##TITLE=	iyIKjFgATUaWbDysWjj16Q/2851s
##JCAMPDX=	6.0	$$ NMR Plug-in 1.13 of MestReNova 11.0.4-18998
##DATATYPE=	NMRSPECTRUM
##DATACLASS=	XYDATA
##NUMDIM=	1
##ORIGIN=	Bruker BioSpin GmbH
##OWNER=	andrew
##.OBSERVEFREQUENCY=	600.30184456100005264
##.OBSERVENUCLEUS=	^1H
##.SOLVENTNAME=	CD2Cl2
##.PULSESEQUENCE=	zg
##LONGDATE=	2015/06/05 10:32:31.000
##.ACQUISITIONMODE=	SIMULTANEOUS (DQD)
##$ORIGINALFORMAT=	Bruker XWIN-NMR
##$PARAMETERFILE=	(acqus, ASCII, /var/folders/f6/rjf_tdyn2v98c5c0wvkgn4s80000gn/T/iyIKjFgATUaWbDysWjj16Q/2851s/acqus, 0)
$$ ##TITLE= Parameter file, TOPSPIN		Version 2.1
$$ ##JCAMPDX= 5.0
$$ ##DATATYPE= Parameter Values
$$ ##NPOINTS= 10	$$ modification sequence number
$$ ##ORIGIN= Bruker BioSpin GmbH
$$ ##OWNER= andrew
$$ $$ 2015-06-05 15:32:31.857 +0600  andrew@av-600
$$ $$ /opt/data/andrew/nmr/limog-1782/612/acqus
$$ $$ process /opt/ts21pl6/prog/mod/shimcntl
$$ ##$ACQT0= -9.54927425515661
$$ ##$AMP= (0..31)
$$ 100 100 100 100 100 100 100 100 100 100 100 100 100 100 100 100 100 100
$$ 100 100 100 100 100 100 100 100 100 100 100 100 100 100
$$ ##$ANAVPT= -1
$$ ##$AQSEQ= 0
$$ ##$AQ_mod= 3
$$ ##$AUNM= <au_zg>
$$ ##$AUTOPOS= <>
$$ ##$BF1= 600.3
$$ ##$BF2= 600.3
$$ ##$BF3= 600.3
$$ ##$BF4= 600.3
$$ ##$BF5= 600.3
$$ ##$BF6= 600.3
$$ ##$BF7= 600.3
$$ ##$BF8= 600.3
$$ ##$BYTORDA= 0
$$ ##$CFDGTYP= 0
$$ ##$CFRGTYP= 9
$$ ##$CHEMSTR= <none>
$$ ##$CNST= (0..63)
$$ 1 1 145 1 1 1 1 1 1 1 1 1 1 1 1 1 1 1 1 1 1 1 1 1 1 1 1 1 1 1 1 1 1 1 1
$$ 1 1 1 1 1 1 1 1 1 1 1 1 1 1 1 1 1 1 1 1 1 1 1 1 1 1 1 1 1
$$ ##$CPDPRG= <>
$$ ##$CPDPRG1= <>
$$ ##$CPDPRG2= <waltz16>
$$ ##$CPDPRG3= <>
$$ ##$CPDPRG4= <mlev>
$$ ##$CPDPRG5= <mlev>
$$ ##$CPDPRG6= <mlev>
$$ ##$CPDPRG7= <mlev>
$$ ##$CPDPRG8= <mlev>
$$ ##$CPDPRGB= <>
$$ ##$CPDPRGT= <>
$$ ##$D= (0..63)
$$ 0 1 0 0 0 0 0 0 0 0.06 0 0.03 0 0 0 0 1e-04 0 0 0 0 0 0 0 0 0 0 0 0 0 0
$$ 0 0 0 0 0 0 0 0 0 0 0 0 0 0 0 0 0 0 0 0 0 0 0 0 0 0 0 0 0 0 0 0 0
$$ ##$DATE= 1433496751
$$ ##$DBL= (0..7)
$$ 120 120 120 120 120 120 120 120
$$ ##$DBP= (0..7)
$$ 150 150 150 150 150 150 150 150
$$ ##$DBP07= 0
$$ ##$DBPNAM0= <>
$$ ##$DBPNAM1= <>
$$ ##$DBPNAM2= <>
$$ ##$DBPNAM3= <>
$$ ##$DBPNAM4= <>
$$ ##$DBPNAM5= <>
$$ ##$DBPNAM6= <>
$$ ##$DBPNAM7= <>
$$ ##$DBPOAL= (0..7)
$$ 0.5 0.5 0.5 0.5 0.5 0.5 0.5 0.5
$$ ##$DBPOFFS= (0..7)
$$ 0 0 0 0 0 0 0 0
$$ ##$DE= 6.5
$$ ##$DECBNUC= <off>
$$ ##$DECIM= 2218.66666666667
$$ ##$DECNUC= <off>
$$ ##$DECSTAT= 4
$$ ##$DIGMOD= 1
$$ ##$DIGTYP= 12
$$ ##$DL= (0..7)
$$ 0 120 120 120 120 120 120 120
$$ ##$DP= (0..7)
$$ 150 150 150 150 150 150 150 150
$$ ##$DP07= 0
$$ ##$DPNAME0= <>
$$ ##$DPNAME1= <>
$$ ##$DPNAME2= <>
$$ ##$DPNAME3= <>
$$ ##$DPNAME4= <>
$$ ##$DPNAME5= <>
$$ ##$DPNAME6= <>
$$ ##$DPNAME7= <>
$$ ##$DPOAL= (0..7)
$$ 0.5 0.5 0.5 0.5 0.5 0.5 0.5 0.5
$$ ##$DPOFFS= (0..7)
$$ 0 0 0 0 0 0 0 0
$$ ##$DQDMODE= 0
$$ ##$DR= 22
$$ ##$DS= 0
$$ ##$DSLIST= <SSSSSSSSSSSSSSS>
$$ ##$DSPFIRM= 0
$$ ##$DSPFVS= 20
$$ ##$DTYPA= 0
$$ ##$EXP= <>
$$ ##$F1LIST= <111111111111111>
$$ ##$F2LIST= <222222222222222>
$$ [...]
$$ -1 -1 -1 -1 -1 -1 -1 -1 -1 -1 -1 -1 -1 -1 -1 -1 -1 -1 -1 -1 -1 -1 -1 -1
$$ -1 -1 -1 -1 -1 -1 -1 -1 -1 -1 -1 -1 -1 -1 -1 -1 -1 -1 -1 -1 -1 -1 -1 -1
$$ -1 -1 -1 -1 -1 -1 -1 -1 -1 -1 -1 -1 -1 -1 -1 -1 -1 -1 -1 -1 -1 -1 -1 -1
$$ -1 -1 -1 -1 -1 -1 -1 -1 -1 -1 -1 -1 -1 -1 -1 -1 -1 -1 -1 -1 -1 -1 -1 -1
$$ -1 -1 -1 -1 -1 -1 -1 -1 -1 -1 -1 -1 -1 -1 -1 -1
$$ ##$RG_tab8= (0..255)
$$ -1 -1 -1 -1 -1 -1 -1 -1 -1 -1 -1 -1 -1 -1 -1 -1 -1 -1 -1 -1 -1 -1 -1 -1
$$ -1 -1 -1 -1 -1 -1 -1 -1 -1 -1 -1 -1 -1 -1 -1 -1 -1 -1 -1 -1 -1 -1 -1 -1
$$ -1 -1 -1 -1 -1 -1 -1 -1 -1 -1 -1 -1 -1 -1 -1 -1 -1 -1 -1 -1 -1 -1 -1 -1
$$ -1 -1 -1 -1 -1 -1 -1 -1 -1 -1 -1 -1 -1 -1 -1 -1 -1 -1 -1 -1 -1 -1 -1 -1
$$ -1 -1 -1 -1 -1 -1 -1 -1 -1 -1 -1 -1 -1 -1 -1 -1 -1 -1 -1 -1 -1 -1 -1 -1
$$ -1 -1 -1 -1 -1 -1 -1 -1 -1 -1 -1 -1 -1 -1 -1 -1 -1 -1 -1 -1 -1 -1 -1 -1
$$ -1 -1 -1 -1 -1 -1 -1 -1 -1 -1 -1 -1 -1 -1 -1 -1 -1 -1 -1 -1 -1 -1 -1 -1
$$ -1 -1 -1 -1 -1 -1 -1 -1 -1 -1 -1 -1 -1 -1 -1 -1 -1 -1 -1 -1 -1 -1 -1 -1
$$ -1 -1 -1 -1 -1 -1 -1 -1 -1 -1 -1 -1 -1 -1 -1 -1 -1 -1 -1 -1 -1 -1 -1 -1
$$ -1 -1 -1 -1 -1 -1 -1 -1 -1 -1 -1 -1 -1 -1 -1 -1 -1 -1 -1 -1 -1 -1 -1 -1
$$ -1 -1 -1 -1 -1 -1 -1 -1 -1 -1 -1 -1 -1 -1 -1 -1
$$ ##$RG_tabA= (0..255)
$$ 0.25 0.28 0.32 0.35 0.4 0.44 0.5 0.56 0.64 0.7 0.8 0.89 1 1.12 1.28 1.4
$$ 1.6 1.78 2 2.25 2.56 2.8 3.2 3.56 4 4.5 5 5.6 6.35 7.12 8 9 10 11.3 12.7
$$ 14.2 16 18 20.2 22.6 25.4 28.5 32 36 40.3 45.2 50.8 57 64 71.8 80.6 90.5
$$ 101 114 128 144 161 181 203 -1 -1 -1 -1 -1 -1 -1 -1 -1 -1 -1 -1 -1 -1 -1
$$ -1 -1 -1 -1 -1 -1 -1 -1 -1 -1 -1 -1 -1 -1 -1 -1 -1 -1 -1 -1 -1 -1 -1 -1
$$ -1 -1 -1 -1 -1 -1 -1 -1 -1 -1 -1 -1 -1 -1 -1 -1 -1 -1 -1 -1 -1 -1 -1 -1
$$ -1 -1 -1 -1 -1 -1 -1 -1 -1 -1 -1 -1 -1 -1 -1 -1 -1 -1 -1 -1 -1 -1 -1 -1
$$ -1 -1 -1 -1 -1 -1 -1 -1 -1 -1 -1 -1 -1 -1 -1 -1 -1 -1 -1 -1 -1 -1 -1 -1
$$ -1 -1 -1 -1 -1 -1 -1 -1 -1 -1 -1 -1 -1 -1 -1 -1 -1 -1 -1 -1 -1 -1 -1 -1
$$ -1 -1 -1 -1 -1 -1 -1 -1 -1 -1 -1 -1 -1 -1 -1 -1 -1 -1 -1 -1 -1 -1 -1 -1
$$ -1 -1 -1 -1 -1 -1 -1 -1 -1 -1 -1 -1 -1 -1 -1 -1 -1 -1 -1 -1 -1 -1 -1 -1
$$ -1 -1 -1 -1 -1 -1 -1 -1 -1 -1 -1 -1 -1 -1
$$ ##$ROUT14= (0..7)
$$ 0 0 0 0 0 0 0 0
$$ ##$ROUTER= -1
$$ ##$RX22TY= <no>
$$ ##$RXFMAX= (0..7)
$$ 647.5 -1 -1 -1 -1 -1 -1 -1
$$ ##$RXFMIN= (0..7)
$$ 5 -1 -1 -1 -1 -1 -1 -1
$$ ##$RXINTLV= (0..7)
$$ 1 0 0 0 0 0 0 0
$$ ##$RXMSTY= <no>
$$ ##$SCMTY= <no>
$$ ##$SGUC1= (0..15)
$$ 17 18 34 0 0 0 0 0 0 0 0 0 0 0 0 0
$$ ##$SGUC2= (0..15)
$$ 33 256 20 0 0 0 0 0 0 0 0 0 0 0 0 0
$$ ##$SPECTR= 10
$$ ##$SY2FLAG= 0
$$ ##$TFXNUM= 0
$$ ##$TRIPLO2= 0
$$ ##$VTUTY= <tty05>
$$ ##$WBREFAM= (0..15)
$$ 100 100 100 100 100 100 100 100 100 100 100 100 100 100 100 100
$$ ##$WBREFPH= (0..15)
$$ 0 0 0 0 0 0 0 0 0 0 0 0 0 0 0 0
$$ ##$XFAC= 2
$$ ##END=
$$ 
##$DECIM=	2218.66666666667
##$DSPFVS=	20
##XUNITS=	HZ
##YUNITS=	ARBITRARY UNITS
##FIRSTX=	6322.8525384689401108
##LASTX=	-2691.4329892738592207
##XFACTOR=	-0.1375491802509010153
##YFACTOR=	9.5593925781250011842e-06
##NPOINTS=	65536
##XYDATA=	(X++(Y..Y))
$$ [...]
-12102f0485j207j207j208P57P60P60P60k019k016Q46Q45j363j360j360j360J632J635J636
$$ -60485 -61692 -62899 -64107 -63350 -62590 -61830 -61070 -63089 -65105 -64259 -63414 -64777 -66137 -67497 -68857 -67225 -65590 -63954
-12084f3954J636K2K6k835k836m62m58m62m58O70O75O70O75j200j196j200j196K258K262K258
$$ -63954 -62318 -62296 -62270 -65105 -67941 -68403 -68861 -69323 -69781 -69111 -68436 -67766 -67091 -68291 -69487 -70687 -71883 -69625 -67363 -65105
-12064f5105K261l65l61l65l62n44n40n44n40J326J330j177j174o40N085N083o37PPl50l50
$$ -65105 -62844 -63209 -63570 -63935 -64297 -64841 -65381 -65925 -66465 -65139 -63809 -64986 -66160 -66800 -61715 -56632 -57269 -57262 -57255 -57605 -57955
-12043e7955P82P83K392m70n73n74p53p52p53p53p52p53o78o78q57q57j930m792k01K660L629
$$ -57955 -57173 -56390 -53998 -54468 -55041 -55615 -56368 -57120 -57873 -58626 -59378 -60131 -60809 -61487 -62344 -63201 -65131 -69923 -70124 -67464 -63835
-12022f3835P68j27j26o64K199L271j498r80r76j274j274l25l20J468j394l811r47K035K034
$$ -63835 -63067 -63194 -63320 -63984 -61785 -58514 -60012 -60992 -61968 -63242 -64516 -64841 -65161 -63693 -65087 -68898 -69845 -67810 -65776
-12003f5776L819L823O63k198j23j19k98k98J069J073K683j79m117m114M77M77J189J192j669
$$ -65776 -61957 -58134 -57471 -59669 -59792 -59911 -60209 -60507 -59438 -58365 -55682 -55861 -59978 -64092 -63615 -63138 -61949 -60757 -62426
-11984f2426j669j781j778j598j599k90K574K575k87J155J159j882j881J274J278J278J278
$$ -62426 -64095 -65876 -67654 -69252 -70851 -71141 -68567 -65992 -66279 -65124 -63965 -65847 -67728 -66454 -65176 -63898 -62620
-11967f2620P53P56q53K008L7M1K20K20j930j926k106k105O34k225M59L319L328M69o03o04
$$ -62620 -61867 -61111 -61964 -59956 -59919 -59878 -59658 -59438 -61368 -63294 -65400 -67505 -66871 -69096 -68637 -65318 -61990 -61521 -62124 -62728
-11947f2728J360J364j498j498J166J170q2k943j874j871O34O33K157p00R09R09J144J148
$$ -62728 -61368 -60004 -61502 -63000 -61834 -60664 -60746 -63689 -65563 -67434 -66800 -66167 -64010 -64710 -63801 -62892 -61748 -60600
-11929f0600L830r39j375j371J192J192j315j311k922n9J084J084J263J264j241j241j241
$$ -60600 -56770 -57709 -59084 -60455 -59263 -58071 -59386 -60697 -63619 -63678 -62594 -61510 -60247 -58983 -60224 -61465 -62706
-11912f2706j240J00J01J00J01j449j450j449j450K545K545K545K545r13r13r13r13o59o60
$$ -62706 -63946 -63846 -63745 -63645 -63544 -64993 -66443 -67892 -69342 -66797 -64252 -61707 -59162 -60075 -60988 -61901 -62814 -63473 -64133
-11893f4133o59o60O52O52L514L514k415k414M47M47Q9R0Q9R0M32M32M32M32j833j833j833
$$ -64133 -64792 -65452 -64800 -64148 -60634 -57120 -59535 -61949 -61502 -61055 -60966 -60876 -60787 -60697 -60265 -59833 -59401 -58969 -60802 -62635 -64468
-11872f4468j833m03m02m02m03J148J147J148J148l51l50l50l50l033l033J438J438K482k284
$$ -64468 -66301 -66704 -67106 -67508 -67911 -66763 -65616 -64468 -63320 -63671 -64021 -64371 -64721 -67754 -70787 -69349 -67911 -65429 -67713
-11853f7713k467K306N522K664j97j98j04j01k965k963l42l39O14L477K280k485j416J449
$$ -67713 -70180 -67874 -62352 -59688 -59885 -60083 -60187 -60288 -63253 -66216 -66558 -66897 -66283 -62806 -60526 -63011 -64427 -62978
-11835f2978j058l916P34P34J327J330L72k485j595L179J926r35j528j527j707j703L421L420
$$ -62978 -64036 -67952 -67218 -66484 -65157 -63827 -63455 -65940 -67535 -64356 -62430 -63365 -64893 -66420 -68127 -69830 -66409 -62989
-11817f2989N59N63N14N14k347k344J051J051J050J055l145l145j04j01l42K518L592j174
$$ -62989 -62430 -61867 -61353 -60839 -63186 -65530 -64479 -63428 -62378 -61323 -64468 -67613 -67717 -67818 -68160 -65642 -62050 -63224
-11799f3224R10R09k251k247O71O71O70O75L09L13L13L13k429k430k429k429J069J073J073
$$ -63224 -62314 -61405 -63656 -65903 -65232 -64561 -63891 -63216 -62907 -62594 -62281 -61968 -64397 -66827 -69256 -71685 -70616 -69543 -68470
-11780f8470J073j609j610J252J252M88M92M92M92J684J684j178j177P41P46k236K534L487
$$ -68470 -67397 -69006 -70616 -69364 -68112 -67624 -67132 -66640 -66148 -64464 -62780 -63958 -65135 -64394 -63648 -65884 -63350 -59863
-11762e9863j281k594K69j778J088K221K221J441l323k251O12J248J252J430J431j554j550
$$ -59863 -61144 -63738 -63469 -65247 -64159 -61938 -59717 -58276 -61599 -63850 -63238 -61990 -60738 -59308 -57877 -59431 -60981
-11745f0981J312J312o45o41K221K220l983l979r39r39j60K705J215l555j591L182J811j051
$$ -60981 -59669 -58357 -59002 -59643 -57422 -55202 -59185 -63164 -64103 -65042 -65202 -62497 -61282 -64837 -66428 -63246 -61435 -62486
-11727f2486k452k451K31K35J125J125J125J129P45P46P45P49r0q9r0q5l58l58l57l54J729
$$ -62486 -64938 -67389 -67158 -66923 -65798 -64673 -63548 -62419 -61674 -60928 -60183 -59434 -59524 -59613 -59703 -59788 -60146 -60504 -60861 -61215 -59486
-11706e9486J728l040l037Q20Q20Q20Q23N22N21N22N25q31q31q30q28k738k739J23J27K239
$$ -59486 -57758 -60798 -63835 -63015 -62195 -61375 -60552 -60030 -59509 -58987 -58462 -59293 -60124 -60954 -61782 -64520 -67259 -67136 -67009 -64770
-11686f4770K239k529k527J405J405J404J409O82O82O81O86o30o29o30o26J174J173j926K847
$$ -64770 -62531 -65060 -67587 -66182 -64777 -63373 -61964 -61282 -60600 -59919 -59233 -59863 -60492 -61122 -61748 -60574 -59401 -61327 -58480
-11667e8480M661k016m341j475K68K68r83r80k743k742K027K031N96N96k265k262o86o85M083
$$ -58480 -53819 -55835 -60176 -61651 -61383 -61115 -62098 -63078 -65821 -68563 -66536 -64505 -63909 -63313 -65578 -67840 -68526 -69211 -65128
-11648f5128M088q42q42N88N93j230j229j230j226J707J706J707J710j692j691J170J173O90
$$ -65128 -61040 -61882 -62724 -62136 -61543 -62773 -64002 -65232 -66458 -64751 -63045 -61338 -59628 -61320 -63011 -61841 -60668 -59978
-11630e9978O89O89O90k948k947q6q5M654M653Q39l931l186l24O30O29j837j837m06m06j092
$$ -59978 -59289 -58600 -57910 -60858 -63805 -63891 -63976 -59322 -54669 -53830 -57761 -60947 -61271 -60641 -60012 -61849 -63686 -64092 -64498 -65590
-11610f5590j091J770J769J934J934J934J933o29o30o30o29p45p42p41p42K623K627J196J196
$$ -65590 -66681 -64911 -63142 -61208 -59274 -57340 -55407 -56036 -56666 -57296 -57925 -58670 -59412 -60153 -60895 -58272 -55645 -54449 -53253
-11591e3253p15p12l275l275m143O29K716K717j338j334j334j334m73m69K392K392R13R16
$$ -53253 -53968 -54680 -57955 -61230 -65373 -64744 -62028 -59311 -60649 -61983 -63317 -64651 -65124 -65593 -63201 -60809 -59896 -58980
-11573e8980n14n14j025j021j021j020k564k563K205K210K116K117p46p41K474K474J043J047
$$ -58980 -59494 -60008 -61033 -62054 -63075 -64095 -66659 -69222 -67017 -64807 -62691 -60574 -61320 -62061 -59587 -57113 -56070 -55023
-11555e5023p45p45O85O90l514l513o52o49N70N70q60q57J762J762L32L35J405J405J404J409
$$ -55023 -55768 -56513 -55828 -55138 -58652 -62165 -62817 -63466 -62896 -62326 -63186 -64043 -62281 -60519 -60187 -59852 -58447 -57042 -55638 -54229
-11535e4229n55n55n56n55P57P56P56P57j360j360j360j360k87k87k87k87l69l69l68l69p27
$$ -54229 -54784 -55339 -55895 -56450 -55693 -54937 -54181 -53424 -54784 -56144 -57504 -58864 -59151 -59438 -59725 -60012 -60381 -60750 -61118 -61487 -62214
-11514f2214p26p27p27M81M81L02L01Mk858j069L700J069J070J367J371j762j763J100J102
$$ -62214 -62940 -63667 -64394 -63913 -63432 -63130 -62829 -62825 -65683 -66752 -63052 -61983 -60913 -59546 -58175 -59937 -61700 -60600 -59498
-11495e9498k507k508j077j073K322K321n40n37L43L46j084j084L72L77n78l439o26M147L968
$$ -59498 -62005 -64513 -65590 -66663 -64341 -62020 -62560 -63097 -62754 -62408 -63492 -64576 -64204 -63827 -64405 -67844 -68470 -64323 -60355
-11476f0355q01k354k352k470K299L316L320j155j151k288k284N74L439M106o60o63o59K228
$$ -60355 -61156 -63510 -65862 -68332 -66033 -62717 -59397 -60552 -61703 -63991 -66275 -65701 -62262 -58156 -58816 -59479 -60138 -57910
-11458e7910K231k541k537K72K72j159j159M81M81M80M81k262k261l54M415K865Mr50r50j394
$$ -57910 -55679 -58220 -60757 -60485 -60213 -61372 -62531 -62050 -61569 -61089 -60608 -62870 -65131 -65485 -61070 -58205 -58201 -59151 -60101 -61495
-11438f1495j390j393j390K213K217o48o45l65l61j796j792P67P72o64o59R39R43j923j919
$$ -61495 -62885 -64278 -65668 -63455 -61238 -61886 -62531 -62896 -63257 -65053 -66845 -66078 -65306 -65970 -66629 -65690 -64747 -66670 -68589
-11419f8589P60P64K191K194L428L432L309Q081Q287L521J430j427o863o859m002l998l376
$$ -68589 -67829 -67065 -64874 -62680 -59252 -55820 -52511 -44430 -36143 -32622 -31192 -32619 -39482 -46341 -50343 -54341 -57717
-11402e7717n10J990k776j506j501j803j800j058j055J804J807O7P1O7P0j363j360J498J501
$$ -57717 -58227 -56237 -59013 -60519 -62020 -63823 -65623 -66681 -67736 -65932 -64125 -64058 -63987 -63920 -63850 -65213 -66573 -65075 -63574
-11383f3574m99m96m99m95K600K605K302K307L46m419J122J125j591j587j60j57l4k9l4l0
$$ -63574 -64073 -64569 -65068 -65563 -62963 -60358 -58056 -55749 -55403 -59822 -58700 -57575 -59166 -60753 -60913 -61070 -61104 -61133 -61167 -61197
-11363f1197p78p75p79p75J829J834J829J833j241j237j240j237o90o85j941j938J874M740
$$ -61197 -61975 -62750 -63529 -64304 -62475 -60641 -58812 -56979 -58220 -59457 -60697 -61934 -62624 -63309 -65250 -67188 -65314 -60574
-11345f0574L126j640k705J60l16l17J379J382m9m8J118J121l09l09l264l260L416L417K91
$$ -60574 -57448 -59088 -61793 -61633 -61949 -62266 -60887 -59505 -59554 -59602 -58484 -57363 -57672 -57981 -61245 -64505 -61089 -57672 -57381
-11326e7381K94J725J725Q57Q61k001k001k027k023Q39Q38R24R28n03n03J408J408J409J412
$$ -57381 -57087 -55362 -53637 -52780 -51919 -53920 -55921 -57948 -59971 -59132 -58294 -57370 -56442 -56945 -57448 -56040 -54632 -53223 -51811
-11307e1811k01k01j632j629m180m181j319j315J12J12j319j316L942L943J080J084Q13Q12
$$ -51811 -52012 -52213 -53845 -55474 -59654 -63835 -65154 -66469 -66357 -66245 -67564 -68880 -64938 -60995 -59915 -58831 -58018 -57206
-11289e7206Q12Q16M10M10M10M13L21L20j110j107j583j580J278J282j077j073j077j073k642
$$ -57206 -56394 -55578 -55168 -54758 -54348 -53935 -53614 -53294 -54404 -55511 -57094 -58674 -57396 -56114 -57191 -58264 -59341 -60414 -63056
-11270f3056k638K20K24p9p4p9p4R20R24J278J282o353o26R21R24Q23Q27k038k034J38J41
$$ -63056 -65694 -65474 -65250 -65329 -65403 -65482 -65556 -64636 -63712 -62434 -61152 -67505 -68131 -67210 -66286 -65463 -64636 -66674 -68708 -68570 -68429
-11249f8429J569J572j606j602j602j602J464J468l301l301j23j19M292M292M945p75l637
$$ -68429 -66860 -65288 -66894 -68496 -70098 -71700 -70236 -68768 -72069 -75370 -75493 -75612 -71320 -67028 -62083 -62858 -66495
-11232f6495K087l69l65qpn48n44n44n44Q98R02M121j603q5q2m40m40k75k72J158J159K377
$$ -66495 -64408 -64777 -65142 -65150 -65157 -65705 -66249 -66793 -67337 -66439 -65537 -61416 -63019 -63104 -63186 -63626 -64066 -64341 -64613 -63455 -62296 -59919
-11210e9919K381m80m81J148J151j710j711k310k306N55N55K504K504m173m169o26o26K235
$$ -59919 -57538 -58018 -58499 -57351 -56200 -57910 -59621 -61931 -64237 -63682 -63127 -60623 -58119 -62292 -66461 -67087 -67713 -65478
-11192f5478K240O48O48p82p79Q2Q2j349j345J639J644K12K12j699j695k053L670k936k932
$$ -65478 -63238 -62590 -61942 -62724 -63503 -63421 -63339 -64688 -66033 -64394 -62750 -62538 -62326 -64025 -65720 -67773 -64103 -67039 -69971
-11173f9971K87K87J624J628J98J97J75J79L041L040l730l726l726l726j382j379L033L033
$$ -69971 -69684 -69397 -67773 -66145 -65947 -65750 -65575 -65396 -62355 -59315 -63045 -66771 -70497 -74223 -75605 -76984 -73951 -70918
-11155g0918O100L80j170j170N29N29j855j856k005k004J334J334L562L562J177J177K24K24
$$ -70918 -64818 -64438 -65608 -66778 -66249 -65720 -67575 -69431 -71436 -73440 -72106 -70772 -67210 -63648 -62471 -61294 -61070 -60846
-11137f0846K23K24j398j393j397j394j874j870J464J468J680J685p05p00k552k549J740J744
$$ -60846 -60623 -60399 -61797 -63190 -64587 -65981 -67855 -69725 -68261 -66793 -65113 -63428 -64133 -64833 -67385 -69934 -68194 -66450
-11119f6450J796J796n89n89J796J796K631l093J043J044k653k653K325K325j968j967M9N2
$$ -66450 -64654 -62858 -63447 -64036 -62240 -60444 -57813 -60906 -59863 -58819 -61472 -64125 -61800 -59475 -61443 -63410 -63361 -63309
-11101f3309M8N2K135K139P04P08j039j036j040j036j248j244K090K094j092j088K247K251
$$ -63309 -63261 -63209 -61074 -58935 -58231 -57523 -58562 -59598 -60638 -61674 -62922 -64166 -62076 -59982 -61074 -62162 -59915 -57664
-11083e7664J90J93l148l145q38q35q38q35K351K355K232l487q91q90J82J83k6k7k6k6K210
$$ -57664 -57474 -57281 -60429 -63574 -64412 -65247 -66085 -66920 -64569 -62214 -59982 -63469 -64360 -65250 -65068 -64885 -64911 -64938 -64964 -64990 -62780
-11062f2780K209k082k083k292k291R3R3j535j535K757K757J983J982k310k310J751J751L20
$$ -62780 -60571 -62653 -64736 -67028 -69319 -69226 -69133 -70668 -72203 -69446 -66689 -64706 -62724 -65034 -67344 -65593 -63842 -63522
-11044f3522L21N29N29N29N29K746K746k500k500J375J375J375J374j643j643l431K291j285
$$ -63522 -63201 -62672 -62143 -61614 -61085 -58339 -55593 -58093 -60593 -59218 -57843 -56468 -55094 -56737 -58380 -61811 -59520 -60805
-11026f0805j286r28r27j088j088L42L43J178J177L562L562m92m92m91m92o11o11o11o11k743
$$ -60805 -62091 -63019 -63946 -65034 -66122 -65780 -65437 -64259 -63082 -59520 -55958 -56450 -56942 -57433 -57925 -58536 -59147 -59758 -60369 -63112
-11006f3112k742K504K504j610j610j609j610q57q57J528J527J87J86J86J87J088J091J092
$$ -63112 -65854 -63350 -60846 -62456 -64066 -65675 -67285 -68142 -68999 -67471 -65944 -65757 -65571 -65385 -65198 -64110 -63019 -61927
-10988f1927J092l145l141J151J152K362K366J293m430L05L09J383J382r98r95r95r95k757
$$ -61927 -60835 -63980 -67121 -65970 -64818 -62456 -60090 -58797 -63227 -62922 -62613 -61230 -59848 -60846 -61841 -62836 -63831 -66588
-10970f6588k754K493K493K459K463q76q75n22n18J867J866k34k31k620k615k799k794J494
$$ -66588 -69342 -66849 -64356 -61897 -59434 -60310 -61185 -61707 -62225 -60358 -58492 -58726 -58957 -61577 -64192 -66991 -69785 -68291
-10952f8291J498J733J736L02L05J83J86k202k198j129j126K210K213K985K988l54l50j576
$$ -68291 -66793 -65060 -63324 -63022 -62717 -62534 -62348 -64550 -66748 -67877 -69003 -66793 -64580 -61595 -58607 -58961 -59311 -60887
-10934f0887j573j45j42O00O04O00O03J289J290l003l004j781j781O04O04L010L011l28l28
$$ -60887 -62460 -62605 -62747 -62147 -61543 -60943 -60340 -59051 -57761 -60764 -63768 -65549 -67330 -66726 -66122 -63112 -60101 -60429 -60757
-10915f0757J699J699J699J699j773j774m993P31Q49Q50k132k131J736J737L05L06J885J885
$$ -60757 -59058 -57359 -55660 -53961 -55734 -57508 -62501 -61770 -60921 -60071 -62203 -64334 -62598 -60861 -60556 -60250 -58365 -56480
-10897e6480m314m315k98k94k95k94j461j456J404J405K53K57M36M36l383n18M36M36L864
$$ -56480 -60794 -65109 -65407 -65701 -65996 -66290 -67751 -69207 -67803 -66398 -66145 -65888 -65452 -65016 -68399 -68917 -68481 -68045 -64181
-10878f4181r02P08k153k456M10L212L212L282M25q27q27l097l092j662J200k739J23K985
$$ -64181 -65083 -64375 -66528 -68984 -68574 -65362 -62150 -58868 -58443 -59270 -60097 -63194 -66286 -67948 -66748 -69487 -69364 -66379
-10860f6379J22L522O59p71p72l200l201j948R12N56N55P34P34L804L804R43R43m89m88k097
$$ -66379 -66257 -62735 -62076 -62847 -63619 -66819 -70020 -71968 -71056 -70500 -69945 -69211 -68477 -64673 -60869 -59926 -58983 -59472 -59960 -62057
-10840f2057P63J301J300J301J300N85k277o67o67j885j882o33K232Q2Q6Q2Q5J617j240L65
$$ -62057 -61294 -59993 -58693 -57392 -56092 -55507 -57784 -58451 -59118 -61003 -62885 -63518 -61286 -61204 -61118 -61036 -60951 -59334 -60574 -60209
-10820f0209L69l51l46l50l47J520J524K68k589K68K72R0R3r99r95r98r95j833j830p60K105
$$ -60209 -59840 -60191 -60537 -60887 -61234 -59714 -58190 -57922 -60511 -60243 -59971 -59881 -59788 -60787 -61782 -62780 -63775 -65608 -67438 -68198 -66093
-10799f6093J360j501j502J364N056K195o08o03l916j055J98K01k068k068R73R76q24K039
$$ -66093 -64733 -66234 -67736 -66372 -61316 -59121 -59729 -60332 -64248 -65303 -65105 -64904 -66972 -69040 -68067 -67091 -67915 -65876
-10781f5876K038q20J203J204j837j833m21m21J188j669Q31Q31O52O56j822j819j818j818
$$ -65876 -63838 -64658 -63455 -62251 -64088 -65921 -66342 -66763 -65575 -67244 -66413 -65582 -64930 -64274 -66096 -67915 -69733 -71551
-10763g1551r3r0j699J163l91l88R0Q9O22N395K713K712j82j79%%m81K385k98l160n563k697
$$ -71551 -71644 -71734 -73433 -72270 -72661 -73049 -72959 -72870 -72248 -66853 -64140 -61428 -61610 -61789 -61789 -61789 -62270 -59885 -60183 -63343 -68906 -71603
-10741g1603k579K191L976J118J64J64Q71Q76O93O97j692m549k109M572L331M73Q87L752K436
$$ -71603 -74182 -71991 -68015 -66897 -66733 -66569 -65698 -64822 -64129 -63432 -65124 -69673 -71782 -67210 -63879 -63406 -62519 -58767 -56331
-10722e6331K441J364j494j12j08j364m222l748q83J86J90J148J151j535j531P4K940K936
$$ -56331 -53890 -52526 -54020 -54132 -54240 -55604 -59826 -63574 -64457 -64271 -64081 -62933 -61782 -63317 -64848 -64774 -61834 -58898
-10704e8898P9l082l078J510J512L17L20m154j289K001K004k411k406j517J349J643j215k925
$$ -58898 -58819 -61901 -64979 -63469 -61957 -61640 -61320 -65474 -66763 -64762 -62758 -65169 -67575 -69092 -67743 -66100 -67315 -70240
-10686g0240J849L453N97j137j132l998P75p34p31M214J357m36K429K247o11R42R43q46K020
$$ -70240 -68391 -64938 -64341 -65478 -66610 -70608 -69833 -70567 -71298 -67084 -65727 -66163 -63734 -61487 -62098 -61156 -60213 -61059 -59039
-10667e9039K27K27M06M10j837j837J025J028j121j122J740J744l092l093l092l089m10m10
$$ -59039 -58812 -58585 -58179 -57769 -59606 -61443 -60418 -59390 -60511 -61633 -59893 -58149 -61241 -64334 -67426 -70515 -70925 -71335
-10649g1335m10m06J520J520J699J703k176O86r24r21j56j56j57j53j56j57j56j53j379j378
$$ -71335 -71745 -72151 -70631 -69111 -67412 -65709 -67885 -67199 -68123 -69044 -69200 -69356 -69513 -69666 -69822 -69979 -70135 -70288 -71667 -73045
-10629g3045j379j375R47R46R47R50J971J971q91q87Q98Q98Q98R02r43r42p64M009J084J084
$$ -73045 -74424 -75799 -74852 -73906 -72959 -72009 -70038 -68067 -68958 -69845 -68947 -68049 -67151 -66249 -67192 -68134 -68898 -64889 -63805 -62721
-10609f2721l386l384l09l05l10l05k575k571K195o63j040L733L432L435L92m375j695j692
$$ -62721 -66107 -69491 -69800 -70105 -70415 -70720 -73295 -75866 -73671 -74334 -75374 -71641 -68209 -64774 -64382 -68757 -70452 -72144
-10591g2144J271J274j591j587j174j170J688J692J226J229K72k586j278L495O30O34n44n41
$$ -72144 -70873 -69599 -71190 -72777 -73951 -75121 -73433 -71741 -70515 -69286 -69014 -71600 -72878 -69383 -68753 -68119 -68663 -69204
-10573f9204n44n40J960J963J960J964Q2Q6Q2Q5r7r3k660k657j192L581K503l54L58L62J78
$$ -69204 -69748 -70288 -68328 -66365 -64405 -62441 -62359 -62273 -62191 -62106 -62203 -62296 -64956 -67613 -68805 -65224 -62721 -63075 -62717 -62355 -62177
-10552f2177J83J811J814j050j047j230j226J632J636J017J021j844j841L02L05k559k556
$$ -62177 -61994 -60183 -58369 -59419 -60466 -61696 -62922 -61290 -59654 -58637 -57616 -59460 -61301 -60999 -60694 -63253 -65809
-10535f5809J203J207j658j654J90J94J90J93K970K973l707l704k276k273K493K496J23J27
$$ -65809 -64606 -63399 -65057 -66711 -66521 -66327 -66137 -65944 -62974 -60001 -63708 -67412 -69688 -71961 -69468 -66972 -66849 -66722
-10517f6722J23J26j665j662j665j662O71O74L532L536k787k783J982J986K340K343K042K046
$$ -66722 -66599 -66473 -68138 -69800 -71465 -73127 -72456 -71782 -68250 -64714 -67501 -70284 -68302 -66316 -63976 -61633 -59591 -57545
-10499e7545L72m393j713j711m58m55m58m54j532j527j532j527J822J825J822J826k05k01
$$ -57545 -57173 -61566 -63279 -64990 -65448 -65903 -66361 -66815 -68347 -69874 -71406 -72933 -71111 -69286 -67464 -65638 -65843 -66044
-10481f6044k05k01j710j711j710j710L894L893J032J032r27r28l790l789k001k000r4M676
$$ -66044 -66249 -66450 -68160 -69871 -71581 -73291 -69397 -65504 -64472 -63440 -64367 -65295 -69085 -72874 -74875 -76875 -76969 -72293
-10463g2293K504l54J550J554J669J673J669J673j184j182j184j182J87J90J86J90O86O85
$$ -72293 -69789 -70143 -68593 -67039 -65370 -63697 -62028 -60355 -61539 -62721 -63905 -65087 -64900 -64710 -64524 -64334 -63648 -62963
-10445f2963k176k172P45P45P46P49l8l7l7l4m54m55m54m51L293L298l380l379K280K284n77
$$ -62963 -65139 -67311 -66566 -65821 -65075 -64326 -64364 -64401 -64438 -64472 -64926 -65381 -65835 -66286 -62993 -59695 -63075 -66454 -64174 -61890 -62467
-10424f2467n78K616K619k150k150pmlmJ97K02K01K01j174j170j170j170j374j372J491J490
$$ -62467 -63045 -60429 -57810 -59960 -62110 -62117 -62121 -62124 -62128 -61931 -61729 -61528 -61327 -62501 -63671 -64841 -66011 -67385 -68757 -67266 -65776
-10403f5776N6O0N9O0j640j635J226J225J49J53J53J53L614L618P56k105k884J889L499O37
$$ -65776 -65720 -65660 -65601 -65541 -67181 -68816 -67590 -66365 -66216 -66063 -65910 -65757 -62143 -58525 -57769 -59874 -62758 -60869 -57370 -56733
-10383e6733k168k169k347k348J200J200n2n2j64K697J804l920l115K608M62M62R17R16n14
$$ -56733 -58901 -61070 -63417 -65765 -64565 -63365 -63417 -63469 -63633 -60936 -59132 -63052 -66167 -63559 -63097 -62635 -61718 -60802 -61316
-10364f1316n14k362k363k362k362O71O70O71O71J714J713l055l055J028J032m02l99P01P04
$$ -61316 -61830 -64192 -66555 -68917 -71279 -70608 -69938 -69267 -68596 -66882 -65169 -68224 -71279 -70251 -69219 -69621 -70020 -69319 -68615
-10345f8615K131K135p82p79O48O52K91K94k928K798J479J483K016K019k485L80M848q72r28
$$ -68615 -66484 -64349 -65131 -65910 -65262 -64610 -64319 -64025 -66953 -64155 -62676 -61193 -59177 -57158 -59643 -59263 -54415 -55287 -56215
-10326e6215r24k895k892k42l100k030L696O78k180k12k12J810J815o89o90p37M989K127l595
$$ -56215 -57139 -60034 -62926 -63168 -66268 -68298 -64602 -63924 -66104 -66316 -66528 -64718 -62903 -63592 -64282 -65019 -60030 -57903 -61498
-10307f1498j930j927N78N77K184K187o75o74j394j389j032j032k646L081j37j38J56J60L022
$$ -61498 -63428 -65355 -64777 -64200 -62016 -59829 -60504 -61178 -62572 -63961 -64993 -66025 -68671 -65590 -65727 -65865 -65709 -65549 -62527
-10288f2527L022m9m8m8m5R95R95j867j863j912j911m81m77K709K709j53j49J245J244j617
$$ -62527 -59505 -59554 -59602 -59650 -59695 -58700 -57705 -59572 -61435 -63347 -65258 -65739 -66216 -63507 -60798 -60951 -61100 -59855 -58611 -60228
-10268f0228j613n74n74Q57Q61j632j632m494m489K690K690j72j67K336K336k135k135j360
$$ -60228 -61841 -62415 -62989 -62132 -61271 -62903 -64535 -69029 -73518 -70828 -68138 -68310 -68477 -66141 -63805 -65940 -68075 -69435
-10250f9435L410K157p04L081K20j211j211M88M88M88M88L36L35j095j096k914k913L763L763
$$ -69435 -66025 -63868 -64572 -61491 -61271 -62482 -63693 -63205 -62717 -62229 -61741 -61405 -61070 -62165 -63261 -66175 -69088 -65325 -61562
-10231f1562R32R31j930j930Q12Q13o19o18R98R99m33m32J178J177k53k54k340k339r10r09
$$ -61562 -60630 -59699 -61629 -63559 -62747 -61934 -62553 -63171 -62173 -61174 -61607 -62039 -60861 -59684 -59937 -60191 -62531 -64870 -65780 -66689
-10211f6689J118J118j744j744N82N81N81N81j147j148j147j148R39R39R39R39M02M03M02
$$ -66689 -65571 -64453 -66197 -67941 -67359 -66778 -66197 -65616 -66763 -67911 -69058 -70206 -69267 -68328 -67389 -66450 -66048 -65645 -65243
-10192f5243M02K534K537l24l24n07n03n03n03n2m8m9m8N74N77q53q53l58l54l215l216j103
$$ -65243 -64841 -62307 -59770 -60094 -60418 -60925 -61428 -61931 -62434 -62486 -62534 -62583 -62631 -62057 -61480 -62333 -63186 -63544 -63898 -67113 -70329 -71432
-10170g1432j099J762J763PJ1K873K873j245j240J620J621q27q23q28q23L942L946J080J085
$$ -71432 -72531 -70769 -69006 -68999 -68988 -66115 -63242 -64487 -65727 -64107 -62486 -63313 -64136 -64964 -65787 -61845 -57899 -56819 -55734
-10151e5734j603j598j602j599R02R05R02R06k024k023j069J792J613l156k94k94N85N85N85
$$ -55734 -57337 -58935 -60537 -62136 -61234 -60329 -59427 -58521 -60545 -62568 -63637 -61845 -60232 -63388 -63682 -63976 -63391 -62806 -62221
-10132f2221N85j204j203j204j203m9m4m5m5K158K161p01p00r73r69r68r69J60J64J64J64
$$ -62221 -61636 -62840 -64043 -65247 -66450 -66499 -66543 -66588 -66633 -64475 -62314 -63015 -63715 -64688 -65657 -66625 -67594 -67434 -67270 -67106 -66942
-10111f6942j014j013j013j010P75P75P75P79k09k09n07n03L756j013K38K42j147j148J416
$$ -66942 -67956 -68969 -69982 -70992 -70217 -69442 -68667 -67888 -68097 -68306 -68813 -69316 -65560 -66573 -66335 -66093 -67240 -68388 -66972
-10092f6972J416K996j774n470k608J424J423J602J602K735K735j27j26r0q6k951k947l28
$$ -66972 -65556 -62560 -64334 -69804 -72412 -70988 -69565 -67963 -66361 -63626 -60891 -61018 -61144 -61234 -61320 -64271 -67218 -67546
-10074f7546l24K236K239K049k716n879j107N179M14j379j375j144j144K87K91k20k20K642
$$ -67546 -67870 -65634 -63395 -61346 -64062 -69941 -71048 -65869 -65455 -66834 -68209 -69353 -70497 -70210 -69919 -70139 -70359 -67717
-10056f7717K645k619k619M21M24K836N697K001k765k750k746j613j613j588j583J278J278
$$ -67717 -65072 -67691 -70310 -69889 -69465 -66629 -60932 -58931 -61696 -64446 -67192 -68805 -70418 -72006 -73589 -72311 -71033
-10039g1033O11O15O14O15j326j323J539J539j46j45J286J289J762J762L32L35o14o15J174
$$ -71033 -70422 -69807 -69193 -68578 -69904 -71227 -69688 -68149 -68295 -68440 -67154 -65865 -64103 -62341 -62009 -61674 -62288 -62903 -61729
-10020f1729N946M602j68j956j952O3O3j15m881j725j726Q39Q42K284K284k485k482j90j90
$$ -61729 -55783 -51181 -51349 -53305 -55257 -55194 -55131 -55246 -60127 -61852 -63578 -62739 -61897 -59613 -57329 -59814 -62296 -62486 -62676
-10001f2676L924q42j010j006J557J558j845j840m10m10Q68Q72Q72Q72n63n59l420l421J290
$$ -62676 -58752 -59594 -60604 -61610 -60053 -58495 -60340 -62180 -62590 -63000 -62132 -61260 -60388 -59516 -60079 -60638 -64058 -67479 -66189
-9982f6189J289K720K723J170J170j691j688j334j334R7J01K332K332n29n25L495L499l179
$$ -66189 -64900 -62180 -59457 -58287 -57117 -58808 -60496 -61830 -63164 -63067 -62966 -60634 -58302 -58831 -59356 -55861 -52362 -55541
-9964e5541l178k705k701J60J60L182L186L24L24l346l342j911j912O86O85O86O89j49j49
$$ -55541 -58719 -61424 -64125 -63965 -63805 -60623 -57437 -57113 -56789 -60135 -63477 -65388 -67300 -66614 -65929 -65243 -64554 -64703 -64852
-9945f4852j580j576k124k123K645K649J930J930r31r28r87r88M44M43j255j256J75J75K433
$$ -64852 -66432 -68008 -70132 -72255 -69610 -66961 -65031 -63101 -64032 -64960 -65947 -66935 -66491 -66048 -67303 -68559 -68384 -68209 -65776
-9926f5776K433L864L864j353j352P8P8p30p30p31p30K161K161J982k787n037n038J342J341
$$ -65776 -63343 -59479 -55615 -56968 -58320 -58242 -58164 -58894 -59624 -60355 -61085 -58924 -56763 -54781 -57568 -62605 -67643 -66301 -64960
-9907f4960J19J20K980K981j177j178k608k608J207J207j654j654O03O04q27q27O33O33O34
$$ -64960 -64841 -64721 -61741 -58760 -59937 -61115 -63723 -66331 -65124 -63917 -65571 -67225 -66622 -66018 -66845 -67672 -67039 -66406 -65772
-9888f5772O33M5M5M4M5K24K23K24K23J290J289M150M151j602j602J259J260r4q9m382m381
$$ -65772 -65139 -65094 -65049 -65005 -64960 -64736 -64513 -64289 -64066 -62776 -61487 -57337 -53186 -54788 -56390 -55131 -53871 -53965 -54054 -58436 -62817
-9867f2817k746k743N96N97N47N52Q49l920k492k489N51k310n015k42M050M050K914K917K441
$$ -62817 -65563 -68306 -67710 -67113 -66566 -66014 -65165 -69085 -71577 -74066 -73515 -75825 -80840 -81082 -77032 -72982 -70068 -67151 -64710
-9848f4710k329k079P86L09L10R91R95R94R95m69m66K869K873R7J00l241l238k646k641j215
$$ -64710 -67039 -69118 -68332 -68023 -67713 -66722 -65727 -64733 -63738 -64207 -64673 -61804 -58931 -58834 -58734 -61975 -65213 -67859 -70500 -71715
-9828g1715J651M031p34N14L380J710J714J889J893j092j088j092j088j852j848j851j848
$$ -71715 -70064 -66033 -66767 -66253 -62873 -61163 -59449 -57560 -55667 -56759 -57847 -58939 -60027 -61879 -63727 -65578 -67426
-9811f7426j971j968M229M233M993M996k53k50p60p56p60p57l636l633J609J614J073J077
$$ -67426 -69397 -71365 -67136 -62903 -57910 -52914 -53167 -53417 -54177 -54933 -55693 -56450 -60086 -63719 -62110 -60496 -59423 -58346
-9793e8346j312j308O67O71O67O71r73r69J413J415j822j818J517J520K64K69l074l071L011
$$ -58346 -59658 -60966 -60299 -59628 -58961 -58290 -59263 -60232 -58819 -57404 -59226 -61044 -59527 -58007 -57743 -57474 -60548 -63619 -60608
-9774f0608L014J584J583q34q31m169m170L0L4L3L4J222J226k05k05M32M36M36M36N81N85
$$ -60608 -57594 -56010 -54427 -55261 -56092 -60261 -64431 -64401 -64367 -64334 -64300 -63078 -61852 -62057 -62262 -61830 -61394 -60958 -60522 -59941 -59356
-9753e9356k754k753J04J08j322j323J624J629J807J807J378M241O7P0N15k348k943k940P01
$$ -59356 -62110 -64863 -64759 -64651 -65973 -67296 -65672 -64043 -62236 -60429 -59051 -54810 -54743 -54673 -54158 -56506 -59449 -62389 -61688
-9734f1688L562P00P04j565J297J893J896Q76j986m371j505J174J173j807j803k709J53K835
$$ -61688 -58126 -57426 -56722 -58287 -56990 -55097 -53201 -52325 -54311 -58682 -60187 -59013 -57840 -59647 -61450 -64159 -64006 -61171
-9716f1171K840K328K329n6n2k150k150l759q94l92l91J517J520m304M66L029L033K612K612
$$ -61171 -58331 -56003 -53674 -53730 -53782 -55932 -58082 -61841 -62735 -63127 -63518 -62001 -60481 -64785 -64319 -61290 -58257 -55645 -53033
-9697e3033Q83j975j226j225j53j49K470l91k120k117j702j703O82O85L24L25k717J49k116
$$ -53033 -52150 -54125 -55351 -56576 -56729 -56878 -54408 -54799 -56919 -59036 -60738 -62441 -61759 -61074 -60750 -60425 -63142 -62993 -65109
-9678f5109k113j281L491Q64Q69J162J166n88n85n89n85K481K486K481K485l57l54J073J077
$$ -65109 -67222 -68503 -65012 -64148 -63279 -62117 -60951 -61539 -62124 -62713 -63298 -60817 -58331 -55850 -53365 -53722 -54076 -53003 -51926
-9659e1926Q04Q09l190l185l637J137K742j16n365n92k98k95K042q16j591j591J565J569J568
$$ -51926 -51122 -50313 -53503 -56688 -60325 -59188 -56446 -56562 -61927 -62519 -62817 -63112 -61070 -61886 -63477 -65068 -63503 -61934 -60366
-9640f0366J569O56O59K448m14m262j397l007l007k221O45K075p86m92m88k097P63J044L908
$$ -60366 -58797 -58141 -57482 -55034 -55448 -59710 -61107 -64114 -67121 -69342 -68697 -66622 -67408 -67900 -68388 -70485 -69722 -68678 -64770
-9621f4770j636j635j610J256J255j605R76R76j57l014m091O78K586K590m40m40m39m36j155
$$ -64770 -66406 -68041 -69651 -68395 -67140 -68745 -67769 -66793 -66950 -69964 -74055 -73377 -70791 -68201 -68641 -69081 -69520 -69956 -71111
-9602g1111j155J706J710K169K168K169K172k16k16k16k13l003l003j42j37L7L7L7M1P12P12
$$ -71111 -72266 -70560 -68850 -66681 -64513 -62344 -60172 -60388 -60604 -60820 -61033 -64036 -67039 -67181 -67318 -67281 -67244 -67207 -67166 -66454 -65742
-9581f5742P11P16j23j23j23j19j480j479j479j475P86P86P86P90M06M10M10M10j90j87j86
$$ -65742 -65031 -64315 -64438 -64561 -64684 -64803 -66283 -67762 -69241 -70716 -69930 -69144 -68358 -67568 -67162 -66752 -66342 -65932 -66122 -66309 -66495
-9560f6495j86k098k094k094k094k515k511K258K258M06M06M06M10l69l69l69l65l39l39l39
$$ -66495 -66681 -68779 -70873 -72967 -75061 -77576 -80087 -77829 -75571 -75165 -74759 -74353 -73943 -74312 -74681 -75050 -75415 -75754 -76093 -76432
-9540g6432l35R12R13R13R17j83j79K683K683J188J193m531K38K381m77l57K503M14k444o56
$$ -76432 -76767 -75855 -74942 -74029 -73112 -73295 -73474 -70791 -68108 -66920 -65727 -70258 -70020 -67639 -68116 -68473 -65970 -65556 -68000 -68656
-9520f8656o56K743K742j19j20l278l279m18m17J982J982q79q79l443l443n81n81j12j12k973
$$ -68656 -69312 -66569 -63827 -63946 -64066 -67344 -70623 -71041 -71458 -69476 -67494 -68373 -69252 -72695 -76138 -76719 -77300 -77412 -77524 -80497
-9500h0497J796K213o48l51K512K548K549j34j34J773J774r09L860N074N079N376N377O63
$$ -80497 -78701 -76488 -77136 -77487 -74975 -72427 -69878 -70012 -70146 -68373 -66599 -67508 -63648 -58574 -53495 -48119 -42742 -42079
-9482d2079O67k194k195m307m304m303m304j266j264j084j084j233J632K705k065j233j229
$$ -42079 -41412 -43606 -45801 -50108 -54412 -58715 -63019 -64285 -65549 -66633 -67717 -68950 -67318 -64613 -66678 -67911 -69140
-9465f9140j528j528J509J513J513J513j234j229j051j051m02K463L536j234j64j60m58m58
$$ -69140 -70668 -72196 -70687 -69174 -67661 -66148 -67382 -68611 -69662 -70713 -71115 -68652 -65116 -66350 -66514 -66674 -67132 -67590
-9447f7590J900J904J904J904k213k210l02l163k646K128K247k523J57M929M1m728j118J748
$$ -67590 -65690 -63786 -61882 -59978 -62191 -64401 -64703 -67866 -70512 -68384 -66137 -68660 -68503 -63574 -63533 -68261 -69379 -67631
-9429f7631j61j60p00o97o97o97j315j315J546J550j077j076J784J789K574K575K575K578
$$ -67631 -67792 -67952 -68652 -69349 -70046 -70743 -72058 -73373 -71827 -70277 -71354 -72430 -70646 -68857 -66283 -63708 -61133 -58555
-9411e8555k373k374k194k191r09J952L204j561l532o71k578k575K251K250K251K254o71o70
$$ -58555 -60928 -63302 -65496 -67687 -68596 -66644 -63440 -65001 -68533 -69204 -71782 -74357 -72106 -69856 -67605 -65351 -66022 -66692
-9393f6692o71o67M784M788J926J927j893j889m751m750P60P63J062J062k280K493M281J419
$$ -66692 -67363 -68030 -63246 -58458 -56532 -54605 -56498 -58387 -63138 -67888 -67128 -66365 -65303 -64241 -66521 -64028 -59747 -58328
-9375e8328K61K65Q5Q6L361L364Q02Q01M478R252J4557J9327K6714K9580K6898J0682K996
$$ -58328 -58067 -57802 -57717 -57631 -54270 -50906 -50104 -49303 -44825 -35573 -21016 -1689 25025 54605 81503 92185 95181
-9358I5181K995m814j8164k9733k9733k3294j7567p095p094p094j367j342j341l845l842j207
$$ 95181 98176 93362 75198 45465 15732 -7562 -25129 -32224 -39318 -46412 -47779 -49121 -50462 -54307 -58149 -59356
-9342e9356j207K23K28M32M32k370n227j938L786J997q61l964l965O26O30L439L443j330j327
$$ -59356 -60563 -60340 -60112 -59680 -59248 -61618 -66845 -68783 -64997 -63000 -63861 -67825 -71790 -71164 -70534 -67095 -63652 -64982 -66309
-9323f6309J2J4J2J4K58K60j173j170k158k153P04P08m40m36K422K426J706J711K75K80M17
$$ -66309 -66297 -66283 -66271 -66257 -65999 -65739 -66912 -68082 -70240 -72393 -71689 -70981 -71421 -71857 -69435 -67009 -65303 -63592 -63317 -63037 -62620
-9302f2620M21j013j010n07n03R24R28Q08Q13Q08Q13J613J617j248j245J718J721l051l048
$$ -62620 -62199 -63212 -64222 -64729 -65232 -64308 -63380 -62572 -61759 -60951 -60138 -58525 -56908 -58156 -59401 -57683 -55962 -59013 -62061
-9283f2061r95r91M36M40j297j293j297j292M02M06M02M07J997K001K712l007m620J107k474
$$ -62061 -63056 -64047 -63611 -63171 -64468 -65761 -67058 -68350 -67948 -67542 -67140 -66733 -64736 -62735 -60023 -63030 -67650 -66543 -69017
-9264f9017k471R7J01J00J01j364j360L052L051M047j673J15J16o93o90o89o89N03N07N06
$$ -69017 -71488 -71391 -71290 -71190 -71089 -72453 -73813 -70761 -67710 -63663 -65336 -65221 -65105 -65798 -66488 -67177 -67866 -67363 -66856 -66350
-9244f6350N07N93N96L457L458p34p30k161k161J442J445j416j415p53p49K113K112L778L782
$$ -66350 -65843 -65250 -64654 -61197 -57739 -58473 -59203 -61364 -63525 -62083 -60638 -62054 -63469 -64222 -64971 -62858 -60746 -56968 -53186
-9225e3186N094K231J260l506m162p024k913k910j658j658n18n15q71J989N533K676J602J602
$$ -53186 -48092 -45861 -44601 -48107 -52269 -59293 -62206 -65116 -66774 -68432 -68950 -69465 -70336 -68347 -62814 -60138 -58536 -56934
-9207e6934MPj423j424K72K76R7R7o22l480l659p98R88j871j870R91Q38k019j841J021L283
$$ -56934 -56930 -56923 -58346 -59770 -59498 -59222 -59125 -59028 -59650 -63130 -66789 -67587 -66599 -68470 -70340 -69349 -68511 -70530 -72371 -71350 -68067
-9186f8067L286O04O03j013j010J554J553L577j188k977j16j200j196J547J546N119L54j23
$$ -68067 -64781 -64177 -63574 -64587 -65597 -64043 -62490 -58913 -60101 -63078 -63194 -64394 -65590 -64043 -62497 -57378 -57024 -57147
-9168e7147k984j651j650K641k16k306k306k307k302r21J942J941r17J23J23k35k31Q35k027
$$ -57147 -60131 -61782 -63432 -60791 -61007 -63313 -65619 -67926 -70228 -71149 -69207 -67266 -68183 -68060 -67937 -68172 -68403 -67568 -69595
-9149f9595n96K269K057K056L28m437j178J684J565j293l621p60K101p56J956M821j855m717
$$ -69595 -70191 -67922 -65865 -63809 -63481 -67918 -69096 -67412 -65847 -67140 -70761 -71521 -69420 -70176 -68220 -63399 -65254 -69971
-9131f9971j085J781K974j796k456K318K198K199j90j87j86j86N6N6J844j014j017J845N5
$$ -69971 -71056 -69275 -66301 -68097 -70553 -68235 -66037 -63838 -64028 -64215 -64401 -64587 -64531 -64475 -62631 -63645 -64662 -62817 -62762
-9112f2762O0K05K05L84L87o29K231L305j460l659l659Q12Q12K422K422P191P191K683K683
$$ -62762 -62702 -62497 -62292 -61908 -61521 -62150 -59919 -56614 -58074 -61733 -65392 -64580 -63768 -61346 -58924 -51733 -44542 -41859 -39176
-9093c9176p75o498q95q94j252j252j371j367j371j368L88L91L87L92j640j635k09k05J312
$$ -39176 -39951 -46449 -47344 -48238 -49490 -50742 -52113 -53480 -54851 -56219 -55831 -55440 -55053 -54661 -56301 -57936 -58145 -58350 -57038
-9074e7038J315j550j546J497J498J498J498J855J856k735k735j013J848L457k265J103J103
$$ -57038 -55723 -57273 -58819 -57322 -55824 -54326 -52828 -50973 -49117 -51852 -54587 -55600 -53752 -50295 -52560 -51457 -50354
-9057e0354P45P45J744J747L13L17K191K195o71o67J841J844N954L096K616l104J185M050
$$ -50354 -49609 -48864 -47120 -45373 -45060 -44743 -42552 -40357 -41028 -41695 -39854 -38010 -32056 -28960 -26344 -29448 -28263 -24213
-9039b4213L264L264Q808J4530J6737J6737J7095J7095J9926J9927K5053K5053K7379L3101
$$ -24213 -20949 -17685 -8877 5653 22390 39127 56222 73317 93243 113170 138223 163276 190655 223756
-9025B23756M4190O8990J12121J82710K89060M09247M94614N15601M56698L74671J88012j57276
$$ 223756 267946 336936 449057 631767 920827 1330074 1824688 2340289 2796987 3171658 3359670 3202394
-9013C202394l82388n10199n68148m86115l52818k44076j71599j16272p9792o2618m7301l3944
$$ 3202394 2820006 2309807 1741659 1255544 902726 658650 487051 370779 290987 228369 181068 147124
-9001A47124k3455j3912p121j393q01o521j4214j4211j4572j4569r698r695r699r694n525
$$ 147124 123669 109757 102636 101243 100442 93921 79707 65496 50924 36355 26657 16962 7263 -2431 -7956
-8986g956n522k664k661P64P68k098k094n913n910j322j319k161n019l767J956J505J509k902
$$ -7956 -13478 -16142 -18803 -18039 -17271 -19369 -21463 -27376 -33286 -34608 -35927 -38088 -43107 -46874 -44918 -43413 -41904 -44806
-8968d4806k903M278M281K850K851k132k127K641K642M225M229O137J1860J9009K4736K8731
$$ -44806 -47709 -43431 -39150 -36300 -33449 -35581 -37708 -35067 -32425 -28200 -23971 -17834 -5974 13035 37771 66502
-8952F6502L8269L9160L6302K4916J1561r069k6234l2017l4879l4007l4003k6968j7430j3975
$$ 66502 104771 143931 180233 205149 216710 207641 181407 149390 114511 80504 46501 19533 2103 -11872
-8938a1872j1111o878m017n011k147Q35Q35M109j609k862%K95K98M77M77j852j848j848j848
$$ -11872 -22983 -29861 -33878 -38889 -41036 -40201 -39366 -35257 -36866 -39728 -39728 -39433 -39135 -38658 -38181 -40033 -41881 -43729 -45577
-8919d5577j76j71j71j72P19P23P23P23p12p08K150K154K328K333k441k436J196J199j665
$$ -45577 -45753 -45924 -46095 -46267 -45548 -44825 -44102 -43379 -44091 -44799 -42649 -40495 -38167 -35834 -38275 -40711 -39515 -38316 -39981
-8900c9981j662j069j066j069j066j129j125j129j125m14m10m13m10q83q79q83q80J591J595
$$ -39981 -41643 -42712 -43778 -44847 -45913 -47042 -48167 -49296 -50421 -50835 -51245 -51658 -52068 -52951 -53830 -54713 -55593 -54002 -52407
-8881e2407L022L025j602j598J259J263p08p04P23P26j192j189j192j189K147K149N545K686
$$ -52407 -49385 -46360 -47962 -49560 -48301 -47038 -47746 -48450 -47727 -47001 -48193 -49382 -50574 -51763 -49616 -47467 -41922 -39236
-8863c9236m709J017M77M80k355k351j997j993l190K538o86o82j997j993j997j994J353J352
$$ -39236 -43945 -42928 -42451 -41971 -44326 -46677 -48674 -50667 -53857 -51319 -52005 -52687 -54684 -56677 -58674 -60668 -59315 -57963
-8845e7963J353J353k28k27k27k28Q16Q16K247K247J799J800k969k970l387l387j837L886
$$ -57963 -56610 -55257 -55485 -55712 -55939 -56167 -55351 -54535 -52288 -50041 -48242 -46442 -49411 -52381 -55768 -59155 -60992 -57106
-8827e7106O38O37m36m36L3L4L3L4J23J23J23J23J486J491j371j371l641l636J132J133N6
$$ -57106 -56468 -55831 -56267 -56703 -56670 -56636 -56603 -56569 -56446 -56323 -56200 -56077 -54591 -53100 -54471 -55842 -59483 -63119 -61987 -60854 -60798
-8806f0798O0N9O0r3r0q9r0Q02Q04o26o26k507k504K265K266J136J140k079L644K865K869
$$ -60798 -60738 -60679 -60619 -60712 -60802 -60891 -60981 -60179 -59375 -60001 -60627 -63134 -65638 -63373 -61107 -59971 -58831 -60910 -57266 -54401 -51532
-8785e1532L66L65K228K228o33o30m151m151K527K530n74n74n74n70r91r91j349M378J945
$$ -51532 -51166 -50801 -48573 -46345 -46978 -47608 -51759 -55910 -53383 -50853 -51427 -52001 -52575 -53145 -54136 -55127 -56476 -52098 -50153
-8766e0153J945k467k462m434m434m434m430J86J86j71N555N671N671k90k87l473K254r68
$$ -50153 -48208 -50675 -53137 -57571 -62005 -66439 -70869 -70683 -70497 -70668 -65113 -59442 -53771 -54061 -54348 -57821 -55567 -56535
-8748e6535r65k013k008Q50Q53j34j31j564j562l442l440J5N742K757K761K54K57O41O44p90
$$ -56535 -57500 -59513 -61521 -60671 -59818 -59952 -60083 -61647 -63209 -66651 -70091 -70076 -64334 -61577 -58816 -58562 -58305 -57664 -57020 -57810
-8728e7810p86l584l581l65l62K61N988M017M020J140j718m758R65j006j002o45o44j491j486
$$ -57810 -58596 -62180 -65761 -66126 -66488 -66227 -60239 -56222 -52202 -51062 -52780 -57538 -56573 -57579 -58581 -59226 -59870 -61361 -62847
-8709f2847J375J375k027k024K746K746L659L663j107j106q13q08k239k240r91r87M43M44
$$ -62847 -61472 -60097 -62124 -64148 -61402 -58656 -54997 -51334 -52441 -53547 -54360 -55168 -57407 -59647 -60638 -61625 -61182 -60738
-8691f0738n44n41Q91Q90J681J680J681J680K962K962K962K963J501J502J501J502j122j121
$$ -60738 -61282 -61823 -60932 -60042 -58361 -56681 -55000 -53320 -50358 -47396 -44434 -41471 -39970 -38468 -36967 -35465 -36587 -37708
-8673c7708p64p64m445J278j941j941m863m862q976o114K34N958O197J1919R684O822N749
$$ -37708 -38472 -39236 -43681 -42403 -44344 -46285 -51148 -56010 -64986 -71100 -70866 -64908 -58711 -46792 -37108 -30286 -24537
-8656b4537Q611J963J968p16p15m535m530k743k742o010k83m933k072m669j803l234l234j606
$$ -24537 -15926 -13963 -11995 -12711 -13426 -17961 -22491 -25234 -27976 -33986 -34269 -39202 -41274 -45943 -47746 -50980 -54214 -55820
-8638e5820j602J438J438j665J199J141O863L059L063N58N59P9Q2J512J513R95R98p89M933
$$ -55820 -57422 -55984 -54546 -56211 -55012 -53871 -47008 -43949 -40886 -40328 -39769 -39690 -39608 -38096 -36583 -35588 -34590 -35379 -30446
-8619c0446P075P080P60P60m73m70m881m881p418j692m911m910o376o371m941m940q134q130
$$ -30446 -23371 -16291 -15531 -14771 -15244 -15714 -20595 -25476 -32894 -34586 -39497 -44407 -50783 -57154 -62095 -67035 -75169 -83299
-8601h3299o222n00p04N023L711R434J0623J0626K400K399p143p139l684K041M29M32j002
$$ -83299 -89521 -90021 -90725 -85702 -81991 -72557 -61934 -51308 -48908 -46509 -53652 -60791 -64475 -62434 -62005 -61573 -62575
-8584f2575M724J1J5j062j058K158K161R05L771Q08O536O29O357J2493J8220K1971K4837J7203
$$ -62575 -57851 -57840 -57825 -58887 -59945 -57787 -55626 -54721 -50950 -50142 -43606 -42977 -36620 -24127 -5907 16064 40901 58104
-8566E8104J1483j337j334n451n448K001P728M258P124M259P124N153N157j524j520p575j0433
$$ 58104 69587 68250 66916 61465 56017 58018 65746 70004 77128 81387 88511 93664 98821 97297 95777 88202 77769
-8549G7769j8126j2400q768P75Q343J7884J4140J1283J740M605J025O751J0742K0284J6912
$$ 77769 59643 47243 38475 39250 47593 65477 79617 90900 92640 97245 98270 105021 115763 136047 152959
-8534A52959J6916J1189J1193L558R285O301J2027J2661K2203K0236K0235J7192K0057J8447
$$ 152959 169875 181064 192257 195815 205100 211401 223428 236089 258292 278528 298763 315955 336012 354459
-8520C54459K7986L0217L9760L6540M2264K9025K9029J4721J4721K0016M4820P5462J26969
$$ 354459 382445 412662 452422 488962 531226 560251 589280 604001 618722 638738 683558 759020 885989
-8507H85989J72154K35111K72074L04504K94156K73176K33592K12606K09503L10615N03529
$$ 885989 1058143 1293254 1565328 1869832 2163988 2437164 2670756 2883362 3092865 3403480 3907009
-8496C907009Q71714J409123K223710L390501N296283Q160795J1707192J3275074J1403631
$$ 3907009 4778723 6187846 8411556 11802057 17098340 25259135 36966327 50241401 61645032
-8487F1645032N754691l316373r584795j2570332j1822642q802764n965553l910974k573923
$$ 61645032 67399723 64083350 54498555 41928223 30105581 21302817 15337264 11426290 8852367
-8478H852367j755522j272876r54292p28711n32216l66246k26986j40606j08172j39172k09757
$$ 8852367 7096845 5823969 4869677 4140966 3608750 3242504 3015518 2874912 2766740 2627568 2417811
-8467B417811k57571k74737k58045k25614j92930j60496j35222j06603q4490o3502n2774m3232
$$ 2417811 2160240 1885503 1627458 1401844 1208914 1048418 913196 806593 722103 658601 605827 562595
-8455E62595l3430k7702k6931l2651l6350l3486k8421j8880j6588j6584j8853j8850k1119
$$ 562595 529165 501463 474532 441881 405531 372045 343624 324744 308156 291572 272719 253869 232750
-8442B32750k1115j4084j4080j3361p635o267o263o565r423j0679m952k38N485L636P79q108
$$ 232750 211635 197551 183471 170110 162475 156208 149945 143380 133957 123278 118326 118088 123573 127209 127988 119880
-8426A19880j7646j8779j8775k1111j5388j1573k031J453J453O19O22j431j430q287q282j0880
$$ 119880 102234 83455 64680 43569 28181 16608 14577 16030 17483 18102 18724 17293 15863 7576 -706 -11586
-8410a1586j3741j0462r21J87N909J2109J7837J5923J0202N194N198J900J904r61r58j200
$$ -11586 -25327 -35789 -36710 -36523 -30614 -18505 -668 15255 25457 30651 35849 37749 39653 38692 37734 36534
-8394C6534j196n969n965l592l588M993M996J178J181p229p224r919p052l122K604O803R669
$$ 36534 35338 29369 23404 19812 16224 21217 26213 27391 28572 21343 14119 4200 -2852 -5974 -3370 3433 13102
-8377A3102O982O986J804J807j058j055o274o271r136r132p273p273o915o912q614k891p184
$$ 13102 20084 27070 28874 30681 29623 28568 22294 16023 6887 -2245 -9518 -16791 -23706 -30618 -39232 -42123 -49307
-8360d9307p180q622k899p52M974P265P266K854K858j602j602j603j598k318k317k318k313
$$ -49307 -56487 -65109 -68008 -68760 -63786 -56521 -49255 -46401 -43543 -45145 -46747 -48350 -49948 -52266 -54583 -56901 -59214
-8343e9214Q71Q72N641N645K422K422m40m36j892j889j532j531K83O010M400J539k519k515
$$ -59214 -58343 -57471 -51830 -46185 -43763 -41341 -41781 -42217 -44109 -45998 -47530 -49061 -48778 -42768 -38368 -36829 -39348 -41863
-8325d1863n376k515q093k366J569M430j230j226j047j047J841J844L275L276J438J442m878
$$ -41863 -47239 -49754 -57847 -60213 -58644 -54214 -55444 -56670 -57717 -58764 -56923 -55079 -51804 -48528 -47090 -45648 -50526
-8308e0526m877o729j002m222j360K35L100j192j193k716k712P45O468J472J475J834J833
$$ -50526 -55403 -62132 -63134 -67356 -68716 -68481 -65381 -66573 -67766 -70482 -73194 -72449 -65981 -64509 -63034 -61200 -59367
-8291e9367L260L264j505j506MQL65L65l514K213N44O268L118L122O19O19p27p23P08P08J79
$$ -59367 -56107 -52843 -54348 -55854 -55850 -55842 -55477 -55112 -58626 -56413 -55869 -49601 -46483 -43361 -42742 -42123 -42850 -43573 -42865 -42157 -41978
-8270d1978J82L041L044M024M028p46p41Q05Q08n276M51p183p180n097O29n21K343L950L953
$$ -41978 -41796 -38755 -35711 -31687 -27659 -28405 -29146 -28341 -27533 -32809 -32358 -39541 -46721 -51818 -51189 -51710 -49367 -45417 -41464
-8251d1464K638K642K638K641K467K470l435K291j646J218k16N510J636M497K888Q614L663
$$ -41464 -38826 -36184 -33546 -30905 -28438 -25968 -29403 -27112 -28758 -27540 -27756 -22246 -20610 -16113 -13225 -4611 -948
-8234i48L662p49p45j516j516N159N164N757N756L4N760k075L648M363J3905J6733K2457K3410
$$ -948 2714 1965 1220 -296 -1812 3347 8511 14268 20024 20058 25818 23743 27391 31754 45659 62392 84849 108259
-8216A08259L6768L8463M8001L8821M4547M4455M4454K3828L3369O4284J34869K25960L65226
$$ 108259 145027 183490 231491 270312 314859 359314 403768 427596 460965 525249 660118 886078 1251304
-8203A251304N33695Q33202J324909K223435L332841L178319j98530k978030k891353k134001
$$ 1251304 1784999 2618201 3943110 6166545 9499386 12677705 12479175 9501145 6609792 4475791
-8193D475791j433163r08544n36385l55155k37116j85605j45070j20270q0686n5881k6615
$$ 4475791 3042628 2134084 1597699 1242544 1005428 819823 674753 554483 473797 417916 391301
-8182C91301k0891n153j8503m0207m9745l6630l6626k8325k8321k5102k5102j8428j2702j613
$$ 391301 370410 365257 346754 306547 256802 220172 183546 155221 126900 101798 76696 58268 45566 43953
-8168D3953j614m776m773J307m415m896m892m534j0258o765j040L371k350l756l752n540n541
$$ 43953 42339 37563 32790 34097 29682 24786 19894 15360 5102 -1663 -2703 668 -1682 -5438 -9190 -14730 -20271
-8151b0271k206k202O60O59R84R87n62o286k213k210L749L752K913k805j021j017m688m683
$$ -20271 -22477 -24679 -24019 -23360 -22376 -21389 -21951 -28237 -30450 -32660 -28911 -25159 -22246 -25051 -26072 -27089 -31777 -36460
-8133c6460o118o114j617j614j86j83N992N995o86o82j579j577m441m437p46p41k534L193
$$ -36460 -42578 -48692 -50309 -51923 -52109 -52292 -46300 -40305 -40991 -41673 -43252 -44829 -49270 -53707 -54453 -55194 -57728 -54535
-8115e4535N455N459M262j457q79q76J98J97j922j919K850K851j178j173j174j174j64j60
$$ -54535 -49080 -43621 -39359 -40816 -41695 -42571 -42373 -42176 -44098 -46017 -43167 -40316 -41494 -42667 -43841 -45015 -45179 -45339
-8097d5339j60j60M32M36M36M36r10r05N25N26l361l357m96m95n2m9K813K813J677J677J676
$$ -45339 -45499 -45659 -45227 -44791 -44355 -43919 -44829 -45734 -45209 -44683 -48044 -51401 -51897 -52392 -52444 -52493 -49680 -46867 -45190 -43513 -41837
-8076d1837J681K76K75k884n741j446j446j93j90K816K817P30m035r83r84J282J285J222l547
$$ -41837 -40156 -39880 -39605 -42489 -48230 -49676 -51122 -51315 -51505 -48689 -45872 -45142 -49177 -50160 -51144 -49862 -48577 -47355 -50902
-8057e0902k474L91J297J297j386j383r69r68L323M66M095J237J058L920j98j93j94j94m81
$$ -50902 -53376 -52985 -51688 -50391 -51777 -53160 -54129 -55097 -51774 -51308 -47213 -45976 -44918 -40998 -41196 -41389 -41583 -41777 -42258
-8038d2258l338j729j729o89o86q64q64M079J223J401J400J636J640O110L249J815J818L070
$$ -42258 -45596 -47325 -49054 -49743 -50429 -51293 -52157 -48078 -46855 -45454 -44054 -42418 -40778 -34668 -31419 -29604 -27786 -24716
-8020b4716L070N720N723J3949J8719K6875L3553L7606L4748L4744K2345O964p340k2919l3410
$$ -24716 -21646 -15926 -10203 3746 22465 49340 82893 120499 155247 189991 212336 219300 211960 189041 155631
-8005A55631l4961l7818l3411k6734j7374q785o405o405l006l004m139m140l960l957k597
$$ 155631 120670 82852 49441 22707 5333 -3452 -9857 -16262 -19268 -22272 -26411 -30551 -34511 -38468 -41065
-7990d1065K64J517J520q09q08O22O26M40M43r87r88K407K411R80j882k399n258l826l827
$$ -41065 -40801 -39284 -37764 -38573 -39381 -38759 -38133 -37693 -37250 -38237 -39225 -36818 -34407 -33427 -35309 -37708 -42966 -46792 -50619
-7971e0619k399k396M66M66J341J345M028M027O56k202n92n93n9n6j487j486j580j576L968
$$ -50619 -53018 -55414 -54948 -54482 -53141 -51796 -47768 -43741 -43085 -45287 -45879 -46472 -46531 -46587 -48074 -49560 -51140 -52716 -48748
-7952d8748q01j256j252J308J311L514L517K143l577l767r02k872k869O74O78L536L540J23
$$ -48748 -49549 -50805 -52057 -50749 -49438 -45924 -42407 -40264 -43841 -47608 -48510 -51382 -54251 -53577 -52899 -49363 -45823 -45700
-7934d5700J26j129j125Q68L734P49m971m192j326L081K24k046k041p94p90J613J617L048
$$ -45700 -45574 -46703 -47828 -46960 -43226 -42477 -47448 -51640 -52966 -49885 -49661 -51707 -53748 -54542 -55332 -53719 -52102 -49054
-7916d9054L048p41p38k169k168M13M18k444k445j434j431%%J986J990k780k780j1pqpj375
$$ -49054 -46006 -46747 -47485 -49654 -51822 -51409 -50991 -53435 -55880 -57314 -58745 -58745 -58745 -56759 -54769 -57549 -60329 -60340 -60347 -60355 -60362 -61737
-7894f1737j371j371j371J75J79J78J79K35K35K34K35K262K262K798k925l69K493j025o748
$$ -61737 -63108 -64479 -65850 -65675 -65496 -65318 -65139 -64904 -64669 -64435 -64200 -61938 -59676 -56878 -59803 -60172 -57679 -58704 -65452
-7875f5452n495n496K731K731M81M80L342L343q6q6J345J345j67j68j68j67o75o74m96m95
$$ -65452 -70947 -76443 -73712 -70981 -70500 -70020 -66678 -63335 -63421 -63507 -62162 -60817 -60984 -61152 -61320 -61487 -62162 -62836 -63332 -63827
-7855f3827q2K783M747r72m345J382O64O67J512J517K943K948J840J844j020j018l986l983
$$ -63827 -63909 -61126 -56379 -57351 -61696 -60314 -59650 -58983 -57471 -55954 -53011 -50063 -48223 -46379 -47399 -48417 -52403 -56386
-7837e6386j126j121L346L349M85M88l286l283l107l104Q27L692N299m21j554j554j911j912
$$ -56386 -57512 -58633 -55287 -51938 -51453 -50965 -54251 -57534 -60641 -63745 -62918 -59226 -53927 -54348 -55902 -57456 -59367 -61279
-7819f1279l01l02K560K559o3o3o4o3j673j673j673j673j598j599j598j599M29M28N198N198
$$ -61279 -61580 -61882 -59322 -56763 -56826 -56889 -56953 -57016 -58689 -60362 -62035 -63708 -65306 -66905 -68503 -70102 -69673 -69245 -64047 -58849
-7799e8849L021L022J60J61j9j9K843j926j077J789J490j371j673j669j848j848j957j952
$$ -58849 -55828 -52806 -52646 -52485 -52504 -52523 -49680 -51606 -52683 -50894 -49404 -50775 -52448 -54117 -55965 -57813 -59770 -61722
-7781f1722R09R09n25n22n21n22L070L074K12K13L0L3L4L3R99J002J002J003J535J539j323
$$ -61722 -60813 -59904 -60429 -60951 -61472 -61994 -58924 -55850 -55638 -55425 -55395 -55362 -55328 -55295 -54296 -53294 -52292 -51289 -49754 -48215 -49538
-7760d9538j323J375J379J378J379l693l688l689l689J897J900pK854O844K079N3K913K661
$$ -49538 -50861 -49486 -48107 -46729 -45350 -49043 -52731 -56420 -60109 -58212 -56312 -56319 -53465 -46621 -44542 -44489 -41576 -38915
-7742c8915m013k940k940K76K79K80K79j065j062K217K217j364N317O330O331L305L304M44
$$ -38915 -42928 -45868 -48808 -48532 -48253 -47973 -47694 -48759 -49821 -47604 -45387 -46751 -41434 -35104 -28773 -25468 -22164 -21720
-7724b1720M43m028m027m028m028n354n354k493k493K50K50k612k612l02l02l01l02L54L54
$$ -21720 -21277 -25305 -29332 -33360 -37388 -42742 -48096 -50589 -53082 -52832 -52582 -55194 -57806 -58108 -58410 -58711 -59013 -58659 -58305
-7705e8305L54L54N03N03k359K411L84k478n041k180J390J389J569J572k008k008k008k005
$$ -58305 -57951 -57597 -57094 -56591 -58950 -56539 -56155 -58633 -63674 -65854 -64464 -63075 -61506 -59934 -61942 -63950 -65958 -67963
-7687f7963J792J792j069j066j963j964j963j960J036J035J036J040J334J334j528j524J751
$$ -67963 -66171 -64379 -65448 -66514 -68477 -70441 -72404 -74364 -73328 -72293 -71257 -70217 -68883 -67549 -69077 -70601 -68850
-7670f8850J751J394J397L659k064m926Q01K608K609K965K966j624j625j624j625K61K61K61
$$ -68850 -67099 -65705 -64308 -60649 -62713 -67639 -66838 -64230 -61621 -58656 -55690 -57314 -58939 -60563 -62188 -61927 -61666 -61405
-7652f1405K61J870J870r91r91n89n85n88n85O7P1O7P1k236k232k235k232K414K418m47m43
$$ -61405 -61144 -59274 -57404 -58395 -59386 -59975 -60560 -61148 -61733 -61666 -61595 -61528 -61457 -63693 -65925 -68160 -70392 -67978 -65560 -66007 -66450
-7631f6450o19o15M155M154l539l536o75o74J572J576J219J218l35o055k835k836j267j263
$$ -66450 -67069 -67684 -63529 -59375 -62914 -66450 -67125 -67799 -66227 -64651 -63432 -62214 -62549 -68604 -71439 -74275 -75542 -76805
-7613g6805J599J598Q80Q83Q83Q83J453J457j405j405K169K172n10n11k660K01J990l734j945
$$ -76805 -75206 -73608 -72728 -71845 -70962 -70079 -68626 -67169 -68574 -69979 -67810 -65638 -66148 -66659 -69319 -69118 -67128 -70862 -72807
-7594g2807R17k839K2k794n656p087j364K213K214k91k91J431J435J430J435J609J614j610
$$ -72807 -71890 -74729 -74707 -77501 -83157 -90244 -91608 -89395 -87181 -87472 -87763 -86332 -84897 -83467 -82032 -80423 -78809 -80419
-7576h0419M117N07N11Q64Q68K474K478l88l83j182j181j181j177j360j360J501J506K835
$$ -80419 -76302 -75795 -75284 -74420 -73552 -71078 -68600 -68988 -69371 -70553 -71734 -72915 -74092 -75452 -76812 -75311 -73805 -70970
-7558g0970K836k6k3q90q91N40N44j792j792J069J073L633L633K202K206j435j434m296m292
$$ -70970 -68134 -68160 -68183 -69073 -69964 -69424 -68880 -70672 -72464 -71395 -70322 -66689 -63056 -60854 -58648 -60083 -61517 -65813 -70105
-7539g0105J069J069J427J431Q2N809J155J159J453J457l316l313J327J330j05j00M02M06
$$ -70105 -69036 -67967 -66540 -65109 -65027 -59218 -58063 -56904 -55451 -53994 -57310 -60623 -59296 -57966 -58071 -58171 -57769 -57363
-7521e7363M03M06N850N853O208O211R277J5005J3569J3573J9152K4878K6424K6429K4189
$$ -57363 -56960 -56554 -50704 -44851 -38643 -32432 -23155 -8150 5419 18992 38144 63022 89446 115875 140064
-7506A40064K4192J4889N354j986p705j5574j5575k3745k3742k3384k3384j9990j4263j0805
$$ 140064 164256 179145 184499 182513 174808 159234 143659 119914 96172 72788 49404 29414 15151 4346
-7492D346j0805q633q629n768n768j836j834k906k906k433L294M724r98n370n365k861k862
$$ 4346 -6459 -15092 -23721 -29489 -35257 -37093 -38927 -41833 -44739 -47172 -43878 -39154 -40152 -45522 -50887 -53748 -56610
-7475e6610N92N97K026K027J200J204l212l208k824K902l20l17n74n70n74n70j706j703j707
$$ -56610 -56018 -55421 -53395 -51368 -50168 -48964 -52176 -55384 -58208 -55306 -55626 -55943 -56517 -57087 -57661 -58231 -59937 -61640 -63347
-7456f3347j702K61K64L122L126M40M44M39M44j275j270j275j270k109k105j751j748q05M919
$$ -63347 -65049 -64788 -64524 -61402 -58276 -57836 -57392 -56953 -56509 -57784 -59054 -60329 -61599 -63708 -65813 -67564 -69312 -70117 -65198
-7437f5198J699J702L58L58k504k500r39r39k370k366R99R98R99J002r24r24n66n63r83M739
$$ -65198 -63499 -61797 -61439 -61081 -63585 -66085 -67024 -67963 -70333 -72699 -71700 -70702 -69703 -68701 -69625 -70549 -71115 -71678 -72661 -67922
-7417f7922J520J524K772K772q9q6k653k653K09K12J42J45L003L007j26j23j558j553j42j38
$$ -67922 -66402 -64878 -62106 -59334 -59423 -59509 -62162 -64815 -64606 -64394 -64252 -64107 -61104 -58097 -58223 -58346 -59904 -61457 -61599 -61737
-7397f1737j42j37K16K20k646k642j304j304p67l629l451K273L06L05L555L554j214j215K46
$$ -61737 -61879 -62016 -61800 -61580 -64226 -66868 -68172 -69476 -70243 -73872 -77323 -75050 -74744 -74439 -70884 -67330 -68544 -69759 -69513
-7378f9513K46J677J676K601K604M032M035k675k672j244j241M553M557L003k716n44n40J960
$$ -69513 -69267 -67590 -65914 -63313 -60709 -56677 -52642 -55317 -57989 -59233 -60474 -55921 -51364 -48361 -51077 -51621 -52161 -50201
-7360e0201J963J271J270j591j591K344K344N205N205N145N146K284K284N503N504N085J4624
$$ -50201 -48238 -46967 -45697 -47288 -48879 -46535 -44191 -38986 -33781 -28636 -23490 -21206 -18922 -13419 -7915 -2830 11794
-7343A1794K1323K4189K5974K8839K9908K4189J7806J2087M542m992r349j5068k0615k3474
$$ 11794 33117 57306 83280 112119 142027 166216 184022 196109 200651 195659 186310 171242 150627 127153
-7329A27153k6816k6812k6100k3235k2702j6975r288K53K157P884J1607N886j211j0745j4147
$$ 127153 100337 73525 47425 24190 1488 -15487 -24775 -24522 -22365 -14481 -2874 3012 1801 -8944 -23091
-7314b3091j1282q425n559l093l088k910k910J26J31K992K992M240M244J382J382j602j598
$$ -23091 -34373 -42798 -48357 -51450 -54538 -57448 -60358 -60232 -60101 -57109 -54117 -49877 -45633 -44251 -42869 -44471 -46069
-7297d6069q276q275p728p724k358N03L063P835J0698N928L018J60j509m371n447k582L99
$$ -46069 -54345 -62620 -70348 -78072 -80430 -79927 -76864 -69029 -58331 -52403 -49385 -49225 -50734 -55105 -60552 -63134 -62735
-7280f2735L98J565J569J565J568K042K046K041K046M620M624J759J762K236K239o26o22j453
$$ -62735 -62337 -60772 -59203 -57638 -56070 -54028 -51982 -49941 -47895 -43275 -38651 -36892 -35130 -32894 -30655 -31281 -31903 -33356
-7262c3356j450j453j449Q12Q16L495j271k228k224k526k523M866M870K005K008O19O22L484
$$ -33356 -34806 -36259 -37708 -36896 -36080 -32585 -33856 -36084 -38308 -40834 -43357 -38491 -33621 -31616 -29608 -28989 -28367 -24883
-7244b4883L483Q2Q6Q6m684k854J1K336K337K451o129r885r885p854p855m635P769Q421L651
$$ -24883 -21400 -21318 -21232 -21146 -25830 -28684 -28673 -26337 -24000 -21549 -27678 -37563 -47448 -55302 -63157 -67792 -60023 -51602 -47951
-7225d7951O036L178K251N112K072p87K966K966K787K791l693l692q31q27P79P78P79P83l007
$$ -47951 -41915 -38737 -36486 -31374 -29302 -30089 -27123 -24157 -21370 -18579 -22272 -25964 -26795 -27622 -26843 -26065 -25286 -24503 -27510
-7206b7510l007n869j095J524j338N70N74O614O617O319O320N719R54P75P75J933J937J937
$$ -27510 -30517 -36386 -37481 -35957 -37295 -36725 -36151 -29537 -22920 -16601 -10281 -4562 -3608 -2833 -2058 -125 1812 3749
-7188C749J938o30o26M144M143M844M843k83k79k370q093m873m870j1415j1417q555q551l904
$$ 3749 5687 5057 4431 8575 12718 17562 22405 22122 21843 19473 11380 6507 1637 -9778 -21195 -29750 -38301 -42205
-7170d2205l905l905l901j550j550N9K925P691J3413J3235P515k966q689n827n824l204l204
$$ -42205 -46110 -50015 -53916 -55466 -57016 -56957 -54032 -46341 -32928 -19693 -12178 -15144 -23833 -29660 -35484 -38688 -41892
-7153d1892N797J1524J2631R774K558l162j736j733k090k090L152L156P745P746R650O793
$$ -41892 -36095 -24571 -11940 -2166 392 -2770 -4506 -6239 -8329 -10419 -7267 -4111 3634 11380 21030 27823
-7137B7823R535J9073K5366K2509J6845J1122P004k530l83l84q05q01N876N876N872N876J2374
$$ 27823 37358 56431 81797 104306 121151 132273 139277 136747 136364 135980 135175 134374 140250 146126 151998 157874 170248
-7120A70248J2373R509O647J401q137j5590j2728k68R270J6424J6424J8272J5411J0939N217
$$ 170248 182621 192130 198777 200178 192041 176451 163723 163455 172725 189149 205573 223845 239256 250195 255412
-7105B55412P839J7378K4181K7044K7460K4599K0604J7743J3153J6014J7549K3272L1023L3884
$$ 255412 263251 280629 304810 331854 359314 383913 404517 422260 435413 451427 468976 492248 523271 557155
-7091E57155L3287L3288L4301L4301M1571N4924O3986P3528P2332P2336P3524P3528P3480
$$ 557155 590442 623730 658031 692332 733903 788827 852813 926341 998673 1071009 1144533 1218061 1291541
-7078A291541Q3018J04837J37271J81205K21270K64904L08785L43663L76095M13771M65282
$$ 1291541 1374559 1479396 1616667 1797872 2019142 2284046 2592831 2936494 3312589 3726360 4191642
-7067D191642N22629N70325O08713O98378R43990J415189K121273L107552M446389O321650
$$ 4191642 4714271 5284596 5893309 6591687 7535677 8950866 11072139 14179691 18626080 24947730
-7057B4947730Q918728J2171343J4754389J3245413M768828o415956j2770943j3360423j1221902
$$ 24947730 33866458 46037801 60792190 74037603 78806431 72390475 59619532 46259109 35037207
-7048C5037207q484364o043420m233020l010672k207531j649653j247129r28069o81973n14629
$$ 35037207 26552843 20509423 16276403 13265731 11058200 9408547 8161418 7233349 6551376 6036747
-7038F036747m32598m36176m64791m47025m06964l68810l40191l17764k96780k73649k48849
$$ 6036747 5604149 5167973 4703182 4256157 3849193 3480383 3140192 2822428 2525648 2251999 2003150
-7027B003150k17372j81127j43211j14591r2516p1531n4838m1485k8191j4837n477q338k3899
$$ 2003150 1785778 1604651 1461440 1346849 1254333 1182802 1127964 1086479 1058288 1043451 1037974 1029636 1005737
-7014A005737n2513o8312p4035o8788o3066n8773n3050m9168l9629l3549k7825k5232k5233
$$ 1005737 953224 884912 810877 742089 679023 620250 567200 518032 478403 444854 417029 391797 366564
-7001C66564k4337k7200k5694j9971j2102o379k534L28k831q555k2039k7762k1443k1443j7449
$$ 366564 342227 315027 289333 269362 257260 250881 248347 248675 245844 237289 215250 187488 166045 144602 127153
-6986A27153p910n78K284K821K821K999k724q238j3961j0563j3425j5556r832J434J0973K3641
$$ 127153 119243 118665 120949 123770 126591 129590 126866 118628 104667 94104 80679 65123 55291 56725 67698 91339
-6970I1339K3641K1019K6741L0959L0959L1316K1779R199l39l022q745p399j0258r427J16
$$ 91339 114980 135999 162740 193699 224658 255974 277753 286952 286613 283591 274846 267447 257189 247762 247878
-6955B47878J0127J2992J1976O256M299j419n835j1554j1201j1196p981J561J0679J6405J9263
$$ 247878 258005 270997 282973 289229 293528 292109 286274 274720 263519 252323 244342 245903 256582 272987 292250
-6940B92250J3544J1335J799l092K634J3063J3067J3421J3424J0530J0533R099R103P869P869
$$ 292250 305794 317129 318928 315836 318470 331533 344600 358021 371445 381975 392508 401607 410710 418579 426448
-6925D26448J4665K8020L7408L7409L7051L1328L3071L8795M7975N7514O0972O0971O8066
$$ 426448 441113 469133 506541 543950 581001 612329 645400 684195 732170 789684 850656 911627 979693
-6912I79693O8066O6933O4071O7351Q0704J10929J50991J93675K45183K90684L34561L65323
$$ 979693 1047759 1114692 1178763 1246114 1326818 1437747 1588738 1782413 2027596 2318280 2652841 3018164
-6900C018164L93937M33165M73226M94688N08042N77441P77749J175502J803131K679000L890384
$$ 3018164 3412101 3845266 4318492 4813180 5321222 5898663 6676412 7851914 9655045 12334045 16224429
-6889A6224429N597764Q033885J1299015J4517288J4655830P977010l471391j1897657j3925289
$$ 16224429 21822193 29856078 41155093 55672381 70328211 78305221 74833830 62936173 49010884
-6880D9010884j2130158r278569o617341m583031l211403k331480j745819j327320r97289
$$ 49010884 36880726 27602157 20984816 16401785 13190382 10858902 9113083 7785763 6788474
-6871F788474p33060n51829m45237l93729l83595l77872l51402l26602l02201k81213k69532
$$ 6788474 6055414 5503585 5058348 4664619 4281024 3903152 3551750 3225148 2922947 2641734 2372202
-6860B372202k59990k44136k19332j78797j42548j15709j02352q5843o4854n3292n0427n0371
$$ 2372202 2112212 1868076 1648744 1469947 1327399 1211690 1109338 1023495 958641 905349 854922 804551
-6848H04551n0368n0915m5188l5594k9868l0884l3742l4998k9271k5475k5470k3209j7483
$$ 804551 754183 703268 658080 622486 592618 561734 527992 492994 463723 438248 412778 389569 372086
-6835C72086j5936j0209r497j5217k1637j5909j2039o312k619K46m468m463j7389k6924j9893
$$ 372086 356150 345941 336444 321227 299590 283681 271642 265330 262711 262957 258489 254026 236637 209713 189820
-6820A89820j0351J450P176L238o297j6152j6148j3887j3883j3290j3287j9610j9606j9043
$$ 189820 179469 180919 188095 191333 185036 168884 152736 138849 124966 111676 98389 78779 59173 40130
-6806D0130j3317l186O357J7471K7013K5817J6283O665R43l111l111m602m601J67J68J956
$$ 40130 26813 23627 29984 47455 74468 100285 116568 123233 124176 121065 117954 113352 108751 108918 109086 111042
-6790A11042J956k336L387O636J2359M370M371L439k284j2299j2300n861J1309K7404M4574
$$ 111042 112998 110662 114049 120685 133044 137414 141785 145224 142940 130641 118341 112480 123789 151193 195767
-6775A95767O6974R9405J43520J91212K11243J40659k1972j57418j99946j71327j29839r7404
$$ 195767 262741 362146 505666 696878 908121 1048780 1026808 869390 669444 498117 368278 270874
-6763B70874p3680n2693l9819l0277k2211j6483j7203j1476m505J222J219J222l223l218l223
$$ 270874 197194 144501 104682 74405 52194 35711 18508 7032 2527 3749 4968 6190 2967 -251 -3474
-6748c474l219j018j013l879l875r639r635q328J215L745L748J479J483J584J583L014L015
$$ -3474 -6693 -7711 -8724 -12603 -16478 -26117 -35752 -44080 -42865 -39120 -35372 -33893 -32410 -30826 -29243 -26229 -23214
-6731b3214o435o435o792j069P202P202M699M698j263j263K87O010K194K195o033o032p105
$$ -23214 -29649 -36084 -42876 -43945 -36743 -29541 -24842 -20144 -21407 -22670 -22383 -16373 -14179 -11984 -18017 -24049 -31154
-6714c1154p106l09J3045K2210K2209J2196K656q789q790p597p597m310J412r73r72q53j0392
$$ -31154 -38260 -38569 -25524 -3314 18895 31091 33747 24958 16168 8571 974 -3336 -1924 -2897 -3869 -4722 -15114
-6697a5114j4922r200l059l059P56O480M333M333P553P553O59O60j845j844n33N190J0914
$$ -15114 -30036 -39236 -42295 -45354 -44598 -38118 -33785 -29452 -21899 -14346 -13687 -13027 -14872 -16716 -17249 -12059 -1145
-6680a145K0450K7323K7322J1823n347k1681k1682j5064r341p802j125J796O565Q950J5626
$$ -1145 19305 46628 73950 85773 80426 58745 37063 21999 12658 4856 3731 5527 12092 21042 36668
-6665C6668J7892J5031m99j0992j9278j9278j4360r590p265n89j952R09j535j535n679k817
$$ 36668 54560 69591 69092 58100 38822 19544 5184 -4406 -11671 -12260 -14212 -13303 -14838 -16373 -22052 -24869
-6649b4869m32M337K921K922L219L219j013j014n365n366p373o97K224K225k098k098k097
$$ -24869 -25301 -20964 -18043 -15121 -11902 -8683 -9696 -10710 -16075 -21441 -28814 -29511 -27287 -25062 -27160 -29258 -31355
-6632c1355k098n481n481q223n362l096J673M21L283q46q46k098k098J629J628j233j234j233
$$ -31355 -33453 -38934 -44415 -52638 -58000 -61096 -59423 -59002 -55719 -56565 -57411 -59509 -61607 -59978 -58350 -59583 -60817 -62050
-6614f2050j233L536L536K850K850N712N712O48O53K079K082O19O22L659L663R382J2247J0990
$$ -62050 -63283 -59747 -56211 -53361 -50511 -44799 -39087 -38439 -37786 -35707 -33625 -33006 -32384 -28725 -25062 -15680 -3433 7557
-6596G557J5765J7072J9938J9636K6316K4748K4751K2542J7777J0798K217q697j3462j7877
$$ 7557 23322 40394 60332 79968 106284 131032 155783 178325 196102 206900 209117 200420 186958 169081
-6582A69081j7873j5314j5310j4538j4535j9308k2166j9017j4248r539r54j252j251n186n186
$$ 169081 151208 135894 120584 106046 91511 72203 50037 31020 16772 7233 6279 5027 3776 -1410 -6596
-6567f596n22M247K876J5j1222j5992j7184j2415j0104l428j520J341M113Q883Q823Q823M680
$$ -6596 -7118 -2871 5 20 -11202 -27194 -44378 -56793 -66897 -70325 -71845 -70504 -66391 -57508 -48685 -39862 -35182
-6550c5182j997m918m919r866r866m740m739P26O454K157p00j539J326K217K221K142p15n012
$$ -35182 -37179 -42097 -47016 -56882 -66748 -71488 -76227 -75501 -69047 -66890 -67590 -69129 -67803 -65586 -63365 -61223 -61938 -66950
-6532f6950P16p49K116K113K116m385p243m267J461m713p572p396m530q142j0999j3327j0463
$$ -66950 -66234 -66983 -64867 -62754 -60638 -65023 -72266 -76533 -75072 -79785 -87357 -94753 -99283 -107425 -118424 -131751 -142214
-6515a42214o710r84K053K057k210j1748j5921k567Q998K2352K1399J5675R743M020K05K05
$$ -142214 -148924 -149908 -147855 -145798 -148008 -159756 -175677 -178244 -169246 -146894 -125495 -109820 -100077 -96057 -95852 -95647
-6499i5647j703j702M974M974R363R364O501O502L879L879O740O740M251M252n18n18o67o67
$$ -95647 -97350 -99052 -94078 -89104 -79741 -70377 -63876 -57374 -53495 -49616 -42876 -36136 -31885 -27633 -28151 -28669 -29336 -30003
-6481c0003P64P64O82O85k12l070n966k38P448J3175J6688J6692J3231P511J547m174k567
$$ -30003 -29239 -28475 -27793 -27108 -27320 -30390 -36356 -36594 -29146 -15971 717 17409 30640 38151 39698 35524 32957
-6464C2957K98J062O789J2329J2333P620P623N116N119Q141J3868J3507J3510O472O476J0526
$$ 32957 33255 34317 41106 53435 65768 73388 81011 86127 91246 99387 113255 126762 140272 146744 153220 163746
-6448A63746K0068L2084M5438O2369Q3353J08988J45234J83388K27265K71499L15376L46138
$$ 163746 183814 215898 261336 323705 407058 516046 661280 844668 1071933 1343432 1658808 2004946
-6436B004946L55676L30757K67803J80765O0580p0484j75407k58868l06561l10853k89868
$$ 2004946 2360622 2691379 2959182 3139947 3200527 3130043 2954636 2695768 2389207 2078354 1788486
-6425A788486k51953j96630j45882j02005o3256m6086l8665l8664m2718n2256n8338n8337
$$ 1788486 1536533 1339903 1194021 1092016 1028760 982674 944009 905345 862627 810371 752033 693696
-6413F93696n7324n7324n7651n4791m2807k9454j3477L693J2635J2634J3350P627q469j8007
$$ 693696 636372 579048 521397 466606 423799 394345 380868 384561 397196 409830 423180 430807 422338 404331
-6399D04331k6898m0251m3471m3471l0713k4990j3365l826n6K805M773P635R870P008k232
$$ 404331 377433 337182 293711 250240 219527 194537 181172 177346 177290 180095 184868 192503 202373 209381 207149
-6384B07149j1770k1793k4655k2031k2032j5503j2643p336j613l685r408m66N257N854N853
$$ 207149 195379 173586 148931 126900 104868 89365 76722 69386 67773 64088 54680 54214 59471 65325 71178
-6369G1178j181j0720j6435k2158j4051m512N146J0868J3969Q246O382O60q879q879n034n034
$$ 71178 69997 59277 42842 20684 6633 2121 7267 18135 32104 40350 46732 47392 38513 29634 24600 19566
-6353A9566o464o465p794p791K698K701N290N295J3279J3283Q316j218j5172k0891m798J6188
$$ 19566 13102 6637 -1157 -8948 -6250 -3549 1741 7036 20315 33598 41914 40696 25524 4633 -165 16023
-6337A6023K5008J9290N514k05n66n63j758p478r330j2188n857n854o214o212K728j31n797
$$ 16023 41031 60321 65835 65630 65064 64501 62743 55265 45935 33747 27890 22036 15822 9610 12338 12207 6410
-6320F410j1516j0638j0637l901J822J0347P485J4042J4043J2329R468P500k038n943j1665
$$ 6410 -5106 -15744 -26381 -30282 -28460 -18113 -10628 3414 17457 29786 39254 46754 44716 38773 27108
-6305B7108p613p612p120p119k65k64j249J614J4072J9796J4087P35L476L476R557L834l677
$$ 27108 19495 11883 4763 -2356 -2621 -2885 -4134 -2520 11552 31348 45435 46170 49646 53122 62679 66513 62836
-6288F2836r401o353o29Q133J0996J6003J0280J2843J2843J6808L454n727j9080k8083l3805
$$ 62836 53435 47082 46453 54586 65582 81585 91865 104708 117551 134359 137813 132086 113006 84923 51118
-6273E1118j9975j0437P583J7120K5467J9744Q834p04M959P821J4617N079J203J204o547j9900
$$ 51118 31143 20706 28289 45409 70876 90620 99454 98750 103709 111530 126147 131226 132429 133633 127086 107186
-6257A07186j4714n175N317Q178K7434L3158L7449L1727K2903j896j9200k8739k4326k4327
$$ 107186 92472 87297 92614 100792 128226 161384 198833 230560 253463 251567 232367 203628 179302 154975
-6243A54975j1629k090P567j971j8909l2263l6436l6436j6763M221K5206K5206J9066R527
$$ 154975 143346 141256 148823 146852 127943 95680 59244 22808 6045 10266 35472 60678 79744 89271
-6229H9271Q693m661j5988l6973l9238l9237k3891o721K3682M4667N9808N0270L7394M963
$$ 89271 97964 93303 77315 40342 1104 -38133 -62024 -68745 -45063 -396 59412 109682 147076 152039
-6215A52039j6827k6364j2535o811q49j0388k0165l7334l4300k4763k824J0529L2288M1828
$$ 152039 135212 108848 96313 89502 88653 78265 58100 20766 -13534 -38297 -41121 -30592 1696 43524
-6201D3524M6597K9427K2051J6327J5135k035q651j8190j6998k2721k1633j5906j960j956
$$ 43524 90121 119548 141599 157926 173061 171026 162375 144185 127187 104466 82833 66927 64967 63011
-6187F3011l50r885p743k016J0679J0682K7371M0729N7476N7481N6641L9477K3064R713J3525
$$ 63011 62661 52776 45033 43017 53696 64378 91749 132478 189954 247435 304076 343553 366617 376330 389855
-6172C89855L991j1394l2375k0336l163K1275K1279j0321p7087j23709j33244q4362k5221
$$ 389855 393846 382452 350077 329741 326578 347853 369132 358811 281724 158015 24771 -59591 -84812
-6159h4812M0684O9298P7645O0476M8195K7211K5959L1682N5200N2338M2145K082k3730m4715
$$ -84812 -44128 25170 102815 163291 211486 238697 264656 296338 351538 403876 446021 448103 424373 379658
-6145C79658m9723m4000j6495M490K9588K6726R140k7107l9089l3366m13R125J6517O979J7053
$$ 379658 329935 285935 269440 273930 303518 330244 339384 312277 273188 239822 239409 248534 265051 272030 289083
-6130B89083K2777M0125M2986N6236L9070K4581P414N742l793r35J930L2434L5300M0065N7238
$$ 289083 311860 351985 394971 451207 490277 514858 522272 528014 524221 523286 525216 557650 592950 633015 690253
-6115F90253Q6565Q0846N8904J5030o800m3042n6638o6173o6892q7873r8131j03849o8547
$$ 690253 776818 857664 916568 931598 924798 881756 825118 758945 692053 604180 506049 402200 333653
-6102C33653n1373m1362o2343p3673p9393m6011j3577M3470R1163J42074J42074R6410J0563
$$ 333653 282280 240918 178575 104902 25509 -20502 -34079 9391 100554 242628 384702 481112 491675
-6089D91675m6072q6133p4761n3777o323K6108O9150Q2504P6661K1339l4871l4871J8663J2940
$$ 491675 445603 359470 284709 230932 224609 250717 319867 402371 479032 500371 465500 430629 449292 462232
-6075D62232j6867k6406J4013K7367M6862M6861Q1796J56196K78407L48992L34922K26184
$$ 462232 445365 418959 432972 460339 507201 554062 635858 792054 1070461 1419453 1754375 1980559
-6063A980559J29373N1157j1558p0696n5435l4450J3481M9726J01071J14424J10608J01071
$$ 1980559 2109932 2161089 2149531 2078835 2023400 1988950 2002431 2052157 2153228 2267652 2378260 2479331
-6051B479331J24678J07509N7431m3675j19771j90352k02994j36221J9133J43136K37087K61890
$$ 2479331 2604009 2711518 2768949 2725274 2605503 2415151 2212157 2075936 2095069 2238205 2475292 2737182
-6039B737182K40410J31675N4410O7768J66248K29206K66641K49475K25711J70388J34678
$$ 2737182 2977592 3109267 3163677 3231445 3397693 3626899 3893540 4143015 4368726 4539114 4673792
-6028D673792J21325J68599J71461K39602L55970M37226M00980L64257L28011L53049M16003
$$ 4673792 4795117 4963716 5135177 5374779 5730749 6167975 6568955 6933212 7261223 7614272 8030275
-6017H030275N51926O49218O99623O44304O49545O70535O68503N44508N45220P11191J087138
$$ 8030275 8582201 9231419 9931042 10575346 11224891 11895426 12563929 13108437 13653657 14364848 15451986
-6006A5451986J592679K204565K782602L391387L858773M204303M484734M937863N431954
$$ 15451986 17044665 19249230 22031832 25423219 29281992 33486295 37971029 42908892 48340846
-5997D8340846N650625N225209N146632O922701J1760115J9450018L0188808M4727323O5900296
$$ 48340846 53991471 59216680 64363312 71286013 83046128 102496146 132684954 177412277 243312573
-5988B43312573R7596564J44018971J96154224K08352020J10565647o1830754j69624821j82943436
$$ 243312573 340909137 484928108 681082332 889434352 999999999 938169245 768544424 585600988
-5980E85600988j53513478j14509535p8635439n1857244l4457187k3133577j5115563q282697
$$ 585600988 432087510 317577975 238942536 187085292 152628105 129494528 114378965 106096268
-5972A06096268j130761O885586J3209575J1134963l105942j6787943j9830714j7012090j3141398
$$ 106096268 104965507 111851093 125060668 136195631 133089689 116301746 96471032 79458942 66317544
-5963F6317544r786006p140038n218761l591496j949951l2716K436306N837720J0525984J6468440
$$ 66317544 56531538 49391500 44172739 40581243 38631292 38598576 41034882 46872602 57398586 73867026
-5953G3867026K0367512J3459771m993491j7834156j8912236j5220856j0885514p041516m072441
$$ 73867026 94234538 107694309 102700818 84866662 65954426 50733570 39848056 32806540 28734099
-5944B8734099j952993l17943J339842L532487O521846R435239Q937335J610370p037178r976278
$$ 28734099 26781106 26463163 27803005 31335492 37857338 47292577 56229912 57840282 50803104 40826826
-5934D0826826q963288o950444n048472l561433k540815j811368j321087r69329p23235n37953
$$ 40826826 31863538 24913094 19864622 16303189 13762374 11951006 10629919 9660590 8937355 8399402
-5924H399402n01704o01861o99149o75546o08773m99591l87034k98330k62080k28103k07115
$$ 8399402 7897698 7295837 6596688 5921142 5312369 4812778 4425744 4127414 3865334 3637231 3430116
-5913C430116j72780j63237j63734j84714k09041k56730k78791k42541j63853p4187P1129
$$ 3430116 3257336 3094099 2930365 2745651 2536610 2279880 2001089 1758548 1594695 1520508 1591637
-5902A591637K06574K65951K10629J20013L7982J0798k556r382m1813p4005r4989q7717j08701
$$ 1591637 1798211 2064162 2274791 2394804 2432786 2443584 2441028 2431646 2389833 2315828 2220839 2133122 2024421
-5889B024421j30162j12994l9018J6305N1359L4189l0m3906o9184j05430j16429j10705n7767
$$ 2024421 1894259 1781265 1742247 1758552 1809911 1844100 1844070 1800164 1730980 1625550 1509121 1398416 1340649
-5876A340649K0448Q4594R0317O5279K9032K825l3418o0011p7175o2157o2152p5391j07819
$$ 1340649 1361097 1445691 1536008 1601287 1630319 1633144 1599726 1539715 1462540 1400383 1338231 1262840 1155021
-5863A155021j32696j46046j29775j16418r7046r4181p4452n3464j0499L3381P2067O9210
$$ 1155021 1022325 876279 746504 630086 533040 438859 364407 310943 300444 333825 405892 475102
-5851D75102N2454K7657J5672r125l3288m2822k5657j9930q250k522K2453L1994M2011L9148
$$ 475102 527556 555213 570885 561760 528472 485650 459993 440063 431813 429291 451744 483738 525749 564897
-5837E64897L6585J5601L618k105j867k2851m9515o6683m3314j4699J4393Q670J040k7576
$$ 564897 601482 617083 620701 618596 616729 593878 544363 477680 434366 419667 434060 442730 443770 416194
-5823D16194n0855o8025n1571l8217l760K4856L7494L1772K2411N243J3350K2888M8881O9866
$$ 416194 365339 297314 245743 207526 203766 228622 266116 297888 320299 325542 338892 361780 410661 480527
-5809D80527Q1311M8881P00o6064j11377j24726o6665J08L7781R170k9301o1728o2924m5751
$$ 480527 561838 610719 611419 545355 433978 309252 242587 242695 280476 289646 260345 198617 135693 89942
-5795H9942j5768o226Q078J0943K8246L1112L7368L4509M0945L1410K7054R889l991k1156
$$ 89942 74174 67948 76026 86969 115215 146327 183695 218204 259149 290559 317613 327502 323511 302355
-5781C02355j8954j6089m467m464n957j9308j6834k6373l1499l1499q965M389J7505J7505
$$ 302355 283401 267312 262845 258381 252424 233116 216282 189909 158410 126911 117946 122335 139840 157345
-5767A57345K7982L7520M2886L3347K8459P474j7564m2364m2726l7002j6733p195l99j7568
$$ 157345 185327 222847 265733 299080 327539 335013 317449 275085 232359 195357 178624 171429 171030 153462
-5753A53462k6272k6271k068J5101L5728M5267N2063K7263K701k2099l2185m1723l6477k3123
$$ 153462 127190 100919 98851 113952 149680 194947 247010 274273 276974 254875 222690 180967 144490 121367
-5739A21367m166J558J1572J1573K6358K6357J5627r174k7057m0412l4212k8489n775L763
$$ 121367 117201 118759 130331 141904 168262 194619 210246 201072 174015 133603 99391 70902 65127 68890
-5725F8890Q056j483k914j6267k2587k2587J260J8428L0113L0114K7549J8012P876n477j5053
$$ 68890 76946 75463 72549 56282 33695 11108 12368 30796 60909 91023 118572 136584 144460 138983 123930
-5710A23930l2218k6618k0892j1297j1293m024J702R435L714K519K523J2832J2836J6886P351
$$ 123930 91712 65094 44202 32905 21612 17588 19290 28725 32439 34958 37481 50313 63149 80035 87386
-5695H7386j494k2475l1302l7020k5102j5559J248O975R743R747R744R746J4453Q733P061
$$ 87386 85892 63417 32115 -4905 -30007 -45566 -44318 -37343 -27600 -17853 -8109 1637 16090 24823 31884
-5680C1884o289r867r862J341J345L726j993O587J2315K1655K1659J6886P351P109P113O275
$$ 31884 25595 15728 5866 7207 8552 12278 10285 16872 29187 50842 72501 89387 96738 103847 110960 117235
-5664A17235N55k552j2087j9722k5441j7217j1491J144J0686J3588P869Q224Q227P627j908
$$ 117235 117790 115238 103151 83429 57988 40771 29280 30424 41110 54698 62567 70791 79018 86645 84737
-5649H4737p396j6931j3797j3794l901l897k917k914m73l331n824j5357p076j349m88o207
$$ 84737 77341 60410 46613 32819 28918 25021 22104 19190 18717 15386 9562 -5795 -12871 -14220 -14708 -20915
-5633b0915m781M762K1539K7266K2136J155j3275j3272m1N686J2105O387M594M598O263l272
$$ -20915 -25696 -20934 605 27871 50007 51162 37887 24615 24574 30260 42365 48752 53346 57944 64207 60935
-5617F0935q998j4717j1107j1107o696o695j1107j1107J889P613O554O552Q939Q939M169r185
$$ 60935 51937 37220 26113 15006 8310 1615 -9492 -20599 -18710 -11097 -4543 2009 10948 19887 24056 14871
-5601A4871j5383j5384j2672l134P240M378N868L007k120P41P016M155M332J472K544l178
$$ 14871 -512 -15896 -28568 -31702 -24462 -20084 -14216 -11209 -13329 -12588 -5572 -1417 2915 4387 6931 3753
-5585C753o814o814N36N40M949M950L935j785j431j427J655J658M277j442o571j6108j3726
$$ 3753 -3061 -9875 -9339 -8799 -3850 1100 5035 3250 1819 392 2047 3705 7982 6540 -31 -16139 -29865
-5568b9865q000j654P888J1461J1465J2890J2896J1223J687M48n273m262j397M143M147P541
$$ -29865 -37865 -39519 -31631 -20170 -8705 4185 17081 28304 29991 30439 25166 20904 19507 23650 27797 35338
-5552C5338J822Q46Q49N437N440J2113J4978J3901Q183R147J2012J8209J2490J4631J7497
$$ 35338 37160 38006 38855 44292 49732 61845 76823 90724 98907 108054 120066 138275 150765 165396 182893
-5537A82893K6973L2699M1645M7372O0721P0264Q4688J09491J45733J97245K49791L01304
$$ 182893 209866 242565 284210 331582 392303 462567 547255 656746 802479 999724 1249515 1550819
-5525A550819L45415L66403L54863L03360K22280J09729k4602j48603k52094l22679l47509
$$ 1550819 1896234 2262637 2617500 2920860 3143140 3252869 3228267 3079664 2827570 2504891 2157382
-5514B157382l37970l09594k65716k13554j62045j15784p5723m6392k9222k7673k7673l0940
$$ 2157382 1819412 1509818 1244102 1030548 868503 752719 676996 630604 601382 573709 546036 515096
-5502E15096l6663m3102m3102m0777l5054k8496j8958r314l592j267J595J2027J7750K4547
$$ 515096 478433 435331 392229 351452 316398 287902 268944 259630 256038 254771 256366 268393 286143 310690
-5488C10690K1685J3030l24j0817k0355k7926k5064k1428j5705q425q424p590j866M571J0295
$$ 310690 332375 345405 345081 334264 313909 285983 260919 239491 223786 215361 206937 199347 197481 202052 212347
-5473B12347P672J949n955j5492j6804j9666j9069j6208j3466p742N66J0105J7259P720n187
$$ 212347 220019 221968 216013 200521 183717 164051 144982 128774 115308 107566 108132 118237 135496 143216 138029
-5458A38029j0909j1327n604m918k057o26l488p392j3115j3414j3413j0328j0329m307m307
$$ 138029 127120 115793 110189 105271 103214 102588 99100 91708 78593 65179 51766 41438 31109 26802 22495
-5443B2495r99l860p854k131J67J68N25N26l976l976l855J867M697M699L625L625J718J718
$$ 22495 21496 17636 9782 7651 7818 7986 8511 9037 5061 1085 -2770 -903 3794 8493 12118 15743 17461 19179
-5425A9179L148L149m073m072r319r318r855r855k880K843M735P598O703L840K470N332J755
$$ 19179 22327 25476 21403 17331 8012 -1306 -11161 -21016 -23896 -21053 -16318 -8720 -2017 1823 4293 9625 11380
-5408A1380p783j3416j3418j2880j0019n906j83K024K023k046k045J114J114L141K79o457
$$ 11380 3597 -9819 -23237 -36117 -46136 -52042 -52225 -50201 -48178 -50224 -52269 -51155 -50041 -46900 -46621 -53078
-5392e3078j2180j1834o106O85J0228J2191J2195N992K72o111o107l130l126k9k7j102j100
$$ -53078 -65258 -77092 -83198 -82513 -72285 -60094 -47899 -41907 -41635 -47746 -53853 -56983 -60109 -60138 -60165 -61267 -62367
-5375f2367J427P154K500K504j494j490N33O259M512M516k284k280k254k251n473K53M229
$$ -62367 -60940 -53786 -51286 -48782 -50276 -51766 -51233 -44974 -40462 -35946 -38230 -40510 -42764 -45015 -50488 -50235 -46006
-5358d6006M229P925P925L603L603k239k239m460J263M244M244l47l47l46l47lmmlo443o442
$$ -46006 -41777 -33852 -25927 -22324 -18721 -20960 -23199 -27659 -26396 -22152 -17908 -18255 -18602 -18948 -19295 -19298 -19302 -19306 -19309 -25752 -32194
-5337c2194p277j553k642k642J01J00j419j420j419j420o185o185j297M427M426M427M91M92
$$ -32194 -39471 -41024 -43666 -46308 -46207 -46107 -47526 -48946 -50365 -51785 -57970 -64155 -65452 -61025 -56599 -52172 -51681 -51189
-5319e1189k608k608n827j05K83K84L979L979K348K347R16R17k929k928k929k928l234l235
$$ -51189 -53797 -56405 -62232 -62337 -62054 -61770 -57791 -53812 -51464 -49117 -48201 -47284 -50213 -53141 -56070 -58998 -62232 -65467
-5301f5467k161L562K042K042r39r39L991L990l02l01p79p79L514L513L387L387r05r06n615
$$ -65467 -67628 -64066 -62024 -59982 -60921 -61860 -57869 -53879 -54181 -54482 -55261 -56040 -52526 -49013 -45626 -42239 -43144 -44050 -49665
-5282d9665n615k873k872m181J543K615K616J662J662k631k630r904r904p876k154k332k333
$$ -49665 -55280 -58153 -61025 -65206 -63663 -61048 -58432 -56770 -55108 -57739 -60369 -70273 -80177 -88053 -90207 -92539 -94872
-5265i4872r02M822K183K187l062l059k228P314K1498K7226J8324Q790l555r274p280m416
$$ -94872 -95774 -90952 -88769 -86582 -89644 -92703 -94931 -87617 -66119 -38893 -20569 -11779 -15334 -24608 -31888 -36304
-5249c6304q42K024j286j282k358N07o4N664J009J014K276n81n533J94L290L294j241j237
$$ -36304 -37146 -35122 -36408 -37690 -40048 -39541 -39605 -33941 -32932 -31918 -29642 -30223 -35756 -35562 -32272 -28978 -30219 -31456
-5231c1456l659K064K184K183r17r16n805n805n194N29O48O49l66l65l65l65O45O44O45O44
$$ -31456 -35115 -33051 -30867 -28684 -29601 -30517 -36322 -42127 -47321 -46792 -46144 -45495 -45861 -46226 -46591 -46956 -46311 -45667 -45022 -44378
-5211d4378p0p1M221M222N235N235L983L983Q454J1315M06n316j2318o591l972l968J751J755
$$ -44378 -44448 -44519 -40298 -36076 -30841 -25606 -21623 -17640 -9186 2129 2535 -2781 -15099 -21690 -25662 -29630 -27879 -26124
-5193b6124J334j524m926Q01J513J516l554o413j1185n458n765k898j61K706P8N805P053P057
$$ -26124 -24790 -26314 -31240 -30439 -28926 -27410 -30964 -37377 -48562 -54020 -59785 -62683 -62844 -60138 -60060 -54255 -47202 -40145
-5175d0145J762J766o22o18n571n566m140m135l730l730K113P835N988N988j763j762m460
$$ -40145 -38383 -36617 -37239 -37857 -43428 -48994 -53134 -57269 -60999 -64729 -62616 -54781 -48793 -42805 -44568 -46330 -50790
-5158e0790m460j68j67M542M542K157K157r05r06K433K433r05r05l290l290l648l648j799
$$ -50790 -55250 -55418 -55585 -51043 -46501 -44344 -42187 -43092 -43998 -41565 -39132 -40037 -40942 -44232 -47522 -51170 -54818 -56617
-5140e6617L923K135p27k097P63J267l498m755J9l73l69j505j501j699j696j401j397n246
$$ -56617 -52694 -50559 -51286 -53383 -52620 -51353 -54851 -59606 -59587 -59960 -60329 -61834 -63335 -65034 -66730 -68131 -69528 -74774
-5122g4774m73L040L044L626L629O010O013j203j200J181J185N11N14l782l778j815j811j814
$$ -74774 -75247 -72207 -69163 -65537 -61908 -55898 -49885 -51088 -52288 -51107 -49922 -49411 -48897 -52679 -56457 -58272 -60083 -61897
-5104f1897j811k72k72k72k72k835k836N03N03j881j882M318M319L931L930J547J546O37O37
$$ -61897 -63708 -63980 -64252 -64524 -64796 -67631 -70467 -69964 -69461 -71342 -73224 -68906 -64587 -60656 -56726 -55179 -53633 -52996 -52359
-5085e2359O37O38M601M602K217K217J747J748j591j591l648l648l648l647k98k98K086K087
$$ -52359 -51722 -51084 -46483 -41881 -39664 -37447 -35700 -33952 -35543 -37134 -40782 -44430 -48078 -51725 -52023 -52321 -50235 -48148
-5067d8148N96N96N96N96m54m55k839k839l7l8J394J393J211J211J211J211j651j650K57k605
$$ -48148 -47552 -46956 -46360 -45764 -46218 -46673 -49512 -52351 -52388 -52426 -51032 -49639 -48428 -47217 -46006 -44795 -46446 -48096 -47839 -50444
-5047e0444n734r65m88m88l350l349J67J68L279O144P217K448K772K776K478K478j580j576
$$ -50444 -56178 -57143 -57631 -58119 -61469 -64818 -64651 -64483 -61204 -55060 -47843 -45395 -42623 -39847 -37369 -34891 -36471 -38047
-5029c8047j576j576m084m080m080m080K109K113K112K113M493M498J158J159j229j226J159
$$ -38047 -39623 -41199 -45283 -49363 -53443 -57523 -55414 -53301 -51189 -49076 -44583 -40085 -38927 -37768 -38997 -40223 -39064
-5012c9064J158m419m415j23j23m057m054M527J669j762L010L007L011j122j118j121j118
$$ -39064 -37906 -42325 -46740 -46863 -46986 -51043 -55097 -50570 -48901 -50663 -47653 -44646 -41635 -42757 -43875 -44996 -46114
-4995d6114k254k251k254k250j450j445j450j445J114J117J114J118K448K452m14m10Q98R02
$$ -46114 -48368 -50619 -52873 -55123 -56573 -58018 -59468 -60913 -59799 -58682 -57568 -56450 -54002 -51550 -51964 -52374 -51476 -50574
-4977e0574J077J080K944N809L182l492k481k478J871J874k09k05l070l066j759j755j759
$$ -50574 -49497 -48417 -45473 -39664 -36482 -39974 -42455 -44933 -43062 -41188 -41397 -41602 -44672 -47738 -49497 -51252 -53011
-4960e3011j755J621J625J620J625K396K399K396K400P71P75l998l994j018j013j017j014
$$ -53011 -54766 -53145 -51520 -49900 -48275 -45879 -43480 -41084 -38684 -37913 -37138 -41136 -45130 -46148 -47161 -48178 -49192
-4943d9192J182J181l588l589n018n019J658J658M251M251M252M251p56p57l618l617j141
$$ -49192 -48010 -46829 -50417 -54006 -59024 -64043 -62385 -60727 -56476 -52225 -47973 -43722 -44478 -45235 -48853 -52470 -53611
-4926e3611j140q42q42K616P385Q458J781k273k273L987L986J72J71m598m597j953j949j952
$$ -53611 -54751 -55593 -56435 -53819 -46434 -37976 -36195 -38468 -40741 -36754 -32768 -32596 -32425 -37023 -41620 -43573 -45522 -47474
-4908d7474j949m992m989k132k127l0k6K832K835o86o81o86o82j785j781J077J081J255J260
$$ -47474 -49423 -54415 -59404 -61536 -63663 -63693 -63719 -60887 -58052 -58738 -59419 -60105 -60787 -62572 -64353 -63276 -62195 -60940 -59680
-4889e9680J255J260N40N44N40N44R58R61P79P82M956K094j12m881n358k496m404m404P67
$$ -59680 -58425 -57165 -56625 -56081 -55541 -54997 -54039 -53078 -52299 -51517 -46561 -44467 -44579 -49460 -54818 -57314 -61718 -66122 -65355
-4870f5355P68P67P68R352R352N895L033J8m750k247k247o122o121j353j352M0M1M1M1M095
$$ -65355 -64587 -63820 -63052 -53700 -44348 -38453 -35420 -35402 -40152 -42399 -44646 -50768 -56889 -58242 -59594 -59554 -59513 -59472 -59431 -55336
-4850e5336M095k582k582j081j080j081j080J244J245J244J245P90P90P89P90n21n22n291
$$ -55336 -51241 -53823 -56405 -57486 -58566 -59647 -60727 -59483 -58238 -56994 -55749 -54959 -54169 -53380 -52590 -53111 -53633 -58924
-4832e8924n291j084j084J777J777n47n48n48n47M43M43L126L126j52l015j404L364M952K090
$$ -58924 -64215 -65299 -66383 -64606 -62829 -63376 -63924 -64472 -65019 -64576 -64133 -61007 -57881 -58033 -61048 -62452 -59088 -54136 -52046
-4813e2046J137J136K567K567K568K567K05K05k657k656j107j107J457J457J114l655r73r72
$$ -52046 -50909 -49773 -47206 -44639 -42071 -39504 -39299 -39094 -41751 -44407 -45514 -46621 -45164 -43707 -42593 -46248 -47221 -48193
-4795d8193K20K20K19K20j188j189j188j189j189j188j189j188q28q27q27q27l927l927j066
$$ -48193 -47973 -47753 -47534 -47314 -48502 -49691 -50879 -52068 -53257 -54445 -55634 -56822 -57650 -58477 -59304 -60131 -64058 -67985 -69051
-4776f9051j066L205L204L43L43M396M397J535J535l35l36l196l197K60K61k600k601Q9R0
$$ -69051 -70117 -66912 -63708 -63365 -63022 -58626 -54229 -52694 -51159 -51494 -51830 -55026 -58223 -57963 -57702 -60302 -62903 -62814 -62724
-4757f2724k772k773N07N07L368L368j050j051j051j050q72q72q72q72K474K474K474K474
$$ -62724 -65496 -68269 -67762 -67255 -63887 -60519 -61569 -62620 -63671 -64721 -65593 -66465 -67337 -68209 -65735 -63261 -60787 -58313
-4739e8313R84R84R83R84O30O29k232k231K72K72K72K71j903j904K865K865P79P79l991l990
$$ -58313 -57329 -56345 -55362 -54378 -53748 -53119 -55351 -57582 -57310 -57038 -56766 -56495 -58398 -60302 -57437 -54572 -53793 -53014 -57005 -60995
-4719f0995l268l268p64p63K127l595j808j807K411K411M914M915M497j226N63N62M74M73
$$ -60995 -64263 -67531 -68295 -69058 -66931 -70526 -72334 -74141 -71730 -69319 -64405 -59490 -54993 -56219 -55656 -55094 -54620 -54147
-4701e4147L692k030m833m832k329k329K142K143L215L216L484k240j881j882R32R31M151
$$ -54147 -50455 -52485 -57318 -62150 -64479 -66808 -64666 -62523 -59308 -56092 -52608 -54848 -56729 -58611 -57679 -56748 -52597
-4684e2597j572k229k228k586k585M016M017P236J512J275J274J274m449m925m926k422k422
$$ -52597 -54169 -56398 -58626 -61212 -63797 -59781 -55764 -48528 -47016 -45741 -44467 -43193 -47642 -52567 -57493 -59915 -62337
-4667f2337J871J870J870J871L122L123L122L122K199K198P68P67n384n384q246q245j598
$$ -62337 -60466 -58596 -56726 -54855 -51733 -48610 -45488 -42366 -40167 -37969 -37201 -36434 -41818 -47202 -55448 -63693 -65291
-4650f5291j599N079N078P187P188J822l901n153n153n511n511k347k347N14N14r17r16r17
$$ -65291 -66890 -61811 -56733 -49546 -42358 -40536 -44437 -49590 -54743 -60254 -65765 -68112 -70459 -69945 -69431 -70348 -71264 -72181
-4632g2181r16r09r10J953J952M605M606L174L175k124k124k124k123R46R46q42K020L301
$$ -72181 -73097 -74006 -74916 -72963 -71011 -66406 -61800 -58626 -55451 -57575 -59699 -61823 -63946 -63000 -62054 -62896 -60876 -57575
-4614e7575M40J930J930K168k600K60K61l685q23o45l506j569J293R36j927J576j285k895
$$ -57575 -57135 -55205 -53275 -51107 -53707 -53447 -53186 -56871 -57694 -58339 -61845 -63414 -62121 -61185 -63112 -61536 -62821 -65716
-4596f5716l4o00o00Q31L693J490J491j193j192J282J281R24L786J952r09P01P00j058l920
$$ -65716 -65750 -66350 -66950 -66119 -62426 -60936 -59445 -60638 -61830 -60548 -59267 -58343 -54557 -52605 -53514 -52813 -52113 -53171 -57091
-4577e7091j058J804O70O71j058n828m396j535p60p61K907M4M516M516n51n52j803m665n33
$$ -57091 -58149 -56345 -55675 -55004 -56062 -61890 -66286 -67821 -68581 -69342 -66435 -66391 -61875 -57359 -57910 -58462 -60265 -64930 -65463
-4558f5463n33Q98j963k083k083K508K507K225K224m58m59k306N55J986J986K530N391K352
$$ -65463 -65996 -65098 -67061 -69144 -71227 -68719 -66212 -63987 -61763 -62221 -62680 -64986 -64431 -62445 -60459 -57929 -52538 -50186
-4540e0186n11r57l820n428k567k091k090R50R50L663L662N094K232m483p340k872k869k277
$$ -50186 -50697 -51654 -55474 -60902 -63469 -65560 -67650 -66700 -65750 -62087 -58425 -53331 -51099 -55582 -62922 -65794 -68663 -70940
-4522g0940N89J658J661L238L80J98L063K254o04m28K436l416l413j807j804L588L592P27
$$ -70940 -70351 -68693 -67032 -63794 -63414 -63216 -60153 -57899 -58503 -58931 -56495 -59911 -63324 -65131 -66935 -63347 -59755 -59028
-4504e9028P30K232K236p49l607j852J014p79p75O3O4k143k142J792M654O024J256n77M191
$$ -59028 -58298 -56066 -53830 -54579 -58186 -60038 -59024 -59803 -60578 -60515 -60451 -62594 -64736 -62944 -58290 -52266 -51010 -51587 -47396
-4485d7396j173j174q46q46N85N85k075k075m460m460q83q83K455K455L901L902J516J516
$$ -47396 -48569 -49743 -50589 -51435 -50850 -50265 -52340 -54415 -58875 -63335 -64218 -65101 -62646 -60191 -56290 -52388 -50872 -49356
-4467d9356J159J159k478k478j151n920l715J054J919r43l029j67K127K128K306K306J31J30
$$ -49356 -48197 -47038 -49516 -51994 -53145 -59065 -62780 -61726 -59807 -60750 -63779 -63946 -61819 -59691 -57385 -55079 -54948 -54818
-4449e4818J31J30K042K042M903J34m32K429N22N22K503K504J073J073j281j282L010L011
$$ -54818 -54687 -54557 -52515 -50473 -45570 -45436 -45868 -43439 -42917 -42395 -39892 -37388 -36315 -35242 -36523 -37805 -34795 -31784
-4431c1784j084j084l469l469n198n198k813k813O30O30J822O591N101j576m378m378l749
$$ -31784 -32868 -33952 -37421 -40890 -46088 -51286 -54099 -56912 -56282 -55652 -53830 -47239 -42138 -43714 -48092 -52470 -56219
-4414e6219J021k31k31j542j543J796J796K846K847j446j445J04J04J05J04l76l77l76l76
$$ -56219 -55198 -55429 -55660 -57202 -58745 -56949 -55153 -52307 -49460 -50906 -52351 -52247 -52143 -52038 -51934 -52310 -52687 -53063 -53439
-4395e3439k254k255J085J084J472J471J472J472J680J681J680J681J609J610J609J610l368
$$ -53439 -55693 -57948 -56863 -55779 -54307 -52836 -51364 -49892 -48212 -46531 -44851 -43170 -41561 -39951 -38342 -36732 -40100
-4378d0100l369l368l368l480l480r17r16m40K422K183m493k57k57o75o74j479j480R06R05
$$ -40100 -43469 -46837 -50205 -53685 -57165 -58082 -58998 -59438 -57016 -54833 -59326 -59583 -59840 -60515 -61189 -62668 -64148 -63242 -62337
-4359f2337K679K679O52O52J427P150R50m772k903k903l140K582q16q16j889j889j428j427
$$ -62337 -59658 -56979 -56327 -55675 -54248 -47098 -46148 -50920 -53823 -56726 -59866 -57284 -58100 -58916 -60805 -62694 -64122 -65549
-4341f5549J912J911J137J136l156l156N26N29J956J960j740j737O45O48J68J71l170l167
$$ -65549 -63637 -61726 -60589 -59453 -62609 -65765 -65239 -64710 -62754 -60794 -62534 -64271 -63626 -62978 -62810 -62639 -65809 -68976
-4323f8976k933k928n48n44p12p08J673J677O3O7K448K452J584J587m44m39k351L375K538
$$ -68976 -71909 -74837 -75385 -75929 -76641 -77349 -75676 -73999 -73936 -73869 -71421 -68969 -67385 -65798 -66242 -66681 -69032 -65657 -63119
-4304f3119K541K519K522l085K642o71o67l13l09k608k605P31P34K429K433R98J003j085j080
$$ -63119 -60578 -58059 -55537 -58622 -55980 -56651 -57318 -57631 -57940 -60548 -63153 -62422 -61688 -59259 -56826 -55828 -54825 -55910 -56990
-4285e6990m423m419P34P38K165K168r35r31r36r31M8N2J480J483L31L32m557m553j368M356
$$ -56990 -61413 -65832 -65098 -64360 -62195 -60027 -60962 -61893 -62829 -63760 -63712 -63660 -62180 -60697 -60366 -60034 -64591 -69144 -70512 -66156
-4265f6156K567K571J092J092J091J096Q53Q53l439l435M5M4M03M02n708J5J088J088q65q64
$$ -66156 -63589 -61018 -59926 -58834 -57743 -56647 -55794 -54941 -58380 -61815 -61770 -61726 -61323 -60921 -66629 -66614 -65526 -64438 -65303 -66167
-4245f6167J520J520j579j580j580j580j420j415l205l42L111K53K53L115L454N96m113m113
$$ -66167 -64647 -63127 -64706 -66286 -67866 -69446 -70866 -72281 -75486 -75828 -72717 -72464 -72211 -69096 -65642 -65046 -69159 -73272
-4227g3272k985j19o56K206L633P71R50L812J75J75j256J606o89o89l372l372n11n10n11n10
$$ -73272 -76257 -76376 -77032 -74826 -71193 -70422 -69472 -65660 -65485 -65310 -66566 -64960 -65649 -66338 -69710 -73082 -73593 -74103 -74614 -75124
-4207g5124j140j141J722J721R47R46K198N060L21L20O78O78k124P38Q2K944N287N18j390
$$ -75124 -76264 -77405 -75683 -73962 -73015 -72069 -69871 -64811 -64490 -64170 -63492 -62814 -64938 -64200 -64118 -61174 -55887 -55369 -56759
-4188e6759j390j688j688l476o15k656n518l372J397j23K738K858K858k444k444k445k444
$$ -56759 -58149 -59837 -61525 -65001 -65616 -68272 -73790 -77162 -75765 -75888 -73150 -70292 -67434 -69878 -72322 -74767 -77211
-4171g7211%%l040j79M933M933K251K250L056L055J94J93m899m900J777J778J240J241j442
$$ -77211 -77211 -77211 -80251 -80430 -75497 -70564 -68313 -66063 -63007 -59952 -59758 -59565 -64464 -69364 -67587 -65809 -64569 -63328 -64770
-4152f4770j442P04L566J777J778J956r06k157k157K850K850k097k098j60l022m452j591Q83
$$ -64770 -66212 -65508 -61942 -60165 -58387 -56431 -57337 -59494 -61651 -58801 -55951 -58048 -60146 -60306 -63328 -67780 -69371 -68488
-4134f8488Q83M221P083r95r94o38o37l513o49o52l509Q38Q42O59O64J553J558j129j125k977
$$ -68488 -67605 -63384 -56301 -57296 -58290 -58928 -59565 -63078 -63727 -64379 -67888 -67050 -66208 -65549 -64885 -63332 -61774 -62903 -64028 -67005
-4114f7005j12L044L048K6L0K6L0J397J401J397J401J412J416j569L205L141j625j628L145
$$ -67005 -67117 -64073 -61025 -60999 -60969 -60943 -60913 -59516 -58115 -56718 -55317 -53905 -52489 -54058 -50853 -47712 -49337 -50965 -47820
-4095d7820j38m907j927j926j151j152j151j151R80R80R79R80K35K35k627k627J584J583J53
$$ -47820 -47958 -52865 -54792 -56718 -57869 -59021 -60172 -61323 -60343 -59363 -58384 -57404 -57169 -56934 -59561 -62188 -60604 -59021 -58868
-4076e8868J53q91q90l752l752j092j092J770J770J591J591j271j270l21l20l20l21J885J886
$$ -58868 -58715 -59606 -60496 -64248 -68000 -69092 -70184 -68414 -66644 -65053 -63462 -64733 -66003 -66324 -66644 -66964 -67285 -65400 -63514
-4057f3514k884k884l219l219J550J550n67n66M203M203j785j781l54l50K537K541l24l20
$$ -63514 -66398 -69282 -72501 -75720 -74170 -72620 -73187 -73753 -69550 -65347 -67132 -68913 -69267 -69617 -67080 -64539 -64863 -65183
-4039f5183j323j319j323j319J151J156k80k76J316J319j547j542o52o49K210K213k20k16
$$ -65183 -66506 -67825 -69148 -70467 -69316 -68160 -68440 -68716 -67400 -66081 -67628 -69170 -69822 -70471 -68261 -66048 -66268 -66484
-4021f6484j650j647j055j050J807J810m32m28j863j859N21N26R98j859j632L141L137L141
$$ -66484 -68134 -69781 -70836 -71886 -70079 -68269 -68701 -69129 -70992 -72851 -72330 -71804 -70806 -72665 -74297 -71156 -68019 -64878
-4003f4878J796J800j066j062r16r17r17r16j006j006j006j006k54k53J177J178J267J266
$$ -64878 -63082 -61282 -62348 -63410 -64326 -65243 -66160 -67076 -68082 -69088 -70094 -71100 -71354 -71607 -70430 -69252 -67985 -66719
-3985f6719l323l324j378J483j27j27q42q42K020K019L450L451j498j498j379m240K31K31
$$ -66719 -70042 -73366 -74744 -73261 -73388 -73515 -74357 -75199 -73179 -71160 -67710 -64259 -65757 -67255 -68634 -72874 -72643 -72412
-3967g2412k6k2k05k01L3k824j397j394J919r39O67O71M88M92M88M92P93P98P93P98J568J573
$$ -72412 -72438 -72460 -72665 -72866 -72833 -75657 -77054 -78448 -76529 -77468 -76801 -76130 -75642 -75150 -74662 -74170 -73377 -72579 -71786 -70988 -69420 -67847
-3945f7847l320o178k306N59J449J453J390j468J38J41M85M88J557M423K094p64j841j836
$$ -67847 -71167 -77345 -79651 -79092 -77643 -76190 -74800 -76268 -76130 -75989 -75504 -75016 -73459 -69036 -66942 -67706 -69547 -71383
-3927g1383J527J532l242l238J766J770J766J770R7J00R7J01q2p8J527j330J684J688J506
$$ -71383 -69856 -68324 -71566 -74804 -73038 -71268 -69502 -67732 -67635 -67535 -67438 -67337 -67419 -67497 -65970 -67300 -65616 -63928 -62422
-3908f2422J509k489k486J983q76J174J177k57l115J30J35J30k727m118m113M73M77J785J788
$$ -62422 -60913 -63402 -65888 -63905 -64781 -63607 -62430 -62687 -65802 -65672 -65537 -65407 -68134 -72252 -76365 -75892 -75415 -73630 -71842
-3889g1842L216L219K351K351J934J934L871k806n548n548l550o90L84L84J695j166j166J695
$$ -71842 -68626 -65407 -63056 -60705 -58771 -56837 -52966 -55772 -61320 -66868 -70418 -71108 -70724 -70340 -68645 -69811 -70977 -69282
-3871f9282J271J270j412j412j681j680k50k49R28R27q60K000J495j368K42K42J029j830k23
$$ -69282 -68011 -66741 -68153 -69565 -71246 -72926 -73176 -73425 -72497 -71570 -72430 -70430 -68935 -70303 -70061 -69819 -68790 -70620 -70843
-3852g0843k20J386J390l204l201l577p12K445m14j878K895M322J465J371j487j490j487r84
$$ -70843 -71063 -69677 -68287 -71491 -74692 -78269 -78981 -76536 -76950 -78828 -75933 -71611 -70146 -68775 -70262 -71752 -73239 -74223
-3834g4223r80K69K72J5k843k489k485m33K433N291K433j8j9K843j9k105k105N78N77o97o96
$$ -74223 -75203 -74934 -74662 -74647 -77490 -79979 -82464 -82897 -80464 -75173 -72740 -72758 -72777 -69934 -69953 -72058 -74163 -73585 -73008 -73705 -74401
-3813g4401P34P34R12R13o96o97l91l253j643j643j197j196J666J665M356M356L282M21n182
$$ -74401 -73667 -72933 -72021 -71108 -71804 -72501 -72892 -76145 -77788 -79431 -80628 -81824 -80158 -78493 -74137 -69781 -66499 -66078 -71260
-3794g1260k322K389K388K571k91l152k91L644L644M002J140k504k503j252j252j342j341
$$ -71260 -73582 -71193 -68805 -66234 -66525 -69677 -69968 -66324 -62680 -58678 -57538 -60042 -62545 -63797 -65049 -66391 -67732
-3777f7732j162m025k869k868j87j86M315M314J453J453K206K206r54l815j669j670q94J967
$$ -67732 -68894 -72919 -75788 -78656 -78843 -79029 -74714 -70400 -68947 -67494 -65288 -63082 -64036 -67851 -69520 -71190 -72084 -70117
-3759g0117L026j740j744j740J237J241J237J241q95q90J967J971k98k94k98k95k436k433
$$ -70117 -67091 -68831 -70575 -72315 -71078 -69837 -68600 -67359 -68254 -69144 -67177 -65206 -65504 -65798 -66096 -66391 -68827 -71260
-3741g1260M24M29K273K276J021j837N29N33L50L54j56j53l018l014L707L711J323J326l595
$$ -71260 -70836 -70407 -68134 -65858 -64837 -66674 -66145 -65612 -65262 -64908 -65064 -65217 -68235 -71249 -67542 -63831 -62508 -61182 -64777
-3722f4777l592k57k54K419K421j874j870J583J588j815J051L856j863q53q50l16l13l17l13
$$ -64777 -68369 -68626 -68880 -66461 -64040 -65914 -67784 -66201 -64613 -66428 -65377 -61521 -63384 -64237 -65087 -65403 -65716 -66033 -66346
-3703f6346P1P4P1P5j629j624j628j625K258K262j27j23o63o60K676K679P15P19P15P20J520
$$ -66346 -66275 -66201 -66130 -66055 -67684 -69308 -70936 -72561 -70303 -68041 -68168 -68291 -68954 -69614 -66938 -64259 -63544 -62825 -62110 -61390 -59870
-3682e9870J524J520J524j923j919j922j919p01o96p01o97q79q76k310k306p30p27J297J300
$$ -59870 -58346 -56826 -55302 -57225 -59144 -61066 -62985 -63686 -64382 -65083 -65780 -66659 -67535 -69845 -72151 -72881 -73608 -72311 -71011
-3663g1011M412j312k086P75J371J371J550J550p45p45p46p45O56O56O55O56j900j900m70
$$ -71011 -66599 -67911 -69997 -69222 -67851 -66480 -64930 -63380 -64125 -64870 -65616 -66361 -65705 -65049 -64394 -63738 -65638 -67538 -68008
-3644f8008m69J468J468r17r16j185j185M061M062J468J468r17r17l50l46l51l46Q12Q16Q12
$$ -68008 -68477 -67009 -65541 -66458 -67374 -68559 -69744 -65683 -61621 -60153 -58685 -59602 -60519 -60869 -61215 -61566 -61912 -61100 -60284 -59472
-3624e9472Q16j289j285j289j286m031m028j408M318M456j263k638K27P5P8j773j770j565
$$ -59472 -58656 -59945 -61230 -62519 -63805 -67836 -71864 -73272 -68954 -64498 -65761 -68399 -68172 -68097 -68019 -69792 -71562 -73127
-3606g3127M162M158j561k042k038k400k396K747K746n93n92j457j457j457j457J271J270
$$ -73127 -68965 -64807 -66368 -68410 -70448 -72848 -75244 -72497 -69751 -70344 -70936 -72393 -73850 -75307 -76764 -75493 -74223
-3589g4223J271J271K075K075j263j263p8p8p9p8q53q53q54q53M125M124P87P86p34p34j748
$$ -74223 -72952 -71681 -69606 -67531 -68794 -70057 -70135 -70213 -70292 -70370 -71223 -72076 -72930 -73783 -69658 -65534 -64747 -63961 -64695 -65429 -67177
-3568f7177L976L621P61L42L43k131k131p01p00j357j356j356j356K667K668q49q50j826m687
$$ -67177 -63201 -59580 -58819 -58477 -58134 -60265 -62396 -63097 -63797 -65154 -66510 -67866 -69222 -66555 -63887 -64736 -65586 -67412 -72099
-3549g2099k183L539L21k541K2K884K049q12j408j409K91K90K91K91L707L707L588k135N78
$$ -72099 -74282 -70743 -70422 -72963 -72941 -70057 -68008 -68820 -70228 -71637 -71346 -71056 -70765 -70474 -66767 -63060 -59472 -61607 -61029
-3530f1029N78j211j211K64K65l074l074r28r28r27r28O3O4O3O3P49P49P49P49J531J532q54
$$ -61029 -60451 -61662 -62873 -62609 -62344 -65418 -68492 -69420 -70348 -71275 -72203 -72140 -72076 -72013 -71950 -71201 -70452 -69703 -68954 -67423 -65891 -66745
-3508f6745q53K366K366K366K366q61q57N70N74j665j662P19P23m66m62j896j893m96m91J889
$$ -66745 -67598 -65232 -62866 -60500 -58134 -58995 -59852 -59282 -58708 -60373 -62035 -61316 -60593 -61059 -61521 -63417 -65310 -65806 -66297 -64408
-3488f4408J892M66M70M65M70k128k124k127k124J613J618J613J617J434J439J434J438j062
$$ -64408 -62516 -62050 -61580 -61115 -60645 -62773 -64897 -67024 -69148 -67535 -65917 -64304 -62687 -61253 -59814 -58380 -56942 -58004
-3470e8004j058l923l920k314k310k314k310J845J848J844J848J845J848J844J848K299K303
$$ -58004 -59062 -62985 -66905 -69219 -71529 -73843 -76153 -74308 -72460 -70616 -68768 -66923 -65075 -63231 -61383 -59084 -56781
-3453e6781K299K302j755j751j755j751r95r91r95r91Q53Q57Q54Q56j058j058j595M129J94
$$ -56781 -54482 -52180 -53935 -55686 -57441 -59192 -60187 -61178 -62173 -63164 -62311 -61454 -60600 -59744 -60802 -61860 -63455 -59326 -59132
-3434e9132k668p01p00J326J327J326J327l384l383l383l383k601k601K169K168M017M017
$$ -59132 -61800 -62501 -63201 -61875 -60548 -59222 -57895 -61279 -64662 -68045 -71428 -74029 -76630 -74461 -72293 -68276 -64259
-3417f4259J155J155J281J282j222j222m978P45K176o85k355N10J580J584K68K72k593k590
$$ -64259 -63104 -61949 -60668 -59386 -60608 -61830 -66808 -66063 -63887 -64572 -66927 -66417 -64837 -63253 -62985 -62713 -65306 -67896
-3399f7896m10m06m10m06n89n85n88n85O48O52O48O52J692J695L123L126R7J00m672m669k436
$$ -67896 -68306 -68712 -69122 -69528 -70117 -70702 -71290 -71875 -71227 -70575 -69927 -69275 -67583 -65888 -62765 -59639 -59542 -59442 -64114 -68783 -71219
-3378g1219k434k794K932L164L167L163L167P19n000k500L227j070o788J672M539J315j543
$$ -71219 -73653 -76447 -73515 -70351 -67184 -64021 -60854 -60135 -65135 -67635 -64408 -65478 -72266 -70594 -66055 -64740 -66283
-3361f6283K43K46K984K988K985K988j16j11j16j12k530k526k530k526R3R7R3R7k23k24k23
$$ -66283 -66040 -65794 -62810 -59822 -56837 -53849 -53965 -54076 -54192 -54304 -56834 -59360 -61890 -64416 -64323 -64226 -64133 -64036 -64259 -64483 -64706
-3340f4706k24J833J833k936k936P45P46K176K175Q95Q94Q94Q94L879L879J017J017m139m140
$$ -64706 -64930 -63097 -61264 -64200 -67136 -66391 -65645 -63469 -61294 -60399 -59505 -58611 -57717 -53838 -49959 -48942 -47925 -52064 -56204
-3321e6204k709k708m66m66m66m65j9j9j8j9r91r87r91r88m25m21J006J010n36n33n37M237
$$ -56204 -58913 -61621 -62087 -62553 -63019 -63484 -63503 -63522 -63540 -63559 -64550 -65537 -66528 -67516 -67941 -68362 -67356 -66346 -66882 -67415 -67952 -63715
-3299f3715O26k232j938R28k023k020j844j841k142k139j308N373K210o49j486j483J017J021
$$ -63715 -63089 -65321 -67259 -66331 -68354 -70374 -72218 -74059 -76201 -78340 -79648 -74275 -72065 -72714 -74200 -75683 -74666 -73645
-3281g3645K448K452K824K828J393J398N805N808O640R505P117M43j349o114r576o710l853
$$ -73645 -71197 -68745 -65921 -63093 -61700 -60302 -54497 -48689 -42049 -32544 -25427 -24984 -26333 -32447 -42023 -48733 -52586
-3264e2586l849k481k478k482k477n15n10n14n11M47M51M47M51R0R3Q9R3k030k031m713N6
$$ -52586 -56435 -58916 -61394 -63876 -66353 -66868 -67378 -67892 -68403 -67956 -67505 -67058 -66607 -66517 -66424 -66335 -66242 -68272 -70303 -75016 -74960
-3243g4960K530K530J397J397l141l141J628J628N26N25N26N25P19P19P19P19j75j75K687
$$ -74960 -72430 -69900 -68503 -67106 -70247 -73388 -71760 -70132 -69606 -69081 -68555 -68030 -67311 -66592 -65873 -65154 -65329 -65504 -62817
-3224f2817K686J315J316J315J315K806K805q90n660k198K571m10m10o19o18k049k050m702
$$ -62817 -60131 -58816 -57500 -56185 -54870 -52064 -49259 -50149 -55809 -58007 -55436 -55846 -56256 -56875 -57493 -59542 -61592 -66294
-3206f6294m702k616K154K213K213R02R02n29l391n29K333J86J86L406N44j141j140J722J721
$$ -66294 -70996 -73612 -71458 -69245 -67032 -66130 -65228 -65757 -69148 -69677 -67344 -67158 -66972 -63566 -63022 -64163 -65303 -63581 -61860
-3187f1860j408J453J453j408k191k187M91M96J386J390m03K463K415m44l249l245j938R28
$$ -61860 -63268 -61815 -60362 -61770 -63961 -66148 -65657 -65161 -63775 -62385 -62788 -60325 -57910 -58354 -61603 -64848 -66786 -65858
-3169f5858o85o82J431J434l338l335j669j666L100L104Q34Q39K444m14k384k381k564k559
$$ -65858 -66543 -67225 -65794 -64360 -67698 -71033 -72702 -74368 -71268 -68164 -67330 -66491 -64047 -64461 -66845 -69226 -71790 -74349
-3151g4349j424j419j72K694J975J979p08p05j386j382J475J480O41O44k221k216M068M073
$$ -74349 -75773 -77192 -77364 -74670 -72695 -70716 -71424 -72129 -73515 -74897 -73422 -71942 -71301 -70657 -72878 -75094 -71026 -66953
-3133f6953p01o96J982J986N51N55m99m96j751L022K064K068J110j747r20r17j397j394K13
$$ -66953 -67654 -68350 -66368 -64382 -63831 -63276 -63775 -64271 -66022 -63000 -60936 -58868 -57758 -59505 -60425 -61342 -62739 -64133 -63920
-3114f3920m553j875j870Q68Q72j695j692j099L674Q08Q13J471j386j390J476L99M02L99M02
$$ -63920 -68473 -70348 -72218 -71350 -70478 -72173 -73865 -74964 -71290 -70482 -69669 -68198 -69584 -70974 -69498 -69099 -68697 -68298 -67896
-3095f7896j002l860k254k251J144J147J144J148N81N85N81N85j34j30j34j31r68r65r69r65
$$ -67896 -68898 -72758 -75012 -77263 -76119 -74972 -73828 -72680 -72099 -71514 -70933 -70348 -70482 -70612 -70746 -70877 -71845 -72810 -73779 -74744
-3075g4744J94J97J625J628J594J599j267j263k072k068P90P94J833J837j028j025K24K27
$$ -74744 -74550 -74353 -72728 -71100 -69506 -67907 -69174 -70437 -72509 -74577 -73787 -72993 -71160 -69323 -70351 -71376 -71152 -70925
-3057g0925K23K28j971j968Q91Q94q38q35K023K027K307K310n55n52j867j863j866j863N25
$$ -70925 -70702 -70474 -72445 -74413 -73522 -72628 -73466 -74301 -72278 -70251 -67944 -65634 -66189 -66741 -68608 -70471 -72337 -74200 -73675
-3038g3675N29N26N29j263j260J599J602J494J498j368j363J136J140j725j721J483J483j379
$$ -73675 -73146 -72620 -72091 -73354 -74614 -73015 -71413 -69919 -68421 -69789 -71152 -70016 -68876 -70601 -72322 -70839 -69356 -70735
-3020g0735j379P68P67R47R46j080J781L748j975l644K079J12k750K3K2j56j57L80L80L80
$$ -70735 -72114 -71346 -70579 -69632 -68686 -69766 -67985 -64237 -66212 -69856 -67777 -67665 -70415 -70392 -70370 -70526 -70683 -70303 -69923 -69543
-3000f9543L80K273K273n89n88k914k914L763L764R68R73j889j889k277k276N85N84L58L62
$$ -69543 -69163 -66890 -64617 -65206 -65794 -68708 -71622 -67859 -64095 -63127 -62154 -64043 -65932 -68209 -70485 -69900 -69316 -68958 -68596
-2981f8596j070j069J405J404J405J405L7L7k824k821K124K128L35L39K742k980j193j188
$$ -68596 -69666 -70735 -69330 -67926 -66521 -65116 -65079 -65042 -67866 -70687 -68563 -66435 -66100 -65761 -63019 -65999 -67192 -68380
-2963f8380q35q31q34q31r17r16r17r17m39m40K422K425J983J982K340l383m03m02p60p57
$$ -68380 -69215 -70046 -70880 -71711 -72628 -73544 -74461 -75378 -75817 -76257 -73835 -71410 -69427 -67445 -65105 -68488 -68891 -69293 -70053 -70810
-2943g0810k653k649k653k649M203M207n63n62K384K389K384K388L816L819k858k858j047
$$ -70810 -73463 -76112 -78765 -81414 -77211 -73004 -73567 -74129 -71745 -69356 -66972 -64584 -60768 -56949 -59807 -62665 -63712
-2926f3712j047j047j043j53j52j53j49M1M1M1M4K963K962J00J05q28q27q27q23k199k198
$$ -63712 -64759 -65806 -66849 -67002 -67154 -67307 -67456 -67415 -67374 -67333 -67289 -64326 -61364 -61264 -61159 -61987 -62814 -63641 -64464 -66663 -68861
-2905f8861O63O67L06L05k556k552j12j12j11j08L916L919k399k400j330M397J177J178O96
$$ -68861 -68198 -67531 -67225 -66920 -69476 -72028 -72140 -72252 -72363 -72471 -68555 -64636 -67035 -69435 -70765 -66368 -65191 -64013 -63317
-2886f3317P01m069m069k343k340N21N22N70N74k288k288j337j334j334j334M296M300L942
$$ -63317 -62616 -66685 -70754 -73097 -75437 -74916 -74394 -73824 -73250 -75538 -77826 -79163 -80497 -81831 -83165 -78869 -74569 -70627
-2868g0627L942K925k795k436k437n2m9n2m8K749K754j12j08k571k567K198K202j021j017
$$ -70627 -66685 -63760 -66555 -68991 -71428 -71480 -71529 -71581 -71629 -68880 -66126 -66238 -66346 -68917 -71484 -69286 -67084 -68105 -69122
-2849f9122j021j017J368J371J367J371j196j192j196j192K05K08L067L070N62N67N62N67
$$ -69122 -70143 -71160 -69792 -68421 -67054 -65683 -66879 -68071 -69267 -70459 -70254 -70046 -66979 -63909 -63347 -62780 -62218 -61651
-2831f1651l137l134l670K053K049q08J158J159j252j248j248j248N9O4k95k94L961j759j49
$$ -61651 -64788 -67922 -71592 -69539 -67490 -68298 -67140 -65981 -67233 -68481 -69729 -70977 -70918 -70854 -71149 -71443 -67482 -69241 -69390
-2812f9390K712P42P45R24R24p64p60p60p60k373k370k370k369n78n78K284K288K284K284
$$ -69390 -66678 -65936 -65191 -64267 -63343 -64107 -64867 -65627 -66387 -68760 -71130 -73500 -75869 -76447 -77025 -74741 -72453 -70169 -67885
-2793f7885n77n74J75J75J75J79j82j83j83j78J788J788j073j069N37N36N37N40o26o26o26
$$ -67885 -68462 -69036 -68861 -68686 -68511 -68332 -68514 -68697 -68880 -69058 -67270 -65482 -66555 -67624 -67087 -66551 -66014 -65474 -66100 -66726 -67352
-2772f7352o22k09k08k09k05J38J41k723k720M36M39M36M40R87R91R88R91L91L95L91L95n47
$$ -67352 -67974 -68183 -68391 -68600 -68805 -68667 -68526 -71249 -73969 -73533 -73094 -72658 -72218 -71231 -70240 -69252 -68261 -67870 -67475 -67084 -66689 -67236
-2750f7236n44n48n44N25N29N26N29LQMPq31q27q31q27Q53Q54Q53Q57j234j233j233j230k202
$$ -67236 -67780 -68328 -68872 -68347 -67818 -67292 -66763 -66760 -66752 -66748 -66741 -67572 -68399 -69230 -70057 -69204 -68350 -67497 -66640 -67874 -69107 -70340 -71570 -73772
-2726g3772k202Q39Q42J613M475L223k497j408j408j767j762J632J632l137l134K31K31N000
$$ -73772 -75974 -75135 -74293 -72680 -68205 -64982 -67479 -68887 -70295 -72062 -73824 -72192 -70560 -73697 -76831 -76600 -76369 -71369
-2708g1369N004k332k332N29N32m47m43m43m44J520J524J703J703j178J688k20k19J475l290
$$ -71369 -66365 -68697 -71029 -70500 -69968 -70415 -70858 -71301 -71745 -70225 -68701 -66998 -65295 -66473 -64785 -65005 -65224 -63749 -67039
-2689f7039k038k038K90K95k567k568j110j106l4K828L510O52m21m21j707j702k061Q01K061
$$ -67039 -69077 -71115 -70825 -70530 -73097 -75665 -76775 -77881 -77915 -75087 -71577 -70925 -71346 -71767 -73474 -75176 -77237 -76436 -74375
-2670g4375p98R88R91k95k90K388K392K426m32j688j684J00J05J00J04m80m77K381K384j792
$$ -74375 -75173 -74185 -73194 -73489 -73779 -71391 -68999 -66573 -67005 -68693 -70377 -70277 -70172 -70072 -69968 -70448 -70925 -68544 -66160 -67952
-2650f7952j788l223l58n33K333K507l50O00O04M21M24n18n17n18n15J092J092K701j56m36
$$ -67952 -69740 -72963 -73321 -73854 -71521 -69014 -69364 -68764 -68160 -67739 -67315 -67833 -68350 -68868 -69383 -68291 -67199 -64498 -64654 -65090
-2630f5090m36o15o11J174J173j688j684K247K247p94p90K426m36J174J177l208l208j956
$$ -65090 -65526 -66141 -66752 -65578 -64405 -66093 -67777 -65530 -63283 -64077 -64867 -62441 -62877 -61703 -60526 -63734 -66942 -68898
-2612f8898R09l76l77J234J237l0k6J762j099j192J673J494j368j587j584l372n10J930J934
$$ -68898 -67989 -68365 -68742 -67508 -66271 -66301 -66327 -64565 -65664 -66856 -65183 -63689 -65057 -66644 -68228 -71600 -72110 -70180 -68246
-2593f8246p49p49q31q27K034K035R87R91k61l122k20k16j826j825O14O19r91J870P23P23
$$ -68246 -68995 -69744 -70575 -71402 -69368 -67333 -66346 -65355 -65616 -68738 -68958 -69174 -71000 -72825 -72211 -71592 -72583 -70713 -69990 -69267
-2573f9267K332K337k884k884J885J889J751J752j111j106j141j140k272k270k116K653l28
$$ -69267 -66935 -64598 -67482 -70366 -68481 -66592 -64841 -63089 -64200 -65306 -66447 -67587 -69859 -72129 -74245 -71592 -71920
-2556g1920l24J908k862j788J076J282J282J460J465o26o26o26o22O96O97m072m069Q46Q45
$$ -71920 -72244 -70336 -73198 -74986 -73910 -72628 -71346 -69886 -68421 -69047 -69673 -70299 -70921 -70225 -69528 -73600 -77669 -76823 -75978
-2537g5978L708L711O97O96p34p30k612k612K50K53O63O64k199k194j662j662J200J204K749
$$ -75978 -72270 -68559 -67862 -67166 -67900 -68630 -71242 -73854 -73604 -73351 -72688 -72024 -74223 -76417 -78079 -79741 -78541 -77337 -74588
-2518g4588K750K750K753J558J557J558J561k780k776Q2Q6K467K470k303k299R32R35R32R35
$$ -74588 -71838 -69088 -66335 -64777 -63220 -61662 -60101 -62881 -65657 -65575 -65489 -63022 -60552 -62855 -65154 -64222 -63287 -62355 -61420
-2499f1420j811j807j811j807Q12Q12k049k045k31k31J199J204J557J558j304m162l570J200
$$ -61420 -63231 -65038 -66849 -68656 -67844 -67032 -69081 -71126 -71357 -71588 -70389 -69185 -67628 -66070 -67374 -71536 -75106 -73906
-2481g3906J200J203K687K690J256J259n03m99n03n00J256J259J256J259L02L06L163L167
$$ -73906 -72706 -71503 -68816 -66126 -64870 -63611 -64114 -64613 -65116 -65616 -64360 -63101 -61845 -60586 -60284 -59978 -56815 -53648
-2463e3648l431l428J341J341j762j759j758j759j345j341j342j341j703j699j699j699J047
$$ -53648 -57079 -60507 -59166 -57825 -59587 -61346 -63104 -64863 -66208 -67549 -68891 -70232 -71935 -73634 -75333 -77032 -75985
-2446g5985J051J050J051m43m40m40m39Q98R01L764O624K687k079k079k079J006J009J010
$$ -75985 -74934 -73884 -72833 -73276 -73716 -74156 -74595 -73697 -72796 -69032 -62408 -59721 -61800 -63879 -65958 -64952 -63943 -62933
-2428f2933J010p23p19p19p19Q86Q91Q90Q91M69M74k389k388J896J901qK854L506j259j259
$$ -62933 -61923 -62646 -63365 -64084 -64803 -63917 -63026 -62136 -61245 -60776 -60302 -62691 -65079 -63183 -61282 -61290 -58436 -54930 -56189 -57448
-2408e7448j260m393m389j527j528Q53Q57Q57Q57Q98R02R01R02l54l50K511K511j620j617
$$ -57448 -58708 -63101 -67490 -69017 -70545 -69692 -68835 -67978 -67121 -66223 -65321 -64420 -63518 -63872 -64222 -61711 -59200 -60820 -62437
-2389f2437j617j618p0o7o7o8J696J699j163j162o30o26o26o26M06M10M10M10o67o63o63o64
$$ -62437 -64054 -65672 -65742 -65809 -65876 -65944 -64248 -62549 -63712 -64874 -65504 -66130 -66756 -67382 -66976 -66566 -66156 -65746 -66413 -67076 -67739 -68403
-2367f8403M92M92M92M92K101K102p61p60N3N2N2N2J900J900r61r61K023K027q35q34n41n36
$$ -68403 -67911 -67419 -66927 -66435 -64334 -62232 -62993 -63753 -63700 -63648 -63596 -63544 -61644 -59744 -60705 -61666 -59643 -57616 -58451 -59285 -59826 -60362
-2345f0362l398l398j308j304m166O04K090p67J140J140m32m29m32m28m33m28m32m29o48o45
$$ -60362 -63760 -67158 -68466 -69770 -73936 -73332 -71242 -72009 -70869 -69729 -70161 -70590 -71022 -71450 -71883 -72311 -72743 -73172 -73820 -74465
-2325g4465o48o45N44N48L406L409R83R88j874j874O85O89k172k172k012k008k009k008J505
$$ -74465 -75113 -75758 -75214 -74666 -71260 -67851 -66868 -65880 -67754 -69628 -68943 -68254 -70426 -72598 -74610 -76618 -78627 -80635 -79130
-2306g9130J509J509J509J301J304J304J304m88m85m84m84k05k01k02k01Q68Q72Q72Q72j94
$$ -79130 -77621 -76112 -74603 -73302 -71998 -70694 -69390 -69878 -70363 -70847 -71331 -71536 -71737 -71939 -72140 -71272 -70400 -69528 -68656 -68850
-2286f8850j94j93j90N21N22j982j979o155m32L025L029l72l73l72l69K630K631k31k27j72
$$ -68850 -69044 -69237 -69427 -68906 -68384 -70366 -72345 -78500 -78932 -75907 -72878 -73250 -73623 -73995 -74364 -71734 -69103 -69334 -69561 -69733
-2266f9733j71j72j67qpqlP67P68k094k091O53O52O52O52j23j23j23j23k65k64k65k64J524
$$ -69733 -69904 -70076 -70243 -70251 -70258 -70266 -70269 -69502 -68734 -70828 -72919 -72266 -71614 -70962 -70310 -70433 -70556 -70679 -70802 -71067 -71331 -71596 -71860 -70336
-2242g0336J523j337j338k254k254O07O08j778j777J084J084J234J233l536l536K485K486
$$ -70336 -68813 -70150 -71488 -73742 -75996 -75389 -74781 -76559 -78336 -77252 -76168 -74934 -73701 -77237 -80773 -78288 -75802
-2225g5802K127K128N194n26k079k075J855J860j006j003n9n6o0n6j073j069j073j070J822
$$ -75802 -73675 -71547 -66353 -66879 -68958 -71033 -69178 -67318 -68324 -69327 -69386 -69442 -69502 -69558 -70631 -71700 -72773 -73843 -72021
-2206g2021J826J822J826k05k01k05k01k083k079k083k079n6n2n6n2R31R32R31R35J767J766
$$ -72021 -70195 -68373 -66547 -66752 -66953 -67158 -67359 -69442 -71521 -73604 -75683 -75739 -75791 -75847 -75899 -74968 -74036 -73105 -72170 -70403 -68637
-2185f8637J766J770l66l65l65l61qpqlL91L91L91L95k619k619j189j185L089L089K27K31
$$ -68637 -66871 -65101 -65467 -65832 -66197 -66558 -66566 -66573 -66581 -66584 -66193 -65802 -65411 -65016 -67635 -70254 -71443 -72628 -69539 -66450 -66223 -65992
-2163f5992k604k605K165K168K642K642k20l078m124O44K553K556k202k202p72p67J315J315
$$ -65992 -68596 -71201 -69036 -66868 -64226 -61584 -61804 -64882 -69006 -68362 -65809 -63253 -65455 -67657 -68429 -69196 -67881 -66566
-2145f6566J316J318l24l24J107J110N40N41m229m226k112k113K657K660J703J703J702J707
$$ -66566 -65250 -63932 -64256 -64580 -63473 -62363 -61823 -61282 -65511 -69737 -71849 -73962 -71305 -68645 -66942 -65239 -63537 -61830
-2127f1830n55n55n56n55m06m06j837j837N40N41L402L401j695j695J166J166j114j114j114
$$ -61830 -62385 -62940 -63496 -64051 -64457 -64863 -66700 -68537 -67997 -67456 -64054 -60653 -62348 -64043 -62877 -61711 -62825 -63939 -65053
-2108f5053j114r35r36j114j114J219j643k895J874L185L25k240O22J606J610k985k980o90
$$ -65053 -66167 -67102 -68038 -69152 -70266 -69047 -70690 -73585 -71711 -68526 -68201 -70441 -69819 -68213 -66603 -69588 -72568 -73258
-2090g3258o85P41P46J456J461M139o25j972j967N93N96Q94Q98Q94Q98r54r50r54r50K191
$$ -73258 -73943 -73202 -72456 -71000 -69539 -65400 -66025 -67997 -69964 -69371 -68775 -67881 -66983 -66089 -65191 -66145 -67095 -68049 -68999 -66808
-2070f6808K195K191K194j028j025j028j025q31q27k437M25q01p97k050k049K72K76J349M210
$$ -66808 -64613 -62422 -60228 -61256 -62281 -63309 -64334 -65165 -65992 -68429 -68004 -68805 -69602 -71652 -73701 -73429 -73153 -71804 -67594
-2051f7594J047j811l063k01K813K817J34J34k284k280k101k102j30K735K734j26l10l05m84
$$ -67594 -66547 -68358 -71421 -71622 -68809 -65992 -65858 -65724 -68008 -70288 -72389 -74491 -74621 -71886 -69152 -69278 -69588 -69893 -70377
-2032g0377m85K001K005P49k109J23J26K806n2J561j297j479J386j330j326J710J714J404
$$ -70377 -70862 -68861 -66856 -66107 -68216 -68093 -67967 -65161 -65213 -63652 -64949 -66428 -65042 -66372 -67698 -65988 -64274 -62870
-2014f2870J409L014J57l663l659k768R7O96k161l76l73j747j744l059L622M445k232k530
$$ -62870 -61461 -58447 -58290 -61953 -65612 -68380 -68283 -67587 -69748 -70124 -70497 -72244 -73988 -77047 -73425 -68980 -71212 -73742
-1996g3742L32O89O89Q68Q69L24L24L24L24O82O82O82O82o60o59l62l61k567K202J129j733
$$ -73742 -73410 -72721 -72032 -71164 -70295 -69971 -69647 -69323 -68999 -68317 -67635 -66953 -66271 -66931 -67590 -67952 -68313 -70880 -68678 -67549 -69282
-1975f9282k873k872j264L507N831J062m363m364j639J222K474K478l726l726Q64Q69L904
$$ -69282 -72155 -75027 -76291 -72784 -66953 -65891 -70254 -74618 -76257 -75035 -72561 -70083 -73809 -77535 -76671 -75802 -71898
-1958g1898J044K474K477m47l308j699j696O23O26O26O25O23O26O26O26M28M32M32M33J30
$$ -71898 -70854 -68380 -65903 -66350 -69658 -71357 -73053 -72430 -71804 -71178 -70553 -69930 -69304 -68678 -68052 -67624 -67192 -66760 -66327 -66197
-1938f6197J34J34J35J687J692j289m151j531J334K228K228j01k958j349j349L47L50k511
$$ -66197 -66063 -65929 -65794 -64107 -62415 -63704 -67855 -69386 -68052 -65824 -63596 -63697 -66655 -68004 -69353 -69006 -68656 -71167
-1920g1167k512J066J066K496K500r7r7j885R80K243o18K600k57K16k645n507k642N48L409
$$ -71167 -73679 -72613 -71547 -69051 -66551 -66648 -66745 -68630 -67650 -65407 -66025 -63425 -63682 -63466 -66111 -71618 -74260 -73712 -70303
-1901g0303q83q83p8p8J352J353J330J330m58K403J658j204l767l766m453K224J152J151K046
$$ -70303 -71186 -72069 -72147 -72225 -70873 -69520 -68190 -66860 -67318 -64915 -63257 -64461 -68228 -71994 -76447 -74223 -73071 -71920 -69874
-1882f9874q16m59l320m95m96L797R35M88M89k553k552K262K265Q31Q35Q30Q35K262K265k455
$$ -69874 -70690 -71149 -74469 -74964 -75460 -71663 -70728 -70240 -69751 -72304 -74856 -72594 -70329 -69498 -68663 -67833 -66998 -64736 -62471 -64926
-1862f4926k452N85N89N25L391N25k332m29m25Q24Q27j293j289k724k720n33n29Q98R02P19
$$ -64926 -67378 -66793 -66204 -65679 -62288 -61763 -64095 -64524 -64949 -64125 -63298 -64591 -65880 -68604 -71324 -71857 -72386 -71488 -70586 -69867
-1842f9867P23K329n29l596l592o11K251M58M62L43L42J047l718j036j036J167J169R92R91
$$ -69867 -69144 -66815 -67344 -70940 -74532 -75143 -72892 -72434 -71972 -71629 -71287 -70240 -73958 -74994 -76030 -74863 -73694 -72702 -71711
-1823g1711M95k362k362M99M06M10k273k273J569J572K825K824M967K108Q57Q57k723k724
$$ -71711 -71216 -73578 -75940 -75441 -75035 -74625 -76898 -79171 -77602 -76030 -73205 -70381 -65414 -63306 -62449 -61592 -64315 -67039
-1805f7039m154m155J241J241M102M102J725J725j136j136k359k358r28r28l376l375J393
$$ -67039 -71193 -75348 -74107 -72866 -68764 -64662 -62937 -61212 -62348 -63484 -65843 -68201 -69129 -70057 -73433 -76808 -75415
-1788g5415J394J184J185J543m181j781j781K631K630J707J706J707J706Q76Q79n55n51L469
$$ -75415 -74021 -72837 -71652 -70109 -74290 -76071 -77852 -75221 -72591 -70884 -69178 -67471 -65765 -64889 -64010 -64565 -65116 -61647
-1770f1647L472O07O11m474m472K95K98K798K802j971j967l234l231l69l69L73L76J629J628
$$ -61647 -58175 -57568 -56957 -61431 -65903 -65608 -65310 -62512 -59710 -61681 -63648 -66882 -70113 -70482 -70851 -70478 -70102 -68473 -66845
-1751f6845J177j680l886J837N261m274m631J091k6k2L31L36k05k01N10n209k947K780N279
$$ -66845 -65668 -67348 -71234 -69397 -64136 -68410 -73041 -71950 -71976 -71998 -71667 -71331 -71536 -71737 -71227 -76436 -79383 -76603 -71324
-1732g1324m39o23o18K418m40l700K024J844j014j82K679K500l58K471K470n70n66l313l312
$$ -71324 -71763 -72386 -73004 -70586 -71026 -74726 -72702 -70858 -71872 -72054 -69375 -66875 -67233 -64762 -62292 -62862 -63428 -66741 -70053
-1713g0053m51m47j49j49j49j49N96N96L458L457l13l13j743j744k549k548k549k548P90P89
$$ -70053 -70504 -70951 -71100 -71249 -71398 -71547 -70951 -70355 -66897 -63440 -63753 -64066 -65809 -67553 -70102 -72650 -75199 -77747 -76957 -76168
-1693g6168P90P90J863J863J863J863j311j312j311j312k087k086P75P75l84l84l83l80M206
$$ -76168 -75378 -74588 -72725 -70862 -68999 -67136 -68447 -69759 -71070 -72382 -74469 -76555 -75780 -75005 -75389 -75773 -76156 -76536 -72330
-1674g2330M207J345J349L31L32k530k526p42p41p42p37M95M96M95N00j293j293j293j289
$$ -72330 -68123 -66778 -65429 -65098 -64766 -67296 -69822 -70564 -71305 -72047 -72784 -72289 -71793 -71298 -70798 -72091 -73384 -74677 -75966
-1655g5966L39L39L39L43K49K50k27K638M046p23k630k631l35l36l35l35J781J781j081j080
$$ -75966 -75627 -75288 -74949 -74606 -74357 -74107 -74334 -71696 -67650 -68373 -71003 -73634 -73969 -74305 -74640 -74975 -73194 -71413 -72494 -73574
-1635g3574j170j170J691J692J319J319j12j12k049k049j871K899R0Q9L249L249k057k056
$$ -73574 -74744 -75914 -74223 -72531 -71212 -69893 -70005 -70117 -72166 -74215 -76086 -73187 -73097 -73008 -69759 -66510 -68567 -70623
-1617g0623Q04Q05K69K68K68K72O0N9J491J494J371J371j490j487k891k892k9k6O70O71k191
$$ -70623 -69819 -69014 -68745 -68477 -68209 -67937 -67877 -67818 -66327 -64833 -63462 -62091 -63581 -65068 -67959 -70851 -70880 -70906 -70236 -69565 -71756
-1596g1756k187r09r09N21N26J743J744l025l022N81N81N82N85j852j848j852j848L424L428
$$ -71756 -73943 -74852 -75761 -75240 -74714 -72971 -71227 -74252 -77274 -76693 -76112 -75530 -74945 -76797 -78645 -80497 -82345 -78921 -75493
-1577g5493J993J997j881j878R80L845M765%l%j487j483J375J379J673J676l096l093o66o64
$$ -75493 -73500 -71503 -73384 -75262 -74282 -70437 -65672 -65672 -65675 -65675 -67162 -68645 -67270 -65891 -64218 -62542 -65638 -68731 -69397 -70061
-1557g0061l69l65k276K496K672k094l663q01M51L312M21M21J852M713l16l17j569j568r43
$$ -70061 -70430 -70795 -73071 -70575 -67903 -69997 -73660 -74461 -74010 -70698 -70277 -69856 -68004 -63291 -63607 -63924 -65493 -67061 -68004
-1538f8004r43r42r43m06m06k195O67R65j896k791J978O75O74K761j00O74L536j114j114O93
$$ -68004 -68947 -69889 -70832 -71238 -71644 -73839 -73172 -72207 -74103 -76894 -74916 -74241 -73567 -70806 -70906 -70232 -66696 -67810 -68924 -68231
-1518f8231O93O93O97p08p08P23P26k899k899L600L603K198o63l704q38L100K38k742k738
$$ -68231 -67538 -66845 -66148 -66856 -67564 -66841 -66115 -69014 -71913 -68313 -64710 -62512 -63175 -66879 -67717 -64617 -64379 -67121 -69859
-1499f9859O85O86l607p42Q72L734Q72Q75J468J468L8M1Q23Q27k336k333J957k810j740J125
$$ -69859 -69174 -68488 -72095 -72837 -71965 -68231 -67359 -66484 -65016 -63548 -63510 -63469 -62646 -61819 -64155 -66488 -64531 -67341 -69081 -67956
-1479f7956L99M03o75o71o44K221o45l502J93J94J5J9L42L43J297M162K951j819l249J524
$$ -67956 -67557 -67154 -67829 -68500 -69144 -66923 -67568 -71070 -70877 -70683 -70668 -70649 -70307 -69964 -68667 -64505 -61554 -63373 -66622 -65098
-1459f5098K772q9L87L92m59m58m58m58j860j859j859j859mmmlmmmlP26P27P26P31k553k552
$$ -65098 -62326 -62415 -62028 -61636 -62095 -62553 -63011 -63469 -65329 -67188 -69047 -70906 -70910 -70914 -70918 -70921 -70925 -70929 -70933 -70936 -70210 -69483 -68757 -68026 -70579 -73131
-1433g3131M29L293K664j97r73r68m609J60K426K429r32J934L186j584n879l015k060k060
$$ -73131 -72702 -69409 -66745 -66942 -67915 -68883 -73492 -73332 -70906 -68477 -69409 -67475 -64289 -65873 -71752 -74767 -76827 -78887
-1415g8887J125J129L990L991K90K95K94K94n88n85n85n85n89n85n85n85R69R72R73R72J863
$$ -78887 -77762 -76633 -72643 -68652 -68362 -68067 -67773 -67479 -68067 -68652 -69237 -69822 -70411 -70996 -71581 -72166 -71197 -70225 -69252 -68280 -66417
-1394f6417J867J688l082m322m318K057K060J103J107J103J106M40M43M40M43M40M43M40M43
$$ -66417 -64550 -62862 -65944 -70266 -74584 -72527 -70467 -69364 -68257 -67154 -66048 -65608 -65165 -64725 -64282 -63842 -63399 -62959 -62516
-1375f2516j870j867j870j867L95L99L95L98l87l84l87l84n67n62n67n62J1J5K876K877K276
$$ -62516 -64386 -66253 -68123 -69990 -69595 -69196 -68801 -68403 -68790 -69174 -69561 -69945 -70512 -71074 -71641 -72203 -72192 -72177 -69301 -66424 -64148
-1354f4148K281n82n81l46l43l43l43J204J207J207J207j292j290J573J572k79k76l137l138
$$ -64148 -61867 -62449 -63030 -63376 -63719 -64062 -64405 -63201 -61994 -60787 -59580 -60872 -62162 -60589 -59017 -59296 -59572 -62709 -65847
-1335f5847J38J42L003L003n77n74n74n74j155j151m136O37L078j688j274j271j796K977L272
$$ -65847 -65709 -65567 -62564 -59561 -60138 -60712 -61286 -61860 -63015 -64166 -68302 -67665 -64587 -66275 -67549 -68820 -70616 -67639 -64367
-1316f4367j495l584J189J065J070j319j316j319j315J602J606J602J606P83P86O03O08j900
$$ -64367 -65862 -69446 -68257 -67192 -66122 -67441 -68757 -70076 -71391 -69789 -68183 -66581 -64975 -64192 -63406 -62803 -62195 -64095
-1298f4095m758n656q84Q24L689L983J125M66M69K87K91J8K3j055l912l141k76K523K526J930
$$ -64095 -68853 -74509 -75393 -74569 -70880 -66897 -65772 -65306 -64837 -64550 -64259 -64241 -64218 -65273 -69185 -72326 -72602 -70079 -67553 -65623
-1278f5623r28k004k001n74K291O79O81p00o97p00o97P30P34l43l200K20L081K903M1j271
$$ -65623 -66551 -68555 -70556 -71130 -68839 -68160 -67479 -68179 -68876 -69576 -70273 -69543 -68809 -69152 -72352 -72132 -69051 -66148 -66107 -67378
-1258f7378j271l76K485L521O60m14m13k977k977k799k798o22K239K240o23L32L32J52J53
$$ -67378 -68649 -69025 -66540 -63019 -62359 -62773 -63186 -66163 -69140 -71939 -74737 -75359 -73120 -70880 -71503 -71171 -70839 -70687 -70534
-1239g0534l99l98l99l99J927J926Q53k008k396M66L268L271j859m721M8K914r95r95q16q12
$$ -70534 -70933 -71331 -71730 -72129 -70202 -68276 -67423 -69431 -71827 -71361 -68093 -64822 -66681 -71402 -71354 -68440 -69435 -70430 -71246 -72058
-1219g2058j531j532m58K407M915K053R80R83J874J875k597K68o22o23o22o18Q08k053m43
$$ -72058 -73589 -75121 -75579 -73172 -68257 -66204 -65224 -64241 -62367 -60492 -63089 -62821 -63443 -64066 -64688 -65306 -64498 -66551 -66994
-1200f6994m40q87q86p08p05j423J438j71j68K653K653n634k768K116K117K295K299J19J19
$$ -66994 -67434 -68321 -69207 -69915 -70620 -72043 -70605 -70776 -70944 -68291 -65638 -71272 -74040 -71924 -69807 -67512 -65213 -65094 -64975
-1181f4975J19J23n36n37k146P19o55o56k98k95K564N425r54r50j096j091j092j092K899K903
$$ -64975 -64856 -64733 -65269 -65806 -67952 -67233 -67888 -68544 -68842 -69137 -66573 -61148 -62102 -63052 -64148 -65239 -66331 -67423 -64524 -61621
-1161f1621M1M1m613m609j748j747N44N48q83q84J122J121J68k694l98M370J330l439l76l76
$$ -61621 -61580 -61539 -66152 -70761 -72509 -74256 -73712 -73164 -74047 -74931 -73809 -72688 -72520 -75214 -75612 -71242 -69912 -73351 -73727 -74103
-1141g4103K187K187j032j032J829J830j725j726J137J136J53J53j278j278p94p94p93p94
$$ -74103 -71916 -69729 -70761 -71793 -69964 -68134 -69859 -71585 -70448 -69312 -69159 -69006 -70284 -71562 -72356 -73150 -73943 -74737
-1123g4737J740J740j121j122K80K83L145L144j8j5j5j5k210k205O55O56J546J550J550J550
$$ -74737 -72997 -71257 -72378 -73500 -73220 -72937 -69792 -66648 -66666 -66681 -66696 -66711 -68921 -71126 -70471 -69815 -68269 -66719 -65169 -63619
-1103f3619k302k303k124k123k541L20J692l078K019O789J721l047K526K526o33o34j542j543
$$ -63619 -65921 -68224 -70348 -72471 -75012 -74692 -73000 -76078 -74059 -67270 -65549 -68596 -66070 -63544 -64177 -64811 -66353 -67896
-1085f7896J86J87k377K392K392k378n14n14O19O18K01K02k661k660j159j159K72K76r80r80
$$ -67896 -67710 -67523 -69900 -67508 -65116 -67494 -68008 -68522 -67903 -67285 -67084 -66882 -69543 -72203 -73362 -74521 -74249 -73973 -74953 -75933
-1065g5933L789L794m74m73j904j900J077J077l54l51o70o71o71o67P90P90P90P94J356J356
$$ -75933 -72144 -68350 -68824 -69297 -71201 -73101 -72024 -70947 -71301 -71652 -72322 -72993 -73664 -74331 -73541 -72751 -71961 -71167 -69811 -68455
-1045f8455J356J360j505j505J356J360k20k16l081l078l09l06j740j736K314K317n47n44
$$ -68455 -67099 -65739 -67244 -68749 -67393 -66033 -66253 -66469 -69550 -72628 -72937 -73243 -74983 -76719 -74405 -72088 -72635 -73179
-1027g3179m1l8K821K824l09l09l10l09m88m88K373K374j233j234J629J628o08o07l469l469
$$ -73179 -73220 -73258 -70437 -67613 -67922 -68231 -68541 -68850 -69338 -69826 -67453 -65079 -66312 -67546 -65917 -64289 -64897 -65504 -68973 -72442
-1007g2442K02K05J635J636J006J010j852j852J453J457j405j404M69M73J904J904k638k638
$$ -72442 -72240 -72035 -70400 -68764 -67758 -66748 -68600 -70452 -68999 -67542 -68947 -70351 -69882 -69409 -67505 -65601 -68239 -70877
-989g0877K24K27k23k24k24k19K325K325K325K328K98K99K98L01q23q20q23q20k57k53J173
$$ -70877 -70653 -70426 -70649 -70873 -71097 -71316 -68991 -66666 -64341 -62013 -61715 -61416 -61118 -60817 -61640 -62460 -63283 -64103 -64360 -64613 -63440
-968f3440J178l387l383J382J386K724K727j38j34o382o379K202K206M43M47k418k415O67
$$ -63440 -62262 -65649 -69032 -67650 -66264 -63540 -60813 -60951 -61085 -67467 -73846 -71644 -69438 -68995 -68548 -70966 -73381 -72714
-950g2714O71K098K101J412J416j449j446k064k064k064k065k16k16k16k12J930J930J930
$$ -72714 -72043 -69945 -67844 -66432 -65016 -66465 -67911 -69975 -72039 -74103 -76168 -76384 -76600 -76816 -77028 -75098 -73168 -71238
-932g1238J930K01K01K02K04p11p12M058M057n03n03j933j931P42P41N511N511l62l61l223
$$ -71238 -69308 -69107 -68906 -68704 -68500 -69211 -69923 -65865 -61808 -62311 -62814 -64747 -66678 -65936 -65195 -59684 -54173 -54535 -54896 -58119
-912e8119l219j588j587J275J274j051j051l912l908J102J103J103J103Q65Q64j997j994J357
$$ -58119 -61338 -62926 -64513 -63238 -61964 -63015 -64066 -67978 -71886 -70784 -69681 -68578 -67475 -66610 -65746 -67743 -69737 -68380
-894f8380J356J356J356j445j446J416J420k907k906m5m4J93J94J94J97J27J27J26J27n89
$$ -68380 -67024 -65668 -64312 -65757 -67203 -65787 -64367 -67274 -70180 -70225 -70269 -70076 -69882 -69688 -69491 -69364 -69237 -69111 -68984 -69573
-874f9573n88n89n89J230J229J230J230m40m40m39m40j613j614j613j613J009J010J010J009
$$ -69573 -70161 -70750 -71339 -70109 -68880 -67650 -66420 -66860 -67300 -67739 -68179 -69792 -71406 -73019 -74632 -73623 -72613 -71603 -70594
-855g0594p04p04p04p04k314k314N48N47K739K742K743K742J248J252J252J252j427j423j424
$$ -70594 -71298 -72002 -72706 -73410 -75724 -78038 -77490 -76943 -74204 -71462 -68719 -65977 -64729 -63477 -62225 -60973 -62400 -63823 -65247
-836f5247j423N40N44k139k138j077J788L160j610m21M352L160K98l752q87J86J87n33n29
$$ -65247 -66670 -66130 -65586 -67725 -69863 -70940 -69152 -65992 -67602 -68023 -63671 -60511 -60213 -63965 -64852 -64666 -64479 -65012 -65541
-817f5541n29n29J039J044J039J043o29o26o30o26j166j163q68q64j107L666K590k68o37o34
$$ -65541 -66070 -66599 -65560 -64516 -63477 -62434 -63063 -63689 -64319 -64945 -66111 -67274 -68142 -69006 -70113 -66447 -63857 -64125 -64762 -65396
-797f5396q16q12L536L540j234j229r36r31r35r32J271J274j591j587q65q60K001K000o85
$$ -65396 -66212 -67024 -63488 -59948 -61182 -62411 -63347 -64278 -65213 -66145 -64874 -63600 -65191 -66778 -67643 -68503 -66502 -64502 -65187
-778f5187o82o82o82J461J464j397j397r84r80r80r80L10L13L12L13j836j834j833j833J472
$$ -65187 -65869 -66551 -67233 -65772 -64308 -65705 -67102 -68086 -69066 -70046 -71026 -70716 -70403 -70091 -69778 -71614 -73448 -75281 -77114 -75642
-758g5642J475J476J475L439L443j326j327j554j553j554j554N93N92L454L454R50R50R50
$$ -75642 -74167 -72691 -71216 -67777 -64334 -65660 -66987 -68541 -70094 -71648 -73202 -72609 -72017 -68563 -65109 -64159 -63209 -62259
-740f2259R51l62l61l62l61m173m173j312j311L398L398N36N37j088j088J773J774j624j625
$$ -62259 -61308 -61670 -62031 -62393 -62754 -66927 -71100 -72412 -73723 -70325 -66927 -66391 -65854 -66942 -68030 -66257 -64483 -66107 -67732
-721f7732J237J237j606j606j606j605p12p12p11p12J554J553J554J554n93n92n93n92N85
$$ -67732 -66495 -65258 -66864 -68470 -70076 -71681 -72393 -73105 -73816 -74528 -72974 -71421 -69867 -68313 -68906 -69498 -70091 -70683 -70098
-702g0098N85N85N85K195K194o67o67q68q68q68q68j763j762j762j763M73M77M73M77j494
$$ -70098 -69513 -68928 -68343 -66148 -63954 -64621 -65288 -66156 -67024 -67892 -68760 -70523 -72285 -74047 -75810 -75337 -74860 -74387 -73910 -75404
-682g5404j490J367J371n5n3n5n3M81M84L343L345k257k255K512K515n29n26l390l387k735
$$ -75404 -76894 -75527 -74156 -74211 -74264 -74319 -74372 -73891 -73407 -70064 -66719 -68976 -71231 -68719 -66204 -66733 -67259 -70649 -74036 -76771
-662g6771k731k735k731R61R65R61R65L451L454N88N93p53p49O78O82Q50Q53Q49Q54j237j234
$$ -76771 -79502 -82237 -84968 -84007 -83042 -82081 -81116 -77665 -74211 -73623 -73030 -73783 -74532 -73854 -73172 -72322 -71469 -70620 -69766 -71003 -72237
-641g2237J94J98P45P49k117k112n96n93n96n92J080J084L942L946O34O37K064K068M195M196
$$ -72237 -72043 -71845 -71100 -70351 -72468 -74580 -75176 -75769 -76365 -76957 -75877 -74793 -70851 -66905 -66271 -65634 -63570 -61502 -57307 -53111
-621e3111J334J333m180m181m180m181j915j915R46R47J453J453K884K884L894L893J032J032
$$ -53111 -51777 -50444 -54624 -58805 -62985 -67166 -69081 -70996 -70050 -69103 -67650 -66197 -63313 -60429 -56535 -52642 -51610 -50578
-603e0578N831N832P738J7278K3685L3224N1109O8278O1363J3670m2129o3114n3877m0524
$$ -50578 -44747 -38915 -31177 -13899 9786 43010 94119 162397 223760 237430 195301 132187 78310 37786
-589C7786k6693j7153j4501q779o632o632m516m516l085l085k280k281N82N81J643J643j218
$$ 37786 11093 -6060 -20561 -29340 -35972 -42604 -47120 -51636 -54721 -57806 -60086 -62367 -61785 -61204 -59561 -57918 -59136
-572e9136j219k440k441k440k441N70N71J643J643K478l246r20l782j088M639K668K671j058
$$ -59136 -60355 -62795 -65236 -67676 -70117 -69547 -68976 -67333 -65690 -63212 -66458 -67378 -71160 -72248 -67609 -64941 -62270 -63328
-554f3328j054j059j054N66N70N67N70O56O59O56O59m65m62R65R68k57k53K604K609N32N37
$$ -63328 -64382 -65441 -66495 -65929 -65359 -64792 -64222 -63566 -62907 -62251 -61592 -62057 -62519 -61554 -60586 -60843 -61096 -58492 -55883 -55351 -54814
-533e4814N33N36m117m113O52O55k071k072k071k072M02M03j029j028k489k489L73L72L43
$$ -54814 -54281 -53745 -57862 -61975 -61323 -60668 -62739 -64811 -66882 -68954 -68552 -68149 -69178 -70206 -72695 -75184 -74811 -74439 -74096
-514g4096L43L43L42R43R43R42R43o37o37l499l499L387L387M639j30K135K135M06M06O30
$$ -74096 -73753 -73410 -73068 -72125 -71182 -70240 -69297 -69934 -70571 -74070 -77569 -74182 -70795 -66156 -66286 -64151 -62016 -61610 -61204 -60574
-494f0574O33k228k228K269K273n89n89k723k720J41J42j31j26j558j557Q6Q5Q6Q6q09q08
$$ -60574 -59941 -62169 -64397 -62128 -59855 -60444 -61033 -63756 -66476 -66335 -66193 -66324 -66450 -68008 -69565 -69479 -69394 -69308 -69222 -70031 -70839
-473g0839k061K709L327L327J539l230q76q75j174j174L88L91L91L91L0L4L3L4k39k34k35
$$ -70839 -72900 -70191 -66864 -63537 -61998 -65228 -66104 -66979 -68153 -69327 -68939 -68548 -68157 -67766 -67736 -67702 -67669 -67635 -67874 -68108 -68343
-452f8343k35J19J23J23J23K20K24K20K23k224k221k224k221q83q79q83L889K277n81j08j05
$$ -68343 -68578 -68459 -68336 -68213 -68090 -67870 -67646 -67426 -67203 -69427 -71648 -73872 -76093 -76976 -77855 -78738 -74849 -72572 -73153 -73261 -73366
-431g3366r31r28k362k359K169K172L599L603k377k373r47r42M84M88M85M88J00J05J00J04
$$ -73366 -74297 -75225 -77587 -79946 -77777 -75605 -72006 -68403 -70780 -73153 -74100 -75042 -74558 -74070 -73585 -73097 -72997 -72892 -72792 -72688
-411g2688J085J088l47l43R06R09j956j953J711J714J710J714j040j036j039j036l84l80l066
$$ -72688 -71603 -70515 -70862 -71205 -70299 -69390 -71346 -73299 -71588 -69874 -68164 -66450 -67490 -68526 -69565 -70601 -70985 -71365 -74431
-392g4431J706K322K325K619K623j554j550j554j550P5P8P5P8k191k187k191k187J177J182
$$ -74431 -72725 -70403 -68078 -65459 -62836 -64390 -65940 -67494 -69044 -68969 -68891 -68816 -68738 -70929 -73116 -75307 -77494 -76317 -75135
-373g5135J177J181m32m29m32m28L543L547j226j222q08q05q09q04J844J848J844J848k448
$$ -75135 -73958 -72777 -73209 -73638 -74070 -74498 -70955 -67408 -68634 -69856 -70664 -71469 -72278 -73082 -71238 -69390 -67546 -65698 -68146
-354f8146k444M14M17K340K344n22n18k83k80n81n77K205k559j669J196J669j189j848j844
$$ -68146 -70590 -70176 -69759 -67419 -65075 -65597 -66115 -66398 -66678 -67259 -67836 -65631 -68190 -69859 -68663 -66994 -68183 -70031 -71875
-335g1875k497M185M359k314n119k255O64O67j170J695K944j822l257l91l95l253j624L148
$$ -71875 -74372 -70187 -65828 -68142 -73261 -75516 -74852 -74185 -75355 -73660 -70716 -72538 -75795 -76186 -76581 -79834 -81458 -78310
-317g8310N827J062j34j30m486K194K847j919J177J182k042k038k161K612R79l785q09L965
$$ -78310 -72483 -71421 -71555 -71685 -76171 -73977 -71130 -73049 -71872 -70690 -72732 -74770 -76931 -74319 -73340 -77125 -77934 -73969
-299g3969K709j50j52K712J859k906k910k906r43r39J919J923J457J457J456J457l31l32l32
$$ -73969 -71260 -71410 -71562 -68850 -66991 -69897 -72807 -75713 -76656 -77595 -75676 -73753 -72296 -70839 -69383 -67926 -68257 -68589 -68921
-280f8921l31M13M14k448k448k42k42K619K619M1M1m728m728K306K307K306K306L84L84L84
$$ -68921 -69252 -68839 -68425 -70873 -73321 -73563 -73805 -71186 -68567 -68526 -68485 -73213 -77941 -75635 -73328 -71022 -68716 -68332 -67948 -67564
-260f7564L83m50m51m51m51r31r28r32r27K049K053q12q09J893J896r68r65J714J717j147
$$ -67564 -67181 -67631 -68082 -68533 -68984 -69915 -70843 -71775 -72702 -70653 -68600 -69412 -70221 -68328 -66432 -67400 -68365 -66651 -64934 -66081
-240f6081j144P23P26P23P27j066j062J796J800j223j218j222j218R83R88R83R88j204j200
$$ -66081 -67225 -66502 -65776 -65053 -64326 -65392 -66454 -64658 -62858 -64081 -65299 -66521 -67739 -66756 -65768 -64785 -63797 -65001 -66201
-221f6201j203j200k455k452M06M10J181J185J181J185J002J006J003J006j744j740j744j740
$$ -66201 -67404 -68604 -71059 -73511 -73105 -72695 -71514 -70329 -69148 -67963 -66961 -65955 -64952 -63946 -65690 -67430 -69174 -70914
-203g0914J476J479J475J479n06n03n07n03L28L31L28L32K01K05K01K05J036J040j826j822
$$ -70914 -69438 -67959 -66484 -65005 -65511 -66014 -66521 -67024 -66696 -66365 -66037 -65705 -65504 -65299 -65098 -64893 -63857 -62817 -64643 -66465
-183f6465m143m140O26O30L28L31L190L193j878j874j878j874j401j398j400j398L36L39N104
$$ -66465 -70608 -74748 -74122 -73492 -73164 -72833 -69643 -66450 -68328 -70202 -72080 -73954 -75355 -76753 -78153 -79551 -79215 -78876 -73772
-164g3772N109r77r72J885J889O86O89O86O89M47M51M47M51k362k359M99N03l614l610J155
$$ -73772 -68663 -69640 -70612 -68727 -66838 -66152 -65463 -64777 -64088 -63641 -63190 -62743 -62292 -64654 -67013 -66514 -66011 -69625 -73235 -72080
-144g2080J159P19P19L580L581j904j904j904j904J681J680J680J681l387l387n25n26M36
$$ -72080 -70921 -70202 -69483 -65903 -62322 -64226 -66130 -68034 -69938 -68257 -66577 -64897 -63216 -66603 -69990 -70515 -71041 -70605
-126g0605M36M36M36n18n18n18n18q83q83j240M482J710J710p93p94j1pJ419J423j084j080
$$ -70605 -70169 -69733 -69297 -69815 -70333 -70851 -71369 -72252 -73135 -74375 -69893 -68183 -66473 -67266 -68060 -68071 -68078 -66659 -65236 -66320 -67400
-105f7400J777J781k046k041o15o11J263J267j599j595O23O26n817q9M438j282n70n66l492
$$ -67400 -65623 -63842 -65888 -67929 -68544 -69155 -67892 -66625 -68224 -69819 -69196 -68570 -74387 -74476 -70038 -71320 -71890 -72456 -75948
-86g5948l487L185L190L186L189j584j579j524j524J337J338K321K322K679l045j851j852
$$ -75948 -79435 -76250 -73060 -69874 -66685 -68269 -69848 -71372 -72896 -71559 -70221 -67900 -65578 -62899 -65944 -67795 -69647
-69f9647p79p79K05K05K05K05L190L189j580j580q34q35q34q35K61K61J691J692J572J572
$$ -69647 -70426 -71205 -71000 -70795 -70590 -70385 -67195 -64006 -65586 -67166 -68000 -68835 -69669 -70504 -70243 -69982 -68291 -66599 -65027 -63455
-49f3455j289j289L28L28j103j103l87l88l87l88m69m70R61R62K600K601k61k60j737j736
$$ -63455 -64744 -66033 -65705 -65377 -66480 -67583 -67970 -68358 -68745 -69133 -69602 -70072 -69111 -68149 -65549 -62948 -63209 -63469 -65206 -66942
-29f6942j736j737j26j27j27j26j148j148j147j148J356J357J356J356l84l83l84l84J405
$$ -66942 -68678 -70415 -70541 -70668 -70795 -70921 -72069 -73217 -74364 -75512 -74156 -72799 -71443 -70087 -70471 -70854 -71238 -71622 -70217
-10g0217J404j456j457k105k106P57P56r72r73L499L499P49m021k947q6J703J703r80r80L148
$$ -70217 -68813 -70269 -71726 -73831 -75937 -75180 -74424 -75396 -76369 -72870 -69371 -68622 -72643 -75590 -75676 -73973 -72270 -73250 -74230 -71082
9g1082L149L148L149r36r35k366k366j408j409J454J453J155J155K705k064j640L130l0m799
$$ -71082 -67933 -64785 -61636 -62572 -63507 -65873 -68239 -69647 -71056 -69602 -68149 -66994 -65839 -63134 -65198 -66838 -63708 -63738 -68537
28f8537r54r53N36N306j9m788J055J054n55n55n55n55J300J300o07K254K195k575m184j323
$$ -68537 -69491 -70444 -69908 -64602 -64621 -69409 -68354 -67300 -67855 -68410 -68965 -69520 -68220 -66920 -67527 -65273 -63078 -65653 -69837 -71160
48g1160J304J308j379j374J274J278K705K709o64o59o63o60j885j882j885j882R32R35R32
$$ -71160 -69856 -68548 -69927 -71301 -70027 -68749 -66044 -63335 -63999 -64658 -65321 -65981 -67866 -69748 -71633 -73515 -72583 -71648 -70716
67g0716R35R7J00R7J01j066j062j065j062J110J114J110J114j78j79j610j609M322M322K414
$$ -70716 -69781 -69684 -69584 -69487 -69386 -70452 -71514 -72579 -73641 -72531 -71417 -70307 -69193 -69371 -69550 -71160 -72769 -68447 -64125 -61711
87f1711k355j699J163p45p46M48M47M47M47p68p63p68p64O7P1O7P1K466K471K466K471j945
$$ -61711 -64066 -65765 -64602 -65347 -66093 -65645 -65198 -64751 -64304 -65072 -65835 -66603 -67367 -67300 -67229 -67162 -67091 -64625 -62154 -59688 -57217 -59162
109e9162j942j944j942o78o74q57q53J348j509R7J01p23p19r02q98J751j106j110J754J927
$$ -59162 -61104 -63048 -64990 -65668 -66342 -67199 -68052 -66704 -68213 -68116 -68015 -68738 -69457 -70359 -71257 -69506 -70612 -71722 -69968 -68041
129f8041J926j233j233q76q76q75q76M222M221P04P05O14k246O14O15j904m762k500K273O89
$$ -68041 -66115 -67348 -68581 -69457 -70333 -71208 -72084 -67862 -63641 -62937 -62232 -61618 -63864 -63250 -62635 -64539 -69301 -71801 -69528 -68839
149f8839O93Q09Q12K284n74j352j349p26p23Q83j975j207j204j386j382O71O74r39J926o11
$$ -68839 -68146 -67337 -66525 -64241 -64815 -66167 -67516 -68242 -68965 -68082 -70057 -71264 -72468 -73854 -75236 -74565 -73891 -74830 -72904 -73515
169g3515o07p90K075L056J97m02l99j032j032L99L98K307K306J651l119k016k015K813m9r72
$$ -73515 -74122 -74912 -72837 -69781 -69584 -69986 -70385 -71417 -72449 -72050 -71652 -69345 -67039 -65388 -68507 -70523 -72538 -69725 -69774 -70746
189g0746J889K306K307k7k887j278j278l454l454J82L045L431L432j517J345L551O90k769
$$ -70746 -68857 -66551 -64244 -64271 -67158 -68436 -69714 -73168 -76622 -76440 -73395 -69964 -66532 -68049 -66704 -63153 -62463 -65232
207f5232k768J524J527j814j811K895K899J464J468j650j647k009Q57J122j736j383j378k05
$$ -65232 -68000 -66476 -64949 -66763 -68574 -65679 -62780 -61316 -59848 -61498 -63145 -65154 -64297 -63175 -64911 -66294 -67672 -67877
225f7877k01k05k02O4O7O3O7P94P97P94P97k664k660k485k482O3K925J316J315k023k024j248
$$ -67877 -68078 -68283 -68485 -68421 -68354 -68291 -68224 -67430 -66633 -65839 -65042 -67706 -70366 -72851 -75333 -75270 -72345 -71029 -69714 -71737 -73761 -75009
247g5009J614J143J144J502j360L707L708p64p64K6K6J278J278K619k42j792j792j636J226
$$ -75009 -73395 -72252 -71108 -69606 -70966 -67259 -63551 -64315 -65079 -65053 -65027 -63749 -62471 -59852 -60094 -61886 -63678 -65314 -64088
266f4088J226j636l662l663j278j278J613M475M296J435J017j845k34k35k858MJ434J435K209
$$ -64088 -62862 -64498 -68160 -71823 -73101 -74379 -72766 -68291 -63995 -62560 -61543 -63388 -63622 -63857 -66715 -66711 -65277 -63842 -61633
285f1633k559k262k262j49j49J461j401P75P75%k862k190O70J446J446j208J655k161k161
$$ -61633 -64192 -66454 -68716 -68865 -69014 -67553 -68954 -68179 -67404 -67404 -70266 -72456 -71786 -70340 -68894 -70102 -68447 -70608 -72769
304g2769r32J934J41J46L837R80j527j524k61K604m39K425R32L797L971J115m602m598l051
$$ -72769 -73701 -71767 -71626 -71480 -67643 -66663 -68190 -69714 -69975 -67371 -67810 -65385 -64453 -60656 -56685 -55570 -60172 -64770 -67821
323f7821j87J092J095r35r31m110j244O59O63n62K302L730Q72j096j095j274j275l152l152
$$ -67821 -68008 -66916 -65821 -66756 -67687 -71797 -73041 -72382 -71719 -72281 -69979 -66249 -65377 -66473 -67568 -68842 -70117 -73269 -76421
342g6421j423J438K645K646M255M255Q57Q57n74n74j796j796j86j86j409J454j57j56k549
$$ -76421 -77844 -76406 -73761 -71115 -66860 -62605 -61748 -60891 -61465 -62039 -63835 -65631 -65817 -66003 -67412 -65958 -66115 -66271 -68820
361f8820k549R69R69j64K698l43l43K94K95K94K98r3r3r3r0L223L223j546j543j367j367j368
$$ -68820 -71369 -70400 -69431 -69595 -66897 -67240 -67583 -67289 -66994 -66700 -66402 -66495 -66588 -66681 -66771 -63548 -60325 -61871 -63414 -64781 -66148 -67516
383f7516j364R32R35R35R36k407k404M59M58J945J949r13r13n59n55K306k463j468J394K347
$$ -67516 -68880 -67948 -67013 -66078 -65142 -67549 -69953 -69494 -69036 -67091 -65142 -66055 -66968 -67527 -68082 -65776 -68239 -69707 -68313 -65966
403f5966K347Q2Q2Q2Q2j021j020p23p23m359M09K199o64j292j290j471j468L16L21L16L21
$$ -65966 -63619 -63537 -63455 -63373 -63291 -64312 -65332 -66055 -66778 -71137 -70728 -68529 -69193 -70485 -71775 -73246 -74714 -74398 -74077 -73761 -73440
424g3440L543L547O82O86o90o85l551l547k139k135K635K634n2m9m8m9j930j926R35R35J588
$$ -73440 -69897 -66350 -65668 -64982 -65672 -66357 -69908 -73455 -75594 -77729 -75094 -72460 -72512 -72561 -72609 -72658 -74588 -76514 -75579 -74644 -73056
445g3056J591J591J591K49K54K53K53j360j356J505J506l69l65l65l66Q83Q87Q87Q87j1j2
$$ -73056 -71465 -69874 -68283 -68034 -67780 -67527 -67274 -68634 -69990 -68485 -66979 -67348 -67713 -68078 -68444 -67561 -66674 -65787 -64900 -64911 -64923
466f4923j1j1j561j561j561j562Q24Q23Q24Q23K135K135k634k634p12p12K150K150m14m13
$$ -64923 -64934 -64945 -66506 -68067 -69628 -71190 -70366 -69543 -68719 -67896 -65761 -63626 -66260 -68894 -69606 -70318 -68168 -66018 -66432 -66845
486f6845m14m13J52J53m616m617Q09Q08Q09Q08N74N74N74N74p38p38p38p37M69M70M69M69
$$ -66845 -67259 -67672 -67520 -67367 -71983 -76600 -75791 -74983 -74174 -73366 -72792 -72218 -71644 -71070 -71808 -72546 -73284 -74021 -73552 -73082 -72613 -72144
508g2144J066J066J065J066o48o49o48o48J080J081J080J081j289j290J573J572q72q72q71
$$ -72144 -71078 -70012 -68947 -67881 -68529 -69178 -69826 -70474 -69394 -68313 -67233 -66152 -67441 -68731 -67158 -65586 -66458 -67330 -68201
527f8201q72n89n85n89n85O7P1K929K932j192j189j371j367P15k142l041J733m92K373J059
$$ -68201 -69073 -69662 -70247 -70836 -71421 -71354 -71283 -68354 -65422 -66614 -67803 -69174 -70541 -69826 -71968 -75009 -73276 -73768 -71395 -70336
547g0336J061M03M06M02M07j64j61j64j60j773j770J088J092k3j8j9j9P53P56P57P56j036
$$ -70336 -69275 -68872 -68466 -68064 -67657 -67821 -67982 -68146 -68306 -70079 -71849 -70761 -69669 -69692 -69710 -69729 -69748 -68995 -68239 -67482 -66726 -67762
569f7762j032j032j032J230J233J233J233o59o56l58l57m654J19J729j133Q39k020O63L525
$$ -67762 -68794 -69826 -70858 -69628 -68395 -67162 -65929 -66588 -67244 -67602 -67959 -72613 -72494 -70765 -71898 -71059 -73079 -72416 -68891
588f8891Q98R02j781j781K098K097p64p63m06m07m06m06K35K35K34K35j23j23j23j23o85o86
$$ -68891 -67993 -67091 -68872 -70653 -68555 -66458 -67222 -67985 -68391 -68798 -69204 -69610 -69375 -69140 -68906 -68671 -68794 -68917 -69040 -69163 -69848 -70534
$$ [...]
##END=	
