##TITLE=	ld0JoSFISrakfZL6Ji4$yg/2425s
##JCAMPDX=	6.0	$$ NMR Plug-in 1.13 of MestReNova 11.0.4-18998
##DATATYPE=	NMRSPECTRUM
##DATACLASS=	XYDATA
##NUMDIM=	1
##ORIGIN=	Bruker BioSpin GmbH
##OWNER=	andrew
##.OBSERVEFREQUENCY=	600.30184456100005264
##.OBSERVENUCLEUS=	^1H
##.SOLVENTNAME=	CD2Cl2
##.PULSESEQUENCE=	zg
##LONGDATE=	2015/06/05 10:25:25.000
##.ACQUISITIONMODE=	SIMULTANEOUS (DQD)
##$ORIGINALFORMAT=	Bruker XWIN-NMR
##$PARAMETERFILE=	(acqus, ASCII, /var/folders/f6/rjf_tdyn2v98c5c0wvkgn4s80000gn/T/ld0JoSFISrakfZL6Ji4$yg/2425s/acqus, 0)
$$ ##TITLE= Parameter file, TOPSPIN		Version 2.1
$$ ##JCAMPDX= 5.0
$$ ##DATATYPE= Parameter Values
$$ ##NPOINTS= 10	$$ modification sequence number
$$ ##ORIGIN= Bruker BioSpin GmbH
$$ ##OWNER= andrew
$$ $$ 2015-06-05 15:25:25.972 +0600  andrew@av-600
$$ $$ /opt/data/andrew/nmr/limog-1782/611/acqus
$$ $$ process /opt/ts21pl6/prog/mod/shimcntl
$$ ##$ACQT0= -9.54927425515661
$$ ##$AMP= (0..31)
$$ 100 100 100 100 100 100 100 100 100 100 100 100 100 100 100 100 100 100
$$ 100 100 100 100 100 100 100 100 100 100 100 100 100 100
$$ ##$ANAVPT= -1
$$ ##$AQSEQ= 0
$$ ##$AQ_mod= 3
$$ ##$AUNM= <au_zg>
$$ ##$AUTOPOS= <>
$$ ##$BF1= 600.3
$$ ##$BF2= 600.3
$$ ##$BF3= 600.3
$$ ##$BF4= 600.3
$$ ##$BF5= 600.3
$$ ##$BF6= 600.3
$$ ##$BF7= 600.3
$$ ##$BF8= 600.3
$$ ##$BYTORDA= 0
$$ ##$CFDGTYP= 0
$$ ##$CFRGTYP= 9
$$ ##$CHEMSTR= <none>
$$ ##$CNST= (0..63)
$$ 1 1 145 1 1 1 1 1 1 1 1 1 1 1 1 1 1 1 1 1 1 1 1 1 1 1 1 1 1 1 1 1 1 1 1
$$ 1 1 1 1 1 1 1 1 1 1 1 1 1 1 1 1 1 1 1 1 1 1 1 1 1 1 1 1 1
$$ ##$CPDPRG= <>
$$ ##$CPDPRG1= <>
$$ ##$CPDPRG2= <waltz16>
$$ ##$CPDPRG3= <>
$$ ##$CPDPRG4= <mlev>
$$ ##$CPDPRG5= <mlev>
$$ ##$CPDPRG6= <mlev>
$$ ##$CPDPRG7= <mlev>
$$ ##$CPDPRG8= <mlev>
$$ ##$CPDPRGB= <>
$$ ##$CPDPRGT= <>
$$ ##$D= (0..63)
$$ 0 1 0 0 0 0 0 0 0 0.06 0 0.03 0 0 0 0 1e-04 0 0 0 0 0 0 0 0 0 0 0 0 0 0
$$ 0 0 0 0 0 0 0 0 0 0 0 0 0 0 0 0 0 0 0 0 0 0 0 0 0 0 0 0 0 0 0 0 0
$$ ##$DATE= 1433496325
$$ ##$DBL= (0..7)
$$ 120 120 120 120 120 120 120 120
$$ ##$DBP= (0..7)
$$ 150 150 150 150 150 150 150 150
$$ ##$DBP07= 0
$$ ##$DBPNAM0= <>
$$ ##$DBPNAM1= <>
$$ ##$DBPNAM2= <>
$$ ##$DBPNAM3= <>
$$ ##$DBPNAM4= <>
$$ ##$DBPNAM5= <>
$$ ##$DBPNAM6= <>
$$ ##$DBPNAM7= <>
$$ ##$DBPOAL= (0..7)
$$ 0.5 0.5 0.5 0.5 0.5 0.5 0.5 0.5
$$ ##$DBPOFFS= (0..7)
$$ 0 0 0 0 0 0 0 0
$$ ##$DE= 6.5
$$ ##$DECBNUC= <off>
$$ ##$DECIM= 2218.66666666667
$$ ##$DECNUC= <off>
$$ ##$DECSTAT= 4
$$ ##$DIGMOD= 1
$$ ##$DIGTYP= 12
$$ ##$DL= (0..7)
$$ 0 120 120 120 120 120 120 120
$$ ##$DP= (0..7)
$$ 150 150 150 150 150 150 150 150
$$ ##$DP07= 0
$$ ##$DPNAME0= <>
$$ ##$DPNAME1= <>
$$ ##$DPNAME2= <>
$$ ##$DPNAME3= <>
$$ ##$DPNAME4= <>
$$ ##$DPNAME5= <>
$$ ##$DPNAME6= <>
$$ ##$DPNAME7= <>
$$ ##$DPOAL= (0..7)
$$ 0.5 0.5 0.5 0.5 0.5 0.5 0.5 0.5
$$ ##$DPOFFS= (0..7)
$$ 0 0 0 0 0 0 0 0
$$ ##$DQDMODE= 0
$$ ##$DR= 22
$$ ##$DS= 0
$$ ##$DSLIST= <SSSSSSSSSSSSSSS>
$$ ##$DSPFIRM= 0
$$ ##$DSPFVS= 20
$$ ##$DTYPA= 0
$$ ##$EXP= <>
$$ ##$F1LIST= <111111111111111>
$$ ##$F2LIST= <222222222222222>
$$ [...]
$$ -1 -1 -1 -1 -1 -1 -1 -1 -1 -1 -1 -1 -1 -1 -1 -1 -1 -1 -1 -1 -1 -1 -1 -1
$$ -1 -1 -1 -1 -1 -1 -1 -1 -1 -1 -1 -1 -1 -1 -1 -1 -1 -1 -1 -1 -1 -1 -1 -1
$$ -1 -1 -1 -1 -1 -1 -1 -1 -1 -1 -1 -1 -1 -1 -1 -1 -1 -1 -1 -1 -1 -1 -1 -1
$$ -1 -1 -1 -1 -1 -1 -1 -1 -1 -1 -1 -1 -1 -1 -1 -1 -1 -1 -1 -1 -1 -1 -1 -1
$$ -1 -1 -1 -1 -1 -1 -1 -1 -1 -1 -1 -1 -1 -1 -1 -1
$$ ##$RG_tab8= (0..255)
$$ -1 -1 -1 -1 -1 -1 -1 -1 -1 -1 -1 -1 -1 -1 -1 -1 -1 -1 -1 -1 -1 -1 -1 -1
$$ -1 -1 -1 -1 -1 -1 -1 -1 -1 -1 -1 -1 -1 -1 -1 -1 -1 -1 -1 -1 -1 -1 -1 -1
$$ -1 -1 -1 -1 -1 -1 -1 -1 -1 -1 -1 -1 -1 -1 -1 -1 -1 -1 -1 -1 -1 -1 -1 -1
$$ -1 -1 -1 -1 -1 -1 -1 -1 -1 -1 -1 -1 -1 -1 -1 -1 -1 -1 -1 -1 -1 -1 -1 -1
$$ -1 -1 -1 -1 -1 -1 -1 -1 -1 -1 -1 -1 -1 -1 -1 -1 -1 -1 -1 -1 -1 -1 -1 -1
$$ -1 -1 -1 -1 -1 -1 -1 -1 -1 -1 -1 -1 -1 -1 -1 -1 -1 -1 -1 -1 -1 -1 -1 -1
$$ -1 -1 -1 -1 -1 -1 -1 -1 -1 -1 -1 -1 -1 -1 -1 -1 -1 -1 -1 -1 -1 -1 -1 -1
$$ -1 -1 -1 -1 -1 -1 -1 -1 -1 -1 -1 -1 -1 -1 -1 -1 -1 -1 -1 -1 -1 -1 -1 -1
$$ -1 -1 -1 -1 -1 -1 -1 -1 -1 -1 -1 -1 -1 -1 -1 -1 -1 -1 -1 -1 -1 -1 -1 -1
$$ -1 -1 -1 -1 -1 -1 -1 -1 -1 -1 -1 -1 -1 -1 -1 -1 -1 -1 -1 -1 -1 -1 -1 -1
$$ -1 -1 -1 -1 -1 -1 -1 -1 -1 -1 -1 -1 -1 -1 -1 -1
$$ ##$RG_tabA= (0..255)
$$ 0.25 0.28 0.32 0.35 0.4 0.44 0.5 0.56 0.64 0.7 0.8 0.89 1 1.12 1.28 1.4
$$ 1.6 1.78 2 2.25 2.56 2.8 3.2 3.56 4 4.5 5 5.6 6.35 7.12 8 9 10 11.3 12.7
$$ 14.2 16 18 20.2 22.6 25.4 28.5 32 36 40.3 45.2 50.8 57 64 71.8 80.6 90.5
$$ 101 114 128 144 161 181 203 -1 -1 -1 -1 -1 -1 -1 -1 -1 -1 -1 -1 -1 -1 -1
$$ -1 -1 -1 -1 -1 -1 -1 -1 -1 -1 -1 -1 -1 -1 -1 -1 -1 -1 -1 -1 -1 -1 -1 -1
$$ -1 -1 -1 -1 -1 -1 -1 -1 -1 -1 -1 -1 -1 -1 -1 -1 -1 -1 -1 -1 -1 -1 -1 -1
$$ -1 -1 -1 -1 -1 -1 -1 -1 -1 -1 -1 -1 -1 -1 -1 -1 -1 -1 -1 -1 -1 -1 -1 -1
$$ -1 -1 -1 -1 -1 -1 -1 -1 -1 -1 -1 -1 -1 -1 -1 -1 -1 -1 -1 -1 -1 -1 -1 -1
$$ -1 -1 -1 -1 -1 -1 -1 -1 -1 -1 -1 -1 -1 -1 -1 -1 -1 -1 -1 -1 -1 -1 -1 -1
$$ -1 -1 -1 -1 -1 -1 -1 -1 -1 -1 -1 -1 -1 -1 -1 -1 -1 -1 -1 -1 -1 -1 -1 -1
$$ -1 -1 -1 -1 -1 -1 -1 -1 -1 -1 -1 -1 -1 -1 -1 -1 -1 -1 -1 -1 -1 -1 -1 -1
$$ -1 -1 -1 -1 -1 -1 -1 -1 -1 -1 -1 -1 -1 -1
$$ ##$ROUT14= (0..7)
$$ 0 0 0 0 0 0 0 0
$$ ##$ROUTER= -1
$$ ##$RX22TY= <no>
$$ ##$RXFMAX= (0..7)
$$ 647.5 -1 -1 -1 -1 -1 -1 -1
$$ ##$RXFMIN= (0..7)
$$ 5 -1 -1 -1 -1 -1 -1 -1
$$ ##$RXINTLV= (0..7)
$$ 1 0 0 0 0 0 0 0
$$ ##$RXMSTY= <no>
$$ ##$SCMTY= <no>
$$ ##$SGUC1= (0..15)
$$ 17 18 34 0 0 0 0 0 0 0 0 0 0 0 0 0
$$ ##$SGUC2= (0..15)
$$ 33 256 20 0 0 0 0 0 0 0 0 0 0 0 0 0
$$ ##$SPECTR= 10
$$ ##$SY2FLAG= 0
$$ ##$TFXNUM= 0
$$ ##$TRIPLO2= 0
$$ ##$VTUTY= <tty05>
$$ ##$WBREFAM= (0..15)
$$ 100 100 100 100 100 100 100 100 100 100 100 100 100 100 100 100
$$ ##$WBREFPH= (0..15)
$$ 0 0 0 0 0 0 0 0 0 0 0 0 0 0 0 0
$$ ##$XFAC= 2
$$ ##END=
$$ 
##$DECIM=	2218.66666666667
##$DSPFVS=	20
##XUNITS=	HZ
##YUNITS=	ARBITRARY UNITS
##FIRSTX=	6322.8525384689401108
##LASTX=	-2691.4329892738592207
##XFACTOR=	-0.1375491802509010153
##YFACTOR=	9.6046884765625000125e-06
##NPOINTS=	65536
##XYDATA=	(X++(Y..Y))
$$ [...]
-15706 -68504 -69507 -65263 -61019 -60196 -59373 -58549 -57726 -57648 -57569 -57491 -57413 -57484 -57555 -57625 -57692 -57763 -57834 -57905 -57972 -58855 -59738 -60621 -61500 -61370 -61239
-15681 -61239 -62540 -63836 -61932 -60028 -60211 -60390 -62152 -59145 -55781 -55274 -55330 -55386 -55800 -56210 -55431 -57514 -60848 -59410 -56742
-15662 -56742 -56932 -60163 -60531 -60666 -60796 -60747 -60699 -62152 -63601 -62666 -61731 -62260 -62785 -60926 -59067 -58110 -57148 -57618 -58087 -59633 -61176
-15641 -61176 -62718 -64261 -64063 -63862 -63661 -63460 -62607 -61750 -62323 -62897 -62435 -61973 -58173 -54373 -51288 -48203 -51318 -54432 -52711
-15622 -52711 -50990 -52607 -54224 -55066 -55908 -55319 -54730 -55859 -56988 -56686 -56385 -56321 -56258 -52976 -55416 -56418 -57420 -58780 -60140
-15603 -60140 -58519 -56899 -55636 -54373 -52488 -56325 -56944 -57562 -55438 -53315 -54529 -55744 -57018 -58292 -57182 -56072 -57763
-15586 -57763 -59455 -58762 -58069 -58862 -59656 -59019 -58382 -58400 -58419 -58438 -58456 -58937 -59417 -59898 -60379 -60263 -60148 -60032 -59917 -61802 -63683 -65569
-15564 -65569 -67450 -67547 -67640 -67737 -67830 -66720 -65606 -64496 -63382 -62271 -61157 -60047 -58933 -58926 -58914 -58907 -58896 -60230 -61560 -60509 -59455
-15543 -59455 -60759 -62059 -63363 -64663 -63016 -61366 -62104 -62838 -59991 -57141 -59537 -61932 -63259 -64581 -61612 -58642 -57972
-15526 -57972 -57297 -59008 -60718 -59689 -58657 -60010 -61362 -59809 -58251 -60032 -61813 -62703 -63590 -65311 -61310 -63393 -65472
-15509 -65472 -64808 -64145 -62323 -60498 -60103 -59708 -59678 -59645 -59611 -59578 -58564 -57547 -56530 -55513 -54619 -53721 -52823 -51925 -51925 -51921 -51918 -51914 -54362 -56809
-15485 -56809 -56396 -55979 -55386 -54794 -54201 -53605 -55069 -56534 -60859 -60412 -56839 -56128 -58277 -57562 -55498 -58199 -59473 -60744 -60557
-15466 -60557 -60367 -58750 -57130 -56012 -54891 -55025 -55155 -56303 -54585 -51619 -53419 -54567 -52853 -51258 -52525 -55401 -55416 -57219
-15448 -57219 -59022 -59596 -60170 -60744 -61317 -62279 -63240 -61340 -59440 -58397 -57353 -57741 -58128 -59797 -61467 -63136 -64805 -64589 -64373
-15429 -64373 -64156 -63940 -63903 -63866 -63829 -63791 -61444 -59097 -59611 -60125 -60282 -60438 -60595 -60751 -58888 -57025 -58024 -59022 -59097 -59171 -59246 -59321 -58542
-15406 -58542 -57759 -58408 -59056 -61943 -64827 -62942 -61057 -60353 -59645 -61619 -58825 -57167 -55505 -56407 -57309 -57767 -58221 -58676 -59131
-15387 -59131 -58695 -58255 -58113 -57972 -55800 -58393 -58303 -58214 -58337 -58456 -58575 -58695 -58877 -59056 -57804 -56552 -56109 -55662 -58076 -60490 -61306
-15366 -61306 -62119 -60367 -58616 -56392 -58933 -61832 -61869 -61336 -60800 -61515 -62230 -59641 -57048 -57316 -57584 -55576 -53564 -52983 -52402
-15347 -52402 -52927 -53449 -53970 -54492 -55513 -56534 -60416 -64294 -64540 -64786 -62171 -59552 -61541 -63531 -62659 -61783 -61031 -60278 -59227
-15328 -59227 -58173 -60285 -57629 -54973 -57081 -57912 -58743 -58441 -58136 -58654 -59171 -56828 -54481 -54403 -54324 -55677 -57025 -58158 -59287
-15309 -59287 -60420 -61548 -61370 -61187 -59578 -57964 -60088 -62208 -61470 -60729 -61332 -61932 -62536 -63136 -64071 -65002 -63076 -61146 -62141
-15290 -62141 -63132 -63948 -64760 -65569 -63512 -58896 -60952 -65457 -63281 -60811 -61198 -62070 -62942 -63993 -65039 -64689 -64335 -63985 -63631
-15271 -63631 -62320 -61008 -61127 -61243 -61958 -62670 -63504 -59566 -56899 -59000 -59552 -60099 -60561 -61019 -61481 -61940 -61984 -62029 -63981 -63069 -57212
-15250 -57212 -56120 -58549 -58113 -59626 -61139 -59611 -58084 -57271 -56459 -55647 -54831 -55830 -56828 -57827 -58825 -58810 -58795 -58780 -58762 -59540 -60319
-15229 -60319 -63959 -67599 -66202 -64805 -57327 -55569 -54023 -52476 -52719 -52961 -54037 -55114 -54760 -54403 -52465 -50528 -53002 -55476
-15211 -55476 -61288 -61377 -61824 -62271 -61526 -60781 -61467 -62152 -64954 -67756 -67696 -67636 -68303 -68970 -66776 -64581 -63221 -61861 -63363 -64864
-15191 -64864 -65695 -66526 -64853 -63180 -60077 -62696 -62096 -61496 -62420 -63341 -64265 -65185 -62383 -59578 -58207 -56832 -55118 -53400 -54548
-15172 -54548 -55692 -55319 -54943 -54570 -54194 -55405 -56612 -58180 -59745 -58095 -62163 -63016 -63866 -63616 -63363 -63113 -62860 -62610 -62357 -62107
-15152 -62107 -61854 -62081 -62305 -62532 -62756 -62983 -63206 -63434 -63657 -62424 -61187 -59954 -58717 -59630 -60539 -61452 -62361 -61440 -60516 -59596 -58672
-15131 -58672 -59987 -61299 -62614 -63925 -61642 -59354 -58501 -57644 -60129 -62610 -62234 -61854 -62435 -63016 -62167 -61317 -59753 -58188 -59484
-15112 -59484 -60781 -61042 -61303 -60133 -58963 -57078 -55192 -56169 -57145 -58747 -60349 -60520 -60692 -61548 -62405 -61832 -61258 -60192 -59127
-15093 -59127 -57525 -58784 -60669 -56832 -57823 -58814 -59362 -59905 -60453 -60997 -61008 -61016 -58523 -56027 -55800 -61291 -65356 -63694 -62513 -61329
-15073 -61329 -61221 -61109 -59879 -58646 -60278 -61906 -61303 -60695 -60092 -59484 -58881 -58274 -57670 -57063 -58039 -59011 -62491 -65967 -66783 -61876
-15053 -61876 -58221 -60289 -62476 -61802 -60233 -58665 -59481 -60297 -59682 -59067 -56962 -54857 -52216 -52435 -58765 -59373 -58609 -57845 -58214
-15034 -58214 -58583 -58952 -59321 -59868 -60416 -59533 -58650 -57856 -57063 -59131 -61198 -58788 -56377 -56828 -57279 -59607 -61936 -61463 -58128 -55926
-15014 -55926 -59447 -61001 -62554 -63393 -64231 -62208 -60185 -57856 -55528 -54809 -54090 -54175 -57122 -58818 -54790 -55405 -56020 -56277 -56534
-14995 -56534 -56970 -57406 -57841 -58277 -58013 -57748 -59093 -57577 -58952 -60326 -61522 -62718 -60375 -58031 -55330 -55490 -58333 -58315 -54540
-14976 -54540 -55535 -57569 -59600 -60680 -61757 -59231 -59563 -58289 -57011 -57048 -57081 -57119 -57152 -56295 -55435 -54578 -53717 -56459 -59201 -60692
-14956 -60692 -59321 -58873 -58426 -56549 -54671 -54693 -57577 -60461 -60483 -60505 -60528 -60729 -58069 -55561 -55912 -58948 -61981 -63229 -59704 -60118
-14936 -60118 -63389 -63050 -62707 -61116 -59522 -60822 -62119 -60557 -58993 -56865 -54734 -57376 -60014 -61612 -63206 -64447 -68545
-14919 -68545 -68966 -66522 -63009 -59492 -58900 -58303 -60394 -62480 -63069 -60792 -57089 -56243 -55967 -55688 -56664 -60498 -62994 -62625 -59280
-14900 -59280 -55930 -54641 -53348 -53669 -53985 -51742 -52357 -54227 -56094 -56444 -56791 -57141 -57487 -59008 -60524 -59183 -57838 -58106 -58370
-14881 -58370 -59891 -61407 -62044 -59816 -59022 -61087 -63423 -65755 -65289 -61958 -61545 -63989 -63218 -62443 -62625 -62804 -59946 -59946 -60911 -61873
-14861 -61873 -63016 -64156 -64019 -63877 -63739 -63598 -62461 -61321 -60483 -59641 -60353 -65829 -66541 -62480 -61802 -61120 -63005 -64887 -64864 -64838
-14841 -64838 -64816 -64790 -64067 -63341 -62618 -61891 -62271 -62648 -65889 -69127 -67238 -65349 -64890 -64432 -63259 -62085 -62342 -62599 -62618 -62636 -62655 -62674
-14819 -62674 -61083 -59492 -59332 -59171 -61489 -63806 -63262 -62718 -60774 -58829 -59745 -60662 -58031 -55401 -55632 -55863 -55856 -55848 -55841 -55833 -54861 -53888
-14797 -53888 -52916 -51940 -50550 -49161 -50632 -52100 -53259 -54418 -55576 -56731 -58069 -59406 -60744 -62078 -61519 -60956 -60397 -59835
-14779 -59835 -60647 -61455 -62268 -63076 -62398 -61716 -63601 -65483 -68232 -66209 -63654 -63955 -63985 -61154 -57428 -58467 -56590 -54712 -57603
-14760 -57603 -60490 -60744 -56228 -54216 -55062 -54689 -54317 -54123 -53926 -54283 -54641 -54999 -55356 -58575 -61794 -60244 -58695 -57413 -56131
-14741 -56131 -57711 -59291 -58963 -58635 -58307 -57979 -59186 -60390 -61597 -62800 -60937 -59071 -61321 -58799 -57279 -55755 -56798 -57838
-14723 -57838 -56467 -55092 -56582 -58069 -59309 -60546 -61787 -63024 -61820 -60613 -59410 -58203 -59980 -61753 -63531 -65304 -66157
-14706 -66157 -67007 -64998 -62987 -61958 -60926 -61329 -61727 -61146 -60561 -58728 -56891 -56936 -59838 -62566 -60520 -59075 -60487 -61604
-14688 -61604 -59857 -58143 -56426 -54533 -52637 -54976 -57312 -59652 -61988 -59946 -57901 -58721 -59537 -57853 -56165 -57342 -58516
-14671 -58516 -59410 -60304 -61198 -62092 -60513 -58933 -58784 -58635 -60602 -62569 -61675 -60781 -60692 -60602 -63374 -66146 -64130 -62115 -60099 -58084
-14651 -58084 -57171 -56258 -58207 -60155 -62163 -64171 -64749 -65326 -63966 -62607 -61247 -59887 -59525 -59160 -59753 -63203 -64838 -61701
-14633 -61701 -61429 -61154 -61984 -62812 -62212 -61608 -59488 -57365 -55423 -58248 -58076 -57901 -60889 -63873 -67219 -70561 -69317 -68068 -66794
-14614 -66794 -68378 -68177 -63203 -62942 -62677 -62119 -61556 -62916 -64276 -63132 -61988 -58728 -61191 -63296 -65401 -66373 -67346 -66887 -66429
-14595 -66429 -64302 -62174 -61478 -60781 -62726 -64671 -63754 -62838 -64723 -66608 -63724 -60841 -61504 -62167 -64261 -66355 -66153 -65952 -65751
-14576 -65751 -65550 -64909 -64268 -63627 -62983 -63624 -64265 -64905 -65542 -65498 -65453 -66839 -68221 -64570 -60919 -60129 -59335 -60077 -60818 -61560 -62297
-14555 -62297 -62502 -62707 -62912 -63113 -63616 -64119 -64622 -65121 -65893 -66664 -66004 -65341 -63568 -61794 -62882 -63970 -65267 -66563 -66429 -66295
-14535 -66295 -66280 -66265 -64820 -63374 -63836 -64298 -64760 -65222 -64153 -63083 -62014 -60945 -62499 -64052 -65427 -66802 -67074 -64484 -60285
-14516 -60285 -61809 -60770 -59730 -61910 -64089 -65323 -66556 -64928 -63296 -59999 -56701 -56265 -55826 -58400 -60975 -60509 -60040 -62137
-14498 -62137 -61373 -58642 -61630 -64153 -60952 -57931 -60628 -62733 -61977 -61578 -64037 -63363 -62689 -62193 -61694 -61139 -60584 -60028 -59470
-14479 -59470 -63598 -67722 -65170 -62618 -62722 -62823 -62923 -63024 -61526 -60025 -59954 -59883 -59369 -58851 -61195 -63538 -65755 -67968 -67320
-14460 -67320 -66671 -67368 -68061 -65893 -63724 -61977 -60226 -59905 -59585 -57093 -54596 -56869 -59142 -61206 -63266 -62469 -61668 -61109 -60546
-14441 -60546 -59987 -59425 -59604 -59779 -59958 -60133 -59954 -59771 -59592 -59410 -59078 -58743 -58411 -58076 -57923 -57767 -57614 -57458 -57581 -57700 -60684 -63665
-14419 -63665 -62893 -62119 -61347 -60572 -59585 -58598 -57610 -56619 -56824 -57029 -57234 -57435 -58400 -59365 -60330 -61291 -62256 -63221 -64186 -65148 -64276 -63404
-14397 -63404 -62532 -61657 -58967 -56277 -55017 -53754 -52674 -51593 -53374 -55151 -57201 -59250 -58438 -57622 -55945 -54268 -55453 -56638
-14379 -56638 -56750 -56862 -56973 -57085 -58315 -59544 -60774 -62003 -60937 -59872 -60237 -60602 -63784 -66966 -65379 -63791 -62472 -61154
-14361 -61154 -62875 -64596 -65542 -69350 -71369 -68620 -67092 -65565 -65170 -64775 -63709 -62644 -61578 -60513 -57569 -54626 -56452
-14344 -56452 -58277 -60267 -62256 -63888 -65520 -67271 -63300 -59328 -61079 -62797 -64514 -63728 -62942 -63825 -64708 -62014 -65043 -68832
-14326 -68832 -66899 -63773 -60647 -60710 -60774 -62268 -63762 -62737 -61712 -60688 -59663 -58221 -56780 -58199 -59619 -60524 -61429 -60904
-14308 -60904 -60379 -58691 -57003 -55315 -53628 -55438 -57249 -59060 -60870 -62413 -63955 -65498 -67040 -66191 -65341 -65922 -66504 -64581
-14290 -64581 -62659 -63598 -64537 -65263 -65990 -65285 -64581 -65457 -66332 -64346 -62361 -60934 -59507 -60941 -62376 -64257 -66139 -63251 -60364
-14271 -60364 -60874 -61385 -63683 -60259 -58654 -57048 -56515 -55982 -54369 -52756 -52931 -53106 -52923 -58464 -61142 -58098 -56493 -54883
-14253 -54883 -55781 -56675 -60703 -64727 -63985 -63240 -60919 -58594 -57704 -56809 -59049 -61284 -63523 -65759 -65274 -64786 -67163 -69536 -65773
-14234 -65773 -62007 -61105 -60200 -60244 -60285 -63192 -66094 -66288 -66478 -66671 -66861 -67510 -68154 -67372 -66586 -63687 -60785 -60747 -60706 -61966 -63221
-14213 -63221 -61083 -64663 -65267 -63005 -62715 -62420 -62558 -62692 -62830 -62964 -63102 -63236 -63374 -63508 -63944 -64376 -64812 -65244 -65591 -65934 -66280
-14192 -66280 -66623 -66146 -65669 -63762 -61850 -61612 -61373 -58274 -55170 -54239 -53307 -53806 -54302 -55069 -55837 -56604 -57368 -59384 -61399 -58825
-14172 -58825 -56247 -54328 -55271 -60684 -60371 -60733 -61094 -61098 -61098 -61638 -62178 -62718 -63255 -62465 -61671 -60882 -60088 -60371 -60651 -60934 -61213 -61362
-14150 -61362 -61508 -61657 -61802 -62368 -62931 -63497 -64060 -65043 -66023 -67543 -63337 -60565 -60651 -60382 -57249 -58538 -59823 -56165 -52502 -57487
-14130 -57487 -62469 -64592 -66712 -65207 -63702 -64700 -65695 -68303 -65189 -65293 -65393 -63814 -62234 -63516 -64794 -63214 -61634 -61485
-14112 -61485 -61332 -62465 -63598 -63300 -62998 -66276 -69555 -68065 -66571 -65267 -63963 -62659 -61351 -61627 -61902 -62178 -62450 -61131
-14094 -61131 -59809 -61828 -60982 -54865 -53512 -57588 -58799 -57726 -56649 -55576 -59268 -59686 -60099 -62245 -64387 -62268 -60144
-14077 -60144 -59455 -58762 -57178 -55591 -54008 -52421 -54183 -55941 -54842 -53739 -53892 -54041 -54194 -54343 -55893 -57443 -58993 -60543
-14059 -60543 -61288 -62033 -59917 -57800 -58546 -59291 -61467 -63642 -62033 -60423 -59768 -61973 -63870 -60997 -63847 -66697 -66031 -65364
-14041 -65364 -64697 -64030 -64257 -64484 -64712 -64939 -64361 -63784 -61776 -59768 -59842 -59913 -62849 -65781 -64842 -63899 -61530 -59157 -60334 -61508
-14021 -61508 -59823 -62905 -60833 -55897 -57640 -59380 -59976 -60569 -61165 -61757 -60475 -59190 -59339 -59484 -62882 -66276 -64905 -63531
-14003 -63531 -63173 -62812 -66567 -65550 -62901 -60252 -60166 -60077 -60259 -60442 -63486 -66526 -66232 -65937 -68504 -71068 -68568 -66068 -66429
-13984 -66429 -66787 -66262 -65736 -65211 -64682 -63978 -63273 -62569 -61861 -63698 -65535 -65464 -68251 -69223 -65427 -64492 -63553 -64380 -65207 -63650 -62092
-13963 -62092 -62025 -61958 -61891 -61824 -60796 -59768 -61124 -62480 -62733 -62987 -61988 -60990 -62256 -66384 -67174 -65103 -61988 -58873 -56355 -56698
-13943 -56698 -57465 -58233 -59179 -60125 -59432 -58739 -59477 -60215 -61250 -62286 -60937 -59585 -59846 -60107 -58758 -60267 -59991 -59715 -59619 -59518
-13923 -59518 -59451 -59384 -57707 -58888 -60021 -61154 -60081 -59004 -57990 -56977 -55964 -54947 -57979 -61012 -60528 -60040 -61493 -60084
-13905 -60084 -60285 -60483 -60502 -60516 -60535 -60550 -59674 -58795 -60125 -61452 -63557 -62797 -61444 -60088 -56947 -56664 -57160 -57651 -57741 -57827 -58393 -63724
-13883 -63724 -68821 -71053 -71679 -72301 -74074 -72983 -71120 -69253 -66496 -63735 -61753 -62629 -63344 -64060 -63523 -62987 -64238 -65490
-13865 -65490 -64358 -63225 -61280 -59335 -56139 -57711 -59522 -61332 -62189 -63046 -60494 -60800 -60930 -61057 -62439 -63817 -61861 -59902
-13847 -59902 -59414 -58922 -59686 -60446 -61478 -59645 -57637 -58486 -61642 -61936 -61634 -61332 -62849 -64365 -62543 -60721 -59913 -59104 -59727
-13828 -59727 -60349 -57722 -55096 -53244 -54254 -56005 -57752 -59861 -61966 -61064 -63020 -63370 -63717 -62920 -62119 -61500 -60878 -61243 -64466
-13809 -64466 -67692 -68054 -68128 -68199 -64935 -61668 -56556 -54302 -55688 -57070 -59321 -61567 -63817 -66064 -66288 -66507 -64346 -62182
-13791 -62182 -60457 -58728 -57003 -55274 -53758 -52238 -50900 -49559 -49950 -53199 -53233 -56124 -58661 -61195 -61526 -61854 -60043 -58233
-13773 -58233 -61489 -64745 -65975 -64343 -61280 -61079 -63337 -65595 -64693 -63791 -63426 -63061 -63948 -64835 -67040 -66384 -65908 -65431 -66146
-13754 -66146 -66861 -67934 -66146 -61839 -60394 -60498 -60602 -62227 -63851 -63747 -63642 -63948 -59484 -56094 -55565 -55811 -56057 -54872 -56549
-13735 -56549 -59641 -62733 -63620 -64507 -64380 -64253 -62040 -59827 -58035 -61012 -62916 -61958 -61448 -60937 -60248 -59559 -59183 -58806 -58430 -58054
-13715 -58054 -58482 -58911 -59339 -59768 -59946 -60122 -63639 -67152 -70043 -72931 -71530 -70125 -70051 -69972 -68169 -66362 -69566 -67998 -64823
-13696 -64823 -61645 -64335 -67022 -65419 -63814 -61705 -59592 -59868 -60140 -60625 -61105 -61589 -62070 -60438 -58803 -57171 -55535 -54716
-13678 -54716 -53892 -54980 -53203 -51906 -55375 -55986 -56593 -56720 -56843 -56970 -57093 -56444 -55792 -56575 -60215 -62681 -60375 -58549 -56720
-13659 -56720 -53583 -50442 -51597 -52748 -54514 -56277 -55658 -55036 -56921 -58803 -59257 -59708 -58650 -57588 -57961 -58329 -59209 -60084 -59533
-13640 -59533 -58978 -59581 -60181 -60785 -61385 -61452 -61515 -59198 -56876 -57819 -58758 -59701 -60639 -61671 -62700 -57532 -57130 -60800 -61604 -60148
-13620 -60148 -61548 -62566 -60718 -60662 -60602 -57290 -53974 -54298 -54619 -52797 -55740 -53620 -51497 -53371 -55241 -57115 -58985 -58683
-13602 -58683 -58378 -57897 -57413 -58300 -56321 -53274 -54991 -57577 -60159 -63043 -65922 -65841 -65755 -62513 -59268 -57547 -58683 -62327 -61198
-13583 -61198 -60125 -59049 -59108 -59164 -58717 -58266 -57819 -57368 -58069 -58765 -57081 -55394 -55647 -55897 -56150 -56400 -54824 -53244 -51668 -50088
-13563 -50088 -54682 -59272 -58620 -57964 -58952 -59935 -60923 -61906 -60777 -59645 -58516 -57383 -56362 -55341 -54321 -53300 -55498 -57696
-13545 -57696 -59894 -62092 -62905 -63717 -64529 -65341 -64514 -63687 -62860 -62033 -62681 -63329 -62547 -61765 -60952 -60140 -61712 -63285 -65200 -67115
-13525 -67115 -63784 -60453 -60520 -60587 -59224 -57860 -59816 -61772 -61344 -60915 -60189 -59462 -58736 -58009 -58236 -58464 -58691 -58918 -60457 -61996
-13505 -61996 -63534 -65073 -65196 -65319 -65442 -65565 -66403 -67241 -71299 -69633 -69063 -68493 -67566 -66638 -65621 -64604 -63586 -62569 -63333
-13486 -63333 -64097 -63430 -62763 -61411 -60058 -61090 -62122 -59928 -57733 -58877 -60021 -60151 -60282 -63631 -61258 -62070 -62882 -63337 -63791
-13467 -63791 -62934 -62078 -61221 -60364 -61608 -62852 -64097 -65341 -65244 -65148 -65051 -64954 -62029 -59101 -59335 -59566 -62215 -61999 -57197 -57160 -60449
-13446 -60449 -60874 -61779 -62681 -63646 -64607 -64142 -63672 -62651 -61627 -62990 -64350 -64253 -64153 -62625 -61094 -62189 -63281 -64376 -65468
-13427 -65468 -65431 -65390 -65352 -65311 -66597 -67882 -68333 -64015 -64138 -61399 -55859 -55088 -56433 -57778 -57990 -58203 -58952 -59701 -62834 -65967
-13407 -65967 -66265 -66563 -64477 -62391 -62629 -62867 -65490 -68113 -66742 -65371 -62569 -59768 -59470 -59171 -60304 -61437 -61541 -61642 -63177
-13388 -63177 -64708 -64544 -64376 -64212 -64045 -63657 -63266 -64309 -65349 -63322 -61291 -61649 -62003 -62480 -62953 -65814 -68672 -65781 -62886
-13369 -62886 -62379 -61869 -61765 -61657 -61552 -61444 -61489 -61530 -61575 -61616 -61221 -60822 -60427 -60028 -59425 -58818 -58214 -57607 -59611 -61612 -60278 -58941
-13347 -58941 -59455 -59965 -62864 -65759 -63829 -61895 -59965 -58031 -56727 -55420 -55546 -55669 -57525 -59376 -58847 -55453 -52897 -55107
-13329 -55107 -60598 -59410 -60531 -61649 -59969 -58285 -58631 -58974 -57890 -56802 -57238 -57670 -59537 -61399 -64190 -66977 -65475 -63970
-13311 -63970 -61593 -59212 -56835 -54455 -56221 -57983 -59749 -61511 -61787 -62059 -62335 -62607 -62137 -61664 -59764 -57860 -58713 -59563 -60416
-13292 -60416 -61265 -61612 -61955 -60870 -59783 -59831 -59876 -61355 -62830 -63713 -64592 -63091 -61586 -59030 -56470 -58207 -59939 -60900 -61858
-13273 -61858 -64250 -66638 -65773 -64905 -61657 -58404 -55751 -53095 -54734 -56370 -59462 -62554 -62309 -62063 -62085 -62107 -65468 -68829 -67115
-13254 -67115 -65401 -63687 -61973 -63389 -64805 -63836 -62867 -61064 -59261 -61750 -64238 -64790 -65341 -65893 -66444 -63240 -60036 -61124
-13236 -61124 -62212 -61094 -59976 -61243 -62510 -61329 -60144 -58959 -57774 -57338 -56899 -57890 -58881 -61277 -63668 -63676 -63683 -62204 -60721
-13217 -60721 -61623 -62525 -60315 -58106 -59235 -60360 -60595 -60829 -62495 -64156 -64153 -64149 -65576 -66999 -67204 -67409 -66362 -65311 -61418 -60382
-13197 -60382 -60423 -55692 -54332 -52968 -56079 -59186 -61306 -63423 -62681 -61936 -64175 -66411 -65788 -65162 -66031 -66899 -64905 -62912 -63780
-13178 -63780 -64648 -62655 -60662 -62879 -65095 -64451 -63806 -62774 -61742 -62141 -62540 -60666 -58791 -61686 -64581 -66761 -68940 -72670
-13160 -72670 -71630 -65270 -63680 -63877 -64075 -61828 -59581 -58765 -57949 -58430 -58911 -59391 -59872 -58952 -58031 -57111 -56191 -55599 -55006 -59183
-13140 -59183 -63359 -64108 -64857 -64175 -63493 -63996 -64499 -65002 -65505 -66217 -66928 -64779 -62629 -62536 -62443 -62350 -62256 -60285 -58315 -56344 -54373
-13119 -54373 -55800 -57227 -60084 -62942 -62491 -62040 -64451 -66861 -63877 -60893 -60770 -60647 -59034 -57420 -58669 -59917 -59190 -58464
-13101 -58464 -57737 -57011 -58728 -60446 -62163 -63881 -63080 -62279 -61478 -60677 -58743 -56809 -55830 -57711 -62204 -61929 -58136 -57204 -58121
-13082 -58121 -59037 -60133 -61228 -62890 -64551 -63352 -62152 -61698 -61243 -63650 -66057 -65110 -64164 -61787 -59410 -59805 -60200 -60595 -60990
-13063 -60990 -62554 -64119 -65684 -67249 -65952 -64656 -60677 -61467 -63072 -64678 -63721 -62763 -61508 -60252 -61858 -63464 -64838
-13046 -64838 -66213 -62819 -59425 -60740 -62055 -58601 -55148 -56195 -57238 -58285 -59328 -60435 -61537 -62644 -63747 -62484 -61217
-13029 -61217 -59954 -58687 -59779 -60867 -61958 -63046 -61455 -59861 -59701 -59537 -55979 -52417 -52018 -51616 -50591 -54332 -56645 -58955
-13011 -58955 -61180 -60539 -59723 -54134 -52845 -56321 -59678 -63035 -63739 -64443 -63717 -62990 -61381 -59768 -59108 -61310 -63870 -61660
-12993 -61660 -59272 -59745 -58560 -57372 -56362 -55353 -56459 -57566 -58672 -59779 -57998 -56213 -57290 -58367 -57357 -56347 -58199
-12976 -58199 -60051 -61772 -63490 -62350 -61206 -62838 -64466 -64667 -64864 -62912 -60956 -61865 -62771 -60103 -57432 -57625 -57815 -58441
-12958 -58441 -59063 -61120 -63173 -64425 -65673 -65017 -67219 -67279 -62566 -59108 -58508 -60207 -61902 -60919 -59932 -59276 -58620 -59395 -60170
-12939 -60170 -60498 -60826 -63538 -66247 -66873 -67498 -65740 -63981 -63117 -62253 -61388 -60520 -61288 -62055 -62823 -63590 -62867 -62145 -59991 -57834
-12919 -57834 -57156 -56478 -59138 -61798 -63743 -65688 -63341 -60990 -60904 -60815 -59298 -57778 -60435 -63087 -64313 -65535 -67253 -68966
-12901 -68966 -68299 -67629 -66157 -64682 -63210 -61735 -60438 -59138 -61180 -63218 -63739 -64257 -61440 -58620 -60222 -61820 -61992 -59298
-12883 -59298 -57204 -59876 -59689 -59499 -58978 -58452 -57931 -57406 -58285 -59160 -58430 -57696 -60475 -60390 -59056 -62487 -65088 -64823 -64086 -63344
-12863 -63344 -64719 -66090 -67465 -68836 -68393 -67946 -65118 -62286 -60144 -57998 -59194 -60386 -61582 -62774 -62540 -62301 -61340 -60375
-12845 -60375 -61798 -63218 -64194 -65166 -63758 -62346 -64037 -65725 -67416 -69104 -68143 -67178 -67647 -68113 -68836 -69555 -69801 -67182 -62450
-12826 -62450 -62484 -62998 -63508 -64134 -64756 -65382 -66004 -66243 -66478 -68147 -69812 -65360 -60904 -59790 -58672 -57797 -56917 -59380 -61839 -63206
-12806 -63206 -64570 -61645 -58717 -60561 -62402 -59954 -57502 -58013 -58519 -60461 -62398 -61955 -61508 -61064 -60617 -60516 -60412 -60312 -60207
-12787 -60207 -62014 -63817 -64194 -64566 -66217 -67864 -66176 -64484 -64704 -64920 -63709 -62495 -60666 -58832 -59388 -59939 -57722 -55502
-12769 -55502 -55669 -55833 -58594 -61351 -64112 -66869 -65278 -63683 -62092 -60498 -61254 -62007 -61332 -60654 -62215 -63773 -61996 -60215
-12751 -60215 -59239 -58262 -55856 -53449 -55125 -56802 -58479 -60155 -58277 -56400 -58814 -61228 -63791 -66355 -64626 -62897 -60431
-12734 -60431 -57964 -57882 -57800 -58017 -58233 -59879 -61526 -58501 -55476 -55789 -56102 -58054 -60006 -58620 -57234 -57502 -57767 -58035 -58300 -59194
-12714 -59194 -60084 -60978 -61869 -64060 -66247 -68437 -70624 -69030 -67431 -65837 -64238 -63970 -63698 -61999 -60297 -61429 -62558 -63691
-12696 -63691 -64820 -66139 -67454 -68773 -70088 -67800 -65509 -65606 -65699 -65472 -65244 -65017 -64790 -63519 -62249 -60978 -59708 -60487 -61265
-12677 -61265 -62044 -62823 -61932 -61042 -60151 -59261 -59704 -60148 -60591 -61034 -61269 -61504 -60308 -59112 -58706 -58300 -60755 -63210 -64950 -66690
-12657 -66690 -66999 -67308 -64618 -61929 -62100 -62271 -63218 -64164 -63680 -63195 -63098 -63002 -62547 -62092 -67033 -66250 -62010 -57771 -58173 -58575 -61839
-12636 -61839 -65103 -66429 -67756 -69082 -70408 -68970 -67532 -67525 -67517 -69566 -71615 -68896 -66176 -68363 -70546 -69872 -69194 -68191 -67185
-12617 -67185 -64753 -62316 -60666 -59011 -60222 -61429 -61984 -62536 -64522 -66504 -63452 -60397 -60207 -60014 -60867 -61716 -61139 -60557 -58460
-12598 -58460 -56359 -55692 -55021 -58169 -61314 -61601 -61884 -63504 -65125 -64779 -67294 -69570 -66124 -63214 -60304 -61932 -63560 -62327
-12580 -62327 -61094 -60755 -60416 -60077 -59738 -61522 -63307 -62230 -61154 -63743 -66332 -64153 -61973 -59995 -58017 -57469 -56921 -57596
-12562 -57596 -58270 -58944 -59619 -58572 -57525 -59339 -61154 -61239 -61325 -64272 -67219 -67744 -68270 -65934 -63598 -61977 -60356 -61597 -62838
-12543 -62838 -61448 -60058 -61530 -63002 -62148 -61295 -60442 -59589 -60621 -61653 -59823 -57994 -57834 -57674 -60077 -62480 -64104 -60960
-12525 -60960 -58888 -59678 -59902 -60125 -61958 -63791 -64358 -64924 -62629 -60334 -64477 -68620 -67994 -67368 -67286 -67204 -65691 -64179 -61385
-12506 -61385 -58590 -58657 -58724 -60863 -63002 -62279 -61556 -61996 -62435 -62875 -63314 -62812 -62305 -63233 -64156 -64399 -64637 -62018 -59395 -60174 -60949
-12485 -60949 -62681 -67271 -70136 -68229 -66325 -64417 -61813 -59205 -58628 -55185 -51269 -54026 -57622 -61213 -59950 -58683 -57420
-12468 -57420 -56154 -57961 -59764 -60140 -60513 -60259 -60002 -56888 -53769 -53903 -54034 -55599 -57160 -58642 -60122 -60174 -60222 -60721 -61217 -61716
-12448 -61716 -62212 -62383 -62551 -58430 -59075 -62495 -63050 -61046 -61899 -63560 -65218 -60382 -55543 -57502 -59458 -59987 -60513 -62160 -63803
-12429 -63803 -62290 -60774 -58248 -58579 -60643 -62703 -60863 -59019 -62424 -65826 -66817 -67804 -63549 -59291 -59417 -59540 -57879 -59075
-12411 -59075 -62510 -63080 -61150 -59216 -57547 -55874 -49436 -45856 -44872 -46746 -48624 -50498 -52748 -54999 -57249 -59499 -59186
-12394 -59186 -58873 -61422 -59201 -56683 -57025 -59753 -62480 -61630 -60781 -59753 -61586 -62543 -63501 -64637 -65773 -64764 -63754 -60360
-12376 -60360 -56966 -59235 -61504 -62163 -65684 -64883 -64082 -62029 -59976 -57294 -54611 -55267 -55923 -58605 -61288 -58724 -56161 -59194
-12358 -59194 -62227 -62696 -63165 -62592 -59157 -57510 -55863 -56187 -59373 -59220 -59067 -62312 -60788 -60338 -62748 -63318 -63888 -64816 -62882
-12339 -62882 -59250 -55617 -56754 -55029 -54835 -54641 -55997 -57353 -55490 -58397 -62614 -63970 -66071 -68173 -70274 -69514 -66280
-12322 -66280 -63046 -63925 -64805 -66317 -67830 -69164 -70498 -69954 -66548 -63203 -64626 -67718 -66042 -63352 -63523 -64410 -65297 -66362
-12304 -66362 -67428 -67528 -67625 -67726 -67823 -69354 -70881 -70624 -70364 -72252 -68415 -66370 -64320 -63885 -63445 -64440 -65431 -63855 -62275 -59268
-12284 -59268 -56258 -58378 -60494 -59276 -58054 -57312 -56567 -59164 -61757 -61970 -62178 -64775 -67368 -62893 -58419 -58832 -59246 -61627
-12266 -61627 -58285 -57148 -61735 -64294 -63993 -64227 -64462 -62789 -61116 -58013 -54909 -56485 -58061 -61068 -64075 -62908 -61742
-12249 -61742 -62007 -62271 -61001 -59730 -60844 -61958 -61671 -61385 -61098 -60811 -62104 -63393 -62480 -61563 -62081 -65457 -68061 -64939 -64428
-12230 -64428 -63914 -63046 -62174 -62618 -63057 -63501 -63940 -64622 -65300 -62644 -59984 -58847 -57707 -60863 -64015 -64041 -64063 -62659 -61250 -60263
-12210 -60263 -59272 -59715 -60155 -59272 -58385 -59887 -61385 -60293 -59198 -60490 -61779 -61426 -61068 -60714 -60356 -59496 -58631 -59201 -59768 -61828
-12190 -61828 -63885 -62607 -61325 -61508 -61686 -61869 -62048 -61046 -60040 -58799 -63277 -67074 -65144 -65364 -65580 -66262 -66940 -62376 -57808
-12171 -57808 -56761 -55710 -58002 -60289 -51910 -43527 -31452 -9836 17558 44957 45050 20349 -7597 -26002 -34634
-12156 -34634 -43263 -48319 -53371 -56042 -58710 -59533 -60353 -62607 -64857 -65472 -66083 -67532 -63255 -61686 -60118 -58192 -56265 -54190
-12138 -54190 -52115 -54689 -57264 -58348 -65155 -68624 -66370 -63370 -60371 -61306 -62241 -62104 -61966 -61828 -61690 -60449 -59209 -61306
-12120 -61306 -63404 -63974 -64544 -61776 -59008 -58683 -58359 -58035 -57711 -58959 -60207 -61455 -62703 -62014 -61325 -60636 -59946 -58311 -56675
-12101 -56675 -58378 -60081 -59190 -58300 -57409 -56519 -58475 -60431 -62387 -64343 -65673 -67003 -68333 -69663 -66791 -63918 -62476 -61034
-12083 -61034 -61023 -61012 -63385 -65759 -63940 -62119 -60300 -58479 -57406 -56329 -56686 -57040 -57502 -57961 -61403 -64842 -66973 -63378 -64078
-12064 -64078 -64775 -69298 -68098 -65826 -63553 -63337 -63121 -62905 -62689 -62547 -62405 -60833 -59261 -57063 -54865 -56005 -57145 -59559
-12046 -59559 -61973 -60095 -58218 -53598 -48978 -51511 -54045 -57175 -60304 -61049 -61794 -62987 -64179 -63940 -63702 -63225 -62744 -62268
-12028 -62268 -61787 -62890 -63989 -65092 -66191 -66489 -66783 -67081 -67375 -66958 -66537 -66120 -65699 -66630 -67558 -68489 -69417 -69544 -69667 -67409
-12008 -67409 -65148 -64827 -64503 -64183 -63858 -64104 -64346 -64592 -64835 -65453 -66068 -66686 -67301 -67174 -67044 -63579 -60110 -59388 -58661 -57938 -57212
-11987 -57212 -58546 -59876 -59779 -59678 -62923 -66168 -66075 -65982 -65472 -64961 -60159 -55356 -57022 -58687 -58922 -59157 -59123 -59090 -56672 -54254
-11967 -54254 -55107 -55960 -56813 -57666 -59086 -60505 -61925 -63344 -62111 -60878 -59645 -58411 -59503 -60595 -60256 -59917 -59738 -59555 -56992
-11948 -56992 -54425 -55736 -57044 -58356 -59663 -60215 -60762 -61314 -61861 -60744 -59622 -58505 -57383 -57908 -58430 -58955 -59477 -59406 -59332 -60692
-11928 -60692 -62048 -62051 -62051 -65393 -68732 -66798 -64861 -65311 -65759 -64607 -63456 -62305 -61154 -61344 -61534 -61724 -61914 -59779 -57644 -55509
-11908 -55509 -53374 -52163 -50953 -52603 -54254 -53970 -53687 -51973 -50260 -52331 -54403 -53613 -52823 -54052 -55282 -56511 -57741 -58970
-11890 -58970 -60200 -61429 -62659 -64749 -66835 -66064 -65289 -63504 -61716 -59932 -58143 -57633 -57119 -56608 -56094 -56686 -57275 -56437 -55595
-11871 -55595 -52271 -48944 -50390 -51832 -52473 -53110 -56612 -60110 -59417 -58721 -58028 -57331 -59082 -60829 -59719 -58605 -56649 -54689
-11853 -54689 -57502 -60312 -60889 -61463 -62040 -62614 -62662 -62707 -61325 -59939 -59302 -58661 -62793 -66921 -66638 -66351 -66068 -65781 -63083 -60382
-11833 -60382 -60546 -60706 -59872 -59034 -59630 -60222 -61355 -62484 -62186 -61884 -60844 -59801 -58762 -57718 -56232 -54742 -53255 -51765 -52707
-11814 -52707 -53646 -54589 -55528 -54295 -53058 -53255 -53449 -56113 -58773 -58575 -58374 -59160 -59943 -60729 -61511 -61806 -62096 -62391 -62681 -62886 -63087
-11793 -63087 -63292 -63493 -64723 -65952 -65751 -65550 -62875 -60200 -60565 -60930 -59946 -61824 -63881 -63076 -63255 -66295 -66116 -65937 -63344
-11774 -63344 -60751 -61019 -61288 -61049 -60811 -60751 -60692 -61012 -64194 -65587 -66981 -67003 -64164 -62934 -66474 -69343 -69350 -66615 -66742 -69492
-11754 -69492 -69380 -66288 -63195 -63083 -62972 -62860 -62748 -62338 -61929 -61519 -61109 -61455 -61802 -62148 -62495 -61411 -60326 -62104 -63881 -62774
-11734 -62774 -61668 -63423 -65177 -64250 -63322 -63825 -64328 -63892 -63452 -61586 -59715 -59458 -59198 -58941 -58680 -58497 -58311 -58128 -57942 -56835
-11714 -56835 -55725 -59388 -63046 -63046 -63043 -62864 -65542 -67182 -68817 -69384 -67085 -66198 -65308 -64242 -63173 -63002 -62826 -61046 -62122 -64808
-11694 -64808 -67491 -67375 -64395 -61955 -62372 -63866 -65356 -63870 -62379 -63754 -65125 -61970 -58810 -56906 -57860 -56709 -55554
-11677 -55554 -54760 -53963 -55613 -60122 -63024 -65922 -65747 -65569 -64142 -59850 -59973 -60092 -60036 -59976 -60122 -60267 -60114 -59961 -60524 -56318
-11657 -56318 -56046 -58635 -61932 -65229 -65844 -66459 -64749 -63039 -61627 -60215 -60204 -64961 -65785 -63747 -62692 -61638 -63266 -64894
-11639 -64894 -64689 -64484 -62849 -61213 -62826 -64440 -66053 -67666 -68381 -69097 -69812 -70527 -69693 -68858 -68024 -67189 -66086 -64984 -63881
-11620 -63881 -62778 -63225 -63672 -64119 -64566 -63165 -61765 -60364 -58963 -59768 -60572 -61377 -62182 -61168 -60155 -62003 -63851 -65520 -67189
-11601 -67189 -65997 -61943 -58791 -60408 -62025 -58873 -58762 -61511 -62353 -63195 -62249 -61303 -63218 -65133 -64455 -63776 -64529 -65282 -62808
-11582 -62808 -60334 -60721 -61109 -62629 -64149 -64238 -64328 -64641 -64954 -62405 -59857 -59365 -58873 -56951 -55029 -55800 -56571 -58773 -60971 -61206
-11562 -61206 -61440 -61675 -61906 -62372 -62838 -63303 -63765 -61161 -58557 -58814 -59067 -57864 -56660 -56888 -57111 -55908 -54704 -54932 -55155 -57841
-11542 -57841 -60528 -63214 -65896 -66407 -66917 -64566 -62212 -63203 -64194 -59641 -59857 -58821 -57786 -57048 -56310 -57584 -58859 -60312
-11524 -60312 -61765 -60684 -62465 -66750 -66265 -63978 -61690 -61966 -62241 -63203 -64164 -65125 -66086 -65267 -64447 -66489 -68530 -67413 -66295
-11505 -66295 -65177 -64060 -63072 -62085 -61098 -60107 -59060 -58013 -59827 -61638 -60531 -59425 -58318 -57208 -56698 -56187 -58538 -60885
-11487 -60885 -60982 -61079 -61176 -61269 -60949 -60628 -60308 -59984 -60826 -61668 -62510 -63348 -62640 -61932 -61224 -60513 -61653 -62789 -63929 -65066 -63642 -62215
-11465 -62215 -60792 -59365 -59484 -59600 -62581 -65557 -64514 -63467 -62424 -61377 -60453 -59525 -60032 -60535 -58538 -56537 -57402 -58262 -59402
-11446 -59402 -60539 -60248 -59954 -60945 -61932 -61493 -61049 -61515 -61981 -63877 -65773 -63467 -61161 -61716 -62271 -62051 -61832 -63043 -64253 -62961
-11426 -62961 -61668 -61806 -61943 -61720 -61496 -61273 -61049 -58203 -55356 -56623 -53121 -47935 -42749 -40126 -37503 -36460 -35416 -34552
-11408 -34552 -38457 -42559 -46661 -50882 -55103 -59145 -60326 -58348 -56370 -58162 -59954 -61746 -63538 -62290 -61042 -59794 -58546
-11391 -58546 -57920 -57290 -56664 -56034 -57197 -58356 -61127 -61034 -60952 -60867 -63467 -66064 -64969 -63870 -62595 -61317 -62383 -60584 -61649
-11372 -61649 -65572 -65922 -66269 -68586 -68039 -66012 -66843 -67498 -65289 -62964 -60636 -59920 -56340 -53140 -52801 -55263 -57726 -60487
-11354 -60487 -60386 -59034 -57681 -56195 -54708 -54473 -57100 -58952 -60803 -64443 -65222 -65509 -65796 -64950 -61243 -58728 -60982 -63236
-11336 -63236 -65490 -65151 -64812 -66083 -64492 -61768 -59045 -59004 -58963 -58683 -58404 -58125 -57845 -56493 -55140 -56828 -58516 -57610 -59566
-11317 -59566 -61522 -60617 -62215 -63814 -65233 -66653 -68653 -70654 -68184 -65714 -64197 -67450 -70703 -69186 -67998 -66809 -68184
-11300 -68184 -69559 -72305 -75050 -74935 -74819 -74547 -74275 -71142 -68009 -67618 -67226 -66835 -66444 -65636 -64827 -64019 -63210 -62581 -61951 -64183
-11280 -64183 -66414 -66098 -65777 -65460 -65140 -64466 -63788 -63113 -62435 -65039 -67640 -67383 -67122 -66627 -66127 -65632 -65133 -64235 -63333 -65297 -67256
-11259 -67256 -67908 -68557 -69209 -69857 -71820 -73780 -73836 -69119 -65658 -65054 -64156 -60394 -59779 -59160 -61228 -63292 -61962 -60628 -59298
-11240 -59298 -57964 -58616 -59265 -59917 -60565 -58534 -56500 -59239 -61973 -62536 -63095 -63657 -64216 -67938 -71656 -70609 -69559 -68609 -67655
-11221 -67655 -69566 -71474 -71299 -71120 -70945 -70766 -70777 -70788 -67938 -65088 -63013 -60937 -61724 -62510 -62327 -62145 -64823 -67502 -68750 -69998
-11201 -69998 -71246 -72495 -71708 -70922 -72819 -69946 -69160 -68374 -67290 -66206 -66068 -65930 -68653 -66608 -65099 -66452 -67506 -65699
-11183 -65699 -65900 -66098 -66116 -66135 -63352 -60569 -57786 -55002 -54399 -53792 -56046 -58300 -59540 -60781 -62022 -63262 -63855 -64447 -65039
-11164 -65039 -65628 -64671 -63709 -65613 -62744 -60513 -61142 -62845 -67405 -69734 -69197 -70453 -71705 -70647 -69589 -67100 -64611 -67010
-11146 -67010 -69410 -70438 -65740 -64197 -65516 -66299 -67081 -66314 -65546 -66209 -66869 -64477 -62081 -62551 -63016 -61250 -59481 -57711 -55941
-11127 -55941 -55144 -54343 -53546 -52745 -54093 -55438 -56783 -58128 -57197 -56265 -57301 -55476 -53173 -56593 -61087 -62718 -64738 -66757
-11109 -66757 -65736 -64715 -64291 -63866 -63441 -63016 -63978 -64939 -65900 -66861 -66630 -66399 -66168 -65937 -64276 -62614 -60952 -59291 -59775 -60259
-11089 -60259 -60744 -61228 -60636 -60040 -59447 -58851 -59362 -59868 -63240 -66608 -66038 -65464 -66325 -67182 -63542 -59898 -59060 -61079 -62752 -58698
-11069 -58698 -59239 -65498 -68363 -65501 -66221 -66936 -69749 -72558 -70602 -68642 -68355 -68065 -67599 -67130 -65054 -60118 -56433 -58471
-11051 -58471 -63788 -69104 -68102 -67100 -66820 -66541 -66262 -65982 -66716 -67450 -65323 -63195 -63341 -63486 -66493 -69499 -67647 -65796 -63408
-11032 -63408 -63881 -65896 -62189 -62953 -66578 -66776 -64112 -60196 -59142 -59876 -60606 -62946 -65285 -65841 -66392 -66943 -67495 -70226 -72953
-11013 -72953 -72819 -72685 -73538 -74387 -72375 -70364 -70058 -69749 -68009 -66269 -63639 -61005 -59801 -58598 -59030 -59458 -59887 -60315 -60122
-10994 -60122 -59924 -59727 -59529 -60964 -62394 -63825 -65256 -65110 -64961 -66243 -67525 -71023 -74518 -71336 -68154 -66735 -65311 -65319 -65326
-10975 -65326 -66016 -66701 -65956 -65211 -66168 -67122 -68076 -69030 -67215 -65397 -65010 -64622 -64238 -63851 -62510 -58307 -55431 -57320 -55990 -57521
-10955 -57521 -59086 -57786 -59347 -63769 -65900 -65166 -66221 -67275 -64011 -60744 -60338 -59932 -61820 -63706 -64160 -64615 -65043 -65468
-10937 -65468 -65893 -66317 -65285 -64250 -66075 -67901 -67256 -66608 -64529 -62450 -61370 -60289 -59209 -58128 -59283 -60438 -58732 -57025
-10919 -57025 -57137 -57249 -57361 -57473 -60505 -63538 -63709 -63881 -65680 -67480 -66418 -65356 -63400 -61444 -62350 -63255 -63504 -63754 -64004
-10900 -64004 -64253 -65606 -66958 -63542 -60125 -61385 -62640 -62465 -62290 -62387 -62480 -65434 -68389 -65788 -63184 -63441 -63698 -64227 -64753
-10881 -64753 -62417 -60081 -61470 -62856 -65673 -68489 -68359 -68225 -68091 -67957 -66723 -65487 -67111 -68735 -69738 -70736 -70304 -69872
-10863 -69872 -67294 -64715 -64998 -65282 -66310 -67338 -68367 -69395 -70706 -72018 -70468 -68918 -64924 -60930 -61705 -62480 -63225 -63970
-10845 -63970 -63762 -60692 -58486 -61049 -65341 -69633 -68679 -64864 -61407 -62718 -64060 -65401 -67040 -68679 -66146 -63609 -65844
-10828 -65844 -68076 -67718 -67357 -65569 -63776 -63322 -62864 -62409 -61951 -62391 -62826 -61835 -60841 -62752 -64659 -63709 -62756 -64518 -66276 -68039
-10808 -68039 -69797 -69570 -69339 -69112 -68881 -69041 -69197 -67927 -66653 -64611 -62566 -65293 -68016 -66601 -65181 -63765 -62346 -63791
-10790 -63791 -65233 -63519 -61802 -63009 -59443 -55882 -57085 -59097 -61105 -63415 -65721 -65408 -65092 -64779 -64462 -64551 -64637 -64727 -64812 -63918
-10770 -63918 -63020 -64987 -66951 -66228 -65505 -63352 -61195 -61455 -61716 -62335 -57227 -57204 -57182 -59663 -62141 -61642 -61142 -60643 -60140 -60099 -60058
-10749 -60058 -60017 -59973 -60915 -61858 -59939 -58017 -59466 -60915 -63795 -66671 -68121 -69570 -68158 -66742 -66679 -66612 -67975 -69339 -66742
-10730 -66742 -64142 -64402 -64663 -66522 -68378 -64153 -65650 -65006 -64358 -65498 -66638 -66813 -66984 -68586 -70188 -64820 -59447 -58844
-10712 -58844 -58240 -59294 -60345 -61038 -61731 -66779 -66101 -63873 -61645 -61984 -62323 -59801 -57275 -57167 -57059 -56951 -56839 -57238 -57637 -56604
-10692 -56604 -55569 -55699 -55830 -58821 -61809 -64186 -66563 -66079 -65591 -64928 -64265 -63601 -62934 -61049 -59164 -56921 -60397 -63370 -66343
-10673 -66343 -66813 -67279 -67539 -67800 -69492 -71183 -71027 -70870 -69283 -67696 -66139 -64581 -63024 -61467 -59760 -58054 -61116 -64179
-10655 -64179 -64764 -65349 -65934 -66519 -67521 -68523 -66664 -64805 -63519 -62234 -63810 -65386 -64279 -63173 -62066 -60960 -61940 -62920
-10637 -62920 -61038 -59153 -61236 -63318 -62540 -61757 -61105 -60453 -58370 -56284 -55602 -54920 -54239 -53553 -52860 -52167 -54336 -56500 -55807
-10618 -55807 -55114 -57283 -59447 -59872 -60297 -60721 -61142 -61806 -62469 -60271 -58069 -56210 -54350 -52491 -50628 -53866 -57104 -58911
-10600 -58911 -60714 -58870 -57025 -59950 -62871 -63709 -64548 -62525 -60498 -59719 -58941 -56731 -54518 -58538 -62558 -61809 -61057 -58862
-10582 -58862 -56668 -57335 -57998 -60334 -62670 -62145 -61616 -59727 -57838 -58810 -59783 -61530 -63277 -67886 -72495 -71530 -70565 -69600 -68635
-10563 -68635 -71127 -73620 -71343 -69067 -67476 -65885 -64294 -62703 -63795 -64887 -65978 -67070 -64481 -61891 -59302 -56713 -56150
-10546 -56150 -55587 -55025 -54462 -56910 -59358 -61806 -64253 -63244 -62234 -61224 -60215 -60360 -60505 -60651 -60796 -62551 -64306 -63199
-10528 -63199 -62092 -62886 -63680 -64473 -65267 -65226 -65185 -65144 -65103 -62312 -59522 -59592 -59663 -60002 -60341 -62111 -63881 -62327 -60770 -62078 -63382
-10507 -63382 -64063 -64741 -66139 -61809 -60598 -65107 -69261 -67688 -65583 -63475 -61012 -58546 -58341 -58132 -57927 -57718 -57156 -56590 -56027
-10488 -56027 -55461 -56821 -58177 -59537 -60893 -61657 -62417 -63180 -63940 -61675 -59406 -57137 -54868 -57253 -59633 -62014 -64395 -62309
-10470 -62309 -60218 -58128 -56038 -55919 -55796 -55673 -55550 -53706 -51858 -52871 -53885 -57406 -60923 -62890 -59134 -61090 -63043 -64637
-10452 -64637 -66232 -65207 -64179 -63151 -62122 -64037 -65949 -63270 -60591 -60688 -63642 -66954 -64544 -62323 -62961 -64492 -66023
-10435 -66023 -67558 -69089 -67759 -66429 -66742 -67051 -66109 -65166 -65718 -69127 -71284 -67718 -67785 -67849 -66124 -64399 -67029 -69656 -69421
-10416 -69421 -69186 -65256 -61321 -58821 -56318 -56500 -56679 -58292 -59902 -62633 -65360 -65229 -65095 -63832 -62566 -62733 -62897 -62312 -61724
-10397 -61724 -61139 -60550 -62797 -65039 -64425 -63806 -64130 -64451 -61914 -59373 -59458 -59540 -62487 -65431 -67800 -70170 -65863 -61552 -60256
-10378 -60256 -58959 -57663 -56362 -56660 -56958 -59224 -55762 -54064 -55226 -55494 -58620 -64589 -67696 -67823 -67946 -68430 -68914 -67968 -67018
-10359 -67018 -64864 -62711 -61988 -61262 -60539 -59816 -60524 -61228 -61366 -61504 -60211 -58918 -59592 -60267 -60941 -61616 -60367 -59119 -57871 -56623
-10339 -56623 -57879 -59134 -60390 -61645 -64142 -66634 -69130 -71623 -70900 -70173 -69451 -68724 -66288 -63847 -61411 -58970 -58560 -58147
-10321 -58147 -57737 -57324 -58765 -60204 -61824 -63441 -61724 -62864 -62756 -56921 -56351 -55777 -54850 -53918 -56686 -59451 -59358 -59261 -60677
-10302 -60677 -62089 -63504 -64917 -64514 -64108 -63706 -63300 -62361 -61418 -59049 -56675 -60237 -63795 -64496 -65192 -67182 -69171 -68299 -67424
-10283 -67424 -65449 -63475 -62931 -62383 -63337 -64291 -62383 -60472 -60829 -61187 -64406 -67621 -67264 -66902 -65110 -63318 -62513 -61705 -62864
-10264 -62864 -61161 -57450 -59458 -62540 -62759 -61731 -60699 -62350 -64000 -64905 -65811 -66358 -66906 -67573 -62517 -60323 -63851 -65345
-10246 -65345 -66839 -68691 -70542 -69890 -69238 -68586 -67934 -69328 -70721 -69253 -67785 -68434 -69082 -69730 -70378 -69641 -68903 -66735 -64566
-10227 -64566 -65080 -65595 -63247 -60900 -61616 -62331 -61616 -60900 -58784 -56668 -57413 -58158 -58069 -57979 -60751 -63523 -63225 -62927 -64060 -65192
-10207 -65192 -64551 -63911 -63270 -62629 -63627 -64626 -65624 -66623 -68113 -69603 -71094 -72584 -68262 -63940 -64387 -64835 -63773 -62707 -63072
-10188 -63072 -63437 -63925 -64410 -62033 -59656 -61068 -62476 -64958 -67439 -71593 -70021 -68806 -67592 -66168 -64741 -64745 -64749 -63087 -61422
-10169 -61422 -62618 -63814 -62092 -60367 -60073 -59779 -59280 -58777 -61135 -63493 -62003 -60509 -59376 -58240 -53918 -55315 -54928 -54537
-10151 -54537 -58605 -62670 -67096 -65796 -64499 -63199 -64406 -65610 -64093 -62577 -59630 -56683 -58832 -60982 -63132 -65282 -63654
-10134 -63654 -62025 -63259 -64492 -64533 -64574 -64615 -64656 -63981 -63307 -59771 -56232 -58508 -60785 -61452 -62115 -64682 -64387 -62841 -61291 -60192
-10114 -60192 -59093 -57994 -56891 -58166 -59436 -59633 -56970 -56545 -58978 -59443 -59909 -63389 -64004 -64618 -65233 -64332 -60565 -59481 -61258
-10095 -61258 -64488 -64853 -64145 -63437 -63627 -63814 -63821 -63829 -64764 -62834 -62513 -62193 -62323 -62450 -65438 -68426 -68989 -69548 -71537 -73527 -71645
-10074 -71645 -69760 -69484 -69209 -66314 -66276 -69100 -69063 -66228 -63389 -60192 -59857 -58072 -56288 -57543 -58799 -56567 -54336 -55084 -58695
-10055 -58695 -61560 -61563 -60494 -59425 -60144 -60863 -56992 -53121 -51947 -53635 -53713 -53792 -54824 -55856 -54026 -52197 -51508 -50818 -51381 -54805
-10035 -54805 -56083 -57361 -55956 -54552 -54384 -54216 -52439 -53523 -57052 -60580 -61247 -61914 -61768 -58762 -53609 -55133 -57372 -59611
-10017 -59611 -55889 -55029 -56977 -58926 -58370 -57815 -57320 -59686 -62230 -61914 -61165 -63277 -60740 -58203 -58438 -58672 -57297 -58784 -58322
-9998 -58322 -57860 -55789 -59436 -60584 -61731 -60375 -59015 -59045 -59075 -57674 -56269 -55882 -55494 -56537 -57577 -58359 -59142 -59924 -60703 -63542
-9978 -63542 -66381 -64451 -62517 -62882 -63247 -63613 -63974 -61120 -58266 -55770 -53270 -50655 -53758 -56508 -59253 -58128 -56999 -58736
-9960 -58736 -60468 -61936 -63400 -60099 -56794 -59812 -62826 -62983 -63136 -65691 -68244 -66031 -63814 -61869 -59920 -60837 -61750 -60453
-9942 -60453 -59153 -59287 -59417 -62681 -65941 -66343 -66742 -65170 -63594 -62022 -60446 -58635 -56821 -55010 -53195 -50230 -47260 -49064
-9924 -49064 -50863 -52786 -54704 -56627 -58546 -56757 -54965 -56038 -57107 -57435 -57759 -59518 -61273 -62197 -63117 -64041 -64961 -64484 -64004
-9905 -64004 -63527 -63046 -63672 -64294 -67782 -71265 -70043 -68817 -67595 -66370 -64365 -62357 -60353 -58344 -58575 -58803 -59034 -59261 -59514
-9886 -59514 -59764 -61448 -63128 -61742 -60353 -61828 -63300 -64186 -65069 -61545 -58017 -54850 -57402 -56441 -55476 -58236 -56224 -54213
-9868 -54213 -56970 -59373 -61772 -64469 -67167 -67044 -66917 -66791 -66664 -66273 -65878 -65483 -65088 -63892 -62692 -62923 -63154 -63240 -63322 -65788
-9848 -65788 -68255 -69048 -69838 -68244 -66649 -66012 -65371 -67115 -68858 -67372 -65885 -65829 -65770 -69767 -73765 -70609 -70311 -75471 -75863
-9829 -75863 -67372 -63646 -62487 -61329 -61899 -62465 -61612 -60759 -58475 -56187 -57420 -58654 -59887 -61116 -61783 -62450 -63117 -63780 -63732
-9810 -63732 -63683 -61250 -55952 -53795 -56407 -58542 -60673 -62212 -63750 -62905 -62055 -61142 -60230 -60747 -61262 -60677 -60092 -61891 -63687
-9791 -63687 -62476 -61265 -60054 -58840 -58076 -57312 -55118 -52920 -54309 -55699 -54704 -53706 -55692 -57677 -58233 -58784 -57771 -56754
-9773 -56754 -57171 -60446 -62979 -60740 -58981 -57219 -59082 -60941 -62804 -64663 -60982 -57297 -56001 -54701 -54798 -54891 -54988 -55081 -55476
-9754 -55476 -55867 -56083 -56295 -55602 -52044 -49623 -51966 -56429 -58028 -59153 -60274 -60777 -61280 -58445 -55610 -56709 -57808 -56523
-9736 -56523 -55237 -55599 -55960 -58706 -61452 -59876 -58300 -56724 -55148 -55971 -56794 -54280 -51765 -52290 -52815 -51910 -51005 -52074 -53143
-9717 -53143 -54213 -55282 -56262 -57242 -58221 -59201 -59272 -59339 -59410 -59477 -58475 -57469 -55036 -52599 -53698 -54794 -54462 -51266 -51709 -56917
-9697 -56917 -56884 -56847 -57223 -57596 -56541 -55483 -56277 -57066 -60244 -63419 -63810 -64197 -63158 -62115 -64831 -67543 -65013 -62480 -63002 -63519
-9677 -63519 -61653 -59786 -60129 -60468 -60807 -61146 -61198 -61247 -61295 -61344 -60978 -60610 -59764 -61779 -65643 -64738 -64309 -63877 -62435 -60993 -59552
-9656 -59552 -58106 -57834 -57562 -57290 -57014 -56742 -56470 -56198 -55923 -57469 -59011 -60557 -62100 -64719 -67335 -67569 -67800 -71239 -74674
-9637 -74674 -73821 -72964 -70501 -68035 -68910 -69782 -68378 -66973 -65092 -67979 -69048 -67256 -67372 -67487 -64197 -60908 -61135 -66131 -64332
-9618 -64332 -62532 -63415 -64298 -64417 -64533 -64648 -64764 -66940 -69112 -68899 -68687 -64686 -60680 -60014 -59347 -60114 -60878 -61642 -62405 -62569 -62730
-9597 -62730 -63247 -63765 -63452 -68858 -71224 -70729 -69611 -68489 -70170 -71850 -71686 -65796 -63899 -64864 -66485 -68102 -67513 -66925 -66995
-9578 -66995 -67063 -67130 -67197 -65725 -64250 -62774 -61299 -58784 -56265 -57085 -57905 -58523 -59142 -59760 -60375 -61202 -62029 -62856 -63680 -65036 -66392
-9557 -66392 -67748 -69100 -69622 -70144 -70665 -71183 -71321 -71459 -71597 -71731 -71153 -70576 -68568 -66556 -67960 -69365 -67431 -65494 -63024
-9538 -63024 -60554 -60647 -60736 -62823 -67767 -71936 -70382 -69309 -68232 -66798 -65364 -65334 -65300 -65267 -65233 -63713 -62189 -64958 -67726 -69466
-9518 -69466 -71206 -70561 -69916 -67305 -64693 -64466 -64238 -66947 -69656 -69026 -68396 -68631 -68866 -68743 -68620 -69056 -63769 -62476 -64045 -65941
-9498 -65941 -67837 -68482 -69127 -68072 -67018 -63579 -60140 -58162 -56183 -55278 -60095 -58382 -56664 -55304 -53944 -53572 -53195 -55204
-9480 -55204 -57212 -59343 -61470 -63478 -59764 -58497 -57227 -59891 -62554 -62871 -63184 -66835 -70486 -69551 -68612 -67674 -66735 -67543 -68348
-9461 -68348 -69153 -69957 -69693 -69425 -69156 -68888 -68359 -67826 -67651 -67476 -64831 -67905 -69369 -67972 -68784 -69592 -67837 -66083 -65703 -65319
-9441 -65319 -66366 -67413 -67759 -68102 -68445 -68788 -67733 -66675 -67048 -67420 -67543 -67662 -70166 -72670 -74670 -76667 -76101 -75535 -73150
-9422 -73150 -67901 -61046 -59909 -60297 -60680 -59995 -59306 -63985 -68661 -67141 -65617 -68747 -71872 -73571 -75267 -72204 -69138 -67506
-9404 -67506 -65870 -66951 -68027 -66723 -65416 -63560 -61701 -59846 -57987 -59112 -60233 -61358 -62480 -61880 -61280 -59250 -57219
-9387 -57219 -57096 -56973 -59831 -62689 -63311 -58210 -54719 -54090 -53490 -52890 -52469 -52048 -51053 -50058 -49064 -48069 -44392 -40714 -34831 -23226
-9367 -23226 -12097 1892 24049 46205 63891 72039 69040 66041 58325 38214 13333 -6777 -19590 -32399
-9353 -32399 -43419 -47763 -50874 -53982 -58281 -59719 -58687 -57651 -55662 -50811 -50286 -49757 -52387 -55017 -57115 -59209 -57011
-9336 -57011 -54812 -56128 -57439 -57320 -57201 -56787 -56370 -55952 -55535 -56463 -57387 -59924 -59596 -61537 -63475 -63806 -64134 -64980 -65822 -66071
-9316 -66071 -63456 -61113 -61627 -63396 -62301 -62864 -63423 -63806 -64186 -64570 -64950 -65334 -65714 -66873 -68027 -67756 -67480 -67953 -68422 -67346
-9296 -67346 -63404 -62581 -64615 -63311 -59145 -57249 -58210 -60423 -59775 -59876 -59973 -61321 -62670 -65453 -68232 -68627 -69022 -68750 -68478
-9277 -68478 -71366 -74249 -74633 -72156 -69082 -66004 -64391 -65639 -67960 -73139 -74864 -76589 -76109 -75624 -74913 -74197 -77595 -80993
-9259 -80993 -81384 -78910 -74708 -70505 -68914 -67320 -65904 -64488 -64626 -67621 -69007 -67532 -68326 -66258 -64011 -64622 -64045 -63467
-9241 -63467 -63247 -63024 -62372 -64581 -66314 -68042 -69536 -66262 -64894 -60662 -57413 -54164 -50737 -47305 -44503 -41702 -47007 -52309
-9223 -52309 -58821 -65334 -67554 -69771 -72409 -75047 -73393 -71735 -72603 -73471 -70047 -66619 -67130 -67640 -67674 -64842 -61463 -62852
-9205 -62852 -67282 -68847 -69462 -70077 -66399 -62718 -63724 -67588 -69365 -66373 -62193 -60870 -61932 -62994 -63270 -63542 -62383 -61224
-9187 -61224 -60934 -60639 -61776 -62912 -61779 -60643 -59507 -58370 -55599 -52823 -55293 -57763 -59015 -60263 -60081 -59898 -60464 -61027
-9169 -61027 -61888 -62748 -60591 -63199 -66466 -69730 -70703 -71671 -71213 -70751 -70360 -69965 -66235 -62502 -62260 -62014 -63203 -64387 -64421 -64451
-9149 -64451 -64484 -64514 -66783 -69048 -67979 -66906 -64116 -61321 -62823 -64320 -63885 -63445 -63009 -62569 -61098 -59626 -59585 -59540 -59052 -58564
-9129 -58564 -61414 -64261 -61701 -59142 -59920 -60695 -59596 -58497 -57398 -56295 -53259 -50222 -53385 -56545 -57622 -58698 -58344 -57987
-9111 -57987 -57499 -57011 -56523 -56031 -52771 -49511 -46251 -42987 -45260 -47529 -46936 -46344 -48497 -50647 -52797 -54947 -56623 -58296
-9093 -58296 -57107 -55919 -56642 -57361 -55576 -53792 -52029 -55986 -56724 -57461 -56891 -56318 -55744 -55170 -57953 -60733 -60651 -60569 -58613 -56653
-9073 -56653 -57555 -58456 -59559 -60658 -60151 -59641 -57942 -53378 -51977 -56295 -56236 -56172 -57901 -59626 -58970 -58311 -57655 -56996 -56381 -55762
-9053 -55762 -53717 -51668 -51858 -52044 -47465 -42883 -40882 -38878 -34016 -29150 -25063 -20972 -16885 -12794 -2876 7044 21794
-9036 21794 33683 47893 67829 87527 110086 136829 163576 195271 236503 293231 374760 492533 669441
-9023 669441 926857 1273932 1681096 2093982 2444392 2708965 2790651 2603371 2247164 1793676 1319680
-9012 1319680 923895 641129 448022 322157 240165 185241 147489 118082 94397 81797 74923 69957 64990
-8999 64990 60870 56753 47867 38981 26098 13218 3200 -6818 -9247 -11673 -14098 -16523 -18356 -20186 -22015 -23844
-8983 -23844 -25126 -26404 -30543 -34682 -38468 -42249 -43170 -44090 -44630 -45167 -45707 -46243 -43982 -41717 -42316 -42913 -43155 -43393 -43993 -38866
-8963 -38866 -35562 -32253 -26981 -21706 -15368 -6166 7145 26183 53564 86670 117865 143342 161736 166780 158647
-8948 158647 137165 109509 78995 52472 25952 4138 -11948 -20767 -29582 -36523 -43460 -47540 -51616 -50196 -48773
-8933 -48773 -48784 -48792 -49518 -50241 -52398 -54552 -54757 -54958 -55163 -55364 -56821 -58274 -56869 -55461 -56254 -57044 -56407 -55766 -55457 -55144 -54835
-8912 -54835 -54522 -57998 -61474 -60181 -58888 -58967 -59045 -60554 -62063 -60330 -58598 -58296 -57994 -57573 -57152 -53870 -50587 -52342 -54097
-8893 -54097 -52991 -51884 -56142 -60401 -64659 -68918 -65829 -62741 -60010 -57279 -55859 -60163 -64645 -63404 -60882 -61217 -59585
-8876 -59585 -57953 -57338 -56720 -56102 -55483 -54034 -52581 -51128 -49675 -48732 -47786 -46839 -45893 -48605 -51314 -52592 -53870 -55151 -56429
-8857 -56429 -54846 -53263 -53188 -53110 -54462 -55815 -57827 -59835 -60412 -60990 -60975 -60960 -60945 -60926 -61239 -61552 -58527 -55498 -54172 -52845 -52950
-8836 -52950 -53050 -51873 -50696 -49697 -48695 -48319 -50804 -56508 -56485 -54887 -56150 -57830 -59507 -57968 -56429 -56321 -56210 -52853 -49496
-8817 -49496 -49716 -55654 -59995 -58609 -60800 -62990 -59581 -56169 -58002 -59835 -61068 -62297 -63527 -64756 -63903 -63046 -66124 -69201
-8799 -69201 -69548 -64168 -62007 -59846 -61057 -62264 -62040 -61817 -62051 -62282 -61083 -59883 -59850 -59812 -59775 -59738 -61407 -63072 -62353 -61634 -57849
-8778 -57849 -54060 -53609 -53158 -52577 -51992 -54745 -57499 -57573 -57644 -55688 -53732 -51571 -55129 -57853 -60576 -62618 -64656 -66694 -68732
-8759 -68732 -70222 -71708 -72778 -70986 -65293 -65319 -66239 -67159 -66161 -65162 -65595 -66023 -69943 -73862 -72536 -71206 -67987 -64768 -59581
-8740 -59581 -57253 -59697 -56418 -56537 -56653 -57949 -59246 -57204 -55159 -55889 -56619 -61642 -66660 -68001 -69343 -68299 -67253 -64302
-8722 -64302 -61351 -61560 -61765 -63989 -63348 -59253 -55155 -53266 -54235 -54850 -55461 -56038 -53751 -54507 -55260 -57089 -58914 -59015 -56251
-8703 -56251 -54615 -52976 -55274 -57569 -55755 -51076 -49559 -50900 -51120 -48475 -50006 -51534 -51217 -50897 -51355 -54671 -56701 -58728
-8685 -58728 -60461 -57420 -53788 -53013 -53374 -50871 -50353 -49831 -45975 -42115 -43326 -47395 -51288 -55178 -58654 -62126 -66854 -66809
-8667 -66809 -60956 -55099 -50558 -43151 -41038 -38922 -33948 -26110 -23312 -20510 -15924 -14195 -20268 -26341 -32413 -38486 -46228
-8650 -46228 -51109 -52830 -51690 -51936 -49321 -49865 -53270 -53874 -54477 -57763 -56280 -55833 -52525 -50528 -48531 -50111 -51690 -49753
-8632 -49753 -43047 -38665 -34284 -32943 -31601 -33896 -36191 -38665 -38278 -39798 -41318 -40096 -34105 -30975 -27846 -25849 -23852
-8615 -23852 -23062 -22272 -21661 -18189 -19485 -20782 -21244 -16937 -15834 -14731 -16967 -22063 -27697 -33330 -39559 -39112 -36571 -34030
-8597 -34030 -33039 -32048 -35677 -32630 -29045 -25461 -21676 -17891 -14105 -10316 -5816 -1315 3185 7689 17145 26601 33672
-8580 33672 40747 46716 52684 57580 62479 65624 74491 83120 91752 89412 81350 69353 57360 43813 30267 18866
-8564 18866 17007 18244 25204 30971 42465 51224 65706 73034 80366 81197 82028 77613 78924 79904 86607 88660 96439
-8547 96439 105705 114971 120302 125637 122646 119654 115828 117728 118551 119374 120079 126509 129717 138647 139113 145305 150957 156609
-8529 156609 153915 151225 139121 132742 122906 126423 137090 164929 200159 252557 309497 375978 434472 492966
-8515 492966 528565 558445 576999 608906 655667 750121 889403 1103079 1360149 1657281 1943922 2224840
-8503 2224840 2489317 2782410 3137023 3676668 4453682 5602674 7206143 9505870 12811128 17793130
-8493 17793130 25130016 35021125 45361464 53536723 56257791 51877012 42930442 32127819 22542216
-8484 22542216 15537544 10904984 7926276 6065161 4850708 4039742 3455775 3031566 2708459 2495751
-8474 2495751 2361253 2293043 2230555 2137711 1966656 1754828 1514386 1289025 1084648 919614 783194 687432
-8462 687432 620288 588847 570762 565788 557957 549466 527626 499746 462333 421697 375341 331754 288171 257758
-8448 257758 230210 213150 201817 190658 173781 156602 139426 124274 109125 95433 81745 68053 54365
-8435 54365 41835 29309 23933 18561 20084 21608 24920 22510 19801 17093 14861 6907 1098 -4709 -1814 1080
-8419 1080 6508 11936 18616 22435 23847 19537 9205 -6848 -22574 -44023 -66247 -85609 -94525 -97718 -92982 -88247
-8403 -88247 -81664 -75080 -71835 -68590 -67752 -66914 -61187 -55457 -46214 -42693 -37503 -35171 -35778 -33524 -26501 -25197 -25268 -25338 -24336
-8384 -24336 -23330 -26825 -30320 -35245 -40167 -39965 -39764 -38311 -39716 -43181 -52368 -60125 -65017 -67528 -70039 -66172 -62301
-8367 -62301 -59276 -56247 -55606 -54961 -56109 -57253 -59831 -62405 -60647 -58885 -55695 -52502 -51519 -50532 -53840 -57145 -61291 -65434
-8349 -65434 -62428 -59417 -55397 -51374 -50692 -50006 -47924 -45837 -40416 -34992 -32045 -29094 -33300 -37503 -36195 -34884 -33576
-8332 -33576 -32264 -32030 -31791 -31557 -31318 -31724 -32127 -36825 -41519 -44459 -47395 -46042 -44686 -42551 -40413 -42570 -44723 -47953
-8314 -47953 -51180 -49164 -47145 -42462 -37775 -40245 -42711 -50785 -58855 -62636 -66414 -65434 -64455 -56321 -48188 -44883 -41579
-8297 -41579 -38274 -34969 -34802 -34634 -34466 -34299 -33118 -31937 -32186 -32436 -33505 -34574 -32305 -30036 -30808 -31579 -35331 -39083 -46970
-8278 -46970 -49134 -50226 -51318 -49101 -46884 -44667 -42451 -38751 -35048 -35636 -36225 -37324 -38419 -40588 -42756 -44034 -39585
-8261 -39585 -35018 -30450 -27674 -24895 -19135 -13375 -12962 -18267 -21784 -25301 -24530 -23755 -25364 -26974 -26695 -26411 -27499 -31449
-8243 -31449 -34567 -31959 -26072 -23047 -23923 -27659 -31039 -34418 -35353 -30566 -25659 -20752 -11315 -1878 8274 24149 38892
-8226 38892 47912 51626 55341 55501 58522 72811 96636 129881 172663 225102 283264 333245 383225 444770 512037
-8211 512037 583597 679955 843316 1096332 1435557 1879698 2534386 3572498 5220548 7744168 11185324
-8200 11185324 13766174 12756457 9493911 6437381 4233534 2808564 1934880 1393110 1055454 858714
-8190 858714 724924 622847 545572 487548 446692 420620 404089 402144 386846 351162 305943 262568 219193
-8177 219193 182734 146278 118301 96048 79040 71570 70389 69208 68623 68038 58675 49313 38519 27726 14250
-8162 14250 774 -4594 -9962 -12321 -14679 -17038 -19396 -22976 -26557 -27753 -28949 -34079 -39209 -41001 -42793 -45152 -47510
-8145 -47510 -49868 -52227 -55226 -58221 -55975 -53725 -51508 -49287 -48501 -47711 -50740 -53766 -55364 -56958 -54324 -51687 -49052
-8128 -49052 -46415 -45211 -44004 -42801 -41594 -45040 -48482 -53359 -58233 -61768 -65300 -66452 -67599 -66247 -64890 -63538 -62182
-8111 -62182 -64130 -66079 -68027 -69976 -64890 -59805 -54719 -49634 -49265 -48896 -48527 -48158 -50412 -52666 -50628 -48590 -45670 -42745
-8093 -42745 -43162 -43576 -45453 -47327 -46821 -46310 -48181 -50047 -51918 -53784 -54105 -54421 -52357 -50289 -47551 -44809 -42067 -39325
-8075 -39325 -37361 -35394 -33427 -31460 -32104 -32745 -34817 -36888 -40066 -43240 -43553 -43866 -47823 -51776 -50960 -50144 -47663 -45178
-8057 -45178 -45554 -45930 -44194 -42454 -43576 -44697 -44392 -44082 -40733 -43106 -42436 -44623 -45558 -46493 -44570 -42644 -41076 -39507 -38747
-8038 -38747 -43706 -44254 -39079 -32536 -31713 -34347 -36981 -38308 -45357 -46027 -43833 -39377 -34921 -30286 -25648 -23442 -21236 -13904
-8020 -13904 -6568 2909 18110 44696 74148 103983 133819 163595 183833 186426 175666 151792 118380 82494
-8006 82494 52330 25803 4999 -8442 -19023 -24180 -29336 -31560 -33785 -34578 -35372 -38013 -40655 -41866 -43076 -48818
-7990 -48818 -54559 -53624 -52689 -53751 -54812 -53371 -51929 -45275 -44343 -46631 -43196 -40416 -43360 -44157 -44954 -45573 -46191 -45379 -44567
-7971 -44567 -43546 -42525 -44366 -46206 -48956 -51705 -53024 -54343 -52890 -51437 -54753 -58069 -58374 -58680 -58985 -59291 -59090 -58888
-7953 -58888 -60774 -56936 -52149 -52130 -53840 -55546 -57107 -58669 -60230 -61787 -61679 -61571 -58601 -55628 -51586 -47544 -46363 -45178
-7935 -45178 -44895 -44611 -44149 -43684 -45338 -44131 -40718 -42071 -44380 -51459 -51087 -47849 -49772 -51694 -52007 -52316 -51266 -50215 -50595
-7916 -50595 -50975 -51981 -52987 -55900 -55952 -54261 -57338 -58985 -55863 -51340 -49678 -48971 -48263 -47026 -45789 -41869 -37950 -36594
-7898 -36594 -38099 -40975 -39083 -36549 -38784 -40901 -43017 -42719 -42421 -44984 -47547 -49865 -52178 -53065 -53948 -53792 -53631 -50912
-7880 -50912 -48188 -43695 -43967 -46329 -48687 -51705 -54719 -57737 -60751 -60401 -60047 -59697 -59343 -59917 -60487 -61060 -61630 -61757 -61880 -63437
-7860 -63437 -64991 -65386 -65777 -61403 -57025 -54656 -52286 -52778 -53266 -50718 -48169 -50390 -52607 -52786 -52964 -53441 -53915 -53080 -57014
-7841 -57014 -58266 -59514 -58072 -56631 -55189 -53743 -52957 -52171 -51385 -50595 -49779 -48963 -52916 -56865 -56109 -55353 -54596 -53836 -53225 -52614
-7821 -52614 -52003 -51388 -52715 -54041 -55725 -57406 -56198 -60714 -62189 -60800 -57983 -55166 -56463 -57756 -56768 -55781 -54794 -53803
-7803 -53803 -49805 -45807 -44969 -44127 -47029 -47070 -47708 -54064 -57622 -58318 -58598 -58873 -56783 -54693 -54034 -53371 -56228 -59086 -58665 -55379
-7783 -55379 -52603 -55550 -58914 -59414 -59142 -56008 -56034 -58918 -59294 -59671 -57841 -56008 -53553 -51098 -51027 -50953 -49168 -47383 -45599
-7764 -45599 -43810 -44768 -45725 -49067 -52406 -54440 -56474 -58508 -60543 -60222 -59902 -59939 -59976 -55833 -57413 -57383 -54492 -53717 -52942 -51988
-7744 -51988 -51035 -50338 -49641 -45606 -41571 -38609 -35647 -34116 -32585 -33483 -34381 -35279 -36176 -36448 -36720 -34966 -33211 -31240 -34992
-7725 -34992 -38863 -42730 -43978 -45226 -47905 -50580 -54160 -57741 -58937 -60129 -59745 -59362 -58978 -58590 -58125 -57659 -56955 -61970 -67852
-7706 -67852 -68013 -65550 -63083 -60993 -58903 -58244 -57581 -57517 -57454 -57391 -57324 -55684 -54045 -52406 -50766 -51243 -51720 -54581 -57443 -58978
-7686 -58978 -60513 -62048 -63583 -67055 -70527 -67800 -65073 -64812 -64551 -61906 -59261 -61683 -64104 -65095 -66086 -63769 -61452 -60565
-7668 -60565 -59678 -58762 -57845 -56929 -56012 -53497 -50979 -56571 -62160 -64831 -67498 -70170 -72837 -69756 -66671 -61206 -55736 -51910
-7650 -51910 -48080 -50453 -52823 -50390 -47953 -50766 -53575 -56478 -59376 -63709 -68039 -68258 -68475 -68694 -68910 -70561 -72208 -71474
-7632 -71474 -70736 -70632 -70524 -70416 -70308 -70144 -69976 -69808 -69641 -69581 -69518 -70885 -72252 -72729 -73202 -77014 -80825 -81578 -82327 -83076 -83824 -81895
-7610 -81895 -79961 -78027 -76094 -74715 -73333 -69566 -65800 -64212 -62621 -62461 -62301 -61340 -60379 -60848 -61314 -62618 -63922 -65226
-7592 -65226 -66526 -67502 -68478 -69454 -70427 -70568 -70710 -70852 -70989 -73076 -75162 -77249 -79331 -79808 -80285 -77424 -74559 -74000 -73441 -68590
-7572 -68590 -63735 -61180 -58624 -60360 -62092 -63844 -65595 -67346 -69097 -71831 -74566 -77301 -80035 -77919 -75803 -73687 -71571
-7555 -71571 -72942 -74313 -70915 -67517 -66936 -66355 -67204 -68054 -69589 -71124 -69797 -68471 -67398 -66325 -68113 -69902 -68560 -67219
-7537 -67219 -64447 -61675 -62685 -63691 -64697 -65703 -65550 -65393 -60468 -55543 -49161 -42775 -40979 -39183 -39328 -36609 -35677 -29023
-7519 -29023 -20186 -8483 3755 15994 30196 50125 72080 96897 122962 151892 178974 203195 219573 226418
-7505 226418 223605 211254 190465 166817 137504 108194 79774 51358 30390 15148 -3055 -18394 -26404 -34410
-7491 -34410 -38248 -42082 -42879 -43673 -47555 -48572 -47983 -53114 -56638 -60159 -61180 -62197 -62778 -63355 -64116 -64872 -68493 -74972 -82886
-7472 -82886 -85073 -85225 -82517 -81060 -79603 -78146 -76690 -75233 -73776 -72021 -70267 -71373 -72480 -71679 -70878 -70077 -69276 -72211
-7454 -72211 -75147 -73314 -71481 -70483 -69484 -71884 -68560 -64924 -64149 -64268 -64387 -63911 -63434 -60095 -56757 -51016 -45271 -46206 -47137
-7435 -47137 -49742 -52342 -50178 -48009 -49965 -51918 -51012 -50103 -51672 -53236 -53374 -53508 -55051 -56590 -58132 -59671 -60140 -60606
-7417 -60606 -62506 -64402 -68471 -72536 -73743 -74946 -72845 -70740 -65777 -60811 -58024 -55233 -57212 -59190 -59980 -60766 -61552 -62338
-7399 -62338 -63069 -63795 -64522 -65248 -69555 -73858 -69577 -65297 -59324 -53348 -50830 -54034 -56914 -59790 -59984 -60177 -60911 -58780 -56292
-7380 -56292 -59525 -63270 -64149 -65207 -69127 -70922 -69853 -70576 -71295 -73985 -76671 -76500 -76325 -74812 -73296 -68922 -64544 -57547
-7362 -57547 -50546 -48319 -46087 -45956 -45822 -48494 -54023 -58303 -56858 -52137 -47413 -45286 -43155 -37987 -32816 -23714 -11747
-7345 -11747 3971 25416 47580 69748 93525 114442 131002 141844 144340 143975 136125 118741 97959 77177
-7331 77177 55140 33106 16497 2749 -12079 -21181 -24381 -27581 -29832 -26355 -23237 -20119 -20581 -21039 -27995 -34951
-7315 -34951 -44682 -51549 -54660 -52048 -48441 -44831 -39794 -34753 -28017 -27000 -29921 -32838 -41094 -49347 -54265 -59179 -62636
-7298 -62636 -66090 -66567 -61317 -57324 -53326 -48974 -44619 -44917 -45211 -45509 -45804 -48397 -50986 -49645 -42577 -38762 -34943 -36016
-7280 -36016 -37086 -37868 -38647 -41813 -44977 -44746 -44511 -44161 -38084 -29955 -21821 -15719 -9612 -7593 -5570 -3550 -1527 -492
-7262 -492 547 -801 -2146 -8472 -14795 -20048 -19575 -17645 -15711 -16404 -17093 -21065 -19310 -19347 -19381 -21289 -23192 -20804 -18416
-7243 -18416 -17462 -16505 -19839 -23174 -27704 -32231 -41646 -51061 -58631 -60475 -54570 -48665 -44015 -39366 -35789 -37931 -39094
-7226 -39094 -40256 -40346 -40431 -39895 -39358 -38822 -38281 -36493 -34705 -36255 -37801 -34336 -30867 -24180 -23215 -22403 -21587 -25420 -29254 -32764
-7206 -32764 -36270 -33576 -30882 -28252 -25618 -24414 -23211 -18476 -13740 -4713 4317 9231 14146 12860 11579 6031 483
-7189 483 -2083 1076 9775 18475 23598 23002 23631 24261 27275 30289 33273 41980 49078 50453 47833 42353 39376 33538
-7171 33538 25524 11787 197 -1855 1441 7600 14175 20751 24287 27823 27066 26310 27431 28553 35874 43195 49115
-7154 49115 55035 60955 66875 76447 86018 102981 125671 146360 161326 172298 177551 182056 189421 202331 215244
-7139 215244 228541 232300 222230 206440 188542 170644 152984 135328 124374 122959 128100 138968 152038 170830
-7125 170830 191351 209015 225482 236227 238806 235665 236227 242516 254942 270232 282478 300451 320924 338539
-7111 338539 353825 363393 370334 371556 371642 374593 377599 380610 386854 402640 420568 438499 457560 482347 510111
-7096 510111 532156 544332 550788 555691 560598 567945 588649 629736 691810 773936 873229 989214 1118556 1256060
-7082 1256060 1387842 1505317 1613258 1729064 1869669 2051762 2285364 2587098 2959411 3399919 3907196
-7071 3907196 4469759 5087641 5788978 6595235 7532991 8686301 10227799 12358738 15255974 19135605
-7061 19135605 24410377 31751041 41907767 55290176 70825026 84042200 87899487 79950882 65255491
-7052 65255491 49974471 37243468 27734337 21015249 16377310 13206164 11013599 9456490 8324767
-7043 8324767 7492050 6855815 6348817 5904769 5472349 5034210 4608470 4199899 3811472 3432586 3066339
-7032 3066339 2717259 2398249 2123117 1908789 1753594 1650258 1583170 1540998 1504550 1468906 1433262 1405487
-7020 1405487 1377712 1347433 1299986 1222615 1116630 1005756 904421 824069 757069 697164 642981 599409 561559
-7007 561559 527331 493103 458875 424647 393758 357145 320890 290358 263701 242766 237509 237975 236056 231276
-6993 231276 226913 216828 200636 184444 173617 168516 169433 176072 187957 196985 204816 209786 212491 215199 221421 214290
-6977 214290 201496 182983 159850 133856 116267 112035 124192 142071 154228 153036 138130 117500 102832 97706
-6963 97706 102352 112720 122433 129288 140682 157801 176292 194783 213627 232476 246197 250381 251164 251950 252140 252330
-6947 252330 258120 263913 276085 291118 304549 308446 301435 288700 274651 266327 263369 260411 261428 268171 280220
-6932 280220 295131 309024 317198 324001 330804 338423 346042 352290 352820 353643 357328 368344 396533 437907 492634 561191
-6916 561191 646919 748858 856520 964181 1058494 1140817 1213602 1296164 1407342 1560126 1764414 2024975
-6904 2024975 2337043 2698675 3104181 3544738 4017726 4545316 5154930 5905943 6910665 8324964 10275292
-6893 10275292 12906856 16494108 21519776 28596076 38205853 49950189 61018294 66056606 61879963
-6884 61879963 51265316 39295457 29044316 21340957 15920949 12215969 9707032 7999509 6793674
-6875 6793674 5912001 5257331 4763851 4371471 4039891 3748373 3480223 3214934 2955543 2699018 2444817
-6864 2444817 2193477 1947506 1711073 1496159 1321309 1192354 1103459 1043058 999829 962080 924331 880085
-6852 880085 832981 774904 707290 639319 574212 516713 472567 439569 416112 396883 377655 359023 340394
-6839 340394 321434 302474 280653 258835 235881 212927 187469 162015 139009 121729 111658 114945 117094 116386
-6825 116386 115257 114132 114076 114024 120585 130011 135857 135984 127165 115488 105232 100701 97180 93663 88354 77326 60333
-6808 60333 37621 12521 -12574 -36124 -50133 -58035 -56396 -51303 -46206 -39470 -38453 -38509 -38565 -32812 -27056 -15100
-6792 -15100 -3144 6363 15874 29678 43482 54659 65840 75590 85340 90958 96581 103872 116886 140209 173073
-6777 173073 226205 300321 403403 542733 687786 773705 735986 600985 442378 308569 211008 142060
-6765 142060 95049 61391 37808 23762 15796 13553 14112 14671 14157 13643 11489 9336 7182 5029 -2444 -9918 -20372
-6748 -20372 -30826 -37257 -37965 -34738 -31512 -30402 -29291 -26750 -24209 -20029 -15849 -11669 -7489 -10063 -12637 -17596 -22552
-6731 -22552 -23904 -25256 -25178 -25096 -23319 -21542 -14579 -4750 3226 5480 3621 -7772 -20156 -32540 -41586 -50628 -65039
-6714 -65039 -85173 -102803 -110892 -109357 -102099 -91563 -78161 -69115 -69607 -75524 -81436 -85259 -89081 -86704 -84327 -83023
-6698 -83023 -81719 -80415 -79111 -76347 -73583 -70818 -68054 -64425 -60796 -57167 -53538 -46027 -38516 -29873 -18368 -8621 6847
-6681 6847 26310 45773 54238 45535 26340 7145 -11333 -24090 -29515 -25402 -18964 -9664 3509 21452 32778
-6666 32778 35520 27055 10006 -9605 -24448 -36907 -44597 -54671 -61884 -69216 -73687 -76883 -73404 -68255 -63106 -60759
-6650 -60759 -58411 -61429 -67308 -72651 -75132 -76541 -75088 -74648 -71347 -65185 -59022 -58356 -57685 -58624 -59563 -61101 -65498 -69238
-6632 -69238 -68210 -66619 -60256 -51031 -41806 -34552 -27294 -30230 -37935 -42879 -47819 -54309 -56031 -53583 -51131 -52674 -54216
-6615 -54216 -60278 -66336 -70665 -74995 -74469 -69171 -59402 -49634 -43278 -36922 -30566 -24206 -20264 -16322 -9936 3129 18352
-6598 18352 33575 48798 70702 98920 127139 152019 176903 195517 207454 215158 220006 214536 200483 179276
-6584 179276 153304 123633 98730 76152 60255 44592 28929 10524 -7876 -24809 -38878 -51158 -56761 -60848
-6570 -60848 -64931 -68419 -71906 -75814 -76857 -73191 -66664 -62674 -61541 -58799 -53195 -58728 -64257 -67044 -65062 -64514 -63963
-6553 -63963 -61385 -55945 -52842 -49734 -56284 -62834 -73828 -81958 -89372 -88202 -83832 -79462 -77237 -75009 -72368 -66865 -59693
-6536 -59693 -46795 -36352 -28770 -20651 -12529 -14038 -15547 -21169 -23926 -27905 -26162 -22689 -19213 -22656 -26098 -33952
-6520 -33952 -41802 -48553 -49582 -50967 -52350 -55286 -58221 -71291 -84357 -98336 -106589 -103638 -87330 -62920 -38505
-6505 -38505 -18982 -5179 -67 -674 -1285 -1893 -6796 -11695 -19459 -27220 -38319 -49414 -53061 -50982 -49056 -44265 -37868
-6488 -37868 -31467 -22984 -14497 -4582 5334 5442 5554 893 -3763 -13982 -24202 -34422 -38919 -40226 -35811 -28714 -15894
-6471 -15894 -6784 5185 14473 23762 27834 31906 31269 27771 22324 22599 28478 40080 52278 61615 61175 63597 73530
-6454 73530 89185 109907 136352 166851 210703 259323 317481 388184 476055 588247 736682 925058 1164937
-6441 1164937 1455069 1792890 2153020 2510289 2826366 3075679 3225858 3248231 3143751 2938171 2654581
-6430 2654581 2330933 2002755 1695559 1433072 1225904 1073579 965128 892890 845451 810649 781570 743668
-6418 743668 696229 634244 566537 504817 448820 402122 368777 346281 329508 315715 301923 297668 302951 305015
-6404 305015 297541 282735 262207 233690 202312 170159 140868 124810 122105 129236 145905 165853 180077 187685
-6390 187685 192432 192469 186784 168699 141077 110533 82851 60464 43798 25822 13568 2626 -5454 -11211 -22689
-6375 -22689 -35882 -43352 -44861 -40647 -32231 -18092 -2522 10185 11545 10044 11404 12763 11798 10833 7901 7831 9101
-6358 9101 4649 1806 4686 14779 24872 28646 32420 37711 43005 49130 55259 54678 44562 25740 1199 -18502
-6342 -18502 -24847 -17365 3471 27882 46574 58288 60467 56812 50300 49864 52293 56209 60128 60467 57949 47707
-6326 47707 27931 4038 -10313 -12388 -1106 19708 46250 70545 89122 99829 104814 102046 93559 79170
-6312 79170 55244 32342 12305 -4571 -15726 -18241 -20752 -22727 -30424 -38669 -49772 -65703 -81634 -85348 -79521
-6297 -79521 -70475 -61429 -49168 -36903 -20465 -4027 5014 4522 2123 -5998 -20480 -34958 -46757 -58553 -63586
-6282 -63586 -65755 -67569 -75103 -82178 -86388 -79573 -67033 -55062 -43088 -30044 -34165 -53784 -79123 -93496 -90698
-6267 -90698 -76816 -57208 -25681 15386 56183 87445 107497 110384 97531 67513 38683 19395 20517 34991
-6253 34991 52684 70378 86044 95988 97885 94058 93287 89654 76782 58187 48057 47465 54860 56533 55698 54864
-6237 54864 53493 52122 54476 53970 56265 52837 45967 29559 19291 18561 28948 36474 30229 14447 6474 8043
-6221 8043 20099 37882 59715 75828 92296 108767 128916 143346 150976 149072 147641 129046 101983 74923
-6207 74923 58541 51701 63813 89282 130544 177533 230479 266260 277523 267806 256775 245747 244431 248843
-6193 248843 263622 265053 250772 226958 209581 197927 199861 207521 214227 196135 165625 140842 136982 146475 164131
-6178 164131 178930 205114 240836 289538 338245 375386 391544 390889 357808 287053 180055 63142 -17522
-6165 -17522 -13778 52915 149530 221351 253351 241477 214778 197618 209548 231015 259517 282296 284926 243682
-6151 243682 184436 125190 84185 56533 55706 68232 91011 108067 124419 131233 137809 127217 109471 82188
-6137 82188 62773 56712 90098 133022 174276 190733 205043 240337 308059 389134 486077 565855 610821 604282
-6123 604282 572584 527536 507287 508021 544816 594968 653227 701948 746850 766957 767036 746131 735304 749279
-6109 749279 809513 883099 942017 960880 966152 954256 939703 896541 820235 707685 614327 568661 590236
-6096 590236 632795 676345 695100 700498 688733 691031 706687 766212 850540 952985 1034452 1098865 1163283 1264775
-6082 1264775 1352917 1449044 1592864 1802919 2007255 2181782 2308624 2395760 2439027 2502915 2614496 2798486
-6070 2798486 2982480 3090526 3024987 2842487 2597041 2356361 2132852 1970751 1875418 1859483 1891241 1982487
-6058 1982487 2113795 2295889 2502785 2740138 2937437 3056044 3054480 3016667 2984582 3001612 3051074 3154418
-6046 3154418 3271114 3452191 3665696 3865372 3994467 4079689 4105776 4119107 4107639 4099271 4058475 4045099
-6034 4045099 4067968 4148659 4229350 4322720 4433258 4650739 4912093 5162479 5338470 5444835 5431024 5371312
-6022 5371312 5317323 5403539 5674789 6181503 6846546 7733341 8831876 10136133 11495713 12805454 13892014
-6011 13892014 14770766 15525529 16467231 17796171 19742590 22404347 25922833 30217703 35263072 40760538
-6001 40760538 46688630 53171828 60413921 68230189 77280404 89510530 107874295 134087651 169851943
-5992 169851943 218959632 289652875 392623978 538395707 725719840 913056377 1000000000 926861687
-5984 926861687 754089723 567151449 410690310 295886708 218412160 167993211 135968903 116066641
-5976 116066641 104380244 99173996 100287496 107537367 118699658 126075905 120951925 105438420 87916244
-5967 87916244 72954209 61484908 52855255 46386866 41680468 38597403 37092124 37473427 40325332
-5958 40325332 46437259 56599167 71085519 87087899 95316983 88658984 73025922 57077296 44480264
-5949 44480264 35678557 30140687 27023386 25857523 26473556 29079181 34049472 41883018 52133438
-5940 52133438 61027584 61803388 53657545 42355873 32173945 24361250 18805203 14930430 12213547
-5931 12213547 10307735 8953207 7988775 7361981 6982247 6699797 6395887 6059550 5689829 5299126 4879452
-5920 4879452 4459777 4089946 3817399 3620082 3447563 3277906 3136862 3025385 2927262 2809436 2647737
-5909 2647737 2415697 2105446 1740949 1351654 959975 627430 421454 366180 404137 459263 477485 463283
-5897 463283 452419 473983 522607 607479 728832 844463 901850 915367 918631 916172 911094 927002 970809 1024154
-5883 1024154 1069745 1094357 1091310 1063464 1020324 982910 957896 942419 929562 895725 812769 678308 536009
-5870 536009 426138 363717 333725 315417 302832 307414 340610 389186 424409 421719 386600 335625 290373 269204
-5856 269204 280463 308219 349329 396876 431070 442017 416719 367219 317720 301259 332488 399603 480071
-5843 480071 556366 611678 635753 627400 615720 632653 677962 713732 717968 693591 657947 625165 606778 597930
-5829 597930 593075 593943 602919 611894 608351 587639 555423 513669 459039 398687 360986 348084 352589 362816 377677
-5814 377677 386817 381649 363129 355338 383791 461126 563258 641688 645723 591756 509176 411037 310037 235087
-5800 235087 192566 181027 194287 226503 258719 287299 306341 324132 339060 343699 323539 280429 231596 204879
-5786 204879 195330 192458 183863 169262 141308 115142 98514 99651 100787 104665 102821 98723 77460 54286 44469
-5771 44469 65348 103399 146930 184742 212685 219648 215639 198281 171620 139240 121997 114296 110951 107609 113443
-5756 113443 119281 130361 141445 155029 168617 183006 191675 191400 177775 168319 164590 168367 172149 172097 158692 140756
-5740 140756 122824 116096 115090 122310 123812 126934 124333 119825 115321 120470 125619 131364 127575 117396 107217 105623
-5724 105623 109755 116267 122780 142049 167045 189652 202722 213646 211220 190789 153189 113443 79424 63806
-5710 63806 61544 81219 114248 150730 177678 200811 214406 218430 205289 183684 162078 154418 156300 166527
-5696 166527 171031 180331 189634 193453 187734 183620 179511 174567 163900 154973 136513 121271 108890 102825 93902 90165
-5680 90165 95966 112061 131021 150219 166557 182831 193385 205073 207223 204808 192860 179302 168606 167026
-5666 167026 165450 164291 153595 132873 106431 81242 50330 24123 782 -11173 -17406 -19977 -16821 -5797
-5652 -5797 10949 35680 54692 64405 60765 45579 24674 11515 4082 3322 2566 4667 6772 6609 726 -6352
-5636 -6352 -13427 -8644 1866 24831 50661 74670 85329 83943 65393 42278 22029 8274 245 -1542 -3327
-5621 -3327 -3327 -3323 -969 1389 8155 14924 18076 15506 14604 7983 5562 3140 1791 446 1586 2726 3866 5010 18579
-5602 18579 32148 49592 64178 75564 77412 71629 60128 52736 48206 48385 48567 51280 53992 53247 52505 52297 42550
-5585 42550 35010 24611 19473 14336 10569 12529 24917 37305 54163 68165 80344 86801 87117 81715 78395 75076
-5569 75076 71398 67725 67125 66525 66283 60322 57755 55188 59178 68895 79666 84714 90001 92430 94259 93227 96726
-5552 96726 105951 119233 126796 132869 136080 143044 150011 159660 169310 180759 192212 209387 232286 259830 293100
-5537 293100 335432 387301 456342 542555 656665 799390 978354 1197380 1462427 1767532 2102246 2446501
-5525 2446501 2778356 3058708 3251070 3330889 3281472 3111878 2846716 2514789 2156157 1807062 1488250
-5514 1488250 1217127 1003946 849899 745702 673934 621301 582021 552636 526113 501676 474378 445202
-5502 445202 413165 383989 354813 328796 302780 284214 271372 266085 263660 265049 269300 279155 289009 299043 303353
-5487 303353 305361 301651 291800 276226 258146 242930 234629 229189 228605 228023 222494 207428 194265 181106 163893
-5472 163893 140957 117862 94770 74837 57766 53567 55095 65683 79133 87616 86566 72937 49771 32800
-5458 32800 21556 9954 4075 3345 2618 -1207 -10756 -18640 -26519 -33386 -34530 -33025 -34377 -36624 -38870 -42134 -45394
-5441 -45394 -48654 -51914 -48292 -44667 -41042 -37417 -32663 -27905 -23148 -18390 -11386 -4378 -827 2723 3229 -5797 -12321
-5424 -12321 -18844 -24508 -30171 -25342 -20510 -16903 -13297 -5041 -2504 -6542 -10581 -14977 -13647 -11456 -3543 3296 4418
-5407 4418 9746 15073 18613 22156 19794 17432 15070 12711 9842 6974 -2511 -14854 -25890 -31203 -32939 -31810 -28617
-5390 -28617 -25420 -18830 -17958 -18580 -19198 -17317 -15432 -14899 -14362 -20506 -26646 -32432 -38214 -42451 -40960 -36776 -32589 -30908
-5372 -30908 -29224 -24206 -19184 -17026 -14865 -13535 -12202 -13375 -14545 -14526 -8781 -5186 -1587 -2209 -8554 -10249 -11944 -11583
-5354 -11583 -11222 -12291 -13360 -16158 -18956 -24616 -30275 -31791 -33308 -31605 -29902 -25331 -15037 -7604 -5894 -5465 -5037
-5337 -5037 -6397 -7757 -7656 -7556 -9959 -12362 -8684 714 5465 10215 9865 9518 4399 -715 -4821 -8923 -11479 -8308
-5319 -8308 -5559 -2805 -1129 551 -4180 -8908 -13640 -18368 -19545 -20719 -21896 -23069 -33665 -44258 -51038 -52093 -51079
-5302 -51079 -44339 -43326 -42309 -42965 -43617 -41411 -39202 -38818 -38431 -40908 -43382 -43028 -42670 -40886 -39097 -34913 -30726 -29403
-5284 -29403 -28077 -27261 -26441 -25625 -24806 -21374 -17939 -17369 -16795 -18222 -19646 -16304 -12958 -10614 -8267 -7354 -6438 -5793 -5145
-5265 -5145 267 5685 13333 20986 31675 36645 29630 19757 7138 -2615 -10257 -17894 -23926 -29955 -38132 -46307 -49596
-5248 -49596 -47160 -42544 -37924 -36288 -34649 -35994 -37335 -37011 -30960 -26866 -28490 -32086 -32816 -34384 -30227 -24701 -16311
-5231 -16311 -14761 -16073 -22391 -28706 -33058 -31687 -28587 -28345 -34172 -39999 -44753 -43781 -41799 -36955 -34735 -35372 -36445 -31795
-5213 -31795 -26251 -20704 -18856 -17008 -17544 -18077 -15320 -12563 -6468 -369 -950 -1531 -9206 -19739 -29042 -32618 -35960 -36437
-5195 -36437 -39302 -42164 -41512 -40856 -43244 -45629 -46586 -47540 -44742 -41940 -40573 -39202 -37775 -36344 -37302 -38255 -38319 -38378 -38442 -38501
-5175 -38501 -39980 -41456 -42935 -44410 -44548 -44682 -44820 -44954 -45729 -46500 -50610 -54719 -55315 -55908 -54116 -52324 -49745 -47164 -44582
-5156 -44582 -42000 -38676 -35349 -28744 -19277 -14113 -14668 -19098 -26389 -36188 -43121 -50770 -52696 -53613 -54526 -57107 -59689 -64272
-5138 -64272 -63128 -66038 -63225 -61873 -60516 -58803 -57089 -52756 -48419 -44082 -39746 -35457 -31165 -31165 -31165 -34597 -38024 -40021
-5120 -40021 -42018 -44455 -46888 -47890 -48892 -49451 -50006 -50561 -51117 -53821 -56523 -57793 -59063 -59682 -60297 -59481 -58665 -55986 -53304
-5101 -53304 -50625 -47942 -47141 -46336 -47920 -49500 -48192 -46880 -43188 -39492 -37738 -35979 -36609 -37235 -36653 -36068 -35487 -34902 -37391
-5082 -37391 -39876 -39205 -38531 -36340 -37007 -43341 -42994 -40834 -41530 -44198 -46862 -49731 -47827 -46996 -49026 -49183 -49336 -53959 -58583
-5063 -58583 -59723 -60859 -60565 -60271 -56195 -52115 -48214 -44313 -37734 -34012 -35953 -33125 -29437 -30513 -30040 -29567 -31691 -33811
-5045 -33811 -38315 -42819 -47268 -51713 -53773 -55833 -50867 -45897 -44269 -42637 -43393 -44146 -44902 -45655 -48386 -51113 -56526 -57167
-5027 -57167 -53728 -50286 -49887 -49485 -49120 -48754 -48389 -48024 -46675 -45327 -46363 -47398 -44932 -42465 -42383 -42302 -42547 -42793 -40655 -38516
-5007 -38516 -37562 -36609 -38337 -40066 -44388 -45848 -48918 -51988 -54037 -56087 -58136 -60185 -58717 -57249 -54172 -53956 -53892 -53825 -53941
-4988 -53941 -54052 -55569 -57081 -58419 -59753 -61105 -59592 -61124 -62651 -63586 -64518 -62771 -61019 -59652 -61142 -63888 -63769 -63624
-4970 -63624 -60613 -61899 -63180 -61768 -60353 -59119 -57882 -56590 -58154 -59723 -58426 -57614 -56798 -55807 -54812 -54656 -54496 -54339 -54179
-4951 -54179 -55632 -57081 -58534 -59984 -60662 -61336 -62014 -62689 -63471 -64250 -64853 -60684 -56370 -52052 -50301 -48546 -49060 -49570 -48654
-4932 -48654 -47734 -46817 -45897 -49749 -53598 -52961 -52320 -53114 -49134 -44414 -42551 -40692 -43598 -46746 -47029 -46363 -45692 -44190 -42685
-4913 -42685 -39932 -37175 -36534 -38751 -40789 -42827 -41709 -40588 -39466 -38345 -40811 -43274 -42875 -42477 -42171 -41862 -42626 -46251
-4895 -46251 -51128 -53140 -55330 -57521 -56765 -53143 -51131 -49120 -50159 -51195 -52231 -53266 -53382 -53494 -53605 -53717 -58136 -62554
-4877 -62554 -65542 -68530 -70058 -71586 -70252 -68918 -60714 -52510 -49075 -45640 -44380 -43121 -40431 -37741 -34753 -31765 -33546
-4860 -33546 -35327 -38539 -41750 -43531 -45312 -48017 -50722 -48658 -46594 -47003 -47413 -50684 -53956 -50453 -46951 -46310 -45666 -46277
-4842 -46277 -46888 -47499 -48106 -46705 -45304 -46765 -48222 -46940 -45658 -47238 -51675 -52812 -49179 -43937 -41553 -42629 -43706 -44962
-4824 -44962 -46214 -47946 -49678 -51411 -53140 -55260 -57379 -56638 -55893 -53266 -50640 -49444 -48248 -47916 -47585 -47253 -46921 -48691
-4806 -48691 -50461 -49369 -48278 -49362 -50446 -52961 -55476 -59943 -64410 -66016 -67621 -69197 -70773 -72349 -73925 -70434 -66943
-4789 -66943 -68221 -69499 -69287 -69074 -66001 -62927 -64279 -65628 -69842 -74052 -75255 -76455 -74797 -73135 -72968 -72796 -71198 -69596
-4771 -69596 -70114 -70628 -71146 -71660 -72968 -74272 -76533 -81652 -87669 -88914 -84439 -79961 -74235 -68504 -67547 -66586 -67506 -68422 -66481
-4752 -66481 -64537 -61336 -58136 -59227 -60315 -61109 -61902 -62696 -63486 -62893 -62301 -58669 -55032 -49850 -49436 -48725 -48009 -50405 -52801
-4733 -52801 -52514 -56992 -60878 -64764 -66563 -68359 -68564 -68769 -68974 -69175 -69827 -70479 -71131 -71779 -72584 -73385 -74186 -74987 -77282 -79573
-4713 -79573 -74592 -74380 -75885 -72618 -70244 -67871 -67856 -72606 -74674 -76742 -76023 -75300 -72193 -69086 -69201 -69313 -69425 -69536 -71068
-4694 -71068 -72595 -71738 -70881 -72562 -74238 -75259 -71511 -65963 -60416 -62022 -63624 -64484 -70114 -73538 -72189 -68177 -67025 -63966
-4676 -63966 -60904 -62763 -64622 -65051 -62614 -60613 -63382 -70263 -77141 -82085 -84167 -81481 -74022 -69041 -64060 -58780 -53497
-4659 -53497 -51944 -50390 -53128 -58724 -65524 -67554 -64458 -64224 -64257 -61429 -60688 -59946 -55271 -55364 -56947 -55669 -51888 -50967 -54458
-4640 -54458 -57949 -59600 -61250 -62901 -64551 -68855 -73158 -69354 -60781 -54801 -51683 -48088 -44492 -45427 -46363 -45867 -45371 -50189
-4622 -50189 -55006 -60002 -62133 -61556 -60978 -58970 -56958 -55099 -56102 -55494 -54883 -53620 -52357 -51094 -49827 -50669 -51511 -49969
-4604 -49969 -48423 -47447 -46471 -42454 -41296 -41325 -41355 -43173 -49757 -53035 -56314 -56373 -56429 -57022 -54753 -54272 -53792 -50777 -50625 -51545 -55327
-4583 -55327 -56195 -57063 -56679 -56295 -52871 -49447 -48587 -47726 -49958 -55051 -55852 -53792 -53907 -54023 -53780 -56400 -56947 -57495 -58221 -58948
-4563 -58948 -58572 -58195 -55435 -52674 -49976 -47279 -45237 -47961 -51761 -55561 -58229 -60893 -63158 -65423 -65483 -65539 -65509 -68340 -67178
-4544 -67178 -66012 -66761 -67510 -66828 -69004 -69902 -73661 -78374 -83083 -85054 -87025 -86313 -82737 -76272 -69808 -65729 -66414 -66358 -66299
-4525 -66299 -66537 -66776 -62726 -58672 -55394 -54976 -55397 -55815 -54801 -56649 -57249 -57845 -58441 -59037 -60997 -60092 -58590 -57089 -54309
-4506 -54309 -54388 -55062 -55736 -53039 -47477 -44298 -43982 -45338 -46690 -48222 -49753 -49056 -48360 -47663 -46966 -47313 -47659 -49436 -51210 -54097
-4486 -54097 -56985 -55103 -53222 -49313 -45405 -44358 -43307 -44582 -45856 -45699 -45543 -47741 -49939 -52137 -54332 -57454 -60576
-4469 -60576 -58929 -57283 -60733 -64183 -64771 -65356 -63091 -60826 -59991 -59157 -61094 -63031 -64969 -66906 -67234 -67562 -63121 -58680
-4451 -58680 -60170 -61660 -61720 -61779 -60371 -58963 -54693 -50424 -47585 -44746 -40476 -36206 -35662 -35118 -39343 -43568 -46690 -49813
-4433 -49813 -52935 -56057 -56154 -56247 -56344 -56437 -57547 -58654 -54991 -51329 -51098 -50863 -50632 -50397 -52014 -53628 -55241 -56854 -56422 -55986
-4413 -55986 -55554 -55118 -56355 -57588 -58821 -60054 -60636 -61213 -61794 -62372 -61284 -60192 -59101 -58009 -55558 -53106 -50655 -48203
-4395 -48203 -49030 -49857 -50684 -51511 -50193 -48874 -50416 -51959 -50371 -48784 -48628 -48471 -48237 -48002 -47767 -47532 -52573 -57614 -62655
-4376 -62655 -67696 -66396 -65095 -66656 -68218 -68020 -67823 -64943 -62063 -60364 -61522 -62506 -58717 -54485 -53110 -54600 -56087 -55692
-4358 -55692 -55293 -54898 -54499 -53210 -51918 -50927 -49932 -49991 -54820 -58397 -59112 -60751 -59529 -58307 -57085 -54939 -52793 -53508 -54224
-4339 -54224 -55833 -57443 -60483 -63523 -66343 -69160 -69115 -69071 -69834 -70595 -74216 -77837 -76440 -75039 -73638 -72238 -71109 -69976
-4321 -69976 -69022 -68068 -63583 -61958 -62838 -58944 -57230 -55517 -60181 -64842 -68747 -72651 -73694 -74734 -74853 -74972 -73661 -72346
-4303 -72346 -72781 -73217 -70792 -68367 -66746 -65125 -63504 -61884 -60889 -59894 -58900 -57905 -59563 -61221 -61448 -61675 -63691 -65706 -70583
-4284 -70583 -75460 -74495 -73530 -75427 -77323 -76418 -75512 -76038 -76563 -74138 -71712 -72148 -72584 -71619 -70650 -69685 -68717 -66917 -65114 -68083
-4264 -68083 -71049 -70725 -70397 -70073 -69745 -69808 -69868 -69931 -69991 -67696 -65397 -64533 -63665 -62234 -60800 -60323 -62703 -63911 -60345 -59645 -58941
-4243 -58941 -58180 -57417 -59518 -61616 -65371 -69127 -74194 -76395 -77617 -74071 -71597 -69119 -70699 -72279 -69089 -65896 -65360 -64823
-4225 -64823 -67148 -69469 -67770 -66071 -64373 -62670 -63445 -64220 -63564 -62905 -65870 -68836 -70848 -69995 -66194 -67163 -70039 -72912
-4207 -72912 -72476 -72040 -71306 -70572 -72819 -70296 -70457 -70617 -69182 -67748 -66314 -64879 -65025 -65170 -68177 -71183 -69495 -67808 -67551
-4188 -67551 -67294 -66232 -65170 -65539 -65908 -65501 -65095 -63259 -61422 -65665 -69909 -71470 -73031 -72360 -74547 -77811 -76302 -73873
-4170 -73873 -71440 -69190 -64075 -61228 -63147 -69659 -71399 -71325 -71246 -68013 -64775 -60584 -56388 -56012 -60401 -63780 -64294 -65289 -66280
-4151 -66280 -65248 -64212 -64611 -65006 -65375 -65740 -67539 -69335 -69685 -70036 -70386 -70732 -71023 -71314 -68743 -66168 -64768 -63367 -60535
-4132 -60535 -57700 -58892 -60084 -64138 -68188 -68679 -69171 -69663 -70151 -70881 -71612 -72342 -73068 -73776 -74484 -70423 -66358 -62297 -58236
-4113 -58236 -58944 -59648 -59559 -59466 -59376 -59283 -60326 -61366 -65270 -69171 -65818 -62461 -61016 -64335 -68851 -70501 -74063 -74760 -73609 -69592
-4093 -69592 -68441 -67286 -66910 -66530 -66153 -65773 -64145 -62513 -63747 -64976 -66746 -68512 -70282 -72048 -73743 -75438 -77133 -78825
-4075 -78825 -78553 -78281 -78009 -77733 -73735 -69738 -68601 -67461 -67338 -67215 -67092 -66966 -67197 -67428 -67659 -67886 -69488 -71090 -72692 -74290
-4055 -74290 -71988 -69685 -70244 -70799 -69510 -68221 -69793 -71362 -71261 -71161 -73922 -76682 -73542 -70401 -66187 -68650 -72483 -73456
-4037 -73456 -73594 -73732 -72677 -71623 -70568 -69514 -66165 -62815 -64235 -65654 -67521 -69387 -72804 -71451 -67349 -68016 -65703 -63389
-4019 -63389 -63341 -63292 -60382 -57473 -56944 -56414 -57316 -58218 -58702 -59186 -61101 -63016 -64402 -65788 -69857 -73925 -78888 -80989 -82912
-4000 -82912 -80065 -75941 -76582 -75676 -74767 -73922 -73072 -73657 -74238 -73035 -71828 -70624 -69417 -70151 -70881 -71615 -72346 -72178 -72010 -71485
-3980 -71485 -76679 -75855 -75032 -74566 -74097 -72729 -71362 -70352 -69339 -65677 -67737 -68009 -68277 -67621 -66962 -69164 -71366 -70263 -69156
-3961 -69156 -70911 -72666 -69484 -66299 -65975 -65650 -66522 -67390 -68258 -69127 -70554 -71980 -73407 -74831 -73635 -72439 -71243 -70043
-3943 -70043 -69443 -68843 -68244 -67640 -70617 -73594 -73709 -73821 -69961 -66101 -67010 -67916 -68765 -69615 -67960 -66302 -66139 -71697 -77256 -77088
-3923 -77088 -76358 -75628 -74540 -73448 -70513 -67577 -66071 -64566 -63747 -62927 -64969 -67010 -66668 -66325 -65982 -65639 -69350 -73061 -72003
-3904 -72003 -70945 -71243 -71541 -71839 -72137 -71898 -71660 -68560 -65460 -66444 -67428 -65908 -64387 -63165 -67666 -72167 -70945 -71474 -72003
-3885 -72003 -69313 -66623 -67361 -68098 -67405 -66712 -66496 -66280 -63203 -60125 -60625 -61124 -64484 -67845 -65148 -62450 -61183 -59917 -60349
-3866 -60349 -60781 -61213 -61645 -63419 -65192 -62554 -59917 -59842 -65490 -67919 -70349 -70106 -69861 -69615 -69369 -69335 -69298 -70691 -72085 -71574
-3846 -71574 -71060 -67685 -64309 -60312 -56310 -55170 -54030 -56202 -58370 -60539 -62707 -62912 -63113 -63493 -63873 -62200 -63385 -66180
-3828 -66180 -63251 -62532 -61809 -60729 -59648 -59816 -59980 -60144 -60308 -61191 -62070 -62949 -63829 -62245 -60658 -59071 -57484 -55036 -52584
-3809 -52584 -51921 -51258 -52603 -59667 -67923 -76179 -82025 -82144 -82621 -83098 -82468 -81835 -81202 -80568 -79044 -77517 -75989 -74462 -74667
-3790 -74667 -74872 -75077 -75278 -74112 -72945 -71779 -70609 -70144 -69678 -69928 -64451 -57905 -57081 -57450 -57815 -59436 -61057 -62677 -64294
-3771 -64294 -61712 -59131 -55476 -51817 -49921 -53747 -57216 -60680 -62718 -64756 -66794 -68829 -71690 -74551 -75982 -77413 -78337
-3754 -78337 -79260 -73866 -68471 -61288 -59827 -61824 -63821 -61824 -59827 -57830 -55833 -59030 -62227 -62562 -62897 -62696 -62495 -57882
-3736 -57882 -53270 -50729 -53911 -56377 -58844 -62204 -59842 -57480 -60841 -64559 -68277 -65677 -63072 -63214 -63352 -63493 -63631 -64369
-3718 -64369 -65107 -68706 -72301 -74171 -76038 -71232 -66422 -63374 -60326 -60438 -60546 -59466 -63151 -68627 -71239 -68579 -65919 -67849
-3700 -67849 -69775 -71526 -73273 -72163 -71049 -69492 -67931 -66373 -64812 -63613 -62409 -61031 -59648 -62890 -63266 -59712 -60923
-3683 -60923 -62554 -64183 -66112 -68039 -69305 -70568 -71835 -73098 -71742 -70382 -69026 -67666 -66668 -65665 -64667 -63665 -62249
-3666 -62249 -60829 -62275 -63717 -65051 -66381 -67711 -69041 -69358 -69674 -69991 -70308 -70658 -71004 -71351 -71697 -71507 -71317 -68266 -65215
-3647 -65215 -65610 -66001 -66392 -66783 -65028 -63273 -59611 -58810 -61500 -59417 -58587 -60617 -59846 -59075 -61344 -63613 -62815 -62014 -61213 -60412
-3627 -60412 -62119 -63821 -65524 -67226 -64604 -61977 -62212 -62446 -61135 -59820 -61366 -62912 -62771 -62625 -62480 -62335 -60405 -58471
-3609 -58471 -59399 -60326 -59090 -57849 -56608 -55368 -58542 -61712 -61724 -61735 -62774 -59045 -55315 -56355 -56560 -56765 -57268 -57771 -57886 -58002
-3589 -58002 -60978 -63955 -64309 -64663 -65017 -65371 -63691 -62010 -63192 -64373 -63646 -62920 -66962 -73866 -78951 -79268 -77677 -76086 -73899
-3570 -73899 -71712 -69525 -67338 -65058 -62778 -63359 -63937 -62014 -60092 -58169 -56243 -55379 -54514 -58419 -62320 -62350 -62379 -62409 -62435 -63911
-3550 -63911 -65386 -66861 -68333 -69808 -71284 -72759 -74231 -72800 -71369 -69939 -68504 -67789 -67074 -66358 -65639 -63803 -61962 -60420
-3532 -60420 -58877 -55371 -56631 -58069 -59507 -57819 -56128 -55390 -57514 -60297 -58307 -56318 -59097 -60800 -59641 -60390 -61135 -62241
-3514 -62241 -63348 -64455 -65557 -65501 -65446 -65390 -60561 -57704 -57707 -55803 -53896 -53311 -52726 -52141 -51556 -55382 -59209 -60174 -61139 -61209 -61280 -64212
-3492 -64212 -67145 -68229 -69313 -67536 -65759 -67163 -68564 -69969 -71369 -69197 -67022 -64849 -62674 -62446 -62215 -64849 -67480
-3475 -67480 -67789 -68095 -68404 -68709 -65699 -62689 -59678 -56668 -55356 -54045 -52733 -51422 -54276 -57130 -58553 -59976 -59879 -59783 -62070
-3456 -62070 -64358 -63605 -62852 -63531 -64209 -63694 -63180 -65051 -66921 -64447 -61973 -66653 -71332 -71571 -71809 -75386 -78962 -77185 -75404
-3437 -75404 -73623 -71843 -70185 -68523 -66861 -65200 -65881 -66560 -65807 -65054 -66541 -68024 -67122 -66221 -64376 -62528 -62111 -61694 -61757
-3418 -61757 -61817 -65095 -62651 -63028 -63400 -63415 -63430 -63449 -63464 -63478 -63493 -66321 -69149 -71977 -74805 -75427 -76049 -73333 -70617 -68579 -66541
-3397 -66541 -65934 -65326 -65643 -65960 -67707 -69454 -69950 -70445 -70941 -71437 -72439 -73441 -73012 -72584 -72707 -72830 -76291 -79752 -78981 -78210
-3377 -78210 -78869 -79529 -79831 -80129 -78046 -75960 -73430 -70896 -68367 -65833 -65501 -65166 -67219 -69268 -69980 -70688 -71399 -72107 -70792
-3358 -70792 -69473 -68158 -66839 -66686 -66530 -66377 -66221 -66336 -66448 -67994 -69536 -71798 -74056 -76198 -72614 -73609 -74603 -75419 -76231
-3339 -76231 -73471 -73571 -75281 -71265 -68780 -66295 -62022 -57745 -58270 -58795 -55982 -53166 -53192 -53218 -54675 -56128 -60714 -65300 -66548
-3320 -66548 -67793 -67402 -67010 -66619 -66224 -65714 -65203 -68985 -72763 -70956 -69149 -66090 -65889 -62353 -64540 -67681 -67957 -67476 -66995
-3301 -66995 -66336 -65673 -64358 -63043 -65066 -67085 -65397 -63709 -62022 -60330 -57897 -55464 -57324 -59179 -59697 -60215 -59302 -58385
-3283 -58385 -56608 -54831 -55438 -56042 -53847 -51649 -49097 -46541 -41098 -29928 -25141 -26072 -32030 -40845 -47637 -51564 -54481
-3266 -54481 -57394 -63471 -69544 -70173 -70799 -69045 -67286 -64965 -62640 -61750 -60856 -60680 -60502 -62294 -61221 -60926 -66351 -66653 -64089
-3247 -64089 -66243 -68396 -73590 -73057 -70948 -68840 -69712 -70580 -70617 -70654 -67353 -64048 -64831 -65613 -66396 -67174 -67118 -67063 -62715 -58363 -58456
-3226 -58456 -58549 -58642 -58732 -54727 -50722 -46716 -42708 -43591 -44474 -45357 -46236 -49652 -53065 -56660 -60252 -62417 -67439 -70855 -69499
-3207 -69499 -65941 -65241 -67107 -66109 -65919 -65725 -68396 -68203 -67972 -67737 -68937 -67271 -65282 -63288 -61120 -58948 -59492 -60032 -60576
-3188 -60576 -61116 -63240 -65360 -66053 -66742 -65881 -65021 -66843 -68665 -70069 -68612 -67513 -66414 -63870 -64186 -65755 -67323 -68355
-3170 -68355 -69387 -70598 -68948 -69726 -70505 -72536 -71705 -69771 -64976 -61612 -58248 -55964 -53680 -58072 -62465 -63788 -65110 -65360
-3152 -65360 -62748 -61094 -62297 -63143 -63989 -63229 -62465 -63132 -63799 -63180 -62558 -61936 -61314 -63437 -65557 -67498 -69440 -68896 -65487 -62554
-3132 -62554 -59622 -57052 -59246 -61619 -63993 -63642 -63288 -64365 -65442 -63870 -62294 -63400 -64507 -61899 -56429 -53821 -54075 -59395
-3114 -59395 -64715 -63657 -65460 -68687 -69052 -68165 -67279 -69432 -68724 -65155 -64447 -65915 -67383 -66168 -64954 -62666 -60379 -61072
-3096 -61072 -64626 -66146 -64805 -65252 -65699 -65103 -64507 -66772 -69037 -68210 -67383 -67987 -68586 -67640 -66694 -66642 -69447 -73910 -72651 -69782
-3076 -69782 -72632 -76231 -74108 -70792 -67472 -64656 -61839 -61884 -61925 -63788 -65650 -64652 -63650 -63359 -63069 -64209 -65345 -66843 -68340
-3057 -68340 -66977 -65610 -65211 -64808 -65837 -66865 -67092 -67316 -67539 -67763 -67104 -66440 -68639 -70837 -70893 -70945 -70639 -70334 -72491 -68922
-3037 -68922 -65710 -62499 -64149 -65796 -68873 -71951 -71679 -71403 -71127 -70852 -70013 -69171 -68329 -67487 -63832 -60174 -59380 -58583 -60829
-3018 -60829 -63072 -62458 -61839 -64563 -67282 -67145 -67003 -67521 -68035 -68553 -69067 -66656 -64242 -64633 -67882 -70390 -67171 -62703 -63955
-2999 -63955 -63504 -63050 -62957 -62860 -64466 -66068 -67674 -69276 -69063 -68847 -68635 -68419 -68027 -67633 -67238 -66843 -69350 -71854 -71500 -71142 -70252
-2978 -70252 -69358 -65602 -61847 -59898 -57949 -58862 -59775 -58780 -57786 -58221 -58654 -58277 -57901 -58955 -60010 -60349 -60688 -61027 -61362 -61716
-2958 -61716 -62066 -62417 -62767 -62670 -62573 -60867 -62022 -61072 -60118 -62681 -65244 -63516 -61787 -65185 -65721 -64760 -66660 -68381 -67238 -64518
-2938 -64518 -61794 -63188 -64577 -64674 -64771 -65047 -62458 -62107 -61753 -61403 -61049 -62096 -66004 -66873 -67741 -69115 -70490 -70434 -67517 -64719
-2918 -64719 -66690 -67230 -67770 -69562 -71355 -69033 -66712 -64630 -65408 -66962 -68516 -64823 -61131 -58989 -59708 -62156 -61742 -61865
-2900 -61865 -61988 -59399 -59671 -60539 -61407 -62964 -61657 -63572 -62621 -61914 -61202 -61865 -65386 -68560 -68870 -69063 -72115 -73590 -70293
-2881 -70293 -66820 -66206 -68586 -70963 -68575 -69045 -72111 -75173 -74126 -73076 -75285 -77491 -77793 -80952 -83459 -81194 -77800 -77264
-2863 -77264 -74495 -71727 -69138 -66548 -67744 -68940 -69957 -70975 -72469 -71101 -71343 -71586 -71470 -71355 -69630 -70766 -69827 -68888
-2845 -68888 -66519 -67010 -68337 -69663 -69559 -72316 -71481 -70647 -69991 -69335 -69574 -69812 -71183 -72554 -71831 -66340 -63233 -64894 -65900
-2826 -65900 -66906 -66779 -66653 -70326 -74000 -74335 -74670 -73307 -71943 -70580 -69216 -65211 -61206 -60539 -59872 -58043 -56213 -58676
-2808 -58676 -61139 -62253 -63367 -63050 -62733 -64294 -65855 -65986 -66116 -66824 -67528 -68236 -68940 -68724 -68504 -68288 -68068 -68039 -68005 -67975 -67942 -69223
-2786 -69223 -70501 -71783 -73061 -72647 -72230 -71817 -71399 -70151 -68899 -67651 -66399 -67104 -67804 -68508 -69209 -69555 -69898 -70244 -70587 -72312
-2766 -72312 -74033 -75758 -77480 -78191 -78899 -77226 -75550 -74659 -73765 -71444 -69119 -67484 -65844 -65639 -65431 -66429 -67424 -68422 -69417
-2747 -69417 -70237 -71053 -71872 -72688 -73501 -74309 -70829 -67346 -65684 -64019 -62834 -66414 -69540 -69801 -70244 -70684 -74853 -74249 -72338
-2728 -72338 -73284 -71358 -69428 -67681 -65930 -64868 -63803 -64171 -64537 -64674 -64808 -62860 -60908 -56157 -56172 -57800 -59425 -61813 -64197
-2709 -64197 -63247 -62294 -63281 -64265 -65252 -66235 -67666 -69093 -67185 -65274 -64052 -62826 -63989 -65148 -63642 -62133 -63013 -63888 -64618
-2690 -64618 -65345 -66075 -66802 -66053 -65300 -67890 -70475 -71366 -72252 -71712 -71168 -69287 -67402 -65282 -68881 -73944 -73281 -72860 -72435 -72364
-2670 -72364 -72290 -72219 -72144 -72700 -73251 -73806 -74357 -74525 -74689 -74857 -75021 -76500 -77975 -75520 -73061 -69440 -71537 -73758 -75974 -76317 -76656
-2649 -76656 -73780 -76623 -77487 -78348 -81954 -85557 -83739 -81917 -80099 -78277 -75274 -72271 -70699 -69127 -70505 -71884 -74693
-2632 -74693 -77502 -76466 -75430 -76779 -78128 -75155 -72182 -70639 -69097 -69473 -69849 -70226 -70602 -68922 -67241 -69853 -72465 -74622
-2614 -74622 -76779 -73691 -70602 -69928 -69253 -70367 -71481 -69600 -73441 -74063 -74685 -76112 -77539 -78966 -80393 -80024 -79655 -79287 -78918
-2595 -78918 -77386 -75855 -74324 -72793 -71586 -70378 -71556 -72733 -74596 -76459 -76891 -77323 -77673 -78024 -76943 -75863 -73709 -71556
-2577 -71556 -72741 -73925 -71686 -69443 -68635 -67823 -68355 -68884 -69417 -69946 -69063 -68177 -69678 -71176 -70889 -70598 -70311 -70021 -69633 -69242
-2557 -69242 -68258 -72040 -76272 -75732 -74838 -73940 -73068 -72193 -69890 -67584 -68978 -70367 -70330 -70289 -69253 -68214 -71470 -74723 -74015 -73303
-2537 -73303 -71165 -69022 -68702 -68378 -68057 -67733 -67204 -66671 -67573 -68471 -68434 -68396 -69790 -71183 -71474 -71764 -68717 -65669 -65289 -64909 -64529
-2516 -64529 -64149 -62994 -61839 -64022 -66206 -66373 -66537 -66705 -66869 -65934 -64995 -64060 -63121 -64913 -66701 -68493 -70282 -72401 -74518
-2497 -74518 -73299 -72077 -73180 -74283 -75386 -76489 -75833 -75177 -74521 -73866 -74611 -75356 -76101 -76846 -75028 -73210 -72822 -72435 -72353 -72271
-2477 -72271 -68851 -65431 -65766 -66101 -66437 -66772 -65870 -64969 -64067 -63165 -62532 -61899 -61444 -60990 -62391 -66653 -70557 -69693 -67189 -64686
-2457 -64686 -66057 -70289 -74991 -73016 -71638 -70259 -71623 -72986 -72919 -72852 -70565 -68273 -64197 -65841 -66951 -68057 -69883 -65982
-2439 -65982 -64387 -62789 -65606 -68419 -70490 -72558 -71768 -70975 -70591 -70203 -68389 -66571 -65025 -63475 -63359 -63240 -62119 -60993
-2421 -60993 -61303 -61608 -63050 -64488 -65930 -67368 -68814 -70259 -68843 -67428 -68516 -69603 -69261 -68918 -70460 -72003 -74618 -77234
-2403 -77234 -77226 -71496 -67197 -68620 -68720 -68821 -67849 -66876 -65844 -64812 -66642 -68471 -68080 -67688 -64436 -61183 -62461 -63739 -65017
-2384 -65017 -66295 -67558 -68821 -70084 -71347 -70852 -70356 -68430 -66504 -65919 -65334 -67610 -69887 -70285 -70684 -68221 -65759 -64768 -63776
-2365 -63776 -62785 -61794 -62592 -63389 -64186 -64984 -65155 -65326 -68359 -71392 -71116 -70840 -69134 -67428 -67849 -68266 -68687 -69104 -66217 -63326
-2345 -63326 -65207 -67085 -69309 -71530 -70893 -70252 -68661 -67066 -68337 -69603 -68486 -67364 -63385 -59402 -60520 -61634 -62752
-2328 -62752 -63866 -64760 -65650 -67975 -70296 -71012 -71723 -69577 -67428 -67323 -67219 -68545 -69872 -66846 -63821 -62227 -60632 -60319 -60006
-2309 -60006 -62554 -65103 -65773 -66444 -67115 -67785 -68292 -68799 -69305 -69812 -70825 -71839 -71422 -71004 -68158 -65311 -67234 -69156 -68396 -67636
-2289 -67636 -68307 -68978 -70870 -72763 -71794 -70825 -70274 -69723 -67741 -65759 -66191 -66623 -69916 -73210 -71437 -69663 -69320 -68978 -67964
-2270 -67964 -66951 -68799 -70647 -72346 -74044 -71273 -68501 -66846 -69961 -70393 -70825 -71615 -72405 -73195 -73985 -72424 -70863 -69302
-2252 -69302 -67741 -68206 -68672 -69138 -69603 -70270 -70937 -71604 -72271 -71388 -70505 -69622 -68739 -69033 -69328 -69622 -69916 -70390 -70863 -71038 -71213 -71559
-2230 -71559 -67137 -65278 -68188 -71962 -70967 -71522 -72077 -68512 -64943 -64238 -63531 -63393 -63251 -63113 -62972 -64980 -66984 -68992 -70997
-2211 -70997 -70501 -70002 -69507 -69007 -68810 -68609 -68411 -68210 -69324 -70434 -71548 -72659 -72700 -72737 -72778 -72815 -71217 -69615 -68016 -66414 -65121
-2190 -65121 -63829 -64920 -66012 -65405 -64797 -64190 -63583 -63661 -63739 -63817 -63896 -63229 -62562 -61895 -61228 -64238 -67249 -67875 -68501 -65639 -62778
-2169 -62778 -67070 -71362 -73642 -75922 -74864 -73806 -71675 -69544 -69797 -70051 -69354 -68653 -68434 -72979 -72103 -68363 -67308 -69112
-2151 -69112 -69264 -69413 -71176 -72934 -71716 -70494 -71958 -68650 -66820 -64987 -60177 -60133 -62148 -64160 -66474 -68784 -67342 -65896
-2133 -65896 -65885 -65870 -68482 -71090 -70364 -69633 -70833 -72029 -73229 -74425 -71362 -68296 -69525 -70751 -69164 -67573 -68370 -69164 -67815
-2114 -67815 -66463 -65114 -63762 -64577 -65390 -66206 -67018 -70725 -74428 -75751 -77070 -76433 -75792 -75155 -74514 -72893 -71269 -69648 -68024
-2095 -68024 -68098 -68169 -68244 -68314 -68389 -68460 -68534 -68605 -69656 -70703 -71753 -72800 -72211 -71619 -71030 -70438 -67849 -65256 -65051 -64842 -65889 -66932
-2073 -66932 -66548 -66161 -66045 -65926 -65811 -65691 -63996 -62297 -61735 -61168 -65311 -64682 -61493 -58300 -60654 -63005 -62022 -61034 -61541 -62044
-2053 -62044 -63981 -65915 -70296 -74674 -72081 -69484 -68668 -70710 -70669 -65855 -64086 -65174 -64358 -63538 -62707 -61873 -61042 -60207 -61075
-2034 -61075 -61940 -60423 -58903 -60442 -61977 -63516 -65051 -65039 -65025 -65013 -64998 -63929 -62856 -64171 -65483 -65934 -66381 -65401 -64417 -60993
-2014 -60993 -57566 -58434 -59298 -60703 -62104 -62078 -62048 -60084 -58117 -59492 -60863 -63430 -65993 -67130 -63493 -61019 -61407 -63225 -65043
-1995 -65043 -66683 -68322 -67577 -66832 -68039 -69246 -68068 -66891 -69559 -72226 -74894 -77562 -73948 -70334 -69104 -67875 -70252
-1978 -70252 -72629 -73575 -74521 -72666 -70811 -72293 -73776 -73739 -73702 -72234 -70766 -67454 -64142 -60829 -57517 -59212 -60908 -62603
-1960 -62603 -64298 -67171 -70043 -71485 -68158 -65308 -65319 -67416 -69514 -70494 -66705 -63989 -64134 -64220 -64306 -67908 -71511 -72014 -72517
-1941 -72517 -73020 -73523 -73549 -73575 -73601 -73627 -75170 -76708 -78784 -77997 -74085 -75892 -80382 -79149 -77420 -75688 -73597 -71507 -71120 -70729
-1921 -70729 -67476 -64224 -65975 -67722 -68039 -68355 -68229 -68098 -67968 -67837 -67003 -66165 -65326 -64488 -63057 -61623 -60189 -58754 -59823
-1902 -59823 -60893 -61962 -63031 -63534 -64037 -63110 -62182 -62133 -62085 -64898 -67711 -66798 -65885 -64972 -64060 -63687 -63314 -62942 -62569 -64373 -66176
-1881 -66176 -66548 -66921 -69328 -71735 -71280 -70825 -70341 -69857 -67942 -66027 -66757 -67484 -66779 -66075 -67700 -69320 -68080 -66839 -67726 -68609
-1861 -68609 -69492 -70375 -69473 -68568 -67662 -66757 -65092 -63423 -64615 -65807 -68523 -71235 -72517 -73799 -70971 -68139 -70077 -72014
-1843 -72014 -70587 -69156 -67726 -66295 -67510 -68724 -69939 -71153 -71772 -72390 -73009 -73627 -73411 -73195 -72979 -72763 -71235 -69708 -68180
-1824 -68180 -66653 -67070 -67487 -67905 -68322 -69514 -70706 -71898 -73091 -73359 -73627 -69127 -64626 -65460 -66295 -66057 -65818 -61358 -62621
-1805 -62621 -65434 -68247 -70881 -73515 -71381 -69246 -69585 -69924 -68832 -67741 -68229 -68717 -69205 -69693 -70766 -71839 -72912 -73985
-1787 -73985 -75296 -76608 -73150 -69693 -71615 -73538 -72599 -71660 -68545 -65431 -63747 -62063 -63475 -64887 -63616 -62346 -62774 -66064
-1769 -66064 -69533 -67279 -66090 -64902 -64786 -64671 -64496 -64320 -64145 -63970 -65252 -66533 -67815 -69097 -71988 -74879 -74909 -74939 -73679
-1750 -73679 -72420 -71161 -69902 -69060 -68218 -67375 -66533 -65520 -64507 -63493 -62476 -61880 -61284 -60688 -60088 -61660 -63233 -61943 -60651
-1731 -60651 -61329 -62007 -59287 -62286 -64186 -63225 -62264 -64160 -66507 -63132 -61545 -62815 -63173 -63531 -62636 -61739 -61202 -60666 -62990
-1712 -62990 -65311 -65028 -64745 -65893 -67040 -68039 -69037 -67174 -65311 -63888 -62465 -63903 -65341 -65796 -66250 -65274 -64298 -65930 -67562
-1693 -67562 -69194 -70825 -69238 -67651 -67495 -67338 -65282 -63225 -64030 -64835 -66146 -67457 -68769 -70080 -68851 -67621 -66392 -65159
-1675 -65159 -65181 -65203 -65226 -65244 -67137 -69030 -66153 -63273 -63020 -62767 -65375 -67979 -68147 -68314 -66574 -67692 -71675 -70889 -68493 -68955
-1655 -68955 -70591 -72226 -71179 -70129 -71138 -72148 -71727 -71302 -68903 -66504 -66966 -67428 -65028 -62629 -66906 -71183 -70796 -70408
-1637 -70408 -71451 -72495 -72316 -72137 -71958 -71779 -70904 -70028 -69153 -68277 -68236 -68195 -68154 -68113 -70173 -72234 -74294 -76354 -74719 -73083 -69540
-1616 -69540 -68858 -72934 -72241 -67733 -63225 -61101 -58978 -61623 -64268 -67927 -71586 -72383 -73180 -75438 -77696 -74231 -75535 -77241
-1598 -77241 -76086 -75408 -74730 -72562 -70393 -69656 -68918 -69045 -69171 -72159 -75147 -74529 -73910 -72994 -72077 -72256 -67662 -65755 -68612 -69894
-1578 -69894 -68311 -66910 -65505 -69380 -68482 -68661 -71697 -69372 -67044 -66329 -65610 -66139 -66664 -70054 -73441 -72867 -72290 -74279 -76265
-1559 -76265 -75989 -70941 -66969 -65855 -65610 -65360 -67975 -65818 -67096 -68370 -67919 -67465 -67849 -68229 -71474 -74715 -73206 -71694 -71615
-1540 -71615 -71533 -69965 -68393 -69685 -70975 -70919 -70859 -69372 -67882 -67647 -67409 -68605 -69797 -69354 -68907 -70431 -69089 -67543 -71716
-1521 -71716 -72137 -72554 -74160 -70039 -67532 -67882 -67908 -67931 -68136 -68337 -66910 -65479 -65483 -65483 -64324 -63162 -64864 -66563 -66057 -65546 -67901
-1500 -67901 -70252 -70550 -70844 -72573 -74298 -71027 -67752 -67342 -66928 -69440 -71947 -73027 -74104 -74007 -73910 -69045 -64179 -66168 -68158
-1481 -68158 -66750 -68203 -73963 -74000 -74574 -75147 -76079 -77010 -75080 -73150 -72055 -70960 -71295 -71630 -72562 -73493 -73173 -72852 -71243 -72495
-1461 -72495 -70945 -63672 -62927 -67905 -72346 -73925 -72342 -70755 -70423 -70088 -69041 -67990 -66943 -65893 -67506 -69115 -70729 -72338
-1443 -72338 -71627 -70911 -70200 -69484 -68758 -68027 -70162 -72293 -73683 -75069 -73597 -72122 -70211 -68296 -67815 -67331 -70248 -73162 -71131
-1424 -71131 -69097 -70289 -68616 -68258 -72666 -71772 -70874 -71708 -72539 -72219 -71895 -71276 -70654 -71437 -67446 -64533 -64477 -63411 -62346 -61459
-1404 -61459 -60572 -61385 -62197 -63009 -63821 -64320 -64820 -63888 -62957 -61548 -60140 -62070 -64000 -63907 -63814 -63899 -63985 -63892 -66660 -71753 -70170 -70822
-1382 -70822 -74335 -73437 -72539 -72089 -71638 -75479 -79320 -79860 -80397 -77599 -74797 -72565 -70330 -72390 -74447 -73393 -72334 -71280
-1364 -71280 -70222 -71939 -73653 -74954 -76250 -78430 -73929 -71757 -72442 -71254 -72923 -74775 -73761 -74466 -75166 -74261 -73352 -75665
-1346 -75665 -77975 -77904 -77830 -78214 -78594 -78977 -79357 -74108 -68855 -65990 -63121 -65949 -68773 -68262 -67748 -68937 -70121 -67018 -63911
-1327 -63911 -64786 -65658 -66533 -67405 -69831 -72252 -70386 -68516 -68363 -68206 -68054 -67897 -67685 -67469 -69641 -71809 -70643 -69473 -65624
-1308 -65624 -66541 -65047 -63549 -63784 -64015 -66902 -69786 -70289 -70788 -70218 -69644 -70505 -71362 -73590 -75814 -75658 -75498 -76146 -76790 -74100
-1288 -74100 -71407 -71287 -71165 -71045 -70922 -70952 -70978 -71008 -71034 -71265 -71492 -71723 -71951 -72182 -72409 -72640 -72867 -72271 -71671 -71075 -70475 -68985 -67491
-1265 -67491 -67431 -72137 -75755 -76511 -75837 -72301 -68586 -69641 -70099 -73419 -77945 -75796 -71500 -70065 -70777 -68627 -70650 -72673
-1247 -72673 -72416 -72159 -70472 -68784 -70941 -73098 -70010 -69782 -70762 -66973 -64436 -64760 -64905 -65051 -65375 -65699 -68016 -70334 -72532
-1228 -72532 -71869 -72666 -68694 -66928 -69931 -70267 -70602 -69805 -69007 -68538 -68068 -67599 -67130 -65855 -64581 -66645 -68709 -70565 -72420
-1209 -72420 -70937 -69454 -68702 -67949 -69283 -70617 -72398 -69410 -66243 -67845 -70736 -70762 -70315 -69864 -69417 -68966 -73467 -77964 -78739
-1190 -78739 -74741 -71641 -71399 -74171 -74078 -75777 -77472 -77021 -76567 -76116 -75661 -74287 -72908 -71533 -70155 -67916 -65673 -65818 -65960
-1171 -65960 -68132 -70300 -70088 -69872 -69425 -68974 -68527 -68076 -68225 -68370 -68519 -68665 -69790 -70911 -70606 -70296 -70319 -70337 -68929 -67517 -65338
-1150 -65338 -63154 -65267 -67375 -68475 -69570 -68285 -66995 -65867 -64734 -65990 -67241 -68318 -69391 -70468 -71541 -70203 -68866
-1133 -68866 -67528 -66191 -65479 -64768 -67096 -69425 -72573 -70952 -69331 -72480 -72230 -71980 -71850 -71720 -69406 -64231 -61321 -63180
-1115 -63180 -65993 -68806 -70486 -72167 -70956 -69745 -68534 -67323 -65487 -63650 -66105 -68560 -67700 -66835 -67405 -67972 -67498 -67022
-1097 -67022 -66548 -66071 -65047 -64019 -64604 -65185 -63654 -64980 -67562 -65371 -65528 -68542 -69652 -70758 -71034 -71306 -69197 -67085 -65334
-1078 -65334 -63579 -64212 -64842 -63985 -63124 -65606 -68083 -68061 -68035 -69443 -70848 -72256 -73661 -73638 -73612 -74380 -75144 -78296 -81444 -78843
-1058 -78843 -76239 -76023 -75803 -74562 -73318 -72077 -70833 -70576 -70315 -67674 -65028 -65345 -65658 -67405 -69149 -70002 -70852 -69320 -67785
-1039 -67785 -69529 -71269 -69674 -68076 -66481 -64883 -65673 -66459 -70311 -74160 -71813 -69462 -69797 -70129 -69033 -67934 -66153 -64369
-1021 -64369 -63661 -68672 -70051 -71425 -70777 -70125 -69492 -68855 -66791 -64723 -65788 -66850 -64577 -62301 -63404 -64503 -65606 -66705
-1003 -66705 -67718 -68728 -68311 -67890 -67130 -66366 -64175 -61981 -60893 -59801 -62051 -64298 -65285 -66269 -67256 -68240 -69019 -69793 -68188
-984 -68188 -66578 -68355 -70129 -68568 -67003 -66068 -65129 -68486 -71839 -70613 -69384 -68158 -66928 -67044 -67156 -67271 -67383 -65159 -62931
-965 -62931 -61064 -59194 -56612 -59749 -63009 -66265 -68843 -71418 -69704 -67987 -65975 -63959 -66239 -68516 -67532 -66545 -66992 -67435
-947 -67435 -67644 -67849 -66627 -65401 -62756 -60107 -62703 -65300 -64022 -62744 -63851 -64958 -65472 -65982 -68877 -71772 -72819 -73866
-929 -73866 -76343 -78821 -78009 -77193 -73039 -68884 -68933 -68981 -65811 -68363 -68184 -68001 -65792 -63583 -63519 -63456 -61962 -60468 -61914 -63359
-909 -63359 -64805 -66250 -65490 -64730 -64328 -63922 -62662 -67126 -66940 -66753 -69071 -71388 -70844 -70296 -68978 -67659 -67770 -67882 -68858 -69834
-889 -69834 -74030 -72498 -70792 -69086 -69883 -70680 -70464 -70248 -67528 -64805 -63333 -67584 -65755 -63925 -64421 -64917 -63981 -63046 -62886
-870 -62886 -62726 -63996 -65267 -65047 -64827 -64607 -64387 -64551 -64715 -64879 -65043 -66071 -67100 -71347 -69872 -70863 -71854 -71056 -70259 -72651
-850 -72651 -75043 -74574 -74104 -72610 -71112 -72480 -73843 -73124 -72401 -71682 -70960 -73460 -75956 -73687 -71414 -71649 -71880 -69253 -66623
-831 -66623 -66981 -67335 -67692 -68046 -66705 -65360 -66880 -68396 -66735 -65069 -64838 -64604 -64283 -63959 -63639 -63314 -61999 -60680 -62223 -63765
-811 -63765 -64715 -65662 -66608 -67554 -66150 -64741 -66194 -67647 -66660 -65669 -69447 -73225 -76556 -79883 -76533 -73184 -71567 -69946 -68326
-792 -68326 -66705 -68814 -70919 -68255 -65591 -64838 -64082 -66187 -68292 -66723 -65151 -63579 -62007 -61750 -61489 -61228 -60967 -61753 -62536
-773 -62536 -60457 -58378 -59552 -60721 -63322 -65922 -63970 -62014 -62923 -63829 -64231 -64630 -62171 -59708 -61437 -63162 -64890 -66615
-755 -66615 -64529 -62439 -63214 -63985 -63911 -63832 -63754 -63676 -62588 -61496 -63266 -65036 -66928 -68817 -67845 -66873 -68348 -69820 -70337 -67994
-735 -67994 -62692 -62160 -65323 -65624 -64346 -65930 -67156 -68381 -69734 -71086 -72439 -73791 -71150 -68508 -67297 -66086 -64432 -62774
-717 -62774 -63981 -65185 -65855 -66522 -65762 -64998 -63978 -62953 -64794 -66630 -68173 -69712 -69823 -69931 -67845 -65755 -63668 -61578 -62949
-698 -62949 -64317 -67118 -69916 -68843 -67767 -69555 -71340 -74380 -77416 -73780 -70140 -68102 -66064 -65457 -64846 -65043 -65241 -62577
-680 -62577 -59909 -60718 -61526 -59473 -57417 -58195 -58974 -59753 -60528 -59987 -59447 -60338 -61224 -60058 -58892 -60587 -62279 -62618 -62957 -63296
-660 -63296 -63631 -62540 -61448 -60356 -59261 -64712 -70159 -68814 -64604 -63586 -65427 -66735 -68039 -68393 -65881 -64984 -64082 -63512
-642 -63512 -62938 -65229 -67517 -67841 -68162 -68486 -68806 -68713 -68616 -70133 -68784 -66753 -64719 -63762 -65662 -65807 -65949 -66452 -64089 -61802
-622 -61802 -59514 -57227 -54935 -54227 -56381 -58534 -57823 -56981 -56139 -55118 -54093 -52625 -51158 -49690 -48218 -45591 -42965 -40100
-604 -40100 -34369 -27242 -13438 10140 40401 80120 134147 198426 244588 235784 182152 117910 64163 24794
-590 24794 -2176 -19847 -32745 -40998 -46389 -49932 -53471 -58162 -58084 -60509 -62931 -63508 -61224 -60550 -59872 -60420 -60967 -59727
-572 -59727 -61344 -63799 -63393 -61735 -60073 -59950 -56966 -58750 -63393 -63538 -63683 -61146 -58605 -58929 -59253 -61008 -62763 -64130 -65498
-553 -65498 -66865 -68232 -66813 -65393 -65583 -62912 -61224 -59537 -58922 -58307 -62137 -63106 -62644 -62182 -61392 -57741 -55878 -54015 -52942
-534 -52942 -54730 -56519 -55446 -57324 -59201 -62331 -65460 -69723 -73985 -73478 -72968 -71060 -69153 -67245 -65334 -65170 -65006 -64842
-516 -64842 -64674 -66448 -68221 -69995 -71764 -73053 -74343 -74201 -74056 -74540 -75024 -72647 -70267 -70527 -70788 -71049 -71306 -70077 -68847
-497 -68847 -67618 -66384 -67439 -68493 -69548 -70598 -69715 -68832 -67949 -67063 -67431 -67800 -69600 -71396 -73106 -74816 -73664 -72510 -71742
-478 -71742 -70975 -73068 -75158 -73735 -72312 -72320 -72323 -71243 -70162 -67651 -65136 -65248 -65360 -65472 -65580 -67774 -69969 -67394 -64820 -66090
-458 -66090 -67361 -65770 -64179 -65658 -67137 -67185 -67234 -66984 -66735 -67379 -70885 -74179 -71749 -68068 -70110 -70811 -71511 -69708 -67905
-439 -67905 -66384 -64864 -63344 -61824 -63821 -65818 -67815 -69812 -70773 -71731 -72688 -73646 -72998 -72346 -71694 -71042 -73627 -76209 -77241
-420 -77241 -72550 -71261 -69969 -70822 -71675 -74156 -70911 -66474 -62037 -59779 -63240 -64913 -66586 -66951 -67312 -67674 -68035 -71261 -74484
-401 -74484 -74846 -75207 -71921 -68631 -66772 -64913 -65531 -66146 -66761 -67375 -66757 -66135 -65513 -64890 -67670 -70445 -70062 -69678 -66574 -66329
-381 -66329 -67633 -68937 -69767 -67733 -67130 -69387 -69250 -69108 -66761 -64414 -65408 -66399 -65185 -63970 -66750 -72390 -73739 -72223 -73393
-362 -73393 -74562 -73169 -71772 -71995 -72219 -69104 -65986 -68922 -71858 -74138 -71645 -71399 -71153 -70788 -70419 -68892 -70226 -68340 -66452
-343 -66452 -68538 -67763 -64604 -64302 -66507 -68713 -68713 -68709 -69108 -69503 -68646 -67789 -65535 -66139 -65133 -64127 -66180 -68229 -68847 -69466 -69104
-322 -69104 -68739 -68374 -68009 -67871 -67729 -67588 -67446 -68679 -69909 -72748 -72726 -72692 -72655 -72439 -72223 -71027 -69827 -68806 -67785 -64764 -64604
-301 -64604 -64265 -63925 -65375 -66824 -66247 -68530 -73229 -71250 -68914 -66578 -66120 -65662 -66634 -67606 -70934 -74261 -73415 -75430 -74436
-282 -74436 -70580 -70062 -72405 -73944 -72621 -73266 -73910 -71068 -71086 -72536 -71124 -69171 -67215 -67469 -67718 -71012 -74302 -73303 -72301
-263 -72301 -68978 -65650 -64712 -68538 -72845 -74287 -76209 -73359 -69965 -69428 -70982 -69671 -69585 -69495 -69231 -68963 -66254 -63542 -64171
-244 -64171 -64797 -68020 -71239 -72077 -72912 -71619 -70326 -70464 -65829 -63344 -63721 -65528 -67331 -68579 -69827 -67737 -65643 -64507
-226 -64507 -63370 -63665 -63955 -66586 -69216 -66601 -63981 -63810 -63639 -63467 -63292 -64179 -65066 -65952 -66835 -67931 -69026 -68691 -68352 -68761
-206 -68761 -69168 -69574 -69980 -73877 -77770 -75464 -73158 -71146 -69130 -68545 -67960 -68810 -69656 -69071 -68486 -66504 -64522 -66832 -69138
-187 -69138 -67096 -65054 -64443 -63829 -65483 -67137 -65453 -63765 -64406 -65047 -63303 -61556 -63490 -65419 -68784 -72144 -73005 -73862 -74723
-168 -74723 -75579 -76202 -76820 -77442 -78061 -77878 -77692 -77509 -77323 -78027 -78731 -78780 -74059 -72021 -69983 -69078 -68173 -67267 -66362 -65457 -64551 -64958
-146 -64958 -65364 -67200 -69037 -69555 -70069 -67364 -70382 -67532 -64678 -65043 -65408 -65494 -65576 -68519 -71463 -71012 -70557 -70103 -69648 -71958
-126 -71958 -74264 -73709 -73154 -72662 -72167 -71671 -71176 -69626 -68072 -66519 -64965 -63326 -61683 -64808 -67934 -68251 -68568 -70315 -72059
-107 -72059 -71988 -71917 -71846 -71772 -72036 -72301 -72565 -72826 -73091 -73355 -73620 -73881 -72957 -72033 -71109 -70181 -68512 -66843 -64816 -68508 -69544 -70580
-85 -70580 -70542 -70501 -69510 -68519 -68959 -69395 -68836 -68273 -70572 -72871 -73623 -74372 -73691 -73009 -73955 -74898 -75840 -76783 -77282 -77778 -78273 -78769 -75680
-62 -75680 -72588 -69495 -66403 -67487 -68568 -69648 -70729 -69086 -67439 -65792 -64145 -65304 -66459 -67614 -68769 -66262 -63750
-45 -63750 -66012 -68270 -69428 -70583 -70311 -70036 -72849 -75658 -73702 -71742 -71545 -71343 -71146 -70945 -71768 -72588 -73411 -74231 -72550 -70866
-25 -70866 -72048 -73225 -75851 -78474 -76332 -74186 -72223 -70255 -68590 -66921 -66656 -71157 -71723 -69428 -69104 -68776 -68270 -67763 -67647
-6 -67647 -67528 -67409 -67290 -67264 -67234 -68635 -70036 -70319 -70598 -68016 -65434 -62439 -59440 -57871 -56303 -58464 -60621 -62778 -64935 -67185
13 -67185 -69432 -71679 -73925 -72927 -71925 -69015 -68966 -70293 -66846 -63400 -64723 -67405 -67223 -68948 -70673 -67901 -65125 -62350 -59574
32 -59574 -59570 -59563 -60986 -62409 -65446 -68478 -66742 -65006 -65062 -65114 -66597 -68080 -66824 -65565 -65736 -65908 -64615 -63318 -62025 -60729 -62864
53 -62864 -64995 -62361 -59723 -58102 -56478 -59626 -62771 -66306 -69838 -68605 -67368 -65617 -63862 -63542 -63218 -62927 -62633 -62342 -62048
72 -62048 -63188 -64324 -62603 -60878 -64551 -68221 -69033 -69842 -71727 -73609 -74063 -74514 -70170 -65822 -66247 -66668 -66302 -65934 -65569 -65200
92 -65200 -63970 -62737 -64369 -65997 -66820 -67640 -69894 -72144 -72372 -72595 -71392 -70185 -71284 -72379 -70617 -68851 -68728 -68601 -69909
111 -69909 -71213 -69752 -68292 -68262 -68232 -68918 -69603 -67905 -66206 -65468 -64730 -65423 -66116 -65259 -64402 -63545 -62689 -64224 -65759 -67294 -68829
132 -68829 -68188 -67547 -66906 -66265 -66355 -66444 -67964 -69484 -67934 -66384 -67219 -68054 -70051 -72044 -68791 -65539 -66820 -68098 -67946 -67793
152 -67793 -66101 -64406 -67003 -69600 -70412 -71220 -70598 -69976 -70382 -70785 -69756 -68728 -68866 -69000 -67703 -66407 -66716 -67022 -67327 -67633
172 -67633 -66958 -66280 -67033 -67785 -66563 -65341 -68411 -71481 -72316 -73150 -70647 -68143 -68352 -68560 -68769 -68978 -69454 -69931 -66116 -62301
192 -62301 -59492 -56683 -59119 -61556 -62800 -64045 -62905 -61765 -61854 -61943 -63464 -64984 -62629 -60274 -59350 -58426 -59920 -61414 -61478
211 -61478 -61541 -63452 -65364 -65844 -66325 -65039 -63754 -64853 -65952 -67677 -69402 -66835 -64268 -65621 -66973 -68326 -69678 -70404 -71131
230 -71131 -71858 -72584 -73057 -73530 -74004 -74477 -73996 -73515 -70650 -67785 -66053 -64317 -65919 -67521 -67070 -66615 -64730 -62845 -64332 -65814
250 -65814 -67297 -68780 -70058 -71332 -69268 -67204 -70449 -73694 -73601 -73504 -72666 -71828 -72897 -71101 -67536 -68739 -71373 -74004 -74015
269 -74015 -74026 -72785 -71541 -69264 -69846 -71682 -68747 -63221 -60554 -62182 -63806 -64764 -65718 -66198 -69536 -76485 -78661 -76548 -74432
288 -74432 -74380 -74328 -74275 -74223 -74976 -75729 -75050 -74372 -74529 -74685 -72457 -70229 -69432 -68635 -69268 -69902 -68437 -66969 -67886 -68802 -70170 -71533
310 -71533 -72897 -74261 -72439 -70613 -71172 -71731 -71340 -70945 -66258 -61571 -62610 -63646 -64682 -65718 -65654 -65587 -65520 -65453 -64227 -62998
330 -62998 -61768 -60539 -60863 -61183 -61504 -61824 -61563 -61303 -61042 -60781 -63769 -66757 -65453 -64149 -64507 -64864 -65222 -65580 -64179 -62778
350 -62778 -63762 -64745 -66519 -68292 -67681 -67070 -68724 -70378 -69648 -68918 -70244 -71571 -69559 -67547 -64253 -60960 -61958 -62957 -63590 -64220
370 -64220 -68247 -66552 -64861 -66027 -69697 -70505 -69745 -68981 -66608 -64235 -64577 -64917 -65256 -65595 -68400 -71202 -71202 -68340 -65125 -67629
390 -67629 -69596 -71563 -72550 -73534 -71656 -69779 -69276 -68769 -65401 -62033 -62025 -62018 -62010 -61999 -63065 -64130 -65196 -66258 -64410 -62562 -63575
411 -63575 -64585 -64794 -65002 -63780 -62554 -65375 -68191 -71008 -73825 -74678 -75527 -74946 -74365 -74965 -75561 -73296 -71030 -71034 -71034 -71034 -71034 -71422 -71805
434 -71805 -70762 -69715 -71265 -72811 -68102 -69112 -71884 -71790 -70807 -69820 -67226 -64630 -66805 -68978 -70911 -72841 -71913 -70982 -68743
453 -68743 -66500 -67122 -67741 -66574 -65405 -67100 -68791 -68340 -67886 -64216 -66265 -66683 -67096 -67871 -68642 -69328 -70010 -70695 -71377 -72025 -72670
474 -72670 -75106 -71817 -68769 -65718 -65174 -64626 -64842 -65058 -66705 -68352 -66750 -65148 -66407 -67666 -68851 -70036 -68359 -66683
492 -66683 -65244 -63806 -65229 -66653 -69335 -72014 -69928 -67837 -67450 -67059 -68102 -69141 -69440 -69734 -68124 -69372 -70326 -66507 -63944
511 -63944 -64238 -65408 -66574 -66493 -66407 -63732 -61053 -61239 -61422 -63993 -66560 -69130 -71697 -68068 -64436 -65755 -67070 -65699 -67185
530 -67185 -70047 -68136 -64499 -65628 -65390 -62286 -62577 -62864 -62975 -63083 -63851 -64615 -65382 -66146 -68210 -70270 -69473 -68672 -69305 -69935 -70568
551 -70568 -71198 -71183 -71165 -68288 -65408 -67301 -69190 -68221 -67249 -68411 -69570 -70732 -71891 -71682 -71470 -68400 -65326 -68009 -70688 -71284
571 -71284 -67107 -64425 -61739 -60666 -64358 -66112 -65002 -64194 -66243 -69935 -73623 -72726 -71824 -71075 -70323 -71004 -71682 -72960 -74235
590 -74235 -74082 -73925 -73396 -72863 -72450 -67267 -62923 -63344 -63646 -63948 -64820 -65688 -67987 -70285 -68266 -66243 -67081 -67919 -65855 -63788
610 -63788 -64581 -65375 -65576 -65773 -65971 -66168 -66750 -67327 -67905 -68482 -69659 -70833 -72007 -73180 -74559 -75933 -77312 -78687 -76191 -73691
630 -73691 -71194 -68694 -66936 -65174 -66276 -67375 -68061 -68743 -69428 -70110 -70609 -71105 -71604 -72100 -69112 -66120 -67901 -69678 -68784 -67886
650 -67886 -65561 -63233 -63292 -63348 -63408 -63464 -63221 -62979 -64168 -65356 -64399 -63441 -65345 -67249 -67864 -68478 -67662 -66846 -65822 -64797 -63773
671 -63773 -62748 -63240 -63732 -64224 -64715 -64015 -63314 -62614 -61914 -62882 -63851 -64820 -65788 -64432 -63076 -61720 -60364 -63471 -66574 -66817 -67059
692 -67059 -67752 -68441 -67700 -66958 -66265 -65569 -67733 -69898 -70546 -71191 -71835 -72480 -70486 -68489 -69354 -70218 -69745 -69268 -67361 -65453 -64399
713 -64399 -63341 -65144 -66947 -66519 -66086 -65654 -65222 -64581 -63940 -66161 -68378 -70300 -72223 -69376 -66526 -67942 -69358 -67912 -66463
732 -66463 -65613 -64764 -63914 -63061 -64455 -65848 -67241 -68631 -67878 -67126 -66373 -65617 -67696 -69775 -71854 -73929 -71776 -69622 -70330 -71034
752 -71034 -71891 -72748 -73605 -74462 -74395 -74328 -72353 -73240 -74603 -71198 -69223 -67249 -69536 -71824 -71250 -70676 -70587 -70494 -67543 -69358 -74305
773 -74305 -76388 -75494 -71735 -71138 -73400 -75308 -77211 -74797 -72379 -69965 -67547 -70241 -72934 -72767 -72599 -70583 -68568 -69413 -70259
792 -70259 -72387 -74514 -73780 -73046 -74339 -75632 -74063 -72495 -71574 -70650 -66869 -63083 -63803 -64518 -66668 -68814 -66522 -64227 -66705
811 -66705 -69179 -68080 -66977 -68739 -70498 -70341 -70185 -68598 -67010 -66794 -66578 -67793 -69007 -68940 -68873 -68806 -68739 -68046 -67353 -66660 -65967
832 -65967 -65598 -65229 -64861 -64492 -64928 -65364 -65800 -66235 -65949 -65662 -66805 -67949 -66321 -64693 -65926 -67159 -67010 -66858 -63844 -65598
852 -65598 -69235 -70006 -67916 -65826 -66280 -66731 -68612 -70494 -70233 -69969 -70181 -67532 -65438 -68109 -69529 -68087 -65487 -62882 -62961
871 -62961 -63039 -64365 -65688 -66832 -63206 -64354 -65498 -67416 -69335 -72293 -69529 -68374 -67215 -66656 -63236 -60591 -63665 -64514
889 -64514 -65364 -63233 -61098 -61709 -62320 -65315 -68307 -69264 -70218 -69741 -69264 -66049 -62830 -62949 -63069 -62342 -61612 -66127 -70643 -71228
909 -71228 -71809 -72390 -72971 -72163 -71355 -70546 -69734 -68925 -68117 -67308 -66496 -66478 -66459 -66440 -66418 -65058 -63698 -62338 -60975 -58758 -56537 -59563
931 -59563 -62588 -62279 -61966 -60222 -58479 -59525 -60569 -61612 -62655 -65341 -68024 -67368 -66712 -69387 -72062 -72353 -72640 -69562 -66485
950 -66485 -66746 -67003 -66772 -66541 -66310 -66075 -65338 -64600 -63862 -63121 -63370 -63620 -63870 -64116 -63829 -63542 -65639 -67733 -65718 -63702 -63117 -62528
972 -62528 -62629 -62730 -62830 -62927 -62245 -61563 -63266 -64969 -66522 -68076 -69630 -71183 -71038 -70893 -70747 -70602 -70397 -70192 -68735 -67279 -66604
993 -66604 -68791 -70561 -66608 -64473 -68061 -69503 -70945 -69972 -69000 -68027 -67055 -66887 -66720 -66552 -66384 -67744 -69100 -70457 -71813
1012 -71813 -73441 -75065 -72398 -69730 -69667 -69600 -69533 -69466 -69134 -68799 -68463 -68128 -67908 -67685 -67461 -67238 -66809 -66377 -65945 -65513 -64361 -63206
1034 -63206 -64436 -65665 -68240 -70811 -70997 -71183 -69000 -66817 -67018 -67215 -68668 -70121 -69190 -68255 -66578 -64902 -66563 -68221 -68959
1053 -68959 -69697 -70434 -71168 -70583 -69995 -67975 -65956 -68441 -70922 -70065 -69209 -67878 -66545 -67595 -68646 -68866 -69082 -69298 -69514 -68296
1073 -68296 -67074 -65855 -64633 -65352 -66068 -66787 -67502 -69011 -70516 -68687 -66854 -66902 -66947 -66995 -67040 -66671 -66302 -66232 -66161 -64302 -67212 -69943
1095 -69943 -67905 -68072 -65379 -62387 -62256 -64153 -66049 -65561 -65073 -68244 -68553 -65226 -66668 -68765 -68001 -67715 -67424 -67375 -67327 -65848
1115 -65848 -64369 -64559 -64749 -63508 -62264 -62558 -62852 -65531 -68210 -68266 -68322 -68378 -68430 -68925 -69421 -69916 -70412 -70550 -70688 -70825 -70960 -69972
1137 -69972 -68981 -67990 -66999 -69585 -72170 -69987 -67804 -66548 -65289 -66891 -68493 -67770 -67048 -69186 -71325 -70781 -70233 -69685 -69138
1156 -69138 -69037 -68937 -68836 -68735 -70308 -71876 -72014 -72152 -69697 -67241 -69555 -71869 -72238 -72606 -72975 -73344 -74369 -75393 -76418 -77442
1176 -77442 -76492 -75542 -74592 -73642 -69115 -64589 -65010 -65431 -66630 -70691 -73143 -70825 -70654 -73344 -74126 -74909 -72115 -69320 -69387 -69454
1196 -69454 -70207 -70960 -70282 -69603 -71153 -72700 -71388 -70073 -68612 -67148 -65688 -64224 -65602 -66977 -68355 -69730 -69708 -69682 -66798
1215 -66798 -63911 -64011 -64108 -65639 -67167 -68251 -69331 -70416 -71496 -68340 -65181 -64887 -64589 -63221 -61850 -63344 -64835 -66243
1233 -66243 -67651 -67152 -69514 -70803 -67323 -66705 -66086 -68009 -69931 -68992 -68054 -67472 -66891 -67741 -68590 -69291 -69991 -69261 -68530 -65893
1253 -65893 -63255 -63478 -63702 -64164 -64626 -65088 -65550 -65535 -65520 -65505 -65490 -68955 -72416 -71112 -69805 -68560 -67312 -68929 -70542 -67830 -65114
1274 -65114 -65263 -65408 -68091 -70770 -68683 -66593 -64518 -62439 -61794 -61146 -65598 -70047 -67823 -65595 -63423 -61247 -63844 -66437
1292 -66437 -69153 -71865 -69812 -67756 -66563 -65371 -67040 -68709 -72346 -75982 -74849 -73717 -71876 -70036 -68195 -66355 -67793
1309 -67793 -69231 -70669 -72107 -70486 -68866 -67543 -66221 -64183 -66914 -68571 -67368 -68907 -70445 -71805 -73165 -69965 -66764
1326 -66764 -64995 -63225 -65133 -67040 -66265 -65490 -65282 -67934 -73091 -73478 -73597 -73717 -72107 -70498 -70855 -71213 -70140 -73836 -74823
1345 -74823 -72949 -73460 -71109 -66433 -66526 -68527 -70527 -71276 -72025 -72774 -73523 -72603 -71682 -70762 -69842 -67316 -64790 -65125 -65460 -66809
1365 -66809 -68158 -69507 -70855 -72234 -73612 -74991 -76369 -74857 -73344 -73262 -73180 -75348 -77517 -73009 -68501 -69507 -70513 -71518
1383 -71518 -72524 -71489 -70453 -69417 -68381 -68359 -68337 -68314 -68292 -69536 -70781 -69164 -67543 -66820 -66098 -66805 -67510 -66265 -65021 -65207
1403 -65207 -65390 -65397 -65405 -65412 -65416 -67681 -69946 -72033 -69346 -65710 -62074 -62908 -66601 -69633 -67897 -67413 -69786 -67662 -65539 -63594 -61645
1424 -61645 -62022 -62398 -64205 -66012 -63885 -61757 -64399 -67040 -67051 -67063 -65643 -64224 -64265 -64306 -67208 -65341 -62290 -62100 -64771 -67443
1444 -67443 -65822 -64201 -65442 -66683 -65293 -63903 -65375 -66846 -66351 -65855 -67267 -65818 -63713 -66373 -69033 -66925 -63687 -63307
1462 -63307 -63881 -64455 -65785 -67111 -65576 -64041 -63493 -62942 -64000 -65058 -65136 -68072 -71902 -70963 -71012 -68195 -66690 -65185 -65643 -66098
1482 -66098 -66552 -67007 -65498 -63985 -62472 -60960 -60520 -60081 -62502 -64924 -67525 -70125 -69864 -69603 -69961 -70319 -67815 -65311 -64179
1501 -64179 -63046 -66683 -70319 -70788 -71258 -71727 -72197 -71116 -70036 -68955 -67875 -69507 -71138 -69909 -68679 -67003 -65326 -63650
1519 -63650 -61973 -61567 -61161 -62186 -63210 -63013 -62815 -65479 -68143 -68631 -69119 -69607 -70095 -70673 -71250 -70397 -69544 -67107 -64671 -67003
1539 -67003 -69335 -68001 -66668 -65334 -64000 -66601 -69201 -68940 -68679 -68925 -69171 -68523 -65013 -62305 -65315 -67972 -67763 -66694 -65621
1558 -65621 -64373 -63121 -64823 -66522 -65364 -64201 -65755 -67305 -68858 -70408 -70155 -69898 -70181 -67599 -63233 -64585 -67014 -66578
1576 -66578 -65610 -64637 -64920 -65200 -66288 -67372 -65598 -63821 -65718 -67610 -66645 -65677 -65963 -66247 -66533 -66817 -67290 -67759 -65371 -62979
1596 -62979 -65479 -67975 -67614 -67249 -67312 -67372 -67435 -67495 -68244 -68989 -68307 -67621 -71582 -75539 -74730 -73918 -70814 -67707 -67465 -67219 -66053 -64887
1618 -64887 -68489 -72092 -70241 -68389 -67968 -67547 -68586 -69626 -73884 -72420 -70032 -67644 -67759 -67875 -68549 -69223 -69898 -70572 -67849
1637 -67849 -65125 -67171 -69216 -70881 -72547 -71351 -70155 -68959 -67763 -67998 -68232 -66981 -65725 -65904 -66079 -68404 -70725 -70486
1655 -70486 -70244 -70222 -67335 -66001 -70386 -74745 -76239 -74458 -72673 -72878 -73080 -73284 -73486 -73959 -74428 -74901 -75371 -73221 -71068 -68918
1675 -68918 -66764 -68221 -69674 -71131 -72584 -69037 -65487 -68139 -70788 -73292 -75792 -72096 -68396 -67107 -65814 -67864 -69909
1692 -69909 -72733 -75553 -73132 -70706 -71034 -71358 -73117 -74872 -75259 -75643 -73646 -71645 -69909 -68169 -69771 -71369 -71451 -71530 -73042
1711 -73042 -74551 -73221 -71887 -70557 -69223 -68489 -67752 -67018 -66280 -65039 -63795 -64939 -66079 -64987 -63892 -66139 -68381 -67856
1729 -67856 -67327 -69186 -71042 -70844 -70643 -70445 -70244 -67416 -64585 -64142 -63694 -64056 -64414 -68113 -71809 -70073 -68333 -68027 -67718 -66817
1749 -66817 -65911 -65010 -64104 -65759 -67409 -69063 -70714 -70520 -70323 -68162 -68858 -70103 -65621 -61321 -62741 -64045 -65345 -67007 -68665
1768 -68665 -67987 -67305 -66627 -65945 -65058 -64168 -63281 -62391 -60893 -59395 -60282 -61168 -59850 -58531 -61325 -64119 -65766 -64551 -64768 -64984
1788 -64984 -66481 -65118 -66794 -68471 -69812 -71153 -69335 -67517 -63851 -63046 -64924 -66802 -67592 -68381 -66608 -64835 -67979 -68262
1806 -68262 -67770 -67279 -67163 -67048 -67111 -67174 -67446 -70580 -74965 -74581 -71396 -71071 -69019 -66966 -64853 -65602 -64265 -65788 -69909 -69261
1826 -69261 -67361 -65460 -65587 -68575 -69179 -66921 -67793 -68665 -69715 -67905 -66958 -68873 -71384 -73895 -73448 -72998 -72550 -72100 -72249 -72394
1846 -72394 -72543 -72688 -73389 -74085 -72580 -71071 -70520 -72826 -73348 -73866 -72584 -68437 -66500 -67420 -67778 -65270 -68668 -72062 -72420 -69913
1866 -69913 -69615 -72174 -72502 -69965 -69220 -68471 -68866 -69257 -69056 -65990 -63553 -63974 -64041 -64104 -66034 -67960 -65777 -63590 -63136 -65539
1886 -65539 -66336 -67130 -66925 -66716 -66511 -66302 -68571 -70837 -72152 -70602 -72007 -70546 -70520 -70490 -68586 -66679 -62569 -58456 -57193 -58791
1906 -58791 -60390 -61988 -63646 -68165 -70896 -68858 -72081 -75304 -75367 -75430 -74421 -73411 -72401 -71392 -70293 -69194 -68095 -66995
1924 -66995 -68579 -70162 -68884 -67606 -68579 -69551 -70345 -71138 -72886 -71772 -70658 -72405 -70855 -69305 -69007 -71571 -75743 -77055
1942 -77055 -73478 -69902 -67502 -65103 -65863 -69484 -69440 -69395 -70960 -72524 -71269 -70013 -66075 -62137 -61567 -63858 -64719 -62718 -63370
1961 -63370 -64022 -63065 -62107 -62610 -63113 -63616 -64119 -65002 -65881 -67118 -65494 -67837 -73039 -74365 -70922 -69048 -67171 -64995 -67588
1980 -67588 -71198 -71943 -69648 -67353 -68981 -67744 -68121 -68493 -68124 -67752 -68814 -69872 -68743 -67610 -67554 -70356 -71224 -69227 -67592
1999 -67592 -68814 -67402 -68851 -68870 -68884 -67413 -65941 -62860 -62636 -61366 -60095 -63475 -63989 -60751 -57514 -60774 -64030 -64078 -64123 -63993
2019 -63993 -63858 -65963 -65203 -62838 -63329 -66768 -67342 -65237 -65990 -65494 -64995 -64142 -66146 -68136 -64402 -62458 -63374 -64201 -65028 -66034
2039 -66034 -67040 -66839 -66638 -66437 -66235 -67584 -68933 -70282 -71630 -72603 -73575 -72580 -74447 -76015 -71861 -68244 -64626 -63273 -61921
2058 -61921 -63430 -64939 -68653 -72368 -71314 -70259 -69741 -69223 -68706 -68188 -69518 -70848 -69317 -67785 -65986 -64186 -65248 -66310
2076 -66310 -68266 -70222 -67409 -64596 -65453 -66310 -67167 -68024 -67599 -67174 -68180 -69186 -70550 -71913 -70416 -68918 -69238 -69559 -67018
2095 -67018 -64477 -62558 -60639 -63490 -66340 -64719 -63098 -66247 -69395 -68758 -68121 -67484 -66846 -66865 -66884 -66902 -66921 -67353 -67785 -68218 -68650
2116 -68650 -68486 -68322 -68158 -67994 -67279 -66563 -65848 -65133 -65311 -65490 -67636 -66921 -64052 -66902 -66712 -66522 -63981 -67159 -70159 -70296 -67912
2137 -67912 -65524 -65818 -66112 -65874 -65632 -63959 -62286 -62186 -62085 -64846 -67606 -67118 -66630 -66142 -65654 -64816 -63978 -63318 -62659 -63102 -66407
2158 -66407 -71321 -70513 -67036 -63557 -64965 -66373 -68262 -70147 -68694 -67241 -66671 -66098 -65524 -64950 -67152 -69350 -71548 -73746
2176 -73746 -72137 -70524 -68914 -67301 -65423 -63542 -64048 -64551 -64551 -64548 -64548 -64544 -63948 -63348 -62752 -62152 -62584 -63013 -64876 -66735 -69402 -72066
2198 -72066 -71396 -70721 -69231 -67737 -67677 -67614 -69343 -71068 -69458 -67845 -67852 -67860 -69298 -70736 -68210 -65684 -63158 -60632 -63016 -65401
2218 -65401 -64447 -63493 -66742 -69991 -69902 -69812 -64555 -59294 -61191 -63083 -64741 -66396 -66623 -66846 -68005 -69160 -66027 -62890 -63631
2237 -63631 -64369 -65110 -65848 -64592 -63337 -62081 -60826 -60882 -60937 -60993 -61049 -62536 -64022 -65509 -66995 -67647 -68299 -68951 -69603 -67964 -66325
2258 -66325 -64686 -63046 -61765 -60483 -60632 -60781 -63024 -65267 -65125 -64984 -65438 -65893 -66347 -66802 -66302 -65803 -65304 -64805 -64574 -64343 -64112
2279 -64112 -63881 -61750 -59619 -61779 -63940 -66042 -68143 -70244 -72346 -73992 -75635 -74898 -74156 -69633 -65107 -64876 -64641 -68985
2297 -68985 -73325 -70516 -67703 -66265 -64823 -67677 -70527 -72573 -74618 -74458 -74298 -70948 -70460 -71761 -67338 -64227 -63978 -62536
2315 -62536 -63955 -66537 -69119 -66634 -64149 -63635 -63121 -64633 -66146 -70162 -68456 -65975 -66355 -68218 -70080 -68784 -67487 -67919
2333 -67919 -68352 -68784 -69216 -68385 -67554 -66723 -65893 -67267 -68642 -68586 -68530 -70218 -71906 -71209 -70513 -70144 -69775 -72625 -69752 -67238 -64723
2354 -64723 -66142 -67562 -67640 -67718 -66366 -65013 -62566 -60118 -61962 -63806 -63952 -64097 -62812 -61526 -61794 -62059 -62327 -62592 -60744 -58892
2374 -58892 -60382 -61869 -62525 -63177 -61448 -59715 -60371 -61023 -61679 -62331 -62797 -63262 -63728 -64194 -64987 -65781 -63415 -61049 -60487 -62785
2394 -62785 -66694 -64879 -64943 -65006 -64712 -64417 -63564 -62711 -61858 -61005 -63072 -65140 -65777 -66414 -68482 -70550 -70233 -69916 -70017 -70118 -70218
2415 -70218 -70319 -70960 -71600 -72241 -72882 -72599 -72316 -70602 -68888 -70408 -71928 -70587 -69246 -68530 -67815 -67100 -66384 -65841 -65297 -67614
2435 -67614 -69931 -69089 -68247 -67405 -66563 -67368 -68173 -68978 -69782 -70498 -71213 -71928 -72644 -72144 -71645 -69715 -67785 -69820 -71854 -71027 -70200
2456 -70200 -70498 -70796 -71094 -71392 -68411 -65431 -65252 -67934 -70773 -67890 -66794 -68560 -69492 -70423 -71533 -72644 -72115 -71586 -71056 -70527
2476 -70527 -70684 -70840 -72428 -74015 -71817 -69618 -70282 -70945 -68866 -66787 -65960 -65133 -65900 -63806 -62607 -67130 -69000 -65148 -64335
2495 -64335 -69246 -73195 -74283 -72569 -70855 -66817 -62778 -63508 -64238 -64194 -64149 -66966 -69782 -68486 -67189 -65893 -64596 -66861 -69127
2514 -69127 -66623 -64119 -64715 -65311 -65908 -66504 -68560 -70617 -69812 -69007 -64447 -59887 -60095 -60304 -64171 -68039 -69045 -70051 -70401
2533 -70401 -70751 -68240 -65729 -65781 -65833 -65885 -65937 -67152 -68367 -68150 -67934 -65591 -63247 -63765 -64283 -63698 -63113 -62528 -61943 -61508 -61072 -60636
2555 -60636 -60200 -59883 -59566 -61753 -63940 -70352 -71038 -70177 -69313 -68452 -67588 -66727 -65863 -63579 -61291 -59008 -56720 -58519 -60315 -60684
2575 -60684 -61049 -62744 -64436 -63270 -62100 -62454 -62804 -63158 -63508 -63601 -63691 -63784 -63873 -66560 -69242 -67159 -65073 -65975 -66876 -66347 -65818
2596 -65818 -65080 -64343 -65036 -65729 -64753 -63776 -64231 -64686 -64604 -64522 -64440 -64358 -66384 -68411 -67577 -66742 -65818 -64894 -62540 -60185 -60095 -60006 -59917 -59827
2620 -59827 -60244 -60662 -63940 -67219 -66254 -65289 -67185 -69082 -67819 -66556 -66723 -66891 -67998 -69104 -68780 -68456 -66612 -64768 -64354
2639 -64354 -63940 -64250 -64555 -67726 -70893 -70427 -69957 -69492 -69022 -68437 -67849 -65833 -63814 -62007 -60196 -61250 -62301 -59470 -56634
2658 -56634 -53445 -55975 -58747 -61515 -65002 -62763 -59864 -56962 -56567 -56169 -59201 -62230 -63832 -65431 -64730 -64030 -63329 -62629 -63031
2677 -63031 -63434 -63836 -64238 -66273 -68307 -70341 -72375 -68627 -64879 -65900 -66921 -67685 -68448 -69212 -69976 -67759 -65542 -66187 -66832
2696 -66832 -67387 -67942 -68497 -69052 -69071 -69089 -69108 -69127 -68091 -67055 -66019 -64984 -66571 -68158 -69745 -71332 -70907 -70483 -70058 -69633 -67301
2717 -67301 -64969 -65498 -66027 -69834 -73642 -72681 -71720 -70341 -68963 -70445 -71928 -70863 -69797 -68732 -67666 -67972 -68277 -68583 -68888
2736 -68888 -67461 -66034 -64607 -63180 -61515 -59850 -61046 -62241 -62424 -62607 -65650 -68694 -72692 -76690 -75919 -75147 -70043 -64939
2754 -64939 -66511 -68083 -68225 -68367 -68508 -68650 -68463 -68277 -68091 -67905 -68434 -68963 -69492 -70021 -68940 -67860 -66779 -65699 -65155 -64611 -66928
2775 -66928 -69246 -69954 -70662 -71369 -72077 -71116 -70155 -66094 -66802 -68955 -64432 -62174 -62778 -64633 -63627 -62800 -64835 -65855 -66876
2794 -66876 -65215 -63553 -64216 -64879 -62681 -60483 -59779 -59071 -63136 -67197 -67685 -68169 -68657 -69141 -69093 -69041 -68992 -68940 -67878 -66813 -70520
2815 -70520 -74223 -74760 -75293 -75829 -76362 -77614 -78862 -77252 -75639 -74447 -73251 -72059 -70863 -70863 -70859 -70859 -70855 -73232 -75606 -73214 -70818
2836 -70818 -70393 -69965 -69540 -69112 -68747 -68378 -68013 -67644 -68113 -68579 -72267 -70229 -68534 -66835 -64782 -62726 -64548 -66366 -67830 -69291
2856 -69291 -74182 -73348 -72875 -72398 -71984 -71567 -71153 -70736 -69469 -68203 -66936 -65669 -65118 -64566 -64015 -63464 -61988 -60513 -59037 -57562
2876 -57562 -58233 -58903 -59574 -60244 -60513 -60781 -61407 -62033 -58724 -61139 -60334 -59529 -60930 -62331 -63732 -65133 -65818 -66504 -67189 -67875 -67368
2897 -67368 -66858 -66351 -65841 -64440 -63035 -64496 -65952 -65788 -65621 -65457 -65289 -65125 -64958 -64794 -64626 -64145 -63661 -60319 -56973 -59771
2917 -59771 -62566 -65364 -68158 -69764 -71366 -72971 -74574 -73020 -71463 -73307 -69425 -65434 -64306 -65978 -67651 -66820 -65990 -65338
2935 -65338 -64686 -65390 -68955 -72521 -73225 -71992 -70758 -70777 -70796 -69656 -68512 -70233 -71951 -70453 -68951 -70434 -74775 -74171 -70703
2954 -70703 -70457 -70207 -68381 -66552 -66515 -63613 -63121 -65490 -67979 -67606 -63836 -64835 -65833 -66832 -69171 -71511 -72599 -70825 -70781 -70736
2974 -70736 -70691 -70647 -69115 -70442 -70162 -69879 -68765 -67647 -64924 -65058 -65434 -65807 -66362 -66914 -66604 -66291 -62942 -62450 -64242 -66034 -63355
2995 -63355 -63538 -67804 -69209 -65904 -62599 -60695 -61653 -62610 -60706 -62320 -63933 -65367 -66802 -66884 -66966 -67048 -67130 -66645 -66161 -64246
3015 -64246 -62331 -64499 -66668 -66153 -65639 -64440 -66101 -68836 -71571 -74331 -74231 -72878 -71526 -70263 -69000 -69168 -69335 -69235 -69134
3034 -69134 -67245 -68218 -70770 -70460 -67349 -64238 -62715 -64052 -63780 -63508 -64041 -64574 -66537 -68501 -69987 -71474 -67893 -61452 -59838
3053 -59838 -58225 -61202 -64179 -65356 -66533 -66280 -66027 -65684 -65341 -64998 -64656 -65043 -65431 -65520 -65610 -68173 -65967 -65013 -64060 -63940 -63821
3074 -63821 -66563 -69305 -69633 -69961 -71720 -73478 -70214 -66951 -65297 -63642 -65148 -69514 -70185 -66086 -66079 -66071 -65766 -65460 -65095 -64730
3094 -64730 -67226 -69723 -69149 -68575 -70863 -73150 -71533 -69916 -69730 -69544 -68683 -67823 -63981 -64909 -68728 -67778 -65338 -65759 -67998
3113 -67998 -70237 -69793 -69350 -67595 -65841 -66947 -68054 -69875 -71694 -67137 -62577 -60464 -63117 -68933 -69976 -68653 -72096 -75244
3131 -75244 -73620 -71403 -69182 -66668 -64149 -65647 -67141 -65777 -64410 -62867 -61321 -62640 -63955 -66161 -68363 -67707 -67048 -67465
3149 -67465 -67878 -68296 -68709 -68814 -68914 -66332 -68519 -69991 -71463 -70371 -69279 -68542 -67800 -67059 -66317 -66768 -67219 -67670 -68121 -65971
3169 -65971 -63817 -64525 -65233 -65047 -64861 -64674 -64488 -64991 -65490 -65990 -66489 -68091 -69693 -66526 -63359 -62085 -60811 -60967 -61120 -62618
3189 -62618 -64112 -62271 -60427 -64667 -68907 -70762 -72614 -72204 -71790 -68996 -66198 -62193 -58188 -58475 -58758 -61250 -63739 -67662
3207 -67662 -71582 -70989 -70397 -71235 -72070 -69779 -67484 -69484 -71481 -70404 -69324 -68244 -67163 -67394 -67625 -67856 -68087 -65054 -62022
3226 -62022 -64235 -66448 -67111 -67774 -68437 -69100 -69302 -69499 -65405 -61310 -62402 -63493 -66016 -68538 -68251 -67964 -67677 -67390 -68892 -70393
3246 -70393 -69510 -68627 -67238 -65844 -64451 -63057 -65274 -67487 -65408 -63329 -61858 -60382 -61291 -62200 -62547 -62890 -63411 -63933 -65621
3265 -65621 -70166 -73400 -71865 -71705 -71541 -71079 -70617 -67893 -65166 -66731 -68296 -67539 -66779 -64589 -62398 -62793 -63184 -63575 -63966 -63110
3285 -63110 -62249 -64727 -67204 -67837 -68467 -69097 -69726 -68896 -68065 -67234 -66403 -66068 -65729 -65390 -65051 -65162 -65270 -65379 -65487 -69354 -73217
3306 -73217 -72789 -72360 -69428 -66496 -65949 -65401 -66157 -66914 -67670 -68422 -67659 -66895 -66131 -65364 -65211 -65058 -64905 -64749 -64596 -64443 -64291 -64134
3328 -64134 -64261 -64387 -64514 -64637 -65479 -66321 -67163 -68001 -66802 -65602 -64402 -63199 -63668 -64138 -64607 -65073 -66027 -66981 -67934 -68884 -67782
3349 -67782 -66679 -65576 -64469 -63605 -62741 -63307 -63870 -67387 -70904 -69175 -67443 -67375 -67308 -68672 -70032 -68832 -67633 -67864 -68091 -66772
3369 -66772 -65453 -65565 -65673 -69182 -72692 -72863 -73031 -72346 -71656 -72398 -73139 -72245 -71347 -70449 -69551 -68434 -67312 -67621 -67931 -68780 -69626
3390 -69626 -68087 -66548 -66481 -66411 -66340 -66269 -65606 -64939 -64272 -63605 -62107 -60606 -63396 -66187 -66299 -66407 -66515 -66623 -70878 -75132 -75095 -75058
3412 -75058 -74037 -73016 -68657 -64298 -63613 -62927 -65580 -68232 -69156 -70080 -71004 -71928 -72185 -72442 -72700 -72957 -71694 -70431 -69168 -67905
3432 -67905 -66619 -65334 -66433 -67532 -68303 -69074 -69548 -70021 -74182 -73575 -72789 -71999 -71511 -71023 -70535 -70043 -67014 -63985 -63817 -63646
3452 -63646 -66727 -69808 -68121 -63568 -61209 -63620 -64600 -65576 -64469 -63363 -63687 -64007 -64525 -65043 -65561 -66075 -66325 -66574 -66824 -67070
3472 -67070 -66213 -65352 -64492 -63631 -64831 -66027 -70084 -74141 -73933 -73720 -74641 -75561 -75442 -70550 -68340 -66131 -66794 -67454 -68113 -68773
3492 -68773 -70002 -71228 -73884 -76541 -74067 -71589 -71973 -72357 -71403 -70445 -69488 -68530 -69600 -70665 -68870 -67074 -68590 -70103 -70185
3511 -70185 -70267 -70390 -70509 -73489 -76470 -78262 -80050 -78977 -77904 -75729 -73549 -72800 -72051 -71038 -70021 -69004 -67987 -67718 -67446
3530 -67446 -67174 -66902 -65293 -63680 -63497 -63314 -64376 -65438 -69063 -72685 -72942 -68430 -66601 -64768 -65621 -66474 -67327 -68177 -70133
3549 -70133 -72089 -69276 -66459 -66697 -66936 -68605 -70270 -69644 -69019 -68393 -67763 -67212 -66660 -66109 -65554 -66194 -66835 -67476 -68113 -68042 -67972 -67901
3571 -67901 -67830 -67759 -67688 -67618 -67547 -66954 -66362 -65770 -65177 -64913 -64648 -61522 -58397 -60911 -63426 -67372 -66548 -62238 -60788 -64108 -70289
3592 -70289 -70956 -66854 -66865 -69738 -71805 -73873 -69443 -65013 -64261 -63508 -64186 -64861 -65509 -66157 -66805 -67450 -68426 -69402 -70378 -71351 -72267
3613 -72267 -73184 -71239 -69291 -68698 -68106 -67513 -66917 -68113 -69309 -70505 -71697 -68601 -65505 -67178 -68847 -66943 -65039 -65699 -66355
3632 -66355 -68858 -66589 -67007 -67420 -66735 -66045 -68221 -70393 -69916 -69436 -67528 -65617 -67495 -69369 -68385 -67398 -66548 -65699 -64849 -64000
3652 -64000 -64641 -65282 -65922 -66563 -65669 -64775 -63881 -62987 -63106 -63225 -63344 -63464 -65025 -66586 -65285 -63985 -64920 -65855 -65360 -64864 -66738
3673 -66738 -68612 -67625 -66638 -65978 -65319 -64659 -64000 -63523 -63043 -62566 -62085 -61101 -60114 -61992 -63866 -65103 -66336 -66142 -65945 -66466 -66984
3694 -66984 -67506 -68024 -67010 -65993 -66411 -66824 -69268 -71708 -71291 -70870 -70706 -70539 -68944 -67346 -68493 -69637 -69354 -69067 -68326 -67580
3714 -67580 -66839 -66094 -66753 -67409 -68068 -68724 -67059 -65390 -66586 -67778 -68139 -68497 -65997 -63493 -62800 -62107 -61414 -60718 -59786 -58855 -60785
3735 -60785 -62711 -62569 -62428 -62286 -62141 -65934 -69726 -68750 -67770 -65699 -63627 -61556 -59481 -57767 -56053 -57201 -58344 -59835 -61325
3754 -61325 -62815 -64302 -65285 -66269 -67253 -68232 -70036 -71839 -72211 -72580 -72387 -72193 -69138 -66079 -66198 -66317 -66437 -66552 -65688 -64823 -62528
3775 -62528 -60230 -64045 -67860 -66906 -65949 -65621 -65293 -66396 -67495 -68180 -68866 -68121 -67372 -66180 -64987 -65226 -65460 -67629 -69797 -69104
3795 -69104 -68408 -66671 -64935 -64630 -64320 -64358 -64395 -65863 -67327 -67901 -68475 -66187 -63896 -65963 -68027 -70092 -72156 -72912 -73664 -74417
3815 -74417 -75170 -72208 -69242 -69138 -69033 -68307 -67577 -65416 -63255 -63214 -63169 -64197 -68087 -69477 -68001 -65274 -65408 -64704 -63996 -63467
3835 -63467 -62938 -63545 -64149 -64753 -65356 -67491 -69626 -70151 -70673 -70334 -67133 -62860 -58583 -59466 -63210 -65047 -66880 -68925 -66202
3854 -66202 -64730 -63255 -62364 -61474 -60584 -64458 -68963 -70606 -71295 -71980 -71895 -71809 -71723 -71634 -70952 -70270 -69589 -68903 -68825 -68747 -69920 -73951
3876 -73951 -72890 -71828 -69693 -67554 -69205 -73717 -73579 -73437 -75982 -75665 -72487 -72167 -72197 -72223 -73862 -75498 -75080 -74659 -74063 -73463
3896 -73463 -75453 -74577 -75494 -76407 -71958 -70367 -70211 -70051 -69723 -72252 -70315 -68374 -65542 -62707 -64466 -66221 -68702 -68318 -66686
3915 -66686 -65051 -66727 -68400 -68646 -68888 -70527 -72167 -70647 -66262 -64473 -62685 -60896 -59104 -57569 -58896 -61295 -63691 -66805
3933 -66805 -67059 -66060 -65058 -65569 -66079 -66589 -67096 -65550 -64004 -63709 -66273 -67558 -68843 -68698 -68549 -69834 -68258 -65431 -62599
3952 -62599 -64317 -66031 -63631 -61232 -60982 -63590 -67450 -66541 -63236 -62789 -66336 -67022 -64045 -61064 -63151 -65237 -66351 -67461
3970 -67461 -67141 -66820 -68441 -70058 -70244 -70431 -69935 -69436 -71798 -69391 -67316 -68098 -65542 -62987 -64134 -65282 -64045 -62804 -64041
3989 -64041 -65278 -66515 -67748 -66615 -65483 -63873 -67029 -67715 -65539 -66820 -70960 -73024 -72226 -70833 -69436 -69056 -68676 -68296
4007 -68296 -67912 -68687 -69462 -70237 -71008 -70859 -70710 -70561 -70408 -68821 -67234 -68031 -68829 -68016 -67204 -66392 -65580 -68456 -71332 -69916 -68501
4028 -68501 -68665 -68829 -68992 -69156 -69712 -70267 -70822 -71377 -69667 -67957 -66247 -64537 -64481 -64425 -64369 -64313 -65092 -65870 -66649 -67428 -67923 -68415 -68907
4051 -68907 -69399 -68165 -66928 -63307 -59686 -60405 -61120 -64220 -67320 -67770 -68218 -68665 -69112 -68445 -67778 -66515 -70017 -71049 -67312
4070 -67312 -63516 -62577 -60807 -59037 -59831 -60621 -59775 -58929 -58084 -57234 -56474 -55710 -55423 -57998 -61291 -59812 -61195 -62577 -64440 -66299
4090 -66299 -66727 -67156 -64339 -61519 -63944 -66370 -67279 -68188 -64805 -61418 -62476 -63534 -66023 -68508 -69060 -69611 -70162 -70710 -69354
4109 -69354 -67998 -66642 -65282 -62029 -58773 -59809 -60844 -61526 -62204 -65744 -64514 -60472 -59287 -61440 -63594 -63575 -63553 -63531 -63508 -63095
4129 -63095 -62677 -62260 -61843 -61817 -61787 -65095 -68404 -67223 -66038 -64853 -63668 -62696 -61720 -60744 -59768 -60166 -60565 -60964 -61362 -63370 -65379
4150 -65379 -65002 -64626 -65628 -66630 -66381 -66131 -66567 -69864 -71850 -69067 -68314 -67562 -66511 -65460 -65274 -65088 -66332 -67577 -69179
4169 -69179 -70781 -69045 -67308 -66943 -66578 -68598 -70617 -68288 -65956 -66008 -66060 -65610 -65155 -67085 -69015 -68281 -67543 -66805 -66068 -67569
4189 -67569 -69067 -68180 -67294 -64421 -61545 -64868 -68191 -68955 -69715 -70475 -71235 -70971 -70703 -70434 -70166 -69067 -67964 -67040 -66116 -65140
4209 -65140 -67025 -67301 -67577 -66720 -65863 -64827 -63791 -65975 -65297 -66228 -67159 -65408 -63657 -61906 -60155 -61657 -63158 -64659 -66161
4228 -66161 -68199 -70237 -71798 -76220 -78653 -76317 -74458 -72599 -71336 -70073 -70241 -70408 -70602 -70796 -69559 -68322 -67174 -66027
4246 -66027 -66131 -66235 -67435 -65773 -65721 -65669 -65647 -65624 -67808 -69991 -70017 -67182 -63095 -61869 -60107 -61206 -64212 -67219 -64399 -61578
4266 -61578 -61321 -65833 -70524 -75214 -75792 -73508 -70952 -71254 -73884 -76511 -76787 -74197 -72923 -71645 -75140 -73862 -69369 -67733
4284 -67733 -68039 -68340 -70255 -72167 -74566 -76965 -74894 -72822 -72152 -68620 -67472 -69186 -68612 -68039 -67644 -67249 -67778 -68307 -69015 -66861
4304 -66861 -64749 -62636 -62730 -62819 -64224 -65628 -67033 -68434 -68445 -68456 -68467 -68475 -69708 -70941 -73784 -73761 -71377 -68989 -65170 -66120 -67402
$$ [...]
##END=	
