##TITLE=	2MLoJD17S927wA5o9YEHTA/2059s
##JCAMPDX=	6.0	$$ NMR Plug-in 1.13 of MestReNova 11.0.4-18998
##DATATYPE=	NMRSPECTRUM
##DATACLASS=	XYDATA
##NUMDIM=	1
##ORIGIN=	Bruker BioSpin GmbH
##OWNER=	andrew
##.OBSERVEFREQUENCY=	600.30184456100005264
##.OBSERVENUCLEUS=	^1H
##.SOLVENTNAME=	CD2Cl2
##.PULSESEQUENCE=	zg
##LONGDATE=	2015/06/05 10:19:19.000
##.ACQUISITIONMODE=	SIMULTANEOUS (DQD)
##$ORIGINALFORMAT=	Bruker XWIN-NMR
##$PARAMETERFILE=	(acqus, ASCII, /var/folders/f6/rjf_tdyn2v98c5c0wvkgn4s80000gn/T/2MLoJD17S927wA5o9YEHTA/2059s/acqus, 0)
$$ ##TITLE= Parameter file, TOPSPIN		Version 2.1
$$ ##JCAMPDX= 5.0
$$ ##DATATYPE= Parameter Values
$$ ##NPOINTS= 10	$$ modification sequence number
$$ ##ORIGIN= Bruker BioSpin GmbH
$$ ##OWNER= andrew
$$ $$ 2015-06-05 15:19:20.126 +0600  andrew@av-600
$$ $$ /opt/data/andrew/nmr/limog-1782/610/acqus
$$ $$ process /opt/ts21pl6/prog/mod/shimcntl
$$ ##$ACQT0= -9.54927425515661
$$ ##$AMP= (0..31)
$$ 100 100 100 100 100 100 100 100 100 100 100 100 100 100 100 100 100 100
$$ 100 100 100 100 100 100 100 100 100 100 100 100 100 100
$$ ##$ANAVPT= -1
$$ ##$AQSEQ= 0
$$ ##$AQ_mod= 3
$$ ##$AUNM= <au_zg>
$$ ##$AUTOPOS= <>
$$ ##$BF1= 600.3
$$ ##$BF2= 600.3
$$ ##$BF3= 600.3
$$ ##$BF4= 600.3
$$ ##$BF5= 600.3
$$ ##$BF6= 600.3
$$ ##$BF7= 600.3
$$ ##$BF8= 600.3
$$ ##$BYTORDA= 0
$$ ##$CFDGTYP= 0
$$ ##$CFRGTYP= 9
$$ ##$CHEMSTR= <none>
$$ ##$CNST= (0..63)
$$ 1 1 145 1 1 1 1 1 1 1 1 1 1 1 1 1 1 1 1 1 1 1 1 1 1 1 1 1 1 1 1 1 1 1 1
$$ 1 1 1 1 1 1 1 1 1 1 1 1 1 1 1 1 1 1 1 1 1 1 1 1 1 1 1 1 1
$$ ##$CPDPRG= <>
$$ ##$CPDPRG1= <>
$$ ##$CPDPRG2= <waltz16>
$$ ##$CPDPRG3= <>
$$ ##$CPDPRG4= <mlev>
$$ ##$CPDPRG5= <mlev>
$$ ##$CPDPRG6= <mlev>
$$ ##$CPDPRG7= <mlev>
$$ ##$CPDPRG8= <mlev>
$$ ##$CPDPRGB= <>
$$ ##$CPDPRGT= <>
$$ ##$D= (0..63)
$$ 0 1 0 0 0 0 0 0 0 0.06 0 0.03 0 0 0 0 1e-04 0 0 0 0 0 0 0 0 0 0 0 0 0 0
$$ 0 0 0 0 0 0 0 0 0 0 0 0 0 0 0 0 0 0 0 0 0 0 0 0 0 0 0 0 0 0 0 0 0
$$ ##$DATE= 1433495959
$$ ##$DBL= (0..7)
$$ 120 120 120 120 120 120 120 120
$$ ##$DBP= (0..7)
$$ 150 150 150 150 150 150 150 150
$$ ##$DBP07= 0
$$ ##$DBPNAM0= <>
$$ ##$DBPNAM1= <>
$$ ##$DBPNAM2= <>
$$ ##$DBPNAM3= <>
$$ ##$DBPNAM4= <>
$$ ##$DBPNAM5= <>
$$ ##$DBPNAM6= <>
$$ ##$DBPNAM7= <>
$$ ##$DBPOAL= (0..7)
$$ 0.5 0.5 0.5 0.5 0.5 0.5 0.5 0.5
$$ ##$DBPOFFS= (0..7)
$$ 0 0 0 0 0 0 0 0
$$ ##$DE= 6.5
$$ ##$DECBNUC= <off>
$$ ##$DECIM= 2218.66666666667
$$ ##$DECNUC= <off>
$$ ##$DECSTAT= 4
$$ ##$DIGMOD= 1
$$ ##$DIGTYP= 12
$$ ##$DL= (0..7)
$$ 0 120 120 120 120 120 120 120
$$ ##$DP= (0..7)
$$ 150 150 150 150 150 150 150 150
$$ ##$DP07= 0
$$ ##$DPNAME0= <>
$$ ##$DPNAME1= <>
$$ ##$DPNAME2= <>
$$ ##$DPNAME3= <>
$$ ##$DPNAME4= <>
$$ ##$DPNAME5= <>
$$ ##$DPNAME6= <>
$$ ##$DPNAME7= <>
$$ ##$DPOAL= (0..7)
$$ 0.5 0.5 0.5 0.5 0.5 0.5 0.5 0.5
$$ ##$DPOFFS= (0..7)
$$ 0 0 0 0 0 0 0 0
$$ ##$DQDMODE= 0
$$ ##$DR= 22
$$ ##$DS= 0
$$ ##$DSLIST= <SSSSSSSSSSSSSSS>
$$ ##$DSPFIRM= 0
$$ ##$DSPFVS= 20
$$ ##$DTYPA= 0
$$ ##$EXP= <>
$$ ##$F1LIST= <111111111111111>
$$ ##$F2LIST= <222222222222222>
$$ [...]
$$ -1 -1 -1 -1 -1 -1 -1 -1 -1 -1 -1 -1 -1 -1 -1 -1 -1 -1 -1 -1 -1 -1 -1 -1
$$ -1 -1 -1 -1 -1 -1 -1 -1 -1 -1 -1 -1 -1 -1 -1 -1 -1 -1 -1 -1 -1 -1 -1 -1
$$ -1 -1 -1 -1 -1 -1 -1 -1 -1 -1 -1 -1 -1 -1 -1 -1 -1 -1 -1 -1 -1 -1 -1 -1
$$ -1 -1 -1 -1 -1 -1 -1 -1 -1 -1 -1 -1 -1 -1 -1 -1 -1 -1 -1 -1 -1 -1 -1 -1
$$ -1 -1 -1 -1 -1 -1 -1 -1 -1 -1 -1 -1 -1 -1 -1 -1
$$ ##$RG_tab8= (0..255)
$$ -1 -1 -1 -1 -1 -1 -1 -1 -1 -1 -1 -1 -1 -1 -1 -1 -1 -1 -1 -1 -1 -1 -1 -1
$$ -1 -1 -1 -1 -1 -1 -1 -1 -1 -1 -1 -1 -1 -1 -1 -1 -1 -1 -1 -1 -1 -1 -1 -1
$$ -1 -1 -1 -1 -1 -1 -1 -1 -1 -1 -1 -1 -1 -1 -1 -1 -1 -1 -1 -1 -1 -1 -1 -1
$$ -1 -1 -1 -1 -1 -1 -1 -1 -1 -1 -1 -1 -1 -1 -1 -1 -1 -1 -1 -1 -1 -1 -1 -1
$$ -1 -1 -1 -1 -1 -1 -1 -1 -1 -1 -1 -1 -1 -1 -1 -1 -1 -1 -1 -1 -1 -1 -1 -1
$$ -1 -1 -1 -1 -1 -1 -1 -1 -1 -1 -1 -1 -1 -1 -1 -1 -1 -1 -1 -1 -1 -1 -1 -1
$$ -1 -1 -1 -1 -1 -1 -1 -1 -1 -1 -1 -1 -1 -1 -1 -1 -1 -1 -1 -1 -1 -1 -1 -1
$$ -1 -1 -1 -1 -1 -1 -1 -1 -1 -1 -1 -1 -1 -1 -1 -1 -1 -1 -1 -1 -1 -1 -1 -1
$$ -1 -1 -1 -1 -1 -1 -1 -1 -1 -1 -1 -1 -1 -1 -1 -1 -1 -1 -1 -1 -1 -1 -1 -1
$$ -1 -1 -1 -1 -1 -1 -1 -1 -1 -1 -1 -1 -1 -1 -1 -1 -1 -1 -1 -1 -1 -1 -1 -1
$$ -1 -1 -1 -1 -1 -1 -1 -1 -1 -1 -1 -1 -1 -1 -1 -1
$$ ##$RG_tabA= (0..255)
$$ 0.25 0.28 0.32 0.35 0.4 0.44 0.5 0.56 0.64 0.7 0.8 0.89 1 1.12 1.28 1.4
$$ 1.6 1.78 2 2.25 2.56 2.8 3.2 3.56 4 4.5 5 5.6 6.35 7.12 8 9 10 11.3 12.7
$$ 14.2 16 18 20.2 22.6 25.4 28.5 32 36 40.3 45.2 50.8 57 64 71.8 80.6 90.5
$$ 101 114 128 144 161 181 203 -1 -1 -1 -1 -1 -1 -1 -1 -1 -1 -1 -1 -1 -1 -1
$$ -1 -1 -1 -1 -1 -1 -1 -1 -1 -1 -1 -1 -1 -1 -1 -1 -1 -1 -1 -1 -1 -1 -1 -1
$$ -1 -1 -1 -1 -1 -1 -1 -1 -1 -1 -1 -1 -1 -1 -1 -1 -1 -1 -1 -1 -1 -1 -1 -1
$$ -1 -1 -1 -1 -1 -1 -1 -1 -1 -1 -1 -1 -1 -1 -1 -1 -1 -1 -1 -1 -1 -1 -1 -1
$$ -1 -1 -1 -1 -1 -1 -1 -1 -1 -1 -1 -1 -1 -1 -1 -1 -1 -1 -1 -1 -1 -1 -1 -1
$$ -1 -1 -1 -1 -1 -1 -1 -1 -1 -1 -1 -1 -1 -1 -1 -1 -1 -1 -1 -1 -1 -1 -1 -1
$$ -1 -1 -1 -1 -1 -1 -1 -1 -1 -1 -1 -1 -1 -1 -1 -1 -1 -1 -1 -1 -1 -1 -1 -1
$$ -1 -1 -1 -1 -1 -1 -1 -1 -1 -1 -1 -1 -1 -1 -1 -1 -1 -1 -1 -1 -1 -1 -1 -1
$$ -1 -1 -1 -1 -1 -1 -1 -1 -1 -1 -1 -1 -1 -1
$$ ##$ROUT14= (0..7)
$$ 0 0 0 0 0 0 0 0
$$ ##$ROUTER= -1
$$ ##$RX22TY= <no>
$$ ##$RXFMAX= (0..7)
$$ 647.5 -1 -1 -1 -1 -1 -1 -1
$$ ##$RXFMIN= (0..7)
$$ 5 -1 -1 -1 -1 -1 -1 -1
$$ ##$RXINTLV= (0..7)
$$ 1 0 0 0 0 0 0 0
$$ ##$RXMSTY= <no>
$$ ##$SCMTY= <no>
$$ ##$SGUC1= (0..15)
$$ 17 18 34 0 0 0 0 0 0 0 0 0 0 0 0 0
$$ ##$SGUC2= (0..15)
$$ 33 256 20 0 0 0 0 0 0 0 0 0 0 0 0 0
$$ ##$SPECTR= 10
$$ ##$SY2FLAG= 0
$$ ##$TFXNUM= 0
$$ ##$TRIPLO2= 0
$$ ##$VTUTY= <tty05>
$$ ##$WBREFAM= (0..15)
$$ 100 100 100 100 100 100 100 100 100 100 100 100 100 100 100 100
$$ ##$WBREFPH= (0..15)
$$ 0 0 0 0 0 0 0 0 0 0 0 0 0 0 0 0
$$ ##$XFAC= 2
$$ ##END=
$$ 
##$DECIM=	2218.66666666667
##$DSPFVS=	20
##XUNITS=	HZ
##YUNITS=	ARBITRARY UNITS
##FIRSTX=	6322.8525384689401108
##LASTX=	-2691.4329892738592207
##XFACTOR=	-0.1375491802509010153
##YFACTOR=	9.4149619140625002078e-06
##NPOINTS=	65536
##XYDATA=	(X++(Y..Y))
$$ [...]
-12141e7672J081J084k377k373K392K395o11o07o11o07J04J08q49l708m322M51K057q01l28
-12122f5194l24K354K359K705K709j57j53l35l32l35l31k176k176O85O86P45P45k116k116
-12103f2757l987l987K690K690K46K46K46K46K105K105p56p56K27K27k634k634Q75Q76K127
-12084f2605k641m96m95K067K068j732j733l02l01J695J695j345j345K746j15m229N40J405
-12066f5123j457J881J882K247K246o14o15j062j062j062j062J53J53J53J52O90O89O89O90
-12047f0432J859J863M720M725l327l324l327l324q23q20q23q20j777j774j896K876M009p56
-12029f3171K221K224O41O44K072k694l972j106j766J099L361L364j229j226j19j20J014J013
-12011e7750J580l189n07n07j550j550J312J311J19J20k743k742J64J64k519K251Q79Q79J178
$$ plain form
-12141 -57672 -56591 -55507 -57884 -60257 -57865 -55470 -56081 -56688 -57299 -57906 -57802 -57694 -58543 -62251 -66573 -66122 -64065 -64866 -65194
-12122 -65194 -65518 -63164 -60805 -58100 -55391 -55548 -55701 -56036 -56368 -56703 -57034 -59210 -61386 -60701 -60015 -59270 -58525 -60641 -62757
-12103 -62757 -66744 -70731 -68041 -65351 -65105 -64859 -64613 -64367 -62262 -60157 -60913 -61669 -61442 -61215 -63849 -66483 -65608 -64732 -62605
-12084 -62605 -65246 -65742 -66237 -64170 -62102 -63834 -65567 -65869 -66170 -64475 -62780 -64125 -65470 -62724 -62839 -67068 -66528 -65123
-12066 -65123 -66580 -64699 -62817 -60570 -58324 -58938 -59553 -60615 -61677 -62739 -63801 -63648 -63495 -63342 -63190 -62500 -61811 -61122 -60432
-12047 -60432 -58573 -56710 -51990 -47265 -50592 -53916 -57243 -60567 -61390 -62210 -63033 -63853 -65630 -67404 -69300 -66424 -62415 -63171
-12029 -63171 -60950 -58726 -58085 -57441 -55369 -58063 -62035 -63141 -64907 -63808 -60447 -57083 -58312 -59538 -59657 -59777 -58763 -57750
-12011 -57750 -56170 -59359 -59866 -60373 -61923 -63473 -62161 -60850 -60731 -60611 -63354 -66096 -65932 -65768 -68287 -66036 -65157 -64278 -63100
-11992f3100J177l979l979P90P89J774J774j088j088o0o0j490j490Q94Q94Q94Q95k69k68J162
-11972f5828J163K325K325k444k445M18M17M17M18j073j073j073j074M33M32M32M32J535J535
-11953f2728J05J04l614l610J155J158K31K35K31K35j230j226J632J636L80L84K943K947K884
-11934e6148j881k064k061M10M14j021j017j610j606J252J256J19J23k564k559j610J252J848
-11916f7467J848L279M17k146P15Q42k019k31k31O33O34O33O34m21m21m21m21M73M73j136
-11896f4333J725j23j23j554J308L24L24N03N03q94q91k325k321Q05Q09J404M266J617j240
-11877f0216k497L69q27q23m66m66J680M546K932K936o14o11o12o11p11p08m706j841J852
-11858f1394J856j72j71k321N44q91q87o22K243q01p97K418K422j46j41Mk854j726L048N33
$$ plain form
-11992 -63100 -61923 -65902 -69881 -69091 -68302 -66528 -64754 -65842 -66930 -66990 -67050 -68540 -70030 -69136 -68242 -67348 -66453 -66722 -66990 -65828
-11972 -65828 -64665 -62340 -60015 -62459 -64904 -64486 -64069 -63652 -63234 -64307 -65380 -66453 -67527 -67094 -66662 -66230 -65798 -64263 -62728
-11953 -62728 -62623 -62519 -66133 -69743 -68588 -67430 -67199 -66964 -66733 -66498 -67728 -68954 -67322 -65686 -65306 -64922 -61979 -59032 -56148
-11934 -56148 -58029 -60093 -62154 -61744 -61330 -62351 -63368 -64978 -66584 -65332 -64076 -63957 -63834 -66398 -68957 -70567 -69315 -67467
-11916 -67467 -65619 -62340 -61923 -64069 -63354 -62512 -64531 -64762 -64993 -64360 -63726 -63093 -62459 -62880 -63301 -63722 -64143 -63670 -63197 -64333
-11896 -64333 -62608 -62731 -62854 -64408 -63100 -62776 -62452 -61949 -61446 -62340 -63231 -65556 -67877 -67072 -66263 -64859 -60593 -58976 -60216
-11877 -60216 -62713 -62344 -63171 -63994 -64460 -64926 -63246 -58700 -55768 -52832 -53446 -54057 -54669 -55280 -55991 -56699 -61405 -63246 -61394
-11858 -61394 -59538 -59710 -59881 -62202 -61658 -62549 -63436 -64058 -61815 -62616 -63413 -60995 -58573 -58719 -58860 -58856 -61710 -63436 -60388 -59855
-11838e9855k325m21m17J218J222J219J222N32N37L54L58M73k385k388M77k053k049m553K16
-11819f8618J56J57J885J885K567K571J796j065j126j125j304j304r05r02r02r01K198K198
-11801f2739K198K199r28r24Q64j997j579J281K176k593l95l95l376J394J095J096j945j945
-11783f6513K53K54K638K637M129M128k072k071l383l383R09R09j237j237K101K102L42L43
-11765e9151j088j088k23k24K638k131l454n92j16j15m74m73j904j904L84L84L84L83O52O53
-11745f7459O52O52J982J982J982J982k936k936n51n52l05l06pqk213K556K258K258j602j599
-11725f4170j602j598K034K038l50l46K75K80N74N77j572L200K124p34j215j211R92R94p37
-11706f0447p34k169k165j41j38L7M1o18K246L316j449j68j64J919J923L171L174j68j64M89
$$ plain form
-11838 -59855 -62180 -62601 -63018 -61800 -60578 -59359 -58137 -57605 -57068 -56714 -56356 -55883 -58268 -60656 -60179 -62232 -64281 -68834 -68618
-11819 -68618 -68462 -68305 -66420 -64535 -61968 -59397 -57601 -58666 -59792 -60917 -62221 -63525 -64430 -65332 -66234 -67135 -64937 -62739
-11801 -62739 -60541 -58342 -59270 -60194 -59330 -61327 -62906 -61625 -59449 -62042 -62437 -62832 -66208 -64814 -63719 -62623 -64568 -66513
-11783 -66513 -66260 -66006 -63368 -60731 -56602 -52474 -54546 -56617 -60000 -63383 -62474 -61565 -62802 -64039 -61938 -59836 -59494 -59151
-11765 -59151 -60239 -61327 -61550 -61774 -59136 -61267 -64721 -65313 -65429 -65544 -66018 -66491 -68395 -70299 -69915 -69531 -69147 -68764 -68112 -67459
-11745 -67459 -66807 -66155 -64173 -62191 -60209 -58227 -61163 -64099 -64650 -65202 -65507 -65813 -65820 -65828 -68041 -65485 -63227 -60969 -62571 -64170
-11725 -64170 -65772 -67370 -65336 -63298 -63648 -63994 -63719 -63439 -62865 -62288 -63860 -60660 -58536 -59270 -60485 -61696 -60704 -59710 -60447
-11706 -60447 -61181 -63350 -65515 -65656 -65794 -65757 -65716 -66334 -64088 -60772 -62221 -62389 -62553 -60634 -58711 -55540 -52366 -52534 -52698 -52209
-11686e2209M91M88M92k612k608k612k608k589k586P49P53L91L95L91L95J382J386j002r99
-11667f2512j37j35K247K251k389k388mlJ75J75j256j255m9m8P1N793O08O07R65R65j245j244
-11645e8808j244j245N44N44N44N44k31k31k31k31k31k31k31k31q38q35q38q35M44M47k895
-11624f6319k892P94P97P94P97M758M762J062J065M66n253r65M761J658J662n138n134k307
-11606f4632k302P8Q2k50k45J181J184N59N59N59N59Q87Q87n44n44l294l294R99R98J684J684
-11585f3205j654j654J464J468J464J468K448K452O3O7P42P45j643j640q08q05q08q05p42
-11566f1383p41p41p42J23J23J23J23R13R13k426k426k276k277K970K970J557J561J27J30
-11547f1379j781j777J557J561K661K664k586k582j036j032L95L99j94j90l532l529O71O74
$$ plain form
-11686 -52209 -51718 -51230 -50738 -53350 -55958 -58570 -61178 -63767 -66353 -65604 -64851 -64460 -64065 -63674 -63279 -61897 -60511 -61513 -62512
-11667 -62512 -62649 -62784 -60537 -58286 -60675 -63063 -63067 -63070 -62895 -62720 -63976 -65231 -65280 -65328 -65257 -59464 -58856 -58249 -57284 -56319 -57564 -58808
-11645 -58808 -60052 -61297 -60753 -60209 -59665 -59121 -59352 -59583 -59814 -60045 -60276 -60507 -60738 -60969 -61807 -62642 -63480 -64315 -63871 -63424 -66319
-11624 -66319 -69211 -68417 -67620 -66826 -66029 -61271 -56509 -55447 -54382 -53916 -59169 -60134 -55373 -53715 -52053 -57191 -62325 -64632
-11606 -64632 -66934 -66856 -66774 -67024 -67269 -66088 -64904 -64345 -63786 -63227 -62668 -61781 -60894 -61438 -61982 -65276 -68570 -67571 -66573 -64889 -63205
-11585 -63205 -64859 -66513 -65049 -63581 -62117 -60649 -58201 -55749 -55686 -55619 -54877 -54132 -55775 -57415 -58223 -59028 -59836 -60641 -61383
-11566 -61383 -62124 -62865 -63607 -63484 -63361 -63238 -63115 -62202 -61289 -63715 -66141 -68417 -70694 -67724 -64754 -63197 -61636 -61509 -61379
-11547 -61379 -63160 -64937 -63380 -61819 -59158 -56494 -59080 -61662 -62698 -63730 -63335 -62936 -63130 -63320 -66852 -70381 -69710 -69036
-11529f9036O71O75j409j405J930J934Q57Q61n74n70q2p8q2p8J915J918m69m66R62R65m70
-11508f2031m66J87J90J86J90n55n55n55n56J174J174K604K604m273m274J9J9L46L47L46L47
-11487f3532K321K321Q91Q90j524j524K769K768J770J769J115l656j568j569j866j867O85
-11470e9807O90O85O90O26O29k712k709J49J53J282J285J133l633r54r50j192j189K146K150
-11451f1528N37N40J669J673J751l014l35l32k511k508Q27Q31P45P49o85o82m17m14J967J971
-11431e9166n88n85n89n85k824k821N14N18O41O45K071K076K906K910J356O129P422K657N633
-11412c1680K776j133l990p810p805o275o274M02M03L42L43j088j088l353l353l354l353J863
-11394g4427J863m5K817L204j564J296J297j357j356k787k787j907j908K862K861K355K355
$$ plain form
-11529 -69036 -68365 -67690 -69099 -70504 -68574 -66640 -65783 -64922 -65496 -66066 -66148 -66226 -66308 -66386 -64471 -62553 -63022 -63488 -62526 -61561 -62031
-11508 -62031 -62497 -62310 -62120 -61934 -61744 -62299 -62854 -63409 -63965 -62791 -61617 -59013 -56409 -60682 -64956 -64937 -64918 -64572 -64225 -63879 -63532
-11487 -63532 -61211 -58890 -57999 -57109 -58633 -60157 -57388 -54620 -52850 -51081 -49966 -53622 -55190 -56759 -58625 -60492 -59807
-11470 -59807 -59117 -58432 -57742 -57116 -56487 -59199 -61908 -61759 -61606 -60324 -59039 -57906 -61539 -62493 -63443 -64635 -65824 -63678 -61528
-11451 -61528 -60991 -60451 -58782 -57109 -55358 -58372 -58707 -59039 -61550 -64058 -63231 -62400 -61655 -60906 -61591 -62273 -62690 -63104 -61137 -59166
-11431 -59166 -59754 -60339 -60928 -61513 -64337 -67158 -66644 -66126 -65485 -64840 -62769 -60693 -57787 -54877 -53521 -47392 -39970 -37313 -31680
-11412 -31680 -28904 -30037 -34027 -41837 -49642 -55917 -62191 -61789 -61386 -61044 -60701 -61789 -62877 -66230 -69583 -72937 -76290 -74427
-11394 -74427 -72564 -72609 -69792 -66588 -68152 -66856 -65559 -66916 -68272 -71059 -73846 -75753 -77661 -74799 -71938 -69583 -67228
-11377f7228n07n07L070L070K09K09l100l100k39k38J535J535J058L920J535l234m486K83
-11359f6215o04o03l06l05J393J394J393J394j20j19j19j19P15P15P16P15m66m62m65m62l327
-11338f5257l324J442J446J509J512j352j349k753k750j323j319M59M62M58M62J144J147J144
-11320f8242J148J75J79J75J79k359k355N03N07K284K284Q53Q53K582K582J152J151l707l707
-11301f3763J061J062L17L17j114j114L83L84j047j047R21R20n11n10k87k87J144J144l208
-11282f5235l208l029l029P34L599J807J811J807j051L76L80K463l95J211J215j293j289J389
-11264f1737l375j185j181j483j479J498J501J319J323K384m73m77K389Q64Q68K653k05j584
-11246e8380j579l32l28l819l815R50R54j60j57J449j408j591j587l558o93J062j796j1qL208
$$ plain form
-11377 -67228 -67735 -68242 -65172 -62102 -61893 -61684 -64784 -67884 -68123 -68361 -66826 -65291 -64233 -60313 -58778 -62012 -66498 -66215
-11359 -66215 -66819 -67422 -67728 -68033 -66640 -65246 -63853 -62459 -62579 -62698 -62817 -62936 -62221 -61506 -60790 -60075 -60541 -61003 -61468 -61930 -65257
-11338 -65257 -68581 -67139 -65693 -64184 -62672 -64024 -65373 -68126 -70876 -72199 -73518 -73059 -72597 -72139 -71677 -70533 -69386 -68242
-11320 -68242 -67094 -66919 -66740 -66565 -66386 -68745 -71100 -70597 -70090 -67806 -65522 -64669 -63816 -61234 -58652 -57500 -56349 -60056 -63763
-11301 -63763 -62702 -61640 -61323 -61006 -62120 -63234 -62851 -62467 -63514 -64561 -63640 -62720 -63231 -63741 -64028 -64315 -63171 -62027 -65235
-11282 -65235 -68443 -71472 -74501 -73767 -70168 -68361 -66550 -64743 -65794 -65418 -65038 -62575 -62970 -61759 -60544 -61837 -63126 -61737
-11264 -61737 -65112 -66297 -67478 -68961 -70440 -68942 -67441 -66122 -64799 -62415 -62888 -63365 -60976 -60112 -59244 -56591 -56796 -58380
-11246 -58380 -59959 -60291 -60619 -64438 -68253 -67303 -66349 -66509 -66666 -65217 -66625 -68216 -69803 -73361 -74054 -72992 -74788 -74799 -74807 -71599
-11226g1599L212K27k630l320m55K344K347J420j438J419J423J297j565K24K23q79J982L73
-11208f5395L72l72l73J416j446r98J863K53K53l107k46J364j498J185M046M70m300l838R32
-11189f9419o19o18k91k91J141J140J922J927K101p56N51N55m273j413J148j710P4P9K578
-11170f6174K582k79k80k373k374M88M89p64p64p64p60K6K6K888K887M14M13K35m531k161
-11150g0776k157K787K791J028J032l98l99j282j278K057K060P75P79P79P78J707J706o78
-11132e8689o78k198k198J86J90J41J42l197l197J990J990N59N62K657K660K72K76L31L36
-11113e7865j099j096j740j736K552K556p1o7K314K317N93N96q38q35k805k802J486J491k43
-11094e7292k38L54m411n250m77K440m17K407K407j110j111k004k005J334J334o19o18J766
$$ plain form
-11226 -71599 -68387 -68160 -70790 -74110 -74565 -72221 -69874 -68454 -69892 -68473 -67050 -65753 -67318 -67094 -66871 -67750 -65768 -65395
-11208 -65395 -65023 -65395 -65768 -64352 -65798 -66796 -64933 -64680 -64427 -67534 -67780 -66416 -67914 -66729 -62683 -62213 -66513 -70351 -69419
-11189 -69419 -70038 -70656 -70947 -71238 -70097 -68957 -67035 -65108 -63007 -63763 -63212 -62657 -66930 -68343 -67195 -68905 -68831 -68752 -66174
-11170 -66174 -63592 -63871 -64151 -66524 -68898 -68410 -67921 -68685 -69449 -70213 -70973 -70947 -70921 -68033 -65146 -64732 -64319 -64084 -68615 -70776
-11150 -70776 -72933 -70146 -67355 -66327 -65295 -65693 -66092 -67374 -68652 -66595 -64535 -63760 -62981 -62202 -61424 -59717 -58011 -58689
-11132 -58689 -59367 -61565 -63763 -63577 -63387 -63246 -63104 -66301 -69498 -67508 -65518 -64959 -64397 -61740 -59080 -58808 -58532 -58201 -57865
-11113 -57865 -58964 -60060 -61800 -63536 -60984 -58428 -58499 -58566 -56252 -53935 -53342 -52746 -53584 -54419 -57224 -60026 -58540 -57049 -57292
-11094 -57292 -57530 -57176 -61587 -66837 -67314 -64874 -65291 -62884 -60477 -61587 -62698 -64702 -66707 -65373 -64039 -64658 -65276 -63510
-11076f3510J766K511K512k735k735M62M62M62M62j326j327j326j327j267j266J64J64j983
-11058f9837j982K489K489N18L383M631j34q83J982P1P5j524j520j524j520j763j758l194
-11040g0001l189j315j312K977K981J993J997J994J997J457J460k835k832k656k653O82O85
-11023f8570J390J393L003J42J98K01K2K2K120K124L95k466k620k615K273K272J524j334j155
-11004f1681j155J047J051K183K184K284k482n820j050J419J424k571k571l50l51n29n29J647
-10986f5850j215L95L95J12J12J12J11n44n44J066J066K407N268J751j110M40k422m151m151
-10967f6752k719J41R17R16m24m25Q27Q27J30k731k552L09R95L856L857R95P34k128k127P34
-10947f4620l99K463K463K462K80K79k105k105o74o75m95m96O30L491K72L133k64k65R4k769
$$ plain form
-11076 -63510 -61744 -59233 -56721 -59456 -62191 -61729 -61267 -60805 -60343 -61669 -62996 -64322 -65649 -66916 -68182 -68018 -67854 -69837
-11058 -69837 -71819 -69330 -66841 -66323 -62940 -58309 -58443 -59326 -57344 -57273 -57198 -58722 -60242 -61766 -63286 -65049 -66807 -70001
-11040 -70001 -73190 -74505 -75817 -72840 -69859 -67866 -65869 -63875 -61878 -60421 -58961 -61796 -64628 -67284 -69937 -69255 -68570
-11023 -68570 -67180 -65787 -62784 -62642 -62444 -62243 -62221 -62199 -60079 -57955 -57560 -60026 -62646 -65261 -62988 -60716 -59192 -60526 -61681
-11004 -61681 -62836 -61789 -60738 -58555 -56371 -54087 -56569 -62389 -63439 -62020 -60596 -63167 -65738 -66088 -66439 -66968 -67497 -65850
-10986 -65850 -67065 -66670 -66275 -66163 -66051 -65939 -65828 -66372 -66916 -65850 -64784 -62377 -57109 -55358 -56468 -56028 -58450 -62601 -66752
-10967 -66752 -69471 -69330 -68413 -67497 -67921 -68346 -67519 -66692 -66562 -69293 -71845 -71536 -70541 -66685 -62828 -61833 -61099 -63227 -65354 -64620
-10947 -64620 -65019 -62556 -60093 -57631 -57351 -57072 -59177 -61282 -61956 -62631 -63126 -63622 -62992 -59501 -59229 -56096 -56360 -56625 -56531 -59300
-10927e9300j296j293r99J867L592j174o97o97J49J53P45L611r24l782l603p41n52n47l73
-10908f5861l69P60P64k098K672O85k172k951J822K742K746J316j547j505j505J296M159J4
-10890e9032k846j058j058l398l398J371J371K027K027K38L100M493J632K61k601M40M40j349
-10872e7340J513J661J662j200j199L50k511k512L51j606j602m73K392J583l182j930R32r80
-10854f4091r76m44l301l335m69P82P83J464M330j46l003j15M657P23k139k053Q12M51M55
-10835f5615j368j363J498J497J655J654l73K489M516k161k817k817J64L026j94K668j386
-10818e8927j386j207j208j222j222J640J639M47M47K057q05j058j058k847J5k83k83P4P5
-10799f5112J64L029L025J68K24K27J833j025k280N85j207j204L43L47J952r05j163j159j341
$$ plain form
-10927 -59300 -60596 -61889 -62888 -61021 -57429 -58603 -59300 -59997 -59848 -59695 -58950 -55339 -56263 -60045 -63648 -64389 -64941 -65488 -65861
-10908 -65861 -66230 -65470 -64706 -66804 -64132 -63447 -65619 -68570 -66748 -64006 -61260 -59944 -61491 -62996 -64501 -63205 -59046 -59032
-10890 -59032 -61878 -62936 -63994 -67392 -70790 -69419 -68048 -66021 -63994 -63756 -60656 -56163 -54531 -54270 -56871 -56431 -55991 -57340
-10872 -57340 -55827 -54166 -52504 -53704 -54903 -54553 -57064 -59576 -59225 -60831 -62433 -62906 -60514 -58931 -62113 -64043 -63111 -64091
-10854 -64091 -65067 -65511 -68812 -72147 -72616 -71834 -71051 -69587 -65257 -65403 -68406 -68521 -63864 -63141 -65280 -67333 -66521 -66070 -65615
-10835 -65615 -66983 -68346 -66848 -65351 -63696 -62042 -62415 -59926 -55410 -57571 -60388 -63205 -63041 -60015 -60209 -57541 -58927
-10818 -58927 -60313 -61520 -62728 -63950 -65172 -63532 -61893 -61446 -60999 -58942 -59747 -60805 -61863 -64710 -64695 -64978 -65261 -65187 -65112
-10799 -65112 -64948 -61919 -58894 -58726 -58502 -58275 -56442 -57467 -59747 -59162 -60369 -61573 -61230 -60883 -58931 -59836 -60999 -62158 -63499
-10780f3499j337p46p41l607l603p08p04M061M065K810K813n2m9j621j617j617j617P04P08
-10761f6357P08P08l3l0l0l0J099J103J103J103m803m799k9l0J218J222J222J222L39L43L43
-10740f4408L43P56P60P60P60P23P23k139k138J498J497l271l271n52n51K310K310l73l72
-10721f4635K489K489K90K91K90K91O48O49O48O48j140j140J721J722J721J721j140j140k768
-10702e6345k769k470k466l305J464K12k645L4k828j398L376K508l54k560K213L253L253j46
-10684f0973m910l931Q38K627K630R65R65R65R69m8m9m8m5M43M44M43M47q98q98J964J967
-10663e6133o52o52k083k079r20r20r21r16N6N6K917K921m81m80j912j907L24L24j106j103
-10643f5667j83j82j83j79p23p23K616K616Q57Q57j528j528P16P15j669j669L57L58L58L57
$$ plain form
-10780 -63499 -64836 -65582 -66323 -69930 -73533 -74241 -74945 -70884 -66819 -64009 -61196 -61248 -61297 -62918 -64535 -66152 -67769 -67065 -66357
-10761 -66357 -65649 -64941 -64974 -65004 -65034 -65064 -63965 -62862 -61759 -60656 -65459 -70258 -70287 -70317 -69099 -67877 -66655 -65433 -65094 -64751 -64408
-10740 -64408 -64065 -63309 -62549 -61789 -61029 -60306 -59583 -61722 -63860 -62362 -60865 -64136 -67407 -67959 -68510 -66200 -63890 -64263 -64635
-10721 -64635 -62146 -59657 -59367 -59076 -58786 -58495 -57847 -57198 -56550 -55902 -57042 -58182 -56461 -54739 -53018 -51297 -52437 -53577 -56345
-10702 -56345 -59114 -61584 -64050 -67355 -65891 -65679 -68324 -68290 -71118 -72516 -69140 -66632 -66986 -69546 -67333 -64080 -60827 -60973
-10684 -60973 -65883 -69814 -68976 -66349 -63719 -62754 -61789 -60824 -59855 -59903 -59952 -60000 -60045 -59602 -59158 -58715 -58268 -59166 -60064 -58100 -56133
-10663 -56133 -56785 -57437 -59520 -61599 -62519 -63439 -64360 -65276 -65220 -65164 -62247 -59326 -59807 -60287 -62199 -64106 -63782 -63458 -64564 -65667
-10643 -65667 -65850 -66032 -66215 -66394 -67117 -67840 -65224 -62608 -61751 -60894 -62422 -63950 -63234 -62519 -64188 -65857 -65500 -65142 -64784 -64427
-10623f4427l05l06l05l06K825K824M39M40j699j699m918Q05J728J729k205k206r02r01N29
-10604f8860N32n44n44n44n40j04j04j05j00R68R69R69R72j56j57j56j53R17R16R17R20N29
-10582f3458N29N29N33j975j974M09M14J971J975N40N44O00O03k380k378k962K765K880K884
-10563e7951n466n462k20k16K694K697o44o41O67O71N47n171J218J222j524j520K113K116
-10545f4870k72k68N62N63j822j822J904J904J904J904J844J844j494j494j583j584J755J755
-10527e9270k694k694J599J598o07o07k396L327m14m13k441k440k709k708l25l24R28R31J230
-10508g0429J230o23M151J468J468J561J565q20q19L68L73L73L72J084J088j296j297l327
-10490f3510l324L13L175J270J275J453J453Q23Q27k511k511k075k072J30J35N197K340k910
$$ plain form
-10623 -64427 -64732 -65038 -65343 -65649 -62824 -60000 -59561 -59121 -60820 -62519 -67437 -66632 -64904 -63175 -65380 -67586 -68488 -69389 -68860
-10604 -68860 -68328 -68872 -69416 -69960 -70500 -70604 -70708 -70813 -70913 -69945 -68976 -68007 -67035 -67191 -67348 -67504 -67657 -66740 -65824 -64907 -63987 -63458
-10582 -63458 -62929 -62400 -61867 -63842 -65816 -65407 -64993 -63022 -61047 -60507 -59963 -59363 -58760 -61140 -63518 -66480 -63715 -60835 -57951
-10563 -57951 -63417 -68879 -69099 -69315 -66621 -63924 -64568 -65209 -64542 -63871 -63324 -68495 -67277 -66055 -67579 -69099 -66986 -64870
-10545 -64870 -65142 -65410 -64848 -64285 -66107 -67929 -66025 -64121 -62217 -60313 -58469 -56625 -58119 -59613 -61196 -62780 -61025 -59270
-10527 -59270 -61964 -64658 -63059 -61461 -62068 -62675 -65071 -61744 -62158 -62571 -65012 -67452 -70161 -72869 -73194 -73518 -72590 -71659 -70429
-10508 -70429 -69199 -69822 -65671 -64203 -62735 -61174 -59609 -60429 -61248 -60880 -60507 -60134 -59762 -58678 -57590 -58886 -60183 -63510
-10490 -63510 -66834 -66521 -63346 -62076 -60801 -59348 -57895 -57072 -56245 -58756 -61267 -63342 -65414 -65284 -65149 -59952 -57612 -60522
-10472f0522m5J31J34J740J744K753K757j717j714j621m479l230l65Q83j975j90j86J90J94
-10453f5518J1J5J531j326K79K83J293J297M5M4n25K340J34k727j711J155J573J572J986q72
-10433e9121j647j647j281j278l782K895L785R28N70N70l13l09J897J896J118j740r06l766
-10415f2131r21r20K239K243o52o52j248m106j323J539J360j498n18n18k306N59Q50Q49K638
-10396f4516k20J863J863J088j770q64J997K414K418p45l607j997j993j878j878j877j878
-10379g1580J579J580J49J49R09R10L114L115n21l384l025J744O63O63K213k556n29n29N075
-10360f0261N075J348l420k168k169J051J050k466k467K042q20j594j591K161K161J565j293
-10343f1796k079P82M25M28M25M25O04k255k451k452k46k42k511k511O48O52r39l800J147
$$ plain form
-10472 -60522 -60567 -60436 -60302 -58562 -56818 -54065 -51308 -53025 -54739 -56360 -60839 -64069 -64434 -63551 -65526 -65716 -65902 -65712 -65518
-10453 -65518 -65507 -65492 -63961 -65287 -65008 -64725 -63432 -62135 -62090 -62046 -62571 -60231 -60097 -62824 -64535 -63380 -61807 -60235 -58249 -59121
-10433 -59121 -60768 -62415 -63696 -64974 -68756 -65861 -62076 -61148 -60578 -60008 -60321 -60630 -58733 -56837 -55719 -57459 -58365 -62131
-10415 -62131 -63052 -63972 -61733 -59490 -60142 -60794 -62042 -66148 -67471 -65932 -64572 -66070 -66588 -67106 -69412 -68853 -68003 -67154 -64516
-10396 -64516 -64736 -62873 -61010 -59922 -61692 -62556 -60559 -58145 -55727 -56472 -60079 -62076 -64069 -65947 -67825 -69702 -71580
-10379 -71580 -70001 -68421 -68272 -68123 -67214 -66304 -63190 -60075 -60596 -63980 -67005 -65261 -64598 -63935 -61722 -64278 -64807 -65336 -60261
-10360 -60261 -55186 -53838 -57258 -59426 -61595 -60544 -59494 -61960 -64427 -62385 -63205 -64799 -66390 -64229 -62068 -60503 -61796
-10343 -61796 -63875 -63093 -62668 -62240 -61815 -61390 -60786 -63041 -65492 -67944 -68190 -68432 -70943 -73454 -72806 -72154 -73093 -76893 -75746
-10324g5746J151K728K727m32m29o03K258O48O48K3K2k362k362K2K2L063K01K61K61r7r7K064
-10302f6029p97p97K064N14N14j691j692p75p75K563K564J699J699R24j938J200J200J021
-10284e8532J024J111J114k407k403j357m217m5m1m32K433L860J002N14N14j453J412J87k672
-10265f0388k138k135n656k795J617J621K809m8J200J203L111k612j002J859O38O37j569j569
-10247f5217k64k65k64k65R88R87R87R88j189j188K42K42R28R28j457j457r58r57J427J427
-10227f4337K053K053O22O22k023k023k023k020J345J349j039j036k28k27k612k608O67O71
-10209g0794K694K697N824J00k582K83j747j744N943K24l842l841j636j632j069J796L580
-10192f5746k138j312J550N365l57Q64L726L0k832J64J64j446j445M62M62M62M62K31K31K31
$$ plain form
-10324 -75746 -74595 -71867 -69140 -69572 -70001 -70604 -68346 -67698 -67050 -67027 -67005 -69367 -71729 -71707 -71685 -68622 -68421 -68160 -67899 -67996 -68093 -66029
-10302 -66029 -66826 -67623 -65559 -65045 -64531 -66222 -67914 -68689 -69464 -66901 -64337 -62638 -60939 -60015 -61953 -60753 -59553 -58532
-10284 -58532 -57508 -56397 -55283 -57690 -60093 -61450 -65667 -65712 -65753 -66185 -63752 -59892 -58890 -58376 -57862 -59315 -57903 -57716 -60388
-10265 -60388 -62526 -64661 -70317 -73112 -71495 -69874 -67065 -67113 -65913 -64710 -61599 -64211 -65213 -63354 -62716 -62079 -63648 -65217
-10247 -65217 -65481 -65746 -66010 -66275 -65287 -64300 -63313 -62325 -63514 -64702 -64460 -64218 -63290 -62362 -63819 -65276 -66234 -67191 -65764 -64337
-10227 -64337 -62284 -60231 -59609 -58987 -61010 -63033 -65056 -67076 -65731 -64382 -65421 -66457 -66685 -66912 -69524 -72132 -71465 -70794
-10209 -70794 -68100 -65403 -59579 -59479 -62061 -61778 -63525 -65269 -59326 -59102 -62944 -66785 -68421 -70053 -71122 -69326 -65746
-10192 -65746 -67884 -69196 -67646 -62281 -62638 -61774 -58048 -58018 -60850 -60686 -60522 -61968 -63413 -62951 -62489 -62027 -61565 -61334 -61103 -60872
-10172f0872K31j081j080j081j080K004K005K004K005j215j214j215j215l65l65l65l61j468
-10154f4728j468j468j465J72J71L510L513j86j86l525l521p1o7o7o7J271J274J274J274Q69
-10134f3491Q71Q72Q72M21M25j960j960J31J34J34J34L39L43L43L42K95K98K98K98m21m17
-10113f1699m18m17j811j810j811j807J289J289J289J293Q42Q42Q42Q46l212l211l212l208
-10095g4084J595J594J595J598n51n52n51n48j34j34j34j30J594J595J595J598M721M720j956
-10076e6569j952j300j301j300j297O45O44O45O48K87K87K87K91L83L84L84L87O23O22k239
-10056e9441k236k820k821J949J952J680J681l089l085J379J378n2m8K600K601k61k57j028
-10038e9918j029J833J837P60P61P60P63L28L32L31L32L219L223L62L61k340k336r05r06k608
$$ plain form
-10172 -60872 -60641 -61722 -62802 -63883 -64963 -62959 -60954 -58950 -56945 -58160 -59374 -60589 -61804 -62169 -62534 -62899 -63260 -64728
-10154 -64728 -66196 -67664 -69129 -68957 -68786 -65276 -61763 -61949 -62135 -65660 -69181 -69252 -69319 -69386 -69453 -68182 -66908 -65634 -64360 -63491
-10134 -63491 -62620 -61748 -60876 -60455 -60030 -61990 -63950 -63819 -63685 -63551 -63417 -63078 -62735 -62392 -62050 -61755 -61457 -61159 -60861 -61282 -61699
-10113 -61699 -62117 -62534 -64345 -66155 -67966 -69773 -68484 -67195 -65906 -64613 -63771 -62929 -62087 -61241 -64453 -67664 -70876 -74084
-10095 -74084 -72489 -70895 -69300 -67702 -68253 -68805 -69356 -69904 -70038 -70172 -70306 -70436 -68842 -67247 -65652 -64054 -59333 -54613 -56569
-10076 -56569 -58521 -59821 -61122 -62422 -63719 -63074 -62430 -61785 -61137 -60850 -60563 -60276 -59985 -59602 -59218 -58834 -58447 -57824 -57202 -59441
-10056 -59441 -61677 -64497 -67318 -65369 -63417 -61737 -60056 -63145 -66230 -64851 -63473 -63525 -63573 -60973 -58372 -58633 -58890 -59918
-10038 -59918 -60947 -59114 -57277 -56517 -55756 -54996 -54233 -53905 -53573 -53242 -52910 -49691 -46468 -46106 -45745 -48085 -50421 -51326 -52232 -54840
-10018e4840k604j174j174j926j926m96m95N18N18J948J949K6K6j405j404J009J010m21m21
-9999f1282l39l35l36l35m28m25m25m25K687K690K690K690n93n88n89n89j863j862K906K906
-9979e3845n52n51k161k161J416j446k459M218O274J505k83l144k735J27l093l092K958K958
-9961e6066Q72l897n44n44q42q42n14n15j646j647J110N883L36L39k91k87k91k86K563K567
-9941e4542k206k202j579j576J281J286N47N48q83q79J054J055M58L323K657m020m199N73
-9923e9304J763J762K061K064J643J643j218j215k411k410k411k407l961l960Q08Q13Q98Q97
-9905f4945K329K333m85m84m85m80m270m270P97Q02j916K854J72J75J483J483J483J486k015
-9886f3953k016k016k012O08O07O07O11K165K165K164K169r35r36r35r31l17l17l16l17K902
$$ plain form
-10018 -54840 -57444 -58618 -59792 -61718 -63644 -64140 -64635 -64117 -63599 -61651 -59702 -59676 -59650 -61055 -62459 -61450 -60440 -60861 -61282
-9999 -61282 -61621 -61956 -62292 -62627 -63055 -63480 -63905 -64330 -61643 -58953 -56263 -53573 -54166 -54754 -55343 -55932 -57795 -59657 -56751 -53845
-9979 -53845 -54397 -54948 -57109 -59270 -57854 -59300 -61759 -57541 -51267 -49762 -50045 -53189 -55924 -55797 -58890 -61982 -59024 -56066
-9961 -56066 -55194 -59091 -59635 -60179 -61021 -61863 -62377 -62892 -64538 -66185 -65075 -59192 -58856 -58517 -58808 -59095 -59386 -59672 -57109 -54542
-9941 -54542 -56748 -58950 -60529 -62105 -60824 -59538 -58991 -58443 -59326 -60205 -59151 -58096 -57638 -54315 -51658 -55678 -59877 -59304
-9923 -59304 -57541 -55779 -53718 -51654 -50011 -48368 -49586 -50801 -53212 -55622 -58033 -60440 -64401 -68361 -67553 -66740 -65842 -64945
-9905 -64945 -62616 -60283 -60768 -61252 -61737 -62217 -66487 -70757 -69960 -69158 -71074 -68220 -68048 -67873 -66390 -64907 -63424 -61938 -63953
-9886 -63953 -65969 -67985 -69997 -69389 -68782 -68175 -67564 -65399 -63234 -61070 -58901 -59836 -60772 -61707 -62638 -62955 -63272 -63588 -63905 -61003
-9866f1003K903k344k343N25N25r05r05j561j562Q24Q23r95r94K343K344j055j054L76L77
-9847f3681k709k709K537K538N70N70M504M505L085k634o751j025L43L208L741Q83j863J002
-9829e3886R98j859J05K969l115l111J42J45J572J576l614l610K586K589j56j53J274J278
-9811e4270J543J546j796j792O30O33O33O34k202k199l271l271k530L197L972J110n03m99
-9793e8435o79o78K84K86K87K87m605m601l10l09j557j554Q31Q31J155J158J159J159j617
-9774f6908j617J721J722J155J155Q2Q2l480K243L375N14j810L912N14N14j710j710j710j711
-9755f3667R13R13R13R13N62N63N63N62J755J755J755J755k206k202k206k202m77m73L816
-9736e6695L819k184k179p53p49j528j523r7r3M17M21L756L759J848J852M17M21j930j926
$$ plain form
-9866 -61003 -58100 -60444 -62787 -62262 -61737 -62642 -63547 -65108 -66670 -65846 -65023 -66018 -67012 -64669 -62325 -63380 -64434 -64058 -63681
-9847 -63681 -66390 -69099 -66562 -64024 -63454 -62884 -58380 -53875 -50790 -53424 -60175 -61200 -60857 -57649 -53908 -53025 -54888 -53886
-9829 -53886 -52888 -54747 -54642 -51673 -54788 -57899 -57757 -57612 -56040 -54464 -58078 -61688 -59102 -56513 -56669 -56822 -55548 -54270
-9811 -54270 -52727 -51181 -52977 -54769 -54139 -53506 -52873 -52239 -54441 -56640 -59911 -63182 -65712 -62515 -58543 -57433 -57936 -58435
-9793 -58435 -59114 -59792 -59508 -59222 -58935 -58648 -63253 -67854 -68164 -68473 -70030 -71584 -70753 -69922 -68767 -67609 -66450 -65291 -66908
-9774 -66908 -68525 -66804 -65082 -63927 -62772 -62690 -62608 -66088 -63845 -60470 -59956 -61766 -57854 -57340 -56826 -58536 -60246 -61956 -63667
-9755 -63667 -62754 -61841 -60928 -60015 -59453 -58890 -58327 -57765 -56010 -54255 -52500 -50745 -52951 -55153 -57359 -59561 -60038 -60511 -56695
-9736 -56695 -52876 -55060 -57239 -57992 -58741 -60269 -61792 -61889 -61982 -61565 -61144 -57388 -53629 -51781 -49929 -49512 -49091 -51021 -52947
-9717e2947K362K366q57q53k288k284J785J788J19n603l313K415j163j162r06r01J483J483
-9699e8476j740j737j736j736K448K451q86q87L491L495J468m255k023k020J915J916k083
-9682f0395k079J259J259k94k94L998L997N71N70k769k768J554J553J554J554J971J971J971
-9664d4817J971m058m057K34K35o29o30m922m922l528l529J718J717j501j502j501j502R7
-9646g1126J01J00J01j751j748l16l17j86j83K202K202K258K262N480k42j852j848k205k206
-9627f9274j434j431K861K862j710j707k76k75L76L80L80L80Q6Q6Q5R0J009J010K441K444
-9607f1617k366k366M95N00j2j1k872k869J520J520J520J524N07N07N06N11k24k23k24k20
-9587f3894p00p01K161k604j72K694m65l328k790k791J800J799K102K105p57p56o37o37K224
$$ plain form
-9717 -52947 -50585 -48219 -49076 -49929 -52217 -54501 -52716 -50928 -50809 -56412 -59725 -57310 -58473 -59635 -60541 -61442 -59959 -58476
-9699 -58476 -60216 -61953 -63689 -65425 -62977 -60526 -61412 -62299 -58808 -55313 -53845 -58100 -60123 -62143 -60228 -58312 -60395
-9682 -60395 -62474 -61215 -59956 -60250 -60544 -56546 -52549 -51978 -51408 -54177 -56945 -55391 -53838 -52284 -50730 -48759 -46788 -44817
-9664 -44817 -42846 -46904 -50961 -50727 -50492 -51121 -51751 -56673 -61595 -65123 -68652 -66934 -65217 -66718 -68220 -69721 -71223 -71126
-9646 -71126 -71025 -70925 -70824 -72575 -74323 -74639 -74956 -75142 -75325 -73123 -70921 -68663 -66401 -60921 -61163 -63015 -64863 -67068 -69274
-9627 -69274 -70708 -72139 -69278 -66416 -68126 -69833 -70109 -70384 -70008 -69628 -69248 -68868 -68782 -68696 -68611 -68521 -67512 -66502 -64061 -61617
-9607 -61617 -63983 -66349 -65854 -65354 -65366 -65377 -68249 -71118 -69598 -68078 -66558 -65034 -64527 -64020 -63514 -63003 -63227 -63450 -63674 -63894
-9587 -63894 -64594 -65295 -63134 -65738 -65910 -63216 -63681 -67009 -69799 -72590 -70790 -68991 -66889 -64784 -65541 -66297 -66934 -67571 -65347
-9568f5347K224K355K359n03n03J494J494j368j367k154k149l581l580j822j822J039J040
-9551g2191Q60Q65Q64Q65K64K68K69K68J337J342j520j521K202K206o56o55P52P57o75o74
-9531f4773j960j956K813K813o7o3K798K798r32r27N03N03J561J565l208l205j330j326j326
-9512f5719j327k813k809M8N2L149L152j617j617R68R73R69R72O71O74j233J628L927q38q42
-9492f1632q39p22p19L871L871M255J397j56l015p82p79k392k388j155j151j155j152q2p8
-9473f4803J349J352j993j990O90O93n6k914m169O03L805R46j919j915j90j86K850K854l73
-9454f5366K489K489l69k638k637k638k635j877R83L666Q09J282j580j49j45q16q16k426M40
-9435g1934J777J777L566P08J747J748m1l8K87k574l827l822m10m10m10m06j125j126n2K813
$$ plain form
-9568 -65347 -63123 -60768 -58409 -58912 -59415 -57921 -56427 -57795 -59162 -61316 -63465 -67046 -70626 -72448 -74270 -73231 -72191
-9551 -72191 -71331 -70466 -69602 -68737 -68473 -68205 -67936 -67668 -66331 -64989 -66509 -68030 -65828 -63622 -64278 -64933 -64181 -63424 -64099 -64773
-9531 -64773 -66733 -68689 -65876 -63063 -63130 -63193 -60395 -57597 -58529 -59456 -58953 -58450 -56889 -55324 -58532 -61737 -63067 -64393 -65719
-9512 -65719 -67046 -69859 -72668 -72620 -72568 -69419 -66267 -67884 -69501 -68533 -67560 -66591 -65619 -64948 -64274 -65507 -63879 -59952 -60790 -61632
-9492 -61632 -62471 -63193 -63912 -60041 -56170 -51915 -50518 -50674 -53689 -54471 -55250 -57642 -60030 -61185 -62336 -63491 -64643 -64725 -64803
-9473 -64803 -63454 -62102 -64095 -66085 -65395 -64702 -64758 -67672 -71841 -71238 -67433 -66487 -68406 -70321 -70511 -70697 -67847 -64993 -65366
-9454 -65366 -62877 -60388 -60757 -63395 -66032 -68670 -71305 -73182 -72199 -68533 -67724 -66442 -68022 -68171 -68316 -69132 -69948 -72374 -71934
-9435 -71934 -70157 -68380 -64814 -64106 -62359 -60611 -60652 -60690 -60403 -62977 -66804 -70626 -71036 -71446 -71856 -72262 -73387 -74513 -74565 -71752
-9415g1752N746K883k004k001j080j081J602J606p38l595n55n55K839K843l17l17J908k858
-9397f7426J256J255l0k6k6k6o11o07m32m29j34K731K727j30J990J993q72q68o63K202P67
-9376e7359k090K321K322N003N004O107O107J0101J4870K0308K0310J2620M035J233n443q603
-9360C6846j5280k2437j6714j3078p355o579o580M54M55j334j334j334j334p37p38p38p38
-9343e8555m95m96l357l357J710J711J710J710p34p34p34p34L39L39L39L39r69r68r69r69
-9323f4874K012K012q49q50K750K750l927l928l509l510o48o49L65L66L65L65K153K154p08
-9304f8160p08%%%%n36n37j79j79L13O040K817K820m098m095J982l737J744J747j475j472
-9283f7713J5J9K876K880P68P71M10M13Q28m893j676j673j558j553j558j553K31K34K31K35
$$ plain form
-9415 -71752 -66006 -63123 -65127 -67128 -68208 -69289 -67687 -66081 -66819 -70414 -70969 -71524 -68685 -65842 -66159 -66476 -64568 -67426
-9397 -67426 -66170 -64915 -64945 -64971 -64997 -65023 -65634 -66241 -66673 -67102 -67236 -64505 -61778 -61908 -59918 -57925 -58797 -59665 -60328 -58126 -57359
-9376 -57359 -59449 -57128 -54806 -49803 -44799 -38692 -32585 -22484 -7614 12694 33004 45624 49659 50892 45449 36846
-9360 36846 21566 -871 -17585 -30663 -38018 -44597 -51177 -50723 -50268 -51602 -52936 -54270 -55604 -56341 -57079 -57817 -58555
-9343 -58555 -59050 -59546 -62903 -66260 -64550 -62839 -61129 -59419 -60153 -60887 -61621 -62355 -62016 -61677 -61338 -60999 -61968 -62936 -63905 -64874
-9323 -64874 -62862 -60850 -61699 -62549 -59799 -57049 -60976 -64904 -68413 -71923 -72571 -73220 -72855 -72489 -72124 -71759 -69606 -67452 -68160
-9304 -68160 -68868 -68868 -68868 -68868 -68868 -69404 -69941 -70120 -70299 -69986 -63946 -61129 -58309 -62407 -66502 -64520 -68257 -66513 -64766 -66241 -67713
-9283 -67713 -67698 -67679 -64803 -61923 -61155 -60384 -59974 -59561 -58733 -63626 -65302 -66975 -68533 -70086 -71644 -73197 -72966 -72732 -72501 -72266
-9263g2266j647j647j646j647J274J274J275J274M32M32L294L294J505J505J505J506K544
-9246e7739K545l17l16p9p8p8p8k888k887k6k7j993j993M683M684M158M158Q19k041j625m486
-9225e5604m843j983m76l339k981j19o56K206N067K206J647j215L95L95m195j334q2q2o26
-9206f5619o26K057K057J222j640k08k09L372N10p41p42Q69Q68p42K120p19p19l61l62k805
-9186f2418N6j375j375l69K493M638k038l349l350j084j084J136j725J792O561L164L01M21
-9168e7605L283J870r87k064k061k481k478m091j226J230J233L316M59k586K187R31j926O00
-9150f2396O04j189J677O00O03q31K035q16q13o37o33j01r7j00r7k53k54K429K433J834j029
-9129e7031N81N85j654j654l443n77k24l085j297j292K500K500K321K325O52k210k209O56
$$ plain form
-9263 -72266 -73913 -75560 -77206 -78853 -77579 -76305 -75030 -73756 -73324 -72892 -69598 -66304 -64799 -63294 -61789 -60283 -57739
-9246 -57739 -55194 -55511 -55827 -55906 -55984 -56062 -56140 -59028 -61915 -61941 -61968 -63961 -65954 -61271 -56587 -52429 -48271 -47452 -49493 -51118 -55604
-9225 -55604 -60447 -62430 -62906 -66245 -69226 -69345 -70001 -67795 -62728 -60522 -58875 -60090 -59695 -59300 -63495 -64829 -64911 -64993 -65619
-9206 -65619 -66245 -64188 -62131 -60909 -62549 -62757 -62966 -59594 -59084 -59825 -60567 -59698 -58830 -59572 -57452 -58171 -58890 -59251 -59613 -62418
-9186 -62418 -62362 -63737 -65112 -65481 -62988 -58350 -60388 -63737 -67087 -68171 -69255 -68119 -69844 -68052 -61491 -58327 -58026 -57605
-9168 -57605 -54322 -52452 -53439 -55503 -57564 -60045 -62523 -66614 -67840 -66610 -65377 -62061 -61602 -64188 -62001 -61070 -62996 -62396
-9150 -62396 -61792 -62981 -61304 -60704 -60101 -60932 -58897 -59713 -60526 -61163 -61796 -61897 -61994 -62094 -62191 -62444 -62698 -60269 -57836 -56002 -57031
-9129 -57031 -56450 -55865 -57519 -59173 -62616 -63193 -63417 -66502 -67799 -69091 -66591 -64091 -61770 -59445 -58793 -61003 -63212 -62556
-9111f2556K410K411M020J163J635j225k657k653m795m791k7k2r50r46r50r47L298L301J866
-9092f2415J871J777J781j084j081O67O71k552L174L230L234j181j177k075k072P86P90K575
-9074e3081K578K932k787k131k127P34P34l950J777J420J420K354K359k292L432Q9R3J882
-9056d4564J882k661k656K112K113L927L931N361N362L316L320M750M751O982O985L767R490
-9039A8168J1121J1122J3268J3272J4967K0689K2836K2840K4401L3939N0035P1022J06311
-9026D33991J65448K33884L00656L44242L38519K95119J90203L2579j52463l12229l82808
-9015A487141l88386l33064k48889j66856j12969o9092m7155k9982k3898j4356r467l745k436
-9002C6846k433l507l506o013o010j0660m936n655n653k433k433l126l122p891p892k828k824
$$ plain form
-9111 -62556 -60146 -57735 -53715 -52552 -50917 -52142 -54799 -57452 -62247 -67038 -67065 -67087 -68037 -68983 -69933 -70880 -67582 -64281 -62415
-9092 -62415 -60544 -58767 -56986 -58070 -59151 -58484 -57813 -60365 -57191 -53961 -50727 -51908 -53085 -55160 -57232 -56446 -55656 -53081
-9074 -53081 -50503 -47571 -50358 -52489 -54616 -53882 -53148 -57098 -55321 -53901 -52481 -50127 -47768 -50060 -46628 -46539 -46446 -44564
-9056 -44564 -42682 -45343 -47999 -45887 -43774 -39847 -35916 -30555 -25193 -21877 -18557 -13807 -9056 -2074 4911 8678 18168
-9039 18168 29289 40411 53679 66951 81918 102607 125443 148283 172684 206623 256658 327680 433991
-9026 433991 599439 833323 1133979 1478221 1816740 2111859 2302062 2334641 2182178 1869949 1487141
-9015 1487141 1098755 765691 516802 349946 236977 167885 120730 90748 66850 52494 43027 39282 36846
-9002 36846 34413 30906 27400 21387 15377 4717 -219 -5874 -11527 -13960 -16393 -19519 -22641 -30532 -38424 -41252 -44076
-8985d4076k824k824j852j848M829M828K679K683j79j79K090K091K090K090R28R28R27R28
-8967b6691k194k195p64p64K962K963O777J2500J5804K1529K3555K6416K2840J9978J2467
-8952A35183K928q025j3749k3525k3525k2870k2869j7445j4582j0704m982m683j822o234l371
-8937d0275l4l4k626k627K35K34M74M73r58r57P67P68o63o64O78O79p53p53k556k556L06L05
-8915e0537n2n2j483j483k302k303k660L066K407K407r7r3J662J662K31K34J453J454j409
-8896d7895j405j084j084l946l942k753k754J09J11q83q83L886L890L081L082j748J118L186
-8878d9914k538l789J938K6K6L245L249N160N161L729L734l991l990l991l986j893j893n112
-8860e4829O15O11O11R69R72J49J49J49J53j460j461j639j636J356j501j5M758J863k903j177
$$ plain form
-8985 -44076 -46900 -49724 -51576 -53424 -48595 -43767 -41088 -38405 -38584 -38763 -36673 -34582 -32492 -30402 -29474 -28546 -27619 -26691
-8967 -26691 -28885 -31080 -31844 -32608 -29646 -26683 -19906 -7406 8398 29927 53482 79898 102738 122716 135183
-8952 135183 138111 130086 116337 92812 69287 46417 23548 6103 -8479 -19183 -24165 -28848 -30670 -36904 -40275
-8937 -40275 -40309 -40343 -42969 -45596 -45361 -45127 -44653 -44180 -45138 -46095 -45328 -44560 -45223 -45887 -45209 -44530 -45283 -46036 -48592 -51148 -50842 -50537
-8915 -50537 -50589 -50641 -52124 -53607 -55909 -58212 -60872 -57806 -55399 -52992 -53089 -53182 -51520 -49858 -49627 -49393 -47940 -46486 -47895
-8896 -47895 -49300 -50384 -51468 -55414 -59356 -62109 -64863 -64754 -64643 -65526 -66409 -62523 -58633 -55552 -52470 -54218 -53100 -49914
-8878 -49914 -52452 -56241 -54303 -54277 -54251 -51006 -47757 -42597 -37436 -33707 -29973 -33964 -37954 -41945 -45931 -47824 -49717 -54829
-8860 -54829 -54214 -53603 -52992 -52023 -51051 -50902 -50753 -50604 -50451 -51911 -53372 -55011 -56647 -55291 -56792 -56807 -52049 -50186 -53089 -54266
-8840e4266L595N07N10Q05Q09J043J047j818j815j516j513K13K16l335J438MPL32k526l424
-8820e9687L256M684J825k530L36L72L73k310k310j267j267J64J64K474K474k295k295J132
-8802e6707J133J133J132q94q94l458l457l756J014L099L100J267J267o41K221L293j475m993
-8784e7616k131M77M77k206k206k056k057Q05Q05K958K958M389M390L05L06O03O04l920Q50
-8765e2265j833j834p30p30m844p4M180M181k91k91k973k973J796J796o75o74k105k105O96
-8746f1748O97L558L558k57k57J174J174K336K336R05R06j718j718l148l148j062j062J799
-8728e5675J800j077j076j077j077m21m21l104l103l939j073J75J79o29o26O22O26k87l145
-8709g3328J621M486K217K220K575k83l622l617k549L17L43L46L383L387J893J896O41k217
$$ plain form
-8840 -54266 -50671 -50164 -49654 -48849 -48040 -46997 -45950 -47768 -49583 -51099 -52612 -52399 -52183 -55518 -54080 -54076 -54069 -53737 -56263 -59687
-8820 -59687 -56431 -51747 -49922 -52452 -52116 -51744 -51371 -53681 -55991 -57258 -58525 -58361 -58197 -55723 -53249 -55544 -57839 -56707
-8802 -56707 -55574 -54441 -53309 -54203 -55097 -58555 -62012 -65768 -64754 -61655 -58555 -57288 -56021 -56662 -54441 -51148 -52623 -57616
-8784 -57616 -59747 -59270 -58793 -60999 -63205 -65261 -67318 -66513 -65708 -62750 -59792 -55403 -51013 -50708 -50402 -49799 -49195 -53115 -52265
-8765 -52265 -54098 -55932 -56662 -57392 -62236 -62310 -58130 -53949 -54240 -54531 -57504 -60477 -58681 -56885 -57560 -58234 -60339 -62444 -61748
-8746 -61748 -61051 -57493 -53935 -54192 -54449 -53275 -52101 -49765 -47429 -46524 -45618 -47336 -49054 -52202 -55350 -56412 -57474 -55675
-8728 -55675 -53875 -54952 -56028 -57105 -58182 -58603 -59024 -62128 -65231 -69170 -70243 -70068 -69889 -70518 -71144 -70522 -69896 -70183 -73328
-8709 -73328 -71707 -67221 -65004 -62784 -60209 -60492 -64114 -67731 -70280 -69963 -69620 -69274 -65891 -62504 -60611 -58715 -58074 -60291
-8691f0291Q20Q23l949l946m165j305n2n2n89n88K273K272L056L055J94J93L73L72L235L234
-8671e5037N868N868P657M795J576M438N331N332N265K403L595L595K492m183p105p105o144
-8654b1359o140m710m709l015l010l965o825j077L696N306K444j315j312K98k563l559o93
-8637e2508q71l734j442j438J423J424J270M136N566K705j292j290l7l7J803J804j059j054
-8619d4631m92m92j93j90j968K802K683K686K444k325j251J613L856L856N645K787k403k403
-8601b7976M58M62L335O196J427j431M497M497M319J460K236o23k295q014k981K746P750P753
-8583C816P571P574M293j427l160k94J848j010l182q901m076o933l987j121j304m162j513
-8566a5968j509k61k57J438J442N850N853J1807O084O084O089N845J23l334l331O41O40L145
$$ plain form
-8691 -60291 -59471 -58648 -62597 -66543 -70708 -72013 -72065 -72117 -72706 -73294 -71021 -68749 -65693 -62638 -62444 -62251 -61878 -61506 -58271 -55037
-8671 -55037 -49169 -43301 -35644 -30849 -29273 -24835 -19504 -14172 -8907 -6504 -2909 686 3178 -1005 -8110 -15215 -21359
-8654 -21359 -27499 -32209 -36918 -39933 -42943 -46908 -53733 -54810 -51114 -45808 -43364 -44679 -45991 -45693 -48256 -51815 -52508
-8637 -52508 -53379 -57113 -58555 -59993 -58570 -57146 -55876 -51740 -46174 -43469 -44761 -46051 -46088 -46125 -44322 -42518 -43577 -44631
-8619 -44631 -45123 -45615 -45808 -45998 -47966 -45164 -42481 -39795 -37351 -39676 -40927 -39314 -35458 -31602 -25957 -23170 -25573 -27976
-8601 -27976 -27518 -27056 -23721 -17525 -16098 -17529 -13032 -8535 -4216 -2756 -520 -1143 -3438 -11452 -14433 -11687 -3937 3816
-8583 3816 11387 18961 23254 21827 18667 18373 20221 19211 16029 7128 3052 -3881 -7868 -8989 -10293 -14455 -15968
-8566 -15968 -17477 -17738 -17995 -16557 -15115 -9265 -3412 8395 14479 20563 26652 32497 32620 29286 25955 26596 27236 30381
-8548C0381L149K310l413K608N473O375O52Q819Q823J2038J2039R177R180J3950J3950K4441
-8532A59952K4446K8585K8585K3160K0302K3007J7289K1401K1401K5303J9583J9703J3979
-8519D46696K9595L5321N4636O0360P8478Q4205J02327J15682J44854J58212J87543K00895
-8507A698804K24976K34519K55740K80540L50747M51856O54306R38545J409255K094106L176935
-8496A1770329M750747O742028Q170861Q328720N701883J299860l875593p656086q730085
-8487B6502664p951740n904827l966658k511117j592944r99662o64395m25935k94482j78112
-8477B012792j18502o6991o4015q1179j35313j71554k02573j81584j58458j14578q6683n8064
-8465E73298n4491m4949m8213m2486m5348l5809k9971k4245k6629k0906k0939j1397r013N25
$$ plain form
-8548 30381 33530 35840 32427 35035 40508 46883 47535 56354 65177 77215 89254 98431 107611 121561 135511 159952
-8532 159952 184398 212983 241568 264728 285030 308037 325326 346727 368128 393431 413014 432717 446696
-8519 446696 476291 511612 566248 626608 705086 789291 891618 1007300 1152154 1310366 1497909 1698804
-8507 1698804 1923780 2158299 2414039 2694579 3045326 3497182 4151488 5090033 6499288 8593394 11770329
-8496 11770329 16521076 23263104 31433965 39762685 45464568 46764428 42888835 35232749 26502664
-8487 26502664 18550924 12646097 8679439 6168322 4575378 3575716 2911321 2485386 2190904 2012792
-8477 2012792 1894290 1827299 1763284 1682105 1546792 1375238 1172665 991081 832623 718045 631362 573298
-8465 573298 518807 473858 425645 383159 337811 302002 272031 247786 221157 200251 179312 167915 158902 159427
-8451A59427J595P321p1p1m862m858r449r449r930p064r270K68m698m694p318j595j658j654
-8433I1970o066o066p395p393r661r657j0734j193K441Q167Q253N395r88M740m21o141j0853
-8416D4398p988o901o896p974p969j4083j1219j1103n376r390o524k712n570p750J792K921
-8400f2344K925N239N242L811L812k958k955p724p723l21l17o74N049M329M333K009K008K194
-8382d4065N060M166j558n376L50J542J543r05r02r02r01K27K31K31K31m88m88m88m88j770
-8362d4750j770K820K821j90l052l409K314N086K224o97l558k977j15k441L283K150p12l037
-8344d6010j75j814J047K477K478K299K299n63n62k124k120j941K828k005k001j702j703l376
-8326e2668l372l372l372N00N03Q01Q01n317n44l65l65L565L570O431O431K969K973J12J12
$$ plain form
-8451 159427 161022 168343 168272 168201 163339 158481 149032 139583 129653 122589 113319 113587 108889 104195 96877 95282 93624 91970
-8433 91970 85904 79838 72443 65050 55389 45732 34998 33805 36246 44413 52666 58061 57073 61813 61392 55251 44398
-8416 44398 36410 29509 22613 14639 6670 -7413 -18632 -29735 -35111 -44501 -51025 -53737 -59307 -67057 -65265 -62344
-8400 -62344 -59419 -54180 -48938 -45127 -41315 -44273 -47228 -54952 -62675 -62996 -63313 -63987 -58938 -54609 -50276 -48267 -46259 -44065
-8382 -44065 -39005 -34839 -36397 -41773 -41423 -39881 -38338 -39243 -40145 -41047 -41948 -41721 -41490 -41259 -41028 -41516 -42004 -42492 -42980 -44750
-8362 -44750 -46520 -43700 -40879 -41069 -44121 -47530 -45216 -40130 -37906 -38603 -42161 -45138 -45253 -47694 -44411 -42261 -42973 -46010
-8344 -46010 -46185 -47999 -46952 -44475 -41997 -39698 -37399 -37962 -38524 -40648 -42768 -44709 -41881 -43886 -45887 -47589 -49292 -52668
-8326 -52668 -56040 -59412 -62784 -62284 -61781 -60980 -60179 -65496 -66040 -66405 -66770 -63205 -59635 -53204 -46773 -43804 -40831 -40719 -40607
-8307d0607M8N3N2N2K612K612k158k153P04P04P04P08K836K835k6k2j398j397j397j394J68
-8286c6464J68J67J72j621j621j620j617m289m288m289m285O00O00O00O03J808J810J811J811
-8267d9944K582K586k76k76J315J319J319J319O00O04O03O04m77m73K388N250K683k083j904
-8248c2261K865k68k65k6Q559P779P784N637N636M587P448L334Q104M706P567O435O434K828
-8230E6883N690M318J2903J3439J8208J7613K4289K3823L2408K9069L7654L5984N4107O5911
-8216D32299P8311P6343Q8743Q6478J17954J56464K43263L57424N64404Q47354J333806K029800
-8204F412643L031317L175105J658524r63543l174509l222857k396844j595869r79698n69314
-8194A374955l53751k27606j53208r2905o4290l8597k5242p776j0638k0414m1398n6689n9551
$$ plain form
-8307 -40607 -40559 -40506 -40454 -40402 -37790 -35178 -37336 -39489 -38785 -38081 -37377 -36669 -33833 -30998 -31024 -31046 -32444 -33841 -35238 -36632 -36464
-8286 -36464 -36296 -36129 -35957 -37578 -39199 -40819 -42436 -46725 -51013 -55302 -59587 -58987 -58387 -57787 -57184 -55376 -53566 -51755 -49944
-8267 -49944 -47362 -44776 -45052 -45328 -44013 -42694 -41375 -40056 -39456 -38852 -38249 -37645 -38122 -38595 -36207 -30957 -28274 -30357 -32261
-8248 -32261 -29396 -29664 -29929 -29955 -21396 -13617 -5833 -196 5440 10027 17475 20809 28913 33619 41186 47621 54055 56883
-8230 56883 62573 66891 79794 93233 111441 129054 153343 177166 209574 238643 276297 312281 366388 432299
-8216 432299 510610 586953 675696 762174 880128 1036592 1279855 1637279 2201683 3049037 4382843 6412643
-8204 6412643 9443960 12619065 14277589 13314046 10139537 6916680 4519836 2923967 1944269 1374955
-8194 1374955 1021204 793598 640390 547485 483195 444598 419356 411580 400942 380528 339130 282441 222890
-8181B22890m6138l6599k5332j9610j0190j0190o699j2422j2363j5220q309q308q488q483
-8167e461n224n223k362k359J990J989K3K887L346k377l748l745k675k675k675k672L763L764
-8149b3434M120j598k258k258K46K50N29N33k329k329m061m057P11P12K124K127K128K127
-8131b6717q57q53q53q54k995k992j31j30k101k098m959m959l234l231J539J539l175l170
-8113f0231J598J599L31L32L31L32L91L91L253L253n33n33l394l394J434J435J434J434M96
-8094e0041M96k366k366K880K880J9J8m73m73m73m74j75j75K687K686J494J498j010j006k262
-8074d6636L466K030q27l096k31k023k020M21M25M21M25q39q34m233J491K708j49J818J819
-8055d5864j882j878m47m47j434j431L338L339L20L24L24L25q42q39l02l163n104O22L901
$$ plain form
-8181 222890 176752 140153 114821 95211 85021 74831 68132 55710 43347 28127 19818 11510 3022 -5461
-8167 -5461 -10685 -15908 -18270 -20629 -18639 -16650 -16627 -13740 -10394 -12771 -16519 -20264 -22939 -25614 -28289 -30961 -27198 -23434
-8149 -23434 -19314 -20912 -23170 -25428 -25182 -24932 -24403 -23870 -26199 -28528 -32589 -36646 -35935 -35223 -33099 -30972 -28844 -26717
-8131 -26717 -27574 -28427 -29280 -30134 -33129 -36121 -36252 -36382 -38483 -40581 -45540 -50499 -53733 -56964 -55425 -53886 -57061 -60231
-8113 -60231 -58633 -57034 -56703 -56371 -56040 -55708 -55317 -54926 -51673 -48420 -48953 -49486 -52880 -56274 -54840 -53405 -51971 -50537 -50041
-8094 -50041 -49545 -51911 -54277 -51397 -48517 -48498 -48480 -48953 -49426 -49899 -50373 -50548 -50723 -48036 -45350 -43856 -42358 -43368 -44374 -46636
-8074 -46636 -43170 -41140 -41967 -45063 -45294 -47317 -49337 -48916 -48491 -48070 -47645 -48484 -49318 -53551 -52060 -49352 -49501 -47683 -45864
-8055 -45864 -47746 -49624 -50071 -50518 -51952 -53383 -50045 -46706 -46386 -46062 -45738 -45413 -46255 -47094 -47396 -50559 -55663 -55041 -51140
-8036e1140L901J185J188j673j673K240K243K72L137R87m732N70O297P873J3599J4252J7116
-8019A5642K1464K7192K8320K8324K1301J1767O18j2735k1919k4777k8116k5254k3313j7586
-8005I28j1445n723m832m829m471m471o48o45l506l506j274j271k701k701J699J702j158j159
-7987e0011j49j46J286J285J453J454l317l316l65l65l65l65P67P68j915j915j737J126L092
-7968e2735k630k497L227K511K511J707J706K76K76j513j513j512j513p68p67p68p67j312
-7950e6081j311j312j311K444K444M352J490m396L72n81l443k23M545L473O11k761J01j688
-7932e3275j688k284k284l76l238J040N808K947K948R20R20R20R21l540l539o79o78k31k31
-7913e5619k31M538Q87j974j498j498q72q72q72q72J487J487j375j375N33N33N32N33k269
$$ plain form
-8036 -51140 -47239 -46054 -44866 -46539 -48212 -45972 -43729 -43457 -40320 -39333 -44065 -43495 -37198 -29325 -15726 -1474 15642
-8019 15642 37106 64298 92618 120942 142243 154010 154628 141893 119974 95197 67081 41827 18514 928
-8005 928 -10517 -16240 -21072 -25901 -30372 -34843 -35491 -36136 -39642 -43148 -44422 -45693 -48394 -51095 -49396 -47694 -48852 -50011
-7987 -50011 -50160 -50306 -49020 -47735 -46282 -44828 -48145 -51461 -51826 -52191 -52556 -52921 -52154 -51386 -53301 -55216 -56953 -55827 -52735
-7968 -52735 -55365 -57862 -54635 -52124 -49613 -47906 -46200 -45924 -45648 -47161 -48674 -50186 -51699 -52467 -53234 -54002 -54769 -56081
-7950 -56081 -57392 -58704 -60015 -57571 -55127 -50775 -49285 -53681 -53309 -53890 -57333 -57556 -53011 -49538 -48927 -51688 -51587 -53275
-7932 -53275 -54963 -57247 -59531 -59907 -63145 -62105 -56297 -53350 -50402 -49482 -48562 -47642 -46721 -50261 -53800 -54479 -55157 -55388 -55619
-7913 -55619 -55850 -51312 -50425 -52399 -53897 -55395 -56267 -57139 -58011 -58883 -57396 -55909 -57284 -58659 -58126 -57593 -57061 -56528 -58797
-7894e8797k269K500K500J219J218k12k13P45P46P45P49j520j521j520j516M92M91J923J926
-7875e2314J505J506j356j353k858k857j427j424K657K656J226J230n93n92Q38Q42l126l126
-7857e8566k64k61J371J375K805K806K98L02K865K865K534k232j874M803o26o23n03n03J35
-7838d3293m632n18n17m039m035P34P34K146K149P20P19j491j486n6n6J658J658J658J662
-7819d6285k575k574k217k214k939K783M572j148m192J532K366K369J088m635l204K522J834
-7802e2917J833q50q46j557m419n849j23m55K407M553j166j125J736J200J203q57q57K005
-7784e6084K008J110J111J646m072m70K393j006j003p49p49K828k891l670K053J338J341j077
-7766e5943j077L54L58j166j166l849r84k470L253L91k470m74m73k083k082K850K850j1j1
$$ plain form
-7894 -58797 -61066 -58566 -56066 -54847 -53629 -53841 -54054 -53309 -52563 -51818 -51069 -52589 -54110 -55630 -57146 -56654 -56163 -54240 -52314
-7875 -52314 -50809 -49303 -50659 -52012 -54870 -57727 -59154 -60578 -57921 -55265 -54039 -52809 -53402 -53994 -53156 -52314 -55440 -58566
-7857 -58566 -58830 -59091 -57720 -56345 -53540 -50734 -50436 -50134 -47269 -44404 -41870 -44102 -45976 -41173 -41799 -42422 -42925 -43428 -43293
-7838 -43293 -47925 -48443 -48960 -52999 -57034 -56300 -55566 -53420 -51271 -50551 -49832 -51323 -52809 -52865 -52921 -51263 -49605 -47947 -46285
-7819 -46285 -48860 -51434 -53651 -55865 -58804 -56021 -51449 -52597 -56789 -55257 -52891 -50522 -49434 -54069 -57273 -54751 -52917
-7802 -52917 -51084 -51934 -52780 -54337 -58756 -64605 -64728 -65183 -62776 -58223 -59389 -60514 -58778 -57578 -56375 -57232 -58089 -56084
-7784 -56084 -54076 -52966 -51855 -50209 -54281 -54751 -52358 -53364 -54367 -55116 -55865 -53037 -55928 -59598 -57545 -56207 -54866 -55943
-7766 -55943 -57020 -56666 -56308 -57474 -58640 -62489 -63473 -65943 -62690 -62299 -64769 -65243 -65716 -67799 -69881 -67031 -64181 -64192 -64203
-7747f4203O74O75O74O74K687K686K687K686J792J792J792J793L178L178O040O039L596L595
-7729a7965P34P34m393m389p250p251m691m687l256l257k64k61j692j691k262k258q27q27
-7711f5753j334j330J531J532Q42Q45Q46Q46j222j218q61q61j639M087O89O90N06k351K09
-7692f3946L074L845r20k534L32J915J919Pm758l50l47K214K216j915j911j736j733K91L156
-7673f1181J542J546o33o30o33o30k511k508k511k507m59m54j01k958k50K616L685L688Q54
-7654f4035Q57j830j826l349m84K492K496L328M69M66M69J9k839J449J453j904m761l156J617
-7635f9069M326J468N10N14J491J490J133L994L785R24k354n217m664m665l771r09J595j267
-7617g0686k042k042j650L118L298L297L506L506K076K075N10N11k172k173k619K42j367j368
$$ plain form
-7747 -64203 -63529 -62854 -62180 -61506 -58819 -56133 -53446 -50760 -48968 -47176 -45384 -43591 -40413 -37235 -31195 -25156 -21560 -17965
-7729 -17965 -17231 -16497 -20890 -25279 -32529 -39780 -44471 -49158 -52414 -55671 -55935 -56196 -57888 -59579 -61841 -64099 -64926 -65753
-7711 -65753 -67087 -68417 -66886 -65354 -64512 -63667 -62821 -61975 -63197 -64415 -65276 -66137 -67776 -63689 -63000 -62310 -61804 -64155 -63946
-7692 -63946 -60872 -57027 -57947 -60481 -60149 -58234 -56315 -56308 -61066 -61416 -61763 -59549 -57333 -59248 -61159 -62895 -64628 -64337 -61181
-7673 -61181 -59639 -58093 -58726 -59356 -59989 -60619 -63130 -65638 -68149 -70656 -71115 -71569 -71670 -74628 -74878 -72262 -68577 -64889 -64035
-7654 -64035 -63178 -65008 -66834 -70183 -70667 -68175 -65679 -62351 -61882 -61416 -60947 -60928 -63767 -62318 -60865 -62769 -67530 -70686 -69069
-7635 -69069 -64743 -63275 -62765 -62251 -60760 -59270 -58137 -54143 -50358 -49434 -51788 -57005 -61669 -66334 -70105 -71014 -69419 -70686
-7617 -70686 -72728 -74770 -76420 -73302 -70004 -66707 -63201 -59695 -57619 -55544 -55034 -54523 -56695 -58868 -61487 -61245 -62612 -63980
-7599f3980o18o19R92j871j542j543l152l152k362k362M99M99J721J722j319j319J092j770
-7581g9084k843J926l39l39k20k20o07l469o07K254K731K731N593Q23O11O15L13L17Q19Q24
-7561f8171Q20Q23L532L536K101K105j386j382m247m244j066j062J796J800j42j38J290J292
-7543f2743j631j629L138L140K750K754j12j08N03N06N03N07J636J639J636J639L812L815
-7525c8245L812L815M289M292J0965J0969J2317J2321J5716K5258K6148K9013L0500L0504
-7511A81674K8309K2590J4360M825n909j5444k1528l1063l0366l0366k9412k3685k2497k2497
-7497A8991j1647j1642q302q301l532l528n381n380n380n376m963m963k102k097K280K280
-7481e9043Q50Q53j028j029J774M639L472k250J147J152r95r91r95r91N55N59J97K01K933
$$ plain form
-7599 -63980 -64598 -65217 -64225 -66096 -67638 -69181 -72333 -75485 -77847 -80209 -79710 -79211 -77490 -75768 -77087 -78406 -77314 -79084
-7581 -79084 -81927 -80001 -80340 -80679 -80899 -81119 -81726 -85195 -85802 -83548 -80817 -78086 -72493 -71670 -71059 -70444 -70131 -69814 -68995 -68171
-7561 -68171 -67351 -66528 -62996 -59460 -57359 -55254 -56640 -58022 -62269 -66513 -67579 -68641 -66845 -65045 -65187 -65325 -64035 -62743
-7543 -62743 -64374 -66003 -62865 -59725 -56975 -54221 -54333 -54441 -53938 -53432 -52929 -52422 -50786 -49147 -47511 -45872 -42060 -38245
-7525 -38245 -34433 -30618 -26329 -22037 -11072 -103 12214 24535 40251 65509 91657 120670 151170 181674
-7511 181674 209983 232573 246933 251758 245849 230405 208877 177814 147448 117082 87670 63985 41488 18991
-7497 18991 7344 -4298 -12600 -20901 -24433 -27961 -33342 -38722 -44102 -49478 -54441 -59404 -61506 -63603 -61323 -59043
-7481 -59043 -58193 -57340 -58368 -59397 -57623 -52984 -49512 -51762 -50615 -49463 -50458 -51449 -52444 -53435 -52880 -52321 -52124 -51923 -48990
-7462d8990k787M28M32j419j416j420j415j636j632L134L137q6q2q6q2j293j289L477L480
-7443d9545n317n313l886l883l692l689J081J080L789L793L793L793L238L242j528j528J122
-7426e3450J125l05l06p23p19p19p19l197l193l32l31R16R21n757n756j170j166j167j166
-7407g7214K772K776l87l84K802j964l756q90K608K612M218M221L73L76L234L238p98p93l659
-7388f0615l655j304j301L06L09N179Q044O252J487L182L186K2k835o41M128L949q16J565
-7370c3558J565l502l499P75P75K087p72k38n008m113j248J00J01N049N052M154M155N585
-7352b2540N589N391N391O821O826R326R326J9520J9523J8775J4009J4189R419K351m322q674
-7336A10920j3443j3030j3025j1774j6543k0928j6156j0550j0552m583m579J90J90R02R05
$$ plain form
-7462 -48990 -51777 -51349 -50917 -52336 -53752 -55172 -56587 -58223 -59855 -56721 -53584 -53670 -53752 -53838 -53920 -55213 -56502 -53025 -49545
-7443 -49545 -54862 -60175 -64061 -67944 -71636 -75325 -74244 -73164 -69375 -65582 -61789 -57996 -54758 -51516 -53044 -54572 -53450
-7426 -53450 -52325 -52630 -52936 -53659 -54378 -55097 -55816 -59013 -62206 -62538 -62869 -61953 -61032 -66789 -72545 -73715 -74881 -76048 -77214
-7407 -77214 -74442 -71666 -72053 -72437 -69635 -71599 -75355 -76245 -73637 -71025 -66807 -62586 -62213 -61837 -58603 -55365 -56163 -56956 -60615
-7388 -60615 -64270 -65574 -66875 -66569 -66260 -61081 -53037 -46785 -45298 -42116 -38930 -38908 -41743 -42384 -38256 -34307 -35123 -33558
-7370 -33558 -31993 -35495 -38994 -38219 -37444 -35357 -36129 -36367 -41375 -45488 -46736 -46636 -46535 -41486 -36434 -32280 -28125 -22540
-7352 -22540 -16951 -11560 -6169 652 7478 16804 26130 45650 65173 83948 97957 112146 121565 123916 119594 110920
-7336 110920 97477 84447 71422 59648 43105 22177 6021 -4529 -15081 -19664 -24243 -24053 -23863 -22961 -22056
-7321b2056l864l863o953o949m087m087r7r3K768K768L581L581L580L581K239K239L32k530
-7303b9910m199p061n331n332l692J076N071K210K38k623n186k325J013J014K921K921k01
-7286d9396M568K183k586o759o758n209n209j643N037O230L368M617M620N812q64m21m18N96
-7268d2232N97N421N425J132J133k12k09j639j640l3l0q05l666O00O03O04k258k977k973O63
-7248d2496k198k169n030l957j095K154p08J259J259J900M762P564J0425Q815N954R531O668
-7231B638K787N649J892J893j028N648L383n201o438o439o795o796l338m77k086k087k243
-7214a9038k239L24L24K586N451L841L842L05L09m281p142p623p620q156M29N499Q365P112
-7196a7712P113N708K851M280M281K921O3J673J673N604N607P992P992O00O00l633o494k441
$$ plain form
-7321 -22056 -25920 -29783 -36736 -43685 -47772 -51859 -51956 -52049 -49281 -46513 -42932 -39351 -35771 -32190 -29951 -27712 -27380 -29910
-7303 -29910 -34109 -41170 -46501 -51833 -55525 -54449 -49378 -47168 -46930 -49553 -54739 -57064 -56051 -55037 -52116 -49195 -49396
-7286 -49396 -44828 -42645 -45231 -51990 -58748 -63957 -69166 -70809 -65772 -59542 -56174 -51557 -46937 -41125 -41989 -42410 -42828 -42232
-7268 -42232 -41635 -36214 -30789 -29657 -28524 -28736 -28945 -30584 -32224 -32257 -32287 -33092 -36758 -36158 -35555 -34951 -37209 -40186 -43159 -42496
-7248 -42496 -44694 -46863 -51893 -55850 -56945 -54791 -55499 -54240 -52981 -51081 -46319 -38755 -28330 -19515 -13561 -4030 2638
-7231 2638 5425 11074 12966 14859 13831 19479 22862 17661 11223 4784 -2011 -8807 -12145 -12622 -14708 -16795 -19038
-7214 -19038 -21277 -20953 -20629 -18043 -12592 -8751 -4909 -4604 -4295 -8576 -15718 -23341 -30961 -39117 -38688 -33189 -24824 -17712
-7196 -17712 -10599 -4891 -2040 2240 6521 9442 9505 11178 12851 18455 24062 32054 40046 40646 41246 37613 31119 28678
-7178B8678L283N786K925N85N85L744L745M996M997J658J658K138K139P08P08O014O013Q219
-7160H8579Q220O356L495K16n507j0693j0693o759K779J3533K3074K3846K0988J1326N608
-7145A74368K444K448j222j219p422p418r568r564m322m318m963m959q898q894l889J836J774
-7128A06214P500J5097J7963J9091J9095J5753J5757J0150O14N07N10N757J1479J1893J1897
-7113B69277J0228J0227R628J5354K1554K1555K2116K7844K4803K4803K5873K8738L2135L7859
-7099E81994N1060O8232P7174P7174P0881O5162O2837O5698O4860P0587Q1854Q4715Q6139
-7086A508367Q9004J02592J35026J73473K09723K42629K71244L02150L34584L59857L92290
-7075D120939M35507N02279O02907P26904Q54222R82038J125823J337576J698178K283831
$$ plain form
-7178 28678 31961 37747 40672 41257 41842 45586 49331 54327 59324 60982 62640 64778 66917 67625 68333 74347 80360 88579
-7160 88579 96799 103155 106650 106866 101359 90666 79973 73214 75993 89526 112600 136446 157434 168760 174368
-7145 174368 176812 179260 178038 176819 169397 161979 152411 142847 138525 134207 129244 124285 115387 106493 102604 104440 106214
-7128 106214 113714 128811 146774 165865 184960 200713 216470 226620 227234 227741 228251 234008 245487 257380 269277
-7113 269277 279505 289732 299360 314714 336268 357823 379939 407783 432586 457389 483262 512000 544135 581994
-7099 581994 633054 701286 778460 855634 926515 991677 1054514 1120212 1185072 1255659 1337513 1422228 1508367
-7086 1508367 1597371 1699963 1834989 2008462 2218185 2460814 2732058 3034208 3368792 3728649 4120939
-7075 4120939 4556446 5058725 5661632 6388536 7242758 8224796 9350619 10688195 12386373 14670204
-7065A4670204L182810M489552O331441Q836196J2003842J5225873J6438147J2716329L703153
-7056I7597547p386022j5209744j7020093j4837276j1371067q088807n545906l791820k610985
-7047A1735827j805991j243229q66949o24674m98653m54774m75519n15579n39985n15181m62963
-7036C732330m07637l55539l00212k53237k09361j82732j65560j57932j44576j25264r2830
-7025A337450o6839l8224k3089k105L856n682k9348n7964p3284p0423o6060o0337o3139n3600
-7011G31212m8116l4763l2139k6417k4550j8826j5250k0973k4252j8529k0734j5012j2936
-6998D18715j5798j6632j9494k2475j6751o796j073r32M795M792M795l137l133m032o889j5090
-6982C00865r363p757k031m776j0496j7653k3373k7367k1639j2225o498j4251j4248j9379
$$ plain form
-7065 14670204 17853014 22342566 28674007 37510203 49514045 64739918 81178065 93894394 97597547
-7056 97597547 90211525 75001781 57981688 43144412 31773345 23684538 18138632 14346812 11735827
-7047 11735827 9929836 8686607 7819658 7194984 6696331 6241557 5766038 5250459 4710474 4195293 3732330
-7036 3732330 3324693 2969154 2668942 2415705 2206344 2023612 1858052 1700120 1555544 1430280 1337450
-7025 1337450 1270611 1232387 1209298 1207193 1211049 1205367 1176019 1118055 1044771 974348 908288 847951 784812 731212
-7011 731212 683096 648333 616194 589777 565227 546401 531151 510178 485926 467397 446663 431651 418715
-6998 418715 402917 386285 366791 344316 327565 320769 319696 318764 323559 328351 333146 330009 326876 322844 315955 300865
-6982 300865 291502 283745 281714 276938 266442 248789 225416 198049 176410 164185 157687 143436 129188 109809
-6968A09809j3651n190M352N421k98J75J79o502o498r345l621N51J0090J4054J9777J8764
-6952A38067J3040O364L502L43L43K459Q182O394R255O695R557L357L357O278O278J3134J3134
-6935B49739J0987J3849J2478J8201K1838L1375L5549M1271L6317L6320L2262L2266L2024
-6922F04476L7751M1562N1104M9103M9107M4931N0657O6630Q7618J03113J20287J31069J52057
-6909A589465J70414J91402K05348K33967K69016L24342L82193M41334M91883N54840O59160
-6898E513364Q48022J147757J618951K303433L285872M656519O459251Q445947R569553Q063704
-6888E1912373L281225l215538q307055r918304q840481o811815m825950l276222k209846
-6879G788387j507141j032136p07597m80586l40374k58346k31876k37599k55842k73010k65618
$$ plain form
-6968 109809 96158 90968 95320 100741 100443 100618 100797 94295 87797 78452 74831 75382 85472 99526 119303 138067
-6952 138067 151107 157471 160973 161316 161659 164118 172300 178694 187949 194644 204201 207558 210915 217193 223471 236605 249739
-6935 249739 260726 274575 287053 305254 327092 358467 394016 435287 471604 507924 540186 572452 604476
-6922 604476 642227 683789 734893 783996 833103 878034 928691 995321 1082939 1186052 1306339 1437408 1589465
-6909 1589465 1759879 1951281 2156629 2390596 2659612 2983954 3366147 3807481 4299364 4854204 5513364
-6898 5513364 6361386 7509143 9128094 11431527 14717399 19373918 25833169 34279116 43848669 51912373
-6888 51912373 55193598 51978060 43671005 33752701 24912220 18100405 13274455 9998233 7788387
-6879 7788387 6281246 5249110 4541513 4060927 3720553 3462207 3230331 2992732 2736890 2463880 2198262
-6868B198262k37003k07315j78701j50086j25286j11143j01605r6001r6001r2544p9190o2736
-6856F60651m9383m1126m1126l8384l2661k8250k2527j6446o907j390j390q067j3789j8171
-6842C41034j8171j9602j9602j7158j1434p977p978j0779j0779j0779j0778l883l878k452
-6828A85784k448l495l491k183P358Q816Q819L688k030j1901j7619j6551j0823j3809j3804
-6813A16311j3450j3447j1930j1927p161p157j4747j4744j5581k225j602j598n89n84j941
-6798b372R24L84O109J2813J2817O554Q35k806O0m81m77K858K862Q700Q703J0649K0190K2214
-6780A10536L1756M4032N7390P9085J03889J06225O2353j3958q4536j18640j12912r0979o6175
-6767A08066m3280k6107j7110j1382n425q282p332j606L726Q68n07n03n305n302o0n6r65r61
$$ plain form
-6868 2198262 1961259 1753944 1575243 1425157 1299871 1188728 1087123 991122 895121 802577 723387 660651
-6856 660651 611268 570142 529016 490632 457971 429721 407194 390748 383841 382451 381061 372994 359205 341034
-6842 341034 322863 303261 283659 266501 255067 247090 239112 228333 217554 206775 195997 192114 188236 185784
-6828 185784 183336 179841 176350 174167 181525 190341 199160 202848 200818 188917 171298 154747 143924 130115 116311
-6813 116311 102861 89414 77484 65557 58396 51239 36492 21748 6167 3942 2340 742 153 -431 -2372
-6798 -2372 -1448 -1064 5045 17858 30675 37229 38064 35258 35318 34837 34360 37218 40080 48780 57483 68132 88322 110536
-6780 110536 142292 186324 243714 322799 426688 532913 595266 581308 496772 378132 265220 174241 108066
-6767 108066 64786 38679 21569 10187 4762 -3520 -10852 -12458 -8732 -7864 -8371 -8874 -14179 -19481 -19541 -19597 -20562 -21523
-6749b1523r65r61n913n910n913n909n6n2k440k437j278j274L014L018M378M378l730l729
-6731d7302j495j494M74k389l416K306P195J471l685o546q037q036q935j4658j0723n000R61
-6714a09309J0500J6461J6461J2169J2168N790N790Q354N492L167k556m725m724o513o513
-6699c7988m32m32k459k459p5N649N767N768P109P109J0447J0447R910R911R911R911J6111
-6682F4205J6110R434p735j8391k7929k6260k0536j3473l934L279O140J1565J1568Q525L759
-6667A6327J550q938j2220j2217q510n645n231k366l43M430N917N920Q648L883J82m583m646
-6650a7842m642j904m762n719n716m169j304K716K720K239k526j591j591j00k962k068P93
-6633d8428K523K522N026P888P470M609L268l409m125m124n880n879p132p131o654l793J930
$$ plain form
-6749 -21523 -22488 -23449 -29362 -35272 -41185 -47094 -47150 -47202 -49642 -52079 -53357 -54631 -51617 -48599 -44221 -39843 -43573 -47302
-6731 -47302 -48797 -50291 -49817 -52206 -55622 -53316 -46121 -44650 -48335 -54881 -62918 -70954 -79889 -94547 -105270 -110270 -109309
-6714 -109309 -98809 -82348 -65887 -53718 -41550 -35760 -29970 -21616 -16124 -12957 -15513 -20238 -24962 -31475 -37988
-6699 -37988 -38420 -38852 -41311 -43770 -43845 -38196 -32429 -26661 -19552 -12443 -1996 8451 18361 28272 38183 48094 64205
-6682 64205 80315 89749 82014 63623 35694 9434 -11102 -24575 -28509 -25230 -19090 -7525 4043 12568 16327
-6667 16327 17877 8939 -3281 -15498 -24008 -29653 -34884 -37250 -37593 -33163 -27246 -21326 -12678 -8795 -8613 -13196 -17842
-6650 -17842 -22484 -24388 -29150 -34869 -40585 -44754 -46058 -43342 -40622 -38383 -40909 -42500 -44091 -44191 -47153 -49221 -48428
-6633 -48428 -45905 -43383 -38357 -30469 -22999 -18390 -15122 -18531 -22656 -26780 -32660 -38539 -45671 -52802 -59456 -63249 -61319
-6616f1319J930L80L241M971M970Q458Q457N597K735K250o07p90K075J744J747J0626J3491
-6599I956J4650J9423L0746L0750L5515L5519L4203K9438J9159Q670j468j7679k6864l5444
-6585A86574l7416l7411l5433k8753k0529j3850n804n802n565n563n525q387o957o956k604
-6570c9981n466j651j650k917n779k560k560L611O472O471L611N611N611N552P82J57k705
-6553b7391k3o699n447n447m434m434QPj423j424M948M952m17o137j818j814k176k173l57
-6534f1699l54M054M057P809K091O557L700K295l424l547o405m203m199r150r147p616p612
-6517h6793o364r221j4710k0429j3577p851L849R576J8394Q860Q916L197J047J051M847M851
-6501i4357O815L957O755J2482J5101J2243J5172R452P422M564K593K597K414l305p45o464
$$ plain form
-6616 -61319 -59389 -59009 -55768 -50797 -45827 -37369 -28912 -23315 -20580 -18330 -18937 -19727 -17652 -15908 -14161 -3535 9956
-6599 9956 24606 44029 74775 105525 141040 176559 210762 240200 259359 268029 266561 248882 222018 186574
-6585 186574 149158 111747 76314 47561 27032 13182 7378 1576 -3989 -9552 -15077 -23464 -30421 -37377 -39981
-6570 -39981 -45447 -47098 -48748 -51665 -57444 -60004 -62564 -58953 -52481 -46010 -42399 -36788 -31177 -25625 -24843 -24686 -27391
-6553 -27391 -27414 -34113 -39560 -45007 -49441 -53875 -53867 -53860 -55283 -56707 -51759 -46807 -47224 -53361 -55179 -56993 -59169 -61342 -61699
-6534 -61699 -62053 -57999 -53942 -46133 -44042 -37485 -33785 -31490 -34914 -38461 -44866 -49069 -53268 -62418 -71565 -79181 -86793
-6517 -86793 -93157 -102378 -117088 -137517 -151094 -158945 -155096 -145520 -127126 -118266 -109350 -106153 -105106 -104055 -99208 -94357
-6501 -94357 -87542 -83585 -76830 -64348 -49247 -37004 -21832 -12380 -4958 -394 2199 4796 7210 3905 3160 -3304
-6485c304q375q372n395n392R24R28N742K2M311P176J3907J1051J2478J2482J1852O133O069
-6468F2237L51J658M523J2746R889J3469J3472J4543J1684R415L696J2456J8182K1785K7512
-6453B37618L4424M0150N6480O6023Q4380J05368J35644J64260K06465K50342L01014L41075
-6441B023243L66351L56812L18332K36303J33766R769j11604k24157k96170l40046l46872
-6430B125727l25888k83443k28120j64692j13185p1454n4287m8101n3824o0620o6343o8370
-6418E87400o8370o1097n5374m2497l6771k2467j6740k437L290Q055j479m568j4102j8518
-6404B54325k4237k0783k0779j7683j1956l965l960J758P486J0104J0109Q554K836K787k933
-6389A91663n797j1517j7959k3678k3681k3678j9591j9587j8041j2314k958k955R77m743O48
$$ plain form
-6485 -3304 -11679 -20051 -25446 -30838 -29914 -28986 -23244 -23222 -18911 -11735 2172 13223 25701 38183 50035 56168 62237
-6468 62237 62588 64246 68769 81515 91404 104873 118345 132888 144572 153987 157683 170139 188321 210106 237618
-6453 237618 272042 312192 368672 434695 519075 624443 760087 924347 1130812 1381154 1682168 2023243
-6441 2023243 2389594 2746406 3064738 3301041 3434807 3444576 3332972 3108815 2812645 2472599 2125727
-6430 2125727 1799839 1516396 1288276 1123584 1010399 938945 884658 836557 782733 722113 655770 587400
-6418 587400 519030 457933 402559 360062 323291 300824 284084 281647 284937 292992 291513 286945 272843 254325
-6404 254325 230088 209305 188526 170843 158887 154922 150962 152720 160206 170310 180419 188973 191809 194596 191663
-6389 191663 185866 174349 156390 132712 109031 85353 65762 46175 28134 15820 12862 9907 10884 6141 6789
-6374F789O375Q517K798k46n965l107l104N041N045P903K183K72n447p716p713L968j751m259
-6356I583J468R334J5060J9348J3629R125m225q163j3883j0787j0782j0787j6505r489r486
-6341a6560k813O729J3520J3525J9125R590J0030M311O573O576O811J091m277m274J834J836
-6325G3627O245O248L741j978n440n436J363J364O491O490M285J0008R650L927M955p67m583
-6308A20190m583k675k675k676k675J453J453O223O222K347K347q860j8398k7996l3720k1796
-6292A4181j2258l911J810J3912J9635K5809K2952J2157K623k984k981J0429J3294J0488R54
-6277A26110q409j4129j2820j2817o264n36N902J82l159q879j2281o553P15P19O468J2195
-6261F6444J3979M445n514j1233l726R631J5727J5727N593p761k2069k7791k3261j3722r50
$$ plain form
-6374 6789 13164 21681 24479 24233 18268 15161 12057 17098 22143 30046 32229 32501 27054 19338 11625 15593 13842 9583
-6356 9583 11051 20385 35445 54793 68422 77547 73322 65159 51276 40489 29707 18920 2415 -7074 -16560
-6341 -16560 -19373 -12644 876 14401 33526 43116 53146 57457 64030 70606 77417 78508 74231 69957 71791 73627
-6325 73627 79872 86120 89861 87883 82443 77007 78370 79734 86225 92715 97000 107008 116658 120585 125540 124773 120190
-6308 120190 115607 112932 110257 107581 104906 106359 107812 114035 120257 122604 124951 116091 97693 69697 35977 14181
-6292 14181 1923 -1988 -178 13734 33369 59178 82130 94287 96910 93926 90945 101374 114668 125156 126110
-6277 126110 117701 103572 90752 77935 71671 71135 77037 77219 74060 65181 52900 46347 47062 47781 54249 66444
-6261 66444 80423 84868 79354 68121 64395 74026 89753 105480 111073 103312 81243 53452 30191 16469 15519
-6246A5519J2403J5623J5622J2940P217j75l036J054L916P195J0056J0652J0652M155M154
-6231A27947N302N302n011n012k805N6r602l0586m4777m1916k7906l108J8950L9933M4763
-6216G1530M1901K8086J4732J26r411j7758j2034r47M777K768K769P060P061l432j6785k9900
-6200I0543k9900k4967l983R251K2605J7359M005j4833k4371l0094j6739n056Q297P105J382
-6185A0604r944r944p246O106P478J0338O286O286K589N451J997J1535J6364K9718L6752N7736
-6169A82106O6977O6976O3579O6440M9330L9793J5887K533j5231j5231j0884O286K2620M3604
-6155E84785L1800J0816k6860n1659n9066m1898k8067j4713k9856m3209n7993m0825j1319
-6142B21936L2557N0918O0456L8399J7415r591k2944m0962m3824m6864k5880q294J2690J8652
$$ plain form
-6246 15519 27922 43545 59167 72107 79324 79149 76113 77167 81083 88278 98334 108986 119638 123793 127947
-6231 127947 133249 138551 133540 128528 125723 125779 116177 85591 40814 -1102 -29008 -32116 -13166 26767 71530
-6216 71530 113431 141517 156249 156375 146964 129206 117172 116225 121002 123770 126539 133599 140660 137228 120443 90543
-6200 90543 60643 35676 31693 40944 63549 80908 84913 70080 45709 15615 -1124 -6180 2117 9222 10604
-6185 10604 660 -9284 -16530 -10424 -2946 7392 13678 19964 22553 28004 30001 41536 57900 87618 124370 182106
-6169 182106 249083 316059 379638 446078 495408 535201 551088 553621 538390 523159 512275 518561 541181 584785
-6155 584785 616585 627401 600541 548882 489816 447918 419851 405138 375282 332073 274080 233255 221936
-6142 221936 254493 305411 365867 404266 421681 412090 389146 348184 304360 257496 231616 223322 236012 254664
-6128B54664K4375K4188M8992N0538N0541K7170J0003o11J2747K0894M5698M6410N2136L7229
-6114G04974K0064j5708k9058l0769J6927N6030Q0833N6626K0384j1096R892L3377N4364M0053
-6100A006893L4334J2631O912j1454N719K0742O4622P7495R4667P3441O3906L0757R777l4923
-6086A455519m8272o4969l2534K5407J18885J78973K15222J78183J22864M1547k325l5652
-6074B152848k2296k2598j9732q1720j25592j58204j10510o8068k4188n7815p1164r0766n0702
-6061A249493j8991M0150O8523J23848J54248K05758K02714K02717J47750J00063J5048j7377
-6049B473944m0273P422L5619Q3315O8287P7831M9211P7830J00956J75359J89304K10293J79766
-6036C688864K00754J97174K41053K38665K93991L46749M93638N85920O67950O33910O20558
$$ plain form
-6128 254664 279039 303227 352219 402757 453298 480468 490471 489860 502607 523501 569199 615609 667745 704974
-6114 704974 725038 709330 680272 649503 666430 722460 803293 859919 880303 869207 879099 912476 966840 1006893
-6100 1006893 1041227 1053858 1060770 1049316 1055035 1075777 1140399 1217894 1312561 1386002 1449908 1480665 1490442 1455519
-6086 1455519 1407247 1342278 1309744 1335151 1454036 1633009 1848231 2026414 2149278 2190825 2188500 2152848
-6074 2152848 2130552 2107954 2088222 2006502 1880910 1722706 1612196 1544128 1519940 1462125 1390961 1300195 1249493
-6061 1249493 1230502 1270652 1339175 1463023 1617271 1823029 2025743 2228460 2376210 2476273 2491321 2473944
-6049 2473944 2433671 2441093 2476712 2560027 2628314 2706145 2755356 2833186 2934142 3109501 3298805 3509098 3688864
-6036 3688864 3889618 4086792 4327845 4566510 4860501 5207250 5700888 6286808 6954758 7588668 8209226
-6025H209226N50986N48126M93891N41583N77291O82213O50229O29245N87994P42512R90052
-6014A5203348J404012J703513K018275K235301K580587K846700L195805L407237L786863
-6005C8381641M266637N161323O174047P282399P973195Q692394R817585J2570343J7366171
-5996A17685735K5506108L7398281N5034511Q0086981J15235463J57009144J86823852J58831350
-5988I33611425O6388575n6615131j57787363j87345586j64879113j24927198q5673454n5068300
-5980A67703855l4975017k1643393j2328348m673179J894866P425204Q873109M244667n005526
-5971A11516238j3702386j6710748j4847693j1576073q321449n793803l797449k143516m98406
-5962C4124715J144085L072476N519996Q727528J1510800J0453235M030178n370610j2339245
$$ plain form
-6025 8209226 8760212 9308338 9802229 10343812 10921103 11603316 12253545 12882790 13470784 14213296 15203348
-6014 15203348 16607360 18310873 20329148 22564449 25145036 27991736 31187541 34594778 38381641
-6005 38381641 42648278 47809601 53983648 61266047 69239242 77931636 87749221 100319564 117685735
-5996 117685735 143191843 180590124 235624635 315711616 430947079 587956223 774780075 933611425
-5988 933611425 1000000000 943384869 785597506 598251920 433372807 308445609 222772155 167703855
-5980 167703855 132728838 111085445 98757097 94083918 95978784 103403988 112277097 116521764 111516238
-5971 111516238 97813852 81103104 66255411 54679338 46357889 40564086 36766637 34623121 34124715
-5962 34124715 35268800 38341276 43861272 52588800 64099600 74552835 78583013 73212403 60873158
-5953F0873158j3048906j0429692p136352m223361j810666J17972K025739M072651O607437
-5944C7047980R413598J0872246Q005051R91094p324358j1779201j1338527q902221o340246
-5935B0645416m249991k863128j964865j383028r39742o36421m42083m09649m38805n20830
-5925F796874n34425n01992l94929k82373j67441j23561j06463j42705j53916j71082j70369
-5914D047618k18057k62176k94601k60596k20531j81666k10278k49149k70131k16719j53763
-5903A509951j04694j10416j13517j19239q2040l8164L1226Q2733J20007R5208L6308n3351
-5891A254012j07242j32041j08911q0297m5247k4263O021J9375L2728J9375O021k2594l4755
-5878G82182m4293l6186l0463j3532L636K4621P451j8253l9237l946K8485M1003Q573l0056
$$ plain form
-5953 60873158 47824252 37394560 30258208 26034847 24224181 24342153 26367892 30440543 37047980
-5944 37047980 46461578 57333824 65338875 66329969 59005611 47226410 35887883 26985662 20645416
-5935 20645416 16395425 13532297 11567432 10184404 9244662 8608241 8166158 7756509 7317704 6796874
-5925 6796874 6262449 5760457 5365528 5083155 4915714 4792153 4685690 4542985 4389069 4217987 4047618
-5914 4047618 3829561 3567385 3272784 3012188 2791657 2609991 2399713 2150564 1880433 1663714 1509951
-5903 1509951 1405257 1294841 1181324 1062085 980045 941881 973107 1055840 1175847 1271055 1307363 1254012
-5891 1254012 1146770 1014729 905818 825521 780274 756011 762032 781407 814135 833510 839531 816937 782182
-5878 782182 737889 701703 671240 657708 661344 685965 693416 675163 635926 631980 660465 701468 710041 679985
-5864F79985n1041l8492k5139n525J97J3253J6115J6054q744j7292k3015o800J0370L2784
-5850E92710L8507L2784J9430J6062O524J278j5890m0929o1913o2629n3090l2609k3070K861
-5836D20026K7661N3713N0850J9673k4203n7468p0822n6514l5530k2892l2430n4606p9406
-5823A38052p1351l8921L287L1901L4643J7474k436j9606k0664k0663j4107m568K3213O3273
-5809A19527R0814R0815P5449N8280M1469K4300R397l957j0157j5879j5686r963q413q413
-5795D37583n433K91k571q294j5093j5094n436M102Q633m721k3797l7151l4795k5258m751
-5780B68215J2419J7187L834j5004k8358l3842k8119j9296n943J628P351P292J0153P515n839
-5765A99193j5973j8834j3290l752P396K0749L1555L7277L4178K0824k545k7344n0356n0355
$$ plain form
-5864 679985 628944 590452 565313 559788 559985 573238 589353 605407 596663 579371 556356 549556 559926 592710
-5850 592710 631217 664001 683431 699493 706017 707295 691405 650476 588563 525934 472844 440235 417165 420026
-5836 420026 447687 501400 552250 571923 547720 490252 419430 362916 327386 304494 272064 217458 138052
-5823 138052 66701 27780 31067 62968 97611 115085 112649 93043 72379 51716 37609 33041 56254 119527
-5809 119527 210341 301156 376605 434885 476354 500654 510051 506094 495937 480058 464372 454409 445996 437583
-5795 437583 432150 432441 429870 421576 406483 391389 385953 390055 398688 393967 370170 333019 298224 272966 268215
-5780 268215 280634 297821 301655 286651 258293 224451 196332 177036 171093 172721 180072 187364 197517 205032 199193
-5765 199193 183220 164386 151096 147344 154740 175489 207044 244321 278499 299323 296778 269434 219078 168723
-5751A68723l5988j8820p850k128m512m512K523K522L629L629M822J0544J0127M404k452n313
-5735A29348n522K01L600J6952K0768K0768J3973M433o766j6304j6841j3980m501J2668J4397
-5720A73194Q674m441j3980k0179j4457l338O200L875J013m072r792j5041j7899k0139j0596
-5705E9022n354k489m236m233j2284j2281j2403o676K678J2221R076O219j714j710J34N860
-5689C1830J5217K4758K0344J7485M427j293j7989k3708k8540k5675k0875j1338n317M222
-5675a6452O189J1910R289R288N071N071K031K030o434r296j5317r593o759j036m076J647
-5659a6437j096J766M091j632j0901n179r174L66K869N730J855J856j394j393J56N880N730
-5642a6907N731M478J0201J2899J5760J3257J0395K049K049m746p609j1177n455p422p422
$$ plain form
-5751 168723 132735 113915 106065 103937 99425 94913 97436 99958 103587 107216 112038 122582 132709 137113 134661 129348
-5735 129348 123826 124027 127627 144579 165347 186115 200088 204521 197755 181451 164610 150630 146129 158797 173194
-5720 173194 181868 177427 163447 143268 128811 125473 131673 135548 136561 132489 122697 107656 89757 69618 59022
-5705 59022 53668 51179 46943 42710 30426 18145 5742 -934 1744 13965 23041 29260 27546 25836 25970 31830
-5689 31830 47047 71805 92149 109634 114061 112768 94779 71071 42531 16856 -4019 -15357 -20674 -16452
-5675 -16452 -10263 1647 10936 20224 25295 30366 32397 34427 27993 18697 3380 -6213 -12972 -14008 -18084 -16437
-5659 -16437 -17533 -15767 -11676 -13308 -24209 -29388 -38562 -38196 -35327 -29597 -27742 -25886 -27280 -28673 -28517 -22637 -16907
-5642 -16907 -11176 -6698 3503 16402 32162 45419 55814 57863 59912 55166 47557 36380 30925 23503 16081
-5627A6081j7466j7467j0313L040J0701J6423J2668O945j461J401n66n66n377n376o629l766
-5611a728J68N890K850K850l431l432K113P835N362Q223K202K202l35l36j56K705l048K675
-5593C2609j975Q87j252j252l934J788m17N306J550j312p161j438l108K616L391O252M463
-5576C7013J0187P370M508K76L137m553j692l122K601L137Q860N641J1364P787P787J885P609
-5559A09795L927J065n492q353j2944p221p638N716J0358J0361J1193J1196Q659Q663M605
-5544A43890J0332J7243K6786K7974L3700L9748N3105O5978Q6966J09220J45470J86003K29883
-5531A176298K70655L22166L56261L69619L49077K89945J87881P5334n4242j78235k82921
-5520B881838l42054l74283l64742l32792k81281k23669j64527j18509p4629n1578l4405k6241
$$ plain form
-5627 16081 -1385 -18852 -29165 -26125 -15424 999 13667 20612 19151 20552 19986 19420 14043 8667 2038 -1728
-5611 -1728 -1560 4330 7180 10030 6599 3167 5280 13115 18477 26700 28902 31104 30769 30433 30277 32982 29934 32609
-5593 32609 30634 31521 30269 29017 25083 26871 26454 31760 33310 31998 24837 23399 20291 22907 26298 32550 37013
-5576 37013 47200 54570 59078 59354 62491 57938 56246 53124 55725 58862 67722 73363 84727 92514 100301 102186 109795
-5559 109795 113722 114787 109295 100942 87998 80777 73139 78855 89213 99574 110767 121963 130622 139285 143890
-5544 143890 154222 171465 198251 226225 259925 299673 352778 418756 505722 614942 760412 946415 1176298
-5531 1176298 1446953 1769119 2125380 2494999 2844076 3134021 3321902 3397236 3342994 3164759 2881838
-5520 2881838 2539784 2165501 1800759 1467967 1186686 963017 798490 679981 605352 553774 519369 493128
-5508D93128k3376l0891l0888l3693l3690l0760k5035k4680j8953j7885q342k027P515J0880
-5494B31303J0883L368L372n931n928j4814j4811j8465j5604r821m099j64R374J1521K1059
-5479B01243K1565J5842J1551N827o632j2355j7542k0403k1889j6167j5987j0265l052O487
-5465A38223N533j90j2903k2441k2679j6957j7940j2217r356o494q279n417o670o668l897
-5450h352j036l301K422L390O252O430O431J960J960n194n194o165o167k828k828j337j338
-5433a4895K955K954k6k6j457j456m319m318p657p656o785o785n533J90J561M423M899P761
-5415c6170P612P612K545K545l76l77l76l76k269k269k269k270l073l074k716k717j434M288
-5397c5164N362N362O702O703k001p723p396p392o323n96J427P153N720N723M102M106O486
$$ plain form
-5508 493128 469752 438861 407973 374280 340590 309830 284795 260115 241162 223277 214935 212908 220423 231303
-5494 231303 242186 245554 248926 242995 237067 222253 207442 188977 173373 163552 159453 159289 168663 180184 201243
-5479 201243 222808 238650 250201 256028 249396 237041 219499 199096 177207 161040 145053 134788 131736 138223
-5465 138223 143756 143566 130663 108222 85543 68586 50646 38429 29073 22579 14300 8883 2213 -4455 -8352
-5450 -8352 -9388 -12689 -10267 -6877 -625 5805 12236 14196 16156 10962 5768 -397 -6564 -9392 -12220 -13557 -14895
-5433 -14895 -11940 -8986 -9012 -9038 -10495 -11951 -16270 -20588 -28245 -35901 -42686 -49471 -55004 -54814 -53253 -48830 -43931 -36170
-5415 -36170 -28558 -20946 -18401 -15856 -16232 -16609 -16985 -17361 -19630 -21899 -24168 -26438 -29511 -32585 -35301 -38018 -39452 -35164
-5397 -35164 -29802 -24440 -17738 -11035 -13036 -20759 -28155 -35547 -41870 -42466 -41039 -33886 -28166 -22443 -18341 -14235 -7749
-5380g749O491M66M69r65r61k582k578n921n917p768p765o15o11j546j542M653M658K865K869
-5361b4049J077J080L335k385n369n365q290q287l997l995O852O856N421N425p19p15j733
-5344c4858L994O211L353j121o841p023j297k492k489J069J073M408M411n339n335n339n336
-5327e2951o062o062k724k723K910K910O248O248L313L312r80r80K359K358r80r80k086k087
-5309d8957l517l517K921K921N306N305O185O185M337j386q063n201l830l830m039m035n470
-5292e8685n466m516m512l442K284P243P246L309L312K653K657L487k232n562n559o75o70
-5275e9128k016k012m9k906L10O035M602j118J025L890O509R374J7407J7408J5439R717K891
-5258B7378o647j4039j4038p690p691q047k325K295K295Q64Q65K585l137Q2Q2n373n372o04
$$ plain form
-5380 -7749 -1258 -792 -323 -1288 -2249 -4831 -7409 -13330 -19247 -27015 -34780 -35395 -36006 -37552 -39094 -34441 -29783 -26918 -24049
-5361 -24049 -22972 -21892 -18557 -20942 -26311 -31676 -39966 -48253 -52250 -56245 -49393 -42537 -37116 -31691 -32410 -33125 -34858
-5344 -34858 -30864 -24653 -21300 -22421 -29262 -36285 -37582 -40074 -42563 -41494 -40421 -36013 -31602 -36941 -42276 -47615 -52951
-5327 -52951 -59013 -65075 -67799 -70522 -67612 -64702 -58454 -52206 -48893 -45581 -46561 -47541 -45182 -42824 -43804 -44784 -46870 -48957
-5309 -48957 -52474 -55991 -53070 -50149 -44843 -39538 -33353 -27168 -22831 -24217 -32280 -37481 -41311 -45141 -49180 -53215 -58685
-5292 -58685 -64151 -68667 -73179 -76621 -74337 -67094 -59848 -56539 -53227 -50574 -47917 -44430 -46662 -52224 -57783 -58458 -59128
-5275 -59128 -61144 -63156 -63205 -66111 -65801 -59766 -55164 -56282 -55257 -51367 -44858 -35484 -18077 -669 14770 24487 27378
-5258 27378 20731 6692 -7346 -15036 -22727 -30774 -33099 -30804 -28509 -27645 -26780 -24195 -27332 -27250 -27168 -32541 -37913 -38517
-5240c8517o03O93O93L554L555J169J170N939N940k72k69l133l130k418k414M43M47K575K578
-5221b2000k87k83l506l502o45o41k552k549K217K221L051L056j68j64L096k623m177m172
-5203c3628o979o975k209k206k858k858k857k858K090K090J733J732L954j770J449J450o08
-5186e1308o07Q23Q24o08o07J897J896M788r35n78n77k50k50K254K255M787r35m393m392j35
-5166d6051j34J297J297j953j952n22n21J453J453K884K883K348K347K347K348p985p985n123
-5148e1569n123m43m43R87R87L827L826R65R65j270j271m132m132o971o967k202k199n5n3
-5129g5273K806K809K567K571k94k91Q98R02J077J080Q61L726M795L0K64K69K827K832M631
-5110d0913M635J770J774k57k54n026n022o547o542m758J5M452l13J233j624O00k258k262
$$ plain form
-5240 -38517 -39120 -38427 -37734 -34180 -30625 -29456 -28286 -22347 -16407 -16679 -16948 -20081 -23211 -25629 -28043 -27600 -27153 -24578 -22000
-5221 -22000 -22287 -22570 -26076 -29578 -30223 -30864 -33416 -35965 -33748 -31527 -28476 -25420 -25588 -25752 -22656 -25279 -29456 -33628
-5203 -33628 -40607 -47582 -49791 -51997 -54855 -57713 -60570 -63428 -61338 -59248 -57515 -55783 -51829 -53599 -52150 -50700 -51308
-5186 -51308 -51915 -51092 -50268 -50876 -51483 -49586 -47690 -42902 -43837 -44415 -44992 -45242 -45492 -43238 -40983 -36196 -37131 -41524 -45916 -46051
-5166 -46051 -46185 -44888 -43591 -45544 -47496 -48018 -48539 -47086 -45633 -42749 -39866 -37518 -35171 -32824 -30476 -38461 -46446 -51569
-5148 -51569 -56692 -57135 -57578 -56591 -55604 -51777 -47951 -46986 -46021 -47291 -48562 -52694 -56826 -63797 -70764 -72966 -75165 -75220 -75273
-5129 -75273 -72467 -69658 -67091 -64520 -64814 -65105 -64207 -63305 -62228 -61148 -60287 -56561 -51766 -51736 -51472 -51203 -48376 -45544 -40913
-5110 -40913 -36278 -34508 -32734 -32991 -33245 -38271 -43293 -49840 -56382 -61140 -61125 -56673 -56986 -55753 -57377 -56777 -59035 -61297
-5092f1297k258q31q27k261k258r35r32J926J930J360J364J360J364J948J953r13r09M869
-5074e5347M874K008K012l663l658R27R32L133K76k05m970j785j781k083k079m13m10m14m09
-5055f3055O181O185M094o70M1M4K426k340l387l383J084J088L99M03J412J415N82o096n201
-5036e8778n198p00p01p00o97J878J878M739k6R54L815O796J23N030K65l32l32pmmlk98k95
-5013d2597k94k94k862k858k857k858l812l808r50r46J703J706M564M568q98q94k329k324
-4995e8040J367J371m21K444K620k43J16J15j166j166m028m027l551l551L245O107N719K858
-4977e0231L215L54J379j479m10K455J707j152o18l476j930j927N74N78l957o815n030n026
-4959g1789j528J338K407K411M553J695L301L305K221K224m62m58l652p86k399k396J445J450
$$ plain form
-5092 -61297 -63555 -64386 -65213 -67474 -69732 -70667 -71599 -69673 -67743 -66383 -65019 -63659 -62295 -60347 -58394 -59307 -60216 -55347
-5074 -55347 -50473 -48465 -46453 -50116 -53774 -52847 -51915 -48782 -48506 -48711 -53681 -55466 -57247 -59330 -61409 -61822 -62232 -62646 -63055
-5055 -63055 -56874 -50689 -46595 -47265 -47224 -47180 -44754 -47094 -50481 -53864 -52780 -51692 -51293 -50890 -49478 -48063 -47481 -53577 -58778
-5036 -58778 -63976 -64676 -65377 -66077 -66774 -64896 -63018 -58279 -58305 -57351 -53536 -46740 -46617 -41587 -41322 -41654 -41986 -41993 -41997 -42001 -42004 -42302 -42597
-5013 -42597 -42891 -43185 -46047 -48905 -51762 -54620 -58432 -62240 -63190 -64136 -62433 -60727 -56163 -51595 -52493 -53387 -55716 -58040
-4995 -58040 -56673 -55302 -55723 -53279 -50659 -50902 -50786 -50671 -51837 -53003 -57031 -61058 -64609 -68160 -64915 -58808 -53089 -50231
-4977 -50231 -47016 -46662 -45283 -46762 -47172 -44717 -43010 -44162 -44780 -48256 -50186 -52113 -51539 -50961 -54918 -61733 -66763 -71789
-4959 -71789 -73317 -71979 -69572 -67161 -62608 -60913 -57612 -54307 -52086 -49862 -50324 -50782 -54434 -55220 -57619 -60015 -58570 -57120
-4941e7120J5J8k399k396K191K195K555l01L50k508j140L633P68P71M307M311M307M311m32
-4922c6564m29l294l290l830l826k579k574j058l916m099j233M40k418q13q08L390N33N29
-4904f5839N33J42k717K050M914K377K381K377k388j304j300Pk850p38p34L35L39L048J90
-4885e9177p67p64O03N377Q234L469M84M88j244j241j244j241J617J621M508M512L078L081
-4867b8606j900j897j900j896l532l529l532l528K23K27k638k634r76r72r77r72k705k701
-4849f4445J56J60L790L789r80r80k828k828L4L3k135k135k135k134J650J651K19K20J860
-4830f7038J859M720M721M840M840L409L409p04p04l566l565k404k403M274M273o96o93l559
-4812d8987l554j651j646J210J215o67o63l528l525K135K138k634k630k508k504k507k504
$$ plain form
-4941 -57120 -57105 -57087 -59486 -61882 -59691 -57496 -54941 -55242 -54892 -57400 -58540 -54907 -54139 -53368 -49061 -44750 -40443 -36132 -36564
-4922 -36564 -36993 -40287 -43577 -47407 -51233 -53812 -56386 -57444 -61360 -65459 -66692 -66252 -68670 -69483 -70291 -66901 -66368 -65839
-4904 -65839 -65306 -65164 -67881 -65831 -60917 -58540 -56159 -53782 -56170 -57474 -58774 -58767 -61617 -62355 -63089 -62754 -62415 -59367 -59177
-4885 -59177 -59944 -60708 -60105 -54728 -46494 -43025 -42541 -42053 -43297 -44538 -45782 -47023 -45406 -43785 -39277 -34765 -31687 -28606
-4867 -28606 -30506 -32403 -34303 -36199 -39731 -43260 -46792 -50320 -50097 -49870 -52508 -55142 -56118 -57090 -58067 -59039 -61744 -64445
-4849 -64445 -64289 -64129 -60339 -56550 -57530 -58510 -61338 -64166 -64132 -64099 -66234 -68369 -70504 -72638 -70988 -69337 -69118 -68898 -67038
-4830 -67038 -65179 -60459 -55738 -50898 -46058 -42649 -39240 -39944 -40648 -44214 -47779 -50183 -52586 -48312 -44039 -44735 -45428 -48987
-4812 -48987 -52541 -54192 -55838 -54628 -53413 -54080 -54743 -58271 -61796 -59661 -57523 -60157 -62787 -65295 -67799 -70306 -72810
-4795g2810j792j788J069J073J069J073J070J073j941j938R20R24J748J751L178L182M072
-4778e8067M077K284K287P1n648k433k430j479j475J382J386M14M17j017j014l91l87l92l87
-4759f2802O89O93O89O93R4R6m675m673l640l640J129J129L334L335J16N838N719N719L216
-4740d6941L215k388k388k031k030m065J658J300J300m303m303M65M66k575k574k575k574
-4723g0343k873k873j1j1k288k287p38M985J230J229J945J945l010K712N872L010K653K653
-4705e6200K474K474J818J819J818J818Q05Q05k057k057k407k407k407k406m196m195j334
-4688f5835j334J848J848J848J848K027K027K027K027N07N06N07N07p661p660q018k295n22
-4670g5798n22j64j64J506J505M367M366N22N22N21N22k578k579k578k578J840J845o64o59
$$ plain form
-4795 -72810 -74602 -76390 -75321 -74248 -73179 -72106 -71036 -69963 -71904 -73842 -72922 -71998 -70250 -68499 -65321 -62139 -58067
-4778 -58067 -53990 -51706 -49419 -49348 -54996 -57429 -59859 -61338 -62813 -61431 -60045 -59631 -59214 -60231 -61245 -61636 -62023 -62415 -62802
-4759 -62802 -62113 -61420 -60731 -60038 -59944 -59848 -64523 -69196 -72836 -76476 -75347 -74218 -70884 -67549 -67433 -61595 -55876 -50157 -46941
-4740 -46941 -43726 -46114 -48502 -50533 -52563 -56628 -54970 -53670 -52370 -56673 -60976 -60511 -60045 -62620 -65194 -67769 -70343
-4723 -70343 -73216 -76089 -76100 -76111 -78399 -80686 -81424 -76439 -75209 -73980 -72035 -70090 -73100 -70388 -64516 -61506 -58853 -56200
-4705 -56200 -53726 -51252 -49434 -47615 -45797 -43979 -43174 -42369 -44426 -46483 -48890 -51297 -53704 -56110 -60306 -64501 -65835
-4688 -65835 -67169 -65321 -63473 -61625 -59777 -57750 -55723 -53696 -51669 -51162 -50656 -50149 -49642 -57303 -64963 -72981 -75276 -75798
-4670 -75798 -76320 -76484 -76648 -75142 -73637 -69270 -64904 -64382 -63860 -63339 -62817 -65395 -67974 -70552 -73130 -71290 -69445 -70109 -70768
-4651g0768j736L990M166j554m315j449n59n55j751j748K839K843N753K895j580M147K474
-4634e6908K478K832K835L13L17k549k545l860l856m218J509M33M32P90P90L293L294L294
-4616e1326L293r68r69n738n738L43L43L42L43j304j304m165m166J975J974J975J975J259
-4598f1856J260J259J259L227L227L226L227J352J353j509j509k523k522k523k522J472J472
-4581e2630J471J472j98j97j97j98n70n70n70n70l670l670q09q08k687k686J75J75o3o3k031
-4560f8894Q31M553j166o34o29k184k179O78O82j27j23j27j23J12J16K973K977K720K723K720
-4540e5101K724j155j151j513j509n89o308o311n85n3m8l092K634o60l521j911L812M705M706
-4521f4926j613j613k597k597k597k597N62N63N63N62J315J316J136J136j75l036m646J076
$$ plain form
-4651 -70768 -72504 -68514 -64348 -65902 -70217 -71666 -72225 -72780 -74531 -76279 -73440 -70597 -64844 -61949 -63529 -59382 -56908
-4634 -56908 -54430 -51598 -48763 -48450 -48133 -50682 -53227 -57087 -60943 -65161 -63652 -63219 -62787 -61997 -61207 -57914 -54620 -51326
-4616 -51326 -48033 -49001 -49970 -55708 -61446 -61103 -60760 -60418 -60075 -61379 -62683 -66848 -71014 -69039 -67065 -65090 -63115 -61856
-4598 -61856 -60596 -59337 -58078 -54851 -51624 -48398 -45171 -43819 -42466 -43975 -45484 -48007 -50529 -53052 -55574 -54102 -52630
-4581 -52630 -51159 -49687 -49885 -50082 -50279 -50477 -51047 -51617 -52187 -52757 -56427 -60097 -60906 -61714 -64401 -67087 -66912 -66737 -66800 -66863 -68894
-4560 -68894 -68063 -63510 -64676 -65310 -65939 -68123 -70302 -69624 -68942 -69069 -69192 -69319 -69442 -69330 -69214 -66241 -63264 -60544 -57821 -55101
-4540 -55101 -52377 -53532 -54683 -56196 -57705 -58294 -64602 -70913 -71498 -71551 -71599 -74691 -72057 -72717 -76238 -78149 -74337 -69632 -64926
-4521 -64926 -66539 -68152 -70749 -73346 -75943 -78540 -77978 -77415 -76852 -76290 -74975 -73659 -72523 -71387 -71562 -74598 -79244 -78168
-4503g8168K068K068m36m36m36m36O241O241K269K269K269K269K269K269n92n92j398j397
-4485e3659j218j219j009J851k440K329K716K716J584J583j546j546N130N131L83L84k478
-4468d1308k477m863m862k001k000K377K381k392k389P08P12k154k150J916J918M598M602
-4451d7384K243o15m553K20p23p19J006J009M404M408l65l61k348k343l778l775j900j896
-4433e7470k91k87J643M505M326m44m73K388r50r50k351k351k351k351j16j15j16j15L275
-4414e4594L275m21n190l461J307j673j673K977K977K977K977M74M73L454j316l316J457K824
-4396d6472K828L301l371k482k478K31K35K31K35j57j52m628m624m769Mj252j248Q64Q68j997
-4376f4833j993k623k619k623k620L368L372N07N11K075K079L506j259j383J483J002j855
$$ plain form
-4503 -78168 -76100 -74032 -74468 -74904 -75340 -75776 -69535 -63294 -61025 -58756 -56487 -54218 -51949 -49680 -50272 -50864 -52262 -53659
-4485 -53659 -54877 -56096 -57105 -55254 -57694 -55365 -52649 -49933 -48349 -46766 -48312 -49858 -44728 -39597 -39214 -38830 -41308
-4468 -41308 -43785 -48648 -53510 -55511 -57511 -55134 -52753 -55145 -57534 -56826 -56114 -58268 -60418 -58502 -56584 -51986 -47384
-4451 -47384 -45141 -45756 -50309 -50089 -50812 -51531 -50525 -49516 -45112 -40704 -41069 -41430 -43778 -46121 -49899 -53674 -55574 -57470
-4433 -57470 -57761 -58048 -56405 -51900 -47574 -48018 -48491 -46103 -47053 -48003 -50354 -52705 -55056 -57407 -57523 -57638 -57754 -57869 -54594
-4414 -54594 -51319 -51740 -56930 -60391 -59084 -60757 -62430 -59453 -56476 -53499 -50522 -50048 -49575 -46121 -47437 -50753 -49296 -46472
-4396 -46472 -43644 -40343 -43714 -46196 -48674 -48443 -48208 -47977 -47742 -47899 -48051 -52679 -57303 -62072 -62068 -63320 -64568 -63704 -62836 -64833
-4376 -64833 -66826 -69449 -72068 -74691 -77311 -73943 -70571 -70064 -69553 -67478 -65399 -61893 -63152 -64535 -63052 -62050 -63905
-4359f3905K373m84m88m84r36r31l797l793l021l018J747J751J956J960L387L391L282L286
-4341e7724j486j483k739k735J23J27j651j650J688j174k396K374O188O189P64P64k098k098
-4323e9017k425k426r95r94J389J390J390J390J002J002j859j859m065m065j204j203J509
-4306g1040J509P8P8Q20Q24Q19Q24J833J837M02M06J103J107j759m616m710O3O0O3o07o07
-4285g1513o08o07Q83Q83j978j979N638N637Q68Q68MMj427j427K123K128K123K128r46r43
-4265e8141j125j122J528j330k705K068M717m9j12j08r24l785o290j520J431J431l041l040
-4247g2117K09K08K09K09J937J938J758J759J919r43j241J621J740l029j68j67J099J099j53
-4228f2113l014J159J158L842L841L998L998j248m110j75l037l394n33K702j61J98k664J032
$$ plain form
-4359 -63905 -61532 -62016 -62504 -62988 -63924 -64855 -68652 -72445 -75466 -78484 -76737 -74986 -73030 -71070 -67683 -64292 -61010 -57724
-4341 -57724 -59210 -60693 -63432 -66167 -66044 -65917 -67568 -69218 -67530 -68704 -71100 -68726 -62538 -56349 -55585 -54821 -56919 -59017
-4323 -59017 -61442 -63868 -64863 -65857 -64468 -63078 -61688 -60298 -59296 -58294 -60153 -62012 -66077 -70142 -71346 -72549 -71040
-4306 -71040 -69531 -69453 -69375 -68555 -67731 -66912 -66088 -64255 -62418 -62016 -61610 -60507 -59400 -61159 -65775 -70485 -70422 -70362 -70299 -70906 -71513
-4285 -71513 -72121 -72728 -71845 -70962 -72940 -74919 -69281 -63644 -62776 -61908 -61904 -61900 -63327 -64754 -62631 -60503 -58380 -56252 -57198 -58141
-4265 -58141 -59266 -60388 -58860 -60190 -62895 -60827 -56110 -56159 -56271 -56379 -57303 -61088 -67378 -68898 -67467 -66036 -69077 -72117
-4247 -72117 -71908 -71700 -71491 -71282 -69345 -67407 -65649 -63890 -61971 -62914 -64155 -62534 -60794 -63823 -63991 -64158 -63059 -61960 -62113
-4228 -62113 -65127 -63968 -62810 -58968 -55127 -51129 -47131 -48379 -52489 -52664 -55701 -59095 -59628 -56926 -57087 -56889 -59553 -58521
-4210e8521j830l081l081k884k2J229J230r76r77k2K839J573l197l197J572L808R46j915j915
-4191f8421J647J647J826j036J200J199n88K272K750K750q87n656k228O33J57J56l68l66o67
-4172f3980o63L77m389J97M970J509j348l99l257j561L212M818J959k559k556j308j304k292
-4154f8574k287j040j036J174j684J353J356j330j327J532J535J568J569L16k544M8M9j383
-4136g0705j382l186l24o82K180L759L760K686j75J695J696j167j166j434J427l62l61j60
-4118f3901l022j054l916p27K135M818J956l454l454p71p72J971J971K329n33k559L01J554
-4100f7128j308J584J583j635J225K150K150q31l692r50r50L02L01q45q46J837J836Q54k009
-4081f6372J033J032m88m85P64P67J837j021J837J841N77k280m95l354k135k131q83q79L200
$$ plain form
-4210 -58521 -60351 -63432 -66513 -69397 -69419 -68190 -66960 -67936 -68913 -68935 -66096 -64523 -67720 -70917 -69345 -65537 -64591 -66506 -68421
-4191 -68421 -66774 -65127 -63301 -64337 -63137 -61938 -62526 -60254 -57504 -54754 -55641 -61297 -63525 -62892 -62735 -62579 -62947 -63313 -63980
-4172 -63980 -64643 -64266 -68655 -68458 -63488 -61979 -63327 -63726 -66983 -68544 -65332 -60514 -58555 -61114 -63670 -64978 -66282 -68574
-4154 -68574 -70861 -71901 -72937 -71763 -73447 -72094 -70738 -72068 -73395 -71863 -70328 -68760 -67191 -66875 -69419 -69371 -69322 -70705
-4136 -70705 -72087 -75273 -75597 -76279 -74099 -70340 -66580 -63894 -64069 -62374 -60678 -61845 -63011 -64445 -63018 -63380 -63741 -63901
-4118 -63901 -66923 -67977 -71893 -72620 -70485 -65667 -63711 -67165 -70619 -71390 -72162 -70191 -68220 -65891 -66424 -68983 -68682 -67128
-4100 -67128 -68436 -66852 -65269 -66904 -65679 -63529 -61379 -62210 -65902 -66852 -67802 -67500 -67199 -68044 -68890 -67053 -65217 -64363 -66372
-4081 -66372 -65339 -64307 -64795 -65280 -64516 -63749 -61912 -62933 -61096 -59255 -58678 -60958 -61453 -64807 -66942 -69073 -69956 -70835 -67635
-4062f7635L205j748j743J60k698k522k519j323j319J539J543M311M314M013M016K009k757
-4045e9154k940k936L39L43L39L42j866j863K604k53K396K399K396m62j301j296j479j476
-4027f3868J412J416j449j446n10n07l193l189j852J013K620k39p79K083J16J15L186L24r28
-4008f5675r28j359j360L111K49n85n85p63p64k228k228j155J706K273n89k31k31J252J252
-3989f8838J073l696J311J312m17m18J68J71J68J71o96o93o97o93O89O93k172k168j040j036
-3969g6808J822J826J036J039j825j822k541k538K228K232o63o60K199K202J959J964K318
-3952f6032l402m88m88l708l707P04P04P05P04K381K381N600j23J15J16o00o00J144m579j360
-3932g0533j360j301j300J561J561j23j23j23j22K559K560l02l02k362k362N864N865K526
$$ plain form
-4062 -67635 -64430 -66178 -67921 -67761 -70459 -72981 -75500 -76823 -78142 -76603 -75060 -70749 -66435 -62422 -58406 -56397 -59154
-4045 -59154 -62094 -65030 -64691 -64348 -64009 -63667 -65533 -67396 -64792 -65045 -62649 -60250 -57854 -58316 -59617 -60913 -62392 -63868
-4027 -63868 -62456 -61040 -62489 -63935 -64445 -64952 -68145 -71334 -73186 -72173 -69553 -69792 -70571 -68488 -68372 -68257 -65071 -64747 -65675
-4008 -65675 -66603 -67962 -69322 -66211 -65962 -66547 -67132 -67895 -68659 -70887 -73115 -74270 -72564 -70291 -70880 -71111 -71342 -70090 -68838
-3989 -68838 -67765 -71461 -70150 -68838 -69255 -69673 -69505 -69334 -69166 -68995 -69691 -70384 -71081 -71774 -71085 -70392 -72564 -74732 -75772 -76808
-3969 -76808 -74986 -73160 -72124 -71085 -72910 -74732 -77273 -79811 -77583 -75351 -76014 -76674 -74475 -72273 -70314 -68350 -66032
-3952 -66032 -69434 -69922 -70410 -74118 -77825 -77121 -76417 -75712 -75008 -72627 -70246 -64646 -64769 -64654 -64538 -65138 -65738 -64594 -69173 -70533
-3932 -70533 -71893 -73194 -74494 -72933 -71372 -71495 -71618 -71741 -71863 -69304 -66744 -67046 -67348 -69710 -72072 -66208 -60343 -57817
-3914e7817l197K3K2l13l13o71o70K846k876k519k518o0o0n9o0O0N9O0O0k959k958J811J810
-3891g0299J215J215J214J215k31k27l093l089L66L68L66L68J804J807j058j055k071k068
-3873g3253n22N205K832K835j580j576j758j755j759j755L21L24k541k537r7r3r7r3k20k16
-3853g8335k20k16J330J334J330J334J032J036J032J035j00r7j01r6L446L450j323j319r65
-3834f6413r61l826l823J807J811J807J811O74O78L536L540J114J114j748j747j748j747j748
-3816f5869j747j077j077j076j077N33N33K440m21k709K061Q08k053j397j397j576L193N980
-3798f5928L118J867r95J271J270J092J092K64K68K69K68l87l88l87l88j762j759J103J103
-3779e9009j342j341j341j341k329k325k325k325j013j014j013j014j97j94j94j93L681L681
$$ plain form
-3914 -57817 -61014 -60991 -60969 -61282 -61595 -62266 -62936 -60090 -62966 -65485 -68003 -68063 -68123 -68182 -68242 -68182 -68123 -68063 -68003 -70962 -73920 -72109 -70299
-3891 -70299 -69084 -67869 -66655 -65440 -65671 -65898 -68991 -72080 -71714 -71346 -70980 -70612 -68808 -67001 -68059 -69114 -71185 -73253
-3873 -73253 -73775 -68570 -65738 -62903 -64483 -66059 -67817 -69572 -71331 -73086 -72765 -72441 -74982 -77519 -77616 -77709 -77806 -77899 -78119 -78335
-3853 -78335 -78555 -78771 -77441 -76107 -74777 -73443 -72411 -71375 -70343 -69308 -69408 -69505 -69606 -69702 -66256 -62806 -64129 -65448 -66413
-3834 -66413 -67374 -71200 -75023 -73216 -71405 -69598 -67787 -67113 -66435 -62899 -59359 -58245 -57131 -58879 -60626 -62374 -64121 -65869
-3816 -65869 -67616 -68693 -69770 -70846 -71923 -71390 -70857 -68417 -68838 -71547 -69486 -68678 -70731 -72128 -73525 -75101 -71908 -65928
-3798 -65928 -62810 -60943 -61938 -60667 -59397 -58305 -57213 -56949 -56681 -56412 -56144 -56531 -56919 -57306 -57694 -59456 -61215 -60112 -59009
-3779 -59009 -60351 -61692 -63033 -64374 -66703 -69028 -71353 -73678 -74691 -75705 -76718 -77732 -77929 -78123 -78317 -78510 -74829 -71148
-3761g1148Q20Q19n33n29n32n29l54l51l54l50Q31Q35Q30Q35Q31Q35Q30Q35o30o26o29o26
-3739f8890J457J460j226L547J107J110J405J408J137J140j725j722k656k653m087m084K172
-3722g1100K176o85o86R65R69K396K399J770J773L43L43J263J267j68j64n85n81k012k012
-3703f2329j181j177P0P5j360m218k429K340R16R21J214J219o34o29M135M140K131K135p30
-3684e5391p27j982j979j982j978Q05Q08k057k052J162J166j699j695k049k046j751j747q28
-3666g6022L946J259J264q57q54N74N78L167L170L06k552k765K008k108m967K273K276p67
-3648g0071p64K258K261Q28Q30q71q69l733l730k645k642k645k642J57J60J57J60L547L551
-3629g6703L547L550L369L372N06N11j744j740j446j442k101K671j4j2J297J300l174l171
$$ plain form
-3761 -71148 -70328 -69509 -70042 -70571 -71103 -71632 -71986 -72337 -72691 -73041 -72210 -71375 -70545 -69710 -68879 -68044 -67214 -66379 -67009 -67635 -68264 -68890
-3739 -68890 -67433 -65973 -67199 -63652 -62545 -61435 -60030 -58622 -57485 -56345 -58070 -59792 -62448 -65101 -69188 -73272 -71100
-3722 -71100 -68924 -69609 -70295 -69330 -68361 -65965 -63566 -61796 -60023 -59680 -59337 -58074 -56807 -56975 -57139 -57724 -58305 -60317 -62329
-3703 -62329 -63510 -64687 -64617 -64542 -65902 -70120 -72549 -70209 -69293 -68372 -67158 -65939 -66573 -67202 -63067 -58927 -56796 -54661 -55391
-3684 -55391 -56118 -58100 -60079 -62061 -64039 -63234 -62426 -64483 -66535 -65373 -64207 -65906 -67601 -69650 -71696 -73447 -75194 -76022
-3666 -76022 -72076 -70817 -69553 -70410 -71264 -70690 -70112 -66945 -63775 -63469 -66021 -68786 -66778 -68886 -73853 -71580 -69304 -70071
-3648 -70071 -70835 -68577 -66316 -65488 -64658 -65529 -66398 -70131 -73861 -76506 -79148 -81793 -84435 -84278 -84118 -83961 -83801 -80254 -76703
-3629 -76703 -73156 -69606 -66237 -62865 -62359 -61848 -63592 -65332 -66778 -68220 -70321 -67650 -67664 -67676 -66379 -65079 -68253 -71424
-3611g1424k995J777J952J956k98k94k98k95l159l156J610J613r61r58r61r58K974K977J11
-3592g0787J16K600K605K601K604j42j38j41j38l80l76K302K307q2k940m017P57J334J337
-3573f0578j229j226Q2Q6k780J993K31k630p23p23k541k541k362k362J095L957L778r91j975
-3554g1439Q87K31L093N51N51m038m039m367m367m009P60L100N962N901J133K742K743m18
-3536f5023m17k228k228p98p97k526k526K243K243K392K392R61R61L8L7k824k825l494l495
-3517g7914J274J274J12J12J542J543K884K883K884K884K675K675K676K675o357o352j587
-3500f4117j584k243k239k243k239J736J740J736J740j662j658j661j658l369l364J401J405
-3483g8279J371J375K801K806Q05Q08j878K895J610J613J908J911n25n25p05p04o44l506m401
$$ plain form
-3611 -71424 -74419 -72642 -70690 -68734 -69032 -69326 -69624 -69919 -73078 -76234 -74624 -73011 -73972 -74930 -75891 -76849 -73875 -70898 -70787
-3592 -70787 -70671 -68071 -65466 -62865 -60261 -60403 -60541 -60682 -60820 -61200 -61576 -59274 -56967 -57049 -59989 -64006 -63249 -61915 -60578
-3573 -60578 -61807 -63033 -62951 -62865 -65645 -63652 -63421 -66051 -66774 -67497 -70038 -72579 -74941 -77303 -76208 -72251 -68473 -69464 -71439
-3554 -71439 -70552 -70321 -67228 -66677 -66126 -70164 -74203 -78570 -82937 -86946 -86186 -83086 -77124 -71223 -70090 -67348 -64605 -65023
-3536 -65023 -65440 -67668 -69896 -70694 -71491 -74017 -76543 -74300 -72057 -69665 -67273 -66312 -65351 -65313 -65276 -68100 -70925 -74419 -77914
-3517 -77914 -76640 -75366 -75254 -75142 -73600 -72057 -69173 -66290 -63406 -60522 -57847 -55172 -52496 -49821 -56178 -62530 -64117
-3500 -64117 -65701 -67944 -70183 -72426 -74665 -72929 -71189 -69453 -67713 -69375 -71033 -72694 -74352 -77721 -81085 -79684 -78279
-3483 -78279 -76908 -75533 -72732 -69926 -69121 -68313 -70191 -67296 -65686 -64073 -62165 -60254 -60779 -61304 -62009 -62713 -63357 -66863 -71264
-3464g1264L69j285J576M735J875r28r28j106j107j569j568j569j568J501J502j062j062j23
-3446g3581M646L514j256j643L126l4l3l50l212m285M84q27q27n29n29L65L65L65L66J86J86
-3425g3503J86J87j923j922R39R38J536J535j327j326L50L50L50L51J781J781j081j080K790
-3406f9088K795K790K795r06r01r06r01k135k131K038q20L09m456l566p00Q31Q34j851j848
-3387g7817j137j132q39q34j666L108L282L286J286J289J285J289Q46Q46n85n85J740J740
-3369f4598j121j122J718J717K87K87k425k426M36M36J255J256j606j606k649k649K13K12
-3351g2385r50r50M80M81N10N11N10N11L197L196j572m434l301J468M151o19J930J930J632
-3332f3704J632M911M911J41J42P97P97k064k064j766j766J095J096l629l629l629l629l510
$$ plain form
-3464 -71264 -70895 -72180 -70604 -65869 -63994 -64922 -65850 -66956 -68063 -69632 -71200 -72769 -74337 -72836 -71334 -72396 -73458 -73581
-3446 -73581 -68935 -65421 -66677 -68320 -65194 -65228 -65261 -65611 -68823 -73108 -72624 -73451 -74278 -74807 -75336 -74971 -74606 -74241 -73875 -73689 -73503
-3425 -73503 -73317 -73130 -75053 -76975 -76036 -75098 -73562 -72027 -73354 -74680 -74330 -73980 -73630 -73279 -71498 -69717 -70798 -71878 -69088
-3406 -69088 -66293 -63503 -60708 -61614 -62515 -63421 -64322 -66457 -68588 -66550 -67370 -67061 -71517 -75083 -75783 -74952 -74118 -75969 -77817
-3387 -77817 -78954 -80086 -80925 -81759 -83425 -80317 -77035 -73749 -72463 -71174 -69889 -68600 -67754 -66908 -67493 -68078 -66338 -64598
-3369 -64598 -65719 -66841 -65123 -63406 -63119 -62832 -65257 -67683 -67247 -66811 -65556 -64300 -65906 -67512 -70161 -72810 -72597 -72385
-3351 -72385 -73335 -74285 -73805 -73324 -72814 -72303 -71793 -71282 -68085 -64889 -66461 -70895 -74196 -72728 -68577 -69196 -67266 -65336 -63704
-3332 -63704 -62072 -57161 -52250 -52109 -51967 -51170 -50373 -52437 -54501 -56267 -58033 -56938 -55842 -59471 -63100 -66729 -70358 -73868
-3314g3868l510o48o48J866J871J866J871P93P98L655L659j413j408j412j408J628J632j234
-3296f5910j229o67o63J896J900M699o7m065m061m74m69K388K392O90O93K120K123N854N853
-3277d6997J0205J0205O062o14l834o696m594m594l819r57P11m057n131J547O89k172l007
-3260e7053l007k64k65k64k65k128k127k127k128L17L16L17L17m29m24K254K258M06k452o390
-3240g3138j617j144j140K016K019K255K257o07o03J166J170j696j691M087M091M087M091
-3223e4397N369N373l215l212n540n537k679k675L54L58k508k504l61l58l61l58N6O0N5O0
-3203g2020L037L040L037L040K98K98K98K98l279l278m18m17m5m4k907k906K042K042q20q20
-3183f9524j117j114j118j114J147J152J147J152j282j278J580J583o26o22o26o22r7r7r7
$$ plain form
-3314 -73868 -77378 -78026 -78674 -76808 -74937 -73071 -71200 -70407 -69609 -65954 -62295 -63708 -65116 -66528 -67936 -66308 -64676 -65910
-3296 -65910 -67139 -67806 -68469 -66573 -64673 -59974 -60041 -64106 -68167 -68641 -69110 -66722 -64330 -63640 -62947 -60827 -58704 -52850 -46997
-3277 -46997 -36792 -26587 -20525 -21139 -24973 -31669 -36263 -40857 -44676 -45633 -44922 -48979 -54110 -52563 -51874 -54046 -57053
-3260 -57053 -60060 -60324 -60589 -60853 -61118 -63246 -65373 -67500 -69628 -69311 -68995 -68678 -68361 -68790 -69214 -66960 -64702 -64296 -66748 -73138
-3240 -73138 -74755 -75899 -77039 -75023 -73004 -70749 -68492 -69099 -69702 -68536 -67366 -69062 -70753 -66666 -62575 -58488 -54397
-3223 -54397 -49028 -43655 -46870 -50082 -55622 -61159 -63838 -66513 -66159 -65801 -68309 -70813 -71174 -71532 -71893 -72251 -72195 -72135 -72080 -72020
-3203 -72020 -68983 -65943 -62906 -59866 -59568 -59270 -58972 -58674 -61953 -65231 -65649 -66066 -66111 -66155 -69062 -71968 -69926 -67884 -68704 -69524
-3183 -69524 -70641 -71755 -72873 -73987 -72840 -71688 -70541 -69389 -70671 -71949 -70369 -68786 -69412 -70034 -70660 -71282 -71379 -71476 -71573
-3164g1573r7K050K049q13q12j170j170J692J692J214J215J214J215N40N44N41N44k262k258
-3145f5645n123n119N47N52N47N52L69L72L69L73r58r54r57r54J248J252J248J252n25n22
-3125g2076K336K340K336K340n25n22k191k190k191k191j04j05j04j04k02k01k01k01L35L35
-3105g3086L36L35j133j132J729J728M829M829N9O0j282j281j282j282K832K832L010k712
-3087f0611l175o036m784j5R99j863k817k817k9l0K831K832O86O85O86O85J103J103J103J103
-3067f8361J401J401j461j460l041l040m948k086K623k147k146k146J673J677M534M538j75
-3050g3164j71j75j72m58m55M013M017L059j707l618l614J98L062J271l495M96M99k664k660
-3031g5738j368j363j368j364J196J200J196J200J911J912J911J911k202k202O60O59L62L61
$$ plain form
-3164 -71573 -71670 -69620 -67571 -68384 -69196 -70366 -71536 -69844 -68152 -66938 -65723 -64509 -63294 -62754 -62210 -61669 -61125 -63387 -65645
-3145 -65645 -70768 -75887 -75340 -74788 -74241 -73689 -73320 -72948 -72579 -72206 -73164 -74118 -75075 -76029 -74781 -73529 -72281 -71029 -71554 -72076
-3125 -72076 -69740 -67400 -65064 -62724 -63249 -63771 -65962 -68152 -70343 -72534 -72638 -72743 -72847 -72951 -73153 -73354 -73555 -73756 -73421 -73086
-3105 -73086 -72750 -72415 -73548 -74680 -72951 -71223 -66394 -61565 -61506 -61446 -62728 -64009 -65291 -66573 -63741 -60909 -57899 -60611
-3087 -60611 -63786 -69822 -74606 -74621 -73622 -75485 -78302 -81119 -81148 -81178 -78347 -75515 -74829 -74144 -73458 -72773 -71670 -70567 -69464 -68361
-3067 -68361 -66960 -65559 -67020 -68480 -71521 -74561 -79509 -81595 -78972 -81119 -83265 -85411 -83738 -82061 -77527 -72989 -73164
-3050 -73164 -73335 -73510 -73682 -74140 -74595 -70582 -66565 -63506 -65213 -68831 -72445 -72247 -69185 -67914 -71409 -70913 -70414 -73078 -75738
-3031 -75738 -77106 -78469 -79837 -81201 -80005 -78805 -77609 -76409 -74498 -72586 -70675 -68764 -70966 -73168 -72508 -71849 -71487 -71126
-3013g1126L62L61j665j666J196J196j799j800j800j799K075K075K076K075k94k95k94k94
-2995g1416R57R58j904j904J028J029J028J028n21n22n22n21r99r98J863J863l43l43K519
-2976f7720K518j363j360J498J501j244j241j244j241M62M66M62M65o11o07o11o07K16K19
-2957g0042K17K19j930j926J110J114j058J807P884o96m03l98r39r36J57J56k705k705K005
-2938f9069K004K005K005O63O63O63O63l569l569p08p08J721J725J423J427J364l402k332
-2920f7031N33n74n70l95l91J930J934r32r28j274j270j275j270K124K127p38p34j006j002
-2901g0742l867l864M84M88M85M88j308j304M81N253N369O04P19P23j398j393j397j394J047
-2882g0526J051J047J050K061K064K060K065l126l123k64k61k053k049k053k049J702J707
$$ plain form
-3013 -71126 -70764 -70403 -72068 -73734 -72538 -71342 -73141 -74941 -76741 -78540 -76465 -74390 -72314 -70239 -70533 -70828 -71122 -71416
-2995 -71416 -70459 -69501 -71405 -73309 -72281 -71252 -70224 -69196 -69717 -70239 -70761 -71282 -72281 -73279 -71416 -69553 -69896 -70239 -67720
-2976 -67720 -65202 -66565 -67925 -66427 -64926 -66170 -67411 -68655 -69896 -69434 -68968 -68506 -68041 -68652 -69259 -69870 -70477 -70261 -70042
-2957 -70042 -69825 -69606 -71536 -73462 -72352 -71238 -72296 -70489 -62605 -63301 -63704 -64102 -65041 -65977 -65820 -65664 -68369 -71074 -69069
-2938 -69069 -67065 -65060 -63055 -62392 -61729 -61066 -60403 -63972 -67541 -68249 -68957 -67236 -65511 -64088 -62661 -61297 -64699 -67031
-2920 -67031 -66498 -67072 -67642 -68037 -68428 -66498 -64564 -65496 -66424 -67698 -68968 -70243 -71513 -69389 -67262 -68000 -68734 -69740 -70742
-2901 -70742 -74609 -78473 -77989 -77501 -77016 -76528 -77836 -79140 -78659 -73406 -68037 -67433 -66714 -65991 -67389 -68782 -70179 -71573 -70526
-2882 -70526 -69475 -68428 -67378 -65317 -63253 -61193 -59128 -62254 -65377 -65641 -65902 -67955 -70004 -72057 -74106 -72404 -70697
-2865g0697J702J707j848j848j848j848Q94Q94L756L756m48m47l308l309J49J49J49J49q12
-2846g3108q12q12q13k75k76k76k76K109K109p52p53j051j050J810J811l338l339J20N842
-2827g3130K623K623J19J19k027k027K743K742j312j311j312j311q31q31q31q31Q39Q38Q38
-2808g2270Q39R27R28R28R28k65k64k65k64r21r20r20r21N70N71N70N70J613J613J971l752
-2787f8734k798k798J613J614K60K61K61K61m55m54r7r7k929K795K437K436pqppj841j837
-2765g0131j841j836j781j778J081J084K76K79K76K79J170J174J170J174M02M06M03M06J117
-2746f6670J122J118J121j937j934j938j933j938j933j938j934O04O04O03O04q27q28P23O446
-2727g0865L338L339j073j073J729J728J729J729P75P75k087k086J669J669l100l100J87J86
$$ plain form
-2865 -70697 -68995 -67288 -69136 -70984 -72832 -74680 -73786 -72892 -69136 -65380 -65828 -66275 -69583 -72892 -72743 -72594 -72445 -72296 -73108
-2846 -73108 -73920 -74732 -75545 -75820 -76096 -76372 -76648 -74539 -72430 -73182 -73935 -74986 -76036 -74226 -72415 -75753 -79092 -78972 -73130
-2827 -73130 -70507 -67884 -67765 -67646 -69673 -71700 -68957 -66215 -67527 -68838 -70150 -71461 -72292 -73123 -73954 -74785 -73946 -73108 -72270
-2808 -72270 -71431 -70504 -69576 -68648 -67720 -67985 -68249 -68514 -68778 -69699 -70619 -71539 -72460 -71890 -71319 -70749 -70179 -68566 -66953 -64982 -68734
-2787 -68734 -71532 -74330 -72717 -71103 -70843 -70582 -70321 -70060 -70515 -70969 -71066 -71163 -74092 -71297 -68860 -66424 -66431 -66439 -66446 -66453 -68294 -70131
-2765 -70131 -71972 -73808 -75589 -77367 -76286 -75202 -74926 -74647 -74371 -74092 -72922 -71748 -70578 -69404 -69002 -68596 -68193 -67787 -66670
-2746 -66670 -65548 -64430 -63309 -65246 -67180 -69118 -71051 -72989 -74922 -76860 -78794 -78190 -77586 -76983 -76379 -77206 -78034 -77311 -70865
-2727 -70865 -67527 -64188 -65261 -66334 -64605 -62877 -61148 -59419 -58644 -57869 -59956 -62042 -60373 -58704 -61804 -64904 -64717 -64531
-2709f4531k675k675o49o48o48o49j56j56j57j56j57j56j57j56K153K154K153K154J051J050
-2689f3011j811j810L83L84j047j047n10n11R21R20r58r57r58r57Q01Q01Q01Q01R91R95R91
-2668f4788R95K75K80K76K79k049k046k049k045n89n85k139K634K232k533k120k117k388K385
-2649g6092K559K564K05K08K05K09p19p16p19p15n29n25j781K991K124K128m40m36J446J449
-2629f6584j416j412l025l022J744J747l87l84l88l83k98k95p75K091L211j553l466l461k302
-2610h0358k299N59N62j308j307L461L461J852J852M21M21j010j010M21M21P79P79K209K210
-2591f7884J144J143k86k87q83q83q83q83l179l178l17l16L677L678j092j092K825K824J751
-2572f4121j110j319J542j677j676J133J132j729j728n67n66k355N07L133K72R88j874k769
$$ plain form
-2709 -64531 -67206 -69881 -70530 -71178 -71826 -72475 -72631 -72787 -72944 -73100 -73257 -73413 -73570 -73726 -71573 -69419 -67266 -65112 -64061 -63011
-2689 -63011 -64822 -66632 -66249 -65865 -66912 -67959 -68469 -68980 -68059 -67139 -68097 -69054 -70012 -70969 -70168 -69367 -68566 -67765 -66774 -65779 -64788
-2668 -64788 -63793 -63518 -63238 -62962 -62683 -64732 -66778 -68827 -70872 -71461 -72046 -74185 -71551 -69319 -71852 -73972 -76089 -78477 -76092
-2649 -76092 -73533 -70969 -70764 -70556 -70351 -70142 -70861 -71577 -72296 -73011 -73540 -74065 -75846 -72855 -70731 -68603 -69043 -69479 -68033 -66584
-2629 -66584 -68000 -69412 -72437 -75459 -73715 -71968 -72355 -72739 -73127 -73510 -73808 -74103 -74878 -72787 -69576 -71129 -74595 -78056 -80358
-2610 -80358 -82657 -82098 -81536 -82844 -84151 -80690 -77229 -75377 -73525 -73104 -72683 -73693 -74703 -74282 -73861 -73082 -72303 -70094 -67884
-2591 -67884 -66740 -65597 -65883 -66170 -67053 -67936 -68819 -69702 -72881 -76059 -76376 -76692 -73015 -69337 -70429 -71521 -68696 -65872 -64121
-2572 -64121 -65231 -66550 -65008 -66685 -68361 -67228 -66096 -67825 -69553 -70120 -70686 -73041 -72534 -69401 -69129 -68141 -70015 -72784
-2554g2784R3J167J166r65r65p86p87k038Q24L864J002Q34L696Q35k027p15K146L040j729
-2535f4129j274j274j751j751M84k377n89n89n96K266p75p75O55O56N127K265k593k593j341
-2516g0954j342J312J311j550j550j546j546j367j368j15K746N428K567K702j61j591j591
-2499f8615N26N25r05r06K508K507l871j009L91L91k291k292O45O44r65J897K433K433K612
-2480f3342k158l789r28J46L006O82k179l134k72l61M408M765J904j286m147j106j107k977
-2462g1875j15j725j725O89O89n62l424R3R3q6q6J107J107q61K001L353k370J029J032n22
-2442g2158n21n22n18J64J64J64J68m5m5j475j472p42p41K120K124J941J941L014L018M237
-2422e9184j487l037l032j368j367O3O7R95R95l774l775j449j450j8j9J643J643J644J643
$$ plain form
-2554 -72784 -72691 -71524 -70358 -71323 -72288 -73074 -73861 -75899 -75075 -71211 -70209 -69375 -65679 -64844 -66871 -67586 -65440 -62400 -64129
-2535 -64129 -65403 -66677 -68428 -70179 -69695 -72072 -72661 -73250 -73846 -71580 -72355 -73130 -72475 -71819 -66692 -64427 -67020 -69613 -70954
-2516 -70954 -72296 -70984 -69673 -71223 -72773 -74319 -75865 -77232 -78600 -78715 -75969 -70541 -67974 -65272 -65433 -67024 -68615
-2499 -68615 -68089 -67564 -68469 -69375 -66867 -64360 -68231 -69240 -68849 -68458 -70749 -73041 -72396 -71752 -72717 -70820 -68387 -65954 -63342
-2480 -63342 -65500 -69289 -70217 -70071 -67065 -66383 -68562 -71696 -71968 -72329 -67921 -63156 -61252 -62538 -66685 -67791 -68898 -71875
-2462 -71875 -71990 -73715 -75440 -74751 -74062 -74624 -78048 -77955 -77862 -77948 -78034 -76927 -75820 -76681 -74680 -71327 -73697 -72668 -71636 -72158
-2442 -72158 -72679 -73201 -73719 -73555 -73391 -73227 -73059 -73104 -73149 -74624 -76096 -76838 -77579 -75459 -73335 -71394 -69453 -66439 -63421 -59184
-2422 -59184 -60671 -63708 -66740 -68108 -69475 -69412 -69345 -68350 -67355 -71129 -74904 -76353 -77803 -77821 -77840 -76197 -74554 -72910 -71267
-2403g1267K090K090K090K091j439j438j438j438k035k034Q27Q27J372J371j491j490J967
-2386f9345J967J968J967j550j546j546j547N96O00O00O00j79j75j75j75R54R57R58R57m553
-2366f8667m549K128K127J826J829j032j032j543j538J322J323K630K635k28k27l454l450
-2349f9900J315J319L462L465j308j304l409l406n48n43O009O014o67o63k008k005Q53Q57
-2331f2467J420J423l350l345R57R61K746k973j904j900q31q27J848J852j014j009k743k738
-2313g3894j312j307J013J017J014J017O56O59k206k202j013j010M17M22J341J345K772K776
-2295f8495p45p42O86O89L87L92k474k471J692J692J691J692J930J930r32r31q72q72q72q72
-2275f7497j557j558J006J006K575k195r42r43j449j450j449j449k13k12k12k13l3l4l32l31
$$ plain form
-2403 -71267 -69177 -67087 -64997 -62906 -64345 -65783 -67221 -68659 -70694 -72728 -71901 -71074 -69702 -68331 -69822 -71312 -69345
-2386 -69345 -67378 -65410 -63443 -64993 -66539 -68085 -69632 -69036 -68436 -67836 -67236 -67415 -67590 -67765 -67940 -66986 -66029 -65071 -64114 -68667
-2366 -68667 -73216 -71088 -68961 -67135 -65306 -66338 -67370 -68913 -70451 -69129 -67806 -65176 -62541 -62769 -62996 -66450 -69900
-2349 -69900 -68585 -67266 -63804 -60339 -61647 -62951 -66360 -69766 -70314 -70857 -64848 -58834 -59501 -60164 -62172 -64177 -63324 -62467
-2331 -62467 -61047 -59624 -62974 -66319 -65362 -64401 -61655 -64628 -66532 -68432 -69263 -70090 -68242 -66390 -67404 -68413 -71156 -73894
-2313 -73894 -75206 -76513 -75500 -74483 -73469 -72452 -71796 -71137 -73343 -75545 -76558 -77568 -77151 -76729 -75388 -74043 -71271 -68495
-2295 -68495 -69240 -69982 -69296 -68607 -68220 -67828 -70302 -72773 -71081 -69389 -67698 -66006 -64076 -62146 -63078 -64009 -64881 -65753 -66625 -67497
-2275 -67497 -69054 -70612 -69606 -68600 -66025 -68220 -69162 -70105 -71554 -73004 -74453 -75902 -76115 -76327 -76539 -76752 -76785 -76819 -77151 -77482
-2255g7482O71m095k310M370K608K612J595J598l0k6k9k7K743K746k027k023r21r16r20L852
-2235f8011K657k02j158j155k649k646K13K16J434J438J435J438J203J208k28k23l119l115
-2217g1264J651J654r05r02J956J960J032J036l99l95l129l126J639J643O56O59k205k202
-2199g0641K675K679j87j82m55m51R77R80N99O04k262k257L014L018J52J57m06m03l267l264
-2179f8920m96m91l357l354j158j159K72K72K567K567k94k95M59M58M58M58r42r43M88M88
-2159g2922K895K895l781l782j129j129j129j129J002J003J002J002K87K87K87K87J710J714
-2141g0630J710J714k910k906k910k906P19P23p12p08K239K243o22o18K902K902M1M1Q16Q16
-2121f8056Q16Q16R13R13l856l857J68J68J598J599j27j27L093k631n14n14q72q72N2N2L272
$$ plain form
-2255 -77482 -76811 -80906 -83216 -78846 -76238 -73626 -72031 -70433 -70463 -70489 -70518 -70545 -67802 -65056 -67083 -69106 -70027 -70943 -71863 -68011
-2235 -68011 -65354 -65556 -66714 -67869 -70518 -73164 -72951 -72735 -71301 -69863 -68428 -66990 -65787 -64579 -64807 -65030 -68149 -71264
-2217 -71264 -69613 -67959 -68864 -69766 -67810 -65850 -64818 -63782 -64181 -64576 -67705 -70831 -69192 -67549 -66893 -66234 -68439 -70641
-2199 -70641 -67966 -65287 -65474 -65656 -66111 -66562 -65585 -64605 -64006 -63402 -65664 -67921 -64907 -61889 -61737 -61580 -61986 -62389 -65656 -68920
-2179 -68920 -69416 -69907 -73264 -76618 -77776 -78935 -78663 -78391 -75824 -73257 -73551 -73846 -73387 -72929 -72471 -72013 -72955 -73898 -73410 -72922
-2159 -72922 -70027 -67132 -70913 -74695 -75824 -76953 -78082 -79211 -78209 -77206 -76204 -75202 -74915 -74628 -74341 -74054 -72344 -70630
-2141 -70630 -68920 -67206 -70116 -73022 -75932 -78838 -78119 -77396 -78108 -78816 -76577 -74334 -74956 -75574 -72672 -69770 -69729 -69688 -68872 -68056
-2121 -68056 -67240 -66424 -65511 -64598 -68454 -72311 -72143 -71975 -70377 -68778 -68905 -69032 -65939 -68570 -69084 -69598 -70470 -71342 -71290 -71238 -67966
-2100f7966k452K31K31j27j26q35q34K026K027k027k026k385L338N97N96R54R53K921K922
-2081f1982l756l756q31q31J673J673L193k530k172k172J435J434MLJ226J226j636j635p08
-2062g0142p04K153K158l51l46l50l47Q42Q46Q42Q46p98p93k228k225j505j501J356J360J326
-2042f9561J330J327J330j505j502j505j502O41O45O41O44K46K50K46K49P83P86K690j68l249
-2022f7184J524j341j338o85o82o86o82J35J37J35J37P60P64P60P64J871J874M39M44k035
-2002f4889k030Q27Q31n26n25n25n26j061j062j062j062K306K307K306K306L09L10j122j121
-1983f4009N06N07k355k354k325k325k325k325K742K742j19k981k444K325L935J073m85m80
-1965g0697o63o60J215J218k16k12k780k776Q2Q6P08P11k153k150J748J751J747J751m512
$$ plain form
-2100 -67966 -70418 -70187 -69956 -70083 -70209 -71044 -71878 -69852 -67825 -69852 -71878 -74263 -70925 -70328 -69732 -68778 -67825 -64904 -61982
-2081 -61982 -65738 -69494 -70325 -71156 -69483 -67810 -64617 -67147 -69319 -71491 -70056 -68622 -68618 -68615 -67389 -66163 -67799 -69434 -70142
-2062 -70142 -70846 -68693 -66535 -66886 -67232 -67582 -67929 -67087 -66241 -65399 -64553 -65351 -66144 -68372 -70597 -72102 -73603 -72247 -70887 -69561
-2042 -69561 -68231 -66904 -65574 -67079 -68581 -70086 -71588 -70947 -70302 -69661 -69017 -68771 -68521 -68275 -68026 -67243 -66457 -63767 -63935 -67184
-2022 -67184 -65660 -67001 -68339 -69024 -69706 -70392 -71074 -70939 -70802 -70667 -70530 -69770 -69006 -68246 -67482 -65611 -63737 -63298 -62854 -64889
-2002 -64889 -66919 -66092 -65261 -65787 -66312 -66837 -67363 -68424 -69486 -70548 -71610 -69304 -66997 -64691 -62385 -62076 -61766 -62888 -64009
-1983 -64009 -63503 -62996 -65351 -67705 -70030 -72355 -74680 -77005 -74263 -71521 -71640 -74621 -77065 -74740 -70805 -69732 -70217 -70697
-1965 -70697 -71360 -72020 -70805 -69587 -69803 -70015 -72795 -75571 -75489 -75403 -74695 -73984 -76137 -78287 -76539 -74788 -73041 -71290 -75802
-1946g5802m508K57K61L260L264j509j505J263J267j68j64K27K27L089L089l99l98l99l99
-1927f9047n70n70n70n70k120k120k120k120R50R50R50R50L54L54L54L54O97O97O96O97J01
-1906g1703J00J01J01J52J57J56J57P49P52P53P53J464J468J468J468q01p98p97p97p45p46
-1885f6588p45p45N66N67N66N66j058j058j058j058K53K53K54K53j244j245j244j241o48o48
-1865g5302o49o44L20L21L20L24J572J573J572J576J073J073l696l696Q35Q34L696L696n73
-1846f5775n74n74n74j229j230J632J632K291K292k478k478j047j046J814J815j115j114J748
-1828f6010J747m1m1m1m1j140j140j140j140j915j915R46R46l7l7l7l8L182L182j587j587
-1807f7884m03l98m03l98j059j054j058j055K24K27K24K27o11o07o11o08N22N25N22N25J655
$$ plain form
-1946 -75802 -80310 -80053 -79792 -76532 -73268 -74777 -76282 -75019 -73752 -73920 -74084 -73857 -73630 -70541 -67452 -67851 -68249 -68648 -69047
-1927 -69047 -69617 -70187 -70757 -71327 -73447 -75567 -77687 -79807 -78857 -77907 -76957 -76007 -75653 -75299 -74945 -74591 -73894 -73197 -72501 -71804 -71703
-1906 -71703 -71603 -71502 -71401 -71249 -71092 -70936 -70779 -70030 -69278 -68525 -67772 -66308 -64840 -63372 -61904 -62705 -63503 -64300 -65097 -65842 -66588
-1885 -66588 -67333 -68078 -67512 -66945 -66379 -65813 -66871 -67929 -68987 -70045 -69792 -69539 -69285 -69032 -70276 -71521 -72765 -74006 -74654 -75302
-1865 -75302 -75951 -76595 -76275 -75954 -75634 -75310 -73738 -72165 -70593 -69017 -67944 -66871 -70567 -74263 -73428 -72594 -68898 -65202 -65775
-1846 -65775 -66349 -66923 -67497 -68726 -69956 -68324 -66692 -64401 -62109 -64587 -67065 -68112 -69158 -67344 -65529 -66644 -67758 -66010
-1828 -66010 -64263 -64304 -64345 -64386 -64427 -65567 -66707 -67847 -68987 -70902 -72817 -71871 -70925 -70962 -70999 -71036 -71074 -67892 -64710 -66297 -67884
-1807 -67884 -68287 -68685 -69088 -69486 -70545 -71599 -72657 -73712 -73488 -73261 -73037 -72810 -73421 -74028 -74639 -75247 -74725 -74200 -73678 -73153 -71498
-1786g1498J658J654J658K027K030q34q31k444k441k444k440j42j38J766j091j096L678L673
-1768f7255L678l95l91K466K471k363k358k362k359K325K329n37n33j907j904j908j904N07
-1750g2400N10N07N11j044j039j043j040j177j178j177j177p61p60p60p60L331L331M70M69
-1731g5187J423J424j439j438J174J174J173J174K425K426m36m36J487J486j375j374N6N5
-1713f6208N6N6j185j184j185j185j543j542J319J319k206k206O56O56J609J610j252j252
-1695g3667k16k16K645K646r32r31o34o33k019K749O7O7QPQPr98r99j177j178j714m575J5
-1672h1670K876L644P83K571K570J767J766L35L35J684J684O11k250k221O41L622P60m710
-1654f5202O0L577P15k474k474K117K116k955k954j524j524k627k627K143K142K895K895L4
$$ plain form
-1786 -71498 -69840 -68186 -66528 -64501 -62471 -63305 -64136 -66580 -69021 -71465 -73905 -74047 -74185 -72419 -73510 -74606 -70928 -67255
-1768 -67255 -63577 -63972 -64363 -61897 -59426 -61789 -64147 -66509 -68868 -66543 -64214 -64751 -65284 -67191 -69095 -71003 -72907 -72400
-1750 -72400 -71890 -71383 -70872 -71916 -72955 -73998 -75038 -76215 -77393 -78570 -79747 -80508 -81268 -82028 -82788 -79457 -76126 -75656 -75187
-1731 -75187 -73764 -72340 -73779 -75217 -74043 -72869 -71696 -70522 -68097 -65671 -66107 -66543 -65056 -63570 -64945 -66319 -66263 -66208
-1713 -66208 -66152 -66096 -67281 -68465 -69650 -70835 -72378 -73920 -72601 -71282 -73488 -75694 -75038 -74382 -72773 -71163 -72415 -73667
-1695 -73667 -73883 -74099 -71454 -68808 -69740 -70671 -71305 -71938 -73957 -71208 -71141 -71074 -71066 -71059 -71051 -71044 -72042 -73041 -74218 -75396 -77110 -81685 -81670
-1672 -81670 -78794 -75150 -74367 -71796 -69226 -67459 -65693 -65358 -65023 -63339 -61655 -61044 -63294 -65515 -64874 -61252 -60492 -65202
-1654 -65202 -65142 -61565 -60850 -63324 -65798 -63681 -61565 -64520 -67474 -68998 -70522 -73149 -75776 -73633 -71491 -68596 -65701 -65667
-1636f5667L3Q68Q68Q69Q68j148j147k758J05Q49Q50j655j654j49K713l28l28J490J491j550
-1616f5380j550O89k169n62n59l24l21l24l20P19P23P19P23q31q27n33n29j293L480M95N00
-1595f7474O74m091j233j230l960j096L968L972J822J826j159m017k16K649K467l91K2K6j766
-1576f9207J099P68P71j27k984j528J338K228K232l95l253k899k895K318N183P07P12k213
-1558f8145k209k214k209k76k72k76k72J118J122O41L506M903J38j476J390j401j397J639
-1540f5690J643k861k858l040j75k91k87K571K575J080j777m464L10K049q09j766j762M69
-1522g5083M74J900J904J628J632J986q72l469o04O45k213J97K02J8K3j711j706k80k75J214
-1502g4390J219j647j643M69M73L153L155Q27k030k46k42k005Q61O78O82N29N29p23l584j051
$$ plain form
-1636 -65667 -65634 -64766 -63898 -63029 -62161 -63309 -64456 -67214 -67109 -66260 -65410 -67065 -68719 -68868 -66155 -66483 -66811 -65321 -63830 -65380
-1616 -65380 -66930 -66241 -68410 -68972 -69531 -69855 -70176 -70500 -70820 -70101 -69378 -68659 -67936 -68767 -69594 -70127 -70656 -71949 -68469 -67974 -67474
-1595 -67474 -66800 -70891 -72124 -73354 -77314 -78410 -74442 -70470 -68648 -66822 -67981 -71998 -72214 -69565 -67098 -67489 -67467 -67441 -69207
-1576 -69207 -68108 -67340 -66569 -66696 -69680 -71208 -69870 -67642 -65410 -65805 -69058 -71957 -74852 -72534 -67351 -66644 -65932 -68145
-1558 -68145 -70354 -72568 -74777 -75053 -75325 -75601 -75873 -74755 -73633 -72992 -69486 -64583 -64445 -65921 -64531 -65932 -67329 -65690
-1540 -65690 -64047 -66908 -69766 -72806 -72981 -73272 -73559 -70988 -68413 -67333 -69110 -73574 -73264 -71215 -72024 -73790 -75552 -75083
-1522 -75083 -74609 -72709 -70805 -69177 -67545 -65559 -66431 -69900 -70504 -69859 -72072 -71875 -71673 -71655 -71632 -73343 -75049 -75329 -75604 -74390
-1502 -74390 -73171 -74818 -76461 -75992 -75519 -72366 -69211 -68384 -70414 -70660 -70902 -72907 -72046 -71368 -70686 -70157 -69628 -70351 -73935 -74986
-1482g4986j050J810J811j408J453j57j56J900J900M70M69J118J118j923j922M843J982P31
-1464f1997P30p01p00J088j774k965j05k83l145l12l13m92m92K489K489l73l72P75P74j907
-1444f7586j908l100k38J013J014K213K213K213K213p67p68Q42k019j207j207j386j387K251
-1426f7601K250K251K250j539j538j897L827O07O07j896j897k187k187k187k187k20k20k20
-1408g3984k19M36M36M35M36J807J807J808J807k992k992j31j30J08J08J08J08M389M389K840
-1388e9426k884P52P53k467k466K586K585k183k183Q57Q57Q57Q56k187k183O74O79K641K646
-1369e9236m036m031k202k198k560L167O3O7M21M25o93o89o93o89L062L067K01K05r32r27
-1349f8208r32r28j527j524J334J337J785J785J784J785N93N92N92N93J285J286j576j576
$$ plain form
-1482 -74986 -76036 -74226 -72415 -73823 -72370 -72527 -72683 -70783 -68883 -68413 -67944 -66826 -65708 -67631 -69553 -64710 -62728 -61997
-1464 -61997 -61267 -61968 -62668 -61580 -63354 -66319 -66424 -66707 -69852 -70164 -70477 -70969 -71461 -68972 -66483 -66856 -67228 -66453 -65679 -67586
-1444 -67586 -69494 -72594 -72832 -71819 -70805 -68592 -66379 -64166 -61953 -62720 -63488 -62646 -64665 -65872 -67079 -68465 -69852 -67601
-1426 -67601 -65351 -63100 -60850 -62389 -63927 -65824 -61997 -61390 -60783 -62679 -64576 -66763 -68950 -71137 -73324 -73544 -73764 -73984
-1408 -73984 -74203 -73767 -73331 -72896 -72460 -70653 -68846 -67038 -65231 -68223 -71215 -71346 -71476 -71368 -71260 -71152 -71044 -66655 -62266 -59426
-1388 -59426 -62310 -61558 -60805 -63272 -65738 -63152 -60567 -62750 -64933 -64076 -63219 -62362 -61506 -63693 -65876 -65202 -64523 -61882 -59236
-1369 -59236 -63272 -67303 -69505 -71703 -74263 -71096 -71033 -70966 -70545 -70120 -70813 -71502 -72195 -72884 -69822 -66755 -66554 -66349 -67281 -68208
-1349 -68208 -69140 -70068 -71595 -73119 -71785 -70448 -68663 -66878 -65094 -63309 -62716 -62124 -61532 -60939 -59654 -58368 -59944 -61520
-1331f1520j159j159j159j158n59n59n59n59m99m99n00m99J386J386l383l383M92M91M92M92
-1311g2415N93N92N92N93N92N93N92N92N48N48N48N47j67j68j68j67j293j289j290j289J215
-1290g0101J215j647j647j233j230J632J632J453J453j408j409l35l32l31l32l91l91K470
-1272g0932k299m516j650L118L119m58m59m58m58M58M62M58M62o14o11L39L204K016k750J08
-1252g1461J12L387L390j382j379r76r72r77r72n59n55n59n55K370K373K370K373m32m29K430
-1232f2403K433j182j177J30k727O67m098o41K220Q39l927j070j065L01L06L06L05J498J501
-1213f7784j661j658M84m281l208l47L316L320O34O37J706J710j97K664P30m039j177j177
-1195g0328J4J5K877K876j766j766j587j587K60L123J512l256l897j036J826J825k109k108
$$ plain form
-1331 -61520 -62679 -63838 -64997 -66155 -66714 -67273 -67832 -68391 -68890 -69389 -69889 -70388 -69002 -67616 -70999 -74382 -73890 -73399 -72907 -72415
-1311 -72415 -71822 -71230 -70638 -70045 -69453 -68860 -68268 -67676 -67128 -66580 -66032 -65485 -65652 -65820 -65988 -66155 -67448 -68737 -70027 -71316 -70101
-1290 -70101 -68886 -70533 -72180 -73413 -74643 -73011 -71379 -69926 -68473 -69881 -71290 -71625 -71957 -72288 -72620 -73011 -73402 -70932
-1272 -70932 -73231 -77747 -79397 -76279 -73160 -73618 -74077 -74535 -74993 -74535 -74073 -73615 -73153 -73767 -74378 -74039 -70835 -68819 -71569 -71461
-1252 -71461 -71349 -67962 -64572 -65954 -67333 -68309 -69281 -70258 -71230 -71789 -72344 -72903 -73458 -71088 -68715 -66345 -63972 -64404 -64833 -62403
-1232 -62403 -59970 -61152 -62329 -62199 -64926 -64259 -68357 -68998 -66778 -65939 -69866 -70936 -72001 -71700 -71394 -71088 -70783 -69285 -67784
-1213 -67784 -69445 -71103 -70619 -74900 -78108 -78455 -75139 -71819 -71185 -70548 -68842 -67132 -67329 -64665 -63935 -67974 -69151 -70328
-1195 -70328 -70314 -70299 -67422 -64546 -66312 -68078 -69665 -71252 -70992 -67869 -66357 -69613 -73510 -74546 -72720 -70895 -73004 -75112
-1177g5112R31R31J133L994N068K98k325k325K38K39K34K35K35K35l02l02l02k98j256j255
-1157f9706j256j255N62N63N62N67j535j535Q49Q50j118j118J267J270N07N07N07N06M47M47
-1137f8112M48M50K754K753K098k672k403k403K545K545l62l61k746k746k448k448Q91Q90
-1119g1327J136J137k202k202m14m13J971J971j159j159l245l245j040L730K656k05m50m48
-1101g4908o25o26J401J400L786L785J621J625j714j714n52n51j982j982N29N33N32N33J785
-1082f7124J785o00o00K76K79K79K80j777j778O08O07j025j021J360J364m58m55m58m55j531
-1062g0444j528j00r7k336k333J957J959O45O48p86l644j680L092K612K616l99l95q75J989
-1043f9099R73l793k486K288M862R7k049Q12K836k3j572j572k411k407k2k3N71N73N74N74
$$ plain form
-1177 -75112 -74181 -73250 -72117 -68123 -63055 -62757 -65082 -67407 -67169 -66930 -66696 -66461 -66226 -65991 -66293 -66595 -66897 -67195 -68451 -69706
-1157 -69706 -70962 -72217 -71655 -71092 -70530 -69963 -71498 -73033 -72184 -71334 -72452 -73570 -72303 -71033 -70526 -70019 -69512 -69006 -68559 -68112
-1137 -68112 -67664 -67214 -64460 -61707 -59609 -62281 -64684 -67087 -64542 -61997 -62359 -62720 -65466 -68212 -70660 -73108 -72217 -71327
-1119 -71327 -70191 -69054 -71256 -73458 -73872 -74285 -72314 -70343 -71502 -72661 -75906 -79151 -80191 -76461 -73805 -74010 -74460 -74908
-1101 -74908 -75533 -76159 -74758 -73358 -69572 -65787 -64166 -62541 -64255 -65969 -66521 -67072 -69054 -71036 -70507 -69974 -69442 -68909 -67124
-1082 -67124 -65339 -65939 -66539 -66263 -65984 -65705 -65425 -67202 -68980 -68372 -67765 -68790 -69811 -68451 -67087 -67545 -68000 -68458 -68913 -70444
-1062 -70444 -71972 -72072 -72169 -74505 -76838 -74881 -72922 -72277 -71629 -72415 -76059 -77739 -74647 -72035 -69419 -69818 -70213 -71088 -69099
-1043 -69099 -68126 -71919 -74405 -72117 -67255 -67158 -69207 -68395 -65559 -65582 -67154 -68726 -71137 -73544 -73566 -73589 -73018 -72445 -71871 -71297
-1023g1297N59N62N59N63J960J963J960J964l041l036K98L01n96n92k981k977j23j19j23j19
-1003g4315R20R24R20R25Q38Q42j069J795K150k615K42K46j002r99r99r98k373k370J922J923
-983g3093K940K943N59N59j114j110L20L20j300j300J084J088j598j599J740J744j770j770
-965g1357l39l35o67o67J241j617j439L331L510O49m85m84K675K675n2n2n2n3j035j036j036
-944f6625j036m77m77m76m77J341J341j520L249K996J34J267j595j5j5j94j93l92l87l88l87
-923f4326L24L28L28L28J90J94J93J94j68j64j64j63k270k265k269k265m%m%P42P45P41P46
-899f9009J874J878J874J877k98k98l159l160j252j252L518L517n37n36n37n36j014j013j014
-880f9077j013l160l159J610J609J371J371J193J192k124m985k76N447L659k064j706M016
$$ plain form
-1023 -71297 -70738 -70176 -69617 -69054 -67094 -65131 -63171 -61207 -64248 -67284 -66986 -66685 -67281 -67873 -70854 -73831 -73954 -74073 -74196 -74315
-1003 -74315 -73395 -72471 -71551 -70626 -69788 -68946 -70015 -68220 -66070 -68685 -68443 -68197 -69199 -70198 -71197 -72195 -74568 -76938 -75016 -73093
-983 -73093 -70153 -67210 -66651 -66092 -67206 -68316 -67996 -67676 -68976 -70276 -69192 -68104 -69702 -71301 -69561 -67817 -69587 -71357
-965 -71357 -71696 -72031 -72698 -73365 -72124 -73741 -75180 -71849 -68339 -67690 -68175 -68659 -65984 -63309 -63361 -63413 -63465 -63518 -64553 -65589 -66625
-944 -66625 -67661 -68138 -68615 -69091 -69568 -68227 -66886 -68406 -65157 -62161 -62027 -60760 -62355 -62370 -62385 -62579 -62772 -63164 -63551 -63939 -64326
-923 -64326 -64002 -63674 -63346 -63018 -62828 -62634 -62441 -62247 -62415 -62579 -62743 -62906 -65176 -67441 -69710 -71975 -71979 -71979 -71983 -71983 -71241 -70496 -69755 -69009
-899 -69009 -67135 -65257 -63383 -61506 -61804 -62102 -65261 -68421 -69673 -70925 -67407 -63890 -64427 -64963 -65500 -66036 -67050 -68063 -69077
-880 -69077 -70090 -73250 -76409 -74799 -73190 -71819 -70448 -69255 -68063 -70187 -75172 -75448 -70001 -66342 -68406 -70112 -66096
-863f6096j501j498j144j140k575k571K87K91J90J94L051L055L10L13L09L13K57K61K57K61
-843f7176j01r7j00r7L76L80L76L80m58m54m59m54P00P01L42L43L383k339j983j982J72J71
-821f8376J71J72J602J602j259j260o70o71o71o70k54k53k53k54j41j42j42j41l21l20l182
-800g5433l182K497K496K496K497Q27Q27Q27Q27k094k094P08L570K854k869N29N29J121J122
-781f1945J121J122j859j860j501j502m169J554j666j665k679k679K090K090J759J759J758
-764f8272J759l0l0l0k9j144j144J718J717J539J539j323j323j859j859j859j859L46L47L208
-744f8588L208J475J475j386j386J655J654j207j207Q9Q9R0Q9l964l964j103j103K68K68K69
-724g3279K68M143M143M501j222k455k452M9N2J002J006J002J006k545k541k544k541m989
$$ plain form
-863 -66096 -67597 -69095 -70239 -71379 -73954 -76525 -76238 -75947 -75757 -75563 -72512 -69457 -69147 -68834 -68525 -68212 -67955 -67694 -67437 -67176
-843 -67176 -67277 -67374 -67474 -67571 -67195 -66815 -66439 -66059 -66517 -66971 -67430 -67884 -67184 -66483 -66141 -65798 -62415 -64754 -66737 -68719 -68547 -68376
-821 -68376 -68205 -68033 -66431 -64829 -66088 -67348 -68018 -68689 -69360 -70030 -70284 -70537 -70790 -71044 -71185 -71327 -71469 -71610 -71931 -72251 -75433
-800 -75433 -78615 -76118 -73622 -71126 -68629 -67802 -66975 -66148 -65321 -67415 -69509 -68801 -65231 -62377 -65246 -64717 -64188 -63067 -61945
-781 -61945 -60824 -59702 -61561 -63421 -64922 -66424 -70593 -69039 -70705 -72370 -75049 -77728 -75638 -73548 -71789 -70030 -68272
-764 -68272 -66513 -66543 -66573 -66603 -66632 -67776 -68920 -67202 -65485 -63946 -62407 -63730 -65053 -66912 -68771 -70630 -72489 -72143 -71796 -68588
-744 -68588 -65380 -63905 -62430 -63816 -65202 -63547 -61893 -63100 -64307 -64218 -64129 -64039 -63950 -67914 -71878 -72981 -74084 -73816 -73548 -73279
-724 -73279 -73011 -68868 -64725 -60224 -61446 -63901 -66353 -66304 -66252 -65250 -64244 -63242 -62236 -64781 -67322 -69866 -72407 -77396
-706g7396m986J688J692J915J919J915J919J915J919r47r42J289J293J289J293j573j568j215
-688f8581j211p49M978j464j461L484k236j881j878j725j722J137J140M81M84M81M84J446
-670f8793J449m635J092K161K164k250k247QJ1PJ2K511K515K511K515J099J099m981P41K05
-650f2806K05N63N62k224k224k225k224p04p05K158K157K090K091J017J017m825Q98K328l394
-631f6245j1j1J181O904L387L387Q83Q83j696j691k65k60p72p67l633l629M06M10L268L271
-611e5000L089L092L089L092M676M680O822J2549J6538K6081L5139M8496O0698N4979K1353
-596B49373k2519n4714o0434n1138l3965k5951k0226j3194p470n086n086j867j866j837j837
-581e7817J025J024M1M1J472J472k824k825L8L7J319J319J676m046j349j348j707j706m85
$$ plain form
-706 -77396 -82382 -80694 -79002 -77087 -75168 -73253 -71334 -69419 -67500 -68447 -69389 -68100 -66807 -65518 -64225 -65798 -67366 -68581
-688 -68581 -69792 -70541 -65563 -67027 -68488 -65004 -67240 -69121 -70999 -72724 -74446 -73309 -72169 -71688 -71204 -70723 -70239 -68793
-670 -68793 -67344 -71979 -70887 -68726 -66562 -68812 -71059 -71051 -71040 -71033 -71021 -68510 -65995 -63484 -60969 -59870 -58771 -63752 -63011 -62806
-650 -62806 -62601 -62038 -61476 -63700 -65924 -68149 -70373 -71077 -71782 -69624 -67467 -65377 -63286 -62269 -61252 -66077 -65179 -62851 -66245
-631 -66245 -66256 -66267 -65086 -58182 -54795 -51408 -50525 -49642 -51338 -53029 -53294 -53554 -54326 -55093 -58726 -62355 -61949 -61539 -58271 -55000
-611 -55000 -51911 -48819 -45730 -42638 -37962 -33282 -26460 -13911 2627 28708 63847 112343 173041 228020 249373
-596 249373 226854 172140 111706 60568 26603 652 -19574 -32768 -40238 -45324 -50410 -52277 -54143 -55980 -57817
-581 -57817 -56792 -55768 -55727 -55686 -54214 -52742 -55566 -58391 -58353 -58316 -56997 -55678 -54002 -58048 -59397 -60745 -62452 -64158 -64643
-562f4643m84m84m85j468j464l7l4L361L364N00N03j528j524r7r3Q87Q90Q87Q91L070L074
-541e4914j699j696j550j546J312J315j64j60J624m095k101k098N82N85M65L327L328M65k544
-522e9564k545j651J211J032j829l260l99J420j442j31K731j259o028m419L50K317K318l65
-504g1513l227j900R61K035K034j245j244j066j065j014J852M17M21j19K746J133J136J043
-486f8615J047k08l067N37N40j073j069j163j158J520J524J073j785%Mk266O00j013j010K146
-466g3436K150J073j785j859J002Q24k038M8M9K910K910K27L089J479l290j502J360p26p27
-447f8242o56l517K862K861j013j014J848J848o11o11m32m32j94K668K489l73K310n48l591
-428f4348p27N81N85q49q46m17l275k39k35j460j457k09k04M187J331P4P8J34J38j296j293
$$ plain form
-562 -64643 -65127 -65611 -66096 -67564 -69028 -69065 -69099 -65738 -62374 -61874 -61371 -62899 -64423 -64520 -64613 -63726 -62836 -61949 -61058 -57988 -54914
-541 -54914 -56613 -58309 -59859 -61405 -60093 -58778 -58942 -59102 -57478 -61573 -63674 -65772 -65190 -64605 -64140 -60813 -57485 -57020 -59564
-522 -59564 -62109 -63760 -62549 -61517 -63346 -66606 -67005 -65585 -67027 -67158 -64427 -65686 -71714 -76133 -75783 -73466 -71148 -71513
-504 -71513 -74740 -76640 -75679 -73644 -71610 -72855 -74099 -75165 -76230 -77244 -75392 -74975 -74554 -74673 -71927 -70794 -69658 -68615
-486 -68615 -67568 -67776 -70843 -70306 -69766 -70839 -71908 -73071 -74229 -72709 -71185 -70112 -71897 -71897 -71893 -74159 -73559 -74572 -75582 -73436
-466 -73436 -71286 -70213 -71998 -73857 -72855 -72031 -74069 -74021 -73972 -71062 -68152 -67925 -64836 -63357 -66647 -68149 -66789 -67515 -68242
-447 -68242 -68898 -72415 -69553 -66692 -67705 -68719 -66871 -65023 -65634 -66245 -66677 -67109 -67303 -64635 -62146 -62519 -60209 -60757 -64348
-428 -64348 -65075 -64494 -63909 -64758 -65604 -66021 -69296 -69535 -69770 -71230 -72687 -72896 -73100 -68913 -67582 -67508 -67430 -67296 -67158 -68454 -69747
-407f9747M69M73M70M73j259j256J602J606k533k534K712K713K206K205k086k087J558J557
-389f3458q27q27J498J497l092l093J517l249l312m47j53M620O82O85J532J535q54q49J054
-370f5541J058k283k281j285j286J46J45J069J070J069J069p34p34J651J650j508j509j509
-352f9743j509j070j065K269K272k917k914j486j483Q98R02K805n2p71M001L819r46l368l365
-333g3723l28l24J014J017J013J017O86O89O86O89k38k35k38k35j919j915M66M69J092J095
-313f9222j293j289p86p82L506L509n77n74n77n74J941J945j397j394k798k794m14m10k887
-294g6867k884K358K363J315J319J315J319l260l257P9Q2n78n74Q53Q57J957J959J956J960
-275f7728m58m55o37o33K101p56Q49Q54k281k276m069j203M679J822J223J225J20J23j312
$$ plain form
-407 -69747 -69278 -68805 -68335 -67862 -69121 -70377 -68775 -67169 -69702 -72236 -69524 -66811 -64605 -62400 -64486 -66573 -65015 -63458
-389 -63458 -64285 -65112 -63614 -62117 -65209 -68302 -66785 -70034 -73346 -73793 -73946 -69326 -68644 -67959 -66427 -64892 -65746 -66595 -65541
-370 -65541 -64483 -66766 -69047 -70332 -71618 -71472 -71327 -70258 -69188 -68119 -67050 -67784 -68518 -66867 -65217 -66725 -68234 -69743
-352 -69743 -71252 -72322 -73387 -71118 -68846 -71763 -74677 -76163 -77646 -76748 -75846 -73041 -73093 -73864 -69863 -66044 -66990 -70358 -73723
-333 -73723 -74051 -74375 -73361 -72344 -71331 -70314 -69628 -68939 -68253 -67564 -67802 -68037 -68275 -68510 -70429 -72344 -71878 -71409 -70317 -69222
-313 -69222 -70515 -71804 -72590 -73372 -69866 -66357 -66934 -67508 -68085 -68659 -66718 -64773 -66170 -67564 -70362 -73156 -73570 -73980 -76867
-294 -76867 -79751 -77393 -75030 -73715 -72396 -71081 -69762 -73022 -76279 -76200 -76118 -76696 -77270 -76417 -75560 -73603 -71644 -69688 -67728
-275 -67728 -68186 -68641 -69278 -69911 -67810 -68566 -67717 -66863 -69144 -71420 -75489 -76692 -72013 -70191 -68968 -67743 -67623 -67500 -68812
-256f8812j308p26p23J479J483P64k094J08K973O00k258m586J86J613J617j427j423j286j281
-237g5101R20R24J993q64q68J997J755J758J636J639r87n753o89M084K690j68k556L09K452
-218f4829k314k615k612k839K6J751J755N59N62K288N153qpK258K258J274l495r91r91k064
-198f4881m926j408J453j021J841K019q42j654j655j654j654l13K548K549l13J595J594j94
-180f6916j93Q79j982l532l532j61K705R13R17L625P68k754J12N607K750k500L65O89k168
-161f4408n63n58J408j449l182l179P83P86P82P87o41o37o41o37m62m59k071P93L84L88N66
-140g2210N66R84R84O85O86M683q2j870R91k31k31n2n2l95l95j826j822l65l62K497K500j394
-118f6711j393j394j389j42j38j41j38l80l80l480J289M359k317k377K392K988K988M25M24
$$ plain form
-256 -68812 -70120 -70846 -71569 -70090 -68607 -67843 -69937 -69829 -66856 -66256 -68514 -73100 -72914 -71301 -69684 -71111 -72534 -73820 -75101
-237 -75101 -74181 -73257 -71264 -72128 -72996 -70999 -69244 -67486 -65850 -64211 -65198 -70951 -71640 -67556 -64866 -65034 -67590 -67281 -64829
-218 -64829 -67143 -69758 -72370 -75209 -75183 -73432 -71677 -71118 -70556 -68268 -63115 -63123 -63130 -60872 -58614 -57340 -60835 -61826 -62817 -64881
-198 -64881 -69807 -71215 -69762 -70783 -68942 -66923 -67765 -69419 -71074 -72728 -74382 -74695 -72147 -69598 -69911 -68316 -66722 -66916
-180 -66916 -67109 -66230 -68212 -71744 -75276 -75437 -72732 -71819 -70902 -67277 -66509 -69263 -69151 -63544 -60794 -63294 -62929 -62240 -64408
-161 -64408 -64971 -65529 -64121 -65570 -68752 -71931 -71148 -70362 -69580 -68793 -69434 -70071 -70712 -71349 -71811 -72270 -74341 -73548 -73164 -72776 -72210
-140 -72210 -71644 -70660 -69676 -68991 -68305 -63622 -63704 -65574 -64583 -64814 -65045 -65097 -65149 -65544 -65939 -67765 -69587 -69952 -70314 -67817 -65317 -66711
-118 -66711 -68104 -69498 -70887 -71029 -71167 -71308 -71446 -71826 -72206 -75686 -74397 -70038 -72355 -74732 -72340 -69352 -66364 -65939 -65515
-99f5515k794k794O7O7l84l80J047J051k948k943j338j333k039Q28M758qJ777J781P64L629
-79f6707K918n664l342J431n70n67k68k68j017j014L752L756p49p45O85O86j893j889R69L834
-59f6662K161k605m213j353j282j278L28L32J788J792J793J792K176K176k594k593o85o86
-41f9613J222j639n89M180M002p68k198k198k496k497J49J53J49J53L28L31L28L32o93o89
-21g2053K168K172k690k686j260j255M042M047J002J006J956r02J420m300j919L808J658J662
-3f2124L536L539j233j229k784k783P8P9k80k79k80k79j189j188j189j188j159j159k589k590
16g6290L897L898J036J035l35l35j766j766O18O19R76R76m926P98q13l673L98L99J651J650
36g1953J531J532j330j331J904J904M74M73k299k299N63N62Q12Q13Q12Q12l20l21l20l21o03
$$ plain form
-99 -65515 -68309 -71103 -71036 -70969 -71353 -71733 -70686 -69635 -72583 -75526 -76864 -78197 -80236 -79408 -74650 -74658 -72881 -71100 -70336 -66707
-79 -66707 -63789 -69453 -72795 -71364 -71934 -72501 -72769 -73037 -74054 -75068 -71316 -67560 -68309 -69054 -68369 -67683 -69576 -71465 -70496 -66662
-59 -66662 -64501 -67106 -71319 -72672 -73954 -75232 -74904 -74572 -72784 -70992 -69199 -67407 -65231 -63055 -65649 -68242 -68927 -69613
-41 -69613 -68391 -70030 -70619 -66439 -62437 -63205 -65403 -67601 -70097 -72594 -72445 -72292 -72143 -71990 -71662 -71331 -71003 -70671 -71364 -72053
-21 -72053 -69885 -67713 -70403 -73089 -74349 -75604 -71562 -67515 -66513 -65507 -63551 -64453 -63033 -67333 -69252 -65444 -63786 -62124
-3 -62124 -58588 -55049 -56282 -57511 -60295 -63078 -63000 -62921 -63201 -63480 -63760 -64039 -65228 -66416 -67605 -68793 -69952 -71111 -73700 -76290
16 -76290 -72393 -68495 -67459 -66424 -66759 -67094 -68860 -70626 -70008 -69389 -68413 -67437 -72363 -71565 -72378 -76051 -75653 -75254 -73603 -71953
36 -71953 -70422 -68890 -70220 -71551 -69647 -67743 -67269 -66796 -69095 -71394 -70831 -70269 -69457 -68644 -67832 -67020 -67340 -67661 -67981 -68302 -68905
57f8905o04o03o04p53p52J751J751K608l115k936p4J684J684J863J863J56J57J56J57j006
77f5522j006J855J856j859j859m29m28l559l558k187L536M028J166K72K72Q68Q68j636j635
96f8957k817K906l13l13j34j34j34j34n89n89n88n89L674L673O34O33J960r02k332N29J811
117f2705J811k899n760k512L51J423J423Q27Q27j736j736k590K184n03m99q91q87J83L048
136g0641n78l435k20k16K612K615J181J185j248j244J82J87j219j214j46K720l39l197j591
155g4606J275j2pj1qJ528j334k586k586K482K481l80l80Q94Q95Q94Q94Q05Q05Q05Q04k712
177g0060k713k891l0K594K593k295n157J379J378k31k31P53P52N74N74K977J15J547J546J75
197f6651k686l760l759N33L394J606J606J397j464J576J576q46q42n317k452j054j051J986
$$ plain form
57 -68905 -69509 -70112 -70716 -71469 -72221 -70470 -68719 -66111 -69226 -72162 -72236 -70552 -68868 -67005 -65142 -64986 -64829 -64673 -64516 -65522
77 -65522 -66528 -64673 -62817 -64676 -66535 -66964 -67392 -70951 -74509 -76696 -73160 -69132 -67966 -67694 -67422 -66554 -65686 -67322 -68957
96 -68957 -71774 -68868 -69181 -69494 -69628 -69762 -69896 -70030 -70619 -71208 -71796 -72385 -68711 -65038 -64404 -63771 -61811 -62713 -65045 -64516 -62705
117 -62705 -60894 -63793 -69553 -72065 -71714 -70291 -68868 -68041 -67214 -68950 -70686 -73276 -71092 -71595 -72094 -72985 -73872 -73689 -70641
136 -70641 -71219 -74654 -74874 -75090 -72478 -69863 -68682 -67497 -68745 -69989 -69807 -69620 -70839 -72053 -72199 -69479 -69818 -73015 -74606
155 -74606 -73331 -73343 -73350 -73361 -73369 -71841 -73175 -75761 -78347 -75865 -73384 -73764 -74144 -73250 -72355 -71461 -70567 -69762 -68957 -68152 -67348 -70060
177 -70060 -72773 -75664 -75694 -73100 -70507 -72802 -77959 -76580 -75202 -75433 -75664 -74911 -74159 -73585 -73011 -70034 -69919 -68372 -66826 -66651
197 -66651 -69337 -73097 -76856 -76323 -72929 -71323 -69717 -68320 -69784 -68208 -66632 -67478 -68320 -73637 -76089 -77143 -78194 -76208
215g6208J990k20k16Q53L718k425n283k247O18j49j45K891K895J580J584L28k530j416j412
234g5794j595j591K817K820J208M072J688J688J866J867j204j203k634k634j010j010l871
251g4520l871J23J23K984K985J501J502P0P1l595l596p34p34K977K977j494j494j792K977
270g3540L156j614m266j401m51m47O23O26O22O26J531J535J531J536r73r69o74o71O0M832
290f8328L935J077k892k6P46P48P75l990j788J076J49m616j937R27J174J177p8p4K19K24K20
311g1282K23j38j34j38j34L10L13J740J743k258k254O04O07N74N77N74N78k057k053Q05Q08
332g0992r83r80r84r80L398L402N37N40j729j725J133J136J79J82J79J83j252j248J430J435
352f7139q23l682m758J5L052L055M88M92n85n81K276K280j061j059j061j059m39m36m40m36
$$ plain form
215 -76208 -74218 -74438 -74654 -73801 -70083 -72508 -77791 -80038 -79420 -79569 -79714 -76823 -73928 -72348 -70764 -70436 -72966 -74382 -75794
234 -75794 -77389 -78980 -76163 -73343 -72135 -68063 -66375 -64687 -62821 -60954 -62158 -63361 -65995 -68629 -69639 -70649 -74520
251 -74520 -78391 -78268 -78145 -75161 -72176 -70675 -69173 -69103 -69032 -72627 -76223 -76957 -77691 -74714 -71737 -73231 -74725 -76517 -73540
270 -73540 -70384 -71998 -76264 -77665 -78116 -78563 -77940 -77314 -76692 -76066 -74535 -73000 -71469 -69933 -70906 -71875 -72549 -73220 -73160 -68328
290 -68328 -64393 -63316 -66208 -66234 -65488 -64740 -63965 -67955 -69743 -68667 -68518 -73134 -75071 -74144 -72970 -71793 -71871 -71945 -71726 -71502 -71282
311 -71282 -71059 -71197 -71331 -71469 -71603 -71293 -70980 -69240 -67497 -69755 -72009 -71405 -70798 -70224 -69647 -69073 -68495 -70552 -72605 -71800 -70992
332 -70992 -71975 -72955 -73939 -74919 -71521 -68119 -67582 -67042 -68771 -70496 -69363 -68227 -68048 -67866 -67687 -67504 -68756 -70004 -68574 -67139
352 -67139 -67962 -71644 -76402 -76387 -73335 -70280 -69792 -69300 -69885 -70466 -68190 -65910 -66971 -68030 -69091 -70150 -70589 -71025 -71465 -71901
372g1901n29n25J259j598P4K940M188J330j207j204R99L864J144l622n712k846n56n51j986
391g6439Q79K977K981K560k98l372n07M676q9m501m501M47M47j19j19j20j19M03M02j982j982
412g8376J207J207k787P5M120M121J796j065k199O63n29K333L092K31j319j319l077l078o93
431g5597o93O71O70M92M92J297j565k996j34J304J304j080j081M553J692q12q13j337J527
450g2106J524j334J83J86MPQ46Q50Q45Q50j539j535J502j357M25M25K630K631q87q87q86q87
472f8510L80L80L80L80L80L80j051j050O18O22k720k716L80L84N59N63k154P12Q86j971j020
493g4188J844K735k031j632j628j930j926K392K395K392K396J334J338r7r3K079K082k213
511f4751k209l313l312R80R80M199M199J815J814j285j286k716k716l014l015J278J278L54
$$ plain form
372 -71901 -72430 -72955 -71696 -73294 -73220 -70280 -66092 -64762 -65969 -67173 -66174 -62310 -61166 -64788 -70500 -73346 -73902 -74453 -76439
391 -76439 -75560 -72583 -69602 -67042 -67340 -70712 -71219 -66543 -66632 -71133 -75634 -75187 -74740 -74859 -74978 -75098 -75217 -74814 -74412 -76394 -78376
412 -78376 -77169 -75962 -78749 -78674 -74554 -70433 -68637 -69702 -71901 -71238 -71767 -69434 -66342 -66111 -67430 -68749 -71826 -74904 -75597
431 -75597 -76290 -75619 -74949 -74457 -73965 -72668 -74233 -77229 -77363 -76059 -74755 -75835 -76916 -72363 -70671 -71483 -72296 -73633 -72106
450 -72106 -70582 -71916 -71733 -71547 -71543 -71536 -70690 -69840 -68995 -68145 -69684 -71219 -69717 -71074 -70649 -70224 -67594 -64963 -65850 -66737 -67623 -68510
472 -68510 -68130 -67750 -67370 -66990 -66610 -66230 -67281 -68331 -67713 -67091 -69811 -72527 -72147 -71763 -71204 -70641 -72795 -72083 -71197 -73168 -74188
493 -74188 -72344 -69609 -71640 -73272 -74900 -76830 -78756 -76364 -73969 -71577 -69181 -67847 -66509 -66606 -66699 -64620 -62538 -64751
511 -64751 -66960 -70273 -73585 -72605 -71625 -67426 -63227 -61412 -59598 -60883 -62169 -64885 -67601 -70615 -73630 -72352 -71074 -70720
529g0720L54j076j077J218J218J219J218P86P87o45o45n55n55K783K784k39k35k623k619p15
549f9337p12p15p12J118J121J118J122K83K87j148j144j442j442R43R43O74O74O75O74J9J8
$$ plain form
529 -70720 -70366 -71442 -72519 -71301 -70083 -68864 -67646 -66860 -66073 -66718 -67363 -67918 -68473 -65690 -62906 -63145 -63380 -66003 -68622 -69337
549 -69337 -70049 -70764 -71476 -70358 -69237 -68119 -66997 -66714 -66427 -67575 -68719 -70161 -71603 -70660 -69717 -69043 -68369 -67694 -67020 -67001 -66983
$$ [...]
##END=	
