##TITLE=	tOtD8mqBSpmZD$+nqcWb2g/1533s
##JCAMPDX=	6.0	$$ NMR Plug-in 1.13 of MestReNova 11.0.4-18998
##DATATYPE=	NMRSPECTRUM
##DATACLASS=	XYDATA
##NUMDIM=	1
##ORIGIN=	Bruker BioSpin GmbH
##OWNER=	andrew
##.OBSERVEFREQUENCY=	600.30184456100005264
##.OBSERVENUCLEUS=	^1H
##.SOLVENTNAME=	CD2Cl2
##.PULSESEQUENCE=	zg
##LONGDATE=	2015/06/05 10:10:33.000
##.ACQUISITIONMODE=	SIMULTANEOUS (DQD)
##$ORIGINALFORMAT=	Bruker XWIN-NMR
##$PARAMETERFILE=	(acqus, ASCII, /var/folders/f6/rjf_tdyn2v98c5c0wvkgn4s80000gn/T/tOtD8mqBSpmZD$+nqcWb2g/1533s/acqus, 0)
$$ ##TITLE= Parameter file, TOPSPIN		Version 2.1
$$ ##JCAMPDX= 5.0
$$ ##DATATYPE= Parameter Values
$$ ##NPOINTS= 10	$$ modification sequence number
$$ ##ORIGIN= Bruker BioSpin GmbH
$$ ##OWNER= andrew
$$ $$ 2015-06-05 15:10:34.052 +0600  andrew@av-600
$$ $$ /opt/data/andrew/nmr/limog-1782/609/acqus
$$ $$ process /opt/ts21pl6/prog/mod/shimcntl
$$ ##$ACQT0= -9.54927425515661
$$ ##$AMP= (0..31)
$$ 100 100 100 100 100 100 100 100 100 100 100 100 100 100 100 100 100 100
$$ 100 100 100 100 100 100 100 100 100 100 100 100 100 100
$$ ##$ANAVPT= -1
$$ ##$AQSEQ= 0
$$ ##$AQ_mod= 3
$$ ##$AUNM= <au_zg>
$$ ##$AUTOPOS= <>
$$ ##$BF1= 600.3
$$ ##$BF2= 600.3
$$ ##$BF3= 600.3
$$ ##$BF4= 600.3
$$ ##$BF5= 600.3
$$ ##$BF6= 600.3
$$ ##$BF7= 600.3
$$ ##$BF8= 600.3
$$ ##$BYTORDA= 0
$$ ##$CFDGTYP= 0
$$ ##$CFRGTYP= 9
$$ ##$CHEMSTR= <none>
$$ ##$CNST= (0..63)
$$ 1 1 145 1 1 1 1 1 1 1 1 1 1 1 1 1 1 1 1 1 1 1 1 1 1 1 1 1 1 1 1 1 1 1 1
$$ 1 1 1 1 1 1 1 1 1 1 1 1 1 1 1 1 1 1 1 1 1 1 1 1 1 1 1 1 1
$$ ##$CPDPRG= <>
$$ ##$CPDPRG1= <>
$$ ##$CPDPRG2= <waltz16>
$$ ##$CPDPRG3= <>
$$ ##$CPDPRG4= <mlev>
$$ ##$CPDPRG5= <mlev>
$$ ##$CPDPRG6= <mlev>
$$ ##$CPDPRG7= <mlev>
$$ ##$CPDPRG8= <mlev>
$$ ##$CPDPRGB= <>
$$ ##$CPDPRGT= <>
$$ ##$D= (0..63)
$$ 0 1 0 0 0 0 0 0 0 0.06 0 0.03 0 0 0 0 1e-04 0 0 0 0 0 0 0 0 0 0 0 0 0 0
$$ 0 0 0 0 0 0 0 0 0 0 0 0 0 0 0 0 0 0 0 0 0 0 0 0 0 0 0 0 0 0 0 0 0
$$ ##$DATE= 1433495433
$$ ##$DBL= (0..7)
$$ 120 120 120 120 120 120 120 120
$$ ##$DBP= (0..7)
$$ 150 150 150 150 150 150 150 150
$$ ##$DBP07= 0
$$ ##$DBPNAM0= <>
$$ ##$DBPNAM1= <>
$$ ##$DBPNAM2= <>
$$ ##$DBPNAM3= <>
$$ ##$DBPNAM4= <>
$$ ##$DBPNAM5= <>
$$ ##$DBPNAM6= <>
$$ ##$DBPNAM7= <>
$$ ##$DBPOAL= (0..7)
$$ 0.5 0.5 0.5 0.5 0.5 0.5 0.5 0.5
$$ ##$DBPOFFS= (0..7)
$$ 0 0 0 0 0 0 0 0
$$ ##$DE= 6.5
$$ ##$DECBNUC= <off>
$$ ##$DECIM= 2218.66666666667
$$ ##$DECNUC= <off>
$$ ##$DECSTAT= 4
$$ ##$DIGMOD= 1
$$ ##$DIGTYP= 12
$$ ##$DL= (0..7)
$$ 0 120 120 120 120 120 120 120
$$ ##$DP= (0..7)
$$ 150 150 150 150 150 150 150 150
$$ ##$DP07= 0
$$ ##$DPNAME0= <>
$$ ##$DPNAME1= <>
$$ ##$DPNAME2= <>
$$ ##$DPNAME3= <>
$$ ##$DPNAME4= <>
$$ ##$DPNAME5= <>
$$ ##$DPNAME6= <>
$$ ##$DPNAME7= <>
$$ ##$DPOAL= (0..7)
$$ 0.5 0.5 0.5 0.5 0.5 0.5 0.5 0.5
$$ ##$DPOFFS= (0..7)
$$ 0 0 0 0 0 0 0 0
$$ ##$DQDMODE= 0
$$ ##$DR= 22
$$ ##$DS= 0
$$ ##$DSLIST= <SSSSSSSSSSSSSSS>
$$ ##$DSPFIRM= 0
$$ ##$DSPFVS= 20
$$ ##$DTYPA= 0
$$ ##$EXP= <>
$$ ##$F1LIST= <111111111111111>
$$ ##$F2LIST= <222222222222222>
$$ [...]
$$ -1 -1 -1 -1 -1 -1 -1 -1 -1 -1 -1 -1 -1 -1 -1 -1 -1 -1 -1 -1 -1 -1 -1 -1
$$ -1 -1 -1 -1 -1 -1 -1 -1 -1 -1 -1 -1 -1 -1 -1 -1 -1 -1 -1 -1 -1 -1 -1 -1
$$ -1 -1 -1 -1 -1 -1 -1 -1 -1 -1 -1 -1 -1 -1 -1 -1 -1 -1 -1 -1 -1 -1 -1 -1
$$ -1 -1 -1 -1 -1 -1 -1 -1 -1 -1 -1 -1 -1 -1 -1 -1 -1 -1 -1 -1 -1 -1 -1 -1
$$ -1 -1 -1 -1 -1 -1 -1 -1 -1 -1 -1 -1 -1 -1 -1 -1
$$ ##$RG_tab8= (0..255)
$$ -1 -1 -1 -1 -1 -1 -1 -1 -1 -1 -1 -1 -1 -1 -1 -1 -1 -1 -1 -1 -1 -1 -1 -1
$$ -1 -1 -1 -1 -1 -1 -1 -1 -1 -1 -1 -1 -1 -1 -1 -1 -1 -1 -1 -1 -1 -1 -1 -1
$$ -1 -1 -1 -1 -1 -1 -1 -1 -1 -1 -1 -1 -1 -1 -1 -1 -1 -1 -1 -1 -1 -1 -1 -1
$$ -1 -1 -1 -1 -1 -1 -1 -1 -1 -1 -1 -1 -1 -1 -1 -1 -1 -1 -1 -1 -1 -1 -1 -1
$$ -1 -1 -1 -1 -1 -1 -1 -1 -1 -1 -1 -1 -1 -1 -1 -1 -1 -1 -1 -1 -1 -1 -1 -1
$$ -1 -1 -1 -1 -1 -1 -1 -1 -1 -1 -1 -1 -1 -1 -1 -1 -1 -1 -1 -1 -1 -1 -1 -1
$$ -1 -1 -1 -1 -1 -1 -1 -1 -1 -1 -1 -1 -1 -1 -1 -1 -1 -1 -1 -1 -1 -1 -1 -1
$$ -1 -1 -1 -1 -1 -1 -1 -1 -1 -1 -1 -1 -1 -1 -1 -1 -1 -1 -1 -1 -1 -1 -1 -1
$$ -1 -1 -1 -1 -1 -1 -1 -1 -1 -1 -1 -1 -1 -1 -1 -1 -1 -1 -1 -1 -1 -1 -1 -1
$$ -1 -1 -1 -1 -1 -1 -1 -1 -1 -1 -1 -1 -1 -1 -1 -1 -1 -1 -1 -1 -1 -1 -1 -1
$$ -1 -1 -1 -1 -1 -1 -1 -1 -1 -1 -1 -1 -1 -1 -1 -1
$$ ##$RG_tabA= (0..255)
$$ 0.25 0.28 0.32 0.35 0.4 0.44 0.5 0.56 0.64 0.7 0.8 0.89 1 1.12 1.28 1.4
$$ 1.6 1.78 2 2.25 2.56 2.8 3.2 3.56 4 4.5 5 5.6 6.35 7.12 8 9 10 11.3 12.7
$$ 14.2 16 18 20.2 22.6 25.4 28.5 32 36 40.3 45.2 50.8 57 64 71.8 80.6 90.5
$$ 101 114 128 144 161 181 203 -1 -1 -1 -1 -1 -1 -1 -1 -1 -1 -1 -1 -1 -1 -1
$$ -1 -1 -1 -1 -1 -1 -1 -1 -1 -1 -1 -1 -1 -1 -1 -1 -1 -1 -1 -1 -1 -1 -1 -1
$$ -1 -1 -1 -1 -1 -1 -1 -1 -1 -1 -1 -1 -1 -1 -1 -1 -1 -1 -1 -1 -1 -1 -1 -1
$$ -1 -1 -1 -1 -1 -1 -1 -1 -1 -1 -1 -1 -1 -1 -1 -1 -1 -1 -1 -1 -1 -1 -1 -1
$$ -1 -1 -1 -1 -1 -1 -1 -1 -1 -1 -1 -1 -1 -1 -1 -1 -1 -1 -1 -1 -1 -1 -1 -1
$$ -1 -1 -1 -1 -1 -1 -1 -1 -1 -1 -1 -1 -1 -1 -1 -1 -1 -1 -1 -1 -1 -1 -1 -1
$$ -1 -1 -1 -1 -1 -1 -1 -1 -1 -1 -1 -1 -1 -1 -1 -1 -1 -1 -1 -1 -1 -1 -1 -1
$$ -1 -1 -1 -1 -1 -1 -1 -1 -1 -1 -1 -1 -1 -1 -1 -1 -1 -1 -1 -1 -1 -1 -1 -1
$$ -1 -1 -1 -1 -1 -1 -1 -1 -1 -1 -1 -1 -1 -1
$$ ##$ROUT14= (0..7)
$$ 0 0 0 0 0 0 0 0
$$ ##$ROUTER= -1
$$ ##$RX22TY= <no>
$$ ##$RXFMAX= (0..7)
$$ 647.5 -1 -1 -1 -1 -1 -1 -1
$$ ##$RXFMIN= (0..7)
$$ 5 -1 -1 -1 -1 -1 -1 -1
$$ ##$RXINTLV= (0..7)
$$ 1 0 0 0 0 0 0 0
$$ ##$RXMSTY= <no>
$$ ##$SCMTY= <no>
$$ ##$SGUC1= (0..15)
$$ 17 18 34 0 0 0 0 0 0 0 0 0 0 0 0 0
$$ ##$SGUC2= (0..15)
$$ 33 256 20 0 0 0 0 0 0 0 0 0 0 0 0 0
$$ ##$SPECTR= 10
$$ ##$SY2FLAG= 0
$$ ##$TFXNUM= 0
$$ ##$TRIPLO2= 0
$$ ##$VTUTY= <tty05>
$$ ##$WBREFAM= (0..15)
$$ 100 100 100 100 100 100 100 100 100 100 100 100 100 100 100 100
$$ ##$WBREFPH= (0..15)
$$ 0 0 0 0 0 0 0 0 0 0 0 0 0 0 0 0
$$ ##$XFAC= 2
$$ ##END=
$$ 
##$DECIM=	2218.66666666667
##$DSPFVS=	20
##XUNITS=	HZ
##YUNITS=	ARBITRARY UNITS
##FIRSTX=	6322.8525384689401108
##LASTX=	-2691.4329892738592207
##XFACTOR=	-0.1375491802509010153
##YFACTOR=	1.0164121093750000223e-05
##NPOINTS=	65536
##XYDATA=	(X++(Y..Y))
$$ [...]
-15728 -59855 -62110 -60869 -59624 -58383 -57139 -58104 -59065 -59732 -60396 -60645 -56121 -54284 -52443 -52961 -53475 -53993 -54508 -52342 -50173
-15709 -50173 -46875 -43574 -40693 -42579 -46257 -47069 -48653 -50233 -50207 -50177 -50509 -50837 -52599 -54358 -52290 -50222 -51195 -52167 -55197
-15690 -55197 -61089 -59468 -53076 -51403 -49730 -52529 -55327 -55503 -55678 -55853 -56028 -55808 -55588 -55368 -55149 -55078 -55007 -53505 -52003 -54221
-15670 -54221 -56438 -53885 -51332 -53252 -55171 -55659 -56147 -55909 -55667 -55424 -55182 -56643 -58100 -56695 -55290 -54716 -54139 -56423 -58707
-15651 -58707 -57269 -55827 -52775 -49723 -52767 -52946 -51873 -55570 -55901 -53367 -51131 -51757 -52879 -53997 -52432 -50867 -51720 -52570
-15633 -52570 -51988 -51407 -51683 -51959 -52234 -52506 -52603 -52696 -52793 -52886 -54660 -56430 -56952 -57470 -53192 -51772 -55007 -52514 -51437 -53222 -53039
-15612 -53039 -52853 -53654 -54452 -57042 -53904 -51821 -49734 -50155 -50572 -54541 -58506 -57705 -56900 -57753 -58603 -56594 -54582 -55108 -55629
-15593 -55629 -56691 -54888 -53505 -57843 -60396 -60083 -56375 -52663 -53546 -54426 -55704 -56982 -56829 -56676 -57448 -58219 -56129 -54038
-15575 -54038 -54690 -55342 -55994 -56647 -56941 -57235 -54668 -52100 -53706 -55312 -56919 -58525 -56971 -55417 -53863 -52309 -52544 -52778 -53013
-15556 -53013 -53248 -53125 -53002 -52879 -52752 -52965 -53173 -53386 -53595 -55149 -56699 -56822 -56941 -54500 -52055 -52477 -52894 -53554 -54209 -53434 -52659
-15535 -52659 -54344 -56028 -54850 -53669 -54608 -55547 -56486 -57422 -56676 -55931 -55186 -54437 -54526 -54616 -54705 -54791 -54735 -54679 -54623 -54563 -53911 -53259 -52607
-15512 -52607 -51951 -52529 -53106 -53684 -54258 -54835 -55413 -55812 -56207 -56233 -53397 -50561 -50583 -52905 -55227 -56296 -57362 -59080 -60798 -61264
-15492 -61264 -58864 -57332 -55801 -54090 -52376 -54418 -56460 -58324 -60183 -59781 -56516 -55040 -58331 -57616 -56900 -60955 -62143
-15475 -62143 -60027 -57910 -58476 -59039 -59855 -60668 -60049 -59430 -56937 -54440 -54806 -55171 -56196 -57217 -55376 -53535 -55275 -57012 -58927
-15456 -58927 -57981 -57940 -57895 -59102 -60310 -60686 -61059 -58570 -56080 -55160 -54235 -54921 -52745 -53017 -53285 -50513 -47740 -47509 -47278 -47226 -47170
-15435 -47170 -47118 -49927 -51127 -52324 -53539 -54753 -54060 -56226 -58573 -56151 -55160 -57027 -56002 -57839 -59855 -59006 -58309 -57612
-15417 -57612 -59777 -59076 -56516 -53956 -51217 -53244 -55842 -55577 -54180 -52778 -53207 -50773 -50129 -49480 -49670 -52722 -53091 -50595
-15399 -50595 -51038 -54344 -54787 -52365 -51347 -53192 -56468 -56878 -51631 -49246 -51750 -54250 -54042 -53833 -53624 -53412 -52339 -51265
-15381 -51265 -52875 -54481 -55286 -53229 -51172 -51973 -52055 -52134 -53826 -55514 -57176 -58834 -57634 -56430 -57049 -57664 -58283 -58898 -58502
-15362 -58502 -58104 -57709 -57310 -54739 -52163 -49592 -47017 -48232 -49443 -50658 -51869 -51377 -50882 -51821 -52756 -51101 -49443 -50650
-15344 -50650 -51854 -54683 -57507 -57470 -57433 -55998 -54560 -53002 -56214 -58305 -55622 -52879 -52998 -54552 -56103 -54970 -53837 -55417
-15326 -55417 -56997 -57146 -57291 -57232 -57172 -57112 -57049 -56930 -56811 -56989 -57165 -53945 -55495 -57224 -58950 -61163 -63373 -62721 -62069 -61152 -60232
-15305 -60232 -60742 -61253 -61320 -61383 -58584 -55786 -56747 -57705 -58186 -61529 -61644 -56986 -56263 -58402 -60843 -60418 -58741 -59926 -61107 -62285
-15285 -62285 -60779 -59274 -61081 -62885 -61827 -60768 -59792 -58812 -60694 -62576 -61625 -60675 -62587 -59729 -57597 -58324 -58573 -58823
-15267 -58823 -59102 -59382 -62524 -65665 -63586 -61506 -59427 -57344 -59676 -62006 -63384 -61897 -56934 -56740 -60064 -60522 -59852 -59177
-15249 -59177 -58327 -57474 -56147 -54817 -56352 -57884 -57809 -57731 -60515 -58529 -55324 -54977 -57496 -60012 -61637 -63258 -62017 -60776
-15231 -60776 -60638 -60500 -60362 -60224 -59311 -58398 -57485 -56568 -57153 -57739 -58324 -58909 -59315 -59721 -60127 -60530 -58450 -56371 -57153 -57936 -55022
-15210 -55022 -52108 -53963 -55819 -54590 -53360 -52130 -50900 -51936 -52972 -51146 -49320 -48962 -48601 -48243 -47882 -50147 -52409 -54675
-15192 -54675 -56937 -54388 -51836 -54057 -56274 -56885 -57493 -58104 -58711 -57671 -56632 -55592 -54552 -56375 -58197 -62702 -62438 -60034
-15174 -60034 -57630 -57612 -57593 -57932 -55409 -51813 -52987 -55122 -57258 -54921 -52585 -53110 -53635 -54161 -54686 -52044 -49402 -49622 -49842
-15155 -49842 -51612 -53382 -54198 -52152 -54086 -60791 -61473 -59293 -57351 -55409 -56151 -56893 -56643 -56393 -57098 -60664 -61130 -56826 -53773
-15136 -53773 -53583 -54932 -56281 -54947 -53613 -51206 -48798 -51161 -53524 -55238 -56952 -58666 -60381 -60843 -61305 -61767 -62229 -60649
-15118 -60649 -59065 -57485 -55901 -56885 -57865 -58849 -59829 -60783 -61733 -59825 -57914 -58450 -58983 -59520 -60053 -59792 -59527 -59266 -59002 -59278
-15098 -59278 -59550 -59825 -60098 -57884 -55667 -56673 -57675 -53076 -54198 -54966 -55730 -56546 -57358 -58175 -58987 -60757 -62524 -61432 -60336
-15079 -60336 -58424 -56509 -58175 -54113 -53453 -58514 -60537 -56833 -57638 -61301 -61748 -59330 -57392 -55450 -56196 -56937 -55596 -54250
-15061 -54250 -55771 -57288 -58033 -58775 -59520 -60261 -59695 -59125 -55696 -52264 -53665 -55063 -56464 -57862 -58040 -58216 -58394 -58570 -57735
-15042 -57735 -56896 -56062 -55223 -56766 -58305 -56986 -55663 -58160 -60653 -60288 -59919 -59479 -59035 -58596 -58152 -56758 -55361 -56829 -58294
-15023 -58294 -58965 -59635 -60306 -60977 -58905 -56833 -57623 -58413 -57653 -56893 -56132 -55372 -54314 -53255 -55059 -56863 -57649 -58435 -56360 -54284
-15003 -54284 -53341 -52398 -51455 -50513 -54906 -59300 -58924 -58547 -55070 -51593 -50978 -50364 -52089 -53814 -55540 -57265 -57798 -58331 -56002
-14984 -56002 -53673 -54072 -54470 -54869 -55268 -55845 -56423 -57001 -57578 -56583 -55585 -54590 -53591 -54206 -54817 -57399 -57116 -54109 -56822 -59360
-14964 -59360 -56170 -55965 -55756 -55193 -54627 -55696 -56762 -57832 -58898 -58178 -57455 -56736 -56013 -57127 -58238 -59352 -60463 -59192 -57917
-14945 -57917 -53785 -49648 -48679 -47706 -49600 -51489 -51236 -50978 -50546 -50110 -52130 -51284 -48653 -51742 -54835 -55063 -56188 -54448 -53281
-14926 -53281 -54977 -54884 -54791 -54698 -54604 -54511 -54418 -54280 -54142 -54004 -53867 -53729 -53591 -53453 -53315 -54276 -55234 -56196 -57153 -57042 -56926 -56814 -56699 -56445
-14902 -56445 -56188 -55935 -55678 -56855 -58029 -56345 -54657 -55953 -57247 -55681 -54113 -54157 -54198 -54243 -54284 -52495 -50703 -51776 -52845
-14883 -52845 -52190 -51530 -51768 -54865 -57030 -53468 -51698 -52786 -53937 -55085 -56416 -57742 -60064 -62382 -61842 -61297 -60578 -59855
-14865 -59855 -59136 -58413 -57198 -55983 -54470 -52957 -54127 -50527 -49611 -48694 -49462 -50229 -50997 -51765 -51817 -51869 -54903 -53166 -50129 -51862
-14845 -51862 -55085 -55447 -56106 -56766 -57247 -57727 -56799 -55871 -54944 -54016 -53982 -53949 -53915 -53881 -55883 -57884 -57023 -56162 -56732 -57303 -57873 -58443
-14823 -58443 -56375 -54306 -55100 -55894 -56807 -57720 -58454 -59188 -59266 -56483 -55488 -59263 -61488 -63712 -63373 -63034 -62859 -62684 -59647 -61379
-14803 -61379 -62218 -60194 -60079 -59963 -60004 -60042 -60083 -60120 -59565 -59006 -58450 -57891 -56799 -55704 -54612 -53516 -54452 -55383 -56319 -57250 -57329 -57403
-14781 -57403 -57481 -57556 -57276 -56993 -56714 -56430 -56121 -55808 -55499 -55186 -52432 -49674 -49782 -49886 -50311 -50736 -51161 -51586 -52786 -53986 -55186
-14760 -55186 -56386 -56080 -55775 -55469 -55163 -55991 -56818 -57645 -58473 -56628 -54783 -57709 -60634 -62248 -63861 -60705 -57548 -57075 -56602
-14741 -56602 -56129 -55655 -58998 -62341 -62822 -63302 -62706 -62110 -61514 -60917 -60977 -61037 -61454 -61871 -59054 -61961 -64868 -62050 -60068 -58085
-14721 -58085 -55745 -53404 -54347 -55290 -56233 -57176 -55734 -54291 -54280 -54269 -57448 -60627 -62732 -59114 -59192 -59270 -54698 -50125 -51836 -53546
-14701 -53546 -50963 -48381 -51463 -54545 -54288 -54031 -54742 -55454 -57597 -59740 -60750 -61760 -60384 -59009 -61316 -63623 -63545 -63466 -60586
-14682 -60586 -57705 -57209 -56714 -57694 -58674 -57269 -55864 -54757 -53650 -54929 -56207 -54601 -52995 -53773 -54552 -54944 -55335 -54295 -53255
-14663 -53255 -53632 -54008 -54385 -54761 -56360 -57958 -59557 -61156 -60601 -60045 -59490 -58935 -59989 -61044 -58760 -56475 -56158 -55842 -56956
-14644 -56956 -58070 -57098 -56125 -55152 -54180 -55085 -55987 -56893 -57794 -57388 -56978 -56572 -56162 -58186 -60206 -62229 -64249 -62099 -59945 -57794
-14624 -57794 -55640 -56714 -57783 -58857 -59926 -59688 -59445 -59207 -58965 -57355 -55741 -54131 -52518 -52488 -52454 -55763 -59069 -58312 -57556
-14605 -57556 -56799 -56043 -58924 -61804 -61346 -60888 -60131 -59375 -58618 -57862 -56300 -54739 -53177 -51616 -51929 -52242 -52555 -52868 -54493 -56117
-14585 -56117 -57742 -59367 -58085 -56803 -55521 -54239 -53822 -53404 -52987 -52570 -55421 -58271 -57783 -57295 -55316 -53337 -53744 -54150 -54444
-14566 -54444 -54739 -55033 -55327 -57649 -59971 -58953 -57936 -56960 -55983 -55007 -54031 -53680 -53330 -52980 -52629 -53315 -54001 -54686 -55372 -52898
-14546 -52898 -50423 -50334 -50244 -48757 -47267 -49119 -50967 -52014 -53058 -54105 -55149 -56576 -57999 -57042 -56080 -55629 -55175 -57109 -59039
-14527 -59039 -58607 -58171 -60124 -62073 -61402 -60727 -62442 -64152 -64160 -64163 -62740 -61312 -58816 -56315 -55249 -54180 -53766 -53352 -51686 -54791
-14507 -54791 -56434 -58078 -60019 -61961 -60712 -59464 -56785 -54105 -51366 -48627 -50181 -51735 -52346 -52954 -53565 -54172 -51951 -49726
-14489 -49726 -50844 -51959 -51183 -50404 -51060 -51713 -53144 -54571 -55644 -56714 -61510 -60582 -60012 -59442 -59378 -59315 -57821 -56326 -57657
-14470 -57657 -58987 -60317 -61648 -61994 -62341 -59825 -57310 -56654 -55994 -55339 -54679 -52681 -50680 -48325 -51690 -52667 -53639 -56404 -59166
-14451 -59166 -61484 -63798 -61704 -59606 -56874 -59863 -59632 -59401 -59859 -60314 -57906 -55499 -55674 -55845 -57448 -59050 -60448 -61842
-14433 -61842 -60373 -58905 -60198 -61488 -62777 -64066 -60500 -56930 -56222 -55514 -55667 -55816 -54534 -53252 -53941 -54627 -53881 -53136 -54139
-14414 -54139 -55137 -58998 -62859 -61804 -60746 -59688 -58629 -57821 -57008 -56196 -55383 -53322 -51258 -52055 -52853 -52689 -52521 -52354 -52186
-14395 -52186 -50889 -49588 -48288 -46987 -48239 -49488 -50736 -51985 -52432 -52875 -51888 -50900 -49831 -48761 -50554 -52342 -53330 -54317
-14377 -54317 -55305 -56289 -57724 -59158 -57731 -56300 -55588 -54876 -54165 -53449 -52708 -51966 -54086 -56203 -54686 -53170 -51653 -50132 -50382
-14358 -50382 -50632 -50882 -51127 -53255 -55383 -57511 -59635 -58398 -57161 -57355 -57545 -58633 -59721 -57947 -56170 -54493 -52816 -52570
-14340 -52570 -52320 -54727 -57135 -56680 -56222 -56084 -55946 -55808 -55667 -56751 -57835 -58920 -60001 -58797 -57593 -57821 -58044 -59375 -60705
-14321 -60705 -59173 -57638 -56941 -56240 -60016 -63787 -64789 -61018 -61186 -64212 -62881 -61547 -58965 -56378 -54452 -52521 -55365
-14304 -55365 -58204 -55678 -53147 -52052 -50952 -53047 -55137 -55801 -56460 -56885 -57306 -56300 -55290 -56311 -57329 -58350 -59367 -58953
-14286 -58953 -58540 -58126 -57709 -56878 -56043 -55212 -54377 -50647 -46916 -49864 -52808 -54444 -56076 -57712 -59345 -57388 -55432 -56337 -57239
-14267 -57239 -58145 -59047 -57090 -55130 -55312 -55495 -55678 -55857 -57440 -59020 -59173 -59322 -59252 -59181 -61972 -64763 -64543 -64323 -61242 -58160
-14247 -58160 -60623 -63086 -62688 -62289 -60429 -58570 -58141 -57712 -56240 -54765 -56155 -57541 -59348 -61152 -58189 -55223 -55190 -55152 -56550
-14228 -56550 -57943 -56628 -55309 -56676 -58040 -59490 -58078 -56367 -57519 -61175 -60060 -57157 -57112 -58093 -56211 -54329 -55309 -58376
-14210 -58376 -58581 -57712 -56840 -57034 -57224 -57418 -57608 -58875 -60138 -58540 -56941 -56837 -56729 -56624 -56516 -57068 -57616 -57984 -58353 -58361 -55503
-14189 -55503 -54437 -53367 -53196 -55883 -56963 -58040 -59330 -60616 -59043 -54604 -52495 -55152 -57813 -60470 -60589 -60705 -58141
-14172 -58141 -55573 -53009 -53304 -56464 -56758 -56773 -56785 -55547 -51444 -50624 -52663 -52916 -53166 -52085 -51001 -52603 -54202 -56162 -55257
-14153 -55257 -55965 -56669 -56289 -55905 -53915 -54783 -58994 -63202 -62822 -62438 -60839 -59237 -57638 -56035 -55689 -55339 -54992 -54642 -54325 -54004
-14133 -54004 -53867 -53725 -53050 -55234 -55812 -56386 -55648 -54906 -54168 -53427 -54001 -54571 -55324 -56073 -54634 -56054 -57657 -56393 -56147 -58760
-14113 -58760 -59766 -60768 -58905 -59900 -59468 -59032 -58778 -61383 -63992 -63735 -61693 -59647 -57247 -54843 -56021 -54332 -52648 -53822
-14095 -53822 -53796 -53766 -53919 -54068 -53624 -53177 -52734 -52286 -52477 -52663 -52853 -53039 -53229 -53416 -53606 -53792 -54109 -54422 -54739 -55052 -56740 -58424
-14073 -58424 -55342 -52257 -53744 -55227 -56714 -58197 -58551 -58901 -59255 -59606 -58894 -58178 -57466 -56751 -58305 -59855 -58547 -57235 -58052
-14054 -58052 -58864 -56818 -54768 -55346 -55920 -53934 -51944 -46834 -46495 -51582 -53807 -55614 -54560 -54936 -55312 -55085 -54858 -54631 -54403
-14035 -54403 -57217 -60030 -58074 -56117 -57698 -59278 -63541 -63034 -58652 -54269 -52450 -50632 -51541 -52450 -53360 -54269 -55894 -57519
-14017 -57519 -56281 -55044 -55737 -56427 -59982 -58763 -55104 -54303 -54459 -54612 -51377 -48139 -49674 -51206 -51847 -52484 -50263 -48038
-13999 -48038 -48012 -47982 -47956 -47926 -47662 -47393 -49991 -52585 -53088 -53587 -54090 -54590 -56524 -58454 -57526 -56594 -57071 -57545 -58022 -58495 -58435 -58372 -58312
-13976 -58312 -58249 -57414 -56576 -55741 -54903 -54843 -54780 -54720 -54657 -53606 -52555 -54366 -56177 -54768 -53360 -51951 -50542 -50296 -50050 -52667 -55283
-13955 -55283 -55216 -55149 -55081 -55014 -54828 -54642 -54455 -54269 -54440 -54612 -54783 -54955 -56960 -58965 -60970 -62974 -60925 -58875 -59688 -60500 -61532
-13934 -61532 -62565 -60735 -58905 -58447 -57988 -57530 -57071 -54049 -51027 -50867 -50706 -52991 -55275 -54698 -54120 -52797 -51474 -53013 -54552
-13915 -54552 -56509 -58465 -57560 -56654 -56449 -56244 -56039 -55834 -56762 -57690 -58618 -59546 -59065 -58584 -58104 -57623 -56367 -55111 -53855 -52599
-13895 -52599 -51895 -51191 -55257 -59322 -58916 -58510 -58104 -57698 -57664 -57630 -57597 -57563 -56934 -56304 -55674 -55044 -55003 -54962 -54921 -54880 -54839 -54798 -54757 -54716 -53501
-13870 -53501 -52283 -51068 -49849 -51795 -53736 -52819 -51899 -51929 -51955 -51985 -52011 -52518 -53021 -53527 -54031 -55037 -56039 -54183 -52324 -52913
-13850 -52913 -53498 -54086 -54672 -54276 -53878 -53483 -53084 -54239 -55391 -56546 -57698 -57943 -58189 -58435 -58681 -58570 -58458 -58346 -58234 -58167 -58100
-13829 -58100 -58033 -57966 -57541 -57116 -59553 -61991 -63731 -65471 -62442 -59412 -58171 -56930 -55689 -54448 -55190 -55931 -56673 -57414 -55950
-13810 -55950 -54485 -55585 -56684 -59438 -57422 -55406 -58160 -60258 -62356 -61890 -61424 -59341 -57258 -58037 -58816 -57984 -57153 -56322
-13792 -56322 -55491 -55089 -54686 -57146 -59606 -58905 -58204 -57504 -56803 -55946 -55089 -57094 -54329 -52160 -52853 -56110 -56505 -56606 -56703 -58532
-13772 -58532 -57496 -56822 -60914 -64830 -63973 -62151 -60325 -55521 -55484 -56524 -57560 -58898 -60232 -60768 -61301 -61838 -57601 -55037
-13754 -55037 -55331 -58372 -58547 -56967 -58245 -60601 -62952 -62684 -62412 -62143 -61871 -59699 -57522 -58212 -58898 -61316 -63731 -61379 -59024
-13735 -59024 -60459 -61890 -60463 -59032 -59751 -60466 -61186 -61901 -61022 -60138 -59259 -58376 -57854 -57329 -56807 -56281 -55864 -55443 -55026 -54604 -56453
-13714 -56453 -58298 -55376 -52450 -52331 -52208 -54951 -57690 -57720 -57746 -56345 -54940 -54672 -54399 -56993 -59583 -62147 -64707 -62501 -60291
-13695 -60291 -60463 -60630 -57940 -55245 -54821 -54392 -56829 -59263 -61089 -62911 -61875 -60835 -59442 -58044 -59512 -60977 -61111 -61242
-13677 -61242 -58514 -55782 -57019 -58253 -58059 -57862 -58905 -59945 -58126 -56304 -56453 -56598 -55316 -54031 -53967 -53900 -53837 -53770 -56151 -58529
-13657 -58529 -58048 -57563 -56188 -54809 -54865 -54917 -55242 -55562 -55886 -56207 -58301 -60392 -57716 -55037 -55074 -55108 -56576 -58040 -58391 -58737 -59088
-13636 -59088 -59434 -58950 -58462 -56546 -54627 -55626 -56621 -54757 -52890 -52905 -52916 -52931 -52942 -54180 -55413 -56650 -57884 -55871 -53855 -53274
-13616 -53274 -52689 -55026 -57362 -56837 -56311 -54862 -53412 -54824 -56237 -58230 -60224 -59356 -58488 -57381 -56274 -55167 -54060 -53982
-13598 -53982 -53904 -53826 -53747 -55875 -58003 -57269 -56535 -55428 -54321 -53214 -52108 -52849 -53591 -54332 -55074 -54720 -54362 -54008 -53650 -53267 -52879
-13577 -52879 -53926 -54970 -57925 -60876 -59061 -57243 -56412 -55577 -54746 -53911 -54895 -55875 -56859 -57839 -54262 -50680 -51873 -53062 -53732
-13558 -53732 -54399 -53639 -52875 -53129 -53378 -52499 -51616 -48836 -50826 -54783 -55879 -54560 -56103 -58719 -61335 -60455 -59576 -58696 -57817
-13539 -57817 -59382 -60947 -62512 -64078 -63362 -62643 -61927 -61208 -60493 -59773 -59058 -58339 -58048 -57753 -57463 -57168 -56341 -55510 -54683 -53852 -54418
-13518 -54418 -54981 -55544 -51336 -50140 -51806 -52995 -54183 -55152 -56117 -54519 -52920 -51947 -55745 -58469 -58331 -58786 -59240 -59516 -59788
-13499 -59788 -57291 -54791 -55156 -55517 -55972 -56427 -55450 -54470 -52689 -50904 -55801 -60694 -58107 -55521 -55797 -56073 -57303 -58532 -56900
-13480 -56900 -55268 -54888 -54508 -55081 -58517 -58734 -54180 -53740 -56162 -56363 -56565 -56945 -57325 -56721 -56117 -55514 -54910 -56199 -57489 -57347
-13460 -57347 -57206 -54351 -51496 -53412 -55327 -56281 -57232 -58186 -59136 -57019 -54899 -55163 -55428 -54914 -54396 -53881 -53363 -52998 -52629 -52260
-13440 -52260 -51891 -52782 -53669 -54560 -55447 -55026 -54601 -54176 -53751 -53777 -53799 -53826 -53848 -52562 -51273 -49506 -52510 -55980 -56583 -56594 -53740 -55361
-13418 -55361 -59840 -60150 -60455 -62725 -64991 -63921 -59986 -57187 -59155 -58264 -57370 -57489 -57604 -57724 -57839 -59240 -60638 -58700 -56758
-13399 -56758 -56237 -55711 -55190 -54664 -55722 -56777 -57835 -58890 -59483 -60075 -60668 -61260 -61584 -61909 -62233 -62557 -60608 -58659 -58141 -57623
-13379 -57623 -59967 -62311 -61316 -60321 -60850 -61379 -61909 -62438 -61745 -61052 -61789 -62527 -62945 -63362 -60440 -57519 -58115 -58711 -59307 -59904 -60388
-13358 -60388 -60869 -61353 -61834 -61096 -60355 -59319 -58279 -61633 -60213 -56412 -57377 -59330 -61279 -59237 -57191 -54567 -51940 -52655
-13340 -52655 -53367 -52592 -51813 -53423 -55029 -58883 -62732 -62292 -61849 -58368 -54884 -52834 -50781 -52730 -54679 -58059 -61439 -63865
-13322 -63865 -66291 -63649 -61007 -56442 -54739 -55719 -56699 -56576 -56453 -56509 -56565 -54616 -55529 -58648 -58905 -59341 -56915 -53833 -50751
-13303 -50751 -47967 -49954 -49436 -48918 -50963 -55871 -56486 -54239 -54396 -54552 -54530 -54508 -56542 -58577 -58227 -57876 -58339 -58801 -59442 -57221
-13283 -57221 -56907 -56594 -56103 -55611 -55126 -54642 -54157 -53673 -54530 -55387 -54038 -52689 -51660 -53494 -55327 -54299 -54165 -54031 -52108 -53047
-13263 -53047 -57537 -62028 -64133 -61469 -60802 -60135 -60422 -60709 -62158 -60746 -57903 -57921 -58834 -59747 -60660 -61573 -62986 -61536 -60086
-13244 -60086 -61499 -60496 -59494 -58491 -57489 -55011 -49670 -47669 -48530 -51090 -53650 -54958 -56267 -58480 -60690 -61473 -62252
-13227 -62252 -60768 -59281 -57798 -56311 -55976 -55637 -55301 -54962 -55819 -56673 -58961 -61245 -59069 -56893 -56445 -58860 -61514 -64167
-13209 -64167 -61931 -59695 -58130 -59427 -62155 -62020 -60932 -59844 -58577 -57310 -55491 -53669 -54712 -55752 -55067 -54377 -53870 -50498
-13191 -50498 -51422 -52342 -54519 -56691 -57616 -58536 -59460 -60381 -60083 -59784 -59665 -59546 -59188 -61693 -64197 -63839 -62445 -61052 -59479 -57906
-13171 -57906 -54724 -51541 -49611 -50542 -53278 -56013 -56065 -56117 -55514 -54910 -55916 -54060 -53837 -53613 -53211 -52808 -53390 -53971 -54552 -55134
-13151 -55134 -55119 -55104 -53658 -52212 -51034 -49857 -51541 -53226 -52756 -52286 -51996 -51705 -50401 -51959 -53516 -52212 -53356 -54496 -57071
-13132 -57071 -56781 -55599 -54414 -57645 -60873 -58670 -53602 -51400 -52055 -51552 -51045 -53583 -56117 -54757 -53397 -53647 -53896 -53460
-13114 -53460 -55886 -56881 -55014 -54191 -53367 -52186 -53867 -54057 -54247 -52827 -54269 -56811 -56486 -57955 -59419 -58473 -57522 -55145 -52763
-13095 -52763 -50982 -49197 -48668 -50997 -53300 -55599 -58260 -58055 -58320 -58584 -57418 -56252 -55383 -57377 -59371 -58502 -60720 -62937
-13077 -62937 -60504 -60932 -60765 -60597 -60608 -60619 -59222 -57821 -54813 -54664 -56427 -58186 -58875 -56699 -57440 -58178 -55879 -53576 -53513 -53445
-13057 -53445 -51951 -50453 -50539 -50621 -50885 -51146 -49890 -51493 -53278 -52197 -50680 -52022 -51757 -51489 -49942 -51254 -55432 -56744 -56788
-13038 -56788 -56829 -55264 -53695 -54336 -54973 -57045 -59114 -57153 -55190 -53229 -51265 -50945 -50621 -50121 -49618 -51795 -51105 -52029 -52950
-13019 -52950 -53695 -54437 -55182 -55924 -56199 -56471 -58357 -57377 -57653 -57925 -58022 -58115 -58611 -59106 -59602 -60098 -58953 -57809 -59706 -58741 -56896
-12998 -56896 -55052 -57500 -57086 -56971 -56855 -57992 -59129 -61167 -63202 -62080 -58093 -58909 -59721 -63220 -66716 -64446 -62173 -59904
-12980 -59904 -57630 -57984 -58335 -56900 -58324 -58536 -55886 -55204 -54522 -53065 -54470 -57247 -55253 -52655 -54828 -55808 -53926 -52342
-12962 -52342 -53621 -53110 -52599 -53114 -53624 -55749 -55007 -54329 -53647 -57560 -61469 -62453 -63433 -61733 -60030 -58898 -60623 -62173 -63720
-12943 -63720 -63399 -63075 -62576 -62073 -63362 -61786 -58603 -58279 -57466 -53788 -54765 -55737 -56952 -58163 -57947 -57727 -56043 -54355 -52670
-12924 -52670 -50982 -52905 -54824 -53885 -52942 -51899 -50852 -54578 -58301 -57466 -56628 -57224 -57817 -57493 -57165 -59404 -61640 -60869 -55324
-12905 -55324 -53539 -54612 -55592 -53706 -53613 -53516 -55033 -56546 -55201 -53852 -53423 -52991 -52741 -52488 -52685 -55741 -58801 -58994 -59244 -59490
-12885 -59490 -56520 -56408 -57910 -59408 -58107 -53941 -53721 -56363 -55786 -55208 -58089 -60970 -59080 -57187 -57399 -57612 -57466 -60183
-12867 -60183 -62006 -60966 -60463 -59956 -57314 -57534 -58827 -55350 -55719 -56088 -56158 -56226 -54865 -53505 -50535 -50427 -51213 -51999 -52965 -53926
-12847 -53926 -54086 -54243 -54224 -54202 -56330 -55592 -54858 -56982 -57127 -57269 -57593 -57914 -58119 -58320 -57273 -53360 -53483 -53602 -53725 -53844 -52834
-12826 -52834 -54683 -56535 -55521 -55771 -56017 -57876 -56870 -55868 -57724 -57794 -57862 -57567 -57273 -56978 -56680 -56982 -57280 -57582 -57880 -58055
-12806 -58055 -58230 -58406 -58577 -57500 -56419 -55342 -54262 -56811 -59360 -59047 -58730 -56866 -54999 -55998 -56993 -58201 -59408 -60616
-12788 -60616 -61819 -61178 -60534 -59893 -59248 -58324 -57399 -56475 -55551 -55462 -55372 -55283 -55193 -54746 -54299 -53852 -53404 -53404 -53404 -54835 -56267 -55696 -55126 -57418
-12764 -57418 -59710 -60929 -62147 -61935 -61722 -61115 -60507 -59900 -59293 -58775 -58257 -57739 -57221 -56326 -55428 -57392 -59356 -59114 -58871 -58629
-12744 -58629 -58387 -57850 -57310 -56770 -56229 -55689 -55149 -54608 -54068 -54686 -55301 -55916 -56531 -56550 -56568 -56587 -56606 -57127 -57645 -58163 -58681 -59259 -59837
-12721 -59837 -57552 -55268 -55428 -55585 -55745 -55901 -55197 -54489 -52354 -50214 -49570 -48921 -53047 -57168 -58670 -60168 -58808 -57444 -56162
-12702 -56162 -54876 -55026 -55171 -57258 -59341 -62680 -61245 -60053 -58857 -56233 -53606 -51817 -54794 -56703 -55745 -57731 -59717
-12685 -59717 -61525 -63332 -60548 -57765 -57843 -57917 -57906 -57895 -57884 -57873 -55178 -52484 -56468 -60448 -61618 -62788 -61096 -59404 -57235 -55067
-12665 -55067 -52898 -50725 -52700 -54675 -56650 -58625 -61495 -64365 -62464 -60560 -60090 -59620 -59151 -58681 -56960 -55238 -56378 -57519
-12647 -57519 -58584 -59650 -57854 -56058 -57839 -59620 -61402 -63183 -62572 -61961 -61350 -60738 -58696 -56654 -57474 -58294 -61976 -65658
-12629 -65658 -66478 -67297 -62095 -56893 -56103 -55312 -57653 -54265 -50882 -53218 -53352 -53483 -53975 -54463 -55238 -56009 -56785 -57556 -58689 -59818
-12609 -59818 -60951 -62080 -61491 -60899 -60310 -59717 -59725 -59729 -59736 -59740 -59337 -58931 -58529 -58122 -59926 -61726 -60668 -59606 -58912 -58219 -57526 -56833 -55961
-12586 -55961 -55089 -54217 -53345 -53710 -54075 -54440 -54806 -56960 -59114 -58406 -57698 -55037 -52376 -52577 -52778 -53397 -54016 -54634 -55253 -54090
-12566 -54090 -52927 -54627 -56326 -55819 -55312 -54806 -54299 -53751 -53203 -52655 -52108 -54064 -56021 -57977 -59934 -59893 -59852 -59811 -59770 -59550 -59330
-12545 -59330 -56248 -53166 -52767 -52368 -51970 -51571 -51172 -50773 -53237 -55700 -58074 -60448 -62822 -65196 -64350 -63504 -62658 -61812 -60738
-12526 -60738 -59661 -55726 -51787 -53814 -55838 -55003 -54165 -54835 -55503 -56173 -56840 -55067 -53289 -54377 -55462 -55260 -55055 -57716 -60373
-12507 -60373 -62676 -64976 -62509 -60038 -61193 -62345 -58730 -55111 -54299 -53483 -52670 -51854 -53699 -55544 -54526 -53509 -54936 -56363
-12489 -56363 -57791 -59218 -59512 -59807 -60101 -60396 -58424 -56453 -54481 -52510 -52290 -52070 -51850 -51631 -55823 -60016 -57530 -55044 -55987
-12470 -55987 -56930 -55011 -53091 -53676 -54262 -54847 -55432 -55275 -55115 -54958 -54798 -57325 -59848 -62374 -64897 -66008 -67115 -63455 -59792
-12451 -59792 -57504 -55212 -52924 -50632 -51645 -52655 -53669 -54679 -53427 -52171 -55689 -59203 -61215 -63224 -62374 -61521 -63116
-12434 -63116 -64707 -63619 -62527 -60936 -62203 -63474 -61879 -63060 -64238 -62378 -60515 -60839 -61160 -61663 -59300 -58462 -57619 -56244
-12416 -56244 -57727 -59013 -57433 -57824 -55350 -54131 -52909 -49723 -49395 -47229 -42198 -42299 -45258 -47893 -53386 -56199 -56147 -55312
-12398 -55312 -54474 -50419 -49223 -47613 -46000 -46000 -45996 -49402 -52804 -53349 -53889 -54880 -55868 -56859 -57847 -58726 -59602 -57440 -55275 -56244 -54347
-12377 -54347 -54064 -53777 -55871 -57962 -60235 -59643 -59382 -59117 -59632 -63004 -66362 -64946 -61625 -58301 -55845 -53386 -55521 -57653
-12359 -57653 -59512 -58506 -57683 -56855 -57105 -57351 -54560 -54627 -55316 -56002 -55260 -57377 -58603 -59825 -61409 -60127 -59572 -59013 -61141
-12340 -61141 -63265 -60534 -57798 -57929 -58055 -58305 -58555 -58804 -59054 -58707 -58361 -55331 -57071 -58342 -59613 -59572 -62393 -63425 -64458
-12321 -64458 -65669 -66880 -65989 -65095 -61342 -57586 -56934 -56278 -56878 -60336 -57507 -54675 -56915 -62013 -62464 -60049 -59427 -58801 -58980
-12302 -58980 -59158 -59337 -59516 -59695 -59874 -60053 -60232 -61119 -62006 -62892 -63779 -63235 -62691 -59285 -60649 -62904 -62292 -58942 -52726 -48362
-12282 -48362 -50673 -53703 -53867 -53811 -56613 -62997 -64607 -64551 -61629 -56982 -55193 -55186 -55175 -53915 -52652 -52614 -52573 -53967 -55357 -56587
-12262 -56587 -57813 -59043 -60269 -58488 -56703 -57783 -58860 -62751 -66638 -67666 -68691 -65278 -61860 -59878 -57891 -55223 -52551
-12245 -52551 -52745 -52935 -53785 -54631 -55659 -56684 -55652 -57481 -58953 -55655 -53699 -51742 -54258 -56773 -57172 -57571 -57970 -58368 -57366
-12226 -57366 -56363 -56792 -57221 -55965 -54709 -56315 -57921 -56934 -55946 -54958 -53971 -53669 -53367 -53065 -52763 -53117 -53472 -53826 -54180 -56121
-12206 -56121 -58063 -57142 -56222 -53930 -51638 -52208 -52778 -53073 -53367 -56524 -59680 -59617 -59553 -62352 -65151 -63157 -61163 -56308 -51452
-12187 -51452 -52141 -52831 -54951 -57071 -56934 -56796 -57135 -54612 -51731 -53621 -53900 -54180 -56449 -55853 -53352 -50848 -47691 -41669 -28674
-12168 -28674 -7090 21795 44005 38427 14725 -7727 -27314 -39989 -49797 -53632 -52693 -48060 -48195 -51940 -52819 -54180
-12152 -54180 -55536 -57209 -58879 -60552 -62222 -62196 -62166 -60530 -61752 -60694 -59632 -58752 -57869 -58301 -58730 -59162 -59591 -58160 -56725
-12133 -56725 -55294 -53859 -56125 -58387 -58268 -58145 -56386 -54623 -54474 -54321 -53397 -55331 -55659 -55983 -54187 -52387 -50412 -48433
-12115 -48433 -54746 -58193 -57053 -55909 -54880 -53848 -54549 -58107 -57794 -57478 -57522 -57563 -56289 -57873 -59639 -58540 -56550 -57418 -56501
-12096 -56501 -55581 -55849 -56114 -56382 -56647 -55126 -53602 -52260 -50915 -50289 -52521 -51359 -53054 -55469 -55018 -54452 -56744 -58957 -56397
-12077 -56397 -56703 -57004 -57608 -58208 -58812 -59412 -59561 -59706 -59676 -59643 -61372 -60235 -60534 -60828 -59270 -54847 -54601 -54351 -53479 -55465 -55667
-12056 -55667 -55864 -56177 -53624 -52864 -52100 -53904 -58566 -58581 -51914 -49849 -53509 -59315 -59393 -57686 -58842 -62024 -62341 -59546 -56751
-12037 -56751 -56580 -62129 -61719 -58447 -59527 -60604 -62475 -64346 -61924 -59498 -55734 -51970 -51545 -51116 -52436 -53755 -55074 -56389
-12019 -56389 -56516 -56643 -54385 -52122 -53367 -54608 -55849 -57090 -55443 -53792 -52141 -50490 -50617 -50740 -50863 -50986 -53826 -56662
-12001 -56662 -56158 -55655 -55756 -55853 -55950 -56047 -53673 -51295 -54165 -57034 -60012 -62986 -59758 -56531 -57481 -58428 -56989 -55551 -56427 -57299
-11981 -57299 -55786 -54273 -53628 -52980 -55312 -57645 -59982 -56591 -53021 -55175 -55931 -53822 -53501 -56043 -56080 -56114 -58711 -61309 -58722
-11962 -58722 -56132 -53542 -50952 -51019 -51083 -51146 -51209 -52231 -53248 -52834 -52421 -55935 -59449 -59624 -59796 -59583 -59371 -59158 -58942 -59356 -59770
-11941 -59770 -57798 -55823 -54835 -53848 -55186 -59382 -64014 -62922 -59445 -61689 -63936 -63321 -63243 -63161 -63418 -63675 -62501 -61324 -59524
-11922 -59524 -57724 -58309 -58890 -59214 -59535 -59859 -60179 -61428 -62673 -61059 -59442 -59579 -59714 -59852 -59986 -58454 -56919 -55387 -53852
-11903 -53852 -55942 -58029 -57258 -56483 -53028 -49570 -49812 -54821 -58804 -58014 -58599 -62043 -62091 -62136 -59382 -61394 -65650 -65132 -64733
-11884 -64733 -64335 -64596 -64853 -65110 -65367 -62557 -59743 -59792 -59840 -60071 -60299 -60526 -60753 -61797 -62837 -63578 -64320 -66615 -64137 -62553
-11864 -62553 -63832 -63936 -61175 -60202 -59229 -58439 -57645 -56852 -56058 -57478 -58894 -60314 -61730 -60824 -59915 -59009 -58100 -56658 -55212
-11845 -55212 -56632 -58048 -59110 -60168 -58368 -56565 -56956 -57344 -59643 -59076 -55950 -57589 -59233 -60873 -63142 -65408 -64815 -61357
-11827 -61357 -58022 -59453 -59635 -56952 -54862 -52771 -55271 -57768 -56274 -54780 -53285 -51787 -52558 -53330 -54101 -54869 -53852 -52834
-11809 -52834 -51817 -50796 -52260 -53725 -55190 -56650 -57101 -57552 -60865 -64174 -64670 -65166 -65661 -66153 -65814 -65475 -65136 -64793 -66612
-11790 -66612 -68427 -67383 -66336 -63742 -61145 -58551 -55953 -54992 -54027 -57478 -60925 -63362 -60071 -60004 -59934 -59993 -60049 -60109 -60165 -60284
-11770 -60284 -60399 -56941 -59203 -62997 -61063 -57940 -54813 -52227 -49637 -50270 -50900 -49287 -53397 -57150 -60902 -60302 -59702 -56240
-11752 -56240 -52778 -54437 -56095 -57932 -59770 -62143 -67379 -67726 -62348 -60735 -61983 -61264 -60545 -59587 -58629 -57671 -56714 -56054 -55394
-11733 -55394 -54735 -54075 -55026 -55976 -56926 -57876 -59073 -60265 -58599 -56930 -55264 -53595 -54791 -55983 -56561 -57135 -57712 -58286 -57970
-11714 -57970 -57649 -57332 -57012 -57686 -58361 -59035 -59710 -61935 -64160 -61614 -59069 -58409 -57750 -59952 -62155 -61137 -60120 -61965 -63809
-11695 -63809 -59930 -56047 -56937 -57824 -55435 -53043 -53516 -53986 -54467 -54944 -55424 -55901 -55249 -54593 -53941 -53285 -55029 -56773 -58517 -60261
-11675 -60261 -60396 -60530 -60664 -60798 -62408 -64018 -60858 -57698 -54955 -52212 -52331 -52450 -51474 -50498 -52383 -54269 -53650 -53032 -52413
-11656 -52413 -51795 -53024 -54254 -55484 -56714 -58927 -61141 -61924 -62706 -64346 -65986 -64763 -63541 -62736 -61931 -63988 -66045 -66105
-11638 -66105 -66164 -64793 -63422 -61186 -58950 -56714 -54478 -58376 -62270 -61398 -60522 -61022 -61517 -62017 -62512 -61655 -60794 -59937 -59076 -56967
-11618 -56967 -54854 -55607 -56356 -57057 -57753 -60362 -60105 -57705 -60071 -61368 -59799 -58294 -59647 -59214 -58778 -59539 -60295 -61055 -61812
-11599 -61812 -58890 -55968 -55909 -55849 -56445 -57042 -57638 -58234 -57802 -57370 -56937 -56505 -55417 -54329 -53419 -57280 -60314 -63347 -63817 -64286
-11579 -64286 -64577 -64868 -65158 -65449 -67200 -68952 -67841 -66731 -64398 -62065 -61163 -60261 -60970 -61674 -62382 -63086 -63675 -64260 -63418 -62572
-11559 -62572 -64487 -66399 -65453 -64502 -64420 -64335 -62822 -61305 -61924 -62538 -64588 -66634 -66060 -65483 -64909 -64331 -59866 -55398 -55704 -56006
-11539 -56006 -58965 -61920 -60109 -58294 -58547 -58797 -57619 -56438 -56363 -56285 -56211 -56132 -55238 -54340 -53445 -52547 -53889 -55227 -57999 -60768
-11519 -60768 -62729 -64685 -63783 -62878 -62304 -61726 -60973 -60217 -59255 -55428 -52857 -56006 -56833 -57657 -55980 -54299 -54996 -55693 -56389 -57086
-11499 -57086 -55458 -53829 -55063 -56296 -58842 -61387 -61070 -60753 -59006 -57258 -55510 -53762 -55517 -57273 -59028 -60783 -60750 -60716
-11481 -60716 -60683 -60649 -60370 -60090 -59811 -59531 -58894 -58257 -57619 -56982 -57433 -57884 -58335 -58786 -61741 -64696 -62881 -61066 -62352 -63638 -62061
-11460 -62061 -60485 -60220 -59956 -59691 -59427 -59170 -58912 -58655 -58398 -56680 -54962 -58014 -61066 -60459 -59852 -57813 -55775 -56688 -57601 -58871
-11440 -58871 -60142 -54616 -54813 -56561 -58309 -58148 -57988 -60690 -63392 -63962 -64532 -68322 -66388 -64365 -62341 -62822 -63302 -62755 -62207
-11421 -62207 -60228 -58249 -52484 -46719 -38271 -29822 -25578 -24195 -24661 -30851 -37488 -44125 -49510 -54895 -55708 -53658 -56199
-11404 -56199 -61603 -62684 -60902 -58048 -55193 -55640 -56088 -56535 -56982 -57429 -57876 -56714 -58413 -59017 -59620 -58793 -60828 -62803 -64778
-11385 -64778 -62341 -59904 -57027 -57012 -58249 -59486 -60127 -60768 -61230 -61693 -64283 -64007 -60694 -60239 -61517 -59930 -57273 -54612 -55421
-11366 -55421 -56226 -57034 -57839 -58976 -60109 -61066 -62020 -63850 -62818 -59281 -60515 -63627 -66738 -63470 -60202 -57224 -54247 -52521
-11348 -52521 -53658 -54556 -55454 -56531 -57608 -58122 -58637 -62013 -65389 -66560 -67730 -67469 -67208 -66895 -66582 -64838 -63094 -62989 -62885
-11329 -62885 -62960 -60172 -55495 -50814 -48046 -50043 -52372 -54698 -55715 -59591 -58648 -57701 -56639 -55573 -56300 -52253 -49462 -49529
-11311 -49529 -50144 -53617 -55484 -57347 -56591 -52968 -53822 -54672 -53587 -52499 -54098 -55693 -58007 -57455 -58517 -59576 -58204 -56829
-11293 -56829 -58320 -59807 -62401 -64991 -62933 -63735 -64584 -62568 -63955 -65337 -64100 -65721 -64484 -63243 -61063 -61745 -63500
-11276 -63500 -65255 -66027 -63936 -64528 -67983 -67950 -65054 -63947 -62840 -61376 -59911 -58447 -56982 -57347 -57712 -58078 -58443 -56572 -54701
-11257 -54701 -57601 -60500 -60865 -61230 -62729 -64227 -67007 -65017 -61238 -60321 -62192 -64063 -63250 -62438 -62222 -62006 -61968 -61931 -60314
-11238 -60314 -61558 -63220 -62020 -56676 -58011 -56840 -55670 -56144 -56617 -59773 -62930 -66176 -66560 -65691 -64823 -63813 -62803 -64476
-11220 -64476 -66150 -66213 -63414 -59542 -55670 -52763 -52715 -53922 -55126 -55529 -55927 -54899 -53867 -54694 -55517 -56166 -56811 -58413 -57150
-11201 -57150 -55890 -57489 -55596 -53699 -53416 -53129 -53412 -53691 -55227 -59620 -59866 -60109 -57671 -55231 -57176 -59117 -56293 -53464
-11183 -53464 -53840 -54217 -53162 -52104 -53464 -54821 -53140 -54317 -53993 -53669 -54955 -56237 -56747 -57254 -56334 -55409 -56330 -57250 -56740
-11164 -56740 -56226 -56311 -56393 -54571 -55607 -59978 -59579 -57273 -54962 -55667 -56367 -55462 -54552 -55685 -53952 -53833 -58480 -58570 -55793 -54925
-11144 -54925 -54057 -52715 -51370 -52890 -54407 -55629 -56848 -58066 -59285 -59114 -58939 -58946 -58950 -58778 -61465 -64152 -63977 -65237 -66492
-11125 -66492 -64711 -62926 -62039 -61148 -57396 -53643 -53360 -53073 -55648 -58223 -57940 -57653 -57366 -57079 -57824 -58566 -59486 -60407 -60496 -63444
-11105 -63444 -61920 -60396 -61603 -62807 -65442 -65214 -65229 -62378 -59348 -59181 -58398 -57612 -57183 -56755 -56270 -58644 -59408 -60172 -59252 -58331
-11085 -58331 -57411 -56490 -55271 -54053 -55696 -52570 -51016 -52324 -52022 -51720 -50882 -54813 -58745 -57906 -58462 -59017 -57664 -59173 -61577
-11066 -61577 -63981 -65311 -63779 -61353 -58927 -54712 -53360 -54392 -55424 -58245 -58204 -55756 -53308 -53542 -53773 -54426 -55078 -55730
-11048 -55730 -56378 -57336 -58294 -59252 -60206 -61163 -62121 -63079 -64033 -62643 -61253 -60042 -58827 -55111 -54258 -56386 -58510 -59453 -57534
-11029 -57534 -57224 -56911 -59404 -61897 -61529 -61156 -59673 -58189 -56706 -55219 -57493 -59766 -62039 -64309 -62743 -61178 -62296 -58640
-11011 -58640 -57671 -56703 -55435 -54165 -55529 -56893 -58257 -59617 -60623 -61629 -62635 -63638 -61625 -59613 -57601 -55585 -55659 -55734
-10993 -55734 -56762 -60649 -63779 -62140 -60500 -58857 -56203 -53550 -53758 -53963 -53799 -53635 -56334 -59028 -60832 -62635 -61577 -60515
-10975 -60515 -59926 -59337 -58748 -58156 -57984 -57813 -57642 -57466 -57258 -57049 -56840 -56628 -54809 -52991 -54034 -55074 -56401 -57727 -59054 -60381
-10955 -60381 -59799 -59218 -55775 -52331 -53434 -54537 -55640 -56744 -55879 -55014 -57012 -59009 -60228 -61447 -59803 -58160 -58663 -59166
-10937 -59166 -59669 -60172 -59579 -58987 -58394 -57802 -58700 -59598 -60496 -61394 -59594 -57794 -55875 -58726 -63008 -62520 -60243 -57966 -58104 -58242
-10917 -58242 -58380 -58517 -58536 -58555 -61435 -64316 -64234 -64152 -64070 -63988 -64323 -64659 -62132 -59606 -56229 -52853 -52339 -51824 -51608 -51392 -51176 -50960
-10895 -50960 -54638 -58316 -59132 -59945 -60105 -60265 -60425 -60582 -59699 -58816 -57932 -57045 -56848 -56650 -54843 -55894 -56896 -57899 -58633 -57932
-10875 -57932 -54999 -54929 -58734 -61104 -59758 -58413 -59751 -61085 -58160 -53803 -55231 -59516 -61357 -61767 -62207 -59784 -55752 -56490
-10857 -56490 -58927 -58502 -59620 -62170 -65166 -63392 -62930 -65330 -65196 -63630 -64018 -64406 -64704 -65002 -65986 -66969 -65091 -63213 -63258
-10838 -63258 -63302 -63347 -63392 -62602 -61812 -61022 -60232 -59613 -58994 -60254 -62945 -63399 -60992 -58674 -59218 -57988 -56758 -58570 -60381 -60999
-10818 -60999 -61618 -62237 -62855 -63496 -64137 -61916 -59695 -58189 -56684 -55178 -53673 -52823 -51973 -53986 -55998 -54612 -53226 -56788
-10800 -56788 -60351 -61763 -66038 -67540 -66179 -62464 -60179 -60668 -59725 -59825 -61357 -60563 -59770 -58767 -57765 -55331 -52898 -53296
-10782 -53296 -53695 -56777 -59859 -60914 -59106 -57120 -57996 -59811 -58763 -56285 -56669 -59110 -58689 -55585 -55342 -54008 -52674 -51519
-10764 -51519 -50364 -53919 -57474 -62639 -64938 -62650 -60362 -60757 -61152 -61666 -62181 -59654 -59986 -60906 -61827 -61495 -61163 -59609 -58055
-10745 -58055 -56501 -54944 -54016 -53088 -53591 -54094 -54746 -55398 -53367 -51332 -49223 -49972 -51977 -53978 -54970 -55957 -56770 -57578 -56587 -52730
-10725 -52730 -50486 -48239 -50736 -53229 -54295 -55357 -57291 -59222 -57996 -53904 -51217 -48526 -46913 -48157 -47557 -46954 -49395
-10708 -49395 -51832 -53617 -55398 -57183 -58965 -59061 -59155 -54657 -50159 -51265 -55234 -54731 -54228 -52491 -50751 -51694 -52637 -53758 -52018
-10689 -52018 -51709 -51400 -52801 -51336 -53270 -52342 -53322 -57165 -60828 -61629 -59632 -57630 -55450 -53270 -51597 -49924 -49324 -51586
-10671 -51586 -54847 -55245 -54213 -56043 -60705 -62505 -59714 -59784 -59870 -59956 -60042 -60127 -58573 -54157 -51530 -53673 -54958 -56244 -59259
-10652 -59259 -57504 -56017 -57392 -56859 -56326 -55935 -55544 -55152 -54761 -54519 -54276 -54034 -53792 -52987 -52178 -53755 -55331 -56315 -57295 -58275
-10632 -58275 -59255 -58376 -57493 -58994 -60496 -57440 -54381 -53706 -53032 -54582 -56129 -56244 -56360 -57821 -59278 -60735 -62192 -59002
-10614 -59002 -55808 -58816 -61823 -61346 -60865 -60384 -59904 -59613 -59319 -59028 -58734 -59427 -60116 -60809 -61499 -59993 -58484 -59363 -60239 -60224 -60206
-10593 -60206 -58760 -57310 -56758 -56207 -55655 -55104 -56848 -58592 -56997 -55402 -56267 -57131 -56565 -55998 -57310 -58622 -56594 -54567 -54593
-10574 -54593 -54619 -54645 -54668 -57377 -60086 -60411 -60731 -61622 -62512 -63403 -64290 -63601 -62911 -57929 -52942 -55532 -58119 -58320 -58521 -60604 -62684
-10553 -62684 -61424 -60165 -60019 -59870 -59721 -59572 -59218 -58860 -58502 -58145 -58249 -58353 -58458 -58562 -58070 -57578 -55655 -53732 -54813 -55894
-10533 -55894 -59360 -62825 -62356 -61886 -61417 -60947 -60232 -59516 -58801 -58085 -59397 -60709 -62020 -63332 -63623 -63914 -64204 -64495 -63593 -62691
-10513 -62691 -64174 -65658 -64264 -62870 -65292 -64853 -64264 -60813 -61178 -61543 -62587 -63630 -64674 -65717 -64435 -63153 -65210 -67268
-10495 -67268 -66768 -66269 -65769 -65270 -63966 -62661 -59926 -57191 -59553 -61916 -59986 -58055 -57616 -57176 -56736 -56296 -55160 -54023 -51277
-10476 -51277 -51392 -50703 -50013 -49503 -48992 -48750 -48508 -51426 -54344 -58066 -58927 -57105 -55283 -54057 -52831 -53155 -56341 -58842 -58480
-10457 -58480 -54958 -54299 -54116 -53934 -53930 -53926 -54549 -55171 -55793 -56416 -58488 -60556 -62624 -64692 -64737 -64778 -64640 -64502 -64070 -60772 -59084 -57396
-10435 -57396 -57083 -56766 -56449 -56132 -56602 -57068 -57534 -57999 -60526 -63049 -61279 -59509 -57981 -56449 -53308 -53028 -51232 -49432 -47811
-10416 -47811 -46190 -46752 -47311 -47870 -48429 -51675 -54917 -58458 -57228 -57880 -58529 -56494 -54459 -53621 -52778 -51936 -53956 -55391 -59684
-10397 -59684 -60996 -59445 -57541 -58495 -57481 -56468 -58171 -57008 -57455 -57903 -56386 -54865 -56684 -58502 -57392 -56278 -56598 -56915
-10379 -56915 -55387 -53855 -54712 -55566 -56386 -57202 -59453 -61700 -63295 -64886 -66481 -68073 -66984 -65892 -64804 -63712 -61551 -59386
-10361 -59386 -57224 -55059 -58115 -61167 -64223 -67275 -64756 -62233 -63053 -63869 -61957 -60045 -58134 -56222 -56009 -55797 -53199 -50602
-10343 -50602 -49473 -48344 -49600 -50855 -51217 -51578 -51940 -52301 -51895 -51489 -51083 -50677 -51344 -52011 -52678 -53345 -53669 -53993 -54317 -54642 -55324
-10322 -55324 -56006 -56688 -57370 -56490 -55607 -54727 -53844 -54992 -56136 -57284 -58428 -58778 -59125 -59475 -59822 -58771 -57716 -56665 -55611
-10303 -55611 -57064 -58514 -58536 -58555 -60634 -62710 -62404 -62095 -62721 -63343 -62538 -61730 -61163 -60593 -62412 -64227 -65102 -65978 -64469 -62960
-10283 -62960 -62911 -62863 -61383 -59904 -61197 -62490 -63783 -65076 -63627 -62177 -63112 -64048 -62993 -61938 -60884 -59829 -57016 -54202
-10265 -54202 -55681 -57161 -58745 -60329 -60481 -60634 -60697 -60761 -58439 -56117 -55912 -55704 -55499 -55290 -54578 -53863 -53151 -52436 -53304 -54168 -55037
-10244 -55037 -55901 -58290 -60675 -59725 -58771 -59035 -59300 -59565 -59829 -59020 -58212 -57403 -56594 -55145 -53695 -55585 -57474 -60049 -62624
-10225 -62624 -63768 -64912 -61849 -58786 -59240 -59695 -61283 -65732 -66902 -62348 -58480 -60336 -63623 -61186 -58212 -60962 -61566
-10208 -61566 -62170 -61316 -60459 -62945 -65427 -67197 -68963 -64890 -60813 -57813 -60534 -63079 -62758 -62770 -62777 -62609 -62438 -62889 -63336 -65993
-10188 -65993 -68646 -66861 -62211 -58160 -59829 -63045 -63396 -61424 -59449 -58611 -57768 -59315 -60858 -61938 -63015 -65527 -68035
-10171 -68035 -69414 -70789 -69783 -68773 -66194 -63612 -64372 -65128 -63832 -62531 -59803 -57071 -58394 -59717 -61040 -62360 -64189
-10154 -64189 -66019 -67909 -64070 -61458 -61707 -66191 -70670 -70174 -69679 -69183 -68684 -68151 -67614 -64871 -62129 -59598 -59926 -63295 -60940
-10135 -60940 -60094 -59244 -59468 -59691 -60276 -60858 -61439 -62020 -61715 -61406 -57701 -59717 -63675 -64767 -64432 -66955 -69332 -65982 -63172
-10116 -63172 -60358 -59844 -59326 -58812 -58294 -60448 -62602 -61894 -61186 -61551 -61916 -62281 -62647 -63720 -64793 -63004 -61215 -63004 -64793
-10097 -64793 -63720 -62647 -62054 -61461 -60869 -60276 -60131 -59986 -58409 -56833 -58707 -60582 -59594 -58607 -57679 -56751 -54392 -52033 -50967
-10078 -50967 -49901 -48836 -47770 -49894 -52018 -53785 -55551 -58853 -56430 -54366 -52301 -51340 -50378 -50848 -51318 -52331 -53341 -51493
-10060 -51493 -49641 -50684 -51724 -54735 -54880 -52778 -56397 -56978 -51832 -51072 -50308 -50621 -50930 -51873 -52812 -53755 -54694 -55100 -55503 -57340
-10040 -57340 -59173 -56770 -54362 -54821 -55275 -55823 -56367 -54053 -51735 -51012 -50289 -49566 -48839 -48116 -47393 -49532 -51668 -50729 -49790 -48850
-10020 -48850 -47908 -46432 -44956 -46342 -47725 -49216 -50706 -49693 -48675 -45456 -47960 -51716 -52607 -51370 -50132 -51578 -53021
-10003 -53021 -50442 -47863 -48325 -48783 -47583 -49242 -53945 -52920 -51362 -49801 -49316 -48828 -49834 -50837 -51843 -52845 -52898 -52946 -51567
-9984 -51567 -50185 -49868 -49547 -52093 -54634 -52320 -50002 -50550 -51094 -48362 -45627 -42895 -40160 -43480 -46797 -48687 -50572 -49585
-9966 -49585 -48593 -47248 -51623 -55137 -58648 -57750 -56848 -58707 -60563 -59561 -58555 -57075 -55592 -54113 -52629 -53300 -53967 -54638
-9948 -54638 -55305 -57765 -60220 -59818 -59412 -60992 -62568 -61286 -60001 -58748 -57493 -56240 -54985 -52603 -50218 -49983 -44021 -41371
-9930 -41371 -44442 -50319 -53330 -53021 -52708 -52219 -51727 -52521 -53311 -49693 -46070 -44494 -48638 -50997 -53352 -55801 -58245 -57832 -57414
-9911 -57414 -58730 -60042 -58495 -56945 -55994 -55040 -56952 -58860 -60861 -62859 -60090 -57317 -56635 -55950 -55268 -54582 -56494 -58402
-9893 -58402 -57452 -56498 -56740 -56978 -57578 -58175 -54057 -55659 -59948 -58510 -58387 -55398 -53665 -51929 -50896 -49860 -48828 -47792 -49741
-9874 -49741 -51686 -53457 -55223 -55249 -52409 -51180 -49950 -50870 -51787 -52704 -53621 -56658 -59691 -61652 -60750 -56870 -55849 -55722 -55596
-9855 -55596 -57888 -57317 -56747 -59035 -58167 -57299 -56609 -55916 -57746 -59576 -61406 -63232 -62020 -60809 -59598 -58383 -56028 -53669
-9837 -53669 -57992 -62311 -62520 -62725 -61681 -57772 -56937 -56099 -55085 -54068 -53949 -53826 -53885 -53941 -53714 -56348 -59162 -59114 -58052 -59852
-9817 -59852 -62725 -60828 -55801 -53635 -52603 -51571 -51612 -54515 -55808 -57101 -57124 -57142 -58238 -62192 -64301 -63545 -60109 -59531 -58704
-9798 -58704 -57873 -57224 -56572 -54731 -52886 -51045 -49201 -52745 -56289 -56971 -57653 -57202 -56751 -56300 -55849 -55816 -55782 -57358 -56073 -55204
-9778 -55204 -54336 -51679 -51884 -51280 -50677 -53114 -55547 -52797 -50047 -50278 -53367 -54396 -52562 -52518 -52469 -52722 -52976 -53229 -53479 -51698
-9758 -51698 -49913 -52778 -52782 -50106 -50289 -48683 -47077 -48701 -50323 -51944 -53565 -53401 -53233 -53065 -52898 -53896 -54895 -55894 -56893 -55626
-9738 -55626 -54358 -53091 -51824 -52458 -53091 -53725 -54358 -56602 -58845 -58227 -57608 -56852 -56095 -55339 -54582 -54303 -54023 -53744 -53464 -54936
-9718 -54936 -56408 -55018 -53628 -54444 -55260 -56076 -56893 -56334 -55775 -51996 -53937 -52365 -50792 -52081 -53367 -55886 -52681 -52696 -52708
-9699 -52708 -49860 -47013 -50844 -54672 -54407 -54142 -53878 -53609 -53762 -53915 -54068 -54217 -54317 -54418 -54519 -54616 -51795 -48973 -49014 -49052 -49432
-9678 -49432 -49812 -50192 -50568 -52201 -53833 -55465 -57094 -54806 -52518 -50229 -47937 -48094 -48250 -48407 -48560 -52160 -55760 -54590 -53416
-9659 -53416 -53915 -54414 -58134 -56125 -54418 -52711 -53509 -54303 -55279 -56255 -57232 -58204 -58413 -58618 -58827 -59032 -57929 -56822 -55719 -54612
-9639 -54612 -54090 -53565 -53043 -52518 -54917 -57314 -56852 -56386 -56870 -57351 -57835 -58316 -59934 -61547 -60302 -59054 -55722 -52387 -53826
-9620 -53826 -55260 -56430 -57597 -58767 -59934 -60004 -60071 -57757 -55439 -55599 -55756 -56274 -53926 -49167 -47267 -45966 -44662 -46581 -48496
-9601 -48496 -52801 -57101 -58100 -59099 -59322 -56684 -55864 -55044 -54045 -53047 -55216 -57385 -56334 -58145 -61834 -62661 -62714 -62766 -62557 -59486
-9581 -59486 -55402 -57992 -64670 -66578 -62524 -58465 -57891 -57317 -56744 -56166 -56695 -57224 -57753 -58279 -57284 -56285 -57194 -55242 -55618 -60761
-9561 -60761 -64651 -65680 -65401 -65117 -64834 -64551 -59889 -58085 -60873 -63660 -62851 -62043 -59624 -60064 -60001 -59937 -60053 -60165 -58909 -57653
-9541 -57653 -56695 -55734 -53941 -56919 -59896 -58100 -58555 -59009 -59166 -59319 -60191 -61063 -61935 -62803 -60888 -58972 -57057 -55137 -52327
-9522 -52327 -49518 -49391 -52122 -51854 -51586 -52272 -55819 -56684 -57548 -58592 -59635 -59389 -59143 -58898 -58652 -56021 -53390 -54098 -54806 -56401
-9502 -56401 -57996 -58994 -57131 -56460 -58652 -61260 -63869 -66023 -65315 -63056 -60798 -59494 -61052 -60999 -60947 -61812 -62673 -61927 -64040
-9483 -64040 -63504 -62963 -62606 -62244 -60157 -58066 -58365 -58659 -58421 -58178 -56330 -57340 -60548 -63753 -67320 -68020 -69381 -70737 -69533
-9464 -69533 -68326 -67241 -66153 -65069 -63981 -65788 -67592 -68803 -67148 -62799 -61309 -61368 -61428 -61283 -61134 -62594 -61193 -60996 -60794
-9445 -60794 -61189 -64446 -64726 -65002 -59553 -56967 -56859 -56747 -56814 -56881 -56863 -56840 -58428 -57153 -58141 -59125 -61540 -61093 -60947 -60798 -61722 -62647
-9423 -62647 -62948 -60388 -62777 -65162 -63496 -61830 -60940 -62907 -63127 -63347 -60586 -57821 -57027 -59095 -57824 -53688 -51694 -49700
-9405 -49700 -50867 -52029 -53345 -54660 -58182 -61700 -61696 -58830 -55965 -55957 -56460 -56963 -57645 -58324 -58648 -58972 -59296 -59620 -58752 -57884 -57016
-9384 -57016 -56147 -55577 -55007 -51754 -53270 -53296 -53322 -54004 -51824 -48120 -47278 -43693 -37246 -27996 -15885 -2879 3448 3724 4000
-9365 4000 2368 -5942 -14938 -23934 -36031 -43357 -45072 -46782 -51239 -55693 -58242 -56017 -54094 -52167 -52391 -52611 -52834 -53054
-9347 -53054 -54321 -55585 -58283 -60977 -61029 -61078 -58745 -56408 -58070 -59729 -63776 -67819 -67364 -66906 -64365 -61819 -61484 -65915 -67964
-9328 -67964 -65240 -63683 -62125 -60746 -64133 -66422 -65848 -67182 -68512 -68803 -69094 -66999 -64901 -63373 -61845 -58886 -55924 -56870
-9310 -56870 -57817 -60194 -62568 -63396 -64223 -62665 -61104 -59270 -57437 -57988 -58536 -56911 -55286 -57001 -58711 -60053 -61391 -62732
-9292 -62732 -64070 -63176 -62278 -64722 -67163 -66545 -65922 -61965 -58003 -57414 -56822 -58618 -60411 -60943 -61476 -62009 -62542 -62032 -61521 -61011
-9272 -61011 -60500 -58439 -56378 -54317 -52257 -52283 -52309 -54720 -57131 -59803 -62475 -62762 -63049 -60921 -58793 -58096 -57399 -55599 -53799
-9253 -53799 -51999 -50200 -52067 -53934 -55801 -57668 -58808 -59945 -61085 -62222 -62229 -62233 -60809 -59382 -60016 -60645 -56807 -52965 -48888
-9234 -48888 -41945 -40849 -48336 -55368 -62401 -64722 -67040 -67066 -67092 -68550 -70003 -68538 -67074 -65609 -64141 -65210 -66280 -64010
-9216 -64010 -61737 -61938 -62140 -59956 -57768 -57433 -57098 -56762 -56423 -57817 -59211 -60604 -61994 -61242 -60489 -59736 -58980 -59073 -59162 -59255 -59345
-9195 -59345 -60004 -60660 -61320 -61976 -62755 -63530 -61924 -60314 -60437 -60556 -62110 -63660 -62408 -61152 -59900 -58644 -58465 -58283 -58104 -57921
-9175 -57921 -56550 -55175 -56188 -60060 -62535 -60235 -59371 -58502 -58994 -59486 -57593 -55696 -53088 -50479 -53117 -55752 -58078 -60403
-9157 -60403 -59389 -58372 -59266 -60161 -61532 -58130 -58055 -60843 -60947 -58186 -57157 -56129 -57306 -58480 -57407 -56334 -53829 -56091
-9139 -56091 -58775 -58596 -60325 -62050 -61883 -61711 -61543 -61372 -62486 -63597 -67394 -66418 -65535 -64648 -63943 -60373 -56598 -57589 -60016
-9120 -60016 -62438 -64543 -66645 -66366 -66082 -61629 -57172 -57012 -56848 -56039 -55227 -57757 -60284 -61890 -63492 -61760 -60023 -59930 -59837
-9101 -59837 -58134 -59293 -58335 -57377 -57671 -60828 -61234 -58778 -61093 -66269 -68106 -67081 -63194 -62170 -65792 -66552 -62423 -58294
-9083 -58294 -58875 -59457 -60038 -60619 -61141 -61663 -62184 -62706 -60127 -57548 -53360 -52033 -50349 -48664 -51631 -51731 -52372 -53013 -53475 -53934
-9063 -53934 -51981 -50028 -49149 -51127 -53289 -52588 -53855 -55119 -53110 -53963 -54638 -52447 -51332 -47356 -42128 -36895 -32025 -30016
-9045 -30016 -27828 -22775 -17010 -8383 -1187 6012 17088 28163 37808 50318 64077 80698 104951 141610 194319
-9030 194319 274696 398599 574977 793568 1028376 1246727 1425968 1524713 1483217 1323183 1093510 828892
-9018 828892 588125 405672 279511 194815 139694 103773 80258 61211 45026 33254 24347 21109 20732 18925
-9004 18925 17121 12631 8140 787 -6561 -10962 -15363 -19764 -24161 -26595 -29028 -33251 -34607 -32125 -32505 -35867 -39225
-8987 -39225 -41870 -44516 -44300 -44080 -45735 -47390 -46182 -44971 -42213 -39456 -37950 -39303 -38848 -38394 -38118 -37838 -37562 -37287 -37011
-8968 -37011 -36731 -34630 -32528 -27206 -21881 -14234 -862 15787 32442 49107 62911 74508 80385 77433 68758 52509
-8952 52509 33403 14785 1890 -11241 -21508 -26830 -32151 -37294 -42433 -43257 -44077 -44897 -45716 -46957 -48195 -49074 -49954
-8935 -49954 -53647 -51612 -51903 -49331 -46227 -48843 -51638 -48709 -44349 -45709 -44744 -46641 -47289 -47934 -48757 -49581 -49253 -48921 -53360
-8916 -53360 -57798 -58782 -59762 -60742 -61722 -62345 -62967 -60727 -58484 -54873 -51262 -47651 -44036 -44352 -44669 -44986 -45299 -46689 -48079
-8897 -48079 -49469 -50855 -50677 -50498 -50319 -50136 -49957 -49778 -49421 -49059 -49007 -46093 -41569 -42765 -42653 -42541 -42787 -43029 -39351 -35673
-8877 -35673 -36765 -37853 -40615 -43376 -46137 -48895 -47990 -47084 -49041 -50993 -51698 -52402 -50244 -48083 -45180 -42277 -44144 -46007
-8859 -46007 -46026 -46044 -46063 -46078 -44077 -42075 -42936 -43793 -46741 -49689 -52637 -55581 -56281 -56978 -57675 -58372 -58775 -59173 -59572 -59971 -61186
-8838 -61186 -62397 -59136 -55875 -54467 -57824 -58499 -59173 -59732 -60288 -57981 -55674 -54385 -53091 -51798 -50505 -51504 -52499 -53494 -54489
-8819 -54489 -52804 -51116 -54198 -57280 -55052 -52823 -50595 -48366 -49715 -51064 -52234 -53404 -53248 -50229 -50729 -55998 -58942
-8802 -58942 -59024 -58152 -57280 -56076 -54873 -53669 -52465 -54958 -57452 -57083 -56714 -56263 -55812 -55361 -54910 -53028 -51146 -49264 -47382
-8783 -47382 -45705 -44028 -47121 -50211 -48891 -47572 -46253 -44930 -44759 -44587 -49186 -53781 -55339 -56896 -58454 -60008 -59661 -59315
-8765 -59315 -58968 -58618 -59106 -59594 -60083 -60567 -60697 -60828 -60958 -61085 -61812 -62538 -58495 -54448 -51966 -49480 -49860 -50237 -52883 -55525
-8745 -55525 -58171 -60813 -60358 -59900 -59445 -58987 -56744 -54496 -52253 -50006 -49029 -48049 -47073 -46093 -45474 -44852 -43816 -42776 -46137
-8726 -46137 -42817 -43257 -43693 -44610 -45523 -46439 -47352 -51034 -54716 -55536 -56356 -58726 -61096 -62214 -60470 -61260 -62050 -59799 -57548
-8707 -57548 -54940 -52331 -49723 -47114 -50162 -53211 -56259 -59307 -60746 -62184 -62550 -60053 -56214 -55238 -55335 -55432 -57079 -58726
-8689 -58726 -57332 -55939 -54891 -50978 -50464 -47088 -43834 -43439 -44416 -48254 -51127 -53997 -58834 -60809 -64875 -71799 -73715 -68952
-8671 -68952 -65203 -56680 -50423 -44166 -36840 -29509 -23431 -20215 -20893 -21568 -22600 -23632 -26457 -32140 -36035 -39929 -43488
-8654 -43488 -44181 -46484 -48787 -52644 -56498 -56535 -51802 -48973 -49003 -50106 -54072 -55119 -53300 -53270 -53240 -50703 -48161 -45619 -43078
-8635 -43078 -42627 -42172 -44401 -46629 -49361 -49227 -50524 -51821 -55983 -57280 -53688 -50095 -49518 -51798 -54083 -53501 -52506 -51508 -50330
-8616 -50330 -49152 -47829 -46503 -43391 -43138 -42530 -39057 -37372 -35688 -37466 -39239 -41017 -42791 -40156 -37518 -34879 -32241
-8599 -32241 -31156 -30068 -28984 -27896 -27586 -27273 -25350 -26289 -30482 -34671 -38684 -42694 -42176 -35930 -32908 -29882 -28946 -28007
-8581 -28007 -27072 -26133 -26927 -27717 -30836 -36813 -40883 -39225 -37630 -36031 -31872 -27709 -22894 -23800 -25976 -31011 -32412 -33810
-8563 -33810 -36105 -38397 -39798 -35472 -31156 -29703 -28667 -27631 -26267 -24903 -23539 -22171 -16887 -11603 -8644 -8547 -6393
-8546 -6393 1484 9303 17125 24116 31107 36668 42228 44866 47505 55390 63280 74042 84805 93182 101560 103378 105197
-8529 105197 107015 108838 115535 122231 132506 137056 141546 151761 169370 196518 235070 283163 340795 407968 487901
-8514 487901 585006 700178 828706 960626 1089683 1222616 1365089 1531115 1752474 2066612 2535300
-8503 2535300 3228646 4255900 5818835 8242298 11983383 17252808 23273525 28521486 31203458 29949145
-8493 29949145 25611193 19779248 14132559 9785252 6799088 4860443 3620093 2835768 2319520 1973091
-8483 1973091 1732913 1567152 1451294 1375509 1321026 1269408 1196977 1092113 966912 835992 722478 633773
-8471 633773 568303 520010 479941 445600 405203 364810 326559 297853 275352 252854 230949 209047 188812
-8458 188812 168580 152160 140514 131429 127117 120416 113720 105439 97162 88882 80605 77318 74035 70748 67465 60481
-8442 60481 53501 51764 50031 45761 41494 38654 35818 34051 32289 28137 23990 21113 18236 18698 19163 18791 18418 15660
-8424 15660 12906 11371 9836 6094 2356 2013 4533 2878 -3542 -12020 -20498 -24027 -27553 -30814 -34074 -38766 -43454
-8407 -43454 -43853 -44252 -44651 -45046 -46369 -47691 -49014 -50334 -52108 -53878 -55652 -57422 -55737 -54049 -52365 -50677 -48247 -45813
-8389 -45813 -43682 -41546 -41084 -45388 -50054 -51854 -52156 -52454 -50967 -44706 -37734 -30758 -30642 -30523 -32047 -33568 -37477 -41382
-8371 -41382 -44606 -47826 -51347 -50095 -50539 -50978 -51120 -51262 -52331 -53397 -54463 -55529 -56062 -56591 -57120 -57649 -58868 -60083 -61297
-8352 -61297 -62512 -60329 -58141 -57385 -56628 -56322 -56013 -58089 -63027 -66120 -64439 -60254 -53207 -49264 -48180 -48646 -49111 -45150
-8334 -45150 -41188 -39612 -38036 -36519 -35002 -37779 -40555 -41960 -43365 -46559 -44028 -39530 -35032 -32561 -30091 -28104 -26118
-8317 -26118 -24251 -28108 -36258 -44408 -46715 -49022 -48616 -48210 -46372 -44535 -42847 -41159 -39471 -37782 -36064 -34346 -34059 -33769
-8299 -33769 -37805 -41841 -39675 -37507 -38010 -38513 -40089 -41662 -45504 -43622 -41740 -42716 -47125 -48672 -49622 -50572 -50330 -50088 -48414
-8280 -48414 -46741 -43995 -41248 -40887 -40525 -38494 -36463 -40574 -47546 -53524 -53773 -52771 -51768 -54467 -51437 -50017 -51459 -52249
-8262 -52249 -53036 -54001 -54966 -51999 -49029 -45701 -42374 -41375 -34652 -31149 -27646 -25306 -22965 -20625 -18285 -15586 -12888 -5897
-8244 -5897 1093 571 50 -113 -277 -4876 -3747 4115 14844 19756 18947 15094 20785 28916 42775 59255 81462
-8227 81462 101936 128138 156244 190079 228940 281161 333379 391325 459224 532852 597412 675332 795166
-8214 795166 989418 1266427 1686542 2322859 3350329 5007687 7697299 11565458 14939439 14742518
-8204 14742518 11479377 7973492 5316689 3528999 2380503 1692751 1262588 996994 824894 705738
-8194 705738 619023 564983 524299 499245 483734 470609 436495 381986 317940 265819 223238 195501 173491
-8181 173491 162334 151176 141714 126532 111588 96644 86470 82021 77571 67401 54634 41866 33988 26114
-8167 26114 20755 15396 13376 11360 8595 5830 3064 303 -4727 -9758 -11450 -13138 -15814 -18490 -19734 -20975 -21683
-8150 -21683 -22391 -22682 -20107 -16701 -19019 -20323 -21624 -23919 -26211 -25164 -24117 -23938 -23755 -25004 -26252 -29308 -32360 -35412
-8132 -35412 -38464 -34514 -30560 -29349 -28138 -27120 -31823 -34738 -37652 -40987 -44319 -45265 -46212 -50494 -54772 -54757 -54742 -49782
-8114 -49782 -44818 -44147 -43477 -44360 -45243 -47557 -49872 -50397 -50922 -51865 -55670 -58066 -54739 -51947 -52018 -48690 -48224 -48295 -45504 -45839
-8094 -45839 -51899 -56348 -57936 -55946 -56818 -54470 -52122 -50535 -48947 -46525 -49827 -52324 -54821 -54336 -53852 -48977 -44103 -42090
-8076 -42090 -40078 -40272 -40466 -45072 -49678 -53270 -51139 -50796 -50453 -49782 -49111 -50945 -52778 -55275 -52048 -51683 -57042 -58048 -59054
-8057 -59054 -61849 -64644 -64122 -63601 -62006 -60411 -54463 -54239 -51154 -48068 -45701 -49055 -49190 -49324 -49819 -50311 -50803 -51295 -49592
-8038 -49592 -47885 -46178 -44472 -43603 -42731 -41859 -40987 -39351 -37712 -36072 -34432 -29338 -24240 -21646 -19052 -12870 -959 12739
-8020 12739 32162 53847 69812 74329 69306 61394 47762 28167 8572 -5062 -18694 -25648 -32602 -37935 -43264
-8005 -43264 -45731 -48198 -47449 -46696 -45944 -45191 -47468 -49741 -52014 -54288 -53434 -52577 -51720 -50863 -48444 -46022 -45031 -44039 -48269
-7986 -48269 -52495 -53859 -55223 -56617 -58011 -59404 -60798 -59747 -58696 -57645 -56594 -58927 -61260 -63593 -65926 -66649 -67372
-7969 -67372 -65233 -63094 -60604 -58115 -55626 -53136 -51303 -49469 -47636 -45802 -45847 -45892 -45936 -45981 -47487 -48992 -50498 -52003 -53412
-7950 -53412 -54817 -54794 -54768 -50870 -46969 -45933 -44893 -46182 -47468 -47326 -47181 -47278 -47371 -47468 -47561 -49652 -51739 -55260 -58778 -57858 -56934
-7929 -56934 -59054 -61171 -60787 -63261 -66813 -65591 -62524 -59453 -56088 -52719 -52439 -52160 -51880 -51597 -50990 -50382 -48344 -46301 -47095
-7910 -47095 -47889 -51545 -55197 -55514 -55830 -56624 -54552 -52909 -56035 -56300 -56561 -55484 -54407 -53330 -52249 -51232 -50214 -49197
-7892 -49197 -48176 -49901 -51627 -53352 -55074 -54720 -54366 -54012 -53658 -54377 -55096 -55816 -56535 -56382 -56229 -56076 -55924 -57202 -58480 -56896
-7872 -56896 -55312 -56080 -56848 -54753 -52659 -55782 -58905 -60597 -62289 -62818 -63347 -63578 -63809 -62878 -57176 -49685 -45057 -46555 -48053
-7853 -48053 -46868 -45683 -47539 -49395 -48388 -47382 -50632 -53881 -57131 -60381 -59188 -57996 -56803 -55611 -53073 -50535 -46864
-7836 -46864 -43193 -40656 -42888 -47088 -48426 -50002 -54440 -55659 -56878 -58186 -59494 -60802 -62110 -60280 -58447 -56617 -54783
-7819 -54783 -52834 -50882 -53345 -55804 -57403 -53274 -49506 -45735 -44859 -43980 -40242 -36500 -37864 -39225 -42020 -44811 -47874
-7802 -47874 -50934 -51135 -51332 -50602 -49868 -49137 -48403 -46063 -43719 -44241 -44759 -43581 -42403 -44088 -45769 -43041 -40313 -40447 -40577
-7783 -40577 -41054 -41531 -44870 -48206 -51187 -54168 -57507 -55119 -54798 -54478 -50937 -47393 -48742 -50091 -51441 -52786 -51236 -49685
-7765 -49685 -48135 -46581 -47773 -48966 -50159 -51347 -53729 -56110 -58491 -60873 -60750 -60627 -60504 -60381 -59184 -57988 -56792 -55596
-7747 -55596 -54250 -52905 -52633 -52361 -55845 -53606 -51366 -49126 -46499 -38148 -33016 -27884 -21754 -15624 -12952 -16004 -21143
-7730 -21143 -26282 -34641 -43000 -44833 -46663 -45634 -44602 -48075 -51545 -55376 -53479 -53554 -53624 -51910 -50192 -52890 -55585 -56852
-7712 -56852 -58115 -59151 -60183 -61219 -62252 -62989 -63724 -59691 -55655 -56274 -56889 -58939 -60984 -62408 -63828 -62389 -60947 -58618
-7694 -58618 -56289 -56822 -57351 -57675 -57999 -58324 -53874 -52558 -54105 -52313 -50516 -51467 -52417 -51936 -51452 -53300 -55149 -54135 -53117
-7675 -53117 -52014 -50911 -49808 -48701 -48701 -48701 -51563 -54422 -53885 -53349 -52812 -52272 -51865 -51459 -51053 -50643 -52026 -53408 -54791 -56170
-7655 -56170 -56412 -56654 -56896 -57135 -55350 -53565 -51780 -49991 -50699 -51407 -52115 -52819 -53527 -54235 -54944 -55648 -52346 -49044 -45742 -42437
-7635 -42437 -40984 -39530 -40939 -42344 -45403 -48459 -51519 -54575 -59244 -63910 -65717 -67521 -69395 -71266 -70279 -69287 -71251
-7618 -71251 -73212 -72015 -70815 -72172 -68754 -64983 -64070 -63489 -62904 -59639 -56371 -57444 -58514 -59587 -60656 -61730 -62799 -63873
-7600 -63873 -64942 -66761 -68576 -67528 -66481 -64931 -63377 -60392 -57407 -59203 -60996 -59926 -58857 -58476 -58093 -57709 -57325 -60869
-7582 -60869 -64413 -67957 -71501 -73346 -75190 -79897 -84604 -82901 -81198 -78064 -74930 -75045 -75161 -75276 -75392 -76375 -77356 -78339 -79320
-7563 -79320 -76934 -74546 -73592 -72634 -73342 -74046 -68434 -62818 -62006 -66914 -71825 -71009 -70994 -70979 -70607 -70230 -68963 -67696 -66429 -65158
-7543 -65158 -65591 -66023 -63593 -61160 -63589 -66019 -67018 -68013 -66969 -65926 -62020 -58111 -55011 -51910 -45947 -39981 -34048 -28115
-7525 -28115 -19321 -10522 895 12314 32319 52327 80593 108860 145534 182212 219064 253055 281024 295639
-7511 295639 302142 295289 277942 254874 223902 187205 150688 117036 87406 63503 43834 29889 20024 10164
-7497 10164 3523 -3117 -8107 -13093 -18080 -23066 -26118 -29166 -32215 -35263 -37100 -38934 -39336 -39739 -39340 -38938 -41397 -43857
-7479 -43857 -43518 -43175 -42832 -42489 -45131 -47770 -47546 -47323 -47073 -46819 -46566 -46313 -48210 -50103 -50445 -45064 -45336 -45605 -45515 -45426 -48619
-7458 -48619 -51809 -52137 -52465 -53915 -55361 -53945 -52529 -56989 -61447 -64473 -67499 -73897 -80292 -80009 -79726 -76763 -73797 -75600
-7440 -75600 -77404 -76756 -76103 -74024 -71941 -69981 -68017 -68620 -69220 -71464 -68933 -65870 -65665 -65136 -61741 -60138 -58532 -58428 -58320
-7421 -58320 -53744 -49164 -48910 -53423 -58119 -58040 -58264 -61346 -63955 -66560 -71553 -76543 -79987 -80564 -80493 -75649 -71881 -68110 -62285
-7402 -62285 -56457 -56535 -61379 -62650 -63917 -65486 -67051 -66712 -66369 -63168 -59963 -59199 -58432 -54985 -56304 -60250 -64193 -65576
-7384 -65576 -66955 -66071 -65184 -61260 -57332 -55853 -51508 -48955 -51168 -51750 -52331 -53211 -54090 -56222 -58353 -55715 -53076 -46354
-7366 -46354 -39631 -41494 -43357 -45877 -48396 -46145 -43894 -42880 -41867 -40853 -39839 -33042 -26245 -19447 -12650 -3646 5356
-7349 5356 14539 23721 33977 47095 59199 64625 67032 64670 57060 44680 28305 16700 6884 -2931 -13432
-7334 -13432 -23934 -31574 -39213 -41725 -44237 -43887 -43536 -38863 -34190 -26655 -19116 -20375 -21635 -24325 -27012 -27966 -28920 -34645
-7316 -34645 -40365 -45463 -50561 -52797 -55029 -52014 -48996 -45977 -42959 -41434 -39907 -38379 -36851 -34723 -32591 -30460 -28328
-7299 -28328 -27273 -26215 -22294 -18374 -16712 -15046 -16246 -17442 -20610 -23774 -24079 -24381 -25909 -27433 -28961 -30486 -32759
-7282 -32759 -35028 -38435 -41837 -44326 -42046 -37678 -30448 -21817 -17957 -11651 -5346 -4794 -10921 -16153 -21385 -26349 -31313
-7265 -31313 -31507 -31700 -30847 -29994 -27709 -25425 -26718 -28011 -29125 -25470 -18803 -12136 -6602 -1067 -900 -732 -3426 -6121
-7247 -6121 -12754 -19388 -27452 -35517 -49633 -63750 -75004 -86259 -88718 -91178 -86959 -82741 -77747 -72753 -68058 -63362
-7231 -63362 -59755 -60917 -62259 -63601 -63988 -64376 -58085 -51795 -42731 -33668 -24605 -20312 -18106 -13037 -8267 -6359 -2659
-7214 -2659 1045 4570 8095 10126 12161 16879 16827 16711 16600 16190 15780 17870 19965 15381 10797 5617 441 1943 3445
-7195 3445 411 -2618 -9821 -14163 -13470 -8003 -3430 -1720 -3829 -5934 -8040 -14916 -18564 -16488 -9344 -2197 9150
-7178 9150 20498 30056 39619 47344 49346 49797 50251 48556 46860 50531 59929 70852 81775 94486 107202 114785
-7162 114785 122369 128164 133963 137626 135565 126230 116898 108726 100553 95601 100192 115892 131593 138707 140097 132483
-7146 132483 124870 123577 122283 113865 105446 97386 89325 82516 81432 88218 100729 113168 125608 134947 138561 146350
-7130 146350 154139 158708 163277 165043 166809 171438 176066 180874 185681 193351 201020 214600 228180 241760 255340 268979
-7114 268979 282619 299716 322538 345420 368302 401677 435053 466044 491311 517293 543275 571877 606203
-7101 606203 648042 695605 744599 787870 826131 864392 898778 933164 984961 1057746 1135420 1207370 1275505
-7088 1275505 1349363 1457138 1620249 1830107 2080035 2371935 2692460 3041844 3423665 3841974 4300355
-7077 4300355 4822655 5434633 6159898 7013005 7996097 9122293 10495681 12313645 14829237 18354184
-7067 18354184 23336155 30426518 40533493 54618734 72893765 92689511 106660955 107178799 94518502
-7058 94518502 75899405 57821294 43122328 32200567 24490998 19174292 15516628 12983870 11213379
-7049 11213379 9960326 9051673 8347982 7754007 7194496 6624491 6039576 5470882 4944285 4466343 4040902
-7038 4040902 3677476 3372245 3113761 2888307 2677166 2463760 2255124 2070662 1929136 1823981 1744585
-7027 1744585 1677349 1630151 1605134 1588703 1555517 1483220 1378602 1259678 1139557 1035658 949285 871503
-7015 871503 799828 742468 699116 670078 647684 625295 608745 592198 574929 560522 543253 525983 510264
-7002 510264 497407 485445 466804 448581 433220 417620 406790 395663 379765 365596 351427 336603 324644
-6989 324644 310240 292975 276988 267682 263028 261235 260423 254844 245449 236054 218845 201639 189084 179391 169720
-6974 169720 153371 136426 128071 127702 132103 136862 136855 134429 129140 117651 101396 85196 73766 70088 73092 73830
-6958 73830 77433 84793 92154 97960 106632 113694 120756 121225 121698 122351 123003 125619 131101 138014 144927 154720 167380 181112
-6940 181112 194845 204817 211932 217078 217454 218483 226193 240642 257952 275676 293403 305228 312283 313919 312693
-6925 312693 314448 325743 342882 365745 381751 394895 413763 445987 496994 565173 643727 735637 840426
-6912 840426 954756 1081149 1220898 1380920 1561931 1771800 2010291 2279071 2580288 2924079 3349915
-6901 3349915 3921001 4722960 5861092 7481958 9809278 13165029 17928351 24269624 31387468 36751829
-6891 36751829 37461754 33258473 26644140 20130939 14852984 10969806 8261028 6416597 5162819 4296375
-6881 4296375 3686084 3245614 2928524 2693481 2501608 2326910 2149019 1965403 1780595 1605331 1446789
-6870 1446789 1309234 1190045 1091848 1007987 929851 856365 780021 704844 632528 572853 526539 489403 452267
-6857 452267 416323 380383 349538 324417 303350 288011 276127 264243 254505 244771 235212 231377 222892 214410 205656
-6842 205656 196902 186717 176536 162654 148772 139661 130553 124870 119187 116366 113548 112508 111469 117107 122749 132204
-6826 132204 141658 149443 147692 135919 118423 97527 79498 65221 56668 57298 57932 59814 58834 56005 47456 40036
-6810 40036 32617 24839 17065 14833 12601 10369 8140 9485 10831 12176 13525 11408 9292 7175 5058 3806 2554
-6793 2554 1302 50 -2185 -4421 -4093 -3766 -903 4820 13704 29266 48563 74538 108145 157970 224073 283498
-6777 283498 298144 266042 206662 147282 98932 64893 43495 30683 25860 21038 14744 8453 2934 281 -2376
-6762 -2376 -5029 -6076 -7120 -12281 -17439 -25641 -30978 -29669 -28358 -25261 -25022 -27147 -29267 -29364 -29457 -29345 -32092 -34782 -40331
-6743 -40331 -45258 -47319 -46581 -42977 -39377 -35774 -32770 -32625 -33888 -35148 -39627 -41244 -41852 -42456 -41330 -37343 -38815 -43145
-6725 -43145 -50099 -59915 -70092 -77404 -82510 -87615 -81399 -64685 -42545 -23267 -9896 -1291 -199 892 -4250 -9389
-6709 -9389 -12143 -14897 -17446 -19991 -20927 -24724 -30784 -36843 -42426 -43234 -45567 -47900 -48385 -46003 -46577 -50013 -52078 -47460
-6691 -47460 -35483 -23506 -12303 1764 23464 51842 75689 77597 57231 30187 6720 -13880 -29684 -38811
-6677 -38811 -43048 -42511 -37030 -28686 -19924 -11159 -5759 -10854 -23282 -32848 -41520 -45422 -45806 -46190 -47438 -51549 -54824
-6660 -54824 -60962 -63999 -67036 -69299 -68699 -66101 -60642 -50591 -40540 -30698 -23718 -21508 -19298 -20099 -23763 -25816 -27869
-6643 -27869 -31682 -35494 -39008 -47293 -54213 -61130 -64648 -63396 -57288 -48314 -41069 -33825 -29028 -30907 -36064 -38360 -37827
-6626 -37827 -40152 -44028 -47904 -51597 -55286 -57545 -59803 -61588 -63369 -62766 -62162 -59058 -55950 -51113 -43413 -33243 -23070
-6609 -23070 -14148 -5226 512 6251 12526 18802 33157 56098 88043 124758 161562 195505 230639 262912 285466
-6594 285466 293709 293128 280144 255511 226108 196108 163247 130027 99670 78436 65788 58357 50926 42600 34275
-6579 34275 22849 11423 4290 -2841 -2077 -1310 1544 4399 3135 -2894 -9400 -15907 -18750 -18728 -16201 -13675 -11867
-6562 -11867 -12918 -18560 -24202 -28440 -32673 -35356 -35177 -35360 -38401 -39832 -38401 -36564 -34723 -34134 -33545 -35971 -38394 -36523
-6544 -36523 -34652 -32736 -30817 -26040 -21258 -21639 -22015 -25257 -28496 -32088 -35677 -36407 -37134 -36254 -35371 -29543 -23711 -16675
-6526 -16675 -6773 4734 10521 16424 22331 24835 27343 30027 29852 29375 23177 7853 -13190 -32986 -49916 -60817
-6510 -60817 -71717 -80829 -87078 -89273 -85744 -82215 -78686 -76543 -71538 -67964 -70115 -73935 -80616 -82588 -78835 -72552 -66269
-6493 -66269 -62490 -58711 -60656 -62602 -62997 -57668 -50401 -43134 -32647 -22160 -20140 -18121 -18068 -15154 -11301 -13168 -8778
-6476 -8778 -4384 -1604 1179 3959 6743 11818 16898 21973 27053 32069 37089 43655 55949 76576 97207 118192
-6460 118192 139180 165889 192601 216448 246023 279812 319330 373869 445585 542518 668077 831792 1043212
-6447 1043212 1307487 1615650 1962687 2326899 2675486 2972558 3190683 3296237 3269178 3125731 2889264
-6436 2889264 2582204 2247950 1923240 1625954 1372557 1175694 1037983 943200 873225 817556 771431 731623
-6424 731623 691819 647062 596585 540797 482151 424753 373083 336554 313386 296377 284143 276734 269329 263113
-6410 263113 256901 250387 243876 227882 207120 188979 179428 176670 173916 171099 174963 183285 196380 214361 237116
-6395 237116 255217 262826 258507 239881 208522 170488 137578 109441 86131 65687 48101 35289 25719 19014
-6381 19014 12787 3698 -5096 -11025 -12840 -9885 -2759 4369 3985 -1168 -8830 -16488 -23014 -26677 -30463 -31384 -30456 -29528
-6363 -29528 -33612 -31015 -19771 -8528 -672 7186 10693 14200 15258 22998 39563 56128 61207 38624 -6080
-6348 -6080 -47923 -70510 -74967 -69824 -64681 -59199 -60392 -65997 -71602 -70651 -63019 -54373 -45728 -36564 -27396 -16678 -1190
-6331 -1190 18407 29423 30660 23311 15213 11889 10413 11800 15150 18504 13272 8039 -725 -12348 -22063 -31779
-6315 -31779 -38516 -40480 -41133 -37015 -26744 -16470 -14543 -19294 -26494 -33691 -36534 -39377 -41315 -43249 -44229 -34715 -12743
-6298 -12743 12094 29061 39351 44657 47106 46811 37931 20043 -702 -11133 -9162 -3069 3023 9713 16406 26673
-6282 26673 34078 39694 51037 69742 85583 99994 120133 141580 160165 160623 143913 112430 78085 50001
-6268 50001 35277 33608 45295 66283 92999 113332 120308 118937 117569 118881 120193 121147 122105 122928 118031 103535
-6252 103535 83314 57962 35475 27001 31883 36567 35531 30023 21653 11669 7413 2979 -1455 -6967 -6751 -2122
-6236 -2122 8230 29490 56478 88475 126196 168788 220924 271867 313270 332906 327741 301110 268755 240854
-6222 240854 230129 227453 227639 228359 223357 209412 192605 175183 163489 151616 134019 113138 92262 77944 84615
-6207 84615 112125 149179 184086 205637 209178 199365 184962 164834 134581 101470 75335 62557 60268 71340
-6193 71340 89150 104097 111234 108830 95038 81249 84510 112576 161510 219989 267611 301878 320045 328676
-6179 328676 330267 331859 332615 320019 280699 193678 50132 -129663 -284658 -361423 -362761 -324026 -272833 -218778
-6165 -218778 -169553 -129864 -99540 -78757 -77531 -89657 -119851 -155768 -180237 -168450 -110157 -23245 70345 142951
-6151 142951 180002 188431 187977 190388 210147 258526 323183 378304 412921 434181 435646 423758 413416 420247 439242
-6136 439242 467781 513488 564919 600848 608160 577903 526658 486384 474734 468053 444202 387673 310159 253748
-6122 253748 264123 312536 360953 393654 420635 421973 383245 316252 266434 256443 278892 330107 421395 533489
-6108 533489 642724 734962 806216 843300 844134 817806 785757 761574 769833 835328 952345 1070789 1179696
-6095 1179696 1282160 1371268 1419830 1443591 1474146 1514241 1504488 1427958 1328199 1237981 1143708 1093324 1156226
-6082 1156226 1320254 1488337 1597274 1622567 1573446 1499282 1469007 1454588 1388653 1281456 1191435 1127110
-6070 1127110 1072324 1043536 1092981 1209323 1339021 1412671 1419543 1394064 1393393 1429210 1478387 1495123 1483243
-6057 1483243 1477798 1508610 1552715 1587283 1612069 1642583 1697778 1815942 1966421 2107362 2217924 2328490
-6045 2328490 2448414 2589329 2739245 2886302 3048202 3273072 3518203 3711820 3836984 3967875 4157315
-6034 4157315 4409724 4700529 5058119 5469440 5871221 6194057 6461558 6686845 6875879 7064198 7368907
-6023 7368907 7852651 8414625 8840174 9107356 9420450 10056003 11119674 12605020 14450417 16644984
-6013 16644984 19127907 21891309 24949387 28326106 32019082 36179529 41003798 46677145 53175003
-6004 53175003 60250997 67759403 76582451 88704259 106529218 132628222 170826131 227159264 311428042
-5995 311428042 435954202 609988364 816397676 977634160 1000000000 880016448 696492766
-5988 696492766 518519541 375519981 271686822 201423283 155668515 126304998 107876443 97279926
-5980 97279926 93103974 94874200 101282875 107675097 106933148 97049251 82885625 69335201 58293848
-5971 58293848 49838727 43537787 39009653 35944991 34126992 33436649 33884932 35697463 39448324 45914329
-5961 45914329 54586985 61135997 60078168 52141861 42475675 34288219 28364889 24565213 22649254
-5952 22649254 22341771 23512240 26287373 31239347 39246092 50967435 64499514 72961447 70022829
-5943 70022829 58434346 45168693 34032413 25813531 20121250 16308394 13752699 12015554 10824997
-5934 10824997 10037034 9531463 9157551 8755252 8267092 7753649 7253567 6772144 6307894 5869164 5478138
-5923 5478138 5156633 4882829 4620473 4344765 4065312 3818294 3631381 3507437 3420486 3320180 3180998
-5912 3180998 3017014 2835675 2618084 2393099 2215819 2081675 1934174 1771171 1621527 1524306 1512948
-5901 1512948 1583873 1660527 1653103 1559818 1435288 1289774 1118348 960279 855516 794641 739725 684809
-5889 684809 663880 683024 724994 787952 877264 966581 1015467 1009020 956899 879977 805079 758802 737329 740664
-5875 740664 779175 850123 929180 991068 1026550 1044859 1035859 990606 918403 846199 799158 765472 737005 733341
-5861 733341 754482 754635 701482 623524 562143 529382 519115 508848 467456 401260 337926 303212 298788 315353
-5847 315353 335764 350451 355419 347030 324987 305806 305407 322181 351934 402676 459619 499390 510182 499986
-5833 499986 481681 469100 481264 533496 617689 711421 785358 819225 811832 775818 732346 698415 674263 667283
-5819 667283 676044 698162 734351 791529 871156 964140 1025402 1000803 888791 740526 595124 463078 351755
-5806 351755 272870 224036 192374 169299 159580 162263 182118 223917 279071 329694 359328 360818 341321 313475
-5792 313475 295170 295200 308586 322687 327249 325609 314429 287985 255817 226987 207698 190257 175679 162710
-5778 162710 159282 175709 205492 229316 239785 236896 220656 199701 184470 169657 157709 141375 115501 83664
-5764 83664 54693 33351 21549 12489 571 -24773 -55842 -86970 -104739 -98899 -68255 -25328 17602 60716
-5750 60716 98105 129472 157981 180225 196746 205216 207966 205171 202376 192546 182715 169545 156375 148333 149831
-5735 149831 156628 163426 158894 141006 112385 93305 84421 85077 91643 95347 96189 94170 90600 87029 83102 84898
-5719 84898 93223 104410 110291 110448 105774 91561 64468 27835 -9799 -37894 -44405 -33743 -15419 2904 17472
-5704 17472 37763 53941 67256 77292 84466 88211 89094 88367 87641 91263 92023 81752 65758 48630 37227 35005
-5688 35005 42325 51880 61435 76297 94021 108823 117901 121434 124967 130575 130460 128973 127490 123200 121773 132808
-5672 132808 153386 172709 182491 177665 163303 144256 122347 100378 78413 57555 42421 33608 30522 29729 34659
-5657 34659 39947 39515 28048 16581 11971 16905 33910 53777 69469 82304 91449 100598 108137 115676 114178 112684
-5641 112684 107015 101347 104947 118091 134216 144617 138319 107220 70636 47408 36832 39615 46215 52815 50944
-5626 50944 49077 50430 51783 55427 64800 75425 83187 79438 75693 74631 73569 69913 66257 59918 53583 48973 47225
-5609 47225 49055 56613 64912 70349 74295 72522 67077 61632 54041 52178 50255 48332 49629 50929 50110 49290 39645
-5592 39645 24280 9597 638 -2655 -3084 -1071 6664 8498 10335 6776 3221 1216 4935 7309 9687 8010 6333
-5575 6333 6500 12396 16860 15601 14188 12780 11908 13898 19942 20267 15284 7439 -1243 -7060 -7213 -1641 3717 11941
-5557 11941 21776 31610 46331 61055 75958 90860 106598 125201 141837 164197 186672 209152 227815 246478
-5543 246478 271427 305921 353414 410446 490610 599398 744678 933842 1168121 1453921 1785514 2149544
-5531 2149544 2516075 2846356 3102224 3256965 3286525 3192066 2988132 2698337 2354279 1996867 1661399
-5520 1661399 1365999 1122198 929918 782716 675582 602312 553851 517792 491273 467307 437621 401256
-5508 401256 364892 331713 298539 264172 235529 216240 206494 199373 197975 204355 216463 231791 247119 257687
-5494 257687 258720 252120 239796 233073 226354 222497 218640 222761 232607 242095 251583 258507 265431 274979 278803 275381
-5478 275381 262420 249101 230058 203204 176350 144368 112385 86787 61189 29747 -1694 -24311 -33571 -35677
-5464 -35677 -37782 -45105 -46704 -42936 -39169 -38561 -37954 -30668 -23383 -20658 -17934 -15210 -12482 -12769 -13056 -14774 -16488 -21694
-5446 -21694 -26901 -25429 -23953 -22511 -21068 -16764 -12456 -9847 -7239 -7492 -7742 -12646 -17550 -19593 -21631 -23092 -24553
-5429 -24553 -28876 -33195 -34358 -35520 -36683 -37842 -39400 -40954 -45370 -49786 -51314 -52838 -51500 -50162 -51362 -52558 -54828
-5412 -54828 -57098 -59579 -56334 -51537 -46741 -44147 -41550 -45631 -49711 -49622 -49529 -42757 -35986 -28637 -21285 -18702 -16119 -15389
-5394 -15389 -14655 -16783 -18911 -22492 -26073 -29655 -33236 -33806 -34376 -33515 -32654 -28514 -24374 -23096 -21817 -25756 -29696 -36139
-5376 -36139 -42582 -46223 -44140 -38002 -26140 -19347 -12553 -6952 -7075 -8614 -10153 -12050 -13947 -19362 -24776 -27329 -29882
-5359 -29882 -31868 -33854 -32979 -32103 -31585 -31067 -30549 -30031 -27575 -25119 -22663 -20208 -18229 -16250 -20949 -25648 -31984 -38319
-5341 -38319 -41792 -45265 -47964 -50662 -53360 -56058 -58406 -60753 -54515 -48277 -44483 -40689 -34033 -27378 -25224 -23070 -27594
-5324 -27594 -32114 -32703 -33292 -33881 -34466 -30814 -27161 -23509 -19853 -20852 -21851 -22850 -23845 -23036 -22227 -21419 -20606 -20632 -20658 -20685 -20707 -22134
-5302 -22134 -23561 -24989 -26412 -26051 -25689 -25328 -24963 -25600 -26233 -26867 -27501 -27392 -27281 -27169 -27057 -29602 -32144 -36117 -40089 -42187
-5282 -42187 -44282 -50788 -57295 -61808 -60593 -58126 -58521 -56833 -55141 -52734 -47464 -44643 -47542 -49667 -46067 -39817 -24024
-5265 -24024 -1492 21038 32751 33973 28216 22462 16764 11069 5669 273 -9777 -15054 -17890 -23584 -26122 -25794
-5249 -25794 -28689 -31581 -31525 -31466 -33020 -31708 -31026 -30340 -29479 -28615 -30258 -31898 -33720 -35539 -36676 -40670 -45146 -49618 -49443
-5230 -49443 -44498 -40626 -39616 -36012 -32409 -32502 -32595 -35028 -40324 -41505 -39825 -39545 -42128 -43100 -41211 -35662 -30113 -24385
-5212 -24385 -18657 -7563 3530 12299 12482 3199 -6084 -15903 -25723 -28894 -32066 -35416 -35904 -34514 -33120 -33158 -37965
-5195 -37965 -40421 -42873 -45623 -48373 -49771 -51165 -51783 -49540 -51295 -53047 -51459 -49872 -48120 -49227 -50334 -48578 -47304
-5178 -47304 -46026 -41229 -36433 -36158 -35878 -33989 -34961 -36713 -38461 -38956 -39452 -36664 -33877 -29479 -27940 -26435 -24929 -26763
-5160 -26763 -28592 -29323 -27191 -25417 -23640 -24460 -28142 -30214 -32282 -33217 -34153 -39083 -41148 -39638 -38129 -38826 -39519 -42586
-5142 -42586 -45653 -50330 -52141 -54821 -57500 -58271 -56177 -52678 -49175 -44062 -38949 -34913 -30873 -28563 -26252 -23632 -25779
-5125 -25779 -28581 -31384 -31626 -31864 -35442 -39020 -40186 -41349 -45851 -50352 -51698 -53039 -55812 -58584 -64834 -71080 -72079 -73077
-5107 -73077 -69429 -65777 -59084 -52391 -51694 -55763 -62099 -68434 -72597 -71986 -69764 -67543 -65520 -63492 -61465 -59438 -58070
-5090 -58070 -56699 -52644 -53360 -55324 -57284 -56203 -55122 -51124 -47121 -45504 -43887 -45165 -46439 -47714 -48988 -47583 -46175
-5073 -46175 -44766 -43357 -45836 -48310 -49536 -50759 -51418 -54936 -58279 -56848 -50963 -47937 -46346 -41889 -38628 -40134 -43074
-5056 -43074 -46011 -49954 -53893 -54496 -55096 -56028 -56956 -54847 -52734 -49074 -50181 -48608 -47032 -44774 -42511 -44546 -46577 -49965
-5038 -49965 -53352 -54355 -55357 -53229 -51101 -48973 -46842 -49014 -51187 -51929 -52670 -53382 -54094 -54806 -55514 -55391 -55268 -55145 -55022
-5019 -55022 -55048 -55074 -55100 -55122 -53382 -51642 -52286 -52931 -53635 -54340 -53613 -52883 -50587 -48288 -45992 -43693 -46436 -49175 -51914 -54653
-4999 -54653 -54146 -53635 -53129 -52618 -51277 -49931 -48586 -47241 -48962 -50680 -52402 -54120 -53606 -53088 -52570 -52052 -53654 -55253 -53516
-4980 -53516 -51776 -48370 -44960 -42981 -41002 -39560 -38118 -36676 -35233 -34179 -33124 -33500 -33877 -31227 -28578 -30221 -31864
-4963 -31864 -36579 -41293 -41714 -42135 -42292 -42448 -42605 -42761 -43603 -44446 -41949 -39452 -41695 -43939 -44751 -45564 -46436 -47308 -51519 -55730
-4943 -55730 -52939 -50144 -51645 -53144 -51783 -50419 -44766 -39109 -37108 -35103 -33579 -34913 -35595 -31503 -29025 -31313 -34905
-4926 -34905 -38494 -39046 -39593 -38177 -36758 -35341 -33922 -36247 -38569 -40894 -43216 -44259 -45299 -46044 -46786 -43663 -35770 -35807
-4908 -35807 -40615 -43484 -43492 -46957 -53285 -59926 -63705 -66589 -69474 -70390 -66537 -64890 -66105 -67595 -64316 -59904 -55491 -49767
-4890 -49767 -48813 -50423 -52033 -52927 -53822 -52331 -50841 -54329 -57817 -59874 -61931 -61875 -61815 -64979 -62415 -53773 -45128 -36128 -27124
-4871 -27124 -22522 -17916 -20468 -23017 -28999 -34976 -39526 -44073 -45884 -47691 -47118 -46540 -50915 -55286 -57276 -59263 -60105 -60943
-4853 -60943 -59401 -57854 -57862 -57865 -55488 -53106 -48161 -43212 -43514 -43812 -45247 -46678 -45728 -44774 -47595 -50412 -47986 -45556 -45038 -44516
-4833 -44516 -47337 -50155 -50870 -51582 -54683 -57780 -54679 -51575 -52767 -53956 -54358 -54757 -52775 -50788 -46749 -42705 -42005 -41300
-4815 -41300 -41274 -41248 -41222 -41196 -44241 -47285 -46991 -46696 -48072 -49447 -53207 -56967 -57388 -57809 -58230 -58652 -57474 -56296 -55119 -53941
-4795 -53941 -54672 -55402 -54701 -54001 -55122 -56244 -54027 -51809 -52931 -54053 -52790 -51526 -51530 -51530 -54873 -58212 -59617 -61018 -62423
-4776 -62423 -63824 -60753 -57679 -55681 -59404 -62624 -65840 -68345 -65121 -64510 -63895 -60541 -57183 -55618 -54049 -56419 -58786
-4759 -58786 -64167 -63820 -61450 -59076 -57780 -56479 -55182 -53881 -54563 -55245 -55927 -56609 -57470 -58331 -59490 -55879 -52819 -49760 -49741
-4740 -49741 -49723 -50002 -50282 -55808 -61335 -63526 -65717 -66478 -67238 -67819 -68400 -68982 -69563 -67040 -64517 -61994 -59471 -59691 -59911 -62516
-4720 -62516 -65121 -65825 -66526 -65796 -65065 -62729 -60388 -60433 -63340 -64912 -61711 -58987 -56263 -57299 -58331 -56978 -55626 -53229
-4702 -53229 -50833 -52551 -54269 -57120 -57109 -55726 -59114 -64260 -64637 -66205 -70636 -69969 -66440 -67085 -67730 -64998 -62266 -59535
-4684 -59535 -56799 -60120 -63440 -65330 -67215 -67748 -68281 -72153 -76021 -73424 -70826 -68229 -65628 -62673 -59717 -59147 -58577 -62509
-4666 -62509 -66440 -67987 -69533 -66533 -63533 -61965 -60396 -57634 -54873 -47818 -40764 -36456 -32144 -33083 -34018 -36389 -38755
-4649 -38755 -42556 -46354 -44952 -43547 -43577 -43603 -43484 -43361 -43540 -43715 -41513 -44077 -47300 -50520 -52760 -54996 -58666 -62333 -65885
-4630 -65885 -69433 -66783 -64130 -58380 -52626 -50393 -48157 -48277 -51258 -53106 -50185 -46816 -46309 -48187 -50065 -51556 -53047
-4613 -53047 -54537 -56028 -58353 -60679 -63004 -65330 -67312 -69291 -66981 -64666 -61402 -58134 -57254 -56371 -56043 -55711 -55383 -55052
-4595 -55052 -58450 -61845 -61905 -61961 -58849 -55734 -55007 -54276 -54742 -55204 -55670 -56132 -57388 -58640 -59896 -61148 -59661 -58171 -55253
-4576 -55253 -52331 -51843 -51355 -53252 -55149 -54899 -54649 -57739 -60828 -64991 -69153 -67115 -65076 -61070 -57064 -56397 -55730 -55014 -54299
-4557 -54299 -55968 -57638 -56535 -55432 -51944 -48455 -48202 -47949 -47695 -47442 -45728 -44013 -42299 -40585 -39959 -39333 -38707 -38080 -37693
-4538 -37693 -37305 -40257 -43208 -47024 -50841 -52272 -53703 -57101 -60500 -60560 -60619 -60124 -59624 -56744 -53859 -56762 -59661 -62565 -65464
-4519 -65464 -65609 -65751 -65896 -66038 -63679 -61316 -62296 -60411 -55614 -55585 -56989 -58391 -59468 -60541 -61618 -62691 -59587 -56479 -55760
-4500 -55760 -55037 -54496 -53952 -51206 -48455 -46055 -46518 -48053 -49588 -49305 -46160 -47010 -52629 -51683 -55506 -59628 -63750 -64830 -63049
-4481 -63049 -63056 -63064 -58078 -55953 -56691 -57429 -59240 -56281 -57079 -60738 -62997 -62393 -59106 -58681 -60165 -61648 -63131 -59844 -57060 -54276
-4461 -54276 -51373 -48470 -45269 -44930 -42981 -41032 -38606 -36180 -34827 -36336 -36772 -34346 -32099 -32714 -33031 -33348 -33843 -34339 -37160
-4442 -37160 -39981 -44412 -45981 -45970 -45959 -44159 -45221 -46223 -47226 -49719 -45534 -42795 -46734 -48109 -46622 -47580 -48537 -49495 -50453
-4423 -50453 -47535 -47479 -45813 -44147 -43972 -43797 -42012 -43089 -44837 -46585 -47259 -45072 -41811 -38550 -38092 -40495 -42094 -40831
-4405 -40831 -41356 -41882 -43063 -44244 -45247 -46249 -49596 -50077 -49011 -45079 -42225 -39366 -41103 -42836 -43022 -43205 -41781 -43216
-4387 -43216 -44177 -45135 -44665 -47054 -49089 -51120 -50472 -49819 -50244 -50665 -51090 -51511 -49551 -47587 -48608 -52488 -54284 -53214 -47557
-4368 -47557 -44759 -46082 -47401 -48903 -50401 -51008 -51612 -52398 -53181 -53073 -55823 -56967 -58107 -62412 -66712 -69943 -70308 -69504 -71557
-4349 -71557 -71825 -72090 -69377 -66660 -66928 -62423 -56371 -55085 -52909 -55499 -61372 -67241 -66735 -66224 -65337 -64446 -66422 -68393 -69533
-4330 -69533 -70670 -67338 -66865 -67484 -68099 -68896 -69690 -66850 -64007 -61167 -58324 -59143 -59960 -60779 -61596 -63250 -64901 -66735 -68564
-4311 -68564 -67819 -69932 -70439 -70942 -69899 -68851 -69597 -67476 -67018 -69422 -70036 -70651 -71564 -72477 -68620 -64763 -62546 -60329 -58946
-4292 -58946 -60425 -63276 -59449 -54966 -50483 -49890 -52160 -52819 -53479 -55093 -56706 -58141 -59576 -60071 -57705 -56948 -56192 -56270 -56348
-4273 -56348 -54817 -56147 -57541 -58931 -62292 -62788 -61558 -63187 -63030 -62870 -61819 -60765 -56852 -52935 -53315 -53691 -51209 -48724
-4255 -48724 -49532 -50337 -51146 -51951 -54608 -57262 -59919 -62572 -60653 -58730 -56811 -54888 -54250 -53609 -54582 -52689 -50967 -49246 -48120
-4236 -48120 -49857 -52100 -54344 -58197 -62050 -57355 -52659 -50349 -52808 -55596 -55521 -56997 -61335 -63563 -62930 -64085 -65240 -65292
-4218 -65292 -65345 -67782 -70219 -66783 -63347 -62296 -66015 -67260 -65643 -64323 -63004 -64461 -63056 -63261 -63466 -63403 -63340 -63276 -63213 -65825
-4198 -65825 -68438 -72660 -74020 -74963 -75906 -76849 -77792 -74139 -73349 -70949 -68550 -68833 -69116 -69399 -69682 -69727 -69772 -68028 -69146 -74855
-4178 -74855 -77702 -79118 -83396 -82573 -78887 -71922 -64957 -62762 -63429 -62486 -61543 -61122 -60701 -58670 -59501 -57083 -54664 -52424 -50185
-4159 -50185 -50173 -50162 -50747 -54194 -56896 -56736 -58365 -59993 -63396 -66798 -70200 -73603 -72026 -70450 -66489 -62527 -60936 -59345
-4141 -59345 -55965 -55447 -56270 -54232 -56486 -61603 -64335 -64204 -64133 -61201 -61786 -62371 -64029 -65687 -67141 -65732 -60865 -55998 -51549
-4122 -51549 -49961 -50103 -50244 -49954 -49663 -52711 -55760 -56423 -57086 -55365 -53643 -52823 -52003 -52734 -56326 -57862 -56535 -55089 -56505
-4103 -56505 -56430 -51586 -51988 -52391 -52257 -52122 -52763 -56267 -58566 -60861 -66023 -66410 -65222 -64029 -62542 -61052 -59788 -58521 -57258
-4084 -57258 -55991 -59825 -63656 -66716 -66910 -66682 -66455 -64439 -65285 -65266 -65248 -63023 -60798 -59512 -58227 -59326 -60425 -61883 -63340
-4065 -63340 -66407 -66612 -65009 -63403 -61622 -59837 -60738 -61637 -60332 -59024 -58614 -61063 -60176 -56423 -57116 -57806 -60705 -63601 -63958
-4046 -63958 -64316 -64495 -64674 -65330 -63124 -61096 -61931 -62974 -66880 -63153 -59427 -59576 -59725 -60053 -60381 -58007 -58495 -60534 -62572
-4027 -62572 -63179 -60925 -62665 -64406 -64521 -64637 -64752 -64868 -65728 -66589 -65065 -63541 -61998 -60455 -56527 -52599 -48970 -45340 -45049
-4008 -45049 -44759 -48344 -51929 -54083 -56237 -56304 -56371 -55186 -54001 -50568 -49995 -52286 -54575 -56389 -61063 -64309 -64689 -61823 -58953
-3989 -58953 -57340 -55722 -57209 -58693 -60179 -61663 -62635 -63608 -61719 -59829 -59013 -58197 -60243 -62289 -61219 -60150 -59080 -58011
-3971 -58011 -60131 -62252 -61808 -61365 -57071 -57545 -56770 -55991 -56140 -56285 -56434 -56580 -58711 -60839 -60109 -59375 -58286 -57194 -56106 -55014
-3951 -55014 -57355 -59691 -59170 -58644 -56751 -54854 -55823 -56788 -54761 -52730 -53565 -54396 -55111 -55823 -56539 -57250 -57459 -57664 -57694 -57720 -54470
-3930 -54470 -48355 -45940 -48291 -50423 -52551 -54683 -56811 -57929 -54273 -53304 -57101 -59993 -60019 -59095 -58167 -59151 -60131 -60161 -57325
-3911 -57325 -54739 -56919 -59102 -61283 -62781 -64275 -64342 -64406 -62669 -60929 -59192 -57452 -59919 -62382 -60079 -57772 -58786 -59796
-3893 -59796 -57947 -56095 -57705 -59311 -63366 -67417 -71195 -68292 -66287 -64279 -62661 -61040 -60854 -60664 -59479 -58290 -59967
-3876 -59967 -61640 -62453 -63261 -64074 -64882 -65889 -66891 -65035 -63176 -61141 -59102 -57068 -55029 -56304 -57575 -58849 -60120 -60858
-3858 -60858 -61592 -62330 -63064 -64745 -66425 -65244 -64063 -64849 -65635 -66600 -67566 -67830 -70957 -75693 -74706 -69187 -63668 -59341 -60738
-3839 -60738 -60101 -59464 -59184 -58905 -55495 -52085 -53445 -54806 -54206 -53606 -54437 -55268 -55950 -56632 -57314 -57996 -59095 -60191 -61290 -62386
-3819 -62386 -60802 -59214 -62401 -65583 -65110 -64633 -64160 -63683 -69828 -75969 -77344 -78716 -75496 -72272 -71915 -71553 -71166 -70774 -70387
-3800 -70387 -69995 -67946 -65892 -65274 -64651 -64927 -65199 -62613 -60023 -59002 -57981 -58391 -58801 -57958 -57116 -55022 -52927 -54448 -58830
-3781 -58830 -64823 -65091 -65777 -66463 -65896 -62468 -57269 -57794 -56352 -54910 -56389 -57869 -57917 -57966 -59855 -61745 -63634 -65523 -67145
-3762 -67145 -68766 -72354 -73081 -70953 -74549 -74568 -74587 -72727 -68005 -64536 -66791 -67428 -68065 -67629 -67193 -63984 -60776 -62337 -63899
-3743 -63899 -63090 -62281 -61473 -60664 -61704 -62743 -63783 -64823 -64536 -64249 -63962 -63675 -61778 -59881 -57984 -56088 -55599 -55111 -57485
-3724 -57485 -59859 -60265 -60671 -61078 -61484 -62039 -62594 -63150 -63705 -65363 -67022 -65818 -64614 -64946 -65278 -67040 -68803 -68330 -67856 -70245
-3704 -70245 -72634 -70804 -68974 -67145 -65315 -63068 -60820 -58573 -56326 -56274 -56222 -56170 -56117 -56989 -57862 -60165 -62468 -67528 -72589
-3685 -72589 -72880 -73171 -72537 -71903 -71270 -70636 -68754 -66873 -64991 -63109 -65341 -67573 -66943 -66314 -65550 -64786 -64022 -63258 -61599 -59941
-3665 -59941 -61145 -62348 -59427 -56501 -58350 -60194 -60999 -61801 -61175 -60545 -62222 -63895 -62710 -61521 -65225 -68926 -67860 -66791
-3647 -66791 -64752 -62710 -62102 -61491 -61391 -61286 -58324 -55357 -55279 -55197 -55119 -55037 -56211 -57381 -61417 -65449 -64566 -63679 -59934 -56185
-3627 -56185 -54168 -52149 -52995 -53837 -56099 -58357 -60619 -62878 -60071 -57262 -57317 -57370 -59647 -61920 -61335 -60746 -60519 -60288 -62922
-3608 -62922 -65553 -68069 -70581 -70234 -69884 -69060 -68233 -67409 -66582 -65412 -64238 -63246 -62252 -62810 -66228 -70543 -70085 -70689 -68427 -67480
-3588 -67480 -66530 -63377 -60220 -57068 -53911 -54724 -55532 -56345 -57153 -57519 -57880 -58245 -58607 -58763 -58916 -57642 -56363 -59531 -62695 -63001
-3568 -63001 -63302 -65020 -66735 -68453 -70167 -70633 -71095 -71561 -72023 -70372 -68717 -67066 -65412 -62688 -59960 -57235 -54508 -54884
-3550 -54884 -55257 -55633 -56006 -57455 -58901 -60351 -61797 -61011 -60220 -59434 -58644 -59259 -59870 -61916 -63958 -66433 -68907 -66612 -64316
-3531 -64316 -62289 -60261 -61096 -61931 -61230 -60530 -59829 -63899 -66388 -66015 -68982 -71948 -68281 -64614 -63809 -63004 -63422 -63839 -65687
-3512 -65687 -67536 -66641 -65747 -66284 -66820 -65837 -64853 -62438 -60023 -59650 -59278 -61767 -64253 -63731 -63209 -62688 -62162 -61312 -60463 -59613 -58760
-3491 -58760 -60176 -61592 -63008 -64420 -65695 -66969 -68244 -69515 -70193 -70871 -71549 -72224 -71315 -70405 -69496 -68583 -67674 -66764 -65855 -64942
-3471 -64942 -65061 -65177 -65296 -65412 -65889 -66362 -66839 -67312 -65725 -64133 -62546 -60955 -59427 -57895 -61137 -64376 -64987 -65594 -66205 -66813
-3451 -66813 -65337 -63858 -67152 -70443 -70592 -70737 -66116 -61491 -59017 -56539 -56926 -57310 -58171 -59032 -62755 -66474 -64801 -63127
-3433 -63127 -64316 -65501 -64096 -62691 -59855 -57016 -57787 -58558 -56468 -54373 -51787 -49201 -49477 -49749 -50978 -52208 -53438 -54664
-3415 -54664 -55312 -55961 -56609 -57254 -58409 -59565 -59289 -59009 -56173 -53334 -55268 -57198 -57612 -58022 -58435 -58845 -55160 -51470 -50647 -49819
-3395 -49819 -51321 -52819 -54321 -55819 -55760 -55696 -55637 -55573 -56289 -57001 -57716 -58428 -61365 -64297 -62464 -60627 -59360 -58089 -59684 -61275
-3375 -61275 -61234 -61193 -62583 -63973 -64707 -65442 -67607 -69772 -68300 -66828 -68218 -69608 -67987 -66366 -64745 -63124 -63615 -64107 -61737
-3356 -61737 -59367 -59263 -59158 -59054 -58950 -60996 -63042 -62225 -61409 -62322 -63235 -64148 -65061 -62184 -59304 -61197 -63086 -61163 -59237
-3337 -59237 -57314 -55387 -51731 -48072 -47278 -46480 -48012 -49540 -53934 -58324 -59304 -60280 -64122 -67961 -67689 -67413 -67141 -66865 -67935
-3318 -67935 -69000 -67208 -65412 -65527 -65639 -62892 -60142 -59650 -59158 -58666 -58175 -56907 -55640 -57235 -58830 -57429 -56028 -57489
-3300 -57489 -58950 -59635 -60321 -61186 -62050 -61909 -64629 -65561 -61722 -58540 -55357 -54440 -53524 -54657 -51019 -47203 -43387 -43208 -43029
-3281 -43029 -39989 -36948 -31302 -25656 -28596 -31537 -36981 -42426 -45008 -47591 -50062 -52532 -52141 -51750 -56158 -60567 -63545
-3264 -63545 -66522 -67950 -69377 -67942 -66507 -66623 -66738 -68285 -69831 -68292 -66753 -65214 -63675 -61212 -58748 -58074 -62170 -65125
-3246 -65125 -63310 -60004 -59561 -59475 -59389 -59483 -59576 -60534 -61491 -62449 -63407 -63679 -63951 -64223 -64495 -62367 -60239 -56680 -53121 -48757 -44393
-3225 -44393 -42116 -44610 -45224 -45839 -49614 -53390 -54303 -55216 -56308 -57399 -58066 -61592 -65121 -65784 -65974 -66161 -66172 -66179 -67353 -68523
-3205 -68523 -71307 -71225 -66914 -62598 -59181 -58622 -60638 -59788 -58942 -60955 -62315 -60809 -61096 -61379 -60936 -60489 -62729 -64964 -66369
-3186 -66369 -64909 -65240 -65568 -62229 -61752 -59844 -57936 -58175 -61275 -64376 -64614 -61365 -58115 -57548 -59844 -63750 -62885 -63094 -66164
-3167 -66164 -66082 -63138 -57690 -55104 -54127 -56013 -61238 -66463 -66545 -66627 -66709 -66791 -65442 -64092 -57973 -51854 -52980 -54101 -53617 -55991
-3147 -55991 -59143 -62292 -62762 -63228 -61432 -59632 -58014 -56393 -56445 -59356 -60660 -61961 -62810 -63656 -64506 -65352 -65188 -65020 -64856 -59919
-3127 -59919 -56729 -56397 -57023 -57645 -58450 -59252 -60057 -60858 -61551 -62244 -62937 -63630 -62296 -60962 -61238 -58652 -58286 -57921 -58629 -62199 -63384
-3106 -63384 -64569 -64323 -66940 -68602 -70264 -69243 -68222 -67022 -65822 -64622 -63422 -62922 -62423 -61924 -61424 -61938 -62453 -62967 -63481
-3087 -63481 -61700 -59915 -60996 -62073 -63153 -64230 -65013 -65792 -68289 -66012 -60876 -60507 -59725 -58939 -55592 -52242 -51750 -51254 -53624
-3068 -53624 -55991 -59017 -62039 -62203 -62363 -62870 -63373 -63880 -64383 -63578 -62770 -61965 -61156 -60183 -59211 -61100 -62989 -64044 -65099 -68658
-3048 -68658 -67446 -68911 -67514 -67428 -67342 -65587 -63832 -62076 -60321 -62658 -64994 -64469 -63943 -66638 -69332 -69164 -68997 -69791 -70584
-3029 -70584 -71378 -72172 -71296 -70420 -69545 -68669 -65650 -62632 -64383 -66135 -66753 -67372 -67991 -68609 -68620 -68632 -68643 -68654 -69500 -70346 -71192 -72038
-3007 -72038 -70450 -68863 -67275 -65687 -64279 -62870 -61461 -60053 -60250 -60448 -60645 -60843 -60206 -59568 -58931 -58294 -60735 -63172 -65609
-2988 -65609 -68046 -67681 -67316 -66951 -66586 -66641 -66694 -69608 -72522 -72753 -72984 -73215 -73446 -73256 -73066 -72876 -72682 -72135 -71583 -71035 -70484 -70219
-2966 -70219 -69954 -69690 -69422 -67905 -66384 -64868 -63347 -65326 -67301 -69399 -66723 -65870 -69783 -70894 -69142 -67439 -65732 -66533
-2948 -66533 -67331 -66492 -62788 -59084 -58242 -58413 -58584 -58935 -54515 -53375 -55096 -54910 -54720 -56069 -57418 -58767 -60116 -58245 -56375
-2929 -56375 -54683 -52987 -53658 -57187 -60720 -61387 -62058 -62725 -63217 -63705 -62900 -62091 -61286 -60478 -61372 -62263 -61726 -61186 -63142 -65095
-2909 -65095 -64189 -63280 -60437 -57589 -55819 -56907 -59669 -59565 -59643 -62579 -61644 -60705 -61558 -59546 -57716 -55883 -56553 -57224 -57839 -55588
-2889 -55588 -57929 -63131 -66802 -67607 -65430 -63254 -59770 -56281 -55834 -55387 -54653 -56777 -57470 -58163 -57876 -60448 -61409 -62371 -62524
-2870 -62524 -62673 -61391 -60109 -57370 -54627 -56654 -58681 -60530 -62378 -61365 -60351 -60440 -60530 -63660 -63928 -63116 -62304 -64174 -66045
-2851 -66045 -66634 -67223 -65248 -63273 -60664 -62825 -68922 -68341 -67074 -65807 -62512 -62080 -61402 -60724 -61655 -62587 -64413 -66239 -65203
-2832 -65203 -64167 -64767 -65367 -67398 -69425 -69727 -70029 -70510 -70987 -68598 -69071 -69366 -69656 -70398 -71140 -69019 -66895 -67562 -68229 -64424
-2812 -64424 -63478 -64950 -66422 -66999 -64711 -62844 -63839 -66086 -65468 -63899 -62330 -63802 -62408 -62285 -65020 -63284 -61547 -61096
-2794 -61096 -63504 -64301 -65099 -68628 -72153 -72518 -70022 -69466 -68907 -66738 -64569 -61588 -58603 -60388 -62173 -63246 -64316 -62166
-2776 -62166 -62878 -65002 -64260 -63697 -65997 -66153 -66306 -66638 -66969 -65114 -63258 -62833 -62408 -62788 -63168 -62475 -58920 -55722 -55387 -55946
-2756 -55946 -56505 -57243 -55119 -52995 -53732 -56106 -58480 -61033 -63586 -64678 -65769 -66861 -67953 -66757 -65561 -67405 -66388 -64655
-2738 -64655 -62922 -62263 -64465 -65553 -66638 -66470 -66302 -67122 -67938 -68576 -69213 -69936 -67793 -67260 -66727 -66019 -65307 -64774 -64242 -65128 -68874
-2717 -68874 -72619 -73502 -70812 -68117 -65244 -62371 -62788 -63202 -65225 -64387 -63373 -62356 -61458 -60560 -59136 -62483 -65829 -64406
-2699 -64406 -62743 -61081 -61983 -62885 -61178 -59471 -60627 -61782 -62162 -62542 -62922 -63302 -65434 -67566 -63854 -64912 -69131 -68579 -65464
-2680 -65464 -67119 -66597 -66075 -65851 -65628 -65643 -65658 -65673 -65687 -67059 -68430 -66940 -65445 -64968 -64491 -64014 -63533 -62445 -61357 -60448 -59535
-2659 -59535 -58447 -60220 -63068 -61141 -58480 -55819 -55722 -55622 -58029 -60437 -59982 -59524 -60977 -62430 -63884 -65333 -65535 -65736 -65937
-2640 -65937 -66135 -66764 -67394 -68024 -68650 -67730 -66809 -68572 -65561 -62434 -59307 -60653 -61994 -62922 -63850 -64778 -65702 -64856 -64010 -63165
-2620 -63165 -62315 -60873 -59430 -58286 -57139 -56218 -60068 -61234 -62397 -62311 -62225 -62140 -62050 -63496 -64938 -66381 -67823 -67182 -66537 -65892
-2600 -65892 -65248 -63220 -61189 -62020 -62851 -64104 -65352 -66600 -67849 -69496 -71140 -72783 -74426 -73808 -73185 -72563 -71941 -71650 -71356
-2581 -71356 -71061 -70767 -71311 -71851 -72392 -72932 -71576 -70215 -68859 -67499 -67454 -67405 -67361 -67312 -66828 -66340 -65855 -65367 -63332 -61294 -59259
-2560 -59259 -57221 -58398 -59572 -60750 -61924 -64711 -67495 -67420 -67342 -65740 -64133 -62531 -60925 -61648 -62367 -63090 -63809 -63485 -63161
-2541 -63161 -62837 -62512 -63261 -64010 -64760 -65509 -65184 -64860 -62628 -63258 -64961 -61894 -61689 -61484 -60981 -60478 -59975 -59471 -58670 -57869 -57068
-2520 -57068 -56267 -59326 -62386 -60675 -58965 -57910 -56855 -55801 -54746 -56035 -57321 -58611 -59896 -62080 -64260 -61674 -59084
-2503 -59084 -59360 -59632 -59907 -60179 -59322 -58462 -57604 -56744 -56669 -56591 -56516 -56438 -57198 -57955 -58715 -59471 -61856 -64238 -66623 -69004 -66560 -64111
-2481 -64111 -64528 -64942 -65568 -66194 -66820 -67443 -67413 -67383 -67353 -67320 -68706 -70092 -71479 -72861 -73413 -73964 -74516 -75064 -73834 -72604 -71374
-2460 -71374 -70141 -69448 -68754 -65199 -61640 -62565 -63489 -64413 -65333 -65572 -65810 -63187 -60560 -59960 -59356 -61316 -63276 -63183 -65948 -65673
-2440 -65673 -65397 -63418 -61435 -61957 -65341 -68102 -67998 -64614 -61230 -60787 -63202 -63828 -64454 -63742 -60165 -58972 -60642 -61197 -61748
-2421 -61748 -64864 -67979 -68833 -69682 -70532 -71382 -71531 -71680 -71829 -71974 -70633 -69291 -66518 -63742 -65471 -67200 -64637 -62069 -62188
-2402 -62188 -62307 -62248 -62184 -63437 -61823 -60209 -61458 -62233 -63004 -63776 -64547 -66068 -64722 -64987 -65251 -64924 -64592 -62829 -63928 -65263
-2382 -65263 -69459 -75086 -75943 -73521 -73961 -72671 -68520 -65218 -61916 -60165 -61275 -64204 -67133 -72925 -73946 -73249 -72552 -67562
-2364 -67562 -65434 -65333 -65233 -68471 -71710 -71624 -68676 -65728 -65643 -65766 -65889 -66012 -66135 -68315 -67629 -68557 -69481 -68769 -68054 -67342 -66627
-2343 -66627 -65945 -65259 -65829 -66396 -68546 -67830 -66343 -64853 -66191 -67528 -65706 -63884 -65579 -70137 -70581 -68162 -64789 -64279 -63410
-2324 -63410 -62542 -62300 -62058 -61815 -61573 -61297 -61022 -64085 -67148 -67051 -66955 -66858 -66761 -69690 -72619 -72209 -71799 -69392 -66984 -66008 -65032 -66079
-2302 -66079 -67126 -67100 -67074 -63232 -65114 -67711 -70308 -73294 -70554 -68650 -66746 -65497 -64249 -64432 -64614 -65848 -67078 -65926
-2284 -65926 -64771 -66451 -68128 -69809 -71486 -71140 -70789 -68058 -65322 -65721 -66116 -65084 -64048 -62155 -60258 -60750 -61238 -61372 -61502
-2265 -61502 -61637 -61767 -61178 -60586 -59997 -59404 -59471 -59535 -58171 -56803 -59270 -61733 -61812 -61890 -64894 -67894 -68151 -68408 -72418 -70700 -64689
-2244 -64689 -64402 -65520 -66634 -64767 -62900 -62583 -62263 -61942 -61622 -63094 -64562 -66030 -67499 -65803 -64104 -65743 -67383 -68937
-2226 -68937 -70487 -68699 -66910 -65833 -64756 -67972 -71184 -70882 -70581 -71710 -72835 -72190 -71546 -69470 -67391 -66209 -65028 -63847
-2208 -63847 -62661 -62322 -61983 -61644 -61301 -61558 -61815 -62073 -62326 -62807 -63288 -63768 -64245 -62550 -60854 -62497 -64137 -68646 -73152 -72887
-2188 -72887 -72623 -71080 -69533 -69418 -69302 -66082 -62859 -61066 -59274 -60437 -61596 -64186 -66776 -64752 -62729 -65475 -68218 -67059
-2170 -67059 -65900 -64741 -63578 -62688 -61797 -60906 -60012 -60016 -60019 -62885 -65747 -63928 -62106 -60288 -58465 -60045 -61622 -63202 -64778
-2151 -64778 -64420 -64059 -63701 -63340 -62565 -61786 -65781 -69772 -69328 -68885 -68441 -67998 -69701 -71404 -68337 -65270 -65527 -65784 -66042 -66299
-2131 -66299 -67391 -68482 -69574 -70666 -71251 -71836 -69559 -67279 -64316 -61353 -61253 -61148 -62762 -64376 -64558 -64737 -65486 -66235 -65553
-2112 -65553 -64868 -65505 -66142 -68210 -70275 -69422 -68568 -67715 -66858 -66571 -66284 -65997 -65706 -66850 -67994 -66276 -64555 -63355 -62151 -63809
-2092 -63809 -65468 -66682 -67894 -67674 -67454 -67059 -66660 -69123 -71587 -70089 -68587 -67085 -65583 -65143 -64700 -64256 -63813 -63820 -63824 -63828 -63832 -64495
-2070 -64495 -65155 -67245 -69336 -68538 -67737 -64074 -60411 -58577 -56744 -54910 -53076 -56669 -60261 -63854 -67446 -67074 -66701 -66328
-2052 -66328 -65956 -64987 -64018 -63049 -62080 -60962 -59844 -58726 -57608 -58517 -59427 -60336 -61245 -62155 -63064 -63973 -64882 -63765 -62647 -61529
-2032 -61529 -60411 -60936 -61461 -61987 -62512 -62203 -61894 -61584 -61275 -61502 -61730 -61957 -62184 -62978 -63772 -65997 -68222 -68188 -68151 -65255 -62356
-2011 -62356 -61040 -59721 -63176 -66627 -67435 -68240 -66187 -64130 -64163 -64193 -64227 -64256 -62307 -60358 -61271 -62184 -62024 -61864 -61704 -61543 -63940
-1990 -63940 -66336 -63962 -61588 -63478 -65367 -65825 -66284 -64133 -61979 -62691 -63399 -63068 -62732 -62401 -62065 -60586 -59102 -62393 -65680
-1971 -65680 -65125 -64566 -66873 -69176 -69802 -70428 -72485 -74538 -73644 -72749 -71855 -70957 -69250 -67543 -68699 -69850 -70707 -71564 -69559
-1952 -69559 -67551 -69690 -71825 -69190 -66556 -65833 -65106 -64379 -63653 -64346 -65035 -65725 -66414 -65915 -65412 -67592 -69772 -71885 -71132 -69131
-1932 -69131 -67126 -66138 -65147 -66839 -68531 -70420 -69444 -67215 -64987 -64909 -64827 -64745 -64663 -64111 -63560 -65870 -68181 -67391 -66600 -65810 -65017
-1911 -65017 -63474 -61931 -61461 -63850 -66064 -65415 -63694 -61968 -64838 -67704 -67707 -67711 -65959 -64204 -65311 -66418 -65687 -64953 -65650 -66347
-1891 -66347 -65080 -63809 -63969 -64130 -63604 -63075 -63619 -67025 -70167 -70443 -69645 -68848 -67674 -66496 -65140 -63783 -64398 -62147 -62579
-1872 -62579 -65874 -68412 -68087 -66511 -64935 -64909 -62020 -60921 -59822 -59378 -61797 -62606 -63414 -63686 -63958 -64051 -64141 -64569 -62136 -61312
-1852 -61312 -60489 -61633 -62777 -63921 -65065 -63556 -62047 -60537 -59028 -58234 -57440 -59509 -61573 -59516 -57459 -58264 -59069 -59248
-1834 -59248 -59427 -59606 -59784 -59084 -58383 -58935 -59486 -62274 -62199 -60873 -59546 -62147 -64748 -66097 -64584 -61104 -57623 -56826 -56028 -55708
-1814 -55708 -55387 -56140 -59755 -60507 -58398 -59330 -63124 -63556 -63984 -64592 -65199 -64320 -63437 -62553 -61670 -59852 -58029 -56207 -54385 -56621
-1794 -56621 -58853 -61085 -63317 -62654 -61987 -61320 -60653 -61659 -62661 -63664 -64666 -64137 -63604 -63071 -62538 -60220 -57899 -58439 -58980
-1775 -58980 -58976 -58972 -56106 -53240 -53922 -54604 -55286 -55968 -55838 -55708 -57008 -58309 -56837 -55365 -56755 -58145 -58898 -59650 -60403 -61156 -63280
-1754 -63280 -65404 -67528 -69653 -67923 -66194 -62557 -61782 -66314 -66075 -65837 -65598 -66373 -67148 -67923 -68699 -68102 -67506 -66910 -66314 -66597
-1734 -66597 -66880 -67163 -67446 -67730 -68013 -68296 -68579 -67517 -66455 -65393 -64331 -63984 -63638 -63291 -62945 -61719 -60493 -59266 -58040 -59527
-1714 -59527 -61014 -59639 -58264 -59032 -59796 -59132 -58465 -58637 -58804 -60407 -62006 -63571 -65132 -63835 -62535 -61387 -60235 -61950
-1696 -61950 -63660 -64681 -65699 -61950 -58197 -56505 -54809 -55980 -57146 -57370 -57589 -59244 -60895 -62013 -63127 -61383 -59635
-1679 -59635 -59673 -59710 -62132 -64551 -64499 -64446 -62963 -61476 -63116 -64756 -64964 -65169 -66541 -67912 -69284 -70651 -69109 -67566 -67454 -67338
-1659 -67338 -65289 -63239 -65483 -67722 -68363 -69004 -71076 -73144 -70178 -67212 -67584 -67953 -67782 -67610 -67439 -67268 -66887 -66507 -68512
-1640 -68512 -70517 -71359 -72202 -68751 -65300 -63668 -62035 -64696 -67357 -64875 -62393 -59911 -57429 -59598 -61767 -63936 -66105
-1623 -66105 -67655 -69205 -68371 -67536 -65181 -62825 -63809 -64793 -62922 -61048 -62512 -63977 -64133 -64286 -64439 -64592 -63847 -63097 -62348 -61599
-1603 -61599 -63955 -66306 -68658 -71009 -70890 -70767 -70644 -70521 -66914 -63302 -59691 -56080 -56662 -57239 -59248 -61256 -63806 -66351
-1585 -66351 -66511 -66671 -67689 -68706 -69723 -70741 -68747 -66753 -67145 -67536 -67167 -66798 -68814 -70830 -73323 -75816 -78310 -80803
-1567 -80803 -79398 -77993 -76588 -75183 -73063 -70942 -68822 -66701 -65505 -64309 -63112 -61916 -65639 -69362 -73085 -76808 -76048
-1550 -76048 -75284 -73092 -70897 -67663 -64424 -63574 -62721 -60709 -58693 -60019 -61342 -61357 -61368 -63768 -66164 -67096 -68024 -70387 -72746
-1531 -72746 -70070 -67391 -66146 -64897 -64815 -64730 -64648 -64562 -64212 -63858 -63507 -63153 -64610 -66068 -67525 -68982 -70081 -71181 -72101 -73021
-1511 -73021 -73539 -71195 -67778 -69131 -68337 -67543 -67048 -66552 -65915 -65278 -64640 -64003 -61338 -58674 -59348 -60023 -61070 -62117 -60779 -59442
-1491 -59442 -60280 -61119 -59572 -58025 -57500 -56975 -58357 -56874 -54172 -56240 -60694 -65143 -64320 -63496 -60288 -57075 -57295 -57515 -57735
-1472 -57735 -57951 -58052 -58148 -59676 -61204 -61693 -62177 -60276 -58376 -59699 -61018 -63768 -66518 -68527 -70532 -69019 -67506 -69694
-1454 -69694 -69019 -66973 -69694 -73253 -72038 -69515 -66988 -66813 -66638 -66463 -66284 -65602 -64916 -65665 -66410 -65076 -63738 -65740 -67741
-1435 -67741 -65896 -64051 -62207 -60362 -61279 -62192 -64536 -66880 -63649 -60418 -61480 -62542 -63183 -63824 -61126 -58428 -58860 -59293
-1417 -59293 -61156 -63019 -63727 -64435 -65143 -65851 -65099 -64346 -63593 -62840 -63712 -64584 -65456 -66328 -64607 -62885 -58301 -58488 -62892 -64435
-1397 -64435 -65501 -66567 -66679 -66791 -64517 -62244 -64428 -66612 -68497 -70379 -72026 -68900 -65777 -67420 -66094 -64767 -62307
-1380 -62307 -59844 -62333 -64819 -63969 -63116 -63340 -63563 -63787 -64007 -64022 -64033 -64048 -64059 -63425 -62792 -62158 -61521 -62110 -62695 -63284 -63869 -61741
-1358 -61741 -59609 -59863 -60116 -61148 -62177 -63206 -64234 -62538 -60839 -61704 -67338 -68892 -70443 -72291 -74139 -73472 -72802 -72131
-1340 -72131 -71460 -66858 -62252 -63668 -65084 -67100 -66250 -62896 -64312 -65434 -66552 -64629 -62706 -63403 -64100 -66228 -68352 -65292
-1322 -65292 -62233 -61558 -60880 -59490 -58100 -59095 -60086 -59948 -59811 -63012 -66209 -67629 -69049 -69038 -69023 -66984 -64946 -66068 -67186
-1303 -67186 -66712 -63377 -61175 -63738 -65173 -63746 -62617 -64346 -65699 -67048 -68579 -70107 -69343 -68576 -67633 -66686 -65788 -62024
-1285 -62024 -60351 -63444 -66928 -67547 -67692 -67834 -68188 -68542 -67465 -66388 -68441 -70495 -72548 -74602 -71058 -67514 -67309 -67104 -67674
-1266 -67674 -68244 -66429 -64614 -64882 -65151 -65419 -65684 -65714 -65743 -65773 -65799 -66746 -67692 -67208 -66720 -68859 -70998 -67294 -68356 -67253 -69008
-1245 -69008 -71061 -70253 -70193 -70130 -69887 -69645 -68840 -68032 -67223 -66414 -66444 -66470 -66496 -66522 -67051 -67577 -68106 -68632 -67133 -65632 -64133 -62632 -61551
-1222 -61551 -60466 -59386 -58301 -60351 -62397 -62061 -61722 -63414 -65102 -69477 -69079 -66805 -64528 -61957 -59382 -59434 -59483 -59535 -59583 -62378
-1202 -62378 -65169 -67964 -70756 -69276 -67797 -68225 -65788 -63414 -65810 -66955 -65233 -63381 -61529 -59498 -57463 -59158 -60854
-1185 -60854 -62550 -64242 -64230 -64219 -60869 -57515 -59263 -61011 -62758 -64502 -62851 -61201 -59848 -58491 -55529 -57336 -58070 -55939
-1167 -55939 -53848 -51754 -52346 -52935 -57135 -61331 -62669 -64003 -64842 -65676 -65084 -64487 -66548 -68605 -65896 -63183 -61413 -59639
-1149 -59639 -60731 -61819 -61808 -61793 -60351 -58905 -58126 -57344 -56565 -55782 -57776 -59766 -58898 -58025 -56594 -55163 -56594 -58025 -57489 -56952
-1129 -56952 -56416 -55879 -55909 -55939 -58830 -61722 -62408 -63094 -63779 -64465 -64987 -65509 -66030 -66552 -65702 -64853 -64003 -63153 -61573 -59993 -61275
-1108 -61275 -62557 -62020 -61484 -62378 -63273 -64458 -65639 -66824 -68005 -69041 -70074 -68248 -66418 -64323 -62225 -62993 -63757 -61961
-1090 -61961 -60161 -61227 -62289 -62594 -62896 -63202 -63504 -64256 -65005 -64327 -63645 -64815 -65982 -64290 -62594 -60276 -57955 -58499 -59039
-1071 -59039 -61543 -64048 -63690 -63332 -61901 -60470 -61901 -63332 -63489 -63645 -60940 -58234 -58063 -57891 -59151 -60411 -61320 -62229 -63138
-1052 -63138 -64048 -65046 -66045 -67044 -68043 -67610 -67178 -66746 -66314 -65881 -65449 -65017 -64584 -64555 -64521 -64491 -64458 -63653 -62844 -62039 -61230 -63638 -66042
-1029 -66042 -65587 -65128 -65300 -65468 -62777 -60083 -62102 -64119 -64707 -65292 -63347 -61398 -60884 -60366 -61268 -62166 -61637 -61104 -61827 -62546
-1009 -62546 -63269 -63988 -63504 -63015 -62531 -62043 -63377 -64707 -64610 -64510 -62401 -60288 -61040 -61789 -59233 -56673 -58886 -61096 -61856 -62613
-989 -62613 -63373 -64130 -65188 -66243 -62531 -58816 -62773 -66727 -67823 -68915 -68579 -68240 -65043 -61842 -59893 -57943 -60765 -63586
-971 -63586 -63724 -63861 -64178 -64495 -63850 -66068 -72220 -73603 -70335 -67066 -68270 -69474 -68203 -66932 -65959 -64987 -62017 -63817 -67227
-952 -67227 -67774 -68099 -65561 -63023 -60485 -60124 -59762 -59401 -59039 -60809 -62576 -63388 -61338 -59173 -61774 -61514 -61253 -60362 -59468 -58573
-932 -58573 -62449 -66507 -67700 -67938 -68177 -65807 -63437 -63928 -64417 -63120 -61823 -60526 -59225 -60873 -62520 -64167 -65810 -63761
-914 -63761 -61711 -56978 -57012 -56863 -56714 -59546 -62374 -62613 -59989 -60049 -62967 -64771 -63712 -63012 -62307 -61458 -60608 -61666 -59859 -58950
-894 -58950 -62807 -62550 -59430 -58134 -56833 -56785 -56736 -56334 -55927 -58204 -60481 -62196 -61044 -60071 -59099 -59807 -60511 -62650 -64786 -65106
-874 -65106 -65423 -64133 -62840 -65330 -64953 -63329 -61700 -61238 -60772 -60310 -59844 -60806 -61763 -60042 -58316 -58920 -62382 -64417 -63586 -63213
-854 -63213 -62837 -60854 -58868 -59389 -59907 -60429 -60947 -60910 -60873 -59225 -60440 -62699 -64957 -67096 -69235 -70450 -66895 -63161 -62289 -62460
-834 -62460 -65494 -69779 -74065 -74359 -71792 -69224 -69518 -68471 -67424 -69776 -69265 -65840 -65278 -67398 -66656 -65468 -64279 -64163 -64048
-815 -64048 -65579 -64249 -64350 -67309 -67737 -68166 -67521 -66873 -65028 -66045 -65632 -65214 -62743 -63135 -66388 -66776 -65087 -63399 -64394 -65389
-795 -65389 -66325 -67260 -63425 -59591 -61003 -62415 -63828 -65240 -65669 -66097 -65095 -64092 -65333 -66574 -65132 -63686 -62960 -65095
-777 -65095 -68661 -66500 -66086 -62810 -58819 -60548 -64279 -65147 -65121 -65091 -64968 -64842 -64719 -64592 -63813 -63030 -59211 -55387 -57396 -56539
-757 -56539 -56937 -63056 -64916 -66772 -66127 -65479 -66537 -67592 -67215 -66839 -63753 -60664 -62345 -64025 -63071 -62114 -62050 -64849 -65773 -60970
-737 -60970 -57955 -57802 -56360 -54914 -52216 -49518 -53591 -57660 -56960 -56259 -55242 -54221 -57970 -61719 -63832 -65941 -68408 -65151
-719 -65151 -64174 -63198 -63295 -63388 -61488 -59587 -57686 -55782 -57817 -59852 -59024 -58193 -60675 -63157 -62777 -62393 -62035 -61678 -62751 -63820
-699 -63820 -62777 -61733 -57828 -53919 -55685 -57452 -59218 -60981 -60541 -60101 -59661 -59218 -60016 -60809 -61607 -62401 -62065 -61726 -61391 -61052
-679 -61052 -64338 -67622 -66138 -64651 -63258 -61860 -63329 -64793 -64387 -63981 -64648 -65315 -67174 -63310 -62307 -64167 -68263 -69496
-661 -69496 -69656 -69817 -70901 -71986 -70208 -68430 -64104 -59777 -57001 -59945 -59524 -59102 -60470 -61834 -59296 -56758 -58991 -61219
-643 -61219 -61037 -60854 -62102 -63347 -63906 -64461 -63586 -62710 -64402 -66090 -63008 -59926 -58905 -57880 -53993 -50106 -48966 -47822 -49540
-624 -49540 -51258 -53293 -55327 -54500 -53673 -52458 -51243 -48597 -45951 -46391 -46831 -47270 -47710 -46212 -44714 -41606 -35636 -27907 -14454
-605 -14454 4007 25331 56791 105424 168486 228687 243988 203957 139538 84659 42839 10559 -7708 -23114
-591 -23114 -34980 -41121 -41718 -42314 -45623 -48932 -50811 -52689 -53114 -53539 -53963 -54388 -51802 -49216 -49491 -49767 -50800 -51832 -49465
-572 -49465 -52823 -55257 -54828 -54936 -55044 -57903 -60761 -58849 -56937 -55741 -54545 -54780 -55014 -55920 -56822 -57724 -58625 -55771 -52916
-553 -52916 -54832 -56747 -56520 -56289 -54627 -52965 -55715 -58465 -57996 -57526 -57753 -52253 -46931 -44472 -45321 -46171 -47200 -48228 -50364
-534 -50364 -52495 -54627 -56758 -58443 -60127 -57042 -53956 -55096 -56233 -58804 -61372 -60992 -60608 -58797 -56982 -57049 -57112 -58611 -60105
-515 -60105 -60202 -60295 -60392 -60485 -60004 -59520 -60470 -61417 -62695 -63969 -60478 -56982 -57440 -57895 -58353 -58808 -60578 -62345 -66023 -66835 -64886
-494 -64886 -67704 -71415 -68449 -65095 -61741 -60832 -59922 -61193 -62460 -64979 -62729 -63280 -63832 -65516 -67200 -70625 -74046 -70789
-476 -70789 -67532 -66899 -66265 -65632 -64998 -63429 -61856 -61715 -61573 -61104 -60634 -63027 -65419 -69395 -73368 -70666 -67961 -67405 -66846 -66291
-456 -66291 -65732 -64029 -62322 -60619 -58912 -60459 -62002 -62117 -62229 -62512 -62792 -65937 -69079 -64741 -60399 -58924 -57444 -57414 -57381
-437 -57381 -57649 -57914 -55797 -58447 -61279 -64107 -61268 -58424 -58447 -58465 -56907 -55346 -56650 -57951 -58421 -58886 -57925 -56960 -57340 -57716
-417 -57716 -55234 -52749 -55558 -58365 -58312 -58257 -57608 -56956 -56308 -55655 -58063 -60466 -62874 -65278 -65240 -65199 -65162 -65121 -69999 -74877 -73077
-396 -73077 -71277 -69358 -67439 -68382 -69325 -67227 -65128 -63030 -60932 -60086 -59240 -58394 -57548 -59635 -61722 -63809 -65896 -66135 -66373
-377 -66373 -63750 -61126 -60530 -59934 -59337 -58741 -60411 -62080 -61186 -60291 -60459 -65397 -69261 -70260 -68818 -67376 -65755 -64130 -64327
-358 -64327 -64525 -64722 -64916 -65948 -66981 -68013 -69041 -66478 -63910 -61342 -58775 -56926 -55074 -56084 -57094 -57206 -57314 -54560
-340 -54560 -51806 -55197 -58584 -59110 -59635 -60325 -61014 -61704 -62393 -64812 -67230 -64104 -65747 -65505 -65263 -65319 -65374 -67040 -68706 -70372
-320 -70372 -72038 -70487 -68933 -67383 -65829 -63027 -60220 -60101 -59978 -61767 -60690 -58365 -60806 -65933 -68196 -67599 -66999 -65740
-302 -65740 -64476 -63217 -61953 -61290 -60623 -59960 -59293 -62430 -65564 -68523 -66709 -65374 -64037 -65266 -66492 -67420 -68345 -66410 -64473
-283 -64473 -64148 -63820 -60634 -57444 -57522 -57597 -57854 -58107 -56695 -58141 -63526 -64137 -63720 -63302 -62587 -61871 -60321 -58771 -60083 -61394
-263 -61394 -62244 -63094 -63645 -64197 -67372 -65777 -62572 -62229 -61752 -64137 -67953 -66999 -63541 -62945 -65091 -64376 -61976 -62438 -59501 -59427
-243 -59427 -62155 -64882 -64629 -61514 -61215 -60917 -60440 -59963 -62170 -64376 -66582 -68788 -68810 -68833 -68855 -68877 -68900 -68922 -70733 -69682 -66731
-222 -66731 -66641 -67625 -68609 -68341 -68073 -67625 -67178 -69019 -67998 -65725 -63451 -63981 -64510 -64860 -65210 -67741 -67405 -64208 -63873 -64018 -64160
-201 -64160 -64480 -64801 -66235 -67666 -66235 -64804 -65106 -65404 -62840 -60276 -61409 -62538 -60627 -58715 -59848 -58115 -57992 -57869 -58898
-182 -58898 -59922 -60947 -61972 -63001 -64025 -65050 -66075 -66813 -67547 -68285 -69019 -68922 -68822 -68725 -68624 -68945 -69261 -67793 -69183 -70577
-162 -70577 -69105 -69246 -69384 -68505 -64760 -61018 -60135 -59971 -59803 -59818 -59829 -59837 -59840 -59848 -59852 -60932 -62009 -62911 -63809 -63694 -60712 -59520 -58327
-139 -58327 -59702 -63936 -65784 -64771 -62181 -59587 -60153 -60720 -60485 -60247 -61618 -62989 -62222 -64312 -64793 -65274 -60183 -55089 -56315
-120 -56315 -60403 -62788 -62307 -61230 -60153 -58901 -57645 -57940 -61096 -63772 -63586 -62803 -62017 -60101 -58186 -58655 -59121 -59032 -58942 -55812
-100 -55812 -55540 -55450 -55361 -59445 -60664 -59173 -57683 -57444 -57202 -56546 -55890 -58573 -61253 -61730 -62207 -60299 -58387 -58625 -58864 -60355
-80 -60355 -61842 -61044 -57385 -56945 -56505 -57645 -61648 -61655 -61663 -60627 -59591 -58734 -57876 -56721 -58428 -59956 -58622 -60888 -60291 -58741
-60 -58741 -57191 -57966 -58741 -58264 -57787 -55573 -56222 -55260 -54299 -55365 -56430 -55111 -53792 -55458 -57124 -58789 -60455 -61793 -63131
-41 -63131 -66079 -66164 -63038 -59911 -53922 -52704 -54884 -57064 -59721 -62378 -62024 -64532 -67040 -66686 -67525 -68363 -69023 -69682 -67599
-22 -67599 -65516 -63433 -61350 -60906 -60463 -60019 -59576 -61398 -63220 -62658 -62091 -61886 -61681 -63861 -66038 -65743 -65449 -65155 -64856 -65069 -65281
-1 -65281 -65494 -65702 -65941 -66179 -66418 -66653 -66772 -66891 -65579 -64264 -62237 -60209 -60567 -60921 -61011 -61100 -63217 -65330 -68154 -65251 -65572
19 -65572 -65889 -67730 -69567 -69977 -70383 -70823 -71259 -69313 -67364 -67983 -68598 -69217 -69831 -68930 -68024 -67122 -66217 -66955 -67689 -68427 -69161 -68706
41 -68706 -68248 -65408 -62565 -60321 -58074 -58216 -58353 -58842 -59326 -59811 -60295 -61171 -62043 -61484 -60925 -63284 -65639 -64655 -63671 -63049 -62423
62 -62423 -63228 -64033 -62546 -61055 -62904 -64752 -66694 -68632 -67230 -65829 -65378 -64924 -64469 -64014 -64070 -64122 -65605 -67089 -64193 -61297
82 -61297 -61741 -62181 -62863 -63545 -64227 -64905 -63768 -62632 -61495 -60355 -60530 -60705 -60880 -61052 -62356 -63660 -64964 -66265 -67212 -68158 -69105
103 -69105 -70048 -68296 -66545 -64793 -63038 -63701 -64365 -62643 -60917 -59833 -58748 -57664 -56576 -57370 -58163 -58957 -59747 -59699 -59650 -59602 -59550
124 -59550 -59501 -59453 -59404 -59352 -60206 -61059 -62091 -63120 -62602 -64946 -68363 -67007 -66123 -65240 -64059 -62874 -59755 -56635 -55901 -55163 -56650
145 -56650 -58134 -59620 -61104 -63097 -65087 -66425 -62989 -60496 -57999 -56639 -55275 -55883 -56486 -58525 -60560 -62143 -63724 -62922
163 -62922 -62117 -65073 -68024 -65732 -63437 -62427 -61413 -63742 -66068 -66191 -66310 -64048 -61782 -59512 -57243 -58312 -59382 -57828
181 -57828 -56274 -55018 -53762 -52491 -55991 -58238 -57623 -58499 -56512 -54526 -52540 -52096 -51653 -53595 -55536 -58074 -60612 -63150
199 -63150 -65687 -66287 -66887 -67487 -68087 -67137 -66187 -65237 -64286 -63806 -63325 -62844 -62360 -62952 -63545 -64137 -64726 -63955 -63183 -62412 -61637 -60597
221 -60597 -59557 -60902 -62244 -62136 -62028 -61920 -61808 -66500 -71192 -67774 -64353 -64849 -65345 -67271 -69194 -68348 -67502 -66656 -65807 -66146
241 -66146 -66481 -64432 -62382 -64897 -67409 -65628 -63847 -61264 -58678 -59430 -60183 -62639 -65091 -65158 -65225 -64458 -63686 -62915 -62143 -62777
261 -62777 -63407 -64037 -64666 -63183 -61696 -60209 -58722 -59117 -59509 -60079 -60649 -60157 -62527 -67402 -67502 -65222 -62941 -64655 -66366 -67499
281 -67499 -68632 -69764 -70894 -70118 -69343 -68568 -67789 -66157 -64525 -64323 -64119 -59952 -55786 -55912 -56035 -59919 -63802 -65300 -66794
300 -66794 -65788 -64782 -62345 -59904 -57645 -55383 -56464 -57541 -59784 -62024 -61883 -61737 -60358 -58976 -57597 -56214 -56893 -57567
318 -57567 -60630 -63690 -64499 -65304 -63727 -62147 -63224 -64297 -64242 -64182 -61897 -64379 -65792 -64338 -64976 -65609 -66068 -66522 -62151 -57776
338 -57776 -57698 -57616 -57627 -57634 -56214 -54791 -54258 -53721 -55573 -57422 -59334 -61242 -60768 -60291 -59158 -58022 -59274 -60522 -60731 -60936 -61145
359 -61145 -61350 -59009 -56665 -61480 -66291 -66723 -67152 -67584 -68013 -67655 -67294 -68546 -66932 -62818 -58700 -55659 -55476 -58294 -61107
378 -61107 -62851 -61730 -59658 -57582 -58014 -58443 -58879 -56449 -54023 -54455 -58290 -62121 -61186 -60247 -62896 -62680 -59427 -59032 -60966
397 -60966 -60034 -59106 -61037 -61264 -58629 -59035 -62304 -62352 -62401 -62628 -62855 -62956 -63056 -65840 -68624 -68904 -66321 -66422 -69384 -69422 -66597
418 -66597 -65561 -64525 -63668 -62810 -63742 -61812 -61223 -63496 -63981 -64465 -64294 -64122 -64130 -64137 -62919 -64558 -64592 -64622 -61912 -59199 -59352 -59501
440 -59501 -59043 -58581 -58301 -58018 -57560 -59960 -60575 -61186 -60545 -57038 -56397 -58614 -58450 -58283 -58298 -58309 -59084 -59855 -63492 -67126 -66410 -65691
462 -65691 -64797 -63899 -64476 -62188 -58830 -60239 -59863 -59483 -59404 -59322 -59714 -60101 -58883 -60522 -61152 -61778 -62587 -63392 -62997 -62598 -62203 -61804
484 -61804 -62840 -63873 -63835 -60932 -60001 -61927 -62069 -62207 -63124 -64037 -64953 -65866 -67469 -69068 -65900 -62729 -63854 -64976 -63239 -61499
504 -61499 -61201 -60899 -60601 -60299 -61372 -62442 -63515 -64584 -65449 -66310 -67174 -68035 -65382 -62725 -60071 -57414 -56430 -55443 -57321 -59196
524 -59196 -59822 -60444 -61070 -61693 -62892 -64089 -64991 -65889 -68937 -67212 -63701 -63049 -60999 -58946 -59937 -60925 -60485 -60042 -59602 -59158 -59550
545 -59550 -59937 -60329 -60716 -64268 -67815 -64689 -61558 -62568 -63574 -64584 -65591 -66362 -67130 -67901 -68669 -65650 -62628 -62468 -62307 -62151
565 -62151 -61991 -61830 -61670 -63533 -65393 -64391 -63388 -64357 -65322 -66287 -67253 -67309 -67361 -67413 -67465 -66388 -65307 -64227 -63146 -62874 -62598 -65184
587 -65184 -67771 -67022 -66269 -65337 -64406 -61935 -56602 -54787 -57742 -62307 -64010 -64760 -65509 -66377 -67245 -68113 -68982 -67405 -65829 -64551
607 -64551 -63273 -60724 -62945 -65166 -62617 -61499 -60381 -58965 -57548 -58279 -59009 -59740 -60470 -61022 -61573 -61827 -62080 -62658 -58462 -57131
627 -57131 -60567 -61204 -61838 -62773 -63705 -64342 -64976 -65613 -66246 -65333 -64417 -63504 -62587 -62445 -62300 -62158 -62013 -60858 -59699 -58543 -57385
648 -57385 -59285 -61182 -60220 -59255 -60977 -62695 -61555 -60411 -58476 -56539 -59375 -62207 -62777 -63343 -63914 -64480 -64365 -64245 -62222
667 -62222 -63056 -63358 -58886 -58532 -61037 -60757 -60474 -63235 -65993 -65714 -65430 -65151 -64868 -62143 -59416 -59553 -59688 -58394 -57098 -55804
687 -55804 -54508 -53993 -53475 -55525 -57571 -61499 -60653 -61063 -61469 -60984 -60496 -60012 -59524 -58801 -58074 -54668 -56028 -58152 -60273 -61264
707 -61264 -62252 -63481 -64707 -63075 -61439 -60865 -60288 -61145 -61998 -61037 -60071 -59110 -58145 -59442 -60735 -62032 -63325 -62117 -60906 -59699
727 -59699 -58488 -58547 -58603 -58842 -59076 -59673 -63127 -67838 -67774 -65397 -65878 -64454 -63027 -64048 -65065 -66086 -67104 -65546 -63984 -62427
747 -62427 -60865 -62438 -64007 -60809 -57608 -57332 -57053 -58208 -59360 -58011 -56658 -55309 -53956 -55819 -57679 -58111 -58540 -61208
765 -61208 -63873 -63679 -63481 -65043 -66600 -65300 -63996 -63768 -63537 -60448 -57355 -56039 -54720 -58175 -61625 -62307 -62986 -63668 -64346
784 -64346 -63910 -63470 -64461 -65453 -65225 -64994 -61901 -58808 -59818 -60824 -61830 -62837 -62207 -61573 -60940 -60306 -59907 -59505 -57671 -60608
804 -60608 -64353 -65233 -63250 -61268 -61994 -62717 -63440 -64163 -64979 -65792 -65173 -64555 -62378 -60202 -60888 -61573 -62170 -62766 -63362 -63958 -65315
825 -65315 -66671 -65166 -63660 -63407 -63153 -64331 -65509 -64305 -63101 -63329 -63556 -65691 -67827 -65192 -62557 -59654 -56751 -58618
843 -58618 -60485 -62352 -64219 -66086 -67953 -67666 -67376 -67089 -66798 -65557 -64312 -65933 -67551 -68263 -68971 -66820 -64666 -64484 -64297
862 -64297 -64115 -63928 -67148 -70364 -70722 -71076 -69735 -68389 -65617 -62840 -60105 -57366 -59401 -61432 -62393 -63351 -61450 -59546 -60310
881 -60310 -61070 -63261 -65453 -66783 -68110 -66574 -65039 -65691 -66340 -64126 -61912 -60507 -59099 -60552 -62006 -62382 -62755 -61696 -60638
900 -60638 -61789 -62937 -64085 -65233 -67353 -69470 -73733 -72272 -68132 -69712 -70577 -71441 -71099 -70752 -68974 -67197 -65572 -63943
918 -63943 -62315 -60686 -60284 -59878 -59471 -59065 -58216 -57362 -56509 -55655 -57090 -58521 -58521 -58521 -58883 -59240 -62460 -65680 -64998 -64312 -65058 -65803
940 -65803 -66164 -66522 -64376 -62229 -59885 -63265 -66287 -69306 -68691 -68076 -67461 -66843 -66548 -66254 -66317 -60653 -58599 -56546 -58905 -61260
960 -61260 -62162 -63064 -62535 -62002 -60876 -59751 -61488 -63220 -64406 -65591 -65345 -65095 -65028 -64961 -66325 -67685 -67834 -67983 -68132 -68281 -67685
981 -67685 -67089 -66492 -65896 -65859 -65822 -65784 -65747 -66068 -66388 -66709 -67029 -66828 -66627 -66425 -66224 -64473 -62721 -60970 -59218 -59196 -59173 -59151 -59129 -60776
1005 -60776 -62423 -61208 -59993 -57865 -55737 -58499 -64122 -64827 -62669 -60869 -59069 -60235 -61402 -62270 -63138 -66273 -64637 -64253
1023 -64253 -63869 -62386 -60902 -62281 -63660 -62088 -60515 -61804 -63094 -63295 -63496 -65307 -64256 -66097 -67938 -66738 -65538 -64294
1041 -64294 -63049 -63235 -63422 -61849 -60276 -58883 -62259 -60612 -58965 -60478 -61991 -60493 -58994 -58927 -58860 -60977 -63094 -62348 -61603
1060 -61603 -62199 -62796 -63392 -63988 -64450 -64912 -65553 -66194 -66656 -69981 -73305 -73767 -70316 -66865 -68005 -69142 -65930 -62717 -62665 -65471
1080 -65471 -65546 -65620 -65874 -66123 -65065 -64007 -67420 -67968 -64804 -61637 -61152 -60668 -60306 -59941 -62438 -64935 -63373 -61808 -63105 -64402
1100 -64402 -67223 -70040 -68087 -66135 -66068 -65997 -64495 -62993 -63612 -64227 -66273 -65456 -66716 -65110 -63146 -64044 -65304 -63697 -62091
1119 -62091 -63347 -65866 -65523 -66969 -68412 -68844 -69276 -69530 -69779 -70405 -68169 -67543 -66914 -67122 -67331 -67540 -67745 -65661 -63574 -64350
1139 -64350 -65125 -65605 -66082 -66560 -67036 -66861 -66682 -66504 -66325 -65971 -65613 -65255 -64897 -64562 -64223 -66746 -69269 -70603 -71933 -68494 -65054
1160 -65054 -66634 -68210 -69787 -71363 -70141 -68915 -67689 -66463 -66042 -65620 -65199 -64778 -61674 -58570 -60235 -61901 -63172 -64443
1178 -64443 -65714 -66984 -66824 -66664 -66504 -66343 -67998 -69653 -68445 -67238 -64659 -62080 -59501 -56922 -57206 -57489 -57772 -58055 -58935
1197 -58935 -59814 -60694 -61573 -62673 -63772 -64871 -65967 -64801 -63634 -62468 -61297 -61547 -61797 -62047 -62292 -63615 -64938 -66261 -67581
1216 -67581 -67476 -67372 -67268 -67159 -65505 -63850 -62196 -60537 -59866 -59196 -58525 -57850 -56524 -55197 -53870 -52540 -51970 -51396 -53684 -55972
1236 -55972 -58622 -61268 -61052 -60835 -61324 -61808 -62292 -62777 -61178 -59576 -54753 -55655 -57660 -59661 -62020 -64379 -64655 -64927 -62695
1255 -62695 -60463 -58704 -62665 -63407 -64148 -62330 -60507 -58864 -57221 -55331 -56304 -58529 -55980 -51824 -50531 -52100 -53665 -55912
1273 -55912 -58160 -57545 -56926 -55298 -53669 -54903 -56132 -56550 -56967 -57385 -57798 -60183 -62568 -62091 -61611 -63138 -64666 -63332 -61994
1292 -61994 -61912 -61830 -61748 -61663 -62140 -62613 -60407 -58197 -58257 -61175 -61234 -58428 -59188 -59945 -60526 -61104 -60433 -59758 -59088 -58413 -58890 -59363 -61450
1315 -61450 -60671 -62937 -65199 -64424 -63645 -63653 -63656 -60981 -58301 -57295 -59147 -62255 -65360 -65382 -65401 -67029 -65796 -66414 -67029 -64603 -62177
1336 -62177 -61931 -61681 -63042 -61540 -61830 -62117 -62225 -62333 -61767 -61197 -59017 -59699 -60623 -61543 -62643 -63742 -63966 -64186 -61722 -59259
1356 -59259 -57813 -59225 -59028 -58830 -57258 -55685 -58584 -58618 -59848 -61078 -57657 -57094 -58025 -58957 -59889 -60817 -63478 -63276 -61823 -60366
1376 -60366 -60001 -59632 -59263 -58894 -57515 -56132 -56181 -59091 -58517 -60802 -63086 -62509 -60712 -56050 -54072 -54955 -56267 -57578 -60500
1395 -60500 -63422 -61394 -59367 -59725 -60083 -60560 -61037 -63124 -62348 -62796 -63243 -65300 -64495 -63064 -64491 -64312 -64130 -62162 -63053 -63768
1415 -63768 -64480 -64629 -64774 -65639 -61730 -59166 -63276 -64767 -66254 -65494 -64733 -63973 -63213 -63705 -64197 -64689 -65181 -66001 -66820 -66865 -64048
1436 -64048 -63198 -62348 -61141 -62796 -62732 -62669 -62784 -62900 -62389 -61879 -64707 -67536 -66623 -65710 -66228 -66746 -64938 -63131 -65796 -68460 -66287
1457 -66287 -66973 -67480 -67987 -67394 -66798 -64771 -62743 -62181 -61614 -61048 -60481 -59471 -58458 -57623 -56788 -56762 -59594 -60817 -62039 -62669 -63295
1478 -63295 -65531 -64905 -65863 -66817 -67592 -68367 -68192 -68013 -68013 -65151 -63217 -61279 -62326 -63369 -62568 -58901 -58398 -60753 -63515 -63410
1498 -63410 -62892 -62371 -60630 -61748 -62870 -61126 -60027 -58924 -60150 -64234 -65669 -64238 -61260 -58279 -59661 -61040 -60992 -60940 -63276
1517 -63276 -65609 -64607 -63601 -62278 -60951 -58372 -55793 -55573 -58212 -61029 -60984 -59237 -60347 -60921 -61495 -64487 -64614 -63966 -63317
1536 -63317 -62501 -61681 -60504 -62188 -63638 -62222 -61163 -60105 -60906 -61704 -61249 -60794 -57958 -57981 -58778 -59576 -59714 -59848 -57780 -55708
1556 -55708 -54891 -56934 -59158 -58517 -57709 -59758 -60023 -60284 -62695 -65102 -66738 -65509 -63709 -61905 -61655 -64264 -63776 -63284 -65360
1575 -65360 -67432 -67167 -66899 -65084 -68035 -71140 -69470 -67625 -65777 -64063 -65210 -64927 -64644 -64033 -66284 -66925 -67566 -68087 -68609
1594 -68609 -69131 -69653 -69101 -68550 -67998 -67446 -65833 -64219 -62606 -60992 -61167 -61342 -61517 -61693 -62002 -62311 -64230 -63288 -62881 -62475 -64096
1615 -64096 -65717 -70092 -71605 -69481 -67353 -67078 -66802 -66526 -66246 -66805 -67364 -67923 -68479 -65311 -62143 -60705 -62125 -61488 -60850 -60392
1635 -60392 -59930 -59740 -59550 -60135 -63578 -67331 -71084 -69768 -68449 -65851 -63254 -63996 -64733 -63560 -62382 -61204 -60027 -60254 -60478
1654 -60478 -60701 -60925 -61607 -62285 -62963 -63642 -62833 -62020 -61208 -60396 -58141 -55883 -56486 -57090 -58055 -59017 -59978 -60940 -63336 -65728 -65259
1675 -65259 -64789 -64741 -64689 -61774 -58860 -61789 -64719 -64786 -64853 -64204 -63556 -62907 -62259 -60925 -59591 -58257 -56922 -59881 -62840 -61029
1695 -61029 -56356 -54757 -57929 -58238 -58547 -58022 -57496 -56971 -56445 -57589 -58734 -59878 -61022 -59721 -58421 -57120 -55819 -56024 -56226
1714 -56226 -59293 -62356 -63753 -65147 -63683 -62214 -62777 -63336 -63899 -64458 -66511 -68561 -70614 -72664 -70551 -68434 -66321 -64204
1732 -64204 -64238 -64268 -64301 -64331 -64081 -63828 -63578 -63325 -63075 -62822 -62572 -62319 -62755 -63191 -63627 -64059 -63779 -63500 -63220 -62937 -61391 -59844 -58119
1755 -58119 -56389 -58242 -57232 -55149 -57832 -58521 -59211 -59900 -60586 -64972 -64588 -60507 -59285 -61376 -63466 -62874 -62278 -61983 -61689
1774 -61689 -61394 -61096 -63705 -66314 -64152 -61991 -61499 -61007 -60515 -60023 -58786 -57548 -59173 -60798 -63437 -66075 -65851 -65628 -66157
1793 -66157 -66686 -64353 -62020 -62967 -63914 -64860 -65807 -64577 -63347 -64979 -66612 -67528 -68445 -69362 -70279 -66589 -62896 -62069 -61238 -62557
1813 -62557 -63873 -62326 -60779 -59863 -58942 -58025 -57105 -58454 -59799 -61145 -62490 -64297 -66101 -65046 -63988 -63828 -63664 -63500 -63336
1832 -63336 -63563 -63787 -64014 -64238 -62319 -60396 -58473 -56550 -57157 -57765 -58372 -58976 -58868 -58760 -58652 -58540 -59147 -59755 -60362 -60966 -60858
1853 -60858 -60750 -60642 -60530 -61715 -62900 -64085 -65266 -64782 -64297 -63813 -63325 -62840 -62356 -61871 -61383 -62091 -62799 -63507 -64212 -65222 -66228
1874 -66228 -67238 -68244 -65676 -63105 -61488 -62732 -66001 -64495 -64245 -66854 -66366 -65874 -65561 -65248 -65646 -66042 -63578 -61111 -60079
1893 -60079 -59043 -58007 -56971 -56155 -55335 -57381 -59423 -60545 -61663 -59620 -57578 -61417 -60481 -57284 -56945 -57742 -58536 -59512 -60485
1912 -60485 -59822 -59155 -60876 -62594 -60381 -58163 -59289 -60411 -61193 -61976 -62758 -63541 -63340 -63138 -62937 -62736 -62751 -62766 -62781 -62796 -63019 -63243
1934 -63243 -66150 -64286 -62743 -61201 -61745 -62285 -63157 -64029 -61562 -59091 -60224 -61357 -59151 -56941 -56971 -57001 -57030 -57057 -57906 -58752 -57213
1955 -57213 -55674 -54794 -53911 -56367 -58823 -59315 -59803 -60291 -60779 -60765 -60746 -60727 -60709 -61748 -62784 -63820 -64856 -63273 -61685 -60098 -58510
1976 -58510 -60414 -62315 -64215 -66116 -66351 -66582 -66813 -67044 -65404 -63761 -62117 -60474 -60981 -61484 -61987 -62490 -60791 -59088 -57385
1995 -57385 -55681 -56606 -57526 -58447 -59367 -59285 -59203 -59121 -59039 -60150 -61260 -62371 -63481 -63705 -63928 -64152 -64376 -64242 -64107 -63973 -63839 -64901
2017 -64901 -65959 -67022 -68080 -67204 -66325 -65449 -64569 -61719 -58864 -59352 -59837 -61070 -62300 -63533 -64763 -62512 -60261 -58011 -55756
2036 -55756 -59766 -63776 -62538 -61297 -59553 -57809 -59404 -60996 -59669 -58342 -57016 -55685 -56162 -56635 -57109 -57582 -59788 -61991
2054 -61991 -62762 -63533 -62222 -60906 -62930 -64953 -65013 -65069 -65125 -65181 -64737 -64290 -63847 -63399 -64297 -65192 -63705 -62214 -60481 -58745 -57012
2075 -57012 -55275 -57448 -59617 -60358 -61096 -60414 -59729 -61432 -63131 -63850 -64566 -63854 -63138 -63060 -62978 -62900 -62818 -61458 -60094 -58734 -57370
2096 -57370 -58350 -59326 -60306 -61283 -59639 -57992 -56348 -54701 -55935 -57165 -58398 -59628 -60861 -62091 -63325 -64555 -63198 -61838
2114 -61838 -60481 -59121 -58868 -58611 -58357 -58100 -59173 -60243 -59885 -59524 -62594 -65661 -64439 -63213 -62028 -60839 -62993 -65143 -61126
2133 -61126 -57105 -60243 -63377 -63049 -62717 -62389 -62058 -62535 -63008 -63485 -63958 -64335 -64707 -65084 -65456 -63686 -61912 -60142 -58368 -57403
2153 -57403 -56434 -55469 -54500 -54340 -54176 -56401 -58622 -60079 -61536 -62814 -64092 -63612 -60269 -59192 -62885 -64365 -65844 -63448 -63914
2172 -63914 -64290 -61804 -60929 -60053 -60738 -58562 -58592 -61484 -64644 -64942 -64644 -64346 -63660 -62974 -63720 -64465 -63690 -62915 -62140 -61365 -64137
2193 -64137 -66906 -64547 -65050 -65736 -63556 -61733 -59911 -59732 -59550 -59367 -59184 -59453 -59717 -58551 -57385 -56997 -56606 -57824 -59043 -57254
2213 -57254 -58324 -60168 -62013 -61968 -61920 -62050 -62181 -61689 -64055 -64812 -65568 -66239 -66910 -67581 -68248 -65579 -62907 -64532 -66153 -63351
2233 -63351 -60548 -60131 -59710 -61707 -63701 -65699 -67692 -68758 -69824 -67551 -65274 -64968 -64659 -61014 -57366 -57567 -57768 -57970 -58167
2252 -58167 -58875 -59579 -60109 -63496 -64245 -64994 -64372 -60888 -58596 -59166 -60153 -61141 -60161 -56319 -54742 -57936 -57850 -57765 -58573 -62244 -65881
2273 -65881 -66656 -64927 -63198 -63288 -63377 -61678 -62840 -63407 -61111 -60425 -62602 -62483 -62363 -60992 -59620 -62330 -65039 -65363 -65684 -64338
2293 -64338 -62989 -63075 -63157 -64003 -64849 -64264 -63675 -64640 -65602 -65136 -64666 -63478 -62289 -64439 -66586 -66053 -65516 -63552 -61584 -60142 -58700
2314 -58700 -61551 -64398 -64148 -63895 -63943 -63988 -61599 -63977 -65281 -63724 -62974 -62222 -61290 -60358 -58417 -56471 -57865 -59259 -56930 -54597
2334 -54597 -53695 -52793 -51634 -50472 -50740 -55778 -58495 -58346 -56110 -56736 -56650 -56561 -59035 -61510 -61901 -62289 -62676 -63064 -62986 -62907 -62829 -62751
2356 -62751 -60735 -58719 -56703 -54686 -56553 -58421 -57903 -57385 -57016 -56647 -58663 -60679 -60068 -59457 -61230 -63004 -61529 -60053 -62870
2375 -62870 -65687 -66142 -66597 -67051 -67506 -66679 -65851 -65024 -64197 -63988 -63779 -63571 -63362 -61543 -59725 -62199 -64674 -63735 -62796 -64897 -66999
2396 -66999 -68087 -64406 -61856 -64078 -67681 -66515 -64037 -61558 -61972 -62386 -62799 -63213 -61965 -60716 -60899 -61081 -63738 -66396 -67622
2415 -67622 -68848 -70562 -72276 -69697 -67119 -65523 -63928 -64719 -65509 -65039 -64569 -62490 -63273 -64085 -64897 -63504 -62110 -61212 -60314
2434 -60314 -61622 -62930 -63105 -60418 -61726 -63034 -63448 -63861 -67495 -68266 -63761 -62117 -62024 -61931 -62702 -63470 -64242 -65009 -67063 -69112
2454 -69112 -68661 -65345 -61927 -61368 -61409 -61447 -62770 -64089 -62252 -60411 -59926 -62300 -65930 -64786 -60247 -58566 -61838 -62244 -62408
2473 -62408 -62568 -60765 -61819 -64637 -64588 -64126 -63660 -61532 -62263 -64428 -63727 -61689 -59647 -57429 -55208 -59289 -63366 -61543 -59717
2492 -59717 -56375 -57798 -54932 -54925 -56710 -58491 -60455 -62415 -64022 -65624 -67230 -68833 -68650 -68464 -68281 -68095 -64633 -61167 -61044
2511 -61044 -60917 -62840 -64763 -61618 -58469 -56486 -57366 -60929 -64487 -65143 -65799 -66455 -67107 -66720 -66332 -65646 -64957 -65531 -61335 -58212
2531 -58212 -57947 -56524 -55100 -53855 -52607 -51839 -51072 -51079 -53945 -59140 -64335 -66071 -64942 -64420 -63899 -63198 -62497 -62542 -62587 -62632 -62676 -62483
2553 -62483 -62289 -62095 -61901 -60455 -59009 -61856 -64704 -68210 -71717 -69023 -66328 -64678 -63027 -64715 -66403 -66407 -66410 -66414 -66418 -65378 -64338
2574 -64338 -64730 -65121 -61924 -58726 -57914 -57101 -57541 -57981 -58421 -58860 -59881 -60902 -61924 -62945 -62028 -61111 -60194 -59278 -59960 -60642 -58939
2595 -58939 -57235 -57947 -58659 -59371 -60083 -61450 -62818 -64186 -65553 -64894 -64234 -63574 -62915 -62926 -62937 -62948 -62960 -63090 -63220 -60966 -58711 -59870
2617 -59870 -61029 -59803 -58577 -58812 -59047 -59281 -59516 -59173 -58830 -57057 -55283 -54791 -54299 -56192 -58085 -59248 -60411 -58234 -56058
2636 -56058 -56982 -57906 -58830 -59755 -59058 -58357 -57657 -56956 -57809 -58659 -59509 -60358 -59557 -58752 -57947 -57142 -60276 -63407 -63198 -62989 -59900 -56807
2658 -56807 -58007 -59207 -61215 -63220 -61886 -60552 -58402 -56248 -54094 -51940 -53695 -55447 -57198 -58950 -57127 -55305 -56345
2675 -56345 -57385 -55681 -53978 -57045 -60112 -60943 -61774 -62606 -63437 -63731 -64025 -64320 -64614 -63507 -62401 -63083 -60902 -58365 -58689 -57403
2695 -57403 -56117 -54645 -56035 -57604 -56311 -55018 -56587 -57977 -56505 -56852 -57198 -57366 -57530 -58532 -59535 -60537 -61536 -62374 -63213
2714 -63213 -64230 -65244 -64651 -66921 -70562 -69429 -64201 -63742 -66861 -67115 -64450 -64648 -63235 -61819 -62009 -65061 -65251 -62576 -60679
2733 -60679 -58782 -59568 -60351 -59587 -58819 -55190 -51560 -51750 -51936 -52122 -52309 -52790 -53267 -55353 -54578 -55417 -56252 -56907 -57563 -59885 -62203
2754 -62203 -62732 -66123 -66239 -63489 -62706 -61924 -59408 -59751 -61167 -62583 -66150 -66850 -66478 -66105 -63891 -64540 -66440 -63571 -57481
2773 -57481 -54254 -53889 -53524 -53695 -53867 -55111 -59218 -62073 -62065 -60984 -59904 -60150 -60396 -60463 -60530 -61670 -59948 -59837 -59725 -60716 -61707
2794 -61707 -64309 -64048 -62654 -61260 -61476 -58830 -56483 -56993 -58760 -60522 -59725 -61786 -65222 -63884 -58346 -57575 -62114 -63787
2812 -63787 -62781 -61771 -60586 -59397 -57388 -55376 -53367 -51355 -51612 -51865 -52122 -52376 -53922 -55465 -56833 -58197 -61592 -62121
2830 -62121 -59494 -56863 -57023 -57180 -57340 -57496 -57358 -57217 -55469 -56580 -57850 -59117 -59315 -56647 -56486 -56322 -58666 -61007 -62863
2849 -62863 -61853 -57984 -56975 -57519 -58059 -58603 -59143 -61134 -60258 -60996 -61730 -63183 -64633 -66086 -67536 -67767 -67998 -65546 -63090
2868 -63090 -59386 -58543 -58953 -59360 -59136 -58912 -58510 -58104 -60146 -59326 -59937 -60545 -63686 -63966 -62993 -62017 -62714 -63410 -65717 -65158 -62389
2889 -62389 -59620 -63053 -66481 -69138 -67025 -64912 -62796 -62125 -64316 -66507 -65833 -64506 -63179 -64536 -65889 -64443 -62997 -62505
2907 -62505 -64871 -67718 -65796 -61189 -61350 -59788 -58227 -55353 -55339 -58845 -62352 -63176 -63996 -65490 -66984 -68300 -69612 -69615 -66757
2926 -66757 -65509 -64256 -62989 -61719 -60448 -59177 -61428 -63675 -61152 -58629 -58987 -59341 -59695 -60049 -60705 -61357 -62009 -62661 -62024
2945 -62024 -61383 -60742 -60101 -60537 -60970 -61402 -61834 -62129 -62419 -62710 -63001 -64666 -66328 -65128 -61066 -55864 -55428 -60422 -62550 -62535 -62516
2966 -62516 -62322 -62125 -62117 -62106 -64007 -63042 -62080 -65885 -66832 -67774 -66522 -65266 -64014 -62758 -61208 -59654 -60966 -62274 -62512 -62747
2986 -62747 -62986 -63220 -61789 -60355 -58924 -57489 -58648 -59807 -63828 -67845 -67036 -66228 -65419 -64607 -64931 -65255 -65758 -66258 -63720 -64044
3006 -64044 -65620 -62423 -59117 -58674 -59184 -59691 -59606 -59520 -59434 -59345 -58186 -57027 -55868 -54705 -57958 -61212 -61603 -61991 -59706 -57422
3026 -57422 -59907 -62393 -60765 -59136 -60370 -61603 -61309 -61014 -60720 -60425 -60310 -60194 -60079 -59963 -59419 -58875 -58331 -57787 -56050 -54314
3046 -54314 -57347 -57519 -55320 -57891 -59211 -57668 -56602 -55536 -57153 -58771 -58286 -57802 -57317 -56829 -56881 -56934 -56986 -57034 -58361 -59688
3066 -59688 -61014 -62337 -62173 -62009 -61845 -61678 -59609 -57541 -60243 -62941 -64927 -66914 -66336 -65755 -63030 -65076 -67122 -64394 -63399
3085 -63399 -62404 -61111 -59814 -59874 -59930 -59986 -60042 -61473 -62900 -59557 -56214 -55603 -54988 -54373 -53758 -54817 -55871 -56926 -57981 -60940
3105 -60940 -63895 -59397 -59669 -60302 -60932 -61860 -62788 -62065 -61338 -60612 -59885 -59937 -59986 -60034 -60083 -62475 -64864 -62483 -60101 -56471 -52838
3126 -52838 -53975 -55111 -57660 -60206 -59889 -59572 -60988 -62401 -60951 -59501 -59401 -59296 -59192 -59088 -59225 -59360 -59494 -59628 -56941 -54250
3146 -54250 -58238 -62225 -60850 -59471 -60955 -62438 -61901 -61361 -60820 -60280 -60101 -59919 -59736 -59553 -58614 -57671 -59591 -61510 -60750 -59986
3166 -59986 -59222 -58458 -59240 -60019 -60798 -61577 -61048 -60515 -59982 -59449 -58830 -58208 -57586 -56963 -56673 -56378 -56263 -60917 -62430 -63940 -63362 -62784
3188 -62784 -60630 -58473 -59654 -60835 -60888 -60936 -62415 -63895 -63232 -62565 -63329 -64092 -64193 -64290 -65818 -67346 -66463 -65576 -63258 -60940
3208 -60940 -61838 -62732 -63627 -64521 -65330 -66135 -66940 -67745 -66668 -65591 -64514 -63433 -62952 -62471 -61991 -61506 -60899 -60291 -59684 -59073 -59926
3229 -59926 -60779 -61633 -62483 -60589 -58696 -59188 -59676 -59542 -59408 -61659 -63906 -65755 -67603 -66112 -64618 -63753 -62889 -63455 -64018 -64294
3249 -64294 -64566 -64838 -65110 -63507 -61901 -62322 -59881 -58025 -62844 -63727 -64610 -63887 -63161 -62434 -61707 -60295 -58879 -57463 -56047 -57079
3269 -57079 -58107 -61998 -61119 -59572 -60884 -64223 -60884 -60053 -62080 -63690 -62438 -60545 -58652 -53896 -53908 -53445 -52983 -54131 -60045
3288 -60045 -61767 -58719 -57519 -56315 -51776 -52007 -52119 -52227 -52525 -55685 -58488 -56516 -55413 -54310 -56248 -58182 -58309 -58435 -58562
3307 -58562 -58685 -57709 -56732 -55756 -54776 -54884 -54992 -58320 -55924 -55167 -54411 -53296 -52182 -54511 -56840 -54876 -52913 -51813 -50714
3326 -50714 -52954 -55193 -57500 -59807 -57821 -55834 -54683 -53531 -56673 -59814 -60869 -61924 -59639 -57355 -56859 -56363 -55868 -55372
3344 -55372 -55763 -56155 -56546 -56937 -57388 -57839 -56859 -55879 -52961 -50043 -52551 -55059 -55033 -57869 -62494 -61394 -58137 -57742 -58719 -59695
3364 -59695 -60522 -61350 -62177 -63004 -62371 -61737 -61104 -60470 -61625 -62781 -65009 -67238 -69101 -65237 -58987 -58462 -58834 -59203 -58499 -57794
3384 -57794 -56721 -55644 -55939 -59095 -64461 -64100 -62188 -63138 -63157 -63172 -61935 -60697 -61134 -61566 -61998 -62430 -62434 -62434 -62434 -62434 -62796 -63153 -63511 -63869
3408 -63869 -64212 -64555 -64897 -65240 -66179 -67119 -68058 -68997 -66940 -64882 -62825 -60768 -60023 -59278 -58532 -57787 -59416 -61044 -62673 -64301
3428 -64301 -62948 -61596 -60243 -58890 -59147 -59404 -59840 -60276 -58745 -60075 -63015 -60232 -60045 -59859 -59315 -58767 -58223 -57679 -57135 -56587
3448 -56587 -57086 -57586 -55223 -57627 -63194 -65900 -65743 -65583 -65926 -66269 -66791 -67309 -62225 -60004 -59035 -58063 -56706 -55350 -58644 -59073
3468 -59073 -59207 -62203 -60429 -55789 -53155 -53378 -54675 -55972 -56855 -57735 -58614 -59494 -59609 -59721 -59833 -59945 -58629 -57310 -57064 -59680
3488 -59680 -61338 -60131 -60712 -61294 -60984 -60671 -60358 -60045 -56986 -53922 -55749 -60437 -61372 -59442 -57511 -58443 -57537 -53766 -53036 -55167
3508 -55167 -55633 -56095 -56557 -57019 -58141 -56397 -57515 -61495 -62438 -63377 -64674 -65971 -64801 -66492 -66396 -66299 -65963 -62766 -61178 -59591
3528 -59591 -58912 -58234 -57556 -56878 -55186 -53494 -54664 -55834 -54631 -53423 -53829 -51370 -53445 -55517 -57414 -59307 -58827 -58342 -56252
3547 -56252 -57019 -57791 -58558 -59509 -60455 -61622 -62788 -61093 -59393 -59606 -59818 -59852 -59881 -59356 -55968 -56099 -60996 -62796 -61733 -62579 -63422
3568 -63422 -62442 -61461 -60481 -59501 -59594 -59688 -59781 -59874 -59117 -58361 -57604 -56848 -55197 -53546 -56665 -59784 -60578 -61372 -62166 -62960 -63932 -64905 -63015
3591 -63015 -61126 -61860 -62594 -60466 -58339 -56866 -55394 -56785 -58175 -56602 -55029 -53457 -51880 -52275 -52670 -53065 -53457 -53106 -52756
3610 -52756 -52406 -52052 -51880 -51709 -54399 -57086 -57798 -58510 -59222 -59930 -60403 -60876 -58488 -56095 -55987 -55879 -55771 -55659 -55551 -55443 -55335
3631 -55335 -55223 -59814 -64406 -66254 -61424 -57310 -56058 -57548 -59039 -59337 -59635 -59934 -60232 -59576 -58920 -60828 -62736 -64189 -60873
3650 -60873 -58450 -58890 -59986 -58219 -56632 -57906 -58652 -59397 -60321 -61245 -61335 -61424 -61514 -61603 -61316 -61025 -60738 -60448 -60161 -59870 -59583 -59293
3672 -59293 -59401 -59505 -59613 -59717 -60839 -61957 -60217 -58473 -58652 -58827 -59006 -59181 -61148 -63112 -62218 -61320 -61394 -61465 -61540 -61611 -62102 -62591
3694 -62591 -63083 -63571 -62505 -61435 -60366 -59296 -56978 -54657 -55197 -55737 -57221 -58700 -60179 -61659 -61055 -60448 -59840 -59233 -58454
3713 -58454 -57671 -56889 -56106 -55745 -55380 -55014 -54649 -57612 -60571 -60668 -60765 -58927 -57086 -56676 -56267 -55607 -54947 -54288 -53628 -53893 -54157 -54422
3735 -54422 -54686 -55808 -56930 -58052 -59173 -57314 -55454 -58365 -61275 -63358 -65438 -62751 -60060 -59997 -59930 -59866 -59799 -58119 -56434
3754 -56434 -54753 -53069 -52998 -52924 -55715 -58502 -57273 -56039 -54806 -53572 -54131 -54686 -55242 -55797 -56445 -57090 -54873 -52655 -54586 -56512
3774 -56512 -55577 -54642 -53371 -52100 -52558 -53013 -50997 -53751 -56505 -54485 -55480 -56475 -60034 -63589 -62408 -61227 -60045 -58860 -58473
3793 -58473 -58081 -59121 -60161 -59386 -58607 -60690 -62773 -63288 -63798 -64309 -64819 -60235 -55648 -55830 -56013 -57239 -58462 -58253 -58044 -58048 -58048
3814 -58048 -59479 -60910 -62322 -63731 -63709 -63686 -62773 -61856 -60940 -60023 -62557 -65087 -67618 -70148 -68270 -66388 -64506 -62624 -63489
3833 -63489 -64350 -65210 -66071 -67294 -68512 -69731 -70949 -68222 -65490 -62758 -60027 -59505 -58980 -58454 -57929 -57481 -57030 -59442 -61853
3852 -61853 -61167 -60478 -61219 -61961 -62825 -63690 -63124 -62553 -62255 -61957 -63090 -64219 -63668 -63116 -59702 -56285 -57075 -57865 -58655 -59442 -58059
3873 -58059 -56676 -55294 -53911 -54317 -54724 -55130 -55536 -57627 -59717 -61808 -63899 -64201 -64502 -64804 -65106 -63779 -62449 -61119 -59788
3892 -59788 -59505 -59218 -60362 -61506 -62997 -64484 -63109 -61733 -60511 -59285 -58059 -56833 -58622 -60411 -62199 -63988 -63750 -63511
3910 -63511 -63273 -63034 -62825 -62617 -62408 -62199 -61812 -61424 -60858 -60291 -59143 -55130 -52726 -55093 -56717 -55476 -56144 -56811 -56080 -55346 -56043
3931 -56043 -56740 -60034 -63325 -63753 -64182 -62792 -61398 -60004 -58611 -58830 -59047 -59263 -59479 -59863 -60243 -60623 -61003 -59628 -58249 -56870
3951 -56870 -55491 -56960 -58428 -56557 -54683 -53199 -51716 -52618 -53516 -53688 -53859 -57370 -60876 -58394 -55912 -54862 -53807 -54250
3969 -54250 -54690 -55134 -55573 -53155 -50732 -51653 -52570 -54504 -56434 -58368 -60299 -61189 -62076 -61536 -60992 -58968 -56941 -58257 -59568
3988 -59568 -59512 -59453 -59397 -59337 -60012 -60683 -61357 -62028 -60109 -58186 -57698 -57206 -57153 -57101 -57049 -56993 -56285 -55577 -54869 -54157 -53777 -53397 -54448 -55495
4012 -55495 -54042 -52588 -53520 -54448 -55573 -56695 -57817 -58939 -58752 -58562 -56941 -55320 -57787 -60250 -62714 -65177 -64096 -63012
4030 -63012 -63358 -63705 -61286 -58864 -57873 -56881 -59084 -61283 -60142 -59002 -60220 -61435 -62352 -63269 -60850 -53658 -50759 -52629 -52525
4049 -52525 -52421 -52614 -52808 -54344 -55879 -55029 -54180 -53874 -53568 -54694 -55819 -55991 -56162 -56334 -56505 -58793 -61081 -63369 -65658 -66008
4069 -66008 -66358 -65278 -64197 -63124 -62050 -60977 -59904 -59457 -59009 -56177 -53345 -52260 -51172 -53427 -55678 -57396 -59110 -59218
4087 -59218 -59322 -61815 -61443 -58510 -58435 -60034 -58767 -57742 -53852 -50472 -49950 -50982 -52011 -53729 -55443 -55730 -56013 -56643 -57269
4106 -57269 -57899 -58525 -60437 -62345 -60917 -59486 -58570 -57653 -57988 -58324 -58748 -56311 -55484 -54657 -54008 -53360 -54142 -54925 -58301 -61678
4126 -61678 -62371 -60202 -58435 -56669 -56334 -55998 -57034 -60932 -59881 -58830 -57712 -56594 -57862 -59129 -58249 -57370 -53628 -52749 -53818
4145 -53818 -57746 -57739 -54869 -54508 -57004 -57891 -58778 -57530 -59140 -60929 -59855 -56609 -56222 -54045 -51869 -51224 -50576 -52134 -53691
4164 -53691 -54239 -51921 -51392 -50863 -52096 -56188 -59266 -55667 -53531 -54254 -55335 -56416 -57947 -59475 -59576 -59673 -59237 -58797 -59971
4183 -59971 -58279 -57612 -56941 -57705 -55603 -56039 -56471 -56550 -56624 -56937 -54385 -54876 -55365 -55052 -54735 -52812 -53747 -54388 -55026 -55845 -56662 -57183
4205 -57183 -57701 -55838 -53971 -54631 -55290 -54698 -54101 -50527 -49816 -54411 -53278 -49749 -51944 -53900 -55853 -56498 -57142 -57787 -58428 -57940
4225 -57940 -57452 -56963 -56471 -56341 -56211 -56080 -55946 -56389 -56833 -57276 -57716 -59203 -60690 -58838 -56982 -55536 -54086 -52640 -51191 -49954
4245 -49954 -48713 -51768 -54821 -55685 -56546 -55026 -53501 -52040 -50576 -50546 -50513 -50595 -50673 -52186 -53695 -54552 -55406 -53878 -52346 -51332
4265 -51332 -50315 -53595 -56870 -58599 -60325 -60623 -60917 -57083 -53244 -52749 -52249 -50800 -49346 -50282 -51213 -51649 -52081 -53949 -55812
4284 -55812 -56039 -56263 -55055 -53848 -54113 -54373 -54638 -54899 -55670 -56438 -57209 -57977 -57802 -57623 -57448 -57269 -59181 -61089 -58704 -56319 -54105
$$ [...]
##END=	
