##TITLE=	1qWgxwtwRrevoYWIXBVKFg/1327s
##JCAMPDX=	6.0	$$ NMR Plug-in 1.13 of MestReNova 11.0.4-18998
##DATATYPE=	NMRSPECTRUM
##DATACLASS=	XYDATA
##NUMDIM=	1
##ORIGIN=	Bruker BioSpin GmbH
##OWNER=	andrew
##.OBSERVEFREQUENCY=	600.30184456100005264
##.OBSERVENUCLEUS=	^1H
##.SOLVENTNAME=	CD2Cl2
##.PULSESEQUENCE=	zg
##LONGDATE=	2015/06/05 10:07:07.000
##.ACQUISITIONMODE=	SIMULTANEOUS (DQD)
##$ORIGINALFORMAT=	Bruker XWIN-NMR
##$PARAMETERFILE=	(acqus, ASCII, /var/folders/f6/rjf_tdyn2v98c5c0wvkgn4s80000gn/T/1qWgxwtwRrevoYWIXBVKFg/1327s/acqus, 0)
$$ ##TITLE= Parameter file, TOPSPIN		Version 2.1
$$ ##JCAMPDX= 5.0
$$ ##DATATYPE= Parameter Values
$$ ##NPOINTS= 10	$$ modification sequence number
$$ ##ORIGIN= Bruker BioSpin GmbH
$$ ##OWNER= andrew
$$ $$ 2015-06-05 15:07:08.261 +0600  andrew@av-600
$$ $$ /opt/data/andrew/nmr/limog-1782/608/acqus
$$ $$ process /opt/ts21pl6/prog/mod/shimcntl
$$ ##$ACQT0= -9.54927425515661
$$ ##$AMP= (0..31)
$$ 100 100 100 100 100 100 100 100 100 100 100 100 100 100 100 100 100 100
$$ 100 100 100 100 100 100 100 100 100 100 100 100 100 100
$$ ##$ANAVPT= -1
$$ ##$AQSEQ= 0
$$ ##$AQ_mod= 3
$$ ##$AUNM= <au_zg>
$$ ##$AUTOPOS= <>
$$ ##$BF1= 600.3
$$ ##$BF2= 600.3
$$ ##$BF3= 600.3
$$ ##$BF4= 600.3
$$ ##$BF5= 600.3
$$ ##$BF6= 600.3
$$ ##$BF7= 600.3
$$ ##$BF8= 600.3
$$ ##$BYTORDA= 0
$$ ##$CFDGTYP= 0
$$ ##$CFRGTYP= 9
$$ ##$CHEMSTR= <none>
$$ ##$CNST= (0..63)
$$ 1 1 145 1 1 1 1 1 1 1 1 1 1 1 1 1 1 1 1 1 1 1 1 1 1 1 1 1 1 1 1 1 1 1 1
$$ 1 1 1 1 1 1 1 1 1 1 1 1 1 1 1 1 1 1 1 1 1 1 1 1 1 1 1 1 1
$$ ##$CPDPRG= <>
$$ ##$CPDPRG1= <>
$$ ##$CPDPRG2= <waltz16>
$$ ##$CPDPRG3= <>
$$ ##$CPDPRG4= <mlev>
$$ ##$CPDPRG5= <mlev>
$$ ##$CPDPRG6= <mlev>
$$ ##$CPDPRG7= <mlev>
$$ ##$CPDPRG8= <mlev>
$$ ##$CPDPRGB= <>
$$ ##$CPDPRGT= <>
$$ ##$D= (0..63)
$$ 0 1 0 0 0 0 0 0 0 0.06 0 0.03 0 0 0 0 1e-04 0 0 0 0 0 0 0 0 0 0 0 0 0 0
$$ 0 0 0 0 0 0 0 0 0 0 0 0 0 0 0 0 0 0 0 0 0 0 0 0 0 0 0 0 0 0 0 0 0
$$ ##$DATE= 1433495227
$$ ##$DBL= (0..7)
$$ 120 120 120 120 120 120 120 120
$$ ##$DBP= (0..7)
$$ 150 150 150 150 150 150 150 150
$$ ##$DBP07= 0
$$ ##$DBPNAM0= <>
$$ ##$DBPNAM1= <>
$$ ##$DBPNAM2= <>
$$ ##$DBPNAM3= <>
$$ ##$DBPNAM4= <>
$$ ##$DBPNAM5= <>
$$ ##$DBPNAM6= <>
$$ ##$DBPNAM7= <>
$$ ##$DBPOAL= (0..7)
$$ 0.5 0.5 0.5 0.5 0.5 0.5 0.5 0.5
$$ ##$DBPOFFS= (0..7)
$$ 0 0 0 0 0 0 0 0
$$ ##$DE= 6.5
$$ ##$DECBNUC= <off>
$$ ##$DECIM= 2218.66666666667
$$ ##$DECNUC= <off>
$$ ##$DECSTAT= 4
$$ ##$DIGMOD= 1
$$ ##$DIGTYP= 12
$$ ##$DL= (0..7)
$$ 0 120 120 120 120 120 120 120
$$ ##$DP= (0..7)
$$ 150 150 150 150 150 150 150 150
$$ ##$DP07= 0
$$ ##$DPNAME0= <>
$$ ##$DPNAME1= <>
$$ ##$DPNAME2= <>
$$ ##$DPNAME3= <>
$$ ##$DPNAME4= <>
$$ ##$DPNAME5= <>
$$ ##$DPNAME6= <>
$$ ##$DPNAME7= <>
$$ ##$DPOAL= (0..7)
$$ 0.5 0.5 0.5 0.5 0.5 0.5 0.5 0.5
$$ ##$DPOFFS= (0..7)
$$ 0 0 0 0 0 0 0 0
$$ ##$DQDMODE= 0
$$ ##$DR= 22
$$ ##$DS= 0
$$ ##$DSLIST= <SSSSSSSSSSSSSSS>
$$ ##$DSPFIRM= 0
$$ ##$DSPFVS= 20
$$ ##$DTYPA= 0
$$ ##$EXP= <>
$$ ##$F1LIST= <111111111111111>
$$ ##$F2LIST= <222222222222222>
$$ [...]
$$ -1 -1 -1 -1 -1 -1 -1 -1 -1 -1 -1 -1 -1 -1 -1 -1 -1 -1 -1 -1 -1 -1 -1 -1
$$ -1 -1 -1 -1 -1 -1 -1 -1 -1 -1 -1 -1 -1 -1 -1 -1 -1 -1 -1 -1 -1 -1 -1 -1
$$ -1 -1 -1 -1 -1 -1 -1 -1 -1 -1 -1 -1 -1 -1 -1 -1 -1 -1 -1 -1 -1 -1 -1 -1
$$ -1 -1 -1 -1 -1 -1 -1 -1 -1 -1 -1 -1 -1 -1 -1 -1 -1 -1 -1 -1 -1 -1 -1 -1
$$ -1 -1 -1 -1 -1 -1 -1 -1 -1 -1 -1 -1 -1 -1 -1 -1
$$ ##$RG_tab8= (0..255)
$$ -1 -1 -1 -1 -1 -1 -1 -1 -1 -1 -1 -1 -1 -1 -1 -1 -1 -1 -1 -1 -1 -1 -1 -1
$$ -1 -1 -1 -1 -1 -1 -1 -1 -1 -1 -1 -1 -1 -1 -1 -1 -1 -1 -1 -1 -1 -1 -1 -1
$$ -1 -1 -1 -1 -1 -1 -1 -1 -1 -1 -1 -1 -1 -1 -1 -1 -1 -1 -1 -1 -1 -1 -1 -1
$$ -1 -1 -1 -1 -1 -1 -1 -1 -1 -1 -1 -1 -1 -1 -1 -1 -1 -1 -1 -1 -1 -1 -1 -1
$$ -1 -1 -1 -1 -1 -1 -1 -1 -1 -1 -1 -1 -1 -1 -1 -1 -1 -1 -1 -1 -1 -1 -1 -1
$$ -1 -1 -1 -1 -1 -1 -1 -1 -1 -1 -1 -1 -1 -1 -1 -1 -1 -1 -1 -1 -1 -1 -1 -1
$$ -1 -1 -1 -1 -1 -1 -1 -1 -1 -1 -1 -1 -1 -1 -1 -1 -1 -1 -1 -1 -1 -1 -1 -1
$$ -1 -1 -1 -1 -1 -1 -1 -1 -1 -1 -1 -1 -1 -1 -1 -1 -1 -1 -1 -1 -1 -1 -1 -1
$$ -1 -1 -1 -1 -1 -1 -1 -1 -1 -1 -1 -1 -1 -1 -1 -1 -1 -1 -1 -1 -1 -1 -1 -1
$$ -1 -1 -1 -1 -1 -1 -1 -1 -1 -1 -1 -1 -1 -1 -1 -1 -1 -1 -1 -1 -1 -1 -1 -1
$$ -1 -1 -1 -1 -1 -1 -1 -1 -1 -1 -1 -1 -1 -1 -1 -1
$$ ##$RG_tabA= (0..255)
$$ 0.25 0.28 0.32 0.35 0.4 0.44 0.5 0.56 0.64 0.7 0.8 0.89 1 1.12 1.28 1.4
$$ 1.6 1.78 2 2.25 2.56 2.8 3.2 3.56 4 4.5 5 5.6 6.35 7.12 8 9 10 11.3 12.7
$$ 14.2 16 18 20.2 22.6 25.4 28.5 32 36 40.3 45.2 50.8 57 64 71.8 80.6 90.5
$$ 101 114 128 144 161 181 203 -1 -1 -1 -1 -1 -1 -1 -1 -1 -1 -1 -1 -1 -1 -1
$$ -1 -1 -1 -1 -1 -1 -1 -1 -1 -1 -1 -1 -1 -1 -1 -1 -1 -1 -1 -1 -1 -1 -1 -1
$$ -1 -1 -1 -1 -1 -1 -1 -1 -1 -1 -1 -1 -1 -1 -1 -1 -1 -1 -1 -1 -1 -1 -1 -1
$$ -1 -1 -1 -1 -1 -1 -1 -1 -1 -1 -1 -1 -1 -1 -1 -1 -1 -1 -1 -1 -1 -1 -1 -1
$$ -1 -1 -1 -1 -1 -1 -1 -1 -1 -1 -1 -1 -1 -1 -1 -1 -1 -1 -1 -1 -1 -1 -1 -1
$$ -1 -1 -1 -1 -1 -1 -1 -1 -1 -1 -1 -1 -1 -1 -1 -1 -1 -1 -1 -1 -1 -1 -1 -1
$$ -1 -1 -1 -1 -1 -1 -1 -1 -1 -1 -1 -1 -1 -1 -1 -1 -1 -1 -1 -1 -1 -1 -1 -1
$$ -1 -1 -1 -1 -1 -1 -1 -1 -1 -1 -1 -1 -1 -1 -1 -1 -1 -1 -1 -1 -1 -1 -1 -1
$$ -1 -1 -1 -1 -1 -1 -1 -1 -1 -1 -1 -1 -1 -1
$$ ##$ROUT14= (0..7)
$$ 0 0 0 0 0 0 0 0
$$ ##$ROUTER= -1
$$ ##$RX22TY= <no>
$$ ##$RXFMAX= (0..7)
$$ 647.5 -1 -1 -1 -1 -1 -1 -1
$$ ##$RXFMIN= (0..7)
$$ 5 -1 -1 -1 -1 -1 -1 -1
$$ ##$RXINTLV= (0..7)
$$ 1 0 0 0 0 0 0 0
$$ ##$RXMSTY= <no>
$$ ##$SCMTY= <no>
$$ ##$SGUC1= (0..15)
$$ 17 18 34 0 0 0 0 0 0 0 0 0 0 0 0 0
$$ ##$SGUC2= (0..15)
$$ 33 256 20 0 0 0 0 0 0 0 0 0 0 0 0 0
$$ ##$SPECTR= 10
$$ ##$SY2FLAG= 0
$$ ##$TFXNUM= 0
$$ ##$TRIPLO2= 0
$$ ##$VTUTY= <tty05>
$$ ##$WBREFAM= (0..15)
$$ 100 100 100 100 100 100 100 100 100 100 100 100 100 100 100 100
$$ ##$WBREFPH= (0..15)
$$ 0 0 0 0 0 0 0 0 0 0 0 0 0 0 0 0
$$ ##$XFAC= 2
$$ ##END=
$$ 
##$DECIM=	2218.66666666667
##$DSPFVS=	20
##XUNITS=	HZ
##YUNITS=	ARBITRARY UNITS
##FIRSTX=	6322.8525384689401108
##LASTX=	-2691.4329892738592207
##XFACTOR=	-0.1375491802509010153
##YFACTOR=	1.028038281249999993e-05
##NPOINTS=	65536
##XYDATA=	(X++(Y..Y))
$$ [...]
$$ plain form
-12161 -33166 -40941 -45850 -47777 -49704 -50021 -50334 -52261 -54188 -54684 -55176 -53636 -52097 -53778 -55455 -53648 -57565 -58441 -56451
-12143 -56451 -54445 -52436 -51680 -50923 -52287 -53648 -55008 -56369 -57196 -58020 -57412 -56805 -55933 -55057 -57043 -59030 -60912 -62791 -61807
-12124 -61807 -60823 -61423 -62019 -61184 -60349 -58445 -56536 -57490 -58445 -59194 -59939 -60685 -61430 -63596 -65758 -65057 -64356 -60469 -56577 -55549
-12104 -55549 -54520 -54986 -55448 -54837 -54225 -54781 -61057 -64472 -62161 -61307 -60450 -59235 -58020 -56838 -55653 -55899 -56145 -57453 -58758
-12085 -58758 -57200 -55642 -57397 -59149 -58038 -56928 -56380 -55832 -55284 -54732 -54065 -53398 -55593 -57785 -58691 -59596 -60502 -61404 -61296
-12066 -61296 -61188 -61080 -60968 -60219 -59470 -58720 -57968 -59365 -60763 -59477 -58187 -54091 -52857 -56096 -53607 -50912 -48217 -44031
-12048 -44031 -39842 -41318 -47561 -52734 -55042 -56070 -57095 -57945 -58791 -59313 -59831 -60353 -60871 -60200 -59526 -58855 -58180 -58627 -59071 -59518
-12028 -59518 -59962 -59514 -59063 -58616 -58165 -59060 -59950 -57983 -56011 -53983 -51952 -54695 -57435 -58005 -58575 -56283 -53991 -55366 -56741
$$ packed form
-12161c3166p775m909j927j927l17l13j927j927m96m92J540J539j681j677J807l917q76J990
-12143e6451K006K009P56P57j364j361j360j361q27q24O08O07Q72Q76j986j987j882j879R84
-12124f1807R84o00n96Q35Q35J904J909r54r55p49p45p46p45k166k162P01P01L887L892J028
-12104e5549J029m66m62O11O12n56o276l415K311Q54Q57J215J215J182J185k46k46j308j305
-12085e8758J558J558j755j752J111J110N48N48N48N52O67O67k195k192r06r05r06r02J08
-12066f1296J08J08J12P49P49P50P52j397j398J286J290M096J234l239K489K695K695M186
-12048d4031M189j476o243n173k308j028j025q50q46n22n18n22n18O71O74O71O75m47m44m47
-12028e9518m44M48M51M47M51q95q90J967J972K028K031k743k740n70n70K292K292j375j375
$$ plain form
-12009 -56741 -58117 -59492 -57707 -55921 -55567 -55213 -55455 -55698 -58802 -61907 -62205 -62504 -61371 -60237 -60715 -61192 -61669 -62146 -62556
-11990 -62556 -62966 -61945 -60923 -62675 -64427 -63316 -62205 -62429 -62653 -62876 -63096 -62515 -61933 -61352 -60767 -59507 -58247 -58419 -58586
-11971 -58586 -58788 -58989 -62053 -65113 -64237 -63361 -59622 -55880 -54557 -53234 -53819 -59171 -61382 -60729 -62343 -61091 -59962 -61695
-11953 -61695 -62772 -63845 -65280 -61941 -58605 -60036 -61471 -62902 -61773 -60640 -58392 -56141 -55325 -54505 -58668 -62828 -64129
-11936 -64129 -65426 -65657 -65884 -63253 -60618 -59089 -57558 -58892 -60223 -58784 -57341 -57334 -57323 -58061 -58795 -59354 -59909 -58855 -54937
-11917 -54937 -53883 -55690 -53860 -52030 -51631 -54095 -53219 -52343 -51646 -50949 -52936 -54922 -54225 -53528 -53845 -57025 -54002 -50979 -49089
-11898 -49089 -50062 -52287 -54512 -53935 -53357 -52779 -52201 -55083 -57964 -59593 -58359 -58150 -57938 -60230 -62522 -63447 -61505 -61173 -60841
-11879 -60841 -60275 -59704 -59134 -58564 -60264 -61959 -66100 -70241 -71967 -67010 -60264 -58288 -56972 -55653 -57494 -59336 -59868 -60398
$$ packed form
-12009e6741j376j375J785J786L54L54k42k43l104l105k98k99J133J134m78m77m77m77m10
-11990f2556m10J021J022j752j752J111J111k24k24k23k20N81N82N81N85J260J260j72j67
-11971e8586k02k01l064l060Q76Q76L739L742J323J323n85n352k211O53j614J252J129j733
-11953f1695j077j073j435L339L336j431j435j431J129J133K248K251Q16Q20m163m160j301
-11936f4129j297k31k27K631K635J529J531j334j331J439J443PJ1p38p34n59n55J054L918
-11917e4937J054j807J830J830L99k464Q76Q76O97O97j987j986O97O97l17l180L023L023J890
-11898d9089r73k225k225N77N78N78N78k882k881j629J234K09K12k292k292r25J942L32L32
-11879f0841N66N71N70N70j700j695m141m141j726M957O746J976J316J319j841j842n32n30
$$ plain form
-11861 -60398 -62716 -62172 -60618 -61922 -61438 -60953 -62146 -63335 -64524 -65713 -63804 -61892 -60159 -58426 -57658 -59749 -60230 -60711
-11843 -60711 -60182 -59649 -59116 -58583 -57941 -57297 -56473 -55649 -56797 -55079 -54792 -54505 -57196 -57021 -58277 -59533 -60435 -58471 -56328 -57047
-11823 -57047 -60107 -60301 -57517 -54729 -54032 -53331 -52634 -51933 -50252 -48567 -51478 -54386 -57118 -56984 -55780 -54572 -55027 -58340
-11805 -58340 -61658 -62109 -60595 -59078 -57386 -55690 -55146 -54598 -54233 -53864 -52902 -54799 -56700 -55735 -55265 -54796 -54147 -53499 -54460 -55422
-11785 -55422 -53521 -51620 -52418 -53215 -54013 -54811 -53282 -51754 -54997 -58240 -59089 -59939 -57927 -55914 -55392 -54870 -57211 -59552 -60729
-11766 -60729 -61907 -63085 -64263 -63294 -62325 -61356 -60387 -62075 -63763 -62589 -61412 -61132 -60852 -60573 -60290 -59794 -59298 -58802 -58303 -58165
-11746 -58165 -58027 -57889 -57748 -56905 -56063 -57129 -55329 -52876 -55194 -57334 -54699 -55534 -56369 -56905 -57438 -57259 -57080 -56902 -56719 -57643
-11726 -57643 -58564 -59488 -60409 -60618 -60823 -61031 -61236 -61699 -62157 -62619 -63078 -63540 -63998 -64460 -64919 -63353 -61784 -60219 -58650 -61318
$$ packed form
-11861f0398k318N44J554j304M84M85j193j189j189j189J909J912J733J733P68k091m81m81
-11843f0711N29N33N33N33O42O44Q24Q24j148J718K87K87k691J75j256j256r02J964K143p19
-11823e7047l060j94K784K788O97P01O97P01J681J685k911k908k732J34J204J208m55l313
-11805e8340l318m51J514J517J692J696N44N48L65L69R62j897j901R65M70M69O49O48r61r62
-11785e5422J901J901p98p97p98p98J529J528l243l243q49q50K012K013N22N22k341k341j177
-11766f0729j178j178j178R69R69R69R69j688j688J174J177K80K80K79K83M96M96M96M99J38
-11746e8165J38J38J41Q43Q42j066J800K453k318k140K635q35q35n36n33J79J79J78J83r24
-11726e7643r21r24r21k09k05k08k05m63m58m62m59m62m58m62m59J566J569J565J569k668
$$ plain form
-11706 -61318 -63983 -63790 -63592 -61773 -59950 -58132 -56309 -57412 -58512 -59615 -60715 -61348 -61982 -62615 -63245 -63044 -62843 -59779 -56711
-11687 -56711 -55996 -55280 -57427 -59570 -60465 -61359 -60346 -62191 -62869 -58776 -55936 -55955 -57170 -58385 -59779 -61169 -62996 -64822
-11669 -64822 -66648 -68471 -65586 -62701 -62679 -62653 -61363 -60070 -58776 -57483 -55657 -53827 -55336 -56846 -57807 -58765 -57338 -55910
-11651 -55910 -56812 -57710 -57177 -56644 -54408 -52168 -55176 -58184 -60122 -62056 -60651 -59246 -57658 -56067 -55906 -55746 -55798 -55847 -55895 -55944
-11631 -55944 -58635 -61326 -62586 -63842 -63730 -63618 -63506 -63391 -61229 -59067 -58337 -57602 -58035 -58467 -57468 -56465 -55582 -54699 -55247 -55791
-11611 -55791 -57114 -58437 -56600 -54758 -55985 -60073 -61896 -58944 -59365 -59786 -59909 -60029 -59794 -59559 -61710 -63857 -63681 -63506 -63331
-11592 -63331 -63152 -61285 -59417 -58981 -58542 -57509 -56477 -55444 -54408 -54721 -55034 -58389 -61740 -67569 -68628 -68076 -67521 -67595 -67670
-11573 -67670 -65359 -63044 -59839 -56633 -56767 -56898 -57584 -58266 -57520 -56771 -57248 -57722 -58199 -58672 -60618 -62560 -62120 -61676 -61743 -61807 -60442
$$ packed form
-11706f1318k665J93J98J819J823J818J823j103j100j103j100o33o34o33o30K01K01L064L068
-11687e6711P15P16k147k143q95q94J013j845o78M093K840j9j215j215j394j390j827j826
-11669f4822j826j823K885K885K2K6J290J293J294J293J826J830j509j510r61r58J427J428
-11651e5910r02q98N33N33K236K240l008l008j938j934J405J405J588J591J61J60n2m9m8m9
-11631e5944k691k691j260j256J12J12J12J15K162K162P30P35m33m32R99J003Q83Q83n48n44
-11611e5791j323j323J837J842j227m088j823K952m21m21j23j20K35K35k151k147J76J75J75
-11592f3331J79J867J868M36M39J033J032J033J036l13l13l355l351n829j059N52N55p4p5
-11573f7670K311K315L205L206j34j31o86o82P46P49m77m74m77m73j946j942M40M44o7o4J365
$$ plain form
-11552 -60442 -59075 -56443 -53808 -53562 -53312 -54438 -55560 -53346 -51128 -51374 -51616 -49477 -47334 -47967 -48597 -47800 -46998 -49056 -51109
-11533 -51109 -53163 -55217 -53994 -52768 -54881 -56995 -58083 -59168 -60252 -61337 -60606 -59872 -59138 -58404 -58687 -58966 -59246 -59526 -57215
-11514 -57215 -54900 -52585 -50271 -52403 -54531 -55228 -55925 -56417 -56905 -55962 -55019 -53711 -52403 -54434 -56465 -54978 -53491 -52004
-11496 -52004 -50517 -50625 -50733 -50841 -50949 -52369 -53789 -55209 -56629 -56779 -56928 -57077 -57226 -59313 -61400 -61102 -60804 -59388 -57971
-11477 -57971 -56555 -55139 -55839 -56540 -54855 -53171 -52041 -50908 -51210 -51508 -56104 -60696 -60998 -61296 -59451 -57602 -57189 -56771 -57520
-11458 -57520 -58266 -55675 -53081 -54054 -55023 -55996 -56965 -56059 -55150 -58538 -61922 -61210 -60495 -58351 -56205 -55344 -54479 -52187 -49891
-11439 -49891 -51214 -52533 -53853 -55172 -55631 -56085 -55109 -54132 -52891 -51646 -53741 -55836 -54475 -53111 -53178 -53245 -54456 -55664 -51624
-11420 -51624 -47583 -42324 -37061 -28757 -26178 -25108 -26897 -31728 -36558 -39216 -41869 -45656 -49443 -52228 -50241 -47598 -44956
$$ packed form
-11552f0442J367K632K635K46K50j126j122K214K218k46k42K139K143o33o30P97Q02k058k053
-11533e1109k054k054J223J226k113k114j088j085j084j085P31P34P34P34k83k79k80k80K311
-11514e7215K315K315K314k132k128o97o97m92m88R43R43J308J308k031k031J487J487J487
-11496e2004J487j08j08j08j08j420j420j420j420j50j49j49j49k087k087K98K98J416J417
-11477e7971J416J416p00p01J685J684J130J133l02k98m596m592l02k98J845J849M13M18p49
-11458e7520p46K591K594r73r69r73r69R06R09l388l384P12P15K144K146Q61Q65K292K296
-11439d9891j323j319j320j319m59m54R76R77J241J245k095k095J361J364o7o7j211j208M040
-11420e1624M041N259N263Q304K579J070j789m831m830k658k653l787l787k785J987K643K642
$$ plain form
-11403 -44956 -45533 -46111 -46689 -47267 -47978 -48690 -49402 -50114 -51244 -52373 -52071 -51769 -51139 -50509 -53219 -55929 -57863 -59798 -59347 -58896
-11383 -58896 -57490 -56085 -58020 -59954 -59831 -59708 -58154 -56600 -57233 -57863 -58497 -59127 -56451 -53771 -53480 -53186 -52224 -51258 -52682
-11364 -52682 -54102 -54035 -53964 -58191 -62414 -60819 -59224 -59060 -58896 -57837 -56779 -55720 -54661 -54363 -54065 -53767 -53469 -54989 -56510
-11345 -56510 -58031 -59552 -60159 -60767 -58035 -55303 -54419 -53536 -55038 -56540 -55075 -53610 -54054 -51635 -48530 -50196 -49775 -52216
-11327 -52216 -53696 -55172 -54445 -53715 -56834 -59950 -61639 -63324 -60196 -57066 -53938 -50807 -50901 -50990 -53469 -55944 -56536 -57129 -57722
-11308 -57722 -58310 -59171 -60032 -59462 -58888 -58452 -58016 -59965 -61911 -59596 -57282 -56398 -55511 -56984 -58456 -59928 -61397 -59529 -57662
-11289 -57662 -59134 -60603 -60852 -61102 -61352 -61598 -59075 -56551 -54028 -51501 -53018 -54535 -56052 -57569 -58221 -58873 -59526 -60178 -58199
-11270 -58199 -56219 -57401 -58583 -59854 -58262 -54881 -57226 -59164 -58240 -59104 -59969 -61460 -60088 -56749 -59134 -64047 -63234 -62779
$$ packed form
-11403d4956n77n78n78n78p11p12p12p12j130j129L02L02O30O30k710k710j934j935M51M51
-11383e8896J406J405j935j934J23J23J554J554o33o30o34o30K676K680K91K94R62R66j424
-11364e2682j420O7P1m227m223J595J595J64J64J059J058J059J059K98K98K98K98j520j521
-11345e6510j521j521o07o08K732K732Q84Q83j502j502J465J465m44K419L105j666M21k441
-11327e2216j480j476P27P30l119l116j689j685L128L130L128L131r4q9k479k475n92n93n93
-11308e7722n88q61q61N70N74M36M36j949j946K315K314Q84Q87j473j472j472j469J868J867
-11289e7662j472j469k49k50k50k46K523K524K523K527j517j517j517j517o52o52o53o52J979
-11270e8199J980j182j182j271J592L381k345j938R24q64q65j491J372L339k385m913Q13M55
$$ plain form
-11252 -62779 -65187 -66701 -65351 -62451 -59552 -59514 -59473 -59436 -59395 -59507 -59615 -60085 -60551 -57531 -60234 -61330 -59559 -56868 -54173 -53689
-11232 -53689 -53200 -52846 -52489 -52134 -51777 -53301 -54822 -53007 -51188 -51087 -50983 -54222 -57457 -57535 -57610 -57688 -57763 -58199 -58635 -59071 -59503
-11211 -59503 -59343 -59183 -59022 -58858 -57610 -56361 -55291 -54218 -55414 -59473 -62757 -60312 -58467 -56622 -56805 -56984 -58508 -60032
-11193 -60032 -60126 -60215 -60547 -60879 -61210 -61538 -61423 -61307 -61192 -61072 -60696 -60316 -59936 -59555 -61147 -62735 -62712 -62690 -60152 -54747 -52980 -56939
-11171 -56939 -59112 -61281 -60469 -59656 -60659 -61658 -59317 -56976 -56905 -56831 -56756 -56682 -57244 -57804 -58363 -58922 -58650 -58374 -57919 -57464 -59201
-11150 -59201 -58072 -58556 -59037 -57673 -56305 -56372 -56436 -58635 -60830 -62254 -60811 -58657 -56499 -55597 -54691 -53465 -52235 -53394 -54550
-11131 -54550 -55440 -56328 -54833 -53335 -55336 -57334 -60946 -61691 -62709 -63722 -63130 -62533 -59201 -55865 -55094 -54322 -53733 -56003 -56305
-11112 -56305 -59470 -62854 -63372 -62519 -61665 -60547 -62287 -63670 -65053 -64744 -61568 -60003 -58437 -58217 -57994 -55563 -53133 -52339
$$ packed form
-11252f2779k408j514J350K900K899L8M1L7M1j12j08m70m66L020k703j096J771K691K695M84
-11232e3689M89L54L57L55L57j524j521J815J819J01J04l239l235p8p5p8p5m36m36m36m32
-11211e9503J60J60J61J64J248J249J070J073j196m059l284K445J845J845j83j79j524j524
-11193f0032r4q9l32l32l31l28J15J16J15J20L76L80L80L81j592j588K3K2K538N405J767l959
-11171e6939k173k169Q12Q13j003r99K341K341P1P4P5P4n62n60n59n59K72K76M55M55j737
-11150e9201J129m84m81J364J368o7o4k199k195j424J443K154K158R02R06J226J230j159j156
-11131e4550q90q88J495J498k001j998l612p45j018j013N92N97L332L336P71P72N89k270l02
-11112e6305l165l384n18Q53Q54J118j740j383j383L09L176J565J566K20K23K431K430P94
$$ plain form
-11094 -52339 -54404 -56111 -57818 -60215 -59745 -55817 -51888 -52142 -55258 -56764 -58266 -56820 -55373 -55537 -55698 -53894 -54952 -56786
-11076 -56786 -58616 -56156 -53696 -53622 -53543 -53551 -53558 -57561 -61561 -65087 -63842 -60987 -58128 -60163 -62198 -60893 -59585 -59772 -59958 -57759
-11056 -57759 -55556 -54020 -52485 -52500 -55373 -59503 -60770 -62276 -60916 -60811 -63570 -65970 -63596 -60390 -60047 -60182 -60312 -60387 -60461
-11037 -60461 -58150 -55836 -55880 -55925 -57580 -59231 -58083 -59798 -61512 -60360 -58944 -57528 -56290 -55049 -52369 -55414 -56849 -55418
-11019 -55418 -57151 -58884 -60439 -61989 -60987 -59984 -58981 -57975 -59119 -60264 -61408 -62548 -61236 -59924 -58612 -57297 -55269
-11002 -55269 -53241 -50021 -52522 -56510 -54773 -55183 -55590 -55165 -54740 -55746 -56749 -56078 -55407 -56167 -56924 -58966 -61009 -61620 -62228
-10983 -62228 -62355 -62481 -62608 -62731 -62261 -61792 -61322 -60849 -59820 -58791 -61102 -63409 -61069 -58728 -60681 -62630 -61132 -59634 -58135
-10964 -58135 -56633 -56596 -56559 -56521 -56480 -55530 -54580 -53629 -52675 -54259 -55839 -55038 -54233 -54326 -54419 -54512 -54602 -54307 -54009 -55146 -56279 -58467 -60655
$$ packed form
-11094e2339k065j707j707k397M70L928L929k54l116j506j502J446J447j64j61J804j058j834
-11076e6786j830K460K460P4P9qpm003m000l526J245K855K859k035k035J305J308j87j86K199
-11056e7759K203J536J535j5k873m130j267j506J360J05k759k400K374L206L43j35j30p5p4
-11037f0461K311K314m4m5j655j651J148j715j714J152J416J416J238J241K680l045j435J431
-11019e5418j733j733j555j550J002J003J003J006j144j145j144j140J312J312J312J315K028
-11002e5269K028L220k501l988J737m10m07M25M25j006j003O71O71p60p57k042k043o11o08
-10983f2228j27j26j27j23M70M69M70M73J029J029k311k307K340K341j953j949J498J498J499
-10964e8135J502L7L7L8M1R50R50R51R54j584j580Q01Q05r3r3r3r0K95K98j137j133k188k188
$$ plain form
-10941 -60655 -60457 -60256 -60476 -60692 -59481 -58266 -59887 -61508 -60744 -59977 -60823 -61665 -59171 -56674 -55321 -53968 -54822 -55672 -56853
-10922 -56853 -55172 -53312 -57174 -57908 -58642 -59734 -60823 -59857 -58892 -57927 -56957 -58269 -59581 -60893 -62202 -58922 -55642 -53793
-10904 -53793 -51941 -54237 -56533 -55489 -54442 -57960 -61479 -61658 -61833 -59224 -56615 -54005 -51393 -52153 -52910 -53670 -54427 -55098
-10886 -55098 -55768 -56439 -57107 -55601 -54091 -54196 -54296 -56014 -60595 -62492 -61523 -60469 -62273 -64975 -62902 -60655 -58407 -56041
-10868 -56041 -53670 -56253 -61695 -62548 -60536 -60864 -64054 -65456 -66857 -66469 -66082 -65694 -65307 -64099 -62891 -60073 -60118 -60073 -60029 -57121
-10848 -57121 -57077 -58817 -60558 -61404 -59388 -60592 -64658 -64073 -63488 -61516 -59544 -57394 -58105 -59682 -61259 -60331 -59403 -57077 -57613
-10829 -57613 -59403 -61188 -60472 -59757 -59041 -58322 -56637 -54952 -56428 -60763 -61315 -61866 -59734 -57599 -57673 -57748 -59253 -60756 -61993
-10810 -61993 -63230 -63216 -63197 -62071 -63808 -64114 -61553 -60070 -58586 -60144 -58836 -58001 -60029 -60625 -58355 -55493 -55493 -58474 -61453
$$ packed form
-10941f0655J98K01k20k16J211J215j621j621P64P67q46q42K494K497J353J353q54q50j181
-10922e6853J681J860l862p34p34j092j089R66R65R65R70j312j312j312j309L280L280J849
-10904e3793J852k296k296J044J047l518l519j79j75K609K609K610K612p60p57p60p57o71
-10886e5098o70o71o68J506J510j05j00j718m581j897R69J054j804k702K073K247K248K366
-10868e6041K371k583n442q53K012l28l190j402j401L88L87L88L87J208J208K818m5M5M4K908
-10848e7121M4j740j741q46K016j204m066N85N85J972J972K150p11j577j577R28R28K326n36
-10829e7613j790j785P16P15P16P19J685J685j476m335n52n51K132K135p4p5j505j503j237
-10810f1993j237J4J9J126j737l06K561J483J484j558J308Q35k028n96K270K862%k981k979
$$ plain form
-10791 -61453 -59149 -56846 -59313 -61777 -60040 -58303 -55135 -51963 -53256 -54550 -54054 -56417 -57979 -56678 -56987 -57293 -58825
-10774 -58825 -57494 -57774 -58050 -56957 -55865 -54773 -53677 -54196 -54710 -55228 -55742 -56678 -57610 -55683 -53752 -55105 -56454 -57807 -59157
-10755 -59157 -61225 -63290 -62496 -61699 -60476 -59250 -58027 -56801 -57845 -58884 -59928 -60968 -62571 -64170 -62910 -61646 -59999
-10738 -59999 -58348 -58132 -57912 -57587 -57259 -56931 -56603 -56100 -55593 -55086 -54580 -53636 -52690 -53174 -53659 -55131 -56600 -53297 -49995 -52406
-10718 -52406 -54814 -54360 -53905 -54557 -55206 -54423 -53640 -52727 -51810 -53756 -55701 -55951 -56197 -56443 -56689 -55809 -54930 -52142 -52213 -54017 -51050
-10697 -51050 -50945 -55608 -58471 -58471 -57517 -56559 -58407 -60256 -62105 -63950 -62273 -60595 -58918 -57237 -58184 -59130 -60077 -61020 -60685
-10678 -60685 -60349 -60014 -59675 -58146 -56618 -55090 -53558 -54736 -55910 -56905 -57900 -58184 -55601 -51944 -53059 -54587 -56111 -60618
-10660 -60618 -60353 -59198 -58038 -59444 -60849 -59179 -57505 -58694 -59883 -60182 -60476 -59339 -58202 -58560 -58914 -60700 -62485 -59622
$$ packed form
-10791f1453K304K303k467k464J737J737L168L172j293j294M96k363j562J301l09l06j532
-10774e8825J331k80k76J093J092J092J096n19n14n18n14r36r32J927J931j353j349j353j350
-10755e9157k068k065P94P97J223J226J223J226j044j039j044j040j603j599J260J264J647
-10738e9999J651K16K20L25L28L28L28N03N07N07N06R44R46m84m85j472j469L303L302k411
-10718e2406k408M54M55o52o49P83P83R13R17j946j945k50k46k46k46Q80Q79K788p1j804K967
-10697e1050J05m663k863%R54R58j848j849j849j845J677J678J677J681r47r46r47r43L35
-10678f0685L36L35L39J529J528J528J532j178j174r95r95k84K583L657j115j528j524m507
-10660f0618K65J155J160j406j405J670J674j189j189k99k94J137J137l58l54j786j785K863
$$ plain form
-10642 -59622 -56756 -55321 -53886 -53036 -52183 -53715 -55247 -56335 -57420 -58504 -59589 -56510 -53428 -53685 -53942 -56111 -58277 -59011
-10624 -59011 -59745 -58896 -58042 -57189 -56335 -55455 -54572 -57028 -59485 -61199 -62910 -63189 -63469 -63782 -64091 -62970 -61848 -61807 -61762 -61721 -61676
-10603 -61676 -59697 -57714 -58120 -58523 -60912 -63298 -63301 -63301 -63096 -62888 -61251 -59611 -58966 -58318 -57673 -57025 -57364 -57699 -58038 -58374 -57841
-10582 -57841 -57304 -56771 -56234 -55701 -55165 -54632 -54095 -55236 -56376 -57517 -58653 -56872 -55090 -54740 -54386 -56950 -59514 -56831 -54143
-10563 -54143 -54710 -55276 -55843 -56406 -57796 -59186 -58191 -57192 -58284 -59376 -58083 -56786 -56290 -55795 -55299 -54799 -56301 -57804 -57874 -57941
-10543 -57941 -58870 -59798 -57386 -54971 -53752 -52533 -52746 -52954 -52623 -52291 -55299 -58303 -58001 -57699 -57397 -57092 -59540 -61989 -61098
-10524 -61098 -60204 -61549 -62895 -61855 -60811 -59071 -57330 -57021 -56708 -56607 -56506 -56406 -56301 -57983 -59663 -58959 -58255 -57818 -57382
-10505 -57382 -56946 -56510 -57431 -58351 -59272 -60193 -60040 -59887 -59734 -59581 -59380 -59179 -58978 -58776 -57949 -57121 -56294 -55467 -54758 -54050 -56682 -59313
$$ packed form
-10642e9622K866J435J435Q50Q53j532j532j088j085j084j085L079L082k57k57k169k166p34
-10624e9011p34Q49Q54Q53Q54Q80Q83k456k457j714j711k79k80l13l09J121J122M1M5M1M5
-10603f1676J979J983m06m03k389k386l%K05K08J637J640O45O48O45O48l39l35l39l36N33
-10582e7841N37N33N37N33N36N33N37j141j140j141j136J781J782L50L54k564k564K683K688
-10563e4143n67n66n67n63j390j390R95R99j092j092J293J297M96M95M96N00j502j503p0o7
-10543e7941r29r28K412K415J219J219k13k08L31L32l008l004L02L02L02L05k448k449Q91
-10524f1098Q94j345j346J040J044J740J741L09L13J01J01J00J05j682j680P04P04M37M36
-10505e7382M36M36r21r20r21r21J53J53J53J53K01K01K01K02Q27Q28Q27Q27P09P08k632k631
$$ plain form
-10483 -59313 -60305 -61296 -60856 -60416 -58076 -55731 -57684 -59634 -59022 -58407 -59227 -60044 -59954 -59861 -58340 -56816 -57621 -58422 -55888 -53349
-10463 -53349 -51668 -49984 -50688 -51389 -54002 -56611 -55884 -55153 -53383 -51609 -54132 -56652 -57863 -59071 -60282 -61490 -60346 -59201
-10445 -59201 -58236 -57271 -55232 -56055 -57953 -55075 -54065 -53055 -51747 -50439 -51367 -52295 -53223 -54147 -57461 -60774 -59794 -58814 -59026
-10426 -59026 -59239 -59451 -59660 -60066 -60472 -58493 -56514 -57666 -58817 -59969 -61117 -60659 -60196 -59917 -59634 -61799 -66824 -70540 -69481
-10407 -69481 -64967 -60450 -59932 -59410 -61754 -64095 -63100 -62101 -59634 -57162 -56126 -55086 -56346 -57602 -57431 -57256 -57681 -58102 -58527
-10388 -58527 -58948 -58925 -58899 -58877 -58851 -59686 -60521 -61356 -62187 -61889 -61587 -61289 -60987 -62813 -64639 -61695 -58747 -57054 -55358 -56529 -57695
-10367 -57695 -56197 -54695 -56055 -57416 -57166 -56916 -56667 -56417 -55329 -54237 -56007 -57777 -59309 -60841 -57602 -54363 -55299 -56234
-10349 -56234 -57170 -58102 -56115 -54128 -55004 -55877 -58750 -61624 -61635 -61643 -62369 -63096 -63823 -64546 -63775 -63003 -62232 -61456 -61997 -62537 -63078 -63614
$$ packed form
-10483e9313r92r91M40M40K340K345j953j950O12O15q20q17R0R3J521J524q05q01K534K539
-10463e3349J681J684p04p01k613k609P27P31J770J774k523k520j211j208j211j208J144J145
-10445e9201R65R65K039q23j898K878J010J010J308J308r28r28r28r24l314l313R80R80k12
-10426e9026k13k12k09m06m06J979J979j152j151j152j148M58M63K79K83k165n025l716J059
-10407f9481M514M517N18N22k344k341R95R99K467K472J036J040j260j256J71J75m25m21m25
-10388e8527m21K3K6K2K6q35q35q35q31K98L02K98L02j826j826K944K948J693J696j171j166
-10367e7695J498J502j360j361K50K50K49K50J088J092j770j770j532j532L239L239r36r35
-10349e6234r36r32J987J987q76q73k873k874j1qp26p27p27p23P71P72P71P76n41n40n41n36
$$ plain form
-10327 -63614 -63253 -62891 -62530 -62164 -61803 -61441 -61080 -60715 -60964 -61210 -61460 -61706 -63089 -64468 -61080 -57688 -58087 -58482 -58881 -59276 -59973
-10306 -59973 -60666 -61363 -62056 -61453 -60849 -60245 -59641 -60647 -61654 -59798 -57941 -56987 -56033 -55079 -54125 -58061 -61997 -59253 -56510
-10287 -56510 -56544 -56577 -56611 -56644 -59183 -61721 -61397 -61072 -59779 -58486 -57192 -55899 -55262 -54624 -53987 -53349 -52321 -51292 -50263 -49235
-10267 -49235 -49100 -48966 -48832 -48698 -51292 -53886 -53618 -53349 -53916 -54483 -55049 -55616 -57177 -58735 -57435 -56130 -51609 -47084 -49242
-10248 -49242 -51396 -53301 -55202 -57107 -59007 -59302 -59593 -59589 -59581 -62381 -60405 -59328 -61110 -64028 -64080 -61453 -61684 -60159 -58631
-10229 -58631 -57464 -56294 -53756 -54076 -58337 -57822 -60439 -63055 -62511 -61967 -62317 -62668 -63018 -63368 -66745 -70122 -68728 -67334 -65225
-10210 -65225 -63115 -63868 -64621 -62403 -60185 -57968 -55750 -53592 -51434 -54046 -56659 -59943 -63227 -59831 -56436 -57930 -59425
-10193 -59425 -60920 -62414 -62526 -62634 -62746 -62854 -61654 -60450 -59250 -58046 -59529 -61009 -62492 -63972 -64323 -64669 -62157 -59641
$$ packed form
-10327f3614L61L62L61L66L61L62L61L65k49k46k50k46j383j379L388L392l99l95l99l95o97
-10306e9973o93o97o93O03O04O04O04j006j007J856J857R54R54R54R54l936l936K744K743
-10287e6510l4l3l4l3k539k538L24L25J293J293J294J293O37O38O37O38J028J029J029J028
-10267d9235J35J34J34J34k594k594K68K69n67n67n66n67j561j558J300J305M521M525k158
-10248d9242k154j905j901j905j900k95k91MQk800J976J077j782k918n2K627k31J525J528
-10229e8631J167J170K538l20m261N15k617k616N44N44l50l51l50l50l377l377J394J394K109
-10210f5225K110p53p53K218K218K217K218K158K158k612k613l284l284L396L395j494j495
-10193e9425j495j494j12j08j12j08J200J204J200J204j483j480j483j480l51l46K512K516
$$ plain form
-10175 -59641 -59854 -60066 -60278 -60491 -61717 -62943 -61307 -59671 -57878 -56085 -57155 -58225 -60010 -61795 -58810 -55824 -57379 -58933
-10157 -58933 -57625 -56316 -54352 -52388 -53286 -54184 -53957 -53730 -53502 -53275 -53823 -54371 -54919 -55467 -55083 -54695 -54311 -53923 -54374 -54822 -55273
-10136 -55273 -55720 -56096 -56469 -56846 -57218 -58430 -59637 -60849 -62056 -62123 -62187 -61952 -61717 -63872 -61251 -58452 -60424 -61296 -59302 -61005
-10116 -61005 -59846 -58154 -59321 -58519 -57718 -58989 -57394 -55798 -57066 -55892 -54714 -52105 -52358 -51810 -51258 -51065 -50871 -51337 -54661
-10097 -54661 -55303 -53081 -50759 -51296 -50226 -49153 -47427 -48560 -49876 -48325 -49581 -53696 -52984 -52269 -54121 -53107 -51918 -53588
-10079 -53588 -59552 -62649 -60860 -59067 -59306 -59540 -59779 -60014 -59731 -59444 -57371 -58158 -59365 -57707 -57662 -57613 -60211 -59943 -56816 -56547
-10059 -56547 -57416 -58281 -59328 -60372 -58363 -56350 -52731 -51970 -53957 -55940 -56853 -54900 -54240 -53577 -55601 -57621 -54218 -50811
-10041 -50811 -50271 -49727 -49402 -49074 -48750 -48422 -46666 -44907 -46014 -47118 -48549 -49980 -53200 -53558 -49563 -48430 -48191 -47952 -51001
$$ packed form
-10175e9641k13k12k12k13j226j226J636J636J793J793j070j070j785j785K985K986j555j554
-10157e8933J308J309J964J964q98q98K27K27K28K27n48n48n48n48L84L88L84L88m51m48m51
-10136e5273m47l76l73l77l72j212j207j212j207o7o4K35K35k155K621K799j972q72J994j703
-10116f1005J159J692j167Q02Q01j271J595J596j268J174J178K609k53N48N52J93J94m66l324
-10097e4661o42K222K322n37J070J073J726j133j316J551j256m115P12P15j852J014J189j670
-10079e3588n964l097J789J793k39k34k39k35K83K87K073p87j207J658M5M9k598K68L127K69
-10059e6547q69q65j047j044K009K013L619P61j987j983r13J953O60O63k024k020L403L407
-10041e0811N40N44L25L28L24L28J756J759j107j104j431j431l220l58L995J133K39K39l049
$$ plain form
-10022 -51001 -51188 -50122 -49056 -51270 -53484 -57129 -57912 -59235 -57695 -54725 -51754 -51050 -50345 -49820 -49294 -48709 -50986 -51654 -52321
-10003 -52321 -50841 -49361 -52354 -52485 -49674 -46860 -48638 -50416 -51661 -52902 -51281 -49659 -50621 -51579 -52537 -53495 -50043 -46588
-9985 -46588 -45996 -48265 -54393 -55746 -57099 -58452 -55515 -52574 -49633 -46693 -42265 -37833 -40080 -42328 -43088 -43845 -44602 -45358
-9967 -45358 -46838 -48318 -49797 -51277 -50729 -50181 -49633 -49086 -48060 -47036 -46010 -44986 -45988 -46991 -47993 -48996 -48031 -47065
-9949 -47065 -46100 -45135 -49298 -53461 -54762 -56063 -58504 -60946 -56708 -52470 -52108 -51747 -51385 -51024 -47054 -43085 -43886 -44687 -46264
-9930 -46264 -47841 -49417 -50994 -49536 -48079 -46622 -45164 -44065 -42965 -41866 -40766 -43379 -45992 -48605 -51217 -50610 -50002
-9913 -50002 -49395 -48787 -50282 -51777 -53271 -54766 -54948 -55131 -55314 -55496 -56652 -57804 -58959 -60111 -58344 -56574 -57669 -58761
-9895 -58761 -59798 -60830 -61866 -62899 -59522 -56141 -52764 -49384 -51419 -53450 -52623 -51792 -51799 -51803 -51810 -51814 -50480 -49141 -52578 -56011
$$ packed form
-10022e1001j87J066J066k214k214l645p83j323J540K970K971P04P05N25N26N85k277o68o67
-10003e2321J480J480k993j31K811K814j778j778j245j241J621J622r62r58r58r58L452L455
-9985d6588N92k269o128j353j353j353K937K941K941K940M428M432k247k248p60p57p57p56
-9967d5358j480j480j479j480N48N48N48N47J026J024J026J024j002j003j002j003R65R66
-9949d7065R65R65m163m163j301j301k441k442M238M238L62L61L62L61L970L969q01q01j577
-9930d6264j577j576j577J458J457J457J458J099J100J099J100k613k613k613k612O07O08
-9913e0002O07O08j495j495j494j495j82j83j83j82j156j152j155j152J767J770j095j092
-9895e8761j037j032j036j033L377L381L377L380k035k031Q27Q31pmpmJ334J339l437l433
$$ plain form
-9875 -56011 -59537 -63059 -63722 -64382 -61896 -59410 -58355 -57300 -56633 -55966 -58638 -61311 -61210 -61110 -57669 -54229 -52995 -51762
-9857 -51762 -51959 -52157 -50576 -48996 -48847 -48698 -49950 -51203 -51024 -50845 -51173 -51501 -51829 -52157 -50576 -48996 -47416 -45835 -45097 -44359
-9837 -44359 -46961 -49559 -51445 -53331 -55217 -57099 -57107 -57114 -54736 -52354 -51676 -50998 -48888 -46775 -48426 -50077 -50297 -50513 -51478 -52444
-9817 -52444 -51024 -49600 -49671 -49742 -49812 -49879 -49443 -49007 -48571 -48131 -50189 -52246 -54304 -56357 -56149 -55940 -57162 -58381 -54743 -51106
-9797 -51106 -52716 -54322 -56410 -58497 -57244 -55988 -56264 -56536 -55377 -54218 -53957 -53692 -55813 -57934 -57181 -56424 -57099 -57774 -58392
-9778 -58392 -59007 -57237 -55467 -55418 -55366 -56745 -58124 -57956 -57785 -57613 -57442 -58944 -60442 -61941 -63439 -61840 -60237 -60066 -59895 -60879
-9758 -60879 -61863 -58553 -55239 -55508 -55776 -56044 -56309 -55549 -54788 -54028 -53264 -52831 -52399 -51967 -51531 -53622 -55713 -53510 -51303 -51158
-9738 -51158 -51012 -50867 -50718 -51422 -52127 -52831 -53532 -51255 -48977 -46700 -44419 -45720 -47021 -48321 -49618 -51039 -52459 -52448 -52433 -50901
$$ packed form
-9875e6011l526l522o63o60K486K486J055J055O67O67k672k673J01J00L441L440J234J233
-9857e1762j97j98J581J580J49J49j252j253J79J79l28l28l28l28J581J580J580J581P38P38
-9837d4359k602k598j886j886j886j882qpK378K382O78O78K110K113j651j651k20k16r65r66
-9817e2444J420J424p1p1p0o7M36M36M36M40k058k057k058k053K08K09j222j219L638L637
-9797e1106j610j606k088k087J253J256k76k72J159J159K61K65k121k121P53P57o75o75o18
-9778e8392o15J770J770M9N2j379j379J68J71J72J71j502j498j499j498J599J603J71J71r84
-9758f0879r84L310L314k69k68k68k65P60P61P60P64M33M32M32M36k091k091K203K207J45
-9738e1158J46J45J49p04p05p04p01K277K278K277K281j301j301j300j297j421j420J1J5J532
$$ plain form
-9718 -50901 -49369 -50222 -51072 -51419 -51765 -52112 -52455 -53883 -55310 -54352 -53394 -51303 -49212 -50461 -51709 -50752 -49794 -48836 -47878 -48411
-9698 -48411 -48944 -49477 -50010 -46927 -43845 -44102 -44359 -46197 -48034 -48441 -48847 -51847 -54848 -59637 -58702 -58005 -57308 -56253 -55198
-9679 -55198 -55884 -56566 -57248 -57930 -58020 -58105 -58191 -58277 -57845 -57408 -56972 -56536 -56104 -55668 -55232 -54796 -54606 -54412 -53860 -53308 -56249 -53461 -50673
-9656 -50673 -53610 -56864 -60114 -62291 -64468 -67006 -69541 -69690 -69839 -67871 -65899 -63927 -61956 -64311 -66663 -64721 -62779
-9639 -62779 -60342 -57900 -59753 -61605 -59883 -58158 -57863 -57569 -56935 -56298 -54229 -52160 -55224 -58284 -58005 -57725 -57375 -57021 -58098
-9620 -58098 -59175 -60047 -60916 -60353 -59790 -59526 -59261 -58996 -58728 -59089 -59451 -62675 -65895 -68225 -70555 -70022 -69485 -67103 -64721 -62340
-9600 -62340 -59954 -58560 -57166 -60543 -63916 -64788 -65661 -66533 -67401 -66246 -65090 -66797 -68501 -68777 -69052 -69328 -69600 -70685 -71766
-9581 -71766 -69988 -68206 -68039 -67867 -67342 -66812 -68501 -64460 -63644 -62824 -63141 -63454 -63771 -64084 -62481 -60875 -62135 -63391 -62027
$$ packed form
-9718e0901J532q53q50l47l46l47l43j428j427R58R58K091K091j249j248R57R58R58R58n33
-9698d8411n33n33n33L083L082k57k57j838j837m07m06l000l001m789R35O97O97J055J055
-9679e5198o86o82o82o82r0q5q6q6M32M37M36M36M32M36M36M36J90J94N52N52k941K788K788
-9656e0673k937l254l250k177k177k538k535j49j49J968J972J972J971k355k352J942J942
-9639f2779K437K442j853j852J722J725K95K94O34O37K069K069l064l060K79K80L50L54j077
-9620e8098j077q72q69N63N63K64K65K65K68l61l62l224l220k330k330N33N37K382K382K381
-9600f2340K386J394J394l377l373q72q73q72q68J155J156j707j704k76k75k76k72j085j081
-9581g1766J778J782J67J72N25N30j689M041Q16Q20l17l13l17l13J603J606j260j256J364
$$ plain form
-9562 -62027 -60659 -62157 -63652 -64375 -65094 -65817 -66537 -64815 -63089 -66138 -69183 -70271 -71356 -67673 -63987 -64539 -65087 -65638 -66186
-9543 -66186 -64949 -63708 -65333 -66954 -66313 -65668 -65027 -64382 -63614 -62843 -64938 -67029 -65187 -63342 -66272 -69198 -67267 -65333
-9525 -65333 -63402 -61467 -65321 -69172 -71475 -68050 -66138 -64226 -64818 -65411 -64632 -63853 -63074 -62295 -60770 -59246 -60584 -61922
-9507 -61922 -62962 -64002 -64684 -65366 -67368 -63644 -63141 -62638 -59809 -56980 -57013 -57047 -56782 -56518 -56253 -55988 -54889 -53789 -52690 -51590
-9487 -51590 -54825 -58057 -56816 -58437 -58989 -59537 -60442 -61348 -60834 -63178 -65344 -64647 -65743 -63972 -64706 -68303 -70022 -68874 -66652
-9468 -66652 -64431 -63227 -62019 -60811 -59604 -59063 -58519 -57975 -57431 -57725 -58016 -58307 -58597 -58937 -59272 -57997 -59585 -60398 -61210 -62202
-9448 -62202 -63193 -61952 -60707 -59462 -58217 -56495 -54773 -55914 -57054 -54069 -51083 -50185 -54054 -55183 -56309 -54874 -53435
-9431 -53435 -53543 -53651 -55549 -54580 -50752 -49783 -51799 -53812 -54900 -55988 -57077 -58165 -58299 -58433 -58568 -58702 -58351 -58001 -54967
$$ packed form
-9562f2027J368j498j495p23p19p23p20J722J726l049l045j088j085L683L686n52n48n51n48
-9543f6186J237J241j625j621O41O45O41O45P68P71k095k091J842J845k930k926J931J934
-9525f5333J931J935l854l851k303L425J912J912n92n93P79P79P79P79J525J524j338j338
-9507f1922j040j040o82o82k002L724N03N03K829K829l3l4K65K64K65K65J099J100J099J100
-9487e1590l235l232J241j621n52n48r05r06N14k344k166O97j096J771p34l597j719J148K222
-9468f6652K221J204J208J208J207N41N44N44N44k94k91k91k90l40l35J275j588q13q12r92
-9448f2202r91J241J245J245J245J722J722j141j140K985K986Q98l869j129j126J435J439
-9431e3435j08j08j898R69L828R69k016k013j088j088j089j088j34j34j35j34L51L50L034
$$ plain form
-9412 -54967 -51933 -51463 -53856 -54639 -55422 -57528 -59630 -60483 -58471 -57714 -56954 -57628 -55437 -55627 -55813 -56003 -56190 -54471 -55612 -58009
-9392 -58009 -60401 -59704 -59007 -58489 -57971 -57632 -60155 -58206 -56253 -55892 -55530 -56779 -55165 -55042 -54919 -54438 -53953 -51881 -46946 -41713
-9372 -41713 -31709 -19141 -9435 -4858 -6956 -8417 -14649 -21478 -28306 -37907 -47509 -53950 -57524 -60327 -63126 -63361 -63596
-9355 -63596 -62075 -60551 -61412 -62273 -63003 -63730 -62071 -60413 -59652 -58888 -58124 -57360 -56738 -56111 -55485 -54859 -55787 -56711 -57636 -58560 -58072
-9334 -58072 -57580 -57088 -56596 -56167 -55735 -56734 -57733 -59712 -61687 -60327 -58963 -57304 -55642 -53983 -52321 -53174 -54024 -54878 -55727 -56581
-9314 -56581 -57431 -58284 -59134 -61087 -63037 -64990 -66939 -68534 -70126 -71363 -72597 -73186 -68046 -66130 -64211 -64531 -64848 -65169 -65485
-9295 -65485 -60856 -56227 -53267 -56033 -59306 -56853 -57979 -59104 -59201 -59298 -59395 -59492 -63495 -67498 -68162 -68825 -66533 -64241 -61948
-9276 -61948 -59656 -59660 -59663 -59667 -59671 -59637 -59604 -59570 -59537 -59503 -59470 -59436 -59403 -59682 -59958 -60237 -60513 -59242 -57968 -56697 -55422 -54978 -54531 -54087 -53640 -54628
$$ packed form
-9412e4967L034M70k393p83p83k106k102q53K012P57P60o74K191j90j86j90j87J719j141k397
-9392e8009k392O97O97N18N18L39k523J949J953L61L62j249J614J23J23M81M85K072M935N233
-9372d1713J0004J2568R706M577k098j461o232o829o828r601r602o441l574k803k799k35k35
-9355f3596J521J524q61q61p30p27J659J658P61P64P64P64O22O27O26O26r28r24r25r24M88
-9334e8072M92M92M92M29M32r99r99j979j975J360J364J659J662J659J662q53q50q54q49q54
-9314e6581q50q53q50j953j950j953j949j595j592j237j234n89N140J916J919l20l17l21l16
-9295f5485M629M629K960k766l273K453j126j125r7r7r7r7m003m003o64o63K292K292K293
-9276f1948K292mlmmL4L3L4L3L4L3L4L3k79k76k79k76J271J274J271J275M44M47M44M47r88
$$ plain form
-9250 -54628 -55612 -54811 -54005 -55973 -52213 -48336 -44456 -44904 -45347 -45794 -46238 -45060 -43878 -41269 -38657 -37777 -36894 -42037 -47177
-9231 -47177 -50815 -51590 -53976 -56357 -57997 -59637 -60502 -58501 -55101 -51702 -48899 -48955 -52205 -55455 -60495 -62668 -63715 -64762
-9213 -64762 -60562 -56357 -54304 -55112 -55921 -53864 -54539 -55213 -56067 -54054 -52790 -54389 -56585 -58776 -60942 -63107 -60979 -58851
-9195 -58851 -59019 -59186 -59175 -62027 -63148 -64270 -65392 -66514 -66592 -63808 -62813 -61818 -60342 -61728 -61505 -61281 -58374 -55467 -56853
-9176 -56853 -58240 -57002 -55765 -56913 -58061 -56764 -55467 -55780 -56093 -58404 -63577 -65411 -64382 -63145 -61907 -58881 -58717 -60193
-9158 -60193 -61669 -59984 -58299 -59030 -59760 -58583 -60267 -62861 -60685 -58508 -61102 -63875 -63786 -65605 -67424 -65873 -64323 -64561
-9140 -64561 -61937 -60148 -61221 -60506 -59790 -60461 -61128 -60189 -62109 -61587 -61061 -60718 -60372 -60394 -60413 -60435 -60454 -60506 -60554 -58817 -59939 -62437
-9118 -62437 -62068 -63790 -60737 -59119 -57498 -58146 -58791 -58374 -60815 -61650 -62481 -62750 -63014 -63283 -63547 -62537 -61527 -63380 -65232
$$ packed form
-9250e4628r84Q01Q06j968L760L877L880m48m43m47m44J178J182K609K612Q80Q83n143n140
-9231d7177l638p75k386k381j640j640q65K001L400L399K803n6l250l250n040k173j047j047
-9213f4762M200M205K053q08q09K057o75o74q54K013J264j599k196k191k166k165K128K128
-9195e8851j68j67J1k852j121j122j122j122p8K784R95R95J476j386K23K24K907K907j386
-9176e6853j387J238J237j148j148J297J297l13l13k311n173j834J029J237J238L026J64j476
-9158f0193j476J685J685p31p30J177j684k594K176K177k594k773Q9j819j819J551J550k38
-9140f4561K624J789j073P15P16o71o67R39j920N22N26L43L46k2j9k2j9n2m8J737j122k498
-9118f2437L69j722L053J618J621o48o45M17k441q35q31k69k64k69k64J010J010j853j852
$$ plain form
-9099 -65232 -62314 -59395 -59339 -59283 -58214 -57144 -56074 -55004 -53756 -52507 -54121 -55735 -54121 -52507 -53756 -55004 -54166 -53327
-9081 -53327 -52489 -51650 -50155 -48661 -50028 -51396 -50319 -49242 -48165 -47088 -46894 -46696 -46502 -46305 -45753 -45198 -44646 -44091 -43301 -42507
-9061 -42507 -41717 -40923 -39477 -38027 -36581 -35131 -33435 -31735 -32902 -34065 -34217 -34366 -31657 -28943 -24072 -19197 -11462 -3725
-9043 -3725 -284 3159 9461 15768 22671 29574 41844 54118 69608 94641 128619 183592 262580 377827 535297
-9028 535297 721396 905225 1060428 1178896 1211491 1130024 974131 774345 565022 390045 262778 177733
-9016 177733 121317 84607 61256 41363 27200 20845 14490 8492 2499 -1 -2502 -7866 -13229 -17996 -22763
-9001 -22763 -24668 -26573 -27538 -28504 -29469 -30434 -32533 -34631 -36730 -38828 -41187 -43547 -45906 -48265 -50446 -52626 -51944 -51262
-8983 -51262 -50304 -49346 -48389 -47431 -46294 -45157 -44020 -42883 -42511 -42138 -41765 -41389 -42924 -44460 -45817 -42399 -35310 -28220 -23516
$$ packed form
-9099f5232K918K919N6N6J069J070J070J070J248J249j614j614J614J614j249j248Q38Q39
-9081e3327Q38Q39J495J494j367j368J077J077J077J077J94J98J94J97N52N55N52N55P90P94
-9061d2507P90P94J446J450J446J450J696J700j167j163j52j49K709K714M871M875P735P737
-9043c725L441L443O302O307O903O903J2270J2274J5490K5033L3978N4973P8988J15247J57470
-9028E35297J86099J83829J55203J18468L2595q1467j55893j99786k09323j74977j27267q5045
-9016A77733n6416l6710k3351j9893j4163o355o355n998n993k500k501n364n363m767m767
-9001b2763j905j905r65r66r65r65k099k098k099k098k359k360k359k359k181k180O82O82
-8983e1262R58R58R57R58J137J137J137J137L72L73L73L76j535j536j357L418P089P090M704
$$ plain form
-8964 -23516 -14038 -925 12186 25299 38415 49179 55173 54785 51539 41072 27744 15846 3953 -8063 -20080
-8949 -20080 -25119 -27292 -29469 -31646 -36804 -44821 -46298 -47770 -52287 -52030 -52552 -55933 -55977 -53156 -52067 -48113 -45593 -43070
-8931 -43070 -43174 -43275 -43379 -43480 -43163 -42846 -42529 -42212 -42611 -43010 -46271 -49533 -50230 -50927 -49059 -47192 -45384 -48348 -51191 -54035
-8911 -54035 -56264 -53718 -49387 -47915 -46387 -44855 -43506 -42153 -45440 -48724 -47240 -45753 -48265 -50774 -53107 -55437 -56335
-8894 -56335 -54371 -53838 -53305 -53666 -51165 -52839 -54512 -53950 -48616 -45966 -43316 -43051 -42786 -42522 -42257 -42458 -42656 -42854 -43051 -45399
-8874 -45399 -47744 -47226 -46707 -46491 -46271 -48914 -51557 -54620 -57681 -56924 -51396 -47736 -46935 -48996 -51057 -51751 -52440 -53130 -53819
-8855 -53819 -54289 -54755 -55042 -55329 -58303 -58411 -60129 -61848 -60763 -59675 -58586 -57498 -54799 -52101 -51311 -55291 -58210 -58262 -55452
-8836 -55452 -52641 -52634 -52626 -52619 -52611 -51266 -49917 -48567 -47218 -47419 -47621 -47822 -48023 -49413 -50800 -52187 -53573 -53648 -53722 -53797 -53871 -55135 -56398
$$ packed form
-8964b3516R478J3113J3111J3113J3116J0764N994l88l246j0467j3328j1898j1893j2016j2017
-8949b0080n039k173k177k177n158q017j477j472m517K57n22l381m4K821J089L954K520K523
-8931d3070j04j01j04j01L17L17L17L17l99l99l261l262o97o97J868J867J808k964k843k844
-8911e4035k229K546M331J472J528J532J349J353l287l284J484J487k512k509k333k330q98
-8894e6335J964N33N33l61K501j674j673N62N334K650K650K65K65K64K65k01j98j98j97k348
-8874d5399k345N18N19K16K20k643k643l063l061P57N528L660Q01k061k061o94o89o90o89
-8855e3819m70m66k87k87k974j08j718j719J085J088J089J088K699K698P90l980k919n2K810
-8836e5452K811PQPQJ345J349J350J349k01k02k01k01j390j387j387j386p5p4p5p4j264j263
$$ plain form
-8813 -56398 -57662 -58922 -58217 -57513 -59671 -61825 -59451 -57077 -54702 -52324 -51918 -51512 -51106 -50696 -52231 -53767 -55303 -56834
-8795 -56834 -53927 -51020 -49544 -48064 -50658 -53253 -52984 -52712 -49223 -45735 -48925 -52112 -52813 -53510 -52775 -52041 -49607 -47173
-8777 -47173 -44739 -42306 -40770 -39231 -42462 -45694 -44989 -44285 -45012 -45738 -48903 -52064 -53793 -55522 -54479 -53435 -50841 -53018
-8759 -53018 -56227 -54661 -53215 -51769 -53871 -55973 -55213 -54453 -53718 -52984 -55112 -57237 -56324 -55411 -57360 -59306 -59376 -59447 -59518 -59585
-8739 -59585 -57688 -55791 -56756 -57718 -59071 -60424 -58914 -57401 -56190 -54978 -53767 -52552 -54874 -57196 -56656 -56111 -55213 -54315
-8721 -54315 -56279 -58240 -58713 -59183 -59652 -60122 -61699 -63271 -61982 -60692 -62448 -64200 -64341 -64483 -62511 -57673 -56533 -60163
-8703 -60163 -61855 -63544 -65351 -62388 -61039 -59686 -58035 -56383 -58061 -59734 -61408 -63081 -63685 -64285 -64885 -65485 -64915 -64341
-8685 -64341 -63767 -63193 -60267 -57338 -52977 -48616 -44646 -40673 -33837 -27001 -25626 -24247 -25730 -27214 -29174 -31131 -28317
$$ packed form
-8813e6398j264j260P05P04k158k154K374K374K375K378M06M06M06M10j535j536j536j531
-8795e6834K907K907J476J480k594k595K69K72L489L488l190l187p01o97P35P34K434K434
-8777d7173K434K433J536J539l231l232P05P04p27p26l165l161j729j729J043J044K594k177
-8759e3018l209J566J446J446k102k102P60P60P35P34k128k125R13R13j949j946p0p1p1o7
-8739e9585J897J897r65r62j353j353J510J513J211J212J211J215k322k322N40N45Q98Q98
-8721e4315j964j961m73m70m69m70j577j572J289J290j756j752j41j42J972M838J140l630
-8703f0163j692j689j807K963J349J353J651J652j678j673j674j673o04o00o00o00N70N74
-8685f4341N74N74K926K929M361M361L970L973O836O836J375J379j483j484j960j957K814
$$ plain form
-8668 -28317 -25503 -18220 -10933 -7642 -9122 -11768 -14411 -20214 -28880 -37281 -40908 -44534 -48161 -50043 -51926 -52377 -52828
-8651 -52828 -52235 -51642 -55821 -59999 -58959 -57919 -59742 -61564 -60852 -60141 -57997 -55854 -54702 -53551 -52399 -51247 -51885 -52522
-8633 -52522 -50297 -48072 -48560 -49048 -48105 -47162 -47680 -48198 -48716 -49235 -49667 -50096 -50528 -50957 -54818 -58676 -59198 -62578 -65948 -64542
-8613 -64542 -61233 -57919 -53774 -49626 -50252 -50875 -52078 -53279 -53051 -52820 -53219 -53614 -51150 -48683 -44631 -40576 -43204 -45828
-8595 -45828 -47651 -49469 -48430 -47386 -43077 -38765 -30162 -21556 -14057 -6554 -1440 3677 6293 8914 8190 7471 3766
-8578 3766 65 -1850 -9487 -15898 -22305 -25734 -29160 -24120 -19077 -12607 -6132 -2524 1086 3263 5443 5235 5030 3390
-8560 3390 1753 2197 2641 4515 6394 7165 7937 10140 12346 15802 19257 22712 26171 33801 41430 46675 51922 55158
-8542 55158 58393 61628 64867 73023 81178 91719 102263 117634 133005 147244 158623 167554 170759 177841 179201
$$ packed form
-8668b8317K814P283P287L291j480k646k643n803q666q401l627l626l627j882j883m51m51
-8651e2828N93N93m179m178J040J040j823j822P12P11K144K143J152J151J152J152o38o37
-8633e2522K225K225m88m88R43R43n18n18n18n19m32m29m32m29l861l858n22l380l370J406
-8613f4542L309L314M145M148o26o23j203j201K28K31l99l95K464K467M052M055k628k624
-8595d5828j823j818J039J044M309M312Q603Q606P499P503N114N117K616K621p24p19l705
-8578C766l701j915p637o411o407l429l426N040N043O470O475L608L610K177K180k08k05j640
-8560C390j637M44M44J874J879P71P72K203K206L456L455L455L459P630P629N245N247L236
-8542E5158L235L235L239Q156Q155J0541J0544J5371J5371J4239J1379Q931L205P082J360
$$ plain form
-8527 179201 183972 188743 197987 216772 245129 276349 310133 338192 367577 402688 452172 515013 591661 671171
-8513 671171 754438 828164 906820 995018 1116136 1281146 1523981 1875593 2393233 3149417 4268190 5911763
-8501 5911763 8353508 11892561 16412095 20925903 24277042 24931665 22606167 18389486 13574532 9459948
-8491 9459948 6509580 4599272 3389095 2627383 2122402 1783451 1544929 1377015 1247086 1145787 1059277
-8480 1059277 986125 910473 821466 718921 613514 504167 408182 331937 280501 247906 228673 214092 199511
-8467 199511 181110 156987 128570 105878 83392 60905 43309 32395 29320 29108 31042 32981 31754 30528 27513
-8452 27513 27364 22977 15727 8835 4810 3364 4780 1604 -1567 -5458 -6487 -9125 -11761 -15935 -20110 -23509 -24042
-8435 -24042 -22581 -21120 -22641 -24157 -28023 -29022 -27993 -24102 -25701 -27296 -25373 -23449 -20859 -18265 -19308 -23215 -28079
$$ packed form
-8527A79201M771M771R244J8785K8357L1220L3784K8059K9385L5111M9484O2841P6648P9510
-8513F71171Q3267P3726P8656Q8198J21118J65010K42835L51612N17640P56184J118773J643573
-8501E911763K441745L539053M519534M513808L351139O54623k325498m216681m814954m114584
-8491I459948k950368j910308j210177p61712n04981l38951k38522j67914j29929j01299q6510
-8480A059277p3152p5652q9007j02545j05407j09347r5985p6245n1436l2595j9233j4581j4581
-8467A99511j8401k4123k8417k2692k2486k2487j7596j0914l075k12J934J939j227j226l015
-8452B7513j49m387p250o892m025j446J416l176l171l891j029k638k636m174m175l399n33
-8435b4042J461J461j521j516l866r99J029L891j599j595J923J924K590K594j043l907m864
$$ plain form
-8418 -28079 -32939 -41437 -52798 -63342 -71020 -77148 -83276 -83503 -83727 -85382 -84174 -78468 -69895 -62753 -55612 -49369 -43122
-8401 -43122 -38306 -33491 -34400 -35306 -33830 -32350 -35943 -39533 -42171 -41944 -43569 -42328 -38407 -34482 -32052 -32481 -36253 -37158
-8383 -37158 -36655 -36148 -34870 -30725 -26226 -24586 -24500 -24411 -27784 -31154 -39596 -48034 -52481 -54061 -55645 -52455 -51340 -50226
-8365 -50226 -52809 -52530 -52608 -52686 -52585 -52485 -51288 -50092 -48895 -47699 -46502 -45306 -44289 -43271 -41858 -43308 -42969 -42630 -44467
-8346 -44467 -43442 -45817 -45328 -44475 -46484 -49745 -53007 -54866 -51955 -47613 -48042 -44743 -41445 -41784 -42123 -46935 -51747 -57990
-8328 -57990 -64233 -65273 -66313 -63059 -59805 -59980 -60155 -60331 -60506 -64263 -68020 -70584 -64561 -57077 -52455 -52962 -56331 -58717
-8310 -58717 -58240 -58120 -53230 -48608 -46849 -48131 -46551 -46201 -45850 -45023 -44195 -45366 -41765 -39059 -39216 -37747 -33416 -30874 -28332
-8291 -28332 -28384 -28436 -31530 -34624 -38295 -37195 -37169 -40006 -41679 -43353 -43774 -39424 -34657 -32753 -31862 -30971 -31690 -25730 -25257 -27646
$$ packed form
-8418b8079m860q498j1361j0544p678o128o128k27k24j655J208N706Q573P142P141O243O247
-8401d3122M816M815r09r06J476J480l593l590k638K27j625J241L921L925K430m29l772r05
-8383c7158N03N07J278M145M499J640Q6Q9l373l370q442q438m447j580j584L190J115J114
-8365e0226k583K79p8p8J01J00J197J196J197J196J197J196J017J018J413j450L39L39j837
-8346d4467J025k375M89Q53k009l261l262j859K911M342m29L299L298l39l39m812m812o243
-8328e7990o243j040j040L254L254j75j75j76j75l757l757k564O023P484M622n07l369k386
-8310e8717M77J20M890M622J759j282J580L50L51Q27Q28j171L601K706j57J469M331K542K542
-8291b8332n2n2l094l094l671J100K6k837j673j674m21M350M767J904Q91Q91p19N960M73k389
$$ plain form
-8271 -27646 -31016 -34381 -36316 -33479 -32108 -30732 -29059 -27385 -26573 -25757 -22555 -19353 -17199 -15041 -9543 -4045 158
-8254 158 4366 3625 2883 3121 8135 10464 12794 16126 19462 29000 41400 47804 49440 46544 50327 50450 45802 41274
-8236 41274 45336 52198 65739 81368 103679 115581 127482 136938 154985 180782 215166 246449 280598 307975
-8222 307975 342031 385509 450938 526083 617450 732552 909679 1167565 1563807 2145876 3022791 4323477
-8210 4323477 6319761 9324018 13111662 14984055 13076942 9535674 6384668 4156767 2746604 1939602
-8200 1939602 1459883 1147829 928334 782072 682565 615079 561910 522695 480618 444691 405905 354118
-8188 354118 295652 242431 195892 156748 122375 98450 81208 75952 70697 66928 58393 49202 40010 35444 30882
-8173 30882 24054 10546 -1384 -10449 -11701 -12953 -12286 -14478 -13449 -15283 -16136 -16986 -16763 -21310 -23136 -24959 -23919
$$ packed form
-8271b7646l370l365j935K837J371J376J673J674Q12Q16L202L202K154K158N498N498M203
-8254A58M208p41p42K38N014K329K330L332L336R538J2400O404J636k896L783J23m648m528
-8236D1274M062O862J3541J5629K2311J1902J1901R456J8047K5797L4384L1283L4149K7377
-8222C07975L4056M3478O5429P5145R1367J15102J77127K57886L96242N82069Q76915J300686
-8210D323477J996284L004257L787644J872393j907113l541268l151006k227901j410163q07002
-8200A939602m79719l12054k19495j46262r9507o7486n3169l9215m2077l5927l8786n1787
-8188C54118n8466n3221m6539l9144l4373k3925j7242n256n255l769q535r191r192m566m562
-8173C0882o828j3508j1930r065j252j252O67k192J029j834q53q50K23m547j826j823J040
$$ plain form
-8156 -23919 -22879 -23334 -26647 -29782 -32917 -33535 -34150 -39834 -40748 -41009 -41266 -40092 -38918 -38996 -43845 -45235 -43759 -41273 -38787
-8137 -38787 -37553 -36316 -34918 -33520 -33733 -33942 -37434 -43789 -49965 -56137 -59753 -63368 -69846 -73458 -73406 -70491 -67398 -67163
-8119 -67163 -67073 -66984 -62779 -58571 -52846 -47121 -45988 -47714 -49917 -52116 -50204 -48288 -50133 -51974 -52388 -52798 -53398 -53994 -56801
-8100 -56801 -59604 -60353 -58236 -57733 -57226 -59123 -61016 -61184 -58486 -50632 -42775 -40945 -39111 -38742 -38370 -41340 -44307 -40509
-8082 -40509 -36707 -34340 -31970 -31284 -30598 -32775 -34948 -37602 -40256 -44341 -48422 -45470 -42518 -44337 -46152 -44572 -42991
-8065 -42991 -42842 -42689 -43763 -44836 -46089 -47337 -48679 -52884 -55299 -52939 -48795 -44650 -44978 -45302 -46525 -47747 -48970 -50189
-8047 -50189 -50561 -50934 -48444 -45955 -43823 -41691 -40990 -40289 -42645 -45000 -45925 -46849 -48787 -50725 -49801 -48877 -50621 -52365 -52559
-8028 -52559 -49891 -44091 -33520 -20564 -4746 9670 21225 32958 44692 52340 57126 55113 42604 27352 12104
$$ packed form
-8156b3919J040m55l313l135l135o18o15n684r14k61k57J174J174p8m849j390J476K486K486
-8137c8787J234J237J398J398k13k09l492o355o176o172l616l615o478l612N2K915L093K35
-8119f7163R0Q9M205M208N725N725J133j726k203k199J912J916j845j841m14m10o00n96k807
-8100e6801k803p49K117N03N07j897j893j68K698P854P857J830J834L69L72k970k967L798
-8082d0509L802K367K370O86O86k177k173k654k654m085m081K952K952j819j815J580J581
-8065d2991J49J53j074j073j253j248j342m205k415K360M144M145l28l24j223j222j223j219
-8047e0189l72l73K490K489K132K132P01P01k356k355r25r24j938j938R24R24j744j744j94
-8028e2559K668N800J0571J2956J5818J4416J1555J1733J1734P648M786k013j2509j5252j5248
$$ plain form
-8013 12104 -1712 -10758 -18138 -25514 -32592 -39670 -44337 -49000 -50800 -52600 -51422 -50241 -51922 -53603 -52489 -51370 -50252
-7996 -50252 -49134 -47185 -45231 -46141 -47050 -47308 -47561 -47814 -48068 -47669 -47267 -49727 -52187 -54285 -56383 -53711 -51039 -49768 -48497
-7977 -48497 -51698 -54900 -56954 -54237 -52772 -51307 -52615 -53923 -52369 -50815 -49626 -48437 -47248 -46059 -46003 -45947 -45891 -45835 -47673
-7958 -47673 -49510 -51348 -53186 -53145 -53103 -53062 -53021 -53130 -53238 -53525 -50945 -48489 -46033 -46260 -46484 -48351 -50219 -50476 -50729 -52269 -50945
-7937 -50945 -51232 -51516 -50811 -50107 -49402 -48694 -48825 -48955 -49086 -49212 -49447 -49682 -51825 -51102 -48743 -51154 -53685 -51441 -48154 -49637
-7917 -49637 -49391 -49141 -47911 -43819 -42589 -44218 -43584 -42950 -45179 -47404 -49633 -49000 -48366 -50591 -53383 -56175 -58966 -61754
-7899 -61754 -62459 -60301 -59753 -59201 -60025 -60849 -61672 -62492 -61289 -60085 -58702 -57315 -56380 -52582 -48784 -47848 -47688 -47527 -49335 -48280
-7879 -48280 -48463 -51508 -54374 -54378 -54173 -53968 -52153 -50338 -46577 -42816 -40308 -40662 -42119 -43577 -45213 -46849 -46741 -46633 -46525
$$ packed form
-8013A2104j3816r046p380p376p078p078m667m663j800j800J178J181j681j681J114J119J118
-7996e0252J118J949J954r10r09k58k53k53k54L99M02k460k460k098k098K672K672J271J271
-7977d8497l201l202k054K717J465J465j308j308J554J554J189J189J189J189N6N6N6N6j838
-7958d7673j837j838j838M1M2M1M1j09j08k87K580K456K456k27k24j867j868k57k53j540J324
-7937e0945k87k84P05P04P05P08j31j30j31j26k35k35k143P23K359k411k531K244L287j483
-7917d9637K46K50J230M092J230j629O34O34k229k225k229O33O34k225k792k792k791k788
-7899f1754p05K158N48N52q24q24q23q20J203J204J383J387R35L798L798R36J60J61j808J055
-7879d8280j83l045k866mK05K05J815J815L761L761K508l54j457j458j636j636J08J08J08
$$ plain form
-7860 -46525 -46417 -46309 -46201 -48776 -51352 -55146 -56074 -55575 -55071 -56719 -55500 -54285 -55929 -59082 -62232 -64490 -63883 -61192 -61359
-7841 -61359 -64513 -67662 -67398 -67129 -65612 -61229 -58489 -55746 -57121 -53722 -48031 -45198 -45231 -45261 -44818 -44371 -45358 -46342 -47762
-7822 -47762 -49179 -50595 -52011 -50599 -49182 -49197 -49212 -49723 -50230 -53122 -56014 -56078 -56137 -52679 -49220 -49678 -47270 -46473 -45675 -50278
-7802 -50278 -54878 -55959 -57039 -57915 -55925 -51430 -46935 -47632 -51188 -52358 -50666 -46748 -42831 -39510 -39052 -40174 -41295 -42596
-7784 -42596 -43897 -45839 -47781 -48172 -45701 -43290 -43741 -44192 -41780 -41814 -44710 -48023 -51337 -50207 -46215 -43834 -41452 -42827
-7766 -42827 -44203 -43789 -46238 -49015 -48929 -47293 -45656 -47609 -49559 -49723 -52746 -57084 -58556 -58482 -58404 -57002 -55597 -54196 -52790
-7747 -52790 -48675 -44557 -39190 -38589 -39641 -40688 -40129 -36704 -32894 -26219 -19547 -15734 -13460 -14045 -18451 -22853 -28660 -34463
-7729 -34463 -40271 -46074 -47509 -48940 -50375 -51806 -52466 -53122 -50442 -47759 -46391 -45019 -43472 -44784 -47173 -49559 -52127
$$ packed form
-7860d6525J08J08J08k575k576l794r28M99N04j648J219J215j644l153l150k258O07K691j67
-7841f1359l154l149K64K69J517M383K740K743j375L399N691K833l3l0M43M47r87r84j420
-7822d7762j417j416j416J412J417j5j5n11n07k892k892o4n9L458L459m58K408P97P98m603
-7802e0278m600j081j080q76J990M495M495o97l556j170J692L918L917L321M58j122j121j301
-7784d2596j301j942j942l91K471K411m51m51K412l4k896l313l314J130L992K381K382j375
-7766d2827j376M14k449k777Q6J636J637j953j950j64l023m338j472P4P8J402J405J401J406
-7747e2790M115M118N367O01j052j047N59L425L810O675O672L813K274n85m406m402n807n803
-7729c4463n808n803j435j431j435j431o60o56K680K683J368J372J547j312k389k386k568
$$ plain form
-7712 -52127 -54691 -55004 -55314 -55627 -55936 -57323 -58706 -60092 -61475 -60275 -59071 -59481 -57025 -56391 -55754 -54941 -54125 -53920 -53715 -56849
-7692 -56849 -59980 -60014 -60047 -60081 -60111 -56201 -52291 -53629 -54963 -57017 -59071 -57785 -56495 -57364 -58232 -59101 -59965 -57882 -55798 -53715
-7672 -53715 -51627 -51370 -51113 -50856 -50595 -51978 -53361 -54743 -56123 -56898 -57673 -59880 -62082 -61069 -60055 -63335 -66611 -65411
-7654 -65411 -64211 -63011 -61807 -58728 -55649 -54956 -54259 -50901 -47542 -48478 -49410 -51866 -54322 -55347 -56369 -57736 -59104 -60472
-7636 -60472 -61836 -60998 -60159 -59321 -58478 -57051 -55623 -56581 -57535 -55750 -53964 -49794 -45619 -47293 -48966 -50640 -52310 -56607
-7618 -56607 -60905 -60908 -60908 -59235 -57561 -55888 -54210 -52895 -51579 -50263 -48944 -51788 -54632 -54136 -53636 -53946 -54255 -54565 -54870 -53521
-7598 -53521 -52172 -50822 -49473 -50390 -51307 -49838 -48370 -52000 -55631 -56875 -58120 -56533 -54945 -50971 -46998 -47192 -47386 -47580
-7580 -47580 -47774 -48325 -48877 -47043 -45209 -46745 -48280 -49816 -51352 -52261 -53171 -49786 -46402 -45805 -45205 -46037 -46868 -49999 -53126
$$ packed form
-7712e2127k564l13l10l13l09j387j383j386j383J200J204m10K456O34O37Q13Q16K05K05l134
-7692e6849l131l4l3l4l0L910L910j338j334k054k054J286J290q69q68q69q64K083K084K083
-7672e3715K088K57K57K57K61j383j383j382j380p75p75k207k202J013J014l280l276J200
-7654f5411J200J200J204L079L079O93O97L358L359r36r32k456k456j025j022j367j368j368
-7636f0472j364Q38Q39Q38Q43J427J428r58r54J785J786M170M175j674j673j674j670m297
-7618e6607m298l%J673J674J673J678J315J316J316J319k844k844M96N00l10l09l10l05J349
-7598e3521J349J350J349r17r17J469J468l630l631j244j245J587J588L974L973j94j94j94
-7580d7580j94n51n52J834J834j536j535j536j536r09r10L385L384N97O00q32q31l131l127
$$ plain form
-7561 -53126 -51482 -49838 -49801 -49760 -51150 -52541 -52831 -53118 -53405 -53692 -52649 -51601 -50554 -49507 -49536 -49563 -49589 -49615 -47729 -45839 -43949
-7540 -43949 -42060 -41068 -40073 -39078 -38083 -39272 -40461 -42007 -37825 -33051 -28276 -23144 -18008 -11190 -4373 4351 18806 35284
-7522 35284 57487 83507 109531 141001 172470 203581 234697 262528 284635 298511 302850 293021 273650 248197
-7508 248197 213205 176421 139636 109531 79430 52642 35400 23282 11169 95 -10974 -17277 -23576 -23945
-7494 -23945 -24310 -26111 -27907 -30244 -32577 -33483 -34385 -35872 -37356 -38843 -40326 -38265 -36200 -35690 -40900 -40807 -40710 -43837 -46961
-7475 -46961 -47554 -48142 -47304 -46461 -48884 -51307 -53730 -56149 -57289 -58430 -56708 -54982 -54781 -54580 -61057 -67532 -68851 -70171
-7457 -70171 -68628 -67081 -64419 -61758 -57666 -53569 -54456 -55344 -53368 -51389 -52768 -54147 -52306 -56186 -59801 -63417 -67390
-7440 -67390 -71360 -71826 -72288 -71319 -70350 -67327 -64300 -64136 -63972 -64408 -64841 -68016 -74054 -81528 -82318 -80365 -78412 -77118 -75821
$$ packed form
-7561e3126J644J644L7M1j390j391k90k87k87k87J043J048J047J047k9k7k6k6J886J890J890
-7540d3949J889R92R95R95R95j189j189j546M182M774M775N132N136O818O817Q724J4455J6478
-7522C5284K2203K6020K6024L1470L1469L1111L1116K7831K2107J3876M339r829j9371k5453
-7508B48197l4992l6784l6785l0105l0101k6788j7242j2118j2113j1074j1069o303o299l69
-7494b3945l65j801j796k337k333r06r02j487j484j487j483K061K065N10n210R3R7l127l124
-7475d6961n93n88Q38Q43k423k423k423k419j140j141J722J726K01K01o477o475j319j320
-7457g0171J543J547K662K661M092M097q87q88J976J979j379j379J841l880l615l616l973
-7440f7390l970m66m62R69R69L023L027J64J64m36m33l175o038p474p90J953J953J294J297
$$ plain form
-7421 -75821 -79295 -82769 -79925 -77077 -71367 -65657 -62127 -58594 -59831 -61069 -60700 -60327 -59954 -59581 -56294 -53003 -52578 -52149
-7403 -52149 -55243 -58333 -54747 -51158 -49645 -48128 -51385 -54639 -56346 -58050 -54986 -51918 -47863 -43804 -46428 -49048 -56622
-7386 -56622 -64192 -66995 -69794 -66887 -63976 -61069 -58158 -57874 -57587 -59988 -57613 -51937 -46257 -40282 -34303 -26122 -17937
-7369 -17937 -12678 -14094 -18347 -22596 -27266 -27162 -27985 -31668 -33625 -32715 -33957 -35194 -31485 -27773 -22424 -17072 -8861 -646
-7351 -646 7147 14944 22738 30535 33350 36167 40115 44065 42202 35571 26551 14672 5771 -3125 -10773 -18418 -23949
-7334 -23949 -29476 -32145 -34810 -32082 -29350 -23759 -18164 -17557 -16945 -19200 -21452 -28418 -35380 -35667 -35951 -40099 -44244 -48392
-7316 -48392 -52537 -50424 -48307 -46193 -44076 -46372 -48668 -50964 -53256 -53554 -53853 -54151 -54445 -57531 -60618 -60364 -60107 -59019
-7298 -59019 -57930 -56842 -55750 -56715 -57681 -58706 -54002 -48675 -46212 -44166 -42116 -46540 -50964 -51095 -51221 -50189 -49156 -44784
$$ packed form
-7421g5821l474l474K844K848N710N710L530L533j237j238L69L73L73L73L287L291M25M29
-7403e2149l094l090L586L589J513J517l257l254j707j704L064L068M055M059k624k620p574
-7386e6622p570k803k799K907K911K907K911K84K87k401K375N676N680N975N979Q181Q185
-7369a7937N259j416m253m249m670J04q23l683j957R10j242j237L709L712N349N352Q211Q215
-7351f46P793P797P794P797K815K817L948L950j863o631r020j1879q901q896p648p645n531
-7334b3949n527k669k665K728K732N591N595O07O12k255k252o966o962k87k84m148m145m148
-7316d8392m145K113K117K114K117k296k296k296k292k98k99k98k94l086l087K54K57J088
-7298e9019J089J088J092r65r66j025M704N327K463K046K050m424m424j31j26J032J033M372
$$ plain form
-7280 -44784 -40408 -39234 -38060 -36886 -35712 -36894 -38075 -36871 -35667 -34501 -33334 -34553 -35772 -36841 -37911 -36953 -35995
-7263 -35995 -34859 -39447 -40815 -42183 -42268 -42354 -44825 -47296 -46599 -45902 -48545 -51188 -51922 -52656 -50349 -45179 -38302 -25697 -9692
-7244 -9692 12037 38981 60204 69739 65915 55736 39835 23100 12089 1582 -8920 -15726 -22532 -25302 -28067
-7229 -28067 -33219 -38370 -45135 -51896 -49592 -47289 -42097 -36901 -31288 -22812 -17680 -18268 -18798 -19327 -21049 -22771 -20199 -17624
-7211 -17624 -18093 -18563 -23147 -27728 -29465 -28340 -22383 -10698 -150 4672 6215 10624 11459 12294 11877 11463 11642 11821
-7193 11821 7706 3595 3207 2819 -2219 -7254 -16647 -31765 -50222 -68676 -83503 -88785 -85836 -73346 -54330 -29584
-7177 -29584 -4601 14657 27457 34535 35411 36287 35877 35470 36495 37520 40077 42638 43409 44181 42683 35463 26812 23886
-7159 23886 29753 35623 44237 62392 91994 131142 173927 213850 248521 277467 296812 306614 310006 307673 299257
$$ packed form
-7280d4784M376J174J174J174J174j182j181J204J204J166J167j219j219j069j070R58R58
-7263c5995J136m588j368j368q5q6k471k471O97O97k643k643p34p34K307N170O877J2605J6005
-7244i692K1729K6944K1223R535l824j0179j5901j6735j1011j0507j0502o806o806k770k765
-7229b8067n152n151o765o761K304K303N192N196N613Q476N132n88n30n29j722j722K572K575
-7211a7624m69m70m584m581j737J125N957J1685J0548M822J543M409Q35Q35m17m14J79J79
-7193A1821m115m111l88l88n038n035r393j5118j8457j8454j4827n282K949J2490J9016K4746
-7177b9584K4983J9258J2800P078Q76Q76m10m07J025J025K557K561P71P72j498p220q651k926
-7159B3886N867N870Q614J8155K9602L9148M2785L9923L4671K8946J9345R802L392k333q416
$$ plain form
-7144 299257 285115 265696 246277 228468 207797 191091 180111 175511 180454 194830 214931 231812 245830 261309
-7130 261309 279651 299067 312757 318933 319384 318344 320167 328460 346295 365144 383992 398275 412558 431731 456633
-7115 456633 480100 503567 531685 559808 591549 623290 650142 676997 706532 741791 784566 836885 896503
-7102 896503 961846 1031482 1110664 1190499 1260791 1311762 1353194 1395637 1443804 1495788 1561135 1650392 1775907
-7089 1775907 1942274 2144903 2369784 2597528 2823065 3061961 3340514 3670593 4047428 4449071 4866562
-7078 4866562 5324129 5870435 6559868 7438944 8529849 9868125 11574714 13869748 17040720 21463099
-7068 21463099 27623999 36154544 47816714 63268883 82077864 100399936 110105779 105408005 89479526
-7059 89479526 70002485 52470058 38917998 29306705 22725987 18192943 15008872 12750360 11150197
$$ packed form
-7144B99257j4142j9419j9419j7809k0671j6706j0980m600M943J4376K0101J6881J4018J5479
-7130B61309J8342J9416J3690O176M51j040J823Q293J7835J8849J8848J4283J4283J9173K4902
-7115D56633K3467K3467K8118K8123L1741L1741K6852K6855K9535L5259M2775N2319N9618
-7102H96503O5343O9636P9182P9835P0292N0971M1432M2443M8167N1984O5347Q9257J25515
-7089A775907J66367K02629K24881K27744K25537K38896K78553L30079L76835M01643M17491
-7078D866562M57567N46306O89433Q79076J090905J338276J706589K295034L170972M422379
-7068B1463099O160900Q530545J1662170J5452169J8808981J8322072R705843m697774j5928479
-7059H9479526j9477041j7532427j3552060r611293o580718m533044l184071k258512j600163
$$ plain form
-7050 11150197 9998501 9108966 8339661 7620596 6907257 6198211 5529244 4925994 4393352 3909135 3457364
-7039 3457364 3048527 2698854 2417643 2210857 2056041 1922221 1786970 1645993 1511469 1394123 1303018
-7028 1303018 1240537 1204920 1197931 1207641 1200175 1144262 1048277 939650 840564 760081 692961 635740 578518 523217
-7014 523217 477461 448821 429722 416136 405417 390463 378372 369266 357301 342236 324308 309715 297989 288768
-7000 288768 276684 257709 235874 211893 197454 190555 189384 187558 182869 178083 179026 184915 196533 204271 198654
-6985 198654 187726 171076 153095 132256 106344 80436 54822 34937 19700 10192 4281 7915 15660 32951
-6971 32951 62105 94126 125130 150412 166297 176462 180539 184621 180916 171490 161165 160386 162507 161769 156916 152063
-6955 152063 152723 159111 161027 160080 159711 159346 167747 185690 209921 234156 258808 280598 300207 314095 316592 305731
$$ packed form
-7050A1150197j151696q89535p69305p19065p13339p09046o68967o03250n32642m84217m51771
-7039C457364m08837l49673k81211k06786j54816j33820j35251j40977j34524j17346r1105
-7028A303018o2481l5617o989R710p466n5913r5985j08627r9086q0483o7120n7221n7222n5301
-7014E23217m5756k8640j9099j3586j0719j4954j2091r106j1965j5065j7928j4593j1726r221
-7000B88768j2084j8975k1835k3981j4439o899j171j826m689m786R43N889J1618P738n617
-6985A98654j0928j6650j7981k0839k5912k5908k5614j9885j5237r508n911L634P745J7291
-6971C2951K9154L2021L1004K5282J5885J0165M077M082l705r426j0325p79K121p38m853m853
-6955A52063O60O388J916r47l69l65Q401J7943K4231K4235K4652K1790J9609J3888K497j0861
$$ plain form
-6939 305731 289588 273449 260053 256199 260571 270672 283218 298627 316238 333853 344968 356083 365080 374078
-6925 374078 386534 398991 414429 439409 473812 521573 585019 654189 717874 775833 834865 899623 977262
-6912 977262 1072076 1180279 1294206 1416483 1559752 1734986 1946478 2209020 2542170 2974824 3562055
-6901 3562055 4389979 5551865 7182374 9463634 12627751 16892990 22206351 27536888 30552108 29439540
-6891 29439540 24955609 19359109 14327243 10469020 7762400 5927906 4672360 3796579 3185102 2770190
-6881 2770190 2488684 2289238 2122208 1958044 1785471 1607174 1434777 1279558 1144616 1023033 911270
-6870 911270 809054 721388 647082 589082 544444 506962 466618 422342 375203 329675 287009 245863 210443
-6857 210443 183193 165485 156021 152283 148783 145283 141068 136852 127866 118879 106531 94182 86784 79385 75147 73772
$$ packed form
-6939C05731j6143j6139j3396l854M372J0101J2546J5409J7611J7615J1115J1115Q997Q998
-6925C74078J2456J2457J5438K4980L4403M7761O3446O9170O3685N7959N9032O4758P7639
-6912I77262R4814J08203J13927J22277J43269J75234K11492K62542L33150M32654N87231
-6901C562055Q27924J161886J630509K281260L164117M265239N313361N330537L015220j112568
-6891B9439540m483931n596500n031866l858223k706620j834494j255546q75781o11477m14912
-6881B770190k81506j99446j67030j64164j72573j78297j72397j55219j34942j21583j11763
-6870I11270j02216q7666p4306n8000m4638l7482m0344m4276m7139m5528m2666m1146l5420
-6857B10443k7250j7708r464l738l500l500m215m216q986q987j2348j2349p398p399m238j375
$$ plain form
-6841 73772 71502 63507 56824 55866 58009 60152 62892 65631 71233 76836 85621 94406 109513 124619 140561 150777
-6825 150777 149543 138768 122461 106154 95930 85706 77093 68479 55094 41710 30487 19264 8041 -3180
-6811 -3180 -13509 -23837 -31303 -38768 -39644 -40520 -36029 -25812 -13539 -1265 11008 23282 27770 26536 23569 23469
-6795 23469 28672 33879 36279 32958 30647 28340 22451 22291 26927 31568 39186 52534 73250 103512 142834 191703
-6779 191703 234246 244350 221770 182019 143859 111428 87223 68747 49254 29764 12835 1634 -10348
-6766 -10348 -19465 -20773 -22078 -22849 -23617 -22957 -22294 -21038 -19778 -20907 -22033 -23938 -25839 -27206 -31433 -32749 -28336 -23330
-6748 -23330 -21183 -22439 -23692 -25127 -26558 -21821 -17079 -12342 -7601 -7694 -7784 -13125 -18462 -22797 -27128 -28120 -29111 -27542
-6730 -27542 -25969 -28690 -31411 -36998 -42581 -42559 -42537 -38284 -28302 -17128 -5954 1668 -4064 -14985 -25906 -35697 -42622
$$ packed form
-6841G3772k270p995o683r58K143K143K740K739N602N603Q785Q785J5107J5106J5942J0216
-6825A50777j234j0775j6307j6307j0224j0224q613q614j3385j3384j1223j1223j1223j1221
-6811c180j0329j0328p466p465q76q76M491J0217J2273J2274J2273J2274M488j234k967j00
-6795B3469N203N207K400l321k311k307n889j60M636M641P618J3348K0716L0262L9322M8869
-6779A91703M2543J0104k2580l9751l8160l2431k4205j8476j9493j9490j6929j1201j1982
-6766a0348r117j308j305p71p68O60O63J256J260j129j126j905j901j367m227j316M413N006
-6748b3330K147j256j253j435j431M737M742M737M741r3r0n341n337m335m331r92r91J569
-6730b7542J573k721k721n587n583K2K2M253R982J1174J1174P622n732j0921j0921r791o925
$$ plain form
-6713 -42622 -42093 -32022 -20255 -14209 -13710 -16073 -18619 -21161 -25313 -29465 -30718 -31970 -31791 -31612 -27766 -23919 -20251
-6696 -20251 -19446 -20162 -26603 -32864 -33401 -23114 -7102 18690 50208 77246 90925 84208 64133 43640 23148
-6681 23148 9931 2439 -4768 -6252 -9166 -12081 -8853 -5626 -5737 -5849 -10568 -15283 -18567 -21850 -22752 -23651 -24131 -31292
-6663 -31292 -35623 -39950 -44993 -45265 -42708 -40148 -37468 -34788 -29294 -26659 -26707 -31526 -37035 -39678 -41843 -44009 -44657 -45302
-6645 -45302 -47378 -49454 -52816 -56175 -56193 -56212 -56026 -55839 -55653 -55463 -54620 -53778 -50550 -47319 -48042 -48765 -49488 -50207 -47412 -44616
-6625 -44616 -41821 -39022 -36976 -34929 -38131 -41329 -37643 -33957 -34564 -35168 -33807 -32447 -27747 -23043 -23949 -24854 -20512 -16166
-6607 -16166 -6259 3651 19048 41125 68923 99587 136513 176301 214998 253698 287329 312373 326022 323454
-6593 323454 309078 282298 251328 217499 179555 141612 106706 76575 50439 27166 10032 -4235 -13553 -18101
$$ packed form
-6713d2622N29J0071J1767O046M99k363k546k542m152m152j253j252J79J79L846L847L668
-6696b0251Q05p16o441o261n37J0287J6012K5792L1518K7038J3679o717k0075k0493k0492
-6681B3148j3217p492p207j484k914k915L228L227j11j12m719m715l284l283r02q99m80p161
-6663c1292m331m327n043k72K557K560K680K680N494K635m8m819n509k643k165k166o48o45
-6645d5302k076k076l362l359j8j9J86J87J86J90Q43Q42L228L231p23p23p23p19K795K796
-6625d4616K795K799K046K047l202l198L686L686o07o04J361J360M700M704r06r05M342M346
-6607a6166R907R910J5397K2077K7798L0664L6926L9788L8697L8700L3631K5044J3649k568
-6593C23454j4376k6780l0970l3829l7944l7943l4906l0131k6136k3273j7134j4267r318m548
$$ plain form
-6579 -18101 -21042 -23979 -26916 -29853 -34176 -43271 -51113 -56093 -61311 -63667 -62205 -60744 -56421 -52097 -50040 -52753 -51143
-6562 -51143 -44762 -38679 -37367 -32193 -27020 -25484 -23949 -23815 -23680 -25455 -24366 -27080 -34564 -39186 -43808 -48817 -53827
-6545 -53827 -56451 -59075 -61810 -64546 -64419 -64293 -61065 -57837 -51568 -48161 -41594 -35026 -31798 -31433 -33006 -34579 -31560 -28541
-6527 -28541 -26744 -24948 -28220 -34355 -37509 -40662 -43517 -41601 -32782 -19193 -117 16096 22649 22522 17266 9148
-6511 9148 1485 -3311 -6740 -7303 -2442 2421 2093 -6818 -18254 -24914 -29730 -31679 -30114 -28545 -26562 -29346 -29063 -22096
-6493 -22096 -11794 3282 19667 29376 33596 33048 26145 22108 21646 25958 30535 28437 27528 29484 36536 46451 57797
-6476 57797 69146 79866 90585 100888 111194 120542 123210 123195 116505 107932 104130 110526 125514 144791 164069
-6461 164069 182451 200838 221577 242315 271403 312898 367719 438761 531510 648118 795613 982230 1218465
$$ packed form
-6579a8101k941k937k937k937m323r095p842m980n218k356J462J461M323M324K057k713J610
-6562e1143O381O083J312N174N173J536J535J34J35j775J089k714p484m622m622n009n010
-6545e3827k624k624k735k736J27J26L228L228O269L407O567O568L228L65j573j573L019L019
-6527b8541J797J796l272o135l154l153k855J916Q819J3589J9076J6213O553j27n256q118
-6511I148p663m796l429n63M861M863l28q911j1436o660m816j949J565J569J983k784K83O967
-6493b2096J0302J5076J6385R709M220n48o903m037m62M312M577k098r09J956P052R915J1346
-6476E7797J1349J0720J0719J0303J0306R348K668j5o690q573l802O396J4988J9277J9278
-6461A64069J8382J8387K0739K0738K9088M1495N4821P1042R2749J16608J47495J86617K36235
$$ plain form
-6448 1218465 1505274 1836785 2203604 2574717 2912434 3181207 3347887 3392789 3306968 3105122 2816449
-6437 2816449 2476131 2132950 1811115 1528406 1300323 1124720 996405 905307 841462 784297 728202 672110
-6425 672110 611963 551816 492575 438109 389904 348378 312336 281068 258685 242982 235248 237056 241846 243776
-6411 243776 238129 226758 211748 196742 187576 178411 170796 168910 174058 179205 191389 203578 213168 222758 230500
-6396 230500 235382 234596 224268 204457 175109 141895 108681 80596 58240 42917 33320 28135 28679 30789 32899
-6381 32899 33458 28292 20919 7821 -8794 -28272 -45053 -52291 -54162 -50308 -46812 -46178 -43219 -40259 -34803 -23621
-6365 -23621 -7668 8284 21016 24207 16245 5421 -9099 -23621 -33789 -30598 -19655 -14437 -27825 -58389
-6351 -58389 -88561 -101558 -88554 -62187 -32723 -12801 -8801 -14340 -22283 -27363 -29581 -28932 -25276 -21619 -19215 -16807
$$ packed form
-6448A218465K86809L31511L66819L71113L37717K68773J66680M4902q5821k01846k88673
-6437B816449l40318l43181l21835k82709k28083j75603j28315r1098o3845n7165n6095n6092
-6425F72110o0147o0147n9241n4466m8205m1526l6042l1268k2383j5703p734J808M790J930
-6411B43776n647j1371j5010j5006r166r165p615j886N148N147J2184J2189R590R590P742
-6396B30500M882p86j0328j9811k9348l3214l3214k8085k2356j5323r597n185N44K110K110
-6381C2899N59n166p373j3098j6615j9478j6781p238j871L854L496O34K959K960N456J1182
-6365b3621J5953J5952J2732L191p962j0824j4520j4522j0168L191J0943N218j3388l0564
-6351e8389l0172j2997J3004K6367K9464J9922M000n539p943n080k218O49L656L657K404K408
$$ plain form
-6335 -16807 -17489 -18172 -23446 -28716 -30859 -30140 -30673 -36927 -45720 -54512 -59846 -55634 -44628 -24079 -8540 -2539 -13106
-6318 -13106 -37031 -61195 -75817 -71594 -50196 -22477 5242 23524 28448 24665 20882 14862 8843 2823 2529
-6303 2529 9316 21829 35951 44349 48124 49038 43212 37386 34766 41687 44315 29768 5320 -19126 -43215 -53946
-6287 -53946 -57878 -56085 -52026 -50830 -48441 -43189 -36506 -35548 -36469 -37389 -38668 -39946 -41404 -42861 -40800 -35876 -27478 -13356
-6269 -13356 2137 17632 31695 40033 45150 44543 43100 55016 71107 87197 92076 91230 81021 61270 32619
-6254 32619 6830 -8283 -10035 673 17106 24713 22783 17360 21478 27028 26857 20002 3606 -27221 -58046
-6239 -58046 -85035 -102482 -114085 -116143 -117131 -112393 -104316 -90510 -73220 -46387 -13829 24456 60831 91480 105550
-6224 105550 106266 96728 87194 82311 86970 97708 114175 129927 136136 128313 110951 93769 76586 55732 37744
$$ packed form
-6335a6807o82o83n274n270k143P19n33o254q793q792n334M212J1006K0549J5539O001j0567
-6318a3106k3925k4164j4622M223K1398K7719K7719J8282M924l783l783o020o019o020k94
-6303B529O787J2513J4122Q398L775R14n826n826k620O921K628j4547k4448k4446k4089j0731
-6287e3946l932J793M059J196K389N252O683R58r21r20j279j278j458j457K061M924Q398J4122
-6269a3356J5493J5495J4063Q338N117o07j443J1916J6091J6090M879q46j0209j9751k8651
-6254C2619k5789j5113j752J0708J6433P607j930n423M118N550j71o855j6396l0827l0825
-6239e8046k6989j7447j1603k058r88M738Q077J3806J7290K6833L2558L8285L6375L0649J4070
-6224A05550P16r538r534m883M659J0738J6467J5752O209p823j7362j7182j7183k0854j7988
$$ plain form
-6209 37744 17192 2365 -3311 4374 15399 26424 35209 43998 44200 44401 49608 54819 54304 48065 31475 9163
-6193 9163 -20065 -39752 -50886 -56290 -60681 -67934 -79336 -81192 -69749 -48765 -25235 4023 32328 51091 62814
-6178 62814 91715 146379 260202 441232 677608 913745 1067823 1088431 1004083 855805 701802 569219
-6166 569219 469082 387313 330353 289282 253940 225039 205680 178288 137542 95837 75128 76809 99486
-6153 99486 131462 172984 211103 239684 256214 255573 231909 208248 197107 206962 228837 244991 235617 209072
-6139 209072 180018 171959 201349 267001 344591 408827 439186 448556 453510 471825 498487 542327 585153 614625
-6125 614625 612247 585064 543326 501591 468560 452708 433990 382833 264641 94928 -96616 -255714 -340629
-6112 -340629 -332030 -252155 -105483 87462 301403 503414 661536 747136 773581 756697 722641 689774 677902
$$ packed form
-6209C7744k0552j4827n676P685J1025J1025Q785Q789K02K01N207N211n15o239j6590k2312
-6193I163k9228j9687j1134n404m391p253j1402j856J1443K0984K3530K9258K8305J8763J1723
-6178F2814K8901N4664J13823J81030K36376K36137J54078K0608q4348j48278j54003j32583
-6166E69219j00137q1769n6960m1071l5342k8901j9359k7392m0746m1705k0709J681K2677
-6153I9486L1976M1522L8119K8581J6530o41k3664k3661j1141R855K1875J6154r374k6545
-6139B09072k9054q059K9390O5652P7590O4236L0359R370M954J8315K6662M3840M2826K9472
-6125F14625k378k7183m1738m1735l3031j5852j8718n1157j18192j69713j91544j59098q4915
-6112c40629Q599P9875J46672J92945K13941K02011J58122Q5600K6445j6884l4056l2867j1872
$$ plain form
-6099 677902 666266 660358 673292 711038 742958 734807 678588 622370 612187 653534 694999 753641 880949 1124672
-6085 1124672 1458087 1823944 2152466 2444732 2687620 2859898 2948875 2978697 2962957 2910958 2784171 2590595
-6073 2590595 2379844 2193902 2012384 1840411 1699450 1640548 1694832 1869346 2075826 2242230 2353921
-6062 2353921 2471341 2612854 2763910 2876555 2926228 2901237 2859070 2858988 2933336 3054439 3204167 3334986
-6050 3334986 3433368 3522446 3663049 3839916 4011057 4165977 4353344 4580483 4843882 5094697 5316891
-6039 5316891 5504492 5694955 5938316 6290457 6728650 7229818 7762475 8342844 8971373 9632345 10195751
-6028 10195751 10558780 10755781 10962324 11215622 11512812 11862646 12374690 13174899 14377771 15944304 17711215
-6017 17711215 19449979 21125766 22848265 24878012 27373874 30337288 33522067 36773642 40155460
$$ packed form
-6099F77902j1636n908J2934L7746L1920q151n6219n6218j0183M1347M1465N8642J27308K43723
-6085A124672L33415L65857L28522K92266K42888J72278Q8977K9822j5740n1999j26787j93576
-6073B590595k10751j85942j81518j71973j40961n8902N4284J74514K06480J66404J11691
-6062B353921J17420J41513J51056J12645M9673k4991m2167q2P4348J21103J49728J30819
-6050C334986R8382Q9078J40603J76867J71141J54920J87367K27139K63399K50815K22194
-6039E316891J87601J90463K43361L52141M38193N01168N32657N80369O28529O60972N63406
-6028A0195751L63029J97001K06543K53298K97190L49834N12044Q00209J202872J566533J766911
-6017A7711215J738764J675787J722499K029747K495862K963414L184779L251575L381818
$$ plain form
-6008 40155460 44077348 48993310 55231767 62688002 71504891 82813987 98941701 122437580 156461905
-5999 156461905 205300941 275317057 374755607 513008316 692889322 884802498 1000000000 965744261
-5991 965744261 814541348 626176960 456323918 326830758 238629431 181849304 145117720 121074801
-5983 121074801 105839842 97381474 94608111 96630467 101279795 103148648 97068211 84417294 70305185
-5974 70305185 58107152 48729209 41711906 36317902 32097540 29029830 27311333 27080435 28278906
-5965 28278906 30858792 34974908 40793040 47017658 49422449 45363622 37599079 29870802 23964291
-5956 23964291 20239038 18489533 18280078 19381431 21835811 25989211 32392573 41788962 54313151
-5947 54313151 66821009 71472130 64584344 51492487 38477747 28243489 21086705 16408882 13380953
$$ packed form
-6008D0155460L921888M915962O238457P456235Q816889J1309096J6127714K3495879L4024325
-5999A56461905M8839036P0016116R9438550J38252709J79881006J91913176J15197502l4255739
-5991I65744261j51202913j88364388j69853042j29493160q8201327n6780127l6731584k4042919
-5983A21074801j5234959q458368k773363K022356M649328J868853o080437j2650917j4112109
-5974G0305185j2198033r377943p017303n394004m220362l067710j718497k30898J198471
-5965B8278906K579886M116116N818132O224618K404791m058827p764543p728277n906511
-5956B3964291l725253j749505k09455J101353K454380M153400O403362R396389J2524189
-5947E4313151J2507858M651121o887786j3091857j3014740j0234258p156784m677823l027929
$$ plain form
-5938 13380953 11347284 9907116 8865795 8156399 7719899 7400285 7025333 6528719 5934779 5291460
-5928 5291460 4692037 4215863 3882817 3650198 3461475 3260225 3053250 2918315 2892161 2908069 2868635 2714221
-5916 2714221 2428135 2064637 1687780 1323447 959117 611870 339049 150792 17881 -79131 -113168
-5905 -113168 -52742 97380 319895 609205 938349 1250321 1475937 1581329 1576033 1534481 1490376 1413833
-5893 1413833 1294527 1178087 1108160 1085945 1072851 1050219 1027177 1017498 1008291 981913 927085 855085 801212
-5880 801212 810317 897036 1046734 1231734 1411011 1555816 1664365 1712559 1667246 1523504 1312969 1085975
-5868 1085975 895243 772016 707948 657716 607487 557359 507231 457341 424631 422271 440904 466633 495229
-5855 495229 514003 523236 527757 538007 567575 621952 678715 718306 719666 684768 633410 595414 587889 601355
$$ packed form
-5938A3380953k033669j440168j041321p09396m36500l19614l74952m96614n93940o43319
-5928E291460n99423m76174l33046k32619j88723k01250k06975j34935k6154J5908l9434j54414
-5916B714221k86086l63498l76857l64333l64330l47247k72821j88257j32911r7012l4037
-5905a13168O0426J50122K22515K89310L29144L11972K25616J05392n296m1552m4105p6543
-5893A413833j19306j16440o9927k2215j3094k2632k3042r679r207k6378n4828p2000n3873
-5880H01212R105Q6719J49698J85000J79277J44805J08549M8194m5313j43742k10535k26994
-5868A085975j90732j23227o4068n0232n0229n0128n0128m9890l2710k360J8633K5729K8596
-5855D95229J8774R233M521J0250K9568N4377N6763L9591J360l4898n1358l7996p525J3466
$$ plain form
-5841 601355 615061 607778 579055 540795 504443 489083 500018 528133 563882 605355 642352 665994 657492 620365
-5827 620365 573155 528812 482083 432492 378703 315377 242807 170237 86750 -29174 -191258 -370518 -506798
-5814 -506798 -530481 -413661 -191881 56015 267657 397000 451918 452447 431985 419513 424217 436793 449369
-5801 449369 457889 456868 447840 438813 433960 429107 429144 429182 417053 391566 360712 335583 309976 293912 289834 291481
-5785 291481 289610 284877 275342 271533 280307 298623 311482 314799 303685 283028 258857 234685 214569 188732 156241
-5770 156241 123751 101875 97179 106523 125409 143043 154955 152909 148000 142674 146893 163882 194230 227499 257910
-5755 257910 281280 298925 312276 322768 324281 320070 313592 309980 300699 278060 243672 209288 183178 166614
-5741 166614 162574 171892 180849 184084 183741 189123 200883 218371 227510 223291 201058 169287 143956 128167 125182
$$ packed form
-5841F01355J3706p283k8723l8260l6352j5360J0935K8115L5749M1473L6997K3642q502l7127
-5827F20365m7210m4343m6729m9591n3789o3326p2570p2570q3487j15924j62084j79260j36280
-5814e06798k3683J16820K21780K47896K11642J29343N4918N29k0462j2472M704J2576J2576
-5801D49369Q520j021r028r027m853m853L7L8j2129k5487l0854k5129k5607j6064m078J647
-5785B91481j871m733r535l809Q774J8316J2859L317j1114k0657k4171k4172k0116k5837l2491
-5770A56241l2490k1876m696R344J8886J7634J1912k046m909n326M219J6989L0348L3269L0411
-5755B57910K3370J7645J3351J0492J513m211o478l612r281k2639l4388l4384k6110j6564
-5741A66614m040R318Q957L235l43N382J1760J7488R139m219k2233l1771k5331j5789k985
$$ plain form
-5726 125182 131742 140210 148679 147363 146051 141876 137702 135104 132510 133434 137221 141601 151709 158776 165843 167736 169633
-5709 169633 168664 167699 164285 160874 157102 159059 164859 170662 170081 172365 172559 167032 153807 134862 102237 69616 45281
-5692 45281 38124 41341 47424 46168 42053 35310 31434 36618 51348 63689 76034 85453 92013 93549 89359 84812
-5676 84812 83127 85080 104209 135085 171687 199880 207081 185657 150874 116688 88226 73481 79728 93023
-5662 93023 106318 113471 114898 105293 92826 86620 86139 84107 76351 62631 54636 50816 52720 58442 64163 67376
-5646 67376 70589 70760 70932 71401 69008 66317 73168 91588 119550 151090 176905 177375 153036 119632 91953 82352
-5630 82352 82292 78654 72154 61479 47942 33212 24207 24549 34434 47837 64103 75688 81547 84126 86705 89847
-5614 89847 92990 94343 95696 90041 78662 58456 38251 26618 20710 19216 23446 30211 42701 50898 59094 66541
$$ packed form
-5726A25182O560Q468Q469j316j312m175m174k598k594R24L787M380J0108P067P067J893J897
-5709A69633r69r65l414l411l772J957N800N803n81K284J94n527j3225j8945l2625l2621k4335
-5692D5281p157L217O083j256m115o743l876N184J4730J2341J2345R419O560J536m190m547
-5676H4812j685J953J9129L0876L6602K8193P201k1424l4783l4186k8462j4745O247J3295
-5662I3023J3295P153J427r605j2467o206m81k032p756j3720p995l820J904N722N721L213
-5646F7376L213J71J72M69k393k691O851J8420K7962L1540K5815M70k4339l3404k7679r601
-5630H2352o0l638o500j0675j3537j4730r005L42R885J3403J6266J1585N859K579K579L142
-5614H9847L143J353J353n655j1379k0206k0205j1633n908j494M230O765J2490Q197Q196P447
$$ plain form
-5598 66541 73988 76306 69083 52437 35791 22007 13949 11825 9700 9186 8671 -877 -13289 -24866 -26901 -20907
-5582 -20907 -17773 -17143 -19375 -19793 -14482 -9349 -7079 -5849 -1753 3416 8586 18612 28642 28534 28426 26823 30949
-5565 30949 36626 42302 45828 49358 46566 43775 38989 39932 46839 59470 74722 89978 108454 126930 142655 158381
-5549 158381 169574 171225 173353 185023 199079 222676 263165 324647 404496 509154 645181 821283 1035314
-5536 1035314 1293237 1597860 1942557 2306339 2664395 2974385 3198498 3308825 3283658 3133405 2885825
-5525 2885825 2564773 2207462 1853490 1531961 1254563 1024874 840378 699774 593521 519710 466771
-5514 466771 427191 393217 364968 334394 303819 276464 249110 224111 199112 172921 152454 136211 129509 128235
-5500 128235 129822 132364 129181 126535 126751 130724 137560 142607 147654 149152 144925 147437 152812 161627 176171 193458
$$ packed form
-5598F6541P447K318p223j6646j6646j3784q058k124k125n14n15r548j2412j1577k035N994
-5582b0907L134O30k232m18N311N133K270J230M096N169N170J0026J0030j08j08j603M126
-5565C0949N677N676L526L530k792k791m786R43O907J2631J5252J5256J8476J8476J5725J5726
-5549A58381J1193J651K128J1670J4056K3597M0489O1482P9849J04658J36027J76102K14031
-5536A035314K57923L04623L44697L63782L58056L09990K24113J10327k5167j50253k47580
-5525B885825l21052l57311l53972l21529k77398k29689j84496j40604j06253p3811n2939
-5514D66771l9580l3974k8249l0574l0575k7355k7354k4999k4999k6191k0467j6243o702j274
-5500A28235J587K542l183k646K16L973O836N047N047J498m227K512N375Q815J4544J7287
$$ plain form
-5484 193458 207883 211032 204644 192351 174333 155835 137340 115625 93910 65214 36521 13256 -7146 -22849
-5470 -22849 -32823 -29201 -19853 -6572 3848 7233 4892 -642 -3311 -6159 -11869 -14183 -13632 -12007 -10382 -12186 -13986
-5453 -13986 -15786 -17586 -15991 -14392 -12793 -11194 -9062 -6926 -4791 -2655 -4548 -6438 -8328 -10218 -14157 -18093 -23460
-5436 -23460 -28828 -35392 -41951 -39924 -37896 -40941 -43983 -45593 -47203 -46939 -46670 -39723 -32775 -26394 -20013 -16494 -12972
-5419 -12972 -11183 -9394 -3192 3013 3699 -1339 -3158 -4973 -10549 -16125 -16930 -17732 -14791 -11850 -11772 -11690 -17396 -23103 -25947
-5400 -25947 -28787 -32674 -36562 -40449 -44333 -46163 -47993 -49824 -51650 -48858 -46063 -42015 -37967 -30971 -26834 -23949 -21064
-5383 -21064 -19539 -18011 -13919 -9826 -8868 -12678 -18574 -24471 -28388 -32305 -34613 -36916 -35645 -31511 -25947 -23241 -24266
-5366 -24266 -25291 -26495 -27695 -29555 -31415 -32022 -29763 -27382 -24996 -21004 -17009 -14239 -11466 -10128 -11649 -14142 -19495
$$ packed form
-5484A93458J4425L149o388j2293j8018j8498j8495k1715k1715k8696k8693k3265k0402j5703
-5470b2849r974L622R348J3281J0420L385k341n534k669k848n710k314N51J625J625j804j800
-5453a3986j800j800J595J599J599J599K132K136K135K136j893j890j890j890l939l936n367
-5436b3460n368o564o559K027K028l045l042j610j610K64K69O947O948O381O381L519L522
-5419a2972J789J789O202O205O86n038j819j815n576n576q05q02K941K941P8Q2n706n707k844
-5400b5947k840l887l888l887l884j830j830j831j826K792K795M048M048O996M137K885K885
-5383b1064J525J528M092M093R58l810n896n897l917l917k308k303J271M134N564K706j025
-5366b4266j025j204j200j860j860o07K259K381K386L992L995K770K773J338j521k493n353
$$ plain form
-5349 -19495 -25209 -28056 -29029 -32861 -37591 -37546 -33461 -29372 -28030 -23822 -21317 -18809 -20300 -26558 -32298 -40897 -44728 -45694
-5331 -45694 -46961 -43454 -42455 -41452 -40680 -39905 -39134 -38358 -38392 -38422 -41318 -44210 -43647 -43081 -41266 -39447 -36856 -37125 -38649 -40170
-5311 -40170 -41720 -43271 -43390 -43510 -42555 -41601 -42078 -42555 -38336 -34117 -33058 -34862 -38604 -42347 -42928 -34922 -27206 -26170 -31634
-5292 -31634 -39961 -45664 -51367 -50569 -49771 -48198 -46625 -42369 -38112 -36062 -36875 -39238 -44464 -51542 -58620 -65698 -72776 -76634
-5274 -76634 -77629 -75642 -73656 -72221 -73648 -79608 -85568 -89649 -85143 -68650 -47386 -28936 -19070 -16300 -16394 -19144 -21891
-5257 -21891 -24817 -27743 -33826 -39905 -45984 -52064 -53077 -54087 -58437 -62787 -64106 -65422 -63398 -61374 -60636 -59895 -60584 -61274
-5239 -61274 -61169 -61061 -60953 -60845 -57431 -54013 -53935 -53856 -55124 -56387 -54311 -52235 -49745 -47252 -44758 -42265 -38165 -34061 -29957
-5220 -29957 -25853 -25510 -25164 -27203 -29242 -33416 -37587 -36510 -30662 -20225 -12648 -8648 -11328 -16323 -24176 -29406 -34635
$$ packed form
-5349a9495n714k847r73l832m730M5M085M089J342M208K505K508j491o258n740q599l831r66
-5331d5694j267L507R99J003P72P75P71P76l4l0k896k892N63N66J815J819K591k69j524j521
-5311d0170j550j551j19j20R55R54m77m77M219M219J059j804l742l743n81Q006P716J036n464
-5292c1634q327n703n703P98P98J573J573M256M257K050q13k363n226p078p078p078p078l858
-5274g6634r95J987J986J435j427n960n960m081M506J6493K1264J8450R866K770r4k750k747
-5257b1891k926k926o083o079o079o080j013j010m350m350j319j316K024K024P38P41o89o90
-5239f1274J05J08J08J08L414L418P8P9j268j263K076K076K490K493K494K493M100M104M104
-5220b9957M104L43L46k039k039m174m171J077N848J0437P577M000k680m995p853n230n229
$$ plain form
-5203 -34635 -37214 -39790 -42365 -44941 -46737 -48534 -53670 -58802 -63611 -68419 -67979 -67535 -64024 -60513 -56704 -57662 -59786 -61911
-5185 -61911 -61948 -61982 -59637 -57293 -54948 -52600 -50286 -47971 -48996 -50017 -51624 -53230 -51497 -49760 -48564 -47367 -48437 -54274
-5167 -54274 -58892 -58735 -58225 -57710 -56365 -55016 -53670 -52321 -49276 -46227 -43181 -40133 -40397 -40658 -40923 -41184 -41609 -42030 -40069
-5148 -40069 -38105 -38381 -38653 -40360 -42063 -42354 -42641 -41501 -40356 -42555 -44751 -45697 -46640 -46681 -49581 -50096 -47747 -46596 -45440
-5129 -45440 -44106 -45634 -50297 -57818 -61523 -65228 -67834 -70435 -68743 -67051 -64091 -61128 -56555 -54844 -54956 -55064 -52190
-5112 -52190 -49317 -45418 -44378 -44411 -47308 -48895 -50480 -49201 -50785 -51501 -52213 -56443 -60674 -61210 -61743 -64065 -63525 -62012 -63357
-5093 -63357 -64524 -62828 -61076 -59321 -58817 -58314 -61162 -64006 -63510 -63014 -62612 -62205 -65139 -68072 -66559 -65042 -63525 -62008
-5075 -62008 -61121 -60230 -62679 -65128 -65869 -66607 -64009 -61408 -59913 -58415 -56920 -55422 -53778 -52131 -51918 -51702 -50506 -49305
$$ packed form
-5203c4635k579k576k575k576j796j797n136n132m809m808M40M44L511L511L809r58k124k125
-5185f1911l7l4K345K344K345K348K314K315j025j021j607j606J733J737J196J197j070n837
-5167e4274m618J57N10N15J345J349J346J349L045L049L046L048k64k61k65k61m25m21J961
-5148d0069J964k76k72j707j703k91k87J140J145k199k196r46r43m1k900n15K349J151J156
-5129d5440J334j528m663p521l705l705k606k601J692J692K960K963M573J711j12j08K874
-5112e2190K873L899J040l3k897j587j585J279j584p16p12m230m231n36n33k322N40J513j345
-5093f3357j167J696J752J755N04N03k848k844M96M96M02M07k934k933J513J517J517J517
-5075f2008Q87Q91k449k449p41p38K598K601J495J498J495J498J644J647K13K16J196J201
$$ plain form
-5057 -49305 -47513 -50487 -57997 -60733 -61207 -58814 -56514 -58981 -61930 -64874 -64080 -63283 -62310 -61333 -60390 -56581 -50211 -46700
-5039 -46700 -45556 -41549 -42671 -48560 -50427 -49432 -50345 -51255 -51639 -52023 -49246 -46465 -42406 -41210 -40789 -40364 -44986 -49604 -50703
-5020 -50703 -51803 -51803 -48936 -47680 -46424 -47483 -48538 -46551 -47427 -48843 -50256 -49462 -48668 -51076 -53480 -55884 -58288 -55657
-5002 -55657 -53021 -50386 -47751 -45709 -43662 -38396 -38854 -40897 -42936 -45332 -47729 -50930 -54132 -55903 -57669 -59291 -60912
-4985 -60912 -59194 -57472 -53607 -49742 -48262 -46778 -48698 -50617 -53968 -57315 -56018 -54717 -55802 -56887 -55262 -53633 -50573
-4968 -50573 -47513 -44426 -41336 -38247 -35157 -35112 -35063 -35015 -34967 -36569 -38168 -38336 -38504 -37870 -37233 -41486 -45738 -52127 -52787 -53327
-4948 -53327 -53868 -53279 -52686 -52093 -51501 -52000 -52500 -52999 -53499 -51493 -49488 -47483 -45477 -44203 -42928 -41653 -40379 -41012 -41646 -43711
-4928 -43711 -45776 -49674 -53573 -53178 -52783 -53223 -53663 -56488 -59313 -58351 -57390 -60364 -63339 -63450 -57837 -51150 -44464 -43815 -43167
$$ packed form
-5057d9305J792k974p510k736m74K393K300k467k949k944P94P97R73R77R43L809O370L511
-5039d6700J144M007j122n889j867R95r13r10l84l84K777K781M059J196M21M25m622m618j099
-5020e0703j100%K867J256J256j059j055J987q76j416j413P94P94k408k404k404k404K631
-5002e5657K636K635K635K042K047N266m58k043k039k396k397l201l202j771j766j622j621
-4985f0912J718J722L865L865J480J484j920j919l351l347J297J301j085j085J625J629L060
-4968e0573L060L087L090L089L090M5M9M8M8j602j599j68j68O34O37m253m252o389o60n40
-4948e3327n41N89N93N93N92m99n00m99n00K006K005K005K006J274J275J275J274o33o34k065
-4928d3711k065l898l899L95L95m40m40k825k825R62R61k974k975j11N613O687O686O49O48
$$ plain form
-4909 -43167 -43949 -44732 -44054 -43375 -43055 -42734 -37427 -37844 -42198 -46551 -49115 -51680 -50904 -50129 -50315 -50502 -50688 -50875 -50494 -50114 -49734
-4888 -49734 -49354 -48340 -47326 -46312 -45299 -46640 -47982 -49324 -50666 -47952 -45239 -40140 -35041 -33789 -32536 -31284 -30032
-4871 -30032 -31851 -33669 -35488 -37307 -41094 -44881 -43420 -41959 -42242 -42522 -44236 -45947 -45783 -45615 -45451 -45284 -45694 -46100 -44124
-4852 -44124 -42145 -44911 -47673 -48053 -48430 -49973 -51516 -49719 -47919 -47852 -47785 -47718 -47647 -49093 -50539 -51985 -53428 -50282 -47136
-4833 -47136 -47330 -47520 -47606 -47688 -44430 -41172 -42093 -43010 -41542 -40073 -42291 -44505 -45287 -46070 -44471 -42868 -39834 -36800 -34959
-4814 -34959 -33114 -36517 -39920 -45951 -51978 -55619 -59261 -60394 -61523 -57405 -53286 -50930 -48571 -49551 -50532 -50558 -50584 -50610 -50632
-4795 -50632 -51136 -51639 -52142 -52641 -50752 -48862 -51266 -53666 -53864 -54061 -54259 -54453 -54624 -54792 -52578 -50360 -52768 -55172 -54240 -53305
-4775 -53305 -53059 -52809 -53994 -55176 -58687 -62194 -61412 -60625 -59134 -57643 -57584 -57524 -57673 -57822 -54632 -51441 -50934 -50427 -49920 -49413
$$ packed form
-4909d3167p82p83O78O79L20L21N307m17m354m353k564k565P76P75j86j87j86j87L81L80L80
-4888d9734L80J014J014J014J013j341j342j342j342K714K713N099N099J252J253J252J252
-4871c0032j819j818j819j819l787l787J461J461k83k80j714j711J64J68J64J67m10m06J976
-4852d4124J979k766k762l80l77j543j543J797J800O7O7O7P1j446j446j446j443L146L146
-4833d7136j94j90q6q2L258L258r21r17J468J469k218k214p82p83J599J603L034L034J841
-4814c4959J845l403l403o031o027l641l642j133j129M118M119K356K359r80r81k6k6k6k2
-4795e0632n04n03n03m99J889J890k404k400j98j97j98j94j71j68K214K218k408k404R32R35
-4775e3305K46K50j185j182l511l507P82P87J491J491N9O0j49j49L190L191N07N07N07N07
$$ plain form
-4755 -49413 -50725 -52037 -53349 -54661 -54975 -55284 -55597 -55906 -54907 -53905 -54337 -54766 -57420 -60070 -60338 -60603 -57382 -54158 -55232
-4736 -55232 -56301 -58247 -60189 -62135 -64077 -65903 -67726 -66212 -64695 -65940 -67181 -68426 -69667 -68587 -67502 -66421 -65336
-4719 -65336 -63242 -61143 -61434 -61721 -59954 -58184 -59757 -61326 -64032 -66734 -63238 -59738 -59403 -59063 -57297 -55526 -51613 -47695
-4701 -47695 -47121 -46543 -50591 -54635 -54389 -54140 -53051 -51959 -50871 -49779 -49585 -49387 -49194 -48996 -49835 -50673 -52943 -55213 -56529
-4682 -56529 -57845 -59160 -60476 -62112 -63749 -62999 -62250 -59891 -57531 -55172 -52813 -51624 -50435 -50677 -55690 -61866 -65180 -69746
-4664 -69746 -69541 -66667 -63793 -65869 -67945 -67875 -67804 -64393 -60983 -56984 -52984 -52324 -51661 -49272 -46883 -44493 -42101 -44989 -47878
-4645 -47878 -50766 -53651 -54989 -56328 -56234 -56137 -59190 -62243 -67681 -73115 -76406 -79698 -74878 -70055 -68717 -67379 -67472 -67562 -67058
-4626 -67058 -66555 -64621 -62683 -64706 -66727 -67319 -67908 -70111 -72310 -72127 -71941 -68225 -64505 -63175 -61840 -56395 -50945 -49794
$$ packed form
-4755d9413j312j312j312j312l14l09l13l09R99J002m32m29k654k650k68k65L221L224j074
-4736e5232j069j946j942j946j942j826j823J514J517j245j241j245j241J080J085J081J085
-4719f5336K094K099k91k87J767J770j573j569k706k702L496L500L35L40J766J771L913L918
-4701d7695N74N78m048m044K46K49J089J092J088J092J94J98J93J98q39q38k270k270j316
-4682e6529j316j315j316j636j637P50P49K359K360K359K359J189J189k42n013o176l314m566
-4664f9746K05K874K874k076k076P0P1L411L410L999M000O60O63K389K389K390K392k888k889
-4645d7878k888k885j338j339R4R7l053l053n438n434l291l292M820M823J338J338r3r0N04
-4626f7058N03J934J938k023k021n92n89k203k199J83J86L716L720J330J335N445N450J151
$$ plain form
-4608 -49794 -48638 -50237 -51833 -50092 -48348 -49618 -50886 -52157 -53424 -58460 -63491 -65187 -66879 -66756 -66630 -66507 -66380 -67271
-4590 -67271 -68158 -69045 -69932 -69660 -69384 -66723 -64062 -62552 -61039 -59526 -58012 -54684 -51352 -51359 -51367 -53554 -55739 -55537 -55336 -54005
-4570 -54005 -52671 -52768 -52865 -50356 -47844 -47718 -47591 -46782 -45969 -45157 -44344 -43793 -43241 -46029 -48813 -51870 -54926 -53689 -52448 -51389
-4550 -51389 -50330 -50703 -51072 -52160 -53249 -52906 -52559 -56324 -60088 -66238 -72385 -69589 -66794 -62567 -58337 -55854 -53372 -52917
-4532 -52917 -52459 -52809 -47434 -42060 -42406 -45489 -48571 -47718 -46860 -46603 -46346 -46089 -45828 -46368 -46909 -50789 -54665 -56667 -58668 -60670
-4512 -60670 -62668 -63186 -63704 -64222 -64736 -64718 -64699 -66112 -67521 -67368 -67215 -65631 -64043 -64397 -64751 -60811 -56868 -55418 -53964 -55377
-4492 -55377 -56786 -55604 -54419 -54669 -54915 -54576 -54233 -55325 -56413 -56193 -55970 -55750 -55526 -55269 -55008 -54751 -54490 -52474 -50453 -47363
-4472 -47363 -44270 -43193 -47837 -52127 -56413 -61628 -66838 -65374 -63905 -64692 -65474 -66615 -62030 -58881 -55727 -53648 -51568
$$ packed form
-4608d9794J156j599j596J741J744j270j268j271j267n036n031j696j692J23J26J23J27q91
-4590f7271q87q87q87K72K76K661K661J510J513J513J514L328L332pqk187k185K02K01J331
-4570e4005J334r7r7K509K512J26J27Q09Q13Q12Q13N51N52k788k784l057l056J237J241J059
-4550e1389J059l73l69j088j089L43L47l765l764o150o147K796K795M227M230K483K482M55
-4532e2917M58l50N375N374l46l083l082Q53Q58K57K57K57K61n40n41l880l876k002k001k002
-4512f0670j998n18n18n18n14J8J9j413j409J53J53J584J588l54l54L940L943J450J454j413
-4492e5377j409J182J185k50k46L39L43j092j088K20K23K20K24K57K61K57K61K016K021L090
-4472d7363L093J077m644m290m286n215n210J464J469p87p82j141M585L149L154K079K080
$$ plain form
-4455 -51568 -50983 -50394 -51236 -52078 -52209 -52336 -49600 -46864 -42298 -37728 -36021 -34314 -40006 -45694 -48519 -51344 -51594 -51840 -49223
-4436 -49223 -46607 -45694 -44777 -45291 -45805 -47826 -49842 -51859 -53875 -54434 -54989 -55545 -56100 -58404 -60703 -63003 -65303 -64863 -64419
-4417 -64419 -63976 -63532 -63756 -63976 -64196 -64416 -63208 -61997 -57923 -53849 -52880 -51907 -53797 -55686 -57640 -59589 -61896 -58478 -58396
-4398 -58396 -58310 -54650 -56711 -57315 -57915 -58877 -59835 -60856 -61874 -64684 -61766 -61445 -61121 -63305 -65485 -63942 -62396 -63715 -65031
-4379 -65031 -64114 -63193 -63708 -64218 -64375 -64528 -64684 -64837 -64278 -63715 -60293 -56868 -57002 -57133 -58694 -60256 -61672 -63085 -64498 -65910
-4359 -65910 -65821 -65728 -65635 -65541 -63573 -61602 -58199 -54796 -52708 -50617 -53297 -55977 -57915 -59850 -61784 -63719 -64956 -66190 -67424
-4340 -67424 -68657 -67032 -65403 -60912 -56421 -55075 -53730 -55247 -56760 -55414 -54069 -54155 -54237 -53607 -52977 -53778 -54576 -56212 -57848
-4321 -57848 -59485 -61117 -62835 -64554 -66272 -67986 -66335 -64684 -64285 -63883 -62306 -57867 -55217 -57334 -58441 -59548 -59522 -59492
$$ packed form
-4455e1568N85N89q42q42j31j27K736K736M566M570J707J707n692n688k825k825k50k46K617
-4436d9223K616R13R17n14n14k021k016k017k016n59n55n56n55k304k299k300k300M40M44
-4417f4419M43M44k24k20k20k20J208J211M074M074R69R73j890j889j954j949k307L418Q2
-4398e8396Q6L660k061o04o00r62r58j021j018k810K918L21L24k184k180J543J546j319j316
-4379f5031R17R21n15n10j57j53j56j53N59N63L422L425j34j31j561j562j416j413j413j412
-4359f5910Q9R3R3R4J968J971L403L403K088K091k680k680j938j935j934j935j237j234j234
-4340f7424j233J625J629M491M491J346J345j517j513J346J345q6q2O30O30q01p98j636j636
-4321e7848j637j632j718j719j718j714J651J651L99M02J577M439K650k117j107j107K6L0
$$ plain form
-4303 -59492 -60252 -61013 -58911 -56805 -55567 -54330 -53092 -51851 -55713 -59574 -60573 -58706 -57379 -60823 -63014 -62340 -61863 -61385
-4285 -61385 -63592 -65795 -65556 -65318 -65079 -64837 -63122 -61408 -59693 -57975 -58050 -58124 -58199 -58269 -62847 -67424 -72001 -76578 -72418 -68259
-4265 -68259 -65530 -62802 -59298 -55795 -56883 -57971 -58553 -56272 -54169 -56838 -58150 -56600 -55526 -54453 -53916 -53379 -52843 -52306
-4247 -52306 -52865 -53424 -56846 -60267 -62198 -64129 -63197 -62265 -63301 -64334 -62507 -60677 -60282 -59883 -59488 -59089 -60640 -62187 -61054
-4228 -61054 -64688 -67431 -70171 -70350 -70525 -68490 -66451 -67278 -68102 -68661 -69216 -68821 -65560 -62765 -64736 -65280 -65821 -66335 -66846 -67360
-4208 -67360 -67871 -63935 -59995 -60826 -61658 -63059 -64457 -62992 -61527 -60990 -60450 -61341 -62232 -61128 -60021 -59868 -62578 -66216 -65079
-4189 -65079 -63942 -62806 -61792 -60774 -59936 -59097 -61915 -67591 -69571 -66779 -63991 -61199 -58407 -55616 -53048 -55247 -59533
-4172 -59533 -63819 -65694 -67565 -66872 -66179 -64386 -67360 -68009 -65795 -63048 -63160 -62914 -62668 -61859 -61046 -63096 -65146 -62936 -60722
$$ packed form
-4303e9492p60p61K102K106J238J237J238J241l862l861r99J867J327l444k191O74M77M78
-4285f1385k207k203K39K38K39K42J715J714J715J718p5p4p5p0m578m577m577m577M160M159
-4265f8259K729K728L504L503j088j088n82K281K103k669j312J550J074J073N37N37N36N37
-4247e2306n59n59l422l421j931j931R32R32j036j033J827J830L95L99L95L99j551j547J133
-4228f1054l634k743k740j79j75K035K039q27q24n59n55L95L261K795j971n44n41n14n11n14
-4208f7360n11L936L940q31q32j401j398J465J465N37N40q91q91J104J107J53k710l638J137
-4189f5079J137J136J014J018Q38Q39k818n676j980K792K788K792K792K791K568k199m286
-4172e9533m286j875j871O93O93J793k974o49K214K747j12K46K46Q09Q13k050k050K210K214
$$ plain form
-4153 -60722 -58508 -56294 -55112 -53927 -52742 -51557 -47155 -42749 -43114 -43480 -46991 -50502 -51150 -51799 -51344 -50889 -51866 -52843 -53983
-4134 -53983 -55124 -53402 -51680 -53387 -55094 -56801 -58508 -59723 -60938 -65016 -69093 -70428 -71762 -70234 -68706 -66358 -64009
-4117 -64009 -61661 -59313 -58575 -57837 -57099 -56361 -56085 -55809 -55534 -55258 -55578 -55899 -56219 -56540 -55429 -54319 -53208 -52097 -53044 -53991
-4097 -53991 -53506 -53021 -49701 -46380 -45921 -45463 -46674 -47885 -50528 -53171 -54404 -55638 -56872 -58105 -59608 -61110 -62612 -64114
-4079 -64114 -63234 -62355 -64337 -66317 -64721 -63126 -61531 -59932 -60998 -62064 -60267 -58467 -59533 -60599 -58802 -57002 -58717
-4062 -58717 -60431 -62146 -63857 -62709 -61561 -60413 -59261 -62146 -65031 -65053 -65072 -63782 -62492 -58519 -59313 -59037 -58761 -58784 -58806 -58918
-4042 -58918 -59030 -59142 -59253 -58344 -57435 -57956 -58478 -60521 -62563 -59835 -57107 -57267 -57423 -57584 -57740 -59212 -60681 -62153 -63622 -61188
-4022 -61188 -58750 -61087 -63421 -64147 -64870 -65597 -66320 -65102 -63879 -62656 -61434 -60066 -58694 -58754 -58814 -60905 -62992 -66153 -62634
$$ packed form
-4153f0722K214K214J182J185J185J185M402M406l65l66l511l511o48o49M55M55r77r77j140
-4134e3983j141J722J722j707j707j707j707j215j215m078m077j335j334J528J528K348K349
-4117f4009K348K348P38P38P38P38K76K76K75K76l20l21l20l21J111J110J111J111r47r47
-4097e3991M85M85L320L321M59M58j211j211k643k643j233j234j234j233j503j502j502j502
-4079f4114Q80Q79j982j980J596J595J595J599j066j066J797J800j066j066J797J800j715
-4062e8717j714j715j711J148J148J148J152k885k885k2j9J290J290L973p94K76K76k3k2j12
-4042e8918j12j12j11R09R09n21n22k043k042K728K728j60j56j61j56j472j469j472j469K434
-4022f1188K438k337k334p26p23p27p23J218J223J223J222J368J372o0o0k091k087l161L519
$$ plain form
-4003 -62634 -61922 -64069 -62757 -61445 -65966 -70484 -70230 -69977 -67103 -64226 -64211 -64196 -62574 -60949 -60756 -60562 -59537 -58508 -58911
-3984 -58911 -59313 -59801 -60290 -60599 -60908 -62261 -60752 -62284 -63816 -64990 -66164 -65608 -62191 -63752 -65314 -65087 -64859 -64908 -62090
-3965 -62090 -61065 -60036 -59101 -61024 -59731 -58433 -61725 -62150 -61982 -61810 -60271 -61590 -64345 -64233 -63115 -61993 -62902 -63808 -64121
-3946 -64121 -61568 -63014 -64457 -63778 -63096 -59257 -55414 -55362 -58169 -59727 -58419 -58963 -62366 -64162 -65955 -65157 -67219 -67077 -64069
-3927 -64069 -60961 -60711 -62791 -64867 -65813 -63894 -63588 -63279 -62015 -60752 -59667 -58583 -56723 -57725 -58549 -59373 -62179 -64986
-3909 -64986 -67017 -66186 -65683 -65180 -62709 -63100 -63640 -61318 -58400 -55481 -55008 -54535 -54061 -53588 -53950 -54311 -56223 -60998 -64073 -64285
-3889 -64285 -62828 -58508 -56715 -57785 -59451 -61117 -62694 -64270 -63163 -59194 -57908 -56622 -54978 -53335 -55418 -54639 -52429
-3872 -52429 -53081 -54173 -55265 -54151 -53036 -53681 -54326 -54673 -55019 -57513 -55236 -54210 -53186 -55291 -57397 -54434 -56242 -58922
$$ packed form
-4003f2634P12k147J312J312m521m518K54K53K874K877J5J5J622J625J93J94J025J029m03
-3984e8911m02m88m89l09l09j353J509j532j532j174j174N56L417j561j562K27K28m9K818
-3965f2090J025J029R35j923J293J298l292m25J68J72J539j319k755J12J118J122r09r06l13
-3946f4121K553j446j443O79O82L839L843N2k807j558J308n44l403j796j793P98k062J42L008
-3927f4069L108K50k080k076r46J919L06L09J264J263J085J084J860j002q24q24k806k807
-3909f4986k031Q31N03N03K471l91n40K322K918K919M73M73M74M73l62l61j912m775l075k12
-3889f4285J457M320J793j070j666j666j577j576J107L969J286J286J644J643k083P79K210
-3872e2429o52j092j092J114J115o45o45l47l46k494K277J026J024k105k106K963j808k680
$$ plain form
-3854 -58922 -61598 -63141 -64684 -65903 -67118 -66723 -66328 -65280 -61367 -57453 -56402 -56875 -57345 -56205 -57927 -60129 -59466 -57908
-3836 -57908 -61121 -61236 -61348 -65098 -68847 -69932 -71013 -69708 -68404 -68236 -68065 -70100 -72135 -73499 -71997 -69720 -67442 -67972
-3818 -67972 -68497 -65802 -65970 -73193 -77551 -78449 -79347 -77715 -76078 -74442 -72806 -71658 -70506 -71740 -72974 -73436 -73894 -74174 -74453
-3799 -74453 -71106 -64893 -62019 -62008 -63312 -64613 -65914 -67215 -69216 -68355 -66719 -65083 -62194 -59306 -60711 -62116 -61814 -61512
-3781 -61512 -61210 -60908 -56820 -52731 -52101 -54333 -60364 -63532 -65150 -66768 -68743 -70719 -68698 -69541 -70163 -70786 -70036 -66425 -63708
-3762 -63708 -63853 -63640 -63428 -61713 -59999 -62280 -61695 -60815 -59936 -62217 -64494 -61255 -58016 -57341 -56663 -55660 -57520 -59201 -60879
-3743 -60879 -61169 -61460 -62049 -62634 -60897 -63931 -65892 -64986 -67513 -70040 -70003 -69962 -69328 -68695 -68061 -67424 -66585 -65746 -66339 -66932 -64721
-3722 -64721 -62511 -65072 -67632 -66227 -64822 -64848 -64874 -65467 -66059 -69515 -72970 -70998 -69026 -69619 -70212 -69940 -64897 -63790 -65545
$$ packed form
-3854e8922k676j543j543j219j215L95L95J048L913L914J051m73m70J140j722k202O63J558
-3836e7908l213j15j12l750l749j085j081J305J304J68J71k035k035j364J502K277K278n30
-3818f7972n25K695j68p223m358q98q98J632J637J636J636J148J152j234j234m62m58k80k79
-3799g4453L347O213K874J1j304j301j301j301k001Q61J636J636K889K888j405j405L02L02
-3781f1512L02L02M088M089O30k232o031l168j618j618j975j976K021q43o22o23P50L611K717
-3762f3708j45K13K12J715J714k281N85Q80Q79k281k277L239L239O75O78J003j860j681j678
-3743f0879k90k91n89n85J737l034j961R06k527k527L7M1O34O33O34O37Q39Q39n93n93K211
-3722f4721K210k561k560J405J405k6k6n93n92l456l455J972J972n93n93K72N043J107j755
$$ plain form
-3703 -65545 -66660 -67774 -67636 -67498 -67986 -68475 -66100 -63726 -63022 -62317 -58750 -55183 -54181 -53178 -53607 -54035 -57341 -60647 -62522
-3684 -62522 -64397 -66570 -68743 -68054 -67364 -66186 -65008 -60968 -56928 -56943 -56957 -59835 -62712 -64979 -67245 -66648 -66052 -68229 -70405
-3665 -70405 -67811 -65217 -64084 -62947 -63242 -63536 -62910 -62280 -63081 -63883 -63927 -63968 -62578 -61188 -59026 -56861 -57558 -58255 -56328 -54397
-3645 -54397 -57237 -60077 -61251 -62422 -63592 -64762 -65489 -66212 -66935 -67658 -64032 -60401 -59634 -58866 -60148 -61426 -65392 -64583 -65866
-3626 -65866 -67144 -68128 -69108 -70122 -71132 -69284 -67431 -66596 -65758 -62060 -58359 -58993 -59622 -57394 -55161 -58150 -61136 -62694
-3608 -62694 -64248 -64837 -65422 -66190 -66954 -65694 -67293 -71401 -70733 -67193 -63648 -62668 -61687 -60413 -59134 -59466 -59798 -58925 -60912
-3589 -60912 -64509 -62381 -59779 -57174 -55642 -54110 -56123 -58132 -57278 -56424 -57662 -58896 -57267 -55638 -56085 -56529 -58404 -60278
-3571 -60278 -60666 -61050 -60003 -58955 -58303 -57647 -56991 -56335 -58098 -59857 -61617 -63376 -63529 -63678 -63827 -63976 -63055 -62131 -61207 -60282
$$ packed form
-3703f5545j115j114J38J38m88m89K375K374P04P05L567L567J002J003m29m28l306l306j875
-3684f2522j875k173k173O89O90J178J178M040M040j5j4k878k877k267k266N97N96k177k176
-3665g0405K594K594J133J137k95k94O26O30q01q02m4m1J390J390K162K165o97o97J927J931
-3645e4397k840k840j174j171j170j170p27p23p23p23L626L631P67P68j282j278l966Q09j283
-3626f5866j278r84r80j014j010J848J853Q35Q38L698L701o34o29K228K233k989k986j558
-3608f2694j554n89n85p68p64J260j599m108O68L540L545R80R81J274J279l32l32Q73j987
-3589f0912l597K128K602K605J532J532k013k009Q54Q54j238j234J629J629m47m44j875j874
-3571f0278l88l84J047J048O52O56O56O56j763j759j760j759j53j49j49j49R21R24R24R25
$$ plain form
-3551 -60282 -59574 -58862 -58150 -57438 -58996 -60551 -62105 -63659 -65351 -67040 -68728 -70417 -69694 -68967 -68240 -67513 -65966 -64419 -64304
-3532 -64304 -64188 -60435 -56682 -55791 -54900 -54427 -53953 -54911 -55869 -59123 -62377 -62768 -63160 -61658 -60155 -58653 -57151 -57498 -57845 -58191
-3512 -58191 -58538 -57349 -56160 -54971 -53782 -56052 -58322 -60949 -57852 -55183 -52511 -52347 -52179 -52701 -53219 -55172 -57121 -61445
-3494 -61445 -65765 -67226 -68683 -68057 -67427 -69664 -71896 -70197 -68493 -68225 -67953 -69563 -71170 -71348 -71524 -69392 -67256 -63693
-3476 -63693 -60126 -60677 -61225 -58914 -56600 -57859 -59116 -60372 -61628 -61754 -61877 -59615 -57353 -56734 -56111 -58829 -61546 -63968
-3458 -63968 -66387 -64513 -62638 -62902 -63163 -61993 -60823 -58672 -56518 -57703 -58888 -60032 -61173 -62314 -63454 -62779 -62101 -62854
-3440 -62854 -63607 -65307 -67002 -66317 -65627 -66999 -68367 -65444 -62519 -63383 -64244 -65109 -65970 -65135 -64296 -64893 -65485 -67193 -68896 -66309
-3420 -66309 -63719 -64084 -64446 -64811 -65172 -64569 -63961 -64788 -65612 -66141 -66667 -64811 -62951 -63983 -65016 -66048 -67077 -66499 -65922 -65344
$$ packed form
-3551f0282P08P12P12P12j558j555j554j554j692j689j688j689P23P27P27P27J547J547J15
-3532f4304J16L753L753Q91Q91M73M74r58r58l254l254l91l92J502J503J502J502l47l47l46
-3512e8191l47J189J189J189J189k270k270k627L097K669K672J64J68n22n18j953j949m324
-3494f1445m320j461j457O26O30k237k232J699J704K68K72j610j607j78j76K132K136L563
-3476f3693L567n51n48K311K314j259j257j256j256j26j23K262K262O19O23k718k717k422
-3458f3968k419J874J875k64k61J170J170K151K154j185j185j144j141j141j140O75O78p53
-3440f2854p53j700j695O85O90j372j368K923K925q64q61q65q61Q35Q39n97n92j708j703K587
-3420f6309K590l65l62l65l61O03O08q27q24n29n26J856J860j032j033j032j029N78N77N78
$$ plain form
-3400 -65344 -64762 -65459 -66156 -64468 -62776 -62220 -61665 -62541 -63413 -63413 -63413 -63413 -63409 -65646 -67882 -66779 -65672 -62757 -59842 -61221 -62597 -63141
-3378 -63141 -63685 -64229 -64770 -66082 -67390 -68702 -70010 -69623 -69231 -68844 -68452 -69794 -71132 -70089 -69041 -69578 -70111 -67308 -64501
-3359 -64501 -65474 -66443 -65985 -65523 -64259 -62992 -63160 -63324 -63685 -64043 -64405 -64762 -62232 -59697 -57166 -54632 -53972 -53308 -52649 -51985
-3339 -51985 -51117 -50245 -49376 -48504 -45817 -43126 -42824 -42518 -45108 -47695 -51717 -55735 -57915 -60092 -60841 -61587 -61441 -61292 -61147 -60998
-3319 -60998 -61180 -61359 -61542 -61721 -62649 -63573 -64501 -65426 -67606 -69787 -70536 -71281 -71703 -72124 -70159 -68191 -63708 -59224 -59034 -58840
-3299 -58840 -60707 -62574 -61400 -60223 -58206 -60961 -62642 -61456 -62302 -63148 -60476 -57800 -55545 -53290 -51035 -48776 -40915
-3282 -40915 -33054 -24001 -17806 -18037 -24944 -32570 -40192 -45045 -49894 -51408 -52917 -55064 -57207 -56969 -56726 -57472 -58214 -58959
-3264 -58959 -59701 -61687 -63670 -63271 -62869 -63186 -63499 -63816 -64129 -62642 -61151 -63003 -64852 -66376 -67897 -69421 -70942 -69981 -69015
$$ packed form
-3400f5344N82o97o97J688J692N56N55q76q72%%%Mk237k236J103J107K915K915j379j376n44
-3378f3141n44n44n41j312j308j312j308L87L92L87L92j342j338J043J048n37n33K803K807
-3359f4501r73r69M58M62J264J267j68j64l61l58l62l57K530K535K531K534O60O64O59O64
-3339e1985Q68Q72Q69Q72K687K691L02L06k590k587m022m018k180k177p49p46J46J49J45J49
-3319f0998j82j79j83j79r28r24r28r25k180k181p49p45m22m21J965J968M483M484J90J94
-3299e8840j867j867J174J177K017k755j681J186q46q46K672K676K255K255K255K259P861
-3282d0915P861R053O195k31o907p626p622m853m849j514j509k147k143K38K43p46p42p45
-3264e8959p42j986j983L99M02l17l13l17l13J487J491j852j849j524j521j524j521R61R66
$$ plain form
-3245 -69015 -68050 -67084 -66123 -65157 -64192 -63227 -62735 -62239 -61743 -61248 -62038 -62824 -60271 -57718 -56887 -56052 -55221 -54386 -51437 -48485 -46968
-3224 -46968 -45448 -46838 -48224 -52954 -57681 -64349 -71013 -73387 -75758 -76261 -76764 -77267 -77767 -76451 -75135 -73820 -72500 -69500
-3206 -69500 -66499 -63499 -60495 -60685 -60875 -63927 -66976 -68378 -69776 -69746 -69712 -71650 -73585 -70752 -67916 -67871 -67822 -69209 -70592
-3187 -70592 -68430 -66264 -66965 -67662 -66630 -65597 -64565 -63529 -62079 -60629 -59179 -57725 -57722 -57718 -57416 -57110 -60774 -59667 -57129
-3168 -57129 -59358 -61777 -64196 -64050 -63901 -64203 -64505 -64807 -65105 -64393 -63681 -62970 -62254 -63510 -64766 -66022 -67275 -64964 -62649
-3149 -62649 -63201 -63749 -62571 -61389 -63074 -64755 -66477 -68195 -65146 -62094 -59403 -56708 -58788 -60864 -60804 -60741 -63544 -66343
-3131 -66343 -66134 -65922 -65713 -65500 -64501 -63499 -63931 -64360 -65508 -66652 -64938 -63219 -63216 -63208 -61773 -60334 -60897 -61456 -62019 -62578 -66339
-3110 -66339 -70096 -67178 -64255 -66078 -67897 -68467 -69034 -65407 -64639 -68109 -66805 -64162 -66287 -65433 -64576 -62053 -59526 -59865
$$ packed form
-3245f9015R65R66R61R66R65R65M92M96M96M95p90p86K553K553Q31Q35Q31Q35K949K952J517
-3224d6968J520j390j386m730m727o668o664k374k371n03n03n03n00J316J316J315J320L000
-3206f9500L001L000L004j90j90l052l049j402j398L0L4j938j935K833K836M5M9j387j383
-3187g0592K162K166p01o97J032J033J032J036J450J450J450J454LML02L06l664J107K538
-3168e7129k229k419k419J46J49l02l02l02k98P12P12P11P16j256j256j256j253K311K315
-3149f2649n52n48J178J182j685j681j722j718L049L052K691K695k080k076O0O3k803k799
-3131f6343K09K12K09K13R99J002m32m29j148j144J714J719LQJ435J439n63n59n63n59l761
-3110f6339l757K918K923j823j819n70n67L627P68l470J304K643k125Q54Q57K523K527l39
$$ plain form
-3092 -59865 -60200 -59138 -58072 -58441 -58806 -63499 -68191 -68113 -68035 -68225 -68415 -68605 -68795 -69239 -69682 -70126 -70569 -69701 -68833 -67964 -67096 -68270
-3070 -68270 -69444 -70618 -71792 -71505 -71218 -70931 -70644 -69932 -69220 -69940 -70659 -72094 -73529 -72101 -70674 -68415 -66153 -62459 -58765
-3051 -58765 -59160 -59552 -59943 -60334 -60707 -61076 -61445 -61814 -62306 -62794 -67755 -72716 -78233 -78974 -75721 -72467 -70707 -68944 -67181 -65418
-3031 -65418 -67237 -69052 -70868 -72683 -74204 -75721 -72467 -69213 -69343 -69474 -69604 -69735 -64617 -59499 -59153 -58806 -60182 -61557
-3013 -61557 -64841 -65262 -61091 -61691 -62291 -62891 -63536 -64181 -61963 -59745 -60927 -62109 -60428 -58747 -59883 -61020 -62157 -63294
-2995 -63294 -65325 -67357 -69388 -71419 -70331 -69243 -68154 -67062 -66093 -65124 -61471 -62586 -66067 -69548 -70465 -71378 -70804 -70230
-2977 -70230 -66794 -63353 -59883 -56410 -59436 -62463 -62958 -60588 -58575 -61333 -64006 -66674 -64870 -63066 -62966 -62861 -61326 -59790
-2959 -59790 -60506 -61218 -60498 -59779 -62343 -64904 -65079 -65254 -63972 -62686 -63786 -64885 -66525 -68162 -68367 -68572 -66544 -64516 -64874
$$ packed form
-3092e9865l35J062J066l69l65m693m692P8P8j90j90j90j90m44m43m44m43Q68Q68Q69Q68j174
-3070f8270j174j174j174K87K87K87K87P12P12p20p19j435j435J428J427K259K262L694L694
-3051e8765l95l92l91l91l73l69l69l69m92m88m961m961n517p41L253L254J760J763J763J763
-3031f5418j819j815j816j815j521j517L254L254j30j31j30j31N118N118L46L47j376j375
-3013f1557l284m21M171o00o00o00o45o45K218K218j182j182J681J681j136j137j137j137
-2995f3294k031k032k031k031J088J088J089J092R69R69L653j115l481l481r17r13N74N74
-2977g0230L436L441L470L473l026l027m95K370K013k758k673k668J804J804J00J05J535J536
-2959e9790p16p12P20P19k564k561j75j75J282J286j100j099j640j637k05k05K028K028l58
$$ plain form
-2940 -64874 -65228 -63857 -62485 -62545 -62601 -65225 -67849 -69041 -70230 -69515 -68799 -66831 -64859 -65318 -68639 -70648 -67886 -65929 -63972
-2921 -63972 -63148 -62325 -63782 -65239 -66697 -68154 -68240 -68326 -68411 -68497 -70182 -71867 -71166 -70465 -68751 -67036 -65321 -63607 -63875 -64144
-2901 -64144 -66797 -69451 -69183 -68915 -68646 -68378 -66797 -65217 -66797 -68374 -67062 -62888 -60025 -61930 -63152 -64375 -61602 -58825
-2883 -58825 -59451 -60077 -60703 -61326 -60700 -60073 -59447 -58817 -59026 -59235 -59444 -59649 -59112 -58575 -55355 -56902 -56424 -55947 -60062 -64173 -66350
-2862 -66350 -68527 -68020 -67513 -69928 -67573 -66469 -65366 -66932 -68497 -67677 -66857 -66693 -66529 -64934 -63339 -63197 -63055 -65299 -67543
-2843 -67543 -68594 -69645 -67357 -65068 -62347 -59626 -59291 -58955 -58322 -57688 -59440 -61192 -60107 -59019 -59362 -59704 -60886 -62064
-2825 -62064 -61810 -61557 -59630 -57699 -57200 -56700 -56801 -56898 -58426 -59954 -63029 -66100 -66130 -66160 -63808 -66223 -69772 -70458 -72012 -70700
-2805 -70700 -66824 -65810 -64501 -63189 -62056 -60923 -61494 -62064 -62634 -63204 -63238 -63271 -61874 -60476 -63961 -67446 -66637 -65828 -64423
$$ packed form
-2940f4874l54J371J372o0n6k624k624j192j189P15P16J968J972m59l321k009K762J957J957
-2921f3972Q24Q23j457j457j458j457q6q6q5q6j685j685P01P01J714J715J715J714k68k69
-2901f4144k653k654K68K68K69K68J581J580j580j577J312M174K863j905j222j223K773K777
-2883e8825o26o26o26o23O26O27O26O30k09k09k09k05N37N37L220j547M78M77m115m111k177
-2862f6350k177N07N07k415K355J104J103j566j565Q20Q20J64J64J595J595J42J42k244k244
-2843f7543j051j051K288K289K721K721L35L36O33O34j752j752J085J088l43l42j182j178
-2825f2064K54K53J927J931M99N00j01r7j528j528l075l071l0l0K352k415l549o86j554J312
-2805g0700L876J014J309J312J133J133n71n70n70n70l4l3J397J398l485l485Q09Q09J405
$$ plain form
-2786 -64423 -63018 -63998 -64979 -68553 -72127 -71408 -70689 -69194 -67699 -70200 -72701 -76276 -75079 -71617 -68154 -64185 -64986 -68054
-2768 -68054 -68259 -68982 -69705 -70249 -70789 -71006 -71222 -73823 -76421 -72627 -68833 -68378 -67919 -69910 -71900 -73890 -75877 -75161 -74446 -74028
-2748 -74028 -73607 -72951 -77066 -81181 -80521 -77771 -75020 -71971 -68918 -69805 -70692 -71580 -72463 -72072 -71676 -71281 -70886 -70495 -70100 -69705
-2728 -69705 -69310 -67942 -66570 -65198 -63827 -64069 -64308 -63115 -61922 -59824 -57722 -58959 -60196 -62302 -64405 -65075 -65746 -64736
-2710 -64736 -63722 -62709 -61695 -61430 -61162 -60893 -60625 -62079 -63532 -64986 -66440 -68191 -69943 -68833 -67722 -67133 -66544 -65955 -65366
-2691 -65366 -63942 -62519 -61095 -59671 -62519 -65366 -63443 -61520 -58105 -54691 -51277 -47863 -49816 -51769 -53722 -55675 -56555
-2674 -56555 -57435 -58314 -59194 -60025 -60856 -61687 -62519 -66093 -69667 -70379 -71091 -71177 -71263 -68486 -65709 -66481 -67252 -66592 -65933 -66350 -66764 -67181
-2652 -67181 -67595 -67506 -67412 -67323 -67230 -64710 -62187 -62530 -62869 -63719 -64565 -63983 -63398 -63879 -64360 -64841 -65321 -67084 -68847 -65840 -62828 -62041
$$ packed form
-2786f4423J405r80r81l574l574P19P19J495J495k501k501l575J197L462L463L969q01l068
-2768f8054k05p23p23n44n40k17k16k601k598L794L794M55M59j991j990j990j987P16P15M18
-2748g4028M21O56m115m115O60K750K751L049L053q87q87q88q83L91L96L95L95L91L95L95
-2728f9705L95J368J372J372J371k42k39J193J193K098K102j237j237k106k103o70o71J010
-2710f4736J014J013J014K65K68K69K68j454j453j454j454j751j752J110J111N89N89N89N89
-2691f5366J424J423J424J424k848k847J923J923L415L414L414L414j953j953j953j953q80
-2674e6555q80q79q80q31q31q31q32l574l574p12p12q6q6K777K777p72p71O60O59m17m14m17
-2652f7181m14Q9R4Q9R3K520K523l43l39q50q46N82N85m81m81m81m80j763j763L007L012P87
$$ plain form
-2630 -62041 -61255 -60469 -59682 -59611 -59540 -58754 -63689 -68408 -67398 -69969 -72537 -74632 -76723 -74043 -71363 -69403 -67439 -65478 -63514
-2611 -63514 -61911 -60305 -58698 -57092 -56857 -56622 -61158 -65690 -65992 -66294 -64091 -61885 -59145 -62131 -66667 -71199 -69623 -68046
-2593 -68046 -66469 -64889 -65072 -65254 -66868 -68478 -66365 -64252 -65001 -65746 -64274 -62802 -61330 -59854 -63957 -68061 -70733 -73402
-2575 -73402 -72564 -71725 -73749 -75769 -77047 -78322 -74830 -71334 -71367 -71401 -68572 -65739 -66727 -67711 -68698 -69682 -69556 -69425 -69295 -69164
-2555 -69164 -69034 -68903 -68773 -68642 -69284 -69921 -70558 -71196 -70223 -69250 -68277 -67304 -70476 -73648 -72049 -70446 -69205 -67964 -66723 -65478
-2535 -65478 -68389 -71300 -69440 -67576 -67983 -68389 -68795 -69198 -70711 -72221 -67051 -61881 -62888 -63890 -66324 -68758 -68654 -68546
-2517 -68546 -68437 -68329 -67480 -66626 -65772 -64919 -63514 -62105 -60696 -59287 -60297 -61303 -60879 -60454 -61777 -63096 -61553 -60010 -61125
-2498 -61125 -62235 -63346 -64457 -66779 -69097 -68553 -68009 -68661 -69310 -69958 -70607 -68560 -66510 -67323 -68136 -67073 -66007 -66373 -66738
$$ packed form
-2630f2041P86P86P87P1P1P86m935m719J010k571k568k095k091K680K680J960J964J961J964
-2611f3514J603J606J607J606K35K35m536m532l02l02K203K206K740k986m536m532J576J577
-2593f8046J577J580j83j82j614j610K113K113p49p45J472J472J472J476m103m104k672k669
-2575g3402Q38Q39k024k020j278j275L492L496l3l4K829K833r88r84r87r84J26J31J30J31
-2555f9164J30J31J30J31o42o37o37o38R73R73R73R73l172l172J599J603J241J241J241J245
-2535f5478k911k911J860J864m07m06m06m03j513j510N170N170j007j002k434k434J04J08
-2517f8546J09J08Q49Q54Q54Q53J405J409J409J409j010j006M24M25j323j319J543J543j115
-2498f1125j110j111j111k322k318N44N44o52o49o48o49K047K050q13q13J063J066l66l65
$$ plain form
-2479 -66738 -66421 -66100 -68642 -71184 -70987 -70786 -67722 -64658 -63715 -62768 -60390 -58012 -57576 -57136 -55265 -53394 -54654 -55910 -55735
-2460 -55735 -55560 -56492 -57420 -56916 -56413 -56570 -56723 -59738 -62753 -63208 -63659 -64110 -64561 -62899 -61233 -62910 -64583 -62742 -60897 -59056
-2440 -59056 -57211 -57323 -57431 -59928 -62422 -61072 -59719 -58370 -57017 -57006 -56991 -56980 -56965 -57878 -58788 -59701 -60610 -60271 -59928 -61020 -62109
-2419 -62109 -63529 -64945 -63025 -61102 -59376 -57651 -57356 -57058 -54945 -52831 -54058 -55280 -54956 -54632 -54307 -53979 -55086 -56193
-2401 -56193 -57300 -58404 -56972 -55541 -56495 -57446 -57535 -57625 -61054 -64479 -67118 -69757 -70010 -70260 -68665 -67070 -64043 -61013 -57114
-2382 -57114 -53215 -52954 -52693 -52820 -57718 -61363 -65008 -64822 -64636 -64449 -64263 -66641 -69019 -69787 -65784 -65936 -66089 -65944 -65799 -66369
-2362 -66369 -66939 -67509 -68080 -66742 -65403 -66451 -67498 -67234 -66969 -64319 -61669 -61356 -61043 -60729 -60416 -59209 -58001 -59179 -60357
-2343 -60357 -58568 -56779 -54989 -53200 -51292 -49384 -49861 -50338 -51754 -53171 -54587 -56003 -58195 -60387 -62578 -64770 -65448 -66127
$$ packed form
-2479f6738L17L21k542k542J97K01L064L064R43R47K378K378M36M40J871J871j260j256J75
-2460e5735J75r32r28N04N03j57j53l015l015m55m51m51m51J662J666j677j673J841J845J841
-2440e9056J845j12j08k497k494J350J353J349J353J1J5J1J5r13r10r13r09L39L43j092j089
-2419f2109j420j416J920J923J726J725K95K98K113K114j227j222L24L24L25L28j107j107
-2401e6193j107j104J432J431r54r51q9r0l429l425k639k639k53k50J595J595L027L030L899
-2382e7114L899K61K61j27m898l645l645J86J86J87J86k378k378p68M003j52j53J45J45n70
-2362f6369n70n70n71J338J339j048j047K64K65K650K650L13L13L14L13J207J208j178j178
-2343f0357J789J789J790J789J908J908m77m77j416j417j416j416k192k192k191k192o78o79
$$ plain form
-2325 -66127 -63465 -60804 -59604 -58404 -59589 -60774 -61248 -61717 -59805 -57889 -57468 -57043 -56622 -56197 -56350 -56499 -56652 -56801 -57312 -57818
-2305 -57818 -56301 -54781 -50196 -51333 -57900 -58739 -59939 -63998 -67524 -71047 -71099 -71147 -69828 -65642 -63279 -66637 -68210 -66917
-2287 -66917 -65336 -63756 -63428 -63100 -65366 -67632 -66559 -65485 -63585 -61684 -63122 -64561 -68206 -71852 -72157 -72463 -72694 -72925
-2269 -72925 -71725 -70525 -70189 -69854 -69518 -69183 -67312 -65441 -65895 -69213 -72530 -70122 -69682 -69243 -70379 -71516 -72653 -73790 -74658
-2250 -74658 -75527 -74010 -72493 -74807 -77122 -76097 -75072 -72437 -69802 -71460 -73119 -72668 -72217 -70335 -68452 -67644 -66835 -66026
-2232 -66026 -65217 -64267 -63316 -62366 -61415 -61389 -61363 -61337 -61311 -60483 -59652 -60256 -60856 -61162 -61464 -63201 -64934 -64747 -64557 -64371 -64181 -63786 -63387
-2209 -63387 -64423 -65456 -66846 -68232 -68191 -68147 -68583 -69015 -68020 -67021 -66637 -66250 -63480 -60707 -59160 -57610 -58448 -59283 -60495 -61706
-2189 -61706 -62917 -64129 -63939 -63749 -63558 -63368 -63283 -63197 -63111 -63025 -63298 -63570 -63842 -64114 -64367 -64621 -64874 -65128 -66753 -68378 -70003 -71628
$$ packed form
-2325f6127K662K661J200J200j185j185m74m69J912J916M21M25M21M25j53j49j53j49n11n06
-2305e7818J517J520M585j137o567q39j200m059l526l523n2m8J319M186K363l358j573J293
-2287f6917J581J580L28L28k266k266J073J074J900J901j438j439l645l646l05l06k31k31
-2269g2925J200J200L36L35L36L35J871J871m54l318l317K408M40M39j136j137j137j137q68
-2250g4658q69J517J517k314k315J025J025K635K635j658j659M51M51J882J883Q08Q09Q09
-2232f6026Q09R50R51R50R51K6K6K6K6Q28Q31o04o00l06l02j737j733J87J90J86J90L95L99
-2209f3387j036j033j390j386M1M4m36m32R95R99L84L87K770K773J547J550q38q35j212j211
-2189f1706j211j212J90J90J91J90Q5Q6Q6Q6k73k72k72k72k53k54k53k54j625j625j625j625
$$ plain form
-2167 -71628 -73387 -75147 -74043 -72940 -71419 -69899 -68378 -66857 -68281 -69701 -71125 -72545 -71643 -70737 -66973 -63204 -65567
-2150 -65567 -67927 -70290 -72649 -72001 -71348 -69567 -67781 -64091 -65169 -69947 -71859 -70614 -69366 -69373 -69377 -70391 -71401 -69552 -67699
-2131 -67699 -66566 -65430 -65728 -66022 -66656 -67286 -65351 -63417 -62440 -66231 -68948 -68803 -66954 -65102 -61818 -63305 -63335 -63361 -61002
-2112 -61002 -58642 -60841 -65899 -69347 -68024 -65869 -66574 -65370 -64166 -63652 -63134 -65478 -67822 -68769 -69712 -67793 -65873 -65597
-2094 -65597 -65318 -63607 -61896 -60278 -58657 -57036 -55414 -54378 -53338 -57069 -60800 -60182 -59559 -61799 -64039 -67301 -70558 -67137
-2076 -67137 -63715 -63696 -63674 -63652 -63629 -64781 -65929 -64214 -62500 -62399 -62295 -62191 -62086 -63845 -65601 -67357 -69112 -68337 -67558 -68210 -68862
-2055 -68862 -69645 -70424 -68341 -66257 -64744 -63227 -61710 -60193 -59902 -59608 -62176 -64744 -63976 -63204 -63864 -64524 -65649 -66771 -66462
-2036 -66462 -66153 -68590 -71024 -68687 -66350 -66365 -66376 -66387 -66399 -65336 -64274 -66074 -67875 -67845 -67811 -67778 -67744 -69500 -71255 -73011 -74766
$$ packed form
-2167g1628j759j760J104J103J521J520J521J521j424j420j424j420R02R06L764L769k363
-2150f5567k360k363k359O48O53J781J786L690j078m778j912J245J248pmj014j010J849J853
-2131f7699J133J136k98k94o34o30J935J934R77l791k717J45J849J852L284j487l0k6K359
-2112f1002K360k199n058l448J323K155p05J204J204N14N18k344k344r47r43J919J920K76
-2094f5597K79J711J711J618J621J621J622J036J040l731l731O18O23k240k240l262l257L421
-2076f7137L422J9K2K2K3j152j148J715J714J01J04J04J05j759j756j756j755P75P79o52o52
-2055f8862p83p79K083K084J513J517J517J517K91K94k568k568P68P72o60o60j125j122L09
-2036f6462L09k437k434K337K337j5j1j1j2J063J062j800j801L0L4L3L4j756j755j756j755
$$ plain form
-2015 -74766 -74509 -74248 -71125 -68001 -66667 -65333 -63998 -62664 -63227 -63786 -61482 -59179 -60096 -61013 -61930 -62847 -64106 -65362 -63760
-1996 -63760 -62153 -64785 -67412 -65273 -63130 -60662 -58191 -60495 -62794 -62623 -62448 -63708 -64964 -63901 -62835 -61773 -60707
-1979 -60707 -60420 -60129 -59842 -59552 -59429 -59302 -60610 -61915 -61553 -61188 -63689 -66186 -66451 -66712 -65545 -64375 -63596 -62813 -64893 -66973
-1959 -66973 -64807 -62638 -63335 -64028 -65649 -67267 -67453 -67640 -67882 -68121 -68363 -68601 -69321 -70036 -65981 -61926 -62377 -62824 -61844 -60860
-1939 -60860 -61132 -61400 -62921 -64442 -63954 -60603 -56178 -56521 -58687 -60852 -64569 -68281 -70305 -69466 -65288 -63968 -63398 -62828 -64047
-1920 -64047 -62399 -60759 -59119 -59686 -60249 -59473 -58698 -58102 -57502 -56391 -58143 -59895 -58780 -59190 -59600 -62217 -64829 -65586 -66343
-1901 -66343 -67099 -67856 -68941 -70025 -71289 -69690 -68628 -67565 -68710 -69854 -68016 -66179 -64341 -62504 -62023 -61542 -61061 -60580
-1883 -60580 -63052 -65523 -64654 -63786 -63409 -63033 -62656 -62280 -61725 -61169 -62045 -62921 -62556 -62191 -61825 -61460 -61303 -61147 -61169 -58329 -58173 -58016
$$ packed form
-2015g4766K57K61L123L124J334J334J335J334n63n59K304K303r17r17r17r17j259j256J602
-1996f3760J607k632k627K139K143K468K471k304k299J71J75j260j256J063J066J062J066
-1979f0707K87K91K87K90J23J27j308j305L62L65k501k497k65k61J167J170P79P83k080k080
-1959f6973K166K169o97o93j621j618j86j87k42k39k42k38p20p15M055M055m51m47R80R84
-1939f0860k72k68j521j521M88L351M425l43k166k165l717l712k024Q39M178J320N70N70j219
-1920f4047J648J640J640n67n63P76P75N96O00J111j752j752J115m10m10k617k612p57p57
-1901f6343p56p57j085j084j264J599J062J063j145j144J838J837J838J837M81M81M81M81
-1883f0580k472k471Q69Q68L77L76L77L76N55N56q76q76L65L65L66L65J57J56k2K840J56J57
$$ plain form
-1861 -58016 -57502 -59850 -60439 -61028 -63406 -62921 -62601 -62280 -63212 -64144 -63972 -63801 -65061 -66320 -68430 -70540 -69190 -64979 -62854
-1842 -62854 -63592 -64926 -66261 -68847 -71430 -70678 -69921 -67677 -65430 -66525 -67617 -68728 -69835 -71125 -69548 -68393 -67234 -69895
-1824 -69895 -69690 -66518 -63342 -62556 -61766 -61576 -64244 -63577 -60044 -59570 -59093 -60528 -61959 -64498 -62261 -61281 -60297 -60864 -61430 -62176
-1804 -62176 -62921 -63637 -67215 -70972 -69004 -67781 -66559 -63547 -60536 -60506 -60476 -62832 -65187 -65627 -66067 -65075 -64084 -64047 -64009 -66358
-1784 -66358 -68706 -68758 -68810 -65523 -62235 -60200 -58165 -59470 -60774 -60267 -59757 -52865 -51698 -52474 -56108 -56939 -54907 -54557 -57066
-1765 -57066 -57785 -58504 -59108 -59708 -60308 -60908 -62142 -63372 -63171 -62970 -59283 -55593 -56197 -56801 -59839 -62873 -60659 -58445 -57039
-1746 -57039 -55631 -58515 -61400 -61568 -61736 -61904 -62068 -63189 -64311 -65433 -66551 -65430 -64308 -64617 -64923 -66633 -68344 -67670 -66991
-1727 -66991 -66414 -65836 -69552 -73264 -73969 -74673 -72992 -71307 -71065 -70823 -70581 -70335 -70659 -70983 -69697 -68408 -69790 -68307 -63786
$$ packed form
-1861e8016N14k348n89n89k378M85L20L21r32r32J72J71j260j259k110k110J350M211K125
-1842f2854p38j334j335k586k583P52P57K244K247j095j092j111j107j290J577J155J159k661
-1824f9895K05L172L176P86P90J90k668O67L533M74M77j435j431k539K237R80R84n67n66p46
-1804f2176p45p16l578l757J968J223J222L012L011L0L0k356k355m40m40R92R91L7L8k349
-1784f6358k348n2n2L287L288K035K035j305j304N07N10O892J167p76l634q31K032L50k509
-1765e7066p19p19o04o00o00o00j234j230K01K01L687L690o04o04l038l034K214K214J406
-1746e7039J408k884k885j68j68j68j64j121j122j122j118J121J122l09l06j710j711O74O79
-1727f6991N77N78l716l712p05p04J681J685K42K42K42K46l24l24J286J289j382J483M521
$$ plain form
-1708 -63786 -64986 -64103 -63216 -64121 -65023 -66749 -68471 -67811 -67148 -64222 -61292 -63435 -65575 -67185 -65929 -64319 -68430 -72157
-1690 -72157 -73018 -72511 -72001 -71211 -70417 -69626 -68833 -67834 -66831 -65832 -64829 -64837 -64841 -64550 -64255 -64949 -60867 -62157 -63443 -62071 -65467
-1669 -65467 -67793 -67252 -69011 -70767 -69962 -69153 -69052 -68948 -64554 -60155 -58624 -57088 -55556 -54020 -54799 -55575 -56354 -57129 -58892
-1650 -58892 -60651 -60029 -59403 -60442 -61479 -60726 -62835 -66112 -66522 -67289 -68057 -65489 -62917 -62731 -62545 -60513 -58478 -59127 -62638
-1631 -62638 -61590 -60539 -63961 -67383 -66455 -65523 -66797 -68072 -72332 -73726 -70827 -70789 -70070 -69347 -67371 -65396 -64356 -63316
-1613 -63316 -62276 -61236 -60763 -60290 -61069 -61848 -64438 -64166 -60256 -56346 -55358 -54371 -55768 -57166 -57073 -56980 -58318 -59656 -58609 -57561
-1593 -57561 -59854 -62146 -61799 -61453 -63491 -65530 -66406 -67282 -69768 -69392 -66592 -63793 -63201 -62608 -62910 -63212 -60174 -57136 -57759
-1574 -57759 -58381 -60793 -60342 -59861 -62243 -64624 -64144 -62914 -64546 -64390 -64233 -61691 -59149 -61855 -64561 -66074 -67588 -67670 -64889
$$ packed form
-1708f3786j200Q83Q87r05r02j726j722O60O63K926K930k143k140j610J256J610m111l727
-1690g2157q61N07N10P90P94P91P93R99J003R99J003qmK91K95o94M082j290j286J372l396
-1669f5467k326N41j759j756Q05Q09J01J04M394M399J531J536J532J536p79p76p79p75j763
-1650e8892j759O22O26j039j037P53k109l277m10p67p68K568K572J86J86K032K035o49l511
-1631f2638J048J051l422l422R28R32j274j275m260j394K899L8P19P23J976J975J040J040
-1613f3316J040J040M73M73p79p79k590K72L910L910R88R87j397j398R3R3j338j338J047J048
-1593e7561k293k292L47L46k038k039q76q76k486L76K800K799N92N93l02l02L038L038o23
-1574e7759o22k412M51M81k382k381M80J230j632J56J57K542K542k706k706j513j514q2K781
$$ plain form
-1555 -64889 -62794 -65471 -69280 -70227 -68982 -67733 -64699 -64524 -65157 -65787 -66421 -67051 -67938 -65959 -63983 -64867 -65664 -66458 -70115
-1536 -70115 -69000 -67714 -66428 -68184 -69936 -68859 -67781 -70044 -72303 -70920 -69537 -69585 -69630 -67562 -65489 -67416 -66477 -66768
-1518 -66768 -67058 -67170 -67278 -67122 -66965 -65198 -66291 -67088 -67886 -69041 -70193 -65713 -64095 -65936 -67774 -68355 -66071 -65400 -64725
-1499 -64725 -62414 -60100 -61128 -62153 -62802 -63447 -65348 -67245 -68370 -66630 -66503 -66373 -65489 -64606 -63722 -62835 -62131 -61423 -62328 -60368
-1479 -60368 -59798 -59224 -60264 -58437 -57569 -59559 -61016 -62470 -66138 -66943 -65064 -63182 -62466 -61747 -61031 -60312 -59872 -59429 -62984
-1460 -62984 -63674 -64636 -65594 -66197 -66797 -67696 -65728 -65374 -65016 -66988 -68956 -70927 -72895 -70745 -68590 -66440 -64285 -65355 -66421
-1441 -66421 -67491 -68557 -67360 -66160 -64960 -63760 -63905 -64047 -62578 -63972 -64505 -65034 -64967 -62038 -60722 -59403 -60290 -61177 -61404
-1422 -61404 -61628 -61851 -62075 -63048 -64017 -62123 -60230 -59414 -58594 -60636 -62679 -64546 -66410 -65411 -64412 -65743 -67070 -68400 -69727
$$ packed form
-1555f4889K095k677l809r47J245J249L034J75o33o30o34o30q87J979J976q84p97p94l657
-1536g0115J115J286J286j756j752J077J078k263k259J383J383m8m5K068K073j927R39k91
-1518f6768k90j12j08J56J57J767j093p97p98j155j152M480J618j841j838n81K284O71O75
-1499f4725K311K314j028j025o49o45j901j897j125J740J27J30Q84Q83Q84Q87P04P08r05J960
-1479f0368N70N74j040J827Q68j990j457j454l668q05J879J882P16P19P16P19M40M43l555
-1460f2984o90r62r58o03o00q99J968L54L58j972j968j971j968K150K155K150K155j070j066
-1441f6421j070j066J197J200J200J200j45j42J469j394n33n29O7K929J316J319q87q87k27
-1422f1404k24k23k24r73r69J894J893Q16Q20k042k043j867j864R99R99j331j327j330j327
$$ plain form
-1403 -69727 -69686 -69641 -66738 -63831 -65922 -68009 -67237 -66462 -66406 -66346 -66291 -66231 -65295 -64360 -63424 -62485 -63219 -63954 -64688 -65418 -65303 -65187 -65072
-1380 -65072 -64952 -64777 -64602 -64427 -64248 -62172 -60096 -62791 -65482 -65851 -66220 -66589 -66954 -65936 -64919 -63901 -62880 -62578 -62276 -61974
-1360 -61974 -61669 -63216 -64759 -66302 -67845 -65336 -62824 -65083 -67342 -67875 -68404 -66071 -63737 -64032 -64323 -64613 -64904 -63954 -62999
-1341 -62999 -62045 -61091 -62287 -63480 -64673 -65866 -64624 -63380 -62135 -60890 -61617 -62340 -63063 -63786 -65362 -66939 -65653 -64364
-1323 -64364 -66656 -68948 -68378 -67804 -66361 -64919 -63476 -62030 -62556 -63081 -63607 -64129 -62757 -61385 -60014 -58638 -57804 -56969 -58996
-1304 -58996 -61020 -59529 -58038 -56547 -55053 -55590 -56126 -56663 -57196 -55563 -53927 -55336 -56741 -57673 -61464 -66868 -66544 -66134 -65720
-1285 -65720 -64952 -64181 -64904 -65623 -66346 -67066 -68102 -69134 -67308 -65478 -64546 -63611 -67450 -71285 -71486 -71684 -69023 -66358 -66499 -66637
-1265 -66637 -66779 -66917 -65765 -64613 -66324 -68035 -65989 -63942 -62254 -60565 -58370 -61900 -65608 -63592 -61039 -61348 -62552 -63756
$$ packed form
-1403f9727M1M5K903K907k091k087P72P75N6O0N5O0R36R35R36R39p34p35p34p30J15J16J15
-1380f5072J20J75J75J75J79K076K076k695k691l69l69l69l65J018J017J018J021L02L02L02
-1360f1974L05j547j543j543j543K509K512k259k259n33n29K333K334k95k91k90k91R50R55
-1341f2999R54R54j196j193j193j193J242J244J245J245p27p23p23p23j576j577J286J289
-1323f4364k292k292N70N74J443J442J443J446n26n25n26n22J372J372J371J376Q34Q35k027
-1304e8996k024J491J491J491J494n37n36n37n33J633J636j409j405r32l791n404L24M10M14
-1285f5720P68P71p23p19p23p20j036j032J826J830R32R35l839l835k01j98K661K665j41j38
-1265f6637j42j38J152J152j711j711K046K047J688J689K195l530l708K016K553l09j204j204
$$ plain form
-1247 -63756 -63965 -64173 -61877 -59578 -58892 -63931 -68970 -68281 -64405 -60528 -61065 -61598 -61598 -61598 -61598 -61594 -62086 -62578 -63070 -63558 -63335 -63111 -62888
-1224 -62888 -62660 -63868 -65075 -66283 -67487 -66846 -66205 -65564 -64919 -65310 -65702 -63230 -60759 -60077 -59395 -58713 -58031 -58616 -59201 -62649
-1204 -62649 -66097 -63700 -61303 -61769 -62235 -62541 -62843 -63145 -63447 -64468 -65485 -66503 -67521 -68751 -69977 -71740 -67778 -63760
-1186 -63760 -62601 -62336 -62071 -62425 -62776 -63126 -63476 -61863 -60245 -58627 -57010 -58467 -59921 -61374 -62828 -63093 -63353 -63614 -63875
-1167 -63875 -64460 -65046 -65631 -66216 -65042 -63868 -62694 -61520 -63163 -64807 -65020 -65232 -63804 -62377 -63335 -64293 -63804 -63316 -64259 -65202
-1147 -65202 -65489 -65776 -66063 -66350 -66235 -66119 -66004 -65888 -65415 -64941 -65899 -66857 -68974 -71088 -68911 -66730 -63808 -60882 -56529 -52172
-1127 -52172 -53409 -54643 -55880 -57114 -58262 -59406 -60554 -61699 -61054 -60405 -59760 -59112 -58706 -58296 -56458 -54617 -55597 -56574 -59939
-1108 -59939 -63301 -64043 -64781 -63137 -61490 -62358 -63227 -65526 -67822 -67707 -67591 -67476 -67357 -69060 -70763 -68173 -65579 -65314 -65049
$$ packed form
-1247f3756k09k08K296K299O86n039n039O89L876L877n37n33%%%Mm92m92m92m88K23K24K23
-1224f2888K28j208j207j208j204O41O41O41O45l91l92K472K471O82O82O82O82n85n85l448
-1204f2649l448K397K397m66m66l06l02l02l02j021j017j018j018j230j226j763L962M018
-1186f3760J159K65K65l54l51l50l50J613J618J618J617j457j454j453j454k65k60k61k61
-1167f3875n85n86n85n85J174J174J174J174j643j644k13k12J428J427r58r58M89M88r43r43
-1147f5202k87k87k87k87J15J16J15J16M73M74r58r58k117k114K177K181K922K926M353M357
-1127e2172j237j234j237j234j148j144j148j145O45O49O45O48M06M10J838J841r80r77l365
-1108e9939l362p42p38J644J647q68q69k299k296J15J16J15J19j703j703K590K594K65K65
$$ plain form
-1089 -65049 -66216 -67379 -68497 -69615 -70733 -71848 -67122 -62396 -61009 -59619 -58978 -58337 -57695 -57051 -58288 -59526 -60763 -61997
-1071 -61997 -62217 -62437 -62656 -62873 -62377 -61881 -61385 -60886 -61933 -62981 -64028 -65072 -68505 -71937 -72031 -72120 -69213 -66305 -65784 -65258
-1051 -65258 -62709 -60159 -59995 -59827 -60088 -60349 -62996 -65638 -65810 -65981 -63767 -61549 -60815 -60081 -59347 -58612 -59220 -59827 -61866 -63905
-1031 -63905 -62552 -61199 -61933 -62668 -64654 -61870 -59384 -56898 -55653 -54408 -55549 -56689 -55892 -55094 -55727 -56361 -56972 -57584 -58195
-1012 -58195 -58806 -59358 -59909 -62847 -65784 -65351 -64919 -64487 -64050 -62425 -60800 -61561 -62317 -63078 -63838 -64598 -65355 -67875 -70394 -68620
-992 -68620 -66842 -63275 -59708 -62343 -64975 -65195 -65415 -63249 -61080 -61822 -62563 -63305 -64043 -65948 -67852 -66417 -64979 -62675 -60368
-973 -60368 -60450 -60528 -62220 -63909 -62261 -60610 -59440 -58266 -58527 -58784 -58896 -59004 -60547 -62086 -61348 -60606 -59868 -59127 -60804 -62478
-953 -62478 -62246 -64874 -66164 -62679 -60450 -61080 -59119 -57155 -58713 -60267 -58918 -57565 -56510 -55455 -54345 -58001 -64043 -65314
$$ packed form
-1089f5049j167j163j118j118j118j115M726M726J387J390O41O41O42O44j237j238j237j234
-1071f1997k20k20k19k17M96M96M96M99j047j048j047j044l433l432r4q9K907K908N21N26
-1051f5258K549K550J64J68k61k61k647k642j72j71K214K218P34P34P34P35o08o07k039k039
-1031f3905J353J353p34p35j986K784K486K486J245J245j141j140P97P98o33o34o11o12o11
-1012e8195o11n52n51k938k937M33M32M32M37J625J625p61p56p61p60p60p57k520k519J774
-992f8620J778L567L567k635k632k20k20K166K169p42p41p42p38j905j904J435J438K304K307
-973f0368q2p8j692j689J648J651J170J174k61k57j12j08j543j539P38P42P38P41j677j674
-953f2478K32k628j290L485K229o30J961J964j558j554J349J353J055J055J110l656o042j271
$$ plain form
-935 -65314 -65307 -65295 -64986 -64677 -62970 -61259 -63842 -66425 -65247 -64065 -65269 -66473 -64073 -61669 -61650 -61631 -63055 -64475 -65895 -67316
-915 -67316 -68560 -69802 -68657 -67513 -66835 -66156 -65478 -64796 -67129 -69462 -70364 -71263 -69831 -68400 -68221 -68039 -67144 -63387 -59272
-896 -59272 -60879 -65139 -66537 -65668 -61933 -60528 -64848 -63383 -61915 -63722 -65530 -63998 -62463 -61527 -60592 -62996 -65396 -64311
-878 -64311 -63227 -64528 -65825 -66261 -66697 -67133 -67565 -65444 -63324 -61918 -66235 -68318 -64677 -63003 -64188 -64926 -65664 -66581 -67494
-859 -67494 -69604 -71714 -71438 -71158 -70391 -69623 -66469 -63312 -63886 -64460 -68016 -71568 -73372 -69448 -65348 -66969 -66566 -63298 -61822
-840 -61822 -63204 -63249 -63290 -63514 -63734 -64315 -64893 -65474 -66052 -65303 -64550 -62369 -60185 -61702 -63216 -62347 -61475 -62075 -62671 -63271 -63868 -64200
-818 -64200 -64528 -61520 -58508 -60744 -62977 -61870 -60763 -60077 -59388 -61084 -62779 -63711 -64639 -66999 -69358 -67696 -66030 -64364
-800 -64364 -62697 -62120 -61538 -58571 -55604 -57233 -58858 -60483 -62109 -65810 -69507 -69865 -70223 -69869 -69511 -69153 -68795 -67588 -66376
$$ packed form
-935f5314PJ2L09L09J707J711k583k583J178J182j204j204K400K404J9J9j424j420j420j421
-915f7316j244j242J145J144O78O79O78O82k333k333r02q99J432J431J79J82Q95L757M115
-896e9272j607m260j398Q69L735J405m320J465J468j807j808J532J535R36R35k404k400J085
-878f4311J084j301j297m36m36m36m32K121K120J406m317k083L641J674j185p38p38r17r13
-859f7494k110k110K76K80P67P68L154L157n74n74l556l552j804L924M100j621M03L268J476
-840f1822j382m5m1k24k20n81n78n81n78P49P53K181K184j517j514Q69Q72o00n96o00n97l32
-818f4200l28L008L012k236k233J107J107O86O89j696j695r32r28k360k359J662J666J666
-800f4364J667N77N82K967K967j629j625j625j626l701l697l58l58L54L58L58L58J207J212
$$ plain form
-781 -66376 -63913 -61449 -60599 -62608 -64796 -64121 -62153 -63044 -63577 -64110 -63126 -62138 -64490 -66842 -67893 -68941 -68557 -68173 -68568 -68959
-761 -68959 -68575 -65329 -65724 -66115 -64897 -63678 -62164 -60647 -59906 -62027 -64050 -66074 -66071 -66067 -61680 -60155 -58452 -56749 -58519 -60290
-741 -60290 -63670 -64188 -63007 -61825 -61896 -61967 -60722 -59477 -60618 -61758 -59678 -57599 -55340 -55944 -56503 -57062 -61139 -65217 -65239 -65262
-721 -65262 -65284 -65307 -66041 -66775 -67330 -67882 -69690 -68635 -63286 -60797 -63760 -66723 -69388 -67278 -65053 -65690 -65851 -66007 -66756 -67506
-701 -67506 -66704 -63037 -59432 -58691 -57710 -59589 -63380 -64308 -63685 -63059 -62138 -61218 -61728 -62235 -63611 -64982 -64923 -64863 -63137 -61408 -63972
-680 -63972 -66537 -66756 -66973 -63193 -62276 -61751 -61221 -60871 -60521 -62202 -63879 -62217 -60554 -60208 -59857 -59507 -59157 -62090 -65020 -64610
-660 -64610 -64200 -64211 -64218 -64226 -64233 -66130 -68024 -67535 -67043 -64975 -62902 -63219 -63532 -60644 -57751 -58202 -58650 -60353 -62053 -63756 -65456 -63443
-638 -63443 -61426 -59414 -57397 -58128 -58855 -59585 -60312 -59030 -57744 -56462 -55176 -51538 -47896 -49507 -51113 -53048 -54978 -56913
$$ packed form
-781f6376K463K464Q50k009k188O75J968q91n33n33R84R88k352k352j051j048L84L84l95l91
-761f8959L84L246l95l91J218J219J514J517P41k121k023k024LMM387J525J703J703j770j771
-741f0290l380n18J181J182p1p1J245J245j141j140K080K079K259o04n59n59m077m078k2k3
-721f5262k2k3p34p34n55n52j808J055N349K489k963k963k665K110K225o37j61j56p49p50
-701f7506Q02L667L605P41R81j879l791r28O23O26R21R20n10n07j376j371N9O0J726J729k564
-680f3972k565k19k17L780R17N25N30L50L50j681j677J662J663L46L51L50L50k933k930M10
-660f4610M10j1pqpj897j894M89M92K068K073l17l13K888K893m51m48j703j700j703j700K013
-638f3443K017K012K017p31p27p30p27J282J286J282J286L638L642j611j606j935j930j935
$$ plain form
-620 -56913 -58843 -57886 -56924 -55966 -55004 -52362 -49715 -47073 -44426 -41903 -39376 -34765 -27288 -15398 2219 24426 56179
-603 56179 97350 155701 215956 236139 202989 145033 88506 41523 10759 -10460 -24884 -33580 -39920 -46257
-589 -46257 -49850 -53443 -54535 -55623 -58143 -60662 -62157 -63648 -63708 -63767 -62697 -61624 -60551 -59477 -58795 -58109 -57423 -56738 -58232
-570 -58232 -59723 -61214 -62705 -60756 -58802 -59235 -59667 -60073 -60476 -59447 -58419 -59171 -59921 -59242 -58560 -59999 -61434 -61441 -61445 -60081 -58713
-549 -58713 -57349 -55981 -57748 -59511 -61277 -63040 -58821 -54598 -50379 -46156 -45485 -44810 -44139 -43465 -46842 -50215 -51206 -52194 -54259
-530 -54259 -56320 -58385 -60446 -62664 -64878 -62802 -60722 -58378 -56029 -57025 -58016 -59362 -60703 -58709 -56711 -57401 -58087 -58776
-512 -58776 -59462 -59984 -60502 -61024 -61542 -60334 -59123 -59347 -59567 -60163 -60756 -63737 -66715 -69101 -71483 -69574 -67662 -67394 -67122 -63510
-492 -63510 -59898 -61031 -62161 -60905 -59649 -61005 -62358 -63711 -65064 -64364 -63659 -64386 -65113 -63722 -62332 -64282 -66231 -65318
$$ packed form
-620e6913j930R57R62R58R62K642K647K642K647K523K527M611P477J1890J7617K2207L1753
-603E6179M1171N8351O0255K0183l3150n7956n6527m6983l0764k1219j4424q696o340o337
-589d6257l593l593j092j088k520k519j495j491o0n9J070J073J073J074O82O86O86O85j494
-570e8232j491j491j491J949J954m33m32m06m03J029J028p52p50O79O82j439j435pmJ364J368
-549e8713J364J368j767j763j766j763M219M223M219M223O71O75O71O74l377l373r91r88k065
-530e4259k061k065k061k218k214K076K080K344K349r96r91j346j341J994J998o90o86o89
-512e8776o86n22n18n22n18J208J211k24k20n96n93k981k978k386k382J909J912K68K72L612
-492f3510L612j133j130J256J256j356j353j353j353P00P05p27p27J391J390j950j949R13
$$ plain form
-474 -65318 -64405 -63491 -62578 -63044 -63510 -63976 -64442 -64043 -63644 -63245 -62847 -62068 -61289 -63849 -66406 -68281 -70156 -69645 -69131 -71893 -74655
-453 -74655 -75031 -75404 -75184 -74964 -74744 -74520 -74498 -74476 -74453 -74431 -72918 -71404 -71322 -71240 -68400 -65560 -65105 -64651 -64196 -63741 -64718 -65694 -65989
-430 -65989 -66279 -63230 -60182 -59701 -59216 -61117 -63018 -64118 -65213 -64878 -64542 -62183 -59820 -58888 -57956 -57039 -56119 -56629 -57140 -56253
-410 -56253 -55362 -54471 -53581 -56547 -59511 -61043 -62574 -64796 -67014 -66846 -66678 -65266 -63853 -63872 -63890 -61344 -58799 -60547 -62295
-391 -62295 -62858 -63421 -65415 -67409 -66182 -64956 -65161 -65366 -63581 -61795 -62396 -65858 -70335 -70040 -70223 -70405 -66533 -62660 -62127
-372 -62127 -61594 -62433 -63271 -61725 -60178 -60577 -60972 -60237 -59499 -57662 -60592 -60841 -61087 -58653 -56216 -57121 -58023 -61106 -64185 -64882
-352 -64882 -65575 -65299 -65020 -64267 -66373 -66305 -61464 -57878 -57151 -57353 -57550 -60316 -63078 -62712 -62343 -63409 -64472 -61982 -59492 -60342
-332 -60342 -61188 -62962 -64736 -66212 -67685 -68624 -64792 -65075 -65355 -64624 -63894 -61732 -59567 -59451 -59336 -59220 -59101 -60237 -61374 -59529
$$ packed form
-474f5318R13R14R13m66m66m66m66L99L99L99L98P79P79k560k557j875j875N11N14k762k762
-453g4655l76l73K20K20K20K24K2K2K3K2J513J514Q2Q2K840K840M55M54M55M55r77r76k95
-430f5989k90L049L048M81M85j901j901j100j095L35L36K359K363R32R32R17R20n10n11Q87
-410e6253Q91Q91Q90k966k964j532j531k222k218J68J68J412J413j9j8K546K545j748j748
-391f2295n63n63j994j994J227J226k05k05J785J786o01l462m477K95j83j82L872L873N33
-372f2127N33q39q38J546J547l99l95P35P38J837k930k49k46K434K437r05r02l083l079o97
-352f4882o93K76K79P53k106O8M841L586P27k02j97k766k762L66L69j066j063K490K490q50
-332f0342q46j774j774j476j473r39L832k83k80P31P30K162K165J16J15J16J19j136j137J845
$$ plain form
-312 -59529 -62451 -65497 -63771 -61210 -61508 -60290 -61933 -63577 -65217 -62038 -58855 -59969 -61080 -60584 -60085 -59589 -59089 -57923
-294 -57923 -56752 -55586 -54415 -56410 -58400 -61825 -65247 -65277 -65303 -63898 -62492 -62791 -63085 -61948 -60811 -59857 -58899 -57941 -56984 -57610
-274 -57610 -58232 -58855 -59477 -58720 -57960 -57203 -56443 -55030 -53614 -56495 -59373 -59212 -59048 -60319 -61587 -61605 -61620 -61818 -62012 -62150 -65150
-253 -65150 -70476 -69120 -66127 -65996 -65627 -62392 -59548 -59567 -62090 -64610 -63465 -62321 -59745 -57166 -58105 -59045 -58553 -58061 -57390
-234 -57390 -56719 -59089 -61460 -65605 -64979 -63696 -62414 -63070 -63726 -64382 -65038 -62798 -60558 -60703 -60849 -58430 -56011 -57886 -59760
-215 -59760 -61710 -63659 -65608 -67558 -67152 -66745 -66339 -65933 -64874 -63816 -62757 -61695 -64125 -66555 -66600 -66641 -65374 -64106 -62839
-196 -62839 -61568 -63968 -66369 -65430 -64487 -66779 -69071 -68024 -66973 -67774 -68575 -66037 -63495 -59421 -55347 -58430 -61508 -62414
-178 -62414 -63320 -64226 -65128 -65985 -66842 -66268 -65694 -66134 -66574 -67014 -67453 -64747 -62041 -62675 -63309 -61915 -60521 -61512 -62504 -62724 -62943
$$ packed form
-312e9529k922l046J726K561k98J218j643j644j640L179L183j114j111M96M99M96N00J166
-294e7923J171J166J171j995j990l425l422l0k6J405J406k99k94J137J137R54R58R58R57o26
-274e7610o22o23o22P57P60P57P60J413J416k881k878J61J64j271j268j8j5j98j94j38l000
-253f5150n326J356K993J31L69L235K844j9k523k520J145J144K576K579r39r40M92M92O71
-234e7390O71k370k371m145O26J283J282o56o56o56o56K240K240j45j46K419K419j875j874
-215e9760j950j949j949j950M06M07M06M06J059J058J059J062k430k430m5m1J267J268J267
-196f2839J271k400k401R39R43k292k292J047J051q01q01K538K542M074M074l083l078r06
-178f2414r06r06r02q57q57N74N74m40m40m40m39K706K706o34o34J394J394r91r92k20k19
$$ plain form
-157 -62943 -63163 -63383 -64856 -66328 -67800 -69272 -69887 -70502 -69686 -68870 -66175 -63480 -63946 -64412 -66522 -65765 -65187 -64610 -63618 -62623
-137 -62623 -62880 -66000 -66499 -66995 -64807 -62619 -62582 -62541 -61069 -59596 -59682 -59764 -58415 -57066 -59209 -61348 -62056 -62765 -62574 -62381 -57714
-116 -57714 -55910 -58076 -60237 -59537 -58836 -63003 -64304 -62567 -63689 -65709 -64863 -61337 -60670 -61646 -62619 -63954 -65284 -65068 -67711
-97 -67711 -67494 -64412 -64651 -64885 -65124 -65359 -64703 -66906 -67502 -68095 -66186 -64274 -65407 -66537 -63913 -64147 -67368 -70584 -71013 -68579
-77 -68579 -67755 -66928 -68460 -69992 -70271 -67685 -66182 -64680 -64431 -64177 -63838 -63499 -61549 -62459 -63052 -63644 -64237 -64826 -67207 -66727 -67677
-56 -67677 -68624 -68046 -64606 -58482 -55217 -53834 -55314 -59954 -64591 -67207 -66958 -65102 -66104 -67289 -65608 -61248 -59745 -59857
-38 -59857 -59965 -61687 -63406 -61997 -60584 -59175 -57763 -57770 -57774 -57781 -57785 -58120 -58452 -59861 -64129 -64583 -62172 -62984 -63793 -65649 -67502 -67748
-16 -67748 -70853 -69776 -68698 -67800 -66902 -66540 -66179 -65519 -64859 -67658 -65687 -63536 -61385 -62783 -64181 -62716 -61251 -61956 -62660
$$ packed form
-157f2943k20k20j473j472j472j472o15o15Q16Q16K695K695m66m66k110P57N78N77R92R95
-137f2623k57l120m99m96K188K188L7M1J472J473q6q2J349J349k143k139p08p09J91J93M667
-116e7714J804k166k161P00P01m167j301J737j122k020Q46L526O67r76r73j335j330K16k643
-97f7711K17L082k39k34k39k35O56k203n96n93J909J912j133j130K624k34l221l216m29K434
-77f8579Q24Q27j532j532k79K586J503J502K49K54L39L39J950r10n93n92n93n89k381M80r50
-56f7677r47N78L440O124L265J383j480m640m637k616K49J856j002j185J681M360J503j12
-38e9857j08j722j719J409J413J409J412pmpml35l32j409m268m54K411q12q09j856j853k46
-16f7748l105J077J078Q98Q98L62L61O60O60k799J971K151K151j398j398J465J465p05p04
$$ plain form
2 -62660 -61933 -61207 -61911 -62615 -60457 -58299 -60785 -63271 -64326 -65381 -65243 -65105 -63536 -61967 -61680 -61393 -60927 -60457 -61453 -59585 -56465
23 -56465 -58113 -60785 -60595 -60703 -63670 -63182 -62694 -62384 -62071 -62720 -63365 -64013 -64658 -63816 -62970 -62127 -61281 -58903 -56521 -57006 -57487 -55556
45 -55556 -53622 -53122 -52619 -54240 -55858 -57479 -59097 -60092 -61084 -62079 -63070 -63350 -63626 -64084 -64539 -65236 -68792 -73246 -72925 -72370 -68952
66 -68952 -66846 -64736 -64777 -64818 -64859 -64897 -64147 -63398 -65512 -67621 -68124 -68628 -69131 -69630 -67364 -65098 -62832 -60562 -61397 -62232 -63066 -63898
88 -63898 -63555 -63212 -60364 -62284 -61881 -64341 -66920 -66633 -66727 -63954 -62615 -61274 -62858 -64438 -66022 -67603 -66585 -65564 -64546
107 -64546 -63525 -64326 -65124 -65925 -66723 -65843 -64960 -66466 -67968 -67923 -67875 -65444 -63011 -60767 -58519 -56275 -54028 -56048 -58064 -61516
127 -61516 -64964 -65579 -66194 -64423 -62649 -62996 -63342 -63689 -64032 -61151 -58269 -60636 -62999 -62325 -61650 -60975 -60297 -63260 -66223 -67755
147 -67755 -69287 -68404 -67521 -69023 -70525 -70089 -69653 -67785 -65918 -65005 -64091 -63178 -62265 -62709 -63152 -63596 -64039 -63081 -62123 -61166 -60208
$$ packed form
2f2660P27P26p04p04K158K158k486k486j055j055J38J38J569J569K87K87M66M70r96J868L120
23e6465j648k672J90j08k967M88M88L10L13o49o45o48o45Q42Q46Q43Q46K378K382m85m81J931
45e5556J934N00N03j621j618j621j618r95r92r95r91k80k76m58m55o97l556m454L21N55L418
66f8952K106K110m1m1m1l8P50P49k114k109n03n04n03m99K266K266K266K270q35q35q34q32
88f3898L43L43K848j920M03k460k579K87r4K773J339J341j584j580j584j581J018J021J018
107f4546J021q01p98q01p98Q80Q83j506j502M5M8K431K433K244K248K244K247k020k016l452
127f1516l448o15o15J771J774l47l46l47l43K881K882k367k363O74O75O75O78k963k963j532
147f7755j532Q83Q83j502j502M36M36J868J867R13R14R13R13m44m43m44m43R58R58R57R58
$$ plain form
168 -60208 -61441 -62675 -62478 -62280 -64319 -66358 -66011 -65664 -64841 -64017 -64624 -65232 -65005 -64777 -65981 -67185 -65922 -64658 -64826 -64993
188 -64993 -65996 -66999 -68001 -69004 -66663 -64323 -61982 -59641 -60431 -61221 -62012 -62802 -62578 -62355 -64516 -66678 -64248 -61818 -58553
207 -58553 -61013 -60141 -59268 -58754 -58240 -59813 -61385 -60573 -59760 -60021 -60282 -60185 -60088 -63063 -60312 -60782 -61251 -61669 -62082 -62500 -62914 -63331
229 -63331 -63745 -64162 -64576 -64815 -65049 -65288 -65523 -65046 -64565 -65519 -66469 -68710 -70946 -69071 -67193 -63767 -63201 -65202 -64337 -61687 -61896
250 -61896 -62705 -63510 -64528 -65541 -66559 -67573 -66108 -64643 -65564 -66484 -66809 -67133 -67457 -67781 -66026 -64270 -64900 -65530 -64639 -63749
270 -63749 -64647 -62683 -61054 -62284 -63339 -61527 -60674 -59816 -58784 -57748 -58661 -59570 -60483 -61393 -61769 -62142 -64304 -63603 -62515 -64285
290 -64285 -64270 -64252 -65161 -66067 -66797 -67524 -69269 -68147 -67386 -66622 -62731 -61699 -65914 -67267 -65541 -63816 -62388 -63823 -66212 -63831
310 -63831 -61628 -64196 -65601 -67006 -68710 -70413 -68091 -65769 -63447 -61125 -62112 -63100 -62478 -61855 -63737 -62757 -60047 -57338 -59101
$$ packed form
168f0208j233j234J97J98k039k039L47L47Q23Q24o07o08K27K28j204j204J263J264j68j67
188f4993j003j003j002j003K341K340K341K341p90p90p91p90K24K23k161k162K430K430L265
207e8553k460Q72Q73N14N14j573j572Q12Q13k61k61R7R7k975K751m70m69m18m13m18m14m17
229f3331m14m17m14k39k34k39k35M77M81r54r50k241k236J875J878L426N66k001Q65K650k09
250f1896q09q05j018j013j018j014J465J465r21r20l25l24l24l24J755J756o30o30Q91Q90
270f3749q98J964J629j230j055J812Q53Q58J032J036r13r09r13r10l76l73k162P01J088j770
290f4285J5J8r09r06p30p27j745J122P61P64L891J032m215j353J726J725J428j435k389K381
310f3831K203k568j405j405j704j703K322K322K322K322r87r88O22O23j882R80K710K709j763
$$ plain form
329 -59101 -60864 -62627 -64390 -64274 -64159 -61836 -59514 -58743 -60834 -66264 -68829 -66417 -64002 -63022 -62038 -61326 -63473 -65623 -64908
348 -64908 -64464 -64017 -64170 -67181 -68042 -68900 -68326 -67752 -68341 -66067 -66656 -67245 -67990 -65873 -63756 -64501 -63756 -63011 -62444 -61877 -59846
369 -59846 -57815 -59123 -60428 -60543 -60659 -60774 -60886 -63186 -65485 -65400 -65310 -63495 -61680 -59388 -61863 -64643 -64557 -66380 -68203 -68449
389 -68449 -68691 -66548 -64405 -62496 -60584 -60103 -59622 -58788 -57949 -57110 -56272 -56823 -57371 -57919 -58467 -59734 -60998 -63812 -61855 -58120
409 -58120 -59153 -62153 -62291 -61628 -60961 -60114 -59268 -59015 -58761 -58031 -60159 -62560 -60189 -57341 -54490 -57502 -60513 -62094 -63670
428 -63670 -65012 -66354 -65310 -64263 -62727 -61188 -61080 -60972 -61221 -61471 -63152 -64833 -64967 -65098 -62843 -60588 -60122 -59656 -61397
447 -61397 -63137 -63454 -60908 -59376 -62612 -63257 -59127 -57983 -59697 -58210 -59585 -62213 -60066 -61978 -63886 -65500 -67111 -67703
465 -67703 -68292 -65545 -62794 -61151 -59503 -62153 -64800 -66391 -67979 -67185 -66387 -67919 -69448 -66686 -63920 -62914 -61904 -62328
$$ packed form
329e9101j763j763j763J16J15K323K322P71k091n430k565K412K415R80R84P12k147k150P15
348f4908M44M47j53l011q61q58N74N74n89K274n89n89p45K117K117p45P45P45N67N67K031
369e9846K031j308j305j15j16j15j12k300k299Q5R0J815J815K292k475k780Q6j823j823k46
389f8449k42K143K143J909J912M81M81Q34Q39Q39Q38n51n48n48n48j267j264k814J957L735
409e8120j033l000j38O63O67Q47Q46K53K54P30k128k401K371K848K851l012l011j581j576
428f3670j342j342J044J047J536J539J08J08k49k50j681j681j34j31K255K255M66M66j741
447f1397j740l17K546J532l236o45M130J144j714J487j375k628K147j912j908j614j611n92
465f7703n89K747K751J643J648k650k647j591j588P94P98j532j529K762K766J006J010m24
$$ plain form
483 -62328 -62750 -64367 -65981 -67599 -69213 -68102 -66988 -65877 -64762 -64725 -64684 -64647 -64606 -64539 -64468 -64401 -64330 -64203 -64073 -65374 -66674 -64587
505 -64587 -62496 -62794 -63089 -64699 -66305 -63618 -60931 -59667 -58400 -59522 -60640 -61404 -62164 -60539 -58914 -57330 -55742 -58452
523 -58452 -61158 -62943 -64725 -65075 -65426 -67342 -69254 -71170 -73082 -72642 -72198 -71758 -71315 -70145 -68970 -67800 -66626 -65813 -64997
542 -64997 -64185 -63368 -63525 -63681 -63838 -63995 -64509 -65023 -65538 -66052 -64882 -63711 -62541 -61371 -64077 -66783 -66149 -65515 -67584 -69649
562 -69649 -67424 -65195 -62791 -60383 -61318 -62250 -64364 -66473 -66201 -65925 -65176 -64423 -63674 -62921 -62761 -62601 -62798 -62996 -61762 -66253
582 -66253 -67524 -68795 -68158 -67521 -66883 -66246 -65221 -64196 -63171 -62146 -60804 -59462 -61460 -63458 -65933 -68408 -70763 -67390
$$ packed form
483f2328m22j617j614j618j614J111J114J111J115L7M1L7M1O7P1O7P1J27J30j301j300K087
505f4587K091k98k95j610j606K687K687J264J267j122j118p64p60J625J625J584J588k710
523e8452k706j785j782l50l51j916j912j916j912M40M44M40M43J170J175J170J174Q13Q16
542f4997Q12Q17j57j56j57j57n14n14n15n14J170J171J170J170k706k706O34O34k069k065
562f9649K225K229K404K408r35r32k114k109K72K76P49P53P49P53J60J60j97j98J234m491
582f6253j271j271O37O37O38O37J025J025J025J025J342J342j998j998k475k475k355L373
$$ [...]
##END=	
