##TITLE=	PWg7sf6jT8qn2ZcWtuWl0g/1142s
##JCAMPDX=	6.0	$$ NMR Plug-in 1.13 of MestReNova 11.0.4-18998
##DATATYPE=	NMRSPECTRUM
##DATACLASS=	XYDATA
##NUMDIM=	1
##ORIGIN=	Bruker BioSpin GmbH
##OWNER=	andrew
##.OBSERVEFREQUENCY=	600.30184456100005264
##.OBSERVENUCLEUS=	^1H
##.SOLVENTNAME=	CD2Cl2
##.PULSESEQUENCE=	zg
##LONGDATE=	2015/06/05 10:04:02.000
##.ACQUISITIONMODE=	SIMULTANEOUS (DQD)
##$ORIGINALFORMAT=	Bruker XWIN-NMR
##$PARAMETERFILE=	(acqus, ASCII, /var/folders/f6/rjf_tdyn2v98c5c0wvkgn4s80000gn/T/PWg7sf6jT8qn2ZcWtuWl0g/1142s/acqus, 0)
$$ ##TITLE= Parameter file, TOPSPIN		Version 2.1
$$ ##JCAMPDX= 5.0
$$ ##DATATYPE= Parameter Values
$$ ##NPOINTS= 10	$$ modification sequence number
$$ ##ORIGIN= Bruker BioSpin GmbH
$$ ##OWNER= andrew
$$ $$ 2015-06-05 15:04:02.412 +0600  andrew@av-600
$$ $$ /opt/data/andrew/nmr/limog-1782/607/acqus
$$ $$ process /opt/ts21pl6/prog/mod/shimcntl
$$ ##$ACQT0= -9.54927425515661
$$ ##$AMP= (0..31)
$$ 100 100 100 100 100 100 100 100 100 100 100 100 100 100 100 100 100 100
$$ 100 100 100 100 100 100 100 100 100 100 100 100 100 100
$$ ##$ANAVPT= -1
$$ ##$AQSEQ= 0
$$ ##$AQ_mod= 3
$$ ##$AUNM= <au_zg>
$$ ##$AUTOPOS= <>
$$ ##$BF1= 600.3
$$ ##$BF2= 600.3
$$ ##$BF3= 600.3
$$ ##$BF4= 600.3
$$ ##$BF5= 600.3
$$ ##$BF6= 600.3
$$ ##$BF7= 600.3
$$ ##$BF8= 600.3
$$ ##$BYTORDA= 0
$$ ##$CFDGTYP= 0
$$ ##$CFRGTYP= 9
$$ ##$CHEMSTR= <none>
$$ ##$CNST= (0..63)
$$ 1 1 145 1 1 1 1 1 1 1 1 1 1 1 1 1 1 1 1 1 1 1 1 1 1 1 1 1 1 1 1 1 1 1 1
$$ 1 1 1 1 1 1 1 1 1 1 1 1 1 1 1 1 1 1 1 1 1 1 1 1 1 1 1 1 1
$$ ##$CPDPRG= <>
$$ ##$CPDPRG1= <>
$$ ##$CPDPRG2= <waltz16>
$$ ##$CPDPRG3= <>
$$ ##$CPDPRG4= <mlev>
$$ ##$CPDPRG5= <mlev>
$$ ##$CPDPRG6= <mlev>
$$ ##$CPDPRG7= <mlev>
$$ ##$CPDPRG8= <mlev>
$$ ##$CPDPRGB= <>
$$ ##$CPDPRGT= <>
$$ ##$D= (0..63)
$$ 0 1 0 0 0 0 0 0 0 0.06 0 0.03 0 0 0 0 1e-04 0 0 0 0 0 0 0 0 0 0 0 0 0 0
$$ 0 0 0 0 0 0 0 0 0 0 0 0 0 0 0 0 0 0 0 0 0 0 0 0 0 0 0 0 0 0 0 0 0
$$ ##$DATE= 1433495042
$$ ##$DBL= (0..7)
$$ 120 120 120 120 120 120 120 120
$$ ##$DBP= (0..7)
$$ 150 150 150 150 150 150 150 150
$$ ##$DBP07= 0
$$ ##$DBPNAM0= <>
$$ ##$DBPNAM1= <>
$$ ##$DBPNAM2= <>
$$ ##$DBPNAM3= <>
$$ ##$DBPNAM4= <>
$$ ##$DBPNAM5= <>
$$ ##$DBPNAM6= <>
$$ ##$DBPNAM7= <>
$$ ##$DBPOAL= (0..7)
$$ 0.5 0.5 0.5 0.5 0.5 0.5 0.5 0.5
$$ ##$DBPOFFS= (0..7)
$$ 0 0 0 0 0 0 0 0
$$ ##$DE= 6.5
$$ ##$DECBNUC= <off>
$$ ##$DECIM= 2218.66666666667
$$ ##$DECNUC= <off>
$$ ##$DECSTAT= 4
$$ ##$DIGMOD= 1
$$ ##$DIGTYP= 12
$$ ##$DL= (0..7)
$$ 0 120 120 120 120 120 120 120
$$ ##$DP= (0..7)
$$ 150 150 150 150 150 150 150 150
$$ ##$DP07= 0
$$ ##$DPNAME0= <>
$$ ##$DPNAME1= <>
$$ ##$DPNAME2= <>
$$ ##$DPNAME3= <>
$$ ##$DPNAME4= <>
$$ ##$DPNAME5= <>
$$ ##$DPNAME6= <>
$$ ##$DPNAME7= <>
$$ ##$DPOAL= (0..7)
$$ 0.5 0.5 0.5 0.5 0.5 0.5 0.5 0.5
$$ ##$DPOFFS= (0..7)
$$ 0 0 0 0 0 0 0 0
$$ ##$DQDMODE= 0
$$ ##$DR= 22
$$ ##$DS= 0
$$ ##$DSLIST= <SSSSSSSSSSSSSSS>
$$ ##$DSPFIRM= 0
$$ ##$DSPFVS= 20
$$ ##$DTYPA= 0
$$ ##$EXP= <>
$$ ##$F1LIST= <111111111111111>
$$ ##$F2LIST= <222222222222222>
$$ [...]
$$ -1 -1 -1 -1 -1 -1 -1 -1 -1 -1 -1 -1 -1 -1 -1 -1 -1 -1 -1 -1 -1 -1 -1 -1
$$ -1 -1 -1 -1 -1 -1 -1 -1 -1 -1 -1 -1 -1 -1 -1 -1 -1 -1 -1 -1 -1 -1 -1 -1
$$ -1 -1 -1 -1 -1 -1 -1 -1 -1 -1 -1 -1 -1 -1 -1 -1 -1 -1 -1 -1 -1 -1 -1 -1
$$ -1 -1 -1 -1 -1 -1 -1 -1 -1 -1 -1 -1 -1 -1 -1 -1 -1 -1 -1 -1 -1 -1 -1 -1
$$ -1 -1 -1 -1 -1 -1 -1 -1 -1 -1 -1 -1 -1 -1 -1 -1
$$ ##$RG_tab8= (0..255)
$$ -1 -1 -1 -1 -1 -1 -1 -1 -1 -1 -1 -1 -1 -1 -1 -1 -1 -1 -1 -1 -1 -1 -1 -1
$$ -1 -1 -1 -1 -1 -1 -1 -1 -1 -1 -1 -1 -1 -1 -1 -1 -1 -1 -1 -1 -1 -1 -1 -1
$$ -1 -1 -1 -1 -1 -1 -1 -1 -1 -1 -1 -1 -1 -1 -1 -1 -1 -1 -1 -1 -1 -1 -1 -1
$$ -1 -1 -1 -1 -1 -1 -1 -1 -1 -1 -1 -1 -1 -1 -1 -1 -1 -1 -1 -1 -1 -1 -1 -1
$$ -1 -1 -1 -1 -1 -1 -1 -1 -1 -1 -1 -1 -1 -1 -1 -1 -1 -1 -1 -1 -1 -1 -1 -1
$$ -1 -1 -1 -1 -1 -1 -1 -1 -1 -1 -1 -1 -1 -1 -1 -1 -1 -1 -1 -1 -1 -1 -1 -1
$$ -1 -1 -1 -1 -1 -1 -1 -1 -1 -1 -1 -1 -1 -1 -1 -1 -1 -1 -1 -1 -1 -1 -1 -1
$$ -1 -1 -1 -1 -1 -1 -1 -1 -1 -1 -1 -1 -1 -1 -1 -1 -1 -1 -1 -1 -1 -1 -1 -1
$$ -1 -1 -1 -1 -1 -1 -1 -1 -1 -1 -1 -1 -1 -1 -1 -1 -1 -1 -1 -1 -1 -1 -1 -1
$$ -1 -1 -1 -1 -1 -1 -1 -1 -1 -1 -1 -1 -1 -1 -1 -1 -1 -1 -1 -1 -1 -1 -1 -1
$$ -1 -1 -1 -1 -1 -1 -1 -1 -1 -1 -1 -1 -1 -1 -1 -1
$$ ##$RG_tabA= (0..255)
$$ 0.25 0.28 0.32 0.35 0.4 0.44 0.5 0.56 0.64 0.7 0.8 0.89 1 1.12 1.28 1.4
$$ 1.6 1.78 2 2.25 2.56 2.8 3.2 3.56 4 4.5 5 5.6 6.35 7.12 8 9 10 11.3 12.7
$$ 14.2 16 18 20.2 22.6 25.4 28.5 32 36 40.3 45.2 50.8 57 64 71.8 80.6 90.5
$$ 101 114 128 144 161 181 203 -1 -1 -1 -1 -1 -1 -1 -1 -1 -1 -1 -1 -1 -1 -1
$$ -1 -1 -1 -1 -1 -1 -1 -1 -1 -1 -1 -1 -1 -1 -1 -1 -1 -1 -1 -1 -1 -1 -1 -1
$$ -1 -1 -1 -1 -1 -1 -1 -1 -1 -1 -1 -1 -1 -1 -1 -1 -1 -1 -1 -1 -1 -1 -1 -1
$$ -1 -1 -1 -1 -1 -1 -1 -1 -1 -1 -1 -1 -1 -1 -1 -1 -1 -1 -1 -1 -1 -1 -1 -1
$$ -1 -1 -1 -1 -1 -1 -1 -1 -1 -1 -1 -1 -1 -1 -1 -1 -1 -1 -1 -1 -1 -1 -1 -1
$$ -1 -1 -1 -1 -1 -1 -1 -1 -1 -1 -1 -1 -1 -1 -1 -1 -1 -1 -1 -1 -1 -1 -1 -1
$$ -1 -1 -1 -1 -1 -1 -1 -1 -1 -1 -1 -1 -1 -1 -1 -1 -1 -1 -1 -1 -1 -1 -1 -1
$$ -1 -1 -1 -1 -1 -1 -1 -1 -1 -1 -1 -1 -1 -1 -1 -1 -1 -1 -1 -1 -1 -1 -1 -1
$$ -1 -1 -1 -1 -1 -1 -1 -1 -1 -1 -1 -1 -1 -1
$$ ##$ROUT14= (0..7)
$$ 0 0 0 0 0 0 0 0
$$ ##$ROUTER= -1
$$ ##$RX22TY= <no>
$$ ##$RXFMAX= (0..7)
$$ 647.5 -1 -1 -1 -1 -1 -1 -1
$$ ##$RXFMIN= (0..7)
$$ 5 -1 -1 -1 -1 -1 -1 -1
$$ ##$RXINTLV= (0..7)
$$ 1 0 0 0 0 0 0 0
$$ ##$RXMSTY= <no>
$$ ##$SCMTY= <no>
$$ ##$SGUC1= (0..15)
$$ 17 18 34 0 0 0 0 0 0 0 0 0 0 0 0 0
$$ ##$SGUC2= (0..15)
$$ 33 256 20 0 0 0 0 0 0 0 0 0 0 0 0 0
$$ ##$SPECTR= 10
$$ ##$SY2FLAG= 0
$$ ##$TFXNUM= 0
$$ ##$TRIPLO2= 0
$$ ##$VTUTY= <tty05>
$$ ##$WBREFAM= (0..15)
$$ 100 100 100 100 100 100 100 100 100 100 100 100 100 100 100 100
$$ ##$WBREFPH= (0..15)
$$ 0 0 0 0 0 0 0 0 0 0 0 0 0 0 0 0
$$ ##$XFAC= 2
$$ ##END=
$$ 
##$DECIM=	2218.66666666667
##$DSPFVS=	20
##XUNITS=	HZ
##YUNITS=	ARBITRARY UNITS
##FIRSTX=	6322.8525384689401108
##LASTX=	-2691.4329892738592207
##XFACTOR=	-0.1375491802509010153
##YFACTOR=	1.0386403320312501334e-05
##NPOINTS=	65536
##XYDATA=	(X++(Y..Y))
$$ [...]
-12167C6737p776k1126k3272j7550q969l241o103o104n40n36Q94Q94k299k295J043J043K188
-12150e7012K190j93j94P56P60M03M02J901l820k46k42k690L037K854mR7J01k467k463k2j9
-12129e6871J051J054K292l428n161k295p19p15j23K742L968j751J464J468L879J021l335
-12112e5459K392N090o30l912j047j557j554J006J010r24r21r24r20J490J494J491J494o86
-12094e3067o81o86o82o26o22K712K717k206k202J79J82r24r20N07N10J885J886J885J886
-12075d8267j960j960j960j960m5m4L13L13k281L443N81k280j915R46P68k094L361L361L241
-12056d8439k481j930R31M091J230l003j42K362K363l220l215j785j785k891k888L4L3J811
-12038e8924m862m863J815K615K620j256j256K940K944N59N59k50k46J185J185R43R46P68
$$ y = [36737, 28961, 7835, -15437, -32987, -41956, -45197, -51300, -57404, -57944, -58480, -57586, -56692, -58991, -61286, -60243, -59200, -57012, -54822, -55015, -55209, -54453, -53693, -53290, -52888, -50987, -54807, -55053, -55295, -57985, -54948, -52094, -52098, -52001, -51900, -54367, -56830, -56852, -56871, -55820, -54766, -52474, -55902, -61063, -63358, -64077, -64792, -64915, -62173, -58205, -59956, -58492, -57024, -53145, -52124, -55459, -53067, -47977, -48607, -52519, -53566, -55123, -56677, -55671, -54661, -55585, -56506, -57430, -58350, -56860, -55366, -53875, -52381, -53067, -53748, -54434, -55116, -55742, -56364, -53652, -50935, -53141, -55343, -55164, -54982, -55906, -56826, -56319, -55809, -53924, -52038, -50153, -48267, -50227, -52187, -54147, -56107, -56152, -56196, -55883, -55570, -57851, -54408, -53827, -56107, -58022, -57076, -56308, -58402, -55041, -51680, -48439, -50920, -52850, -51919, -47828, -46598, -49601, -49743, -47381, -45018, -48238, -51453, -53238, -55023, -57914, -60802, -60768, -60735, -58924, -63786, -68649, -66834, -64219, -61599, -62855, -64111, -61171, -58227, -57668, -57109, -57359, -57605, -56420, -55235, -54292, -53346, -52578]
-12020e2578P67o07l465j856j856L201L204J774J774L39L43k698J64O37O41Q20Q19j539j535
-12001e1651Q50Q49l103l100n37n37k805N9J789J788J413J415J595j267K605K608k638k638
-11983e3305j639J222K653k09l130l130L0L0r62r61M70M69K109K109J334j528Q50Q49Q50Q49
-11963e1040k876j5M576j94l756q94N36N37j163j162j163j162J553J558j602j602m259j394
-11945f3522J289J290K634K638J863r99l16l13K191k579j505j502K493K493j059j054j412
-11928e7370J449K325n32j129j129N66N70j040j039M13k448k448M18l91l92k12k09K13K12
-11909f2173j397J468K418K418M207J349n18n18n18n14k128P34j054j051J494j367K42K46
-11891e6662P49P49N70N74M80k377r50J915k291k288R28R31j777J088K455k310k314K459p04
$$ y = [-52578, -51811, -52418, -55883, -57739, -59595, -56394, -53190, -51416, -49642, -49303, -48960, -51658, -51494, -50857, -50216, -49396, -48577, -50116, -51651, -50801, -49952, -53055, -56155, -56692, -57229, -60034, -59975, -58186, -56398, -54985, -53570, -51975, -53242, -50637, -48029, -50667, -53305, -54944, -53722, -51069, -51278, -54408, -57538, -57508, -57478, -58440, -59401, -58931, -58462, -56353, -54244, -52910, -54438, -53588, -52739, -51889, -51040, -53916, -53931, -49355, -49549, -53305, -54199, -53663, -53126, -54289, -55451, -56614, -57776, -56223, -54665, -56267, -57869, -62128, -63522, -62233, -60943, -58309, -55671, -53808, -54807, -55123, -55436, -53245, -55824, -57329, -58831, -56338, -53845, -54904, -55958, -57370, -55921, -53596, -54128, -55257, -56386, -55820, -55250, -56290, -57329, -56916, -59364, -61812, -61394, -61785, -62177, -62389, -62598, -62385, -62173, -63570, -62102, -59684, -57266, -53059, -51710, -52228, -52746, -53264, -53778, -55906, -55172, -56226, -57277, -55783, -57150, -56908, -56662, -55913, -55164, -54594, -54020, -53540, -55917, -56867, -54952, -57243, -59531, -58603, -57672, -59449, -58361, -55906, -58216, -60530, -58071, -58775]
-11872e8775p00K481l76J229J234k825k820K16K20j140J725J12J15k16k12K347K351J49m616
-11853e9501k117P49N37N40P15P19K102K105r39r35M92k366k191O74Q76L741n55n52k165k161
-11833f0232O97P01J501J505J502J505R36R39j927j922K86K91k750J12m28m25j677j677Q76
-11814f0187Q79r09J953K664j94j625J237J409j450k343k344n2K813K813m8O78O82N03N03
-11795e3018L20L24J46J45J461j398k649k649l279l275m14m13K466K471J039J040qlmmK65
-11774e7437K64Q6Q9O23k240m50m48j047J815K6L0J218j643j643J222J367J368j315j316L25
-11754e9106L24J755J755J337J338J338J337j375j375K918N6l376o234J42J45j527J337J513
-11736e7698j345k661K05L182L186r91r87k601K64q60q61K180K183J882J882J702J707J703
$$ y = [-58775, -59475, -56994, -57370, -56141, -54907, -57732, -60552, -60336, -60116, -61256, -59531, -59419, -59304, -59520, -59732, -57385, -55034, -54885, -59501, -61618, -60869, -60332, -59792, -59077, -58358, -56256, -54151, -55090, -56025, -55533, -57899, -60090, -59416, -58540, -54799, -55354, -55906, -58071, -60232, -59535, -58834, -57333, -55828, -54326, -52821, -51885, -50946, -52873, -54795, -54509, -54218, -56968, -56856, -57284, -57709, -59386, -61063, -60187, -59308, -60217, -58264, -55600, -55794, -57419, -56182, -54773, -56223, -58566, -60910, -60962, -58149, -55336, -55384, -54706, -54024, -53521, -53018, -52698, -52374, -52228, -52083, -50622, -52020, -54669, -57318, -60597, -63872, -64286, -64699, -62233, -59762, -58723, -57683, -57691, -57694, -57698, -57702, -57437, -57173, -57087, -56998, -56375, -58615, -59065, -59513, -60560, -58745, -58719, -58689, -57471, -59114, -60757, -59535, -58168, -56800, -58115, -59431, -59106, -58782, -57027, -55272, -53935, -52597, -51259, -49922, -51297, -52672, -49754, -49698, -53074, -59308, -59166, -59021, -60548, -59211, -57698, -59043, -61704, -61499, -58317, -55131, -56122, -57109, -59710, -59446, -60306, -61167, -58987, -56804, -54922, -53040, -51338, -49631, -47928]
-11718d7928j159j338J528L3k828l722J051k433k433P26P30J621J621O67k191o89M080K828
-11700d9836l0j285j286j464j461J368J367J368J367q98q98q98q98L69L69j241J621j360j360
-11681e5086j181j181o56o56N96L458R54R54j729j729r69r69K072K072j684J177m32m32j454
-11662e6875j449j453j450K959K962k288k284r46r43J438J442R32R35m99m96N41N40N40N40
-11643e5854j814j815j516j517j650L118K046q16K57K57P8P9L42L47L46L47J94J97J98J97
-11623e6979j118j114K046K045J088j769l022J747L272M10o8o3K61K61K61K64M92M92M92M95
-11603e0507l43l42l43l39J19J19K027q31j937K832J758j099l532o71p4p1j953j952n22n18
-11583e8179K16K17J646J651J528J527l718l715R39R39m92m88j654j655j356j353j572L197
$$ y = [-47928, -49087, -50425, -48897, -48864, -51692, -55414, -54363, -56796, -59229, -58503, -57773, -56152, -54531, -53864, -56055, -56744, -52664, -49836, -49866, -51151, -52437, -53901, -55362, -53994, -52627, -51259, -49892, -50790, -51688, -52586, -53484, -53115, -52746, -53987, -52366, -53726, -55086, -56267, -57448, -58104, -58760, -58164, -54706, -53752, -52798, -54527, -56256, -57225, -58194, -56122, -54050, -55734, -54557, -54989, -55421, -56875, -58324, -59777, -61227, -58268, -55306, -57594, -59878, -60824, -61767, -60329, -58887, -57955, -57020, -57519, -58015, -57474, -56934, -56394, -55854, -57668, -59483, -60999, -62516, -64166, -61048, -59002, -59818, -59561, -59304, -59226, -59147, -58805, -58458, -58112, -57765, -57571, -57374, -57176, -56979, -58097, -59211, -57165, -55120, -54032, -55801, -58823, -57076, -53804, -53394, -53462, -53525, -53264, -53003, -52742, -52478, -51986, -51494, -51002, -50507, -50850, -51192, -51535, -51874, -51755, -51636, -49609, -50440, -52377, -49545, -47787, -48886, -52418, -53089, -53163, -53234, -55187, -57139, -57661, -58179, -57963, -57746, -56100, -54449, -52921, -51394, -55112, -58827, -57888, -56949, -57441, -57929, -59583, -61238, -62594, -63947, -65519, -62322]
-11565f2322M508J647j512j513j692j691j528j528J811J811p83p82K556K556J021J021K452
-11548e3968K451m09m10j841j841J975J975M359M360l152l153l152l152P71P72P71P71j971
-11530e4844j971j971j971J382J383J382J382j121j122j121j122K95K94K94K95j018j017j017
-11512f1588j017J233J233J234J233J979J978m06m06k24k20k19k20k936k933M06M07R53R58
-11493e8555m73m73J78J83J83J82P23P27P26P27j155j152j151j151L040L044k023k023r84
-11474e9427J882L253j517l555J215j56l018J11J12o7o7j312j311J073J073o0n9o0n9J565
-11454f0384J564n21n22j416L354L353j416j080j081J006J006l376l375J691J692L145K83
-11437e6077k221K549p90p90R39R39l764l763N29N29n44n44K795K794K910K910N295N295N831
$$ y = [-62322, -57814, -56167, -57679, -59192, -60884, -62575, -64103, -65631, -63820, -62009, -62792, -63574, -61018, -58462, -57441, -56420, -53968, -51517, -51926, -52336, -54177, -56018, -54043, -52068, -47709, -43349, -46501, -49654, -52806, -55958, -55187, -54415, -53644, -52873, -54844, -56815, -58786, -60757, -59375, -57992, -56610, -55228, -56349, -57471, -58592, -59714, -59419, -59125, -58831, -58536, -59554, -60571, -61588, -62605, -61372, -60139, -58905, -57672, -55693, -53715, -54121, -54527, -54751, -54971, -55190, -55410, -58346, -61279, -60873, -60466, -59513, -58555, -59028, -59501, -59323, -59140, -58957, -58775, -58052, -57325, -56599, -55872, -57027, -58179, -59330, -60481, -57441, -54397, -56420, -58443, -59427, -57545, -54292, -55809, -59364, -58149, -58305, -61323, -61212, -61100, -61167, -61234, -62546, -63857, -62784, -61711, -61771, -61830, -61890, -61949, -60384, -58820, -59341, -59863, -61279, -57925, -54572, -55988, -57068, -58149, -57143, -56137, -59513, -62888, -61197, -59505, -56360, -56077, -58298, -55749, -56539, -57329, -56390, -55451, -59215, -62978, -62449, -61920, -62464, -63008, -60213, -57419, -54509, -51599, -46304, -41009, -35178]
-11418c5178N831L149L148J114l655l655o517n593n592n26n25l126l123j039L733k977k973
-11401e7504K090K094j852j848q98J967L484j281j644J223K708j49l133l130K113K116K113
-11384e1531K116j941j938n10n07k478k474L84L87j26j27p23K139M344k332j259j260J304
-11366e6532J304j26j27R46R47m85m84n07n06n07n07K623K623K623K624o86o86o85o86j043
-11346d9877j043j044j043q79q76q79q76J386J390J386J390q35q31q34q31m77m73m77m73m96
-11326e6692m96m95m96p64p63M88M88N18k344n55M214J949J948Q17Q16k557k556k556k556
-11307f1592J528J528J527J528j334j334j334j334k01k01k01k02P46P49k117k112N9O3K922
-11288f1312K925R09R13n22n18K83K87K83K87l286l283m24m22P08P12J006J010k2M750L674
$$ y = [-35178, -29347, -26198, -23050, -21936, -25591, -29246, -35763, -41356, -46948, -47474, -47999, -51125, -54248, -55287, -51554, -54531, -57504, -55414, -53320, -55172, -57020, -57918, -55951, -52467, -53748, -55392, -54169, -51461, -51610, -54743, -57873, -55760, -53644, -51531, -49415, -51356, -53294, -53804, -54311, -56789, -59263, -58879, -58492, -58618, -58745, -59468, -57329, -52985, -55317, -56576, -57836, -56532, -55228, -55354, -55481, -54535, -53588, -54073, -54557, -55064, -55570, -56077, -56584, -53961, -51338, -48715, -46091, -46777, -47463, -48148, -48834, -49877, -50920, -51964, -53007, -53886, -54762, -55641, -56517, -55131, -53741, -52355, -50965, -51800, -52631, -53465, -54296, -54773, -55246, -55723, -56196, -56692, -57188, -57683, -58179, -58943, -59706, -59218, -58730, -58212, -60556, -61111, -56897, -54948, -53000, -52183, -51367, -53924, -56480, -59036, -61592, -60064, -58536, -57009, -55481, -56815, -58149, -59483, -60817, -61018, -61219, -61420, -61622, -60876, -60127, -62244, -64356, -64297, -64234, -61312, -58387, -57478, -56565, -57087, -57605, -57322, -57035, -56752, -56465, -59751, -63034, -63458, -63880, -63172, -62460, -61454, -60444, -60466, -55716, -52042]
-11268e2042Q16M55M58K76K79j155j151j155j152J617J621j244j241j014j009M17M21J043
-11250e3760J047j818j814p90p90p90p90K250K251K250K251o78o78o78o79j363j364J498J498
-11231e2947j409j408K2K2r01r02N29N29l65l65j796j796l05l06l06l05M88M88M88M88P1P1
-11209e9915P1P1k478k478L84L83J457J457j404j405J919J919J919J918J383J382J383J382
-11191e0652j822j822j822j822j822j822J039J040K247K250o11o11L43L43L42L43j077j073
-11173e7009j073j073N37N36N37N36K977K977J16J19q68q64J993J997j636j635k05k01k590
-11154e4829k586M51M55N47L410J203j654n206k339J60J64J937J938K295n63k414M51r0q5
-11135e6755K340n18j949R13j60j61J9J9J434J438J439J438j721j722M84M85K213o48j543
$$ y = [-52042, -51226, -50771, -50313, -50037, -49758, -50913, -52064, -53219, -54371, -52754, -51133, -52377, -53618, -54632, -55641, -55224, -54803, -53760, -52713, -54531, -56345, -57135, -57925, -58715, -59505, -57255, -55004, -52754, -50503, -51181, -51859, -52537, -53216, -54579, -55943, -54445, -52947, -54356, -55764, -55742, -55720, -56621, -57523, -56994, -56465, -56830, -57195, -58991, -60787, -61092, -61398, -61704, -62009, -61521, -61033, -60545, -60057, -59986, -59915, -59844, -59773, -62251, -64729, -64345, -63962, -62505, -61048, -62452, -63857, -61938, -60019, -58100, -56182, -54799, -53417, -52034, -50652, -52474, -54296, -56118, -57940, -59762, -61584, -60545, -59505, -57258, -55008, -55619, -56230, -55887, -55544, -55202, -54859, -55936, -57009, -58082, -59155, -58618, -58082, -57545, -57009, -54032, -51055, -50939, -50820, -51688, -52552, -50559, -48562, -50198, -51833, -52038, -52239, -54829, -57415, -56964, -56509, -55962, -52552, -51349, -53003, -58209, -60548, -60388, -60224, -58287, -56349, -54054, -54617, -57031, -56580, -56670, -56755, -54415, -54933, -56882, -55969, -56129, -56290, -56271, -56252, -54818, -53380, -51941, -50503, -52224, -53946, -53462, -52977, -50764, -51412, -52955]
-11116e2955m404k258O04K153K154l50l51J081J081k31k31k31l093j256m117O52O52J75J75
-11097f0750lK857K217K217Q46k016l714q54O97O97j640j635j461j457j788J077J848J852
-11079f1010K369K374R39R42j04j01j04j00K664K668R35j923n55n52k939k936k553L13M88
-11060e9185k369j510J357o15o11K306n55J055J054J472J472M1M1j942j941M43M44J934J934
-11041e5175N03N03r95r95K045q16r35r35j114j114O3O3J673j188J017J017Q39Q38j315j312
-11021e7333j311j312M73M77M77M77O45O48O48O49j144j140K198K198j337j334R7R6n03m99
-11001e6830R32R31j777j774J565J565q23q20k251k250j848j845N37N40N07N10N07N11J863
-10982f0250J866n21n18k430k425J863J867J136J140J137J140l395l390K805K810J23J26J23
$$ y = [-52955, -57359, -59617, -59013, -56860, -54706, -55056, -55407, -54326, -53245, -53476, -53707, -53938, -57031, -58287, -62404, -61752, -61100, -60925, -60750, -60753, -57896, -55679, -53462, -52616, -54632, -58346, -59200, -58503, -57806, -59446, -61081, -62542, -63999, -65787, -64710, -62862, -61010, -58641, -56267, -55328, -54386, -54490, -54591, -54695, -54795, -52131, -49463, -48528, -50451, -51006, -51558, -54497, -57433, -59986, -59673, -59185, -61554, -63064, -61707, -62322, -62933, -60627, -61182, -60127, -59073, -57601, -56129, -56088, -56047, -57989, -59930, -59487, -59043, -57109, -55175, -54672, -54169, -55164, -56159, -54114, -54930, -55865, -56800, -57914, -59028, -58965, -58902, -57229, -58417, -57400, -56383, -55544, -54706, -56021, -57333, -58644, -59956, -59483, -59006, -58529, -58052, -57407, -56759, -56111, -55462, -56606, -57746, -55548, -53350, -54687, -56021, -55924, -55828, -56331, -56830, -55898, -54967, -56744, -58518, -56953, -55388, -56211, -57031, -59282, -61532, -63380, -65225, -64688, -64148, -63641, -63131, -62624, -62113, -60250, -58384, -58905, -59423, -61853, -64278, -62415, -60548, -59412, -58272, -57135, -55995, -59390, -62780, -59975, -57165, -57042, -56916, -56793]
-10964e6793J27k142k139K42K46J203J208J207J207m36m32m32m32M91M96M96M95J04J09J08
-10944e5067J08K690K694o45o44k288k284J054J055J613J617J86J87J82J87k199k198j420
-10926e5172j419k851k850k016k016K277K276Q2Q2J513J513J244J245J244J245p97p98O34
-10908e4564O33k109k109K76K76j405j405j405j404N6N5N6N6M85M88M84M88J856J859j304
-10888e8637j300j617J248J244J248N30L394J960q98k918k913m14K452P49P52j456j454m88
-10870e8518m84k277N89K701j56k485K287L84L88K112K117M43M47r87r84k224k221J114J118
-10851e6636k57k54k462k460k194O70L10L13J620j237k671J94K157K161N377K519n56n51O97
-10832e3260P00j002j002j003j002l625l626k87k87J502J501L112K49j747j748J412J413q68
$$ y = [-56793, -56666, -58808, -60947, -60705, -60459, -59256, -58048, -56841, -55634, -56070, -56502, -56934, -57366, -56875, -56379, -55883, -55388, -55284, -55175, -55067, -54959, -52269, -49575, -50220, -50864, -53152, -55436, -54382, -53327, -51714, -50097, -49911, -49724, -49542, -49355, -51554, -53752, -55172, -56591, -59442, -62292, -64308, -66324, -64047, -61771, -61689, -61607, -60094, -58581, -57337, -56092, -54848, -53603, -54400, -55198, -54564, -53931, -56040, -58149, -57873, -57597, -59002, -60407, -61812, -63216, -63160, -63105, -63049, -62993, -62508, -62020, -61536, -61048, -59192, -57333, -58637, -59937, -61554, -60306, -59062, -57814, -57284, -53890, -51930, -52828, -55746, -58659, -59073, -56621, -55872, -55120, -56576, -58030, -58518, -59002, -61279, -60690, -57989, -58145, -60630, -58343, -57959, -57571, -55459, -53342, -52899, -52452, -53439, -54423, -56647, -58868, -57754, -56636, -56893, -57147, -59609, -62069, -64263, -63593, -63283, -62970, -61350, -62587, -65258, -65064, -62907, -60746, -55369, -52850, -53406, -53957, -53260, -52560, -53562, -54564, -55567, -56569, -60194, -63820, -64107, -64394, -62892, -61391, -58279, -58030, -59777, -61525, -60113, -58700, -59568]
-10814e9568q69K351n10n101k239K64K65q98q98O52L514L83k477l373J398L320L320R35j927
-10795f1458J2J1l208l47J75J75R51L811K143p19k150P11L942J081L06L05J170j692q2q1j979
-10774e6923j979J360J360O15O15q16q16j263j259J121J125J003J006J002J006pmqlN2N6j379
-10752e4136j375q20q16O11O15r68r66r68r65J758J763L28L31j371j367j372j367J013J018
-10733e9054J013J017O0O3k325k321J34J38L473L476K280K284j04j00j573j569j41j38J170
-10714e2217J174j215j211P38P41j647j643q42q38q42q39j967j967J371J371l58l57l58l58
-10695f1264J655J654j684j684J296J297J297J296K690K691o49o48K005K004k288k287k914
-10678e5533k914n29n29n2n2J378J379J647J650K16K20j155j151K76K79j110j107L20L25j468
$$ y = [-59568, -60437, -58086, -58596, -63697, -65936, -65672, -65407, -66305, -67203, -66551, -63037, -62654, -65131, -68504, -67106, -63786, -60466, -59531, -61458, -61446, -61435, -64643, -64990, -64815, -64640, -63689, -59878, -57735, -58454, -60604, -59893, -55951, -54870, -54564, -54259, -53089, -54781, -54863, -54944, -56923, -58902, -57542, -56182, -55567, -54952, -55768, -56584, -57847, -59106, -57985, -56860, -55857, -54851, -53849, -52843, -52850, -52854, -52862, -52865, -52813, -52757, -54136, -55511, -56331, -57147, -56536, -55921, -56889, -57855, -58823, -59788, -58030, -56267, -55939, -55608, -56979, -58346, -59718, -61085, -60072, -59054, -58041, -57024, -56964, -56901, -59226, -61547, -61413, -61275, -57802, -54326, -52046, -49762, -49866, -49966, -51539, -53108, -53249, -53387, -52217, -51043, -52258, -53469, -52731, -51990, -53637, -55280, -56122, -56960, -57802, -58641, -60608, -62575, -61204, -59833, -60191, -60548, -60906, -61264, -59609, -57955, -59639, -61323, -60027, -58730, -57433, -56137, -53447, -50756, -51405, -52053, -50048, -48044, -50332, -52619, -55533, -58447, -58976, -59505, -59557, -59609, -58231, -56852, -55205, -53555, -53339, -53119, -54274, -55425, -55149, -54870, -55980, -57087, -56767, -56442, -57910]
-10658e7910j465R17R20J371J375n9n6j729j725J609J614J520J524q65q60j371j368O0O3K981
-10638e3454K984J20J23Q9R3R0R3Q05Q08k057k053N67N70k295k292k38k35k39k34M17M21M17
-10616e5500M21P38P42P37P42N29N33r02q98j785j784K984K985J822J822j040j039j182j181
-10597e1256j181j181J90J90J90J90l24l24l24l25J83J83J82J83j666j665l097l096K448K448
-10577e8052m14m13Q90Q91n40n41L484L484O22O23j524j524j524j524o60o59P71P71J60J61
-10557e5518k702k701M88M88r43r42J00J01J531J532K008K008k761k761j415j416j416j416
-10539f5735J446J445j416j415J624J625J624J625k907k906m5m4J684J684J684J684n51n52
-10521e9446Q80Q79O56O56L517L517l726l726q64q64J266J271j595j591J446J449j416j412
$$ y = [-57910, -59375, -58458, -57538, -56167, -54792, -54851, -54907, -56636, -58361, -56752, -55138, -53618, -52094, -52959, -53819, -55190, -56558, -56498, -56435, -53454, -50470, -50350, -50227, -50138, -50045, -49955, -49862, -49057, -48249, -50306, -52359, -51792, -51222, -53517, -55809, -56047, -56282, -56521, -56755, -56338, -55917, -55500, -55079, -54341, -53599, -52862, -52120, -51591, -51058, -51960, -52858, -54643, -56427, -53443, -50458, -48636, -46814, -47854, -48893, -50075, -51256, -52437, -53618, -53428, -53238, -53048, -52858, -53182, -53506, -53830, -54155, -53972, -53789, -53607, -53424, -55090, -56755, -59852, -62948, -60500, -58052, -58466, -58879, -57989, -57098, -57638, -58179, -54695, -51211, -50589, -49966, -51490, -53014, -54538, -56062, -56722, -57381, -56610, -55839, -55679, -55518, -58220, -60921, -60433, -59945, -60888, -61830, -61730, -61629, -60098, -58566, -56558, -54550, -57311, -60072, -61487, -62903, -64319, -65735, -64289, -62844, -64260, -65675, -64051, -62426, -60802, -59177, -62084, -64990, -65035, -65079, -63395, -61711, -60027, -58343, -58894, -59446, -58566, -57687, -57031, -56375, -52858, -49341, -53067, -56793, -57657, -58521, -57255, -55984, -57579, -59170, -57724, -56275, -57691, -59103]
-10503e9103N67N70N66N70J818J822j043j039J702J707j159j155K72K76K72K76n11n07n10
-10484e4609n07n10n07n11n06R68R73R69R72p30p27P01P04m84m81K377K381n44n40n44n40
-10463e1695J121J125l09l05l976l972P94P97M06M10M06M10L447L450l231l226j267j263m129
-10444f1007m124P60P63K191K195j893j889m62m58m92m88m92m88P97Q01K229K231J364J368
-10425e7094J721l998J56J61k02j97k2j9k2j9j103j099j103j099J401J405J401J404K102K105
-10405e4121K101K106l354l349m92m88j312j308J19J23K266K269M77M81j64n884J94J97J64
-10386e9975J68J64J68J259J263J260J263P82P86o48o45l085l081J207J211p00o97p01o96
-10367f0697r51r50r50r50Q38Q39j547j546j166j166N987N988K023K024N92N92Q01Q02Q01
$$ y = [-59103, -58536, -57966, -57400, -56830, -55012, -53190, -54233, -55272, -53570, -51863, -53022, -54177, -53905, -53629, -53357, -53081, -53592, -54099, -54609, -55116, -55626, -56133, -56644, -57150, -56182, -55209, -54240, -53268, -53998, -54725, -54024, -53320, -53804, -54285, -51908, -49527, -50071, -50611, -51155, -51695, -50574, -49449, -49758, -50063, -54039, -58011, -57217, -56420, -56014, -55604, -55198, -54788, -51341, -47891, -51122, -54348, -55615, -56878, -61007, -65131, -64371, -63608, -61417, -59222, -61115, -63004, -63466, -63924, -64416, -64904, -65396, -65884, -65087, -64286, -62057, -59826, -58462, -57094, -55373, -59371, -59215, -59054, -59256, -59453, -59475, -59494, -59516, -59535, -60638, -61737, -62840, -63939, -62538, -61133, -59732, -58328, -56226, -54121, -52020, -49914, -53268, -56617, -57109, -57597, -58909, -60217, -60098, -59975, -57709, -55440, -54963, -54482, -54646, -60530, -60336, -60139, -59975, -59807, -59643, -59475, -58216, -56953, -55693, -54430, -53648, -52862, -53510, -54155, -57240, -60321, -59114, -57903, -58603, -59300, -60001, -60697, -61648, -62598, -63548, -64498, -63660, -62821, -64368, -65914, -67080, -68246, -62259, -56271, -54248, -52224, -51632, -51040, -50239, -49437, -48636]
-10348d8636Q01k210k209p79p79j911j912M74M73n11n10n11n10J487J490N6N9J040J043k299
-10328e5854k295k060k057o30o26K769K772J337J342P23P26p08p04q2p8q2p8l987l983L05
-10308f3250L09K899K903j394j389L57L62J788J792k742k739j311j308K191K195j94j90J118
-10290e8603J121K549K552J654J658p30p26k519k515J773J778J557J561j781j777K16K20K16
-10272e1796K20K12K16k172k168J374J379n6n2j569j565j37j35j032j028k463k459K560K559
-10253e8112p78p79P12P11j673j673Q76Q75K128k642l76l76K664K664K113K112k180k179n042
-10234f0955n041p49p49K426K426R94R95m36m36m36m36L92L95L91L95K72K76j159j155j308
-10214f3898j304J077J080M81M84M81M84n92n89n92n89K627K630K43K45k6k2J405J408l84
$$ y = [-48636, -47835, -50045, -52254, -53033, -53812, -55723, -57635, -57161, -56688, -57199, -57709, -58220, -58730, -57243, -55753, -55697, -55638, -54598, -53555, -55854, -58149, -60209, -62266, -62896, -63522, -60753, -57981, -56644, -55302, -54579, -53853, -54561, -55265, -55347, -55425, -55507, -55585, -59572, -63555, -63250, -62941, -60042, -57139, -58533, -59922, -59565, -59203, -57415, -55623, -58365, -61104, -62415, -63723, -61532, -59337, -59531, -59721, -58603, -57482, -54933, -52381, -50727, -49069, -49799, -50525, -53044, -55559, -53786, -52008, -50451, -48890, -50671, -52448, -52232, -52012, -51796, -51576, -51364, -51148, -53320, -55488, -54114, -52735, -52791, -52843, -54412, -55977, -56114, -56249, -57281, -58309, -60772, -63231, -60671, -58112, -58890, -59669, -58957, -58246, -59919, -61592, -60716, -59841, -57713, -60355, -60731, -61107, -58443, -55779, -53666, -51554, -53734, -55913, -60955, -65996, -66745, -67494, -65068, -62642, -61648, -60653, -61089, -61525, -61961, -62397, -62005, -61610, -61219, -60824, -60552, -60276, -61435, -62590, -63898, -65202, -64125, -63045, -62564, -62080, -61599, -61115, -61707, -62296, -62888, -63477, -60850, -58220, -57977, -57732, -57758, -57780, -56375, -54967, -55351]
-10194e5351l80l83l81l24l24l24l24N70N70K001K001q98q98J486J487J368J367j315j315
-10175e1367L603j167l431n70l02l02j23j23n63n62Q68Q68k411k410R27R28P49P49P49P49
-10155e3141k023k024k023k023o67o67o67o67J122J121J122J121l61l62l61l61j196j197j196
-10136f4450j196J420J420J419J420j263j263L029L029K157K158k135k135j68j68j598j598
-10119e9922J017J017k321k322J018J017J017J017l28l24j49j45J49L014J699l066l398l395
-10101f4405N96O00K266K269Q34Q39n00m95K839K843K601K604k645k642k83k80k369k366l056
-10082f0750J718Q20k038Q68L730J166j696J644J643J464J465k784k783N55N55K552K553J121
-10064d8197J122k42k42J188J189k478k478Q61L722K225k545j293J568j501j502k574K194
$$ y = [-55351, -55731, -56114, -56495, -56819, -57143, -57467, -57791, -57221, -56651, -54650, -52649, -53547, -54445, -52959, -51472, -50104, -48737, -50052, -51367, -47764, -48931, -52362, -52932, -53234, -53536, -53659, -53782, -54345, -54907, -54039, -53171, -55582, -57992, -57065, -56137, -55388, -54639, -53890, -53141, -55164, -57188, -59211, -61234, -61901, -62568, -63235, -63902, -62780, -61659, -60537, -59416, -59777, -60139, -60500, -60861, -62057, -63254, -64450, -65646, -64226, -62806, -61387, -59967, -61230, -62493, -59464, -56435, -54278, -52120, -54255, -56390, -56558, -56726, -58324, -59922, -58905, -57888, -60209, -62531, -61513, -60496, -59479, -58462, -58790, -59114, -59263, -59408, -59259, -56245, -54546, -57612, -61010, -64405, -63809, -63209, -60943, -58674, -57840, -57001, -57501, -57996, -55157, -52314, -49713, -47109, -49754, -52396, -52679, -52959, -55328, -57694, -60750, -59032, -58212, -60250, -59382, -55652, -54486, -56182, -54538, -52895, -51431, -49966, -52750, -55533, -54978, -54423, -51871, -49318, -48197, -47075, -47317, -47559, -46371, -45182, -47660, -50138, -49277, -45555, -43330, -45875, -47168, -45600, -47101, -48603, -51177, -48983]
-10047d8983J681J680m06m06j181j182K50K50j479j480R06R05p8p8k463k463J211J211J211
-10028e0894J211M013M013O74O74j442j442j442j442j531j531j01j01j08j08J323J323J203
-10010d5708J204k27k28j792j792N92N93p79p79k209k210k712k713j282j281N06N07M799M799
-9991e0712J647J647k645k646j304j304J080J081J64J64J64J64J893J892N232N231k213k213
-9973d2678k214k213k46k46k46k46q23q20K515K519o44o41o45o41O97P00k641k638j837j834
-9953e4822N48N52J00J05j331j326j9j5j449j446J159J163J635j222l074J699K173K176L096
-9934e0298L100k42k39j285j282j285j282K247K250L678L681K903K906j271o036l528J244
-9917d4739M9k810m303j439K970j796k202O63r50r46k739K034o52o48j878j874N10N11R54
$$ y = [-48983, -47302, -45622, -46028, -46434, -47615, -48797, -48547, -48297, -49776, -51256, -50350, -49445, -49523, -49601, -52064, -54527, -53316, -52105, -50894, -49683, -45670, -41657, -40983, -40309, -41751, -43193, -44635, -46077, -47608, -49139, -49240, -49341, -49449, -49557, -48234, -46911, -45708, -44504, -44731, -44959, -46751, -48543, -47951, -47358, -48137, -48916, -51125, -53335, -56047, -58760, -60042, -61323, -60817, -60310, -55511, -50712, -49065, -47418, -50063, -52709, -54013, -55317, -54237, -53156, -52992, -52828, -52664, -52500, -50607, -48715, -43483, -38252, -40465, -42678, -44892, -47105, -47351, -47597, -47843, -48089, -48912, -49732, -47217, -44698, -45342, -45983, -46628, -47269, -46572, -45872, -48513, -51151, -52988, -54822, -54274, -53722, -53622, -53517, -54848, -56174, -56193, -56208, -57657, -59103, -57944, -56781, -55146, -56368, -59442, -57743, -55570, -53394, -50298, -47198, -47440, -47679, -48964, -50246, -51531, -52813, -50566, -48316, -44638, -40957, -38054, -35148, -36419, -42455, -45983, -44739, -44690, -47500, -51803, -53242, -50272, -52068, -54270, -53607, -54557, -55503, -58242, -56208, -56860, -57508, -59386, -61260, -60750, -60239, -59285]
-9898e9285R57R58R57q04q01q02q01L28L32k053k053N51N55K940K940K817K821k426k426L160
-9878e2135L163j129j129q34q31q31q31j613j610m475K98O018L159J75k682p49K116K113p45
-9859e2552k359N07j286j281m759m754J919J923m9m5m8m5m06m02m06m03J90J94J90J94k50
-9838f3928k46k46k46K016K020K019K020L46L50L51L50j442j438j439j438J047J051J051J050
-9819e6752k6k2k2k3M96M99M99N00n78n74n73n74r43r43r42r39J90J90J90J94K343K344n18
-9796e5984n14M95M96M95N00j31j30j31j26j31j30j30j27Q6Q5Q6Q9o89o89o90o85l361l361
-9773f4677J409J408m99n00m99m99M061M062p08p08J26J27J27J26j468j468J215J215j707
-9754e8857m568j170L599N038K68L88L87p45p45p45p46L99L99L99M02L99L98L99M02R65R66
$$ y = [-59285, -58328, -57370, -56413, -57217, -58018, -58820, -59621, -59293, -58961, -61014, -63067, -62516, -61961, -59021, -56081, -53264, -50443, -52869, -55295, -52135, -48972, -50101, -51230, -52064, -52895, -53726, -54557, -56170, -57780, -62255, -61957, -55939, -52780, -52605, -55287, -56036, -53920, -51807, -52552, -54911, -54404, -55690, -56971, -61730, -66484, -64565, -62642, -62691, -62736, -62784, -62829, -63235, -63637, -64043, -64446, -64256, -64062, -63872, -63678, -63928, -64174, -64420, -64666, -62650, -60630, -58611, -56591, -56245, -55895, -55544, -55194, -56636, -58074, -59513, -60951, -59904, -58853, -57802, -56752, -56778, -56800, -56822, -56845, -56349, -55850, -55351, -54851, -55429, -56003, -56576, -57150, -58093, -59036, -59978, -60917, -60727, -60537, -60347, -60153, -57810, -55466, -55984, -56498, -56003, -55507, -55012, -54512, -54643, -54773, -54904, -55030, -55161, -55291, -55421, -55548, -55462, -55377, -55291, -55202, -55891, -56580, -57270, -57955, -61316, -64677, -63268, -61860, -62359, -62859, -63358, -63857, -59796, -55734, -56442, -57150, -57024, -56897, -56770, -56644, -58112, -59580, -58365, -57150, -58857, -63425, -64595, -60996, -55958, -55690, -55302, -54915, -55660, -56405, -57150, -57896, -57497, -57098, -56699, -56297, -55898, -55500, -55101, -54699, -53734, -52768]
-9733e2768K574k83j897j896l685q20J554J554r50r47r50J911L02L06p04p05p04p00K455K456
-9713e3897m07m02J766J766J766J767j156j155j155j155k46k46k46k45j081j081j080j081
-9695e7568O64O63Q42Q42O7K929L107K46l584p23J960r02j080j081j259j260j855j852j856
-9676f1700j852r61r58r61r57L226L231J975q84J27J31n3m8K407K407m55m54K2K3K2K2j296
-9654e6986j297J565J565j297j296m159O11J290j569L35L39j632j628J230J233m5m1j296m155
-9635f7233m02l99M92L357K686j75J614J613L02L02LMK284k485k485K284J032J032J330J330
-9615e3514j699j695J162J167l518l513k087k083J833J837J834J836j04j00k84k79Q20k038
-9597f0425l294J479J297j562L43L47l58l54l58l54N67N70J997K001j673j669J188J193m982
$$ y = [-52768, -50194, -50477, -52374, -54270, -57955, -58775, -57221, -55667, -56617, -57564, -58514, -56603, -56301, -55995, -56699, -57404, -58108, -58808, -56353, -53897, -54304, -54706, -52940, -51174, -49408, -47641, -48797, -49952, -51107, -52262, -52508, -52754, -53000, -53245, -54326, -55407, -56487, -57568, -56904, -56241, -55399, -54557, -54490, -51561, -48454, -48208, -51792, -52515, -50555, -51457, -52537, -53618, -54877, -56137, -57992, -59844, -61700, -63552, -64513, -65471, -66432, -67389, -64163, -60932, -58957, -59841, -59714, -59583, -59636, -59684, -57277, -54870, -55325, -55779, -55757, -55734, -55712, -55690, -56986, -58283, -56718, -55153, -56450, -57746, -61905, -61294, -60004, -61573, -61238, -60899, -62531, -64159, -62929, -61696, -61741, -61782, -63078, -67233, -67635, -68034, -67542, -64185, -61499, -61674, -60060, -58447, -58145, -57843, -57840, -57836, -55552, -58037, -60522, -58238, -57206, -56174, -54844, -53514, -55213, -56908, -55746, -54579, -58097, -61610, -63697, -65780, -63947, -62110, -60276, -58440, -58544, -58644, -58928, -59207, -58387, -60425, -63719, -62240, -60943, -62505, -62162, -61815, -62173, -62527, -62885, -63239, -62672, -62102, -60105, -58104, -59777, -61446, -60258, -59065, -64047]
-9578f4047m978k13k08k225k220j38M635J591J595J889J893J173J178J173J178j032j029J830
-9560e7955J833r3q9r4q9Q6Q9Q6Q9MMLMm169m170K508K507K434K433m244m244R13R13L357
-9536e7884L357M780j896M28N198m66l327j420j419P11P12p19p19k061k060K411K410j594
-9518e3558o364k609K54L234L72P31P30j34j34J296J297l264l264J505J506Q72Q72K302K303
-9499e2053k31k31k31k31m55m54m55m54q13q12q12q13r39r38r39r39l443l443J326J327K071
-9478f3962K072p90p90k53k53k54k53j498j498J364J364M39M40M40M39k90k91J140J140J409
-9458e9885J408l361l361l3l0K828K832K142K147P11P16O67O70k194k191l17l13J114J118
-9439e5332q6q2J345J349k351k347N10N14L47L50m423m419J68J71J68J71L112L115j658j655
$$ y = [-64047, -69025, -69238, -69446, -71671, -73891, -74029, -69394, -67803, -66208, -64319, -62426, -61253, -60075, -58902, -57724, -58756, -59785, -57955, -56122, -56215, -56304, -56398, -56487, -56401, -56312, -56226, -56137, -56133, -56129, -56126, -56122, -60291, -64461, -61953, -59446, -57012, -54579, -58823, -63067, -62154, -61241, -57884, -54527, -49747, -51643, -51215, -46017, -46483, -49810, -51230, -52649, -51938, -51226, -51945, -52664, -54725, -56785, -54374, -51964, -53558, -59922, -62531, -62277, -59043, -58671, -57940, -57210, -57344, -57478, -56182, -54885, -58149, -61413, -59908, -58402, -57530, -56658, -54356, -52053, -52284, -52515, -52746, -52977, -53432, -53886, -54341, -54795, -55608, -56420, -57232, -58045, -58984, -59922, -60861, -61800, -65243, -68686, -67360, -66033, -63962, -61890, -62680, -63470, -63723, -63976, -64230, -64483, -65981, -67479, -66115, -64751, -64312, -63872, -63432, -62993, -63283, -63574, -62434, -61294, -59885, -58477, -61838, -65199, -65232, -65262, -62434, -59602, -57460, -55313, -54602, -53886, -53219, -52549, -54743, -56934, -57251, -57564, -56450, -55332, -55418, -55500, -54155, -52806, -55157, -57504, -56994, -56480, -56133, -55783, -60206, -64625, -64457, -64286, -64118, -63947, -60835, -57720, -59378, -61033]
-9419f1033k87k83K575K578K947K952j823j818K35K38j196j192j979j974Q83Q87J449J453
-9401e5388J450J453j815j811j814j811k65k61K598K600J673J677l096l093L312L317M51M54
-9383e0369R28R31n03m99J912J915J911J915N176N179N175N180J330J334J330J334o569o565
-9365b8955n139n134n913n910l051l048j282j282j460J401J460J461k832L0R39R39l13l13
-9347e8402j416j416j416j416O11O11N202N201J953r09n52l413k042k042o11o11j64K698K519
-9328e5615K519L35L39j274j271M85k374m10l268k615K49K929P1J170J174j692j688j729J137
-9309f1528J311j546j789J077K146K150K892K895j49j46K594k65j520j516j98j97j9j9k492
-9290e6319L68j061j062l17K545J114j748j747j748q53K008P87k076j717j718j837j837Q46
$$ y = [-61033, -61320, -61603, -59028, -56450, -53503, -50551, -52374, -54192, -53957, -53719, -54915, -56107, -58086, -60060, -59177, -58290, -56841, -55388, -53938, -52485, -54300, -56111, -57925, -59736, -60001, -60262, -57664, -55064, -53391, -51714, -54810, -57903, -54591, -51274, -50823, -50369, -49441, -48510, -49013, -49512, -47600, -45685, -43774, -41859, -36683, -31504, -26329, -21149, -19819, -18485, -17155, -15821, -22390, -28955, -34094, -39228, -45141, -51051, -54102, -57150, -58432, -59714, -61174, -59773, -58313, -56852, -59684, -59654, -58715, -57776, -58089, -58402, -59818, -61234, -62650, -64066, -63455, -62844, -57642, -52441, -50488, -51397, -51949, -55362, -57404, -59446, -60057, -60668, -60832, -58134, -55615, -53096, -52761, -52422, -53696, -54967, -54482, -56856, -57266, -60534, -63149, -62900, -59971, -59900, -58730, -57556, -59248, -60936, -62665, -61528, -60217, -61763, -63552, -62475, -60329, -58179, -55287, -52392, -52541, -52687, -50093, -50358, -51878, -53394, -53592, -53789, -53808, -53827, -56319, -55951, -57012, -58074, -58391, -55846, -54732, -56480, -58227, -59975, -60828, -58820, -58033, -60109, -61826, -63544, -65381, -67218, -66372]
-9272f6372Q46J90k672j241J621N585N586R95R94L84L84J993q68k299k299L84L84m73m74O00
-9252e6752L462K329n33j606j606J069J070Q90Q91K142p19Q91Q90Q83Q83Q83l886m423j561
-9233e4803k038k038J930J934L361L364j051j047j050j047j319j316j319j315P08P12P08P11
-9215e4915J677J680J677J681l51l46l50l47j393j390j394j390j989j986j990j986L39L39
-9197f2434L39L39r72r73r72r73J487J487J486J487q68q68J993J994N6N5J487J487k13k12
-9177e4788J218J219k038k038o08o07R72R73j889j889J49J49J580J579N97N96N96N96n29n29
-9157e4691n29n29j126j125j125j125L57L58L58L57K624K623K623K623q50q49q50q49j446
-9138e3171j446j445j446k20k16k20k16Q53Q57Q57Q57j97j94j97j94j181j178j177j178o11
$$ y = [-66372, -65526, -65336, -68008, -69249, -67628, -62043, -56457, -55462, -54468, -54084, -53700, -51707, -52575, -54874, -57173, -56789, -56405, -56878, -57352, -56752, -53290, -50961, -51494, -53100, -54706, -53637, -52567, -51677, -50786, -48644, -49363, -48472, -47582, -46699, -45816, -44933, -48819, -53242, -54803, -56841, -58879, -56949, -55015, -51654, -48290, -49341, -50388, -51438, -52485, -53804, -55120, -56439, -57754, -57046, -56334, -55626, -54915, -53238, -51558, -49881, -48200, -48551, -48897, -49247, -49594, -50987, -52377, -53771, -55161, -57150, -59136, -61126, -63112, -62773, -62434, -62095, -61756, -62728, -63701, -64673, -65646, -64159, -62672, -61186, -59699, -60567, -61435, -59442, -57448, -57392, -57337, -55850, -54363, -54576, -54788, -53570, -52351, -54389, -56427, -57035, -57642, -56670, -55697, -57586, -59475, -59326, -59177, -57597, -56018, -55421, -54825, -54229, -53633, -54162, -54691, -55220, -55749, -56875, -58000, -59125, -60250, -59893, -59535, -59177, -58820, -56196, -53573, -50950, -48327, -49177, -50026, -50876, -51725, -53171, -54617, -56062, -57508, -57728, -57944, -58164, -58380, -57527, -56670, -55813, -54956, -55153, -55347, -55544, -55738, -56919, -58097, -59274, -60452, -61063]
-9118f1063o11Q20Q20J803J804j059j054M25M24L287L286Q42Q42k019k016K24K27K27K27p86
-9098e3350p86p86p86K056K061K060K061n33n33n33n32j118j118k549k544o71o67K191K194
-9079e3883K363K362k407k403M54M59M54M58j043j043j043j044l57l58l58l57J803J803L235
-9060e0905L234j05j04K757K758J874J874M43M44r3r3K768K768M475M475N906N906M803M803
-9041b012P663P665Q364Q365J0750J6477K1480L4835N2243Q0862J13052J37852J51922J38571
-9027G88089J07567N6058k2874j01087j47074j68060j53989j17739q3165n4550l6425k3068
-9015D3683j6633j0910q048n183n424k564j133j129n950n951l088l086l715l714j032j029
-8999c4906L39k522n563J64N77N78m96m92k198k198k199k194J170J170J170J173o26o26o26
$$ y = [-61063, -61674, -60854, -60034, -58231, -56427, -57486, -58540, -58115, -57691, -54404, -51118, -50276, -49434, -51453, -53469, -53245, -53018, -52791, -52564, -53350, -54136, -54922, -55708, -53652, -51591, -49531, -47470, -48003, -48536, -49069, -49601, -50719, -51837, -54386, -56930, -57601, -58268, -56077, -53883, -51520, -49158, -51565, -53968, -53514, -53055, -52601, -52143, -53186, -54229, -55272, -56316, -56673, -57031, -57389, -57746, -55943, -54140, -50905, -47671, -47776, -47880, -45123, -42365, -40491, -38617, -38174, -37730, -37823, -37916, -35148, -32380, -27905, -23430, -17524, -11618, -6815, -2012, 5651, 13316, 21680, 30045, 40795, 57272, 78752, 113587, 165830, 246692, 359744, 497596, 649518, 788089, 895656, 951714, 928840, 827753, 680679, 512619, 358630, 240891, 157726, 103176, 66751, 43683, 27050, 16140, 8092, 2909, -2515, -5079, -6212, -7341, -13291, -19242, -22330, -25416, -29131, -32845, -33877, -34906, -34567, -37089, -42652, -42488, -41911, -41333, -41829, -42321, -44519, -46717, -48916, -51110, -49940, -48770, -47600, -46427, -47053, -47679, -48305]
-8980d8305o22O56O56J729J732O796J074k385k385k355k355M323M322M657M658R427R427J1602
-8962B652J1602J3213P489J189j673p694j3418q320q319q678q678m937m937n295M29l17l17
-8945c6009N78k284l287K441r58r57l942l939j077j077N45N47q83q83q2p8p8p9J167J170j692
-8924e0857j692j784j781J080J081L39L43j088j089J204J207j475j476K105M967J807l912
-8907e1021n78n77r35r32J375J375l394l391J82J83j248j245P98P97K228K232J781J781J781
-8888d8808J785j356j356P4P8K847K847j5j1M225M229n44n40j260j255P08k150m688J040K288
-8868d1862n70k303N62J632J636J390J394j472j468J479J483j382j379p12p08k142k139k64
-8850d6825k61m44m39J26k735J27K988L66L65J617M478L451N89k571k571J065j796j796J066
$$ y = [-48305, -48927, -48271, -47615, -45886, -44154, -37358, -36284, -38669, -41054, -43409, -45764, -41441, -37119, -32462, -27804, -18377, -8950, 2652, 14254, 27467, 34956, 36145, 34472, 26778, 13360, 5040, -3279, -11957, -20635, -25572, -30509, -35804, -35375, -35692, -36009, -35431, -37715, -41002, -38561, -39519, -40476, -44418, -48357, -49434, -50511, -49966, -49419, -50302, -51185, -51267, -51345, -51423, -51502, -50335, -49165, -50857, -52549, -54333, -56114, -55034, -53953, -53614, -53271, -54359, -55448, -54244, -53037, -54512, -55988, -53883, -48916, -47109, -51021, -51599, -52176, -53111, -54043, -52668, -51293, -54687, -58078, -57896, -57713, -58961, -60206, -59408, -58611, -56383, -54151, -52370, -50589, -48808, -47023, -48379, -49735, -49661, -49583, -46736, -43889, -43904, -43915, -39690, -35461, -36005, -36545, -37805, -39060, -38352, -40502, -45190, -44150, -41862, -42432, -44735, -44173, -42541, -40905, -39515, -38121, -39593, -41061, -39582, -38099, -39481, -40860, -41572, -42280, -44422, -46561, -46825, -47086, -47530, -47969, -47843, -50578, -50451, -47463, -47097, -46732, -45115, -40637, -37186, -36597, -39168, -41739, -40674, -42470, -44266, -43200]
-8831d3200j617j617j617j617J006j856m25m24n3k913n3K810J677J676J856J855N6O0O0N9
-8811d4277j017j014k623K39L46L51k333k332n48n44k452M10K258k508J75J76P67k090j912
-8792e8928R51p16K150N012K149K802n5l097k34m33m32m546j684j624J237K667K668j013j014
-8773e4140j013j014o55o56K206K205j356j356j178j177l443n81K578K579J192J192j669j669
-8755e7955L100L100K38K39j789j788j610L160J192J193J311J312k102m963l353l354p4p5
-8737f2218p4p5N29N29P08P08k332N29L391N29PQPQj066J796J86J86J87J90J86J90J200J203
-8713e3488J200J204k467k463L95L99R7J00R7J01k95k90k95k90j368j363j368j364K35K39
-8693f0984K34K39J010J013j852j848Q01Q01Q01Q01L25L24L186j584P34L596L595P34k127
$$ y = [-43200, -44817, -46434, -48051, -49668, -48662, -50518, -50943, -51367, -51420, -54333, -54386, -51576, -49899, -48223, -46367, -44512, -44456, -44396, -44336, -44277, -45294, -46308, -48931, -48692, -48346, -47995, -50328, -52660, -53208, -53752, -56204, -55794, -53536, -56044, -55869, -55693, -54926, -57016, -58928, -57977, -58693, -56543, -51531, -49382, -46580, -46635, -49732, -49966, -50399, -50831, -55377, -57061, -58685, -57448, -54781, -52113, -53126, -54140, -55153, -56167, -56822, -57478, -55272, -53067, -54423, -55779, -56957, -58134, -61577, -62158, -59580, -57001, -55809, -54617, -56286, -57955, -54855, -51755, -51517, -51278, -53067, -54855, -56465, -53305, -52113, -50920, -49609, -48297, -50399, -55362, -58715, -62069, -62143, -62218, -62292, -62367, -61838, -61309, -60601, -59893, -62225, -61696, -58305, -57776, -57769, -57761, -57754, -57746, -58812, -57016, -56830, -56644, -56457, -56267, -56081, -55891, -54691, -53488, -52288, -51084, -53551, -56014, -55619, -55220, -55123, -55023, -54926, -54825, -55120, -55410, -55705, -55995, -57363, -58726, -60094, -61458, -61223, -60984, -60750, -60511, -59501, -58488, -60340, -62188, -61387, -60586, -59785, -58984, -58659, -58335, -55149, -56733, -55999, -52403, -48808, -48074, -50201]
-8674e0201K642K641K642N686N686N686N686L182L182J274l495l733q72n641n642o118o118
-8657d3513l257l256m96m95m96m95j867j867j867j866J598J599J598J599O44O45k217k217
-8639e6226K250K251k519k519j624j625J237J237k16k16k16k16j289j290N388N388M62M62
-8621d9281M62M62K728K727K728K727J610J609j252j252l338l339l338l339j349j348m032
-8604e6815P38L838L837M136M136M114M113o55o56k713k712k713k712L24L28K712K713O196
-8586c1791O200K862K861L939L942J557J558j517j512j513j513k2j9k403k403n89n85j08M661
-8567a6395L942J085J561J561P23P26p04p04j12j12K273K273J200J200M537M538M896M896
-8549A7384O148O148M807J945J170l600n272k411m318m319K568K567L640O502P814J2583J7113
$$ y = [-50201, -47559, -44918, -42276, -36590, -30904, -25218, -19532, -16350, -13168, -11894, -15389, -19122, -19994, -25635, -31277, -37395, -43513, -46770, -50026, -50522, -51017, -51513, -52008, -53875, -55742, -57609, -59475, -57877, -56278, -54680, -53081, -52437, -51792, -54009, -56226, -53976, -51725, -54244, -56763, -58387, -60012, -58775, -57538, -57754, -57970, -58186, -58402, -59691, -60981, -55593, -50205, -49743, -49281, -48819, -48357, -45629, -42902, -40174, -37447, -35837, -34228, -35480, -36732, -40070, -43409, -46747, -50086, -51435, -52783, -56815, -56077, -52239, -48402, -44266, -40130, -36016, -31903, -32558, -33214, -35927, -38639, -41352, -44064, -43740, -43412, -40700, -37987, -31791, -25591, -22729, -19868, -15929, -11987, -10430, -8872, -10389, -11901, -13414, -14927, -14949, -14968, -17371, -19774, -20363, -20948, -21056, -16395, -12453, -11368, -9807, -8246, -7523, -6797, -7501, -8205, -8317, -8429, -6156, -3883, -2683, -1483, 3054, 7592, 12488, 17384, 23532, 29680, 34487, 36432, 37602, 34002, 28730, 26319, 22001, 17682, 20250, 22817, 26457, 32959, 40773, 53356, 70469]
-8532G0469J4252J0675J3537Q648J971M557R326J4454K3042K4170K7033K9834K9838L4157
-8518C15963M2741N9255P3567Q4682Q9451Q9689Q6832Q3735R0412J17121J82941K95940M70498
-8505B082827P36627J136299J732909K554188L391085L704911L080065J371692r45962k847013
-8495A5997628l690283l527172k711735j835129j170527p42241m90182l38515k42446j76629
-8485A072769j26670q5650m8841l4533l3937m6333p3109q7416q8132p9544o3122m5000l0393
-8472B30089k1805j6324j6323j7218k1984k0974j8112j0899m218R3R7O93k168m378m375j0753
-8456F1441j0753q939q935j0068j0068r326m552j990j990k354k352l960j099O25O30Q09Q08
-8439a2073k504k500l752l752k802O3Q39Q38J148J151J148J151q50q45l235l230j952j949
$$ y = [70469, 84721, 95396, 108933, 117581, 119552, 124109, 133435, 147889, 170931, 195101, 222134, 251968, 281806, 315963, 358704, 417959, 491526, 576208, 665659, 755348, 842180, 925915, 1016327, 1133448, 1316389, 1612329, 2082827, 2819454, 3955753, 5688662, 8242850, 11633935, 15338846, 18418911, 19790603, 18844641, 15997628, 12307345, 8780173, 6068438, 4233309, 3062782, 2320541, 1830359, 1491844, 1249398, 1072769, 946099, 860449, 811608, 777075, 743138, 696805, 623696, 536280, 448148, 368604, 305482, 260482, 230089, 208284, 191960, 175637, 158419, 136435, 115461, 97349, 86450, 82232, 82325, 82422, 83115, 80947, 76569, 72194, 61441, 50688, 41749, 32814, 22746, 12678, 3352, -1200, -3190, -5180, -7534, -9886, -13846, -14945, -14320, -13690, -12881, -12073, -14577, -17077, -20829, -24581, -27383, -27320, -26481, -25643, -24495, -23344, -22196, -21045, -21895, -22740, -25975, -29205, -31157, -33106]
-8421c3106n22n18k727k724l324o181l704q38J006J010K794P568N179M14l95l92m329m326
-8403d5115k482p247n999n995q16q12j60M612J629J632J926J930J628J632L059K02J181j677
-8385e0872j859J006K090K094m13l272j516j513O89O93K776K780n63n59J83J86J792j065j692
-8366d9035j688m40m36K363K366j751j748m99K366P52P57k31k27J378j479j543j538j722j718
-8347e4073n29n25l50l47j513J353m40m36J170j688k287k284K734N597K139l585l65K497M463
-8328d8469M464K854k869l644p82j766j767P98P97j60j60j60j61r05r06J480J479J196J196
-8309d7485l096l097j337j338R3R3j878j877j521j516L726R449P840M981K564K563j907j904
-8291c5647K653K653o86o82QPj423j420k139k138p08p05J856J855n29n25R7R7J527J532L499
$$ y = [-33106, -33628, -34146, -36873, -39597, -42921, -49102, -52806, -53644, -52638, -51628, -48834, -41266, -36087, -35673, -36068, -36460, -40789, -45115, -47597, -54844, -60843, -66838, -67654, -68466, -68626, -64014, -62385, -60753, -58827, -56897, -55269, -53637, -50578, -50376, -49195, -50872, -52731, -51725, -49635, -47541, -47954, -51226, -52742, -54255, -53566, -52873, -50097, -47317, -47880, -48439, -48256, -48070, -46278, -47343, -49035, -50723, -51163, -51599, -49236, -46870, -48621, -50369, -50868, -48502, -47750, -46993, -47224, -47451, -46073, -47552, -49095, -50633, -52355, -54073, -54602, -55127, -55477, -55824, -57337, -55984, -56424, -56860, -55690, -57378, -59665, -61949, -59215, -53618, -51479, -55064, -55429, -52932, -48469, -44005, -41151, -44020, -47664, -48446, -50212, -51979, -51181, -50384, -50544, -50704, -50864, -51025, -51930, -52836, -51356, -49877, -48681, -47485, -50581, -53678, -55015, -56353, -56260, -56167, -58045, -59922, -61443, -62959, -59233, -49784, -41944, -36963, -34399, -31836, -33743, -35647, -32994, -30341, -31027, -31709, -31701, -31694, -33117, -34537, -36676, -38814, -39522, -40227, -38371, -36516, -37045, -37570, -37473, -37376, -35849, -34317, -30818]
-8270c0818L498L499L499j390j390J949J949Q90Q91Q90Q91K560K559K560K560j528j527m867
-8252a3325m866k213k213r62M762N865Q726J0812J0813J0515J0515N269N268k053k049L31
-8236D5195O059R990J5716J5832J5836J7620J1901J6070K9429L4611M0338M6773N6315O1006
-8222D22691O6734N5998M6464N6893J08405J84473L00847M73553P46363J145790J777252K671201
-8210H056664L401864K492111m20990k932093l292655k509768j637936r79471n88386l66374
-8200A222966k46187j73544j33481r7235o8619l8750k1582j0492j0493k9446n4248n8897n3175
-8187B26817m4410l8688k5691j2337m944m944p091j2814j4722j4721j3649j3648o439o438
-8173F281J669J673K98K98p75o494m947m949p690p687n306n306j013j010l264l264m278J450
$$ y = [-30818, -27320, -23821, -20322, -21712, -23102, -21153, -19204, -18314, -17423, -16533, -15642, -13082, -10523, -7963, -5403, -6931, -8458, -13325, -18191, -20404, -22617, -23579, -18817, -12952, -4226, 6586, 17399, 27914, 38429, 43698, 48966, 46913, 44864, 45195, 51254, 61244, 76960, 92792, 108628, 126248, 138149, 154219, 183648, 218259, 258597, 305370, 361685, 422691, 489425, 545423, 591887, 648780, 757185, 941658, 1242505, 1716058, 2462421, 3608211, 5385463, 8056664, 11458528, 13950639, 13529649, 10597556, 7304901, 4795133, 3157197, 2177726, 1589340, 1222966, 976779, 803235, 669754, 572519, 503900, 465150, 443568, 433076, 422583, 393137, 338889, 279992, 226817, 182407, 143719, 118028, 105691, 100747, 95803, 88712, 75898, 61176, 46455, 32806, 19158, 12719, 6281, 7950, 9623, 9921, 10219, 9444, 2950, -1997, -6946, -14636, -22323, -27629, -32935, -33948, -34958, -38222, -41486, -45764, -44314]
-8155d4314L890J028l43l39L43L43m546m542j803L920O900O905J948J949j390j386j747j748
-8137c4932j747j744l685l685l685l682r42r43k374k369j085j084L208L212L715L715J330
-8120d6777J334k35k35k34k31k35k35k35k31l830l827m482J241P4K940K57K57J059J061L447
-8100d9117L447j893j889m59m58J550J554J554J553L846L849m44m43Q87Q90k269k269O48L514
-8081c5949Q31m893l390l391j364j360k735k734l51M423N425K564p75p72n06n07k891k888
-8063e1263P19P19P19P23j546j547j546j542j01j01K284K288J003J002m29m24m07m06J025
-8044d8830J028L946L946K515k250m103j241k671n530l565J203J561j296K332N194M837M840
-8027c8084R546R546J0977J0980R233R233O133L275l286r964j1632j1628q075q074n690n689
$$ y = [-44314, -40424, -39396, -39739, -40078, -39735, -39392, -43938, -48480, -50283, -46363, -39463, -32558, -30610, -28661, -30051, -31437, -33184, -34932, -36679, -38423, -42108, -45793, -49478, -53160, -54102, -55045, -57419, -59788, -60873, -61957, -58749, -55537, -51822, -48107, -46777, -45443, -45678, -45913, -46147, -46378, -46613, -46848, -47083, -47314, -51144, -54971, -59453, -58212, -58138, -55198, -54941, -54684, -53625, -52564, -49117, -45670, -47563, -49452, -49911, -50369, -48819, -47265, -45711, -44158, -40312, -36463, -36907, -37350, -36463, -35573, -37842, -40111, -39463, -35949, -35118, -40011, -43401, -46792, -48156, -49516, -52251, -54985, -55336, -50913, -45488, -42924, -43699, -44471, -44977, -45484, -48375, -51263, -50544, -49825, -49106, -48383, -49929, -51476, -53022, -54564, -54665, -54766, -52482, -50194, -49191, -48189, -48618, -49042, -49449, -49855, -48830, -47802, -43856, -39910, -37395, -39645, -43748, -44989, -47660, -53190, -56755, -55552, -53991, -55287, -52955, -47761, -42924, -38084, -28538, -18992, -8015, 2965, 12198, 21431, 27564, 30839, 27553, 17589, 5957, -5671, -13746, -21820, -27510, -33199]
-8011c3199k173k172m557m557K13K12j218j219k94k95J137J136J226J226J226J226L31L32
-7993d1419j099j099p87p86p86p86L17L16j114L655K489l72J04J05j267j267J893J892q04
-7974d0815l667k533K235K266n97k980k981LQMPN40N44q90q87j084j081j084j081j769j767
-7953e7609J211J215O252N29n44n44j736j736O48O48P98P97q12q12K943Q2l912J811L215L220
-7933d4336J188J192q97q95m236m233l149l144J90J93L10L13j122j118J375J375K806K809
-7915e1379J226J226j159j155q90q91q90q87R87R88R87R91j229j230j230j225K31K31K31K34
-7895e4833m69m70j900j896N43N45N43N48n33n32Q98Q98l54l54J076J077q83q83q83q83K694
-7874e6051K694j599j598J285J286J285J286j010j010K329K329J397J397r87r87n280n280
$$ y = [-33199, -35372, -37544, -42101, -46658, -46445, -46233, -47451, -48670, -48964, -49259, -48122, -46986, -45760, -44534, -43308, -42082, -41751, -41419, -42518, -43617, -44404, -45190, -45976, -46762, -46445, -46129, -47243, -43588, -41099, -41471, -41367, -41262, -42529, -43796, -41903, -40011, -40815, -44482, -47015, -44780, -42514, -43111, -46091, -49072, -49069, -49061, -49057, -49050, -48510, -47966, -48856, -49743, -50827, -51908, -52992, -54073, -55842, -57609, -56398, -55183, -48931, -48402, -48946, -49490, -51226, -52962, -52314, -51666, -50868, -50071, -50883, -51695, -48752, -48670, -52582, -50771, -47556, -44336, -43148, -41956, -42853, -43748, -47984, -52217, -55366, -58510, -58320, -58127, -57817, -57504, -58626, -59744, -58369, -56994, -54188, -51379, -50153, -48927, -50086, -51241, -52131, -53022, -53912, -54799, -53812, -52824, -51837, -50846, -52075, -53305, -54535, -55760, -55529, -55298, -55067, -54833, -55302, -55772, -57672, -59568, -59025, -58480, -57937, -57389, -57922, -58454, -57556, -56658, -57012, -57366, -56290, -55213, -56096, -56979, -57862, -58745, -56051, -53357, -54956, -56554, -55269, -53983, -52698, -51412, -52422, -53432, -51103, -48774, -47377, -45980, -46967, -47954, -53234, -58514]
-7857e8514l4l3J252J252j133j129p15p16L577L581K936K936N52N55j297j296k728k724r83
-7838e4661r84J401J405J937J938N07N10K206K206j79j75m233m233j848j844k173k172J166
-7820e9226J170q5q6L253L256L954L953J569J572j323j323j322j319l566l566k27k24K396
-7802e1144K396K396K399r42r43l327l324J1J1J2J4l428l424q5q6P45P49P49P49K638K642
-7781e1192j651j651j982j978j979j978K485K489K489K489j271j267J118J118J099J103j282
-7764e1841j281k448k445n9o0L99L98L99L99m9m8k433k433Q5Q6J517J516R20R21K351K351
-7743e1755L663L662Q611Q611J0101N332L425N62m549m550o159o159m251m252n682n682l253
-7726e2325l253Q6K947L484j286J46J45l506l506j122j121J382J382m8m9J79J79j252j252
$$ y = [-58514, -58548, -58581, -57329, -56077, -57210, -58339, -59054, -59770, -56193, -52612, -49676, -46740, -46188, -45633, -46930, -48226, -50954, -53678, -54661, -55645, -54244, -52839, -50902, -48964, -48457, -47947, -45741, -43535, -43714, -43889, -48122, -52355, -54203, -56047, -58220, -60392, -59226, -58056, -58141, -58227, -54974, -51718, -47764, -43811, -42242, -40670, -41993, -43316, -44638, -45957, -49523, -53089, -53316, -53540, -51144, -48748, -46352, -43953, -44895, -45838, -49165, -52489, -52478, -52467, -52455, -52441, -55869, -59293, -59378, -59464, -58719, -57970, -57221, -56472, -53834, -51192, -52843, -54494, -56476, -58454, -60433, -62411, -59926, -57437, -54948, -52459, -53730, -54997, -53879, -52761, -51662, -50559, -51841, -53122, -55570, -58015, -58074, -58134, -57735, -57337, -56938, -56539, -56588, -56636, -59069, -61502, -61417, -61331, -59814, -58298, -57378, -56457, -54106, -51755, -48092, -44430, -35819, -27208, -17107, -11775, -8350, -7788, -12337, -16887, -23046, -29205, -33456, -37708, -43390, -49072, -52325, -55578, -55492, -52545, -49061, -50347, -50201, -50056, -53562, -57068, -58190, -59311, -57929, -56547, -56595, -56644, -56465, -56286, -57538, -58790]
-7707e8790L58L58J788J789J013J014m18m17K98K98j133j132p23p23P08P08K01K01m091m091
-7687f2784J826J825J826J826j036j036j036j035J170J170L554L555J86J86J87J86j006j006
-7669e1442j006j006l21l20l20l21n29n29k914k910J230J229j155j151q9r0j520j517M829
-7650e9852M829m17m14O90O89O89O93Q98Q98n33n29J293J293k999k996J353J352K784K787
-7631d7492K530K533J49J49k358k355k355k355M29M32M32M32q83q79q79q80o3o0n9o0P42P45
-7609e2105P45P45K95K98l995l994L84L87j043j043j722j721k91k90J319J319J319J319j036
-7590e9110j036j036j036J230J229J230J230p9p8p8p8k582k583k582k582j196j196j196j196
-7571g2725J636J635J457J457L745Q87K90K91j174J692j349j349k277k272p23K138R13j945
$$ y = [-58790, -58432, -58074, -56286, -54497, -53484, -52470, -52888, -53305, -53007, -52709, -53842, -54974, -55697, -56420, -55712, -55004, -54803, -54602, -58693, -62784, -60958, -59133, -57307, -55481, -56517, -57553, -58589, -59624, -58454, -57284, -53730, -50175, -49989, -49803, -49616, -49430, -50436, -51442, -52448, -53454, -53775, -54095, -54415, -54736, -55265, -55794, -58708, -61618, -60388, -59159, -60314, -61465, -61554, -61644, -63164, -64681, -59852, -55023, -55440, -55854, -55164, -54475, -53786, -53093, -52195, -51297, -51830, -52359, -51066, -49773, -52772, -55768, -54415, -53063, -50279, -47492, -44962, -42429, -42280, -42131, -44489, -46844, -49199, -51554, -51125, -50693, -50261, -49829, -50712, -51591, -52470, -53350, -53413, -53473, -53532, -53592, -52850, -52105, -51360, -50615, -50320, -50022, -54017, -58011, -57627, -57240, -58283, -59326, -61048, -62769, -63060, -63350, -62031, -60712, -59393, -58074, -59110, -60146, -61182, -62218, -60988, -59759, -58529, -57299, -57378, -57456, -57534, -57612, -60194, -62777, -65359, -67941, -69137, -70333, -71529, -72725, -71089, -69454, -67997, -66540, -62795, -61908, -61618, -61327, -62501, -60809, -62158, -63507, -65784, -68056, -68779, -66641, -65728, -67673]
-7553f7673j56j57J5J9K403K403J774J777j561j561K824K828J398J397K139K142L573P12N03
-7534d5201k358K708N571O137O136Q701Q700J0883J0883R811J4580K0065K2926K9902L4670
-7519A44114L6061L6060L4094K9324K1991J1498l525j5925k6328l3005l7834l7834l5748l0978
-7505I1965k6448j9770j5873j5869j5455j2590r792o927l115l111j811j807N74N77J349J353
-7489c6750j990j986j45j42j576j572j159j155J226J229M44M47j763j758l194l27n11n07l57
-7470e1546l54J073J077l28l24l28l25J610J614L815L819K09k649n336n332n302n299k619
-7452f6525K46k500k497L879L883L610L614K180K184K716K720K060k705m270m266k184O82
-7435e7173j289o055k422M44j94j90K370K373J34J38L294L298K485l73J234J237k87k83J918
$$ y = [-67673, -67829, -67986, -67971, -67952, -65549, -63146, -61372, -59595, -61156, -62717, -59893, -57065, -55667, -54270, -52131, -49989, -46416, -45704, -45201, -47559, -44851, -39280, -33143, -27007, -18306, -9606, 1277, 12160, 21971, 36551, 56616, 79542, 109444, 144114, 180175, 216235, 250329, 279653, 301644, 313142, 309617, 293692, 267364, 234359, 196525, 158691, 122943, 91965, 65517, 45747, 29874, 14005, -1450, -14040, -23832, -30759, -33874, -36985, -38796, -40603, -40029, -39452, -38103, -36750, -38740, -40726, -40871, -41013, -42589, -44161, -45320, -46475, -45249, -44020, -43576, -43129, -44892, -46650, -49844, -50171, -50682, -51189, -51546, -51900, -50827, -49750, -50078, -50402, -50730, -51055, -49445, -47831, -44016, -40197, -39988, -42637, -47973, -53305, -58607, -63906, -66525, -66279, -68779, -71276, -67397, -63514, -59904, -56290, -54110, -51926, -49210, -46490, -44430, -47135, -51405, -55671, -57855, -57173, -58462, -64517, -66939, -66495, -66689, -66879, -64509, -62136, -62002, -61864, -58570, -55272, -52787, -53160, -51926, -50689, -50976, -51259, -49341]
-7416d9341J923K165o93k426k422K28K31l69l227j610J256n37n32M17M21M17M21q19q16O11
-7396e4702O14p89p87L205L46j088j084J64J68L621L626R39j919j997j994n66n63n9K805J014
-7376d9046J017P04k157J002L864L894J032k426k425l350l350J599j263o67o67L446L447N25
-7358d4821N26r06r05L685L685N116N115N459N459L849L849O144L283J075j783p441j0303
-7341a8914q693q689q454n593p202p199o144o144K917K921K530K530L961L964l76l76J829
-7324e7132J834J471j389l894Q79K985K984M833P698Q201N339M565k01j677j677m836m833
-7307c4850n164n165n164n160m025m024j162j159j848j848j848j845j736j736l06l02J364
-7290g5978J364Q041Q044O685O684N254N257J826J826l123l118J132j729k38M535Q048L279
$$ y = [-49341, -47418, -45253, -45946, -48372, -50794, -50566, -50335, -50704, -53931, -55541, -54285, -54822, -55354, -54937, -54516, -54099, -53678, -54497, -55313, -54702, -54088, -54877, -55664, -52459, -52113, -53201, -54285, -54121, -53953, -50332, -46706, -45767, -47686, -49683, -51677, -52243, -52806, -52865, -50060, -49046, -48029, -47325, -49482, -48480, -44616, -40722, -39690, -42116, -44541, -47891, -51241, -49642, -50905, -51572, -52239, -48793, -45346, -44821, -44295, -45201, -46106, -42421, -38736, -33620, -28505, -23046, -17587, -13738, -9889, -3745, -462, 613, -1170, -8611, -18914, -27607, -36296, -44750, -50343, -57545, -64744, -70888, -77032, -74115, -71194, -68664, -66134, -62173, -58209, -58585, -58961, -57132, -55298, -53827, -55216, -59110, -58231, -55246, -52262, -47429, -39731, -31530, -26191, -21626, -21827, -23504, -25181, -30017, -34850, -40014, -45179, -50343, -55503, -59528, -63552, -64714, -65873, -67721, -69569, -71417, -73262, -74998, -76734, -77040, -77342, -75978, -74614, -66573, -58529, -51844, -45160, -39906, -34649, -32823, -30997, -34120, -37238, -36106, -37835, -38073, -33538, -25490, -22211]
-7273b2211J490J494q465q466j788j785n37n36M233P098R889N119L212L216L510L509l167
-7256d185l163o148o148r010r005k929k929j498j494k31k27J203J204N939N943P374P374O133
-7238a1797O137J367J368k094k091j792j792Q72N645N823K962k854n711n235q097n030k57
-7221b2576J948M811N671N674K515N376K836j934n03K358M207P068L551j218n913n914m780
-7204C177m780l558l558j472L297J092J092l380o241n466o97o96o97L163L164L163L164M176
-7186e057M177J0853J0854J2635J2639P269J550q38q35j196j192l119l115k761k757k314L413
-7169D0206N556J1282J1808J1812J3954Q234N578N582N399l21q864j1722j1249q384j60J3198
-7153I1909K6011K8877K5307K2446J9465J9465J9196J9197J0313l040q689j1551r345r345
$$ y = [-22211, -20721, -19227, -27692, -36158, -37946, -39731, -40268, -40804, -36571, -29473, -19584, -14465, -11253, -8037, -4527, -1018, -4185, -7348, -13496, -19644, -28654, -37659, -40588, -43517, -45015, -46509, -46740, -46967, -45764, -44560, -38621, -32678, -25304, -17930, -11797, -5660, -4293, -2925, -5019, -7110, -8902, -10694, -9822, -4177, 1646, 4608, 1754, -3957, -9192, -17289, -22319, -22576, -20628, -15817, -10146, -4472, -1957, 3419, 6255, 4321, 3818, 6176, 10383, 17451, 21002, 19784, 13871, 7957, 3177, -1603, -5161, -8719, -10191, -6894, -5802, -4710, -8090, -14331, -19797, -20494, -21190, -21887, -18724, -15560, -12397, -9233, -5057, -880, 9973, 20827, 33462, 46101, 53370, 54920, 54082, 53247, 52051, 50859, 47740, 44625, 41864, 39107, 36793, 40206, 45762, 57044, 68852, 80664, 94618, 102852, 108430, 114012, 119411, 119090, 110226, 98504, 87255, 78871, 78711, 91909, 117920, 146797, 172104, 194550, 214015, 233480, 252676, 271873, 282186, 279146, 270457, 258906, 249561, 240216]
-7139B40216j0269j0269o453p30L837R561J1469J1469J3436J3436J3436J3436J0232J0232
-7125C23039J3093J3093J2795J2796J7564J7565K1667K1670K4473K7334K7450K1730J9465
-7112E73734J6603J3589M054m233m233J249J4606K4264L3802M0014M9556O1480P8649R0569
-7098I93703J00111J04881R9157Q6172P2822O5667Q2838J18484J50919J89313K25559K45039
-7086B534665K54582K69843L06090L57595M12924M70155N44556O38494P47238Q53595R39441
-7075H329178J034706J254098J702654K452392L580092N184497P414635J0404048J4126269
-7066E5482569J7832991J9098538J4159418K293660j0783816j8215149j8789377j5572352
-7058D5506482j1491708q029654n543881l883685k779109k031995j503554j115448q35012
$$ y = [240216, 229947, 219678, 213225, 212495, 216332, 225893, 237362, 248831, 262267, 275703, 289139, 302575, 312807, 323039, 336132, 349225, 362020, 374816, 392380, 409945, 431612, 453282, 477755, 505089, 532539, 554269, 573734, 590337, 603926, 607980, 603747, 599514, 600763, 615369, 639633, 673435, 713449, 763005, 824485, 903134, 993703, 1093814, 1198695, 1297852, 1384024, 1456846, 1522513, 1605351, 1723835, 1874754, 2064067, 2289626, 2534665, 2789247, 3059090, 3365180, 3722775, 4135699, 4605854, 5150410, 5788904, 6536142, 7389737, 8329178, 9363884, 10617982, 12320636, 14773028, 18353120, 23537617, 30952252, 41356300, 55482569, 73315560, 92414098, 106573516, 108867176, 98083360, 79868211, 61078834, 45506482, 34014774, 25985120, 20441239, 16557554, 13778445, 11746450, 10242896, 9127448, 8292436]
-7049H292436o60694n74846n64009n77365n71403n42786n04394m64331m20454l57498k86450
-7038B768206k27311j88679j71510j64832j59109j43371j10939p3246k9369R263M1695M5748
-7026A596546K0948m2842j09613j44052j44052j33203j16032j06017r2663q1693o8339n0350
-7014E28638l3181l0855k7994k7368k1644j9320j3596j5571j5571j6465j6466k0787j7926
-7001B51894j5899j0176j0444p583j978j979K076M937m88o212p579j3298j7352k3075k1350
-6986A21494j5624q648j1510j4971r244j792P746J2154J2158J2218J7941J5921J3064R367
-6972A60274O506j487j1022j7877j7878j6152j0425m583j722P79L644P400J3123Q790N932
-6957A25302P41k116l92l249o114l249j584J282K6L0L424O290R684J5410J7375J1655P955
$$ y = [8292436, 7631742, 7056896, 6492887, 5915522, 5344119, 4801333, 4296939, 3832608, 3412154, 3054656, 2768206, 2540895, 2352216, 2180706, 2015874, 1856765, 1713394, 1602455, 1529209, 1499840, 1509103, 1550798, 1596546, 1617494, 1574652, 1465039, 1320987, 1176935, 1043732, 927700, 821683, 729020, 647327, 578988, 528638, 495457, 464602, 436608, 409240, 387596, 368276, 354680, 339109, 323538, 307073, 290607, 269820, 251894, 235995, 225819, 215375, 207792, 205814, 203835, 205911, 210848, 210360, 204148, 196569, 183271, 165919, 142844, 121494, 105870, 97222, 85712, 70741, 61497, 59705, 67451, 79605, 91763, 103981, 121922, 137843, 150907, 160274, 166780, 165293, 154271, 136394, 118516, 102364, 91939, 87356, 85634, 86413, 90057, 97457, 110580, 119370, 125302, 126043, 123927, 123535, 120286, 114172, 110923, 109339, 110621, 110647, 110677, 114101, 120391, 130075, 145485, 162860, 174515, 182470]
-6940A82470K236J665J670j23j20j434j431K202P929J4275J7139K0654L0196K7960K2241J6871
-6924C44400J1152J3175J3179J8064L1422L9406M5134N2701N5566O6950Q4122R0618J00159
-6911I66048J16178J37167J60294J77467J83783K00957K45307L42605N05475P47759J098302
-6900D881342J596223K270721L134928M030842M395222L328979O14283k445003m194393m310290
-6890A3302854l526211k564237j761081j197067q28872n92075m26102l09854k24002j66889
-6880A706464j30642j09754j09751j19647j25370j21916j08558r8781r3057p6578o3220n4217
-6868D94973m0864l6038l8896l8777k9238k3269k0408j8201q663o577o576p352j3074j9961
-6854A87079j7099j3998j1137j0422j0422p381p381o897o897k128k127p315p314m452m453
$$ y = [182470, 184706, 186371, 188041, 187918, 187798, 186364, 184933, 187135, 195064, 209339, 226478, 247132, 277328, 305288, 327529, 344400, 355552, 368727, 381906, 399970, 431392, 470798, 515932, 568633, 624199, 691149, 775271, 865889, 966048, 1082226, 1219393, 1379687, 1557154, 1740937, 1941894, 2187201, 2529806, 3035281, 3783040, 4881342, 6477565, 8748286, 11883214, 15914056, 20309278, 23638257, 24252540, 21807537, 17613144, 13302854, 9776643, 7212406, 5451325, 4254258, 3425386, 2833311, 2407209, 2097355, 1873353, 1706464, 1575822, 1466068, 1356317, 1236670, 1111300, 989384, 880826, 782045, 688988, 612410, 549190, 494973, 454109, 418071, 379175, 340398, 311160, 287891, 267483, 249282, 240619, 234042, 227466, 220114, 207040, 187079, 169980, 155982, 144845, 134423, 124001, 116620, 109239, 102342, 95445, 93317, 91190, 83875, 76561, 72109, 67656]
-6839F7656J151J152J151J151P94P94J151J151N526J1249J4170J7036R520l834j8083j8079
-6823I3656j3864j3865r095r092r304r303p933k206k020m881j483j479j900j900l153l147
-6807i69k407M54K17N942R218O356L317k404p206j479L052L051K452K455q83q83J692J695
-6789B3670K053K053L629R357J1621J7345K7405L6947L3370J6201j2597k9764l1254k8392
-6775H1644k0006j0462p542p541q320q317l070l070M09M14j021j017j319j315m658m654j0007
-6758i852j0004p624p620m195m192k168k165j442p162o807j081k79N447N623K765M99N03L659
-6740d6095L663Q189Q194O401O405M744r80l007l007l544l543J524J524N008K146K086l636
-6723a3928p512j7050k1403j8540j1462n738n51K310M456J595M277J0001J2967J0105N276
$$ y = [67656, 68807, 69959, 71110, 72261, 73055, 73849, 75000, 76151, 81677, 92926, 107096, 124132, 133652, 129818, 111735, 93656, 79792, 65927, 56832, 47740, 38436, 29133, 21200, 18994, 16974, 12093, 10610, 9131, 7231, 5331, 2178, -969, -3376, -2922, -2705, 3237, 12455, 18811, 22128, 19724, 12518, 11039, 14091, 17142, 19594, 22049, 21166, 20283, 21975, 23670, 25723, 27776, 31405, 40762, 52383, 69728, 97133, 134080, 167450, 183651, 171054, 141290, 110036, 81644, 61638, 51176, 43634, 36093, 27773, 19456, 16386, 13316, 13725, 14139, 13118, 12101, 10782, 9467, 4809, 155, -9852, -19856, -27480, -35100, -39295, -43487, -45655, -47820, -49262, -56424, -63231, -64312, -64591, -59144, -53521, -50756, -50257, -49754, -46095, -42432, -34243, -26049, -19648, -13243, -8499, -9479, -12486, -15493, -19037, -22580, -21056, -19532, -14524, -12378, -10292, -13928, -21440, -38490, -59893, -78433, -89895, -95633, -96184, -93874, -89418, -87823, -83546, -73545, -60578, -50473, -45197]
-6708d5197m47m501m501J341J341K199K202l044l045L21L24N570N571P012P016N765Q625J3422
-6690b6J9147K4454J8730p41j7907k5121k5120j7911j5046p773k049L104N969M717J856L402
-6674c0315N44j662m524p00p01k310k306k489k489o782o777m218m218j833j830k012k012k23
-6656g6857k20J263O986O748O752N317m06K813K817j502j502j501j498J08J08J539J543J945
-6638d5547J948M334M333N820N824L797j927m262m259k232k232K415K418N757N756l036l033
-6621b4126o968o968m825R02N790N790Q529Q533N194N194K806K808Q056J3779J3220J8943
-6605E6657K4189K4193L2029L2029L1433L1437K4323J4785N604l931j0641j6365k4353l0073
-6591A91316l0964l0963k4763k4760k2498j6774j4748j4744j2988j2989q339q335q816l092
$$ y = [-45197, -45644, -50145, -54646, -53305, -51964, -49765, -47563, -50607, -53652, -53331, -53007, -47437, -41866, -34854, -27838, -22073, -13448, -26, 19121, 43575, 62305, 61564, 43657, 18536, -6584, -24495, -39541, -47314, -49363, -46259, -40290, -35573, -33717, -30315, -29771, -31433, -35957, -36657, -37358, -39668, -41974, -44463, -46952, -53734, -60511, -64729, -68947, -70780, -72610, -74622, -76634, -76857, -77077, -75814, -68828, -62080, -55328, -50011, -50417, -47604, -44787, -46289, -47791, -49292, -50790, -50682, -50574, -49035, -47492, -45547, -43599, -39265, -34932, -29112, -23288, -19491, -21418, -25680, -29939, -32171, -34403, -31988, -29570, -23813, -18057, -21093, -24126, -31094, -38062, -42887, -41985, -36195, -30405, -21876, -13343, -8149, -2955, -149, 2659, 10715, 24494, 37714, 56657, 80846, 105039, 137068, 169097, 200530, 231967, 256290, 271075, 276679, 272748, 262107, 245742, 221389, 191316, 160352, 129389, 104626, 79866, 57368, 40594, 25846, 11102, -1886, -14875, -23214, -31549, -40365, -43457]
-6577d3457l927l924o442o439j196j192N064N067P091P094R326L607l32l27J933J938P180
-6560a8936P184M311M315j890j885k128k123J091m627o122o118o480o476p880p877k635k630
-6543f0906k72k68k72k69J547J550j793j788j524j520J814J819J45J49K530K534L189L193
-6525e0142j103j099q793q790j0582j0578k83R259K2729K8456K5620J9900Q927o07p568j3291
-6509B055j0845j0843j2963j5824j2188o461P79P78K389K392Q380N518M743r76n369j1093
-6493e9528q230q227n012n011j852L875J2665J5526J5526J2669R654L931L216k504k132P34
-6477a4700N917N921O363O368O364O368N514N519N693Q559J1237J6965J7736K0601K7428L0292
-6461A72145L0647K7789K8530L1396M6057N5600P3407R4395J19192J51628K02536K54049L07938
$$ y = [-43457, -47384, -51308, -57750, -64189, -65385, -66577, -61513, -56446, -49355, -42261, -32935, -29328, -29660, -29987, -28054, -26116, -18936, -11752, -7441, -3126, -5016, -6901, -9029, -11152, -10061, -14688, -20810, -26928, -33408, -39884, -47764, -55641, -58276, -60906, -61178, -61446, -61718, -61987, -60440, -58890, -60683, -62471, -63995, -65515, -63701, -61882, -61737, -61588, -59058, -56524, -53335, -50142, -51245, -52344, -61137, -69927, -80509, -91087, -91370, -82111, -59382, -30926, -5306, 14594, 23521, 22914, 15346, 2055, -8790, -19633, -32596, -48420, -60608, -67069, -66290, -65512, -63123, -60731, -52351, -46833, -42090, -43066, -48435, -59528, -67758, -75985, -80997, -86008, -87860, -83985, -71320, -55794, -40268, -27599, -17945, -14014, -10798, -13302, -15434, -14700, -8783, -2862, 3501, 9869, 16233, 22601, 28115, 33634, 39327, 47886, 59123, 76088, 93824, 114425, 141853, 172145, 202792, 230581, 259111, 290507, 336564, 392164, 465571, 559966, 679158, 830786, 1033322, 1287371, 1595309]
-6448A595309L51820L74873L61522L13587K31558J17508j7937j41228k46149l16605l49033
-6437B275225l42360l17555k74635k15491j61125j13428q1437o8078n8126n5261n0674m4947
-6425D92108l9526l9522l7782l2055l2894k7166k5561j9834j1729j1726j4852j4852j1514
-6412A73095j1513p102p102q711k988k661K01O104O103J1677J1678J1498J1499J4952J2091
-6397B18821P262J539j173j0713j7330k0191k0042k5766k6660k6659j8374j2649j1577j1577
-6383B4911j6242j6237j7076j7073j2784l242J0288J3153J6219J6223O978k556n957n954L61
-6368h988n358j1379k0914k1634j5906o252P105J6879K2606K1484J5765J6953K2680K3988
-6354E7029J4454M493q857j3931j1066p970n105j353j349n108n105p150j423M057R785O144
$$ y = [1595309, 1947129, 2322002, 2683524, 2997111, 3228669, 3346177, 3328240, 3187012, 2940863, 2624258, 2275225, 1932865, 1615310, 1340675, 1125184, 964059, 850631, 769194, 701116, 642990, 587729, 537055, 492108, 452582, 413060, 375278, 343223, 310329, 283163, 257602, 237768, 226039, 214313, 199461, 184609, 173095, 161582, 154480, 147378, 138667, 135679, 133018, 133219, 139323, 145426, 157103, 168781, 180279, 191778, 206730, 218821, 226083, 227622, 226449, 215736, 198406, 178215, 158173, 132407, 105747, 79088, 60714, 48065, 36488, 24911, 8669, -7568, -24644, -41717, -54501, -57743, -47455, -34302, -18083, -1860, 5118, 2562, -3395, -9349, -8988, -14346, -25725, -46639, -68273, -84179, -90431, -83326, -66447, -43841, -22357, -6592, 10361, 33041, 57029, 71483, 75976, 67119, 53188, 42122, 34152, 29047, 27694, 26345, 21237, 16132, 8982, 7559, 11616, 21401, 27545]
-6338B7545O148M475j244n481n478j606J260j069o789j3351j6207j5988j0262k932J0425K1987
-6322h567L1529L2003K6284J5727O193m900j4435k2903k2901j8254j2526p225j497J241J243
-6307A012N116J0843J5131J5135P974j561j3190j6048j5158j5153q182q179p452p448J550
-6292c5610M415k116p836j3026j0161o927m061p221j2944j1488j4345j9115j6253j1994o267
-6277a74949j081j080m900j0619p161j439N194J4737J7121J1398m106j3641j9841j0303R472
-6262a91198K2829K7539K1816J3764J0906J3112J8835K0900J1360K72n447j1174j1175j2784
-6248g0445r919n093O30O412J2140J4043Q320R28j930j382m244q000j3719j7658j4796j6525
-6232a21238j0798l573N965P336M479l573l573l514O029J5630K8989L5781L5785K5705J6171
$$ y = [27545, 33693, 38168, 36924, 31443, 25965, 24359, 25619, 24550, 17761, 4410, -11797, -27785, -38047, -40979, -30554, -8567, 22962, 54965, 81249, 96976, 103169, 98269, 83834, 60931, 38030, 19776, 7250, 25, -1472, -231, 1012, 6128, 16971, 32102, 47237, 55211, 53650, 40460, 24412, 9254, -5899, -14081, -22260, -29712, -37160, -35610, -31195, -33311, -41147, -54173, -64334, -71261, -75322, -82543, -95487, -106975, -121320, -140435, -156688, -168682, -174949, -176030, -177110, -182010, -192629, -199790, -201229, -196035, -181298, -164177, -152779, -156885, -170526, -190367, -200670, -191198, -168369, -140830, -119014, -105250, -94344, -81232, -62397, -41497, -30137, -29865, -35312, -46486, -57661, -70445, -80364, -85457, -84827, -78415, -66275, -52232, -43912, -42984, -44914, -46296, -50540, -58540, -72259, -89917, -104713, -121238, -132036, -135609, -129644, -122308, -117829, -121402, -124975, -128489, -122460, -106830, -77841, -42060, -6275, 19430, 35601]
-6217C5601K932P5j23k981o025l160O197O200L752R479J1920K1462K0266O915q648k1999k8679
-6200E3184j9137p545J997J0399J6127J4274J7140J9521K5247K4760K7625K0169J0634j2263
-6186B02132k9428l9507l6642l3352k3809j1234R755K3940K3943J5951K1678L3825M3368N5465
-6172B56085N8332L2036J1055K407K411o148j5683l1664l1660j6163K3902M8342N7884L1079
-6158D22215j353k5974l5513m9284n2146m3740j8940J0169L1153L2584K3046L849j874k351
-6144B91841J4818M1959P0575O8190M7205J2985j9446m8062o1416o9823m8837k0936J9125
-6131B98178N1677O8846N7399K4969q242j7777k8687l1548l7574l1846j3306J5310K6560L9917
-6117D13876N4225Q2841J09068J22427J02395O2333J1070j3727j5157j804j0094j9628l5428
$$ y = [35601, 38533, 38608, 38485, 35504, 29479, 26319, 32516, 38716, 42468, 51947, 63867, 85329, 105595, 112510, 103862, 81863, 53184, 34047, 26502, 28499, 38898, 55025, 69299, 86439, 105960, 131207, 155967, 183592, 203761, 214395, 202132, 172704, 133197, 96555, 63203, 39394, 28160, 37915, 61855, 85798, 101749, 123427, 157252, 200620, 256085, 314417, 346453, 357508, 359915, 362326, 356178, 340495, 308831, 277171, 261008, 284910, 333252, 391136, 422215, 420862, 394888, 359375, 310091, 257945, 214205, 195265, 205434, 236587, 269171, 292217, 296066, 294192, 291841, 306659, 348618, 419193, 487383, 534588, 547573, 528127, 480065, 418649, 348826, 299989, 279053, 298178, 349855, 418701, 476100, 501069, 492827, 475050, 446363, 414815, 377241, 345395, 332089, 347399, 373959, 413876, 468101, 550942, 660010, 782437, 884832, 947165, 958235, 944508, 929351, 927547, 917453, 897825, 862397]
-6104H62397l2565j6652Q153K1328M9943Q1180J13614J16714J07176P5415M2987J2937m14
-6091A442213k7364p1238j32766j53747j20128j1383J05700K02999K53787K63331K22548J74860
-6079B148812J37300J58290J59955Q1742m2742j01877j09512q8523q8587r4306r3594n7344
-6067B009614o673O0101J07075J39510J39514J45238J37844J24495Q5829O4844N1252P2240
-6055C130883P0448O4725N1848Q4283J23776J60021J66938J99373K19158K28697J98888J81723
-6043D880761J47498J03622J2526o1870j02802n8923K6924J50931K39994L14395L63043M79419
-6031F495518O06908P34729P96250Q32501P72404O29327M41175L74407M49848P18843J068429
-6020A3920339J436625J689040J835937J863359J979732K276120K808381L311302L824486
$$ y = [862397, 829832, 813180, 821333, 842661, 892604, 973784, 1087398, 1204112, 1311288, 1386703, 1429690, 1442627, 1442213, 1414849, 1343611, 1210845, 1057098, 936970, 925587, 1031287, 1234286, 1488073, 1751404, 1973952, 2148812, 2286112, 2444402, 2604357, 2686099, 2643357, 2541480, 2431968, 2343445, 2254858, 2160552, 2066958, 2009614, 2002941, 2063042, 2170117, 2309627, 2449141, 2594379, 2732223, 2856718, 2942547, 3007391, 3058643, 3130883, 3201331, 3266056, 3317904, 3402187, 3525963, 3685984, 3852922, 4052295, 4271453, 4500150, 4699038, 4880761, 5028259, 5131881, 5144407, 5082537, 4979735, 4920812, 4947736, 5098667, 5338661, 5653056, 6016099, 6495518, 7102426, 7837155, 8633405, 9465906, 10238310, 10867637, 11308812, 11683219, 12133067, 12851910, 13920339, 15356964, 17046004, 18881941, 20745300, 22725032, 25001152, 27809533, 31120835, 34945321]
-6011C4945321M368546N118283N921920O583895O713560O719300P694133J1049838J7205845
-6002A06320641K6818897M0805430O1181907Q9643071J27601163J70272094J93216473J50758622
-5994I66618298L3381701r8334501j75809401j83718253j51277230j08118646p1938557m6940253
-5986A63863158l1012600k0587301j3267361p213505j732594K524986K992382j538366p999849
-5977H6028950j1690829j1734708r873225p757552o037730m727120l487454k276042j128067
-5968B7316223j2041J195951K525645L988871M803473L252129r54418m870987o055691n099990
-5958B6089165l507035j981804p51318L60054J560018L129364N203065P989939J1135786J2535113
-5948F1762347Q317112j525349j0501212j3426017j1733853q603981n767186l769316k512119
$$ y = [34945321, 39313867, 44432150, 50354070, 56937965, 63651525, 70370825, 78064958, 89114796, 106320641, 133139538, 173944968, 235126875, 324769946, 452371109, 622643203, 815859676, 966618298, 999999999, 901665498, 725856097, 542137844, 390860614, 282741968, 210803411, 163863158, 132850558, 112263257, 98995896, 91782391, 90049797, 92574783, 95567165, 94028799, 86028950, 74338121, 62603413, 52730188, 44972636, 38934906, 34207786, 30720332, 28444290, 27316223, 27304182, 28500133, 31025778, 35014649, 39818122, 43070251, 42115833, 37244846, 31189155, 26089165, 22582130, 20600326, 19849008, 20209062, 21769080, 24898444, 30101509, 38091448, 49227234, 61762347, 70079459, 68554110, 58052898, 44626881, 32893028, 24289047, 18521861, 14752545, 12240426]
-5939A2240426j729952j228217q83395o41113m63913l89513m06920m58426m84184m78460m26952
-5928D649381l41100k53139k16893k05625j96083j76711j73849j96683k44372k83939k83939
-5917B077048k44830k16211k16572k16572j62083o4785J5039L9838L8408M7951R3136J14121
-5905A304488J07921P9309K6928m3655j04228j55733j67422j46434j10428q1809n8652l7663
-5893F12622K694N4207R9809J02675O2072J0567k1175m5972o2430p1964o6961n3603l7689
-5880E84852l7685m0073l7209j9982J6268N9963R2398R3110P2129L8791J0180n563j5098k2971
-5866G89110l2506m4373n0093n7668n4803l2688L562L6169O0972N8346K5919j7859n7918p9621
-5852E46549q5341p5449n4460k7755Q495M5916O3090N0923K2312J084j2266q931M426J7356
$$ y = [12240426, 10510474, 9282257, 8398862, 7757749, 7293836, 6904323, 6497403, 6038977, 5554793, 5076333, 4649381, 4308281, 4055142, 3838249, 3632624, 3436541, 3259830, 3085981, 2889298, 2644926, 2360987, 2077048, 1832218, 1616007, 1399435, 1182863, 1020780, 955995, 971034, 1010872, 1049280, 1097231, 1190367, 1304488, 1412409, 1491718, 1518646, 1474991, 1370763, 1215030, 1047608, 901174, 790746, 708937, 650285, 612622, 615316, 669523, 769332, 872007, 934079, 944646, 923471, 877499, 815069, 743105, 676144, 622541, 584852, 547167, 507094, 469885, 449903, 466171, 526134, 618532, 711642, 783771, 822562, 832742, 827179, 812081, 789110, 756604, 712231, 662138, 604470, 549667, 516979, 520541, 556710, 617682, 676028, 701947, 684088, 626170, 546549, 461208, 385759, 331299, 303544, 312039, 357955, 421045, 471968, 494280, 495364, 483098, 474167, 478593, 495949]
-5838D95949K3083J2113k0318n3170p0337o8190n4836m0413p977K5408M6393M2275K1295j0899
-5824C40376l5699m5607l2249j6748l395K921J2464K2956M0126P4282Q7640N7832K5400M293
-5810E34592n243j6748k6287l4697l7559m6560n6100n6635m3282j6693Q108J6499J6499J5187
-5796B51081J5188J5426J5425J2207J2206J0172M449j1886k9055l8118l2394k0471N14J4674
-5782B19418K0396J2944P221K46k616r829j2691q223j546m587m587o733P575J9916L2316L4954
-5766C04174L0184J9812J1226j710j0295j1011k425l84l245q075j0936j3111j3112j3470j0608
-5751B67014q581q581o614l752l24Q260R811O949M535J676l752l748q730j1588j0638j0634
-5735B21303l245R158J9528K4302K1078K1082J9826K4599K6828K2061M353q045j7378j7375
$$ y = [495949, 519032, 531145, 510827, 457657, 387320, 319130, 264294, 223881, 215904, 241312, 287705, 329980, 351275, 340376, 304677, 259070, 226821, 210073, 206678, 209599, 222063, 245019, 285145, 359427, 447067, 504899, 530299, 534592, 529349, 512601, 486314, 451617, 414058, 367498, 311398, 254763, 211481, 194788, 202896, 219395, 235894, 251081, 266269, 281695, 297120, 309327, 321533, 331705, 336154, 324268, 295213, 257095, 224701, 204230, 204744, 219418, 239814, 252758, 259979, 260225, 257609, 247780, 235089, 226866, 225320, 220733, 216146, 209413, 216988, 236904, 269220, 304174, 334358, 354170, 365396, 363686, 353391, 342380, 339955, 339571, 336326, 328251, 317315, 304204, 291092, 277622, 267014, 258433, 249852, 243238, 239486, 239162, 247422, 257233, 264182, 268717, 270393, 266641, 262893, 254163, 242575, 231937, 221303, 218058, 227216, 246744, 271046, 292124, 313206, 333032, 357631, 384459, 406520, 410873, 402828, 385450, 368075]
-5721C68075j1655j159K161K165k429n287q689j1547j0359j770m180p042j4435j9200j9920
-5706B54729j7058j5507j2643j3794r024j036j032r978r979q965k284n097n097r270r267j0582
-5690A14116p720j1953j4811j2997m412L876J2463J5262J5262J4367J1510Q779N920K698k068
-5675A50292j0716k1205l1164l1161k4547j4051K817J5220K1537K4402J8913J4148J013r475
-5661A06023j8183k1041k3072j8298j0433l752m993k128N560Q424P199P202K907P679R062
-5646E2156L338n783j1506j1386n664m233J491k564q286n903j78O230J5768J3623J3622R975
-5630F0700R974J4684J7546J3910Q186m811j4349k3783k0922j2277k738L61L61l156k94M237
-5614D7629R959J3239J3242Q708K985q522j4241j5467j2605j1293n567k947n809q253q250
$$ y = [368075, 356420, 355261, 357422, 359587, 357158, 351871, 343182, 331635, 321276, 319506, 315326, 308284, 293849, 274649, 254729, 237671, 222164, 209521, 195727, 186703, 185667, 184635, 174657, 164678, 155713, 153429, 148332, 143235, 133965, 124698, 114116, 106396, 94443, 79632, 66635, 62223, 66099, 78562, 93824, 109086, 123453, 134963, 143742, 149662, 152360, 150292, 139576, 118371, 87207, 56046, 31499, 17448, 20265, 35485, 57022, 81424, 100337, 114485, 115498, 106023, 87840, 66799, 43727, 25429, 14996, 11244, 6251, 4123, 9683, 18107, 25306, 32508, 35415, 43094, 52156, 55494, 49711, 38205, 26819, 21155, 16922, 18413, 15849, 7563, 1660, 1482, 7712, 23480, 37103, 50725, 60700, 70674, 85358, 102904, 116814, 125000, 120189, 105840, 82057, 61135, 48858, 46120, 46481, 46842, 43686, 43392, 47629, 57588, 70827, 84069, 92777, 95762, 87240, 72999, 57532, 44927, 33634, 28067, 25120, 19311, 11058, 2808]
-5599B808r880m159J506M370N857N857Q898Q901M628M628j42j38k109k109k109k105O75O74
-5581B6051N444N444N443N444O74O75o383o383o203o204p039m177k42N481J2829J5690J6943
-5564F3487J6942J7956J2232Q775Q775M810M811J0175J5899J2442J2441Q029Q030R326R330
-5549B23460J1476J7200K0653L0196M2835N6188O9226R0215J14538J46970J83571K31268K77053
-5536A514849L20931L52859L66218L38793K68208J66498L8684r0327k02883k87855l39360
-5525B446615l59391l42222l06455k58758k03435j55740j19431q6996o1002m3833l3792k8064
-5513D47496k7171l0031k9991k9987l4340l4339l0706k1164r360l636M490J0216J2006O282
-5499B29765O44O49o387o386j2918j2915j2914l376j830P713J1946J7669J7620J4759J2672
$$ y = [2808, -7072, -11231, -9725, -5355, 502, 6359, 15257, 24158, 28786, 33414, 33272, 33134, 31025, 28916, 26807, 24702, 25377, 26051, 31495, 36939, 42382, 47826, 48500, 49175, 42792, 36409, 30206, 24002, 16963, 12786, 12544, 18025, 30854, 46544, 63487, 80429, 98385, 110617, 119392, 128167, 132977, 137788, 147963, 163862, 176304, 188745, 196774, 204804, 214130, 223460, 234936, 252136, 272789, 302985, 345820, 402008, 471234, 561449, 675987, 822957, 1006528, 1237796, 1514849, 1835780, 2188639, 2554857, 2893650, 3161858, 3328356, 3367040, 3276713, 3073830, 2785975, 2446615, 2087224, 1745002, 1438547, 1179789, 976354, 820614, 701183, 614187, 553185, 509352, 475560, 447496, 420325, 390294, 360303, 330316, 295976, 261637, 230931, 209767, 200407, 196771, 201261, 211477, 223483, 229765, 230409, 231058, 224671, 218285, 205367, 192452, 179538, 176162, 174332, 182045, 193991, 211660, 229280, 244039, 256711]
-5484B56711L134r565k2919l0311l0311l3650l3650l5319k5780j5885k529J2254K1794J9044
-5470G3018R505j107j0645j4699j4699j1838o114o920o919l700l700j434j434J843P568M777
-5454A3502J915j006l868m911k049k407k406n939n940l077l078j081j080j081j080q149q149
-5437c9884l379l380P34P34n585n585l589K135L685L685N206N205L774L775N522N522N343
-5420a6082N343Q294N432L584k138k378k376j185M538J319J319j185j185n171n172j952j952
-5403a0947m039J684L234L234L368L369L367L368n06n07n276n275o301o297l435l436k634
-5386b7029k631j021j020L46L212N29k333l319m55P97P98M17L283O442O442L935L938p11p389
-5367a5769r703o837j889R73M128M132J330j531k183O81J577J576J125j733j553j554j438
$$ y = [256711, 259845, 250280, 227361, 197050, 166739, 133089, 99439, 64120, 38340, 22455, 19926, 32180, 53974, 73018, 82523, 81416, 70771, 56072, 41373, 29535, 23421, 16501, 9582, 5882, 2182, 748, -686, 1157, 8725, 13502, 15417, 14411, 10543, 5632, 3583, 1176, -1230, -7169, -13109, -16186, -19264, -20345, -21425, -22506, -23586, -31735, -39884, -43263, -46643, -45909, -45175, -50760, -56345, -59934, -57799, -54114, -50429, -45223, -40018, -36244, -32469, -26947, -21425, -16082, -10739, -2445, 2987, 6571, 4433, 2055, -321, -1506, 3032, 4351, 5670, 4485, 3300, -1871, -7043, -8995, -10947, -14986, -13302, -10068, -6834, -3466, -97, 3270, 6638, 6132, 5625, 349, -4926, -11227, -17524, -20959, -24395, -27029, -29660, -30681, -31701, -31355, -28143, -27614, -29947, -33266, -33721, -32924, -32126, -31709, -28426, -21984, -15542, -11607, -7669, -8380, -15769, -25472, -32309, -34198, -33225, -29097, -24965, -23635, -25166, -27349, -26668, -25091, -23515, -22390, -24123, -25676, -27230, -28668]
-5350b8668j435J427J427p53p48k359N03J755J759M799M799K172K176K355K355L186O050O409
-5332G209k176l015l009l548l547j095j096o163r020n120n120n298k433L555O416M985M989
-5315b3486M837M836L585P26p08p08L764R05M84L346J737j122n21n22k131k128l115l115k53
-5296a3589k50J42J45j289j286p22p20l882o741n380n377k578K87O006L149L43L46O118Q984
-5277a6294R933R937M836P1J140J144K005q54o640j5219j9517j6652r323p34L037L037N004
-5260d5089N008mmk865k862n473n474l685l681l447K277P642P646N909N910O982O987P221
-5242a7002J498J855J859n223n224l793l790j229j230k660k657o528o528o528o524Q04Q05
-5225f2095Q05Q09J878J877L667k053m471m472j609j606Q9N813J0582J0585J0344Q05k415
$$ y = [-28668, -30103, -28676, -27249, -28002, -28750, -31109, -30606, -28851, -27092, -22293, -17494, -15322, -13146, -10791, -8436, -5250, 800, 7209, 5033, 2018, -991, -4539, -8086, -9181, -10277, -16440, -25460, -30580, -35700, -40998, -43431, -39876, -33460, -28475, -23486, -18649, -13813, -10228, -9502, -10210, -10918, -7154, -6249, -5765, -2419, -682, -1804, -2325, -2847, -4978, -7106, -10221, -13336, -13589, -13839, -13697, -13552, -14841, -16127, -16849, -17569, -21451, -28192, -33572, -38949, -41527, -41240, -35234, -32085, -31742, -31396, -25278, -16294, -6361, 3576, 8412, 8483, 9623, 10767, 12772, 11918, 5278, -9941, -29458, -46110, -55433, -56167, -53130, -50093, -45089, -40081, -40085, -40089, -42954, -45816, -51289, -56763, -60448, -64129, -67576, -65299, -57657, -50011, -44102, -38192, -31210, -24223, -17002, -15504, -13649, -11790, -17013, -22237, -26030, -29820, -31049, -32279, -34939, -37596, -44124, -50652, -57180, -63704, -62900, -62095, -61290, -60481, -58603, -56726, -53059, -55112, -59583, -64055, -65664, -67270, -67181, -61368, -50786, -40201, -29857, -29052, -31467]
-5208c1467k410l548l547o85o82l0l0l0k6J166J170j334j333m289J438M538M539M06n313l525
-5188d4992l525r95r91L420L421L309k411l961l961j103j099J763J762M904M907N265m59l144
-5170c7890l141k068k068K541K545J114J114K809K813M244M244k123k121m981m982n164n161
-5153d8275k299k299j643j639k09k09k090k087k086k087N93N96N008N007O972J252k98k98
-5135d6091k791k791n652n653r13r13Q76Q76J814P538K888K6M825J964l283l283O49O48L510
-5116d5756L510o93o93k124k124j446j445j446j446j535j535j535j535q98q94q95q94Q91Q94
-5097f1599Q94Q94J778J781m25K437M728m807k302N59L491L495Q12Q13k381k378k377k377
-5079e6964L998M002p68p67K597K600k60k61j401j401k832k832m411m412j550j550K459K459
$$ y = [-31467, -33877, -37425, -40972, -41657, -42339, -42369, -42399, -42429, -42455, -41289, -40119, -41453, -42786, -47075, -45637, -41099, -36560, -36154, -41467, -44992, -48517, -49512, -50503, -47083, -43662, -40353, -42764, -46725, -50686, -51789, -52888, -51125, -49363, -44459, -39552, -34287, -34746, -37890, -41031, -43099, -45167, -42626, -40081, -38967, -37853, -35044, -32231, -27987, -23743, -25866, -27987, -32968, -37950, -43114, -48275, -50574, -52873, -54516, -56155, -56364, -56573, -58663, -60750, -62836, -64923, -64330, -63734, -58726, -53719, -46747, -45495, -45793, -46091, -48882, -51673, -57325, -62978, -63891, -64804, -63928, -63052, -61238, -53700, -50812, -50786, -45961, -43997, -47280, -50563, -49914, -49266, -45756, -42246, -42939, -43632, -45756, -47880, -49326, -50771, -52217, -53663, -55198, -56733, -58268, -59803, -60701, -61595, -62490, -63384, -62493, -61599, -60705, -59811, -58033, -56252, -56677, -54240, -49512, -54319, -56621, -56062, -52571, -49076, -48264, -47451, -49832, -52210, -54587, -56964, -52966, -48964, -49732, -50499, -47902, -45302, -45562, -45823, -47224, -48625, -51457, -54289, -58700, -63112, -64662, -66212, -63753, -61294]
-5061f1294K460K459L472L473O11O11j036j035l898l897l063l063k01k01J348J349M211M210
-5043e3484L137L138J349J348K538l186j397j394Q09Q08M51M55K001l723l364l361j278j278
-5025e6431J53J56k839k836j404j405J41J46j286j285K474K478J047J047L368L372N11N10
-5007e2083L50L54L54L54M106M110o59o60k191k187O74O75J028J032J033J032L91L91K299
-4988c9597n59n391o23K895L8o97o97J986J990j353j352j353j349k395k393k395k393j978
-4970e7616j975j90M583L939q28p11p08P79P82l991l986k747k742J16J19J427J431J427J431
-4951e9460J546J550J546J550l104l100l103l100k530k530k530k530J136J136L999L998M102
-4934f1424M102K672K671K523K522l39l39n92n89n92n89J792J796J792J796J271J274j591
$$ y = [-61294, -58834, -56375, -52903, -49430, -48819, -48208, -49244, -50279, -54177, -58074, -61137, -64200, -64401, -64602, -63254, -61905, -57694, -53484, -50347, -47209, -45860, -44512, -41974, -45160, -46557, -47951, -47142, -46334, -45883, -45428, -43427, -47150, -50514, -53875, -55153, -56431, -56278, -56122, -58961, -61797, -63201, -64606, -64465, -64319, -65605, -66890, -64416, -61938, -60891, -59844, -56476, -53104, -52593, -52083, -51733, -51379, -51025, -50671, -46565, -42455, -43114, -43774, -45965, -48152, -47478, -46803, -45775, -44743, -43710, -42678, -42287, -41896, -39597, -40156, -45547, -46170, -43275, -43237, -43934, -44631, -42645, -40655, -42008, -43360, -44713, -46062, -48457, -50850, -53245, -55638, -57616, -59591, -59781, -55198, -51259, -52087, -52798, -53506, -52727, -51945, -55936, -59922, -62669, -65411, -65295, -65176, -63749, -62318, -60891, -59460, -57914, -56364, -54818, -53268, -56372, -59472, -62575, -65675, -68205, -70735, -73265, -75795, -74659, -73523, -69524, -65526, -61424, -57322, -54650, -51979, -49456, -46934, -47273, -47612, -48204, -48793, -49385, -49974, -48182, -46386, -44594, -42798, -41527, -40253, -41844]
-4916d1844j587J420J423o07K258J270n406m513j646J538J539M580M583M832M833p71n537
-4899c3635j994K776l066l063J319J323j08j09l032l030j598j599K050K053K053K053L80L84
-4881c6843j047j047j167j166Q6K951P71P71L991J133j666j665k024Q42K806K806j75l033
-4863c3676r95r95j174j170j471j472j472j468j897j896j897j893k075k075j897j893n026
-4846f4442k161r09r10K068K072K072K071P20P22P23P23P19P23K333n30k671k668j595J267
-4827e9673L350L353L533L532J583J588M270M270K239o18j871j870O14O19k247k243m1l7j293
-4808d0942m151k977k973k95k90J82J87J792J796J978M844M483M486M28k429l685l682k418
-4790d3666k414n280n276q09q04o30o26j45K720j752j751r80r76Q12k049k947q2j692j692
$$ y = [-41844, -43431, -42011, -40588, -41195, -38937, -37667, -43073, -47586, -49232, -47694, -46155, -41575, -36992, -32160, -27327, -28098, -33635, -35629, -32853, -35919, -38982, -37663, -36340, -36448, -36557, -39589, -42619, -44217, -45816, -43766, -41713, -39660, -37607, -37227, -36843, -37890, -38937, -40104, -41270, -41184, -38233, -37462, -36691, -32700, -31567, -33233, -34898, -36922, -36080, -33274, -30468, -30643, -33676, -34671, -35666, -36840, -38010, -39481, -40953, -42425, -43893, -45790, -47686, -49583, -51476, -53551, -55626, -57523, -59416, -64442, -66603, -67512, -68422, -66354, -64282, -62210, -60139, -59419, -58697, -57974, -57251, -56532, -55809, -53476, -54006, -56677, -59345, -60940, -59673, -56323, -52970, -49437, -45905, -44322, -42734, -38464, -34194, -31955, -32573, -34444, -36314, -35700, -35081, -37328, -39571, -39612, -39649, -40942, -45093, -48070, -51043, -51338, -51628, -51446, -51259, -49467, -47671, -45693, -40849, -36366, -31880, -31452, -33881, -37566, -41248, -43666, -46080, -51360, -56636, -57445, -58249, -58879, -59505, -59650, -56930, -58682, -60433, -61413, -62389, -61577, -63626, -66573, -66655, -68347, -70039]
-4771g0039MK869k91M479O957K187j509J356O67m102k851J5p79p78m21m18Q6K947J338J341
-4751e6942L529L528J144J148M88M88K098p60k873k873K87K91o97o97l081l078k738k735l51
-4732f3824l50k560k556j125j125O82O85K117K116N272N276J938J937l759l760k030Q34j23
-4714f0355j23N6O0q09q08o30o26m087j226Q01L666K709K709M318M323L573L573Q91j968j762
-4694d5715j763l550o86j852j852k42k38r73r69o870m010l625l622l443l443k224k221k399
-4676h9697M62K336K340P109R971Q320Q324P549M688l335o193l987j125j025j021q42q42K135
-4658e4833K139P08P08J714J718J416J419J207l558m218m214k340k336J296J301m92M281L43
-4640e3741L47k467L99J170J173k198k195k019k016K98L163K99L01k205O59K385K388J666
$$ y = [-70039, -70035, -67166, -67457, -62978, -56021, -53834, -55343, -53987, -53320, -57422, -60273, -60258, -61037, -61815, -62236, -62654, -62568, -59621, -58283, -56942, -53413, -49885, -48741, -47593, -47105, -46617, -44519, -45279, -48152, -51025, -50738, -50447, -51144, -51841, -54922, -58000, -60738, -63473, -63824, -64174, -66734, -69290, -70415, -71540, -70858, -70173, -68056, -65940, -60668, -55392, -53454, -51517, -55276, -59036, -61066, -60232, -60355, -60478, -60422, -60362, -61171, -61979, -62609, -63235, -67322, -68548, -67747, -64081, -61372, -58663, -54345, -50022, -46449, -42876, -41985, -43953, -45715, -47478, -51028, -51714, -53566, -55418, -55660, -55898, -56871, -57840, -64710, -68720, -72345, -75967, -79410, -82853, -85077, -87298, -89697, -89235, -86899, -84559, -77450, -67479, -59159, -50835, -43286, -38598, -41933, -48126, -52113, -53238, -54263, -55284, -56126, -56968, -54833, -52694, -51986, -51278, -49564, -47846, -46430, -45011, -43804, -47362, -51580, -55794, -58134, -60470, -59174, -57873, -58365, -54084, -53741, -53394, -55861, -55462, -54292, -53119, -55317, -57512, -59531, -61547, -61249, -58086, -57787, -57486, -59691, -59032, -56647, -54259, -52593]
-4622e2593J669J665J670r88r83n280n276l678l674J569J572J241J245K671K675L4L7L4L7
-4603e6353L32L35j099j096k887k884k888k884k35k31M058M061K832K832n07n03j490j491
-4585f0098Q95Q98n52n51n52n47k430k429m5m1l58l57j789j785L577L577K147K150K123K124
-4565e4043l122l119k228k228J110J114p1o7j498j497k80k76j706j707k254k250k430k429
-4547g8981K694j64j416L353K769r0L965Q734O792J20k027k027k016k012p60p60j122l979
-4529f6927n053k83K906K910L205L208P00P04j684j680j438j435pmj558j553j27j23j654j651
-4509g1544J684J688K906K910j088j084J125N899M821J964K437K440K258K262k493k489j08
-4492d6412j04R05R09m340m338k082k080k082k080k94k91k94k90J60J64k225k220j480j475
$$ y = [-52593, -50924, -49259, -47589, -48577, -49560, -54840, -60116, -63794, -67468, -65899, -64327, -63086, -61841, -59170, -56495, -56461, -56424, -56390, -56353, -56021, -55686, -56785, -57881, -60768, -63652, -66540, -69424, -69659, -69890, -65832, -61771, -58939, -56107, -56614, -57117, -58607, -60098, -59203, -58305, -58857, -59408, -59960, -60507, -62937, -65366, -65411, -65452, -65810, -66167, -67956, -69741, -66164, -62587, -60440, -58290, -56167, -54043, -57165, -60284, -62512, -64740, -63630, -62516, -62587, -62654, -64152, -65649, -65929, -66205, -67911, -69618, -71872, -74122, -76552, -78981, -76287, -76451, -77867, -74514, -71745, -71835, -67870, -59136, -52344, -52224, -54251, -56278, -58294, -60306, -61066, -61826, -62948, -66927, -71980, -72263, -69357, -66447, -63242, -60034, -59334, -58630, -60314, -61994, -63432, -64867, -64874, -64878, -66436, -67989, -68116, -68239, -69893, -71544, -69860, -68172, -65266, -62356, -63444, -64528, -63403, -57504, -52683, -50719, -48282, -45842, -43584, -41322, -43815, -46304, -46412, -46516, -45611, -44702, -49042, -53380, -55462, -57542, -59624, -61704, -61998, -62289, -62583, -62873, -62713, -62549, -64774, -66994, -68474, -69949]
-4473f9949m9m4R57R62M296M299K538K541J53J56J796J796J796J800PQJ438J442R7R7R7J00
-4451d3666L018L018J588J591l51l50l50l47k228k228k228k225p52p53p52p49j260j259j260
-4432e1543j255J568J573q13q12k396k392J901J900J53J56J587J588L998M001O64O63n48n44
-4413d0551n44n44j60j57j56j57k395k392k393k392J98K01K109p53k947J826L256L257r80
-4394d5674r76r77r76k053k049L35L36k322k317J021J020k574k571P67P68k20k16k16k16K090
-4374e7020K094k90k91j994j989l421l420N03N03K6K891K232k537k061k057J61J60J591J595
-4355f3324J293J293k046k042j665j666k35k31J226J226L134K75l051J717K851qJ539J539
-4337e8175J360J364k955k955n70n70K083K083r58r57l752J017K448k322J23J23L164L163
$$ y = [-69949, -69998, -70042, -69085, -68123, -63827, -59528, -56990, -54449, -54296, -54140, -52344, -50548, -48752, -46952, -46945, -46937, -45499, -44057, -43960, -43863, -43766, -43666, -40648, -37630, -36042, -34451, -34802, -35152, -35502, -35849, -38077, -40305, -42533, -44758, -45510, -46263, -47015, -47764, -49024, -50283, -51543, -52798, -51230, -49657, -50470, -51282, -53678, -56070, -54169, -52269, -52116, -51960, -50373, -48785, -44787, -40786, -40122, -39459, -40007, -40551, -41095, -41639, -41799, -41956, -42112, -42269, -44664, -47056, -49449, -51841, -51643, -51442, -49333, -50086, -53033, -51207, -47951, -44694, -45674, -46650, -47627, -48603, -50656, -52705, -52370, -52034, -54356, -56673, -55652, -54632, -57206, -59777, -59010, -58242, -58462, -58678, -58894, -59110, -57020, -54926, -55216, -55507, -57501, -59490, -62911, -66331, -65828, -65325, -65299, -62408, -60176, -62713, -64774, -66831, -66670, -66510, -64919, -63324, -62031, -60738, -62784, -64826, -66491, -68157, -68392, -68623, -67397, -66171, -63037, -62762, -65813, -64096, -61245, -61253, -59714, -58175, -56815, -55451, -58406, -61361, -61931, -62501, -60418, -58335, -59293, -60250, -64002, -62985, -60537, -62859, -62736, -62613, -59449, -56286]
-4319e6286l3l4k418k418l194l193J099J100K038K038L171L171L021j747m132O37j31j26J67
-4300e7270J72k128k124J211J215J114J118l178l175j956j953L291L293J182J184J182J184
-4283e5638k097k094K87K90Q98R02L581j185k292k288P49P53J990J989k302k303j706j707
-4265f2173O78O78J021J021K571k198j12M658J855j006l28l28l0k891m620J49O26O26J922
-4246e7881J923M92M92M02M03j983j982J628J632j233j230r94r92M36M40k575k571K87K91
-4227f3015J032J036l99l95J368J371o3o0K083K086k686k683K530K534l32l28j047j043j047
-4208e9058j043j714j711j714j710K83K87J714J718K608K612L324k396l979J747K936K940
-4191e3156j796j792j796j792J453J457K884K887o93o89l555l551m478m475j379M348P363
$$ y = [-56286, -56319, -56353, -58771, -61189, -64383, -67576, -66477, -65377, -63339, -61301, -58130, -54959, -51938, -53685, -57817, -57180, -57311, -57437, -57270, -57098, -59226, -61350, -60139, -58924, -57810, -56692, -59870, -63045, -65001, -66954, -63663, -60370, -59188, -58004, -56822, -55638, -57735, -59829, -59542, -59252, -58354, -57452, -53871, -55056, -57348, -59636, -58887, -58134, -56144, -54155, -56457, -58760, -60466, -62173, -61495, -60817, -59796, -58775, -56204, -58402, -58514, -53856, -52001, -53007, -53335, -53663, -53693, -56584, -61204, -61055, -60429, -59803, -57881, -55958, -55466, -54974, -54572, -54169, -56152, -58134, -56506, -54874, -56107, -57337, -58331, -59323, -58887, -58447, -61022, -63593, -63306, -63015, -61983, -60947, -61346, -61741, -60373, -59002, -59065, -59125, -57042, -54956, -57642, -60325, -57795, -55261, -55593, -55921, -56968, -58011, -59058, -60101, -61815, -63526, -65240, -66950, -66667, -66380, -64666, -62948, -60340, -57728, -54404, -56800, -60779, -59032, -56096, -53156, -54952, -56744, -58540, -60332, -58879, -57422, -54538, -51651, -52344, -53033, -56588, -60139, -64617, -69092, -70471, -66123, -58760]
-4174e8760J643M47M51N37N40q94q91P16P19P15P19q34q31q35q31j349j345Q2Q6K31K35L092
-4152e6357L097K869K873l809l804p08p04p08p04O33O34O33O37K76K76K75K80P53P52P53P56
-4131e1297k705k705k705k701j483j483j483j480K214K213K213K217N07N07N07N10O86O85
-4113e5783O86O89k537k534L24L28M43M47r87r84J599J602L029L033o07o04o07o04j188j185
-4093e5440j189j185n03m99R28R31l68l66K493K497r06r02N26N29J9J8L238k485j561j562
-4073e5787R43R43J561J561K277l447k820K902K366m95k65k64l305l305k95k94k94k95O97
-4054e7616O97O96O97j330j330j509j509J404j453l241K481M088J229L36L35R28R31R32R31
-4035e2303k709k705k705k705o22o19o18o19N11N14N14N14K255K258K615l107m483m478J840
$$ y = [-58760, -57117, -56670, -56219, -55682, -55142, -56036, -56927, -56211, -55492, -54777, -54058, -54892, -55723, -56558, -57389, -58738, -60083, -60001, -59915, -59684, -59449, -56357, -53260, -50391, -47518, -51327, -55131, -55839, -56543, -57251, -57955, -57322, -56688, -56055, -55418, -55142, -54866, -54591, -54311, -53558, -52806, -52053, -51297, -54002, -56707, -59412, -62113, -63596, -65079, -66562, -68042, -65828, -63615, -61402, -59185, -58678, -58171, -57664, -57154, -56468, -55783, -55097, -54408, -56945, -59479, -59155, -58827, -58384, -57937, -58924, -59908, -58309, -56707, -53678, -50645, -51252, -51856, -52463, -53067, -54255, -55440, -56629, -57814, -58317, -58816, -57888, -56957, -57325, -57691, -55198, -52701, -53607, -54509, -53983, -53454, -53435, -53417, -50179, -52664, -54225, -55787, -54844, -53901, -52340, -50779, -48502, -51949, -54769, -51867, -49501, -49996, -50261, -50525, -53830, -57135, -57430, -57724, -58018, -58313, -57616, -56919, -56223, -55526, -56856, -58186, -59695, -61204, -59800, -61253, -64494, -62013, -57925, -56696, -56360, -56025, -55097, -54166, -53234, -52303, -55012, -57717, -60422, -63127, -63749, -64368, -64986, -65605, -65094, -64580, -64066, -63552, -61297, -59039, -56424, -59531, -64014, -68492, -66652]
-4016f6652J841O00O00k262k262J316J315j16j15K090K091O59O60m14m14m13m14j010j006
-3997f3906j009j006L01L06L02L05K493K496K493K497k158k153P04P08J207J207l562l558
-3979f2333L72L73L73L76P97P98P97Q01j706j707j706j703L13L16L17L17L13L17L16L17K578
-3958e9364K583K582K582m03l98l99l99j866j867j867j867j687j688j688j688J002J002L864
-3940f1566L864M66M66M66M65l65l65l65l65R46R46l822l823J445J446l324l323K101K102
-3921f2605J803J804L625j140k929o7l69l65j86j87j509j505j505j506J890J892r68r69q61
-3902f5657q57q57q57l84l80l80l80M401M404J542J543p1o7o7o7r65r65r65r61L46L47L46
-3880f0951L50m28m29m28m25J08J08J08J12J602J602l167l163j200j200J662J666L703L704
$$ y = [-66652, -64811, -64211, -63611, -65873, -68135, -66819, -65504, -65620, -65735, -63645, -61554, -60895, -60235, -60649, -61063, -61476, -61890, -62900, -63906, -64915, -65921, -65620, -65314, -65012, -64707, -62214, -59718, -57225, -54728, -56886, -59039, -58335, -57627, -56420, -55213, -58775, -62333, -61961, -61588, -61215, -60839, -60042, -59244, -58447, -57646, -59352, -61059, -62765, -64468, -64155, -63839, -63522, -63205, -62892, -62575, -62259, -61942, -59364, -56781, -54199, -51617, -52020, -52418, -52817, -53216, -55082, -56949, -58816, -60683, -62370, -64058, -65746, -67434, -66432, -65430, -61566, -57702, -57236, -56770, -56304, -55839, -56204, -56569, -56934, -57299, -56353, -55407, -59229, -63052, -61607, -60161, -63485, -66808, -64707, -62605, -60802, -58998, -55373, -56513, -59442, -59509, -59878, -60243, -60429, -60616, -62125, -63630, -65135, -66641, -64751, -62859, -63827, -64796, -65657, -66514, -67371, -68228, -68612, -68992, -69372, -69752, -65351, -60947, -59405, -57862, -57933, -58000, -58067, -58134, -59099, -60064, -61029, -61990, -61644, -61297, -60951, -60601, -61029, -61458, -61886, -62311, -62203, -62095, -61987, -61875, -60273, -58671, -61838, -65001, -66201, -67401, -65739, -64073, -60370, -56666]
-3861e6666Q42Q46j125j126j125j121Q19Q20l949l946j863j863m367m364k205L517N067N072
-3843f6737K623K623k39k34n78n77n78n74K880K881J8K3O74O74O75O78J330J330R73R76J90
-3822e0969n529k314k310J084J088J084J088j494j490l998l995l580K146j077j073o78o75
-3805g2692o78o74J706J711j155j152P98Q01L659L662R77R80R76R80K280K280k489k489J267
-3786e9252J267J267J267o41o41o41o41k83k83k83k83q09q09q08q09k12k12k13k12k374k373
-3765f7978k374k373J621J621J620J621J543J546j319j315Q27Q31k035k030q27q24q27q24
-3747g1496R62R65R61R65R84R87L846L849q05q01l667l663j78j75j79j75n37n33n36n33j189
-3726g0948j188J673J676J107J107j755L018L193L32r80J885k35l096n6K809j214j215j036
$$ y = [-56666, -55824, -54978, -56103, -57229, -58354, -59475, -58656, -57836, -61785, -65731, -67594, -69457, -73824, -78188, -80393, -76876, -71809, -66737, -64114, -61491, -61730, -61964, -62542, -63119, -63697, -64271, -61391, -58510, -58492, -58469, -57795, -57121, -56446, -55768, -54438, -53108, -52135, -51159, -50969, -56498, -58812, -61122, -60038, -58950, -57866, -56778, -58272, -59762, -63760, -67755, -71335, -69189, -70266, -71339, -72017, -72692, -73370, -74044, -72338, -70627, -71782, -72934, -72136, -71335, -67676, -64014, -63037, -62057, -61081, -60101, -57821, -55541, -58030, -60519, -59252, -57985, -56718, -55451, -56092, -56733, -57374, -58015, -58298, -58581, -58864, -59147, -59956, -60765, -61573, -62382, -62594, -62806, -63019, -63231, -65605, -67978, -70352, -72725, -71104, -69483, -67863, -66242, -64699, -63153, -64472, -65787, -64960, -64129, -66164, -68194, -69021, -69845, -70672, -71496, -70534, -69569, -68608, -67643, -66659, -65672, -61826, -57977, -58782, -59583, -63250, -66913, -67091, -67266, -67445, -67620, -68157, -68690, -69226, -69759, -70948, -72136, -70463, -68787, -67680, -66573, -68328, -65310, -62117, -61785, -62765, -60880, -61115, -64211, -64267, -61458, -62672, -63887, -64923]
-3708f4923j032R32R31R32R35k3k2k2j9k258k258K512K515Q27Q27K258K262J41J42J41J46
-3687e5056l80l80M54L320L912k764m554K20K150p11l574l569L61L62k620K154K627k143Q39
-3668e9352Q42j010j010j010j006N11N10N11N10n62n63n63n62K433K433K433K433l09l09l10
-3648e3950l09j826j825j826j826l376l376n14n14K526K527j945j945k571K198L987J125L47
-3630f3093L46j263j263k962k962j01j01O00O00O00O00J554J553J554J554L242L241j527j528
-3611e9356l018l018J751J751M091M092J229J230L35L35L36L35k116k117P46P45L0K9L0L0
-3591e2530J013J014j848j848k266k265k266k265n44n44n44n44N29N29N29N29j676j677j677
-3572f8351j676r92r91r91r91j300j297J34J34J383J386j476j475m29m25J006J006P34P38
$$ y = [-64923, -65955, -65023, -64092, -63160, -62225, -62248, -62270, -62292, -62311, -64569, -66827, -64315, -61800, -60973, -60146, -57888, -55626, -55485, -55343, -55202, -55056, -55436, -55816, -55362, -52042, -48130, -50894, -55448, -55228, -53078, -53789, -57363, -60932, -60571, -60209, -62829, -60675, -58048, -60191, -59352, -58510, -59520, -60530, -61540, -62546, -62035, -61525, -61014, -60504, -61066, -61629, -62192, -62754, -60321, -57888, -55455, -53022, -53331, -53640, -53950, -54259, -56085, -57910, -59736, -61562, -64938, -68314, -68828, -69342, -66816, -64289, -66234, -68179, -70750, -68552, -64565, -63440, -63093, -62747, -64010, -65273, -68235, -71197, -71298, -71399, -70799, -70199, -69599, -68999, -67445, -65892, -64338, -62784, -59542, -56301, -57828, -59356, -62374, -65392, -63641, -61890, -57799, -53707, -52478, -51248, -50913, -50578, -50242, -49907, -52023, -54140, -53394, -52649, -52619, -52590, -52560, -52530, -51517, -50503, -52351, -54199, -56465, -58730, -60996, -63261, -63805, -64349, -64893, -65437, -64908, -64379, -63850, -63321, -64997, -66674, -68351, -70027, -71019, -72010, -73001, -73992, -75292, -76589, -76455, -76321, -74938, -73552, -75028, -76503, -76932, -77357, -76351, -75345, -74611, -73873]
-3553g3873o93o93J017J021m10m09R57R61L823L823N63N66N67N66j524j520j520j521N41N44
-3533f7214N40N44J23J27J23J26l61l58K500K504K35K38j196j192J1J5J442J446L69L72L69
-3512e9237L73j23j19k985k981j375j371j375j371O0O3O0O3J371J375J371J375R02R05R02
-3492f2117R05j781j777J081J084K217K220K217K221k224k221l655l652n846n842Q31Q34K053
-3474g3452K057q08q05J214J219J218J219J870J874J874J875M24M29M28M29j71j68j68j67
-3455e9609J121J125J126J125k724k720k720k720j196j192K38K39k001j997O85O86o7k929
-3437g3530j677M047K973K974j439j438l87l88l87l88J103J103J103J103j372j371j371j371
-3419g0713Q35Q34Q35Q34k578k578K83K83J654J655J654J654j155j155j155j151j871j870
$$ y = [-73873, -74566, -75259, -74242, -73221, -73631, -74040, -73083, -72122, -68299, -64476, -63913, -63347, -62780, -62214, -63738, -65258, -66778, -68299, -67758, -67214, -66674, -66130, -66007, -65880, -65757, -65631, -65992, -66350, -63850, -61346, -61111, -60873, -62069, -63261, -63250, -63235, -61793, -60347, -59978, -59606, -59237, -58864, -58987, -59106, -62091, -65072, -66447, -67818, -69193, -70564, -70504, -70441, -70381, -70318, -68947, -67572, -66201, -64826, -63924, -63019, -62117, -61212, -62993, -64770, -63689, -62605, -60388, -58168, -55951, -53730, -55954, -58175, -61830, -65482, -71328, -77170, -76339, -75505, -73452, -71395, -72203, -73008, -71794, -70575, -69357, -68138, -66268, -64394, -62520, -60645, -60221, -59792, -59364, -58935, -59106, -59274, -59442, -59609, -58488, -57363, -56237, -55112, -57836, -60556, -63276, -65996, -67192, -68384, -68146, -67907, -69908, -71905, -71220, -70534, -70601, -73530, -75207, -71160, -68187, -65213, -66652, -68090, -68477, -68865, -69252, -69640, -68537, -67434, -66331, -65228, -66600, -67971, -69342, -70713, -69878, -69044, -68209, -67375, -69953, -72531, -72248, -71965, -70311, -68656, -67002, -65348, -66503, -67658, -68813, -69964, -71835, -73705]
-3401g3705R91R95j304j304J498M363M091j632j274J591r0q9Q9R3L011L011J579J584j341
-3382e7843j342m143p001o141m17K861K866j319j316J185J189M166j554N2K918o41o37r99
-3364f8116M728K072p86M397J538j885R80P97k060k76k72m54m51J296J301j34j31l800l797
-3345f5053P90P93K061q01q01K060L968L969J285J286L16L17J38J38k217n079k217O45l32
-3326e8734l31j405j405l223l61P11P12L156K94p78p79r88J875j167j166J028J033j830j829
-3307f5187J117J122j740j740k713k709j278J584M382P247N459O89K616k43l700l699j856
-3290f0649j852L096L097j438J427O494O495Q279Q283L454l223p918p914o249j475k016k012
-3273e4121j04k966j509j506J174J177J711J714l056l055l376l372J394J397j27j23J308J308
$$ y = [-73705, -72714, -71719, -73023, -74327, -72829, -68466, -64375, -66007, -67281, -65690, -65780, -65869, -65780, -65687, -62676, -59665, -58086, -56502, -57843, -59185, -63328, -70329, -76470, -76887, -74026, -71160, -72479, -73795, -72610, -71421, -67255, -68809, -68757, -65839, -66480, -67117, -68116, -63388, -61316, -62102, -57705, -56167, -58052, -57072, -56275, -58335, -58611, -58883, -59337, -59788, -58492, -57191, -57325, -57456, -61256, -65053, -64263, -63470, -61409, -62210, -63011, -60951, -56983, -53014, -51729, -50443, -50127, -49810, -49672, -49534, -51751, -56830, -59047, -58402, -58734, -59065, -60470, -61875, -65098, -65459, -64748, -64036, -60880, -60586, -61364, -62143, -63131, -61256, -62423, -63589, -62561, -61528, -63358, -65187, -64070, -62948, -64688, -66428, -69141, -71850, -73128, -71544, -67162, -59915, -54456, -53767, -51151, -51394, -55094, -58793, -60649, -62501, -59405, -56308, -57746, -56319, -49825, -43330, -35051, -26768, -23314, -26537, -34455, -42369, -48618, -50093, -52109, -54121, -54225, -57191, -58700, -60206, -59032, -57855, -56144, -54430, -57486, -60541, -63917, -67289, -65895, -64498, -64625, -64748, -63440, -62132]
-3255f2132J86J90J87J90J199J204j658j658M10M09j020j021k601k601k601k600K705K705
-3237f8507j57j56P08P08Q86Q87K597N459O889M028O60O59k500n362m527j665m14m14l334
-3218f3555m74P79P79j5j5J64J68j983Q84Q79j979J565J565j654j651K072p86o11o08j881
-3198f6357j882K709K712J636j222k657K09J755J755k836k831R50R54j912j908j326j327J536
-3180g0042J538j356j356K53K57k921n9L100L103K773K772M382J524j048j047l014j49q08
-3162f2098l671j881j878j077j077J606J610N62k299k120k116j86j83K675K679Q2Q6j349j345
-3143g1980o33o30k064K709K049q09n14n10J624j233k668J98Q49Q53m02l99m77m73o56K210
-3123g2956N36N41P15P19L80L80L80L84J125J126R46R50J483j378j021j018J513M375J512
$$ y = [-62132, -61946, -61756, -61569, -61379, -60180, -58976, -60634, -62292, -61882, -61473, -62493, -63514, -66115, -68716, -71317, -73917, -71212, -68507, -68664, -68820, -68112, -67404, -66518, -65631, -63034, -57575, -50686, -46658, -45998, -45339, -47839, -53201, -57728, -59393, -59807, -60221, -63555, -64029, -63250, -62471, -62486, -62501, -62337, -62169, -64152, -63268, -62389, -64368, -62803, -61238, -62892, -64543, -62471, -63257, -63868, -64476, -66357, -68239, -65530, -62818, -61182, -62404, -65061, -64852, -63097, -61342, -64178, -67009, -66059, -65105, -67017, -68925, -70251, -71578, -70042, -68504, -69860, -71216, -70963, -70706, -73627, -73686, -70586, -67483, -64710, -61938, -57556, -56032, -57080, -58127, -61141, -61290, -62098, -65769, -67650, -69528, -70605, -71682, -70076, -68466, -67904, -70203, -72323, -74439, -74625, -74808, -72133, -69454, -69372, -69286, -70635, -71980, -72613, -73243, -75307, -72598, -70549, -71358, -71872, -72382, -70758, -71991, -74659, -74461, -73612, -72759, -73161, -73560, -74037, -74510, -75166, -72956, -72420, -71879, -71164, -70445, -70065, -69685, -69305, -68921, -67796, -66670, -65724, -64774, -63291, -64669, -65690, -66708, -65195, -60820, -59308]
-3104e9308j345R50R51k091k086J606J605J606J610m43m44k232O34q91l752Q98R02n59n59
-3085f2948k347L375K631K631l689l689j490j491J371J372j729j729k087L637K463K463m1
-3068f1297m1j413j412J450J449N85N85N85N85M06M06M07M06j498j494j498j494N2N6N2N6
-3047f3067j558j553j558j554l882l879Q87Q90k46k42k42k42L271L275j494j494K869K873
-3029f6946j897j896J378J383J024J025K675l044k686k687K884K888j882j881M24M29J859
-3012f6950J860O33O37k224k225K005K008q57q53o48o45o48o45j244j241J86J90N14N18L376
-2992f6253L380k87k87k87k83r43r39r43r39L47L46L47L50L47L50L46L51J64J64J64J67n21
-2970f4859n18n22n18p00p01k131k128L43L47L204L208K05K05p49l607m415L57L54L58J53
$$ y = [-59308, -60653, -59703, -58752, -60843, -62929, -61323, -59718, -58112, -56502, -56945, -57389, -59621, -58987, -59878, -63630, -62732, -61830, -62389, -62948, -65295, -61920, -59289, -56658, -60347, -64036, -65526, -67017, -65646, -64274, -66003, -67732, -69819, -66182, -63719, -61256, -61297, -61338, -62751, -64163, -62713, -61264, -60679, -60094, -59509, -58924, -58518, -58112, -57705, -57299, -58797, -60291, -61789, -63283, -63231, -63175, -63123, -63067, -64625, -66178, -67736, -69290, -73172, -77051, -76164, -75274, -75520, -75762, -76004, -76246, -72975, -69700, -71194, -72688, -69819, -66946, -68843, -70739, -69361, -67978, -66954, -65929, -63254, -66298, -68984, -71671, -68787, -65899, -67781, -69662, -69238, -68809, -66950, -65090, -64457, -63820, -66044, -68269, -66264, -64256, -65113, -65966, -66614, -67259, -67907, -68552, -69796, -71037, -70851, -70661, -70147, -69629, -66253, -62873, -63160, -63447, -63734, -64017, -64960, -65899, -66842, -67781, -67434, -67088, -66741, -66391, -66044, -65694, -65348, -64997, -64833, -64669, -64505, -64338, -64859, -65377, -65899, -66417, -67117, -67818, -69949, -72077, -71734, -71387, -68183, -64975, -64770, -64565, -65314, -68921, -73336, -72979, -72625, -72267, -72114]
-2950g2114J53J583J588m44m40R88R91J546J547J546J550l02k98l02k98j233j233J97K01P64
-2930f4010P68L625L629q34q35q35q34o56o56o56o55p98p97p98p97L7L8L7L7P23P23P23P23
-2907f2098J259J259j602j602j110j111j110j111k481k482L80L81K682K687j79j75q65q60
-2889f8138k296k291j416j412J446J449L13L17J743J748K869K873PJ1R62R65j901j896J297
-2870f3350J300j34j31Q50Q53Q50Q53l47l42l47l43l46l43l46l43P8Q2P8Q2k992k988j31j26
-2847f7583j148j144K83K87K012K016N81N85j251j249j252j248N37N40N36N41j070j069N40
-2828f8556N41j696J166M028J167o38o37K57L119L76k485k306N55n74n74l077l078j617J244
-2809g2785J066J066P67P68q42K019K735K735j677j677M51L317K72K75O60O63L521L525k485
$$ y = [-72114, -71961, -70378, -68790, -69234, -69674, -68686, -67695, -66149, -64602, -63056, -61506, -61808, -62106, -62408, -62706, -63939, -65172, -64975, -64774, -64010, -63242, -59617, -55988, -56822, -57657, -58492, -59326, -59982, -60638, -61294, -61949, -62747, -63544, -64342, -65139, -65102, -65064, -65027, -64990, -64267, -63544, -62821, -62098, -60839, -59580, -61182, -62784, -63894, -65005, -66115, -67226, -69707, -72189, -71809, -71428, -68746, -66059, -66238, -66413, -67278, -68138, -70434, -72725, -74141, -75553, -74107, -72658, -72345, -72028, -70285, -68537, -65668, -62795, -62788, -62777, -61815, -60850, -62751, -64647, -63350, -62050, -62184, -62315, -61465, -60612, -59762, -58909, -59256, -59598, -59945, -60288, -60634, -60977, -61323, -61666, -61588, -61506, -61428, -61346, -64338, -67326, -67457, -67583, -68731, -69875, -69592, -69305, -67293, -65277, -64696, -64111, -65362, -66611, -67863, -69111, -68574, -68034, -67498, -66957, -68027, -69096, -68556, -68015, -69711, -68545, -64517, -63350, -63988, -64625, -64368, -61249, -60873, -63358, -65664, -65109, -65683, -66257, -69334, -72412, -74029, -72785, -71719, -70653, -69886, -69118, -69960, -67941, -65206, -62471, -64148, -65825, -65374, -62057, -61785, -61510, -60850, -60187, -56666, -53141, -55626]
-2790e5626k482k485k482k79k76k79k76j599j594j599j594O07O11P86P90j405J461K530K534
-2771f2657J188j669j315j312l346m84P67P68P97P98P97P97J081J080R02R02J706j155k407
-2752f2762k407j822j822k001Q61P12P11j792j792N48L409L409N48O07O08K49K50P1k791j181
-2732f6387j181k284k284k284k285K366K367R35R35J293J293K366N228L178L17K462l98k009
-2714e6372Q54l499l499j963K805j486j487p71l633j845K925K184K183R7R7k61k61k645k646
-2695f9223K46K46K46K46k228k228J56J57J840J841L271L272q42q42q42q42M99M99M99N00
-2675f3529q13q12q12q12J1J1J1J1j300j300j301j300J472J471J472J472p8p9p8p8o0n9o0
-2652f6540o0K99K98K98K98m77m77m77m77Q35Q34Q35Q35P56P60P56P61l17l13l17l13q23q20
$$ y = [-55626, -58108, -60593, -63075, -63354, -63630, -63909, -64185, -65784, -67378, -68977, -70571, -69964, -69353, -68567, -67777, -69182, -67721, -65191, -62657, -61469, -63138, -64453, -65765, -69111, -69595, -68828, -68060, -67263, -66465, -65668, -64871, -63790, -62710, -61808, -60906, -59200, -60355, -62762, -65169, -66991, -68813, -70814, -69953, -69241, -68530, -70322, -72114, -71566, -68157, -64748, -64200, -63593, -62985, -62736, -62486, -62415, -65206, -66387, -67568, -69852, -72136, -74420, -76705, -74339, -71972, -71037, -70102, -68809, -67516, -65150, -59922, -56744, -56427, -53965, -54363, -56372, -55518, -59017, -62516, -64479, -61674, -63160, -64647, -65418, -69051, -70896, -67971, -65787, -63604, -63507, -63410, -63671, -63932, -66577, -69223, -68977, -68731, -68485, -68239, -70467, -72695, -72539, -72382, -70542, -68701, -65430, -62158, -63000, -63842, -64684, -65526, -65027, -64528, -64029, -63529, -64342, -65154, -65966, -66778, -66767, -66756, -66745, -66734, -68034, -69334, -70635, -71935, -70463, -68992, -67520, -66048, -66126, -66205, -66283, -66361, -66421, -66480, -66540, -66600, -66301, -66003, -65705, -65407, -65884, -66361, -66838, -67315, -66480, -65646, -64811, -63976, -63220, -62460, -61704, -60943, -61260, -61573, -61890, -62203, -63026, -63846]
-2629f3846q23q20K49K54K49K54j327j322j327j323K24K27K24K27j080j077j081j077k034
-2610g5229k031o03o00J457J457r28r28R50R50R50R51K939K940N55N56r95r95r95r95R32R31
-2589f8731j453j453J438J438J439J438l58l58l57l58j669j669j670j669J364J363J364J364
-2571f8537L50L50J781J782K563K564p75p75l58l58J073J073k05k05k589k590j039j040L91
-2552f6544L92n78n77Q53Q53k20k20k604k605q79q79N51N55K012K012K012K016K504K504O56
-2532e8186n064r54J908J729j129q50K016J655J658k24k20k608k604j148j144J237J241P30
-2514f1957P34j654j651K131K132K131K135j058j058L72L77m248m248M5M8r68r69M62M66j68
-2494f6946j68J263J264r43r43M88M88N78N77q53q53O67O67O67O67j129j129L163L164k292
$$ y = [-63846, -64669, -65489, -65240, -64986, -64737, -64483, -65810, -67132, -68459, -69782, -69558, -69331, -69107, -68880, -69960, -71037, -72118, -73195, -75229, -77260, -77863, -78463, -77006, -75549, -76477, -77405, -76455, -75505, -74555, -73604, -70665, -67725, -67170, -66614, -67609, -68604, -69599, -70594, -69662, -68731, -70184, -71637, -70199, -68761, -67322, -65884, -66242, -66600, -66957, -67315, -68984, -70653, -72323, -73992, -72628, -71265, -69901, -68537, -68187, -67837, -66056, -64274, -61711, -59147, -59922, -60697, -61055, -61413, -60340, -59267, -59472, -59677, -62266, -64856, -65895, -66935, -66544, -66152, -66730, -67307, -66454, -65601, -65821, -66041, -68645, -71250, -72129, -73008, -72457, -71902, -69890, -67878, -65866, -63850, -61346, -58842, -58186, -63250, -64204, -62296, -60567, -61696, -62546, -60530, -58875, -57217, -57441, -57661, -60269, -62873, -64021, -65165, -63928, -62687, -61957, -61223, -62877, -64528, -62397, -60265, -58134, -55999, -57057, -58115, -57743, -57366, -61614, -65862, -65817, -65769, -66737, -67706, -67244, -66778, -66946, -67114, -65851, -64587, -65530, -66473, -65985, -65497, -64919, -64342, -65195, -66048, -65381, -64714, -64047, -63380, -64509, -65638, -62475, -59311, -61603]
-2474f1603k291R3R3k284k284j032j032J143j717l685K038M128j594j536j535M03k460j684
-2456g6839M039K258K258p23p22N29N29K615K616M777J1j602j599q27q23O03O08j319j316
-2437f4927k749k746M09M14M10M13O82O86O82O85J934J938k359k355l91l87J993J997K620
-2418f1051K623K142p15k571K198R47j916l435l435k542M136M002k675l570J200K988K989
-2401e8685K809j960m426j565J773J774k728k727O11O11j19j19j20j19o56o55m77m77J151
-2382f6104M017K880j885k992j27o07o04k038k035K910K914J897k869j90j87P34P38P34P38
-2363f2076j621j617j90j86O74O78O75O78K671K676K86K91j181j177K157K161j777j774l46
-2344e8998l43q39q34K500K504l91l88l91l88l301l297L7M1j096j091L35L39N07N10N07N10
$$ y = [-61603, -63894, -63801, -63708, -65992, -68276, -69308, -70340, -69197, -70914, -74599, -72561, -68433, -70027, -71563, -73098, -72695, -75155, -76839, -72800, -70542, -68284, -69007, -69729, -69200, -68671, -66056, -63440, -58663, -58652, -60254, -61853, -62680, -63503, -62900, -62292, -63611, -64927, -67676, -70422, -70013, -69599, -69189, -68776, -68094, -67408, -66726, -66041, -64107, -62169, -64528, -66883, -67274, -67661, -65668, -63671, -61051, -58428, -56286, -57001, -59572, -57374, -56427, -58343, -61778, -65213, -67755, -63619, -59617, -62292, -65862, -64662, -61674, -58685, -55876, -57836, -62262, -63827, -62054, -60280, -63008, -65735, -65124, -64513, -64632, -64751, -64871, -64990, -65646, -66301, -66778, -67255, -66104, -62087, -59207, -61092, -64084, -64211, -64818, -65422, -67460, -69495, -66585, -63671, -61774, -64643, -64833, -65020, -64286, -63548, -62814, -62076, -63697, -65314, -65504, -65690, -65016, -64338, -63663, -62985, -60314, -57638, -57352, -57061, -58242, -59419, -57262, -55101, -56878, -58652, -58998, -59341, -60180, -61014, -58514, -56010, -56401, -56789, -57180, -57568, -60869, -64166, -64129, -64088, -65184, -66275, -65940, -65601, -65094, -64584, -64077, -63567]
-2323f3567j490j487J848J852L287L290n2m9Q12Q16o18o15j356j353j356j353J834J837k460
-2304f0180k455J632J636j707j703j796j792N89N92j26j23j27j23j319j315K973K977p67p64
-2285f3898p68p64R02R06n30n25j930j926j632j629n29M244N492P27k05l063L492L495k35
-2266e8376k31k35k31K57K61J688l078m005j140o67o64J088J088K519K519J505J506q80q79
-2247e7955j848j848m18m17k504k504Q35Q34J595J595J64J64m5m5m4m5R39R39j148j147j029
-2226f3932L741K489K489l35l35l36l35o04o03l943l942J632J632j706j707p82p83J603J602
-2207f4155O41O41O40O41j863j863N22N22J4J5J5J5P60P60P60P61r80r80r80r80J881J882
-2185f1331r80r80k306k307N56N55P8P8J330J331l80l242k884J885K76K76N74N73L123L122
$$ y = [-63567, -65057, -66544, -64696, -62844, -59557, -56267, -56319, -56368, -55556, -54740, -55358, -55973, -57329, -58682, -60038, -61391, -59557, -57720, -60180, -62635, -61003, -59367, -61074, -62777, -64573, -66365, -65776, -65184, -65310, -65433, -65560, -65683, -67002, -68317, -65344, -62367, -63134, -63898, -64666, -65430, -64528, -63622, -64152, -64677, -66607, -68533, -70165, -71794, -72323, -68079, -62587, -61860, -62065, -65128, -61636, -58141, -58376, -58607, -58842, -59073, -58816, -58555, -56867, -59945, -63950, -65090, -65757, -66421, -65333, -64245, -61726, -59207, -57702, -56196, -57076, -57955, -59803, -61651, -62069, -62486, -64990, -67494, -66659, -65825, -64230, -62635, -62471, -62307, -62352, -62397, -62441, -62486, -61547, -60608, -61756, -62903, -63932, -60191, -57702, -55213, -55548, -55883, -56219, -56554, -57158, -57761, -61704, -65646, -64014, -62382, -64088, -65795, -66577, -67360, -65757, -64155, -63514, -62873, -62233, -61592, -63455, -65318, -64796, -64274, -64260, -64245, -64230, -64215, -63455, -62695, -61935, -61174, -62154, -63134, -64114, -65094, -63213, -61331, -62311, -63291, -65597, -67904, -67348, -66793, -66715, -66637, -65307, -63976, -64356, -67598, -70482, -68597, -68321, -68045, -67471, -66898, -63775, -60653]
-2165f0653j647j647k332k333K437K437J16J15j315j316P72P71o59o60K165K165n18n18m88
-2146f3108K373L626j144m334j471J509M370L089K27N85N85P1P1m698m699k57k57k57k57R76
-2126f3000R76j885j886Q57Q57Q57Q57M85M84k377k377p08p08M061M061O75O74O75O74j710
-2106e8458j710J97k664k590K180R28j934O00O00j010j010O19O18L481L480j379j379J483
-2088e7948J483q87q86q87q87m40m39m40m40J353J356p8p5j956j952R05R09L40L42L39L43
-2067e9945l76l73l76l73k34k35K627K627p12p12p11p12P79P78k083k082n6n6n6n6J498J502
-2045e9337j364j360p08p04l928J800M47M51Q05Q08k503k501L58L61o85o82P45P49J818J822
-2025f3608j043j039j886j881m55m51M99N03r31r28r95r91L775L778J211J215j651j647J211
$$ y = [-60653, -62300, -63947, -66279, -68612, -66175, -63738, -63622, -63507, -64822, -66138, -65366, -64595, -65254, -65914, -63749, -61584, -62102, -62620, -63108, -60735, -57109, -58253, -62587, -64058, -62549, -58179, -55090, -54863, -54278, -53693, -53622, -53551, -58249, -62948, -63205, -63462, -63719, -63976, -63000, -62024, -63909, -65795, -64938, -64081, -63224, -62367, -61882, -61398, -63775, -66152, -66860, -67568, -63507, -59446, -58771, -58097, -57422, -56748, -58458, -60168, -59971, -62635, -65225, -63045, -62117, -64051, -63451, -62851, -63861, -64871, -64252, -63634, -60153, -56673, -58052, -59431, -57948, -56465, -57352, -58238, -59125, -60012, -60452, -60891, -61331, -61771, -60418, -59062, -59140, -59215, -61171, -63123, -62218, -61309, -60969, -60627, -60288, -59945, -60321, -60694, -61070, -61443, -61677, -61912, -59285, -56658, -57370, -58082, -58793, -59505, -58726, -57948, -60031, -62113, -62169, -62225, -62281, -62337, -60839, -59337, -60701, -62061, -62769, -63473, -67401, -65601, -65154, -64703, -63898, -63090, -65593, -68094, -67736, -67375, -68060, -68742, -67997, -67248, -65430, -63608, -64651, -65690, -67576, -69457, -69912, -70363, -69864, -69361, -70292, -71220, -72215, -73206, -69431, -65653, -64442, -63227, -64878, -66525, -65314]
-2006f5314J215k20k16j860j855J002J006M81M80L343L342J405J404j456j454J31J30j300
-1988e9736j301k492k493j062j058J662J662j200j200j170j170j528M200L800L801k519k519
-1971f4323l13l13l13l09k426k425K343K344J867J866r94r95P8P8P8P9J97J98k664k665Q6
-1950f8526Q6Q5Q6p79p78K083K082q68q68N63N62q38q38q39q38J729J732r50r50j45K716K716
-1928f2777j45p30p27k336k336j532j531L238L238j386j383L268M06j144J718K612K612L443
-1910e5492N85k575K87p86n556k694J68j274J587J587J588m10m10n2k910j617J244K318K317
-1891f2095n14n14n14n11R0Q9Q9R0P15P16j968j963m03K459K281K280K24K23J834j025j006
-1870e9423j002j185j182L8M1L7M1J185J188k45k43K795K798j86l044k378M89J26J31j901
$$ y = [-65314, -64099, -64319, -64535, -66395, -68250, -67248, -66242, -65761, -65281, -61938, -58596, -57191, -55787, -57243, -58697, -58566, -58436, -59736, -61037, -63529, -66022, -67084, -68142, -66480, -64818, -66018, -67218, -68388, -69558, -71086, -66886, -63086, -59285, -61804, -64323, -64636, -64949, -65262, -65571, -67997, -70422, -68079, -65735, -63868, -62002, -62996, -63991, -63913, -63835, -63757, -63678, -63481, -63283, -65947, -68612, -68526, -68440, -68355, -68269, -69048, -69826, -67743, -65661, -66529, -67397, -66834, -66272, -67110, -67948, -68787, -69625, -67896, -66164, -67114, -68064, -68209, -65493, -62777, -62922, -63652, -64379, -66715, -69051, -70583, -72114, -68876, -65638, -67024, -68407, -65139, -64733, -65877, -64159, -61547, -58935, -55492, -54907, -57482, -57195, -57981, -63537, -66231, -66063, -67337, -65750, -64163, -62575, -62985, -63395, -63447, -66357, -67974, -66730, -64412, -62095, -62609, -63123, -63637, -64148, -64058, -63969, -63880, -63790, -63075, -62359, -64327, -66290, -66693, -64234, -61953, -59673, -59449, -59226, -57392, -58417, -59423, -60425, -61610, -62792, -62754, -62713, -62676, -62635, -61450, -60262, -60507, -60750, -57955, -55157, -55343, -58387, -60765, -60276, -60150, -60019, -61920]
-1850f1920j896k91k87k548L16L473L476Q50Q53n81n78J122J125j736j736k124k124N59N59
-1831f3488L357M99k660k661j408j409J454J453k068k064R76R76Q87L748j021l882k046k042
-1813g1399p90p90K996K996j595j595l349m85M580M583j919j915R42R47J099J103j584j580
-1795f7755o00K266J010j848j532J334O15L480K314n44j621j617K217K221o45o41J144J148
-1777e9054J144J147O41O41K250o11l323l324k072k071j461j460k09K653J133J132J670j193
-1759f2367P34L596J986q76J98J97k664k664k918n5J017J017L074K12L92L91l32l28R21L785
-1739e4684k984k981j554J312J60J64L39L43n55n52n55n51L68L69L69L69j479j479j480j479
-1719f6540j181j181j08K753L99k463j926j927j19K742J133J133o26o26o26o26j073j073J79
$$ y = [-61920, -63816, -64107, -64394, -66942, -66626, -63153, -59677, -58827, -57974, -58555, -59133, -58011, -56886, -58622, -60358, -62482, -64606, -64047, -63488, -60131, -59632, -62292, -64953, -66361, -67770, -66316, -64863, -66931, -68995, -68019, -67043, -66156, -62408, -63429, -67311, -69357, -71399, -72189, -72979, -69983, -66987, -68582, -70177, -73526, -74011, -69431, -64848, -66767, -68682, -67740, -66793, -65694, -64591, -66175, -67755, -68355, -66089, -65079, -66927, -68459, -67125, -66510, -63030, -60716, -61260, -62881, -64498, -62281, -60060, -60705, -61346, -60202, -59054, -57910, -56763, -56122, -55481, -53231, -53842, -57165, -60489, -62561, -64632, -66093, -67553, -67762, -65109, -63976, -62844, -61174, -62367, -61633, -58037, -56051, -56927, -56729, -56532, -59196, -61860, -64778, -64833, -63816, -62799, -59725, -59513, -59121, -58730, -59062, -59390, -58469, -54684, -57668, -60649, -62203, -60891, -60731, -60567, -60228, -59885, -60440, -60992, -61547, -62098, -61730, -61361, -60992, -60623, -62102, -63581, -65061, -66540, -67721, -68902, -69010, -66257, -65858, -68321, -70247, -72174, -72293, -69551, -68418, -67285, -67911, -68537, -69163, -69789, -70862, -71935, -71756]
-1700g1756L040O56O56Q34Q35j155j152r76r72r47J919J558J561N44k314K154K157J468J472
-1681f0418j394j389p31p30p30p31R10R09n22n22j967j967p16K147J818J818J818J819l80
-1662f0958l242j632j632k019k020Q42Q42N89N89K019K020q72q72o93o93k907m1j654j651
-1643g3985n21n18k131P34J162J166K415N280L487O30o26K239N22N25p30p27p30p26K131K135
-1623e8268k68k65j520m378K68K72Q9R4o79o74J885J890P82l983l749l744P4O756M545k19
-1603f1092l771J002P01P04R83j874j878R88m47m44k057Q09J274j583K01K05J751J755J751
-1584f1022J755q94q94J967J967J79J79q94l756k258O04J676J677O7O7O7O7p75p75r53r54
-1563f2903J19k742j133L636M710J848j013j014R0Q9J520J521k612k609K162K161o15o11o11
$$ y = [-71756, -68716, -68060, -67404, -66570, -65735, -66890, -68042, -69018, -69990, -70937, -69018, -67460, -65899, -65355, -67669, -65515, -63358, -61890, -60418, -61812, -63201, -63932, -64662, -65392, -66123, -65213, -64304, -64826, -65348, -67315, -69282, -69998, -67851, -66033, -64215, -62397, -60578, -60958, -64200, -65832, -67464, -69483, -71503, -70661, -69819, -69230, -68641, -66622, -64602, -65474, -66346, -67039, -67732, -70639, -70680, -72334, -73985, -74506, -75024, -77155, -76421, -75259, -74093, -71678, -66398, -62911, -62281, -62907, -60668, -60146, -59621, -60351, -61078, -61808, -62534, -60403, -58268, -58536, -58801, -60321, -64699, -64431, -64159, -64070, -63976, -64655, -65329, -63444, -61554, -60772, -64755, -68504, -72248, -72174, -65418, -60873, -61092, -64863, -63861, -63160, -62456, -61473, -63347, -65225, -64237, -64684, -65128, -67185, -66376, -65102, -66685, -66484, -66279, -64528, -62773, -61022, -59267, -60161, -61055, -59088, -57121, -56942, -56763, -57657, -61413, -63671, -63067, -61391, -59714, -59647, -59580, -59513, -59446, -60221, -60996, -61949, -62903, -62784, -65526, -66659, -63023, -58313, -56465, -57478, -58492, -58402, -58313, -56793, -55272, -57884, -60493, -58331, -56170, -56785, -57396, -58007]
-1544e8007o11l54l51l211l212k083k079P82P83J151J151j710j710M36M36M36M36J881J882
-1525f3954J882J881j337j338j338j337J79J78J79J83j163j162K68K72K288K288n74n70j319
-1506f4494j319J542J547o41o41o41o41K042K042k728k727R76R76j885j885P67P68o64o63
-1487f8269m58m58K403K403J718J718j144j144n18n18n18n18k127k128P34P34L782L782R20
-1468e9606R21Q60Q61k001k001m66m65m66m66R06R05R05R06j181j178j181j177K306K310n51
-1448e9859n52j75j71J256J259j815j810l242l242q9q6J341J346M47M51M50M51k38k35k38
-1428f4751k35J013J018J374m348m73m70q30q28N41N44Q38Q42j345L428P41P46j226j222j226
-1408f5869j222J08J11J09J11k336k332N25N29o37o34o37o33L655L659P94P97j505j506m366
$$ y = [-58007, -58618, -58972, -59323, -62534, -65746, -67829, -69908, -69126, -68343, -67192, -66041, -67751, -69461, -69025, -68589, -68153, -67717, -65836, -63954, -62072, -60191, -61528, -62866, -64204, -65541, -65362, -65184, -65005, -64822, -65985, -67147, -66879, -66607, -64319, -62031, -62605, -63175, -64494, -65813, -64271, -62724, -63365, -64006, -64647, -65288, -63246, -61204, -63932, -66659, -65683, -64707, -66592, -68477, -67710, -66942, -67606, -68269, -68727, -69185, -66782, -64379, -62661, -60943, -62087, -63231, -63749, -64267, -64785, -65303, -67430, -69558, -68824, -68090, -64308, -60526, -59606, -58685, -57825, -56964, -58965, -60966, -61432, -61897, -62363, -62829, -61923, -61018, -60113, -59207, -60388, -61566, -62747, -63924, -61618, -59308, -59859, -60411, -60586, -60757, -59501, -58242, -60057, -61867, -65109, -68351, -68440, -68526, -67185, -65839, -65392, -64941, -64491, -64040, -64278, -64513, -64751, -64986, -63973, -62955, -61581, -65929, -66402, -66872, -67702, -68530, -67989, -67445, -66607, -65765, -67110, -63682, -62941, -62195, -63421, -64643, -65869, -67091, -66983, -66872, -66763, -66652, -68988, -71320, -70795, -70266, -70903, -71537, -72174, -72807, -69152, -65493, -64699, -63902, -65407, -66913, -71279]
-1388g1279M06K23k634p30p27Q94Q95Q94Q98J79J82L041L044K586K586k76k72k16k13k16k12
-1367f0947K01K01L21m445l794R80Q57Q61J181J185j680j677J330J334j01r6N92N96k269k265
-1347f7635k538k534L25L28J270J274j412j408n78K288O74N448L096K39k627k623j494j491
-1329f9398o3o0N85N85K016K016j055j054J628J628N6k805k746K023L007j763l91K470O56
-1310f2665O56k027k027L88L87j043j044O41O41O41O41j058j058J624J625K556l02j379L395
-1291e9408R76R80J095J100M17k441k265k262j401j397J460J465K12K16k649k645n93n89Q39
-1272f6890Q42o3o0k42k39L216L58j077J788j729j725J133J136Q65j994l87l84O41O45k221
-1252f6387k217J684J688K53K57r42r39J919J922N78N81j211J654o44l503J144J148m9m4J382
$$ y = [-71279, -70873, -70650, -73284, -74014, -74741, -73847, -72952, -72058, -71160, -70981, -70799, -67758, -64714, -62128, -59542, -59818, -60090, -60306, -60519, -60735, -60947, -60746, -60545, -60224, -64669, -68463, -67483, -66626, -65765, -64584, -63399, -65079, -66756, -65426, -64092, -64193, -64289, -63697, -63101, -65370, -67635, -70173, -72707, -72382, -72054, -70784, -69510, -70922, -72330, -72908, -70620, -69946, -64498, -61402, -61163, -63790, -66413, -67907, -69398, -69461, -69521, -68936, -68351, -66335, -64319, -65374, -66428, -64800, -63172, -63116, -65921, -68667, -66644, -63637, -65400, -65791, -63321, -62665, -62009, -64036, -66063, -65675, -65288, -66331, -67375, -66734, -66093, -65452, -64811, -65869, -66927, -65303, -63678, -61122, -61424, -62803, -59408, -58432, -57452, -56357, -55257, -54840, -57281, -59546, -61808, -63209, -64606, -63146, -61681, -61469, -61253, -63902, -66547, -67140, -67729, -66890, -66048, -66111, -66171, -66413, -66652, -63436, -63078, -64155, -62367, -64096, -65821, -64688, -63552, -62687, -64681, -65068, -65452, -64811, -64166, -66387, -68604, -66920, -65232, -64979, -64722, -65664, -66603, -64684, -62762, -62184, -61603, -62814, -61160, -61804, -65307, -64163, -63015, -63064, -63108, -61726]
-1232f1726l383k292N74K72K76k590K76J524J528K6L0K6K9j106j103j107j103J059J058J058
-1212f6674J058p00p01q79J982j04j05K758K757k83l145m62K400j79l041j431J431K266K265
-1193f0787m17m18P75P75K206K206R0Q9j818J043J054l711k463M03j092j088r13r09J636J639
-1173f1700N63k295l045j78J188M054J274J275j886j885r61r62M70M69o03o04k034k035L50
-1154f8545L51L689L688J576J577J45J45l02l01l02l02j859j860m28m29J98J97k187k187q68
-1134f8004q65N63N66J815J818L84L87M89M91j896j893J859J863J860J863m88m85m88m84m88
-1114f1133m85m88m84r13r09r13r09Q75Q80Q75Q80k61k57k61k57J289J293J289J293j319j315
-1093f1230j319j316J185J189j379j375K65k593k776K951J457J460j345j341J90L055L231
$$ y = [-61726, -65109, -67401, -66827, -66555, -66279, -68869, -68593, -67069, -65541, -65515, -65485, -65459, -65430, -66536, -67639, -68746, -69849, -68790, -67732, -66674, -65616, -66316, -67017, -67896, -65914, -66018, -66123, -63365, -60608, -60891, -64036, -64498, -62098, -62277, -65318, -66749, -65318, -63052, -60787, -61204, -61622, -60847, -60072, -57866, -55660, -55570, -55481, -57299, -56256, -55202, -58913, -61376, -60973, -62065, -63153, -64066, -64975, -63339, -61700, -61137, -63432, -66477, -66655, -65467, -61413, -60139, -58864, -60750, -62635, -63596, -64558, -64088, -63619, -64222, -64826, -66860, -68895, -68545, -68194, -64505, -60817, -59241, -57664, -57519, -57374, -57676, -57977, -58279, -58581, -60440, -62300, -62728, -63157, -62959, -62762, -64949, -67136, -68004, -68869, -68306, -67740, -65925, -64107, -63723, -63336, -62847, -62356, -64252, -66145, -64286, -62423, -60563, -58700, -59188, -59673, -60161, -60645, -61133, -61618, -62106, -62590, -63503, -64412, -65325, -66234, -65359, -64479, -63604, -62724, -62985, -63242, -63503, -63760, -62471, -61178, -59889, -58596, -59915, -61230, -62549, -63865, -62680, -61491, -62870, -64245, -63980, -66573, -69349, -66398, -64941, -63481, -64826, -66167, -65977, -62922, -59691]
-1076e9691k489j539j535Q45Q50n89N138m69m66J587J591J469m252k258k254k616k612O34
-1058f8656O37O33O37L25L27L25L28p49p46p49p45N18N22N18N21L10L13L09L13j934j934M51
-1036f8526M51j099j099L31L32O59O60O59O60J554J553j784j785J136J137J136J137J82J83
-1017f2523J82J83J121J122j263j263k664k665k79k79L059L059J628J628j233j233l022K701
-999f1741O30O30K418K418k35k34k35k35k917k918j487j486q91q90J494J494j30j31j30j31
-979f4707J330J331J330J330k57k57k57k57L39L39L39L39k165k165k165k164J00J01J00J01
-959f7315j092j091j092j092J472J472r13r13j628j629P57P56L201L201L200L201K2K3K2K2
-939e9416L80L80L80L84j5j5j93j94l43l204m814R13P52P53l21l20j185j185J200J204J743
$$ y = [-59691, -62180, -63719, -65254, -64409, -63559, -64148, -59010, -59479, -59945, -58358, -56767, -55298, -59550, -61808, -64062, -66678, -69290, -68656, -68019, -67386, -66749, -66424, -66097, -65772, -65444, -66193, -66939, -67688, -68433, -67915, -67393, -66875, -66354, -66044, -65731, -65422, -65109, -67043, -68977, -68526, -68075, -69174, -70273, -69942, -69610, -68951, -68291, -67632, -66972, -65418, -63865, -65649, -67434, -66298, -65161, -64025, -62888, -62706, -62523, -62341, -62158, -61037, -59915, -61178, -62441, -65105, -67770, -68049, -68328, -65269, -62210, -60582, -58954, -60187, -61420, -64442, -61741, -61111, -60481, -58063, -55645, -55880, -56114, -56349, -56584, -59501, -62419, -63906, -65392, -66283, -67173, -65679, -64185, -64315, -64446, -64576, -64707, -63377, -62046, -60716, -59386, -59643, -59900, -60157, -60414, -60075, -59736, -59397, -59058, -61223, -63388, -65553, -67717, -67617, -67516, -67416, -67315, -68407, -69498, -70590, -71682, -70210, -68738, -69651, -70564, -72192, -73821, -73064, -72308, -69107, -65906, -62706, -59505, -59483, -59460, -59438, -59416, -59036, -58656, -58276, -57892, -57907, -57922, -58115, -58309, -58652, -61856, -66670, -65757, -65005, -64252, -64573, -64893, -66078, -67263, -66063, -64859, -63116]
-918f3116J744l502l503P5P4K459K463K392K396r46r43K16K20K20K20j319j316K020K023k362
-898f0485k359r27r28j860j855m29m24r06r02K437K437J31J34J561J565j301j296j297j297
-879f8001P9Q2Q2Q2K27K31K31K31l91l88J997J998o90o85K712j49l130K597q01q01R54R58
-857f2575k381k381j744j740K552K553n82n77n78n77J229J230K660K661j603j602j71j72Q20
-838f2978Q20K250K251l443l443j475m337m863Q61K709K709K380K381j911j912K165K165k20
-820f3891k20K87K87K87K87k660k657J636J635K02K05J635J636j051j047j047j047N59N63
-801f4401N62N63J792J796k496k497J83J86J617J617J256J260J259J259q01p97K541K541k917
-782e5477k914j487j483J316J319k024k019K731K735j561j558o67o63o67o63n52n47n52n48
$$ y = [-63116, -61372, -64874, -68377, -68302, -68228, -65769, -63306, -60914, -58518, -59464, -60407, -60191, -59971, -59751, -59531, -60850, -62166, -60146, -58123, -60485, -62844, -63771, -64699, -66559, -68414, -68843, -69267, -70173, -71075, -68638, -66201, -66070, -65936, -64375, -62810, -64111, -65407, -66704, -68001, -67922, -67840, -67758, -67676, -67449, -67218, -66987, -66756, -67147, -67535, -65538, -63540, -64230, -64915, -62203, -62352, -65482, -62885, -63686, -64487, -63533, -62575, -64956, -67337, -69081, -70821, -68269, -65716, -66298, -66875, -67453, -68030, -66801, -65571, -62911, -60250, -61853, -63455, -63626, -63798, -62978, -62158, -59908, -57657, -61100, -64543, -66018, -70355, -75218, -74357, -71648, -68939, -66559, -64178, -66089, -68001, -65836, -63671, -63891, -64111, -63824, -63537, -63250, -62963, -65623, -68280, -66644, -65009, -64807, -64602, -62967, -61331, -62382, -63429, -64476, -65523, -64964, -64401, -63839, -63276, -61484, -59688, -62184, -64681, -64498, -64312, -62695, -61078, -59822, -58562, -57303, -56044, -56845, -57642, -55101, -52560, -55477, -58391, -59878, -61361, -60045, -58726, -60750, -62769, -60038, -57303, -58864, -60422, -61089, -61752, -62419, -63082, -63634, -64181, -64733, -65281]
-763f5281j684j680j923L805M933p86n52n48j326j323J05J08P49P48K180K180m73m73m74m73
-743f2188O00O00j785j785j45j45j576j577J38J38J569J569j830j829j830j829J166J166J166
-724f8407J167j517j516L729L730Q24Q23o07o04O45O44p86p82k508k508j23j19o59o60J725
-704f7509J729K556K556j736j733P38P38P38P41J640J639K09K12m680m680N67N70O07O11O11
-684f3876O11K247K251k042k042j330j327K012K012K038K042l42l43j085j080j081j080p27
-666f3142p23P08P08Q54Q57Q57Q56j620j617P67P68j237j237J93J94K400K399m62m62k012
-646f0951k012Q50Q49r69r68M62M62k501k500L62L61K299K299K299K299M36M36M36M36j889
-626e7504j889j889j890M747M747k2j9o48o48K213K217M69M70J900J904N567N567Q786Q789
$$ y = [-65281, -66965, -68645, -70568, -66763, -61830, -62616, -63168, -63716, -65042, -66365, -66260, -66152, -65403, -64655, -62475, -60295, -60768, -61241, -61715, -62188, -61588, -60988, -62773, -64558, -64703, -64848, -66424, -68001, -67863, -67725, -66156, -64587, -66417, -68246, -70076, -71905, -70739, -69573, -68407, -67240, -68757, -70273, -66544, -62814, -61990, -61167, -61774, -62378, -61733, -61089, -61875, -62657, -65165, -67673, -67796, -67915, -68574, -69234, -67509, -65780, -63224, -60668, -62404, -64137, -63399, -62661, -61923, -61182, -59542, -57903, -57694, -57482, -62162, -66842, -66275, -65705, -65098, -64487, -63876, -63265, -61018, -58767, -60809, -62851, -64181, -65508, -63496, -61484, -59446, -57404, -57746, -58089, -59174, -60254, -61335, -62415, -63142, -63865, -63157, -62449, -61595, -60738, -59881, -59025, -60645, -62262, -61495, -60727, -61964, -63201, -63008, -62814, -60414, -58015, -58477, -58939, -60951, -62963, -62113, -61264, -62233, -63201, -62739, -62277, -64778, -67278, -66916, -66555, -64256, -61957, -59658, -57359, -56923, -56487, -56051, -55615, -57504, -59393, -61282, -63172, -58425, -53678, -53700, -53719, -54367, -55015, -52802, -50585, -50116, -49646, -47746, -45842, -40275, -34708, -25922, -17133]
-607a7133J4003J9724L2842M6199N7045N7046K1037l0467n8730n8730m5495k8322k0097j4375
-593b5453r844r841l390l387n29n26j155j151k944K784j267j263J952J956l72l69J058J062
-575e2679r61r58r61r58j706j703j707j703Q72Q76Q72Q75J498J502O7P1j979j975Q87Q87k336
-554f1219k333N29N30k72k69J163J162L425L428M858M859J334J338J337J338k035k030k031
-536d4888k031o18o15o15o15j453j449j450j449M62M62M62M66l294l294J476J479k98k98k98
-516e7858k95L58L58k504k500l864l864p04K161R05R06n26K340n55n55M393M397o15o15k224
-496f0861O40j15j12O7O7j963j960j960j960L84L87L88L87N63N66L88L87J319j542J319M184
-475e9427p67p68p68p63R98j863j863J002P61P60R39R42m4m5m5m5q79q79p01p00j811J051
$$ y = [-17133, -3130, 16594, 49436, 95635, 152680, 209726, 230763, 200296, 141566, 82836, 37341, 9019, -11078, -25453, -35297, -45138, -48528, -51915, -52444, -52970, -54125, -55276, -58220, -55436, -56703, -57966, -56014, -54058, -54430, -54799, -53741, -52679, -53640, -54598, -55559, -56517, -58223, -59926, -61633, -63336, -62464, -61588, -60716, -59841, -58343, -56841, -56774, -56703, -58682, -60657, -59770, -58883, -61219, -63552, -63023, -62493, -62765, -63034, -61871, -60709, -57284, -53856, -48998, -44139, -42805, -41467, -40130, -38792, -40827, -42857, -44888, -46919, -47537, -48152, -48767, -49382, -50835, -52284, -53734, -55183, -54721, -54259, -53797, -53331, -56625, -59919, -58443, -56964, -57262, -57560, -57858, -58153, -57795, -57437, -59941, -62441, -66305, -70169, -70873, -68712, -67807, -66901, -67427, -65087, -65642, -66197, -61804, -57407, -58022, -58637, -60861, -60221, -60336, -60448, -60381, -60314, -62277, -64237, -66197, -68157, -67773, -67386, -66998, -66611, -66048, -65482, -65094, -64707, -63388, -64930, -63611, -59427, -60194, -60962, -61730, -62493, -61495, -63358, -65221, -64219, -63458, -62698, -61759, -60817, -60861, -60906, -60951, -60996, -61875, -62754, -63455, -64155, -65966, -64915]
-453f4915J229j632j274J587k01k01j893j889P90P93K579k80J506J509K01L066J454J457q13
-434e6927q08J870J874M14k444k627K38j23k980j197j192J979J982J800J803m8k907j300j297
-415f1890q72q68q72q68j796j792J066J069J71J75J603J606j021j018j021j017J055J054j986
-396f7222j982k821J949Q76j983J606J606j911j908q38q39K501K503m02m02m03l98J356J356
-377f7356p4p1Q05Q04L190L193j460j461j461j457p37p38p38p38J826J826j036L734J252j610
-357f2307K98K98M77M77M77M77o15o15o15o14o15o15o15o15L92L91L91L91o82o81o82o82J032
-334f4852J032Q53Q57J688j173k247K526j45j46J53J57n33n33n33n29m58m59J927J930j293
-314f1778j293J38J41j017j017j017j014J010J010j375j371N25N26N25N29J718J717o67o63
$$ y = [-64915, -63686, -65318, -66592, -65005, -65206, -65407, -67300, -69189, -68399, -67606, -65027, -65307, -63801, -62292, -62091, -59025, -57571, -56114, -56927, -57735, -55865, -53991, -53577, -56021, -58648, -58410, -58533, -61513, -62710, -63902, -61923, -59941, -58141, -56338, -56386, -59293, -60593, -61890, -62762, -63630, -64502, -65370, -67166, -68958, -67892, -66823, -66652, -66477, -64874, -63268, -64289, -65307, -66328, -67345, -66290, -65236, -67222, -69204, -72025, -70076, -69200, -71183, -69577, -67971, -69882, -71790, -72628, -73467, -70966, -68463, -68865, -69267, -69670, -70068, -68712, -67356, -67430, -67501, -66696, -65892, -62702, -59509, -60969, -62430, -63891, -65348, -66085, -66823, -67561, -68299, -66473, -64647, -65683, -61949, -60697, -62307, -62009, -61711, -61234, -60757, -60280, -59803, -60418, -61033, -61648, -62262, -62877, -63492, -64107, -64722, -64330, -63939, -63548, -63157, -63839, -64520, -65202, -65884, -64852, -63820, -62967, -62110, -60422, -61595, -63842, -61316, -61461, -61607, -61454, -61297, -61830, -62363, -62896, -63425, -63883, -64342, -62415, -60485, -61778, -63071, -62933, -62792, -63809, -64826, -65843, -66857, -65847, -64837, -66212, -67583, -67058, -66532, -66007, -65478, -63760, -62043, -62710, -63373]
-295f3373m8m9m8m5j032j032j032j029J394J394J095J099L659j110J41J46k571k571j87j82
-275f5381L80L80L80L84j751j748J587J591J796J800L65L69O63O67r46n712j632j628L316
-256f5120L320K79K83K80K83O67O71p64p60m07m02k791k787j38j34j38j34o78o74P52P57J140
-234f6495J144k199k194O18O22L004L007L80L83L80L84j464j461j464j461p49p45O82O86L573
-214f3369L577K142k623m80K384J725l040m99m96O37O37R32R35k403k403n74n70k001k001
-195f7490l95l91J039J040K958K963l77l76j274j271k701k702l20l17L976L975j71j68J264
-176f0738J263J132J137J136J137l28l24l25l24k056k054k053k053q94q90J494J494O97P00
-157f1849P01P00K50K53k131k131q09q05O26O26K202K206P75P75l201l200L476L480J599J598
$$ y = [-63373, -63421, -63470, -63518, -63563, -64595, -65627, -66659, -67688, -66294, -64900, -63805, -62706, -59047, -60157, -60016, -59870, -62441, -65012, -65199, -65381, -65001, -64621, -64241, -63857, -65608, -67356, -65769, -64178, -62382, -60582, -60217, -59848, -59185, -58518, -59464, -65176, -66808, -68436, -65120, -61800, -61521, -61238, -60958, -60675, -60008, -59337, -60101, -60861, -61268, -61670, -64461, -67248, -67386, -67520, -67658, -67792, -68470, -69144, -68392, -67635, -66495, -65351, -67550, -69744, -69126, -68504, -65500, -62493, -62113, -61730, -61350, -60966, -62430, -63891, -65355, -66816, -67565, -68310, -67628, -66942, -63369, -59792, -57650, -60273, -60753, -58369, -56644, -59684, -60183, -60679, -60042, -59405, -58473, -57538, -59941, -62344, -62918, -63488, -65489, -67490, -67885, -68276, -67237, -66197, -63239, -60276, -60653, -61029, -62303, -63574, -66275, -68977, -69297, -69614, -65638, -61663, -61834, -62002, -60738, -59475, -58343, -57206, -56070, -54933, -55261, -55585, -55910, -56234, -58290, -60344, -62397, -64450, -65344, -66234, -64740, -63246, -62549, -61849, -61148, -60448, -60198, -59945, -62076, -64207, -65016, -65821, -65195, -64569, -62367, -60161, -59386, -58611, -61812, -65012, -61536, -58056, -56457, -54859]
-137e4859j90K675lk866k686J79k299k299P41P46q24q23P86P90R35L797L99m367k657K113
-117f0712P41k116n11n10n11n06j129J736J27J26k291k288j036J826J546J550K98K98J070
-98f2292J073J252j610o63o60q38q38N29N33q98q98L487L492O29O30j19j16j15j16J31J30
-77e7277J30J31j479j480k27K634k19k20k903k902J97J98J97J97n9o0n9o0J401J401J49J49
-55f0161l957j095K064K064n29n29n29n29Q2Q5Q2Q6m55m50K228K232J982q76j177J688J147
-34e6547l618p60p56R31R36l838l834K392K396m70m66J662J666N2N6J155j703j706J158L47
-14f0947L46N26N25R73R72j889j889J23J23j308j308p71p71k203k202l68l69K492K493K582
5f2870K582k79k80l39l39l200l201Q83Q83K314K314N6N6N6N9k299k299k299k295m66m65M303
$$ y = [-54859, -55049, -52374, -52377, -55243, -57929, -57750, -60049, -62348, -61607, -60861, -61685, -62508, -61722, -60932, -59997, -56200, -55801, -60168, -62825, -60712, -59971, -62087, -62598, -63108, -63619, -64125, -65254, -63518, -63391, -63265, -65556, -67844, -68880, -67054, -65508, -63958, -63660, -63362, -62292, -61219, -59967, -61577, -62240, -62900, -63738, -64576, -64047, -63514, -64412, -65310, -61823, -58331, -57702, -57072, -57191, -57307, -57422, -57538, -57407, -57277, -57147, -57016, -58495, -59975, -60202, -57568, -57787, -58007, -60910, -63812, -63615, -63417, -63220, -63023, -63082, -63142, -63201, -63261, -61860, -60459, -60310, -60161, -64118, -65213, -63149, -61085, -61614, -62143, -62672, -63201, -63119, -63034, -62952, -62866, -63321, -63771, -61543, -59311, -57329, -58205, -59382, -57694, -56547, -60165, -60925, -61681, -60750, -59814, -63652, -67486, -65094, -62698, -63168, -63634, -61972, -60306, -60254, -60198, -59043, -60746, -62452, -61294, -60947, -60601, -60075, -59550, -58577, -57605, -59494, -61383, -61260, -61137, -62445, -63753, -64524, -65295, -67498, -69700, -70068, -70437, -67945, -65452, -62870, -60288, -60567, -60847, -61186, -61525, -64725, -67926, -67043, -66160, -63846, -61532, -61476, -61420, -61364, -61305, -63604, -65903, -68202, -70497, -70963, -71428, -67125]
27f7125M307L39L40k523k519l98l99J032J036K254K254o07o04l24l24l24l21R88R87r20J945
48f0906K362k403M54M59O7P1j364j360j334j330J527J532l50l47j781j777l43l39J088J092
68f4982K280K284k489k485M92M95M92M96k847k843J922J927R84R83R84R84k415k414k415k414
88g0981K116K116K117K116J79J79J610J609j699j699J163J162%%J431J431j983j982n51n52
108f2218k83k83j714j714J412J412j449j450j896j897R65R65J428J427J427J427k687k686
126f7814K083K082q01q01K061K060n62n63n63n62K27K27K28K27l69l69l69l69K58K57K57K61
148f2914K27K27J479J483j159m020k232K541Q39Q38j725j722K825K824K825K828j230j230
166e7296j229j226R61R62j901j896o49o48k079k075J952J952N22N25M03M02n51l410k041K727
$$ y = [-67125, -62818, -62479, -62139, -64662, -67181, -67579, -67978, -66946, -65910, -63656, -61402, -62009, -62613, -62937, -63261, -63585, -63906, -62918, -61931, -62851, -60906, -58544, -60947, -60493, -60034, -59967, -59896, -61260, -62620, -63954, -65284, -63757, -62225, -62575, -62922, -64703, -66480, -66823, -67162, -66074, -64982, -62702, -60418, -62907, -65392, -64900, -64405, -63913, -63417, -66264, -69107, -67185, -65258, -64274, -63291, -62307, -61323, -63738, -66152, -68567, -70981, -68865, -66749, -64632, -62516, -62337, -62158, -60548, -58939, -60638, -62337, -61174, -60012, -60012, -60012, -58581, -57150, -59133, -61115, -61666, -62218, -62501, -62784, -64498, -66212, -64800, -63388, -64837, -66287, -68183, -70080, -69115, -68150, -66722, -65295, -63868, -62441, -65128, -67814, -65731, -63649, -64450, -65251, -63190, -61130, -61692, -62255, -62818, -63380, -63153, -62926, -62698, -62471, -62840, -63209, -63578, -63947, -63689, -63432, -63175, -62914, -62687, -62460, -60981, -59498, -60657, -64677, -66909, -64368, -63529, -62691, -64416, -66138, -63313, -60489, -57664, -54836, -56066, -57296, -58525, -59751, -58790, -57828, -59729, -61625, -62274, -62922, -65001, -67076, -65124, -63172, -62650, -62125, -61722, -61320, -61871, -65281, -67322, -64595]
186f4595j34j30J237J237J237J240k541k541L21L24m55m54m55m51n81n81n82n77J207J207
206f6067J208J210M36M40M36M40M36M39M36M40M1M5M1M4O38O40O38O40j121j118j121j118
228f1897M28M32M29M32J651J654J651J654p64p60j062j058O71m099j595J271K459K459k131
247e8175k128J401J401k9k6k683k683J79J82R21R20R20R25o90o89o89o86j837j837P1k787
268f8019k57M512J651J654j5j5j446j445J893J892r68r69j416j416J5J5j327j326J04J05L80
289f6398L80J811J810j26j27j557j558Q12Q13Q12Q12n89n88n89n89M03M06M06M06j237j233
310f5720j234j233K802K806J375J375J878J881k887k888R35R39R39R39j867j863j863j863
328f5549P19P23P23P23K12K16J647J647l480l480J289J289J141J140j722j717P00P01P00P01
$$ y = [-64595, -64729, -64859, -63622, -62385, -61148, -59908, -62449, -64990, -64669, -64345, -64800, -65254, -65709, -66160, -66741, -67322, -67904, -68481, -67274, -66067, -64859, -63649, -63213, -62773, -62337, -61897, -61461, -61022, -60586, -60146, -60105, -60060, -60019, -59975, -59337, -58697, -58059, -57419, -58540, -59658, -60779, -61897, -61469, -61037, -60608, -60176, -58525, -56871, -55220, -53566, -54330, -55090, -56152, -57210, -56539, -60638, -62233, -60962, -58503, -56044, -58175, -60303, -58902, -57501, -57530, -57556, -60239, -62922, -62743, -62561, -61640, -60720, -59800, -58875, -59565, -60254, -60943, -61629, -63466, -65303, -65232, -68019, -68276, -63764, -62113, -60459, -60474, -60489, -61935, -63380, -61487, -59595, -60563, -61532, -62948, -64364, -64349, -64334, -65661, -66987, -66883, -66778, -66398, -66018, -64207, -62397, -62523, -62650, -64207, -65765, -64953, -64140, -63328, -62516, -63105, -63693, -64282, -64871, -64468, -64062, -63656, -63250, -64487, -65720, -66954, -68187, -65385, -62579, -61204, -59829, -57951, -56070, -58957, -61845, -60910, -59971, -59032, -58093, -59960, -61823, -63686, -65549, -64830, -64107, -63384, -62661, -62449, -62233, -60586, -58939, -62419, -65899, -64610, -63321, -62180, -61040, -62762, -64479, -63779, -63078, -62378, -61677]
348f1677m5m5j475j472j971j968Q91Q94J159J163J162J163L83L88L245L249j404j401j401
367e9162j401k094k094P67P71J334J334r7r3O49O48j856j852k004L718N00N03m85m80m81m81
388f2356K497K500l61l62K24K27k634k635N22N25N26N25j911j912R50R51o60o59o60o56j53
409f5512j52j53j53k42k42k42k39J733J732L02L02J464J465l305l302l416l417n55n56K575
429g1913K575J144J147K340K344n18n18J297J300j561j561j282j278j278j278K712K717K716
447f0895K716j188j185j185j185M51M54M55M55j502j498o7o7J271J274j587j588k518k519
466f9908L43L46J297J296J297J300n36n37n36n33j610j609j610j606J960J960J960J963J006
485f3757J006j855j852k31k31K631K634r46r47r46r43P27P30P26P31Q75Q80O96L563K097K102
$$ y = [-61677, -61722, -61767, -63242, -64714, -66685, -68653, -67762, -66868, -65709, -64546, -63384, -62221, -61838, -61450, -58205, -54956, -56360, -57761, -59162, -60563, -62657, -64751, -63984, -63213, -61879, -60545, -60642, -60735, -60086, -59438, -61294, -63146, -65150, -61432, -60932, -60429, -60914, -61394, -61875, -62356, -59859, -57359, -57720, -58082, -57858, -57631, -60265, -62900, -62378, -61853, -61327, -60802, -62713, -64625, -63675, -62724, -63384, -64043, -64703, -65359, -65512, -65664, -65817, -65970, -66212, -66454, -66696, -66935, -65202, -63470, -63168, -62866, -61402, -59937, -63242, -66544, -69960, -73377, -73932, -74488, -71913, -69338, -68194, -67047, -64707, -62363, -62881, -63399, -62102, -60802, -62363, -63924, -65206, -66484, -67762, -69040, -66328, -63611, -60895, -58179, -59367, -60552, -61737, -62922, -62471, -62017, -61562, -61107, -62609, -64107, -64174, -64241, -62970, -61696, -63283, -64871, -67389, -69908, -69565, -69219, -67922, -66626, -65329, -64029, -64565, -65102, -65638, -66171, -67781, -69390, -71000, -72606, -70646, -68686, -66726, -64763, -63757, -62751, -64606, -66458, -66689, -66920, -64289, -61655, -62601, -63548, -64494, -65437, -64710, -63980, -63254, -62523, -61648, -60768, -60072, -56509, -54412, -52310]
506e2310k493k489m95m92m96m92J740J744j121j118j569j565J651j207k985j19l02l160J159
525f6119J163l492o26L510L510r61J904K586k76j528j524K974J12j617J248L599j170j349
543e8056j345J725j136k210k205l402n41q98J968R80R80J337J342k180O82J755l011N40N41
562f3134K42K46J345J345j517j512q16q16M36M39K910M9k813k810k302K466K646k120K2K884
582f2810R76R80R17R16R17R20J274J275J274J278k467k462k467k463L06L09j125j122j692
601f5266j688m39K425N15N18p38p34J054J058n55K310j002r98k612K53K597k61L313M54j039
$$ y = [-52310, -54803, -57292, -57787, -58279, -58775, -59267, -57527, -55783, -56904, -58022, -59591, -61156, -59505, -60712, -63697, -63816, -64118, -67278, -66119, -64956, -68448, -69074, -65564, -62054, -63015, -61111, -58525, -58801, -60329, -61853, -58879, -58767, -60384, -59136, -55537, -56707, -58056, -59401, -57676, -58812, -61022, -63227, -66629, -67170, -68068, -66100, -65120, -64140, -62803, -61461, -63641, -62959, -61204, -64215, -63675, -63134, -62892, -62646, -61301, -59956, -61473, -62985, -63801, -64617, -64181, -63742, -60832, -60783, -63596, -66406, -68708, -66242, -63596, -65716, -65694, -62810, -61834, -60854, -59937, -59021, -58104, -57184, -55910, -54635, -53361, -52083, -54550, -57012, -59479, -61942, -61636, -61327, -62452, -63574, -65266, -66954, -67393, -64968, -64453, -63935, -64673, -65407, -64353, -63295, -63850, -61540, -62542, -63540, -66152, -65899, -63302, -63563, -60250, -59796, -60835]
$$ [...]
##END=	
