##TITLE=	20LVDEGZQiCVzsOpfL+sSg/0976s
##JCAMPDX=	6.0	$$ NMR Plug-in 1.13 of MestReNova 11.0.4-18998
##DATATYPE=	NMRSPECTRUM
##DATACLASS=	XYDATA
##NUMDIM=	1
##ORIGIN=	Bruker BioSpin GmbH
##OWNER=	andrew
##.OBSERVEFREQUENCY=	600.30184456100005264
##.OBSERVENUCLEUS=	^1H
##.SOLVENTNAME=	CD2Cl2
##.PULSESEQUENCE=	zg
##LONGDATE=	2015/06/05 10:01:16.000
##.ACQUISITIONMODE=	SIMULTANEOUS (DQD)
##$ORIGINALFORMAT=	Bruker XWIN-NMR
##$PARAMETERFILE=	(acqus, ASCII, /var/folders/f6/rjf_tdyn2v98c5c0wvkgn4s80000gn/T/20LVDEGZQiCVzsOpfL+sSg/0976s/acqus, 0)
$$ ##TITLE= Parameter file, TOPSPIN		Version 2.1
$$ ##JCAMPDX= 5.0
$$ ##DATATYPE= Parameter Values
$$ ##NPOINTS= 10	$$ modification sequence number
$$ ##ORIGIN= Bruker BioSpin GmbH
$$ ##OWNER= andrew
$$ $$ 2015-06-05 15:01:16.621 +0600  andrew@av-600
$$ $$ /opt/data/andrew/nmr/limog-1782/606/acqus
$$ $$ process /opt/ts21pl6/prog/mod/shimcntl
$$ ##$ACQT0= -9.54927425515661
$$ ##$AMP= (0..31)
$$ 100 100 100 100 100 100 100 100 100 100 100 100 100 100 100 100 100 100
$$ 100 100 100 100 100 100 100 100 100 100 100 100 100 100
$$ ##$ANAVPT= -1
$$ ##$AQSEQ= 0
$$ ##$AQ_mod= 3
$$ ##$AUNM= <au_zg>
$$ ##$AUTOPOS= <>
$$ ##$BF1= 600.3
$$ ##$BF2= 600.3
$$ ##$BF3= 600.3
$$ ##$BF4= 600.3
$$ ##$BF5= 600.3
$$ ##$BF6= 600.3
$$ ##$BF7= 600.3
$$ ##$BF8= 600.3
$$ ##$BYTORDA= 0
$$ ##$CFDGTYP= 0
$$ ##$CFRGTYP= 9
$$ ##$CHEMSTR= <none>
$$ ##$CNST= (0..63)
$$ 1 1 145 1 1 1 1 1 1 1 1 1 1 1 1 1 1 1 1 1 1 1 1 1 1 1 1 1 1 1 1 1 1 1 1
$$ 1 1 1 1 1 1 1 1 1 1 1 1 1 1 1 1 1 1 1 1 1 1 1 1 1 1 1 1 1
$$ ##$CPDPRG= <>
$$ ##$CPDPRG1= <>
$$ ##$CPDPRG2= <waltz16>
$$ ##$CPDPRG3= <>
$$ ##$CPDPRG4= <mlev>
$$ ##$CPDPRG5= <mlev>
$$ ##$CPDPRG6= <mlev>
$$ ##$CPDPRG7= <mlev>
$$ ##$CPDPRG8= <mlev>
$$ ##$CPDPRGB= <>
$$ ##$CPDPRGT= <>
$$ ##$D= (0..63)
$$ 0 1 0 0 0 0 0 0 0 0.06 0 0.03 0 0 0 0 1e-04 0 0 0 0 0 0 0 0 0 0 0 0 0 0
$$ 0 0 0 0 0 0 0 0 0 0 0 0 0 0 0 0 0 0 0 0 0 0 0 0 0 0 0 0 0 0 0 0 0
$$ ##$DATE= 1433494876
$$ ##$DBL= (0..7)
$$ 120 120 120 120 120 120 120 120
$$ ##$DBP= (0..7)
$$ 150 150 150 150 150 150 150 150
$$ ##$DBP07= 0
$$ ##$DBPNAM0= <>
$$ ##$DBPNAM1= <>
$$ ##$DBPNAM2= <>
$$ ##$DBPNAM3= <>
$$ ##$DBPNAM4= <>
$$ ##$DBPNAM5= <>
$$ ##$DBPNAM6= <>
$$ ##$DBPNAM7= <>
$$ ##$DBPOAL= (0..7)
$$ 0.5 0.5 0.5 0.5 0.5 0.5 0.5 0.5
$$ ##$DBPOFFS= (0..7)
$$ 0 0 0 0 0 0 0 0
$$ ##$DE= 6.5
$$ ##$DECBNUC= <off>
$$ ##$DECIM= 2218.66666666667
$$ ##$DECNUC= <off>
$$ ##$DECSTAT= 4
$$ ##$DIGMOD= 1
$$ ##$DIGTYP= 12
$$ ##$DL= (0..7)
$$ 0 120 120 120 120 120 120 120
$$ ##$DP= (0..7)
$$ 150 150 150 150 150 150 150 150
$$ ##$DP07= 0
$$ ##$DPNAME0= <>
$$ ##$DPNAME1= <>
$$ ##$DPNAME2= <>
$$ ##$DPNAME3= <>
$$ ##$DPNAME4= <>
$$ ##$DPNAME5= <>
$$ ##$DPNAME6= <>
$$ ##$DPNAME7= <>
$$ ##$DPOAL= (0..7)
$$ 0.5 0.5 0.5 0.5 0.5 0.5 0.5 0.5
$$ ##$DPOFFS= (0..7)
$$ 0 0 0 0 0 0 0 0
$$ ##$DQDMODE= 0
$$ ##$DR= 22
$$ ##$DS= 0
$$ ##$DSLIST= <SSSSSSSSSSSSSSS>
$$ ##$DSPFIRM= 0
$$ ##$DSPFVS= 20
$$ ##$DTYPA= 0
$$ ##$EXP= <>
$$ ##$F1LIST= <111111111111111>
$$ ##$F2LIST= <222222222222222>
$$ [...]
$$ -1 -1 -1 -1 -1 -1 -1 -1 -1 -1 -1 -1 -1 -1 -1 -1 -1 -1 -1 -1 -1 -1 -1 -1
$$ -1 -1 -1 -1 -1 -1 -1 -1 -1 -1 -1 -1 -1 -1 -1 -1 -1 -1 -1 -1 -1 -1 -1 -1
$$ -1 -1 -1 -1 -1 -1 -1 -1 -1 -1 -1 -1 -1 -1 -1 -1 -1 -1 -1 -1 -1 -1 -1 -1
$$ -1 -1 -1 -1 -1 -1 -1 -1 -1 -1 -1 -1 -1 -1 -1 -1 -1 -1 -1 -1 -1 -1 -1 -1
$$ -1 -1 -1 -1 -1 -1 -1 -1 -1 -1 -1 -1 -1 -1 -1 -1
$$ ##$RG_tab8= (0..255)
$$ -1 -1 -1 -1 -1 -1 -1 -1 -1 -1 -1 -1 -1 -1 -1 -1 -1 -1 -1 -1 -1 -1 -1 -1
$$ -1 -1 -1 -1 -1 -1 -1 -1 -1 -1 -1 -1 -1 -1 -1 -1 -1 -1 -1 -1 -1 -1 -1 -1
$$ -1 -1 -1 -1 -1 -1 -1 -1 -1 -1 -1 -1 -1 -1 -1 -1 -1 -1 -1 -1 -1 -1 -1 -1
$$ -1 -1 -1 -1 -1 -1 -1 -1 -1 -1 -1 -1 -1 -1 -1 -1 -1 -1 -1 -1 -1 -1 -1 -1
$$ -1 -1 -1 -1 -1 -1 -1 -1 -1 -1 -1 -1 -1 -1 -1 -1 -1 -1 -1 -1 -1 -1 -1 -1
$$ -1 -1 -1 -1 -1 -1 -1 -1 -1 -1 -1 -1 -1 -1 -1 -1 -1 -1 -1 -1 -1 -1 -1 -1
$$ -1 -1 -1 -1 -1 -1 -1 -1 -1 -1 -1 -1 -1 -1 -1 -1 -1 -1 -1 -1 -1 -1 -1 -1
$$ -1 -1 -1 -1 -1 -1 -1 -1 -1 -1 -1 -1 -1 -1 -1 -1 -1 -1 -1 -1 -1 -1 -1 -1
$$ -1 -1 -1 -1 -1 -1 -1 -1 -1 -1 -1 -1 -1 -1 -1 -1 -1 -1 -1 -1 -1 -1 -1 -1
$$ -1 -1 -1 -1 -1 -1 -1 -1 -1 -1 -1 -1 -1 -1 -1 -1 -1 -1 -1 -1 -1 -1 -1 -1
$$ -1 -1 -1 -1 -1 -1 -1 -1 -1 -1 -1 -1 -1 -1 -1 -1
$$ ##$RG_tabA= (0..255)
$$ 0.25 0.28 0.32 0.35 0.4 0.44 0.5 0.56 0.64 0.7 0.8 0.89 1 1.12 1.28 1.4
$$ 1.6 1.78 2 2.25 2.56 2.8 3.2 3.56 4 4.5 5 5.6 6.35 7.12 8 9 10 11.3 12.7
$$ 14.2 16 18 20.2 22.6 25.4 28.5 32 36 40.3 45.2 50.8 57 64 71.8 80.6 90.5
$$ 101 114 128 144 161 181 203 -1 -1 -1 -1 -1 -1 -1 -1 -1 -1 -1 -1 -1 -1 -1
$$ -1 -1 -1 -1 -1 -1 -1 -1 -1 -1 -1 -1 -1 -1 -1 -1 -1 -1 -1 -1 -1 -1 -1 -1
$$ -1 -1 -1 -1 -1 -1 -1 -1 -1 -1 -1 -1 -1 -1 -1 -1 -1 -1 -1 -1 -1 -1 -1 -1
$$ -1 -1 -1 -1 -1 -1 -1 -1 -1 -1 -1 -1 -1 -1 -1 -1 -1 -1 -1 -1 -1 -1 -1 -1
$$ -1 -1 -1 -1 -1 -1 -1 -1 -1 -1 -1 -1 -1 -1 -1 -1 -1 -1 -1 -1 -1 -1 -1 -1
$$ -1 -1 -1 -1 -1 -1 -1 -1 -1 -1 -1 -1 -1 -1 -1 -1 -1 -1 -1 -1 -1 -1 -1 -1
$$ -1 -1 -1 -1 -1 -1 -1 -1 -1 -1 -1 -1 -1 -1 -1 -1 -1 -1 -1 -1 -1 -1 -1 -1
$$ -1 -1 -1 -1 -1 -1 -1 -1 -1 -1 -1 -1 -1 -1 -1 -1 -1 -1 -1 -1 -1 -1 -1 -1
$$ -1 -1 -1 -1 -1 -1 -1 -1 -1 -1 -1 -1 -1 -1
$$ ##$ROUT14= (0..7)
$$ 0 0 0 0 0 0 0 0
$$ ##$ROUTER= -1
$$ ##$RX22TY= <no>
$$ ##$RXFMAX= (0..7)
$$ 647.5 -1 -1 -1 -1 -1 -1 -1
$$ ##$RXFMIN= (0..7)
$$ 5 -1 -1 -1 -1 -1 -1 -1
$$ ##$RXINTLV= (0..7)
$$ 1 0 0 0 0 0 0 0
$$ ##$RXMSTY= <no>
$$ ##$SCMTY= <no>
$$ ##$SGUC1= (0..15)
$$ 17 18 34 0 0 0 0 0 0 0 0 0 0 0 0 0
$$ ##$SGUC2= (0..15)
$$ 33 256 20 0 0 0 0 0 0 0 0 0 0 0 0 0
$$ ##$SPECTR= 10
$$ ##$SY2FLAG= 0
$$ ##$TFXNUM= 0
$$ ##$TRIPLO2= 0
$$ ##$VTUTY= <tty05>
$$ ##$WBREFAM= (0..15)
$$ 100 100 100 100 100 100 100 100 100 100 100 100 100 100 100 100
$$ ##$WBREFPH= (0..15)
$$ 0 0 0 0 0 0 0 0 0 0 0 0 0 0 0 0
$$ ##$XFAC= 2
$$ ##END=
$$ 
##$DECIM=	2218.66666666667
##$DSPFVS=	20
##XUNITS=	HZ
##YUNITS=	ARBITRARY UNITS
##FIRSTX=	6322.8525384689401108
##LASTX=	-2691.4329892738592207
##XFACTOR=	-0.1375491802509010153
##YFACTOR=	1.0693049804687499986e-05
##NPOINTS=	65536
##XYDATA=	(X++(Y..Y))
$$ [...]
$$ plain form
-12213 -56783 -56754 -56724 -56012 -55296 -54581 -53866 -53433 -52997 -54354 -52844 -50653 -51320 -52110 -50035 -47613 -49956 -52483 -52144 -52226 -52304 -53161
-12192 -53161 -56877 -59355 -57063 -56202 -55341 -56150 -56958 -56336 -55714 -52967 -50221 -50337 -50452 -50031 -49610 -49189 -48768 -42873 -36974 -27382
-12172 -27382 -13016 6264 28410 40297 30247 7553 -12275 -26502 -35956 -44579 -48429 -50374 -52315 -52923 -53530
-12157 -53530 -52707 -51883 -51835 -51786 -52871 -53955 -57044 -55364 -52073 -48783 -49189 -49595 -47616 -45638 -45667 -45693 -48104 -50515 -52990 -55460
-12137 -55460 -57931 -60402 -58315 -56224 -54134 -52043 -52222 -52397 -52572 -52748 -52994 -53236 -53478 -53720 -53817 -53910 -54003 -54097 -54872 -55643 -54208
-12116 -54208 -52774 -51373 -52830 -55539 -53478 -53049 -55479 -56001 -56523 -58956 -61386 -59522 -57659 -55457 -53251 -53430 -53608 -54208
-12098 -54208 -54805 -53970 -53135 -51857 -50575 -51678 -52781 -52815 -52844 -52874 -52904 -53131 -53355 -53579 -53802 -52539 -51272 -52569 -58635 -60696
-12078 -60696 -62753 -62727 -62697 -63089 -63476 -63390 -58531 -55434 -55196 -55438 -55677 -54279 -52878 -50050 -47218 -47214 -47206 -47203 -47195 -50232 -53266 -53918 -54566
$$ packed form
-12213e6783K9L0P12P16P15P15M33M36j357J510K191o67p90K075K422k343k527L39q2p8q57
-12192e3161l716k478K292Q61Q61q09q08O22O22K747K746j16j15M21M21M21M21N895N899R592
-12172b7382J4366J9280K2146J1887j0050k2694j9828j4227r454q623l850j945j941o08o07
-12157e3530Q23Q24M8M9j085j084l089J680L291L290m06m06J979J978k9k6k411k411k475k470
-12137e5460k471k471K087K091K090K091j79j75j75j76k46k42k42k42r7r3r3r4p75p71J435
-12116e4208J434J401j457k709K061M29k430n22n22k433k430J864J863K202K206j79j78o00
-12098e4208n97Q35Q35J278J282j103j103l4k9l0l0k27k24k24k23J263J267j297o066k061
-12078f0696k057K6L0l92l87Q6M859L097K38k42k39J398J401K828K832MQLQl037l034o52o48
$$ plain form
-12055 -54566 -52744 -50918 -49096 -47270 -47027 -46782 -48924 -51063 -53817 -56571 -55151 -56590 -57883 -56314 -54328 -52338 -51335
-12038 -51335 -53195 -53444 -53690 -51853 -50016 -48179 -46338 -46726 -47113 -47978 -45977 -44903 -48600 -51820 -55036 -58479 -61922 -62026
-12020 -62026 -62127 -64616 -67106 -65958 -61944 -61102 -60260 -60670 -61080 -63308 -65537 -64605 -63674 -60685 -60558 -58822 -57085 -56660 -56236
-12001 -56236 -54201 -55028 -54950 -54872 -54376 -51019 -50702 -53247 -54003 -54760 -54801 -54842 -55479 -58978 -60838 -59835 -57283 -54730 -55602 -56470 -54954
-11980 -54954 -53437 -53176 -52912 -54853 -56795 -58389 -57119 -54417 -54577 -54503 -54425 -56731 -59038 -61482 -61061 -60819 -60577 -61113 -61646 -62179
-11960 -62179 -62712 -61333 -59951 -56958 -56828 -55986 -55140 -56262 -54521 -52621 -53579 -50963 -51205 -53031 -51991 -52923 -53851 -51935 -52878
-11941 -52878 -55077 -54410 -54790 -52304 -53638 -54969 -53042 -51112 -51570 -52025 -52185 -52341 -54410 -53612 -51067 -53288 -52651 -52010 -52058
-11922 -52058 -52103 -50542 -51838 -53776 -55714 -55446 -55174 -55054 -54935 -57201 -59463 -57860 -56258 -57040 -57819 -57767 -57715 -57663 -57607 -56798 -55990
$$ packed form
-12055e4566J822J826J822J826K43K45k142k139k754k754J420j439j293J569J986J990J003
-12038e1335j860k49k46J837J837J837J841l88l87q65K001J074l697l220l216l443l443j04
-12020f2026j01k489k490J148M014Q42Q42m10m10k228k229R32R31K989J27J736J737M25M24
-12001e6236K035q27P8P8M96L357L17k545p56p57m1m1o37l499j860J003K552K553q72q68J516
-11980e4954J517K61K64j941j942j594J270K702j60P4P8k306k307k444M21K42K42n36n33n33
-11960f2179n33J379J382K993J30Q42Q46j122J741J900r58K616k42j826J040r32r28J916r43
-11941e2878k199O67l80K486j334j331J927J930m58m55j60j56k069P98K545k221O37O41m8
-11922e2058m5J561j296j938j938K68K72J20J19k266k262J603J602p82p79N2N2N2N6Q09Q08
$$ plain form
-11901 -55990 -55181 -54369 -55110 -55852 -55162 -54469 -53989 -53508 -55412 -57313 -56951 -56590 -56228 -55863 -54756 -53646 -52539 -51428 -52468 -53504
-11881 -53504 -55975 -58442 -54816 -51186 -46845 -49178 -53124 -52297 -51235 -50169 -53333 -56493 -57272 -58047 -59034 -60018 -61005 -61989
-11863 -61989 -59191 -56388 -55975 -55557 -56873 -58184 -58069 -57950 -57093 -56236 -55378 -54518 -54018 -53519 -53020 -52517 -52628 -52740 -54283 -55822
-11843 -55822 -57096 -58371 -56306 -57100 -58550 -55229 -57156 -59079 -59068 -59056 -59045 -59030 -58527 -58024 -57044 -60830 -63100 -62507 -61438 -60364
-11823 -60364 -58125 -55882 -56027 -56168 -55807 -55442 -55080 -54715 -55248 -55777 -58695 -61609 -61277 -60942 -58225 -55505 -52740 -49971 -50545
-11804 -50545 -51115 -53061 -55002 -54562 -54119 -54931 -55740 -53213 -50683 -48097 -45507 -46260 -47009 -48231 -49450 -52103 -54752 -56660
-11786 -56660 -58565 -60473 -62377 -62764 -63148 -61151 -59150 -58941 -58729 -58520 -58307 -59038 -59765 -58110 -56452 -57122 -57790 -58460 -59127 -59023
-11766 -59023 -58915 -57380 -55841 -55140 -54436 -55166 -55893 -56694 -57491 -58289 -59086 -57022 -54957 -56232 -57506 -58006 -58505 -59183 -59861 -59198
$$ packed form
-11901e5990Q09Q12p41p42O90O93M80M81j904j901L62L61L62L65J107J110J107J111j040j036
-11881e3504k471k467L626L630M341k333l946Q27J062J066l164l160p79p75r87r84r87r84
-11863f1989K798K803M13M18j316j311J15J19Q57Q57Q58Q60N00M99M99N03j11j12j543j539
-11843e5822j274j275K065p94j450L321j927j923J1J2J1J5N03N03R80l786k270N93J069J074
-11823f0364K239K243j45j41L61L65L62L65n33n29k918k914L32L35K717K720K765K769n74
-11804e0545n70j946j941M40M43q12q09K527K530K586K590p53p49j222j219k653k649j908
-11786e6660j905j908j904l87l84J997K001K09K12K09K13p31p27J655J658o70o68o70o67J04
-11766e9023J08J535J539P01P04p30p27q01p97p98p97K064K065j275j274n00m99o78o78O63
$$ plain form
-11746 -59198 -61397 -63416 -60666 -57980 -58151 -57845 -52770 -48678 -47449 -50512 -53575 -55013 -56452 -57890 -59329 -57160 -54991
-11729 -54991 -55207 -55423 -55438 -55453 -56899 -58341 -61069 -63797 -60323 -56847 -56690 -56534 -56377 -56217 -56806 -57394 -55896 -54395 -51730 -53836
-11709 -53836 -55643 -57447 -59314 -61181 -60663 -60141 -59660 -59179 -57268 -55352 -54067 -52781 -53880 -54976 -55595 -56209 -56828 -57443 -56273
-11690 -56273 -55099 -56314 -57525 -57279 -57029 -56485 -55937 -57331 -53951 -49439 -47788 -47072 -49215 -51361 -53504 -54070 -54633 -55200 -55762
-11671 -55762 -52885 -50005 -51421 -52833 -55263 -57689 -56776 -55863 -57078 -58289 -59500 -60711 -60435 -60156 -59876 -59597 -61281 -62962
-11653 -62962 -61304 -59645 -57782 -55915 -57387 -58859 -59049 -59235 -56083 -52930 -54849 -56765 -58680 -60596 -59668 -58736 -57804 -56873
-11635 -56873 -58151 -59425 -57361 -55296 -51973 -48645 -50568 -52487 -53426 -54361 -55300 -56236 -57435 -58632 -58401 -58166 -56563 -54957
-11617 -54957 -55740 -56519 -57626 -58729 -59835 -60938 -58736 -56530 -54328 -52122 -53288 -54451 -55617 -56780 -58065 -59347 -59202
$$ packed form
-11746e9198k199k019K750K686j71L06N075M092J229l063l063j438j439j438j439K169K169
-11729e4991k16k16j5j5j446j442k728k728L474L476J57J56J57J60n89n88J498J501K665k106
-11709e3836j807j804j867j867N18N22M81M81J911J916J285J286j099j096o19o14o19o15J170
-11690e6273J174j215j211K46K50N44N48j394L380M512J651P16k143k146k143n66n63n67n62
-11671e5762K877K880j416j412k430k426R13R13j215j211j211j211K76K79K80K79j684j681
-11653f2962J658J659J863J867j472j472j90j86L152L153j919j916j915j916R28R32R32R31
-11635e6873j278j274K064K065L323L328j923j919r39r35r39r36j199j197K31K35J603J606
-11617e4957p83p79j107j103j106j103K202K206K202K206j166j163j166j163j285j282J45
$$ plain form
-11600 -59202 -59053 -57540 -56023 -56895 -57763 -56757 -55747 -54741 -53731 -53105 -52476 -54234 -55990 -55513 -55032 -55986 -56936 -58397 -59854
-11581 -59854 -59884 -59910 -59969 -60025 -56746 -53463 -54231 -54995 -55762 -56526 -58069 -59608 -58766 -57920 -56291 -54659 -53031 -51399 -51648 -51894 -52144
-11560 -52144 -52390 -52431 -52468 -52509 -52546 -49099 -45649 -46495 -47337 -49301 -51261 -53225 -55185 -53959 -52729 -51503 -50273 -52163 -54048
-11541 -54048 -55937 -57823 -58639 -59451 -60268 -61080 -60435 -59787 -59138 -58490 -57309 -56124 -56727 -54469 -54287 -56962 -57849 -58736 -57868 -56996
-11521 -56996 -56124 -55252 -53951 -52647 -52774 -52900 -53925 -54946 -53761 -52576 -51373 -53027 -54682 -53474 -50869 -48261 -50899 -53538
-11503 -53538 -54041 -57406 -57551 -57693 -57570 -54585 -51421 -51115 -53787 -53597 -52811 -52021 -51861 -51700 -53925 -56146 -56239 -56332 -59586 -62835
-11483 -62835 -66029 -66360 -64009 -61654 -60495 -59336 -56925 -54510 -51861 -52073 -50676 -49275 -50079 -50881 -53292 -52841 -54093 -55341
-11465 -55341 -56411 -57480 -58017 -58550 -56698 -51984 -51060 -54901 -54451 -54000 -55237 -56470 -58837 -61203 -64587 -63197 -61330 -59463
$$ packed form
-11600e9202J49J513J517q72q68J006J010J006J010O26O29j758j756M77M81r54r50j461j457
-11581e9854l0k6n9n6L279L283p68p64p67p64j543j539Q42Q46J629J632J628J632k49k46k50
-11560e2144k46m1l7m1l7L447L450q46q42j964j960j964j960J226J230J226J230j890j885
-11541e4048j889j886q16q12q17q12O45O48O49O48J181J185o03K258J82k675q87q87Q68Q72
-11521e6996Q72Q72J301J304j27j26j025j021J185J185J203j654j655J208K605K608k638k639
-11503e3538n03l365j45j42J23K985L164L06k672J90P86P90J60J61k225k221r3r3l254l249
-11483f2835l194l31K351K355J159J159K411K415K649k12J397J401q04q02k411M51j252j248
-11465e5341j070j069n37n33J852M714R24l841M50M51j237j233k367k366l384J390J867J867
$$ plain form
-11447 -59463 -56660 -56716 -56891 -57067 -56113 -59925 -60279 -57771 -59437 -61099 -61154 -61207 -60279 -59347 -59671 -59992 -59869 -56880 -55505 -54126
-11427 -54126 -54212 -54294 -51995 -49692 -46849 -44002 -40562 -34257 -26167 -20935 -21550 -25023 -28678 -35192 -40458 -42858 -44963 -47065
-11409 -47065 -48991 -50914 -53284 -55651 -56049 -59310 -63469 -61900 -58960 -56019 -56005 -55986 -56683 -51656 -47706 -49476 -52438 -55401
-11391 -55401 -53977 -52550 -53985 -55419 -56709 -57994 -56418 -54842 -56198 -57551 -57473 -57394 -57052 -56705 -57790 -58874 -59668 -60458 -59820
-11372 -59820 -59179 -59228 -59273 -62183 -65090 -63536 -61978 -61855 -61728 -60413 -59094 -56347 -53597 -51693 -49785 -50743 -51697 -53251 -54801
-11353 -54801 -54924 -55043 -53459 -51872 -53150 -54425 -54957 -55487 -53158 -50825 -50612 -50400 -53049 -55695 -56556 -57417 -58278 -59135 -58468
-11334 -58468 -57801 -57134 -56463 -56154 -55844 -55535 -55222 -54644 -54067 -53668 -53266 -51496 -52587 -55468 -52621 -51298 -52837 -54018 -52334
-11315 -52334 -52382 -52431 -52300 -52166 -50296 -48421 -51320 -54216 -56310 -58401 -57633 -56862 -59567 -62269 -63543 -64814 -64747 -64676 -64609 -64538 -65015
$$ packed form
-11447e9463K803n6j75j76R54l812l54K508j666j662n5n3R28R32l24l21J23K989J375J379
-11427e4126q6q2K299K303K843K847L440O305Q090N232o15l473l655o514n266k400k105k102
-11409d7065j926j923k370k367l98l261m159J569K940K941J4J9o97N027L950j770k962k963
-11391e5401J424J427j435j434j290j285J576J576j356j353P8P9L42L47j085j084p94p90O38
-11372e9820O41m9m5k910k907J554J558J23J27J315J319K747K750J904J908r58r54j554j550
-11353e4801j23j19J584J587j278j275n32n30K329K333K13K12k649k646q61q61q61q57O67
-11334e8468O67O67O71L09L10L09L13N78N77L99M02J770j091k881K847J323j539j181J684
-11315e2334m8m9J31J34J870J875k899k896k094k091P68P71k705k702j274j271O7P1O7P1m77
$$ plain form
-11294 -65015 -65488 -63103 -60715 -61192 -61665 -58922 -56176 -58457 -55010 -53176 -54201 -54872 -55539 -56388 -57234 -58177 -59120 -60063 -61005
-11275 -61005 -59683 -58360 -57037 -55714 -55062 -54410 -53757 -53105 -53825 -54544 -55263 -55982 -58483 -60983 -60622 -60260 -58438 -56616 -56224
-11256 -56224 -55833 -56485 -57137 -57790 -58442 -57633 -56824 -56016 -55207 -54697 -54186 -53675 -53165 -51432 -49699 -49755 -49811 -47728 -51369 -56262 -58293
-11235 -58293 -57313 -56332 -55174 -54015 -53921 -53828 -53735 -53642 -52923 -52204 -52915 -53627 -52036 -50445 -51715 -52986 -55092 -57197 -59302 -61408
-11215 -61408 -61356 -61304 -62682 -64061 -61177 -58293 -58270 -58248 -56645 -55043 -56303 -57562 -58941 -60320 -60268 -60215 -60566 -60916 -60014 -59112 -58658
-11194 -58658 -61065 -60670 -54551 -51801 -54775 -57212 -56787 -54246 -51704 -50415 -49125 -48145 -47162 -47609 -48056 -48447 -48835 -50653 -52472
-11175 -52472 -53035 -53594 -52722 -51850 -50892 -49930 -50042 -50154 -56243 -56608 -55721 -57693 -57372 -57052 -56910 -56765 -56168 -55572 -54976 -54376 -54615
-11154 -54615 -54853 -55092 -55326 -54048 -52770 -51492 -50214 -51917 -53620 -55323 -57026 -54823 -52621 -50597 -48574 -50486 -55259
$$ packed form
-11294f5015m73K385K388m77m73K743K746k281L447J834j025o71o67q49q46r43r43r43r42
-11275f1005J322J323J323J323O52O52O53O52p20p19p19p19k501k500L61L62J822J822L92
-11256e6224L91o52o52o53o52Q09Q09Q08Q09N10N11N11N10J733J733n6n6K083l641m893k031
-11235e8293R80R81J158J159R4R3R3R3P19P19p11p12J591J591j270j271k106k105k105k106
-11215f1408N2N2j378j379K884K884K3K2J603J602j260j259j379j379N2N3l51l50R02R02M54
-11194e8658k407L95O119K750k974k437M25K541K542J289J290R80R83m47m47l91l88j818j819
-11175e2472n63n59Q72Q72R58R62j12j12o089l65Q87j972L21L20J42J45N97N96N96O00k39
-11154e4615k38k39k34J278J278J278J278j703j703j703j703K203K202K024K023j912m773
$$ plain form
-11137 -55259 -61106 -62183 -61367 -60547 -59433 -58315 -57737 -57156 -56578 -55997 -54749 -53497 -55110 -56720 -55561 -54398 -51689 -53746
-11119 -53746 -58874 -59232 -57801 -56370 -56280 -56191 -56101 -56012 -53761 -51510 -52122 -52733 -55222 -57711 -58770 -59828 -57309 -54790 -55133 -55475
-11099 -55475 -56385 -57294 -58203 -59112 -57838 -56563 -55289 -54015 -54171 -54328 -57346 -60364 -61132 -61896 -59798 -57700 -55964 -54223 -55345
-11080 -55345 -56467 -55207 -53944 -55542 -57141 -59012 -60879 -59884 -58889 -58464 -58035 -59038 -60040 -59228 -58412 -57596 -56780 -56817 -56850 -56884
-11060 -56884 -56918 -56955 -56988 -57022 -57055 -56362 -55669 -54976 -54279 -52334 -50389 -51305 -52218 -52353 -52487 -52621 -52751 -54376 -56001 -57327 -58650 -58967
-11038 -58967 -54514 -52744 -50970 -52449 -53929 -52546 -51160 -53027 -54894 -55330 -55762 -53485 -51209 -55610 -60007 -60897 -61788 -61427
-11020 -61427 -58199 -56824 -55449 -53716 -54842 -55255 -55669 -53221 -53631 -54432 -55233 -57465 -54924 -54220 -53515 -50903 -51149 -51309 -51469
-11001 -51469 -51809 -52144 -53780 -55416 -54369 -53318 -50243 -50031 -49461 -48887 -50653 -49558 -49893 -53087 -55360 -57633 -58654 -59671
$$ packed form
-11137e5259n847j077Q16Q20J114J118N78N81N78N81J248J252j613j610J159J163K709k057
-11119e3746n128l58J431J431R0Q9R0Q9K251K251o12o11k489k489j059j058K519K519l43l42
-11099e5475r10r09r09r09J274J275J274J274j56j57l018l018p68p64K098K098J736J741j122
-11080e5345j122J260J263j598j599j871j867R95R95M25M29j003j002Q12Q16Q16Q16l7l3l4
-11060e6884l4l7l3l4l3O93O93O93O97J945J945r16r13j35j34j34j30j625j625j326j323l17
-11038e8967M453J770J774j479j480J383J386j867j867m36m32K277K276m401m397q90q91L61
-11020f1427L228J375J375J733j126m13m14K448m10q01q01k232K541P04P05K612k46j60j60
-11001e1469l40l35j636j636J047J051L075K12N70N74j766J095l35l194k273k273j021j017
$$ plain form
-10983 -59671 -60812 -61952 -64165 -69237 -69155 -66211 -63446 -63539 -63599 -63659 -61214 -58766 -56351 -56798 -58676 -57689 -54894 -52099 -51987
-10964 -51987 -51872 -52386 -52900 -50553 -48201 -51171 -54138 -52334 -50530 -52546 -54559 -53709 -52859 -56329 -59794 -60398 -58140 -56243
-10946 -56243 -59112 -59120 -59127 -60242 -61352 -62284 -63215 -60305 -54529 -51615 -51563 -50687 -49807 -47676 -45544 -46905 -48261 -51048 -53836 -53534
-10926 -53534 -53232 -54361 -55487 -57510 -59533 -58695 -57853 -57454 -57055 -56478 -55896 -54246 -49733 -49811 -52748 -53616 -51622 -51238 -50851 -53895
-10906 -53895 -54078 -53008 -51935 -51894 -51853 -53243 -54629 -54529 -54428 -52897 -51361 -52483 -53601 -54723 -55841 -54846 -53847 -55714 -57577
-10887 -57577 -54771 -51961 -51659 -51354 -52572 -48063 -44989 -47635 -48447 -49256 -53288 -57316 -58129 -58937 -58319 -57696 -57473 -57245 -57022
-10868 -57022 -56795 -56482 -56165 -55852 -55535 -56008 -56482 -56955 -57428 -58885 -60342 -60368 -60394 -57737 -55080 -55285 -55490 -53847 -52204 -51991 -51779
-10847 -51779 -54052 -56325 -55736 -55147 -55662 -56176 -56690 -57204 -57667 -58129 -58591 -59053 -58084 -57115 -59008 -60901 -59135 -57365 -58457 -59548
$$ packed form
-10983e9671j141j140k213n072Q2K944K765r3o0o0K445K448K415m47j878R87K795K795J12
-10964e1987J15n14n14K347K352k970k967J804J804k016k013Q50Q50l470l465o04K258J897
-10946e6243k869qpj115j110r32r31K910N776K914N2Q76Q80K131K132j361j356k787k788L02
-10926e3534L02j129j126k023k023Q38Q42L99L99N77N82J650M513p8k937q68J994L84L87l044
-10906e3895j83J070J073M1M1j390j386J00J01J531J536j122j118j122j118R95R99j867j863
-10887e7577K806K810L02L05j218M509L074k646q12q09m032m028q13q08O18O23K23K28K23
-10868e7022K27L13L17L13L17m73m74m73m73j457j457k6k6K657K657k05k05J643J643K13K12
-10847e1779k273k273N89N89n15n14n14n14m63m62m62m62R69R69j893j893J766J770j092j091
$$ plain form
-10827 -59548 -57752 -55952 -55583 -55215 -54350 -53482 -55475 -57469 -59258 -61043 -62828 -64613 -65533 -66450 -67366 -68283 -64642 -60998 -62123
-10808 -62123 -63249 -63424 -63595 -62336 -61076 -61758 -62436 -63115 -63793 -64411 -65030 -65649 -66263 -64706 -63148 -61590 -60029 -57234 -54439
-10789 -54439 -53076 -51708 -50106 -48503 -49763 -51019 -53731 -56441 -57719 -58997 -59533 -60066 -60599 -61132 -62392 -63647 -62041 -60435
-10771 -60435 -60622 -60804 -60987 -61169 -60473 -59772 -61937 -64098 -63670 -63238 -64240 -60469 -57163 -56716 -59135 -61549 -62358 -63163 -62541 -61915
-10751 -61915 -58863 -55811 -55621 -55431 -58073 -60715 -60495 -60275 -59824 -59373 -61784 -64195 -60882 -57570 -59027 -60484 -62302 -64117
-10733 -64117 -63368 -62619 -61158 -64464 -67948 -66662 -64493 -65183 -63964 -62746 -61710 -60670 -59630 -58591 -58140 -57685 -57231 -56776
-10715 -56776 -57577 -58375 -59172 -59969 -58975 -57976 -59839 -61702 -60767 -59828 -61751 -63674 -64717 -65760 -63942 -62123 -59321 -56519 -55147
-10696 -55147 -53776 -56549 -59321 -59232 -59142 -60007 -60871 -58874 -56877 -56817 -56757 -55267 -53776 -55267 -56757 -56817 -56877 -57756 -58635 -59515 -60394
$$ packed form
-10827e9548J796J800L69L68Q65Q68j993j994j789j785j785j785r20r17r16r17L641L644j125
-10808f2123j126j75j71J259J260o82o78o79o78o18o19o19o14J557J558J558J561K795K795
-10789e4439J363J368J602J603j260j256k712k710j278j278n36n33n33n33j260j255J606J606
-10771f0435j87j82j83j82O96P01k165k161M28M32j002L771L306M47k419k414q09q05O22O26
-10751f1915L052L052J90J90k642k642K20K20M51M51k411k411L313L312j457j457j818j815
-10733f4117P49P49J461l306l484J286K169o90J219J218J036J040J040J039M51M55M54M55
-10715e6776q01p98p97p97R94R99j863j863R35R39j923j923j043j043J818J819K802K802J372
-10696e5147J371k773k772Q9R0q65q64J997J997O0O0J490J491j491j490o0o0q79q79q80q79
$$ plain form
-10675 -60394 -59485 -58576 -59097 -59619 -58099 -56578 -57920 -59261 -60394 -61527 -61229 -60927 -60219 -59511 -57372 -55233 -52915 -50597 -49711
-10656 -49711 -48820 -51939 -55054 -56563 -58069 -59548 -58162 -56836 -60279 -61944 -58837 -57104 -58229 -59507 -60782 -59373 -57965
-10639 -57965 -58617 -59269 -59921 -60573 -60152 -59731 -59310 -58889 -56142 -53396 -53512 -53627 -53027 -52427 -54689 -56951 -58434 -59914 -61397 -62876
-10619 -62876 -61766 -60651 -60972 -61289 -62548 -63804 -62202 -60596 -58188 -55777 -53370 -50959 -52353 -53743 -55133 -56523 -57167
-10602 -57167 -57812 -55595 -53377 -55926 -58471 -59586 -60700 -60741 -60782 -59690 -58598 -56903 -59973 -60361 -60748 -61345 -61941 -62537 -63133
-10583 -63133 -61937 -60737 -59537 -58337 -56005 -53672 -56109 -58546 -59299 -60051 -60804 -61557 -59686 -57816 -55945 -54074 -52010 -49945
-10565 -49945 -52651 -55356 -54544 -53731 -52919 -52107 -53709 -55308 -56910 -58509 -58561 -58609 -58661 -58710 -59805 -60897 -61993 -63085 -61438 -59787
-10545 -59787 -58140 -56489 -57689 -58885 -60081 -61277 -60271 -59261 -58550 -57838 -55192 -57313 -61520 -65727 -64184 -62638 -61091
$$ packed form
-10675f0394R09R09n21n22J520J521j342j341j133j133K98L02P08P08K139K139K318K318Q86
-10656d9711Q91l119l115j509j506j479J386J326l443j665L107J733j125j278j275J409J408
-10639e7965o52o52o52o52M21M21M21M21K747K746j16j15O00O00k262k262j483j480j483j479
-10619f2876J110J115l21l17j259j256J602J606K408K411K407K411j394j390j390j390o44
-10602e7167o45K217K218k549k545j115j114m1m1J092J092J695l070l88l87n97n96n96n96
-10583f3133J196J200J200J200K332K333k437k437p53p52p53p53J871J870J871J871K064K065
-10565d9945k706k705Q12Q13Q12Q12j602j599j602j599n2m8n2m9j095j092j096j092J647J651
-10545e9787J647J651j200j196j196j196J006J010P11P12K646k121m207m207J543J546J547
$$ plain form
-10528 -61091 -59545 -56772 -54000 -52658 -51313 -51492 -51671 -54711 -57749 -59433 -61117 -62802 -64482 -64706 -64929 -63722 -62511 -61974
-10510 -61974 -61438 -58039 -54637 -54607 -54577 -54547 -54514 -55677 -56839 -55140 -53437 -53169 -52900 -52632 -52360 -54234 -56109 -55121 -54130 -54931 -55732
-10489 -55732 -56534 -57331 -54950 -52569 -53049 -53526 -53202 -52878 -50944 -49006 -50497 -49125 -46681 -49006 -48887 -48768 -48947 -49125 -50020
-10470 -50020 -50914 -50378 -49841 -51719 -53597 -52613 -51630 -51004 -50374 -49748 -49118 -52517 -55911 -56448 -56981 -56526 -56068 -57044 -58017 -59023
-10450 -59023 -60025 -61032 -62034 -59384 -56731 -56940 -57149 -55274 -53396 -54380 -55364 -57052 -58736 -60420 -57335 -55923 -57368 -61378
-10432 -61378 -62526 -61855 -61184 -60335 -59481 -60212 -60942 -61672 -62399 -60581 -58762 -58375 -57983 -59712 -61441 -63170 -60126 -55569 -53873
-10413 -53873 -55039 -56202 -56981 -57760 -57108 -56452 -55919 -55386 -57715 -60040 -60074 -60107 -60141 -60171 -58449 -56727 -55006 -53280 -54480 -55680
-10393 -55680 -59563 -58673 -59165 -59656 -59850 -60040 -61248 -62455 -60800 -59142 -59295 -59444 -59597 -59746 -59899 -60048 -60201 -60350 -58289 -56224
$$ packed form
-10528f1091J546K773K772J342J345j79j79l040l038j684j684j685j680k24k23J207J211N37
-10510f1974N36L399L402L0L0L0L3j163j162J699J703K68K69K68K72j874j875R88R91q01q01
-10489e5732q02p97K381K381m80m77L24L24J934J938j491J372K444k325J19J19j79j78q95
-10470e0020q94N36N37j878j878R84R83O26O30O26O30l399l394n37n33M55M58r76r73j006
-10450e9023j002j007j002K650K653k09k09J875J878r84r84j688j684j684L085J412j445m010
-10432f1378j148O71O71Q49Q54p31p30p30p27J818J819L87L92j729j729j729L044M557J696
-10413e3873j166j163p79p79O52O56N33N33k329k325l4l3l4l0J722J722J721J726j200j200
-10393e5680l883Q90m92m91j94j90j208j207J655J658j53j49j53j49j53j49j53j49K061K065
$$ plain form
-10373 -56224 -57026 -57823 -60025 -62224 -61564 -60901 -59530 -58155 -58214 -58270 -56809 -55345 -55315 -55282 -56653 -58021 -57961 -57898 -56526 -55151 -53780
-10352 -53780 -52405 -54451 -56496 -55680 -54860 -56161 -57462 -60193 -62921 -62343 -61766 -61188 -60607 -60297 -59988 -59679 -59366 -58021 -56675
-10333 -56675 -58192 -59705 -58717 -57730 -58173 -58613 -59310 -60007 -59273 -58535 -58516 -58498 -58479 -58457 -56340 -54223 -54969 -55710 -56157 -56604 -57052 -57495
-10311 -57495 -58702 -59910 -61117 -62321 -61740 -61158 -60577 -59992 -61054 -62116 -63178 -64236 -64165 -64095 -61162 -58225 -57573 -56921 -56269
-10292 -56269 -55613 -56571 -57529 -58486 -59440 -59306 -59168 -59034 -58896 -55513 -52125 -50173 -48216 -50124 -52028 -51074 -50117 -51697 -53273
-10273 -53273 -54853 -56429 -57394 -58356 -59321 -60282 -61486 -62686 -61028 -59366 -56649 -53929 -54074 -54216 -55822 -57424 -57599 -57771 -55822
-10254 -55822 -53869 -54782 -55692 -56843 -57991 -59142 -60290 -60249 -60204 -58732 -57257 -54711 -52163 -52479 -52792 -50128 -47463 -46230 -44997
-10235 -44997 -46387 -47777 -47736 -47695 -48145 -48596 -51909 -55222 -55196 -55170 -55144 -55118 -56072 -57026 -56549 -56068 -56962 -57857 -53981 -50102 -51011 -51920
$$ packed form
-10373e6224q02p97k202k199O60O63J371J375n9n6J461J464L0L3j371j368O0O3J372J375J371
-10352e3780J375k046k045Q16Q20j301j301k731k728N78N77N78N81L10L09L09L13J345J346
-10333e6675j517j513R88R87m43m40o97o97P34P38J9J8J9K2K117K117p46p41m47m47m48m43
-10311e7495j207j208j207j204N81N82N81N85j062j062j062j058P1P0K933K937O52O52O52
-10292e6269O56r58r58r57r54J34J38J34J38L383L388J952J957j908j904R54R57j580j576
-10273e3273j580j576r65r62r65r61j204j200J658J662K717K720j45j42j606j602j75j72J949
-10254e5822J953r13r10j151j148j151j148M1M5J472J475K546K548l16l13K664K665J233J233
-10235d4997j390j390M1M1m50m51l313l313K6K6K6K6r54r54M77M81q94q95L876L879r09r09
$$ plain form
-10213 -51920 -51399 -50873 -50978 -51082 -50113 -46278 -48253 -53087 -55952 -58818 -61359 -61035 -59459 -57883 -58546 -59206 -58434 -57663 -56209
-10194 -56209 -54752 -54726 -54700 -54846 -54987 -56385 -57778 -57506 -54369 -51056 -50601 -53310 -53154 -54790 -56422 -56806 -57186 -57570 -57950 -58811
-10174 -58811 -59668 -60528 -61386 -57596 -53802 -52874 -51943 -50538 -49129 -50586 -52040 -52841 -53638 -54439 -55237 -58188 -61136 -62179 -58449
-10155 -58449 -56362 -57134 -58863 -60588 -58457 -56321 -54011 -54559 -57167 -59772 -59578 -56519 -56187 -58714 -59455 -60193 -59086 -57976
-10137 -57976 -58777 -56713 -54525 -57104 -56824 -56541 -55159 -53772 -55252 -56727 -53012 -49297 -47311 -48183 -50221 -52259 -56087 -57048
-10119 -57048 -55218 -53389 -51380 -49368 -51235 -53102 -55565 -60886 -62861 -61974 -61445 -60912 -57968 -55024 -52856 -53545 -52613 -51682
-10101 -51682 -50929 -50173 -51358 -52543 -53549 -54551 -55255 -53098 -50940 -51641 -54521 -57402 -56168 -54931 -56530 -58129 -59727 -61322
-10083 -61322 -58956 -56590 -54223 -51853 -51399 -50944 -50489 -50031 -48056 -46081 -47445 -48805 -48783 -48760 -48917 -49070 -47557 -48906 -51030
$$ packed form
-10213e1920N21N26j05j04R69L835j975m834k865k866k541L24J576J576o63o60P72P71J454
-10194e6209J457K6K6j46j41j398j393K72L137L313M55k709J56j636j632l84l80l84l80q61
-10174e8811q57q60q58L790L794R28R31J405J409j457j454q01p97q01p98k951k948j043L730
-10155e8449K087p72j729j725K131K136K310n48k608k605J94L059L32k527p41p38J107J110
-10137e7976q01K064K188k579K80K83J382J387j480j475L715L715J986q72k038k038l828r61
-10119e7048J830J829K009K012j867j867k463n321j975Q87N29N33K944K944K168o89R32R31
-10101e1682P53P56j185j185j006j002p04K157K158p01k880k881J234J237j599j599j598j595
-10083f1322K366K366K367K370M54M55M55M58J975J975j364j360K2K3j57j53J513j349k124
$$ plain form
-10064 -51030 -53150 -52967 -52785 -52602 -52416 -52830 -53243 -53478 -53709 -54719 -52867 -48630 -47251 -47545 -47840 -43484 -39124 -37335 -42224
-10045 -42224 -45146 -45202 -44516 -46692 -46901 -47106 -48730 -47493 -46077 -47519 -50158 -49934 -48160 -46383 -45321 -44255 -44624 -44989 -45269
-10026 -45269 -45544 -45824 -46100 -47586 -49070 -48172 -47270 -47892 -48511 -50743 -50109 -49409 -48704 -46215 -46584 -46986 -47385 -47967 -48544 -49252 -49956
-10005 -49956 -48280 -46599 -46442 -46282 -44516 -45608 -45429 -45246 -45243 -45239 -46312 -47381 -46066 -44751 -43819 -42884 -43200 -43517 -46729 -47076
-9985 -47076 -45693 -44311 -43622 -42928 -43845 -41900 -39332 -36761 -36396 -36031 -37085 -38136 -37756 -37376 -40279 -43178 -45302 -44564 -46312
-9966 -46312 -48060 -47244 -46428 -47072 -47717 -49614 -51510 -53333 -52293 -51074 -52718 -52722 -49863 -48794 -47724 -48086 -48447 -48630 -48812 -50396
-9946 -50396 -49118 -47065 -45011 -44494 -43976 -43458 -42940 -41766 -40592 -39597 -38602 -37301 -38859 -40063 -41263 -44166 -44203 -43469 -42731
-9927 -42731 -40044 -37354 -36396 -38296 -42586 -46871 -44303 -44594 -48075 -48689 -47877 -49923 -51853 -50918 -50344 -49766 -50057 -50344 -52066
$$ packed form
-10064e1030k120J83J82J83J86m14m13k35k31j010J852M237J379k94k95M356M360J789m889
-10045d2224k922n6O86k176k09k05j624J237J416j442k639K24J774J777J062J066l69l65k80
-10026d5269k75k80k76j486j484Q98R02o22o19k232O34P00P05K489l69m02l99n82n77p08p04
-10005d9956J676J681J57J60J766j092J79J83LMj073j069J315J315R32R35l16l17l212l47
-9985d7076J383J382O89O94r17J945K568K571L65L65j054j051L80L80k903k899k124P38j748
-9966d6312j748Q16Q16o44o45j897j896j823J040J219j644mK859J069J070l62l61j83j82j584
-9946e0396J278K053K054N17N18N18N18J174J174R95R95J301j558j204j200k903l7P34P38
-9927d2731K687K690R58j900m290m285K568k91l481o14Q12k046j930R35N74N78k91k87j722
$$ plain form
-9908 -52066 -53784 -54432 -55077 -56977 -58874 -60685 -59634 -56854 -54070 -53199 -52327 -47460 -45451 -44818 -44184 -46115 -48041 -49226
-9890 -49226 -50411 -49807 -52062 -55557 -56191 -54320 -52446 -49770 -47095 -47102 -49968 -52226 -54484 -53582 -52677 -51805 -50933 -51492 -52047 -52744
-9870 -52744 -53437 -54134 -54827 -55285 -55740 -56195 -56649 -53515 -50378 -51537 -52692 -53463 -54231 -54998 -55766 -55509 -55248 -54991 -54730 -53102 -51469
-9849 -51469 -51268 -51067 -53463 -55855 -54913 -53966 -53381 -52792 -54588 -56385 -55106 -53828 -53981 -54134 -54942 -55751 -58945 -62138 -59489
-9830 -59489 -56839 -56575 -56310 -53184 -50057 -50270 -50482 -52099 -53716 -52949 -52181 -50937 -49692 -49878 -50065 -51950 -53836 -53336 -52837
-9811 -52837 -52308 -51779 -51250 -50720 -49234 -47747 -47691 -47635 -46059 -44482 -46245 -48004 -48201 -48399 -46211 -44024 -44758 -45492 -47657 -49819
-9791 -49819 -51302 -52785 -52837 -52889 -53478 -54067 -54656 -55241 -54637 -54033 -53430 -52826 -53743 -54659 -52237 -49811 -49744 -49677 -49610 -49543 -50430 -51317 -52204
-9768 -52204 -53090 -53485 -53880 -51891 -49901 -50564 -51227 -51891 -52554 -52822 -53090 -53359 -53627 -56817 -60007 -59858 -59709 -58248 -56787 -58665
$$ packed form
-9908e2066j718o48o45j900j897j811J051K780K784Q71Q72M867K009O33O34j931j926j185
-9890d9226j185O04k255l495o34J871J874K676K675pk866k258k258R02R05Q72Q72n59n55o97
-9870e2744o93o97o93m58m55m55m54L134L137j159j155p71p68p67p68K57K61K57K61J628J633
-9849e1469K01K01k396k392R42R47N85N89j796j797J279J278j53j53q08q09l194l193K649
-9830e9489K650K64K65L126L127k13k12j617j617P67P68J244J245j86j87j885j886N00M99
-9811e2837N29N29N29N30J486J487N6N6J576J577j763j759j97j98K188K187p34p34k165k162
-9791d9819j483j483n2n2n89n89n89n85O04O04O03O04r17r16K422K426O7O7O7O7q87q87q87
-9768e2204q86l95l95J989J990o63o63o64o63k68k68k69k68l190l190J49J49J461J461j878
$$ plain form
-9748 -58665 -60543 -61885 -63226 -64568 -65909 -64575 -63238 -61903 -60566 -59828 -59086 -58348 -57607 -57853 -58095 -58341 -58583 -58293 -57998
-9729 -57998 -56277 -54551 -52669 -50784 -52241 -53694 -52289 -50881 -53769 -56653 -57886 -59116 -56057 -52994 -49547 -46096 -44080
-9712 -44080 -42060 -43305 -44546 -45787 -47027 -47288 -47545 -47803 -48060 -48962 -49860 -50758 -51656 -54793 -57927 -57722 -57517 -58076 -58632 -59187
-9692 -59187 -59742 -63789 -67832 -69491 -71149 -69174 -67195 -66647 -66099 -64095 -62086 -58647 -55207 -55058 -54905 -54752 -54600 -54957 -55311
-9673 -55311 -55665 -56019 -58002 -59981 -61959 -63938 -63416 -62891 -62366 -61840 -60152 -58460 -56768 -55077 -56370 -57659 -58948 -60238
-9655 -60238 -60443 -60644 -60845 -61046 -60655 -60260 -59865 -59470 -58360 -57245 -56131 -55017 -56172 -57324 -58475 -59627 -58986 -58341 -57696 -57052
-9635 -57052 -57901 -58747 -61024 -63301 -61706 -60107 -62802 -65496 -67299 -69099 -68514 -67929 -67370 -66808 -67676 -68544 -67866 -67184 -66502 -65820
-9615 -65820 -65131 -64441 -63752 -63062 -62969 -62876 -62783 -62690 -62462 -62235 -62008 -61781 -62149 -62518 -62887 -63256 -63834 -64411 -64989 -65567 -64356 -63144 -61933
$$ packed form
-9748e8665j878j342j341j342j341J334J337J335J337P38P42P38P41k46k42k46k42K90K95
-9729e7998J721J726J882J885j457j453J405J408k888k884j233j230L059L063L447L451K016
-9712d4080K020j245j241j241j240k61k57k58k57r02q98q98q98l137l134K05K05n59n56n55
-9692e9187n55m047m043j659j658J975J979N48N48K004K009L439L440J49J53J53J52l57l54
-9673e5311l54l54j983j979j978j979N22N25N25N26J688J692J692J691j293j289j289j290
-9655f0238k05k01k01k01L91L95L95L95J110J115J114J114j155j152j151j152O41O45O45O44
-9635e7052q49q46k277k277J595J599k695k694j803j800N85N85N59N62q68q68O78O82O82O82
-9615f5820O89O90O89O90R3R3R3R3K28K27K27K27l68l69l69l69n78n77n78n78J211J212J211
$$ plain form
-9592 -61933 -60722 -62030 -63338 -64646 -65954 -62939 -59925 -59295 -58665 -59209 -59750 -60294 -60834 -60364 -59891 -59422 -58948 -57599 -56247
-9573 -56247 -57283 -58315 -57890 -57462 -59422 -61378 -60174 -58967 -56332 -53694 -50225 -46752 -49483 -52211 -55278 -58341 -59977
-9556 -59977 -61609 -61456 -61300 -61147 -60991 -60763 -60532 -60301 -60070 -59843 -59612 -59381 -59150 -59347 -59541 -59735 -59928 -58635 -57339 -58427 -59515
-9535 -59515 -58091 -56668 -58583 -60499 -61371 -62243 -63115 -63987 -65216 -66446 -65291 -64136 -63010 -61885 -60759 -59634 -60305 -60976
-9517 -60976 -61646 -62313 -62925 -63536 -61762 -59984 -58784 -57585 -58770 -59951 -59645 -59340 -59034 -58725 -59299 -59873 -60446 -61020 -59001 -56981
-9497 -56981 -54961 -52941 -53105 -53269 -55818 -58367 -61989 -65611 -66848 -68086 -66018 -63946 -60268 -59448 -57409 -55367 -56668 -57965
-9479 -57965 -58028 -55226 -54812 -57257 -56932 -56604 -56459 -56310 -55226 -54138 -55438 -56735 -57648 -58557 -58039 -57517 -56277 -55032 -56176 -57316
-9459 -57316 -59504 -61687 -60536 -59381 -58602 -57819 -57219 -56616 -52677 -51596 -53083 -51704 -52647 -56448 -59895 -60476 -62343 -61345 -61781
$$ packed form
-9592f1933J211j308j308j308j308L015L014O30O30n44n41n44n40M70M73M69M74J349J352
-9573e6247j036j032M25M28j960j956J204J207K635K638L469L473k731k728l067l063j636
-9556e9977j632J53J56J53J56K28K31K31K31K27K31K31K31j97j94j94j93J293J296j088j088
-9535e9515J424J423j915j916q72q72q72q72j229j230J155J155J126J125J126J125o71o71
-9517f0976o70o67o12o11J774J778J200J199j185j181L06L05L06L09n74n74n73n74K019K020
-9497e6981K020K020j64j64k549k549l622l622j237j238K068K072L678Q20K039K042j301j297
-9479e7965o3K802M14k445L25L28J45J49J084J088j300j297r13r09N18N22J240J245j144j140
-9459e7316k188k183J151J155P79P83O00O03L939J081j487J379r43l801l447n81j867R98m36
$$ plain form
-9440 -61781 -62213 -60923 -59630 -58341 -57048 -57547 -58043 -58542 -59038 -59030 -59019 -59012 -59001 -59619 -60234 -62462 -61825 -59127 -56426 -54026 -56392
-9419 -56392 -60968 -62679 -62008 -61333 -60677 -60018 -59362 -58702 -57570 -56433 -55300 -54164 -55785 -57402 -57473 -54678 -55315 -58811 -57957
-9400 -57957 -57100 -55777 -51589 -49670 -52517 -54533 -56545 -52837 -49125 -48138 -50012 -53616 -57216 -59358 -61501 -63823 -63279 -62343
-9382 -62343 -61408 -60115 -58818 -57495 -53310 -50735 -48157 -43998 -39839 -32997 -30922 -32010 -33098 -33232 -38132 -43394 -48656
-9365 -48656 -52487 -53452 -52155 -50858 -47773 -47545 -51689 -55833 -57294 -58755 -56817 -54879 -52584 -56012 -54283 -52554 -54044
-9348 -54044 -55535 -54760 -53985 -53210 -52435 -52945 -53456 -53966 -54477 -53556 -52636 -48496 -50079 -49308 -48537 -48123 -47709 -50992 -54275 -57558
-9328 -57558 -60841 -59127 -57409 -55692 -53974 -57387 -60797 -61345 -61892 -61415 -60935 -57592 -54249 -52013 -49774 -52304 -54834 -53560
-9310 -53560 -52282 -52435 -52587 -54622 -56653 -55822 -54991 -54506 -54018 -56392 -58766 -57566 -56362 -53728 -51093 -52084 -53076 -52636 -52196
$$ packed form
-9440f1781m32J290J293J289J293m99m96m99m96QJ1PJ1o18o15k228O37K698K701K400k366
-9419e6392m576j711O71O75O56O59O56O60J132J137J133J136j621j617p1K795o37l496Q54
-9400e7957Q57J323M188J919k847k016k012L708L712R87j874l604l600k142k143k322N44R36
-9382f2343R35J293J297J323M185K575K578M159M159O842K075j088j088j34m900n262n262
-9365d8656l831r65J297J297L085K28m144m144j461j461J938J938K295l428J729J729j490
-9348e4044j491P75P75P75P75n10n11n10n11R21R20M140j583P71P71M14M14l283l283l283
-9328e7558l283J714J718J717J718l413l410n48n47M77M80L343L343K236K239k530k530J274
-9310e3560J278j53j52k035k031Q31Q31M85M88k374k374J200J204K634K635r91r92M40M40
$$ plain form
-9291 -52196 -53307 -54417 -55528 -56638 -56347 -56057 -55766 -55475 -56973 -58471 -59969 -61468 -60473 -59478 -58483 -57488 -59056 -60625 -62194
-9272 -62194 -63763 -63856 -63949 -61181 -58412 -56239 -54067 -54756 -55446 -54626 -53802 -52982 -52159 -54559 -56955 -59355 -61751 -63748 -65742
-9253 -65742 -64877 -64009 -62727 -61441 -60160 -58874 -60126 -61374 -60659 -62802 -64113 -59697 -55703 -48842 -43670 -41356 -40536 -45436
-9235 -45436 -51801 -55300 -56001 -56698 -56053 -55405 -56191 -56973 -58207 -59437 -60670 -61900 -60316 -58729 -55535 -55200 -57193 -59183 -58494
-9216 -58494 -57801 -61427 -65049 -63606 -59299 -57439 -55576 -54969 -54357 -54421 -54480 -55796 -57108 -59466 -58960 -57204 -55446 -55352 -55255 -54805
-9196 -54805 -57212 -57655 -55233 -53172 -51108 -51283 -51455 -51630 -51801 -53348 -54890 -57510 -62988 -65921 -65988 -66416 -66841 -66018 -65190 -64546
-9176 -64546 -61035 -58915 -56791 -59083 -61371 -59817 -55397 -54022 -52643 -54186 -55725 -55833 -55941 -59720 -63495 -64408 -65321 -65008
-9158 -65008 -64691 -65805 -66919 -64639 -62354 -64184 -61244 -60361 -59474 -60078 -57819 -53925 -52889 -51496 -52964 -54950 -59794 -60227
$$ packed form
-9291e2196j111j110j111j110K91K90K91K91j498j498j498j499R95R95R95R95j568j569j569
-9272f2194j569r3r3K768K769K173K172o89o90Q20Q24Q20Q23k400k396k400k396j997j994
-9253f5742Q65Q68J282J286J281J286j252j248P15k143j311M416L994O861N172K314Q20m900
-9235d5436o365l499p01o97O45O48p86p82j234j230j233j230J584J587L194L35j993j990O89
-9216e8494O93l626l622J443M307J860J863O07O12o4n9j316j312k358N06J756J758R4R7M50
-9196e4805k407m43K422K061K064j75j72j75j71j547j542k620n478k933o7m28m25Q23Q28O44
-9176f4546L511K120K124k292k288J554M420J375J379j543j539j08j08l779l775r13r13L13
-9158f5008L17j114j114K280K285j830K940Q83Q87o04K259L894J036J393j468j986m844m33
$$ plain form
-9140 -60227 -57797 -54834 -54730 -57309 -57026 -57558 -58091 -58445 -58799 -58766 -58732 -55837 -52941 -50851 -48760 -48101 -47441 -46841 -46241 -47072 -47903
-9119 -47903 -50705 -53504 -53444 -53381 -53053 -52722 -53348 -56832 -61065 -60525 -59988 -59448 -57659 -55867 -56940 -58009 -53366 -48719 -50750
-9100 -50750 -52781 -51417 -50050 -51544 -53038 -53955 -54868 -55781 -56694 -56716 -56735 -56754 -56772 -55867 -54961 -54056 -53146 -53970 -54793 -55617 -56437 -54890
-9078 -54890 -53344 -54659 -55971 -56839 -57708 -57681 -54790 -51145 -53221 -55121 -54156 -53016 -54734 -53236 -51734 -49804 -47870 -45939
-9060 -45939 -44005 -45533 -47057 -50016 -52971 -54283 -55591 -52133 -48671 -45243 -41810 -38382 -34950 -30896 -26838 -22783 -18725
-9043 -18725 -13359 -7989 -5306 -2619 5008 15498 30817 51860 83576 132464 206751 305841 416528 527214
-9029 527214 625380 698743 720114 674708 578740 454154 327309 221451 145167 93686 58303 36276 19377
-9016 19377 8201 -186 -8574 -13743 -18911 -21337 -23763 -26189 -28615 -29577 -30538 -31499 -32457 -33329 -34201 -33642 -33079 -33474 -33869
$$ packed form
-9140f0227K430K963J04k579K83n32n33l54l54L3L4K895K896K090K091O59O60O00O00q31q31
-9119d7903k802k799O0O3L28L31o26l484m233N40N37N40J789J792j073j069M643M647k031
-9100e0750k031J364J367j494j494r17r13r13r13k2j9j9j8R05R06R05R10q24q23q24q20J547
-9078e4890J546j315j312q68q69K7K891L645k076j900R65J140j718J498J502J930J934J931
-9060d5939J934j528j524k959k955j312j308L458L462L428L433L428L432M054M058M055M058
-9043a8725N366N370K683K687P627J0490J5319K1043L1716M8888P4287R9090J10687J10686
-9029E27214R8166P3363K1371m5406r5968j24586j26845j05858p6284n1481l5383k2027j6899
-9016A9377j1176q387q388n169n168k426k426k426k426r62r61r61r58q72q72N59N63l95l95
$$ plain form
-8997 -33869 -35159 -39306 -46826 -48622 -49047 -49468 -48447 -47426 -49267 -51104 -50978 -50851 -50724 -50594 -48022 -45451 -47650 -49845
-8979 -49845 -48049 -46252 -44456 -42656 -44687 -46714 -48745 -50773 -50150 -49524 -46040 -42552 -36534 -30512 -23420 -16325 -4017
-8962 -4017 2571 6830 5369 3525 -1177 -9401 -17622 -25041 -32457 -37015 -41568 -43994 -46416 -47411 -48403 -48235 -48063 -49327
-8944 -49327 -50586 -50869 -51149 -52863 -54574 -53008 -51440 -49517 -47590 -49662 -46006 -46647 -50147 -52934 -52856 -51708 -50556 -49662
-8926 -49662 -48764 -47870 -46972 -47031 -47087 -47147 -47203 -50124 -53042 -53102 -53158 -54648 -56135 -54764 -53389 -53355 -53318 -53284 -53247 -51782 -50314 -48850 -47381
-8903 -47381 -48242 -49099 -47098 -45093 -43510 -41922 -43200 -44475 -47087 -49696 -49446 -49193 -49330 -49465 -51033 -52599 -52200 -51797 -51399
-8884 -51399 -50996 -53191 -55382 -52807 -50229 -46834 -43439 -39686 -41658 -42019 -42381 -43100 -43819 -45910 -48000 -47229 -46457 -44255 -42053
-8865 -42053 -44620 -47188 -48667 -50147 -51447 -52748 -54018 -52427 -50478 -54253 -59116 -61117 -58408 -55699 -56865 -58032 -56515
$$ packed form
-8997c3869j290m147p520j796m25m21J021J021j841j837J26J27J27J30K572K571k199k195
-8979d9845J796J797J796J800k031k027k031k028O23O26L484L488O018O022P092P095J2308
-8962d017O588M259j461j844m702q224q221p419p416m558m553k426k422r95r92J68J72j264
-8944d9327j259k83k80j714j711J566J568J923J927k072L656o41l500k787P8J148J152Q94
-8926d9662Q98Q94Q98n9n6o0n6k921k918o0n6j490j487J371J375L4L7L4L7J465J468J464J469
-8903d7381q61q57K001K005J583J588j278j275k612k609K50K53j37j35j568j566L99M03L98
-8884e1399M03k195k191K575K578L395L395L753j972l61l62p19p19k091k090P71P72K202K202
-8865d2053k567k568j479j480j300j301j270J591J949l775m863k001K709K709j166j167J517
$$ plain form
-8848 -56515 -54998 -53239 -54343 -57830 -58453 -55829 -53206 -53743 -54275 -54201 -54126 -52800 -51469 -47102 -45597 -47728 -49856 -53113 -56370
-8829 -56370 -54380 -52386 -53467 -54547 -55628 -56705 -55460 -54216 -55177 -56135 -57096 -55196 -54547 -56757 -59466 -59314 -60950 -62585
-8811 -62585 -61956 -61326 -60696 -60066 -59317 -58568 -57462 -59217 -61568 -61058 -60905 -60752 -62433 -64113 -65794 -67475 -64922 -62369 -60592
-8792 -60592 -61676 -60540 -59403 -58624 -57845 -57544 -60104 -62485 -64866 -63286 -61702 -60119 -58535 -55196 -51853 -52803 -53754 -56005
-8774 -56005 -58252 -57816 -54518 -56113 -57704 -59116 -60528 -60461 -60391 -58710 -59891 -63610 -67325 -67881 -68436 -67877 -67314 -66752 -66189 -64020
-8754 -64020 -61848 -59675 -57503 -58281 -59060 -58408 -57752 -57070 -56388 -55706 -55021 -54980 -54939 -51917 -53661 -53769 -49107 -48857 -48604 -49561 -50519
-8733 -50519 -53087 -52789 -51987 -51186 -51637 -52084 -52997 -53910 -55598 -60145 -61475 -62805 -64315 -65820 -63554 -61289 -59023 -56757 -56221
-8714 -56221 -55684 -53895 -56877 -59783 -62690 -61602 -60514 -61631 -62749 -58799 -59619 -58009 -56400 -52703 -49006 -47903 -46800
$$ packed form
-8848e6515J517J759j104l487o23K624K623n37n32P4P5J326J331M367J505k131k128l257l257
-8829e6370J990J994j081j080j081j077J245J244r61r58r61J900O49k210k709J52j636j635
-8811f2585O29O30O30O30P49P49J106j755k351N10J53J53j681j680j681j681K553K553J777
-8792f0592j084J136J137P79P79L01k560k381k381J580J584J583J584L339L343r50r51k251
-8774e6005k247M36L298j595j591j412j412O7P0J681j181l719l715n56n55N59N63N62N63K169
-8754f4020K172K173K172p78p79O52O56O82O82O82O85M1M1L022j744j08M662K50K53r57r58
-8733e0519k568K98Q02Q01m51m47r13r13j688m547j330j330j510j505K266K265K266K266N36
-8714e6221N37J789k982k906k907J088J088j117j118L950q20J610J609L697L697J103J103
$$ plain form
-8697 -46800 -45697 -44594 -44982 -45369 -47188 -49006 -53120 -57234 -58009 -58784 -55498 -52207 -51302 -50396 -50627 -50855 -49651 -48447 -48649
-8678 -48649 -48846 -50474 -52103 -50814 -49521 -45842 -42164 -31499 -20831 -15409 -9987 -11425 -12860 -15725 -18591 -25589 -32584
-8661 -32584 -38147 -43711 -49040 -54365 -56351 -58337 -54287 -50236 -49524 -48812 -50038 -51264 -52490 -53716 -52125 -50534 -50374 -50214
-8643 -50214 -51723 -53232 -54264 -52435 -48615 -49565 -47654 -45742 -48928 -52114 -51961 -51809 -51581 -51354 -52558 -53761 -53534 -53307 -55464
-8624 -55464 -57622 -61441 -65261 -66696 -68130 -67210 -66290 -65369 -64449 -63454 -62459 -59079 -55699 -55092 -54484 -49584 -44684 -44918 -45153
-8605 -45153 -46819 -48485 -49435 -50385 -47996 -45608 -46692 -47777 -53154 -58531 -60718 -62906 -60622 -58337 -58356 -55513 -51060 -52327
-8587 -52327 -51242 -50158 -49431 -48701 -46327 -43953 -41579 -39202 -38498 -37793 -37805 -32088 -25422 -24479 -26636 -28790 -29338 -29886 -30434
-8568 -30434 -30978 -29297 -27616 -28798 -29975 -31991 -34007 -33161 -32312 -25887 -19459 -13031 -6603 1699 10005 9725 9446 9699
$$ packed form
-8697d6800J103J103l88l87j819j818m114m114p75p75L286L291R05R06k31k28J204J204k02
-8678d8649j97j628j629J289J293L679L678J0665J0668N422N422j438j435k865k866o998o995
-8661c2584n563n564n329n325j986j986M050M051P12P12j226j226j226j226J591J591J60J60
-8643e0214j509j509j032J829L820r50J911J912l186l186J53J52K28K27j204j203K27K27k157
-8624e5464k158l819l820j435j434R20R20R21R20R95R95L380L380O07O08M900M900k34k35
-8605d5153j666j666r50r50K389K388j084j085n377n377k187k188K284K285j9K843M453j267
-8587e2327J085J084P27P30K374K374K374K377P04P05j2N717O666R43k157k154n48n48n48
-8568c0434n44J681J681j182j177k016k016Q46Q49O425O428O428O428Q302Q306k80k79K53
$$ plain form
-8550 9699 9956 11645 13333 9502 5675 6618 7560 10221 12885 20320 27754 31846 35941 37174 38408 39817 41229 45503
-8532 45503 49777 56552 63330 65339 67348 70500 73653 84199 104288 130753 162942 194356 228636 268263 317430
-8517 317430 375719 434012 490304 546596 600503 660137 736671 849456 1019718 1287288 1702333 2355871
-8505 2355871 3377881 4962739 7257289 10122313 12923900 14838294 15089674 13553309 10961373 8096605
-8495 8096605 5682332 3964459 2831609 2101336 1627681 1308570 1090103 930782 813168 727988 668566
-8484 668566 630132 599210 562564 513874 455644 390349 325054 277348 246814 225908 207865 191252 168916
-8471 168916 144165 122276 105574 91733 80606 72341 65686 56168 46427 36690 28205 19720 12006 4296 1356
-8456 1356 -1583 -3901 -6215 -8529 -10844 -18051 -25254 -27687 -30121 -30106 -30087 -29890 -29692 -27650 -22742 -16761 -15550 -17950 -20346
$$ packed form
-8550I699K57J689J688l831l827R43R42K661K664P435P434M092M095J233J234J409J412M274
-8532D5503M274O775O778K009K009L152L153J0546K0089K6465L2189L1414L4280L9627M9167
-8517C17430N8289N8293N6292N6292N3907N9634P6534J12785J70262K67570M15045O53538
-8505B355871J022010J584858K294550K865024K801587J914394K51380j536365k591936k864768
-8495H096605k414273j717873j132850p30273m73655l19111k18467j59321j17614q5180n9422
-8484F68566l8434l0922l6646m8690n8230o5295o5295m7706l0534k0906j8043j6613k2336
-8471A68916k4751k1889j6702j3841j1127q265o655r518r741r737q485q485p714p710k940
-8456A356k939k318k314k314k315p207p203k433k434J5J9J97J98K042M908N981J211k400k396
$$ plain form
-8437 -20346 -23040 -25735 -29208 -32677 -36146 -39616 -41423 -43227 -40264 -37298 -37764 -38226 -41553 -44877 -45984 -47087 -49625
-8420 -49625 -52159 -51030 -49897 -45906 -41911 -39649 -37383 -35121 -32856 -35602 -38345 -36321 -34294 -34372 -34447 -34525 -34600 -36974 -39344
-8401 -39344 -43148 -46949 -49584 -52218 -50083 -47948 -46260 -44572 -42884 -41196 -38330 -35464 -39276 -43089 -45410 -47732 -47191
-8384 -47191 -46651 -48388 -50120 -48995 -47866 -47009 -46148 -48153 -50154 -48298 -46439 -46014 -45585 -47188 -48786 -48958 -49125 -47318 -45511
-8365 -45511 -48473 -51436 -49658 -47881 -47534 -47188 -47780 -48373 -47534 -46696 -47527 -48358 -49189 -50020 -49547 -49070 -51458 -53843 -53370 -52893
-8345 -52893 -53851 -54805 -53005 -51201 -47970 -44736 -43681 -42623 -44609 -46592 -44475 -45216 -45127 -47896 -50460 -53020 -52423 -51823 -52651
-8326 -52651 -53474 -52871 -52263 -53806 -55345 -59094 -62839 -63800 -61896 -56657 -51414 -46621 -46595 -44069 -41538 -38192 -37704 -38949 -40189
-8307 -40189 -44087 -47981 -50329 -49811 -48183 -49416 -51067 -52714 -54395 -53213 -53642 -54067 -51000 -47933 -43554 -36310 -33273 -36914
$$ packed form
-8437b0346k694k695l473l469l469l470j807j804K963K966m66m62l327l324j107j103k538
-8420d9625k534J129J133L991L995K262K266K262K265k746k743K024K027p8p5p8p5k374k370
-8401c9344l804l801k635k634K135K135J688J688J688J688K866K866l812l813k321k322N41
-8384d7191N40j737j732J125J129Q57Q61k005k001J856J859M25M29j603j598j72j67J807J807
-8365d5511k962k963J778J777L47L46n92n93Q39Q38q31q31q31q31M73M77k388k385M73M77
-8345e2893r58r54J800J804L231L234J055J058j986j983K117p41Q9k769k564k560N97O00q28
-8326e2651q23O03O08j543j539l749l745r61J904N239N243M793K6K526K531L346M88j245j240
-8307d0189l898l894k348N18J628j233j651j647j681J182m29m25L067L067M379P244L037l641
$$ plain form
-8289 -36914 -38050 -39183 -36862 -34540 -32994 -34305 -35859 -37413 -37715 -38013 -38226 -38438 -37100 -32897 -32036 -34037 -37410 -40778
-8271 -40778 -41904 -40163 -35744 -31320 -28213 -25101 -20383 -18524 -15953 -13378 -10985 -8589 -10102 -11611 -12945 -14276 -14037
-8254 -14037 -10933 -3540 994 4303 7616 10389 16027 21810 24736 25809 24024 26886 29751 33865 35121 34570 31156
-8237 31156 28101 27907 39459 59597 81284 100111 115374 135408 165875 196343 230566 271468 318630 365792
-8223 365792 414579 463365 519307 595282 714841 907857 1219165 1720313 2535363 3830262 5887384 8897524
-8211 8897524 12124574 13351145 11414342 8234513 5540939 3664923 2502235 1794596 1346256 1051508
-8201 1051508 851438 711473 616579 551261 501085 463313 439609 418771 389105 339409 282971 231308 188107
-8188 188107 155404 137185 129464 124243 114256 96380 75646 58367 43953 33142 29014 27206 25403 22090 14011
$$ packed form
-8289c6914j136j133K321K322J546j311j554j554l02k98k13k12J338M203Q61k001l373l368
-8271d0778j126J741M419M424L107L112M718J859K571K575K393K396j513j509j334j331K39
-8254a4037L104P393M534L309L313K773N638N783K926J073j785K862K865M114J256n51l414
-8237C1156l055j94J1552K0138K1687J8827J5263K0034L0467L0468L4223M0902M7162M7162
-8223C65792M8787M8786N5942P5975J19559J93016L11308N01148Q15050J294899K057122L010140
-8211H897524L227050J226571j936803l179829k693574j876016j162688p07639m48340k94748
-8201A051508k00070j39965r4894o5318n0176l7772k3704k0838k9666m9696n6438n1663m3201
-8188A88107l2703j8219p721n221r987j7876k0734j7279j4414j0811m128j808j803l313q079
$$ plain form
-8173 14011 7005 2861 -2060 -6979 -11719 -16459 -17477 -18490 -19504 -23379 -27855 -35189 -40316 -42582 -44464 -46346 -49658
-8156 -49658 -50106 -49453 -48801 -46241 -40815 -37003 -33191 -32539 -36653 -41665 -43815 -42627 -41434 -37506 -33575 -30303 -31797 -33296
-8138 -33296 -34790 -36586 -38378 -38833 -39284 -39739 -40189 -44162 -48131 -48645 -46293 -40283 -37134 -36787 -39303 -40625 -41948 -43629
-8120 -43629 -42448 -38598 -34749 -34059 -33370 -34887 -36403 -40186 -48738 -55945 -58378 -60160 -61937 -61721 -56731 -52997 -54029 -53195
-8102 -53195 -49494 -47706 -45913 -43439 -40961 -39917 -38870 -37812 -36754 -39034 -41315 -44460 -47605 -48186 -48768 -48999 -46368 -42843
-8084 -42843 -44087 -43245 -45265 -47583 -47039 -48477 -49915 -46882 -43845 -39470 -35095 -36921 -38744 -38677 -38609 -39973 -41333 -40014
-8066 -40014 -38695 -39761 -40823 -42627 -44426 -44795 -45164 -45269 -45369 -45470 -45570 -41263 -36951 -37886 -38822 -36511 -34197 -33314 -32431
-8047 -32431 -34808 -37186 -38132 -39075 -40856 -42638 -41080 -39519 -36873 -34227 -33012 -31794 -34633 -37473 -37927 -38378 -39701 -41024
$$ packed form
-8173A4011p006m144m921m919m740m740j018j013j014l875m476p334n127k266j882j882l312
-8156d9658m48O53O52K560N426L812L812O52m114n012k150J188J193L928L931L272j494j499
-8138c3296j494j796j792m55m51m55m50l973l969n14K352O010L149L47k516j322j323j681
-8120d3629J181L850L849O90O89j517j516l783q552p207k433j782j777K16M990L734j032Q34
-8102e3195L701J788J793K474K478J044J047J058J058k280k281l145l145n81n82k31K631L525
-8084d2843j244Q42k020k318N44j438j438L033L037M375M375j826j823O7O8j364j360J319
-8066d0014J319j066j062j804j799l69l69j05j00j01j00M307M312r35r36K311K314Q83Q83
-8047c2431k377k378r46r43j781j782J558J561K646K646J215J218k839k840m54m51j323j323
$$ plain form
-8029 -41024 -37875 -29953 -24479 -19005 -10847 -2686 3800 10288 13258 11462 5787 111 -9200 -18509 -26737 -34961 -39549
-8012 -39549 -44136 -46819 -44728 -41982 -39235 -39668 -40096 -42910 -45723 -44665 -43603 -45880 -48157 -46472 -44784 -45481 -46178 -45686
-7994 -45686 -45190 -47080 -48969 -49357 -49740 -53463 -57186 -60286 -63383 -62187 -60991 -59012 -57033 -55054 -53072 -55207 -57342 -56139
-7976 -56139 -54931 -53236 -51540 -49845 -48145 -47493 -46841 -47620 -48395 -49565 -50732 -48559 -46387 -45708 -45026 -45775 -49386 -53716 -53273
-7957 -53273 -48835 -47259 -47236 -47210 -48794 -50378 -52867 -55352 -54503 -53649 -53754 -53854 -55390 -56921 -53925 -50925 -47631 -49103 -50877
-7938 -50877 -52647 -51380 -50109 -50124 -50139 -47769 -45399 -43983 -42567 -43536 -44505 -46875 -49245 -49230 -49215 -48514 -47814 -45682 -43551 -47173
-7918 -47173 -50791 -54410 -58028 -56433 -54834 -53236 -51637 -50899 -50158 -49416 -48675 -47937 -47195 -46454 -45712 -49036 -52356 -55677 -58997
-7899 -58997 -59101 -59202 -59302 -59403 -59172 -58937 -58702 -58468 -55226 -51980 -48734 -45488 -47467 -49446 -47132 -44814 -47270 -49725 -50750
$$ packed form
-8029d1024L149P922N474N474Q158Q161O486O488K970j796n675n676r311r309q228q224m588
-8012c9549m587k683K091K746K747m33m28k814k813J058J062k277k277J685J688o97o97M92
-7994d5686M96j890j889l88l83l723l723l100l097J196J196J979J979J979J982k135k135J203
-7976e6139J208J695J696J695J700O52O52p79p75j170j167K173K172O79O82p49l611m330M43
-7957e3273M438J576K3K6j584j584k489k485Q49Q54j05j00j536j531K996L000L294j472j774
-7938e0877j770J267J271j5j5K370K370J416J416r69r69k370k370J5J5P01P00K132K131l622
-7918d7173l618l619l618J595J599J598J599P38P41P42P41P38P42P41P42l324l320l321l320
-7899e8997j04j01j00j01K31K35K35K34L242L246L246L246j979j979K314K318k456k455j025
$$ plain form
-7880 -50750 -51771 -50799 -49826 -48853 -47877 -48485 -49092 -50176 -46487 -42545 -41464 -44378 -44426 -44956 -45485 -44404 -43320 -44743 -46167
-7861 -46167 -49021 -51872 -53236 -54600 -55964 -57324 -57510 -57693 -57879 -58062 -55744 -53422 -51104 -48783 -50534 -52282 -54033 -55781
-7843 -55781 -56459 -57134 -57812 -58486 -59433 -60376 -61322 -62265 -61482 -60696 -57529 -54357 -53903 -53444 -55375 -57301 -55714 -54123 -53966 -53806
-7823 -53806 -53608 -53407 -52733 -54916 -58416 -57141 -52233 -47322 -42504 -40543 -39839 -39131 -41706 -44277 -46852 -49424 -49912 -50396 -50884
-7804 -50884 -51369 -52930 -54488 -56049 -57607 -56955 -56299 -55468 -54633 -55680 -53862 -52047 -53090 -54253 -55416 -58188 -60957 -59437
-7786 -59437 -57912 -59075 -60234 -61672 -60245 -59001 -57752 -55941 -54126 -53389 -55509 -58050 -57730 -54428 -51123 -51101 -51074 -51052 -51026
-7767 -51026 -53195 -55360 -55740 -58978 -61386 -60927 -60473 -62876 -63521 -61300 -58006 -54711 -53448 -52181 -50914 -49647 -50724 -51797
-7749 -51797 -52871 -53944 -55319 -56690 -54901 -53113 -49569 -41251 -34007 -29625 -24471 -19314 -17376 -15438 -15144 -17708 -22955
$$ packed form
-7880e0750j021R72R73R73R76o08o07j084L689L942J081k914m8n30n29J081J084j423j424
-7861d6167k854k851j364j364j364j360j86j83j86j83K318K322K318K321j751j748j751j748
-7843e5781o78o75o78o74r47r43r46r43P83P86L167L172M54M59j931j926J587J591J57J60
-7823e3806J98K01O74k183l500J275M908M911M818J961P04P08k575k571k575k572m88m84m88
-7804e0884m85j561j558j561j558O52O56Q31Q35j047J818J815j043j163j163k772k769J520
-7786e9437J525j163j159j438J427J244J249J811J815P37k120k541L20L302L305K2K7K2K6
-7767e1026k169k165l80l238k408M59M54k403o45K221L294L295J263J267J267J267j077j073
-7749e1797j074j073j375j371J789J788L544Q318P244M382N154N157J938J938K94k564n247
$$ plain form
-7732 -22955 -25340 -29278 -30352 -31425 -32498 -35338 -38177 -42448 -46714 -49316 -51917 -54518 -57115 -59746 -62377 -63934 -62626
-7715 -62626 -59444 -59120 -59873 -60622 -62872 -65123 -65645 -66163 -68861 -66789 -63107 -62284 -58975 -58527 -59511 -60491 -60253 -60010 -59593 -62034
-7695 -62034 -60063 -58088 -58855 -59623 -60841 -57286 -54805 -55185 -54167 -53146 -53735 -57186 -56407 -58486 -60745 -60141 -61318 -62492
-7677 -62492 -57108 -54585 -53437 -52286 -56083 -59880 -57771 -55658 -53545 -51432 -49979 -48522 -45455 -45250 -43853 -42451 -42302
-7660 -42302 -45015 -46510 -45138 -45377 -48477 -52960 -57439 -57327 -57216 -54126 -51033 -49371 -47709 -45466 -43219 -42224 -44091 -45187
-7642 -45187 -46278 -45939 -45600 -47545 -46625 -47314 -48004 -47147 -46286 -43994 -41702 -42228 -42753 -46141 -49524 -54044 -58565 -60402 -62235
-7623 -62235 -62731 -66088 -68015 -67076 -64203 -61330 -59709 -58084 -57085 -56087 -53657 -51223 -52580 -53936 -55293 -56645 -55244 -53843
-7605 -53843 -53992 -49368 -45313 -46029 -48414 -47933 -47646 -50221 -52617 -52148 -50907 -49666 -49498 -52189 -50515 -48842 -45738 -45492 -45846
$$ packed form
-7732b2955k385l938j074j073j073k840k839m271m266k602k601k601k597k631k631j557J308
-7715f2626L182L24p53p49k250k251n22n18k698K072L682Q23L309M48r84r80K38K43M17k441
-7695f2034J971J975p67p68j218L555K481l80J018J021n89l451P79k079k259O04j177j174
-7677f2492N384K523J148J151l797l797K109K113K113K113J453J457L067K05J397J402J49
-7660d2302k713j495J372k39l100m483m479J12J11L090L093J662J662K243K247R95j867j096
-7642d5187j091L39L39j945R20o89o90Q57Q61K292K292n26n25l388l383m520m521j837j833
-7623f2235m96l357j927R39K873K873J621J625R99R98K430K434j357j356j357j352J401J401
-7605e3843j49M624M055p16k385M81K87k575k396M69J241J241J68k691J674J673L104K46l54
$$ plain form
-7586 -45846 -46200 -46912 -47620 -47244 -49729 -50605 -51477 -53575 -55673 -53001 -50325 -51976 -53627 -55457 -54421 -53895 -53370 -50877 -51242
-7567 -51242 -52289 -50471 -50620 -50769 -51876 -55841 -58196 -60551 -60748 -60942 -62925 -62045 -59142 -59097 -61855 -64613 -65593 -63707 -60569
-7548 -60569 -57432 -54954 -52472 -49990 -47508 -47072 -46632 -44583 -45395 -42873 -40346 -39787 -36366 -33068 -32632 -32017 -28541 -25123
-7530 -25123 -21706 -14950 -5332 7817 20968 41452 64799 89874 117811 147895 182748 217062 244697 264343
-7516 264343 275403 276506 267115 249795 223888 192780 161672 130205 98739 70552 45227 24195 7933 -1270
-7502 -1270 -10475 -16519 -22563 -26312 -30061 -32558 -32192 -32438 -32684 -34361 -36038 -38311 -43446 -47150 -47993 -49763 -51533 -52051
-7484 -52051 -49707 -46469 -46092 -48876 -51659 -53743 -58688 -62023 -62496 -64818 -64277 -63379 -65343 -68089 -67970 -69818 -68805 -63711
-7466 -63711 -58613 -56198 -53784 -51298 -48809 -49181 -49554 -51659 -53761 -54074 -57249 -58866 -57618 -57860 -58103 -57931 -52986 -48220
$$ packed form
-7586d5846l54p12p08L76k485q76q72k098k098K672K676j651j651j830J036N26N25K493l65
-7567e1242j047J818j49j49j107l965k355k355j97j94j983Q80K903M5k758k758r80J886L138
-7548f0569L137K478K482K482K482M36M40K049q12K522K527N59L421L298M36O15L476L418
-7530b5123L417O756R618J3149J3151K0484K3347K5075K7937L0084L4853L4314K7635J9646
-7516B64343J1060J103r391j7320k5907l1108l1108l1467l1466k8187k5325k1032j6262r203
-7502a270r205o044o044l749l749k497L66k46k46j677j677k273n135l704q43j770j770n18
-7484e2051K344L238L77k784k783k084m945l335m73k322N41Q98j964k746J19j848J013N094
-7466f3711N098K415K414K486K489l72l73k105k102l13l175j617J248k42k43J72M945M766
$$ plain form
-7448 -48220 -48224 -47501 -49636 -50460 -51283 -53273 -55259 -55814 -56370 -56016 -55662 -54234 -49942 -48246 -49412 -50042 -53530 -54875 -56221 -57924
-7428 -57924 -59623 -60253 -63744 -65626 -67504 -69289 -71074 -72859 -74641 -75770 -76899 -77849 -78796 -75628 -69599 -65358 -65883 -65578
-7410 -65578 -65272 -65265 -65254 -63502 -61747 -62679 -63606 -65164 -63856 -62731 -61602 -61374 -61143 -59127 -59969 -63737 -64639 -62682 -63584 -64914
-7390 -64914 -63379 -62205 -61028 -56724 -52416 -50974 -49528 -48846 -48160 -44795 -41427 -38032 -37495 -36783 -36068 -35844 -35621 -35576 -35528 -34559
-7370 -34559 -36452 -39597 -42738 -46495 -50251 -49237 -48220 -46551 -44881 -43033 -36411 -29640 -22869 -20749 -18624 -16206 -16649
-7353 -16649 -15483 -14313 -13788 -13262 -12737 -12208 -6942 -1677 -1479 -4140 -9286 -14432 -18147 -21863 -23193 -21662 -20309 -18956
-7335 -18956 -18453 -17950 -16374 -11935 -10985 -12897 -16001 -21967 -26558 -28287 -28943 -29599 -29837 -30076 -34786 -36634 -36620 -36605 -38200 -36933
-7315 -36933 -32148 -30225 -26513 -22802 -23312 -23823 -24691 -25559 -21598 -23361 -26674 -29986 -27769 -25552 -23335 -21117 -22180 -23242
$$ packed form
-7448d8220mP23k135q24q23j990j986n55n56L54L54J428M292J696j166o30l488j345j346j703
-7428e7924j699o30l491j882j878j785j785j785j782j129j129r50r47L168O029M241n25L05
-7410f5578L06PJ1J752J755r32r27j558J308J125J129K28K31K016q42l768r02J957r02j330
-7390f4914J535J174J177M304M308J442J446O82O86L365L368L395N37P12P15K24K23M5M8R69
-7370c4559j893l145l141l757l756J014J017J669J670J848O622O771O771K120K125K418m43
-7353a6649J166J170N25N26N25N29N266N265J98k661n146n146l715l716j330J531J353J353
-7335a8956N03N03J576M439R50j912l104n966m591j729o56o56k38k39m710j848J4J5j595J267
-7315c6933M785J923L712L711n10n11q68q68L961j763l313l312K217K217K217K218j063j062
$$ plain form
-7297 -23242 -24304 -25366 -27247 -29129 -31011 -32893 -33702 -34510 -35319 -36128 -34969 -33810 -32651 -31492 -29200 -26908 -24617 -22325
-7279 -22325 -16277 -10225 -10851 -11477 -12942 -14402 -20633 -26864 -26584 -26301 -26018 -25735 -22384 -19031 -20447 -21863 -24393 -26920
-7261 -26920 -28015 -29111 -27199 -25284 -23368 -21453 -18319 -15181 -9182 -3182 3677 10542 18837 27132 37342 47556
-7245 47556 48827 40558 26144 11734 186 -5638 -9722 -13802 -16094 -18386 -17700 -17011 -17752 -18494 -15934 -13370 -13668
-7228 -13668 -13966 -17100 -20231 -23003 -25776 -27359 -23215 -17521 -11827 -7717 -3603 510 4624 4821 5023 3793 2563 4341
-7210 4341 6122 5041 3961 3159 2362 1564 767 -1166 -3096 -1807 -518 -536 5172 12073 18974 28853 33012 33713 34413
-7191 34413 31071 27732 26897 26062 26178 20573 11868 3163 1997 6558 14574 22593 29953 37316 44676 52039 56254 60472
-7173 60472 60096 59723 63997 71137 77618 89826 100073 100785 95948 85391 70359 52468 35408 27892 28704 32382
$$ packed form
-7297b3242j062j062j881j882j882j882q09q08q09q09J159J159J159J159K292K292K291K292
-7279b2325O048O052o26o26j465j460o231o231K80K83K83K83L351L353j416j416k530k527
-7261b6920j095j096J912J915J916J915L134L138N999O000O859O865Q295Q295J0210J0214
-7245D7556J271q269j4414j4410j1548n824m084m080k292k292O86O89p41p42K560K564k98
-7228a3668k98l134l131k772k773j583M144N694N694M110M114M113M114J97K02j230j230J778
-7210D341J781j081j080q02p97p98p97j933j930J289J289j8N708O901O901R879M159P01P00
-7191C4413l342l339q35q35J16n605q705q705j166M561Q016Q019P360P363P360P363M215M218
-7173F0472l76l73M274P140O481J2208J0247P12m837j0557j5032j7891j7060p516Q12L678
$$ plain form
-7157 32382 36116 42716 50862 56150 56604 54201 60897 73321 96652 129527 166214 197181 217710 224887 227708 233395
-7141 233395 241045 248699 259271 264123 267719 274181 283843 293510 302994 312481 320713 323225 318816 314412 310689 312694
-7125 312694 330078 360821 399669 444245 488340 522899 546767 561095 573158 585220 595912 600879 602925 602109
-7111 602109 607508 626264 657301 701695 746505 788454 831893 881056 930394 970193 1003850 1034646 1068005 1114720
-7097 1114720 1177831 1246666 1309733 1367075 1426564 1507041 1628181 1808466 2048137 2335506 2647101 2972052
-7085 2972052 3312266 3677287 4065915 4490794 4978397 5551861 6229930 7016752 7922822 8979622 10304366
-7074 10304366 12108003 14693183 18451752 23932012 31863987 43108870 58324182 76872556 94865720
-7065 94865720 105038702 101896123 87602330 69288489 52464766 39298569 29788916 23112562 18427150
$$ packed form
-7157C2382L734O600Q146N288M54k403O696J2424K3331L2875L6687L0967K0529P177K821N687
-7141B33395P650P654J0572M852L596O462R662R667R484R487Q232K512m409m404l723K005
-7125C12694J7384L0743L8848M4576M4095L4559K3868J4328J2063J2062J0692M967K046q16
-7111F02109N399J8756L1037M4394M4810M1949M3439M9163M9338L9799L3657L0796L3359M6715
-7097A114720O3111O8835O3067N7342N9489Q0477J21140J80285K39671K87369L11595L24951
-7085B972052L40214L65021L88628M24879M87603N73464O78069P86822R06070J056800J324744
-7074A0304366J803637K585180L758569N480260P931975J1244883J5215312J8548374J7993164
-7065I4865720J0172982l142579j4293793j8313841j6823723j3166197r509653o676354m685412
$$ plain form
-7056 18427150 15113549 12739492 11035123 9798440 8853672 8080767 7412801 6791579 6179896 5579467
-7046 5579467 5022921 4519082 4070573 3680197 3360415 3103715 2883265 2670272 2457283 2247033 2053958
-7035 2053958 1884490 1747461 1648825 1590260 1559088 1548908 1556014 1563124 1529090 1439730 1303502 1153922 1019073
-7022 1019073 912847 829393 759298 694148 629003 564211 508962 461610 423802 393502 363206 338391 319304
-7009 319304 311900 317855 329142 340433 345639 341309 322785 298541 272027 245517 225726 211662 202424 196052 188006
-6994 188006 174241 159935 145633 128570 117234 110787 104340 97591 90847 86248 91189 105026 124590 146181 167772
-6979 167772 182562 187816 189136 184731 179532 180062 183035 186009 186713 184559 174356 158430 138758 119089 103356 93347
-6963 93347 90012 92404 95274 98143 98538 98933 98255 97580 98631 105406 115758 126114 139283 146729 152743 158761 162093
$$ packed form
-7056A8427150l313601k374057j704369j236683r44768p72905o67966o21222o11683o00429
-7046E579467n56546n03839m48509l90376l19782k56700k20450k12993k12989k10250j93075
-7035B053958j69468j37029r8636n8565l1172j0180P106P110l4034q9360j36228j49580j34849
-7022A019073j06226q3454p0095o5150o5145o4792n5249m7352l7808l0300l0296k4815j9087
-7009C19304p404N955J1287J1291N206m330j8524k4244k6514k6510j9791j4064r238o372q046
-6994A88006j3765j4306j4302j7063j1336o447o447o749o744m599M941J3837J9564K1591K1591
-6979A67772J4790N254J320m405n199N30K973K974P04k154j0203j5926j9672j9669j5733j0009
-6963I3347l335K392K870K869L95L95o78o75J051O775J0352J0356J3169P446O014O018L332
$$ plain form
-6946 162093 159700 149855 142875 136227 129579 119950 110325 105525 103587 109102 120345 128365 142108 156984 169002 175709
-6930 175709 182417 190376 198340 208167 217993 224123 230257 240024 259331 288058 322513 363955 411120 461208 520838
-6915 520838 588813 659649 736626 826963 931874 1050140 1176516 1320066 1486985 1701603 2000647 2438975
-6903 2438975 3086383 4040971 5433670 7435006 10184851 13585304 16912540 18787834 18180198 15502446
-6893 15502446 12105637 9035087 6674526 4995107 3826300 3014280 2440391 2024865 1726678 1518164
-6883 1518164 1372728 1263547 1166111 1071538 977288 883042 792314 711126 639504 577425 524945 482005 445098
-6870 445098 411057 376181 341305 304726 271013 246065 230656 215850 201045 180695 157483 136417 121076
-6857 121076 108834 99455 90746 82037 78754 75471 72963 70455 61747 53038 41534 30031 19958 9886 2973
$$ packed form
-6946A62093k393r845o980o648o648r629r625m800j938N515J1243Q020J3743J4876J2018O707
-6930A75709O708P959P964R827R826O130O134R767J9307K8727L4455M1442M7165N0088N9630
-6915E20838O7975P0836P6977R0337J04911J18266J26376J43550J66919K14618K99044M38328
-6903B438975O47408R54588J392699K001336K749845L400453L327236J875294o07636k677752
-6893A5502446l396809l070550k360561j679419j168807q12020n73889m15526k98187k08514
-6883A518164j45436j09181r7436r4573r4250r4246r0728q1188p1622o2079n2480m2940l6907
-6870D45098l4041l4876l4876l6579l3713k4948j5409j4806j4805k0350k3212k1066j5341
-6857A21076j2242r379q709q709l283l283k508k508q708q709j1504j1503j0073j0072o913
$$ plain form
-6842 2973 -3939 -3696 -3454 -2556 -1658 1624 4907 12036 19165 25041 33780 45604 63155 75520 74528 60565 37066
-6825 37066 12852 -5638 -17648 -23931 -26577 -26361 -24836 -23309 -22675 -22042 -22888 -18006 -10143 -2280 3968 10221 12360
-6808 12360 8775 6670 1706 -633 -111 763 -4080 -7911 -11742 -16646 -21546 -29129 -33851 -35475 -31373 -24945 -15654
-6791 -15654 -5720 1356 3424 5492 8749 17734 33277 58359 85548 103200 106662 89136 63498 37864 14913
-6776 14913 -5176 -20842 -30780 -33146 -29789 -27508 -25224 -29737 -34249 -33392 -32532 -30244 -27952 -23637 -19318 -18341 -17361
-6759 -17361 -20842 -24318 -30184 -36046 -42150 -48250 -49107 -49960 -47613 -45261 -50068 -54872 -55267 -55658 -50806 -45951 -40338 -34723
-6741 -34723 -36265 -37805 -43759 -49711 -53280 -56847 -55136 -53426 -50284 -47139 -48172 -49204 -53277 -60208 -65757 -61766 -51156
-6724 -51156 -34820 -18367 -7639 -5437 -12770 -25958 -36284 -44523 -47035 -46152 -39545 -31507 -23465 -19839 -16213 -17834
$$ packed form
-6842B973o912K43K42Q98Q98L282L283P129P129N876Q739J1824J7551J2365r92j3963k3499
-6825C7066k4214j8490j2010o283k646K16J525J527O34O33q46M882P863P863O248O253K139
-6808A2360l585k105m964k339N22Q74m843l831l831m904m900p583m722j624M102O428R291
-6791a5654R934P076K068K068L257Q985J5543K5082K7189J7652L462j7526k5638k5634k2951
-6776A4913k0089j5666r938k366L357K281K284m513m512Q57Q60K288K292M315M319R77R80
-6759a7361l481l476n866n862o104o100q57q53K347K352m807m804l95l91M852M855N613N615
-6741c4723j542j540n954n952l569l567J711J710L142L145j033j032m073o931n549L991J0610
-6724e1156J6336J6453J0728K202p333j3188j0326q239k512Q83O607Q038Q042L626L626j621
$$ plain form
-6708 -17834 -19452 -21967 -24482 -25567 -26648 -26800 -26953 -28537 -30117 -30150 -30184 -28011 -20111 -9211 4549 19742 37801
-6691 37801 61818 85835 100908 98814 81117 60558 40536 23379 11287 2056 -6219 -14492 -15263 -16035 -11619
-6676 -11619 -4337 1330 1274 -2537 -6346 -7792 -9234 -13065 -16892 -18099 -19303 -18125 -16944 -14619 -12289 -12349 -12405 -9245
-6658 -9245 -6081 417 6919 10117 13318 11268 9222 763 -7691 -16150 -24605 -32409 -40208 -50038 -59865 -66476 -67359
-6641 -67359 -63357 -59351 -48354 -37354 -26711 -16068 -9245 -8142 -8410 -11540 -14510 -17477 -20622 -23767 -27721 -31671
-6625 -31671 -31924 -32178 -31853 -25802 -20585 -15368 -10035 -4699 2664 10027 16224 16701 16463 16224 17890 25283 33690 44959
-6607 44959 59164 82909 111126 145070 181932 218794 253391 282267 306459 321112 324316 314169 295492 267276
-6593 267276 236435 205599 173194 140789 109516 81109 56515 37644 21576 11235 4303 -2627 -4907 -7184
$$ packed form
-6708a7834j618k515k515j085j081j52j53j584j580l3l4K173P900J0900J3760J5193J8059
-6691C7801K4017K4017J5073k094j7697k0559k0022j7157j2092r231q275q273p71p72M416
-6676a1619P282N667n6l811l809j446j442l831l827j207j204J178J181K325K330o0n6L160
-6658i245L164O498O502L198L201k050k046q459q454q459q455p804p799r830r827o611q83
-6641f7359M002M006J0997J1000J0643J0643O823J103k68l130k970k967l145l145l954l950
-6625c1671k53k54L25O051N217N217N333N336P363P363O197M77k38k39J666P393Q407J1269
-6607D4959J4205K3745K8217L3944L6862L6862L4597K8876K4192J4653L204j0147j8677k8216
-6593B67276l0841l0836l2405l2405l1273k8407k4594j8871j6068j0341o932o930k280k277
$$ plain form
-6579 -7184 -7736 -8287 -10270 -12248 -14622 -16992 -15073 -13150 -16210 -19265 -22325 -25381 -24915 -24445 -19686 -14924 -10493 -6059
-6561 -6059 -5921 -5779 -5522 -5261 -7031 -14522 -24520 -34514 -36761 -39004 -38710 -38412 -40502 -42589 -49092 -55591 -59709 -63823 -65570
-6542 -65570 -67314 -65723 -64128 -61702 -59273 -55416 -51555 -43107 -34656 -24002 -13344 409 11305 16176 18188 20651
-6526 20651 20256 18904 17555 21568 25585 33474 41367 46468 44896 34137 16705 4874 -6953 -14611 -19403 -20558
-6510 -20558 -21714 -17741 -13765 -9018 -9040 -15442 -26610 -35039 -40607 -41702 -38024 -30773 -23521 -15017 -11280 -11458 -16407
-6493 -16407 -25172 -33933 -37987 -42041 -40849 -36791 -29532 -27043 -29919 -35654 -39694 -40871 -37458 -34041 -25608 -14309 -3014
-6476 -3014 5421 13765 22112 29502 34033 36340 38650 41136 50303 63997 74834 85846 96861 112240 136209 167388
-6460 167388 209065 258250 312209 374989 452082 555703 694625 876115 1106261 1389527 1713818 2068155
$$ packed form
-6579g184n52n51j983j978k374k370J919J923l060l055l060l056M66M70M759M762M431M434
-6561f059J38J42K57K61j770p491r998r994k247k243K94K98k090k087o503o499m118m114j747
-6542f5570j744J591J595K426K429L857L861Q448Q451J0654J0658J3753J0896M871K012K463
-6526B0651l95j352j349M013M017P889P893N101j572j0759j7432j1831j1827p658m792j155
-6510b0558j156L973L976M747k2o402j1168q429n568j095L678P251P252Q504L737j78m949
-6493a6407q765q761m054m054J192M058P259K489k876n735m040j177L413L417Q433J1299J1295
-6476c014Q435Q344Q347P390M531K307K310K486R167J3694J0837J1012J1015J5379K3969L1179
-6460A67388M1677M9185N3959O2780P7093J03621J38922J81490K30146K83266L24291L54337
$$ plain form
-6448 2068155 2429174 2761500 3031820 3211633 3277923 3219596 3049659 2792194 2474630 2139666 1819016
-6437 1819016 1531993 1293623 1108314 965937 856950 767996 690083 618852 554775 495469 447368 405948
-6425 405948 371028 344693 325270 305852 282379 256044 229825 203609 179600 155590 133038 110489 87459
-6412 87459 61572 40629 24460 11507 5235 12271 31711 60033 88357 117930 142737 166169 184835 195940
-6398 195940 198463 195020 186810 169087 146598 125178 106624 93522 85194 77696 70202 63957 57715 53079 45585
-6383 45585 32539 19496 7885 1043 -4848 -10736 -17577 -19649 -18863 -18073 -17283 -16493 -13411 -15095 -17436 -19776 -22157
-6366 -22157 -24535 -27031 -24758 -16079 -4535 3431 -2910 -24505 -50866 -77048 -100368 -117879 -135385 -149017 -157878
-6351 -157878 -160934 -161128 -155240 -142674 -118303 -91070 -65149 -43998 -28213 -19105 -17808 -19373 -15871 -12368 -7792
$$ packed form
-6448B068155L61019L32326K70320J79813O6290n8327j69937k57465l17564l34964l20650
-6437A819016k87023k38370j85309j42377j08987q8954p7913p1231o4077n9306m8101m1420
-6425D05948l4920k6335j9423j9418k3473k6335k6219k6216k4009k4010k2552k2549k3030
-6412H7459k5887k0943j6169j2953o272P036J9440K8322K8324K9573K4807K3432J8666J1105
-6398A95940K523l443q210j7723k2489k1420j8554j3102q328p498p494o245o242m636p494
-6383D5585j3046j3043j1611o842n891n888o841k072P86P90P90P90L082j684k341k340k381
-6366b2157k378k496K273Q679J1544P966o341k1595k6361k6182k3320j7511j7506j3632q861
-6351a57878l056j94N888J2566K4371K7233K5921K1151J5785R108J297j565L502L503M576
$$ plain form
-6336 -7792 -3216 -18 316 -1255 -7598 -10244 -12889 -17085 -21281 -28198 -32252 -31715 -28317 -24143 -24740 -28496 -32252 -35237
-6318 -35237 -35360 -28030 -17838 -9137 -5205 -4911 -4617 -7490 -15133 -24564 -33996 -44561 -57987 -70221 -75777 -76422 -77066
-6301 -77066 -74372 -71678 -71607 -78214 -85954 -88924 -86737 -81687 -76638 -66819 -46714 -16117 21576 52591 72084 74405
-6285 74405 58184 28607 -10419 -49446 -76668 -86718 -81684 -70925 -57722 -44520 -35431 -29204 -31384 -39288 -45090
-6270 -45090 -33720 -1602 51503 112598 167969 214278 243415 250283 236163 201533 157364 111644 75464 52162
-6256 52162 38400 26759 20841 19634 21292 28730 41892 58691 75494 91577 107660 120286 127191 134450 141709
-6241 141709 145152 142875 136309 129743 121866 108268 102179 105629 119991 140081 157766 172590 190335 213808 230302
-6226 230302 237255 222744 194882 164746 144154 132028 129441 128760 128081 127582 136622 153857 173958 187559 187805 174006
$$ packed form
-6336g792M576L198L34j571o343k646k645m196m196o917m054N37L398M174n97l756l756k985
-6318c5237j23P330J0192Q701L932K94K94k873p643r431r432j0565j3426j2234n556o45o44
-6301g7066K694K694P1o607p740k970K187N050N049R819K0105L0597L7693L1015J9493K321
-6285G4405j6221k9577l9026l9027k7222j0050N034J0759J3203J3202R089O227k180p904n802
-6270d5090J1370L2118N3105O1095N5371M6309K9137O868j4120l4630m4169m5720l6180k3302
-6256E2162j3762j1641n918j207J658P438J3162J6799J6803J6083J6083J2626O905P259P259
-6241A41709L443k277o566o566p877j3598o089L450J4362K0090J7685J4824J7745K3473J6494
-6226B30302O953j4511k7862l0136k0592j2126k587o81o79m99R040J7235K0101J3601K46j3799
$$ plain form
-6210 174006 150671 128290 115449 112792 115862 122928 132855 138575 138575 134342 135832 147768 165432 178802 178817 168782
-6194 168782 153026 137211 124258 117494 120274 127582 137755 156838 189281 224939 257740 289895 327778 376569
-6180 376569 442534 538636 667176 802629 886571 867347 747004 581822 445262 355235 305278 285606
-6168 285606 283109 291684 309802 326008 328863 315496 296409 286083 292932 299901 304007 297799 285867 268986 252105
-6153 252105 242498 250063 276260 319629 368423 420079 465594 501569 515901 513061 500898 494459 494578 504237 517354
-6138 517354 530471 531783 523555 512823 507814 506622 511153 509961 514492 535718 585563 654816 729796 786173 817747
-6123 817747 813306 784064 749099 723673 705861 682328 625407 539866 458793 425423 441659 497962 568116 647814
-6109 647814 726557 799577 852500 884440 898731 907298 918723 947324 1001205 1087520 1188977 1277081 1321542
$$ packed form
-6210A74006k3335k2381j2841k657L070P066R927N720%m233J490J1936J7664J3370J5j0035
-6194A68782j5756j5815j2953o764K780P308J0173J9083L2443L5658L2801L2155L7883M8791
-6180C76569O5965R6102J28540J35453Q3942j9224j20343j65182j36560r0027m9957j9672
-6168B85606k497Q575J8118J6206K855j3367j9087j0326O849O969M106o208j1932j6881j6881
-6153B52105r607P565K6197M3369M8794N1656M5515L5975J4332k840j2163o439J19R659J3117
-6138E17354J3117J312q228j0732n009j192M531j192M531K1226M9845O9253P4980N6377L1574
-6123H17747m441k9242l4965k5426j7812k3533n6921q5541q1073l3370J6236N6303P0154P9698
-6109F47814P8743P3020N2923L1940J4291Q567J1425K8601N3881Q6315J01457Q8104M4461
$$ plain form
-6096 1321542 1299224 1191123 1020064 823482 663155 569841 550941 580689 654324 757930 852001 894553
-6084 894553 893227 879495 905833 999185 1182213 1450745 1759348 2002361 2136625 2172269 2175481 2188229 2248680
-6071 2248680 2332126 2402221 2440354 2472767 2513403 2571216 2636179 2718317 2806027 2880381 2890342 2829713 2722812
-6058 2722812 2629266 2616809 2751267 3026193 3409873 3826941 4215394 4512978 4713256 4840794 4954980
-6047 4954980 5061769 5159022 5214777 5222834 5192609 5202454 5316282 5584654 5961745 6367460 6718797 7049148
-6035 7049148 7383906 7724391 8006685 8226017 8415459 8660232 8999923 9459821 9953103 10387238 10710235
-6024 10710235 11016066 11431823 12177654 13452225 15335433 17632185 20140718 22754905 25573243 28649034
-6014 28649034 31986214 35543049 39525353 44144671 49540526 55535711 61956371 68941139 77698385
$$ packed form
-6096A321542k2318j08101j71059j96582j60327r3314j8900K9748P3635J03606R4071M2552
-6084H94553j326j3732K6338R3352J83028K68532L08603K43013J34264L5644L212J2748O0451
-6071B248680Q3446P0095L8133L2413M0636N7813O4963Q2138Q7710P4354R961o0629j06901
-6058B722812r3546j2457J34458K74926L83680M17068L88453K97584K00278J27538J14186
-6047D954980J06789R7253N5755Q057l0225R845J13828K68372L77091M05715L51337L30351
-6035G049148L34758L40485K82294K19332J89442K44773L39691M59898M93282M34135L22997
-6024A0710235L05831M15757P45831J274571J883208K296752K508533K614187K818338L075791
-6014B8649034L337180L556835L982304M619318N395855N995185O420660O984768Q757246
$$ plain form
-6005 77698385 90358580 109767173 139455178 184904702 253934017 356697746 503370919 692768639
-5997 692768639 885231015 1000000000 973886367 829638629 644338790 474811919 344585820
-5990 344585820 254077378 193392037 152749684 125570838 107624531 96778167 91772011 91499994 93576664
-5981 93576664 93802390 88393945 78084001 66474749 56185308 47965994 41613807 36728831 33179179
-5972 33179179 30772389 29246828 28333716 28049510 28637238 30478136 33580190 36863261 37866335 35144981
-5962 35144981 30239034 25373868 21514190 18918565 17511594 17196443 17944019 19958942 23700559 29894124
-5952 29894124 39264415 51609696 63571480 68487473 62617851 50276592 37681581 27685430 20663768
-5943 20663768 15949295 12763092 10615285 9205855 8354137 7916446 7749206 7637297 7385333 6902511
$$ packed form
-6005G7698385J2660195J9408593K9688005M5449524O9029315J02763729J46673173J89397720
-5997F92768639J92462376J14768985k6113633j44247738j85299839j69526871j30226099
-5990C44585820r0508442o0685341m0642353k7178846j7946307j0846364n006156k72017K076670
-5981I3576664K25726n408445j0309944j1609252j0289441q219314o352187m884976l549652
-5972C3179179k406790j525561r13112k84206N87728J840898L102054L283071J003074k721354
-5962C5144981m905947m865166l859678k595625j406971l15151P47576K014923L741617O193565
-5952B9894124R370291J2345281J1961784M915993n869622j2341259j2595011r996151p021662
-5943B0663768m714473l186203k147807j409430q51718m37691j67240j11909k51964m82822
$$ plain form
-5933 6902511 6265862 5573881 4926972 4392636 3998772 3698397 3445747 3214089 3010572 2816595 2626431
-5922 2626431 2441994 2293569 2177579 2069560 1940558 1792953 1654888 1585863 1617963 1743313 1889651
-5911 1889651 2006024 2063255 2055855 1985492 1898430 1839992 1838315 1861442 1872107 1854153 1804002 1698525 1529128
-5898 1529128 1300584 1060116 859718 740062 694815 709908 761254 816294 854162 870805 858832 829065
-5886 829065 789758 763330 757893 780475 820229 865945 905941 938779 950629 925990 853656 762536 680957 620365
-5872 620365 569316 517723 456594 394269 349120 341112 373174 432659 501688 561576 589033 585302 560589 537898
-5858 537898 518073 498543 473293 444964 416639 397135 383358 373513 363672 347566 328602 311572 300270 309235
-5844 309235 339192 378984 421640 456125 477258 477668 460910 437116 413323 394772 381950 384510 400426 411866
$$ packed form
-5933F902511o36649o91981o46909n34336l93864l00375k52650k31658k03517j93977j90164
-5922B626431j84437j48425j15990j08019j29002j47605j38065o9025L2100J25350J46338
-5911A889651J16373N7231p400p0363q7062n8438j677K3127J0665j7954n0151j05477j69397
-5898A529128k28544k40468k00398j19656m5247J5093N1346N5040L7868J6643j1973k9767
-5886H29065l9307k6428n437K2582L9754M5716L9996L2838J1850k4639p2334r1120q1579o0592
-5872F20365n1049n1593o1129o2325m5149q008L2062N9485O9029N9888K7457l731k4713k2691
-5858E37898j9825j9530k5250k8329k8325j9504j3777r845r841j6106j8964j7030j1302Q965
-5844C09235K9957L9792M2656L4485K1133M10j6758k3794k3793j8551j2822K560J5916J1440
$$ plain form
-5830 411866 398506 361775 319319 297132 299752 312865 320255 317124 308274 277005 209486 92594 -68175 -231330
-5816 -231330 -312444 -268114 -141739 -816 103856 160408 184530 195355 203318 217386 240993 261201 271874
-5803 271874 275865 274132 267987 261846 254911 242252 227030 214673 206069 207004 216704 226408 226225 220319 211312 202309
-5787 202309 197893 199201 198481 192042 176849 152117 129054 115534 114830 123666 145022 166382 180904 182070 171670
-5772 171670 155549 132389 103505 74979 46457 17663 -5407 -13691 -4799 12673 30146 43923 57704 78538
-5758 78538 99373 109594 106464 96801 87139 75568 64001 54711 51145 55032 58922 64687 73314 83968 100349
-5743 100349 115233 132982 152098 165495 170719 166408 158038 146810 134953 120237 92639 55505 13538 -22701
-5729 -22701 -45828 -47963 -32621 -104 43618 93068 140844 171454 179164 169706 152821 141664 140878 149635 160028
$$ packed form
-5830D11866j3360l6731m2456k2187K620J3113P390l131q850l1269o7519j16892j60769j63155
-5816b31330q1114M4330J26375J40923J04672N6552K4122J0825P963J4068K3607K0208J0673
-5803B71874L991j733o145o141o935j2659j5222j2357q604R35R700R704j83n906r007r003
-5787B02309m416J308p20o439j5193k4732k3063j3520p04Q836K1356K1360J4522J166j0400
-5772A71670j6121k3160k8884k8526k8522k8794k3070q284Q892J7472J7473J3777J3781K0834
-5758G8538K0835J0221l130r663r662j1571j1567r290l566L887L890N765Q627J0654J6381
-5743A00349J4884J7749J9116J3397N224m311q370j1228j1857j4716k7598l7134m1967l6239
-5729b2701k3127k135J5342L2517M3722M9450M7776L0610P710r458j6885j1157p86Q757J0393
$$ plain form
-5714 160028 170425 181772 193123 191975 173656 141206 105898 72941 45708 31771 35009 53567 81665 113161
-5700 113161 141798 158329 165320 168554 171793 171405 165294 156380 150332 146844 149080 152687 156298 152601 143181 130899
-5684 130899 124344 117785 111227 106337 110992 122343 133697 146300 161768 174848 178392 170962 160673 146326 131983
-5669 131983 120915 115575 115478 115385 108551 95997 81788 70444 62138 59559 58020 50761 42783 40532 40767 46729 54596
-5652 54596 62466 65264 68067 69911 77484 89908 115687 144150 169754 193894 212310 222320 226609 225796 219260
-5637 219260 211532 198083 176879 146136 111100 81791 67370 62488 61780 66800 69341 71883 68104 64329 59179
-5622 59179 54029 50310 46595 48868 51141 53414 55691 49867 44042 40722 37406 35099 27068 18084 9103 -1893 -3350
-5605 -3350 -3495 -3637 3014 9666 13456 17249 22213 27176 27370 27568 32800 38032 40402 42775 48454 54134 58203 68000
$$ packed form
-5714A60028J0397J1347J1351j148j8319l2450l5308l2957k7233j3937L238J8558K8098L1496
-5700A13161K8637J6531O991L234L239l88o111q914o048l488K236L607L611l697r420j2282
-5684A30899o555o559o558m890M655J1351J1354J2603J5468J3080L544p430j0289j4347j4343
-5669A31983j1068n340r7r3o834j2554j4209j1344q306k579j539p259p978k251K35N962P867
-5652E4596P870K798K803J844P573J2424K5779K8463K5604K4140J8416J0010M289q13o536
-5637B19260p728j3449k1204l0743l5036k9309j4421m882p08N020K541K542l779l775n150
-5622E9179n150l719l715K273K273K273K277n824n825l320l316k307q031q984q981j0996j457
-5605c350j45j42O651O652L790L793M964M963J94J98N232N232K370K373N679N680M069R797
$$ plain form
-5587 68000 82652 100166 119291 132695 139633 140848 134312 124914 109047 96041 87627 76351 62719 49088 34443
-5572 34443 19798 10549 10840 18941 32766 50836 71767 89539 101586 104631 101951 95814 89676 88100 92248 100629
-5556 100629 114733 132117 152363 174397 196432 220117 246665 273331 305721 342285 381711 426801 485247
-5543 485247 563935 675058 831971 1036584 1293068 1601067 1947940 2315801 2678068 3000269 3241620
-5532 3241620 3378034 3385662 3261642 3021357 2699030 2329615 1960200 1622147 1331793 1095666 911054
-5521 911054 770325 665846 588380 535718 495100 464021 437563 411106 383813 356520 329183 301846 278026
-5508 278026 254207 229255 207164 190559 187310 187433 184694 180881 177069 168577 157222 144437 137375 134890 135266 142797
-5492 142797 153190 165849 178508 190272 196313 197282 198250 196894 198403 195377 186628 167802 143255 117126 90996
$$ packed form
-5587F8000J4652J7514J9125J3404O938J215o536r398j5867j3006q414j1276j3632j3631j4645
-5572C4443j4645r249K91Q101J3825J8070K0931J7772J2047L045k680o137o138j576M148Q381
-5556A00629J4104J7384K0246K2034K2035K3685K6548K6666L2390L6564L9426M5090N8446
-5543D85247P8688J11123J56913K04613K56484L07999L46873L67861L62267L22201K41351
-5532C241620J36414P628j24020k40285l22327l69415l69415l38053k90354k36127j84612
-5521I11054j40729j04479p7466n2662m0618l1079k6458k6457k7293k7293k7337k7337k3820
-5508B78026k3819k4952k2091j6605l249J23k739l813l812q492j1355j2785p062k485L76P531
-5492A42797J0393J2659J2659J1764O041R69R68j356J509l026q749j8826k4547k6129k6130
$$ plain form
-5477 90996 64687 38382 9002 -17514 -37771 -48485 -47076 -39944 -37462 -40700 -43197 -45693 -48548 -51399 -53880
-5462 -53880 -56362 -55088 -48086 -40074 -34924 -29595 -21401 -13381 -8220 -6521 -4818 -346 4128 4307 4490 4348 4210 1684
-5444 1684 -838 -6704 -12565 -14138 -15707 -18039 -20368 -29856 -39340 -47635 -55926 -58021 -60111 -62541 -64967 -61195 -57421
-5427 -57421 -51384 -45343 -41691 -38036 -38207 -38378 -37119 -35859 -37253 -38647 -37655 -36664 -33087 -29509 -25932 -22355 -21103 -19850
-5409 -19850 -18598 -17346 -21736 -26126 -30277 -40152 -50564 -55252 -59224 -63197 -63226 -63256 -62928 -62600 -63167 -58009 -50169 -45190
-5391 -45190 -42664 -40137 -37790 -35438 -33359 -31280 -32539 -33795 -36560 -39325 -40838 -42347 -46543 -53601 -60480 -61631 -60435
-5374 -60435 -53515 -45462 -40268 -36448 -32628 -30419 -28205 -32524 -36843 -43189 -49532 -52897 -50538 -49670 -45936 -45041 -44147 -45101
-5356 -45101 -46055 -46115 -40450 -31328 -25067 -17823 -13441 -12219 -13858 -16929 -20000 -26588 -33176 -41266 -49357 -55062 -60767 -67486
$$ packed form
-5477I0996k6309k6305k9380k6516k0257j0714J409P132K482l238k497k496k855k851k481
-5462e3880k482J274P002Q012N150N329Q194Q020N161J699J703M472M474J79J83j42j38k526
-5444A684k522n866n861j573j569k332k329r488r484q295q291k095k090k430k426L772L774
-5427e7421O037O041L652L655j71j71J259J260j394j394R92R91L577L578L577L577J252J253
-5409a9850J252J252m390m390m151r875j0412m688l972l973k9l0L28L28n67N158P840M979
-5391d5190K526K527K347K352K079K079j259j256k765k765j513j509m196p058o879j151J196
-5374f0435O920Q053N194L820L820K209K214m319m319o346o343l365K359Q68L734Q95Q94r54
-5356d5101r54o0N665R122O261P244M382J222j639l071l071o588o588q090q091n705n705o719
$$ plain form
-5338 -67486 -74205 -79850 -79772 -73195 -66617 -66062 -65507 -66800 -70955 -73381 -70083 -67586 -65090 -63666 -62243 -62489 -62735 -61549
-5320 -61549 -60364 -59016 -57667 -53933 -50199 -47359 -44520 -44244 -43968 -48779 -56452 -60487 -58799 -55621 -52442 -52245 -52047 -50046
-5302 -50046 -48045 -49383 -50720 -51134 -51548 -49576 -47605 -48548 -49491 -50433 -51373 -51868 -52364 -49521 -46673 -45127 -43581 -43465 -43346
-5283 -43346 -48209 -53072 -56862 -54924 -52330 -49737 -47143 -44546 -44367 -49912 -53907 -63621 -71432 -73519 -66304 -49547 -29334
-5266 -29334 -14846 -8108 -7091 -12215 -17335 -21386 -25433 -26144 -26852 -26133 -25410 -26823 -28231 -32982 -37730 -41110 -44486 -39757
-5248 -39757 -35025 -31537 -28045 -27896 -27743 -30396 -33046 -33314 -33579 -31805 -30027 -30639 -31246 -36329 -41408 -44762 -48112 -50873
-5230 -50873 -48861 -42377 -35893 -35047 -34197 -33348 -32498 -34365 -36228 -33799 -31369 -28734 -26096 -23935 -17003 -8522 -2899 1769
-5212 1769 3577 -2072 -10579 -19265 -25090 -29293 -33493 -37514 -41535 -43234 -44929 -44896 -44862 -42899 -36165 -31935 -30568 -32897
$$ packed form
-5338f7486o719n645P8O577O578N55N55j293m155k426L298K497K496J424J423k46k46J186
-5320f1549J185J348J349L734L734K840K839K76K76m811p673m035J688L178L179J97J98K001
-5302e0046K001j338j337m14m14J972J971r43r43r42r40m95m96K843K848J546J546J16J19
-5283d3346m863m863l790J938K594K593K594K597J79n545l995r714p811k087P215J6757K0213
-5266b9334J4488O738J017n124n120m051m047p11p08P19P23j413j408m751m748l380l376M729
-5248c9757M732L488L492J49J53k653k650k68k65J774J778o12o07n083n079l354l350k761
-5230e0873K012O484O484Q46Q50Q49Q50j867j863K429K430K635K638K161O932Q481N623M668
-5212A769J808n649q507q686n825m203m200m021m021j699j695L3L4J963O734M230J367k329
$$ plain form
-5194 -32897 -35226 -36303 -37380 -35967 -34555 -34574 -34592 -34194 -33795 -36735 -39675 -41471 -43268 -46316 -49364 -44810 -37395 -29263
-5176 -29263 -27810 -28175 -28541 -29323 -30106 -27758 -25410 -22586 -16899 -12822 -13512 -15636 -17756 -17018 -16277 -18878 -21475 -26178 -30877
-5157 -30877 -31287 -31693 -27959 -24222 -23827 -23428 -24341 -25250 -26163 -27072 -29983 -32889 -39139 -45384 -47519 -49651 -47493 -45332 -43711
-5138 -43711 -42086 -42850 -43610 -42664 -41714 -39332 -42675 -43726 -50497 -54585 -55811 -52703 -49591 -46301 -43010 -36772 -30530 -28582
-5120 -28582 -26633 -26424 -26212 -28026 -29841 -30378 -25187 -21427 -23391 -24449 -25504 -26916 -28328 -32517 -36701 -38084 -33743 -33076
-5102 -33076 -35267 -37879 -40488 -43010 -45529 -48052 -50571 -51171 -51768 -51294 -50817 -48645 -52192 -55923 -53925 -52658 -54249 -53877
-5084 -53877 -53500 -53873 -54242 -51276 -48306 -44490 -40670 -37212 -33750 -28384 -28738 -30169 -31596 -33851 -36102 -38356 -40607 -41401
-5066 -41401 -42191 -39645 -37096 -34685 -32271 -35107 -37939 -38032 -38121 -36783 -35442 -33113 -30780 -31790 -32796 -32494 -32189 -33318 -34443
$$ packed form
-5194c2897k329j077j077J413J412j9j8L98L99k940k940j796j797l048l048M554P415Q132
-5176b9263J453l65l66p82p83K348K348K824N687M077o90k124k120P38P41k601k597m703m699
-5157c0877m10m06L734L737L95L99r13r09r13r09k911k906o250o245k135k132K158K161J621
-5138d3711J625p64p60R46R50K382l343j051o771m088j226L108L112L290L291O238O242J948
-5120b8582J949K09K12j814j815n37N191L760j964j058j055j412j412m189m184j383M341O67
-5102c3076k191k612k609k522k519k523k519o00n97M74M77K172l547l731J998J267j591L72
-5084e3877L77l73l69K966K970L816L820L458L462N366l54j431j427k255k251k254k251p94
-5066d1401p90K546K549K411K414k836k832r3q9J338J341K329K333j010j006L02L05j129j125
$$ plain form
-5047 -34443 -34633 -34820 -37395 -39966 -43912 -47855 -47508 -47158 -48984 -50806 -50247 -49684 -49215 -48742 -48272 -47799 -50683 -53564 -54063 -54559
-5027 -54559 -51600 -48637 -48063 -47486 -49569 -51652 -53735 -55818 -58289 -60759 -59891 -59023 -59079 -59135 -57760 -56385 -55248 -54111 -52975
-5008 -52975 -51838 -49517 -47191 -41650 -41829 -46841 -51850 -57219 -62585 -66152 -69714 -70418 -71119 -70154 -69185 -72990 -76791 -77286
-4990 -77286 -77782 -75058 -78058 -81236 -84415 -81274 -78132 -75989 -73847 -74566 -75285 -73798 -72311 -67963 -63614 -60603 -57592 -54581
-4972 -54581 -51570 -52613 -53657 -54700 -55744 -56385 -57026 -54805 -52584 -47441 -42299 -43834 -45369 -46949 -48529 -47247 -45965
-4955 -45965 -47665 -49364 -55833 -62302 -66014 -69725 -68667 -67609 -64821 -62034 -59247 -56459 -54320 -52177 -52900 -53620 -53657 -53690
-4937 -53690 -50866 -48037 -48000 -47959 -46491 -45019 -45280 -45537 -44367 -43193 -45205 -47214 -44456 -41695 -40458 -39217 -40842 -42463
-4919 -42463 -46867 -51268 -54123 -51250 -47068 -42884 -41207 -39526 -43659 -47791 -49062 -50329 -54820 -59310 -60581 -61848 -63647
$$ packed form
-5047c4443j90j87k575k571l946l943L47L50j826j822N59N63M69M73M70M73k884k881m99m96
-5027e4559K959K963N74N77k083k083k083k083k471k470Q68Q68n6n6J375J375J137J137J136
-5008e2975J137K321K326N541j79n012n009n369n366l567l562p04p01R65R69l805l801m95
-4990g7286m96K724l000l178l179L141L142K143K142p19p19J487J487M348M349L011L011L011
-4972e4581L011j043j044j043j044o41o41K221K221N143N142j535j535j580j580J282J282
-4955d5965j700j699o469o469l712l711J058J058K788K787K787K788K139K143p23p20l7l3
-4937e3690K824K829L7M1J468J472k61k57J170J174k012k009K758K761J237J241j625j621
-4919d2463m404m401k855K873M182M184J677J681m133m132j271j267m491m490j271j267j799
$$ plain form
-4902 -63647 -59724 -56157 -52587 -51466 -50344 -49222 -48097 -47713 -47329 -51715 -56098 -56519 -56940 -54499 -52054 -47855 -43655 -40886
-4884 -40886 -38114 -33914 -29714 -28377 -27035 -27784 -28533 -32502 -33605 -33310 -35878 -39817 -43752 -43487 -47993 -49815 -51633 -53933
-4866 -53933 -56232 -57100 -60827 -58848 -59731 -62045 -64356 -65418 -66480 -64680 -60014 -58363 -61482 -64601 -67717 -67676 -67635 -67594 -67549
-4847 -67549 -66148 -64747 -63346 -61941 -56634 -51328 -44769 -38207 -35017 -34689 -39429 -44166 -45984 -47803 -49621 -51436 -51987
-4830 -51987 -52539 -51838 -51134 -47184 -46096 -48049 -47136 -44900 -45526 -48835 -49278 -49040 -48801 -46774 -47605 -48112 -48619 -50735 -52848 -54935
-4810 -54935 -57022 -56247 -55468 -54052 -52636 -51220 -49800 -48473 -47147 -47072 -49856 -51451 -53046 -53389 -53728 -52490 -51253 -50016
-4792 -50016 -48775 -45064 -41352 -40502 -39649 -40827 -42004 -41751 -41494 -41781 -42064 -43782 -45496 -45783 -46066 -48142 -47352 -47907 -51320
-4773 -51320 -53128 -54931 -52565 -53057 -53553 -51182 -49867 -48548 -48127 -50564 -51574 -49718 -52338 -54954 -56083 -54346 -54402 -54454 -54689
$$ packed form
-4902f3647L923L567L570J121J122J122J125L84L84m386m383m21m21K441K445M199M200K769
-4884d0886K772M200M200J337J342p49p49l969j103K95k568l939l935K65m506j822j818k300
-4866e3933k299q68l727J979q83k314k311j062j062J800M666J651l119l119l116M1M1M1M5
-4847f7549J401J401J401J405N307N306O559O562L190L28m740m737j818j819j818j815n51
-4830e1987n52P01P04L950J088j953R13K236o26l309m43K38K39K027q31n07n07k116k113k087
-4810e4935k087P75P79J416J416J416J420J327J326P5k784j595j595l43l39J238J237J237
-4792e0016J241L711L712Q50Q53j178j177K53K57k87k83j718j714k87k83k076P90n55l413
-4773e1320j808j803K366m92m96K371J315J319M21k437j010J856k620k616j129J737n6n2k35
$$ plain form
-4754 -54689 -57782 -59269 -60752 -60037 -59321 -58606 -57886 -61285 -64683 -65220 -65753 -66707 -67661 -68615 -69565 -67866 -66167 -63036 -59902
-4735 -59902 -55043 -50184 -48186 -46185 -46960 -47736 -51850 -53098 -50951 -53575 -56377 -56314 -54972 -53631 -50679 -47724 -48701 -49673
-4717 -49673 -53508 -57342 -59392 -61438 -60622 -59805 -57830 -55852 -55304 -54756 -55255 -55751 -56247 -56742 -56116 -55487 -54857 -54227 -52528 -50825
-4697 -50825 -49122 -47419 -51399 -55375 -59351 -63327 -63282 -63234 -63185 -63137 -63744 -64348 -66204 -63290 -65268 -67244 -66834 -61654 -58699 -55740
-4677 -55740 -53914 -52088 -53754 -55416 -57078 -58740 -61747 -64751 -65667 -61814 -62347 -62876 -60245 -57614 -59220 -60823 -60994 -61166
-4659 -61166 -61430 -61691 -61952 -62213 -65369 -68525 -68820 -69110 -64695 -60279 -60633 -60983 -60279 -59574 -58691 -53035 -48932 -44829 -44423 -48783
-4639 -48783 -54026 -59269 -61948 -64624 -66767 -68909 -68190 -67467 -65809 -64151 -62492 -60830 -61736 -62641 -63547 -64449 -65298 -66144 -66994
-4620 -66994 -67840 -69286 -70728 -69312 -67892 -69338 -70780 -72584 -68660 -64382 -60100 -58326 -56549 -57592 -58632 -56813 -54991
$$ packed form
-4754e4689l093j487j483P15P16P15P20l399l398n37n33r54r54r54r50J699J699L131L134
-4735e9902M859M859J998K001p75p76m114j248K147k624k802O3J342J341K952K955r77r72
-4717d9673l835l834k050k046Q16Q17J975J978N48N48m99m96m96m95O26O29O30O30J699J703
-4697e0825J703J703l980l976l976l976M5M8M9M8o07o04j856K914j978j976M10N180K955K959
-4677e5740J826J826j666j662j662j662l007l004r16L853n33n29K631K631j606j603j71j72
-4659f1166k64k61k61k61l156l156k95k90M415M416l54l50P04P05Q83N656M103M103M06m360
-4639d8783n243n243k679k676k143k142P19P23J658J658J659J662r06r05r06r02q49q46q50
-4620f6994q46j446j442J416J420j446j442j804L924M278M282J774J777j043j040J819J822
$$ plain form
-4603 -54991 -52368 -49740 -49979 -50214 -48589 -46960 -46767 -46569 -45988 -45403 -47683 -49960 -50236 -50508 -47922 -45332 -46055 -46774 -48928
-4584 -48928 -51078 -52233 -53385 -51678 -49968 -46979 -43987 -40998 -38006 -41650 -45291 -48935 -52576 -55207 -57834 -60107 -62377
-4567 -62377 -65932 -63759 -61948 -60133 -58352 -56567 -52997 -55147 -60476 -65801 -64806 -63811 -65622 -67430 -67806 -68183 -66148 -64110
-4549 -64110 -64933 -65757 -68104 -70448 -69930 -69412 -67743 -66070 -61535 -56999 -55300 -53597 -53325 -53053 -52889 -52722 -55416 -58110 -58095
-4530 -58095 -58076 -55196 -52315 -48242 -44169 -42958 -41743 -42917 -44091 -45265 -46435 -47773 -49111 -50448 -51782 -53955 -56127
-4513 -56127 -57942 -59753 -63334 -61192 -62269 -63342 -59500 -55658 -51816 -47970 -47065 -46159 -46685 -47206 -48149 -49092 -47173 -45250
-4495 -45250 -42660 -40066 -40812 -41557 -41561 -41561 -40130 -38699 -39910 -41117 -44710 -48302 -48291 -48276 -48261 -48246 -48846 -49442 -51171 -52900 -59135
-4474 -59135 -60596 -59492 -58389 -56053 -53713 -55665 -57618 -56623 -55624 -54626 -53627 -51168 -48708 -48634 -48555 -48153 -47750 -48779 -49804
$$ packed form
-4603e4991K623K628k39k35J625J629J93J98N81N85k280k277k76k72K586K590p23p19k154
-4584d8928k150j155j152J707J710K989K992K989K992l644l641l644l641k631k627k273k270
-4567f2377l555K173J811J815J781J785L570k150n329n325R95R95j811j808l76l77K035K038
-4549f4110q23q24k347k344N18N18J669J673M535M536J699J703K72K72J64J67k694k694J5
-4530e8095J9K880K881M073M073J211J215j174j174j174j170j338j338j337j334k173k172
-4513e6127j815j811l581K142j077j073L842L842L842L846R05R06n26n21r43r43J919J923
-4495d5250K590K594p46p45m%J431J431j211j207l593l592J1J5J5J5o00n96j729j729o235
-4474e9135j461J104J103K336K340j952j953R95R99R98R99K459K460P4P9M02M03j029j025
$$ plain form
-4455 -49804 -52621 -55438 -57599 -54987 -49040 -43092 -40186 -37275 -39660 -42045 -40137 -38226 -39358 -40491 -38285 -36075 -36910
-4438 -36910 -37745 -40011 -42273 -43525 -44777 -46029 -47277 -48865 -50448 -52036 -53620 -54939 -56254 -57573 -58889 -60476 -62060
-4421 -62060 -59355 -56645 -54387 -52125 -53206 -54283 -53292 -52297 -55598 -58896 -57428 -55956 -52103 -48246 -50609 -52967 -51991 -51011
-4403 -51011 -50482 -49949 -52103 -49483 -46383 -43282 -41315 -39347 -39854 -40361 -45161 -49960 -54462 -58963 -60782 -62600 -62898 -58427
-4385 -58427 -55028 -54492 -53825 -53158 -54100 -55043 -54585 -54126 -53668 -53210 -51842 -50474 -49107 -47739 -45984 -44229 -46767 -49304 -51298
-4366 -51298 -53292 -55285 -57275 -59656 -62038 -62034 -62026 -60465 -58904 -58773 -58639 -58568 -58498 -56996 -55490 -55788 -56087 -59724 -63357 -64609
-4346 -64609 -65861 -62820 -59776 -56683 -53590 -50199 -51574 -53757 -55941 -58423 -60901 -64519 -68134 -67456 -66778 -68101 -69420
-4329 -69420 -71037 -67884 -62917 -57946 -57924 -57901 -56124 -54343 -52561 -50780 -53221 -55658 -54756 -53854 -53642 -53426 -50825 -48224 -47199
$$ packed form
-4455d9804k817k817k161K612N947N948K906K911k385k385J908J911j132j133K206K210q35
-4438c6910q35k266k262j252j252j252j248j588j583j588j584j319j315j319j316j587j584
-4421f2060K705K710K258K262j081j077R91R95l301l298J468J472L853L857k363k358R76R80
-4403e1011N29N33k154K620L100L101J967J968n07n07m800m799m502m501j819j818k98M471
-4385e8427L399N36O67O67r42r43M58M59M58M58J368J368J367J368J755J755k538k537j994
-4366e1298j994j993j990k381k382MQJ561J561J31J34P1P0J502J506k98k99l637l633j252
-4346f4609j252L041L044L093L093L391j375k183k184k482k478l618l615O78O78j323j319
-4329f9420j617L153M967M971K2K3J777J781J782J781k441k437R02R02K12K16K601K601J025
$$ plain form
-4310 -47199 -46170 -48481 -50791 -51406 -52017 -54059 -58963 -60461 -57190 -53918 -55416 -57629 -56981 -54901 -52822 -52449 -52077 -51704
-4292 -51704 -51332 -50363 -49394 -48425 -47456 -46457 -45459 -47799 -50139 -53105 -56072 -56653 -57234 -56176 -55118 -51674 -48231 -46159 -44087
-4273 -44087 -46308 -48529 -51913 -55293 -56291 -57286 -58196 -59101 -58579 -58054 -57644 -57231 -56821 -56407 -57160 -57909 -56277 -54641 -54924 -55203
-4253 -55203 -54056 -52904 -47762 -42615 -41766 -40912 -44512 -48108 -48369 -48626 -51630 -54629 -55248 -55863 -53415 -50963 -47259 -48324
-4235 -48324 -47098 -45869 -44937 -44005 -48354 -52699 -53705 -54711 -56079 -57443 -58807 -60171 -61195 -62217 -59899 -57581 -55744
-4218 -55744 -53903 -57309 -60715 -57998 -55278 -52558 -49837 -51086 -52330 -52144 -51958 -52006 -52051 -49714 -47374 -46290 -45202 -48410
-4200 -48410 -51615 -56269 -60920 -60625 -60327 -58840 -62120 -62898 -60812 -59750 -58684 -59828 -60968 -62798 -64624 -65023 -65418 -68544
-4182 -68544 -71667 -74793 -77916 -76064 -74208 -69971 -65731 -60707 -55684 -53046 -55174 -57484 -56932 -54950 -52964 -51816 -50668
$$ packed form
-4310d7199J029k311k310o15o11k042m904j498L271L272j498k213O48K080K079L73L72L73
-4292e1704L72R69R69R69R69R99R98k340k340k966k967n81n81J058J058L444L443K072K072
-4273d4087k221k221l384l380r98r95r10r05N22N25M10M13M10M14p53p49J632J636k83k79
-4253e5203J147J152N142N147Q49Q54l600l596k61k57l004k999o19o15K448K452L704j065
-4235d8324J226J229R32R32m349m345j006j006j368j364j364j364j024j022K318K318J837
-4218e5744J841l406l406K717K720K720K721j249j244J86J86m8m5K337K340J084J088l208
-4200d8410l205m654m651K95K98J487l280p78K086J062J066j144j140j830j826l99l95l126
-4182f8544l123l126l123J852J856M237M240N024N023K638k128k310N52J982J986J148J148
$$ plain form
-4165 -50668 -50951 -54093 -55867 -52871 -52558 -55103 -55602 -56101 -55349 -54592 -53184 -51775 -52751 -53724 -51898 -50072 -50631 -51186 -53295
-4146 -53295 -55405 -55129 -54849 -52654 -50456 -49692 -48924 -48607 -48287 -47970 -47650 -51373 -55092 -56429 -57763 -59966 -62164 -62936 -63703
-4127 -63703 -61658 -59608 -59947 -63144 -65034 -62149 -59746 -57339 -59377 -61412 -61065 -60715 -60338 -59958 -59582 -59202 -59138 -59075 -60443 -61807
-4107 -61807 -62548 -63290 -60692 -58091 -56336 -54581 -54257 -53929 -51786 -49643 -48932 -48216 -49263 -50310 -51358 -52401 -53985 -55569
-4089 -55569 -57152 -58732 -59750 -60767 -59399 -58028 -56124 -54220 -55654 -57085 -54898 -52710 -50523 -48332 -51242 -54152 -57063
-4072 -57063 -59969 -59593 -59217 -58840 -58460 -59724 -60987 -62250 -63510 -63029 -62548 -63498 -64445 -63040 -61635 -57845 -54052 -52423 -50795
-4053 -50795 -51194 -57313 -57622 -57931 -58598 -59261 -56310 -53355 -52785 -52215 -50843 -49468 -50478 -51488 -53381 -55270 -54775 -54279 -54294 -54305
-4033 -54305 -54316 -54328 -56265 -58199 -61564 -64929 -66003 -67072 -66711 -66349 -66409 -66465 -62585 -58706 -55725 -58464 -59414 -60364 -61576 -62787
$$ packed form
-4165e0668k83l142j774K996L13k545m99m99P52P57J408J409r76r73J826J826n59n55k109
-4146e3295k110K76K80K195K198P64P68L17L20L17L20l723l719j337j334k203k198p72p67
-4127f3703K045K050l39l197j890K885K403K407k038k035L47L50L77L80L76L80O4O3j368j364
-4107f1807p41p42K598K601J755J755L24L28K143K143P11P16j047j047j048j043j584j584
-4089e5569j583j580j018j017J368J371J904J904j434j431K187K188K187K191k910k910k911
-4072e7063k906L76L76L77L80j264j263j263j260M81M81r50r47J405J405L790L793J629J628
-4053e0795l99o119l09l09o67o63K951K955N70N70J372J375j010j010j893j889M95M96j5j1
-4033e4305j1j2j937j934l365l365j074j069L61L62o0n6L880L879K981k739r50r50j212j211
$$ plain form
-4013 -62787 -61613 -60435 -61110 -61784 -60074 -58360 -56217 -54074 -54316 -54555 -56049 -57544 -59038 -60528 -60618 -60704 -60789 -60875 -60547 -60215
-3993 -60215 -62269 -64322 -66245 -68164 -67698 -67232 -67307 -67378 -68701 -70023 -67676 -62466 -60596 -61587 -62995 -64404 -64560 -64717 -63845
-3974 -63845 -62973 -65142 -67311 -68824 -65567 -61833 -58099 -55166 -55092 -56750 -58404 -60510 -62612 -64359 -68965 -70623 -69416 -69822
-3956 -69822 -70225 -71317 -69543 -69382 -69219 -68585 -67952 -69226 -67635 -66584 -70303 -71339 -69509 -69368 -69226 -69502 -72636 -74074 -72651
-3937 -72651 -71227 -72662 -71782 -68041 -68473 -68902 -67873 -66845 -65637 -67288 -68197 -69107 -69599 -67225 -65809 -67255 -68522 -69785
-3919 -69785 -69692 -72461 -70936 -66547 -64009 -61471 -60186 -58896 -58207 -57517 -59213 -60905 -61468 -62030 -60208 -58382 -58509 -58635 -58583
-3900 -58583 -61389 -63096 -64803 -66688 -68570 -67639 -66707 -65954 -62336 -59347 -56359 -54801 -53239 -50415 -50448 -50307 -50161 -49781 -49398
-3881 -49398 -53310 -57219 -57972 -58721 -62634 -66543 -69621 -69833 -66591 -63346 -59761 -59034 -59086 -59135 -58948 -58758 -58393 -60886 -63077 -65265
$$ packed form
-4013f2787J174J178o75o74J710J714K143K143k42k39j494j495j494j490r0q6q5q6L28L32
-3993f0215k054k053j923j919M66M66p5p1j323j322K347N210J870r91j408j409j56j57Q72
-3974f3845Q72k169k169j513L257L734L734K933P4j658j654k106k102j747m606j658J207m06
-3956f9822m03j092J774J61J63O34O33j274J591J051l719j036J830J41J42k76l134j438J423
-3937g2651J424j435Q80L741m32m29J029J028J208j651r09r10m92K374J416j446j267j263
-3919f9785R3k769J525M389K538K538J285J290O89O90j696j692n63n62J822J826j27j26N2
-3900e8583k806j707j707j885j882R31R32P53L618K989K988J558J562K824l3J41J46L80L83
-3881d9398l912l909p53p49l913l909l078k12L242L245L585P27n2m9J87J90L65k493k191k188
$$ plain form
-3861 -65265 -66860 -65589 -69211 -72829 -74544 -73392 -70541 -67687 -65432 -66036 -66882 -67724 -67020 -63450 -60473 -57491 -56720 -55945
-3843 -55945 -56187 -56426 -58099 -59768 -57212 -54652 -52871 -53948 -51868 -49785 -52177 -54566 -57614 -60659 -61143 -61624 -61959 -59429
-3825 -59429 -56724 -56877 -59969 -60197 -60603 -61009 -65026 -66178 -65421 -64665 -62377 -57223 -55110 -52997 -54704 -56407 -55069 -56593
-3807 -56593 -56046 -55494 -56552 -57611 -58702 -59791 -60879 -61967 -60540 -59109 -57499 -58751 -60901 -63048 -62869 -59828 -56850 -56731
-3789 -56731 -56612 -53631 -50445 -50117 -47821 -48388 -49070 -49748 -49174 -48600 -47195 -45787 -47538 -49289 -50139 -48123 -50102 -52081 -52453
-3770 -52453 -52822 -54622 -56422 -56549 -56672 -59179 -61687 -61307 -60923 -60540 -60156 -61930 -63703 -65835 -65101 -61330 -60420 -63744 -67065
-3751 -67065 -70463 -71000 -72848 -74693 -77197 -74931 -72308 -72543 -70348 -68149 -66427 -64706 -63107 -66275 -66759 -67244 -67299 -67352 -65973
-3732 -65973 -64594 -64233 -63867 -62071 -60275 -60487 -60700 -59302 -60767 -63454 -66140 -68231 -67460 -64706 -61952 -62358 -62764 -62217 -61669
$$ packed form
-3861f5265j595J271l622l618j715J152K851K854K255o04q46q42P04L570K977K982P71P75
-3843e5945k42k39j673j669K556K560J781j077K080K083k392k389l048l045m84m81l35K530
-3825e9429K705j53l092k28m06m06m017j152P57P56K288N154K113K113j707j703J338j524
-3807e6593N47N52j058j059j091j089j088j088J427J431J610j252k150k147J79L041K978J19
-3789e6731J19K981L186L28K296n67o82o78N74N74J405J408j751j751q50K016j979j979l72
-3770e2453l69j800j800j27j23k507k508L80L84L83L84j774j773k132P34L771R10l324l321
-3751f7065l398n37j848j845k504K266K623k35K195K199J722J721J599l168m84m85n5n3J379
-3732f5973J379L61L66J796J796k12k13J398j465k687k686k091P71K754K754m06m06N47N48
$$ plain form
-3713 -61669 -61121 -60573 -59396 -58214 -57037 -55855 -57003 -58147 -60905 -60797 -60782 -60763 -60569 -60372 -57018 -53661 -52990 -55177 -54991 -54805
-3693 -54805 -53366 -51924 -54779 -57633 -58103 -58568 -61512 -64456 -65015 -65570 -66875 -68179 -69662 -68279 -67314 -66349 -65205 -64057
-3675 -64057 -61661 -59265 -56869 -54469 -55770 -57070 -56940 -56806 -57122 -57439 -57756 -58069 -58930 -59791 -60651 -61508 -60163 -58818 -59202 -62444
-3655 -62444 -63357 -64270 -64587 -62038 -61937 -61836 -60126 -58412 -57394 -56377 -59474 -62567 -64680 -63931 -64792 -65649 -65883 -66118 -64922
-3636 -64922 -63722 -64076 -64430 -66215 -67996 -67355 -66714 -65895 -65075 -66103 -64270 -64046 -63823 -63830 -63838 -66230 -68622 -70538 -72453 -71805 -66386
-3615 -66386 -64859 -63331 -61505 -59679 -58986 -58293 -60282 -65134 -65753 -66372 -68779 -68324 -68913 -69502 -67527 -65552 -64288 -63025 -63193
-3596 -63193 -63357 -63554 -63752 -65380 -67005 -67307 -67609 -67911 -68209 -65380 -62552 -62108 -61661 -65004 -68347 -70258 -72166 -71991 -71816 -69256
-3576 -69256 -66692 -62448 -58203 -58252 -58296 -59090 -59884 -60677 -61468 -63051 -64631 -63830 -63025 -61181 -59332 -60827 -62317 -61292 -60264
$$ packed form
-3713f1669N48N48J177J182J177J182j148j144k758J08J5J9J94J97L354L357O71k187J86J86
-3693e4805J439J442k855k854m70m65k944k944n59n55j305j304j483J383R65R65J144J148
-3675f4057K396K396K396K400j301j300J30J34l16l17l17l13q61q61q60q57J345J345l84l242
-3655f2444r13r13l17K549J01J01J710J714J018J017l097l093k113P49q61q57k34k35J196
-3636f4922J200l54l54j785j781O41O41Q19Q20j028J833K24K23pqk392k392j916j915O48N419
-3615f6386J527J528J826J826O93O93j989m852o19o19k407M55n89n89J975J975J264J263j68
-3596f3193j64j97j98j628j625l02l02l02k98K829K828M44M47l343l343j911j908J75J75K560
-3576f9256K564M244M245m9m4p94p94p93p91j583j580Q01Q05J844J849j495j490J025J028
$$ plain form
-3557 -60264 -60670 -61072 -59690 -58304 -60260 -62213 -65198 -68179 -68779 -69375 -67352 -65324 -65686 -66044 -64244 -62440 -63025 -63606 -63953
-3538 -63953 -64296 -60350 -56400 -56970 -57536 -59533 -61531 -61564 -61594 -64009 -66424 -66830 -67232 -65250 -63267 -61169 -59068 -60305 -61542
-3519 -61542 -60718 -59891 -57633 -55375 -55654 -55930 -56206 -56482 -55852 -55218 -57924 -60629 -60029 -59425 -60253 -61080 -57980 -54879 -55118 -55352
-3499 -55352 -58184 -61017 -63849 -66677 -69539 -72401 -70970 -69535 -67448 -65362 -63275 -61184 -60167 -59150 -60517 -61881 -62921
-3482 -62921 -63961 -63569 -63174 -63662 -64151 -62254 -60353 -61110 -61866 -62623 -63375 -63931 -64486 -66591 -62015 -58844 -58535 -58583 -58628 -58289 -57950
-3461 -57950 -56180 -59176 -62712 -63387 -63584 -63778 -63144 -62511 -63308 -64102 -62604 -61106 -59608 -58106 -57741 -57376 -58561 -62604 -65250
-3442 -65250 -65034 -63267 -61497 -62865 -64229 -64341 -64452 -62541 -63487 -64613 -62876 -60897 -61777 -60868 -59958 -59232 -58501 -57771 -57040 -57920
-3422 -57920 -58796 -59671 -60547 -59876 -59202 -58706 -58211 -55632 -55911 -56370 -53966 -50881 -50653 -52930 -55207 -54887 -54562 -54238 -53914 -54011 -54104
$$ packed form
-3557f0264m06m02J382J386j956j953k985k981o00n96K023K028l62l58J800J804n85n81l47
-3538f3953l43L946L950n70n66j997j998l3l0k415k415m06m02J982J983K098K101j237j237
-3519f1542Q24Q27K258K258k79k76k76k76O30O34k706k705O00O04q28q27L100L101k39k34
-3499e5352k832k833k832k828k862k862J431J435K087K086K087K091J017J017j367j364j040
-3482f2921j040L92L95m88m89J897J901p57p56p57p52n56n55k105M576L171L09m8m5L39L39
-3461e7950J770k996l536o75j97j94O34O33p97p94J498J498J498J502L65L65j185m043k646
-3442f5250K16J767J770j368j364j12j11J911r46j126J737J979q80R09R10P26P31P30P31q80
-3422e7920q76q75q76O71O74M96M95K579k79m59K404L085K28k277k277L20L25L24L24r7r3
$$ plain form
-3401 -54104 -54197 -54290 -53679 -53064 -54834 -56604 -57782 -58956 -60130 -61304 -59906 -58505 -57879 -60115 -61222 -62325 -63428 -64531 -66442
-3382 -66442 -65488 -62805 -60122 -58307 -56489 -54670 -52852 -52144 -51432 -50720 -50009 -50016 -50020 -49666 -52174 -57070 -59101 -59403 -59705 -62455
-3362 -62455 -62340 -60793 -62108 -61710 -61307 -62336 -63364 -65321 -64411 -63681 -62951 -63297 -63640 -63804 -63968 -64106 -61378 -60260 -59142 -56824
-3342 -56824 -54506 -53798 -50225 -48622 -47020 -45418 -43812 -43789 -46629 -46249 -48727 -52103 -55479 -60644 -62943 -62735 -62526 -60350
-3324 -60350 -61032 -62910 -61926 -60346 -58762 -55528 -52293 -50966 -52498 -52394 -55151 -57909 -60663 -60845 -61028 -61210 -61393 -57819 -54246
-3305 -54246 -54309 -57234 -57730 -58225 -58900 -59574 -61590 -63606 -67053 -70500 -71022 -71540 -68723 -65902 -62280 -58654 -58073 -54626 -46755
-3286 -46755 -38881 -31011 -23137 -19053 -17827 -23104 -33146 -42109 -48209 -50016 -51820 -52286 -52751 -56079 -54633 -52364 -52956
-3269 -52956 -56888 -60815 -60812 -60808 -62056 -63301 -65030 -63893 -62578 -64124 -65734 -64478 -65011 -65544 -64739 -63931 -63897 -66726 -67501 -68272
$$ packed form
-3401e4104r3r3O11O15j770j770j178j174j174j174J398J401O26k236j107j103j103j103j911
-3382f6442R54K683K683J815J818J819J818P08P12P12P11pmL54k508m896k031l02l02k750
-3362f2455J15J547j315L98M03j029j028j957R10P30P30l46l43j64j64j38K728J118J118K318
-3342e6824K318P08L573J603J602J602J606K3k840L80k478l376l376n165k299K08K09K176
-3324f0350o82j878R84J580J584L234L235J327j532J04k757k758k754j82j83j82j83L574L573
-3305e4246o3k925m96m95o75o74k016k016l447l447n22n18K817K821L622L626N81L447P871
-3286d6755P874P870P874M084J226n277j0042q963o100j807j804m66m65l328J446K269n92
-3269e2956l932l927LMj248j245j729J137J315j546j610J256n33n33Q05Q08L4k829p75p71
$$ plain form
-3249 -68272 -66003 -66595 -66897 -64333 -62131 -59925 -58766 -57603 -56623 -55639 -52073 -51365 -51436 -51503 -52975 -54443 -55140 -52971 -49804
-3230 -49804 -46632 -41080 -35524 -37603 -42541 -47303 -47292 -44907 -45380 -48242 -51101 -53247 -55390 -59146 -60037 -58717 -57394 -55893
-3212 -55893 -54391 -55457 -56519 -53288 -50057 -48656 -47251 -48231 -49211 -49658 -50102 -50545 -50989 -51093 -51194 -51294 -51395 -51857 -52315 -52774
-3192 -52774 -53232 -54574 -55911 -57249 -58587 -58289 -57987 -57685 -57383 -53992 -50597 -49591 -48581 -48201 -47818 -49822 -51823 -53523 -55218
-3173 -55218 -54533 -53843 -55513 -57178 -58848 -60514 -58527 -56537 -58844 -61147 -60890 -60629 -63234 -61065 -58192 -58177 -58643 -59105 -61598
-3154 -61598 -64087 -63241 -62392 -62019 -61643 -61266 -60890 -62097 -63301 -64505 -65708 -66021 -66331 -66640 -66949 -63744 -60536 -58758 -56981
-3135 -56981 -60316 -63647 -63640 -63633 -62108 -60581 -63346 -66111 -65377 -64639 -63901 -63163 -64337 -65507 -66677 -67847 -64113 -60379 -61892
-3116 -61892 -63402 -62410 -61419 -60428 -59433 -59217 -59001 -56400 -53795 -53042 -52289 -52967 -53642 -55919 -58196 -60473 -62746 -60759 -58773
$$ packed form
-3249f8272K269n92l02K564K202K206J159J163R80R84L566P08p1o7j472j468o97K169L167
-3230d9804L172N552N556k079m938m762J1K385m73k862k859k146k143l756q91J320J323J501
-3212e5893J502j066j062L231L231J401J405r80r80m47m44m43m44j04j01j00j01m62m58m59
-3192e2774m58j342j337j338j338K98L02L02L02L391L395J006J010L80L83k004k001j700j695
-3173e5218O85O90j670j665j670j666J987J990k307k303K57K61k605K169K873J5m66m62k493
-3154f1598k489Q46Q49L73L76L77L76j207j204j204j203l13l10l09l09L205L208J778J777
-3135e6981l335l331PPJ525J527k765k765P34P38P38P38j174j170j170j170L734L734j513
-3116f1892j510R92R91R91R95K16K16K601K605P53P53o78o75k277k277k277k273J987J986
$$ plain form
-3097 -58773 -62034 -65291 -66293 -67296 -66867 -66435 -66334 -66234 -67564 -68891 -68265 -67635 -67005 -66375 -64288 -62198 -60286 -58375 -58144
-3078 -58144 -60771 -61788 -62805 -62962 -63115 -63267 -63420 -65790 -68156 -65157 -59295 -58147 -59858 -59302 -61609 -62816 -59250 -56936
-3060 -56936 -57484 -59198 -60909 -62798 -64687 -63595 -62500 -61404 -60309 -58054 -55796 -56221 -59507 -59474 -59437 -57968 -59362 -60521
-3042 -60521 -61676 -58896 -56116 -55565 -57871 -60178 -59623 -59608 -59589 -61598 -63606 -62444 -58416 -54387 -53221 -51283 -49342 -48354 -50229
-3023 -50229 -52338 -54447 -56914 -59381 -59016 -61512 -61803 -59232 -56832 -57294 -59306 -61318 -62079 -62839 -62168 -61497 -62831 -64165 -64069
-3004 -64069 -61110 -56183 -56027 -56347 -56668 -55267 -53866 -53895 -58695 -63197 -64836 -65820 -66804 -65350 -61035 -58151 -58125 -55896 -53668
-2985 -53668 -54003 -54335 -55326 -56318 -54924 -53526 -51358 -49189 -49405 -49617 -49230 -48842 -50840 -52833 -57096 -61359 -64013 -66662 -67676
-2966 -67676 -65827 -64158 -62485 -63379 -64274 -63737 -63197 -62630 -62060 -63875 -65690 -65183 -64672 -62731 -60789 -61579 -62366 -64583 -66800
$$ packed form
-3097e8773l261l257j002j003M29M32J01J00j330j327O26O30O30O30K087K090J912J911K31
-3078e8144k627j017j017j57j53j52j53k370k366K999N862J148j711N56k307j207L566K314
-3060e6936n48j714j711j889j889J092J095J096J095K255K258m25l286L3L7J469j394j159
-3042f0521j155K780K780N51k306k307N55J5J9k009k008J162M028M029J166J938J941R88j875
-3023e0229k109k109k467k467L65k496k91K571K400m62k012k012p61p60O71O71j334j334R6
-3004f4069K959M927J56l20l21J401J401k9m800m502j639r84r84J454M315K884K6K229K228
-2985e3668l35l32r91r92J394J398K168K169k16k12L87L88j998j993m263m263k654k649j014
-2966f7676J849J669J673q94q95N37N40N67N70j815j815N07N11J941J942p90p87k217k217
$$ plain form
-2947 -66800 -67203 -67601 -65615 -63629 -61848 -60063 -58278 -56493 -58259 -60022 -61784 -63547 -63502 -63454 -63405 -63357 -65339 -67318 -65958
-2928 -65958 -64598 -63010 -61419 -62213 -63007 -61091 -59172 -57253 -55334 -56735 -58132 -58099 -58065 -58095 -58121 -56716 -55311 -55673 -56031 -56388
-2908 -56388 -56746 -59224 -61699 -63696 -62831 -58274 -58483 -59168 -59854 -60275 -60692 -61110 -61527 -62876 -64221 -64136 -64050 -64415 -64777 -65138 -65500
-2887 -65500 -64546 -63588 -62630 -61672 -61881 -62086 -62291 -62496 -62008 -61516 -62455 -63394 -65261 -67124 -65649 -64173 -65757 -67337 -66532 -65727
-2867 -65727 -64717 -63703 -65075 -66446 -64736 -63021 -61311 -59597 -58989 -58378 -60152 -61926 -64240 -66550 -65526 -64497 -64158 -63815
-2849 -63815 -65857 -67899 -66461 -65019 -63580 -62138 -60253 -58363 -59813 -61263 -61874 -62481 -58799 -55114 -54831 -54544 -55688 -56832
-2831 -56832 -55058 -53284 -55803 -58319 -60689 -63059 -63044 -63025 -63129 -63234 -63338 -63439 -62530 -61620 -60711 -59798 -55680 -51563 -50784 -50001
-2811 -50001 -51339 -52677 -51630 -50579 -53452 -56325 -57767 -59206 -60081 -60957 -61833 -62705 -62660 -62612 -60178 -57745 -57875 -58006 -58136 -58266
$$ packed form
-2947f6800m03l98J986J986J781J785J785J785j766j763j762j763M5M8M9M8j982j979J360
-2928f5958J360J588J591p94p94J916J919J919J919j401j397L3L4l0k6J405J405l62l58l57
-2908e6388l58k478k475j997Q65M557k09o85o86m21m17m18m17j349j345Q5Q6l65l62l61l62
-2887f5500R54R58R58R58k09k05k05k05M88M92r39r39j867j863J475J476j584j580Q05Q05
-2867f5727J010J014j372j371J710J715J710J714O08O11j774j774k314k310J024J029L39L43
-2849f3815k042k042J438J442J439J442J885J890j450j450o11o07L682L685K83K87j144j144
-2831e6832J774J774k519k516k370k370J5J9j04j05j04j01R09R10R09R13M118M117P79P83
-2811e0001j338j338J047J051k873k873j442j439q75q76q76q72M5M8K434K433j30j31j30j30
$$ plain form
-2791 -58266 -61143 -64016 -61643 -59269 -59727 -60186 -63029 -65872 -65786 -65697 -64177 -62656 -59556 -56455 -53355 -50255 -49990 -49722 -52792
-2772 -52792 -55863 -58307 -60752 -58904 -57055 -55129 -53202 -53661 -54119 -55710 -57301 -58893 -60484 -61106 -61728 -62351 -62973 -62939 -62906
-2753 -62906 -63349 -59023 -55188 -54216 -56582 -58948 -59556 -60163 -59340 -58516 -56336 -54156 -51976 -49796 -50866 -51935 -54436 -56936
-2735 -56936 -60219 -63502 -65354 -62436 -60443 -61311 -65220 -66267 -65704 -65142 -64400 -63659 -61933 -60208 -59914 -59619 -58002 -56385 -58106
-2716 -58106 -59828 -60297 -60767 -61713 -65522 -71179 -72066 -70568 -69069 -67542 -66014 -65917 -65820 -66625 -67430 -68235 -69040 -68145 -67251 -66357 -65462
-2695 -65462 -65708 -65954 -66200 -66446 -66692 -66938 -67184 -67430 -67933 -68436 -68939 -69442 -70124 -70806 -69103 -67400 -66733 -66066 -63968 -61870 -62992
-2674 -62992 -64113 -60942 -57771 -61684 -65593 -69382 -67448 -64713 -61974 -63170 -64367 -65030 -65690 -66349 -67009 -68835 -70657 -70094
-2656 -70094 -69532 -70161 -70787 -69982 -69178 -65127 -61072 -60357 -59642 -59347 -59049 -58751 -58453 -58427 -58397 -56936 -55475 -57640 -59802 -59578 -59355
$$ packed form
-2791e8266k877k873K373K374m58m59k843k843Q6Q9J520J521L100L101L100L100K65K68l070
-2772e2792l071k444k445J848J849J926J927m59m58j591j591j592j591o22o22o23o22L4L3
-2753f2906m43M326L835R72k366k366o08o07Q23Q24K180K180K180K180j070j069k501k500
-2735e6936l283l283j852K918J993q68l909j047N63N62P42P41J726J725K94K95J617J617j721
-2716e8106j722m69m70r46l809n657q87J498J499J527J528R7R7q05q05q05q05Q95Q94Q94Q95
-2695f5462k46k46k46k46k46k46k46k46n03n03n03n03o82o82J703J703O67O67K098K098j122
-2674f2992j121L171L171l913l909l789J934K735K739j196j197o63o60o59o60j826j822N63
-2656g0094N62o29o26Q05Q04M051M055P15P15K95K98K98K98K6L0J461J461k165k162K24K23
$$ plain form
-2635 -59355 -62414 -65470 -66140 -66811 -66487 -66159 -67262 -68365 -64076 -59783 -59783 -59783 -60711 -61635 -62559 -63484 -62414 -61341 -62653 -63964
-2615 -63964 -61672 -59377 -59824 -60271 -59112 -63674 -63584 -63495 -61926 -60353 -58904 -63174 -64527 -65876 -67586 -69293 -67843 -66390
-2597 -66390 -64941 -63487 -63349 -63208 -63070 -62928 -62563 -62194 -61829 -61460 -62884 -64303 -64296 -64285 -63472 -62656 -64229 -65798 -65432 -65064 -64698
-2576 -64698 -64329 -64281 -64233 -65615 -66998 -64206 -61415 -61009 -60603 -60323 -60044 -59765 -59485 -59444 -59403 -59362 -59321 -59317 -59314 -60741 -62168 -64370 -66573
-2553 -66573 -64482 -62392 -61695 -60998 -60301 -59604 -59802 -59999 -60197 -60394 -61169 -61944 -64151 -66357 -66506 -66655 -64419 -62183 -61430 -60677
-2533 -60677 -59329 -62749 -66111 -64702 -62936 -61169 -62541 -63912 -63852 -63793 -64329 -64866 -65403 -65939 -66394 -66848 -67303 -67758 -66901 -66044
-2513 -66044 -65187 -64329 -63443 -62556 -61371 -60186 -62220 -59485 -55319 -55923 -58464 -61005 -60506 -60007 -60223 -60439 -60655 -60871 -59355 -57838
-2493 -57838 -56321 -54805 -53586 -52368 -53534 -54700 -58371 -62041 -63327 -64613 -64139 -63666 -63193 -62720 -60245 -57767 -58632 -59492
$$ packed form
-2635e9355l059l056o70o71L24L28j103j103M289M293%%r28r24r24r25J070J073j312j311
-2615f3964K292K295m47m47J159m562R0Q9J569J573J449m270j353j349j710j707J450J453
-2597f6390J449J454J38J41J38J42L65L69L65L69j424j419PJ1Q13Q16j573j569L66L68L66
-2576f4698L69M8M8j382j383K792K791M06M06K80K79K79K80M1M1M1M1MLj427j427k202k203
-2553f6573K091K090O97O97O97O97j98j97j98j97p75p75k207k206j49j49K236K236P53P53
-2533f0677J348l420l362J409J766J767j372j371O0N9n36n37n37n36m55m54m55m55Q57Q57
-2513f6044Q57Q58Q86Q87J185J185k034K735M166o04k541k541M99M99k16k16k16k16J516J517
-2493e7838J517J516J219J218j166j166l671l670j286j286M74M73M73M73K475K478q65q60
$$ plain form
-2475 -59492 -60774 -62053 -64765 -62705 -61140 -62433 -63431 -61564 -60327 -59086 -57670 -56250 -56142 -56031 -55923 -55811 -56120 -56426 -58166
-2456 -58166 -59902 -58520 -57134 -58136 -59135 -59153 -59168 -60618 -62064 -61810 -61557 -61304 -61050 -60976 -60901 -60827 -60752 -60193 -59634 -60506 -61378 -64903
-2434 -64903 -68429 -70702 -70113 -69375 -68637 -67899 -67162 -64993 -65686 -67452 -69219 -69554 -67027 -67184 -70202 -71581 -70098 -68973 -67847
-2415 -67847 -67441 -67031 -66621 -66211 -64821 -63428 -62034 -60640 -59444 -58244 -59727 -61210 -61803 -59530 -57257 -57845 -57298 -56746 -56373
-2396 -56373 -56001 -54857 -53709 -54350 -52129 -52267 -55263 -56291 -57320 -57070 -53955 -52449 -50944 -52569 -54193 -52599 -53866 -57040
-2378 -57040 -57353 -56593 -55833 -56146 -56459 -58024 -59589 -57786 -53120 -51317 -52375 -51376 -50378 -52420 -54462 -57577 -60692 -62556 -61557
-2359 -61557 -61840 -62123 -62228 -62332 -61631 -60931 -61661 -62392 -64318 -66241 -65306 -64367 -63282 -62194 -61289 -60379 -56120 -54719 -52964 -54067
-2339 -54067 -53266 -52461 -53269 -54074 -54782 -55487 -54764 -54037 -53612 -53184 -52759 -52330 -51205 -50076 -47341 -47463 -49081 -50694 -49629 -48559
$$ packed form
-2475e9492j282j279k712K060J565j293r98J867J237J241J416J420J08J11J08J12l09l06j740
-2456e8166j736J382J386j002r99j8j5j450j446K54K53K53K54P4P5P4P5N59N59q72q72l525
-2434f4903l526k273N89P38P38P38P37K169o93j766j767l35K527j57l018j379J483J125J126
-2415f7847M06M10M10M10J390J393J394J394J196J200j483j483n93K273K273n88N47N52L73
-2396e6373L72J144J148o41K221j38k996j028j029K50L115J506J505j625j624J594j267l174
-2378e7040l13P60P60l13l13j565j565J803M666J803j058R99R98k042k042l115l115j864R99
-2359f1557k83k83j05j04P01P00p30p31j926j923R35R39J085J088R05R10M259J401J755j103
-2339e4067Q01Q05q08q05p08p05P23P27M25M28M25M29J125J129K735j22j618j613J065J070
$$ plain form
-2319 -48559 -49651 -50739 -51708 -57447 -60983 -59746 -58628 -57510 -57201 -56888 -56575 -56262 -55416 -54566 -53538 -52509 -53825 -52278 -49658
-2300 -49658 -51805 -53120 -54436 -56049 -57659 -58259 -58859 -59459 -60055 -59820 -59586 -59351 -59112 -62556 -65995 -69260 -72520 -70746 -66107
-2281 -66107 -64333 -65418 -65559 -65697 -62798 -62757 -63435 -61248 -59422 -57592 -57301 -57011 -56720 -56429 -56228 -56027 -55826 -55624 -54343 -53061
-2261 -53061 -53031 -55863 -56012 -56161 -54700 -56101 -57517 -56068 -56407 -56746 -54883 -53016 -51149 -49282 -49550 -49815 -50258 -50702 -52818
-2242 -52818 -57793 -60085 -59515 -56232 -55807 -58363 -60920 -61781 -62638 -63674 -61848 -61531 -61210 -60711 -60212 -60432 -60648 -63726 -66804
-2223 -66804 -66815 -66826 -65406 -63983 -64948 -65913 -67236 -65693 -62172 -61512 -61926 -62336 -63882 -65429 -67154 -66014 -65313 -64609 -63726 -62843
-2203 -62843 -63662 -64478 -65295 -66111 -67527 -68939 -70351 -71764 -70437 -69107 -67776 -66446 -66364 -66278 -66193 -66107 -65936 -65760 -64333 -62906
-2183 -62906 -60692 -61337 -63234 -65131 -66584 -68034 -69304 -70575 -70825 -68212 -65779 -66204 -64784 -66226 -66237 -66245 -64870 -63495 -62120
$$ packed form
-2319d8559j092j088r69n739l536J237J118J118L09L13L13L13Q46Q50J028J029j316J547K620
-2300d9658k147j315j316j613j610o00o00o00n96K35K34K35K39l444l439l265l260J774M639
-2281f6107J774j085j41j38K899M1o78K187J826J830K91K90K91K91K01K01K01K02J281J282
-2261e3061L0k832j49j49J461j401j416J449l39l39J863J867J867J867k68k65m43m44k116
-2242e2818m975k292N70L283M25k556k557q61q57j036J826L17L21M99M99k20k16l078l078
-2223f6804j1j1J420J423r65r65j323J543L521O60m14m10j546j547j725J140P01P04Q83Q83
-2203f2843q19q16q17q16j416j412j412j413J327J330J331J330Q2Q6Q5Q6J71J76J427J427
-2183f2906K214o45j897j897j453j450j270j271k50K613K433m25J420j442j1qJ375J375J375
$$ plain form
-2164 -62120 -60741 -61154 -61568 -61803 -62034 -63021 -61147 -61061 -60976 -59697 -61281 -61255 -61229 -61471 -61713 -61956 -62198 -62619 -63040 -63461 -63882 -64538
-2142 -64538 -65194 -62988 -60782 -59649 -58516 -60245 -61974 -63025 -64076 -63338 -65462 -66722 -65119 -60834 -59411 -60309 -61207 -62462
-2124 -62462 -60853 -63092 -65332 -64710 -64083 -62313 -63405 -64676 -63081 -61490 -62761 -62243 -61721 -61356 -60991 -60625 -60256 -60487 -60718
-2105 -60718 -60950 -61177 -61937 -62697 -63457 -64214 -64795 -65377 -64169 -65820 -64322 -59958 -55773 -54451 -54801 -55147 -55673 -56198 -56698 -57193
-2085 -57193 -57689 -58184 -59370 -60551 -61732 -62913 -61479 -60040 -60033 -60025 -58859 -57689 -61289 -64888 -65541 -66189 -63975 -61762 -61818 -61870
-2065 -61870 -61922 -61974 -62306 -62638 -62969 -63301 -62559 -61818 -61076 -60335 -61069 -61803 -62537 -63271 -63409 -63547 -63685 -63823 -63301 -62779 -62258 -61736 -60379
-2042 -60379 -59023 -57667 -56310 -56735 -57160 -57585 -58009 -58434 -58859 -59284 -59709 -60007 -60305 -60603 -60901 -62272 -63644 -65015 -66386 -66834
-2022 -66834 -67281 -67728 -68175 -68622 -69069 -69517 -69964 -69524 -69084 -68645 -68205 -64426 -60648 -61639 -62630 -60633 -58635 -59500 -60364 -60991 -61617
$$ packed form
-2164f2120J379m13m14k35k31r87J874Q6Q5J279j584K6K6k42k42k43k42m21m21m21m21o56
-2142f4538o56K206K206J133J133j729j729j051j051P38k124j260J603M285J423q98q98j255
-2124f2462J609k239k240O22O27J770j092j271J595J591j271N18N22L65L65L66L69k31k31
-2105f0718k32k27p60p60p60p57n81n82J208j651J498M364M185J322l50l46n26n25n00m95
-2085e7193m96m95j186j181j181j181J434J439PQJ166J170l600l599o53o48K214K213n6n2
-2065f1870n2n2l32l32l31l32P42P41P42P41p34p34p34p34j38j38j38j38N22N22N21N22J357
-2042f0379J356J356J357m25m25m25m24m25m25m25m25k98k98k98k98j371j372j371j371m48
-2022f6834m47m47m47m47m47m48m47M40M40M39M40L779L778r91r91J997J998q65q64o27o26
$$ plain form
-2001 -61617 -62243 -62869 -62530 -62190 -61851 -61512 -61590 -61669 -61747 -61825 -64095 -66364 -65772 -65179 -63215 -61251 -62149 -63048 -61665 -60282 -61762
-1980 -61762 -63241 -65883 -68525 -68306 -68086 -69669 -71253 -71406 -71559 -71085 -70612 -73001 -75390 -73482 -71570 -69662 -67750 -66230
-1962 -66230 -64706 -64616 -64523 -67191 -69856 -67754 -65649 -66468 -67285 -66673 -66058 -64255 -62451 -63510 -64568 -66461 -68354 -67385 -66416
-1943 -66416 -65887 -65358 -66260 -67162 -64724 -62287 -61281 -60275 -60238 -60201 -60163 -60122 -61188 -62254 -61889 -61520 -58866 -56213 -57078 -57939 -56716
-1922 -56716 -58356 -61248 -59366 -59586 -62664 -63834 -65004 -63554 -62101 -62079 -62056 -62887 -63715 -61203 -58691 -58181 -57667 -58583 -59500 -59839
-1902 -59839 -60178 -60517 -60853 -61639 -62425 -63211 -63994 -62395 -60797 -59198 -57596 -59038 -60480 -60491 -60499 -58065 -55628 -56530 -57432 -58516
-1882 -58516 -59597 -58293 -56988 -57216 -57439 -61002 -64564 -66282 -67996 -65418 -62839 -61024 -59209 -61687 -64165 -64765 -65365 -64534
-1864 -64534 -63703 -64847 -65991 -67135 -68279 -67545 -66811 -66077 -65343 -63767 -62187 -60610 -59030 -58289 -57544 -56802 -56057 -57342 -58624
$$ packed form
-2001f1617o26o26L39L40L39L39p8p9p8p8k270k269N92N93J964J964q98q99J383J383j480
-1980f1762j479k642k642K19K20j583j584j53j53M74M73k389k389J908J912J908J912J520
-1962f6230J524R0R3k668k665K102K105q19q17O12O15J803J804j059j058j893j893R69R69
-1943f6416N29N29r02r02K438K437J006J006L7L7L8M1j066j066L65L69K654K653q65q61J223
-1922e6716j640k892J882k20l078j170j170J450J453K2K3q31q28K512K512N10N14r16r17l39
-1902e9839l39l39l36p86p86p86p83J599J598J599J602j442j442j1qK434K437r02r02j084
-1882e8516j081J304J305k28k23l563l562j718j714K578K579J815J815k478k478o00o00Q31
-1864f4534Q31j144j144j144j144P34P34P34P34J576J580J577J580P41P45P42P45j285j282
$$ plain form
-1845 -58624 -59910 -61192 -61255 -61315 -61378 -61438 -60983 -60528 -61505 -62481 -61699 -60916 -63472 -66029 -65336 -64642 -65380 -66118 -67214 -68309 -66066
-1824 -66066 -63823 -63748 -63674 -62168 -60663 -58442 -56221 -58293 -60364 -61959 -63554 -61810 -60066 -59515 -58963 -60379 -61795 -64747
-1806 -64747 -61017 -57708 -54395 -54961 -55524 -60204 -60111 -60409 -60704 -62910 -65112 -65500 -63021 -62157 -61289 -61959 -62626 -62522 -59552 -61564
-1786 -61564 -63573 -65406 -67236 -67266 -67292 -67322 -67348 -65172 -62992 -62246 -61497 -60048 -58594 -59526 -60458 -59630 -58803 -60361 -61918 -61982 -62041
-1765 -62041 -62101 -62161 -64575 -66990 -67795 -68600 -70936 -70407 -69282 -68156 -65242 -65190 -65734 -66278 -66282 -63420 -63599 -63778 -63092 -62407 -60290
-1744 -60290 -58173 -59791 -61408 -63025 -64639 -65093 -65548 -66003 -66453 -65656 -64859 -63882 -62902 -65146 -64527 -62537 -65313 -65917 -61751
-1725 -61751 -59135 -59377 -58490 -60465 -62440 -64411 -66729 -69047 -67072 -65093 -66159 -67225 -66502 -68637 -67933 -64367 -62589 -60812
-1707 -60812 -60644 -60476 -60130 -62641 -66140 -69640 -68071 -66502 -63651 -60800 -60514 -60223 -60044 -62727 -63621 -64516 -64546 -61713 -58702
$$ packed form
-1845e8624j286j282o3o0o3o0M55M55r77r76P82P83k556k557O93O94p38p38j096j095K243
-1824f6066K243P5P4J506J505K221K221k072k071j595j595J744J744N51N52j416j416k952
-1806f4747L730L309L313n66n63m680R3k98k95k206k202l88K479Q64Q68o70o67J04K970k012
-1786f1564k009j833j830l0k6l0k6K176K180P46P49J449J454r32r32Q28Q27j558j557o4n9
-1765f2041o0o0k414k415q05q05k336N29J125J126K914N2n44n44mK862j79j79O86O85K117
-1744f0290K117j618j617j617j614m54m55m55m50P97P97R77R80k244O19J990k776o04M166
-1725f1751K616k42Q87j975j975j971k318k318J975J979j066j066P23k135P04L566J778J777
-1707f0812J68J68L46k511l499l500J569J569K851K851K86K91J79k683q94q95l0K833L011
$$ plain form
-1688 -58702 -58550 -60622 -59832 -59220 -61471 -61576 -61680 -61784 -61885 -62619 -60491 -58363 -59094 -59261 -59429 -59597 -59761 -62000 -61378 -60756 -60130
-1667 -60130 -58345 -53698 -52390 -53940 -54868 -55792 -54510 -53228 -53053 -52874 -54126 -55378 -55069 -54756 -54443 -54130 -54268 -54402 -54715 -55028
-1647 -55028 -55237 -58304 -61549 -61933 -60681 -62287 -63715 -62280 -62094 -61903 -63920 -65936 -66763 -67586 -68410 -69233 -66752 -64270 -62563
-1628 -62563 -63715 -64423 -65131 -64587 -64039 -62533 -61028 -62086 -63141 -60353 -60428 -60323 -60215 -58963 -57708 -56452 -55196 -53884 -52569
-1609 -52569 -51253 -49938 -52859 -55777 -58993 -57439 -56873 -56303 -53825 -54208 -55587 -56962 -58516 -60070 -60316 -60558 -60800 -61043 -61721
-1590 -61721 -62395 -63070 -63744 -63826 -63905 -64162 -64419 -63446 -65336 -65615 -65895 -66204 -66513 -61576 -61408 -62187 -60104 -59928 -59753 -61635 -63517
-1569 -63517 -63968 -64419 -65928 -67437 -67396 -64493 -63379 -65127 -65086 -65045 -64341 -63636 -62932 -62228 -61911 -61594 -59668 -60603 -61635 -62667 -61315
-1548 -61315 -59962 -61769 -60715 -59839 -58963 -59429 -59895 -60361 -60827 -61799 -62772 -61538 -60305 -58457 -59470 -60305 -61140 -61795 -62451 -63286
$$ packed form
-1688e8702J52k072P90O12k251j05j04j04j01p34K128K128p31j67j68j68j64k239O22O22O26
-1667f0130J785M647J308j550r28r24J282J282J75J79j252j252L09L13L13L13j38j34l13l13
-1647e5028k09l067l245l84J252j606j428J435J86J91k017k016q27q23q24q23K481K482J707
-1628f2563j152p08p08N44N48J506J505j058j055K788p5J05J08J252J255J256J256J312J315
-1609e2569J316J315k921k918l216J554N66N70K478l83j379j375j554j554k46k42k42k43o78
-1590f1721o74o75o74q2p9k57k57R73j890k79k80l09l09M937J68p79K083J76J75j882j882
-1569f3517m51m51j509j509M1K903J114j748M1M1P04P05P04P04L17L17J926r35j032j032J352
-1548f1315J353j807J054Q76Q76m66m66m66m66r72r73J234J233J848j013q35q35o55o56q35
$$ plain form
-1528 -63286 -64121 -62168 -63077 -63987 -62034 -63778 -65522 -68339 -71156 -74693 -75363 -73351 -71339 -69181 -67020 -63249 -62340 -63178
-1510 -63178 -64013 -62641 -61270 -61930 -62585 -63241 -63897 -65105 -66308 -66916 -64661 -64736 -67668 -70064 -72461 -72162 -68999 -67445 -65891
-1491 -65891 -63536 -61177 -61978 -62779 -63208 -60771 -61378 -61982 -60681 -59377 -55215 -53910 -54302 -57551 -59552 -58688 -60331 -61971 -63435
-1472 -63435 -64896 -62753 -60607 -58464 -56318 -56113 -55904 -55699 -55490 -55829 -56165 -57756 -54574 -52736 -50896 -52218 -56400 -59824
-1454 -59824 -60383 -59396 -58404 -59206 -60003 -57763 -55520 -53489 -56224 -58665 -61102 -61963 -62820 -63681 -64538 -62157 -59772 -60074 -63234
-1435 -63234 -63893 -64549 -66998 -66580 -66062 -65541 -67229 -68913 -67381 -65846 -65924 -63137 -61345 -59548 -59008 -58464 -57596 -56724 -58240 -59753
-1415 -59753 -61374 -62992 -61274 -59552 -61412 -63267 -63696 -64121 -62578 -61032 -61874 -62712 -62988 -63260 -60674 -62854 -65641 -65563 -63402
-1396 -63402 -61236 -58330 -60189 -60800 -61408 -62790 -64173 -64124 -64076 -65637 -67199 -67329 -67460 -66711 -65962 -63782 -61602 -58259 -54916
$$ packed form
-1528f3286q35J953r09r10J953j744j744k817k817l537o70K012K012K158K161L771R09q38
-1510f3178q35J372J371o60o55o56o56j208j203o08K255p5k932k396k397K99L163J554J554
-1491f5891K355K359q01q01m29K437o07o04J301J304M162J305l92l249k001Q64j643j640j464
-1472f3435j461K143K146K143K146K05K09K05K09l39l36j591L182J838J840j322m182l424
-1454e9824n59R87R92q02p97K240K243K031k735k441k437q61q57q61q57K381K385l02l160
-1435f3234o59o56k449M18N18N21j688j684J532J535p8K787J792J797N40N44Q68Q72j516j513
-1415e9753j621j618J718J722j860j855m29m25J543J546q42q38k76k72K586k180k787P8K161
-1396f3402K166K906j859o11o08j382j383M9M8j561j562j30j31P49P49K180K180L343L343
$$ plain form
-1377 -54916 -54913 -54909 -55673 -56437 -57201 -57965 -59921 -61877 -63834 -65790 -66174 -66558 -65511 -64464 -65563 -66662 -63469 -60275 -60204 -60130 -60055
-1356 -60055 -59981 -62056 -64128 -63815 -63502 -62731 -61956 -61181 -60405 -59843 -59276 -58710 -58144 -59146 -60145 -61143 -62142 -61266 -60387 -60938 -61490 -60435
-1334 -60435 -59377 -58319 -57260 -58412 -59560 -59276 -58993 -59712 -60428 -61147 -61863 -62612 -63357 -62675 -61989 -60383 -58773 -55736 -52695
-1315 -52695 -54935 -57171 -60841 -64508 -62835 -61158 -59485 -57808 -57208 -56604 -56005 -55401 -56530 -57655 -57353 -57048 -56895 -56739 -58017
-1296 -58017 -59291 -59627 -59958 -56955 -53948 -52673 -51395 -52505 -53612 -56482 -59347 -61740 -59358 -57100 -57700 -57827 -57950 -58729
-1278 -58729 -59504 -61713 -63920 -63357 -62790 -62228 -61661 -60577 -59489 -61743 -63994 -61777 -59556 -58770 -57980 -59712 -61445 -63178 -64911
-1259 -64911 -61933 -58956 -58363 -57771 -57708 -57644 -57581 -57517 -58438 -59358 -60279 -61199 -61337 -61475 -61613 -61751 -63677 -65604 -64192 -62779 -63238 -63696
-1237 -63696 -64631 -62705 -59168 -60402 -61814 -60364 -57536 -54708 -55039 -55367 -54983 -54600 -54216 -53828 -54384 -54939 -55494 -56046 -56213 -56381
$$ packed form
-1377e4916LMp64p64p64p64j956j956j957j956l84l84J047J047j099j099L193L194P1P4P5
-1356f0055P4k075k072L13L13P71P75P75P76N62N67N66N66j002r99r98r99Q76Q79n51n52J055
-1334f0435J058J058J059j152j148K84K83p19p16p19p16p49p45O82O86J606J610L037L041
-1315e2695k240k236l670l667J673J677J673J677O00O04N99O04j129j125L02L05J53J56j278
-1296e8017j274l36l31L003L007J275J278j110j107k870k865k393K382K258o00j27j23p79
-1278e8729p75k209k207N63N67N62N67J084J088k254k251K217K221P86P90j732j733j733j733
-1259f4911K978K977N93N92O3O4O3O4r21r20r21r20j38j38j38j38j926j927J412J413m59m58
-1237f3696r35J926L537j234j412J450K828K828l31l28L84L83L84L88n56n55n55n52j67j68
$$ plain form
-1217 -56381 -56549 -56713 -56094 -55472 -58188 -60905 -62999 -65090 -64795 -64501 -61736 -58967 -60491 -62015 -62291 -62563 -61404 -60245 -58803
-1198 -58803 -57357 -58296 -59235 -58147 -57059 -58356 -59653 -59463 -59269 -61460 -63651 -63457 -63264 -60685 -58106 -56973 -55841 -58047
-1180 -58047 -60249 -59116 -57980 -58278 -58572 -58602 -58632 -60092 -61549 -63338 -65123 -63573 -62019 -61922 -61825 -61728 -61628 -60905 -60182 -57849 -58375
-1159 -58375 -57361 -56347 -55513 -54674 -55569 -56463 -57357 -58248 -60961 -63674 -61617 -59556 -58572 -57588 -59466 -61341 -61691 -62041 -60603
-1140 -60603 -62023 -61300 -57715 -54309 -53761 -53832 -53903 -54152 -54402 -56232 -58062 -58460 -58855 -61043 -63230 -60648 -58065 -60610 -63156
-1121 -63156 -62839 -62518 -61520 -60517 -59340 -61020 -61661 -62298 -63115 -63931 -64847 -65760 -66677 -67590 -66241 -64888 -63536 -62183 -61833 -61482
-1101 -61482 -61132 -60782 -61535 -62287 -61609 -60931 -58024 -55118 -56981 -58844 -59008 -59172 -57905 -56638 -57573 -58505 -58307 -58106 -55554 -57767
-1081 -57767 -61773 -62913 -62753 -62589 -63681 -64769 -65235 -65697 -63182 -65432 -70433 -70664 -69107 -67549 -67870 -68190 -67080 -65969 -65522
$$ packed form
-1217e6381j68j64O19O22k716k717k094k091K95K94K765K769j524j524k76k72J159J159J442
-1198e8803J446r39r39J088J088j297j297J90J94k191k191J94J93K579K579J133J132k206
-1180e8047k202J133J136k98k94l0l0j460j457j789j785J550J554R7R7R7J00P23P23K333n26
-1159e8375J014J014Q34Q39q95q94q94q91k713k713K057K061R84R84j878j875l50l50J438
-1140f0603j420P23L585L406N48p1p1k49k50j830j830l98l95k188k187K582K583k545k546
-1121f3156L17L21R98J003J177j680o41o37q17q16r16r13r17r13J349J353J352J353L50L51
-1101f1482L50L50p53p52O78O78K907K906j863j863j64j64J267J267r35r32J98K01K552k213
-1081e7767m006j140J60J64j092j088m66m62K515k250n001k31J557J558l21l20J110J111M47
$$ plain form
-1062 -65522 -65075 -64628 -64180 -65015 -65850 -68294 -67877 -65626 -63375 -61125 -58874 -58233 -60454 -61065 -61676 -60767 -59858 -58948 -58039 -58293
-1042 -58293 -58546 -60230 -61915 -59906 -57894 -58743 -59593 -61430 -63264 -62235 -61207 -62880 -64549 -63357 -62164 -62705 -63241 -60916
-1024 -60916 -58591 -59023 -59451 -59880 -60309 -59250 -58188 -56947 -55706 -57428 -56284 -53888 -56262 -59951 -60774 -63506 -66237 -67870
-1006 -67870 -69498 -68265 -67031 -66606 -66178 -67180 -68183 -67773 -67359 -66945 -66532 -66211 -65887 -65563 -65239 -66435 -67627 -68820 -70012
-987 -70012 -68048 -66081 -66975 -67870 -66331 -64788 -63245 -61702 -63800 -65895 -65127 -64359 -64303 -64247 -61330 -58408 -56474 -54540 -55468
-968 -55468 -56392 -58945 -61497 -65481 -69461 -68555 -67650 -65313 -62973 -63946 -64918 -63029 -61136 -63748 -66360 -66111 -65857 -65488 -65119
-949 -65119 -61889 -58654 -60074 -61494 -62913 -64329 -63148 -61967 -60786 -59601 -61699 -63797 -61125 -58449 -58140 -57830 -57521 -57208
-931 -57208 -57197 -57186 -57175 -57160 -56880 -56597 -56314 -56031 -57450 -58866 -57421 -55975 -56701 -57424 -59578 -61732 -62071 -62407 -62563 -62720 -64628 -63674
$$ packed form
-1062f5522M47M47M48q35q35k444M17K251K251K250K251O41k221o11o11R09R09R10R09k54
-1042e8293k53j684j685K009K012q49q50j837j834J029J028j673j669J192J193n41n36K325
-1024f0916K325m32m28m29m29J059J062J241J241j722J144K396k374l689q23k732k731j633
-1006f7870j628J233J234M25M28j002j003M10M14M14M13L21L24L24L24j196j192j193j192
-987g0012J964J967q94q95J539J543J543J543k098k095P68P68N6N6K917K922J934J934r28
-968e5468r24k553k552l984l980R06R05K337K340r73r72J889J893k612k612K49K54L69L69
-949f5119L230L235j420j420j419j416J181J181J181J185k098k098K672K676L09L10L09L13
-931e7208J1J1J1J5K80K83K83K83j419j416J445J446p26p23k154k154l39l36j56j57j908R54
$$ plain form
-909 -63674 -64151 -64624 -63551 -59615 -57469 -55319 -56392 -60327 -62653 -64974 -64020 -63066 -62112 -61154 -60331 -59504 -58676 -57849 -58099 -58345
-889 -58345 -58591 -58837 -59802 -60763 -61725 -62686 -63532 -64374 -62831 -61289 -60081 -58874 -59097 -59317 -61061 -62805 -62939 -65932 -66528 -67124
-869 -67124 -66349 -62708 -60204 -60562 -59131 -57696 -59254 -60812 -59984 -59153 -59340 -59526 -59712 -59895 -57741 -55587 -57726 -59861 -58751
-850 -58751 -57640 -56530 -55416 -57342 -59269 -59407 -62403 -65641 -66018 -63890 -61758 -62656 -63554 -62067 -60577 -58315 -56053 -55222
-832 -55222 -54387 -58460 -62533 -63089 -63640 -65567 -64631 -62921 -61207 -60718 -60230 -61948 -63662 -64307 -62090 -62913 -63733 -63092 -62451 -64970
-812 -64970 -67486 -68753 -67158 -66994 -66826 -67139 -64590 -63651 -62708 -61769 -60830 -58103 -58233 -59403 -57711 -57629 -57544 -59161 -57916 -56493
-792 -56493 -57927 -57413 -54037 -52271 -53362 -55382 -57402 -57216 -57026 -57838 -58647 -61665 -64680 -66029 -64512 -63178 -61840 -63234
-774 -63234 -64624 -66196 -64903 -61199 -57491 -58676 -59858 -60446 -58170 -57506 -56839 -56742 -56642 -57976 -59306 -58181 -57052 -56701 -59209
$$ packed form
-909f3674m77m73J073L936K146K150j073l935k326k321R54R54R54R58Q23Q27Q28Q27k50k46
-889e8345k46k46r65r61r62r61q46q42J543J542J208J207k23k20j744j744j34k993n96n96
-869f7124P75L641K504l58J431J435j558j558Q28Q31j87j86j86j83K154K154k139k135J110
-850e8751J111J110J114j926j927j38k996l238l77K128K132q98q98J487J490K262K262Q31
-832e5222Q35m073m073n56n51j927R36J710J714M89M88j718j714o45K217q23q20O41O41k519
-812f4970k516j267J595J64J68l13K549R39R43R39R39K727j30j170J692Q2Q5j617J245J423
-792e6493j434N14L376J766j091k020k020J86J90q12q09l018l015j349J517J334J338j394
-774f3234j390j572J293L704L708j185j182n88K276O64O67R7J00j334j330J125J129L51k508
$$ plain form
-755 -59209 -59574 -59936 -62865 -65790 -67482 -69174 -67706 -66237 -63875 -64374 -64516 -64657 -67020 -66521 -65067 -63614 -65649 -64821 -61311
-736 -61311 -57801 -58471 -59142 -59813 -60484 -60916 -61348 -59574 -57801 -57503 -60066 -62809 -62690 -60573 -61318 -63316 -62451 -64288 -66122 -64437
-716 -64437 -62753 -60864 -58971 -55468 -54827 -55814 -56798 -60346 -63893 -63062 -62228 -59187 -56146 -55509 -57730 -57685 -52871 -52382 -51891 -51101
-696 -51101 -50310 -48540 -46767 -46424 -46081 -49289 -52494 -54149 -52941 -51030 -51980 -55136 -55427 -56854 -58281 -57145 -56005 -56940 -57875
-677 -57875 -55770 -56523 -58203 -59884 -60312 -60737 -59802 -58866 -56321 -56634 -59127 -61620 -60953 -60282 -58050 -55818 -55017 -57074 -58091
-658 -58091 -54339 -53269 -55058 -55863 -56664 -57648 -58628 -59254 -59876 -60502 -61125 -62123 -63118 -62686 -62250 -59820 -57387 -58296 -59202 -59858 -60510
-637 -60510 -59735 -58956 -58986 -59012 -56657 -54298 -51987 -49673 -47542 -45406 -46197 -49845 -52900 -50229 -50072 -52777 -55125 -54611 -52755
-618 -52755 -50899 -49282 -50527 -51995 -47739 -40979 -37082 -32289 -27497 -20260 -7300 12181 41203 84772 141698 198564
$$ packed form
-755e9209l65l62k929k925j692j692J468J469K362m99j42j41k363M99J454J453k035Q28L510
-736f1311L510o70o71o71o71m32m32J774J773K98k563k743J19K117p45j998Q65j837j834J685
-716f4437J684J889J893L503O41r87r84l548l547Q31Q34L041L041O37k221M5M814M89M91P90
-696e1101P91J770J773L43L43l208l205j655J208J911r50l156k91j427j427J136J140r35r35
-677e7875K105p53j680j681m28m25R35R36K545l13k493k493O67O71K232K232Q01k057j017
-658e8091L752J070j789q05q01r84r80o26o22o26o23r98r95M32M36K430K433r09r06o56o52
-637f0510P75P79l0k6K355K359K311K314K131K136p91l648l055K671J57k705k348N14J856
-618e2755J856J617j245j468M256O760L897M793M792P237J2960J9481K9022M3569N6926N6866
$$ plain form
-602 198564 222994 196149 140684 86248 45168 12912 -5988 -17138 -22563 -27035 -31507 -36575 -41643 -43372 -45101
-587 -45101 -46413 -47724 -46651 -45578 -48663 -51749 -51496 -51242 -49439 -47635 -47262 -46890 -46301 -45712 -49416 -53120 -54976 -56832 -57257
-568 -57257 -57681 -56124 -54566 -57301 -60037 -59791 -59545 -55960 -52375 -51820 -51261 -53090 -54916 -55792 -56664 -55155 -53642 -54905 -56165
-549 -56165 -55043 -53918 -53124 -52327 -48194 -44058 -42429 -40797 -39168 -37536 -38024 -38509 -42336 -46159 -50106 -54048 -54656 -55259 -56463
-530 -56463 -57663 -57435 -57204 -56735 -56265 -59135 -62000 -62306 -62612 -62917 -63219 -62526 -61833 -60961 -60085 -59451 -55956 -52461 -51823 -51980 -52136
-509 -52136 -52651 -53161 -51797 -53295 -55569 -57838 -59589 -61341 -64702 -65198 -64087 -62977 -60078 -60037 -57782 -55524 -55829 -56135 -56653
-490 -56653 -57167 -57681 -58196 -59459 -60718 -63767 -63953 -59791 -58486 -59686 -60886 -59697 -58505 -57134 -58624 -61371 -64113 -62742
-472 -62742 -61371 -59332 -57290 -57633 -57976 -59068 -60156 -59813 -59470 -59779 -60085 -60573 -61058 -60025 -61851 -63681 -62645 -61613 -60577
$$ packed form
-602A98564K4430k6845n5465n4436m1080l2256j8900j1150n425m472m472n068n068j729j729
-587d5101j312j311J073J073l085l086K53K54J803J804L73L72N89N89l704l704j856j856m25
-568e7257m24J557J558k735k736K46K46L585L585N55N59j829j826q76q72J509J513j263j260
-549e6165J122J125P94P97M133M136J629J632J629J632m88m85l827l823l947l942o08o03j204
-530e6463j200K28K31M69M70k870k865l06l06l05l02O93O93Q72Q76O34L495L495O38j57j56
-509e2136n15n10J364j498k274k269j751j752l361m96J111J110K899M1K255K258l05l06n18
-490e6653n14n14n15j263j259l049j86M162J305j200j200J189J192J371j490k747k742J371
-472f2742J371K039K042l43l43j092j088L43L43l09l06m88m85J033j826j830J036J032J036
$$ plain form
-453 -60577 -59366 -58151 -58460 -58766 -58896 -59023 -63290 -64691 -63592 -62489 -61658 -63685 -64106 -64523 -66167 -67806 -69450 -71089 -66949
-434 -66949 -62805 -62958 -63107 -65190 -67270 -66964 -66658 -64806 -62951 -62884 -59955 -58237 -59377 -61590 -59034 -56094 -56012 -56526 -59902
-415 -59902 -60085 -57402 -54898 -55255 -55349 -55438 -53918 -55259 -57313 -56500 -57655 -58811 -58777 -61602 -62816 -64031 -62820 -61609 -60398
-396 -60398 -59187 -59407 -59627 -57462 -55296 -55494 -55692 -57320 -58948 -59176 -59403 -61061 -62720 -62075 -61430 -60786 -60141 -58721 -57301 -55882
-376 -55882 -54462 -53385 -52308 -54570 -56832 -56858 -56884 -56910 -56936 -57756 -58576 -59396 -60215 -59515 -58814 -61453 -64091 -62690 -61289 -59887 -58486
-355 -58486 -57652 -56817 -57413 -58009 -59694 -61378 -60677 -59977 -58024 -56072 -57458 -58844 -61289 -63733 -62839 -61944 -60245 -58546 -55416
-336 -55416 -52286 -53195 -54100 -55010 -55915 -55453 -54987 -54525 -54059 -57950 -61836 -62388 -62936 -62682 -62425 -59966 -57503 -58501 -62358 -65861
-316 -65861 -64590 -63234 -61874 -62604 -63331 -62884 -62433 -61985 -61535 -61296 -61054 -58430 -55803 -58650 -61494 -60998 -60502 -61680 -62854 -61643
$$ packed form
-453f0577J211J215l09l06j30j27m267j401J099J103Q31k027m21m17j644j639j644j639M140
-434f6949M144j53j49k083k080L06L06J852J855O7K929J718j140k213K556K940Q2n14l376
-415e9902j83K683K504l57r4q9J520j341k054Q13j155j156L4k825j214j215J211J211J211
-396f0398J211k20k20K165K166j98j98j628j628k28k27j658j659O45O45O44O45J420J420J419
-376e5882J420J077J077k262k262k6k6k6k6q20q20q20q19P00P01k639k638J401J401J402J401
-355e8486Q34Q35n96n96j685j684P01P00J953J952j386j386k445k444Q94Q95J699J699L130
-336e5416L130r09r05r10r05M62M66M62M66l891l886n52n48K54K57K459K463r98l857l503
-316f5861J271J356J360p30p27M47M51M48M50K39K42K624K627k847k844M96M96j178j174J211
$$ plain form
-296 -61643 -60432 -58062 -55688 -55699 -55710 -57633 -59552 -60040 -60528 -60368 -60208 -61479 -62746 -61721 -60696 -59671 -58643 -60242 -61840
-277 -61840 -62008 -62172 -63025 -63879 -62347 -60812 -60353 -59891 -60860 -61829 -61132 -60432 -56511 -58315 -57618 -56918 -56575 -56232 -55296 -54357 -53418
-256 -53418 -52479 -53102 -53724 -54346 -54965 -53560 -52155 -50750 -49342 -50590 -51838 -53087 -54331 -54745 -55159 -55572 -55982 -56783 -57585 -58386
-236 -58386 -59187 -59809 -60432 -59623 -58814 -59936 -61058 -59794 -58531 -59116 -59701 -60286 -60871 -60465 -60059 -59653 -59247 -58840 -58434 -58028 -57622
-215 -57622 -59757 -61892 -64028 -66163 -64810 -63457 -62105 -60752 -62701 -64646 -62298 -59951 -60409 -60864 -61318 -61773 -64095 -66413
-197 -66413 -65391 -64370 -61177 -57980 -57763 -57547 -60197 -57119 -58691 -60264 -61423 -62578 -62302 -62026 -58684 -55337 -57238 -59138
-179 -59138 -59314 -59485 -59656 -59828 -58907 -57983 -57059 -56135 -56288 -56437 -56586 -56735 -57156 -57573 -57991 -58408 -62705 -66998 -69263 -65805 -62679
-158 -62679 -59548 -59399 -59250 -57346 -55438 -55915 -56392 -55740 -55084 -54428 -53772 -56310 -58844 -61378 -63912 -65861 -67810 -66897 -65980 -62623
$$ packed form
-296f1643J211K370K374j1j1j923j919m88m88J60J60j271j267J025J025J025J028j599j598
-277f1840j68j64q53q54J532J535M59M62r69r69O97P00L921j804O97P00L43L43R36R39R39
-256e3418R39o23o22o22o19J405J405J405J408j248j248j249j244m14m14m13m10q01q02q01
-236e8386q01o22o23Q09Q09j122j122J264J263n85n85n85n85M06M06M06M06M07M06M06M06
-215e7622k135k135k136k135J353J353J352J353j949j945K348K347m58m55m54m55k322k318
-197f6413J022J021L193L197K17K16k650L078j572j573j159j155K76K76L342L347j901j900
-179e9138j76j71j71j72R21R24R24R24j53j49j49j49m21m17m18m17m297m293k265L458L126
-158f2679L131J49J49J904J908m77m77O52O56O56O56k538k534k534k534j949j949R13R17L357
$$ plain form
-138 -62623 -59265 -55788 -57078 -57775 -53702 -49927 -50918 -54357 -57797 -56765 -55729 -57238 -58747 -57394 -56038 -57547 -59056 -60566
-120 -60566 -62071 -61523 -60976 -60428 -59876 -60581 -61285 -61989 -62690 -58509 -54328 -53008 -51686 -54689 -57693 -59265 -60834 -61110 -61386 -61661
-100 -61661 -61933 -59854 -57775 -55695 -53612 -54186 -54760 -55632 -56500 -53765 -55800 -58013 -60223 -59142 -58062 -56504 -57804 -61285
-82 -61285 -59996 -58348 -59560 -61751 -61080 -59157 -60096 -59604 -59112 -58799 -58486 -59261 -60037 -60812 -61587 -61766 -61944 -62123 -62302 -62302 -62298 -62298 -62295 -61222
-58 -61222 -60145 -59071 -57994 -57428 -56858 -56291 -55721 -54559 -53392 -55092 -56787 -55416 -54044 -52852 -56429 -57980 -59530 -61378
-40 -61378 -63226 -62213 -61199 -57324 -53448 -52971 -52494 -53448 -54402 -53694 -52982 -53705 -54425 -55982 -57536 -59094 -60648 -59865 -59079 -58296
-20 -58296 -57510 -57801 -58088 -58378 -58665 -57823 -56981 -56139 -55293 -56806 -58319 -59832 -61341 -59902 -58464 -54879 -57014 -62969 -63200 -62239
0 -62239 -61274 -61337 -61400 -56634 -57588 -62213 -63975 -64546 -62250 -62850 -63450 -63871 -64288 -60297 -56306 -55177 -54044 -53705 -53366 -53027 -52684 -51600
$$ packed form
-138f2623L358L477j290o97M073L775r91l439l440J032J036j509j509J353J356j509j509j510
-120f0566j505N48N47N48N52p05p04p04p01M181M181J320J322l003l004j572j569k76k76k75
-100f1661k72K079K079K080K083n74n74q72q68K735k035k213k210J081J080J558j300l481
-82f1285J289J648j212k191O71J923r39M92M92L13L13p75p76p75p75j79j78j79j79%M%LJ073
-58f1222J077J074J077N66N70N67N70J162J167j700j695J371J372J192l577j551j550j848
-40f1378j848J013J014L875L876M77M77r54r54P08P12p23p20j557j554j558j554P83P86P83
-20e8296P86k91k87k90k87Q42Q42Q42Q46j513j513j513j509J439J438L585k135n955k31R61
0f2239R65o3o3M766r54m625j762n71K296o00o00m21m17L991L991J129J133L39L39L39L43J084
$$ plain form
21 -51600 -50515 -52293 -54067 -53474 -52882 -53720 -54555 -57808 -61061 -59545 -58024 -59794 -61561 -63327 -65093 -65015 -64933 -64851 -64769 -63923 -63074
42 -63074 -62224 -61374 -60528 -59679 -58829 -57980 -57894 -57808 -57722 -57637 -57014 -56392 -58632 -60871 -60301 -59731 -59161 -58591 -59034 -59478 -59921 -60361 -60622 -60879
66 -60879 -63107 -62470 -59362 -61974 -64411 -61121 -60368 -59612 -59932 -60249 -58811 -57368 -57119 -62593 -65541 -62761 -60700 -58635 -59347
85 -59347 -60055 -62198 -64337 -62917 -61494 -60074 -58650 -58393 -58132 -57875 -57614 -58788 -59962 -61136 -62310 -62887 -63465 -64042 -64620 -64110
105 -64110 -63599 -63089 -62578 -59176 -55773 -57320 -58866 -56254 -56504 -57529 -58550 -58352 -58151 -57953 -57752 -58151 -58546 -58945 -59340 -59381 -59418
126 -59418 -59459 -59496 -60167 -60834 -61322 -61810 -62686 -60700 -60502 -60305 -57991 -58539 -58907 -59276 -57111 -54946 -53556 -55028 -57160 -59288 -59392
147 -59392 -59492 -61386 -66137 -67851 -69561 -69129 -68693 -65101 -61505 -61222 -63797 -62380 -60961 -61445 -61926 -64020 -63249 -62123 -60994
166 -60994 -59511 -58024 -60804 -60718 -58132 -55542 -55133 -57581 -56992 -53538 -51030 -53292 -57640 -59124 -59597 -60070 -60186 -60297 -61702
$$ packed form
21e1600J085j778j774N93N92q38q35l253l253J516J521j770j767j766j766P8Q2Q2Q2Q46Q49
42f3074Q50Q50Q46Q49Q50Q49Q6Q6Q6Q5O23O22k240k239N70N70N70N70m43m44m43m40k61k57
66f0879k228O37L108k612k437L290P53P56l20l17J438J443K49n474k948K780K061K065p12
85e9347p08k143k139J420J423J420J424K57K61K57K61j174j174j174j174n77n78n77n78N10
105f4110N11N10N11L402L403j547j546K612k50j025j021J98K01J98K01l99l95l99l95m1l7
126e9418m1l7o71o67m88m88q76J986J98J97K314n48l68l69K165K165J390j472k132k128j04
147e9392j00j894m751j714j710M32M36L592L596K83k575J417J419m84m81k094P71J126J129
166f0994J483J487k780Q6K586K590M09k448N89L454K508k262m348j484m73m73j16j11j405
$$ plain form
185 -61702 -60245 -60577 -60905 -59656 -61270 -61274 -61274 -58814 -56355 -57234 -58110 -58035 -57961 -57886 -57808 -60514 -63219 -63539 -63856 -64147 -64437 -63297 -62153
208 -62153 -64061 -65969 -67102 -65369 -62120 -58870 -56217 -56422 -56720 -57018 -57495 -57968 -58237 -58505 -58773 -59038 -58650 -58263 -57875 -57484 -59362
229 -59362 -61240 -58170 -57957 -58874 -59791 -58501 -57208 -58483 -59757 -58647 -57532 -57067 -56601 -55658 -57573 -60774 -59206 -56504 -56660
248 -56660 -57171 -57681 -58371 -59056 -61922 -64788 -65268 -65745 -66208 -66670 -67311 -65086 -63879 -62671 -62716 -62757 -63435 -64113 -63361 -62604 -62120 -61635
270 -61635 -64370 -64240 -63484 -65589 -65906 -66222 -66152 -66081 -67262 -68443 -66770 -62235 -60085 -60797 -61747 -62697 -62395 -62094 -59724 -57353 -58322
291 -58322 -59291 -59187 -59083 -60767 -59589 -57547 -58367 -57398 -56429 -57398 -58367 -59336 -60305 -58419 -56530 -56191 -58714 -60078 -58576 -55703
311 -55703 -52830 -53791 -57611 -59820 -59168 -60160 -58285 -59273 -60260 -60178 -60092 -60186 -60279 -59213 -61005 -61188 -61371 -59947 -58520 -57272 -56023
332 -56023 -56836 -60506 -62388 -64270 -64769 -62403 -63197 -66852 -69170 -68622 -63961 -62161 -63510 -64855 -64948 -65041 -66480 -67914 -66010
$$ packed form
185f1702J457l32l28J249j614m%K460K459q79q76P5P4P5P8k706k705l20l17k91k90J140J144
208f2153j908j908j133J733L249L250K653k05k98k98m77m73k69k68k68k65L88L87L88L91j878
229e9362j878L070K13r17r17J290J293j275j274J110J115M65M66R43j915l201J568K702j56
248e6660n11n10o90o85k866k866m80m77m63m62o41K225J207J208m5m1o78o78P52P57M84M85
270f1635k735J30P56k105l17l16P0P1j181j181J673M535K150p12r50r50L02L01K370K371r69
291e8322r69J04J04j684J178K042q20R69R69r69r69r69r69J886J889L39k523j364J502K873
311e5703K873r61l820k209O52r92J875r88r87Q2Q6r4r3J066j792j83j83J424J427J248J249
332e6023q13l670j882j882m99K366p94l655k318N48M661J800j349j345r3r3j439j434J904
$$ plain form
351 -66010 -64106 -64106 -64102 -63800 -63498 -65317 -62362 -62090 -61818 -62503 -63185 -63867 -64549 -64192 -63830 -63469 -63107 -65336 -67564 -66453 -65339 -67180
373 -67180 -69021 -66569 -64113 -61855 -59597 -60677 -61754 -64654 -67553 -66159 -64762 -63886 -63010 -62135 -61255 -60648 -60040 -60864 -61684
392 -61684 -62589 -63495 -61061 -58624 -59530 -60435 -61818 -60335 -57096 -58624 -61289 -61087 -62708 -64326 -63383 -62436 -62582 -62723 -62869 -63010
412 -63010 -63603 -64192 -62399 -60603 -62593 -64579 -64184 -63785 -66461 -69133 -68470 -67802 -67191 -66576 -65965 -65350 -67422 -69491 -69178 -68861
432 -68861 -67650 -66435 -65224 -64009 -63722 -63431 -63144 -62854 -61777 -60696 -59619 -58539 -59012 -59481 -59955 -60424 -60741 -61054 -61371 -61684
452 -61684 -61792 -61896 -59619 -57339 -59384 -61427 -63472 -65514 -63864 -62209 -60558 -58904 -57089 -55274 -55844 -56414 -56955 -57495 -58035
471 -58035 -58576 -58155 -57734 -57313 -56891 -56619 -56347 -56075 -55803 -53843 -51883 -52308 -52733 -52889 -53046 -53202 -53359 -54685 -56012 -57339 -58665
492 -58665 -57905 -57145 -57816 -58486 -61005 -63525 -61572 -54849 -54417 -53985 -51645 -52166 -54991 -57816 -63323 -62153 -58896 -58501 -58464 -58427
$$ packed form
351f6010J904%ML02L02j819K955K72K72o85o82o82o82L57L62L61L62k229k228J111J114j841
373f7180j841K452K456K258K258j080j077k900k899J394J397Q76Q76Q75Q80O07O08q24q20
392f1684r05r06K434K437r06r05j383J483L239j528k665K02j621j618R43R47j46j41j46j41
412f3010n93n89J793J796j990j986L95L99k676k672O63O68O11O15O11O15k072k069L13L17
432f8861J211J215J211J215K87K91K87K90J077J081J077J080m73m69m74m69l17l13l17l13
452f1684j08j04K277K280k045k043k045k042J650J655J651J654J815J815n70n70n41n40n40
471e8035n41M21M21M21M22K72K72K72K72J960J960m25m25j56j57j56j57j326j327j327j326
492e8665P60P60o71o70k519k520J953O723M32M32K340n21k825k825n507J170L257L95L7L7
$$ plain form
512 -58427 -58345 -58263 -59791 -58457 -56437 -54417 -54901 -58248 -60588 -62928 -63897 -62004 -60171 -61199 -63480 -62898 -65052 -67203 -64885
531 -64885 -62563 -62898 -63230 -60346 -60320 -60119 -57052 -54167 -54141 -53284 -52423 -56038 -59649 -59064 -58475 -57890 -57301 -59638 -61971 -64307 -66640
552 -66640 -65026 -63409 -64180 -64948 -63394 -61836 -62667 -63495 -62831 -62168 -61505 -60841 -62354 -63867 -64605 -62481 -60171 -57860 -58054 -61110
572 -61110 -62407 -63703 -60886 -58069 -58021 -57972 -57924 -57875 -58632 -59388 -60145 -60901 -60100 -59299 -58676 -58054 -58058 -60923 -63789 -63793 -63219 -62645 -62250 -58993
$$ packed form
512e8427Q2Q2j528J334K020K020m84l347k340k340r69J893J833j028k281N82k154k151K318
531f4885K322l35l32K884K6K01L067K885K6Q57Q61l615l611N85N89N85N89k337k333k336k333
552f6640J614J617p71p68J554J558q31q28O64O63O63O64j513j513p38K124K310K311j94l056
572f1110j297j296K817K817M8M9M8M9p57p56p57p56Q01Q01O23O22mk865k866mN74N74L95L257
$$ [...]
##END=	
