##TITLE=	$eAbyiikT8SrJZVHsUiJyA/0830s
##JCAMPDX=	6.0	$$ NMR Plug-in 1.13 of MestReNova 11.0.4-18998
##DATATYPE=	NMRSPECTRUM
##DATACLASS=	XYDATA
##NUMDIM=	1
##ORIGIN=	Bruker BioSpin GmbH
##OWNER=	andrew
##.OBSERVEFREQUENCY=	600.30184456100005264
##.OBSERVENUCLEUS=	^1H
##.SOLVENTNAME=	CD2Cl2
##.PULSESEQUENCE=	zg
##LONGDATE=	2015/06/05 09:58:50.000
##.ACQUISITIONMODE=	SIMULTANEOUS (DQD)
##$ORIGINALFORMAT=	Bruker XWIN-NMR
##$PARAMETERFILE=	(acqus, ASCII, /var/folders/f6/rjf_tdyn2v98c5c0wvkgn4s80000gn/T/$eAbyiikT8SrJZVHsUiJyA/0830s/acqus, 0)
$$ ##TITLE= Parameter file, TOPSPIN		Version 2.1
$$ ##JCAMPDX= 5.0
$$ ##DATATYPE= Parameter Values
$$ ##NPOINTS= 10	$$ modification sequence number
$$ ##ORIGIN= Bruker BioSpin GmbH
$$ ##OWNER= andrew
$$ $$ 2015-06-05 14:58:50.792 +0600  andrew@av-600
$$ $$ /opt/data/andrew/nmr/limog-1782/605/acqus
$$ $$ process /opt/ts21pl6/prog/mod/shimcntl
$$ ##$ACQT0= -9.54927425515661
$$ ##$AMP= (0..31)
$$ 100 100 100 100 100 100 100 100 100 100 100 100 100 100 100 100 100 100
$$ 100 100 100 100 100 100 100 100 100 100 100 100 100 100
$$ ##$ANAVPT= -1
$$ ##$AQSEQ= 0
$$ ##$AQ_mod= 3
$$ ##$AUNM= <au_zg>
$$ ##$AUTOPOS= <>
$$ ##$BF1= 600.3
$$ ##$BF2= 600.3
$$ ##$BF3= 600.3
$$ ##$BF4= 600.3
$$ ##$BF5= 600.3
$$ ##$BF6= 600.3
$$ ##$BF7= 600.3
$$ ##$BF8= 600.3
$$ ##$BYTORDA= 0
$$ ##$CFDGTYP= 0
$$ ##$CFRGTYP= 9
$$ ##$CHEMSTR= <none>
$$ ##$CNST= (0..63)
$$ 1 1 145 1 1 1 1 1 1 1 1 1 1 1 1 1 1 1 1 1 1 1 1 1 1 1 1 1 1 1 1 1 1 1 1
$$ 1 1 1 1 1 1 1 1 1 1 1 1 1 1 1 1 1 1 1 1 1 1 1 1 1 1 1 1 1
$$ ##$CPDPRG= <>
$$ ##$CPDPRG1= <>
$$ ##$CPDPRG2= <waltz16>
$$ ##$CPDPRG3= <>
$$ ##$CPDPRG4= <mlev>
$$ ##$CPDPRG5= <mlev>
$$ ##$CPDPRG6= <mlev>
$$ ##$CPDPRG7= <mlev>
$$ ##$CPDPRG8= <mlev>
$$ ##$CPDPRGB= <>
$$ ##$CPDPRGT= <>
$$ ##$D= (0..63)
$$ 0 1 0 0 0 0 0 0 0 0.06 0 0.03 0 0 0 0 1e-04 0 0 0 0 0 0 0 0 0 0 0 0 0 0
$$ 0 0 0 0 0 0 0 0 0 0 0 0 0 0 0 0 0 0 0 0 0 0 0 0 0 0 0 0 0 0 0 0 0
$$ ##$DATE= 1433494730
$$ ##$DBL= (0..7)
$$ 120 120 120 120 120 120 120 120
$$ ##$DBP= (0..7)
$$ 150 150 150 150 150 150 150 150
$$ ##$DBP07= 0
$$ ##$DBPNAM0= <>
$$ ##$DBPNAM1= <>
$$ ##$DBPNAM2= <>
$$ ##$DBPNAM3= <>
$$ ##$DBPNAM4= <>
$$ ##$DBPNAM5= <>
$$ ##$DBPNAM6= <>
$$ ##$DBPNAM7= <>
$$ ##$DBPOAL= (0..7)
$$ 0.5 0.5 0.5 0.5 0.5 0.5 0.5 0.5
$$ ##$DBPOFFS= (0..7)
$$ 0 0 0 0 0 0 0 0
$$ ##$DE= 6.5
$$ ##$DECBNUC= <off>
$$ ##$DECIM= 2218.66666666667
$$ ##$DECNUC= <off>
$$ ##$DECSTAT= 4
$$ ##$DIGMOD= 1
$$ ##$DIGTYP= 12
$$ ##$DL= (0..7)
$$ 0 120 120 120 120 120 120 120
$$ ##$DP= (0..7)
$$ 150 150 150 150 150 150 150 150
$$ ##$DP07= 0
$$ ##$DPNAME0= <>
$$ ##$DPNAME1= <>
$$ ##$DPNAME2= <>
$$ ##$DPNAME3= <>
$$ ##$DPNAME4= <>
$$ ##$DPNAME5= <>
$$ ##$DPNAME6= <>
$$ ##$DPNAME7= <>
$$ ##$DPOAL= (0..7)
$$ 0.5 0.5 0.5 0.5 0.5 0.5 0.5 0.5
$$ ##$DPOFFS= (0..7)
$$ 0 0 0 0 0 0 0 0
$$ ##$DQDMODE= 0
$$ ##$DR= 22
$$ ##$DS= 0
$$ ##$DSLIST= <SSSSSSSSSSSSSSS>
$$ ##$DSPFIRM= 0
$$ ##$DSPFVS= 20
$$ ##$DTYPA= 0
$$ ##$EXP= <>
$$ ##$F1LIST= <111111111111111>
$$ ##$F2LIST= <222222222222222>
$$ [...]
$$ -1 -1 -1 -1 -1 -1 -1 -1 -1 -1 -1 -1 -1 -1 -1 -1 -1 -1 -1 -1 -1 -1 -1 -1
$$ -1 -1 -1 -1 -1 -1 -1 -1 -1 -1 -1 -1 -1 -1 -1 -1 -1 -1 -1 -1 -1 -1 -1 -1
$$ -1 -1 -1 -1 -1 -1 -1 -1 -1 -1 -1 -1 -1 -1 -1 -1 -1 -1 -1 -1 -1 -1 -1 -1
$$ -1 -1 -1 -1 -1 -1 -1 -1 -1 -1 -1 -1 -1 -1 -1 -1 -1 -1 -1 -1 -1 -1 -1 -1
$$ -1 -1 -1 -1 -1 -1 -1 -1 -1 -1 -1 -1 -1 -1 -1 -1
$$ ##$RG_tab8= (0..255)
$$ -1 -1 -1 -1 -1 -1 -1 -1 -1 -1 -1 -1 -1 -1 -1 -1 -1 -1 -1 -1 -1 -1 -1 -1
$$ -1 -1 -1 -1 -1 -1 -1 -1 -1 -1 -1 -1 -1 -1 -1 -1 -1 -1 -1 -1 -1 -1 -1 -1
$$ -1 -1 -1 -1 -1 -1 -1 -1 -1 -1 -1 -1 -1 -1 -1 -1 -1 -1 -1 -1 -1 -1 -1 -1
$$ -1 -1 -1 -1 -1 -1 -1 -1 -1 -1 -1 -1 -1 -1 -1 -1 -1 -1 -1 -1 -1 -1 -1 -1
$$ -1 -1 -1 -1 -1 -1 -1 -1 -1 -1 -1 -1 -1 -1 -1 -1 -1 -1 -1 -1 -1 -1 -1 -1
$$ -1 -1 -1 -1 -1 -1 -1 -1 -1 -1 -1 -1 -1 -1 -1 -1 -1 -1 -1 -1 -1 -1 -1 -1
$$ -1 -1 -1 -1 -1 -1 -1 -1 -1 -1 -1 -1 -1 -1 -1 -1 -1 -1 -1 -1 -1 -1 -1 -1
$$ -1 -1 -1 -1 -1 -1 -1 -1 -1 -1 -1 -1 -1 -1 -1 -1 -1 -1 -1 -1 -1 -1 -1 -1
$$ -1 -1 -1 -1 -1 -1 -1 -1 -1 -1 -1 -1 -1 -1 -1 -1 -1 -1 -1 -1 -1 -1 -1 -1
$$ -1 -1 -1 -1 -1 -1 -1 -1 -1 -1 -1 -1 -1 -1 -1 -1 -1 -1 -1 -1 -1 -1 -1 -1
$$ -1 -1 -1 -1 -1 -1 -1 -1 -1 -1 -1 -1 -1 -1 -1 -1
$$ ##$RG_tabA= (0..255)
$$ 0.25 0.28 0.32 0.35 0.4 0.44 0.5 0.56 0.64 0.7 0.8 0.89 1 1.12 1.28 1.4
$$ 1.6 1.78 2 2.25 2.56 2.8 3.2 3.56 4 4.5 5 5.6 6.35 7.12 8 9 10 11.3 12.7
$$ 14.2 16 18 20.2 22.6 25.4 28.5 32 36 40.3 45.2 50.8 57 64 71.8 80.6 90.5
$$ 101 114 128 144 161 181 203 -1 -1 -1 -1 -1 -1 -1 -1 -1 -1 -1 -1 -1 -1 -1
$$ -1 -1 -1 -1 -1 -1 -1 -1 -1 -1 -1 -1 -1 -1 -1 -1 -1 -1 -1 -1 -1 -1 -1 -1
$$ -1 -1 -1 -1 -1 -1 -1 -1 -1 -1 -1 -1 -1 -1 -1 -1 -1 -1 -1 -1 -1 -1 -1 -1
$$ -1 -1 -1 -1 -1 -1 -1 -1 -1 -1 -1 -1 -1 -1 -1 -1 -1 -1 -1 -1 -1 -1 -1 -1
$$ -1 -1 -1 -1 -1 -1 -1 -1 -1 -1 -1 -1 -1 -1 -1 -1 -1 -1 -1 -1 -1 -1 -1 -1
$$ -1 -1 -1 -1 -1 -1 -1 -1 -1 -1 -1 -1 -1 -1 -1 -1 -1 -1 -1 -1 -1 -1 -1 -1
$$ -1 -1 -1 -1 -1 -1 -1 -1 -1 -1 -1 -1 -1 -1 -1 -1 -1 -1 -1 -1 -1 -1 -1 -1
$$ -1 -1 -1 -1 -1 -1 -1 -1 -1 -1 -1 -1 -1 -1 -1 -1 -1 -1 -1 -1 -1 -1 -1 -1
$$ -1 -1 -1 -1 -1 -1 -1 -1 -1 -1 -1 -1 -1 -1
$$ ##$ROUT14= (0..7)
$$ 0 0 0 0 0 0 0 0
$$ ##$ROUTER= -1
$$ ##$RX22TY= <no>
$$ ##$RXFMAX= (0..7)
$$ 647.5 -1 -1 -1 -1 -1 -1 -1
$$ ##$RXFMIN= (0..7)
$$ 5 -1 -1 -1 -1 -1 -1 -1
$$ ##$RXINTLV= (0..7)
$$ 1 0 0 0 0 0 0 0
$$ ##$RXMSTY= <no>
$$ ##$SCMTY= <no>
$$ ##$SGUC1= (0..15)
$$ 17 18 34 0 0 0 0 0 0 0 0 0 0 0 0 0
$$ ##$SGUC2= (0..15)
$$ 33 256 20 0 0 0 0 0 0 0 0 0 0 0 0 0
$$ ##$SPECTR= 10
$$ ##$SY2FLAG= 0
$$ ##$TFXNUM= 0
$$ ##$TRIPLO2= 0
$$ ##$VTUTY= <tty05>
$$ ##$WBREFAM= (0..15)
$$ 100 100 100 100 100 100 100 100 100 100 100 100 100 100 100 100
$$ ##$WBREFPH= (0..15)
$$ 0 0 0 0 0 0 0 0 0 0 0 0 0 0 0 0
$$ ##$XFAC= 2
$$ ##END=
$$ 
##$DECIM=	2218.66666666667
##$DSPFVS=	20
##XUNITS=	HZ
##YUNITS=	ARBITRARY UNITS
##FIRSTX=	6322.8525384689401108
##LASTX=	-2691.4329892738592207
##XFACTOR=	-0.1375491802509010153
##YFACTOR=	1.1207768554687499944e-05
##NPOINTS=	65536
##XYDATA=	(X++(Y..Y))
$$ [...]
$$ plain form
-12278 -48772 -50270 -49983 -49692 -51641 -53585 -56965 -55571 -52006 -51302 -51074 -50847 -51305 -51764 -52222 -52680 -50575 -48470 -48750 -49029
-12259 -49029 -48325 -47621 -48347 -49074 -47688 -46298 -46343 -46384 -46577 -46767 -46961 -47151 -49916 -52676 -52281 -51883 -51846 -54666 -57490 -57449 -54267
-12238 -54267 -51082 -52013 -52941 -55422 -57900 -56089 -54275 -53857 -53436 -53198 -52956 -48783 -47468 -48839 -50206 -49927 -49644 -49364 -49081
-12219 -49081 -49934 -50784 -47762 -44737 -43101 -48139 -52106 -51302 -49696 -48086 -47613 -47136 -47084 -47032 -49364 -51697 -50780 -49864 -47337
-12200 -47337 -47673 -47159 -46645 -47561 -48478 -49841 -48343 -48455 -48567 -49312 -50057 -50624 -51190 -51965 -49878 -47792 -48567 -49759 -50951 -48209
-12180 -48209 -45467 -44603 -46600 -46033 -42606 -35456 -25445 -9950 11267 33736 42853 26516 4456 -14220 -30035
-12165 -30035 -39115 -42472 -46216 -49960 -50963 -51965 -50080 -48194 -46309 -44424 -44893 -45363 -45832 -46302 -46555 -46808 -47062 -47315 -49357
-12146 -49357 -51398 -53440 -55482 -54569 -53656 -52743 -51827 -50258 -48690 -48552 -48410 -48086 -47762 -49823 -51879 -49856 -47833 -47241 -46645
$$ packed form
-12278d8772j498K87K91j949j944l380J394L565P04K28K27m58m59m58m58K105K105k80k79
-12259d9029P04P04p26p27J386J390m5m1j93j90j94j90k765k760L95L98L7k820k824M1L182
-12238e4267L185r31r28k481k478J811J814M18M21K38K42M173J315j371j367K79K83K80K83
-12219d9081q53q50L022L025J636n038l967Q04J606J610M73M77N2N2k332k333R17R16K527
-12200d7337l36N14N14r16r17j363J498j12j12p45p45n67n66p75K087K086p75j192j192K742
-12180d8209K742Q64j997N67L427P150J0011J5495K1217K2469R117j6337k2060j8676j5815
-12165c0035r080l357l744l744j003j002J885J886J885J885m69m70m69m70k53k53k54k53k042
-12146d9357k041k042k042R13R13R13R16J569J568J38J42L24L24k061k056K023K023N92N96
$$ plain form
-12127 -46645 -46890 -47136 -47382 -47624 -47781 -47937 -51432 -54923 -55720 -56518 -55884 -55247 -54912 -54577 -52811 -51041 -52933 -54822 -53377 -51928
-12107 -51928 -50333 -48735 -49524 -50311 -50035 -49755 -49480 -49200 -49074 -48943 -48817 -48686 -48425 -48161 -47900 -47636 -48120 -48600 -46700 -44797 -45162
-12086 -45162 -45523 -45888 -46250 -46197 -46142 -46447 -46749 -43891 -46756 -49443 -49264 -48910 -48556 -50407 -52255 -52118 -51980 -51842 -51700 -52397 -53094
-12065 -53094 -53790 -54483 -56011 -57538 -56682 -55821 -55560 -55299 -53608 -51913 -49990 -48068 -46145 -44219 -45754 -47289 -48824 -50355
-12047 -50355 -51637 -52915 -51808 -50702 -49599 -48492 -49770 -51048 -50609 -50165 -49722 -49279 -48630 -47978 -44942 -41905 -45400 -48891
-12029 -48891 -49998 -51104 -50933 -50758 -50583 -50407 -52047 -53682 -55079 -51708 -48310 -51585 -53846 -53246 -51942 -50638 -51540 -52438
-12011 -52438 -52684 -52930 -53176 -53418 -54550 -55683 -56816 -57945 -57915 -57885 -55471 -53053 -52349 -51644 -50940 -50232 -49737 -49241 -48746 -48247 -49122
-11990 -49122 -49998 -50873 -51745 -49521 -47297 -46503 -45706 -45087 -44469 -47188 -49904 -49763 -49621 -51864 -54103 -53835 -53567 -51868 -50165
$$ packed form
-12127d6645k45k46k46k42j57j56l495l491p97p98O34O37L35L35J766J770j892j889J445J449
-12107e1928J595J598p89p87K76K80K75K80J26J31J26J31K61K64K61K64m84m80J900J903l65
-12086d5162l61l65l62N3N5l05l02K858k865k687J79L54L54j851j848J37J38J38J42o97o97
-12065e3094o96o93j528j527Q56Q61K61K61J691J695J923J922J923J926j535j535j535j531
-12047e0355j282j278J107J106J103J107j278j278M39M44M43M43O49O52L036L037l495l491
-12029d8891j107j106J71J75J75J76j640j635j397L371L398l275k261O00J304J304r02q98
-12011e2438k46k46k46k42j132j133j133j129L0L0K414K418P04P05P04P08M95M96M95M99q75
-11990d9122q76q75q72K224K224P94P97O19O18k719k716J41J42k243k239K68K68J699J703
$$ plain form
-11971 -50165 -50732 -51298 -50434 -49565 -50825 -52084 -51913 -51738 -52281 -52825 -53369 -53910 -53612 -53314 -53015 -52714 -55694 -58675 -57363 -56048
-11951 -56048 -52334 -48615 -49193 -49767 -49003 -48235 -50810 -53381 -54524 -55664 -56808 -57948 -58407 -58861 -56935 -55005 -55672 -56335 -53664
-11932 -53664 -50989 -49480 -47967 -46637 -45303 -46767 -51089 -53150 -50437 -49487 -48533 -47285 -46033 -46358 -46678 -47002 -47323 -47557
-11914 -47557 -47788 -48023 -48254 -49062 -49867 -49245 -48619 -47371 -46119 -49163 -52203 -53518 -54830 -54714 -54595 -57222 -59845 -57225 -54603
-11895 -54603 -52401 -50195 -52285 -54372 -53362 -52349 -48954 -45557 -45564 -45568 -47006 -48440 -52978 -57512 -57758 -58000 -57024 -56044 -52684
-11876 -52684 -49320 -47777 -46231 -44689 -43142 -43861 -44577 -47680 -50780 -50665 -50545 -51860 -53172 -53399 -53623 -53850 -54074 -53556 -53034
-11857 -53034 -52516 -51995 -50720 -49446 -48172 -46898 -48038 -49178 -50318 -51458 -52486 -53515 -53112 -52710 -55079 -57449 -56480 -55512
-11839 -55512 -54983 -54454 -55355 -56257 -54357 -52457 -51987 -51518 -53135 -54752 -53984 -53217 -50124 -47032 -46324 -45616 -44782 -43943 -44539 -45132
$$ packed form
-11971e0165n67n66Q64Q69j260j259J71J75n43n44n44n41K98K98K99L01k980k981J312J315
-11951e6048L714L719n78n74P64P68k575k571j143j140j144j140m59m54J926J930o67o63K671
-11932e3664K675J509J513J330J334j464m322k061K713R50R54J248J252l25l20l24l21k34
-11914d7557k31k35k31q08q05O22O26J248J252l044l040j315j312J16J19k627k623K620K622
-11895e4603K202K206k090k087J010J013L395L397pmj438j434m538m534k46k42R76R80L360
-11876e2684L364J543J546J542J547p19p16l103l100J15J20j315j312k27k24k27k24N18N22
-11857e3034N18N21J275J274J274J274j140j140j140j140j028j029M03M02k369k370R69R68
-11839e5512N29N29r01r02J900J900M70M69j617j617P68P67L093L092P08P08Q34Q39n96n93
$$ plain form
-11819 -45132 -46145 -47155 -46738 -46317 -45579 -44838 -48392 -51942 -51741 -51536 -52766 -53992 -51194 -48392 -47978 -47561 -46879 -46194 -45512
-11800 -45512 -44826 -46611 -48392 -48746 -49096 -49599 -50098 -52032 -53962 -53854 -53742 -56015 -58287 -58477 -58664 -58850 -59036 -57967 -56894
-11781 -56894 -55821 -54748 -52814 -50877 -48940 -47002 -46101 -45195 -47628 -50061 -48593 -47121 -45650 -44178 -45154 -46127 -47099 -48071
-11763 -48071 -50419 -52762 -51767 -50773 -52639 -54506 -53988 -53466 -52293 -51119 -49945 -48768 -48571 -48373 -48176 -47975 -47032 -46089 -47531
-11744 -47531 -48969 -48969 -48969 -48969 -48966 -47326 -45687 -47386 -49081 -49372 -49662 -51384 -53101 -55806 -58511 -56924 -55333 -54796 -54260 -53723 -53187
-11723 -53187 -53217 -53246 -53276 -53306 -55035 -56763 -58492 -60221 -60966 -61711 -61026 -60340 -58697 -57054 -55411 -53768 -52393 -51018 -49644 -48269
-11703 -48269 -48325 -48381 -48437 -48492 -49830 -51168 -52505 -53843 -51760 -49673 -50925 -52177 -54267 -56354 -55102 -53850 -52915 -51976 -51037
-11684 -51037 -50098 -48984 -47867 -48179 -48492 -47453 -46410 -45367 -44323 -45966 -47606 -49245 -50884 -52825 -54763 -54316 -53869 -54409
$$ packed form
-11819d5132j013j010M17M21P38P41l554l550K01K05j230j226K798K802M14M17O82O85O82
-11800d5512O86j785j781l54l50n03m99j934j930J08J12k273k272j90j87j86j86J069J073
-11781e6894J073J073J934J937J937J938R01R06k433k433J468J472J471J472r76r73r72r72
-11763d8071k348k343R95R94j866j867N18N22J173J174J174J177J97J98J97K01R43R43j442
-11744d7531j438%%%LJ640J639j699j695k91k90j722j717k705k705J587J591N37N36N37N36
-11723e3187l0k9l0l0j729j728j729j729p45p45O85O86J643J643J643J643J375J375J374J375
-11703d8269n6n6n6n5j338j338j337j338K083K087j252j252k090k087J252J252R35R39R39
-11684e1037R39J114J117l12l13J039J043J043J044j643j640j639j639j941j938M47M47n40
$$ plain form
-11666 -54409 -54945 -55124 -55303 -58738 -56451 -57382 -58313 -56622 -54930 -53239 -51548 -51324 -51100 -50877 -50653 -50519 -50385 -50251 -50117 -50281
-11646 -50281 -50445 -52039 -53634 -53112 -52591 -49208 -45825 -47762 -49700 -48776 -47852 -48358 -48865 -49372 -49878 -50299 -50720 -51141 -51562 -51477
-11626 -51477 -51391 -51305 -51220 -51857 -52494 -54562 -56629 -57177 -57725 -55411 -53097 -51756 -50411 -51931 -53448 -53209 -52967 -54159 -55348 -54916
-11606 -54916 -54480 -54047 -53612 -55474 -57334 -56335 -55333 -53068 -50799 -48533 -46264 -44655 -43042 -44294 -45542 -45124 -44703 -47147
-11588 -47147 -49588 -49290 -48988 -48690 -48388 -49215 -50042 -50869 -51697 -50676 -49655 -48634 -47613 -48485 -49357 -53090 -56823 -56443 -56063 -55683
-11568 -55683 -55303 -55135 -54964 -54793 -54621 -54483 -54342 -52770 -51197 -47855 -44510 -45933 -47356 -49320 -51279 -50378 -49476 -51197 -52915
-11549 -52915 -53202 -53489 -53273 -53053 -52833 -52613 -50437 -48258 -48940 -49621 -51231 -52837 -53012 -53187 -51745 -50299 -51719 -53135 -52855
-11530 -52855 -52572 -52293 -52010 -51887 -51760 -53544 -52464 -48437 -49174 -49916 -50653 -50288 -49923 -50989 -52054 -51480 -50907 -50333 -49759 -51853
$$ packed form
-11666e4409n36j79j79l435K287r31r31J691J692J691J691K24K24K23K24J34J34J34J34j64
-11646e0281j64j594j595N22N21L383L383j937j938R24R24n06n07n07n06m21m21m21m21Q5
-11626e1477Q6Q6Q5o37o37k068k067n48n48K314K314J341J345j520j517K39K42j192j189M32
-11606e4916M36M33M35j862j860R99J002K265K269K266K269J609J613j252j248M18M21k444
-11588d7147k441K98L02K98L02q27q27q27q28J021J021J021J021q72q72l733l733L80L80L80
-11568e5683L80J68J71J71J72J38J41J572J573L342L345j423j423j964j959R01R02j721j718
-11549e2915k87k87K16K20K20K20K176K179o82o81j610j606j75j75J442J446j420j416K80
-11530e2855K83K79K83J23J27j784J080M027p37p42p37L65L65j066j065N74N73N74N74k094
$$ plain form
-11510 -51853 -53947 -53179 -52412 -51704 -50996 -50288 -49580 -49871 -50158 -50445 -50732 -50665 -50594 -50523 -50452 -51227 -51998 -52770 -53541 -52825 -52106 -51387 -50668
-11487 -50668 -51972 -53276 -51719 -50158 -50210 -50262 -50314 -50363 -50407 -50452 -50497 -50538 -51417 -52296 -53176 -54051 -53828 -53600 -53373 -53146 -55098 -57047 -57565
-11464 -57565 -58082 -59155 -60225 -58433 -56641 -56193 -55743 -55292 -54841 -55713 -56581 -54588 -52594 -50516 -48433 -49212 -49990 -51324 -52654
-11445 -52654 -52553 -52453 -50597 -48738 -46879 -45020 -46961 -48899 -50840 -52777 -53168 -53556 -53947 -54334 -53757 -53176 -52598 -52017 -50307
-11426 -50307 -48593 -46883 -45169 -43724 -42274 -36060 -29842 -28903 -27960 -27021 -26079 -30117 -34152 -39622 -45087 -49215 -53340 -52699
-11408 -52699 -52054 -52106 -52155 -52203 -52252 -52602 -52948 -53295 -53641 -52658 -51670 -50683 -49696 -49428 -49156 -51268 -53381 -53906 -54427 -51611 -48794 -47859
-11386 -47859 -46920 -45981 -45042 -47468 -49890 -49927 -49964 -49796 -49625 -49454 -49282 -50009 -50735 -51462 -52185 -52315 -52445 -50191 -47934 -46246 -44558
-11365 -44558 -44301 -44040 -46048 -48057 -48634 -49208 -50404 -51596 -51358 -51119 -51242 -51361 -51480 -51600 -51954 -52304 -52654 -53004 -53358 -53708 -54059
$$ packed form
-11510e1853k094P68P67P08P08P08P08k91k87k87k87O7P1P1P1p75p71p72p71P16P19P19P19
-11487e0668j304j304J557J561n2n2n2m9m4m5m5m1q79q79q80q75K23K28K27K27j952j949n18
-11464e7565n17j073j070J792J792M48M50M51M51q72q68J993J994K078K083p79p78j334j330
-11445e2654J01J00J856J859J859J859j941j938j941j937l91l88l91l87N77N81N78N81J710
-11426e0307J714J710J714J445J450O214O218R39R43R39R42m038m035n470n465m128m125O41
-11408e2699O45n2m9m8m9l50l46l47l46R83R88R87R87K68K72k112k113n25n21K816K817R35
-11386d7859R39R39R39k426k422l7l7J68J71J71J72p27p26p27p23j30j30K254K257J688J688
-11365d4558K57K61k008k009n77n74j196j192K38K39j23j19j19j20l54l50l50l50l54l50l51
$$ plain form
-11344 -54059 -54409 -54420 -54431 -54442 -54450 -53865 -53280 -52695 -52106 -52766 -53425 -54085 -54740 -53135 -51529 -49923 -48314 -49144 -49972 -50799 -51626 -50907
-11322 -50907 -50184 -49461 -48738 -49472 -50203 -50933 -51663 -52397 -53127 -52427 -51726 -50098 -48470 -51134 -53798 -54763 -55728 -55560 -55392 -53325
-11302 -53325 -56026 -56044 -56063 -54353 -52643 -53317 -53992 -52583 -51175 -49767 -48358 -48649 -48940 -49230 -49521 -49521 -49521 -49521 -49521 -49521 -49521 -49521 -49521 -50042 -50564 -48224
-11276 -48224 -50653 -55258 -57002 -56361 -55720 -54163 -52606 -51048 -49491 -50884 -52278 -53671 -55065 -53932 -52796 -51663 -50527
-11259 -50527 -49633 -48735 -50225 -51711 -55050 -58384 -58384 -58380 -57814 -57244 -54293 -51339 -51067 -50791 -50519 -50244 -50001 -49755 -50944 -52129 -51186
-11238 -51186 -50240 -51682 -53120 -54204 -55284 -53984 -52680 -54942 -57203 -58034 -58865 -58235 -57606 -56976 -56346 -57475 -58604 -58302 -58000
-11219 -58000 -55851 -53701 -53936 -54170 -53653 -53131 -52613 -52091 -53362 -54629 -55899 -57166 -54621 -52073 -54774 -57471 -58056 -58638 -59222
-11200 -59222 -59804 -58533 -57259 -55989 -54714 -54249 -53779 -53314 -52844 -52065 -51283 -53843 -56398 -57199 -57997 -57367 -56734 -55940 -55143 -56734
$$ packed form
-11344e4059l50j1j1j1qN85N85N85N89o60o59o60o55J605J606J606J609q30q28q27q27P19
-11322e0907P23P23P23p34p31p30p30p34p30P00P01J628J628k664k664r65r65J68J68K067
-11302e3325k701j8j9J710J710o74o75J409J408J408J409k91k91k90k91%%%%%%%%n21n22K340
-11276d8224k429m605j744O41O41J557J557J558J557j393j394j393j394J133J136J133J136
-11259e0527Q94Q98j490j486l339l334%MN66N70K951K954K72K76K72K75K43K46j189j185R43
-11238e1186R46j442j438j084j080J300J304k262k261q31q31O30O29O30O30j129j129L02L02
-11219e8000K149K150k35k34N17N22N18N22j271j267j270j267K545K548k701k697n85n82n84
-11200e9222n82J271J274J270J275M65M70M65M70P79P82k560k555q01p98O30O33P94P97j591
$$ plain form
-11180 -56734 -58321 -57796 -57266 -56741 -56212 -54457 -52699 -53328 -53954 -54733 -55508 -53902 -52293 -50940 -49584 -50616 -51644 -53839 -56030
-11161 -56030 -55840 -55646 -54718 -53787 -52859 -51928 -51983 -52036 -51913 -51786 -54785 -54919 -52017 -51972 -51335 -47833 -46123 -44409 -46976 -49539 -49126
-11140 -49126 -53477 -55508 -52766 -51398 -52889 -53097 -53302 -52080 -53716 -55594 -57468 -54755 -52039 -53321 -54599 -54271 -56801
-11123 -56801 -54923 -53042 -51521 -49998 -47844 -48552 -47650 -46749 -45847 -44946 -44223 -43500 -43686 -46734 -50855 -54975 -56234 -54632 -54819
-11104 -54819 -55005 -51235 -50325 -50847 -51369 -49565 -50624 -54364 -55243 -55519 -52933 -51957 -50981 -48217 -48314 -51391 -54468 -55765 -54196
-11085 -54196 -54241 -54282 -54446 -54606 -56376 -55284 -51894 -48500 -47792 -47080 -47446 -47807 -48168 -48530 -47658 -46782 -48772 -50758 -48455 -46149
-11065 -46149 -46704 -47259 -47908 -48552 -49022 -49487 -52401 -52449 -54286 -56123 -52669 -52073 -54640 -57203 -55299 -53392 -54170 -54945 -55672 -53533
-11045 -53533 -51398 -52121 -52311 -52498 -52866 -53232 -53459 -53682 -53910 -54133 -54539 -54942 -55348 -55750 -52915 -50076 -50102 -50124 -51283 -52438 -53299
$$ packed form
-11180e6734j587N25N30N25N29J755J758o29o26p79p75J606J609J353J356j032j028k195k191
-11161e6030J90J94R28R31R28R31n5n3J23J27k999j34K902M5O37L502J710J714k567k563M13
-11140d9126m351k031K742J368j491k08k05J222j636j878j874K713K716j282j278L28k530
-11123e6801J878J881J521J523K154p08R02R01R02R01P23P23j86l048m121m120j259J602j87
-11104e4819j86L770R10n22n22J804j059l740q79k76K586R76R76K764r7l077l077j297J569
-11085e4196m5m1j64j60j770J092L390L394P08P12l66l61l61l62Q72Q76j990j986K303K306
-11065d6149n55n55o49o44m70m65k914m8j837j837L454N96k567k563J904J907p78p75p27K139
-11045e3533K135p23j90j87l68l66k27k23k28k23m06m03m06m02K835K839k6k2j159j155q61
$$ plain form
-11024 -53299 -54156 -55422 -51920 -51100 -50281 -50951 -51622 -52293 -52960 -53168 -53377 -53585 -53794 -53824 -53854 -53884 -53910 -52259 -50609 -51820 -53030
-11003 -53030 -52870 -52710 -49688 -46663 -45400 -44137 -45735 -47334 -46786 -46238 -45691 -45139 -46566 -47993 -49420 -50843 -55310 -59778
-10985 -59778 -59476 -59170 -58027 -56883 -55739 -54591 -53984 -53377 -52770 -52159 -51931 -51704 -51477 -51246 -51018 -50791 -50564 -50333 -49994 -49655 -49316
-10964 -49316 -48973 -51555 -54137 -53857 -53574 -53056 -52539 -52021 -51503 -49793 -48083 -46373 -44662 -47557 -50452 -50486 -50519 -51507 -52494 -53481
-10944 -53481 -54468 -52643 -50817 -51853 -52889 -53686 -54483 -55281 -56078 -56652 -57225 -54938 -52650 -53284 -53917 -54550 -55184 -55921 -56659 -57397
-10924 -57397 -58131 -56424 -54718 -53012 -51302 -52501 -53701 -52039 -50374 -50858 -51343 -51827 -52308 -52337 -52367 -55258 -58146 -54837 -51529
-10905 -51529 -51082 -50631 -50743 -50855 -50966 -51074 -51365 -51656 -51767 -51875 -52997 -51253 -51302 -51346 -49875 -51261 -52650 -51175 -50188 -49197 -47673
-10884 -47673 -49007 -53444 -55016 -55042 -55065 -55322 -55575 -55653 -55728 -56342 -54092 -51846 -52457 -52222 -51983 -48768 -45549 -43914 -45136 -46183
$$ packed form
-11024e3299q57j266L502Q20Q19o70o71o71o67k08k09k08k09l0l0l0k6J651J650j211j210
-11003e3030J60J60L022L025J263J263j598j599N48N48N47N52j427j427j427j423m467m468
-10985e9778L02L06J143J144J144J148O07O07O07O11K28K27K27K31K28K27K27K31L39L39L39
-10964d9316L43k582k582K80K83N18N17N18N18J710J710J710J711k895k895l4l3r88r87r87
-10944e3481r87J825J826j036j036p97p97p98p97n74n73K287K288o34o33o33o34p37p38p38
-10924e7397p34J707J706J706J710j199j200J662J665m84m85m84m81k9l0k891k888L309L308
-10905e1529M47M51j12j12j11j08k91k91j11j08j122J744m9m4J471j386j389J475R87R91J524
-10884d7673j334m437j572k6k3k57k53p8p5o14K250K246o11K35K39L215L219J635j222j047
$$ plain form
-10864 -46183 -47226 -49398 -51570 -52967 -51503 -50575 -49647 -50925 -52203 -51700 -51197 -53079 -54960 -55024 -55087 -54793 -57360 -57695 -55169
-10845 -55169 -52822 -53336 -54983 -56629 -58276 -59923 -59699 -56614 -54781 -55810 -57822 -56972 -54573 -52173 -52017 -51860 -53135 -54409
-10827 -54409 -54670 -54930 -55191 -55452 -56041 -56629 -55609 -57449 -56756 -56063 -57337 -55750 -52539 -52188 -51659 -51130 -48485 -48701 -49692 -50683
-10807 -50683 -51480 -52278 -51644 -51011 -51689 -52367 -52866 -53366 -54006 -51782 -51168 -50553 -51223 -51890 -52259 -52628 -54744 -52088 -50683 -49279
-10787 -49279 -50620 -51957 -49957 -47956 -49070 -50180 -51290 -52401 -52621 -52837 -53232 -53626 -52960 -55150 -54301 -53451 -54930 -56406
-10769 -56406 -55497 -54588 -54558 -54528 -54498 -54465 -55627 -56790 -57952 -59111 -58656 -58202 -57628 -51328 -50545 -49763 -50054 -50340 -51413 -52486 -52129
-10748 -52129 -51767 -54420 -57073 -58295 -59513 -58969 -58425 -57881 -57334 -55955 -54577 -55582 -56585 -56424 -56261 -56100 -55936 -55776 -55612
-10729 -55612 -55452 -55288 -54480 -53667 -50475 -47278 -46440 -45598 -47144 -48686 -48343 -47997 -49085 -50169 -49796 -49420 -49048 -48671 -52188 -55702
$$ packed form
-10864d6183j043k172k172j397J464R28R28j278j278N03N03j882j881o4o3K94k567l35K526
-10845e5169K347n14j647j646j647j647K24L085J833j029k012Q50K399K400J56J57j275j274
-10827e4409k61k60k61k61n89n88J020j840O93O93j274J587L211L51N29N29K645k16r91r91
-10807e0683p97p98O34O33o78o78m99n00o40K224O14O15o70o67l69l69k116K656J405J404
-10787d9279j341j337K000K001j114j110j110j111k20k16l95l94O66k190Q49Q50j479j476
-10769e6406R09R09L0L0L0L3j162j163j162j159M55M54N74O300P83P82k91k86j073j073L57
-10748e2129L62k653k653j222j218N44N44N44N47J379J378j005j003J61J63J61J64J60J64
-10729e5612J60J64Q08Q13L192L197Q38Q42j546j542L43L46j088j084L73L76L72L77l517l514
$$ plain form
-10709 -55702 -55881 -56056 -54804 -53548 -52296 -51041 -48317 -45590 -45251 -44908 -45732 -46551 -49759 -52963 -52960 -52952 -51518 -50080 -48794 -47505
-10689 -47505 -47650 -47792 -49189 -50583 -51980 -53373 -53310 -53243 -53179 -53112 -52773 -52431 -52091 -51749 -50814 -49875 -48940 -48001 -49353 -50706 -52058
-10668 -52058 -53410 -52498 -51585 -50672 -49759 -48712 -47665 -46618 -45572 -47356 -49141 -50925 -52710 -52427 -52144 -53291 -54439 -56152
-10650 -56152 -57866 -56242 -54617 -52293 -49968 -49074 -48179 -49014 -49849 -49252 -48656 -49875 -51089 -50877 -50661 -51641 -52617 -50258 -47896
-10631 -47896 -46685 -45471 -46645 -47814 -49644 -51469 -51868 -52263 -53604 -54942 -55806 -53805 -49752 -50463 -51656 -52844 -51816 -50784
-10613 -50784 -49755 -48723 -48887 -49048 -49212 -49372 -50624 -51872 -51693 -51510 -51749 -51983 -52222 -52457 -50802 -49144 -50828 -52509 -53060
-10594 -53060 -53608 -51775 -49938 -50758 -51574 -52393 -53209 -53194 -53176 -50776 -48373 -48910 -49443 -49979 -50512 -52539 -54562 -55158 -55750 -55955 -56160
-10573 -56160 -56365 -56570 -54718 -52866 -53399 -53932 -52855 -51779 -54040 -56302 -56477 -56652 -56827 -57002 -55888 -54774 -50977 -51950 -52416
$$ packed form
-10709e5702j79j75J252J256J252J255K724K727L39L43q24q19l208l204LQJ434J438J286J289
-10689d7505j45j42j397j394j397j393O3O7O4O7L39L42L40L42R35R39R35R39j352j353j352
-10668e2058j352R12R13R13R13J047J047J047J046j784j785j784j785K83K83j147j148j713
-10650e6152j714J624J625K324K325Q94Q95q35q35N97N96j219j214K12K16r80r76K359K362
-10631d7896J211J214j174j169j830j825l99l95j341j338q64K001M053p11j193j188J028J032
-10613e0784J029J032j64j61j64j60j252j248J79J83k39k34k39k35J655J658j684j681n51
-10594e3060n48J833J837q20q16q19q16J5J8K400K403n37n33n36n33k027k023n96n92k05k05
-10573e6160k05k05J852J852n33n33J077J076k261k262j75j75j75j75J114J114L797r73m66
$$ plain form
-10554 -52416 -52881 -53645 -54409 -54845 -55281 -54286 -53291 -54651 -56011 -57371 -58731 -58597 -58459 -58321 -58183 -56976 -55765 -54554 -53343
-10535 -53343 -53343 -53340 -53336 -53332 -53422 -53507 -53593 -53679 -56372 -59062 -57460 -55858 -56167 -56473 -56778 -57084 -56424 -55761 -56529 -57296 -55713 -54126 -53969 -53813
-10511 -53813 -54830 -55843 -56380 -54055 -49945 -50601 -52390 -51317 -50434 -49547 -50031 -53377 -55713 -55184 -53105 -51026 -50430 -49830 -51615
-10492 -51615 -53399 -53548 -53694 -53839 -53984 -54126 -54264 -54580 -52036 -55635 -59230 -60918 -59744 -58261 -56778 -55117 -53451 -55098
-10474 -55098 -56745 -55828 -54908 -55862 -53954 -50616 -50135 -52460 -54785 -54070 -56212 -59062 -59051 -56536 -54018 -55020 -56022 -56249 -53612
-10455 -53612 -52334 -51056 -52937 -54815 -54014 -53213 -53843 -54468 -53880 -53287 -55079 -56872 -56342 -55810 -55098 -54387 -53015 -48779 -46332
-10436 -46332 -43884 -41350 -41674 -41641 -41607 -44264 -44055 -43847 -46499 -44357 -42211 -43582 -44953 -46440 -47922 -45411 -45762 -45966 -46168
-10417 -46168 -46548 -46928 -48258 -49588 -51097 -49741 -48478 -47215 -47203 -47188 -48869 -50549 -48891 -47229 -47121 -47013 -49111 -51205 -51853
$$ packed form
-10554e2416m65p64p64m36m36R95R95j360j360j360j360J34J38J38J38J207J211J211J211
-10535e3343%LMMr0q5q6q6k693k690J602J602l09l06l05l06O60O63p68p67J583J587J57J56
-10511e3813j017j013n37K325M110o56j789J073Q83Q87m84l346k336N29K079K079N96O00j785
-10492e1615j784j49j46j45j45j42j38l16K544l599l595j688J174J483J483J661J666j647
-10474e5098j647R17R20r54J908L338M81k325k325P15k142k850J1K515K518j002j002k27K637
-10455e3612J278J278j881j878Q01Q01o30o25N88N93j792j793N30N32P12P11J372M236K447
-10436d6332K448K534l24L3L4k657K09K08k652K142K146j371j371j487j482K511l51k04k02
-10417d6168l80l80j330j330j509J356J263J263J2J5j681j680J658J662J08J08k098k094o48
$$ plain form
-10398 -51853 -49640 -50467 -51294 -51644 -51995 -52524 -53053 -51711 -53232 -54752 -53410 -55199 -56987 -56212 -55437 -54647 -53854 -53064 -52270 -53358
-10378 -53358 -54442 -55530 -56614 -56540 -56462 -56387 -56309 -56831 -57348 -56439 -55527 -55996 -56462 -53891 -51317 -48925 -51298 -52423 -53544 -53351
-10358 -53351 -53153 -54569 -55981 -52598 -52073 -53280 -54483 -54059 -53630 -53205 -52777 -53962 -55143 -56328 -57509 -58306 -59100 -57512 -55921
-10339 -55921 -58030 -60135 -60813 -61488 -60310 -59129 -56339 -56410 -56484 -56555 -56804 -57054 -55012 -52967 -53485 -54003 -52825 -54506 -59524 -61681
-10319 -61681 -59684 -57687 -56942 -56193 -55210 -54226 -53243 -52255 -53433 -54610 -57576 -57676 -54562 -54308 -52445 -50579 -50564 -53407 -54465
-10300 -54465 -55519 -57144 -55903 -56454 -57002 -57687 -61231 -63466 -60929 -59290 -57646 -57140 -56629 -57505 -58380 -59256 -60128 -59692 -59256
-10281 -59256 -58641 -58023 -57721 -54558 -53779 -55858 -56212 -56566 -56801 -57032 -58969 -56138 -53604 -51071 -48030 -44990 -45586 -49044 -48120
-10262 -48120 -47196 -48835 -50475 -50683 -50892 -49849 -48805 -47650 -49353 -50881 -52404 -52173 -51939 -51708 -51473 -52442 -53407 -52647 -49022
$$ packed form
-10398e1853K213q27q27l50l51n29n29J342j521j520J342j789j788P75P75P90P93P90P94j088
-10378e3358j084j088j084P4P8P5P8n22n17R09R12m69m66K571K574K392k373j125j121J93
-10358e3351J98j416j412L383N25j207j203M24M29M25M28j185j181j185j181p97p94J588J591
-10339e5921k109k105o78o75J178J181K790p1p4p1k49k50K042K045n18n18J178j681n018k157
-10319f1681J997J997P45P49R83R84R83R88j178j177k966j00L114K54J863J866J5k843j058
-10300e4465j054j625J241n51n48o85l544k235K537J639J644N06N11q76q75q76q72M36M36
-10281e9256O15O18L02L163P79k079l54l54k35k31j937K831K534K533L041L040n96l458R24
-10262d8120R24j639j640k08k09J043J044J155j703j528j523K31K34K31K35r69r65P60L625
$$ plain form
-10243 -49022 -48887 -48750 -48615 -48478 -46916 -48213 -47904 -47591 -48444 -49293 -52054 -51950 -49502 -51820 -55392 -54193 -52788 -51380 -50452
-10224 -50452 -52382 -52993 -53600 -53790 -51119 -48153 -48045 -47580 -47114 -48500 -49882 -48880 -47878 -49472 -51063 -52654 -54245 -53585
-10206 -53585 -52922 -48265 -46469 -46734 -46995 -49223 -48589 -48474 -51216 -52170 -53123 -53276 -53425 -53574 -53723 -54830 -55933 -54655 -53373
-10187 -53373 -52542 -51708 -52308 -52904 -53988 -55068 -54543 -54014 -55813 -54748 -53507 -55124 -55899 -53809 -51901 -52852 -53150 -53444 -52788
-10168 -52788 -52129 -53172 -58980 -60500 -57248 -54536 -51820 -50240 -48656 -46399 -44141 -45221 -46298 -47736 -49174 -49182 -49185 -47665
-10150 -47665 -46145 -47308 -51328 -54159 -56991 -55709 -54424 -54826 -55229 -54200 -53168 -52468 -51767 -51067 -50363 -52680 -54998 -54156
-10132 -54156 -53310 -53332 -56216 -56059 -55899 -56626 -57352 -54740 -52129 -49428 -46726 -47364 -48001 -47341 -46682 -46022 -45363 -44733 -44104 -45858
-10112 -45858 -47613 -51067 -54521 -55590 -56659 -54658 -52658 -53042 -53425 -52706 -51987 -51268 -50549 -49144 -47740 -48720 -49700 -48373 -47047
$$ packed form
-10243d9022J35J37J35J37J562j297L09L13q53q49k761J04K448k318l572J199J405J408R28
-10224e0452j930o11o07j90K671K966J08M65M66j386j382J002J002j594j591j591j591O60
-10206e3585O63M657J796k65k61k228O34J15k742r54r53j53j49j49j49j107j103J278J282
-10187e3373Q31Q34o00n96j084j080N25N29j799J065J241j617p75K090J908r51k98k94O56
-10168e2788O59j043n808j520L252K712K716J580J584K257K258j080j077j438j438qlJ520
-10150d7665J520j163m020k831k832J282J285m02m03J029J032P00P01P00P04k317k318Q42
-10132e4156Q46k2k884J57J60p27p26K612K611K701K702o38o37O60O59O60O59O30O29j754
-10112d5858j755l454l454j069j069K001K000l84l83P19P19P19P19J405J404r80r80J327J326
$$ plain form
-10093 -47047 -48105 -49163 -48194 -47226 -46257 -45285 -45359 -45434 -45508 -45583 -46849 -48116 -47952 -47785 -49033 -50281 -48191 -46101 -47498 -48895
-10073 -48895 -47908 -46916 -45519 -44122 -42725 -41328 -41242 -41157 -41071 -40981 -42475 -43966 -44029 -44089 -44808 -45523 -46242 -46957 -47818 -48675 -47151 -45624
-10051 -45624 -45113 -44599 -44089 -43575 -41753 -39927 -42397 -44864 -46231 -47595 -47531 -47464 -47952 -48437 -47494 -46548 -45784 -45016 -45683 -46346 -47542
-10030 -47542 -48735 -48500 -48261 -47937 -47609 -49666 -51723 -51369 -51011 -50657 -50299 -50601 -50899 -51197 -51495 -51942 -52386 -51402 -50415 -50117 -49815
-10009 -49815 -47129 -44443 -45911 -47375 -46458 -45538 -46618 -47695 -47341 -46987 -47278 -47565 -47855 -48142 -45601 -43057 -40516 -37971 -37964
-9990 -37964 -37952 -37945 -37934 -38493 -39048 -39607 -40162 -42140 -44115 -41801 -39484 -38869 -38251 -39066 -39879 -41313 -42744 -45609 -48470 -47043 -45612
-9969 -45612 -46570 -47524 -48500 -49472 -47106 -44741 -44584 -44424 -45694 -46965 -46779 -46589 -48783 -50977 -49808 -48634 -47460 -46287 -47215
-9950 -47215 -48139 -47632 -47125 -48023 -48917 -47427 -45937 -46700 -47460 -45836 -44212 -43783 -43351 -45303 -47256 -48805 -50355 -48567 -46779
$$ packed form
-10093d7047j058j058R69R68R69R72p4p5p4p5j266j267J64J67j248j248K090K090j397j397
-10073d8895R87R92J397J397J397J397Q6Q5Q6R0j494j491o3o0p19p15p19p15q61q57J524J527
-10051d5624N11N14N10N14J822J826k470k467j367j364O4O7m88m85R43R46P64P68o67o63j196
-10030d7542j193K35K39L24L28k057k057L54L58L54L58l02k98k98k98m47m44R84R87K98L02
-10009d9815K686K686j468j464R17R20j080j077L54L54k91k87k90k87K541K544K541K545P
-9990c7964J2PJ1n59n55n59n55j978j975K314K317O15O18q15q13j434j431k865k861J427J431
-9969d5612r58r54r76r72K366K365J57J60j270j271J86J90k194k194J169J174J174J173r28
-9950d7215r24N07N07q98q94J490J490p63p60J624J624M29M32j952j953j549j550J788J788
$$ plain form
-9931 -46779 -44364 -41950 -39536 -37122 -36987 -36853 -34335 -31816 -33709 -35602 -37494 -39387 -41805 -44223 -44256 -44290 -43489 -42688 -41887
-9912 -41887 -41086 -41492 -41898 -39920 -37941 -36261 -34581 -36239 -37897 -39476 -41052 -42632 -44208 -46563 -48913 -47930 -46943 -47367
-9894 -47367 -47788 -48213 -48634 -48701 -48764 -48831 -48895 -48951 -49007 -46678 -44346 -46488 -48630 -50773 -52911 -53630 -54349 -53638 -52922 -50810 -48697 -48016
-9872 -48016 -47330 -49182 -51033 -51454 -51875 -50747 -49618 -49919 -50221 -48377 -46533 -47073 -47613 -49793 -51972 -51767 -51562 -51175 -50787 -50400
-9852 -50400 -50009 -50307 -50605 -53287 -55966 -56026 -56085 -54714 -53340 -53369 -53399 -51998 -50594 -52468 -54338 -56212 -58082 -55664 -53243 -50825
-9832 -50825 -48403 -47460 -46514 -48910 -51302 -52803 -54301 -53418 -52531 -52159 -51782 -51410 -51033 -50542 -50046 -47170 -44290 -44700 -45106 -45516
-9812 -45516 -45922 -46987 -48049 -47684 -47315 -46618 -45918 -45218 -44517 -43671 -42822 -44357 -45892 -49465 -53034 -52311 -51589 -52568 -53544 -51182
-9792 -51182 -48820 -48839 -48854 -48869 -48884 -46369 -43850 -43716 -43582 -44659 -45732 -48235 -50739 -50176 -49610 -49044 -48478 -48746 -49010 -50709 -52404
$$ packed form
-9931d6779K415K414K414K414J35J34K518K519j893j893j892j893k418k418l3l4Q01Q01Q01
-9912d1887Q01m06m06J978J979J680J680j658j658j579j576j580j576k355k350R83R87m24
-9894d7367m21m25m21o7o3o7o4n6n6K329K332k142k142k143k138p19p19P11P16K112K113O81
-9872d8016O86j852j851m21m21J128J129l01l02J844J844n40n40k180k179K05K05L87L88L87
-9852e0400L91k98k98k682k679o0n9J371J374k9l0J401J404j874j870j874j870K418K421K418
-9832e0825K422R43R46k396k392j501j498Q83Q87L72L77L72L77M91M96K876K880m10m06m10
-9812d5516m06j065j062L65L69O97P00P00P01Q46Q49j535j535l573l569P23P22r79r76K362
-9792e1182K362j9j5j5j5K515K519J34J34j077j073k503k504N63N66N66N66k68k64j699j695
$$ plain form
-9771 -52404 -52315 -52222 -52132 -52039 -50475 -48906 -48772 -48634 -47457 -46276 -48437 -50594 -52788 -54983 -54793 -54603 -52893 -51182 -50903 -50624
-9751 -50624 -50627 -50631 -50635 -50638 -50732 -50825 -50918 -51011 -50706 -50400 -50273 -50147 -48232 -49178 -50124 -48209 -48768 -49327 -51495 -50802 -48023 -48105 -49618 -48269 -44800
-9726 -44800 -44189 -45311 -46428 -45016 -46462 -46123 -45780 -46812 -44979 -46190 -47397 -49532 -51663 -53023 -51518 -51924 -52330 -52736
-9708 -52736 -50277 -50385 -50493 -52807 -55117 -55411 -55705 -55225 -51879 -51637 -51395 -51153 -50907 -50583 -53120 -55657 -55329 -53872 -52416 -54118
-9688 -54118 -55817 -56611 -57404 -54860 -52311 -49469 -46626 -46466 -49163 -51078 -52993 -52702 -52408 -51969 -51529 -51089 -50646 -47650 -44655
-9669 -44655 -45952 -47244 -48571 -49897 -49793 -49685 -47483 -45281 -44510 -43735 -43768 -43802 -43835 -43865 -42110 -40356 -39197 -40896 -43791 -43824
-9649 -43824 -45646 -47464 -49409 -51350 -49957 -48560 -50117 -51670 -52751 -49059 -48008 -49815 -52758 -52837 -52144 -51447 -53735 -56018
-9631 -56018 -58787 -58690 -55910 -53131 -53544 -53954 -55974 -55132 -54346 -53556 -54018 -54480 -56108 -57732 -57628 -54662 -51607 -48548 -49606
$$ packed form
-9771e2404Q9R3R0R3J564J569J34J38J177J181k161k157k194k195J90J90J710J711K79K79
-9751e0624lmmlr4r3r3r3L05L06J27J26J915r46r46J915n59n59k168O93K779q2j513J349L469
-9726d4800O11j122j117J412j446L39L43j032J833j211j207k135k131j360J505m06m06m06
-9708e2736K459j08j08k314k310k94k94M80L346K42K42K42K46L24k537k537L28J457J456j702
-9688e4118j699p94p93K544K549K842K843J60k697j915j915K91K94M39M40M40M43K996K995
-9669d4655j297j292j327j326J04J08K202K202P71P75l3l4l3l0J755J754J159j699k895l3
-9649d3824j822j818j945j941J393J397j557j553j081L692J051j807k943p9O93O97k288k283
-9631e6018k769R7K780K779m13m10k020Q42P86P90m62m62j628j624J04K966L055L059j058
$$ plain form
-9612 -49606 -50661 -50884 -51104 -51328 -51548 -51153 -50754 -50359 -49960 -49029 -48094 -49547 -50996 -49748 -48500 -48981 -52319 -54498 -56678 -59215
-9592 -59215 -58887 -58623 -58358 -57915 -57468 -57620 -57773 -57926 -58075 -59032 -59986 -60344 -57840 -56056 -57129 -58321 -56652 -53630 -55374 -56641
-9572 -56641 -57907 -61354 -64796 -64602 -61547 -58354 -55158 -51603 -50910 -51950 -52986 -54379 -52911 -54182 -55448 -54927 -54405 -56749
-9554 -56749 -56227 -53321 -53276 -53351 -53422 -54927 -56428 -57784 -56275 -57810 -59342 -59170 -58995 -58824 -58649 -58000 -57348 -60038 -62725 -60716
-9534 -60716 -58705 -56875 -55042 -53660 -55135 -53574 -52010 -50434 -48854 -50616 -52375 -53422 -54465 -56942 -59416 -57572 -55724
-9517 -55724 -58168 -60612 -59006 -57397 -55430 -56324 -56954 -54718 -48191 -44525 -47330 -47270 -47211 -50013 -54536 -56193 -56302 -56410 -56223
-9498 -56223 -56033 -55843 -55653 -57896 -60135 -59036 -57937 -56126 -54312 -52498 -50683 -50728 -50769 -49383 -47993 -48723 -49450 -50180 -50907 -51130
-9478 -51130 -51350 -51574 -51793 -51957 -52118 -53712 -55303 -55664 -56022 -54953 -53880 -54003 -54122 -56629 -59133 -59256 -59375 -57114 -54848 -54018
$$ packed form
-9612d9606j055k23k20k24k20L95L99L95L99R31R35j453j449J248J248m81l338k179k180k537
-9592e9215L28K64K65M43M47j52j53j53j49r57r54l58K504J784j073j192J669L022j744j267
-9572e6641j266l447l442J94L055L193L196L555O93j040j036j393J468j271j266N21N22k344
-9554e6749N22K906M5p5p1j505j501j356J509j535j532J72J75J71J75O49O52k690k687K009
-9534f0716K011J830J833J382j475J561J564J576J580j762j759j047j043k477k474J844J848
-9517e5724k444k444J606J609J967q94o30K236O527L666k805O0N9k802m523j657j09j08J87
-9498e6223J90J90J90k243k239J099J099J811J814J814J815m5m1J386J390p30p27p30p27k23
-9478e1130k20k24k19j64j61j594j591l61l58J069J073j23j19k507k504j23j19K261K266Q30
$$ plain form
-9458 -54018 -53183 -53783 -54379 -55646 -56913 -56749 -56581 -57401 -58220 -59040 -59856 -61286 -62717 -59856 -56991 -54278 -51566 -51238 -50907 -50933
-9438 -50933 -50959 -49554 -48146 -52404 -56663 -57583 -58500 -57833 -57166 -57930 -58690 -56085 -53481 -52308 -51130 -51376 -51622 -51868 -52110 -52296
-9418 -52296 -52483 -52669 -52852 -54223 -55594 -54580 -53563 -51119 -48675 -49569 -53321 -55538 -52986 -50434 -52647 -57129 -58749 -57866
-9400 -57866 -54118 -52177 -53097 -54018 -52073 -51324 -53436 -53761 -54081 -51533 -48984 -47867 -46749 -47390 -48030 -50102 -52173 -53425 -54677
-9381 -54677 -54498 -54319 -51786 -49252 -47017 -44782 -38619 -37226 -36488 -35751 -35251 -34752 -37591 -40430 -43254 -46078 -48902 -51726
-9363 -51726 -51123 -50519 -51346 -52173 -52993 -53809 -53496 -53179 -50601 -52788 -55456 -58120 -58775 -56566 -55612 -57516 -59632 -58883 -56886 -57747
-9343 -57747 -56905 -56059 -55396 -54729 -52606 -50478 -52527 -51711 -48545 -48235 -46916 -48455 -48746 -49033 -52840 -56644 -58388 -60132 -58537
-9324 -58537 -56939 -54509 -52077 -52032 -51983 -49793 -47602 -48750 -49893 -51279 -52662 -52796 -52926 -51521 -52978 -54077 -55173 -57166
$$ packed form
-9458e4018Q35o00n96j267j267J64J68q20q19q20q16j430j431K861K865K713K712L28L31k6
-9438e0933k6J405J408m258m259r20r17O67O67p64p60K605K604J173J178k46k46k46k42j86
-9418e2296j87j86j83j371j371J014J017K444K444q94l752k217K552K552k213m482j620Q83
-9400e7866L748J941r20r21J945P49k112l25l20K548K549J117J118o41o40k072k071j252j252
-9381e4677J79J79K533K534K235K235O163J393P38P37N00M99k839k839k824k824k824k824
-9363e1726O03O04q27q27q20q16L13L17K578k187k668k664o55K209R54j904k116P49J997q61
-9343e7747Q42Q46O63O67K123K128k049Q16L166L10J319j539k91k87l807l804j744j744J595
-9324e8537J598K430K432M5M9K190K191j148j143j386j383j34j30J405j457j099j096j993
$$ plain form
-9306 -57166 -56294 -53697 -51097 -51317 -51536 -50325 -49111 -49152 -49189 -50661 -52129 -51145 -50162 -51384 -52602 -54182 -52900 -50188 -50333
-9287 -50333 -51719 -53105 -52285 -51462 -49569 -47677 -45605 -46391 -47881 -49372 -46749 -46984 -50620 -49487 -48831 -48172 -45653 -43135
-9269 -43135 -43001 -42863 -43086 -43310 -44964 -46615 -46790 -46961 -45702 -44443 -45300 -46156 -48265 -50374 -49998 -46756 -45303 -43850 -41891
-9250 -41891 -42792 -45244 -47695 -51462 -52363 -50702 -51901 -52565 -50366 -48824 -47282 -45057 -47598 -51570 -55541 -57129 -55854 -52196
-9232 -52196 -51398 -52803 -54208 -54360 -54513 -54278 -54044 -53809 -53574 -55337 -57099 -55523 -53947 -54606 -55266 -55925 -56585 -57021 -57456 -57892
-9212 -57892 -58328 -59122 -59915 -58325 -56734 -56573 -56413 -57684 -58954 -58347 -57740 -54748 -51756 -51492 -51227 -50963 -50698 -52252 -53805 -53928
-9192 -53928 -54051 -52281 -50512 -50173 -49834 -49912 -49990 -50068 -50147 -47960 -45773 -43586 -41399 -42431 -43463 -43064 -42665 -43653 -44640 -44197 -43753
-9171 -43753 -41313 -38873 -39771 -40668 -41004 -41339 -41674 -42006 -42401 -42796 -43191 -43582 -44439 -45296 -49491 -53682 -55791 -57900 -57624 -57345
$$ packed form
-9306e7166Q72K597K600k20k19J211J214m1l7j472j468R84R83j222j218j580J282K712j45
-9287e0333j386j386Q20Q23J893J892K072p86j490j491K623k35l636J133O56O59K519K518
-9269d3135J34J38k23k24j654j651j75j71J259J259q57q56k109k109L76L242J453J453J959
-9250d1891r01k452k451l767r01J661j199o64K199J542J542K225k541l972l971j588J275L658
-9232e2196P98j405j405j52j53K35K34K35K35j763j762J576J576o59o60o59o60m36m35m36
-9212e7892m36p94p93J590J591J61J60j271j270O07O07K992K992K64K65K64K65j554j553j23
-9192e3928j23J770J769L39L39p8p8p8p9K187K187K187K187j032j032L99L99r88r87M43M44
-9171d3753K440K440q98q97l36l35l35l32l95l95l95l91q57q57m195m191k109k109K76K79
$$ plain form
-9151 -57345 -57252 -57158 -57065 -56968 -56011 -55053 -57434 -59811 -58392 -56972 -56983 -56991 -56614 -56238 -54431 -52621 -51842 -51063 -50285 -49502 -50333 -51160 -49606
-9128 -49606 -48049 -47941 -47833 -47725 -47613 -49174 -50732 -52293 -53850 -51678 -49506 -51626 -53742 -55176 -56607 -56611 -56611 -55832 -55053 -55705
-9108 -55705 -56354 -55486 -54614 -55176 -55735 -55553 -55370 -58049 -60728 -59055 -57382 -58570 -59759 -58213 -56667 -56551 -56436 -54442 -52449
-9089 -52449 -53317 -54185 -54297 -54409 -54521 -54632 -53492 -52352 -47993 -49357 -49618 -49878 -50497 -51115 -51138 -51160 -51182 -51205 -50717 -50229 -49741 -49249
-9067 -49249 -50787 -52322 -53861 -55396 -55042 -54688 -54334 -53977 -50404 -46827 -43254 -39677 -39722 -39767 -39812 -39853 -37155 -34454 -31757 -29055
-9047 -29055 -25635 -22215 -16828 -14298 -13650 -7275 -2514 2251 10872 25219 40875 66072 108224 171364 252621 339605
-9031 339605 419111 485269 526624 516479 458879 376486 279066 187373 119312 72238 39765 20648 6714
-9018 6714 -4354 -9525 -14693 -19179 -23661 -25285 -26906 -29216 -31522 -32401 -33277 -35497 -37714 -39931 -42148 -42729 -43306 -43884
$$ packed form
-9151e7345R3R4R3R7R57R58k381k377J419J420j1qL77L76J807J810P79P79P78P83q31q27J554
-9128d9606J557J08J08J08J12j561j558j561j557K172K172k120k116j434j431m%P79P79o52
-9108e5705o49Q68Q72n62n59J82J83k679k679J673J673j188j189J546J546J16J15J994J993
-9089e2449q68q68j12j12j12j11J140J140M359j364k61k60o19o18k3k2k2k3M88M88M88M92
-9067d9249j538j535j539j535L54L54L54L57L573L577L573L577m5m5m5m1K698K701K697K702
-9047b9055L420L420N387K530O48O375M761M765Q621J4347J5656K5197M2152O3140Q1257Q6984
-9031C39605P9506O6158M1355j0145n7600q2393r7420r1693o8061m7074l2473j9117j3934
-9018F714j1068n171n168m486m482j624j621k310k306q79q76k220k217k217k217n81n77n78
$$ plain form
-9000 -43884 -44461 -43612 -42759 -41905 -41052 -41574 -42092 -42610 -43127 -45337 -47542 -46887 -46231 -46831 -47427 -46592 -45758 -45270 -44778 -42855 -40933
-8979 -40933 -40981 -41026 -41071 -41116 -42233 -43351 -39700 -36049 -35646 -35244 -34663 -29313 -21995 -14678 -8493 -2309 1133 4575 4560 1684
-8959 1684 -2823 -12100 -18873 -22785 -30512 -35378 -34998 -34618 -34640 -34663 -36116 -37569 -38813 -40057 -38441 -36824 -34532 -32237 -29946
-8940 -29946 -27651 -29234 -30814 -35259 -39700 -41619 -43534 -42591 -41645 -43295 -44942 -45162 -45378 -44152 -42923 -41697 -40467 -41417
-8922 -41417 -42364 -43314 -44260 -44890 -45516 -46145 -46771 -46387 -46000 -45616 -45229 -47017 -48805 -47732 -46659 -47077 -47494 -47434 -50236 -51756 -48507
-8901 -48507 -45080 -44513 -44275 -44037 -42546 -41056 -41339 -41622 -44767 -47911 -47807 -47703 -47598 -47494 -48567 -49640 -50713 -51786 -52024
-8882 -52024 -52263 -52501 -52740 -50255 -47766 -45277 -42788 -43612 -44431 -45251 -46071 -45970 -45866 -47192 -48519 -48567 -48612 -51518 -54424 -52259
-8862 -52259 -50091 -52691 -55292 -55035 -54774 -54513 -54252 -53138 -52021 -50903 -49785 -48671 -47554 -46436 -45318 -46641 -47963 -49107
$$ packed form
-9000d3884n77Q49Q53Q54Q53n22n18n18n17k210k205O55O56o00n96Q35Q34M88M92J923J922
-8979d0933m8m5m5m5j117j118L651L651M03M02N81N350P318P317O185O184L442L442j5k876
-8959A684m507r277o773l912p727m866L80L80k2k3j453j453j244j244J616J617K292K295K291
-8940b9946K295j583j580m445m441j919j915R43R46j650j647k20k16J226J229J226J230r50
-8922d1417r47r50r46o30o26o29o26L84L87L84L87j788j788J073J073m18m17O0k802j520L249
-8901d8507L427N67K38K38J491J490k83k83l145l144J04J04J05J04j073j073j073j073k38
-8882e2024k39k38k39K485K489K489K489q24q19q20q20J01J04j326j327m8m5k906k906K165
-8862e2259K168k600k601K57K61K61K61J114J117J118J118J114J117J118J118j323j322j144
$$ plain form
-8844 -49107 -50251 -50024 -46935 -45635 -44335 -43832 -46190 -46939 -47688 -49241 -50795 -53958 -54260 -51846 -49428 -48742 -50914 -50229 -52401
-8825 -52401 -55888 -56510 -56495 -51708 -49606 -47501 -45579 -46514 -45843 -45169 -43198 -41224 -42591 -43955 -44845 -45732 -46622 -47509 -46425
-8806 -46425 -45337 -45504 -45668 -48966 -49398 -48880 -48358 -50441 -49662 -49062 -48463 -48340 -48217 -47796 -47375 -46842 -41540 -37312 -35944 -38988
-8786 -38988 -42032 -41917 -41801 -44048 -46291 -45199 -44104 -44920 -45732 -47799 -49864 -53444 -54159 -52196 -50229 -51961 -53690 -54647
-8768 -54647 -52740 -51257 -49770 -49837 -52762 -52889 -53012 -50933 -48850 -48820 -48787 -50188 -51585 -51018 -50448 -52267 -54081 -56961 -59837
-8749 -59837 -58425 -57009 -56134 -55255 -54379 -53500 -52356 -51208 -48276 -48202 -47088 -43109 -45333 -50415 -51089 -48899 -48500 -48098 -49755
-8730 -49755 -51410 -50683 -49953 -50165 -50374 -49156 -47934 -48831 -49726 -47583 -50206 -52762 -49595 -47561 -45523 -46261 -46998 -47736 -48470
-8711 -48470 -47583 -46697 -45810 -44920 -46536 -48153 -47386 -46615 -44864 -43113 -42792 -42468 -42893 -43317 -43742 -44163 -46719 -49275 -50400 -51521
$$ packed form
-8844d9107j144K27L089J300J300N03k358p49p49j553j554l163l02K414K418O86k172O85k172
-8825e2401l487o22J5M787K102K105J922r35O71O74J971J974j367j364q90q87q90q87J084
-8806d6425J088j67j64l298m32N18N22k083P79O00N99J23J23M21M21N33N302M228J368l044
-8786c8988l044J15J16k247k243J092J095q16q12k067k065l580p15J963J967j732j729r57
-8768e4647J907J483J487o7k925j27j23K079K083L0L3j401j397N67N70j819j814k880k876
-8749e9837J412J416Q75Q79Q76Q79J144J148K932P4J114L979k224n082o74K190L99M02j657
-8730d9755j655P27P30k12k09J218J222q97q95K143k623k556L167K034K038p38p37p38p34
-8711d8470Q87Q86Q87Q90j616j617P67P71J751J751L21L24m25m24m25m21k556k556j125j121
$$ plain form
-8691 -51521 -53451 -55381 -53973 -52561 -51831 -51097 -48936 -46771 -45952 -45128 -45739 -46346 -45572 -44793 -44018 -43239 -41242 -39242 -38079
-8672 -38079 -31190 -26220 -21246 -23072 -24894 -23799 -22699 -25360 -33739 -40855 -45106 -49599 -51227 -53694 -56156 -55106 -54051
-8655 -54051 -51827 -49599 -48805 -48008 -49271 -50530 -50363 -50191 -49949 -49703 -49461 -49215 -46976 -44733 -49290 -53843 -56082 -52594 -51972
-8636 -51972 -54208 -55314 -53556 -48343 -43127 -43086 -43042 -44431 -45817 -43988 -42155 -41756 -41354 -43072 -44785 -43165 -41540 -43437
-8618 -43437 -45329 -41980 -38627 -36067 -33504 -33329 -33150 -33243 -33333 -33426 -33515 -33955 -34391 -33400 -32405 -34007 -35605 -37207 -38806 -39670 -40531
-8597 -40531 -41395 -42256 -44551 -46842 -46753 -46659 -47587 -48515 -50873 -53228 -54215 -55202 -53328 -51451 -49316 -47181 -45046 -42908 -41339
-8578 -41339 -39771 -41063 -42353 -41030 -39707 -39815 -39920 -38329 -36738 -35147 -33552 -31172 -28791 -26410 -24026 -22480 -20933
-8561 -20933 -19387 -17837 -16295 -14749 -13206 -11660 -11191 -10718 -10248 -9775 -12077 -14376 -16679 -18977 -17584 -16187 -14794 -13396
$$ packed form
-8691e1521j930j930J408J412P30P34K161K165Q19Q24o11o07P74P79P75P79J997K000J163
-8672c8079O889M970M974j826j822J095J100k661q379p116m251m493j628k467k462J050J055
-8655e4051K224K228P94P97j263j259J67J72K42K46K42K46K239K243m557m553k239L488O22
-8636e1972k236j106J758N213N216M1M4j389j386J829J833L99M02j718j713J620J625j897
-8618d3437j892L349L353K560K563J75J79r3r0r3q9m40m36R91R95j602j598j602j599q64q61
-8597d0531q64q61k295k291Q9R4r28r28k358k355r87r87J874J877K135K135K135K138J569
-8578d1339J568j292j290J323J323j08j05J591J591J591J595K380K381K381K384J546J547
-8561b0933J546J550J542J546J543J546M69M73M70M73k302k299k303k298J393J397J393J398
$$ plain form
-8543 -13396 -10308 -7215 -4127 -1035 -1523 -2007 365 2742 6844 10950 19821 28696 37805 46918 53166 59418 62190
-8526 62190 64965 69648 80054 97371 120415 150135 185577 227633 275415 319441 360607 402662 450444 507466
-8512 507466 581656 691735 868583 1140093 1558485 2187420 3138736 4559072 6526877 8695807 10530917
-8501 10530917 11350492 10706971 8984962 6784159 4749314 3242862 2260794 1646889 1263794 1012324
-8491 1012324 836557 708483 616409 549138 504799 473816 450579 427345 400531 364183 318890 267878 226817
-8478 226817 195298 165384 138335 117989 103370 90773 81042 74540 68043 62793 57547 54623 45979 39120 32265
-8463 32265 27444 22626 17805 12988 11773 10563 9348 8137 2869 -2394 -7663 -12927 -15632 -18333 -21038 -23739 -24175
-8446 -24175 -24607 -27904 -31198 -33005 -34808 -35184 -35557 -36082 -36604 -35698 -34789 -35911 -37028 -38150 -39268 -38821 -38370 -37919 -37468 -34875
$$ packed form
-8543a3396L088L093L088L092m88m84K372K377M102M106Q871Q875R109R113O248O252K772
-8526F2190K775M683J0406J7317K3044K9720L5442M2056M7782M4026M1166M2055M7782N7022
-8512E07466P4190J10079J76848K71510M18392O28935R51316J420336J967805K168930J835110
-8501A0530917Q19575o43521j722009k200803k034845j506452r82068o13905l83095k51470
-8491A012324j75767j28074r2074o7271m4339l0983k3237k3234k6814l6348m5293n1012m1061
-8478B26817l1519k9914k7049k0346j4619j2597r731o502o497n250n246k924q644o859o855
-8463C2265m821m818m821m817j215j210j215j211n268n263n269n264k705k701k705k701m36
-8446b4175m32l297l294j807j803l76l73n25n22R06R09j122j117j122j118M47M51M51M51K593
$$ plain form
-8426 -34875 -32278 -32543 -32807 -32375 -31939 -30549 -26298 -23214 -24894 -28482 -32070 -33109 -34145 -33750 -33355 -34245 -35132 -36019 -36906
-8407 -36906 -38899 -40888 -40016 -39145 -42569 -45989 -49409 -52829 -54088 -55344 -51831 -48317 -48146 -47971 -49226 -50482 -52293 -54100
-8389 -54100 -54476 -54852 -53176 -51495 -48384 -45273 -42081 -38884 -35866 -37617 -40922 -44223 -44960 -45698 -45903 -46104 -44875 -43645
-8371 -43645 -47665 -51682 -50929 -50176 -51592 -53004 -52986 -52967 -52505 -52039 -54435 -56831 -57650 -58466 -56421 -54375 -53973 -53567 -54591 -55616
-8351 -55616 -56562 -57505 -55586 -53667 -50381 -47092 -45232 -43373 -44305 -45232 -46160 -47088 -46410 -45728 -45046 -44364 -44189 -44010 -43653 -46156
-8331 -46156 -49111 -52062 -49945 -47829 -46045 -44256 -45151 -48906 -49238 -49565 -48284 -49864 -48716 -44703 -41227 -37751 -35799 -36704
-8313 -36704 -39338 -41972 -44871 -47766 -46369 -44972 -46291 -47606 -48921 -50236 -51000 -51764 -53958 -56152 -56946 -57740 -57103 -61234
-8295 -61234 -62244 -60392 -53474 -46555 -42915 -42136 -43086 -44037 -43955 -43873 -41406 -38940 -40229 -41518 -41376 -41235 -41257 -41280 -40706 -37271
$$ packed form
-8426c4875K597k65k64M32M36J390M251L084j680l588l588j039j036L95L95q90q87q87q87
-8407c6906j993j989Q72Q71l424l420l420l420j259j256L513L514J71J75j255j256j811j807
-8389e4100l76l76J676J681L111L111L192L197L018j751l305l301p37p38k05k01J229J230
-8371d3645m020m017P53P53j416j412J8J9M62M66k396k396q19q16K045K046M02M06j024j025
-8351e5616r46r43J919J919L286L289J860J859r32r27r28r28O78O82O82O82J75J79L57k503
-8331d6156k955k951K117K116J784J789q95l755l32l27J281j580J148M013L476L476J952r05
-8313c6704k634k634k899k895J397J397j319j315j315j315p64p64k194k194p94p94O37m131
-8295f1234j010J852O918O919L640P79r50r51Q2Q2K467K466j289j289J42J41k2k3N74L435
$$ plain form
-8275 -37271 -31630 -28851 -27621 -26392 -23236 -20080 -20263 -20445 -18869 -17293 -19056 -20818 -21246 -21675 -22103 -22532 -26209 -29886
-8257 -29886 -28318 -26749 -22487 -18225 -13784 -12204 -7942 -3680 -4842 -6005 -1966 2072 6468 15633 24679 28956 33531
-8240 33531 35245 37186 39131 40659 39325 39955 49172 67271 92047 121149 150254 177392 207391 244719 292542
-8225 292542 348353 397487 442904 502630 603608 766581 1029697 1433023 2040576 2950477 4361346 6559086
-8213 6559086 9687833 12136537 11449987 8563075 5737920 3726338 2438655 1684135 1261767 994869
-8203 994869 807728 674951 582114 511218 460496 427897 408053 392983 372961 336725 287136 242320 206635
-8190 206635 177627 157083 136543 117371 98198 85524 75714 67063 58412 49582 43617 39616 32753 26248 19746
-8175 19746 12146 4549 1543 1397 2619 3845 1733 -379 -1347 -5174 -10729 -16284 -18147 -20006 -23474 -24082 -25285 -26485
$$ packed form
-8275c7271N641K779J230J229L156L156j83j82J576J576j763j762m28m29m28m29l677l677
-8257b9886J568J569M262M262M441J580M262M262j162j163M039M038M396R165R046M277M575
-8240C3531J714J941J945J528j334O30R217J8099K4776K9102K9105K7138K9999L7328M7823
-8225B92542N5811M9134M5417N9726J00978J62973K63116M03326O07553R09901J410869K197740
-8213F559086L128747K448704o86550k886912k825155k011582j287683p54520m22368k66898
-8203I94869j87141j32777r2837p0896n0722l2599j9844j5070k0022l6236m9589m4816l5685
-8190B06635k9008k0544k0540j9172j9173j2674r810q651q651q830n965m001o863o505o502
-8175A9746p600p597l006j46J222J226k112k112r68l827n555n555j863j859l468o08j203j200
$$ plain form
-8157 -26485 -27684 -28884 -28806 -31585 -32576 -33567 -36619 -36805 -32699 -31455 -31973 -32487 -34611 -36734 -38869 -41000 -44387 -43001 -41291
-8138 -41291 -39577 -40907 -42233 -41850 -41462 -42688 -41049 -37356 -33660 -31399 -29134 -30449 -34622 -37368 -37248 -35911 -34570 -36391
-8120 -36391 -38210 -41477 -44741 -48008 -51272 -50575 -49875 -49953 -52889 -54860 -56831 -56596 -53496 -51771 -54815 -55355 -53030 -53943 -57717
-8101 -57717 -57140 -56559 -54133 -48846 -43738 -38627 -34614 -30602 -30106 -34376 -38381 -42386 -46689 -48127 -49182 -47375 -47177 -46976
-8083 -46976 -43470 -42826 -42002 -41175 -40728 -40281 -41563 -45702 -51037 -56372 -56819 -57263 -55735 -57069 -59655 -59375 -57043 -51849 -48265
-8064 -48265 -44677 -45504 -49193 -48887 -48578 -49823 -51067 -50404 -52598 -55698 -54029 -52658 -51283 -51372 -48600 -46007 -43411 -38884
-8046 -38884 -34357 -32513 -33530 -36127 -38724 -40247 -41771 -41566 -44223 -46879 -46674 -45754 -44834 -43735 -42636 -40717 -38794 -34491
-8028 -34491 -30184 -23944 -17700 -13843 -9984 -8944 -7901 -12107 -16310 -23288 -30263 -33903 -37539 -37632 -37721 -37811 -37900 -40080 -42256
$$ packed form
-8157b6485j199j200P8k779r91r91l052j86M106J244n18n14k124k123k135k131l387J386J710
-8138d1291J714j330j326L83L88j226J639L693L696K261K265j315m173k746J20J337J341j821
-8120c6391j819l267l264l267l264O97P00p8k936j971j971K35L100J725l044n40K325r13l774
-8101e7717N77N81K426N287N108N111M013M012M96m270m005m005m303j438j055J807J98K01
-8083d6976L506O44Q24Q27M47M47j282m139n335n335m47m44J528j334k586K80K332N194L584
-8064d8265L588q27l689L06L09j245j244O63k194l100J669J371J375q9K772K593K596M527
-8046c8884M527J844j017k597k597j523j524K05k657k656K05R20R20J099J099J919J923M303
-8028c4491M307O240O244L857L859J040J043m206m203o978o975l640l636r3q9r0q9k180k176
$$ plain form
-8009 -42256 -44431 -46607 -50083 -53556 -53869 -54182 -54379 -57434 -58105 -55914 -57006 -58097 -59010 -59919 -58746 -57572 -56398 -55221
-7991 -55221 -53757 -52293 -50650 -51864 -52397 -52930 -50303 -47673 -47669 -47665 -45456 -43247 -41931 -43478 -47408 -48478 -48615 -48753 -49070 -46525
-7971 -46525 -41507 -39350 -38921 -38493 -38083 -40534 -41376 -42218 -43656 -45095 -46354 -47613 -49513 -48552 -46995 -45437 -44268 -45959
-7953 -45959 -46041 -46123 -45493 -44864 -44234 -43601 -44521 -45441 -46361 -47278 -48049 -48820 -49592 -50359 -50534 -50709 -48500 -46287 -48399 -50512 -52147
-7932 -52147 -50918 -48887 -51626 -53112 -51734 -51887 -52039 -49629 -47215 -45937 -44659 -43381 -42099 -45128 -48153 -47844 -47531 -45344
-7914 -45344 -43154 -43351 -43545 -44003 -44458 -46346 -48232 -50448 -52662 -54878 -57091 -56410 -55724 -53612 -51495 -51112 -50724 -50340 -49953
-7895 -49953 -49167 -48377 -49022 -49662 -50158 -50650 -48105 -45557 -42792 -44797 -47337 -47013 -45620 -47088 -46767 -46443 -45564 -44685 -43806 -42923
-7875 -42923 -42312 -41701 -41089 -40475 -41183 -41891 -46890 -51887 -52207 -52527 -51417 -50303 -49126 -47949 -49156 -50359 -52013 -53667 -51983
$$ packed form
-8009d2256k175k176l476l473l13l13j97l055o71K191j092j091r13r09J173J174J174J177
-7991e5221J464J464J643j214n33n33K627K630MMK209K209J316j547l930j070j37j38l17K545
-7971d6525N018K157M29M28M10k451q42q42j438j439j259j259j900R61J557J558J169j691
-7953d5959q2q2O30O29O30O33r20r20r20r17p71p71p72p67j75j75K209K213k112k113j635
-7932e2147J229K031k739j486J378j53j52K410K414J278J278J278J282l029l025L09L13K187
-7914d5344K190j97j94m58m55j888j886k216k214k216k213O81O86K112K117L83L88L84L87
-7895d9953P86P90o45o40m96m92K545K548K765k005k540L24J393j468L21L24Q79Q79Q79Q83
-7875d2923O11O11O12O14p08p08m999m997l20l20J110J114J177J177j207j203j654j654J684
$$ plain form
-7856 -51983 -50296 -51860 -53425 -54990 -56555 -56033 -55512 -58328 -61145 -58522 -55899 -53276 -50653 -50266 -49878 -49491 -49103 -49990 -50877
-7837 -50877 -51764 -52650 -50795 -48940 -48515 -48090 -48083 -48075 -49498 -50922 -52464 -54006 -55370 -56734 -56164 -52732 -50910 -49089 -48220 -47352
-7817 -47352 -47736 -48120 -50173 -49364 -48735 -48105 -48101 -48098 -48094 -48090 -45862 -43634 -45877 -48120 -47799 -50340 -52524 -54707 -54938 -52308 -49498 -49551
-7795 -49551 -49692 -46972 -42047 -39983 -37487 -34987 -36004 -37021 -38340 -39655 -39540 -39424 -37613 -35799 -35713 -38489 -41388 -44282
-7777 -44282 -44972 -45661 -46276 -46887 -48750 -50612 -50810 -48142 -45475 -45668 -45151 -44629 -44286 -43943 -45005 -46063 -45691 -45318 -44782 -44241
-7757 -44241 -43705 -43165 -43344 -43519 -43697 -43873 -44707 -45538 -44763 -39215 -34596 -29972 -25054 -20132 -13158 -6180 3476 8368 7236
-7738 7236 6107 1219 -6526 -14812 -20233 -25836 -31436 -35996 -37692 -39569 -41443 -42271 -43094 -43917 -44741 -45300 -45855 -47840 -49826
-7719 -49826 -50951 -52073 -51466 -47997 -46261 -44521 -44808 -45095 -47744 -47527 -44748 -44830 -44946 -42196 -44573 -46950 -46589 -46224 -45858
$$ packed form
-7856e1983J687j564j565j565j565N22N21k816k817K623K623K623K623L87L88L87L88q87q87
-7837e0877q87q86J855J855M25M25PQj423j424j542j542j364j364N70L432J822J821Q69Q68
-7817d7352l84l84k053Q09O29O30MLMMK228K228k243k243L21k541k184k183k31K630K810n3
-7795d9551j41K720M925K064K496K500j017j017j319j315J15J16J811J814Q6k776k899k894
-7777d4282o90o89o15o11j863j862j98K668K667j93N17N22L43L43j062j058L72L73N36N41
-7757d4241N36N40j79j75j78j76q34q31P75N548M619M624M918M922O974O978R656M892j132
-7738G236j129m888p745q286n421n603n600m560j696j877j874q28q23q23q24n59n55j985j986
-7719d9826j125j122O07L469J736J740k87k87k649K17K779q2j16K750k377k377L61L65L66
$$ plain form
-7700 -45858 -45493 -46354 -47211 -46518 -42964 -41071 -42036 -41574 -38247 -38083 -40777 -44726 -45810 -45042 -44271 -43921 -46428 -48820 -48347 -46626
-7680 -46626 -47762 -47919 -48071 -50791 -53507 -56346 -59181 -59636 -60087 -60564 -61037 -59427 -57814 -57278 -61506 -67050 -69729 -69870 -70008
-7661 -70008 -70146 -67423 -63958 -60489 -56842 -53194 -53023 -52848 -51242 -49636 -48153 -46667 -47863 -51920 -52930 -53936 -55120 -56305
-7643 -56305 -56778 -57248 -57717 -58187 -57900 -57609 -54934 -52259 -51525 -50787 -50050 -49312 -48399 -47487 -48362 -46376 -47520 -51525 -53742 -55959
-7623 -55959 -57214 -58470 -58295 -58120 -57199 -56279 -55359 -54439 -54640 -54841 -55221 -55601 -55623 -58507 -57397 -56287 -54096 -51905 -48284 -44662
-7603 -44662 -46346 -48030 -47151 -46272 -47762 -46391 -46272 -49014 -54230 -56585 -57270 -55094 -54334 -56436 -58358 -57419 -56242 -55065
-7585 -55065 -53708 -52352 -53384 -54416 -53243 -52069 -51521 -53835 -57579 -58462 -59696 -60929 -61208 -58626 -55746 -52866 -52192 -51518
-7567 -51518 -48634 -45747 -47151 -48556 -47341 -46123 -46335 -46548 -49200 -51849 -50206 -48563 -48027 -47487 -46946 -46406 -43221 -40031
$$ packed form
-7700d5858L65q61q57O93L554J893r65M62L327J64k694l949j084P68P71L50k507k392M73J721
-7680d6626j136j57j52k720k716k839k835m55m51m77m73J610J613N36m228n544k679j41j38
-7661g0008j38K723L465L469L647L648J71J75J606J606J483J486j196m057j010j006j184j185
-7643e6305m73m70m69m70K87K91K675K675P34P38P37P38R13R12q75J986j144m005k217k217
-7623e5959j255j256J75J75R21R20R20R20k01k01l80l80k2k884J110J110K191K191L621L622
-7603d4662j684j684Q79Q79j490J371J19k742n216k355o85K176P60k102j922R39J177J177
-7585e5065J357J356j032j032J173J174N48k314l744q83j234j233k79K582K880K880O74O74
-7567e1518K884K887j404j405J215J218k12k13k652k649J643J643N36N40N41N40L185L190
$$ plain form
-7549 -40031 -39167 -41164 -46175 -45460 -43850 -42241 -42393 -42543 -46030 -49517 -47375 -45229 -43083 -40937 -34461 -27986 -22942 -17893
-7531 -17893 -11686 -5479 5019 15521 28286 41050 60610 85896 117199 148503 179985 208609 235010 255687
-7517 255687 269629 270221 256682 233605 205879 175294 144267 116100 89186 65137 45346 31277 20369 9463
-7503 9463 3059 -3341 -9745 -16146 -22521 -28892 -33836 -38776 -43206 -47632 -53850 -54342 -54837 -55329 -53083 -50832 -51112 -51387
-7485 -51387 -47375 -43358 -43042 -42721 -40020 -37315 -37371 -37423 -38910 -40393 -44621 -48846 -54088 -53604 -50583 -50422 -49726 -49029 -50180
-7466 -50180 -51331 -52483 -53634 -53176 -52717 -52259 -51801 -51134 -50467 -53138 -55810 -60877 -65944 -71011 -76078 -74021 -71964 -66570
-7448 -66570 -61175 -55869 -50564 -46689 -42814 -42367 -41920 -46719 -51518 -51827 -52132 -52442 -52747 -54010 -55269 -56533 -57792 -59263
-7430 -59263 -60731 -60772 -60810 -57125 -53436 -52136 -50832 -51309 -51782 -50828 -49871 -46592 -43310 -43370 -43426 -43455 -43481 -40173 -36861 -39215 -41566
$$ packed form
-7549d0031Q64j997n011P15J610J609j52j50l487l487K142K146K146K146O476O475N044N049
-7531a7893O207O207J0498J0502J2765J2764J9560K5286L1303L1304L1482K8624K6401K0677
-7517B55687J3942N92j3539k3077k7726l0585l1027k8167k6914k4049j9791j4069j0908j0906
-7503I463o404o400o404o401o375o371m944m940m430m426o218m92m95m92K246K251k80k75
-7485e1387M012M017L16L21K701K705n6n2j487j483m228m225n242M84L021J61O96O97j151
-7466e0180j151j152j151M58M59M58M58O67O67k671k672n067n067n067n067K057K057N394
-7448f6570N395N306N305L875L875M47M47m799m799l09l05l10l05j263j259j264j259j471
-7430e9263j468m1l8L685L689J300J304m77m73R54R57L279L282o0n6k9k6L308L312k354k351
$$ plain form
-7409 -41566 -43921 -46272 -46570 -46864 -47162 -47457 -47576 -47691 -46380 -45065 -47598 -50128 -48370 -46607 -48545 -50478 -49077 -47673
-7391 -47673 -46954 -46231 -48850 -51466 -53191 -54912 -56637 -58358 -57281 -56201 -55124 -54044 -50434 -46820 -43209 -39595 -36004
-7374 -36004 -32412 -30251 -28091 -31026 -33962 -38329 -42695 -45422 -48150 -47539 -46928 -47956 -48984 -47628 -46272 -43738 -41205
-7357 -41205 -38672 -36138 -28806 -21474 -11757 -2040 6692 15425 17004 18584 17422 16259 12712 9165 4009 -1143 -4865
-7340 -4865 -8587 -8944 -9298 -9652 -10006 -11168 -12327 -16824 -21321 -24570 -27815 -31060 -34305 -39785 -45262 -49308 -53354 -55229
-7322 -55229 -57099 -55631 -54163 -49510 -44852 -34950 -25047 -18843 -12636 -10721 -8806 -15095 -21384 -27018 -27882 -25527 -23173
-7305 -23173 -17480 -11787 -8478 -9939 -13784 -17629 -16347 -12204 -8061 -6780 -5669 -4559 -2316 -2935 -4924 -11683 -18977
-7288 -18977 -26272 -27994 -24946 -19335 -13724 -8829 -3933 783 5499 5980 3599 2649 1703 -2495 -9555 -14589 -19618 -21671
$$ packed form
-7409d1566k355k351k98k94k98k95j19j15J311J315k533k530J758J763j938j933J401J404
-7391d7673P19P23k619k616j725j721j725j721J077J080J077J080L610L614L611L614L591
-7374c6004L592K161K160k935k936m367m366k727k728O11O11j028j028J356J356K534K533
-7357d1205K533K534P332P332R717R717Q732Q733J579J580j162j163l547l547n156n152l722
-7340d865l722l57l54l54l54j162j159m497m497l249l245l245l245n480n477m046m046j875
-7322e5229j870J468J468M653M658R902R903O204O207J915J915o289o289n634q64K355K354
-7305b3173N693N693L309j461l845l845J282M143M143J281J111J110K243o19j989o759p294
-7288a8977p295j722L048N611N611M895M896M716M716M81k381r50r46m198p060n034n029k053
$$ plain form
-7270 -21671 -17048 -10934 -4816 2221 9259 12779 16304 16568 13972 11375 8782 6483 1323 -2227 -2912 -3214 -655 1904
-7252 1904 4467 12750 21032 27406 27108 20465 7146 -9391 -23068 -29473 -31108 -28094 -25080 -21649 -18217 -16813 -18270
-7235 -18270 -20650 -27800 -32327 -33992 -28329 -17897 -10148 -2398 1446 2429 2638 -14 -1891 999 4546 8092 13070
-7218 13070 20909 31251 41594 46296 48140 49984 51828 51284 47883 44660 41437 38390 35346 30752 23297 14646 8860
-7201 8860 12433 20775 32395 44019 49265 51650 48397 42287 37607 32928 29348 25771 22910 13372 -371 -9343
-7185 -9343 -12294 -8568 2172 12917 28308 46564 63654 75025 82517 87152 93213 102140 109275 116413 122326 128242
-7169 128242 130996 128030 118977 107066 94614 87889 82055 76224 69674 57406 42749 28096 18327 8562 4277
-7154 4277 -3 -5956 -17629 -32200 -41049 -37856 -17495 7813 33122 52708 66571 76053 85535 93228 100922
$$ packed form
-7270b1671M623O114O118P037P038L520L525K64k596k597k593k299n160l550o85l02K559K559
-7252A904K563Q283Q282O374k98o643j3319j6537j3677o405j635L014L014L431L432J404j457
-7235a8270k380p150m527j665N663J0432P749P750L844R83K09k652j877K890L547L546M978
-7218A3070P839J0342J0343M702J844J844J844n44l401l223l223l047l044m594p455q651n786
-7201H860L573Q342J1620J1624N246K385l253o110m680m679l580l577k861r538j3743q972
-7185i343k951L726J0740J0745J5391J8256J7090J1371P492M635O061Q927P135P138N913N916
-7169A28242K754k966r053j1911j2452o725n834n831o550j2268j4657j4653r769r765m285
-7154D277m280n953j1673j4571q849L193K0361K5308K5309J9586J3863R482R482P693P694
$$ plain form
-7139 100922 114815 128708 142184 152799 163208 179340 201732 229846 260702 291558 323249 349217 373337
-7126 373337 391735 406019 414581 421563 425683 424856 424029 418661 413292 407923 402554 405024 407495 411336 418038 431149
-7110 431149 453798 485328 522581 564246 615448 668200 715230 754823 794416 836751 896254 977217 1071533
-7097 1071533 1165015 1252773 1336836 1420899 1513904 1616446 1733712 1879592 2074353 2328248 2641259 2998147
-7085 2998147 3374584 3760562 4174018 4658057 5252253 5966629 6787527 7713344 8827529 10306060 12402697
-7074 12402697 15428317 19765616 25890302 34430112 46157455 61548261 79333046 94113427 97984502
-7065 97984502 88635479 71848907 54608423 40460091 30105885 22988809 18164704 14815141 12421023
-7056 12421023 10677385 9395414 8439635 7701079 7097959 6559965 6027693 5481831 4960766 4497308 4092984
$$ packed form
-7139A00922J3893J3893J3476J0615J0409J6132K2392K8114L0856L0856L1691K5968K4120
-7126C73337J8398J4284Q562O982M120q27q27n368n369n369n369K470K471L841O702J3111
-7110D31149K2649L1530L7253M1665N1202N2752M7030L9593L9593M2335N9503Q0963R4316
-7097A071533R3482Q7758Q4063Q4063R3005J02542J17266J45880J94761K53895L13011L56888
-7085B998147L76437L85978M13456M84039N94196P14376Q20898R25817J114185J478531K096637
-7074A2402697L025620M337299O124686Q539810J1727343J5390806J7784785J4780381L871075
-7065I7984502r349023j6786572j7240484j4148332j0354206p117076m824105l349563k394118
-7056A2421023j743638j281971r55779p38556o03120n37994n32272n45862n21065m63458m04324
$$ plain form
-7045 4092984 3730388 3396405 3078399 2773744 2490312 2243123 2037763 1872461 1738634 1637235 1572915
-7034 1572915 1544838 1543467 1559264 1586164 1618786 1628040 1578161 1465749 1320909 1179884 1059842 961249 879824
-7021 879824 804836 732711 667083 604316 547570 496546 447475 401265 360957 323510 290713 260777 235073
-7008 235073 212231 194683 186673 184623 185436 191553 203393 216605 229816 235695 235852 229093 222335 214772 212931 211091
-6992 211091 206389 201568 199608 200987 202365 209317 221992 240509 253303 259309 251962 235911 219861 208311 202484
-6977 202484 197909 187611 168424 146375 125579 110504 96354 87927 82718 71787 55617 39448 26736 19746
-6963 19746 20298 26572 33025 36616 39306 42000 45226 42734 41102 45197 50957 59582 68531 80345 93348 100631 99745
-6946 99745 89324 77886 69313 61780 59973 61798 63628 62920 62216 63117 66884 75341 89525 105314 115385 124081
$$ packed form
-7045D092984l62596l33983l18006l04655k83432k47189k05360j65302j33827j01399o4320
-7034A572915k8077j371J5797K6900L2622R254m9879j12412j44840j41025j20042r8593q1425
-7021H79824p4988p2125o5628o2767n6746n1024m9071m6210m0308l7447l2797k9936k5704
-7008B35073k2842j7548q010k050Q13O117J1840J3212J3211N879J57o759o758p563j841j840
-6992B11091m702m821j960J379J378O952J2675J8517J2794O006p347j6051j6050j1550n827
-6977B02484m575j0298j9187k2049k0796j5075j4150q427n209j0931j6170j6169j2712o990
-6963A9746N52O274O453L591K690K694L226k492j632M095N760Q625Q949J1814J3003P283q86
-6946I9745j0421j1438q573p533j807J825J830p08p04R01L767Q457J4184J5789J0071Q696
$$ plain form
-6930 124081 132780 138257 143738 148857 153976 157843 161710 172582 186315 204161 231545 266604 311200 364202 422926
-6915 422926 480399 540733 612691 698002 792680 893080 1008263 1152060 1350938 1639471 2063917 2677212
-6903 2677212 3552095 4791321 6510536 8796296 11452480 13633682 14146248 12680679 10141176 7595954
-6893 7595954 5553614 4089262 3098338 2433611 1970607 1635410 1385781 1202920 1072755 978834 905505
-6882 905505 841717 775366 706154 637277 574126 516758 465113 417129 369150 319382 279152 243359 213293
-6869 213293 189843 169255 152776 142024 133239 130176 125385 114871 103463 94916 88456 81995 78575 75155 68307
-6854 68307 61459 51929 42399 31855 24173 16431 14411 12030 9650 4348 -6675 -15732 -21928 -25322 -28716 -31723
-6838 -31723 -34730 -36008 -31563 -22409 -10393 8953 34023 61571 79581 77621 62309 44999 30551 20633 13577
$$ packed form
-6930A24081Q699N477N481N119N119L867L867J0872J3733J7846K7384L5059M4596N3002N8724
-6915D22926N7473O0334P1958Q5311R4678J00400J15183J43797J98878K88533M24446O13295
-6903B677212Q74883J239226J719215K285760K656184K181202N12566j465569k539503k545222
-6893G595954k042340j464352r90924o64727m63004l35197k49629j82861j30165r3921p3329
-6882I05505o3788o6351o9212o8877o3151n7368n1645m7984m7979m9768m0230l5793l0066
-6869B13293k3450k0588j6479j0752q785l063m791j0514j1408q547o460o461l420l420o848
-6854F8307o848r530r530j0544p682p742k020k381k380n302j1023r057o196l394l394l007
-6838c1723l007j278M445R154J2016J9346K5070K7548J8010j960j5312j7310j4448r918p056
$$ plain form
-6823 13577 6580 -416 -5446 -10475 -14581 -12964 -14566 -16168 -15624 -15080 -14536 -13993 -10945 -7897 -1988 3920 5432 6945
-6805 6945 3689 432 216 0 -1646 -3292 -11705 -20118 -32465 -44808 -54234 -57937 -57706 -57471 -53269 -49066 -39618 -30166
-6787 -30166 -16545 -2923 9564 19195 23182 21445 11840 -621 -10375 -14406 -17543 -20676 -26801 -32926 -39052 -45173
-6771 -45173 -48198 -51223 -51864 -52501 -46969 -41432 -35900 -30363 -32669 -34972 -37278 -39581 -41037 -42490 -43947 -45400 -43876
-6754 -43876 -42349 -42256 -42159 -39528 -36894 -31880 -26861 -26764 -26664 -26567 -26466 -22375 -18281 -18482 -18679 -22219 -25755 -30725 -35691 -41458
-6734 -41458 -47222 -52986 -58749 -64606 -70459 -71841 -73224 -78246 -80403 -73738 -61350 -46104 -33716 -25203 -22413 -22696
-6718 -22696 -22975 -26950 -30926 -32461 -33992 -31231 -28471 -27651 -26828 -32204 -37580 -41619 -45653 -49688 -53723 -57389 -61056 -63291
-6700 -63291 -65523 -64390 -63257 -54614 -45966 -35967 -20244 4419 38625 62275 68758 53542 21162 -6463 -20736
$$ packed form
-6823A3577o997o996n030n029m106J617j602j602N44N44N44N43L048L048N909N908J512J513
-6805F945l256l257k16k16j646j646q413q413j2347j2343r426l703K31K35M202M203R448R452
-6787c0166J3621J3622J2487R631L987j737r605j2461r754m031l137l133o125o125o126o121
-6771d5173l025l025o41o37N532N537N532N537k306k303k306k303j456j453j457j453J524
-6754d3876J527R3R7K631K634N014N019R7J00R7J01M091M094k01j97l540l536m970m966n767
-6734d1458n764n764n763n857n853j382j383n022k157O665J2388J5246J2388Q513K790k83
-6718b2696k79l975l976j535j531K761K760Q20Q23n376n376m039m034m035m035l666l667k235
-6700f3291k232J133J133Q643Q648R999J5723K4663L4206K3650O483j5216l2380k7625j4273
$$ plain form
-6685 -20736 -27260 -28057 -26503 -24950 -23038 -21123 -17230 -13337 -14689 -16038 -15751 -15464 -15177 -14887 -17908 -20926 -24123 -27319
-6667 -27319 -32725 -40989 -46033 -51078 -53772 -53600 -53310 -50158 -45996 -41831 -41481 -38269 -30397 -22521 -19890 -22029 -22442 -22852
-6649 -22852 -21176 -19499 -17603 -15703 -15233 -14764 -12122 -9477 -5222 -3829 -137 3555 4385 5220 2325 -5338 -10498 -15654
-6631 -15654 -20621 -28448 -37349 -41477 -39648 -37818 -36466 -37971 -41987 -46004 -49424 -49979 -49197 -48414 -46678 -42077 -39849 -37621
-6613 -37621 -37718 -33042 -21246 -6590 13372 33338 55524 84391 114450 144509 175041 200808 222223 238870
-6599 238870 248076 246794 234425 211564 179817 145213 111682 81012 55435 34631 19907 8044 1721 -1735
-6585 -1735 -5192 -8650 -12245 -15837 -23065 -33154 -39402 -45646 -52069 -58492 -63712 -68928 -69856 -70780 -69710 -68637 -67091
-6568 -67091 -60772 -49465 -41015 -36205 -31392 -31470 -36313 -43724 -51130 -55411 -59688 -60631 -61570 -62214 -62855 -63321 -63783 -63503 -60359
$$ packed form
-6685b0736o524p97J554J553J912J915L893L893j352j349K87K87K87K90l021l018l197l196
-6667b7319n406q264n044n045k694J72K90L152M162M165L50L212P872P876K631k139m13m10
-6649b2852J676J677J896J900M70M69K642K645M255J393L692L692Q30Q35k895p663n160n156
-6631a5654m967p827q901m128J829J830J352j505m016m017l420n55P82P83J736M601K228K228
-6613c7621r7M676J1796J4656J9962J9966K2186K8867L0059L0059L0532K5767K1415J6647
-6599B38870R206j282j2369k2861l1747l4604l3531l0670k5577k0804j4724j1863o323l456
-6585a735l457l458l595l592p228j0089o248o244o423o423n220n216r28r24J070J073J546
-6568f7091O319J1307Q450M810M813p8m843p411p406m281m277r43r39o44o41m66m62K80L144
$$ plain form
-6549 -60359 -58828 -57293 -49174 -41052 -31324 -24454 -18769 -13080 -10733 -8382 -5885 -524 6144 12817 17191 14892 6211
-6532 6211 -5327 -13471 -18750 -21351 -19179 -14771 -10360 -9470 -15252 -31052 -53526 -74393 -82858 -78749 -74636 -74163 -76547
-6515 -76547 -83048 -86685 -83887 -78224 -73522 -71681 -72821 -71100 -61510 -49059 -35415 -24633 -20900 -23843 -30840 -34976
-6499 -34976 -34938 -32040 -25326 -18612 -12018 -5423 -4254 -3084 -3762 -7301 -13225 -19149 -18322 -12726 -7309 969 9933 16036
-6481 16036 23927 31818 32227 32637 35312 42756 49813 52100 54030 55960 60826 65692 74492 86153 98172 114960 134014
-6464 134014 155928 180697 208326 243825 286000 340335 412793 508975 634725 796897 1005804 1264666 1572170
-6451 1572170 1917944 2281841 2633815 2937146 3159183 3271535 3257631 3126411 2898622 2601207 2273987
-6440 2273987 1949628 1653763 1397003 1186024 1021780 901768 811323 739238 677645 624203 575531 526203
$$ packed form
-6549f0359J531J535Q119Q122R728O870N685N689K347K351K497N361O668O673M374k299q681
-6532F211j1538q144n279k601K172M408M411Q90n782j5800k2474k0867q465M109M113M73k384
-6515g6547o501l637K798N663M702J841j140J721R590J2451J3644J0782L733k943o997m136
-6499c4976L8K898O714O714O594O595J169J170o78l539n924n924Q27N596N417Q278Q964O103
-6481A6036P891P891M09M10K675P444P057K287J930J930M866M866Q800J1661J2019J6788J9054
-6464A34014K1914K4769K7629L5499M2175N4335P2458R6182J25750J62172K08907K58862L07504
-6451A572170L45774L63897L51974L03331K22037J12352j3904j31220k27789k97415l27220
-6440B273987l24359k95865k56760k10979j64244j20012r0445p2085o1593n3442m8672m9328
$$ plain form
-6428 526203 470198 410438 350678 293481 242960 203304 172232 149803 132143 125035 117926 109744 108239 115396
-6414 115396 122553 126789 131026 134367 137709 144390 151070 156081 161092 174031 186971 202294 214757 225014 229548
-6399 229548 223989 205077 184974 159147 128641 103858 89924 81712 77629 73545 69820 66094 62517 58941 57391
-6384 57391 55841 52987 44414 33096 27503 30789 43617 63713 83814 99856 106365 103034 93985 87793 84465 82148
-6368 82148 79834 79883 74212 62041 47011 35376 33282 32734 35052 43595 61679 80296 89380 87252 67961 39783
-6352 39783 14471 2459 -3825 -8501 -13177 -10882 -2860 9333 27250 46236 59503 66809 60763 45621 24761
-6337 24761 6643 -11474 -21291 -25382 -21425 -20330 -20788 -26965 -37077 -47188 -52922 -55791 -56693 -63317 -73313 -77583
-6321 -77583 -74997 -66689 -55154 -46477 -41082 -35684 -34074 -32461 -25963 -13739 2534 18811 35085 51363 64745
$$ packed form
-6428E26203n6005n9760n9760n7197n0521l9656l1072k2429j7660p108p109q182j505P157
-6414A15396P157M236M237L341L342O681O680N011N011J2939J2940J5323J2463J0257M534
-6399B29548n559j8912k0103k5827l0506k4783j3934q212m083m084l725l726l577l576j550
-6384E7391j550k854q573j1318n593L286J2828K0096K0101J6042O509l331r049o192l328k317
-6368H2148k314M9n671j2171j5030j1635k094n48K318Q543J8084J8617R084k128j9291k8178
-6352C9783k5312j2012o284m676m676K295Q022J2193J7917J8986J3267P306o046j5142k0860
-6337B4761j8118j8117r817m091L957J095m58o177j0112j0111n734k869r02o624r996m270
-6321g7583K586Q308J1535Q677N395N398J610J613O498J2224J6273J6277J6274J6278J3382
$$ plain form
-6306 64745 72409 77148 79030 77759 66955 47086 24359 11881 12761 27645 48255 77625 101276 115862 120914
-6291 120914 114755 102878 92606 82338 77197 78732 89268 106484 129151 148957 161789 166040 162508 158976 156696
-6276 156696 151558 145671 142646 145701 157344 178211 196218 209336 219597 219362 195283 146167 82748 25942 -16556
-6261 -16556 -41768 -56484 -62322 -65299 -65415 -58850 -42885 -20244 7820 35890 57935 75211 93023 106071 108683
-6246 108683 102710 92982 83258 68941 51761 40364 41370 53665 68821 88985 113921 141417 160328 166125
-6232 166125 163342 167068 175563 186918 195417 205044 217532 237472 257416 268399 266984 250129 218967 183752 157120
-6217 157120 154930 178491 220263 266805 310723 338428 345655 342392 339724 337057 329292 321528 314062 306595 302795
-6202 302795 303764 311767 332168 359754 387339 412480 425221 422524 416965 417964 421824 418094 401966 378803 362317
$$ packed form
-6306F4745P664M739J882j271j0804j9869k2727j2478Q80J4884K0610K9370K3651J4586N052
-6291A20914o159j1877j0272j0268n141J535J0536J7216K2667J9806J2832M251l532l532k280
-6276A56696n138n887l025L055J1643K0867J8007J3118J0261k35k4079m9116o3419n6806m2498
-6261a6556k5212j4716n838k977j16O565J5965K2641K8064K8070K2045J7276J7812J3048K612
-6246A08683n973r728r724j4317j7180j1397J006J2295J5156K0164K4936K7496J8911N797
-6232A66125k783L726Q495J1355Q499R627J2488J9940J9944J0983j415j6855l1162l5215k6632
-6217A57120k190K3561M1772M6542M3918K7705P227l263k668k667p765p764p466p467l800
-6202C02795R69Q003K0401K7586K7585K5141J2741k697n559R99L860l730j6128k3163j6486
$$ plain form
-6187 362317 358409 363084 379325 409872 458674 517969 583225 641804 671591 641290 531825 377533 237048
-6174 237048 143298 98072 93858 121715 165786 215103 248206 255512 237066 202645 171084 163130 190465 243612
-6160 243612 299621 342205 367626 378557 379954 375029 375830 388311 414149 453276 501945 556332 620262 682220
-6146 682220 727014 759763 792516 825711 845558 841318 816099 781279 746462 720524 694589 661781 631837 625556
-6132 625556 651707 712249 789963 861474 908191 915296 882342 827094 771849 734007 713333 696832 659352 578933
-6118 578933 462270 361821 328141 374396 479784 617602 768775 915672 1045401 1146278 1203285 1231436
-6106 1231436 1265310 1318498 1377413 1432806 1493923 1555278 1588023 1560795 1470619 1343662 1219570 1139799 1111532
-6093 1111532 1099539 1051306 939524 787683 623205 475898 379943 346937 327284 259946 129714 -25315
$$ packed form
-6187C62317l908M675J6241L0547M8802N9295O5256N8579K9787l0301j09465j54292j40485
-6174B37048r3750m5226m214K7857M4071M9317L3103P306j8446l4421l1561p954K7335N3147
-6160B43612N6009M2584K5421J0931J397m925Q01J2481K5838L9127M8669N4387O3930O1958
-6146F82220M4794L2749L2753L3195J9847m240k5219l4820l4817k5938k5935l2808k9944o281
-6132F25556K6151O0542P7714P1511M6717P105l2954n5248n5245l7842k0674j6501l7480q0419
-6118E78933j16663j00449l3680M6255J05388J37818J51173J46897J29729J00877N7007K8151
-6106A231436L3874N3188N8915N5393O1117O1355L2745k7228r0176j26957j24092p9771k8267
-6093A111532j1993m8233j11782j51841j64478j47307r5955l3006j9653o7338j30232j55029
$$ plain form
-6081 -25315 -110004 -36362 170935 425922 659925 842429 971099 1067342 1144270 1211664 1290246 1397442
-6069 1397442 1508692 1602777 1684578 1783547 1934021 2155078 2430928 2727766 3026268 3315237 3560448 3750343
-6057 3750343 3892068 3997554 4075287 4132040 4171145 4185456 4161373 4097235 3999949 3893130 3817472 3789507 3763923
-6044 3763923 3721174 3706022 3791974 3989037 4264314 4594161 4983146 5401456 5798787 6127292 6389037 6626696
-6032 6626696 6927307 7398854 8105034 8930198 9730563 10452446 11134275 11796790 12476474 13174989 13947903
-6021 13947903 14955686 16446080 18565250 21304379 24506804 27966752 31489015 35142904 39322322
-6012 39322322 44476503 50590062 57186237 63957429 71722462 82592074 99312153 125037815 163591799
-6003 163591799 219906323 301398696 418133871 579313229 777462793 951124947 1000000000 898653060
$$ packed form
-6081b5315q4689P3642K07297K54987K34003J82504J28670R6243P6928O7394P8582J07196
-6069A397442J11250R4085Q1801R8969J50474K21057K75850K96838K98502K88969K45211J89895
-6057C750343J41725J05486P7733N6753L9105J4311k4083o4138r7286j06819p5658k7965k5584
-6044C763923m2749j5152Q5952J97063K75277L29847L88985M18310L97331L28505K61745K37659
-6032F626696L00611M71547P06180Q25164Q00365P21883O81829O62515O79684O98515P72914
-6021A3947903J007783J490394K119170K739129L202425L459948L522263L653889M179418
-6012C9322322N154181O113559O596175O771192P765033J0869612J6720079K5725662L8553984
-6003A63591799N6314524Q1492373J16735175J61179358J98149564J73662154M8875053j01346940
$$ plain form
-5995 898653060 717338306 532538509 382438067 275240518 205001086 159954784 130295061 110289472
-5987 110289472 97075980 89194109 86069690 86876745 88661766 86530589 78763291 68155638 58007468
-5978 58007468 49772578 43516302 38707862 34803753 31447113 28573560 26312334 24886618 24416587 25035057
-5968 25035057 26853379 29633379 31762900 31142442 27979214 24149411 20867075 18504420 17108901 16680106
-5958 16680106 17214628 18793537 21587565 26008377 32739238 42509555 54673860 64094091 63600741 53659026
-5948 53659026 40941823 30027733 22018851 16618554 13127725 10807982 9180683 8008576 7166479
-5939 7166479 6599901 6248877 5990846 5696576 5371725 5056412 4785688 4585543 4457409 4350258 4226058
-5928 4226058 4042724 3812163 3581602 3398849 3259970 3147916 3049215 2976028 2927638 2917765 2959396 3063738
$$ packed form
-5995H98653060j81314754j84799797j50100442j07197549p0239432m5046302k9659723k0005589
-5987A10289472j3213492p881871l124419Q07055J785021k131177p767298j0607653j0148170
-5978E8007468q234890o256276m808440l904109l356640k873553k261226j425716m70031O18470
-5968B5035057J818322K780000K129521o20458l163228l829803l282336k362655j395519m28795
-5958A6680106N34522J578909K794028M420812O730861R770317J2164305R420231m93350r941715
-5948E3659026j2717203j0914090q008882n400297l490829k319743j627299j172107q42097
-5939G166479n66578l51024k58031k94270l24851l15313k70724k00145j28134j07151j24200
-5928D226058j83334k30561k30561j82753j38879j12054r8701p3187m8390r873M1631J04342
$$ plain form
-5916 3063738 3215769 3369349 3425645 3330289 3122388 2893846 2712993 2593421 2491016 2365602 2192498
-5905 2192498 1974329 1731362 1514954 1357685 1268607 1204332 1104166 937240 722621 513729 370703
-5894 370703 309706 306528 324337 348580 372827 389559 389127 382786 401247 467691 566567 682667 801632 913142
-5880 913142 999858 1045200 1031411 953000 830719 710103 621920 566876 521374 474091 417275 358248 302087
-5867 302087 268753 267852 301342 355819 412215 443816 432494 381117 317098 258806 208677 152828 91351 32738
-5853 32738 -6385 -16891 -9637 3342 16319 42652 90620 144315 197768 245501 283634 304602 313406 305045
-5839 305045 285698 272073 270132 281547 314658 372566 439059 484572 491274 457918 406858 358662 335678 341308
-5825 341308 371318 410870 444215 460392 452725 401187 296830 152415 37805 -6221 -3069 17250 42220
$$ packed form
-5916C063738J52031J53580N6296r5356k07901k28542j80853j19572j02405j25414j73104
-5905B192498k18169k42967k16408j57269q9078o4275j00166j66926k14619k08892j43026
-5894C70703o0997l178J7809K4243K4247J6732m32o341J8461O6444R8876J16100J18965J11510
-5880I13142Q6716M5342j3789p8411j22281j20616q8183n5044m5502m7283n6816n9027n6161
-5867C02087l3334r01L3490N4477N6396L1601j1322n1377o4019n8292n0129n5849o1477n8613
-5853C2738l9123j0506P254J2979J2977K6333M7968N3695N3453M7733L8133K0968Q804q361
-5839C05045j9347j3625j941J1415L3111N7908O6493M5513O702l3356n1060m8196k2984N630
-5825C41308L0010L9552L3345J6177p667n1538j04357j44415j14610m4026L152K0319K4970
$$ plain form
-5812 42220 67193 85367 94003 96321 92919 81045 59634 27611 -4410 -22543 -31138 -36216 -44156 -47833 -41972
-5797 -41972 -26932 -6169 17753 38815 50875 49582 43718 32131 16311 -2368 -18307 -28523 -36593 -47524
-5783 -47524 -56354 -48016 -16369 24813 69604 104856 124133 118612 88862 49578 13152 -13732 -29979 -29055 -19253
-5768 -19253 -6586 5585 17761 33807 49857 59347 59302 58240 62905 77372 94704 108694 119826 135247 144948
-5753 144948 139565 120832 104256 97222 90482 80885 78616 85889 99894 113902 132896 157612 187932 212529 229317
-5738 229317 236567 238452 240337 242476 238892 224220 200011 152672 88165 26520 -17957 -38604 -42084 -35311 -22815
-5723 -22815 -5520 6051 5820 -133 -7800 -15468 -23493 -31518 -42852 -54185 -51749 -35959 -14551 3998 18550
-5708 18550 27384 30074 23230 8215 -3933 -11347 -13035 -9302 3972 26304 48639 66321 74469 72566 61128
$$ packed form
-5812D2220K4973J8174Q636K318l402j1874k1411l2023l2021j8133q595n078p940l677N861
-5797d1972J5040K0763K3922K1062J2060j293n864j1587j5820j8679j5939j0216q070j0931
-5783d7524q830Q338L1647M1182M4791L5252J9277n521k9750l9284l6426k6884j6247R24R802
-5768a9253J2667J2171J2176J6046J6050R490m5j062M665J4467J7332J3990J1132J5421R701
-5753A44948n383j8733j6576p034o740r597k269P273J4005J4008J8994K4716L0320K4597J6788
-5738B29317P250J885J885K139l584j4672k4209m7339o4507o1645m4477k0647l480O773J2496
-5723b2815J7295J1571k31n953p667p668q025q025j1334j1333K436J5790K1408J8549J4552
-5708A8550Q834K690o844j5015j2148p414j688L733J3274K2332K2335J7682Q148j903j1438
$$ plain form
-5693 61128 43844 26564 16911 12984 16445 25633 38647 51664 66467 81273 96045 110821 125593 140370
-5679 140370 155462 170555 181356 186438 187611 183062 174221 159661 141387 132650 125344 118041 112643 107244 97912
-5664 97912 88582 79235 75610 74369 73132 69507 56344 39783 20365 540 -9745 -7573 4139 18770 33401
-5649 33401 44694 55990 63807 62085 60841 59600 58177 47216 25048 2884 -6794 693 16766 32842 43610
-5634 43610 48654 47499 36810 20384 3957 -11038 -20308 -25587 -30866 -37218 -43567 -50396 -57225 -64532 -66111 -54044
-5618 -54044 -36254 -19536 -2815 7016 7314 -498 -8307 -17431 -20829 -20296 -19760 -16351 -12938 -10364 -2063 6889 15846
-5601 15846 25633 29701 27518 19616 5511 -2868 -6481 -4369 -2737 -1102 902 2910 -3788 -10483 -16049 -15889 -12752
-5584 -12752 -9611 -1798 6013 19072 32131 47037 61944 65882 69820 71776 73732 71992 70252 67379 58784 46612
$$ packed form
-5693F1128j7284j7280r653l927L461R188J3014J3017J4803J4806J4772J4776J4772J4777
-5679A40370J5092J5093J0801N082J173m549q841j4560j8274q737p306p303n398n399r332
-5664I7912r330r347l625j241j237l625j3163j6561j9418j9825j0285K172J1712J4631J4631
-5649C3401J1293J1296P817j722j244j241j423j0961k2168k2164r678P487J6073J6076J0768
-5634D3610N044j155j0689j6426j6427j4995r270n279n279o352o349o829o829p307j579J2067
-5618e4044J7790J6718J6721R831K98p812p809r124l398N33N36L409L413K574Q301Q952Q957
-5601A5846R787M068k183p902j4105q379l613K112J632J635K004K008o698o695n566J60L137
-5584a2752L141P813P811J3059J3059J4906J4907L938L938J956J956j740j740k873q595j2172
$$ plain form
-5568 46612 34441 23889 19061 20670 28003 38911 49820 57749 65677 72830 79983 91071 107881 126838 145794
-5553 145794 169400 193006 215707 238411 262069 291450 330663 383233 456786 558952 696836 878598 1113056
-5540 1113056 1399018 1729566 2092545 2468401 2811828 3085243 3261375 3316854 3240712 3047788 2765212
-5529 2765212 2417065 2051749 1706712 1397923 1137776 932948 772289 651692 565133 503372 456674 422375
-5517 422375 391713 361050 327407 293764 263101 237208 213892 197254 184310 171367 158722 146077 135042
-5504 135042 128775 122266 115758 112110 113232 116350 119468 122885 126301 129241 132181 135239 141159 154799 173208 197399
-5488 197399 221590 239607 245226 240889 229876 215465 198192 176986 152918 126734 107226 92725 82994 76720
-5474 76720 65677 43963 22250 2642 -14104 -27275 -31861 -28221 -24581 -23385 -25050 -31529 -42777 -54919 -58477
$$ packed form
-5568D6612j2171j0552m828J609P333J0908J0909P929P928P153P153J1088J6810J8957J8956
-5553A45794K3606K3606K2701K2704K3658K9381L9213N2570P3553J02166J37884J81762K34458
-5540A113056K85962L30548L62979L75856L43427K73415J76132N5479p6142j92924k82576
-5529B765212l48147l65316l45037l08789k60147k04828j60659j20597q6559o1761m6698l4299
-5517D22375l0662l0663l3643l3643l0663k5893k3316j6638j2944j2943j2645j2645j1035
-5504A35042o267o509o508l648J122L118L118L417L416K940K940L058N920J3640J8409K4191
-5488A97399K4191J8017N619m337j1013j4411j7273k1206k4068k6184j9508j4501r731o274
-5474G6720j1043k1714k1713j9608j6746j3171m586L640L640J196j665o479j1248j2142l558
$$ plain form
-5459 -58477 -57624 -56771 -52043 -47315 -44409 -41503 -35080 -28657 -23307 -15095 -3546 5142 9225 13308 14650 15991 16498
-5442 16498 14143 11967 9791 10063 10335 8223 6110 272 -5565 -11224 -16884 -23258 -26772 -24562 -17584 -11440 -5297
-5425 -5297 -584 1267 3078 4892 6345 7802 8748 6837 3193 -446 -7115 -13780 -20449 -22346 -23202 -19287 -13467 -7644
-5407 -7644 -3210 1226 5481 9739 8540 4482 600 -3277 -7085 -10889 -11060 -8367 -3918 533 2478 1565 831 97
-5389 97 -815 -1728 -256 1215 2686 4158 4929 5701 5041 4382 2619 857 1479 2102 1446 790 -3203 -7197 -12383 -17569
-5369 -17569 -19417 -21265 -21354 -21444 -25825 -30207 -33366 -36526 -38254 -39983 -42833 -45680 -48526 -51372 -52434 -53492 -53120 -52747
-5351 -52747 -51603 -50456 -49308 -48161 -48239 -48314 -48388 -48463 -50169 -51872 -53574 -55277 -47386 -39491 -36842 -34193 -35035 -35874 -35281 -34689
-5331 -34689 -34040 -33388 -37982 -42576 -49092 -55605 -57829 -60050 -58846 -57639 -56436 -55229 -54189 -53146 -54491 -55832 -54614
$$ packed form
-5459e8477Q53Q53M728M728K906K906O423O423N350Q212J1549Q688M083M083J342J341N07
-5442A6498k355k176k176K72K72k112k113n838n837n659n660o374l514K210O978O144O143
-5425e297M713J851J811J814J453J457R46j911l644l639o669o665o669j897q56L915N820N823
-5407g644M434M436M255M258j199m058l882l877l808l804j71K693M449M451J945r13p34p34
-5389I7r12r13J472J471J471J472P71P72o60o59j763j762O22O23o56o56l993l994n186n186
-5369a7569j848j848q9r0m381m382l159l160j728j729k850k847k846k846j062j058L72L73
-5351e2747J144J147J148J147p8p5p4p5j706j703j702j703P891P895K649K649q42q39N93N92
-5331c4689O49O52m594m594o516o513k224k221J204J207J203J207J040J043j345j341J218
$$ plain form
-5314 -54614 -53392 -52173 -50951 -45132 -39309 -34920 -30527 -30699 -30866 -28653 -26436 -25196 -23951 -24141 -24328 -24398 -24465 -23106 -21742
-5295 -21742 -20807 -19868 -19048 -23951 -30557 -37159 -44118 -51078 -59737 -68391 -70847 -73302 -71141 -68976 -65023 -66793 -68138 -69479
-5277 -69479 -68794 -68108 -65012 -61912 -58336 -49036 -37028 -19294 -1560 10451 14888 13606 9940 6274 -196 -6668
-5261 -6668 -11351 -18892 -28642 -35531 -43910 -52285 -56447 -55840 -55530 -55217 -51004 -46790 -46868 -46943 -50486 -54029 -53280 -52527 -51302
-5242 -51302 -50076 -49446 -51674 -52073 -49610 -43809 -40866 -42248 -40769 -39290 -40668 -42107 -40680 -37703 -34726 -34882 -35035 -33936
-5224 -33936 -32837 -29968 -29957 -32211 -34465 -34100 -27055 -18817 -10580 451 6718 7679 1964 -6973 -13046 -18761 -24477 -24756
-5206 -24756 -25032 -23877 -22722 -23210 -23694 -24357 -25021 -25419 -28679 -32416 -36149 -41645 -42371 -42442 -39648 -35233 -35587 -36417 -37245 -35572
-5186 -35572 -33899 -32226 -30549 -28560 -26570 -22971 -22230 -24056 -25881 -27707 -29529 -30311 -28232 -28061 -27886 -25449 -27781 -28564
$$ packed form
-5314e4614J222J219J222N819N823M389M393j72j67K213K217J240J245j90j87p0o7J359J364
-5295b1742R35R39Q20m903o606o602o959o960q659q654k456k455K161K165L953j770j345j341
-5277f9479O85O86L096L100L576R300J2008J7734J7734J2011M437j282l666l666o470o472
-5261f668m683p541r750o889q379q375m162O07L10L13M213M214p8p5l543l543P49P53J225
-5242e1302J226O30k228l99K463N801K943j382J479J479j378j439J427K977K977j56j53J099
-5224c3936J099K869J1k254k254L65P045Q238Q237J1031O267R61n715q937o073n715n716k79
-5206b4756k76J155J155m88m84o63o64l98l260l737l733n496p26p1K794M415l54q30q28J673
-5186c5572J673J673J677J989J990L599P41j826j825j826j822p82K079J71J75K437k332p83
$$ plain form
-5168 -28564 -29342 -30359 -26608 -19339 -12066 -3963 4139 7593 6282 2821 -3501 -11850 -20196 -21720 -23243 -24767 -26287
-5151 -26287 -25900 -25512 -29417 -33318 -35166 -37014 -38862 -40706 -44953 -49200 -53269 -57334 -57796 -55396 -52222 -49044 -47419 -45795
-5133 -45795 -44171 -42543 -41991 -41440 -40888 -40333 -39648 -38962 -36846 -34726 -33534 -32342 -35441 -38537 -41604 -44670 -44398 -44122 -44566
-5114 -44566 -45009 -47837 -50661 -51119 -51577 -44882 -38183 -38761 -39338 -42300 -45259 -48101 -50940 -50441 -49942 -49446 -48947 -47017 -45087
-5095 -45087 -42297 -39502 -35277 -31052 -31004 -30952 -30900 -30848 -31019 -31187 -31354 -31522 -34912 -38299 -41686 -45072 -43575 -42073 -40572 -39070
-5075 -39070 -40672 -42271 -44346 -41652 -39752 -40713 -42449 -47043 -51611 -56179 -60925 -65668 -65795 -65921 -60802 -52818 -46954 -45858
-5057 -45858 -46194 -46525 -47386 -48247 -45769 -43288 -37472 -31656 -29178 -26697 -22550 -18404 -15688 -12968 -12338 -11709 -12390 -17837 -26764
-5038 -26764 -30922 -32815 -34707 -37703 -40698 -40356 -40013 -40057 -40102 -40147 -40192 -40624 -41056 -41488 -41920 -43601 -45281 -46961 -48641 -47818 -46995
$$ packed form
-5168b8564p78j017L751P269P273Q103Q102L454j311l461o322q349q346j524j523j524j520
-5151b6287L87L88l905l901j848j848j848j844m247m247m069m065m62K400L174L178J625J624
-5133d5795J624J628N52N51N52N55O85O86K116K120J192J192l099l096l067l066K72K76m44
-5114d4566m43k828k824m58m58O695O699n78n77k962k959k842k839M99M99M96M99J930J930
-5095d5087K790K795M225M225M8N2N2N2j71j68j67j68l390l387l387l386J497J502J501J502
-5075c9070j602j599k075K694J900r61j736m594m568m568m746m743j27j26N119P984N864J096
-5057d5858l36l31q61q61K478K481N816N816K478K481M147M146K716K720O30O29o81n447q927
-5038b6764m158j893j892k996k995L42L43m4m5m5m5m32m32m32m32j681j680j680j680Q23Q23
$$ plain form
-5017 -46995 -46171 -45348 -44718 -44089 -43757 -43426 -42140 -45624 -46186 -40072 -37945 -40583 -41555 -42524 -40635 -38742 -37211 -40445 -45873
-4998 -45873 -46529 -47785 -49036 -48861 -48682 -48686 -45825 -42729 -39629 -37129 -37487 -37461 -37431 -39014 -40594 -41566 -42535 -41600 -43522 -46045
-4978 -46045 -43794 -42800 -44662 -44893 -45121 -46957 -48794 -49949 -51100 -52729 -57218 -61324 -60657 -58559 -56462 -52997 -49528 -50352
-4960 -50352 -51175 -50579 -49983 -50817 -51648 -51499 -51350 -48995 -46637 -44975 -46175 -47554 -46067 -44435 -45665 -46715 -44901 -43992 -43083
-4941 -43083 -40207 -40188 -44942 -46835 -46224 -45609 -41622 -37636 -38895 -40151 -39532 -38914 -41633 -44349 -44048 -43742 -43616 -43489 -44260 -47889
-4921 -47889 -51339 -51928 -53682 -52572 -48600 -44629 -41645 -38657 -37099 -40311 -46186 -49200 -50605 -52010 -52967 -51063 -45821
-4904 -45821 -43440 -43057 -42673 -42468 -42263 -42952 -43642 -44927 -49074 -50877 -49819 -50549 -51279 -46764 -42248 -37733 -33217 -32263 -31310
-4885 -31310 -31131 -33813 -35810 -37807 -36526 -32383 -27737 -25952 -20293 -14633 -12879 -15893 -16403 -16913 -20956 -27860 -31425 -32129
$$ packed form
-5017d6995Q24Q23O30O29L32L31J286l484n62O114K127k638r72r69J889J893J531l234n428
-4998d5873o56j256j251J75J79mK861L096L100K500l58K6L0j583j580r72r69R35j922k523
-4978d6045K251R94j862k31k28j836j837j155j151j629m489m106O67K098K097L465L469q24
-4960e0352q23N96N96q34q31J49J49K355K358J662j200j379J487J632j230j050J814R09R09
-4941d3083K876J9m754j893O11O15L987L986j259j256O19O18k719k716L01L06J26J27p71l629
-4921d7889l450n89j754J110L972L971K984K988J558l212n875l014j405j405r57J904N242
-4904d5821K381L83L84K05K05o89o90j285m147j803J058p30p30M515M516M515M516R54R53
-4885c1310J79k682j997j997J281M143M646J785N659N660J754l014n10n10m043o904l565p04
$$ plain form
-4867 -32129 -32267 -32405 -30754 -31965 -32502 -33038 -33575 -34111 -35691 -34409 -31697 -31846 -35065 -38284 -41503 -44722 -48925 -50266 -47971
-4848 -47971 -45676 -44756 -43835 -44644 -48310 -49238 -50165 -51093 -52017 -51991 -49103 -47826 -46544 -46876 -47207 -50877 -54543 -56253 -57963 -55202
-4828 -55202 -52438 -52598 -49897 -48805 -47710 -46991 -46272 -47162 -45188 -41846 -38504 -37666 -39685 -39134 -38582 -38031 -40337 -42855 -45374
-4809 -45374 -48071 -50765 -48828 -46890 -46205 -45516 -49867 -51358 -51298 -51235 -49867 -51361 -50650 -47073 -43202 -42192 -42434 -39812 -39920
-4790 -39920 -40028 -43295 -46559 -47919 -49279 -52069 -54856 -60325 -65791 -64882 -63969 -64461 -62088 -57214 -57106 -57166 -57222 -57758 -58291 -59066
-4770 -59066 -62699 -64546 -66391 -65813 -62371 -59111 -55847 -55299 -54748 -54021 -56152 -58883 -61611 -60407 -59200 -59338 -62333 -61041
-4752 -61041 -56883 -55750 -54617 -53306 -51995 -53813 -55631 -56018 -56406 -55109 -53813 -53947 -54081 -55407 -56734 -59491 -62248 -63667
-4734 -63667 -65087 -65076 -65064 -64636 -64207 -60441 -56674 -51581 -46488 -41931 -44051 -45396 -46741 -48504 -50266 -51875 -53485 -55094
$$ packed form
-4867c2129j38j38J651j211n37n36n37n36j580J282K712j49l219l219l219l219m203j341K295
-4848d7971K295R20R21q09l666r28r27r28r24K6K888J277J282l32l31l670l666j710j710K761
-4828e5202K764j60K701J092J095P19P19q90J974L342L342Q38k019N51N52N51k306k518k519
-4809d5374k697k694J937J938O85O89m351j491O0O3J368j494P11L577L871J010k42K622j08
-4790c9920j08l267l264j360j360k790k787n469n466R09R13m92K373M874J08o0n6n36n33p75
-4770e9066l633j847j845N78L442L260L264N48N51P27k131k731k728J204J207j38k995J292
-4752f1041M158J133J133J311J311j818j818l87l88J297J296j34j34j326j327k757k757j419
-4734f3667j420J1J2M28M29L766L767N093N093M557k120j345j345j763j762j609j610j609
$$ plain form
-4716 -55094 -56700 -56760 -56819 -54495 -52166 -51808 -51451 -52822 -54189 -52192 -54964 -59226 -60623 -60795 -63827 -65072 -66312 -68362 -70411
-4697 -70411 -70075 -69736 -69319 -68902 -71823 -74740 -75336 -75932 -73190 -70444 -68686 -66927 -70414 -73902 -75660 -77419 -78522 -74855
-4679 -74855 -69632 -64409 -56503 -48597 -44387 -40177 -40259 -40341 -43873 -47405 -52367 -57330 -60057 -62784 -65511 -68239 -69118 -69997
-4661 -69997 -72307 -74617 -72397 -70176 -64617 -59059 -59722 -60381 -61044 -61704 -64364 -67020 -67296 -67568 -68388 -69204 -66685 -64163 -57471
-4642 -57471 -50776 -47423 -44066 -44163 -44256 -42923 -41585 -39923 -38258 -38981 -39700 -41138 -42572 -44010 -45445 -46883 -48317 -49755
-4624 -49755 -51190 -52516 -53839 -54565 -52431 -50478 -51384 -50501 -49618 -47241 -44860 -44864 -44867 -45948 -47025 -49532 -52039 -56954 -61864
-4605 -61864 -66774 -71685 -71622 -71555 -71666 -68917 -65634 -62348 -59658 -59830 -59409 -58984 -57129 -58135 -58828 -59521 -62002 -61622 -59602 -57583
-4585 -57583 -57293 -59863 -59543 -62084 -63194 -64304 -63298 -62292 -61286 -60281 -58027 -55772 -53697 -51622 -47401 -46041 -47066
$$ packed form
-4716e5094j606o0n9K324K329L58L57j371j367J997k772m262j397j72l032j245j240k050k049
-4697g0411L36L39M17M17k921k917n96n96K742K746J758J759l487l488j758j759j103L667
-4679g4855N223N223P906P906M210M210q2q2l532l532m962m963k727k727k727k728q79q79
-4661f9997k310k310K220K221N559N558o63o59o63o60k660k656k76k72q20q16K519K522O692
-4642e7471O695L353L357r7r3J333J338J662J665p23p19j438j434j438j435j438j434j438
-4624d9755j435j326j323p26K134J953r06Q83Q83K377K381mlj081j077k507k507m915m910
-4605f1864m910m911O3O7j11K749L283L286K690j72M21M25J855j006o93o93k481L80K020K019
-4585e7583K90k570L20k541j110j110J006J006J006J005K254K255K075K075M221J360j025
$$ plain form
-4568 -47066 -45229 -44055 -42882 -43616 -44349 -48422 -47725 -47982 -45378 -44532 -43686 -43437 -46045 -48001 -49957 -51913 -53865 -54904 -53083
-4549 -53083 -52691 -52296 -49461 -43765 -36518 -29268 -25345 -24283 -26857 -29428 -33940 -38452 -42785 -47114 -50612 -51249 -49979 -48705
-4531 -48705 -49580 -47595 -47039 -46481 -48519 -47691 -47047 -46399 -46380 -46358 -48068 -52635 -56089 -59539 -59535 -56667 -56246 -55821 -56652 -57479 -58112
-4510 -58112 -58742 -55858 -52971 -50713 -45590 -42081 -38567 -35803 -33035 -34562 -36086 -34126 -32163 -33660 -38016 -42420 -43958
-4493 -43958 -44245 -47393 -51320 -55243 -55709 -53314 -53768 -54219 -57650 -61082 -61268 -58589 -55910 -56093 -56264 -56432 -57136 -54979 -49517
-4474 -49517 -46913 -45858 -44804 -43373 -41939 -44797 -47654 -48966 -50273 -50150 -50027 -50176 -50322 -48086 -45847 -43493 -41134 -41999
-4456 -41999 -39998 -35996 -34853 -35263 -35669 -36585 -37498 -38414 -39327 -42036 -44741 -45065 -45385 -47647 -49904 -49960 -50013 -48727 -50299 -51697
-4436 -51697 -53090 -53653 -54211 -53343 -52471 -50098 -47725 -46782 -48697 -51808 -50150 -48969 -47785 -43981 -40177 -37327 -37334 -40296 -46119
$$ packed form
-4568d7066J837J174J173p34p33m073O97k57K604Q46Q46K49k608j956j956j956j952j039J821
-4549e3083L92L95K835N696P247P250L923J062k574k571m512m512m333m329l498o37J270J274
-4531d8705q75J985N56N58k038Q28O44O48J9K2j710m567l454l450MK868M21M25q31q27o33
-4510e8112o30K884K887K258N123L509L514K764K768j527j524J960J963j497m356m404j538
-4493d3958k87l148l927l923m66K395m54m51l431l432j86K679K679j83j71j68p04K157N462
-4474d9517K604J055J054J431J434k858k857j312j307J23J23j49j46K236K239K354K359q65
-4456d1999K001M002J143m10m06r16r13r16r13k709k705l24l20k262k257n6n3J286j572j398
-4436e1697j393n63n58Q68Q72K373K373R43j915l111J658J181J184L804L804K850pk962n823
$$ plain form
-4417 -46119 -50691 -52397 -52945 -53492 -53861 -54226 -55340 -56454 -54886 -50452 -49927 -49402 -47267 -45128 -42785 -40441 -40661 -40877 -41119
-4398 -41119 -44223 -47326 -47565 -48075 -48586 -49275 -47099 -43608 -42978 -44078 -45173 -43679 -45046 -43373 -41697 -42911 -44126 -45341
-4380 -45341 -46551 -47319 -48086 -50285 -52479 -52926 -53373 -51615 -49852 -47855 -48720 -48571 -51279 -56033 -57922 -58261 -58600 -57572 -56540
-4361 -56540 -55508 -54476 -52278 -50076 -47874 -45672 -43295 -40914 -41872 -42829 -43906 -44979 -44621 -44264 -47129 -49990 -51421 -48083
-4343 -48083 -47080 -48936 -50314 -51693 -51197 -50698 -50199 -49700 -45698 -41697 -42941 -44186 -44208 -44230 -45683 -47136 -48783 -50430 -48738
-4324 -48738 -47047 -47293 -47539 -50169 -52799 -54290 -55780 -57091 -58403 -61473 -61681 -61294 -60906 -58492 -58939 -60936 -62933 -65049
-4306 -65049 -64304 -62784 -61264 -59129 -56994 -56290 -55582 -53865 -52147 -51860 -51570 -52811 -54051 -55650 -54383 -52136 -52751 -52710 -52665
-4287 -52665 -56156 -54878 -56283 -57684 -59684 -61685 -62255 -62821 -61223 -59625 -58027 -56424 -56763 -57103 -57442 -57777 -58488 -59196 -59908
$$ packed form
-4417d6119m572j706n48n47l69l65j114j114J568M434N25N25K135K139K343K344k20k16k42
-4398d1119l104l103k39n10n11o89K176L491O30j100j095J494j367J673J676j214j215j215
-4380d5341j210p68p67k199k194m47m47J758J763J997q65J49k708m754j889l39l39J028J032
-4361e6540J032J032K198K202K202K202K377K381r58r57j077j073L58L57k865k861j431L338
-4343d8083J003j856j378j379M96M99M99M99M002M001j244j245k2k2j453j453j647j647J692
-4324d8738J691k46k46k630k630j491j490j311j312l070k08L87L88K414m47j997j997k116
-4306f5049P45J520J520K135K135P04P08J717J718K87K90j241j240j599J267K247o15M1M5
-4287e2665l491J278j405j401k000k001n70n66J598J598J598J603l39l40l39l35p11p08p12
$$ plain form
-4268 -59908 -60616 -61506 -62393 -60899 -59401 -59696 -59986 -58850 -57710 -60687 -63660 -68067 -72471 -72665 -72855 -73525 -69423 -65146 -63727
-4249 -63727 -62788 -61845 -58492 -55135 -54942 -54744 -56488 -55366 -54249 -55989 -58187 -60381 -60370 -60359 -59994 -59625 -61938 -59483 -58038
-4230 -58038 -56588 -57225 -57863 -57162 -56458 -55754 -55050 -54781 -54509 -54237 -53965 -56201 -58433 -60485 -62538 -63410 -61417 -61331 -61246 -60061 -63641
-4209 -63641 -65970 -65437 -64800 -61298 -60001 -61566 -62210 -62851 -61108 -59364 -61082 -59934 -58846 -54897 -51011 -49983 -52412 -54841
-4191 -54841 -55340 -55840 -54908 -53977 -55549 -57121 -57144 -54305 -50586 -49729 -51555 -53381 -51451 -52382 -53910 -55437 -56797 -55296 -53198
-4172 -53198 -51097 -48314 -48392 -51153 -53910 -52751 -51592 -48824 -48913 -50407 -51901 -53753 -55601 -53928 -55117 -54696 -54275 -53198
-4154 -53198 -52121 -53429 -54737 -56864 -58991 -56052 -53112 -50173 -50094 -51626 -50296 -48567 -49696 -52080 -51600 -51302 -51000 -47483
-4136 -47483 -46823 -47956 -49085 -48966 -48843 -49409 -49972 -52922 -55869 -58019 -60165 -62136 -64103 -67117 -67266 -67419 -67568 -69539 -68645
$$ packed form
-4268e9908p08q90q87J494J498k95k90J136J140k977k973m407m404j94j90o70M102M277J419
-4249f3727R39R43L353L357J93J98j744J122J117j740k198k194J1J1L65L69k313K455J445
-4230e8038J450o37o38P01P04P04P04K69K72K72K72k236k232k052k053q72J993Q6Q5J185l580
-4209f3641k329N33O37L502J297j565o44o41J743J744j718J148J088L949L886J028k429k429
-4191e4841m99n00R32R31j572j572k3K839L719Q57j826j826J930r31j528j527j360J501K098
-4172e3198K101K783p8k761k757J159J159K768q9j494j494j852j848J673j189M21M21J077
-4154e3198J077j308j308k127k127K939K940K939P9j532J330J729j129k384M80K98L02L517
-4136d7483O60j133j129J19J23n66n63k950k947k150k146j971j967l014j49j53j49j971Q94
$$ plain form
-4117 -68645 -66324 -63999 -60754 -62274 -61115 -59953 -60634 -61316 -58660 -56000 -54953 -53906 -52859 -51808 -50195 -48582 -48578 -48571 -47554
-4098 -47554 -49398 -52017 -54632 -53995 -53358 -52721 -52080 -49804 -47527 -49424 -48455 -49308 -53023 -56201 -59375 -60705 -59174 -59252 -59327
-4079 -59327 -59785 -60243 -60702 -61160 -59442 -57725 -56007 -54290 -52825 -51361 -48347 -50102 -53198 -51525 -54264 -57002 -54282 -51562
-4061 -51562 -52181 -52799 -53477 -54156 -52449 -50743 -49707 -48671 -50020 -51369 -51406 -51443 -52911 -54379 -52632 -50884 -51521 -52155 -54312
-4042 -54312 -56469 -58448 -60422 -61491 -59699 -54569 -52296 -54677 -57058 -57412 -57762 -58779 -62658 -64927 -67192 -66003 -64815
-4025 -64815 -61838 -61719 -64181 -63783 -60404 -59882 -58977 -60933 -63067 -62337 -62076 -61816 -61376 -60936 -59006 -57076 -56756 -53574 -53865 -54156
-4005 -54156 -54267 -54379 -51719 -49059 -47949 -49700 -51898 -51235 -50750 -53127 -53120 -53112 -54059 -57866 -58470 -59073 -58246 -60281 -59632 -58984 -60124
-3984 -60124 -58403 -61506 -64606 -64189 -63772 -61301 -58828 -56354 -53880 -54047 -54211 -54375 -54539 -55929 -57315 -58701 -60087 -60623 -61156
$$ packed form
-4117f8645K321K325L245j520J159J162o81o82K656K660J047J047J047J051J613J613MPJ017
-4098d7554j844k619k615O37O37O37O41K276K277j897R69q53l715l178l174j330J531p8p5
-4079e9327m58m58m59m58J718J717J718J717J465J464L014j755l096J673k739k738K720K720
-4061e1562o19o18o78o79J707J706J036J036j349j349l7l7j468j468J747J748o37o34k157
-4042e4312k157j979j974j069J792N130K273k381k381l54l50j017l879k269k265J189J188
-4025f4815K977J19k462L98L379N22R05j956k134P30K61K60M40M40J930J930L20L182k91k91
-4005e4156j11j12K660K660J110j751k198O63M85k377PQr47l807o04o03Q27k035O49O48j140
-3984f0124J721l103l100M17M17K471K473K474K474j67j64j64j64j390j386j386j386n36n33
$$ plain form
-3965 -61156 -62047 -60076 -56290 -55363 -55985 -56607 -57598 -58585 -58798 -56149 -56514 -56875 -57058 -57240 -58656 -60072 -59103 -58135 -59103 -60072 -58656
-3944 -58656 -57240 -55698 -54156 -54044 -53932 -54267 -54603 -57322 -60042 -59971 -59901 -59830 -59759 -59241 -58723 -56775 -54826 -51641 -48455 -47654 -46853
-3923 -46853 -45009 -43165 -42095 -43887 -47438 -50989 -56149 -58444 -58865 -56424 -52553 -51540 -49510 -50340 -52781 -52356 -52680 -53004
-3905 -53004 -51540 -52933 -57412 -61890 -61301 -60709 -61283 -61857 -61000 -60139 -57263 -54387 -53895 -53399 -53176 -52952 -53027 -53097 -50821 -53310
-3885 -53310 -55500 -57691 -55236 -52777 -50139 -50363 -51738 -53109 -54658 -56208 -55914 -55616 -57702 -59789 -58839 -57885 -56931 -55977 -56726
-3866 -56726 -57471 -56965 -56458 -55001 -56402 -54763 -53123 -51875 -50624 -51756 -52889 -51659 -50430 -49200 -47967 -49986 -52006 -55456
-3848 -55456 -58902 -61391 -63880 -62076 -60269 -60761 -61253 -61745 -62233 -63813 -65392 -63634 -61871 -60918 -59964 -57579 -55191 -52710
-3830 -52710 -50229 -50132 -50031 -50858 -51685 -51082 -50475 -49312 -48146 -46980 -45814 -47662 -49506 -52781 -56056 -63239 -70418 -73306 -76193
$$ packed form
-3965f1156q91J971L786R27o22o22r91r87k13K649l65l61j83j82j416j416R69R68r68r69J416
-3944e8656J416J542J542J12J12l35l36k719k720P1P0P1P1N18N18J948J949L185L186Q01Q01
-3923d6853J844J844J070j792l551l551n160k295m21K441L871J013K030q30k441M25l24l24
-3905e3004J464j393m479m478N89N92n74n74Q57Q61K876K876M92M96K23K24p5p0K276k489
-3885e3310k190k191K455K459K638k24j375j371j549j550K94K98k086k087R50R54R54R54p49
-3866e6726p45N06N07J457j401J639J640J248J251j132j133J230J229J230J233k019k020l450
-3848e5456l446k489k489J804J807m92m92m92m88j580j579J758J763R53R54K385K388K481
-3830e2710K481R7J01q27q27O03O07J163J166J166J166j848j844l275l275p183p179k888k887
$$ plain form
-3811 -76193 -73212 -70228 -67244 -64260 -63466 -62669 -63302 -63935 -63172 -62404 -64021 -65638 -66916 -68190 -68034 -67877 -66324 -64766 -63209
-3792 -63209 -61652 -60132 -58611 -59476 -60340 -61175 -62009 -62844 -63678 -64006 -64334 -64662 -64990 -65586 -66182 -64394 -62605 -61983 -61361 -60739 -60117
-3771 -60117 -61134 -62151 -63168 -64185 -62088 -59990 -57892 -55795 -55694 -55594 -55493 -55392 -55217 -55039 -58198 -61357 -60974 -60586 -64491
-3752 -64491 -68395 -70776 -73153 -70284 -67415 -65355 -63291 -63611 -63932 -63488 -63041 -62594 -62147 -61853 -61555 -61257 -60959 -61268 -61573 -61879
-3732 -61879 -62184 -60914 -59640 -58366 -57091 -56044 -54998 -57110 -59222 -58861 -55638 -51402 -53843 -55679 -52747 -53392 -58805 -63146
-3714 -63146 -64625 -64673 -64722 -64420 -64118 -67154 -70191 -69323 -68455 -70627 -69938 -67944 -65951 -63779 -61607 -60865 -60124 -56164 -55065 -56693
-3694 -56693 -55456 -54401 -56205 -54852 -53496 -55661 -57822 -58794 -59763 -60735 -61704 -61573 -61439 -61309 -61175 -61067 -60955 -59059 -60020 -61879
-3674 -61879 -60873 -58321 -55765 -56335 -56901 -58902 -60899 -60336 -59770 -60638 -61503 -62736 -63965 -62814 -61659 -62654 -63645 -64997 -63485
$$ packed form
-3811g6193K981K984K984K984P94P97o33o33P63P68j617j617j278j274J56J57J553J558J557
-3792f3209J557J520J521q65q64q35q34q35q34l28l28l28l28n96n96J788J789O22O22O22O22
-3771f0117j017j017j017j017K097K098K098K097J01J00J01J01J75J78l159l159L83L88l905
-3752f4491l904k381k377K869K869K060K064l20l21M44M47M47M47K94K98K98K98l09l05l06
-3732f1879l05J270J274J274J275J047J046k112k112L61L223M236k441j836K932o45n413m341
-3714f3146j479m8m9L02L02l036l037Q68Q68k172O89J994J993K172K172P42P41L960J099j628
-3694e6693J237J055j804J353J356k165k161r72r69r72r69J31J34J30J34J08J12J896r61j859
-3674f1879J006K552K556n70n66k001j997N63N66q68q65j233j229J151J155r95r91j352J512
$$ plain form
-3655 -63485 -61231 -61834 -61905 -61972 -62937 -61037 -60750 -60459 -59755 -59047 -58343 -57635 -59345 -61052 -60199 -59342 -59077 -55948 -52822 -52553 -53869
-3634 -53869 -55180 -58462 -58880 -57866 -59711 -61555 -60538 -59047 -60415 -62378 -64342 -65608 -66871 -65750 -64628 -67326 -70020
-3617 -70020 -69375 -68730 -64528 -60322 -56115 -54770 -54234 -56555 -57624 -55832 -54998 -54159 -53142 -52125 -52095 -52062 -53459 -54856 -58805
-3598 -58805 -62751 -60497 -58243 -54889 -51533 -52468 -53403 -54461 -55515 -56570 -57624 -56536 -55445 -56737 -58030 -56510 -54986
-3581 -54986 -53463 -51939 -50180 -48418 -50948 -53477 -52613 -51745 -50877 -50009 -52304 -54595 -56886 -59178 -58306 -57430 -55124 -52818
-3563 -52818 -54182 -55541 -54517 -53492 -52844 -52192 -54878 -57565 -59390 -61212 -61603 -61994 -61186 -60374 -59562 -58749 -60206 -61659 -63112
-3544 -63112 -64565 -62415 -60262 -59539 -58816 -57173 -55527 -55310 -55094 -55847 -56600 -58783 -60966 -60646 -60325 -62389 -64453 -64863 -65273
-3525 -65273 -64252 -63231 -63909 -64587 -62881 -61175 -58731 -56287 -54141 -51995 -51249 -55273 -58045 -60817 -58373 -55929 -55869 -55810 -58343
$$ packed form
-3655f3485K254o03p1o7r65J900K87K91P04P08P04P08j710j707Q53Q57K65L129L126K69j316
-3634e3869j311l282m18J014j845j844J017J491j368j963j964j266j263J121J122k698k694
-3617g0020O45O45M202M206M207J345N36k321j069J792Q34Q39J017J017L0L3j397j397l949
-3598e8805l946K254K254L354L356r35r35j058j054j055j054J088J091j292j293J520J524
-3581e4986J523J524J759J762k530k529Q64Q68Q68Q68k295k291k291k292Q72Q76K306K306
-3563e2818j364j359J024J025O48O52k686k687j825j822l91l91Q08Q12Q12Q13j457j453j453
-3544f3112j453K150K153P23P23J643J646K17K16p53p53k183k183L20L21k064k064m10m10
-3525f5273J021J021o78o78J706J706K444K444K146K146P46m024k772k772K444K444O0N9k533
$$ plain form
-3506 -58343 -60877 -61026 -61175 -61573 -61972 -62371 -62766 -63820 -64874 -62590 -60303 -60135 -59968 -59800 -59629 -57851 -56074 -54297 -52516
-3487 -52516 -51458 -50400 -51726 -53049 -56253 -59457 -60277 -61093 -61406 -61719 -59647 -57572 -56961 -56350 -53533 -50713 -50855 -53854 -55068
-3468 -55068 -56279 -59729 -60314 -58876 -54573 -54640 -54703 -55843 -56980 -57583 -55322 -56283 -57240 -56216 -58049 -62270 -63626 -64032 -64435
-3449 -64435 -62278 -60117 -56573 -53027 -55504 -57978 -61320 -61797 -61503 -61205 -61242 -61275 -61309 -61342 -62065 -62784 -63503 -64222 -64483 -64740 -64699 -64658
-3427 -64658 -65128 -60825 -59025 -60087 -60128 -60165 -60381 -60597 -59714 -58828 -61100 -63373 -65225 -64211 -62423 -60634 -59625 -58611 -59983
-3408 -59983 -61354 -60087 -58820 -59938 -61052 -61871 -62691 -62259 -61823 -59275 -59588 -61510 -60567 -59807 -61909 -60791 -59670 -60675 -61681
-3389 -61681 -62330 -65836 -65947 -63198 -62237 -61272 -63000 -64729 -66458 -68183 -65500 -62818 -61864 -63768 -65541 -67315 -67538 -64897
-3371 -64897 -63779 -62661 -59755 -59707 -58552 -57397 -58626 -59852 -60515 -58317 -55523 -52725 -50713 -51562 -52233 -52900 -54942 -56983
$$ packed form
-3506e8343k534j49j49l98l99l99l95j054j054K284K287J68J67J68J71J778J777J777J781
-3487e2516J058J058j326j323l204l204q20q16l13l13K072K075O11O11K817K820j42k999j214
-3468e5068j211l450n85J438M303o7o3j140j137o03K261r61r57J024j833m221j356m06m03
-3449f4435K157K161L544L546k477k474l342m77K94K98l7l3l4l3p23p19p19p19k61k57M1M1
-3427f4658m70M303J800j062m1l7k16k16Q83Q86k272k273j852J014J788J789J009J014j372
-3408e9983j371J267J267j118j114q19q20M32M36K548l13j922R43P60k102J118J121j005j006
-3389f1681o49l506j11K749R61R65j728j729j729j725K683K682R54j904j773j774k23K641
-3371f4897J118J118K906M8J155J155j229j226o63K198K794K798K012q49o71o67k042k041
$$ plain form
-3353 -56983 -57475 -55102 -51205 -50169 -54319 -58466 -59189 -57050 -55091 -53127 -51179 -49230 -47282 -45329 -41116 -36902 -39066
-3336 -39066 -41227 -42200 -46033 -51119 -51432 -50348 -52125 -54379 -56629 -52136 -47643 -48396 -49144 -51030 -52915 -52416 -51913 -53187
-3318 -53187 -54461 -57166 -59867 -60903 -61938 -59636 -57330 -54394 -51454 -50899 -50344 -51432 -52516 -53302 -54088 -55072 -51283 -50653
-3300 -50653 -54793 -57356 -57054 -57229 -57404 -59129 -60851 -59234 -57617 -54871 -52121 -47941 -43761 -39987 -36209 -28437 -20665 -20110
-3282 -20110 -24320 -31093 -37867 -43142 -48418 -52263 -56104 -59323 -62542 -61469 -60392 -60109 -59826 -59543 -59256 -60851 -62445 -65470
-3264 -65470 -63723 -61626 -62389 -62676 -62959 -62740 -62520 -62300 -62076 -62646 -63216 -61402 -59584 -58157 -56730 -56734 -56734 -55422 -54107 -56130 -58153
-3243 -58153 -58272 -58388 -59934 -61480 -60810 -60135 -60892 -61648 -57967 -54282 -50597 -46913 -43571 -40225 -40218 -40210 -41935 -43656 -46808 -49960
-3223 -49960 -51141 -52319 -53496 -54673 -57285 -59893 -60117 -60340 -60348 -60355 -60363 -60366 -60880 -61395 -58570 -55743 -56264 -56786 -58738 -60687 -59390
$$ packed form
-3353e6983m92K373L897J036m150m147p23K139J959J964J948J949J948J953M213M214k164
-3336c9066k161r73l833n086l13J084j777k254k250M493M493p53p48j886j885M99N03j274
-3318e3187j274k705k701j036j035K302K306K936K940N55N55j088j084p86p86r84L789O30
-3300e0653m140k563L02j75j75j725j722J617J617K746K750M180M180L774L778P772P772N55
-3282b0110m210o773o774n275n276l845l841l219l219J073J077K83K83K83K87j595j594l025
-3264f5470J747K097p63k87k83K19K20K20K24n70n70J814J818J427J427m%J312J315k023k023
-3243e8153j19j16j546j546O70O75p57p56L681L685L685L684L342L346PQj725j721l152l152
-3223d9960j181j178j177j177k612k608k24k23qpqln14n15K825K827n21n22j952j949J297
$$ plain form
-3202 -59390 -58094 -60135 -62173 -62050 -61927 -61804 -61678 -60243 -58809 -60713 -62613 -62743 -62874 -63004 -63131 -64304 -65478 -66651 -67821
-3183 -67821 -68570 -69315 -70064 -70809 -68786 -66760 -64733 -62706 -59960 -57211 -57803 -58392 -59521 -60646 -57479 -54312 -54342 -54368 -54398 -54424
-3163 -54424 -55497 -56566 -57635 -58705 -59368 -60027 -60690 -61350 -60553 -59752 -58950 -58149 -57065 -55977 -56324 -56667 -58712 -60754 -59461
-3144 -59461 -58164 -54770 -51372 -52270 -53164 -55135 -57103 -57643 -58179 -58660 -59137 -58187 -57233 -55448 -53660 -51875 -50087 -50642 -51194
-3125 -51194 -51749 -52300 -53451 -54599 -55750 -56898 -55433 -53969 -52505 -51037 -50735 -50430 -50128 -49823 -50013 -50203 -51823 -53440 -53779
-3106 -53779 -54115 -50162 -46205 -51018 -55832 -58261 -60687 -59837 -58984 -59565 -60143 -60970 -61797 -61193 -60586 -60310 -60031 -59755 -59476 -61380
-3086 -61380 -63283 -61849 -60411 -58291 -56171 -58343 -60512 -60664 -60817 -58585 -56350 -56950 -57550 -59282 -61011 -61965 -58149 -53261
-3068 -53261 -55046 -55851 -56655 -57877 -59096 -58634 -58172 -57710 -57244 -58779 -60314 -61849 -63380 -65318 -67255 -64900 -62546 -63052 -63559
$$ packed form
-3202e9390J296k041k038J23J23J23J26J435J434j904j900j30j31j30j27j173j174j173j170
-3183f7821p49p45p49p45K023K026K027K027K746K749n92n89j129j125L167L167l0k6l0k6
-3163e4424j073j069j069j070o63o59o63o60P97Q01Q02Q01J084J088l47l43k045k042J293
-3144e9461J297L394L398q98q94j971j968n40n36m81m77R50R54J785J788J785J788n55n52
-3125e1194n55n51j151j148j151j148J465J464J464J468L02L05L02L05j90j90j620j617l39
-3106e3779l36L953L957m813m814k429k426Q50Q53n81n78q27q27O04O07K76K79K76K79j904
-3086f1380j903J434J438K120K120k172k169j52j53K232K235o00o00j732j729r54L816M888
-3068e3261j785q05q04j222j219M62M62M62M66j535j535j535j531j938j937K355K354n06n07
$$ plain form
-3049 -63559 -62635 -61711 -61942 -62173 -62404 -62635 -62866 -63097 -63328 -63559 -61551 -59543 -58965 -58388 -59420 -60452 -59100 -57747 -58869 -59990
-3029 -59990 -61111 -62233 -62132 -62032 -61931 -61830 -61715 -61599 -61484 -61365 -61249 -61134 -61018 -60899 -59308 -57717 -56126 -54532 -53567 -52602
-3009 -52602 -54975 -57345 -57501 -57658 -57814 -57967 -58332 -58697 -59062 -59424 -59081 -58738 -58395 -58049 -56484 -54919 -53354 -51786 -51130 -50475
-2989 -50475 -51249 -52024 -51249 -50475 -52084 -53694 -54409 -55124 -55840 -56555 -56078 -55601 -55124 -54647 -57877 -61104 -60221 -59334 -60329 -64181 -67680
-2968 -67680 -66406 -62020 -57632 -56287 -54938 -56246 -57550 -55519 -53485 -53477 -53466 -55247 -54163 -53083 -54860 -57237 -59610 -59446
-2950 -59446 -59278 -58936 -58589 -60005 -58556 -58719 -58880 -59073 -59267 -59461 -59655 -59312 -58969 -60236 -58641 -56890 -55139 -53209 -51279 -52091
-2930 -52091 -52904 -55147 -57389 -58094 -58794 -58719 -55784 -55117 -54446 -55981 -57516 -56387 -55255 -57460 -59666 -60653 -61637 -62620 -63604 -62427
-2910 -62427 -61246 -58813 -56380 -53682 -53843 -56566 -56428 -53373 -53176 -55482 -57788 -56432 -55072 -53712 -52352 -53090 -53824 -56112
$$ packed form
-3049f3559R24R24k31k31k31k31k31k31k31k31K008K008N78N77j032j032J352J353j122j121
-3029e9990j121j122J01J00J01J01J15J16J15J19J16J15J16J19J591J591J591J594R65R65
-3009e2602k373k370j56j57j56j53l65l65l65l62L43L43L43L46J565J565J565J568O56O55
-2989e0475p74p75P75P74j609j610p15p15p16p15M77M77M77M77l230l227Q83Q87r95l852l499
-2968f7680J274M386M388J345J349j308j304K031K034QJ1j781J084J080j777k377k373J64
-2950e9446J68L42L47j416J449j63j61j93j94j94j94L43L43j267J595J751J751J930J930q12
-2930e2091q13k243k242p05p00P5K935O67O71j535j535J129J132k205k206r87r84r83r84J177
-2910f2427J181K433K433K698j61k723J38L055J97k306k306J356J360J360J360p38p34k288
$$ plain form
-2892 -56112 -61257 -62889 -61655 -59830 -58000 -57747 -57490 -57237 -56980 -58067 -59152 -58034 -56913 -55318 -56581 -60232 -61018 -59215
-2874 -59215 -57408 -53995 -53440 -51928 -53273 -57363 -58589 -59014 -62296 -68563 -71964 -70891 -66953 -63198 -59439 -57471 -58362 -59077
-2856 -59077 -59789 -60266 -60739 -61395 -59185 -57218 -55247 -53280 -51309 -51279 -54107 -55150 -56190 -57412 -55769 -55560 -58209 -61562 -64912
-2837 -64912 -67669 -67561 -67754 -67944 -67959 -67970 -68052 -68134 -67918 -67702 -69572 -66674 -66458 -66242 -66502 -66763 -67024 -67285 -67903 -68522 -69140 -69759 -68194
-2814 -68194 -66625 -65239 -63850 -63358 -65724 -66484 -67240 -65035 -62825 -60620 -58410 -58947 -59480 -60016 -60549 -62646 -64740 -66834 -68928
-2795 -68928 -66167 -63403 -59029 -57516 -58839 -60158 -59271 -58384 -58366 -58343 -56890 -55437 -56946 -58455 -56804 -55150 -54215 -56141 -54074
-2776 -54074 -52002 -54047 -56093 -54800 -53504 -55251 -56998 -58746 -60489 -61301 -62110 -64528 -64084 -63704 -63321 -62758 -62196 -61599 -61000
-2757 -61000 -58611 -59085 -61380 -60810 -62028 -63246 -61905 -60560 -63507 -66454 -67199 -67941 -68682 -69423 -67732 -66037 -67501 -68965
$$ packed form
-2892e6112n145j632J234J825J830K53K57K53K57j087j085J118J121J595j263l651p86J803
-2874e9215J807L413N55J512j345m090j226m25l282o267l401J073L938L755L759J968q91p15
-2856e9077p12m77m73o56K210J967J971J967J971L0k828j043j040j222J643K09k649l353l350
-2837f4912k757J08j93j90j5j1q2q2K16K16j870K898K16K16k60k61k61k61o18o19o18o19J565
-2814f8194J569J386J389M92k366p60p56K205K210K205K210n37n33n36n33k097k094k094k094
-2795f8928K761K764M374J513j323j319Q87Q87J8K3J453J453j509j509J651J654R35j926K067
-2776e4074K072k045k046J293J296j747j747j748j743q12q09k418M44L80L83N63N62N97N99
-2757f1000K389m74k295N70j218j218J341J345k947k947p45p42p41p41J691J695j464j464
$$ plain form
-2739 -68965 -70672 -69513 -69964 -70414 -70903 -71391 -70448 -69502 -66741 -63980 -62769 -64416 -65605 -63932 -61007 -60940 -61234 -61529 -63909
-2720 -63909 -63425 -61320 -63984 -66469 -64181 -64342 -64502 -65973 -64580 -63675 -62769 -61685 -60597 -61927 -63257 -62203 -61145 -61547
-2702 -61547 -61946 -62348 -62747 -61510 -60269 -61417 -62561 -62911 -63257 -61223 -59185 -58820 -58451 -59338 -60221 -59938 -56790 -56030 -58127 -60646
-2682 -60646 -63161 -64427 -65690 -65891 -66089 -66469 -63984 -63827 -63667 -63332 -62993 -61853 -60713 -59573 -58433 -58634 -58835 -58857 -58880 -62278
-2662 -62278 -62814 -61622 -60430 -60757 -61085 -60161 -59237 -56287 -56197 -59565 -62933 -64245 -62695 -60966 -62099 -62248 -59535 -58433 -60191
-2643 -60191 -59804 -59416 -61294 -63172 -64725 -61506 -59364 -60079 -61216 -62348 -63663 -64975 -63794 -62609 -63813 -65012 -64874 -64733
-2625 -64733 -64595 -64453 -63041 -61626 -60213 -58798 -58131 -57460 -56793 -56123 -57550 -58973 -60757 -59677 -57617 -58414 -59811 -61205 -60910
-2606 -60910 -60616 -58891 -57166 -56663 -56160 -55836 -52650 -52743 -52837 -52751 -52665 -54964 -57263 -56223 -55184 -56044 -56905 -57766 -58626 -58444 -58261
$$ packed form
-2739f8965j707J159m51m50m89m88R43R46K761K761J211j647j189J673K925O7k94k95k380
-2720f3909M84K105k664k485K288j61j60j471J393R05R06J084J088j330j330J054J058m02
-2702f1547l99m02l99J237J241j148j144l50l46K034K038L65L69q87q83K83L148P60k097k519
-2682f0646k515j266j263k01j98l80K485J57J60L35L39J140J140J140J140k01k01k2k3l398
-2662f2278n36J192J192l27l28R24R24K950R0l368l368j312J550J729j133j49K713J102j758
-2643f0191L87L88j878j878j553L219K142p15j137j132j315j312J181J185j204j199J38J41
-2625f4733J38J42J412J415J413J415O67O71O67O70j427j423j784J080K060p97j397j394K95
-2606f0910K94J725J725N03N03L24L186r3r4Q6Q6k299k299J040J039q60q61q61q60J82J83
$$ plain form
-2585 -58261 -58079 -57896 -58846 -59796 -60746 -61696 -62110 -62523 -64725 -64066 -61987 -62766 -61935 -61104 -61529 -64811 -65053 -65295 -64170 -63041 -59528
-2564 -59528 -56015 -55128 -54237 -54778 -55318 -55296 -55269 -57628 -59986 -60023 -60057 -60269 -57620 -55944 -54264 -54014 -53764 -52326 -53746 -53556 -53366
-2543 -53366 -53429 -53489 -53552 -53612 -55016 -56417 -57822 -59222 -57348 -55471 -56279 -59945 -60426 -60903 -61741 -59714 -59554 -59390 -56667 -53939
-2523 -53939 -55448 -56954 -58462 -59968 -61253 -62535 -63820 -65102 -64837 -64569 -64304 -64036 -63332 -62628 -61924 -61219 -61171 -61123 -62684 -61383
-2503 -61383 -60202 -59021 -57661 -56302 -57535 -58768 -60001 -61234 -62654 -64073 -63108 -62143 -61119 -60094 -60322 -60549 -61462 -59513
-2485 -59513 -58995 -58477 -59927 -58515 -58891 -59267 -57147 -57889 -60061 -59371 -57877 -56383 -57393 -61264 -61246 -61227 -62639 -64051 -64658 -62404
-2465 -62404 -60150 -60757 -58660 -56562 -57982 -59401 -59778 -60154 -60351 -60549 -59845 -56279 -54502 -52725 -52378 -54893 -55799 -56704 -57054
-2446 -57054 -57401 -57751 -58097 -58448 -58794 -59144 -59491 -60266 -61037 -61514 -61987 -63835 -60910 -58883 -59714 -62084 -61588 -60023 -58455 -56085
$$ packed form
-2585e8261J82J83r50r50r50r50m14m13k202O59K079p79Q31Q31m25l282k42k42J125J129L513
-2564e9528L513Q87Q91n41n40K2K7k359k358l7l4k12K649J676J680K50K50J438j420J90J90
-2543e3366o3o0o3o0j404j401j405j400J874J877q08l666m81m77q38K027J60J64K723K728
-2523e3939j509j506j508j506j285j282j285j282K65K68K65K68P04P04P04P05M8M8j561J301
-2503f1383J181J181J360J359j233j233j233j233j420j419R65R65J024J025k28k27r13J949
-2485e9513N18N18j450J412l76l76K120p42k172O90J494J494j010l871J8J9j412j412o07K254
-2465f2404K254o07K097K098j420j419l77l76j97j98P04L566J777J777L47k515r06r05l50
-2446e7054l47l50l46l51l46l50l47p75p71m77m73j848K925K027q31k370M96J565J568K370
$$ plain form
-2426 -56085 -53712 -56112 -58507 -57941 -57371 -58235 -59096 -58857 -58615 -58377 -58135 -57531 -56924 -56495 -56067 -55642 -58075 -60508 -60079 -59029
-2406 -59029 -57974 -56741 -55508 -57199 -58887 -60575 -62263 -65146 -68026 -66137 -64248 -59740 -55229 -55784 -59200 -60698 -62192
-2389 -62192 -61003 -59815 -60955 -62091 -62155 -59357 -56823 -57147 -58366 -59584 -62028 -61607 -57252 -57665 -58619 -59569 -59386 -59204 -58339
-2370 -58339 -57471 -56424 -55378 -56376 -54509 -52643 -53638 -53653 -53664 -55284 -56905 -57233 -57557 -55020 -52483 -53049 -53612 -53995 -57240 -59155
-2350 -59155 -61070 -63164 -65258 -63388 -61517 -62509 -63500 -65012 -66525 -65176 -63827 -62956 -62084 -61212 -60340 -59833 -59323 -58816 -58306
-2331 -58306 -59409 -60508 -61611 -62710 -62993 -63272 -62482 -58828 -56100 -56231 -57438 -58641 -57952 -57259 -58000 -58738 -59092 -59442 -56935
-2312 -56935 -54424 -54517 -54606 -57561 -60512 -58697 -56879 -55065 -53246 -53667 -54088 -54509 -54930 -55351 -55772 -56193 -56614 -55717 -54819 -53921 -53023
-2291 -53023 -54957 -56890 -55962 -55035 -56313 -57587 -57434 -57278 -59837 -62393 -60184 -57971 -59249 -60523 -61801 -63075 -66320 -69561
$$ packed form
-2426e6085K373k400k395N66N70q64q61K39K42K38K42O04O07M29M28M25k433k433M29J050
-2406e9029J055J233J233j691j688j688j688k883k880J889J889M508M511n55l416j498j494
-2389f2192J189J188j140j136o4K798K534l24j219j218k444M21M355m13r54r50J83J82Q65
-2370e8339Q68J047J046r98J867J866r95j5j1j620j621l28l24K537K537n66n63l83l245j915
-2350e9155j915k094k094J870J871r92r91j512j513J349J349Q71Q72Q72Q72N07N10N07N10
-2331e8306j103j099j103j099k83k79P90L654K728j31j207j203O89O93p41p38l54l50K507
-2312e6935K511r3q9k955k951J815J818J814J819m21m21m21m21m21m21m21m21Q97Q98Q98Q98
-2291e3023j934j933R28R27j278j274J53J56k559k556K209K213j278j274j278j274l245l241
$$ plain form
-2273 -69561 -68037 -66510 -65798 -65083 -67233 -69379 -69591 -69800 -67151 -64498 -65113 -65724 -64908 -64088 -64673 -65254 -62978 -60698 -60590 -60478
-2253 -60478 -60366 -60254 -60355 -60452 -59118 -57784 -55411 -53034 -53518 -54003 -55802 -57598 -56533 -55467 -54673 -53876 -54509 -55143 -56346 -57546
-2233 -57546 -58746 -59945 -59629 -59308 -58988 -58667 -57456 -56242 -55027 -53813 -54647 -55478 -59174 -62866 -62210 -61551 -60895 -60236 -60832 -61424
-2213 -61424 -62020 -62613 -62613 -62609 -62609 -62605 -62643 -62676 -62713 -62747 -64334 -65918 -63093 -60266 -57710 -60873 -63682 -66488 -66853 -67214 -66149 -65079 -64953
-2190 -64953 -64826 -66130 -67434 -67784 -68134 -66100 -64066 -63179 -62292 -63790 -65288 -66279 -67270 -68261 -69252 -68224 -67195 -64736 -62278
-2171 -62278 -60564 -58850 -60474 -62099 -63708 -65318 -63589 -61860 -61532 -61205 -60877 -60549 -59908 -59263 -61007 -62747 -63596 -64442 -65292
-2152 -65292 -66137 -64364 -62587 -62244 -61898 -61585 -61268 -60955 -60638 -59394 -58146 -56901 -55653 -54468 -53280 -55433 -57583 -59230 -60873
-2133 -60873 -61089 -61301 -61070 -60836 -60605 -60370 -58801 -57233 -57095 -56954 -60452 -63950 -63157 -62359 -61059 -59759 -58459 -57155 -56033
$$ packed form
-2273f9561J524J527P12P15k150k146k12k09K649K653o15o11Q16Q20n85n81K276K280J08J12
-2253f0478J12J12j01r7J334J334K373K377m84m85j799j796J065J066P94P97o33o34j203j200
-2233e7546j200j199L16L21L20L21J211J214J215J214q34q31l696l692O56O59O56O59n96n92
-2213f1424n96n93%M%Ml8l3l7l4j587j584K825K827K556l163k809k806l65l61J065J070J26
-2190f4953J27j304j304l50l50K034K034Q87Q87j498j498r91r91r91r91J028J029K459K458
-2171f2278J714J714j624j625j609j610J729J729L28L27L28L28O41O45j744j740q49q46q50
-2152f5292q45J773J777L43L46L13L17L13L17J244J248J245J248J185J188k153k150j647j643
-2133f0873k16k12K31K34K31K35J569J568J38J41l498l498P93P98J300J300J300J304J122
$$ plain form
-2114 -56033 -54912 -56175 -57434 -58235 -59036 -59837 -60634 -62121 -63608 -63663 -63716 -62132 -60549 -60396 -60240 -58924 -57609 -58679 -59744
-2095 -59744 -61201 -62654 -64111 -65564 -67169 -68771 -67039 -65303 -63973 -62639 -63693 -64744 -62699 -60649 -58604 -56555 -56775
-2078 -56775 -56991 -57211 -57427 -58094 -58757 -61808 -64856 -64196 -63533 -62874 -62210 -60180 -58146 -59453 -60757 -60221 -59681 -59140 -58600 -59103
-2058 -59103 -59606 -57725 -55843 -57535 -59222 -58526 -57829 -58921 -60012 -59673 -59334 -61093 -62848 -61264 -59681 -58723 -57766 -58239 -58712
-2039 -58712 -58809 -58902 -58995 -59088 -59122 -59155 -55851 -52546 -52550 -52553 -52557 -52557 -53157 -53757 -54357 -54953 -54182 -53410 -55977 -58541 -58246 -57952 -57658 -57360 -57155 -56950
-2013 -56950 -57877 -58801 -62143 -60716 -57978 -58097 -58950 -59804 -58451 -57095 -58097 -59100 -60102 -61100 -61443 -61786 -59744 -57702 -55929
-1994 -55929 -54156 -54767 -55374 -57088 -58801 -59085 -59368 -56968 -54569 -53600 -52628 -51950 -51272 -52978 -54685 -56033 -57382 -56346 -55307
-1975 -55307 -53898 -52490 -53466 -54442 -55329 -56216 -57103 -57986 -59401 -60813 -59841 -58869 -58705 -58537 -56939 -55340 -54133 -52922 -55050
$$ packed form
-2114e6033J121j263j259q01q01q01p97j487j487n5n3J584J583J53J56J316J315j070j065
-2095e9744j457j453j457j453j605j602J732J736J330J334j054j051K045K050K045K049k20
-2078e6775k16k20k16o67o63l051l048O60O63O59O64K030K034j307j304N36N40N41N40n03
-2058e9103n03J881J882j692j687O96O97j092j091L39L39j759j755J584J583R58R57m73m73
-2039e8712r7r3r3r3l4l3L304L305mlm%o00o00o00n96P71P72k567k564K95K94K94K98K05K05
-2013e6950r27r24l342J427K738j19q53q54J353J356j002j003j002r98l43l43K042K042J773
-1994e5929J773o11o07j714j713k84k83K400K399R69R72O78O78j706j707j348j349J036J039
-1975e5307J409J408r76r76q87q87q87q83j415j412R72R72J64J68J598J599J207J211k128
$$ plain form
-1956 -55050 -57177 -56328 -55474 -56052 -56629 -54681 -52732 -53168 -53600 -54275 -54949 -54193 -53433 -56447 -59461 -60091 -60716 -59260 -57803 -58731
-1936 -58731 -59655 -60970 -62281 -62047 -58947 -55910 -55731 -57881 -60027 -62617 -62341 -61592 -60839 -57378 -58682 -62434 -63321 -62006 -63552
-1917 -63552 -63310 -63067 -64017 -64967 -64785 -64602 -61968 -64103 -66238 -63604 -61119 -58634 -58414 -58194 -57185 -59036 -60530 -57255 -58541
-1898 -58541 -59826 -58608 -57389 -55292 -56056 -55210 -54364 -54860 -55355 -54599 -53843 -53261 -55541 -56391 -54379 -54543 -54707 -57851 -60996 -61488
-1878 -61488 -59118 -56749 -57240 -59610 -61979 -61011 -60042 -62259 -61611 -57628 -56503 -56573 -56641 -56890 -57136 -58533 -59927 -61145 -62359
-1859 -62359 -64263 -63302 -61570 -59833 -59032 -58228 -57725 -57218 -54301 -56149 -60385 -59848 -58377 -56901 -59424 -61942 -60500 -59055
-1841 -59055 -57613 -56167 -58436 -60702 -62192 -60821 -60705 -60586 -59036 -57486 -55925 -57222 -56909 -56596 -57986 -59371 -58194 -57017
-1823 -57017 -60385 -60888 -59781 -61536 -64308 -64215 -61797 -59379 -58537 -60553 -59528 -58503 -58854 -59200 -58116 -57032 -58332 -59629
$$ packed form
-1956e5050k127Q49Q54n78n77J948J949m36m32o75o74P56P60l014l014o30o25J456J457r28
-1936e8731r24j315j311K34L100L037J79k150k146k590K76P49P53L461j304l752q87J315j546
-1917f3552K42K43r50r50J82J83K634k135k135K634K485K485K20K20J009j851j494L275j286
-1898e8541j285J218J219K097p64Q46Q46m96m95P56P56N82k280q50K012j64j64l144l145m92
-1878f1488K370K369m91k370k369R68R69k217O48L983J125p0o8k49k46j397j394j218j214
-1859f2359j904R61J732J737Q01Q04N03N07K917j848m236N37J471J476k523k518J442J445
-1841e9055J442J446k269k266j490J371J16J19J550J550J561j297L13L13j390j385J177J177
-1823e7017l368n03J107j755k772R3K418K418Q42k016J025J025l51l46J084J084j300j297
$$ plain form
-1805 -59629 -60329 -58168 -56190 -57069 -57591 -58112 -57967 -57818 -57490 -60023 -61190 -62352 -62263 -62173 -60176 -58176 -58559 -58943 -59032 -59118 -60634
-1784 -60634 -62151 -61294 -60433 -61778 -63123 -64293 -62598 -61082 -59565 -57021 -54476 -55269 -56059 -57300 -58541 -61391 -61376 -61648 -61920
-1765 -61920 -58019 -56976 -58112 -59249 -58179 -57106 -60042 -62978 -62576 -62169 -63615 -65061 -64003 -60079 -57978 -58738 -60094 -61447
-1747 -61447 -61968 -62490 -61760 -61026 -59032 -59901 -61365 -62825 -63067 -60448 -58187 -60690 -60173 -59655 -59435 -59211 -59439 -59666 -61026 -62382
-1727 -62382 -66029 -64904 -64081 -63254 -64397 -65538 -66502 -67464 -65448 -60567 -55691 -53671 -53146 -52617 -53701 -54781 -55992 -57203
-1709 -57203 -56983 -56760 -56927 -57095 -57263 -57427 -56536 -55646 -54577 -56365 -57293 -58220 -59327 -60430 -60176 -59923 -59670 -59416 -58805 -58194 -57762
-1688 -57762 -57330 -56577 -58686 -59185 -59684 -60035 -60385 -64669 -62278 -58742 -58064 -56790 -55515 -52278 -49036 -50266 -51495 -51439 -54241
-1669 -54241 -57043 -56983 -58686 -60385 -58567 -56749 -55895 -55039 -55433 -55828 -56197 -53701 -52993 -52285 -49510 -49592 -51402 -53213 -53686 -54156
$$ packed form
-1805e9629p00K161J978q79n22n21J45J49L28k533j167j162Q9R0J997K000l83l84q9q6j516
-1784f0634j517Q57Q61j345j345j170J695J516J517K544K545p93p90j241j241k850J5k72k72
-1765f1920L901J043j136j137J070J073k936k936M02M07j446j446J058L924K101p60j356j353
-1747f1447n21n22P30P34J994q69j464j460k42K619K261k503N17N18K20K24k28k27j360j356
-1727f2382l647J125Q23Q27j143j141r64r62K016M881M876K020N25N29j084j080j211j211
-1709e7203K20K23j67j68j68j64Q91Q90J069j788r28r27j107j103K54K53K53K54O11O11M32
-1688e7762M32P53k109m99m99l51l50m284K391L536O78J274J275L237L242j230j229N6k802
-1669e4241k802O0j703j699J818J818Q54Q56l94l95l69K496P08P08K775q2j810j811m73m70
$$ plain form
-1649 -54156 -54625 -55094 -55623 -56149 -56857 -57561 -59073 -63444 -62572 -58835 -57799 -56760 -55545 -54327 -56451 -58570 -59919 -58403 -58492
-1630 -58492 -58578 -58488 -58395 -56637 -54875 -53712 -55407 -57658 -57043 -58220 -59394 -59319 -59241 -59345 -59446 -56130 -55676 -55042 -54405 -54994 -55582
-1609 -55582 -54919 -54252 -51793 -52196 -54327 -56454 -55724 -54994 -55039 -57941 -58168 -58395 -60232 -62065 -61935 -61804 -61674 -61540 -61462 -61383 -61305 -61223
-1587 -61223 -63380 -65538 -64356 -63172 -63108 -63045 -63161 -63272 -60050 -59688 -61056 -62419 -62631 -62844 -63056 -63265 -64401 -65538 -65422 -65303
-1567 -65303 -65552 -68663 -68734 -68801 -69945 -71089 -68894 -66696 -64524 -62352 -61611 -60865 -58395 -55925 -54886 -53843 -54312 -54781 -56682
-1548 -56682 -58578 -59763 -60947 -62132 -63313 -62367 -61421 -60474 -59524 -58280 -57035 -57222 -57404 -55325 -53246 -53552 -53854 -55948 -58041
-1529 -58041 -56797 -55549 -54349 -53150 -53381 -53608 -54018 -54427 -52453 -50475 -52468 -54461 -54070 -53679 -55821 -57963 -57721 -57479 -55918
-1510 -55918 -54357 -52796 -51235 -51700 -52166 -54062 -55959 -56376 -56793 -57211 -57628 -58939 -60251 -60132 -60012 -59632 -59252 -58872 -58492 -57814
$$ packed form
-1649e4156m69m69n29n26p08p04j512m371Q72L737J036J039J215J218k124k119j349J516q9
-1630e8492q6R0R3J758J762J163j695k251O15j177j174P5P8j04j01L316M54O34O37n89n88
-1609e5582O63O67K459m03k131k127P30P30m5k902k27k27j837j833J30J31J30J34P8P9P8Q2
-1587f1223k157k158J182J184O4O3j16j11L222L62j368j363k12k13k12k09j136j137J16J19
-1567f5303k49l111p1o7j144j144K195K198K172K172P41P46K470K470J039J043m69m69j901
-1548e6682j896j185j184j185j181R46R46R47R50J244J245j87j82K079K079l06l02k094k093
-1529e8041J244J248J200J199k31k27m10m09J974J978j993j993L91L91k142k142K42K42J561
-1510e5918J561J561J561m65m66j896j897m17m17m18m17j311j312J19J20L80L80L80L80O78
$$ plain form
-1490 -57814 -57136 -56458 -55780 -54636 -53492 -54733 -55970 -56376 -56782 -54804 -52822 -52706 -52591 -52475 -52356 -53254 -54152 -53619 -53083 -52360
-1470 -52360 -51637 -50914 -50188 -50389 -50590 -52222 -53850 -56808 -59766 -59386 -59003 -58563 -58123 -56253 -54379 -52628 -50873 -51507 -52136 -52859
-1450 -52859 -53578 -54301 -55020 -56383 -57743 -54815 -51883 -53157 -54427 -55702 -56972 -56737 -56499 -56264 -56026 -56328 -56626 -59312 -61994
-1431 -61994 -64338 -66678 -66637 -66592 -64971 -63347 -63157 -62963 -62214 -61465 -58928 -59249 -61778 -61447 -62903 -64356 -62445 -60534 -58265
-1412 -58265 -58854 -61443 -61171 -59349 -57524 -57781 -58038 -58116 -61052 -59819 -58585 -57531 -56473 -56179 -55884 -55769 -55650 -55474 -58161 -57807
-1392 -57807 -57449 -57415 -57382 -59733 -62080 -60795 -59509 -59833 -60154 -58123 -58954 -60381 -61804 -61026 -57386 -55534 -53679 -52322 -53824
-1373 -53824 -53716 -53608 -55948 -58284 -60441 -62598 -63835 -62207 -62188 -62169 -63049 -63924 -64800 -65675 -65362 -65049 -64736 -64420 -62348 -60277
-1353 -60277 -58801 -60184 -60765 -58485 -56383 -57140 -58287 -59435 -56648 -53857 -52580 -54159 -57289 -60418 -61406 -59528 -59260 -58991
$$ packed form
-1490e7814O78O78O78J144J144j241j237m06m06J978J982J16J15J16J19q98q98N33N36P23
-1470e2360P23P23P26k01k01j632j628k958k958L80L83M40M40J870J874J751J755o34o29p23
-1450e2859p19p23p19j363j360K928K932j274j270j275j270K35K38K35K38l02k98k686k682
-1431f1994k344k340M1M5J621J624J90J94P49P49K537l21k529L31j456j453J911J911K269
-1412e8265n89k589K72J822J825k57k57p8k936J233J234J054J058K94K95J15J19J76k687L54
-1392e7807L58L4L3k351k347J285J286l24l21K031q31j427j423P78L640J852J855J357j502
-1373e3824J08J08k340k336k157k157j237J628J9J9q80q75q76q75L13L13L13L16K072K071
-1353f0277J476j383n81K280K102p57j147j148K787K791J277j579l130l129r88J878K68K69
$$ plain form
-1335 -58991 -59562 -60128 -62304 -61618 -60370 -59118 -59893 -60668 -60880 -58231 -55582 -55795 -55828 -55862 -56253 -56644 -54986 -56190 -58168 -60146
-1315 -60146 -60992 -61838 -61074 -63172 -62743 -62315 -61469 -57762 -58436 -61972 -62944 -61056 -60053 -59051 -59301 -59550 -58488 -57427 -58749
-1296 -58749 -60072 -59893 -59711 -58101 -56488 -57442 -58392 -56961 -55527 -57181 -58831 -59055 -59275 -59081 -58883 -61074 -63261 -62747 -62229
-1277 -62229 -60281 -58332 -58414 -58492 -60001 -61510 -59163 -56812 -55892 -54971 -53876 -52777 -53109 -53440 -55817 -58190 -57225 -56261 -56581 -56898
-1257 -56898 -54830 -52762 -54036 -55307 -56577 -57848 -58556 -59260 -57579 -55899 -54372 -52840 -55605 -58366 -58775 -59181 -59591 -59997
-1239 -59997 -60243 -60485 -58347 -56205 -56361 -56514 -52378 -48239 -49577 -50914 -53682 -56451 -56447 -56443 -56439 -56436 -56715 -56994 -58705 -60415 -58667
-1218 -58667 -56920 -57557 -58194 -58623 -59051 -59480 -59908 -59651 -59394 -59137 -58880 -58526 -58172 -57818 -57464 -56752 -56041 -55329 -54617 -54979 -55337 -55698
-1196 -55698 -56056 -56417 -56775 -57136 -57494 -56827 -56156 -55489 -54819 -54152 -53481 -52814 -52144 -54204 -56261 -58321 -60377 -60173 -59964 -58328 -56689
$$ packed form
-1335e8991n71n66k176O86J248J252p75p75k12K649K649k13l3l4l91l91J658j204j978j978
-1315f0146q46q46P64k098M29M28Q46L707o74l536r72J888J003J002k50k49J062J061j322
-1296e8749j323J79J82J610J613r54r50J431J434j654j650k24k20J94J98k191k187N14N18
-1277f2229J948J949q2p8j509j509K347K351R20R21J095J099l32l31k377k373R65R64l20l17
-1257e6898K068K068j274j271j270j271p08p04J681J680J527J532k765k761m09m06m10m06
-1239e9997k46k42K138K142j56j53M136M139j338j337k768k769MMMLk79k79j711j710J748
-1218e8667J747o37o37m29m28m29m28K57K57K57K57L54L54L54L54P12P11P12P12l62l58l61
-1196e5698l58l61l58l61l58O67O71O67O70O67O71O67O70k060k057k060k056K04K09J636J639
$$ plain form
-1175 -56689 -54122 -51551 -51369 -51182 -53444 -55702 -56533 -57360 -58515 -59666 -58433 -57199 -56566 -55929 -53861 -51793 -51421 -51045 -52099
-1156 -52099 -53153 -54033 -54908 -54353 -53798 -53608 -53414 -51790 -50165 -52926 -55683 -55102 -54521 -54755 -54986 -55217 -55448 -56071 -56689 -57307 -57926
-1135 -57926 -57665 -57401 -57140 -56875 -58641 -60404 -59785 -59163 -59148 -59129 -60545 -61957 -62687 -63414 -61760 -60102 -60187 -60273 -60359 -60444 -60381 -60318 -60254
-1112 -60254 -60191 -59241 -58291 -57341 -56391 -56573 -56756 -58369 -59983 -58407 -56831 -57639 -58444 -60504 -62564 -63194 -63820 -61827 -59833 -60225
-1092 -60225 -60612 -61331 -62050 -62769 -63485 -60892 -58295 -59036 -59778 -59956 -60132 -60307 -60482 -60944 -61402 -61860 -62319 -60366 -58410 -56454 -54498
-1071 -54498 -54141 -53779 -54852 -55921 -57680 -59435 -56901 -54364 -53634 -52900 -54554 -56205 -56667 -57125 -55202 -53276 -52281 -51287 -52676
-1052 -52676 -54062 -54886 -55709 -56533 -57352 -60225 -63097 -63585 -64070 -61696 -59323 -61242 -63157 -63142 -63127 -63112 -63093 -63347 -63600 -63854 -64103
-1031 -64103 -63261 -62419 -61577 -60731 -61469 -62207 -58652 -55094 -56980 -58861 -60746 -62628 -61383 -60135 -61275 -62412 -63522 -64628
$$ packed form
-1175e6689K567K571J82J87k262k258q31q27j155j151J233J234O33O37K068K068L72L76j054
-1156e2099j054q80q75N55N55J90J94J624J625k761k757N81N81k34k31k31k31o23o18o18o19
-1135e7926K61K64K61K65j766j763O19O22J5J9j416j412p30p27J654J658q5q6q6q5O3O3O4
-1112f0254O3R50R50R50R50j82j83j613j614J576J576q08q05k060k060o30o26J993J994l92
-1092f0225l87p19p19p19p16K593K597p41p42j78j76j75j75m62m58m58m59J953J956J956J956
-1071e4498L57L62j073j069j759j755K534K537P30P34j654j651m62m58J923J926R95R94j389
-1052e2676j386q24q23q24q19k873k872m88m85K374K373j919j915J5J5J5J9k54k53k54k49
-1031f4103Q42Q42Q42Q46p38p38L555L558j886j881j885j882J245J248j140j137j110j106
$$ plain form
-1013 -64628 -62400 -60169 -60415 -60657 -60903 -61145 -61767 -62386 -60623 -58857 -57632 -56402 -58515 -60623 -61946 -63265 -64587 -65906
-995 -65906 -63742 -61573 -59409 -57240 -56003 -54763 -53526 -52285 -52837 -53384 -53936 -54483 -55869 -57252 -58638 -60020 -58902 -57781
-977 -57781 -56663 -55541 -56130 -56715 -57300 -57885 -58116 -58343 -60001 -61659 -60072 -58481 -54506 -50530 -52639 -54744 -56849 -58954 -59532
-958 -59532 -60105 -60679 -61253 -59178 -57099 -55020 -52941 -53429 -53913 -55828 -57743 -57725 -57702 -55296 -52889 -52986 -53083 -49841 -46600 -48455
-938 -48455 -50311 -53597 -56883 -58082 -59282 -60482 -61681 -62672 -63663 -62270 -60877 -61834 -62792 -65538 -62561 -59822 -57084 -55419
-920 -55419 -53753 -55381 -57009 -57207 -57404 -55277 -53150 -51022 -48895 -49655 -50415 -51175 -51931 -54241 -56551 -57430 -58306 -58135 -57963 -60176
-900 -60176 -62386 -61052 -59718 -59636 -59550 -60512 -58611 -58321 -58027 -57646 -57266 -56708 -56145 -56816 -54625 -54044 -53459 -53861 -54264 -54666 -55065 -57550
-878 -57550 -60035 -60314 -60590 -58544 -59360 -61607 -60988 -60165 -59342 -58339 -57334 -57017 -56700 -56383 -56063 -56778 -57494 -58209 -58921 -59010 -59100 -59368
$$ packed form
-1013f4628K228K231k46k42k46k42o22o19J763J766J225J230k113k108j323j319j322j319
-995f5906K164K169K164K169J237J240J237J241n52n47n52n47j386j383j386j382J118J121
-977e7781J118J122n89n85n85n85k31k27j658j658J587J591L975L976k109k105k105k105n78
-958e9532n73n74n74K075K079K079K079m88m84j915j915J8K3K406K407r7r7L242L241j855
-938d8455j856l286l286j199j200j200j199r91r91J393J393r57r58k746K977K739K738J665
-920e5419J666j628j628j98j97K127K127K128K127p60p60p60p56k310k310q79q76J71J72k213
-900f0176k210J334J334Q2Q6r62J901K90K94L81L80N58N63o71K191N81N85m02m03m02l99k485
-878e7550k485k79k76K046q16k247O19Q23Q23J003J005L17L17L17L20p15p16p15p12q9r0k68
$$ plain form
-856 -59368 -59632 -56786 -56801 -58366 -59927 -61223 -59658 -59107 -55691 -52017 -51205 -51942 -52680 -54372 -56063 -57933 -56942 -54267 -51592
-837 -51592 -52732 -51011 -51585 -52159 -52553 -52948 -52658 -52367 -53686 -55005 -52866 -53589 -58425 -60400 -60377 -57494 -53179 -53634 -54744 -52993
-817 -52993 -53150 -53306 -56290 -59271 -57661 -53191 -51168 -49141 -49320 -49498 -50769 -52036 -53302 -54569 -54498 -54424 -55959 -54632 -53906
-798 -53906 -53176 -52267 -51358 -52896 -54431 -54536 -54640 -56216 -57788 -56976 -56164 -56249 -56331 -56413 -56495 -56056 -55616 -55176 -54737 -54953 -55169 -53954
-776 -53954 -52740 -55646 -58552 -59073 -59595 -59878 -60161 -60623 -58224 -56171 -54118 -54092 -54066 -56454 -55981 -57117 -58254 -57855 -57456 -60396
-756 -60396 -63336 -61417 -59498 -59010 -58522 -59599 -60672 -59360 -58049 -60020 -61987 -63179 -61510 -58660 -55806 -52594 -52244 -52792
-738 -52792 -53336 -55310 -57285 -59874 -59599 -58727 -57855 -57971 -60944 -59923 -58902 -58727 -58548 -55687 -57594 -57270 -56942 -57091 -57240 -55951
-718 -55951 -57524 -59096 -57803 -56991 -56179 -55366 -54550 -53768 -55847 -57926 -57140 -58146 -59152 -59979 -60802 -60258 -59714 -59170 -58623 -56410
$$ packed form
-856e9368k64K846j5j565j561j296J565N51L416L674Q12p37p38j692j691j870R91K675K675
-837e1592j140J721n74n74l94l95K90K91j319j319K139p23m836j975K3K883M315m55j110J751
-817e2993j57j56k984k981J610M470K023K027j79j78j271j267j266j267P1P4j535J327P26
-798e3906P30R09R09j538j535j05j04j576j572Q12Q12q5q2q2q2M39M40M40M39k16k16J215
-776e3954J214k906k906n21n22k83k83m62K399K053K053K6K6k388M73j136j137L99L99k940
-756f0396k940J919J919M88M88j077j073J312J311j971j967j192J669K850K854L212L50n48
-738e2792n44j974j975k589K75Q72Q72j16k973J021J021J75J79K861j907L24L28j49j49J289
-718e5951j573j572J293Q12Q12Q13Q16P82k079k079P86j006j006q27q23N44N44N44N47K213
$$ plain form
-698 -56410 -54196 -55322 -56443 -55825 -55206 -57926 -60642 -60560 -60478 -60217 -62814 -63675 -64532 -63183 -61834 -61413 -60988 -60385 -59781 -61193
-678 -61193 -59740 -59539 -62199 -65608 -66152 -64193 -62233 -59066 -55895 -56898 -55039 -53243 -54305 -56618 -56071 -53753 -51432 -49707
-660 -49707 -50843 -52490 -54133 -53094 -56823 -58425 -57162 -55422 -53682 -53466 -53246 -54457 -55668 -55035 -54398 -55191 -55985 -55560 -55132
-641 -55132 -57088 -59044 -58928 -58809 -56901 -57855 -59856 -58991 -54014 -51898 -51529 -51156 -52393 -53630 -52486 -51339 -50191 -49044 -49331
-622 -49331 -49614 -48291 -49826 -50590 -51350 -49908 -48463 -47796 -47125 -43776 -40423 -35762 -26328 -14454 4098 31147 70598
-605 70598 123876 180018 208378 184284 130202 76124 34426 7038 -11649 -23657 -28456 -33251 -39063 -44871 -44294
-590 -44294 -43712 -44566 -45415 -46715 -48012 -48954 -52755 -54889 -54159 -55042 -55921 -54629 -50471 -49357 -48239 -47922 -47602 -45080 -42554
-571 -42554 -40508 -41320 -43686 -46048 -51439 -53965 -52978 -54848 -57468 -57222 -58768 -60310 -59852 -59390 -55892 -55251 -56879 -58503 -58880
$$ packed form
-698e6410K214j126j121O18O19k720k716Q2Q2K61k597q61q57J349J349M21M25O03O04j412
-678f1193J453K01k660l409n44J959J960L167L171j003J859J796j062k313N47K318K321J725
-660d9707j136j647j643J039l729j602J263J740J740K16K20j211j211O33O37p93p94M25M28
-641e5132j956j956J16J19J908r54k001Q65M977K116L69L73j237j237J144J147J148J147k87
-622d9331k83J323j535p64p60J442J445O67O71L349L353M661R434J1874J8552K7049L9451
-605G0598N3278N6142K8360k4094n4082n4078m1698k7388j8687j2008m799m795n812n808N77
-590d4294N82q54q49j300j297r42l801k134P30q83q79J292M158J114J118L17L20K522K526
-571d2554K046q12k366k362n391k526R87j870k620K46j546j542M58M62L498O41j628j624l77
$$ plain form
-552 -58880 -59252 -57274 -55292 -54923 -51689 -47297 -42900 -39759 -36615 -31213 -25807 -22848 -26563 -31354 -36142 -41171 -46197 -48545
-534 -48545 -48027 -49122 -50214 -49670 -49122 -48578 -48030 -49603 -51171 -50355 -49539 -50665 -51786 -52729 -53671 -54521 -52505 -48701 -50620 -54748
-514 -54748 -56011 -55903 -55795 -55042 -54286 -54960 -55635 -55299 -54960 -54621 -54282 -54595 -54904 -55214 -55523 -55657 -55787 -53533 -51279 -53779 -56275
-493 -56275 -55433 -54591 -53451 -52311 -52602 -52893 -55866 -58839 -59427 -60016 -59562 -59107 -58652 -58198 -56536 -54871 -55530 -59051 -61350 -57926
-473 -57926 -56290 -57516 -57877 -58239 -58779 -59319 -60307 -61294 -60851 -60407 -60176 -59942 -59711 -59476 -58172 -56864 -55560 -54252 -54983 -55709 -57870
-452 -57870 -60027 -58254 -56477 -57088 -57695 -58220 -58742 -59267 -59789 -60314 -60836 -61361 -61883 -62281 -62676 -61048 -59416 -55016 -56335 -58433
-432 -58433 -57665 -55310 -52952 -51313 -55392 -60251 -62244 -60962 -59677 -59409 -59137 -61253 -63365 -61905 -60441 -60407 -60374 -63582 -66786
-413 -66786 -65701 -64614 -62248 -59878 -58943 -58004 -59938 -61868 -63801 -65731 -63254 -60772 -59543 -58313 -58887 -56600 -54133 -54528
$$ packed form
-552e8880l72J978J982L69L234M392M397L141L144N402N406K959l715m791m788n029n026k348
-534d8545N18j095j092N44N48N44N48j573j568Q16Q16j126j121r43r42q50K016L804j919m128
-514e4748j263J08J08P53P56o74o75L36L39L39L39l13l09l10l09j34j30K254K254k500k496
-493e6275Q42Q42J140J140k91k91k973k973n88n89M54M55M55M54J662J665o59l521k299L424
-473e7926J636j226l61l62n40n40r88r87M43M44K31K34K31K35J304J308J304J308p31p26k161
-452e7870k157J773J777o11o07n25n22n25n22n25n22n25n22l98l95J628J632M400j319k098
-432e8433P68K355K358J639m079m859j993J282J285K68K72k116k112J460J464L4L3l208l204
-413f6786J085J087K366K370R35R39j934j930j933j930K477K482J229J230n74K287K467l95
$$ plain form
-395 -54528 -54834 -52278 -51689 -51100 -50318 -52397 -52866 -53336 -53895 -54454 -55012 -55571 -55527 -55482 -54006 -52531 -54364 -56197 -53857 -54379 -56145
-374 -56145 -55050 -56100 -54290 -53761 -56093 -58246 -57538 -55616 -53694 -53977 -54260 -54185 -54111 -54215 -54319 -52382 -53306 -56614 -57062 -58313
-354 -58313 -59565 -60638 -61711 -61246 -60780 -60314 -59848 -58727 -57606 -58869 -60132 -59353 -58574 -59226 -59878 -59874 -59871 -58436 -57002 -57412 -57822
-333 -57822 -54893 -51961 -53474 -54986 -54115 -53239 -53157 -53075 -53172 -53265 -55180 -59956 -63481 -64140 -60728 -60176 -62784 -62527 -61558 -60590 -61827
-312 -61827 -63060 -65027 -66994 -66279 -62699 -59003 -55307 -54770 -54230 -56577 -58921 -60493 -59200 -58805 -58407 -59263 -60117 -62136 -64152
-293 -64152 -65396 -63775 -60906 -58034 -56715 -58254 -57460 -56663 -54796 -52926 -51119 -52170 -53045 -53917 -53481 -53042 -56600 -57293 -57453
-274 -57453 -57609 -60273 -58164 -57222 -56275 -55031 -53787 -53857 -53925 -53992 -54059 -54994 -55925 -55068 -57073 -59439 -58939 -57844 -56749 -57855 -58958
-253 -58958 -57676 -56395 -57620 -58842 -58634 -58425 -60277 -62125 -62363 -62602 -62069 -58671 -58313 -57956 -55948 -53936 -55262 -56588 -56786
$$ packed form
-395e4528l06K556N89N89P82k079m69m70n59n59n58n59M4M5J476J475j833j833K340n22j766
-374e6145J095j050J810N29k332k153P08J922J922k83k83P5P4j04j04J937r24l308m48j251
-354e8313j252j073j073M65M66M66M66J121J121j263j263P79P79o52o52MLJ435J434m10m10
-333e7822K929K932j513j512Q71Q76Q2Q2r7r3j915m776l525o59L412N52k608K57R69R68j237
-312f1827j233j967j967P15L580L696L696N37N40k347k344j572J293L95L98q56q54k019k016
-293f4152j244J621K869K872J319j539P94P97J867J870J807j051q75q72M36M39l558o93j60
-274e7453j56k664K109R42R47J244J244p0o8o7o7r35r31Q57k005k366N00J095J095j106j103
-253e8958J282J281j225j222K08K09j852j848k38k39N33L398L58L57K008K012j326j326j98
$$ plain form
-234 -56786 -56980 -58783 -57725 -58488 -59249 -61439 -60769 -61860 -62948 -63857 -64766 -63347 -61924 -61275 -63488 -62576 -61659 -62531 -60541 -59480
-214 -59480 -58414 -57170 -55925 -55936 -55944 -54342 -55601 -56193 -56782 -57550 -58317 -57777 -57233 -56868 -56503 -57155 -60664 -64174 -64822 -62851 -60877
-193 -60877 -58902 -56927 -55955 -57840 -58116 -58392 -59506 -60616 -59521 -58425 -58272 -60977 -63503 -61260 -57352 -56302 -54774 -53246
-175 -53246 -56909 -60567 -61544 -59658 -57121 -54580 -54543 -57367 -55739 -54107 -55992 -57877 -59439 -60996 -59394 -57792 -54927 -54919 -56164
-156 -56164 -52639 -50758 -51734 -53366 -54998 -53265 -54390 -56112 -57833 -58515 -56331 -55758 -55184 -54308 -53433 -54942 -56447 -57509 -58570
-137 -58570 -57427 -56279 -56067 -58716 -58325 -57930 -57389 -56849 -56488 -56123 -54856 -56451 -58045 -59636 -58667 -60560 -62453 -61480 -59968
-118 -59968 -58455 -54677 -50896 -48876 -51626 -52945 -54260 -57829 -58533 -56737 -54938 -52278 -52475 -54107 -52874 -53969 -55061 -55799
-100 -55799 -56533 -55750 -52103 -52453 -52799 -53537 -54271 -51786 -52162 -57192 -59357 -59673 -57129 -58910 -60687 -59901 -59114 -57974 -56831 -56462
$$ packed form
-234e6786j94j803J058p63p61k190O70j091j088r09r09J419J423O49k213R12R17q72J990J061
-214e9480J066J244J245j1qJ602j259n92n89p68p67N40N44L65L65o52l509l510o48J971J974
-193f0877J975J975R72j885k76k76j114j110J095J096J53k705k526K243L908J050J528J528
-175e3246l663l658r77J886K537K541L7k824J628J632j885j885j562j557J602J602K865Qj245
-156e6164L525J881r76j632j632J733j125j722j721o82K184N73N74Q76Q75j509j505j062j061
-137e8570J143J148K12k649L91L95N41N40L61L65J267j595j594j591R69j893j893R73J512
-118e9968J513L778L781K020k750j319j315l569p04J796J799K660j97j632J233j095j092p38
-100e5799p34P83L647l50l46p38p34K485l76n030k165l16K544j781j777P86P87J140J143L69
$$ plain form
-80 -56462 -58954 -57930 -56901 -58440 -59975 -62319 -64658 -62590 -57658 -56477 -58153 -58045 -57933 -59345 -60754 -60735 -60713 -59457 -58202
-61 -58202 -58377 -58548 -55802 -53056 -53649 -54237 -54971 -55705 -54234 -52758 -51823 -53749 -55497 -57240 -56193 -55143 -55527 -55907 -56082 -56253
-41 -56253 -57859 -59461 -58049 -56633 -55221 -53805 -56000 -58190 -57047 -55899 -55292 -54681 -55504 -56324 -56849 -57371 -56465 -55556 -57818
-22 -57818 -60076 -62695 -62449 -58928 -58265 -60765 -60400 -59889 -59375 -61726 -61212 -62460 -63704 -64774 -65839 -65210 -64576 -62516 -60452
-3 -60452 -60359 -60262 -60169 -60072 -60117 -60158 -57997 -55832 -53910 -54845 -54174 -53500 -51652 -49800 -50337 -50869 -51525 -52177 -52833 -53485 -54170 -54856 -55899
19 -55899 -54081 -52293 -53366 -54260 -52293 -52606 -52919 -51443 -52829 -55616 -58403 -57255 -56108 -55586 -57926 -60444 -60102 -59103 -60966
38 -60966 -61041 -61115 -57866 -54617 -55661 -56704 -57538 -58373 -57777 -57181 -57475 -57769 -53891 -52870 -56264 -56797 -55005 -53209 -52386 -54424 -53422
59 -53422 -52416 -49565 -46715 -50065 -53410 -55635 -57859 -59487 -58250 -57583 -59778 -61793 -60944 -61454 -61965 -59912 -57855 -56011 -54167
$$ packed form
-80e6462k492J024J029j539j535k344k339K068M932J181j676J08J12j412j409J9K2J256J255
-61e8202j75j71K746K746n93n88p34p34J471J476R35j926j748j743J047J050l84l80j75j71
-41e6253j606j602J412J416J412J416k195k190J143J148O07O11q23q20n25n22R06R09k262
-22e7818k258k619K46L521O63k500L65N11N14k351N14j248j244j070j065O29O34K060K064
-3f0452R3R7R3R7m5m1K161K165J922r35O71O74J848J852n37n32o56o52o56o52o85o86j043
19e5899J818J788j073q94J967l13l13J476j386k787k787J148J147N22k340k518L42R99j863
38f0966p5p4L249L249j044j043q34q35N96N96k94k94L878J021l394n33J792J796Q23k038J002
59e3422J006K851K850l350l345k225k224j628J237O67k195k015Q49n10n11K053K057J844J844
$$ plain form
78 -54167 -55661 -57151 -61067 -64982 -65262 -62680 -62721 -62762 -59465 -56167 -56581 -59856 -61700 -60683 -59785 -58887 -57989 -57091 -56458 -58686
98 -58686 -59304 -59923 -59409 -58895 -56950 -55005 -53634 -52263 -53276 -54290 -55571 -56853 -58313 -56913 -55284 -53656 -51849 -50039 -50765
117 -50765 -51492 -52218 -52941 -53317 -53694 -54070 -54442 -56428 -58414 -57538 -56659 -55687 -54714 -53742 -52766 -52151 -51536 -53783 -56026 -55948 -55869 -55791 -55709
140 -55709 -54200 -52691 -54044 -55392 -53608 -51823 -50039 -48254 -49182 -50109 -51037 -51965 -53965 -55966 -56536 -57106 -56782 -56458 -58995
159 -58995 -61532 -60810 -60087 -57933 -55780 -54670 -53559 -55310 -57062 -55787 -54513 -53239 -51965 -54625 -57285 -57084 -56883 -55862
177 -55862 -54841 -53820 -52799 -53925 -55050 -56175 -57300 -55474 -53649 -54685 -55720 -55147 -54573 -53999 -53425 -53857 -54290 -54722 -55154
196 -55154 -55586 -56018 -56451 -56883 -57181 -57479 -57777 -58075 -58373 -58671 -58969 -59267 -58518 -57766 -57013 -56261 -56704 -57144 -57583 -58023 -57825 -57624 -57423
219 -57423 -57222 -57233 -57240 -58679 -60117 -60631 -61141 -58790 -56439 -55702 -54960 -55650 -56339 -54804 -53265 -51726 -50188 -50799 -51406 -52013 -52621
$$ packed form
78e4167j494j490l916l915k80K582m1m1L297L298m14l275j844J017Q98Q98Q98Q98O33k228
98e8686o18o19N14N14J945J945J371J371j013j014j281j282j460J400J629J628J807J810p26
117e0765p27p26p23l76l77l76l72j986j986Q76Q79R72R73R72R76O15O15k247k243P8P9P8Q2
140e5709J509J509j353j348J784J785J784J785r28r27r28r28k000k001n70n70L24L24k537
159e8995k537P22P23K154K153J110J111j751j752J275J274J274J274k660k660K01K01J021
177e5862J021J021J021j126j125j125j125J826J825j036j035N73N74N74N74m32m33m32m32
196e5154m32m32m33m32k98k98k98k98k98k98k98k98P49P52P53P52m43m40m39m40J98K01K01
219e7423K01j1pj439j438n14n10K351K351P37P42o90o89J535J539J539J538o11o07o07o08
$$ plain form
240 -52621 -52647 -52669 -52870 -50210 -48805 -47397 -47062 -49588 -50322 -51052 -50352 -49651 -54826 -57136 -58194 -59252 -59241 -59226 -59032 -58839 -59841
261 -59841 -57978 -60586 -63194 -61156 -59114 -59934 -60754 -60146 -59535 -58746 -60817 -61350 -61879 -60977 -60076 -59357 -55772 -54096 -52419 -48213
281 -48213 -48772 -51417 -54062 -56652 -59237 -58962 -58686 -59927 -61164 -62400 -63637 -62553 -61465 -60556 -59647 -57341 -57892 -56834 -55776
300 -55776 -55258 -54737 -52606 -53336 -54685 -56033 -56488 -54077 -51730 -52244 -53831 -55415 -58045 -60675 -58537 -56395 -57356 -58317 -58205
319 -58205 -55229 -53738 -55109 -54692 -54271 -54390 -54509 -56417 -55460 -53075 -53552 -53850 -51283 -51521 -51760 -53429 -52233 -52453 -52669 -52889
339 -52889 -53105 -53205 -56164 -58947 -58865 -58608 -55486 -52188 -51749 -53101 -54450 -54193 -56793 -58645 -57632 -55549 -53463 -54360 -55255 -59193
359 -59193 -60266 -59792 -59316 -55623 -54789 -53779 -52766 -53544 -51458 -51056 -50650 -50065 -49480 -51045 -52606 -54167 -55728 -56339 -56946 -57553
379 -57553 -58161 -57103 -56041 -56410 -56778 -57274 -57766 -55873 -53980 -54237 -54491 -54744 -54998 -54226 -53451 -52676 -51901 -51130 -50355 -49580 -48805 -49945
$$ packed form
240e2621k6k2k01K660J405J408L35k526p34p30P00P01n175k310j058j058J1J5J94J93j002
261e9841J863k608k608K038K042q20q20O08O11P89k071n33n29R02R01P19L585J676J677M206
281d8213n59k645k645k590k585K75K76j241j237j236j237J084J088R09R09K306n51J058J058
300e5776N18N21K131p30j349j348m55K411K347n14j587j584k630k630K138K142r61r61J12
319e8205K976J491j371M17M21j19j19j908R57K385m77k98K567k38k39j669J196k20k16k20
339e2889k16j00k959k783Q2K57L122L298M39j352j349K57k600j852J013K083K086q97q95l938
359e9193j073M74M76L693Q34J010J013p78K086M02M06N85N85j565j561j561j561o11o07o07
379e7553o08J058J062l69l68m96m92J893J893k57k54k53k54P72P75P75P75P71P75P75P75j140
$$ plain form
401 -49945 -51082 -52218 -53354 -53779 -54200 -54621 -55042 -54975 -54904 -54834 -54763 -55411 -56056 -58131 -60206 -62594 -64979 -64800 -64621 -63432 -59379
422 -59379 -56458 -58306 -58518 -55866 -53690 -56283 -58820 -58492 -58641 -58790 -60623 -62456 -61905 -61350 -60530 -59711 -60322 -60929 -59349 -57769
442 -57769 -56190 -54606 -52878 -51149 -51805 -52457 -49089 -45721 -48552 -51380 -52304 -53228 -51767 -50303 -50795 -51287 -53209 -55128 -56097
461 -56097 -57065 -55650 -54230 -55720 -57211 -56316 -55419 -56611 -57803 -54703 -51600 -50728 -49856 -51369 -52878 -53854 -54830 -54375 -53917 -55258
481 -55258 -56600 -56212 -55821 -56983 -53377 -51201 -53790 -55184 -56577 -55884 -55188 -53362 -51536 -53824 -56108 -57050 -55132 -52617 -50098
500 -50098 -47941 -48645 -49349 -47188 -48086 -48984 -51134 -50419 -50780 -48280 -47211 -46138 -47405 -48671 -49938 -51201 -50143 -49085 -49815
519 -49815 -47680 -47770 -50720 -53492 -53399 -55098 -56797 -58138 -59476 -59971 -57602 -56842 -56082 -56816 -57546 -58276 -59006 -58198 -57386 -58183 -56119
540 -56119 -58351 -60579 -59290 -58000 -57207 -56410 -56864 -57319 -56644 -53105 -51771 -53299 -55933 -55702 -52311 -51782 -51406 -51026 -52255 -53485
$$ packed form
401d9945j137j136j136m25m21m21m21O7P1P0P1o48o45k075k075k388k385J79J79J189M053
422e9379K921j848k12K652K176k593k537L28j49j49j833j833N51N55Q20Q19o11o07J580J580
442e7769J579J584J728J729o56o52L368L368k831k828r24r24J461J464m92m92j922j919r69
461e6097r68J415J420j490j491Q95Q97j192j192L100L103Q72Q72j513j509r76r76M55M58j341
481e5258j342L88L91j162L606K176k589j394j393O93O96J826J826k288k284r42J918K515K519
500e0098K157p04p04K161q98q98k150P15l61K500J069J073j267j266j267j263J058J058p30
519d9815K135r0k950k772R3j699j699j341j338m95K369P60P60p34p30p30p30Q08Q12p97K064
540e6119k232k228J289J290P93P97m54m55O75L539J334j528k634K31L391N29L76L80j229j230
$$ plain form
560 -53485 -53381 -53273 -53164 -53056 -53936 -54811 -54912 -52151 -51786 -51417 -52300 -53183 -52401 -51615 -50828 -50042 -51581 -53120 -56089 -56197 -56514 -53969
582 -53969 -51246 -51384 -51887 -52390 -51641 -50892 -52468 -54044 -54845 -52784 -53213 -53641 -53891 -54141 -55493 -56845 -54860 -52874 -51879 -50884
$$ packed form
560e3485J04J08J09J08q80q75j01K761L65L69q83q83P82P86P87P86j539j539k969j08l17K545
582e3969K723j38n03n03P49P49j576j576q01K061m29m28k50k50j352j352J985J986R95R95
$$ [...]
##END=	
