##TITLE=	AAucascfQLyHLv5aUvXO$A/0704s
##JCAMPDX=	6.0	$$ NMR Plug-in 1.13 of MestReNova 11.0.4-18998
##DATATYPE=	NMRSPECTRUM
##DATACLASS=	XYDATA
##NUMDIM=	1
##ORIGIN=	Bruker BioSpin GmbH
##OWNER=	andrew
##.OBSERVEFREQUENCY=	600.30184456100005264
##.OBSERVENUCLEUS=	^1H
##.SOLVENTNAME=	CD2Cl2
##.PULSESEQUENCE=	zg
##LONGDATE=	2015/06/05 09:56:44.000
##.ACQUISITIONMODE=	SIMULTANEOUS (DQD)
##$ORIGINALFORMAT=	Bruker XWIN-NMR
##$PARAMETERFILE=	(acqus, ASCII, /var/folders/f6/rjf_tdyn2v98c5c0wvkgn4s80000gn/T/AAucascfQLyHLv5aUvXO$A/0704s/acqus, 0)
$$ ##TITLE= Parameter file, TOPSPIN		Version 2.1
$$ ##JCAMPDX= 5.0
$$ ##DATATYPE= Parameter Values
$$ ##NPOINTS= 10	$$ modification sequence number
$$ ##ORIGIN= Bruker BioSpin GmbH
$$ ##OWNER= andrew
$$ $$ 2015-06-05 14:56:44.928 +0600  andrew@av-600
$$ $$ /opt/data/andrew/nmr/limog-1782/604/acqus
$$ $$ process /opt/ts21pl6/prog/mod/shimcntl
$$ ##$ACQT0= -9.54927425515661
$$ ##$AMP= (0..31)
$$ 100 100 100 100 100 100 100 100 100 100 100 100 100 100 100 100 100 100
$$ 100 100 100 100 100 100 100 100 100 100 100 100 100 100
$$ ##$ANAVPT= -1
$$ ##$AQSEQ= 0
$$ ##$AQ_mod= 3
$$ ##$AUNM= <au_zg>
$$ ##$AUTOPOS= <>
$$ ##$BF1= 600.3
$$ ##$BF2= 600.3
$$ ##$BF3= 600.3
$$ ##$BF4= 600.3
$$ ##$BF5= 600.3
$$ ##$BF6= 600.3
$$ ##$BF7= 600.3
$$ ##$BF8= 600.3
$$ ##$BYTORDA= 0
$$ ##$CFDGTYP= 0
$$ ##$CFRGTYP= 9
$$ ##$CHEMSTR= <none>
$$ ##$CNST= (0..63)
$$ 1 1 145 1 1 1 1 1 1 1 1 1 1 1 1 1 1 1 1 1 1 1 1 1 1 1 1 1 1 1 1 1 1 1 1
$$ 1 1 1 1 1 1 1 1 1 1 1 1 1 1 1 1 1 1 1 1 1 1 1 1 1 1 1 1 1
$$ ##$CPDPRG= <>
$$ ##$CPDPRG1= <>
$$ ##$CPDPRG2= <waltz16>
$$ ##$CPDPRG3= <>
$$ ##$CPDPRG4= <mlev>
$$ ##$CPDPRG5= <mlev>
$$ ##$CPDPRG6= <mlev>
$$ ##$CPDPRG7= <mlev>
$$ ##$CPDPRG8= <mlev>
$$ ##$CPDPRGB= <>
$$ ##$CPDPRGT= <>
$$ ##$D= (0..63)
$$ 0 1 0 0 0 0 0 0 0 0.06 0 0.03 0 0 0 0 1e-04 0 0 0 0 0 0 0 0 0 0 0 0 0 0
$$ 0 0 0 0 0 0 0 0 0 0 0 0 0 0 0 0 0 0 0 0 0 0 0 0 0 0 0 0 0 0 0 0 0
$$ ##$DATE= 1433494604
$$ ##$DBL= (0..7)
$$ 120 120 120 120 120 120 120 120
$$ ##$DBP= (0..7)
$$ 150 150 150 150 150 150 150 150
$$ ##$DBP07= 0
$$ ##$DBPNAM0= <>
$$ ##$DBPNAM1= <>
$$ ##$DBPNAM2= <>
$$ ##$DBPNAM3= <>
$$ ##$DBPNAM4= <>
$$ ##$DBPNAM5= <>
$$ ##$DBPNAM6= <>
$$ ##$DBPNAM7= <>
$$ ##$DBPOAL= (0..7)
$$ 0.5 0.5 0.5 0.5 0.5 0.5 0.5 0.5
$$ ##$DBPOFFS= (0..7)
$$ 0 0 0 0 0 0 0 0
$$ ##$DE= 6.5
$$ ##$DECBNUC= <off>
$$ ##$DECIM= 2218.66666666667
$$ ##$DECNUC= <off>
$$ ##$DECSTAT= 4
$$ ##$DIGMOD= 1
$$ ##$DIGTYP= 12
$$ ##$DL= (0..7)
$$ 0 120 120 120 120 120 120 120
$$ ##$DP= (0..7)
$$ 150 150 150 150 150 150 150 150
$$ ##$DP07= 0
$$ ##$DPNAME0= <>
$$ ##$DPNAME1= <>
$$ ##$DPNAME2= <>
$$ ##$DPNAME3= <>
$$ ##$DPNAME4= <>
$$ ##$DPNAME5= <>
$$ ##$DPNAME6= <>
$$ ##$DPNAME7= <>
$$ ##$DPOAL= (0..7)
$$ 0.5 0.5 0.5 0.5 0.5 0.5 0.5 0.5
$$ ##$DPOFFS= (0..7)
$$ 0 0 0 0 0 0 0 0
$$ ##$DQDMODE= 0
$$ ##$DR= 22
$$ ##$DS= 0
$$ ##$DSLIST= <SSSSSSSSSSSSSSS>
$$ ##$DSPFIRM= 0
$$ ##$DSPFVS= 20
$$ ##$DTYPA= 0
$$ ##$EXP= <>
$$ ##$F1LIST= <111111111111111>
$$ ##$F2LIST= <222222222222222>
$$ [...]
$$ -1 -1 -1 -1 -1 -1 -1 -1 -1 -1 -1 -1 -1 -1 -1 -1 -1 -1 -1 -1 -1 -1 -1 -1
$$ -1 -1 -1 -1 -1 -1 -1 -1 -1 -1 -1 -1 -1 -1 -1 -1 -1 -1 -1 -1 -1 -1 -1 -1
$$ -1 -1 -1 -1 -1 -1 -1 -1 -1 -1 -1 -1 -1 -1 -1 -1 -1 -1 -1 -1 -1 -1 -1 -1
$$ -1 -1 -1 -1 -1 -1 -1 -1 -1 -1 -1 -1 -1 -1 -1 -1 -1 -1 -1 -1 -1 -1 -1 -1
$$ -1 -1 -1 -1 -1 -1 -1 -1 -1 -1 -1 -1 -1 -1 -1 -1
$$ ##$RG_tab8= (0..255)
$$ -1 -1 -1 -1 -1 -1 -1 -1 -1 -1 -1 -1 -1 -1 -1 -1 -1 -1 -1 -1 -1 -1 -1 -1
$$ -1 -1 -1 -1 -1 -1 -1 -1 -1 -1 -1 -1 -1 -1 -1 -1 -1 -1 -1 -1 -1 -1 -1 -1
$$ -1 -1 -1 -1 -1 -1 -1 -1 -1 -1 -1 -1 -1 -1 -1 -1 -1 -1 -1 -1 -1 -1 -1 -1
$$ -1 -1 -1 -1 -1 -1 -1 -1 -1 -1 -1 -1 -1 -1 -1 -1 -1 -1 -1 -1 -1 -1 -1 -1
$$ -1 -1 -1 -1 -1 -1 -1 -1 -1 -1 -1 -1 -1 -1 -1 -1 -1 -1 -1 -1 -1 -1 -1 -1
$$ -1 -1 -1 -1 -1 -1 -1 -1 -1 -1 -1 -1 -1 -1 -1 -1 -1 -1 -1 -1 -1 -1 -1 -1
$$ -1 -1 -1 -1 -1 -1 -1 -1 -1 -1 -1 -1 -1 -1 -1 -1 -1 -1 -1 -1 -1 -1 -1 -1
$$ -1 -1 -1 -1 -1 -1 -1 -1 -1 -1 -1 -1 -1 -1 -1 -1 -1 -1 -1 -1 -1 -1 -1 -1
$$ -1 -1 -1 -1 -1 -1 -1 -1 -1 -1 -1 -1 -1 -1 -1 -1 -1 -1 -1 -1 -1 -1 -1 -1
$$ -1 -1 -1 -1 -1 -1 -1 -1 -1 -1 -1 -1 -1 -1 -1 -1 -1 -1 -1 -1 -1 -1 -1 -1
$$ -1 -1 -1 -1 -1 -1 -1 -1 -1 -1 -1 -1 -1 -1 -1 -1
$$ ##$RG_tabA= (0..255)
$$ 0.25 0.28 0.32 0.35 0.4 0.44 0.5 0.56 0.64 0.7 0.8 0.89 1 1.12 1.28 1.4
$$ 1.6 1.78 2 2.25 2.56 2.8 3.2 3.56 4 4.5 5 5.6 6.35 7.12 8 9 10 11.3 12.7
$$ 14.2 16 18 20.2 22.6 25.4 28.5 32 36 40.3 45.2 50.8 57 64 71.8 80.6 90.5
$$ 101 114 128 144 161 181 203 -1 -1 -1 -1 -1 -1 -1 -1 -1 -1 -1 -1 -1 -1 -1
$$ -1 -1 -1 -1 -1 -1 -1 -1 -1 -1 -1 -1 -1 -1 -1 -1 -1 -1 -1 -1 -1 -1 -1 -1
$$ -1 -1 -1 -1 -1 -1 -1 -1 -1 -1 -1 -1 -1 -1 -1 -1 -1 -1 -1 -1 -1 -1 -1 -1
$$ -1 -1 -1 -1 -1 -1 -1 -1 -1 -1 -1 -1 -1 -1 -1 -1 -1 -1 -1 -1 -1 -1 -1 -1
$$ -1 -1 -1 -1 -1 -1 -1 -1 -1 -1 -1 -1 -1 -1 -1 -1 -1 -1 -1 -1 -1 -1 -1 -1
$$ -1 -1 -1 -1 -1 -1 -1 -1 -1 -1 -1 -1 -1 -1 -1 -1 -1 -1 -1 -1 -1 -1 -1 -1
$$ -1 -1 -1 -1 -1 -1 -1 -1 -1 -1 -1 -1 -1 -1 -1 -1 -1 -1 -1 -1 -1 -1 -1 -1
$$ -1 -1 -1 -1 -1 -1 -1 -1 -1 -1 -1 -1 -1 -1 -1 -1 -1 -1 -1 -1 -1 -1 -1 -1
$$ -1 -1 -1 -1 -1 -1 -1 -1 -1 -1 -1 -1 -1 -1
$$ ##$ROUT14= (0..7)
$$ 0 0 0 0 0 0 0 0
$$ ##$ROUTER= -1
$$ ##$RX22TY= <no>
$$ ##$RXFMAX= (0..7)
$$ 647.5 -1 -1 -1 -1 -1 -1 -1
$$ ##$RXFMIN= (0..7)
$$ 5 -1 -1 -1 -1 -1 -1 -1
$$ ##$RXINTLV= (0..7)
$$ 1 0 0 0 0 0 0 0
$$ ##$RXMSTY= <no>
$$ ##$SCMTY= <no>
$$ ##$SGUC1= (0..15)
$$ 17 18 34 0 0 0 0 0 0 0 0 0 0 0 0 0
$$ ##$SGUC2= (0..15)
$$ 33 256 20 0 0 0 0 0 0 0 0 0 0 0 0 0
$$ ##$SPECTR= 10
$$ ##$SY2FLAG= 0
$$ ##$TFXNUM= 0
$$ ##$TRIPLO2= 0
$$ ##$VTUTY= <tty05>
$$ ##$WBREFAM= (0..15)
$$ 100 100 100 100 100 100 100 100 100 100 100 100 100 100 100 100
$$ ##$WBREFPH= (0..15)
$$ 0 0 0 0 0 0 0 0 0 0 0 0 0 0 0 0
$$ ##$XFAC= 2
$$ ##END=
$$ 
##$DECIM=	2218.66666666667
##$DSPFVS=	20
##XUNITS=	HZ
##YUNITS=	ARBITRARY UNITS
##FIRSTX=	6322.8525384689401108
##LASTX=	-2691.4329892738592207
##XFACTOR=	-0.1375491802509010153
##YFACTOR=	1.1318190429687500451e-05
##NPOINTS=	65536
##XYDATA=	(X++(Y..Y))
$$ [...]
-12274d8421L4j401j397J878J881n03n03r24r20r20r21m54m51m51m51j706j703O82O82L174
$$ -48421 -48387 -49788 -51185 -49307 -47426 -47929 -48432 -49356 -50276 -51196 -52117 -52571 -53022 -53473 -53924 -55630 -57333 -56651 -55969 -52795
-12254e2795L178j114j114J5J9j412j412J632J635K05K05j885j882J457J457K940K943l99
$$ -52795 -49617 -50731 -51845 -51830 -51811 -53223 -54635 -53003 -51368 -51163 -50958 -52843 -54725 -53268 -51811 -48871 -45928 -46327
-12236d6327l95j948j945M36M40J427J430r57r54N92N96j792j788O30O29q01q01K13K12K12
$$ -46327 -46722 -48670 -50615 -50179 -49739 -48312 -46882 -47839 -48793 -48201 -47605 -49397 -51185 -50555 -49926 -50727 -51528 -51315 -51103 -50891
-12216e0891K13o90o89o89o89K34K35K35K34J733J736k556k556q60q57J527J528Q08Q13o19
$$ -50891 -50678 -51368 -52057 -52746 -53435 -53201 -52966 -52731 -52497 -50764 -49028 -51584 -54140 -55000 -55857 -54330 -52802 -51994 -51181 -51800
-12196e1800o18J047J050J051J051o56o52o52o52k623k619k35k35K01K05J636J636L062L067
$$ -51800 -52418 -51371 -50321 -49270 -48219 -48875 -49527 -50179 -50831 -53454 -56073 -56308 -56543 -56342 -56137 -54501 -52865 -49803 -46736
-12177d6736M795M795Q889J3659J8844K3618P518j4419k1153j6383j1371j1371p258m392j625
$$ -46736 -41941 -37146 -28257 -14598 4246 27864 35382 20963 -190 -16573 -27944 -39315 -46573 -50965 -52590
-12162e2590J237J05J08j539L230k27l085P56P57N77N81k552k552m162j296j68j68J442J446
$$ -52590 -51353 -51248 -51140 -52679 -49449 -49676 -52761 -52005 -51248 -50671 -50090 -52642 -55194 -59356 -60652 -60820 -60988 -59546 -58100
-12143e8100J390J393M609J751j651J215l99l256J636J639K6L0M43M47L126j639j028j025
$$ -58100 -56710 -55317 -50708 -48957 -50608 -49393 -49792 -53048 -51412 -49773 -49747 -49717 -49274 -48827 -45701 -47340 -48368 -49393
-12125d9393j326j323j565j561K727K731q86q83J497J502l50l47k556k552Q01L663R79n696
$$ -49393 -50719 -52042 -53607 -55168 -52441 -49710 -50596 -51479 -49982 -48480 -48830 -49177 -51733 -54285 -53484 -49821 -48842 -54538
-12107e4538l998K679J844J844o59o60o59o60m50m51K768r3k567K94Q91Q90J636J635k477
$$ -54538 -58536 -55857 -54013 -52169 -52828 -53488 -54147 -54807 -55257 -55708 -52940 -53033 -55600 -55306 -54415 -53525 -51889 -50254 -52731
-12088e2731k478m73K388O00O00K090p71r50J911J811j047k601k597O49O52K079K082j79j75
$$ -52731 -55209 -55682 -53294 -52694 -52094 -50004 -50775 -51725 -49814 -48003 -49050 -51651 -54248 -53599 -52947 -50868 -48786 -48965 -49140
-12069d9140p75l632l428n62k355k351J509J512K940K943O75O78r35J930J360J363J08J12
$$ -49140 -49915 -53547 -56975 -57537 -59892 -62243 -60734 -59222 -56282 -53339 -52664 -51986 -52921 -50991 -49631 -48268 -48160 -48048
-12051d8048l99l95n77n74J494j363j364J498J23J26J558J557J189j670j311j311l044j79
$$ -48048 -48447 -48842 -49419 -49993 -48499 -49862 -51226 -49728 -49605 -49479 -47921 -46364 -45175 -46845 -48156 -49467 -52511 -52690
-12033e2690J430j430k396M66Q83Q83K015q45P63P64j345j345j166j166l044j83L335M73M25
$$ -52690 -51260 -52690 -55086 -54620 -53737 -52854 -50839 -51684 -50921 -50157 -51502 -52847 -54013 -55179 -58223 -58406 -55071 -54598 -54173
-12014e4173L286J319J319p08l569j781j781r47J916K511K511O93k169j989j990J517J520
$$ -54173 -50887 -49568 -48249 -48957 -52526 -54307 -56088 -57035 -55119 -52608 -50097 -49404 -51573 -53562 -55552 -54035 -52515
-11997e2515Q9R0j316j311j133j132R05L771P30P30j68j64j63j64k6k7j456j457K388K388
$$ -52515 -52426 -52336 -53652 -54963 -56096 -57228 -56323 -52552 -51822 -51092 -51260 -51424 -51587 -51751 -51777 -51804 -53260 -54717 -52329 -49941
-11977d9941MMk05k05j636j635J375J374n6n5r21r20r20r20K42K42j010j009k620K42O4O3
$$ -49941 -49937 -49933 -50138 -50343 -51979 -53614 -52239 -50865 -50921 -50976 -51897 -52817 -53737 -54657 -54415 -54173 -55183 -56192 -58812 -58570 -58506 -58443
-11955e8443p71p71L342L342K071p90m128j263j475j476K042K046J609J610J609J613m47m47
$$ -58443 -59214 -59985 -56643 -53301 -51230 -52020 -56148 -57411 -58886 -60362 -58320 -56274 -54665 -53055 -51446 -49833 -50280 -50727
-11937e0727m47m43K6K6K6L0J427J427m%p79p78p79p75j941j941M43M47J278J282K6L0j614
$$ -50727 -51174 -51617 -51591 -51565 -51539 -51509 -50082 -48655 -48659 -48659 -49438 -50216 -50995 -51770 -53711 -55652 -55209 -54762 -53484 -52202 -52176 -52146 -53760
-11914e3760J252j82j79k657K09K6L0J188J193J188J192M1M5M1M5m06m03m06m02o89o86J695
$$ -53760 -52508 -52690 -52869 -55526 -55317 -55291 -55261 -54073 -52880 -51692 -50500 -50459 -50414 -50373 -50328 -50734 -51137 -51543 -51945 -52634 -53320 -51625
-11892e1625J699N63N66q68q64L39L42L43L43j539j535Q50Q49J211J215k16k16L16L21j111
$$ -51625 -49926 -49363 -48797 -49665 -50529 -50190 -49848 -49505 -49162 -50701 -52236 -51386 -50537 -49326 -48111 -48327 -48543 -48227 -47906 -49017
-11872d9017j110q53q50N82N81r73r68M62M62j271j267R39R39K008q49o71o70l69l65j796
$$ -49017 -50127 -50980 -51830 -51248 -50667 -51640 -52608 -52146 -51684 -52955 -54222 -53283 -52344 -50336 -51185 -51856 -52526 -52895 -53260 -55056
-11852e5056j796o67o63P67P68j934j930M270M270n03m99j930j930M58M62j923j922n25n22
$$ -55056 -56852 -57519 -58182 -57415 -56647 -58581 -60511 -56241 -51971 -52474 -52973 -54903 -56833 -56375 -55913 -57836 -59758 -60283 -60805
-11833f0805n22n21N10N14K899K899LQL65k496q39K024J367J371K202k567l879j013N6N6J844
$$ -60805 -61327 -61848 -61338 -60824 -57925 -55026 -55023 -55015 -54650 -57146 -57985 -55961 -54594 -53223 -51021 -53588 -57467 -58480 -58424 -58368 -56524
-11812e6524J848k209O52J903r53q95l755q94q91K474K474K295K299r84l845o26o22q9K772
$$ -56524 -54676 -56885 -56233 -54330 -55283 -56178 -59933 -60827 -61718 -59244 -56770 -54475 -52176 -53160 -57005 -57631 -58253 -58342 -55570
-11793e5570K772q6K433K433j31j26o37o37P93P97J286J285k053k049j188j189k798O7K239
$$ -55570 -52798 -52884 -50451 -48018 -48149 -48275 -48912 -49549 -48756 -47959 -46673 -45388 -47441 -49490 -50678 -51867 -54665 -54598 -52359
-11774e2359K240O89k169Q09Q08O30O33J867J867n18n14j2j1j1pq20q16q20q16J05J08J04
$$ -52359 -50119 -49430 -51599 -50790 -49982 -49352 -48719 -46852 -44985 -45503 -46017 -46029 -46040 -46051 -46058 -46878 -47694 -48514 -49330 -49225 -49117 -49013
-11752d9013J08J79J83k99l155q94L878K444m13J870r87r91r88J990J993N59N63j394j390
$$ -49013 -48905 -48726 -48543 -48842 -51997 -52891 -49013 -46569 -46982 -45112 -46099 -47090 -48078 -46088 -44095 -43536 -42973 -44367 -45757
-11733d5757j393j390k019k016j423J442L338M77k683J83k38k39j311j308j058J803J625J628
$$ -45757 -47150 -48540 -50559 -52575 -53998 -52556 -49218 -48741 -51424 -51241 -51479 -51718 -53029 -54337 -55395 -53592 -51967 -50339
-11715e0339k54k53p5k932O41O41M62M66j34j35j34j30j215j214K16K20j722j721k91k87K620
$$ -50339 -50593 -50846 -50921 -53853 -53212 -52571 -52109 -51643 -51777 -51912 -52046 -52176 -53391 -54605 -54389 -54169 -55891 -57612 -57903 -58190 -55570
-11694e5570K619j017l875o30o29q09q05J860J859M28M32L797L797J292j564n455k593p45
$$ -55570 -52951 -53968 -57843 -58473 -59102 -59911 -60716 -58856 -56997 -56569 -56137 -52340 -48543 -47251 -48815 -54270 -56863 -57608
-11676e7608K120J490J490K39K42O26O26j163J703K981J19J311j546k798O3J614J613j844
$$ -57608 -55488 -53998 -52508 -52269 -52027 -51401 -50775 -51938 -50235 -47254 -47135 -45824 -47370 -50168 -50105 -48491 -46878 -48722
-11658d8722j845m13m14j650j651K463K463o08l468m29m28J039J040Q60Q61P12k150Q90L752
$$ -48722 -50567 -50980 -51394 -53044 -54695 -52232 -49769 -50377 -53845 -54274 -54702 -53663 -52623 -51763 -50902 -50190 -52340 -51450 -47698
-11639d7698K463k306j830j829K105K105M96M95j118l979k548L17J296J297j863j859P90P89
$$ -47698 -45235 -47541 -49371 -51200 -49095 -46990 -46494 -45999 -47117 -51096 -53644 -53327 -52031 -50734 -52597 -54456 -53666 -52877
-11621e2877P90P94n81n82m02l99m69K392o48o45n59n59k168O97R91R91J170J173QPJ617j241
$$ -52877 -52087 -51293 -51874 -52456 -52858 -53257 -53726 -51334 -51982 -52627 -53186 -53745 -55913 -55216 -54225 -53234 -52064 -50891 -50883 -50876 -49259 -50500
-11599e0500p26p23j680m538M06M10j382J482K165K168O15k243l39l35l39l35j919R46K672
$$ -50500 -51226 -51949 -53629 -58167 -57761 -57351 -58733 -57251 -55086 -52918 -52303 -54546 -54885 -55220 -55559 -55894 -57813 -56867 -54195
-11580e4195K675q16q13q15q13q31q27q31q27K091K093O60O63J036J036j528j524K645k16
$$ -54195 -51520 -52336 -53149 -53964 -54777 -55608 -56435 -57266 -58093 -56002 -53909 -53249 -52586 -51550 -50514 -52042 -53566 -50921 -51137
-11561e1137j646J218J274J274k839k835n74n74Q57Q61k98k98j908j904J193j669J19J23j207
$$ -51137 -52783 -51565 -50291 -49017 -51856 -54691 -55265 -55839 -54982 -54121 -54419 -54717 -56625 -58529 -57336 -59005 -58886 -58763 -59970
-11542e9970J654K727k038m92m92O41O45M5M4J655J654k578K83K846j5j728J132K683K682
$$ -59970 -58316 -55589 -57627 -58119 -58611 -57970 -57325 -57280 -57236 -55581 -53927 -56505 -56222 -53376 -53391 -55119 -53987 -51304 -48622
-11523d8622J133J133k206k206k749k750j86j87N89L450n44n44N07N07J758J759n37l398j013
$$ -48622 -47489 -46356 -48562 -50768 -53517 -56267 -56453 -56640 -56051 -52601 -53145 -53689 -53182 -52675 -50917 -49158 -49695 -53093 -54106
-11504e4106J848O63O63Q42Q46J021J021p68K098K086p75j371j367r54r54r53r51J409J408
$$ -54106 -52258 -51595 -50932 -50090 -49244 -48223 -47202 -47970 -45872 -43786 -44561 -45932 -47299 -48253 -49207 -50160 -51111 -49702 -48294
-11485d8294r76r72j901j900L06L09L100K38M18M21J013J013K802n6j065J799J796j062k973
$$ -48294 -49270 -50242 -52143 -54043 -53737 -53428 -50328 -50090 -49672 -49251 -48238 -47225 -44423 -44479 -45544 -43745 -41949 -43011 -45984
-11466d5984j08J259J263k645n503l122k57K124K127Q72Q75P53P56j632j628j095j092j274
$$ -45984 -46092 -44833 -43570 -46215 -51718 -54840 -55097 -52973 -50846 -49974 -49099 -48346 -47590 -49222 -50850 -51945 -53037 -54311
-11448e4311J591J19J23j133j128N66N70q64q61k98k98J490j367j371J490k98k94M24M25K46
$$ -54311 -52720 -52601 -52478 -53611 -54739 -54173 -53603 -54467 -55328 -55626 -55924 -54434 -55801 -57172 -55682 -55980 -56274 -55850 -55425 -55179
-11428e5179L111J706J707O33O37J994M854O405O408J069j792l521l517m273m274n883l017
$$ -55179 -52068 -50362 -48655 -48022 -47385 -45391 -40537 -34132 -27724 -26655 -28447 -31968 -35485 -39758 -44032 -49915 -52932
-11411e2932l022l022M96M99r20r17p41p38n33K333K328n29Q6Q9j702J162Q01Q05m51m47J885
$$ -52932 -55954 -58976 -58480 -57981 -58901 -59818 -60559 -61297 -61830 -59497 -57169 -57698 -57612 -57523 -59225 -58063 -57262 -56457 -56908 -57355 -55470
-11390e5470J889o78o74K183o74R31R35P90P94P90P93j505j501j327j322l223l58J367J372
$$ -55470 -53581 -54259 -54933 -52750 -53424 -52493 -51558 -50768 -49974 -49184 -48391 -49896 -51397 -52724 -54046 -57269 -57627 -56260 -54888
-11371e4888K857K862m81m77N48N51N48N51L69L73j837j833j792J073J248j610p49K117L24
$$ -54888 -52031 -49169 -49650 -50127 -49579 -49028 -48480 -47929 -47560 -47187 -49024 -50857 -52649 -51576 -50328 -51938 -52687 -50570 -50246
-11352e0246L28o15o11o15o11o15o11o14o11Q5R0Q5R0j107j103J278J282j01r6K283K288q75
$$ -50246 -49918 -50533 -51144 -51759 -52370 -52985 -53596 -54210 -54821 -54736 -54646 -54561 -54471 -55578 -56681 -55403 -54121 -54222 -54318 -52035 -49747 -50622
-11330e0622q72K462K467O56O59p75p71q35q31q34q31j006j002j006j002J170J173j036j032
$$ -50622 -51494 -49032 -46565 -45909 -45250 -46025 -46796 -47631 -48462 -49296 -50127 -51133 -52135 -53141 -54143 -52973 -51800 -52836 -53868
-11311e3868j825J036J035j822J72J71pmk01k01J408j449k586k586q2p8j975K795M106J248
$$ -53868 -55693 -54657 -53622 -55444 -55272 -55101 -55108 -55112 -55313 -55514 -54106 -55555 -58141 -60727 -60809 -60887 -62862 -60067 -55961 -54713
-11291e4713l65l66j676j673k459K310J058J062p5p4K966J08j390j390j38j34q53q53o75o70
$$ -54713 -55078 -55444 -57120 -58793 -61252 -58942 -57884 -56822 -56897 -56971 -54005 -53897 -55287 -56677 -56815 -56949 -57802 -58655 -59330 -60000
-11271f0000J53L014L014J56J345J345J345J349q31K031K030q27j069j069j249j244L76L77
$$ -60000 -59847 -56833 -53819 -53663 -52318 -50973 -49628 -48279 -49110 -47079 -45049 -45876 -46945 -48014 -49263 -50507 -50131 -49754
-11253d9754K164o93k872j1j800j796J163J162L88k471k235k236R24R28M85M84O63O67r17
$$ -49754 -47590 -48283 -51155 -51166 -52966 -54762 -53599 -52437 -52049 -54520 -56755 -58991 -58067 -57139 -56654 -56170 -55507 -54840 -55757
-11234e5757J945K124p34j297J569k20k20P01P04j680j681P68P71P71P72o93o90o89o89J1
$$ -55757 -53812 -51688 -52422 -53719 -52150 -52370 -52590 -51889 -51185 -52865 -54546 -53778 -53007 -52236 -51464 -52157 -52847 -53536 -54225 -54214
-11214e4214J5J1J5P86P90q24K042P42P45R20R24N63N66N63N66j487j486j487j486R27R28
$$ -54214 -54199 -54188 -54173 -53387 -52597 -53421 -51379 -50637 -49892 -48972 -48048 -47485 -46919 -46356 -45790 -47277 -48763 -50250 -51736 -50809 -49881
-11193d9881R28R27l275l275q90q90J076J077l54l54p1p0p1o7K582K582J8K3J076j784l54
$$ -49881 -48953 -48026 -51301 -54576 -55466 -56356 -55280 -54203 -54557 -54911 -54982 -55052 -55123 -55190 -52608 -50026 -50008 -49985 -48909 -50693 -51047
-11172e1047K511j010j009R57j900k064P97P98k061k660K01K3k836N44N44k496K276K839k2
$$ -51047 -48536 -49546 -50555 -49598 -51498 -53562 -52765 -51967 -54028 -56688 -56487 -56464 -59300 -58756 -58212 -60708 -58432 -55593 -55615
-11153e5615K76L141L57L58q94q94J549J550J20J19M17M17M18M17n07n06n07n07k187k187
$$ -55615 -55339 -52198 -51841 -51483 -52377 -53271 -51722 -50172 -50052 -49933 -49516 -49099 -48681 -48264 -48771 -49277 -49784 -50291 -52478 -54665
-11133e4665j889j889p86L983K910M8j248j248K865K865k94k95j725j725L77L80L80L80j532
$$ -54665 -56554 -58443 -59229 -55246 -52336 -52288 -53536 -54784 -51919 -49054 -49348 -49643 -51368 -53093 -52716 -52336 -51956 -51576 -53108
-11114e3108j527j528j527p71p68K571K571R87R91m40m39%LJ435J434L58L61j069j069J080
$$ -53108 -54635 -56163 -57690 -58461 -59229 -56658 -54087 -53100 -52109 -52549 -52988 -52988 -52985 -51550 -50116 -49758 -49397 -50466 -51535 -50455
-11094e0455J084j300j300j42j38j37j38N40N40q90q87k411k410k6k3p49p48O81O86J576J576
$$ -50455 -49371 -50671 -51971 -52113 -52251 -52388 -52526 -51986 -51446 -52336 -53223 -55634 -58044 -58070 -58093 -58842 -59590 -58909 -58223 -56647 -55071
-11073e5071J576J580J006J006J006J009j498j497o7o4J111J110j274j271p08p08p08p04L32
$$ -55071 -53495 -51915 -50909 -49903 -48897 -47888 -49386 -50883 -50950 -51014 -49903 -48793 -50067 -51338 -52046 -52754 -53462 -54166 -53834
-11054e3834L32Q08N581O89k172k64k61m73m73R57R61J584J583k708k705l040l041K206K209
$$ -53834 -53502 -52694 -47113 -46424 -48596 -48860 -49121 -49594 -50067 -49110 -48149 -46565 -44982 -47690 -50395 -53435 -56476 -54270 -52061
-11035e2061K69K68K68K72q79q79N51L417L621j148k280N85j04j01k127k128L264O129K910
$$ -52061 -51792 -51524 -51256 -50984 -51863 -52742 -52191 -48774 -45153 -46301 -48581 -47996 -48100 -48201 -50328 -52456 -49192 -43063 -40153
-11016d0153j859j252j248j546j547J073J077j308j307j010j006j006j006j457j453j751L018
$$ -40153 -42012 -43264 -44512 -46058 -47605 -46532 -45455 -46763 -48070 -49080 -50086 -51092 -52098 -53555 -55008 -56759 -53741
-10999e3741L439L443j506j505J591J595k698k697m10m10n89K273R02R01L06k556j080j081
$$ -53741 -50302 -46859 -48365 -49870 -48279 -46684 -49382 -52079 -52489 -52899 -53488 -51215 -50313 -49412 -49106 -51662 -52742 -53823
-10981e3823J125J125k75k76k76k75k757k758M62k399m62K399K817K817K407m55j885R76J692
$$ -53823 -52698 -51573 -51848 -52124 -52400 -52675 -55432 -58190 -57728 -60127 -60589 -58190 -55373 -52556 -50149 -50604 -52489 -51513 -49821
-10962d9821J691m150m151k809N2j27j23P38P38P37P42j006j006M25M28J498J498O7P1r32
$$ -49821 -48130 -52280 -56431 -59240 -59188 -59315 -59438 -58700 -57962 -57225 -56483 -57489 -58495 -58070 -57642 -56144 -54646 -54579 -54508 -55440
-10942e5440r31O78k180Q2Q2Q2Q6o78K183K004k760l272m09J020J025L219L223L398N40j729
$$ -55440 -56371 -55693 -57873 -57791 -57709 -57627 -57541 -58219 -56036 -54032 -56792 -60064 -60473 -59453 -58428 -55209 -51986 -48588 -48048 -49777
-10922d9777j725j729j725k772R4j342j337j79K686Q98Q98L987J129L50L54j468j464j468
$$ -49777 -51502 -53231 -54956 -57728 -57634 -58976 -60313 -60492 -57806 -56908 -56010 -52023 -50894 -50544 -50190 -51658 -53122 -54590
-10904e4590j465n66n63n66n62j461j457k6k6J248J248j82j83j077j076J307J308J763J762
$$ -54590 -56055 -56621 -57184 -57750 -58312 -59773 -61230 -61256 -61282 -60034 -58786 -58968 -59151 -60228 -61304 -59997 -58689 -56926 -55164
-10885e5164L31L32M51M51j934j934M59M58J889J889R95R94j389j390j807j807K485K485J859
$$ -55164 -54833 -54501 -54050 -53599 -55533 -57467 -57008 -56550 -54661 -52772 -51777 -50783 -52172 -53562 -55369 -57176 -54691 -52206 -50347
-10866e0347J859n25n25j055j050j055j050j174j170K61K61J38J41J42J41Q83Q87j498j497
$$ -50347 -48488 -49013 -49538 -50593 -51643 -52698 -53748 -54922 -56092 -55831 -55570 -55432 -55291 -55149 -55008 -54125 -53238 -54736 -56233
-10847e6233k042k038L43L46J535J539J08J08j57j52J278J278j647j643J695J695Q79Q80j505
$$ -56233 -58275 -60313 -59970 -59624 -58089 -56550 -56442 -56334 -56491 -56643 -55365 -54087 -55734 -57377 -55682 -53987 -53108 -52228 -53733
-10828e3733j502p4p5K310K314m658m657J543J546l7l8l7l3j517j516J822J825O30O30O29
$$ -53733 -55235 -55309 -55384 -53074 -50760 -55418 -60075 -58532 -56986 -57023 -57061 -57098 -57131 -58648 -60164 -58342 -56517 -55887 -55257 -54628
-10808e4628O34n93n92Q38Q42K955K954j337j334K235K236Q05Q08k38k39k38k35l122l122
$$ -54628 -53994 -54587 -55179 -54341 -53499 -50544 -47590 -48927 -50261 -48026 -45790 -44985 -44177 -44415 -44654 -44892 -45127 -48249 -51371
-10789e1371K16K20O93O93O93O96j516j517q5q2p42p41p41p38o52o52J732J737l484l484j874
$$ -51371 -51155 -50935 -50242 -49549 -48856 -48160 -49676 -51193 -51278 -51360 -52102 -52843 -53584 -54322 -54974 -55626 -53894 -52157 -55641 -59125 -60999
-10768f0999j870N03L368N07N06j911R54K682K683N40N44N44N44k351k347R91R91j207j204
$$ -60999 -62869 -62366 -58998 -58491 -57985 -59896 -58942 -56260 -53577 -53037 -52493 -51949 -51405 -53756 -56103 -55112 -54121 -55328 -56532
-10749e6532K28K27J267J270j60j60l28l24j934R28l28l24j45j46o15o11k816k817k045Q19
$$ -56532 -56304 -56077 -54810 -53540 -53700 -53860 -54188 -54512 -56446 -55518 -55846 -56170 -56315 -56461 -57076 -57687 -60503 -63320 -65365 -64546
-10729f4546L324L323J815j044N67N66K679K682K98K98l83l80p38K124L312M54l777R91K492
$$ -64546 -61222 -57899 -56084 -57128 -56561 -55995 -53316 -50634 -50336 -50038 -50421 -50801 -51539 -49415 -46103 -45649 -49426 -48435 -45943
-10710d5943K496j617m478l648p82J423j438n85n85J621J624J800J800j539j535k80k79J151
$$ -45943 -43447 -45064 -49542 -53190 -53972 -52549 -53987 -54572 -55157 -53536 -51912 -50112 -48312 -49851 -51386 -51666 -51945 -50794
-10692e0794J155J38J38J38J41j080j081j080j077j349j348j349j345R61R61K392K396M55
$$ -50794 -49639 -49501 -49363 -49225 -49084 -50164 -51245 -52325 -53402 -54751 -56099 -57448 -58793 -57832 -56871 -54479 -52083 -51628
-10674e1628M54r76r72J218J218j166j162p19p20Q91Q94k64K596K597k61j277j278k709k705
$$ -51628 -51174 -52150 -53122 -51904 -50686 -51852 -53014 -53733 -54453 -53562 -52668 -52932 -50336 -47739 -48000 -49277 -50555 -53264 -55969
-10655e5969j017J844K35K38j285j285J278J281k179O81K292n67k626K34N6k801q42q39J364
$$ -55969 -56986 -55142 -54907 -54669 -55954 -57239 -55961 -54680 -56859 -56178 -53886 -54453 -57079 -56845 -56789 -59590 -60432 -61271 -59907
-10636e9907J367N29N33N29N33p08p04J676J681J408J412r76r72j398j393L4L7k232k228L014
$$ -59907 -58540 -58011 -57478 -56949 -56416 -57124 -57828 -56152 -54471 -53063 -51651 -52627 -53599 -54997 -56390 -56356 -56319 -58551 -60779 -57765
-10616e7765L018J494J498q91q86k262k258J077J081J292J293j38j34M1M1M1M5j01j00j01
$$ -57765 -54747 -53253 -51755 -52646 -53532 -55794 -58052 -56975 -55894 -54602 -53309 -53447 -53581 -53540 -53499 -53458 -53413 -53514 -53614 -53715
-10596e3715r7o07o07k038k035j56j57j56j53k46k46k45k43K02K01K01K05o7o7o7o4M03M02
$$ -53715 -53812 -54419 -55026 -57064 -59099 -59255 -59412 -59568 -59721 -59967 -60213 -60458 -60701 -60499 -60298 -60097 -59892 -59959 -60026 -60093 -60157 -59754 -59352
-10573e9352J833J833J744J744L12L13J245J244j86j86r32r31r32r31P08P08j677j676j498
$$ -59352 -57519 -55686 -53942 -52198 -51886 -51573 -50328 -49084 -49270 -49456 -50388 -51319 -52251 -53182 -52474 -51766 -53443 -55119 -56617
-10554e6617j498o7o7o48o49o48o48Q12Q12K243K243O59O64p68p67j666j661P22P23K27K31
$$ -56617 -58115 -58182 -58249 -58897 -59546 -60194 -60842 -60030 -59218 -56975 -54732 -54073 -53409 -54177 -54944 -56610 -58271 -57549 -56826 -56599 -56368
-10533e6368j199j200M96M99M99M99q5q2K004K005K358k407q2K780j100l956k169k168Q08
$$ -56368 -57567 -58767 -58271 -57772 -57273 -56774 -56859 -56941 -54937 -52932 -50574 -52981 -53063 -50283 -51383 -55339 -57508 -59676 -58868
-10514e8868Q13Q12Q12r87r84M43M48n70n67n70n66P11P16L096L100o89o86P41P46K205K206
$$ -58868 -58055 -57243 -56431 -57418 -58402 -57959 -57511 -58081 -58648 -59218 -59784 -59073 -58357 -55261 -52161 -52850 -53536 -52795 -52049 -49844 -47638
-10493d7638P75P79q95q94k325k321k653k652j222j219J729J729J729J732k35k34K149K154
$$ -47638 -46863 -46084 -46979 -47873 -50198 -52519 -55172 -57824 -59046 -60265 -58536 -56807 -55078 -53346 -53581 -53815 -51666 -49512
-10475d9512j904j904J434J439n48n48n47n44l857l856n18n14J122J125l09l06J08J12J539
$$ -49512 -51416 -53320 -51886 -50447 -50995 -51543 -52090 -52634 -56491 -60347 -60865 -61379 -60257 -59132 -59441 -59747 -59639 -59527 -57988
-10456e7988J542K135K139k50k46k694k690J599J602L24L28k057k056k657k653K593K594L409
$$ -57988 -56446 -54311 -52172 -52422 -52668 -55362 -58052 -56453 -54851 -54527 -54199 -56256 -58312 -60969 -63622 -61029 -58435 -55026
-10438e5026L412j833j833j151j147K83K83r73r68r69r69q53q49N81N81R35R39R39R39k344
$$ -55026 -51614 -53447 -55280 -56431 -57578 -57295 -57012 -57985 -58953 -59922 -60891 -61744 -62593 -62012 -61431 -60496 -59557 -58618 -57679 -60023
-10418f0023k339M4M5J271J274J270J274n17n15n17n15J845J848n41n36j23j19j23j19P52
$$ -60023 -62362 -62318 -62273 -61002 -59728 -58458 -57184 -57701 -58216 -58733 -59248 -57403 -55555 -56096 -56632 -56755 -56874 -56997 -57116 -56364
-10398e6364P56o78o74n89n85Q42Q46j371j367N9O4J222J225k08k05j282j278j281j278j014
$$ -56364 -55608 -56286 -56960 -57549 -58134 -57292 -56446 -57817 -59184 -59125 -59061 -57839 -56614 -56822 -57027 -58309 -59587 -60868 -62146 -63160
-10378f3160j009j014j009j35j30j34j31L920L923l72l69J103J106j281j278l88l84j818j814
$$ -63160 -64169 -65183 -66192 -66327 -66457 -66591 -66722 -62802 -58879 -59251 -59620 -58517 -57411 -58692 -59970 -60358 -60742 -62560 -64374
-10359f4374N06N11J937J941J49J53j281j278M80M85J911J915L91L95L91L95J144J148k791
$$ -64374 -63868 -63357 -61420 -59479 -59330 -59177 -60458 -61736 -61256 -60771 -58860 -56945 -56554 -56159 -55768 -55373 -54229 -53081 -55872
-10340e5872k787k343L383K544K549J110J114j274j271J27J30J27J30L056L058J625J628m62
$$ -55872 -58659 -61002 -57619 -55075 -52526 -51416 -50302 -51576 -52847 -52720 -52590 -52463 -52333 -49277 -46219 -44594 -42966 -43428
-10322d3428m58j893j889M5M8M9M8L13L17j114j114n67n62J822J822k266k261k262k261J319
$$ -43428 -43886 -45779 -47668 -47623 -47575 -47526 -47478 -47165 -46848 -47962 -49076 -49643 -50205 -48383 -46561 -48827 -51088 -53350 -55611 -54292
-10302e4292J322j062j061J587J591J591J590r09r05r05r06j266j263J67J68j021j017M13
$$ -54292 -52970 -54032 -55093 -53506 -51915 -50324 -48734 -49643 -50548 -51453 -52359 -53625 -54888 -54721 -54553 -55574 -56591 -56178
-10284e6178M14l06l01l02l02j5j1j1j1K53K57J688J688N81N85N85N85k072k068k067k068
$$ -56178 -55764 -56070 -56371 -56673 -56975 -56990 -57001 -57012 -57023 -56770 -56513 -54825 -53137 -52556 -51971 -51386 -50801 -52873 -54941 -57008 -59076
-10263e9076J550J553J554J554O85O89k649k649P42P41P42P45j494j494o4n9J889J889m96
$$ -59076 -57526 -55973 -54419 -52865 -52180 -51491 -54140 -56789 -56047 -55306 -54564 -53819 -55313 -56807 -56871 -56930 -55041 -53152 -53648
-10244e3648m92J591J591p93p90k023k023j249J617p41p41Q68Q72r06r05r06r01J08J08j502
$$ -53648 -54140 -52549 -50958 -51751 -52541 -54564 -56587 -57836 -56219 -56960 -57701 -56833 -55961 -56867 -57772 -58678 -59579 -59471 -59363 -60865
-10224f0865J364M016M017j051j047p23p22n44l402j297j296J863J866n21n22J863J867q46
$$ -60865 -59501 -55485 -51468 -52519 -53566 -54289 -55011 -55555 -58957 -60254 -61550 -59687 -57821 -58342 -58864 -57001 -55134 -55980
-10206e5980q46N85N89j60j61j60j56J769J770K128p31k492L69K574k83l871l871K42K46Q08
$$ -55980 -56826 -56241 -55652 -55812 -55973 -56133 -56289 -54520 -52750 -50622 -51353 -53845 -53476 -50902 -51185 -55056 -58927 -58685 -58439 -57631
-10186e7631Q09Q08Q13R3R3j993j990p12M058K805j960k537L24J457j401j762j762n11n06
$$ -57631 -56822 -56014 -55201 -55108 -55015 -57008 -58998 -59710 -55652 -52847 -54807 -57344 -57020 -55563 -56964 -58726 -60488 -60999 -61505
-10167f1505J389J390m1l7L46L47L46L50R84R84L87k474k027Q35M77M77R46R46J304j557Q2
$$ -61505 -60116 -58726 -58767 -58804 -58458 -58111 -57765 -57415 -56431 -55447 -55060 -57534 -59561 -58726 -58249 -57772 -56826 -55880 -54576 -56133 -56051
-10146e6051K943J155J155J144J148k83k84r72r69M62M62r65r61J423J424j174j170J215J214
$$ -56051 -53108 -51953 -50798 -49654 -48506 -48789 -49073 -50045 -51014 -50552 -50090 -51055 -52016 -50593 -49169 -50343 -51513 -50298 -49084
-10127d9084r83r84r84r79N9O0J490J494j676j677P08P11K556K556p82p79j092j087o15K250
$$ -49084 -50067 -51051 -52035 -53014 -52955 -52895 -51405 -49911 -51587 -53264 -52556 -51845 -49289 -46733 -47515 -48294 -49386 -50473 -51088 -48838
-10107d8838L409j356l744l741P56P60P57P60L98M03j032j029M51M55M51M54o22o18o23o18
$$ -48838 -45429 -46785 -50529 -54270 -53514 -52754 -51997 -51237 -50839 -50436 -51468 -52497 -52046 -51591 -51140 -50686 -51308 -51926 -52549 -53167
-10087e3167J196J199j188j185K239K243j45j42J457J461K6L0l342l339J904J908J218J222
$$ -53167 -51971 -50772 -51960 -53145 -50906 -48663 -48808 -48950 -47493 -46032 -46006 -45976 -49318 -52657 -50753 -48845 -47627 -46405
-10069d6405J218J222j82j79J248J252k53k50j684j680M92M95M92M95M039M043k54k49o11
$$ -46405 -45187 -43965 -44147 -44326 -43078 -41826 -42079 -42329 -44013 -45693 -45201 -44706 -44214 -43719 -39680 -35637 -35891 -36140 -36751
-10050c6751o08o11o07j580j576J759J762q64q61q64q61R24R28j461j457K98L02J729J733
$$ -36751 -37359 -37970 -38577 -40157 -41733 -39974 -38212 -39076 -39937 -40801 -41662 -40738 -39810 -41271 -42728 -42430 -42128 -40399 -38666
-10031c8666k188k187l617l614J8J9J9K2J68J67J68J71J807J807L77L80m81m81m80m77J397
$$ -38666 -40854 -43041 -46658 -50272 -50254 -50235 -50216 -50194 -50026 -49859 -49691 -49520 -47713 -45906 -45529 -45149 -45630 -46111 -46591 -47068 -45671
-10010d5671J397J099N872K366K366o74o71j390j390j389j386j196j196j196j192p49p49p49
$$ -45671 -44274 -43175 -37303 -34937 -32571 -33245 -33916 -35306 -36696 -38085 -39471 -40667 -41863 -43059 -44251 -45000 -45749 -46498
-9992d6498p45K6K6J457J460L84L84L84L87J311J312K742K746J759J758m441m437k221k221
$$ -46498 -47243 -47217 -47191 -45734 -44274 -43890 -43506 -43122 -42735 -41424 -40112 -37370 -34624 -32865 -31107 -35548 -39985 -42206 -44427
-9973d4427K072K075J5J5K698k068k526k523N14N18k01j97j632j628r39r35r39r35m5m1J386
$$ -44427 -42355 -40280 -40265 -40250 -37552 -39620 -42146 -44669 -44155 -43637 -43838 -44035 -45667 -47295 -48234 -49169 -50108 -51043 -51088 -51129 -49743
-9952d9743J390K75K80k3j8M240n26k31k27J282J285L666L670J997K001k295k292k585k586
$$ -49743 -48353 -48078 -47798 -47821 -47839 -43599 -44125 -44356 -44583 -43301 -42016 -38350 -34680 -32683 -30682 -32977 -35269 -37854 -40440
-9933d0440k01j98n29n29n29n25K839K839j453j449j483j483n2m9l051l052o66o64m1m1j471
$$ -40440 -40641 -40839 -41368 -41897 -42426 -42951 -40112 -37273 -38726 -40175 -41658 -43141 -43193 -43242 -46293 -49345 -50011 -50675 -50716 -50757 -52228
-9912e2228j468n85n85n85n81k87k87k87k83J442J445j896j893j628j624P56P60L759L763
$$ -52228 -53696 -54281 -54866 -55451 -56032 -56319 -56606 -56893 -57176 -55734 -54289 -56185 -58078 -59706 -61330 -60574 -59814 -56055 -52292
-9893e2292n32n29q6q2J345J349K90K95K90K95q43q38k273k269O0O3O0O3R84R87m47m43k809
$$ -52292 -52824 -53353 -53439 -53521 -52176 -50827 -50537 -50242 -49952 -49657 -50500 -51338 -53611 -55880 -55820 -55757 -55697 -55634 -54650 -53663 -54110 -54553 -57362
-9870e7362k806L50L54K497l62j86j83J312J315j729J137K563K567J79J82K262o00m21m21
$$ -57362 -60168 -59818 -59464 -56967 -57329 -57515 -57698 -56386 -55071 -56800 -55663 -53100 -50533 -50354 -50172 -47910 -48510 -48931 -49352
-9851d9352j285j286k895l3K313K314k634K27K195o67J121J122j472j472m1l7m58m58k247
$$ -49352 -50637 -51923 -54818 -54851 -52538 -50224 -52858 -52631 -50436 -51103 -49982 -48860 -50332 -51804 -51845 -51882 -52340 -52798 -55045
-9832e5045O19O81k179m385j521J696J695J099j759l31l28J282j580J725M590K623K623J695
$$ -55045 -54426 -53745 -55924 -60309 -61830 -60134 -58439 -57340 -59099 -59430 -59758 -58476 -60056 -58331 -53741 -51118 -48495 -46800
-9814d6800j162M47M47m81m77m77m76J341J341q64q65q94J967L398N37n59n59j989j990k705
$$ -46800 -47962 -47515 -47068 -47549 -48026 -48503 -48979 -47638 -46297 -47161 -48026 -48920 -46953 -43555 -43018 -43577 -44136 -46125 -48115 -50820
-9794e0820J57j454j453K46K46K46K46P23P23q27l689k608K53J506j357j64j64J446j416J20
$$ -50820 -50663 -52117 -53570 -53324 -53078 -52832 -52586 -51863 -51140 -51967 -55656 -58264 -58011 -56505 -57862 -58026 -58190 -56744 -58160 -58040
-9774e8040K980K802n6J043J043j520j516j416j416j415j412J93J94J982q75j793J070J665
$$ -58040 -55060 -52258 -52314 -51271 -50228 -51748 -53264 -54680 -56096 -57511 -58923 -58730 -58536 -56554 -57429 -59222 -58152 -56487
-9756e6487J669J219J218j941j938P42L603K172o86m51m50Q01Q04j635j636L312M55k202k202
$$ -56487 -54818 -53599 -52381 -54322 -56260 -55518 -51915 -49743 -50429 -50880 -51330 -50529 -49725 -51360 -52996 -49684 -49229 -51431 -53633
-9737e3633R58R61l99l98n78n74O45k217O45O48J788j073j550j546k027K742L220L222K504
$$ -53633 -52675 -51714 -52113 -52511 -53089 -53663 -53018 -55235 -54590 -53942 -52154 -53227 -54777 -56323 -58350 -55608 -52388 -49166 -46662
-9718d6662l58j132j129j669j669q95J971N48N51j654j654j330j327J05J04Q91Q94Q94Q94
$$ -46662 -47020 -48152 -49281 -50950 -52619 -53514 -51543 -50995 -50444 -52098 -53752 -55082 -56409 -56304 -56200 -55309 -54415 -53521 -52627
-9699e2627J785J788J013j847k694k690k869k869P34P38J989J990M787J930j706j706l99l95
$$ -52627 -50842 -49054 -48041 -49888 -52582 -55272 -58141 -61010 -60276 -59538 -57549 -55559 -50772 -48842 -50548 -52254 -52653 -53048
-9681e3048l95l95p04p04p04p01j896j897K396K399j67j68j598j595K20K20J650J655n6n6
$$ -53048 -53443 -53838 -54542 -55246 -55950 -56651 -58547 -60444 -58048 -55649 -55816 -55984 -57582 -59177 -58957 -58737 -57087 -55432 -55488 -55544
-9661e5544n6n2J017J017j367j364p27p26p27p22r95r95k425k422P15P19L100L104Q34Q39
$$ -55544 -55600 -55652 -54635 -53618 -54985 -56349 -57076 -57802 -58529 -59251 -60246 -61241 -63666 -66088 -65373 -64654 -61554 -58450 -57616 -56777
-9641e6777Q34Q38n88n85k377M88J289j569j035j032j509J356J531j326m36K429K247o11q83
$$ -56777 -55943 -55105 -55693 -56278 -58655 -58167 -56878 -58447 -59482 -60514 -62023 -60667 -59136 -60462 -60898 -58469 -56222 -56833 -57716
-9622e7716q80J323J326k86k84K098K101p78p79p79p78k120k120K64K65J106J107j278j278
$$ -57716 -58596 -57273 -55947 -56233 -56517 -54419 -52318 -53096 -53875 -54654 -55432 -57552 -59672 -59408 -59143 -58037 -56930 -58208 -59486
-9603e9486M21M21M21M21K321K321o3o3J15J16J15J16k43k42j673j672K887K887m50m51o75
$$ -59486 -59065 -58644 -58223 -57802 -55481 -53160 -53223 -53286 -53171 -53055 -52940 -52824 -53067 -53309 -54982 -56654 -53767 -50880 -51330 -51781 -52456
-9582e2456o74P56P60R06R05n25n22K05K05K05K09o30o30o29o26j643j643k13k08J903J904
$$ -52456 -53130 -52374 -51614 -50708 -49803 -50328 -50850 -50645 -50440 -50235 -50026 -50656 -51286 -51915 -52541 -54184 -55827 -56040 -56248 -54345 -52441
-9561e2441M74M76Q16Q16j568j565o74o75o74o71J83J86J86J87O89O93O93O93l54l50j781
$$ -52441 -51967 -51491 -50675 -49859 -51427 -52992 -53666 -54341 -55015 -55686 -55503 -55317 -55131 -54944 -54255 -53562 -52869 -52176 -52530 -52880 -54661
-9540e4661j781L31L36L35L35J31J34J34J34k612k608P31P30o3o0L279L278J338J341J341
$$ -54661 -56442 -56111 -55775 -55440 -55105 -54974 -54840 -54706 -54572 -57184 -59792 -59061 -58331 -58394 -58454 -55175 -51897 -50559 -49218 -47877
-9520d7877J342j625j620j90j90K071K075K076K075k39k34k620k619k265k262J23J23N26N29
$$ -47877 -46535 -48160 -49780 -49970 -50160 -48089 -46014 -43938 -41863 -42102 -42336 -44956 -47575 -49840 -52102 -51979 -51856 -51330 -50801
-9501e0801N29N29P8Q2Q2Q2r20r17r16r17k35k31k31k31P49P49J53k709o82K180L91L91j099
$$ -50801 -50272 -49743 -49665 -49583 -49501 -49419 -50339 -51256 -52172 -53089 -53324 -53555 -53786 -54017 -53268 -52519 -52366 -55075 -55757 -53577 -53186 -52795 -53894
-9478e3894j099j278J584K149K150l54l215r84r83J043J043L88k474k295k295j05j04J148
$$ -53894 -54993 -56271 -54687 -52538 -50388 -50742 -53957 -54941 -55924 -54881 -53838 -53450 -55924 -58219 -60514 -60619 -60723 -59575
-9460e9575J147m62l323k012K757J825J826L95k463K005K004J647J651N2k810k809N6j378
$$ -59575 -58428 -58890 -62213 -64225 -61468 -59643 -57817 -57422 -59885 -57880 -55876 -54229 -52578 -52526 -55336 -58145 -58089 -59467
-9442e9467j379J185J188K54K53j177j174J505J506j536j531l144J624L890J032j476j475
$$ -59467 -60846 -59661 -58473 -58219 -57966 -59143 -60317 -58812 -57306 -58842 -60373 -63517 -61893 -58003 -56971 -58447 -59922
-9425e9922P30P34L58L58k027k027l0l0J222J222K143p19q98J963K947Q6j166J695j308j307
$$ -59922 -59192 -58458 -58100 -57742 -59769 -61796 -61826 -61856 -60634 -59412 -57269 -57988 -58886 -56923 -53976 -53890 -55056 -53361 -54669 -55976
-9405e5976k560k560J196J196J554j308l033j71K034q27L7L8J289J289L074L073L074L074
$$ -55976 -58536 -61096 -59900 -58704 -57150 -58458 -61491 -61662 -59628 -60455 -60418 -60380 -59091 -57802 -54728 -51655 -48581 -45507
-9387d5507r20r21J465J464j323j322k933p0K403K403K582K582J058J058J058J058l234l234
$$ -45507 -46427 -47348 -45883 -44419 -45742 -47064 -49997 -50067 -47664 -45261 -42679 -40097 -39039 -37981 -36923 -35865 -39099 -42333
-9369d2333j803j803m113m114p75p75k9l0j640J223j122j121j122J740M29M28j002J859K261
$$ -42333 -44136 -45939 -50052 -54166 -54941 -55716 -55745 -55775 -57415 -56192 -57314 -58435 -59557 -57817 -57388 -56960 -57962 -56103 -53842
-9350e3842K262K35K34k954r3J635J636K448K448q91q90k65k64q6q6k529L31l662l663j188
$$ -53842 -51580 -51345 -51111 -54065 -54158 -52523 -50887 -48439 -45991 -46882 -47772 -48037 -48301 -48387 -48473 -51002 -50671 -54333 -57996 -59184
-9330e9184j189j546J315K295n62j938j933k98K567R53R58k265k262J19J23m47m43K891K895
$$ -59184 -60373 -61919 -60604 -58309 -58871 -60809 -62742 -63040 -60473 -59520 -58562 -60827 -63089 -62970 -62847 -63294 -63737 -60846 -57951
-9311e7951j94j90K191K194P01P04j684j680m55m51K765r3J11K977M10k448l95l91J334j524
$$ -57951 -58145 -58335 -56144 -53950 -53249 -52545 -54229 -55909 -56364 -56815 -54050 -54143 -54032 -51055 -50645 -53093 -53488 -53879 -52545 -54069
-9291e4069m25M348J483j375n06l365j162J703r24r21r24J942P00P04p30p27R39j919k518
$$ -54069 -54494 -50146 -48663 -50038 -50544 -53909 -55071 -53368 -54292 -55213 -56137 -54195 -53495 -52791 -53521 -54248 -53309 -55228 -57746
-9272e7746k515k742J23j491J375n9K805K981J23q20q20r98r99M92M92j118J744M5M4K24K23
$$ -57746 -60261 -63003 -62880 -64371 -62996 -63055 -60250 -57269 -57146 -57966 -58786 -59784 -60783 -60291 -59799 -60917 -59173 -59128 -59084 -58860 -58637
-9251e8637J029J028J028J029K34K35L394L394L663Q01j882j881j598j599l029l029p34p34
$$ -58637 -57608 -56580 -55552 -54523 -54289 -54054 -50660 -47266 -43603 -42802 -44684 -46565 -48163 -49762 -52791 -55820 -56554 -57288
-9233e7288p34p34j322j323K016K015L715L714L77L80j442j442k873k872o37o37J747J751
$$ -57288 -58022 -58756 -60078 -61401 -59385 -57370 -53655 -49941 -49564 -49184 -50626 -52068 -54941 -57813 -58450 -59087 -57340 -55589
-9215e5589j30j31j30j31L17L17J747J751J122J121k217k216R12R13R13R17J11J12k273k272
$$ -55589 -55719 -55850 -55980 -56111 -55794 -55477 -53730 -51979 -50857 -49736 -51953 -54169 -53257 -52344 -51431 -50514 -50403 -50291 -52564 -54836
-9195e4836Q2Q2K108K109J945l778k943k944J87J86J86J87q28q27K511K512J617J617J617
$$ -54836 -54754 -54672 -52564 -50455 -48510 -52288 -55231 -58175 -57988 -57802 -57616 -57429 -58257 -59084 -56573 -54061 -52444 -50827 -49210
-9176d9210J617j275j274o520o520j841j840J498J497K556K556J125J126j141j140J245J248
$$ -49210 -47593 -48868 -50142 -56662 -63182 -65023 -66863 -65365 -63868 -61312 -58756 -57631 -56505 -57646 -58786 -57541 -56293
-9159e6293j706j707k76k75q72q72J513J516K921K921N37N36k38k39k38k35n66n67n66n66
$$ -56293 -57999 -59706 -59982 -60257 -61129 -62001 -60488 -58972 -56051 -53130 -52593 -52057 -52295 -52534 -52772 -53007 -53573 -54140 -54706 -55272
-9139e5272j073j073j073j070J331J330j055j050J270J271J270J274J703J703K72K75J53J53
$$ -55272 -56345 -57418 -58491 -59561 -58230 -56900 -57955 -59005 -57735 -56464 -55194 -53920 -52217 -50514 -50242 -49967 -49814 -49661
-9121d9661J53J56j427j427k858k854J167J166K597K600J889J889m95m92J1J1J1J5k183k180
$$ -49661 -49508 -49352 -50779 -52206 -55064 -57918 -56751 -55585 -52988 -50388 -48499 -46610 -47105 -47597 -47586 -47575 -47564 -47549 -49732 -51912
-9101e1912K05K05N2N6N6N6j341j338j337j338o26o22o22o22J82J86J87J86J703J706K76K76
$$ -51912 -51707 -51502 -51450 -51394 -51338 -51282 -52623 -53961 -55298 -56636 -57262 -57884 -58506 -59128 -58946 -58760 -58573 -58387 -56684 -54978 -54702 -54426
-9079e4426J002J006J006J006j830j825J512J513l91l91k776k772j077j077j076j073j420
$$ -54426 -53424 -52418 -51412 -50406 -52236 -54061 -52549 -51036 -51427 -51818 -54594 -57366 -58443 -59520 -60596 -61669 -63089
-9062f3089j419R65R68K575K574K575K578L227L226J021J024L257O118M031p34j066J796L227
$$ -63089 -64508 -63543 -62575 -60000 -57426 -54851 -52273 -49046 -45820 -44799 -43775 -40518 -34400 -30369 -31103 -32169 -30373 -27146
-9044b7146L230M955M955L942L946Q408J5089K7191L3867M8409O4627O5581N6997M6084K4150
$$ -27146 -23916 -18961 -14006 -10064 -6118 2290 17379 44570 78437 126846 191473 257054 314051 360135 384285
-9029C84285j7816m9292o6643p3316o3300m7087l2928k2433j5219j0450n716n711j122j121
$$ 384285 366469 317177 250534 177218 113918 66831 33903 11470 -3749 -14199 -19915 -25626 -26748 -27869
-9015b7869J94J97J97J98j774j769j770j770k053k049l483l480j368j363k798k795l31l28
$$ -27869 -27675 -27478 -27281 -27083 -28857 -30626 -32396 -34166 -36219 -38268 -41751 -45231 -46599 -47962 -50760 -53555 -53886 -54214
-8997e4214K053K056P12P15p19p15J352J357J352J356J323J326j062j058K158K160P27P30
$$ -54214 -52161 -50105 -49393 -48678 -49397 -50112 -48760 -47403 -46051 -44695 -43372 -42046 -43108 -44166 -42008 -39848 -39121 -38391
-8979c8391j717j714j718j714K441K444K440K444J129J133L513Q286Q253N395M556k08k359
$$ -38391 -40108 -41822 -43540 -45254 -42813 -40369 -37929 -35485 -34356 -33223 -29710 -21424 -13171 -7776 -3220 -3428 -5787
-8962e787n216n339n335l305l301m735m732k94k91k94k91k530k526j45j42j099j095L32L35
$$ -5787 -11003 -16342 -21677 -24982 -28283 -33018 -37750 -38044 -38335 -38629 -38920 -41450 -43976 -44121 -44263 -45362 -46457 -46125 -45790
-8943d5790Q27Q31Q31Q31k17k12k597k597l286l282q98q98J036J039J040J039L219L223Q38
$$ -45790 -44963 -44132 -43301 -42470 -42687 -42899 -45496 -48093 -51379 -54661 -55559 -56457 -55421 -54382 -53342 -52303 -49084 -45861 -45023
-8924d5023Q39Q94Q98Q98Q98P45P49o82o82r54r50l334l335k034k035J304J308J841J840K31
$$ -45023 -44184 -43290 -42392 -41494 -40596 -39851 -39102 -39784 -40466 -41420 -42370 -45704 -49039 -51073 -53108 -51804 -50496 -48655 -46815 -46584
-8904d6584K35n44l405l346J427L510j260j617j613k76k75J155J158J692J691L778L782K928
$$ -46584 -46349 -46893 -50298 -53644 -52217 -48707 -49967 -51584 -53197 -53473 -53748 -52593 -51435 -49743 -48052 -44274 -40492 -37564
-8886c7564j840k496k493k735k734O03O07K437K437J006J009j319j318J11J16k258k258q27
$$ -37564 -39404 -41900 -44393 -47128 -49862 -49259 -48652 -46215 -43778 -42772 -41763 -43082 -44400 -44289 -44173 -46431 -48689 -49516
-8868d9516q23K75K76k586K187R51j912k388k385Q31Q31Q31Q35M43M43r87r84J874J875n11
$$ -49516 -50339 -50064 -49788 -52374 -50187 -49236 -51148 -53536 -55921 -55090 -54259 -53428 -52593 -52150 -51707 -52694 -53678 -51804 -49929 -50440
-8848e0440n07j654j650j651j650P60P63K195K194K936K940l99l98p60p57O75O74j848j844
$$ -50440 -50947 -52601 -54251 -55902 -57552 -56792 -56029 -53834 -51640 -48704 -45764 -46163 -46561 -47321 -48078 -47403 -46729 -48577 -50421
-8829e0421N40N40j431j426R57R58o26o23k052k053j997j994J345J345K277K280j062j058
$$ -50421 -49881 -49341 -50772 -52198 -51241 -50283 -50909 -51532 -53584 -55637 -57634 -59628 -58283 -56938 -54661 -52381 -53443 -54501
-8811e4501k57k53k58k53J442J446J1J5O37O41p94p90m%J427M293J039l726q68q64Q31Q34
$$ -54501 -54758 -55011 -55269 -55522 -54080 -52634 -52623 -52608 -51971 -51330 -52124 -52914 -52918 -52918 -51491 -47198 -46159 -49885 -50753 -51617 -50786 -49952
-8789d9952k507k504q08q05O22O26K712K713J281J286k743k742l57l54k69k68k68k65k026
$$ -49952 -52459 -54963 -55771 -56576 -55954 -55328 -52616 -49903 -48622 -47336 -50079 -52821 -53178 -53532 -53801 -54069 -54337 -54602 -56628
-8770e6628k027J967J971L715j055l320m54K403K403J151J155j456j457R28R31R87R88j398
$$ -56628 -58655 -56688 -54717 -51002 -52057 -55377 -55831 -53428 -51025 -49874 -48719 -50175 -51632 -50704 -49773 -48786 -47798 -49196
-8752d9196j393k150k146K39K38K023K027N96N96Q31Q35j550j550k12k09k09k08r28r24N07
$$ -49196 -50589 -52739 -54885 -54646 -54408 -52385 -50358 -49762 -49166 -48335 -47500 -49050 -50600 -50812 -51021 -51230 -51438 -52366 -53290 -52783
-8732e2783N06M14M17M17M18J1J5J5J5l000k995o11o11k87k87k87k83J1J1M006J147k209k210
$$ -52783 -52277 -51863 -51446 -51029 -50611 -50600 -50585 -50570 -50555 -53555 -56550 -57161 -57772 -58059 -58346 -58633 -58916 -58905 -58894 -54888 -53741 -55950 -58160
-8709e8160k209k206l61K500K500l58Q01Q01q08q05n40n40Q90Q94k314k313J978J982m06m06
$$ -58160 -60369 -62575 -62936 -60436 -57936 -58294 -57493 -56692 -57500 -58305 -58845 -59385 -58495 -57601 -59915 -62228 -60250 -58268 -58674 -59080
-8689e9080n85K280K217K221J5J4J263J267k071k072n55n51J058J058L707O572P646K876M135
$$ -59080 -59665 -57385 -55168 -52947 -52932 -52918 -51655 -50388 -52459 -54531 -55086 -55637 -54579 -53521 -49814 -43242 -35596 -32720 -28585
-8670b8585M140J576n101o773l909l550l551o41o37o37o37K24K27K27K27k83k79k83k80J64
$$ -28585 -24445 -22869 -27970 -34743 -38652 -42202 -45753 -46394 -47031 -47668 -48305 -48081 -47854 -47627 -47400 -47683 -47962 -48245 -48525 -48361
-8650d8361J68j267j263j043j040j043j039J222J225K832k6L17L20j293j289k20k16k20k16
$$ -48361 -48193 -49460 -50723 -51766 -52806 -53849 -54888 -53666 -52441 -49609 -49635 -49318 -48998 -50291 -51580 -51800 -52016 -52236 -52452
-8631e2452o52o48k94l152j517J349M802M807J851J856o48l510k083P83K45K46K038q19j595
$$ -52452 -53104 -53752 -54046 -57198 -58715 -57366 -52564 -47757 -45906 -44050 -44698 -48208 -50291 -49508 -49263 -49017 -46979 -47798 -49393
-8612d9393j595k939k936M02M03K000K005K004K005J345J348q1q2j509j506j684j684P27k131
$$ -49393 -50988 -53927 -56863 -56461 -56058 -54058 -52053 -50049 -48044 -46699 -45351 -45432 -45514 -47023 -48529 -50213 -51897 -51170 -53301
-8593e3301l562p01M233M232K981K981K891K891j401j401j527j528j527j528j051j050L80
$$ -53301 -56863 -57564 -53331 -49099 -46118 -43137 -40246 -37355 -38756 -40157 -41684 -43212 -44739 -46267 -47318 -48368 -47988
-8576d7988L80k95k94k94k95Q68Q69Q68Q68J740J740J918J919R06L766L946j777j316j311
$$ -47988 -47608 -47903 -48197 -48491 -48786 -47918 -47049 -46181 -45313 -43573 -41833 -39915 -37996 -37090 -33324 -29378 -31155 -32471 -33782
-8557c3782P15P16J307J312J311J312J151J155J155J155N85N89L927L927o93o90o89o89j259
$$ -33782 -33067 -32351 -31044 -29732 -28421 -27109 -25958 -24803 -23648 -22493 -21908 -21319 -17392 -13465 -14158 -14848 -15537 -16226 -17485
-8538a7485j256L036L037M195M199R444R445N328N331L901L901Q066Q070J3137J8860K1300
$$ -17485 -18741 -15705 -12668 -8473 -4274 5170 14615 19943 25274 29175 33076 41142 49212 62349 81209 102509
-8522A02509K4166L1259L6982L8290L2570L1200K8338L7932M7474P6028J04642J43915K06870
$$ 102509 126675 157934 194916 233206 265776 296976 325314 363246 410720 486748 591390 735305 942175
-8509I42175L17748M95154P86715J177775J576700J624390J247145L44858p45095j414659
$$ 942175 1259923 1755077 2541792 3719567 5296267 6920657 8167802 8512660 7767565 6352906
-8499F352906j665392j426939j024915o75824m40017k81687j85830j19064p7872m9259m0674
$$ 6352906 4687514 3260575 2235660 1559836 1119819 838132 652302 533238 455366 406107 365433
-8488C65433l1136k7783j8245j5563j8424k5100l0824l3982k8260k4669j8945j2388j2388
$$ 365433 334297 306514 288269 272706 254282 229182 198358 164376 136116 111447 92502 80114 67726
-8475F7726j0362m638n950l089l372n10n11n10m713m713p098p098q107q106p750p749l279
$$ 67726 57364 52726 46776 43687 40315 39805 39294 38784 34071 29358 22260 15162 7055 -1051 -8801 -16550 -19829
-8458a9829K444p75p75K54K53k131k131j148j147l532l533j639j639k09k08J281J282K08K09
$$ -19829 -17385 -18160 -18935 -18681 -18428 -20559 -22690 -23838 -24985 -28517 -32050 -33689 -35328 -35537 -35745 -34464 -33182 -32974 -32765
-8439c2765m024J699q9r0r83r84r83r84J341J345J342J345m48m43j878j874l845l841j461
$$ -32765 -36789 -35090 -35179 -35269 -36252 -37236 -38219 -39203 -37862 -36517 -35175 -33830 -34278 -34721 -36599 -38473 -42318 -46159 -47620
-8420d7620j456J79J82K563K568M02M06M02M06j236j234j237j233k76k72k75k72j140j137
$$ -47620 -49076 -48897 -48715 -46152 -43584 -43182 -42776 -42374 -41968 -43204 -44438 -45675 -46908 -47184 -47456 -47731 -48003 -49143 -50280
-8401e0280j140j136j636j632J703J706K448K452j844j841l223l219J16J19J75J79J606J609
$$ -50280 -51420 -52556 -54192 -55824 -54121 -52415 -49967 -47515 -49359 -51200 -54423 -57642 -57526 -57407 -57232 -57053 -55447 -53838
-8383e3838L651L655L13L17J684J688p01o96n96n93Q35Q38j431j427%MN07N10j874j874j49
$$ -53838 -50187 -46532 -46219 -45902 -44218 -42530 -43231 -43927 -44523 -45116 -44281 -43443 -44874 -46301 -46301 -46297 -45790 -45280 -47154 -49028 -49177
-8362d9177j45j576j576j043j040L91L92Q34Q38Q39Q38J922J927j412j412r39r35r36r35j893
$$ -49177 -49322 -50898 -52474 -53517 -54557 -54166 -53774 -52940 -52102 -51263 -50425 -48503 -46576 -47988 -49400 -50339 -51274 -52210 -53145 -55038
-8342e5038j888M95M96j744j740O45O44P86P86K217K217k27k27k28k27J75J75J75J75m623
$$ -55038 -56926 -56431 -55935 -57679 -59419 -58774 -58130 -57344 -56558 -54341 -52124 -52351 -52578 -52806 -53033 -52858 -52683 -52508 -52333 -56956
-8322e6956m624l551K173R16R17J274J274L569L570L569L569J185J185J185J184k988k988
$$ -56956 -61580 -65131 -62958 -62042 -61125 -59851 -58577 -55008 -51438 -47869 -44300 -43115 -41930 -40745 -39561 -42549 -45537
-8305d5537j557j558J23J23j665M057J375J375L02L01n70n70Q61Q61l91l92l91l91J08J08
$$ -45537 -47094 -48652 -48529 -48406 -50071 -46014 -44639 -43264 -42962 -42661 -43231 -43801 -42940 -42079 -42470 -42862 -43253 -43644 -43536 -43428
-8285d3428J08J08j680j681J658J658J070J069K500K500p19p19K619K619M25M25j602j599
$$ -43428 -43320 -43212 -44892 -46573 -44915 -43257 -42187 -41118 -38618 -36118 -36837 -37556 -34937 -32318 -31893 -31468 -33070 -34669
-8267c4669k287L435J647J650K46K46K46K49q2q1r17M810j04j05m038m035M62M62J892J897
$$ -34669 -36956 -33521 -31874 -30224 -29978 -29732 -29486 -29237 -29319 -29400 -30317 -25507 -25611 -25716 -29754 -33789 -33327 -32865 -30973 -29076
-8247b9076N350N350N529N533N678Q538L711R438R098R102R817R818Q562J4288J7984K7522
$$ -29076 -23726 -18376 -12847 -7314 -1636 6902 10613 20051 29149 38251 48068 57886 66448 80736 98720 126242
-8231A26242L4330M0055L3678L0815K5030L8387M8103O5272Q6542J15160J44727K19124L44902
$$ 126242 160572 200627 234305 265120 290150 328537 376640 441912 528454 643614 788341 1007465 1352367
-8218A352367N75724R20045J498045K302644K892094J567270j402852k686547k356529j618709
$$ 1352367 1928091 2848136 4346181 6648825 9540919 11108189 9705337 7018790 4662261 3043552
-8208C043552r79664o04558m03307k73531j75286j01908n1356k9597l2455l4844l4843k4411
$$ 3043552 2063888 1459330 1056023 782492 607206 505298 453942 424345 391890 357046 322203 297792
-8196B97792j9639k6140l4724l4307l4303k7664j9079j6278j3413j0436p574o621o617p083
$$ 297792 278153 252013 217289 182982 148679 121015 101936 85658 72245 61809 54235 47614 40997 33914
-8182C3914p082q83q80N48N48l745l740m170m165r952r946p985j304K746j12j084j080l648
$$ 33914 26832 25949 25069 25617 26165 22420 18680 14510 10345 393 -9553 -17538 -18842 -16096 -16208 -17292 -18372 -22020
-8164b2020l644n197n194j859j855K779K783k466k463k705k701J587J591P97Q01K228K232
$$ -22020 -25664 -30861 -36055 -37914 -39769 -36990 -34207 -36673 -39136 -41841 -44542 -42955 -41364 -40567 -39766 -37538 -35306
-8147c5306Q2Q6J512J517J311J312k027k027j609j610l040l040j312j311k742k743j49j49
$$ -35306 -35224 -35138 -33626 -32109 -30798 -29486 -31513 -33540 -35149 -36759 -39799 -42839 -44151 -45462 -48204 -50947 -51096 -51245
-8129e1245j49j49j009j010M21M21M51M51j934j934j069j069M176M177L640L640K209K210
$$ -51245 -51394 -51543 -52552 -53562 -53141 -52720 -52269 -51818 -53752 -55686 -56755 -57824 -53648 -49471 -45831 -42191 -39982 -37772
-8111c7772K414K418j878j874L28L32k057k053j833j829m03l98L770L774M069o97l256l253
$$ -37772 -35358 -32940 -34818 -36692 -36364 -36032 -38089 -40142 -41975 -43804 -44207 -44605 -40835 -37061 -32992 -33689 -36945 -40198
-8093d0198K646K649k452k448k451k448J49J53J579J584%Lj430j427l651l652j5j5p89L979
$$ -40198 -37552 -34903 -37355 -39803 -42254 -44702 -44553 -44400 -42821 -41237 -41237 -41234 -42664 -44091 -47742 -51394 -51409 -51424 -52213 -48234
-8073d8234K906M5P52P53N74N73j41j42K243K243m84m85j915j915k481k482j050j051m92m91
$$ -48234 -45328 -45283 -44531 -43778 -43204 -42631 -42772 -42914 -40671 -38428 -38912 -39397 -41312 -43227 -45708 -48190 -49240 -50291 -50783 -51274
-8053e1274m92m92m5m5m4m5K791K794K791K794m58m55j889j885r28r24r28r23k687k682K738
$$ -51274 -51766 -52258 -52303 -52348 -52392 -52437 -49646 -46852 -44061 -41267 -41725 -42180 -44069 -45954 -46882 -47806 -48734 -49657 -52344 -55026 -52288
-8032e2288K742L845O710R210M445L786L789K056K061k444k441o736o732o200o196j908j903
$$ -52288 -49546 -45701 -38991 -29781 -25336 -21550 -17761 -15705 -13644 -16088 -18529 -25265 -31997 -38197 -44393 -46301 -48204
-8015d8204O89O93p42p37n03n00l543l539m356M18L930L935J963J967m21m17K619K623j673
$$ -48204 -47515 -46822 -47564 -48301 -48804 -49304 -52847 -56386 -60742 -60324 -56394 -52459 -50496 -48529 -48950 -49367 -46748 -44125 -45798
-7996d5798j669k984k981k984k981n6n2n6n2P49P53L133L137j252j248j248j248J79J82K567
$$ -45798 -47467 -50451 -53432 -56416 -59397 -59453 -59505 -59561 -59613 -58864 -58111 -54978 -51841 -53093 -54341 -55589 -56837 -56658 -56476 -53909
-7976e3909K567J163J166J166J166l57l54J077J076R73R76j408j409k127k124o93o93R13R16
$$ -53909 -51342 -50179 -49013 -47847 -46681 -47038 -47392 -46315 -45239 -44266 -43290 -44698 -46107 -48234 -50358 -51051 -51744 -50831 -49915
-7957d9915j468j467k188k183p52p53L979L979J595J594Q80Q79K310K310k53k54k638k637
$$ -49915 -51383 -52850 -55038 -57221 -57973 -58726 -54747 -50768 -49173 -47579 -46699 -45820 -43510 -41200 -41453 -41707 -44345 -46982
-7939d6982L13L13j118j118j177j178j177j177J922J923J922J923J117J118K549K548m92m92
$$ -46982 -46669 -46356 -47474 -48592 -49769 -50947 -52124 -53301 -51379 -49456 -47534 -45611 -44494 -43376 -40827 -38279 -38771 -39263
-7921c9263m91m92K254K254Q23Q27m58m58R72R77k724k724l796l793n376L46M66M69K717K716
$$ -39263 -39754 -40246 -37992 -35738 -34915 -34088 -34546 -35004 -34032 -33055 -35779 -38503 -42299 -46092 -51468 -51122 -50656 -50187 -47470 -44754
-7901d4754K716K720J017J017m14m10j993j993l424l420L01L02L02L05J46J45j285j286K35
$$ -44754 -42038 -39318 -38301 -37284 -37698 -38108 -40101 -42094 -45518 -48938 -48637 -48335 -48033 -47728 -47582 -47437 -48722 -50008 -49773
-7882d9773K35K34K35O52O52O52O52J725J725j613j613K477K478J047J047R28R27n03n03j404
$$ -49773 -49538 -49304 -49069 -48417 -47765 -47113 -46461 -44736 -43011 -44624 -46237 -43760 -41282 -40235 -39188 -38260 -37333 -37836 -38339 -39743
-7862c9743j405R80R80r87r88M44M43r80r76k411k406k232k228J53J56l17l13j747j744j419
$$ -39743 -41148 -40168 -39188 -40175 -41163 -40719 -40276 -41256 -42232 -44643 -47049 -49281 -51509 -51356 -51200 -51517 -51830 -53577 -55321 -56740
-7842e6740j416R65R69R94R99R95R98j97j94j97j94p04p01l088l085J1J5K395K400J766J770
$$ -56740 -58156 -57191 -56222 -55228 -54229 -53234 -52236 -52433 -52627 -52824 -53018 -53722 -54423 -57511 -60596 -60585 -60570 -58175 -55775 -54009 -52239
-7821e2239J769J770j662j658j658j658m62m58m58m58j982j979n48n47n67n62K656l066j19
$$ -52239 -50470 -48700 -50362 -52020 -53678 -55336 -55798 -56256 -56714 -57172 -59154 -61133 -61681 -62228 -62795 -63357 -60701 -63767 -63886
-7802f3886j16R58R57r01q98N33N32J006J010J010J009P75P79P75P79k98k95j728j726J35
$$ -63886 -64002 -63044 -62087 -62988 -63886 -63353 -62821 -61815 -60805 -59795 -58786 -58011 -57232 -56457 -55678 -55976 -56271 -57999 -59725 -59590
-7782e9590J37M427M430l73l69l72l69J08J12k277k273q45q42q46q42o67o63P64P67p56p53
$$ -59590 -59453 -55026 -50596 -50969 -51338 -51710 -52079 -51971 -51859 -54136 -56409 -57254 -58096 -58942 -59784 -60451 -61114 -60350 -59583 -60339 -61092
-7761f1092O74O79r21r20N10N15L31L32J762J766j561j561J002J006L208O069O427P08j010
$$ -61092 -60418 -59739 -60660 -61580 -61070 -60555 -60224 -59892 -58130 -56364 -57925 -59486 -58484 -57478 -54270 -48201 -41774 -41066 -42076
-7742d2076J852J315J319j218j218j219j214l119l118K127K131j032j032j032j028k563k560
$$ -42076 -40224 -38909 -37590 -38808 -40026 -41245 -42459 -45578 -48696 -46569 -44438 -45470 -46502 -47534 -48562 -51125 -53685
-7725e3685j79j75N66N70q64q61P98Q01K228K231m84m81m84m81Q20Q24j565j561J207J211
$$ -53685 -53864 -54039 -53473 -52903 -53767 -54628 -53830 -53029 -50801 -48570 -49054 -49535 -50019 -50500 -49680 -48856 -50421 -51982 -50775 -49564
-7705d9564k24k20p4p1j505j502J625J628J624J628N30N32j23m892l316l312k72k72R0R3J524
$$ -49564 -49788 -50008 -50082 -50153 -51658 -53160 -51535 -49907 -48283 -46655 -46125 -45593 -45716 -50608 -53924 -57236 -57508 -57780 -57690 -57597 -56073
-7684e6073J524N66N70N70N70J028J032J032J032k53k50k49k50j244j241k671k672P53P56
$$ -56073 -54549 -53983 -53413 -52843 -52273 -51245 -50213 -49181 -48149 -48402 -48652 -48901 -49151 -50395 -51636 -54307 -56979 -56226 -55470
-7665e5470P57P56q50q49q49q46L442L443J058J062J893J892m91m89k429k429n22l379j986
$$ -55470 -54713 -53957 -54807 -55656 -56505 -57351 -53909 -50466 -49408 -48346 -46453 -44561 -45052 -45541 -47970 -50399 -50921 -54300 -56286
-7646e6286K784K306K310q24q23l864l860l744J025K634k131k284N77j330j326k98k95L044
$$ -56286 -53502 -51196 -48886 -49710 -50533 -54397 -58257 -62001 -60976 -58342 -60473 -62757 -62180 -63510 -64836 -65134 -65429 -62385
-7628f2385L044j758j755J583J584J460J464l781l782j907j904j904j904M001M006K574K575
$$ -62385 -59341 -61099 -62854 -61271 -59687 -58227 -56763 -60544 -64326 -66233 -68137 -70041 -71945 -67944 -63938 -61364 -58789
-7611e8789K123K128O96O97r16r13N18N18R6J01J531J532j740j740l09l10M96M95r35r35Q53
$$ -58789 -56666 -54538 -53842 -53145 -54061 -54974 -54456 -53938 -53842 -53741 -52210 -50678 -52418 -54158 -54467 -54777 -54281 -53786 -54721 -55656 -54803
-7590e4803Q53Q54Q53p57p56O75O74J356J356J356J357j386j386j386j386k549k548J743J744
$$ -54803 -53950 -53096 -52243 -53000 -53756 -53081 -52407 -51051 -49695 -48339 -46982 -48368 -49754 -51140 -52526 -55075 -57623 -55880 -54136
-7571e4136J416J416J64J64j129J736J557J558q31q27l212l212j076j073j252J609L096L100
$$ -54136 -52720 -51304 -51140 -50976 -52105 -50369 -48812 -47254 -48085 -48912 -52124 -55336 -56412 -57485 -58737 -57128 -54032 -50932
-7553e0932Q94j967l521J252P75P75j315j311j491J371J673J677N193N194M296M300K093K094
$$ -50932 -50038 -52005 -55526 -54274 -53499 -52724 -54039 -55350 -56841 -55470 -53797 -52120 -46927 -41733 -37437 -33137 -31044 -28950
-7535b8950l7K828N507N510Q308Q312J0037J2902J7161J7165K1810K6584K6102K6107K3539
$$ -28950 -28987 -26159 -20652 -15142 -6834 1478 11515 24417 41578 58743 80553 107137 133239 159346 182885
-7520A82885J8774J2452P686l047j3536k1647k8319l0172l0167k8562k3789j5507j5503j1809
$$ 182885 201659 214111 221797 218750 205214 183567 155248 125076 94909 66347 42558 27051 11548 -261
-7506b61j1807p519p515n033n030m255j393k262k258j781j780m736L7k60k61L3L8J646j214
$$ -261 -12068 -19587 -27102 -32135 -37165 -41420 -42813 -45075 -47333 -49114 -50894 -55630 -55593 -55853 -56114 -56081 -56043 -54397 -55611
-7487e5611K68K72k113k112k623K42K925K925L368L372l603l603j103J762J584J583L279L282
$$ -55611 -55343 -55071 -57184 -59296 -61919 -61677 -58752 -55827 -52459 -49087 -52690 -56293 -57396 -55634 -54050 -52467 -49188 -45906
-7469d5906J848J852J550J554J550J553r54r50p75p71M17L283o0k917m288m285p329m463k500
$$ -45906 -44058 -42206 -40656 -39102 -37552 -35999 -36953 -37903 -38678 -39449 -39032 -35749 -35809 -38726 -43014 -47299 -54628 -59091 -61591
-7450f1591L65L61L66m1l8j471j468k485k482j173L599N600Q30m117m117j851J009Q31Q31
$$ -61591 -61226 -60865 -60499 -60540 -60578 -62049 -63517 -66002 -68484 -69657 -66058 -60458 -59628 -63745 -67862 -69713 -68704 -67873 -67042
-7431f7042k045k046k343K425Q16Q16P56L618L942J080M85M84P23P23k616k615n89n89K750
$$ -67042 -69087 -71133 -73476 -71051 -70235 -69419 -68663 -65045 -61103 -60023 -59538 -59054 -58331 -57608 -60224 -62839 -63428 -64017 -61267
-7412f1267K750J646J647L7K899N25N30K134K139P34P38k724n581l521o56Q91Q94L54L58l760
$$ -61267 -58517 -56871 -55224 -55187 -52288 -51763 -51233 -49099 -46960 -46226 -45488 -48212 -53793 -57314 -57970 -57079 -56185 -55831 -55473 -59233
-7392e9233l755j893R69L651L651J505J506J505J505J520J520J699J699L58L219J967q94j170
$$ -59233 -62988 -64881 -63912 -60261 -56610 -55105 -53599 -52094 -50589 -49069 -47549 -45850 -44151 -43793 -40574 -38607 -39501 -40671
-7374d0671J695r3r3K019K023j315j315l368l364k590K72K593K597J524J524K921N782O558
$$ -40671 -38976 -39069 -39162 -37143 -35120 -36435 -37750 -41118 -44482 -47072 -46800 -44207 -41610 -40086 -38562 -35641 -29859 -23301
-7356b3301O561M351M352K921K925Q64Q65p46p41l189o051o826o821o096o091k459M06J177
$$ -23301 -16740 -12389 -8037 -5116 -2191 -1327 -462 -1208 -1949 -5138 -11189 -18015 -24836 -30932 -37023 -39482 -39076 -37899
-7338c7899J181J356J360N22N25N22N25q20q16k250k247j244j241j244j241j632j628l20K545
$$ -37899 -36718 -35362 -34002 -33480 -32955 -32433 -31908 -32728 -33544 -35794 -38041 -39285 -40526 -41770 -43011 -44643 -46271 -46591 -44046
-7319d4046K779l893m255m251J915J918J915J919L029L029L208L47j979j978k157k158j568
$$ -44046 -41267 -45160 -49415 -53666 -51751 -49833 -47918 -45999 -42970 -39941 -36733 -36386 -38365 -40343 -42500 -44658 -46226
-7302d6226j569J114L976M899M900j68j68o11o11k816k817n261k399j446j446L510O371K198
$$ -46226 -47795 -46681 -42705 -37806 -32906 -33074 -33242 -33853 -34464 -37280 -40097 -45358 -47757 -49203 -50649 -47139 -40768 -38570
-7284c8570K199J125j736l06K556O319O322K39o434r807r802r449o583J848J851K027K031
$$ -38570 -36371 -35246 -36982 -37288 -34732 -28413 -22091 -21852 -28286 -38093 -47895 -57344 -63927 -62079 -60228 -58201 -56170
-7267e6170M113M117M888P754O222O225Q011N153K585K590K406K410L659L662o33o30Q27Q31
$$ -56170 -52057 -47940 -43052 -35298 -29076 -22851 -14840 -9687 -7102 -4512 -2106 304 3963 7625 6992 6362 7189 8020
-7249H020k809n666r206r207n749k887k947k947j040J822K217K217M005M005M125O985Q596
$$ 8020 5211 -455 -9661 -18868 -24617 -27504 -30451 -33398 -34438 -32616 -30399 -28182 -24177 -20172 -16047 -9062 -466
-7232d66J1j565m426m784m784k876k876m009m009l152J617M84L346M895K035J617J617j949
$$ -466 -455 -2020 -6446 -11230 -16014 -18890 -21766 -25775 -29784 -32936 -31319 -30835 -27489 -22594 -20559 -18942 -17325 -19274
-7214a9274R17K462K467N384K526P469P474M847M851q76l733n227q085j1724j1721n250k384
$$ -19274 -18357 -15895 -13428 -8044 -5518 1951 9425 14272 19123 18247 14514 9287 1202 -10522 -22243 -27493 -29877
-7197b9877K94K98r87r84o89o86L633Q405J1561J6333J1233K653R20L786Q263Q264O654O658
$$ -29877 -29583 -29285 -30272 -31256 -31945 -32631 -28998 -20593 -9032 7301 18534 21187 22107 25893 34156 42420 49074 55732
-7179E5732J587m135j2660j2657p325m463q27M899O803J2527J4552K0280J9929J9929J4326
$$ 55732 57319 53184 40524 27867 20542 16079 15252 20151 26954 39481 54033 74313 94242 114171 128497
-7164A28497M791k545q267j2798j8517j6256o717P34L599O456O457Q007J0872J1754O036K277
$$ 128497 133288 130743 122476 109678 91161 74905 68188 68922 72521 78977 85434 93441 104313 116067 122103 124380
-7148A24380K280m9m4M243M248Q088Q093P790K072j450m307k880j4K958Q685J5655K1382K1915
$$ 124380 126660 126611 126567 130810 135058 143146 151239 159029 161101 159651 155344 152464 152450 155408 164093 179748 201130 223045
-7130B23045J2381N581N585O833J2560J3331J0473Q323Q327J4344J4348J1491J1494J3517
$$ 223045 235426 241007 246592 253425 265985 279316 289789 298112 306439 320783 335131 346622 358116 371633
-7116C71633J9243J8227J8230K0969L0510L5573K9855J4113o866j2891l350J0238K3596L5141
$$ 371633 390876 409103 427333 448302 478812 514385 544240 558353 551487 538596 535246 545484 569080 604221
-7102F04221M4683N9225P6397Q5633R5175J01371J07097J18211J31568J48971J66143J95767
$$ 604221 648904 708129 784526 870159 965334 1066705 1173802 1292013 1423581 1572552 1738695 1934462
-7090A934462K32015K64440L00688L50349L98039M25937M43109M63851N19171O25280P79800
$$ 1934462 2166477 2430917 2731605 3081954 3479993 3905930 4349039 4812890 5332061 5957341 6737141
-7079F737141R64922J199555J532908K034608K801100L993344N786723Q329546J1641982J5161489
$$ 6737141 7702063 8901618 10434526 12469134 15270234 19263578 25050301 33379847 45021829 60183318
-7069F0183318J6659432J2250981R56534j0624457j5972160j5470453j2316992q950093o333828
$$ 60183318 76842750 89093731 90050265 79425808 63453648 47983195 35666203 26716110 20382282
-7060B0382282m485367l149399k166988j451403r87854p31234o33947n96510n60263n20504
$$ 20382282 15896915 12747516 10580528 9129125 8141271 7410037 6776090 6179580 5619317 5098813
-7050E098813m72815m15349l71470l47830l26847k92987k56739k25565j96952j62376j33759
$$ 5098813 4625998 4210649 3839179 3491349 3164502 2871515 2614776 2389211 2192259 2029883 1896124
-7039A896124j08416r1248o4542l9739j6017M967L0242M7414M6307j382q5316j67339j97507
$$ 1896124 1787708 1696460 1631918 1592179 1576162 1581129 1611371 1658785 1705092 1703710 1618394 1451055 1253548
-7026A253548j84153j43618j03554p5160o1806n2984m7258m1837l6114l3133k7407k4057k4057
$$ 1253548 1069395 925777 822223 747063 685257 632273 585015 543178 507064 473931 446524 422467 398410
-7013C98410k2269k2265k0958k0957j5712j5708j7704j7705j5500r772k265N96K325K328l72
$$ 398410 376141 353876 332918 311961 296249 280541 262837 245132 229632 219860 217595 218191 220516 222844 222472
-6998B22472o096o214o211o930o930p049j2768j6651j6650j3670j3666q603q603o576q49N048
$$ 222472 216376 210162 203951 197021 190091 183042 170274 153623 136973 123303 109637 101034 92431 85855 85006 90054
-6982I0054N048L022L025M095M095j98n916j4259j9981j5987j3123j0085m363M877J4419J8200
$$ 90054 95102 98124 101149 105244 109339 109141 103225 88966 68985 52998 39875 29790 25427 30304 44723 62923
-6966F2923J8200J6591J0872L536O74j233o952j1681j4541j4900r172j726J137K269K273L267
$$ 62923 81123 97714 108586 112122 112796 111563 104611 92930 78389 63489 54317 52591 53728 55997 58270 61537
-6950F1537L268Q83Q86J0004J0004M757M762q9r0l428l424L28L28k056k053j878j878q05M922
$$ 61537 64805 65688 66574 76578 86582 91339 96101 96012 95922 92494 89070 89398 89726 87670 85617 83739 81861 81056 85978
-6931H5978L994L994J2459J2463J7038J7038J7038J7041K0108K0108K5771K5775K9408L6084
$$ 85978 89972 93966 106425 118888 135926 152964 170002 187043 207151 227259 253030 278805 308213 344297
-6917C44297M6456M6461N1583N6352N8439O5119P8815J00752J31751J72767K32138L18933
$$ 344297 390753 437214 488797 545149 603588 668707 747522 848274 980025 1152792 1384930 1703863
-6905A703863M54253O68861R84698J403415J848242K020882J434593K3926j368139j966166
$$ 1703863 2158116 2826977 3811675 5215090 7063332 9084214 10518807 10542733 9174594 7208428
-6895G208428j848387j435393j020969p10980n01746l55814k46844j67674j12522p9139o0540
$$ 7208428 5360041 3924648 2903679 2192699 1690953 1335139 1088295 920621 808099 728960 668420
-6884F68420n7675n6904n4042n0048m5276l8002l8003l2280k7508k0655k0656j7973j7970
$$ 668420 610745 553841 499799 449751 404475 366473 328470 296190 268682 248027 227371 209398 191428
-6871A91428j2488j2489q197q193o259o259o260o255p780p775j0935j0935j3592j0727p865
$$ 191428 178940 166451 158254 150061 143802 137543 131283 125028 117248 109473 98538 87603 74011 63284 55419
-6856E5419l096K802K806j189j189o289o285o285o286m713m709q048q048m742m739k175k176
$$ 55419 52323 55125 57931 56742 55553 49264 42979 36694 30408 25695 20986 12938 4890 148 -4591 -6766 -8942
-6839h942r13J952O066J0833J5481K0253K0075K0074N283j2835k3148k6010j9635j4861j2299
$$ -8942 -9855 -7903 -1837 8996 24477 44730 64805 84879 90162 77327 54179 28169 8534 -6327 -18626
-6824a8626p529m285m281K217K217O03O08k731k731J620J625L055L055M58M62M62M62L380
$$ -18626 -26155 -30440 -34721 -32504 -30287 -29684 -29076 -31807 -34538 -32918 -31293 -28238 -25183 -24725 -24263 -23801 -23339 -19959
-6806a9959L383r09r10l714l711k280k280J389J390J211J215L684Q24N85n134o062l201N55
$$ -19959 -16576 -17485 -18395 -22109 -25820 -28100 -30380 -28991 -27601 -26390 -25175 -21491 -20667 -20082 -25216 -31278 -34479 -33924
-6788c3924L421P708J0570J2537R679J01r438j3967j1102o755o755p411j684J904J904j23
$$ -33924 -30503 -22795 -12225 312 9991 10092 654 -13313 -24415 -31170 -37925 -45336 -47020 -45116 -43212 -43335
-6772d3335j19J904J904M288M292p34p30l119l114l655l652O38O40k328k325n667n663j256
$$ -43335 -43454 -41550 -39646 -35358 -31066 -31800 -32530 -35649 -38763 -42418 -46070 -45432 -44792 -47120 -49445 -55112 -60775 -62031
-6754f2031j252j255j252K261K266K261K266M73M77M73M77q39q34q38q35K202K206K023q35
$$ -62031 -63283 -64538 -65790 -63529 -61263 -59002 -56736 -56263 -55786 -55313 -54836 -55675 -56509 -57347 -58182 -55980 -53774 -51751 -52586
-6735e2586j203o923r311r307r906j2765j4974r247k455J0901K1748K1751J5428N894J241
$$ -52586 -53789 -60712 -70023 -79330 -89236 -102001 -116975 -126222 -128677 -117776 -96028 -74277 -58849 -52955 -51714
-6720e1714J244L58L61K743K745K027K031N9K925J520m199q04q02k235k232J49J53M270M270
$$ -51714 -50470 -50112 -49751 -47008 -44263 -42236 -40205 -40146 -37221 -35701 -39900 -40704 -41506 -43741 -45973 -45824 -45671 -41401 -37131
-6701c7131L017L022J56L018Q801J4526K0141K9679L5403K9683O490j8308k4747k1881k0496
$$ -37131 -34114 -31092 -30936 -27918 -19117 -4591 15550 45229 80632 110315 116805 98497 73750 51869 31373
-6686C1373j7634j3163j0297j0600m877k373M92K157K157R05R10J829J829K664l055q144q141
$$ 31373 13739 576 -9721 -20321 -25198 -27571 -27079 -24922 -22765 -21860 -20950 -19121 -17292 -14628 -17683 -25827 -33968
-6669c3968q081q082n968P11P925J0786Q577L811M229k448o922o919m952m951j800j796J543
$$ -33968 -42049 -50131 -56099 -55388 -47463 -36677 -28100 -24289 -20060 -22508 -29430 -36349 -41301 -46252 -48052 -49848 -48305
-6652d8305J542K404K406K228K228J554j304j900j900m020j155K481K481R699R701J532n142
$$ -48305 -46763 -44359 -41953 -39725 -37497 -35943 -37247 -39147 -41047 -45067 -46222 -43741 -41260 -31561 -21860 -20328 -25470
-6635b5470o516o513m251j386n175n171j658j655K992K996K395m62j933R31J047L912O114
$$ -25470 -31986 -38499 -42750 -44136 -49311 -54482 -56140 -57795 -54803 -51807 -49412 -49874 -51807 -50876 -49829 -45917 -39803
-6618c9803Q979J1837J1841J0807J0812P470P474J0332J0335J2001J8681J8677K1539K4459
$$ -39803 -30824 -18987 -7146 3661 14473 21943 29417 39749 50084 62085 80766 99443 120982 145441
-6604A45441K4464K0167J7307R377j110j2265k2757l0388l0383k6930k6930k2876k0011j6878
$$ 145441 169905 190072 207379 216756 215646 203381 180624 150236 119853 92923 65993 43117 23106 6228
-6590F228j0200p400p395n194k332o04o00o471o472n816j043k537k538J398M262L979L983
$$ 6228 -3972 -11372 -18767 -23961 -26293 -26897 -27497 -33968 -40440 -46256 -47299 -49836 -52374 -50976 -46714 -42735 -38752
-6573c8752m92n257n291q148r702o837j982Q83k53k50J625O397P705M847o30o26k239k235
$$ -38752 -39244 -44501 -49792 -57940 -67642 -74479 -76461 -75578 -75831 -76081 -74456 -68059 -60354 -55507 -56137 -56763 -59002 -61237
-6555f1237j435j430o025q882q499q494q380q375j643L129Q02Q04o7N656J0246P388O460O461
$$ -61237 -62672 -64102 -70127 -79009 -87508 -96002 -104382 -112757 -114400 -111271 -110469 -109665 -109732 -104076 -93830 -86442 -79982 -73521
-6537g3521L718L722J438j423K213P940Q830Q830N253N257L465R188J3063J5926J3301P579
$$ -73521 -69803 -66081 -64643 -66066 -63853 -55913 -47083 -38253 -33000 -27743 -24278 -15090 -2027 13899 27200 34779
-6521C4779l808j3342j6043j0320r843m117k154L570Q86j971n104n100r214r214o595q68L186
$$ 34779 30971 17629 1586 -8734 -18577 -22694 -24848 -21278 -20392 -22363 -27467 -32567 -41781 -50995 -57590 -58458 -55272
-6504e5272O047M851J993n11n10k16k12N987N987M542M545L115L115j479j476m02m02n787
$$ -55272 -49225 -44374 -42381 -42892 -43402 -43618 -43830 -37843 -31856 -27314 -22769 -19654 -16539 -18018 -19494 -19896 -20298 -26085
-6486b6085j1505j4545j1684j0496r53R001J8539J8272J8271Q852Q855N634N633R151R154
$$ -26085 -37590 -52135 -63819 -74315 -75268 -66267 -47728 -29456 -11185 -2333 6522 12156 17789 26940 36094
-6471C6094J2474J5335J4203J9929K2429K8152K8509K8514L2831M6185N7034O6575P8137R9121
$$ 36094 48568 63903 78106 98035 120464 148616 177125 205639 238470 284655 341689 408264 486401 585522
-6457E85522J29165J65412K04485K52175K98673L38735L63412L57688L08092K29883J12791
$$ 585522 714687 880099 1084584 1336759 1635432 1974167 2337579 2695267 3003359 3233242 3346033
-6446C346033j8834j47119k44404l16418l45032l35971l07354k68549k17045j66732j26668
$$ 3346033 3327199 3180080 2935676 2619258 2274226 1938255 1630901 1362352 1145307 978575 851907
-6435H51907r8417p7432o4914n5373n1222n1221n6170n3305n3308m7585l6796k7254k1744
$$ 851907 753490 676058 611144 555771 504549 453328 397158 343853 290545 242960 206164 178910 157166
-6422A57166j2205r404l677l682o542o006o002j1390j1386r720l040K201N067J785J789J963
$$ 157166 144961 135557 131880 128198 121656 115650 109648 98258 86872 77152 74112 76313 81380 83165 84954 86917
-6406H6917O736J1442K0030K0026K4798K5272J6692K820r575k1859l2347l7448k6952j7955
$$ 86917 93653 105095 125125 145151 169949 195221 211913 214733 205158 183299 150952 113504 86552 68597
-6392F8597p459m556m553l603l599l275J498J851J856o021j0790j3770j3771j3769n186n425
$$ 68597 61138 56582 52029 48426 44827 41552 43050 44901 46757 40736 29946 16176 2405 -11364 -16550 -21975
-6376b1975n425m426L43N529J0298P347J5930J5693J5693O379O378O379O378L070L070o289
$$ -21975 -27400 -31826 -31483 -25954 -15656 -8309 7621 23314 39007 45386 51764 58143 64521 67591 70661 64372
-6360F4372r150q242q241j0805j0804j0209j0208r374k697J12M884N000N004J243J248m417
$$ 64372 55222 46980 38739 27934 17130 6921 -3287 -12661 -15358 -15246 -10362 -5362 -358 885 2133 -2284
-6344b284m415k050O539J0767J0771O714O717J289l476j2753j2750j1142m464k738L941M117
$$ -2284 -6699 -8749 -2210 8557 19328 26042 32759 34048 30572 17819 5069 -6073 -10537 -13275 -9334 -5217
-6328e217M121K939N805O397O401J330j528n525k660K477P247R035J1896R870N100N11k351
$$ -5217 -1096 1843 7648 14045 20446 21776 20248 14723 12063 14540 21787 30822 42718 52588 57688 58199 55848
-6311E5848r982r981p418M981J4162K4654K0063J1479M661M661J144j718j1017j5786j8052
$$ 55848 45866 35885 28467 33448 47610 72264 92327 103806 108467 113128 114272 112554 101537 85751 67699
-6296F7699j3282r065m296m116m117L066N928M497J635n708n704L238J2776K3055K5920J2269
$$ 67699 54417 45352 41056 36940 32823 35889 41817 46314 47949 42241 36537 39775 52551 75606 101526 113795
-6280A13795m900k1773k7493k1292j5570j0686j144N295J8647L9814N3170M6732K5749l465
$$ 113795 108895 87122 59629 38337 22767 12081 10937 16232 34879 74693 127863 174595 200344 196879
-6266A96879k0629k8141k8141k9441k3714j1017O151J3003J0145l46o070j6751j9612j5559
$$ 196879 176250 148109 119968 90527 66813 55796 61947 74950 85095 84749 78679 61928 42316 26757
-6252B6757k206J550j311n485q345m948P75J0253K3607L1952L7675L4813K1461O63k0320k6043
$$ 26757 24551 26101 24790 19305 10960 6012 6787 17040 40647 72599 110274 145087 166548 167211 146891 120848
-6236A20848k0321j6386l032J497P221J9024K8561K3972J4434n89l450k91o013k2880m0045
$$ 120848 100527 84141 81109 82606 89827 108851 137412 161384 175818 175229 171779 171488 165475 142595 102550
-6221A02550n4832m9104l1047j3875p04Q837J5496J8360J8774K1639K6106K8972K7060J3711
$$ 102550 47718 -1386 -32433 -46308 -47012 -38175 -22679 -4319 14455 36094 62200 91172 118232 131943
-6207A31943o934k7913m1032l5305k1717m545J1843K5201K9892K7034K9474L9017M9087N8628
$$ 131943 125009 97096 56064 20759 -958 -5503 6340 31541 61433 88467 117941 156958 206045 264673
-6193B64673N4095L6930K0562P209L335L335P686J0548J5137K4676L9802N6971O5317L6702
$$ 264673 318768 355698 376260 383469 386804 390139 397825 408373 423510 448186 487988 544959 610276 646978
-6179F46978l4117j19958j52865j16620n4665o974J2816R956q94l756J1744M0357P4486Q4023
$$ 646978 612861 492903 340038 223418 168753 161779 174595 184551 183657 179901 191645 232002 306488 390511
-6165C90511O8525K8464l2697q0387r4217q4680m6385o327J0365j0618k2183n015K1334L4686
$$ 390511 459036 487500 454803 374416 280199 195519 149134 142807 153172 142554 120371 115356 136690 171376
-6151A71376L9546L9545K9173J2004q979k2332j9709k541K1467L8637N0379O3733P9888Q2750
$$ 171376 210922 250467 279640 291644 282665 260333 240624 238083 259550 298187 348566 412299 492187 574937
-6137E74937O7667L5238n223n2913q2243j07041j03346p8546m8026j5596J3007J8729N615
$$ 574937 642604 677842 672619 619706 537463 430422 327076 248530 200504 184908 197915 216644 222259
-6124B22259j5365p977K4453Q5256J48211J83498J28178L9236j9896k0734J1695M5794N9150
$$ 222259 206894 198917 223370 308626 456837 640335 768513 807749 787853 767119 778814 824608 883758
-6111H83758O4646K8402l6934r6065j02984q2001o1017m3844o129M5376J10234J69374K18967
$$ 883758 948404 976806 939872 843807 740823 658822 597805 553961 547832 593208 703442 872816 1091783
-6098A091783K36135K13244J46483O9970k3499r9806j78013k13665j81233p2086L6650R5365
$$ 1091783 1327918 1541162 1687645 1757615 1734116 1634310 1456297 1242632 1061399 989313 1025963 1121328
-6086A121328R2507Q1475Q7202J21952J21955P8197J5249q353j4072j5507l6486k6357K262
$$ 1121328 1213835 1295310 1382512 1504464 1626419 1704616 1719865 1711512 1697440 1681933 1645447 1619090 1621352
-6073A621352N0186O3543M8219Q163r605r601J8890M7507J06281J65420K16501J91706J19213
$$ 1621352 1671538 1735081 1783300 1791463 1781858 1772257 1791147 1838654 1944935 2110355 2326856 2518562 2637775
-6060B637775M1006L9571P5820J29705J20171Q7261O2466R6561J36624J58140J33345J31136
$$ 2637775 2678781 2718352 2794172 2923877 3044048 3131309 3193775 3290336 3426960 3585100 3718445 3849581
-6048C849581J34001J52913J39564J43673J64660K47875L03200K60513O7850j15208k08677
$$ 3849581 3983582 4136495 4276059 4419732 4584392 4832267 5135467 5395980 5463830 5348622 5139945
-6037E139945j29515J7373J93971L17969M55311N79308P10109P95951Q75354Q50556Q74966
$$ 5139945 5010430 5027803 5221774 5539743 5995054 6574362 7284471 8080422 8955776 9806332 10681298
-6026A0681298R91330J174698J268169J454280J746140K113114K408791K837583L427027M034120
$$ 10681298 11672628 12847326 14115495 15569775 17315915 19429029 21837820 24675403 28102430 32136550
-6016C2136550M303092M372453M401069M758979N546815O745857Q006774R878119J3027567
$$ 32136550 36439642 40812095 45213164 49972143 55518958 62264815 70271589 80149708 93177275
-6007I3177275J8115369K5865917L8533761N8439494Q8173620J29116315J77209849K03303768
$$ 93177275 111292644 137158561 175692322 234131816 322305436 451421751 628631600 831935368
-5999H31935368J53918001J4146631j25346048j86677074j81062841j41829296r9109028o7334224
$$ 831935368 985853369 1000000000 874653952 687976878 506914037 365084741 265975713 198641489
-5991A98641489m6248458l1168908k0113932j1714811n637147j327899P95967k36037m560270
$$ 198641489 152393031 121224123 101110191 89395380 83758233 82430334 83226301 82990264 78429994
-5982G8429994q503271r589871q424338o737374n442114m610163l765102l004095k292557
$$ 78429994 69926723 60336852 51912514 45175140 39733026 35122863 31357761 28353666 26061109
-5973B6061109j627047q27765m6609P90826J653538K159049J112735j227885k758963k818101
$$ 26061109 24434062 23606297 23559688 24350514 26004052 28163101 29275836 28047951 25288988 22470887
-5963B2470887k244093j513485r48122m69316K9027Q43570K138586M116762O819642R946188
$$ 22470887 20226794 18713309 17765187 17295871 17324898 18168468 20307054 24423816 31243458 41189646
-5953D1189646J1491096P380238k558585j0064964j1400281r338173o579134m410203l011222
$$ 41189646 52680742 60060980 57502395 47437431 36037150 26698977 20119843 15709640 12698418
-5944A2698418k105115j483224r85343n89040k78103j68117k80667m89785n45106m62282l11578
$$ 12698418 10593303 9110079 8124736 7535696 7257593 7089476 6808809 6319024 5773918 5311636 5000058
-5933E000058k10003j73755k08453k40879k78557k88091k78810k19672j57201j13323j27515
$$ 5000058 4790055 4616300 4407847 4166968 3888411 3600320 3321510 3101838 2944637 2831314 2703799
-5922B703799j52309j74250j49448j17500r2697r5085p0283l3566q763k3550m0716m8483j9866
$$ 2703799 2551490 2377240 2227792 2110292 2017595 1922510 1852227 1818661 1809898 1786348 1745632 1697149 1677283
-5909A677283l655k0819j05294j91132k52238k49373k07231j21390k9765P1341J51814J91874
$$ 1677283 1673628 1652809 1547515 1356383 1104145 854772 647541 526151 496386 567727 719541 911415
-5897I11415J67313J31072O8297J2977l8528p0954j06009j34623j58707j30089p0413l647
$$ 911415 1078728 1209800 1278097 1291074 1252546 1181592 1075583 940960 782253 652164 581751 578104
-5885E78104K2581L2124K0794P440k3677k3674J6755Q3521J08676R9143N4460K954l4303l1438
$$ 578104 600685 632809 653603 661043 637366 613692 630447 713968 822644 921787 976247 979201 944898 913460
-5871I13460j7593L390l65j7529n1781q0395j06624j12343r7116o8502l5834M13K7057M8040
$$ 913460 895867 899257 898892 881363 829582 749187 642563 530220 433104 364602 328768 329181 356238 404278
-5857D04278M8815M5957L8622L2898J9486O136j5685k5224j9977J009J1811K1349K5521K5525
$$ 404278 453093 499050 537672 570570 590056 596192 580507 555283 535306 536315 548126 569475 594996 620521
-5843F20521N910k2705l8085k0913P90m933m1416q5290j10864r7511n3397R553N8032Q2831
$$ 620521 626431 603726 565641 544728 545518 540585 499169 413879 303015 205504 152107 161660 219692 302523
-5829C02523O8763M3964J0581j0402j6602j0879o688j2410n3424j12559j35630p6492n913
$$ 302523 371286 415250 425831 415429 398827 387948 381260 368850 315426 202867 67237 -9255 -15168
-5816a5168L7961M4176L0823P038k500q818n958n421n421m888Q38M534K1703L5678M9035M7604
$$ -15168 22793 66969 97792 104830 102330 93512 87554 82133 76712 71824 72662 77196 98899 134577 183612 231216
-5800B31216L8066K9657K3938K1852J8990L100j4065k6047l5584m1681l5953j7832o63J2984
$$ 231216 269282 298939 322877 344729 363719 366819 352754 326707 291123 249442 213489 195657 194994 207978
-5786B07978K2526K3063J7340J7082J9948J6133J3271L968j3197l0425m7593n9321n3599m2630
$$ 207978 230504 253567 270907 287989 307937 324070 337341 341309 328112 297687 250094 190773 137174 94544
-5772I4544k5459j2526k988l65R177K2347K8070K2109J2574N179m359j6759l0108l3547k4008
$$ 94544 69085 56559 53571 53206 62383 84730 112800 134909 147483 152662 148303 131544 101436 67889 43881
-5757D3881p079J7723L4352M0074L4829K5294J5469K116q256q252n813q9R84m736j7355k3077
$$ 43881 36802 54525 88877 128951 163780 189074 204543 206659 198403 190151 184338 184249 185233 180497 163142 140065
-5741A40065j8547j2824m598M941J6147J0425k854j6207k6341k6341k8607k2883o550J4433
$$ 140065 121518 108694 104096 109037 125184 135609 132755 116548 90207 63866 35259 12376 5826 20259
-5727B0259L1569L7291K8707J5354K418l305r981j5704k3901k9624k4377j1025O442J9795
$$ 20259 51828 89119 117826 133180 135598 132293 122312 106608 82707 53083 28706 17681 24123 43918
-5713D3918K0510J0973M58n261k519L205K187K190l651l651l014l011p898j3622j7321j7317
$$ 43918 64428 75401 75859 70598 68079 71284 73471 75661 72010 68359 65345 62334 54436 40814 23493 6176
-5697F176p063j341j703j699Q9N812J6508K2236J8897R359j762j1297j1535j997O673J2399
$$ 6176 -887 -2228 -3931 -5630 -5541 271 16779 39015 57912 67271 65509 54212 42677 40680 47353 59752
-5681E9752J9911J9910K3748J0399j047j0585j4016j4013j1628n905k586k582k224k224K272
$$ 59752 79663 99573 123321 133720 132673 122088 108072 94059 82431 76526 73940 71358 69134 66910 69182
-5666F9182K277k016k016j2257j2254r512r512k422L305J1650J1651Q442K724k761k761l509
$$ 69182 71459 69443 67427 55170 42916 33404 23892 21470 24775 36425 48076 56518 59242 56481 53720 50211
-5650E0211K217L289L290J845J847J487J490q68o587j1479j1475n637n634j0167j5886j1121
$$ 50211 52428 55717 59007 60852 62699 64186 65676 64808 58221 46742 35267 29630 23996 13829 -2057 -13178
-5634a3178n395M854M859K898K903P189P195J3539J3543J4553J1696R217l17j691j688m642
$$ -13178 -18573 -13719 -8860 -5962 -3059 4130 11325 24864 38407 52960 64656 73873 73556 71865 70177 65535
-5618F5535j0362j1557j4415j3938j1073m816j953N912J94j658j654R50R53P508P511j196
$$ 65535 55173 43616 29201 15263 4190 -626 -2579 3333 3527 1869 215 1165 2118 9626 17137 15941
-5602A5941j0730j3118j3114n205N21R401J8940K0906J8047J4289M754K306l413m787j923
$$ 15941 5211 -7907 -21021 -26226 -25705 -16304 2636 23542 41589 55878 60632 62938 59525 54738 52815
-5587E2815J233J237L439L443j576p299l961J766K836K835P485P489K597K597L252k466m259
$$ 52815 54048 55285 58724 62167 60591 53292 49331 51097 53933 56768 64253 71742 74339 76936 80188 77722 73463
-5570G3463p120p298p296k2k2M210P075J0291M567K601k57O118Q979R873J2738J7385J7384
$$ 73463 66343 59045 51749 51727 51705 55915 62990 73281 77848 80449 80192 86310 95289 105162 117900 135285 152669
-5553A52669J9888K2754L2235M1777N2802O6158P8912Q4638J03711J36143J80521K28214K83114
$$ 152669 172557 195311 227546 269323 322125 388283 467195 551833 655544 791687 972208 1200422 1483536
-5540A483536L30807L63233L66097L35513K64936J70707L9087r7071k09615k98203l53520
$$ 1483536 1814343 2177576 2543673 2879186 3144122 3314829 3353916 3256845 3047230 2749027 2395507
-5529B395507l67592l50419l08114k52789j96520j52641j09783q1166n9232m2061l0104k0566
$$ 2395507 2027915 1677496 1369382 1116593 920073 767432 657649 576483 517251 475190 445086 424520
-5517D24520j6691j9550k4560l4098l7913m0772l5812l0089k1922j6196r076r076o692r65
$$ 424520 407829 388279 363719 329621 291708 250936 215124 185035 163113 146917 137841 128765 122073 121108
-5503A21108N634N633P243M385k68n991k593k590J684P407R851J5578J7153J4292Q629m721
$$ 121108 126742 132375 139618 144003 143735 137744 135151 132561 134245 141652 151503 167081 184234 198526 207155 202434
-5487B02434p306j3029j7202j7202j5115k0838k3819k3819k3670k3670j9734j9735j0853j316
$$ 202434 195128 182099 164897 147695 132580 111742 87923 64104 40434 16764 -2970 -22705 -33558 -34874
-5473c4874P090R952J1781O057L912J051K839K839N044N045n89n88Q42Q42K302K303K302K303
$$ -34874 -27784 -17832 -6051 6 3918 4969 7808 10647 15691 20736 20147 19559 20401 21243 23545 25848 28150 30453
-5455C0453N395N395O468O471P959K235l428r146q212j1073r821r817l711l711j327j322P30
$$ 30453 35848 41243 47711 54182 62141 64376 60948 51802 43590 32517 22696 12879 9168 5457 4130 2808 3538
-5438C538P30K757K761P049J327R09j949K83K83R39m780q599q598q778n913q23M903P109P108
$$ 3538 4268 7025 9786 16835 18162 19071 17122 17405 17688 18627 13847 5248 -3350 -12128 -18041 -18864 -13961 -6852 256
-5419B56M243M248m5m5l595l592k53k53L200L204M635M635M601M605K221K220P86P90j296
$$ 256 4499 8747 8702 8657 5062 1470 1217 964 4164 7368 12003 16638 21239 25844 28065 30285 31071 31861 30565
-5400C0565m158n906j1624l338l339k774k772k772k772n652n648l268l264m430m426j032l890
$$ 30565 26407 20501 8877 5539 2200 -574 -3346 -6118 -8890 -14542 -20190 -23458 -26722 -31152 -35578 -36610 -40500
-5383d0500r12M813O658O662P403P407L111L115p23p19p23p19J989J994J988J994m418m415
$$ -40500 -41412 -36599 -29941 -23279 -15876 -8469 -5358 -2243 -2966 -3685 -4408 -5127 -3138 -1144 844 2838 -1580 -5995
-5365e995m419m415j438j435j438j434J706J707J706J710l450l450l450l446l257l256Q2Q6
$$ -5995 -10414 -14829 -16267 -17702 -19140 -20574 -18868 -17161 -15455 -13745 -17195 -20645 -24095 -27541 -30798 -34054 -33972 -33886
-5347c3886L181L182L182L186L05L06k437k433k168p891q965l237j021M702Q040Q044K794
$$ -33886 -30705 -27523 -24341 -21155 -20850 -20544 -22981 -25414 -27582 -35473 -44438 -47675 -48696 -43994 -35954 -27910 -25116
-5330b5116K794j140o859p816p817j975j974K973K973N358N357K586K586K01K01o982o982
$$ -25116 -22322 -23462 -30321 -38137 -45954 -47929 -49903 -46930 -43957 -38599 -33242 -30656 -28070 -27869 -27668 -34650 -41632
-5313d1632o625o624n566J56J230J229L853L852L853L852N790N790j364j364M85M84r46r47
$$ -41632 -48257 -54881 -60447 -60291 -59061 -57832 -53979 -50127 -46274 -42422 -36632 -30842 -32206 -33570 -33085 -32601 -33547 -34494
-5295c4494k768k768k768k769j486j487n6n6J152J151L536L535K731K731J301J300q27q27
$$ -34494 -37262 -40030 -42798 -45567 -47053 -48540 -48596 -48652 -47500 -46349 -42813 -39278 -36547 -33816 -32515 -31215 -32042 -32869
-5277c2869m70m69K362Q085J3212K6563K7534J4180J662p877j3241j3241q592q592j0997j0995
$$ -32869 -33339 -33808 -31446 -23361 -10149 16414 43948 58128 59790 51913 38672 25431 16839 8247 -2750 -13745
-5261a3745n570q01K68K72N70N70j311j308j308j307j848j845J495J494L088L093k46k46J360
$$ -13745 -19315 -20116 -19848 -19576 -19006 -18436 -19747 -21055 -22363 -23670 -25518 -27363 -25868 -24374 -21286 -18193 -18439 -18685 -17325
-5242a7325J363o7o7o255o252j960j960L760L763M24M25k831k828k471M207O229L372M207
$$ -17325 -15962 -16029 -16096 -22351 -28603 -30563 -32523 -28763 -25000 -24576 -24151 -26982 -29810 -32281 -28074 -21845 -18473 -14266
-5224a4266k471o065j293M668M669L830L834M847M846K12o459q428n566m288j424k854k853
$$ -14266 -16737 -22802 -24095 -19427 -14758 -10928 -7094 -2247 2599 2811 -3648 -12076 -17642 -21930 -23354 -26208 -29061
-5207b9061l246l241q57q57k649k645k645k646J189J188k42k42r87r88r87r87J345J345J345
$$ -29061 -32307 -35548 -36405 -37262 -39911 -42556 -45201 -47847 -46658 -45470 -45712 -45954 -46941 -47929 -48916 -49903 -48558 -47213 -45868
-5188d5868J345J941J941N10N11L938L938O00O00L372L371L372L372J949J948l297l297l864
$$ -45868 -44523 -42582 -40641 -40131 -39620 -35682 -31744 -31144 -30544 -27172 -23801 -20429 -17057 -15108 -13160 -16457 -19754 -23618
-5170b3618l864k27k27l037J736L462O326M355J498j009j006l972l968j587j584m031m028
$$ -23618 -27482 -27709 -27936 -30973 -29237 -25775 -19449 -15094 -13596 -14605 -15611 -19583 -23551 -25138 -26722 -30753 -34781
-5153c4781n283n10k83k80M92m273o334l469k697k694k27M545L767R09O97N469M214J356O30
$$ -34781 -40064 -40574 -40857 -41137 -40645 -44918 -51252 -54721 -57418 -60112 -60339 -55794 -52027 -51118 -50421 -44952 -40738 -39382 -38752
-5134c8752O29M51M55J196J196j189j185k157k157n376L50M907M907J926J930K891K891j401
$$ -38752 -38123 -37672 -37217 -36021 -34825 -36014 -37199 -39356 -41513 -46889 -46539 -41632 -36725 -34799 -32869 -29978 -27087 -28488
-5116b8488j397n96n96n96n93QPj423j419o19o18o19o15j483j482j483j479j930j930j573
$$ -28488 -29885 -30481 -31077 -31673 -32266 -32258 -32251 -33674 -35093 -35712 -36330 -36949 -37564 -39047 -40529 -42012 -43491 -45421 -47351 -48924
-5096d8924j568j237M486j64j60J028J028J029J032N011N011k35k31n689n689k709L018R13
$$ -48924 -50492 -51729 -47243 -47407 -47567 -46539 -45511 -44482 -43450 -38439 -33428 -33663 -33894 -39583 -45272 -47981 -44963 -44050
-5078d4050R13j114j111K105K105l737l733n782o0J014J017n37n36M709M713M128M129K697
$$ -44050 -43137 -44251 -45362 -43257 -41152 -44889 -48622 -54404 -54464 -53450 -52433 -52970 -53506 -48797 -44084 -39956 -35827 -33130
-5060c3130K701J803J804J803J807m434m433m434m430k794k795k794k791J12J12J543J546
$$ -33130 -30429 -28626 -26822 -25019 -23212 -27646 -32079 -36513 -40943 -43737 -46532 -49326 -52117 -52005 -51893 -50350 -48804
-5043d8804k035k034k034k031l152l152l032K693K392K392K750K753L599L599j646j644n342
$$ -48804 -50839 -52873 -54907 -56938 -60090 -63242 -66274 -63581 -61189 -58797 -56047 -53294 -49695 -46096 -47742 -49386 -54728
-5026e4728n343r7r3L558L558L558L562J740J740L171L174L111L111j181j177j837j837p04
$$ -54728 -60071 -60168 -60261 -56703 -53145 -49587 -46025 -44285 -42545 -39374 -36200 -33089 -29978 -31159 -32336 -34173 -36010 -36714
-5008c6714p01j304o073p503k731l421l420J349O121N120N119N417N421J12J12J11J16p45
$$ -36714 -37415 -38719 -44792 -52295 -55026 -58447 -61867 -60518 -54397 -49277 -44158 -38741 -33320 -33208 -33096 -32985 -32869 -33614
-4990c3614p42l129l126o26o22J758J762R0R3Q9R4l58l54m650m646k932k929M07M09J241J244
$$ -33614 -34356 -37485 -40611 -41237 -41859 -40101 -38339 -38249 -38156 -38067 -37973 -38331 -38685 -43335 -47981 -50913 -53842 -53435 -53026 -51785 -50541
-4969e0541J241J245m81m77m81m76J397J401j942j937j71j68j71j68K303K306Q72Q75O56O59
$$ -50541 -49300 -48055 -48536 -49013 -49494 -49970 -48573 -47172 -49114 -51051 -51222 -51390 -51561 -51729 -49426 -47120 -46248 -45373 -44717 -44058
-4949d4058K087K090j19j16j19j16r83r84r83r80P75P75P75P78J804J803N141N146K787K786
$$ -44058 -41971 -39881 -40000 -40116 -40235 -40351 -41334 -42318 -43301 -44281 -43506 -42731 -41956 -41178 -39374 -37571 -32430 -27284 -24497 -21711
-4929b1711j505j501j606j606j75j75j516j517j516j517m36m35R94R95n25n26R06R05Q20Q20
$$ -21711 -23216 -24717 -26323 -27929 -28104 -28279 -29795 -31312 -32828 -34345 -34781 -35216 -34222 -33227 -33752 -34278 -33372 -32467 -31647 -30827
-4909c0827K250K250j64j64j64j63m017m016J229J230N432N432k854k854l096n957n600q31
$$ -30827 -28577 -26327 -26491 -26655 -26819 -26982 -30999 -35015 -33786 -32556 -27124 -21692 -24546 -27400 -30496 -36453 -42053 -42884
-4891d2884j129j129k261k262J792J792P038P038L700L700J315J315J136J137L521L524j755
$$ -42884 -44013 -45142 -47403 -49665 -47873 -46081 -39043 -32005 -28305 -24605 -23290 -21975 -20839 -19702 -16181 -12657 -14412
-4874a4412j755j754j752l736l737j353j349k872k873j442j438j591j591m929m925l946l945
$$ -14412 -16167 -17921 -19673 -23409 -27146 -28499 -29848 -32720 -35593 -37035 -38473 -40064 -41655 -46584 -51509 -55455 -59400
-4857e9400o450j676j31K731N712N715L953L953M132J274k772k772j222J643N07N07r0k947
$$ -59400 -65850 -67526 -67657 -64926 -59214 -53499 -49546 -45593 -41461 -40187 -42959 -45731 -46953 -45310 -44803 -44296 -44386 -47333
-4839d7333k369k370k071K701K042q20l43l39M9M8J658J662n18K343j948K824M325M326R87
$$ -47333 -49702 -52072 -54143 -51442 -49400 -50220 -50563 -50902 -50853 -50805 -49147 -47485 -48003 -45660 -47608 -44784 -40459 -36133 -35146
-4820c5146j870l990l991k559k556k496L69M88L349K929K932N47N48P23k135j777j777k944
$$ -35146 -37016 -41006 -44997 -47556 -50112 -52608 -52239 -51751 -48402 -45473 -42541 -41994 -41446 -40723 -42858 -44635 -46412 -49356
-4802d9356p8O97O96R47R50R50R50j826j821l92l91k183k180l193l193o356L24J815J814L078
$$ -49356 -49434 -48737 -48041 -47094 -46144 -45194 -44244 -46070 -47891 -48283 -48674 -50857 -53037 -56230 -59423 -65779 -65455 -63640 -61826 -58748
-4782e8748L077J647J650K720K720K899M1j394j393l003k999l033l033m642j777L658L659
$$ -58748 -55671 -54024 -52374 -49654 -46934 -44035 -43994 -45388 -46781 -49784 -52783 -55816 -58849 -63491 -65268 -61610 -57951
-4765e7951K586K589O78L540J155j703J41J42J572j285j259j260K854K858L662L663j584j579
$$ -57951 -55365 -52776 -52098 -48558 -47403 -49106 -48965 -48823 -47251 -48536 -49795 -51055 -48201 -45343 -41681 -38018 -39602 -41181
-4747d1181m684m683l253l248p34p34M512M515M751M750J412J416j699j699O85O90J401J400
$$ -41181 -45865 -50548 -53801 -57049 -57783 -58517 -54005 -49490 -44739 -39989 -38577 -37161 -38860 -40559 -39874 -39184 -37783 -36383
-4729c6383J401J405r09r09r09r06l293l294m724m721J915J919j423j420l420l416j990j986
$$ -36383 -34982 -33577 -34486 -35395 -36304 -37210 -40503 -43797 -48521 -53242 -51327 -49408 -50831 -52251 -55671 -59087 -61077 -63063
-4711f3063R47R50R46R50L748L752M10M13m4m1m5m1J5J9J445J449l87l84l87l84k38k35K146
$$ -63063 -62116 -61166 -60220 -59270 -55522 -51770 -51360 -50947 -50991 -51032 -51077 -51118 -51103 -51084 -49639 -48190 -48577 -48961 -49348 -49732 -49970 -50205 -48059
-4688d8059K150q87q83l271l268P23P26P23P27K23K28K23K27K24K27K24K27q83q79q83q79
$$ -48059 -45909 -46796 -47679 -50950 -54218 -53495 -52769 -52046 -51319 -51096 -50868 -50645 -50418 -50194 -49967 -49743 -49516 -50399 -51278 -52161 -53040
-4667e3040J292J297J293J296K031K034l215l212q60q57q61q57k053k049k049k049J52J57
$$ -53040 -51748 -50451 -49158 -47862 -45831 -43797 -47012 -50224 -51084 -51941 -52802 -53659 -55712 -57761 -59810 -61859 -61707 -61550
-4649f1550L495L494j628j624l055l055p9p4M217M218K899K902j390j389N73N78K008K008
$$ -61550 -58055 -54561 -56189 -57813 -60868 -63923 -64002 -64076 -59859 -55641 -52742 -49840 -51230 -52619 -52046 -51468 -49460 -47452
-4631d7452j818j814l84l84K385K388K388K388k12k13l550l551J069J070J069J069M73M74
$$ -47452 -49270 -51084 -51468 -51852 -49467 -47079 -44691 -42303 -42515 -42728 -46278 -49829 -48760 -47690 -46621 -45552 -45079 -44605
-4613d4605M73M73j83j82K202K202M65M66j919j918j61j60j60j60j904j904l335l334k679
$$ -44605 -44132 -43659 -43842 -44024 -41822 -39620 -39155 -38689 -40608 -42526 -42687 -42847 -43007 -43167 -45071 -46975 -50310 -53644 -56323
-4594e6323k679J614J613J572J576J572J576N29N33N29N33J71J76J71J75m55m50m55m51L063
$$ -56323 -59002 -57388 -55775 -54203 -52627 -51055 -49479 -48950 -48417 -47888 -47355 -47184 -47008 -46837 -46662 -47117 -47567 -48022 -48473 -45410
-4574d5410L066j229j226L390L395J959J964K16K20J646J651j274j271j274j270j345j342
$$ -45410 -42344 -43573 -44799 -41409 -38014 -36055 -34091 -33875 -33655 -32009 -30358 -31632 -32903 -34177 -35447 -36792 -38134
-4557c8134j341j341k653k653j222j222k87k83J148J147L13L13l979l979l007l003L36L35
$$ -38134 -39475 -40816 -43469 -46122 -47344 -48566 -48853 -49136 -47988 -46841 -46528 -46215 -50194 -54173 -57180 -60183 -59847 -59512
-4539e9512k109k109o78o78j30j27K258K258L748L748k452k451k61k57J170J173J140J144
$$ -59512 -61621 -63730 -64408 -65086 -65216 -65343 -63085 -60827 -57079 -53331 -55783 -58234 -58495 -58752 -57582 -56409 -55269 -54125
-4521e4125J140J144m10m06J021J025M091M094k01j97o41o37j118L655K042q16l43l39J997
$$ -54125 -52985 -51841 -52251 -52657 -51636 -50611 -46520 -42426 -42627 -42824 -43465 -44102 -45220 -41565 -39523 -40339 -40682 -41021 -39024
-4502c9024K001N66N70J550J554J549J554R39R39m92m92j177j177J982J986K980J19j609j610
$$ -39024 -37023 -36457 -35887 -34337 -32783 -31234 -29680 -28741 -27802 -28294 -28786 -29963 -31140 -29158 -27172 -24192 -24073 -25682 -27292
-4483b7292m530m531j073J792L469O07j08k969j718J144o45o40k254k255k254k254J859J860
$$ -27292 -31822 -36353 -37426 -35634 -32165 -31558 -31666 -34635 -36353 -35209 -35854 -36494 -38748 -41003 -43257 -45511 -43652 -41792
-4465d1792M28M32j285j282J46J49N62N66P42P45J472M336N407O40j002r98j122l979j777
$$ -41792 -41364 -40932 -42217 -43499 -43353 -43204 -42642 -42076 -41334 -40589 -39117 -34781 -29374 -28734 -29736 -30734 -31856 -35835 -37612
-4446c7612j774j777j773k403M62L796R39K172K176N63N66l163l160j911j908n51l409j621
$$ -37612 -39386 -41163 -42936 -45339 -44877 -41081 -40142 -37970 -35794 -35231 -34665 -37828 -40988 -42899 -44807 -45358 -48767 -50388
-4428e0388j620l026j60J569J568Q57Q61n70n70j081j077K083K083K045q12R76R76k574K90
$$ -50388 -52008 -55034 -55194 -53625 -52057 -51200 -50339 -50909 -51479 -52560 -53637 -51554 -49471 -47426 -48238 -47262 -46286 -48860 -48570
-4409d8570K020K019M072M076K348K347n18n283j170j170k057k056o26o22j431j431j430j427
$$ -48570 -46550 -44531 -40459 -36383 -34035 -31688 -32206 -37489 -38659 -39829 -41886 -43942 -44568 -45190 -46621 -48052 -49482 -50909
-4391e0909J021J020m09m07J886J885O33O37J241M102J718j144m1m1j651j650l54l54J434
$$ -50909 -49888 -48868 -49277 -49684 -47798 -45913 -45280 -44643 -43402 -39300 -37582 -38726 -38767 -38808 -40459 -42109 -42463 -42817 -41383
-4372d1383j427p71K090M296J435j282j278j457j457K09K12K13K12k362k358R80R79j110j106
$$ -41383 -42810 -43581 -41491 -37195 -35760 -37042 -38320 -39777 -41234 -41025 -40813 -40600 -40388 -42750 -45108 -44128 -43149 -44259 -45365
-4353d5365j107j107P12P15k622k623j584j580j579j580J494J498J497J498P49P53o78o78
$$ -45365 -46472 -47579 -46867 -46152 -48774 -51397 -52981 -54561 -56140 -57720 -56226 -54728 -53231 -51733 -50984 -50231 -50909 -51587
-4335e1587o82o82o82o78J703J702j635j632j859j859j860j855J08J08J539J542K020K023
$$ -51587 -52269 -52951 -53633 -54311 -52608 -50906 -52541 -54173 -56032 -57891 -59751 -61606 -61498 -61390 -59851 -58309 -56289 -54266
-4317e4266K019K023J245J248J244J248j71j68m463m460r46r43r46r43k206k205K086K090
$$ -54266 -52247 -50224 -48979 -47731 -46487 -45239 -45410 -45578 -50041 -54501 -55447 -56390 -57336 -58279 -60485 -62690 -60604 -58514
-4299e8514M263M262l0k6j282j281k713k708p16p15P15P19K95K94K94K98p19p19L573L577
$$ -58514 -54251 -49989 -50019 -50045 -51327 -52608 -55321 -58029 -58745 -59460 -58745 -58026 -57731 -57437 -57143 -56845 -57564 -58283 -54710 -51133
-4279e1133m84m85m84m81o93o93k123k120o93o93L599L603J244J245J244J248l76l77M870
$$ -51133 -51617 -52102 -52586 -53067 -53760 -54453 -56576 -58696 -59389 -60082 -56483 -52880 -51636 -50391 -49147 -47899 -48275 -48652 -43782
-4260d3782M873K396K396r43r39k440k441l871l867j844j845J495J497Q05Q05K235K239m17
$$ -43782 -38909 -36513 -34117 -35060 -35999 -38439 -40880 -44751 -48618 -50462 -52307 -50812 -49315 -48510 -47705 -45470 -43231 -43648
-4242d3648m17k39k34k392M69K377K381k064P97O19O22l4l3k418k414k448k448k269k265l972
$$ -43648 -44065 -44304 -44538 -46930 -46461 -44084 -41703 -43767 -42970 -42351 -41729 -41763 -41796 -44214 -46628 -49076 -51524 -53793 -56058 -60030
-4222f0030j110K526K530K168K168K169K172L614L614k2k881j11j12k91k87p48p49n70n70
$$ -60030 -61140 -58614 -56084 -53916 -51748 -49579 -47407 -43793 -40179 -40201 -43082 -43193 -43305 -43596 -43883 -44631 -45380 -45950 -46520
-4203d6520l670q09K649K649L543O82Q61Q61j53j53j583j584K314K314j979j978j1j2L47k515
$$ -46520 -50190 -50999 -48350 -45701 -42158 -41476 -40615 -39754 -39907 -40060 -41643 -43227 -40913 -38599 -40578 -42556 -42567 -42579 -42232 -44747
-4183d4747k619K42O3O4l782r20Q08Q09P30P30R09R13J94L055J267J270r54l815k384M80L28
$$ -44747 -47366 -47124 -47061 -46997 -50779 -51699 -50891 -50082 -49352 -48622 -47713 -46800 -46606 -43551 -42284 -41014 -41968 -45783 -48167 -47687 -47359
-4162d7359L28r24r20o78o78P52P57q27q28q27q23n29n29J855J859L06L05k079k075n62n63
$$ -47359 -47031 -47955 -48875 -49553 -50231 -49479 -48722 -49549 -50377 -51204 -52027 -52556 -53085 -51230 -49371 -49065 -48760 -50839 -52914 -53476 -54039
-4141e4039n63n62j606j606j129L640K463l99q75q76k49k50k50k49j34j34J296J297j058j059
$$ -54039 -54602 -55164 -56770 -58376 -59505 -55865 -53402 -53801 -54676 -55552 -55801 -56051 -56301 -56550 -56684 -56818 -55522 -54225 -55283 -56342
-4121e6342j058j058J476J475J475J476p90p90p90p90J222J226J226J226p16p11J673J673
$$ -56342 -57400 -58458 -56982 -55507 -54032 -52556 -53346 -54136 -54926 -55716 -54494 -53268 -52042 -50816 -51532 -52243 -50570 -48897
-4103d8897l503l498l499l498q50q45J538J539o18o15J770J769q86q83q83q83k050k045o15
$$ -48897 -52400 -55898 -59397 -62895 -63745 -64590 -63052 -61513 -62131 -62746 -60976 -59207 -60093 -60976 -61859 -62742 -64792 -66837 -67452
-4084f7452o15J498J502P1P0J271J270j114j110O45O44K075K079P86P87P86P90P26P27P26
$$ -67452 -68067 -66569 -65067 -64996 -64926 -63655 -62385 -63499 -64609 -63964 -63320 -61245 -59166 -58380 -57593 -56807 -56017 -55291 -54564 -53838
-4064e3838P30K009K008l76l73j68j67j599j594j994j993n63n58J52J53J584J587K787K790
$$ -53838 -53108 -51099 -49091 -49467 -49840 -50008 -50175 -51774 -53368 -55362 -57355 -57918 -58476 -58324 -58171 -56587 -55000 -52213 -49423
-4045d9423J356J360l13l09j744j739k057k053o26o22M17M21M17M21j613j609P71P75l4k9
$$ -49423 -48067 -46707 -47020 -47329 -49073 -50812 -52869 -54922 -55548 -56170 -55753 -55332 -54915 -54494 -56107 -57716 -56945 -56170 -56204 -56233
-4025e6233k419k414L242L245r7r3L301L305R16R20k12k12K172K172J248J248k090k090p01
$$ -56233 -58652 -61066 -57824 -54579 -54676 -54769 -51468 -48163 -47247 -46327 -46539 -46751 -44579 -42407 -41159 -39911 -42001 -44091 -44792
-4006d4792p00p01p00j565j565k995k996m91m92R39R39K071K072L502L502J535J535q49q50
$$ -44792 -45492 -46193 -46893 -48458 -50023 -53018 -56014 -56505 -56997 -56058 -55119 -53048 -50976 -47474 -43972 -42437 -40902 -41751 -42601
-3987d2601l830l830j446j445p9p4j509j505j98j93J233J237r73r68M58M62q23q20q24q19
$$ -42601 -46431 -50261 -51707 -53152 -53231 -53305 -54814 -56319 -56517 -56710 -55477 -54240 -55213 -56181 -55723 -55261 -56084 -56904 -57728 -58547
-3967e8547j483j479K809K813P53P56P53P56j136j133j136j133k806k801m21m18L082L084
$$ -58547 -60030 -61509 -58700 -55887 -55134 -54378 -53625 -52869 -54005 -55138 -56274 -57407 -60213 -63014 -63435 -63853 -60771 -57687
-3949e7687O97P01O37O41O37O41O7P0k31k27Qm758m762J1J211J215J509J512k19k16J210J215
$$ -57687 -56990 -56289 -55652 -55011 -54374 -53733 -53666 -53596 -53827 -54054 -54046 -58804 -63566 -63555 -62344 -61129 -59620 -58108 -58327 -58543 -57333 -56118
-3927e6118k65k60j696j691J881J886M51M54l43l39J092J092K53K57j174j173j502j497o8
$$ -56118 -56383 -56643 -58339 -60030 -58149 -56263 -55812 -55358 -55701 -56040 -54948 -53856 -53603 -53346 -54520 -55693 -57195 -58692 -58760
-3908e8760o7J658J662j677j676k72k72j703j699k000k001n70n67K333K332j960j956k079
$$ -58760 -58827 -57169 -55507 -57184 -58860 -59132 -59404 -61107 -62806 -64806 -66807 -67377 -67944 -65611 -63279 -65239 -67195 -69274
-3890f9274k079J260J263k50k50J182J181J121J122L505L506L402L402J017J017M81M80M81
$$ -69274 -71353 -70093 -68830 -69080 -69330 -68148 -66967 -65846 -64724 -61219 -57713 -54311 -50909 -49892 -48875 -48394 -47914 -47433
-3872d7433M80j52j49j53j49r28r24l312l309k120k116K65K68j971j967j673j669k046K728
$$ -47433 -46953 -47105 -47254 -47407 -47556 -48484 -49408 -52720 -56029 -58149 -60265 -60000 -59732 -61703 -63670 -65343 -67012 -69058 -66330
-3853f6330J471J476L111L115k28k23N62N67P41k116K232K235l32l27j614j609o4K802L186
$$ -66330 -64859 -63383 -60272 -57157 -57385 -57608 -57046 -56479 -55738 -57854 -55622 -53387 -53719 -54046 -55660 -57269 -57333 -54531 -51345
-3834e1345L28j345m203j200J666j27j23j259j256o63K202J498j364M25M24K273K273K094
$$ -51345 -51017 -52362 -56565 -57765 -56099 -56226 -56349 -57608 -58864 -59527 -57325 -55827 -57191 -56766 -56342 -54069 -51796 -49702
-3816d9702K094K157p04j479j480k254k254L10L09j282J580J580j282k504k504k98k98r68
$$ -49702 -47608 -45451 -46155 -47634 -49114 -51368 -53622 -53312 -53003 -54285 -52705 -51125 -52407 -54911 -57415 -57713 -58011 -58979
-3798e8979r69P60L621J05J04j147j148k131k131k310N51K83K83M62M62L73L73L532L532M247
$$ -58979 -59948 -59188 -55567 -55462 -55358 -56505 -57653 -59784 -61915 -64225 -63674 -63391 -63108 -62646 -62184 -61811 -61438 -57906 -54374 -50127
-3778e0127J386O11O11o3o4o3o3J158J159k179k180o59o60M73M73j82m952j494J368o60o56
$$ -50127 -48741 -48130 -47519 -47582 -47646 -47709 -47772 -46614 -45455 -47634 -49814 -50473 -51133 -50660 -50187 -50369 -55321 -56815 -55447 -56107 -56763
-3757e6763J606J610J397l368k299N66J75J79K560K563J815j043o90o85k996j34L204L43k906
$$ -56763 -55157 -53547 -52150 -55518 -57817 -57251 -57076 -56897 -54337 -51774 -49959 -51002 -51692 -52377 -55373 -55507 -52303 -51960 -54866
-3738e4866k906j833j833J699j163j162J699J222J222J401J401l99l95j826j825o67o63J721
$$ -54866 -57772 -59605 -61438 -59739 -60902 -62064 -60365 -59143 -57921 -56520 -55119 -55518 -55913 -57739 -59564 -60231 -60894 -59173
-3720e9173J721j56j53j583j584l7l4l3l4P68P67P68P71Q57Q57Q57Q60M81M81r50r47L62L61
$$ -59173 -57452 -57608 -57761 -59344 -60928 -60965 -60999 -61032 -61066 -60298 -59531 -58763 -57992 -57135 -56278 -55421 -54561 -54080 -53599 -54549 -55496 -55134 -54773
-3697e4773L61L66o41o41k072k067r99r98r99r95L666L667K235K239J133J132j251j249j833
$$ -54773 -54412 -54046 -54687 -55328 -57400 -59467 -60466 -61464 -62463 -63458 -59792 -56125 -53890 -51651 -50518 -49386 -50637 -51886 -53719
-3678e3719j833J506J508j356j356J028J032j341j341J043J047J19J20J19J23j129j129k560
$$ -53719 -55552 -54046 -52538 -53894 -55250 -54222 -53190 -54531 -55872 -54829 -53782 -53663 -53543 -53424 -53301 -54430 -55559 -58119
-3660e8119k559J52J53K537K538M8M9l290l290j084j085L208L208K385K384%%m17m17m18m17
$$ -58119 -60678 -60526 -60373 -57836 -55298 -55250 -55201 -58491 -61781 -62865 -63950 -60742 -57534 -55149 -52765 -52765 -52765 -53182 -53599 -54017 -54434
-3639e4434n22n21n22n21l741l741j356j356J38J41K523K526R72R76R73R76l09l06l09l06
$$ -54434 -54956 -55477 -55999 -56520 -60261 -64002 -65358 -66714 -66576 -66435 -63912 -61386 -60414 -59438 -58465 -57489 -57798 -58104 -58413 -58719
-3619e8719P64P68P64P67P08P12P07P12J870J874M40M43j035j032j036j032j185j181J975
$$ -58719 -57955 -57187 -56423 -55656 -54948 -54236 -53529 -52817 -50947 -49073 -48633 -48190 -49225 -50257 -51293 -52325 -53510 -54691 -52716
-3600e2716J978L189L28j401j397m143m143k712k709K049K049j56j53k958r7K586K589j975
$$ -52716 -50738 -47549 -47221 -48622 -50019 -54162 -58305 -61017 -63726 -61677 -59628 -59784 -59937 -62895 -62992 -60406 -57817 -59792
-3582e9792j974M10M13O48O49j27k984j148j147J058J062k459k459Q79Q83N85N88L745L748
$$ -59792 -61766 -61356 -60943 -60295 -59646 -59773 -62757 -63905 -65052 -63994 -62932 -65391 -67850 -66971 -66088 -65503 -64915 -61170 -57422
-3563e7422J360j498k932o7j740j736Q23Q27J122J125L804r61j655j650j774j769l085k20
$$ -57422 -56062 -57560 -60492 -60559 -62299 -64035 -63212 -62385 -61263 -60138 -56334 -57295 -58950 -60600 -62374 -64143 -67228 -67448
-3545f7448N51N56K399K403J624j233L294L297J386j472j717j718m65m62j032j033P57k102
$$ -67448 -66897 -66341 -63942 -61539 -59915 -61148 -57854 -54557 -53171 -54643 -56360 -58078 -58543 -59005 -60037 -61070 -60313 -62415
-3527f2415r72J889O002L145p8p9k57k53J367J368J546j312l31l32K828K832p9p8o74l532
$$ -62415 -63387 -61498 -55496 -52351 -52429 -52508 -52765 -53018 -51651 -50283 -48737 -50049 -50380 -50712 -47884 -45052 -45131 -45209 -45883 -49415
-3507d9415j003J860P0P5q76q71L118K61J67J72k396k392l98l95r95l853J032L898J926J930
$$ -49415 -50418 -48558 -48488 -48413 -49289 -50160 -47042 -46781 -46614 -46442 -48838 -51230 -51628 -52023 -53018 -56871 -55839 -51941 -50015 -48085
-3487d8085P30k131n22n21K23K24K23K24p34p34Q75Q76k791P1O67O67J796j066q86q87L05
$$ -48085 -47355 -49486 -50008 -50529 -50306 -50082 -49859 -49635 -50369 -51103 -50228 -49352 -52143 -52072 -51405 -50738 -48942 -50008 -50894 -51781 -51476
-3466e1476L06J915r46k284k284k463k463j97j98j449j449j185J680K452K455m69m66R61R65
$$ -51476 -51170 -49255 -50201 -52485 -54769 -57232 -59695 -59892 -60090 -61539 -62988 -64173 -62493 -60041 -57586 -58055 -58521 -57560 -56595
-3447e6595k869k865j319J546K586k72Q2Q6K027K026M18L278O0O0j550J311J79k683M173M173
$$ -56595 -59464 -62329 -63648 -62102 -59516 -59788 -59706 -59620 -57593 -55567 -55149 -51871 -51811 -51751 -53301 -51990 -51811 -54494 -50321 -46148
-3427d6148K564k99k980k981j021j021j020j021Q2Q2J691j170j609j610j788j788l518l517
$$ -46148 -43584 -43883 -46863 -49844 -50865 -51886 -52906 -53927 -53845 -53763 -52072 -53242 -54851 -56461 -58249 -60037 -63555 -67072
-3409f7072j79j78J963J967M352M352J907J908M77M77P41P45o85o86j79j79%k861N63N66j222
$$ -67072 -67251 -67429 -65466 -63499 -59147 -54795 -52888 -50980 -50503 -50026 -49285 -48540 -49225 -49911 -50090 -50269 -50269 -53130 -52567 -52001 -53223
-3388e3223J639J193J192j014j013j45j42J110l658l421l420N74N74j003r98n22K340M423
$$ -53223 -51584 -50391 -49199 -50213 -51226 -51371 -51513 -50403 -54061 -57482 -60902 -60328 -59754 -60757 -61755 -62277 -59937 -55514
-3370e5514l43k549K221J397J401R24j937k180k176L0L0K75K80J710J710J885J889m95m96
$$ -55514 -55857 -58406 -56185 -54788 -53387 -52463 -54400 -56580 -58756 -58726 -58696 -58421 -58141 -56431 -54721 -52836 -50947 -51442 -51938
-3351e1938l196l193j763j762L20L25J754J755K210K213M419M418K690j71k854k854j90j86
$$ -51938 -55134 -58327 -60090 -61852 -61532 -61207 -59453 -57698 -55488 -53275 -48856 -44438 -41748 -41919 -44773 -47627 -47817 -48003
-3333d8003j617j617k154k153k511L50K828l0L28L28K68K68J878r84j427j423j602j602K16
$$ -48003 -49620 -51237 -53391 -55544 -58055 -57705 -54877 -54907 -54579 -54251 -53983 -53715 -51837 -52821 -54248 -55671 -57273 -58875 -58659
-3314e8659K16L95L95j841J021K094M959L435L436q57q54R24j937l189l24r24J937L28L31
$$ -58659 -58443 -58048 -57653 -59494 -58473 -56379 -51420 -47985 -44549 -45406 -46260 -45336 -47273 -50462 -50786 -51710 -49773 -49445 -49114
-3295d9114L022J60J60L026J233J233L797L800N734N734M899J35n414q275o188l324k440k437
$$ -49114 -46092 -45932 -45772 -42746 -41513 -40280 -36483 -32683 -26949 -21215 -16316 -16181 -21595 -29870 -36058 -39382 -41822 -44259
-3277d4259l692l689k738k735J554J557o22o18j874j871Q38L704N40k317j662J203n88n85
$$ -44259 -47951 -51640 -54378 -57113 -55559 -54002 -54624 -55242 -57116 -58987 -58149 -54445 -53905 -56222 -57884 -56681 -57269 -57854
-3259e7854n89n85k31l088l95K470O78O82k46k42J11M885L863r05k217k213p86p86l09K556
$$ -57854 -58443 -59028 -59259 -62347 -62742 -60272 -59594 -58912 -59158 -59400 -59289 -54404 -50541 -51446 -53663 -55876 -56662 -57448 -57757 -55201
-3239e5201M191n77n78K288J8K880L655L659K876J5Q50k009l353l353l532l528k981k980n97
$$ -55201 -51010 -51587 -52165 -49877 -49859 -46979 -43324 -39665 -36789 -36774 -35924 -37933 -41286 -44639 -48171 -51699 -54680 -57660 -58257
-3220e8257n92R54R54j252j248L39L200L201L39p34p34j38K723n40n40l62l61k507k508p79
$$ -58257 -58849 -57895 -56941 -58193 -59441 -59102 -55902 -52701 -52362 -53096 -53830 -53968 -51245 -51785 -52325 -52687 -53048 -55555 -58063 -58842
-3200e8842K083J140J140J319J319N74N74k3k883o86K176q64q65o26K236q05q05l69l65K973
$$ -58842 -56759 -55619 -54479 -53160 -51841 -51267 -50693 -50716 -53599 -54285 -52109 -52973 -53838 -54464 -52228 -53033 -53838 -54207 -54572 -51599
-3180e1599K974l69l65j975Q87j256j252j073j073l3l0J49J49k772R3J643J643R0k769r80
$$ -51599 -48625 -48994 -49359 -51334 -50447 -51703 -52955 -54028 -55101 -55134 -55164 -55015 -54866 -57638 -57545 -55902 -54259 -54169 -56938 -57918
-3160e7918r79j066J800L409N47k60K604K425m36n36n33n33n32k355N10L32L31J87J90j599
$$ -57918 -58897 -59963 -58163 -54754 -54207 -54467 -51863 -49438 -49874 -50410 -50943 -51476 -52008 -54363 -53853 -53521 -53190 -53003 -52813 -54412
-3140e4412J263K392m65k016k016J27J30J31J30N14N18j866j867l197l193M44L305P67P71
$$ -54412 -53149 -50757 -51222 -53238 -55254 -55127 -54997 -54866 -54736 -54222 -53704 -55570 -57437 -60634 -63827 -63383 -60078 -59311 -58540
-3121e8540R50R50J323J323J680j181l625p64k552k552j912j911l61K500O047L185J636J635
$$ -58540 -57590 -56640 -55317 -53994 -52314 -53495 -57120 -57884 -60436 -62988 -64900 -66811 -67172 -64672 -58625 -55440 -53804 -52169
-3103e2169j468j468l7l7J036J035J215j647l196l197k601K61j27j26K31K31j87K679j82j83
$$ -52169 -53637 -55105 -55142 -55179 -54143 -53108 -51893 -53540 -56736 -59933 -62534 -62273 -62400 -62526 -62295 -62064 -62251 -59572 -59754 -59937
-3083e9937m419j553p79p79J57J60j449J412K123K128K306K306K888K891J461J460l91l88
$$ -59937 -64356 -65909 -66688 -67467 -67310 -67150 -68599 -67187 -65064 -62936 -60630 -58324 -55436 -52545 -51084 -49624 -50015 -50403
-3065e0403l87l88m8m5k429k429k582k578r69r69J692M556J696J695j584J278n10n11j229
$$ -50403 -50790 -51178 -51226 -51271 -53700 -56129 -58711 -61289 -62258 -63227 -61535 -56979 -55283 -53588 -55172 -53894 -54404 -54915 -56144
-3046e6144m087m087j226P71P71R50R50L88L91j814j815k082P78K508K507j147j144K87K87
$$ -56144 -60231 -64318 -65544 -64773 -64002 -63052 -62102 -61714 -61323 -63137 -64952 -67034 -66256 -63748 -61241 -62388 -63532 -63245 -62958
-3027f2958K641K642J866r95P98P97O19O18j408j409j229j230k511L50J126J125q42q42o7
$$ -62958 -60317 -57675 -55809 -56804 -56006 -55209 -54590 -53972 -55380 -56789 -58018 -59248 -61759 -61409 -60283 -59158 -60000 -60842 -60909
-3008f0909K794K262K261Q31L692N33N33P11P12N63N62k12l074l640l640l62K500r38l801
$$ -60909 -58115 -55853 -53592 -52761 -49069 -48536 -48003 -47292 -46580 -46017 -45455 -45667 -48741 -52381 -56021 -56383 -53883 -54821 -58622
-2989e8622n81n77j357j352J028J032m32m32L43L208L889L894k131k128j19j16k94k94J106
$$ -58622 -59203 -59780 -61137 -62489 -61461 -60429 -60861 -61293 -60950 -57742 -53853 -49959 -52090 -54218 -54337 -54453 -54747 -55041 -53935
-2970e3935j755j754J106Q65Q68n63K299k05k05k05K657R42R43l171l167k455k455r06J960
$$ -53935 -55690 -57444 -56338 -55473 -54605 -55168 -52869 -53074 -53279 -53484 -50827 -49885 -48942 -52113 -55280 -57735 -60190 -61096 -59136
-2951e9136J107j755j099j096n32M236J732J736o07K258M642J781m28m25J781J781j598j595
$$ -59136 -58029 -59784 -60883 -61979 -62511 -58275 -56543 -54807 -55414 -53156 -48514 -46733 -47161 -47586 -45805 -44024 -45622 -47217
-2933d7217j595j594j539j535j535j535J416J415j4j2M33M32M32M36p68p67n89n85p97K064
$$ -47217 -48812 -50406 -51945 -53480 -55015 -56550 -55134 -53719 -53733 -53745 -53312 -52880 -52448 -52012 -52780 -53547 -54136 -54721 -55518 -53454
-2913e3454M54M59K23K24J654J658q49q50k280k277r91r91k600K64j527j528j349j345P23
$$ -53454 -53000 -52541 -52318 -52094 -50440 -48782 -49631 -50481 -52761 -55038 -56029 -57020 -59620 -59356 -60883 -62411 -63760 -65105 -64382
-2894f4382P23p08p04j304j304j602L171K83K83N81N85M575M575K012K016p53l614l614p48
$$ -64382 -63659 -64367 -65071 -66375 -67679 -69281 -66110 -65827 -65544 -64963 -64378 -59803 -55228 -53216 -51200 -51953 -55567 -59181 -59929
-2875e9929n15n14l35l32J088J088j64j60k24K638J029J032K72K72j159j155j159j158K72
$$ -59929 -60444 -60958 -61293 -61625 -60537 -59449 -59613 -59773 -59997 -57359 -56330 -55298 -55026 -54754 -55913 -57068 -58227 -59385 -59113
-2856e9113K75R06R05R05R09M88M89r43r39J330J330J330J334J122J121l09l06k20k19K164
$$ -59113 -58838 -57932 -57027 -56122 -55213 -54725 -54236 -55179 -56118 -54788 -53458 -52128 -50794 -49672 -48551 -48860 -49166 -49386 -49605 -47441
-2836d7441K169K27K27j561J304J531j326r72r69O67O71q83l741m847j982j390j386J352J356
$$ -47441 -45272 -45045 -44818 -46379 -45075 -43544 -44870 -45842 -46811 -46144 -45473 -46356 -50097 -54944 -56926 -58316 -59702 -58350 -56994
-2817e6994R95L860K508l51r50r46k321k318O4O7k157k154K135K139J419J423O45k213J974
$$ -56994 -55999 -52139 -49631 -49982 -50932 -51878 -54199 -56517 -56453 -56386 -58543 -60697 -58562 -56423 -55004 -53581 -52936 -55149 -53175
-2798e3175J975j542j543K511K511j780j781k266k265K027K027o56o56o56o55J147J148J147
$$ -53175 -51200 -52742 -54285 -51774 -49263 -51043 -52824 -55090 -57355 -55328 -53301 -53957 -54613 -55269 -55924 -54777 -53629 -52482
-2780e2482J148k53k54k53k54l748l748j363j364K511K511R02R02K563k98J132J133J461j401
$$ -52482 -51334 -51587 -51841 -52094 -52348 -56096 -59844 -61207 -62571 -60060 -57549 -56647 -55745 -53182 -53480 -52348 -51215 -49754 -51155
-2761e1155j997j997l413n51K23K24J922J923J93k667J121J122J121J122l678q16K701j60
$$ -51155 -53152 -55149 -58562 -59113 -58890 -58666 -56744 -54821 -54628 -57295 -56174 -55052 -53931 -52809 -56487 -57303 -54602 -54762
-2743e4762j248J613K031K030n5k918J23J23p30p30P00P01J356J356J535j326r10r09J118
$$ -54762 -56010 -54397 -52366 -50336 -50391 -53309 -53186 -53063 -53793 -54523 -53823 -53122 -51766 -50410 -48875 -50201 -51111 -52020 -50902
-2724e0902J118p90l651k519n380k522K246K724K723J174J174l77l237k865mK500K500R20
$$ -50902 -49784 -50574 -54225 -56744 -62124 -64646 -62400 -59676 -56953 -55779 -54605 -54982 -58219 -61084 -61088 -58588 -56088 -55168
-2706e5168R20R21R20N21N22k638k634k787P5J624J628J655j208j028j024n52n51p31p26L122
$$ -55168 -54248 -53327 -52407 -51886 -51364 -54002 -56636 -59423 -59348 -57724 -56096 -54441 -55649 -56677 -57701 -58253 -58804 -59535 -60261 -57139
-2686e7139K61Q2K947J721j140O49O52J915J915j424j419j42j41j42j38j427j423j244j245
$$ -57139 -56878 -56796 -53849 -52128 -53268 -52619 -51967 -50052 -48137 -49561 -50980 -51122 -51263 -51405 -51543 -52970 -54393 -55637 -56882
-2667e6882L62L226J796j066j397j393j42j41k292k287q57q57J434J438QPO60O63k377M84
$$ -56882 -56520 -53294 -51498 -52564 -53961 -55354 -55496 -55637 -57929 -60216 -61073 -61930 -60496 -59058 -59050 -59043 -58383 -57720 -60097 -59613
-2647e9613K448K452K46K45L402L405q86q87n55n55k761k757m311j449K187K191p12p12J673
$$ -59613 -57165 -54713 -54467 -54222 -50820 -47415 -48301 -49188 -49743 -50298 -53059 -55816 -60127 -61576 -59389 -57198 -57910 -58622 -56949
-2628e6949J677L91L91K13K16L543O82l92l248j047j047K6L0J546j315K94K98K05K05L84L87
$$ -56949 -55272 -54881 -54490 -54277 -54061 -50518 -49836 -50228 -53476 -54523 -55570 -55544 -55514 -53968 -55283 -54989 -54691 -54486 -54281 -53897 -53510
-2607e3510J57L017K839j8J438j423j602J263j893j893O71O74j654j654j654j651Q9R0J520
$$ -53510 -53353 -50336 -47497 -47515 -46077 -47500 -49102 -47839 -49732 -51625 -50954 -50280 -51934 -53588 -55242 -56893 -56804 -56714 -55194
-2588e5194J524j49j49J460j397M32M33K637K642J863J863J088j770k146k146k146k146l547
$$ -55194 -53670 -53819 -53968 -52508 -53905 -53473 -53040 -50403 -47761 -45898 -44035 -42947 -44717 -46863 -49009 -51155 -53301 -56848
-2570e6848o86R0Q9J207J207k23k24J058J059J058J058K965K966j326j327J893J893j625j624
$$ -56848 -57534 -57444 -57355 -56148 -54941 -55164 -55388 -54330 -53271 -52213 -51155 -48190 -45224 -46550 -47877 -45984 -44091 -45716 -47340
-2551d7340q35l696k086k086l58l58J848J848K224o33R72R77P63P68k575k570k590k585P48
$$ -47340 -48175 -51871 -53957 -56043 -56401 -56759 -54911 -53063 -50839 -51472 -50500 -49523 -48760 -47992 -50567 -53137 -55727 -58312 -57564
-2532e7564P53O89O93O90O93p72p67p71p68J882J885J881J886J75J79j256j252l61l58n40
$$ -57564 -56811 -56122 -55429 -54739 -54046 -54818 -55585 -56356 -57124 -55242 -53357 -51476 -49590 -49415 -49236 -50492 -51744 -52105 -52463 -53003
-2512e3003n37K944Q2m211j345p22p23n44n40j669j670j669j665l0l0K176K180J997q65q64
$$ -53003 -53540 -50596 -50514 -54725 -56070 -56792 -57515 -58059 -58599 -60268 -61938 -63607 -65272 -65302 -65332 -63156 -60976 -58979 -59844 -60708
-2492f0708K001j461j460j282j278j557j558L391N33M39M40K049q09j166J699k68k68P41k116
$$ -60708 -58707 -60168 -61628 -62910 -64188 -65745 -67303 -63912 -63379 -62940 -62500 -60451 -61260 -62426 -60727 -60995 -61263 -60522 -62638
-2473f2638o86K176L193L197K601k61o22o19R91j870k649K16j572j573J822J826J647J646
$$ -62638 -63324 -61148 -57955 -54758 -52157 -52418 -53040 -53659 -52668 -54538 -57187 -56971 -58543 -60116 -58294 -56468 -54821 -53175
-2455e3175M66k392k392M70P63P68K556l06p11p12q90q91J83J82j248j248n92n93k023k023
$$ -53175 -52709 -55101 -57493 -57023 -56260 -55492 -52936 -53242 -53953 -54665 -55555 -56446 -56263 -56081 -57329 -58577 -59169 -59762 -61785 -63808
-2435f3808J762J763L31L32K53K57K54K57p60p57p60p56p75p71J609J613R0R3j341j338p37
$$ -63808 -62046 -60283 -59952 -59620 -59367 -59110 -58856 -58599 -59359 -60116 -60876 -61632 -62407 -63178 -61569 -59956 -59866 -59773 -61114 -62452 -63189
-2414f3189p34O96O97k2j9J412J412m69m66j896j897J349J352J353J352J017J021K452K451
$$ -63189 -63923 -63227 -62530 -62552 -62571 -61159 -59747 -60216 -60682 -62578 -64475 -63126 -61774 -60421 -59069 -58052 -57031 -54579 -52128
-2395e2128P49P53o78o78o08o03Q27Q27j859j856j855j855O3O3O4O3O59O60O59O60k35k35
$$ -52128 -51379 -50626 -51304 -51982 -52590 -53193 -52366 -51539 -53398 -55254 -57109 -58964 -58901 -58838 -58774 -58711 -58052 -57392 -56733 -56073 -56308 -56543
-2373e6543k34k35Q38Q38Q39Q38j162j159j163j158Q04Q09o26o22j177j174K53K57K668K671
$$ -56543 -56777 -57012 -56174 -55336 -54497 -53659 -54821 -55980 -57143 -58301 -57497 -56688 -57314 -57936 -59113 -60287 -60034 -59777 -57109 -54438
-2353e4438J237J241j263j263j263j259J330J330j01r7q31q30N99O04j45j46j45j41L040L040
$$ -54438 -53201 -51960 -53223 -54486 -55749 -57008 -55678 -54348 -54449 -54546 -55377 -56207 -55608 -55004 -55149 -55295 -55440 -55581 -52541 -49501
-2333d9501k98k94k474k474J818J822K340K339R09R13p60p60p60p56R3R3R3R7n03n03j934
$$ -49501 -49799 -50093 -52567 -55041 -53223 -51401 -49061 -46722 -45813 -44900 -45660 -46420 -47180 -47936 -47843 -47750 -47657 -47560 -48063 -48566 -50500
-2312e0500j929j271j270J114J117l16l17l17l13k23k24k23k20J147J148j893j889k608K161
$$ -50500 -52429 -53700 -54970 -53856 -52739 -53055 -53372 -53689 -54002 -54225 -54449 -54672 -54892 -53745 -52597 -54490 -56379 -58987 -56826
-2293e6826R09R13o11o11Q20Q23P8P9P8P8N25N26j859j860N11N10J941J941Q39Q38k500k500
$$ -56826 -55917 -55004 -55615 -56226 -55406 -54583 -54505 -54426 -54348 -54270 -53745 -53219 -55078 -56938 -56427 -55917 -53976 -52035 -51196 -50358 -52858 -55358
-2271e5358J53J53J52J53L4L3L4L3j583j584j52j53K261K262k031k030l104l103K34K39K351
$$ -55358 -55205 -55052 -54900 -54747 -54713 -54680 -54646 -54613 -56196 -57780 -57932 -58085 -55824 -53562 -55593 -57623 -60727 -63830 -63596 -63357 -61006
-2250f1006K351R20R24n40n40n41n36K947K947J516J520l550l551P42P45l4l3k418k415J398
$$ -61006 -58655 -57735 -56811 -57351 -57891 -58432 -58968 -56021 -53074 -51558 -50038 -53588 -57139 -56397 -55652 -55686 -55719 -58137 -60552 -59154
-2230e9154J397j941j938N63N62J994J997K116K120j218j219m17m14m13m14p4p1j502j501
$$ -59154 -57757 -59698 -61636 -61073 -60511 -58517 -56520 -54404 -52284 -53502 -54721 -55138 -55552 -55965 -56379 -56453 -56524 -58026 -59527
-2211e9527r99r94j591L178K012k754k813M9K459K463K57K57M4M9M8M9j267j263J68J67N96
$$ -59527 -60526 -61520 -63111 -59933 -57921 -60675 -63488 -63439 -60980 -58517 -58260 -58003 -57959 -57910 -57862 -57813 -59080 -60343 -60175 -60008 -59412
-2190e9412O00N96O00j341j338j341j337O70O75O70O75O70O75O70O75P37P42P37P42P38P41
$$ -59412 -58812 -58216 -57616 -58957 -60295 -61636 -62973 -62303 -61628 -60958 -60283 -59613 -58938 -58268 -57593 -56856 -56114 -55377 -54635 -53897 -53156
-2169e3156P38P41J57J60J56J61k586k582k586k582M96M99M96M99j830j825J509J512k19k16
$$ -53156 -52418 -51677 -51520 -51360 -51204 -51043 -53629 -56211 -58797 -61379 -60883 -60384 -59888 -59389 -61219 -63044 -61535 -60023 -60242 -60458
-2149f0458K164K169o08o03o08o03j293j289J092J095J002J006m28m25J419J424K552K556
$$ -60458 -58294 -56125 -56733 -57336 -57944 -58547 -59840 -61129 -60037 -58942 -57940 -56934 -57362 -57787 -56368 -54944 -52392 -49836
-2131d9836M757pk276N88k265k262K99L01j639j636j639j636j862j860J476J479p01o96P30
$$ -49836 -45079 -45086 -47362 -46774 -49039 -51301 -51002 -50701 -52340 -53976 -55615 -57251 -59113 -60973 -59497 -58018 -58719 -59415 -58685
-2112e8685P34K213K217P82P86K76K80K75K80J870J874M40M43r31r28r31r28J088J088j297
$$ -58685 -57951 -55738 -53521 -52739 -51953 -51677 -51397 -51122 -50842 -48972 -47098 -46658 -46215 -47146 -48074 -49005 -49933 -48845 -47757 -49054
-2092d9054j293j356j356j654L118M17M18P15P19j997j997J341J345j833j833m02l99j594
$$ -49054 -50347 -51703 -53059 -54713 -51595 -51178 -50760 -50045 -49326 -51323 -53320 -51979 -50634 -52467 -54300 -54702 -55101 -56695
-2074e6695j595P90P93M85M84r46r43j870j871J468J472m81m80m81m77N63N62N63N66n18n17
$$ -56695 -58290 -57500 -56707 -56222 -55738 -56684 -57627 -59497 -61368 -59900 -58428 -58909 -59389 -59870 -60347 -59784 -59222 -58659 -58093 -58611 -59128
-2053e9128n18n14J181J181K611K616O89O89O90O93k023k023J315J319k843k843m58m55j352
$$ -59128 -59646 -60160 -58979 -57798 -55187 -52571 -51882 -51193 -50503 -49810 -51833 -53856 -52541 -51222 -54065 -56908 -57366 -57821 -59173
-2034e9173j353J032J036J826J829j512j509k437k433R02R05k91k86k91k87n29n25R01R06
$$ -59173 -60526 -59494 -58458 -56632 -54803 -56315 -57824 -60261 -62694 -61792 -60887 -61178 -61464 -61755 -62042 -62571 -63096 -62195 -61289
-2015f1289j12j08j12j08J56J61K541K544K199K202k094k091k183k179K01K05K12K16K13K16
$$ -61289 -61401 -61509 -61621 -61729 -61573 -61412 -58871 -56327 -54128 -51926 -54020 -56111 -58294 -60473 -60272 -60067 -59855 -59639 -59426 -59210
-1995e9210p12p08p12p07L76L80L76L80J748J751L178L182l253l249q68q64k597k593J695
$$ -59210 -59922 -60630 -61342 -62049 -61673 -61293 -60917 -60537 -58789 -57038 -53860 -50678 -53931 -57180 -58048 -58912 -61509 -64102 -62407
-1976f2407J699L036L041J605J610j405j401j404j401M62M62J893J892j266j267j267j267
$$ -62407 -60708 -57672 -54631 -53026 -51416 -52821 -54222 -55626 -57027 -56565 -56103 -54210 -52318 -53584 -54851 -56118 -57385
-1959e7385n9o0j490j491k38k38j670j669l95l91l95l91J632J635K02K05J654J658J654J658
$$ -57385 -57444 -57504 -58994 -60485 -60723 -60961 -62631 -64300 -64695 -65086 -65481 -65872 -64240 -62605 -62403 -62198 -60544 -58886 -57232 -55574
-1939e5574j535j531J803J807p86p86O44O49p87p86J599J602K313K314j025j020o67o67o67
$$ -55574 -57109 -58640 -56837 -55030 -55816 -56602 -55958 -55309 -56096 -56882 -55283 -53681 -51368 -49054 -50079 -51099 -51766 -52433 -53100
-1920e3100o63q31q27q27q28K43K46j185j185J606J609J79J79J546J550k742k742J539J542
$$ -53100 -53763 -54594 -55421 -56248 -57076 -56833 -56587 -57772 -58957 -57351 -55742 -55563 -55384 -53838 -52288 -55030 -57772 -56233 -54691
-1901e4691J12J12j830j825l95l95J270J274J275J274j174j170j170j169j368j363O7O7L252
$$ -54691 -54579 -54467 -56297 -58122 -58517 -58912 -57642 -56368 -55093 -53819 -54993 -56163 -57333 -58502 -59870 -61233 -61166 -61099 -57847
-1882e7847L257j036j036O37O41p90p90M59M62M62M62n67n62n63n63j013j010M21M21m02l99
$$ -57847 -54590 -55626 -56662 -56025 -55384 -56174 -56964 -56505 -56043 -55581 -55119 -55686 -56248 -56811 -57374 -58387 -59397 -58976 -58555 -58957 -59356
-1861e9356l98l99J148J151J151J151J584J587j751j751N70N74q57q57K693K698K697K698
$$ -59356 -59754 -60153 -59005 -57854 -56703 -55552 -53968 -52381 -54132 -55883 -55313 -54739 -55596 -56453 -53760 -51062 -48365 -45667
-1843d5667j360j356j356j357k31k31J200J200J199J200J200J200k02k01J230J229k675k675
$$ -45667 -47027 -48383 -49739 -51096 -51327 -51558 -50358 -49158 -47959 -46759 -45559 -44359 -44561 -44762 -43532 -42303 -44978 -47653
-1825d7653k675k675l02l02l02l01M13M14M13M14j137j136j136j137P72P71o60o59j98j93
$$ -47653 -50328 -53003 -53305 -53607 -53909 -54210 -53797 -53383 -52970 -52556 -53693 -54829 -55965 -57102 -56330 -55559 -56219 -56878 -57076 -57269
-1805e7269j625j624k761k757K489K489K239K243Q12Q12j367j364j363j364K779K784n56n55
$$ -57269 -58894 -60518 -63279 -66036 -63547 -61058 -58819 -56576 -55764 -54952 -56319 -57683 -59046 -60410 -57631 -54847 -55403 -55958
-1787e5958R61R65R65R65Q13Q16Q16Q15j631j629P57P56j256j251J78J79j643j639k09k08
$$ -55958 -54997 -54032 -53067 -52102 -51289 -50473 -49657 -48842 -50473 -52102 -51345 -50589 -51845 -53096 -52918 -52739 -54382 -56021 -56230 -56438
-1767e6438J15J19J20J19k031k027k026k027J557J561J31J30L614L618j628j629l35l31J099
$$ -56438 -56323 -56204 -56084 -55965 -57996 -60023 -62049 -64076 -62519 -60958 -60827 -60697 -57083 -53465 -55093 -56722 -57057 -57388 -56289
-1748e6289J099L20L24L24L25j16j15j16j12J435J434r50r46j464j465J874J878r3r3k478
$$ -56289 -55190 -54870 -54546 -54222 -53897 -54013 -54128 -54244 -54356 -52921 -51487 -52437 -53383 -54847 -56312 -54438 -52560 -52653 -52746 -55224
-1728e5224k474N70N70q60q57K418K418K418K422k50k50k49k46k843k843M96M99p79p78p79
$$ -55224 -57698 -57128 -56558 -57418 -58275 -55857 -53439 -51021 -48599 -48849 -49099 -49348 -49594 -52437 -55280 -54784 -54285 -55064 -55842 -56621
-1708e6621p79j762j762O22O22j464j464R20R20k72k72k72k72O34O33O33O34q2q2q2q2p45
$$ -56621 -57400 -59162 -60924 -60302 -59680 -61144 -62608 -61688 -60768 -61040 -61312 -61584 -61856 -61222 -60589 -59956 -59322 -59404 -59486 -59568 -59650 -60395
-1686f0395p45p45p46n66n66K474K474J788k981l338m77k891k891O26O26L211L212O073J304
$$ -60395 -61140 -61885 -62631 -63197 -63763 -61289 -58815 -57027 -60008 -63346 -63823 -66714 -69605 -68979 -68353 -65142 -61930 -55857 -54553
-1667e4553j736J125Q27k034M43M43j166j166n70n70K768K768p19p19p19p19J785J784J785
$$ -54553 -56289 -55164 -54337 -56371 -55928 -55485 -56651 -57817 -58387 -58957 -56189 -53421 -54140 -54859 -55578 -56297 -54512 -52728 -50943
-1648e0943J785k198k199J87J90J229J230j155j152J498J498q87q83j781j781J558J561K619
$$ -50943 -49158 -51356 -53555 -53368 -53178 -51949 -50719 -51874 -53026 -51528 -50030 -50917 -51800 -53581 -55362 -53804 -52243 -49624
-1630d9624K619p19p15J367J368J069J073J114l655k582K83o74o75j926j922j670j665P19
$$ -49624 -47005 -47724 -48439 -47072 -45704 -44635 -43562 -42448 -46103 -48685 -48402 -49076 -49751 -51677 -53599 -55269 -56934 -56215
-1612e6215P19J133J136k94k94J117J122J598l171j475J390n18n18j08j04J326J326l46l43
$$ -56215 -55496 -54363 -53227 -53521 -53815 -52698 -51576 -49978 -53149 -54624 -53234 -53752 -54270 -54378 -54482 -53156 -51830 -52176 -52519
-1593e2519j773j774K306K310K310K310j181j177J207J207k455k455j025j024J67J68j263
$$ -52519 -54292 -56066 -53760 -51450 -49140 -46830 -48011 -49188 -47981 -46774 -49229 -51684 -52709 -53733 -53566 -53398 -54661
-1576e4661j263J322J323j062j062J800J799j538j539k83k83J147J148M4M5M5M5M24M25j006
$$ -54661 -55924 -54602 -53279 -54341 -55403 -53603 -51804 -53342 -54881 -55164 -55447 -54300 -53152 -53108 -53063 -53018 -52973 -52549 -52124 -53130
-1556e3130j006K064K064O34O33k522k523J770J774J60J60j271j266r13r13k343K429O97k165
$$ -53130 -54136 -52072 -50008 -49374 -48741 -51263 -53786 -52016 -50242 -50082 -49922 -51193 -52459 -53372 -54285 -56628 -54199 -53502 -55667
-1537e5667k642k638P72P71K202K205j82j83K202K206j047j047k478k473K34K35K35K38K910
$$ -55667 -58309 -60947 -60175 -59404 -57202 -54997 -55179 -55362 -53160 -50954 -52001 -53048 -55526 -57999 -57765 -57530 -57295 -57057 -54147
-1518e4147K910l290l286k068k068K046K049J024j836p05M069N48k314m06m03P34P34P34P38
$$ -54147 -51237 -54527 -57813 -59881 -61949 -59903 -57854 -56830 -58666 -59371 -55302 -54754 -57068 -57474 -57877 -57143 -56409 -55675 -54937
-1499e4937n18n18R13L778L141j628P56L622L39m430j748J118J945J948j210j211j602j599
$$ -54937 -55455 -55973 -55060 -51282 -48141 -49769 -49013 -45391 -45052 -49482 -51230 -50112 -48167 -46219 -47429 -48640 -50242 -51841
-1481e1841j598j599j423j419K872K873J319J322K754K753k809k806k805k806J245J248j136
$$ -51841 -53439 -55038 -56461 -57880 -55008 -52135 -50816 -49494 -46740 -43987 -46796 -49602 -52407 -55213 -53968 -52720 -53856
-1464e3856j137M92M96M95M96P89P94P94P93j177j177K53K53J267J267K697K698j57j56j57
$$ -53856 -54993 -54501 -54005 -53510 -53014 -52225 -51431 -50637 -49844 -51021 -52198 -51945 -51692 -50425 -49158 -46461 -43763 -43920 -44076 -44233
-1444d4233j56j349j349j348j349r3r3j524j524j911j912j911j911J717J718J717J718j382
$$ -44233 -44389 -45738 -47087 -48435 -49784 -49877 -49970 -51494 -53018 -54929 -56841 -58752 -60663 -58946 -57228 -55511 -53793 -55175
-1426e5175j383J181J182M65L331K973j796j382j378P08P07l16l13L025L025k343k340r09
$$ -55175 -56558 -55377 -54195 -53730 -50399 -47426 -49222 -50604 -51982 -51274 -50567 -50883 -51196 -48171 -45146 -47489 -49829 -50738
-1408e0738r09R02R05n25n26j512j509j509j509r39r35J449J449K042K046l39l40p0p1p1o7
$$ -50738 -51647 -50745 -49840 -50365 -50891 -52403 -53912 -55421 -56930 -57869 -58804 -57355 -55906 -53864 -51818 -52157 -52497 -52567 -52638 -52709 -52776
-1387e2776q76q75N55N59j539j539Q46Q50K932K932j360j356j274j274J56J60n2n2n2m9K161
$$ -52776 -53652 -54527 -53972 -53413 -54952 -56491 -55645 -54795 -51863 -48931 -50291 -51647 -52921 -54195 -54039 -53879 -53931 -53983 -54035 -54084 -51923
-1366e1923K161q79q76k548K220L831L833j345j341j341j341k418k415l0k9k95k90k91k91
$$ -51923 -49762 -50641 -51517 -54065 -51845 -48014 -44181 -45526 -46867 -48208 -49549 -51967 -54382 -54412 -54441 -54736 -55026 -55317 -55608
-1347e5608K13K16K16K16K150K153K154K153j367j364k794k794n03n00R32R31L02L06k079
$$ -55608 -55395 -55179 -54963 -54747 -52597 -50444 -48290 -46137 -47504 -48868 -51662 -54456 -54959 -55459 -54527 -53596 -53294 -52988 -55067
-1328e5067k079J110J110J111J110m40m39R91R91L05L06L05L06p98p97k228k228j926j926
$$ -55067 -57146 -56036 -54926 -53815 -52705 -53145 -53584 -52593 -51602 -51297 -50991 -50686 -50380 -51178 -51975 -54203 -56431 -58357 -60283
-1309f0283K365K366N78N77j807j807q90q91K448K448J017J017m13m14J885J886L35k522l272
$$ -60283 -57918 -55552 -54974 -54397 -56204 -58011 -58901 -59792 -57344 -54896 -53879 -52862 -53275 -53689 -51804 -49918 -49583 -52105 -55377
-1290e5377m09J020j836q65J997J997q60l249l88K09K12J204J203m06K459p8p8K485K488J055
$$ -55377 -55786 -54766 -56602 -57467 -55470 -53473 -54333 -57582 -57970 -57761 -57549 -56345 -55142 -55548 -53089 -53167 -53245 -50760 -48272 -47217
-1270d7217J054l76l73J90J90l148l144n18n14n15n14k79k76k064P97K366m92j743J117j8
$$ -47217 -46163 -46539 -46912 -46722 -46532 -49680 -52824 -53342 -53856 -54371 -54885 -55164 -55440 -57504 -56707 -54341 -54833 -56576 -55459 -55477
-1250e5477j5J64J64J207J211r95r95k638K28M698J837j908R58J553J554O26O30q02q01j430
$$ -55477 -55492 -55328 -55164 -53957 -52746 -53741 -54736 -57374 -57146 -52448 -50611 -52519 -51561 -50008 -48454 -47828 -47198 -48000 -48801 -50231
-1230e0231j431j609j610p15l577k146P15K76K76M54M55P52P53l242l80P49P49R28R28P49
$$ -50231 -51662 -53271 -54881 -55596 -59173 -61319 -60604 -60328 -60052 -59598 -59143 -58391 -57638 -60880 -61260 -60511 -59762 -58834 -57906 -57157
-1210e7157P48R28R28m587j725J912J911j278j278k887k6J404J409J583J587J315J319O4O7
$$ -57157 -56409 -55481 -54553 -59140 -60865 -58953 -57042 -58320 -59598 -62485 -62511 -61107 -59698 -58115 -56528 -55213 -53894 -53830 -53763
-1191e3763o37K228M36M39J599j260k694J72L122L126l7l4j378j375j379j374m77m74m470
$$ -53763 -54400 -52172 -51736 -51297 -49698 -50958 -53652 -53480 -50358 -47232 -47269 -47303 -48681 -50056 -51435 -52809 -53286 -53760 -58230
-1172e8230j606K921K924P16P19Q64Q65Q64Q64N67N66N66N67P52P53k3k883K511K511q27q27
$$ -58230 -59836 -56915 -53991 -53275 -52556 -51692 -50827 -49963 -49099 -48532 -47966 -47400 -46833 -46081 -45328 -45351 -48234 -45723 -43212 -44039 -44866
-1151d4866k422M40K168K169r92r91M40M40k318k317j12j12J081j781l331l331m542j680r05
$$ -44866 -47288 -46848 -44680 -42511 -43503 -44494 -44054 -43614 -45932 -48249 -48361 -48473 -47392 -49173 -52504 -55835 -60377 -62057 -62962
-1132f2962J956L357j412j591J270M59M58j151J710J740j122p64p63J233J233j97j98k87k87
$$ -62962 -61006 -57649 -59061 -60652 -59382 -58923 -58465 -59616 -57906 -56166 -57288 -58052 -58815 -57582 -56349 -56546 -56744 -57031 -57318
-1113e7318J323J323p49K112N03N03P71P72P71P71n07n06K354k414q94J967O0N9j795j796
$$ -57318 -55995 -54672 -55421 -53309 -52806 -52303 -51532 -50760 -49989 -49218 -49725 -50231 -47877 -50291 -51185 -49218 -49158 -49099 -50894 -52690
-1093e2690l65l66K020K019J423j438r46J915J27J26r76r76K362K362q42q42k094k093l346
$$ -52690 -53055 -53421 -51401 -49382 -47959 -49397 -50343 -48428 -48301 -48175 -49151 -50127 -47765 -45403 -46245 -47087 -49181 -51274 -54620
-1074e4620m85J245J244J520J524J699j159%Mj79j75k399k396r69r65K161K165m5m1k000Q64
$$ -54620 -55105 -53860 -52616 -51096 -49572 -47873 -49032 -49032 -49028 -49207 -49382 -51781 -54177 -55146 -56111 -53950 -51785 -51830 -51871 -53871 -53007
-1053e3007N03N07K023q35M14L278N33k325n40n36l62l57J248j610q75q76L76L80n47n48Q83
$$ -53007 -52504 -51997 -49974 -50809 -50395 -47117 -46584 -48909 -49449 -49985 -50347 -50704 -49456 -51066 -51941 -52817 -52441 -52061 -52608 -53156 -52273
-1032e2273Q87n63n62Q68Q71j456j457J881J886l88l87j818j815P15P16P15P19J446J445k846
$$ -52273 -51386 -51949 -52511 -51643 -50772 -52228 -53685 -51804 -49918 -50306 -50693 -52511 -54326 -53611 -52895 -52180 -51461 -50015 -48570 -51416
-1012e1416k843P60P60L145L148K42K46l092l093m73m69m70m69R28R31R32R31j189j184K46
$$ -51416 -54259 -53499 -52739 -49594 -46446 -46204 -45958 -49050 -52143 -52616 -53085 -53555 -54024 -53096 -52165 -51233 -50302 -51491 -52675 -52429
-992e2429K45p71p67p68p67j278j274j275j274n33n29n29n29K329K332j662j661k549K225
$$ -52429 -52184 -52955 -53722 -54490 -55257 -56535 -57809 -59084 -60358 -60891 -61420 -61949 -62478 -60149 -57817 -59479 -61140 -63689 -61464
-973f1464K578k80J148J151R69R72l7l4l7l3k46k42k46k42R01R06k437k433R02R05R02R05
$$ -61464 -58886 -59166 -58018 -56867 -55898 -54926 -54963 -54997 -55034 -55067 -55313 -55555 -55801 -56043 -55142 -54236 -56673 -59106 -58204 -57299 -56397 -55492
-951e5492r69r65J416J420Q79Q83Q79Q83O37O37j747m605q53L916K663j93k008k009p56p53
$$ -55492 -56461 -57426 -56010 -54590 -53711 -52828 -51949 -51066 -50429 -49792 -51539 -56144 -56997 -53081 -50418 -50611 -52619 -54628 -55384 -56137
-931e6137J122J121l09l05L31L32J762J766J673J673K42K46O22O22O22O26j881j882j881j878
$$ -56137 -55015 -53894 -54203 -54508 -54177 -53845 -52083 -50317 -48644 -46971 -46729 -46483 -45861 -45239 -44617 -43991 -45872 -47754 -49635 -51513
-911e1513o0n5m14K448%k858j069j069J654J658K27K27J446J449p56p56k594K72K657k05O86
$$ -51513 -51573 -51628 -52042 -49594 -49594 -52452 -53521 -54590 -52936 -51278 -51051 -50824 -49378 -47929 -48685 -49441 -52035 -51763 -49106 -49311 -48625
-890d8625O89O89O89k064Q01q08q09n14n10R20R20j531j531j01j01p26p27n47n48j785J077
$$ -48625 -47936 -47247 -46558 -48622 -47821 -48629 -49438 -49952 -50462 -49542 -48622 -50153 -51684 -51785 -51886 -52612 -53339 -53886 -54434 -56219 -55142
-869e5142Q98Q98o82o82N70N70K679j82r58r57N62N63N62N63N70N70j039j040O89k172n62
$$ -55142 -54244 -53346 -54028 -54710 -54140 -53570 -50891 -51073 -52031 -52988 -52426 -51863 -51301 -50738 -50168 -49598 -50637 -51677 -50988 -53160 -53722
-848e3722n63J129J129J486j374j405J457j762j763J584J583J762j099J226J226j338j337
$$ -53722 -54285 -53156 -52027 -50541 -51915 -53320 -51863 -53625 -55388 -53804 -52221 -50459 -51558 -50332 -49106 -50444 -51781
-831e1781k098k094J062J066N55k303o96o93K038K041O08O11J054J058J055J058j271j267
$$ -51781 -53879 -55973 -54911 -53845 -53290 -55593 -56289 -56982 -54944 -52903 -52295 -51684 -50630 -49572 -48517 -47459 -48730 -49997
-813d9997j270j267j211j207J293M158K709j49j524j520k776Q9r3q9N81N85k757k753J654
$$ -49997 -51267 -52534 -53745 -54952 -53659 -49501 -46792 -46941 -48465 -49985 -52761 -52672 -52765 -52854 -52273 -51688 -54445 -57198 -55544
-794e5544J658K23K28j446j442J64J68m03K463M844J985n88n85p64p64M55M58r72r73N2N6
$$ -55544 -53886 -53663 -53435 -54881 -56323 -56159 -55991 -56394 -53931 -49087 -47102 -47690 -48275 -49039 -49803 -49348 -48890 -49862 -50835 -50783 -50727
-773e0727j375j374r32r28J457J457R61R61R62R65j006j006j006j002j222j223J163J166j79
$$ -50727 -52102 -53476 -54408 -55336 -53879 -52422 -51461 -50500 -49538 -48573 -49579 -50585 -51591 -52593 -53815 -55038 -53875 -52709 -52888
-754e2888j79j78j76N48N52N51N51l327l323O11O11O293N74k407k407k619k616k31k31K388
$$ -52888 -53067 -53245 -53421 -52873 -52321 -51770 -51219 -54546 -57869 -57258 -56647 -50354 -49780 -52187 -54594 -57213 -59829 -60060 -60291 -57903
-734e7903K392K392K392k321k317J020J021J003J006J005J006n77n74n74n73K23K24K23K28
$$ -57903 -55511 -53119 -50727 -53048 -55365 -54345 -53324 -52321 -51315 -50310 -49304 -49881 -50455 -51029 -51602 -51379 -51155 -50932 -50704
-715e0704j416j412J5J8K578K579K578K582j505j502Q79Q83j30j30j561j558k992k988L47
$$ -50704 -52120 -53532 -53517 -53499 -50921 -48342 -45764 -43182 -44687 -46189 -45310 -44427 -44557 -44687 -46248 -47806 -50798 -53786 -53439
-696e3439L50J777J777o07o03k396k392j1qJ330J334k008k004J091J096J091J096n6n2n6n2
$$ -53439 -53089 -51312 -49535 -50142 -50745 -53141 -55533 -55544 -55552 -54222 -52888 -54896 -56900 -55809 -54713 -53622 -52526 -52582 -52634 -52690 -52742
-675e2742O3O7j367j364p27p22J658J661M96M99M96M99N33N36q98q94r3q9r4q9l95l91l95
$$ -52742 -52679 -52612 -53979 -55343 -56070 -56792 -55134 -53473 -52977 -52478 -51982 -51483 -50950 -50414 -51312 -52206 -52299 -52388 -52482 -52571 -52966 -53357 -53752
-652e3752l91j498j494K798K798N51N56N51N55j505j502P05P04L237L80k008Q57O15O18m54
$$ -53752 -54143 -55641 -57135 -54337 -51539 -50988 -50432 -49881 -49326 -50831 -52333 -51628 -50924 -47687 -47307 -49315 -48458 -47843 -47225 -47679
-632d7679m55j97K668j331j326L09L13L13L13K020K023l62l61R80R80R79R80K802K806J374
$$ -47679 -48134 -48331 -45663 -46994 -48320 -48011 -47698 -47385 -47072 -45052 -43029 -43391 -43752 -42772 -41792 -40813 -39833 -37031 -34225 -32851
-612c2851M237N249Q111J6337K4921L4441M4937N4951L4922j1755m5138n0979l8581k4038
$$ -32851 -28614 -23365 -15254 1083 26004 60445 105382 160333 195255 183500 138362 87383 48802 24764
-598B4764j9266j4496r728q804m035m035m035j539j539j538j539R35R35M154J293j963Q98
$$ 24764 5498 -8998 -18726 -27530 -31565 -35600 -39635 -41174 -42713 -44251 -45790 -44855 -43920 -39766 -38473 -40436 -39538
-581c9538N40N40P79P79K030k738m736m735n63n62l54K507K507l53j23j23J129J128k149k150
$$ -39538 -38998 -38458 -37679 -36900 -34870 -37608 -42344 -47079 -47642 -48204 -48558 -46051 -43544 -43897 -44020 -44143 -43014 -41886 -44035 -46185
-561d6185l759q98K604K608N81N81J744M605J267j595l684l682j296L472N172N171N291N290
$$ -46185 -49944 -50842 -48238 -45630 -45049 -44468 -42724 -38119 -36852 -38447 -42131 -45813 -47109 -43637 -38465 -33294 -28003 -22713
-543b2713M371J512k422n283l763l763o326o326k366k362r32r31r02r02r01r02j304j304J081
$$ -22713 -18342 -16830 -19252 -24535 -28298 -32061 -38387 -44713 -47079 -49441 -50373 -51304 -52206 -53108 -54009 -54911 -56215 -57519 -56438
-524e6438J084L95L95j990j986J319J319j12j08J289J290J289J292o03o04k034k030j349j349
$$ -56438 -55354 -54959 -54564 -56554 -58540 -57221 -55902 -56014 -56122 -54833 -53543 -52254 -50962 -51565 -52169 -54203 -56233 -57582 -58931
-505e8931Q2Q6Q57Q57j528j524R47R46R46R50Q65Q64M203M206j609j610j79j75M47M47j937
$$ -58931 -58849 -58763 -57906 -57049 -58577 -60101 -59154 -58208 -57262 -56312 -55447 -54583 -50380 -46174 -47783 -49393 -49572 -49747 -49300 -48853 -50790
-484e0790j934J192J193j193j188N14N14J57J60K004l718k109P57o49o48J915J919L226L227
$$ -50790 -52724 -51532 -50339 -51532 -52720 -52206 -51692 -51535 -51375 -49371 -53089 -55198 -54441 -55090 -55738 -53823 -51904 -48678 -45451
-465d5451K153l565Q38Q42M85M84L074L077k168k169l841l838M55M55r80r76r77r76J423J427
$$ -45451 -43298 -46863 -46025 -45183 -44698 -44214 -41140 -38063 -40231 -42400 -46241 -50079 -49624 -49169 -50149 -51125 -52102 -53078 -51655 -50228
-445e0228J427J427j676j673J665J666K98L02k083k083K98L02L02L02r7r7r7r7r7r7Q2Q2m54
$$ -50228 -48801 -47374 -49050 -50723 -49058 -47392 -47094 -46792 -48875 -50958 -50660 -50358 -50056 -49754 -49851 -49948 -50045 -50142 -50239 -50336 -50254 -50172 -50626
-422e0626K407M016j706l853l852Q2Q2J762J762o22o22J643J643K12K13J233J233j151j151
$$ -50626 -48219 -44203 -45909 -49762 -53614 -53532 -53450 -51688 -49926 -50548 -51170 -49527 -47884 -47672 -47459 -46226 -44993 -46144 -47295
-403d7295O07O07j777j777M17M17M18M17q05q05q04q05n22n21n22n21n52n51J058j803n11
$$ -47295 -46688 -46081 -47858 -49635 -49218 -48801 -48383 -47966 -48771 -49576 -50380 -51185 -51707 -52228 -52750 -53271 -53823 -54374 -53316 -55119 -55630
-382e5630n10k13K649M885J15j315j315o3o4J368J367j53j53J457j404j390j386j34j34j088
$$ -55630 -56140 -56353 -53704 -48819 -48704 -50019 -51334 -51397 -51461 -50093 -48726 -48879 -49032 -47575 -48979 -50369 -51755 -51889 -52023 -53111
-362e3111j088O41L502q53q50o70o71M02M03M02M02o26o22L670L670M21M21M21M21j542j539
$$ -53111 -54199 -53558 -50056 -50909 -51759 -52429 -53100 -52698 -52295 -51893 -51491 -52117 -52739 -49069 -45399 -44978 -44557 -44136 -43715 -45257 -46796
-341d6796j360j360j658J204m07m06O0O0N9O0N9O0O0N9Q42Q42Q42Q42K46K46K46K46j054j055
$$ -46796 -48156 -49516 -51174 -49970 -50377 -50783 -50723 -50663 -50604 -50544 -50485 -50425 -50365 -50306 -49464 -48622 -47780 -46938 -46692 -46446 -46200 -45954 -47008 -48063
-317d8063k664J98J091J092J270J271L46L47L46L47k50k49k50k50L84L88K172o86l908j043
$$ -48063 -50727 -50529 -49438 -48346 -47076 -45805 -45459 -45112 -44766 -44419 -44669 -44918 -45168 -45418 -45034 -44646 -42474 -43160 -47068 -48111
-297d8111k832k831Q01Q04Q01Q05K05K09K08K09R76R80R76R80J42J45j285j286j051j046k76
$$ -48111 -50943 -53774 -52973 -52169 -51368 -50563 -50358 -50149 -49941 -49732 -48756 -47776 -46800 -45820 -45678 -45533 -46818 -48104 -49155 -50201 -50477
-276e0477K589K169K172k239n101l655l651P60L621J442J446J93J94l39l35l35l36J301J304
$$ -50477 -47888 -45719 -43547 -45786 -50887 -54542 -58193 -57433 -53812 -52370 -50924 -50731 -50537 -50876 -51211 -51546 -51882 -50581 -49277
-257d9277m85K377O93k164j98j97k020Q46J025j837k422M43Q61Q61K794o3J15J16L05L09k079
$$ -49277 -49762 -47385 -46692 -48856 -49054 -49251 -51271 -50425 -49400 -51237 -53659 -53216 -52355 -51494 -48700 -48763 -48648 -48532 -48227 -47918 -49997
-236d9997k075q27q23q27q24P30P34P31P34J34J38J34J38n97n92n96n92r0q6q9q6J081J084
$$ -49997 -52072 -52899 -53722 -54549 -55373 -54643 -53909 -53178 -52444 -52310 -52172 -52038 -51900 -52497 -53089 -53685 -54277 -54367 -54453 -54542 -54628 -53547 -52463
-213e2463l50l47J796J800n89n85N07N10N11N10l87l84k05k05J349M214J829j032n59n55r13
$$ -52463 -52813 -53160 -51364 -49564 -50153 -50738 -50231 -49721 -49210 -48700 -49087 -49471 -49676 -49881 -48532 -44318 -42489 -43521 -44080 -44635 -45548
-192d5548J949O48O52Q31Q31j111j106j107j106k61k57k57k57j096j091r13r13o7K798K973
$$ -45548 -43599 -42951 -42299 -41468 -40637 -41748 -42854 -43961 -45067 -45328 -45585 -45842 -46099 -47195 -48286 -49199 -50112 -50179 -47381 -44408
-172d4408J16p83K083M69M74N2K917J304J308l06l02l05l02r98r95j178j173Q20k038k042
$$ -44408 -44292 -45075 -42992 -42523 -42049 -41997 -39080 -37776 -36468 -36774 -37076 -37381 -37683 -38681 -39676 -40854 -42027 -41207 -43245 -45287
-152d5287Q23Q94Q98j132j129j908R58J728J733k735k731k731k731J111J114J114J114j20
$$ -45287 -44464 -43570 -42672 -43804 -44933 -46841 -45883 -44155 -42422 -45157 -47888 -50619 -53350 -52239 -51125 -50011 -48897 -49017
-134d9017j15j16j15O85O90p42p41J088J091J092J092m03l98J032J032n00m95m96m95j602
$$ -49017 -49132 -49248 -49363 -48678 -47988 -48730 -49471 -48383 -47292 -46200 -45108 -45511 -45909 -44877 -43845 -44345 -44840 -45336 -45831 -47433
-114d7433j599j67K694L207j557j919R47L178L20l796r32L91L95N70N74k94k91k679k675n6
$$ -47433 -49032 -49199 -46505 -43298 -44855 -46774 -45827 -42649 -42329 -46125 -47057 -46666 -46271 -45701 -45127 -45421 -45712 -48391 -51066 -51122
-94e1122n2J375J378m73m69J911J915p56p53O75O78m29m24J002J006r17r13r12r13P82P86
$$ -51122 -51174 -49799 -48421 -48894 -49363 -47452 -45537 -46293 -47046 -46371 -45693 -46122 -46546 -45544 -44538 -45455 -46368 -47280 -48193 -47411 -46625
-73d6625k552k552m69m66R65R65N44N47J979J978o26o22Q09Q08j19j16J315J316K08K13K12
$$ -46625 -49177 -51729 -52198 -52664 -51699 -50734 -50190 -49643 -47664 -45686 -46312 -46934 -46125 -45317 -45436 -45552 -44237 -42921 -42713 -42500 -42288
-52d2288K12M77M81j606j606k492K276L588P30K50K50j360j356l47l46k731k728J263J263
$$ -42288 -42076 -41599 -41118 -42724 -44330 -46822 -44546 -40958 -40228 -39978 -39728 -41088 -42444 -42791 -43137 -45868 -48596 -47333 -46070
-33d6070j121j118K035K034l50l47j572j572Q12Q16K16K16K16K20K064K064l20l17m81m80
$$ -46070 -47191 -48309 -46274 -44240 -44590 -44937 -46509 -48081 -47269 -46453 -46237 -46021 -45805 -45585 -43521 -41457 -41777 -42094 -42575 -43055
-13d3055m81m81J46J45j762J099K738k030j852K917L84L84p49p49k187k187k187k187J896
$$ -43055 -43536 -44017 -43871 -43726 -45488 -44389 -41651 -43681 -45533 -42616 -42232 -41848 -42597 -43346 -45533 -47720 -49907 -52094 -50198
5e0198J897J896J897J22J23J23J23o22o22J762J762J64J68J68J67r98r95r95r94m33m28m29
$$ -50198 -48301 -46405 -44508 -44386 -44263 -44140 -44017 -44639 -45261 -43499 -41737 -41573 -41405 -41237 -41070 -42068 -43063 -44058 -45052 -45485 -45913 -46342
27d6342m28K24K27J658J658j662j658P27P26J051J054J055J054J110J114j926j926j364L409
$$ -46342 -46770 -46546 -46319 -44661 -43003 -44665 -46323 -45596 -44870 -43819 -42765 -41710 -40656 -39546 -38432 -40358 -42284 -43648 -40239
46d0239K336n25r20r21j099j099O00O00J732J733K478k292k470K299K567k94J82J83j848j845
$$ -40239 -37903 -38428 -39348 -40269 -41368 -42467 -41867 -41267 -39535 -37802 -35324 -37616 -40086 -37787 -35220 -35514 -35332 -35149 -36997 -38842
66c8842N37N40j252j248j252j248O56O59O56O60N96O00k743k738O71O74K101K105l025l022
$$ -38842 -38305 -37765 -39017 -40265 -41517 -42765 -42109 -41450 -40794 -40134 -39538 -38938 -41681 -44419 -43748 -43074 -40973 -38868 -41893 -44915
86d4915J267J271N96O00j789j784K68K72K68K72K105K105k79k80m88m88m88m88k05k05k05
$$ -44915 -43648 -42377 -41781 -41181 -42970 -44754 -44486 -44214 -43946 -43674 -41569 -39464 -39743 -40023 -40511 -40999 -41487 -41975 -42180 -42385 -42590
107d2590k05N41N40N40N40k548k549j63j61M62M62r68r65P75P75K205K210j49j49j49j46N85
$$ -42590 -42795 -42254 -41714 -41174 -40634 -43182 -45731 -45894 -46055 -45593 -45131 -46099 -47064 -46289 -45514 -43309 -41099 -41248 -41397 -41546 -41692 -41107
129d1107N85K016K019K27K28j204j199R42R43R42R47o97o97o96o93k58k53k57k53J144J147
$$ -41107 -40522 -38506 -36487 -36260 -36032 -37236 -38435 -37493 -36550 -35608 -34661 -35358 -36055 -36751 -37444 -37702 -37955 -38212 -38465 -37321 -36174
150c6174J144J147j82j79k567k563r58r54M73M77K3K6K2K6K437K440r01q98K645K649K61K64
$$ -36174 -35030 -33883 -34065 -34244 -36811 -39374 -40332 -41286 -40813 -40336 -40313 -40287 -40265 -40239 -37802 -35362 -36263 -37161 -34516 -31867 -31606 -31342
172c1342j706j703k75k72j837j833J501J505J412J416r72r69K6L0K6L0k448k444o3o0J837
$$ -31342 -33048 -34751 -35026 -35298 -37135 -38968 -37467 -35962 -34550 -33134 -34106 -35075 -35049 -35019 -34993 -34963 -37411 -39855 -39918 -39978 -38141
193c8141J837n48n48m1m1m1m1n40n40Q90Q91Q5Q6Q6Q6R42R43R42R43q76q75q76q75P11P12
$$ -38141 -36304 -36852 -37400 -37441 -37482 -37523 -37564 -38104 -38644 -37754 -36863 -36778 -36692 -36606 -36520 -35578 -34635 -33693 -32750 -33626 -34501 -35377 -36252 -35541 -34829
218c4829l580l581J367J368J367J368J125J129k213k210l05l02J125J129J79J82J79J83K68
$$ -34829 -38409 -41990 -40623 -39255 -37888 -36520 -35395 -34266 -36479 -38689 -38994 -39296 -38171 -37042 -36863 -36681 -36502 -36319 -36051
237c6051K72K68K72o26o26o26o22K057K056j162J703o63l525O48O52Q27Q27o03o00p34p34
$$ -36051 -35779 -35511 -35239 -35865 -36491 -37117 -37739 -35682 -33626 -34788 -33085 -33748 -37273 -36625 -35973 -35146 -34319 -34922 -35522 -36256 -36990
258c6990k165k161J442J442J442J446J00J01j330j327j181j181J204J207j073j073L58L57
$$ -36990 -39155 -41316 -39874 -38432 -36990 -35544 -35444 -35343 -36673 -38000 -39181 -40362 -39158 -37951 -39024 -40097 -39739 -39382
276c9382J729J729J728J729Q27Q27J006J006k392M70K90K91P27P26J31k731j509J352K247
$$ -39382 -37653 -35924 -34196 -32467 -31640 -30813 -29807 -28801 -31193 -30723 -30433 -30142 -29415 -28689 -28558 -31289 -32798 -31446 -29199
295b9199k523k216k217r06r05Q53L715k80k79r84r80j341J524J580j278j103J762J103J107
$$ -29199 -31722 -33938 -36155 -37061 -37966 -37113 -33398 -33678 -33957 -34941 -35921 -37262 -35738 -34158 -35436 -36539 -34777 -33674 -32567
314c2567J281J286J162J166l87l245l775r09O37O41p63p61O67O71l69l65J241j617j353j348
$$ -32567 -31286 -30000 -28838 -27672 -28059 -31304 -35079 -35988 -35351 -34710 -35473 -36234 -35567 -34896 -35265 -35630 -34389 -36006 -37359 -38707
334c8707Q53Q57J039J043J219j640k418k414J516J521L513O56r58J908L83k473J516J520N48
$$ -38707 -37854 -36997 -35958 -34915 -33696 -35336 -37754 -40168 -38652 -37131 -33618 -32962 -33920 -32012 -31629 -34102 -32586 -31066 -30518
353c0518k310p04p01j628j624j98j94J435J438MPQ09Q12Q08Q13P00P04p30p27q79q75N51N55
$$ -30518 -32828 -33532 -34233 -35861 -37485 -37683 -37877 -36442 -35004 -35000 -34993 -34184 -33372 -32564 -31751 -31051 -30347 -31077 -31804 -32683 -33558 -33007 -32452
376c2452J550J554q35q31m17m14J014J017m92m88j5K850J684l081k906J867K921K924j19j15
$$ -32452 -30902 -29348 -30183 -31014 -31431 -31845 -30831 -29814 -30306 -30794 -30809 -27959 -26275 -29356 -32262 -30395 -27474 -24550 -24669 -24784
396b4784j043j040k474k470O04O03K034K038n59n58n59n55j57j56J274J278Q2Q2Q2Q5j430
$$ -24784 -25827 -26867 -29341 -31811 -31207 -30604 -28570 -26532 -27091 -27649 -28208 -28763 -28920 -29076 -27802 -26524 -26442 -26360 -26278 -26193 -27623
417b7623j431J908J911n66n67j997j993N51N52q79q76K548K549p90p86p57p56p56p53M06M06
$$ -27623 -29054 -27146 -25235 -25801 -26368 -28365 -30358 -29807 -29255 -30134 -31010 -28462 -25913 -26703 -27489 -28246 -29002 -29758 -30511 -30105 -29699
438b9699J837J841N40N40q90q87k94k95K091K093l137l137K01K05J12J12J12J15j334j333
$$ -29699 -27862 -26021 -25481 -24941 -25831 -26718 -27012 -27307 -25216 -23123 -26260 -29397 -29196 -28991 -28879 -28767 -28655 -28540 -29874 -31207
458c1207R6J01J408J409J110J114K817j953l263m03j565j564j386j386P15P15P16P15K027
$$ -31207 -31111 -31010 -29602 -28193 -27083 -25969 -23152 -25105 -28368 -28771 -30336 -31900 -33286 -34672 -33957 -33242 -32526 -31811 -29784
477b9784K027K026K027j118j117j118j114j177j178K54K57o26o26J758J763K682K683K98L02
$$ -29784 -27757 -25731 -23704 -24822 -25939 -27057 -28171 -29348 -30526 -30272 -30015 -30641 -31267 -29509 -27746 -25064 -22381 -22083 -21781
496b1781q31q31q31q31J047J047l84l83m73m74j904j903O89O89O89O90q2p9J353J352O64O66
$$ -21781 -22612 -23443 -24274 -25105 -24058 -23011 -23395 -23778 -24251 -24725 -26629 -28532 -27843 -27154 -26465 -25775 -25857 -25936 -24583 -23231 -22567 -21901
518b1901p63p64m32m29J956J956l13l09l09l09J52J57J56J57R57R62m70m69O82O85O86O85
$$ -21901 -22664 -23428 -23860 -24289 -22333 -20377 -20690 -20999 -21308 -21617 -21465 -21308 -21152 -20995 -20038 -19076 -19546 -20015 -19333 -18648 -17962 -17277
540a7277j852j848m17m17J431J434MLk9k6k7k6J42J45j285j285p23p19J665J665J252J256
$$ -17277 -19129 -20977 -21394 -21811 -20380 -18946 -18942 -18939 -18968 -18994 -19021 -19047 -18905 -18760 -20045 -21330 -22053 -22772 -21107 -19442 -18190 -16934
562a6934k087k082j073j070L58L62K332K336j006j002J229J233J230J233p08p04k138k135
$$ -16934 -19021 -21103 -22176 -23246 -22888 -22526 -20194 -17858 -18864 -19866 -18637 -17404 -16174 -14941 -15649 -16353 -18491 -20626
580b0626J408J412r76r72l197l193K049K053Q87Q90j498j494K91K94K91K94P38P41o93o89
$$ -20626 -19218 -17806 -18782 -19754 -22951 -26144 -24095 -22042 -21155 -20265 -21763 -23257 -22966 -22672 -22381 -22087 -21349 -20608 -21301 -21990
$$ [...]
##END=	
