##TITLE=	h7zDYx29T$+db7j52l57XQ/0598s
##JCAMPDX=	6.0	$$ NMR Plug-in 1.13 of MestReNova 11.0.4-18998
##DATATYPE=	NMRSPECTRUM
##DATACLASS=	XYDATA
##NUMDIM=	1
##ORIGIN=	Bruker BioSpin GmbH
##OWNER=	andrew
##.OBSERVEFREQUENCY=	600.30184456100005264
##.OBSERVENUCLEUS=	^1H
##.SOLVENTNAME=	CD2Cl2
##.PULSESEQUENCE=	zg
##LONGDATE=	2015/06/05 09:54:58.000
##.ACQUISITIONMODE=	SIMULTANEOUS (DQD)
##$ORIGINALFORMAT=	Bruker XWIN-NMR
##$PARAMETERFILE=	(acqus, ASCII, /var/folders/f6/rjf_tdyn2v98c5c0wvkgn4s80000gn/T/h7zDYx29T$+db7j52l57XQ/0598s/acqus, 0)
$$ ##TITLE= Parameter file, TOPSPIN		Version 2.1
$$ ##JCAMPDX= 5.0
$$ ##DATATYPE= Parameter Values
$$ ##NPOINTS= 10	$$ modification sequence number
$$ ##ORIGIN= Bruker BioSpin GmbH
$$ ##OWNER= andrew
$$ $$ 2015-06-05 14:54:59.067 +0600  andrew@av-600
$$ $$ /opt/data/andrew/nmr/limog-1782/603/acqus
$$ $$ process /opt/ts21pl6/prog/mod/shimcntl
$$ ##$ACQT0= -9.54927425515661
$$ ##$AMP= (0..31)
$$ 100 100 100 100 100 100 100 100 100 100 100 100 100 100 100 100 100 100
$$ 100 100 100 100 100 100 100 100 100 100 100 100 100 100
$$ ##$ANAVPT= -1
$$ ##$AQSEQ= 0
$$ ##$AQ_mod= 3
$$ ##$AUNM= <au_zg>
$$ ##$AUTOPOS= <>
$$ ##$BF1= 600.3
$$ ##$BF2= 600.3
$$ ##$BF3= 600.3
$$ ##$BF4= 600.3
$$ ##$BF5= 600.3
$$ ##$BF6= 600.3
$$ ##$BF7= 600.3
$$ ##$BF8= 600.3
$$ ##$BYTORDA= 0
$$ ##$CFDGTYP= 0
$$ ##$CFRGTYP= 9
$$ ##$CHEMSTR= <none>
$$ ##$CNST= (0..63)
$$ 1 1 145 1 1 1 1 1 1 1 1 1 1 1 1 1 1 1 1 1 1 1 1 1 1 1 1 1 1 1 1 1 1 1 1
$$ 1 1 1 1 1 1 1 1 1 1 1 1 1 1 1 1 1 1 1 1 1 1 1 1 1 1 1 1 1
$$ ##$CPDPRG= <>
$$ ##$CPDPRG1= <>
$$ ##$CPDPRG2= <waltz16>
$$ ##$CPDPRG3= <>
$$ ##$CPDPRG4= <mlev>
$$ ##$CPDPRG5= <mlev>
$$ ##$CPDPRG6= <mlev>
$$ ##$CPDPRG7= <mlev>
$$ ##$CPDPRG8= <mlev>
$$ ##$CPDPRGB= <>
$$ ##$CPDPRGT= <>
$$ ##$D= (0..63)
$$ 0 1 0 0 0 0 0 0 0 0.06 0 0.03 0 0 0 0 1e-04 0 0 0 0 0 0 0 0 0 0 0 0 0 0
$$ 0 0 0 0 0 0 0 0 0 0 0 0 0 0 0 0 0 0 0 0 0 0 0 0 0 0 0 0 0 0 0 0 0
$$ ##$DATE= 1433494498
$$ ##$DBL= (0..7)
$$ 120 120 120 120 120 120 120 120
$$ ##$DBP= (0..7)
$$ 150 150 150 150 150 150 150 150
$$ ##$DBP07= 0
$$ ##$DBPNAM0= <>
$$ ##$DBPNAM1= <>
$$ ##$DBPNAM2= <>
$$ ##$DBPNAM3= <>
$$ ##$DBPNAM4= <>
$$ ##$DBPNAM5= <>
$$ ##$DBPNAM6= <>
$$ ##$DBPNAM7= <>
$$ ##$DBPOAL= (0..7)
$$ 0.5 0.5 0.5 0.5 0.5 0.5 0.5 0.5
$$ ##$DBPOFFS= (0..7)
$$ 0 0 0 0 0 0 0 0
$$ ##$DE= 6.5
$$ ##$DECBNUC= <off>
$$ ##$DECIM= 2218.66666666667
$$ ##$DECNUC= <off>
$$ ##$DECSTAT= 4
$$ ##$DIGMOD= 1
$$ ##$DIGTYP= 12
$$ ##$DL= (0..7)
$$ 0 120 120 120 120 120 120 120
$$ ##$DP= (0..7)
$$ 150 150 150 150 150 150 150 150
$$ ##$DP07= 0
$$ ##$DPNAME0= <>
$$ ##$DPNAME1= <>
$$ ##$DPNAME2= <>
$$ ##$DPNAME3= <>
$$ ##$DPNAME4= <>
$$ ##$DPNAME5= <>
$$ ##$DPNAME6= <>
$$ ##$DPNAME7= <>
$$ ##$DPOAL= (0..7)
$$ 0.5 0.5 0.5 0.5 0.5 0.5 0.5 0.5
$$ ##$DPOFFS= (0..7)
$$ 0 0 0 0 0 0 0 0
$$ ##$DQDMODE= 0
$$ ##$DR= 22
$$ ##$DS= 0
$$ ##$DSLIST= <SSSSSSSSSSSSSSS>
$$ ##$DSPFIRM= 0
$$ ##$DSPFVS= 20
$$ ##$DTYPA= 0
$$ ##$EXP= <>
$$ ##$F1LIST= <111111111111111>
$$ ##$F2LIST= <222222222222222>
$$ [...]
$$ -1 -1 -1 -1 -1 -1 -1 -1 -1 -1 -1 -1 -1 -1 -1 -1 -1 -1 -1 -1 -1 -1 -1 -1
$$ -1 -1 -1 -1 -1 -1 -1 -1 -1 -1 -1 -1 -1 -1 -1 -1 -1 -1 -1 -1 -1 -1 -1 -1
$$ -1 -1 -1 -1 -1 -1 -1 -1 -1 -1 -1 -1 -1 -1 -1 -1 -1 -1 -1 -1 -1 -1 -1 -1
$$ -1 -1 -1 -1 -1 -1 -1 -1 -1 -1 -1 -1 -1 -1 -1 -1 -1 -1 -1 -1 -1 -1 -1 -1
$$ -1 -1 -1 -1 -1 -1 -1 -1 -1 -1 -1 -1 -1 -1 -1 -1
$$ ##$RG_tab8= (0..255)
$$ -1 -1 -1 -1 -1 -1 -1 -1 -1 -1 -1 -1 -1 -1 -1 -1 -1 -1 -1 -1 -1 -1 -1 -1
$$ -1 -1 -1 -1 -1 -1 -1 -1 -1 -1 -1 -1 -1 -1 -1 -1 -1 -1 -1 -1 -1 -1 -1 -1
$$ -1 -1 -1 -1 -1 -1 -1 -1 -1 -1 -1 -1 -1 -1 -1 -1 -1 -1 -1 -1 -1 -1 -1 -1
$$ -1 -1 -1 -1 -1 -1 -1 -1 -1 -1 -1 -1 -1 -1 -1 -1 -1 -1 -1 -1 -1 -1 -1 -1
$$ -1 -1 -1 -1 -1 -1 -1 -1 -1 -1 -1 -1 -1 -1 -1 -1 -1 -1 -1 -1 -1 -1 -1 -1
$$ -1 -1 -1 -1 -1 -1 -1 -1 -1 -1 -1 -1 -1 -1 -1 -1 -1 -1 -1 -1 -1 -1 -1 -1
$$ -1 -1 -1 -1 -1 -1 -1 -1 -1 -1 -1 -1 -1 -1 -1 -1 -1 -1 -1 -1 -1 -1 -1 -1
$$ -1 -1 -1 -1 -1 -1 -1 -1 -1 -1 -1 -1 -1 -1 -1 -1 -1 -1 -1 -1 -1 -1 -1 -1
$$ -1 -1 -1 -1 -1 -1 -1 -1 -1 -1 -1 -1 -1 -1 -1 -1 -1 -1 -1 -1 -1 -1 -1 -1
$$ -1 -1 -1 -1 -1 -1 -1 -1 -1 -1 -1 -1 -1 -1 -1 -1 -1 -1 -1 -1 -1 -1 -1 -1
$$ -1 -1 -1 -1 -1 -1 -1 -1 -1 -1 -1 -1 -1 -1 -1 -1
$$ ##$RG_tabA= (0..255)
$$ 0.25 0.28 0.32 0.35 0.4 0.44 0.5 0.56 0.64 0.7 0.8 0.89 1 1.12 1.28 1.4
$$ 1.6 1.78 2 2.25 2.56 2.8 3.2 3.56 4 4.5 5 5.6 6.35 7.12 8 9 10 11.3 12.7
$$ 14.2 16 18 20.2 22.6 25.4 28.5 32 36 40.3 45.2 50.8 57 64 71.8 80.6 90.5
$$ 101 114 128 144 161 181 203 -1 -1 -1 -1 -1 -1 -1 -1 -1 -1 -1 -1 -1 -1 -1
$$ -1 -1 -1 -1 -1 -1 -1 -1 -1 -1 -1 -1 -1 -1 -1 -1 -1 -1 -1 -1 -1 -1 -1 -1
$$ -1 -1 -1 -1 -1 -1 -1 -1 -1 -1 -1 -1 -1 -1 -1 -1 -1 -1 -1 -1 -1 -1 -1 -1
$$ -1 -1 -1 -1 -1 -1 -1 -1 -1 -1 -1 -1 -1 -1 -1 -1 -1 -1 -1 -1 -1 -1 -1 -1
$$ -1 -1 -1 -1 -1 -1 -1 -1 -1 -1 -1 -1 -1 -1 -1 -1 -1 -1 -1 -1 -1 -1 -1 -1
$$ -1 -1 -1 -1 -1 -1 -1 -1 -1 -1 -1 -1 -1 -1 -1 -1 -1 -1 -1 -1 -1 -1 -1 -1
$$ -1 -1 -1 -1 -1 -1 -1 -1 -1 -1 -1 -1 -1 -1 -1 -1 -1 -1 -1 -1 -1 -1 -1 -1
$$ -1 -1 -1 -1 -1 -1 -1 -1 -1 -1 -1 -1 -1 -1 -1 -1 -1 -1 -1 -1 -1 -1 -1 -1
$$ -1 -1 -1 -1 -1 -1 -1 -1 -1 -1 -1 -1 -1 -1
$$ ##$ROUT14= (0..7)
$$ 0 0 0 0 0 0 0 0
$$ ##$ROUTER= -1
$$ ##$RX22TY= <no>
$$ ##$RXFMAX= (0..7)
$$ 647.5 -1 -1 -1 -1 -1 -1 -1
$$ ##$RXFMIN= (0..7)
$$ 5 -1 -1 -1 -1 -1 -1 -1
$$ ##$RXINTLV= (0..7)
$$ 1 0 0 0 0 0 0 0
$$ ##$RXMSTY= <no>
$$ ##$SCMTY= <no>
$$ ##$SGUC1= (0..15)
$$ 17 18 34 0 0 0 0 0 0 0 0 0 0 0 0 0
$$ ##$SGUC2= (0..15)
$$ 33 256 20 0 0 0 0 0 0 0 0 0 0 0 0 0
$$ ##$SPECTR= 10
$$ ##$SY2FLAG= 0
$$ ##$TFXNUM= 0
$$ ##$TRIPLO2= 0
$$ ##$VTUTY= <tty05>
$$ ##$WBREFAM= (0..15)
$$ 100 100 100 100 100 100 100 100 100 100 100 100 100 100 100 100
$$ ##$WBREFPH= (0..15)
$$ 0 0 0 0 0 0 0 0 0 0 0 0 0 0 0 0
$$ ##$XFAC= 2
$$ ##END=
$$ 
##$DECIM=	2218.66666666667
##$DSPFVS=	20
##XUNITS=	HZ
##YUNITS=	ARBITRARY UNITS
##FIRSTX=	6322.8525384689401108
##LASTX=	-2691.4329892738592207
##XFACTOR=	-0.1375491802509010153
##YFACTOR=	1.148199609375000156e-05
##NPOINTS=	65536
##XYDATA=	(X++(Y..Y))
$$ [...]
-15883 -49953 -48410 -46868 -47114 -44494 -44919 -48206 -51313 -51556 -51325 -51090 -50501 -49909 -50810 -48850 -46711 -47430 -51940 -53587 -52730
-15864 -52730 -51869 -52398 -52927 -51846 -53624 -53020 -52413 -51988 -51559 -51392 -51224 -48671 -46119 -46219 -46320 -46421 -46521 -46547 -46573 -46599 -46625 -48619
-15842 -48619 -50613 -51176 -51738 -51899 -52055 -53646 -55234 -55424 -55610 -54548 -53482 -50169 -49715 -49443 -46305 -44006 -44565 -48586 -52603
-15823 -52603 -52994 -53385 -53598 -53810 -52920 -49167 -46547 -48694 -51436 -51317 -49767 -48213 -47527 -46842 -46752 -49521 -51373 -50359 -51138
-15804 -51138 -51913 -50963 -50009 -48876 -50605 -51880 -53151 -54600 -56050 -53270 -50486 -50087 -49689 -48571 -47453 -44904 -45213 -44990
-15786 -44990 -47628 -47106 -43719 -44151 -44583 -44837 -45086 -43909 -42731 -41375 -42877 -43860 -44844 -46186 -47524 -44930 -45198 -43678 -42154
-15767 -42154 -42705 -40395 -39515 -41494 -44281 -47069 -49260 -48586 -47419 -46253 -46458 -49525 -51190 -49994 -50408 -50822 -53367 -53050
-15749 -53050 -51004 -48958 -47837 -46715 -45235 -46618 -48798 -48116 -46838 -45560 -44639 -43719 -44229 -44740 -46115 -47490 -45824 -47021
-15731 -47021 -46845 -46670 -49059 -51448 -52469 -53486 -55934 -58383 -57824 -57261 -54492 -51723 -49480 -50095 -50710 -48463 -48425 -48384 -49953
-15712 -49953 -48660 -48943 -52085 -52007 -51928 -51138 -50345 -47941 -48399 -48802 -49201 -48347 -47494 -47449 -47401 -46994 -49450 -52949 -53583 -52666 -51749 -50359
-15690 -50359 -48966 -47751 -46536 -45377 -47076 -48776 -47613 -48153 -48690 -49048 -49405 -48478 -47546 -45183 -42821 -44039 -45254 -46469
-15672 -46469 -47684 -49521 -51354 -49849 -48343 -49614 -50881 -48809 -46737 -46592 -46447 -47553 -48660 -50095 -48668 -47598 -46529
-15655 -46529 -46003 -48340 -50855 -50509 -48522 -49398 -51645 -53892 -52987 -49215 -46581 -48712 -50907 -50237 -48437 -49495 -49692 -49886
-15637 -49886 -48832 -47773 -48388 -48999 -48183 -47363 -46100 -44837 -45958 -47080 -47516 -47952 -48388 -48824 -48686 -48548 -50795 -53043 -54216
-15618 -54216 -55390 -54179 -52968 -53844 -54720 -51660 -55278 -58450 -58759 -59665 -60570 -59821 -59072 -54328 -49584 -48179 -51545 -49841
-15600 -49841 -48138 -48012 -47881 -49186 -50486 -50479 -50468 -50460 -50449 -51202 -51951 -52703 -53452 -55696 -57936 -55886 -53833 -51843 -49853 -50248 -50643
-15579 -50643 -49487 -48332 -49562 -50792 -49733 -48675 -49048 -49420 -47050 -44680 -45649 -46618 -49372 -52126 -51541 -50952 -50576 -50199 -49823
-15560 -49823 -49443 -50684 -51925 -51735 -51541 -50367 -49193 -49450 -49704 -50564 -51425 -53717 -56005 -55316 -54626 -53937 -53244 -51123 -49003
-15541 -49003 -46883 -44759 -48332 -51906 -50233 -48556 -49909 -51258 -52607 -53956 -51761 -49562 -47363 -45165 -46860 -48552 -50244
-15524 -50244 -51936 -51992 -52044 -49711 -47378 -46823 -46264 -45705 -45146 -45753 -46357 -46961 -47565 -48202 -48835 -49469 -50102 -50054 -50002 -49950 -49897 -49745 -49592
-15501 -49592 -51824 -54052 -55539 -57026 -56128 -55226 -53255 -51284 -50743 -50199 -50255 -50311 -50367 -50419 -49692 -48966 -48239 -47509 -47915 -48321 -45388
-15480 -45388 -42452 -43573 -44695 -47248 -49797 -48742 -47688 -48064 -48437 -47863 -47285 -46707 -46130 -44840 -43547 -45593 -47639 -48839
-15462 -48839 -50035 -51231 -52428 -52584 -52737 -50505 -48273 -48042 -47807 -49957 -52107 -50892 -49674 -49886 -50099 -50792 -51481 -52171 -52860
-15443 -52860 -52718 -52573 -52428 -52282 -50400 -48515 -47110 -48563 -49424 -45511 -41423 -40193 -41919 -43641 -45545 -47445 -47710 -47971
-15425 -47971 -48235 -48496 -48444 -48388 -48336 -48280 -48824 -49364 -49909 -50449 -50233 -50013 -49797 -49577 -50702 -51824 -50564 -49301 -49704 -50102 -50501 -50900
-15403 -50900 -51153 -51403 -51354 -51306 -53557 -51034 -49584 -50997 -52681 -54362 -53836 -53311 -53016 -52718 -52420 -52122 -50635 -49145 -50993 -52841
-15383 -52841 -52547 -52249 -51951 -51653 -50971 -50285 -51030 -51776 -53393 -55010 -54243 -53475 -53542 -53609 -53676 -53743 -52141 -50538 -48936 -47334 -48116
-15362 -48116 -48899 -48250 -47602 -43883 -40164 -40738 -41311 -42034 -42757 -41095 -39433 -42049 -44665 -47281 -49897 -49383 -48869 -48355 -47840
-15343 -47840 -48191 -48537 -48887 -49234 -50598 -51958 -49029 -46096 -48608 -51116 -52197 -53274 -53102 -52927 -51325 -49719 -51045 -52368
-15325 -52368 -52264 -52156 -50978 -49797 -50050 -50300 -48496 -46689 -46316 -45940 -46700 -47457 -46786 -46111 -44602 -43093 -44922 -46748 -48250
-15306 -48250 -49752 -49823 -49890 -49663 -49435 -49208 -48977 -50002 -51027 -47758 -44486 -45765 -47043 -48321 -49596 -49204 -48813 -48422 -48027 -47129
-15286 -47129 -46230 -47717 -49201 -48630 -48060 -49875 -51686 -52741 -53792 -51507 -49219 -50602 -51981 -51932 -51880 -49432 -46980 -44531
-15268 -44531 -42079 -43715 -45347 -46983 -48615 -49405 -50192 -50982 -51768 -51723 -51675 -51630 -51582 -50613 -49640 -48671 -47699 -48042 -48381 -48724 -49063 -49737
-15246 -49737 -50412 -51086 -51757 -52074 -52390 -52707 -53020 -53493 -53967 -54440 -54910 -55383 -55856 -56329 -56799 -57045 -57291 -57537 -57779 -55014 -52249
-15225 -52249 -50915 -49577 -51313 -53050 -51925 -50795 -50237 -49678 -49119 -48556 -47587 -46614 -48504 -50393 -51481 -52566 -52219 -51872 -51612
-15206 -51612 -51347 -51082 -50818 -51064 -51306 -51548 -51790 -51776 -51761 -51746 -51727 -51116 -50505 -49894 -49279 -48973 -48668 -48362 -48053 -47747 -47442 -47136 -46827
-15183 -46827 -48250 -49670 -51094 -52513 -52774 -53031 -53292 -53549 -53616 -53680 -52316 -50948 -48958 -46965 -47837 -48705 -47151 -45593 -46898
-15164 -46898 -48202 -47900 -47594 -47289 -46983 -46853 -46719 -49446 -52174 -50195 -48213 -49092 -49972 -51459 -52946 -51571 -50192 -49294 -48396
-15145 -48396 -47497 -46596 -46920 -47244 -47568 -47889 -45917 -43942 -44833 -45720 -45373 -45023 -43246 -41464 -43652 -45835 -48023 -50207 -50143 -50076
-15125 -50076 -50013 -49946 -49286 -48623 -47960 -47296 -47326 -47352 -47382 -47408 -49316 -51220 -52174 -50263 -46998 -48500 -48574 -48645 -48302 -47956 -49044 -50128
-15103 -50128 -49707 -49282 -48858 -48433 -48757 -49078 -49398 -49719 -51682 -53643 -52920 -52197 -49361 -49383 -51015 -49786 -47106 -47285 -48541 -49793
-15083 -49793 -49528 -49260 -47561 -45862 -45806 -45746 -47117 -48489 -46376 -44259 -43573 -42888 -44975 -47061 -48969 -50874 -52692 -51645 -52212
-15064 -52212 -52774 -51328 -49879 -48433 -46983 -47326 -47665 -47829 -47989 -50386 -49920 -49454 -51846 -50188 -48530 -47229 -45925 -44252
-15046 -44252 -45440 -46629 -44952 -43637 -42321 -43689 -45053 -46473 -47893 -48060 -45362 -44665 -43968 -44524 -45075 -45653 -46230 -46629 -47024
-15027 -47024 -47811 -45735 -45448 -45157 -44677 -47058 -47829 -48597 -49547 -50497 -51448 -52394 -53665 -54936 -56206 -57473 -55286 -53098 -50911
-15008 -50911 -48720 -48947 -49174 -49402 -49625 -52357 -55088 -53050 -51008 -48373 -45739 -45966 -46189 -45254 -44319 -46245 -48168 -50531 -52890
-14989 -52890 -52867 -52841 -52879 -52912 -52949 -52983 -50769 -48552 -48127 -47699 -43279 -44580 -44095 -43607 -44088 -44565 -45042 -45519 -45850 -46178 -47937 -49696
-14967 -49696 -51645 -53590 -54462 -49610 -48847 -48079 -46953 -45828 -46946 -48064 -47751 -47434 -48015 -48597 -49178 -49756 -49092 -48429 -49197 -49961
-14947 -49961 -49506 -49051 -50028 -51000 -52070 -53139 -50870 -48601 -47017 -45433 -46830 -48228 -50952 -47952 -48172 -48392 -51504 -54615
-14929 -54615 -54388 -54161 -52942 -51723 -51936 -52148 -48485 -44822 -45452 -46081 -45467 -44852 -46622 -48392 -48820 -49249 -49678 -50106 -49104 -48101
-14909 -48101 -48530 -48958 -47330 -45701 -46458 -47214 -46324 -45433 -45973 -46514 -48813 -51112 -51027 -50941 -50866 -50792 -50717 -50639 -53069 -55498 -55543 -55584 -54757
-14886 -54757 -53929 -53102 -52271 -51444 -50617 -49789 -48958 -49137 -49316 -51880 -54440 -52920 -51399 -47852 -44300 -41446 -44315 -45396 -46473
-14867 -46473 -45407 -44341 -43275 -42206 -43402 -44595 -48649 -47934 -47460 -49845 -49726 -46745 -44483 -45079 -48179 -51280 -52297 -53311
-14849 -53311 -52894 -52476 -52368 -52256 -53277 -54298 -57768 -56464 -54503 -52543 -50691 -48835 -46801 -47628 -48459 -49286 -47132 -44978
-14831 -44978 -44334 -46551 -49543 -52532 -51470 -50408 -50777 -51142 -53315 -55487 -56229 -56967 -54310 -51653 -49771 -50747 -50855 -50963 -48865
-14812 -48865 -46763 -48094 -49424 -50754 -52081 -52681 -53281 -54239 -52331 -51828 -54187 -54578 -54965 -54992 -52156 -49320 -49346 -48120 -46894
-14793 -46894 -45668 -47304 -46763 -46223 -45683 -48004 -47494 -46983 -44863 -45604 -49271 -50076 -51239 -52402 -52253 -52103 -51954 -51805 -51224 -50643
-14773 -50643 -51492 -52342 -52417 -52491 -50359 -48228 -47572 -49774 -50371 -50963 -50904 -50840 -48396 -45947 -45873 -45794 -47330 -45999 -45925 -45847 -45593 -45336
-14751 -45336 -47378 -49417 -49909 -47535 -47043 -49409 -49991 -50568 -50859 -51146 -49827 -51366 -52461 -53553 -54052 -51686 -51410 -51131 -50676
-14732 -50676 -50218 -50210 -50199 -50192 -50181 -49778 -49372 -48969 -48563 -48727 -48887 -49051 -49212 -47378 -45541 -47047 -48548 -47102 -45653 -44207 -42757
-14711 -42757 -42459 -42157 -41859 -41557 -41915 -42269 -44058 -45843 -45452 -45060 -47054 -49044 -49428 -49812 -50195 -50576 -49640 -48705 -47770 -46830 -47893
-14690 -47893 -48955 -50017 -51075 -49480 -47885 -49629 -51369 -51235 -51101 -50967 -50829 -51030 -51231 -51433 -51630 -51533 -51436 -48955 -46469 -45593
-14670 -45593 -44718 -46227 -47736 -47158 -46581 -47434 -48284 -48526 -48768 -46625 -44479 -46361 -48243 -50125 -52003 -52629 -53255 -51496 -49737
-14651 -49737 -49916 -50095 -52659 -55219 -53326 -51433 -51925 -52413 -53203 -53993 -50490 -46983 -47758 -48530 -47870 -47211 -46197 -45180 -47203
-14632 -47203 -49227 -51015 -48030 -48325 -51481 -54522 -54697 -51712 -51589 -51638 -51682 -53337 -54992 -54116 -53236 -54265 -52431 -49812 -51958
-14613 -51958 -54582 -57205 -56434 -55659 -54883 -54108 -56423 -58733 -56754 -54772 -52226 -49678 -47430 -45180 -43797 -47181 -49793 -49540
-14595 -49540 -47829 -50885 -52689 -51630 -50520 -49405 -49547 -49685 -47889 -46089 -46678 -47263 -48612 -49957 -48921 -47881 -47263 -46640
-14577 -46640 -44587 -42534 -43551 -44565 -47669 -50769 -51518 -47494 -44546 -44457 -46100 -47740 -48131 -48519 -48135 -47747 -47363 -46976 -49778
-14558 -49778 -52577 -51086 -49592 -49174 -48753 -48336 -47915 -47363 -46808 -49596 -52379 -52901 -53419 -53941 -54459 -52346 -50229 -51455 -52677
-14539 -52677 -53486 -54291 -56531 -58767 -57786 -56803 -55823 -54839 -55886 -56929 -55592 -54250 -53132 -52014 -50896 -49778 -50359 -50941 -49137
-14520 -49137 -47334 -48839 -50345 -50419 -50494 -51522 -52551 -52148 -51746 -52122 -52498 -50490 -48478 -49063 -49648 -50233 -50814 -48015 -45217 -46890
-14500 -46890 -48560 -45910 -46122 -48839 -46782 -45295 -43805 -45355 -46905 -47505 -48101 -48697 -49294 -49148 -48999 -48850 -48701 -49868 -51030
-14481 -51030 -52193 -53356 -52603 -51850 -51097 -50341 -50572 -50803 -51034 -51261 -51000 -50740 -49048 -47352 -47866 -48381 -48895 -49405 -48608 -47807 -48440
-14460 -48440 -49070 -51403 -53732 -52726 -51716 -53572 -55424 -53941 -52454 -51656 -50855 -50058 -49256 -49618 -49979 -51772 -53561 -52908 -52256
-14441 -52256 -51604 -50948 -51653 -52357 -51630 -50900 -51902 -52905 -53907 -54906 -53292 -51679 -51496 -51313 -52860 -54406 -55953 -57499 -58450
-14422 -58450 -59400 -57011 -54623 -51727 -48832 -47546 -51030 -52607 -54179 -51761 -49338 -47635 -45929 -44703 -48243 -51332 -51556
-14405 -51556 -47490 -43421 -42962 -42500 -42042 -41580 -42198 -42813 -44863 -46909 -49286 -51660 -53918 -53311 -52968 -47852 -45124 -47162 -49681
-14386 -49681 -55059 -56564 -53296 -53359 -53423 -51757 -50091 -52092 -54093 -52756 -51418 -52428 -53438 -54447 -55457 -57600 -59743 -59501
-14368 -59501 -59258 -57067 -54876 -52685 -50494 -51403 -52312 -53221 -54131 -56285 -58439 -59937 -56665 -54913 -53162 -54451 -55741 -55148
-14350 -55148 -54556 -52532 -50509 -49260 -48012 -50102 -52193 -53702 -55211 -54336 -53460 -52107 -50754 -50833 -50911 -51250 -51589 -53359 -55129
-14331 -55129 -55588 -56046 -56505 -56963 -56363 -55763 -55163 -54563 -55275 -55987 -56698 -57410 -56359 -55308 -54257 -53203 -51168 -49133 -49484 -49830
-14311 -49830 -49614 -49398 -49182 -48962 -49700 -50438 -47837 -45232 -44550 -43868 -43186 -42500 -44591 -46681 -46387 -46089 -47620 -49152 -48299 -47442
-14291 -47442 -47065 -46689 -47743 -48794 -49022 -49245 -50900 -52554 -53139 -53721 -54302 -54883 -54880 -54872 -54865 -54857 -55211 -55562 -53527 -51492 -50237 -48977
-14269 -48977 -49148 -49320 -51224 -53125 -53594 -54064 -53657 -53248 -50453 -47658 -45999 -44337 -45060 -45783 -45429 -45072 -47099 -49126 -48921
-14250 -48921 -48712 -48504 -48295 -51041 -53784 -53188 -52592 -51701 -50807 -48481 -46156 -47378 -48597 -49815 -51034 -55029 -59020 -58718 -58416
-14231 -58416 -55994 -53568 -52573 -51578 -52495 -53408 -53069 -52730 -49912 -49957 -50777 -51597 -51313 -51030 -50747 -50464 -49815 -49167 -50904 -52640 -52349
-14210 -52349 -52059 -54749 -52670 -48232 -48560 -49428 -50292 -50356 -53277 -54772 -53400 -50885 -48366 -49010 -49651 -50982 -52308 -51254 -50195
-14191 -50195 -49201 -48206 -49119 -47170 -45578 -48757 -51936 -50345 -47993 -48504 -48537 -48571 -48843 -49115 -47956 -49659 -48343 -49886 -51433
-14172 -51433 -52975 -52823 -52666 -52513 -52357 -52756 -53151 -56531 -55137 -53300 -56229 -57790 -56486 -53706 -50922 -49391 -47859 -47404
-14154 -47404 -46946 -46488 -46029 -48973 -51913 -52469 -53024 -52420 -51813 -51205 -50598 -49581 -48560 -47538 -46517 -47617 -48712 -49629 -50546
-14135 -50546 -52510 -51608 -50110 -48612 -48757 -51761 -54764 -54906 -53374 -51843 -50311 -48779 -47427 -48936 -49014 -49092 -48649 -51068 -53486
-14116 -53486 -53043 -52361 -51679 -52249 -52819 -53050 -53281 -51127 -48973 -47505 -46037 -46775 -47512 -49219 -48064 -48519 -48973 -50143 -51313
-14097 -51313 -50099 -48884 -49115 -49342 -49569 -49797 -49282 -48765 -48247 -47729 -49063 -50393 -51723 -53054 -50423 -47788 -49446 -51105 -50408
-14078 -50408 -49707 -49186 -48664 -46953 -48101 -50501 -48131 -46748 -48224 -49223 -50222 -49912 -49599 -49286 -48973 -47304 -45634 -46350 -47061
-14059 -47061 -49655 -52249 -50550 -48847 -47281 -45716 -47490 -49260 -53896 -58532 -58875 -59214 -58431 -57649 -54481 -51310 -49484 -47658
-14041 -47658 -47263 -46864 -46588 -46312 -46037 -45757 -47598 -49439 -48895 -48347 -49003 -49655 -51738 -53821 -52390 -50956 -51906 -52856 -53229 -53598
-14021 -53598 -51403 -49208 -51012 -49950 -46204 -47229 -50162 -50233 -48873 -47509 -47609 -47710 -47811 -47907 -50736 -53564 -54008 -54447 -52297
-14002 -52297 -50147 -50382 -50613 -49640 -48664 -50073 -51481 -48660 -45835 -45396 -44956 -46584 -48209 -47449 -46689 -48228 -49763 -49868 -49972
-13983 -49972 -50907 -51843 -52778 -53710 -52618 -51526 -52819 -54108 -55051 -55994 -56937 -57876 -56225 -54574 -52923 -51269 -50773 -50274 -49774
-13964 -49774 -49275 -50419 -51559 -52700 -53840 -51675 -49506 -48768 -48030 -45508 -42981 -45224 -47468 -48343 -49215 -48656 -48097 -46141
-13946 -46141 -44181 -45083 -45985 -46346 -46704 -49923 -53143 -52014 -50881 -49748 -48615 -49800 -50982 -49305 -47624 -47557 -47486 -47419 -47348 -47408
-13926 -47408 -47464 -47524 -47579 -47043 -46503 -45966 -45426 -46573 -47717 -48865 -50009 -49905 -49797 -49692 -49584 -50225 -50863 -48642 -46417 -45657 -44893
-13905 -44893 -45563 -46230 -45101 -43972 -47315 -50654 -54325 -53225 -50337 -50307 -50818 -51328 -52018 -52703 -51425 -50147 -48869 -47587 -46611
-13886 -46611 -45634 -44658 -43678 -45206 -46734 -48261 -49786 -47989 -46193 -44397 -42597 -43067 -43536 -44006 -44472 -44449 -44427 -44404 -44382 -42482
-13866 -42482 -40581 -41543 -42504 -42728 -42951 -44606 -46260 -48094 -49927 -50330 -50732 -51272 -51813 -52353 -52894 -51794 -50695 -49596 -48496
-13847 -48496 -48798 -49100 -49402 -49704 -50005 -50307 -50609 -50911 -51053 -51190 -51328 -51466 -51638 -51805 -50542 -49279 -51306 -53330 -52491 -51653 -51265
-13826 -51265 -50874 -50482 -50091 -50117 -50140 -50162 -50184 -50568 -50948 -51328 -51708 -53508 -55305 -57101 -58897 -57239 -55577 -53915 -52253 -52692 -53132
-13805 -53132 -53572 -54008 -54447 -54887 -52465 -50039 -49242 -48444 -50509 -52569 -52696 -52823 -54380 -55934 -53892 -51850 -54578 -57302 -57973
-13786 -57973 -58644 -59314 -59981 -56821 -53661 -53363 -53061 -54164 -55267 -54939 -54608 -53598 -52588 -54440 -56288 -55368 -54447 -53527 -52603
-13767 -52603 -51809 -51015 -50222 -49424 -49316 -49208 -49100 -48988 -48440 -47893 -48776 -49655 -51343 -53031 -51858 -50680 -50646 -50613 -50579 -50542 -50866 -51190
-13745 -51190 -51515 -51835 -50665 -49495 -51187 -52875 -52062 -51250 -50438 -49622 -48220 -46819 -48280 -49737 -50304 -50870 -50005 -49137 -50754
-13726 -50754 -52372 -52737 -53098 -50959 -51682 -53657 -50859 -50248 -52498 -52841 -53180 -52659 -52137 -51615 -51090 -50155 -49219 -52577 -55931 -53892
-13706 -53892 -51854 -49815 -47773 -48552 -49331 -50110 -50885 -50829 -50773 -49286 -47796 -50240 -52685 -53698 -54708 -53128 -51548 -51399 -51246
-13687 -51246 -50874 -50501 -50128 -49752 -49946 -50140 -47948 -45753 -45388 -45023 -47997 -50971 -51082 -51194 -51306 -51418 -50754 -50091 -49428 -48765 -47654
-13666 -47654 -46544 -46864 -47184 -48627 -50065 -51507 -52946 -52748 -52547 -50918 -49286 -47315 -45340 -46707 -48071 -50035 -51995 -51574
-13648 -51574 -51150 -50669 -50184 -52085 -53985 -53087 -52185 -51284 -50382 -51973 -53561 -55148 -56736 -56150 -55562 -54973 -54384 -57063 -59743
-13629 -59743 -60037 -60328 -58416 -56505 -56024 -55539 -54149 -52759 -51369 -49976 -49152 -48329 -50844 -53356 -53486 -53613 -51354 -49096 -50091
-13610 -50091 -51082 -52074 -53065 -53374 -53680 -56370 -59061 -59012 -58960 -58908 -58856 -57857 -56855 -54421 -51988 -50959 -49927 -50326 -50725 -50948 -51168
-13589 -51168 -49003 -46838 -46942 -47043 -48574 -50106 -49581 -49055 -49961 -50863 -48131 -45399 -45053 -44703 -43939 -43175 -45750 -48321 -48004
-13570 -48004 -47688 -47371 -47050 -47132 -47214 -49681 -52144 -53866 -55588 -54924 -54257 -53072 -51887 -52133 -52376 -52562 -52748 -50550 -48347 -47751
-13550 -47751 -47155 -48943 -50728 -49059 -47389 -48105 -48817 -51820 -54824 -53534 -52241 -52800 -53359 -55349 -57336 -55849 -54362 -54306
-13532 -54306 -54246 -52849 -51451 -50054 -48653 -46830 -45008 -46525 -48038 -46782 -45526 -47609 -49689 -48824 -47960 -47512 -49927 -54697
-13514 -54697 -53743 -50941 -48138 -48824 -49510 -50195 -50881 -48973 -47065 -45157 -43249 -43611 -43972 -44334 -44695 -47680 -50665 -50311 -49957
-13495 -49957 -49141 -48325 -49894 -51463 -50497 -49532 -50952 -52372 -52103 -51831 -51563 -51291 -51858 -52420 -52987 -53549 -54101 -54649 -56631 -58610
-13475 -58610 -57611 -56609 -55610 -54608 -53754 -52897 -53475 -54049 -52569 -51086 -51038 -50986 -52025 -53061 -52670 -52275 -53851 -55424 -57000 -58573
-13455 -58573 -57391 -56210 -55029 -53844 -53020 -52197 -51373 -50546 -51720 -52894 -54067 -55238 -54861 -54485 -54108 -53728 -53445 -53162 -52879
-13436 -52879 -52592 -52905 -53218 -53531 -53840 -53102 -52364 -51626 -50885 -49312 -47740 -48552 -49361 -48276 -47188 -48489 -49786 -49894 -49998 -50106
-13416 -50106 -50210 -51742 -53270 -54801 -56329 -56460 -56586 -56717 -56844 -54488 -52130 -52159 -52185 -50933 -49678 -51764 -53848 -52402 -50952
-13397 -50952 -51891 -52826 -49413 -45996 -42582 -39165 -41274 -43380 -45485 -47591 -50058 -52521 -52599 -52677 -52223 -51764 -52737 -53710 -54388
-13378 -54388 -55062 -54306 -53549 -51381 -49208 -50374 -51541 -51489 -51433 -51556 -51679 -51142 -53464 -55726 -53218 -50356 -52260 -53568 -54876
-13359 -54876 -54090 -53303 -52517 -51727 -52014 -52301 -52588 -52871 -54954 -57037 -56736 -56430 -54310 -52189 -51500 -50807 -51127 -51444 -50330 -49215
-13339 -49215 -49745 -50270 -48410 -46551 -47870 -49186 -50501 -51817 -49290 -46760 -48642 -45753 -41479 -41975 -45690 -49405 -50229 -51053
-13321 -51053 -50624 -50195 -48202 -49070 -51190 -48541 -47412 -49145 -48969 -48794 -49856 -50915 -51977 -53035 -53262 -53486 -53713 -53937 -54895
-13302 -54895 -55849 -56806 -57760 -56691 -55618 -54548 -53475 -54388 -55301 -56214 -57123 -56635 -56147 -55659 -55167 -54090 -53013 -54321 -55625
-13283 -55625 -55472 -55319 -53736 -52148 -50807 -49465 -50509 -51548 -52234 -52920 -52174 -51425 -49897 -48370 -49227 -52942 -53680 -49648 -48478
-13264 -48478 -47304 -47296 -47289 -47281 -47274 -47147 -47021 -49279 -51537 -52454 -53370 -52856 -52342 -51947 -51552 -51157 -50762 -50404 -50046 -49689 -49331 -50702 -52074
-13241 -52074 -52014 -51954 -51969 -51984 -49614 -47244 -49167 -51090 -50628 -50166 -47997 -45828 -46044 -46260 -46625 -46991 -47356 -47721 -48668 -49614 -48176
-13220 -48176 -46737 -49383 -52029 -53244 -54459 -53113 -51768 -48992 -46216 -48388 -50561 -50348 -50136 -50408 -50680 -49521 -48362 -49111
-13202 -49111 -49860 -49178 -48496 -48064 -47632 -48630 -49625 -51340 -53054 -51906 -50754 -50695 -50635 -48966 -50155 -49469 -48783 -48276 -47766 -49927
-13182 -49927 -52089 -54429 -53903 -54604 -55305 -52964 -50620 -49130 -47639 -48832 -50020 -51123 -49364 -47606 -48705 -50583 -52461
-13165 -52461 -53385 -54310 -50911 -52282 -53833 -55383 -55390 -55398 -55405 -55413 -54824 -54235 -53646 -53057 -53143 -53229 -50632 -48034 -47136 -49100 -50885 -52670
-13143 -52670 -51712 -50754 -49797 -48839 -51995 -55152 -57056 -56098 -56236 -56374 -57585 -58793 -59348 -57041 -53780 -50516 -47285 -48824 -50900
-13124 -50900 -50110 -49145 -51041 -52580 -54116 -54272 -54429 -54585 -54738 -54149 -53561 -52972 -52379 -51940 -51500 -51060 -50617 -50743 -50870 -53680 -56486
-13103 -56486 -59210 -59068 -59109 -59147 -59665 -60179 -59266 -58349 -61848 -65344 -64073 -62799 -60365 -57928 -55495 -53057 -50482 -47904 -48191
-13084 -48191 -48474 -48999 -49521 -51656 -50926 -51600 -52271 -52767 -53259 -53218 -53173 -55994 -58811 -57932 -57052 -55994 -54932 -55245 -52696 -50147
-13064 -50147 -50456 -51038 -51619 -52379 -53136 -53538 -53941 -54164 -54384 -54910 -52573 -52025 -51474 -49167 -49722 -51708 -50829 -49119 -47408 -48381
-13044 -48381 -49350 -46715 -44080 -41267 -41311 -42038 -42765 -46711 -47796 -47181 -46566 -48992 -48552 -46685 -47680 -49748 -51817 -51798 -51779 -50330
-13024 -50330 -48876 -47859 -46842 -45824 -44807 -45727 -46648 -47568 -48485 -49584 -50684 -51783 -52882 -51060 -49238 -48668 -50956 -52573
-13006 -52573 -54187 -53121 -52051 -53430 -54805 -56184 -57559 -58431 -59299 -57309 -55316 -53654 -51988 -48716 -48302 -48299 -48291 -49897 -51500
-12987 -51500 -52778 -54052 -52648 -51239 -48768 -49156 -50978 -52797 -49789 -49640 -50747 -51850 -51071 -50292 -47904 -48377 -48820 -49264
-12969 -49264 -49886 -50505 -51030 -51556 -55122 -55826 -57276 -58726 -55405 -52081 -49603 -49983 -48757 -47527 -48925 -50318 -51712 -53106
-12951 -53106 -51895 -50680 -49469 -48254 -48563 -48869 -50784 -49838 -50408 -50978 -49938 -48895 -50449 -52003 -53378 -54749 -54641 -51671
-12933 -51671 -48701 -48589 -49376 -50162 -50769 -54235 -54727 -52353 -50516 -53449 -53583 -53713 -54500 -52424 -50434 -51302 -54377 -54589 -52092
-12914 -52092 -49592 -49596 -52461 -53080 -53698 -54496 -55290 -54209 -53128 -55387 -57641 -57186 -56732 -57708 -58681 -56586 -54492 -50788 -49942 -49543
-12894 -49543 -49145 -50535 -51921 -50270 -51481 -52692 -51038 -52361 -53684 -53397 -53106 -53236 -53367 -55107 -53982 -54567 -55148 -50602
-12876 -50602 -48917 -50635 -52349 -52036 -51723 -50453 -52040 -52018 -51995 -51291 -50583 -49100 -44755 -44513 -44267 -46227 -48187 -49495 -50799
-12857 -50799 -49719 -48638 -49797 -50952 -49722 -48492 -47863 -47229 -46775 -46320 -44479 -45496 -44908 -44315 -45664 -47009 -48358 -49704
-12839 -49704 -48116 -46525 -46488 -49309 -53028 -53881 -52413 -50941 -49364 -50646 -50322 -49994 -51578 -53158 -53967 -51910 -51943 -51973 -52007 -52036
-12819 -52036 -50192 -51205 -54608 -55144 -54246 -53348 -53523 -53698 -55185 -53810 -53866 -53922 -55319 -53855 -54000 -54146 -52323 -50501 -48858
-12800 -48858 -47214 -46312 -48273 -48623 -48973 -51142 -53311 -50412 -47512 -46611 -48571 -50531 -49629 -48876 -48124 -47192 -46260 -46905 -47546
-12781 -47546 -48187 -48828 -48876 -48921 -49145 -46506 -44423 -42336 -39713 -39951 -44039 -45262 -46842 -48422 -48664 -48902 -49141 -49379 -50099 -50814
-12761 -50814 -51530 -52245 -50065 -47881 -49037 -50192 -50874 -51552 -54436 -57321 -57854 -55521 -54623 -53721 -54313 -52040 -51381 -50717 -50661 -50602
-12741 -50602 -49115 -47624 -48165 -48701 -49242 -49778 -48168 -46555 -47330 -48101 -48220 -48336 -47978 -50479 -52879 -50505 -50997 -51485 -50993 -50497
-12721 -50497 -51735 -55830 -57179 -58524 -59452 -57518 -55975 -57291 -58070 -58849 -59132 -56549 -55577 -54604 -53903 -53199 -52495 -51790 -52245
-12702 -52245 -52696 -53147 -53598 -52621 -51641 -52867 -54093 -55197 -53434 -51850 -50266 -48806 -47341 -48261 -49182 -50788 -52394 -51615 -50833
-12683 -50833 -51097 -51362 -53057 -54749 -55469 -56188 -56907 -57622 -58342 -59061 -59780 -60496 -61871 -63246 -63190 -63130 -59318 -55506 -54079 -52648
-12663 -52648 -52823 -52998 -53173 -53344 -51254 -49163 -49458 -49748 -49212 -48675 -48138 -47598 -47926 -48254 -47151 -46044 -42810 -39575 -44449 -49320
-12643 -49320 -49901 -50482 -51064 -51641 -51235 -50829 -50423 -50013 -48653 -47293 -48317 -49338 -51630 -53922 -52875 -51824 -51343 -50863 -50382
-12624 -50382 -49897 -48910 -47922 -48366 -48806 -50114 -51422 -48437 -45448 -48157 -50866 -51190 -51511 -51418 -51325 -52662 -53997 -55014 -56031
-12605 -56031 -55618 -55200 -52163 -49126 -49428 -49726 -50430 -51135 -50408 -49678 -49607 -49536 -49465 -49391 -49681 -49972 -50263 -50553 -52245 -53937 -55629 -57321
-12583 -57321 -55837 -54354 -54302 -54250 -52141 -50032 -49353 -48675 -49800 -50926 -50620 -50315 -51142 -51969 -50412 -48854 -47937 -47021 -49443 -51865
-12563 -51865 -52051 -52238 -52424 -52610 -50423 -48235 -48433 -48630 -48828 -49025 -47613 -49063 -50318 -51574 -50624 -49674 -51854 -54034 -54783
-12544 -54783 -55532 -56300 -57067 -56404 -55741 -51798 -47855 -48027 -48198 -51962 -52864 -51261 -49659 -49130 -51463 -53616 -55770 -56892 -58010
-12525 -58010 -59609 -58342 -54157 -54738 -54846 -54951 -53821 -52689 -53766 -54839 -55439 -53173 -53296 -56277 -55979 -55677 -54127 -52573
-12507 -52573 -51470 -50363 -49439 -48511 -47006 -48358 -51146 -51068 -51619 -52167 -52539 -52908 -53423 -53937 -54630 -55319 -52554 -52651 -53523 -54392 -53132
-12486 -53132 -51872 -52044 -52212 -53426 -54641 -56035 -54563 -55808 -57052 -59728 -59538 -58278 -57019 -55759 -54496 -52707 -53780
-12469 -53780 -53721 -56519 -61438 -61587 -60306 -59020 -58968 -58916 -55346 -51776 -51217 -47796 -46163 -44531 -43682 -45694 -48481 -51269 -53221
-12450 -53221 -55174 -53788 -52402 -51444 -50486 -47740 -47855 -50833 -50948 -52853 -54757 -52890 -51023 -48798 -49435 -52696 -53095 -51764
-12432 -51764 -50434 -52118 -50941 -49763 -51448 -50598 -49748 -51463 -53177 -51135 -49092 -50389 -51686 -50091 -48496 -46901 -45306
-12415 -45306 -45385 -45463 -44110 -42757 -43313 -43868 -45019 -49033 -51600 -51306 -52800 -54295 -51526 -48757 -48373 -47989 -47524 -47058 -48023 -48984
-12395 -48984 -48370 -47755 -47319 -46879 -47278 -50538 -50758 -50974 -52476 -53978 -53751 -50658 -49003 -47345 -47893 -48440 -49201 -49957 -50535 -51112
-12375 -51112 -51843 -49707 -52521 -55334 -55469 -55599 -52390 -49182 -49577 -49972 -50546 -51120 -50292 -52327 -54362 -53534 -53125 -52715 -52126 -51537
-12355 -51537 -51694 -51850 -52007 -52163 -52894 -53620 -52920 -52215 -51336 -50453 -47963 -48332 -47453 -46570 -48254 -49935 -50158 -50378 -52212 -54041
-12335 -54041 -52923 -54664 -54019 -50512 -49484 -48451 -49804 -51157 -50158 -52018 -53877 -52875 -51161 -49443 -49931 -50419 -52033 -53643
-12317 -53643 -55252 -56862 -54451 -52036 -51828 -51619 -51772 -49059 -48731 -51265 -54280 -57291 -56844 -53534 -54287 -55036 -57041 -59042
-12299 -59042 -58126 -57205 -57719 -58230 -55763 -53292 -52435 -51574 -50658 -52599 -52935 -53266 -51749 -50229 -48712 -47192 -47464 -47732 -47647 -50419
-12279 -50419 -53300 -53315 -53870 -54421 -53635 -55707 -57783 -56993 -54902 -52812 -51973 -51135 -51280 -51425 -51749 -49212 -47196 -45180 -44416 -43652
-12259 -43652 -43395 -43137 -43059 -42981 -42754 -45388 -47665 -49942 -52070 -51336 -50423 -52372 -53128 -51023 -49096 -50032 -49923 -49815 -49886 -49957 -47952
-12238 -47952 -45944 -46324 -46700 -50181 -53657 -55409 -54295 -53110 -51921 -48947 -48832 -51552 -54269 -55439 -53743 -51533 -49320
-12221 -49320 -50270 -51217 -52584 -53948 -55495 -54175 -51675 -49171 -46312 -46312 -46137 -45958 -47214 -48466 -50732 -50136 -49897 -49655 -49357
-12202 -49357 -51921 -53054 -51321 -47945 -44568 -46141 -44848 -43946 -45906 -46078 -46245 -46387 -46529 -49711 -50028 -49603 -49178 -48574 -47967
-12183 -47967 -46469 -44971 -41863 -41613 -38625 -35636 -28891 -22142 -12032 7617 30964 44770 32551 10792 -9058
-12168 -9058 -23186 -33557 -38204 -39512 -40820 -42515 -44211 -45906 -47602 -48705 -49804 -50904 -52003 -52122 -52238 -50922 -49607
-12151 -49607 -49346 -49081 -48817 -48552 -49007 -49458 -48478 -47497 -46748 -45999 -45250 -44501 -44796 -45090 -46816 -48541 -48396 -48250 -46674 -45098 -45727
-12130 -45727 -46357 -46987 -47617 -48500 -49383 -50266 -51146 -52238 -53330 -52990 -52648 -51384 -50121 -48858 -47591 -47788 -47986 -48183 -48377 -49909
-12110 -49909 -51436 -52968 -54496 -55133 -55767 -54973 -54175 -54246 -54313 -55815 -57313 -55178 -53039 -52335 -51626 -53836 -56042 -55867 -55688 -54261
-12090 -54261 -52830 -52834 -52834 -53501 -54164 -53400 -52633 -51362 -50087 -50248 -50404 -51205 -52007 -52808 -53609 -54500 -55390 -56281 -57172 -57578 -57984 -58390
-12068 -58390 -58796 -58278 -57760 -54857 -51954 -51779 -51604 -51429 -51254 -52062 -52871 -50341 -47811 -45325 -42839 -41785 -40730 -43074 -45418
-12049 -45418 -47762 -50106 -51414 -52718 -54026 -55331 -54880 -54425 -53974 -53520 -54679 -55834 -55442 -52185 -50304 -51280 -52856 -54429
-12031 -54429 -53467 -52502 -51541 -50576 -51790 -53002 -52785 -52566 -51813 -51056 -52689 -54317 -54697 -55074 -59270 -60600 -61308 -59154 -57179
-12012 -57179 -55200 -51675 -51012 -50289 -52424 -53631 -51977 -50680 -49379 -50110 -50840 -49186 -47527 -48806 -50084 -47188 -47151 -47893
-11994 -47893 -45772 -47825 -49875 -51250 -52625 -53225 -50959 -49532 -48105 -46499 -44889 -45414 -45940 -46465 -46991 -46920 -46849 -46778 -46707 -46875
-11974 -46875 -47043 -47211 -47378 -48083 -48787 -49312 -52700 -54716 -56732 -58152 -56709 -57414 -58118 -57213 -56307 -55595 -54883 -55603 -56322 -55163
-11954 -55163 -54004 -52845 -51686 -51291 -50896 -51932 -52968 -55793 -58617 -59832 -61047 -60958 -58006 -56963 -55919 -52461 -53773 -54608
-11936 -54608 -55442 -54965 -51623 -51325 -51023 -51500 -51973 -50244 -48511 -45694 -45735 -45601 -50233 -54898 -56698 -54388 -52074 -51418 -53620
-11917 -53620 -54213 -54805 -54597 -54384 -54172 -53959 -53773 -53583 -55182 -53918 -52182 -53303 -55677 -55189 -53344 -51500 -50073 -51504 -52133
-11898 -52133 -49901 -48027 -46149 -46652 -47155 -47658 -48157 -49555 -50952 -49130 -50166 -52331 -51630 -52722 -53810 -53918 -54023 -52700
-11880 -52700 -51373 -47613 -43849 -44382 -44911 -45027 -45139 -46685 -48228 -49767 -51302 -51589 -51872 -50848 -52681 -53087 -53490 -52219 -53807
-11861 -53807 -53788 -53766 -54701 -55633 -52275 -48914 -50658 -52402 -52715 -53028 -54056 -55085 -54503 -56784 -56150 -55517 -55062 -54608 -51649 -48690
-11841 -48690 -47162 -45634 -46335 -47035 -46305 -50345 -52387 -51567 -50270 -48973 -49800 -50628 -51455 -52282 -51321 -50359 -50829 -51299 -50974 -50646
-11821 -50646 -50322 -49994 -49610 -49223 -48839 -48451 -49581 -50706 -51060 -48548 -45593 -42634 -40275 -40775 -43055 -45332 -44453 -43570 -45314
-11802 -45314 -47054 -48798 -50538 -50717 -50892 -51250 -51604 -49935 -51123 -53091 -55055 -58163 -61267 -63596 -63063 -61938 -60809 -59501
-11784 -59501 -58193 -57231 -56266 -55301 -54336 -53643 -52946 -52249 -51552 -52774 -53993 -53602 -53210 -53359 -50643 -47926 -48071 -49055 -50035 -47199
-11764 -47199 -44363 -42247 -44896 -48858 -49957 -50743 -51530 -53926 -53456 -53885 -57175 -56292 -55405 -55223 -55040 -54857 -54671 -53356 -52040
-11745 -52040 -49115 -49048 -48358 -47669 -49364 -51056 -52901 -51884 -51045 -50203 -51354 -52506 -52048 -51585 -52469 -50490 -49763 -51895 -52882
-11726 -52882 -51008 -49312 -50475 -52446 -54418 -52275 -50128 -48425 -46722 -46450 -46175 -47960 -49745 -51530 -53311 -52938 -52566 -50762
-11708 -50762 -48955 -48463 -47971 -47479 -46983 -48936 -50889 -51231 -51571 -52033 -49633 -47233 -47691 -49950 -52208 -51127 -50046 -50367 -47825
-11689 -47825 -49279 -50732 -52543 -54354 -53602 -52849 -53020 -50330 -48891 -50315 -52431 -51686 -51120 -53415 -50911 -48407 -49420 -50434
-11671 -50434 -49137 -47840 -47974 -48109 -48571 -49033 -49495 -49957 -48571 -47184 -45619 -46916 -48958 -51000 -52625 -51388 -49376 -50225
-11653 -50225 -50836 -54310 -55994 -54816 -53997 -53177 -53076 -52975 -54127 -55278 -57503 -56866 -56408 -55949 -54760 -53572 -50773 -47974 -51884
-11634 -51884 -52931 -52547 -52163 -49756 -52115 -53404 -51828 -49450 -47069 -46122 -45172 -46149 -49983 -51436 -50024 -49480 -48932 -49819 -50702
-11615 -50702 -51179 -54515 -56065 -57611 -57492 -54507 -53136 -51761 -52595 -53426 -52830 -52230 -54705 -57175 -58219 -59258 -57775 -56292
-11597 -56292 -53378 -50460 -48560 -46659 -48097 -49532 -48466 -47401 -48541 -49678 -52368 -52197 -52204 -52208 -53229 -54246 -52226 -53065 -52327
-11578 -52327 -51585 -52815 -51179 -49577 -50833 -51735 -52633 -51984 -51332 -50684 -50032 -50520 -51008 -51675 -49476 -49726 -49976 -51477 -52975 -51973
-11558 -51973 -50971 -49968 -48962 -49450 -49938 -50427 -50911 -51571 -52230 -50505 -48779 -49141 -49502 -51653 -50941 -49476 -50874 -51913 -52953
-11539 -52953 -54798 -56642 -56102 -55562 -54775 -53989 -54634 -55278 -56818 -58357 -54649 -50941 -48239 -45537 -46175 -46812 -46853 -46894 -45504 -44114
-11519 -44114 -43693 -43268 -46182 -49096 -49331 -49562 -47408 -45254 -43581 -41904 -43566 -45228 -45701 -46171 -46640 -47110 -46737 -46365 -45992
-11500 -45992 -45616 -45273 -44930 -46018 -47102 -47907 -48712 -49517 -50318 -49663 -49007 -48351 -47691 -48015 -48336 -48660 -48981 -48768 -48552 -49771 -50986
-11479 -50986 -51593 -52197 -51373 -50546 -50259 -49968 -49681 -49391 -50173 -50956 -51738 -52517 -52226 -51936 -51645 -51351 -50687 -50024 -49361 -48694 -48090 -47486
-11457 -47486 -50222 -52953 -54597 -56240 -56452 -56661 -56098 -55536 -54973 -54406 -54112 -53818 -53523 -53225 -52573 -51921 -51269 -50613 -51097 -51582 -52066
-11436 -52066 -52547 -53091 -53635 -52748 -51858 -51507 -51157 -52238 -53315 -51921 -50527 -45794 -41058 -35274 -29491 -23707 -17920 -18188 -18457
-11417 -18457 -23972 -29483 -36087 -42690 -45955 -49215 -50363 -51511 -52659 -53803 -52431 -51056 -52726 -51530 -51410 -51287 -52599
-11400 -52599 -51045 -53110 -55170 -54671 -54168 -52297 -50423 -51712 -52998 -54116 -52368 -52234 -52096 -50561 -49022 -49871 -50717 -51798
-11382 -51798 -52875 -54134 -52528 -53311 -54090 -53262 -52431 -52458 -52484 -53106 -48958 -44483 -44777 -46562 -48347 -48433 -51381 -54328 -54414 -55782
-11362 -55782 -57149 -56132 -55115 -55100 -57947 -60436 -58155 -54652 -51150 -52595 -54041 -53892 -53743 -55383 -54161 -53475 -55651 -55860
-11344 -55860 -56069 -55491 -52051 -51653 -54116 -56400 -53915 -53039 -52163 -51272 -53244 -53605 -53967 -52987 -52007 -54365 -56724 -58114 -59501
-11325 -59501 -60294 -58222 -55439 -55513 -56963 -58409 -57049 -52823 -50866 -53676 -54939 -56199 -56329 -56456 -56493 -56527 -55129 -53732 -53262
-11306 -53262 -52789 -52316 -51843 -50434 -49022 -50948 -52875 -52748 -52618 -54097 -52715 -50766 -48817 -46689 -44557 -44695 -44833 -44971 -45105
-11287 -45105 -47337 -49569 -51623 -53672 -55278 -54023 -51694 -54131 -54134 -54134 -53002 -51869 -51068 -50263 -52797 -55331 -54872 -54410 -51861
-11268 -51861 -49312 -46111 -47676 -50195 -55577 -58278 -60976 -60514 -60052 -58014 -55972 -55360 -54749 -53918 -53084 -52249 -51414 -49391 -47363
-11249 -47363 -48675 -49987 -50330 -50672 -51015 -51354 -51071 -50788 -50505 -50218 -50397 -50576 -50754 -50930 -50214 -49499 -47352 -45202 -48008 -50814
-11229 -50814 -51235 -51653 -50911 -50169 -49428 -48683 -50274 -51865 -51071 -50274 -49838 -49402 -48966 -48526 -49480 -50434 -49003 -47572 -46052 -44531
-11209 -44531 -45396 -46260 -47952 -49644 -49905 -50166 -49741 -49316 -50322 -51328 -51884 -52439 -52994 -53549 -55059 -56568 -53784 -51000 -51518
-11190 -51518 -52036 -52554 -53072 -53352 -53631 -55342 -57052 -56262 -55469 -54675 -53881 -51150 -48418 -49025 -49633 -51086 -52536 -51600 -50665 -51936
-11170 -51936 -53207 -52092 -50978 -50479 -49976 -51858 -53739 -53534 -53330 -53125 -52920 -52629 -52335 -52338 -52342 -51213 -54854 -55811 -56769 -55860 -54947
-11149 -54947 -54038 -53125 -54004 -54880 -53549 -52219 -50326 -51291 -52081 -52867 -53330 -53788 -54246 -54705 -53225 -51746 -51697 -51649 -50855 -50061 -52607
-11128 -52607 -55148 -56799 -58450 -58670 -58889 -58275 -57660 -55256 -55711 -56333 -54093 -52033 -52834 -52920 -53005 -53270 -53534 -53810 -54086 -54362 -54638
-11107 -54638 -52886 -51135 -49383 -47632 -48194 -48757 -49320 -49882 -48478 -47073 -49007 -50941 -51776 -52610 -54876 -57142 -57559 -57976 -56784
-11088 -56784 -55592 -54939 -51425 -52860 -54295 -54030 -53766 -53501 -53236 -54746 -56255 -57168 -55219 -53508 -54660 -54202 -53743 -49961 -49037
-11069 -49037 -49666 -50292 -53009 -52860 -54325 -55785 -56907 -58025 -59504 -58118 -57362 -59463 -58349 -57231 -58595 -59955 -60544 -58267
-11051 -58267 -56352 -54433 -52159 -52744 -53095 -53441 -52539 -51634 -53564 -55491 -55036 -54578 -54496 -54410 -54328 -54243 -53028 -51809 -50594 -49376
-11031 -49376 -51395 -53411 -53046 -52677 -51567 -50453 -50117 -52640 -54142 -55644 -55893 -56143 -56542 -56941 -57339 -57738 -58450 -59162 -56534
-11012 -56534 -53907 -55036 -56165 -55864 -55562 -55714 -55867 -56020 -56173 -55878 -55584 -55290 -54995 -55640 -56285 -56929 -57574 -56251 -54928 -55036
-10992 -55036 -55144 -55450 -55755 -58446 -61137 -57507 -53877 -52633 -51388 -51194 -51000 -54146 -57291 -56083 -54876 -51284 -47691 -47151
-10974 -47151 -46611 -49409 -52208 -51638 -51068 -52882 -54697 -54466 -54235 -54004 -53773 -55331 -56888 -58446 -60004 -58852 -57697 -57976 -58252
-10955 -58252 -58919 -59583 -58819 -58051 -55241 -52428 -52957 -53482 -55592 -57697 -58375 -59050 -56736 -54418 -52103 -49786 -49499 -49208 -48921
-10936 -48921 -48630 -46853 -45072 -44725 -44375 -47397 -50415 -52007 -53594 -55614 -57634 -58222 -58811 -59281 -59750 -58789 -57827 -57969 -58111
-10917 -58111 -56821 -55532 -54869 -54205 -52111 -47155 -44363 -46342 -47069 -44934 -47747 -50561 -48902 -47244 -47732 -48220 -48709 -49197
-10899 -49197 -47538 -45880 -44222 -42564 -44367 -46167 -50356 -54541 -52409 -50274 -49573 -48869 -50240 -51608 -52979 -54347 -55211
-10882 -55211 -56072 -56937 -57798 -57522 -57242 -56967 -56687 -55726 -54760 -53799 -52834 -54638 -56437 -56810 -57179 -54839 -52495 -53493 -54488 -53274
-10862 -53274 -52055 -53225 -54392 -53296 -52197 -53486 -54772 -53236 -51697 -53501 -55301 -54183 -53061 -56236 -59407 -60276 -61140
-10845 -61140 -60578 -60011 -59925 -59836 -59750 -59661 -58010 -56355 -54705 -53050 -52353 -51653 -54295 -56933 -55916 -54898 -55312 -55726 -56139 -56553 -54582
-10824 -54582 -52610 -52431 -52253 -53505 -54757 -54876 -54995 -55115 -55234 -54522 -53810 -53098 -52387 -53225 -54064 -54902 -55741 -54801 -53862 -52923 -51984
-10803 -51984 -52506 -53028 -53549 -54071 -49786 -45500 -47416 -49331 -50978 -52625 -52841 -53057 -53780 -54503 -53795 -53087 -51753 -50419 -49085
-10784 -49085 -47751 -47889 -48027 -51504 -54980 -56937 -58893 -60850 -62806 -61438 -60071 -58703 -57336 -56564 -55793 -55021 -54250 -53959
-10766 -53959 -53669 -53378 -53087 -53721 -54354 -54988 -55621 -55197 -54772 -55778 -56784 -55286 -53788 -54675 -55562 -54582 -53602 -52621 -51641 -52957
-10746 -52957 -54272 -54157 -54041 -56013 -57984 -56616 -55249 -55431 -55614 -54365 -53117 -52879 -52636 -49059 -45478 -47684 -49886 -50661
-10728 -50661 -51433 -48973 -46510 -47389 -48265 -53169 -58070 -56773 -55472 -55670 -55864 -56061 -56255 -54992 -53725 -52461 -51194 -50005
-10710 -50005 -48813 -47624 -46432 -46078 -45720 -45366 -45008 -45176 -45340 -45508 -45671 -45720 -45765 -47244 -48720 -52718 -56713 -61547 -60652 -60477
-10690 -60477 -60298 -59765 -59229 -58371 -57511 -56654 -55793 -56784 -57772 -56378 -54980 -54481 -53978 -52048 -50114 -50151 -50184 -50222 -50255 -50728 -51202 -51675
-10668 -51675 -52148 -51310 -50471 -49633 -48794 -49953 -51112 -52271 -53430 -53993 -54556 -55118 -55681 -55908 -56136 -56363 -56590 -53300 -50009 -49104
-10648 -49104 -48198 -47650 -47102 -47986 -48869 -49215 -49562 -48478 -47393 -47021 -46648 -48660 -50672 -48899 -47125 -46782 -46439 -46946 -47453 -47960
-10628 -47960 -48466 -50672 -52879 -53654 -54429 -53952 -53475 -56337 -59199 -59855 -60511 -58781 -57052 -55845 -54638 -56769 -58901 -58260 -57619
-10609 -57619 -56978 -56337 -56516 -56691 -58301 -59907 -59251 -58591 -57936 -57276 -57470 -57660 -59285 -60906 -62918 -64926 -62646 -60361 -58558
-10590 -58558 -56750 -56378 -56001 -55688 -55372 -56490 -57604 -57865 -58122 -56952 -55778 -57052 -58323 -57213 -56098 -53084 -50065 -50389
-10572 -50389 -50710 -50050 -49387 -53020 -56650 -55252 -53851 -52454 -51053 -51086 -51116 -51150 -51179 -49860 -48537 -48649 -48757 -49763 -50766 -51772
-10552 -51772 -52774 -53482 -54187 -53464 -52737 -52253 -51764 -54619 -57470 -57440 -57410 -57380 -57350 -54936 -52521 -51537 -50553 -49927 -49301 -48675 -48049 -49450
-10530 -49450 -50851 -52253 -53654 -55055 -56456 -56426 -56396 -57440 -58483 -57142 -55800 -55100 -54399 -53698 -52998 -53788 -54578 -53937 -53296 -53993
-10510 -53993 -54690 -55387 -56083 -59493 -62903 -61066 -59229 -54321 -49413 -51660 -53907 -51861 -49815 -51109 -52402 -51444 -50486 -51913
-10492 -51913 -53341 -54977 -56613 -53956 -51299 -52241 -53184 -54127 -55070 -55744 -56419 -57093 -57768 -57343 -56918 -56493 -56069 -55703 -55338 -53542
-10472 -53542 -51746 -50479 -49212 -53192 -57172 -56799 -56426 -56054 -55681 -56009 -56337 -56665 -56993 -55115 -53236 -52789 -52342 -54533 -56724
-10453 -56724 -53669 -50613 -48183 -45753 -45709 -45664 -46775 -47881 -48992 -50099 -49092 -48083 -48507 -48928 -49309 -49685 -51496 -53303 -54011
-10434 -54011 -54716 -52085 -49450 -48984 -48515 -48049 -47579 -49648 -51712 -51395 -51075 -51384 -51690 -53430 -55167 -56400 -57630 -57432 -57231
-10415 -57231 -55856 -54481 -53106 -51731 -50505 -49279 -50438 -51597 -51936 -52275 -49275 -46275 -46107 -45940 -45772 -45604 -46734 -47863
-10397 -47863 -44699 -41535 -41382 -41229 -43462 -45694 -48172 -50650 -51697 -52744 -51943 -51142 -50341 -49540 -49853 -50166 -53341 -56512 -57183
-10378 -57183 -57854 -59955 -62053 -61852 -61651 -60019 -58383 -56810 -55238 -56527 -57813 -56777 -55737 -57559 -59381 -59448 -59512 -58144
-10360 -58144 -56777 -54220 -51660 -51962 -52264 -56087 -59907 -57049 -54190 -55864 -57537 -57958 -58379 -57250 -58983 -60537 -57321 -57026
-10342 -57026 -59594 -60253 -60913 -59307 -57701 -56095 -54488 -54116 -53739 -51936 -50128 -52111 -54090 -53389 -52685 -52089 -54351 -54828 -50531
-10323 -50531 -48832 -47129 -49901 -52670 -55349 -58025 -59270 -60514 -62359 -64200 -63179 -62158 -60596 -59031 -56035 -53039 -52044
-10306 -52044 -51045 -51477 -51910 -52841 -53769 -53266 -52763 -53158 -53549 -53941 -54332 -52841 -51347 -49853 -48358 -49163 -49964 -47904 -45843 -45705
-10286 -45705 -45567 -46860 -48153 -48940 -49726 -47650 -45575 -46286 -46998 -50572 -54146 -53098 -52051 -52435 -52819 -53028 -53236 -53445 -53654
-10267 -53654 -54846 -56039 -57231 -58424 -59750 -61077 -59542 -58006 -58111 -58215 -59571 -60928 -62337 -60883 -59430 -60838 -60429
-10250 -60429 -60019 -58714 -54548 -53907 -56128 -58170 -57350 -57067 -56784 -56501 -56218 -54600 -55845 -55480 -55115 -54928 -54742 -54734 -54727 -53199 -54533
-10229 -54533 -54257 -53982 -53706 -53430 -54764 -53236 -52867 -52495 -51947 -51395 -50013 -48627 -47244 -45858 -47941 -50020 -51925 -53825 -54298
-10210 -54298 -51906 -51306 -50702 -49443 -51041 -52107 -56031 -56680 -54462 -51354 -48243 -47803 -50222 -49245 -51127 -54325 -54656 -54992
-10192 -54992 -58185 -61111 -61174 -60343 -59512 -55998 -55346 -53084 -50822 -51317 -51813 -52308 -52804 -52942 -53080 -53218 -53356 -53691 -54026 -54362 -54697
-10171 -54697 -54436 -54175 -54093 -54011 -51843 -52536 -51619 -50702 -50859 -51015 -51172 -51328 -53225 -55122 -55946 -53907 -51243 -51440 -54440 -57440
-10151 -57440 -56594 -52886 -52040 -51194 -50706 -47356 -45437 -46380 -49040 -51701 -51381 -48198 -47192 -46186 -46611 -47035 -47401 -50628 -52245
-10132 -52245 -51000 -54019 -54175 -51291 -48407 -44013 -44386 -46372 -48355 -48731 -49104 -49480 -49853 -48664 -47471 -49622 -51768 -52070
-10114 -52070 -52368 -50285 -48198 -49525 -50851 -53788 -53862 -53549 -53236 -51313 -49391 -48511 -47632 -48183 -48735 -49733 -50732 -51552 -52372 -49338
-10094 -49338 -43443 -43629 -43816 -39858 -38763 -39515 -43130 -45806 -45619 -45016 -44412 -41453 -41356 -42988 -44621 -43805 -42985 -42169 -41349 -42649
-10074 -42649 -43946 -40954 -37958 -37097 -36232 -36802 -37369 -38893 -40413 -41938 -43458 -44006 -44550 -45276 -45999 -43268 -43395 -40484 -37570
-10055 -37570 -38982 -40391 -43055 -45716 -46980 -45377 -43182 -40984 -39083 -40044 -39396 -38748 -40782 -42817 -46462 -47244 -45992 -44740
-10037 -44740 -44740 -44740 -43518 -42295 -43458 -44621 -45768 -46912 -45854 -44792 -43823 -45712 -45996 -46275 -44509 -42739 -42701 -45522 -46827
-10018 -46827 -48127 -50207 -47512 -42090 -41438 -42873 -44308 -45862 -44554 -43424 -42295 -43685 -45075 -46644 -45351 -44744 -44136
-10001 -44136 -44781 -45426 -45549 -45671 -45794 -45917 -45265 -44613 -43186 -38897 -38468 -38040 -37432 -36825 -37469 -38114 -38759 -39403 -37067 -34730 -32215
-9980 -32215 -32562 -34369 -36176 -36553 -39791 -42448 -45105 -47762 -50419 -53076 -52871 -52845 -52819 -50561 -48302 -45865 -46290 -45940 -45590
-9961 -45590 -43808 -44889 -44747 -44606 -44643 -44680 -43972 -43264 -45120 -46976 -47363 -50613 -53862 -54250 -53475 -52700 -48526 -47214 -47736 -45396
-9941 -45396 -42638 -39880 -36586 -36154 -37451 -38748 -37425 -36102 -32573 -29044 -25932 -25682 -25254 -24825 -26603 -28380 -33497 -38613
-9923 -38613 -40123 -41632 -43320 -45008 -42072 -41997 -43652 -45306 -46901 -48496 -48839 -49182 -48213 -50106 -51999 -51030 -50389 -49748 -52089
-9904 -52089 -54429 -55905 -54515 -53307 -52096 -51694 -51287 -50706 -52983 -53579 -54172 -54947 -55718 -52588 -49454 -49663 -49868 -48444 -47017
-9885 -47017 -47978 -48936 -52193 -55446 -57928 -57544 -56613 -55677 -52957 -53095 -54220 -55342 -54261 -53177 -55472 -57764 -57675 -57581 -56210
-9866 -56210 -54835 -53464 -52089 -48645 -45198 -44438 -46536 -47356 -48172 -48992 -49808 -50427 -48179 -47546 -46909 -47319 -47725 -48314 -48899 -46983
-9846 -46983 -47926 -49648 -51366 -51597 -51824 -53665 -52640 -49897 -47155 -47572 -47989 -49420 -50851 -53713 -56575 -55100 -53624 -52148
-9828 -52148 -50672 -51015 -51358 -54384 -52640 -52908 -53177 -52849 -52521 -53505 -49719 -46111 -49182 -52879 -53713 -55800 -55025 -53505 -51984
-9809 -51984 -50106 -51090 -50814 -50535 -50438 -50337 -49733 -49126 -48522 -47915 -49160 -50400 -53255 -53244 -52342 -51436 -50356 -49271 -49223 -49171 -49122 -49070
-9787 -49070 -49379 -49685 -49994 -50300 -50907 -51511 -52118 -52722 -52584 -52443 -52305 -52163 -53970 -55778 -53590 -54265 -55416 -56568 -57719 -58871
-9767 -58871 -60112 -58491 -57049 -55606 -53777 -51947 -52323 -52700 -55599 -55636 -52990 -50345 -51485 -52625 -52335 -52044 -53676 -55308
-9749 -55308 -56762 -58215 -59639 -58200 -58371 -58543 -56952 -55357 -53766 -52171 -52428 -52681 -53296 -51045 -47784 -47382 -47579 -47773 -50028
-9730 -50028 -52279 -53102 -53922 -54496 -55066 -57429 -56926 -54727 -55387 -54440 -50628 -48623 -46614 -48724 -50829 -51567 -52301 -54470 -56635
-9711 -56635 -58331 -60022 -60287 -60548 -59769 -58986 -56777 -54563 -54768 -54969 -55174 -55375 -53941 -52502 -51068 -49629 -52826 -56024 -59221
-9692 -59221 -62419 -62158 -61897 -61457 -61017 -61561 -59244 -58535 -57827 -56941 -56054 -55346 -54638 -52834 -53888 -54947 -53139 -53125 -53106 -52912 -52715
-9671 -52715 -53221 -53725 -54231 -54734 -53780 -52823 -51869 -50911 -52890 -54869 -54462 -54056 -53680 -53303 -52569 -54697 -57347 -57134 -57280 -57425 -56586
-9650 -56586 -55748 -54910 -54071 -54336 -54597 -52476 -50352 -49603 -48850 -49532 -50210 -50952 -51690 -50822 -52812 -53285 -53754 -53631 -50643 -49882 -49119
-9629 -49119 -50564 -52007 -51127 -50244 -49364 -48481 -48809 -49133 -49640 -50143 -51604 -55923 -60246 -61703 -61114 -60525 -59758 -58990 -58908 -58826 -58744
-9608 -58744 -58662 -57559 -56456 -56784 -57112 -56128 -55144 -56546 -57947 -57813 -57678 -57544 -57410 -55010 -52610 -54503 -56396 -58237 -60078
-9589 -60078 -61919 -63760 -64081 -64401 -64722 -65042 -63059 -61073 -59091 -57104 -57626 -58144 -60097 -62046 -59586 -57123 -56095 -55062
-9571 -55062 -56300 -57533 -56385 -55234 -55703 -56169 -58070 -59966 -60764 -61558 -59016 -56471 -57023 -57570 -58122 -58670 -56985 -55297 -55044
-9552 -55044 -54787 -55912 -57037 -55778 -54518 -52662 -50807 -52290 -53773 -54883 -55994 -54720 -53445 -56076 -58707 -59907 -61107
-9535 -61107 -60168 -59229 -58290 -57350 -54891 -52431 -52357 -52282 -54600 -56918 -57805 -58692 -59340 -59989 -57298 -54608 -54585 -54559 -56922 -59281 -59169
-9514 -59169 -59053 -58942 -58826 -59579 -60328 -59650 -58968 -58170 -57369 -56572 -55770 -58439 -61103 -62340 -63574 -59147 -54716 -52674 -50628 -51761
-9494 -51761 -52890 -54023 -55152 -55837 -56519 -57205 -57887 -56285 -54679 -53076 -51470 -49391 -47307 -48567 -49823 -51142 -52458 -51392
-9476 -51392 -50322 -51075 -51824 -52577 -53326 -52849 -52368 -50460 -48548 -49473 -50393 -51317 -52238 -53482 -54723 -55968 -57209 -56098 -54984
-9457 -54984 -55305 -55621 -55129 -54638 -54146 -53654 -52536 -51418 -51731 -52044 -51626 -51209 -52223 -53236 -52879 -52521 -53594 -54667 -53221 -51772
-9437 -51772 -52711 -53646 -52737 -51824 -50915 -50002 -49055 -48105 -47158 -46208 -47438 -48664 -49894 -51120 -51362 -51600 -50412 -49219 -49610 -49998
-9417 -49998 -52774 -55547 -54224 -52897 -53005 -53110 -51250 -49387 -52774 -56158 -58070 -59981 -59508 -59035 -57250 -55465 -53978 -52491
-9399 -52491 -51869 -56016 -59389 -59899 -59188 -63246 -64442 -65638 -63760 -61882 -58573 -55264 -53982 -52700 -52849 -52998 -51194 -49391
-9381 -49391 -47587 -45783 -44546 -43309 -43503 -43696 -42541 -41382 -43566 -45746 -50464 -55178 -59419 -58886 -58446 -60865 -61379 -61889
-9363 -61889 -60824 -59754 -58688 -57619 -56225 -54828 -53434 -52036 -52670 -53300 -53933 -54563 -54630 -54693 -54760 -54824 -53877 -52927 -51981 -51030 -49499
-9342 -49499 -47967 -51205 -54444 -55625 -56806 -55126 -53445 -51742 -50039 -49767 -49495 -51340 -53184 -52167 -51150 -49383 -47617
-9325 -47617 -52528 -57440 -58416 -59393 -60369 -61345 -61077 -60809 -60540 -60272 -60660 -61047 -61435 -61822 -63112 -64397 -62825 -61248 -59735 -58219
-9305 -58219 -56706 -55189 -54168 -53143 -52122 -51097 -50672 -50244 -49819 -49391 -48660 -47930 -47199 -46469 -47229 -47989 -48750 -49510 -48213 -46916
-9285 -46916 -45798 -49450 -52446 -55442 -55875 -56307 -55390 -54470 -53553 -52633 -51269 -49901 -49014 -45262 -42959 -45422 -47889 -50352 -49629
-9266 -49629 -48902 -48179 -47453 -48466 -49476 -50490 -51500 -53676 -55849 -58025 -60198 -58155 -56110 -55498 -54883 -54243 -53598 -50095 -46588
-9247 -46588 -44982 -43372 -41766 -40156 -42545 -44930 -47319 -49704 -50289 -50870 -51455 -52036 -50117 -48194 -46454 -44710 -43283 -44714
-9229 -44714 -42750 -43644 -47136 -47762 -48750 -49733 -51138 -52539 -51261 -49979 -50162 -53203 -56247 -56426 -53650 -50870 -49167 -50322
-9211 -50322 -50289 -50251 -50397 -50538 -50371 -50199 -50210 -50218 -49305 -51250 -51589 -51925 -50576 -49223 -49305 -49383 -47587 -45787 -45243 -47557 -48563 -49566
-9189 -49566 -50930 -52290 -50881 -52331 -53605 -54876 -56326 -57772 -56538 -55301 -53262 -54082 -53475 -52864 -50393 -50781 -52603 -54421
-9171 -54421 -52130 -52696 -52730 -55621 -55729 -52975 -50400 -50687 -51123 -51559 -52532 -50643 -47479 -47177 -49856 -52536 -53605 -54675 -54313
-9152 -54313 -53952 -52517 -51079 -50896 -53572 -54433 -55290 -53289 -54146 -53419 -52689 -50889 -49085 -48507 -50788 -52894 -54995 -54652 -54306
-9133 -54306 -56821 -59337 -60511 -61684 -62858 -64032 -64375 -64714 -62191 -59668 -58249 -56829 -56661 -59355 -59311 -59266 -59042 -61677 -62139
-9114 -62139 -59735 -57514 -58152 -55677 -53203 -53888 -57432 -60712 -61125 -63332 -65534 -65646 -65754 -64431 -63108 -61994 -60879 -59765
-9096 -59765 -58651 -58241 -57827 -57414 -57000 -55156 -53311 -53851 -54392 -54541 -54686 -53400 -52115 -51783 -51451 -51120 -50788 -52174 -53557 -54939
-9076 -54939 -56322 -55200 -54079 -52957 -51835 -51161 -50482 -49804 -49126 -48809 -48489 -49599 -50710 -49104 -47494 -47315 -47136 -46454 -45768
-9057 -45768 -45083 -44397 -43473 -42545 -39232 -35919 -34906 -33888 -31440 -28992 -27136 -25276 -25802 -26327 -22742 -19154 -13538 -7922
-9039 -7922 4621 26708 57619 98071 143825 189583 232122 265120 279229 260905 223025 171789 116495 70744
-9025 70744 39065 16926 -383 -11965 -18062 -24158 -27665 -31168 -32286 -33404 -34563 -35718 -36873 -38028 -38681 -39329
-9009 -39329 -39977 -40626 -40969 -41311 -41654 -41993 -44751 -47509 -45973 -44434 -44472 -44509 -44546 -44580 -45929 -47278 -48627 -49972 -44997 -40022
-8989 -40022 -39340 -38654 -39374 -40093 -37473 -34850 -36821 -38792 -39333 -39869 -41692 -43514 -45336 -47155 -44457 -41759 -40492 -39225
-8971 -39225 -39717 -40208 -37361 -34514 -29461 -24408 -24602 -24795 -25735 -26674 -31906 -37138 -39664 -42191 -44896 -47602 -44822 -44904 -46953
-8952 -46953 -43279 -39441 -41326 -43808 -43428 -44509 -48451 -49174 -49897 -49730 -49558 -50818 -52077 -50956 -49830 -46678 -43525 -38468
-8934 -38468 -39131 -42418 -45705 -50456 -49480 -48384 -47289 -45668 -44043 -42418 -40793 -38964 -37130 -38636 -40141 -42262 -44378
-8917 -44378 -44110 -43842 -43637 -43428 -44650 -45873 -48049 -50225 -50971 -51716 -51626 -51537 -50017 -48496 -45403 -42310 -42556 -42802 -42631 -42459
-8897 -42459 -44673 -46886 -46734 -46581 -44997 -43413 -42933 -42452 -41971 -41490 -39839 -38189 -38923 -39657 -41017 -42377 -41352 -40328 -37097
-8878 -37097 -33862 -34924 -35983 -34600 -33214 -34216 -35215 -36411 -37604 -37369 -37130 -38684 -40234 -41788 -43339 -45232 -47121 -49014
-8860 -49014 -50904 -49487 -48068 -46652 -45232 -45172 -45109 -47434 -49756 -50680 -51600 -50140 -48675 -49353 -50028 -49275 -48519 -48690 -48858 -49029
-8840 -49029 -49197 -53020 -56840 -59232 -61621 -59691 -57757 -57257 -56754 -58580 -60402 -59843 -59281 -56575 -53866 -55454 -57037 -57045 -57049 -59143
-8820 -59143 -61233 -62433 -58860 -56542 -54220 -54049 -53877 -56091 -58301 -56818 -55334 -55103 -54869 -55085 -52439 -50151 -52629 -55319
-8802 -55319 -58010 -55752 -53490 -53795 -54101 -54406 -54708 -52659 -50609 -48560 -46506 -46111 -45716 -45321 -44922 -44885 -44848 -44811 -44770 -44263 -43752
-8781 -43752 -43246 -42735 -44703 -46666 -45593 -44516 -44799 -49849 -51921 -53989 -58148 -57533 -54656 -54638 -54384 -54127 -54052 -53974 -52528 -51079
-8761 -51079 -51064 -51045 -49972 -48895 -47822 -46745 -47073 -47397 -50110 -52819 -53859 -54898 -54507 -54116 -54798 -55480 -54731 -53982 -52018 -50054
-8741 -50054 -50475 -50896 -50095 -49294 -48492 -47691 -46257 -44822 -46726 -48630 -50296 -51962 -52197 -52431 -52838 -53244 -53650 -54056 -54134 -54213 -55543
-8720 -55543 -52103 -51027 -49946 -49998 -50050 -50285 -50516 -52178 -53840 -54626 -55409 -57622 -59836 -58118 -56396 -54675 -52953 -53628 -54298
-8701 -54298 -54969 -55640 -56851 -58058 -57835 -57611 -57578 -57541 -56072 -59374 -63216 -64192 -62784 -61375 -60395 -59415 -59866 -60317 -59039 -57760
-8681 -57760 -53143 -48526 -42187 -35848 -32849 -29849 -25507 -21166 -18255 -15345 -18542 -21740 -24937 -28134 -31690 -35245 -36892
-8664 -36892 -41401 -46700 -47229 -47937 -45783 -47714 -49644 -49010 -48377 -50609 -52841 -52689 -52536 -51876 -51217 -52942 -54667 -53978 -53289
-8645 -53289 -52599 -51910 -50863 -49815 -48768 -47721 -47140 -46558 -47408 -48258 -50091 -51925 -53758 -55592 -55770 -55949 -56128 -56307 -56069 -55830
-8625 -55830 -54161 -52491 -51958 -51422 -52316 -53210 -53631 -54049 -52081 -50114 -49730 -49342 -51340 -53337 -51343 -49346 -48779 -48213 -47248 -46279
-8605 -46279 -46741 -47203 -48802 -50397 -49607 -48817 -46868 -44915 -45347 -45780 -47468 -49152 -49405 -49659 -47535 -45411 -43465 -38654 -37484
-8586 -37484 -36314 -36396 -36474 -39195 -41915 -42251 -42582 -43365 -44147 -43499 -42847 -43920 -44993 -46067 -47136 -45645 -44155 -42664 -41170
-8567 -41170 -39523 -37876 -40343 -42806 -44468 -43268 -43499 -43726 -45604 -44617 -45239 -45862 -45057 -44248 -42664 -38218 -37615 -37007 -37473
-8548 -37473 -37939 -37991 -35178 -31589 -28000 -28552 -29100 -27262 -25425 -23145 -20860 -18397 -15934 -13355 -7911 -2645 2620 7077
-8530 7077 11537 18860 29044 38875 51571 67428 83284 98719 118928 140091 164116 183174 202235 220998
-8516 220998 248347 281535 330945 405517 526834 712165 995762 1421264 2065231 3003500 4200304 5356206
-8504 5356206 6182981 6264566 5578192 4463117 3238334 2243817 1557443 1120418 838894 655533 524643
-8493 524643 431554 358503 307986 267963 241117 219045 200606 182167 162536 136231 110786 85341 66813
-8480 66813 53058 45322 37586 31757 23071 17362 11653 7196 2743 59 -2623 -5306 -7985 -8313 -8641 -8969 -9293 -10910
-8462 -10910 -12524 -14138 -15751 -19213 -22675 -24706 -26737 -31693 -36646 -37305 -37965 -39608 -41252 -42895 -44539 -42087 -39631
-8445 -39631 -40514 -41397 -41863 -42329 -42795 -43260 -45057 -46849 -47211 -47572 -47188 -46804 -46421 -46037 -46119 -46197 -46275 -46353 -46197 -46037 -48261 -50486
-8423 -50486 -52342 -54194 -52707 -51220 -51466 -51708 -49566 -47423 -46734 -46040 -47732 -49424 -49748 -50069 -51820 -53572 -53389 -53203 -54447
-8404 -54447 -55692 -53810 -51925 -52424 -52923 -51798 -50672 -49547 -48422 -46611 -44799 -45373 -45944 -47471 -48999 -49096 -49193 -47501 -45809
-8385 -45809 -46503 -47192 -47203 -47214 -45794 -44375 -43790 -43205 -45004 -46801 -48899 -50997 -51664 -52331 -50553 -48776 -49383 -52849 -56430 -55241
-8365 -55241 -49163 -47855 -46577 -48161 -48433 -48705 -47710 -46715 -47151 -47587 -46711 -45835 -44960 -44084 -42973 -41863 -42183 -42504 -41721 -40939
-8345 -40939 -39858 -43547 -45746 -47945 -49010 -50076 -49860 -49644 -52767 -55890 -56199 -56505 -56810 -57116 -58051 -58983 -53713 -48444 -47412
-8326 -47412 -46376 -47725 -49074 -46909 -44740 -42571 -40402 -39385 -38364 -37343 -36322 -36020 -35714 -35886 -40827 -44990 -46286 -44542
-8308 -44542 -45660 -47796 -49927 -50807 -51686 -52118 -52547 -51548 -50546 -47758 -44967 -42180 -39389 -41617 -43842 -46070 -48295 -47453
-8290 -47453 -46607 -45765 -44919 -44259 -43596 -45321 -47043 -48470 -49894 -47982 -46067 -46093 -46115 -46141 -46163 -43149 -40130 -37115 -34097 -34272
-8270 -34272 -34447 -33191 -31936 -33094 -34253 -32073 -29893 -29129 -28366 -29033 -29700 -28757 -27814 -26871 -25928 -24866 -23804 -22742 -21680
-8251 -21680 -17488 -13295 -6420 -4314 -1732 849 6175 11500 19001 21733 30188 35782 40444 45109 58361 71613
-8235 71613 88974 101570 123825 146080 173995 199052 226018 248213 287636 327062 373942 429408 531734
-8222 531734 690350 949016 1338379 1947752 2848096 4244873 6335202 8893594 9815895 8098622 5678256
-8211 5678256 3743230 2463600 1689466 1246367 959081 764333 616807 512215 433973 389120 352257
-8200 352257 322076 293591 275599 255342 220778 177386 140673 104674 81082 66321 58238 51467 44700 35156
-8186 35156 25612 16247 6886 56 -3912 -7702 -6718 -5947 -2313 -1423 -528 -2477 -4423 -7803 -11179 -13664 -16146 -20063
-8168 -20063 -23976 -31052 -38125 -38047 -37965 -38036 -38103 -38174 -38241 -36497 -34749 -36344 -37935 -40961 -43983 -47009 -50032 -50285 -50535 -48403
-8148 -48403 -46268 -43808 -41345 -38289 -40000 -42817 -40864 -37898 -34928 -36105 -42053 -46927 -48936 -49189 -49443 -47132 -44818
-8131 -44818 -40570 -36322 -35412 -34499 -36225 -37950 -42061 -46167 -47445 -48724 -48571 -48414 -48366 -48317 -48269 -48217 -52908 -57600 -57045 -56486
-8111 -56486 -54869 -53248 -53061 -52871 -53221 -53568 -52487 -51403 -48317 -45228 -46435 -47639 -46342 -45042 -43745 -42444 -43491 -44535
-8093 -44535 -45582 -46625 -47792 -48955 -48690 -48422 -46674 -44922 -45560 -46193 -46026 -45854 -49025 -52193 -50367 -48537 -46707 -44878
-8075 -44878 -45049 -45217 -45385 -45552 -45202 -44848 -44494 -44140 -42955 -41766 -40577 -39389 -40559 -41725 -42891 -44058 -44393 -44725 -45057 -45388
-8055 -45388 -46857 -48321 -49786 -51250 -49976 -48697 -47419 -46141 -46927 -47710 -48496 -49279 -47412 -45541 -46059 -46573 -46324 -46070 -45821
-8036 -45821 -45567 -43529 -41487 -39448 -37406 -37276 -37145 -30814 -24482 -19224 -13966 -13001 -12036 -15371 -18706 -22042 -25377 -28861
-8018 -28861 -32345 -37261 -42176 -44714 -47252 -47404 -47553 -48213 -48873 -47147 -45418 -45377 -45336 -45295 -45250 -46372 -47494 -48615 -49733 -50393
-7998 -50393 -51049 -51705 -52361 -51470 -50576 -49681 -48787 -48761 -48731 -48701 -48671 -49242 -49808 -50374 -50941 -51220 -51496 -51776 -52051 -51019 -49983 -48951 -47915
-7975 -47915 -47032 -46145 -45262 -44375 -45429 -46480 -47535 -48586 -49625 -50661 -50270 -49875 -51332 -52785 -50904 -49018 -46614 -44207
-7957 -44207 -41803 -39396 -39944 -40488 -43421 -46350 -46100 -45850 -45243 -47497 -48738 -47117 -47464 -44945 -44397 -43849 -41870 -44662 -46290
-7938 -46290 -47919 -49845 -51768 -53754 -55741 -54686 -56493 -56721 -56948 -56579 -53344 -51574 -49804 -49286 -48768 -48131 -47494 -46857 -46216
-7919 -46216 -46722 -47229 -47736 -48243 -46484 -44725 -42966 -41207 -41908 -42608 -43488 -44367 -44770 -48034 -51299 -51701 -52331 -52961 -53411 -53862
-7899 -53862 -51511 -49160 -45198 -44099 -44937 -45776 -46793 -47811 -49424 -51038 -52651 -54265 -53743 -53218 -52875 -52528 -49741 -49812 -48273
-7880 -48273 -46734 -45869 -45001 -44136 -43268 -42016 -40760 -43797 -46834 -47609 -48381 -47367 -49212 -50315 -48552 -45239 -41926 -39482
-7862 -39482 -37033 -36020 -35002 -34764 -34522 -34280 -34037 -34432 -34824 -35215 -35606 -37432 -39254 -42329 -45403 -49346 -50423 -48817 -47211
-7843 -47211 -46234 -45254 -42485 -42578 -43540 -41636 -42295 -45817 -46987 -48153 -47889 -50486 -52118 -53747 -55256 -56765 -57503 -53467 -52115
-7824 -52115 -50762 -50777 -50792 -50807 -50822 -53639 -56456 -56888 -57321 -59631 -61942 -60615 -56426 -53788 -51150 -51671 -52193 -50945 -49692 -49696 -49696
-7803 -49696 -51071 -49581 -47319 -45053 -42925 -40793 -40097 -39396 -42247 -45094 -46335 -47572 -48951 -47468 -47594 -47717 -46324 -44930
-7785 -44930 -48783 -52633 -53415 -54198 -57365 -60529 -59255 -57980 -56885 -55785 -55878 -58830 -56832 -54835 -53050 -51261 -55375 -56627
-7767 -56627 -57108 -57585 -56452 -55319 -54816 -54310 -55234 -56158 -55129 -54097 -53069 -52036 -50650 -49260 -51869 -51612 -48451 -45288 -41770
-7748 -41770 -38248 -35983 -30851 -25723 -23454 -23562 -23666 -22522 -21375 -23599 -25820 -30430 -35036 -39571 -44103 -44345 -44583 -45809
-7730 -45809 -47032 -50046 -50195 -45701 -44065 -43029 -41990 -42713 -43432 -45586 -47736 -50993 -54246 -55774 -54436 -54563 -54686 -56244
-7712 -56244 -54936 -54246 -53553 -54116 -54675 -57772 -60865 -63186 -62642 -61148 -59650 -60361 -61070 -57309 -53546 -52171 -50792 -53616 -56441
-7693 -56441 -57835 -59225 -58830 -58435 -58040 -57641 -57201 -56762 -56322 -55878 -51802 -47725 -45437 -43145 -40309 -43197 -45250 -47300 -50725
-7674 -50725 -54149 -57574 -60995 -61066 -61137 -61207 -61274 -59795 -58316 -55405 -52491 -49204 -45917 -45016 -44110 -42791 -41472 -41583 -41692 -44442
-7654 -44442 -47192 -46603 -46011 -47807 -49603 -49014 -48422 -50304 -52185 -52636 -53084 -52580 -52077 -50143 -48206 -48433 -48660 -46503 -44341
-7635 -44341 -42064 -39787 -40849 -41908 -46652 -51395 -54112 -51101 -51433 -51764 -54720 -57671 -61729 -60063 -56370 -52674 -53721
-7618 -53721 -54768 -53430 -52089 -52867 -53646 -54246 -54842 -56396 -55088 -52171 -54973 -54589 -54205 -57518 -60827 -64766 -68705 -67397
-7600 -67397 -66085 -61338 -56590 -54228 -51865 -48220 -44576 -40931 -37287 -39396 -41505 -40275 -39046 -40052 -41058 -42064 -43070
-7583 -43070 -44617 -46163 -47710 -49256 -50564 -51872 -52644 -56277 -61401 -60801 -60261 -59721 -56437 -53154 -52256 -51358 -52685 -54008
-7565 -54008 -51038 -48068 -49096 -50121 -47807 -45493 -45955 -46413 -49256 -52100 -54231 -56359 -56102 -52983 -49473 -50728 -51507 -52286
-7547 -52286 -53158 -54026 -53464 -52901 -53147 -53389 -53631 -53874 -49618 -45358 -40920 -36482 -31693 -24039 -15315 -11358 -4900 1561 8556
-7528 8556 22232 42210 66962 92902 121708 146277 167988 189576 202581 205279 199395 182656 161150 136480
-7514 136480 108952 82494 62717 41282 22713 11533 3220 -4829 -10012 -13769 -22291 -28328 -31503 -35155 -38807
-7499 -38807 -40104 -41401 -42698 -43995 -44963 -45932 -46901 -47870 -47468 -47065 -50002 -52938 -55733 -58528 -59892 -61256 -60652 -60048 -60876
-7480 -60876 -61703 -62590 -63477 -61979 -60481 -59012 -57544 -57507 -57470 -57019 -56568 -56296 -56020 -55808 -58457 -60749 -58267 -55722 -53177 -50333
-7460 -50333 -47486 -44673 -41859 -38032 -34201 -30505 -33486 -38912 -44334 -48478 -52621 -53426 -54228 -52551 -50874 -49197 -47516
-7443 -47516 -48224 -48932 -49640 -50345 -48127 -45906 -45295 -44684 -43123 -44419 -45716 -44151 -44900 -45645 -47643 -49640 -53698 -57753 -58290
-7424 -58290 -58826 -58651 -55610 -53881 -56922 -59549 -62173 -63484 -64796 -66447 -65232 -61334 -57436 -54347 -51254 -50546 -49838 -51377
-7406 -51377 -52912 -54451 -55987 -56601 -57213 -57827 -58439 -58181 -57921 -59273 -57760 -53121 -48478 -46342 -47065 -48962 -50855 -53110 -55360
-7387 -55360 -56423 -60343 -64267 -65325 -64874 -64420 -59676 -54928 -52331 -52592 -49040 -45485 -44200 -45772 -45735 -45698 -45664 -45627 -47974 -50322
-7367 -50322 -51086 -51846 -52607 -53367 -54071 -54772 -53266 -51761 -48273 -47643 -45582 -43521 -41077 -41490 -37909 -34328 -31391 -28451 -26167
-7348 -26167 -28652 -33288 -37920 -41420 -44919 -47755 -50587 -49130 -47669 -43469 -39266 -38107 -34082 -29331 -24576 -18572 -17335
-7331 -17335 -18934 -23391 -25109 -26823 -30635 -34443 -38077 -41706 -43104 -41636 -37011 -35245 -34242 -36098 -39210 -45180 -49066
-7314 -49066 -52949 -54630 -56307 -54608 -52905 -46551 -43059 -43328 -48362 -53933 -56642 -60593 -64539 -64967 -65396 -63980 -62560 -59709
-7296 -59709 -56859 -53952 -51041 -52722 -54403 -56236 -62836 -69436 -71265 -70833 -70397 -66324 -62251 -61342 -60429 -59516 -58603 -55379
-7278 -55379 -52152 -52267 -52379 -54164 -55946 -56300 -56650 -52666 -48679 -44993 -41304 -39556 -42575 -49115 -55651 -62977 -70300 -73334
-7260 -73334 -76363 -77131 -77895 -72462 -67025 -64170 -61312 -60663 -60011 -61271 -59665 -53590 -42742 -33881 -29789 -28082 -29238 -30273
-7242 -30273 -28447 -23163 -17879 -14995 -12110 -7795 -3480 1431 6342 4099 1856 -1281 -4419 -3264 -2108 0 2109
-7225 2109 879 -349 -1311 -2272 -4665 -7057 -6647 -6237 -7557 -8876 -10568 -17026 -20804 -21717 -20756 -16929 -13105 -12140 -8004
-7206 -8004 -6726 -5451 -4173 -961 2254 5467 8683 8377 8075 7770 7468 9577 11690 13799 15912 14026 12145 8828
-7188 8828 5515 9890 14269 21029 27792 35611 43432 51251 59073 66682 74296 79043 80933 83340 82889 82434 81983 82483
-7170 82483 82986 81935 78026 74806 74452 77254 77199 79345 81495 80124 73986 69201 67282 66254 65229 66884 75220 91602
-7152 91602 112757 135086 152646 162216 161291 156760 149367 145491 146385 153481 160576 171070 176794 181474 192833 201389
-7136 201389 209945 222336 231864 239366 244005 245008 246010 244628 243245 245217 250050 257745 270210 283093 295976 310587
-7120 310587 329969 351493 370160 383217 389601 387574 380780 376607 377206 386672 406635 434226 468499 508790 553855
-7105 553855 613226 679279 746774 811410 877713 954513 1043830 1137921 1231770 1330393 1443948 1575632 1735097
-7092 1735097 1927957 2152472 2402750 2668645 2946946 3245079 3561338 3910630 4304758 4767753 5329009
-7081 5329009 6007964 6817616 7823850 9195462 11171069 14032934 18137195 23936697 31982135 42842797
-7071 42842797 56608569 71354087 81382838 80575193 69723578 55041689 41486099 30953712 23457657
-7062 23457657 18284568 14658615 12042938 10112050 8693454 7656872 6873097 6224063 5649443 5128664
-7052 5128664 4640321 4175466 3746867 3362629 3022274 2721476 2468381 2251538 2059499 1892320 1746132
-7041 1746132 1613538 1501932 1415637 1357965 1324143 1311309 1320234 1365415 1440407 1521124 1551335 1491874 1358241
-7028 1358241 1195988 1045597 920013 814701 726561 649914 578994 516661 467683 434085 410030 391341
-7016 391341 369791 345047 323168 304390 291336 274880 258427 238993 219559 199589 179622 161086 148275
-7003 148275 140527 138507 136965 135422 134993 134568 130864 124298 117728 116886 110618 98626 83996 69365 56285 48933
-6987 48933 50163 64748 87681 104894 115455 116476 109985 97773 83977 70182 56386 42594 33650 30431 31027
-6972 31027 28765 24114 22325 17317 12312 10285 8258 6231 4207 63 -4080 -6018 -2228 2877 10844 20898 30952
-6955 30952 38800 46649 51158 55667 59609 63552 63381 57485 49682 39017 29723 26153 29003 31854 33989 36125 39005
-6938 39005 47610 52816 58022 59934 58983 59941 66623 75660 87558 95820 104082 113998 123914 134606 148163 165830
-6922 165830 183498 205160 229688 251693 276560 302978 334169 366489 405487 451163 507337 577138 666974
-6909 666974 793657 982354 1257561 1652018 2211754 3003313 4084509 5466213 6929244 7862814 7685219
-6898 7685219 6539323 5067757 3755513 2761726 2070355 1603171 1281952 1050583 886947 772084 690615
-6887 690615 630860 581599 533769 485943 441273 396603 356822 321815 290554 265970 245082 224199 199317
-6874 199317 174435 149553 127537 112299 99923 92079 90916 91687 87689 84585 81484 75011 71400 66477 61558 56546
-6858 56546 56304 54988 50815 45639 40462 35286 30114 27382 27513 26630 28612 32652 33829 32622 34280 34414 31686 29316
-6840 29316 29812 29991 33032 38040 49730 64428 79125 92213 98626 89582 71952 54918 40746 32059 26235 21662
-6824 21662 19952 16303 12655 8709 1900 -3655 -4441 -3797 -3152 -1143 864 -2373 -5611 -8224 -10836 -11838 -12841 -13605
-6806 -13605 -11507 -11197 -10888 -11950 -15874 -18188 -20503 -26092 -31682 -33933 -36184 -37570 -38956 -39508 -35289 -30922 -23692 -18252
-6788 -18252 -8041 4136 13453 21159 24096 15204 6313 462 -5388 -12341 -19295 -23864 -28433 -31198 -33963 -36728
-6772 -36728 -39493 -40261 -41028 -39411 -37794 -36527 -35260 -38107 -40954 -48481 -53147 -56680 -55442 -53207 -48109 -45932 -40894
-6755 -40894 -33411 -25928 -18565 -11201 -9140 -11850 -18077 -24304 -33810 -43316 -54134 -62091 -67170 -67479 -64092 -60704 -60417
-6738 -60417 -60130 -59843 -59557 -59665 -59773 -64174 -68575 -76523 -84472 -97310 -113010 -126205 -128907 -123679 -113681 -101417 -89153
-6721 -89153 -83924 -78696 -73583 -71332 -74448 -72793 -69141 -65489 -63924 -62359 -64237 -66115 -69305 -69633 -67278 -60153 -55532
-6704 -55532 -50911 -48608 -46305 -46089 -45869 -44967 -39295 -26051 -6126 18148 45285 63716 60209 40898 16818 -5116
-6688 -5116 -22276 -36646 -48153 -55666 -56497 -52323 -48150 -45347 -37771 -29349 -29513 -33135 -33892 -36828 -36903 -36620 -39195 -44982
-6670 -44982 -47907 -48030 -45291 -45086 -44881 -45750 -46618 -47889 -46298 -42023 -37749 -34906 -32062 -30650 -29238 -30139 -31041 -33553 -40834
-6651 -40834 -47043 -53251 -57075 -58036 -55316 -52595 -51902 -51209 -53378 -52685 -47699 -42713 -40246 -42549 -49145 -55737 -64151 -69704
-6633 -69704 -72216 -69954 -65280 -57745 -51522 -45295 -44289 -43283 -42277 -41267 -42254 -43242 -44050 -44855 -46946 -46175 -44449 -37950
-6615 -37950 -28772 -19593 -11548 -636 13162 29823 47439 65058 83537 102017 123359 141839 153939 163177
-6601 163177 163471 157088 142282 122707 102237 81767 59032 39158 22266 8235 -5037 -18311 -30452 -39731
-6587 -39731 -44688 -46782 -46968 -47155 -50069 -52983 -55897 -58811 -61278 -63745 -62754 -58901 -54179 -52316 -51824 -51332 -49651 -45105
-6569 -45105 -41215 -42094 -41904 -46480 -53739 -60999 -68083 -72301 -70140 -61301 -51776 -45109 -40052 -37857 -43089 -48317 -52115
-6552 -52115 -58774 -64423 -70069 -73330 -76591 -80570 -81685 -80891 -80097 -76371 -69778 -67956 -68996 -68042 -67084 -64695 -65169 -64125
-6534 -64125 -63078 -61912 -60745 -57019 -48519 -40913 -36169 -31783 -24531 -10959 9290 33054 48236 48989 39248 26849
-6518 26849 17317 11422 10296 9525 8757 8109 2690 -9558 -21803 -35778 -46890 -53594 -57432 -59542 -58789 -54567 -50341
-6501 -50341 -48023 -50475 -59489 -68500 -71072 -66965 -55700 -44431 -34175 -26782 -21866 -19809 -17931 -16053 -11346 -9498
-6485 -9498 -4967 2426 11217 17149 20041 16255 12186 8120 10732 13345 20693 34724 50483 59565 67867 80944
-6469 80944 97478 111151 128785 149285 176343 208171 248679 297776 358082 436514 541654 680188 862367
-6456 862367 1091291 1367748 1687137 2039320 2405813 2751195 3036479 3237097 3320374 3270990 3109989 2863009
-6444 2863009 2554024 2222378 1893594 1590449 1330236 1120015 954632 833013 739064 662521 598380 545687
-6432 545687 495859 446416 399834 354981 310133 267725 230087 200856 174491 153414 137106 124794 112485
-6419 112485 97937 80526 67826 61808 60347 61752 62143 59673 57765 55861 59978 68866 81313 98533 114919
-6404 114919 122718 126310 123229 114483 102874 95470 88069 81443 70047 56949 39084 19132 2042 -8954 -19947
-6389 -19947 -24203 -21781 -14413 -9904 -7363 -9591 -12949 -16306 -10243 592 15987 31381 49101 60146 68400 71885
-6373 71885 72268 69794 60876 47189 35827 27330 29108 30885 34750 35756 40544 50103 68188 86276 96401 90309
-6357 90309 75987 56900 41744 26589 15905 5224 -7024 -19269 -27102 -30165 -24468 -12088 6849 15294
-6343 15294 18308 10833 -3618 -18069 -19228 -17521 -18736 -28537 -35066 -33005 -29871 -33415 -38334 -46111 -49655 -53199
-6327 -53199 -52603 -49141 -45500 -50445 -57123 -66659 -73334 -82870 -83850 -81964 -76505 -68180 -49603 -26253 2519 31295
-6311 31295 58190 74594 83183 79375 67036 44208 21733 -737 -22627 -44513 -56743 -60384 -52521 -41792
-6297 -41792 -28086 -17238 -5678 -793 33 -11536 -25138 -43506 -61342 -64863 -49253 -33642 -14633 4375
-6283 4375 23384 36669 53472 67413 71337 54273 32976 11679 -5742 -17439 -21863 -16746 -4069 2884 -417
-6268 -417 -17074 -29677 -36556 -26264 -6431 11701 12663 9271 3018 -3174 -9368 -9658 -15673 -19027 -22377 -14398 -696
-6251 -696 11690 3093 -18144 -52737 -81461 -93010 -87565 -82121 -79959 -80656 -74973 -59750 -30124 -6219 -320 -11592
-6235 -11592 -24389 -37182 -46279 -55375 -68262 -81144 -92596 -104048 -118752 -133454 -134083 -121357 -102508 -89380
-6221 -89380 -78640 -62173 -36169 -15885 -2582 -6446 -19854 -36120 -45176 -54228 -53564 -52897 -57958 -80187 -97310
-6206 -97310 -101074 -104603 -113852 -116069 -104927 -69223 -23976 22489 47971 44830 9257 -51869 -130163 -205838 -268153
-6191 -268153 -308630 -331932 -332637 -319985 -296992 -276858 -264296 -268905 -282254 -289875 -255281 -153909 7084 154725
-6177 154725 233202 256348 260872 259675 274220 298305 328855 349869 374222 404298 443494 492233 546458 575879
-6163 575879 573427 538543 493284 448025 414580 390678 377628 374117 381991 384145 384451 381894 381645 371859 354024
-6148 354024 336189 325087 300634 268489 233482 212274 212058 239090 279478 327435 375395 426337 471555 498062
-6134 498062 507400 518170 546111 590923 618566 623075 618045 631337 673249 728279 762321 759157 723557 677226
-6120 677226 640434 626537 637445 665703 696823 737066 790665 873897 981933 1122076 1267944 1398070 1480497
-6107 1480497 1527388 1545659 1536980 1514945 1504105 1510436 1518437 1494002 1446910 1409358 1394701 1401033 1435809 1487760
-6093 1487760 1521344 1488152 1417869 1364763 1312606 1247097 1213201 1219376 1282309 1442554 1714889 2023479 2253599
-6080 2253599 2355889 2357189 2303162 2220988 2144542 2121039 2168135 2245576 2309665 2368220 2429640 2504413 2603994
-6067 2603994 2726347 2851565 2958118 3028422 3060489 3063936 3043772 3029332 3039695 3067230 3112653 3205775 3341514
-6054 3341514 3471529 3585803 3736329 3948029 4180717 4378585 4498225 4513705 4443326 4342896 4274901 4274164
-6042 4274164 4351653 4508801 4740360 5025462 5377343 5842987 6466995 7192244 7888874 8488793 9088712
-6031 9088712 9816737 10672602 11560543 12435130 13340121 14399662 15672421 17240917 19181018 21500811
-6021 21500811 24120634 26990404 30090201 33394156 36867444 40636470 44819939 49566267 55144952
-6012 55144952 61549792 68639829 77334487 90079554 110015805 140511153 185978447 252505557 348058832
-6003 348058832 481901395 659457690 859377928 999999999 990635134 848396572 658933219 484594512
-5995 484594512 350494583 258147074 197482105 156765093 128569967 108722255 95346908 87369240
-5987 87369240 83887731 82926664 81145645 75603995 66919096 57480550 49106180 42305896 36910603 32593318
-5977 32593318 29205459 26525464 24450090 22910860 21934482 21475168 21646801 22545377 23849157 24185592
-5967 24185592 22681502 20263488 18110684 16623766 15774948 15447010 15614671 16360449 17904152 20529681
-5957 20529681 24658464 30872668 39609823 49512759 54941232 51014866 41135737 30976131 23067233
-5948 23067233 17629168 14087998 11716420 10061768 8870754 8008779 7385300 6987442 6690706 6307633
-5938 6307633 5762382 5182072 4630382 4161015 3796590 3549745 3358231 3184482 2993564 2798473 2603382
-5927 2603382 2442884 2326274 2238879 2111417 1939352 1734855 1525588 1329677 1227060 1267545 1447551
-5916 1447551 1659993 1826282 1899083 1884356 1802849 1686340 1548846 1408967 1229020 1050381 915630 848851
-5904 848851 810691 791328 766241 722074 634024 542277 479149 451916 403695 338465 273236 227683 195486
-5891 195486 195844 240085 334411 442093 548958 631020 687563 711670 724567 731741 741299 729870 693786 625267
-5877 625267 545299 474871 446300 461612 496959 515133 522116 515748 519396 532584 546901 536419 517290 501024
-5863 501024 507590 519884 546667 573449 605713 628442 640080 623098 593684 547103 509584 477789 454994 426479
-5849 426479 404343 385069 376897 363005 353167 346191 343146 330565 308027 272133 230199 171096 115090 72444
-5835 72444 64912 86004 124265 152989 178191 193858 205525 217197 240611 261166 275696 276873 282493 305288
-5821 305288 400822 566954 736660 843406 885516 868482 830263 801587 796519 804811 816199 814235 799627
-5808 799627 760219 704131 623239 542049 463722 404652 366571 360925 380083 420542 458139 484586 490046 483640
-5794 483640 471510 459976 438903 414658 390413 378213 371736 367585 357709 344793 329015 316397 309503 316621
-5780 316621 337094 358492 366534 374158 381783 395686 406728 412344 400788 386817 372846 358816 339062 324823
-5766 324823 313446 304930 290691 272875 257920 261747 278930 300649 309011 310517 306298 307565 311694 312186 295506
-5751 295506 265098 228965 204519 193429 203744 219783 229025 224911 219738 214570 209815 205063 198698 189475 183647
-5736 183647 187362 209408 231458 242533 232625 212636 192650 188044 192982 199250 199798 191994 178471 159041 130074
-5721 130074 102297 80247 77288 87689 98921 107294 119838 135247 155899 176555 190578 187433 169378 145603
-5707 145603 126624 113372 111922 116200 129359 142521 155202 167887 179287 177334 161068 135265 107555 79848
-5693 79848 53211 32301 24386 26015 39684 62896 91084 119275 149847 174699 193109 211521 228142 235226
-5679 235226 236698 228634 210429 189367 167705 148908 141615 140050 139197 135485 130279 122215 113551 107752 107316 101160
-5663 101160 93487 80094 72183 69999 67394 59069 50919 45635 47055 58018 73867 86858 92153 87912 80329 67025
-5647 67025 54452 44744 39087 28664 13050 -2559 -12151 -11246 -2146 11727 23689 28977 28657 23570 23786 24006
-5631 24006 18450 8127 -4464 -17052 -24695 -27564 -26741 -21143 -9215 2716 17030 31347 46794 57474 63917
-5616 63917 61778 60511 62110 63943 70550 79241 85073 86548 81350 74419 67491 60023 57329 61160 67856 74549 78384
-5599 78384 79543 75935 70714 65497 61141 59650 61674 66563 72298 71359 67375 63396 59173 57817 62658 67502 70804
-5582 70804 69339 64353 59371 53222 47077 41882 39553 37355 38022 37254 36490 38286 40086 47606 57992 67934 80743
-5565 80743 93547 103493 108785 111218 115258 119301 124935 133436 145390 167843 196820 225801 257343 293658 333002
-5550 333002 377121 430179 497551 580660 691439 836915 1029140 1277320 1583696 1934549 2307347 2677876
-5538 2677876 3007386 3257712 3400240 3409777 3286712 3055425 2741145 2378982 2016823 1674515 1371325
-5527 1371325 1123269 933409 786595 676991 592305 527658 476004 429125 385602 346850 314180 286283
-5515 286283 257190 230959 205324 182555 163777 147861 138027 134874 134222 138340 144008 156358 167209 169475 162201
-5500 162201 152068 139130 130961 131796 141220 152996 164772 175176 182723 184660 183736 177029 163647 145864 128081
-5485 128081 106541 85006 63705 42404 21699 -1862 -23536 -38531 -43272 -33698 -18345 -5854 1032 3152
-5471 3152 4822 9353 14183 19016 22594 23309 22296 18424 13087 12521 15294 18070 18994 19918 20246 25348 28895 27677
-5453 27677 23537 22258 18174 14094 10013 5932 1848 -5093 -11857 -15759 -17756 -16888 -12323 -2988 8653 15528 16262
-5436 16262 10319 3536 -3241 -11510 -15010 -17767 -17659 -14391 -11123 -9081 -4173 -2485 2064 8936 15811 18271 17872
-5419 17872 16009 14149 12286 10427 11604 15648 18077 20511 19840 19173 16296 13423 12104 13650 16266 21748 23499
-5402 23499 25254 27185 29119 32033 34951 32618 30289 27718 25150 18286 11425 8597 5772 2948 123 -1125 -2369
-5385 -2369 -275 1818 6726 11638 9394 7151 969 -5209 -9778 -14346 -18609 -20007 -23133 -21490 -18539 -12722 -3267
-5368 -3267 6186 14608 18264 16493 14723 9938 5157 1807 -1542 -2492 -3442 -4393 -5339 -7035 -8730 -10903 -8302 -5719
-5350 -5719 -5999 -8961 -14782 -21203 -27624 -32614 -32830 -32968 -33106 -30560 -28011 -25138 -22265 -19392 -16515 -15461 -14406 -15736
-5332 -15736 -17063 -17469 -17875 -23230 -28582 -32748 -32144 -30765 -26521 -24039 -24419 -27780 -28276 -24199 -17260 -11753 -6241 -3267
-5314 -3267 -294 -2567 -4836 -7352 -9863 -9990 -10117 -10426 -10732 -12468 -14205 -13590 -12971 -14738 -16504 -18274 -20040 -23238 -26435
-5295 -26435 -25940 -25440 -21606 -17767 -14708 -11645 -12878 -14108 -14648 -15185 -13340 -6722 -2552 -1240 -111 1021 499 4747
-5277 4747 11560 23142 34068 42132 49361 51821 44957 35230 23954 15539 6439 201 -1922 -1184 -2071 -2954 -3659
-5260 -3659 -4363 -4982 -5596 -4780 -3964 -6841 -9714 -16880 -26908 -37059 -42437 -47039 -48779 -45739 -42694 -37086 -31477 -28347
-5242 -28347 -25213 -23510 -21807 -23305 -24799 -26294 -27788 -29316 -30840 -30933 -31026 -28652 -26279 -27244 -28205 -32748 -37291 -40402
-5224 -40402 -43510 -41546 -39582 -38871 -38155 -36907 -32796 -29998 -31965 -37361 -42757 -45113 -47464 -46182 -44900 -41233 -37563
-5207 -37563 -32129 -26696 -25556 -24412 -28161 -31909 -34227 -36542 -39694 -42843 -47423 -52003 -52472 -52938 -51019 -49100 -49197 -49290
-5189 -49290 -50814 -52338 -53866 -55390 -54529 -53669 -52521 -51369 -53557 -55744 -57876 -60004 -56885 -53766 -51582 -49394 -48638 -47881
-5171 -47881 -47486 -47088 -44304 -41520 -39288 -37056 -37209 -37361 -39273 -41185 -43096 -45008 -47881 -50754 -50289 -49823 -49655 -49487 -49320
-5152 -49320 -49152 -48489 -47825 -50501 -53177 -54272 -55368 -54734 -54101 -53944 -49018 -45344 -46439 -46640 -43980 -39888 -35796 -38744 -41688
-5133 -41688 -42251 -42810 -41852 -40890 -40112 -39329 -43275 -50080 -56113 -56419 -53628 -50833 -47684 -44531 -45139 -45742 -48377 -51008 -53821
-5114 -53821 -50907 -51217 -51522 -50028 -48530 -48466 -48399 -47173 -45944 -44718 -43488 -43995 -44498 -45001 -45504 -43268 -41028 -37358 -33687
-5095 -33687 -34939 -36187 -36005 -35822 -32215 -28604 -24993 -21382 -19306 -17227 -19440 -21654 -22828 -23998 -27553 -31108 -34175
-5078 -34175 -37238 -36009 -34779 -28753 -22724 -22299 -21874 -21691 -27233 -31164 -32234 -33780 -35327 -36694 -38062 -40846 -43629 -42120
-5060 -42120 -40611 -38625 -36638 -37037 -37436 -39143 -40849 -42556 -44263 -46685 -49107 -48191 -47274 -45180 -43085 -40991 -38897 -37756
-5042 -37756 -36616 -35833 -35051 -32222 -35114 -37831 -37682 -38222 -38759 -35778 -32796 -32651 -32502 -30926 -29346 -30452 -31555 -34089 -36623
-5023 -36623 -39374 -42120 -43439 -44755 -47654 -50550 -53445 -56341 -54842 -53341 -53274 -53203 -50632 -48056 -48045 -48034 -49752 -54332 -57302
-5004 -57302 -60272 -59128 -57984 -53680 -49372 -45485 -44460 -42005 -39549 -37719 -38751 -40559 -42362 -44293 -46223 -48511 -47937
-4987 -47937 -45187 -45299 -46007 -46711 -46383 -46055 -45727 -45399 -44416 -43432 -45787 -48138 -47114 -46089 -43454 -43682 -41613 -39545 -40875
-4968 -40875 -39344 -37149 -37816 -38304 -38792 -36419 -36907 -38349 -39791 -39974 -43018 -43022 -40164 -37961 -40529 -43275 -43160 -41777 -40395
-4949 -40395 -39191 -35125 -33832 -35401 -33929 -32457 -34358 -39117 -42269 -45418 -47796 -50169 -49208 -48243 -48161 -48075 -47814 -47550 -46693
-4930 -46693 -42970 -39251 -38390 -38494 -38595 -40309 -42019 -41885 -41747 -37499 -33247 -33739 -37089 -38833 -40574 -43093 -45608 -46517 -50285
-4911 -50285 -55983 -61677 -62963 -61383 -60939 -60492 -58260 -58886 -58099 -57309 -53542 -49771 -45467 -44021 -41744 -42325 -41319 -40309
-4893 -40309 -41092 -39008 -34604 -30195 -25731 -24125 -24430 -29502 -32073 -34641 -34738 -34831 -30635 -26435 -22466 -18498 -14529 -13422
-4875 -13422 -12852 -15144 -20298 -25451 -30762 -36072 -37089 -38107 -37007 -35908 -37194 -38479 -39605 -40730 -41856 -42981 -45209
-4858 -45209 -47438 -48235 -49033 -46320 -43607 -43279 -42951 -42474 -41997 -39910 -40685 -42333 -43980 -42467 -40954 -40007 -39061 -38293 -37525 -37212
-4838 -37212 -39761 -40402 -41043 -42280 -38748 -36467 -34186 -33214 -32241 -32044 -34708 -35882 -37056 -36202 -35349 -32073 -31660 -32975 -34291
-4819 -34291 -37723 -41155 -42858 -41699 -41692 -41680 -41494 -41304 -41744 -42180 -39459 -36735 -35289 -36702 -39191 -44539 -46551 -48560 -49320
-4800 -49320 -50076 -49707 -49335 -47535 -45731 -43812 -41889 -41580 -46037 -48999 -51958 -52834 -50844 -49394 -52711 -52990 -56128 -58066
-4782 -58066 -60004 -60689 -61375 -61733 -62091 -62448 -62806 -61047 -59288 -58781 -58275 -56963 -52789 -48615 -47304 -47192 -47080 -47147 -47214 -48593
-4762 -48593 -49972 -48012 -46052 -43659 -41267 -43167 -45068 -45657 -46245 -49219 -52193 -52405 -52614 -51395 -50173 -52294 -54410 -53192
-4744 -53192 -51969 -48887 -45802 -41289 -36773 -36642 -36508 -38763 -41013 -42810 -44602 -46398 -48191 -48288 -48381 -47047 -45709 -46715
-4726 -46715 -47717 -46339 -44956 -40566 -36173 -33214 -30251 -31056 -31857 -32662 -33463 -34149 -34831 -35517 -36199 -37317 -38431 -41934 -45433
-4707 -45433 -50039 -54641 -54000 -53356 -48660 -43961 -40697 -37428 -36310 -35189 -38543 -41893 -47125 -55215 -58181 -56374 -55346
-4690 -55346 -54313 -52987 -51656 -52405 -53154 -53903 -54652 -57906 -61159 -62027 -62896 -61915 -60935 -59478 -55159 -53493 -56598 -60179 -63760
-4671 -63760 -63477 -63194 -62910 -62627 -62433 -62240 -60615 -58990 -57887 -56784 -54250 -51716 -48705 -45694 -46022 -46350 -47069 -47788 -49938
-4652 -49938 -52089 -50661 -49234 -47807 -46380 -46935 -47490 -48045 -48601 -47993 -47386 -48209 -49033 -47934 -46834 -47643 -45590 -44103 -47386
-4633 -47386 -47807 -48228 -48604 -48981 -49357 -49733 -49603 -49473 -49342 -49212 -48705 -48194 -45303 -42407 -39336 -36262 -36530 -36795 -38673 -40548
-4613 -40548 -42426 -44300 -46924 -49543 -53598 -57649 -58897 -60142 -58051 -55957 -53479 -50997 -49950 -48899 -49521 -50140 -50941 -51738
-4595 -51738 -50274 -51667 -54138 -51835 -52074 -52312 -50822 -49327 -46823 -44319 -41815 -39307 -39232 -39158 -42422 -45683 -45876 -46070 -42925
-4576 -42925 -39776 -39005 -38233 -36031 -33829 -36486 -39143 -44185 -49227 -49961 -50695 -51429 -52163 -52301 -52439 -52577 -52715 -51068 -49420
-4557 -49420 -49204 -48984 -49573 -50162 -49320 -48474 -48466 -48459 -51790 -55118 -61997 -68877 -69555 -70229 -67248 -64263 -61282 -58297 -57611 -56922 -53016
-4536 -53016 -44337 -39374 -39176 -41248 -43316 -43033 -42746 -42463 -42176 -42456 -42731 -40626 -38517 -38081 -37641 -37205 -36765 -39847 -42925 -41714
-4516 -41714 -40499 -40302 -40100 -41334 -42564 -42731 -42895 -43063 -43227 -40145 -37059 -36363 -35662 -37186 -38707 -36892 -35073 -35942 -36806
-4497 -36806 -39105 -41401 -43059 -44718 -46555 -45530 -42001 -38472 -38103 -37734 -37633 -37533 -38684 -39836 -43402 -44106 -44990 -45873 -44975
-4478 -44975 -44077 -43178 -42280 -40428 -38576 -41017 -43458 -44572 -45686 -48410 -48273 -45750 -43227 -40525 -37823 -35748 -33668 -33978
-4460 -33978 -34283 -34175 -34063 -33955 -33843 -33348 -32849 -29968 -27084 -25813 -24538 -24699 -24855 -26797 -28734 -29066 -32256 -36404 -40548
-4441 -40548 -44099 -44785 -43715 -42642 -41393 -40141 -41904 -43663 -43995 -44322 -43372 -42422 -43082 -43741 -41360 -41841 -42321 -39940 -42269
-4422 -42269 -44598 -46450 -48302 -50959 -48847 -47032 -45217 -45429 -45642 -46033 -46424 -47054 -50546 -52249 -53952 -55878 -54943 -51325
-4404 -51325 -47706 -42329 -36951 -33303 -29655 -26756 -28626 -32107 -35588 -40797 -46007 -45016 -44024 -44404 -44785 -43913 -43041 -41632
-4386 -41632 -43085 -44181 -45276 -46625 -45113 -47416 -49719 -47967 -43354 -41125 -41759 -44345 -46931 -49875 -49957 -51619 -53281 -53333
-4368 -53333 -53385 -54380 -55372 -56188 -57000 -56355 -52845 -51127 -49405 -49342 -52137 -53147 -54153 -55014 -53009 -52141 -54131 -54798 -50691 -49450
-4348 -49450 -48206 -49707 -51205 -54496 -54921 -53397 -54731 -56665 -58595 -59068 -59538 -59236 -56069 -53054 -50039 -48276 -46514 -44453
-4330 -44453 -42392 -41762 -41133 -43283 -45433 -46152 -46871 -50155 -53438 -55946 -55592 -55323 -55055 -55860 -51895 -49599 -47304 -48049 -48794
-4311 -48794 -45835 -42877 -44867 -43995 -42318 -40641 -41170 -41699 -40350 -38997 -37648 -36296 -37004 -37708 -36210 -34708 -34075 -36299
-4293 -36299 -40257 -44211 -44770 -45325 -45705 -46081 -49104 -49260 -49242 -52081 -54298 -53650 -52409 -51164 -51563 -51958 -55219 -53706 -50825
-4274 -50825 -50803 -50784 -47900 -46499 -49864 -48940 -48012 -49145 -50274 -48068 -45858 -47043 -48224 -47978 -47729 -47632 -47531 -48865 -50195 -49614
-4254 -49614 -49029 -48448 -47863 -46029 -44192 -44744 -45291 -45388 -45481 -45578 -45671 -47140 -48604 -50073 -51537 -52111 -52681 -51824 -50963 -51865 -52763 -51280
-4232 -51280 -49793 -46238 -42679 -42463 -42243 -41878 -41509 -43529 -45545 -44945 -44341 -43741 -43137 -43790 -44438 -48429 -52417 -54097 -55774
-4213 -55774 -57455 -59132 -57950 -56765 -57015 -57261 -59344 -61424 -63507 -65586 -65970 -66350 -66734 -67114 -64367 -61617 -58871 -56121
-4195 -56121 -54626 -53128 -54019 -54906 -56218 -57526 -56452 -55375 -51738 -48097 -46845 -45590 -44278 -42962 -45944 -48921 -50233
-4178 -50233 -51541 -50468 -49391 -48135 -46879 -47054 -47229 -48001 -48772 -50020 -46499 -47032 -50427 -50482 -50538 -49879 -49219 -49991 -50762 -51541
-4158 -51541 -52320 -50713 -49107 -48574 -48042 -48940 -49838 -50989 -52141 -54723 -57306 -60872 -64438 -65620 -66801 -66044 -65284 -64524 -63764
-4139 -63764 -62292 -60816 -59340 -57865 -53814 -49760 -49998 -50237 -51224 -52208 -51761 -51313 -51287 -51261 -52666 -54071 -53330 -52588 -49461 -46335
-4119 -46335 -46965 -47594 -46793 -45992 -47665 -49338 -46898 -44457 -43484 -45373 -45474 -45571 -45314 -42195 -40089 -42750 -43715 -39910 -37477
-4100 -37477 -37902 -36273 -34645 -34924 -38062 -40369 -42675 -46592 -50509 -51086 -51664 -49856 -48049 -47620 -47192 -45332 -48243 -49126 -47147
-4081 -47147 -47076 -47006 -47110 -47211 -47315 -47416 -46059 -44699 -43342 -41982 -40574 -39161 -39184 -39202 -41490 -43775 -44632 -45485 -46793 -48097
-4061 -48097 -49402 -50706 -49420 -48131 -46842 -45552 -46294 -47032 -46160 -48150 -47222 -46290 -47088 -50747 -53125 -52640 -52394 -49286 -49219
-4042 -49219 -52014 -50635 -49256 -46685 -44114 -44106 -44099 -43257 -45276 -45686 -46096 -47956 -49812 -51667 -53523 -54667 -55808 -55517 -55226 -54507
-4022 -54507 -53784 -50140 -46495 -43242 -46663 -51097 -52670 -53456 -51377 -49122 -49726 -48962 -48194 -49994 -51790 -51414 -51034 -50658 -50277
-4003 -50277 -49991 -49700 -50844 -51984 -52774 -53564 -53102 -52640 -52834 -55890 -54652 -50553 -48511 -46469 -45977 -48347 -50449 -52551 -53221
-3984 -53221 -56754 -60153 -63551 -66354 -66294 -65176 -64058 -63477 -62896 -60190 -57485 -54421 -54220 -53929 -50777 -50128 -49480 -50691 -51899
-3965 -51899 -53110 -54317 -54321 -54321 -54921 -58379 -58986 -56728 -55010 -53289 -51213 -51995 -54511 -57023 -59005 -60984 -62370 -60891 -58312
-3946 -58312 -58591 -57265 -55934 -55085 -57093 -59106 -61114 -59340 -60425 -62944 -62597 -63052 -63503 -60440 -57373 -56277 -55178 -53367
-3928 -53367 -51552 -51798 -52040 -51392 -50740 -50553 -47501 -43559 -46290 -50043 -50933 -53136 -55334 -56210 -57086 -55577 -54064 -53493 -52923
-3909 -52923 -52353 -51779 -51984 -52189 -52394 -52595 -53762 -54928 -53888 -52845 -54816 -59650 -60488 -61323 -60104 -58886 -56236 -53583 -53587 -53590
-3889 -53590 -53594 -53594 -52048 -50501 -52115 -53728 -57250 -57909 -57794 -57678 -57354 -57030 -56885 -56739 -53404 -52931 -55141 -57350 -59299 -61248
-3869 -61248 -61766 -62284 -61252 -60220 -59009 -60660 -62892 -65124 -65806 -63626 -63473 -63320 -62989 -62657 -60894 -59128 -57362 -55595 -55085
-3850 -55085 -54570 -50359 -49010 -47412 -50579 -55357 -55364 -54570 -53773 -52677 -51582 -50453 -49320 -46756 -44192 -44166 -44136 -46491 -48847
-3831 -48847 -49417 -49983 -51981 -53978 -53773 -53564 -52103 -50643 -50255 -52726 -52100 -44792 -38725 -32655 -32372 -32085 -35766 -39444 -42411
-3812 -42411 -45373 -46298 -47218 -48142 -49063 -50754 -52443 -52703 -52961 -54474 -55983 -59881 -63775 -63469 -63160 -62855 -62545 -61792 -61036 -60283
-3792 -60283 -59527 -58796 -58066 -57336 -56605 -58379 -60153 -61927 -63700 -63134 -62568 -62001 -61435 -61420 -61405 -61390 -61375 -60600 -59825 -58513 -57201 -54980
-3770 -54980 -55621 -56083 -51776 -48735 -48556 -48854 -49152 -49510 -49868 -51656 -53445 -53851 -54257 -56095 -57932 -57145 -56359 -57004 -57649 -56117
-3750 -56117 -54585 -56393 -58200 -57324 -56449 -57004 -57559 -57324 -57090 -55424 -53758 -50035 -46312 -47837 -49361 -49499 -49637 -49774 -49912
-3731 -49912 -51243 -52573 -53903 -55234 -55211 -55185 -51824 -48459 -44859 -41256 -42903 -44546 -45239 -45929 -46622 -47311 -49644 -51973 -52875
-3712 -52875 -53773 -50762 -47747 -47121 -46491 -45895 -45295 -44699 -44099 -45530 -46957 -46957 -46953 -44270 -41583 -43193 -44799 -45329 -45858 -46387 -46916
-3691 -46916 -48220 -49525 -50829 -52133 -53706 -55278 -55420 -55562 -54153 -52744 -52767 -52789 -54526 -56262 -57999 -59735 -59475 -59214 -56568
-3672 -56568 -53922 -54526 -55129 -52394 -49659 -50471 -51284 -52096 -52908 -55353 -57794 -56900 -56001 -56896 -57786 -62020 -66249 -66175 -66097 -66022 -65944
-3651 -65944 -65482 -65016 -63123 -61226 -62150 -63071 -62564 -62053 -61338 -60619 -57518 -54414 -53661 -52905 -52152 -51395 -49838 -48276 -50058 -51835
-3631 -51835 -51828 -51820 -54198 -56575 -59012 -61450 -61502 -61554 -60436 -59318 -55815 -52312 -51463 -50613 -51194 -51776 -50374 -48973 -47572 -46171
-3611 -46171 -47363 -48556 -49748 -50941 -53326 -55711 -58096 -60481 -61703 -62925 -61763 -60600 -59765 -58927 -58092 -57254 -58297 -59337
-3593 -59337 -58949 -58558 -56665 -54768 -55260 -55748 -55942 -56132 -57757 -59378 -59012 -58644 -56847 -55047 -55219 -55387 -55558 -55726 -55174 -54619
-3573 -54619 -54067 -53512 -55316 -57116 -58919 -60719 -61029 -61334 -61942 -57775 -56445 -55111 -55867 -56620 -54224 -51824 -51813 -51798 -55454 -59106
-3553 -59106 -59422 -59735 -57272 -54805 -52342 -49875 -50602 -51325 -50620 -49912 -50140 -50363 -52022 -53676 -51459 -49238 -49405 -49569 -50166 -50762
-3533 -50762 -49927 -49089 -50997 -52901 -51470 -50035 -51966 -53896 -54395 -54891 -55629 -56363 -54537 -52707 -50829 -46089 -41706 -42090 -44445
-3514 -44445 -46797 -48019 -49238 -51079 -52920 -56191 -59460 -61032 -62601 -59881 -57157 -56818 -56475 -56136 -55793 -54291 -52785 -52715
-3496 -52715 -52640 -52562 -52480 -51269 -50054 -51287 -57287 -56970 -53788 -54023 -54254 -56695 -59132 -58114 -57093 -56076 -55055 -55334 -55610 -55890
-3476 -55890 -56165 -55014 -53859 -54138 -54414 -54500 -54585 -50378 -46171 -44110 -42049 -42374 -42694 -45761 -48828 -50464 -52100 -53467 -54835
-3457 -54835 -56203 -57567 -55633 -53698 -49379 -45060 -45392 -45724 -48440 -51153 -51373 -51593 -51813 -52033 -51597 -51161 -52156 -53147 -51876
-3438 -51876 -50602 -49331 -48056 -48515 -48969 -49424 -49879 -47840 -45798 -45191 -44580 -45045 -45508 -48355 -51202 -51027 -50848 -50672 -50494 -52435
-3418 -52435 -54373 -54880 -55387 -55882 -56374 -58301 -60224 -58036 -55845 -53654 -51463 -51772 -52077 -49525 -51738 -54760 -54917 -55554 -56188
-3399 -56188 -55006 -53821 -52640 -51455 -50542 -49625 -48712 -47796 -47915 -48030 -48150 -48265 -48325 -48381 -49871 -51358 -50598 -49834 -47643 -45448
-3379 -45448 -45135 -44818 -44505 -44188 -43566 -42940 -44699 -46458 -47620 -48783 -49946 -51109 -50710 -50307 -52290 -54272 -55629 -56985 -56911
-3360 -56911 -56836 -56687 -56534 -54951 -53367 -52648 -51928 -51209 -50490 -48984 -47475 -48351 -49227 -47211 -45194 -43178 -41162 -38569 -35971
-3341 -35971 -33378 -30780 -33225 -35666 -38110 -40551 -40887 -41218 -43939 -46655 -49107 -51556 -54008 -56456 -56419 -56378 -56341 -56300 -57455
-3322 -57455 -58606 -57377 -56143 -54965 -53784 -50222 -46655 -45865 -45072 -47620 -50166 -50017 -49864 -49715 -49562 -50456 -51347 -52241 -53132
-3303 -53132 -51686 -50237 -48791 -47341 -44762 -42180 -41986 -41788 -42593 -43395 -44498 -40827 -38949 -37067 -31552 -26033 -21367 -16698
-3285 -16698 -22049 -27397 -34149 -40898 -44311 -47721 -48370 -49018 -49666 -50315 -50158 -50002 -51276 -52551 -55659 -58767 -59489 -60212 -59236
-3266 -59236 -58260 -57283 -56307 -57384 -58461 -57153 -55845 -55342 -54839 -55767 -56695 -56117 -55539 -55439 -52476 -49007 -50307 -52085 -53862
-3247 -53862 -55390 -56914 -58442 -59966 -57947 -55923 -56288 -56650 -59065 -61476 -57690 -53900 -48593 -43283 -38274 -33262 -31373
-3230 -31373 -34250 -37786 -41319 -43126 -44930 -44829 -47587 -54947 -57533 -56128 -57581 -57667 -57749 -56583 -55413 -57600 -59788 -61975
-3212 -61975 -64163 -63428 -62694 -61960 -61226 -59210 -57194 -57563 -57932 -55796 -53661 -52957 -52253 -53151 -54049 -54947 -55845 -55491 -55137 -54783 -54429
-3191 -54429 -52025 -49622 -50557 -51492 -51742 -51992 -49856 -47721 -49092 -50460 -49446 -48429 -48250 -48068 -49320 -50568 -47758 -44945
-3173 -44945 -43566 -42183 -42891 -43596 -46689 -49778 -46059 -42336 -41956 -41572 -43637 -45698 -47762 -49823 -49845 -49864 -49886 -49905 -50762 -51615
-3153 -51615 -52472 -53326 -53423 -53520 -53616 -53713 -55301 -56888 -57045 -57201 -53482 -49763 -48071 -52103 -55659 -59214 -58834 -58453 -57805 -57157 -58893
-3132 -58893 -60630 -60160 -59691 -59221 -58752 -59072 -59393 -59713 -60034 -58565 -57097 -55629 -54161 -53821 -53479 -53139 -52797 -54246 -55692 -57142
-3112 -57142 -58588 -58726 -58860 -58998 -59132 -57719 -56303 -54891 -53475 -52800 -52122 -51448 -50769 -50810 -50848 -54466 -52357 -49998 -53359 -53147
-3092 -53147 -52931 -51943 -50952 -53303 -55651 -56717 -57779 -57414 -57045 -57634 -58219 -60239 -62255 -61412 -60566 -58293 -56016 -52282 -48545
-3073 -48545 -46242 -43935 -45194 -46450 -47710 -48966 -51626 -54283 -56944 -59601 -55055 -50505 -45958 -41408 -42944 -44475 -44580
-3056 -44580 -44680 -44732 -44781 -47218 -49651 -49763 -49871 -51414 -52953 -52938 -52920 -51474 -50024 -49264 -48500 -47740 -46976 -46372 -45765 -45638 -48370
-3035 -48370 -53341 -53538 -51354 -49167 -48451 -47732 -45586 -43436 -43644 -43849 -46443 -49033 -50304 -51574 -52845 -54116 -55536 -56955
-3017 -56955 -58375 -59795 -59553 -59311 -59068 -58826 -58226 -57626 -57026 -56426 -55551 -54675 -53799 -52923 -52495 -52066 -51638 -51209 -51153 -51097 -52472 -53848
-2995 -53848 -52867 -51887 -53292 -54697 -55800 -56903 -54667 -52428 -51325 -50218 -50725 -51228 -51749 -55133 -58338 -56769 -53445 -52979
-2977 -52979 -53948 -54913 -54898 -54880 -54861 -54842 -53244 -51645 -50046 -48448 -47702 -46953 -46204 -45455 -47509 -49562 -49230 -48899 -50784 -52670 -53125
-2956 -53125 -53579 -56926 -60272 -60458 -57779 -57488 -57198 -56370 -58405 -56743 -52219 -52346 -52469 -52614 -52756 -54332 -55905 -55782 -55655 -52666
-2936 -52666 -49678 -52014 -54347 -55431 -53650 -52081 -50509 -51619 -52730 -51287 -49845 -49834 -49823 -53121 -56419 -54649 -50017 -50773
-2918 -50773 -51530 -52286 -53043 -51772 -53363 -53344 -53326 -52763 -52200 -53248 -51433 -50393 -49353 -46525 -46558 -47047 -47535 -45340 -43145 -41725
-2898 -41725 -40305 -38885 -37466 -38729 -39989 -41252 -42511 -43178 -43842 -44509 -45172 -45452 -45727 -46007 -46283 -45250 -44214 -43182 -42146
-2879 -42146 -41058 -39966 -39057 -38144 -38010 -40734 -44535 -48332 -47170 -43141 -43886 -47490 -50263 -53031 -53419 -53803 -53397 -57760 -59441
-2860 -59441 -56352 -53173 -52856 -52062 -51269 -50237 -49204 -50855 -52506 -52964 -50561 -46726 -45753 -47147 -48541 -50114 -51686 -50725
-2842 -50725 -49763 -48981 -48198 -49219 -53102 -52513 -51925 -50948 -49972 -48817 -50523 -51302 -52077 -53031 -53985 -54675 -55360 -56046 -56732 -56639 -56542 -56445
-2820 -56445 -56348 -55659 -54965 -54272 -53579 -54168 -54753 -55338 -55923 -56512 -57097 -57682 -58267 -58178 -58085 -57991 -57898 -57063 -56225 -56818 -57410 -59333 -61256
-2797 -61256 -58409 -55558 -55275 -54992 -56139 -57283 -55450 -53616 -51783 -49946 -50468 -50989 -51511 -52029 -52715 -53400 -54086 -54768 -57004
-2778 -57004 -59240 -61476 -63708 -63872 -64036 -64200 -64360 -63630 -62899 -62169 -61435 -59229 -57023 -57678 -58331 -56691 -55047 -56270 -57488
-2759 -57488 -57086 -56683 -57712 -58737 -59497 -60253 -61014 -61770 -61312 -60853 -60395 -59933 -58014 -56091 -55603 -55111 -52730 -50348 -50829 -51306
-2739 -51306 -53069 -54828 -56590 -58349 -58595 -58841 -56225 -53605 -54656 -55707 -55327 -54943 -54846 -54749 -57514 -60276 -58927 -57578 -57660
-2720 -57660 -57738 -55036 -52335 -52495 -52655 -53561 -54466 -55372 -56277 -57526 -58774 -60022 -61271 -59687 -58103 -56698 -55293 -53132 -53833
-2701 -53833 -55129 -56426 -56948 -54608 -52089 -52428 -52308 -49327 -45094 -43723 -45273 -46823 -45213 -43600 -44960 -46316 -49461 -49745
-2683 -49745 -48984 -51086 -51220 -51354 -53430 -52640 -51850 -53922 -55845 -57768 -58439 -59109 -58752 -58394 -58036 -57678 -60391 -63104 -60570 -58036
-2663 -58036 -59124 -60212 -60704 -58334 -56680 -57887 -58737 -59586 -60350 -61111 -60443 -59773 -57645 -55513 -54816 -54116 -54358 -54597 -54839 -55077
-2643 -55077 -53710 -52338 -49540 -46737 -47363 -47989 -47006 -48884 -48705 -48526 -50076 -46857 -45247 -48407 -53534 -55800 -56844 -57887
-2625 -57887 -58752 -59616 -57686 -55755 -56210 -56665 -58133 -59601 -59639 -59676 -57805 -55934 -54064 -52193 -48981 -45768 -44285 -45664 -45597
-2606 -45597 -45530 -47073 -48612 -49767 -50922 -52077 -53229 -52812 -52394 -49771 -47143 -45086 -45891 -47471 -49048 -50695 -52342 -50948
-2588 -50948 -52413 -52629 -52845 -54671 -56493 -54570 -52648 -54064 -55476 -56177 -56877 -57578 -58275 -58196 -58114 -58032 -57950 -58498 -59042 -59586 -60130
-2567 -60130 -59709 -59285 -55700 -52115 -49010 -48765 -51858 -52089 -51664 -51239 -50635 -50032 -49994 -49957 -49920 -49882 -50553 -51224 -51716 -52208 -52461 -49853
-2545 -49853 -50285 -50717 -52376 -54034 -52532 -51030 -50691 -53214 -52696 -52178 -53352 -54526 -55700 -56873 -57332 -57790 -57473 -54295 -53493
-2526 -53493 -52689 -52003 -51317 -49115 -51679 -54779 -55018 -55431 -58703 -59530 -55588 -54690 -53788 -52588 -51388 -51392 -51395 -51399 -51403 -50453 -49502 -49983 -50464
-2503 -50464 -51228 -51992 -50371 -48750 -48112 -47475 -46659 -45843 -49413 -50121 -45284 -40447 -41602 -42757 -42482 -42206 -41788 -41371 -44949 -48526
-2483 -48526 -52938 -52580 -49540 -51269 -51802 -47565 -47561 -47553 -47490 -44565 -45634 -46700 -47807 -48914 -47635 -46353 -45373 -44393 -45142 -48750
-2463 -48750 -49663 -50576 -50237 -49894 -49584 -49275 -52007 -51872 -53002 -54131 -56870 -56743 -53907 -53933 -54556 -55174 -54828 -54477 -55141 -50080 -49555
-2442 -49555 -51887 -53684 -55480 -51310 -47136 -46301 -45467 -43831 -42191 -45798 -49405 -48999 -48589 -48179 -47770 -46737 -45701 -46096 -46491
-2423 -46491 -48261 -50028 -49409 -48791 -48623 -48451 -46849 -45247 -45690 -46130 -46570 -47009 -47453 -47893 -48332 -48772 -49506 -50237 -52040 -53844
-2403 -53844 -57768 -55964 -54995 -54026 -53784 -53538 -51861 -50184 -49704 -49219 -50166 -51112 -52823 -54529 -52897 -51265 -49249 -47229 -46640
-2384 -46640 -46052 -47822 -49592 -51362 -53132 -51533 -49935 -50721 -51507 -53777 -56046 -56706 -57365 -59396 -58565 -54693 -56546 -56829 -57112
-2365 -57112 -56322 -55532 -55457 -55383 -55308 -55234 -54392 -53549 -52707 -51865 -51619 -51373 -51127 -50881 -50386 -49890 -49394 -48895 -49234 -49573 -47527 -45478 -43521
-2342 -43521 -41565 -44855 -48142 -49555 -50967 -52379 -53788 -52569 -51351 -52517 -53680 -52372 -51064 -49219 -50233 -53501 -51045
-2325 -51045 -49603 -48157 -50292 -52428 -54444 -50732 -49111 -47490 -47896 -48299 -44352 -40406 -42660 -44911 -44706 -44501 -45727 -46950
-2307 -46950 -46447 -45944 -46871 -47796 -49588 -51381 -50788 -50192 -48854 -47516 -46178 -44837 -43089 -41341 -41025 -40704 -39940 -39176 -40797
-2288 -40797 -42415 -44129 -45839 -46122 -46402 -47729 -49051 -50378 -51701 -49473 -47240 -46443 -45642 -47468 -49290 -47777 -46260 -45593
-2270 -45593 -44922 -44255 -43585 -45541 -47494 -48019 -48541 -48619 -48694 -48772 -48847 -48329 -47807 -47289 -46767 -45079 -43387 -43130 -42869 -44222 -45571 -46924
-2248 -46924 -48273 -47889 -47501 -49502 -51500 -52308 -53113 -53922 -54727 -53400 -52070 -53128 -54183 -51336 -48485 -48977 -49465 -49383 -49297 -47784
-2228 -47784 -46268 -46186 -46100 -47449 -48794 -48399 -48004 -49994 -51981 -53076 -54172 -55267 -56359 -53892 -51425 -48958 -46488 -47330 -48172
-2209 -48172 -49014 -49853 -51917 -53982 -53661 -53337 -51854 -50371 -52226 -54079 -52566 -51053 -52879 -54701 -53098 -51496 -48463 -45426
-2191 -45426 -43909 -42392 -43737 -45083 -47710 -50337 -50102 -49868 -51258 -52648 -51176 -49704 -50736 -51768 -52800 -53833 -53493 -53154
-2173 -53154 -52815 -52476 -51541 -50605 -49849 -49092 -49737 -53244 -55141 -57037 -56907 -56777 -56646 -56516 -57980 -59441 -58044 -56642 -56736 -56825 -55487
-2152 -55487 -54146 -55275 -56400 -57708 -56150 -57131 -58107 -57656 -57201 -55722 -57101 -58662 -57358 -56147 -57794 -57656 -57514 -56773 -56028
-2133 -56028 -55107 -54183 -54872 -52696 -52133 -51567 -51105 -50643 -50181 -49715 -49163 -48612 -48060 -47505 -49473 -51440 -51977 -52510 -53672 -54835 -52838
-2112 -52838 -50836 -53110 -50613 -49189 -50624 -53016 -55409 -53389 -51366 -50084 -51664 -53423 -52316 -50110 -50766 -51243 -51716 -51500
-2094 -51500 -54146 -54108 -51205 -48694 -49044 -49215 -46521 -45821 -45120 -44419 -43715 -43670 -46488 -47516 -48541 -50445 -49487 -48530 -50430 -52156
-2074 -52156 -53881 -57574 -58401 -56370 -57201 -56244 -55282 -53251 -51220 -50441 -52521 -52927 -53330 -51053 -48772 -47658 -46540 -46857 -47170
-2055 -47170 -47173 -47173 -44315 -41453 -42739 -44021 -42444 -40864 -41993 -43119 -44248 -45373 -45876 -46376 -46879 -47378 -46957 -46532 -44680 -42824
-2035 -42824 -44222 -45616 -44151 -42683 -42664 -42642 -42623 -42601 -42046 -41487 -43793 -46096 -44751 -43402 -44919 -46432 -46875 -47315 -47758 -48198
-2015 -48198 -47893 -47583 -47278 -46968 -47497 -48023 -48552 -49078 -47505 -45929 -44356 -42780 -44725 -46666 -48612 -50553 -51470 -52387 -50441
-1996 -50441 -48492 -45325 -42157 -41852 -41543 -42206 -42869 -44963 -47054 -47866 -48679 -48060 -47438 -46245 -45053 -45291 -45526 -46689 -47852
-1977 -47852 -47583 -47311 -48161 -49010 -52722 -56430 -54597 -52763 -50930 -49092 -48660 -48228 -46365 -49271 -52625 -53117 -50747 -48377 -48019
-1958 -48019 -47661 -47304 -46946 -47125 -47304 -47483 -47661 -46521 -45381 -44241 -43100 -44226 -45351 -46476 -47602 -47326 -47050 -46775 -46499 -47296
-1938 -47296 -48094 -48891 -49689 -50792 -51891 -51205 -53378 -54243 -52241 -51854 -51463 -52655 -50982 -49312 -50501 -50233 -49961 -49871 -49778 -52271
-1918 -52271 -54760 -53139 -51515 -47479 -46301 -45903 -45500 -46137 -46771 -45798 -44822 -47307 -46927 -46730 -46529 -46301 -46070 -45664 -48116 -48902
-1898 -48902 -49685 -48265 -46842 -44684 -42523 -41796 -41066 -41979 -42888 -43801 -44710 -47341 -49968 -51824 -50814 -50345 -49871 -51429 -52983
-1879 -52983 -53460 -51071 -48686 -49160 -50233 -51302 -52077 -49987 -48425 -51630 -51977 -52320 -52815 -53307 -53803 -54295 -54216 -54134 -53877 -53616 -54611
-1858 -54611 -52741 -52484 -52223 -53348 -54470 -57205 -57075 -55100 -53121 -51146 -49167 -47535 -48761 -48381 -47997 -48630 -49260 -49894 -50523
-1839 -50523 -51146 -51768 -52390 -53013 -50058 -47102 -45876 -44650 -41889 -43898 -46562 -49227 -48314 -47401 -48873 -50345 -49584 -48824 -49495
-1820 -49495 -50166 -51105 -52044 -55666 -54518 -52029 -49540 -45321 -41103 -39567 -38032 -42698 -47363 -47766 -48165 -48563 -48962 -50706 -52446
-1801 -52446 -57406 -56642 -55629 -54611 -53236 -51861 -50699 -49532 -48366 -47199 -46376 -45549 -48060 -50572 -49868 -49160 -50836 -52513
-1783 -52513 -51675 -50833 -49991 -49148 -46283 -43413 -40544 -37674 -37186 -36698 -37641 -38584 -41434 -44285 -43439 -42593 -46167 -44017 -45086
-1764 -45086 -46156 -46748 -47341 -47934 -48526 -47266 -46007 -46178 -46350 -47594 -48839 -44837 -40834 -40752 -40671 -40589 -40507 -40246 -39985 -39724 -39463
-1743 -39463 -39653 -39839 -42411 -44982 -44427 -43868 -43309 -42750 -43447 -44140 -44833 -45526 -45150 -44770 -44390 -44009 -44479 -44945 -45411 -45876 -47896
-1722 -47896 -49912 -49543 -49174 -47982 -46786 -48928 -51071 -53128 -55182 -54850 -54518 -54257 -53993 -53728 -53464 -52130 -50792 -49454 -48116
-1703 -48116 -46916 -45712 -46894 -48075 -46607 -45135 -43663 -42191 -42873 -43551 -44229 -44908 -41803 -38695 -35588 -32480 -34578 -36672
-1685 -36672 -37335 -37999 -40603 -43205 -43421 -43637 -44024 -44412 -47184 -49957 -49212 -48466 -47721 -46976 -46029 -45083 -44136 -43190 -44867 -46544
-1665 -46544 -44881 -43219 -41647 -40074 -40887 -41699 -40872 -40044 -39217 -38390 -40089 -41788 -42057 -42325 -42027 -41729 -44770 -47811 -48459 -49107
-1645 -49107 -48325 -47542 -48101 -48660 -45880 -43100 -42914 -42728 -42541 -42355 -42109 -41863 -44956 -48049 -47158 -46268 -45377 -44486 -43685 -42884 -44468
-1624 -44468 -46052 -45944 -45835 -44296 -42757 -45332 -47907 -48097 -48288 -49760 -51231 -49364 -47494 -46342 -45191 -45470 -45746 -49014
-1606 -49014 -52282 -52212 -52137 -52066 -51995 -53356 -54712 -55528 -56344 -55729 -55111 -51395 -47680 -46350 -45016 -47635 -50255 -50490 -50721 -50836 -50952
-1585 -50952 -48683 -46409 -43201 -39992 -41077 -42161 -43514 -44867 -46219 -47572 -46294 -45016 -45168 -45321 -45116 -44911 -47091 -49271
-1567 -49271 -48854 -48437 -48019 -47602 -47483 -47363 -47244 -47125 -47520 -47915 -50695 -53475 -54079 -54682 -55286 -55890 -53911 -51928 -50244 -48560
-1547 -48560 -45180 -46566 -46700 -46834 -45631 -44423 -43216 -42008 -44024 -46037 -45664 -45291 -46189 -47084 -47978 -48873 -48519 -48161 -47803 -47445
-1527 -47445 -44997 -42545 -43432 -44319 -42079 -39836 -39977 -40119 -40715 -41308 -43331 -45355 -45891 -46424 -46957 -47490 -46842 -46189 -45537 -44885
-1507 -44885 -44684 -44479 -44274 -44069 -42947 -41822 -42128 -42433 -41282 -40126 -41356 -42586 -42284 -41979 -43104 -44229 -44255 -44278 -44300 -44322 -44270
-1486 -44270 -44214 -42731 -41244 -41788 -42329 -42873 -43413 -41453 -39489 -39914 -40335 -41982 -43626 -44021 -44412 -46912 -52271 -54414 -51783
-1467 -51783 -48917 -46048 -45269 -44486 -42664 -40838 -40447 -40052 -39661 -39266 -36489 -33709 -36381 -39049 -40287 -41524 -43689 -45850
-1449 -45850 -45627 -45403 -46107 -46808 -47509 -48209 -49063 -49912 -51060 -47438 -43547 -39653 -40708 -41762 -42552 -43339 -44125 -44911 -44710 -44505
-1429 -44505 -45731 -46957 -46130 -45299 -45899 -46499 -46160 -45821 -44229 -42638 -42120 -44464 -43469 -39612 -39131 -38651 -39243 -39836 -43588 -44479
-1409 -44479 -43641 -42802 -43421 -44039 -42273 -40507 -40261 -40015 -41200 -39523 -38114 -33843 -32733 -34484 -36087 -37689 -36132 -34574
-1391 -34574 -35800 -37022 -39500 -41975 -45854 -46868 -42519 -38166 -36501 -37693 -38889 -37220 -38267 -39310 -41788 -41401 -41233
-1374 -41233 -41062 -40715 -40365 -42910 -45452 -47997 -50538 -51235 -51928 -51194 -50456 -48410 -46361 -45746 -45127 -44494 -43860 -43406 -42951 -42258
-1354 -42258 -44427 -46775 -46260 -45791 -48183 -47356 -46529 -43674 -40820 -39694 -41431 -41725 -42019 -42493 -42966 -46212 -49458 -46503 -43547
-1335 -43547 -40413 -37279 -36530 -35781 -35718 -35655 -36843 -38032 -38822 -36750 -34678 -35465 -37268 -39072 -40279 -38621 -39485 -40350 -39247
-1316 -39247 -41002 -42910 -41956 -39452 -36944 -34708 -32472 -31786 -33959 -35867 -34913 -35927 -36937 -38994 -43913 -46566 -44445 -43819
-1298 -43819 -43193 -42269 -41341 -39661 -37976 -39631 -41285 -43301 -45314 -43987 -42660 -41010 -39355 -37700 -36046 -35975 -35901 -35826 -35751 -37074
-1278 -37074 -38394 -39713 -41032 -41133 -41229 -39895 -38561 -37887 -37209 -36530 -35852 -37682 -39508 -39903 -40298 -39854 -39407 -38960 -38513 -36843
-1258 -36843 -35174 -35889 -36605 -38412 -40216 -39635 -39053 -38412 -37771 -37130 -36489 -36821 -37149 -37477 -37805 -37626 -37447 -35837 -34227 -35274
-1238 -35274 -36318 -37361 -38405 -37898 -37391 -36884 -36378 -37320 -38259 -39676 -36322 -33299 -33135 -32494 -31854 -30933 -30009 -33378 -36746 -38062
-1218 -38062 -39374 -40685 -41997 -42821 -43641 -43029 -42418 -38531 -34641 -36951 -39262 -39087 -38908 -38729 -38550 -39359 -40164 -40969 -41774 -43108
-1198 -43108 -44438 -45772 -47102 -45932 -44759 -45016 -45273 -44281 -43287 -39910 -36530 -36076 -35617 -37544 -39471 -38308 -37141 -37410 -37674
-1179 -37674 -36005 -34332 -35997 -37663 -36456 -35245 -34037 -32826 -31857 -30885 -31343 -31801 -33370 -34939 -36508 -38077 -37231 -36385
-1161 -36385 -35539 -34693 -33519 -32345 -31172 -29998 -28228 -26458 -29457 -32457 -35651 -38845 -38878 -38912 -37216 -30750 -28399 -28910 -29823
-1142 -29823 -33598 -35643 -37689 -39497 -36534 -34824 -35975 -34648 -36180 -36284 -36385 -34879 -33370 -31865 -30355 -31071 -31783 -32498
-1124 -32498 -33210 -32673 -32133 -31596 -31056 -32424 -33788 -32293 -30795 -32401 -34004 -35610 -37212 -36180 -35144 -36974 -38800 -38245
-1106 -38245 -37686 -39992 -42295 -40320 -38345 -36370 -34395 -34924 -35453 -35983 -36512 -39113 -41714 -41453 -41192 -41229 -41267 -41304 -41341 -40339 -39336
-1085 -39336 -38334 -37332 -35971 -34611 -33251 -31891 -32260 -32629 -32998 -33367 -33139 -32912 -32685 -32457 -33959 -35461 -36963 -38461 -38889
-1066 -38889 -39318 -39746 -40171 -39966 -39761 -39556 -39348 -37056 -34764 -32472 -30177 -29290 -28403 -30378 -32349 -32714 -33080 -33445 -33806 -33754 -33702
-1045 -33702 -33650 -33594 -32707 -31820 -31112 -30400 -28347 -29156 -28354 -27549 -26927 -26305 -25682 -25056 -27885 -30713 -35152 -36724 -36035 -35345 -34477
-1024 -34477 -33605 -35811 -38017 -37361 -36702 -35152 -33601 -32230 -30855 -28693 -29394 -28485 -27572 -26543 -25515 -27348 -29178 -30218
-1006 -30218 -31257 -32118 -32975 -33776 -31716 -29476 -30095 -30665 -28373 -27870 -27363 -26681 -25999 -25317 -24632 -25518 -26405 -27471 -28533 -27154
-986 -27154 -28638 -28332 -28023 -29707 -28529 -28962 -29390 -29286 -29182 -29077 -28969 -29118 -29264 -29409 -29554 -30300 -31041 -31783 -32524 -32241 -31954 -31667
-964 -31667 -31380 -30560 -29737 -29092 -28447 -28965 -32345 -32863 -30516 -30497 -30478 -30281 -30080 -30076 -30072 -30069 -30061 -28030 -25999 -25220 -27300 -26789 -26275 -25940
-940 -25940 -25604 -25630 -25653 -27285 -26055 -25440 -24822 -24024 -23227 -23446 -23663 -26741 -25049 -24158 -26130 -27803 -26610 -26853 -27095 -27337 -27575
-919 -27575 -25448 -26182 -27095 -25142 -22448 -22615 -20994 -19370 -20059 -20745 -20182 -19616 -20096 -23435 -26778 -27255 -27840 -28421 -26144 -28634
-899 -28634 -29040 -29442 -30147 -30847 -29718 -28585 -25846 -25966 -25940 -25910 -26063 -26212 -24337 -22459 -21181 -22761 -23152 -20678 -19996 -19310 -21941
-878 -21941 -24568 -25649 -23864 -21606 -22206 -25194 -25317 -24900 -27341 -27818 -28291 -27903 -24650 -25395 -26137 -25593 -25049 -24326 -26465 -26338
-858 -26338 -26212 -26264 -26316 -27024 -27732 -28440 -29148 -27024 -24900 -24207 -23514 -23491 -23465 -21829 -23055 -24196 -25332 -24263 -23193 -22433 -21669
-837 -21669 -22515 -23361 -22094 -23685 -23666 -23648 -22455 -21263 -21501 -21736 -20842 -19947 -22392 -24833 -24713 -24594 -24475 -24352 -23815 -23279 -25962
-816 -25962 -25779 -23074 -23227 -23379 -20670 -16623 -15434 -16929 -18423 -15979 -16392 -18535 -20678 -19932 -19183 -18434 -17685 -17764 -17838 -17734
-796 -17734 -20491 -20659 -20823 -22776 -21866 -21117 -20365 -19433 -18501 -19124 -19742 -18930 -18118 -19224 -20331 -20007 -19683 -20551 -21419 -22466 -20652
-775 -20652 -18583 -16515 -14626 -17506 -21192 -20108 -18963 -20681 -19999 -19317 -18636 -17954 -21505 -22194 -21155 -20115 -20827 -21538 -23860
-756 -23860 -23320 -23823 -24326 -24650 -24974 -24419 -23864 -23487 -23111 -21035 -21822 -22608 -20532 -18963 -17395 -17078 -16761 -14984 -13206 -12859 -12513
-735 -12513 -11760 -11007 -12640 -14272 -14145 -14018 -12103 -13049 -16016 -16120 -16403 -16687 -18609 -17670 -16910 -16150 -14492 -12830 -13731 -14633
-715 -14633 -17119 -22463 -25422 -25518 -26081 -26640 -28630 -27758 -23581 -19399 -16769 -17000 -15304 -13605 -14469 -15334 -13847 -12356 -9256
-696 -9256 -9017 -9632 -10243 -9781 -9319 -7877 -9293 -11305 -13318 -15874 -15569 -14488 -13407 -14533 -15658 -14398 -13139 -13728 -14316
-677 -14316 -13474 -12632 -11313 -9994 -12013 -14033 -14361 -14689 -13586 -12483 -12900 -13318 -16716 -15345 -10650 -10724 -10978 -11231 -12766 -11440
-657 -11440 -10113 -11648 -10601 -9550 -8682 -7810 -9148 -10482 -8958 -7430 -6964 -6495 -6029 -5559 -5511 -5459 -5410 -5358 -5488 -5615 -5745
-636 -5745 -5872 -5406 -4937 -4471 -4001 -5101 -6196 -7296 -8391 -6927 -5459 -3994 -2526 -1449 -368 -2149 -3931 -2705 -1475
-617 -1475 -245 984 3745 6510 10885 15260 24848 37302 53871 79979 119972 169508 212367 215158 176089 127484
-601 127484 87465 56986 37116 26790 20578 17228 15484 13743 9320 4896 2333 -226 71 372 45 -279 -607
-584 -607 -931 -886 -838 637 2117 3026 3939 1986 37 -1236 -2507 -920 671 22 -622 160 946 1267 1591 1912 2236
-563 2236 708 -815 -912 -1005 -1292 -1579 995 3574 5940 8306 5903 3503 5735 7967 13061 18159 23343 28526 34783
-544 34783 41044 45601 44435 37604 27915 21085 14254 12014 9778 8373 6968 3775 6309 4397 2485 2362 2243 950
-526 950 -342 -204 -66 -1449 -2831 -2783 -2734 -3252 -3770 -5898 -5164 -5175 -5186 -5019 -4851 -6155 -7460 -5902 -4344 -4516 -4687 -3606
-504 -3606 -2526 -3800 -7937 -8853 -9770 -9166 -5701 -5276 -4851 -4967 -5082 -5198 -5309 -4590 -3871 -4941 -3144 -1918 -3554 -4832
-484 -4832 -6107 -5447 -4788 -6990 -9189 -11980 -14771 -12792 -10810 -8652 -6495 -2727 -1818 -1285 -752 -696 -636 1565 -1002 -5179
-464 -5179 -6491 -6811 -4270 -595 3078 4785 1721 -267 604 678 753 -603 902 440 -22 -305 -588 -785 -983 -1180 -1378
-443 -1378 -1575 -1773 -1792 -1810 -3036 -1400 -1374 -1348 466 2280 1233 186 522 857 1192 1531 2940 4349 2895 1446 700
-422 700 -44 -789 -1531 -1441 -1352 -3051 -1885 961 950 4159 4505 4133 902 -2328 -2697 -3577 -1590 753 235 -1389 -148
-401 -148 913 -886 -1665 -2444 -63 2321 3093 3864 6067 8273 7643 7013 6383 5757 3726 1695 -3018 -2958 -2623 -2284 -1646
-380 -1646 -1009 -733 -454 -174 104 723 1345 1789 2232 4103 3115 2307 1498 -1009 -3513 -2384 1610 3484 5362 7416
-360 7416 9473 9693 9916 6797 3682 3991 4304 4613 4926 4248 3574 2895 2221 2139 2061 1979 1900 477 -942 -3975 -4143 -2228
-338 -2228 -308 -599 -886 928 2746 2180 1613 1192 775 358 -59 3231 6525 6480 6436 6775 7118 7639 5299 3641 1986
-317 1986 2538 3089 4144 5202 6439 4815 4744 4677 4431 4185 3846 3510 3175 2839 2541 2247 1949 1654 760 -130 -1024 -1915
-295 -1915 -1333 -748 -167 417 1356 2299 3238 4181 3902 3626 3346 3070 227 -2611 -1162 290 1546 2806 1677 551
-275 551 3983 7419 5605 3793 3562 3335 3104 2877 3629 4386 5139 5895 6164 6436 6704 6976 6171 5370 4565 3764 4054 4349
-253 4349 4639 4934 6775 8619 9029 9443 6499 3559 3000 2444 3197 3954 3275 2601 712 -1177 -681 -185 935 2057
-233 2057 3179 4300 6093 7885 6339 4792 4677 4561 4446 4330 3238 2146 3439 4733 5280 5828 6376 6924 7576 8228
-213 8228 8880 9532 8396 7259 6123 4986 3805 2623 1442 261 1107 1953 2798 3644 2851 2057 1263 469 -55 -581
-193 -581 -1106 -1631 -3163 -4695 -1933 827 369 -89 883 1856 741 -372 -1486 -2600 -1359 -118 1122 2362 2038
-174 2038 1718 1394 1073 2538 4006 5470 6939 5988 5042 4092 3145 2553 1964 1371 782 443 104 -234 -573 -77 417 913
-152 913 1408 1390 1371 1353 1334 1524 1714 1904 2094 857 -376 1725 3831 3756 3685 4088 1632 -789 1561 3432 5306 3868
-130 3868 2433 637 1707 1315 -1933 -3219 -4501 -4266 -1166 141 1453 2590 868 -1035 -74 2731 2679 1073 -528
-111 -528 -886 -1244 782 2813 3827 4841 6033 4367 1140 -2086 -2809 -666 -376 -85 384 857 1338 1822 2128 2433
-91 2433 1781 -1728 -1244 -759 1360 3484 3223 2962 3026 3093 2981 2869 3849 1971 -1520 -2146 -1792 -4296 -3763 -3226 -771 -1173
-69 -1173 -2354 -3532 -5399 -7262 -6744 -6222 -4993 -3759 -920 -938 -2660 -4378 -3118 -1855 1304 1606 -778 -3159 -3487
-50 -3487 -3811 -4139 -4464 -5548 -6632 -6167 -2839 -584 -1192 -1441 -1691 -1128 -566 -3 559 436 313 190 67 -1840 -3748
-29 -3748 -5477 -7206 -8429 -6789 -8548 -7445 -6200 -7817 -9256 -10694 -8198 -8563 -9703 -10843 -10024 -9204 -8384 -7560 -6800
-10 -6800 -6040 -5280 -4516 -7027 -9539 -10620 -11697 -12032 -12368 -11272 -10173 -9043 -7914 -9170 -10422 -9263 -8104 -5514 -2921
8 -2921 -3565 -4210 -4855 -5496 -2951 -405 -2153 -3897 -2902 -1907 -3297 -4683 -7266 -9848 -10046 -10240 -10109 -9979 -7463 -4944 -4605
29 -4605 -4266 -5358 -6446 -7072 -7698 -8324 -8947 -9185 -9424 -8231 -7035 -9107 -11179 -9912 -8641 -8805 -8969 -9133 -9293 -8850 -8406
50 -8406 -7963 -7516 -9785 -12054 -10985 -9912 -10020 -10128 -10236 -10340 -9435 -8529 -7624 -6714 -7974 -9233 -7154 -5071 -3797 -2522
70 -2522 -3633 -4739 -6632 -8525 -12207 -10161 -11130 -12099 -12710 -13318 -13254 -13191 -11697 -10202 -9364 -8525 -7687 -6849 -7762 -8675 -7203
91 -7203 -5731 -8194 -10657 -13120 -15584 -13370 -11156 -10374 -9591 -11462 -13333 -15203 -17074 -17126 -17178 -17231 -17283 -16649 -16016 -15382 -14749
112 -14749 -13519 -12289 -13444 -14600 -14234 -13869 -13325 -15643 -16679 -17715 -14935 -15017 -15993 -16970 -19556 -22142 -20957 -19772 -21628
131 -21628 -20622 -19049 -17477 -15725 -13974 -14085 -14197 -15740 -17283 -17156 -17029 -18513 -17134 -15166 -13195 -13430 -13664 -14887 -16105
150 -16105 -15893 -15680 -13921 -12159 -10873 -14357 -18084 -18945 -19150 -19355 -20249 -18278 -16485 -14693 -18151 -21606 -21542 -21479 -20763 -17182
170 -17182 -15986 -17652 -18188 -18721 -17823 -19787 -21427 -23066 -24885 -26703 -26346 -25988 -24199 -22411 -21203 -19996 -18788 -17581 -17506
189 -17506 -17432 -18788 -20145 -21214 -22284 -25142 -25138 -23674 -25071 -28794 -32517 -33914 -32450 -29256 -26063 -25403 -24743 -22474 -23066
208 -23066 -24389 -25712 -25485 -22396 -22526 -22656 -24993 -27326 -25444 -23562 -21680 -19798 -20480 -21162 -21844 -22522 -23953 -25384 -25205
227 -25205 -25027 -26040 -24192 -22522 -20849 -21117 -21386 -23443 -22638 -20700 -21624 -24099 -26569 -25004 -23439 -21874 -20305 -20976 -21647
246 -21647 -19932 -18214 -18364 -18513 -20093 -21669 -22235 -22802 -24799 -26793 -26368 -25943 -27903 -29860 -27497 -25135 -24203 -23268 -25317
265 -25317 -27367 -29416 -31462 -29815 -28168 -26521 -24870 -24889 -24904 -23487 -22071 -22802 -23532 -22891 -19388 -18259 -22850 -25653 -25593 -25623
285 -25623 -25653 -22165 -18677 -18274 -17868 -19847 -21825 -20763 -19701 -17208 -14715 -15192 -15665 -19478 -23290 -22273 -21255 -23577 -25899
304 -25899 -25951 -26003 -23670 -21337 -23774 -26212 -27218 -28224 -29312 -30400 -30057 -29714 -31429 -33143 -32472 -31801 -30732 -29662 -28593
323 -28593 -27523 -26513 -25504 -24494 -23484 -25567 -27650 -27348 -27046 -25522 -23998 -23905 -23812 -26830 -29849 -29528 -29204 -29062 -28921 -30210
343 -30210 -31496 -31339 -31183 -28641 -26096 -25522 -24948 -27713 -30475 -28954 -27434 -28298 -29159 -32051 -34943 -31634 -28321 -26621 -24922
362 -24922 -27516 -30106 -29003 -27900 -28228 -28552 -26670 -24788 -24516 -29010 -30169 -31328 -31354 -31377 -32796 -34216 -32297 -30374 -30393 -30411
382 -30411 -30430 -30445 -28425 -26405 -26771 -27132 -30151 -33169 -33802 -34432 -33508 -32584 -32137 -28824 -25276 -26499 -28198 -29893 -32017 -34142
402 -34142 -32927 -31712 -31421 -31131 -32271 -33411 -34865 -36318 -37771 -39225 -37309 -35394 -33478 -31563 -32178 -32793 -35315 -34976 -32938
421 -32938 -35670 -37328 -36124 -32774 -32286 -34004 -32860 -31895 -30929 -32170 -33411 -33702 -33993 -34283 -34570 -35159 -35748 -37589 -34656 -33173
441 -33173 -31690 -29908 -28123 -28369 -28615 -28861 -29103 -27665 -26226 -26219 -26208 -29271 -32334 -33012 -33687 -36303 -38919 -38196 -37469 -34928 -32386
462 -32386 -31276 -30162 -31622 -33083 -34544 -36001 -35673 -35345 -35017 -34686 -31220 -27754 -26674 -25589 -26864 -28138 -29413 -30683
480 -30683 -30087 -29491 -28895 -28295 -27788 -27281 -26774 -26264 -25638 -25012 -25817 -26618 -28406 -30195 -31984 -33769 -34343 -34913 -35487 -36057 -37883
501 -37883 -39705 -39146 -38584 -38524 -38461 -36970 -35476 -35535 -35591 -33266 -30937 -30691 -30441 -28764 -27084 -28090 -29092 -30098 -31101 -31809 -32513
522 -32513 -33221 -33925 -33530 -33132 -32737 -32338 -31745 -31153 -33899 -36646 -37931 -39217 -38118 -37018 -36620 -36221 -34391 -32562 -32461 -32360
542 -32360 -32260 -32159 -32957 -33754 -34253 -34749 -36679 -33840 -31000 -32927 -34976 -37026 -39374 -41718 -40458 -39199 -37939 -36676 -35748
561 -35748 -34820 -35323 -35822 -36832 -37838 -37417 -36992 -37421 -37850 -36847 -35841 -36240 -36635 -37033 -37428 -37320 -37212 -34719 -32226 -32625 -33024
582 -33024 -32290 -31552 -27970 -29159 -30050 -30941 -32845 -34749 -38084 -41416 -39396 -37373 -38688 -40003 -41438 -42873 -41923 -40972 -39415
601 -39415 -37853 -36769 -40454 -42739 -42161 -41106 -40052 -38360 -36664 -34969 -33273 -37510 -41747 -40738 -39728 -38259 -36787 -37700
619 -37700 -38613 -40451 -42288 -42694 -43100 -41889 -40678 -39467 -38252 -38740 -39225 -39713 -40197 -41282 -42366 -43450 -44531 -43588 -42642 -41699
639 -41699 -40752 -40890 -41025 -41162 -41297 -41792 -42284 -42776 -43268 -42482 -41692 -40905 -40115 -40700 -41282 -41863 -42444 -43100 -43752 -41543 -39333 -38286
661 -38286 -37238 -39053 -40868 -41002 -41133 -42694 -44255 -43491 -42728 -40533 -38338 -37332 -36322 -35315 -34306 -37086 -39862 -39776 -39690
680 -39690 -38982 -38271 -37563 -36851 -36858 -36862 -39728 -42593 -42530 -42463 -42400 -42333 -40182 -38028 -40648 -43264 -42783 -42299 -38956 -35610 -37007 -38401
702 -38401 -39798 -41192 -39612 -38028 -37879 -37727 -35699 -33668 -34503 -35334 -34619 -33899 -36046 -38189 -38576 -38960 -37917 -36869 -36094 -35319
722 -35319 -37406 -39493 -40477 -41461 -42444 -43428 -43421 -43413 -43406 -43398 -43391 -43383 -43376 -43369 -42474 -41576 -40682 -39784 -38114 -36441 -37633 -38822 -38695 -38565 -38438 -38308
748 -38308 -37108 -35904 -37566 -39225 -40264 -41304 -42165 -43022 -43227 -40570 -39523 -38472 -40451 -42429 -41546 -40659 -39418 -38177 -38189
767 -38189 -41058 -43693 -46327 -44669 -45873 -45944 -46014 -48053 -47229 -44438 -44509 -45653 -46797 -47285 -47773 -45221 -42668 -44404 -43275 -43756
787 -43756 -44237 -45437 -46633 -46756 -44017 -42221 -43283 -42735 -42187 -41405 -43480 -43767 -44054 -46417 -45914 -44162 -42407 -42027 -41643 -45735
807 -45735 -46961 -44658 -42351 -42910 -43465 -42385 -44162 -42903 -41639 -41110 -40581 -40052 -39523 -40514 -41505 -42675 -43846 -40469 -39955 -44211
827 -44211 -45604 -43898 -42191 -41557 -43786 -45876 -47967 -47375 -46782 -46458 -46134 -44378 -42623 -41047 -39471 -40756 -42042 -42761 -43480
846 -43480 -44200 -44919 -45903 -46886 -46618 -43488 -41848 -40208 -38390 -36571 -39571 -42571 -42709 -42847 -43521 -44196 -44870 -45545 -44654 -43764 -42694
867 -42694 -41624 -44043 -43600 -40294 -39851 -41326 -42802 -44636 -43607 -44695 -45783 -45262 -44740 -43350 -41956 -42947 -43939 -42608 -41274
886 -41274 -42325 -43376 -42895 -42411 -43357 -44304 -44926 -45545 -42824 -40104 -40767 -41427 -42087 -42746 -41412 -40074 -41121 -42169 -42891 -43611
906 -43611 -42899 -42187 -44222 -46253 -45899 -45545 -44129 -42713 -42728 -42739 -42783 -42828 -42873 -42914 -42034 -41155 -38845 -36530 -38245 -39959 -40242 -40521
928 -40521 -42601 -44680 -45329 -45973 -46204 -46435 -45235 -44032 -43551 -43070 -44021 -44967 -44844 -44721 -44598 -44472 -44207 -43939 -43674 -43406 -43827 -44244
950 -44244 -44665 -45083 -43689 -42292 -42329 -42362 -41505 -40644 -39787 -38926 -41431 -43931 -45004 -46074 -46402 -46726 -47054 -47378 -46879 -46376 -45876 -45373
972 -45373 -45083 -44788 -44498 -44203 -44718 -45232 -43361 -41487 -41554 -41621 -44073 -46521 -45127 -43734 -44725 -45712 -46674 -47635 -47166 -46693 -45064
993 -45064 -43436 -41807 -40175 -40246 -40316 -41818 -43316 -44028 -44740 -43067 -41390 -41982 -42575 -43167 -43756 -44621 -45485 -46350 -47211 -49327 -51444
1014 -51444 -49268 -47088 -45835 -44583 -43927 -46130 -47561 -46130 -46488 -46842 -47512 -48183 -47244 -49163 -47628 -46093 -46465 -46834 -42034
1033 -42034 -42005 -45194 -45519 -45698 -45876 -45876 -45873 -46402 -46931 -46029 -45124 -43775 -42426 -44416 -46402 -48392 -50382 -49033 -47680 -46093 -44505
1054 -44505 -41665 -38822 -37976 -39992 -43618 -44378 -43860 -46204 -49741 -48504 -45638 -47542 -50579 -48843 -49286 -49730 -49875 -50017 -49670
1073 -49670 -49323 -48798 -48273 -50341 -49547 -50363 -51179 -50915 -50650 -48955 -47259 -48574 -49890 -49774 -49659 -46201 -42742 -40715 -38688 -38509
1093 -38509 -38330 -38151 -37972 -37853 -37734 -39225 -37853 -37495 -37138 -38032 -38926 -42273 -45616 -46573 -47531 -46227 -44919 -45996 -47073 -45336
1113 -45336 -43596 -44241 -44885 -44967 -45045 -45303 -45560 -45735 -48768 -48642 -45653 -46216 -49637 -49838 -50039 -48038 -46033 -45459 -44885 -43719 -42549
1134 -42549 -41200 -42713 -43074 -43436 -45407 -47375 -49256 -51138 -48727 -46312 -47777 -49242 -50706 -52167 -51097 -50028 -48958 -47885
1152 -47885 -47509 -47132 -46756 -46376 -42333 -38289 -41401 -44509 -45310 -46111 -46912 -47710 -50091 -52472 -51515 -50553 -50322 -50091 -47475 -44859
1172 -44859 -43406 -41952 -41930 -41908 -42094 -42280 -42467 -42653 -44479 -46305 -48131 -49957 -50941 -51921 -52905 -53885 -51977 -50065 -47024 -43980
1192 -43980 -42877 -46540 -47524 -48504 -48772 -49037 -49305 -49569 -49853 -50132 -52498 -54865 -54731 -49823 -44736 -44419 -46931 -46577 -44792 -43007
1212 -43007 -42210 -41408 -42038 -42668 -43696 -44725 -47184 -49640 -51116 -52592 -52636 -52677 -52223 -51768 -51313 -50855 -51623 -52390 -53158 -53922 -52856
1233 -52856 -51790 -50725 -49659 -46924 -44188 -44792 -45392 -47874 -50356 -50453 -50550 -49543 -48537 -47531 -46521 -47423 -48321 -50356 -52387
1252 -52387 -54451 -51742 -50285 -48828 -49715 -50598 -52916 -55230 -54388 -53542 -52696 -51850 -51451 -51049 -50646 -50244 -48295 -46342 -44390 -42437
1272 -42437 -44192 -45944 -47695 -49446 -50218 -50986 -50322 -49659 -48969 -48280 -47412 -46540 -47460 -45519 -41967 -44136 -44401 -44665 -43857 -43044
1292 -43044 -43846 -44647 -44017 -43383 -44814 -46245 -47676 -49107 -48243 -47378 -47945 -48507 -47129 -45750 -46756 -47762 -47457 -47151 -48276 -49398
1312 -49398 -47859 -46320 -47166 -48012 -47576 -47140 -49089 -51034 -50248 -49461 -48675 -47889 -47252 -46614 -48362 -50106 -48250 -46391 -48828 -51261
1332 -51261 -49704 -48142 -49923 -51701 -50546 -49387 -50617 -51843 -51045 -50244 -50877 -51507 -51112 -50713 -48887 -47058 -45947 -44833 -44796
1351 -44796 -50479 -51343 -52204 -51041 -49875 -48235 -46592 -46383 -46171 -48496 -50818 -49804 -48787 -48727 -48664 -46219 -43771 -44963 -46152
1370 -46152 -45914 -45671 -47639 -49603 -51571 -53534 -52547 -51556 -50568 -49577 -48858 -48135 -47416 -46693 -46972 -47248 -46096 -44941 -48440 -51936
1390 -51936 -53050 -54161 -53296 -52431 -51567 -50702 -51120 -51537 -48615 -45694 -45709 -45724 -44308 -42891 -42817 -42742 -44099 -45455 -46316 -47177 -48038
1411 -48038 -48899 -47345 -45791 -46622 -47453 -49312 -51172 -51600 -52029 -54932 -57835 -57399 -56963 -55267 -53568 -51869 -50169 -50143 -50114 -48653
1431 -48653 -47192 -47553 -47911 -48269 -48627 -48899 -49167 -49435 -49704 -49525 -49342 -49160 -48977 -48798 -48615 -48433 -48250 -47870 -47486 -47102 -46719 -44908
1453 -44908 -43093 -43663 -44233 -46227 -48220 -48783 -49342 -49547 -49752 -49957 -50158 -50169 -50181 -53411 -50915 -48601 -46286 -45999 -45709 -44539 -43369
1474 -43369 -43629 -43886 -44922 -45958 -44609 -43257 -44673 -46089 -48936 -51779 -49886 -47993 -47531 -47065 -48090 -49115 -50140 -51164
1492 -51164 -49238 -47311 -48724 -50136 -49782 -49428 -51459 -53490 -55193 -56896 -57168 -57440 -55264 -53087 -50911 -48735 -47572 -46409
1510 -46409 -48586 -50762 -51202 -51641 -52081 -52521 -51440 -50359 -50710 -51060 -50527 -49991 -51843 -53691 -54261 -54828 -55398 -55964 -57481 -58994
1530 -58994 -56098 -50337 -47114 -46748 -46029 -45306 -46678 -48045 -47211 -46372 -44673 -45832 -47173 -45649 -44397 -46003 -47255 -48504
1548 -48504 -49726 -50945 -50736 -50523 -52539 -54556 -53233 -51906 -50345 -48783 -48832 -48876 -50833 -55651 -58085 -57652 -57701 -57749 -57440 -57127
1568 -57127 -58606 -57224 -57451 -57675 -58886 -60097 -60533 -58103 -56683 -55264 -53665 -52062 -51120 -50177 -51023 -49003 -47307 -48470 -50233
1587 -50233 -51992 -51995 -51995 -50747 -49495 -50825 -55014 -55987 -56955 -56974 -54127 -50509 -46886 -47591 -48291 -48399 -45642 -44587 -46391 -46409 -46424
1608 -46424 -47591 -48753 -48489 -48220 -46644 -45064 -44919 -44770 -47222 -49670 -53732 -54928 -51448 -47963 -47643 -47319 -47401 -47479 -46130 -44777
1628 -44777 -45992 -47203 -48418 -49629 -49476 -49320 -49167 -49010 -51362 -53710 -54332 -52089 -50132 -48172 -49376 -50576 -49752 -48925 -47922
1647 -47922 -49778 -51526 -53270 -52812 -52349 -50997 -49640 -51626 -53609 -53874 -54134 -52968 -51798 -53374 -54947 -53184 -51418 -52707
1665 -52707 -53993 -52897 -51798 -51328 -50855 -50386 -49912 -49092 -48269 -48880 -49487 -49651 -49812 -51407 -52998 -52696 -52390 -53520 -54645 -53598
1685 -53598 -52547 -51500 -50449 -50609 -50766 -45321 -45597 -45549 -45496 -45806 -46111 -47453 -48791 -50132 -51470 -49860 -48247 -49976 -51701
1704 -51701 -50419 -49133 -47852 -46566 -46357 -46145 -45936 -45724 -47397 -49066 -47401 -45731 -46778 -47822 -48869 -49912 -50781 -51645 -52513
1723 -52513 -53378 -52368 -51354 -50345 -49331 -51146 -52961 -53344 -53728 -51817 -49905 -51332 -52759 -54187 -55614 -54656 -53698 -54708
1741 -54708 -55718 -53389 -51060 -50460 -49856 -50684 -51511 -52014 -52513 -53013 -53512 -53315 -53113 -54343 -55573 -55972 -56367 -55331 -54295 -53162
1761 -53162 -52029 -50896 -49760 -50952 -52144 -50952 -49756 -49771 -49786 -49800 -49812 -51079 -52346 -52003 -51656 -52621 -50725 -50438 -50151 -49864 -49577
1782 -49577 -49290 -49003 -49625 -50248 -49439 -48630 -48627 -48623 -48619 -48615 -48753 -48887 -49025 -49160 -50490 -51817 -50762 -49704 -50259 -50810 -47371 -46789 -49163
1805 -49163 -51533 -51701 -51865 -51585 -51302 -51019 -50736 -49353 -47967 -48966 -49964 -50915 -51861 -49648 -47434 -46476 -48377 -48847 -46454 -45772
1825 -45772 -45090 -45660 -49089 -52759 -51660 -47520 -46238 -47546 -48854 -47956 -47054 -46544 -46033 -45522 -45008 -46499 -47986 -48220 -48455 -49916
1845 -49916 -54235 -57123 -57149 -54809 -52465 -51373 -50281 -49312 -48340 -49752 -51164 -53874 -56579 -58688 -57936 -56322 -57567 -58811
1863 -58811 -57194 -52763 -51190 -52897 -54604 -55688 -53907 -52305 -50702 -50017 -49331 -50076 -50818 -52607 -54395 -56005 -57611 -57760
1881 -57760 -55047 -50904 -49618 -49022 -48425 -49737 -53907 -53903 -53900 -54254 -51742 -50844 -49946 -50300 -50650 -49633 -48615 -50162 -51705 -53102
1901 -53102 -57362 -56672 -55979 -54731 -53482 -52413 -51340 -50061 -51645 -52871 -54093 -54097 -51239 -49514 -52554 -54883 -54351 -55726 -57097
1920 -57097 -57134 -57172 -57209 -57242 -57727 -58211 -58696 -59176 -57529 -55882 -57276 -55804 -54157 -52510 -52890 -53266 -55539 -54951 -54362 -56631 -56907
1941 -56907 -57183 -57637 -58088 -56777 -55465 -54332 -53195 -51973 -53613 -55252 -54026 -54354 -54682 -55189 -52830 -49968 -49968 -48776 -50441
1960 -50441 -52655 -52007 -50762 -49514 -51548 -53583 -54187 -54787 -52484 -50181 -49487 -48794 -46491 -47050 -47609 -48168 -48742 -52178 -55256
1979 -55256 -53564 -52946 -52327 -53020 -50851 -51548 -52245 -52942 -53639 -52130 -53482 -54656 -55830 -56512 -57194 -57101 -54146 -53397 -52648 -51720 -50792
2000 -50792 -50181 -49569 -47348 -47986 -50475 -52964 -53128 -50427 -50576 -53587 -54988 -53523 -53792 -54060 -54149 -54235 -53956 -53676 -53218 -52756 -52953
2021 -52953 -50289 -47982 -45671 -42843 -42877 -47203 -48664 -46551 -44438 -46260 -48079 -51645 -52349 -53233 -54112 -55681 -57250 -56434 -55614
2040 -55614 -55297 -54980 -54664 -54343 -54235 -54127 -54019 -53907 -53900 -53892 -53885 -53874 -56072 -58271 -57131 -55987 -52804 -49622 -49897 -53031 -54351 -52808
2062 -52808 -50848 -48884 -48779 -51537 -52685 -53829 -56288 -58748 -57868 -56985 -55726 -54466 -53207 -51943 -52264 -52584 -52905 -53221 -53676
2081 -53676 -54131 -54406 -54679 -55670 -53799 -51928 -52916 -52178 -51440 -50881 -50318 -50356 -50393 -50251 -50106 -52346 -51723 -52711 -53695 -52715 -51735 -50933
2103 -50933 -50128 -48463 -49659 -51034 -49543 -48832 -50982 -54563 -55278 -52376 -52335 -54798 -57257 -55606 -53956 -52901 -54705 -57459
2121 -57459 -57350 -57302 -54388 -54280 -54172 -51679 -49182 -46350 -46380 -49092 -51805 -52133 -52461 -52789 -53117 -53363 -53609 -53855 -54101 -53542 -52983
2142 -52983 -52424 -51865 -53106 -54347 -52249 -50151 -49305 -48459 -50654 -49987 -50818 -51649 -52301 -52953 -52144 -51336 -50527 -49719 -49838 -49957 -50076
2163 -50076 -50192 -49506 -48820 -49566 -50307 -49301 -48295 -47289 -46279 -47389 -48500 -49610 -50717 -50669 -50620 -50572 -50520 -53989 -57459 -58543
2183 -58543 -59624 -59814 -60004 -58763 -57518 -55383 -53248 -52543 -51835 -50076 -48317 -47989 -47661 -48884 -50106 -52759 -55413 -55755 -56098
2202 -56098 -54056 -52014 -51820 -51626 -52864 -54101 -50948 -47796 -47028 -46260 -48981 -51701 -52990 -54280 -54854 -55428 -56001 -56575 -55599
2221 -55599 -54623 -53646 -52670 -51190 -49711 -49663 -49610 -48787 -47963 -48571 -49174 -50460 -51746 -53031 -54313 -55808 -57302 -57365 -54563 -51041
2241 -51041 -52290 -54015 -55737 -54779 -53821 -54295 -54764 -55871 -56978 -56654 -56326 -56031 -55737 -55442 -55144 -51977 -48806 -48977 -49145 -50240
2261 -50240 -51332 -50043 -48750 -48608 -48463 -50706 -52946 -54742 -56534 -54992 -53445 -52834 -52219 -51608 -50993 -51723 -52450 -54611 -56769
2280 -56769 -55398 -54023 -54082 -54138 -54496 -54850 -57593 -60332 -58211 -56091 -55401 -54712 -52234 -49756 -49663 -49569 -51831 -54093 -53970 -53848 -54857
2301 -54857 -55867 -56877 -57887 -56180 -54474 -52767 -51060 -50576 -50091 -51038 -51984 -52797 -53609 -54421 -55234 -55152 -55070 -54988 -54906 -53922 -52935 -53203
2323 -53203 -53467 -54720 -53106 -48992 -49644 -49271 -48895 -47389 -45880 -44077 -42269 -44759 -47244 -49338 -51429 -51138 -50844 -51388 -51928
2342 -51928 -51041 -50151 -49040 -47926 -48247 -51425 -55264 -54328 -51310 -51150 -51362 -51574 -49581 -47587 -49409 -51231 -51623 -52014 -50825
2361 -50825 -49637 -49879 -50121 -50125 -50128 -51563 -52998 -52335 -51671 -49577 -47483 -46521 -45560 -48891 -52223 -52230 -52238 -50814 -49391 -48683 -47974 -47266
2383 -47266 -46558 -48142 -49726 -51310 -52894 -55431 -57969 -59851 -56963 -53896 -50829 -50803 -50777 -52480 -54183 -52547 -50911 -49726
2401 -49726 -48541 -49741 -50941 -53780 -56620 -56121 -55621 -57149 -58677 -60205 -61733 -60071 -58409 -56747 -55085 -53587 -52085 -50587
2419 -50587 -49085 -48422 -47755 -47091 -46424 -46827 -47225 -47628 -48027 -48250 -48470 -48515 -48556 -52033 -52644 -50218 -50650 -52636 -51757 -51239 -50717 -51697
2441 -51697 -52674 -52044 -51410 -53911 -53546 -50322 -49957 -49033 -48105 -48612 -49115 -49473 -46965 -43387 -44576 -46007 -47434 -47375 -50173 -53095
2461 -53095 -53151 -52137 -51120 -53430 -55737 -55185 -54630 -54347 -54060 -55208 -56352 -54876 -53397 -51921 -50441 -52275 -54105 -55938 -57768
2480 -57768 -57630 -57492 -57175 -56855 -58029 -56341 -54652 -55823 -52241 -48660 -48418 -51034 -51299 -51563 -52007 -52446 -53397 -54343 -51951 -52420
2500 -52420 -54652 -52111 -47065 -46789 -45183 -46435 -46376 -46316 -48138 -49957 -51954 -51090 -49789 -48485 -49864 -51243 -52536 -53825 -52253
2519 -52253 -50680 -51757 -52830 -53903 -54977 -54742 -54503 -52655 -53669 -53013 -52357 -51701 -51041 -51220 -48537 -50326 -52111 -51723 -51336
2538 -51336 -50948 -50557 -50706 -50855 -51004 -51150 -51217 -51284 -51351 -51414 -53210 -55006 -56803 -58595 -55979 -53363 -53609 -53851 -55290 -56728 -58167
2559 -58167 -59601 -60749 -61897 -60183 -58465 -58003 -57541 -55647 -53751 -53661 -53572 -52051 -50527 -53270 -56013 -57324 -58632 -57343 -56050
2578 -56050 -54757 -53464 -53725 -53982 -55670 -57358 -59661 -61960 -59489 -57019 -56013 -55003 -55424 -55845 -54049 -52249 -51880 -51511 -50699
2597 -50699 -49882 -50497 -51112 -50613 -50110 -49607 -49104 -48336 -47565 -46793 -46022 -47121 -48220 -49320 -50419 -50684 -50948 -51213 -51477 -52264 -53050
2618 -53050 -53836 -54623 -53620 -52618 -51615 -50613 -51198 -51783 -52368 -52953 -55983 -59012 -59180 -59348 -59016 -58685 -58353 -58021 -57123 -56225 -56758
2639 -56758 -57291 -52733 -48176 -47434 -51459 -50449 -46577 -44613 -47416 -50959 -51641 -49461 -47278 -46707 -46137 -45567 -44993 -46957 -48921
2658 -48921 -50885 -52845 -53974 -55103 -56232 -57358 -56810 -56262 -55714 -55163 -55122 -55081 -55219 -55353 -52920 -53348 -54552 -55752 -54988 -54224
2678 -54224 -54712 -55197 -57272 -56486 -55700 -57772 -58148 -58524 -56695 -54861 -54481 -54101 -57060 -60015 -57816 -55618 -53598 -51574 -49860
2697 -49860 -51008 -52156 -53300 -51884 -53330 -56505 -59676 -59311 -58945 -58580 -58211 -58055 -57898 -57742 -57581 -56911 -56240 -53959 -54537 -53300
2717 -53300 -52062 -52435 -52804 -52774 -52744 -52715 -52681 -51518 -50356 -49014 -50531 -49711 -48891 -48250 -47606 -48694 -49782 -49439 -49092 -48802 -48511 -48220
2739 -48220 -47926 -48619 -49312 -51436 -53557 -52357 -51157 -51388 -51615 -54798 -57980 -57824 -57663 -57067 -56471 -54086 -54559 -56855 -56288 -57332
2759 -57332 -58371 -57790 -54347 -50904 -50318 -51645 -52972 -53046 -53117 -52972 -52823 -51243 -49663 -50143 -50620 -49487 -51217 -50870 -50520 -51958
2779 -51958 -53397 -52245 -53952 -55659 -54503 -55055 -55603 -55972 -56341 -55014 -53684 -54738 -55793 -56419 -57041 -57485 -57928 -58137 -55480
2798 -55480 -54433 -53385 -51023 -48656 -48973 -52152 -52920 -53684 -52241 -50799 -50233 -49663 -53207 -56750 -56065 -52513 -48962 -48273 -48675
2817 -48675 -49074 -49651 -50229 -49946 -49659 -49193 -48727 -52961 -54328 -53013 -51697 -51548 -51395 -53449 -55502 -56128 -53892 -50225 -49420 -49897
2837 -49897 -50374 -53415 -56456 -55517 -54578 -53639 -52700 -52834 -52968 -55308 -57649 -57973 -55435 -52897 -53221 -53605 -53989 -54552 -55115 -55051 -54988
2858 -54988 -51884 -51641 -54529 -57418 -60663 -61047 -60879 -60712 -61498 -62281 -63902 -60753 -55100 -56121 -57690 -59258 -58860 -58457 -55137
2877 -55137 -51817 -50881 -49942 -49230 -48519 -51981 -52577 -50315 -50915 -53065 -55211 -53285 -51358 -52771 -54179 -53475 -52771 -52066 -51358 -51202
2897 -51202 -51041 -53266 -55491 -57630 -59765 -58562 -57358 -55577 -53792 -55167 -56542 -55983 -52558 -50743 -48928 -52443 -55953 -58688
2915 -58688 -58562 -56501 -54436 -52014 -52454 -53419 -54380 -54090 -53799 -52200 -50598 -50427 -50255 -48716 -47173 -48019 -48861 -48962 -49059 -49160 -49256
2936 -49256 -50527 -51794 -51634 -51470 -52830 -54187 -54116 -54041 -55372 -56698 -56598 -56493 -58032 -59568 -61107 -62642 -59985 -57324 -56098
2955 -56098 -54869 -55729 -56586 -57447 -58304 -57179 -56054 -53497 -50937 -51213 -51489 -51764 -52036 -53400 -54764 -56128 -57488 -55722 -53956
2974 -53956 -54574 -55189 -56061 -56933 -57805 -58673 -57816 -56959 -56102 -55241 -53415 -51589 -52148 -52703 -54902 -57101 -56914 -56724 -57164 -57604 -55659
2995 -55659 -53710 -55282 -56855 -56042 -55226 -53937 -52648 -53743 -54835 -52771 -50706 -50073 -49435 -49476 -49517 -52897 -56273 -56016 -55759 -57887
3015 -57887 -60011 -58696 -57380 -57317 -57250 -57663 -55215 -52826 -55204 -58621 -57268 -53650 -50032 -51571 -53110 -54649 -56188 -57600
3033 -57600 -59012 -58994 -58975 -57883 -56791 -59039 -61286 -60533 -59780 -59027 -58275 -58327 -58379 -56046 -53713 -52476 -51239 -51433 -51626 -53102 -54578
3054 -54578 -52715 -50851 -52234 -53616 -54999 -56382 -55409 -54436 -55849 -57261 -54112 -50963 -52107 -53251 -55946 -58640 -58949 -59258
3072 -59258 -61207 -63156 -60812 -58468 -55975 -53482 -53374 -53266 -52838 -52409 -51981 -51552 -54790 -58029 -58882 -59735 -59672 -59609 -58114 -56616
3092 -56616 -55122 -53628 -53564 -53497 -52480 -51463 -52830 -54194 -54041 -53888 -52305 -50717 -51429 -52141 -52853 -53561 -54272 -54984 -55696 -56404 -54835
3113 -54835 -53266 -53128 -52987 -54429 -55871 -53974 -52074 -53743 -55409 -55644 -55878 -56624 -57365 -58107 -58849 -59318 -59784 -58819 -57854 -60082
3133 -60082 -62307 -61192 -60078 -59579 -59076 -57142 -55208 -56229 -57246 -58263 -59281 -56516 -53747 -52409 -51071 -53702 -56329 -55618
3151 -55618 -54906 -56378 -57850 -57891 -57928 -57492 -57056 -59005 -60950 -61364 -61778 -60760 -59739 -59318 -58897 -58476 -58051 -56806 -55562 -54317
3171 -54317 -53069 -51705 -50341 -52316 -54287 -54980 -55673 -52074 -48470 -50654 -52838 -53590 -54339 -54842 -55342 -57093 -58845 -57619 -53527
3190 -53527 -50747 -52737 -53911 -55081 -54164 -53248 -52752 -52253 -50322 -48392 -47233 -46070 -47293 -48515 -49860 -51202 -52543 -53885
3208 -53885 -53903 -53918 -53933 -53948 -53609 -53266 -52923 -52580 -51559 -50535 -49510 -48485 -47732 -46976 -47650 -48325 -48973 -49618 -50263 -50907 -51436 -51962 -53918
3231 -53918 -55875 -54462 -53046 -51630 -50214 -51872 -53527 -55182 -56836 -55800 -54760 -53721 -52681 -51824 -50963 -52487 -54011 -55521
3249 -55521 -57026 -54239 -51451 -50754 -50054 -50784 -51515 -51246 -50974 -53087 -55200 -54425 -53646 -52867 -52089 -53993 -55893 -56363 -56832 -54891
3269 -54891 -52946 -54339 -55733 -53389 -51041 -52033 -53024 -52797 -52566 -50904 -49242 -49089 -48936 -48783 -48630 -50833 -53035 -52853 -52670 -55618
3289 -55618 -58565 -58174 -57783 -55662 -53542 -52853 -52163 -53568 -54973 -53993 -53013 -52003 -50993 -49983 -48973 -52346 -55718 -56706 -57693
3308 -57693 -57369 -57045 -56721 -56396 -55457 -54518 -55010 -55498 -53933 -52368 -55096 -57820 -57432 -57045 -54272 -51496 -54000 -56505 -55670 -54831
3328 -54831 -54485 -54138 -53792 -53441 -54347 -55252 -56158 -57060 -54716 -52372 -52413 -52450 -54548 -56646 -54451 -52253 -54533 -56810 -57660 -58506 -59176
3349 -59176 -59843 -58129 -56411 -54682 -52949 -54559 -56165 -56374 -56579 -56788 -56993 -59255 -61513 -63656 -60071 -56430 -52785 -53080 -53370
3368 -53370 -53609 -53844 -54082 -54317 -53751 -53180 -54045 -54906 -55744 -56583 -55990 -55398 -53613 -51828 -53382 -54936 -54116 -53296 -54861 -56426 -55040
3389 -55040 -53654 -52267 -50881 -48701 -46521 -47680 -48839 -50713 -52588 -54105 -55621 -58051 -54757 -52297 -49838 -52208 -54578
3406 -54578 -56232 -52163 -50087 -53732 -53803 -53870 -53404 -52935 -53900 -54861 -54183 -53501 -52823 -52141 -53370 -54597 -55826 -57052 -59117 -61178
3426 -61178 -59903 -58625 -57768 -56907 -56050 -55189 -54854 -54515 -55610 -56702 -56218 -55729 -55245 -54757 -55178 -55595 -53330 -51064 -48832 -49458
3446 -49458 -51515 -50710 -49696 -48679 -47483 -51056 -52785 -51649 -52241 -52834 -55118 -54537 -52525 -53374 -51574 -49771 -48146 -51291
3464 -51291 -55905 -57652 -58446 -59240 -57116 -54988 -55722 -56456 -56642 -56825 -54149 -51470 -51656 -51839 -52025 -52208 -52767 -53322 -53881 -54436 -55949
3485 -55949 -57459 -56110 -54757 -54910 -55059 -58073 -61084 -62191 -63294 -58021 -55606 -55059 -54507 -54138 -53766 -55782 -57794 -56769 -55741
3504 -55741 -56687 -54772 -54466 -54157 -55789 -57421 -54283 -54004 -56788 -54801 -54246 -53687 -53639 -53590 -53542 -53490 -52383 -51276 -53031 -54783 -54570
3525 -54570 -54358 -55755 -54287 -55040 -55793 -56188 -56579 -56378 -53315 -51861 -50404 -51582 -52756 -51366 -49976 -49275 -53341 -56154 -58968
3544 -58968 -59862 -60753 -58781 -56810 -57555 -58297 -57250 -59065 -58998 -56065 -53311 -53419 -55379 -57336 -57682 -60891 -60988 -58219 -55629 -55901
3564 -55901 -56564 -57224 -59672 -59258 -57604 -55949 -55547 -55141 -54500 -53859 -56080 -58297 -58327 -58357 -56955 -55551 -54388 -53225 -50632 -48034
3584 -48034 -48258 -48481 -48705 -48925 -49655 -50386 -51116 -51843 -52633 -53423 -54213 -54999 -54865 -54731 -54597 -54459 -54589 -54720 -53419 -52118 -52338 -52558
3606 -52558 -49916 -47274 -46197 -45120 -46905 -48690 -48150 -47609 -49931 -52253 -52458 -52659 -52860 -53061 -52819 -52573 -55189 -57805 -58636
3625 -58636 -59463 -58860 -58256 -57328 -56396 -55465 -54533 -54198 -53862 -53527 -53188 -52495 -51802 -51109 -50412 -50121 -49830 -49540 -49245 -48209 -47173 -46137
3647 -46137 -45098 -47024 -48947 -52305 -55659 -56423 -57183 -55085 -52983 -50289 -47591 -49666 -51738 -53218 -54693 -56173 -57649 -55819
3665 -55819 -53989 -52159 -50326 -50941 -51556 -52171 -52782 -51876 -50971 -52927 -54880 -54392 -53903 -53415 -52923 -54466 -56009 -57552 -59091 -58845
3685 -58845 -58599 -58353 -58103 -57190 -56277 -55364 -54447 -53862 -53277 -52692 -52103 -51735 -51362 -53378 -55390 -55170 -54947 -56158 -57365 -57514 -57660
3706 -57660 -56378 -55092 -53631 -52167 -53091 -54011 -55714 -57414 -57388 -57358 -57600 -53069 -48720 -51045 -51757 -49603 -49480 -49353 -50005 -50654
3726 -50654 -51306 -51954 -54257 -56557 -55517 -54477 -53978 -53475 -55357 -57239 -56568 -55893 -55219 -54544 -55752 -56955 -56728 -56501 -54623 -52741
3746 -52741 -52290 -51839 -54582 -57321 -57675 -58029 -58029 -58025 -58021 -58017 -58524 -59027 -57145 -55264 -53244 -51224 -51589 -51954 -52856 -53758 -54660 -55562 -55062
3769 -55062 -54563 -54064 -53564 -55092 -56620 -55763 -54906 -54090 -53274 -53888 -54503 -53419 -52335 -53635 -54936 -55774 -56613 -57451 -58290 -59158 -60026
3790 -60026 -56900 -53773 -49942 -50877 -52469 -54060 -55118 -56173 -57227 -58282 -57701 -57116 -56531 -55946 -56348 -56747 -58576 -60406 -58677
3809 -58677 -56944 -55211 -53479 -53061 -52640 -52219 -51798 -51366 -50930 -52879 -54828 -55916 -57000 -54746 -52491 -53676 -54857 -54608 -54358
3828 -54358 -53277 -52193 -52539 -52886 -50195 -47501 -48146 -48791 -50632 -52469 -52875 -53281 -54030 -54775 -54090 -53404 -54779 -56150 -54481 -55673
3848 -55673 -55014 -54351 -52077 -52666 -54511 -53490 -51872 -50255 -51302 -52349 -53397 -54440 -54891 -55342 -55972 -53736 -53508 -53281 -52875
3867 -52875 -52465 -53520 -54574 -55629 -56680 -55442 -54205 -51537 -51727 -51831 -54798 -57764 -60727 -60041 -59355 -58371 -57384 -58517 -54880
3886 -54880 -52316 -52610 -52923 -53233 -53725 -54213 -54734 -55252 -57384 -56650 -57976 -59299 -58241 -57179 -56389 -58457 -58144 -54965 -53710 -52450
3906 -52450 -54354 -56255 -56698 -57138 -57581 -58021 -55841 -53657 -53207 -55614 -56236 -56855 -57835 -58811 -53434 -50918 -52994 -55066 -55860 -56654
3926 -56654 -56195 -55733 -52100 -51328 -53121 -52048 -50441 -51697 -53549 -55398 -55182 -54965 -51410 -47852 -50557 -53262 -52629 -51992 -53311
3945 -53311 -54630 -57380 -60127 -58763 -57399 -54604 -51805 -54190 -56572 -55614 -54656 -53941 -53221 -52502 -51783 -51858 -51928 -51999 -52070 -52741 -53408
3966 -53408 -54075 -54742 -54913 -55081 -55249 -55416 -54753 -54086 -53419 -52752 -53184 -53613 -54041 -54470 -55111 -55748 -56385 -57023 -54392 -51757 -52465 -53169
3988 -53169 -55159 -57145 -57704 -58260 -56203 -54142 -53516 -52886 -55808 -58726 -57354 -55979 -54965 -53948 -52935 -51917 -49204 -46488
4006 -46488 -48068 -49644 -52327 -55006 -56259 -57507 -58103 -58696 -57861 -57023 -56307 -55588 -58211 -60831 -59370 -57906 -57876 -57842 -55905 -53963
4026 -53963 -52025 -50084 -51545 -53002 -54462 -55919 -54578 -53233 -53322 -53408 -52126 -50840 -52897 -54951 -54496 -54038 -53583 -53125 -53624
4045 -53624 -54120 -54619 -55115 -53844 -52573 -53687 -54798 -54570 -54343 -54116 -53885 -54455 -55025 -55595 -56162 -56285 -56408 -56232 -56054 -59121 -57418
4066 -57418 -55357 -56154 -57671 -59188 -56590 -53989 -54254 -54518 -54783 -55044 -55487 -55931 -56374 -56814 -56601 -56389 -57608 -58822 -57000 -55178
4086 -55178 -56695 -58208 -57921 -57634 -57347 -57056 -57395 -57734 -55688 -53639 -52603 -51567 -49398 -47225 -48008 -53561 -56907 -55480 -54235
4105 -54235 -55852 -55562 -55267 -56080 -56892 -57704 -58513 -57738 -56959 -56184 -55405 -55226 -55044 -54865 -54682 -54697 -54708 -54723 -54734 -54898 -55059 -55223 -55383 -56736
4129 -56736 -58085 -56098 -54108 -56087 -58062 -57656 -57246 -56184 -55118 -56441 -57760 -55655 -53546 -53825 -54101 -53676 -53248 -52819 -52390
4148 -52390 -51757 -51120 -52867 -54615 -56993 -59366 -60309 -61252 -62228 -63201 -61789 -60376 -59273 -58167 -57060 -55953 -56490 -57023 -57555
4167 -57555 -58088 -57522 -56952 -56382 -55811 -54887 -53959 -53031 -52103 -53128 -54153 -55178 -56203 -56005 -55808 -55610 -55413 -57138 -58863 -58204 -57544
4188 -57544 -57779 -58014 -58249 -58483 -58226 -57969 -56281 -54593 -53441 -52290 -53523 -54757 -54425 -54093 -52450 -53669 -52771 -56642 -59620
4207 -59620 -59735 -57634 -55528 -55927 -56326 -58994 -58796 -58957 -56255 -55659 -55059 -54459 -53859 -53084 -55167 -55640 -56113 -56780 -57444 -55424 -53404
4228 -53404 -51716 -52886 -55487 -55226 -55252 -55275 -55118 -54962 -54749 -54533 -55867 -52431 -50967 -54272 -57459 -60645 -60343 -60041 -56519 -55860
4248 -55860 -57153 -55584 -54552 -53520 -52308 -53959 -55610 -54399 -54552 -54701 -56285 -55003 -54500 -53993 -53311 -52625 -53561 -54492 -55249
4267 -55249 -56001 -57950 -57034 -57731 -58424 -56926 -55424 -56784 -58144 -57898 -57649 -57399 -57149 -56657 -56162 -55487 -54813 -56736 -55793 -55029 -54265
4288 -54265 -55957 -57649 -56478 -55305 -52405 -49506 -49469 -49428 -50926 -52424 -50702 -51839 -54559 -54418 -56065 -57708 -58025 -58338 -60265
4307 -60265 -59326 -59404 -59478 -59378 -59273 -59486 -59694 -59907 -60116 -57883 -55647 -56277 -56903 -56706 -56508 -56490 -56471 -56095 -58580 -58204 -54965 -54611 -54257
4330 -54257 -55513 -53907 -49439 -47833 -49208 -50583 -50736 -50885 -51034 -51183 -51038 -50889 -50740 -50591 -50728 -50863 -50997 -51131 -51090 -51045 -51000 -50956
$$ [...]
##END=	
