##TITLE=	+wE4DzkPTkexqCBMAnE22g/0431s
##JCAMPDX=	6.0	$$ NMR Plug-in 1.13 of MestReNova 11.0.4-18998
##DATATYPE=	NMRSPECTRUM
##DATACLASS=	XYDATA
##NUMDIM=	1
##ORIGIN=	Bruker BioSpin GmbH
##OWNER=	andrew
##.OBSERVEFREQUENCY=	600.30184456100005264
##.OBSERVENUCLEUS=	^1H
##.SOLVENTNAME=	CD2Cl2
##.PULSESEQUENCE=	zg
##LONGDATE=	2015/06/05 09:52:11.000
##.ACQUISITIONMODE=	SIMULTANEOUS (DQD)
##$ORIGINALFORMAT=	Bruker XWIN-NMR
##$PARAMETERFILE=	(acqus, ASCII, /var/folders/f6/rjf_tdyn2v98c5c0wvkgn4s80000gn/T/+wE4DzkPTkexqCBMAnE22g/0431s/acqus, 0)
$$ ##TITLE= Parameter file, TOPSPIN		Version 2.1
$$ ##JCAMPDX= 5.0
$$ ##DATATYPE= Parameter Values
$$ ##NPOINTS= 10	$$ modification sequence number
$$ ##ORIGIN= Bruker BioSpin GmbH
$$ ##OWNER= andrew
$$ $$ 2015-06-05 14:52:11.281 +0600  andrew@av-600
$$ $$ /opt/data/andrew/nmr/limog-1782/602/acqus
$$ $$ process /opt/ts21pl6/prog/mod/shimcntl
$$ ##$ACQT0= -9.54927425515661
$$ ##$AMP= (0..31)
$$ 100 100 100 100 100 100 100 100 100 100 100 100 100 100 100 100 100 100
$$ 100 100 100 100 100 100 100 100 100 100 100 100 100 100
$$ ##$ANAVPT= -1
$$ ##$AQSEQ= 0
$$ ##$AQ_mod= 3
$$ ##$AUNM= <au_zg>
$$ ##$AUTOPOS= <>
$$ ##$BF1= 600.3
$$ ##$BF2= 600.3
$$ ##$BF3= 600.3
$$ ##$BF4= 600.3
$$ ##$BF5= 600.3
$$ ##$BF6= 600.3
$$ ##$BF7= 600.3
$$ ##$BF8= 600.3
$$ ##$BYTORDA= 0
$$ ##$CFDGTYP= 0
$$ ##$CFRGTYP= 9
$$ ##$CHEMSTR= <none>
$$ ##$CNST= (0..63)
$$ 1 1 145 1 1 1 1 1 1 1 1 1 1 1 1 1 1 1 1 1 1 1 1 1 1 1 1 1 1 1 1 1 1 1 1
$$ 1 1 1 1 1 1 1 1 1 1 1 1 1 1 1 1 1 1 1 1 1 1 1 1 1 1 1 1 1
$$ ##$CPDPRG= <>
$$ ##$CPDPRG1= <>
$$ ##$CPDPRG2= <waltz16>
$$ ##$CPDPRG3= <>
$$ ##$CPDPRG4= <mlev>
$$ ##$CPDPRG5= <mlev>
$$ ##$CPDPRG6= <mlev>
$$ ##$CPDPRG7= <mlev>
$$ ##$CPDPRG8= <mlev>
$$ ##$CPDPRGB= <>
$$ ##$CPDPRGT= <>
$$ ##$D= (0..63)
$$ 0 1 0 0 0 0 0 0 0 0.06 0 0.03 0 0 0 0 1e-04 0 0 0 0 0 0 0 0 0 0 0 0 0 0
$$ 0 0 0 0 0 0 0 0 0 0 0 0 0 0 0 0 0 0 0 0 0 0 0 0 0 0 0 0 0 0 0 0 0
$$ ##$DATE= 1433494331
$$ ##$DBL= (0..7)
$$ 120 120 120 120 120 120 120 120
$$ ##$DBP= (0..7)
$$ 150 150 150 150 150 150 150 150
$$ ##$DBP07= 0
$$ ##$DBPNAM0= <>
$$ ##$DBPNAM1= <>
$$ ##$DBPNAM2= <>
$$ ##$DBPNAM3= <>
$$ ##$DBPNAM4= <>
$$ ##$DBPNAM5= <>
$$ ##$DBPNAM6= <>
$$ ##$DBPNAM7= <>
$$ ##$DBPOAL= (0..7)
$$ 0.5 0.5 0.5 0.5 0.5 0.5 0.5 0.5
$$ ##$DBPOFFS= (0..7)
$$ 0 0 0 0 0 0 0 0
$$ ##$DE= 6.5
$$ ##$DECBNUC= <off>
$$ ##$DECIM= 2218.66666666667
$$ ##$DECNUC= <off>
$$ ##$DECSTAT= 4
$$ ##$DIGMOD= 1
$$ ##$DIGTYP= 12
$$ ##$DL= (0..7)
$$ 0 120 120 120 120 120 120 120
$$ ##$DP= (0..7)
$$ 150 150 150 150 150 150 150 150
$$ ##$DP07= 0
$$ ##$DPNAME0= <>
$$ ##$DPNAME1= <>
$$ ##$DPNAME2= <>
$$ ##$DPNAME3= <>
$$ ##$DPNAME4= <>
$$ ##$DPNAME5= <>
$$ ##$DPNAME6= <>
$$ ##$DPNAME7= <>
$$ ##$DPOAL= (0..7)
$$ 0.5 0.5 0.5 0.5 0.5 0.5 0.5 0.5
$$ ##$DPOFFS= (0..7)
$$ 0 0 0 0 0 0 0 0
$$ ##$DQDMODE= 0
$$ ##$DR= 22
$$ ##$DS= 0
$$ ##$DSLIST= <SSSSSSSSSSSSSSS>
$$ ##$DSPFIRM= 0
$$ ##$DSPFVS= 20
$$ ##$DTYPA= 0
$$ ##$EXP= <>
$$ ##$F1LIST= <111111111111111>
$$ ##$F2LIST= <222222222222222>
$$ [...]
$$ -1 -1 -1 -1 -1 -1 -1 -1 -1 -1 -1 -1 -1 -1 -1 -1 -1 -1 -1 -1 -1 -1 -1 -1
$$ -1 -1 -1 -1 -1 -1 -1 -1 -1 -1 -1 -1 -1 -1 -1 -1 -1 -1 -1 -1 -1 -1 -1 -1
$$ -1 -1 -1 -1 -1 -1 -1 -1 -1 -1 -1 -1 -1 -1 -1 -1 -1 -1 -1 -1 -1 -1 -1 -1
$$ -1 -1 -1 -1 -1 -1 -1 -1 -1 -1 -1 -1 -1 -1 -1 -1 -1 -1 -1 -1 -1 -1 -1 -1
$$ -1 -1 -1 -1 -1 -1 -1 -1 -1 -1 -1 -1 -1 -1 -1 -1
$$ ##$RG_tab8= (0..255)
$$ -1 -1 -1 -1 -1 -1 -1 -1 -1 -1 -1 -1 -1 -1 -1 -1 -1 -1 -1 -1 -1 -1 -1 -1
$$ -1 -1 -1 -1 -1 -1 -1 -1 -1 -1 -1 -1 -1 -1 -1 -1 -1 -1 -1 -1 -1 -1 -1 -1
$$ -1 -1 -1 -1 -1 -1 -1 -1 -1 -1 -1 -1 -1 -1 -1 -1 -1 -1 -1 -1 -1 -1 -1 -1
$$ -1 -1 -1 -1 -1 -1 -1 -1 -1 -1 -1 -1 -1 -1 -1 -1 -1 -1 -1 -1 -1 -1 -1 -1
$$ -1 -1 -1 -1 -1 -1 -1 -1 -1 -1 -1 -1 -1 -1 -1 -1 -1 -1 -1 -1 -1 -1 -1 -1
$$ -1 -1 -1 -1 -1 -1 -1 -1 -1 -1 -1 -1 -1 -1 -1 -1 -1 -1 -1 -1 -1 -1 -1 -1
$$ -1 -1 -1 -1 -1 -1 -1 -1 -1 -1 -1 -1 -1 -1 -1 -1 -1 -1 -1 -1 -1 -1 -1 -1
$$ -1 -1 -1 -1 -1 -1 -1 -1 -1 -1 -1 -1 -1 -1 -1 -1 -1 -1 -1 -1 -1 -1 -1 -1
$$ -1 -1 -1 -1 -1 -1 -1 -1 -1 -1 -1 -1 -1 -1 -1 -1 -1 -1 -1 -1 -1 -1 -1 -1
$$ -1 -1 -1 -1 -1 -1 -1 -1 -1 -1 -1 -1 -1 -1 -1 -1 -1 -1 -1 -1 -1 -1 -1 -1
$$ -1 -1 -1 -1 -1 -1 -1 -1 -1 -1 -1 -1 -1 -1 -1 -1
$$ ##$RG_tabA= (0..255)
$$ 0.25 0.28 0.32 0.35 0.4 0.44 0.5 0.56 0.64 0.7 0.8 0.89 1 1.12 1.28 1.4
$$ 1.6 1.78 2 2.25 2.56 2.8 3.2 3.56 4 4.5 5 5.6 6.35 7.12 8 9 10 11.3 12.7
$$ 14.2 16 18 20.2 22.6 25.4 28.5 32 36 40.3 45.2 50.8 57 64 71.8 80.6 90.5
$$ 101 114 128 144 161 181 203 -1 -1 -1 -1 -1 -1 -1 -1 -1 -1 -1 -1 -1 -1 -1
$$ -1 -1 -1 -1 -1 -1 -1 -1 -1 -1 -1 -1 -1 -1 -1 -1 -1 -1 -1 -1 -1 -1 -1 -1
$$ -1 -1 -1 -1 -1 -1 -1 -1 -1 -1 -1 -1 -1 -1 -1 -1 -1 -1 -1 -1 -1 -1 -1 -1
$$ -1 -1 -1 -1 -1 -1 -1 -1 -1 -1 -1 -1 -1 -1 -1 -1 -1 -1 -1 -1 -1 -1 -1 -1
$$ -1 -1 -1 -1 -1 -1 -1 -1 -1 -1 -1 -1 -1 -1 -1 -1 -1 -1 -1 -1 -1 -1 -1 -1
$$ -1 -1 -1 -1 -1 -1 -1 -1 -1 -1 -1 -1 -1 -1 -1 -1 -1 -1 -1 -1 -1 -1 -1 -1
$$ -1 -1 -1 -1 -1 -1 -1 -1 -1 -1 -1 -1 -1 -1 -1 -1 -1 -1 -1 -1 -1 -1 -1 -1
$$ -1 -1 -1 -1 -1 -1 -1 -1 -1 -1 -1 -1 -1 -1 -1 -1 -1 -1 -1 -1 -1 -1 -1 -1
$$ -1 -1 -1 -1 -1 -1 -1 -1 -1 -1 -1 -1 -1 -1
$$ ##$ROUT14= (0..7)
$$ 0 0 0 0 0 0 0 0
$$ ##$ROUTER= -1
$$ ##$RX22TY= <no>
$$ ##$RXFMAX= (0..7)
$$ 647.5 -1 -1 -1 -1 -1 -1 -1
$$ ##$RXFMIN= (0..7)
$$ 5 -1 -1 -1 -1 -1 -1 -1
$$ ##$RXINTLV= (0..7)
$$ 1 0 0 0 0 0 0 0
$$ ##$RXMSTY= <no>
$$ ##$SCMTY= <no>
$$ ##$SGUC1= (0..15)
$$ 17 18 34 0 0 0 0 0 0 0 0 0 0 0 0 0
$$ ##$SGUC2= (0..15)
$$ 33 256 20 0 0 0 0 0 0 0 0 0 0 0 0 0
$$ ##$SPECTR= 10
$$ ##$SY2FLAG= 0
$$ ##$TFXNUM= 0
$$ ##$TRIPLO2= 0
$$ ##$VTUTY= <tty05>
$$ ##$WBREFAM= (0..15)
$$ 100 100 100 100 100 100 100 100 100 100 100 100 100 100 100 100
$$ ##$WBREFPH= (0..15)
$$ 0 0 0 0 0 0 0 0 0 0 0 0 0 0 0 0
$$ ##$XFAC= 2
$$ ##END=
$$ 
##$DECIM=	2218.66666666667
##$DSPFVS=	20
##XUNITS=	HZ
##YUNITS=	ARBITRARY UNITS
##FIRSTX=	6322.8525384689401108
##LASTX=	-2691.4329892738592207
##XFACTOR=	-0.1375491802509010153
##YFACTOR=	1.0609170898437501087e-05
##NPOINTS=	65536
##XYDATA=	(X++(Y..Y))
$$ [...]
-12267e2637K809m8j479J382K91K94j911j912k630k627P12P11m69m66j896j897L95L99L99
-12248f0580L98m32m28K910K909n51n48n47n48k385k384o56K210J848J848l58l54J013J014
-12229e5621K623k35j580j580O26O30j174j173j531J333O45k217j859j856J882J882L491O33
-12211e5081o22o22Q08k049J643J647J647j215j159j155R7R7J941J945J945J945p12p08n29
-12192e0137n29j229J635J636j226j677j673J487J487K570K575K575K574M389M393R519J2381
-12175i250J3777P105j483j0063j6504j1733j0186p321r84J881O26k231l309l305j937R28
-12159e3989K593k65l726l722k056k053j282J584K094K097k90k87L614P56k705K068J416J419
-12141e2734L327M66j922j919M66M65j334J532p9p8J051J054l76l76M21M24M25M25j75j72
$$ y = [-52637, -49828, -49876, -51355, -49973, -49682, -49388, -51299, -53211, -55841, -58468, -57756, -57045, -57514, -57980, -59876, -61773, -61378, -60979, -60580, -60182, -60614, -61042, -58132, -55223, -55774, -56322, -56869, -57417, -59802, -62186, -62842, -60632, -58784, -56936, -57294, -57648, -56635, -55621, -52998, -53233, -54813, -56393, -55767, -55137, -56311, -57484, -59015, -57682, -57037, -59254, -61113, -62969, -61087, -59205, -55714, -55081, -55703, -56325, -55517, -57566, -55923, -54276, -52629, -53844, -55003, -56158, -56061, -55964, -54023, -52078, -50133, -48188, -48900, -49608, -50137, -50666, -51895, -50260, -48624, -49850, -51527, -53200, -51713, -50226, -47656, -45081, -42506, -39932, -35543, -31150, -21631, -9250, 4527, 11632, 10149, 86, -16418, -28151, -38337, -45658, -46642, -44761, -44135, -46366, -49675, -52980, -54917, -53989, -51396, -51661, -55387, -59109, -61165, -63218, -64500, -62916, -60822, -58725, -59015, -59302, -55688, -54932, -57637, -55569, -54153, -52734, -49407, -48941, -50863, -52782, -52316, -51851, -53185, -51653, -51732, -51810, -50759, -49705, -50081, -50457, -50036, -49612, -49187, -48762, -48937, -49109]
-12121d9109j71j71J695J699R24j938j047j043j222j222k045k042J293J296r12r10K247K250
-12103e0428m21l278l283m17l61l58J606j252m568j706P97Q01P38P37P38P42K243K242Q13
-12084e4615Q16j036j036k645K20J08J11P68L629L17m449l256L420N920J155k600K60m1l7
-12065e2991J930r31j599J263l46l47k075P86P27L588N152K292k120k120p19p19l104l103
-12047e4436k407k403k404k403K482K485L98L99j483L290K396m66k526L39j9j8j450j445J237
-12028e8434J237j956K816J744j118o59o56N96N96K053K057l28l28m54m51k836k835J423J427
-12009e6106J606J606r54J912N99m169j013j010j785K985P45k113j814J047q94q91P19P19
-11991e8811j199j196J188J189o34o29K708K709J550J550J550J554R24R24j163j159l219J550
$$ y = [-49109, -49280, -49451, -47756, -46057, -45133, -47071, -48118, -49161, -50383, -51605, -53650, -55692, -54399, -53103, -54015, -54925, -52678, -50428, -50849, -54127, -57410, -57827, -58188, -58546, -56940, -58192, -62760, -64466, -63669, -62868, -62130, -61393, -60655, -59913, -57670, -55428, -54615, -53799, -54835, -55871, -58516, -58296, -58188, -58077, -57309, -53680, -53363, -57812, -61068, -57648, -51728, -50573, -53173, -52913, -52954, -52991, -51061, -51992, -53591, -52328, -52674, -53021, -55096, -54310, -53583, -49995, -44843, -42551, -44671, -46791, -47510, -48229, -51333, -54436, -56843, -59246, -61650, -64053, -61571, -59086, -58688, -58289, -59772, -56482, -54086, -54552, -57078, -56739, -56758, -56776, -58226, -59671, -58434, -57197, -59153, -56337, -54593, -55711, -56370, -57026, -56430, -55834, -53781, -51724, -52052, -52380, -52834, -53285, -56121, -58956, -57533, -56106, -54500, -52894, -53848, -51936, -51337, -55506, -56519, -57529, -59314, -56329, -55584, -57697, -59511, -58464, -59358, -60249, -59530, -58811, -60010, -61206, -60018, -58829, -59463, -60092, -57384, -54675, -53125, -51575, -50025, -48471, -47547, -46623, -47786, -48945, -52164, -50614]
-11973e0614J908r50l160l159R54R57n70n70Q61Q64J010J009J010J014J277J278j106j103
-11955d9090m51m51k835k832M21M21O00O04o22K239J106l658m453j590J747J751J718J717
-11937e3658o67o63m81m80m81m77j643j643k12k09p41p42J643J647N40N41N40N44j017j017
-11917e8676J367J367q38q38k627K35k20l081J38M906M430J569J38J38o56o52o52o52l28l24
-11897e5256k113P49L88k471l364J405j729j725J136J137M69L331J721J722J11J12j676J184
-11879e4869R76j885j348j349k333N29K139p23j930R32L137K79m99m99P52P57n2n3o48l506
-11859f0193n88K272o48o45k462K306Q75Q76K336n25J084J084mlL036J75o3o3j852J010P37
-11838e1255P38L20k541j348J512K765r7n14n14o93o93J006J006k333k332k120k116o86o85
$$ y = [-50614, -48706, -49656, -52816, -55975, -55021, -54064, -54634, -55204, -54343, -53479, -52469, -51460, -50450, -49436, -48159, -46881, -47987, -49090, -49541, -49992, -52827, -55659, -55238, -54817, -54217, -53613, -54235, -51996, -50890, -54548, -59001, -60591, -58844, -57093, -55375, -53658, -54325, -54988, -55469, -55949, -56430, -56907, -58550, -60193, -60405, -60614, -61355, -62097, -60454, -58807, -58267, -57726, -57186, -56642, -57659, -58676, -57309, -55942, -56780, -57618, -60245, -60010, -60230, -63311, -63173, -58267, -53837, -52268, -52130, -51992, -52648, -53300, -53952, -54604, -54932, -55256, -57369, -56620, -56232, -58703, -62067, -60662, -62391, -64116, -62980, -61843, -61374, -58043, -56322, -54600, -54489, -54377, -56053, -54869, -53893, -55778, -57126, -58475, -60808, -60279, -58140, -58863, -60793, -59861, -56724, -56445, -56944, -57443, -56691, -55934, -55986, -56039, -56687, -60193, -60781, -58509, -59157, -59802, -62264, -59958, -59083, -58207, -55871, -56396, -55312, -54228, -54232, -54235, -51199, -51024, -51087, -51150, -53002, -51992, -51255, -50517, -50197, -52738, -54086, -52574, -49809, -49906, -50420, -50934, -51627, -52320, -51314, -50308, -52641, -54973, -57093, -59209, -59895, -60580]
-11819f0580Q31Q34r54J908L297M40K2K3k336N29J304J304K008K012N81k280k463K310K310
-11800d8900n51K000q57j512j513l066J706L018J57o08o07O45O44J092J091K702j61k261k262
-11781d9243J077J077k470L91K12K13J680J680P1P1J60k701r13r13k068P94K403m58j770J092
-11761d9615L297M36j673j673l461n96j077j077l938j073J092J091J271J274J390J390k20
-11744e3162k16K9k831j222j219q9q9r0q5O33O33K064K068J140J140j244j241j784j785j75
-11724e7525j75l54K507j784m646m36m36j9K843K872J2L68L69m84m84p83p82L271j498m24
-11704e7588K436K228K228j885j885P97P97J155j706j803J058p30p31m4m5J386J386j036j036
-11685e5018k466K302N44k317J498j364l212J558K034K034K46K46K46K46j453j453q57K004
$$ y = [-60580, -59749, -58915, -59869, -57961, -54664, -54224, -54202, -54179, -56515, -55986, -54682, -53378, -51370, -49358, -48777, -51057, -53520, -51210, -48900, -49451, -47451, -48308, -49820, -51333, -54399, -52693, -49675, -49518, -50126, -50733, -50088, -49444, -48352, -47261, -44559, -44720, -46981, -49243, -48166, -47089, -49559, -49168, -48956, -48743, -47063, -45383, -45312, -45241, -45081, -47782, -48695, -49608, -51676, -50882, -48479, -48937, -50707, -49615, -46318, -45882, -47555, -49228, -52689, -53285, -54362, -55439, -59377, -60450, -59358, -58267, -56996, -55722, -54332, -52942, -53162, -53378, -53349, -56180, -57402, -58621, -58710, -58799, -58889, -58974, -58341, -57708, -55644, -53576, -52436, -51296, -52540, -53781, -55565, -57350, -57525, -57700, -58054, -55547, -57331, -61977, -62413, -62849, -62868, -60025, -57153, -57141, -56773, -56404, -56888, -57372, -58155, -58937, -55666, -57164, -57588, -55152, -52924, -50696, -52581, -54466, -53669, -52872, -51717, -53423, -55226, -54168, -54898, -55629, -55673, -55718, -54332, -52946, -53982, -55018, -57484, -55182, -54638, -56955, -55457, -56821, -60033, -58475, -56441, -54407, -54161, -53915, -53669, -53423, -54876, -56329, -57186, -55182]
-11667e5182K184o78k884k3J033J035J215J215M35M40M40M39j959j956J382J382J110J114
-11649d9258j270j271j248j244J86J86J047J051O93O93M505j215j334j334m43m40R91R91j136
-11630d9850j136m356J368r28r28Q61Q60j5j4J415J416K102K101O71O70q01q01q01q01P19
-11610d8248P19j665j666m13m14j844j844n93n92Q38Q38q64q64N66N70O26O26L010L015j476
-11590d9675j475m5m1k83k83J147J151j598j598P86P90k642k641k57k54k31k31k31k27R02
-11570e6936R01n29n25Q46Q45Q46Q50Q75Q76n56n51j773j774O11O15m575m576J625J628J285
-11550e9992J286K716K720J434J435j904j900l62l61l62l57r3r4j345j341L420O286K645l074
-11531d9243j319j315j676j673J598J602J68J71j710j706k80k76p74p72J610J613K414K418
$$ y = [-55182, -52998, -53676, -56560, -56583, -55550, -54515, -53300, -52085, -51650, -51210, -50770, -50331, -52290, -54246, -52864, -51482, -50372, -49258, -50528, -51799, -53047, -54291, -54105, -53919, -52872, -51821, -51128, -50435, -45930, -47145, -48479, -49813, -50256, -50696, -49705, -48714, -49850, -50986, -55342, -53974, -54902, -55830, -54969, -54109, -54124, -54138, -52723, -51307, -49205, -47104, -46433, -45763, -46564, -47365, -48166, -48967, -48248, -47529, -49194, -50860, -51273, -51687, -53531, -55375, -55968, -56560, -55722, -54884, -55748, -56612, -56046, -55476, -54850, -54224, -51214, -48199, -49675, -51150, -51195, -51236, -51519, -51802, -50655, -49504, -51102, -52700, -51914, -51124, -53766, -56407, -56664, -56918, -57149, -57380, -57611, -57838, -56936, -56035, -56564, -57089, -56243, -55398, -54552, -53702, -52827, -51951, -52507, -53058, -54831, -56605, -55994, -55379, -59954, -64530, -62905, -61277, -59992, -58706, -55990, -53270, -51836, -50401, -52305, -54205, -54567, -54928, -55290, -55647, -55740, -55834, -57179, -58520, -55100, -48814, -46169, -49243, -50562, -51877, -53553, -55226, -53628, -52026, -51858, -51687, -53397, -55103, -55383, -55659, -56433, -57205, -55595, -53982, -51568, -49150]
-11513d9150r24r20j151j148j151j147M88M91J919J923k277k272J08J11K284K288j055j050
-11495e2633j539j535j539j535q83q79j062j058p8k936k57N469L69L73p05p00o67o63k098
-11476f4556k094Q83Q87Q83Q87P15P16P15P19N96N96j788j785j520j520q9q6L28L28J758J762
-11455f1665p26p23J658J662m1l7m1l8K657K660J226J229j516j513q5q2J345J345J345J348
-11435d9992m13m14j844j841j054j054L76L80J181J181N533K675N07O233O051L31j102j100
-11417c4366m798m796k742k738k742k739O56O59Q35Q38j237J628K404K403k50k50j680j680
-11399e0595k966k962L76L77K045K046M36L297j252j252j073j069n07n03j103l960j580J282
-11381e8963o86o82L219L62N36N41J345J348l718l718k471L95J945J945L715Q57Q2Q2p27p23
$$ y = [-49150, -50074, -50994, -52145, -53293, -54444, -55591, -55103, -54612, -52693, -50770, -53047, -55319, -55211, -55100, -52816, -50528, -51583, -52633, -54172, -55707, -57246, -58781, -59664, -60543, -61605, -62663, -62741, -65677, -65934, -60465, -60096, -59723, -60428, -61128, -61795, -62458, -64556, -66650, -65767, -64880, -63997, -63110, -62395, -61679, -60964, -60245, -59649, -59053, -60841, -62626, -64146, -65666, -65755, -65841, -65513, -65185, -63427, -61665, -62391, -63114, -61456, -59794, -59835, -59872, -59913, -59951, -57294, -54634, -53408, -52179, -53695, -55208, -55293, -55375, -54030, -52685, -51340, -49992, -50405, -50819, -52663, -54504, -55558, -56612, -56236, -55856, -54675, -53494, -47961, -45286, -44779, -38546, -32495, -32164, -33266, -34366, -39164, -43960, -46702, -49440, -52182, -54921, -54265, -53606, -52771, -51933, -53170, -51542, -49138, -46735, -46985, -47235, -48915, -50595, -53561, -56523, -56147, -55770, -53725, -51679, -51243, -47946, -49198, -50450, -51523, -52592, -53099, -53602, -54705, -58665, -60245, -58963, -59649, -60331, -57112, -56750, -56214, -55673, -54328, -52980, -56698, -60416, -62887, -62492, -60547, -58602, -54887, -54030, -53948, -53866, -54593, -55316]
-11361e5316p23p22p83p82r61J903P08P08J245j614r76J885R7J01J140J140j244j241j956
-11342e7391j952J382J386O67O70p60p60J457J461K6L0O22O26j580j580k641K19M1M1n25n25
-11321e9086j777j774Q61L722K112K113O52O52K94L160j68l025m460j595L052J93P27P30m21
-11302e4038K444J010j848K65K68o89l547j79j79j79j75j431J431J252j606N22k340l294l290
-11283f5603P60P60K012K016L204L43r09L864K697j64o41o37j773j774m5K821J982J982j177
-11264e0282j174l95l91k779k776q72q68k481L83N44N48N44N48L584P26j959j956J561J561
-11245e5934j002j003j360m221P27P26K165K164q75J986J479J479J837J837q01K060L491O30
-11227d4615k023k023r51r50M74k389lK857J129J129J308J308j353j349j352j349J98K01j412
$$ y = [-55316, -56039, -56761, -57544, -58326, -59287, -57384, -56676, -55968, -54723, -56337, -57313, -55428, -55331, -55230, -54090, -52950, -54194, -55435, -57391, -59343, -57961, -56575, -55908, -55238, -55998, -56758, -55301, -53840, -53814, -53784, -53162, -52536, -54116, -55696, -58337, -58118, -58077, -58036, -58561, -59086, -60863, -62637, -61776, -58054, -55942, -53829, -53177, -52525, -52231, -49071, -49239, -52264, -56724, -58319, -55267, -55074, -54347, -53617, -54038, -51594, -50584, -52432, -52167, -51899, -52588, -56135, -56314, -56493, -56672, -56847, -58278, -56847, -55595, -57201, -56679, -59019, -62313, -65603, -64843, -64083, -62071, -60055, -56851, -56508, -57417, -53553, -50856, -51020, -51661, -52298, -54071, -55845, -55890, -53069, -51087, -49105, -50282, -51456, -51851, -52242, -55021, -57797, -58669, -59537, -62018, -61635, -61091, -60543, -59999, -59451, -55867, -55141, -57100, -59056, -57495, -55934, -56936, -57939, -59299, -63520, -62793, -62067, -59902, -57738, -58613, -56627, -55148, -53669, -51832, -49995, -50796, -48736, -45245, -44615, -46638, -48661, -49612, -50562, -50088, -52477, -52480, -49623, -48494, -47365, -46057, -44749, -46102, -47451, -48803, -50152, -49954, -49753, -51165]
-11208e1165j409M188J330k310k306n22n17K637K642J006j852j676j673J244J248l047l044
-11191e5226J095J099j289j285M99N03O78k180O08O11j003r98m06m03J025J028J334J338j051
-11172e4023j047j110j107J096J099K559k98k686J79J218J222L007J49k694k690M66M69o37
-11154e4828o33J568J573M4k812K27K27m92m88r65J897K064k701j271j270J587J591J412J412
-11135e1858R95j863k54k53R95R98j386j386q75q72j051J811Q83Q87Q86Q87j203m065k634
-11116e9358K31J598J598J778J781L61L61k798k794q90J970J83J86k79l141j710J155j60j61
-11097f0089J748M612N26N25r05J960k337k336K28K31r99r95r98r95q79q76J505J509m32m28
-11077e9425k54k49k221O45J415J420J207J211K817m1k340k336Q20Q23L0L3k354k351Q64Q68
$$ y = [-51165, -52574, -48386, -47056, -49366, -51672, -52194, -52711, -50074, -47432, -46426, -48278, -49954, -51627, -50383, -49135, -52182, -55226, -54131, -53032, -54321, -55606, -55107, -54604, -53926, -56106, -55498, -54887, -55890, -56888, -57294, -57697, -56672, -55644, -54310, -52972, -54023, -55070, -56180, -57287, -56191, -55092, -52533, -52831, -55517, -55338, -54120, -52898, -49891, -49742, -52436, -55126, -54660, -54191, -54828, -55461, -53893, -52320, -52276, -55088, -54861, -54634, -55126, -55614, -56579, -54682, -52618, -55319, -56590, -57860, -56273, -54682, -53270, -51858, -50863, -52726, -52980, -53233, -52238, -51240, -52626, -54012, -54887, -55759, -56810, -54999, -54116, -53229, -52343, -51456, -52659, -56724, -59358, -59127, -57529, -55931, -54153, -52372, -52011, -51650, -54448, -57242, -58132, -56162, -55979, -55793, -56072, -59213, -60923, -59768, -59928, -60089, -58341, -53729, -53203, -52678, -53583, -51623, -53960, -56296, -56068, -55837, -56836, -57831, -58829, -59824, -60703, -61579, -60074, -58565, -58997, -59425, -59679, -59928, -62149, -61504, -60089, -58669, -57462, -56251, -53434, -53475, -55815, -58151, -57331, -56508, -56478, -56445, -58799, -61150, -60286, -59418]
-11057e9418K295K299q64q65Q65L729J133J132K921O4k027k027l457l454j640J223J043J047
-11039e6001k031k030j554L219L24k537j882j877N47L409J800J803K068K068l17l13J986J990
-11021d9328N58N59l558l554P37P38j38j34K251K250o15o11o11o11j278j274j274j274j368
-11002e8535j363j364j364J919J923M91M92m95m92m92m92l02l01l02k98O52O52K083K086J621
-10982e3881J620k671k668j300j300J084J088Q27Q27j557j554m25m24m25m21O33O34O33O37
-10963e8643k288k287J051J054J751J751j587j583j737j736J602J606N89N88N89N92J394J393
-10945e5901J394J397j60j61j60j56K105K105k187k183k053k053J285J289J405J405r80r77
-10927e4586r20r16N10N14P79P82P79P82k149k146K34K39k537k534j53j49J707J710K75K80
$$ y = [-59418, -57123, -54824, -55688, -56553, -55688, -51959, -50826, -49694, -46773, -46709, -48736, -50763, -54220, -57674, -59314, -58091, -57048, -56001, -58032, -60062, -61616, -58397, -58073, -60610, -62492, -64369, -63822, -60413, -58613, -56810, -54742, -52674, -52991, -53304, -51318, -49328, -48770, -48211, -51769, -55323, -54586, -53848, -53986, -54120, -51869, -49619, -50234, -50845, -51456, -52067, -53345, -54619, -55893, -57167, -58535, -59898, -61262, -62626, -60707, -58784, -58293, -57801, -58296, -58788, -59280, -59772, -60074, -60375, -60677, -60975, -60323, -59671, -57588, -55502, -53881, -52261, -54932, -57600, -58900, -60200, -59116, -58028, -57201, -56374, -57931, -59485, -59910, -60334, -60759, -61180, -60547, -59913, -59280, -58643, -60931, -63218, -62167, -61113, -59362, -57611, -59198, -60781, -62518, -64254, -62652, -61046, -60457, -59869, -59280, -58688, -57294, -55901, -54507, -53110, -53270, -53431, -53591, -53747, -51642, -49537, -51724, -53907, -55960, -58013, -56728, -55439, -54034, -52629, -53609, -54586, -55506, -56422, -55912, -55398, -54619, -53837, -53058, -52276, -54425, -56571, -56337, -56098, -58635, -61169, -61322, -61471, -59764, -58054, -57779, -57499]
-10907e7499J527J532q57q53O03O08k735k731k139k135K46K50q98q98K440K445N92N92q38
-10888f0748q35K120K120N11N14J166j695j338L436L226L230j717j718j095j092j092j091
-10871e6098K2K6J457J457j975j971l61l62R21L785N63m203m%l02k98o29o26k061k056J337
-10850f1378J342J337J342o08o07Q23Q24P34P34j651j650k061k060J278J278L126L126J695
-10832e2376J695l152l148K094K097k31k27j662j658j78j76j609j606J79J82J610J613N85
-10814e5968N89j800j795n78n74Q53Q57R88R91R87R91L342L346r50r46k020k019J319J319
-10795e1068k079k079K213K213K31K31k154k153L80L80K764K765j241j240j241j241R35R36
-10777e1448m96m95J024J025m06m06k672k671k672k671J423J427L037J75O18O22M44M43J319
$$ y = [-57499, -55972, -54440, -55297, -56150, -55547, -54939, -57674, -60405, -62544, -64679, -64433, -64183, -65081, -65979, -63539, -61094, -60502, -59910, -60748, -61583, -59463, -57343, -56832, -56318, -55152, -56847, -58185, -54749, -51523, -48293, -50010, -51728, -52823, -53915, -55007, -56098, -56076, -56050, -54593, -53136, -55111, -57082, -57443, -57805, -56884, -53099, -52536, -56739, -56743, -56743, -57045, -57343, -57972, -58598, -60659, -62715, -61378, -60036, -58699, -57357, -57965, -58572, -57749, -56925, -56191, -55457, -57108, -58758, -60819, -62879, -61601, -60323, -57197, -54071, -52376, -50681, -53833, -56981, -54887, -52790, -53021, -53248, -54910, -56568, -56746, -56922, -58531, -60137, -59958, -59776, -58166, -56553, -55968, -55379, -57179, -58974, -59552, -60126, -59273, -58416, -57428, -56437, -55450, -54459, -51117, -47771, -48721, -49667, -51687, -53706, -52387, -51068, -53147, -55226, -53013, -50800, -50569, -50338, -52492, -54645, -54265, -53885, -51121, -48356, -49597, -50837, -52078, -53319, -52384, -51448, -51944, -52439, -51415, -50390, -50796, -51202, -53874, -56545, -59217, -61888, -60465, -59038, -56001, -55826, -55208, -54586, -54142, -53699, -52380]
-10758e2380J323J501j360l569l565m07m06k53k50k49k50J118J121J122J121N07N10j695j695
-10739e7756m17K447O60O59R54j907k99k98J014J013n36l398j491J372J967J967O56O55n96
-10720e3334n96l945j085L47k515k515k515O45O44J465J464j46j45J882r80j576j576K20L081
-10701f1180r13r09Q16Q16J412l353k13M557J45J49m80m81K560k98n89n85J021j837j095J769
-10681e8688J766j091j125J740J26J31j513J352k60k57j707j703r27J933L123L126l4l4N00
-10662e3542N03j286J576J006j851k448k448p60p57O71O74K430K433r09r06j79j75l57l54
-10643e6679J758j099r24r20k76k76j706j703j885j885m55m51J580J580J49J53J997J997N66
-10624e8479N70j423j423R61R65L584L584p08p04J94J94J624J628l42l43j774j770q27q23
$$ y = [-52380, -51057, -49556, -50916, -54485, -58050, -58457, -58863, -59116, -59366, -59615, -59865, -58747, -57626, -56504, -55383, -54876, -54366, -56061, -57756, -58173, -55726, -55066, -54407, -53453, -55360, -55659, -55957, -54943, -53930, -54466, -57864, -59355, -57983, -56016, -54049, -53393, -52738, -53334, -53930, -57875, -58960, -58613, -61128, -63643, -66158, -65513, -64869, -63404, -61940, -62086, -62231, -60349, -61329, -62905, -64481, -64261, -61180, -62093, -63002, -62186, -61370, -59958, -63311, -63524, -58967, -58822, -58673, -59153, -59634, -57074, -57372, -57961, -58546, -57525, -59362, -60457, -58688, -56922, -58013, -59138, -57398, -57272, -57141, -58654, -57302, -57562, -57819, -59526, -61229, -62156, -60223, -57100, -53974, -54008, -54042, -53542, -53039, -54325, -52749, -51743, -53594, -56042, -58490, -59250, -60007, -59336, -58662, -56232, -53799, -54708, -55614, -55793, -55968, -56325, -56679, -54921, -56020, -56944, -57864, -58140, -58416, -60122, -61825, -63710, -65595, -66050, -66501, -64921, -63341, -63192, -63039, -61042, -59045, -58479, -57909, -59332, -60755, -59794, -58829, -55245, -51661, -52369, -53073, -52879, -52685, -51061, -49433, -49775, -50118, -51892, -53662, -54489, -55312]
-10605e5312O04O07L95L98L95L99l048l044K199K202l36l31J095J099K072K075O41O44l949
-10586e1195l946L43L47J564J569J34J38k101k098o71o67j005j003j006j002J528J531R7J00
-10567e7343j34j30k519k515j117j114m337J389L208L212L804j915j978L748J67J72O97P00
-10549e6005j688j684n55n51Q75Q79J658J662J662J662j413j408K2K3r06r01k333k332J420
-10530e9913J423j915j915N14N18K902K903J229J233j151j151j826j822l91l91O78O82O82
-10512e7711O81O00O00O00O04J732J733o53o48l841l841K358K362L4L3L4L7J79J79J79J82
-10491e4567k09k08j401M326R16m806j230j225k243k243q13q08J732J737J736J736J584J587
-10473e4399J56J57j554j550K742K743l62l58l57l58m43m40m40m39k321k318q87q86J360J363
$$ y = [-55312, -54708, -54101, -53706, -53308, -52913, -52514, -55562, -58606, -56407, -54205, -54541, -54872, -53777, -52678, -50606, -48531, -47890, -47246, -51195, -55141, -54798, -54451, -52887, -51318, -51184, -51046, -53147, -55245, -55916, -56583, -57588, -58591, -59597, -60599, -59071, -57540, -57443, -57343, -57477, -57607, -60126, -62641, -63758, -64872, -69209, -67820, -64612, -61400, -57596, -59511, -61489, -57741, -57574, -57402, -56705, -56005, -57693, -59377, -59932, -60483, -59608, -58729, -57071, -55409, -53747, -52085, -53498, -54906, -54884, -54861, -55767, -56668, -59001, -61333, -59913, -58490, -60405, -62320, -61806, -61288, -58386, -55483, -54254, -53021, -54172, -55323, -57149, -58971, -59362, -59753, -59075, -58393, -57711, -57030, -56430, -55830, -55230, -54626, -52894, -51161, -51814, -52462, -56303, -60144, -57786, -55424, -55390, -55357, -55323, -55286, -55107, -54928, -54749, -54567, -54776, -54984, -56385, -52059, -51143, -55949, -57179, -58404, -60647, -62890, -63703, -64511, -62779, -61042, -59306, -57570, -55986, -54399, -54243, -54086, -55640, -57190, -54448, -51705, -52067, -52425, -52782, -53140, -53583, -54023, -54463, -54902, -57223, -59541, -60428, -61314, -59954, -58591]
-10453e8591J364J364j055j051k481k481O52O52p79p75K94K95K94K98J606J606J606J609q98
-10434e6471q98q98q94Q16Q16Q16Q20P56P56M095M098O67O67k313k310m013J710M58k399o077
-10414e9798l54L402L405J077J077l216l211n63n62n63n59J524J524J524J527P60P60j624
-10396e3870j621R99R98k340k336k16k16k16k12L80L80j051j047n96n92n93n92J967J971m14
-10376e9217m13N06N11N10N11j908j904m73m73Q31Q34j550j549j23j20j19j19r43r39r39r38
-10355f8024K604K608J177J178R68R73R72R73R68R73R72R73k295k292q60q61K653K656K657
-10336e1027K656k49k46j677j677n47n44n44n44j591j587L658L659P94P97k541k541n66n63
-10317e4880n66n63r24r20r24r20K064K068l21l16L05L09K690K694N66N70k768k768j192j189
$$ y = [-58591, -57227, -55863, -56918, -57969, -60450, -62931, -62279, -61627, -62406, -63181, -62887, -62592, -62298, -62000, -60394, -58788, -57182, -55573, -56471, -57369, -58267, -59161, -58345, -57529, -56713, -55893, -55137, -54381, -50286, -46188, -45521, -44854, -47167, -49477, -53490, -51780, -51322, -53721, -59798, -60152, -56750, -53345, -52268, -51191, -54407, -57618, -58181, -58743, -59306, -59865, -58341, -56817, -55293, -53766, -53006, -52246, -53870, -55491, -54492, -53494, -55834, -58170, -58386, -58602, -58818, -59030, -58650, -58270, -59321, -60368, -60964, -61556, -62149, -62741, -60774, -58803, -59217, -59630, -59124, -58613, -58103, -57592, -59500, -61404, -61877, -62350, -61519, -60685, -62235, -63784, -63907, -64027, -64146, -64265, -65208, -66147, -67086, -68024, -65420, -62812, -61635, -60457, -59489, -58516, -57544, -56571, -55603, -54630, -53658, -52685, -54980, -57272, -58132, -58993, -56340, -53684, -51027, -48371, -48620, -48866, -50543, -52220, -52767, -53311, -53855, -54399, -55990, -57577, -53919, -50260, -49466, -48669, -51210, -53751, -54317, -54880, -55446, -56009, -56933, -57853, -58777, -59697, -57633, -55565, -55886, -56202, -55897, -55588, -52898, -50204, -49638, -49068, -51836, -54604, -55796, -56985]
-10297e6985K42K42L28L32L32L31O0O3O3O4O37O37O37O37j151j151j152j151p8p8k57k58m95
-10274e8151l357m36M333L107j658j717J144k616k612J860J859K138K143k42k43O19O22O22
-10256e2585O22k522k522K723K724j300j301j300j300p34p34p34p34n26n25j956j956l47l46
-10237f5353l47l46O97O96K128K127K187K187l059l058J292J293k045k046M03M02M397M396
-10219e4049j04m874k190k191J177J178K608K608J5J4j415j416m96m95J889J889k87k87J800
-10200e4626J799K932j837Q46Q46j271j270J114J114R17R16l375l372K60K61K61K65j126j125
-10181e6471j125j121J766J766o19o15J539J539J539J542j829j830l98l95l052l051m303M69
-10163f4649M370M371L76L80j065j066j066j061k765k764N73N78Q72Q71K303K306J915J915
$$ y = [-56985, -56743, -56501, -56173, -55841, -55509, -55178, -55118, -55055, -54992, -54928, -54291, -53654, -53017, -52380, -53531, -54682, -55834, -56985, -57063, -57141, -57398, -57656, -58151, -61508, -61944, -57611, -54504, -56162, -57879, -56735, -59351, -61963, -60103, -58244, -56106, -53963, -54205, -54448, -53829, -53207, -52585, -51963, -54485, -57007, -54284, -51560, -52860, -54161, -55461, -56761, -57495, -58229, -58963, -59697, -60223, -60748, -62704, -64660, -65007, -65353, -65700, -66046, -65349, -64653, -62525, -60398, -58211, -56024, -59083, -62141, -60849, -59556, -61601, -63647, -63244, -62842, -58445, -54049, -54153, -59027, -61217, -63408, -62231, -61053, -58445, -55837, -55822, -55808, -57223, -58639, -59135, -59630, -57741, -55852, -56139, -56426, -54626, -52827, -49895, -51732, -50886, -50040, -51311, -52581, -51467, -50353, -49436, -48520, -51895, -55267, -55007, -54746, -54485, -54220, -55346, -56471, -57596, -58717, -56951, -55185, -55804, -56419, -54880, -53341, -51802, -50260, -52089, -53919, -54317, -54712, -57764, -60815, -65118, -64649, -60279, -55908, -55532, -55152, -56217, -57283, -58349, -59410, -62175, -64939, -64366, -63788, -62916, -62045, -59742, -57436, -55521, -53606]
-10145e3606l330l328l05l06l05l02j706j707O78O82K981K980J550J554N66N67N66N70k444
-10126e4645k441K802K806O56O59p75p71p38p34p38p34L36L39L35L39k6k2j457L316J613j244
-10105e1124j725j722j278j274J107J110J53J56j278j274l91l88J040J043K113K116O82O85
-10087e0249Q01Q05K232K235K322K324J666l100MPk94k91j904j900j904j900j00r7K284K287
-10067d4772n18n14j948j945k61k57k57k57q87q83N48N47J543J546J16J15l06l01l02l02K485
-10046d6810K489K489K489L09L13L13L13j762j759l28l28o89o86J699J699p78p75p79p75j83
-10026d3539j78j83j79J025J028j360j356r72r69K366K369J450J453r35r32m88m84m88m85
-10007d2857MPL343L345k828k824N11N14J53J56J289J289M028p38n983j215m66m62L13L175
$$ y = [-53606, -56936, -60264, -60569, -60875, -61180, -61482, -63188, -64895, -64217, -63535, -60554, -57574, -56024, -54470, -53904, -53337, -52771, -52201, -54645, -57086, -54284, -51478, -50822, -50163, -50938, -51709, -52447, -53181, -53919, -54653, -54317, -53978, -53643, -53304, -53330, -53352, -54809, -51493, -49880, -51124, -52849, -54571, -55849, -57123, -56016, -54906, -54753, -54597, -55875, -57149, -57540, -57928, -56888, -55845, -53732, -51616, -50934, -50249, -49448, -48643, -46411, -44176, -41854, -39530, -37864, -40964, -40960, -40953, -41247, -41538, -43442, -45342, -47246, -49146, -49246, -49343, -47059, -44772, -45290, -45804, -47752, -49697, -49958, -50215, -50472, -50729, -51616, -52499, -51951, -51404, -49861, -48315, -48199, -48084, -48390, -48691, -48993, -49295, -46810, -44321, -41832, -39343, -39034, -38721, -38408, -38095, -39857, -41616, -41944, -42272, -42961, -43647, -41948, -40249, -41027, -41802, -42581, -43356, -43539, -43717, -43900, -44079, -43054, -42026, -43386, -44742, -45714, -46683, -44317, -41948, -40498, -39045, -39980, -40912, -41400, -41884, -42372, -42857, -42853, -42846, -39503, -36158, -38986, -41810, -41299, -40785, -40632, -40476, -39187, -37898, -33870, -34608, -40591, -41806, -42272, -42734, -42421, -39246]
-9987c9246K157k608l741q79J382J386q20q19J173J178k54k53j60j57j56j57j501j498o7o7
-9967d5107J326J330j04j01l412l409Q79Q83j833j830j833j829J34J38J34J38J516J520Q6
-9948e1374R0n11n07n10n07R35R39L320L323k105k101K79K84J237J237J237J236j028j028
-9929d5554J356J356o26o26o26o26j013j013J371J371K034K034k257k258m40m40m39m40k779
-9910d9615k780j348j349o04o03Q27Q27Q08Q09j576j576q6q6j516j516K358K359k7k6n62n63
-9889e5845Q68Q68O60O59j725j725j606j605j76j75L47L46J778J777m88m88m88m89L06L09
-9869e6892L09L10J468J471J472J472N59N62j822j822O78O82O82O82j621j617j86j86j353
-9850e5152j349J036J036J68J71K556K556l409l406k749K019K780K783k61k57j990j986L95
$$ y = [-39246, -37089, -39697, -43438, -44317, -42935, -41549, -42369, -43188, -42015, -40837, -41091, -41344, -41504, -41661, -41817, -41974, -43475, -44973, -45040, -45107, -43781, -42451, -42555, -42656, -46068, -49477, -48598, -47715, -49548, -51378, -53211, -55040, -54906, -54768, -54634, -54496, -52980, -51460, -51374, -51284, -51795, -52302, -52812, -53319, -52384, -51445, -48125, -44802, -46907, -49008, -48729, -48445, -47208, -45971, -44734, -43498, -44526, -45554, -44198, -42842, -43468, -44094, -44720, -45346, -46359, -47372, -46001, -44630, -42596, -40562, -42819, -45077, -45517, -45957, -46396, -46836, -49615, -52395, -53743, -55092, -55696, -56299, -55472, -54645, -53837, -53028, -54604, -56180, -56266, -56352, -57868, -59384, -57026, -54667, -54694, -54720, -55282, -55845, -54977, -54109, -53449, -52790, -54515, -56240, -57846, -59451, -59627, -59802, -59455, -59109, -57331, -55554, -56042, -56530, -57018, -57507, -57201, -56892, -56583, -56273, -54805, -53334, -51862, -50390, -49831, -49269, -51091, -52913, -52235, -51553, -50871, -50189, -51810, -53427, -53613, -53799, -55152, -56501, -55465, -54429, -54261, -54090, -51534, -48978, -52387, -55793, -58542, -56523, -53743, -50960, -51221, -51478, -53468, -55454, -55059]
-9832e5059L99J006J010k333k328q72q68q72q68K336K340j003r98r13r09J472J475O74O79
-9813e5632p57p52j144j140J240J245K87K87K86K87m88m88m88m88K35K34j196j195K350K351
-9793e4966j166j166k489n350k131K638q80q79J803J804J587J587L018L018K76K75k01m970
-9775e8192R7K958m99l357k407M55R6J01K668K667J237J241O71O70O71O74q27q27l212l207
-9755e8322l659l659J766J770J214M076K944j822l107k46n44l402l54l54J852J855k231k232
-9737f4455j576L197M266M266o82o78J911J911k380k377n29n30n29n25j42j41J766j092r7
-9718e8416M673L420N62k75k76m55m50k120k117k120k116J16J19K023q35l729J043J993q64
-9699e9824J189j670j672j670m13m10j844j841K627K630K42K46k6k2K358K362n92n89n92n89
$$ y = [-55059, -54660, -53654, -52644, -54977, -57305, -58177, -59045, -59917, -60785, -58449, -56109, -57112, -58110, -59023, -59932, -58460, -56985, -56311, -55632, -56389, -57141, -58285, -59425, -58185, -56940, -56653, -56366, -56080, -55793, -56281, -56769, -57257, -57745, -57510, -57276, -58472, -59667, -57317, -54966, -56132, -57298, -59787, -65137, -67268, -64630, -65510, -66389, -64586, -62782, -61195, -59608, -56590, -53572, -53296, -53021, -53222, -58192, -58095, -55137, -55636, -58993, -61400, -60945, -60849, -60748, -58080, -55413, -54176, -52935, -52264, -51594, -50923, -50249, -51076, -51903, -55115, -58322, -61981, -65640, -63874, -62104, -60890, -56814, -53870, -55692, -58799, -59045, -59589, -62991, -63345, -63699, -61847, -59992, -62223, -64455, -66031, -62834, -58568, -54302, -54984, -55662, -53751, -51840, -54220, -56597, -57126, -57656, -58185, -58710, -58852, -58993, -57227, -58319, -58416, -53743, -50323, -49761, -50036, -50312, -50767, -51217, -53337, -55454, -57574, -59690, -59574, -59455, -57432, -58267, -61996, -60953, -58960, -59824, -58635, -60305, -61977, -63647, -64060, -64470, -66314, -68155, -65528, -62898, -62656, -62410, -62436, -62458, -60100, -57738, -58330, -58919, -59511, -60100]
-9679f0100J058J059j327j322P60P60j625j621R62R61R61R65j602j602K690K694l80l80l80
-9660e7469l77O7O8J497J502j476j475k906k903M92M92l800l797J926J927k187k184R43L804
-9641f5856K791j975j010L760P78P83l84l84l84l80J61J60J60J64K545K544p93p90J889J889
-9621e4332M58M62q83q83q83q79PJ1l46K515L018J60J949J948R32R35R35R35l599l595l119
-9600e4254J651J408j449k880k880R6J01J01J00k690k686k508k507J483M348L096K35o52K209
-9581e7678M534k34m44m43p42p41O3O4k143k142j45K716R28R27R28j934l24l24k411k410l782
-9560f5737K895O89O90L31k530K597K597K597k64j502j501k50k46K314K313p0o7P78P79K209
-9540e1378K214j606j606J732J737j983j982p30p26k24l085j297j292j960R02K332n25J408
$$ y = [-60100, -59042, -57983, -59310, -60632, -59872, -59112, -60737, -62358, -61396, -60435, -59474, -58509, -60111, -61713, -59023, -56329, -56709, -57089, -57469, -57846, -57779, -57711, -56214, -54712, -56188, -57663, -60569, -63472, -62980, -62488, -66288, -70085, -68159, -66232, -68419, -70603, -69660, -65856, -63065, -65040, -66050, -62290, -61512, -60729, -61113, -61497, -61881, -62261, -62100, -61940, -61780, -61616, -59071, -56527, -57320, -58110, -56221, -54332, -53874, -53412, -54295, -55178, -56061, -56940, -56933, -56922, -57268, -54753, -51735, -51575, -49626, -47678, -46746, -45811, -44876, -43941, -47540, -51135, -54254, -52603, -51195, -52644, -55524, -58404, -58308, -58207, -58106, -58006, -60696, -63382, -65890, -68397, -66914, -62566, -59470, -59235, -59887, -57678, -53144, -53378, -53822, -54265, -55007, -55748, -55685, -55621, -57764, -59906, -60051, -57335, -56407, -55480, -54552, -56486, -56810, -57134, -59545, -61955, -65737, -62842, -62153, -61463, -61132, -63662, -61065, -58468, -55871, -56135, -57637, -59138, -59388, -59634, -57320, -55007, -55077, -55144, -54366, -53587, -51378, -49164, -50770, -52376, -50644, -48907, -50890, -52872, -53602, -54328, -54552, -57637, -58934, -60226, -62186, -61284, -58952, -59477, -58069]
-9522e8069J408k2j9j799J062L446N85J032J032Q53Q53P34P34l558l558J9J8K225K224K68
-9502e0532k593r84r83j222j222j222j222j535j536m694m695J834M694P01P00J867J866j471
-9484f2249j472J151J151k79k79j614j613j83j82mmL54L54j147M575M575j147J147J148P90
-9464e4928P90l033l033J259J260l21l20l21l20j073j073K146l573j610j609M17M21O71O70
-9445f3580K102K105J028J028J863l856J345J345m43m40j665j666J673J677P11P12P12P15
-9427e4634J159J159j226j222k303k302J035J040j498j498Q87Q91K68K68K68K72J759J758
-9409e3919o26o22j050j051j051j047m54m55m54m51J594J595J64J68k340k340k340k336k83
-9390f7298k79j714j710j923j919L324L327j49j45K235K239J818J822j520j516l145l141J148
$$ y = [-58069, -56661, -56683, -56702, -58501, -57439, -53993, -53408, -52376, -51344, -50491, -49638, -48904, -48170, -51728, -55286, -55267, -55249, -53024, -50800, -50532, -53125, -54109, -55092, -56314, -57536, -58758, -59980, -61515, -63051, -67745, -72440, -70606, -65912, -65211, -64511, -62644, -60778, -62249, -63721, -62570, -61419, -61698, -61977, -63591, -65204, -65387, -65569, -65573, -65577, -65223, -64869, -66016, -61441, -56866, -58013, -56866, -55718, -54928, -54138, -57171, -60204, -58945, -57685, -58006, -58326, -58647, -58967, -60040, -61113, -58967, -62540, -64150, -65759, -65342, -64921, -64250, -63580, -61478, -59373, -58345, -57317, -55454, -59310, -57965, -56620, -57063, -57503, -59168, -60834, -59161, -57484, -56773, -56061, -55349, -54634, -53475, -52316, -53542, -54764, -57067, -59369, -58334, -57294, -58792, -60290, -59403, -58512, -58244, -57976, -57708, -57436, -55677, -53919, -54545, -55167, -56217, -57268, -58319, -59366, -59820, -60275, -60729, -61180, -59586, -57991, -57827, -57659, -59999, -62339, -64679, -67015, -67298, -67577, -69291, -71001, -72924, -74843, -71519, -68192, -68341, -68486, -66251, -64012, -62194, -60372, -61892, -63408, -66553, -69694, -68546]
-9372f8546J151m92m88R39R43J445J450J445J450j5j1j5j1r73r72k582K83l47l46j68j64M59
-9350f5565M58K843K846l76l76k761k757R57R58R57R61K419K418j994m851j114J748J389J394
-9331f0446J67J68J68J71j71j68L827R65q57q54j211J651k332k329n40n40j468J397k13k12
-9311f2827K351K355l0l0j255j252J132J133m%l57K503L096K39J19K981K038k728j475J386
-9291e0625q83q79k906k907k865%l57l58O52k206l755l756N29L394L216L215r02q97L096K34
-9271e8960k712k709j456L312L577P19K984J23k57K604R95R95p04K157K157p04j345j345j524
-9252e2093j524k656k657Q61Q61q28K035O03k258J975J975n89n89k697k698j266j267J714
-9234f1098J714K83K83q94q94J490J494p75p75k206k202J357J356p5p1J386J386J386J390
$$ y = [-68546, -67395, -67887, -68375, -67436, -66493, -65048, -63598, -62153, -60703, -60718, -60729, -60744, -60755, -61728, -62700, -65282, -64999, -65346, -65692, -65860, -66024, -65565, -65107, -62264, -59418, -59794, -60170, -62931, -65688, -64731, -63773, -62816, -61855, -59436, -57018, -59012, -63863, -64977, -63229, -61840, -60446, -60279, -60111, -59943, -59772, -59943, -60111, -56284, -55319, -56176, -57030, -58241, -56590, -58922, -61251, -61791, -62331, -63799, -62402, -62615, -62827, -60476, -58121, -58151, -58181, -59436, -60688, -59556, -58423, -58427, -58427, -58784, -56281, -53185, -52946, -52827, -49846, -47808, -50536, -52011, -50625, -51508, -52387, -55293, -58200, -61065, -61065, -61422, -61780, -61128, -63334, -67089, -70845, -70316, -66922, -63706, -60491, -61393, -62290, -59194, -58960, -61672, -64381, -65837, -62525, -58948, -58229, -55245, -55122, -55379, -52775, -51780, -50785, -51489, -49332, -47175, -47879, -49224, -50569, -52093, -53617, -56273, -58930, -58069, -57208, -58036, -56001, -55398, -57656, -55681, -53706, -54295, -54884, -57581, -60279, -61545, -62812, -61098, -59384, -59101, -58818, -59712, -60606, -59116, -57622, -58397, -59172, -61378, -63580, -62223, -60867, -60942, -61013, -59627, -58241, -56855, -55465]
-9215e5465j553j554k031K743K678j82K94K98L24L24L25L28r28r28r28r24K500K500L752j017
-9195d9444Q6Q5N63L424j226j225l253l253k954r3O81O82j937j938k08K653J579J580J401
-9176e2797M262K005q57n00m99l80l80l80l80J01J04J04J05m9m4m5m5J047J051j334j334O60
-9154d9585O63k497k496o93K172L603P42j200j196J963J964j155j151j152j151J86J90J621
-9136d9172J621J635J636K05K05J963J964k508k507N6k806k626K34j166J695K471K470J088
-9118d3542j774j594j595K53K54K53K53j982j982l770r09P30k131n22K340o97o93n14n14J121
-9098e7015J125K556K556Q53Q57j527j528J211J215l078l077k206k202J136J137r0q5K299
-9080e5863K298m09m07m06m06k61k57k57k57J49J53J49J53J937J941N07N10l882l878j498
$$ y = [-55465, -57018, -58572, -60603, -57860, -55182, -55364, -55070, -54772, -54448, -54124, -53799, -53471, -54399, -55327, -56255, -57179, -54679, -52179, -48427, -49444, -49358, -49273, -48710, -45286, -46512, -47737, -50990, -54243, -57197, -57290, -56609, -55927, -57864, -59802, -60010, -57357, -55778, -54198, -52797, -48535, -46530, -47387, -47887, -48386, -48766, -49146, -49526, -49906, -49805, -49701, -49597, -49492, -49541, -49585, -49630, -49675, -48628, -47577, -48911, -50245, -49585, -48922, -51419, -53915, -54608, -52436, -48833, -48091, -49291, -50487, -48524, -46560, -47715, -48866, -50018, -51169, -50983, -50793, -49172, -47551, -45916, -44280, -44075, -43870, -41907, -39943, -42451, -44958, -44902, -47708, -50334, -50100, -51266, -49571, -47100, -44630, -43542, -45316, -46910, -48505, -48252, -47998, -47745, -47492, -49474, -51456, -55226, -56135, -55405, -57536, -58058, -55718, -56415, -57108, -57622, -58136, -57015, -55890, -53334, -50778, -49925, -49068, -50595, -52123, -50912, -49697, -52775, -55852, -58058, -60260, -59124, -57987, -58077, -58162, -55863, -53565, -53974, -54381, -54787, -55193, -55454, -55711, -55968, -56225, -56076, -55923, -55774, -55621, -53684, -51743, -51236, -50726, -54608, -58486, -59984]
-9060e9984j494m55m51L838L841K832K835K832K835L011L014j282j278K683K686K683K686
-9043b9168L428L431Q435J1301J6292K2969K5175K5179K1837J5160L059r337j5898k2574k8298
-9028E0991k3524j6614j3751j0473p608o103o103o78o74k556k556k556k552J319J319j066
-9012d3185j061j871j870m40m36L540L543l610J158K288n70k001k000j126j121L09L09N44
-8994d7600N48q83q83R02R05K336K336k31k27J203J204J661J666k627k626r02q98L215L216
-8975c7685K228o30K411K410L50L54L54L54K974K976M74k389n521k657Q01Q01J38J42n105
-8956c7220n104k425k422l7l8K657K660J230J229K12K17K600K601k679k675j129J736p12l569
-8937d2868l036l033l946j080J598J602L208L212L386N30P93P97j769j766L16L21L16L21N70
$$ y = [-59984, -61478, -61933, -62384, -58546, -54705, -51873, -49038, -46206, -43371, -40360, -37346, -38628, -39906, -37223, -34537, -31854, -29168, -25740, -22309, -13874, -2573, 13719, 36688, 61863, 87042, 108879, 124039, 127098, 117761, 101863, 79289, 50991, 27467, 10853, -2898, -13371, -20979, -27082, -33185, -33863, -34537, -37093, -39649, -42205, -44757, -43438, -42119, -43185, -44246, -46117, -47987, -48427, -48863, -45323, -41780, -45390, -44232, -41944, -42514, -44515, -46515, -47641, -48762, -48453, -48144, -47600, -47052, -47935, -48818, -47916, -47011, -44675, -42339, -42570, -42797, -41594, -40390, -38729, -37063, -39690, -42316, -43218, -44116, -40901, -37685, -35457, -36087, -33676, -31266, -30916, -30562, -30208, -29854, -26880, -23904, -23430, -25819, -31340, -33997, -33196, -32395, -32257, -32115, -37220, -42324, -44749, -47171, -47208, -47246, -44589, -41929, -40699, -39470, -39258, -39041, -36441, -33840, -36519, -39194, -40323, -38587, -39299, -42868, -45904, -48937, -52883, -53963, -52365, -50763, -47555, -44343, -40957, -40427, -39634, -38837, -40606, -42372, -42056, -41735, -41419, -41098, -40528]
-8918d0528N74L91L95j040l897o226M55K522l35r7K765N55k303n14n14o45o41o40o41l76l73
-8897e1113j982Q79r28r24N07N07L483O26j49j49R35R39J118J118q53K012J04J04K843j926
-8877d2849k582k582j599j598J740J740J107J106j576m437m74m73k440M21K861MJ83J82J79
-8858e1087k679m109j249J05J08K87K87K310K313K314K314O22O22j762j759J75J76J75J78
-8839e0659L84L84L84L87j524j523r4q9K008K012k284k280m36m32J948J953j062j058L69L72
-8819e1240J383J386l864l860k709k708J583J584k35k35k35k34o23o22Q09Q08J882J881M51
-8800e4798M51j069j070j069j069j815j814J345J345J479j382l69M400K433k336r65J896m36
-8782e4843m32k53k53k28k23J207J207o3o0o0n9Q31Q34n96n96m14m09m10m10J941J945m40
$$ y = [-40528, -39954, -39563, -39168, -40208, -44105, -50331, -49876, -47354, -47689, -47786, -45021, -44466, -46769, -47283, -47797, -48442, -49083, -49723, -50364, -50740, -51113, -53095, -52216, -53144, -54068, -53561, -53054, -49571, -48945, -49094, -49243, -48308, -47369, -46251, -45133, -45986, -43974, -43870, -43766, -40923, -42849, -45431, -48013, -49612, -51210, -49470, -47730, -46623, -45517, -47093, -51530, -52004, -52477, -54917, -54496, -51635, -51631, -51448, -51266, -51087, -53766, -57875, -59124, -59019, -58911, -58624, -58337, -56027, -53714, -51400, -49086, -48464, -47842, -49604, -51363, -51188, -51012, -50837, -50659, -50275, -49891, -49507, -49120, -50644, -52167, -52261, -52350, -50342, -48330, -50614, -52894, -53330, -53762, -51814, -49861, -50923, -51981, -51612, -51240, -49857, -48471, -52335, -56195, -58904, -61612, -60029, -58445, -58680, -58915, -59150, -59384, -60007, -60629, -59820, -59012, -57130, -55249, -54798, -54347, -55416, -56486, -57555, -58624, -60439, -62253, -60908, -59563, -58084, -59466, -59835, -55435, -53002, -55338, -56303, -54407, -54843, -55275, -55528, -55781, -56009, -56232, -55025, -53818, -53881, -53941, -54001, -54060, -53229, -52395, -52991, -53587, -54001, -54410, -54820, -55230, -53289, -51344, -51784]
-8760e1784l301l737J036L122K61k247k243l7l7Q49Q50J922k846J416j446l234J535N947p31
-8741e4705j624J237j34j34M4M5K57K57k127k128j919j918K373K373r05r05K433K432j114
-8722e6162j114j114j114j676j673k42k42J363J368j018j017L51L54L53L54j050j047L84L83
-8703f2559R47R50L334L335j140j137j136j136o19o15o14o15J170J173J174J174p31p30p30
-8684e8505p27J744J744J743J748M277M277j5j1j5j5K370K373m54m55m54m51m240m240m240
-8664e3546m236m55m54m55m51k75k76J155J159k199k198J86J90J349J349J349J352%%K087
-8644e4369K090K68m501j222J643L592P34q16q16R39R43R42R43J617J621J90J90J020J025
-8625d3967j360j360p15p16q94q94Q94j967j609L159k38k39O0N9k712k712O25O26j065j062
$$ y = [-51784, -55085, -58822, -57786, -54664, -54403, -56650, -58893, -58930, -58967, -58118, -57268, -55346, -58192, -56776, -58222, -61456, -59921, -53974, -54705, -56329, -55092, -55226, -55360, -55316, -55271, -55014, -54757, -56884, -59012, -60931, -62849, -60476, -58103, -59008, -59913, -57480, -55048, -56162, -57276, -58390, -59504, -61180, -62853, -63095, -63337, -61974, -60606, -61624, -62641, -62290, -61936, -61583, -61229, -62279, -63326, -62942, -62559, -61612, -60662, -57328, -53993, -55133, -56270, -57406, -58542, -59161, -59776, -60390, -61005, -59835, -58662, -57488, -56314, -57045, -57775, -58505, -59232, -57488, -55744, -54001, -52253, -47976, -43699, -43714, -43725, -43740, -43755, -41385, -39012, -39466, -39921, -40375, -40826, -45066, -49306, -53546, -57782, -58237, -58691, -59146, -59597, -59872, -60148, -58993, -57834, -60033, -62231, -62045, -61855, -60506, -59157, -57808, -56456, -56456, -56456, -54369, -52279, -52011, -56512, -57734, -56091, -52499, -51765, -52581, -53397, -52458, -51515, -50573, -49630, -48013, -46392, -46202, -46012, -44992, -43967, -45327, -46687, -47402, -48118, -49012, -49906, -49012, -50979, -52588, -49429, -49667, -49906, -49846, -49787, -52499, -55211, -54586, -53960, -55025, -56087]
-8605e6087l152l148m166O08K868J2J400J405k09k04J609J613J610J613m8m9m161m158k821
-8586f5465M1R95R98j099J763M921K065K149p11q91J975J513J512j349J517L584L584J260
-8568d1638M124N060K198j259j256l539l540k109k105J032J036j349j349j769j766L301L301
-8551d1627J330j528j348j349MPp08p08Q65Q68p42K120J610J613J792J792K087K090J554J553
-8531b8725M516P381Q811N950Q502Q502R277J2139J0469J3331J4583J4583J4523J9292K2809
-8516A45943L1394N0827Q2303J24389J88295K78414L90009M99815N57998N01723L11917K0171
-8504C183198k84092m91783n61410n13125l99621k75269j84658j21111q3912n7773m1553l0232
-8492A38659k3550j4076p396o028o025p280j5861j4732r959r724l044k392k388n466q324m328
$$ y = [-56087, -59239, -62387, -66553, -65945, -63077, -63065, -61665, -60260, -60469, -60673, -59064, -57451, -55841, -54228, -54276, -54325, -58486, -62644, -65465, -65424, -64429, -63431, -64530, -62767, -57846, -55781, -53632, -54343, -55234, -53259, -51746, -50234, -51583, -50066, -46482, -42898, -41638, -37514, -32454, -30256, -31515, -32771, -36310, -39850, -41959, -44064, -43032, -41996, -43345, -44694, -46463, -48229, -44928, -41627, -40297, -41825, -43173, -44522, -44518, -44511, -45219, -45927, -45062, -44194, -44936, -42816, -41206, -39593, -37801, -36009, -33922, -31832, -30278, -28725, -24209, -16828, -8017, -2067, 6435, 14937, 24214, 36353, 46822, 60153, 74736, 89319, 103842, 123134, 145943, 177337, 228164, 310467, 434856, 623151, 901565, 1291574, 1791389, 2349387, 2851110, 3163027, 3183198, 2899106, 2407323, 1845913, 1332788, 933167, 657898, 473240, 352129, 268217, 210444, 168891, 138659, 115109, 101033, 93637, 87609, 81584, 74304, 58443, 43711, 33752, 24028, 20984, 18592, 16204, 10738, 2414, -1914]
-8476a914m329l678l673j111j110j069J796j304p981n242n239m10m09j05j04k489k489j624
-8458d2484j625j93j94j580j580j579j580p75p75p75p75Q91Q94Q94Q94J204J207M92M91n10
-8438d7458n07j937j938J16J19k265k265k17k16r31r28R61R62K46K49J87J86R01R06k228k228
-8417e8285J56J60J338J338j047j044P42P41j643j639J114J114L498L503k046k045L39L43
-8399e3363M02M06j025j024J79J82n33n32J579J584q01q01p90p86p86p86K514K519J088J088
-8379d9686j747j744O41O41M58M62j923j922J30J34J34J35L442L447J061J062k697k694k694
-8360e3360k693K220K224P94P94J475J479k813k813q23q20O11O11L39L43L43L43k500k497
-8341e6743j065j066R28R31l20n090m880Q42K570K571K422K422M806M806o11o11o11o11j654
$$ y = [-1914, -6243, -9921, -13594, -14705, -15815, -16884, -15088, -16392, -24373, -29615, -34854, -35264, -35673, -35778, -35882, -38371, -40860, -42484, -44109, -44302, -44496, -46076, -47656, -49235, -50815, -51590, -52365, -53140, -53915, -53024, -52130, -51236, -50342, -49138, -47931, -47439, -46948, -47458, -47965, -49902, -51840, -51724, -51605, -53870, -56135, -56352, -56568, -57499, -58427, -57466, -56504, -56258, -56009, -55822, -55636, -54735, -53829, -56057, -58285, -58129, -57969, -56631, -55293, -56340, -57384, -56642, -55901, -57544, -59183, -58069, -56955, -53457, -49954, -52000, -54045, -53706, -53363, -52961, -52555, -53580, -54604, -54425, -54243, -54776, -55308, -53729, -52145, -52946, -53747, -54537, -55323, -56109, -56895, -54381, -51862, -50774, -49686, -51433, -53177, -52536, -51895, -51437, -50975, -52898, -54820, -54690, -54556, -54422, -54287, -50845, -47398, -46337, -45275, -47972, -50666, -53360, -56053, -53833, -51609, -50815, -50021, -48546, -47067, -49880, -52693, -53516, -54336, -53725, -53114, -52775, -52432, -52089, -51746, -54246, -56743, -57808, -58874, -57946, -57015, -57335, -62425, -67305, -66463, -63893, -61322, -58900, -56478, -51672, -46866, -47477, -48088, -48699, -49310, -50964]
-8322e0964j654j655j654n88n89n89n88l51l50J081J080J766J766o18o19K16K16J57N879K481
-8302d5577l80j095l953o18o19p97p94J647J647J647J650N44N44N44N48j349j349Q2Q6R46
-8282d6646R47m85m80l734l733j349j345M70M69J900J904K87K87K87K91L863L864J479J483
-8263d0241l99l99l98l95p27p26L565L570p16p15P15P19J521J520K951K954K534K533K534
-8244a9600K537M113M114Q405Q408O461O460J1707J1710J7071J7072K2019K4885K7236L2958
-8229A85556L3137L3141L8801N2153Q2557J34065K14978L31343N11611P57697J026189J146368
-8217D547596R01717K43597o07439j132031j142047q88330o25323l90687k34919j52888j05671
-8206D13575p6100n8632m0511k6803j8216j2194j2195j5417k0183k6025k6024k1200j2612
$$ y = [-50964, -52618, -54273, -55927, -56515, -57104, -57693, -58281, -58632, -58982, -57901, -56821, -55055, -53289, -53907, -54526, -54310, -54094, -53937, -48058, -45577, -45957, -47052, -51005, -51623, -52242, -53039, -53833, -52186, -50539, -48892, -47242, -46698, -46154, -45610, -45062, -46411, -47760, -47678, -47592, -46646, -45699, -46184, -46664, -50398, -54131, -55480, -56825, -56355, -55886, -53986, -52082, -51795, -51508, -51221, -50930, -47067, -43203, -41724, -40241, -40640, -41039, -41437, -41832, -42559, -43285, -39720, -36150, -36866, -37581, -36866, -36147, -34626, -33106, -30155, -27201, -24667, -22134, -19600, -17063, -12950, -8836, -431, 7977, 14438, 20898, 32605, 44315, 61386, 78458, 100477, 125362, 152598, 185556, 218693, 251834, 290635, 342788, 425345, 559410, 774388, 1105731, 1617342, 2375039, 3401228, 4547596, 5449313, 5692910, 5085471, 3953440, 2811393, 1923063, 1297740, 907053, 672134, 519246, 413575, 337475, 278843, 238332, 211529, 193313, 181119, 168924, 153507, 133324, 107299, 81275, 60075, 47463]
-8193D7463p425p426p247p243n991n991l968o824j0403l726j009j006O63O63p71l629k019
-8176b5889k020l088l085j476m337k373k370k548k549q90q87q86q87K388K392k079k079k519
-8158e5182n376k992j30P30P34J092J091J5K880K821N682L174L17j532m392n33n33k321N40
-8139e3915J613J614m14m13j003J859K50K50j777j778j777j777l24l24R27R28K388m73j844
-8120e5990K925J15m653j673j673k359k358j882K888J542j315N89N92pmpmJ446J449K876K880
-8099e4623J714J718K965K970J595j264J595J598J595j263j088j084l502l499j118j114O11
-8082e2194O15K042K045N18N18r13r12K395K396J1J1j158j159j159j159R58R57m73m73P42
-8062d6392P41o89o90q38q38q38q39l372l371l4l4K05K05K05K05k20k20k187L540K522l39
$$ y = [47463, 40038, 32612, 25365, 18122, 12131, 6140, 2172, -4652, -15055, -18781, -19790, -20796, -20133, -19470, -20241, -23870, -25889, -27909, -30997, -34082, -35558, -39895, -42268, -44638, -47186, -49735, -50625, -51512, -52398, -53285, -50897, -48505, -50584, -52663, -55182, -60558, -63550, -63680, -62950, -62216, -61124, -60033, -60018, -57138, -54317, -48635, -45461, -45144, -46676, -51068, -51601, -52134, -54455, -53915, -52302, -50688, -51102, -51515, -52518, -50659, -50409, -50159, -51936, -53714, -55491, -57268, -57592, -57916, -56989, -56061, -53673, -54146, -55990, -53065, -52950, -57603, -59276, -60949, -63308, -65666, -67548, -64660, -63118, -64433, -63844, -63252, -63259, -63263, -63270, -63274, -61828, -60379, -57503, -54623, -52909, -51191, -48226, -45256, -43661, -44925, -43330, -41732, -40137, -41400, -42488, -43572, -47074, -50573, -51691, -52805, -52194, -51579, -49537, -47492, -46974, -46456, -47369, -48281, -45886, -43490, -43479, -43468, -44626, -45785, -46944, -48103, -47145, -46188, -46661, -47134, -46392, -45651, -46340, -47030, -47868, -48706, -49544, -50383, -53755, -57126, -57160, -57194, -56989, -56784, -56579, -56374, -56594, -56814, -59001, -55461, -52939, -53278]
-8041e3278J628J632l901l900k471k466L670L670J285J289L450L450L450L454j974j975j975
-8024d4962j971k466k467j035j032P52P53o78o75o3o3o4o3J248J248J248J248L40L39k046
-8004e0409k045m013m013J234J233m55m51m54m51K61K64M40M43K84L148J773l945l234K492
-7985e7898K131p26p49K113L24L28O81O82O82O86j576j576j46j41J673J672l573l569k023
-7966f1005k019K272K273L342L346R61R61j218j215K124K124L372L375k824k824j684j680
-7949e0319P00P04J446J449j893j889L95L99L95L99j12j08J319J322K038K042O07O11J651
-7930c8844J654J651J654k902k899n18n14K87K90k097k094l432l431r3r3J695J695L484k239
-7911d6746l77l76k165k164O67O66O67O67J479J480r06r05J091J092K522K523R13R12n17n18
$$ y = [-53278, -51650, -50018, -53919, -57819, -60290, -62756, -59086, -55416, -54131, -52842, -49392, -45942, -42492, -39038, -41012, -42987, -44962, -46933, -49399, -51866, -52901, -53933, -53181, -52428, -53106, -53781, -53844, -53907, -53971, -54034, -52786, -51538, -50290, -49042, -48702, -48363, -50409, -52454, -56467, -60480, -59246, -58013, -58468, -58919, -59373, -59824, -59563, -59299, -58859, -58416, -58132, -54984, -53211, -57156, -60390, -57898, -55767, -56493, -57242, -55129, -54805, -54477, -53796, -53114, -52432, -51746, -53322, -54898, -55044, -55185, -53512, -51840, -55413, -58982, -61005, -63024, -60752, -58479, -55137, -51791, -50830, -49869, -51087, -52302, -50178, -48054, -44682, -41307, -44131, -46955, -48639, -50319, -49619, -48915, -47469, -46020, -47913, -49802, -49407, -49008, -48613, -48214, -48326, -48434, -47115, -45793, -43755, -41713, -41106, -40495, -38844, -37190, -35539, -33885, -36787, -39686, -40204, -40718, -40431, -40141, -42238, -44332, -47764, -51195, -51288, -51381, -49686, -47991, -44507, -46746, -47123, -47499, -49664, -51828, -51161, -50495, -49828, -49161, -47682, -46202, -47108, -48013, -46922, -45830, -43308, -40785, -39872, -38960, -39477, -39995]
-7891c9995l231l230l230l230l354l353J893J893K012K011K012K012q49q50N82N81n231n231
-7873e8788k251L473L260L260K187K187Q76Q75K306K307O96O97j688j687k910k910k910k910
-7855e3930k16k12Q60Q61J423m295l462l461k392k388J904J904M09M14M14M13J774J777J777
-7836e6426J777P5P8k80k79M069j651m035J688q50q45j323M400J818J818k08k05L428L427
-7817d3524J044J047m382m382j043j039J937J938N06N11J389J390j948j945j949j948K343
-7800e0055K347o82o81l842l837N70L431K120k645r76r76J56J57P82P82L465j304o48o48M84
-7780e2000M85j42j42k526k526n06n07J878J877L0L0k68k69J394l376l554J215r02l763N29
-7760f3043N29J237J241J237J240J297J300J300J301N231N235L800L804K519K522J092J091
$$ y = [-39995, -43226, -46456, -49686, -52916, -56270, -59623, -57730, -55837, -53825, -51814, -49802, -47790, -48639, -49489, -48907, -48326, -53557, -58788, -61039, -57566, -54306, -51046, -48859, -46672, -45796, -44921, -42615, -40308, -39612, -38915, -40603, -42290, -45200, -48110, -51020, -53930, -54146, -54358, -53498, -52637, -51214, -55509, -58971, -62432, -64824, -67212, -65308, -63404, -62995, -62581, -62167, -61754, -59980, -58203, -56426, -54649, -54574, -54496, -54776, -55055, -50986, -52637, -56672, -54984, -55834, -56679, -58002, -53602, -51784, -49966, -50174, -50379, -46951, -43524, -42480, -41433, -45815, -50197, -51240, -52279, -50342, -48404, -47898, -47387, -45998, -44608, -46556, -48501, -50450, -52398, -50055, -47708, -48390, -49071, -52913, -56750, -56180, -52749, -50629, -53274, -54250, -55226, -55070, -54913, -54131, -53349, -49884, -51188, -51836, -52484, -52000, -51515, -51657, -51799, -54325, -56851, -57357, -57864, -55986, -54109, -54079, -54049, -54317, -54586, -53192, -56568, -60122, -58907, -59809, -63572, -63043, -62514, -61277, -60036, -58799, -57559, -56262, -54962, -53662, -52361, -47130, -41895, -38095, -34291, -31772, -29250, -28158, -27067]
-7743b7067n18n14k902k899k545k541j110j110l327l324m758m754P1P5L412L413J677J680
-7725d7041k615k612R61R65k377k373l353l350K847K850K042K045l43l39J379J382J557J562
-7707d6813J110L975K660k105k965k962J028J032J326J330j654j650p221j494J129J129L275
-7690d8870k448o59o60L569L573N362l62j821j822K112K113M80M85M84M84l748l748l748l748
-7671e2972j114j111k541k541l35l35l35l36N81N85K016K016K190K195K194K195J952J956
-7653d3740N26N25j267j263j263j263j945j941M43M44l95l91J039J040K9L4L4L3J461J464
-7633d6396r20r21L070L070L070L070J908J908m77m77k444k444o0o0M77M77j907j908k124
-7614d3088k123o93o93p53p53k183k183l696l696k266k265k682k683k98k98M609M609J270
$$ y = [-27067, -27585, -28099, -31001, -33900, -36445, -38986, -40096, -41206, -44533, -47857, -52615, -57369, -57298, -57223, -53811, -50398, -48721, -47041, -49656, -52268, -51307, -50342, -52719, -55092, -58445, -61795, -58948, -56098, -54056, -52011, -52354, -52693, -51314, -49932, -48375, -46813, -45703, -41728, -39068, -41173, -44138, -47100, -46072, -45040, -43714, -42384, -44038, -45688, -52909, -54403, -53274, -52145, -48870, -51318, -51977, -52637, -49068, -45495, -40133, -40495, -42316, -44138, -42026, -39913, -39433, -38948, -38464, -37980, -41728, -45476, -49224, -52972, -54086, -55197, -57738, -60279, -60614, -60949, -61284, -61620, -61039, -60454, -58438, -56422, -54232, -52037, -49843, -47648, -45696, -43740, -43214, -42689, -43956, -45219, -46482, -47745, -49690, -51631, -51188, -50744, -51139, -51530, -50491, -49451, -49422, -49388, -49354, -49321, -47860, -46396, -47316, -48237, -45167, -42097, -39027, -35957, -34049, -32141, -32618, -33095, -35539, -37983, -38043, -38103, -37626, -37149, -39056, -40964, -43088, -45211, -45904, -46597, -47350, -48103, -50286, -52469, -56165, -59861, -62127, -64392, -67074, -69757, -70055, -70353, -65744, -61135, -59865]
-7596e9865J274J152J151k80k75K42K42M534M538K269K269p11p08k869K858K023K023j349
-7578d1482j345j345j345o7o3k448k448N59N62K769K768N164K306N74N77k168k165m374m370
-7559d8341l398n33M18M21m77K388R54j904L46L47L208L46l69l69J837J837L022L021J591
-7540c5655J591P165P165M005M005N790Q650P042P042P012P012R754J4523K0574K3435K2005
-7524A21115J9143J3659Q889L763k913p027j3704j9426k4195k4076k1215j7578j7579j3599
-7510E257q829k630k631l912o773o774l912n149n149n149k284j393j394k347k344k392K377
-7493e5428l05l02P08P08K317n40p04p04k314k310L69L69j062j058L424L424L424L428r88
-7474d7544r87j345J520M922K060N280K418R57j904l811l812K016K016l69l69L506L506Q23
$$ y = [-59865, -58591, -57439, -56288, -56568, -56843, -56601, -56359, -51825, -47287, -45018, -42749, -43460, -44168, -47037, -44179, -42156, -40133, -41482, -42827, -44172, -45517, -45584, -45647, -48095, -50543, -49984, -49422, -46653, -43885, -38721, -36415, -35841, -35264, -37432, -39597, -43971, -48341, -51739, -52272, -51854, -51433, -51910, -49522, -48568, -50472, -50126, -49779, -46571, -46225, -46594, -46963, -45126, -43289, -40267, -37246, -35655, -34064, -26899, -19734, -15729, -11724, -5934, 2716, 9758, 16800, 23812, 30824, 40578, 55101, 75675, 99110, 121115, 140258, 153917, 162806, 166569, 163656, 156629, 142925, 123499, 99304, 75228, 54013, 36435, 18856, 5257, -3572, -6202, -8833, -12745, -19518, -26292, -30204, -35353, -40502, -45651, -47935, -49328, -50722, -53069, -55413, -57805, -55428, -55733, -56035, -55327, -54619, -52302, -52842, -53546, -54250, -56564, -58874, -58505, -58136, -59198, -60256, -56832, -53408, -49984, -46556, -47544, -48531, -49876, -48356, -43434, -41374, -36094, -33676, -32719, -34623, -38434, -42246, -40230, -38214, -38583, -38952, -35446, -31940, -31117]
-7456c1117k038j829j829l439l439l99l99l98l99m035m035l856l856m393j531L058L059J684
-7438e9191J688N682K820l42l39l380n18O56L521m73m73P15k142k321N40J293j565J833j028
-7419e3024j539j535j893j893o14l473m247m248N18N22j684j684j014J848K39K38j371j371
-7401g6225J312M172M315M314M315M314K556l05L509L510L290M28k075k075j300J561m9m8
-7383d4481L39L39L39L39L39L39L39L39j665j666j665j665J225J226j159j158j688j688p8
-7364e1750k940k165k164m847p9K593N455L785O647L756Q94K504K504J415j445J64J64l443
-7346c8952l443k667J93k72k68r3q9J069J073L454L457L514L517J129J132k269k265m475m471
-7327d0726m348j482j487j483MK869K507k258m139m136l662p97J643J646K359m99P63O491
$$ y = [-31117, -33155, -34984, -36813, -40252, -43691, -44090, -44489, -44887, -45286, -49321, -53356, -57212, -61068, -65461, -66992, -63934, -60875, -59191, -57503, -51821, -49001, -49343, -49682, -53062, -53580, -52924, -49403, -49876, -50349, -49634, -51776, -54097, -53557, -52264, -53829, -51996, -53024, -54563, -56098, -57991, -59884, -60498, -63971, -68218, -72466, -71948, -71426, -73110, -74794, -75808, -73960, -73721, -73483, -74854, -76225, -74913, -70741, -66426, -62112, -57797, -53483, -50927, -51232, -47723, -44213, -40923, -40495, -42570, -44645, -45945, -44384, -44433, -44481, -44142, -43803, -43464, -43125, -42786, -42447, -42108, -41769, -43434, -45100, -46765, -48430, -47205, -45979, -47138, -48296, -49984, -51672, -51750, -54690, -56855, -59019, -63866, -63945, -61352, -55897, -52112, -45465, -41709, -40815, -38311, -35807, -34392, -35837, -35673, -35509, -38952, -42395, -45062, -44869, -45141, -45409, -45502, -45591, -44522, -43449, -39995, -36538, -33024, -29507, -28378, -27246, -29515, -31780, -36255, -40726, -45074, -46556, -48043, -49526, -49522, -46653, -44146, -46404, -50543, -54679, -58341, -59138, -57495, -55849, -53490, -53989, -53226, -46735]
-7309d6735O427O430L596L599K165K168J658J662J658J661j084j080Q83j975k817K910k220
-7292b1094n079l085l081j833j829M17M21M709M714N424N429J133J136j151j148m486m486
-7275b3889m877m873q093k369j53j49O408O409O911O915J669J670K712K716j576j576j609
-7258a3754j606j606j606K072K075O44O45L234L238m870m870m444m442j106j103J397J401
-7241b4701l3l0Q75Q80L260L263K664K668l536l532m761m758M84M88n2m8j483j479p98p93
-7221c1422j036M691N581j38R7J01J881J882M51M50j993j993m020m021l573K150M833J971
-7203b4108L997L998M81M80Q76Q75L261L260M750M749K366K366j8j9K366K366P433P433K544
-7184B9456K545p71M955M117M121j457j453l841l838k217k213k217k213m601m598m244m239
$$ y = [-46735, -40308, -33878, -30282, -26683, -24518, -22350, -20692, -19030, -17372, -15711, -16795, -17875, -16992, -18967, -21784, -18874, -21094, -26173, -29258, -32339, -34172, -36001, -35584, -35163, -30454, -25740, -20316, -14887, -13754, -12618, -13769, -14917, -19403, -23889, -28766, -33639, -41732, -44101, -44254, -44403, -37995, -31586, -24675, -17760, -16091, -14421, -11709, -8993, -10569, -12145, -13754, -15360, -16966, -18572, -16500, -14425, -13781, -13136, -9902, -6664, -11534, -16404, -20848, -25290, -26396, -27499, -26102, -24701, -24734, -24764, -23889, -23009, -19749, -16486, -13822, -11154, -14690, -18222, -22983, -27741, -27257, -26769, -26821, -26869, -28352, -29831, -30629, -31422, -32458, -27767, -22186, -22324, -22227, -22126, -20245, -18363, -17912, -17462, -19455, -21448, -25468, -29489, -33062, -30912, -26079, -24108, -20111, -16113, -15632, -15152, -14276, -13401, -10140, -6880, -2130, 2619, 4985, 7351, 7333, 7314, 9680, 12046, 19479, 26912, 29456, 32001, 31230, 36185, 40302, 44423, 42966, 41513, 37672, 33834, 31617, 29404, 27187, 24974, 20373, 15775, 11531, 7292]
-7167G292j111M617R500R505R530R535J1557J1561P832K112K61n458j3271j6129j0589m862
-7151C1882K872Q596J1934J1937K724K723K724K727M080M079Q372Q376J2723J2724J2724J2727
-7135A53924J7090J7090J5660R940P225J501K932K936m21m21J964J967N570N570K351Q078
-7119B52956P474P477J2124J2128J8740J8745J8919J8924J5655J8521K3108K8834L0708L6434
-7105E20747M2631M2634M0675M0678M7590N3316O2910Q0082R8916J19904J46234J67221J86293
-7092A649831K07281K29752K58369K94371L38250L90430M61012N34216O04797O77406P78509
-7081F424224R61162J298809J845279K656012L796047N331672P235225R194338J0408772R636185
-7071E8787725O008423N4775o018088r755095j0468005r184182p174521n200143l640841k559224
$$ y = [7292, 6181, 10798, 20298, 29803, 39333, 48868, 60425, 71986, 79818, 81930, 82191, 76733, 63462, 47333, 36744, 31882, 34754, 43350, 55284, 67221, 69945, 72668, 75392, 78119, 82199, 86278, 94650, 103026, 115749, 128473, 141197, 153924, 171014, 188104, 203764, 213704, 220929, 222430, 225362, 228298, 227877, 227456, 229420, 231387, 236957, 242527, 244878, 252956, 260430, 267907, 280031, 292159, 310899, 329644, 348563, 367487, 383142, 401663, 424771, 453605, 484313, 520747, 563378, 606012, 646687, 687365, 734955, 788271, 851181, 931263, 1030179, 1150083, 1296317, 1463538, 1649831, 1857112, 2086864, 2345233, 2639604, 2977854, 3368284, 3829296, 4363512, 4968309, 5645715, 6424224, 7385386, 8684195, 10529474, 13185486, 16981533, 22313205, 29548430, 38742768, 49151540, 58787725, 64796148, 64850923, 58832835, 49077740, 38609735, 29425553, 22251032, 17050889, 13410048, 10850824]
-7061A0850824j835529j345269r99818p42286n65122m44938l77863l49245l47580l41853l25582
-7050C175739l00780k65970k25906j91409j62791j47296j33939j21304j07948r1498p0510
-7039A356388m3842j1412J8871N1301O2150M8797N875n7075j14066j38864j44587j27418j06018
-7026H00100q8849p3588o0235n2646m6919m4057l8335l3569k7843k5935k3074k2795j9929
-7013B42326j9274j6412j2660o934q543q543p944p939k694k694L026L029j263j263m486m482
-6997A43250l052l051l324l319l320l320m027m024n276j0998j5742j8599j4307j1446p247
-6982C2198j520N455N454k71k69K117K116O412O416K302l420o226r083p832p832o419o416
-6965A3182o416o416J986J990N59N59L096L096P11P16M229M228N660N663M288M289J904J907
$$ y = [10850824, 9015295, 7670026, 6670208, 5927922, 5362800, 4917862, 4539999, 4190754, 3843174, 3501321, 3175739, 2874959, 2608989, 2383083, 2191674, 2028883, 1881587, 1747648, 1626344, 1518396, 1426898, 1356388, 1312546, 1301134, 1320005, 1371306, 1433456, 1482253, 1488128, 1431053, 1316987, 1178123, 1033536, 906118, 800100, 711251, 637663, 577428, 524782, 477863, 433806, 395471, 361902, 334059, 308124, 285050, 262255, 242326, 223052, 206640, 193980, 187046, 178503, 169960, 162016, 154077, 151383, 148689, 151715, 154744, 153481, 152218, 147732, 143250, 140198, 137147, 133823, 130504, 127184, 123864, 119837, 115813, 110537, 99539, 83797, 65198, 50891, 39445, 32198, 30678, 36133, 41587, 41316, 41047, 43164, 45280, 51692, 58108, 60410, 56990, 50764, 41681, 33849, 26017, 19598, 13182, 6766, 350, 2336, 4326, 4885, 5444, 8540, 11636, 12347, 13063, 17292, 21520, 27180, 32843, 37131, 41420, 43324, 45231]
-6947D5231r57r58j971L756K209o52l573l569k500L223L998J140M638M639L029L033L953L953
-6929F8622K522K526N552N555N551N556J1959J1964J8159J8164K1736K1740K7340K7344L4374
-6914B88664M0100M6655O0011P9963J20027J75820K54036L63064M98508O35137P09537O40054
-6902C911576L71086m9307m55624o81977p02958n96135m53060l25352k31875j65351j21472
-6891D99551r1312o2694l9925l0384j9195j9192k0030k0026k1461k1456j9077j9072j4724
-6878A01003j4721j1386j1382n753n749p183p180k68k64k69k64k385k381m769m765p418p418
-6861G448r444r445o822j099R28R28j010j010M21M21P19P19j665j665k940k940J353J352K605
-6842b1146K604M989M989R607R609J7120J7120J3245L708r885j9422k0727k0722j5123r396
$$ y = [45231, 44274, 43316, 41345, 45101, 47310, 46658, 43085, 39516, 37016, 40239, 44237, 45377, 50015, 54654, 57683, 60716, 64669, 68622, 71144, 73670, 79222, 84777, 90328, 95884, 107843, 119807, 137966, 156130, 177866, 199606, 226946, 254290, 288664, 328764, 375419, 435430, 515393, 635420, 811240, 1065276, 1428340, 1926848, 2561985, 3271522, 3911576, 4282662, 4233355, 3777731, 3095754, 2392796, 1796661, 1343601, 1018249, 786374, 621023, 499551, 408239, 345545, 305620, 275236, 256041, 236849, 216819, 196793, 175332, 153876, 134799, 115727, 101003, 86282, 74896, 63514, 57761, 52012, 44829, 37649, 37381, 37117, 36848, 36584, 34199, 31818, 27049, 22284, 14866, 7448, -1996, -11441, -18263, -19362, -18434, -17506, -18516, -19526, -19105, -18684, -17965, -17246, -18911, -20576, -23516, -26456, -25103, -23751, -21146, -18542, -13553, -8564, 1043, 10652, 27772, 44892, 58137, 61845, 51960, 32538, 11811, -8911, -24034, -33430]
-6827c3430m810R16K344K347l528l525j144j140l737l733l99l95P23P23P23P22L913L912L912
-6808c5606L912P533P534P533P534k690k690k690k690p172p169m787m784J620J625M005M009
-6791b4973L976L979K246K251l864q629o129o125o718r579p015m155k872j1J896J897L267
-6774f0558L268j90l052m005j144K493K492M710P570O141L278K206K206l816o676o319j1088
-6757f2484j0015j0015m411m412J79L040K012K012M575M576O512O513O334O334L457N97P74
-6740d4422P75N67N66K534K533j00o774j1904j1900j3424j0559o986J602J2046J2049J3893
-6724e9504J1036O293J528L91k467r65r61l528l525M66M69K87K91M132J274K701K705L953
-6706c5424J096l39K526M556M561R627J2489J3378J8152J9822J6960J0950j446j5156j9926
$$ y = [-33430, -38240, -37324, -34980, -32633, -36161, -39686, -40830, -41970, -45707, -49440, -49839, -50234, -49511, -48788, -48065, -47343, -43430, -39518, -35606, -31694, -24161, -16627, -9094, -1560, -4250, -6940, -9630, -12320, -19492, -26661, -31448, -36232, -34612, -32987, -28982, -24973, -20997, -17018, -14772, -12521, -16385, -25014, -31143, -37268, -43986, -53565, -60580, -64735, -67607, -67618, -65722, -63825, -60558, -57290, -57480, -60532, -64537, -65681, -63188, -60696, -55986, -48416, -42275, -38997, -36791, -34585, -38401, -45077, -51396, -62484, -72499, -82514, -86925, -91337, -91158, -88118, -86106, -84094, -79519, -74943, -68431, -61918, -55584, -49250, -45793, -45196, -44422, -43647, -43080, -42514, -39980, -37447, -37547, -44321, -56225, -68125, -81549, -92108, -99094, -97492, -85446, -73397, -59504, -48468, -42175, -40647, -40256, -42723, -43688, -44649, -48177, -51702, -51236, -50767, -50480, -50189, -46057, -44783, -42082, -39377, -35424, -34328, -34667, -32141, -27585, -23024, -13397, -908, 12470, 30622, 50444, 67404, 78354, 76908, 61752, 41826]
-6691D1826k1420j8554q360l591k925k921J371j490l730l726J163l607l402l398k086m948
-6675c9798j881j878k057k056j174j174j173j170P93P94o37o34Q84Q83k635p399m929m930
-6657g0171k842k839q39q38q38q35J159J159Q60N634M780M780P463P466L827L826K217k548
-6639c8579p199p198n767n768m873j05K459K459k429k429K817K816O155O155K817N678O438
-6622c6553J670K146K146L636L636P929P928Q077Q077J1416J1416J2668J2668J6781J6781
-6607I0422J6453J3595J2224P456o56p329j4363j7224j7794k0652k1606k1606j9403j9400
-6593a9883j2247j2247j0507j0503p164p165o095o092k753k754m933m929j591j591n21n18
-6577a11493N682N681P776P776R743R743P120M43p49K113K343K344q16q16o07o08o07o07J620
$$ y = [41826, 20406, 1852, -6508, -10099, -13024, -15945, -14574, -16064, -19794, -23520, -22357, -25964, -29366, -32764, -34850, -39798, -41679, -43557, -45614, -47670, -48844, -50018, -51191, -52361, -51568, -50774, -51411, -52045, -51161, -50278, -52913, -60312, -65241, -70171, -73013, -75852, -76691, -77529, -78367, -79202, -78043, -76884, -76024, -70390, -65610, -60830, -53367, -45901, -42074, -38248, -36031, -38579, -45778, -52976, -58743, -64511, -69384, -69489, -67030, -64571, -67000, -69429, -66612, -63796, -57641, -51486, -48669, -42991, -36553, -34883, -32737, -30591, -26955, -23319, -15390, -7462, 615, 8692, 20108, 31524, 44192, 56860, 73641, 90422, 106875, 120470, 132694, 140150, 139494, 132165, 117802, 100578, 82784, 62132, 40526, 18920, -483, -19883, -32130, -44377, -54884, -65387, -72551, -79716, -85811, -91903, -94656, -97410, -102343, -107272, -108863, -110454, -110975, -111493, -105811, -100130, -92354, -84578, -74835, -65092, -57972, -57529, -58278, -56165, -53822, -51478, -52294, -53110, -53717, -54325, -54932, -55539, -53919]
-6558e3919J621p64p63M28M28M29M28J494J495q91q90J971J970J971J971k98k94k977n838
-6539e2428j0134j0131q700j1561j1729j1725r161m393p5K791J121l647J408O181R758J4527
-6523i7898K0157K3021K3976J9206J7116J0443P1P1L018L021N108N108Q361L592K638k24j416
-6506D5369j416j773J088P52P53M926K064K779K780L673j095m292p154p809p809n842Q34M233
-6488C2061M232O490O491Q040J0902R888P027M225J364L982L987N533N536Q991J3763J5965
-6472A48477J8830K5354L0127L4296L7161M2880M5746M8960N1826N7686P3905J00370J37571
-6459H53189J83231K37601K95899L52178L87419L94100L67390L01581K01189P8153n0615j71745
-6447C429570k64025l27930l55947l53087l24353k77616k25992j77348j38108j12355r7929
$$ y = [-53919, -52298, -53062, -53825, -53397, -52969, -52540, -52112, -50618, -49123, -50014, -50904, -48933, -46963, -44992, -43021, -43319, -43613, -46590, -52428, -62562, -72693, -81393, -92954, -104683, -116408, -125569, -129962, -130037, -127246, -126125, -129772, -128364, -122183, -112425, -97898, -77741, -54720, -30744, -11538, 5578, 16021, 16092, 16163, 19181, 22202, 27310, 32418, 40779, 44371, 47009, 46785, 45369, 43953, 42180, 43268, 44020, 44773, 49699, 51763, 54542, 57322, 60995, 59900, 55608, 48454, 40645, 32836, 26994, 27828, 32061, 36293, 42783, 49274, 57314, 68216, 78104, 85131, 89356, 90720, 94702, 98689, 104222, 109758, 118749, 132512, 148477, 167307, 192661, 222788, 257084, 294245, 337125, 382871, 431831, 483657, 541343, 615248, 715618, 853189, 1036420, 1274021, 1569920, 1922098, 2309517, 2703617, 3071007, 3372588, 3573777, 3651930, 3601315, 3429570, 3165545, 2837615, 2481668, 2128581, 1804228, 1526612, 1300620, 1123272, 985164, 872809, 774880]
-6436G74880r1252q5708p7124o6275n7690m8450l9866l3965k9195k0492k0492j8763j8763
-6423A66845j5902j5901j3339j3338j1341q480m546j684L80L84P41P42J483M348J0190J3051
-6407A13633J3301J3305N973p05p295j2060q365q364o349o345n033p895j4844j9609k0264
-6392B9084k0265j3948j1085m586m586k146k143j486L282O349O352N041N041L845R88j934
-6376b197R28N960J2642J8245K1106J6990J4132J1151Q290K683j75J82M952J0849J3715J0257
-6360A49710L581j0656k1144k3290k0429j4858j1993r132r132j0645j0641j0343j0341r184
-6346a8497m412k980k981n846q703j3175j7943j7530j2757j3830r061o114j342M47L309J5943
-6330a15472K4530L2400L7168L3081K4500J0433o0r303o438K265J2757K0462K3324K0223J5459
$$ y = [774880, 683628, 597920, 520796, 454521, 396831, 348381, 308515, 274550, 245355, 224863, 204371, 185608, 166845, 150943, 135042, 121703, 108365, 97024, 88544, 83998, 82314, 82694, 83078, 83819, 84561, 86044, 90392, 100582, 113633, 126934, 140239, 146212, 145507, 138212, 126152, 117787, 109423, 103074, 96729, 91696, 83801, 68957, 49348, 29084, 8819, -5129, -16214, -20800, -25386, -27532, -29675, -31161, -27879, -21530, -15178, -10137, -5096, -1251, -263, -2197, -1269, 4691, 17333, 35578, 56684, 73674, 87806, 98957, 107247, 109930, 109755, 109937, 114889, 125738, 139453, 149710, 153291, 142635, 121491, 98201, 77772, 62914, 50921, 41789, 32657, 22012, 11371, 1028, -9313, -18497, -22909, -25889, -28870, -34716, -43419, -56594, -74537, -92067, -104824, -118654, -127715, -133829, -135171, -134724, -131415, -115472, -90942, -58542, -21374, 11707, 36207, 46640, 46580, 37277, 30839, 33104, 45861, 66323, 89647, 109870, 125329]
-6315A25329L889m694j5544k4125k2653j7884j1087n93Q107J0969J3175J3178Q562N700K243
-6300I4572K247K153N015k079j0659k1178k5946k7258k0577j3398q629n469o97O077O080J1625
-6284h121J1623R296R300O557O558O531Q12r977j9516k9057k6192k2139m970M36L301M791
-6268f0767J0515J3759J3763J4300J4298J2210J5074J8175K3897K4818K1959J4389J036r922
-6254A27504j5641j2425k884N637N641M803M806P947P951J1285J1290J1583J1587J6472J6476
-6239B12032J4988R270K05r329k5906k5902k5070j5530p321K221N913N916N973J1699J2410
-6224A71569J8138K2526K2530J8237J8238K0142K9683M2202M7925L7281J6300j2791m1404
-6211D10576o6089p5622p4430n7262m0261k3089j2120J233J4702K8059L6882M6420N1125N6852
$$ y = [125329, 129218, 124524, 108980, 84855, 62202, 44318, 33231, 32638, 40745, 51714, 64889, 78067, 86629, 92329, 94572, 96819, 98972, 103987, 101908, 91249, 70071, 44125, 16867, -3710, -17108, -25737, -31206, -31903, -25826, -19746, -8121, 3502, 12798, 22098, 28655, 35213, 41744, 42556, 32579, 13063, -15994, -42186, -64325, -69295, -68859, -65558, -60767, -50252, -36493, -22730, -8430, 5868, 18078, 33152, 51327, 75224, 100042, 122001, 136390, 137426, 127504, 111863, 99438, 96554, 102191, 107832, 112635, 117441, 125388, 133339, 144624, 155914, 167497, 179084, 195556, 212032, 227020, 236290, 236495, 227166, 201260, 175358, 150288, 134758, 127437, 129658, 135571, 141487, 147460, 159159, 171569, 189707, 212233, 234763, 253000, 271238, 291380, 321063, 363265, 411190, 448471, 464771, 451980, 410576, 344487, 268865, 194435, 137173, 96912, 73823, 61703, 62936, 77638, 105697, 142579, 188999, 240124, 296976]
-6197B96976N1368M5644L7057K3707L678n861j9508k9043l4292k4751m366K0436N0954P9572
-6183D91571Q3830N9035K221n3097r0298r3156p7362m4930j3152M020O878k656r397L961L2094
-6168B99562O4527Q0008P4288L8279j777m5239o6218o9084n5727l8096k8558l5712m1431m4952
-6154A29870k3968j792K6826L7969M3693K9862J2698o621j6159j4728j371O963J2687Q156
-6140B44085j379l588N950K0317M1304N2433N5295L7112Q503k5064m2232l9132j4329J6915
-6126C56190M9344O3652N7929L6825L1103L9449P5693J14994J39791J33831J05216N0969J4725
-6113A269711K265J5619J9538J6676m32r970j7005j1281k4874m5857p5291j07720j41103j46827
-6099G43449j09091k7064O9270J51297J73760J68037J53134J53138J46636J33283P7605j2050
$$ y = [296976, 348344, 393988, 431045, 454752, 458430, 452569, 433061, 404018, 369726, 344975, 340609, 361045, 411999, 491571, 575401, 634436, 636657, 583560, 493262, 400106, 322744, 277814, 264662, 268682, 275560, 272904, 263507, 267468, 299562, 364089, 444097, 518385, 556664, 554887, 509648, 443430, 374346, 318619, 280523, 251965, 216253, 174822, 129870, 105902, 104110, 130936, 168905, 212598, 242460, 255158, 248537, 232378, 217650, 216279, 223242, 235929, 244085, 242706, 239118, 245068, 265385, 306689, 359122, 414417, 451529, 460032, 434968, 392736, 353604, 339275, 356190, 405534, 469186, 527115, 563940, 595043, 634492, 710185, 825179, 964970, 1098801, 1204017, 1254986, 1269711, 1271976, 1287595, 1307133, 1323809, 1323377, 1313407, 1296402, 1285121, 1260247, 1214390, 1139099, 1031379, 890276, 743449, 634358, 607294, 676564, 827861, 1001621, 1169658, 1322792, 1475930, 1622566, 1755849, 1833454, 1821404]
-6087A821404j28283k29386k73976k14837r4483N6219J51599J76402J40272R6398N8722M5373
-6075A605424M0957N0496O3611R6043J30049J73924K07069K31871K25727K04744J60630J24390
-6063C314935Q7753P0586N0794M5070K7545K1822J0854J6575J9274K4997K0584K0586R616
-6050C740991K2969M2165Q9855J37136J92459K24588K41759K23037K20180K32635K91775L60952
-6038F020501M31536M75885N15948N18806N09272M84946N13564N96566P58718R71416J248019
-6027A3045177J545542J871747K175534K494104K807888L176060L577610M086942M683721
-6018C9464325N448677O324268P230378P935829Q479493R307150J1533336J6211572K4381854
-6009A36316882L6981359N5345931Q1190281J14949262J50611236J72516298J56999292R4580520
$$ y = [1821404, 1693121, 1463735, 1189759, 974922, 880439, 936658, 1088257, 1264659, 1404931, 1501329, 1560051, 1605424, 1646381, 1696877, 1760488, 1856531, 1986580, 2160504, 2367573, 2599444, 2825171, 3029915, 3190545, 3314935, 3402688, 3473274, 3524068, 3569138, 3596683, 3618505, 3629359, 3645934, 3665208, 3690205, 3710789, 3731375, 3740991, 3763960, 3806125, 3895980, 4033116, 4225575, 4450163, 4691922, 4914959, 5135139, 5367774, 5659549, 6020501, 6452037, 6927922, 7443870, 7962676, 8471948, 8956894, 9470458, 10067024, 10825742, 11797158, 13045177, 14590719, 16462466, 18638000, 21132104, 23939992, 27116052, 30693662, 34780604, 39464325, 44913002, 51237270, 58467648, 66403477, 74882970, 84190120, 95723456, 111935028, 136316882, 173298241, 228644172, 309834453, 424783715, 575394951, 747911249, 904910541, 999491061]
-6001I99491061N08938r4430756j55535945j68963624j48273011j14662897q0507739n3894722
-5993A83731305l6162296k4665147j6702468j0878535o548025l982300l414364m526499o148682
-5984G0702989p234112p364078o805147n871376m873699l912915l064032k366088j852938
-5975B7358604j442922j105277p73351n34904m86257p05632j066408j320121j306067j098134
-5965A7519531q08419m59324P738O23900J452274K545338L923580N375276O300459N623262
-5955D2103615K752667j693961n595026p206951o712590n325753l852608k637458j814985
-5946A0016950j294204r42016o80670m71939l28864k78317k99297l38585l48120l22133k66808
-5935D445997j90641j27687r6394r9251j15709j29058j35261j38119j41237j46957j31521
$$ y = [999491061, 999999999, 905569243, 750033298, 581069674, 432796663, 318133766, 237626027, 183731305, 147569009, 122903862, 106201394, 95322859, 88774834, 84792534, 81378170, 76851671, 70702989, 63468877, 56104799, 49299652, 43428276, 38554577, 34641662, 31577630, 29211542, 27358604, 25915682, 24810405, 24037054, 23502150, 23015893, 22310261, 21243853, 19923732, 18617665, 17519531, 16711112, 16251788, 16259526, 16883426, 18335700, 20881038, 24804618, 30179894, 36480353, 42103615, 44856282, 43162321, 37567295, 30360344, 23647754, 18322001, 14469393, 11831935, 10016950, 8722746, 7780730, 7100060, 6628121, 6299257, 6020940, 5721643, 5383058, 5034938, 4712805, 4445997, 4255356, 4127669, 4031275, 3932024, 3816315, 3687257, 3551996, 3413877, 3272640, 3125683, 2994162]
-5924B994162q7642l0358N891l890o3022j37467k00414k37616k43336k11327j52188q2802
-5912A549991l5108l979K0823L6558M9914O1178N1643K5649o778n2563j04065j55575j76554
-5899A261134j69524j40906j03234q2247p2504o2962n4144l6971k4337p164N469K2642L5946
-5886E71198M9304N2280M6561L7020L7023M0954M0958M1654M1658L3786K0436M62k4333m6990
-5872I41971o0339n5097l7925p940K0675L7898L5041J9244j740j6125j6121q670n809r508
-5858H35555j9043l1024l1025k1766m594J1024K8194K9918J6568j2820m1435n9784o2642n4475
-5844E82651m4936n0008o7172p8738p8737n7645j7586L3800P3860Q0716N9732K6349k265j3890
-5830D46131m352J3771K7123J0433l7258r5440j27870j21967p0463n96M7094O9628O0090L0998
$$ y = [2994162, 2906520, 2876162, 2882053, 2878163, 2815141, 2677674, 2477260, 2239644, 1996308, 1784981, 1632793, 1549991, 1514883, 1510904, 1531727, 1568285, 1618199, 1679377, 1731020, 1756669, 1749891, 1697328, 1593263, 1437688, 1261134, 1091610, 950704, 847470, 765223, 692719, 629757, 575613, 538642, 514305, 507141, 512610, 535252, 571198, 620502, 672782, 719343, 756363, 793386, 834340, 875298, 916952, 958610, 992396, 1012832, 1013294, 988961, 941971, 881632, 826535, 788610, 780670, 801345, 839243, 874284, 893528, 891788, 875663, 859542, 850872, 845063, 835555, 816512, 785488, 754463, 732697, 728103, 739127, 767321, 797239, 813807, 800987, 759552, 699768, 637126, 582651, 537715, 487707, 420535, 341797, 263060, 205415, 187829, 221629, 295489, 376205, 435937, 462286, 460021, 446131, 441779, 455550, 482673, 493106, 455848, 360408, 232538, 110571, 40108, 39512, 86606, 156234, 216324, 247322]
-5816B47322j430k5217l8569m1669l5947k7601j4247j848J1505K0272L3629M2929M8651M8827
-5802B66607M3107K9755J2585q45o565j4911k8264m7522o8503q1259q1260o7104m2303j0648
-5788i7130J7965L0898L3764K9231K3510J8812K1676J9889K2749J7918Q383q2n805p657r76
-5773A33145L316L316l066j3555k7563l2333k9117j6714j751Q741J5235J5238J4464J4463
-5759H3819J1875J1877P288M426O08O11r99r98l551l547p958n097j196P392J3830J6691J4807
-5742A49878J1948J1051J5824J5849J5853J1677J1680Q637N779J244p336j6818j6815j5626
-5728B02825j2761j1647j1643j0514p649o282l416j036J829L927O792R114R117O818j762j2020
-5712A61692j4877j8133j8130j9505j6639j2470n790r192r187r892p027m706J975J3148K1736
$$ y = [247322, 245892, 220675, 182106, 140437, 104490, 76889, 62642, 60794, 72299, 92571, 126200, 169129, 217780, 266607, 309714, 339469, 352054, 351209, 344644, 329733, 301469, 253947, 185444, 104185, 22925, -44179, -86482, -97130, -79165, -48267, -14503, 14728, 38238, 57050, 78726, 98615, 121364, 139282, 147665, 147583, 141778, 134121, 133145, 136461, 139777, 136711, 123156, 95593, 63260, 34143, 17429, 15678, 24419, 39654, 54892, 69356, 83819, 95694, 107571, 114859, 119285, 119893, 120504, 119505, 118507, 114956, 111409, 103451, 98354, 97158, 104550, 118380, 135071, 149878, 161826, 172877, 188701, 204550, 220403, 232080, 243760, 252397, 258176, 259420, 252084, 235266, 218451, 202825, 190064, 178417, 166774, 156260, 148611, 142329, 138913, 137877, 139706, 143633, 150425, 159539, 168656, 175474, 173712, 161692, 146815, 128682, 110552, 91047, 74408, 61938, 56148, 46956, 37769, 27877, 20850, 16144, 18119, 31267, 53003]
-5697E3003K2925J8160P325O52j2467j9139k4330k1464j4911m415O431J6926K5388K8253K4076
-5682A06413J7403O311l61j0816j3677q551R575K2508K7276K5727J9054R839L164j785j781
-5667B10299o077q938j3230j0365j1193j1192j5008j2142r612r613r434r430j0134j0134j0015
-5652E3782p150p600k832l309l304n354j1077j2925j2920j2686r825l327O214K828k895l014
-5636c5394l010m803R20O345J5887J9050K1911K1136J5417P128k411l901j035j427M295N846
-5620F5954Q711O263O263j665j662k787k783n171n168j0954j0950j5306j2440p452K091Q822
-5604B1766Q827O796O799N96O00n89n85K750K753N433N436j722j717L7M1J468J472M031M035
-5585F8227O93O97m728m725n980n976m430j565J711P436J2366J2370R683O826K05n514q082
$$ y = [53003, 75928, 94088, 101413, 102065, 89598, 70459, 46129, 24665, 9754, 5339, 11770, 28696, 54084, 82337, 106413, 123816, 130127, 129766, 118950, 105273, 96722, 106297, 128805, 156081, 181808, 200862, 210701, 213865, 212080, 210299, 204222, 195284, 182054, 171689, 160496, 149304, 134296, 122154, 112542, 102929, 93495, 84065, 73931, 63797, 53782, 46632, 39032, 36200, 32891, 29587, 24233, 13156, 231, -12689, -25375, -35200, -38527, -32313, -29485, -32380, -35394, -38404, -43207, -42287, -35942, -20055, -1005, 20906, 42042, 57459, 64587, 62176, 58275, 57240, 55813, 60108, 65954, 74665, 80928, 87191, 85526, 83864, 81077, 78294, 73123, 67955, 57001, 46051, 30745, 18305, 10853, 12944, 21766, 30593, 37389, 44188, 44784, 45384, 44795, 44210, 46960, 49713, 55146, 60582, 58860, 57143, 57180, 57221, 58689, 60161, 64192, 68227, 68920, 69617, 64889, 60164, 54184, 48208, 43778, 42213, 43924, 51360, 63726, 76096, 85779, 92605, 92810, 87296, 79214]
-5568G9214q077j1315j774J502J1043J5510J8376K2604K2608K3007K3011K5749K5753K8431
-5554B75642L4158L6897N0253O6059R0861J18283J46897J82541K26421K71010L14886L47878
-5542B161786L65049L56705L12829K35805J30891J1904j15906k27303l13142l65840l79193
-5531B173585l61968l29536k79461k24140j77780j37717j07433p8819o2221m5049l4676k8953
-5519C05832k4594k4590k5842k2981j8901j8897k0149k0149j9140j9135j7169j7168j3775
-5506D3342n186k861k862j281j278J106J107J401J404K239P009O050Q916J1718J1717R986
-5490I2527P127R28j1472j5369j5365j4113p437K276J0865J8793J8793J7403Q823k087k086
-5475A09606j614j609l219l219l868o725r407r408j1796j1792q454q454p086p083n473n473
$$ y = [79214, 71137, 59822, 58048, 59550, 70593, 86103, 104479, 127083, 149691, 172698, 195709, 221458, 247211, 275642, 309800, 346697, 396950, 463009, 553870, 672153, 819050, 1001591, 1228012, 1499022, 1813908, 2161786, 2526835, 2883540, 3196369, 3432174, 3563065, 3574969, 3459063, 3231760, 2918618, 2552778, 2173585, 1811617, 1482081, 1202620, 978480, 800700, 662983, 555550, 476731, 414510, 369461, 334785, 305832, 281238, 256648, 230806, 207825, 188924, 170027, 149878, 129729, 110589, 91454, 74285, 57117, 43342, 38156, 35295, 32433, 31152, 29874, 30980, 32087, 33488, 34892, 37131, 44140, 50190, 59106, 70824, 82541, 92527, 99654, 100582, 89110, 73741, 58376, 44263, 36826, 39102, 49967, 68760, 87553, 104956, 113779, 111692, 109606, 107992, 106383, 103164, 99945, 96077, 89352, 79945, 70537, 58741, 46949, 38495, 30041, 22955, 15872, 10399, 4926]
-5459D926m523j657q83q83J292J297r13r09l893j029O97P00K202K206j83j78k031k027o00
-5440f389n96K65K68k597K68J398M262M258M262O091O096N913Q778P194P198O718J952l260
-5422E2079l260n167k303r95r95q15q13l901l901n152n149j487J375J375j483j327j326j505
-5404A5250j502k071k072m62l319l220l218j669J196q05q04k236k232M70k392k988k985k928
-5386a7987o7j498j494r83J877K69K72K056K057N097N100O166J397l073l070j226j226J934
-5368d399J937K374m88m29l286l498o38k127k124M25N194M895M899Q42Q42K630k27j349J513
-5349F986J692J695J900m777o266o262m796m795J107j751l633l632j427j424k157k157j979
-5332c1676j974l99K463J032j826j248j244k858k854k023k019n93n89j456j453j815J051L849
$$ y = [4926, 403, -1254, -2137, -3020, -1728, -431, -1344, -2253, -6146, -7175, -6478, -5778, -3576, -1370, -1553, -1731, -3762, -5789, -6389, -6985, -6720, -6452, -9049, -8781, -7383, -3121, 1137, 5399, 11490, 17586, 23499, 32277, 39471, 46669, 53387, 55339, 52079, 48819, 43652, 41349, 40354, 39359, 38544, 37731, 33830, 29929, 24777, 19628, 18141, 19516, 20891, 19408, 18081, 16755, 15250, 13748, 11677, 9605, 9143, 5824, 2604, -614, -2283, -1087, -1892, -2696, -4932, -7164, -6694, -9086, -12074, -15059, -17987, -18054, -19552, -21046, -22029, -20152, -19883, -19611, -17555, -15498, -10401, -5301, 865, 2262, -811, -3881, -5107, -6333, -4399, -2462, -88, -576, -1005, -4291, -7789, -8427, -10554, -12678, -12253, -7059, -2164, 2735, 3577, 4419, 7049, 6822, 5473, 6986, 8678, 10373, 12273, 7496, 1230, -5032, -9828, -14623, -13516, -15267, -18900, -22532, -23959, -25383, -27540, -29697, -31676, -33650, -34049, -31586, -30554, -32380, -33628, -34872, -37730, -40584, -42607, -44626, -45219, -45808, -47264, -48717, -50532, -49481, -45632]
-5314d5632R91M206M210K381K385j256m113m088m083r28r24J740J744J561J565K843j5j748
-5296c9161j743r91r88O19O22J751M616L182L24j26j23j915j912o93l550m330M44Q625J3398
-5277b1951J8282J5424R132N51m996r761j0406j0402j0704p839j137J729j315J550J047J047
-5261b9749k113k112P19P19N011N011Q409Q409L164L162K150K149k500k499k999q722j0749
-5244b2540j0749p083p082P0P1O211O211O211O211L09L09L10L09r58r54j017M710N838K981
-5225a0632J606J609J412J416J054J058k731q450j0480j0477p374p369j174j170K195K198
-5209d7309K194K199J553J558l693l688l364l361j934j930J144J144J084O811P314M452J829
-5192c3997j028K05K05K6L0L54L54K738K742M29M28k910k906P1P1O270O275R87R87k351k347
$$ y = [-45632, -44641, -40435, -36225, -33844, -31459, -32715, -36828, -40916, -44999, -45927, -46851, -45111, -43367, -41806, -40241, -37398, -37413, -39161, -40904, -41895, -42883, -42264, -41642, -39891, -35275, -32093, -31769, -31895, -32018, -33933, -35845, -36538, -40088, -44418, -43974, -35349, -21951, -3669, 11755, 20887, 21438, 16442, 6681, -3725, -14127, -24831, -32670, -33807, -32078, -33393, -31843, -30796, -29749, -31862, -33974, -33255, -32536, -27525, -22514, -14105, -5696, -2532, 630, 2780, 4929, 2429, -70, -3069, -11791, -22540, -33289, -40372, -47454, -47384, -47313, -41102, -34891, -28680, -22469, -22160, -21851, -21541, -21232, -22190, -23144, -24161, -19451, -13613, -10632, -9026, -7417, -6005, -4589, -3535, -2477, -5208, -13658, -24138, -34615, -41989, -49358, -50532, -51702, -49507, -47309, -45115, -42916, -41363, -39805, -43498, -47186, -50550, -53911, -55845, -57775, -56631, -55487, -54403, -47592, -40278, -35826, -33997, -35025, -34820, -34615, -34589, -34559, -34205, -33851, -31113, -28371, -27942, -27514, -30424, -33330, -33259, -33188, -26918, -20643, -19656, -18669, -21020, -23367]
-5171b3367j934j933j994L734L681Q19k459k455k936k936k936k932j42j41j42j38m076m076
-5153d6363K124K127K638K638J207J211m217m218P5P8m322m322q05q01K68L130M739r80J901
-5134d3892J900J542J543M105M106k094k093m375m374j632j631l361K362L137K76j60j61M550
-5116d0252M549L506k217m065m065k276N85K373l349k873j1j979j978k455k452j024j021M310
-5098e4694M315J926J930K031K034O00O03k34k31L103L108K474K477q64q61j848j844j848
-5080c7823j844j35j30n380n376l443l439j04j01K213K217p64p63j632M094Q76Q75L95L99
-5061d9865j032j032j304j300k731k731J844J848M17M17j672j670K623K623o29o26K712K713
-5043d9395K261K265Q35Q35J691J692J691J695k213k213K079K083L971L972K541K545j751
$$ y = [-23367, -25301, -27234, -29228, -25494, -21813, -20994, -23453, -25908, -28844, -31780, -34716, -37648, -37790, -37931, -38073, -38211, -42287, -46363, -44239, -42112, -39474, -36836, -35629, -34418, -38635, -42853, -42778, -42700, -47022, -51344, -52149, -52950, -52682, -49552, -44813, -45793, -43892, -41992, -40450, -38907, -34802, -30696, -32790, -34883, -39258, -43632, -45264, -46895, -50256, -47894, -44757, -44481, -44641, -44802, -40252, -35703, -32197, -34414, -38479, -42544, -44820, -44235, -41862, -45211, -48084, -48095, -50074, -52052, -54507, -56959, -57983, -59004, -54694, -50379, -48453, -46523, -44492, -42458, -41858, -41255, -41489, -41720, -38617, -35509, -33035, -30558, -31422, -32283, -34131, -35975, -37823, -39667, -39802, -39932, -45312, -50688, -54131, -57570, -57674, -57775, -55562, -53345, -54109, -54872, -56504, -52410, -51534, -50659, -50264, -49865, -50897, -51929, -53233, -54533, -57264, -59995, -58151, -56303, -55886, -55469, -57141, -58811, -56188, -53565, -54194, -54820, -52108, -49395, -47134, -44869, -44034, -43199, -41508, -39816, -38125, -36430, -38643, -40856, -38777, -36694, -32723, -28751, -26210, -23665, -25416]
-5026b5416j751l21l16j401j398L849L849j550j546K42n481m202m199m557m557O26O30O30
-5008d6869O29K448K452J021J020m43m40m39m40j457j453j453j453k172k168Q12O535M668
-4990c9202M669L595L599j352j353J986J990k724k723p374j647J360J360K87K91J766J770
-4973c3702J769J770k139k134p05p04k764k761N77N78p38p34J651J650J111J114k225k224
-4955d0610k765k760N77N78k497k492j08j08K988K992O07O07J673J673K42K42j099j099j099
-4936d2458j099J08J08M400M400O815O814N742J8j717j718n413n414m281m281r43r42K127
-4918c7734K128L558L558L230L231k970k969k351k348k351k347l334l331j904j900j83j79
-4901d8196k567k563k269k265J15J19l126l122K12K17m14m10K925K928L715L718L715L718
$$ y = [-25416, -27167, -27488, -27804, -29205, -30603, -26754, -22905, -24455, -26001, -25759, -31240, -35442, -39641, -44198, -48755, -48129, -47499, -46869, -46240, -43792, -41340, -40319, -39299, -39742, -40182, -40621, -41061, -42518, -43971, -45424, -46877, -49049, -51217, -50405, -43870, -39202, -34533, -30938, -27339, -28691, -30044, -28058, -26068, -28792, -31515, -38889, -40536, -39176, -37816, -37529, -37238, -35472, -33702, -31933, -30163, -32302, -34436, -35141, -35845, -38609, -41370, -40793, -40215, -40953, -41687, -40036, -38386, -37275, -36161, -38386, -40610, -43375, -46135, -45558, -44980, -47477, -49969, -50077, -50185, -47197, -44205, -43598, -42991, -41318, -39645, -39403, -39161, -40260, -41359, -42458, -43557, -43449, -43341, -38941, -34541, -27726, -20912, -15170, -15152, -16869, -18587, -24000, -29414, -33695, -37976, -38919, -39861, -37734, -35606, -32048, -28490, -25260, -22029, -24999, -27968, -30319, -32667, -35018, -37365, -40699, -44030, -45934, -47834, -48017, -48196, -50763, -53326, -55595, -57860, -57745, -57626, -60752, -63874, -63662, -63445, -63859, -64269, -61344, -58416, -54701, -50983, -47268, -43550]
-4883d3550L924L927L923L927J375J378J375J379Q68Q71m377m374j390j386j390j386j121
-4866c6027j118l506l502j524j520r3r0J844J848n40n36n55n52n55n51k016k012k016k012
-4847e5033K817K821K816K821l13l10j743j740J79J82J79J83j20j15J311J316J594J599J594
-4828c9962J599J237J240j147j144K384K389K384K388j579j576l965l960j319j315k213p933
-4811e2492k749J15N29N33j602j598P82P86K243K247K064K068M948K090j967p687n693k828
-4793e8211l249l83J102j754K414K418k98k94k98k95K590K589J159J158n40n40j554M170M064
-4774d5752J204j68j68L99L99l894l893k672k671k671k672J293J293K724K723J636J635K05
-4756e1050K05N6N6N6N6l28l24l666l663j758j755L487L491q35q30q35q31Q65Q68L249L252
$$ y = [-43550, -39626, -35699, -31776, -27849, -26474, -25096, -23721, -22342, -21474, -20603, -24980, -29354, -30744, -32130, -33520, -34906, -36027, -37145, -40651, -44153, -45677, -47197, -47290, -47380, -45536, -43688, -44228, -44764, -45319, -45871, -46426, -46977, -48993, -51005, -53021, -55033, -52216, -49395, -46579, -43758, -44071, -44381, -46124, -47864, -47685, -47503, -47324, -47141, -47261, -47376, -46065, -44749, -43155, -41556, -39962, -38363, -37126, -35886, -37033, -38177, -35793, -33404, -31020, -28632, -30211, -31787, -35752, -39712, -41031, -42346, -44559, -52492, -55241, -55126, -54597, -54064, -55666, -57264, -56482, -55696, -53453, -51206, -49142, -47074, -42126, -40036, -42003, -49690, -55383, -58211, -61460, -61843, -60741, -62495, -60081, -57663, -57961, -58255, -58553, -58848, -56258, -53669, -52510, -51352, -51892, -52432, -53986, -49816, -45752, -44548, -44716, -44884, -44485, -44086, -47980, -51873, -54545, -57216, -59887, -62559, -61266, -59973, -57249, -54526, -52890, -51255, -51050, -50845, -50789, -50733, -50677, -50621, -50949, -51273, -54939, -58602, -60360, -62115, -58628, -55137, -55972, -56802, -57637, -58468, -57603, -56735, -53486, -50234]
-4735e0234J118J121l174l171l13l09l651l648%ML338L342L309L312L011L014L159j606k261
-4716d3639k262k325k321k321k321m009m005j621j621p60p56k843k843k533K239L849L848
-4699f6244L041L044L044L044O676O681N249N250J580J583q01q01j490j487m825m825l815
-4682d5096l811k202K567J535J539n48n48m635m631m631m631J34J38K522K522K847K850m88
-4664e4567m88k280k277J08J08J536J538J539J539l58l54l58l53K056K061K056K061J296J300
-4645d3837L682L684n51n48n51n48l379l376j948j945J091J096K522K526m28m25m28m25P93
-4626d2995P98l499l495j564j561K727K731m62m58m62m59L58L61J789J792j669j666j669j665
-4607e1068J38J41J569J572L446L450K016K019j218j215K13K16K716K720j576j572j919j915
$$ y = [-50234, -49116, -47995, -51169, -54340, -54653, -54962, -58613, -62261, -62261, -62257, -58919, -55577, -52268, -48956, -45945, -42931, -39772, -41378, -43639, -45901, -48226, -50547, -52868, -55189, -59198, -63203, -64824, -66445, -67205, -67961, -70804, -73647, -76180, -73941, -70092, -66244, -63203, -60159, -57115, -54071, -47395, -40714, -35465, -30215, -28635, -27052, -27853, -28654, -30144, -31631, -36456, -41281, -45096, -48907, -51109, -48542, -47007, -45468, -46016, -46564, -51199, -55830, -60461, -65092, -64958, -64820, -62298, -59776, -56929, -54079, -54567, -55055, -57335, -59612, -59504, -59396, -57860, -56322, -54783, -53244, -53602, -53956, -54314, -54667, -52611, -50550, -48494, -46433, -45137, -43837, -40155, -36471, -37022, -37570, -38121, -38669, -42048, -45424, -47372, -49317, -48226, -47130, -44608, -42082, -42510, -42935, -43363, -43788, -42995, -42197, -45696, -49191, -50755, -52316, -49589, -46858, -47320, -47778, -48240, -48699, -48341, -47980, -46191, -44399, -46068, -47734, -49403, -51068, -50930, -50789, -49220, -47648, -44202, -40752, -38736, -36717, -37935, -39150, -38937, -38721, -36005, -33285, -34861, -36433, -38352, -40267]
-4589d0267l346l346j263j259j259j260R43R46R47R46M340M345J006J006m9m4m337m337q24
-4570d7112q19q20q20J994J997J997J997K530K533k712k713l681l681k250k247m02m03m02
-4552e5014l99k474k473k474k471J20J19K504K507O97O96O97P01J084J084k254k250j94j94
-4533e9988K191K194L413L413j833j829N40N44N44N44Q68Q72K302K303k31k28K158K157r17
-4514d0983r12r13r13n51n48K790K791R09R13R13R13o64o59o60o59j855j852J486J487k46
-4494c9213k42J188J189pmmmq04q01q01q02%Mj427j427R7J01J00J01m40m36m36m35k310k307
-4469d9120l141K582J237J241J598J599P00P01P00P01K83K83K668K667K534K533L965L964
-4451b2305o26o26l011l010k735k734j304j304l063l063K76K76j587j588j587j587K258K258
$$ y = [-40267, -43613, -46959, -48222, -49481, -50740, -52000, -51057, -50111, -49164, -48218, -43878, -39533, -38527, -37521, -37570, -37614, -41951, -46288, -47112, -47931, -48751, -49571, -47577, -45580, -43583, -41586, -39056, -36523, -39235, -41948, -45629, -49310, -51560, -53807, -54209, -54612, -55014, -55413, -57887, -60360, -62834, -65305, -65185, -65066, -62562, -60055, -59358, -58662, -57965, -57264, -56180, -55096, -57350, -59600, -59794, -59988, -57797, -55603, -52190, -48777, -50610, -52439, -51899, -51355, -50811, -50267, -49399, -48527, -46225, -43922, -44153, -44381, -42223, -40066, -40983, -41895, -42808, -43721, -44272, -44820, -42030, -39239, -38330, -37417, -36504, -35591, -36255, -36914, -37574, -38233, -40088, -41940, -40454, -38967, -39213, -39455, -38267, -37078, -37085, -37089, -37093, -37097, -37901, -38702, -39503, -40305, -40305, -40301, -41728, -43155, -43058, -42957, -42857, -42756, -43196, -43632, -44068, -44503, -46813, -49120, -52261, -49679, -48442, -47201, -45603, -44004, -43304, -42603, -41903, -41202, -40919, -40636, -37968, -35301, -32767, -30234, -26269, -22305, -22931, -23557, -26568, -29578, -32313, -35047, -36351, -37655, -40718, -43781, -43505, -43229, -44816, -46404, -47991, -49578, -47320, -45062]
-4433d5062j27j27L163L167j71j71j815j811l241l241M95M99N00M99K224K228K228K228L059
-4414c5476L063k76k76Q24Q27k511k512k380k377K868K869L938L942k257k258k824k825m39
-4396c8080m36l242l241R7J00l837l838m99m95p08p08p08p04J93J94K161l558o632l770K369
-4376f5342K373K847K846J416J420L085L085P00P04K109K113k76k72J155J159k76k72O18O23
-4357d0185k720k716j528j524j527j524J490J494J491J494J102J107J103J106o55o52K682
-4340c9962K687K08K13K08K13n26n21n26n21k612k608j181j178j255j252L036L041j047j043
-4321d4626j047j044k477k474J814J818N93N96q38q35J263J267k075k072k522k519Q16Q20
-4303e3542J259J259J260J263j692j691k61k57J766J766L35L39O7O7J498J502m70m69m70m65
$$ y = [-45062, -45189, -45316, -42153, -38986, -39157, -39328, -41143, -42954, -46195, -49436, -48941, -48442, -47942, -47443, -45219, -42991, -40763, -38535, -35476, -32413, -32689, -32965, -32141, -31314, -33825, -36337, -38717, -41094, -38226, -35357, -31419, -27477, -29734, -31992, -34816, -37641, -38080, -38516, -41758, -44999, -44902, -44802, -48639, -52477, -52976, -53471, -54179, -54887, -55595, -56299, -56106, -55912, -53751, -57309, -63941, -67711, -65342, -62969, -60122, -57276, -55860, -54440, -51355, -48270, -47570, -46866, -44757, -42644, -42920, -43192, -42037, -40878, -41154, -41426, -40808, -40185, -42905, -45621, -47149, -48673, -50200, -51724, -50234, -48740, -47249, -45755, -44653, -43546, -42443, -41337, -41992, -42644, -39962, -37275, -37067, -36854, -36646, -36433, -36959, -37480, -38006, -38527, -41139, -43747, -44928, -46106, -47361, -48613, -45577, -42536, -43583, -44626, -45673, -46717, -49194, -51668, -49854, -48036, -47443, -46847, -47685, -48520, -47257, -45990, -48065, -50137, -52659, -55178, -54362, -53542, -52283, -51024, -49764, -48501, -50193, -51884, -52145, -52402, -50636, -48870, -48535, -48196, -48129, -48062, -46564, -45062, -45532, -46001, -46471, -46936]
-4283d6936j42j42j572j568K16K16M687M691K481N343K422k344o144j375l61l219l342l342
-4265e0431l62l57L506O44j859K914m59m58j60j57L074L074k65k60m74m73K865K869M572M571
-4245b7626J234J237j182j181j181j177m791m788k105k105k049K723J830j033M70L335P71
-4228c7618k090k46k42m21m22J454J456j881j882l65l61l62l61J021J024J025J025n00m95
-4209d0241m96m95l044l040J248J252N32N37J963J968O07O11O07O11n55n51k940k936L09L13
-4189d3740j121j118R95R98R95R99K343K347R13R17J8K3J8K3l99l95J032J036J569J572q16
-4168c1791q12P41P45P42P45J755J758J755J759Q2Q5k302k299o63o60j795j793l003J770N14
-4148c2667N18k198k194k199k194K94K98j132j133o3o0J371J371J025J028J028J029J322J327
$$ y = [-46936, -47078, -47220, -48792, -50360, -50144, -49928, -45241, -40550, -38069, -32726, -30304, -32648, -38792, -40167, -40528, -43747, -47089, -50431, -50793, -51150, -47644, -47000, -48859, -45945, -46404, -46862, -47022, -47179, -44105, -41031, -41296, -41556, -42030, -42503, -39638, -36769, -32197, -27626, -26392, -25155, -26337, -27518, -28699, -29876, -34667, -39455, -41560, -43665, -45714, -42991, -41161, -42194, -41724, -38389, -37618, -39708, -39954, -40196, -40617, -41039, -39585, -38129, -40010, -41892, -42257, -42618, -42980, -43341, -42320, -41296, -40271, -39246, -39746, -40241, -40737, -41232, -44276, -47316, -46068, -44816, -44284, -43747, -41784, -39816, -39209, -38598, -37991, -37380, -37935, -38486, -41426, -44362, -44053, -43740, -44861, -45979, -44984, -43986, -42991, -41992, -39649, -37302, -36389, -35472, -35454, -35431, -35413, -35390, -35789, -36184, -35152, -34116, -32547, -30975, -31791, -32603, -31862, -31117, -30375, -29630, -27875, -26117, -24362, -22603, -22521, -22436, -24738, -27037, -27700, -28360, -30155, -31948, -34951, -33181, -32667, -32149, -34347, -36541, -38740, -40934, -40640, -40342, -41474, -42607, -42670, -42730, -41359, -39988, -38963, -37935, -36907, -35878, -34556, -33229]
-4129c3229j05j04k288k283k284k284Q42Q46K276K276K348K351l4l3l316l313r27r28o7o7
-4109d0323k452k448J304J304J305J307K377K377K377K381Q27Q27j557j554p45p45O86O89
-4091c2063K38K39K38K42p52p53k183k180k898k899M40M43k50k49k50k50q45q46N85N85L24
-4070d3084L24L24L24J875J874J516J516O357O33j393j394j840j841L465O04m255J468K958
-4052c0569K958J319m404k794O7p82p83Q27Q27j56j57J275J274L465L465J27J26l062l063
-4033c0040J230J229L17L16L17L17o07o08k038k038k336k336J956J956P64P64o67o67N03N07
-4013c1161r24r24J337J341J342J341j53j49j49j49j136j133J252J252p71p72p71p67k65k64
-3993c1623k65k61j337j338r80r76j993L729r20r17L10L13J743J744k27k24k23k24o89o86
$$ y = [-33229, -33334, -33438, -35726, -38009, -40293, -42577, -41735, -40889, -38613, -36337, -33989, -31638, -31672, -31705, -35021, -38334, -39261, -40189, -40256, -40323, -42775, -45223, -43919, -42615, -41310, -40003, -37626, -35249, -32872, -30491, -29664, -28837, -30394, -31948, -32693, -33438, -32752, -32063, -31825, -31586, -31348, -31106, -31858, -32611, -34794, -36974, -39872, -42771, -42331, -41888, -42138, -42387, -42637, -42887, -43732, -44578, -43993, -43408, -43084, -42760, -42436, -42112, -40237, -38363, -36847, -35331, -28974, -28341, -29734, -31128, -32968, -34809, -31344, -30740, -34995, -33527, -30569, -27611, -26292, -30696, -33490, -33423, -34205, -34988, -34161, -33334, -33490, -33647, -32372, -31098, -27633, -24168, -24041, -23915, -26977, -30040, -28810, -27581, -27264, -26948, -26631, -26314, -26921, -27529, -29567, -31605, -33941, -36277, -34321, -32365, -31601, -30837, -31504, -32171, -31668, -31161, -32085, -33009, -31672, -30331, -28989, -27648, -27801, -27950, -28099, -28248, -29384, -30517, -29265, -28013, -28784, -29556, -30327, -31094, -31359, -31623, -31888, -32149, -33486, -34824, -35804, -36780, -38773, -35044, -35964, -36881, -36571, -36258, -34515, -32771, -32998, -33222, -33445, -33669, -34358, -35044]
-3973c5044n06n07M43L309J997k772j885j886J155J159R17R16j468j464K019K020n44n41R17
-3954c1765j945j587L186j167j166q68q64R20R20j166j162j718L051L052j714P56P57r73r68
-3935c4421K27K27j203j200j800j799l69l65J047J047K477K482J702J703j635j632j684j681
-3917c6877k53k50J207J211k131k127J184J189J185J188r01q98K436K441J654J658J654J658
-3899b4772R09R13j475j472j036j032K303K306J766J770L35L39j948j945n18n14N55N59q76
-3880b3833q72J137J140j248j245l215l212K031K034K020K023k273k269M69M74M69M73O19
-3862b5278O22O18O23l078l074j647j643L201L204M631M635L230L234Q46Q50r73r69r72r69
-3843a2909r42r39M88M92J632J635K01K05Q2Q6J513J516m151m146j766j763R17R20R17R20
$$ y = [-35044, -35550, -36057, -35614, -32305, -30308, -33080, -34965, -36851, -35696, -34537, -33620, -32704, -34172, -35636, -33617, -31597, -32141, -32682, -31765, -33710, -35297, -32111, -33278, -34444, -35312, -36176, -35256, -34336, -35502, -36664, -38382, -35331, -32279, -33993, -33237, -32480, -33453, -34421, -34194, -33967, -35170, -36370, -38170, -39969, -40338, -40703, -39656, -38609, -36132, -33650, -31948, -30245, -31880, -33512, -35196, -36877, -37130, -37380, -36173, -34962, -37093, -39220, -38036, -36847, -35662, -34474, -35375, -36273, -33837, -31396, -29742, -28084, -26430, -24772, -23863, -22950, -24425, -25897, -26933, -27965, -25662, -23356, -21590, -19820, -19485, -19146, -21094, -23039, -23557, -24071, -23516, -22957, -23833, -24705, -23568, -22428, -23676, -24921, -28136, -31348, -29317, -27283, -25263, -23240, -25513, -27782, -27313, -26839, -26370, -25897, -25278, -24656, -24038, -23415, -26493, -29567, -31214, -32857, -29656, -26452, -21821, -17186, -13956, -10722, -9876, -9026, -9999, -10968, -11940, -12909, -13851, -14790, -14302, -13810, -12178, -10543, -10342, -10137, -10055, -9969, -8456, -6940, -11091, -15237, -17003, -18766, -17849, -16929, -16012, -15092]
-3823a5092J449J453J453J453J271J274k064k064l186l181J56J57J82J86K571K571o7o3o4
-3804a1605o3n164n160j822j822j945j941n10n11J125J129J129J129K720K720j573j572q27
-3786b4563q27O03O04j706j707J632J632K735K734L51L50k12k13k12k13K35K35K35K34j069
-3766a9142j069j070j069l334l335R57R58O82O82L066L066q38q38q39q38J494J494O3O4j487
-3746b1333j486j487j487l05l06j736j736K288K287K288K288L703L703L704L703j095j095
-3729h102j096j095k116k113o86o81k802k798j371j368j654j650k24k20O11O15O11O15R35
-3710b4589R39R35R39m66m62R65R69m%m%l401l398K798K802p9p8p8p8J00J01J00J01K142K143
-3685a7603j196j196l4l3j465j464k433k433J860J859R35R35R35R35J196J196k142k142m44
$$ y = [-15092, -13643, -12190, -10737, -9284, -8013, -6739, -8803, -10867, -14053, -17234, -17078, -16921, -16739, -16553, -13982, -11411, -11478, -11541, -11605, -11668, -16832, -21992, -23814, -25636, -27581, -29522, -30032, -30543, -29418, -28289, -27160, -26031, -23311, -20591, -22164, -23736, -24563, -25390, -24787, -24183, -25889, -27596, -25964, -24332, -21597, -18863, -18512, -18162, -18374, -18587, -18799, -19012, -18777, -18542, -18307, -18073, -19142, -20211, -21281, -22350, -25684, -29019, -28062, -27104, -26422, -25740, -22674, -19608, -20446, -21284, -22123, -22961, -21467, -19973, -19910, -19846, -21333, -22819, -24306, -25793, -26098, -26404, -28140, -29876, -27588, -25301, -23013, -20725, -17022, -13319, -9615, -5912, -7007, -8102, -9198, -10293, -12409, -14522, -15208, -15889, -18691, -21489, -22860, -24228, -25882, -27532, -27756, -27976, -27365, -26750, -26139, -25524, -24589, -23650, -22715, -21776, -22242, -22704, -21739, -20770, -20774, -20774, -20778, -20778, -24179, -27577, -24779, -21977, -22056, -22134, -22212, -22290, -22190, -22089, -21989, -21888, -19746, -17603, -18799, -19995, -20029, -20062, -21527, -22991, -25424, -27857, -25997, -24138, -23203, -22268, -21333, -20398, -19202, -18006, -20148, -22290, -22734]
-3666b2734m43J464j397j487L287M24M25q01p97p98p97J457J460j877j878J427J430r53r54
-3647b3542l69l69J062J066J08J08J08J11P05P04P04P08J97J98j233j230j15j16j15j16J53
-3626b1273J53J404J405j502m363m184N85J956r05J777M639J386J390q20q16k53k50k53k50
-3607b0174m02l99j833j830J327J330j04j01K839K839K839K839J379J378j006j006J006J006
-3589h073j974j975k779K943k76k75l21l20J110J110K46K46k139k138J825J826L95L95j364
-3570a1538j363j364j364j397j393L7L7O4O7O7O7J53J56J57J56M21M25J855J856J274J278
-3549a0349J278J278j200j196k627k626J557J561q23q24j870j867j866j867j669j665J669
-3532b3106J673J430J435J430J435j475j472m5m1K24K27J654J658O41O45K071K075O11O15
$$ y = [-22734, -23177, -21713, -23110, -24597, -21310, -20886, -20461, -21262, -22059, -22857, -23654, -22197, -20737, -22614, -24492, -23065, -21635, -22588, -23542, -23911, -24280, -23218, -22152, -22044, -21936, -21828, -21717, -21012, -20308, -19604, -18896, -18699, -18501, -19734, -20964, -21079, -21195, -21310, -21426, -21273, -21120, -19716, -18311, -19813, -24176, -28360, -27775, -25819, -26724, -24947, -20308, -18922, -17532, -18352, -19168, -19421, -19671, -19924, -20174, -20576, -20975, -22808, -24638, -23311, -21981, -22085, -22186, -19347, -16508, -13669, -10830, -9451, -8073, -9079, -10085, -9079, -8073, -10047, -12022, -14801, -11858, -12134, -12409, -12730, -13050, -11940, -10830, -10584, -10338, -12477, -14615, -12790, -10964, -10569, -10174, -11538, -12901, -14265, -15629, -17026, -18419, -18382, -18345, -18281, -18214, -18147, -18080, -17927, -17771, -17614, -17458, -17037, -16612, -14757, -12901, -11627, -10349, -9071, -7793, -8993, -10189, -12816, -15442, -13885, -12324, -13147, -13971, -15841, -17708, -19574, -21441, -23110, -24775, -23106, -21433, -20003, -18568, -17138, -15703, -17178, -18650, -18695, -18736, -18512, -18285, -16631, -14973, -14332, -13687, -11616, -9541, -8930, -8315]
-3513h315q20q15K90K94K91K94j766j762l35l32r09r05k336k336l324l320J9J9K392K395K396
-3492a8885K396K749K754K753K754L625L628K90K91l468l465l465l465k962k958L80L80l09
-3474a6977l06K079K079L972L972O33O37k854k854k377K396q57l719j631j629N44L406M84
-3456a3002m281k820J948K009q50j747j748m95m92J114J114l17l13j509j509k939k936j390
-3438c0163j390M1M1J770J770L200L201M109M110j83j82K94K94K95K94J140J140J140J140
-3419g939J57J56j274j274j170j170j170j170J006J006J006J006J327J330J330J330k787k783
-3401a1083j353j352j043j040J345J345K415K418L3L4l666l663j278j278O0O3O3O4p90p86
-3381a9492l171l171K221K224j114j114j114j114J271J274K045K046l39l35J598J598j30j27
$$ y = [-8315, -9135, -9950, -9660, -9366, -9075, -8781, -10547, -12309, -12644, -12976, -13885, -14790, -17126, -19462, -22786, -26106, -26087, -26068, -23676, -21281, -18885, -16489, -13740, -10986, -8233, -5479, -1854, 1774, 2064, 2355, -1113, -4578, -8043, -11508, -14470, -17428, -17048, -16668, -16977, -17283, -15204, -13125, -9153, -5181, -4548, -3911, -6765, -9619, -11996, -9600, -10457, -14176, -15807, -17436, -16892, -13486, -13002, -17283, -20103, -18155, -16146, -16996, -18743, -20491, -20986, -21478, -20364, -19250, -19567, -19880, -21389, -22898, -25837, -28773, -30163, -31553, -31512, -31471, -29701, -27931, -24731, -21530, -17421, -13311, -13494, -13676, -13382, -13088, -12793, -12499, -11359, -10219, -9079, -7939, -7782, -7626, -8900, -10174, -11344, -12514, -13684, -14854, -13848, -12842, -11836, -10830, -9503, -8173, -6843, -5513, -8300, -11083, -12436, -13788, -14831, -15871, -14526, -13181, -10766, -8348, -8315, -8281, -11947, -15610, -16888, -18166, -18106, -18043, -17980, -17916, -18706, -19492, -22663, -25834, -23613, -21389, -22503, -23617, -24731, -25845, -24574, -23300, -21255, -19209, -19548, -19883, -18285, -16687, -16817, -16944]
-3363a6944K672k098m363j498o48o48J915J919J527J528J527J532N29N29J960J963J930J930
-3345d738L361L363K127K128j211j211l744l744l744l745k000k001L84L83j23j23k507k507
-3327a9652L256L256Q72Q72k019k020L65L65O34O33O34O33j960j960M25M25J159J162k68k68
-3307a3456M73M77M77M76n92n89J796J796l54l50J080J081K615K620K618K619O312O315N898
-3288B1312N898K310m363n854n853o423o420l080l081l193l189j763j758M13M18M13M18N32
-3270a3263N37k806k802k090k086k090k087K903K906J471J476O37O41j748j743J315J319J315
-3252a6195J319q6q2K299K303l223l223m475K95J75J75M73M73L402L402L401L402K329K328
-3233a508k917k917J15J16j316j315j017j017k448k448j345j345Q6Q6j852j852J487J486J140
$$ y = [-16944, -14272, -16370, -20733, -22231, -22879, -23527, -21612, -19693, -18166, -16638, -15111, -13579, -13050, -12521, -10561, -8598, -6668, -4738, -1377, 1986, 4113, 6241, 5030, 3819, 75, -3669, -7413, -11158, -13158, -15159, -14775, -14392, -14515, -14638, -17145, -19652, -16396, -13140, -12268, -11396, -13415, -15435, -15070, -14705, -14071, -13438, -12804, -12171, -14131, -16091, -15666, -15241, -14082, -12920, -13188, -13456, -12983, -12506, -12029, -11553, -12145, -12734, -10938, -9142, -9496, -9846, -8766, -7685, -5070, -2450, 168, 2787, 9099, 15414, 21312, 27210, 29520, 25157, 19303, 13450, 7027, 607, -2473, -5554, -8747, -11936, -13699, -15457, -15044, -14626, -14213, -13795, -13263, -12726, -15532, -18334, -20424, -22510, -24600, -26687, -23784, -20878, -19407, -17931, -17294, -16653, -18401, -20144, -18829, -17510, -16195, -14876, -14962, -15044, -12745, -10442, -13665, -16888, -21363, -21068, -20893, -20718, -20245, -19772, -16370, -12968, -9567, -6165, -3836, -1508, -4425, -7342, -7227, -7111, -8427, -9742, -10759, -11776, -14224, -16672, -18017, -19362, -19276, -19190, -21042, -22894, -21407, -19921, -18781]
-3214a8781J140P83P86N015p08q27q23j677j677j676j673qpqlK123K124k61k57R02R02n29
-3192a5140n26N44N44J975J978k705k705m731m728l715K012j207j207R94R99R98R99j83j79
-3173b5983L160L159j82j79j79j79K28K27k157k154J598J599p86p83N55N56L774j945k485
-3154b2156k485m59m54J941J941J941J945l573l573k35k31J502J501P1P5J829J829n55n51
-3135a9697p90p86p86p86O11O14j769j770r76r73K366K366m99m96m95m96K005K004N224n00
-3115a5629j304j304k31k31p82p82p83p82O48O48O49O48l599l599O93O93m10m10m10m10j036
-3094b7723j035K183l539L7L7l20l21J16J15J16J15k388k388r58r57l62l61J069J069J040
-3074c4455J039J040J039K646K645K61K61j230j229j230j229J56J57j275j274j244j245J140
$$ y = [-18781, -17641, -16858, -16072, -11057, -11765, -12592, -13415, -15092, -16769, -18445, -20118, -20126, -20133, -20141, -20144, -18021, -15897, -16158, -16415, -15513, -14611, -15140, -15666, -15122, -14578, -12603, -10625, -13330, -16035, -20766, -25494, -29209, -27197, -28404, -29611, -28617, -27618, -26620, -25621, -25804, -25983, -22823, -19664, -19846, -20025, -20204, -20383, -20155, -19928, -22085, -24239, -22641, -21042, -21828, -22611, -22056, -21500, -17726, -19671, -22156, -24641, -25100, -25554, -23613, -21672, -19731, -17786, -21359, -24932, -25167, -25398, -23896, -22395, -22324, -22249, -20420, -18591, -19146, -19697, -20487, -21273, -22059, -22845, -22234, -21620, -23389, -25159, -26135, -27108, -24742, -22376, -22875, -23371, -23866, -24362, -22357, -20353, -15129, -15629, -16933, -18237, -18468, -18699, -19481, -20263, -21046, -21828, -21180, -20532, -19883, -19235, -22834, -26433, -25740, -25047, -25457, -25867, -26277, -26687, -27723, -28758, -26575, -30114, -30077, -30040, -30360, -30681, -30565, -30450, -30334, -30219, -32607, -34995, -35953, -36910, -37272, -37633, -36564, -35495, -34455, -33416, -32376, -31337, -28691, -26046, -25785, -25524, -26754, -27983, -29213, -30442, -30286, -30129, -31404, -32678, -33922, -35167, -34027]
-3056c4027J141K53K53L592L595n21n22k906k902m412m411j073j069K026K027N96O00J86J87
-3037c7387K571K574m69m70j900j896l331l331J915J919J736J736L06L09J494J494j844j841
-3019c6415J345J345q5q2j76j75j75j71J762J762J763J766j297j296j297j293J64J64J64J68
-2999c2059o0o0K325K329O0N9O0O3n07n03j937j934n36n33n36n33o41o37o41o37l43l39j773
-2976c9313j770K962K966N77N81K008K012l76l72O52O55p78p75r58r54r57r54Q01Q01Q01Q05
-2955c1586N92N93N92N96o59o60j82K682M467l01j733j729k64k65k64k65p11p12j188J672
-2935b9325K642k127j651j650Q83Q83n48n48q31q27q27q27R3R7J528J527j993j990K303K302
-2915c0886j45j42k526k526k403k403r72r73K098K097K098K098K097K098k87k87N18N18j867
$$ y = [-34027, -32886, -32633, -32380, -28788, -25193, -25714, -26236, -29142, -32044, -36456, -40867, -41940, -43009, -40983, -38956, -38360, -37760, -37574, -37387, -34816, -32242, -32711, -33181, -35081, -36977, -40308, -43639, -41724, -39805, -38069, -36333, -36027, -35718, -34224, -32730, -34574, -36415, -35070, -33725, -33810, -33892, -34068, -34243, -34418, -34589, -32827, -31065, -29302, -27536, -28833, -30129, -31426, -32719, -32555, -32391, -32227, -32059, -32119, -32179, -29854, -27525, -27465, -27406, -27346, -27283, -27790, -28293, -30230, -32164, -32700, -33233, -33769, -34302, -34943, -35580, -36221, -36858, -37201, -37540, -39313, -41083, -38121, -35155, -34578, -33997, -31989, -29977, -30353, -30725, -30073, -29418, -30196, -30971, -31929, -32883, -33840, -34794, -33993, -33192, -32391, -31586, -30994, -30401, -29809, -29213, -29872, -30532, -30714, -28032, -23565, -23866, -25599, -27328, -27592, -27857, -28121, -28386, -29097, -29809, -30997, -29325, -26683, -28810, -30461, -32111, -31228, -30345, -30893, -31441, -32272, -33099, -33926, -34753, -34660, -34563, -33035, -31508, -33501, -35491, -33188, -30886, -31031, -31173, -33699, -36225, -38628, -41031, -42003, -42976, -40878, -38781, -36683, -34585, -32488, -30390, -30677, -30964, -30446, -29928, -31795]
-2896c1795j866k519k515j34j31P5P8P5P8r84r79k415k410J311J315j19j15p08p05P23P27
-2875d3013n29n26R02R05p19p15P12P15j077j073L54L58O00O03q31q27O90O93O89O93J431
-2854c9965J434j908j904o25o23o26o22l35l32l35l32R77R79R77R79q12q08q13q08J453J457
-2833d2592r32r27N10N14J941J945K13K16j871j870l09M463J956r01m88m85k094k094J133
-2814d1672J136k205k202M17M21M21M21J207J211J207J211J297J300k038k038P30P31P30P30
-2795c6985J476J475k817k816N21N22j863j863P60P60K191K191N92N92K024K023q68q69q68
-2776c3822q68R13R13j472j471J538J539q46q45l071l070K176K176j520j520j520j517k60
-2758d2547k61k61k61K46K46K46K49n03n02R27l841j069J792K269K272j412j412J927J926
$$ y = [-31795, -33661, -36180, -38695, -38829, -38960, -38885, -38807, -38732, -38654, -39638, -40617, -43032, -45442, -44131, -42816, -42935, -43050, -43758, -44463, -43740, -43013, -43542, -44068, -43166, -42261, -42980, -43695, -42983, -42268, -43345, -44418, -44064, -43706, -43106, -42503, -43334, -44161, -43471, -42778, -42089, -41396, -39965, -38531, -40439, -42343, -42968, -43591, -44217, -44839, -45174, -45506, -45841, -46173, -45196, -44217, -43240, -42261, -43073, -43881, -44694, -45502, -44049, -42592, -43524, -44451, -43941, -43427, -41486, -39541, -39328, -39112, -40983, -42853, -43162, -38699, -36743, -37644, -38132, -38617, -40711, -42805, -41672, -40536, -42741, -44943, -44526, -44105, -43684, -43263, -42056, -40845, -39638, -38427, -37130, -35830, -37868, -39906, -39176, -38445, -37715, -36985, -35509, -34034, -36851, -39667, -39146, -38624, -40487, -42350, -41590, -40830, -38639, -36448, -35856, -35264, -33240, -31217, -32085, -32954, -33822, -34690, -33777, -32864, -34336, -35807, -34269, -32730, -33576, -34421, -37492, -40562, -38386, -36210, -37730, -39250, -40770, -42287, -42547, -42808, -43069, -43330, -43084, -42838, -42592, -42343, -42846, -43348, -42421, -46262, -47331, -45539, -43270, -40998, -42410, -43822, -41895, -39969]
-2739c9969r65r65M66M69r09r09r09r06J774J777L43L46K295K296K295K298k98k94k98k94
-2719c2357o78o79o78o74J56J61k228k225j781j781l50l46j602j599L644L648K209K209P79
-2700c4172P79j695j696l126l126N18N18N18N18J770J770o15o15m25m24m25m25j080j081j080
-2680d3594j081K459K459P5P4J058J058l72l73K038K042l208l204p94p90p89p90K425K429
-2661c8878R95R99n55n52n51n52j371j367J013J017L0L4L3L4p45p42p45p41K176K179P49P49
-2639c6791R39R42K370K373L801L804M62M65%Mk384k381j133j129k563k560o40o38J744J747
-2619c1568M62M66M62M66o15o11l76o096n771m5k86k84o3o3K321K321r28r27r28r28J19J20
-2597d2752j312j311J132J133k98k98j12j12j11j12O7O7J498J497j155j155j155j155j035
$$ y = [-39969, -40934, -41899, -41433, -40964, -41873, -42782, -43691, -44597, -42823, -41046, -40703, -40357, -38062, -35766, -33471, -31173, -31471, -31765, -32063, -32357, -33035, -33714, -34392, -35066, -34910, -34749, -36977, -39202, -40983, -42764, -43114, -43460, -45062, -46661, -43017, -39369, -37160, -34951, -34172, -33393, -35088, -36784, -39910, -43036, -42518, -42000, -41482, -40964, -39194, -37424, -38039, -38654, -39079, -39503, -39928, -40353, -41433, -42514, -43594, -44675, -42216, -39757, -39682, -39608, -38550, -37492, -37864, -38237, -36199, -34157, -37365, -40569, -41363, -42153, -42942, -43732, -41307, -38878, -37883, -36884, -37439, -37991, -38542, -39094, -40465, -41832, -40819, -39802, -39772, -39738, -39705, -39671, -40416, -41158, -41903, -42644, -40468, -38289, -37540, -36791, -35852, -34910, -32540, -30167, -26366, -22562, -22100, -21635, -21635, -21631, -24015, -26396, -27529, -28658, -31221, -33781, -34421, -35059, -33315, -31568, -31106, -30640, -30178, -29712, -30327, -30938, -31314, -37410, -43181, -43226, -43512, -43796, -43859, -43922, -41601, -39280, -40208, -41135, -42063, -42991, -42872, -42752, -44064, -45375, -44243, -43110, -43408, -43706, -43818, -43930, -44041, -44153, -44086, -44019, -42521, -41024, -42179, -43334, -44489, -45644, -46679]
-2578d6679j036L95L95n07n03n07n03m77m73K862K865J803J807j535j531p60p57p60p56M58
-2558d6199M62M59M62K813K816J382J386k298k295k299k295j554j550j554j550m21m21m21
-2540e3077m17Q01Q01K232K235N18N18N18N22q83q83N47N52o30o29k061k056K917K917K917
-2520d2641K921j255j256k686k683Q61Q61Q60Q65n6n2n2n3j546j542j12j12r20r17k347k347
-2499e4209n93n88n89n89K441K444q94q94K34K39K623K623n00m95m96m95m40m36m36m36K169
-2478d9317K172k124k120p82p79J602J606Q6Q9J636l130k716K057O81k175J360J363J181J185
-2459d8125M36M40M36M39J092J095j293j289l09l06J122J125J233J237j151j147p05p00p04
-2440d7074p01L09L13J740J744k87k83k87k83n10n07k895k891J546J550q38q35j509j505J829
$$ y = [-46679, -47715, -47320, -46925, -47432, -47935, -48442, -48945, -49422, -49895, -47033, -44168, -42365, -40558, -42093, -43624, -44384, -45141, -45901, -46657, -46199, -45737, -45278, -44816, -42003, -39187, -37805, -36419, -38717, -41012, -43311, -45606, -47160, -48710, -50264, -51814, -52235, -52656, -53077, -53494, -52693, -51892, -49660, -47425, -46907, -46389, -45871, -45349, -46232, -47115, -46568, -46016, -46646, -47275, -49336, -51392, -48475, -45558, -42641, -39720, -40975, -42231, -44917, -47600, -46739, -45878, -45018, -44153, -44209, -44261, -44313, -44366, -45912, -47454, -47566, -47678, -48598, -49515, -51862, -54209, -54802, -55390, -55979, -56568, -54127, -51683, -52577, -53471, -53237, -52998, -50375, -47752, -48252, -48747, -49243, -49738, -50178, -50614, -51050, -51486, -49317, -47145, -49269, -51389, -52171, -52950, -51348, -49742, -49656, -49567, -47931, -51061, -53777, -51720, -51039, -53214, -51854, -50491, -49310, -48125, -47689, -47249, -46813, -46374, -45282, -44187, -45480, -46769, -47078, -47384, -46262, -45137, -43904, -42667, -43818, -44965, -45670, -46370, -47074, -47775, -47466, -47153, -45413, -43669, -43956, -44239, -44526, -44809, -45319, -45826, -48721, -51612, -50066, -48516, -49354, -50189, -51698, -53203, -51374]
-2420e1374J833J919J923J918J923p01p00l085l081j625j624j94j90n07n06R24R27j967j967
-2401e6154M17M21J94J94J93J98J64J64j267j263m32m32R98J002J982J983J982J986r32r28
-2381d9530N03N03N59N63N62N63K273K276j062j061j513j509Q75Q76j274j271J61J60J229
-2362d6117J233j97j97l80l77J055J054K124K127l118l119j051j046L80L83N59N63N59N62
-2343d5003r54r50r53r51K564K567J79J82k23k20j654j651r98r95r99r94N2N6N2N6J781J784
-2321d7272N29N33q38K023J844J844J755J755L543O82m221j360J90J90k87k87k969J799j609
-2302d2156j610J19J20q65q64l905j043R31R32J289j572n89n89J617J617o26o25R83j878K09
-2282d8505K09J639j222Q27Q27j080j081L242j528j229j230j203j204K27K28K015K016J837
$$ y = [-51374, -49541, -47622, -45699, -43781, -41858, -42559, -43259, -46344, -49425, -51050, -52674, -52868, -53058, -53565, -54071, -53147, -52220, -54187, -56154, -55737, -55316, -55122, -54928, -54735, -54537, -54373, -54209, -55476, -56739, -57171, -57603, -56605, -55603, -53621, -51638, -49656, -47670, -48602, -49530, -49027, -48524, -47965, -47402, -46840, -46277, -44004, -41728, -42790, -43851, -45364, -46873, -45998, -45122, -46396, -47667, -47506, -47346, -46117, -44884, -45081, -45278, -45658, -46035, -44980, -43926, -41802, -39675, -42793, -45912, -46963, -48009, -47629, -47246, -46687, -46124, -45565, -45003, -45957, -46907, -47860, -48811, -46247, -43680, -43501, -43319, -43542, -43762, -45416, -47067, -48065, -49060, -50059, -51053, -51001, -50945, -50893, -50837, -49056, -47272, -46743, -46210, -47048, -45025, -43181, -41337, -39582, -37827, -34284, -33602, -37823, -39183, -38993, -38803, -39090, -39377, -42346, -40547, -42156, -43766, -43647, -43527, -44392, -45256, -49161, -50204, -49273, -48341, -47052, -48624, -49213, -49802, -48185, -46568, -47194, -47819, -46836, -48714, -48505, -48296, -46657, -47879, -47052, -46225, -47305, -48386, -45144, -46672, -47901, -49131, -50334, -51538, -51311, -51083, -49068, -47052, -45215]
-2264d5215J837J911r50M81M80J83k679L61L62j088j084J296J300j743j740j744j740j818
-2246e1590j814j819j814l28l24J222M087m73l331MK869M594J736J82J87r80r76J404J409
-2227d5755m676m672j040J826N611N615j360j360L35L39N18N18k198O67L170j598k228k224
-2209d8512l17l17j509m366N81N81j68j64j64j63J672J677p08p08J256J259J438j423j23j23
-2189e0301l02k98J397J398J397J401r65r65r65r61j085j084J300J304j404j405R80R80L54
-2170d9224L54L54L54j353j352J986J986J8J9J8J9j718j717k850k847m251N18K008q49j860
-2150f0387J003K552K556l618l618k79k76Q09Q12Q08Q13J046J051j337j334J151J155J151
-2132e5942J155J360J364L744L748p71p71k202k198p42p41M504M509q76q75j055j051J509
$$ y = [-45215, -43378, -41467, -42417, -41936, -41456, -41273, -43952, -43591, -43229, -44317, -45401, -44105, -42805, -44548, -46288, -48032, -49772, -51590, -53404, -55223, -57037, -57365, -57689, -56467, -52380, -52853, -56184, -56180, -53311, -48717, -46981, -46799, -46612, -47592, -48568, -47164, -45755, -50431, -55103, -56143, -54317, -48706, -43091, -44451, -45811, -45476, -45137, -44619, -44101, -46299, -45632, -42462, -44060, -46288, -48512, -48829, -49146, -50655, -55021, -54440, -53859, -54027, -54191, -54355, -54518, -52846, -51169, -51877, -52585, -51329, -50070, -48632, -50055, -50178, -50301, -50603, -50901, -49504, -48106, -46709, -45308, -46273, -47238, -48203, -49164, -50249, -51333, -50033, -48729, -50133, -51538, -50558, -49578, -49224, -48870, -48516, -48162, -49515, -50867, -48881, -46895, -46877, -46858, -46840, -46821, -48539, -50256, -53106, -55953, -60204, -59686, -57678, -58527, -60387, -59384, -56832, -54276, -57894, -61512, -61791, -62067, -61258, -60446, -59638, -58825, -57779, -56728, -58065, -59399, -58248, -57093, -55942, -54787, -53427, -52063, -48319, -44571, -45342, -46113, -48315, -50513, -51255, -51996, -47492, -42983, -43859, -44734, -45789, -46840, -45331]
-2114d5331j352n108J572J461j401q05K060k533L28J579l185k742k743J252J256J788J789
-2097e2115j550j546q05q05q05q01L040L041j252j248j416j416J5J9R98R99R98J002L123L122
-2077d7402k16k13J12J12j319j315m25m25j855j852K61K61K61K64L074L074O89O89j695j695
-2057d9615j696j695r87r87K351K351M73M73K94K95J576j286j464J397j822m683P41L603n77
-2038e1258n78J032J032j144j143j144j144J006J010M13k448p52K112J576J576K318n41K95
-2020d7782k567k452k448P12P12k478k474p45K116j345j341m024j163J278M143K892L0L53
-2002e6583L58j79K683N74k284J293j569j721J144P86P86M10M13q38q38j87K679K679j83o93
-1982e1270o89j047j047J960q98P12P11j646j643k13k12j111j106K232K231l72l73j93j94
$$ y = [-45331, -46683, -51791, -50219, -48758, -50159, -50964, -48904, -51437, -51109, -49530, -52715, -55457, -58200, -56948, -55692, -53904, -52115, -53665, -55211, -56016, -56821, -57626, -58427, -55387, -52346, -53598, -54846, -56262, -57678, -57663, -57644, -56646, -55647, -54649, -53647, -50524, -47402, -47618, -47831, -47719, -47607, -48926, -50241, -50666, -51091, -52946, -54798, -54537, -54276, -54015, -53751, -50677, -47603, -46914, -46225, -47920, -49615, -51311, -53006, -53993, -54980, -52629, -50278, -49805, -49332, -49038, -48743, -47167, -48453, -49917, -48520, -50342, -55025, -54284, -50681, -51258, -51836, -50804, -49772, -50916, -52059, -53203, -54347, -53341, -52331, -51918, -54366, -55118, -53006, -51430, -49854, -47536, -48077, -47782, -50349, -52801, -55249, -54537, -53825, -56303, -58777, -59522, -57406, -58751, -60092, -64116, -65279, -64001, -59858, -56966, -56936, -56583, -56225, -56404, -53721, -53147, -55431, -54138, -55707, -57428, -56284, -55498, -54712, -54302, -53889, -54727, -55565, -55752, -53073, -50394, -50577, -51270, -51959, -53006, -54053, -52093, -52991, -52279, -51568, -53214, -54857, -55070, -55282, -56393, -57499, -55267, -53036, -53408, -53781, -53974, -54168]
-1963e4168k757J04p4p5J520J520L309M47n37K325J967J968k180k180k358N03N92N93P71P71
-1943d7939K95K94O52k209m922k061n10n10q01p98J584J587m43m40j874j871q01p97O30O33
-1923f0301J464J468L4L7j010j006M21M25K627K630p11p08J464J468L4L7R57R62k381k377
-1903e4466p98p93p98p93q27q24O04O07o78o74J706J710J647J651p38p34O89O93j695j691
-1883e6202n03n00n03m99k6k2k6k3j75j71j75j72K094K094k91k87J319J319J319J323k392
-1862e2499k392j081L693L062j706j110j107J23J23J256J259K299k470K12K16k515k515j30
-1844e5282j27K075K076O44O48J12J16J15J16k005k000k001k001P38P41P42P41J155J159k72
-1824e2510M497K828l0n07n07k954k951k653k652k731K041o41o40r43r39r39r39J096J099
$$ y = [-54168, -56925, -56821, -56895, -56970, -55450, -53930, -50621, -50174, -50711, -48386, -46419, -44451, -46631, -48811, -51169, -50666, -50074, -49481, -48710, -47939, -47644, -47350, -46698, -48907, -53829, -55890, -56400, -56910, -57711, -58509, -56925, -55338, -55781, -56221, -58095, -59966, -60767, -61564, -60934, -60301, -58837, -57369, -57335, -57298, -58308, -59314, -58893, -58468, -55841, -53211, -53922, -54630, -53166, -51698, -51664, -51627, -50670, -49708, -52089, -54466, -55264, -56057, -56855, -57648, -58475, -59299, -58695, -58088, -58766, -59440, -57734, -56024, -54377, -52726, -53464, -54198, -53509, -52816, -54511, -56202, -56705, -57205, -57708, -58207, -58233, -58255, -58281, -58304, -58479, -58650, -58825, -58997, -56903, -54809, -55100, -55387, -54068, -52749, -51430, -50107, -52499, -54891, -55972, -52279, -49217, -50923, -52033, -53140, -53017, -52894, -51638, -50379, -48080, -50550, -50338, -50122, -52637, -55152, -55282, -55409, -53334, -51258, -50614, -49966, -49854, -49738, -49623, -49507, -51512, -53512, -55513, -57514, -56776, -56035, -55293, -54552, -53397, -52238, -52510, -48013, -45185, -45215, -45722, -46229, -49183, -52134, -54787, -57439, -60170, -58129, -58770, -59410, -60353, -61292, -62231, -63170, -62074, -60975]
-1805f0975J095J099N2N6N2N6Q72Q76m40l297l063L618J289j569K027K027n36n37J133J132
-1785e5033k026k027K034M896L107L107n29l390j602j602l063k01L435j334j423J438j71j72
-1767e4556m32M337M516k54m247j386l115l115k004Q60p52p49J125J129K735j23j900j897
-1749e9828J87M959K332k433k615k612o04K258O48O52K01K02j588J278J737j126M85M88j12
-1730e5491k973j364J502j919R43J896J900j948j949J092j766p86p87r65r61J98J97J98K01
-1711f2782L61L62L61L65p12p11p12p08Q98Q98Q98R02q61q61k470L95O82O82o90M084N391
-1690e4228O22j643j639k57k57k046Q20L081K20j986Q80r73r72p94p94k254k254k254k254
-1671f8982J293J293J293J292p34p34p34p34J126J125J125J125N29N29N29N30K01K01K01K01
$$ y = [-60975, -59880, -58781, -58729, -58673, -58621, -58565, -57693, -56817, -57257, -60554, -63617, -59999, -58710, -60279, -58252, -56225, -56761, -57298, -56165, -55033, -57059, -59086, -57052, -52156, -49049, -45942, -46471, -49861, -51463, -53065, -56128, -56329, -52894, -54228, -55651, -54213, -54384, -54556, -54988, -50651, -46135, -46389, -50636, -52022, -55137, -58252, -60256, -59396, -60148, -60897, -59772, -58643, -55908, -56031, -57931, -59828, -59641, -54682, -52350, -54783, -57398, -60010, -60614, -58356, -57708, -57056, -56855, -56653, -58241, -56963, -55226, -56352, -55867, -55379, -55491, -58464, -59828, -58326, -60245, -59302, -57406, -55506, -57454, -59403, -58311, -60077, -60863, -61650, -62615, -63576, -63378, -63181, -62983, -62782, -62421, -62059, -61698, -61333, -62045, -62756, -63468, -64176, -63278, -62380, -61482, -60580, -61441, -62302, -64772, -64377, -63695, -63013, -63703, -59619, -54228, -53606, -55249, -56888, -57145, -57402, -59448, -58628, -55547, -55327, -57313, -56433, -57406, -58378, -59172, -59966, -62220, -64474, -66728, -68982, -67689, -66396, -65103, -63811, -64545, -65279, -66013, -66747, -65621, -64496, -63371, -62246, -61717, -61188, -60659, -60129, -59928, -59727, -59526, -59325]
-1651e9325K467K466K467K466Q87Q90Q91Q90j706j703j702j703k243k239K053M914L510j256
-1633d7976j732j733J364J367j017l879k779J993P42k120K064K068j450j449K094K097k194
-1616e2540k195p56p56l141l141j293j293K046K045o74o74J710J710j509j509p8p9K735K735
-1597e6657o04o03j677j676L569L569m25m24j856j855j379j378k46k46N40m225p71K094J285
-1578f2965J289L4L7r3q9r4q9J367J371J368J371PJ2PJ1l50l47l50l46j044j039j043j040
-1555f2015r24r20J461J464Q12Q16o15o15J677J680p04p04K91K94K94K95l078l074K172K173
-1535e9220K820K824j468j468M36M40M39M40J964J967J967J967j732j729j729j729j576j572
-1517e6959j572j572K12K16K16K16Q91Q94Q94Q94j404j401j401j401j267j263K075K076j148
$$ y = [-59325, -56858, -54392, -51925, -49459, -48572, -47682, -46791, -45901, -47607, -49310, -51012, -52715, -54958, -57197, -55144, -50230, -46720, -47976, -49708, -51441, -50077, -48710, -49727, -53606, -56385, -54392, -53650, -55770, -53706, -51638, -53088, -54537, -52443, -50346, -52540, -54735, -55491, -56247, -59388, -62529, -63822, -65115, -63069, -61024, -61698, -62372, -60662, -58952, -60461, -61970, -62048, -62127, -59392, -56657, -57261, -57864, -59541, -61217, -57648, -54079, -54504, -54928, -56784, -58639, -60018, -61396, -61642, -61888, -61348, -65573, -66344, -64250, -62965, -61676, -61642, -61605, -61698, -61787, -61881, -61970, -60603, -59232, -57864, -56493, -56486, -56474, -56467, -56456, -56806, -57153, -57503, -57849, -58893, -59932, -60975, -62015, -62939, -63859, -62398, -60934, -60122, -59306, -59921, -60536, -58859, -57179, -57883, -58587, -58296, -58002, -57708, -57413, -60491, -63565, -61393, -59220, -56400, -53576, -55044, -56512, -56076, -55636, -55197, -54757, -52793, -50826, -48859, -46892, -48624, -50353, -52082, -53811, -55387, -56959, -58531, -60103, -59891, -59675, -59459, -59243, -58352, -57458, -56564, -55670, -57074, -58475, -59876, -61277, -62544, -63807, -61732, -59656, -60804]
-1498f0804j144J241J241J013J017J017J018Q04Q09j755j755M77k381k202K567J193j666k798
-1480f2108O3K184K187j9j8J825J830n56n55K780K783L99L98n089n086p94p93Q57Q60L246
-1460e5606L245k46k42j673j673r46r47r46r46N44N43N44N44L272L271l65l65M225n44j319
-1440d9630m181j374J486l02l01K559K560j733j732r13r13r13r12j211j211j211j211k448
-1422f3591k444K500K504J576l189m445K235K187o70J352J356O67O71O67O70R58R61K388K392
-1403e1255j188j185j189j184k351k348R88R91M51M54j933j930Q34Q38Q39Q38P75P79P78P79
-1383e5219r69r65M66M66J982J986j353j352K217K220j64j64J234J237j148j147j286j281
-1365e3240j282j282j941j937j938j937K120K123k64k61q6q2q5q2L983L986j263j259k068
$$ y = [-60804, -61948, -60707, -59466, -58453, -57436, -56419, -55401, -54597, -53788, -55543, -57298, -56821, -59202, -61404, -58837, -57644, -59310, -62108, -62045, -59861, -57674, -57693, -57711, -55886, -54056, -54612, -55167, -52387, -49604, -49205, -48807, -53896, -58982, -59776, -60569, -59712, -58852, -55606, -52361, -52607, -52849, -54522, -56195, -57141, -58088, -59034, -59980, -59436, -58893, -58349, -57805, -54533, -51262, -51627, -51992, -47767, -48311, -49630, -53811, -55185, -53699, -54001, -54302, -51743, -49183, -50916, -52648, -53561, -54474, -55387, -56299, -57510, -58721, -59932, -61143, -63591, -66035, -63535, -61031, -59455, -62644, -67089, -64854, -62667, -63337, -61985, -60629, -59962, -59291, -58624, -57954, -56996, -56035, -53647, -51255, -52443, -53628, -54817, -56001, -58352, -60700, -59712, -58721, -58270, -57816, -59749, -61679, -60845, -60007, -59168, -58330, -57555, -56776, -55998, -55219, -56188, -57153, -56687, -56221, -54239, -52253, -53606, -54958, -52741, -50521, -50685, -50849, -49615, -48378, -49526, -50673, -51959, -53240, -54522, -55804, -57745, -59682, -61620, -63557, -61437, -59314, -59578, -59839, -59925, -60007, -60092, -60174, -56191, -52205, -53468, -54727, -56795]
-1346e6795k064L17L20k135k131L111L115J144J147J144J148j114j111j114j110r65r61r65
-1328e9019r61J039J040L125L130L156j613l62l57q46q46k276k273j90j90J241J244N07N06
-1309e3945r24r20N66N67N66N70Q57Q57Q57Q61K60K61r91r87k497L66R61R61P23k139R02R02
-1287e1366l547l547k09k09m47m47J163J162k485L76J986q75N85L446Q83j978j211j211j390
-1268e9321j390J532J531J352J353P34k128q75J986K194o67j263j263M44M43l730q68J099
-1250e8837j762J457J457k277k276K015K016l39l39J867J866Q76j986l76l77r13r12k344k343
-1231f3527J64J67j5j1J356j501J04J08K645K650K60K65J125J129k213k210J427J431l819
-1212f0465l815j524j520r3r0R73R76J151J155j114J751K523K526n48n44n47n44R42R47j442
$$ y = [-56795, -58859, -58542, -58222, -60357, -62488, -59377, -56262, -55118, -53971, -52827, -51679, -52793, -53904, -55018, -56128, -57093, -58054, -59019, -59980, -58941, -57901, -54776, -51646, -48490, -50103, -50465, -50822, -51668, -52514, -54790, -57063, -57253, -57443, -56202, -54958, -54451, -53945, -54869, -55789, -55223, -54656, -54090, -53520, -52663, -51806, -50949, -50088, -49828, -49567, -50558, -51545, -54042, -53676, -52715, -51754, -51031, -53170, -52268, -51366, -54913, -58460, -58669, -58878, -59325, -59772, -58609, -57447, -59932, -59556, -57570, -58445, -57860, -54414, -53531, -55509, -56720, -57931, -59321, -60711, -59179, -57648, -56296, -54943, -54209, -56337, -57212, -55226, -53032, -53699, -54962, -56225, -55781, -55338, -59068, -59936, -58837, -60599, -59142, -57685, -59962, -62238, -60223, -58207, -58546, -58885, -57018, -55152, -54276, -56262, -56638, -57015, -57928, -58840, -61184, -63527, -63363, -63196, -63211, -63222, -61866, -63367, -63263, -63155, -60510, -57860, -57600, -57335, -56210, -55081, -57294, -59504, -58077, -56646, -60465, -64280, -65804, -67324, -67417, -67507, -66534, -65558, -64407, -63252, -64366, -62615, -60092, -57566, -58114, -58658, -59205, -59749, -58807, -57860, -59302]
-1192e9302j439q5q2k65k61K269n88j368j363K850K854j263j259l678q12q16q12P1K936K932
-1172e9481P4M88M92L09L13J889J893m95m92j420j416j419j416M29M32M28M32M29M32M29M32
-1151e7238n78n77n78n77O74O74j710j710R43R42m88m88j769j770O15O14k90k91k91k86K093
-1130f2086K094j244j241r09r09r09r05o71o71J714J718J661J666J665J666o7o4L275L275
-1111e0942j56j53j53j52j290j285J099J099j289j289j289j286k570k571J721J725J744J744
-1093e5293L13L16j743j744O41O44j132j133j133j129J759J759k534k530J833J833k459k455
-1075f4187p30p30K608K611j11j08K276K277k61k57k642k642J230J233J233J234l21l16l17
-1056e7920l17K035K038O07O07o18o15o15o15j41j38j38j38k764k761N77N78J617J617J86
$$ y = [-59302, -60741, -60826, -60908, -61173, -61434, -59165, -59753, -61121, -62484, -59634, -56780, -58043, -59302, -62980, -63792, -64608, -65420, -65349, -62413, -59481, -59407, -58919, -58427, -58118, -57805, -55916, -54023, -54518, -55010, -56430, -57846, -59265, -60681, -60252, -59820, -59392, -58960, -58531, -58099, -57670, -57238, -57816, -58393, -58971, -59548, -58874, -58200, -59910, -61620, -60677, -59735, -60223, -60711, -62480, -64250, -63635, -63021, -63311, -63602, -63893, -64179, -62086, -59992, -61236, -62477, -63386, -64295, -65204, -66109, -66780, -67451, -65737, -64019, -62358, -60692, -59027, -57361, -57428, -57492, -54217, -50942, -51098, -51251, -51404, -51556, -52846, -54131, -53032, -51933, -53222, -54511, -55800, -57086, -59656, -62227, -60506, -58781, -57037, -55293, -54980, -54664, -56407, -58151, -57510, -56866, -57998, -59131, -60264, -61393, -59634, -57875, -60409, -62939, -61106, -59273, -61732, -64187, -64917, -65647, -63039, -60428, -60539, -60647, -58371, -56094, -56355, -56612, -59254, -61896, -60666, -59433, -58200, -56966, -57287, -57603, -57920, -58237, -56202, -54164, -53557, -52950, -53568, -54183, -54798, -55413, -55554, -55692, -55830, -55968, -58732, -61493, -60916, -60338, -58721, -57104, -56918]
-1036e6918M959j125l987M85M88n2K809J557j300k645K16J766J770N44N43N44N48k2k3J57
-1016d9686k701j021j021k630k627K01K01K01K05j121j118L13L13J323J326J327J326Q01Q05
-997e3583k534k533j167j162r84r83j789J077Q98Q98n66n63n62n63r24r20k530L31K474K478
-977f3207K72K72R3R7O93L554L581P23q27q28j128j126j304j304J166j691j513j512J531J535
-957f0923p5p4J024j833j833J029K112K116Q65Q64q38q35j013J848J375J378L02L06j666J200
-937e4671j844j841j144j140K195K198J688J691J688J691O41O41Q20k042l43l43r98l860k697
-918e7670K071L204L43k24k23j833j833R83R84R84R87q9r0q9q6J863J863m337m333m03m02
-897e8330m02l99j725j721k91k91n5n3k913J855K530l28J49J49J725J729K98K98k138k135
$$ y = [-56918, -51959, -53084, -57071, -56586, -56098, -56150, -53341, -51784, -53084, -55729, -55513, -53747, -51977, -51433, -50890, -50346, -49798, -49820, -49843, -49686, -52387, -53408, -54429, -57059, -59686, -59485, -59284, -59083, -58878, -59999, -61117, -60804, -60491, -59168, -57842, -56515, -55189, -54388, -53583, -56117, -58650, -59817, -60979, -61963, -62946, -64735, -63658, -62760, -61862, -62428, -62991, -63553, -64116, -65040, -65960, -68490, -68159, -65685, -63207, -62935, -62663, -62570, -62473, -61780, -58226, -54645, -53922, -54749, -55577, -56705, -57831, -59135, -60439, -59273, -60964, -62477, -63989, -62458, -60923, -60998, -61072, -60048, -61881, -63714, -62685, -60573, -58457, -57592, -56728, -57566, -58401, -59414, -57566, -56191, -54813, -54511, -54205, -55871, -54671, -56515, -58356, -59500, -60640, -58445, -56247, -54559, -52868, -51180, -49489, -48848, -48207, -47387, -49429, -49772, -50115, -51113, -54973, -57670, -55599, -52395, -52052, -52276, -52499, -54332, -56165, -55182, -54198, -53214, -52227, -52316, -52406, -52495, -52581, -50718, -48855, -53192, -57525, -57928, -58330, -58732, -59131, -60856, -62577, -62868, -63159, -63214, -63267, -66180, -64325, -61795, -62123, -61974, -61825, -60100, -58371, -58073, -57775, -59913, -62048]
-877f2048k433K336N74N77Q76Q75m02l99J032J032m32m28J956J956j196j193K39K38L54L58
-857e6128L338j430l722J050j930j930k053k049L36L35p04p05P27P30R65R65m65m62n71n70
-837f4273Q61Q64j52j53J278J282l43l43J088J092K23K24K23K28Q56Q57j527j524P67P68j617
-816e9321j613k854k850M84M88J438J442r46r43J774J777o11o08j445j442J893J896K68K72
-797f0901k116k113L0L4K414K418j334j330k764k761j125j122J260J263p5p4p5p4m33m32m32
-776f9742m32J624J625L055L055J356J356m32K429N67k295n07n07M17M18j192J669N21N22
-757e6493j684j684M4M5M5M5K038K038j301j296R95R94K20k638k090k090q38q35j464j464
-737f7413K827K832J60J60J61J64J024J025J024J029M43M43M44M47j047j047L84L87K497K500
$$ y = [-62048, -64481, -62145, -61571, -60994, -60118, -59243, -59645, -60044, -59012, -57980, -58412, -58840, -56884, -54928, -56124, -57317, -57078, -56840, -56486, -56128, -52790, -54220, -57942, -56892, -58822, -60752, -62805, -64854, -64518, -64183, -64887, -65592, -64865, -64135, -63170, -62205, -62670, -63132, -63703, -64273, -63412, -62548, -62700, -62853, -61575, -60293, -60636, -60979, -59891, -58799, -58576, -58352, -58129, -57901, -57045, -56188, -57715, -59239, -58472, -57704, -59321, -60934, -63788, -66638, -66154, -65666, -64228, -62786, -63732, -64675, -62901, -61124, -61735, -62343, -63788, -65230, -63337, -61441, -61173, -60901, -63017, -65130, -65100, -65066, -62652, -60234, -61568, -62898, -65662, -68423, -69548, -70670, -69410, -68147, -68222, -68296, -68371, -68445, -68878, -69310, -69742, -70174, -68550, -66925, -63870, -60815, -59459, -58103, -58535, -56106, -55539, -57834, -58341, -58848, -58431, -58013, -59205, -57536, -57015, -56493, -58177, -59861, -59817, -59772, -59727, -59682, -57644, -55606, -56907, -58203, -57208, -56214, -55994, -58632, -60722, -62812, -63650, -64485, -65949, -67413, -64586, -61754, -61594, -61434, -61273, -61109, -60085, -59060, -58036, -57007, -56564, -56121, -55677, -55230, -56277, -57324, -56940, -56553, -54056, -51556]
-717e1556j137l998j944j942k120k120R7J01K306K306Q72j986j97j97J155M020K6K6k094k090
-697f0472o60K202K705k060l193l32J096J099j107j106k09k05J401J405k534L32L845R87k563
-678e9369L01J550j307r84r80q64q61J002N772J777k992m840p1o67o67j024j025q45q46l39
-658f7279K522L297L298n41n40k924k922k42k42L096L100M1M1m36l293l000J770J293J296
-639f1665K691K693L09L10K75K80K187o74m300M73R50R50J871J874J874J874p79p75p78p75
-619e1135j614j609L632L637L215L219O077J0850J4482J9254K6047L2727L0388J6080m426
-604A10824k6364l3517l0656k6482j5991j0171p310k601k601o058O19J810j050Q08Q12p97
-588d8725p97q01p98J588J587k299k295K951K951R80R83j401j401j047j047L84L88k836k835
$$ y = [-51556, -52693, -56691, -58635, -60577, -62697, -64817, -64720, -64619, -62313, -60007, -59135, -61121, -61318, -61515, -60360, -56340, -56314, -56288, -58382, -60472, -61132, -58930, -56225, -58285, -61478, -61810, -60714, -59615, -60722, -61828, -62037, -62242, -60841, -59436, -61970, -61638, -57793, -56806, -59369, -59068, -57518, -58825, -59809, -60789, -61653, -62514, -61512, -55740, -53963, -56955, -61795, -61866, -62533, -63200, -64224, -65249, -66094, -66940, -67279, -64757, -61460, -58162, -58703, -59243, -62167, -65089, -65331, -65573, -62477, -59377, -59336, -59295, -59731, -63024, -66024, -64254, -62961, -61665, -58974, -56281, -55972, -55662, -55387, -55107, -52920, -53594, -57894, -57421, -56471, -55521, -53650, -51776, -49902, -48028, -48807, -49582, -50360, -51135, -52749, -54358, -50726, -47089, -43874, -40655, -34578, -23728, -9246, 10008, 36055, 68782, 99170, 115250, 110824, 84460, 50943, 20287, -6195, -22186, -32357, -39667, -42268, -44869, -50927, -50308, -48498, -49548, -48740, -47928, -48725, -49522, -50323, -51121, -49533, -47946, -50245, -52540, -49589, -46638, -45658, -44675, -46076, -47477, -48524, -49571, -49187, -48799, -51635, -54470]
-569e4470m51m47k42k42j673j669r28r28N03N07J386J386J386J390J892J893L323L328K116
-550d1940K116Q316Q320R627R628P778P783K91o386j0737j0734r933r933n641n637j304j304
-533d9690j304j300P52P53P53P56j148j147M62k399q80q79m62K399K586k76J513J513j27j27
-513d8252j736J125j728j729j550j550j550j550j371j371j110J751J41J42L50L50J781J781
-495e6076p34p30p34p30q83q80K158p01j360j356p64K102J501J505j538J326K567k91k798
-476e8416k794k94k91k679k675R43R46L983J125k49k46J956J959k485k481r7r7j60j56J274
-456f0934J274O00O03J081j781k142K630K809n2j948j945J214J215j1qJ72J71k493L73K101
-436e7071K102o75o70o71o71l61l58n36n37J75k682j252J610L431L435K005k765l573l569
$$ y = [-54470, -54921, -55368, -55610, -55852, -57525, -59194, -60122, -61050, -60547, -60040, -58654, -57268, -55882, -54492, -52600, -50707, -47384, -44056, -41940, -39824, -31508, -23188, -13561, -3933, 3845, 11628, 11919, 5533, -5204, -15938, -25871, -35804, -41445, -47082, -48386, -49690, -50994, -52294, -51542, -50789, -50036, -49280, -50428, -51575, -51113, -53512, -54392, -55271, -55733, -53334, -50748, -51024, -49511, -47998, -48125, -48252, -49988, -48863, -50591, -52320, -53870, -55420, -56970, -58520, -59891, -61262, -62372, -60621, -60480, -60338, -59988, -59638, -57857, -56076, -56810, -57540, -58274, -59004, -59887, -60767, -58609, -59310, -60670, -62026, -62790, -60688, -59187, -57682, -59220, -57894, -55327, -55618, -58416, -61210, -61504, -61795, -64474, -67149, -66206, -65260, -61277, -60152, -60401, -60647, -58691, -56732, -59217, -61698, -61795, -61892, -62052, -62208, -60934, -59660, -59060, -58457, -57376, -59157, -61299, -58669, -55860, -55912, -57860, -59805, -58591, -57376, -57387, -57395, -57223, -57052, -59545, -59172, -57071, -54969, -55644, -56314, -56985, -57656, -58017, -58375, -58911, -59448, -59273, -61955, -63207, -61597, -58166, -54731, -52726, -55491, -59064, -62633]
-417f2633j483j483R43R42J122J125Q83L744j501m359p1p1k49k46j085j084j084j080J546
-398f6124J546q38q39l3l4J397J398R72R72m58m58r05r06J479J479K17K19K16K20j423j419
-377f3322j424j419q05q01o26o22j192J672K743k024j792j788K202K206L83L88L84L87J218
-358f4232J222J219J222q68q65l91K474J654l111m545K27N470K611K24K27J751J755j587j583
-339e7126k601k597j170j166j394j393J945J949J56J56J57J60K400K399K399K404M91M92k846
-320e5185k843j051j050J333J338M40M39r91r87k459k459Q79Q83R09R09R09R13J952J957k340
-300e6504k336n22n18R09R13k153k150J006J009K3k836Q2M855L547j218l0K835l28l185l011
-280e9612j45L7M1j214j211j066j062L66L68q38q38k42K623M526J666J725j133p34p34J472
$$ y = [-62633, -64116, -65599, -64656, -63714, -62592, -61467, -60584, -56840, -58341, -62700, -62771, -62842, -63091, -63337, -64422, -65506, -66590, -67670, -66124, -64578, -65416, -66255, -66288, -66322, -64925, -63527, -62555, -61583, -62041, -62499, -63404, -64310, -62831, -61352, -61135, -60916, -60700, -60480, -61903, -63322, -64746, -66165, -66970, -67771, -68397, -69019, -70211, -68539, -65796, -67820, -69612, -71400, -69198, -66992, -66609, -66221, -65837, -65450, -64232, -63010, -61791, -60569, -61437, -62302, -62693, -60219, -58565, -61676, -66221, -65994, -60524, -57913, -57689, -57462, -55711, -53956, -55543, -57126, -59727, -62324, -63494, -64660, -66054, -67447, -65502, -63553, -63397, -63241, -63084, -62924, -60524, -58125, -55726, -53322, -52831, -52339, -55185, -58028, -59079, -60129, -58796, -57458, -57018, -56579, -57570, -58557, -61016, -63475, -62596, -61713, -60804, -59895, -58986, -58073, -56121, -54164, -56504, -58840, -59362, -59880, -58971, -58058, -60211, -62361, -61355, -60346, -60323, -63159, -63077, -58222, -54675, -55893, -55923, -53088, -53416, -56601, -59612, -59757, -59720, -59679, -60893, -62104, -63170, -64232, -63866, -63498, -64336, -65174, -65416, -62793, -58267, -56601, -54876, -56009, -56743, -57477, -56005]
-260e6005J475k284k283J00J04k228k228J111J114K690K690j722m579j728J132m77m73j848
-242f5439J014J013j844k001k001K113K112M44M43j941j941k65k64k65k64K42K42j188j189
-223g0979K325K325J550j312m77m77k861k861k09K653J520l249k563K98M292J431P04P08L50
-204f6832L50K403m54o34K228M59k400o11o11J889J893o71o71L998J140m10m09k769R7J707
-184f0308j155k456M10j199j200k098P68q42q42J266J271K519K522R09j949j773j770n21n18
-165f6966n22n18J744J747L13L17J706J710J707J710J170J174J169J174j080j077J304J308
-147e1910J274J278l972l968l76l73j807j803P1P4P1P5j31j27J301J304J628J632p56p53R05
-126e6363R09k433k429k254k250q24q19J449J453K880K884j90j86k575k571O26O30O29O30
$$ y = [-56005, -54530, -56814, -59097, -58997, -58893, -61121, -63349, -62238, -61124, -58434, -55744, -57466, -62045, -63773, -62641, -63118, -63591, -65439, -64425, -63412, -65256, -67257, -69258, -67145, -65033, -64589, -64146, -66087, -68028, -68293, -68557, -68822, -69086, -68844, -68602, -69790, -70979, -68654, -66329, -64779, -66091, -66568, -67045, -69906, -72767, -72976, -70323, -68803, -72052, -74615, -74317, -70025, -68594, -67890, -67182, -66832, -66482, -64079, -64533, -65167, -62939, -62480, -64880, -65491, -66102, -64213, -62320, -62991, -63662, -59664, -58524, -58934, -59343, -62112, -62015, -60308, -61463, -63919, -63509, -64708, -65908, -68006, -67238, -68080, -68922, -67656, -66385, -63866, -61344, -60435, -62384, -64157, -65927, -66448, -66966, -67488, -68006, -66262, -64515, -64202, -63885, -62179, -60469, -58762, -57052, -55882, -54708, -53539, -52365, -53445, -54522, -53218, -51910, -50636, -49358, -53330, -57298, -57674, -58047, -59854, -61657, -61586, -61512, -61441, -61366, -61497, -61624, -60323, -59019, -57391, -55759, -56515, -57268, -56363, -55454, -57887, -60316, -62570, -64820, -65644, -66463, -65014, -63561, -60681, -57797, -57987, -58173, -60748, -63319, -62693, -62063, -61434, -60804]
-107f0804M47M51K835K836k146k143k142k142j878j874m44m43L733L737J353J352P53P56o74
-88e6437o75k60k57K127K127k645k642J651J651Q08Q09o23o18k381k381r50r46k50k49k50
-68f2391k46j233j233J97K01J804J803k489k485j94j94j93j90P15P15k623k619Q05Q05Q04
-48f8241Q09j006j006j006j006J736J737J736J736R02R01R02R02m10m10m10m10j028j028o71
-28f5271o71o095l73J655J654J892J893M62M62J625J624J625J624O37O41m311m307J442O215
-9e7577K872j892l939l934K917K921N63N66q68q64r47r42r47r42J86J90J86J90q49q46J535
11f2421J539J356J360p5p0K79K80K79K79J085J084l47l46j695j696k64k65J107J106j278j277
32e9980q65q64K474l88k38M530L100K39R39j923R39R39j982j982M02M02K54K57K53K57j237
$$ y = [-60804, -60357, -59906, -57071, -54235, -56381, -58524, -60666, -62808, -64686, -66560, -67004, -67447, -63714, -59977, -58624, -57272, -56519, -55763, -56437, -57112, -57372, -57629, -55502, -53375, -56020, -58662, -57011, -55360, -54552, -53743, -54366, -54984, -57365, -59746, -60696, -61642, -61892, -62141, -62391, -62637, -63870, -65103, -64906, -64705, -62901, -61098, -63587, -66072, -66266, -66460, -66653, -66843, -66128, -65413, -68036, -70655, -69850, -69045, -68241, -67432, -68438, -69444, -70450, -71456, -69720, -67983, -66247, -64511, -63609, -62708, -61806, -60904, -61314, -61724, -62134, -62544, -63572, -64600, -65271, -65942, -72037, -72410, -70755, -69101, -67209, -65316, -64854, -64392, -62767, -61143, -59518, -57894, -57257, -56616, -60927, -65234, -63792, -57577, -54705, -56597, -60536, -64470, -61553, -58632, -58069, -57503, -58371, -59235, -60182, -61124, -62071, -63013, -62827, -62637, -62451, -62261, -63110, -63956, -62421, -60882, -59526, -58166, -58241, -58311, -58032, -57752, -57473, -57194, -56109, -55025, -55372, -55718, -57413, -59109, -59373, -59638, -58531, -57425, -58703, -59980, -60845, -61709, -59235, -59623, -59861, -55331, -52231, -51992, -51053, -52976, -52037, -51098, -53080, -55062, -54660, -54258, -54004, -53747, -53494, -53237, -54474]
53e4474j233j237j233j818j815N66N71J102J107k236k231m9m4m9m5K247K250k045k042j032
73f3740j028L99M02J203J208k28k23K213K213K213K217R61R61R62R65k236k235J49J53r84
93e4455r84r83r80k858k858M81M84P79P79P78P83N55N55k783Q2n48n316k635K31j579j576
114g2048R83R88K831K836k415k410j140j137J245J248R76R80m55m51P23P27P23P26J707J710
134f1653J706J710p52p49p53p49L21L24L20L24J439J441J442J442L65L69L69L69q27q24q23
155e5189q23j424j419j420j419p94p90p90p90j08j04j04j05M1M5J476J475K336K340j952j953
176f1471r72r73M59M62n26n25n25n22J785J784k507k504n40n40Q90Q94P72P71P71P75o89o90
198f3621o89o85J091J092J092J095J211J211k20k16j151j152J234J233j98j97j98j97M21M21
$$ y = [-54474, -55707, -56944, -58177, -59995, -61810, -61244, -60673, -59571, -58464, -60700, -62931, -62980, -63024, -63073, -63118, -60871, -58621, -60666, -62708, -63740, -64768, -64369, -63967, -62764, -61556, -61784, -62007, -59794, -57581, -55368, -53151, -52190, -51229, -50267, -49302, -51538, -53773, -53624, -53471, -54455, -55439, -56422, -57402, -60260, -63118, -62637, -62153, -61374, -60595, -59817, -59034, -58479, -57924, -60707, -60625, -61173, -66489, -69124, -68893, -70472, -72048, -71065, -70077, -67246, -64410, -66825, -69235, -70375, -71512, -70267, -69019, -68043, -67063, -67518, -67969, -67246, -66519, -65796, -65070, -63363, -61653, -59947, -58237, -58989, -59738, -60491, -61240, -60919, -60595, -60275, -59951, -58512, -57071, -55629, -54187, -53822, -53453, -53084, -52715, -53542, -54366, -55189, -56012, -57436, -58855, -60275, -61694, -62488, -63278, -64068, -64858, -64966, -65070, -65174, -65279, -65238, -65193, -63717, -62242, -59906, -57566, -59518, -61471, -62443, -63416, -62957, -62495, -63021, -63546, -64071, -64593, -62808, -61024, -63531, -66035, -66575, -67115, -66225, -65331, -64559, -63788, -63017, -62242, -62931, -63621, -64310, -64995, -63904, -62812, -61720, -60625, -59414, -58203, -58423, -58639, -59790, -60942, -59708, -58475, -58673, -58870, -59068, -59265, -58844, -58423]
218e8423M21M21j904j904M81M80k261k262q31q30L103L104P19P19J703J702j635j636j159
237e9992j158K72K72l8l7K347K351N59N59j826j821P37P38n14n11j021J841K31K35k627k627
258f2030j196j192j852j851J486J491J90J90J978q79j807J054J472J475K545l17r13r09j151
277f2216J710j330j326J412J412r73r68Q75Q76Q75Q80j34j35j34j30p90p90k042k038m24K436
298f2954K31k626k005Q57M99N03J9K2K02K01K135N000P08k154j010j006p08K154j75m941k079
319f7127k079j00r7r7r7j00r7r7r7J874J878J878J878r4q9k772J997k46k42N2N6o04n99k512
343f7533L54K422k343N14N18O33O37j572j569k183O82J453J457K60K65J513J516L286M29l51
363e9612l46K16K20K16K20J56J60L39k522j095j092J114J114n66n63n62n63j19j16k798J971
$$ y = [-58423, -58002, -57581, -59485, -61389, -60908, -60428, -62689, -64951, -65782, -66612, -63509, -60405, -59686, -58967, -57264, -55562, -57197, -58833, -59992, -61150, -60878, -60606, -60644, -60681, -58334, -55983, -55424, -54865, -56691, -58512, -57775, -57037, -57551, -58062, -59083, -57242, -57011, -56776, -59403, -62030, -63226, -64418, -66270, -68121, -66635, -65144, -64954, -64764, -62786, -63665, -65472, -64418, -62946, -61471, -58926, -59243, -60156, -61065, -62216, -60506, -61836, -63162, -61750, -60338, -61311, -62279, -61404, -60528, -59653, -58773, -58907, -59042, -59176, -59306, -60096, -60886, -62928, -64966, -65390, -62954, -62723, -65349, -67354, -66497, -65998, -65495, -65476, -65454, -65252, -65051, -62916, -57916, -57208, -59362, -60372, -61378, -62086, -59932, -60107, -65048, -67127, -69206, -69306, -69403, -69500, -69597, -69697, -69794, -69891, -69988, -68114, -66236, -64358, -62480, -62574, -62663, -65435, -63438, -63684, -63926, -63874, -63818, -64422, -65021, -67533, -67179, -64757, -67100, -66586, -66068, -65435, -64798, -66370, -67939, -70122, -69440, -67987, -66530, -66270, -66005, -64492, -62976, -59690, -59261, -59612, -59958, -59742, -59522, -59306, -59086, -58930, -58770, -58431, -60953, -62048, -63140, -62026, -60912, -61478, -62041, -62603, -63166, -63285, -63401, -66199, -64228]
384f4228J379J382J680J681N14N18j867j867R10R12K523l39J266J271o37l499j755j751j755
403f3662j751j129J737K805j960m43m40p41p38J53J56J584J587K68K72j162j159k414k411
422f9448j460J404j713J151K936P8k370M96R09R13M795J934k359N03N6N6K35K34J286J285
442e9079j099j099M21M21J673J673J863r99q20q19r09r09N21N22q12q13o33o33r7K764K407
463e6456k362k794k795l092l093j542j542Q42Q42Q19Q20R98R99J34K996m5m5K836K835n03
483f0148n03q91q90q90q91J60J60j97K664K813m9j598j598R01R02n29n25J140J140j066j062
504f0957l956j096K362K366j661m524k138P26J770J770J948J953l47l46J263j595P1P1j718
523f4038J148K068K067K247K250J688J692J214l554m836j975n44n44N85N89q42q42p53p52
$$ y = [-64228, -62849, -61467, -59787, -58106, -57592, -57074, -58941, -60808, -59898, -58986, -56463, -56802, -55536, -54265, -54902, -58401, -60156, -61907, -63662, -65413, -66542, -64805, -62000, -63960, -64403, -64843, -65584, -66322, -66169, -66013, -64429, -62842, -62574, -62302, -63464, -64623, -67037, -69448, -70908, -69504, -71217, -70066, -67130, -67052, -69422, -68926, -68017, -67104, -62309, -60375, -62734, -62231, -62175, -62119, -61884, -61650, -60364, -59079, -60178, -61277, -60856, -60435, -58762, -57089, -55226, -56225, -57045, -57864, -58773, -59682, -59161, -58639, -59451, -60264, -60897, -61530, -61627, -58863, -56456, -58818, -61612, -64407, -67499, -70592, -72134, -73676, -72834, -71992, -71173, -70353, -69355, -68356, -68222, -65226, -65271, -65316, -62480, -59645, -60148, -60651, -61542, -62432, -63322, -64213, -64053, -63893, -64090, -61426, -58613, -58662, -60260, -61858, -60957, -60055, -60584, -61109, -59969, -58829, -59895, -60957, -64913, -66009, -63647, -61281, -62942, -67466, -69604, -68878, -67108, -65338, -63390, -61437, -61784, -62130, -60867, -62462, -62391, -62320, -64038, -62890, -60822, -58755, -56508, -54258, -52570, -50878, -49664, -53218, -58054, -60029, -60573, -61117, -60532, -59943, -60785, -61627, -62380, -63132]
542f3132p53p53K210K213P82P83k3k2J408J409m274m270j408J453j200J662J841j021n18n18
562f4131P34P34m88m88P64P63K389m74k201k202J047J046K657k05o74o75j211J651J293j569
$$ y = [-63132, -63885, -64638, -62428, -60215, -59433, -58650, -58673, -58695, -57287, -55878, -60152, -64422, -65830, -64377, -65577, -63915, -62074, -63095, -63613, -64131, -63397, -62663, -63151, -63639, -62875, -62112, -59723, -60197, -62398, -64600, -63553, -62507, -59850, -60055, -60729, -61404, -62615, -60964, -59671, -61240]
$$ [...]
##END=	
