##TITLE=	sztVxOBjQ0KNsNOsbIYa3g/0258s
##JCAMPDX=	6.0	$$ NMR Plug-in 1.13 of MestReNova 11.0.4-18998
##DATATYPE=	NMRSPECTRUM
##DATACLASS=	XYDATA
##NUMDIM=	1
##ORIGIN=	Bruker BioSpin GmbH
##OWNER=	andrew
##.OBSERVEFREQUENCY=	600.30184456100005264
##.OBSERVENUCLEUS=	^1H
##.SOLVENTNAME=	CD2Cl2
##.PULSESEQUENCE=	zg
##LONGDATE=	2015/06/05 09:49:18.000
##.ACQUISITIONMODE=	SIMULTANEOUS (DQD)
##$ORIGINALFORMAT=	Bruker XWIN-NMR
##$PARAMETERFILE=	(acqus, ASCII, /var/folders/f6/rjf_tdyn2v98c5c0wvkgn4s80000gn/T/sztVxOBjQ0KNsNOsbIYa3g/0258s/acqus, 0)
$$ ##TITLE= Parameter file, TOPSPIN		Version 2.1
$$ ##JCAMPDX= 5.0
$$ ##DATATYPE= Parameter Values
$$ ##NPOINTS= 10	$$ modification sequence number
$$ ##ORIGIN= Bruker BioSpin GmbH
$$ ##OWNER= andrew
$$ $$ 2015-06-05 14:49:19.087 +0600  andrew@av-600
$$ $$ /opt/data/andrew/nmr/limog-1782/601/acqus
$$ $$ process /opt/ts21pl6/prog/mod/shimcntl
$$ ##$ACQT0= -9.54927425515661
$$ ##$AMP= (0..31)
$$ 100 100 100 100 100 100 100 100 100 100 100 100 100 100 100 100 100 100
$$ 100 100 100 100 100 100 100 100 100 100 100 100 100 100
$$ ##$ANAVPT= -1
$$ ##$AQSEQ= 0
$$ ##$AQ_mod= 3
$$ ##$AUNM= <au_zg>
$$ ##$AUTOPOS= <>
$$ ##$BF1= 600.3
$$ ##$BF2= 600.3
$$ ##$BF3= 600.3
$$ ##$BF4= 600.3
$$ ##$BF5= 600.3
$$ ##$BF6= 600.3
$$ ##$BF7= 600.3
$$ ##$BF8= 600.3
$$ ##$BYTORDA= 0
$$ ##$CFDGTYP= 0
$$ ##$CFRGTYP= 9
$$ ##$CHEMSTR= <none>
$$ ##$CNST= (0..63)
$$ 1 1 145 1 1 1 1 1 1 1 1 1 1 1 1 1 1 1 1 1 1 1 1 1 1 1 1 1 1 1 1 1 1 1 1
$$ 1 1 1 1 1 1 1 1 1 1 1 1 1 1 1 1 1 1 1 1 1 1 1 1 1 1 1 1 1
$$ ##$CPDPRG= <>
$$ ##$CPDPRG1= <>
$$ ##$CPDPRG2= <waltz16>
$$ ##$CPDPRG3= <>
$$ ##$CPDPRG4= <mlev>
$$ ##$CPDPRG5= <mlev>
$$ ##$CPDPRG6= <mlev>
$$ ##$CPDPRG7= <mlev>
$$ ##$CPDPRG8= <mlev>
$$ ##$CPDPRGB= <>
$$ ##$CPDPRGT= <>
$$ ##$D= (0..63)
$$ 0 1 0 0 0 0 0 0 0 0.06 0 0.03 0 0 0 0 1e-04 0 0 0 0 0 0 0 0 0 0 0 0 0 0
$$ 0 0 0 0 0 0 0 0 0 0 0 0 0 0 0 0 0 0 0 0 0 0 0 0 0 0 0 0 0 0 0 0 0
$$ ##$DATE= 1433494158
$$ ##$DBL= (0..7)
$$ 120 120 120 120 120 120 120 120
$$ ##$DBP= (0..7)
$$ 150 150 150 150 150 150 150 150
$$ ##$DBP07= 0
$$ ##$DBPNAM0= <>
$$ ##$DBPNAM1= <>
$$ ##$DBPNAM2= <>
$$ ##$DBPNAM3= <>
$$ ##$DBPNAM4= <>
$$ ##$DBPNAM5= <>
$$ ##$DBPNAM6= <>
$$ ##$DBPNAM7= <>
$$ ##$DBPOAL= (0..7)
$$ 0.5 0.5 0.5 0.5 0.5 0.5 0.5 0.5
$$ ##$DBPOFFS= (0..7)
$$ 0 0 0 0 0 0 0 0
$$ ##$DE= 6.5
$$ ##$DECBNUC= <off>
$$ ##$DECIM= 2218.66666666667
$$ ##$DECNUC= <off>
$$ ##$DECSTAT= 4
$$ ##$DIGMOD= 1
$$ ##$DIGTYP= 12
$$ ##$DL= (0..7)
$$ 0 120 120 120 120 120 120 120
$$ ##$DP= (0..7)
$$ 150 150 150 150 150 150 150 150
$$ ##$DP07= 0
$$ ##$DPNAME0= <>
$$ ##$DPNAME1= <>
$$ ##$DPNAME2= <>
$$ ##$DPNAME3= <>
$$ ##$DPNAME4= <>
$$ ##$DPNAME5= <>
$$ ##$DPNAME6= <>
$$ ##$DPNAME7= <>
$$ ##$DPOAL= (0..7)
$$ 0.5 0.5 0.5 0.5 0.5 0.5 0.5 0.5
$$ ##$DPOFFS= (0..7)
$$ 0 0 0 0 0 0 0 0
$$ ##$DQDMODE= 0
$$ ##$DR= 22
$$ ##$DS= 0
$$ ##$DSLIST= <SSSSSSSSSSSSSSS>
$$ ##$DSPFIRM= 0
$$ ##$DSPFVS= 20
$$ ##$DTYPA= 0
$$ ##$EXP= <>
$$ ##$F1LIST= <111111111111111>
$$ ##$F2LIST= <222222222222222>
$$ [...]
$$ -1 -1 -1 -1 -1 -1 -1 -1 -1 -1 -1 -1 -1 -1 -1 -1 -1 -1 -1 -1 -1 -1 -1 -1
$$ -1 -1 -1 -1 -1 -1 -1 -1 -1 -1 -1 -1 -1 -1 -1 -1 -1 -1 -1 -1 -1 -1 -1 -1
$$ -1 -1 -1 -1 -1 -1 -1 -1 -1 -1 -1 -1 -1 -1 -1 -1 -1 -1 -1 -1 -1 -1 -1 -1
$$ -1 -1 -1 -1 -1 -1 -1 -1 -1 -1 -1 -1 -1 -1 -1 -1 -1 -1 -1 -1 -1 -1 -1 -1
$$ -1 -1 -1 -1 -1 -1 -1 -1 -1 -1 -1 -1 -1 -1 -1 -1
$$ ##$RG_tab8= (0..255)
$$ -1 -1 -1 -1 -1 -1 -1 -1 -1 -1 -1 -1 -1 -1 -1 -1 -1 -1 -1 -1 -1 -1 -1 -1
$$ -1 -1 -1 -1 -1 -1 -1 -1 -1 -1 -1 -1 -1 -1 -1 -1 -1 -1 -1 -1 -1 -1 -1 -1
$$ -1 -1 -1 -1 -1 -1 -1 -1 -1 -1 -1 -1 -1 -1 -1 -1 -1 -1 -1 -1 -1 -1 -1 -1
$$ -1 -1 -1 -1 -1 -1 -1 -1 -1 -1 -1 -1 -1 -1 -1 -1 -1 -1 -1 -1 -1 -1 -1 -1
$$ -1 -1 -1 -1 -1 -1 -1 -1 -1 -1 -1 -1 -1 -1 -1 -1 -1 -1 -1 -1 -1 -1 -1 -1
$$ -1 -1 -1 -1 -1 -1 -1 -1 -1 -1 -1 -1 -1 -1 -1 -1 -1 -1 -1 -1 -1 -1 -1 -1
$$ -1 -1 -1 -1 -1 -1 -1 -1 -1 -1 -1 -1 -1 -1 -1 -1 -1 -1 -1 -1 -1 -1 -1 -1
$$ -1 -1 -1 -1 -1 -1 -1 -1 -1 -1 -1 -1 -1 -1 -1 -1 -1 -1 -1 -1 -1 -1 -1 -1
$$ -1 -1 -1 -1 -1 -1 -1 -1 -1 -1 -1 -1 -1 -1 -1 -1 -1 -1 -1 -1 -1 -1 -1 -1
$$ -1 -1 -1 -1 -1 -1 -1 -1 -1 -1 -1 -1 -1 -1 -1 -1 -1 -1 -1 -1 -1 -1 -1 -1
$$ -1 -1 -1 -1 -1 -1 -1 -1 -1 -1 -1 -1 -1 -1 -1 -1
$$ ##$RG_tabA= (0..255)
$$ 0.25 0.28 0.32 0.35 0.4 0.44 0.5 0.56 0.64 0.7 0.8 0.89 1 1.12 1.28 1.4
$$ 1.6 1.78 2 2.25 2.56 2.8 3.2 3.56 4 4.5 5 5.6 6.35 7.12 8 9 10 11.3 12.7
$$ 14.2 16 18 20.2 22.6 25.4 28.5 32 36 40.3 45.2 50.8 57 64 71.8 80.6 90.5
$$ 101 114 128 144 161 181 203 -1 -1 -1 -1 -1 -1 -1 -1 -1 -1 -1 -1 -1 -1 -1
$$ -1 -1 -1 -1 -1 -1 -1 -1 -1 -1 -1 -1 -1 -1 -1 -1 -1 -1 -1 -1 -1 -1 -1 -1
$$ -1 -1 -1 -1 -1 -1 -1 -1 -1 -1 -1 -1 -1 -1 -1 -1 -1 -1 -1 -1 -1 -1 -1 -1
$$ -1 -1 -1 -1 -1 -1 -1 -1 -1 -1 -1 -1 -1 -1 -1 -1 -1 -1 -1 -1 -1 -1 -1 -1
$$ -1 -1 -1 -1 -1 -1 -1 -1 -1 -1 -1 -1 -1 -1 -1 -1 -1 -1 -1 -1 -1 -1 -1 -1
$$ -1 -1 -1 -1 -1 -1 -1 -1 -1 -1 -1 -1 -1 -1 -1 -1 -1 -1 -1 -1 -1 -1 -1 -1
$$ -1 -1 -1 -1 -1 -1 -1 -1 -1 -1 -1 -1 -1 -1 -1 -1 -1 -1 -1 -1 -1 -1 -1 -1
$$ -1 -1 -1 -1 -1 -1 -1 -1 -1 -1 -1 -1 -1 -1 -1 -1 -1 -1 -1 -1 -1 -1 -1 -1
$$ -1 -1 -1 -1 -1 -1 -1 -1 -1 -1 -1 -1 -1 -1
$$ ##$ROUT14= (0..7)
$$ 0 0 0 0 0 0 0 0
$$ ##$ROUTER= -1
$$ ##$RX22TY= <no>
$$ ##$RXFMAX= (0..7)
$$ 647.5 -1 -1 -1 -1 -1 -1 -1
$$ ##$RXFMIN= (0..7)
$$ 5 -1 -1 -1 -1 -1 -1 -1
$$ ##$RXINTLV= (0..7)
$$ 1 0 0 0 0 0 0 0
$$ ##$RXMSTY= <no>
$$ ##$SCMTY= <no>
$$ ##$SGUC1= (0..15)
$$ 17 18 34 0 0 0 0 0 0 0 0 0 0 0 0 0
$$ ##$SGUC2= (0..15)
$$ 33 256 20 0 0 0 0 0 0 0 0 0 0 0 0 0
$$ ##$SPECTR= 10
$$ ##$SY2FLAG= 0
$$ ##$TFXNUM= 0
$$ ##$TRIPLO2= 0
$$ ##$VTUTY= <tty05>
$$ ##$WBREFAM= (0..15)
$$ 100 100 100 100 100 100 100 100 100 100 100 100 100 100 100 100
$$ ##$WBREFPH= (0..15)
$$ 0 0 0 0 0 0 0 0 0 0 0 0 0 0 0 0
$$ ##$XFAC= 2
$$ ##END=
$$ 
##$DECIM=	2218.66666666667
##$DSPFVS=	20
##XUNITS=	HZ
##YUNITS=	ARBITRARY UNITS
##FIRSTX=	6322.8525384689401108
##LASTX=	-2691.4329892738592207
##XFACTOR=	-0.1375491802509010153
##YFACTOR=	2.7930146484375002768e-05
##NPOINTS=	65536
##XYDATA=	(X++(Y..Y))
$$ [...]
-12243f9617k798k794j245J617L394N33j017j017j166j166J218J218J032J032J032J032k962
-12226g1674k962K284K284j27j23j26j23K2K6k362k358J41J46K347K351K615k42j021j017
-12207f9919O41O44L47L46M92m273m095K582O11k246K164K165J5J8J9J9K9L0j579J285L368
-12186f7337L368p45p42L726L726L725O591P064R925J4992J4996N617m873j4529j4530j2325
-12170d1351r463o602j833k250k250K161k608m277m278M92M92M58k399j9K847M690M695k284
-12152f3779k280j204j199q46l703j293J572J569j289k620K46j15j12k94k91k94k91P12P15
-12133g4796K142K146j374j371j375j371j49j46j758j755Q64j993j639L133k61k57L8M1q2
-12114g9963p9L257L260J00J01j509J352J60J61L39L39J82J83k023k023k113P49L432j338
$$ plain form
-12243 -69617 -72415 -75209 -76454 -74837 -71443 -70910 -71927 -72944 -74110 -75276 -74058 -72840 -71808 -70776 -69744 -68712 -71674
-12226 -71674 -74636 -72352 -70068 -70195 -70318 -70444 -70567 -70545 -70519 -72881 -75239 -75098 -74952 -72605 -70254 -67639 -67881 -68902 -69919
-12207 -69919 -69278 -68634 -68287 -67941 -67449 -71722 -75817 -73235 -72624 -74870 -72706 -70541 -70526 -70508 -70489 -70470 -70441 -70411 -71990 -70705 -67337
-12186 -67337 -63969 -64714 -65456 -61730 -58004 -54279 -47688 -40624 -30699 -15707 -711 4906 33 -14496 -29026 -41351
-12170 -41351 -50814 -57416 -59249 -61499 -63749 -61588 -64196 -68473 -72751 -72259 -71767 -71309 -73708 -73727 -70880 -66190 -61495 -63779
-12152 -63779 -66059 -67263 -68462 -69308 -73011 -74304 -72732 -71163 -72452 -75072 -74826 -74941 -75053 -75347 -75638 -75932 -76223 -75511 -74796
-12133 -74796 -72654 -70508 -71882 -73253 -74628 -75999 -76148 -76294 -78052 -79807 -78943 -80936 -82575 -79442 -79703 -79960 -79922 -79881 -79963
-12114 -79963 -80042 -76785 -73525 -73425 -73324 -74833 -73481 -73321 -73160 -72821 -72482 -72300 -72117 -74140 -76163 -78276 -77527 -74095 -75433
-12095g5433j129J733K865Lj993j993l782r20J688J688n18n18K57K57K57K57j60j57K225K228
-12075g3145K373K377J67J72l215l51M21M25J673J676n5k914M36M40K641K645j531j527j711
-12056f9003j706J248j609m%k686k683k209O56L476j289l499J275K015K019j024j021O97P00
-12037g4647O97P00k135k131K50K53j30j27j263j259k50M523L268j498k902l8n17n15j30j27
-12017g7978j30j27Q24Q27p86p83J062j796k872J900L029L033R42R46m88m84m88m84K064K067
-11997f9722l20l17j989j986j989j986J281J286Q05L669L279j487j967j963n70n67Q61Q64
-11979g2818n10n07q08q05K001k765q5q2L91L95J822J825k794k791m224m222K541K545J56
-11960h0735J61j751j748j751j747J200J203J200J203K600K605K600K604L66L68L65L69Q2
$$ plain form
-12095 -75433 -76562 -74829 -71964 -71961 -73954 -75947 -79729 -80649 -78961 -77273 -77791 -78309 -78052 -77795 -77538 -77281 -77441 -77598 -75373 -73145
-12075 -73145 -70772 -68395 -68228 -68056 -71271 -71622 -71201 -70776 -69103 -67427 -67482 -70396 -69960 -69520 -66879 -64234 -65765 -67292 -69003
-12056 -69003 -70709 -69461 -71070 -71074 -71074 -73760 -76443 -78652 -77996 -74520 -75809 -79308 -78033 -76018 -73999 -75023 -76044 -75347 -74647
-12037 -74647 -73950 -73250 -75385 -77516 -77266 -77013 -77143 -77270 -78533 -79792 -80042 -75519 -72251 -73749 -76651 -76689 -77206 -77721 -77851 -77978
-12017 -77978 -78108 -78235 -77411 -76584 -77370 -78153 -77091 -78887 -81759 -79859 -76830 -73797 -72855 -71909 -72397 -72881 -73369 -73853 -71789 -69722
-11997 -69722 -70042 -70359 -72348 -74334 -76323 -78309 -77028 -75742 -74937 -71268 -67989 -69476 -71443 -73406 -73976 -74543 -73682 -72818
-11979 -72818 -73328 -73835 -74643 -75448 -73447 -76212 -76297 -76379 -75988 -75593 -73771 -71946 -74740 -77531 -81755 -85977 -83436 -80891 -80735
-11960 -80735 -80574 -82325 -84073 -85824 -87571 -86371 -85168 -83968 -82765 -80165 -77560 -74960 -72356 -71990 -71622 -71257 -70888 -70806
-11942g0806Q6j349j345n44n40n44n40M66M69M66M69J151J155k187k183J31J34J30J34L69
-11922g4878L73j062j058K57K61K57K61m393m389j00r7P56P60P56P60m95m92R35R39l02k98
-11901h1249l02k98R80R84R80R83k34k31k35k31n33n29Q98R02j584j580Q01Q05J427J431j911
-11880g8726j908j23j19j23j19J933J938m51m47j576j572J762J766J583J587q01p97k701k697
-11861h1591l17l13O67O70p63p60L91L91L91L91m13m14J017J017J182J181K611K612N55N55
-11841g0940N55N55P57P56j628j628r73r72K366K366j256j256j255j256m21m21m21m21J148
-11822g4345J147k83k83j803j803K488K489o56o55P75P75R83R84l309l308l95l95l95l95o63
-11802g9047o63J721J721j229j229J154J155J781J781L212L211o11o07o11o07j148j144j147
$$ plain form
-11942 -70806 -70720 -72069 -73414 -73958 -74498 -75042 -75582 -75116 -74647 -74181 -73712 -72561 -71406 -73593 -75776 -75645 -75511 -75381 -75247 -74878
-11922 -74878 -74505 -75567 -76625 -76368 -76107 -75850 -75589 -79982 -84371 -84471 -84568 -83812 -83052 -82296 -81536 -82031 -82523 -81588 -80649 -80951 -81249
-11901 -81249 -81551 -81849 -80869 -79885 -78905 -77922 -78156 -78387 -78622 -78853 -79386 -79915 -79017 -78115 -79699 -81279 -80478 -79673 -78246 -76815 -78726
-11880 -78726 -80634 -80757 -80876 -80999 -81118 -79185 -77247 -77698 -78145 -79721 -81293 -79531 -77765 -76182 -74595 -75396 -76193 -78894 -81591
-11861 -81591 -81908 -82221 -81554 -80884 -81647 -82407 -82016 -81625 -81234 -80843 -81256 -81670 -80653 -79636 -78454 -77273 -74662 -72050 -71495 -70940
-11841 -70940 -70385 -69830 -69073 -68317 -69945 -71573 -72546 -73518 -71152 -68786 -70042 -71298 -72553 -73809 -74230 -74651 -75072 -75493 -74345
-11822 -74345 -73198 -73481 -73764 -75567 -77370 -74882 -72393 -73049 -73704 -72929 -72154 -71171 -70187 -73496 -76804 -77199 -77594 -77989 -78384 -79047
-11802 -79047 -79710 -77989 -76268 -77497 -78726 -77572 -76417 -74636 -72855 -69643 -66432 -67043 -67650 -68261 -68868 -70016 -71160 -72307
-11784g2307j144j796j792l65l61Q2Q5J513J516L51L54j081j077j855j852J483J487J021J024
-11765g4714j364j359J885J889n00m95K23K24K24K23L13L13j118j117j215j214J169J170k585
-11746g8048k586J706J707o82o82P49P49K358K359K358K358k276k277j918j919k604L118j00
-11728g5630j01o7o7j498j498J304J304j26j27j86j87j86j86M99M99J930J930J207J207k23
-11708g0202k24k071k072J267J267J162J163j222j222j20j19j19j19k686k683J606J609Q6
-11690g4699Q9j345j341n6n2J375J378O90O93O89O93j833j829J505J509J475J479r09r05k124
-11670g3518k120j706J158M732r87k660k657mK862Q90l874j107L666O82O85J547J549o59o56
-11651g2177k298N66N62k295j203j200j382j378r65r62r64J900J956M821J002J006J836J841
$$ plain form
-11784 -72307 -73451 -75247 -77039 -77404 -77765 -77683 -77598 -76085 -74569 -74218 -73864 -74945 -76022 -77877 -79729 -78246 -76759 -75738 -74714
-11765 -74714 -76078 -77437 -75552 -73663 -74163 -74658 -74435 -74211 -73987 -73764 -73451 -73138 -74256 -75373 -76588 -77802 -76633 -75463 -78048
-11746 -78048 -80634 -78928 -77221 -77903 -78585 -77836 -77087 -74729 -72370 -70012 -67654 -69930 -72207 -74125 -76044 -78648 -75530 -75630
-11728 -75630 -75731 -75798 -75865 -77363 -78861 -77557 -76253 -76379 -76506 -76692 -76879 -77065 -77251 -76752 -76253 -74323 -72393 -71186 -69979 -70202
-11708 -70202 -70426 -72497 -74569 -73302 -72035 -70873 -69710 -70932 -72154 -72274 -72393 -72512 -72631 -75317 -78000 -76394 -74785 -74699
-11690 -74699 -74610 -75955 -77296 -77352 -77404 -76029 -74651 -73961 -73268 -72579 -71886 -73719 -75548 -74043 -72534 -71059 -69580 -70489 -71394 -73518
-11670 -73518 -75638 -77344 -76186 -71454 -72441 -75101 -77758 -77762 -74900 -74010 -77884 -78991 -75325 -74643 -73958 -72411 -70862 -71521 -72177
-11651 -72177 -74475 -73909 -73347 -75642 -76845 -78045 -79427 -80805 -81770 -82732 -83696 -81796 -79840 -75019 -74017 -73011 -71175 -69334
-11633f9334N85N88k727J38j654J211J505J509J684J688q20q16q20q16k160k158K24K27j274
-11614g3220j270j275j270r17r12o19o14k161K611L085L089K906M8J654J658j792j788N92
-11596g0195N96l789l785k060Q05L148L152R42R47l10l05J479j379j065J799J617j240k407
-11578g2050k403j155j151P4P8P5P8K221K224k072k067l80l80l80l80j424j423K034M896L249
-11558g0336L87k08k09j639j640l248l88P38P37R17R16P98P97n104k243K139K138Q87Q87J661
-11538g2013J662K31K31o89o90J695J699J696J695j643j640l103l104J189J192K6K6K6L0J844
-11518f9640J845j494j491n40n40n40n37J680J681j658j654j08j08j08j05L879L878j367j368
-11499f8295M51M51r80r80J733J732k559k560q31q31O00O00o85o86K653K652j788j788J19
$$ plain form
-11633 -69334 -68749 -68161 -70888 -70750 -72404 -71193 -69688 -68179 -66495 -64807 -65627 -66443 -67263 -68079 -70239 -72397 -72173 -71946 -73220
-11614 -73220 -74490 -75765 -77035 -77952 -78864 -79483 -80097 -82258 -79647 -76562 -73473 -70567 -70519 -68865 -67207 -68999 -70787 -70195
-11596 -70195 -69599 -73388 -77173 -79233 -78428 -75280 -72128 -71186 -70239 -70549 -70854 -69375 -70754 -71819 -70020 -68403 -69643 -72050
-11578 -72050 -74453 -75608 -76759 -76685 -76607 -76532 -76454 -74233 -72009 -74081 -76148 -76528 -76908 -77288 -77668 -79092 -80515 -78481 -73585 -70336
-11558 -70336 -69949 -70157 -70366 -72005 -73645 -76893 -77281 -76543 -75806 -74889 -73973 -73175 -72378 -77482 -79725 -77586 -75448 -74561 -73674 -72013
-11538 -72013 -70351 -70120 -69889 -70578 -71268 -69573 -67874 -66178 -64483 -66126 -67766 -70869 -73973 -72784 -71592 -71566 -71540 -71514 -71484 -69640
-11518 -69640 -67795 -69289 -70780 -71320 -71860 -72400 -72937 -71257 -69576 -71234 -72888 -72996 -73104 -73212 -73317 -69438 -65560 -66927 -68295
-11499 -68295 -67844 -67393 -68373 -69353 -67620 -65888 -68447 -71007 -71838 -72669 -72069 -71469 -72154 -72840 -70187 -67535 -69323 -71111 -70992
-11480g0992k742j401L368K891K891j252j251j252j252l4l3l4k9j912j911J427J431J00J01
-11461g1886J00J05L09L09k87K578L998k679j75j71j516j517k947k943j01j00j01r7Q24Q23
-11441g5474K254K258j639j636P45P49j639j636P45P49m5m1L294L297J803J807L73L76K943
-11422f0717K947N328N331N59N63l912l908m821p679n417o44j126j121q27q24q27q23q27q23
-11403g9568P22P27j662j658q72q68K467K470K01K05K586K589j226j222k656k653Q31Q34Q31
-11384g7922Q35J90J94j241j237J472J475L856L860j938j933M47M51j073j069j073j070J409
-11366g4367J412l838l834j035j032J348J353N9O4N9O4j103j099L28L31K005K008l80l76L643
-11346g4390L648L05L09j125j121j125j122l092l089K154K157O85O90O85O89J222J226J222
$$ plain form
-11480 -70992 -73734 -75135 -71767 -68876 -65985 -67237 -68488 -69740 -70992 -71026 -71059 -71093 -71122 -73034 -74945 -73518 -72087 -71987 -71886
-11461 -71886 -71786 -71681 -71372 -71063 -71350 -68772 -64774 -67453 -67628 -67799 -69315 -70832 -73779 -76722 -76823 -76923 -77024 -77121 -76297 -75474
-11441 -75474 -73220 -70962 -72601 -74237 -73492 -72743 -74382 -76018 -75273 -74524 -74569 -74610 -71316 -68019 -66216 -64409 -64036 -63660 -60717
-11422 -60717 -57770 -52442 -47111 -46552 -45989 -49901 -53809 -58630 -66309 -71726 -72370 -73496 -74617 -75444 -76268 -77095 -77918 -78745 -79568
-11403 -79568 -78846 -78119 -79781 -81439 -82311 -83179 -80712 -78242 -78041 -77836 -75250 -72661 -73887 -75109 -77765 -80418 -79587 -78753 -77922
-11384 -77922 -77087 -76897 -76703 -77944 -79181 -77709 -76234 -72378 -68518 -70456 -72389 -71942 -71491 -72564 -73633 -74706 -75776 -74367
-11366 -74367 -72955 -76793 -80627 -81662 -82694 -81346 -79993 -79934 -79870 -79811 -79747 -80850 -81949 -81621 -81290 -79285 -77277 -77657 -78033 -74390
-11346 -74390 -70742 -70437 -70128 -71253 -72374 -73499 -74621 -77713 -80802 -78648 -76491 -75806 -75116 -74431 -73742 -72520 -71294 -70072
-11328g0072J226m02l99k787k783L145L148P60P64l286l283r01q98K198K202j87j82k571k571
-11309g6879j86j86J781J781j558j557N59N59q72q72j110j110J274J274K813K813n26n25k999
-11290g5526k999L39L39J471J472J472J471L39L39j091j092R28R31R28R31J23J27m527J200
-11271g2825J732J737j249j244j606j602j75j71k835k832K411K414J159J162k72k68o45o41
-11253g5750P86P90n85n81J800J803K563K567k682k679q35q30J549J554o78o74P52P56o18
-11234g0992o15Q12Q16K329K332j963j960l752l748N41N43J144J148k195k190m66m62J919
-11216g6759J922j237j237K102K101k24k23k251k250n51N171k340k339k84k83k83k83j490
-11198h0738j491Q95Q94K712K712J640m084K39K38j550j550J222J222J222J222j78j79J252
$$ plain form
-11328 -70072 -68846 -69248 -69647 -72434 -75217 -72072 -68924 -68164 -67400 -70686 -73969 -74870 -75768 -73570 -71368 -71555 -71737 -74308 -76879
-11309 -76879 -77065 -77251 -75470 -73689 -75247 -76804 -76245 -75686 -76558 -77430 -78540 -79650 -78376 -77102 -74289 -71476 -72002 -72527 -75526
-11290 -75526 -78525 -78186 -77847 -76376 -74904 -73432 -71961 -71622 -71283 -72374 -73466 -72538 -71607 -70679 -69748 -69625 -69498 -74025 -72825
-11271 -72825 -71093 -69356 -70605 -71849 -73455 -75057 -75232 -75403 -78238 -81070 -78659 -76245 -75086 -73924 -74196 -74464 -75109 -75750
-11253 -75750 -74964 -74174 -74759 -75340 -73540 -71737 -69174 -66607 -69289 -71968 -72803 -73633 -72084 -70530 -71208 -71882 -71130 -70374 -70992
-11234 -70992 -71607 -70795 -69979 -67650 -65318 -67281 -69241 -72993 -76741 -76200 -75657 -74513 -73365 -75560 -77750 -78216 -78678 -76759
-11216 -76759 -74837 -76074 -77311 -75209 -73108 -73332 -73555 -75806 -78056 -78607 -73436 -75776 -78115 -78399 -78682 -78965 -79248 -80738
-11198 -80738 -82229 -81334 -80440 -77728 -75016 -73376 -77460 -77221 -76983 -78533 -80083 -78861 -77639 -76417 -75195 -75373 -75552 -74300
-11180g4300J255o56o52o55o52r54r54M77M81N9O4J490J494J363J364J364J367q42q38q42
-11160g0567q39P46P45j640j635l88l83J043J047O33O37O37O37p04p04K634K634j743j740
-11141f8950l10l09K135K135l111l111K500K504j491j490l398J371K981j789k321N44J021
-11124g1089J021k61k61L8L7l510J260K570k87j602j602J379J382J431j431k504K269j788
-11106g2948j788l875l871P86P86P86P90M035M035j211j207p19p19P12P15j017j017j315j312
-11087g8354K865j900P79P82J136J140j248j244L17L20j114j110J002J006K433K436k90k87
-11069g1331k91k87O93O97j691j688J632J635K02K04K705K709J274J278k966k965L72L77j565
-11050f9006j565j34j31J118J118L621j144m455p318k369M95J498J498N015N018j036j035
$$ plain form
-11180 -74300 -73045 -73701 -74353 -75008 -75660 -76614 -77568 -77091 -76610 -76551 -76487 -74997 -73503 -72140 -70776 -69412 -68045 -68887 -69725 -70567
-11160 -70567 -71406 -70660 -69915 -71555 -73190 -73578 -73961 -72918 -71871 -71238 -70601 -69964 -69327 -70031 -70735 -68101 -65467 -67210 -68950
-11141 -68950 -69260 -69569 -67434 -65299 -68410 -71521 -69021 -66517 -68008 -69498 -72896 -71525 -68544 -70333 -72654 -72110 -71089
-11124 -71089 -70068 -70329 -70590 -70552 -70515 -74025 -72765 -70195 -70482 -72084 -73686 -72307 -70925 -69494 -70925 -73429 -71160 -72948
-11106 -72948 -74736 -78611 -82482 -81696 -80910 -80124 -79334 -75299 -71264 -72475 -73682 -74401 -75120 -74408 -73693 -74710 -75727 -77042 -78354
-11087 -78354 -75489 -77389 -76610 -75828 -74692 -73552 -74800 -76044 -75727 -75407 -76521 -77631 -76629 -75623 -73190 -70754 -71044 -71331
-11069 -71331 -71622 -71909 -71216 -70519 -72210 -73898 -72266 -70631 -70429 -70225 -67520 -64811 -63537 -62259 -65225 -68190 -67818 -67441 -69006
-11050 -69006 -70571 -70705 -70836 -69718 -68600 -64979 -66123 -70578 -77896 -80265 -79770 -78272 -76774 -71759 -66741 -67777 -68812
-11033f8812j036j032K31K31n015n011l65l65l65l62m06m06J978J979Q75Q76k463k463J517
-11014h0414J516Q6Q6j286j285J45J45J841J840M10M10pqj438j438K876K876J446J445K966
-10994f7788K966J237J237P30m039j356j352K459K458j833j829q87q86q87q83r46r47r46r43
-10975g4435J073J073j311j308K98K98J729J733L65L65L65L69j036j036J349J352Q50Q49j535
-10956f8593j535j207j207j207j207K183K183P53P53O7O7k139k138m862k001k72M497M258
-10938g1607J397l3l4j866j867N18N18P86P86L469j300l8l3j885K887K91m475j498j494J64
-10918g5314J68J64J67j922j919K370K373J803J807k488k485K83K87K83K87k243k239q13q08
-10899h0239M10M13J841J844k403k399K846K846K187K191k101k101n56n51J833J833j062j058
$$ plain form
-11033 -68812 -69848 -70880 -70649 -70418 -75433 -80444 -80809 -81174 -81539 -81901 -82307 -82713 -80735 -78756 -77881 -77005 -79468 -81931 -80414
-11014 -80414 -78898 -78812 -78726 -80012 -81297 -81152 -81007 -79166 -77326 -76916 -76506 -76513 -76521 -77959 -79397 -76521 -73645 -72199 -70754 -67788
-10994 -67788 -64822 -63585 -62348 -61618 -65657 -67013 -68365 -65906 -63448 -65281 -67110 -67997 -68883 -69770 -70653 -71599 -72546 -73492 -74435
-10975 -74435 -73362 -72289 -73600 -74908 -74610 -74312 -72583 -70850 -70485 -70120 -69755 -69386 -70422 -71458 -70109 -68757 -67907 -67058 -68593
-10956 -68593 -70128 -71335 -72542 -73749 -74956 -72773 -70590 -69837 -69084 -69017 -68950 -71089 -73227 -78089 -80090 -80362 -75865 -71607
-10938 -71607 -70210 -70243 -70277 -72143 -74010 -73492 -72974 -72188 -71402 -67933 -69233 -69271 -69304 -71189 -68302 -68011 -72486 -73984 -75478 -75314
-10918 -75314 -75146 -74982 -74815 -76737 -78656 -76286 -73913 -72110 -70303 -72791 -75276 -74993 -74706 -74423 -74136 -76379 -78618 -79431 -80239
-10899 -80239 -79829 -79416 -77575 -75731 -78134 -80533 -77687 -74841 -72654 -70463 -72564 -74665 -75221 -75772 -73939 -72106 -73168 -74226
-10881g4226j058j058K723K728o11o11j68j64j595j594J635J640j699j699o30o26J759J758
-10863g3496K798K798k42k42m296M73J129J129mll342l342K94K95K678K679J79J79j252j252
-10843g2840J013J014J013J014j684j684j684j684k042k042L43L43j639j640P45P45k08k09
-10825h1126J222J222L607L606o85o86Q05Q05o26o26k884k884M55M54R62R61R61R61J446J445
-10805g0605k846k846L42L43L383L383J881k883l245l80m73m70j725j721j9j5j8j5M28M32
-10785g7069J860J862J237J241k101k098j207j203J177J181J863J866L294j472J058L923J357
-10768f3231l409o64o63r61r61j528j527j528j527N66N66j341J520N156L88j043j043k355
-10750g3585k355L0L0N07N06j877j878Q42Q42n89n88j006j006q27q27Q08L670M921J53k887
$$ plain form
-10881 -74226 -75284 -76342 -73619 -70891 -71502 -72113 -72281 -72445 -74040 -75634 -73999 -72359 -74058 -75757 -76387 -77013 -75254 -73496
-10863 -73496 -70698 -67900 -68142 -68384 -72680 -72207 -71078 -69949 -69953 -69956 -73298 -76640 -76346 -76051 -73373 -70694 -70515 -70336 -71588 -72840
-10843 -72840 -71827 -70813 -69800 -68786 -70470 -72154 -73838 -75522 -77564 -79606 -79263 -78920 -80559 -82199 -81454 -80709 -80917 -81126
-10825 -81126 -79904 -78682 -75075 -71469 -72154 -72840 -72035 -71230 -71856 -72482 -75366 -78250 -77795 -77341 -76379 -75418 -74457 -73496 -72050 -70605
-10805 -70605 -73451 -76297 -75955 -75612 -72229 -68846 -66965 -69848 -73093 -73473 -73946 -74416 -76141 -77862 -77881 -77896 -77914 -77929 -77501 -77069
-10785 -77069 -75209 -73347 -72110 -70869 -72970 -75068 -76275 -77478 -76301 -75120 -73257 -71391 -68097 -69569 -68511 -64588 -63231
-10768 -63231 -66640 -67304 -67967 -68928 -69889 -71417 -72944 -74472 -75999 -75433 -74867 -76208 -74688 -69532 -69144 -70187 -71230 -73585
-10750 -73585 -75940 -75910 -75880 -75373 -74867 -76744 -78622 -77780 -76938 -77527 -78115 -79121 -80127 -80954 -81781 -80973 -77303 -72382 -72229 -75116
-10730g5116k6J404J405j822j822l91l91l193l193J099J099r69r68K369K370L085L084k53
-10712g2229k53j014j013M17M18L040L040J609J610j900j900m70m66n58n59j990j986k38k38
-10693g4680k39k35K415K414J282J285l253J517J218J222k388k388R50R54q09q08q09q05K709
-10674g0448K708J278J282k690k690k690k690l65l65l65l65J423J423pqJ990J989N59N59N81
-10654f8891N81k757k757k280k280J058J058N209N208l7m806l435n74q72q71K6K891O22m143
-10635g7050M73M77J75J79K880K884K224k541k574k571j442j438N36N41K921K924Q94Q98J371
-10616f8239l394l576p12q94J971J013J017j192j189K206K206j79j75R53R54l338J434J275
-10598f9859j588O79k180j498J364m25m21p78p79J606J609q08q09r87r84J614j249k500K273
$$ plain form
-10730 -75116 -75142 -73738 -72333 -74155 -75977 -76368 -76759 -79952 -83145 -82046 -80947 -81916 -82884 -80515 -78145 -75060 -71976 -72229
-10712 -72229 -72482 -73496 -74509 -74092 -73674 -70634 -67594 -65985 -64375 -66275 -68175 -68645 -69111 -69669 -70228 -72218 -74204 -74442 -74680
-10693 -74680 -74919 -75154 -72739 -70325 -69043 -67758 -71011 -69494 -68276 -67054 -69442 -71830 -70880 -69926 -70735 -71543 -72352 -73157 -70448
-10674 -70448 -67740 -66462 -65180 -67870 -70560 -73250 -75940 -76305 -76670 -77035 -77400 -75977 -74554 -74561 -74569 -72579 -70590 -70031 -69472 -68891
-10654 -68891 -68310 -71067 -73824 -76104 -78384 -77326 -76268 -71059 -65851 -65888 -70694 -74129 -74703 -75575 -76446 -76420 -73529 -72907 -77050
-10635 -77050 -76577 -76100 -75925 -75746 -72866 -69982 -67758 -70299 -72873 -75444 -76886 -78324 -77788 -77247 -74326 -71402 -70508 -69610 -68239
-10616 -68239 -71633 -75209 -75921 -76815 -74844 -73831 -72814 -74006 -75195 -72989 -70783 -70962 -71137 -70184 -69230 -72568 -71134 -69859
-10598 -69859 -71447 -70768 -72948 -74446 -73082 -73507 -73928 -74706 -75485 -73879 -72270 -73078 -73887 -74874 -75858 -74244 -75493 -77993 -75720
-10579g5720K895L4N10N14j300j297j296j297j777j773K518K519q83q79q80q79q53q50O304
-10560g4390O304n51n48k932k932L13L16L17L17J64J67j263j263J714J718o67o67L91L95L95
-10540g2702L95J881J885M55M55o00n96n97n96R50R54R54R54r28r24N07N06k865k861J431
-10520g1342J430J748J751o34o33j948j945K347K347k813k809j382j379J122J125j263j259
-10503g5537k023k020L62L65o82o78o82o78K414K418L845L849P75P78j609j606m292m288R54
-10484g8335R57K146K150j192j189Q35Q34n96n92j610j609P75P78P60P61K190K195K23K24
-10465g0295K23K27n21n22q79q75J385m336k906K820M5M5J833J836N52N51N52N55M06M06k932
-10444g1830k929J718J717k574k571n03n03n03m99m13m14m13m10J799J800J799J803p04p04
$$ plain form
-10579 -75720 -72825 -72791 -72281 -71767 -73067 -74364 -75660 -76957 -78734 -80507 -77989 -75470 -76353 -77232 -78112 -78991 -79844 -80694 -74390
-10560 -74390 -68086 -68637 -69185 -72117 -75049 -74736 -74420 -74103 -73786 -73622 -73455 -74718 -75981 -74267 -72549 -73216 -73883 -73492 -73097 -72702
-10540 -72702 -72307 -70426 -68541 -68086 -67631 -68231 -68827 -69424 -70020 -69070 -68116 -67162 -66208 -67136 -68060 -67553 -67047 -69912 -72773 -71342
-10520 -71342 -69912 -68164 -66413 -67047 -67680 -69628 -71573 -69226 -66879 -69692 -72501 -73883 -75262 -74140 -73015 -74278 -75537
-10503 -75537 -77560 -79580 -79218 -78853 -79535 -80213 -80895 -81573 -79159 -76741 -72896 -69047 -68272 -67494 -69103 -70709 -75001 -79289 -78335
-10484 -78335 -77378 -75232 -73082 -74274 -75463 -74628 -73794 -74390 -74982 -76592 -78201 -77426 -76648 -75888 -75127 -72937 -70742 -70519 -70295
-10465 -70295 -70072 -69845 -70366 -70888 -71767 -72642 -71257 -75593 -78499 -75679 -75634 -75589 -73756 -71920 -71368 -70817 -70265 -69710 -69304 -68898 -71830
-10444 -71830 -74759 -73041 -71324 -73898 -76469 -76972 -77475 -77978 -78477 -78890 -79304 -79717 -80127 -78328 -76528 -74729 -72926 -73630 -74334
-10425g4334p04p00M06M06M06M10J091J092J091J096N92N96j788j788j882j878N07N07J509
-10406g3365J512Q2Q2M9N2N2N2j56j53k537k537J959J964o4o3J915P641M304j420k913k910
-10385f6454q83q83l879l878j494j490l32l31K052K057M73M73M74M76m50m51J099l666m236
-10366h1323N33K499l57Q31Q30p78p75n40n41Q91Q94M14M13j017j013k54k53L085L085j684
-10346g5060j684k54k53J557J558j781j781o19o18Q12Q12R28R28R27R28k798k798m13m14P34
-10326g9289P34k604k605R73R72R73R72O89O93O90O92J882J885n03m99J323J326j062j058
-10307g3816L99M02L99M02j039j036k470k467J077J080J077J081n93n88n93n88Q97R02j486
-10288g6960j483j68j68K217K217K157K157k27k27j122j121j002J859l327J442K276K276Q61
$$ plain form
-10425 -74334 -75038 -75738 -75332 -74926 -74520 -74110 -73019 -71927 -70836 -69740 -69148 -68552 -70340 -72128 -74010 -75888 -75381 -74874 -73365
-10406 -73365 -71853 -71771 -71689 -71640 -71588 -71536 -71484 -71640 -71793 -74330 -76867 -74908 -72944 -73008 -73071 -71156 -63515 -59211 -60631 -63544 -66454
-10385 -66454 -67337 -68220 -72099 -75977 -77471 -78961 -79293 -79624 -77572 -75515 -75042 -74569 -74095 -73619 -74069 -74520 -73421 -77087 -81323
-10366 -81323 -80790 -78291 -78648 -77817 -76987 -77765 -78540 -79080 -79621 -78730 -77836 -77422 -77009 -78026 -79039 -79293 -79546 -76461 -73376 -75060
-10346 -75060 -76744 -76998 -77251 -75694 -74136 -75917 -77698 -78317 -78935 -78123 -77311 -76383 -75455 -74528 -73600 -76398 -79196 -79609 -80023 -79289
-10326 -79289 -78555 -81159 -83764 -82791 -81819 -80846 -79874 -79185 -78492 -77802 -77110 -75228 -73343 -73846 -74345 -73022 -71696 -72758 -73816
-10307 -73816 -73417 -73015 -72616 -72214 -73253 -74289 -76759 -79226 -78149 -77069 -75992 -74911 -75504 -76092 -76685 -77273 -76376 -75474 -76960
-10288 -76960 -78443 -78611 -78779 -76562 -74345 -72188 -70031 -70258 -70485 -71607 -72728 -73730 -71871 -75198 -73756 -71480 -69204 -68343
-10270f8343Q61n70n70j703j703J636J635k358k358r28r28lmmmL331L331r61r62K050K049
-10249f6506L479L480l003l003j572j572M55M54j930j930r94r95M36M36J121J121J122J121
-10231f8280j15j16J315J316j636j636j158J702M821N3N29N29n44n44n44n44k511k511k511
-10212g2385k511k46k46o7o7L76L237M311m58k873k872p86p86K6K6K6K6l253l252Q6Q5p8p4
-10189h1755p9p4R35R39m96m91J046J051J047J051J553J558k739k734l62l57K976K981K381
-10170g1569K384l819l815p04p00P26P30J01J04k939k936O29N399M147J289J464j397m44K422
-10151f8928J390l379n18n14J568J569J568J572m77m73l811l811M76M81j904j904J27J30J31
-10132g6707J30l837l834M58M59L57L58j073j073J341J341J342J341l13l13K071K072J028
$$ plain form
-10270 -68343 -67482 -68052 -68622 -70325 -72028 -70392 -68757 -71115 -73473 -74401 -75329 -75332 -75336 -75340 -75344 -72013 -68682 -69643 -70605 -68555 -66506
-10249 -66506 -63027 -59547 -62550 -65553 -67125 -68697 -68242 -67788 -69718 -71648 -72642 -73637 -73201 -72765 -71644 -70523 -69401 -68280
-10231 -68280 -68395 -68511 -67196 -65880 -67516 -69152 -70310 -68608 -63787 -63734 -63205 -62676 -63220 -63764 -64308 -64852 -67363 -69874 -72385
-10212 -72385 -74896 -75142 -75388 -75455 -75522 -75146 -71909 -67598 -68056 -70929 -73801 -74587 -75373 -75347 -75321 -75295 -75269 -78522 -81774 -81688 -81603 -81681 -81755
-10189 -81755 -81834 -81908 -80973 -80034 -80530 -81021 -79975 -78924 -77877 -76826 -75273 -73715 -76454 -79188 -79550 -79907 -76931 -73950 -71569
-10170 -71569 -69185 -73004 -76819 -77523 -78223 -77497 -76767 -76666 -76562 -79501 -82437 -81808 -76409 -72262 -70973 -69509 -70906 -71350 -68928
-10151 -68928 -67538 -70917 -71435 -71949 -70381 -68812 -67244 -65672 -66149 -66622 -70433 -74244 -73768 -73287 -75191 -77095 -76968 -76838 -76707
-10132 -76707 -76577 -80414 -84248 -83790 -83331 -82974 -82616 -83689 -84762 -83421 -82080 -80738 -79397 -79710 -80023 -77952 -75880 -74852
-10114g4852J028K817k906K6L0L007L010M258M262r87r83k023k020K269K273P19P23P19P22
-10095e7908N97N96N96O00Q34Q35j550j546j342j341R0R3j490j491j490j487j073j073L58
-10076f7192L62J698J699J699J703j19j20j19j15k325k325q94q90M008M009O71O74j893j892
-10057f1361j893j889M47M47M48M50J789J788r54r50L733j989J229J233m69m69m70m66J394
-10038e7952J393J394J397p53p52p53p49k094k094k093k094J870J870n14n14N44N44N44N44
-10019f0262J259J259J260J259j006j006J379J378J27J26J27J27j498j498o7o7j26j27L211
-10000e4145L212m32m32m33m32j833j833k906k906k183L539N447K586j885R76K526K526O18
-9982d7990O19l674l673O78O78l674q12K951k772j759j758j788j789j788j788L014L014k768
$$ plain form
-10114 -74852 -73824 -71007 -73913 -73887 -73857 -70850 -67840 -63582 -59320 -60307 -61290 -63313 -65333 -63064 -60791 -60072 -59349 -58630 -57908
-10095 -57908 -57311 -56715 -56119 -55519 -54685 -53850 -55400 -56946 -58288 -59629 -59539 -59446 -60936 -62427 -63917 -65404 -66477 -67550 -67192
-10076 -67192 -66830 -65132 -63433 -61734 -60031 -60150 -60270 -60389 -60504 -62829 -65154 -66048 -66938 -62930 -58921 -58250 -57576 -59469 -61361
-10057 -61361 -63254 -65143 -64696 -64249 -63801 -63351 -61562 -59774 -60728 -61678 -57945 -59934 -58705 -57472 -57941 -58410 -58880 -59346 -57952
-10038 -57952 -56559 -55165 -53768 -54521 -55273 -56026 -56775 -58869 -60963 -63056 -65150 -63280 -61410 -61924 -62438 -61894 -61350 -60806 -60262
-10019 -60262 -59003 -57744 -56484 -55225 -56231 -57237 -55858 -54480 -54353 -54227 -54100 -53973 -55471 -56969 -57036 -57103 -57229 -57356 -54145
-10000 -54145 -50933 -51365 -51797 -52230 -52662 -54495 -56328 -59234 -62140 -64323 -60784 -55337 -52751 -54636 -53660 -51134 -48608 -47990
-9982 -47990 -47371 -51045 -54718 -54040 -53362 -57036 -57848 -54897 -57669 -59428 -61186 -62974 -64763 -66551 -68339 -65325 -62311 -65079
-9964f5079K954M713J852M80M81q16q16J569J568n48n47n48n48j710j710O75O74j025j024
-9945e9405K313K314J256J255j129j129l83l84J047J047J043J047J047J047l58l54l334l335
-9927e6395N22O248L46k515j535j531m094m095J5J9J8J9K012K015N85N85k846k843m58m58
-9907f4386p60p57K582K582p97p94k224k224J527J531J01J01j12j08l446l447J498J502q83
-9888f8514q83k09k05K12L074K832k888k887K835J058j799J67J68j5j1j442j442J427J431
-9869f7091m%q98q94K440K444j874j870K418K422R27R32R27R32l39l35l40l35R73R76j412
-9848f0001j409k544k541K701K705k724k719O14O19R50R54m81m77K65K68L483k235j814j811
-9829f6197p41p38J881J885M51M55j218j215j218j215K031K034j308j304J375J378j963j960
$$ plain form
-9964 -65079 -62125 -57412 -55560 -55080 -54599 -55415 -56231 -54662 -53094 -53642 -54189 -54737 -55285 -56995 -58705 -58030 -57356 -58381 -59405
-9945 -59405 -57092 -54778 -53522 -52267 -53396 -54525 -54908 -55292 -54245 -53198 -52155 -51108 -50061 -49014 -49372 -49726 -53060 -56395
-9927 -56395 -55873 -49625 -49279 -51794 -53329 -54860 -58954 -63049 -63034 -63015 -62997 -62978 -60966 -58951 -58366 -57781 -60627 -63470 -63928 -64386
-9907 -64386 -65146 -65903 -63321 -60739 -61536 -62330 -64554 -66778 -65251 -63720 -63619 -63518 -63630 -63738 -67184 -70631 -69133 -67631 -68514
-9888 -68514 -69397 -69606 -69811 -69599 -66525 -63693 -66581 -69468 -66633 -65575 -67374 -67207 -67039 -67054 -67065 -68507 -69949 -68522 -67091
-9869 -67091 -67095 -67095 -67993 -68887 -66447 -64003 -65877 -67747 -65329 -62907 -61980 -61048 -60121 -59189 -59528 -59863 -60203 -60538 -59565 -58589 -60001
-9848 -60001 -61410 -63954 -66495 -63794 -61089 -63813 -66532 -65918 -65299 -64349 -63395 -63876 -64353 -64088 -63820 -60337 -62572 -64386 -66197
-9829 -66197 -66938 -67676 -65795 -63910 -63459 -63004 -64222 -65437 -66655 -67870 -65839 -63805 -65113 -66417 -65042 -63664 -65627 -67587
-9811f7587l662l659M445M448m02m02m03l98M91M92M92M96P4P5n172n167q79q80N52N55N66
-9790g5925N67N66N70K712K712L28L32k146k146k146k142K354K355N573j45M21M21O4O3M21
-9770f5191M21j964j963k649k649O89O90l84l84O89O90J255m467J83J82O60O59K090K090N70
-9750f8783N70L909L908n93n92n92n93n88n85k020k015m99m96m99m96k01j97k02j97K779K783
-9729f5199K661l059k310k306j774L953K191o67j34j31Q05Q09Q04Q09j79j75J252J255P68
-9710f0627P71o63o60j169j167k541n398k750K977J364j494k154P12L50L54K61K65K60K65
-9691g1044P08P11j676j673j244j241K094K097J975J978m10m06J606J606p79p79n70n70n70
-9672f8187n70J971J971l54l215n033O89J583J584q61q61J524J524Q38Q39K268K269M29M28
$$ plain form
-9811 -67587 -71249 -74908 -70463 -66015 -66417 -66819 -67222 -67620 -67129 -66637 -66145 -65649 -65575 -65500 -70672 -75839 -76718 -77598 -77046 -76491 -75925
-9790 -75925 -75358 -74792 -74222 -71510 -68798 -68470 -68138 -70284 -72430 -74576 -76718 -74364 -72009 -66436 -66581 -66160 -65739 -65675 -65612 -65191
-9770 -65191 -64770 -66734 -68697 -71346 -73995 -73306 -72616 -73000 -73384 -72695 -72005 -70750 -75217 -75034 -74852 -74192 -73533 -71443 -69353 -68783
-9750 -68783 -68213 -64304 -60396 -60989 -61581 -62173 -62766 -63354 -63939 -65959 -67974 -68473 -68969 -69468 -69964 -70165 -70362 -70564 -70761 -67982 -65199
-9729 -65199 -62538 -65597 -67907 -70213 -71987 -68034 -65843 -66510 -66644 -66775 -65970 -65161 -64357 -63548 -63727 -63902 -62650 -61395 -60627
-9710 -60627 -59856 -60519 -61179 -62348 -63515 -66056 -71454 -74204 -71227 -69863 -71357 -73511 -72799 -72449 -72095 -71834 -71569 -71309 -71044
-9691 -71044 -70336 -69625 -71301 -72974 -74218 -75459 -73365 -71268 -69293 -67315 -67725 -68131 -66525 -64919 -65698 -66477 -67047 -67617 -68187
-9672 -68187 -68757 -66786 -64815 -65169 -68384 -73417 -72728 -71145 -69561 -70422 -71283 -69759 -68235 -67397 -66558 -64290 -62021 -61592 -61164
-9653f1164M29M28k761k760l77l76j796j795J542J542j378j379J006J006k675k675j11j12
-9635g3406K660N521L614k109K76k585k765R7j781J081J080J080K415K414r84J878K861k861
-9617f1514k682L040J993J997r84r83M43M47j639j639k172K600q2q2j844j841N44N44K515
-9598f1339K519q20q20j777j773J565J564K560K563j729j728q09q04k236k235m40m39m40m40
-9579f7058p37p38O93O93n44n44n44n44L867L868L390j379k384M77K623m054o557j788L57
-9560g0903L58n36n37n36n37M47M47L011L010J747M613J393l375j740j736o04o04K627K630
-9541f0825K452K451j278m135j870K898J494J498n89n88O59O63j721j721J434J438QPn03m99
-9521e8727m99n00l129l130p45p45n66n67n66n66j163j162J878J877Q65l905k831L0M165M165
$$ plain form
-9653 -61164 -60735 -60307 -63068 -65828 -66205 -66581 -68377 -70172 -68630 -67088 -68466 -69845 -68839 -67833 -70508 -73183 -73294 -73406
-9635 -73406 -70746 -65225 -61611 -63720 -63444 -66029 -68794 -68697 -70478 -69397 -68317 -67237 -64822 -62408 -63392 -61514 -58653 -61514
-9617 -61514 -64196 -61156 -59163 -57166 -58150 -59133 -58690 -58243 -59882 -61521 -63693 -61093 -61175 -61257 -63101 -64942 -64398 -63854 -61339
-9598 -61339 -58820 -59640 -60460 -62237 -64010 -62445 -60881 -58321 -55758 -57487 -59215 -60024 -60828 -63064 -65299 -65739 -66178 -66618 -67058
-9579 -67058 -67795 -68533 -67840 -67147 -67691 -68235 -68779 -69323 -65456 -61588 -58198 -59577 -61961 -61484 -58861 -62915 -69472 -71260 -70903
-9560 -70903 -70545 -71081 -71618 -72154 -72691 -72244 -71797 -68786 -65776 -64029 -59416 -58023 -61398 -63138 -64874 -65478 -66082 -63455 -60825
-9541 -60825 -58373 -55922 -57200 -61335 -63205 -60307 -58813 -57315 -57904 -58492 -57833 -57170 -58891 -60612 -59178 -57740 -57732 -57725 -58228 -58727
-9521 -58727 -59226 -59726 -62855 -65985 -66730 -67475 -68041 -68608 -69174 -69740 -70903 -72065 -70187 -68310 -67445 -71350 -74181 -74151 -69986 -65821
-9501f5821J006J006J811J810J334l435n357k497Q42Q42K661K660K75K76N33N36N33N37M43
-9482f0005M47r87r84j628j624j98j94J502J505P1P4j605j602j606j602K239K243Q08Q12k224
-9462f4558k220J60J64R05R09K336K340j248j248j248j248q31q31q31q31j762j762L483L484
-9443f4837l104l103l938J784L402L401J375J375j963j964K329K328K060K061l24l24j576
-9426f1018j576j46j45j151j151j032M694R05R06J263J266r27r28k358k355J635J636L424
-9408e7058k295Q68Q68L729j989k619k619n93n88l24l25J107J110K42K43K42K46j442j442
-9389f2639R42R47p56p57p56p53k87k86k87k83j241j241K098K101K522K523J37J42j889j889
-9369f1652M311M314J01J00j330j326k612k611P26P30K31K31K31K35j826j825j826j822J021
$$ plain form
-9501 -65821 -64815 -63809 -61998 -60188 -58854 -62289 -67646 -70143 -69301 -68459 -65798 -63138 -62863 -62587 -62054 -61518 -60985 -60448 -60005
-9482 -60005 -59558 -60545 -61529 -63157 -64781 -64979 -65173 -63671 -62166 -62095 -62021 -63626 -65228 -66834 -68436 -66197 -63954 -63146 -62334 -64558
-9462 -64558 -66778 -66618 -66454 -65549 -64640 -62304 -59964 -61212 -62460 -63708 -64956 -65787 -66618 -67449 -68280 -70042 -71804 -68321 -64837
-9443 -64837 -67941 -71044 -74982 -73198 -69796 -66395 -65020 -63645 -65608 -67572 -65243 -62915 -60855 -58794 -59118 -59442 -61018
-9426 -61018 -62594 -62740 -62885 -64036 -65187 -66219 -61525 -60620 -59714 -58451 -57185 -58112 -59040 -61398 -63753 -62118 -60482 -57058
-9408 -57058 -59353 -58485 -57617 -53888 -55877 -58496 -61115 -61708 -62296 -62620 -62945 -61838 -60728 -60486 -60243 -60001 -59755 -61197 -62639
-9389 -62639 -61697 -60750 -61506 -62263 -63019 -63772 -64059 -64345 -64632 -64915 -66156 -67397 -65299 -63198 -60676 -58153 -58016 -57874 -59763 -61652
-9369 -61652 -57341 -53027 -52926 -52826 -54156 -55482 -58094 -60705 -59979 -59249 -59018 -58787 -58556 -58321 -60147 -61972 -63798 -65620 -64599
-9350f4599J021J021J024r16r17J468J472P60P60P60P64r09r09r09r06j877j878J460J464
-9331f1846R84R84R83R87l91l87J039J043n99n96k031k027r12r10J472J475J830J833l417
-9312f0486l412L103L107M892q27j576j572k768K958O00O03R58R61n6n2n6n2k888k887n03
-9292e9953n03L879L878m14m13K313K314k038Q24K552l171j799j800l580K142J904J904Q30
-9274e1131m891j733L990K321n40m474j613J069J069j136j137K02K05K227K232K91n429n253
-9256f3731k388k90k87j12j08J706J710L495k224K16K20K242K247k61k57k61k57j095j092
-9237f0527j095j092J468J472K898K903N40N40q90q91j576j576j933j934J725l997o60N063
-9219e9562l91l91l4l3P71P71P71P72k13k12k12k13l98l99J032J032J241J240l051l051j647
$$ plain form
-9350 -64599 -63578 -62557 -61533 -62449 -63366 -61898 -60426 -59666 -58906 -58146 -57382 -58291 -59200 -60109 -61015 -62892 -64770 -63310 -61846
-9331 -61846 -60862 -59878 -58895 -57908 -58299 -58686 -57647 -56604 -57203 -57799 -59830 -61857 -62769 -63679 -62207 -60732 -58902 -57069 -60486
-9312 -60486 -63898 -60795 -57688 -52796 -53623 -55199 -56771 -59539 -56581 -55981 -55378 -54420 -53459 -53515 -53567 -53623 -53675 -56563 -59450 -59953
-9292 -59953 -60456 -56577 -52699 -53113 -53526 -51213 -48899 -50937 -50113 -47561 -50732 -52531 -54331 -57911 -55769 -53865 -51961 -51131
-9274 -51131 -56022 -57755 -53765 -51444 -51984 -56458 -58071 -57002 -55933 -57069 -58206 -58004 -57799 -55572 -53340 -53049 -58478 -63731
-9256 -63731 -66119 -66409 -66696 -66808 -66916 -65210 -63500 -60005 -62229 -62013 -61793 -59551 -57304 -57565 -57822 -58083 -58340 -59435 -60527
-9237 -60527 -61622 -62714 -61246 -59774 -56876 -53973 -53433 -52893 -53783 -54674 -56250 -57826 -59759 -61693 -59968 -63965 -64625 -59562
-9219 -59562 -59953 -60344 -60378 -60411 -59640 -58869 -58098 -57326 -57539 -57751 -57963 -58176 -58574 -58973 -57941 -56909 -55668 -54428 -57479 -60530 -62177
-9198f2177j643P41P42K764K768J338J337n21n18k902k903J178J181L565L566j94j90j90j90
-9179e2248R09R13n18n18j692j687O96O97J885J889M58M59l756l755N36N37J967J967J967
-9160d9294J967K69K68K68K68n514n514k68k68m32m32J952J952K459K459K101K101K593l129
-9141d6194m203m202j401j401L0L0J531J535J531J535j300j297K992K996R27R32K000K005
-9123d1954K179l539j755j751q46q45J538J539J241J240j501j502M713j009j129j129j695
-9106d6205j695j517j516k057Q09M560k112J19K984m77l334J319j539k496K276J259O032J736
-9088d1854l029r79J881K835K835N70N70m198j338P49m020m020m020M21M21L282L283l62l61
-9069d7334j792j788j345j345l92K474M557k13k120k116K888K887L841O706L499j271j270
$$ plain form
-9198 -62177 -63820 -63079 -62337 -59573 -56805 -55467 -54130 -54651 -55169 -58071 -60974 -59796 -58615 -55050 -51484 -51678 -51868 -52058 -52248
-9179 -52248 -51339 -50426 -50944 -51462 -53154 -54841 -54145 -53448 -51563 -49674 -49216 -48757 -52513 -56268 -55732 -55195 -53228 -51261 -49294
-9160 -49294 -47327 -47058 -46790 -46522 -46254 -51768 -57282 -57550 -57818 -58250 -58682 -56730 -54778 -52319 -49860 -47759 -45658 -43065 -46194
-9141 -46194 -50397 -54599 -56000 -57401 -57371 -57341 -55810 -54275 -52744 -51209 -52509 -53806 -50814 -47818 -46891 -45959 -43959 -41954
-9123 -41954 -39775 -43314 -45069 -46820 -47666 -48511 -46973 -45434 -44193 -42953 -44454 -45956 -41243 -42252 -43381 -44510 -46205
-9106 -46205 -47900 -49417 -50933 -52990 -52181 -47621 -49733 -49614 -46630 -47107 -50441 -49122 -50661 -53157 -50881 -49622 -43590 -41854
-9088 -41854 -44883 -45862 -43981 -41146 -38311 -37741 -37171 -41369 -42707 -41958 -45978 -49998 -54018 -53597 -53176 -49894 -46611 -46973 -47334
-9069 -47334 -49126 -50914 -52259 -53604 -53996 -51522 -46965 -47178 -49298 -51414 -48526 -45639 -41798 -35092 -31593 -32864 -34134
-9052c4134j267J233J234J233J237K395K396m66m62L886L886O747O751R417R419P868N008
-9035B6381K563k206o497r359j2100r240n961l099l041l040m649r419n517p49J039J040J844
-9018d2010J844J844J844K65K64j166j166Q6Q6K947K947q24q19k251k250p94p89O40O41m66
-8998c9127m61R68R69K157K161P30P30J219J222k09k09l01k98k99k98P05P07J960k809j650
-8978c2133j647O18O19L919q49q50L920P60P60J058J058n44n44n44n44K824K824l7l7m374
-8958b3743m374k943k944K76K76j155j155M895M896K034K034k794k794k795k794j367j367
-8941c5814K42K42n63K299O233J464L357L357j770q446l945l946M06M06J87J86J617J617L018
-8922b9853L017J57J56l040l040J729J729j312j311j312j311l88l83K477K478K98L02j129
$$ plain form
-9052 -34134 -35401 -34168 -32934 -31701 -30464 -28069 -25673 -26139 -26601 -22715 -18829 -12082 -5331 4086 13505 21373 26381
-9035 26381 28944 26738 20241 10882 -1218 -10458 -16419 -19518 -22559 -25599 -30248 -39667 -45184 -45933 -44894 -43854 -42010
-9018 -42010 -40166 -38322 -36478 -36213 -35949 -37115 -38281 -38195 -38109 -35162 -32215 -33039 -33858 -36109 -38359 -39153 -39942 -39302 -38661 -39127
-8998 -39127 -39588 -38620 -37651 -35494 -33333 -32603 -31873 -30654 -29432 -29641 -29850 -30151 -30449 -30748 -31046 -30341 -29634 -27674 -30483 -32133
-8978 -32133 -33780 -33162 -32543 -28624 -29473 -30323 -26403 -25643 -24883 -23825 -22767 -23311 -23855 -24399 -24943 -22119 -19295 -19332 -19369 -23743
-8958 -23743 -28117 -31060 -34004 -33728 -33452 -34607 -35762 -30867 -25971 -23937 -21903 -24697 -27491 -30286 -33080 -34447 -35814
-8941 -35814 -35572 -35330 -35893 -33594 -27361 -25897 -22540 -19183 -20953 -29399 -33344 -37290 -36884 -36478 -36291 -36105 -34488 -32871 -29853
-8922 -29853 -26836 -26679 -26523 -29563 -32603 -30874 -29145 -30457 -31768 -33080 -34391 -34779 -35162 -32685 -30207 -29909 -29607 -30736
-8904c0736j129j021j017l879l878Q2Q6K947K947J497J502J322J323K16k641j152L618J036
-8886b8877l730r27J933j229j226L84L84K090K094p72p67N70N74N70N73l68l66l68l66O45
-8866b9179O48O45O48m10m06l271l267o49o44o48o45K869K872QJ1J647J650m40n204l659l658
-8845d1082L35L35L793L793L792L793J915J915k377k377j036j035K302K302O86O86J758J759
-8827a8743K950k772k891k891j103j102m441m441%%J430J431N66N70N67N70j312j308k742
-8808c5662k738L338L342R54R57J79J83j252j248r54r50L338L342r83r80r84r80M32M36j952
-8788c2182j948o11o08o11o07j30j27j30j27K27K31M877q42J181J185j204j199k903K825l99
-8768c3102l95j781j777l50l47J230J233K660K664j654j651k23k20j386j382M4M9K306K310
$$ plain form
-8904 -30736 -31865 -32886 -33903 -37782 -41660 -41578 -41492 -38545 -35598 -34101 -32599 -31277 -29954 -29738 -32379 -33531 -29913 -28877
-8886 -28877 -32607 -33534 -31601 -32830 -34056 -33672 -33288 -31198 -29104 -29876 -30643 -30073 -29499 -28929 -28356 -28724 -29090 -29458 -29824 -29179
-8866 -29179 -28531 -27886 -27238 -27648 -28054 -31325 -34592 -35241 -35885 -36533 -37178 -34309 -31437 -31429 -31418 -29771 -28121 -28561 -33765 -37424 -41082
-8845 -41082 -40747 -40412 -36619 -32826 -29034 -25241 -23326 -21411 -23788 -26165 -27201 -28236 -25934 -23632 -22946 -22260 -20502 -18743
-8827 -18743 -15793 -18565 -21456 -24347 -25450 -26552 -30993 -35434 -35434 -35434 -34004 -32573 -32007 -31437 -30870 -30300 -31612 -32920 -35662
-8808 -35662 -38400 -35062 -31720 -30766 -29809 -29630 -29447 -30699 -31947 -32901 -33851 -30513 -27171 -28154 -29134 -30118 -31098 -30666 -30230 -32182
-8788 -32182 -34130 -34741 -35349 -35960 -36567 -36697 -36824 -36954 -37081 -36854 -36623 -31746 -32588 -31407 -30222 -31426 -32625 -35528 -32703 -33102
-8768 -33102 -33497 -35278 -37055 -37405 -37752 -36522 -35289 -32629 -29965 -31619 -33270 -33493 -33713 -35099 -36481 -36437 -36388 -34082 -31772
-8749c1772K306K310J01J04j330j326O44O48O45O48o37o33o37o34j337j334j338j333q61q57
-8729c6623N70N74K12K16J643J647MPMPK851K850m88m85o37o37k068k064J256J255k082k079
-8707c4067n03n03n03m99L338L338%Ml547l547P45P49L43L43J773J777K638K638K638K641
-8687b0204j323j322K015K020N25N25J956J960J181J181L864r02L76L77n168n164j430j431
-8669b0964k682K090J132J133%MJ400J401l0k6R0Q9m977k05J185J188N2N6l95l91l95l91j140
-8646b1776j136K90K94P08P12M046M050j300j297j300j297K604K608p34p30L09L13K694K697
-8627h245l505l503P87P89M07M06j025j024P63P64P64P64R12R13R13R13j532j531k962k962
-8607a7194J714J714o71o70K846K847M62M62k698k697O41O40l13l12K071K071L372L376L7
$$ plain form
-8749 -31772 -29466 -27156 -27055 -26951 -28281 -29607 -28963 -28315 -27670 -27022 -27659 -28292 -28929 -29563 -30900 -32234 -33572 -34905 -35766 -36623
-8729 -36623 -36053 -35479 -35267 -35051 -33408 -31761 -31757 -31750 -31746 -31739 -28888 -26038 -26526 -27011 -27648 -28285 -30353 -32417 -31161 -29906 -31988 -34067
-8707 -34067 -34570 -35073 -35576 -36075 -32737 -29399 -29399 -29395 -32942 -36489 -35744 -34995 -34652 -34309 -32536 -30759 -28121 -25483 -22845 -20204
-8687 -20204 -21527 -22849 -20834 -18814 -18289 -17764 -15808 -13848 -12667 -11486 -7622 -8524 -8148 -7771 -12939 -18103 -19533 -20964
-8669 -20964 -23646 -21556 -20424 -19291 -19291 -19287 -17887 -16486 -16516 -16542 -16452 -16363 -21340 -21545 -20360 -19172 -19120 -19064 -19459 -19850 -20245 -20636 -21776
-8646 -21776 -22912 -22622 -22328 -21620 -20908 -16862 -12812 -14112 -15409 -16709 -18006 -15402 -12794 -13528 -14258 -13949 -13636 -10942 -8245
-8627 -8245 -11750 -15253 -14466 -13677 -13270 -12864 -13889 -14913 -14150 -13386 -12622 -11858 -10946 -10033 -9120 -8207 -9739 -11270 -14232 -17194
-8607 -17194 -15480 -13766 -14437 -15107 -12261 -9414 -8952 -8490 -11188 -13885 -13244 -12604 -12917 -13229 -11158 -9087 -5715 -2339 -2302
-8588b302L7j576j572J766J766N40N44q87q86j76j71K213K212K925K928N44N44k64k61j692
-8568F232j691Q68Q72Q72Q71J584J587L971L972j542j539j543j538K988K991J558J561K749
-8550B4823K754K749K753K005K008l80l76J326J330L711L714K936K940K935K940L264L267
-8533F4699L264L267O006O009M575M579N041N045R694R694J1717J7443J2198J2198J4668K0394
-8517B10491K9813L5535M6738O3910Q5608J18036J59902J92333J91379J43691L8892p7464
-8505A238864j77132k21006k14541j74480j28222q8164n4249l7078k6586k0864j6270j0543
-8493F9729o848o848n063O63l986l987o315o311m881m880o196o192k854k854J319J323j658
-8476D161j658m760R64J31J30K16K20J650J650l061l059j628j628J967J971m14m13n37n33
$$ plain form
-8588 -2302 -2265 -3841 -5413 -3647 -1881 -1341 -797 -1684 -2570 -2746 -2917 -704 1508 4433 7361 7905 8449 8185 7924 6232
-8568 6232 4541 5409 6281 7153 8024 9608 11195 15166 19138 17596 16057 14514 12976 15964 18955 20513 22074 24823
-8550 24823 27577 30326 33079 35084 37092 36712 36336 37662 38992 42703 46417 49353 52293 55228 58168 61432 64699
-8533 64699 67963 71230 77236 83245 87820 92399 97440 102485 112179 121873 133590 151033 163231 175429 190097 210491
-8517 210491 240304 275839 322577 386487 472095 590131 750033 942366 1133745 1277436 1316328 1238864
-8505 1238864 1061732 840726 626185 451705 323483 235319 181070 143992 117406 96542 80272 69729
-8493 69729 62881 56033 50970 51633 47647 43660 37345 31034 26153 21273 15077 8885 6031 3177 4496 5819 4161
-8476 4161 2503 -2257 -1293 -1162 -1032 -816 -596 1054 2704 -357 -3416 -5044 -6672 -4705 -2734 -3148 -3561 -4098 -4631
-8457d631j665j665n157l83J225J226k504k500j069j069M84M88M88M88k198k194k194k195
-8439b5025m061m057J188J189K258K261j077j076j31j26j31j26J210J215j174j170j158j155
-8421c1146K179K184q6q2K299K302j483j479k913k910k01j98K184K187R91R94R91R95j542
-8402b4734j539J796J799J207J211k23k20P4P9P4P8j803j799j804j799L055L059L055L059
-8383a5375j35j30k519k514m456m452j118j114K831K836n07n03K921K925N36N40p00o97o97
-8364b2328o96o11o08k037k038K08K13K596K597J997K001j338j337L80L84K768K768N59N62
-8345a3960J040L900L898q69k954r3l852l849J576J576K552K556p83p82M36M39M40M40j651
-8326i940j646J691J691M162M164Q27Q27j936j934L312L312P15P19P19P19K489K492L506k217
$$ plain form
-8457 -4631 -6296 -7961 -13118 -13501 -12276 -11050 -13554 -16054 -17123 -18192 -17708 -17220 -16732 -16244 -18442 -20636 -22830 -25025
-8439 -25025 -29086 -33143 -31955 -30766 -28508 -26247 -27324 -28400 -28531 -28657 -28788 -28914 -27704 -26489 -27663 -28833 -29991 -31146
-8421 -31146 -28967 -26783 -26869 -26951 -24652 -22350 -23833 -25312 -28225 -31135 -31336 -31534 -29350 -27163 -26172 -25178 -24187 -23192 -24734
-8402 -24734 -26273 -24477 -22678 -21471 -20260 -20483 -20703 -20629 -20550 -20476 -20398 -22201 -24000 -25804 -27603 -24548 -21489 -18434 -15375
-8383 -15375 -15510 -15640 -18159 -20673 -25129 -29581 -30699 -31813 -28982 -26146 -26653 -27156 -24235 -21310 -20774 -20234 -20934 -21631 -22328
-8364 -22328 -23024 -23635 -24243 -26280 -28318 -28110 -27897 -25301 -22704 -20707 -18706 -20044 -21381 -21001 -20617 -17849 -15081 -14522 -13960
-8345 -13960 -12920 -9020 -5122 -5991 -8945 -9038 -12890 -16739 -15163 -13587 -11035 -8479 -9262 -10044 -9608 -9169 -8729 -8289 -9940
-8326 -9940 -11586 -9895 -8204 -4042 122 949 1776 -160 -2094 1218 4530 5245 5964 6683 7402 9891 12383 15889 13672
-8307A3672j803J062r05r06K54K53J684J684J773J774L43L42J342J341K772K772L57L58J788
-8288B9957J789O63O63O63O63K332K333K332K332j907j908M292M292J312J311J311J312K064
-8270E5806K064M448M449O33O33K064K064L205L204L204L204N111N112O542O542L905L904
-8253A16094L905L904M859M858O289O289Q941Q942Q941Q942J1475J1475J0223J0223J0585
-8238B35945J3446J5949K1676K6083K8945L2164L2167L2551L5412M4771N8128Q2683J11297
-8225G71217J45632K00954K61123L54593N10534P14643P47366L33431k80318p47661q01939
-8214B209575o35983m80043l33159k05179j26970q1130n6328m5599l5103k8847k2168j7432
-8202A41634q845l722o579j3916j6773j3438j6296j5346j0573j0101j0096m329m326m329m325
$$ plain form
-8307 13672 11869 12931 12026 11120 11374 11627 13311 14995 16768 18542 18885 19227 20569 21910 24682 27454 27811 28169 29957
-8288 29957 31746 32409 33072 33735 34398 36730 39063 41395 43727 41820 39912 44204 48496 49808 51119 52430 53742 55806
-8270 55806 57870 62318 66767 67400 68033 70097 72161 75366 78570 81774 84978 90089 95201 101743 108285 112190 116094
-8253 116094 119999 123903 128762 133620 139909 146198 155139 164081 173022 181964 193439 204914 215137 225360 235945
-8238 235945 249391 265340 287016 313099 342044 374208 406375 438926 474338 519109 577237 659920 771217
-8225 771217 916849 1117803 1378926 1733519 2244053 2958696 3706062 4039493 3759175 3011514 2209575
-8214 2209575 1573592 1093549 760390 555211 428241 347111 290783 245184 210081 181234 159066 141634
-8202 141634 132789 129067 122488 108572 91799 78361 62065 46719 36146 26045 15949 11620 7294 2965 -1360
-8187a360o93o89o93o89L122L125P38P41m84m81k868k865k336k332N2N2l111l107l107l107
-8167b0092P19P23P22P23j75j71J259J259K42K46j184j185J971J974m225m224o658o654M99
-8148c4231M99j90j86j86j87l144l145p60p60K042K042K041K042k53k54J178J177m217m218
-8129d0710q79q79K529K530J099J099O22O23k418k418j345L424M079M080J099J099n101n100
-8111c6567k761k760K485K485L021L022l17l17K992K992O07O07R65R65L349L350R83R88j401
-8092a5312j397N06N11j878j874K46K50l093l088J110J114J110J114n134n134J12J12K90K91
-8073c0144K91K90J073J073l57l58j49j49j49j49J155J158P98Q01L509k209J006J010k027
-8054b3527k023m411m408l0k6j460j457K504K503j788j788k69k68J163J162J766J766J408
$$ plain form
-8187 -1360 -2053 -2742 -3435 -4124 -1002 2123 2861 3602 3118 2637 -231 -3096 -5432 -7764 -7712 -7660 -10771 -13878 -16985 -20092
-8167 -20092 -19373 -18650 -17928 -17205 -17380 -17551 -16292 -15033 -14791 -14545 -15729 -16914 -14943 -12969 -17194 -21418 -28076 -34730 -34231
-8148 -34231 -33732 -33922 -34108 -34294 -34481 -37625 -40770 -41530 -42290 -40248 -38206 -36165 -34123 -34376 -34630 -33452 -32275 -36492 -40710
-8129 -40710 -41589 -42468 -39939 -37409 -36310 -35211 -34589 -33966 -36384 -38802 -40147 -36723 -32644 -28564 -27465 -26366 -31467 -36567
-8111 -36567 -39328 -42088 -39603 -37118 -34097 -31075 -31392 -31709 -28717 -25725 -25118 -24511 -23546 -22581 -19232 -15882 -14899 -13911 -15312
-8092 -15312 -16709 -16203 -15692 -17570 -19444 -19198 -18948 -22041 -25129 -24019 -22905 -21795 -20681 -25815 -30949 -30837 -30725 -30435 -30144
-8073 -30144 -29853 -29563 -28490 -27417 -27774 -28132 -28281 -28430 -28579 -28728 -27573 -26415 -25617 -24816 -21307 -23516 -22510 -21500 -23527
-8054 -23527 -25550 -29961 -34369 -34399 -34425 -35885 -37342 -34838 -32335 -34123 -35911 -36180 -36448 -35285 -34123 -32357 -30591 -29183
-8036b9183J409J974l748k913k914j930j930m99m99J170J170K004l718l525l524k452k451
-8019e1559l7l8l7l7P08P08p23p19M10M10p83M944J945l778k01j98N15N14N14N18K693K698
-7997d1533L532k191l476l472l711K012K827K832Q05Q04K35K39K38K39k132k127O15O15l115
-7978d6764K612J777J777K056K061O29O30k444k440j010j010J129J129J129J133J248J248
-7961c5110j137j132l91l92l91l87J158J159Q6n633J006J005L51L50L182j588m150m150k720
-7942d8884k720k064K705l35l36k421k422m92m91J892J893L800L800M62M62l50l50K988K988
-7923c9875n89n89J796J796J013J017j367j367l309l304L3L4R61R65R65R65J468J471M1M1
-7903c7834q42q38N92N93r91r88l371l372k064k060m743K6K735K738L54L54N555P86j658J207
$$ plain form
-8036 -29183 -27774 -25800 -29548 -32461 -35375 -37305 -39235 -39734 -40233 -39063 -37893 -35889 -39607 -43132 -46656 -49108 -51559
-8019 -51559 -51596 -51634 -51671 -51708 -51000 -50292 -51015 -51734 -51324 -50914 -51697 -46753 -44808 -48586 -48787 -48985 -48470 -47956 -47442 -46924 -44231 -41533
-7997 -41533 -38001 -40192 -43668 -47140 -50851 -48839 -46012 -43180 -42375 -41571 -41336 -41097 -40859 -40620 -42752 -44879 -44264 -43649 -46764
-7978 -46764 -44152 -42375 -40598 -38542 -36481 -35852 -35222 -37666 -40106 -41116 -42126 -40997 -39868 -38739 -37606 -36358 -35110
-7961 -35110 -36247 -37379 -37770 -38162 -38553 -38940 -37782 -36623 -36537 -42170 -41164 -40159 -39808 -39458 -36276 -37864 -42014 -46164 -48884
-7942 -48884 -51604 -53668 -50963 -51298 -51634 -54055 -56477 -56969 -57460 -55568 -53675 -49875 -46075 -45613 -45151 -45501 -45851 -42863 -39875
-7923 -39875 -40464 -41053 -39257 -37461 -36448 -35431 -36798 -38165 -41474 -44778 -44745 -44711 -43750 -42785 -41820 -40855 -39387 -37916 -37875 -37834
-7903 -37834 -38676 -39514 -38922 -38329 -39320 -40308 -43679 -47051 -49115 -51175 -55918 -55892 -53157 -50419 -50065 -49711 -44156 -43370 -45028 -43821
-7883d3821J353j509k940p4K097p64j956K817K902j866J114J117M96M95M96M99j054j054l439
-7864d5091l435l69l69J062J065l39l39l39l35Q57Q60n73n70J41J46J41J45j929j927K362
-7844d8836K366K213K217K034K038L0k828l725J046j19K746%MM69M73M70M73K91K94K90K95
-7823c7759m47m44j874j874k772k768l83l84J334J337J338J337J125J129k090P71M091J233
-7805c7100j270j271k496k492P0P1j013J852J851j009m084m079p42p41r99J863J863J863J922
-7786d5941M784M92k370R91R91j572j572j841j840m523K46J006J006J483j379O48O49K257
-7768d6485o03j736J125L331M69J364J363m25K437K288K287k779k780J185J185k154k153P45
-7750d1336P45L0O706Q852M084K712K712j617m478o207l345j468o237m985k124k198k198n89
$$ plain form
-7883 -43821 -42468 -43977 -46917 -46991 -44894 -45658 -47614 -44797 -41895 -43761 -42647 -41530 -41034 -40539 -40043 -39544 -40598 -41652 -45091
-7864 -45091 -48526 -48895 -49264 -48202 -47137 -47476 -47815 -48154 -48489 -47632 -46772 -47345 -47915 -47774 -47628 -47487 -47342 -49271 -51198 -48836
-7844 -48836 -46470 -44257 -42040 -40006 -37968 -37938 -40766 -44491 -43445 -43564 -40818 -40818 -40814 -40345 -39872 -39402 -38929 -38638 -38344 -38054 -37759
-7823 -37759 -38206 -38650 -40524 -42398 -45170 -47938 -48321 -48705 -47371 -46034 -44696 -43359 -42234 -41105 -43195 -42424 -38333 -37100
-7805 -37100 -38370 -39641 -42137 -44629 -44559 -44488 -45501 -43649 -41798 -42807 -46891 -50970 -51712 -52453 -53452 -51589 -49726 -47863 -45941
-7786 -45941 -41157 -40665 -43035 -42044 -41053 -42625 -44197 -46038 -47878 -52401 -52155 -51149 -50143 -48660 -50039 -49391 -48742 -46485
-7768 -46485 -47088 -48824 -47699 -44368 -43899 -42535 -41172 -41597 -39160 -36872 -34585 -37364 -40144 -38959 -37774 -39928 -42081 -41336
-7750 -41336 -40591 -40561 -33855 -25003 -20919 -18207 -15495 -17112 -21590 -27797 -31142 -32610 -38847 -43832 -45956 -48154 -50352 -50941
-7732e0941M181M090J230j155j155l498l499j114j114l09l09m423m422l208l46j777j777k314
-7714g1860N48J501J501J249M109M288J427n279k418L722L722L170L10j420j419m66m66K873
-7696e4908K872R50R50o203o199M43M43J874J878N25N26N25N29k79k80P94P97J866l856n286
-7676f2039M39J390J390L16L21p19p19l104l100J76J75L513L517J330J330M668M672L119L118
-7657d0207K999k720o74o74k463k459P57P56k582k578j94j94j624j621p30p30J058m661J244
-7638e7297J245j498j494l167l166J125J129r0q9J341J345N36N37N36N41K9L0J461J464J222
-7618e4260J222k116k113J770J770J769J774M58M58k522k519k455L268M8N2K28K27k157k154
-7599e7252J334J334J334J333J275J274J274J274k295k295q64q65j19j19J311J312J825J826
$$ plain form
-7732 -50941 -46760 -42670 -41440 -42595 -43750 -47248 -50747 -51861 -52975 -53284 -53593 -58016 -62438 -65646 -65992 -67769 -69546 -71860
-7714 -71860 -71312 -69811 -68310 -67061 -62952 -58664 -57237 -62516 -64934 -61212 -57490 -54320 -54010 -55430 -56849 -57315 -57781 -54908
-7696 -54908 -52036 -51086 -50136 -56339 -62538 -62095 -61652 -59778 -57900 -57375 -56849 -56324 -55795 -56074 -56354 -55560 -54763 -52897 -56753 -62039
-7676 -62039 -61600 -60210 -58820 -58504 -58183 -58902 -59621 -62725 -65825 -65649 -65474 -61961 -58444 -57114 -55784 -51116 -46444 -43325 -40207
-7657 -40207 -37208 -39928 -40602 -41276 -43739 -46198 -45441 -44685 -47267 -49845 -50039 -50233 -51857 -53478 -54208 -54938 -53880 -58541 -57297
-7638 -57297 -56052 -57550 -59044 -62211 -65377 -64252 -63123 -63213 -63302 -61961 -60616 -60080 -59543 -59007 -58466 -58437 -58407 -56946 -55482 -54260
-7618 -54260 -53038 -55154 -57267 -55497 -53727 -51958 -50184 -49726 -49268 -51790 -54309 -56764 -53496 -53448 -53396 -53168 -52941 -55098 -57252
-7599 -57252 -55918 -54584 -53250 -51917 -50642 -49368 -48094 -46820 -49115 -51410 -52274 -53139 -53258 -53377 -52066 -50754 -48929 -47103
-7581d7103n59n59l658l659j632M091L569L569J543J542J244J245j140j140k634k631k45k46
-7563d8403M519M523k631k630j337j334L7K899O859J140K46K45J971J975J975J974R3R7l241
-7544c1023l242k872k869M285M284M370M374M374M374K366K366M750M749J0115J0115J0116
-7528C0632J0115R653R653J1263N540mk865k865q588j1199j4061j4418j1557j0663j0661j0484
-7512b0509j0484q815q815j662j661j126j125j125j125l674l669j286j285J483J486N6N6J915
-7494f1365J919m66m66j572j568j38j38o74o71l711K012L469O333L353M92J636J639K891K891
-7475d4134k090k086K205K206J188J193J192J192k42k39k38k38O37O40j743j744j419j416
-7457d5136l800l800l432l431j047j043K351K351K351K354J341J342J162J166L249L87k652
$$ plain form
-7581 -47103 -47662 -48221 -51879 -55538 -57170 -53079 -49510 -45941 -44398 -42856 -41612 -40367 -41507 -42647 -45281 -47912 -48157 -48403
-7563 -48403 -43884 -39361 -41992 -44622 -45959 -47293 -47256 -44357 -37498 -36358 -36112 -35867 -33896 -31921 -29946 -27972 -27879 -27782 -31023
-7544 -31023 -34265 -37137 -40006 -35721 -31437 -27067 -22693 -18319 -13945 -11579 -9213 -4463 286 10401 20516 30632
-7528 30632 40747 50400 60053 71316 76856 76852 73987 71122 62534 51335 37274 22856 11299 636 -10025 -20509
-7512 -20509 -30993 -39808 -48623 -50285 -51946 -53072 -54197 -55322 -56447 -60121 -63790 -65076 -66361 -64878 -63392 -63336 -63280 -61365
-7494 -61365 -59446 -59912 -60378 -61950 -63518 -63656 -63794 -64468 -65139 -68850 -66838 -63369 -57036 -53683 -53191 -51555 -49916 -47025 -44134
-7475 -44134 -46224 -48310 -46105 -43899 -42711 -41518 -40326 -39134 -39376 -39615 -39853 -40091 -39454 -38814 -40557 -42301 -43720 -45136
-7457 -45136 -48936 -52736 -56168 -59599 -60646 -61689 -59338 -56987 -54636 -52282 -50941 -49599 -48437 -47271 -44022 -43635 -46287
-7440d6287L073j181j181k254k254R65R65P1n652o505l643j319j319o04o03k571L152M966
-7422f2181K109k20k16O74O78K105K109K478K481j814j811j576j572j576j572j506j501j505
-7404f4416j502J625J628p60p57J640J643J639J643J699J703J699J702K727K731l472l469
-7387e2297j773j770O11O15L562L565K131K135L919L924L621k098k362n223l197l35j885j885
-7369d8742O78O78L360L361j885j886J364J364M701M702J617J617J617J617O63O63K094K094
-7351b0323M77M77M77M76K981K980j311j311Q5R0L487k235n220k355q64J997J106j751L8L7
-7331b0662j725j721n060n059m244m240j855j855K433K436N775N775M623M627L36L35Q38Q42
-7313a8401Q42Q42L812L811K381K380j52j53l491l491m36m36j866j867M512M512J889l834
$$ plain form
-7440 -46287 -43214 -44395 -45576 -47830 -50084 -49119 -48154 -48083 -53735 -60240 -63883 -65202 -66521 -67125 -67728 -70299 -67147 -62181
-7422 -62181 -60072 -60292 -60508 -59834 -59156 -57051 -54942 -52464 -49983 -51797 -53608 -55184 -56756 -58332 -59904 -61410 -62911 -64416
-7404 -64416 -65918 -64293 -62665 -63425 -64182 -62542 -60899 -59260 -57617 -55918 -54215 -52516 -50814 -48087 -45356 -48828 -52297
-7387 -52297 -54070 -55840 -55229 -54614 -51052 -47487 -45356 -43221 -39302 -35378 -31757 -33855 -36217 -41440 -44637 -44972 -46857 -48742
-7369 -48742 -48064 -47386 -44026 -40665 -42550 -44436 -43072 -41708 -37007 -32305 -30688 -29071 -27454 -25837 -25174 -24511 -22417 -20323
-7351 -20323 -19846 -19369 -18892 -18416 -15435 -12455 -13766 -15077 -14992 -14902 -11415 -13650 -18870 -21225 -22089 -20092 -18986 -20737 -20699 -20662
-7331 -20662 -22387 -24108 -29168 -34227 -38471 -42711 -44566 -46421 -43988 -41552 -35777 -30002 -25379 -20752 -20416 -20081 -19243 -18401
-7313 -18401 -17559 -16717 -12905 -9094 -6713 -4333 -4485 -4638 -8129 -11620 -12056 -12492 -14358 -16225 -11713 -7201 -5312 -9146
-7295i146q53M873P074J356J144M009P283P288O121O125O121O125M065M068k27k24k626k627
-7277D9949j196j192K649K649K649K652L171L171j68j64j420j419R65R69p5p1p1p0L472L476
-7257F9926K045K046J863J866n18n18j535j531j531j531K954K955m44N280P127M266R87R91
-7239I4698j16j15K269K269M117M116P79P83L565L565M997M996O039O039O039O043P575P574
-7221A65232M236M236M177M176K746K749K858K861K858K861N331N336R623R627M020M024N450
-7204B42401N455O613O617O613O616L864L867K433K436J658J662N950N953O710O714O710O714
-7187C28986O382O385R721R724J0729J0730K623K623M053M054N484N488R284R285J2622J2623
-7171D50796J9239J9239J7809J7812J7652J7653J5267J5268J3479J3480J1095J1099J0632
$$ plain form
-7295 -9146 -9999 -5126 1948 3304 4448 8457 15740 23028 29149 35274 41395 47520 51585 55653 55426 55202 52576 49949
-7277 49949 48753 47561 50210 52859 55508 58160 61331 64502 64334 64170 62750 61331 62296 63265 63190 63119 63048 62978 66450 69926
-7257 69926 71971 74017 75880 77746 77228 76710 75175 73644 72113 70582 73536 76491 76047 81327 88454 92720 93707 94698
-7239 94698 94582 94467 96736 99005 103122 107238 108017 108800 112365 115930 120927 125923 131962 138001 144040 150083 157658 165232
-7221 165232 169468 173704 177881 182057 184803 187552 190410 193271 196129 198990 204321 209657 219280 228907 232927 236951 242401
-7204 242401 247856 254469 261086 267699 274315 278179 282046 284479 286915 288573 290235 296185 302138 308848 315562 322272 328986
-7187 328986 335368 341753 351474 361198 371927 382657 385280 387903 391956 396010 401494 406982 416266 425551 438173 450796
-7171 450796 470035 489274 507083 524895 542547 560200 575467 590735 604214 617694 628789 639888 650520
-7158F50520J0633J4925J4925K2615K2615K3687K3692K1806J6084J1195J1196J0719J0718
-7145H65330J7872J7872K2269K2268J9884J9883J7172J7171J7291K3014K6217K6217K6575
-7132A139035K6576K3952K3952K3952K3952K4683K4682K7067K7067L2462L2461L8304M4026
-7119A512171M7803M7804N4361N4361O4078O4077O5508O5509O4017O4018O4137O9860P2244
-7106B309948P2244P4510Q0232Q9084J02436J17101J26639J33792J33792J42733J56086J68247
-7094C706844J85415K13312K45740K80075L12505L46362L82606M23830M60073N08478N90504
-7083G655744P19856R12520J188155J537238J989781K563950L267827M147207N090596N531240
-7073C4604114M423435J358032k466135n283560o209909n754005m748082l628356k616414
$$ plain form
-7158 650520 661153 676078 691003 713618 736233 759920 783612 805418 821502 832697 843893 854612 865330
-7145 865330 883202 901074 923343 945611 965495 985378 1002550 1019721 1037012 1060026 1086243 1112460 1139035
-7132 1139035 1165611 1189563 1213515 1237467 1261419 1286102 1310784 1337851 1364918 1397380 1429841 1468145 1512171
-7119 1512171 1559974 1607778 1662139 1716500 1780578 1844655 1910163 1975672 2039689 2103707 2167844 2237704 2309948
-7106 2309948 2382192 2456702 2536934 2626018 2728454 2845555 2972194 3105986 3239778 3382511 3538597 3706844
-7094 3706844 3892259 4105571 4351311 4631386 4943891 5290253 5672859 6096689 6556762 7065240 7655744
-7083 7655744 8375600 9288120 10476275 12013513 14003294 16567244 19835071 23982278 29072874 34604114
-7073 34604114 39027549 40385581 37919446 32635886 26425977 20671972 15923890 12295534 9679120
-7064I679120j840044j303859r39520p07993n53479m42011l59984k98469k54593k22775k05607
-7053B550786j92434j82896j79260j76398j66921j49749j24529r9732p7557n6574l5353k5815
-7041A083568j6754p213N443J8796L2387L8110K1776j8282p0023r8633j04449r8726q5850
-7028G00150p6313n9502m6150l9235l3508k9343k3617k2488k5346l0297l0293k9105k6240
-7015B28713j9716j0175q867o002o125o121m515m512o237o233j1482j1479j1304j1300n104
-7000I9541n100l644l640n074n071l018l014j587j583L398L397L041L040L904j818l845l845
-6983G5082j997j997n66n66J281J282K712K713L994L993k98k98j728j729o021o020m799m799
-6965F0239l368l368k533k534l606l606j893L830q20q19J117J118J118J117m157m158j774
$$ plain form
-7064 9679120 7839076 6535217 5595697 4887704 4334225 3892214 3532230 3233761 2979168 2756393 2550786
-7053 2550786 2358352 2175456 1996196 1819798 1652877 1503128 1378599 1278867 1201310 1144736 1109383 1083568
-7041 1083568 1066814 1059601 1065044 1083840 1116227 1154337 1176113 1157831 1087808 989175 884726 786000 700150
-7028 700150 623837 564335 518185 478950 445442 416099 392482 369994 344648 314351 284058 254953 228713
-7015 228713 208997 198822 189955 183953 177828 171707 167192 162680 156443 150210 138728 127249 115945 104645 99541
-7000 99541 94441 90797 87157 82083 77012 73994 70980 69393 67810 71208 74605 77646 80686 84590 82772 78927 75082
-6983 75082 73085 71088 70522 69956 71237 72519 75231 77944 81938 85931 85633 85335 83607 81878 75857 69837 65038 60239
-6965 60239 56871 53503 50970 48436 44830 41224 39331 43161 42341 41522 42639 43757 44875 45992 41835 37677 35903
-6948C5903j773j684j684k53k54Q87Q87K317K317N239N238L808L807L033L033O370O371O490
-6930H0052O490N060N059M348M348N778N779Q312Q312R564J5286J8982K1844K0770K0771K3900
-6914B64655K6761L2544M5896O0396P7565J01408J30022J64655K04713K19974J60840K9250
-6902A518679j17630k17060k41858k18074j74200j30565r4323o2609m5438l5785k6244j9630
-6890A35263j9627j7008j1281q006q003l357l353n979n976r318r314j1084j1080p746p741
-6875c610p865p861m527m522j994j989K299K302j248j244j249j244L554L558L137K80k616
-6858b4839L111k90k87j27j23j26j23J363J367j020j017j036j032J706J710K720Q446J3329
-6840C732J3335J4060J4064J1915K381n134j0853j6341j6337j2767j2764j1098n373j978p697
$$ plain form
-6948 35903 34130 32446 30762 30509 30255 31142 32029 34346 36663 41902 47140 50948 54755 57788 60821 67191 73562 80052
-6930 80052 86542 91602 96661 101009 105357 111135 116914 125226 133538 143102 158388 177370 199214 219984 240755 264655
-6914 264655 291416 323960 369856 430252 507817 609225 739247 903902 1108615 1328589 1489429 1518679
-6902 1518679 1401049 1183989 942131 724057 549857 419292 324969 262360 216922 181137 154893 135263
-6890 135263 115636 98628 87347 79341 71338 67981 64628 58649 52673 43355 34041 22957 11877 4131 -3610
-6875 -3610 -11475 -19336 -23863 -28385 -30379 -32368 -30069 -27767 -29015 -30259 -31508 -32752 -29198 -25640 -22503 -22223 -24839
-6858 -24839 -21728 -22018 -22305 -22432 -22555 -22681 -22804 -21441 -20074 -21094 -22111 -23147 -24179 -22473 -20763 -18043 -9597 3732
-6840 3732 17067 31127 45191 57106 59487 54353 43500 27159 10822 -1945 -14709 -25807 -31180 -33158 -40855
-6825d0855r072o207j882j877K589K593K768K772L841L845M765r53m892m888n11n06j763J103
-6807d9130J092O818O814L957J419J423m959m955l241l241k586K183K601K600k61k60K049
-6790c7677M910K049K049n44K318Q87Q86j878R84j878j877k772Q9R0k772J64J64j267j267
-6771c7342o41K221L651P90l927l923p265p262o519l655l540l535l659J114j393j390j930
-6754g8205R35L614L618L28L31N07N10o85K179N633N637N127K269K265N130M858M862k712
-6736c3799n570r295j4061j3408j3405q104M85Q826J1691R213R218O352R217O650O655K239
-6720b7096K242j590o356m691m687m810J871L356L361M430M433L298L300O517J1288J2119
-6704F985J2123P861J0723J2451J2451J1199J1200Q457j27j0767j7443j9113j4344j3598j0738
$$ plain form
-6825 -40855 -49927 -56134 -58016 -59893 -57304 -54711 -51943 -49171 -45330 -41485 -36720 -37673 -42565 -47453 -47964 -48470 -50233 -49130
-6807 -49130 -48038 -41220 -34406 -30449 -29030 -27607 -32566 -37521 -40762 -44003 -46589 -44406 -41805 -39205 -39466 -39726 -37677
-6790 -37677 -32767 -30718 -28669 -29213 -26895 -26008 -25122 -27000 -26016 -27894 -29771 -32543 -32454 -32364 -35136 -34972 -34808 -36075 -37342
-6771 -37342 -37983 -35762 -32111 -31321 -35248 -39171 -46436 -53698 -60217 -63872 -67412 -70947 -74606 -73492 -74885 -76275 -78205
-6754 -78205 -77270 -73656 -70038 -69710 -69379 -68872 -68362 -69047 -66868 -61235 -55598 -50471 -48202 -45937 -40807 -35949 -31087 -33799
-6736 -33799 -39369 -48664 -62725 -76133 -89538 -97642 -97157 -88331 -76640 -67427 -58209 -51857 -42640 -35990 -29335 -27096
-6720 -27096 -24854 -26444 -32800 -37491 -42178 -46988 -45117 -41761 -38400 -33970 -29537 -26239 -22939 -16422 -5134 6985
-6704 6985 19108 26969 37692 50143 62594 73793 84993 93450 93323 82556 65113 46000 31656 18058 7320
-6689G320q709q711K91K90k094K675K3M791R380R381Q756N894K913N2l643l644n253n253p415
-6670G044p409m433J292K929K931j960j955l666l662l666l662o200o196l57N368L935L938
-6653a5729P272J2998J2220J2224O140M21l331K396N968N972p37p34K481l238q580q576p150
-6636B0017p146m079J647Q08Q12N667N670P098P101R631R634R631R635N592N596P023P026
-6619A01363Q245Q249M310M314L17O043Q066Q070R318R321P888P891L729L733n63n58p001
-6602A82735o997j3200j3196j3371j3368p172p168q603q598r080l353J561P288R668R671J0324
-6586A17141J0328N078N082M80M85k858k854n778n775n659O7j714j714O71O70J237m485p467
-6568A02935p466j1579j1580j1579j1579q867q867o483o483l554l554k720O818P116P116L182
$$ plain form
-6689 7320 -1389 -10100 -9809 -9519 -11613 -8938 -8915 -4124 5256 14637 23393 29287 32200 32252 28609 24965 19712 14459 7044
-6670 7044 -365 -4798 -3506 -577 2354 394 -1561 -5227 -8889 -12555 -16217 -22417 -28613 -28970 -23602 -19667 -15729
-6653 -15729 -8457 4541 16761 28985 35125 35546 32215 34611 40579 46551 45814 45080 47561 44323 35743 27167 20017
-6636 20017 12871 8792 10439 11247 12059 17726 23396 30494 37595 47226 56860 66491 76126 81718 87314 94337 101363
-6619 101363 109608 117857 122167 126481 126798 132841 140907 148977 158295 167616 175504 183395 187124 190857 190294 189736 182735
-6602 182735 175738 162538 149342 135971 122603 115431 108263 99660 91062 81982 78629 80190 87478 97146 106817 117141
-6586 117141 127469 132547 137629 138109 138594 135736 132882 127104 121329 115670 115737 114023 112309 112980 113650 114887 110402 102935
-6568 102935 95469 83890 72310 60731 49152 40285 31418 24935 18452 14898 11344 8624 15442 22558 29674 32856
-6552C2856k541K831Q555R269R269Q703Q704N961l577p198p194q79M847L800j919K24K27L077
-6534G5015L081J647J651K242K247R277J8818K4507K4512K0215O866o371o367J379J382J2675
-6518A92776J2678J4225J9951J6459J6464J5268R549j900j900l689l688l450l450j662j662
-6503B75969Q28O549J4061J9783J5521R799J333J334j71N551J0916J0916J1870J1870P101
-6488D03230P101P981P980R530J5253J8919J8919K0349K0350J3703P980M881M880R322J5044
-6473E85422K4820K4821L8158M7696N3537O3076O6532P2256P9885R3238J14251J39049J79584
-6460A582325K19642K60892L04766L32663L38386L16837K69149J90939Q9841j8770j27499
-6449C759171k21446k92024l31508l41042l24117k91685k49127k05250j64003j31572j06345
$$ plain form
-6552 32856 30315 33146 41701 50970 60239 68942 77646 83607 80030 72832 65638 64759 69606 73406 71487 71711 71938 75015
-6534 75015 78096 79743 81394 83636 85883 95160 113978 138485 162997 183212 190078 183707 177340 178719 180101 192776
-6518 192776 205454 219679 239630 256089 272553 287821 297370 295470 293570 289881 286193 282743 279293 277631 275969
-6503 275969 276797 283346 297407 317190 332711 342510 343843 345177 345006 350557 361473 372389 384259 396129 403230
-6488 403230 410331 418312 426292 435822 451075 469994 488913 509262 529612 543315 551295 556176 561056 570378 585422
-6473 585422 610242 635063 673221 720917 774454 837530 904062 976318 1056203 1149441 1263692 1402741 1582325
-6460 1582325 1801967 2062859 2367625 2700288 3038674 3355511 3624660 3815599 3905440 3886670 3759171
-6449 3759171 3537725 3245701 2914193 2573151 2249034 1957349 1708222 1502972 1338969 1207397 1101052
-6438A101052q9173p3917o8191o8432o2707n6630n6626n6354n0628m2405l6679k2854j7126
-6425C99330j4866j4861j2377o650O18O22P176P179K407p127o803j081Q040J7578K4433K7294
-6409D30912K6281J6743J0394Q57j706m568m865j0589j2317j2317r523r522p794k072O751
-6394D16665R612Q718K996l756l755l935l934k802O0J669m053j1930j1926p518p515P68P71
-6377C80135N179N182O058L39j572j569J766l953K482J2022J1170J1173P951j584q323j7857
-6361D08599k1020j8155p250j524P97Q01K943J2485J1587Q729Q871Q874Q692Q696J2984J2987
-6345D59096K1509K4373K6590K0871J8304J2585P575j960k202n059q744j1602r579r575L834
-6330E46016J3375J6292J3435J2328J2332P023k511k396k392j024l882J300P023J1553Q692
$$ plain form
-6438 1101052 1011879 937962 869771 801339 738632 682002 625376 569022 518394 475989 439310 416456 399330
-6425 399330 384464 369603 357226 350576 351194 351816 358992 366171 368578 361451 354648 353567 361607 379185 403618 430912
-6409 430912 457193 473936 484330 485187 483481 478913 474048 463459 451142 438825 429302 419780 411986 409914 416665
-6394 416665 426277 434995 437991 434235 430480 426545 422611 419809 419869 421538 417485 405555 393629 386111 378596 379364 380135
-6377 380135 385314 390496 396554 396893 395321 393752 395518 391565 394047 406069 417239 428412 436363 434779 426456 408599
-6361 408599 387579 369424 362174 360650 361447 362248 365191 377676 389263 397992 406863 415737 424429 433125 446109 459096
-6345 459096 480605 504978 531568 552439 570743 583328 590903 588943 586741 581682 572938 561336 551757 542182 546016
-6330 546016 559391 575683 589118 601446 613778 620801 618290 615894 613502 612478 608596 609896 616919 628472 637164
-6315F37164O248N25j501m363o598o598j412M310J5071J5070J3997J3997J8945J8945K1807
-6300G45607K1806K1121K1120J6650J3789J7782K7321M2520L6799L0241K0703J6769P232N056
-6286A044516N059J5547K1274K4250K4254J9481R948O948O952J1956J1959K329j4836j9131
-6272A170506j9128m578J147J978l740o516j6050j7366j7361j1807o080P12J0253K3482M0655
-6257A146107N3884N3888M1135J6337k620q341O322K3490L6724L1001K7857K7857M1567N1104
-6243A546312N9570N0032L7394K4042J9966J4243J9131J9131K0175J4451J0995J0994J6054
-6230A862490J6054J4623J4623J7991J7991J5726J5726K3345L2883M4447N3985P1152P6875
-6217B277911P6160O6622N9283M9745M8552L9015L1862J8509J0879N156J2377J8099K8233
$$ plain form
-6315 637164 643412 643937 642436 638073 631475 624877 623465 627775 642846 657916 671913 685910 704855 723800 745607
-6300 745607 767413 788534 809654 826304 840093 857875 885196 927716 964515 994756 1015459 1032228 1039460 1044516
-6286 1044516 1049575 1065122 1086396 1110646 1134900 1154381 1164329 1171277 1178229 1190185 1202144 1204473 1189637 1170506
-6272 1170506 1151378 1146800 1147947 1149925 1146185 1139669 1123619 1106253 1088892 1077085 1071005 1071717 1081970 1105452 1146107
-6257 1146107 1199991 1253879 1295014 1311351 1308731 1300390 1306712 1330202 1366926 1397927 1425784 1453641 1495208 1546312
-6243 1546312 1605882 1655914 1693308 1717350 1737316 1751559 1770690 1789821 1809996 1824447 1835442 1846436 1862490
-6230 1862490 1878544 1893167 1907790 1925781 1943772 1959498 1975224 1998569 2031452 2075899 2129884 2201036 2277911
-6217 2277911 2354071 2420693 2479976 2529721 2578273 2617288 2649150 2667659 2678538 2683694 2696071 2714170 2742403
-6204B742403K8233K2988J3449J5119J5119P086o267j0201j5923j5327k1050q651J2331M0264
-6190B819573O1249P7699Q3425Q4613O3634L1441j6244k5427j9702j3267p541O703L1504O0829
-6176C238489Q1815J00067J05794J06505J00787R5596Q6062Q2006O8656O2498N6779O3928
-6164D248982O3933P5135P5139P6804P1085Q2579J03562J29791J43143J50297J36943J21922
-6152E479315J00939P9360N0747M8065N0926O3146O8869Q1804J06602J35140J40864J30372
-6140F536149J05573R5441Q2087Q0775Q0777R7511J18494J55572J72740J75005J50207J18495
-6128G968826R3696Q5105P5571P7475R4647J46861J94554K25666K25671K11717J90739J90317
-6116I780845J99859K13864K11006J96040J67431J44409J15802R5052Q5518J06618J46679
$$ plain form
-6204 2742403 2770636 2793624 2807073 2822192 2837311 2844397 2838130 2827929 2812006 2796679 2775629 2766978 2779309 2819573
-6190 2819573 2880822 2958521 3041946 3126559 3190193 3221634 3205390 3179963 3160261 3146994 3139453 3146156 3177660 3238489
-6176 3238489 3320304 3420371 3526165 3632670 3733457 3829053 3915115 3997121 4065777 4128275 4185054 4248982
-6164 4248982 4312915 4388050 4463189 4539993 4611078 4693657 4797219 4927010 5070153 5220450 5357393 5479315
-6152 5479315 5580254 5659614 5710361 5758426 5809352 5872498 5941367 6023171 6129773 6264913 6405777 6536149
-6140 6536149 6641722 6737163 6819250 6900025 6980802 7078313 7196807 7352379 7525119 7700124 7850331 7968826
-6128 7968826 8062522 8147627 8223198 8300673 8395320 8542181 8736735 8962401 9188072 9399789 9590528 9780845
-6116 9780845 9980704 10194568 10405574 10601614 10769045 10913454 11029256 11124308 11209826 11316444 11463123
-6105A1463123J92693K21312K61172L27939L91243L91245L69901L52737L49992L44272L42873
-6094A5008502L21888L09013K95660K87107K81384K89908K92768L29847M30947N39258N56426
-6083A8942708M97322M07668L39712K84395K49373K36019K59626K95869L36763L50114L69904
-6072B2569473L75628L65838L44852L65837M51676N89494O94409P31608P10624O79659O16714
-6061B8495812N50423M68404M17493M07959M40384M84260N74180P05801Q41710R16109R54492
-6050C5257027R86927J039375J075625J144994J261356J376520J416586J405846J369611J357919
-6040D7691786J394173J477646J540604J590192J641700J733022J918054K248057K604765
-6031F3839999K845653K923864K968203L103650L354001L630605L946299M486132N316172
$$ plain form
-6105 11463123 11655816 11877128 12138300 12466239 12857482 13248727 13618628 13971365 14321357 14665629 15008502
-6094 15008502 15330390 15639403 15935063 16222170 16503554 16793462 17086230 17416077 17847024 18386282 18942708
-6083 18942708 19440030 19847698 20187410 20471805 20721178 20957197 21216823 21512692 21849455 22199569 22569473
-6072 22569473 22945101 23310939 23655791 24021628 24473304 25062798 25757207 26488815 27199439 27879098 28495812
-6061 28495812 29046235 29514639 29932132 30340091 30780475 31264735 31838915 32544716 33386426 34302535 35257027
-6050 35257027 36243954 37283329 38358954 39503948 40765304 42141824 43558410 44964256 46333867 47691786
-6040 47691786 49085959 50563605 52104209 53694401 55336101 57069123 58987177 61235234 63839999
-6031 63839999 66685652 69609516 72577719 75681369 79035370 82665975 86612274 91098406 96414578
-6022I6414578O210815P009824P667925Q420683R353474J0053532J0593375J1916220J4607767
-6013A82248193J9199423K5809051L4273213M5434236N9870415P7578060J01588226J31828323
-6005F77829140J53005248J27968946M1196665o4143071j40448811j63913320j48785248j21246189
-5997C61463360r0656989o2206146m1204987k7629091j9129599j3740814r891892p070644
-5989H9933198n546526n327150n733944o021973n888457n554629n236754m998309m692628
-5980D0932828m248173l643365k966188k243954j570590j005143o44616n35175o51532q58023
-5970B2566069j016347j020167q99985p06549m60475j52170K08353O27772J087489J606337
-5960B1840327K252989K998317L362654K336400j87266k835281m252579m199404l564197k857978
$$ plain form
-6022 96414578 102625393 109635217 117303142 125723825 135077299 145130831 155724206 167640426 182248193
-6013 182248193 201447616 227256667 261529880 306964116 366834531 444412591 546000817 677829140
-6005 677829140 830834388 958803334 999999999 935856928 795408117 631494797 482709549 361463360
-5997 361463360 270806371 208600225 167395238 139766147 120636548 106895734 97003842 89933198
-5989 89933198 84386672 79059522 73325578 67303605 61415148 55860519 50623765 45625456 40932828
-5980 40932828 36684655 33041290 30075102 27831148 26260558 25255415 24610799 24075624 23424092 22566069
-5970 22566069 21549722 20529555 19629570 18923021 18462546 18310376 18518729 19146501 20233990 21840327
-5960 21840327 24093316 27091633 30454287 32790687 32603421 29768140 25515561 21316157 17751960 14893982
-5950A4893982k203693j654800j259941r55810p17366m88463l11062k17385k11662k06177
-5940F667623j96640j95447k54582l21345l69033l76515l55531l06889k70646k29933k16579
-5929C574483k12765k26117k19605j94807j33289n8895L2130J06524J36329J11531O8597j3427
-5917B970689o4573q9371r7120r7121p1726n8374m1205k4038r255j4977K668Q390J5186J5186
-5903B444359O009k6418o1112j01171j37770j70199j75922j66384j36877j04448n9681k3439
-5891A286947J658j203j1158k0696n086Q267K7343K1620J0294j8319m9793q2222q3488p7766
-5877A006398n4875l0077j53J7015K6792J7253K045k6563m0636n0170m4689l8963p730K4701
-5863H00348L9853K2689M564k0230k9235m2585m6105m8962l0182r195K1561M2547O4301O7166
$$ plain form
-5950 14893982 12690289 11035489 9775548 8819738 8102372 7613909 7302847 7085462 6873800 6667623
-5940 6667623 6470983 6275536 6020954 5699609 5330576 4954061 4598530 4291641 4020995 3791062 3574483
-5929 3574483 3361718 3135601 2915996 2721189 2587900 2529005 2561135 2667659 2803988 2915519 2984116 2970689
-5917 2970689 2906116 2816745 2719625 2622504 2550778 2492404 2451199 2427161 2417906 2402929 2405597 2413987 2429173 2444359
-5903 2444359 2450368 2423950 2362838 2261667 2123897 1953698 1777776 1611392 1474515 1370067 1310386 1286947
-5891 1286947 1288605 1287402 1276244 1255548 1250462 1258729 1286072 1307692 1317986 1299667 1249874 1167652 1084164 1006398
-5877 1006398 951523 921446 921293 938308 965100 982353 984398 957835 917199 867029 822340 783377 775647 800348
-5863 800348 840201 862890 867454 847224 817989 775404 729299 680337 650155 640960 662521 705068 769369 836535
-5849H36535O3049L8255J5420r373j5100j5097l953l949l953l949L655L659J6053J6058K1955
-5834I59265K1959K5890K5893L0226J6878k560k3539l4749k9023j4243k7592m2551n2084m5412
-5820H08358l9686k2879j3338M184M188j837k2816m8094o5259o7408o7405o2758n7033l8933
-5806C09284l3210k4984k4985k0155j0619k570n432q413j7950j5268j5267m181J543R530J9068
-5791A56391K9604L5327M2599M2599M0572L1035K6623J3271M121j3048j6802j6803o460r322
-5777C59707j1169j6892j3282j3279j5845j5841q483n619o74o393m236m233J725J5082L5941
-5762B96509L5945L0696J3531M765M769J4005J1147L811j7167k4385j8658K962K0134L4078
-5748D12142L4082K5257Q092k523j5871l0230l9767l7920l5059k7428k1705j6639j0916o788
$$ plain form
-5849 836535 899584 937839 953259 943886 928786 913689 909736 905787 901834 897885 901540 905199 921252 937310 959265
-5834 959265 981224 1007114 1033007 1063233 1080111 1077551 1054012 1019263 990240 975997 948405 905854 853770 808358
-5820 808358 768672 745793 732455 736639 740827 738990 716174 668080 602821 535413 468008 405250 348217 309284
-5806 309284 276074 251090 226105 205950 195331 192761 187329 178916 160966 145698 130431 126250 127793 137323 156391
-5791 156391 185995 221322 263921 306520 347092 378127 404750 418021 422142 409094 392292 375489 369029 359707
-5777 359707 348538 331646 318364 305085 289240 273399 264916 259297 258623 252230 247994 243761 245486 260568 296509
-5762 296509 332454 363150 376681 381446 386215 400220 411367 415178 398011 373626 354968 357930 378064 412142
-5748 412142 446224 471481 479573 477050 461179 430949 391182 353262 318203 290775 269070 252431 241515 234727
-5734B34727j6326j9664k5387k4552j5014o967m106k138p862k078L643R367J5088J1990K451
-5719A53172N067o56N37O259J5856K1579K6646K3785K1105P753N786O4K507Q230J3416J0555
-5703C21661J0279J0279R623L901K172l550n935j1658j3617j9340j6002j0279k172L551O590
-5688B85503R452J0004M66J061j799o539j2261r221r221r128r124j378j375l95o114r277j8810
-5671B11844j9530j6665q860q856K3K6O222O225J6259J6262J7094J7097J5186N651K906K910
-5655B63794M799M802P183P187O527O531P601j934p518p515r187j4907j8904j8900j4612n071
-5639B09876M85M88M25r110r709o844m761m758l398l394P16P19m18l274o379j2097j6169j3305
-5621A19093k160L565K250l468l890j024k348k343L495R221J2853R996O356l178k884k880
$$ plain form
-5734 234727 218401 198737 173350 148798 133784 126817 122711 120573 112711 110633 114276 123643 138731 150721 153172
-5719 153172 158239 157583 158120 164379 180235 201814 228460 252245 273350 281103 286889 286953 289460 297690 311106 321661
-5703 321661 331940 342219 351842 355743 357915 354365 348430 336772 323155 303815 287813 277534 275362 278913 285503
-5688 285503 294955 304959 305425 306486 304687 298148 285887 276666 267445 258317 249193 247815 246440 246045 239931 230654 211844
-5671 211844 192314 175649 166789 157933 157956 157982 164204 170429 186688 202950 220044 237141 252327 257978 260884 263794
-5655 263794 268593 273395 280578 287765 294292 300823 308424 306490 298972 291457 282270 267363 248459 229559 214947 209876
-5639 209876 210361 210849 211274 202164 192455 185611 180850 176092 172694 169300 170016 170735 170317 167043 160664 148567 132398 119093
-5621 119093 116933 120498 122748 119280 115390 114366 112018 109675 113170 122391 135244 145240 151596 148418 145534 142654
-5605A42654Q13Q16K809K813L166L171O26O352J4515K0242K2354J9496J4903N368n156n153
-5589B49789J997P724J1713J1717J0998N280Q04Q09M560M564J282j576n634j1352p287m422
-5573B80966m963m959j028j025N589J1315J8054J5197J8055K3780K3539K0681K7890L3617
-5559D66708M0930M6656N0706O0248O3224O8951P9200R2556J14534J43147J76291K08718K41981
-5546A853850K78224L05884L19236L14125K77881K16602J30763K3852r2508j92415k78254
-5535C157240l39690l68303l68542l43743l03000k55312k06431j62557j23006r0578o6019
-5524E30059m8851l6750k7212k9537l5259l5368l2506l2089k6367k2611j6888j5160j2298
-5511A59163j6903j6904j1478n757j464M259N331N331L514k210o143o144o382o382m295j435
$$ plain form
-5605 142654 143467 144283 147092 149905 153071 156242 156868 163220 177735 197977 220331 239827 254730 260098 254942 249789
-5589 249789 251786 259510 271223 282940 293938 299218 300022 300831 305391 309955 311237 309661 304027 292675 285388 280966
-5573 280966 276003 271044 270016 268991 274580 285895 303949 319146 337201 360981 384520 405201 433091 466708
-5559 466708 507638 554294 605000 665248 728472 797423 876623 969179 1083713 1226860 1403151 1611869 1853850
-5546 1853850 2132074 2437958 2757194 3071319 3349200 3565802 3696565 3720417 3627909 3435494 3157240
-5535 3157240 2817550 2449247 2080705 1736962 1433962 1178650 972219 809662 686656 596078 530059
-5524 530059 481208 444458 417246 387709 352450 317082 284576 252487 226120 203509 186621 171461 159163
-5511 159163 142260 125356 113878 108121 106657 110916 116247 121578 125092 122882 116739 110595 104213 97831 93536 92101
-5495I2101j539M184P463J0324J1873R013O687R65o121q979o717j2437j3512j0648k485J0871
-5479I1043J7783J7786J1643N923m333p190n943n938n116n111m758m754q692k965r43r39q967
-5462G8529q964n272n268L312R038Q677N820K395m62k075P90L558L562j9n737j1159q293q476
-5444E9956j1333j0413p549j4705j7561j5592j2727o889m024j643J222q08l666n235k369l387
-5428e6723n21m609m605m072m068k213L513O490O494Q308Q312Q070J3796Q099K381P08P11
-5411i929l286l282j498j494l070K657Q64Q68j669j665j669j666l010l007n037n033m322J405
-5393d3843k09l066m378m374R4R6k082L643N727K869Q38O564R005R009Q886L166K210N074
-5375g71M220J364j025J841R42j915l349m84m675p533n928l062p72p67J613J617L338M77j132
$$ plain form
-5495 92101 90562 94746 102209 112533 124406 133419 140106 141071 134950 125971 119254 106817 93305 82657 80172 91043
-5479 91043 108826 126612 138255 144178 139845 132655 126712 120774 115658 110547 105789 101035 92343 89378 88435 87496 78529
-5462 78529 69565 64293 59025 62337 71375 80052 85872 88267 87805 85730 86520 90078 93640 93621 87884 76725 68432 59956
-5444 59956 48623 38210 30661 15956 -1605 -17197 -29924 -36813 -40837 -42480 -41258 -42066 -45732 -50967 -53336 -56723
-5428 -56723 -57244 -61853 -66458 -70530 -74598 -76811 -73298 -66808 -60314 -52006 -43694 -35624 -21828 -13729 -11348 -10640 -9929
-5411 -9929 -13215 -16497 -17995 -19489 -22559 -19902 -19038 -18170 -19839 -21504 -23173 -24839 -27849 -30856 -35893 -40926 -45248 -43843
-5393 -43843 -44052 -47118 -51496 -55870 -55776 -55680 -57762 -54119 -48392 -45523 -44685 -38121 -29116 -20107 -11221 -8055 -5845 -771
-5375 -771 3449 4813 3788 5629 6571 4656 1307 823 -3852 -11385 -17313 -20375 -21147 -21914 -20301 -18684 -15346 -14869 -16001
-5356a6001M590O765O765J0462J0461M635M635P00n022q032q033q390q389q215q215k016k016
-5339b5316R65R65j419j420o784o784o785o784l715l714K79L141O989J2716J1639N920M605
-5322a5502P470j05j00Q79m839q301n436n857k991j35j30M348M351l401l398l640K087J426
-5304c3274J431M095O959J0175M456m36K429M749M754K802K805M18M21k474k470k474k470
-5287A896m619m616L28L193L576R302P690P693Q383Q386J0827P969J528q007j6296j6292j7518
-5270C423j1791o609l744J438J442M001M005K362K366L792L796l658l654j274j271K109K112
-5253a155O78O81j765j762l35l32j520j516k951k947j758j755m143m139l190l185J103J106
-5235b8885J20J22J20J23l476l473J174J177n264M62N77N82L796L800L797L800j9j5k403k399
$$ plain form
-5356 -16001 -11411 -4646 2119 12581 23042 27677 32312 33012 27990 19958 11925 3535 -4854 -13069 -21284 -23300 -25316
-5339 -25316 -24351 -23386 -24805 -26225 -33009 -39793 -46578 -53362 -57077 -60791 -60512 -57371 -50382 -37666 -26027 -20107 -15502
-5322 -15502 -8032 -8137 -8237 -7358 -12197 -20498 -25934 -31791 -34782 -34917 -35047 -30699 -26348 -29749 -33147 -36787 -34700 -33274
-5304 -33274 -31843 -27748 -20789 -10614 -6158 -6594 -4165 584 5338 8140 10945 11363 11784 9310 6840 4366 1896
-5287 1896 -2723 -7339 -7011 -3818 -242 9060 16750 24443 32826 41212 52039 60008 61536 53529 37233 20941 3423
-5270 3423 -8368 -14977 -18721 -17283 -15841 -11840 -7835 -5473 -3107 685 4481 823 -2831 -4105 -5376 -3267 -1155
-5253 -1155 -477 204 -1561 -3323 -3658 -3990 -5510 -7026 -9977 -12924 -14682 -16437 -20580 -24719 -27909 -31094 -29991 -28885
-5235 -28885 -28765 -28643 -28523 -28400 -31876 -35349 -34175 -32998 -38262 -37800 -37223 -36641 -32845 -29045 -25248 -21448 -21467 -21482 -23885 -26284
-5215b6284j628j625j628j624k433k429m9m4j017j014M14M17J040J043J039J043J509J513
-5197c1757M847M851J300J304k038k034K87K90K672K675L505L510M340j378m639m634l566
-5180b0465l561o010o006J144J148j286j281L006L011N03N06J934J937P1P4j359j357J323
-5162b6668J326j061j058q54q49o457p30j360j356j002r99L834L838k366k362j710j707j710
-5144d3251j706J151J155k79k76P64P67M698M702M404j315l346l342n372n369l942l938o33
-5126e5128o30k660k656n224N03N388N391K23K27k160k158q79q75K459K462J505J509M724
-5108d7979r94m993m988k966k962J416J416J415J416L890L889J505J506K563K563k682k683
-5091d8668j073j073M113O975M977p45J222J222o85o86k116k116l175l174K072K071J863J863
$$ plain form
-5215 -26284 -27912 -29537 -31165 -32789 -35222 -37651 -37700 -37744 -38761 -39775 -39361 -38944 -37904 -36861 -35822 -34779 -33270 -31757
-5197 -31757 -26910 -22059 -20759 -19455 -21493 -23527 -23240 -22950 -20278 -17603 -14098 -10588 -6248 -7626 -12265 -16899 -20465
-5180 -20465 -24026 -30036 -36042 -34898 -33750 -35036 -36317 -33311 -30300 -29797 -29291 -27357 -25420 -25349 -25275 -26634 -27991 -26668
-5162 -26668 -25342 -26403 -27461 -28315 -29164 -35621 -36351 -37711 -39067 -40069 -41068 -37234 -33396 -35762 -38124 -39834 -41541 -43251
-5144 -43251 -44957 -43806 -42651 -42930 -43206 -42442 -41675 -36977 -32275 -27871 -29186 -32532 -35874 -41246 -46615 -50557 -54495 -55128
-5126 -55128 -55758 -58418 -61074 -66298 -65795 -60407 -55016 -54793 -54566 -56726 -58884 -59763 -60638 -58179 -55717 -54212 -52703 -47979
-5108 -47979 -48973 -53966 -58954 -61920 -64882 -63466 -62050 -60635 -59219 -55329 -51440 -49935 -48429 -45866 -43303 -45985 -48668
-5091 -48668 -49741 -50814 -46701 -39726 -34749 -35494 -34272 -33050 -33735 -34421 -36537 -38653 -41828 -45002 -42930 -40859 -38996 -37133
-5073c7133J863J862J412J416K843K846j181j177j181j177l47l43l46l43R05R09l386l383
-5055c5941j487j482Q97R02j457j453k887k884o22o18l841J885j75j72J971l748j97j94K783
-5036d8720K787J084J088r43r39k745K980J546j311p49K116K709K712J86J86j244j244q2q2
-5017d0665j513j512k839k839k482k481k898K824P414M552M520M523M340M344q16q12l200
-5000b9540l197l022l017o37o34J122J125J121J125K210K209j129j129j158j159l543l543
-4983d2796L163L163j129j129n123n122q31q31k05k01J226J229J23J27J23J26O4O7M355M359
-4963c9242M81M84M81M84J095J099K526K530J095J099J096J099j975j971J364J367k541k537
-4945c1966m925m922k313k314K932K932J293J293J293J292j494j494Q91Q90K292K291Q60Q61
$$ plain form
-5073 -37133 -35270 -33408 -31996 -30580 -27737 -24891 -26072 -27249 -28430 -29607 -29954 -30297 -30643 -30986 -30081 -29172 -32558 -35941
-5055 -35941 -37428 -38910 -38013 -37111 -38568 -40021 -42908 -45792 -46414 -47032 -50873 -48988 -49163 -49335 -47364 -51112 -51309 -51503 -48720
-5036 -48720 -45933 -44849 -43761 -44704 -45643 -48388 -45408 -43862 -45173 -45922 -43806 -41097 -38385 -38199 -38013 -39257 -40501 -40583 -40665
-5017 -40665 -42178 -43690 -46529 -49368 -51850 -54331 -57229 -54405 -46991 -42439 -37919 -33396 -29056 -24712 -25528 -26340 -29540
-5000 -29540 -32737 -35759 -38776 -39413 -40047 -38925 -37800 -36679 -35554 -33344 -31135 -32264 -33393 -34551 -35710 -39253 -42796
-4983 -42796 -39633 -36470 -37599 -38728 -43851 -48973 -49804 -50635 -50840 -51041 -49815 -48586 -48463 -48336 -48213 -48087 -48023 -47956 -43601 -39242
-4963 -39242 -38761 -38277 -37796 -37312 -36217 -35118 -32592 -30062 -28967 -27868 -26772 -25673 -27648 -29619 -28255 -26888 -29429 -31966
-4945 -31966 -36891 -41813 -44126 -46440 -43508 -40576 -39283 -37990 -36697 -35405 -36899 -38393 -37502 -36612 -34320 -32029 -31169 -30308
-4927c0308M911M910l35l36L80L80n819n820k16k16L122L122K61K61j170j170j881j878l312
-4908c5114l308m952m947K94K98k343k340k344k339p04p01p04p00J430J435J430J435K444
-4890e1730K447M829M832L442L447J058J062r09r06r09r05L308L309L308L308p75p75p74p75
-4871b4108l607l606n991n991l368l368R24R24N857N856N857N857l770l771m32m32j558j557
-4853c6284J781J781R16R17n14n14j897j892j897j892j777j774O07O11L387L390L387L390
-4835b8274j173j170J211J214K530K533J46J49j584j579j53j49o45o40P86P90Q75Q79n55n51
-4815b5360k042k038k041k038j178j173k608k604k780k775l95l92R77R79k362k358Q05Q08
-4797d8575K236K239J222J226J222J225j088j084j088j084j535j531M32k425O22O348K053
$$ plain form
-4927 -30308 -25397 -20487 -20822 -21158 -20778 -20398 -26217 -32037 -32253 -32469 -29347 -26225 -25964 -25703 -26873 -28043 -29924 -31802 -35114
-4908 -35114 -38422 -43374 -48321 -48027 -47729 -50072 -52412 -54756 -57095 -57799 -58500 -59204 -59904 -58474 -57039 -55609 -54174 -51730
-4890 -51730 -49283 -44454 -39622 -36180 -32733 -31675 -30613 -31522 -32428 -33337 -34242 -30934 -27625 -24317 -21009 -21784 -22559 -23333 -24108
-4871 -24108 -27715 -31321 -37312 -43303 -46671 -50039 -49115 -48191 -42334 -36478 -30621 -24764 -28534 -32305 -32737 -33169 -34727 -36284
-4853 -36284 -34503 -32722 -31806 -30889 -31403 -31917 -33814 -35706 -37603 -39495 -41272 -43046 -42439 -41828 -38441 -35051 -31664 -28274
-4835 -28274 -29447 -30617 -29406 -28192 -25662 -23129 -22983 -22834 -24418 -25997 -26150 -26299 -26944 -27584 -26798 -26008 -25133 -24254 -24809 -25360
-4815 -25360 -27402 -29440 -31481 -33519 -34697 -35870 -38478 -41082 -43862 -46637 -47032 -47424 -46447 -45468 -47830 -50188 -49383 -48575
-4797 -48575 -46339 -44100 -42878 -41652 -40430 -39205 -40293 -41377 -42465 -43549 -45084 -46615 -46183 -48608 -47986 -41638 -39585
-4780c9585l666n40K325J784J789j785j781O00O04J285J289J285J289m940m936k556k552m136
-4762e4227m131J56J60L80L84j051j046P37P42k601k597Q91Q94n40n37J606J609J606J610
-4743e5955k57k54k57k53j598j595P86P90J356J360J356J360K399K403R69R72o85o82P45P49
-4723d6291L0L3M322M326L42L47J773J777o11o07L681L685K83K87k042m899r09M817J118m601
-4703c3139m154p012m333m329j025j021J360J364J673J676J673J676j695j691O89O93N656
-4686d1939N659L271L275j975j971l405l401n552n547k213k209K913K917J483J487K011K016
-4669d3180k280k276o990o985p90p86J311J315j19j15K622K627K265K269J997l722n07n03
-4651e3847k086k083M114M116l13l09l13l09M32M36M32M36J12J15J12J16j528j524j527j524
$$ plain form
-4780 -39585 -43251 -43791 -41466 -39682 -37893 -39678 -41459 -40859 -40255 -38970 -37681 -36396 -35107 -40047 -44983 -47539 -50091 -54227
-4762 -54227 -58358 -58202 -58042 -57662 -57278 -58329 -59375 -58638 -57896 -60497 -63094 -62203 -61309 -61849 -62386 -60780 -59171 -57565 -55955
-4743 -55955 -56212 -56466 -56723 -56976 -58574 -60169 -59383 -58593 -57237 -55877 -54521 -53161 -50762 -48359 -47390 -46418 -47103 -47785 -47040 -46291
-4723 -46291 -46261 -46228 -41906 -37580 -37238 -36891 -35118 -33341 -33952 -34559 -30878 -27193 -26910 -26623 -28665 -33564 -34473 -29656 -28538 -33139
-4703 -33139 -37293 -44305 -48638 -52967 -53992 -55013 -53653 -52289 -50616 -48940 -47267 -45591 -47286 -48977 -48288 -47595 -41939
-4686 -41939 -36280 -33009 -29734 -31709 -33680 -37085 -40486 -46038 -51585 -53798 -56007 -53094 -50177 -48694 -47207 -45196 -43180
-4669 -43180 -45460 -47736 -54726 -61711 -62501 -63287 -61976 -60661 -60780 -60895 -58273 -55646 -53381 -51112 -49115 -52837 -53344 -53847
-4651 -53847 -55933 -58016 -53902 -49786 -50099 -50408 -50721 -51030 -50598 -50162 -49730 -49294 -49182 -49067 -48955 -48839 -50367 -51891 -53418 -54942
-4631e4942l509l506K690K693L555L558K123K128J169J174j393j390p08l565l570p04J230
-4614e2967J233j811J055L912J054J110j747K049K053J691J695N3k806k332k329m731M1M210
-4596d8567J352l360l357k765J01K574K575J90J90K20k642L99L98r3r3r3r3k478k477k478
-4576f0497k477m333m333j830J032Q83j978j1j1O3K925J315J315J941J941J941J941L58L58
-4557e9457J788J788N07N07r24r24j222j222m561m560j043j043L87L88K779K780n59n59m70
-4538f5620m69J140J140n89K273K273n89J27J26M25k436l54M418L163L06J583J587r80r76
-4519e3452m13m10j665j662p12K154K269N134J456J461L841L845L364N07j107J759J710j148
-4501c3069j747j744J651J654j032l889m676m672o643r16J583J587j397j393J389J394m1l8
$$ plain form
-4631 -54942 -58451 -61957 -59267 -56574 -53019 -49461 -47338 -45210 -44041 -42867 -44260 -45650 -46358 -49923 -53493 -54197 -52967
-4614 -52967 -51734 -53545 -52490 -48578 -47524 -46414 -48161 -46112 -44059 -42368 -40673 -40620 -43426 -45758 -48087 -52818 -52777 -48567
-4596 -48567 -47215 -50575 -53932 -56697 -56596 -54022 -51447 -51257 -51067 -50847 -53489 -53090 -52692 -52785 -52878 -52971 -53064 -55542 -58019 -60497
-4576 -60497 -62974 -67307 -71640 -73470 -72438 -71555 -73533 -73544 -73555 -73492 -70567 -69252 -67937 -65996 -64055 -62114 -60173 -59815 -59457
-4557 -59457 -57669 -55881 -55374 -54867 -55791 -56715 -57937 -59159 -63720 -68280 -69323 -70366 -69979 -69591 -66812 -64032 -64591 -65150 -65620
-4538 -65620 -66089 -64949 -63809 -64398 -62125 -59852 -60441 -60314 -60188 -59763 -62199 -62553 -58135 -54972 -54666 -53083 -51496 -52476 -53452
-4519 -53452 -53865 -54275 -55940 -57602 -58314 -56160 -53891 -48757 -47301 -45840 -41999 -38154 -34790 -34283 -35390 -33631 -31921 -33069
-4501 -33069 -34816 -36560 -34909 -33255 -34287 -38176 -42852 -47524 -54167 -55083 -53500 -51913 -53310 -54703 -53314 -51920 -51961 -51999
-4483e1999n763n760K343K348P22P27p08p04n89n85n88n85L7M1L7M1K481K485q57q53Q35Q38
-4461e6056j550j546k563k560j78j76L100L104J669J673J937J941k355k351j013j010j013
-4444e8947j010J103J107l28l24j476j471k906k903J059J061K489K493j23j20j23j19j23j19
-4425f0780j23j19j092j088k522k518m07m02k87N440K306K310j628j625J621J624m06m02j241
-4406f1339M486J263J267j152j147j151j148j416j412j415j412J63J68J64J68J982J986N51
-4388e9394N55J356J360j982j978k280k277K012K016K250K254Q20Q23J475J479M5M9r09r06
-4369e3232l293l290k537k537j107j106K410K411R79R80m653m653l223l223J368J367L752
-4352f9587L751r94r95k068k068j30N592L804L804j1j1L46L47l082K642J807J807n11n10k895
$$ plain form
-4483 -51999 -57762 -63522 -61179 -58831 -58109 -57382 -58090 -58794 -59383 -59968 -60556 -61141 -61104 -61063 -61026 -60985 -58504 -56019 -56876 -57729 -56894 -56056
-4461 -56056 -57606 -59152 -61715 -64275 -64453 -64629 -61529 -58425 -56756 -55083 -53146 -51205 -53560 -55911 -56924 -57934 -58947
-4444 -58947 -59957 -58854 -57747 -58075 -58399 -59875 -61346 -64252 -67155 -66096 -65035 -62546 -60053 -60176 -60296 -60419 -60538 -60661 -60780
-4425 -60780 -60903 -61022 -62114 -63202 -65724 -68242 -68649 -69051 -69338 -63898 -61592 -59282 -60910 -62535 -60914 -59290 -59696 -60098 -61339
-4406 -61339 -56853 -55590 -54323 -55475 -56622 -57773 -58921 -60337 -61749 -63164 -64576 -64413 -64245 -64081 -63913 -61931 -59945 -59394
-4388 -59394 -58839 -57483 -56123 -58105 -60083 -62363 -64640 -62628 -60612 -58362 -56108 -55288 -54465 -52990 -51511 -51466 -51417 -52326 -53232
-4369 -53232 -56525 -59815 -62352 -64889 -65996 -67102 -64692 -62281 -61302 -60322 -64975 -69628 -72851 -76074 -74706 -73339 -69587
-4352 -69587 -65836 -66830 -67825 -69893 -71961 -72091 -66499 -62695 -58891 -58902 -58913 -58567 -58220 -61302 -58660 -56853 -55046 -55557 -56067 -58962
-4332e8962k895P42P41P42P41O22O22O22O23o4o3L275L275l39l39l39l39j979j978n48n47
-4311e6387j904j904M81M80j665j666k34k35p45p45k176k176J490J491K563K563K221l502
-4293f2050k84k83k83k83L055L055k571k570k571k571k869k868k869k869j363j364J975J974
-4275g7609k228k228j512M210M422j296k016k012j777j773l208l204J099J103M437M441L006
-4258g6145L011O22O26j233j230k664k660j144j140K87K91J404J409J404J409J285J289J285
-4240g1894J289J94J98k847k842j327L446K966K969Q95j964j907K865J430l334l219l54k004
-4222g5440Q60Q57Q61M761M765m84m81j557j554j557j554j408j404K2K6L275L275k925k925
-4203g2587l520l521P71P71R88R87m43m44o82o81P49P48J688J688o97o97j739j740j740j740
$$ plain form
-4332 -58962 -61857 -61115 -60374 -59632 -58891 -58269 -57647 -57025 -56402 -56466 -56529 -53254 -49979 -50318 -50657 -50996 -51335 -53314 -55292 -55840 -56387
-4311 -56387 -58291 -60195 -59714 -59234 -60899 -62565 -62799 -63034 -63779 -64524 -66700 -68876 -67386 -65895 -63332 -60769 -58548 -62050
-4293 -62050 -62334 -62617 -62900 -63183 -60128 -57073 -59644 -62214 -64785 -67356 -70225 -73093 -75962 -78831 -80194 -81558 -79583 -77609
-4275 -77609 -79837 -82065 -83577 -79367 -74945 -76241 -78257 -80269 -82046 -83819 -87027 -90231 -89132 -88029 -83592 -79151 -76145
-4258 -76145 -73134 -72512 -71886 -73119 -74349 -77013 -79673 -80817 -81957 -81670 -81379 -79975 -78566 -77162 -75753 -74468 -73179 -71894
-4240 -71894 -70605 -70411 -70213 -73060 -75902 -77229 -73783 -70817 -67848 -66953 -68917 -70824 -67959 -66529 -69863 -73082 -73436 -75440
-4222 -75440 -74580 -73723 -72862 -68101 -63336 -63820 -64301 -65858 -67412 -68969 -70523 -71931 -73335 -73313 -73287 -70012 -66737 -69662 -72587
-4203 -72587 -76107 -79628 -78857 -78086 -77098 -76111 -76554 -76998 -77680 -78361 -77612 -76864 -75176 -73488 -74185 -74882 -76621 -78361 -80101 -81841
-4183h1841j509j509Q76Q75R06R05L766j002n25K340K038q20m66m62K694K697K873K876j420
-4164f6708j415m66m62m66m62J38J42J38J41Q53Q57Q53Q57N26N29Q23Q27m452L20R73R76J043
-4142f4435J043J044J043j669j669l100l100K295K295q9r0L0L0k355k354n56n55J830J829
-4123f8533J919J918J919J919J084J084l46l47k641k642j211j211p67p67j185m046l093K631
-4105g4315O63O63K228K228j110j111p52p53J632J632L193L193j278j278j934m795m198J523
-4087g4569N444K581O15O15j412M310J092J092J546J550J546J550N92N96l699l696L185L189
-4069e3873j106j103k954k951m385m382L8M1L375L379J200J203l092l089o70o67o71o67J774
-4050f8600J777J773J778j912j911m81m80l4l3j464j465j054j054L76L76j948j949n18n18
$$ plain form
-4183 -81841 -83350 -84859 -83983 -83108 -82202 -81297 -77531 -78533 -79058 -76718 -74680 -75500 -75966 -76428 -73734 -71037 -68164 -65288 -66708
-4164 -66708 -68123 -68589 -69051 -69517 -69979 -69841 -69699 -69561 -69420 -68567 -67710 -66857 -66000 -65474 -64945 -64122 -63295 -67747 -67427 -66454 -65478 -64435
-4142 -64435 -63392 -62348 -61305 -62974 -64643 -67743 -70843 -68548 -66253 -66342 -66432 -66402 -66372 -68727 -71081 -71637 -72192 -70362 -68533
-4123 -68533 -66614 -64696 -62777 -60858 -59774 -58690 -59036 -59383 -62024 -64666 -65877 -67088 -67855 -68622 -69807 -73853 -76946 -74315
-4105 -74315 -73652 -72989 -70761 -68533 -69643 -70754 -71506 -72259 -70627 -68995 -65802 -62609 -63887 -65165 -67099 -71894 -76092 -74569
-4087 -74569 -69125 -66544 -65929 -65314 -66726 -62416 -61324 -60232 -58686 -57136 -55590 -54040 -53448 -52852 -56551 -60247 -57062 -53873
-4069 -53873 -54979 -56082 -59036 -61987 -66372 -70754 -70716 -70675 -67300 -63921 -62721 -61518 -64610 -67699 -68369 -69036 -69707 -70374 -68600
-4050 -68600 -66823 -65050 -63272 -65184 -67095 -67576 -68056 -68090 -68123 -69587 -71052 -72106 -73160 -72784 -72408 -74356 -76305 -76823 -77341
-4031g7341k12k12Q60Q61N600j23m81N242L931j792l938j077M43L305K053q09l614l613K406
-4012f8511K407Q27Q27Q27Q27k898k899K347K348l06l05J125J125J021J024m10m06J170J174
-3993e8686k169k164R69R72R69R72K042K045l204l200k087k082k087k082j193j188j192j189
-3975g4554n73n71k004k001K437K440J006J010p60p60O70O71J297J296J297J296l591l592
-3957g4986k53k54k190k191p60p60k623k619L577L580p15p12P15m049k325N40J013J017L428
-3938h0567L431R0R3l43l39l43l39J148J151J148J151J26J31j304j300l301l297J944J949
-3919g8771l089l085p04p00p34p30O96P01J911J915J911J915q5q2L252L256k760k757l77l72
-3899g8689R05R09R06R09l17l13K068K071L09L13j121j118M553M556J215l551k242O22J095
$$ plain form
-4031 -77341 -77553 -77765 -76905 -76044 -70444 -70567 -71048 -65806 -61875 -63667 -67605 -68682 -68239 -64934 -62881 -63690 -67304 -70917 -68511
-4012 -68511 -66104 -65277 -64450 -63623 -62796 -65694 -68593 -66246 -63898 -64204 -64509 -63384 -62259 -61238 -60214 -60624 -61030 -59860 -58686
-3993 -58686 -60855 -63019 -62050 -61078 -60109 -59137 -57095 -55050 -58254 -61454 -63541 -65623 -67710 -69792 -70985 -72173 -73365 -74554
-3975 -74554 -75127 -75698 -77702 -79703 -77266 -74826 -73820 -72810 -73570 -74330 -73660 -72989 -71692 -70396 -69099 -67803 -71394 -74986
-3957 -74986 -75239 -75493 -77683 -79874 -80634 -81394 -84017 -86636 -83059 -79479 -80194 -80906 -80191 -84240 -86565 -86025 -85012 -83995 -80567
-3938 -80567 -77136 -77046 -76953 -77296 -77635 -77978 -78317 -77169 -76018 -74870 -73719 -73593 -73462 -74766 -76066 -79367 -82664 -80720 -78771
-3919 -78771 -81860 -84945 -85649 -86349 -87083 -87813 -87117 -86416 -84505 -82590 -80679 -78764 -78849 -78931 -75679 -72423 -75183 -77940 -78317 -78689
-3899 -78689 -77784 -76875 -75969 -75060 -75377 -75690 -73622 -71551 -71242 -70929 -72050 -73168 -68615 -64059 -62844 -66395 -68637 -68015 -66920
-3880f6920J099r76r72K362K366R6J01l80l238k973J800L65L69p08p04J676J681J616J621
-3861f1719p67p64k914k909M24M29J293J296k045k042k313k310q83q80Q98R02Q98R01J882
-3842g0623J885M51M54k850k846j420j415M28M32j002r98K850K854k396k392N25N29J956J960
-3823g1618J785J784O077O076j285j285j286j285l282l283k209k209J367m355k567k567J792
-3806g8350J792J792J792L193L193J762J762l230l230j561M161K612l111K850K850j449j449
-3789f4621j9j8r43r43r42r43j762j762l32l31K052K053K053K053k105k105J233J233J234
-3770f4915J233j98j97K49K50K50K49Q16Q16k522k522r91r91M39M44l36l31j766j763K728
-3750f9058K727o11o08J834J836M03M06Q2Q2k303k299K61K65O18O22j669M054Q34Q39k742
$$ plain form
-3880 -66920 -65821 -66797 -67769 -65407 -63041 -62945 -62844 -63224 -66462 -69435 -67635 -67270 -66901 -67609 -68313 -66637 -64956 -63340 -61719
-3861 -61719 -62486 -63250 -66164 -69073 -68649 -68220 -66927 -65631 -67676 -69718 -72031 -74341 -75224 -76104 -75206 -74304 -73406 -72505 -70623
-3842 -70623 -68738 -68287 -67833 -70683 -73529 -74949 -76364 -75936 -75504 -76506 -77504 -74654 -71800 -74196 -76588 -76063 -75534 -73578 -71618
-3823 -71618 -69833 -68049 -61972 -55896 -57181 -58466 -59752 -61037 -64319 -67602 -69811 -72020 -70653 -75008 -77575 -80142 -78350
-3806 -78350 -76558 -74766 -72974 -69781 -66588 -64826 -63064 -66294 -69524 -71085 -66924 -64312 -67423 -64573 -61723 -63172 -64621
-3789 -64621 -64640 -64658 -65601 -66544 -67486 -68429 -70191 -71953 -72285 -72616 -70564 -68511 -66458 -64405 -66510 -68615 -67382 -66149 -64915
-3770 -64915 -63682 -63880 -64077 -63828 -63578 -63328 -63079 -62263 -61447 -63969 -66491 -67482 -68473 -68034 -67590 -67926 -68257 -70023 -71786 -69058
-3750 -69058 -66331 -66942 -67550 -65716 -63880 -63477 -63071 -62989 -62907 -65210 -67509 -67248 -66983 -66365 -65743 -67412 -63358 -62524 -61685 -64427
-3730f4427k739j311j308J911J912J434j427o583j815J524J524n77n78n77n78K791K790K791
-3712f5243K790k433k433P87l983m937L648K813K813J307J308j23j23k120k120o89o89J844
-3694f7583J848J844J848l193l189l189l189K269K272K269K273P49P52l539l540k94k90k95
-3676g2177k90j904j900M84M84J949J952J949J952J60J64J64J64R16R17j468j468J721J722
-3657f4509K90K91J498J497k794k794K034K034J736J736K46m523l450n88n59n59l80l80k168
-3638g1342k169L734L733K541k228n447k586M96M99O74O78k79k76k366k362o67M106J420J423
-3619g0418R13R16k425k422k001j997J338J341K679K682o59o56j583j580j583j580K053K056
-3601g2926K053K057m17m14J967J971m47m43m48m43k146k142l577p11J430M296M113M117J766
$$ plain form
-3730 -64427 -67166 -68477 -69785 -67874 -65962 -64528 -65955 -72538 -74353 -72829 -71305 -71882 -72460 -73037 -73615 -70824 -68034 -65243
-3712 -65243 -62453 -64886 -67319 -66532 -70515 -75452 -71804 -68991 -66178 -64871 -63563 -63686 -63809 -65929 -68049 -68738 -69427 -67583
-3694 -67583 -65735 -63891 -62043 -65236 -68425 -71614 -74803 -72534 -70262 -67993 -65720 -64971 -64219 -67758 -71298 -71592 -71882 -72177
-3676 -72177 -72467 -74371 -76271 -75787 -75303 -73354 -71402 -69453 -67501 -67341 -67177 -67013 -66849 -65933 -65016 -66484 -67952 -66231 -64509
-3657 -64509 -64219 -63928 -62430 -60933 -63727 -66521 -64487 -62453 -60717 -58981 -58735 -63258 -66708 -67296 -67855 -68414 -68794 -69174 -71342
-3638 -71342 -73511 -69777 -66044 -63503 -65731 -71178 -73764 -73268 -72769 -72095 -71417 -71696 -71972 -74338 -76700 -77367 -73261 -71841 -70418
-3619 -70418 -69505 -68589 -71014 -73436 -75437 -77434 -76096 -74755 -72076 -69394 -70053 -70709 -72292 -73872 -75455 -77035 -74982 -72926
-3601 -72926 -70873 -68816 -69233 -69647 -67680 -65709 -66156 -66599 -67047 -67490 -69636 -71778 -75355 -76066 -74636 -70340 -66227 -62110 -60344
-3582f0344j092j691j688l182l16K362K366l160l155J78J83O0O3k325k321p41p38k65K601
-3563g3205k65n029l424J349j479j476K50K53L09L13j300J565m9m4j658J207K753j04K49K54
-3543g9531j084j081l09K556m58m55J509j349k302N62J930J934J542j315j140j136m10m06
-3525h0943J140M005M061J203j71j68k317N48J318J323j423j420n417k552k23k20m03K463
-3507g9196L145K86L43L47J971k798j16j15O29O30J881J882j055l915j710J151K463l99j770
-3488g6346j769k731J30J203M065O67O67K455m06p94p93r73r72K008K008l76l76j584j583
-3469g5500j53j53k209k209l461J307L84L84O82O81K918K917N33N32k194k194J143J144o74
-3450g6122o75k105k105J055J054J055J054P1P0K456K455q6q2J345J349MPMPK165K168l081
$$ plain form
-3582 -60344 -61436 -63127 -64815 -67997 -68313 -65951 -63585 -66745 -69900 -69722 -69539 -69479 -69416 -71741 -74062 -74803 -75541 -75806 -73205
-3563 -73205 -73470 -78499 -81923 -80574 -82053 -83529 -83279 -83026 -82717 -82404 -83704 -82139 -82188 -82232 -83890 -82683 -79930 -80034 -79785 -79531
-3543 -79531 -80615 -81696 -82005 -79449 -79907 -80362 -78853 -80202 -82504 -81942 -80012 -78078 -76536 -77851 -78991 -80127 -80537 -80943
-3525 -80943 -79803 -75798 -71737 -70534 -70705 -70873 -73190 -72642 -71324 -70001 -71424 -72844 -78261 -80813 -81036 -81256 -81659 -79196
-3507 -79196 -76051 -75765 -75422 -75075 -73104 -75902 -76018 -76133 -75504 -74874 -72993 -71111 -72166 -76081 -77791 -76640 -74177 -74576 -76346
-3488 -76346 -78115 -80846 -80716 -79513 -75448 -74781 -74114 -71659 -72065 -72859 -73652 -74625 -75597 -73589 -71581 -71957 -72333 -73917 -75500
-3469 -75500 -75653 -75806 -78015 -80224 -83685 -82378 -81994 -81610 -80928 -80247 -77329 -74412 -73879 -73347 -75541 -77735 -76592 -75448 -76122
-3450 -76122 -76797 -78902 -81007 -79952 -78898 -77843 -76789 -76718 -76648 -74192 -71737 -71823 -71905 -70560 -69211 -69207 -69200 -69196 -69189 -67024 -64856 -67937
-3428f7937l077P93P97P94P97k798k794j367j364j337j334J047J050K240K242Q09Q12j099
-3410g1726j095K239K243j34j31J297J300r99r94k429k426m25m21m24m21n14n11n14n10P04
-3390g5891P04P04P04r35r35M95M96N6N6N6N5j315j315j315j315J38J38J568J569J419J420
-3369g3443j919j919n77n78Q53Q53J09J08J538J539N29N33N29N33L122L126j826j822j662
-3350g0374L111K810K812J796J800n89n85N63N66k656p422k209K563J188j669k522k518J590
-3332g1745J595r43r38k374k369N10N14r20r16n03n00R28R31K523K526k724k719J389J394
-3313g4341J389J394J907J908J907J908j759j758J579J580J654J655J654J654Q49Q50K280
-3296e3690K280j431j430M769M768K206K206j133j133n990n991m382L88l219l219j490j491
$$ plain form
-3428 -67937 -71014 -70221 -69424 -68630 -67833 -70631 -73425 -74792 -76156 -77493 -78827 -77780 -76730 -74490 -72248 -71439 -70627 -71726
-3410 -71726 -72821 -70582 -68339 -68473 -68604 -67307 -66007 -67006 -68000 -70429 -72855 -73280 -73701 -74125 -74546 -75060 -75571 -76085 -76595 -75891
-3390 -75891 -75187 -74483 -73779 -74714 -75649 -75154 -74658 -74602 -74546 -74490 -74435 -75750 -77065 -78380 -79695 -79557 -79419 -77851 -76282 -74863 -73443
-3369 -73443 -75362 -77281 -77858 -78436 -77583 -76730 -76621 -76513 -74975 -73436 -72907 -72374 -71845 -71312 -68190 -65064 -66890 -68712 -70374
-3350 -70374 -67263 -64453 -61641 -59845 -58045 -58634 -59219 -58656 -58090 -60746 -68168 -70377 -67814 -66626 -68295 -70817 -73335 -71745
-3332 -71745 -70150 -71093 -72031 -74405 -76774 -76264 -75750 -76670 -77586 -78089 -78589 -77661 -76730 -74207 -71681 -74405 -77124 -75735 -74341
-3313 -74341 -72952 -71558 -69651 -67743 -65836 -63928 -65687 -67445 -65866 -64286 -62632 -60977 -59323 -57669 -56820 -55970 -53690
-3296 -53690 -51410 -52841 -54271 -49502 -44734 -42528 -40322 -41455 -42588 -48578 -54569 -58951 -58563 -61782 -65001 -66491 -67982
-3279f7982K91K91K90K91k034k035k034k034j170j170K61K61K854K853j438j438J073J073
-3261g1797l57l58l994l994K206K205P31P30p01p00J475J476J296J297j017l875k567K206
-3243g5738K410K414J278J282L662L666K232K235j792j788l62l57k388k385k388k384k597
-3226g3000k593k895J878L09L13q23q20n55n52n55n51R7R7J527l241m70K392K094p67j617
-3206g9732j617j498j498l584J185L629P67P45L607L249j521k771Q9M47N216M545k23j535
-3188g0500j535j625j624j624j625j728j729J609J610p75p75J311J312K191k579J05J04O11
-3170g7266O11j475j476q94L875L576L577N96N96q34q35k869k868m85m84l7l8j467j468J79
-3150g9486J78J79J79p15p16P16P15Q2Q2Q2Q2qpj438j438n81n82Q50Q49K072K071K072K071
$$ plain form
-3279 -67982 -67691 -67400 -67110 -66819 -68853 -70888 -72922 -74956 -76126 -77296 -77035 -76774 -73920 -71067 -72505 -73943 -72870 -71797
-3261 -71797 -72154 -72512 -76506 -80500 -78294 -76089 -75358 -74628 -75329 -76029 -74554 -73078 -71782 -70485 -71502 -75377 -77944 -75738
-3243 -75738 -73328 -70914 -69636 -68354 -64692 -61026 -58794 -56559 -58351 -60139 -60501 -60858 -63246 -65631 -68019 -70403 -73000
-3226 -73000 -75593 -78488 -76610 -76301 -75988 -76811 -77631 -78186 -78738 -79293 -79844 -79747 -79650 -78123 -81364 -81834 -79442 -77348 -78115 -79732
-3206 -79732 -81349 -82847 -84345 -87929 -86744 -83115 -82348 -81603 -77996 -74747 -76268 -79039 -78950 -78503 -73287 -68742 -68965 -70500
-3188 -70500 -72035 -73660 -75284 -76908 -78533 -80261 -81990 -80381 -78771 -79546 -80321 -79010 -77698 -75507 -78086 -77981 -77877 -77266
-3170 -77266 -76655 -78130 -79606 -80500 -76625 -73049 -69472 -68876 -68280 -69114 -69949 -72818 -75686 -76171 -76655 -76692 -76730 -78197 -79665 -79486
-3150 -79486 -79308 -79129 -78950 -79665 -80381 -79665 -78950 -78868 -78786 -78704 -78622 -78630 -78637 -80075 -81513 -82094 -82676 -81826 -80977 -78905 -76834 -74762 -72691
-3127g2691n96n96Q34Q35j222j222J162J163N06N07J937J938l487l488M620M620J088J088
-3109f3004k250k251j743j744m128m128m25m21m24m21J989J993l95l91L204L208J595J598
-3091f8138k53l111m188N85P41P45J040J043J129J133J128J133j889j885m58m55p86p82m125
-3072g7393m120J777J777L47L46M460M459J122J121l409l409j978j979L17L17L17L16j281
-3054g6893j282J49J49L87L88L87L88m098m099p60p60M814M813N22N22P22P23p08p08Q42Q42
-3033g3660M181M180q57q57k288k287j572j573j41j42M32M36r98r95p00o97J684J688L13L16
-3013g3537j117j114R68R73k370k366K996K999O11O15n22n18n21n18k24k19k24k20M5M8J476
-2992g2739J479o4o3o3o4j583j583J754J755K50K49j181j181L69L69J800J799J233J233k105
$$ plain form
-3127 -72691 -73287 -73883 -73049 -72214 -73436 -74658 -73496 -72333 -71827 -71320 -69383 -67445 -70932 -74420 -69800 -65180 -64092 -63004
-3109 -63004 -65254 -67505 -69248 -70992 -75120 -79248 -79673 -80094 -80518 -80939 -78950 -76957 -77352 -77743 -74539 -71331 -69736 -68138
-3091 -68138 -68391 -71502 -75690 -75105 -74364 -73619 -72579 -71536 -70407 -69274 -68146 -67013 -68902 -70787 -71245 -71700 -72486 -73268 -77393
-3072 -77393 -81513 -79736 -77959 -77612 -77266 -72806 -68347 -67225 -66104 -69513 -72922 -74900 -76879 -76562 -76245 -75928 -75612 -76893
-3054 -76893 -78175 -78026 -77877 -77490 -77102 -76715 -76327 -80425 -84524 -85284 -86044 -81230 -76417 -75895 -75373 -74651 -73928 -74636 -75344 -74502 -73660
-3033 -73660 -69479 -65299 -66156 -67013 -69301 -71588 -73160 -74733 -74874 -75016 -74584 -74148 -75146 -76141 -76841 -77538 -75854 -74166 -73853 -73537
-3013 -73537 -74654 -75768 -74800 -73827 -76197 -78563 -75567 -72568 -71957 -71342 -71864 -72382 -72903 -73421 -73645 -73864 -74088 -74308 -74263 -74215 -72739
-2992 -72739 -71260 -71324 -71387 -71450 -71514 -73097 -74680 -72926 -71171 -70921 -70672 -71853 -73034 -72665 -72296 -70496 -68697 -67464 -66231 -68336
-2972f8336k105j687j688k57k57R3R3J524J524j994j993L91L92J5J4J446J446R38R39j445
-2952g0947j446J408J409J408J408o18o19K720K720o71o70o71o71l42l43l681l681k086k087
-2933g7460M113M114j103j103j103j103j982j982M03M02j565j565Q20Q20m62m62m62m62M098
-2914g6044M098M03M02M635j088P00P01j386j386l13l13L80n343l137K586J423j438l584l584
-2895h2288q42K023L807j911n74K292J751J755J251J256j79j75q9q6m47m44K959k761r76r73
-2875g4651N44N48q87q83k034k030K257K262J662J665k571n428l614K109L003L002N00M99
-2857g4047k839k839o63o63K675K675Q86Q87n44n44k757k757N82N81J5J5J4J5p45p45K593
-2836g8205K593j430j431J907J908J926J930k366k362k544k541P93P97j575j573K716K720
$$ plain form
-2972 -68336 -70441 -72128 -73816 -74073 -74330 -74237 -74144 -72620 -71096 -73090 -75083 -74692 -74300 -74285 -74271 -72825 -71379 -70441 -69502 -70947
-2952 -70947 -72393 -70985 -69576 -68168 -66760 -67378 -67997 -65277 -62557 -63228 -63898 -64569 -65240 -65582 -65925 -69606 -73287 -75373 -77460
-2933 -77460 -73347 -69233 -70336 -71439 -72542 -73645 -75627 -77609 -77206 -76804 -78369 -79934 -79114 -78294 -78756 -79218 -79680 -80142 -76044
-2914 -76044 -71946 -71543 -71141 -66506 -67594 -66894 -66193 -67579 -68965 -69278 -69591 -69211 -74554 -77691 -75105 -73682 -75120 -78704 -82288
-2895 -82288 -83130 -81107 -77300 -79211 -79785 -77493 -75742 -73987 -72736 -71480 -71659 -71834 -71923 -72009 -72456 -72900 -69941 -72702 -73678 -74651
-2875 -74651 -74107 -73559 -74446 -75329 -77363 -79393 -77136 -74874 -73212 -71547 -74118 -79546 -83160 -81051 -78048 -75046 -74546 -74047
-2857 -74047 -76886 -79725 -80388 -81051 -78376 -75701 -74815 -73928 -74472 -75016 -77773 -80530 -79948 -79367 -79352 -79337 -79323 -79308 -80053 -80798 -78205
-2836 -78205 -75612 -77042 -78473 -76566 -74658 -72732 -70802 -73168 -75530 -78074 -80615 -79822 -79025 -80600 -82173 -79457 -76737
-2819g6737J53J56N11k347mK861M408M411k210k205J963q94K94L160Q90l874k120P45K64K69
-2799g0306j167j162j166j163K7K9K6L0J964J967N33N36j285j282k716k712J181J185L565
-2780g1916L569M06M10k097m956j143J721J360J363l98l95j829j826J468J472J471J472j513
-2762g1361j509K20L081J170J174J352J352k287k284k284k284k347k343R95R94n29n25j241
-2744g8656L529M202k470m318j457l87l84l245l84J163J166r0q5k69k64K772q6k198k194Q42
-2724h2813k016o19K247K243o15j878R88L189L31j013j010K39K42k422k418R17R20O78O82
-2705h2128J274l491j784K988M001J140j75j71j781j781J173J178K310K310l17n082k757J04
-2687h2989m43l301k01M568M146o18o78K183Q68Q72l80l80K090K094K094K093k488k485j059
$$ plain form
-2819 -76737 -76584 -76428 -75917 -78264 -78268 -75407 -70999 -66588 -68798 -71003 -69040 -69934 -69640 -66480 -65590 -69464 -71584 -70839 -70575 -70306
-2799 -70306 -71473 -72635 -73801 -74964 -74937 -74908 -74882 -74852 -72888 -70921 -70388 -69852 -71137 -72419 -75135 -77847 -76666 -75481 -71916
-2780 -71916 -68347 -67941 -67531 -69628 -74584 -75727 -74006 -72646 -71283 -71681 -72076 -73905 -75731 -74263 -72791 -71320 -69848 -71361
-2762 -71361 -72870 -72650 -69569 -68399 -67225 -65873 -64521 -66808 -69092 -71376 -73660 -76007 -78350 -77355 -76361 -76890 -77415 -78656
-2744 -78656 -75127 -70925 -73395 -77713 -79170 -79557 -79941 -83186 -83570 -82407 -81241 -81331 -81416 -81685 -81949 -79177 -79263 -81461 -83655 -82813
-2724 -82813 -84829 -85448 -83201 -80958 -81573 -83451 -82463 -79274 -78943 -79956 -80966 -80727 -80485 -82907 -85325 -84408 -83488 -82810 -82128
-2705 -82128 -80854 -84345 -86129 -83141 -79140 -78000 -78175 -78346 -80127 -81908 -80735 -79557 -77247 -74937 -75254 -80336 -83093 -82989
-2687 -82989 -83432 -86733 -86934 -82366 -78220 -78838 -79516 -77333 -76465 -75593 -75973 -76353 -74263 -72169 -70075 -67982 -70470 -72955 -74014
-2668g4014j054j147j144j148j143N14N18N14N18O63O67O63O67k459k455p5p1j058j054j058
-2648h3156j055J796J800J795J800j930j926j930j926K500K503J16J19L871L875m21m18j568
-2630g4155j565j568j565N18N21N18N22n26n21K813K816p8p4j509j505l238l234o74M098N18
-2610g7888N21Q16Q20k2k3k2k2k318k317j662L107l35l35l7l8K049K049j289j289P45P46P45
-2588g5999P45j133j132q35q34k310K459k24k23J356J356J356J356J5J9J445J449o40o37o41
-2568g3052o37J743J748L13L16j505j501j506j501P90P93P90P94M02M06j028j025j386j382
-2549g6428j386j382K489K492J05J08j863j863j863j863j5j4j5j5L412L413J326J327o155
-2530g8190j386K906j863j192j192Q94Q94K146K146k38k39R02R01k436k437R62R61R61R61
$$ plain form
-2668 -74014 -75068 -76215 -77359 -78507 -79650 -79136 -78618 -78104 -77586 -76923 -76256 -75593 -74926 -77385 -79840 -79915 -79986 -81044 -82098 -83156
-2648 -83156 -84211 -82415 -80615 -78820 -77020 -78950 -80876 -82806 -84732 -82232 -79729 -79613 -79494 -75623 -71748 -72169 -72587 -74155
-2630 -74155 -75720 -77288 -78853 -78335 -77814 -77296 -76774 -77300 -77821 -75008 -72192 -72270 -72344 -73853 -75358 -78596 -81830 -82504 -78406 -77888
-2610 -77888 -77367 -76551 -75731 -75753 -75776 -75798 -75820 -78138 -80455 -82117 -79010 -79345 -79680 -79717 -79755 -77706 -75657 -76946 -78235 -77490 -76744 -75999
-2588 -75999 -75254 -76387 -77519 -78354 -79188 -81498 -79039 -79263 -79486 -78130 -76774 -75418 -74062 -74047 -74028 -72583 -71134 -71774 -72411 -73052
-2568 -73052 -73689 -71946 -70198 -69885 -69569 -71074 -72575 -74081 -75582 -74792 -73999 -73209 -72415 -72013 -71607 -72635 -73660 -75046 -76428
-2549 -76428 -77814 -79196 -76707 -74215 -74110 -74002 -75865 -77728 -79591 -81454 -81469 -81483 -81498 -81513 -78101 -74688 -73362 -72035 -78190
-2530 -78190 -79576 -76670 -78533 -79725 -80917 -80023 -79129 -76983 -74837 -75075 -75314 -74412 -73511 -75947 -78384 -77422 -76461 -75500 -74539
-2511g4539k68k65k68k64j997j994J342J345K615K619p23p19J722J725k571k567k42k39J189
-2492g4099J192k686k683l%m713N9P12P15J75J79l163l159P00P04M039M042p60p56p60p56
-2471h1021J236J241k101P64K131k634k459K313J763J766O29O34k143k138k143k138R20R24
-2453h2456K828l0n40M232J368J371O11O14j773j770q49q46k280k276n00m95R31R35J498J502
-2433g7925J497J502K280K284k966k962K936K939m02l99j847j845O0k798k533K239o26o22
-2415g9188J78J83M77M80l129J643K951R3j550j546j729j725P75P79P75P78k27k24J025J028
-2395g8153J323j535k612K161J054J059j986j982J382J386n25K339J871k895l8l3K228K232
-2377g2724j111j106R7J00O93m072l748J025J378J382L24L28L24L28O52O56p79p75R21R24
$$ plain form
-2511 -74539 -74807 -75072 -75340 -75604 -77601 -79595 -78253 -76908 -74293 -71674 -72397 -73116 -71394 -69669 -72240 -74807 -75049 -75288 -74099
-2492 -74099 -72907 -75593 -78276 -78279 -78279 -82992 -82933 -82221 -81506 -81331 -81152 -84315 -87474 -86774 -86070 -82031 -77989 -78749 -79505 -80265 -81021
-2471 -81021 -79785 -78544 -80645 -79881 -77750 -80384 -82843 -80530 -78767 -77001 -76372 -75738 -77881 -80019 -82162 -84300 -83380 -82456
-2453 -82456 -79628 -79658 -80198 -75966 -74598 -73227 -72616 -72002 -73775 -75545 -76394 -77240 -79520 -81796 -82296 -82791 -81860 -80925 -79427 -77925
-2433 -77925 -76428 -74926 -72646 -70362 -73328 -76290 -73354 -70415 -70817 -71216 -73063 -74908 -74848 -77646 -80179 -77940 -78566 -79188
-2415 -79188 -79010 -78827 -78350 -77870 -80999 -79356 -76405 -76312 -77862 -79408 -81137 -82862 -82087 -81308 -80533 -79755 -79982 -80206 -79181 -78153
-2395 -78153 -76830 -78365 -80977 -78816 -77762 -76703 -78689 -80671 -79289 -77903 -78428 -76089 -74218 -77113 -77151 -77184 -74956 -72724
-2377 -72724 -73835 -74941 -74844 -74744 -74051 -78123 -81871 -80846 -79468 -78086 -77762 -77434 -77110 -76782 -76130 -75474 -76253 -77028 -76107 -75183
-2357g5183n11n06P11P15j672j669J583J583J584J583P79P78o52o51r80r80M51M50K508K507
-2337f7572q31q30j085j084j084j084k008k008J330J330K05K05O81m087j762J099L484L483
-2319g1618j092j091L39L39j98j97j97j98r05r06r05r05Q23Q23o07o07j502j501p1p1R73R72
-2297g8302K403K403M74M73M73M73K887K888N03N03j830j829N55N55l081l081K57K57K664
-2278g0355K664j628j628m06m06O66O67J815l909l908J815K64K65O22O22l103l104p19p19
-2259h0485K530K529N63L424M474j244j069M657k619k616k261k258M43M48M43M47j345j341
-2241g5280j345j341k05k02k04k02j278j274J53J57M541M545K50K53o14o11o15o11N18N21
-2221g2844j449M277K664j94j568j565j196j192j196j192O22O26j762j759K329K332n6n2q91
$$ plain form
-2357 -75183 -75694 -76200 -75489 -74774 -76446 -78115 -76532 -74949 -73365 -71782 -71003 -70225 -70877 -71528 -72508 -73488 -73037 -72587 -70079 -67572
-2337 -67572 -68403 -69233 -70318 -71402 -72486 -73570 -75578 -77586 -76256 -74926 -74721 -74516 -73835 -77922 -79684 -78585 -75101 -71618
-2319 -71618 -72710 -73801 -73462 -73123 -73321 -73518 -73715 -73913 -74818 -75724 -76629 -77534 -76711 -75888 -76495 -77102 -78604 -80105 -80176 -80247 -79274 -78302
-2297 -78302 -75899 -73496 -73022 -72549 -72076 -71603 -68716 -65828 -65325 -64822 -66652 -68481 -67926 -67371 -70452 -73533 -73276 -73019 -70355
-2278 -70355 -67691 -69319 -70947 -71353 -71759 -71093 -70426 -68611 -72520 -76428 -74613 -74349 -74084 -73462 -72840 -75943 -79047 -79766 -80485
-2259 -80485 -77955 -75426 -74863 -71439 -66965 -68209 -69278 -64621 -67240 -69856 -72117 -74375 -73932 -73484 -73041 -72594 -73939 -75280
-2241 -75280 -76625 -77966 -78171 -78373 -78577 -78779 -80057 -81331 -81178 -81021 -76480 -71935 -71685 -71432 -72046 -72657 -73272 -73883 -73365 -72844
-2221 -72844 -74293 -70016 -67352 -67546 -69114 -70679 -71875 -73067 -74263 -75455 -74833 -74207 -75969 -77728 -75399 -73067 -73123 -73175 -74066
-2202g4066q86k500k496K552l06l707K019L894j826o37o33m03m02m02m03k936k935j327L443
-2183h3957M441M441M47M47k057k056L28L27n73n74Q57Q57k452k451k452k451N59N59J989
-2164h3771J990l06l05J125J125K980K981k265k266m411m411J79J79l182J587K243K243L733
-2146h0552L733j513j512J535J535q50q49M32M32j952j952K325K324K325K325J639J640p46
-2128f9681p45r53r51J431J435q65q60N66N70K90K95K90K95k452k448j020j017O55O60O55
-2108g3850O60j431j427k861k858Q05Q09Q04Q09j669j666J669J673J647J647p38p38k645k645
-2089h2005j990K780P52P53l80l80r17r16N14N14n9o0J371J371R54R54j431j431k265k265
-2069h4136K027K026R24R24R24R24L022L021k224k224P56P56K187K187j367j367j189j188
$$ plain form
-2202 -74066 -74952 -77452 -79948 -77396 -77702 -81409 -79390 -75496 -77322 -77959 -78592 -78995 -79397 -79799 -80202 -83138 -86073 -87400 -83957
-2183 -83957 -79516 -75075 -74628 -74181 -76238 -78294 -77966 -77639 -78212 -78786 -77929 -77072 -79524 -81975 -84427 -86878 -86319 -85760 -83771
-2164 -83771 -81781 -82087 -82392 -81267 -80142 -77162 -74181 -76446 -78712 -83123 -87534 -87355 -87176 -90358 -88771 -86528 -84285 -80552
-2146 -80552 -76819 -78332 -79844 -78309 -76774 -77624 -78473 -78041 -77609 -79561 -81513 -79188 -76864 -74539 -72214 -70575 -68935 -69681
-2128 -69681 -70426 -71379 -72330 -70899 -69464 -70329 -71189 -70623 -70053 -69763 -69468 -69178 -68883 -71335 -73783 -74803 -75820 -75165 -74505 -73850
-2108 -73850 -73190 -74621 -76048 -78909 -81767 -80962 -80153 -79349 -78540 -80209 -81875 -80206 -78533 -76886 -75239 -75977 -76715 -79360 -82005
-2089 -82005 -83995 -81215 -80463 -79710 -80090 -80470 -81387 -82303 -81789 -81275 -81334 -81394 -80023 -78652 -77698 -76744 -78175 -79606 -81871 -84136
-2069 -84136 -82109 -80083 -79159 -78235 -77311 -76387 -73365 -70344 -72568 -74792 -74036 -73280 -71093 -68906 -70273 -71640 -72829 -74017
-2051g4017l543o82K120k649l469J301K611K612K910K909N26N25j919j918M65M66J300J300
-2033f9152j1m780o050j282J759l011j78j79m77m77J945J945N283N282k01k01k01k01k593
-2014g2780k593j163j162R24R24j461j460j282j281j282j282p75p75L219L219K627k142j844
-1996h0369j845J166J167j219j218L46L47L46L47M847M847J509J509O22O22k716k716k090
-1978g4498k090J248J248j121j122j121j121k57k58K128K127M25M25l868l867p08p08J677
-1960h1461J676m39m40J945J945L435L435q57q57j468j468k898k899J006J006J006J006j230
-1942g7557j229J155J155Q57Q57k482k481K65K68K64K69J128J133J129J133k13k08k13k08
-1923g4978j673j669j673j669p12p08P19P23q31q27q31q27j166j162K172N037O374J610j733
$$ plain form
-2051 -74017 -77560 -78242 -76122 -78771 -82240 -80939 -78328 -75716 -72806 -69897 -69371 -68846 -70765 -72683 -72218 -71752 -70452 -69152
-2033 -69152 -69163 -73943 -79993 -81275 -79516 -82527 -82705 -82884 -83361 -83838 -81893 -79948 -74665 -69383 -69584 -69785 -69986 -70187 -72780
-2014 -72780 -75373 -76536 -77698 -76774 -75850 -77311 -78771 -80053 -81334 -82616 -83898 -84673 -85448 -82229 -79010 -76383 -78525 -80369
-1996 -80369 -82214 -81048 -79881 -81100 -82318 -81972 -81625 -81279 -80932 -76085 -71238 -69729 -68220 -67598 -66976 -69692 -72408 -74498
-1978 -74498 -76588 -75340 -74092 -75213 -76335 -77456 -78577 -78834 -79092 -76964 -74837 -74412 -73987 -77855 -81722 -82430 -83138 -81461
-1960 -81461 -79785 -80224 -80664 -78719 -76774 -73339 -69904 -70761 -71618 -73086 -74554 -77452 -80351 -79345 -78339 -77333 -76327 -77557
-1942 -77557 -78786 -77631 -76476 -75619 -74762 -77244 -79725 -79460 -79192 -78928 -78659 -77531 -76398 -75269 -74136 -74349 -74557 -74770 -74978
-1923 -74978 -76651 -78320 -79993 -81662 -82374 -83082 -82363 -81640 -82471 -83298 -84129 -84956 -86122 -87284 -85112 -80075 -73701 -72091 -73824
-1904g3824j728J453J457k839k836J304J308J006J010L204j561l055j90L025J67j028L744
-1887f9383M747j9N74N78j12j08n89n354k555L09P82P86j125j121k556k552J471J472k820
-1868g7575k821l46l47K992K992r3r3r4r3o89o89P41P42j16j15j16j15l126l126K120K120
-1847g7847K626K627K42K42L014L014j277j278j859j860j859j859J807J807n77n78p93p94
-1829g5202O37O37j121j122L10L09J330J330J330J330j412j412J9J8J025J024J025J024k283
-1810g1204k284J00J01J930J933k362k358J006J010k333k328m32m29m32m28l13l10l13l09
-1791g9755k302k299K526K530K973l700N2N6M18M21M17M21r84r80r83r80J401J404k9k6O55
-1770g8764O60K086K090L0L4k355k351M47M51k891k888m09m06J020J025K243K246K243K247
$$ plain form
-1904 -73824 -75552 -74099 -72642 -75481 -78317 -77013 -75705 -74699 -73689 -70485 -72046 -75101 -75291 -72266 -72099 -73127 -69383
-1887 -69383 -64636 -64655 -64081 -63503 -63615 -63723 -64312 -69666 -72221 -71912 -71130 -70344 -71469 -72590 -75146 -77698 -76227 -74755 -77575
-1868 -77575 -80396 -80742 -81089 -78097 -75105 -75198 -75291 -75385 -75478 -76167 -76856 -76115 -75373 -75489 -75604 -75720 -75835 -78961 -82087 -79967 -77847
-1847 -77847 -75221 -72594 -72352 -72110 -69096 -66082 -67359 -68637 -70496 -72356 -74215 -76074 -74267 -72460 -73037 -73615 -74408 -75202
-1829 -75202 -74565 -73928 -75049 -76171 -75861 -75552 -74222 -72892 -71562 -70232 -71644 -73056 -73037 -73019 -71994 -70970 -69945 -68921 -71204
-1810 -71204 -73488 -73388 -73287 -71357 -69424 -71786 -74144 -73138 -72128 -74461 -76789 -77221 -77650 -78082 -78510 -78823 -79133 -79446 -79755
-1791 -79755 -82057 -84356 -81830 -79300 -76327 -80027 -79975 -79919 -79501 -79080 -78663 -78242 -79226 -80206 -81189 -82169 -80768 -79364 -79393 -79419 -78764
-1770 -78764 -78104 -76018 -73928 -73898 -73864 -76219 -78570 -78123 -77672 -80563 -83451 -83860 -84266 -83246 -82221 -79978 -77732 -75489 -73242
-1751g3242q27q24K213K217J140l625l152l148o19K247L614j151m672J00K362K366M77M81
-1733g4043M77M80K474K478j819j814k280k276K965K970J773J777j565j561j483j479R02R05
-1715g1119o18o15Q12Q16J90J90J90J90j449j449R35R35k850k850M88M88j747j748O37O37
-1695g7937J964J963J964J963J755J755o30o30K65K64k120k119J427J426lmj684j684j684
-1676g3749j684k24k23k24k23Q87Q86Q87Q87n14n15n14n14j371j371J013J014Q05Q04o26o26
-1655g5195j795j796L450L450K794K794n44n44l68l69j800j799M8M9k515k515j449m311j091
-1636h3506L677L260L260J173J174J348J353k943k940q27q23q27q24K83K87k101k098j415
-1618h2489j412J5J8L815L819M77M81o86o82o85o82Q05Q08j580j576Q35Q38Q35Q38q6q5q6
$$ plain form
-1751 -73242 -74069 -74893 -72680 -70463 -69323 -72948 -76100 -79248 -79867 -77620 -74006 -75157 -79829 -79729 -77367 -75001 -74524 -74043
-1733 -74043 -73566 -73086 -70612 -68134 -69953 -71767 -74047 -76323 -73358 -70388 -68615 -66838 -68403 -69964 -71447 -72926 -72024 -71119
-1715 -71119 -71737 -72352 -71540 -70724 -70534 -70344 -70154 -69964 -71413 -72862 -71927 -70992 -73842 -76692 -76204 -75716 -77463 -79211 -78574 -77937
-1695 -77937 -75973 -74010 -72046 -70083 -68328 -66573 -67203 -67833 -67568 -67304 -69424 -71543 -70116 -68690 -68693 -68697 -70381 -72065 -73749
-1676 -73749 -75433 -75657 -75880 -76104 -76327 -75440 -74554 -73667 -72780 -73294 -73809 -74323 -74837 -76208 -77579 -76566 -75552 -74747 -73943 -74569 -75195
-1655 -75195 -76990 -78786 -75336 -71886 -69092 -66298 -66842 -67386 -67754 -68123 -69923 -71722 -71674 -71625 -74140 -76655 -78104 -82415 -83506
-1636 -83506 -79829 -76569 -73309 -72136 -70962 -69614 -68261 -71204 -74144 -74971 -75794 -76621 -77445 -77162 -76875 -78976 -81074 -82489
-1618 -82489 -83901 -83886 -83868 -80053 -76234 -75757 -75276 -75962 -76644 -77329 -78011 -77206 -76398 -77978 -79554 -78719 -77881 -77046 -76208 -76294 -76379 -76465
-1596g6465q6N11N10N11N10J181J181J181J181K57K57k127k127j494j494N32k328j137N541
-1577g3905M467l02j412J449R72R73J688J687o96o97n25n26n25n25n622n622N77N78K790K791
-1557g2385M06M06l260l260J032J032R28R27R28R28n93n92k023k023j323j322J061J062k49
-1538g8320k50j680j681K65K65K648K649J248J249j137j136j98j97j97j98J1J1J2J1O67O67
-1517g5291O66O67L10L09L09L09M29M28M29M28J025J024J025J024k373k373k373k374j747
-1498g8149j747j748j747L633L632K94K95l91l92k298N62K142k626K35K34j851j852m21m21
-1479h2616K20K20j867j867L678Q446K20k642j621j620J538J539p86p86O44O45J360J360j025
-1460g4960l886J122N890M66m303O40O41j863j862j059J804O70m098o78K183K76K76J56J57
$$ plain form
-1596 -76465 -76551 -76040 -75530 -75019 -74509 -73328 -72147 -70966 -69785 -69528 -69271 -71398 -73525 -75019 -76513 -75981 -78309 -79446 -73905
-1577 -73905 -69438 -69740 -71152 -69703 -68731 -67758 -66070 -64383 -65079 -65776 -66301 -66827 -67352 -67877 -73499 -79121 -78544 -77966 -75176 -72385
-1557 -72385 -71979 -71573 -74833 -78093 -77061 -76029 -75101 -74174 -73246 -72318 -72911 -73503 -75526 -77549 -78872 -80194 -79133 -78071 -78320
-1538 -78320 -78570 -80250 -81931 -81666 -81401 -78753 -76104 -74856 -73607 -74744 -75880 -76078 -76275 -76472 -76670 -76659 -76648 -76636 -76625 -75958 -75291
-1517 -75291 -74625 -73958 -73648 -73339 -73030 -72721 -72292 -71864 -71435 -71007 -69982 -68958 -67933 -66909 -69282 -71655 -74028 -76402 -78149
-1498 -78149 -79896 -81644 -83391 -79758 -76126 -75832 -75537 -75928 -76320 -78618 -78056 -75914 -78540 -78305 -78071 -79922 -81774 -82195 -82616
-1479 -82616 -82396 -82176 -84043 -85910 -82232 -73786 -73566 -76208 -77829 -79449 -77911 -76372 -77158 -77944 -77300 -76655 -75295 -73935 -74960
-1460 -74960 -78846 -77724 -71834 -71368 -75671 -75031 -74390 -76253 -78115 -79174 -77370 -76700 -80798 -81476 -79293 -79017 -78741 -78585 -78428
-1441g8428J56J57K019K019l65l65j140j140j140j140l8l7K347K348p83p82p83p82Q35Q34
-1421g6208L696j073l696q34J549J550l733l733K288K287R76j885m389L80K497K496J363J364
-1403g5105j498j498o7o7N00M99K2k839l971P97L182L181m24m21L867L871l614l610j230j225
-1383g9650J363J367J364J367q12q08J572J576j013j010K325K328j937j934l0k887m925j53
-1365h1897J274J278R46R50j140j136k749K019L450j319q12q12j111j110r54r53J430J431
-1347h1215J460J461M321m47j989Q72k646K17P22P23R02R01R91R91k347k347j185j184j185
-1328h0984j185J520J520J520J520j371j371j371j371j967j967J371J371K504K503K504K503
-1311g2751j214j215k824k824J140j721o132j364J051J050K780K779J378J379n2n2J147J151
$$ plain form
-1441 -78428 -78272 -78115 -76096 -74077 -74442 -74807 -75947 -77087 -78227 -79367 -79405 -79442 -77095 -74747 -75530 -76312 -77095 -77877 -77042 -76208
-1421 -76208 -72512 -73585 -77281 -78115 -76566 -75016 -78749 -82482 -80194 -77907 -76931 -78816 -83205 -82825 -80328 -77832 -76469 -75105
-1403 -75105 -76603 -78101 -78168 -78235 -77735 -77236 -77214 -80053 -84024 -83227 -80045 -76864 -77288 -77709 -73842 -69971 -73585 -77195 -78425 -79650
-1383 -79650 -78287 -76920 -75556 -74189 -75001 -75809 -74237 -72661 -73674 -74684 -72359 -70031 -71968 -73902 -73932 -76819 -81744 -81897
-1365 -81897 -80623 -79345 -78399 -77449 -78589 -79725 -82474 -80455 -77005 -78324 -79136 -79948 -81059 -82169 -83123 -84076 -82646 -81215
-1347 -81215 -79755 -78294 -73973 -74420 -76409 -75537 -78183 -77966 -77244 -76521 -75619 -74718 -73727 -72736 -75083 -77430 -78615 -79799 -80984
-1328 -80984 -82169 -80649 -79129 -77609 -76089 -77460 -78831 -80202 -81573 -83540 -85507 -84136 -82765 -80261 -77758 -75254 -72751
-1311 -72751 -73965 -75180 -78004 -80828 -79688 -81409 -87541 -88905 -87854 -86804 -84024 -81245 -79867 -78488 -78540 -78592 -77445 -76294
-1293g6294J148J151p4p1k459k455M4M9K429K433R39R42k399k396L43L47N81n138k995K731
-1273h1144L442L446L070L074k68k65k68k65k68k64p16p15p15p16j430j431%%k012k012n81
-1252h0038n81q50q49q49q50K630K631j662j662p67p68O64O63o7o7o7o7K645K645K645K645
-1231g1976o40o37o41o37J445J449j892j889j788j785J550J553O56O60O55O60L28L31L28L32
-1211g1938j789j784n007P19r10r05J833J837J296J301j34j31J435J434J434J435j606j606
-1193g3086j75j75o82o82o81o82j069j070K269K269K314K313j978j978j233j234K105K105
-1175g1350j255j256j255j256R80R80J278m445m687J993J871r88J42J45J394J397J877J882
-1157g2553j461j456J550J553j788o554k064Q01j110j106O78O82L360j404p83p78J303J308
$$ plain form
-1293 -76294 -75146 -73995 -74069 -74140 -76599 -79054 -79010 -78961 -76532 -74099 -73160 -72218 -74617 -77013 -76670 -76323 -75742 -80880 -83875 -81144
-1273 -81144 -77702 -74256 -71186 -68112 -68380 -68645 -68913 -69178 -69446 -69710 -70426 -71141 -71856 -72572 -74002 -75433 -75433 -75433 -77445 -79457 -80038
-1252 -80038 -80619 -81469 -82318 -83167 -84017 -81387 -78756 -80418 -82080 -82847 -83615 -82951 -82288 -82355 -82422 -82489 -82556 -79911 -77266 -74621 -71976
-1231 -71976 -72616 -73253 -73894 -74531 -73086 -71637 -73529 -75418 -77206 -78991 -77441 -75888 -75232 -74572 -73917 -73257 -72929 -72598 -72270 -71938
-1211 -71938 -73727 -75511 -80518 -79799 -80709 -81614 -79781 -77944 -76648 -75347 -75481 -75612 -74177 -72743 -71309 -69874 -71480 -73086
-1193 -73086 -73261 -73436 -74118 -74800 -75481 -76163 -77232 -78302 -76033 -73764 -71450 -69137 -71115 -73093 -74326 -75560 -73455 -71350
-1175 -71350 -72605 -73861 -75116 -76372 -75392 -74412 -73134 -77579 -82266 -80273 -78402 -79390 -79248 -79103 -77709 -76312 -74435 -72553
-1157 -72553 -74014 -75470 -73920 -72367 -74155 -80709 -82773 -81972 -83082 -84188 -83510 -82828 -79468 -80872 -81655 -82433 -81130 -79822
-1139g9822J066J069J066J069K295K295O85O86q94l756k325N37L659L658o33o34k719n581
-1121g8279O18L480k575k574q46K016K433m29k932k932J248J248j136j136J009J010k42k42
-1103h0261k54K612J177j680J446J449J088J091l13l170R39L804L710Q53p00o97j352j349
-1085g1607k604k600P33L599P94n879m109O63k35k31K895L7L4K898p04p04J084J084j628J233
-1065g5247K485k284j836J024n85n85k999J770J770k999j688j688J531O300K873K872j419
-1048g0705m281k597k596k13k12J099L960L603j166j248j248j16j15J792J792j546j547k119
-1030g7463k120J218J218L24L24L25L24k50k49k50k50m005m005J837J837J427m296j256J606
-1011h3704r57r58N063N063O461P41l733J993J632j226o93o89l28l24J878J881l28l185l726
$$ plain form
-1139 -79822 -78756 -77687 -76621 -75552 -73257 -70962 -70277 -69591 -70485 -74241 -76566 -76029 -72370 -68712 -69345 -69979 -72698 -78279
-1121 -78279 -77661 -74181 -76756 -79330 -80176 -78160 -75727 -76156 -79088 -82020 -80772 -79524 -80660 -81796 -80787 -79777 -80019 -80261
-1103 -80261 -80515 -77903 -76726 -78406 -76960 -75511 -74423 -73332 -73645 -76815 -75876 -72072 -68362 -67509 -68209 -68906 -70258 -71607
-1085 -71607 -74211 -76811 -76078 -72479 -71685 -77564 -81673 -81010 -81245 -81476 -78581 -78544 -78510 -75612 -76316 -77020 -75936 -74852 -76480 -75247
-1065 -75247 -72762 -75046 -76882 -75858 -76443 -77028 -80027 -78257 -76487 -79486 -81174 -82862 -81331 -75031 -72158 -69286 -70705
-1048 -70705 -74986 -77583 -80179 -80392 -80604 -79505 -75545 -71942 -73108 -74356 -75604 -75720 -75835 -74043 -72251 -73797 -75344 -77463
-1030 -77463 -79583 -78365 -77147 -76823 -76499 -76174 -75850 -76100 -76349 -76599 -76849 -80854 -84859 -83022 -81185 -79758 -84054 -85310 -83704
-1011 -83704 -84661 -85619 -80556 -75493 -69032 -68291 -72024 -70031 -68399 -69625 -70318 -71007 -71335 -71659 -69781 -67900 -68228 -71413 -75139
-992g5139K001N156n62k891k6J847J852L040k678j737J129K556l163l226l62Q87j971j248
-974g4535J617j75j72O60O63O59O64l25l20k709k704Q38Q42j367j364J494M355J077m646k738
-954g8186K984K627l096q01q01j159j159Q68Q68J286M146J260m464j244J617R01R02l50l50
-935g4151K213K213P82P82O34O33p97p97Q57Q60Q57Q61r62r57k392k388j207j204K24K27K429
-914g1283K433K131K135J386l379p01o96K816K821k429k426M84M89r47l804k794J978K452
-896f9334K455k168k165l599l595K034K038j304j300O33O37O34O37k407k403r76r73J405J408
-877g8343J405J408M81M84J733l033j897j892K097K102p34p31p33p31M81M84m765m761L222
-858h3723L227L223L226Q90Q95n41n36P71P75P71P75j807j803l234l234M58M62J893J893o22
$$ plain form
-992 -75139 -73138 -67982 -68544 -71435 -71461 -69614 -67762 -64722 -67400 -69137 -68008 -65452 -68615 -71841 -72203 -71316 -73287 -74535
-974 -74535 -72918 -73093 -73265 -72605 -71942 -71283 -70619 -70944 -71264 -73973 -76677 -75839 -74997 -76364 -77728 -76234 -71879 -70802 -75448 -78186
-954 -78186 -75202 -72575 -75671 -76472 -77273 -78432 -79591 -78723 -77855 -76569 -72423 -71163 -75627 -76871 -75254 -74353 -73451 -73801 -74151
-935 -74151 -71938 -69725 -68943 -68161 -67527 -66894 -67691 -68488 -67631 -66771 -65914 -65053 -66015 -66972 -69364 -71752 -72959 -74163 -73939 -73712 -71283
-914 -71283 -68850 -66719 -64584 -63198 -66577 -67278 -67974 -65158 -62337 -64766 -67192 -66708 -66219 -67166 -70970 -73764 -71786 -69334
-896 -69334 -66879 -69047 -71212 -74811 -78406 -76372 -74334 -75638 -76938 -76305 -75668 -75034 -74397 -76804 -79207 -80183 -81156 -79751 -78343
-877 -78343 -76938 -75530 -75049 -74565 -72832 -75865 -77762 -79654 -77557 -75455 -76189 -76920 -77653 -78384 -77903 -77419 -82184 -86945 -83723
-858 -83723 -80496 -77273 -74047 -73157 -72262 -72803 -73339 -72568 -71793 -71022 -70247 -72054 -73857 -77091 -80325 -79867 -79405 -77512 -75619 -76241
-838g6241o19o18o19j725j721O63O63n85n81J803J804J680J684p01p00K12K16J647J647N40
-818g1551N44N44N44m352m351Q94L755K892j878j878K891N22k340k042Q20J714J714M62M62
-799g0634j722j721k90k91q87q86J497J498p38p37O93O93J199J200k31k31j189j184j185j185
-779g6331k828k824m39m40m73m70J915J915K269K273j12j12J293J297j088j088n25n22n21
-760g6811n22K351K354j937j937M73M77r54r54K470K474q68q64j464j461R20R24L409L413
-741f8507l744l741j509j505Q76Q79j613j610j613j609K34K39K34K39N227N231j9j5M1M5M1
-720g2199M5j688j688k57k57J084J084K515K515j345j345J993J993l401l402j017j017K87
-702g6100K91K87K90o37o33o37o34o96o93o97o93j90j86j90j87K478K481J047J051n03m99
$$ plain form
-838 -76241 -76860 -77478 -78097 -79822 -81543 -80880 -80217 -80802 -81383 -79580 -77776 -76096 -74412 -75113 -75813 -75601 -75385 -73738 -72091 -71551
-818 -71551 -71007 -70463 -69919 -74271 -78622 -77728 -73973 -71081 -72959 -74837 -71946 -71424 -73764 -75806 -74986 -73272 -71558 -71096 -70634
-799 -70634 -72356 -74077 -74367 -74658 -75545 -76431 -74934 -73436 -74174 -74911 -74218 -73525 -72326 -71126 -71357 -71588 -72777 -73961 -75146 -76331
-779 -76331 -79159 -81983 -82422 -82862 -83335 -83805 -81890 -79975 -77706 -75433 -75545 -75657 -74364 -73067 -74155 -75243 -75768 -76290 -76811
-760 -76811 -77333 -74982 -72628 -74565 -76502 -76029 -75552 -76506 -77460 -74990 -72516 -73384 -74248 -75712 -77173 -76253 -75329 -71920 -68507
-741 -68507 -72251 -75992 -77501 -79006 -78130 -77251 -78864 -80474 -82087 -83696 -83462 -83223 -82989 -82750 -77523 -72292 -72311 -72326 -72285 -72240 -72199
-720 -72199 -72154 -73842 -75530 -75787 -76044 -74960 -73876 -71361 -68846 -70191 -71536 -69543 -67550 -70951 -74353 -75370 -76387 -76100
-702 -76100 -75809 -75522 -75232 -75869 -76502 -77139 -77773 -78469 -79162 -79859 -80552 -80742 -80928 -81118 -81305 -78827 -76346 -75299 -74248 -74751 -75250
-681g5250R27R32l24l21l24l20L640L643o52o48l729l730K470K470K232K232j53j53j15j16
-661f7289j546j546J673J673p12p12r01r02J483J483J423J423r61r61j811j811l80l80q2q1
-641g0917J348J349J915J915j423j424p07p08J676J677p01p00P30P30J029J028K459K459k526
-622f0791k526Q12Q12J438J438K869K869O386O385O386O386J0290J0291J9111K4835K0938
-606E7929P586j3398k6750k5081j9357j5663r940k399k400m426m426m366m367p4p5q12q08
-589f8827O18O22j86j83K199K201O71O74M248j472k042L685l234l230P90P93o40o38J05J08
-569f3738k54k49J766l953j572M154N74N77R31R36P89P94k548k545K608K612M038M043L904
-550d7133L908O468O471R508J2373J0044M325k518j2052j1162j1158j0864p999p765k038j475
$$ plain form
-681 -75250 -74323 -73391 -73715 -74036 -74360 -74680 -71040 -67397 -68049 -68697 -72426 -76156 -73686 -71216 -68984 -66752 -66905 -67058 -67173 -67289
-661 -67289 -68835 -70381 -68708 -67035 -67747 -68459 -69360 -70262 -68779 -67296 -65873 -64450 -65411 -66372 -68183 -69994 -70374 -70754 -70836 -70917
-641 -70917 -69569 -68220 -66305 -64390 -65813 -67237 -67944 -68652 -66976 -65299 -66000 -66700 -65970 -65240 -64211 -63183 -60724 -58265 -60791
-622 -60791 -63317 -62505 -61693 -60255 -58817 -55948 -53079 -46693 -40308 -33922 -27536 -17246 -6955 12156 36991 57929
-606 57929 65515 52117 25367 286 -19071 -34734 -44674 -47073 -49473 -53899 -58325 -62691 -67058 -67132 -67207 -68019 -68827
-589 -68827 -68209 -67587 -67773 -67956 -65757 -63556 -62885 -62211 -57963 -59435 -61477 -57792 -61026 -64256 -63466 -62673 -63313 -63951 -63846 -63738
-569 -63738 -63992 -64241 -62475 -66428 -68000 -63846 -63272 -62695 -61764 -60828 -60039 -59245 -61793 -64338 -61730 -59118 -55080 -51037 -47133
-550 -47133 -43225 -36757 -30286 -20778 -8405 1639 5964 3446 -8606 -19768 -30926 -41790 -49789 -57554 -59592 -61067
-534f1067m333p019j293P01P04Q79Q83K180o78m855Q72J494j364j367M359O15k243m572m567
-515h0671j770j766J569J572J665J669k686J79R20m798j584J282J278J281J457J460K232K236
-497g4475K231K236P11P12j673j673k030k031k030k031J904J904m81m80l62l61l62l61O22
-478g8030O22K05k656m206J516M020J159m73m74o52o52J23J23J554J553k49k46k50k46M96
-458g6763M99r35r31K19K24k165k160j68j64j68j64J822J826j576J289J852l868M81L346m184
-438h1688j319M877K019k20l077l260l95J099J099k060k061J755J755J755J755j167j166J219
-420g9080J218l104l103L096L096O89O89p41p41l603l603O90O89J687J688K57K57J450J449
-401g7020J9J8J081J084l50l47n59n55n59n55k027k023L58L61l248l245J043J047l43l39K042
$$ plain form
-534 -61067 -65400 -72419 -73712 -73011 -72307 -71428 -70545 -68365 -69043 -73898 -73026 -71532 -72896 -74263 -69904 -69289 -71532 -76104 -80671
-515 -80671 -82441 -84207 -82638 -81066 -79401 -77732 -80418 -80239 -79319 -84117 -85701 -84419 -83141 -81860 -80403 -78943 -76711 -74475
-497 -74475 -72244 -70008 -69297 -68585 -70258 -71931 -73961 -75992 -78022 -80053 -78149 -76245 -76726 -77206 -77568 -77929 -78291 -78652 -78030
-478 -78030 -77408 -77203 -79859 -84065 -82549 -78529 -77370 -77843 -78317 -78969 -79621 -79498 -79375 -77821 -76268 -76517 -76763 -77013 -77259 -76763
-458 -76763 -76264 -77199 -78130 -77911 -77687 -79852 -82012 -82180 -82344 -82512 -82676 -80854 -79028 -80604 -79315 -77463 -81331 -80850 -77504 -81688
-438 -81688 -83007 -78130 -76111 -76331 -79408 -82668 -83063 -81964 -80865 -82925 -84986 -83231 -81476 -79721 -77966 -79133 -80299 -79080
-420 -79080 -77862 -80966 -84069 -80973 -77877 -77188 -76499 -77240 -77981 -81584 -85187 -84497 -83808 -82121 -80433 -80176 -79919 -78469 -77020
-401 -77020 -77001 -76983 -75902 -74818 -75168 -75515 -76074 -76629 -77188 -77743 -79770 -81793 -81435 -81074 -84322 -87567 -86524 -85477 -85820 -86159 -84117
-380h4117K045R98J003R98J002L152L156k094k090j140j136j141j136J066J069N357N362J333
-362f6313J338r7r3o118o113q72q68J721J725J721J725l081l077J211J214j948j945M36M39
-343g8995k64k61k65k60K42K46j189j185j371j371J014J013q05q04L308L308K370m92k459
-324g8220L264M605j118j833j833k27k27K157K157J00J01k284k284p8p8p8p9j091j092j091
-304g9229j092q98q94K440K444J666J669J665J669J45J50l193l190J100J102j285j282n99
-286g7612n97n99n97L25L27K709K712R65R69m66m62n85n81n85n81K6L0K6L0J099J103J099
-264g1245J102j449j445j450j445l17l13K068K071r57r54K381K384R80R84k061k056l029J743
-245g3008O67k190j032j029J174J177J315J319k977k973j963j960j665j662r50L823K746j12
$$ plain form
-380 -84117 -82072 -81074 -80071 -79073 -78071 -74919 -71763 -73857 -75947 -77087 -78223 -79364 -80500 -79434 -78365 -73008 -67646 -66313
-362 -66313 -64975 -65072 -65165 -71283 -77396 -78268 -79136 -77415 -75690 -73969 -72244 -75325 -78402 -77191 -75977 -77925 -79870 -79434 -78995
-343 -78995 -79259 -79520 -79785 -80045 -79803 -79557 -80746 -81931 -83302 -84673 -83659 -82646 -83451 -84255 -80947 -77639 -75269 -75761 -78220
-324 -78220 -74956 -70351 -71469 -73302 -75135 -75362 -75589 -73432 -71275 -71175 -71074 -73358 -75642 -75720 -75798 -75876 -75955 -77046 -78138 -79229
-304 -79229 -80321 -81219 -82113 -79673 -77229 -75563 -73894 -72229 -70560 -70415 -70265 -73458 -76648 -75548 -74446 -75731 -77013 -77612
-286 -77612 -78209 -78808 -79405 -79080 -78753 -76044 -73332 -72367 -71398 -71864 -72326 -72911 -73492 -74077 -74658 -74632 -74602 -74576 -74546 -73447 -72344 -71245
-264 -71245 -70143 -71592 -73037 -74487 -75932 -76249 -76562 -74494 -72423 -73380 -74334 -71953 -69569 -68589 -67605 -69666 -71722 -74751 -73008
-245 -73008 -72341 -74531 -75563 -76592 -75418 -74241 -72926 -71607 -74584 -77557 -79520 -81480 -83145 -84807 -85757 -81934 -79188 -79300
-227g9300j457j453K656K661q83q80q83q79j509j505j97M575L215j550m%K083K086O52O56
-207g1916l144l141n81n78m92K374L621j144m113j248j610J256L159L02k98k94O18O19O18
-188g5992O19j528j527j528j527K421K422r17r16J915J915j423j424K430K429R98R99r09r09
-169g2452N21N22j252j252J79J79o86o85L308L308J457l312l31l32l312J457J158J159o3o4
-149g0493o3o3j405j405K6K7R46R46m84m84l36l35l35l36r91r91M40M40J989J990N58N59o00
-126g0400n96o00n96K05K09J635J640Q31Q34o00n96r28r23r28r24p90p86M62M66j35k991m784
-104h0295R43M202J345l0k6J550J554J19J23j494j494j077J785J665m057J725J725j837j837
-85g5411J502J501P1P1n533J90J699J699O26O26O26O26q05q05j624j625j93j94K83K83j147
$$ plain form
-227 -79300 -80757 -82210 -79554 -76893 -77776 -78656 -79539 -80418 -81927 -83432 -83629 -79054 -75839 -77389 -77393 -77393 -75310 -73224 -72572 -71916
-207 -71916 -75060 -78201 -78782 -79360 -79852 -77478 -73857 -75001 -79114 -80362 -81972 -80716 -77557 -77255 -77553 -77847 -77229 -76610 -75992
-188 -75992 -75373 -76901 -78428 -79956 -81483 -79062 -76640 -77557 -78473 -76558 -74643 -76066 -77490 -75060 -72631 -71633 -70634 -71543 -72452
-169 -72452 -71931 -71409 -72661 -73913 -73734 -73555 -74241 -74926 -71618 -68310 -66853 -70165 -70496 -70828 -74140 -72683 -71525 -70366 -70429 -70493
-149 -70493 -70556 -70619 -72024 -73429 -73403 -73376 -72430 -71484 -71968 -72452 -72788 -73123 -73458 -73794 -74785 -75776 -75336 -74896 -72907 -70917 -70359 -69800 -70400
-126 -70400 -70996 -71596 -72192 -71987 -71778 -70143 -68503 -67672 -66838 -67438 -68034 -68962 -69885 -70813 -71737 -72527 -73313 -72851 -72385 -72520 -75511 -80295
-104 -80295 -79352 -75150 -73805 -73835 -73861 -72311 -70757 -70638 -70515 -72009 -73503 -74580 -72795 -71130 -75187 -73462 -71737 -73574 -75411
-85 -75411 -73909 -72408 -72337 -72266 -77799 -77609 -75910 -74211 -73585 -72959 -72333 -71707 -72512 -73317 -74941 -76566 -76759 -76953 -76670 -76387 -77534
-64g7534j148J487J490k805k802J45J49J46J49M824M829J486J491r28r24N03N07j640j635
-45g2210J699J702j818j814l249l245j855j852M702j017n74n70M99N03O48O52O48O52J752
-26g4747J754J632m087p38p34L36L39J27J30j304j300J069J073J069J073j553j550j554j550
-7h0515q16q12K522K526K433K437J002J006k753k750l69l65k097k094o67o63J345J348L730
11g5552L733K179K184l067l062k664k660O74O78J360J364j025j021J480J482J479J483k79
29g1234k76J151J155l066l062j636L137J077j781J23J27K395K399r42r39j539j535j538j535
48g7519k742k739J550J554K9L4j401j397K2K6J453J457K3K6J691l074m753J926M843P8q19
69g9732q16o41M132L546O90J162l603m083j218p45p42r16r13N14N18J110J114j930j926j244
$$ plain form
-64 -77534 -78682 -77195 -75705 -78510 -81312 -81167 -81018 -80872 -80723 -75899 -71070 -69584 -68093 -69021 -69945 -69442 -68935 -70575 -72210
-45 -72210 -70511 -68809 -70627 -72441 -75690 -78935 -80790 -82642 -77940 -78957 -79531 -80101 -79602 -79099 -78451 -77799 -77151 -76499 -74747
-26 -74747 -72993 -71361 -75448 -76186 -76920 -76584 -76245 -76118 -75988 -77292 -78592 -77523 -76450 -75381 -74308 -75861 -77411 -78965 -80515
-7 -80515 -81331 -82143 -79621 -77095 -74662 -72225 -71223 -70217 -72970 -75720 -76089 -76454 -78551 -80645 -81312 -81975 -80630 -79282 -75552
11 -75552 -71819 -69640 -67456 -70523 -73585 -76249 -78909 -78235 -77557 -76197 -74833 -75858 -76879 -75399 -73917 -72438 -70955 -71234
29 -71234 -71510 -70359 -69204 -72270 -75332 -76968 -73831 -72754 -74535 -74412 -74285 -71890 -69491 -70433 -71372 -72911 -74446 -75984 -77519
48 -77519 -80261 -83000 -81450 -79896 -79867 -79833 -81234 -82631 -82609 -82583 -81130 -79673 -79650 -79624 -77933 -81007 -85760 -83834 -78991 -78913 -79732
69 -79732 -80548 -81189 -77057 -73511 -72821 -71659 -75262 -79345 -80563 -81308 -82050 -82966 -83879 -83365 -82847 -81737 -80623 -82553 -84479 -85723
89h5723L528M180M184J498J501l748l744j386j382M4M9L085L088k161k157Q20Q23o11o07J803
109g6916J807L234L238j755j755j755j755j546j546Q38Q39p57p56J628J628n47n48j978j979
128h0381m80m81m80m81o89o90J696J695j38j38j568j569j866j867K425K426K671K675K87K91
148g6662o97o93o97o93R58R61m73m70k410k407R28R31J591J595k701k698K902K906m35n201
168h3465k567K98P71P75J576J579J576J580M40M43j945j941J602J606r61r58l35l193j56M616
188g8659J244j613K90K95J427J430r57r54J934J937l312l309J554J557J23J27j546j543Q39
207g9136Q42J304J304k035k034J334J334j051j050r54r54r54r54K09K09K08K09O45O44O45
227h0235O44j501j502K791K790J703J703j636m497j904K865J614j248k277k273J837J841J121
$$ plain form
89 -85723 -82195 -78015 -73831 -72333 -70832 -74580 -78324 -79710 -81092 -81048 -80999 -77914 -74826 -76987 -79144 -78324 -77501 -78112 -78719 -76916
109 -76916 -75109 -71875 -68637 -70392 -72147 -73902 -75657 -77203 -78749 -77911 -77072 -77829 -78585 -76957 -75329 -75876 -76424 -78402 -80381
128 -80381 -80861 -81342 -81822 -82303 -82992 -83682 -81986 -80291 -80429 -80567 -82135 -83704 -85570 -87437 -85012 -82586 -79915 -77240 -76953 -76662
148 -76662 -77359 -78052 -78749 -79442 -78484 -77523 -77996 -78466 -80876 -83283 -82355 -81424 -79833 -78238 -80939 -83637 -80735 -77829 -78264 -83465
168 -83465 -86032 -85734 -84963 -84188 -82612 -81033 -79457 -77877 -77437 -76994 -78939 -80880 -79278 -77672 -78633 -79591 -79926 -83119 -83275 -78659
188 -78659 -77415 -79028 -78738 -78443 -77016 -75586 -76543 -77497 -75563 -73626 -76938 -80247 -78693 -77136 -77013 -76886 -78432 -79975 -79136
207 -79136 -78294 -76990 -75686 -77721 -79755 -78421 -77087 -78138 -79188 -80142 -81096 -82050 -83004 -82795 -82586 -82378 -82169 -81524 -80880 -80235
227 -80235 -79591 -81092 -82594 -79803 -77013 -75310 -73607 -75243 -79740 -81644 -78779 -77165 -78413 -80690 -82963 -81126 -79285 -78164
245g8164J125j263j259j01r6j01r7K850K854j442j438r13r09N18N22J591J594j747j744J420
265g6800J423l826l823J181J185J181J185J19J23J19J23J192J196j192j188K004K008k288
283g6078k283K46K49k138k135J080J084J081J084K004K009l80l77J245J248K675K678k689
301f9397k687k868k865J00k757l833R38L380L382j568m426l029J744J263J266n85n81n85n81
320h3689L76L80L77L80j114j111L17L20o07o03J777J781J270J274M132o33m039j177K53K57
340h0079m62m62R69R72m02m03m02l99r68r69J416J419L21L20J751J755j617j617J721J725
360g5411o03o04o03o00K317K318K317K321k656k653O82O85l3l0l4k9j234j229J97K02j01r7
382g4878j00r7Q90Q94n40n36K64K68K65K68K12K17K12K16n6n2j487j482j755j755j755j751
$$ plain form
245 -78164 -77039 -78302 -79561 -79662 -79758 -79859 -79956 -77106 -74252 -75694 -77132 -78045 -78954 -78436 -77914 -76323 -74729 -76476 -78220 -76800
265 -76800 -75377 -79203 -83026 -81845 -80660 -79479 -78294 -78175 -78052 -77933 -77810 -76618 -75422 -76614 -77802 -75798 -73790 -76078
283 -76078 -78361 -78115 -77866 -80004 -82139 -81059 -79975 -78894 -77810 -75806 -73797 -74177 -74554 -73309 -72061 -69386 -66708 -69397
301 -69397 -72084 -74952 -77817 -77717 -80474 -84307 -83369 -79989 -76607 -78175 -82601 -85630 -83886 -82623 -81357 -81942 -82523 -83108 -83689
320 -83689 -83313 -82933 -82556 -82176 -83290 -84401 -84084 -83764 -84371 -84974 -83197 -81416 -80146 -78872 -74740 -75373 -79412 -80589 -80336 -80079
340 -80079 -80541 -81003 -80034 -79062 -79464 -79867 -80269 -80668 -81636 -82605 -81189 -79770 -79449 -79129 -77378 -75623 -77240 -78857 -77136 -75411
360 -75411 -76014 -76618 -77221 -77821 -75504 -73186 -70869 -68548 -71204 -73857 -73175 -72490 -72523 -72553 -72587 -72616 -73850 -75079 -74882 -74680 -74781 -74878
382 -74878 -74978 -75075 -74185 -73291 -73831 -74367 -74103 -73835 -73570 -73302 -73090 -72873 -72661 -72445 -72501 -72553 -74040 -75522 -77277 -79032 -80787 -82538
404h2538n33n32Q98R01J010J009j374j371K291K291K291K295J040J039l252l249J725J725
422g4334k567k563j054j055J330J334n48n47n48n44N18N21J949J952Q76Q79n55n51j83j79
442g5869j82j79l91l88J993J997M66M69r65r61j144j140J241J244M74M76j911j907K172K175
462g2330P42P45m95m96m96m95p34p34p34p34J539J539q46q46n77n78n77n78l13l13l13l13
484g7937j505j505J833J833n21n22R09R09l204l204J34J34K31K35j200j196j319j315J841
$$ plain form
404 -82538 -83071 -83603 -82705 -81804 -80794 -79785 -81159 -82530 -80239 -77948 -75657 -73362 -72322 -71283 -74535 -77784 -76059 -74334
422 -74334 -76901 -79464 -80518 -81573 -80243 -78909 -79457 -80004 -80552 -81096 -80578 -80057 -78108 -76156 -75280 -74401 -74956 -75507 -75690 -75869
442 -75869 -76051 -76230 -76621 -77009 -75016 -73019 -72553 -72084 -73049 -74010 -75154 -76294 -75053 -73809 -73335 -72859 -74770 -76677 -74505 -72330
462 -72330 -71588 -70843 -71338 -71834 -72330 -72825 -73559 -74293 -75027 -75761 -74222 -72683 -73529 -74375 -74952 -75530 -76107 -76685 -76998 -77311 -77624 -77937
484 -77937 -79442 -80947 -79114 -77281 -77802 -78324 -77415 -76506 -79710 -82914 -82780 -82646 -82415 -82180 -83380 -84576 -85895 -87210 -85369
$$ [...]
##END=	
