##TITLE=	LS00027756.10.fid
##JCAMPDX=	6.0	$$ NMR Plug-in 1.13 of MestReNova 11.0.4-18998
##DATATYPE=	NMRSPECTRUM
##DATACLASS=	XYDATA
##NUMDIM=	1
##ORIGIN=	Bruker BioSpin GmbH
##OWNER=	best
##.OBSERVEFREQUENCY=	700.03432297180802379
##.OBSERVENUCLEUS=	^1H
##.SOLVENTNAME=	DMSO
##.PULSESEQUENCE=	zg30
##LONGDATE=	2007/10/29 13:31:00.000
##.ACQUISITIONMODE=	SIMULTANEOUS (DQD)
##$ORIGINALFORMAT=	Bruker XWIN-NMR
##$PARAMETERFILE=	(acqus, ASCII, /var/folders/bp/m_4195y96sx1d256lqvkcvym0000gq/T/tW7K6eJET3iSdszNklhF1A/1H/acqus, 0)
$$ ##TITLE= Parameter file, TOPSPIN		Version 2.0
$$ ##JCAMPDX= 5.0
$$ ##DATATYPE= Parameter Values
$$ ##NPOINTS= 1	$$ modification sequence number
$$ ##ORIGIN= Bruker BioSpin GmbH
$$ ##OWNER= best
$$ $$ 2007-11-05 15:19:29.436 +0000  best@ukapdwlx069
$$ $$ /opt/topspin/data/routine2007/nmr/LS00027756/20/acqus
$$ $$ process /opt/topspin/prog/mod/dirdata
$$ ##$ACQT0= 1000000
$$ ##$AMP= (0..31)
$$ 100 100 100 100 100 100 100 100 100 100 100 100 100 100 100 100 100 100 
$$ 100 100 100 100 100 100 100 100 100 100 100 100 100 100 
$$ ##$ANAVPT= -1
$$ ##$AQSEQ= 0
$$ ##$AQ_mod= 3
$$ ##$AUNM= <au_zg>
$$ ##$AUTOPOS= <26 >
$$ ##$BF1= 700.03
$$ ##$BF2= 700.03
$$ ##$BF3= 700.03
$$ ##$BF4= 700.03
$$ ##$BF5= 500.13
$$ ##$BF6= 500.13
$$ ##$BF7= 500.13
$$ ##$BF8= 500.13
$$ ##$BYTORDA= 0
$$ ##$CFDGTYP= 0
$$ ##$CFRGTYP= 9
$$ ##$CHEMSTR= <none>
$$ ##$CNST= (0..63)
$$ 1 1 145 1 1 1 1 1 1 1 1 1 1 1 1 1 1 1 1 1 1 1 1 1 1 1 1 1 1 1 1 1 1 1 
$$ 1 1 1 1 1 1 1 1 1 1 1 1 1 1 1 1 1 1 1 1 1 1 1 1 1 1 1 1 1 1 
$$ ##$CPDPRG= <>
$$ ##$CPDPRG1= <>
$$ ##$CPDPRG2= <>
$$ ##$CPDPRG3= <>
$$ ##$CPDPRG4= <mlev>
$$ ##$CPDPRG5= <mlev>
$$ ##$CPDPRG6= <mlev>
$$ ##$CPDPRG7= <mlev>
$$ ##$CPDPRG8= <mlev>
$$ ##$CPDPRGB= <>
$$ ##$CPDPRGT= <>
$$ ##$D= (0..63)
$$ 0 3 0 0 0 0 0 0 0 0.06 0 0 0 0 0 0 0.0002 0 0 0 0 0 0 0 0 0 0 0 0 0 0 
$$ 0 0 0 0 0 0 0 0 0 0 0 0 0 0 0 0 0 0 0 0 0 0 0 0 0 0 0 0 0 0 0 0 0 
$$ ##$DATE= 1193664683
$$ ##$DBL= (0..7)
$$ 120 120 120 120 120 120 120 120 
$$ ##$DBP= (0..7)
$$ 150 150 150 150 150 150 150 150 
$$ ##$DBP07= 0
$$ ##$DBPNAM0= <>
$$ ##$DBPNAM1= <>
$$ ##$DBPNAM2= <>
$$ ##$DBPNAM3= <>
$$ ##$DBPNAM4= <>
$$ ##$DBPNAM5= <>
$$ ##$DBPNAM6= <>
$$ ##$DBPNAM7= <>
$$ ##$DBPOAL= (0..7)
$$ 0.5 0.5 0.5 0.5 0.5 0.5 0.5 0.5 
$$ ##$DBPOFFS= (0..7)
$$ 0 0 0 0 0 0 0 0 
$$ ##$DE= 6
$$ ##$DECBNUC= <off>
$$ ##$DECIM= 1386.66666666667
$$ ##$DECNUC= <off>
$$ ##$DECSTAT= 4
$$ ##$DIGMOD= 1
$$ ##$DIGTYP= 12
$$ ##$DL= (0..7)
$$ 0 120 120 120 120 120 120 120 
$$ ##$DP= (0..7)
$$ 150 150 150 150 150 150 150 150 
$$ ##$DP07= 0
$$ ##$DPNAME0= <>
$$ ##$DPNAME1= <>
$$ ##$DPNAME2= <>
$$ ##$DPNAME3= <>
$$ ##$DPNAME4= <>
$$ ##$DPNAME5= <>
$$ ##$DPNAME6= <>
$$ ##$DPNAME7= <>
$$ ##$DPOAL= (0..7)
$$ 0.5 0.5 0.5 0.5 0.5 0.5 0.5 0.5 
$$ ##$DPOFFS= (0..7)
$$ 0 0 0 0 0 0 0 0 
$$ ##$DQDMODE= 0
$$ ##$DR= 22
$$ ##$DS= 2
$$ ##$DSLIST= <SSSSSSSSSSSSSSS>
$$ ##$DSPFIRM= 0
$$ ##$DSPFVS= 20
$$ ##$DTYPA= 0
$$ ##$EXP= <proton.c>
$$ ##$F1LIST= <111111111111111>
$$ ##$F2LIST= <222222222222222>
$$ [...]
$$ -1 -1 -1 -1 -1 -1 -1 -1 -1 -1 -1 -1 -1 -1 -1 -1 -1 -1 -1 -1 -1 -1 -1 -1 
$$ -1 -1 -1 -1 -1 -1 -1 -1 -1 -1 -1 -1 -1 -1 -1 -1 -1 -1 -1 -1 -1 -1 -1 -1 
$$ -1 -1 -1 -1 -1 -1 -1 -1 -1 -1 -1 -1 -1 -1 -1 -1 -1 -1 -1 -1 -1 -1 -1 -1 
$$ -1 -1 -1 -1 -1 -1 -1 -1 -1 -1 -1 -1 -1 -1 -1 -1 
$$ ##$RG_tab8= (0..255)
$$ -1 -1 -1 -1 -1 -1 -1 -1 -1 -1 -1 -1 -1 -1 -1 -1 -1 -1 -1 -1 -1 -1 -1 -1 
$$ -1 -1 -1 -1 -1 -1 -1 -1 -1 -1 -1 -1 -1 -1 -1 -1 -1 -1 -1 -1 -1 -1 -1 -1 
$$ -1 -1 -1 -1 -1 -1 -1 -1 -1 -1 -1 -1 -1 -1 -1 -1 -1 -1 -1 -1 -1 -1 -1 -1 
$$ -1 -1 -1 -1 -1 -1 -1 -1 -1 -1 -1 -1 -1 -1 -1 -1 -1 -1 -1 -1 -1 -1 -1 -1 
$$ -1 -1 -1 -1 -1 -1 -1 -1 -1 -1 -1 -1 -1 -1 -1 -1 -1 -1 -1 -1 -1 -1 -1 -1 
$$ -1 -1 -1 -1 -1 -1 -1 -1 -1 -1 -1 -1 -1 -1 -1 -1 -1 -1 -1 -1 -1 -1 -1 -1 
$$ -1 -1 -1 -1 -1 -1 -1 -1 -1 -1 -1 -1 -1 -1 -1 -1 -1 -1 -1 -1 -1 -1 -1 -1 
$$ -1 -1 -1 -1 -1 -1 -1 -1 -1 -1 -1 -1 -1 -1 -1 -1 -1 -1 -1 -1 -1 -1 -1 -1 
$$ -1 -1 -1 -1 -1 -1 -1 -1 -1 -1 -1 -1 -1 -1 -1 -1 -1 -1 -1 -1 -1 -1 -1 -1 
$$ -1 -1 -1 -1 -1 -1 -1 -1 -1 -1 -1 -1 -1 -1 -1 -1 -1 -1 -1 -1 -1 -1 -1 -1 
$$ -1 -1 -1 -1 -1 -1 -1 -1 -1 -1 -1 -1 -1 -1 -1 -1 
$$ ##$RG_tabA= (0..255)
$$ 0.25 0.28 0.32 0.35 0.4 0.44 0.5 0.56 0.64 0.7 0.8 0.89 1 1.12 1.28 1.4 
$$ 1.6 1.78 2 2.25 2.56 2.8 3.2 3.56 4 4.5 5 5.6 6.35 7.12 8 9 10 11.3 12.7 
$$ 14.2 16 18 20.2 22.6 25.4 28.5 32 36 40.3 45.2 50.8 57 64 71.8 80.6 90.5 
$$ 101 114 128 144 161 181 203 228 256 287 322 362 406 456 512 575 645 724 
$$ 812 912 1030 1150 1290 1440 1620 1820 2050 -1 -1 -1 -1 -1 -1 -1 -1 -1 
$$ -1 -1 -1 -1 -1 -1 -1 -1 -1 -1 -1 -1 -1 -1 -1 -1 -1 -1 -1 -1 -1 -1 -1 -1 
$$ -1 -1 -1 -1 -1 -1 -1 -1 -1 -1 -1 -1 -1 -1 -1 -1 -1 -1 -1 -1 -1 -1 -1 -1 
$$ -1 -1 -1 -1 -1 -1 -1 -1 -1 -1 -1 -1 -1 -1 -1 -1 -1 -1 -1 -1 -1 -1 -1 -1 
$$ -1 -1 -1 -1 -1 -1 -1 -1 -1 -1 -1 -1 -1 -1 -1 -1 -1 -1 -1 -1 -1 -1 -1 -1 
$$ -1 -1 -1 -1 -1 -1 -1 -1 -1 -1 -1 -1 -1 -1 -1 -1 -1 -1 -1 -1 -1 -1 -1 -1 
$$ -1 -1 -1 -1 -1 -1 -1 -1 -1 -1 -1 -1 -1 -1 -1 -1 -1 -1 -1 -1 -1 -1 -1 -1 
$$ -1 -1 -1 -1 -1 -1 -1 -1 -1 -1 -1 -1 -1 -1 -1 -1 -1 -1 -1 -1 -1 -1 -1 -1 
$$ ##$ROUT14= (0..7)
$$ 0 0 0 0 0 0 0 0 
$$ ##$ROUTER= 2
$$ ##$RX22TY= <no>
$$ ##$RXFMAX= (0..7)
$$ 1072 -1 -1 -1 -1 -1 -1 -1 
$$ ##$RXFMIN= (0..7)
$$ 5 -1 -1 -1 -1 -1 -1 -1 
$$ ##$RXINTLV= (0..7)
$$ 1 0 0 0 0 0 0 0 
$$ ##$RXMSTY= <no>
$$ ##$SCMTY= <no>
$$ ##$SGUC1= (0..15)
$$ 0 0 0 0 0 0 0 0 0 0 0 0 0 0 0 0 
$$ ##$SGUC2= (0..15)
$$ 0 0 0 0 0 0 0 0 0 0 0 0 0 0 0 0 
$$ ##$SPECTR= 5
$$ ##$SY2FLAG= 0
$$ ##$TFXNUM= 0
$$ ##$TRIPLO2= 0
$$ ##$VTUTY= <tty05>
$$ ##$WBREFAM= (0..15)
$$ 100 100 100 100 100 100 100 100 100 100 100 100 100 100 100 100 
$$ ##$WBREFPH= (0..15)
$$ 0 0 0 0 0 0 0 0 0 0 0 0 0 0 0 0 
$$ ##$XFAC= 2
$$ ##END=
$$ 
##$DECIM=	1386.66666666667
##$DSPFVS=	20
##XUNITS=	HZ
##YUNITS=	ARBITRARY UNITS
##FIRSTX=	11534.510269589600284
##LASTX=	-2888.4566141431992037
##XFACTOR=	-0.11003934420072174205
##YFACTOR=	1.9803696289062499387e-06
##NPOINTS=	131072
##XYDATA=	(X++(Y..Y))
$$ [...]
-30546C212811L912L316L317m179r890q046L376Q016Q016n190n191K305Q016L317q105j2746
$$ 3212811 3216723 3220039 3223356 3219177 3209287 3201241 3204617 3212633 3220649 3215459 3210268 3212573 3220589 3223906 3215801 3203055
-30530C203055j2745k275k276R146R147M01M02M01M02o69o70q164j3876r949J472R325L614
$$ 3203055 3190310 3188035 3185759 3194905 3204052 3204453 3204855 3205256 3205658 3204989 3204319 3196155 3182279 3172330 3173802 3183127 3186741
-30513C186741q165q165K543K543l703r414j561R860J7950J2240k870k870k09k08k08k09M314
$$ 3186741 3178576 3170411 3172954 3175497 3171794 3162380 3160819 3170679 3188629 3200869 3197999 3195129 3194920 3194712 3194504 3194295 3198609
-30496C198609M312L0j1392q834K588r82o692k647L063J0916J0916K603K603K602K603p29
$$ 3198609 3202921 3202951 3191559 3182725 3185313 3184331 3177639 3174992 3178055 3188971 3199887 3202490 3205093 3207695 3210298 3209569
-30480C209569p28p29p29j0128j0128J294J294l72l72p28p29J5n696q908K513O915O916l792
$$ 3209569 3208841 3208112 3207383 3197255 3187127 3188421 3189715 3189343 3188971 3188243 3187514 3187529 3181833 3172925 3175438 3182353 3189269 3185477
-30462C185477l793O797O796O797O796J324J324J323J324m525m525m525m525K138K138K138
$$ 3185477 3181684 3188481 3195277 3202074 3208870 3210194 3211518 3212841 3214165 3209640 3205115 3200590 3196065 3198203 3200341 3202479
-30446C202479K138M041M042M041M042j2853j2853q214L209J1061N350k145k145p023p024
$$ 3202479 3204617 3208658 3212700 3216741 3220783 3207930 3195077 3186863 3190072 3201133 3206483 3204338 3202193 3195170 3188146
-30431C188146k740Q681J3084J662r522r522R753K1174R752j669q295q291K413K417r485r481
$$ 3188146 3185406 3194087 3207171 3208833 3199311 3189789 3199542 3220716 3230468 3228799 3220504 3212213 3214626 3217043 3207558 3198077
-30415C198077r485r481J878J881J878J881n261n257O161O164P246P251m176m171n603n600
$$ 3198077 3188592 3179111 3180989 3182870 3184748 3186629 3181368 3176111 3182272 3188436 3195682 3202933 3198757 3194586 3188983 3183383
-30399C183383n246n242L439R154J2362R44p268p265L439L443J294J297J294J298K007K012
$$ 3183383 3178137 3172895 3176334 3185488 3197850 3198794 3191526 3184261 3187700 3191143 3192437 3193734 3195028 3196326 3198333 3200345
-30383C200345K008K011N875N878N874N878O113O116n785j7203j6018m591K900k808o974o972
$$ 3200345 3202353 3204364 3210239 3216117 3221991 3227869 3233982 3240098 3234313 3217110 3201092 3196501 3199401 3196593 3189619 3182647
-30367C182647M090M094m239m235J0872J6586O469m949n309O116J5010L588q310q310m978
$$ 3182647 3186737 3190831 3186592 3182357 3193229 3209815 3216284 3211335 3206026 3212142 3227152 3230740 3222430 3214120 3209142
-30352C209142m979m978m979o35o36o36o36M124M123M123M123L544L543L900L900J164O875
$$ 3209142 3204163 3199185 3194206 3193571 3192935 3192299 3191663 3195787 3199910 3204033 3208156 3211700 3215243 3219143 3223043 3224207 3231082
-30335C231082J0087j335j4898j4898l358Q065K710l000R26R25J023J022J023J022J023J022
$$ 3231082 3241169 3239834 3224936 3210038 3206680 3214745 3217455 3214455 3215381 3216306 3217329 3218351 3219374 3220396 3221419 3222441
-30319C222441J023J022m688m689m688m689J737J736r686r685K777K778K777K777N633N633
$$ 3222441 3223464 3224486 3219798 3215109 3210421 3205732 3207469 3209205 3199519 3189834 3192611 3195389 3198166 3200943 3206576 3212209
-30303C212209n789n789l766l767l766l766m480m481m480m480K034K034K033K034K986K985
$$ 3212209 3206420 3200631 3196865 3193098 3189332 3185566 3181086 3176605 3172125 3167645 3169679 3171713 3173746 3175780 3178766 3181751
-30287C181751J3693J3694Q875k547j4445j4444q020L402Q399Q399L596L595L595L596N974
$$ 3181751 3195444 3209138 3218013 3215466 3201021 3186577 3178557 3181959 3190358 3198757 3202353 3205948 3209543 3213139 3219113
-30272C219113N975J335j0087j4251q540j045j045k353k354k353k354o503o502M561M562O109
$$ 3219113 3225088 3226423 3216336 3202085 3193545 3192500 3191455 3189102 3186748 3184395 3182041 3175538 3169036 3173597 3178159 3184268
-30256C184268L98l528P893J2355R33l350l350J885J885n253O168Q801k622j7374j1663M636
$$ 3184268 3184666 3181138 3189031 3201386 3202319 3198969 3195619 3197504 3199389 3194136 3200304 3209105 3206483 3189109 3177446 3182082
-30240C182082J0347ln715j848R574O005K93M220M220L506L506n46o258J238J2660N878n543
$$ 3182082 3192429 3192426 3186711 3184863 3194437 3200442 3200735 3204955 3209175 3212681 3216187 3215641 3209383 3210621 3223281 3229159 3223616
-30223C223616n544N879O770m651j2147o436l937l938l937l937L781j930n499N923J9843J4132
$$ 3223616 3218072 3223951 3230721 3226070 3213923 3207487 3203550 3199612 3195675 3191738 3195519 3193589 3188090 3194013 3213856 3227988
-30207C227988n379j1091m072m071m428m428J758J759J758J759N190N191o231o232n20n21
$$ 3227988 3222609 3211518 3207446 3203375 3198947 3194519 3196277 3198036 3199794 3201553 3206743 3211934 3205703 3199471 3198951 3198430
-30191C198430n20n21P511P510l912l911m149m149m150m149L599L599L599L599o871o871o871
$$ 3198430 3197910 3197389 3204900 3212410 3208498 3204587 3200438 3196289 3192139 3187990 3191589 3195188 3198787 3202386 3195515 3188644 3181773
-30174C181773o871Q358Q359Q358Q358K409K410r013r012j807j808j806j807l80l79L904J5326
$$ 3181773 3174902 3183260 3191619 3199977 3208335 3210744 3213154 3204141 3195129 3193322 3191514 3189708 3187901 3187521 3187142 3191046 3206372
-30157C206372J2708J286k996k997N807N808n614n614l533l532k1378k1379k818J6218J1935
$$ 3206372 3219080 3220366 3217370 3214373 3220180 3225988 3220374 3214760 3211227 3207695 3186317 3164938 3162120 3178338 3190273
-30142C190273N13L666L666K952K952R7R6R7R7n28n24n28n25J86J90J86J89o476o474M946
$$ 3190273 3190786 3194452 3198118 3201070 3204022 3204119 3204215 3204312 3204409 3203881 3203357 3202829 3202304 3202490 3202680 3202866 3203055 3196579 3190105 3195051
-30122C195051M948j480j476j480j476O581O585O581O584q1p8q2p8p637p633j4062k636N213
$$ 3195051 3199999 3198519 3197043 3195563 3194087 3200668 3207253 3213834 3220418 3220337 3220259 3220177 3220099 3212462 3204829 3190767 3188131 3193344
-30104C193344N216N927N930l681l681l680l682l49l49J0358J0359J1131k90n287n287n525
$$ 3193344 3198560 3204487 3210417 3206736 3203055 3199375 3195693 3195344 3194995 3205353 3215712 3226843 3226553 3221266 3215979 3210454
-30088C210454n525n525n525o76o77o77o76j391j391j390j391J2114J2113P116m305n733n734
$$ 3210454 3204929 3199404 3193879 3193203 3192526 3191849 3191173 3189782 3188391 3187001 3185610 3197724 3209837 3216953 3212648 3206915 3201181
-30071C201181o447o447k134k134j420j420L814J5237J5236L815r749r749j0462j0463l799
$$ 3201181 3194734 3188287 3186153 3184019 3182599 3181179 3184993 3200230 3215466 3219281 3209532 3199783 3189321 3178858 3175059
-30056C175059l800l086l086R6J1519J1519R6j2753j2753k044k045p36p37R972R972N926n495
$$ 3175059 3171259 3168173 3165087 3165183 3176702 3188221 3188317 3175564 3162811 3160767 3158722 3157986 3157249 3167221 3177193 3183119 3177624
-30039C177624n495N926L793L796o916o911k633k629k632k629p153p150k156R269J3310J3315
$$ 3177624 3172129 3178055 3181848 3185644 3178728 3171817 3169184 3166555 3163923 3161294 3154141 3146991 3144835 3154104 3167414 3180729
-30023C180729K602K606K53K57m61m57M298p120j2121j2117q671q666L941J5366J9884J9888
$$ 3180729 3183331 3185937 3186190 3186447 3185986 3185529 3189827 3182707 3170586 3158469 3149798 3141132 3145073 3160439 3180323 3200211
-30007C200211P986l431q035q035q748q749n179n179m465m466l632P789Q503k919K555J3976
$$ 3200211 3208197 3204766 3196731 3188696 3179948 3171199 3166020 3160841 3156376 3151910 3148278 3156067 3164570 3161651 3164206 3178182
-29991C178182K5873K5874J4140J4139J529J528j5843l4879k9881j8460o087N336J1046J1046
$$ 3178182 3204055 3229929 3244069 3258208 3259737 3261265 3245422 3210543 3180662 3162202 3156115 3161451 3172497 3183543
-29977C183543J4616J4615J4616J4615J0961J0965j651j3069k0211k0208k7349j5925j04j00
$$ 3183543 3198159 3212774 3227390 3242005 3252966 3263931 3262280 3249211 3229000 3208792 3181443 3165518 3165414 3165314
-29963C165314J2031J2035R176R180k245k242l481l476l480l476K469K472K469K472k052k048
$$ 3165314 3177345 3189380 3198556 3207736 3205491 3203249 3199768 3196292 3192812 3189336 3191805 3194277 3196746 3199218 3197166 3195118
-29947C195118k053k048L896L900L183L186R923j494o139o134M926J0641K785q634k688L027
$$ 3195118 3193065 3191017 3194913 3198813 3201996 3205182 3215105 3213611 3207472 3201338 3206264 3216905 3219690 3211056 3208368 3211395
-29931C211395r04q99m830m826m473m469J1961J7675R820j599j75N540J610J613k93k90k94
$$ 3211395 3210491 3209592 3204762 3199936 3195463 3190994 3202955 3220630 3230450 3228851 3228676 3234216 3235826 3237439 3237146 3236856 3236562
-29914C236562k90n053n049n053n049k171k167k172k167J3295J3299J042j0378j7043j1329
$$ 3236562 3236272 3231219 3226170 3221117 3216068 3213897 3211730 3209558 3207391 3220686 3233985 3235027 3224649 3207606 3196277
-29899C196277l837l833r072r068O038J1753K587q830q477K948J1273J1277J1273J1277j101
$$ 3196277 3192440 3188607 3179535 3170467 3176505 3188258 3190845 3182015 3173538 3176486 3187759 3199036 3210309 3221586 3220485
-29884C220485j2518r667l952p44o451j7162j1448J952P663Q020K309L498L499j141j2564
$$ 3220485 3207967 3198300 3194348 3193604 3187153 3169991 3158543 3160495 3168158 3176178 3178487 3181985 3185484 3184343 3171779
-29869C171779q101L320J5218J5218M510M510M509M510L782L781L781L781m785m785m785m785
$$ 3171779 3163678 3166998 3182216 3197434 3201944 3206454 3210963 3215473 3219255 3223036 3226817 3230598 3225813 3221028 3216243 3211458
-29853C211458p99q00p99p99k466k464k466k465j0072j0068Q607Q611N395l12l529P897J5746
$$ 3211458 3210659 3209859 3209060 3208261 3205795 3203331 3200865 3198400 3188328 3178260 3186867 3195478 3200873 3200561 3197032 3204929 3220675
-29836C220675J5750M205p213o384o69m600m595r284r280N826J1541J543r875o310n95k026
$$ 3220675 3236425 3240630 3233417 3227033 3226364 3221764 3217169 3207885 3198605 3204431 3215972 3217515 3207640 3201330 3200735 3198709
-29820C198709k023j669j666j431j428R276R281N867n551k700L016k104p812p458j744N034
$$ 3198709 3196686 3195017 3193351 3191920 3190492 3199768 3209049 3214916 3209365 3206665 3209681 3207577 3199765 3192307 3190563 3195597
-29804C195597N038P51j0667j1742o026Q365Q369O522m897n257O168J8895J3188k759j4177
$$ 3195597 3200635 3201386 3190719 3178977 3172951 3181316 3189685 3196207 3191310 3186053 3192221 3211116 3224304 3221545 3207368
-29789C207368j5727j0013j687R737J3779Q072p042p038J833J832J833J834n306n306n305
$$ 3207368 3191641 3181628 3179941 3189678 3203457 3211529 3204487 3197449 3199282 3201114 3202947 3204781 3199475 3194169 3188864
-29774C188864n306l699l700P723P722Q436Q436k985k986j320j320R388R388j796j3217j3218
$$ 3188864 3183558 3179859 3176159 3183882 3191604 3200040 3208476 3205491 3202505 3201185 3199865 3209253 3218641 3216845 3203628 3190410
-29758C190410j796Q377Q377k331k331n187n187O235O235L287L290L287L291p183p180k543
$$ 3190410 3188614 3196991 3205368 3203037 3200706 3195519 3190332 3196567 3202802 3206089 3209379 3212666 3215957 3208774 3201594 3199051
-29742C199051Q882P035J327o172o168k246k242k245k242K811K814K811K815K096K101K097
$$ 3199051 3207933 3214968 3216295 3210123 3203955 3201709 3199467 3197222 3194980 3197791 3200605 3203416 3206231 3208327 3210428 3212525
-29726C212525K101P391P395m030m026m62m57m61m57j287j282j287j282m856m852O566O569
$$ 3212525 3214626 3222017 3229412 3225382 3221356 3220894 3220437 3219976 3219519 3218232 3216950 3215663 3214381 3209525 3204673 3211239 3217808
-29709C217808O18O20O18O21j1757j1752l35l31L934L937L934L937j301j298j301j298q202
$$ 3217808 3218426 3219046 3219664 3220285 3208528 3196776 3196441 3196110 3200044 3203981 3207915 3211852 3210551 3209253 3207952 3206654 3198452
-29692C198452q198L220L224J26J30J0834J0838J0868n50n551n547N632N637N633N636r596
$$ 3198452 3190254 3193474 3196698 3196824 3196954 3207788 3218626 3229494 3228944 3223393 3217846 3223478 3229115 3234748 3240384 3230788
-29676C230788r592r597r592J60J63J60J64J2518J2523J096J101j045j041j044j042j877j874
$$ 3230788 3221196 3211599 3202007 3202167 3202330 3202490 3202654 3215172 3227695 3228791 3229892 3228847 3227806 3226762 3225720 3223843 3221969
-29659C221969N261o157j1396L0J1923J1928k004k004K279J3701N610n811j6995j6995k956
$$ 3221969 3227230 3221073 3209677 3209707 3221630 3233558 3231554 3229550 3231829 3245530 3251140 3245329 3228334 3211339 3208383
-29644C208383Q466J3463J3463k004k004q429K993J0697J0697p25p25M64j0957j5240j5240
$$ 3208383 3216849 3230312 3243775 3241771 3239767 3231338 3234331 3245028 3255725 3255000 3254275 3254739 3243782 3228542 3213302
-29629C213302J655J3076O651O652L796L796L796L796n926n923n926n923p592p589L830L833
$$ 3213302 3214957 3228033 3234684 3241336 3245132 3248928 3252724 3256520 3250594 3244671 3238745 3232822 3225230 3217641 3221471 3225304
-29613C225304K01K04K01K04R15R18R15R18J480J484P904l513j7081j7077o372o370K492K495
$$ 3225304 3225505 3225709 3225910 3226114 3227029 3227947 3228862 3229780 3231260 3232744 3240648 3237135 3220054 3202977 3196605 3190235 3192727 3195222
-29595C195222J3198J3203K967q451j2738j2734j796R630J3909J3913K963q455j2742j2737
$$ 3195222 3208420 3221623 3224590 3216139 3203401 3190667 3188871 3198501 3212410 3226323 3229286 3220831 3208089 3195352
-29581C195352n187O239J1232J1236J0518J0522N521n897r841r838j0556j0551Q719Q722Q005
$$ 3195352 3190165 3196404 3207636 3218872 3229390 3239912 3245433 3239536 3229695 3219857 3209301 3198750 3207469 3216191 3224196
-29566C224196Q009n083j6501j6504n079j037j033l24l20J5385J5386L487p934m365P057J0626
$$ 3224196 3232205 3227122 3210621 3194117 3189038 3188001 3186968 3186644 3186324 3201709 3217095 3220582 3212648 3208283 3215340 3225966
-29550C225966J0626R615j807o804o804l235l235l234l235J271J272J272J271j583j584j584
$$ 3225966 3236592 3246207 3244400 3237596 3230792 3227557 3224322 3221088 3217853 3219124 3220396 3221668 3222939 3221356 3219772 3218188
-29534C218188j584M98M98M98M99L829L830o879o878j3087j666J7847J7846J4991L569j428
$$ 3218188 3216604 3217102 3217600 3218098 3218597 3222426 3226256 3219377 3212499 3199412 3197746 3215593 3233439 3248430 3251999 3250571
-29518C250571j427J487J487r934r935j2790j2790j368j368K79K78J0987J0987J588r835l409
$$ 3250571 3249144 3250631 3252118 3242184 3232249 3219459 3206669 3205301 3203933 3204212 3204490 3215477 3226464 3228052 3218217 3214808
-29502C214808l409K301K301P299P298R559j862o860o860N187N187o236o235n24n24n25n24
$$ 3214808 3211399 3213700 3216001 3223300 3230598 3240157 3238295 3231435 3224575 3229762 3234949 3228713 3222478 3221954 3221430 3220905 3220381
-29485C220381m8m8m9m8m450m451J260J261K1460K1461Q849k573j0783j0782p4p5j2150j2150
$$ 3220381 3220333 3220285 3220236 3220188 3215738 3211287 3212547 3213808 3235268 3256729 3265578 3263005 3252222 3241440 3241366 3241291 3229141 3216991
-29467C216991j1437P600J9021J9021O99j0723j4035k614R284R284M287M287M287M286m517
$$ 3216991 3205554 3213154 3232175 3251196 3251895 3241172 3227137 3224523 3233807 3243091 3247378 3251665 3255952 3260238 3255721
-29452C255721m517m518m517N477N476n945n945l224l223Q198Q198L202L201K487K488J178
$$ 3255721 3251204 3246686 3242169 3247646 3253122 3247177 3241232 3238008 3234785 3242983 3251181 3254383 3257584 3260071 3262559 3263737
-29436C263737j0243j5240j5240r292r291K130K131Q615Q614P901P901J3016J595j1016j1017
$$ 3263737 3253494 3238254 3223014 3213722 3204431 3206561 3208692 3217307 3225921 3233822 3241723 3254739 3256334 3245318 3234301
-29421C234301k450k450q161q161k093k093k094k093R775R774N492n930o169N254M540o882
$$ 3234301 3231851 3229401 3221240 3213079 3210986 3208893 3206799 3204706 3214481 3224255 3229747 3223817 3217648 3222902 3227442 3220560
-29405C220560p001p001L707L706m383m384O14J2035P332P332l376l376M31M32j0991j0990
$$ 3220560 3213559 3206558 3210265 3213971 3209588 3205204 3205818 3217853 3225185 3232517 3229141 3225765 3226196 3226628 3215637 3204647
-29389C204647p541p540L882L882P926P927l495l495l123l123k409k409j696R726R727j696
$$ 3204647 3197106 3189566 3193448 3197330 3205256 3213183 3209688 3206193 3203070 3199947 3197538 3195129 3193433 3203159 3212886 3211190
-29373C211190m551m550n265n265P109P109P109P109o254o254o254o253M09M09M09M09O536
$$ 3211190 3206639 3202089 3196824 3191559 3198668 3205777 3212886 3219995 3213741 3207487 3201233 3194980 3195389 3195798 3196207 3196616 3203152
-29356C203152O536J2961J540K610K610K610q812r719r719R89R89j2217j2217p96p96Q366
$$ 3203152 3209688 3222649 3224189 3226799 3229409 3232019 3223207 3213488 3203769 3204758 3205747 3193530 3181313 3180517 3179721 3188087
-29340C188087Q365Q366Q365R793R794R793R793l885l882L98J1823Q727k692j3880j3875r11
$$ 3188087 3196452 3204818 3213183 3222976 3232770 3242563 3252356 3248471 3244589 3244987 3256810 3265537 3262845 3248965 3235090 3234179
-29324C234179J0515M086j4947j5426m000P417P421K49K53K49K53r031r028r031r027O496
$$ 3234179 3244694 3248780 3233833 3218407 3214407 3221824 3229245 3229494 3229747 3229996 3230249 3221218 3212190 3203159 3194132 3200628
-29308C200628O498O496O499O733O738K450q968j2210p85J1110J1113l168l164l168l164o69
$$ 3200628 3207126 3213622 3220121 3226854 3233592 3236042 3227074 3214864 3214079 3225189 3236302 3233134 3229970 3226802 3223638 3222969
-29292C222969o66q164j3872j1377M8J9914J9917M759M763M759M763k38k34k38k35n472n470
$$ 3222969 3222303 3214139 3200267 3188890 3188938 3208852 3228769 3233528 3238291 3243050 3247813 3247575 3247341 3247103 3246868 3241396 3235926
-29275C235926n473n469p14p10p14p10L157L160L157L160Q96R00m815m811p968p964J0355
$$ 3235926 3230453 3224984 3224270 3223560 3222846 3222136 3225293 3228453 3231610 3234770 3235666 3236566 3231751 3226940 3218972 3211008 3221363
-29258C221363J0358O786m633j781L934l510r217j368J0057J249j0169j5169l744Q923Q927
$$ 3221363 3231721 3238507 3233874 3232093 3236027 3232517 3223300 3221932 3231989 3233238 3223069 3207900 3204156 3213079 3222006
-29243C222006r399r395q805q800q091q087o911M510R507R507k867k867k866k867K190K190
$$ 3222006 3212607 3203212 3194407 3185607 3177516 3169429 3162518 3167028 3176535 3186042 3183175 3180308 3177442 3174575 3176765 3178955
-29227C178955K190K190o65o66o65o66Q395Q395Q396Q395M826M826M826M826p66p66n049j6471
$$ 3178955 3181145 3183335 3182670 3182004 3181339 3180673 3189068 3197463 3205859 3214254 3219080 3223906 3228732 3233558 3232792 3232026 3226977 3210506
-29209C210506j4805l383Q514Q514Q031Q035l391l387l629l625l629l625p317p313M104M109
$$ 3210506 3195701 3192318 3200832 3209346 3217377 3225412 3222021 3218634 3215005 3211380 3207751 3204126 3196809 3189496 3193600 3197709
-29193C197709Q863Q868Q864Q867q016q012L405L410J0068J0072j353j349p59p55p58p55k424
$$ 3197709 3206572 3215440 3224304 3233171 3225155 3217143 3220548 3223958 3234026 3244098 3242745 3241396 3240637 3239882 3239124 3238369 3235945
-29176C235945k420Q997R002j2523j2519p525L901P941P946r667r663j0917N10N503N506K290
$$ 3235945 3233525 3242522 3251524 3239001 3226482 3218957 3222858 3230799 3238745 3229078 3219415 3208498 3209008 3214511 3220017 3222307
-29160C222307K294L004q414q685q681R637R641j190j186L093J4519J1660K41m045m041k380
$$ 3222307 3224601 3227605 3219191 3210506 3201825 3211462 3221103 3219913 3218727 3221820 3236339 3247999 3248240 3244195 3240154 3237774
-29144C237774k376k379k376J885J885J885J885J885J885J885J885p8p8p8p8L848L848j863
$$ 3237774 3235398 3233019 3230643 3232528 3234413 3236298 3238183 3240068 3241953 3243838 3245723 3245645 3245567 3245489 3245411 3249259 3253107 3251244
-29126C251244j862j0489j0488R33R33J766J766q941q942r656J766J4378J4377R33R34m778
$$ 3251244 3249382 3238893 3228405 3229338 3230271 3232037 3233803 3224862 3215920 3206264 3208030 3222408 3236785 3237718 3238652 3233874
-29110C233874m778j4474j4470l053l049j1619j1615R93J2418N871N875Q73Q78l886l881J825
$$ 3233874 3229096 3214622 3200152 3197099 3194050 3182431 3170816 3171809 3184227 3190098 3195973 3196846 3197724 3193838 3189957 3191782
-29094C191782J830K792K796j5530j5527j8742p318N291N295k562k558k562k558q748q745
$$ 3191782 3193612 3196404 3199200 3183670 3168143 3149401 3142083 3147374 3152669 3150107 3147549 3144987 3142429 3133681 3124936
-29079C124936q748q745m343m342Q268J9691K1237K1238K0523L1945L9917K8495Q744j7906
$$ 3124936 3116188 3107443 3103100 3098758 3107026 3126717 3147954 3169192 3189715 3221660 3261577 3290072 3298816 3280910
-29065C280910k5163k5164k1118r697K83J1705K4315K4316K3126J1705r712k1133k4227k4226
$$ 3280910 3255747 3230583 3209465 3199768 3200051 3211756 3236071 3260387 3283513 3295218 3285506 3264373 3240146 3215920
-29051C215920n905n904k454k453p451p451m547O874J5084R373o570o569o927o926j8587j8586
$$ 3215920 3210015 3204111 3201657 3199204 3191753 3184302 3179755 3186629 3201713 3211086 3204516 3197947 3191020 3184094 3165507 3146921
-29035C146921n975N447J0206J0206J0919J0920J0742J0741J0027J0028O577m844j3887j9598
$$ 3146921 3140946 3146393 3156599 3166805 3177724 3188644 3199386 3210127 3220154 3230182 3236759 3231915 3218028 3198430
-29021C198430k1025j5315O28J2051P410m012l298Q124J4292J4296J4292J4296k365j3783
$$ 3198430 3177405 3162090 3162718 3174769 3182179 3178167 3174869 3182993 3197285 3211581 3225873 3240169 3237804 3224021
-29007C224021j4500l075N50j0867j0158J268R592R597j592j3009q700K725J0217M510n250
$$ 3224021 3209521 3206446 3206996 3196129 3185971 3187239 3196831 3206428 3204836 3191827 3183127 3185852 3196069 3200579 3195329
-28992C195329n246J889P603O172n246m893O533J2001J2006J294J297n569n566j287J0139
$$ 3195329 3190083 3191972 3199575 3205747 3200501 3195608 3202141 3214142 3226148 3227442 3228739 3223170 3217604 3216317 3226456
-28977C226456R779j640r496l781m915j0622p057p053M38M43M39M42K878K881K878K882k596
$$ 3226456 3236235 3234595 3225099 3221318 3216403 3205781 3198724 3191671 3192109 3192552 3192991 3193433 3196311 3199192 3202070 3204952 3202356
-28960C202356k591k595k592Q767Q771k655k651k178k175k179k175m02l97J1020J1024M595
$$ 3202356 3199765 3197170 3194578 3203345 3212116 3209461 3206810 3204632 3202457 3200278 3198103 3197701 3197304 3208324 3219348 3223943
-28944C223943M599M596M599O440O443O440O443m031m026m030m027o246o243o246o243N652
$$ 3223943 3228542 3233138 3237737 3244177 3250620 3257060 3263503 3259472 3255446 3251416 3247389 3241143 3234900 3228654 3222411 3228063
-28928C228063N655n771n766j1719j1716k97k94O603O607J963r455j5835j0124O651J6170
$$ 3228063 3233718 3227947 3222181 3210462 3198746 3198449 3198155 3204758 3211365 3213328 3203873 3188038 3177914 3184565 3200735
-28913C200735J2006K487k986k985J892J893J892J893r63r63j320j320n990j1700m919Q406
$$ 3200735 3212741 3215228 3212242 3209257 3211149 3213042 3214934 3216827 3215864 3214901 3213581 3212261 3206271 3194571 3189652 3198058
-28897C198058J2333O622p55p55M956M957M361M361j112j0630q845l134n815j1522j3311l788
$$ 3198058 3210391 3217013 3216258 3215503 3220459 3225416 3229777 3234138 3233026 3222396 3213551 3210417 3204602 3193080 3179769 3175981
-28881C175981Q581Q585k246k242O321O324n101n097L465L469L465L469K662K666K662K666
$$ 3175981 3184562 3193147 3190901 3188659 3194980 3201304 3196203 3191106 3194571 3198040 3201505 3204974 3207636 3210302 3212964 3215630
-28865C215630n191n187n190n186O945O949j1734j1730J591P306j384j0897j379Q138N403
$$ 3215630 3210439 3205252 3200062 3194876 3201821 3208770 3197036 3185306 3186897 3194203 3192819 3181922 3180543 3188681 3194084
-28850C194084l09K785K785K428K427m948m949m354m353k926O591O949k569q934l224M391
$$ 3194084 3193775 3196560 3199345 3201773 3204200 3199252 3194303 3189949 3185596 3182670 3189261 3196210 3193641 3184707 3181483 3185874
-28834C185874M391m056m056P365P365R388R388L678n842j6430j0718O175J5694J2069K550
$$ 3185874 3190265 3186209 3182153 3189518 3196883 3206271 3215659 3219337 3213495 3197065 3186347 3192522 3208216 3220285 3222835
-28819C222835k922k922m113m112J0879J6590R154m172j4761j4760j4761n242Q26Q25q2q2
$$ 3222835 3219913 3216991 3212878 3208766 3219645 3236235 3245389 3241217 3226456 3211696 3196935 3191693 3192519 3193344 3193262 3193180
-28803C193180P295J3005J1341j986n554n555J643J643J644J643p756p755j689P831Q168Q173
$$ 3193180 3200475 3213480 3224821 3222835 3217281 3211726 3213369 3215012 3216656 3218299 3210543 3202788 3201099 3208930 3217098 3225271
-28787C225271Q763Q767p418p413p418p413K695K700m920j0626j2652l131J0192J0194M220
$$ 3225271 3234034 3242801 3235383 3227970 3220552 3213139 3215834 3218534 3213614 3202988 3190336 3187205 3197397 3207591 3211811
-28772C211811M224j491j487l514l509K197K201M815M818q96q92O242O247n179n176o492o491
$$ 3211811 3216035 3214544 3213057 3209543 3206034 3208231 3210432 3215247 3220065 3219169 3218277 3224519 3230766 3225587 3220411 3213919 3207428
-28755C207428o492o492m707m707m707m707Q738Q737Q380j137q158q157M930J4449J2522J2522
$$ 3207428 3200936 3194444 3189737 3185030 3180323 3175616 3184354 3193091 3201471 3200334 3192176 3184019 3188949 3203398 3215920 3228442
-28739C228442P049k469j0083j0083m967m968m134m134L480R191N383m134j3058p346j856
$$ 3228442 3235491 3233022 3222939 3212856 3207889 3202921 3198787 3194653 3198133 3207324 3212707 3208573 3195515 3188169 3186313
-28724C186313j855j499j498N164N165N164N164l759l758P067P069L260o257r827m116Q52
$$ 3186313 3184458 3182959 3181461 3186625 3191790 3196954 3202118 3198359 3194601 3201668 3208737 3211997 3205740 3195913 3191797 3192649
-28708C192649Q51O324O325Q51q667q666Q51J1381J1381l253q965o465L052Q764Q763O29O31
$$ 3192649 3193500 3199824 3206149 3207000 3198333 3189667 3190518 3201899 3213280 3210027 3201062 3194597 3197649 3206413 3215176 3215805 3216436
-28691C216436N983N986m488j0195o986K536L127k581k346L369R789M083l774l770n008n005
$$ 3216436 3222419 3228405 3223917 3213722 3206736 3209272 3212399 3209818 3207472 3210841 3220630 3224713 3220939 3217169 3212161 3207156
-28675C207156n008n004M748M751M748M752l105l101l104l101l818l815l818l815P484P485
$$ 3207156 3202148 3197144 3201892 3206643 3211391 3216143 3213038 3209937 3206833 3203732 3199914 3196099 3192281 3188466 3195950 3203435
-28659C203435l938l937m176m175m175m176M927M926M927M926K785K785q638q636O502O503
$$ 3203435 3199497 3195560 3191384 3187209 3183034 3178858 3183785 3188711 3193638 3198564 3201349 3204134 3195496 3186860 3193362 3199865
-28643C199865O503O503O741O740K101r321o823j111j469p180p298j587O264O265K432K431
$$ 3199865 3206368 3212871 3219612 3226352 3228453 3219132 3212309 3211198 3209729 3202549 3195251 3193664 3199928 3206193 3208625 3211056
-28627C211056K432K432R094R094o015j1727r883J539M69M69l220l220l220l220P51P51P51
$$ 3211056 3213488 3215920 3225014 3234108 3228093 3216366 3206483 3208022 3208491 3208960 3205740 3202520 3199300 3196080 3196831 3197582 3198333
-28610C198333P52O223O224N867N867o685j2395m544O878M975p36l592P830J5215R506k037
$$ 3198333 3199085 3205308 3211532 3217399 3223266 3216581 3204186 3199642 3206520 3211495 3210759 3207167 3214997 3230212 3239718 3237681
-28594C237681p745k513L201K841k867l12l09o69o65j026j023j026j023m654m652j0365j0363
$$ 3237681 3229936 3227423 3230624 3233465 3230598 3230286 3229977 3229308 3228643 3227617 3226594 3225568 3224545 3219891 3215239 3204874 3194511
-28577C194511N934N938n488n484o142o139o142o138o142o139N756J7181K1910J0489k242
$$ 3194511 3200445 3206383 3200895 3195411 3189269 3183130 3176988 3170850 3164708 3158569 3164325 3181506 3203416 3213905 3211663
-28562C211663j3664q667k956j171j171R11R11R11R11M123M123M123M124o81o80o80o81J342
$$ 3211663 3197999 3189332 3186376 3185205 3184034 3184945 3185856 3186767 3187678 3191801 3195924 3200047 3204171 3203490 3202810 3202130 3201449 3202791
-28544C202791J343m369m369P470P469l952j5374j9538n02J4727J4727N216N217J1641K19
$$ 3202791 3204134 3199765 3195396 3202866 3210335 3206383 3191009 3171471 3170969 3185696 3200423 3205639 3210856 3222497 3222716
-28529C222716r418r417j0132j0131K955K956P953P953J1403j9j1916j1916k859Q562K138
$$ 3222716 3213298 3203881 3193749 3183618 3186573 3189529 3197482 3205435 3216838 3216819 3204903 3192987 3190128 3198690 3200828
-28514C200828K138m287m287m287m286o786o785M636M637R990R990J0704p17j5173j5174j0890
$$ 3200828 3202966 3198679 3194392 3190105 3185819 3179033 3172248 3176884 3181521 3191511 3201501 3212205 3211488 3196315 3181141 3170251
-28498C170251N32N172N171Q89Q89O50J2073J1358J1359l038l038P195P194k190k1226k2654
$$ 3170251 3170783 3175955 3181126 3182015 3182904 3183554 3195627 3206985 3218344 3215306 3212268 3219463 3226657 3224467 3203241 3180587
-28482C180587j1232L164L164L878L878J141J142J141J142P804P804P090P090K124r296r298
$$ 3180587 3169355 3172519 3175683 3179561 3183439 3184580 3185722 3186863 3188005 3195809 3203613 3210703 3217793 3219917 3210621 3201323
-28466C201323K127L550L555M264M268o800o796j3225j800R33R37m063m061J0913J0916N915
$$ 3201323 3203450 3207000 3210555 3214819 3219087 3212287 3205491 3192266 3190466 3191399 3192336 3188273 3184212 3195125 3206041 3211956
-28450C211956n502q600q596l603l599P343P347P343P347K04K08j0503j0500j1857m31m35
$$ 3211956 3206454 3197854 3189258 3185655 3182056 3189399 3196746 3204089 3211436 3211640 3211848 3201345 3190845 3178988 3178557 3178122
-28434C178122m31l409Q016J3009J3013m956m953M1J1467J0510J0515j97j93j0429j0426j0428
$$ 3178122 3177691 3174282 3182298 3195307 3208320 3203364 3198411 3198452 3209919 3220429 3230944 3230747 3230554 3220125 3209699 3199271
-28418C199271j0426N17N20N17N21k577k573J5270J5274P774j1258j8401o975M644M644l53
$$ 3199271 3188845 3189362 3189882 3190399 3190920 3188343 3185770 3201040 3216314 3224088 3212830 3194429 3187454 3192098 3196742 3196389
-28402C196389l53m637m636J074J075O310O309n112n113o897o897M525M525m026m027P395
$$ 3196389 3196036 3191399 3186763 3187837 3188912 3195222 3201531 3196419 3191306 3184409 3177512 3182037 3186562 3182536 3178509 3185904
-28386C185904P395M897M896R71O681J119j0302o734j022l521l521l164l164L607L606L606
$$ 3185904 3193299 3198196 3203092 3204063 3210744 3211863 3201561 3194827 3193805 3190284 3186763 3183599 3180435 3184042 3187648 3191254
-28370C191254L607L249L250K535K536L934p488j3556k134P622J911n228n227P845J3556N703
$$ 3191254 3194861 3198110 3201360 3203895 3206431 3210365 3202877 3189321 3187187 3194809 3196720 3191492 3186265 3194110 3207666 3213369
-28354C213369n718j2143o432J063J063K253K253r168r169j673j673M038M038M357M361J5066
$$ 3213369 3207651 3195508 3189076 3190139 3191202 3193455 3195708 3186540 3177371 3175698 3174025 3178063 3182101 3186458 3190819 3205885
-28338C205885J5069R116k301p302p299M953M956p59p54m328m324J383J387m432m428m432
$$ 3205885 3220954 3230070 3227769 3220467 3213168 3218121 3223077 3222318 3221564 3217236 3212912 3214295 3215682 3211250 3206822 3202390
-28322C202390m428L777L781L778L781J1749J1753O752m666j3118j3113q120q117N246N246
$$ 3202390 3197962 3201739 3205520 3209298 3213079 3224828 3236581 3243333 3238667 3225549 3212436 3204316 3196199 3201445 3206691
-28307C206691N247N246L818L819l677r388j1322J01M740M740j684j684j684j685l305l305
$$ 3206691 3211938 3217184 3221002 3224821 3221144 3211756 3200434 3200535 3205275 3210015 3208331 3206647 3204963 3203278 3199973 3196668
-28291C196668l306l305j1872j1871L83J1805J1061N350N707J1418Q206K495n358n358k49
$$ 3196668 3193362 3190057 3178185 3166314 3166697 3178502 3189563 3194913 3200620 3212038 3220244 3222739 3217381 3212023 3211774
-28276C211774k49k49k49j320j320K606l104l224Q199P841l581j9166j9166p626L796R551
$$ 3211774 3211525 3211276 3211027 3209707 3208387 3210993 3207889 3204665 3212864 3220705 3217124 3197958 3178792 3171166 3174962 3184513
-28260C184513L841K413K413O102J1812R670j751o034l24M674j038j1745j1745O934O934m235
$$ 3184513 3188354 3190767 3193180 3199282 3211094 3220764 3219013 3212979 3212655 3217329 3216291 3204546 3192801 3199735 3206669 3202434
-28244C202434m234m235m235O43O44Q138J3850K606q815j3456j3455K26K27N938N938L230
$$ 3202434 3198200 3193965 3189730 3190373 3191017 3199155 3213005 3215611 3206796 3193340 3179885 3180111 3180338 3186276 3192214 3195444
-28228C195444L232L231L230q072q071l432P990J5010R298k241p953o763j053J090J089J918
$$ 3195444 3198676 3201907 3205137 3197065 3188994 3185562 3193552 3208562 3217860 3215619 3207666 3200903 3199850 3200940 3202029 3203947
-28212C203947J919J919J918q194q195L227L227m863m863n80J0842J0247j175j175J0247Q641
$$ 3203947 3205866 3207785 3209703 3201509 3193314 3196541 3199768 3194905 3190042 3189462 3200304 3210551 3209376 3208201 3218448 3227089
-28196C227089k782q491K929R117k305j3489j3489k186R235L525p897j4203j4203k305R117
$$ 3227089 3224307 3215816 3218745 3227862 3225557 3212068 3198579 3196393 3205628 3209153 3201256 3187053 3172850 3170545 3179662
-28181C179662J3734J3734L027L026J718J718n778j1489j1846m23J1830J1831J123J123m588
$$ 3179662 3193396 3207130 3210157 3213183 3214901 3216619 3210841 3199352 3187506 3187083 3198913 3210744 3211867 3212990 3208402
-28166C208402m588n302n302j1013j1012k209k209k208k209j85j86J4924K0635J4805L383
$$ 3208402 3203814 3198512 3193210 3182197 3171185 3168976 3166767 3164559 3162350 3162165 3161979 3176903 3197538 3212343 3215726
-28151C215726j256j257l897l896l896l897n324n324l421K290N860l659j2581o871N502N503
$$ 3215726 3214470 3213213 3209316 3205420 3201524 3197627 3192303 3186979 3183558 3185848 3191708 3188049 3175468 3168597 3174099 3179602
-28135C179602O25q894n740P584J0322J0321L063o454m313J398L004L004L361L361L362L361
$$ 3179602 3180227 3171333 3165593 3173177 3183499 3193820 3196883 3190429 3186116 3187514 3190518 3193522 3196883 3200244 3203606 3206967
-28119C206967L361L361K487K491K488K491o079o075o080o075j736j733j736j732J713J718
$$ 3206967 3210328 3213689 3216176 3218667 3221155 3223646 3217567 3211492 3205412 3199337 3197601 3195868 3194132 3192400 3194113 3195831
-28103C195831m235N287N135m380m383N138M302n213j3545p830Q585J4300N729N733Q942Q946
$$ 3195831 3191596 3196883 3202018 3197638 3193255 3198393 3202695 3197482 3183937 3176107 3184692 3198992 3204721 3210454 3219396 3228342
-28087C228342m741j4255j2987j2987p514K004J1284J1284M58M57k755k755q466q466K599
$$ 3228342 3223601 3209346 3196359 3183372 3175858 3177862 3189146 3200430 3200888 3201345 3198590 3195835 3187369 3178903 3181502
-28072C181502K599K599K599M666M666M666M666n69n69j1395j1396p232K287Q354Q355K167
$$ 3181502 3184101 3186700 3189299 3193965 3198631 3203297 3207963 3207394 3206825 3195430 3184034 3176802 3179089 3187443 3195798 3197965
-28056C197965K168l187l186j89N525P306k209q994j4701q161N168J5634J5638K785o729q875
$$ 3197965 3200133 3196946 3193760 3193571 3199096 3206402 3204193 3195199 3180498 3172337 3177505 3193139 3208777 3211562 3204833 3195958
-28040C195958q872l997N525O399l115j1448n733P231J2946J0087N73q593k877J4013K3535
$$ 3195958 3187086 3183089 3188614 3195013 3191898 3180450 3174717 3181948 3194894 3204981 3205554 3196961 3194084 3208097 3231632
-28025C231632J7820Q306K830K833p455p454p455p454J111J112j0310j0310K182K183K182
$$ 3231632 3249452 3257758 3260588 3263421 3255966 3248512 3241057 3233603 3234714 3235826 3225516 3215206 3217388 3219571 3221753
-28010C221753K183r11r11J0511J0511O231O231n190n191n428n428n428n429J0099J0098j324
$$ 3221753 3223936 3223025 3222114 3232625 3243136 3249367 3255598 3250408 3245217 3239789 3234361 3228933 3223504 3233603 3243701 3242377
-27994C242377j324j2507j2507j086j086O588O589m833m834j5303j5303l882l882O291O291
$$ 3242377 3241053 3228546 3216039 3214953 3213867 3220455 3227044 3222211 3217377 3202074 3186771 3182889 3179007 3185298 3191589
-27979C191589n131n131m417m417P005P005Q012Q012Q013Q012l885l886l885l885j4415j4415
$$ 3191589 3186458 3181327 3176910 3172493 3179498 3186503 3194515 3202527 3210540 3218552 3214667 3210781 3206896 3203011 3188596 3174181
-27963C174181L39J9374K6513P477j4890j4891K223K223K224K223M841M841M841M841J212
$$ 3174181 3174520 3193894 3220407 3227884 3212994 3198103 3200326 3202549 3204773 3206996 3211837 3216678 3221519 3226360 3227572
-27948C227572J212J212J212n926n927N495N496P06P06j0715j0715L086L086L086L086j911
$$ 3227572 3228784 3229996 3231208 3225282 3219355 3224850 3230346 3231052 3231758 3221043 3210328 3213414 3216500 3219586 3222672 3220761
-27932C220761j912j911j911Q797Q797j0239j0240m35m31m35m31O227O232j2809j2805k041
$$ 3220761 3218849 3216938 3215027 3223824 3232621 3222382 3212142 3211707 3211276 3210841 3210410 3216637 3222869 3210060 3197255 3195214
-27916C195214k037k042k037J9374J9379P953P956j2674j2671j1486j1481o250J2790J9925
$$ 3195214 3193177 3191135 3189098 3208472 3227851 3235804 3243760 3231086 3218415 3206929 3195448 3189198 3201988 3221913
-27902C221913Q507k978k975l692l688M399M402M398M402j1355j1351l859J855j361j2778
$$ 3221913 3230420 3227442 3224467 3220775 3217087 3221486 3225888 3230286 3234688 3223333 3211982 3208123 3209978 3208617 3195839
-27887C195839j2426j000J1072J1076L65L67J27J30J27J30l681l677l681l677K982K985K982
$$ 3195839 3183413 3182413 3193485 3204561 3204926 3205293 3205420 3205550 3205677 3205807 3202126 3198449 3194768 3191091 3194073 3197058 3200040
-27870C200040K986K327K331K328K331J495J498k432L283Q332l085j4988j4984P262J2976
$$ 3200040 3203026 3205353 3207684 3210012 3212343 3213838 3215336 3212904 3216187 3224519 3221434 3206446 3191462 3198724 3211700
-27855C211700k138j3556q860K565J0415M707O58O372R582j837j3455p742k49k45k272k268
$$ 3211700 3209562 3196006 3187146 3189711 3200126 3204833 3205491 3211863 3221445 3219608 3206153 3198411 3198162 3197917 3195645 3193377
-27839C193377k271k269j081j079j2503j2500M391M395M390M395J0582J0581J0582J0581Q916
$$ 3193377 3191106 3188837 3187756 3186677 3174174 3161674 3166065 3170460 3174850 3179245 3189827 3200408 3210990 3221571 3230487
-27824C230487Q916k982j4404j2738j316O179M69l64l65p21p21o62o62o62o62O001O001O001
$$ 3230487 3239403 3236421 3222017 3209279 3207963 3214142 3214611 3214247 3213882 3213161 3212440 3211778 3211116 3210454 3209792 3215793 3221794 3227795
-27806C227795O001n540n540n183n183J361P072p81j2203j6333j0622J275O986O273O272O629
$$ 3227795 3233796 3228256 3222716 3217533 3212350 3213711 3220783 3220002 3207799 3191466 3180844 3182119 3189105 3195378 3201650 3208279
-27790C208279O629K347K345q361q362j53J1270P700J989l469r180r537l825p33p32o800M621
$$ 3208279 3214908 3217255 3219600 3211239 3202877 3202724 3213994 3221694 3223683 3220214 3211034 3201497 3197672 3196939 3196207 3189407 3194028
-27773C194028J4854J4853J0570q51o087o086o086o087o551M871N227o194q574k862Q320J4032
$$ 3194028 3208882 3223735 3234305 3233454 3227367 3221281 3215195 3209108 3202557 3207428 3212655 3206461 3197887 3195025 3203345 3217377
-27757C217377R035k387p027p027q693q693l695P726N108N109N822N823M394M395p027p027
$$ 3217377 3226412 3224025 3216998 3209971 3201278 3192585 3188890 3196616 3201724 3206833 3212655 3218478 3222872 3227267 3220240 3213213
-27741C213213l934l934l933l934N347N346J6055J6054J3344J922j4377k0089j2355r33J1321
$$ 3213213 3209279 3205345 3201412 3197478 3202825 3208171 3224226 3240280 3253624 3255546 3241169 3221080 3208725 3207792 3219113
-27726C219113J1322l075l075k718k718k599L113O324n098j1392j1391j1750j1748j398M313
$$ 3219113 3230435 3227360 3224285 3221567 3218849 3216250 3219363 3225687 3220589 3209197 3197806 3186056 3174308 3172910 3177223
-27711C177223P525l897m432m431n146n146P228P228P227P228j472j472j830j829K097l614
$$ 3177223 3184748 3180851 3176419 3171988 3166842 3161696 3168924 3176152 3183379 3190607 3189135 3187663 3185833 3184004 3186101 3182487
-27695C182487o826M595N548N547O261O261n398n399n398n399n410n409O012O012Q867Q867
$$ 3182487 3175661 3180256 3185804 3191351 3197612 3203873 3198475 3193076 3187678 3182279 3176869 3171460 3177472 3183484 3192351 3201218
-27679C201218k554k554J550J551J550J551J22J23M80M79K629Q343Q44j0574p722L703J1195
$$ 3201218 3198664 3196110 3197660 3199211 3200761 3202312 3202434 3202557 3203037 3203516 3206145 3214488 3215332 3204758 3197036 3200739 3211934
-27662C211934N488m65m61q22q18O317O321m748m744n938k23L699p718q555K870P150P153
$$ 3211934 3217422 3216957 3216496 3215674 3214856 3221173 3227494 3222746 3218002 3212064 3211841 3215540 3207822 3199267 3202137 3209287 3216440
-27645C216440K688K692j595j3013j1827m01J1492J1496N599N600N599N599j063j063j064
$$ 3216440 3219128 3221820 3220225 3207212 3195385 3194984 3206476 3217972 3223571 3229171 3234770 3240369 3239306 3238243 3237179
-27630C237179j063j1414j1415l49l50p131j2842n347O076P265m157j1295n585O789J2500
$$ 3237179 3236116 3224702 3213287 3212938 3212588 3205457 3192615 3187268 3193344 3200609 3196452 3185157 3179572 3186361 3198861
-27615C198861R645R644l264l264l265l264l503l502J138J2559J3303P596p518p514L547L551
$$ 3198861 3208506 3218150 3214886 3211622 3208357 3205093 3201590 3198088 3199226 3211785 3225088 3232684 3225166 3217652 3221199 3224750
-27599C224750L547L551p697p692o983o979k461Q965R317k101q70M845k893j4311q484J0555
$$ 3224750 3228297 3231848 3224151 3216459 3209476 3202497 3200036 3209001 3218318 3216217 3215347 3220192 3217299 3202988 3194504 3205059
-27583C205059J6977N558q70q66M841o577j3720j3716M603M607p29p25j1437j1432r415K012
$$ 3205059 3222036 3227594 3226724 3225858 3230699 3224122 3210402 3196686 3201289 3205896 3205167 3204442 3193005 3181573 3172158 3174170
-27567C174170J1050J6765J3786Q079l822r529j3816q102M149R864J1333J1336P050m369p823
$$ 3174170 3185220 3201985 3215771 3223850 3220028 3210499 3196683 3188581 3192730 3202594 3213927 3225263 3232313 3227944 3220121
-27552C220121k108n324n321k706Q718Q715k703j4128j4125k231R195Q339Q340R053R054k27
$$ 3220121 3218013 3212689 3207368 3204662 3213380 3222095 3219392 3205264 3191139 3188908 3198103 3206442 3214782 3223835 3232889 3232662
-27536C232662k27k27k27L09L09L08L09J974J974r090r091j952L759P329m094p663j952N544
$$ 3232662 3232435 3232208 3231981 3232290 3232599 3232907 3233216 3235190 3237164 3228074 3218983 3217031 3220790 3228119 3224025 3216362 3214410 3219954
-27518C219954N543j119j119j119j119R588R589k308j3731q154L272o58o365n774n771o131
$$ 3219954 3225497 3224378 3223259 3222140 3221021 3230609 3240198 3237890 3224159 3216005 3219277 3218619 3212254 3206480 3200709 3194578
-27502C194578o127n953n948j313J0113J3679P971l573r280o384o69m242m239L491L495L491
$$ 3194578 3188451 3182498 3176550 3175237 3185350 3199029 3207000 3203427 3194147 3187763 3187094 3182852 3178613 3182104 3185599 3189090
-27486C189090L495m35m31L491k216J231J2656J2296Q77m476m473O231O235J949J951J949
$$ 3189090 3192585 3192150 3191719 3195210 3192994 3194225 3206881 3219177 3220054 3215578 3211105 3217336 3223571 3225520 3227471 3229420
-27470C229420J952N80N83o915j2623r057K369m91o198o321N105J2954P246j205j201j561
$$ 3229420 3231372 3231952 3232535 3225620 3212997 3203940 3206309 3205818 3199620 3193299 3198404 3211358 3218604 3217399 3216198 3214637
-27454C214637j558r949r946J472J476q521q518K900K904P071P076P071P076K312K316K313
$$ 3214637 3213079 3203130 3193184 3194656 3196132 3187611 3179093 3181993 3184897 3191968 3199044 3206115 3213191 3215503 3217819 3220132
-27438C220132K317j4226j4221j614R812J3378J3381O120j2913l0971k5257N079J6504J0552
$$ 3220132 3222449 3208223 3194002 3192388 3202200 3215578 3228959 3235079 3222166 3191195 3165938 3171017 3187521 3198073
-27424C198073q66K342Q057L413q005j227j223K819K822K818K822J728J733Q511k908j1596
$$ 3198073 3197207 3199549 3207606 3211019 3203014 3201787 3200564 3203383 3206205 3209023 3211845 3213573 3215306 3223817 3220909 3209313
-27408C209313n882J610J613p729p726P380J3095K264r154r157K268L394k312J610J613J967
$$ 3209313 3203431 3205041 3206654 3198925 3191199 3198579 3211674 3213938 3204784 3195627 3197895 3201289 3198977 3200587 3202200 3204167
-27392C204167J971J966J971n588n585N834N837K264K268K265K268k413k413k413k413M42
$$ 3204167 3206138 3208104 3210075 3204487 3198902 3204736 3210573 3212837 3215105 3217370 3219638 3217225 3214812 3212399 3209986 3210428
-27376C210428M42M43M43M487M488M487M488m079m078m079m079J573J573R78R78p113j6631
$$ 3210428 3210870 3211313 3211756 3216243 3220731 3225218 3229706 3225627 3221549 3217470 3213391 3214964 3216537 3217515 3218493 3211380 3194749
-27359C194749j8772n447P581P581Q414Q414Q176Q176l246l246j796j795j796j796M986M986
$$ 3194749 3175977 3170530 3178111 3185692 3194106 3202520 3210696 3218872 3215626 3212380 3210584 3208789 3206993 3205197 3210183 3215169
-27343C215169p25j0244j6846j1135N759J5277N046m473j737L975M748M748M510M510K368
$$ 3215169 3214444 3204200 3187354 3176219 3181978 3197255 3202301 3197828 3196091 3200066 3204814 3209562 3214072 3218582 3220950
-27328C220950p150r886L439J4147M629j5240j5240l699N818L677k033J97K00J98K00L053
$$ 3220950 3213800 3203914 3207353 3221500 3226129 3210889 3195649 3191950 3197768 3201445 3199412 3199609 3199809 3200007 3200207 3203260
-27312C203260Q767J0905J390k420k417l015l012J863J867P216k298j0540j0537K86K90L618
$$ 3203260 3212027 3222932 3224322 3221902 3219485 3216470 3213458 3215321 3217188 3224404 3222106 3211566 3201029 3201315 3201605 3205223
-27296C205223L621L618L621J5159J5162R090m24j1254j1251m27m24P51P51m960M558R793
$$ 3205223 3208844 3212462 3216083 3231242 3246404 3255494 3255070 3243816 3232565 3232138 3231714 3232465 3233216 3228256 3232814 3242607
-27280C242607M083j0552j0551o864K655Q722Q723l057l056l056l056J941J940J346J346l056
$$ 3242607 3246690 3236138 3225587 3218723 3221378 3230100 3238823 3235766 3232710 3229654 3226598 3228539 3230479 3231825 3233171 3230115
-27264C230115j2574j8048j8047l413O105P51P51N391N391N748N748R19O633R841j576j5263
$$ 3230115 3217541 3199493 3181446 3178033 3184138 3184889 3185640 3191031 3196422 3202170 3207918 3208837 3215470 3225311 3223735 3208472
-27248C208472j5258l722P704N975K67k234R191J4779J4783M071M075m9m4m9m4p62p59p62
$$ 3208472 3193214 3189492 3197196 3203171 3203438 3201204 3210395 3225174 3239957 3244028 3248103 3248054 3248010 3247961 3247917 3247155 3246396 3245634
-27230C245634p58j893j889j892j889O06O10M532j175j881R540N972K60m380m380O328O328
$$ 3245634 3244876 3242983 3241094 3239202 3237313 3237919 3238529 3243061 3241886 3240005 3249545 3255517 3255777 3251397 3247017 3253345 3259673
-27213C259673q425j4136o283N138K878k833k476L234O012L01n5N655M941o480j8022j8021
$$ 3259673 3251248 3237112 3230829 3235967 3238845 3236012 3233536 3236770 3242782 3243083 3243028 3248683 3253624 3247144 3229122 3211101
-27197C211101o005N418j008j008P083P083P083P083k469k469k825k826L242k469o395N027
$$ 3211101 3205096 3210514 3209506 3208498 3215581 3222664 3229747 3236830 3234361 3231892 3229067 3226241 3229483 3227014 3220619 3225646
-27181C225646R429j993o276o276j279j279r22r22O949J2660M807o614l283K428M926o496
$$ 3225646 3235075 3233082 3226806 3220530 3219251 3217972 3217050 3216128 3223077 3235737 3240544 3233930 3230647 3233075 3238001 3231505
-27165C231505j1968j1968j260j261N402N403N045N045Q013K305o384j7802j7806o380J945
$$ 3231505 3219537 3207569 3206309 3205048 3210450 3215853 3220898 3225943 3233956 3236261 3229877 3212075 3194269 3187889 3189834
-27150C189834P659N454k52k57N458L38n368j804j799P685P689m213j5630r328K096j119o826
$$ 3189834 3197493 3202947 3202695 3202438 3207896 3208234 3202866 3201062 3199263 3206948 3214637 3210424 3194794 3185466 3187562 3186443 3179617
-27133C179617l142Q284J2920J2924N46N51R03R07K633Q343J0485R66m863m863j413p124p956
$$ 3179617 3176475 3184759 3197679 3210603 3211149 3211700 3212603 3213510 3216143 3224486 3234971 3235937 3231074 3226211 3224798 3217674 3209718
-27116C209718N369J9408J3697M91n220k722k721r311j5020o098L421L421k291k052L658K231
$$ 3209718 3215087 3234495 3248192 3248683 3243463 3240741 3238020 3228709 3213689 3207591 3211012 3214433 3212142 3210090 3213748 3215979
-27100C215979l480Q9Q9l123l123l123l123O510O514O511O513p766p764p172p168j104Q417
$$ 3215979 3212499 3212588 3212677 3209554 3206431 3203308 3200185 3206695 3213209 3219720 3226233 3218467 3210703 3203531 3196363 3195259 3203676
-27083C203676O272N66q124q121k412P108P165P168P760P763n804n800n804n800P40P44P40
$$ 3203676 3209948 3210514 3202390 3194269 3191857 3198965 3206130 3213298 3221058 3228821 3223017 3217217 3211413 3205613 3206353 3207097 3207837
-27066C207837P43m019m015m019m016k517k517j922j923O644J6163J3663P953j803p514m659
$$ 3207837 3208580 3204561 3200546 3196527 3192511 3189994 3187477 3185555 3183632 3190276 3206439 3220102 3228055 3226252 3218738 3214079
-27050C214079m659m182m183l75o087j2749l231R738R737K718k993n491M026R381L669l350
$$ 3214079 3209420 3205238 3201055 3200680 3194593 3181844 3178613 3188351 3198088 3200806 3197813 3192322 3196348 3205729 3209398 3206048
-27034C206048l350n015M502J0571J0570j063j060j1887j1886o061L462R529R530n88n84n83
$$ 3206048 3202698 3197683 3202185 3212756 3223326 3222263 3221203 3209316 3197430 3191369 3194831 3204360 3213890 3213302 3212718 3212135
-27018C212135n84J792J796r269r269o596q81K093p425j0165L164J4110J4110O62O65O66O65
$$ 3212135 3211551 3213343 3215139 3205870 3196601 3190005 3189124 3191217 3183792 3173627 3176791 3190901 3205011 3205673 3206338 3207004 3207669
-27001C207669M707M711M711M711K710K710K711K710q58q60q58q59j45j45j0853j0853j097
$$ 3207669 3212376 3217087 3221798 3226509 3229219 3231929 3234640 3237350 3236492 3235632 3234774 3233915 3233770 3233625 3222772 3211919 3210822
-26984C210822J0325J0325j097m918m920n633n632n276n276M35M35o585o584M837M837P098
$$ 3210822 3221147 3231472 3230375 3225457 3220537 3214904 3209272 3203996 3198720 3199155 3199590 3193005 3186421 3191258 3196095 3203193
-26968C203193P098J387J386r195r194l484l484N321N320N321N320j104j104j104j105J751
$$ 3203193 3210291 3211678 3213064 3203869 3194675 3191191 3187707 3193028 3198348 3203669 3208989 3207885 3206781 3205677 3204572 3206323
-26952C206323J751J752J751l841l841l840l841P343P343P343P344j0147j0147J276J275l90
$$ 3206323 3208074 3209826 3211577 3207736 3203895 3200055 3196214 3203557 3210900 3218243 3225587 3215440 3205293 3206569 3207844 3207454
-26936C207454l91l90l90L450L450L451L454N94N95N95N99n057n056n771n766O54j0767j0767
$$ 3207454 3207063 3206673 3206283 3209733 3213183 3216634 3220088 3220682 3221277 3221872 3222471 3217414 3212358 3206587 3200821 3201475 3190708 3179941
-26918C179941O57J1467J1466P183m234j0188j0187N20N25M089M090M090M094O469O469m952
$$ 3179941 3180598 3192065 3203531 3210714 3206480 3196292 3186105 3186625 3187150 3191239 3195329 3199419 3203513 3209982 3216451 3211499
-26902C211499m949j71j71j71j71j71j71j71j71j3437j3437q440K982J2738J2738K030K030
$$ 3211499 3206550 3206379 3206208 3206037 3205866 3205695 3205524 3205353 3205182 3191745 3178308 3169868 3172850 3185588 3198326 3200356 3202386
-26885C202386N406N406N406N406p086p087j2083j2084J717J3140K432q991j2916j495J0403
$$ 3202386 3207792 3213198 3218604 3224010 3216924 3209837 3197754 3185670 3187387 3200527 3202959 3193968 3181052 3179557 3189960
-26870C189960J0403l959l960l960l959k175k175p172K346Q889J4601J7337P819l841l840
$$ 3189960 3200363 3196404 3192444 3188484 3184525 3182350 3180175 3173003 3175349 3184238 3198839 3216176 3223995 3220154 3216314
-26855C216314m436m435l678l677P745P745l440l439l439l439k844k845k844k844M87M87Q44
$$ 3216314 3211878 3207443 3203765 3200088 3207833 3215578 3212138 3208699 3205260 3201821 3198977 3196132 3193288 3190444 3190931 3191418 3192262
-26838C192262J0362J0106J0105M633m886j5236j5237j0120j0120m588m589O834O834O715
$$ 3192262 3202624 3212730 3222835 3227468 3222582 3207346 3192109 3181989 3171869 3167281 3162692 3169526 3176360 3183075
-26824C183075O714O715O715M216M217p206p206l636l636K074K075J183J182O893O893j911
$$ 3183075 3189789 3196504 3203219 3207435 3211652 3204446 3197240 3193604 3189968 3192042 3194117 3195300 3196482 3203375 3210268 3208357
-26808C208357j911k268k268m584j0295l514R812J4571Q860k562q272p559j848N410N410m21
$$ 3208357 3206446 3204178 3201910 3197326 3187031 3183517 3193329 3207900 3216760 3214198 3205926 3198367 3196519 3201929 3207339 3206918
-26792C206918r938j2080J246L967L967M800M800M1M1M1M0K183K182K183K182m480m480m480
$$ 3206918 3196980 3184900 3186146 3190113 3194080 3198880 3203680 3203721 3203762 3203803 3203843 3206026 3208208 3210391 3212573 3208093 3203613 3199133
-26774C199133m480K766K766K171K172m254j3771j3772m253L87L86R82R81N741N741N740N741
$$ 3199133 3194653 3197419 3200185 3202356 3204528 3200274 3186503 3172731 3168478 3168865 3169251 3170233 3171214 3176955 3182696 3188436 3194177
-26757C194177q93q92q92q93N771N770N770N771K320K320K677K677J725P436R578N9r139r139
$$ 3194177 3193284 3192392 3191500 3190607 3196378 3202148 3207918 3213689 3216009 3218329 3221006 3223683 3225408 3232844 3242422 3242481 3233342 3224203
-26739C224203r733r734K640K639K640K640K60K61r7r7q068j3779n569N852J2857J2857K148
$$ 3224203 3214470 3204736 3207376 3210015 3212655 3215295 3215555 3215816 3215719 3215622 3207554 3193775 3188206 3194058 3206915 3219772 3221920
-26722C221920K150k729k729k729k729o061o060p07p06r273j4983o775M648J1607J1608J2322
$$ 3221920 3224070 3221341 3218612 3215883 3213154 3207093 3201033 3200326 3199620 3190347 3175364 3168589 3173237 3184844 3196452 3208774
-26706C208774J2321p190p191n406L05o239j7661o595M826J1488O7p428j718Q886Q886J1741
$$ 3208774 3221095 3213905 3206714 3201308 3201613 3195374 3177713 3171118 3175944 3187432 3187499 3180071 3178353 3187239 3196125 3207866
-26690C207866O031m320j5742j6100m676N019N019N733N733P756P756l666l666l101l101K253
$$ 3207866 3213897 3209577 3193835 3177735 3173059 3178078 3183097 3188830 3194563 3202319 3210075 3206409 3202743 3199642 3196541 3198794
-26674C198794K253m885j0596l101Q321J4626L205j435j435n480j1191r050K372R689L978
$$ 3198794 3201047 3196162 3185566 3182465 3190786 3205412 3208617 3207182 3205747 3200267 3189076 3180026 3182398 3192087 3196065
-26659C196065l517l517Q975Q976k447k446L323L325k388k387J12J12J11J12j216j216j216
$$ 3196065 3192548 3189031 3198006 3206982 3204535 3202089 3205412 3208737 3206349 3203962 3204074 3204186 3204297 3204409 3203193 3201977 3200761
-26642C200761j216p640p641L782L781J878J877J878J877J0444J0444R730R730k539j3962
$$ 3200761 3199545 3191905 3184264 3188046 3191827 3193705 3195582 3197460 3199337 3209781 3220225 3229955 3239685 3237146 3223184
-26627C223184k1813j6103k539L171L16L16N551N551M837M838k302j3723j3723k302Q596Q597
$$ 3223184 3201371 3185268 3182729 3185900 3186216 3186532 3192083 3197634 3202471 3207309 3205007 3191284 3177561 3175259 3183855 3192452
-26611C192452R309R310L0L0L0K9k230k231j2939j2939k587Q834J0261J5973J9021J3311k990
$$ 3192452 3201761 3211071 3211101 3211131 3211161 3211190 3208960 3206729 3193790 3180851 3178264 3187098 3197359 3213332 3232353 3245664 3242674
-26594C242674j4410j6196j0485o202m90M01M01P59P59k930k930K424K424J2478O767k276
$$ 3242674 3228264 3212068 3201583 3195381 3194891 3195292 3195693 3196452 3197211 3194281 3191351 3193775 3196199 3208677 3215444 3213168
-26578C213168j3697j2626o916J056J2478Q789k632R37O648L435k275j34J1288J0603q17j2716
$$ 3213168 3199471 3186845 3179929 3180985 3193463 3202252 3199620 3200557 3207205 3210640 3208365 3208231 3219519 3230122 3229305 3216589
-26562C216589j2716P392P391O678O677O856m566j2418o707K454Q165K810k900o826o826j472
$$ 3216589 3203873 3211265 3218656 3225334 3232011 3238867 3234301 3221883 3215176 3217630 3225795 3228605 3225705 3218879 3212053 3210581
-26546C210581j473M596M595o826o826n220n221M91M91K989K989q432q432n36n35n35n36O603
$$ 3210581 3209108 3213704 3218299 3211473 3204647 3199427 3194206 3194697 3195188 3198177 3201166 3192734 3184302 3183766 3183231 3182696 3182160 3188763
-26528C188763O603O604O603L986L985l509r221q388L034N175n35q381q380L517J4939J7914
$$ 3188763 3195366 3201970 3208573 3212559 3216544 3213035 3203814 3195426 3198460 3203635 3203100 3194719 3186339 3189856 3204795 3222709
-26512C222709J2202M707M707k134k134p845p845K506K506K506K506j71j71j0879j0879m573
$$ 3222709 3234911 3239618 3244325 3242191 3240057 3232212 3224367 3226873 3229379 3231885 3234391 3234220 3234049 3223170 3212291 3207718
-26496C207718O848L636k074K327K328J970J971m692m692m693m692L562L562L562L562J1414
$$ 3207718 3214566 3218202 3216128 3218455 3220783 3222753 3224724 3220032 3215340 3210647 3205955 3209517 3213079 3216641 3220203 3231617
-26480C231617J1414m83j1905j4879l458M394j316o075l64P488P488L472L473m53N257M424
$$ 3231617 3243031 3242548 3230643 3215764 3212306 3216700 3215384 3209309 3208945 3216433 3223921 3227393 3230866 3230413 3235670 3240094
-26464C240094o997k16k15m975m975m975m974k120k119k119k119N253N254N253N254k599k599
$$ 3240094 3233097 3232881 3232666 3227691 3222716 3217741 3212767 3210647 3208528 3206409 3204290 3209543 3214797 3220050 3225304 3222705 3220106
-26447C220106k956k955n276j0987l491P930J5783M361j1224j6936m324P098O740m680q489
$$ 3220106 3217150 3214195 3208919 3197932 3194441 3202371 3218154 3222515 3211291 3194355 3190031 3197129 3203869 3199189 3190700
-26432C190700q488m205P217Q406Q407k302k301M837M837M837M837k171k171k172k171P585
$$ 3190700 3182212 3178007 3185224 3193630 3202037 3199735 3197434 3202271 3207108 3211945 3216782 3214611 3212440 3210268 3208097 3215682
-26416C215682P584P585P585R667R667M670o752j3177j3177N146N146K305K305K305K306o975
$$ 3215682 3223266 3230851 3238436 3248103 3257770 3262440 3255688 3242511 3229334 3234480 3239626 3241931 3244236 3246541 3248847 3241872
-26400C241872o976k335R087P362J651J651P361L079q343q343L078J5n696n339L71J5n696
$$ 3241872 3234896 3232561 3241648 3249010 3250661 3252312 3259673 3262752 3254409 3246066 3249144 3249159 3243463 3238124 3238495 3238510 3232814
-26383C232814k126k127J145J145J145J146l971l971p897k186Q369l053j4117k696J3248J3247
$$ 3232814 3230688 3228561 3229706 3230851 3231996 3233142 3229171 3225200 3217303 3215117 3223486 3220433 3206316 3203620 3216868 3230115
-26367C230115K064r359o205N216N217o206j0726O95J1879J1879K607q816r172K249M272j439
$$ 3230115 3232179 3222820 3216615 3221831 3227048 3220842 3210116 3210811 3222690 3234569 3237176 3228360 3219188 3221437 3225709 3224270
-26351C224270K488K487N819N818N819N819j558j558j201j201Q202J3913N704n719j0596j0597
$$ 3224270 3226758 3229245 3235064 3240882 3246701 3252520 3250962 3249404 3248203 3247002 3255204 3269117 3274821 3269102 3258506 3247909
-26335C247909o313N109L324L324L681L680L086k625j0834k2256j7668J368J5884J5883P793
$$ 3247909 3241596 3246705 3250029 3253353 3257034 3260714 3263800 3261175 3250341 3228085 3210417 3211785 3227669 3243552 3251345
-26320C251345l629q626q625r340r340m699O722J5169R459J963J963n265n264n265n265K588
$$ 3251345 3247716 3239090 3230465 3221125 3211785 3207086 3213808 3228977 3238436 3240399 3242362 3237097 3231833 3226568 3221303 3223891
-26304C223891K588K230K232m789j0500j3712k291J5438J5437M729M730qpqpp384p384p027
$$ 3223891 3226479 3228709 3230941 3226152 3215652 3201940 3199649 3215087 3230524 3235253 3239983 3239975 3239968 3239960 3239953 3232569 3225185 3218158
-26286C218158p027qN704Q916k506p384p384l458P964J4322Q611l287q998o69o69j026j027
$$ 3218158 3211131 3211123 3216827 3225743 3223237 3215853 3208469 3205011 3212975 3227297 3235908 3232621 3223623 3222954 3222285 3221259 3220232
-26269C220232Q255Q254o857j2566j027J0396J0039j383m350m351n064n064K313K313K312
$$ 3220232 3228487 3236741 3229884 3217318 3216291 3226687 3236726 3235343 3230993 3226642 3221578 3216514 3218827 3221140 3223452
-26254C223452K313r00q99J0164J0166n421j1132l279Q142Q016K305K305Q017R443j978o618
$$ 3223452 3225765 3224865 3223966 3234130 3244296 3238875 3227743 3224464 3232606 3240622 3242927 3245232 3253249 3262692 3260714 3254096
-26238C254096o618n428n428n429n428N21N20J64J63O544Q33j904P615J3206L688r399r399
$$ 3254096 3247478 3242050 3236622 3231193 3225765 3226286 3226806 3226970 3227133 3233677 3234510 3232606 3240221 3253427 3257115 3247716 3238317
-26221C238317n057n056n057n056Q031Q031Q031Q031n057n056n057n057J369J368j0053j0054
$$ 3238317 3233260 3228204 3223147 3218091 3226122 3234153 3242184 3250215 3245158 3240102 3235045 3229988 3231357 3232725 3222672 3212618
-26205C212618k498k499k499k498K261K260K260K261J1299J1299p737p737K376K376n239j0950
$$ 3212618 3210120 3207621 3205122 3202624 3204885 3207145 3209405 3211666 3222965 3234264 3226527 3218790 3221166 3223542 3218303 3207353
-26189C207353j788P730R514l811j1425j1426j193j194l231q942j1083j565R737R738M621
$$ 3207353 3205565 3213295 3222809 3218998 3207573 3196147 3194954 3193760 3190529 3181587 3170504 3168939 3178676 3188414 3193035
-26174C193035m896j209M503L551k161k874q584j1084j565O659O659m168m168Q919Q920Q919
$$ 3193035 3188139 3186930 3191433 3194984 3192823 3189949 3181365 3170281 3168716 3175375 3182034 3177866 3173698 3182617 3191537 3200456
-26158C200456Q920r403r403r403r402K256K257K257K257P715P715l707l707K599K599k874
$$ 3200456 3209376 3199973 3190570 3181167 3171765 3174021 3176278 3178535 3180792 3188507 3196222 3192515 3188808 3191407 3194006 3191132
-26142C191132j2392j0846j327M145M146O882O882m540m539m332m332l974l975J975P685J0421
$$ 3191132 3178740 3167894 3166567 3170712 3174858 3181740 3188622 3184082 3179543 3175211 3170879 3166905 3162930 3164905 3172590 3183011
-26126C183011R04k190P328O734k785j3731j3731k903k904L581L580M175M176N365J4883J7382
$$ 3183011 3183915 3181725 3189053 3195787 3193002 3179271 3165540 3162637 3159733 3163314 3166894 3171069 3175245 3180610 3195493 3212875
-26110C212875M056k547L164q81q81n24n25J7798J7799J4846L424r663k1085j2043o21L663
$$ 3212875 3216931 3214384 3217548 3216667 3215786 3215262 3214737 3232535 3250334 3265180 3268604 3258941 3237856 3225813 3225192 3228855
-26094C228855L662j038j037j037j037n083n083n082n083M205M206M205M205n789n789M919
$$ 3228855 3232517 3231479 3230442 3229405 3228368 3223285 3218202 3213120 3208037 3212242 3216448 3220653 3224858 3219069 3213280 3218199
-26078C218199M919Q250l171q169q168O822O823O822O823o715o715j3139j718M945M945n763
$$ 3218199 3223118 3231368 3228197 3220028 3211860 3218682 3225505 3232327 3239150 3232435 3225720 3212581 3210863 3215808 3220753 3214990
-26062C214990n763J852J851J852J852P562P562K566q856q373q373K334K335m803m804m804
$$ 3214990 3209227 3211079 3212930 3214782 3216634 3224196 3231758 3234324 3225468 3217095 3208722 3211056 3213391 3208588 3203784 3198980
-26046C198980m803L881L882L881L882Q641Q641Q640Q641m250m250m249m250M317M316M317
$$ 3198980 3194177 3198058 3201940 3205821 3209703 3218344 3226985 3235625 3244266 3240016 3235766 3231517 3227267 3231584 3235900 3240217
-26030C240217M317j752j751j751j751q176q176L246L246J862J863J863J863J3284J3284M957
$$ 3240217 3244534 3242782 3241031 3239280 3237529 3229353 3221177 3224423 3227669 3229531 3231394 3233257 3235120 3248404 3261688 3266645
-26014C266645j4081j8660j8661p239M183J37J38Q51Q52l581l580j0719P02J1411j1j1909
$$ 3266645 3252564 3233904 3215243 3208004 3212187 3212324 3212462 3213313 3214165 3210584 3207004 3196285 3196987 3208398 3208387 3196478
-25998C196478j1909J417J416K131K130O176J7597J1173J1173J141J141j0280j0280l856l855
$$ 3196478 3184569 3185986 3187402 3189533 3191663 3197839 3215436 3226609 3237782 3238923 3240064 3229784 3219504 3215648 3211793
-25983C211793l856l856n997n997n997n997M472M473M473M473l35l34l35l34j049j048j049
$$ 3211793 3207937 3204081 3198084 3192087 3186090 3180093 3184565 3189038 3193511 3197984 3197649 3197315 3196980 3196646 3195597 3194549 3193500
-25966C193500j048J3050J3050J628J629J390J391j0031j0031K089K090n406j1117L041J4463
$$ 3193500 3192452 3205502 3218552 3220180 3221809 3223199 3224590 3214559 3204528 3206617 3208707 3203301 3192184 3195225 3209688
-25951C209688J4463L042j064M648M291j421j777L934O789m633r522r522r522r521l930P492
$$ 3209688 3224151 3227193 3226129 3230777 3235068 3233647 3231870 3235804 3242593 3237960 3228438 3218916 3209394 3199873 3195943 3203435
-25935C203435M279j431j729j729k086k086J1002J1001m20m20J342J343J342J342m131m130
$$ 3203435 3207714 3206283 3204554 3202825 3200739 3198653 3209655 3220656 3220236 3219816 3221158 3222501 3223843 3225185 3221054 3216924
-25919C216924O577O577k822j4244k6855k6855p581p581p582p580J706J707K420K421L848
$$ 3216924 3223501 3230078 3227256 3213012 3186157 3159302 3151721 3144140 3136558 3128978 3130684 3132391 3134811 3137232 3141080
-25904C141080J5270J5626M205l75N335Q191l231o086l76P120P120O540O540O540O540N826
$$ 3141080 3156350 3171976 3176181 3175806 3181141 3189332 3186101 3180015 3179639 3186759 3193879 3200419 3206959 3213499 3220039 3225865
-25888C225865N826n595n596r462r462J959J959J3381J3382J483r938j0805O17O18j0805o997
$$ 3225865 3231691 3226096 3220500 3211038 3201576 3203535 3205494 3218875 3232257 3233740 3223802 3212997 3213614 3214232 3203427 3196430
-25872C196430M424J5965J5965J5728J0016J331j0091q187L235J0730N020j852j852M574o849
$$ 3196430 3200854 3216819 3232784 3248512 3258528 3259859 3249768 3241581 3244816 3255546 3260566 3258714 3256862 3261436 3254587
-25857C254587j5296r585k089k090p979p979L443L443P726P726l101l101n840L677R744R745
$$ 3254587 3239291 3229706 3227617 3225527 3217548 3209569 3213012 3216455 3224181 3231907 3228806 3225705 3219865 3223542 3233286 3243031
-25841C243031L202L201L201L201o65o66o65o66l521l521l521l521l625l625l625l625L038
$$ 3243031 3246233 3249434 3252635 3255836 3255171 3254505 3253840 3253174 3249653 3246132 3242611 3239090 3235465 3231840 3228215 3224590 3227628
-25824C227628L037L038L038L037L038L037L038q622q622q027q027l362O157J2225J2225J1749
$$ 3227628 3230665 3233703 3236741 3239778 3242816 3245853 3248891 3240269 3231647 3223620 3215593 3212231 3218388 3230613 3242838 3254587
-25808C254587J1749j934j1451r369r370r607r608K291Q001J0738J219l986N533J4218Q506
$$ 3254587 3266336 3264402 3252951 3243582 3234212 3224605 3214997 3217288 3225289 3236027 3237246 3233260 3238793 3253011 3261517
-25793C261517j249j249R221R220M759m759j0826j0827M75M76M76M76m677m677m321m320k655
$$ 3261517 3260268 3259019 3268240 3277460 3282219 3277460 3266634 3255807 3256282 3256758 3257234 3257710 3253033 3248356 3244035 3239715 3237060
-25776C237060L057N792l725l845N674J4359Q648l94l94J0076J0075L934n584n942L577P979
$$ 3237060 3240117 3245909 3242184 3238339 3244013 3258372 3267020 3266626 3266232 3276308 3286383 3290317 3284733 3278791 3282368 3290347
-25760C290347K268n347n346P81P80P81P81O7O7O7O7m124m123m123m123N632N633N633N633
$$ 3290347 3292615 3287268 3281922 3282703 3283483 3284264 3285045 3285112 3285179 3285246 3285313 3281189 3277066 3272943 3268820 3274452 3280085 3285718 3291351
-25741C291351J825J826r596r597k457k458k457k458q867q868m941Q384K5993K5992Q89j2437
$$ 3291351 3293176 3295002 3285406 3275809 3273352 3270894 3268437 3265979 3257112 3248244 3243303 3251687 3277680 3303672 3304561 3292124
-25725C292124m287R039J5344R634O063O065n715n715N153N154o269o268o507o507J2530J2530
$$ 3292124 3287837 3296876 3312220 3321854 3327917 3333982 3328267 3322552 3327705 3332859 3326590 3320322 3313815 3307308 3319838 3332368
-25709C332368m39m38m39m39J703J703J3124J3125J7750J7750j287j286J2277J2277J2276
$$ 3332368 3331929 3331491 3331052 3330613 3332316 3334019 3347143 3360268 3378018 3395768 3394481 3393195 3405472 3417749 3430025
-25694C430025J2277J8226J8226K0367k476j0567Q55J9654J9653J8230J8229K9651K9652K5843
$$ 3430025 3442302 3460528 3478754 3499121 3496645 3486078 3486933 3506587 3526240 3544470 3562699 3592350 3622002 3647845
-25680C647845K5844M8688P1531Q9972J12816J33756J56599J97051K50352L21739M20727N44523
$$ 3647845 3673689 3722377 3793908 3883880 3996696 4130452 4287051 4484102 4734454 5056193 5476920 6021443
-25668F021443O58740P22511O53980M38872J26676k04792m56071n80282n91704n46731m78200
$$ 6021443 6680183 7402694 8056674 8495546 8622222 8417430 7961359 7381077 6789373 6242642 5764442
-25657E764442m01817l18058k55238k17166j88704j65861j31357j08514q1864p0441o4017
$$ 5764442 5362625 5044567 4789329 4572163 4383459 4217598 4086241 3977727 3895863 3825422 3761405
-25646C761405o4017m0876m0876m0876m0875l6593l6593j7556j7557p079p079p079p079n890
$$ 3761405 3697388 3656512 3615636 3574760 3533885 3497292 3460699 3443143 3425586 3418507 3411428 3404349 3397270 3391380
-25632C391380n889n889n890j2849j2849j2850j2850l093l093Q328Q328j1678j1678j1679
$$ 3391380 3385491 3379602 3373712 3360863 3348014 3335164 3322314 3319221 3316128 3324456 3332784 3321106 3309428 3297749
-25618C297749j1678N693N692n730n729j5010j5009J1641J1641K1397K1397m539m540o176
$$ 3297749 3286071 3291764 3297456 3291726 3285997 3270987 3255978 3267619 3279260 3300657 3322054 3317515 3312975 3306799
-25604C306799N246J2385j0459j4980l558O436m986j2838j2838j3553j3552J1J2J1432J1433
$$ 3306799 3312045 3324430 3313971 3298991 3295433 3301869 3296883 3284045 3271207 3257654 3244102 3244113 3244125 3255557 3266990
-25589C266990R195R195k227k228J53J52J53J52n02n01n03n02n01n02K12K12k577Q845J3842
$$ 3266990 3276185 3285380 3283153 3280925 3281078 3281230 3281383 3281535 3281033 3280532 3280029 3279527 3279026 3278524 3278736 3278948 3276371 3285216 3299058
-25570C299058n194k1851j0429Q607Q608P001P001P001P001l231l231j3939j3939j4388k967
$$ 3299058 3293864 3272013 3261584 3270191 3278799 3285800 3292801 3299802 3306803 3303572 3300341 3286402 3272463 3258075 3255108
-25555C255108J6545J6545K506q916k491k491R050R049M767o655k31J1191J0478r45n376n376
$$ 3255108 3271653 3288198 3290704 3281788 3279297 3276806 3285856 3294905 3299672 3293017 3292786 3303977 3314455 3313510 3308134 3302758
-25539C302758N331N332j093j093j093j093k3k2O402n019n257n257n972n971J896J897Q321
$$ 3302758 3308089 3313421 3312328 3311235 3310142 3309049 3309026 3309004 3315406 3310387 3305130 3299873 3293901 3287930 3289826 3291723 3300044
-25522C300044l101r764r763J658J658L919J5341J5340L919J301J302N87N87j569j569q55
$$ 3300044 3296943 3287179 3277416 3279074 3280732 3284651 3299992 3315332 3319251 3320552 3321854 3322441 3323028 3321459 3319890 3319035
-25506C319035q55l235Q188Q900k520n436N986J0269q767j8047o626J2411J2411j1370j1370
$$ 3319035 3318180 3314945 3323133 3332033 3329513 3324077 3330063 3340332 3331565 3313518 3306892 3319303 3331714 3320344 3308974
-25491C308974N2N2o848o849J2188J2187n42n43n43n43O47O47P785l636j2515j092L903L904
$$ 3308974 3309026 3309078 3302230 3295381 3307569 3319756 3319214 3318671 3318128 3317585 3318232 3318879 3326664 3323028 3310513 3309421 3313324 3317228
-25473C317228q708K715P711P711j2217j2218O819O819N391N391N391N391J554J555J554J554
$$ 3317228 3308520 3311235 3318946 3326657 3314440 3302222 3309041 3315860 3321251 3326642 3332033 3337424 3338978 3340533 3342087 3343641
-25457C343641j0819j0820j301j302J0716J0715J1429QJ554J554P265m157j0105j0106j301
$$ 3343641 3332822 3322002 3320701 3319399 3330115 3340830 3352259 3352267 3353821 3355375 3362640 3358483 3348378 3338272 3336971
-25442C336971j301j540j539P979P979O551O551P265P265L934J5355J9639O02k2356k2357
$$ 3336971 3335670 3334130 3332591 3340570 3348549 3355100 3361651 3368916 3376181 3380115 3395470 3415109 3415711 3393355 3370998
-25427C370998j0221j0220m510m511L105q317j2125O912K5948J4527j0221k1643r031K391
$$ 3370998 3360777 3350557 3346047 3341536 3344641 3336324 3324199 3331111 3357059 3371586 3361365 3339722 3330691 3333082
-25413C333082Q592Q593J5731M309L119L119Q831k592j3061j3062m49m50j0920j0920O213
$$ 3333082 3341674 3350267 3365998 3370307 3373426 3376545 3385376 3382784 3369723 3356661 3356212 3355762 3344842 3333922 3340135
-25398C340135O213j090j089l75l76k041R380R381k041q288q287J5745J5746K778K777o027
$$ 3340135 3346348 3345258 3344169 3343794 3343418 3341377 3350757 3360138 3358097 3349809 3341522 3357267 3373013 3375791 3378568 3372541
-25382C372541o027q897K525Q949k473j0087J335L714L715p648p648N677N678K465K465Q889
$$ 3372541 3366514 3357617 3360142 3369091 3366618 3356531 3357866 3361580 3365295 3357647 3349999 3355676 3361354 3363819 3366284 3375173
-25366C375173k531j6070j6069P964P964m053m052J6887J6887r763r764M038J5459J5698M276
$$ 3375173 3372642 3356572 3340503 3348467 3356431 3352378 3348326 3365213 3382100 3372337 3362573 3366611 3382070 3397768 3402044
-25351C402044J896J896k863k863O656O655j4404j4403j1311J12k268k268l64l65J0939K9974
$$ 3402044 3403940 3405836 3402973 3400110 3406766 3413421 3399017 3384614 3373303 3373415 3371147 3368879 3368515 3368150 3379089 3409063
-25335C409063M2824L1403J4745J4746J9743J9742R273R273k46k45k1899k1899j2381j2381
$$ 3409063 3451887 3483290 3498035 3512781 3532524 3552266 3561539 3570812 3570566 3570321 3548422 3526523 3514142 3501761
-25321C501761j7854j7854J0700J0701p726p726k015k015k7714k7715Q40Q41r095r094l383
$$ 3501761 3483907 3466053 3476753 3487454 3479728 3472002 3469987 3467972 3440258 3412543 3413383 3414224 3405129 3396035 3392652
-25306C392652l383l503l502l503l502o510o511J4430J4430M316M317J3835J3835P469P469
$$ 3392652 3389269 3385766 3382264 3378761 3375259 3368749 3362238 3376668 3391098 3395414 3399731 3413566 3427401 3434870 3442339
-25291C442339J3181J3180L543L544K4483K4483k733k733k732k733K502K503L692L691j424
$$ 3442339 3455520 3468700 3472243 3475787 3500270 3524753 3522020 3519287 3516555 3513822 3516324 3518827 3522519 3526210 3524786
-25276C524786J7613K9748J8326j5344k6767j5344j5344l6251l6250j5073J1578J5861J5861
$$ 3524786 3542399 3572147 3590473 3575129 3548362 3533018 3517674 3481423 3445173 3430100 3441678 3457539 3473400
-25263C473400Q008Q009j3050j3050l533l532j0908j0909j6620j6619l3618l3619j256j257
$$ 3473400 3481408 3489417 3476367 3463317 3459784 3456252 3445344 3434435 3417815 3401196 3367578 3333959 3332703 3331446
-25249C331446k684k685L026L027j0180j0180J5281L4317L5032L5031L3603J4567k126k127
$$ 3331446 3328762 3326077 3329103 3332130 3321950 3311770 3327051 3361368 3396400 3431431 3465034 3479601 3477475 3475348
-25235C475348J7623J7624n220n220J9527J9527O09O10J3935J3936L227L227L227L227l524
$$ 3475348 3492971 3510595 3505375 3500155 3519682 3539209 3539818 3540428 3554363 3568299 3571526 3574753 3577980 3581207 3577683
-25220C577683l525k335k335j5303L733K9194K9193O827O826O826O827q641q641J9914J9914
$$ 3577683 3574158 3571823 3569488 3554185 3557918 3587112 3616305 3623132 3629958 3636784 3643611 3634970 3626329 3646243 3666157
-25205C666157q507q507J0529J0530k98k97J1124J1125j0798j0797J5854J5854q04q03J8234
$$ 3666157 3657650 3649143 3659672 3670202 3669904 3669607 3680731 3691856 3681058 3670261 3686115 3701969 3701165 3700362 3718596
-25190C718596J8233j5884j5883J0768J0767k320k320k320k320k2279k2278J279K0315J7460
$$ 3718596 3736829 3720945 3705062 3715830 3726597 3724277 3721957 3719637 3717317 3695038 3672760 3674039 3694354 3711814
-25176C711814J7460L3878N2915L9106K7685L5299L5298J0790J0790L3157N2194M4935K5900
$$ 3711814 3729274 3763152 3816067 3855173 3882858 3918157 3953455 3964245 3975035 4008192 4060386 4105321 4131221
-25163D131221K5186K5186m558k3595j4552j4553m0266o6917o5251p6673j03800j15221r9278
$$ 4131221 4156407 4181593 4177035 4153440 4138888 4124335 4084069 4017152 3951901 3875228 3771428 3656207 3556929
-25150C556929r9279j14150j33187j38422j57458j84347j84346j40088j05822r9595r9594
$$ 3556929 3457650 3343500 3210313 3071891 2914433 2730086 2545740 2405652 2299830 2200235 2100641
-25139B100641p4610m7958k7733K9376J22178K09744K48888K67924K85533K74111K20333J78454
$$ 2100641 2026031 1978073 1950340 1979716 2101894 2311638 2560526 2828450 3113983 3388094 3608427 3786881
-25127C786881J71315J59893J23829Q9563Q1473Q1473M6494M6494P3144P3145M6375M6374
$$ 3786881 3958196 4118089 4241918 4331481 4412954 4494427 4540921 4587415 4660559 4733704 4780079 4826453
-25115D826453N7797N7797K2103K2104M8754M8755J3674J3675M7226M7226K3431J2010M4609
$$ 4826453 4884250 4942047 4964150 4986254 5035008 5083763 5097437 5111112 5158338 5205564 5228995 5241005 5285614
-25102E285614P1259O2574N1153Q4942J11592R3033P3995R8268J09689P7639O6218J01911
$$ 5285614 5356873 5419447 5470600 5555542 5667134 5760167 5834162 5932430 6042119 6119758 6185976 6287887
-25090F287887J36176J11905Q5254J14047J40697J25111J25111J79841K14106J91738J91738
$$ 6287887 6424063 6535968 6621222 6735269 6875966 7001077 7126188 7306029 7520135 7711873 7903611
-25079G903611K38615K57651K12592J85942K32343K66608K43526K43527L12057L76780L73567
$$ 7903611 8142226 8399877 8612469 8798411 9030754 9297362 9540888 9784415 10096472 10473252 10846819
-25068A0846819L73569M51378N00873M70177M51140N06822N56316N15626M73746M84692M50426
$$ 10846819 11220388 11671766 12172639 12642816 13093956 13600778 14157094 14672720 15146466 15631158 16081584
-25057A6081584K95281J62027J71783K36508K24965K24968L12770M15566M21515M32937N37163
$$ 16081584 16376865 16538892 16710675 16947183 17172148 17397116 17709886 18125452 18546967 18979904 19517067
-25046A9517067O39956O22701N96049O77668P80465P80225P80226R22761J086470J134776
$$ 19517067 20157023 20779724 21375773 22053441 22833906 23614131 24394357 25317118 26403588 27538364
-25036B7538364J191886J412704J652565J763448J896702K215560K584861K825092L133478
$$ 27538364 28730250 30142954 31795519 33558967 35455669 37671229 40256090 43081182 46214660
-25027D6214660L731218M427940M955723N469698O253526P231979Q265176R723351J2091465
$$ 46214660 49945878 54373818 59329541 64799239 71052765 78284744 86549920 96273271 108364736
-25018A08364736J5361886J9419950K4875721L2564931M2642759N5050755P0641387R0095516
$$ 108364736 123726622 143146572 168022293 200587224 243229983 298280738 368922125 459017641
-25010D59017641J10993567J26501894J27617395J07160073O3776490M932940n3801571r5782161
$$ 459017641 570011208 696513102 824130497 931290570 995067060 1000000000 946198429 850416268
-25002H50416268j13192672j10615189r8633758q4911116p1764563n9641515m9426660m1404778
$$ 850416268 737223596 626608407 527974649 443063533 371298970 311657455 262230795 220826017
-24994B20826017l4555538k8064167k2379957j8059667j4735945j1898832r694434q389497
$$ 220826017 186270479 158206312 135826355 117766688 103030743 91131911 81437477 73047980
-24986G3047980p616628o884683o210798n738703n239950m470734l644559l057769k627550
$$ 73047980 65431352 58546669 52335871 46597168 41357218 36886484 33241925 30184156 27556606
-24977B7556606k164017j764253j583887j481094j267645j050634r82103r47839q13632o65149
$$ 27556606 25392589 23628336 22044449 20563355 19295710 18245076 17262973 16315134 15501502 14836353
-24967A4836353o48493o67529n76214m58191m55810m82461m11314l23745l46590l88470l36714
$$ 14836353 14187860 13520331 12944117 12485926 12030116 11547655 11136341 10812596 10466006 10077536 9740822
-24956I740822k64378k71992l06256k55573j75621j88470k22735j80246j23137j53119k02613
$$ 9740822 9476444 9204452 8898196 8642623 8467002 8278532 8055797 7875551 7752414 7599295 7396682
-24945G396682j69776j20282j40270j74534j44137r4642j20341j54606j18200n3476o1091
$$ 7396682 7226906 7106624 6966354 6791820 6647683 6553041 6432700 6278094 6159894 6106418 6045327
-24934F045327j10584j00859n1365n4220q0870o8735m2084o6832j08711q7950m6070o5106
$$ 6045327 5934743 5833884 5782519 5728299 5647429 5578694 5536610 5469778 5361067 5273117 5227047 5161941
-24922E161941j06986r5564n3685n0829o2251k4836L2273L8935M669J0857K9893J0381k3885
$$ 5161941 5054955 4959391 4905706 4854877 4792626 4767790 4800063 4838998 4843667 4854524 4884417 4894798 4870913
-24909D870913k1742j0322l9352p3616n7912k3646l8876o5526m8528o648p600k6635j0217
$$ 4870913 4849171 4838849 4799497 4725881 4667969 4644323 4605447 4539921 4491393 4484745 4477145 4450510 4440293
-24896D440293K4048J9765o886j0693Q343j5928n0193l9248J0247L2377L2376O5014J06893
$$ 4440293 4464341 4484106 4477220 4466527 4474870 4458942 4408749 4369501 4379748 4412125 4444501 4509515 4616408
-24883D616408J25691J44728J98980K56090K61800K27535K04098J77445J13199K5632j4820
$$ 4616408 4742099 4886827 5085807 5341897 5603697 5831232 6035330 6212775 6325974 6351606 6336786
-24872F336786k6242n5509q9776r9903r9903j40593j97702k08886j82234j73193j84615j75572
$$ 6336786 6310544 6255035 6165259 6065356 5965453 5824860 5627158 5418272 5236038 5062845 4878230 4702658
-24860D702658j41306j26554j37976j28934j02282r0861j02283q6600n9949m7338m7338m1151
$$ 4702658 4561352 4434798 4296822 4167888 4065606 3974745 3872462 3785862 3725913 3678575 3631237 3590086
-24848C590086j4500N963N964K4881M3917K7023p243j2002P035J3221J800J1585L0622K2769
$$ 3590086 3575586 3581549 3587513 3612394 3656311 3683334 3676091 3664089 3671124 3684345 3686145 3697730 3728352 3751121
-24834C751121l882j978j978j4589k6012j6731R920J0396j6256j7920J115o023l2674l0674
$$ 3751121 3747239 3745261 3743283 3728694 3702682 3685951 3695871 3706267 3690011 3672091 3673206 3667183 3634509 3603835
-24820C603835m023N496n927m975O447K61j8776j7706Q946K0367o283j6040K997P280j9371
$$ 3603835 3599812 3605308 3599381 3594406 3600853 3601114 3582338 3564632 3573578 3593945 3587662 3571622 3574619 3581899 3562528
-24805C562528k6747r7J7036N614l190Q232J8939P518j405j406o402j7824j4731l309r496
$$ 3562528 3535781 3535684 3552720 3558334 3555144 3563376 3582315 3589833 3588428 3587022 3580620 3562796 3548065 3544756 3535260
-24790C535260k8532k6119N32J0525q96j610R812R812j610K435J3857P195j1842j1366P670
$$ 3535260 3506728 3480609 3481141 3491666 3490770 3489160 3498972 3508784 3507174 3509609 3523466 3530661 3518819 3507453 3515123
-24775C515123L387q034k071J6965K4104J2682J1017K2438K6721P686m808O615O138n283j2422
$$ 3515123 3518510 3510476 3508405 3525370 3549474 3562156 3573173 3595611 3622332 3630018 3625210 3631825 3637963 3632680 3620258
-24760C620258j000q139k7175l7147k5725j4303j4303j6445j6445j5255j5255r187R849N566
$$ 3620258 3619258 3611119 3583944 3546797 3521072 3506769 3492466 3476021 3459576 3444321 3429066 3419879 3429728 3435294
-24746C435294n856k287k286o332l2983l9689k8268j6133j6132j3039N996J3137J713p060
$$ 3435294 3429438 3427151 3424865 3418533 3385550 3345861 3317593 3301460 3285328 3272289 3278285 3291422 3293135 3286075
-24732C286075p061L648L647l491l491k778k777K23J1645O410O410J4262L3298K7350O99l614
$$ 3286075 3279014 3282662 3286309 3282818 3279327 3276549 3273772 3273995 3285640 3292050 3298460 3312722 3346020 3373370 3374069 3370455
-24716C370455J5423K0895R473M477M477J0187j235J19J19n95n94p258p258q32j2255r756
$$ 3370455 3385878 3406773 3416246 3420723 3425200 3435387 3434152 3434271 3434390 3433795 3433201 3425943 3418685 3417853 3405598 3395842
-24700C395842r756j7133l6169l7358j0708J3801K380o377o376p091p090j2325j2325j6609
$$ 3395842 3386086 3368953 3332784 3295426 3284718 3298519 3300899 3294522 3288146 3281055 3273965 3261640 3249315 3232706
-24686C232706k8030k9220j7798n186n187m949O473J2184J2184J2452K3873J7449J7449J2213
$$ 3232706 3204676 3175456 3157658 3152472 3147285 3142336 3148809 3160993 3173177 3185629 3209502 3226951 3244400 3256613
-24672C256613J2214J506J506M242J5664R239r797o941M480k183k1218k4937J714J5991l045
$$ 3256613 3268827 3270333 3271839 3276081 3291745 3300984 3291187 3284246 3288726 3286543 3265325 3240388 3242102 3258093 3255048
-24657C255048j7560o139J2898J2898L647L648M123j4913j4199M837J5783l253k3561j2140
$$ 3255048 3237488 3231349 3244247 3257145 3260792 3264440 3268563 3253650 3239451 3244288 3260071 3256818 3233257 3221117
-24643C221117O897O897M280M279J0704p17j2080j2080O242O243K94K94K93K94J327J328J327
$$ 3221117 3228014 3234911 3239191 3243470 3254174 3253457 3241377 3229297 3235539 3241782 3242076 3242370 3242663 3242957 3244284 3245612 3246939
-24626C246939J327j00j01j00j00q875q875p685p685k688J6348J6348k688j6586j6586o355
$$ 3246939 3248266 3248166 3248065 3247965 3247865 3238990 3230115 3222430 3214745 3212057 3228405 3244753 3242065 3225479 3208893 3202538
-24610C202538o354o830o830M592M592L640L640J0778o43k309R113Q399l023j1938j1939O384
$$ 3202538 3196184 3189354 3182524 3187116 3191708 3195348 3198988 3209766 3209123 3206814 3215927 3224326 3221303 3209365 3197426 3203810
-24594C203810O384k79k79k79k78j0660j0660Q377Q377j856j855j2563j2563n722N700J0696
$$ 3203810 3210194 3209915 3209636 3209357 3209079 3198419 3187759 3196136 3204513 3202657 3200802 3188239 3175676 3169954 3175654 3186350
-24578C186350J0697K844K845K844K844p715p715p001p001o763M659N372o049p562L859J1355
$$ 3186350 3197047 3199891 3202736 3205580 3208424 3200709 3192994 3185993 3178992 3172229 3176888 3182260 3176211 3168649 3172508 3183863
-24562C183863N644K90K90P071m350m350P072J4567Q856m468m470q99o611j2768j346m201
$$ 3183863 3189507 3189797 3190087 3197158 3192808 3188458 3195530 3210097 3218953 3214485 3210015 3209116 3202505 3189737 3188391 3184190
-24546C184190r912n748N673O507m915m975J4062K0486R065j5445j5445K878K878L848L848
$$ 3184190 3174278 3168530 3174203 3180710 3175795 3170820 3184882 3205368 3214433 3198988 3183543 3186421 3189299 3193147 3196995
-24531C196995m35j1857j0667P55J1820L97q287k577Q845L135j0667P54J3010J3009o056o057
$$ 3196995 3196560 3184703 3174036 3174791 3186611 3187008 3178721 3176144 3184989 3188124 3177457 3178211 3191221 3204230 3198174 3192117
-24515C192117N365N365J30J30J31J30N76N76R33R34m659J052M979o444j7627o205Q904L194
$$ 3192117 3197482 3202847 3202977 3203107 3203238 3203368 3203944 3204520 3205453 3206387 3201728 3202780 3207759 3201315 3183688 3177483 3186387 3189581
-24497C189581q585q585K480K480j357j357o43o43j120J0303K1367R946p142j2853j3210p499
$$ 3189581 3180996 3172411 3174891 3177371 3176014 3174657 3174014 3173371 3172251 3182554 3203921 3213867 3206725 3193872 3180662 3173163
-24481C173163k622L090P016m406j4757r046K852Q562L566L566L922L923m332m331m332m331
$$ 3173163 3170541 3173631 3180647 3176241 3161484 3152438 3155290 3163852 3167418 3170984 3174906 3178829 3174497 3170166 3165834 3161503
-24465C161503O138O139J855r566j2541j119m332j0042m689O734P090m332k130R291J9999
$$ 3161503 3167641 3173780 3175635 3166069 3153528 3152409 3148077 3138035 3133346 3140080 3147170 3142838 3140708 3149999 3169998
-24450C169998Q578j2600j2601j892j893J142J141J2563J2563J0898J0897J0898J0897M284
$$ 3169998 3178576 3165976 3153375 3151483 3149590 3150732 3151873 3164436 3176999 3187897 3198794 3209692 3220589 3224873
-24436C224873M283p139p139j0707j0708Q328Q329q448q447K974K975q686q685K736K737j517
$$ 3224873 3229156 3222017 3214878 3204171 3193463 3201791 3210120 3201672 3193225 3196199 3199174 3190488 3181803 3184539 3187276 3185759
-24420C185759j517j517j517N860N859N860N860n265n265n265n264J160J160J160J160k0605
$$ 3185759 3184242 3182725 3181208 3187068 3192927 3198787 3204647 3199382 3194117 3188852 3183588 3184748 3185908 3187068 3188228 3167623
-24404C167623k0606O046O045q55q55J8181J8181r659r659J762J762L190L190L190L190P072
$$ 3167623 3147017 3153063 3159108 3158253 3157398 3175579 3193760 3184101 3174442 3176204 3177966 3181156 3184346 3187536 3190726 3197798
-24388C197798P072P071P072p919p920L502L503p81p81p80p81K788K789K788K789O213O213
$$ 3197798 3204870 3211941 3219013 3211094 3203174 3206676 3210179 3209398 3208617 3207837 3207056 3209844 3212633 3215421 3218210 3224423 3230636
-24371C230636O212O213L357L358L357L358m377m376m376m376l424l424P997P997J008J008
$$ 3230636 3236848 3243061 3246418 3249776 3253133 3256491 3252114 3247738 3243362 3238986 3235562 3232138 3240135 3248132 3249140 3250148
-24355C250148J2429J2430M576M577M577M577K435K436J3857J3857J483J484J483J483K971
$$ 3250148 3262577 3275007 3279583 3284160 3288737 3293314 3295749 3298185 3312042 3325899 3327382 3328866 3330349 3331832 3334803
-24340C334803K971J4393J4392J3916J3917K5338K5338M8658M8658M8657M8658N7462N7462
$$ 3334803 3337774 3352167 3366559 3380475 3394392 3419730 3445068 3493726 3542384 3591041 3639699 3697161 3754623
-24327C754623J02197J02197J08266J53952K17723K93868L75725M82327N94641O70786O74712
$$ 3754623 3856820 3959017 4067283 4221235 4438958 4732826 5108551 5590878 6185519 6856305 7531017
-24316G531017N68109L53000L3191k88522n16957o11186n88343n26646m58115l75308l06777
$$ 7531017 8099126 8452126 8485317 8196795 7679838 7068652 6480309 5953663 5495548 5120240 4813463
-24305D813463k56332k18259j75427j37354j17724r4880p1085p1085o4422o4422l7771l7772
$$ 4813463 4557131 4338872 4163445 4026091 3908367 3813487 3742402 3671317 3606895 3542473 3504702 3466930
-24293C466930l4841l4842j5805j5805l3652l3652k0564K279m978j6401j4972l551m57m57
$$ 3466930 3432089 3397247 3381442 3365637 3331985 3298333 3277769 3280048 3275070 3258669 3243697 3240146 3239689 3239232
-24279C239232K56K57n930n931n930n930k123k123j3545j3545j4794j4794J9472J9471O860
$$ 3239232 3239488 3239745 3233815 3227884 3221954 3216024 3213901 3211778 3198233 3184688 3169894 3155100 3174572 3194043 3200903
-24264C200903O859O860O860M435M436j4600j4602j4600j4601M436M436M911M912M911M912
$$ 3200903 3207762 3214622 3221482 3225917 3230353 3215753 3201151 3186551 3171950 3176386 3180822 3185733 3190645 3195556 3200468
-24249C200468m607m607J4430J4430K361K360K361K361l112l112l112l111J349J350J349J350
$$ 3200468 3195861 3191254 3205684 3220114 3222475 3224835 3227196 3229557 3226445 3223333 3220221 3217110 3218459 3219809 3221158 3222508
-24233C222508j3641j3642k220k219n492n491n492n491k636k636Q785Q786M384M383M383M384
$$ 3222508 3208867 3195225 3193005 3190786 3185294 3179803 3174311 3168820 3166184 3163548 3172333 3181119 3185503 3189886 3194269 3198653
-24217C198653j8698j8698L39L38O038O038n384n383Q179Q180J9602J9601l599l599l599l599
$$ 3198653 3179955 3161257 3161596 3161934 3167972 3174010 3168626 3163243 3171422 3179602 3199204 3218805 3215206 3211607 3208008 3204409
-24201C204409n027n027n027n026j1258j1259J64J64Q016Q016Q016Q016q522q522q521q522
$$ 3204409 3199382 3194355 3189328 3184302 3173044 3161785 3161949 3162113 3170129 3178145 3186161 3194177 3185655 3177133 3168612 3160090
-24185C160090m952m953J3370J3370J0139j283j996R425J0853n69j1753j1752m495O926J1924
$$ 3160090 3155138 3150185 3163555 3176925 3187064 3185781 3183785 3193210 3204063 3203494 3191741 3179989 3175494 3182420 3194344
-24170C194344J1924m50m50m50m50j4980j4980J31N840J915r507r864J558O317n105j178M532
$$ 3194344 3206268 3205818 3205368 3204918 3204468 3189488 3174508 3174639 3180479 3182394 3172887 3163023 3164581 3170898 3165793 3164615 3169147
-24153C169147N365N365N722N722p84p85j141j142q399j4109o258N164n46o258k331k331Q81
$$ 3169147 3174512 3179877 3185599 3191321 3190537 3189752 3188611 3187469 3179070 3164961 3158703 3163867 3163321 3157063 3154732 3152401 3153282
-24136C153282Q81Q82Q81j030j030j030j030N633N633N633N632K064K063K064K063K064K063
$$ 3153282 3154163 3155045 3155926 3154896 3153866 3152836 3151806 3157439 3163072 3168705 3174337 3176401 3178464 3180528 3182591 3184655 3186718
-24119C186718K064K063l75l76l75l76l75l76l75l76Q132Q131Q131Q131P418P417J3486K063
$$ 3186718 3188782 3190845 3190470 3190094 3189719 3189343 3188968 3188592 3188217 3187841 3195973 3204104 3212235 3220366 3227784 3235201 3248687 3250750
-24101C250750r113j4823j3040j3039j6727k8149k8149j6728l342l343j914j915J416J2839
$$ 3250750 3241637 3226814 3213774 3200735 3184008 3155859 3127710 3110982 3107640 3104297 3102383 3100468 3101884 3114723
-24087C114723J7835J7835O767O767O053O053p630j9051j5839j0127p749p748M030M031M61
$$ 3114723 3132558 3150393 3157160 3163927 3169980 3176033 3168403 3149352 3133513 3123386 3115637 3107889 3111919 3115950 3116411
-24072C116411M61M61M61J799J800J799J800M655M655M655M655L465L465L108L109p957j3668
$$ 3116411 3116872 3117333 3117794 3119593 3121393 3123192 3124992 3129647 3134302 3138957 3143612 3147077 3150542 3153650 3156759 3148802 3135134
-24055C135134o171N249N626n797n082O339J1098J1099L90L90k524k525k524k525J521J521
$$ 3135134 3128963 3134212 3139838 3134041 3128959 3135298 3146396 3157495 3157885 3158275 3155751 3153226 3150702 3148177 3149698 3151219
-24039C151219J520J521j275j276j275j275n62n61n61n62m071m071P350P351R492R492R492
$$ 3151219 3152739 3154260 3152985 3151709 3150434 3149159 3148597 3148036 3147475 3146913 3142842 3138771 3146121 3153472 3162964 3172456 3181948
-24022C181948R492l245l246l246l246l008l008Q414Q414J989J989J275J276k889j4311j1455
$$ 3181948 3191440 3188195 3184949 3181703 3178457 3175449 3172441 3180855 3189269 3191258 3193247 3194522 3195798 3192909 3178598 3167143
-24006C167143n744q459j4169n603N818P247P246M034R745Q258l164l09N403Q020l403j1254
$$ 3167143 3161399 3152940 3138771 3133168 3138986 3146233 3153479 3157513 3167258 3175516 3172352 3172043 3177446 3185466 3182063 3170809
-23990C170809n544m179m179l822l822m536m536l822l822j324J0098L674L673M387M388M030
$$ 3170809 3165265 3161086 3156907 3153085 3149263 3144727 3140191 3136369 3132547 3131223 3141321 3144995 3148668 3153055 3157443 3161473
-23974C161473M030n421j1131j4344k923Q381Q380R094R094j791j793k149k149j3927j9639
$$ 3161473 3165503 3160082 3148951 3134607 3131684 3140065 3148445 3157539 3166633 3164842 3163049 3160900 3158751 3144824 3125185
-23959C125185q455J0582J5136R425K405K406q07q06q07q07m257m257m258m257Q474Q473M547
$$ 3125185 3116730 3127312 3142448 3151873 3154278 3156684 3155877 3155071 3154264 3153457 3149200 3144943 3140685 3136428 3144902 3153375 3157922
-23942C157922J0258J157j0266r908J513P462P462l246l246J752J751J751J751M607M606L893
$$ 3157922 3168180 3169337 3159071 3149163 3150676 3158138 3165600 3162354 3159108 3160860 3162611 3164362 3166113 3170720 3175326 3179219
-23926C179219L893j2147k3569j7143J892R983j439n246n246Q139Q139j0184j0184j141J0280
$$ 3179219 3183112 3170965 3147396 3130253 3132145 3142128 3140689 3135443 3130197 3138336 3146475 3136291 3126107 3124966 3135246
-23911C135246L856L855k212k212R209R210R210R209k212k213l282l284l283l282l997l997
$$ 3135246 3139102 3142957 3140745 3138533 3147742 3156952 3166162 3175371 3173159 3170946 3167664 3164380 3161097 3157815 3153818 3149821
-23895C149821l997l997R277R276Q563Q562O421n001P10P11o607j8029j7315n893N529J6950
$$ 3149821 3145824 3141827 3151104 3160380 3168943 3177505 3183926 3178925 3179635 3180346 3173739 3155710 3138395 3132502 3138031 3154981
-23879C154981J7665O242n699n700o414o413j4267j4265r270K153J082J082O079J7501K0832
$$ 3154981 3172646 3178888 3173189 3167489 3161075 3154662 3140395 3126130 3116860 3119013 3120095 3121177 3127256 3144757 3165589
-23864C165589R410k487k488p265p265J0582J0581M157j4879j0597Q26J1176J1177o433o432
$$ 3165589 3174999 3172512 3170024 3162759 3155494 3166076 3176657 3180814 3165935 3155338 3156164 3167340 3178517 3172084 3165652
-23849C165652n718N703J0700J0701Q499Q500Q499Q500K312K313r585k1007j7081n658O239
$$ 3165652 3159934 3165637 3176337 3187038 3195537 3204037 3212536 3221036 3223348 3225661 3216076 3195069 3177988 3172330 3178569
-23834C178569O238Q619Q618j0418j0418n915n916n201n202m249P172P172m250n201n202N506
$$ 3178569 3184807 3193426 3202044 3191626 3181208 3175293 3169377 3164176 3158974 3154725 3161897 3169069 3164819 3159618 3154416 3159922
-23818C159922N507r18r19r18r18k35k34k34k34k34k35k34k34n708n707n707n707l566l565
$$ 3159922 3165429 3164511 3163592 3162674 3161756 3161521 3161287 3161053 3160819 3160585 3160350 3160116 3159882 3154174 3148467 3142760 3137053 3133487 3129922
-23799C129922P142P143N46j0875q020k309n164j0875k666Q756O317O06M532M532N246N247
$$ 3129922 3137064 3144207 3144753 3133878 3125858 3123549 3118385 3107510 3104844 3113600 3119917 3120523 3125055 3129587 3134833 3140080
-23783C140080J320P030L112q310m740R70j00j01K57K57n098n097n098n097J565J565J566
$$ 3140080 3141400 3148430 3151542 3143232 3138492 3139462 3139362 3139261 3139518 3139775 3134677 3129580 3124482 3119385 3120950 3122515 3124081
-23766C124081J565M220M220M220M220j491j491K792J4215O420n000j789L923M72j0949j0593
$$ 3124081 3125646 3129866 3134086 3138306 3142526 3141035 3139544 3142336 3156551 3162971 3157971 3156182 3160105 3160577 3149628 3139035
-23750C139035Q29J2377J2377J670J669m755m756j5463j5463n588N834J0830J0831k257k257
$$ 3139035 3139864 3152241 3164618 3166288 3167957 3163202 3158446 3142983 3127520 3121932 3127766 3138596 3149427 3147170 3144913
-23735C144913k257k257j717j718j718j718J138J138P81P80M291j420n347O075J2143P22l562
$$ 3144913 3142656 3140399 3138682 3136964 3135246 3133528 3134666 3135804 3136585 3137365 3141656 3140236 3134889 3140964 3153107 3153829 3150267
-23718C150267l562j197j197j198j197J4032J4032J420j0001r585r585M811J0522J955r466
$$ 3150267 3146705 3145508 3144311 3143113 3141916 3155948 3169980 3171400 3161399 3151814 3142229 3147040 3157562 3159517 3150051
-23703C150051j7318j1608k019k019j662j661K383K383K383K383Q452Q451Q450Q451k018k019
$$ 3150051 3132733 3121125 3119106 3117087 3115425 3113764 3116147 3118530 3120913 3123296 3131748 3140199 3148649 3157100 3155082 3153063
-23687C153063k019k019K041K041K042K041N610N611n812n811O14O13O14O13j4377j4378k956
$$ 3153063 3151044 3149025 3151066 3153107 3155149 3157190 3162800 3168411 3162599 3156788 3157402 3158015 3158629 3159242 3144865 3130487 3127531
-23670C127531k956m632m633QJ1429J1072N361Q574Q574J733r690j0403J019N064o358o001
$$ 3127531 3124575 3119943 3115310 3115318 3126747 3137819 3143180 3151754 3160328 3162061 3152371 3141968 3142987 3148051 3141693 3135692
-23654C135692N421J0849N138k357k357L711L710L711L710n72n73n72n73j286j287j286j287
$$ 3135692 3141113 3151962 3157100 3154743 3152386 3156097 3159807 3163518 3167228 3166656 3166083 3165511 3164938 3163652 3162365 3161079 3159792
-23637C159792N432N432n632n633K338Q050J1262j60j0451j0452K57K56K399K398K398K398
$$ 3159792 3165224 3170656 3165024 3159391 3161729 3169779 3181041 3180881 3170430 3159978 3160235 3160491 3162890 3165288 3167686 3170084
-23621C170084m443m443m443m443L16L16m1m1l253q964j2534j111L885j826m681O741Q801
$$ 3170084 3165641 3161198 3156755 3152312 3152628 3152944 3152903 3152862 3149609 3140645 3128111 3127000 3130885 3129059 3124378 3131119 3139920
-23604C139920L089m405m406Q324Q325Q325Q324j312j313j312j313l692l692P730P730N231
$$ 3139920 3143009 3138604 3134198 3142522 3150847 3159172 3167496 3166184 3164871 3163559 3162246 3158554 3154862 3162592 3170322 3175553
-23588C175553N231N92j0831j5233r522j193J0228J0466M756P967P968j788j3210j0355m644
$$ 3175553 3180784 3181376 3170545 3155312 3145790 3144597 3154825 3165291 3170047 3178014 3185982 3184194 3170984 3160629 3155985
-23573C155985o146j1856m005P418R202k220j863R559Q905L194m302m302J409J410k518L194
$$ 3155985 3149839 3137983 3133978 3141396 3150598 3148378 3146515 3156074 3164979 3168173 3163871 3159569 3160978 3162388 3159870 3163064
-23557C163064Q459k964p603p603m748m748m748m748R113R113N187J0897R827j595j3850j3849
$$ 3163064 3171523 3168559 3160956 3153353 3148605 3143857 3139109 3134361 3143474 3152587 3157774 3168671 3178498 3176903 3163053 3149204
-23541C149204m336m335j8374j2664J495J1013J1369J852o120o120o715o714L755L755L755
$$ 3149204 3144868 3140533 3122159 3109495 3110990 3122003 3133372 3135224 3129104 3122984 3116269 3109555 3113310 3117065 3120820
-23526C120820L755P22P21P21P22R287R288R287R288K506K506J673J673K982j0344k1289k1289
$$ 3120820 3124575 3125297 3126018 3126739 3127461 3136748 3146036 3155323 3164611 3167117 3169623 3171296 3172969 3175951 3165607 3144318 3123029
-23509C123029r265K52P987J7504J9051R533l554l555J205J205j0218j0217k23k23k23k23
$$ 3123029 3113764 3114016 3122003 3139507 3158558 3168091 3164537 3160982 3162187 3163392 3153174 3142957 3142734 3142511 3142288 3142065
-23493C142065l346l346l347l346L317L316L317L316q48q47q48q48Q433Q432P838P837Q548
$$ 3142065 3138719 3135373 3132026 3128680 3131997 3135313 3138630 3141946 3141098 3140251 3139403 3138555 3146988 3155420 3163258 3171095 3179643
-23476C179643r70j4058j4058p157K361Q428Q429l350l350l350l350L194L194o13N097R931
$$ 3179643 3178673 3164615 3150557 3143400 3145761 3154189 3162618 3159268 3155918 3152568 3149218 3152412 3155606 3154993 3160090 3170021
-23460C170021M13j2318j2318p321K197P671P670M220n298l514K198N885J75p678p677r19
$$ 3170021 3170434 3158116 3145798 3138477 3140674 3148345 3156015 3160235 3154937 3151423 3153621 3159506 3159681 3152003 3144326 3143407
-23444C143407r18l24l23L484J3001J3002L484m963m964n558n559M198M198L602L603J179
$$ 3143407 3142489 3142165 3141842 3145326 3158327 3171329 3174813 3169850 3164886 3159328 3153769 3157967 3162165 3165767 3169370 3170549
-23428C170549q340j7025j1314J774J1292R507L796l700l699m057m056L796L796L796L796
$$ 3170549 3162209 3145184 3133870 3135644 3146936 3156443 3160239 3156539 3152840 3148783 3144727 3148523 3152319 3156115 3159911
-23413C159911K347K346r076r076K822K822K822K822Q236Q235m019j5441q303k591J692P402
$$ 3159911 3162258 3164604 3155528 3146452 3149274 3152096 3154918 3157740 3165976 3174211 3170192 3154751 3146448 3143857 3145549 3152951
-23397C152951O897O897m168m168j074j075j074j075l930l930P135P135k502q213p18J0704
$$ 3152951 3159848 3166745 3162577 3158409 3157335 3156260 3155186 3154111 3150181 3146251 3153386 3160521 3158019 3149806 3149088 3159792
-23381C159792J5679M257o807M614J5679R968n142n142o987o986o986o986J104J105J104J104
$$ 3159792 3175471 3179728 3172921 3177535 3193214 3203182 3198040 3192898 3185911 3178925 3171939 3164953 3166057 3167162 3168266 3169370
-23365C169370J0132J0131q904q905k242k242k242k242M123M124j0987j6698k896Q525N313
$$ 3169370 3179502 3189633 3180729 3171824 3169582 3167340 3165098 3162856 3166979 3171103 3160116 3143418 3140522 3149047 3154360
-23350C154360l97j476M234M592j119l499P923P566l855j2422j2422j238J0184J0183j238
$$ 3154360 3153963 3152487 3156721 3161313 3160194 3156695 3164618 3172184 3168329 3155907 3143485 3142247 3152431 3162614 3161376
-23335C161376j3135j3136J602J603J602J603O361O362O361O362M458M458o964o964K316K316
$$ 3161376 3148241 3135105 3136707 3138310 3139912 3141515 3147876 3154238 3160599 3166961 3171419 3175877 3168913 3161949 3164265 3166581
-23319C166581K317K316k632k632k633k632r057r057K364K365K008K007K008K008K008K007
$$ 3166581 3168898 3171214 3168582 3165950 3163317 3160685 3151628 3142571 3144935 3147300 3149308 3151315 3153323 3155331 3157339 3159346
-23303C159346K008K008J0589J0588q32q33m878m878m878m878m700m699m700m700J4099J4099
$$ 3159346 3161354 3163362 3173951 3184539 3183707 3182874 3177996 3173118 3168240 3163362 3158662 3153963 3149263 3144563 3158662 3172761
-23287C172761K677K677j0942j0942j0943j0942J670J669m755O666K0587K0587J074j0347
$$ 3172761 3175438 3178115 3167173 3156231 3145288 3134346 3136016 3137685 3132930 3139596 3160183 3180770 3181844 3171497
-23273C171497j1537j1537p254M168J0801J0800R3R3j810j811j2518j2519L960J5381J342
$$ 3171497 3159960 3148423 3141169 3145337 3156138 3166938 3167031 3167124 3165314 3163503 3150985 3138466 3142426 3157807 3159149
-23258C159149j7694r841J580N387N388L093L093p614p615R52J2374J2373R52n056n057n056
$$ 3159149 3141455 3131614 3133194 3138581 3143969 3147062 3150155 3142541 3134926 3135878 3148252 3160625 3161577 3156521 3151464 3146408
-23242C146408n057K082J3504K796q626j5125l703Q194Q195O053O053O053O053M387M387M388
$$ 3146408 3141351 3143433 3156937 3159733 3151107 3135982 3132279 3140473 3148668 3154721 3160774 3166827 3172880 3177267 3181654 3186042
-23226C186042M387n369n369n368n369o979o979M443M443J3486J3485m838m836m005P417P418
$$ 3186042 3190429 3185060 3179691 3174323 3168954 3161975 3154996 3159439 3163882 3177368 3190853 3186015 3181179 3177174 3184591 3192009
-23210C192009m004p336p336L373L372K063K064K063K064n54n54j1262j1262j0429R93N989
$$ 3192009 3188005 3180669 3173333 3176706 3180078 3182141 3184205 3186268 3188332 3187778 3187224 3175962 3164700 3154271 3155264 3161253
-23194C161253N990L610L611L610L610Q07Q07j0615j0615P469P470P469P470L305L305j691
$$ 3161253 3167243 3170853 3174464 3178074 3181684 3182491 3183298 3172683 3162068 3169537 3177007 3184476 3191946 3195251 3198556 3196865
-23178C196865j3114j1448j1447p40p40L424L425L424L424N804N804n618n618K829K830K829
$$ 3196865 3183751 3172303 3160856 3160116 3159376 3162800 3166225 3169649 3173073 3178877 3184681 3179063 3173445 3176274 3179104 3181933
-23162C181933K830Q540Q540k881k882l796l796l796l796n224n224n224n223N543N544n165
$$ 3181933 3184763 3193303 3201843 3198962 3196080 3192284 3188488 3184692 3180896 3175672 3170448 3165224 3160001 3165544 3171088 3165923
-23146C165923n164N47J1968R03j0518q480k770n983n982P224J8646P938l484m019P402L477
$$ 3165923 3160759 3161306 3173274 3174177 3163659 3155179 3152409 3146426 3140444 3147668 3166314 3174252 3170768 3166749 3174151 3177628
-23130C177628k235o042o041k473q183j487R934R935j488k320L391O247n176o841j130O365
$$ 3177628 3175393 3169351 3163310 3160837 3152654 3151167 3161101 3171036 3169548 3167228 3170619 3176866 3171690 3164849 3163719 3170084
-23114C170084O365K98K97K98K97m387m387m031m030J34N844j651j3072j3905k484J3102J8814
$$ 3170084 3176449 3176747 3177044 3177342 3177639 3173252 3168865 3164834 3160804 3160938 3166782 3165131 3152059 3138154 3135670 3148772 3167586
-23097C167586J4886L465q789q789o17o18o17o17n376n376n377n376R377R377M736o685n614
$$ 3167586 3182472 3185937 3177148 3168359 3167742 3167124 3166507 3165890 3160514 3155138 3149761 3144385 3153762 3163139 3167875 3161190 3155576
-23080C155576R7l116l115K45J1667J1667K46l086l086l800l800J554J554J554J555j3437
$$ 3155576 3155673 3152557 3149442 3149687 3161354 3173021 3173267 3170181 3167095 3163295 3159495 3161049 3162603 3164157 3165712 3152275
-23064C152275j3437k015k016L499L499L498L499P782P782l640l640Q81Q81Q81Q82J67J67
$$ 3152275 3138838 3136823 3134807 3138306 3141805 3145303 3148802 3156584 3164366 3160726 3157086 3157967 3158848 3159729 3160611 3160778 3160945
-23047C160945J67J68j60j60j60j60q74q73n17n17N670J1381L885p536j4318k897Q407Q406
$$ 3160945 3161112 3161280 3161120 3160960 3160800 3160640 3159766 3158893 3158376 3157859 3163529 3174910 3178795 3171259 3156941 3154044 3162451 3170857
-23029C170857k059j1578j1578k060J747J748K342K343M246M245M246M246K01K01K01K00p264
$$ 3170857 3168798 3157220 3145642 3143582 3145329 3147077 3149419 3151762 3156008 3160253 3164499 3168745 3168946 3169147 3169348 3169548 3162284
-23012C162284p265j198Q321J4508J4508J420q098m469m469j2441j8151j3630l05J0879J0879
$$ 3162284 3155019 3153821 3162142 3176650 3191158 3192578 3184480 3180011 3175542 3163101 3144950 3131320 3131015 3141894 3152773
-22997C152773L153L153L153L152J0887J0886N176m343o187m76P139P138J309J309j0113j0113
$$ 3152773 3155926 3159079 3162232 3165384 3176271 3187157 3192333 3187990 3181803 3181327 3188466 3195604 3196913 3198222 3188109 3177996
-22981C177996r965r964N265J0976N264m253r965r964J934J933J933J934n324n324P525J7043
$$ 3177996 3168031 3158067 3163332 3174308 3179572 3175319 3165354 3155390 3157324 3159257 3161190 3163124 3157800 3152476 3160001 3177044
-22965C177044J2110j216j5374r663K829K829r663j9181j5731k405Q540Q540l83l83K12K12
$$ 3177044 3189154 3187938 3172564 3162901 3165730 3168559 3158896 3139715 3123984 3121579 3130119 3138659 3138276 3137893 3138105 3138317
-22949C138317J1500K1018J2095j231q726l016M362M361L647L648j60N551J0191O73r083j4794
$$ 3138317 3149817 3170835 3182930 3181699 3172973 3169957 3174319 3178680 3182327 3185975 3185815 3191366 3201557 3202230 3193147 3178353
-22933C178353p875k164n138n135M54R972J0328Q14R30O640K833K837j569j569r74r70Q40
$$ 3178353 3170478 3168314 3163176 3158041 3158495 3168467 3178795 3179609 3180539 3187179 3190012 3192849 3191280 3189711 3188737 3187767 3188607
-22916C188607J0358J0716J201p250j540O075O080o299o298o298o295n347n346N718N722N91
$$ 3188607 3198965 3209681 3210882 3203632 3202092 3208167 3214247 3207948 3201650 3195352 3189057 3183710 3178364 3184082 3189804 3190395
-22900C190395n119p262K261J3441J3440K614K618q37q37j2258j2255J662J663N469k38j848
$$ 3190395 3185276 3178014 3180275 3193716 3207156 3209770 3212388 3211551 3210714 3198456 3186201 3187863 3189526 3194995 3194757 3192909
-22884C192909P670R812l510j1009n298K078K082P70P70J2191J2195n893n893n893n890o220
$$ 3192909 3200579 3210391 3206881 3195872 3190574 3192652 3194734 3195504 3196274 3208465 3220660 3214767 3208874 3202981 3197091 3190871
-22868C190871o220o220o221m792m793O630O629N499N499n923n923m257m257l900l900L580
$$ 3190871 3184651 3178431 3172210 3167418 3162625 3169255 3175884 3181383 3186882 3180959 3175036 3170779 3166522 3162622 3158722 3162302
-22852C162302R292K509j0816j5336r626P030J6549J7679Q162j358p068m212J498J499m213
$$ 3162302 3171594 3174103 3163287 3147951 3138325 3145355 3161904 3179583 3187745 3186387 3179319 3175107 3176605 3178104 3173891
-22837C173891j807L904L35L34j569j569M499J4017J5445J5444K358p161m663m662n257n258
$$ 3173891 3172084 3175988 3176323 3176657 3175088 3173519 3178018 3192035 3207480 3222924 3225282 3218121 3213458 3208796 3203539 3198281
-22821C198281K417K417K417K416j985j986r600j5311l472O045O92O92O521J2232N689p637
$$ 3198281 3200698 3203115 3205532 3207948 3205963 3203977 3194377 3179066 3175594 3181639 3182331 3183023 3189544 3201776 3207465 3199828
-22805C199828q288J235O466O469p8p4p9p4m242m239m242m238m243m238m242m239K896K900
$$ 3199828 3191540 3192775 3199241 3205710 3205632 3205558 3205479 3205405 3201163 3196924 3192682 3188444 3184201 3179963 3175721 3171482 3174378 3177278
-22787C177278K897K900o860o856o027o023j982J1347J8126J2418J231m477r120j4828m246
$$ 3177278 3180175 3183075 3176215 3169359 3163332 3157309 3155327 3166674 3184800 3197218 3198449 3193972 3184852 3170024 3165778
-22772C165778P180P176m242p459j744N748N752K179K183K178K183K892K897K892K896m141
$$ 3165778 3172958 3180134 3175892 3168433 3166689 3172437 3178189 3180368 3182551 3184729 3186912 3189804 3192701 3195593 3198489 3194348
-22756C194348m139m141m139q187q183l547P879J0313M607o581j2288o938M488J628m078k071
$$ 3194348 3190209 3186068 3181929 3173742 3165559 3162012 3169891 3180204 3184811 3178230 3165942 3159004 3163492 3165120 3161042 3158971
-22740C158971R351J6846J1135j67n878o592q81j68n878k309k309Q518Q518Q875Q875P358
$$ 3158971 3168322 3185168 3196303 3196136 3190258 3183666 3182785 3182617 3176739 3174430 3172121 3180639 3189157 3198032 3206907 3214265
-22724C214265J3069K242j6794k0007q585K837K837k220k219R202R202j982j982j981j982
$$ 3214265 3227334 3229576 3212782 3192775 3184190 3187027 3189864 3187644 3185425 3194627 3203829 3201847 3199865 3197884 3195902
-22709C195902j0325j0321J096J101P40P43o755j2463l543P882P879l540K6N741N023o84q779
$$ 3195902 3185577 3175256 3176352 3177453 3178193 3178936 3172181 3159718 3156175 3164057 3171936 3168396 3168422 3174163 3179186 3178502 3169723
-22692C169723q774K286K291P402P406r2n800p411M016Q652Q655n625n622m911m908l528P893
$$ 3169723 3160949 3163235 3165526 3172928 3180334 3180242 3174442 3167031 3171047 3179699 3188354 3182729 3177107 3172196 3167288 3163760 3171653
-22675C171653J6103J0391k576k577k933k934J945J945J944J944n908n908n907n908n090n090
$$ 3171653 3187756 3198147 3195571 3192994 3190061 3187127 3189072 3191017 3192961 3194905 3188997 3183089 3177182 3171274 3166184 3161094
-22659C161094O332O331L952L953L952L952N142N142o279o280m614m614m614m614o808o808
$$ 3161094 3167426 3173757 3177709 3181662 3185614 3189566 3194708 3199850 3193571 3187291 3182677 3178063 3173449 3168835 3162027 3155219
-22643C155219k405q117l476J5560K1985J0562p343j3053J342J2763O697m726q295q295q548
$$ 3155219 3152814 3144697 3141221 3156781 3178766 3189328 3181985 3168932 3170274 3183037 3189734 3185008 3176713 3168418 3159870
-22628C159870K874P872P871P32P33P32P33O621O622J982r440j0987n276K220K219m060m060
$$ 3159870 3162744 3170616 3178487 3179219 3179952 3180684 3181417 3188038 3194660 3196642 3187202 3176215 3170939 3173159 3175378 3171318 3167258
-22611C167258m060m060O529O529P599l822m595J115Q611Q611k573k573k573k572j592j591
$$ 3167258 3163198 3159138 3165667 3172196 3179795 3175973 3171378 3172493 3181104 3189715 3187142 3184569 3181996 3179424 3177832 3176241
-22595C176241j591j591j592j591j235j234m328J383N310o113q968K454P808l614p674j963
$$ 3176241 3174650 3173059 3171467 3169876 3168641 3167407 3163079 3164462 3169772 3163659 3154691 3157145 3164953 3161339 3153665 3151702
-22579C151702N532N533p436p436j725j726K380K380J3087J3087m76j1897q686k974q48q47
$$ 3151702 3157234 3162767 3155331 3147895 3146170 3144444 3146824 3149204 3162291 3175378 3174902 3163005 3154319 3151345 3150497 3149650
-22563C149650m91m91N577N577J1288J1288p629p630L793L792N80N80N80N80n424n425n782
$$ 3149650 3149159 3148668 3154245 3159822 3171110 3182398 3174769 3167139 3170932 3174724 3175304 3175884 3176464 3177044 3171620 3166195 3160413
-22546C160413n781K904k807o377N045L618k093j380M332L618L617L975L975J810J811J810
$$ 3160413 3154632 3157536 3154729 3148352 3153397 3157015 3154922 3153542 3157874 3161492 3165109 3169084 3173059 3174869 3176680 3178490
-22530C178490J811j045j045j401j402K822k889o815M607J0317j104q243k532Q079J3794N938
$$ 3178490 3180301 3179256 3178211 3176810 3175408 3178230 3175341 3168526 3173133 3183450 3182346 3174103 3171571 3179650 3193444 3199382
-22514C199382n480j1790j1786p507L919O235O239m473m469K785K788m711j0417n730N696
$$ 3199382 3193902 3182112 3170326 3162819 3166738 3172973 3179212 3174739 3170270 3173055 3175843 3171132 3160715 3154985 3160681
-22499C160681J0332J0337P120P123l75o083n968N459N811n607p633L792J1285N577r97r96
$$ 3160681 3171013 3181350 3188470 3195593 3195218 3189135 3183167 3188626 3194437 3188830 3181197 3184989 3196274 3201851 3200854 3199858
-22483C199858j354j353r206r205R830R830P332P332m090m089r563r563J859J859M060M060
$$ 3199858 3198504 3197151 3187945 3178740 3188570 3198400 3205732 3213064 3208974 3204885 3195322 3185759 3187618 3189477 3193537 3197597
-22467C197597M060M060k483k484J443m268j3133j710J4590K0300J2091O380K454l257l830
$$ 3197597 3201657 3205717 3203234 3200750 3202193 3197925 3184792 3183082 3197672 3217972 3230063 3236443 3238897 3235640 3231810
-22452C231810P596P235m182q827q823l115l112n198O228J1221J1224l889l885l889l885l220
$$ 3231810 3239406 3246641 3242459 3233632 3224809 3221694 3218582 3213384 3219612 3230833 3242057 3238168 3234283 3230394 3226509 3223289
-22436C223289l216P845P848l933r641j792R633L681k026j316M398P964P968M037p380j0544
$$ 3223289 3220073 3227918 3235766 3231833 3222192 3220400 3230033 3233714 3231688 3230372 3234770 3242734 3250702 3254739 3247359 3236815
-22420C236815Q77N161N160p331p332k692Q730Q135K424O39O40J353J354J710J710j34N577
$$ 3236815 3237692 3242853 3248013 3240682 3233350 3230658 3239388 3247523 3249947 3250586 3251226 3252579 3253933 3255643 3257353 3257219 3262796
-22403C262796Q790k633r771r771M626J0336M090p332j1972j1972j0783j0782O40O39j725
$$ 3262796 3271586 3268953 3259182 3249411 3254037 3264373 3268463 3261131 3249159 3237187 3226404 3215622 3216262 3216901 3215176
-22388C215176j725R696R697o0n9n9o0q090q091l093Q328P377P377l332l331n027n027O395
$$ 3215176 3213451 3223147 3232844 3232784 3232725 3232666 3232606 3224516 3216425 3213332 3221660 3229037 3236414 3233082 3229751 3224724 3219697 3226092
-22370C226092O395l599l599K826q596j9423j9423J4128K5550J1749p287l004Q418O172n250
$$ 3226092 3232487 3228888 3225289 3228115 3219519 3200096 3180673 3194801 3220351 3232100 3224813 3221809 3230227 3236399 3231149
-22355C231149n250O172P599l822K603K602N280o142j1139j1140q997q998l286l287j874j874
$$ 3231149 3225899 3232071 3239670 3235848 3238451 3241053 3246333 3240191 3229052 3217912 3208915 3199917 3196631 3193344 3191470 3189596
-22339C189596p585p584O216O217J219J220n265O157N443N443p882p882L539L540m811m811
$$ 3189596 3182011 3174427 3180643 3186860 3188079 3189299 3184034 3190191 3195634 3201077 3193195 3185313 3188852 3192392 3187581 3182770
-22323C182770J86J1607J0656J0656n2n2o477o477j2901j480J0894J0894J86J85m606m607
$$ 3182770 3182956 3194563 3205219 3215875 3215823 3215771 3209294 3202817 3189916 3188436 3199330 3210224 3210410 3210595 3205989 3201382
-22307C201382O815O815k465k465k465k465n796n796j514R909R908j513n796n797K919K919
$$ 3201382 3208197 3215012 3212547 3210082 3207617 3205152 3199356 3193560 3192046 3201955 3211863 3210350 3204554 3198757 3201676 3204595
-22291C204595K918K919o51o50o51o51K919K918K919K919q503q504R820R819N272o149j1147
$$ 3204595 3207513 3210432 3209781 3209131 3208480 3207829 3210748 3213666 3216585 3219504 3211001 3202497 3212317 3222136 3227408 3221259 3210112
-22274C210112j1147l651l651P771P771m99m98N213N213K714K714K714K714l480l476l480
$$ 3210112 3198965 3195314 3191663 3199434 3207205 3206706 3206208 3211421 3216634 3219348 3222062 3224776 3227490 3224010 3220534 3217054
-22258C217054l477M46M50n264n262n978n975N443N447R132R135Q537Q540Q9r425p288j572
$$ 3217054 3213577 3214023 3214473 3209209 3203947 3197969 3191994 3197437 3202884 3212016 3221151 3229688 3238228 3238317 3228892 3221604 3220032
-22241C220032M372M376M730M733K647K651q775q771j3057j3054N978N983N015N019N016N020
$$ 3220032 3224404 3228780 3233510 3238243 3240890 3243541 3234766 3225995 3212938 3199884 3205862 3211845 3216860 3221879 3226895 3231915
-22225C231915n574n569J37R660J3939Q231j647j1161j5092j5087m265m261k197k194L514
$$ 3231915 3226341 3220772 3220909 3230569 3244508 3252739 3251092 3239931 3224839 3209752 3205487 3201226 3199029 3196835 3200349
-22210C200349L517k555k550o51N064O310l205q920q915m399m395P024P027Q88Q89Q89Q88
$$ 3200349 3203866 3201311 3198761 3198110 3203174 3209484 3206279 3197359 3188444 3184045 3179650 3186674 3193701 3194589 3195478 3196367 3197255
-22193C197255N32N31O243O242Q89Q89j0533j0534q986q986J0050J0049L477L476J4065J4065
$$ 3197255 3197787 3198318 3204561 3210803 3211692 3212581 3202048 3191514 3182528 3173542 3183592 3193641 3197118 3200594 3214659 3228724
-22177C228724L001j0325q183J334L358L357R663R664J0019J0021j402j402r418r414r417
$$ 3228724 3231725 3221400 3213217 3214551 3217909 3221266 3230929 3240593 3250612 3260633 3259231 3257829 3248411 3238997 3229580
-22162C229580r414j2868j2865r299M031M383j323m95N220P715P719K361K365J840J844r581
$$ 3229580 3220166 3207298 3194433 3185134 3189165 3193548 3192225 3191730 3196950 3204665 3212384 3214745 3217110 3218950 3220794 3211213
-22146C211213r578n179n176n179n175j6780j6776K258K260K019K022K019K023k145k142k145
$$ 3211213 3201635 3196456 3191280 3186101 3180926 3164146 3147370 3149628 3151888 3153907 3155929 3157948 3159971 3157826 3155684 3153539
-22130C153539k142k145k142k502k498L981j725m941O484J2787J2790Q503k915j2482j2477
$$ 3153539 3151397 3149252 3147110 3144608 3142110 3146091 3144366 3139425 3145909 3158696 3171486 3179989 3177074 3164592 3152115
-22115C152115j774j770l45l42l46l42k27k23k27k23M532M536L819L822l98j1816j1820l93
$$ 3152115 3150341 3148571 3148226 3147884 3147538 3147196 3146969 3146746 3146519 3146296 3150828 3155364 3159183 3163005 3162607 3150791 3138971 3138578
-22097C138578O740O745P454P459j112j108j112j108J744J748J386J391k6n733q950K477R492
$$ 3138578 3145318 3152063 3159517 3166976 3165864 3164756 3163644 3162536 3164280 3166028 3167414 3168805 3168779 3163046 3154096 3156573 3166065
-22080C166065R496j216j212k287k283R135R139q59q55q59q55K038K041K038K040m624m622
$$ 3166065 3175561 3174345 3173133 3170846 3168563 3177698 3186837 3185978 3185123 3184264 3183409 3185447 3187488 3189526 3191566 3186942 3182320
-22063C182320m625m622k008k003k008k004O558O563O558O562p28p25p29p25R741R745R741
$$ 3182320 3177695 3173073 3171065 3169062 3167054 3165050 3171608 3178171 3184729 3191291 3190563 3189838 3189109 3188384 3198125 3207870 3217611
-22046C217611R745K127K130K127K131o678o674o321o316j6278j0567N734J7155J1444K2L235
$$ 3217611 3227356 3229483 3231613 3233740 3235871 3229193 3222519 3216198 3209882 3193604 3183037 3188771 3205926 3217370 3217392 3220627
-22030C220627Q945K819q604q961K462Q172l249p533p533M98M98M99M98l071l071l071l071
$$ 3220627 3229572 3232391 3223787 3214826 3217288 3225460 3222211 3214678 3207145 3207643 3208141 3208640 3209138 3206067 3202996 3199925 3196854
-22013C196854K521K520K521K521J807J807J807J807J911J911r511r511O195O194O194O194
$$ 3196854 3199375 3201895 3204416 3206937 3208744 3210551 3212358 3214165 3216076 3217987 3208476 3198965 3205160 3211354 3217548 3223742
-21997C223742o120o119N301N302m692m692N540N540K208j6827j6828K208N302N302O492O491
$$ 3223742 3217622 3211503 3216804 3222106 3217414 3212722 3218262 3223802 3226010 3209183 3192355 3194563 3199865 3205167 3211659 3218150
-21981C218150J376J376J375J376o001o000o001o002J2348J2351R26R30l120l115l120l116
$$ 3218150 3219526 3220902 3222277 3223653 3217652 3211652 3205651 3199649 3211997 3224348 3225274 3226204 3223084 3219969 3216849 3213733
-21965C213733k703k699k703k699j989j986j989j985N357N362J6779J6783K503K506q920q916
$$ 3213733 3211030 3208331 3205628 3202929 3200940 3198954 3196965 3194980 3200337 3205699 3222478 3239261 3241764 3244270 3235350 3226434
-21949C226434R56R59R56R59p611p607J1425J1430l380l380l379l380q615q614K093K093Q44
$$ 3226434 3227390 3228349 3229305 3230264 3222653 3215046 3226471 3237901 3234521 3231141 3227762 3224382 3215767 3207153 3209246 3211339 3212183
-21932C212183j0578j4861M176N127N127O317O317R128R127k294k294o28o28o29o28K346K346
$$ 3212183 3201605 3186744 3190920 3196047 3201174 3207491 3213808 3222936 3232063 3229769 3227475 3226847 3226219 3225590 3224962 3227308 3229654
-21915C229654K346K346Q295Q295j0741j0742l551l550l551l551o406o406N016N015R716R715
$$ 3229654 3232000 3234346 3242641 3250936 3240195 3229453 3225902 3222352 3218801 3215250 3208844 3202438 3207454 3212469 3222185 3231900
-21899C231900R715R715p179p180M242M243N446N447n974n975J163J164J164J164j157j156
$$ 3231900 3241615 3251330 3244151 3236971 3241213 3245456 3250902 3256349 3250375 3244400 3245563 3246727 3247891 3249055 3247898 3246742
-21883C246742j156j157j394j394j2816j2816k235k230p589J933O332O336O927O930K762K767
$$ 3246742 3245586 3244429 3243035 3241641 3228825 3216009 3213774 3211544 3203955 3205888 3212220 3218556 3225483 3232413 3235175 3237942
-21867C237942K762K766N618N622j3419j3414j6631j6627n209n205r3q9l900J814M845m670
$$ 3237942 3240704 3243470 3249088 3254710 3241291 3227877 3211246 3194619 3189410 3184205 3184112 3184023 3180123 3181937 3186782 3182112
-21851C182112m317N205O630O633P224P227l108l108K365J1882J2240K722n964k53L614L614
$$ 3182112 3177795 3183000 3189630 3196263 3203487 3210714 3207606 3204498 3206863 3218745 3230985 3233707 3227743 3227490 3231104 3234718
-21835C234718L971L971Q016Q016P421P421k112j1630j1630k111L955L956N06O217P108o216
$$ 3234718 3238689 3242660 3250676 3258692 3266113 3273534 3271422 3259792 3248162 3246051 3250006 3253962 3254468 3260685 3267793 3261577
-21819C261577j2998p288q62q63n05n06N979N982n443n440Q120Q124l301l298q834q831n502
$$ 3261577 3248579 3241291 3240429 3239566 3239061 3238555 3244534 3250516 3245073 3239633 3247753 3255877 3252576 3249278 3240444 3231613 3226111
-21802C226111P826R726K12n026n023m971m968m971m967O213O216n208n206J1269J1274j819
$$ 3226111 3233937 3243663 3243875 3238849 3233826 3228855 3223887 3218916 3213949 3220162 3226378 3221170 3215964 3227233 3238507 3236688
-21786C236688j1332m198N324o28o24q48q44q48q44q48q44m90m87m91N224P361k152r533r530
$$ 3236688 3225356 3221158 3226482 3225854 3225230 3224382 3223538 3222690 3221846 3220998 3220154 3219664 3219177 3218686 3223910 3231271 3229119 3219586 3210056
-21767C210056J294J298P098P101P098P101L052L057K695K700p537j3243j5389n867O503O506
$$ 3210056 3211350 3212648 3219746 3226847 3233945 3241046 3244098 3247155 3249850 3252550 3245013 3231770 3216381 3210514 3217017 3223523
-21751C223523P098P101m510m506m510m506m986m982O436O439Q459Q462k963k960M176M179
$$ 3223523 3230621 3237722 3233212 3228706 3224196 3219690 3214704 3209722 3216158 3222597 3231056 3239518 3236555 3233595 3237771 3241950
-21735C241950M175M179l558l555l558l554j0697j0693P25P29J1552J1555J30J34l201l198
$$ 3241950 3246125 3250304 3246746 3243191 3239633 3236079 3225382 3214689 3215414 3216143 3227695 3239250 3239380 3239514 3236313 3233115
-21719C233115l201l197O090O094O090O094N852N856n570n566j822j818j821j819p294p291
$$ 3233115 3229914 3226717 3232807 3238901 3244991 3251085 3256937 3262793 3257223 3251657 3249835 3248017 3246196 3244377 3237083 3229792
-21703C229792p295p291N212N217N213N216M023M026M023M027N986N990j3051j3046l294l291
$$ 3229792 3222497 3215206 3220418 3225635 3230848 3236064 3240087 3244113 3248136 3252163 3258149 3264139 3251088 3238042 3234748 3231457
-21687C231457Q128Q131K458K461J2690J2693K458j6575j7293J748K0542R124j7531j7527
$$ 3231457 3239585 3247716 3250174 3252635 3265325 3278018 3280476 3263901 3246608 3248356 3268898 3278022 3260491 3242964
-21673C242964m443m439m443m439J2481J2485J060J063L915L919L915L919P62P66j0659j0656
$$ 3242964 3238521 3234082 3229639 3225200 3237681 3250166 3251226 3252289 3256204 3260123 3264038 3267957 3268719 3269485 3258826 3248170
-21657C248170l521l518l520l518j260j261Q972Q972J0637q399j5538m116J3791J3790l819
$$ 3248170 3244649 3241131 3237611 3234093 3232833 3231572 3240544 3249516 3260153 3251754 3236216 3232100 3245891 3259681 3255862
-21642C255862l818P841J9263K3547M509j5478j5478n960n960k49j1671j5954L082K2595K2594
$$ 3255862 3252044 3259885 3279148 3302695 3307204 3291726 3276248 3270288 3264328 3264079 3252408 3236454 3239536 3262131 3284725
-21627C284725j0481j0481L320L320L321L320L428L428p994p994N094N094N094N093n971n971
$$ 3284725 3274244 3263763 3267083 3270403 3273724 3277044 3280472 3283900 3275906 3267912 3273006 3278100 3283194 3288287 3282316 3276345
-21611C276345n971n972l115l116l116l115j919j918q344L079K0211K0212Q313l108N80N80
$$ 3276345 3270374 3264402 3261287 3258171 3255055 3251940 3250021 3248103 3239759 3242838 3263049 3283261 3291574 3288466 3289046 3289626
-21595C289626j0366j0366N339K4375J9379P956n250j6671j7386n963J4976J4976L079q344
$$ 3289626 3279260 3268894 3274233 3298608 3317987 3325943 3320693 3304022 3286636 3280673 3295649 3310625 3313704 3305360
-21581C305360Q78Q77J64J63j1734j1734J64J1585Q500k923p919p920O596m826j6247m826
$$ 3305360 3306238 3307115 3307279 3307442 3295708 3283974 3284138 3295723 3304223 3301300 3293381 3285461 3292057 3287231 3270984 3266158
-21565C266158J3912J3913K015r406j554j555j554j554M417J5839R414R414o053o053j2478
$$ 3266158 3280070 3293983 3295998 3286592 3285038 3283483 3281929 3280375 3284792 3300631 3310045 3319459 3313406 3307353 3294875
-21550C294875j055O142O142m566m565Q283Q284l138l138k543k543l257l257k306j3727j3727
$$ 3294875 3293820 3299962 3306104 3301538 3296973 3305256 3313540 3310402 3307264 3304721 3302178 3298921 3295664 3293358 3279631 3265904
-21534C265904k305J2032J2032J323J324J799J800q909q908N73J1998N569N574R138R143k283
$$ 3265904 3263599 3275631 3287663 3288986 3290310 3292109 3293909 3285000 3276092 3276665 3288663 3294232 3299806 3308944 3318087 3315804
-21518C315804k279k997k993k997k992l711l707l710l707P086P090P087P090O373O376O373
$$ 3315804 3313525 3310528 3307535 3304538 3301546 3297835 3294128 3290418 3286711 3293797 3300887 3307974 3315064 3321437 3327813 3334186
-21502C334186O376M470M472o952o949l384l379l384l380L127L127K413K413O696m725r723
$$ 3334186 3340562 3345032 3349504 3342552 3335603 3332219 3328840 3325456 3322076 3325203 3328330 3330743 3333156 3339852 3335127 3325404
-21486C325404r723L365L365K651K651J0027j394p105p105q161j9583j9583q161J0638J0637
$$ 3325404 3315681 3319046 3322411 3325062 3327713 3337740 3336346 3329241 3322136 3313975 3294392 3274809 3266648 3277286 3287923
-21471C287923p1p1K0632K0631M05j1016J833J833J119J119J0946J0949j665j3084n711n707
$$ 3287923 3287852 3287781 3308413 3329044 3329449 3318433 3320266 3322099 3323218 3324337 3335283 3346232 3344567 3331483 3325772 3320065
-21455C320065j6657j6653m878J4162J0589q29K499J3923K975q444j234J7805J2805J387l376
$$ 3320065 3303408 3286755 3281877 3296039 3306628 3305799 3308298 3322221 3325196 3316752 3315518 3333323 3346128 3347515 3344139
-21440C344139l372m090m086m923m919P5J1500J2210J2213o112o109J324J327J324J327k722
$$ 3344139 3340767 3336677 3332591 3327668 3322749 3322824 3334324 3346534 3358747 3352635 3346526 3347850 3349177 3350501 3351828 3349106
-21424C349106k717k722k718M060M064M060M064J918J922q789q785J918J3344O915O920O677
$$ 3349106 3346389 3343667 3340949 3345009 3349073 3353133 3357197 3359115 3361037 3352248 3343463 3345381 3358725 3365640 3372560 3379237
-21408C379237O682m745m740j472j469j473j468l852l848l852l848J5006J5010m031j5448
$$ 3379237 3385919 3381174 3376434 3374962 3373493 3372020 3370552 3366700 3362852 3359000 3355152 3370158 3385168 3381137 3365689
-21393C365689k603J6438J1436J9l793l788l793l788m61J0964J0961m58k82k79r96r93M715
$$ 3365689 3363086 3379524 3390960 3390979 3387186 3383398 3379605 3375817 3375356 3386320 3397281 3396823 3396541 3396262 3395266 3394273 3398988
-21376C398988M717n993n990P273J8698J2269o763l435P990O796m621l633l632l633l632l01
$$ 3398988 3403705 3397712 3391722 3398995 3417693 3429962 3423199 3419764 3427754 3434550 3429929 3426296 3422664 3419031 3415399 3415098
-21360C415098J1120J1121l01k086k086k800k799R335R337m942k3977k2743L907J3188J766
$$ 3415098 3426218 3437339 3437038 3434952 3432866 3430066 3427267 3436602 3445939 3440997 3417020 3394277 3398184 3411372 3413138
-21345C413138M146M145R857j566l349l350P358P358l826l826j0251J172N513N514n194n194
$$ 3413138 3417284 3421429 3431286 3429720 3426371 3423021 3430379 3437737 3433911 3430085 3419834 3421006 3426519 3432033 3426839 3421645
-21329C421645j625j624r12r10J349J2772J2771J350L729L729L015L016o667o666o667o666
$$ 3421645 3420020 3418396 3417484 3416574 3417923 3430695 3443466 3444816 3448545 3452274 3455289 3458305 3451638 3444972 3438305 3431639
-21313C431639M993M994M993M993R396R395N112o309q451K971K970q451o190N234R515R518
$$ 3431639 3436632 3441626 3446619 3451612 3461008 3470403 3475515 3469206 3460755 3463726 3466696 3458245 3452055 3457289 3466804 3476322
-21297C476322R48R52R48R52J365J368J364J369P789P793l633l629K64K68K64K68J8348J8352
$$ 3476322 3477270 3478222 3479170 3480122 3481487 3482855 3484219 3485588 3493377 3501170 3497537 3493908 3494172 3494440 3494704 3494972 3513320 3531672
-21279C531672J8349J8352J454J457O451J7876K4773K4777N261o157K584K588n745k4776k2877
$$ 3531672 3550021 3568373 3569827 3571284 3577735 3595611 3620384 3645161 3650422 3644265 3646849 3649437 3643692 3618916 3596039
-21264C596039j1452l3l0J811J814r611r608J45J49j8891j8887j4148j4143j3433j3430j1291
$$ 3596039 3584587 3584554 3584524 3586335 3588149 3578538 3568930 3569075 3569224 3550333 3531446 3517298 3503155 3489722 3476292 3465001
-21248C465001J34N127N131n84n80J30J34J1790K3215J6787J6790J0820J0819o02o02J5102
$$ 3465001 3465135 3470262 3475393 3474809 3474229 3474359 3474493 3486283 3509498 3526285 3543075 3553895 3564714 3564112 3563510 3578612
-21232C578612J5103J5102J5103J5697J5698l339l339O418O417n004n005L458L458p964p964
$$ 3578612 3593715 3608817 3623920 3639617 3655315 3651976 3648637 3655055 3661472 3656468 3651463 3654921 3658379 3650415 3642451
-21217C642451o299o298j7720j7720j1890j1891j0700j0700p07J8330P622j1414m845O581
$$ 3642451 3636152 3629854 3612134 3594414 3582524 3570633 3559933 3549233 3548526 3566856 3574478 3563064 3558219 3564800
-21203C564800R670r362r365r362j7694l6727l5659j6620j870j867N10N13N09N13J3642J3645
$$ 3564800 3574470 3565108 3555743 3546381 3528687 3491960 3456301 3439681 3437811 3435944 3436454 3436967 3437476 3437989 3451631 3465276
-21187C465276J0310j108J2928L9582L5295J6262J3761K5186J7567j465K577J4002P098P101
$$ 3465276 3475586 3474478 3487406 3526988 3562283 3578545 3592306 3617492 3635059 3633594 3636171 3650173 3657271 3664372
-21173C664372J0243K1669J5240l792r983J442J1671K53M949M952M235M239J0897J0901J0898
$$ 3664372 3674615 3696284 3711524 3707732 3697749 3699191 3710862 3711115 3716064 3721016 3725251 3729490 3740387 3751288 3762186
-21158C762186J0901J2251J2254Q30Q32J2965J2968K257K261K435J3861P908j1124k562J6478
$$ 3762186 3773087 3785338 3797592 3798422 3799254 3812219 3825187 3827444 3829705 3832140 3846001 3853909 3842785 3840223 3856701
-21143C856701J1716K97O730J8151K1721K684j361j360j837j837O611J8033M944j4091r332
$$ 3856701 3868417 3868714 3875444 3893595 3915316 3918000 3916639 3915279 3913442 3911605 3918216 3936249 3941193 3927102 3917770
-21128C917770J7318J9698Q277M305J5727J6203M782Q113K7148K7626Q588J2158L1194L7143
$$ 3917770 3935088 3954786 3963063 3967368 3983095 3999298 4004080 4012193 4039341 4066967 4075555 4087713 4118907 4156050
-21114D156050K5721K6673K6673J5252J5251P864J9285J9286P863N008N008j3314n5194o8103
$$ 4156050 4181771 4208444 4235117 4250369 4265620 4273484 4292769 4312055 4319918 4324926 4329934 4316620 4261426 4193323
-21100D193323n6681o6437q5474r5229r5230j06889j33540j42270j23234j17047j28468j42746
$$ 4193323 4136642 4070205 3984731 3889502 3794272 3687383 3553843 3411573 3288339 3171292 3042824 2900078
-21088B900078j31324j23234j11812q3555m1675k5971j4548J6861O6356J03000J37265J78469
$$ 2900078 2768754 2645520 2533708 2450153 2408478 2382507 2367959 2384820 2451176 2554176 2691441 2869910
-21076B869910K27962K59373K59373K65083K65084K42240J92746J55268J36232J07201P2937
$$ 2869910 3097872 3357245 3616618 3881701 4146785 4389025 4581771 4737039 4873271 4980472 5053409
-21065E053409O8177Q7214P9598N2949N0182P6833Q3495O4459N4942P3977P3501N4466M8635
$$ 5053409 5121586 5208800 5288398 5341347 5391529 5468362 5551857 5616316 5671258 5745235 5818736 5873202 5921837
-21052E921837O0057O0533M9111O4579R1229Q7897O8862P6866J03521J07324R5907J03517
$$ 5921837 5981894 6042427 6091538 6156117 6247346 6335243 6404105 6480971 6584492 6691816 6787723 6891240
-21040F891240J37786J45872J19226J20887J47542J51346J17084J07325J26364J37782J18750
$$ 6891240 7029026 7174898 7294124 7415011 7562553 7713899 7830983 7938308 8064672 8202454 8321204
-21029H321204J21557J55826J62960J51543J62485J96753K12456K01036K21497K63381K68613
$$ 8321204 8442761 8598587 8761547 8913090 9075575 9272328 9484784 9685820 9907317 10170698 10439311
-21018A0439311K41964K54811L04308L22865L03833L10205L59704L91823L91827M18474M83201
$$ 10439311 10681275 10936086 11240394 11563259 11867092 12177297 12537001 12928824 13320651 13739125 14222326
-21007A4222326N08420N08425N36260O08602O36438O09795O16925O81656P25909P14491P27068
$$ 14222326 14730746 15239171 15775431 16384033 17020471 17630266 18247191 18928847 19654756 20369247 21096315
-20996B1096315P84183Q14159P95131Q02262Q44147Q50326Q31298Q80669J021539J138609
$$ 21096315 21880498 22694657 23489788 24292050 25136197 25986523 26817821 27698490 28720029 29858638
-20986B9858638J210952J346102J563121J746343J879602K093007K439471K792592L139053
$$ 29858638 31069590 32415692 33978813 35725156 37604758 39697765 42137236 44929828 48068881
-20977D8068881L634944M362132N218287O227209P547599R173313J0802331J2207203J3479780
$$ 48068881 51703825 56065957 61284244 67511453 75059052 84232365 95034696 107241899 120721679
-20968A20721679J4701904J5809824J6879651J8244934K0167599K2620909K5556274K8983792
$$ 120721679 135423583 151233407 168113058 186357992 206525591 229146500 254702774 283686566
-20960B83686566L2733887L6546886M0670089M5736756N1923488N8814735O6181628P3529198
$$ 283686566 316420453 352967339 393637428 439374184 491297672 550112407 616294035 689823233
-20952F89823233P8269203P5669776O2188332L8541192Q315381k5341690n9549824q8902749
$$ 689823233 768092436 843762212 905950544 944491736 952807117 927465427 867915603 779012854
-20944G79012854j06062076j07292229r6140814q0313561o5583379n3510568m3676403l5736888
$$ 779012854 672950778 565658549 469517735 389204174 323620795 270110227 226433824 190696936
-20936A90696936k9390201k4048155j9422339j5700667j2909947j0644171q675814p144824
$$ 190696936 161306735 137258580 117836241 102135574 89225627 78581456 69905642 62760818
-20928F2760818o090218n236440m410265l751732l336744k968868k538647k192663k013723
$$ 62760818 56670600 51434160 47023895 43272163 39935419 36966551 34427904 32235241 30221518
-20919C0221518j841446j601589j411980j347253j279677j115964r80811r46539r14898q04481
$$ 30221518 28380072 26778483 25366503 24019250 22739573 21623609 20642798 19696259 18781361 17976880
-20909A7976880p11447p11441o89079o01508n24415n24412n14660m49931m02227m21259m16979
$$ 17976880 17265433 16553992 15864913 15263405 14738990 14214578 13699918 13249987 12847760 12426501 12009522
-20898A2009522l52253l06092l17512l24654k75156k35301k54335k58621k09124j77004k03651
$$ 12009522 11657269 11351177 11033665 10709011 10433855 10198554 9944219 9685598 9476474 9299470 9095819
-20887I095819k27925k01272j70846j82265j94638j60373j31584j50617j62039j20159r1846
$$ 9095819 8867894 8666622 8495776 8313511 8118873 7958500 7826916 7676299 7514260 7394101 7302255
-20876G302255j03264j10879q4228o4006r0652j12069r3032p8610r0028r8594p1944n7194
$$ 7302255 7198991 7088112 7003884 6939878 6849226 6737157 6644125 6565515 6475487 6376893 6304949 6247755
-20864F247755p6227q4317n0052k4833m3865n8618l1968j6385l5418n0647k3996j71j9204
$$ 6247755 6171528 6087211 6037159 6012326 5968461 5909843 5877875 5861490 5826072 5775425 5751429 5751258 5732054
-20851E732054l9191l9192k6107k6105l5622l5622j8256j8252k8959r924L517L521N663L9928
$$ 5732054 5692863 5653671 5627564 5601459 5565837 5530215 5511959 5493707 5464748 5454824 5458341 5461862 5467525 5507453
-20837E507453O5905N4488M3304N4725P9231P9235P9473J06123J39195J58235J78223K12488
$$ 5507453 5573358 5627846 5671150 5725875 5805106 5884341 5963814 6069937 6209132 6367367 6545590 6758078
-20825F758078K41040K52464K74357L16235L36131L09481K69028K49993K34881K00617J63496
$$ 6758078 6999118 7251582 7525939 7842174 8178305 8487786 8756814 9006807 9241688 9442305 9605801
-20814I605801J63496J70041J70039J70040J70039K09422K09421K15132K15132K26404K26406
$$ 9605801 9769297 9939338 10109377 10279417 10449456 10658878 10868299 11083431 11298563 11524967 11751373
-20803A1751373K14268K14270J91426J49547J02668N3175l993q3945j60566k17676k76687
$$ 11751373 11965641 12179911 12371337 12520884 12623552 12676727 12672734 12588789 12428223 12210547 11933860
-20792A1933860l41410l81387m00423m08053m34702m48982m37558m26255m37678m38630m19593
$$ 11933860 11592450 11211063 10810640 10402587 9967885 9518903 9081345 8655090 8217412 7778782 7359189
-20781G359189l79676l37797l01152k59272k27030k15608k02520j68255j46661j46661j42378
$$ 7359189 6979513 6641716 6340564 6081292 5854262 5638654 5436134 5267879 5121218 4974557 4832179
-20770D832179j15727q2889q2890q3127o4092m9457o0878p2777n3740k1855j0433k5186k5185
$$ 4832179 4716452 4633563 4550673 4467546 4403454 4353997 4293119 4220342 4166602 4144747 4134314 4109128 4083943
-20757D083943k4297k4298l3815l3815j1329j1329j1329j1328j2162j2162j7872j7873j1805
$$ 4083943 4059646 4035348 4001533 3967718 3956389 3945060 3933731 3922403 3910241 3898079 3880207 3862334 3850529
-20744C850529j1804k287k286j2831j2831j8542j8542J9J8j7113j7115j1759j1761o049o049
$$ 3850529 3838725 3836438 3834152 3821321 3808490 3789948 3771406 3771425 3771443 3754330 3737215 3725456 3713695 3707646 3701597
-20729C701597l194l194j2712j2712J9806J9806K673K674l01l02m227J483M815o607o249N171
$$ 3701597 3698403 3695209 3682497 3669785 3689591 3709397 3712070 3714744 3714443 3714141 3709914 3711397 3716212 3709605 3703356 3708527
-20713C708527J5166J5166N647N648N603n819j2481o770L699k011j6289j6289j7954k9376
$$ 3708527 3723693 3738859 3744506 3750154 3755757 3749938 3737457 3730687 3734386 3732375 3716086 3699797 3681843 3652467
-20699C652467l5444k4022j4861k0572k6163k6164j9825j9824j7921J116J4440L019j4113
$$ 3652467 3617023 3593001 3578140 3557568 3531405 3505241 3485416 3465592 3447671 3448787 3463227 3466246 3452133
-20686C452133j4114j0544j0544k0063k0062j8873j8873j5779m357J2046J2046n65n65P287
$$ 3452133 3438019 3427475 3416931 3396868 3376806 3357933 3339060 3323281 3318924 3330970 3343016 3342451 3341886 3349173
-20672C349173P288J576J576j754j755j1273j1273L718L718J7043J7044J7872J7873P640P641
$$ 3349173 3356461 3358037 3359613 3357859 3356104 3344831 3333558 3337276 3340994 3358037 3375081 3392953 3410826 3418466 3426107
-20657C426107J4779L357l543l543n566n566j5084j5084o161o161o874o875q124j9545k5614
$$ 3426107 3440886 3444243 3440700 3437157 3431591 3426025 3410941 3395857 3389696 3383535 3376661 3369786 3361662 3342117 3316503
-20642C316503j4191R18m793k1211j5501r2r3j3062j3061l781l782r848r850j0722j6434k4643
$$ 3316503 3302312 3303230 3298437 3277226 3261725 3261633 3261540 3248478 3235417 3231636 3227854 3218006 3208156 3197434 3181000 3156357
-20626C156357j3221K246J3667J0098J5809K2710J6998P243P243K1401K1401Q075Q076K275
$$ 3156357 3143136 3145382 3159049 3169147 3184956 3207666 3224664 3231907 3239150 3260551 3281952 3290027 3298103 3300378
-20612C300378K276j0694j0693M299J0009j05j1526n993n993o708o707O023O023O024O023
$$ 3300378 3302654 3291960 3281267 3285566 3295575 3295470 3283944 3277951 3271958 3265250 3258543 3264566 3270589 3276613 3282636
-20597C282636N053N052o369o369l513l514l513l514J722J721r700r700m21m20m20m20J781
$$ 3282636 3287689 3292741 3286372 3280003 3276490 3272976 3269463 3265949 3267671 3269392 3259692 3249992 3249571 3249151 3248731 3248311 3250092
-20580C250092J781J781J781L208L209j5827j5828M279M280o786o785O897J2608M398p023
$$ 3250092 3251873 3253654 3255435 3258643 3261852 3246025 3230197 3234476 3238756 3231970 3225185 3232082 3244690 3249088 3242065
-20565C242065q63q62r072j4783k886Q537M967p43J636J636l004j4427k766Q656Q299l124
$$ 3242065 3241202 3240340 3231268 3216485 3213599 3222136 3227103 3226360 3227996 3229632 3226628 3212201 3209435 3218091 3226390 3223266
-20549C223266r882m172P012J2724J896r526j7378j1667k149k149j792j792L49L50L50L49
$$ 3223266 3213384 3209212 3216224 3228948 3230844 3221318 3203940 3192273 3190124 3187975 3186183 3184391 3184740 3185090 3185440 3185789
-20533C185789M112M112M112M112j360j361j361j361J0537J0537q85q85j837j836j480j480
$$ 3185789 3189901 3194013 3198125 3202237 3200877 3199516 3198155 3196794 3207331 3217868 3216983 3216098 3214261 3212425 3210945 3209465
-20517C209465J2463J8174R964j458p049p049p763p764m908m907j5616j5616J279J2701K469
$$ 3209465 3221928 3240102 3250066 3248608 3241559 3234510 3226747 3218983 3214075 3209168 3193552 3177936 3179215 3191916 3194385
-20502C194385q953l246J5791K1501J0079J514r909j5619j5620K05K04K05K04K346K346K347
$$ 3194385 3185432 3182186 3197977 3219478 3229557 3231071 3221162 3205543 3189923 3190128 3190332 3190537 3190741 3193087 3195433 3197780
-20486C197780K346K970K971K971K970K733K733p975p975L089J4511J4512L090j1188j1187
$$ 3197780 3200126 3203096 3206067 3209038 3212008 3214741 3217474 3209499 3201524 3204613 3219124 3233636 3236726 3225538 3214351
-20471C214351m80m80M395M395M395M394K967K967q098q098l814J896M633m886j2024k506
$$ 3214351 3213871 3213391 3217786 3222181 3226576 3230970 3233937 3236904 3228806 3220708 3216894 3218790 3223423 3218537 3206513 3204007
-20455C204007O180M68m543m544m900m901j0016j0016m544M975M261n257n258M261J2232K715
$$ 3204007 3210187 3210655 3206112 3201568 3196668 3191767 3181751 3171735 3167191 3172166 3176427 3171170 3165912 3170173 3182405 3185120
-20439C185120j0374j0373n789n789n194n194M086J3604J1463N752L134L134K778K777K539
$$ 3185120 3174746 3164373 3158584 3152795 3147601 3142407 3146493 3160097 3171560 3177312 3180446 3183580 3186358 3189135 3191674
-20424C191674K540q882q883l327l328l328l327R045R047k376k376P77P77P77P77O3O4O3O3
$$ 3191674 3194214 3185332 3176449 3173122 3169794 3166466 3163139 3172184 3181231 3178855 3176479 3177256 3178033 3178810 3179587 3179650 3179714 3179777 3179840
-20405C179840K127K127K721K722M863J4381K3305J7593J0634M923M565J0277J5392J5393
$$ 3179840 3181967 3184094 3186815 3189537 3194400 3208781 3232086 3249679 3260313 3265236 3269801 3280078 3295470 3310863
-20391C310863K0509J0990p295j6813j4909r198m440J272L413o105j7646k3356k6093j6575
$$ 3310863 3331372 3342362 3335067 3318254 3303345 3294147 3289707 3290979 3294392 3288287 3270641 3247285 3221192 3204617
-20377C204617J866J867n153j0864L90R908M198M198N030N031o035o034o21N090j454j4779
$$ 3204617 3206483 3208350 3203197 3192333 3192723 3202631 3206829 3211027 3216057 3221088 3215053 3209019 3208398 3213488 3212034 3197255
-20361C197255j4422m904P945P946N343N342N343N343J2243J2244J178J179J7062K2773J5634
$$ 3197255 3182833 3177929 3185874 3193820 3199163 3204505 3209848 3215191 3227434 3239678 3240856 3242035 3259097 3281870 3297504
-20346C297504K309k926k926l759l759n328n328j6036j6036L477J4898Q116j0919j2110o399
$$ 3297504 3299813 3296887 3293961 3290202 3286443 3281115 3275787 3259751 3243715 3247192 3262090 3270206 3259287 3247177 3240778
-20331C240778o874j2586j7106n685O569O570K287K286j996j3418j3657k234R663R663L119
$$ 3240778 3233904 3221318 3204212 3198527 3205096 3211666 3213953 3216239 3214243 3200825 3187168 3184934 3194597 3204260 3207379
-20316C207379L120L119L120R068R068R068R069J1191J1191J1191J1191P22P21P21P22j6055
$$ 3207379 3210499 3213618 3216738 3225806 3234874 3243942 3253011 3264202 3275393 3286584 3297775 3298497 3299218 3299939 3300661 3284606
-20300C284606j6054j6054j6055p488p488p488p488l443l443l443l443J316J317J316J316
$$ 3284606 3268552 3252498 3236443 3228955 3221467 3213979 3206491 3203048 3199605 3196162 3192719 3194035 3195352 3196668 3197984
-20285C197984n049n049m335m336M24J1846N421N421O677O678n220j6642j2716j294O202M91
$$ 3197984 3192935 3187886 3183551 3179215 3179639 3191485 3196906 3202327 3209004 3215682 3210462 3193820 3181104 3179810 3186012 3186503
-20269C186503k543k543k900k901q611q611K811K811n50n50n51n50Q77Q78Q77Q78o142o143
$$ 3186503 3183960 3181417 3178517 3175616 3167005 3158394 3161205 3164016 3163466 3162916 3162365 3161815 3162692 3163570 3164447 3165325 3159183 3153040
-20251C153040N280N280J4559J4560L138L138K506K506J3928J3928L219L220L220L220J2619
$$ 3153040 3158320 3163600 3178159 3192719 3195857 3198995 3201501 3204007 3217935 3231863 3235082 3238302 3241522 3244742 3257361
-20236C257361J2618J198J197O670O670J674r749j2946j2946j3661j3660q900q902q900q901
$$ 3257361 3269979 3271177 3272374 3279044 3285714 3287388 3277639 3264693 3251747 3238086 3224426 3215526 3206624 3197724 3188823
-20221C188823j1757j1756l35l34N138N138o283o284n235n234O186O187Q328Q329l094l093
$$ 3188823 3177066 3165310 3164975 3164641 3169779 3174917 3168634 3162350 3157115 3151881 3158067 3164254 3172582 3180911 3177817 3174724
-20205C174724k915k915k915k915n294n294n295n295p852p852P257J2969N830n592k023L688
$$ 3174724 3171809 3168894 3165979 3163064 3157770 3152476 3147181 3141886 3134034 3126182 3133439 3146408 3152238 3146646 3144623 3148311
-20189C148311N652N651N295N294M580o841p555L867J5831M410p488p488l50l49l50l49j658
$$ 3148311 3153963 3159614 3164909 3170203 3174783 3167942 3160387 3164254 3180085 3184495 3177007 3169519 3169169 3168820 3168470 3168121 3166463
-20172C166463j658n585J26P384m038j5578j5578J063J2485J2485J063J540J539Q25Q26L562
$$ 3166463 3164805 3159220 3159346 3166730 3162692 3147114 3131536 3132599 3145084 3157569 3158632 3160172 3161711 3162536 3163362 3166924
-20156C166924L562p861p859j2619j2619j197j198O496O495O496O495O971O972l737l737J498
$$ 3166924 3170486 3162625 3154766 3142147 3129528 3128331 3127133 3133629 3140124 3146620 3153115 3160086 3167058 3163321 3159584 3161082
-20140C161082J2921J2920J498j0161j0162j0875j0875m673m674m317m316L23O035R603j818
$$ 3161082 3174003 3186923 3188421 3178260 3168098 3157223 3146348 3141675 3137001 3132684 3128368 3128691 3134726 3144329 3142511
-20125C142511l722J990J632m079n030O80N320J1032J2344J2343J2701J2701q63q62q63q63
$$ 3142511 3138789 3140779 3142411 3138332 3133302 3133982 3139302 3150334 3162678 3175021 3187722 3200423 3199560 3198698 3197835 3196972
-20109C196972k052k052k052k053q715q715q715q715n919n919n919n919J0975J0976m46m46
$$ 3196972 3194920 3192868 3190816 3188763 3180048 3171333 3162618 3153903 3147984 3142065 3136146 3130227 3141202 3152178 3151732 3151286
-20093C151286r608r607q894q893k469Q953Q953k469p123p124p838p837o410o410N012N012
$$ 3151286 3141678 3132071 3123177 3114284 3111815 3120768 3129721 3127252 3120129 3113005 3105167 3097330 3090920 3084510 3089522 3094534
-20077C094534M774M774o648o648K632K633K632K633J1183J1184O187n235r52r52N473n949
$$ 3094534 3099308 3104082 3097434 3090786 3093418 3096051 3098683 3101316 3112499 3123683 3129870 3124635 3123683 3122731 3128204 3122255
-20061C122255j1778l57L926L926M878M878N592N592N737J7159J0734J0733K644K643j6868
$$ 3122255 3110477 3110120 3114046 3117972 3122850 3127728 3133320 3138912 3144649 3161808 3172542 3183275 3185919 3188562 3171694
-20046C171694k8291k1032r612m613m615m138P284P997l424m257P164J1448J1448l543l544
$$ 3171694 3143403 3122371 3112759 3108146 3103531 3099393 3106677 3114674 3111250 3106993 3114157 3125605 3137053 3133510 3129966
-20031C129966k2579k2579j5441j5441j4252j4251N737K4774L1911K0490P354P355J3065J643
$$ 3129966 3107387 3084808 3069367 3053926 3039674 3025423 3031160 3055934 3087845 3108335 3115689 3123044 3136109 3137752
-20017C137752o923o923j212j2634k0070k0069j748j747M915M915J5623J5623N079o343Q2
$$ 3137752 3130829 3123906 3122694 3110060 3089990 3069921 3068173 3066426 3071341 3076256 3091879 3107502 3112581 3106238 3106320
-20002C106320Q2O506O507K223r198j3482k060K224K223j1102j1102o105N317J7438J7437
$$ 3106320 3106402 3112908 3119415 3121638 3112440 3098958 3096898 3099122 3101345 3090243 3079141 3073036 3078353 3095791 3113228
-19987C113228N540n882k313k312l027l026K506K506K506K506k254k253k253k253J11J12O536
$$ 3113228 3118768 3112886 3110573 3108261 3105234 3102208 3104714 3107220 3109726 3112232 3109978 3107725 3105472 3103219 3103330 3103442 3109978
-19970C109978m885r645r644J063J064J3793J3794J3794J3794r59r59j1787j1786j1150j632
$$ 3109978 3105093 3095448 3085804 3086867 3087931 3101724 3115518 3129312 3143106 3142147 3141188 3129401 3117615 3106465 3104833
-19955C104833k941q652p581N744J6929J6927R552R552J6690L365j8408k4119j0555K769N507
$$ 3104833 3101892 3093240 3085659 3091403 3108332 3125259 3134811 3144363 3161053 3164418 3146010 3121891 3111336 3114105 3119612
-19940C119612k05L841L841j989j990j989j989j275j275j276j275m131m130m131m131J08J08
$$ 3119612 3119407 3123248 3127089 3125100 3123110 3121121 3119132 3117857 3116582 3115306 3114031 3109900 3105770 3101639 3097508 3097616 3097724
-19923C097724P03P02L559J3076J0934N224K27K27j31j30L083L082m532j0243o377L142J000
$$ 3097724 3098427 3099129 3102688 3115764 3126698 3131922 3132149 3132376 3132245 3132115 3135198 3138280 3133748 3123505 3117128 3120270 3121270
-19906C121270m710j618M094L736j974j1611j1612n46n47M688M689M093M094N897l618r332
$$ 3121270 3116560 3114942 3119036 3122772 3120798 3109187 3097575 3097029 3096482 3101170 3105859 3109952 3114046 3119943 3116325 3106993
-19890C106993r329O7N782Q514j000q678Q44O313O317L339L342L339L343k343k338k342k339
$$ 3106993 3097664 3097731 3103513 3112027 3111027 3102349 3103193 3109506 3115823 3119162 3122504 3125843 3129186 3126843 3124505 3122163 3119824
-19873C119824L725L729l889r596n614L908J405m302m781m778n138n135Q652Q652K584o934
$$ 3119824 3123549 3127278 3123389 3113793 3108179 3112087 3113492 3109190 3104409 3099631 3094493 3089358 3098010 3106662 3109246 3102312
-19857C102312j2526j2526N558N559O867J156r85Q533J4838J4839K346p172n759L759R232
$$ 3102312 3089786 3077260 3082818 3088377 3095244 3096400 3095415 3103948 3118786 3133625 3135971 3128799 3123040 3126799 3136031
-19842C136031R231Q043Q042K569o949m689M830M592m927j5158r448P686J7203J2768P060
$$ 3136031 3145262 3153305 3161347 3163916 3156967 3152278 3157108 3161700 3156773 3141615 3132167 3139853 3157056 3169824 3176884
-19827C176884N867n551n673n671o387o384o149o146o150o146M320M325M320M324j658j655
$$ 3176884 3182751 3177200 3171527 3165856 3159469 3153085 3146936 3140790 3134640 3128494 3132814 3137139 3141459 3145783 3144125 3142470
-19811C142470j658j655J198J201J197J201O908O912O908O912o180o175n466n462r633J788
$$ 3142470 3140812 3139157 3140355 3141556 3142753 3143954 3150862 3157774 3164682 3171594 3165414 3159239 3153773 3148311 3138678 3140466
-19795C140466J3686J3686J2615J194p492j3203j1417LM644M644k971k971k970k971M659M658
$$ 3140466 3154152 3167838 3180453 3181647 3174155 3160952 3149535 3149538 3154182 3158826 3155855 3152884 3149914 3146943 3151602 3156260
-19779C156260o763o763o95o95L230k479j410J0013R656j766k480k480l194l194q179q180
$$ 3156260 3149497 3142734 3142039 3141344 3144574 3142095 3140685 3150698 3160354 3158588 3156108 3153628 3150434 3147240 3139061 3130881
-19763C130881L242L242o038o038o038o038k945k944k945k944J100J101J100J101K260K261
$$ 3130881 3134123 3137365 3131327 3125289 3119251 3113213 3110268 3107324 3104379 3101435 3102535 3103636 3104736 3105837 3108097 3110358
-19747C110358n235j0946l332Q091M521j190n95n95r51r52P14P13r993r994j889R533O321
$$ 3110358 3105123 3094177 3090845 3098936 3103457 3102267 3101672 3101077 3100126 3099174 3099888 3100601 3090608 3080614 3078725 3088258 3094579
-19730C094579O09J681J680J324J324q552q552K871K870N012N012N012N012L614L613J0039
$$ 3094579 3095188 3096869 3098549 3099873 3101197 3092645 3084093 3086964 3089834 3094846 3099858 3104870 3109882 3113496 3117109 3127148
-19714C127148j383r949r950P59P58m714m715m714m714K662K662K662K662M53M54M54M53l116
$$ 3127148 3125765 3115816 3105866 3106625 3107383 3102669 3097954 3093240 3088526 3091188 3093850 3096512 3099174 3099627 3100081 3100535 3100988 3097872
-19696C097872l115Q306Q306Q70Q70Q70Q70L725L726L725L726N302N302o120o120L05L05O61
$$ 3097872 3094757 3103063 3111369 3112239 3113109 3113979 3114849 3118574 3122300 3126025 3129751 3135053 3140355 3134235 3128115 3128420 3128725 3129386
-19678C129386O62m037J673N599n822r392K030R525L815p819p819p462p462q057L365J8832
$$ 3129386 3130048 3126011 3127684 3133283 3127461 3118069 3120099 3129624 3133439 3125620 3117801 3110339 3102877 3094820 3098185 3117017
-19662C117017J3121k941q652n797n796m012m011P410P410L386L388J4095J4095O956m465
$$ 3117017 3130138 3127197 3118545 3112748 3106952 3102940 3098929 3106339 3113749 3117135 3120523 3134618 3148713 3155669 3151204
-19647C151204r463r462n298n298m585m584J484J2905K0758J5046J621m089m447J264K692
$$ 3151204 3141741 3132279 3126981 3121683 3117098 3112514 3113998 3126903 3147661 3162707 3164328 3160239 3155792 3157056 3159748
$$ [...]
##END=	
