##TITLE=	B2Pin2
##JCAMPDX=	6.0	$$ NMR Plug-in 1.14 of MestReNova 12.0.4-22023
##DATATYPE=	NMRSPECTRUM
##DATACLASS=	XYDATA
##NUMDIM=	1
##ORIGIN=	Bruker BioSpin GmbH
##OWNER=	nmrsu
##.OBSERVEFREQUENCY=	224.7001953125
##.OBSERVENUCLEUS=	^11B
##.SOLVENTNAME=	CDCl3
##.PULSESEQUENCE=	zgbs
##LONGDATE=	2018/02/20 16:14:05.000
##.ACQUISITIONMODE=	SIMULTANEOUS
##$ORIGINALFORMAT=	Bruker XWIN-NMR
##$PARAMETERFILE=	(acqus, ASCII, c:/Users/Marco/Dropbox/2NMR%20folder/B2Pin2/11/acqus, 0)
$$ ##TITLE= Parameter file, TopSpin 4.0.1
$$ ##JCAMPDX= 5.0
$$ ##DATATYPE= Parameter Values
$$ ##NPOINTS= 1	$$ modification sequence number
$$ ##ORIGIN= Bruker BioSpin GmbH
$$ ##OWNER= nmrsu
$$ $$ 2018-02-20 16:13:45.626 -0000  nmrsu@CZC7167VR1
$$ $$ Z:/700/data/tds/nmr/B2Pin2/11/acqus
$$ $$ process C:\Bruker\TopSpin4.0.1\prog\mod\dirdata.exe
$$ ##$ACQT0= 1000000
$$ ##$AMP= (0..31)
$$ 100 100 100 100 100 100 100 100 100 100 100 100 100 100 100 100 100 100
$$ 100 100 100 100 100 100 100 100 100 100 100 100 100 100
$$ ##$AQSEQ= 0
$$ ##$AQ_mod= 3
$$ ##$AUNM= <au_zg>
$$ ##$AUTOPOS= <1 >
$$ ##$BF1= 224.700112
$$ ##$BF2= 700.35
$$ ##$BF3= 700.35
$$ ##$BF4= 700.35
$$ ##$BF5= 700.35
$$ ##$BF6= 700.35
$$ ##$BF7= 700.35
$$ ##$BF8= 700.35
$$ ##$BWFAC= (0..63)
$$ 0 0 0 0 0 0 0 0 0 0 0 0 0 0 0 0 0 0 0 0 0 0 0 0 0 0 0 0 0 0 0 0 0 0 0 0
$$ 0 0 0 0 0 0 0 0 0 0 0 0 0 0 0 0 0 0 0 0 0 0 0 0 0 0 0 0
$$ ##$BYTORDA= 0
$$ ##$CAGPARS= (0..11)
$$ 0 0 0 0 0 0 0 0 0 0 0 0
$$ ##$CHANFCU= (0..24)
$$ 0 0 0 1 0 0 0 0 0 0 0 0 0 0 0 0 0 0 0 0 0 0 0 0 0
$$ ##$CHANREC= (0..24)
$$ 0 0 0 0 0 0 0 0 0 0 0 0 0 0 0 0 0 0 0 0 0 0 0 0 0
$$ ##$CHEMSTR= <none>
$$ ##$CNST= (0..63)
$$ 1 1 1 1 1 1 1 1 1 1 1 1 1 1 1 1 1 1 1 1 1 1 1 1 1 1 1 1 1 1 1 1 1 1 1 1
$$ 1 1 1 1 1 1 1 1 1 1 1 1 1 1 1 1 1 1 1 1 1 1 1 1 1 1 1 1
$$ ##$CPDPRG= (0..8)
$$ <> <> <> <> <> <> <> <> <>
$$ ##$D= (0..63)
$$ 0 1 0 0 0 0 0 0 0 0 0 0 0 0 0 0 0.0002 0 0 0 0 0 0 0 0 0 0 0 0 0 0 0 0
$$ 0 0 0 0 0 0 0 0 0 0 0 0 0 0 0 0 0 0 0 0 0 0 0 0 0 0 0 0 0 0 0
$$ ##$DATE= 1519143245
$$ ##$DE= 6.5
$$ ##$DECBNUC= <off>
$$ ##$DECIM= 440
$$ ##$DECNUC= <off>
$$ ##$DECSTAT= 4
$$ ##$DIGMOD= 1
$$ ##$DIGTYP= 17
$$ ##$DQDMODE= 0
$$ ##$DR= 32
$$ ##$DS= 0
$$ ##$DSPFIRM= 0
$$ ##$DSPFVS= 20
$$ ##$DTYPA= 2
$$ ##$EXP= <B11zgbs.ucl>
$$ ##$FCUCHAN= (0..9)
$$ 0 3 0 0 0 0 0 0 0 0
$$ ##$FL1= 0
$$ ##$FL2= 0
$$ ##$FL3= 0
$$ ##$FL4= 0
$$ ##$FN_INDIRECT= (0..7)
$$ 0 0 0 0 0 0 0 0
$$ ##$FOV= 0
$$ ##$FQ1LIST= <>
$$ ##$FQ2LIST= <>
$$ ##$FQ3LIST= <>
$$ ##$FQ4LIST= <>
$$ ##$FQ5LIST= <>
$$ ##$FQ6LIST= <>
$$ ##$FQ7LIST= <>
$$ ##$FQ8LIST= <>
$$ ##$FRQLO3= 224700112
$$ ##$FRQLO3N= 0
$$ ##$FS= (0..7)
$$ 83 83 83 83 83 83 83 83
$$ ##$FTLPGN= 0
$$ ##$FW= 2.4e+08
$$ ##$FnILOOP= 0
$$ ##$FnMODE= 0
$$ ##$FnTYPE= 0
$$ ##$GPNAM= (0..31)
$$ <> <> <> <> <> <> <> <> <> <> <> <> <> <> <> <> <> <> <> <> <> <> <> <>
$$ <> <> <> <> <> <> <> <>
$$ ##$GPX= (0..31)
$$ 0 0 0 0 0 0 0 0 0 0 0 0 0 0 0 0 0 0 0 0 0 0 0 0 0 0 0 0 0 0 0 0
$$ ##$GPY= (0..31)
$$ 0 0 0 0 0 0 0 0 0 0 0 0 0 0 0 0 0 0 0 0 0 0 0 0 0 0 0 0 0 0 0 0
$$ [...]
$$ 524287 524287 524287 524287 524287 524287 524287 524287 524287 524287 524287
$$ 524287 524287 524287 524287 524287 524287 524287 524287 524287 524287 524287
$$ 524287 524287 524287 524287 524287 524287 0 0 0 0 0 0 0 0 0 0 0 0 0 0 0
$$ 0 0 0 0 0 0 0 0 0 0
$$ ##$ShimPowNum= 1
$$ ##$ShimPowRcbType= 3
$$ ##$ShimPowRes= (0..63)
$$ 1e-20 1e-20 1e-20 1e-20 1e-20 1e-20 1e-20 1e-20 1e-20 1e-20 1e-20 1e-20
$$ 1e-20 1e-20 1e-20 1e-20 1e-20 1e-20 1e-20 1e-20 1e-20 1e-20 1e-20 1e-20
$$ 1e-20 1e-20 1e-20 1e-20 1e-20 1e-20 1e-20 1e-20 1e-20 1e-20 1e-20 1e-20
$$ 1e-20 1e-20 1e-20 1e-20 0 0 0 0 0 0 0 0 0 0 0 0 0 0 0 0 0 0 0 0 0 0 0 0
$$ ##$ShimPowRng0= (0..63)
$$ 1 1 1 1 1 1 1 1 1 1 1 1 1 1 1 1 1 1 1 1 1 1 1 1 1 1 1 1 1 1 1 1 1 1 1 1
$$ 1 1 1 1 0 0 0 0 0 0 0 0 0 0 0 0 0 0 0 0 0 0 0 0 0 0 0 0
$$ ##$ShimPowRng1= (0..63)
$$ 1 1 1 1 1 1 1 1 1 1 1 1 1 1 1 1 1 1 1 1 1 1 1 1 1 1 1 1 1 1 1 1 1 1 1 1
$$ 1 1 1 1 0 0 0 0 0 0 0 0 0 0 0 0 0 0 0 0 0 0 0 0 0 0 0 0
$$ ##$ShimPowRng2= (0..63)
$$ 1 1 1 1 1 1 1 1 1 1 1 1 1 1 1 1 1 1 1 1 1 1 1 1 1 1 1 1 1 1 1 1 1 1 1 1
$$ 1 1 1 1 0 0 0 0 0 0 0 0 0 0 0 0 0 0 0 0 0 0 0 0 0 0 0 0
$$ ##$ShimPowRng3= (0..63)
$$ 1 1 1 1 1 1 1 1 1 1 1 1 1 1 1 1 1 1 1 1 1 1 1 1 1 1 1 1 1 1 1 1 1 1 1 1
$$ 1 1 1 1 0 0 0 0 0 0 0 0 0 0 0 0 0 0 0 0 0 0 0 0 0 0 0 0
$$ ##$ShimPowType1= 1
$$ ##$ShimPowType2= 0
$$ ##$ShimPowType3= 0
$$ ##$ShimPowType4= 0
$$ ##$ShimPowType5= 0
$$ ##$ShimPowType6= 0
$$ ##$ShimPowType7= 0
$$ ##$ShimPowType8= 0
$$ ##$ShimSysAngle= <>
$$ ##$ShimSysFunc= (0..63)
$$ 1 2 3 4 5 6 7 8 9 10 0 37 38 35 16 15 14 13 12 11 28 27 26 25 24 23 36
$$ 22 30 29 20 21 34 33 32 31 17 18 19 0 0 0 0 0 0 0 0 0 0 0 0 0 0 0 0 0 0
$$ 0 0 0 0 0 0 0
$$ ##$ShimSysMatId= <292722da.dat>
$$ ##$ShimSysMatrix= 1
$$ ##$ShimSysOffset= <29 mm>
$$ ##$ShimSysType= 4
$$ ##$ShimUnit= 3
$$ ##$TCubeEth= <192.168.180.38>
$$ ##$TCubeSeqDevice= <>
$$ ##$TOSITY= <no>
$$ ##$TRIPLO2= 0
$$ ##$TrxFreqFormula= (0..23)
$$ <TrxFreqFormula(1.0,'TRX',Trx(1.0,'TRX 1200.1',1,5.000000,1290.000000))>
$$ <TrxFreqFormula(1.0,'TRX',Trx(1.0,'TRX 1200.2',1,5.000000,1290.000000))>
$$ <TrxFreqFormula(1.0,'TRX',Trx(1.0,'TRX 1200.3',1,5.000000,1290.000000))>
$$ <> <> <> <> <> <> <> <> <> <> <> <> <> <> <> <> <> <> <> <> <>
$$ ##$VTU= 2
$$ ##$VTUETH= <192.168.99.11>
$$ ##$VTUTY= <no>
$$ ##$WBREFAM= (0..31)
$$ 99.8 100 100 100 100 100 100 100 100 100 100 100 100 100 100 100 100 100
$$ 100 100 100 100 100 100 100 100 100 100 100 100 100 100
$$ ##$WBREFLM= (0..31)
$$ 1 0 1 0 0 0 0 0 0 0 0 0 0 0 0 0 0 0 0 0 0 0 0 0 0 0 0 0 0 0 0 0
$$ ##$WBREFPH= (0..31)
$$ 0.05 0 0 0 0 0 0 0 0 0 0 0 0 0 0 0 0 0 0 0 0 0 0 0 0 0 0 0 0 0 0 0
$$ ##$WBSGU= (0..31)
$$ 1 2 4 0 0 0 0 0 0 0 0 0 0 0 0 0 0 0 0 0 0 0 0 0 0 0 0 0 0 0 0 0
$$ ##END=
$$ 
##$DECIM=	440
##$DSPFVS=	20
##XUNITS=	HZ
##YUNITS=	ARBITRARY UNITS
##FIRSTX=	22640.298828125
##LASTX=	-22814.248046875
##XFACTOR=	-0.34679331717160927218
##YFACTOR=	0.29579116799999999321
##NPOINTS=	131072
##XYDATA=	(X++(Y..Y))
$$ [...]
-26891 -887927 -1434659 -1981391 -2528124 -2389981 -2251838 -4448496 -6645155 -6494365 -3853123 -1772231
-26881 -1772231 -1185613 -1221608 -1257603 -1386990 -1516377 -97012 1322350 1247442 1172535 1097625 1022718 2442081
-26869 2442081 3861445 3177544 2493642 1809739 1125838 1500379 1874919 2249460 2624001 632611 -1358777
-26858 -1358777 -1855895 -2353014 -3068046 -3783079 -3003838 -2224599 -2870075 -3515549 -2666753 -1817954 -1716295
-26847 -1716295 -1614634 -1512972 -1411311 -1831089 -2250866 -2670644 -3090421 -1144268 801884 2748038
-26837 2748038 4694190 4754993 4815794 4876597 4937398 3472798 2008197 543598 -921002 -2447865 -3974726
-26826 -3974726 -4007317 -4039907 -3263099 -2486292 -1709484 -932676 1493082 3918842 2857967 1797093 -73178
-26815 -73178 -1943450 -1323269 -703088 1831628 4366345 6745411 9124474 9853614 8092297 5241409
-26805 5241409 2390521 1646790 903059 159328 -584402 -2697883 -4811364 -5430572 -6049781 -4676627
-26795 -4676627 -3303472 -1930317 -557163 -335843 -114525 -1387477 -2660429 -608723 1442982 1502325
-26785 1502325 -928785 -1741101 -1059145 -439450 -1314028 -2546607 -2284916 280446 1351536 -597049
-26775 -597049 -4039907 -7202588 -6878635 -4151782 -1424930 -970617 -516305 -1743047 -2969791 -1706080
-26765 -1706080 -442369 1264953 2972276 2189145 1406013 467229 -471553 83934 639420 -164139
-26755 -164139 -967699 -1771259 -2574819 -1168102 238614 -1841304 -3921220 -5791007 -7660793 -7040125
-26745 -7040125 -6419457 -6234619 -6049781 -4370669 -2691559 -1201178 289200 285309 281418 -158302 -598023
-26734 -598023 456528 1511079 1834060 2157042 -10431 -2177904 -2726582 -3275260 -1333484 608290
-26724 608290 905005 1201719 4161 -1193396 -803289 -413185 -1517350 -4115788 -6107178 -5608113
-26714 -5608113 -4112869 -2617625 -2803435 -2989247 -3175057 -3360869 -3010162 -2659457 -814478 1030500
-26704 1030500 509548 -11403 -2026629 -4041853 -4461630 -4881408 -5301186 -5720963 -5113428 -4505893 -3898360
-26693 -3898360 -3290825 -2792735 -2294644 -1796552 -1298463 -2823865 -4349267 -3384217 -2419166 -2605950 -2792735
-26682 -2792735 -2979519 -3166303 -3851178 -4536051 -2730473 569378 2443541 1827250 214779 -1397692
-26672 -1397692 -1017800 -637909 -258016 121874 -1264899 -2651673 -1547994 -444315 -648122 -851932
-26662 -851932 -1055741 -1259549 -1801904 -2344258 -1392340 -440423 1289761 3019944 3255856 3491769 3268503
-26651 3268503 3045237 1327701 -389835 -1578152 -2766468 -3954783 -5143099 -5578442 -6013786 -3958676
-26641 -3958676 -1903564 -377675 1148213 2674102 4199991 3632343 3064694 2403655 1742614 -132522
-26631 -132522 -3501930 -5937418 -5882454 -5115860 -4349267 -3427022 -2504775 -2796626 -3088476 -1823793 935163
-26620 935163 1872973 1316513 853445 1884648 3538464 5192281 5382956 4079361 2795220 3005351
-26610 3005351 3682444 4359536 3947054 2040300 86851 -372325 429289 483768 538246 1339860 2390521
-26599 2390521 1946909 1456601 2460565 4052120 4149403 1693972 -761457 -570782 -380107 -282824 -185541
-26588 -185541 433180 -442369 -1878271 -3314172 -2819974 -831502 269744 -1119462 -3458152 -5049707
-26578 -5049707 -4664466 -2784951 -889872 -489064 -1644790 -2800518 -1917185 -1033852 -150520 732814
-26568 732814 -609697 -1952206 -3621588 -4543834 -4660088 -3282070 -2277618 -2020305 -2027601 -2034896 -3427507
-26557 -3427507 -4820120 -4329324 -1348077 1633170 2123964 1120488 117009 358759 600508 624342
-26547 624342 -846095 -2316532 -2292698 -1397205 -501712 393781 1289274 2371551 1959556 -8972 -1977499
-26536 -1977499 -2296103 -1120434 55234 -263368 -1837898 -3412429 -4084170 -2265459 -135440 500305
-26526 500305 -358218 -1216745 -1297002 -1377262 -1971176 -1817954 -1275600 -2227519 -3693092 -5158664 -5921853
-26515 -5921853 -5190768 -3385677 -833447 1065036 473066 -632557 -991047 -929272 -1614634 -2673561
-26505 -2673561 -2238219 -43993 2150231 1791742 -61019 389889 840797 1198315 1555830 1321863
-26495 1321863 1087897 853931 619964 1008611 1397259 1785905 2174552 2594330 3014107 943432 -1127244
-26484 -1127244 -1919616 -2711989 -2508181 -3798644 -5524936 -4760776 -2253299 -1240092 -2779601 -5813381
-26474 -5813381 -7010453 -5717072 -3458639 -1200206 1058226 3316659 3659581 1512053 -2409924 -4837630
-26464 -4837630 -4245660 -1163239 1452223 2573413 2262594 1951773 1547561 1143348 1610795 2078241
-26454 2078241 2545687 3013134 2297615 1582097 866577 151059 743027 1334997 432693 -469608 -1200693
-26443 -1200693 -1931776 -1168589 -405400 357786 1120973 389889 -341195 -1469682 -2598167 -2232382 -1866597
-26432 -1866597 -940459 -14322 -1578639 -3142955 -3664392 -4185831 -3212998 -2240164 351462 2943091
-26422 2943091 4445146 3456746 1164750 -1127244 -3574892 -6022541 -6384435 -6746329 -4617769 -2489210
-26412 -2489210 -1434659 -380107 -1816009 -4746184 -8267840 -9299044 -7341703 -5384362 -5135804 -4887245
-26402 -4887245 -4638686 -4390127 -4888704 -5387280 -5885858 -6384435 -5777873 -5171312 -3070478 -969645 -1732832
-26391 -1732832 -2496021 -1391368 2203737 5162610 4634847 2737336 839825 1650681 2461539 1778122
-26381 1778122 1094708 -351410 -1797526 -4582261 -7366997 -7536756 -5216063 -3455720 -3189650 -3658555
-26371 -3658555 -4127462 -4689759 -5252056 -5440787 -5629517 -3327793 -1026068 -405400 215266 -658337 -1531942
-26360 -1531942 -1129190 -726436 -323682 79069 -329521 -738110 -2640973 -4543834 -2866669 -1189504
-26350 -1189504 -913220 -636935 604399 3340006 3865336 904031 -2057272 -2528124 -2127316 -1726508
-26340 -1726508 -1368506 -1010503 -652500 -294498 -310063 -325630 -341195 -356760 -2504775 -4652792 -5306536
-26329 -5306536 -5960279 -6333847 -6707416 -7080983 -7454552 -5257895 -3061237 -864579 1332078 166624
-26319 166624 -998829 -2164283 -3329739 -3000921 -2672103 -2343284 -2014468 -1405474 -796480 -187487 421506
-26308 421506 96579 -228345 -2047544 -3866743 -2323828 -780915 761998 2304911 3645477 4986041
-26298 4986041 4832333 4678625 4524918 4371210 1727049 -2411383 -4220854 -3539870 -1862706 -185541
-26288 -185541 308658 802856 1297056 1791256 2487804 3184353 2386629 1588906 1258142 927380 596616
-26277 596616 265853 -1517350 -3300553 -5083757 -6866961 -5443705 -4020449 -4091467 -4162483 -2513531
-26267 -2513531 -864579 784374 2433326 1031472 -370379 -277959 -185541 -556191 -926839 -1297489
-26257 -1297489 -1668139 -1789744 -1911348 -2032951 -2154555 -3280124 -4405692 -3040807 -1675922 -2676968
-26247 -2676968 -3678013 -4679057 -5680103 -4244202 -2808300 -2866669 -2925040 -3761677 -4598313 -3940678
-26237 -3940678 -3283042 -1714834 -146627 -1068874 -1991119 -2415274 -2839430 -1769314 -699197 750324
-26227 750324 2199845 2653186 616073 -1950261 -3022323 -2662374 -3796698 -5849376 -6407783 -4413475
-26217 -4413475 -2419166 -2105914 -1792661 -1479410 -1166157 -1988201 -2810246 -2138018 -1465789 -1571828 -1677867
-26206 -1677867 550893 2779655 3755406 2240705 -363569 -2967845 -5260812 -7553781 -6360114 -5166447
-26196 -5166447 -4232528 -3298607 -2364688 -1430767 -1306245 -1181722 -2551472 -3921220 -3625480 -3329739 -3033996
-26185 -3033996 -2738256 -2753821 -2769386 -1290679 188026 475012 761998 1048985 1335969 1342780 1349590 1356399
-26173 1356399 1363210 1370018 1376829 1383638 1390448 -563973 -2518395 -2978545 -3438696 -2343284 -1247875 -152465
-26161 -152465 942945 263907 -415130 -1094167 -1773205 -2701287 -3629371 -4557455 -5485537 -4950479 -4415420
-26150 -4415420 -5374634 -6333847 -6369842 -6405837 -6441832 -6477827 -7136436 -7795044 -8453652 -9112260 -6486583
-26139 -6486583 -3860906 -3725682 -3590458 -2178876 -767296 1982904 4733104 5271081 3318604 276554
-26129 276554 -2765495 -1667166 -568837 -964780 -1360723 -1274142 -1187559 393294 1974149 2340906 2707665
-26118 2707665 3074424 3441181 1986308 531437 -269691 423452 1054335 1685217 2409492 3133766 2519422
-26107 2519422 1905077 1290733 676389 1525185 2373983 2569037 1269818 311576 -646664 -204025 238614
-26096 238614 961429 1684244 1753316 328114 -902520 -2133153 -1962908 -1792661 -2182768 -2572874 -2962980
-26085 -2962980 -3353086 -3199378 -3045670 -2051435 -2551472 -3705252 -4859032 -3615751 -2372471 -965753
-26075 -965753 440963 353408 265853 645259 1024663 3188 -1018285 -1847627 -1182695 -424372 -1160320
-26064 -1160320 -2736797 -2819000 -2340854 -1862706 -1213339 -563973 925920 921543 -826152 -2573847 -2858401
-26053 -2858401 -1648683 -988129 -1821847 -1721645 -1621442 -1458980 -1296517 -1134053 -971590 -1478436 -1985282
-26042 -1985282 -3332656 -3185759 -2571902 -1958043 -2745065 -3532088 -2811218 -2090349 -2926013 -5255949 -7585884
-26031 -7585884 -8421548 -7700679 -6979809 -6554681 -6129552 -4303544 -2477536 -620397 -257531 -548408
-26021 -548408 -839284 -479336 -119388 -413185 -2201252 -4269495 -6337739 -5946659 -4061309 -3537925
-26011 -3537925 -4508812 -5946659 -4894054 -2347176 199700 1252305 810639 -845121 -2500884 -3596295
-26001 -3596295 -3197433 -2767440 -2337448 -3308335 -4279223 -2930876 -1582530 -887927 -1687596 -1864651 -2041707
-25990 -2041707 -2218763 -2395818 -2340854 -791615 -20646 -1740129 -4113356 -3996130 -1948802 98525
-25980 98525 239101 379674 520248 660824 1112705 1564585 2016466 2468347 667148 -1134053 -1440982
-25969 -1440982 -1747912 -1120920 -493929 -2357391 -4220854 -3679472 -3138090 -2596708 -2055326 -1046985
-25959 -1046985 -38643 969697 1978040 2027168 2076295 2125425 2174552 262448 -1649655 -2067487 -2485319
-25948 -2485319 -2949848 -3414375 -3785511 -4156647 -3842908 -2034896 333464 211375 -2021764 -4254903
-25938 -4254903 -3157060 -2059218 -2206602 -2353986 -2501371 -2648755 -3566624 -4484491 -3908088 -3331685 -2755280
-25927 -2755280 -2178876 -3096745 -4014612 -2774738 -1534861 -294985 944891 659363 373838 -1405961
-25917 -1405961 -3185759 -3930463 -4675166 -3925598 -3176031 -1648196 -120361 1407472 2935309 4382884
-25907 4382884 5830459 6281855 4242795 616073 -1516377 -1096112 818422 686117 -940459 -3127388
-25897 -3127388 -2823865 -1679813 -2030033 -2878344 -3726654 -2057272 -387890 1281491 2950874 3157114
-25887 3157114 3363354 3569596 3775836 3382812 2989786 2596762 2203737 1810713 1417687 931271 444854
-25876 444854 -498307 -2935741 -5933527 -6440859 -4675653 -2910446 -3480041 -4049635 -4362402 -4675166
-25866 -4675166 -4987932 -5300699 -5504508 -5708316 -7406396 -9104477 -8369501 -7634526 -6152414 -4670303
-25856 -4670303 -2581143 -491983 -893277 -1294572 -2435218 -3575865 -3222241 -2868615 -2297076 -1725536
-25846 -1725536 -1153996 -582456 -1106327 -1630199 -659798 310604 1997010 3683417 2879370 2075323 329573
-25835 329573 -1416174 -671472 73232 631153 1189072 1746992 2304911 3103121 3901331 4699541 5497752
-25824 5497752 3431939 1366127 296498 1717321 2546661 1881729 1279059 2170661 2190604 716275
-25814 716275 -664661 -551326 943432 2438189 1535887 633583 571808 510033 1942530 3375029 3375514
-25803 3375514 3376001 1882216 388431 46478 -295471 -2131694 -3967917 -4823037 -5678158 -6533279 -7388399
-25792 -7388399 -4118706 -849012 428317 -784807 -1422011 -564945 883603 837879 -1091249 -3020377
-25782 -3020377 -2552444 -2084511 93662 2271835 1959556 1647277 369946 -907383 -2184713 -3462043
-25772 -3462043 -2171094 -880144 -523113 -2656538 -5599359 -6051727 -4511732 -1477464 954132 1891457
-25762 1891457 2112777 839825 -837825 -2515477 -3539383 -4563292 -3820533 -3077774 -3082152 -3086530 -2623947
-25751 -2623947 -2161366 -1698782 -1236201 -2077215 -2918229 -3759245 -4600259 -3075341 -1550426 -25509
-25741 -25509 1499405 915220 331032 -253153 -837339 -5081 827178 1659437 2491695 2248488 2005279
-25730 2005279 2509207 3013134 933217 -1146700 -1732345 -2317991 -3160466 -4002938 -4098276 -4193614 -599968
-25719 -599968 2993677 4096871 5200063 4602743 4005425 3408105 2810785 2011116 1211447 411778 -387890
-25708 -387890 -806208 -1224527 -2389981 -3555435 -4674194 -5792953 -3425076 -1057200 2068513 5194227
-25698 5194227 3837124 2480021 297956 -1884107 -1575719 -1267331 -577593 112144 54748 -2648 -1959017
-25687 -1959017 -3915383 -3381299 -2847213 -2932822 -3018431 -2356906 -1695378 -1765422 -1835467 -1251766 -668065
-25676 -668065 -590240 -2006686 -4730619 -4964098 -2364688 234723 1495514 2756306 116523 -2523259
-25666 -2523259 -4073470 -3133225 -792102 1549020 2551524 3554031 3513657 3473284 1035850 -1401583
-25656 -1401583 -1659870 -423885 -28428 -2123425 -4612419 -5607141 -5107591 -4608041 -3890577 -3173111
-25646 -3173111 -2455648 -1738184 -1728941 -1719699 -1710456 -1701215 -1691974 -1682731 -1673489 -1664248 -1815524 -1966799 -2118075 -2269351
-25632 -2269351 209914 2689181 1681813 674443 -1196802 -3068046 -4192155 -5316264 -3669744
-25623 -3669744 -2023223 -376703 1269818 1500864 1731912 2710097 3688281 3685848 3683417 1283924 -1115569
-25612 -1115569 -1055741 498360 1211934 -564945 -2372957 -2686696 -2408951 -2131207 -2873966 -2122451 123333
-25601 123333 874846 -397133 -1669111 -2380740 -1598095 600994 2800083 4438822 4583287 3887225
-25591 3887225 3191163 2401709 1612254 701195 -209862 -1120920 -2031979 -3005299 -3978617 -3457665 -2936713
-25580 -2936713 -1746451 -556191 73719 -790643 -3149277 -4013640 -2418681 -823719 732934 795317
-25570 795317 203956 -387403 -1227810 -2068217 -1414350 -760485 -1421891 -2083295 -2744701 -3406105 -2977937
-25559 -2977937 -2549770 -3522481 -4495193 -5069042 -4148621 -1578273 992073 449354 -93364 -75732 1436172
-25548 1436172 3236034 3541627 3286866 3032105 1500986 -30131 -1000897 -477390 -246342 -1509566
-25538 -1509566 -1838871 -2168174 -2030520 -1892864 -3249480 -4606095 -4048176 -3490256 -2932335 -2374416 -1909887
-25527 -1909887 -1445360 -980832 -516305 -1073252 -1630199 -2187146 -2744093 -3207648 -3671203 -4134758 -4598313
-25516 -4598313 -5980222 -7362133 -8090299 -7324192 -5686427 -4048662 -3811777 -3574892 -3926207 -4277521
-25506 -4277521 -3227956 -2178389 -1595784 -2507451 -2578589 -2649727 -2253906 -1858084 -1462263 -1066441 -141398
-25495 -141398 783644 152152 -1973608 -3762771 -4057661 -3792199 -3526738 -3292405 -3058074 -2823743 -2589413
-25484 -2589413 -2386212 -2183011 -1886418 -1589826 325560 3735219 5214778 4203883 3440696 2677507
-25474 2677507 3346330 4015153 3967970 5415060 7422501 6939490 3654718 369946 -580025 -1529996
-25464 -1529996 -2729014 -3928031 -1640414 647204 1078656 1510107 1941558 2373010 3894036 5415060
-25454 5415060 4445631 3476204 1277113 -921976 -3027673 -2642918 -888413 866092 285796 -294498
-25444 -294498 -1357319 -2420139 -3482960 -4545779 -4736941 -4928103 -5119265 -5310427 -3011136 -711843
-25434 -711843 93175 898194 -1565504 -4029205 -4002453 -3975700 -3088963 -2202224 -2809759 -3417294 -3651260
-25423 -3651260 -3885225 -4119193 -4353159 -3170681 -1988201 -805722 376755 -308604 -993966 655472
-25413 655472 2304911 3702387 2609408 582510 49884 1540750 3031618 2125425 1219230 359731
-25403 359731 -499766 -1359264 -2218763 -1646250 -1073738 -501225 71286 -930245 -1931776 553326 3038429
-25392 3038429 2846293 2654159 2462024 2269890 3416374 4562859 4215070 3867282 2616705 1366127
-25382 1366127 1609823 1853517 4141134 6428753 5727826 2536446 -810587 -2663348 -2025655 -1387964
-25372 -1387964 -1575232 -1762503 -1949774 -2137044 -1639440 -1141835 -644231 -146627 -1330080 -2513531 -2202711
-25361 -2202711 -1891890 -1798985 -1706080 -1613173 -1520268 -2174498 -2828728 -3482960 -4137190 -3125930 -2114669
-25350 -2114669 -1103410 -92149 -692387 -1292624 -1145727 -998829 1280518 3559867 4344943 5130019
-25340 5130019 2817595 505170 -312982 -1131135 -1171022 -1210908 -1250794 -1290679 430263 2151205 1475084
-25329 1475084 798965 652068 1999442 2412896 335897 -1811146 -3958189 -3770432 -3582674 -3348222
-25319 -3348222 -3113769 -2132181 -1150592 -1829630 -2508666 -1693432 -878198 -1603932 -2329665 -1561128 -792589
-25308 -792589 -810100 -827610 493496 1814604 1112218 -2080619 -4619715 -4668357 -3391999 -3609915 -4419312
-25297 -4419312 -3734437 -1555289 623855 1402122 2180389 1448819 717247 -14322 -745892 -652500 -559108
-25286 -559108 -465717 -372325 249316 870955 2084078 3297202 4058931 2330206 -332438 -1500812 -1315000
-25275 -1315000 -1129190 -849986 -570782 657905 1886594 -371353 -2629299 -1388935 -148574 344653
-25265 344653 837879 957538 1077195 -297417 -1672030 -1708025 -1744020 -2527151 -3310281 -1898701 -487119
-25254 -487119 924461 2336043 1477517 618992 -239533 -1098058 -337788 422478 1182748 1943017 991101
-25243 991101 39183 -912733 -1864651 -1649168 -1433687 -2712476 -3991265 -2746525 -1501784 -1004179
-25233 -1004179 -506576 -2312641 -4118706 -5177636 -6236564 -4330298 -2424031 -2012036 -1600041 -674389
-25223 -674389 251261 1924048 3596834 2221734 846634 218671 -409292 1141890 2693072 2749984
-25213 2749984 2806894 676876 -1453143 -2088889 -2724636 -3111336 -3498038 -2390468 -1282896 -998342
-25203 -998342 -713789 -1923507 -3133225 -2459539 -1785852 -1859301 -1932750 -2286374 -2639999 -4487897 -6335794
-25192 -6335794 -5444192 -4552590 -2913853 -1275114 -530896 213321 957538 1701756 1652140 1602525 58639
-25181 58639 -2979519 -5589631 -5709289 -3836585 -1963880 -651528 660824 -517277 -1695378 -1719699
-25171 -1719699 -1744020 -1768340 -1792661 -3233428 -4674194 -5367824 -6061455 -7081956 -8102459 -5636326 -1675922
-25160 -1675922 183163 -448206 -1079575 -1710943 -2662374 -3613806 -3070965 -2528124 -2031979 -1535833 -2533961
-25149 -2533961 -3532088 -2763549 -1995010 -479336 1036337 668606 300876 -66856 -434587 -1744020
-25139 -1744020 -3053453 -4362887 -5672321 -5020523 -4368724 -3716926 -3065128 -2156501 -1247875 -2829702
-25129 -2829702 -4411529 -4592476 -4773423 -4860978 -4948533 -4083685 -1724562 1194908 1623929 -453069 -2530070
-25118 -2530070 -3268449 -4006830 -3585593 -3164357 -3490256 -3816155 -3535005 -3253858 -2972708 -2691559 -3448911
-25107 -3448911 -4206261 -3469339 -2732419 -1435145 -137872 -1331052 -2524231 -1779529 -1034824 -290120
-25097 -290120 454582 -108201 -670985 -1233769 -1796552 528518 2853590 1692026 -963808 -2872506
-25087 -2872506 -2290752 -868470 -940459 -1479410 -2018359 -1156429 -294498 863173 2020844 2431380 2841915
-25076 2841915 2621569 2401222 2180876 1960528 2502884 3045237 1097138 -850958 -4806985 -8763013
-25066 -8763013 -9730495 -8207525 -5096889 -3480528 -4354619 -5228709 -4104600 -2980491 -1856382 -732273
-25056 -732273 -1040174 -1348077 -1655979 -1963880 -2240651 -2517423 -4288466 -6059509 -6040538 -6021569 -5255462
-25045 -5255462 -4489356 -2878830 -1268305 342221 1952745 1477517 1002288 1274194 1546102 2284968
-25035 2284968 3023836 2268431 1513025 -316387 -2145801 -2480941 -2816083 -2161366 -1506649 -851932 -197215
-25024 -197215 -118416 -39615 39183 117983 -1064009 -2246001 -4175131 -6104259 -5994328 -5884399 -4280197
-25013 -4280197 -2675994 -715734 1244523 714329 184134 -906411 -1996956 -1593230 -1189504 -1439524
-25003 -1439524 -1689541 -3433831 -5178122 -4852222 -4526323 -4947559 -5368797 -5523477 -5678158 -4338567
-24993 -4338567 -2998975 -1083467 832043 -178730 -3679959 -6636399 -7102386 -5638271 -4174157 -4359969
-24983 -4359969 -4545779 -3237319 -1928859 344653 2618164 3397403 4176644 2761171 1345697 677361
-24973 677361 9024 -2091321 -4191668 -3801562 -3411457 -2492129 -1572802 -1400609 -1228419 -1668626 -2108832
-24962 -2108832 -1054767 -703 -549867 -1099032 -1648196 -2197361 -84853 2027655 2645890 3264125
-24952 3264125 1158428 -947269 -3052968 -5158664 -5618328 -6077992 -5790521 -5503048 -6009408 -6515768
-24942 -6515768 -5527856 -4539942 -4034555 -3529168 -1685163 158841 959969 -729355 -2698856 -3174085
-24932 -3174085 -2541744 -3403673 -4825957 -6248239 -4666412 -3084585 -2997029 -2909474 -3662447 -4415420 -3674122
-24921 -3674122 -2932822 -2611786 -2290752 -2716854 -3142955 -3795725 -4448496 -3606995 -2765495 -1363642 38211
-24910 38211 -1050389 -2138990 -2293670 -2448352 -1855895 -1263440 -219590 824260 -466690 -1757640
-24900 -1757640 -1873164 501766 3437046 2885692 -62721 -3011136 -3687011 -4362887 -3785753 -3208621
-24890 -3208621 -296687 2615245 3130118 1154537 -914437 -2983410 -4041609 -5099809 -2827026 -554245
-24880 -554245 582267 -771672 -1534131 193863 2863562 3042805 1291948 -458908 233992 926893
-24870 926893 125522 -2170120 -3391027 -2121479 144248 2409978 2838997 3268016 2202765 1137511
-24860 1137511 1317486 1497460 -657365 -2812191 -4500056 -3697470 -809128 2079215 3068587 4057957
-24850 4057957 3553057 3048157 2652214 2256270 1113190 -29887 951700 1933289 2914879 3896466 3492741
-24839 3492741 3089015 2685289 2281564 3223995 4166429 2618408 -423885 -2905827 -2897314 -2888801 -2880290
-24828 -2880290 -2607167 -2334043 -2060920 -1787798 -2355202 -2922607 -1995740 -1068874 -607021 -145168 -181406
-24817 -181406 -1711917 -3211296 -2220221 763214 3746651 2877667 2008684 1139701 270718 896005
-24807 896005 1521294 2146583 2771872 2780142 2788409 1302407 -183595 -642285 -1100977 -65395 970184
-24796 970184 278013 -414157 1228471 2871101 3579811 1798065 -77069 -1952206 -1556750 -1161293
-24786 -1161293 -765835 -370379 554298 1478975 909383 339788 -1770772 -3881334 -3501443 -3121551 -2119047
-24775 -2119047 -1116542 -2511099 -3905655 -2428409 543111 2144881 260016 -2496506 -5253030
-24766 -5253030 -4740832 -4228637 -2766953 -1305272 -1337862 -1370451 -1714349 -2058246 -2402142 -2746038 -3494634
-24755 -3494634 -4243230 -4991824 -5740419 -6208839 -6677258 -5651406 -4625552 -3428481 -2231410 -1034337
-24745 -1034337 162733 -258990 -680713 391835 1464384 2124451 2784518 3444587 4104654 4422283
-24735 4422283 4739915 3563272 2386629 276068 -1834493 -2450783 -3067074 -2998488 -2929904 -2861319 -2792735
-24724 -2792735 -1264899 262935 1790770 3318604 2106940 895276 1177885 1460493 3260721 5060948
-24714 5060948 3374542 193863 -2364201 -2431813 -507062 1417687 1463410 1509133 60584 -1387964
-24704 -1387964 -3085556 -4783151 -3990293 -3197433 -3066100 -2934768 -1309163 316441 -205971 -728382
-24694 -728382 -1250794 -1773205 -2023223 -2273242 -4017532 -5761821 -6603323 -7444824 -6792052 -6139282 -3587539
-24683 -3587539 -1035798 -974508 -2407492 -3124471 -1350995 2165796 4188318 3225699 768807 -287202
-24673 -287202 151059 1336456 2521853 3800644 5079433 4537077 3994723 3452369 2910014 1589393
-24663 1589393 268772 -958456 -2185687 -1138431 1403096 2170174 446800 -2521801 -2999947 -551813
-24653 -551813 1896322 -247316 -2390953 -2137531 -1884107 -2969304 -5548771 -7194319 -6349413 -4159079
-24643 -4159079 -1968745 283850 2536446 1707106 -616505 -2099591 -1092221 491064 580078 -1821361
-24633 -1821361 -4222800 -5254489 -6286179 -3986887 -1687596 -1075197 -2953252 -4270955 -4094385 -2081106
-24623 -2081106 -67828 544570 1156968 189486 -777996 744973 2267944 1549507 831069 1513512
-24613 1513512 2195954 2031059 371892 -446747 1225067 3519494 4319650 3625534 2931416 1497947
-24603 1497947 64476 -1368992 -2802463 -1278520 245423 275096 304767 1060171 1815576 1076710
-24593 1076710 337843 -1677381 -3692605 -3217376 -2742147 -1893350 -1044552 -195756 653041 38696 -575647
-24582 -575647 -1189991 -1804335 -1745479 -1686622 -1627766 -1568910 -2786411 -4003912 -5065759 -6127606 -6271100
-24571 -6271100 -3924140 -736651 956565 -1054767 -4560372 -5793438 -3539870 -877712 1784446
-24562 1784446 3170246 4556048 4447577 4339106 1740182 -858742 -3255316 -5651891 -5558014 -5464135
-24552 -5464135 -4498597 -3533060 -1073252 1386557 1566045 1745533 430748 -884035 -3257262 -5630489
-24542 -5630489 -6509444 -7388399 -8002744 -8617087 -6740978 -3370597 -1743534 -2606923 -4310842 -4520486
-24532 -4520486 -4222313 -3924140 -3532575 -3141008 -2469267 -1797526 -1125784 -454043 -895222 -1336402 -1777583
-24521 -1777583 -2218763 -2442028 -2665294 -2888558 -3111823 -1950747 -789670 -2119047 -3448424 -2536392
-24511 -2536392 -1624362 -2206602 -2788842 -2203684 -1618525 -1033365 -448206 -1077143 -1706080 -2335017 -2963952
-24500 -2963952 -2808785 -2653618 -2498451 -2343284 -3028646 -3714007 -3060750 -2407492 -2882721 -5848404 -8160342
-24489 -8160342 -8978009 -7927835 -5383389 -3586080 -1788770 -2514503 -3240238 -3965972 -4691705 -4141082
-24479 -4141082 -3590458 -3039833 -2489210 -2249893 -2010577 -3265531 -4520486 -2818028 -1115569 586888
-24469 586888 2289346 2468347 2647349 2826350 3005351 1316513 -372325 -2061163 -3750002 -2076728
-24459 -2076728 -403455 1269818 2943091 2125910 1308730 -847067 -3002866 -5687401 -5881480 -3149277
-24449 -3149277 -417076 1225553 377729 -563487 -1504703 -1083952 -663202 -242451 178298 505657 833015
-24438 833015 1160374 1487732 1015420 543111 70799 -401509 -1434172 -2466834 -2005225 -1543616 -467175
-24427 -467175 609264 191432 -226399 -488579 -750757 -1012935 -1275114 -3630345 -5985574 -6846531 -7707489
-24416 -7707489 -7198697 -6689905 -6181113 -5672321 -5692751 -5713181 -4239337 -2765495 -575647 1614201 2309776
-24405 2309776 3005351 2918770 2832187 4239878 5647567 5000632 4353699 3706765 3059831 2856508 2653186
-24394 2653186 2356471 2059758 1140431 -1273168 -2908501 -2053381 -694819 -1826711 -4733050 -6145119
-24384 -6145119 -7059095 -7973072 -8793657 -9614242 -8730422 -7846604 -6962784 -6078966 -3576352 -1073738 -1061578
-24373 -1061578 -1049417 992073 3033564 3985482 2446945 -430208 -3307363 -2853536 -2399709 -1595662
-24363 -1595662 -791615 -2384631 -3977645 -2084026 1303865 2855049 1915778 57667 -306172 -171921
-24353 -171921 -37670 -806208 -1574747 -2343284 -3111823 -2744093 -2376362 -2008631 -1640899 221103 2083106
-24342 2083106 1454656 826206 -500740 -1827684 -1660357 -1493029 -360651 771726 1904105 3036483
-24332 3036483 3133766 3231049 837879 -1555289 -1426876 -1298463 -1170048 -1041635 -1989660 -2937687 -3792320
-24321 -3792320 -4646955 -4878975 -3616723 -860201 1896322 2847267 1307758 235209 656933 1763529
-24311 1763529 1375855 -1471140 -4318137 -5019064 -4225717 -2778629 -1331539 -1223067 -1114597 -1006125
-24301 -1006125 -897655 -477877 -58100 314982 688063 360705 -713789 -2208548 -2209034 -847554 513926
-24290 513926 474525 435126 364596 294065 223534 153004 -446747 -1046498 -1646250 -2246001 -2285402 -2324802
-24278 -2324802 -3251425 -2683776 -873820 188999 -724977 -1638953 -1727969 -1816982 -3400268 -4983554 -5306049
-24267 -5306049 -5628543 -5857646 -6086748 -6035675 -4490328 -1450710 1588906 2208115 336871 -1020718
-24257 -1020718 -884035 139872 416641 -240505 -897655 211860 2068513 1901672 240559 -1669598
-24247 -1669598 -2832620 -1956584 413724 2292751 2677507 1599121 520735 64963 1103462 2702315
-24237 2702315 4301166 4569181 3342926 1556317 -230290 -1036283 -348003 527059 2149259 3682444
-24227 3682444 4468493 4600798 3985967 3106526 1479949 -613588 -1212853 437071 2086997 1339860
-24217 1339860 -901546 -3127388 -2862778 -1119462 1370992 2330206 1795148 232777 -582456 -759512
-24207 -759512 -936567 -1066928 -1197287 -1491084 -1784879 -1580584 117983 2688209 2767981 14861 -2738256
-24196 -2738256 -2826783 -424858 576186 1577232 1582097 1586960 1591825 1596688 1056767 516844 -23078 -563000
-24184 -563000 -1476491 -2389981 -3303472 -4216963 -3585593 -2954224 -2322856 -1691487 -3270395 -4849304 -4933940
-24173 -4933940 -5018577 -3920248 -2821919 -1816982 -812045 -242938 -1168102 -2747012 -1835467 701682
-24163 701682 1744560 1293165 841771 2382738 3923707 2974221 2024735 2880829 3736923 3098743 2460565
-24152 2460565 1635603 810639 -14322 -839284 42102 923489 1804876 2686263 2571467 2456674 -148574
-24141 -148574 -4248093 -5281242 -3823937 -3020377 -3711089 -3623534 -3535979 -3541816 -3547653 -3232941 -2918229 -2603519
-24129 -2603519 -2288807 -2721230 -3153655 -2091808 -1029961 -1501299 -1972636 -949702 73232 1843302
-24119 1843302 3613373 2892990 2172607 300389 -1571828 -1949774 -2327719 -2020792 -1713862 87338
-24109 87338 1888540 1378288 868038 -1136485 -3141008 -3090908 -3040807 -2990706 -2940605 -3389568 -3838530
-24098 -3838530 -4287492 -4736456 -3660016 -2583576 -1507135 -430695 -1408879 -2387062 -874792 637475
-24088 637475 -122792 -883062 -1643331 -2403601 -1237660 -71719 1094221 2260162 2554444 2848726
-24078 2848726 3143007 3437289 2424083 1410878 397672 -615533 -1753262 -2890990 -2534446 -2177904
-24068 -2177904 -1653546 -1129190 889440 2908068 3370164 3832261 1803902 -224453 439991 1104436
-24058 1104436 274609 -555217 -1229391 -1903564 -87284 1728995 1877838 2026681 2175524 2324369 -297417
-24047 -297417 -2919203 -2054354 -1189504 -114525 960456 541165 121874 -826638 -1775151 -1229391 810639
-24036 810639 3718926 4136758 1721697 -693360 -2423544 -1663274 186567 2036409 1496973 957538
-24026 957538 1912374 2867210 1860814 854416 -1646250 -4146918 -3740760 -3334602 -2928444 -2522286
-24016 -2522286 -5976331 -9430377 -10798666 -9676503 -7744943 -5813381 -5220439 -4627497 -5248652 -5869806
-24006 -5869806 -5557040 -2753821 763457 1790283 1883188 1976095 3750056 5524017 3437776 -1138918
-23996 -1138918 -3801076 -2976600 -782374 1411850 -440910 -2293670 -4146432 -5999193 -4532647 -3066100
-23986 -3066100 -3093826 -3121551 -3678498 -4235445 -4792392 -5349341 -4629930 -3910520 -3191109 -2471699 -351410
-23975 -351410 1768881 1398718 -465717 -416102 2123964 3169761 1725103 -311037 -852905 99499
-23965 99499 1051902 463338 -125225 780483 1686189 194836 -1296517 -2787870 -4279223 -3630345 -2981464
-23954 -2981464 -3733465 -4485465 -3276233 -572728 294065 -1329593 -3155601 -3487337 -2387062 -2781060
-23944 -2781060 -4513677 -4752021 -3433831 -2115642 -2729014 -3342385 -2461484 -1580584 -2162824 -2745065
-23934 -2745065 -836853 1071358 1220688 1370018 1519348 1668678 1600095 1531509 1462925 1394340 839338
-23923 839338 284337 -270663 -825665 -166570 492523 -342653 -1177830 -1732832 -2287833 -2842835 -3397836
-23912 -3397836 -2147259 -896681 353894 1604471 1705647 1806822 -551326 -4403747 -5921366 -4450442
-23902 -4450442 -2263514 -76584 1067467 2211519 3355571 4499623 3090961 1682298 273635
-23893 273635 -1135027 38211 1211447 890411 569378 -280878 -1131135 -487119 156896 -491010 -1138918
-23882 -1138918 -292552 553811 933217 1312622 -798426 -2909474 -3244129 -3578783 -3913438 -4248093 -3275260
-23871 -3275260 -2302426 -1329593 -356760 40156 437071 2328260 4219448 1565558 -1088330 -2247947
-23861 -2247947 -3407566 -1317919 771726 2861373 4951018 4301166 3651314 4464602 6772162 7445364
-23851 7445364 5130019 2098671 -932676 -1255657 -1578639 -1901618 -2224599 -3189163 -4153727 -2658970
-23841 -2658970 330060 3132307 2946009 2043707 1141403 2029113 2916824 2310263 1703701 474525
-23831 474525 -754648 413237 1581123 1826765 578132 -110146 2190117 4832820 5981250 4670355
-23821 4670355 3359463 2593356 1827250 1061143 295039 -253153 -801344 144735 1090816 1572126 2053435
-23810 2053435 1040472 27509 -658581 -1344671 -2777899 -4211126 -4539214 -4867302 -3701117 -2534933
-23800 -2534933 -1882405 -1229877 916922 3063722 4412799 5761875 4620499 3479121 2960358 2441595
-23790 2441595 428559 -1584475 -2375632 -3166789 -1467493 231803 343436 455069 566702 678334
-23780 678334 1795633 2912933 2535959 2158987 1922102 1685217 2195467 2705719 2274268 1842817 2749984
-23769 2749984 3657151 4330837 2514071 -143222 -1306245 -190891 2418733 3285042 1660896 -1146214
-23759 -1146214 -2459052 -2121966 -290607 1789796 3870201 3553544 3236886 2422137 1607390 792641
-23749 792641 -22105 -18457 -14809 -11161 -7512 -284039 -560567 1653357 3867282 2937011 2006738 1076467
-23737 1076467 146194 -1795824 -3737843 -4185588 -4633334 -3038131 -1442928 899411 3241749 3187028
-23727 3187028 3132307 1583312 34319 228642 422965 -129846 -682658 -2122695 -3562733 -3508497 -3454261
-23716 -3454261 -2941091 -2427922 -1914752 -1401583 -3316605 -5231628 -4656197 -4080765 -2524718 -968671
-23706 -968671 587375 2143422 2049543 1955665 -628666 -3212998 -4822551 -6432104 -5551203 -4670303
-23696 -4670303 -2980004 -1289707 -1093680 -897655 -654933 -412211 2165311 4742832 6510956 5788627
-23686 5788627 3976726 2164824 2737823 3310822 3883821 4456820 4095898 3734977 3280664 2826350 690982
-23675 690982 -2938659 -5914556 -5901910 -3834639 -1767368 -2003766 -2240164 -2626379 -3012595 -908357
-23665 -908357 1195882 373838 -448206 -1363642 -2279079 -1887027 -2989247 -4931994 -3886199 -1595176
-23655 -1595176 695845 683198 670552 770753 870955 971158 1071358 -198188 -1467734 -2737282 -4006830
-23644 -4006830 -2365660 -724490 -577593 -430695 -968671 -1506649 -2044626 -2582602 -3566137 -4549671 -4038933
-23633 -4038933 -3528196 -1367534 793128 -532842 -1858814 -834421 189971 -186513 -563000 -1344186
-23623 -1344186 -631098 -478364 -3314172 -6806645 -8804845 -8188069 -6077020 -3716926 -1356832 1096653
-23613 1096653 3550139 3030646 2511153 1991660 1472167 1466330 1460493 707519 -45452 36265 117983 1693972
-23601 1693972 3269962 3865336 4460711 5056085 5651458 5141695 4631930 2627892 623855 627746 631638
-23590 631638 635529 639420 1394340 2149259 3651314 5153368 6484204 7815040 4663060 1511079 -613588
-23579 -613588 -2738256 -3368651 -3999047 -2637081 -1275114 -2403601 -3532088 -4804553 -6077020 -5855213
-23569 -5855213 -5633408 -4197505 -2761603 -1325702 110199 1444928 2779655 5608654 8437655 8931852
-23559 8931852 9426052 7429799 5433544 2950874 468203 -84366 1853517 3729141 3114310 569378
-23549 569378 -1975554 -3454261 -4932968 -4917403 -4901836 -3454261 -2006686 -4045744 -6084803 -7409802
-23539 -7409802 -8734801 -7569347 -6403892 -7417584 -8431276 -7950697 -7470117 -3736382 -2648 2236814
-23529 2236814 4476276 3882847 3289420 2695991 2102562 2903205 3703846 2014035 324223 408859 493496
-23518 493496 578132 662769 669578 676389 683198 690008 2720312 4750615 4290464 3830315 4350780 4871247
-23506 4871247 5391712 5912177 4907240 3902303 2897368 1892431 1377801 863173 441936 20698
-23496 20698 128683 1730940 3893549 3565704 1844762 123820 737677 1351536 471121 -409292 -1289707
-23485 -1289707 -2170120 -606777 956565 1025635 1094708 -50317 -1195341 -846095 -496847 321304 1139457
-23474 1139457 463338 -212780 -795507 -1378234 -466690 444854 181217 -82421 -346058 -609697 -748812
-23463 -748812 -887927 467229 1822387 463825 -894735 -2253299 -3611860 -4005371 -4398882 -2301939
-23453 -2301939 -204997 436585 1078169 225480 -627207 232290 1091788 1951287 2810785 2240219 1669652
-23442 1669652 2593356 3517062 2105967 694873 1774231 2853590 3403727 3953865 3009729 2065595
-23432 2065595 716762 -632070 509548 1651168 1843788 2036409 2229030 2421652 1213393 5133
-23422 5133 291146 577160 -514359 -1605877 -206943 1191991 567432 -57126 -681687 -1306245 -924894
-23411 -924894 -543543 2172607 4888758 6546466 5713720 3791401 1869082 1129729 390376 1985823
-23401 1985823 3581269 4740886 3410051 1985823 561595 983803 1406013 1828223 2250433 1800985
-23391 1800985 1351536 902085 452636 1723158 2993677 1773744 553811 -1693432 -3940678 -2701287
-23381 -2701287 32374 542137 -1438550 -2858886 -2784951 -1372397 -1454115 -2096186 -2738256 -1644790
-23371 -1644790 -551326 542137 1635603 4223339 6811077 5912177 5013280 2417761 -177758 -2773277
-23361 -2773277 -5368797 -4975772 -4582748 -4189722 -3796698 -5038034 -6279369 -6026432 -5773495 -4430985
-23351 -4430985 -3088476 -4236419 -5384362 -4260740 -3137116 -3507767 -3878417 -4996202 -6113987 -3900792
-23341 -3900792 -1687596 -579538 -1961934 -4278251 -5100295 -4210152 -3320011 -2336476 -1352941 395726
-23331 395726 2144394 499820 -1144755 -18700 2601626 3011675 -64910 -4052068 -5548771 -4181455
-23321 -4181455 -2814137 -1415689 -17241 1381207 2779655 2636162 2492669 2349175 2205682 1968797
-23311 1968797 1731912 1495027 1258142 1698350 2138557 1084493 30428 -743462 -1517350 199214
-23301 199214 1915778 3863391 5811003 4271981 1238686 -549380 153004 295039 -1057200 -2767440
-23291 -2767440 -2983410 -2639027 -2294644 -1763477 -1232310 793128 2818567 2818567 2818567 5153368 7488168 8889048
-23279 8889048 7799475 6616509 5433544 3581269 1728995 -123279 -1975554 -3298607 -4621660
-23270 -4621660 -4450442 -4279223 -4200424 -4121625 -2548553 -975482 1718293 4412068 4615391 4818713 3387675
-23259 3387675 1956637 2019872 2083106 1866164 1649222 1432280 1215338 1519835 1824332 -205971 -2236273
-23248 -2236273 -3301526 -1876325 638448 3153222 1589880 26535 -1536807 -3100150 -2982436 -2864723
-23238 -2864723 -2747012 -2629299 -497820 1633657 2270862 2908068 2860399 2812731 2765062 2717393 1728021
-23227 1728021 738651 1243551 1748451 2813704 3878956 3449937 1526646 142303 1248414 3195054
-23217 3195054 3647422 1640466 -366488 -972562 -1578639 -1601012 -1623388 -1645764 -1668139 -881116 -94095
-23206 -94095 692928 1479949 -116955 -1713862 -1816496 -1919130 -2986815 -4054499 -3627912 -3201324 -3350654
-23195 -3350654 -3499984 -2155042 -810100 -834908 -859714 -884522 -909329 -247316 414696 1076710 1738723
-23184 1738723 1622468 1506216 -104310 -1714834 -1083952 -453069 177811 808693 -272609 -1353914
-23174 -1353914 -2435218 -3516523 -2477049 -1437578 -351410 734759 1369532 2751442 3152736 2059758
-23164 2059758 1029041 1492596 2936767 3633801 3194568 2755334 2269403 1783472 -214238 -2211952
-23154 -2211952 -1719212 -1226473 -920517 -614560 -308604 -2648 -1229877 -2457106 -2190063 -1923022 -2589898
-23143 -2589898 -3256775 -2367119 16807 2113749 2716421 1762557 808693 477444 146194 1309217
-23133 1309217 2472239 2786951 3101662 3369678 3637693 3049616 1714402 1359803 2499479 3390107
-23123 3390107 2786464 2603084 3166842 3154681 1648249 95121 36265 1775205 2019872 -288174 -2596221
-23112 -2596221 -3036429 -3476636 -3823450 -4170266 -3196946 -729355 1738236 2711556 3342439 3973321 3016540
-23101 3016540 2059758 1134107 208456 -717195 -1642844 -3969376 -6295908 -6925817 -6061455 -4875571
-23091 -4875571 -2942550 -589267 269744 148139 -1467734 -3177003 -3391999 -2416248 -1440496 -1351969
-23081 -1351969 -2010577 -2466834 -1428822 122846 1674515 1435685 -297417 -1610255 -2175959 -2990706
-23071 -2990706 -3805455 -4059850 -5061381 -6171871 -5788088 -3318550 -101877 1542696 1693000 1796607
-23061 1796607 3394486 4719485 4550211 1983877 -582456 -1156429 760053 3610454 4966585 3715519
-23051 3715519 2464456 2614273 2764090 2540337 2316585 2092834 1869082 1063091 257098 -548894 -1354886
-23040 -1354886 -1040174 -725464 -410752 -96040 -209375 -322710 -436045 -549380 -2063596 -3577811 -3597754
-23029 -3597754 -2123425 -1242525 -2852078 -5302157 -6257967 -5221413 -4184859 -3988832 -2298535 582510
-23019 582510 1969284 1223608 -269205 -905924 -1542644 -3066587 -3096258 -786265 1523727 2370577
-23009 2370577 1723158 1309217 2389549 3002920 2869155 3031131 3940244 4802661 4917942 4286088 3654231
-22998 3654231 3069072 2483912 2704746 4419851 4734076 3554031 1175452 291146 543111 1542211
-22988 1542211 2689181 3836152 3473284 1616146 568404 1014935 1461465 413724 -827124 -573702
-22978 -573702 2559307 4945181 4607122 2774790 2296643 3312767 2585574 364109 -1343699 -2304372
-22968 -2304372 -2159907 -2015440 -1824278 -1633116 -992992 -352868 -1207017 -2061163 -1452169 -843175 -234182
-22957 -234182 374810 1248414 2122019 2948928 3775836 2003333 -516305 -1619497 -232236 688063
-22947 688063 114090 -1860760 -3835611 -3413403 -1496920 -420967 654987 2197900 3740814 3836152
-22937 3836152 3931489 3886738 4589124 5711774 5340152 3308876 1277600 709465 1635603 2281564 1433252
-22926 1433252 631638 1324295 2748523 3425616 3122092 2818567 2094780 1370992 2203737 4530755 6870419
-22915 6870419 7715811 6506580 2806894 -1888972 -5090567 -5303618 -3026214 -79502 1372938 1486760
-22905 1486760 3094852 5450083 7805312 6767299 5729285 3765134 1800985 2327287 2853590 2228058
-22895 2228058 1602525 976995 351462 -849986 -2051435 -3252884 -1963880 1255225 2980058 2214439
-22885 2214439 1448819 1176426 904031 631638 359245 740596 1121946 1503297 1884648 1347643 810639
-22874 810639 273635 -263368 320332 904031 1487732 2071432 2225139 2378847 2532555 2686263 2964493
-22863 2964493 3242723 2026681 810639 427343 44047 2151205 4258362 4871247 5484130 6097016
-22853 6097016 6709901 5357906 4005910 2653916 1301920 2907340 4512758 4623904 4735050 3515360
-22843 3515360 2295670 1075980 -143709 -678524 -1213339 -253883 705573 2044435 3383297 4722159
-22833 4722159 6061022 6559355 7057690 6061751 5065813 2886910 708006 23374 -661257 -1408148
-22823 -1408148 -2155042 -1407663 -660283 -784320 -908357 -534302 1334023 2673129 1521781 -470095
-22813 -470095 -967699 1196369 3360436 3127442 2894449 1260575 -373298 -512899 -652500 145709
-22803 145709 943917 1742127 2540337 2809326 3078315 856849 -1364614 -1749371 -2134127 -1024609 84906
-22792 84906 665200 1245496 1825791 2406087 2054163 1702241 1910672 3613373 5378336 5649027 4300922
-22781 4300922 1458547 -558865 -1082006 -48615 984777 1955908 2927039 3804778 4682516 4410366
-22771 4410366 2643944 2325098 3500523 5033953 5820246 5625921 5431598 5299536 5167475 5035412
-22761 5035412 4903349 4210935 3518521 4320379 5122237 4808985 4495732 4182481 3869228 4131893 4394558
-22750 4394558 5637839 7628256 8645839 8169151 6665151 5908286 6318822 6729359 6252669 7270254
-22740 7270254 9140039 9515554 7385048 5254543 5879102 7250797 6552303 4359536 2657077 954619
-22730 954619 -685578 -2325774 -2160392 495442 3244669 3503443 2444513 2879856 4716078 6552303
-22720 6552303 6302771 4558966 2768466 2472239 2471753 1724130 -4107 -1732345 -892305 -52263 787778
-22709 787778 1627820 3162464 4697109 4737482 4777853 4693705 4609554 4525403 4441254 4964152 5487050 5449596
-22697 5449596 3917870 2650755 2877910 2591411 1557776 692928 -171921 410805 993532 1872001
-22687 1872001 2750469 1652140 -193323 -1260522 -833447 729895 3040374 5148503 6509497 7263443
-22677 7263443 7270254 6088748 4907240 4239391 5065813 6172412 5784736 4836711 3888684 3975754 4062822
-22666 4062822 4149890 4236958 5693777 7150595 6957487 5270108 3882847 2495588 3411996 4328405
-22656 4328405 4902377 3982076 3061776 3635747 4412068 5188390 4563831 3939272 3937326 3935381 3933435 3931489
-22644 3931489 2086510 241531 -513872 1221175 3890144 6559112 6737626 5421870 4510812 3599754
-22634 3599754 1754775 1404068 3357032 5309994 6702605 6600944 7288251 7975557 8569471 9163387
-22624 9163387 8294162 7424934 6555707 5686481 5323127 4959774 4596421 4233067 3963106 3693146 3423183
-22613 3423183 3153222 2680911 2208602 2296643 3878956 5959361 6545492 4672301 2799111 2085538
-22603 2085538 2866236 2806407 2746577 3184839 3623101 4061363 4499623 4221393 3943163 3664933 3386703
-22592 3386703 2672644 1958582 2178444 904031 -1677867 -2765495 -397618 1970258 3622128 3779727
-22582 3779727 4684462 5589198 5451055 3818641 3026755 2234868 1816550 1398231 139385 374810 1481895
-22571 1481895 2588980 3696063 4803148 6034755 5772090 3952891 2133692 2337015 4034609 4891675
-22561 4891675 5748741 6169979 6591216 7012452 7433690 7138921 6844152 6549384 6254615 5025927 3797238
-22550 3797238 1728021 1153077 3463556 5774036 7181725 6098961 5265243 5925797 7084442 8243085
-22540 8243085 7432716 6622346 5811977 5001606 4284627 3567650 2850671 2133692 3304985 4476276 5647567
-22529 5647567 6818859 7678843 8538828 6908360 5277890 3017025 756161 985749 1215338 1662842
-22519 1662842 2110345 4052120 5993896 7235231 8476568 9717903 10959238 10675169 10391104 10107036
-22509 10107036 9822967 8869592 7916215 6962838 6009461 7390884 8772307 6667097 4561885 4073522
-22499 4073522 3585161 3096798 2608436 1902159 1195882 2980058 4764234 6875283 8986333 7610746
-22489 7610746 6235159 5762362 5289564 4910160 4530755 5721502 8406522 10157622 9418269 6593161
-22479 6593161 3768053 3277744 2787437 4414014 6040592 6733250 4935453 3324441 4203883 5021062
-22469 5021062 3347789 -818856 -3491228 -2178876 1623929 4025853 4933507 5343070 5752634 5500669
-22459 5500669 5248706 4996741 4744778 5395603 6046429 5202983 4359536 3134738 1909942 3175598
-22449 3175598 4441254 5395603 6349952 4813848 3277744 2683344 2088943 3984995 5881047 6594135
-22439 6594135 7307221 8020307 8733394 7843739 6954083 6064427 5174770 4503029 3831287 3159546 2487804
-22428 2487804 4796825 7105844 6924412 6742978 6343629 5944281 5544933 5145586 5051707 4957828 4863950
-22417 4863950 4770071 4769586 4769099 4768612 4768125 2969843 1171561 867551 563541 788750 1013961 2733445 4452928
-22404 4452928 4432985 4413042 5887371 7361700 6719144 6076587 5434031 4791475 4242310 3693146 3143981
-22393 3143981 2594817 2076782 1558748 2534987 3511225 4409638 5308048 6206459 7104872 9808862 12512851
-22382 12512851 13224482 11445656 8063601 6175816 7774667 9373518 7952696 6531873 5111050
-22373 5111050 3690226 3794807 3899386 4003965 4108545 4586693 5064840 5542988 6021136 5876669 5732204
-22362 5732204 5587737 5443272 5828028 6212783 8091810 9970838 8503320 7035801 5568281 4100763
-22352 4100763 5092565 6084370 6982781 7881193 7363159 5350852 2778194 2695991 3143007 3590024 4192696
-22341 4192696 4795366 4275873 3756379 1742614 -271150 1170587 2612327 4054066 5495806 6641804
-22331 6641804 7787801 8933799 10079797 9856044 9632292 9408543 9184790 8506237 7827688 7149136
-22321 7149136 6470585 6912736 7354889 7797043 8239194 7257119 6275045 5292970 4310894 4605176 4899458
-22310 4899458 5193740 5488023 5272540 5057057 3347302 1637548 1297543 957538 2018412 3079287
-22300 3079287 3299633 2025709 191432 847608 3931976 7016343 6769730 6523117 5312913 4102708
-22290 4102708 2892503 1682298 2869155 4056011 2752414 1448819 1281491 1114164 2441109 3768053
-22280 3768053 5063868 6359681 7655495 8951308 6808644 4665979 4017586 3369191 4246201 5123210
-22270 5123210 4505947 3888684 5185957 6483231 6286232 6089233 5518667 4948100 4377534 3806966 4026340
-22259 4026340 4245715 4465089 4684462 4125569 3566676 5498237 7429799 7306734 7183671 7060608 6937544
-22248 6937544 7437094 7936645 8436195 8935743 6839288 4742832 4140649 3538464 4306031 5073596 4346889
-22237 4346889 3620182 5617409 7614637 9518472 11422305 9372548 5828514 3218402 3098743 6594135
-22227 6594135 10089523 11250116 12410705 10645013 8879321 5775008 2670698 1854490 3528736 6136902
-22217 6136902 7250797 5905369 4559940 5611572 6663206 6776541 6889876 7003211 7116546 7011967
-22207 7011967 6907386 5401927 3896466 4725808 7049421 8439112 7338352 5459324 3580296 4036068
-22197 4036068 4491841 5628597 6765354 7902108 9038863 8650217 8261571 6472044 4682516 5570227
-22187 5570227 7952210 8497481 6552303 3891116 2724204 3051561 3378921 4012234 4645549 6773136
-22177 6773136 8900722 8475594 8050466 7625337 7200209 7382130 7564049 7745969 7927888 7736241 7544593
-22166 7544593 7352944 7161297 6531873 5902449 5273027 4643603 4792447 4941290 6584405 8227520 8096188
-22155 8096188 7964857 7833524 7702192 8878348 10054502 11230659 12406813 11162561 9918304 9327797
-22145 9327797 10231559 10824014 11416470 12102318 12788164 11232603 9677043 8121483 6565922 5383930
-22135 5383930 4201937 3673688 4639712 5597952 6556194 7607826 8659460 9430917 10202373 10880439
-22125 10880439 11558502 11660652 10268524 8783010 8791766 10668361 11050684 8973685 6896686 6231754
-22115 6231754 7061094 7049906 7038719 6903008 6767299 6724981 6682662 5924338 6660286 7489626 6824696 4790014
-22103 4790014 4249606 6261912 9768489 11428630 10598318 8865213 7132111 7453633 9269424 10244690
-22093 10244690 11219956 10918865 10617774 10316680 10015589 8842840 7670088 8987790 10305493 12045893
-22083 12045893 13786290 14872945 14465330 13621884 12778437 11841597 10904761 10839579 10774398 12110101 13445800
-22072 13445800 13411749 11883431 8798575 5713720 4257388 4295329 4987013 5678698 6183599 6688499
-22062 6688499 7193399 7698301 9713038 11727777 12092588 10963129 10456282 9949438 9349197 8748959
-22052 8748959 7999391 7249824 6593648 5937472 5219035 5994869 7424447 8854027 8586983 8319940 8146291
-22041 8146291 7972640 6616024 6753678 8541259 10328841 9178465 8028089 7531458 8529101 9122043
-22031 9122043 9714985 10401318 11087653 10871196 10654740 10531676 10408613 10814771 12715203 15175983 15146314
-22020 15146314 11645084 8143857 6136902 5624219 5718585 5812949 6747841 7682734 8212929 8743124 8619574
-22009 8619574 7001752 5430625 3859499 3751514 5137803 6016271 5400468 4784664 5663132 7070823
-21999 7070823 6984239 6337307 5690372 5417005 5143640 4870273 4596907 5101808 5606708 6111609 6616509
-21988 6616509 6578568 6540628 6502689 6464748 7049421 7634093 8218768 8803440 9995159 11186882 12378601
-21977 12378601 13570324 13392293 13214265 13036237 12858210 12703526 12548846 12394166 12239486 12364983 12490477
-21966 12490477 12615971 12741469 13116010 13490551 13211347 11437873 7765426 4092980 3409077 5215629
-21956 5215629 6807671 8399713 8653135 8906560 8319453 7732348 7705596 9173117 10360458 10053528
-21946 10053528 9186247 8318967 8805871 9292775 8285406 7278036 7056716 6835396 7361213 7887030
-21936 7887030 7385534 6884039 7783423 8682808 9216407 8255733 7388452 6521171 6494419 6467666 5693777
-21925 5693777 4919888 4988958 5058031 5127102 5196172 5514289 5832405 6897658 7962911 9518472 11074032
-21914 11074032 10979668 9391030 8814140 8237250 7566968 6896686 5909260 4921833 4588152 5748741 8559258
-21903 8559258 11369774 12281320 10702408 8967847 8727559 9981542 11235521 12738551 14241578 15744604
-21893 15744604 17247634 16391053 15534473 13183622 10832771 10318627 9804484 10037476 10270472 9701851
-21883 9701851 9133230 9311745 9490259 9824427 10158596 10492764 10826932 11425713 12024490 11128996 10233503
-21872 10233503 10598801 10964103 10582266 10200429 10441204 10681978 10922756 11163531 9536467 7909406
-21862 7909406 8772794 9636183 10532163 11428143 11576988 11725830 10925187 10124548 10320085 13006077 16462557
-21851 16462557 18424762 17740861 15562685 13602427 11642166 11082788 10523407 12394166 14264925 16135684
-21841 16135684 18006443 16281608 14556776 13579076 12601380 14472139 16342898 15723204 15103507 13721112
-21831 13721112 12338715 12450591 12562467 12019625 11476786 10933943 10391104 9568084 8745068 9416325 10087579
-21820 10087579 11085706 12083832 11587688 9597271 8571905 10036993 12342606 13153949 13381592 13609236
-21810 13609236 15237760 16866281 16564703 16263125 14467274 12671426 12011842 11352262 12186952 13021646
-21800 13021646 11926235 10830823 11229686 11628548 12785246 13941944 12608189 11274437 8913369 6552303
-21790 6552303 7117519 10173187 12357201 12050758 10810393 9570032 10555511 11540993 11779337 12017681
-21780 12017681 11987521 11957365 10432934 8908504 9096262 9284019 9471777 9659531 8469755 7279982
-21770 7279982 6837342 6394704 7710946 9027189 11744316 14461439 15317046 14678379 13385971 12093562
-21760 12093562 11735073 11376583 11018094 10659604 9732981 8806358 9374005 9941655 10805045 11668434 11878079
-21749 11878079 12087723 11954934 13316411 16078772 17346863 16529195 14217256 11998711 9780163 8168665
-21739 8168665 8051440 10486929 12922414 13505629 12594571 11636818 12173335 12088210 11255951 10563780 10618745
-21728 10618745 11747720 13623828 14519321 13920544 13041589 12909770 13758564 14607363 13868497 13129627
-21718 13129627 13091202 13052776 12926792 12053676 12161174 13762943 14991147 14725074 13058124 12885448 13701169
-21707 13701169 14516890 13931731 13346571 13150544 12954517 12011355 11068193 10729164 10390131 11545371 12700609
-21696 12700609 13482282 14263951 14298489 14333024 14733343 15133666 16934866 18736066 19369868 18509396 18489453
-21685 18489453 18469510 18294400 18119290 17944180 17769070 17220392 16671714 16123037 15574359 14706591 13838824
-21674 13838824 12971056 12103289 12854318 13605345 14262981 14920614 15357419 14299946 13616045 13679279 13695817
-21663 13695817 12965221 12281320 12344553 12298829 12253107 12254077 12255051 12380548 12506042 11292920 10079797 9786488
-21651 9786488 11983630 15114697 18245761 19711332 18686453 17101220 16263125 16047642 15085024 14169101
-21641 14169101 14000316 13613614 13226912 13447260 15161879 17810903 18965657 17505434 14550938 12001142
-21631 12001142 10945617 10450447 9955273 10557458 11159640 13256098 15352554 17480139 19607725 20085386
-21621 20085386 19068777 17873163 16677553 16882819 17088089 15923605 14759125 13501251 13737651 14464356
-21611 14464356 15191062 14423496 15150205 17526835 19903467 21377311 20360699 18879076 18891720 20305247
-21601 20305247 21718775 22182815 21152585 19468610 17784638 16552056 15319477 13433152 11546828
-21592 11546828 11263733 12474912 13686091 13402996 13065423 12727847 13791155 14854463 15279590 15704718
-21582 15704718 15382710 15060703 14310650 13560594 15207600 16854607 18205874 18062868 17266117 16469365
-21572 16469365 15312668 14155966 14400149 14644331 13954591 11770581 9960138 11636331 14900184 18164041
-21562 18164041 18159176 18154314 18273973 18393632 17112410 15831186 15050003 15763090 17129919 18496752 18929662
-21551 18929662 19362572 19795482 20228393 20684654 21140911 21036818 19438453 17233039 16521899 19266261
-21541 19266261 22010626 23405181 23305465 23299143 23292818 23519975 23747132 23880898 24014662 23502466 21495996
-21530 21495996 19489527 18977331 18402871 17828416 17347346 16866281 17589585 18312886 19036187 19759487 20327138
-21519 20327138 20894785 21369042 21843299 22854556 22371546 20331999 18292456 17591529 18384876 18431084
-21509 18431084 18477296 19116933 21250844 22544222 23837604 23605586 23373564 23141542 22909524 22584109
-21499 22584109 22258697 21933285 21607873 21500374 21392876 19884498 18376120 18967114 21052383 23137651
-21489 23137651 23728649 23292331 22856017 23166837 21983384 20286278 18589168 18292943 17996713 18385363
-21479 18385363 18774008 20563534 22353064 23155163 22462993 21677428 22386138 22721280 21562148 20496409
-21469 20496409 20924941 22007218 23089496 22770896 22452293 21978036 21503779 20188993 20368481 23355568
-21459 23355568 26342652 27337374 25841643 23007292 20172941 18272513 18862537 20744483 22626429 24010284
-21449 24010284 23899868 21859351 19818830 16844394 15364228 16300094 17235957 18265217 19294473 20292600
-21439 20292600 21290726 20794583 20298439 21094216 21889994 22685772 23481549 23312274 23143003 22973731 22804457
-21428 22804457 23259744 23715028 24170315 24625600 24115838 23606073 23096308 22586543 23602182 24617817
-21418 24617817 24979711 23847334 23026262 22205193 22785000 23364808 24707806 26050801 25743872 23942672
-21408 23942672 22857477 21772279 20593694 19415106 20384533 21353964 22323391 23292818 24947124 26601426
-21398 26601426 26699194 25302692 23608504 23408586 22274748 21140911 21407954 21674998 21942041 22209084
-21388 22209084 21978036 21746988 23010210 24273436 24166911 24060383 23953859 23847334 23564239 23281144
-21378 23281144 24398929 25516715 25700581 24390177 23079769 23263635 24295809 25327987 24056492 22785000
-21368 22785000 22073860 22856990 22799592 22742196 22533035 22323878 22114717 21905559 21883185 21860808 23332704
-21357 23332704 24804601 25576061 26347517 25718093 25088669 24459246 25324096 26188946 25559522 24457789
-21347 24457789 23356052 22254318 21152585 21763039 23867764 26532840 26707464 25963733 25220002 25814891
-21337 25814891 26409777 24358560 22307339 21750392 21193445 20426367 19659285 21289269 22919250 24082274
-21327 24082274 23751023 23326382 24396012 25574600 25258915 24382878 23506844 24498645 25490450 25828509
-21317 25828509 24672298 24565287 24458272 24257871 24057466 23016535 21975602 22428942 22882285 22837534
-21307 22837534 22792783 23401777 25505041 27888483 30271924 30102653 28439108 27806766 27174425 26542083
-21297 26542083 25909742 26086796 27758124 28588923 29419725 29013080 28606435 28199790 27793145 29347735
-21287 29347735 30902322 31803167 31209738 29614291 28018845 27824279 27629709 26874791 26119873 25364956
-21277 25364956 24610035 25131473 25652912 26174351 26695790 26501223 26306657 26112091 25917525 25468076 25018627
-21266 25018627 26966237 28913851 29429452 28450781 27472111 27987715 28814623 29641530 29067558 28493585
-21256 28493585 29382756 30271924 31161096 32050267 30864383 29678499 28492615 27306731 28829214 30351697
-21246 30351697 30379909 30408122 29883765 29359409 28835052 28310693 28564605 28818514 29072423 29326332 29687252
-21235 29687252 30048175 30409095 30770016 31130939 31491859 31852779 32213700 31741877 31270054 30798228 30326405
-21224 30326405 31255459 32184517 30623118 29061723 29493659 29925599 30357535 30789472 30972364 31155257
-21214 31155257 31338153 31521045 30629930 29738812 27509080 25279345 25446672 28104453 30855627 31116344
-21204 31116344 30434390 31246707 31996759 31252542 29605535 29452799 29860418 30268033 28986812 27705590
-21194 27705590 29911004 32116418 33294520 34472621 34156449 33840280 33120870 32401457 31682048 30962638
-21184 30962638 31924283 32885931 33847575 34809220 33249282 31689343 32619858 33550376 33764885 33979395
-21174 33979395 32699630 31419869 33818389 36216909 37525860 36344350 33388397 30432443 31803654
-21165 31803654 33174861 33409800 33644740 32385405 31126074 30987446 30848818 30710186 30571558 30852222
-21155 30852222 31132883 31413547 31694208 31352257 31010307 29174082 27337861 29463016 31588171 32219051
-21145 32219051 32849936 32360114 31870292 31380470 30890648 31095431 31300211 31504994 31709773 32194730 32679687
-21134 32679687 34658918 36638146 35986835 35335524 34684213 34032899 35436213 36839524 36748561 36657605
-21124 36657605 35989756 35321903 34654053 33986204 34688104 35390001 34597628 33805258 34678374 35551494 36424610
-21113 36424610 37297726 37112406 36927079 36741752 36556432 35627862 34699291 36261173 37823056 38606676
-21103 38606676 39390290 37683457 35976621 36324407 36672197 34716317 32760433 32890305 36008725 39127145
-21093 39127145 39257013 37146450 35035890 34232817 33429743 33311545 33193344 34569419 35945491 35360332
-21083 35360332 34775172 34190013 33604853 34513964 35423079 36332193 37241308 39955993 42670685 43673190
-21073 43673190 41687154 38829455 37466027 37565746 37665458 37103650 36541834 37474296 38406758 40708970
-21063 40708970 43011182 41826752 40642329 38982191 37322047 37156180 36990313 37322534 37654761 36679492
-21053 36679492 35704226 34643353 36571024 39152433 40239578 39209831 38180091 38551225 38922358 39186484
-21043 39186484 39450609 39714735 39978861 39464714 38950574 38436428 37922288 37898454 37874619 37850785 37826950
-21032 37826950 38332334 38837724 39343108 39848498 39199135 38549764 40390854 42231937 44726771 47221599
-21022 47221599 46229798 45237997 43600233 41962463 41818970 41675476 41189546 40703615 40217691 39731761
-21012 39731761 39035695 38339636 39137842 39936053 41107833 42279605 43451385 44623164 42713006 40802847
-21002 40802847 40386959 39971078 41485288 42999505 44513722 46027932 46724485 47421030 46623312 45825587
-20992 45825587 45650477 45475367 46794527 48113688 47565010 47016332 46467655 45918977 45899524 45880064 44366334
-20981 44366334 42852604 41811674 40770744 43216449 45662147 46706972 47751797 48796622 49841440
-20972 49841440 51477750 53114053 51263728 49413395 48403595 47393795 47878265 48362735 47649651 46936560
-20962 46936560 47717746 48498932 47972629 47446325 48414298 49382265 48871526 48360788 46355778 44350769
-20952 44350769 44898473 45446184 47394768 49343352 48581626 46325622 44723363 46109652 48336466 50563287
-20942 50563287 51482612 52401943 51826997 51252050 49182834 47113617 47410333 47707043 49498029 51289016
-20932 51289016 51234538 51180060 48821910 46463767 46035715 48596217 52806640 55522786 55188131 54853483
-20922 54853483 54425431 53997386 51919413 49841440 50253921 50666407 49693573 48720738 49366700 53001203
-20912 53001203 55297093 54604436 53444820 53779469 55670661 57561847 58052159 58542464 57912067 57281669
-20902 57281669 56651279 56020881 55384162 54747442 54110723 53474003 52619366 51764736 52404370 53044011 52313901
-20891 52313901 51583784 50853675 50123565 50700939 51278319 51855693 52433073 54166174 55899275 55141923
-20881 55141923 54384571 53222522 52060472 52392700 52724921 54707069 56689217 57177095 57664967 56316137
-20871 56316137 54967300 55953266 56939232 57300155 55170626 53601444 53526533 54136504 54746468 55449830
-20861 55449830 56153184 56514107 56875031 55741677 54608324 57086133 59563942 59551291 59538647 58329415
-20851 58329415 57120184 55910952 54701721 54364145 54026569 53688999 53351423 54975082 56598741 56728130
-20841 56728130 56857519 56115245 55372971 56124975 56876972 56411961 55946944 55481933 55016916 55672608 56328294
-20830 56328294 54493533 52658766 52536193 52413613 52291033 52168460 53166584 54164713 56657114 59149514
-20820 59149514 58773999 58398484 58022969 57647454 57178549 56709644 58731192 60752740 62097195 63441650
-20810 63441650 62295653 61149655 60719662 60289670 61353954 62418232 61188087 59957936 58727791 57497639
-20800 57497639 56360884 55224130 56577828 57931526 61020760 64109987 63712585 63315183 62077255 60839321
-20790 60839321 61095664 61352007 60878721 60405441 59932154 59458874 60542125 61625376 62552969 63480570
-20780 63480570 64159116 62347216 59445737 56544264 57067160 57590063 59607229 61624402 62623986 63623576
-20770 63623576 63128889 62634202 63540396 64446589 63858512 63270435 63546231 63822034 64097829 64373625 65956911
-20759 65956911 67540197 66633030 65725863 66301296 66876729 67452155 68027588 67171011 66314427 65613507 64912580
-20748 64912580 64810914 67199707 69681891 72164074 72342592 72521110 70209168 67897233 67724064 67550901
-20738 67550901 68872009 70193116 70331261 70469399 69113273 67757141 67085890 66414633 67237646 68060666
-20728 68060666 67825243 67589813 68848661 70107509 69658056 69208611 70253429 71298254 73557172 75816097
-20718 75816097 74619509 71928652 69502406 70064701 71343009 72621309 71720464 70819619 72409234 73998842
-20708 73998842 74529520 75060205 73100431 71140656 71515685 71890713 73760011 75629310 76074380 76519451
-20698 76519451 76964522 77409593 77885794 78362001 77343932 76325855 74525632 72725403 74411809 76098215
-20688 76098215 75729996 75361783 74993564 74625345 76008226 77391113 78773995 80156876 79422871 78688874
-20678 78688874 77954869 77220865 77780246 78339621 78899002 79458383 78398966 77339550 76280134 75220717
-20668 75220717 76250951 77281178 78311411 79341645 81025617 82709589 82899297 83088998 82204692 81320386
-20658 81320386 80529470 79738560 81562617 84880958 86549365 85229231 81772752 78316273 78159649 78003025
-20648 78003025 77753004 77502990 77252969 77002948 78245743 79488539 79237064 78985583 80041598 81097607
-20638 81097607 82153615 83209631 83207197 83204762 84696605 86188442 85438872 84689310 83939740 83190171 86544017
-20627 86544017 89897856 90636722 88387047 86106242 86813978 88082062 87855882 88003263 89644921 92127105
-20617 92127105 91620747 89059758 87993046 89385657 90778275 89257249 87736223 86215197 84694171
-20608 84694171 85912646 87131120 88349595 89568069 91533679 93499289 93970621 94441967 93885994 93330007
-20598 93330007 94268304 95206615 93325639 91444664 91057958 90671260 91841092 93010924 92686486 92362047
-20588 92362047 92224389 92086731 93443344 94799963 93230302 91660634 91585236 91509845 91337649 91165460
-20578 91165460 94324249 97483045 98213642 96453779 96094809 95735826 95081108 94426402 95265954 97599776
-20568 97599776 98159158 96228079 93456475 92179148 93026489 93873823 94814555 95755286 96135662 96516039
-20558 96516039 98390686 100265346 99960848 99656349 99351850 99047352 100112603 101177855 102243106 103308371
-20548 103308371 101416199 99524039 100122340 100720627 101132133 101543640 101955160 102366667 101626333 100886014
-20538 100886014 101639951 102393902 103023319 103652750 104282167 104911597 106161682 107411780 106171418 104931057
-20528 104931057 103379381 101827719 101770313 101712922 102745096 103777270 104809444 105841618 105690836 105540041
-20518 105540041 103894988 102249922 102206148 102162374 102118586 102074812 101968778 101862730 103250966 104639202 106323174
-20507 106323174 108007146 108694942 110877009 112747774 112128067 109671672 108709533 109128829 109548125 108566527
-20497 108566527 107584943 108907024 110229105 111551187 112873268 112856730 112840191 112823652 112807113 114907460
-20487 114907460 117007807 116617694 116227594 117084172 117940749 116306880 114673011 113910784 113148571 112479747
-20477 112479747 111810924 111391155 112465643 112699619 112933581 113260934 113588300 113915652 114243018 115071387
-20467 115071387 115899741 116728110 117556478 118384846 119213214 120041582 120869951 121278063 121686162 122094260 122502373
-20456 122502373 123688737 124875114 125968088 127061062 127466253 126377160 124634336 122891498 122113720
-20447 122113720 121335941 121211908 122582145 124901863 127221580 127144242 127066904 127612180 128157443 128609330
-20437 128609330 129061216 128801952 127048418 125294883 125035633 126114989 127194345 125970035 124745726 124455331
-20427 124455331 125659208 126022572 126385923 128150154 129914386 131678617 133442848 134942474 136442099
-20418 136442099 136291790 134647225 134279005 133910786 133542567 133174348 134502758 137325425 139307580 138799276
-20408 138799276 138415491 139525978 139640288 139754598 139102314 138450029 137891135 137332241 137209181 138580391
-20398 138580391 140605334 142630289 142787400 142944511 143101622 143258746 142139497 141020248 139994403 138968544
-20388 138968544 139796912 142119551 143601664 145083777 146036665 146989554 148782981 149082125 147451163 145820215
-20378 145820215 145590134 145360067 145005465 144650863 144296262 143941674 144491805 145041950 146992962 148943973
-20368 148943973 148622463 146806668 145924789 145042924 146200105 148851557 152001103 155150663 155965400 154289704
-20358 154289704 152613995 153428746 154831817 156234874 154306973 150884789 148645560 148896791 150144212
-20349 150144212 151391633 151284855 151178090 151071326 150964561 152819018 154673475 155033675 155393862 155444695
-20339 155444695 155495528 157040632 158585735 156332889 154080056 153321481 152562918 153174106 153785281 155890739
-20329 155890739 157996198 160226176 162456155 164686120 166916099 166941887 166967662 166993437 167019226 168912845
-20319 168912845 170806465 171205815 171605164 172300249 172995334 172289552 171583757 171469446 172849420 174789735
-20309 174789735 174239590 171356110 168472643 168920134 169367639 172149954 174932254 176220285 177508315 177091940
-20299 177091940 176675565 177753461 178831370 177387676 175943995 177986950 180029891 180844398 181658906 182380022
-20289 182380022 183101126 183199628 181803859 179754346 180195278 182426231 183162913 181409135 179655357 179769424
-20279 179769424 179883491 179997544 180111611 181249590 182387555 183525533 184663498 184805288 184947090 186583150
-20269 186583150 188219210 189512839 190806454 189609637 188412806 186593360 184773914 184448752 184123577
-20260 184123577 186596037 189068498 189050499 189032500 189139021 189245542 189352076 189458598 190211088 190963578 191716055
-20249 191716055 192468545 192349367 192230202 192111023 191991858 192809529 193627187 194444859 195262517 195333053 195403589
-20238 195403589 196968382 198533189 198027805 197522408 198511295 199500182 201236204 202972226 202217789 201463364
-20228 201463364 202848193 204233021 207018716 209804438 208885601 206472479 204993287 206004555 206774544
-20219 206774544 207544547 208470200 209395853 210570546 211745240 212919934 214094627 213696265 213297876 215389947
-20209 215389947 217482044 220352394 223222716 222606443 221990144 219397071 216803971 217697520 218591070 219017668
-20199 219017668 219444239 219870838 220297409 221463853 222630271 221306256 219982213 222362731 224743275 225629522
-20189 225629522 226515769 225036076 223556411 223570989 223585594 225934981 228284354 228143336 228002264 228114126
-20179 228114126 228225989 228337906 228449768 230678530 232907292 235136053 237364815 236402677 235440538 235412302
-20169 235412302 237874580 241083925 241802865 239595524 237388129 237954853 238521523 239088193 239654863 240159273
-20159 240159273 240663683 239673849 238683962 239414099 240144181 240874318 241604401 244015561 246426776 247841720
-20149 247841720 246766259 245774478 246276940 248273646 250270406 250897389 251524372 252151409 252778392 252821666
-20139 252821666 252864940 254402511 255940082 257353133 258766184 260179181 261592232 262203204 262814121 264763659
-20129 264763659 266713250 267230805 265257899 263284994 263802548 266436947 269071401 268374855 266184012 264584668
-20119 264584668 265475783 266366898 267258013 267080969 266903925 268221125 269538379 271571597 273604815 275638033
-20109 275638033 277671252 277540889 277410527 274945383 272480184 270419757 270849736 273365457 275881232 277186261
-20099 277186261 278491344 279796373 281101456 281254645 281407888 281561131 281714320 283050506 284386692 285722878
-20089 285722878 287059064 288675448 290291831 289417701 288543625 288564559 288585438 288762049 288938606 290422626
-20079 290422626 294397160 298371694 299855714 299495297 299134881 301109247 303083613 304497583 305911608
-20070 305911608 305831335 305751116 305321570 304892078 304462586 304033094 306280787 308528535 310776283 313023977
-20060 313023977 311574955 310125933 311167370 312208753 313312451 314416149 315519792 316623490 318129904
-20051 318129904 319636372 318652327 317668335 318801188 319934042 321066895 322199748 323270395 324340989
-20042 324340989 326905825 329470716 331288485 333106200 331437292 329768385 330712078 331655717 332599356 333542994
-20032 333542994 334206489 334869930 333260903 331651822 331879442 335593738 340584395 344080753 345304535 345034128
-20022 345034128 344670250 345800723 348743015 351685362 353226827 354768293 354628681 354489069 354349457 354209899
-20012 354209899 353206381 352202916 352693695 353184527 355636527 358088582 359046339 360004095 360844580 361685119
-20002 361685119 363926538 366167958 367195277 366728299 365700979 367164120 370035930 372907740 373444713
-19993 373444713 373981741 375763971 377546201 379328432 381110662 381767828 382424941 381587864 379256435 378792865
-19983 378792865 380819808 383687237 385060367 385094932 385129443 386564834 388000279 388595186 389190038 389784944
-19973 389784944 390379850 392647720 394915645 395689326 396462953 397205477 397948000 398690470 399432994 399303876
-19963 399303876 399174704 399045586 398916413 400810777 402705140 404599504 406493813 408444595 410395377 411785817
-19953 411785817 411681960 411484740 412781763 414639128 416496492 417373273 418250054 417679218 417108437 417533818
-19943 417533818 418706321 419707568 419214626 419143603 421563040 425352199 428394237 430144391 431147369 432243764
-19933 432243764 432592983 432467490 433089171 435640918 438192664 440308589 440930217 440991503 441052790 441300857
-19923 441300857 443043221 446342089 449640957 452052604 452970008 453233654 453497245 454850470 456203695 456903162
-19913 456903162 457602628 458426615 460744899 464043767 466595513 467252896 466415981 464551801 463434743 464216700
-19903 464216700 466492846 468395486 469550950 470130548 470710092 471242954 471775817 473771819 475767876 477763879
-19893 477763879 479759882 481825934 483891986 487358919 490825851 493063105 493806116 493895368 493984620 495661587
-19883 495661587 497338500 499669172 501999843 503038576 502583011 502127500 503166233 505953443 508740599
-19874 508740599 510126874 511513149 512946160 514379117 515111688 515844205 516934758 518772433 519629524 518992318
-19864 518992318 518681991 519865907 522030461 523447894 524369138 525290437 526165000 527039563 527540565 528041621
-19854 528041621 530036867 532032166 533249187 534466208 535729910 536993613 536903116 537559796 540442316 544819079
-19844 544819079 549273682 553728284 555350023 554481248 553892724 555794607 558474768 559660631 559959275 560257972
-19834 560257972 561957495 563657018 564547160 565437302 567821741 570206125 570532031 570857937 573674302 576490667
-19824 576490667 578373077 580255486 582137949 584020358 585708252 587396091 589083985 590771824 590140460
-19815 590140460 589509095 591368191 593227286 594753660 596280034 597059287 597838485 599193658 600548830 601903948
-19805 601903948 603259120 604357463 605455805 606554094 607652436 609373380 611094324 612815268 614536212
-19796 614536212 616323310 618110409 619897508 621684606 622849050 624013547 625178044 626342541 628682192
-19787 628682192 631021843 633361493 635701198 637060211 638419278 639031169 639643114 639880471 640117827 642285303
-19777 642285303 646943238 650947414 652461130 653040945 653620759 654223942 654827070 654683076 654539137 657523783
-19767 657523783 660508430 663493076 666477722 667308524 668139327 668970129 669800931 672826471 675851957 678130321
-19757 678130321 680408686 682764889 685121091 685983051 686844956 686321614 685798218 687765281 689732345 694529405
-19747 694529405 699326411 701633011 703939611 704425035 704910513 706143058 707375657 709573262 711770920
-19738 711770920 712474281 713177642 716013427 718849265 718198428 717547590 717309260 717070930 719323005 721575135
-19728 721575135 723578169 725581258 727584293 729587382 731777251 733967066 736156936 738346751 739011220
-19719 739011220 739675689 740340103 741004572 741969144 742933663 745392533 747851348 749843240 751835132 753826970
-19709 753826970 755818862 757452717 759086626 760720482 762354337 765607010 768859684 769621897 770384110
-19700 770384110 773660152 776936138 777721720 778507301 779915484 781323612 782731795 784139978 786423697
-19691 786423697 788707416 790991190 793274909 793441729 793608550 793775424 793942245 794877174 795812050 796746926
-19681 796746926 797681802 799021396 800360989 801700583 803040177 804017894 804995610 809459895 813924234 815462292
-19671 815462292 817000350 818538408 820076466 822717681 825358950 826505921 827652893 828364043 829075139
-19662 829075139 828292046 827508899 829356311 831203722 833051134 834898545 835998835 837099071 838355038
-19653 838355038 839610951 840282668 843444899 848537194 853629490 855141746 854163542 853652317 854635389 857237224
-19643 857237224 858344817 857895851 857446886 859394963 861343094 863291171 865239248 864455668 863672034 866375077
-19633 866375077 869078065 871532066 873986014 876439961 878893963 881643687 884393410 884652620 884911884
-19624 884911884 882992043 881072148 881673816 885762160 892365738 898969316 901370253 900284622 899883799
-19615 899883799 900977327 901012270 901047322 901132896 901218578 901304152 901389726 900728178 900066738 900899434 901732238
-19604 901732238 902119430 902506622 907376544 912246521 914968549 917690470 920412498 923134527 924475040
-19595 924475040 925815553 925661931 925508201 926288427 927068654 927802144 928535634 928798306 928313856 928809990
-19585 928809990 930800367 933771437 935248154 935215158 935182053 937164641 939894459 941207818 940030663 937203588
-19575 937203588 935870864 937511048 939898354 941034615 940676633 941766158 944350035 947540935 949237591
-19566 949237591 949953556 951416642 953510227 955603813 957744025 959884238 959907606 959930974 959954233 959977601
-19556 959977601 959874501 959771401 960648885 962273491 963524536 963281337 963505063 964476018 966155149 967834171
-19546 967834171 968626081 970912234 973789940 975173295 974097292 973021398 972807301 974087556 975461282
-19537 975461282 975340656 975282236 976718168 978714388 980710607 981788556 982866398 982543467 982220537 982364422
-19527 982364422 984002767 985641004 985784998 984650576 983516262 983782828 984049395 984751836 985454170 986156611
-19517 986156611 986858945 988448607 990038160 991020692 990508979 988985526 988209194 989409717 990610240 992203688
-19507 992203688 993797245 995235016 996672895 997285760 995408219 993110382 991559666 991627823 993190114 995453008
-19497 995453008 997715793 998857896 1000000000 999647859 999295611 998563635 997831551 997099467 996367383 995915496
-19487 995915496 995463718 995011832 994559945 994473830 994387716 994301601 994215486 994160528 994105571 994611008 996610689
-19476 996610689 997972082 997839340 996725906 996359593 996413686 996467670 996615017 996762364 997127703 998240163
-19466 998240163 999772812 999811218 999118080 998424942 997638441 996851941 996256494 995661155 995065816 994470369 993875030
-19455 993875030 993279691 992684244 992088905 991999436 991909859 991820391 991730922 991267785 990804755 992832132 994859508
-19444 994859508 995772044 996684579 996102763 995521056 994067598 992614248 991160790 989707441 989355192 989003052
-19434 989003052 988650911 988298771 989129519 989960376 989296881 988633386 986200859 983768223 983826102 983883981 983973017
-19423 983973017 984062052 984151088 984240124 984745453 985250891 984261977 983273063 982751182 982229192 981707310 981185428
-19412 981185428 980465028 979744628 979024228 978303828 978517384 978730940 977450144 976169457 974087123 972004789
-19402 972004789 971416698 970828608 971641398 972454187 969935978 967417877 966768013 968608555 969888810 969674821
-19392 969674821 968775916 967877012 966884744 965892477 964666639 963440909 960814299 958187581 958705136 960716933
-19382 960716933 961794883 960382319 957187524 953992730 952136610 950280381 948766665 947252948 947233475
-19373 947233475 947214002 946124476 945034951 943945317 942855792 943322716 943789640 944256672 944723596 942654893
-19363 942654893 940586082 939918260 939250437 937991062 935237444 933324418 933901799 934366343 933336535 930968270
-19353 930968270 930094139 929904925 929715710 926133183 922550763 921336177 920121590 920401247 920681012 920773942
-19343 920773942 920866765 918469289 916071706 914720915 913370124 913513685 913657137 911683745 909710353 907736961
-19333 907736961 905763623 905287395 904811167 904335047 903858819 903351434 902844157 902336772 901829496 902536265
-19323 902536265 903243033 900463126 897683219 895494864 893306510 891211518 889116526 886322988 885023801
-19314 885023801 884378319 881242377 877639510 875530888 874916508 874302183 873076886 871851643 872120590 872389590
-19304 872389590 871849209 871308774 868433556 865558338 863916207 864764535 866453348 866647918 865068046 861993878
-19294 861993878 859666884 857339837 855682181 854024471 852366761 850709051 849020184 847331371 847977340
-19285 847977340 848623255 846955863 842797956 838640050 836972603 837017391 837062126 835768240 834474408 834149476
-19275 834149476 833824544 832098732 830372920 830110248 831341874 831639543 829446807 826749120 824051433 821198123
-19265 821198123 818344812 816549924 814755036 812462067 808674855 805537452 804890509 806235945 807581381
-19256 807581381 804568498 801555670 800037031 798518446 798519420 798520393 798521367 798522341 796593250 794664105 792734960
-19245 792734960 790805816 790713426 790620982 792022836 793424690 792771959 792119175 788975930 785832739 782562540
-19235 782562540 779292341 776022196 772751997 770104454 767456856 766303556 765150256 764884230 764618151
-19226 764618151 764352071 764085991 763103947 762121849 758649345 755176787 752540873 749905014 749759560 749614106
-19216 749614106 749126248 748638390 746656235 744674080 743859343 743044606 742229815 741415078 738857003 736298982
-19206 736298982 733740907 731182832 728385453 725588074 726277317 726966560 726161560 725356505 724551505 723746504
-19196 723746504 722614625 721482691 721751692 722020692 720499673 717484357 715122799 714255538 714187923 712626010
-19186 712626010 710503810 708381556 706835222 705288942 705236851 705184814 704121037 703057259 701837804 700618349
-19176 700618349 698916392 694723974 691091898 688954066 687084801 685215482 683252800 682784362 682767323 681256040
-19166 681256040 677441078 675120360 675150057 676673997 677357398 678040853 677696935 675858773 671467891 667077010
-19156 667077010 663865176 662147640 661083863 660020085 659360971 658701858 658042798 657383684 655183646 652983553
-19146 652983553 650876878 648770202 648500282 649724551 650948874 650678900 649733314 648787728 646347844 643908015
-19136 643908015 641670490 640927263 640090619 639253975 637405590 635557205 633802183 632047215 630027628 629502284
-19126 629502284 629630699 629759114 627856258 625953402 624143909 622334470 620727336 620614500 621248785 620388773
-19116 620388773 617505279 614621840 613139226 611656613 609956116 608255619 606555067 604854570 603513516
-19107 603513516 602172462 600084286 597996110 595051817 592107523 589816988 589020751 589578658 590136565 589137969
-19097 589137969 586645075 584276701 581908382 580940888 579973395 581034251 582095162 583062601 584030095 582413765
-19087 582413765 579303084 576285874 574762908 574438463 575608261 576871531 576640449 575304263 573968077
-19078 573968077 571791352 569614681 570064133 570513532 569468740 568423895 565651344 562878740 560106189
-19069 560106189 557333638 555168111 553002583 552331298 551660068 551518022 551375976 552728227 554080478 551205747
-19059 551205747 548331017 546950583 545570096 543676003 541781910 540634938 539487967 536006159 532524405
-19050 532524405 531408591 533779345 536726072 537182340 536766966 536351538 534453550 532555562 528167115 523778668
-19040 523778668 521444805 519110996 519267593 519424244 518678096 517931894 518524366 519116838 519226753 516846209
-19030 516846209 514185521 513019131 512858585 511203796 508988665 506773535 505305526 503837518 501622387
-19021 501622387 499407203 500118353 500829504 501540654 502251804 501297455 500343106 497894460 495445868 493929663
-19011 493929663 492413512 493387821 494362130 493593101 492824072 489564583 486305094 483014502 479723857 478425643
-19001 478425643 479617836 481043544 480974955 480408285 479841615 479826524 479811432 479049218 478287005 476341849 474396639
-18990 474396639 473198604 472000570 471985478 471970386 468624350 465278260 463410942 464034030 464750536 465466987
-18980 465466987 465470882 465474777 462988212 460501646 458482059 456462472 456933291 457404164 455431258 453458353
-18970 453458353 451485448 449512542 446014236 442515930 441508084 440500238 440868930 441237623 442944936
-18961 442944936 444652248 445643596 444144430 441711417 440772592 440798881 440825116 440789144 440753173 441121866 439000098
-18950 439000098 435944429 434383057 434669043 434955082 432844025 429238671 427968153 429188095 429754278 428826218
-18940 428826218 426800735 424775306 422656514 420537667 418730122 416922631 417605545 418288459 417453762 416619065
-18930 416619065 417278666 417938266 417819588 417700855 417582177 417463499 417617229 417770905 416430337 415089770
-18920 415089770 411632358 408174891 406211722 404248554 403405094 402561634 401718174 400874768 400155828 399436889
-18910 399436889 400212247 400987604 400253086 399518622 398784158 398049640 398404701 398759816 395628256 392496695
-18900 392496695 390351614 388206533 388551858 388897237 388588857 388280423 387972043 387663664 385222861 382782003
-18890 382782003 381835444 380888884 381561088 382233292 381411252 380589213 380067277 379545396 379023460 378501524 378446566
-18879 378446566 378391609 376842353 375293098 374117458 372941764 373260367 373578970 371842988 370106953 368370917
-18869 368370917 366634882 365523449 364411962 363300529 362189042 364626492 367063941 368007093 368950245
-18860 368950245 367776552 366602805 366923355 367243906 365665495 364087030 362508619 360930208 358861992
-18851 358861992 356793722 357215912 357638156 358527324 359416492 357815200 356213908 354628194 353042481 352951011
-18841 352951011 352859595 351834223 350808851 348289236 345769566 344783141 343796661 344304479 344812296 344448472
-18831 344448472 344084648 342226526 340368404 339529813 338691221 339191249 339691332 339817800 337453807 334155913
-18821 334155913 332352262 332934024 333515786 331793868 330071951 327976472 327375237 327427761 327480285 327135933
-18811 327135933 326791528 326447177 326102772 326630063 327157354 327591228 328025101 327721590 325923781 322631729
-18801 322631729 320833920 321339790 321845661 319954488 316569019 314638900 315199242 316755799 318312303 317378401
-18791 317378401 316444499 315510542 314576640 313375198 312173756 312466557 312759412 312149414 311539470 309995570
-18781 309995570 309945968 310838057 310235848 308077136 305918424 305347372 304776321 304205269 303634218 304660563
-18771 304660563 305686909 306059496 304937840 303878390 302818994 301666180 300513367 300076572 299639778 299202983
-18761 299202983 298766134 298391600 298017065 296148287 294279455 293417983 292556564 293189389 293822214 294859757
-18751 294859757 295897245 294382068 291372648 289156977 288435657 288368042 288300426 287703573 288601017 290152219
-18741 290152219 291703368 291143513 290583659 290023804 289463950 289371020 289278089 289185213 289092282 288260019 287427811
-18730 287427811 286595548 285763285 284464044 283164803 282363697 283056835 283716922 281886550 279215639 278038971
-18720 278038971 277640581 277242246 275442977 273643707 273922445 274201128 274479865 274758602 274072226 273385904
-18710 273385904 272699582 272013260 272418411 272823615 273135403 273447190 272576035 270210583 267845130 266973975
-18700 266973975 267394704 267815487 268329580 268843726 268984312 269124898 267771186 266417528 266309506 266201538
-18690 266201538 264599272 262997007 262328698 261660334 262486268 263312202 263998092 264683927 263875465 263067056
-18680 263067056 261418109 259769162 258120215 256471268 255038257 253605300 253666586 253727873 252481642 251235466
-18670 251235466 251483533 251731600 250617733 249503812 248389945 247276024 246629081 245982138 245335249 244688306
-18660 244688306 245288513 245888775 246489036 247089243 246724445 246359647 246492877 248120457 249319952 248028987
-18650 248028987 243998576 241462354 242070405 244172699 243971314 242275685 241862204 242943021 243930474 243423630
-18640 243423630 240862147 238300664 236641981 237473757 239671415 240374776 238587678 236800579 235667185
-18631 235667185 234533845 233400505 232267164 232577870 232888576 233199282 233509933 234474397 235438862 234909028
-18621 234909028 234379195 233246179 232113218 230980202 229847241 228340664 226834129 227818025 228801909 229427810
-18611 229427810 230053711 230679612 231305513 229970193 228634818 227299498 225964164 225017982 224071774 223125566
-18601 223125566 222179358 222353860 222528361 222702863 222877364 222077692 221278020 220478374 219678702 220093130 220507557
-18590 220507557 219427714 218347871 218015150 217682429 217349735 217017013 216404149 215791257 217513174 219235092
-18580 219235092 220957009 220188467 218330345 216472224 216388570 216304916 216221236 216137582 216139529 216141477 216143424 216145371
-18568 216145371 215867121 215588898 215155024 214721123 215723263 214234969 209664718 205094467 205007027 204919600
-18558 204919600 204832160 204744733 203575503 202406286 201237056 200067839 199863655 199659484 199455313 199251141
-18548 199251141 201508234 203765326 203531972 203298619 203936907 204575208 203719240 202863271 203594963 204326655
-18538 204326655 205058347 205790039 205805725 205821412 205837099 205852785 205083756 204314741 203545712 202776683 203034973
-18527 203034973 203293263 203551554 203809831 202355940 200902036 197953861 195005700 194859286 194712872 194566458
-18517 194566458 194420044 194971162 195522267 193582926 191643585 193066346 194489120 194417623 194346113 195286358
-18507 195286358 196226602 197166847 198107091 197677585 197248080 196818574 196389068 194802854 193216654 189295645
-18497 189295645 185374649 184566700 186249225 187464772 187186062 186459833 187227889 188556299 189884695 190839531
-18487 190839531 191794367 190258757 188723133 187161247 185599375 185531760 185464144 184431483 183398822 182366161
-18477 182366161 181333500 182662871 183992254 182831165 181670089 180882588 180095073 179307571 178520056 178356143
-18467 178356143 178192217 179522560 180852918 181934221 183015525 184096828 185178132 183286459 181394787
-18458 181394787 182989736 184584699 185619308 186653916 185198078 182247956 180048864 180340232 181627775
-18449 181627775 182915319 182210497 181505689 180800868 180096046 178504004 176911962 176814190 176716432 176245086
-18439 176245086 175773754 175302407 174831075 174240564 173650052 174553812 175457584 174898203 174338822 173779441 173220060
-18428 173220060 173750258 174280457 174810642 175340840 174656939 173973037 173289136 172605234 173796953 174988673
-18418 174988673 174686121 174383570 173582924 172782292 170487375 166698188 163126912 162046095 162957644 163869193
-18408 163869193 165092042 166314891 167537740 168760589 165972947 163185291 161487201 162279585 163881350
-18399 163881350 165483115 164750084 164017054 164120667 164224267 165822151 167420036 167056685 166693320 166329969
-18389 166329969 165966618 166286195 166605772 165431078 164256371 162894897 161533423 161666206 161799002 162994129
-18379 162994129 164189256 165384383 166579497 166902968 167226439 165059451 162892463 163117676 163342889 163661492
-18369 163661492 163980095 162493114 162500416 163223710 161456558 157961660 156957208 157882861 158808514 156714483
-18359 156714483 154620465 154020704 153420956 153301791 153182612 153063447 152944269 153198664 153453060 155201726
-18349 155201726 156950392 156469337 155988268 155507198 155026129 154669594 154313045 153956510 153599961 154585440
-18339 154585440 155570919 154065952 152560971 150122075 147683192 148730931 149778670 150024803 150270923 150517056
-18329 150517056 150763176 150262174 149761158 149260156 148759140 147102404 145445667 146279391 147113101 146732724
-18319 146732724 146352348 145971971 145591595 146296903 147002198 147707506 148412815 148246454 148080107 145423300
-18309 145423300 142766493 141265407 139764321 138963675 139657313 141456082 144001987 145520585 145544900 145016649
-18299 145016649 143741262 142372486 141750844 142685747 143620637 143995171 142875449 142422102 142715904 142496046
-18289 142496046 142276175 142912407 143548640 143624531 142206139 139923866 139135878 139904407 140672949 140663226 140653489
-18278 140653489 140643766 140634043 140500760 140367477 140234207 140100924 139345039 138589141 137833243 137077358 136819555
-18267 136819555 136561751 136817607 136326328 136286449 137740826 139241912 139248728 138822616 139890789 142266451
-18257 142266451 143147844 141289722 137937343 134538256 132633453 132207355 132528392 133923430 135318469 135234815
-18247 135234815 133656877 132125635 132088663 133439940 135538340 137636739 138988003 138580391 136678496 135150174
-18237 135150174 134368988 134432222 134495455 134558689 134621923 133517766 131666460 131729693 133287198 135048995 134320345
-18226 134320345 132751171 132676253 134313543 135950820 137027742 136610393 135410899 134211390 133899116 134333963
-18216 134333963 134021689 132215130 129381266 127294551 126941897 126589242 126283283 125977324 125951549 125925774
-18206 125925774 125899986 125874211 125957391 126040558 126123738 126206919 125667484 125128049 124588615 124049167 124659624 125270082
-18194 125270082 125833831 126397594 125700561 124256380 122391957 122021790 122523279 123024782 121705134 119638352
-18184 119638352 118427660 119707414 121874402 122547120 122513556 122479992 122353037 122226083 123717919 125209769
-18174 125209769 126701605 128193442 127506132 126818823 124637257 122455677 120118434 117781204 118930609
-18165 118930609 120080015 120291610 120503192 122209057 123914923 124313299 124711674 123615780 122519885 121914295
-18155 121914295 121308706 122197387 123086068 122044644 121003234 118467539 115931845 117815742 119699638 119591170
-18145 119591170 116992242 114113143 112728315 113896193 116558355 119539607 121026575 119898576 117276307
-18136 117276307 115338913 114895790 116009197 117122604 115770853 114419102 113067338 111715587 113383520
-18127 113383520 115051440 114228900 113406374 111478703 109551032 109117646 108684245 108873460 109062674 109251889
-18117 109251889 109441104 109705723 109970328 110234934 110499553 109799113 109098673 108398233 107697793 109472234
-18107 109472234 111246688 111526859 111807043 111122168 110437293 111246688 112056084 112886886 113717688 113054207
-18097 113054207 112390739 111696140 111001529 110306931 109612319 109867201 110122084 108976086 107830089 108147245
-18087 108147245 109958658 110991806 109534494 107569864 108095681 109555414 111015147 110669308 110323469 109977631
-18077 109977631 109631779 110671255 111710732 111255924 110801131 109163367 107525604 108378286 109230969 108688627
-18067 108688627 108146271 107697306 107248340 108387036 111020015 113372810 112238969 108848172 106951631 108479466
-18057 108479466 110007300 109791810 109576334 109267454 108958587 109385659 108318460 106597516 104876572 104276338
-18047 104276338 103676090 103075856 102475622 103167299 103858990 104550667 105242358 104813339 104384320 103955301 103526282
-18036 103526282 103486389 103446509 103406616 103366737 103856069 104345400 106329016 108312618 107883599 107454580 106932171
-18025 106932171 106409762 104797774 101691515 98678646 97160061 97525846 99385901 100498822 101611742
-18016 101611742 100794557 99977386 99720556 100957997 103362842 104273417 103627448 102981492 101775182 100568871
-18006 100568871 100856831 101144777 101767392 102390007 103012622 103635237 102888102 102140967 102794712 103448457 103619672
-17995 103619672 102296617 101814087 101331571 100631131 99930691 99230251 98529811 96421188 94312579 93293536
-17985 93293536 94764939 96360875 97956812 97217939 96479080 96705253 96931440 95756746 94582053 93780920
-17975 93780920 94474071 95167209 94366076 93880152 93394215 92814901 92235573 93679740 95123922 96007734
-17965 96007734 95397290 96421188 98939370 100523623 99617430 97590540 97057908 98019559 98981197 98455867
-17955 98455867 97930537 98245746 97066671 94206531 91346405 90042810 90233485 90844423 91455360 92159695
-17945 92159695 92864023 92354258 91844500 91334735 90824970 91906760 92988550 94910866 95338911 93961385
-17935 93961385 92583852 93665636 96241710 97261227 96786486 94755215 92723938 90941707 89159477
-17926 89159477 87377247 85595016 85488002 85380994 86768249 88155512 88484332 88813145 89141965 89470785
-17916 89470785 89285945 89101105 91251068 93401030 93869942 91848388 90387195 90420265 90326875 90233485 90793840
-17905 90793840 92848458 94249345 94155955 92506021 90856100 89540827 88225555 88466819 90202355 92062410
-17895 92062410 92428195 91237450 90046698 90695094 91343484 90497610 89651730 89490724 89329726 89168720
-17885 89168720 89007715 89391499 89775283 90159061 90542845 90646452 90750059 89359395 87968732 87700711
-17875 87700711 87432698 87164685 86896664 87375786 87854908 87773675 86198172 84754971 84806048 85837735 86122294
-17864 86122294 85270578 84418862 83613842 82808821 81808264 82301977 84352221 86402464 86911743 85926750
-17854 85926750 85362021 85544427 86178232 86812030 86978871 87892847 88697868 88008618 86712311 85416012
-17844 85416012 85720997 86025983 86330961 86635947 86224927 85813900 85402881 84991861 84518574 84045295 83572008
-17833 83572008 83098721 84197537 85296353 86722041 87400594 86248761 83602651 81376811 79898105 79695753
-17823 79695753 80240543 80365063 80489583 79921453 78606180 78318220 79524538 80793108 81314550 82349646
-17813 82349646 83384741 83390576 83396411 83402246 83408088 83320533 83232978 83052026 82871081 82806874 81248396 78615910
-17801 78615910 76730560 76292785 75855009 75557320 75259630 75755777 77746195 80296968 80357280 78643145
-17791 78643145 76929017 77502990 78076955 78137275 77450453 76343368 76730560 77600268 78469983 79433088 80396193
-17780 80396193 80935141 81474095 80409811 77851262 75495060 73885992 73350932 72815879 72358644 73395687
-17770 73395687 75086467 76777255 77440723 78104198 78720977 79337750 79687970 79291055 78473877 79150970
-17760 79150970 80154928 81158893 82209554 83260214 82162858 80318368 79454488 80084886 79547885 77516607
-17750 77516607 75578720 75135110 75353027 75570937 75882245 76193552 76224682 76255813 76286943 76318073 75251847
-17739 75251847 74185622 74613674 75041719 74722629 74403540 74084450 73765360 72902947 72040528 71785158 73024060
-17728 73024060 74978973 76186744 75884679 74835479 74548980 75009616 75423556 75090362 74227943 73365523
-17718 73365523 73063459 74255672 75922618 76842436 77201892 76814220 75866193 74918166 73923444 72928722
-17708 72928722 73179230 73429731 73680239 73930740 74181248 74431749 74682256 74932764 74888010 74843262 74284854
-17697 74284854 74473582 74849097 73730342 71677664 70372121 70163934 71450017 72782801 72621309 70623109
-17687 70623109 68624909 68183246 69235846 70442164 71648474 72948182 74247889 73835402 73422922 73010442
-17677 73010442 72597962 71936434 71274907 70613379 69951851 69663898 69375938 68247453 68613238 70771464
-17667 70771464 72929696 73687048 74444399 73178256 71912113 70645970 69379826 70323965 71268098 72212230
-17657 72212230 73156369 72886408 72616448 72346480 72076519 72756046 73435573 72620822 71806072 69310270 66814469
-17646 66814469 66809114 66803766 67545552 68287339 69029119 69770906 69890078 70009250 68634152 67259053 66565909
-17635 66565909 65872764 65179620 64486475 65163081 65839687 66516293 67192898 68352027 69511162 68179838
-17625 68179838 66848513 67883122 68917730 69952338 70986947 69614769 68242585 68364678 68486764 68889034
-17615 68889034 69291298 69693568 70095831 69533049 68970267 68407478 67844696 68496007 69147318 69798635 70449946
-17604 70449946 69209585 67969223 68223132 68477041 68513032 68549031 68585022 68621021 68275662 67930304 67584952
-17593 67584952 67239593 65368834 63498075 61627316 59756557 60064950 60373337 62175994 63978658 66964284
-17583 66964284 69949911 70849782 69259194 66306645 63354095 62238261 63612872 66014797 66922451 66335834
-17573 66335834 65749211 65530813 65312409 65094012 64875608 63785548 62695489 61605429 60515370 60405928
-17563 60405928 60296485 58848423 57400361 58318225 61726548 64574517 65928215 66894728 67861235 67240080
-17553 67240080 66618926 65219506 63820086 63914937 64009788 62820496 61631211 61936196 62241175 63013118
-17543 63013118 63785062 63062734 62340407 62967397 63594386 64221376 64848373 64307964 63767549 64207758 65395103
-17532 65395103 66917102 66944825 64373139 60307182 56614793 55412858 56203287 56993716 56706243 56418770
-17522 56418770 56224687 56030611 56988361 59440388 61051890 62663385 63449920 64236461 63528719 62820983
-17512 62820983 63327347 63833704 64340068 64846425 63390581 61934736 60572281 59209827 58065290 58415023
-17502 58415023 58858146 57806999 55510629 54708530 56941666 59921944 60614115 59812008 58900954 59484169
-17492 59484169 60106290 58237966 56929995 57116289 58547813 58485066 57021438 57052082 59152915 61253749
-17482 61253749 61891442 61034864 60069325 60598063 62060717 62776235 61587917 59652470 58697628 59237069
-17472 59237069 60819381 61654558 62427475 63947528 65514275 64590569 62297113 60750799 60667619 62078716
-17462 62078716 63069543 63313242 62687219 61314068 58820207 56326347 56089463 55852580 55569001 55285416
-17452 55285416 54301398 52570237 51913091 52750215 55782050 58813885 59900050 58495769 56963553 56178479
-17442 56178479 54910875 53643278 52936022 53723050 54183199 53896213 53936099 55470256 56490760 56764122
-17432 56764122 56010178 54509098 53941935 54869048 56167775 55972239 55216347 54460456 54763007 55065558
-17422 55065558 53967230 52868901 52626662 53878701 55224130 55075288 54412787 55244556 57056950 58122201
-17412 58122201 57333233 56544264 55801990 55059723 55438152 57310859 59183558 59561994 58531761 57501534
-17402 57501534 57872180 58242834 56932423 55622019 54965353 55802964 56778720 57754469 57329338 56904214
-17392 56904214 55296120 53688026 52733677 53273598 53167557 53061523 52208347 52849441 54611245 56373048
-17382 56373048 58134846 59896649 60902075 60413223 60671507 60929797 61997483 61570891 60490562 59410232
-17372 59410232 59894215 60378198 58465126 56552046 55946457 56835145 56385206 54440996 53199174 54447805
-17362 54447805 57097323 57256381 55672122 54087862 53842222 53596576 54028029 54459482 56291815 58124149
-17352 58124149 57777330 55936240 54935683 56425579 57649888 57379928 54775164 52170408 50810868 51941787
-17342 51941787 54006629 54577194 53669053 52760912 51759381 50757850 50067627 49377403 51084236 52791075
-17332 52791075 52680660 51075967 49471281 49360865 48845745 48330631 48562653 50288945 51703930 53118915
-17322 53118915 54471646 55824371 56647871 54980924 52380049 51273451 52573645 53873839 54613679 53859241
-17312 53859241 52575592 51291937 49914891 48537845 49511167 50484482 51457804 52431126 53622358 54813597
-17302 54813597 54510559 54207521 54505690 54803867 55102037 55400213 53394717 51389222 50037471 50179990
-17292 50179990 51318692 52457394 52195216 51933031 52075557 52218077 52360596 52503115 53047898 53592688
-17282 53592688 51740415 49888135 48378300 48362735 49094305 49825875 50510750 52689896 54869048 55553923
-17272 55553923 55304876 55055829 56114271 57172714 56404179 54141366 51878553 51110018 52302711 53495403
-17262 53495403 53287216 53079029 51843535 50608035 50026280 50938796 52847500 54756198 54267833 53779469
-17252 53779469 53017742 52256015 51587679 50919343 50033089 50641113 51902874 53164643 52395127 51625618
-17242 51625618 50762719 49899813 49908569 48423055 46937533 46946290 48961029 50975768 51433969 50397900 49984447
-17231 49984447 49570993 49064149 48557305 48719764 48882230 49044689 49207155 50770501 52333841 52963264
-17221 52963264 51102235 48520333 48428890 49271362 50113835 48621512 47129182 47286780 48938655 49010645
-17211 49010645 49082635 49154625 49226615 48271292 45821692 43372099 42416776 44185389 45954002 47816005
-17201 47816005 49678007 49672172 49666330 49660495 49654660 49555428 49456202 49356970 49257745 47788762 46319787 45411159
-17189 45411159 45996802 46215206 44939333 44597382 44255432 44785143 45314848 45844560 46374264 46429229 46484193
-17178 46484193 46539158 46594122 47022654 47451193 47879725 48308257 48011054 47713858 47416655 47119452 47756172
-17167 47756172 48392891 47535340 46677789 44691746 42705710 41373412 41535391 42693546 43851708 45103260
-17157 45103260 46354805 46861169 47367526 46379613 45391700 44123616 42855525 42241180 43121111 44857133
-17147 44857133 46593149 48749440 50158583 49341892 47030924 45513793 46487114 48693982 49406586 47146208
-17137 47146208 44138694 43606068 44567713 44642137 44716554 45032243 45347926 45663608 45979297 46294979 46610661
-17126 46610661 46926350 47242032 47265380 47288727 47312075 47335422 46985202 46634982 46284762 45934542 45576540
-17115 45576540 45218537 44860534 44502532 44518097 44533662 44455837 44378011 43889647 41907011 39364028 39311491
-17104 39311491 41251326 43191154 42733919 40782421 39842663 40397176 40951689 40011931 38371733 38225813
-17094 38225813 39216154 40953636 42832178 44710719 45141685 45572652 45349873 45127094 44951010 44774927
-17084 44774927 42956698 41885611 42946975 45502602 47793631 48590375 47768336 45452019 43467923 42978105
-17074 42978105 44044817 45111529 44746231 44380926 44015627 43650329 43098250 42546165 43394960 44243761
-17064 44243761 44905769 44073513 42587512 41101504 40475488 39849472 40717726 41585981 41053355 40520723
-17054 40520723 39988097 39455471 38673805 37892132 38666989 40936124 43578826 44727258 44319152 43911047
-17044 43911047 43579313 43247579 42962540 42677494 43746640 45562922 45355708 43654224 42513088 42119093
-17034 42119093 41304830 40490566 40501270 42006244 43511218 43521914 43301083 43080251 42766023 42451801 41421568
-17023 41421568 40391341 39361107 38330880 38063347 37795820 36034017 34272216 35623484 36974748 38326012
-17013 38326012 39677276 40670544 41663806 42563677 40973096 38697639 36422176 36481521 36540867 37502999
-17003 37502999 38465130 40921532 43377934 44402333 45426724 42964480 40502243 39401480 38300717
-16994 38300717 39690414 41080104 42687711 44295318 44813352 42840934 39514330 36187726 36192104 36196483
-16984 36196483 36263121 36329759 37890671 39451583 41049460 42647338 42750945 42854552 41495018 40135485
-16974 40135485 38775951 37416418 35784486 34152557 36007265 37861975 39374245 40886508 40904507 40922506
-16964 40922506 41400654 41878802 40862673 39846551 40418089 40989634 40066896 39144164 38026869 36909567
-16954 36909567 35792268 34674970 35674557 36674144 37673727 38673318 38865447 39057582 36914922 34772255
-16944 34772255 33252203 34222603 36282577 38342551 39406342 40470140 40039660 39609181 39272092 38935009
-16934 38935009 38597920 38260831 36403209 34545581 36174592 37803603 38405298 39006999 40947314 42887629
-16924 42887629 43255848 41133608 38917984 36702353 37226223 37750099 38273969 38797838 37807978 36818124
-16914 36818124 37322534 37826950 39265283 40703615 39651501 38599381 38162092 37724804 37287516 36850228
-16904 36850228 37907210 38964192 40021174 41078156 42352082 43626008 42347221 39574156 37361446
-16895 37361446 36643014 37481105 38319203 38285639 38252081 38218517 38184953 38493826 38802700 39952105 39607233
-16884 39607233 37345881 35084533 36278686 38967113 41406489 42351595 41740171 41128746 40758586 40388420
-16874 40388420 40018260 39648093 39184537 38720987 36856550 34992113 35010112 36522381 38594999 40667623
-16864 40667623 40374315 38586730 37639676 36692623 37426627 38160632 39735162 39815421 39459852 39104277 38655319
-16853 38655319 38206353 36663927 35121501 35073346 35025190 35506256 35987321 36374994 36762673 36309816 34362689
-16842 34362689 33256094 32149496 32381514 32613536 33779477 33451147 32675309 33393748 35668718 37943688
-16832 37943688 38381950 38820212 39165084 39509949 38469505 35934788 34894344 35348171 35895388 36442609
-16822 36442609 37083216 37723830 38613485 39503140 40299404 41095669 40117485 37645032 35265965 34381175
-16812 34381175 35130741 37374584 38777892 37690753 35638562 33586371 32966187 32346006 31531867 32211999
-16802 32211999 34448665 36685327 37427723 36675848 35830576 36479574 37144144 36314437 34924379 33534324
-16792 33534324 33047055 32559788 33722443 36379375 38796986 41214597 41235152 41255701 40062156 38868611
-16782 38868611 37675066 36481521 35591502 34701478 35305729 35909983 35767099 35624211 35481326 35338441
-16772 35338441 34110240 32882039 31653835 32916087 35361302 36312250 34772738 33233230 34907962
-16763 34907962 36582694 38257430 39932159 39676789 39421427 39166057 38910688 36129841 33348997 31564336
-16753 31564336 32270125 33567398 33370401 32675309 31980221 32460316 32940408 34914774 36889140 37991844
-16743 37991844 39094554 38702987 38311421 38917375 39523330 37638831 35754329 35177318 34600306 34023294
-16733 34023294 33446282 32752529 32058776 31365027 30671274 30351092 30030906 29710724 29390539 28568374 27746207
-16722 27746207 26924042 26101874 27645639 29189407 30733172 32276937 32100731 31924526 31748321 31572119
-16712 31572119 29995033 28417947 27837044 29746594 32948191 34655514 34868563 35081615 36446497 37811385
-16702 37811385 36685814 35560250 32574623 29588997 29093826 28598653 29660013 30721377 31782737 32844097
-16692 32844097 34033872 35223648 36413426 37603198 37921314 38239431 38557547 38875663 37901861 36928053
-16682 36928053 35954244 34980439 33633066 32285690 30938317 29590944 29821505 30052067 30282628 30513189
-16672 30513189 31864453 33215721 34566985 35918252 35300502 34682752 34065002 33447256 33950209 34453165
-16662 34453165 33461847 32470530 33395692 34320859 33751751 33182643 33360671 33538702 33716730 33894757 32516251
-16651 32516251 31137748 29759242 28380739 30239824 32098906 32463721 32828532 33607771 34387010 33236151
-16641 33236151 29594835 25393168 23681954 24056492 25925307 26618935 27312566 28099588 28886613 30732077
-16631 30732077 32577541 31932552 31287563 31808028 32328497 32848962 33369427 31041437 28713446 27132591
-16621 27132591 25551739 26150030 26748324 28840888 30933452 30566693 30199938 29833179 29466420 30856600
-16611 30856600 32246777 32889822 33532863 32385892 31238921 31586223 31933526 32343088 32752651 33162213
-16601 33162213 33571776 32066802 30561832 30551128 30540428 31072567 31604709 31389713 31174717 31364418 31554119
-16590 31554119 30996686 30439252 31741877 33044502 31856671 30668843 29340923 28013006 29175543 30338079
-16580 30338079 30684408 31030737 29882792 28734850 29548137 30361427 31174717 31988003 30785581 29583161
-16570 29583161 29875009 30166860 28699829 27232794 25765762 24298730 25742415 27186099 27882647 28579196
-16560 28579196 28622000 28664804 31042410 33420014 34326694 32742924 30972364 30696082 31447108 32198135
-16550 32198135 30552102 28906069 28680369 28454673 28976111 29497550 29318549 29139548 27466276 25793001
-16540 25793001 25637347 25481693 27816496 30151295 30026772 29902248 29777728 29653204 29219320 28785436
-16530 28785436 26857282 24929124 25460293 25991458 27923507 29855553 28596705 25843587 24024392 24695646
-16520 24695646 26549866 28404086 27923507 27442925 28303397 29163869 29043723 28176443 28352039 30021907
-16510 30021907 31645079 31773981 30424174 29074367 27631169 26187972 25367386 24546801 23726215 22905633
-16500 22905633 23365295 23824960 24284622 24744288 25079426 25414568 27197286 28980003 31011767 32296393
-16490 32296393 32444748 31098835 29581701 29558840 30049632 30540428 30336619 29385674 29415347 30939290 33350458
-16479 33350458 34267351 33627714 32988077 32994399 33000725 32400000 30305002 27914264 26270662 25763328 26750267
-16468 26750267 28641943 30533619 30931021 31328423 31741390 30660087 28551471 27189990 27159347 27875839
-16458 27875839 27658408 25946707 25013275 25574113 27115569 27909886 27512484 27115082 26670982 26226885
-16448 26226885 26654446 27082005 27509567 27937125 28426947 28916769 28752846 27094652 25343065 23591478
-16438 23591478 22353547 22609890 24615386 25873747 25575574 24530262 24123134 23716002 22343821 20224501
-16428 20224501 19840720 21947389 24941285 26440907 27053306 27665704 27437577 27209446 27463355 27717264
-16418 27717264 28484832 28505259 28478994 29946999 30667869 29894465 28000359 26853391 26640339 26427290 24330831
-16407 24330831 21487240 20060095 21123402 23752970 24888265 23626499 22364738 22815157 24759853
-16398 24759853 26704546 27154969 26710385 26265797 25727820 25189846 26115008 27040175 26471067 25901959 26214237
-16387 26214237 26526518 26838796 27151077 27338835 27526589 26220076 24913559 23965046 23016535 22068021
-16377 22068021 21119511 19050294 16981078 17402314 17823551 20425880 23028209 25630538 28232867 27597608
-16367 27597608 26962346 26327087 25691825 24293866 22895903 24984576 27073249 26578078 26082905 25587734
-16357 25587734 25092561 25739010 26385456 27031905 27678351 28013493 28348635 27189503 24536101 23345839
-16347 23345839 24646029 25852830 24569178 22507257 20445336 21714397 22983458 22423593 21863725 23794314
-16337 23794314 25724902 26690441 27655977 27127243 26598508 26069770 25541036 25012301 24483567 24328400 24173233
-16326 24173233 26415129 28657021 28688638 27225985 25109586 25483641 27071792 27165669 26761458 26357244
-16316 26357244 26303253 26249259 26195268 26141277 25900499 25659724 25418946 25178172 27494002 29809831 30631387
-16305 30631387 31452947 31496237 31539528 31582819 31626109 31428139 31230168 31032194 30834223 27959016 25083805
-16294 25083805 25695233 26306657 28019332 29732003 29950404 30168804 28737281 27305757 27368504 27431251
-16284 27431251 26474472 25517688 24560909 23604126 22740736 21877346 21013957 20150567 20785340 21420115 22054887
-16273 22054887 22689663 22950867 23212075 23473280 23734484 24221389 24708293 25195194 25682098 25639781 25597461
-16262 25597461 25555144 25512823 27231820 28950817 28179360 27407904 26262880 25117856 26463285 27808710
-16252 27808710 26072205 24335696 22599190 20862681 20060095 19257505 18454918 17652332 19763379 21874429
-16242 21874429 22491205 23107982 21140911 19173841 19697227 20220610 22689663 25158712 25137312 25115908
-16232 25115908 25499206 25882503 26265797 26649095 24192689 21736287 21272244 23298657 26041075 27289219
-16222 27289219 26046910 24804601 24698563 24592526 23988397 21889994 19200110 19000678 21789791 24578904
-16212 24578904 25219028 25859152 26499280 27139403 29055884 30972364 29402213 27832061 25468076 23104090
-16202 23104090 23230558 23357025 23639147 23921268 24203393 24485514 25257457 26029401 25307070 24584743 24080326
-16191 24080326 23575913 23071500 22567086 24771040 26974994 29178947 31382901 31532232 31681561 28499911
-16181 28499911 25318257 22461532 22095260 22662911 21736287 20062526 18388767 19112068 19835369 19554708
-16171 19554708 19274044 20487653 21701263 23163920 24626573 24594956 24563339 23601695 22640047 23172676
-16161 23172676 23705302 23023831 22342360 20166619 17990878 19449640 20908406 22367168 23825931 24413037
-16151 24413037 25000141 24186367 23372591 23391563 24904803 26978398 26561540 24961715 23361890 25093048
-16141 25093048 26824205 26780914 26737623 26694333 26651039 25549305 24447572 23345839 22244105 20515379
-16131 20515379 18786656 18552203 18317751 18270082 18222413 18174744 18127076 18219492 18311912 20894785 23477658
-16120 23477658 23881382 24285109 24688837 25092561 23352161 21611764 21365637 21119511 23301574 25483641
-16110 25483641 25175251 24866864 25469046 26071231 26580022 27088814 25262806 21942528 20458957 21465837
-16100 21465837 22698419 22436724 20680762 18924797 18631976 18339151 18046329 17753505 18480213 19206918
-16090 19206918 19933627 20660332 20702163 20743996 23276283 25808566 24702454 23596343 23984505 24372664
-16080 24372664 24854217 25335769 23326869 21317969 20865599 20413232 19960866 19508496 19429697 19350898 20766370
-16069 20766370 22181845 22363277 22544709 22726145 22907577 22559791 22212001 21864212 21516426 21557770 21599116
-16058 21599116 21640463 21681806 22594812 23507814 21930367 20352916 19254100 18155285 17056472 18448109
-16048 18448109 21676458 23410533 21657972 19905415 19149036 18392658 17791934 17191209 18178149 21655541
-16038 21655541 24572582 25995350 26657364 27319375 27887999 28456620 26659308 24861999 23220345 21578686
-16028 21578686 21641433 24194637 26187485 26686063 24974362 23262662 22951841 22641020 22573408 22505797 22438185
-16017 22438185 22370573 22396354 22422133 22447915 22473693 22304908 22136120 21967332 21798548 23497601 25196654
-16006 25196654 25401434 25606217 25201519 24796818 22991240 21185662 18944253 18197118 20002696 21808274
-15996 21808274 23349243 23395938 23349243 24796818 26119873 25948655 23224719 20500787 19596051 18691318
-15986 18691318 17288491 14391393 13206482 14512025 16658097 17309894 16023808 14737721 16751487
-15977 16751487 18765252 19845098 19430671 19856772 20282874 19619886 18956901 18854268 20245905 21232844
-15967 21232844 20725514 20218179 21205119 23561808 24424224 22671664 19424832 17111924 16293282 17031177
-15957 17031177 17769070 19014783 20260496 20011939 19763379 19296908 18830433 18363959 17897485 18668454
-15947 18668454 19439427 18716123 17992822 17362915 16733004 17597367 18461727 18248191 18034656 18474861 20409341
-15936 20409341 21596686 22784027 22570491 22356955 22859421 23361890 23770966 24180042 23717462 21760605
-15926 21760605 19803752 19341169 19830020 20318869 19406837 18494805 17489382 16483957 14638006 14286329
-15916 14286329 15662401 17038473 16858011 15183279 15033951 14884619 14641897 14399175 15671644 16944109
-15906 16944109 17562830 16687279 15780599 14873919 15461509 16049103 17461657 20368481 23275309 24687863
-15896 24687863 23018479 21349099 20240070 20625311 21703210 22781109 23018479 24750123 26481767 26719137
-15886 26719137 23563266 20407394 19088233 20259526 20029935 19800347 19819804 19839260 19858716 19878172 19327064
-15875 19327064 18775952 18224844 17673732 18897072 20120411 19849477 18084268 16552542 17511269 19310525
-15865 19310525 19615507 18986574 18357637 19129580 19901523 20187049 20472575 19263830 18055086 15819028
-15855 15819028 13582968 14833546 16084124 16128388 16172653 16216917 16261178 16523360 16785538 17047716 17309894
-15844 17309894 16667823 16025755 15383684 14741613 14317459 13893301 13469147 13044993 15461509 17878028
-15834 17878028 17804094 17730157 17344916 16959674 18068703 19177732 18724392 18271052 17817712 17364372 18623220
-15823 18623220 19882064 19646641 19411215 18880046 18348881 16479095 14609310 13548920 14978986 17498622
-15813 17498622 20018261 19755109 19491961 19228809 18965657 18079890 17194127 16308363 15422597 15610841 15799085
-15802 15799085 17481600 19164115 20379668 21595225 21316508 21037791 20918619 20799447 19186002 17572559
-15792 17572559 16145897 14719239 14786851 14854463 15731473 16608481 15991217 15373954 15410436 15446918 17973853
-15781 17973853 20500787 19912710 19324633 18736553 18148476 16408562 14668652 14423010 14177370 15573872
-15771 15573872 16970374 16872606 16774834 16147845 15520852 16388136 17255417 17371668 17487922 17604176 17720431
-15760 17720431 17930075 18139720 18349368 18559012 19321225 20083442 19849477 21109781 21809735 20019235
-15750 20019235 17232553 14445874 14974608 15503343 17526348 19549356 21043143 22536927 23843930 22660477
-15740 22660477 19476879 14799011 11335237 11358101 13435587 15513069 17808472 20103872 19816399 19528926
-15730 19528926 19241453 18953983 18666510 18379037 18091564 17804094 17882406 17960718 18039034 18117346 20156889
-15719 20156889 22196436 22741710 23286983 22034944 20782909 19530873 18278835 18645593 19012352 19379111
-15709 19379111 19745870 17388693 15031517 14168614 13305711 11757933 10210156 12149013 14087871 14805820
-15699 14805820 15523773 16241722 16959674 18331368 19703062 18584307 17465548 16549138 15632728 16210592
-15689 16210592 18282726 20541647 20310112 18086216 15862319 14998929 14135540 14766421 15397305 15841402
-15679 15841402 16285499 16729600 17173697 16536004 15898314 15260621 14622928 14856893 15090863 16819099 18547338
-15668 18547338 19726897 20906459 19595564 18284673 18312399 18340125 18367850 18395576 18866915 19338251 17319137
-15657 17319137 15300020 12813945 10327867 10332245 10336623 12648075 14959530 15776708 16593889 14547046
-15647 14547046 12500207 10453364 8406522 9527228 10647931 11768634 12889340 15877884 18866428
-15638 18866428 18368337 17870246 19012352 20154459 19802295 19450127 18848916 18247705 17646493 17045282
-15628 17045282 16654205 16263125 16027699 15792273 15432326 17562830 20627255 22197410 21027578 19857746
-15618 19857746 20088794 20319839 19523578 18727313 16436775 14146240 14174939 14203635 14232335 14261034 14632171
-15607 14632171 15003308 17864894 20726484 23160028 25593570 23544296 21495023 20753239 20011452 20763939
-15597 20763939 21516426 19825155 18133884 17936884 17739887 18165501 18591116 17522456 16453800 15085511
-15587 15085511 13717221 14839384 15961548 17005883 18050221 17600285 17150349 17229635 17308921 16641071
-15577 16641071 15973222 14075711 12178196 11774959 11371718 12978352 14584989 14697348 14809711 16198431
-15567 16198431 17587151 18975870 20364590 21294134 22223675 18826055 15428435 14163266 15388549 16800616
-15557 16800616 16718413 17066199 17413988 16174110 14934235 13647662 12361092 12568789 12776490 13583454
-15547 13583454 14390422 13703113 13015807 12141718 11267625 11887805 12507990 10989881 9471777 9447942 9424108
-15536 9424108 11019068 12614027 11718534 10823041 9927547 9032054 9630835 10229612 11108566 11987521 12866479
-15525 12866479 13745434 13851958 13958483 16555460 19152441 17173210 15193983 15705205 16216430 15887124
-15515 15887124 15557820 15726608 17389667 18788113 17696109 15670183 15138531 14521268 12409731 10484981
-15505 10484981 11050684 12254564 11964173 10179512 8394848 9489772 10584697 8348640 6112582 5806625
-15495 5806625 7991122 9708660 9931926 10139383 11841110 13449448 13563511 11903130 10242746 9236107
-15485 9236107 9723738 10896248 13563024 15435974 14818468 12784516 11497703 12125422 12753142 12299072
-15475 12299072 11845002 11951286 13551838 13969426 12892744 11862757 12327041 14612471 16150762 15603302
-15465 15603302 13561567 12562711 12310989 12292750 12274507 12649049 13023590 13398131 13772672 13057638 12342606
-15454 12342606 12374710 12406813 12485612 12564411 11242333 9920252 9936790 11447600 12257969 11574067 10185834
-15443 10185834 9544737 9884257 10223777 11248168 12272563 13296955 14321350 14941044 15560738 15526690
-15433 15526690 13998369 11987521 9976677 9366709 8756742 8800763 8844784 9635940 10427099 10564510 10701921
-15422 10701921 11819954 13685117 15519151 15858915 15109102 13612154 12722256 13326628 14444657 15562685
-15412 15562685 14705861 12354767 11342292 11824085 11683269 9051997 5626895 3696063 4761560 6574192
-15402 6574192 6503417 4938372 4727510 6010921 7294332 7083470 6859718 8130239 10334679 11791984
-15392 11791984 11972930 11406740 11214121 11021498 10875574 10729650 10583723 10437799 9326823 8215847
-15382 8215847 7758615 8795658 11301676 13807694 13854389 12406813 10554540 10196535 10398887 10601236
-15372 10601236 10858062 11114892 11371718 11628548 10484494 9340444 10686843 12033246 12304180 12575115
-15362 12575115 11351775 10128439 9060753 7993068 8419656 8846244 9864314 10882383 11900453 12918522
-15352 12918522 12815889 12713256 12610623 12507990 12597975 12687961 11283677 9879392 9097722 8316049 9028650
-15341 9028650 9741250 9582192 9423134 9264076 9105018 10066662 11028307 11989955 12951600 11939369 10927134
-15330 10927134 8576283 6225430 6396162 9057349 10379914 9212029 6658827 6596080 9459616 12323150
-15320 12323150 13100932 13878710 14656492 15434270 16083637 16733004 17288978 17844951 16221779 13104336
-15310 13104336 11263247 12908796 15426001 16448936 15043677 13638422 13478390 13318359 13158327 12998295
-15300 12998295 12987595 12976895 11471921 8472676 6407349 6832479 10090497 13348515 13789211 11739451
-15290 11739451 10250042 10254907 11847436 13439961 12635431 11830897 10174161 8517424 10347327 13671496
-15280 13671496 16777755 17393558 15020816 12648075 12532311 12416543 12300776 12185008 11104188 10023372
-15270 10023372 11433008 12842645 12709365 12576085 13937079 15298073 15413840 15529608 13154922 10780237
-15260 10780237 10141083 9501933 11353236 13204538 13405914 13607289 13808667 14010043 15151175 16292312
-15250 16292312 15939170 15586033 15699853 15813677 14433226 13052776 13470121 13887466 12966191 12044920
-15240 12044920 12929226 16303985 17748643 15706665 12819781 9932899 9318554 8704211 6751247 4798283
-15230 4798283 5335774 5873265 5601358 5329450 5057544 4785638 3237373 1689108 3627479 5565849
-15220 5565849 7323273 9080697 9343848 9607000 8873970 8140939 8902182 9663422 8977090 8290754 6110150
-15209 6110150 3929544 3616778 3304011 4485517 5667025 4535618 3404214 3767080 5624219 7107789
-15199 7107789 6100907 5031764 6453073 8855000 8766472 7744024 6721576 8407495 10093414 11779337
-15189 11779337 13465256 13088771 12712282 9845344 6978403 6041564 5104726 5662160 6219594 6325633
-15179 6325633 6431671 6537710 6643749 6313957 5984167 5654377 5324587 6001193 6677799 8848675 11019554
-15168 11019554 12349902 13680252 10527785 7375319 3942676 510033 2556389 4602743 7147191
-15159 7147191 9691634 12236082 14780529 15110806 15441083 15771360 16101636 16151736 16201836 14757665 13313494
-15148 13313494 12694287 12075076 11455869 10836662 9781624 8726585 9165821 11099327 12984190 12378601
-15138 12378601 10776832 9175060 9596784 10018507 10440230 10861953 10170756 9479559 8788359 8097161
-15128 8097161 9118149 10139139 11160126 12181117 10956804 9732494 10002455 10272416 10386726 10501033
-15118 10501033 9121070 7741105 8937203 10133301 8838948 7544593 7775641 8006689 8284432 8562175
-15108 8562175 11232116 14649196 16556434 15973222 14658436 13343653 12480264 13111145 14481382 15104480
-15098 15104480 13750782 10902813 9191112 9969864 10188269 8912395 7062553 6706983 7861250 9015515
-15088 9015515 8535423 7308194 7154973 8496024 9689204 10882383 12168956 13455526 14057224 14658923
-15078 14658923 13766347 12873775 11970499 11067223 10163947 9260672 9478099 9695526 8418682 7141839
-15068 7141839 7717270 8292701 8868131 9443564 9458642 9473721 9488799 9503880 10557945 11612009 12059024
-15057 12059024 11011772 9357466 8450299 9426539 10402778 10585184 9273316 6980835 5435490 4824063
-15047 4824063 5706909 7772721 10585671 12579493 13079041 11072571 9066105 7775641 7979448 8837001
-15037 8837001 9694555 8598657 7502761 6406864 5310966 3467934 1624901 1276140 927380 1781042
-15027 1781042 2634703 3815235 4248632 4012721 2282537 505657 223049 2220762 4218476 6309581
-15017 6309581 8400686 9075345 9750007 9911009 10819149 12549333 12785246 12414109 12042972 11796359 11549746
-15006 11549746 11303133 11056520 10000511 8944499 7888489 6832479 7644308 8456138 8707616 7464820
-14996 7464820 6951651 7932753 7979935 8027119 6611159 5195200 3779240 2363282 2519422 2675561 1851084
-14985 1851084 279472 -389349 436099 2288859 3394486 4360995 5327505 6247319 7167134 6374760
-14975 6374760 5582387 6284286 6986187 7917673 8849162 8286379 7723594 7440986 7158378 8370040 9581705
-14964 9581705 9766059 9950408 10134761 10319114 9476155 8633192 7790232 6947273 6777513 6607754 6437994
-14953 6437994 6268234 6876743 7485250 8093757 8702264 9337036 9971812 9112313 8252815 6521658 4790501
-14942 4790501 3152736 1514970 254666 488631 2372523 4256416 5548825 6841233 7526595 6717683
-14932 6717683 5266703 4562859 4948587 6828587 8615196 9654669 9557871 7966803 5624706 3282609
-14922 3282609 2341393 1400177 1828710 2257242 2685776 3114310 3068587 3022864 3070532 3118201 4099789 6575651
-14910 6575651 8958120 9846314 8570932 5801275 3451882 1849625 854416 1353481 3455774 5558066
-14900 5558066 5788627 4524918 3167816 3304985 3224239 1649222 120901 86851 722112 610236 124792
-14889 124792 1133620 3776809 5672862 5062894 3705791 3732545 4506434 4766667 5026899 5660701 5547366
-14878 5547366 4920375 5787655 6468152 5654377 2910501 913761 909383 1652140 2114723 2577304 3627479
-14867 3627479 6171925 7222098 6777999 5991463 5204928 4325000 3445072 2783059 2121047 1132161 890411
-14856 890411 2298589 5201037 6655910 6616509 6294014 5971520 6302771 6634021 6420484 6206946 4436876
-14845 4436876 1172535 -1877784 -3433831 -2374903 178298 2778194 3883821 2530122 1176426
-14836 1176426 416156 1150159 1790770 2431380 2760684 3089989 3512684 2441109 797506 -846095
-14826 -846095 -1088817 -1331539 -1278520 -1225499 228399 1682298 3393025 3609482 3265586 2921687 5130506
-14815 5130506 8833597 11602766 11881483 10323492 8765498 7145245 5524990 5399008 6767299 8695942
-14805 8695942 10624583 9961598 7804338 5086728 2369119 1581610 2288374 3648881 5009388 5825109
-14795 5825109 6640830 5962279 5283727 5009875 4736022 4462170 4188318 5597952 7007589 6767299 5032736
-14784 5032736 4123138 3213539 2210547 1207556 873874 540191 -447232 -1434659 -1970691 -1012449 599534
-14773 599534 2211519 2070459 1929398 3189217 4449037 4868328 3793346 2064622 335897 1237714
-14763 1237714 2139529 1547074 -539652 -2906555 -2783005 -1725536 -2162338 -4547725 -5438842 -2781060
-14753 -2781060 -123279 993532 2110345 2480021 2849699 2129801 1409905 690008 -29887 479877
-14743 479877 989640 1499405 2009170 454097 -1100977 -1006125 582997 1642898 2702800 2361823
-14733 2361823 2020844 862686 -295471 -1360238 -2425003 -1902105 115064 2132234 2655131 1815091
-14723 1815091 975049 41615 -891818 -953593 -1015368 -1077143 -1138918 -1652087 -2165257 -2585034 -3004812 -2397277
-14711 -2397277 -295471 1806335 2413870 1072332 -269205 -209862 -150520 -386918 -623316 -112579 398159
-14700 398159 1457573 2516990 2019872 28482 -2056300 -2646809 -1353914 -808154 -2273727 -5233574
-14690 -5233574 -6745842 -6763840 -6937491 -7111142 -5634867 -2664320 349030 1868110 2671183 3474258
-14680 3474258 3156627 348544 -2459539 -2777168 -740542 1296083 935649 -919057 -3085071 -3756812
-14670 -3756812 -2965413 -2174013 -2503316 -4326892 -6150469 -6479773 -5672807 -4865843 -4012181 -3158520 -2026629
-14659 -2026629 -1641872 -1023637 1088871 4804607 7026071 5636380 2752414 1463897 1669652 1081573
-14649 1081573 -1000775 -3285475 -4823037 -5800249 -6030323 -5513262 -4996202 -4432444 -3868688 -3974241
-14639 -3974241 -4079793 -3671690 -4010721 -5104674 -4704352 -2794194 -884035 -1012935 -2636108 -3839017
-14629 -3839017 -4294790 -4131839 -3968889 -3759245 -3549598 -3962567 -4375534 -4788501 -5201470 -3948946 -2696424
-14618 -2696424 -1443900 -191378 843230 1877838 421993 -1033852 -2345717 -3657583 -4876056
-14609 -4876056 -6094531 -6488041 -5387280 -4706785 -4773423 -4871193 -4968963 -5113428 -5257895 -5744797 -6231700
-14598 -6231700 -5068679 -2411383 -634990 1141403 520735 -99931 -1872434 -3644936 -3923166 -4201398
-14588 -4201398 -3125443 -2049489 -973536 102416 1302893 2503370 1213393 -76584 -800372 -1524159
-14578 -1524159 -2247947 -2971736 -2730473 -2489210 -2247947 -2006686 -2489210 -2971736 -3454261 -3936787 -4294790
-14567 -4294790 -4652792 -3516523 -2380253 -2739228 -3098204 -1962908 -827610 -532842 -238075 56693
-14557 56693 351462 1665761 2980058 2800083 2620110 2502397 2384684 2266971 2149259 -344599 -2838458
-14546 -2838458 -3838043 -4837630 -4311814 -3785997 -3353573 -2921148 -2473158 -3519440 -5219467 -4429040 -1397205
-14535 -1397205 140357 -1808713 -3757784 -3441613 -3125443 -2809272 -2493101 -2083539 -1673976 -1762503 -3345304
-14524 -3345304 -3293744 -751729 1136540 1530537 1426443 1322350 626774 -1563074 -3993697 -3933868 -1881675
-14513 -1881675 170515 323736 476958 630179 783400 -293039 -1369479 -2445919 -3522360 -3384703
-14503 -3384703 -3247047 -3109391 -2971736 -3109391 -3247047 -1890431 -533815 -111118 311576 734273 1156968
-14492 1156968 2163365 3169761 2681885 2194009 2173093 2152177 2131262 2110345 836419 -437504 -1711430
-14481 -1711430 -2985356 -3543275 -4101195 -2168661 -236127 -965267 -1694406 -2423544 -3152683 -4255389
-14471 -4255389 -5358096 -3970350 -2582602 -755135 1072332 2899799 4727267 4998201 5269136 5540069
-14461 5540069 5811003 3980617 2150231 -1174426 -4499084 -4305977 -4112869 -2425489 -738110 439504
-14451 439504 1617118 1300461 983803 169056 -645692 2026194 4698083 5066299 5434516 4308461
-14441 4308461 3182407 2274268 1366127 2948441 6025027 7422015 6328551 4394558 3954837 4947127
-14431 4947127 5939418 7025099 8110783 8636113 9161443 9686773 10212103 11951526 13690953 15336989
-14421 15336989 14492569 13272634 12052702 13167570 14282437 15366172 16449909 17533647 18617381
-14412 18617381 18222413 17827442 18926744 20026044 20814039 21602034 22390029 23178024 21625381 20072742
-14402 20072742 21010552 21948363 22699389 23450419 24201446 24952472 27400121 29847770 29804966 29762163 31400413
-14391 31400413 33038663 33680735 31832350 29867227 29396378 30419796 31443217 34365610 37288003 40210389
-14381 40210389 43132782 43424636 43716484 44008332 44300186 43160024 42019861 44366334 46712807 48775215
-14371 48775215 50837623 51405760 51973891 55312658 58651419 61990187 65328948 63951415 62573883 62690627
-14361 62690627 62807365 63546718 64286070 65025423 65764783 69282541 72800307 73827620 74854932 74761542
-14351 74761542 74668152 74574762 74481365 78388263 82295161 83711606 85128052 87167112 89206172 91245232
-14341 91245232 93284286 93647637 94011001 95868623 97726244 99459345 101192446 102925561 104658662 104539483
-14331 104539483 104420318 105795410 107170515 109479536 111788557 113443833 113604838 114075197 114545570 117412985
-14321 117412985 120280413 121030956 121781499 122532042 123282585 121869534 120456497 119136849 117817202 117929565
-14311 117929565 119536199 121796577 124056956 125716126 127375297 128193929 130506844 133473491 136440152
-14302 136440152 136947483 135960543 136203268 137940264 139303686 137180471 133500740 131315266 131713641 133606288
-14292 133606288 135037811 136469335 136499978 136530621 136374484 136218347 137463090 138707833 139384432 138566760
-14282 138566760 137188747 135810735 134339318 134362186 134478430 133100417 131573556 131540966 131508375 129981514
-14272 129981514 128143339 127799448 130911048 134022662 134130157 132743381 132197145 131650894 129983948 128316988
-14262 128316988 128144312 127971637 125719047 123466445 122770386 123568598 123899845 122736822 121013444 119290066
-14252 119290066 119092102 118894124 118696160 118498183 118206828 117915461 117624093 117332725 117416879 117501033 117585187
-14241 117585187 117669328 116134691 114600041 113065404 111530754 109941632 108352511 106763377 105174255
-14232 105174255 105110535 105046814 106477364 107907927 108190532 108473137 108755742 109038360 108200255 107362164 106524073
-14221 106524073 105685968 103470337 101254720 100595620 101430804 101799009 100672958 98986552 97300146 95085489
-14211 95085489 92870839 92150452 91430072 91238910 91047748 93129122 95210496 95805389 92913639 89928499
-14201 89928499 90429995 93453081 94981889 92930665 89385177 86724962 84064748 82805413 81546085
-14192 81546085 81812152 82078224 82344290 82610363 83841482 85072600 83813273 82553938 83318099 84082260
-14182 84082260 84846421 85610581 84983592 84356595 83729606 83102616 80203084 77303558 76894479 76485400
-14172 76485400 75484843 74484286 73483728 72483164 73599493 74715821 75832149 76948470 76918801 76889131
-14162 76889131 78198075 79507025 79383959 76770446 74063536 73847079 75622988 75904619 72917538 69930451
-14152 69930451 69091386 71738950 74666691 76100162 74851044 72107656 69270871 67928363 68765001 69601631
-14142 69601631 70531666 71461694 70913016 70364338 68321384 66278436 64546795 62815148 61083507 59351860
-14132 59351860 58594994 57838129 58575542 59312947 61139932 62966910 62303435 61639967 59731269 57822564
-14122 57822564 58404319 58986074 59785747 60585412 61385085 62184750 62277173 62369590 60967736 59565882 60280920
-14111 60280920 60995952 61710983 62426015 59545456 56664896 56274790 55884684 58140681 60396685 61158411
-14101 61158411 61920144 59479301 57038464 56091897 55145331 56066603 56987874 56414875 55841876 53969177
-14091 53969177 52096470 51718035 51339605 51397004 51454403 51511794 51569193 51879040 52188887 52498734 52808581
-14080 52808581 53118435 53428282 53738129 54047976 54007603 53967230 53926856 53886483 53223495 52560514 51897526
-14069 51897526 51234538 51585245 51935952 52286659 52637366 52630070 52622774 53456004 52794963 50048167 47301371
-14058 47301371 45363977 44920854 45209294 45497741 47467245 49436743 49237311 46547427 43172668 41292186
-14048 41292186 41653103 42014026 41223110 40432201 40715292 40998384 42931410 44864429 46797448 47236197
-14038 47236197 46274065 45311927 43803065 42294203 41190033 41580139 42468340 43356534 42096713 40836898
-14028 40836898 40456522 40076139 40442897 40809656 40725022 40640381 40555747 40471113 39598964 38726822 39597990
-14017 39597990 40469166 41371471 42273770 43176076 44078374 45229727 46381073 46629634 45383917 42737327
-14007 42737327 40090730 37755447 36914435 36999556 37084677 37263195 37441706 37744744 38047782 38350820 38653858
-13996 38653858 37867324 37080789 36107467 36628422 37382853 36643014 35591867 34540720 35768921 36997122
-13986 36997122 37478191 37959253 37163962 36368672 36320516 36272364 35998508 35724656 34205578 32686499 32568298
-13975 32568298 32450100 33079037 33707973 35370058 37032146 38787621 39048826 37348802 35648775 34602493
-13965 34602493 36046664 38619320 39697709 37974331 34756686 32986617 32710821 33742508 34774199
-13956 34774199 34655514 34536829 34418143 34299455 35317041 36334624 36106980 35879337 36608963 37338586
-13946 37338586 36822985 36307385 35013516 33719647 34169096 34618545 34490130 34361719 33486168 32610618
-13936 32610618 34334480 36058338 36536973 37015608 35587489 34159370 32731247 31303128 31727286 32151440
-13926 32151440 31828458 31505477 30614362 29723247 31073541 32423834 32046376 31668913 32038593 32408269
-13916 32408269 31960764 31513263 31065758 30618253 31042410 31466564 31890722 32314876 32639801 32964730 32542519
-13905 32542519 32120309 30266089 28411869 28300966 28190064 29822475 31454891 33087306 34719721 33565941
-13895 33565941 32412161 33001695 35085506 36005321 34434679 32272559 31604709 32742438 33880166 33367967
-13885 33367967 32855771 31705395 30555019 30649870 30744724 31648970 32553220 31714151 30875083 28975625 27076170
-13874 27076170 27853948 31122183 34016847 34421061 32148035 29875009 29423130 28971247 30107031 31242812
-13864 31242812 32347466 30961664 28392899 27318405 28200277 29082149 27909399 26736650 27058170 28873965
-13854 28873965 28666264 25968111 24554096 25630538 27889943 30149348 31832836 33516325 33456495 33396666
-13844 33396666 33064445 32732221 32400000 32067776 29478581 26889386 27537779 28186172 29293741 30401313
-13834 30401313 32100366 33799420 33895244 31500616 28016411 26026480 26598992 28665778 30779259 31398466
-13824 31398466 30492272 28838944 27512484 26186025 25163090 24140156 24611495 25082834 25336256 25589678
-13814 25589678 25843100 26096526 26164138 26231750 26299361 26366973 26434585 26502197 26569809 26637421 27094165 27550910
-13802 27550910 28007655 28464402 28391926 28319449 28246972 28174499 27379204 26583914 26769240 27701699 28213898
-13791 28213898 27231820 26249745 26761945 27803362 28097644 26991045 26631582 27579609 28527636 28028085
-13781 28028085 27528536 25967624 24406712 24340074 24273436 24144534 24015635 23886734 23757832 23014101 22270370
-13770 22270370 21526640 20782909 21486753 22190598 22380789 23318113 25306583 25800783 24209228 21870538
-13760 21870538 21352990 22329713 23306439 22788892 21423033 20804312 20792639 21528100 22699389 24617817
-13750 24617817 26489550 27614144 28108344 27108273 25968111 26322222 26629638 25442781 24722884 24750123
-13740 24750123 24442707 23388156 22473693 22306365 23197481 25582870 28528610 28983894 27297975 24864917
-13730 24864917 24253006 25135365 26375730 26121817 24420333 24213119 24721911 24483567 23871655 24754014
-13720 24754014 26009944 26518736 26046910 25575087 24354182 23133273 22472719 23306439 24700511 24600308
-13710 24600308 22990267 21380229 20065930 19498770 19118390 20232284 21953228 22927033 22437698 21201228
-13700 21201228 21191498 22676042 23273362 23870682 24125564 24380447 24074978 22275235 20421015 20061065 20354864
-13689 20354864 20648659 20786800 22419215 24611982 26804748 27372882 26446746 25520606 26088743 25816348
-13679 25816348 25543957 24524427 24999171 25271562 25543957 24415468 23286983 23839552 24392121 23450419
-13669 23450419 22508714 22533035 22557357 22581678 22605999 23066148 23526300 21589387 19652476 18836268 19514335
-13658 19514335 19351872 19189410 19089207 18989005 19822721 19162167 17892620 18117346 20739131 23360917
-13648 23360917 23336596 20821821 17373128 15418705 15658996 15899284 16232969 16566650 16806938 17047229
-13638 17047229 17287517 17527808 17042851 16557894 15325799 15587980 17437822 20781935 24126051 25975893
-13628 25975893 25592113 23714054 21742609 21265435 22158011 23050583 22542278 22033974 20492518 18951062
-13618 18951062 18063355 18669915 20521704 22373490 21828217 21282944 20932240 20581534 20230827 19880120
-13608 19880120 19373759 18867399 18361041 17854681 18029791 18204901 18380011 18555121 19197192 19839260 19080451
-13597 19080451 18321642 18278835 19730305 20341242 20952184 20722593 20493005 21664297 22835587 23676115
-13587 23676115 23022370 22368629 23209154 24890212 26571266 25855261 25139256 23481549 21823842 18827512
-13577 18827512 15831186 14982878 16625019 18360554 20096090 20706054 21316021 20011452 17959748 17775882
-13567 17775882 20082469 22529144 23481549 23702381 23923215 24050657 24178098 22733440 21288783 19844125
-13557 19844125 18399467 18087189 17774908 17462627 17150349 17413988 17677623 17941262 18204901 18445192 18685480
-13546 18685480 18692289 17951966 17585207 18712718 20400585 22088451 23280174 23724758 23033074 20847116
-13536 20847116 19268208 19183571 20079551 20228393 18882967 17537538 16939244 16340951 17454845 19315877
-13526 19315877 20149594 19489040 18688397 18634893 19562003 20489114 19595081 18701045 19301282 19901523 20509544
-13515 20509544 21117564 20231314 19345060 18178636 17012208 17340051 17667897 18065299 18462701 18813408
-13505 18813408 19164115 19343603 18775952 17788042 18294400 19723006 21151611 21117077 19588269 17763721
-13495 17763721 17433444 18146045 19605781 21271757 21443463 20011939 18580416 17475761 16371110 16013595
-13485 16013595 15656075 17333729 19011379 19194758 19378137 19374733 19371328 18807573 16749543 15569494 15883719
-13474 15883719 16851689 16325386 15176470 14027555 13625775 13223995 13020672 14311620 15649267 15492643
-13464 15492643 13608262 12471021 13793102 15862319 17127975 16899358 17091007 18029791 18906315 19035700
-13454 19035700 19118390 19948219 20669089 19895685 18842107 18535664 18353746 18171823 18690345 20703136 21520318
-13443 21520318 22337495 20757614 19177732 20399611 21621490 20352916 19084342 16465474 13846606
-13434 13846606 12722012 11597415 12683100 13768781 14854463 15940144 16160979 16381810 14267843 12153878
-13424 12153878 12063402 14463383 16396402 16835151 17071550 18802221 20439498 20582504 20336377 20090251
-13414 20090251 19750731 19411215 18583333 17755452 17674706 17593960 19427753 21261544 21165233 18578468 15836050
-13403 15836050 15584089 16266043 16948000 17785608 18623220 17966557 17309894 16640584 15971274 17792421 19613563
-13392 19613563 20500787 21388011 20780965 20173915 18570686 16967457 16858498 16749543 17885811 19022082
-13382 19022082 18664079 16811803 16217887 18114428 20010965 19417050 17702431 17482087 18756009 20029935
-13372 20029935 18891233 17752534 18108103 18463675 18663593 18863507 20557699 22251888 20692923 19133955
-13362 19133955 17574990 16016025 16169248 16322468 16475691 16628910 16688740 16748569 16808399 16868228 16321007
-13351 16321007 15773790 14479435 13185079 13088771 12992460 14390422 15788382 13917623 12046864 13662740
-13341 13662740 15278617 16474230 17669841 18118319 18566795 19373272 20179753 20986231 21792709 19768244
-13331 19768244 17743778 17213583 16683388 16090933 15498478 14906023 14313568 13425370 12537172 14139431
-13321 14139431 15741687 16503417 17265143 16532599 15800055 15755791 15711530 16165357 18113454 19937032 19270152
-13310 19270152 16704305 14138457 12957925 13271664 15079672 16887684 18415519 17452901 14497921 11542937
-13300 11542937 10640635 11232603 10984046 10735486 10642579 10549676 10456769 10363862 12092102 13820341 14988226
-13289 14988226 14661840 13681713 14195853 14616606 13543081 11678648 9814214 10409100 12498260 13933674
-13279 13933674 13874819 13255612 12636401 12542524 12448647 13755647 15062650 16213996 15871072 15434757 16492713
-13268 16492713 17756912 17526835 15740226 13953618 14501812 15050003 14197313 13344624 13025050 14199744
-13258 14199744 14533912 14868084 14828681 14789282 14843276 14897266 14917696 16432397 17947101 17967531 16213509
-13247 16213509 14459491 14106354 13753216 14941044 16128875 17316703 18504534 17762261 17019990 16277717
-13237 16277717 15535446 14830141 14124836 14913805 15702774 15526690 15350607 16575403 17800203 18775952
-13227 18775952 18257434 16182379 14107327 12001142 11389231 13423426 15457618 16177514 16897414 17617311
-13217 17617311 18337207 18403358 18469510 18442271 18415032 17267090 14624875 11982660 10834714 11212173 11589632
-13206 11589632 12060485 12531337 13048885 13566432 15484860 17403285 17796312 16695062 16434344 16173623
-13196 16173623 16395432 16617237 18239922 19862607 21080595 20804312 19033756 18757470 19854338 20951210
-13186 20951210 19651019 16856554 14840355 15314612 16785051 18255487 16737382 15219274 13701169
-13177 13701169 12183061 12968625 13754186 13668092 11091544 8744581 9884257 13389862 16895467 15824863
-13167 15824863 14754260 13683657 12613054 12569763 12526472 12483182 12439891 12178683 11917478 13150544 14383610
-13156 14383610 14612228 14840842 15069459 15298073 13907896 12517716 12621810 12725903 12814432 12902957 12991486
-13145 12991486 13080015 14195853 15311694 13937079 12562467 12063402 11564341 13555729 15547120 16355545
-13135 16355545 17163970 17972392 18780817 17519052 16257287 14995522 13733760 13748351 13762943 13777537 13792129
-13124 13792129 13098011 12403896 10215507 8027119 7706568 7386021 8559745 9733468 10300141 10866818
-13114 10866818 11433495 12000168 12815889 13631610 13015320 10904761 9403191 11388257 15552472 18222413
-13104 18222413 18806599 17896511 17733561 17570612 17917428 18264243 18611059 18957875 18650945 18344016 19531360
-13093 19531360 20718701 19528439 18338177 17147919 15957656 15981491 16005325 16029160 16052994 16096285 16139575
-13082 16139575 16182866 16226157 15895880 15565603 15235326 14905049 13366514 11827979 10289441 8750906
-13072 8750906 9920739 11090571 12260403 13430235 12728334 12026437 12818810 13611180 13376241 13141301
-13062 13141301 12906362 12671426 12567819 12464212 12360605 12256998 13149571 14042146 13440448 12838750 12396600
-13051 12396600 11954447 13006564 15552955 18161610 18279808 15409462 12539120 12505555 12471995 13932704
-13041 13932704 15393410 15048542 14703674 12864532 11025390 11007394 10989395 12465669 13941944 12429674
-13031 12429674 10917405 10899409 10881410 13071259 15261108 15956683 16652258 15822433 14992604 15657049 16321494
-13020 16321494 15476104 14630710 13785320 12939926 13464283 13988642 15851615 17714592 16548164 12891284
-13010 12891284 9888148 8379283 9236350 11587688 13191891 14796094 15357419 15918741 16480066 17041391
-13000 17041391 14084950 11128510 10662522 10196535 10677604 11158669 11639735 12120801 12290559 12460321
-12990 12460321 12630079 12799837 10977234 9154631 9822480 10490333 11313836 12137340 11466569 10795802
-12980 10795802 10099740 9403678 10201886 11000098 14133106 17266117 17908671 18551230 16750030 14948827
-12970 14948827 13147627 11346427 11257411 11168396 11079384 10990368 11062358 11134348 11206338 11278328 10136222 8994115
-12958 8994115 9346279 9698447 9225647 8752850 8280054 7807258 8143857 8480459 8817058 9153660 11216065
-12947 11216065 13278472 12850427 12422379 11558502 10694626 11325023 13449691 16056885 16173623 14360263
-12937 14360263 14041173 15247487 14959530 13208430 11457329 12649535 15336015 16372567 14420579 13122332
-12927 13122332 11824085 10525841 9227594 8999464 11759881 13679766 14105380 13285768 12466156 14043607
-12917 14043607 15621054 14709996 13798938 12887879 11976821 12435513 12894205 10862440 8830679 8374905
-12907 8374905 7919134 7463361 7007589 8170612 9333632 10496655 11659678 12338228 13016781 12294450
-12897 12294450 11572123 12717634 15357419 17343455 16340951 14093219 11845488 10905244 9965003 11795389
-12887 11795389 13625775 13961887 14298002 13653500 13008998 12364496 11719994 11853758 11987521 12121288 12255051
-12876 12255051 12170900 12086750 12002603 11918452 12176739 12435026 12693313 12951600 13416614 13881628 11015663
-12865 11015663 6655423 3758325 5842135 9357953 11379501 11159640 10939782 12120801 13301820 13144222
-12855 13144222 12986621 12829024 12671426 12770655 12869883 11474838 10079797 8155530 6231267 5801275
-12845 5801275 5371282 5384902 5398521 6906414 8414304 10295767 12177226 14058685 15940144 15249921
-12835 15249921 14559694 13869467 13179244 11648491 10117736 10081254 10044775 10572536 11100297 11628061 12155822
-12824 12155822 13710896 15265973 15326772 15387575 14185639 12983704 13276042 13568376 13269229 12970083
-12814 12970083 12670939 12371792 12341149 12310502 14583528 16856554 16732517 13619936 11347884 10570106
-12804 10570106 9642022 8713938 9373518 10033102 10630418 11227738 9334605 7441473 7813095 8184716
-12794 8184716 8556340 8927960 8988277 9048593 9108909 9169225 10610962 12052702 12000168 10453364 8782037
-12783 8782037 9601162 12256998 13418561 12198626 10978694 12155822 13332950 12829024 12325097 10326897
-12773 10326897 8328696 7293601 6258506 6717683 7176862 6857772 6538682 6219594 5900504 5184498
-12763 5184498 4468493 6242941 8017389 10601236 13185079 14274655 15364228 14395284 13426344 12457400
-12753 12457400 11488459 11266654 11044846 10823041 10601236 9445508 8289784 9126418 12453509 15593815
-12743 15593815 17239848 16395432 15551011 14674488 13797964 12921443 12044920 11324050 10603180 9882309 9161443
-12732 9161443 9187708 9213973 9240242 9266507 9666343 10066176 7975557 5884939 5158232 4431526 5199092
-12721 5199092 5966657 8944499 11922343 12907822 11402848 8450299 6992024 8086461 10675169 11894131
-12711 11894131 11618818 12277428 12936035 12558576 12181117 10309384 8437655 9523337 10609018 11694700
-12701 11694700 12780381 12823185 12865992 12908796 12951600 13741542 14531481 11834788 9138092 9182843 9227594
-12690 9227594 11762798 14298002 16553029 18808056 17576451 16344842 15494587 14644331 13794073 12943817
-12680 12943817 12902957 12862101 12821241 12780381 12044920 11309458 12550793 14539264 15500425 14967313 14901158
-12669 14901158 15582142 16068559 16554977 15593815 14632657 14278546 13924435 12651966 10632366 9375465
-12659 9375465 10609018 12729795 13356298 12581924 11807549 11593523 12873775 14776634 16679497 17181479
-12649 17181479 17683462 17002478 16321494 15640510 14959530 13918109 12876692 11835275 10793855 9534524
-12639 9534524 8275189 8556827 8838462 9976190 11861053 14119488 14883649 13344137 11057493 9704769
-12629 9704769 9846314 10781694 10969938 10177565 9385192 10102657 10820123 11537585 12255051 11898509 11541963
-12618 11541963 11185421 10828879 10410074 9991268 11066736 12142205 14123866 16105528 17433444 17267090
-12608 17267090 16415862 15564629 14620010 13675388 11905805 10136222 9409513 11173261 13979886 16039373
-12598 16039373 16978157 16422670 15622028 14074250 12433079 11539046 11983630 12428217 11425226 10422234
-12588 10422234 10423208 10424178 10425152 10426126 10240312 10054502 9775298 9496098 9598244 8206120 5833379 4207774
-12576 4207774 4885838 7058175 8856944 9908578 10158596 10408613 10611936 10815258 11298755 11782255
-12566 11782255 12265751 12749251 13812559 14875866 14444900 14013934 13894275 13774616 13654958 13535299
-12556 13535299 12913661 12292020 12650996 13757107 14458518 13665661 13293064 13667605 15074324 15733904
-12546 15733904 14307729 11387283 9431890 8970768 10548702 12873775 14720213 15072377 13821315 12570250
-12536 12570250 11319185 10068123 8817058 7565995 5861591 4157186 4040446 3923707 5550284 8671134
-12526 8671134 11698591 13231777 13021646 11317241 8959091 6600944 5176716 5246760 5970548 6694336
-12516 6694336 6794051 6893767 6993482 7093198 8157965 9222729 10194104 11165478 11950069 11240386 10484008
-12505 10484008 11221903 12831454 13693874 12096967 9752924 8739720 9220785 10729164 11490403 12236082
-12495 12236082 12981760 13680739 14379719 15047568 15715421 14888997 14062576 13547459 13032346 12517229 12002116
-12484 12002116 11706373 11410631 12515772 13620910 14539264 13963347 12733686 11504025 10515624 9527228
-12474 9527228 10033102 10538972 11060411 11581850 11122674 9916360 8632221 8842353 10142057 12188900
-12464 12188900 13379648 13076124 11262763 9449399 8795658 9636183 11037063 12437944 14056738 14181261
-12454 14181261 12749251 11317241 11146509 12470047 13793589 13622854 12611596 11600336 10589075 9577814
-12444 9577814 9990781 11898022 13711869 14031446 13168057 10810393 9806915 10297711 11776903 12508960
-12434 12508960 12307098 12105236 12432595 13507090 15001847 15002334 13205022 11407713 11073545 12233651
-12424 12233651 12304180 10880439 8149208 6912251 7825742 10233503 12687961 13648149 13005107 11614927
-12414 11614927 10645013 9675099 9592406 11003989 11995304 12239486 12623757 13008025 13345597 13683170 13948756
-12403 13948756 14214339 14479921 14745504 14388475 14031446 13674414 13317385 13007051 12696717 12292993 11889266
-12392 11889266 11252060 9120583 7409369 6445290 6487609 6529927 6618941 6707955 6143226 5578496 5060462
-12381 5060462 4542429 3207215 2619136 4163510 7202155 10287497 11878566 11757447 10142057 8785441
-12371 8785441 7428825 7473089 7517354 9024758 10532163 12039568 13546976 13085367 12623757 10761267
-12361 10761267 8898778 7970207 8535910 9661965 10788019 11507916 10733542 9398813 8064084 7414232
-12351 7414232 8258650 9756815 11254977 12550793 13846606 13648149 13449691 11912613 10375539 8838462
-12341 8838462 7301384 6580029 5858672 6631589 7404504 8613249 9821997 10470390 9624509 8226063
-12331 8226063 8321888 9974243 11626601 11411118 11195635 10980155 10764672 9573923 8383174 8686699
-12321 8686699 10484494 11550720 10126492 8282001 7184644 6795510 6406377 7044556 8429869 9254833
-12311 9254833 8585523 8289784 8741177 9456695 8677943 6965270 5999732 7135515 9765572 10994746
-12301 10994746 10729650 10293333 10604153 10401318 10198482 10882870 11567258 10757376 9947491 9839992 9732494
-12290 9732494 11119270 12506042 11028794 9551549 10564754 11577958 12077510 12577059 10586157 8595253
-12280 8595253 7413747 6232239 6451614 6670988 5707396 3249534 1165237 2567576 5806625 9045675
-12270 9045675 9016002 7492059 6738600 8475594 10212586 11949582 12254564 12559550 12864532 13169514
-12260 13169514 13399105 13628692 12364010 11099327 9429943 7760561 9577814 11395066 13461365 15527664
-12250 15527664 16504387 14990660 11173261 7355863 6869446 6383030 5904395 5425762 4947127 4468493
-12240 4468493 5328478 6188462 7048447 7908432 8519372 9130309 9741250 10352188 10340514 10328841 10317167
-12229 10317167 10305493 10794707 11283920 11773133 12262347 10385631 8508915 6632195 4755480 7299316
-12219 7299316 9843153 12386992 14930831 13116375 11301919 9487463 7673006 8228372 8783740 9339105
-12209 9339105 9894470 10418708 10942943 9972907 9002868 9387017 9771163 10155313 10539459 12386749 14234038
-12198 14234038 14587054 14940070 13221561 11503051 11278815 11054576 9460586 7866600 8763067 9659531
-12188 9659531 10594910 11530290 9975216 8420143 9137608 9855071 10572536 11290002 10443151 9596297 10243720
-12177 10243720 10891139 9297153 7703164 8599631 9496098 9606514 9716929 9827345 9937764 8989737
-12167 8989737 8041710 7093683 6145658 6700781 7255904 6316755 5377606 7146825 8916043 10685264
-12157 10685264 12454482 12838388 13222291 13606197 13990099 12008073 10026046 9538293 9050537 10944282
-12147 10944282 12838023 12241312 11644600 12106331 12568062 11535520 10502977 8902304 7301627 7195223
-12137 7195223 7088820 4647616 2206413 854782 1993605 3567650 5141695 4380938 3620182 4042392
-12127 4042392 4464602 4886812 5309020 5910232 6511443 7112654 7713866 6447236 5180607 3913979
-12117 3913979 2647349 4071576 5495806 6920034 8344261 7246905 6149549 7449255 8748959
-12108 8748959 8912395 7581560 5690372 6289638 8476568 10663496 10515624 10367753 7905513 5443272
$$ [...]
##END=	
