##TITLE=userID orcid.org/0000-0002-8635-8390
test file
##JCAMPDX= 6.0         $$ Bruker NMR JCAMP-DX V2.0
##DATA TYPE= NMR SPECTRUM
##DATA CLASS= NTUPLES
##ORIGIN= Bruker BioSpin GmbH
##OWNER= nmr
$$ 1.83.2.2 TOPSPIN		Version 3.2
$$ 2017-04-27 18:13:27.239 +0100  IC\rns@ch-rns-z400
$$ Compression mode = diff/dup
##.OBSERVE FREQUENCY= 400.41240246
##.OBSERVE NUCLEUS= ^1H
##.ACQUISITION MODE= SIMULTANEOUS (DQD)
##.ACQUISITION SCHEME= undefined
##.AVERAGES= 16
##.DIGITISER RES= 22
##SPECTROMETER/DATA SYSTEM= spect
##.PULSE SEQUENCE= zg30
##.SOLVENT NAME= CDCl3
##.SHIFT REFERENCE= INTERNAL, CDCl3, 1, 16.00577
##AUDIT TRAIL= $$ (NUMBER, WHEN, WHO, WHERE, PROCESS, VERSION, WHAT)
$$ ##TITLE= Audit trail, TOPSPIN		Version 3.2
$$ ##JCAMPDX= 5.01
$$ ##ORIGIN= Bruker BioSpin GmbH
$$ ##OWNER= nmr
$$ $$ /opt/topspin/data/sdg/nmr/Aug01-2016/10/pdata/1/auditp.txt
$$ ##AUDIT TRAIL=  $$ (NUMBER, WHEN, WHO, WHERE, PROCESS, VERSION, WHAT)
(   1,<2016-08-01 12:56:26.891 +0100>,<nmr>,<CZC2439F6W>,<go>,<TOPSPIN 3.2>,
      <created by zg
	started at 2016-08-01 12:55:30.377 +0100,
	POWCHK enabled, PULCHK disabled,
       configuration hash MD5:
       4D E8 93 90 A8 73 51 8A A7 EC 4C 94 69 AB 3B 02
       data hash MD5: 32K
       C5 9B BE B7 AD B1 A9 45 30 9D A0 C7 6E B0 CD BF>)
(   2,<2016-08-01 12:56:27.574 +0100>,<nmr>,<CZC2439F6W>,<audit>,<TOPSPIN 3.2>,
      <user comment:
       ICON-NMR User ID: sdg
       data hash MD5: 32K
       C5 9B BE B7 AD B1 A9 45 30 9D A0 C7 6E B0 CD BF>)
(   3,<2016-08-01 12:56:28.040 +0100>,<nmr>,<CZC2439F6W>,<proc1d>,<TOPSPIN 3.2>,
      <Start of raw data processing
       ef LB = 0.55 FT_mod = 6 PKNL = 1 SI = 16K 
       data hash MD5: 16K
       B2 2D CA 65 66 8B 3C A7 D8 AB 8C 71 FA C2 72 FB>)
(   4,<2016-08-01 12:56:28.097 +0100>,<nmr>,<CZC2439F6W>,<proc1d>,<TOPSPIN 3.2>,
      <apk 
       data hash MD5: 16K
       91 17 FC 1A F3 02 B5 CE D2 AB D7 0E F9 4D 09 DC>)
(   5,<2016-08-01 12:56:28.102 +0100>,<nmr>,<CZC2439F6W>,<proc1d>,<TOPSPIN 3.2>,
      <abs ABSG = 5 
       data hash MD5: 16K
       92 6E 0A 73 12 F5 C8 B9 4F 9B B0 E4 F6 5E 42 5A>)
$$ ##END=
$$ 
$$ $$ hash MD5
$$ $$ B2 B9 1B 5C F5 7A 38 A1 6A EC F3 0B 14 3B E1 61
##$RELAX= 
##$RELAX= 
##$RELAX= 
##$RELAX= 
##$RELAX= 
##$RELAX= 
##$RELAX= 
##$RELAX= 
##$RELAX= 
##$RELAX= 
##$RELAX= 
##$RELAX= 
##$RELAX= 
$$ Bruker specific parameters
$$ --------------------------
##$DATPATH= <C:\hsr>
##$EXPNO= 10
##$NAME= <Aug01-2016>
##$PROCNO= 1
##$ACQT0= -2.28991588624586
##$AMP= (0..31)
100 100 100 100 100 100 100 100 100 100 100 100 100 100 100 100 100 100
100 100 100 100 100 100 100 100 100 100 100 100 100 100
##$AMPCOIL= (0..19)
0 0 0 0 0 0 0 0 0 0 0 0 0 0 0 0 0 0 0 0
##$ANAVPT= -1
##$AQSEQ= 0
##$AQ_mod= 3
##$AUNM= <au_zg>
##$AUTOPOS= <60 >
##$BF1= 400.41
##$BF2= 400.41
##$BF3= 400.41
##$BF4= 400.41
##$BF5= 400.41
##$BF6= 400.41
##$BF7= 400.41
##$BF8= 400.41
##$BYTORDA= 0
##$CAGPARS= (0..11)
0 0 0 0 0 0 0 0 0 0 0 0
##$CFDGTYP= 0
##$CFRGTYP= 9
##$CHEMSTR= <none>
$$ [...]
##$TUNHIN= 0
##$TUNHOUT= 0
##$TUNXOUT= 0
##$USERA1= <user>
##$USERA2= <user>
##$USERA3= <user>
##$USERA4= <user>
##$USERA5= <user>
##$V9= 5
##$VALIST= <valist>
##$VCLIST= <CCCCCCCCCCCCCCC>
##$VD= 0
##$VDLIST= <DDDDDDDDDDDDDDD>
##$VPLIST= <PPPPPPPPPPPPPPP>
##$VTLIST= <TTTTTTTTTTTTTTT>
##$WBST= 1024
##$WBSW= 4
##$XGAIN= (0..3)
0 0 0 0
##$XL= 0
##$YL= 0
##$YMAX_a= 3665949
##$YMIN_a= -4939959
##$ZGOPTNS= <>
##$ZL1= 120
##$ZL2= 120
##$ZL3= 120
##$ZL4= 120
##$ABSF1= 16.00577
##$ABSF2= -4.00577
##$ABSG= 5
##$ABSL= 3
##$ALPHA= 0
##$AQORDER= 0
##$ASSFAC= 0
##$ASSFACI= 0
##$ASSFACX= 0
##$ASSWID= 0
##$AUNMP= <proc_1dIC1>
##$AXLEFT= 0
##$AXNAME= <>
##$AXNUC= <1H>
##$AXRIGHT= 0
##$AXTYPE= 0
##$AXUNIT= <>
##$AZFE= 0.1
##$AZFW= 0.1
##$BCFW= 0
##$BC_mod= 0
##$BYTORDP= 0
##$COROFFS= 0
##$CY= 10
##$DATMOD= 1
##$DC= 0
##$DFILT= <>
##$DTYPP= 0
##$ERETIC= no
##$F1P= 11
##$F2P= -1
##$FCOR= 0.5
##$FTSIZE= 16384
##$FT_mod= 6
##$GAMMA= 0
##$GB= 0
##$INTBC= 1
##$INTSCL= 1
##$ISEN= 128
##$LB= 0.55
##$LEV0= 0
##$LPBIN= 0
##$MAXI= 10000
##$MC2= 0
##$MEAN= 0
##$ME_mod= 0
##$MI= 0.3
##$MddCEXP= no
##$MddCT_SP= no
##$MddF180= no
##$MddLAMBDA= 0
##$MddMEMORY= 0
##$MddMERGE= 0
##$MddNCOMP= 0
##$MddNITER= 0
##$MddNOISE= 0
##$MddPHASE= 0
##$MddSEED= 0
##$MddSRSIZE= 0
##$Mdd_CsALG= 0
##$Mdd_CsLAMBDA= 0
##$Mdd_CsNITER= 0
##$Mdd_CsNORM= 0
##$Mdd_CsZF= 0
##$Mdd_mod= 0
##$NCOEF= 0
##$NC_proc= -5
##$NLEV= 6
##$NOISF1= 0
##$NOISF2= 0
##$NSP= 0
##$NTH_PI= 0
##$NZP= 0
##$OFFSET= 16.00577
##$PC= 1
##$PHC0= -89.03825
##$PHC1= -20.75671
##$PH_mod= 1
##$PKNL= yes
##$PPARMOD= 0
##$PPDIAG= 0
##$PPIPTYP= 0
##$PPMPNUM= 100
##$PPRESOL= 1
##$PSCAL= 4
##$PSIGN= 0
##$PYNMP= <proc.py>
##$REVERSE= no
##$SF= 400.41
##$SI= 16384
##$SIGF1= 0
##$SIGF2= 0
##$SINO= 400
##$SIOLD= 16384
##$SPECTYP= <>
##$SREGLST= <1H.CDCl3>
##$SSB= 0
##$STSI= 16384
##$STSR= 0
##$SW_p= 8012.82051282051
##$SYMM= 0
##$S_DEV= 0
##$TDeff= 32768
##$TDoff= 0
##$TI= <>
##$TILT= no
##$TM1= 0
##$TM2= 0
##$TOPLEV= 0
##$USERP1= <user>
##$USERP2= <user>
##$USERP3= <user>
##$USERP4= <user>
##$USERP5= <user>
##$WDW= 1
##$XDIM= 16384
##$YMAX_p= 494476037
##$YMIN_p= -88349
##$CURPLOT= <printer>
##$CURPRIN= <$printer>
##$DFORMAT= <normdp>
##$LAYOUT= <+/Hi1.xwp>
##$LFORMAT= <normlp>
##$PFORMAT= <normpl>
$$ End of Bruker specific parameters
$$ ---------------------------------
##NTUPLES= NMR SPECTRUM
##VAR_NAME=  FREQUENCY,     SPECTRUM/REAL,   SPECTRUM/IMAG
##SYMBOL=    X,             R,               I
##VAR_TYPE=  INDEPENDENT,   DEPENDENT,       DEPENDENT
##VAR_FORM=  AFFN,          ASDF,            ASDF
##VAR_DIM=   16384,         16384,           16384
##UNITS=     HZ,            ARBITRARY UNITS, ARBITRARY UNITS
##FACTOR=    0.489063752003205, 1,           1
##FIRST=     8012.33144906851, -1692,        -316669
##LAST=      0,             -37219,          -395813
##MIN=       0,             -88349,          0
##MAX=       8012.33144906851, 494476037,    0
$$ Real data points
##PAGE= N=1
##DATA TABLE= (X++(R..R)), XYDATA
16383 -1692 -4032 -4852 -1745 -4518 -7270 -6742 -5167 -3433 5058 5610 5198 -619 -1043 2063 5488 72 -2189
16365 2238 2225 -1471 -6608 -6302 -2435 1317 4290 5874 -113 549 -266 -1380 -3166 642 2755 183 393
16348 393 -241 1746 428 2399 -1141 -3107 -875 -514 2001 6330 5984 5089 2300 3136 769 3116 -1125
16330 -7443 -7807 -3130 -796 -1614 1353 -2776 -3804 -2749 5192 2188 2013 1808 5441 1504 -2820 -774
16313 -128 -845 -708 -707 -257 1553 -2888 -2518 -814 -3968 769 -950 -3054 -976 658 2166 -492 40 -4 -4260
16294 -4260 -9139 -6849 -1229 3632 3211 -125 1703 -3019 -6241 -1826 -5973 -5019 -3279 -1604 1150
16278 -2536 -5932 -5003 -4480 -2654 -3350 2282 -1667 -1029 -7821 -4821 -2183 -1692 -916 -8004 -1371 -563
16261 2524 2527 1808 121 -1078 -3630 -3974 -500 2011 7705 5898 1466 2412 2632 5763 3948 7444 15566
16244 15566 6933 -3017 1052 525 -5732 -10635 -7446 -184 684 2001 1261 750 -2741 -52 777 -2242
16227 -7782 -4196 -1639 -3263 -1221 -1115 -2705 240 2529 -2191 -765 936 189 -5681 -4585 -2787 -1141
16210 143 2603 3971 -4594 -944 3136 -5054 -6161 -2657 -7443 -13033 -10830 -5847 -2633 5769 1946
16194 887 -3806 -7751 -2234 -8704 -10994 -10581 -8855 -3249 -2755 2430 4248 -1202 -5220 -7086 -7494 -2154
16177 3595 4381 1479 -6194 -11906 -14603 -9002 -2004 -1574 -3011 -1284 -4802 -9912 -5792 1163 -4528
16161 -5210 -6953 -1535 -3521 -6099 -3202 -7235 1694 7968 9549 4379 -2080 946 -1549 -5783 -4676
16146 -4676 2326 2962 1210 697 3676 5000 5072 5595 2568 5949 -152 -3535 3620 2852 765 -193 -2873
16129 -2873 -1956 -1770 1903 4906 -929 -7800 -3469 -467 -58 -3752 -4210 3158 4346 1418 718 3158 4338
16112 4338 -3352 -1217 -4541 1360 1276 2123 1310 3278 4814 4354 -1596 -45 -1411 -1905 -3994 -1131 -1693
16095 -1693 1717 2683 -3977 -6064 -8937 -3726 -5741 -5715 -2145 -5317 4020 -2944 170 -2044 -312 -1231
16079 -1231 5766 2320 -682 -279 -3432 -9988 -10163 -2782 283 -2048 -7311 -12797 -8811 -2670 -9163 -9887
16063 -9887 -4458 -8500 -6559 -2911 -115 -9323 -4461 -4006 -5818 2562 6918 6281 7716 4706 3309
16048 3309 3123 2194 -4546 -10013 -6607 -12771 -10999 -4236 -1479 -3394 -3989 1052 11843 6389 -1221
16032 4316 -198 -8362 -3300 -6022 -7681 -3489 -6695 -9637 -17037 -17137 -11782 -3547 1793 -627 2550
16016 -5454 -9531 -16523 -6830 -2122 2421 -4160 -8088 -8103 -3120 -5116 -4742 -3637 1320 -3568 2316
16000 5589 -575 -1944 -1958 -7395 -5283 -3372 -1983 -5351 -3104 1223 1351 6214 4167 6269 -1822 -5600
15984 -5600 2145 6476 537 -952 -146 -2962 -6786 -12524 -6092 -7160 -3096 -803 -3254 -3793 -833 -346
15967 -2182 -1132 -1535 2198 940 -96 3872 5743 2651 -449 1512 -1314 -2070 7008 6029 -239 2951 3122
15950 3122 -4329 -2172 -2596 -602 -680 3027 2754 4068 -3531 -1755 -675 -6346 1627 7814 7934 7654 645
15932 -2051 -980 -1013 -1212 2323 6652 4009 1687 -3613 -1592 -2865 -3890 -2587 -2479 -9009 -7778 -4104
15916 -4104 650 -7005 -4368 -647 -1427 1705 -5818 -1829 -2198 -4766 -1419 1076 4904 4381 970 -5665
15899 -5312 -507 -4038 6812 7448 5706 -353 -223 -2510 -2262 986 117 -3622 2864 181 5040 582 1822
15882 1822 -3436 -567 -2818 3151 -3456 -6537 -1159 8099 3683 -4926 -3837 -2346 3330 -1570 -4932
15867 -4932 -2623 -1638 1448 -503 3646 1048 -7089 -8130 -3031 3549 1388 -1956 -3516 197 -3969
15851 1337 443 -1789 -5172 -4336 4103 6490 -120 4111 41 2946 1160 5043 12585 7499 4980 3712
15835 3712 4801 -1847 -4651 2356 1523 6073 7552 8582 5212 2506 2796 968 -481 -2491 -5189 -3716
15819 -3716 -7352 -3872 8585 1825 -1518 -3503 -5302 -4298 -4264 -2764 320 2541 1723 240 -380 3853
15802 9431 6528 185 525 8741 8608 675 -3243 986 6545 771 -1014 539 5921 5728 841 -1158 -6247
15785 -6247 -6738 -2597 -1905 -528 -3436 -4202 -4577 -6737 -4540 -6277 -947 1791 2947 -1363 -2972 -2627
15769 -2627 6155 8110 4387 592 -2767 -3108 2451 -2 -3282 -1304 -1737 -10023 -1359 -4601 -3429 -5229
15753 -5229 -1317 3320 3284 3946 372 -2279 -2935 -2071 -5366 -2828 387 -1738 -1172 1576 -7291 -6255 -10063
15736 -10063 -4155 -3764 2589 7636 -168 1149 158 -393 -5598 -2310 -1772 -658 -2991 -8346 49 -6174
15719 -9279 -10395 -8788 -8428 -3566 -3085 5039 -2328 -3213 -2941 -4902 4890 6189 2423 -5459 -8983 -8453
15703 -8453 -5012 -6480 -9359 -5461 -1212 1798 -690 -839 734 -556 -4396 1439 -843 -5456 -396 184
15686 -2367 4874 4016 -1355 2086 3262 -2306 -3421 -6197 -5704 -2618 350 5573 4878 962 1236 932
15670 932 2058 5008 2632 5102 4508 -390 -539 -4146 -1148 3262 1367 -4361 -9978 -5669 -2562 -1684
15654 -1684 -434 -4926 -1804 -1878 -4701 -3074 2680 6408 3316 7543 6911 7547 3689 -1781 1586 -2880
15637 -7029 -8842 -8920 -8965 -9785 -8542 -5602 2721 706 1793 -586 -2661 -10101 -4422 473 -1226 748 -725
15619 -1633 6304 -354 -1610 -6780 -1991 -6608 -1870 1652 -6774 -7704 -1667 627 -4557 -2729 -1091
15603 -5355 -8061 -5548 -2497 -1219 -3205 -939 -10322 -6482 -2920 409 -4796 -1563 -4262 1486 5840
15588 5840 3958 4953 5340 -6660 -2518 -2909 -2609 -3886 1414 1751 -3263 -8097 -3172 -1787 2797 -750
15571 -4801 -3369 -5195 10 -205 1714 4356 755 1082 2084 -2210 3596 7416 2826 -757 -3280 5175
15554 9394 10492 10664 17142 12878 4465 8533 11211 12399 11872 9790 9148 2420 -1272 -4618 -6413
15539 -6413 -841 979 3849 8916 -274 -4563 -4497 -6016 227 -4027 -1879 -3492 -4746 -5933 -2444 5280
15522 5124 3515 3787 3556 3958 -344 2954 -1815 -4117 -1917 -2176 -15 -1930 -5801 -413 5411 2820 -709
15504 3227 5704 2765 846 -1833 1400 5337 -99 -2835 -5473 -654 -105 -4032 -1920 -2723 -598 -5626
15488 -5626 -2268 -8540 -12666 -9873 -2499 -8653 -201 1051 4542 2699 2744 4531 2700 1994 1218 -3469
15471 -2333 -4812 -1265 -1741 -8951 -5244 -7282 -11305 -13056 -3608 -9577 -3787 -6106 -3734 -819 -2569
15456 -2569 -2364 -7004 -4962 -9288 -13776 -2804 3432 2270 5402 -1518 22 -2236 -8309 -5898 -6593 -7883
15440 -7883 -6510 -8422 182 -405 -217 -535 -2304 -338 828 -1589 -8813 4785 -41 -5209 -388 -360 867 -1596
15421 -5587 -6260 6907 1646 -28 -1460 -4963 -6445 -10117 -14668 -7339 -10716 -6170 -4645 -12115 -13999
15406 -13999 -11223 -10146 -2297 2284 2526 5847 1958 -4924 -5151 -5131 -5251 1708 3199 2269 -55 -4793
15390 -4793 -10779 -9722 -2956 3131 1081 -2989 -2666 70 -5608 1532 2165 4574 -211 6083 7521 -6598
15373 -3522 -547 -2758 1034 -3744 -2248 -3004 2942 6610 1641 1418 545 6875 4545 610 -3146 -8069
15357 -8069 -3920 -7548 -5517 -1470 230 3485 4152 6892 5269 4449 -2137 -5575 -6517 -6914 -8696 366
15340 -3474 -2824 600 -2835 -1878 1243 -1923 -1736 -4356 -6503 -3018 -475 -8518 -5318 -1955 -232 -1572
15324 -1572 -3915 -5745 -6549 -613 -3652 -1804 2151 1133 2140 -2062 -5233 -3891 1837 1890 4476 -746
15307 -2197 -7484 -10860 -12434 -2894 702 -1500 -2830 -7534 -4819 -7938 -6017 -1420 7623 10406 11791
15292 11791 9925 288 -3097 0 -237 -7577 1184 -417 -4683 -2496 -4486 -2201 -4490 -3082 -2915 -10199
15276 -10199 -1697 1760 -1069 -4267 -2654 -7571 -1122 3542 -1755 1658 -50 -4385 -864 -3825 -3831 3131
15259 716 -4218 -964 3668 809 1733 -7604 -1712 -123 5358 1771 -2338 -767 50 -1575 956 5709 5652
15242 5652 2242 1993 3421 2472 3603 3689 -590 -564 -3303 -3472 -3639 -4107 -6251 -979 -5387 -4196 -5677
15225 -5677 -6011 -5796 -3862 -7213 -6398 2763 -6051 -8100 -5254 -6654 -4655 -2318 -2834 -1454 -1789 -5150
15209 -5150 -4049 -5772 -9385 -3845 -7565 -835 1063 -9452 -5776 -206 580 -10875 -5717 2913 -2073
15193 -4053 -4475 1656 -1338 -5075 -5887 -4295 -8966 -9437 -1220 -1460 -6418 -7165 4093 10749 3545 258
15176 -222 783 3449 -492 -7701 -5615 -1494 3683 641 1681 -4330 -1034 -1386 2946 2585 3748 -621
15159 -8662 -5427 -5426 -7488 -5821 -3314 -3916 -9877 2791 -2877 -9013 -7826 -8330 -4558 -4948 709 5417
15143 5417 5861 1377 -2466 -1069 5579 2767 243 -4456 1123 -3617 -7346 -10373 -13152 -12306 -5040
15127 -5022 -4134 -3730 6951 6321 -399 650 -1104 -6343 244 5406 4840 1838 -4110 290 3306 -1592 -1111
15110 -1111 6646 0 684 -1096 4197 473 -3517 -11196 -10483 48 4480 325 4000 -644 -3640 4689 -2441
15092 -1646 863 -6203 -4760 -9794 -10810 -6330 -6773 -3531 2398 2383 3859 4136 -1944 -2624 -2314 2618
15075 1727 -686 1988 5653 1041 -1003 -1826 1447 557 -3396 -817 -545 -4111 11 -7970 -1003 -4654
15059 -4654 -4913 -8078 -7753 1756 6340 7310 -1492 -3968 374 6454 5660 -3161 -7102 -13949 -12683 -11014
15043 -11014 -2506 2009 -622 -1961 2765 3852 977 -5484 -5695 -3287 1758 4134 1377 1386 -566 2136
15026 -2604 -1700 -3470 -9793 -3819 -1933 6619 1580 4374 4569 -1599 -3670 -4911 -6339 -3119 911
15010 487 752 -1114 -1563 68 2331 2876 -716 -4567 -1011 -2494 -1157 906 5721 3211 1526 317 -2801
14992 -29 642 -3642 -1554 5455 4197 7718 9086 3024 4548 7453 6372 105 4090 887 3941 5696
14976 5696 -1692 -2876 3235 1763 -1095 2959 6777 6639 -387 1380 1989 4251 -4899 678 776 249
14959 2632 4700 8460 10458 9669 7876 8330 -3748 -3813 2861 5794 2543 870 4543 1161 2977 545
14942 3716 -1687 6074 7459 1304 1046 4145 -382 4407 7487 5503 6445 193 980 7780 3673 2284
14926 2284 8584 342 -2784 -2427 6094 2037 3317 911 -7798 -6743 -4123 -1459 -3803 2290 5147
14911 5147 3655 3354 -1708 -5160 809 -3309 -8482 2064 -1050 -4930 -4341 2504 2988 -2648 -2952 -4233
14895 -4233 -3780 -3270 2976 4018 1405 -2137 -2179 -4151 694 8129 1248 -3442 -3431 1455 -5398 -11349
14879 -11349 -10169 -4411 5510 -821 -3756 -6388 -2806 2833 4022 4721 -287 -3490 -5934 -9229 -7114
14864 -7114 -3277 -1721 3633 3635 150 439 -579 -6351 -2454 -707 4514 2244 3434 554 -3117 1430 2124
14847 2124 2670 11700 5792 -6190 -9178 -12112 -5241 -3428 -1440 510 -3360 -3135 -1365 -2545 -3611
14832 -3611 -5598 -8389 -3870 1153 -91 -1560 -266 -8674 -2820 -6744 2555 7403 9267 4960 339 -229
14815 2866 -145 2073 1258 -2197 -804 5734 5054 2114 -3773 -9087 -12408 -2123 -2733 -6394 -2058 -364
14798 -3855 -4735 -2968 -513 5872 8180 4270 1704 1108 -6634 -4774 -3963 -4751 1422 3546 2026 3968
14782 3968 9940 1301 -2017 3587 2686 -9450 -7063 -11720 -12466 -9795 -2561 6637 4419 -818 -3121
14767 -3121 -653 -3540 -1082 -4638 -6588 733 3205 1366 1758 4163 5043 1797 -840 -1819 -3516 744
14750 545 -3577 2284 -1270 -2219 -7127 -5250 647 -3048 -5917 -2552 -4552 -3263 -627 -369 -1298 -3740
14734 -3740 -2091 197 -2655 274 877 -3338 1099 1950 713 1938 1674 -2510 -2376 2647 6878 4243
14718 4243 926 40 578 868 -3842 -6305 -5245 -6267 -11951 -5916 -3158 3181 3289 -3322 757 1124 -4
14700 -1856 -979 4701 4541 4471 2776 10524 609 -14197 -9119 -6700 -4234 2005 5880 3878 -3591 -4190
14684 -4190 -1343 991 -277 1937 -1040 2874 -436 -1582 1225 8638 1036 1785 1862 2139 5426 3165
14668 3165 -3193 3636 322 -3831 -73 1945 1041 700 5306 -1282 -5385 -3085 -2243 -1371 2277 -2627
14651 -2043 -5497 -4645 -458 1338 5538 6934 8346 6064 1856 1071 254 1664 -1929 -5941 -7314 -7347
14635 -7347 -6420 2120 5271 -401 3579 3814 2105 -951 2525 2419 -1357 -4045 -2439 -701 4758 3893
14619 3893 -3518 -10437 -3684 4260 1140 -3852 -4181 1337 6045 3585 1946 236 -964 3783 4521 7991
14603 7991 2079 4308 1235 5694 4174 -1624 -5277 -1225 -5250 -7577 232 1457 -651 -10008 -332
14587 -2194 -6489 -2328 2638 2567 3454 -2534 1851 7519 6918 3504 532 1820 6065 4539 1995 -1002
14570 -1616 -418 3022 4388 1787 -3521 3313 -73 -4206 -2835 -2044 -8074 -7761 -6356 -4282 20 -2930
14553 1732 5342 3813 -5067 -5921 505 -834 1758 -1087 5444 4963 4733 -994 967 -4621 -5394 3848 1074
14535 5871 1222 -2366 -2201 439 3921 8305 6437 6958 55 -2821 -4268 -3263 -1599 -1715 -9145 -4172
14518 3754 4713 3744 -2447 -10687 -4066 1482 -3651 -1967 -3215 -6878 -9583 -4648 -1849 -3033 -111
14502 -2772 1217 -1325 -179 525 -4006 1981 874 1388 -9179 -6712 -3142 278 6850 8282 2666 5581
14486 5581 5053 3388 4190 -4253 -8009 -11517 -11800 -8260 -1020 1439 -1423 5577 6277 5618 1834 -757
14469 -1541 2266 2108 5062 2404 7228 3385 -1715 -712 -6959 -2882 -2147 2671 2927 624 3170 567
14452 -3585 -3902 -2349 -3386 239 2697 7816 5248 -2080 -2472 4308 12195 7269 3513 133 5671 7957
14436 7957 8108 5312 -2462 -8853 -14501 -14036 -3877 -6615 -3101 11767 6671 4484 687 -3846 -4194
14421 -4194 -7227 -7415 -2999 -5107 -8210 -2471 -5458 -228 868 -1614 -7543 -6415 -522 5893 1476 -1141
14404 -2377 575 1809 102 3036 4038 3027 -4243 939 -5180 1457 8108 7158 -2156 -9145 -2729 1203
14387 -2392 3037 -3847 -3579 -1611 -1045 64 -36 -2819 891 -3519 -5838 -8364 -7503 -278 2980 6085 3365
14370 3365 2166 92 -1898 -1152 -5677 3862 1608 1141 3105 5866 4093 -2218 3095 4567 5523 4632
14354 4632 -544 602 880 -735 6341 2855 589 -5206 -10485 -6816 1368 2261 2940 11055 12630 3840
14337 2610 3715 -1169 885 3201 2928 2608 13794 5889 1714 -141 189 -1186 -3386 -674 8676 5327
14321 5327 -4813 -75 6130 3560 1043 1107 -374 -3180 1827 216 -2424 -3134 -106 4754 5109 3152 6889
14304 6889 -1651 4934 2078 -1884 -9619 -5094 -5282 -3325 4523 2820 1780 -109 4225 2624 -6811
14288 341 411 -1198 -2958 -1166 734 2767 530 -7724 -7830 -4283 1353 2163 4395 4475 6841 10233 470
14270 8348 -816 828 2303 -728 3040 3421 10530 6306 11501 13113 10914 4633 7411 6006 8185 13552
14254 13552 3853 8266 1652 3183 -6444 -2393 560 -1494 -588 1254 -1258 -2795 -1950 188 -605 -9476
14238 -9476 -9015 98 -5978 -1768 -1940 -1662 -2920 -638 4272 4462 -6615 -7661 -12122 -11429 -5541 -2341 -855
14220 3063 -528 -9895 -1950 1639 5093 2001 -245 3198 7405 3499 4263 4623 5262 -6942 -2047 -2668
14204 -2668 -7846 -11263 -8877 201 814 -2146 4120 12829 9988 9794 11388 6848 9890 6473 2736
14188 -2444 -2461 1526 5526 3739 -2707 4021 5874 1163 -5353 -5897 -7343 -2406 -5146 -564 -3159 -3347
14172 -3347 -3800 -3759 -3830 1465 1102 -143 1049 -390 -7983 -4475 3122 67 743 -2490 -6720 -4149 -4994 -5347
14154 -5347 -3521 -1978 -4337 -2751 1920 3235 -1828 -3472 -8165 -2688 -1583 -5107 -999 -1671 -4706
14139 -4706 -6933 -7559 -9708 -1940 -100 -571 1318 3110 -4532 -673 5158 554 -4750 -779 -3815 -4168
14123 -4168 6560 10128 8864 5960 2976 1488 1684 -2768 -16 497 1121 -3658 -6671 -7113 -4143 3709
14106 -1919 -5362 5037 8765 -2371 -7092 1847 7 -1414 -3686 -2342 2401 7848 10730 6367 3446
14091 3446 1208 -1184 2048 -1474 -1156 -6358 5323 2129 -1031 -1412 1900 105 4502 2511 1749 7418
14075 7418 1153 6678 -2146 -1167 68 -3855 284 1164 6160 -223 -1322 -572 -3062 -2893 -3021 657 1412
14058 1412 -5714 -5096 -3935 1786 3834 1029 1957 5977 791 7629 215 -2672 -3651 -7127 1519 6228
14042 6228 -1575 -1409 -4835 -12377 -2084 950 -1855 2540 1505 1105 -5305 -5188 -5894 -5344 2327 4046
14026 4046 1342 -6795 -2160 -446 3256 5859 8850 -2257 -6466 -7590 742 -6677 -5290 446 623 109
14009 -3383 -8431 -5168 -5032 -2708 4053 -5260 -5060 251 -1082 6525 5994 6922 5255 6816 -766 -3817
13993 -3817 876 -1792 1537 4914 3450 4126 404 -3829 -7809 -2501 -4552 4332 5524 2090 210 1366
13977 1366 -3309 -10725 -517 -2598 -766 -2136 533 6102 954 517 6166 -819 -3485 -1691 -372 -3019
13961 -3019 -427 6947 3108 3999 47 4863 6960 -2236 4173 5502 2527 4259 2760 3625 2830 3152
13945 3152 2468 3944 -1949 -1751 -7370 -6788 -9021 -6109 1321 2616 4177 8399 7291 7319 5671 3865
13929 3865 7630 5304 -185 -2177 -1164 1453 8708 -171 2081 11633 8991 5965 4862 4403 1052
13913 1682 6569 6055 624 -3353 -1402 2452 6786 2752 4872 4042 1824 -84 2240 9079 6337 2669
13896 2728 2951 -4539 -4543 -496 -314 1994 1580 -1946 -98 467 -4489 -2967 -7 2899 6478 5399 7618 4597
13878 4597 2646 -1135 1362 2814 3625 8149 5194 6951 3172 4070 9493 792 2621 633 -4011 -3094
13862 -3094 -4049 -4457 -6574 -4564 5225 8021 3612 -3618 -5401 6349 9169 5754 13091 9902 7123
13847 7123 7849 7146 -626 1776 -2732 -1872 -2502 -3056 7204 9545 9661 8450 9601 5082 364 -853 6775
13829 7052 1079 -5648 -3684 -3874 -174 5017 -1010 -7118 -11667 -9505 -1421 6375 2641 3564 4843
13814 4843 -2473 2577 -148 1987 1997 6817 5512 4249 5428 4871 7955 1137 -430 -261 -1688 -8828
13798 -8828 -5822 -5176 -6188 658 2591 -2164 128 5802 813 3383 -2204 4318 736 -3425 430 306
13782 306 6205 8468 -2614 1113 2989 -2743 4925 4476 2961 3682 2377 6054 3039 1743 229 -3440
13765 -8903 775 -727 -2788 -4272 4565 1177 -5018 -4975 -317 2558 4002 6571 1126 -1913 -4821 -2173
13748 -72 6330 341 1210 -1908 -2439 1390 3611 3941 7282 10071 13434 7826 6286 8038 11237 6072
13732 6072 7901 13117 6909 5792 4406 3211 -213 403 1445 7022 7537 11909 8521 8635 1980 -4428
13715 -7559 -1661 -5269 -513 -192 -1064 2418 320 2122 4147 2088 1729 1801 721 -3738 -4958 132 -395
13697 -4290 -2315 2439 3139 -3435 -7945 -6117 -1170 6118 828 -1009 -750 -3146 750 -2339 2726 -549
13680 -954 -5074 -3094 -4609 3463 -82 -2403 2071 739 3227 -1488 -1668 3336 -1194 3216 433 1510
13664 1510 -241 -3682 -4281 -1252 -6017 -4687 -1640 -247 10130 12002 3096 -7209 -3298 293 -1485
13648 7246 10500 4578 3585 407 4155 1863 5810 1851 5102 -650 3690 3123 3536 7594 9109 6318
13632 6318 5032 5057 5516 5039 -3757 -6091 -1487 5134 778 5529 8236 -62 -889 1120 -1304 3734 5781
13615 5781 3062 6255 14475 9475 8453 3995 2641 2754 4135 3791 2501 1947 2620 12169 2346 367
13598 -2103 -762 -60 2025 4423 5520 -1609 -1180 -4464 2427 11557 6968 7502 11679 4748 3304 1165
13581 6007 2913 -1420 342 822 345 3291 4301 1804 740 426 4397 8047 9888 7695 7936 7301
13565 7301 14373 8859 8932 15104 5422 1708 -3680 -4835 782 3582 2609 4719 1033 1127 6198 2626
13548 -6827 -8923 -6242 -3156 -481 3491 -158 2772 3906 708 3164 2408 2449 3998 1019 3342 7822
13532 7822 7786 3367 -860 2215 1866 950 385 929 872 2980 -3172 -1418 -183 -1941 -5901 -2759 -1057
13514 -527 1848 4732 -1539 -130 780 4344 13330 10905 11113 6052 9853 5046 7775 8555 921 1392
13498 1392 -68 1645 4648 4575 1998 -2633 2254 9299 4542 2303 2991 3051 -410 -3418 -502 823 -1751
13480 -8044 1009 2704 6670 6540 8893 6042 1019 -535 -644 4474 -509 -366 2285 5957 9027 11105
13464 11105 2613 507 -2349 1916 5977 10640 14216 14173 8469 10868 14992 13868 14176 20336 19336
13449 19336 13183 17756 28146 40899 46714 53664 64322 71230 65789 56227 45129 39606 31729
13436 31729 23933 22885 17337 14537 10292 12814 13745 16285 20872 10063 11002 7800 11265 11690 10950
13421 10950 6860 4746 1295 11925 12929 15222 5273 10910 7988 11236 9895 7944 7488 4159
13407 4159 8071 7518 -448 2049 5876 7793 11189 11547 7964 10052 8603 6056 7766 10903 10544 4245
13390 4923 15635 16425 17214 14684 9343 12449 10414 13153 17242 10724 13831 17257 17891 11666 15132
13375 15132 16711 17733 22271 35953 33822 38595 39123 34282 34753 31940 30662 31387 44147 47694 48905
13360 48905 59622 61046 75066 87533 97883 107661 114722 118169 130110 136180 143757 152962 157701
13347 157701 160375 149243 146038 135527 122820 110015 104252 99153 88962 81351 73425 70846 62979
13334 62979 64176 62191 62020 52224 42171 41271 32017 27226 29376 28950 24822 22050 20779 22364 19032
13319 19032 18448 24029 23911 23375 25704 31095 42320 44914 41860 39392 38924 35003 29168 16177 17546
13304 17546 21197 20671 12105 13660 18178 18297 12033 11360 16539 14288 20180 28123 37902 49668 55254
13289 55254 54676 47292 42440 24570 22640 24527 20236 20124 20686 9280 10613 13069 8103 12375 9730
13274 9730 8562 9030 8425 3647 3735 8311 12080 11659 10399 14252 9961 12239 16794 17499 18042 19164
13258 19164 14777 10218 6640 5728 4948 10307 9852 14170 11858 7840 5502 2268 5751 11420 8972
13243 8972 7792 6589 13166 9961 6850 5106 2483 9078 5251 6315 4020 4321 5911 6743 7167
13228 7167 6916 603 -1096 4818 3212 8882 14576 5970 6567 9917 8581 7234 9425 13357 10254
13213 10254 4578 13860 14505 12041 10351 9976 4474 8778 8011 8008 9325 6157 6264 8395 12151 15742
13197 15742 12209 10716 8930 13141 9069 6432 4402 2512 2944 1948 2003 2980 4081 3386 5149 8507
13181 8507 12233 14062 11870 13554 12765 6386 11704 13127 10698 9594 9360 13731 14247 9571 10352 11850
13165 11850 11524 9441 11515 13536 12256 9389 6336 10577 13001 8892 2085 5329 7578 9969 17166
13150 17166 16499 16243 7219 9225 16734 17629 9450 11436 14392 12266 19300 18448 15754 8947 10918
13135 10918 15353 12810 6933 11339 10946 9318 12291 8796 14333 13478 16436 17130 12237 18626 18614 17670
13119 17670 17112 15371 16036 18691 21356 17112 13522 16531 18110 14446 11504 8933 12483 6139 7124
13104 7124 8902 16975 13405 6658 8148 11709 10726 8509 4082 13658 12936 14244 16315 7695 4757
13089 4757 15770 18240 12350 9590 6440 8610 7610 -1426 428 4933 8170 11219 4740 -2622 -5928
13074 -5928 -2618 -856 4435 3828 7298 8552 2507 5851 7081 9801 8665 3600 2520 3250 2682 5165
13058 5165 9079 -1449 2983 6870 8120 -1510 -4632 -4881 -224 3184 4139 6750 6500 7390 6116 -3428
13041 -93 -649 369 -2967 1673 1292 2648 5647 11945 12538 4618 3167 266 -1398 4451 8408 4669
13025 4669 2324 6148 5117 6794 5007 4893 9112 11808 16877 32160 39535 46553 42896 33569 24147
13010 24147 21649 16667 24947 16224 12105 5272 14583 18109 13650 11341 12381 8989 6559 5850 10627
12995 10627 2919 6500 2087 1835 6111 9300 9057 9499 5981 9830 11196 2949 10661 6750 -1754
12979 -3602 -5168 -3310 3266 7149 8003 6714 5037 10046 11238 6572 -1088 -4884 -1311 4191 6596
12964 6596 7672 3043 7117 5647 3148 7879 3683 9526 9112 12138 10185 2437 2721 -2106 1227
12948 3253 5957 7710 6485 7472 11261 11873 14187 11909 14363 21122 19240 14488 14792 17379 24149
12933 24149 26971 19783 11491 11826 8896 14516 9001 5180 1753 9092 6725 4871 15483 11282
12919 11282 8305 7471 13525 5107 4936 2564 6047 5563 5331 6549 1614 -389 3453 8650 6141 627
12902 -1361 5350 5886 -505 -2605 -335 -77 -4751 6277 -2466 -254 7229 3358 1688 1597 -139 4462 5023
12885 5023 -3226 -4433 7290 2015 1835 -3496 -6835 -5563 859 4083 849 -5501 -811 557 617 3450
12869 3450 8153 698 5159 5489 7982 8754 4292 7354 8177 9166 6003 11331 10446 3410 1245 1889
12853 1889 -2797 1374 10637 10400 1471 -955 -1295 68 4143 6364 -581 5397 688 -3697 -507 -1572 -5012
12836 -5012 1624 5795 5513 3937 6058 8118 8529 3529 3283 4233 -4258 -1596 92 -4147 -3165 -6690
12820 -6690 -8855 -4193 6874 2826 241 5306 9634 4082 7488 353 4783 7294 4940 6455 10957
12805 10957 11175 6547 1604 3452 -4433 -1120 -711 2421 3285 240 1925 3351 -1755 -12 308 -2658
12788 -6646 1642 -1031 -3647 3482 400 -1039 -5554 410 151 -2213 -7490 -2472 -1126 -1290 1544 1951
12772 1951 -1279 3850 5698 133 -851 -1340 3473 4552 -4698 -1657 -3352 4423 1026 -411 4155 5517
12756 5517 5989 4811 -2206 3519 3090 -1301 413 1455 -5785 -6477 2645 4101 449 -7680 -6019 -3860
12740 -3860 -1405 5613 9144 7413 2839 2282 6381 4557 1287 -1645 -6236 -9086 -5159 -8348 -3585
12724 1321 -9421 -5281 -1996 -478 411 379 962 1191 4795 6264 -2580 -3976 -5066 -4323 -7085 -4887
12708 -4887 -2142 2744 592 -3575 -3554 -738 -1713 1900 -1997 -4602 1932 -209 409 1000 -3602 2503 4773
12691 4773 5272 371 -3928 1200 2850 -2327 -3357 189 -2429 -2917 1184 1273 -1039 -1679 -479 -3618 -1146
12673 -7265 -2188 -367 2408 3064 8230 2556 -1432 1820 4442 -1370 2514 6434 9721 10202 9335 6134
12657 6134 4795 2059 6842 6453 3271 -2858 -6228 189 3665 -1463 5824 7936 62 -5040 2226 1316
12641 1316 2650 6706 5947 168 668 4174 6465 3568 -2382 -387 -3970 342 -3671 -5099 -735 -4785
12625 -4785 -5020 -1205 -205 1769 5127 3950 3137 -712 2891 2486 6019 4108 3578 1305 1436 1728 5304
12608 5304 2977 -973 2597 2606 -3464 -1268 -345 -116 -4314 -4080 4019 2847 -5138 -154 4756 2636 -431
12590 335 4274 8167 2711 5111 8994 6963 1779 3238 18493 17613 16405 26401 36468 45305 51888
12575 51888 57874 59082 49530 43825 42396 35694 25669 17738 8770 9579 7228 2473 306 827 274
12559 -2633 -7233 -5794 -8261 -3804 -573 -4053 -4129 -568 -1142 -6402 -2985 -1473 2046 1592 1852 -2236
12542 1710 2723 -3846 -1526 -2406 -5741 -5993 -5002 -3618 4933 6481 1329 -5282 -2083 3485 4034 2228
12526 2228 -2436 -1489 -1708 -1631 -4046 -8878 -8731 -1942 -10453 -8743 -5380 -1460 -1776 -4332 -603 -4531
12510 -4531 -696 -3366 -3646 -6462 647 -956 4163 2669 1994 204 -1642 -4903 -8270 -980 -875 3565 -4777
12492 -12989 -12708 -1718 4843 -932 -6562 185 -7746 -5780 -2930 -6828 -3810 -9782 -8580 -6525 -3957
12477 -3957 645 -4708 -648 710 374 -5014 7188 2503 -678 565 1382 4116 6659 -673 -2852 -4306 -5229
12460 -5229 -5268 -888 -3992 -7620 1168 -1232 2611 -2504 -858 -9258 -13647 -4224 558 -670 2950 8906
12444 8906 1560 5588 556 5795 3722 -1207 -3363 1270 -521 -2162 3615 3836 -1457 -1029 -1231 -146
12427 2479 -102 2016 -2132 -5900 -7534 -1525 -152 3888 -254 61 -1711 -825 2329 4874 -4241 -4794
12411 -4794 -989 -4539 4087 4778 658 -6122 5287 9378 7109 -3716 -6260 -2528 -627 -7726 -8690 -4072
12394 -2422 -6572 174 -1931 -2229 7710 412 -6500 -6081 -8525 1362 3617 -1069 4395 3214 -9406 -2553
12377 2381 2852 2345 1987 10792 11400 12518 16085 6386 3515 3105 -760 -6988 -5117 2996 -1016 -6754
12361 -6754 -103 3062 3453 359 4238 225 -1549 -457 -806 -52 -3721 6469 5597 3070 3079 7523 -1908 -3866
12343 -3866 -1787 5983 1561 -1017 -3200 7184 7082 -643 -5231 -1939 3784 3809 1411 7130 2126 3506
12327 3506 3596 8170 1296 -1241 -2294 -3601 -589 -5303 -1719 166 -2868 -6048 -6445 -4401 -4875 1277
12310 -2688 -1592 -3789 29 -2054 -8379 -3926 -11265 -5465 -14699 -7019 -4658 -6430 -2157 -4146 -1151
12294 3489 -1711 -3705 -317 2073 -4826 -5594 -7099 -5331 -9663 -9391 -4472 2254 -4143 597 2842 1073
12277 6375 2788 -1133 -2799 -2466 -1100 5535 -1820 -9612 -6022 -1544 -5162 -4771 -4729 -6086 1049 -1226
12260 -386 5293 2702 -4599 -3573 -1137 -3054 -2927 -6413 -6069 -8753 -2717 747 -2405 -4190 -1950 -5780
12244 -5780 -1097 -522 -5170 -3870 845 -2550 2796 1019 4679 4710 1740 819 1214 -4555 -6756 -1988
12227 -3070 -5584 400 -3282 4729 1390 4777 1877 285 -1374 4599 -241 -5233 -2578 2306 5223
12212 5223 3271 812 1373 1235 -10308 -10184 -7335 -10835 -10558 -7800 -9913 1991 -4937 -4869 -5855 -4970 -5581
12195 -5581 -6119 -478 -3477 -5502 -9214 -7678 -7596 -2876 -2695 876 3420 -992 1347 -2415 -7347 -4534
12179 -4534 3545 878 679 2339 -3029 950 896 -5605 -3264 4036 3171 -5752 -7888 1600 1629 -1214 -3779
12162 -3779 390 621 -3896 -1162 -675 -9166 -2037 5888 1834 -1467 -851 711 1699 -5733 -7782 -7777 -1351
12144 -1835 -4635 -7203 -4284 -1592 -3152 -10967 -6946 -6989 -4636 -5266 -12857 -11070 -9390 -13342 -19192
12129 -19192 -7971 -6212 -13494 -8590 -3021 -1793 -2320 -3595 -4456 -5829 -1775 485 4562 4386 6936
12114 6936 -6 606 -473 -8960 -8069 -8294 -11357 -10609 -12564 -8781 -860 -6569 -8082 -6476 -5827 -8476 -6634
12097 -6634 236 9057 11867 9721 6539 8008 11119 16174 18099 20447 16534 19349 9955 1100 -5175
12081 118 7076 384 -1709 -2581 753 3066 2907 5083 7852 5954 4574 1688 1866 -2650 3659 -4650
12064 -3087 751 -7001 -6744 -5140 -3538 -3855 -6121 -6117 -7947 -4300 -2082 -5096 -7120 -8670 -9234 -861 -2941
12047 -2941 -3549 734 -2254 2371 3048 -991 1031 7119 9697 9442 9125 7767 9068 14738 16687 21343
12031 21343 18283 19261 27223 34116 44525 56967 82947 110828 156776 228100 331892 433688
12019 433688 497772 500416 443796 350219 265708 194987 139210 99393 71092 52687 34437 32007
12007 32007 27293 20698 17672 10724 7665 10051 7281 10617 11495 4215 5383 -1617 -9850 -8621 -5773
11992 -5773 -3523 -5754 -3739 2224 -280 -1913 -3579 -7471 -5108 -6426 -8227 -692 318 -2808 -5834
11977 -5834 -3987 -2225 -2272 -8539 1399 1945 657 -5207 -10380 -1551 2896 -918 365 -2503 520 -1444
11960 733 443 -4837 -2559 -9365 -4275 -3341 -1975 3995 5007 -3191 -5710 -7462 -8565 -7048 -3939
11945 -3939 -2608 -6617 -3286 -5888 731 5289 -4928 -1031 205 2666 -6424 16 -4466 -1219 -1261 5500
11928 3589 8152 8683 433 -2376 -2800 -2807 2919 5832 4075 -6374 -4889 -3065 566 3994 -5842 -3535
11912 -3535 -1377 -11994 -9269 -7591 -5672 -9068 -11573 -7233 -12433 -7764 1369 4280 419 -4910 -5123
11897 -5123 1410 -7348 -6856 -5266 -9579 -2892 -1564 -923 -3918 -11276 -10026 -10777 -5396 -5567 -634 -2740
11881 -2740 1215 -1187 5328 1916 563 -276 7443 10774 9818 3974 5699 -4448 -5326 -2846 -1109 -1865
11865 -1865 1055 -2436 -6437 2095 247 2557 9343 24149 58307 64075 23924 7407 -1270 -8659
11851 -8659 -7744 167 -1597 -3067 5670 822 -2168 -1614 -5847 -6305 -11654 -10404 -4041 -920 -4459 -2323
11835 -2323 -6128 -1205 -3227 -5736 -3602 -6050 -1102 -7243 -9635 -4084 157 -2641 -5341 -5415 -8915
11820 -8915 -3503 -7778 -11107 -11346 -3958 -1828 -3932 -5539 -11880 -9451 -4443 -734 -809 1300 -2133 -5972
11804 -5972 -2696 -7970 -5474 -5312 -6052 -9853 -3423 -3748 -7158 -9503 -9404 -2686 339 -1871 -1870 4550 4083
11787 4083 -2497 1240 5079 3993 11835 9819 14155 19990 23306 31721 49081 67967 77892 85402
11773 85402 84968 75009 63783 49191 43121 25765 11441 4690 4902 7646 4712 -316 -3103 651
11758 -3506 -3460 -7908 -6346 -1495 -5450 430 9375 722 -1568 -2638 -3411 -5948 -8488 -7565 -5669 -6479
11742 -6479 -6795 -3821 -3674 -8511 -14489 -17287 -7605 -9206 -11087 -9232 -5869 -5535 -12630 -17247 -6665
11726 -4649 -6501 -12583 -11868 -5911 -5207 2132 9622 15823 6660 7894 7514 16865 9770 6919 7073 3365
11709 -5997 -7065 -12553 -11602 -13467 -15194 -12497 -9826 -12582 -18561 -11500 -10786 -9862 -13745 -13549 -19428 -18032
11693 -18032 -12460 -4221 -6935 -3885 -5203 -4748 -1209 -626 -3489 -4075 -4989 -3139 -4799 -9315 -5402
11678 -5402 -3961 -2537 -10185 -8854 -4112 -4943 -6480 -14644 -10266 -6143 -10379 -8779 -5042 -6757 -5574
11663 -5574 -8014 -7289 -3414 -8636 -13114 -6994 -3459 -8590 -7574 2430 -6171 -5345 -5683 -10463 -13936
11648 -13936 -13550 -11390 -2862 -10905 -11899 -8955 -11374 -10108 -6872 -10995 -10547 -10085 -17446 -17115 -12129 -13880
11632 -13880 -12228 -10922 -15260 -9443 -13128 -16922 -8605 -5072 -6451 -5781 -4628 -2571 -4513 -7256 -11310
11617 -11310 -10280 -18859 -17399 -10350 -6801 -7953 -14457 -15576 -12451 -12124 -10172 -17480 -10715 -4041 -9255
11602 -9255 -9599 -3896 -3633 -4313 -8879 1081 -7149 -7980 -10321 -6634 -6155 -10872 -15701 -7567 -8522 -6152
11586 -6152 -8739 -12273 -4529 -6836 -14672 -17873 -16338 -7792 -11220 -9569 -3929 -6053 -6563 -1902 -5509
11571 -5509 -8216 -4906 -7934 -6275 -11585 -4405 -8911 -7943 -3480 -52 -8355 -8566 -12438 -14371 -13880 -12527
11555 -12527 -13444 -10980 -6962 -9239 -12612 -9908 -10428 -10104 -9002 -13232 -15163 -13175 -13295 -4478 -10046
11540 -10046 -8072 -15151 -11056 -15329 -12358 -15955 -19056 -11810 1164 2009 297 -2080 -6292 -2476 -11917
11525 -11917 -17619 -13092 -14599 -16569 -13704 -12528 -13863 -13892 -14718 -14011 -12023 -12418 -11562 -13861 -14715 -68 1123
11507 8901 27476 52363 75551 76270 47401 17884 3342 -4948 -8060 -7217 -11587 -15005 -16491 -20103
11493 -20103 -13934 -13975 -13624 -6246 -5611 -10322 -14300 -7973 -8246 -19368 -10500 -12037 -8052 -10304 -8032
11478 -8032 -4458 -1271 -6405 -7592 -5330 -4163 -5924 -5534 -2658 -8566 -1691 -1791 -7633 -10596 -13483
11463 -13483 -14637 -11158 -3048 -1320 11477 30316 55306 75265 61931 35365 27703 32553 59975
11450 59975 95577 38149 15474 8459 -587 -1041 -6250 -3291 -6459 -7029 -6087 -8095 -5643 -3848 -9137
11435 -9137 -11132 -12003 -11414 -14841 -19963 -19529 -13820 -16150 -11662 -8910 -10012 -4635 -8596 -10446 -6803
11420 -6803 -8485 -9750 -10739 -6694 -5910 134 -3664 -6346 -1976 9188 8646 8766 11058 23252 26713 38214
11404 38214 56460 71091 73611 66949 51881 41542 28251 14759 11151 11634 5152 5355 6938
11391 6938 13027 10151 6625 9917 10424 11424 11282 7830 7075 1843 -2831 -5720 -8039 -2528 -4887
11376 -4887 -11478 -8376 -9865 -10002 -10831 -8567 5671 8257 15980 27586 25523 14924 10309 3773 -6132
11360 -6132 -7169 -8835 -9457 -3141 -6511 -3174 -3042 -3760 -4835 -10441 -6633 -12264 -14999 -16177 -5430
11344 -7850 -7412 -4368 -3407 121 -6539 -10270 -8906 -7363 -12624 -15493 -16244 -15401 -16052 -15877 -16243 -11085 -5165
11326 -8344 -8131 -6852 -13199 -11556 -9691 -6983 -11841 -10994 -9508 -2298 9311 42071 112081 212075
11312 212075 244348 157219 77626 45370 21609 13295 7374 8809 2388 -1174 -7772 -1129 -976
11299 -976 612 -2505 3278 1800 7293 15585 15986 23364 20908 15573 12022 11120 14492 9470 4821 -1072
11282 -4005 -11819 -12437 -7071 -6853 -4192 -3928 -6449 -6881 -10378 -6968 -6456 -4954 -10002 -11491 -12073 -15100
11266 -15100 -13192 -16376 -8855 -15216 -14068 -8335 -11707 -9960 -10010 -5660 -12567 -19326 -18907 -17217 -12847
11251 -12847 -13110 -17315 -19056 -24519 -17444 -13161 -12231 -8240 -9002 -14946 -12228 -10924 -10952 -7681 -9070 -15811
11235 -15811 -6214 -8252 -9518 -13393 -9489 -13951 -10226 -5653 -3226 -6944 -7791 -6927 -4424 -8640 -9269
11220 -9269 -12064 -12089 -10231 -15225 -17127 -17443 -13804 -14325 -14687 -14572 -11499 -14032 -14391 -12193 -7059 -7118 -9433
11203 -9433 -10433 -7285 -9861 -9880 1096 -5500 -13576 -10623 -12534 -15512 -14866 -15332 -10553 -10030 -3154 -4801
11187 -4801 -3758 -9391 -7570 -8961 -2528 -5492 -2140 -10025 -7330 -9273 -7867 -3818 -1337 2537 11230
11172 11230 30626 39128 12479 4480 298 -5114 -3506 -4322 -9577 -11125 -13926 -5907 -9264 -2197
11157 230 1226 -2748 5181 5979 3977 -1589 -750 -3524 -4970 -7481 -3240 -2151 -2371 -1420 -3668 -5944
11141 -5944 -5995 -4450 -3937 -9634 -8381 -8407 -8974 -8365 -10093 -10272 -11187 -10465 -8063 -5414 -9321 -6903 -9656
11124 -9656 -10130 -13403 -14009 -14219 -13524 -10890 -18877 -21274 -22537 -18292 -15647 -9158 -11723 -11290 -11554 -6957
11108 -6957 -11121 -11377 -12046 -15305 -14234 -13446 -13962 -13819 -7962 -6206 -1043 -2165 -8355 -4970 -1280 -10738
11092 -10738 -9163 -8823 -10675 -16764 -11161 -9042 -6935 -5295 -9471 -10949 -4148 49 -1844 2999 3871
11077 3871 -2313 -8733 -7335 -4916 -16902 -17033 -10567 -11631 -8976 -9525 -1399 802 -6967 -8286 -8496
11062 -8496 -7119 -3235 -4643 -9418 -10762 -5454 -5749 -13474 -10810 -11722 -14208 -19851 -24928 -18422 -14964
11047 -14964 -15710 -13119 -9959 -7554 -10383 -10201 -8504 -9918 -8508 -8129 -14514 -9402 -7464 -12172 -11883
11032 -11883 -12515 -5516 -10995 -9834 -10423 -5647 -6001 -14034 -17167 -12052 -9755 -10368 -12248 -8100 -10920
11017 -10920 -9914 -13111 -15880 -7499 -6392 -2643 -2038 -8107 -11488 -10372 -6590 -6902 -6312 -6286 -5678 -10582
11001 -10582 -11616 -5117 -8743 -12528 -4659 -6155 -10232 -5807 -6186 -2784 -5994 -7090 -6295 3200 -3326
10985 -7069 -8083 -1970 -3202 -6303 -1782 -2599 -4341 -5241 174 877 1484 -2741 -3500 -145 1533 -2814
10968 1898 7745 1954 2319 5526 8085 7727 1958 4944 2545 2842 11721 14648 14214 17003 21297 26277
10952 26277 25184 32098 44805 55595 74396 94526 130837 165210 199694 235298 259362 257520
10940 257520 236792 210964 176307 144070 117368 97805 81317 64422 51677 44964 38979 26424
10928 26424 17044 22213 12694 11417 13154 14477 18872 7175 11576 7621 15987 18881 7869 34 -3545
10912 -2974 -5089 1413 -4833 -2437 -537 -621 -1435 -476 -3212 -3944 -2588 1908 -1910 -7800 -11385 -11265
10896 -11265 -5354 -6397 -2520 -4560 -8193 -3655 -3718 -9598 -10137 -9395 -6625 -9690 -11755 -5964 -3816
10881 -3816 -1181 -1399 -5093 -12796 -3212 -3817 -8743 -8873 -2939 -5804 -7480 -7359 -7738 -10480 -6925 -8215
10865 -8215 -16282 -17353 -16544 -16895 -12177 -8045 -9909 -10928 -6942 -5501 -8289 -3806 -3389 -7340 -5249
10850 -5249 -6929 -6451 -8982 -3344 1866 -1530 -1371 1446 2432 494 4837 4023 5650 12189 9237 10974
10834 10974 14879 11952 12983 14342 18918 21838 13423 5997 9726 10675 13843 8786 4870 4349 1217
10818 622 54 -2656 3540 -5776 -10335 -4923 -5147 -2788 -347 -8163 -10994 -9602 -12732 -7799 -6890 -2152
10801 -8767 -13636 -12065 -11590 -15039 -11098 -12192 -12014 -12320 -18857 -16247 -25906 -23692 -20173 -23212 -11329
10785 -8298 -7641 -9410 -8315 -7882 -12409 -12916 -7835 -4985 -9082 -10274 1022 -5296 -12833 -20375 -20186 -13729
10769 -13729 -7060 67 8306 6590 13564 9511 14378 22770 24367 9264 3337 6918 9793 8497 -7422
10753 -2682 -3685 -4592 -8742 -7061 -15421 -12599 -17107 -23191 -25946 -18483 -13678 -17872 -8269 -13433 -16624
10738 -16624 -18613 -14144 -21145 -17275 -18395 -17659 -15776 -20428 -25173 -17776 -21081 -24550 -15284 -15868 -18997
10723 -18997 -14542 -17412 -17748 -18624 -15306 -19858 -19953 -17983 -21628 -25686 -18322 -14973 -13544 -13472 -17150 -22783
10707 -22783 -25147 -21364 -14448 -20025 -21391 -19225 -18707 -20342 -19980 -19728 -23152 -20925 -20198 -16290 -22889
10692 -22889 -22708 -15942 -13608 -11865 -15205 -10100 -9485 -11056 -17664 -16864 -16073 -15439 -10869 -8826 -9828 -9845
10676 -9845 -8666 -10649 -1841 2860 -2212 3050 8465 9046 11353 13503 9259 3996 923 5477 6397
10661 6397 11258 9354 15887 16564 13481 16908 13763 11860 11472 14066 16364 11219 7661 12948 17815
10646 17815 23982 30965 38567 39004 42835 47551 51165 59741 72300 77530 88868 104268 111835 124284
10632 124284 131580 139508 148901 152399 150490 143962 132990 126408 111878 104540 85005 70753 62572
10619 62572 56585 47916 43414 31795 24854 25445 26360 23712 19698 10776 19611 16783 13151 16880 17230
10604 17230 16895 14757 12619 6918 6403 4416 13494 14125 16897 12836 10767 10845 13714 19271 23459 25420
10588 25420 23173 27829 33003 33883 35006 35265 42276 44015 41863 44906 47090 48447 50055 46934 49317
10573 49317 50204 46848 52566 57973 53709 48577 48119 48592 53013 54352 52713 55190 60456 55829 49024
10558 49024 42716 39433 37280 36187 38245 40921 43463 43018 37838 41616 38463 37295 36668 30707 31406
10543 31406 25482 25465 33711 31666 21032 21600 23669 21320 24312 22502 23115 25044 21011 17326 11414
10528 11414 15275 11538 10402 11729 15076 10958 6478 5489 2393 7629 567 2275 1285 3782 1144
10512 8341 3912 2627 -16 2016 -2204 207 -2081 -3632 -7049 -2949 -6780 -2458 -5578 -7807 -10597
10497 -10597 -10376 -860 452 1536 -4486 -4539 -11452 -10836 -6724 -6074 -9734 -15742 -15609 -14127 -12163 -8608
10481 -8608 -10644 -10310 -7632 -4325 -16117 -19998 -15682 -16193 -19755 -13990 -20211 -24382 -23970 -25056 -27779
10466 -27779 -20477 -28220 -31413 -20045 -19739 -24298 -17514 -22012 -22277 -17172 -21119 -23109 -24665 -31307 -27969
10451 -27969 -24896 -20835 -17812 -20640 -15141 -16567 -13341 -14720 -21628 -24337 -13106 -12662 -13399 -11012 -4639
10435 -7092 -12770 -17055 -19875 -19823 -20589 -14539 -16925 -13265 -18818 -13968 -16818 -27680 -25129 -18507 -24258
10420 -24258 -26728 -19034 -17263 -12572 -10105 -11406 -17382 -17382 -6307 -7246 -11023 -10225 -16904 -18515 -11180 -10580
10404 -10580 -4436 -4160 -13075 -16147 -14435 -12452 -9877 -8901 -8660 -10911 -10236 -11147 -17761 -14927 -16405 -21826
10388 -21826 -12776 -3443 -2994 -8327 -13197 -13362 -13192 -12011 -13320 -18158 -20771 -18717 -17601 -19658 -16003
10373 -16003 -11399 -11239 -11773 -13530 -11228 -12224 -13651 -4659 -10739 -9802 -10659 -10694 -9048 -10076 -8475 -10587
10357 -10587 -16100 -8797 -4718 -8837 -9616 -2973 -541 -3275 -9510 -9590 -10790 -15379 -5010 -5562 -13475 -16879
10341 -16879 -12031 -9540 -8645 -6710 -4693 -5509 -3917 299 11795 24132 53732 120492 125940 50909
10326 13225 6389 -1562 3395 -437 -7186 -14251 -7377 -9063 -12104 -3392 4005 6980 -1242 375 9634
10311 9634 15498 6009 -287 1746 8507 12691 10232 17280 12865 6130 5837 6051 17067 21703 20810
10296 20810 19702 32208 38523 42056 44702 49523 48285 46291 48070 51547 53329 48489 43224 48530
10282 48530 47542 43157 46896 56685 58148 55464 55200 58303 55906 52899 51145 54045 54794 53794 52875
10267 52875 60146 58047 57820 68168 59543 57190 59997 72039 77552 79293 77951 83630 84634 92988
10253 92988 101407 109034 121044 121069 125096 129886 143984 139334 138418 143936 158573 175288 181310 186284
10239 186284 189304 200625 214491 229098 241542 247461 256751 270870 284109 300087 323230 332138
10227 332138 348558 372045 401058 424523 448026 484462 519849 565775 607592 666173 725671
10216 725671 785957 874366 963351 1079358 1212792 1363751 1534016 1739634 1989570 2293283
10206 2293283 2658424 3109826 3662366 4339244 5155293 6139641 7301936 8582383 9832950
10197 9832950 10899184 11682841 12183681 12442189 12498986 12412816 12178858 11817811 11344853 10795408
10187 10795408 10219687 9642388 9028835 8393439 7731981 7067733 6402226 5757206 5139537
10178 5139537 4577207 4069105 3620508 3205669 2833997 2495250 2203108 1928410 1673916
10169 1673916 1446974 1256613 1109359 987453 883502 804557 724617 659791 604225 553808
10159 553808 503961 468315 437344 401347 379370 362910 331933 311363 297285 281767 268990
10148 268990 258117 247211 234445 224548 217514 220558 220947 206736 190236 168131 145408 144831 138461
10135 138461 135068 133552 132103 117820 111560 108248 103906 102979 97980 94257 88130 88971 86967 85035
10121 85035 84975 86337 91124 89849 89989 103355 102760 113546 133378 145388 153243 161071 168659 141497
10107 141497 110192 91083 73236 71671 67838 60809 66794 76462 81224 78127 74626 67218 62549
10094 62549 63136 63427 57716 60548 52004 50276 57072 59799 51207 44352 41894 47246 49739 43906 37302
10079 37302 39191 39169 44804 39959 36706 34252 40604 50488 55168 51892 52815 54928 62268 70149 70667
10064 70667 69211 73264 72492 86942 97692 104901 120490 141701 158985 182675 210270 249080 293974
10051 293974 354185 422149 516593 646171 815375 1047816 1345469 1711805 2095280 2429476
10041 2429476 2640665 2725736 2692340 2563661 2366573 2141684 1903839 1653339 1400757 1164144
10031 1164144 960050 787016 645913 532396 442099 357813 300003 252414 210218 176340
10021 176340 152811 128897 109667 97981 86224 74702 76506 74823 57476 51106 48245 49194 43572
10008 43572 39523 36193 33567 28141 22628 22218 22124 14104 16721 22842 27903 26318 38193 43416 33396
9993 33396 40134 38525 31420 28112 19447 17675 21121 14294 14963 14211 11302 14477 11990 11988 8126 4970
9977 4970 4383 1209 -3418 236 2225 6528 1510 5264 6492 3314 5714 6543 6084 6596 5142 4733
9961 4733 10022 10140 16324 23404 24667 36994 55716 74788 98447 126825 161696 199332 222738
9948 222738 232594 233919 227595 212555 187143 164639 145752 124880 101292 79269 54499 43372
9936 43372 31965 27652 21032 12229 1873 -5953 -3911 49 -6472 -6484 -10463 -10058 -8916 -10714 -20533 -18640
9920 -18640 -10801 -13226 -19968 -20507 -17480 -19866 -21383 -19616 -26708 -19819 -29424 -25367 -18905 -21246 -11928
9905 -11928 -9308 -11440 -11054 -8019 3537 29262 43132 50321 50373 39089 13773 -2677 -5862 -10557
9891 -10557 -7847 -11013 -15114 -21321 -18648 -23801 -19055 -23143 -12859 -6690 4804 14700 34922 54469
9877 54469 67839 116925 228599 378160 418052 313839 217719 181829 153013 108883 94204
9866 94204 85934 84025 66154 70712 82548 116939 156810 183524 252569 375051 436366 316230
9854 316230 177060 111085 87603 77136 58625 50026 53112 35374 19938 6820 -4549 -10419
9842 -10419 -14201 -13801 -20057 -24705 -21508 -26673 -23886 -26048 -29001 -22693 -19263 -17950 -20598 -24577 -22794
9827 -22794 -21828 -26394 -20590 -26989 -26704 -28731 -30642 -32532 -29288 -24161 -15874 -18551 -26050 -20370 -17125
9812 -17125 -17611 -12842 -19108 -25488 -24752 -27686 -20074 -25603 -22685 -18552 -19350 -20171 -18326 -20341 -17509 -13153
9796 -13153 -9323 -12839 -10744 -5770 8655 23538 60752 84959 71629 50253 36302 33669 31989
9783 31989 38220 41102 33545 22192 14044 11528 17143 25938 34411 42851 72859 98387 103727 81179
9769 81179 69195 73126 85986 108720 117271 115976 117255 134271 95881 58090 55519 83793 115029
9756 115029 82472 43937 33689 48259 58891 61302 53145 57924 66391 51027 30228 26550 31042
9743 31042 52477 66660 76284 73786 63331 63345 56010 52272 47738 47273 69684 97554 91716 108455
9729 108455 140960 198568 248515 261701 237316 215897 187463 164076 140929 122053 136545 195738
9717 195738 251886 254297 225092 209827 203884 196374 199214 218770 225573 187790 131878 101608 101454
9704 101454 116475 120419 134956 193499 234614 208303 131149 84129 67750 68761 59508 36840
9692 36840 38255 36038 37477 34770 32253 34989 26561 22741 25934 25046 32496 35848 37573 50107 75978
9677 75978 84134 85731 86630 92292 111332 163346 237842 254436 211710 162016 130188 100780 77893
9664 77893 68044 68428 82405 96264 103870 94466 107182 123992 152929 207516 256372 228664 155391
9651 155391 98095 65890 46354 25891 25297 11269 3558 5985 4195 8573 17735 21892 24355
9638 24355 26527 37478 38718 34437 39678 51045 42012 30955 28248 22051 21086 20694 20754 17141 18603
9623 18603 25456 29406 40044 46726 48576 53050 68356 93105 111402 85678 67191 55174 48052
9610 48052 45056 36753 33056 21879 29082 20698 14052 19745 33318 43175 56935 94994 96535 57119
9596 57119 39432 25577 27023 22499 18810 13094 12638 21198 21063 31505 35902 37719 35325 36473
9582 36473 34844 44077 45880 54004 54722 46010 47937 49191 54980 59306 78033 100564 109745 111859
9568 111859 102810 109072 125728 127740 117544 106197 108425 122240 118599 114465 111899 114569 134880
9555 134880 159500 184556 205010 214862 229382 256241 295676 338417 303083 258173 250882 276761
9543 276761 298261 332388 382283 526638 767817 984755 1016762 968499 1020327 1165478 1188864
9532 1188864 1132660 1219656 1388964 1506977 1860034 2897419 4452268 5084384 4278541 3325197
9522 3325197 3004509 2843535 2377800 1826532 1505763 1461123 1497759 1433460 1542001 1936413
9512 1936413 2361505 2738366 3628690 5000245 5346011 4007469 2468648 1662503 1337595
9503 1337595 1061039 791661 619611 477470 374762 320443 302304 262613 215390 182559
9493 182559 166529 158342 160592 156313 149998 155021 163697 175061 194990 228975 259136 253901 218435
9480 218435 185467 170237 151626 131124 122188 119300 115329 123960 149753 192001 226732 244155
9468 244155 254720 287275 328974 318298 259075 202168 180362 191748 219221 184327 158933 157339
9456 157339 161023 160738 172587 187100 188064 180532 175537 185899 214472 218058 191096 196964 208255
9443 208255 219630 216016 222493 239471 276371 292250 291349 279674 258617 267774 284860 296710 321476
9430 321476 343088 368368 382491 379519 378575 395828 415598 425680 432669 444126 436209 404415 348047
9417 348047 300888 267132 234839 225251 238918 252236 257469 265939 282717 305956 304861 325759
9405 325759 373489 377343 346871 322903 276731 228415 208846 204248 210619 231124 266764 285998
9393 285998 285317 293330 335563 402106 435977 461248 496228 477496 419174 349955 309996 293595
9381 293595 280786 277376 303006 349656 388001 430943 452404 464165 474626 493803 534307 592193
9369 592193 640424 618891 577911 592920 625173 702823 885914 1149053 1318926 1313004 1174635
9358 1174635 1021612 883100 752196 635557 570352 577128 612200 641724 709203 840115 986759
9347 986759 1139626 1340923 1560511 1775452 1986662 2178404 2009653 1606706 1256310 1112726
9337 1112726 1045704 942200 898196 868618 831611 853670 958796 1128888 1332777 1373936 1373102
9326 1373102 1680639 2408855 2850777 2310439 1647859 1304835 1142106 986129 919620 935410
9316 935410 975905 1031729 1051382 1058348 1055402 1024142 968156 926322 888355 877906 940272 1052555
9304 1052555 1141034 1134434 1142760 1266358 1472945 1686579 1878331 2142016 2582834 3112312
9294 3112312 3477543 3432184 3034561 2672579 2440986 2327362 2222372 2102425 2074931 2199150
9284 2199150 2384616 2554288 2767310 3049855 3174538 3252298 3446474 3854724 4259554 4026351
9274 4026351 3406446 3097179 3052279 2990517 2980663 3008507 3130142 3375468 3996456 5485777
9264 5485777 8573407 12770734 15609885 17700898 15786214 11146555 9791545 9127015
9256 9127015 7044000 5541547 5107329 5454463 6629476 8437892 11574582 20351674 36633175
9247 36633175 41059629 39496369 38589282 33311819 25880772 17230090 11116610 8453709
9239 8453709 7519558 7226518 7953085 10723687 14519524 15708870 18469553 27591774 37962452
9230 37962452 37249412 28336860 18611775 13126349 8771641 5842261 4731075 4133980
9222 4133980 3693737 3734341 3993595 3985613 4280325 4871278 5654118 6019999 5557855 4545030
9212 4545030 3825446 3506001 3270412 2993597 2783052 2738548 2815026 2848866 2851508 2926680 3096302
9201 3096302 3178120 3125952 3272726 3626588 4133405 4682881 5548472 7251713 10271826 14909083
9191 14909083 20849071 27579381 35146030 43401881 48330816 47566989 39960492 31986564
9183 31986564 28195891 27696934 26255722 22022771 18235640 16518599 17075525 18802879
9175 18802879 21540925 25214684 29638323 32501100 34530207 34616522 31088824 27519852
9167 27519852 25322752 25050179 24781386 22370807 17563500 13487287 11878866 10256163
9159 10256163 8830240 8183300 8440740 9638874 11040566 12713948 14904844 18087726
9151 18087726 22188770 26821487 33800086 47923497 80877787 173786862 294730183
9144 294730183 226736113 120039237 64113855 39958655 29825364 24486335 21013576
9137 21013576 18487538 16186979 14195721 13509054 13828190 14694895 16065255 17593231 19635327
9128 19635327 22955771 27743394 34584443 43411780 57271251 82457996 134387478 256157335
9120 256157335 457172142 494476037 277536918 141864911 80888830 52128300 37197792
9113 37197792 28641298 23558099 20217464 18724079 19848869 21157101 20077743 17600976
9105 17600976 15481037 14624581 14904366 16038473 19723352 22142765 19237104 14428557
9097 14428557 11246726 10485565 10544053 11010084 12747154 14165315 13125657 10600733 8464793
9088 8464793 7680409 7503456 6872651 6324463 6779950 7832967 8226626 7230738 6515358
9079 6515358 6194635 5892756 5703721 5759931 6005866 5960200 5196235 4228080 3569646 3174518
9069 3174518 2897662 2809293 2882561 2737596 2476243 2273539 2069849 1907581 1759218 1602889
9059 1602889 1452700 1387206 1359118 1323114 1260957 1201858 1129452 1100243 1142586 1180076 1187194
9048 1187194 1141899 1099028 1135804 1297890 1535371 1661045 1612550 1579723 1628887 1709833 1777738
9037 1777738 1880388 1997845 1906498 1748215 1803934 2042037 2128091 1937973 1760846 1772776
9027 1772776 1981218 2118597 1947102 1663889 1473364 1380034 1314497 1296535 1350721 1372771
9017 1372771 1268812 1149834 1082085 1017593 973832 921266 861055 782937 728585 705669 708024
9006 708024 739512 837715 1067184 1277605 1230364 1071291 988833 955222 870358 764928 705666
8995 705666 715858 753652 769816 811249 919807 989472 991179 1011258 1114642 1185388 1040699
8984 1040699 821943 707022 665100 649037 642611 660528 706126 774303 840721 919007 1041620
8973 1041620 1208386 1470248 1821918 2068733 2123987 1995894 1796315 1614555 1487022 1489476
8963 1489476 1617853 1726473 1608019 1415849 1355402 1388839 1361373 1314678 1345797 1453637
8953 1453637 1608514 1703585 1705140 1634527 1551931 1415331 1303440 1297854 1384134 1353984 1136429
8942 1136429 953518 870863 813353 720536 617583 521989 464195 424945 398035 378288 373836
8931 373836 383162 397000 403076 388749 356647 323062 296052 274271 254882 249222 226654 216479
8919 216479 215538 220661 233838 238067 242990 249881 261021 272863 256113 235412 218300 200902 179987
8906 179987 165125 159432 148693 145437 157553 166304 174895 178274 173856 177742 186531 199551 196438
8893 196438 179487 166892 155563 148974 143931 156625 167963 184863 224058 286987 340284 332767
8881 332767 291343 275582 300504 333758 359175 368512 360750 359136 363813 378105 435685 599025
8869 599025 845965 972108 878143 759440 685132 615266 512261 437876 430168 447390 463875
8858 463875 467905 492516 561100 674230 829001 1022729 1203557 1303183 1180987 917676 727942
8847 727942 654314 709816 930785 1157452 1225284 990341 723909 535584 467344 458950 485952
8836 485952 532104 558722 501881 397970 302429 256266 238113 226490 221314 224936 231999 276703
8824 276703 300271 280179 239430 201482 176575 164478 150079 142597 136334 130657 127280 140242
8812 140242 157402 187329 206532 225340 275722 340640 381576 384658 426864 538936 684798
8801 684798 747980 693957 574195 473037 389808 323574 261906 210861 185379 193327 208538
8790 208538 256651 337468 424432 517118 662226 863969 999785 963006 756329 523716 367514
8779 367514 283903 233049 173892 140137 118966 90450 74310 61302 56978 59155 51320 54261
8767 54261 56198 67519 79888 85518 75738 64494 57712 57050 50269 41792 39018 41046 38522 44573
8753 44573 46373 54932 64958 81134 102716 113720 127625 125252 109449 112536 119094 128205 147972
8740 147972 196588 316789 632622 1185369 1192915 646563 385470 279304 219756 202178 193234
8729 193234 195119 197555 221841 261875 309173 400289 580733 867166 1114968 1141542 936885
8718 936885 704303 552874 440954 339853 256668 198556 165010 155205 178055 224885 290825
8707 290825 353712 427151 552162 686308 697934 574871 411237 301054 260060 239478 219487
8696 219487 229160 307820 482574 622879 562076 397816 292762 254211 209239 144397 107543
8685 107543 87931 75434 85775 108404 164559 211129 238476 291078 417094 536284 489444
8674 489444 308260 170081 111355 86951 71685 52484 31780 16754 7091 -2597 -2978 -2374
8662 -2374 -3768 -3121 -1114 -827 -2177 -3422 -11081 -5593 -2793 -1908 -3175 -4829 -3973 -1986 1458 5501
8646 5501 -413 -2060 5679 -1255 -1805 -806 750 -1666 3432 7367 60 -3572 1973 2550 4138 13418 20969
8629 20969 35648 67886 146641 242912 311442 261848 159417 74166 30570 11994 5435 -8114
8616 -14502 -3455 -1407 -11539 -10362 -15388 -10494 56 5248 -4512 -11910 -12739 -13224 -18749 -27442 -28209 -24985
8600 -24985 -28126 -28099 -34258 -28240 -28048 -25307 -23419 -24586 -33653 -33054 -37174 -33899 -27186 -33896 -29163 -36024
8584 -36024 -33369 -38430 -33516 -24963 -32760 -37775 -32486 -35373 -37994 -42133 -44990 -46457 -46568 -48173 -41140
8569 -41140 -45102 -44434 -42140 -43867 -41470 -49509 -47735 -46652 -49694 -46328 -40526 -42334 -41649 -42965 -41399
8554 -41399 -36907 -39921 -45739 -41465 -41752 -46235 -37177 -28813 -29909 -21771 -26258 -35393 -37672 -36173 -38003
8539 -38003 -39970 -42682 -41015 -45131 -51363 -50393 -47011 -46947 -49542 -53066 -50905 -52970 -48120 -42349 -51066
8524 -51066 -48953 -48380 -47615 -47072 -46311 -41308 -39571 -43739 -48131 -40966 -33232 -31380 -37274 -38839 -43533 -44629
8508 -44629 -40983 -43857 -46442 -48625 -47261 -35778 -28171 -26180 -18002 -10359 -3683 14806 26561 34191
8494 34191 57095 102254 156867 214372 268237 291393 268978 236714 181344 120333 77473 47566
8482 47566 30354 10312 -2196 -6416 -3129 -4783 -14343 -18632 -24141 -24126 -30732 -30643 -31434 -31821 -28756 -28419
8466 -28419 -17089 -16565 -11128 26001 75777 57116 42843 70388 153516 146910 61003 24229 44518
8453 44518 76642 25168 -15696 -36309 -47657 -50005 -46204 -45407 -53521 -54714 -65337 -64344 -55923 -48438
8439 -48438 -53209 -57036 -60357 -64884 -55648 -58361 -52442 -54705 -61836 -57984 -57353 -55668 -53848 -47269 -46662
8424 -46662 -49833 -52360 -49619 -55596 -58143 -56225 -50861 -55277 -56659 -52291 -51522 -49422 -51912 -50071 -39381
8409 -39381 -43362 -44485 -38024 -42095 -49129 -57609 -43673 -48598 -33569 -6300 19549 23125 26767 10223
8394 -11950 -23225 -31877 -25717 -7369 20038 24064 26749 19443 -3597 -23819 -33875 -35678 -26475 -18491
8380 -18491 -8948 29278 89788 132278 123695 117349 75634 36918 26443 37985 67517 106753
8368 106753 149321 139917 136222 94869 38938 14989 1120 -8053 -18591 -22965 -31310 -39922 -27632
8355 -27632 -20787 -18365 -14955 -15599 -11312 -6989 -8847 5887 29019 4213 -28742 -27005 -16752 -5198
8340 -200 7436 12865 25186 51012 66235 26889 19099 30587 25330 18736 28883 30754 28034 33642
8326 33642 43829 48232 64556 77478 85531 94842 94967 107715 116162 111794 111856 107208 122367 159020
8312 159020 200851 278830 349922 419078 483580 576156 765218 970830 1177472 1584156 2224425
8301 2224425 2796904 3837859 5956176 10399209 20779613 51655037 80934990 44170151
8293 44170151 19647646 10224839 5781031 3601531 2669172 2161727 1607735 1109789 743414
8284 743414 582723 503318 402140 331864 287424 257248 267795 243446 231559 199435 161563
8273 161563 130644 117809 117460 147870 165904 178935 182388 172218 136707 86923 55214 30113
8261 30113 12164 16647 17281 1448 -489 16575 21698 12538 6002 -2255 -14447 -15110 -20937 -21415 -26119
8246 -26119 -19922 -35068 -66630 -73653 -62282 -60919 -52409 -46772 -56195 -54626 -47058 -41753 -34245 -25970
8232 -25970 -23472 -35066 -35984 -41468 -39862 -34122 -32221 -35786 -44855 -47959 -55001 -62430 -54075 -39398
8218 -39398 -31315 -39487 -44439 -43787 -35379 -33413 -30012 -37400 -39257 -36024 -22774 -7496 33957 108261
8204 108261 185695 261977 300790 306123 259954 184921 112725 51544 1186 -24881 -36581 -39026
8192 -39026 -45669 -40959 -42970 -42705 -48781 -52982 -56769 -60835 -54376 -51406 -53107 -57003 -59270 -59172 -62942
8177 -62942 -60700 -53173 -55329 -53742 -58160 -63989 -59444 -57905 -59412 -60474 -57438 -52385 -50260 -47724 -46977
8162 -46977 -33776 -34906 -36045 -18232 7516 13490 12337 -11253 -27361 -33902 -41986 -48337 -54928 -58962
8148 -58962 -62443 -60508 -55536 -49245 -45985 -41524 -46299 -42721 -39851 -35754 -33513 -22611 4910 62130
8134 62130 67885 36216 36022 107426 161204 96692 39799 34828 64540 45602 5250 -9431 -15154
8121 -15154 -1077 11914 19743 47181 117197 328236 641579 529043 244503 109093 54123
8109 27176 11851 13105 25691 53620 94099 181183 395488 964443 1417155 894623 421373
8097 237262 184190 235019 484065 766097 555107 288243 194493 200303 336817 654318 708346
8086 708346 411563 273886 276504 381388 724389 1609375 2229149 1459654 694453 346261
8075 188405 121206 89343 86349 108657 144659 227707 398870 836793 1802170 2244737 1331649
8064 1331649 633738 353050 272484 314426 571248 873392 647510 353044 232247 232705
8054 232705 374822 730762 790872 437653 259536 226644 301792 590161 1300688 1617606
8044 1617606 887212 392083 183124 93331 45419 23817 17861 19437 37947 68677 150629
8033 150629 375409 762740 680544 300448 115100 32828 -4919 -20885 -32133 -37765 -46459
8022 -46459 -53474 -56939 -57315 -55480 -58409 -58057 -56870 -56341 -43950 -39589 -28374 -17511 -9151 -16747 -35587
8007 -35587 -50524 -53130 -57051 -64868 -59622 -62337 -64323 -63039 -64360 -59146 -58783 -64409 -68674 -67626 -67046
7992 -67046 -70479 -69351 -70852 -64984 -66514 -62011 -61387 -54027 -53540 -62758 -62596 -60922 -63754 -55011 -55678 -58862
7976 -58862 -55038 -51081 -53355 -44636 -37892 -31196 -26188 -17327 -2290 15509 58462 122932 225332
7963 225332 298380 260850 218241 242732 292802 239065 143881 77980 56389 43102 39278 64381
7951 64381 97440 134522 217744 327152 387352 450571 566814 588143 472462 413124 402703
7940 402703 353408 310402 338094 449659 605970 734317 861818 951935 1146610 1386072
7930 1386072 1266683 924454 775543 697865 542265 401301 298377 257312 277034 354796
7920 354796 417240 461520 599695 813260 869310 799131 871875 992988 876649 674559 576322
7909 576322 492087 364801 284769 262241 300436 435001 672648 843626 892195 1143004 1504627
7898 1504627 1326897 984352 878131 751424 484950 307117 231854 213542 273000 385527
7888 385527 448751 469183 604169 730190 597069 454321 390127 300178 164864 69762 20314
7876 -4374 -15380 -28000 -37317 -39545 -41066 -46638 -52829 -62813 -59573 -62043 -61608 -65774 -66304 -63890 -67086
7861 -67086 -60261 -61006 -57423 -57926 -59504 -62589 -64743 -68149 -62316 -65985 -63492 -59514 -61877 -56970 -50563
7846 -50563 -49143 -47278 -45165 -46238 -58072 -60521 -69958 -72076 -64602 -58376 -52536 -53036 -51945 -51887 -53381
7831 -53381 -61468 -67492 -67687 -70789 -73813 -72993 -68555 -70192 -69198 -64163 -66189 -62940 -65655 -68464 -73555
7816 -73555 -65916 -62111 -60228 -57540 -61293 -64605 -60807 -51502 -62534 -57913 -62956 -68507 -63835 -60367
7802 -60367 -65474 -62482 -65871 -64304 -59194 -60110 -57953 -52515 -50298 -52764 -55615 -56860 -56537 -52410 -41560
7787 -41560 -43457 -48426 -55119 -47189 -41656 -41961 -43005 -40197 -37836 -43350 -46888 -37490 -43082 -43638 -44894
7772 -44894 -43137 -34617 -29428 -24737 -27189 -30970 -36742 -20157 -4558 -262 4388 -10667 -10455 -11378 184
7756 10790 28946 74209 151660 294261 432481 512337 687484 760956 609348 545254 477049
7745 477049 357069 305049 333444 475444 784522 1056847 1150573 1542393 1665273 1206629
7735 1206629 1061969 906768 583435 414626 348603 367649 463103 555466 610954 767686
7725 767686 800886 657088 624617 603084 558666 531124 524542 603715 574595 463866 407994
7714 407994 331627 253692 234674 270266 396329 624224 740538 829426 1145153 1088142 792724
7703 792724 729143 555194 332064 236253 221427 262418 344137 383187 419698 534741 491462
7692 491462 368354 322461 235377 128992 69109 48674 43786 31826 9195 -4723 -5475 -6502
7680 -6502 -4838 -864 5323 447 -10357 -10967 -11828 -16394 -15730 -14771 -7497 3028 18683 39850 35861 39296
7664 39296 63267 67805 34753 21451 27842 19125 5000 3707 16839 20481 17938 18121 11377 1235
7649 12625 19975 78 -9775 3882 15397 11411 15577 41109 46043 18530 3526 -5704 -31542 -46631
7635 -46631 -55704 -57671 -56281 -52563 -40721 -38924 -39203 -36951 -26180 -36229 -43709 -45134 -55082 -62670
7621 -62670 -65587 -71644 -71270 -72626 -73719 -73805 -72217 -72449 -76743 -78598 -77964 -77621 -74233 -75393 -82367 -80928
7605 -80928 -80904 -87467 -87487 -81856 -76599 -79881 -82855 -81534 -79373 -82255 -78442 -75823 -76853 -78122 -72913 -74879
7589 -74879 -70789 -70272 -71104 -74805 -75183 -75516 -79917 -80165 -72151 -67846 -66790 -64458 -67065 -61737 -60990 -59245
7573 -59245 -64467 -61441 -60764 -64845 -64339 -62206 -66537 -72031 -70883 -80146 -74825 -76827 -70987 -71875 -73951
7558 -73951 -76403 -72925 -76343 -76650 -77801 -78567 -79939 -73230 -71886 -70767 -69189 -67649 -61392 -52784 -51747
7543 -51747 -48690 -41052 -41167 -38937 -30437 -31728 -41038 -49506 -35711 -25078 -23856 -36754 -50590 -60122
7529 -60122 -67906 -72062 -72788 -80472 -80442 -83069 -71067 -69629 -65992 -69544 -71711 -74266 -71333 -63274 -65594
7514 -65594 -71030 -77929 -79317 -78977 -79496 -72871 -76506 -78576 -83751 -82512 -78455 -74754 -70123 -73637 -73658 -62953
7498 -62953 -68404 -69011 -69089 -68230 -70864 -67385 -69348 -66421 -67221 -74128 -78308 -71499 -66550 -69151 -79158 -81170
7482 -81170 -72900 -72598 -75646 -76415 -69722 -73328 -80990 -74347 -71715 -73436 -78137 -76342 -75417 -80244 -76130
7467 -76130 -73511 -71111 -61423 -58790 -60339 -45296 -28337 -2800 -22996 -43202 -50942 -52186 -45689 -24167
7453 -24167 -25189 -48526 -62851 -61672 -58994 -64539 -61574 -62281 -67109 -59991 -59227 -53940 -52777 -45330 -39401
7438 -39401 -41858 -35893 -25962 -20203 -17749 30 21484 54910 101389 171428 313180 618330 1182586
7425 1182586 1450721 1258616 1713360 2489712 2372064 2011400 2241839 2694709 2148125 1293856
7415 1293856 1247624 1120275 571499 275148 150079 80314 44071 17833 4154 3694 -5285
7403 -11706 -16632 -11673 -9684 -4055 21175 48183 68204 83879 97083 133916 210490 379941
7391 379941 754304 1004799 943042 1427063 2190100 2113425 1801783 2005876 2432683 1961235
7381 1961235 1183720 1148180 1041746 555011 293431 186039 137659 117128 109619 114146 124088
7370 124088 137157 158453 203619 287111 474215 939817 1438429 1613970 2388599 2489269
7360 2489269 2456115 2500869 2287934 2296132 1605673 1366296 1025583 563663 338482 242588
7350 242588 208541 192684 198103 229866 310474 523510 1018312 1380344 1607473 2351180 2263718
7339 2263718 2338754 2252066 2134324 2001979 1354484 1180021 764924 369030 183170 93569
7329 93569 53993 22867 5582 -11557 -18348 -15026 -19422 -22127 -27994 -28725 -27840 -36989 -37090 -35478 -39605
7314 -39605 -41517 -42092 -38559 -36873 -34567 -39185 -41308 -43170 -40967 -42090 -39288 -42674 -47499 -47131 -47318
7299 -47318 -51254 -41635 -41662 -48394 -49293 -51718 -48155 -49110 -52904 -54289 -54207 -47520 -53693 -60905 -66971 -65258
7283 -65258 -59540 -53368 -48424 -48444 -56570 -54781 -52799 -57651 -64281 -62336 -65158 -65839 -68713 -77511 -76957 -70869
7267 -70869 -68103 -66777 -61126 -56421 -53330 -52820 -57951 -51918 -55199 -62774 -66435 -68117 -71455 -75477 -69767
7252 -69767 -66093 -62901 -64257 -65964 -68942 -69214 -68641 -72210 -73709 -70268 -79750 -78269 -76003 -73929 -64370
7237 -64370 -59981 -59332 -60696 -66471 -69797 -70322 -67485 -70200 -59926 -58279 -58273 -63466 -65371 -64218 -59988 -69037
7221 -69037 -72702 -77272 -76091 -77574 -80385 -74182 -79784 -84523 -84789 -82420 -88349 -87435 -84172 -85706 -73216
7206 -73216 -74010 -77883 -77639 -81764 -74547 -72196 -68424 -70183 -68442 -57521 -59414 -59288 -66413 -65548 -64399
7191 -64399 -69691 -65432 -67801 -70755 -66201 -66383 -63120 -58751 -61592 -58946 -54625 -52588 -46627 -47042 -33277
7176 -33277 -26780 -33951 -31214 -40730 -44297 -40394 -35798 -39937 -33809 -30152 -16083 -1608 17022 33882
7162 33882 61435 94857 125935 154898 190202 203567 218709 214584 201424 187017 173957 174701
7150 174701 180130 189868 200718 200068 177258 161207 149408 140854 137192 134727 127641 122592 128618 135377
7136 135377 145975 138917 133587 123420 122257 121893 121838 110064 94751 90304 86168 86930 82149 66474
7122 66474 54224 50122 54538 56518 55132 47624 42276 32522 29357 29899 35366 35962 40581 43126 46058
7107 46058 41150 44463 43875 49819 62349 88580 146248 242459 329513 369614 327472 221686 123982
7094 123982 61922 30894 12084 -1262 -12052 -19359 -24428 -31541 -34524 -35641 -40250 -40198 -38703 -38919
7080 -38919 -40913 -37697 -30582 -27351 -28982 -24682 -11892 -1087 16933 35768 79995 147498 263228
7067 263228 370181 408277 354213 249807 151812 87490 57166 33528 24427 19160 12371 7369
7055 7369 9091 14732 16464 9702 8399 11023 11209 13540 19414 29230 30362 36190 41641 44340 51563
7040 51563 57427 61972 76904 84751 84557 87366 103515 122737 141007 157912 172184 197630 228267
7027 228267 267773 320524 382324 459664 557516 702644 908778 1234751 1765937 2628833 3854180
7016 3854180 5181191 6031209 5928006 5546311 5734094 6433266 7049229 6833386 5992333
7007 5992333 5703475 6254647 7242305 7871071 7463718 6915935 7315950 8600229 10147799
6998 10147799 10925285 10725685 10175301 9096860 8480481 9162329 10796410 12492891 13018732
6989 13018732 12176094 11584947 12441125 14257532 15353624 14169866 12142111 11552294 12327837
6980 12327837 13243499 12868282 11046117 9375306 8847382 9416328 10529244 11255362 11173689
6971 11173689 10500287 8892391 7447654 7160230 7628755 8063566 7566794 6463102 6063471
6962 6063471 6540391 7377819 7691293 6895565 5983475 5860056 6218449 6370633 5554345 3994180
6952 3994180 2674886 1803300 1242473 881918 649584 502150 397008 321073 272386 243577
6942 243577 205113 177271 154138 135966 118985 101982 83934 70453 56824 45494 37550 31938
6930 31938 24916 20759 6908 731 5022 4667 -9468 -7752 -6577 -9724 -18906 -20584 -19603 -20880 -25127
6915 -25127 -30287 -31621 -29653 -30411 -31371 -33139 -35688 -38919 -42176 -46603 -46481 -48219 -43113 -42264 -45384 -46256
6899 -46256 -39889 -37931 -30377 -29463 -21653 -16438 -8055 23527 56856 113730 242277 395062 488979
6886 488979 488515 463083 487134 510373 451683 321070 183176 91984 46595 14726 -6401 -13506
6874 -13506 -22487 -31653 -42110 -49504 -44723 -38903 -34383 -40205 -29902 -27587 -35977 -35128 -28002 -24193
6860 -24193 -20389 -23419 -25751 -28819 -32369 -26579 -21856 -18435 -25234 -28491 -21475 -10553 -3822 -2273
6846 -2273 -2499 -8945 -9089 -4613 -258 4042 -2399 -8104 -5395 2702 12831 13504 9434 2567 4414 7819
6830 7819 5955 4152 -3835 4230 11137 19595 17193 12530 11623 7412 -3925 -12658 -13009 -11338 -8768
6815 -8768 -9995 -10626 -12801 -2701 -1472 -9744 -16894 -15007 -5243 -7807 -14003 -17175 -27571 -31570 -29430
6800 -29430 -28783 -39145 -41526 -45389 -45816 -51415 -51764 -51910 -37220 -37836 -41663 -50538 -59286 -55436 -59283
6785 -59283 -62292 -66571 -62261 -62360 -63042 -60860 -60630 -59712 -61949 -63179 -60227 -65653 -66837 -63187 -56268 -54951
6769 -54951 -57256 -64226 -59248 -60440 -63476 -59137 -51675 -58033 -51140 -50369 -46790 -47023 -42585 -40293 -48073
6754 -48073 -54488 -58488 -59785 -63817 -61661 -57734 -51790 -54271 -51778 -52072 -53209 -58909 -61409 -51823 -43688
6739 -43688 -36011 -44764 -41424 -33851 -32974 -42277 -47103 -49529 -45567 -46439 -46484 -38689 -42691 -50144 -50670 -43777
6723 -43777 -46457 -46257 -46356 -48770 -46344 -46884 -44867 -37495 -37269 -36694 -31802 -33022 -26752 -23125 -18836 -18677
6707 -18677 -23699 -13663 3462 7306 11331 31705 72907 116798 158122 175031 138014 81924 50332
6694 50332 32666 26180 27277 17528 10539 9793 10740 10237 7857 4214 6976 13527 40507 90083 130566
6679 130566 81710 46785 36231 25025 24410 32078 50147 78121 96424 99511 97171 106730 151359
6666 151359 243417 456585 786098 1119482 941113 487212 293821 187076 126197 97466
6656 97466 91190 87247 90271 94650 102820 120770 139645 165364 200346 244313 250498 197864 154052
6643 154052 138741 141931 153214 168792 187933 215305 237437 275693 328991 383916 468931 543717
6631 543717 560343 645740 893656 1194003 1098527 837785 745632 694335 757714 942587 1420092
6620 1420092 2376878 2688297 1667483 1111500 900373 894796 1036992 1116244 1204680 1501921
6610 1501921 1854260 2381892 3935413 6232304 5679903 3025620 1982365 1493922 1161154
6601 1161154 1013617 1032611 1095114 1006718 888852 936177 1070967 1269061 1512285 1786715
6591 1786715 2097693 2147359 1701794 1309845 1086456 1004643 1040848 1212952 1480253 1791104
6581 1791104 2061429 2129444 1747222 1412294 1341353 1468312 1684191 1640489 1625955 1829920
6571 1829920 2217868 2677546 3044408 3089576 2982238 2974064 2695805 2094122 1678008 1591341
6561 1591341 1685725 1892222 2243754 2519050 2412224 2231846 2252495 2635410 3605411 5237952
6551 5237952 5461298 4083981 3427255 2826634 2742654 2989378 3350597 3854638 4464727 5054549
6541 5054549 4728314 4224396 3924080 3468077 3429584 3918511 4954182 7492841 15099227
6532 15099227 28416444 21339711 11728428 7553020 5683019 4960622 5004248 5756103 7519556
6523 7519556 11025726 15136859 16499141 16188397 17521718 23594808 38489966 74029514
6515 74029514 133210697 202470676 184860773 90123875 49851385 28484904 16825993
6508 16825993 10882646 7914467 6367849 5319100 4435545 3951096 3787852 3730042 3991050
6499 3991050 4655105 5379370 5666437 4657366 4090646 4089434 4409502 4814446 5200302 5094919
6489 5094919 4549872 4473865 4893498 5300245 5781910 6400452 7212214 8788542 10989052
6480 10989052 14080363 18488945 22102399 25425864 33483249 48954568 76564316 141568827
6472 141568827 297191352 468706383 319844365 158534620 89158030 64082416 64430146
6465 64430146 51347048 30974107 20128351 14139729 10312534 8321301 7434486 6695401
6457 6695401 5747944 5084138 4994645 5515723 6344676 6811161 5213811 4072062 3696754
6448 3696754 3766366 4319032 5510681 5174317 3557332 2845787 2695157 2781716 3133591 3795874
6438 3795874 4337186 3756063 2664217 2234019 1951434 1763334 1774978 1820094 1769029 1627134
6428 1627134 1401963 1297404 1298810 1227588 1201390 1305400 1242958 1054496 861542 802006 947183
6417 947183 1078289 1209288 1199541 1102646 1079578 1093231 1097048 1136999 1184901 1198530 1218398 1227371
6405 1227371 1263556 1369341 1624655 1885606 2295379 3032734 4179640 5508706 5384694
6396 5384694 4537951 4685740 5142570 6202696 8257837 11542057 16692929 25770544 45996837
6387 45996837 89735121 158795654 209845483 140317255 67315532 38277364 21572822
6380 21572822 13383551 9179368 7147751 6232094 5617359 5155297 4483060 3554679 2872832
6371 2872832 2528687 2492218 2621537 2824111 2984609 2816174 2332233 2000015 1919611 1911232
6361 1911232 2066925 2051199 1534167 1277832 1254407 1421654 1764264 2117013 2168536 1728358
6351 1728358 1223101 908025 737191 616277 568818 584324 600652 550075 511754 523684 508196
6340 508196 477476 474045 497225 543249 586223 630071 821648 1492780 2577323 2302877 1281055
6329 1281055 844297 624617 552507 586612 577961 539709 552196 626051 816250 1321777 2299047
6318 2299047 2564548 1523366 979000 737934 618603 534388 415692 348856 320491 301247
6308 301247 303572 321518 306869 310245 336977 325584 340176 392759 458895 402354 297517 271686
6296 271686 266583 275292 281699 263102 235328 236238 216730 182737 165685 152198 143459 142674 148838
6283 148838 150140 167150 193382 239636 306866 390190 460053 449658 364708 265395 199875 164785
6271 164785 169203 199534 255487 302942 318648 292258 241166 196466 166829 155268 157751 167870
6259 167870 192792 258538 374475 491815 400252 278330 242432 251858 274701 308601 361581
6248 361581 374656 293195 223606 206833 215270 225772 260951 318785 378521 458418 641899 958532
6236 958532 1211323 865443 438260 266686 162502 113831 98291 98072 73190 59560 51492
6225 51492 52168 44943 36484 30648 33048 37766 50892 52922 53478 59464 45718 40566 45771 50791 59136
6210 59136 59462 61941 62011 65679 85932 105188 123289 140549 149135 153353 140411 125218 99695 80618
6196 80618 69450 75974 65368 64303 66139 72236 78171 68526 68385 72622 83129 110837 151269 218387
6182 218387 347969 561800 956637 1433360 1073301 675709 499710 449355 476769 554294
6172 554294 618826 578752 512639 533514 667806 963253 1589407 2917530 2766051 1496432
6162 1496432 1084048 1054291 1119005 1102432 977964 862193 881428 1021839 1201530 1341527
6152 1341527 1599646 2569597 3390025 2106426 1557360 1407394 1169565 906880 759914
6143 759914 737754 823738 956709 1049345 1046791 1029812 1267050 1783308 1574822 1197932 919385
6132 919385 725069 632900 642095 730075 803763 769077 701473 661983 714561 809007 883759 858154
6120 858154 753359 681249 665204 679826 695518 698206 637393 513326 395391 345545 348010
6109 348010 396661 453535 500564 520044 554509 577533 588204 540569 461843 385730 366316 369827
6097 369827 381042 416040 445235 466839 511078 608452 751909 993872 1429580 2007155 2538103
6086 2538103 3223672 3983085 4153981 4146549 4277505 3904650 3239594 2854729 2567666 2462693
6076 2462693 2663151 2978619 3537300 4190945 4252201 4143190 4127900 3591712 2772521 2182704
6066 2182704 1614238 1086545 750919 544244 421109 347746 308014 292125 284278 248108 197995
6055 197995 169696 149322 136191 118055 113966 112788 109779 107534 102471 108640 117331 142032 165291
6042 165291 172817 161074 140455 130276 126338 140885 158327 187848 194200 180411 173038 175550 182312
6029 182312 187722 195341 203902 224686 253319 310826 407950 530820 614496 551543 490632 468762
6017 468762 469404 498591 554871 638590 756801 926040 1154663 1458676 1842406 2413252 3428832
6006 3428832 5440122 9278198 15133323 21200791 21871284 15352503 9244379 5743630
5998 5743630 3667502 2529525 1949163 1651494 1438736 1241410 1098356 1029736 1019389 1063493
5988 1063493 1151614 1299933 1514714 1805950 2131924 2600734 3455706 5174585 8630090
5979 8630090 14258789 20788182 22744751 16611590 10346983 7143099 5541463 5123217
5971 5123217 5875364 8219240 13091680 20696637 28634762 29043917 19844686 11785327 7277421
5962 7277421 4636451 3205952 2487719 2104230 1805764 1538410 1360060 1265791 1239905 1262133
5952 1262133 1356846 1524806 1786077 2147014 2591998 3244616 4440177 6782533 11244784
5943 11244784 18127777 25439165 26802678 19345654 11648701 7172680 4557564 3069212
5935 3069212 2212497 1739851 1382573 1064748 832052 681214 587241 526473 463008 402476
5925 402476 363443 336835 320621 306642 293073 287015 293882 291333 293715 334471 432030 661904
5913 661904 1260464 2616325 2460772 1165746 605670 369820 249979 186457 150861 126332
5903 126332 109798 98640 114666 151391 199243 173577 116713 89157 71451 57428 46099 40208
5891 40208 26332 10264 8471 18771 30263 40286 66014 75148 61335 44183 42989 38409 39039
5878 39039 41000 27304 28838 30953 31306 33642 35878 38142 40319 48571 59156 63650 72036 99343
5864 99343 132782 168049 190699 215053 234939 214002 178256 152485 148856 149947 164905 192767
5852 192767 267102 421511 754854 1243201 1398908 988353 576263 352228 241150 196791
5842 196791 187992 202043 207215 226153 242886 259591 250220 230338 214644 200532 198527 210623
5830 210623 237435 272307 300754 329516 340915 334521 337612 337782 340049 343560 355785 374144 370264
5817 370264 363305 343792 342264 347452 351147 360439 385206 432661 504713 577584 597792 568108 541030
5804 541030 544442 569513 589451 575659 548062 552641 576459 527557 436749 421718 520074 567337
5792 567337 447952 346254 281210 251262 228135 204710 192849 188803 184537 210052 260591 360459
5780 360459 587240 1043823 1200941 873566 701019 599261 511506 425308 316782 245065
5770 245065 232812 261291 318945 430233 587176 826600 1219001 1200870 741090 460875
5760 460875 357795 319080 279326 227311 196919 185099 189535 215980 256281 311238 411750
5749 411750 542070 507084 373452 313886 291606 290794 289302 287074 287838 313718 354754 412042
5737 412042 486639 571870 643595 709827 811867 964488 1151524 1442132 1872993 2400878
5727 2400878 3117549 4311682 6576981 11260420 20251361 30879213 30144215 19472453
5719 19472453 12044276 8208651 6432444 5935496 6515777 8376721 12588640 20941574
5711 20941574 30691813 29332989 18345860 10619018 6392300 4124029 2981748 2412737
5703 2412737 2052765 1690662 1391211 1204832 1119977 1079370 1090555 1157350 1263608 1452824
5693 1452824 1763125 2146572 2662638 3575889 5330015 8985202 16017844 24313785 23529205
5684 23529205 14941147 9165622 6236953 4896732 4506452 4937443 6353381 9657848
5676 9657848 16364191 24259473 22794693 13707756 7745163 4552782 2853051 2012820
5668 2012820 1590854 1323556 1060382 813040 634861 519348 444049 374201 317077 276013
5658 276013 245557 233174 216185 199031 174233 161072 147276 136561 125143 108201 85418 83578
5646 83578 89069 91208 87900 76429 65025 57467 50198 37654 34185 33672 22900 15383 7639 9861
5632 9861 16084 20680 27178 36590 29358 22512 17304 14593 7870 1723 -539 -5651 -22524 -27047 -29678
5617 -29678 -20452 -14343 -3276 10427 11629 13245 17002 21559 21891 16606 17325 17049 16475 14928 8902
5602 8902 6900 -7275 -21105 -24645 -20493 -17303 -9677 -17244 -16220 -6976 -3459 -6401 -11231 -19329 -12396
5587 -12396 -9001 -2029 4044 20402 42644 72256 99679 99491 72516 45855 24954 14764 28767
5574 28767 29129 27697 33761 56166 84414 87542 57372 21883 -1930 -15911 -21441 -27314 -32280 -27072
5560 -27072 -24183 -7870 15260 85505 182180 108761 33295 463 -9129 -15669 -17444 -14978 -14445 4621
5545 35800 70817 74437 44726 15720 -3376 -17084 -25588 -20529 -19737 -9916 17913 51171 60356
5532 60356 25214 -11878 -35706 -48092 -45867 -48233 -47219 -47477 -45973 -52845 -43424 -40893 -45610 -44382
5518 -44382 -49022 -52190 -42310 -38647 -45167 -46416 -52082 -53250 -47814 -45050 -46603 -44686 -42127 -43755 -44223
5503 -44223 -45993 -45856 -46273 -49058 -40519 -34655 -31629 -24227 -12779 1603 49681 193769 357108 193947
5489 193947 62217 14133 6068 -3309 -6529 -8450 3981 41278 95230 132719 136602 108330 66305
5476 66305 36008 14620 12498 965 3763 13847 15652 25943 50282 76185 119736 163056 181468
5463 181468 166306 119807 74505 40688 18254 15544 17576 20369 16793 24919 31453 53120 82368
5450 82368 123421 177058 207869 204381 200105 258710 368452 410110 356700 224034 120740 73798
5438 73798 56707 60274 63191 67961 93962 122020 154545 228565 347867 479666 591376 609843
5426 609843 528724 397813 270010 176881 128440 104889 92499 72378 60767 57746 68755
5415 68755 104306 178631 302522 424634 430900 316730 185083 93752 47852 26739 33969
5404 33969 37623 41447 38763 43916 50358 50690 51341 62029 55601 52973 53414 85407 142457 258791
5390 258791 406333 374689 248699 237410 233581 198065 152835 119143 117645 129574 134205 130614
5378 130614 120446 110686 114265 132316 133870 145986 167668 172863 174430 183791 201326 224137 270036
5365 270036 375607 597491 884038 1056697 1002652 764392 522718 375508 323254 293146
5355 293146 274217 267299 268865 268739 271229 281734 298189 313811 299444 270142 238551 220118 211045
5342 211045 228099 275971 291524 264706 260688 291496 352335 383883 380308 372535 368374 394909
5330 394909 484564 739783 1198077 1342786 903629 613013 510133 523858 597639 654895
5320 654895 700705 791879 1033331 1577265 2318152 2510113 1949183 1432850 1218128 1150316
5310 1150316 1166276 1238575 1408725 1792179 2572664 3801496 4852105 4958148 4000446 2788727
5300 2788727 2005592 1717006 1651911 1610905 1550630 1553995 1662639 1813871 1865083 1764210 1641651
5289 1641651 1685440 1924335 2281987 2839653 3724925 4664534 5106203 4770359 4018179 3327322
5279 3327322 3012622 3148933 3608088 4175191 4666396 4887270 5062848 5371893 5527541 5295269
5269 5295269 4701757 4116297 3764539 3585235 3557346 3786117 4315069 5116658 6527581 9351696
5259 9351696 13798013 17860468 18702133 15483895 10666451 6843391 4845679 3957399 3574445
5250 3574445 3421488 3453498 3638721 3933271 4410484 5145451 6132661 7337608 8899790
5241 8899790 11080700 14023293 18320183 27134363 49631241 93274665 142919268 165373170
5233 165373170 144738211 96238010 53727351 29273872 18827051 13531971 10310598
5226 10310598 8224242 6809663 5894112 5391169 5176399 5218863 5756230 6470706 6579157
5217 6579157 6269550 6231350 6390870 6603311 6841715 7167720 7690615 8401239 9381565 11128321
5207 11128321 14144056 18364055 22804099 28027153 38100165 63813846 124750311 205279529
5199 205279529 196480311 115015393 65699165 45077810 39538006 42543510 48805477 59638234
5191 59638234 84458711 142929216 265818134 397117138 349501845 209379576 129188094
5184 129188094 87298573 61065197 44779948 34846598 27853636 21931159 16815203 13792462
5176 13792462 12258115 11148254 10204686 9825570 9735413 9590262 9235000 8952185 8817476
5167 8817476 8597863 8192300 7617863 7184170 7074161 7205238 7209258 6681496 5597140 4428658
5157 4428658 3573605 3071265 2791040 2615085 2497276 2398585 2260469 2111613 1999368 1951171
5147 1951171 1964011 1960457 1895229 1776474 1652647 1541944 1467362 1447268 1466942 1457368 1400650
5136 1400650 1444720 1786351 2476825 3415160 4151606 4189602 3549002 2750045 2192765 1862663
5126 1862663 1617573 1376844 1165079 1005438 900439 844577 838683 858021 857407 868521 868512 834702
5114 834702 787934 749315 721019 695033 661547 645255 659642 735005 925237 1196552 1403734
5103 1403734 1373437 1127896 862554 693957 656999 670360 728452 865214 1120471 1482532
5093 1482532 1756579 1738495 1444055 1063245 773156 613713 521066 467295 428603 415790
5083 415790 409020 402726 395613 381993 360452 335278 324889 340843 363991 390900 427589 519443
5071 519443 737992 1126936 1392308 1202001 852482 689560 678682 773007 956361 1277599
5061 1277599 1905619 2900081 4043908 4969817 4835038 3529077 2575547 1996906 1442831
5052 1442831 1043810 810986 666044 573716 503474 466048 476319 531717 707917 1109782
5042 1109782 1456053 1196277 818550 645165 612131 724495 1052502 1385376 1189251 783407
5032 783407 554977 447153 406957 403692 425871 497235 645246 930963 1534246 2396442 2271542
5021 2271542 1473626 1028536 942854 1121485 1671621 2440715 2415854 1656096 1096357 858218
5011 858218 846200 1026737 1259640 1341146 1627527 1821923 1645716 1556030 1468456 1242450
5001 1242450 1109746 1102600 1218551 1508469 2020228 2725252 3287694 3700413 4394014 4740628
4991 4740628 4458163 4226707 3896364 3375018 2987397 2955914 3116519 3411912 3970057 4421843
4981 4421843 4670870 5156497 5604158 5644458 5761079 5641796 5080471 4774933 4573638 4435685
4971 4435685 4502764 4561325 4718080 4776155 4735507 4943359 4756079 4393175 4381318 3954912
4961 3954912 3503684 3499475 3362852 3345635 3551734 3762976 3857986 3781557 3577735 3272995
4951 3272995 2907995 2467981 2068008 1826015 1755906 1699057 1534784 1399364 1406950 1521478
4941 1521478 1531604 1459414 1425217 1235447 998747 838702 713436 663081 709962 766862 695007
4930 695007 549163 458550 437334 456587 459640 413791 351805 294480 249250 223429 202307 198556
4918 198556 203711 203393 196455 177481 174921 174439 180605 185560 196187 199445 203774 215350 217025 214082
4904 214082 220596 224774 219106 227834 230418 244430 265468 270737 253270 251779 249511 250924 252592 257168
4890 257168 267993 276920 291089 304081 318626 343056 371351 409103 452812 491460 523453 554367
4878 554367 583663 596308 618045 649458 682720 695571 705139 715358 734922 781698 821576 842578
4866 842578 848726 857756 875647 918914 978291 1006653 1006423 994692 983197 981540 1006905 1037469 1052923
4853 1052923 1048142 1037896 1060406 1114745 1172719 1217390 1247032 1245139 1228276 1201576 1189377 1188953
4841 1188953 1193515 1222195 1273880 1313713 1290556 1230286 1197763 1208326 1250131 1318787 1370878 1350528
4829 1350528 1276620 1216907 1192856 1207443 1294375 1476407 1868034 2449334 2708414 2386368
4819 2386368 1896921 1596460 1530959 1724963 2214423 2569024 2242975 1667804 1298352 1116013
4809 1116013 1041325 1027542 1090518 1318707 1775858 2106159 1866876 1423933 1171248 1117045
4799 1117045 1249726 1642748 2037322 1798867 1284057 969228 816378 732445 682187 647713
4789 647713 639523 636590 637459 636310 638507 643596 653923 680461 701760 730583 769628 817509 873615
4776 873615 929393 1013686 1109341 1239518 1396980 1586079 1820539 2125534 2511084 2975638
4766 2975638 3438790 3787100 3978132 4115657 4314301 4589763 4793569 4843515 4770908 4726043
4756 4726043 4810229 5039791 5426264 6036685 6965954 7942755 8541526 8720207 8749788 9013106
4746 9013106 9510992 9792331 9644289 9224779 8897677 8850473 9185366 9832646 10256585 10190893
4736 10190893 10165087 10468878 11051523 11484592 11244647 10640893 10155048 9890785 9724454 9484658
4726 9484658 9229114 9126241 9244370 9613337 10322155 11388790 12352760 12716986 12359699
4717 12359699 11760948 11622590 11799409 11611693 10755021 9418372 8237812 7509351 7152891
4708 7152891 7015900 6974561 6921430 6750885 6450653 6173204 5943516 5672864 5209970 4537075
4698 4537075 3823161 3221818 2735180 2344211 2051287 1833556 1678636 1557464 1458657 1392658
4688 1392658 1384263 1432761 1504443 1558227 1511286 1367574 1207129 1084975 1002017 948188 918753
4677 918753 913746 951532 1037205 1195326 1397881 1609171 1713448 1741609 1750383 1668845 1523604
4666 1523604 1355982 1200343 1099978 1077763 1143756 1272533 1355483 1446644 1562149 1743662
4656 1743662 2082992 2472805 2618383 2408567 2090885 1840122 1683329 1528929 1356762 1230735
4646 1230735 1178162 1215962 1317324 1408320 1578302 1841130 2030306 2049933 1953355 1820518
4636 1820518 1658240 1469145 1262393 1079444 932179 843729 806834 820014 852729 931920
4626 931920 1044325 1153678 1239452 1261071 1212493 1096717 982529 897458 852468 849686 888864
4615 888864 909620 888662 873724 884814 894503 910451 934242 966274 961700 930571 894576 888981
4603 888981 902200 953123 1019315 1116975 1224534 1306093 1358164 1410686 1510513 1643796 1831643
4592 1831643 2097473 2321338 2666013 3223150 3818481 4228052 4311995 4182315 3986244 3879223
4582 3879223 3940734 4059843 4194818 4512169 5116654 6082517 7377196 8642695 9452966
4573 9452966 9842010 9548937 8761888 8329114 8275623 8289777 8231748 8148000 8109245 8230260
4563 8230260 8599194 9174616 9808263 10566683 11376082 12226153 13029538 13422500 13302400 12900855
4553 12900855 11983743 10723882 9780821 9231469 8979898 9004273 9235355 9647996 10325003
4544 10325003 11201668 11961514 12309664 12096460 11539162 10899370 10098636 9159026 8437475
4535 8437475 8078504 7980024 8016545 8102719 8150833 8020323 7675455 7290629 7119801 7285826
4525 7285826 7611432 7725552 7391796 6600443 5757406 5138189 4702726 4387280 4178716 4085400
4515 4085400 4113040 4205744 4337673 4403251 4266803 3856807 3362981 2964779 2653620 2408807
4505 2408807 2211551 2069922 1970846 1881647 1799138 1715416 1641483 1607404 1590054 1579493 1568691
4494 1568691 1601007 1689737 1868442 2188985 2772774 4235964 7814019 9892097 6473140
4485 6473140 3896567 2797813 2335656 2040703 1818497 1664196 1557375 1470853 1428387 1422058
4475 1422058 1440816 1490190 1574202 1673903 1761096 1839503 1905394 1960215 1975431 1973278 1947890 1911839
4463 1911839 1893154 1960264 2125701 2350805 2540931 2691178 2865595 3055048 3185774 3193500
4453 3193500 3238325 3320609 3279463 3146854 3077495 3144504 3317928 3558149 3830222 4186643
4443 4186643 4602697 4944535 5114295 5150713 5139610 5080755 5065486 5044862 4882747 4711347
4433 4711347 4705560 4904948 5265655 5682514 6061807 6413061 6570252 6678398 6872776 7100114
4423 7100114 7321083 7521387 7475597 7201712 6951536 6794366 6837826 7168962 7576004 7830262
4413 7830262 8067097 8327688 8580989 8963148 9558749 10196453 10669899 10879951 10879201 10806135
4403 10806135 10848056 11095487 11505280 11850497 12063792 12325433 12714013 13231902 13905957 14828865
4393 14828865 15962835 17061853 18156337 19057988 19679823 20444111 21274739 21991922 22482859
4384 22482859 22569749 22546678 22950184 23842157 25171087 26887066 28812225 30973847 33283957
4375 33283957 35815771 38560074 41212791 43529625 45758685 47681938 49440113 51531507
4367 51531507 54093376 57331572 61448787 66143561 70132025 72309878 74427183 78102844
4359 78102844 81942173 84190729 85716998 87310513 88813382 89854065 90378304 91440454
4351 91440454 92730849 93860979 96292209 100463891 104846616 107679805 108219544 108913398
4343 108913398 110499605 111673548 112094252 111160748 109272601 107859080 107932189 110216911 113313514
4334 113313514 115617110 116750086 114996220 110760795 105711762 101354302 99556823 100506201
4326 100506201 100920619 96988896 88592830 78478462 69019090 61542501 55462205 50223230
4318 50223230 45773274 42740012 39651807 35013512 31156484 28033829 25670266 23928987
4310 23928987 22721415 21854496 20805808 19395207 17830464 16436916 15587322 16267970 18024446
4301 18024446 15024533 12310697 10721342 9753628 9091949 8509986 7938171 7449028 6982162
4292 6982162 6566869 6357321 6271144 6372073 7177207 6323830 4700726 3907126 3473858 3122653
4282 3122653 2787811 2548145 2377898 2232651 2150213 2130372 2064106 1912333 1721774 1540335
4272 1540335 1435366 1359329 1303422 1266020 1248224 1266166 1274151 1200752 1117426 1065755 1046925
4261 1046925 1054555 1056107 1015111 979683 967691 965134 975110 1003663 1084497 1220108 1227461 1116369
4249 1116369 1002305 929653 893756 875907 871770 883685 901100 909729 921999 944523 984109 1047471
4237 1047471 1118680 1162875 1145874 1032158 949535 901029 887761 896504 909323 925751 948536
4226 948536 959764 984500 1026870 1071134 1076940 1084712 1063482 998815 948077 905961 883436 874000
4214 874000 872486 873677 885419 902619 937175 934198 911497 900676 889894 878414 860820 831265
4202 831265 798182 762847 736942 712957 690870 676863 663389 660624 670297 669852 668097 660410 643408
4189 643408 630030 624520 627291 615270 616286 641947 648686 608668 586843 609643 647876 623709
4177 623709 583287 556949 540061 546852 585126 677746 743817 861637 1252757 1880781 1798691
4166 1798691 1309286 1079789 964294 797926 709641 677657 689768 737697 820138 952658
4156 952658 1063732 1283741 2018882 3097630 2718304 1766995 1250378 1002226 908087 932090
4146 932090 1051631 1044890 904943 832268 843785 904349 1018856 1377161 1843089 1621530 1098592
4135 1098592 774450 646456 615921 608472 590279 569396 586536 652981 702981 735524 740114
4124 740114 810804 963556 835851 590830 451833 381264 354169 344844 342923 350544 398360
4113 398360 480105 557225 553095 549775 611351 657443 546384 444389 386827 366634 362186 383491
4101 383491 384839 365506 363559 380198 390674 386512 399707 424951 443153 459525 460087 455406 460460
4088 460460 489408 537252 576849 641772 700802 733938 782468 893445 943022 937894 956492 993917
4076 993917 1040555 1093652 1165785 1303981 1474306 1566150 1659431 1781735 1863833 2076712 2290859
4065 2290859 2174539 2097364 2168888 2336318 2586314 2850063 3161297 3652711 4260862 5068260
4055 5068260 6450866 7896647 8378616 8401311 8637161 9198771 9780058 10031500 10176722
4046 10176722 10509130 11241971 12508629 14556350 17687643 22642357 27533825 27373460 26812696
4037 26812696 29567994 36605979 46448696 55376783 57889020 54779029 51305580 49309175
4029 49309175 48906938 49165808 48687316 49063148 50465542 52675885 57690884 69424877 96467566
4020 96467566 132913220 126430856 88639416 62158798 48513725 41524102 36345307 32138204
4012 32138204 29405181 28103758 28830940 31995687 37577317 45915476 55939356 58636434
4004 58636434 48913956 36760076 30476699 27009701 20313467 14869033 11513799 9364091
3996 9364091 7586931 6210787 5390239 4856859 4350799 4065510 4108041 4595691 5644802
3987 5644802 7012945 6813553 4942248 3466114 2719006 2308924 2003236 1748894 1545927
3978 1545927 1391523 1272265 1186378 1109815 1049386 1002147 986770 943223 874576 795733 716830
3967 716830 677860 665399 630076 590309 554060 521947 498987 496454 495572 498006 484136 450336
3955 450336 414361 380111 355122 350086 348064 333052 323400 306171 303110 288890 287540 280291 279901
3942 279901 279122 276282 263634 271298 275073 274355 264753 253160 244305 235103 229436 225164 220411 225708
3928 225708 225907 230050 234453 235418 234141 237676 236570 227452 215874 209554 211766 206576 217089 221342
3914 221342 235252 250702 273665 291161 284048 274674 298697 343099 406645 451593 443830 417219
3902 417219 383659 366888 349520 350849 349326 349878 363757 377551 414908 491344 660828 857570
3890 857570 786727 566050 419429 350429 312570 279220 256778 234787 221133 222698 240078
3879 240078 275293 344001 421820 435096 359158 283611 246105 226970 192283 160090 148997 134481
3867 134481 115724 108008 96411 93556 92880 92014 95597 104056 109193 111944 101893 82921 68090 67482
3853 67482 71538 60592 55492 56576 62430 65759 68169 67116 73389 65226 53634 49979 48592 47754
3839 47754 52051 50927 54548 51609 47358 43370 42117 44821 44876 40944 44846 37009 35089 34302 34003 31885
3823 31885 36313 40128 37604 31318 30205 37332 34559 32906 33716 35753 34885 35189 31587 29286 30884
3808 30884 33866 33348 32704 29697 28550 23859 24522 28652 29955 26681 24105 33559 25275 19212 18276 18072
3792 18072 23272 23702 27883 25862 24532 21872 25185 27460 27818 17479 11672 16894 19579 26615 26160
3777 26160 22664 21084 13897 21691 16429 9964 9357 11280 19937 14409 13207 18173 22811 23991 19729
3762 19729 15599 20914 20796 13401 9003 11941 11568 9861 7119 8480 9073 1735 8588 15116 9625
3747 9625 12738 11996 13919 7252 7212 8639 15041 9454 10038 8831 3816 7216 9277 10408 6570 10149
3731 10149 13825 14121 14450 13704 16675 13019 11602 9038 8613 8306 9408 10559 14250 12417 3099 -999
3714 5609 12466 9884 13491 7434 7616 9608 10305 2791 6551 4256 3351 10739 10485 9474 7925 -3581
3697 4027 6321 3821 7792 -794 -4970 -222 6823 6088 -1527 8254 9734 6134 1823 6741 9196 880
3680 -1820 4404 -406 -2216 2647 -1059 -4249 139 2697 1249 4483 532 -2866 -6702 -3069 939 -3304
3663 -3379 1237 585 5293 -556 1569 -4285 -4439 -7612 -4113 -4896 -5055 2135 -4053 -585 -1891 -5434
3647 -5434 -789 5353 139 4889 213 -3479 -493 -4448 -2742 -1605 3044 3072 3828 -1276 -11276 -11966 -7152
3630 -7152 -9721 -6972 332 -2391 -8702 -9172 -5488 -4420 -6433 962 -1939 -310 -5225 -6049 -5117 -3550
3614 -3550 -6742 -4563 6402 1245 2691 -2570 -4214 -7842 -5686 -7483 -6541 -3287 -5900 -7296 -5895
3599 -5895 -11076 -5315 -6608 -4759 -4030 -8496 -8775 -8590 -5432 -7176 -8229 -11014 -8411 -12997 -13891 -12127
3583 -12127 -5053 -10317 -2619 -2637 -9512 -13417 -11422 -8692 -12871 -7666 -6798 -6938 -10572 -11231 -17259 -17302
3567 -17302 -11953 -5018 -8155 -13761 -7358 -2052 -5020 -7061 -5350 -3803 -11005 -8053 -7053 -5549 -5831
3552 -5831 -5313 -8725 -11631 -11747 -8580 -8467 -11248 -11130 -9705 -12691 -8701 -12772 -13578 -13019 -10898 -11878 -14946
3535 -14946 -12920 -10195 -9782 -5361 -8931 -16711 -12996 -15995 -13060 -14987 -10462 -17129 -11921 -4985 -1991
3519 -6187 -9948 -11542 -8904 -5379 -4762 -4037 -6997 -7521 -5993 -3374 -7017 -2563 -5711 -7007 -6522 -5103
3503 -5103 -8267 -9999 -9471 -14625 -14134 -13311 -9856 -10383 -13026 -9326 -11176 -11878 -5728 -8608 -12452 -17164
3487 -17164 -12794 -16586 -4987 98 -8224 -11570 -10273 -6572 -5907 -6249 -6191 -8223 -6978 -8488 -6829 -5518
3471 -5518 -6217 -4106 -2524 -6411 -1761 -3386 -6260 -7450 -7272 -9710 -11281 -12582 -16888 -15939 -6008 -2448
3454 -1453 -11801 -11450 -9781 -5123 -7599 -2280 -10925 -7807 -7453 -2731 -6756 -3697 17506 33577 58102
3439 58102 95327 98301 60776 25584 6226 5101 -2045 -631 1716 2143 -3507 -3571 -10753 -9610 -5572
3424 -5572 -4896 -5651 -11116 2040 -2540 -30 4129 -828 -3885 1979 -2012 -6426 -10015 -15098 -12950 -6476
3408 -6476 -2976 -5374 777 8592 14862 14900 13717 27576 38329 47889 55805 60218 72545 95844 132894
3393 132894 178998 254072 401317 559983 620266 564094 429156 308645 194282 133312 90805
3382 90805 62737 44274 38805 31614 25314 28080 21822 17297 13986 6188 22136 33181 32168 22276
3368 22276 9866 7338 13039 11110 12058 14632 9385 20090 25255 24937 10228 10619 13475 14097 26397
3353 26397 25371 23331 18715 24860 25495 33659 34359 48747 47740 52371 48989 51376 55622 54349 48850
3338 48850 51082 63006 88073 106616 133088 160541 195793 232438 286408 361809 471809 715495
3326 715495 1097377 1273521 1385219 1915812 3210052 6370647 14891123 22870282 17551117
3317 17551117 8773426 4630689 2627182 1721866 1373759 1172282 814442 505994 329076
3308 329076 235786 199698 158685 124568 105815 95682 91128 85449 84587 69273 46980 38330 32914
3295 32914 30512 23980 15707 11774 10145 13196 13963 11568 3717 7553 7145 936 5388 3471 1810
3280 1810 2417 -570 -2172 -966 -1797 992 -1142 5034 4635 7119 7440 1866 -7405 -23456 -23704 -14662 -10003
3263 -10003 -14532 -14079 -14207 -15440 -17192 -11393 2620 2458 4628 -777 -3570 -12932 -9338 -6451 -4632 -7765
3247 -7765 -5754 -6616 -18033 -22379 -15635 -16699 -18634 -17142 -19623 -14488 -11918 -11278 -9376 -11559 -16761
3232 -16761 -14353 -11706 -2653 -3196 -14505 -11945 -12699 -18886 -16592 -10226 -19375 -23594 -23922 -19548 -15006
3217 -15006 -19142 -14030 -8002 -13688 -10690 -15230 -22007 -21658 -13212 -15516 -12970 -18596 -14341 -12390 -11933
3202 -11933 -17655 -8033 5895 20096 62658 100156 90391 58403 20760 3752 -3228 -6074 -4814
3189 -4814 -6245 -10481 -15514 -17888 -17705 -17014 -15512 -12686 -16494 -13324 -11361 -5025 -9590 -8662 -17692 -23818
3173 -23818 -16883 -12089 -14839 -15812 -15312 -11085 -6474 -8648 -8575 -12895 -9757 -13583 -10866 -20226 -6313 -6297
3157 -6297 -9979 -8332 -3929 -11937 -11177 -7677 -7905 -12374 -15568 -25569 -26289 -15286 -11240 -9966 -11617
3142 -11617 -2536 -10669 -17228 -11983 -10350 -5914 -2682 -10862 -16029 -17411 -10587 -14528 -14723 -13660 -14569
3127 -14569 -18666 -14130 -17876 -19649 -15160 -22115 -12600 -11260 -10881 -19316 -15221 -9714 -12024 -4358 -2770
3112 -2770 -13362 -13367 -17223 -7939 -11761 -15954 -14853 -15093 -13786 -15099 -19898 -15162 -13210 -12329 -13414 -11064
3096 -11064 -5009 -4756 -9627 -16654 -16846 -13580 -15852 -12975 -10502 -17767 -21269 -17321 -22106 -15527 -11748
3081 -11748 -9106 -16907 -16210 -14434 -11097 -15592 -16726 -12809 -14892 -12530 -10205 -5558 851 -3276 -4127
3066 -4127 -12377 -12260 -10966 -13397 -18191 -19386 -15876 -12916 -10668 -13579 -14106 -9130 -9266 -8810 -6887 -15368
3050 -15368 -14284 -6098 -6191 -10158 -15591 -16778 -14895 -13549 -14171 -20251 -12449 -14572 -10582 -16242 -19902
3035 -19902 -14438 -11771 -11348 -10398 -10298 -11965 -15031 -16417 -14467 -20297 -13467 -20325 -14430 -13383 -11465
3020 -11465 -13519 -15737 -9503 -7839 -13097 -7667 -10853 -11170 -12363 -13969 -10772 -11152 -8902 -8295 -11739
3005 -11739 -5367 -10422 -10020 -3673 -8117 -9907 -12708 -12888 -4594 -9009 -13479 -12077 -8287 -3008 -3178
2990 -3178 -5986 -9871 -16237 -18123 -11213 -12575 -10296 -5378 -2902 -14035 -13383 -12965 -10690 -12686 -10798
2975 -10798 -13966 -15385 -17808 -13266 -12932 -12132 -16215 -13521 -11764 -15863 -9648 -12491 -14299 -7052 -9727
2960 -9727 -9767 -9335 -9046 -13360 -9671 -15831 -11606 -8922 -9217 -14631 -8840 -2397 -1480 3543 -6545 -13407
2944 -13407 -6712 -8146 -11656 -18302 -17873 -15602 -12284 -12045 -5111 -9905 -11832 -7372 -6974 -8549 -8938 -14243
2928 -14243 -12367 -14087 -10419 -13109 -15235 -10482 -3958 -9860 -15654 -10785 -11511 -19627 -13307 -9547 -12339
2913 -12339 -10541 -5303 -11568 -9866 -13972 -17064 -17480 -10081 -19977 -18675 -15388 -14615 -10645 -9690 -11857
2898 -11857 -11211 -6578 -12001 -8345 -16810 -12800 -13397 -10535 -12389 -15201 -10918 -14704 -10747 -7145 -11904
2883 -11904 -11231 -9039 -14363 -13024 -7782 -3011 -6236 -6800 -5161 -7142 -1621 -2360 -7805 -582 -5414 -10330
2867 -10330 -16751 -17730 -10627 -9479 -20780 -16821 -13244 -7049 -11751 -10769 -11858 -9356 -14463 -12383 -8612
2852 -8612 -7881 -12317 -13495 -7459 -7422 -13156 -4847 -7947 -8769 -8208 -9996 -13925 -14712 -11311 -9507 -12708
2836 -12708 -11027 -9921 -12710 -5955 -9426 -6594 -8897 -13198 -14002 -12307 -12481 -15835 -17948 -17202 -15425
2821 -15425 -18001 -14506 -19552 -16381 -17075 -17680 -14659 -8233 -7662 -5427 -8218 -14793 -21973 -19987 -20757 -14827
2805 -14827 -9114 -5413 -7735 -15627 -18401 -18622 -11161 -12868 -18260 -15007 -6312 -8494 -12471 -18239 -23031
2790 -23031 -15108 -5586 -8032 -10555 -8692 -7477 -3747 -1338 -4361 -6214 -5821 -8513 -9007 -6599 -4501
2775 -4501 -10530 -3838 -2423 -629 -4360 -4302 -3771 -6818 -3804 -10023 -10975 -6238 -2042 -3973 1476 -4748
2758 -8981 -6519 -6295 -5907 -9007 -9962 -11929 -13498 -9979 -8430 -4746 -6607 -5526 -6195 -6630 -4957 -6838
2742 -6838 -1626 -722 -377 -5552 -9163 -6977 -4858 -8184 -5227 -7068 -3888 -9727 -7692 -5295 -2692
2727 -2692 -6773 -6610 -6562 -11751 -5900 -8593 -11667 -7498 -1082 -3737 -2603 -3654 -5211 1894 -1127 -6985
2711 -6985 -5429 -1845 -6408 -3344 -4798 -7595 -8671 -2662 -7542 -11292 -14440 -10573 -4479 -12025 -9252
2696 -9252 -6356 -5162 -13700 -14925 -4662 -9901 -7033 -7688 -5815 -3590 -7067 -10022 -5883 -8327 -3802
2680 -10537 -9374 -2402 -5504 -5391 -10346 -7282 -5735 -8495 -6706 -4976 -9736 -8105 -6029 -6120 -6243 -9194
2664 -9194 -8796 -11807 -6852 -6355 -7715 -10179 -11871 -3348 -6918 -8974 -10592 -6610 -6783 -5329 -7896 -6367
2648 -6367 -5828 -7606 -3732 -2088 122 -3041 -5131 -3843 -2183 -5393 -7768 -8334 -5676 -7131 -9612 -8973
2632 -8973 -4977 -11652 -10277 -6426 -8421 710 -4141 -9521 -5146 -10109 -5748 -3401 -3768 -5583 -8032
2617 -8032 -10918 -14747 -12741 -10400 -6230 -13773 -8424 -5318 -3631 -2879 -6825 -5140 -1381 -4333 -2640
2602 -2640 -474 -7907 -5658 -854 -3684 -6721 -9366 -8352 -9208 -7134 337 -5171 -5831 -1043 -3167 -504
2585 1513 -373 -5994 -5788 -11598 -8980 9 -1161 1109 -2567 -4900 -10350 -10058 -8098 -11225 -9164 -8726 -7871
2568 -7871 -3583 -4694 -5711 -10918 -9757 -5293 -826 -6752 -8671 -9450 -6709 -7218 -2459 -3224 -10030 -9333
2552 -9333 2552 -3744 -6705 -8226 -631 -8567 -7625 -5195 -9452 -5117 -2180 -2002 -2329 -5317 -3920 550
2535 -710 -7138 -9140 -11921 -2872 -1086 -1523 -2440 1718 9868 6025 1655 -5688 -4303 -2725 -235 -5273
2519 -5273 -10198 -9716 -4572 -5784 -5565 -6409 2608 -822 -3738 -4334 -5098 -4177 -7252 -5746 -688 4182 3750
2502 3750 8233 -5314 -3487 -8239 -6787 -11650 -7507 -2902 -3086 2873 2690 409 -5630 1018 6799 -980
2485 -7003 -10339 -4795 -4160 2220 -4756 -815 -1774 -7291 -8501 -8467 -2597 -2013 -4519 -7727 -10421 -9480 -7763
2468 -7763 -2932 -1010 -3301 -8066 -9678 -4587 -9292 -7444 -3036 -4271 -9672 -7958 -7159 -522 -5537
2453 -5537 -389 -2894 -3230 -3462 -1822 1620 -3776 -4765 -4711 701 -6239 -9757 -1113 20 -5332 -9566 -10310
2436 -10310 -5690 -11444 -3565 -2652 -4954 -3209 536 -2289 -1207 -4212 -5761 -2826 -7033 -15131 -10704
2421 -10704 -8068 -4724 6153 502 -4729 -7388 -4998 -4525 -475 3145 1754 -737 -4275 1745 527 2871
2405 2871 4403 4331 4713 3069 -2906 968 -6059 -5202 138 3271 -3080 360 -1531 -9292 -3485 -939 -985
2388 -985 -6031 2914 -7335 -4968 1396 1709 -781 -3048 -1774 -3920 -1510 -4317 -5756 -4560 3545 6655
2372 6655 2025 -1232 -1676 -2849 -3807 -1486 962 -618 -616 -41 905 -321 6351 -2231 -3128 -2813 -5137 -3950
2354 -3950 -48 -668 -3618 -153 1096 -1778 -1602 -4405 -3581 3217 3171 -10710 -3226 -6198 -13539 -4925 -970
2336 2384 601 2058 -6059 -8708 -2344 -521 2224 -750 143 -4155 -2897 -10888 -9267 -829 -679 -2725
2320 -2725 4233 2512 5103 -4078 3939 4418 1454 1370 753 973 -2092 1350 -1518 238 5411 -1367
2303 -1835 5293 -5084 -4160 5446 1705 -160 4594 1977 -3398 -1940 -4220 -6402 -8951 -939 2522 -5513
2286 -3550 -611 210 343 -47 4260 -136 4055 6059 2345 -3588 -6911 -6205 -7439 -7949 808 778 -4243 -1144
2267 2390 -917 -1784 9659 8160 11452 12113 13340 8212 5863 1645 4428 673 2330 4322 -1777 -14924
2251 -14924 -9905 1743 2126 1335 6390 1099 3190 857 -3876 -2458 -887 -6187 -11215 -12944 -8473 -5789
2235 -5789 -6689 -6611 -4815 -3187 1265 3340 4580 4988 9456 3540 445 2268 5488 2227 -3525 -1329
2218 -4695 2186 -4566 1696 4198 -3264 516 2852 6058 7963 4927 2300 -3722 -1747 -4795 -1183
2202 -476 818 4666 6412 3402 5468 2921 -5233 -7584 -2364 -660 -3954 -2543 3911 569 1503 4313
2186 4313 6268 1094 7 4458 1997 -2500 -4160 133 2203 4961 -162 -777 -947 -4320 1118 4446 6740
2169 6740 -619 -4835 -2115 1685 1586 5624 -5268 -3026 -1744 -5112 -10285 -12287 -5802 -4962 -4438 -3292
2153 -3292 -2186 -1854 476 4445 2426 1731 613 -166 -1446 -2368 3640 8540 1613 4594 5667 8608
2137 8608 5251 5455 1244 4960 727 -1229 6789 1852 -1356 6293 5511 -3372 -10747 -208 5481 5562
2121 5562 2270 -53 -655 2256 7605 3481 7053 6445 2179 3086 3087 -837 9822 7794 5054 -5194 5528
2103 5968 5383 1462 3765 4046 8064 6748 7188 1017 489 3844 122 -1952 1387 -53 -6673 -3129 -1586
2086 -1586 -1677 2880 11468 15194 18403 17305 17881 10005 5764 4750 3941 7506 6737 7643 3863 4573 9669
2069 9669 5124 7883 7008 5990 -622 2958 5222 4956 686 -4330 -1698 1497 6208 16729 8652 4393
2053 4393 2283 4813 5702 116 6659 6389 7126 9907 9328 4740 1904 3745 2305 206 2907 1664
2037 1664 4109 8539 12064 9584 6997 2644 2952 -1072 -2248 1159 4555 2223 4744 2822 934
2021 4063 4312 -3143 -1127 499 3842 3039 5733 -2122 5514 6281 5021 6319 5493 5898 6367 878 4147
2004 4147 8275 5319 -1577 3386 4992 4274 4821 5171 9026 12673 2049 3790 5286 9255 8031 13215
1988 13215 5925 8871 10321 11638 4122 -555 3554 916 2367 425 4099 3727 7086 2035 5145 9224
1972 9224 7503 10122 10229 12807 8203 5750 11676 11062 10392 7287 3208 4849 2145 1000 8248 8175
1956 8175 3985 -738 1396 6386 10327 10926 13213 -2038 3741 3546 -5825 3500 5104 4242 7618 9245
1940 9245 9827 8262 6258 12961 5438 3816 3668 7962 7914 6773 5871 6926 301 1369 3245 2299 7189
1923 7189 1401 -291 2409 1925 -1598 6645 6436 5661 7044 2523 600 7256 6903 4209 3225 2580 665
1905 2226 6787 9923 6509 1200 2827 6877 9749 6838 7663 996 3929 5520 9514 9222 8715 9570
1889 9570 7319 6267 3885 4327 4076 8087 7172 7378 5576 10118 21437 11016 10463 6707 5635 460
1872 5752 2384 7596 8976 2223 4189 2314 7866 7744 6692 431 -1745 4214 12651 8264 6480
1857 6480 1764 9831 2425 4349 9458 4659 -57 1480 3573 5047 5497 10093 9384 4654 8273 9788
1841 9788 12188 10520 1868 -2304 335 7751 10009 12428 11096 6079 9972 6916 7973 8277 6618
1826 6618 11686 11048 3790 2746 644 1323 1514 3376 3615 4498 1924 4410 3462 2292 -1184 1525 -1321
1808 7968 11873 11934 11951 9744 8657 9342 3403 10559 17053 17296 17832 8166 9874 12612 11705 5069 3218
1791 3218 7223 14346 12333 13009 13049 11812 10842 11607 7939 7504 8437 7898 14417 13630 9550 9340 4840
1774 4840 7387 8959 8982 11730 8892 9740 4958 5380 14408 7192 1467 10337 13052 14926 15585 10345
1758 10345 9121 7760 8599 9744 6766 10534 6402 9631 8612 6982 11990 8370 13393 15750 9899
1743 9899 4414 5695 7777 10278 8023 3885 9800 13913 9105 4974 846 8439 8596 11020 9278
1728 9278 8004 8244 8659 10257 6210 13497 3410 1685 6084 3422 6583 4253 5019 10723 10615 8899
1712 8899 10910 11916 7053 1024 11739 9919 10919 10162 8817 6463 7468 12163 13391 10457 10765
1697 10765 16001 11321 10484 9310 8050 9335 12893 14492 12869 12107 9252 4700 -454 3496 13437
1682 13437 8779 9356 6533 4011 9510 11080 11720 8651 2374 920 10050 11296 9987 12088 17957
1667 17957 13694 12971 13755 7360 4142 8648 10170 3193 8322 4565 5592 8441 9692 10192 2922
1651 2493 10681 9307 2957 3927 9359 5662 3452 6800 8872 -340 2309 12264 18284 11637 4307
1635 9055 10589 7999 5815 -773 4629 -154 9 2531 2023 3370 4907 12973 11449 6840 5829 10177
1619 10177 13082 7999 7639 4004 2713 2187 878 3675 14266 19770 15094 13312 14070 11153 7762
1604 7762 6587 8518 8450 5520 -1251 4739 12849 11358 1423 -2035 5355 6972 10604 10136 14295 9839
1588 9839 14333 10773 5976 9346 7453 10965 18085 8782 7166 7992 7427 10366 7856 9718 4312
1572 7627 3637 8847 14772 7663 1974 5336 9898 7241 6064 5106 4325 8160 7665 9800 9802 11042
1556 11042 10511 12729 14546 7315 8958 10913 12758 10474 11403 6614 8154 9825 7691 6923 7252 7306
1540 7306 3842 7830 4913 7464 12348 10840 8261 8078 5213 5537 12348 11777 13814 11179 7117 10264
1524 10264 12589 11283 3275 260 7985 15771 12798 9968 2898 5680 4348 10084 11165 96 2519
1509 2519 28 5301 7029 702 8252 13518 6546 12114 15249 5238 3311 5209 4363 7162 5908 3396
1493 3396 5612 7281 7605 7433 7460 5597 6842 6780 6109 10788 12413 16339 9491 6728 4881 4979 3581
1476 3581 7410 3572 7657 10143 8307 3534 2555 11546 9792 10317 4629 12046 10665 7562 15151
1461 15151 12853 7853 5215 6445 9884 11512 16231 12510 5870 10806 1529 1246 9949 13997 12359
1446 12359 7665 7120 10978 12920 11367 10893 6040 2769 10320 10123 3362 1064 1516 7865 12188 15501
1430 15501 13666 16812 19563 15580 13109 11401 12835 16904 16192 18033 12078 8243 7516 15202 14400
1415 14400 13374 13471 18766 10228 7752 9985 10626 8639 6356 9517 7461 7882 17070 13517 6758 2605
1398 7344 7236 11875 9370 6265 4421 6785 9906 11710 5402 12216 15171 12433 7396 9870 7159
1383 7159 7453 9642 11195 12284 9674 2826 5338 8477 9962 9668 8719 6755 7438 12690 9779 5450
1367 5450 9089 11546 8052 2547 988 4348 7438 7389 10380 5009 10553 16054 10560 5115 5268 6798
1351 6798 296 2673 1511 2421 1884 4450 6161 6091 4151 -2070 3392 10735 7413 793 8583 6293
1335 6293 7851 2641 6344 -738 3893 6235 6339 7120 6833 15197 12882 6031 6945 4217 1929 1807
1319 1807 4525 12241 7779 10327 6834 5868 12004 11167 5677 7454 3772 5562 1099 2263 5018
1304 5018 2916 -33 -9116 -9307 -1760 4176 7385 16704 13955 13246 10737 9929 2348 10898 17720 17750 12653
1287 12653 12157 14518 12286 8722 7027 8492 16395 12089 14307 6051 3588 4943 7175 4034 10242
1272 10242 5811 7503 14035 18822 13398 14651 14105 15733 11466 5485 4451 6537 5197 7903 3720
1256 11484 15103 7052 8699 11797 12100 8875 10398 7821 5453 5044 8795 12623 4210 9184 10518
1241 10518 11119 8240 12384 12879 14757 12532 14564 11003 9358 11931 8823 11705 8650 6136 4094
1226 4094 6532 10940 12022 16466 8544 5159 7237 9876 8200 4981 5433 5448 7995 10411 4813 8604
1210 8604 11791 9817 14062 15124 13062 11073 3941 7989 6434 -1518 -3079 -105 1784 -940 -7593
1195 -7593 -3809 585 5 -538 1813 5331 1760 3849 3411 -48 -7935 7632 14546 7860 4931 3291 5201
1178 5201 6010 8563 2619 4443 7627 7561 11698 5512 6532 8542 7191 12686 18970 19602 8497 8233
1162 8233 3270 12592 4734 3052 3223 7755 9228 7375 4756 2900 5343 3066 6443 7342 348 6347
1146 6347 10045 10004 13164 10377 6399 10746 15173 13655 6935 3743 8224 9949 7232 3535 8732
1131 8732 11439 4010 -1462 4627 15416 15714 11868 11068 1417 3572 4378 6747 6360 6093 9668 14189
1115 14189 4063 8447 5877 4010 10510 9500 8544 6310 7226 2824 6703 1487 2983 -3890 6012
1099 499 -3270 2969 2275 3136 -1447 -6176 2273 5629 3287 7244 9964 13186 6492 3829 15887
1084 15887 15700 5879 1857 5603 9449 8145 6685 6513 3057 1260 5266 6703 2420 6435 7871
1069 7871 6826 9095 14389 13172 6794 2546 6449 3361 3077 8459 14107 12005 17304 15532 11852
1054 11852 3306 5574 8257 6922 10384 8274 9691 10472 2891 9999 5751 2129 4956 -578 3250
1038 8982 2359 -32 4961 5175 8370 8215 8803 7058 5249 1351 -3317 -1989 6309 5010 8090 5093
1022 5093 6956 4655 -184 -5548 -2504 6760 1728 -1994 2173 -7546 -6116 -4092 2253 2725 4808
1007 4808 9132 8206 3866 -4194 1134 4724 1132 -188 1187 1337 1976 1643 6072 8606 4661 -1407
990 5635 5941 3094 -2487 -6779 2302 -3841 7055 11583 8560 5751 4165 10467 10697 6951 4651 316
973 -3012 -1952 3981 4964 1747 225 442 942 570 4054 1327 -1908 716 2875 2065 -377 2563 5239
956 5239 5348 9070 3227 -3198 -4179 3221 1099 5106 5255 700 4825 5909 11534 4556 2852 8885
940 8885 3275 -8577 -12383 -4846 1323 -289 -2877 -2367 -2359 6992 7431 -1454 -4191 1141 4094 5204 -1156
922 2167 1000 -3498 1477 -2630 -4999 253 185 445 -370 9909 8224 -1571 4656 5157 5234 4710 9374
905 9374 4655 3521 7797 11589 7049 2833 -6444 -2008 -1648 -1695 571 7609 4130 1935 -1115 337
888 -2317 -3103 -4163 -4996 -901 2513 3773 2910 -332 -2222 2637 3692 5886 11189 7348 5249 2361
871 -1038 2425 1108 4062 493 4195 5224 963 790 -2017 -7641 -1220 1500 6783 6209 1397 -3571
854 1104 -472 1954 -445 -4668 3937 6837 320 -2942 -4628 62 3964 3223 -1003 -1128 -2887 8303 4709
837 4709 855 -8124 -88 -5590 -4207 5956 3202 1991 114 152 -170 -5271 -383 -3537 -4405 -2410 -906 -5490
819 -5490 -7129 1941 5870 2326 2879 3569 3727 -171 -5206 -5023 -4630 -9282 -9096 1173 1670 1109 -1999
801 -243 2051 -1491 -2518 -4185 -5195 2257 2385 1500 4048 -1617 -6126 -7970 -4758 -4083 -206 -3974
785 -3974 -4630 -5181 -6489 -3823 -464 -5558 -1542 -4349 2525 1609 2020 2069 4787 5351 -713 -10135 -7610
768 -7610 3043 2973 -1955 -1900 -6323 -5911 -2208 781 -192 -5444 -3031 -2024 -6319 -7667 -7160 -9482 -7356
751 -7356 -5302 -14205 -4285 -2399 -6444 -7878 -4510 -4831 -5423 1148 -7344 -6462 -10221 -12350 -6438 3259
734 -5294 734 -3013 -4394 -6096 1207 -405 1307 -217 -1639 -7002 -7668 -3471 -2514 -450 1878 -2895 -4075
717 -4075 -9424 -5843 -5607 -4446 -5685 -10169 -4824 -1607 -3217 -7318 2262 27 -3264 -588 -484 -796 -8741
700 -8741 -10165 -7203 -9377 -16332 -14906 -4382 339 -4098 -2227 9219 1520 -5464 -3768 -6495 -864 -2136
684 -2136 -10132 -6448 -1899 -1481 -1648 843 4636 -2090 -5175 -2864 -5882 -6747 -1033 487 -8957 -4206
667 -4631 -13305 -5388 -10214 -249 -466 -4015 -3106 -7509 -3261 -6390 -5423 -5631 -7926 -4740 -8591 -10404
651 -10404 -12602 -10096 -5264 -4757 -36 -4608 -1774 5668 -1628 -2634 -2701 -8979 -9074 -5430 240 -3862 -4696
634 -4696 -1900 -2420 -3112 -11372 -8363 -2517 -2977 -2356 -3618 -6903 -5223 -2659 -3766 -1158 -4681 -3552
618 -3552 -4925 -7317 -9328 -4444 -1080 -1519 -4873 -10807 -15838 -12307 -8528 -2871 -9264 -7418 -4680
603 -4680 -2724 -3711 -12948 -7281 -11347 -5751 -5668 -3690 -8206 -8849 -7950 -6411 -5124 -11018 -8840 -8097 -5475
586 -5475 -8941 -14393 -14286 -14975 -7754 -2838 -2099 -3023 -4049 -10565 -4826 -11137 -5772 -955 -7499 -12422
570 -12422 -12376 -17210 -15447 -14448 -13072 -18172 -12273 -12871 -16044 -14756 -12395 -10326 -11940 -15774 -12060 -8207
554 -8207 -4626 -12515 -12941 -13878 -11360 -10410 -10362 -6854 -5612 -10144 -9857 -12849 -4393 -4203 -13684 -8844 -9732
537 -9732 -8912 -9909 -9536 -6382 -7273 -5220 705 -2573 -7315 -13278 -10981 -9488 -2561 -10058 -14665 -16434
521 -16434 -13467 -11300 -16141 -12096 -7239 -8664 -14585 -16413 -10898 -16831 -11216 -10930 -12386 -18977 -14662
506 -14662 -14285 -16142 -17717 -12114 -12132 -9597 -8626 -17084 -15307 -12119 -12199 -15107 -13341 -22382 -21034 -13845
490 -13845 -16091 -10031 -12214 -15316 -11656 -14217 -13637 -10484 -10498 -18494 -15588 -12300 -15143 -10851 -16481 -20784
474 -20784 -17874 -17989 -16414 -20915 -12493 -4374 -8469 -14511 -10777 -12391 -9701 -6202 -9324 -14182 -8728
459 -8728 -14324 -17882 -13038 -11164 -12239 -13870 -19847 -14276 -13207 -16746 -20447 -19596 -12421 -14018 -14312 -15861
443 -15861 -18205 -18581 -20264 -17622 -15576 -15623 -12060 -14672 -14788 -14227 -12685 -16440 -14573 -12496 -15331 -10165
427 -10165 -14575 -15127 -14355 -16694 -13807 -9866 -17035 -14792 -17084 -18855 -21018 -17554 -9006 -16547 -14514
412 -14514 -21270 -16334 -18922 -16288 -19072 -21545 -16860 -13926 -16159 -15748 -13133 -12232 -21608 -18220 -19810
397 -19810 -16721 -8231 -13221 -13425 -13928 -11070 -20471 -18108 -17085 -17859 -20435 -17596 -13924 -14281 -11256 -12056
381 -12056 -19532 -16192 -13344 -18165 -16739 -19485 -23201 -21055 -15871 -16129 -19499 -20188 -22796 -24257 -18696
366 -18696 -15695 -13972 -14850 -16082 -16972 -19056 -21053 -13267 -20203 -19059 -25288 -21148 -18019 -20778 -16307
351 -16307 -18818 -19499 -20702 -18669 -14306 -13126 -19784 -17565 -20599 -25158 -24085 -16230 -15003 -15571 -18219
336 -18219 -18076 -21793 -22186 -22348 -21279 -22712 -23833 -20814 -21780 -16942 -26474 -29774 -26782 -23454 -21343 -17124
320 -17124 -18086 -18013 -19775 -17003 -20804 -23264 -28805 -27912 -20922 -27329 -16631 -15433 -22512 -16318 -21143 -21392
304 -21392 -15689 -13634 -14894 -22759 -21463 -18681 -15811 -21743 -27689 -26953 -19391 -17243 -18219 -21946 -19761
289 -19761 -17610 -23478 -18478 -18963 -18470 -20460 -20742 -15710 -11958 -16662 -18859 -17295 -13205 -11437 -14264 -20745
273 -20745 -25643 -12953 -13551 -16343 -19447 -19251 -17186 -20157 -25755 -20880 -27176 -26231 -24233 -21716 -21162 -20614
257 -20614 -19826 -19262 -24647 -19455 -26150 -30821 -26488 -28170 -25864 -23925 -20048 -18376 -20285 -19119 -16827
242 -16827 -16686 -17613 -23270 -28408 -25836 -31564 -23507 -28780 -37441 -28864 -23234 -17579 -14505 -23995 -29296
227 -29296 -24096 -18560 -17856 -20762 -18629 -19720 -16908 -18075 -19926 -20566 -16882 -19668 -23978 -27337 -28607
212 -28607 -29236 -29563 -31712 -34326 -32717 -21052 -26039 -35771 -31767 -26697 -27512 -31173 -24765 -22530 -21496
197 -21496 -24386 -22440 -16180 -25968 -25876 -22986 -24179 -29250 -30849 -25624 -24688 -24606 -23163 -27850 -24340 -25548
181 -25548 -27142 -28560 -30651 -34732 -32583 -28485 -25494 -23172 -23068 -21570 -22682 -28420 -25931 -27724 -29288
166 -29288 -25903 -28845 -28955 -29404 -28223 -25731 -20505 -20097 -25428 -28121 -26926 -21349 -19140 -21653 -19223 -19244
150 -19244 -22891 -24075 -19483 -20109 -23545 -22244 -24787 -24000 -20499 -28632 -24098 -26271 -31100 -32791 -34752
135 -34752 -28746 -26689 -27729 -30210 -25061 -26118 -25921 -22456 -16743 -19459 -28126 -26171 -26632 -30715 -27767
120 -27767 -27063 -26870 -28623 -30652 -32923 -32143 -28442 -25483 -26586 -28605 -26224 -27710 -29818 -31556 -27242 -27639
104 -27639 -27703 -29072 -29782 -29570 -30927 -28142 -26537 -28597 -29089 -27558 -31110 -33331 -27058 -25714 -30768 -25259
88 -25259 -25973 -31982 -31210 -27545 -30396 -35108 -36080 -30585 -32678 -31020 -30463 -27537 -33350 -31356 -34123 -37336
72 -37336 -31759 -35018 -36636 -32734 -29044 -32871 -29097 -27265 -27295 -28527 -26259 -25262 -24535 -27075 -27373 -24622
56 -24622 -25181 -27657 -30849 -26330 -30408 -26797 -29973 -30557 -32777 -28796 -33823 -32736 -31245 -29141 -29766 -31038
40 -31038 -35693 -31144 -29241 -20893 -25954 -26788 -33265 -27122 -25753 -30811 -28773 -25289 -26660 -29040 -30928
25 -30928 -29111 -27452 -29586 -31078 -35558 -33779 -26481 -28631 -29329 -31068 -31585 -28886 -29881 -31994 -36479 -30631
9 -30631 -31664 -33050 -33691 -32219 -33388 -37058 -39545 -36339 -37219
0 -37219
$$ Imaginary data points
##PAGE= N=2
##DATA TABLE= (X++(I..I)), XYDATA
16383 -316669 -309915 -297771 -291652 -284160 -275675 -259863 -251911 -239236 -232944 -228525 -226750 -217448 -206330
16370 -206330 -195381 -192150 -186777 -174671 -166741 -160961 -156265 -143397 -130773 -118728 -110439 -105708 -102440
16357 -102440 -95212 -83632 -78170 -68654 -59742 -48826 -43865 -37203 -28042 -18820 -10871 -4167 3083 7847
16343 7847 20806 29974 39144 47800 54083 58946 62619 70686 79460 85545 94466 95184 108185 121813
16329 121813 131225 138470 145160 151619 156918 167193 178645 185212 188524 195876 205120 209211 211314 223416
16315 223416 231971 239418 243436 252955 260681 269431 272288 277245 288749 296760 305018 310208 315638 322101
16301 322101 332703 337360 343974 347152 357657 359014 366376 374693 390446 395096 402354 401600 408311 413646
16287 413646 417980 427874 434439 437471 451651 455507 462629 465296 469111 477687 486973 491546 498002 505905
16273 505905 511286 513906 515422 526235 533868 539479 546278 548222 557350 564535 569648 574076 578524 579859
16259 579859 587070 590084 598043 608487 613293 621170 621409 621214 624693 634898 639855 641330 650323 653731
16245 653731 653625 645199 657763 665241 664918 669930 680494 693015 697992 697889 700504 705021 704944 713327 717487
16230 717487 718903 720429 729216 737459 738715 742275 748443 752442 755338 760946 761856 761744 772495 771584 773729
16215 773729 776142 786389 790336 792843 796625 800147 798867 800894 809249 807311 807503 815746 818392 815964
16201 815964 827008 836406 841342 844732 846036 840289 841606 844891 850054 852384 854530 860694 867517 873260
16187 873260 878494 876300 880931 878096 876344 878109 885667 891770 898795 895863 892853 889956 891670 895682
16173 895682 907665 915085 914613 915033 914689 914976 916513 923487 930419 927669 926154 929868 935327 936880 937276
16158 937276 941052 942940 949411 956281 950629 946666 943266 948149 950141 949060 954216 961612 964706 960497
16144 960497 961759 968123 965025 968914 964402 966991 966221 968733 965147 972746 976572 971119 972250 973665
16130 973665 978204 978562 982372 985912 981059 977502 984387 987674 992873 987257 987848 997108 997586 994779 993657
16115 993657 994259 996616 994246 993384 997991 999729 1005045 1002030 1002016 1000396 1004130 1003449 999378 1001661 1001972 1004379
16099 1004379 1003857 1008468 1006502 1010671 1010775 1005963 1005032 1007073 1011088 1016181 1013354 1018799 1016361 1019890 1019237
16084 1019237 1015781 1019417 1018821 1019998 1022783 1019856 1013818 1016342 1012508 1014408 1016127 1023556 1028554 1020858
16070 1020858 1019206 1016555 1023047 1028784 1025787 1025083 1031693 1029765 1029335 1032552 1036645 1028110 1028924 1036456 1033005
16055 1033005 1041141 1039291 1039298 1032738 1031325 1026304 1028747 1027082 1020716 1023639 1025988 1028491 1030001 1038272 1040824
16040 1040824 1040226 1033334 1039873 1043016 1036707 1027687 1030169 1029954 1024671 1028451 1031218 1029297 1032191 1031625 1030272
16025 1030272 1028305 1031812 1041441 1046266 1048724 1042359 1038567 1032878 1032118 1030983 1041559 1048651 1046293 1039794
16011 1039794 1034414 1039334 1043365 1044679 1039759 1046068 1042452 1047262 1042223 1047024 1037592 1038926 1037490 1039095
15997 1039095 1037757 1043856 1044690 1042364 1044750 1045906 1047388 1047697 1043791 1042782 1036659 1034488 1040694 1046663
15983 1046663 1042384 1033051 1042736 1034682 1037700 1035071 1040858 1048948 1047816 1047326 1047605 1045755 1050536 1048541
15969 1048541 1048116 1045182 1050726 1049239 1048925 1048883 1050657 1052114 1046728 1043625 1048633 1044652 1048648 1051096 1052989
15954 1052989 1043621 1044738 1048923 1043621 1042816 1048186 1049819 1051125 1049868 1052869 1050614 1044074 1046853 1050902
15940 1050902 1048210 1051834 1060784 1053269 1049219 1045714 1040984 1048338 1050441 1048998 1051193 1052423 1048791 1044523
15926 1044523 1043792 1043918 1046489 1044698 1050281 1050590 1044703 1048260 1055866 1058210 1050980 1050045 1058675 1055614 1055735
15911 1055735 1051535 1052001 1058227 1054881 1055669 1059835 1060201 1056004 1055087 1048349 1051162 1057972 1057373 1062791 1063070
15896 1063070 1054764 1050724 1049980 1051918 1052759 1056584 1057131 1055212 1057204 1058209 1060150 1054798 1053548 1053288 1053451
15881 1053451 1055594 1056299 1060025 1051572 1059442 1064480 1059084 1050999 1052103 1059072 1061069 1058238 1051818 1059295
15867 1059295 1061176 1059877 1061090 1059130 1059321 1052899 1054171 1062354 1066631 1065070 1055992 1059456 1061663 1061912
15853 1061912 1062371 1065332 1062926 1057705 1064523 1069141 1069884 1064165 1062864 1063651 1063719 1064955 1067020 1067626 1064934
15838 1064934 1057842 1057715 1059767 1058294 1055376 1065221 1065524 1065921 1065197 1063862 1059495 1055583 1059676 1056958 1056126
15823 1056126 1055615 1058479 1061140 1060206 1062964 1072021 1069569 1056298 1060008 1060449 1061701 1067322 1066962 1069427 1070784
15808 1070784 1068791 1066605 1067239 1068973 1072548 1068269 1061839 1062295 1070871 1068452 1059980 1059071 1062014 1071329 1063152
15793 1063152 1062002 1063667 1070302 1064858 1061697 1061127 1055504 1062782 1065867 1067772 1067405 1066527 1063578 1066575 1067804
15778 1067804 1067700 1070849 1073307 1074854 1073642 1067332 1069114 1069809 1075556 1075724 1069460 1064838 1063288 1065951 1070995
15763 1070995 1069551 1064743 1069847 1068777 1064355 1069269 1075371 1070486 1069503 1076388 1075903 1076989 1072560 1068950
15749 1068950 1066018 1068568 1067293 1072644 1068938 1074787 1072020 1070510 1073079 1067732 1069623 1070706 1075561 1080353
15735 1080353 1077630 1083693 1076473 1069602 1074378 1071792 1069336 1072828 1073272 1076267 1074179 1066715 1074268 1074727
15721 1074727 1070247 1073987 1075751 1080681 1079830 1085264 1083760 1080314 1076634 1075509 1079244 1083765 1083051 1075941
15707 1075941 1069041 1070228 1075272 1078614 1080182 1078878 1080690 1087632 1086302 1083485 1080760 1084468 1082809 1076034
15693 1076034 1083638 1083116 1078568 1083574 1085153 1083625 1085962 1085314 1079690 1080837 1084576 1079071 1076413 1079846
15679 1079846 1080346 1085865 1088110 1087244 1088857 1081791 1081212 1083366 1083745 1084788 1086284 1080460 1080921 1079360 1077110
15664 1077110 1078536 1081918 1082734 1081640 1076672 1077098 1080896 1087044 1084714 1088291 1083659 1087011 1087795 1086948 1084435
15649 1084435 1093398 1092805 1088098 1086362 1087322 1083540 1079789 1078165 1078440 1079885 1076420 1077703 1079316 1084521 1085802
15634 1085802 1089787 1087127 1099699 1090773 1090398 1085879 1086272 1081487 1088386 1094635 1093920 1090244 1091327 1087238
15620 1087238 1092579 1089833 1084429 1084301 1086586 1090476 1089578 1092620 1088224 1084090 1093236 1094790 1088028 1091076
15606 1091076 1090569 1090558 1090642 1089386 1096458 1095020 1093869 1091138 1092792 1092498 1096541 1100285 1098005 1092847 1098318
15591 1098318 1099083 1100718 1100217 1093521 1096328 1086877 1087497 1096699 1093957 1096058 1097378 1098753 1094310 1093539 1093399
15576 1093399 1103300 1100251 1096535 1097541 1093795 1100837 1100862 1104530 1102465 1104334 1100336 1098203 1099676 1100229 1103897
15561 1103897 1106122 1099854 1097162 1097991 1107046 1110299 1107352 1102089 1104719 1100695 1091867 1093535 1099605 1097766
15547 1097766 1093462 1092120 1089022 1086418 1084626 1089646 1090815 1092745 1099772 1099211 1102071 1093319 1087272 1092546
15533 1092546 1093105 1100740 1097714 1098429 1098646 1096645 1098995 1103966 1107087 1106001 1101048 1098724 1099120 1100235 1096264
15518 1096264 1097852 1097923 1093700 1100708 1099364 1103606 1099034 1098649 1105372 1106695 1106059 1097515 1103702 1103528 1100520
15503 1100520 1098397 1097994 1099025 1105384 1096455 1096715 1097668 1100778 1102650 1098512 1101098 1101030 1100774 1100683 1100414 1101618
15487 1101618 1097193 1101623 1112909 1107587 1111635 1112168 1112502 1107420 1108476 1104865 1104601 1102165 1100618 1100084 1099445
15472 1099445 1101796 1103784 1102738 1099312 1098980 1105106 1102184 1102987 1110558 1112312 1108950 1112175 1110914 1109718
15458 1109718 1113325 1109400 1105823 1108290 1108275 1106139 1117602 1122310 1114975 1114989 1108131 1107017 1109212 1103406 1107745
15443 1107745 1110624 1110347 1113041 1114009 1117580 1119480 1113486 1116049 1111485 1115218 1113957 1114268 1107205 1114993 1118391
15428 1118391 1107651 1114219 1115597 1114711 1112422 1109327 1113349 1117546 1118156 1106527 1110267 1107459 1105534 1110198
15414 1110198 1106199 1114915 1118117 1115977 1117749 1117309 1111502 1121586 1126365 1128087 1129869 1127488 1123547 1120005
15400 1120005 1114921 1116060 1119286 1119152 1123368 1126569 1121736 1116179 1116777 1112631 1118701 1124672 1129697 1125910
15386 1125910 1118224 1120211 1122224 1123734 1121353 1128711 1125117 1121114 1124156 1123438 1112936 1115694 1120574 1123789
15372 1123789 1123125 1119433 1120791 1124531 1126770 1129413 1122915 1120819 1122211 1123666 1125561 1113748 1117817 1115195
15358 1115195 1121208 1122922 1123631 1127900 1130118 1126635 1128426 1124782 1125567 1120273 1113431 1116692 1117079 1121211 1122480
15343 1122480 1127434 1126995 1124726 1125723 1127145 1123850 1127597 1124924 1124005 1122461 1121483 1128469 1129345 1124581 1124380
15328 1124380 1129864 1132462 1128888 1126358 1126387 1127228 1131921 1130332 1131998 1132430 1131301 1129987 1127626 1125698 1128845
15313 1128845 1136022 1129712 1132344 1126721 1123452 1122797 1122537 1129617 1133565 1140849 1131784 1132110 1129505 1133214 1132814
15298 1132814 1136509 1140088 1145412 1144218 1138018 1131866 1125567 1120333 1130064 1130534 1128058 1131169 1134663 1128954
15284 1128954 1129514 1133211 1131315 1132824 1132481 1134686 1130110 1135865 1142321 1137921 1131721 1135860 1135995 1135882 1143523
15269 1143523 1137597 1137582 1136845 1133635 1135854 1137678 1136624 1140784 1141766 1134612 1136840 1143149 1138545 1138223 1131607
15254 1131607 1137304 1143890 1142053 1142332 1133638 1138406 1139135 1139346 1141905 1142867 1143396 1135601 1136035 1138619 1138913 1136656
15238 1136656 1136021 1135530 1132915 1130752 1135235 1133549 1136060 1136740 1135457 1140956 1134015 1140651 1137700 1139157 1139859
15223 1139859 1140498 1139906 1147798 1141463 1136076 1140828 1143160 1142921 1148135 1143713 1145751 1143371 1139026 1143900 1142306
15208 1142306 1141302 1146325 1146101 1148346 1151022 1139791 1143569 1151016 1147097 1141510 1145806 1152565 1150536 1144588
15194 1144588 1146411 1151493 1147693 1145363 1144705 1146675 1148700 1146724 1152945 1154635 1150748 1150489 1158886 1161524
15180 1161524 1150277 1146355 1146858 1149736 1150389 1148138 1141360 1148911 1153140 1153760 1151154 1149685 1146357 1151928
15166 1151928 1148783 1151806 1152677 1148079 1146206 1140185 1145830 1151456 1147013 1151326 1152304 1151907 1150931 1156460 1156998
15151 1156998 1145723 1152081 1153643 1157579 1161458 1157470 1165284 1160406 1152151 1152935 1152810 1157697 1155051 1149296
15137 1149296 1151943 1149059 1153845 1147887 1150141 1149316 1155813 1161093 1165300 1161313 1164413 1168131 1166073 1155446
15123 1155446 1156313 1158625 1154738 1161031 1165809 1163208 1156882 1154520 1158332 1161995 1158943 1156848 1162771 1159423
15109 1159423 1154098 1157521 1160767 1155976 1151947 1152639 1155767 1165171 1169995 1161764 1159225 1159697 1156214 1162284
15095 1162284 1160914 1155418 1161538 1154339 1155487 1159351 1157320 1166291 1167153 1168842 1171319 1171576 1168014 1166350
15081 1166350 1162531 1158754 1166505 1165950 1168321 1161350 1166789 1167708 1163466 1158875 1163017 1162085 1165958 1161162 1164246
15066 1164246 1165559 1162011 1164000 1163331 1164383 1165610 1164580 1165278 1166924 1175546 1178378 1170366 1165041 1162957
15052 1162957 1166563 1174131 1165892 1163017 1157282 1159183 1164856 1171419 1178061 1178820 1176842 1170367 1173326 1176002
15038 1176002 1170682 1166485 1167318 1172613 1175829 1177164 1170798 1171473 1169263 1173717 1169633 1167630 1173239 1167382
15024 1167382 1176093 1178175 1181638 1177599 1175224 1170877 1171056 1167047 1169770 1174187 1174749 1180177 1177934 1176946 1174328
15009 1174328 1174617 1178120 1178043 1178810 1174956 1172758 1177463 1177810 1178379 1182181 1180986 1180628 1174568 1175050 1176714 1178113
14993 1178113 1182923 1176520 1180998 1184847 1184456 1181377 1184501 1178014 1177763 1178654 1181430 1174189 1172671 1179162 1177049
14978 1177049 1179325 1177129 1172517 1181411 1182735 1176686 1180716 1182742 1182798 1177224 1176041 1179344 1184570 1176391
14964 1176391 1177771 1185060 1182449 1183191 1186656 1187282 1186477 1184310 1177349 1178714 1172837 1172778 1181630 1187094 1178819
14949 1178819 1178709 1180724 1180856 1183199 1182037 1182134 1180044 1184324 1188102 1179742 1179676 1183285 1181773 1184382 1186657
14934 1186657 1183149 1181332 1177837 1177894 1184793 1185592 1179032 1181467 1181084 1173513 1180078 1183738 1185116 1179002 1180131
14919 1180131 1172759 1180209 1184460 1187547 1185405 1189440 1192628 1183613 1185112 1179558 1182287 1183401 1185055 1180889
14905 1180889 1189258 1190028 1184163 1186828 1190524 1192151 1184138 1184177 1189180 1186706 1189181 1195249 1189710 1189806 1186823
14890 1186823 1184982 1189358 1192170 1194999 1189519 1182571 1185292 1188287 1187384 1181904 1189834 1194976 1200360 1195598
14876 1195598 1188886 1192321 1192274 1198058 1195554 1195601 1190202 1186197 1188812 1190482 1193285 1200000 1200244 1200931 1200434 1193789
14860 1193789 1193958 1196168 1192049 1196064 1199320 1203348 1198767 1196765 1195258 1192840 1198033 1197740 1197018 1201107 1193898
14845 1193898 1182578 1185894 1189682 1197250 1202885 1200193 1201382 1197547 1197642 1200616 1198438 1196842 1197703 1197856 1204005
14830 1204005 1205269 1205183 1198173 1201576 1198665 1202926 1204076 1209765 1213006 1210076 1201524 1196524 1200408 1201246 1201248
14815 1201248 1199936 1204772 1198195 1200516 1205812 1203887 1197833 1197439 1192998 1197691 1204516 1209255 1204465 1204910
14801 1204910 1208731 1206131 1205425 1207892 1210870 1213636 1213082 1205823 1204535 1202451 1198587 1203257 1208530 1205407
14787 1205407 1212292 1214757 1207844 1210802 1209527 1206602 1196924 1206411 1203454 1195077 1199298 1206133 1204774 1210326
14773 1210326 1216568 1222478 1217782 1206631 1207062 1212186 1210146 1210290 1210755 1210927 1216486 1218064 1215525 1212922 1214026
14758 1214026 1212882 1209924 1208285 1208872 1210246 1211292 1214872 1208899 1213303 1212041 1209553 1207941 1210936 1216804
14744 1216804 1215426 1211003 1214819 1217238 1215534 1217946 1218845 1218073 1214348 1217526 1218537 1221075 1216496 1217561
14730 1217561 1219335 1216849 1221807 1218014 1219007 1218635 1216215 1217011 1219771 1224066 1219138 1213576 1214576 1214777 1216971
14715 1216971 1213162 1211634 1216952 1217326 1213132 1225181 1225363 1229183 1228899 1218978 1223524 1224192 1221856 1220842 1222614
14700 1222614 1227191 1226514 1223477 1221767 1221859 1219319 1206844 1213855 1225445 1228831 1229769 1230301 1226308 1219598 1219231
14685 1219231 1227357 1226613 1228810 1226871 1225121 1227256 1227117 1223733 1229626 1229711 1228253 1220680 1228880 1225054 1229013
14670 1229013 1226411 1219294 1226455 1223201 1224618 1226404 1230354 1225333 1226004 1228925 1224643 1220412 1226021 1227862
14656 1227862 1229282 1230617 1228394 1227278 1228386 1229505 1233674 1237421 1236676 1234315 1233794 1229314 1225263 1226825
14642 1226825 1225087 1228080 1226873 1223648 1228008 1229684 1234046 1239571 1240668 1234003 1232986 1236720 1230069 1230617
14628 1230617 1231216 1236702 1228274 1231632 1234556 1234783 1238296 1236318 1231625 1224157 1234819 1242370 1240118 1231507
14614 1231507 1236138 1239398 1244828 1236430 1235728 1236779 1235089 1240409 1240328 1241272 1234043 1234752 1235925 1235542 1235651 1230547
14598 1230547 1230376 1232205 1236351 1233616 1240780 1243064 1239264 1231785 1239036 1246759 1238262 1243099 1246657 1247116
14584 1247116 1243096 1241721 1242711 1250412 1243895 1241677 1238674 1238556 1245737 1241506 1237661 1238272 1236704 1241452 1244268
14569 1244268 1241737 1241498 1237953 1240267 1243382 1235493 1240050 1240218 1240362 1237055 1247694 1248005 1251476 1247668 1250508
14554 1250508 1252492 1246634 1242678 1241044 1249350 1251940 1248724 1250451 1247541 1252399 1246844 1243861 1244716 1244484
14540 1244484 1244124 1253720 1252308 1250289 1248375 1246105 1244551 1252949 1251976 1254868 1250396 1247610 1242510 1240791
14526 1240791 1242475 1247201 1247833 1251070 1244248 1251156 1256848 1254852 1251127 1245804 1243030 1250076 1256399 1251776
14512 1251776 1248379 1253241 1248616 1249316 1254760 1259895 1255827 1258677 1256580 1256787 1256898 1257630 1256930 1254045 1259747
14497 1259747 1258473 1255208 1252348 1252546 1262686 1262209 1266850 1263252 1256321 1256945 1257550 1253345 1255354 1248225 1247827
14482 1247827 1252836 1254007 1262323 1267829 1268574 1263958 1267693 1267750 1263241 1257720 1258525 1259604 1262618 1263969 1263597
14467 1263597 1262711 1261203 1259774 1254618 1256380 1257022 1260058 1264379 1267353 1264414 1265318 1259719 1263603 1259982 1261593
14452 1261593 1265094 1264085 1269772 1269685 1271560 1265714 1262159 1260878 1268538 1275672 1267103 1259798 1260313 1260849 1269335
14437 1269335 1260798 1261137 1252638 1250778 1254884 1257732 1270733 1274281 1270828 1278590 1275435 1262167 1263101 1262811
14423 1262811 1259544 1263168 1264067 1270120 1270462 1267422 1271819 1274663 1270791 1277145 1271412 1268889 1268761 1279045
14409 1279045 1282456 1274440 1270514 1275384 1272160 1277950 1274790 1273841 1276279 1272519 1268545 1271939 1274012 1273712
14395 1273712 1281887 1275838 1269646 1265814 1272509 1278832 1275803 1275004 1275210 1271674 1277149 1277012 1277631 1277158 1276509
14380 1276509 1274675 1280593 1271350 1275294 1280465 1286120 1288433 1284805 1282993 1278139 1279551 1276716 1280922 1280257
14366 1280257 1284389 1285853 1283408 1285720 1282981 1282875 1278072 1282811 1285995 1281835 1282438 1278301 1279939 1282357
14352 1282357 1281117 1282931 1284422 1277684 1277181 1278078 1282801 1294839 1293371 1289214 1292613 1292460 1280668 1280340
14338 1280340 1282852 1283451 1282100 1288448 1284713 1288403 1291483 1285350 1279238 1278795 1281015 1284435 1284954 1285210 1293820
14323 1293820 1291256 1278700 1284555 1290031 1288992 1283423 1283645 1286037 1285911 1288310 1289763 1288002 1287609 1291311
14309 1291311 1294751 1291868 1291201 1289456 1287412 1286098 1289497 1283740 1284113 1285505 1295399 1293782 1297081 1295619
14295 1295619 1293838 1288850 1295735 1293685 1286399 1294030 1294519 1291517 1295665 1294687 1298461 1296120 1295175 1287857 1290349
14280 1290349 1301858 1305707 1302073 1304169 1302138 1301158 1302894 1294811 1296474 1297028 1297313 1298310 1297574 1303174 1301040
14265 1301040 1307769 1301496 1299918 1303057 1300080 1289559 1294679 1295753 1294944 1299282 1291711 1289094 1290191 1290967
14251 1290967 1288303 1290958 1296923 1296804 1291927 1301543 1293545 1296325 1296446 1298889 1297455 1293213 1295224 1304029
14237 1304029 1303119 1300648 1304848 1303167 1303031 1303013 1305563 1301950 1297520 1294438 1299114 1304888 1308466 1310945 1311401
14222 1311401 1313881 1308745 1303507 1306716 1316005 1312765 1312158 1305285 1309827 1311507 1309474 1306274 1306895 1308229
14208 1308229 1300310 1298851 1310784 1303567 1305850 1310418 1318887 1322321 1315378 1318389 1323894 1316135 1315497 1310836
14194 1310836 1309736 1308919 1306495 1304622 1301830 1305274 1311002 1313283 1309626 1303756 1311736 1312822 1304100 1302669
14180 1302669 1302234 1310122 1311477 1313430 1312636 1315399 1312081 1313518 1312983 1317599 1319250 1317084 1313174 1315873 1315198
14165 1315198 1311069 1313021 1323299 1318713 1315646 1314373 1311295 1314964 1320514 1314728 1321205 1321336 1319621 1322927
14151 1322927 1323312 1321840 1317376 1314709 1315992 1321021 1324171 1321085 1323134 1322448 1320504 1320431 1322394 1323391 1329477
14136 1329477 1332816 1327689 1329758 1328405 1323550 1325433 1330877 1325573 1321961 1325475 1328178 1330058 1333366 1338653
14122 1338653 1330182 1325426 1319684 1326148 1324216 1321232 1324328 1329267 1325863 1324022 1320930 1327461 1328464 1337638
14108 1337638 1332078 1328312 1333892 1339810 1327623 1323454 1332592 1334867 1331675 1331946 1333806 1337073 1340523 1339342
14094 1339342 1332213 1326998 1327618 1327709 1330336 1330532 1331150 1331977 1336610 1338332 1331780 1333302 1335605 1338703 1335833
14079 1335833 1337333 1331572 1337808 1334279 1334573 1330999 1328648 1336695 1330802 1337062 1336701 1338417 1336425 1331131
14065 1331131 1333465 1338358 1334633 1335229 1341524 1338956 1336090 1335360 1340977 1345674 1344536 1341984 1340292 1341993
14051 1341993 1339389 1339947 1339079 1332244 1336920 1336976 1343008 1345682 1342200 1335999 1337798 1334276 1348424 1351133 1343568
14036 1343568 1346692 1346350 1341488 1341166 1339226 1344226 1347492 1351585 1351454 1347583 1340558 1344247 1352715 1350455 1352222
14021 1352222 1348987 1343804 1333716 1343016 1348451 1349329 1345239 1352893 1353962 1348730 1345776 1345829 1348997 1356924
14007 1356924 1353309 1359326 1351766 1349562 1359102 1358211 1361402 1360757 1354283 1354350 1351924 1348728 1346664 1351318 1354112
13992 1354112 1353039 1359287 1355273 1351058 1353456 1349124 1349624 1354049 1359369 1358554 1361934 1355443 1353873 1355321
13978 1355321 1352200 1350984 1359812 1361033 1360525 1362705 1361537 1365497 1361276 1358857 1363129 1359097 1354917 1357961
13964 1357961 1362495 1362712 1364695 1367410 1365719 1361159 1361111 1363725 1364625 1360744 1359947 1366661 1363555 1360828 1360511
13949 1360511 1365650 1360725 1360665 1361887 1361501 1359907 1357321 1359674 1359888 1366745 1365756 1376630 1374406 1375682 1373693
13934 1373693 1373613 1369487 1367677 1365849 1367476 1366290 1364450 1362952 1367033 1369634 1376081 1367837 1367763 1375464 1375671
13919 1375671 1365475 1366879 1366492 1367122 1364958 1370552 1370336 1366742 1363872 1369408 1372711 1375536 1369438 1371191
13905 1371191 1371249 1370494 1369992 1371970 1375976 1374129 1369039 1367201 1368982 1368435 1367298 1374114 1375378 1377055 1374073
13890 1374073 1374234 1372797 1375869 1374001 1375995 1380422 1385323 1383134 1382913 1377081 1378476 1373373 1374484 1379942
13876 1379942 1378845 1381607 1381373 1380773 1379162 1377325 1376957 1378354 1376732 1372878 1376642 1372373 1376328 1378109 1379153
13861 1379153 1380577 1385561 1391256 1391916 1384250 1379862 1381046 1388775 1395083 1386717 1389090 1384022 1381401 1382943
13847 1382943 1380533 1375244 1379517 1379634 1381814 1384230 1387909 1392607 1393493 1390613 1384585 1384235 1382248 1378825 1378726
13832 1378726 1386555 1387090 1379385 1376766 1382519 1384302 1387576 1389672 1387359 1382125 1380607 1388039 1400216 1403095
13818 1403095 1395639 1392049 1394729 1388492 1391395 1394571 1392848 1394654 1396218 1396562 1389879 1395144 1390857 1392001
13804 1392001 1386933 1385748 1389363 1386613 1389941 1389154 1397793 1394956 1402056 1402101 1398491 1396170 1402491 1399714 1397647
13789 1397647 1396972 1399869 1400311 1394859 1397942 1403086 1402960 1404164 1394870 1397796 1400706 1400000 1402431 1403754 1400260
13774 1400260 1400439 1398525 1403637 1399115 1397839 1395954 1398192 1395152 1406242 1405776 1405268 1398448 1409516 1405836
13760 1405836 1402400 1402131 1410313 1411140 1410103 1411130 1404896 1401909 1405720 1406864 1411758 1415859 1410151 1409697 1407386
13745 1407386 1408779 1414593 1417427 1416889 1416594 1417158 1417149 1412006 1407836 1411614 1412575 1410183 1409463 1412433 1409367 1401379
13729 1401379 1406395 1406274 1405625 1407064 1410354 1415369 1415014 1412401 1411020 1403918 1403031 1399385 1403750 1408012 1412448
13714 1412448 1413894 1416957 1413944 1417397 1414514 1415577 1417654 1413285 1413457 1415229 1412581 1411464 1410426 1418779
13700 1418779 1416856 1417054 1414878 1422450 1419681 1416466 1412455 1419999 1424291 1426845 1422114 1419091 1421613 1418381
13686 1418381 1424773 1421206 1424640 1423617 1421423 1420750 1423410 1423272 1425678 1431085 1424248 1429424 1427230 1429050
13672 1429050 1421877 1425150 1428590 1428548 1426880 1430457 1426227 1425298 1426423 1425924 1432614 1428900 1429979 1437219 1435363
13657 1435363 1441682 1441362 1427538 1423316 1427624 1437230 1435720 1442814 1441179 1435365 1429512 1432992 1433617 1435750
13643 1435750 1436640 1434090 1434789 1435361 1433733 1439409 1437984 1439534 1440054 1437321 1434416 1433798 1436139 1433022 1430144
13628 1430144 1429154 1439606 1445140 1440695 1441250 1443232 1437877 1433723 1440559 1440034 1445185 1447183 1444446 1444966 1448036
13613 1448036 1443832 1437947 1439236 1437439 1438144 1441127 1443533 1441729 1440046 1442949 1446950 1441679 1436283 1442484
13599 1442484 1441721 1447195 1446870 1447538 1448411 1443078 1444395 1446545 1450833 1458683 1453993 1446649 1452351 1444833 1444546
13584 1444546 1444751 1446676 1448452 1445484 1447105 1449818 1452418 1452804 1455265 1451263 1451073 1452722 1457897 1458742 1458600
13569 1458600 1454625 1453762 1453772 1458261 1453183 1448145 1452968 1447446 1442348 1443400 1447843 1452868 1458275 1455453 1455243
13554 1455243 1451319 1452795 1458266 1453065 1448392 1449068 1459159 1459891 1465866 1463536 1464414 1463248 1463323 1462143 1462140 1464244
13538 1464244 1461524 1464614 1461417 1463822 1466709 1464223 1461242 1459068 1460814 1464144 1464042 1462866 1463484 1465088
13524 1465088 1465199 1464910 1461478 1469226 1467644 1464706 1473056 1471648 1474949 1474638 1476049 1473583 1471577 1477390 1480060
13509 1480060 1485049 1477684 1476350 1472302 1472480 1473044 1470487 1470430 1470236 1469272 1471040 1475474 1476026 1476980 1474695 1471719
13493 1471719 1477032 1485422 1478826 1475977 1474544 1479598 1476546 1474146 1482124 1482967 1480571 1479189 1488251 1491900
13479 1491900 1492140 1490077 1488781 1486495 1482465 1482879 1488574 1489981 1491890 1488515 1495653 1497857 1500162 1495798
13465 1495798 1491163 1490202 1494561 1501246 1504925 1507671 1506920 1505410 1502721 1502795 1508213 1505275 1508476 1510118 1510688
13450 1510688 1508180 1511475 1522352 1526128 1526872 1519912 1517707 1510305 1494001 1478571 1468305 1462253 1465695
13437 1465695 1462141 1467188 1467262 1471162 1470376 1476996 1480607 1484830 1484385 1479177 1479832 1481700 1483701 1487863 1488031
13422 1488031 1484508 1488616 1486184 1494355 1504032 1493621 1491218 1494957 1494385 1497193 1495453 1496342 1493321 1499903
13408 1499903 1496625 1502474 1496843 1500838 1509734 1510735 1511605 1509670 1506990 1509953 1509565 1508847 1512212 1514288 1515567
13393 1515567 1512370 1516896 1524085 1526000 1521669 1520495 1517442 1520752 1524329 1525994 1528989 1526385 1527467 1534722
13379 1534722 1534961 1530134 1536315 1539977 1543829 1547907 1556830 1551551 1549393 1548949 1542299 1543941 1546939 1547102 1552429
13364 1552429 1565867 1566770 1567830 1572269 1573394 1580611 1582275 1582791 1576718 1570228 1564007 1557710 1558413 1544405
13350 1544405 1539723 1525212 1511389 1490659 1475638 1462189 1451579 1440950 1441362 1441143 1437618 1431470 1435830
13337 1435830 1436580 1438055 1443181 1438683 1444935 1439274 1430239 1440802 1438982 1442940 1452194 1453334 1454640 1456567
13323 1456567 1461544 1466991 1467454 1470595 1475590 1481697 1479009 1481860 1488608 1490221 1494893 1478019 1475094 1474135
13309 1474135 1469075 1465473 1460574 1466682 1477224 1477280 1473115 1477366 1486196 1485539 1484942 1483825 1494909 1497373
13295 1497373 1498396 1508877 1508734 1512694 1505648 1492458 1481771 1470742 1465869 1459615 1474909 1474332 1475459
13282 1475459 1475323 1473311 1471346 1483158 1481374 1481773 1487871 1481723 1490826 1487225 1487238 1491256 1494629 1499616 1498952
13267 1498952 1497566 1499544 1499135 1499729 1501535 1502862 1499361 1499396 1495784 1492569 1492004 1493499 1499897 1501997 1503963
13252 1503963 1504218 1503351 1495758 1499742 1497898 1504453 1508094 1507434 1506514 1503552 1509994 1507199 1504748 1504335 1505814
13237 1505814 1510004 1511138 1507487 1510338 1511349 1513123 1511132 1515046 1513251 1509295 1511192 1517675 1521950 1521922
13223 1521922 1526409 1519052 1514162 1522511 1522092 1518002 1521030 1524005 1520981 1519710 1521393 1526483 1521577 1517893
13209 1517893 1518839 1518906 1520796 1526217 1522569 1522136 1524353 1523569 1525736 1533600 1528567 1524211 1522722 1522126 1526632
13194 1526632 1523299 1521687 1520671 1522794 1526353 1526739 1527848 1532314 1532798 1534979 1535690 1538039 1540576 1539630 1535971
13179 1535971 1534633 1534114 1530799 1532846 1540436 1533388 1534979 1534594 1540539 1537346 1532792 1536903 1536460 1536709 1537095
13164 1537095 1534243 1539657 1538767 1532472 1536439 1537480 1541801 1540296 1532967 1540069 1544640 1545490 1549517 1547230
13150 1547230 1543034 1540206 1538641 1549600 1545196 1540952 1540650 1547841 1545518 1547909 1545297 1541249 1536201 1542298
13136 1542298 1545170 1543501 1539972 1543205 1547785 1546359 1547267 1545701 1550387 1552997 1548682 1552428 1545534 1551346
13122 1551346 1551505 1547071 1545544 1547599 1547793 1548772 1548517 1544998 1541983 1545507 1546254 1542017 1541340 1541815 1546405 1544697
13106 1544697 1544276 1550234 1552983 1552282 1542915 1547163 1552307 1551411 1548251 1548929 1554939 1559264 1551746 1552499 1549370
13091 1549370 1545607 1555026 1559537 1547630 1547217 1544612 1547574 1550459 1546837 1548115 1556164 1556766 1556238 1552970
13077 1552970 1543626 1551830 1555592 1563206 1563558 1565250 1564561 1565353 1558559 1562389 1563764 1563619 1565437 1556968 1558538
13062 1558538 1561266 1561718 1565942 1566470 1561662 1561534 1571302 1567712 1559467 1560039 1564718 1570018 1576197 1574362 1572651
13047 1572651 1574413 1572018 1569518 1563668 1569221 1572034 1575616 1573805 1577674 1579986 1580213 1581661 1586150 1580882
13033 1580882 1576264 1570747 1576082 1579524 1581335 1588202 1585683 1579828 1585289 1587190 1589710 1586245 1590882 1593428
13019 1593428 1598117 1602434 1605566 1606600 1595893 1586828 1574525 1563944 1566775 1568263 1571028 1570619 1566149
13006 1566149 1566335 1575327 1578081 1574649 1569963 1573247 1573061 1571036 1573453 1576922 1577517 1573908 1578002 1578306 1579734
12991 1579734 1588432 1584235 1582842 1580871 1582792 1581405 1579937 1581728 1581656 1574726 1576356 1583323 1586383 1592601
12977 1592601 1595518 1594875 1590526 1587807 1591915 1592544 1587421 1582109 1582976 1591579 1598064 1596989 1599860 1594692 1594437
12962 1594437 1597781 1596052 1598609 1597661 1597198 1601219 1597413 1596697 1589033 1594885 1593952 1598890 1603619 1605824 1606977
12947 1606977 1604513 1604185 1609529 1607682 1607624 1606575 1605460 1610802 1605359 1601267 1599934 1604161 1606369 1605047 1595971
12932 1595971 1587556 1590767 1593449 1595611 1595590 1590036 1593833 1599478 1602588 1598881 1607116 1603790 1595994 1599995
12918 1599995 1600042 1599035 1596290 1598861 1601062 1603237 1601080 1603184 1601569 1599314 1603169 1610479 1603641 1602611
12904 1602611 1600564 1609966 1608236 1603698 1603075 1607748 1609974 1609738 1613696 1613452 1609648 1617662 1613660 1611795 1611485
12889 1611485 1612862 1612624 1618699 1608620 1609978 1620515 1617668 1613513 1610306 1613774 1616718 1624578 1626101 1622312
12875 1622312 1615458 1625012 1626043 1626227 1625553 1631503 1624432 1624059 1626131 1629583 1628989 1623373 1624948 1626957 1626411
12860 1626411 1624573 1623804 1625996 1616699 1618763 1621540 1621384 1626313 1635114 1630069 1620049 1621692 1622037 1628390
12846 1628390 1630062 1629747 1627171 1627765 1629021 1624672 1629444 1633134 1630949 1633621 1641092 1637742 1632246 1635342
12832 1635342 1634471 1635027 1631458 1629006 1632677 1625277 1632660 1633493 1632630 1636570 1633139 1636183 1642485 1650365 1647459
12817 1647459 1638750 1645791 1646174 1642832 1640293 1640353 1639816 1645680 1643328 1640244 1646530 1639975 1636087 1636412 1634839
12802 1634839 1637537 1636920 1643409 1644114 1645497 1641713 1642165 1644924 1641852 1641512 1645891 1642297 1643981 1649258 1648572
12787 1648572 1645786 1650782 1651228 1644772 1646518 1649287 1655961 1648989 1647550 1653338 1657082 1657471 1655628 1657271
12773 1657271 1656309 1656124 1660703 1652976 1653024 1654832 1657144 1660166 1651625 1655844 1655084 1664073 1662329 1657314 1662314
12758 1662314 1664118 1658395 1661198 1652680 1659069 1659409 1659419 1653783 1661743 1657170 1659137 1665247 1667323 1661312 1658777
12743 1658777 1660317 1667730 1672091 1671961 1676168 1668037 1663839 1662129 1666323 1663754 1663304 1657968 1659068 1661589
12729 1661589 1667670 1667874 1671220 1673717 1669793 1669791 1676250 1674051 1677529 1675977 1674565 1676066 1676273 1676638 1669274
12714 1669274 1667984 1671693 1673437 1675092 1678016 1678427 1684879 1680028 1675175 1677131 1681381 1680686 1683994 1681758
12700 1681758 1677706 1684646 1686319 1682739 1685601 1682497 1685497 1689289 1686293 1683496 1680652 1687529 1685849 1683752
12686 1683752 1680629 1690655 1685442 1686906 1690905 1689577 1688277 1688472 1689464 1689153 1690473 1690531 1693206 1696230 1699892
12671 1699892 1698492 1699248 1694846 1692321 1695934 1699129 1696032 1695874 1700972 1701917 1699327 1697404 1692432 1693718 1692783
12656 1692783 1697039 1695623 1694564 1689697 1688514 1700298 1701500 1699772 1700845 1705923 1695551 1692420 1703481
12643 1703481 1704660 1702436 1705861 1704716 1700205 1699710 1705205 1703020 1702514 1698021 1698662 1703131 1702962 1707324 1701335
12628 1701335 1712326 1705481 1707375 1713301 1714236 1714723 1714666 1713741 1712794 1707854 1713976 1714854 1715055 1713598 1712095 1712696
12612 1712696 1711705 1715974 1714117 1715519 1711480 1715051 1718128 1712913 1715466 1719250 1720596 1718125 1719807 1726744
12598 1726744 1726366 1720458 1723157 1730925 1727327 1724403 1729509 1729759 1737239 1730265 1731743 1737315 1733338 1730260
12584 1730260 1739177 1746365 1750610 1743083 1749564 1755060 1751675 1748887 1738199 1730227 1714094 1705539 1701408
12571 1701408 1696786 1689684 1687834 1685885 1692375 1700628 1695625 1701084 1701013 1706821 1707518 1705131 1709997 1713971 1718528
12556 1718528 1722880 1720623 1718693 1724475 1724268 1719424 1724344 1729386 1727464 1729927 1726361 1724699 1726505 1728785
12542 1728785 1725979 1723174 1731389 1724702 1731500 1732803 1734573 1738526 1738155 1732925 1728662 1733285 1737847 1735721
12528 1735721 1735699 1728491 1733229 1732525 1735185 1731699 1733799 1732334 1740974 1739426 1735227 1746959 1743092 1746918
12514 1746918 1741982 1744631 1744864 1744093 1745417 1744526 1744804 1749230 1750078 1748350 1750581 1744912 1744489 1743629 1742547 1744918
12498 1744918 1750275 1751428 1750791 1747456 1738333 1748597 1758063 1761117 1755860 1747285 1756415 1751166 1751417 1756867
12484 1756867 1754021 1756313 1755395 1755842 1763402 1764111 1764548 1763249 1763441 1764015 1765337 1762407 1766651 1767542 1760344 1765028
12468 1765028 1763111 1764513 1765943 1758649 1758131 1758960 1762544 1762310 1768934 1764254 1765731 1769856 1771791 1771955 1766499
12453 1766499 1767564 1765182 1765482 1774302 1782535 1777284 1778296 1783711 1772932 1772580 1771491 1776053 1773476 1769029
12439 1769029 1770480 1773803 1778226 1772106 1779323 1777527 1774497 1770893 1778671 1776292 1777851 1778116 1778403 1777289
12425 1777289 1773465 1778964 1781913 1784586 1787617 1782245 1780195 1783596 1782723 1785200 1784782 1780894 1778749 1787794
12411 1787794 1786423 1787961 1792698 1784919 1782122 1790103 1795690 1787571 1781199 1775811 1788696 1787457 1785321 1785837
12397 1785837 1792072 1796538 1792515 1794293 1796558 1796892 1799087 1796187 1788722 1792414 1794794 1804532 1806103 1799176
12383 1799176 1798712 1801403 1791870 1799866 1808971 1806411 1805172 1804483 1809558 1809935 1804840 1802165 1797453 1790796 1792921
12368 1792921 1796394 1791873 1796758 1807067 1803151 1800603 1805299 1809754 1807732 1806131 1805335 1806770 1800737 1805918
12354 1805918 1808069 1808407 1808827 1813750 1815231 1809315 1808208 1810384 1805844 1806210 1809570 1815290 1812427 1809220 1810105
12339 1810105 1817831 1818968 1807082 1809733 1809236 1821875 1818322 1813759 1819952 1812889 1815357 1814903 1815905 1812850
12325 1812850 1808973 1812399 1812056 1816759 1815825 1816720 1819209 1816148 1817215 1818175 1819921 1824533 1824788 1823422 1821744
12310 1821744 1821684 1823052 1823344 1817613 1824470 1820584 1825763 1825662 1828072 1834841 1832479 1834594 1834109 1832568 1837307
12295 1837307 1833605 1831114 1831909 1834830 1828903 1830233 1830358 1836120 1835414 1837192 1841956 1845254 1844115 1838458 1848216
12280 1848216 1839591 1842677 1841046 1837101 1834399 1839398 1840585 1845776 1839332 1834930 1838926 1847155 1843823 1843354
12266 1843354 1846199 1845528 1852332 1851555 1846421 1852810 1847793 1843319 1842031 1851984 1847001 1848119 1847470 1847395 1850941
12251 1850941 1854655 1858711 1852290 1853191 1855560 1852089 1858587 1856632 1857019 1855161 1861380 1859729 1861166 1862386
12237 1862386 1860193 1860724 1857428 1855625 1857146 1857750 1852709 1861679 1862559 1862657 1866048 1868235 1864779 1868027 1866990
12222 1866990 1862296 1865343 1861962 1864488 1865108 1861627 1863331 1872472 1869025 1866467 1863717 1862971 1866702 1856622
12208 1856622 1859796 1866669 1867461 1870240 1873455 1875102 1880453 1877580 1872427 1877294 1874954 1877543 1876840 1880924
12194 1880924 1880069 1875189 1878526 1880795 1883447 1888857 1885128 1889318 1888144 1886252 1882308 1883774 1882922 1884083
$$ [...]
##END NTUPLES=NMR SPECTRUM
##END=
