##TITLE=	PROTON_01
##JCAMPDX=	6.0	$$ NMR Plug-in v.1.14 of MestReNova 12.0.4-22023
##DATATYPE=	LINK
##BLOCKS=	3
##ORIGIN=	Varian
##OWNER=	
##TITLE=	PROTON_01
##JCAMPCS=	3.7	$$ Molecule Plug-in 1.10 of MestReNova 12.0.4-22023
##ORIGIN=	Varian
##OWNER=	
##BLOCKID=	1
##NAMES=	
##ATOMLIST=	
$$ AN	AS	NH
	1	O	 
	2	B	 
	3	O	 
	4	B	 
	5	O	 
	6	B	 
	7	C	 
	8	C	 
	9	C	1
	10	C	 
	11	C	 
	12	C	 
	13	C	1
	14	C	1
	15	C	 
	16	C	 
	17	C	 
	18	C	1
	19	N	2
	20	C	 
	21	C	2
	22	C	2
	23	C	1
	24	C	 
	25	C	 
	26	C	 
	27	C	1
	28	F	 
	29	F	 
	30	F	 
	31	F	 
	32	F	 
	33	F	 
	34	F	 
	35	F	 
	36	F	 
	37	N	2
##BONDLIST=	
$$ AN1	AN2	BT
	1	2	S
	2	3	S
	3	4	S
	4	5	S
	5	6	S
	6	1	S
	6	7	S
	2	8	S
	8	9	D
	9	10	S
	10	11	D
	11	12	S
	12	13	D
	13	8	S
	7	14	D
	14	15	S
	15	16	D
	16	17	S
	17	18	D
	18	7	S
	4	19	S
	4	20	S
	19	21	S
	21	22	S
	20	23	D
	23	24	S
	24	25	D
	25	26	S
	26	27	D
	27	20	S
	26	28	S
	25	29	S
	24	30	S
	12	31	S
	11	32	S
	10	33	S
	17	34	S
	16	35	S
	15	36	S
	22	37	S
##CHARGE=	
$$ CH	AN1
	-1	4
	+1	19
##MAXRASTER=	32768
##XYRASTER=	
$$ AN	X	Y	Z
	1	-5900	131	0
	2	-5900	7442	0
	3	431	11097	0
	4	6763	7442	0
	5	6763	131	0
	6	431	-3524	0
	7	431	-10835	0
	8	-12231	11097	0
	9	-18562	7442	0
	10	-24894	11097	0
	11	-24894	18408	0
	12	-18562	22063	0
	13	-12231	18408	0
	14	6763	-14490	0
	15	6763	-21801	0
	16	431	-25457	0
	17	-5900	-21801	0
	18	-5900	-14490	0
	19	13824	5550	0
	20	10418	13773	0
	21	18994	10719	0
	22	26056	8827	0
	23	6763	20104	0
	24	10418	26436	0
	25	17729	26436	0
	26	21385	20104	0
	27	17729	13773	0
	28	28696	20104	0
	29	21385	32768	0
	30	6763	32768	0
	31	-18562	29374	0
	32	-31226	22063	0
	33	-31226	7442	0
	34	-12231	-25457	0
	35	431	-32768	0
	36	13094	-25457	0
	37	31226	13997	0
##END=	

##TITLE=	PROTON_01
##JCAMPDX=	6.0	$$ NMR Plug-in 1.14 of MestReNova 12.0.4-22023
##BLOCKID=	2
##DATATYPE=	NMRSPECTRUM
##DATACLASS=	XYDATA
##NUMDIM=	1
##ORIGIN=	Varian
##OWNER=	
##.OBSERVEFREQUENCY=	699.735595703125
##.OBSERVENUCLEUS=	^1H
##.SOLVENTNAME=	cdcl3
##.PULSESEQUENCE=	s2pul
##LONGDATE=	2016/12/09 15:43:26.000
##.ACQUISITIONMODE=	SIMULTANEOUS
##$ORIGINALFORMAT=	Varian
##$PARAMETERFILE=	(datafile, ASCII, w:/d71612/Dec09153816/PROTON_01.fid/fid, 0)
$$ 
##$PARAMETERFILE=	(header, BASE64, w:/d71612/Dec09153816/PROTON_01.fid/fid, 0)
AAAAAQAAAAEAAVQOAAAABAAFUDgABVBUAAAAyQAAAAE=
##$PARAMETERFILE=	(log, ASCII, w:/d71612/Dec09153816/PROTON_01.fid/log, 0)
$$ Fri Dec  9 15:43:28 2016: Experiment started
$$ Fri Dec  9 15:43:47 2016: Acquisition complete
$$ 
##$PARAMETERFILE=	(procpar, ASCII, w:/d71612/Dec09153816/PROTON_01.fid/procpar, 0)
$$ gf1 1 1 100000 0 0 3 1 1 0 64
$$ 1 1 
$$ 0 
$$ dg2 2 2 8 0 0 4 1 4 1 64
$$ 6 "1:1st DECOUPLING:dfrq:3,dn,dpwr:0,dof:1,dm,dmm,dmf:0,dseq,dres:1,homo;"
$$ "2(numrfch>2):2nd DECOUPLING:dfrq2:3,dn2,dpwr2:0,dof2:1,dm2,dmm2,dmf2:0,dseq2,dres2:1,homo2;"
$$ "2(numrfch>3):3rd DECOUPLING:dfrq3:3,dn3,dpwr3:0,dof3:1,dseq3,dres3:1,homo3;"
$$ "3(ni2):3D ACQUISITION:d3:3,sw2:1,ni2:0,phase2:0;"
$$ "3(ni2):3D DISPLAY:rp2:1,lp2:1;"
$$ [...]
$$ wtfile1 2 2 15 0 0 3 2 1 1 64
$$ 1 ""
$$ 0 
$$ wstart 2 2 8 0 0 3 1 0 1 64
$$ 1 ""
$$ 0 
$$ wrtp 2 2 8 0 0 3 1 0 1 64
$$ 1 ""
$$ 0 
$$ wqinit 2 2 8 0 0 4 1 0 1 64
$$ 1 ""
$$ 0 
$$ wshim 4 2 4 0 0 2 1 1 1 64
$$ 1 "n"
$$ 15 "e" "f" "g" "n" "s" "0" "1" "2" "3" "4" "5" "6" "7" "8" "9" 
$$ wtfile 2 2 15 0 0 3 1 1 1 64
$$ 1 ""
$$ 0 
$$ x2y2 7 1 19 19 19 2 1 8192 1 64
$$ 1 -20379 
$$ 0 
$$ wtune 4 2 4 0 0 2 1 0 1 64
$$ 1 "st12"
$$ 11 "s" "t" "e" "i" "n" "o" "v" "1" "2" "3" "4" 
$$ x1 7 1 19 19 19 2 1 8192 1 64
$$ 1 -6520 
$$ 0 
$$ x4 7 1 19 19 19 2 1 8192 1 64
$$ 1 0 
$$ 0 
$$ x3 7 1 19 19 19 2 1 8192 1 64
$$ 1 518 
$$ 0 
$$ z3y 7 1 19 19 19 2 1 8192 1 64
$$ 1 3272 
$$ 0 
$$ z2xy 7 1 19 19 19 2 1 8192 1 64
$$ 1 -2588 
$$ 0 
$$ yz2 7 1 19 19 19 2 1 8192 1 64
$$ 1 -2487 
$$ 0 
$$ y1 7 1 19 19 19 2 1 8192 1 64
$$ 1 6249 
$$ 0 
$$ xz2 7 1 19 19 19 2 1 8192 1 64
$$ 1 -2594 
$$ 0 
$$ xz 7 1 19 19 19 2 1 8192 1 64
$$ 1 -6418 
$$ 0 
$$ y4 7 1 19 19 19 2 1 8192 1 64
$$ 1 0 
$$ 0 
$$ y3 7 1 19 19 19 2 1 8192 1 64
$$ 1 -1223 
$$ 0 
$$ yz 7 1 19 19 19 2 1 8192 1 64
$$ 1 3486 
$$ 0 
$$ z2 7 1 19 19 19 2 1 8192 1 64
$$ 1 -4134 
$$ 0 
$$ z1 7 1 19 19 19 2 1 8192 1 64
$$ 1 -6868 
$$ 0 
$$ z0_ 1 1 19 19 19 2 1 73744 1 64
$$ 1 14402 
$$ 0 
$$ z1c 7 1 19 19 19 2 1 8192 1 64
$$ 1 -1044 
$$ 0 
$$ z2x2y2 7 1 19 19 19 2 1 8192 1 64
$$ 1 -4362 
$$ 0 
$$ z2c 7 1 19 19 19 2 1 8192 1 64
$$ 1 196 
$$ 0 
$$ z2x3 7 1 19 19 19 2 1 8192 1 64
$$ 1 0 
$$ 0 
$$ z3x 7 1 19 19 19 2 1 8192 1 64
$$ 1 2326 
$$ 0 
$$ z3 7 1 19 19 19 2 1 8192 1 64
$$ 1 -89 
$$ 0 
$$ z2y3 7 1 19 19 19 2 1 8192 1 64
$$ 1 0 
$$ 0 
$$ z3c 7 1 19 19 19 2 1 8192 1 64
$$ 1 0 
$$ 0 
$$ z3x3 7 1 19 19 19 2 1 8192 1 64
$$ 1 0 
$$ 0 
$$ z3x2y2 7 1 19 19 19 2 1 8192 1 64
$$ 1 0 
$$ 0 
$$ z3xy 7 1 19 19 19 2 1 8192 1 64
$$ 1 0 
$$ 0 
$$ z5 7 1 19 19 19 2 1 8192 1 64
$$ 1 -2314 
$$ 0 
$$ z4x 7 1 19 19 19 2 1 8192 1 64
$$ 1 -176 
$$ 0 
$$ z4 7 1 19 19 19 2 1 8192 1 64
$$ 1 -8574 
$$ 0 
$$ z3y3 7 1 19 19 19 2 1 8192 1 64
$$ 1 0 
$$ 0 
$$ z4c 7 1 19 19 19 2 1 8192 1 64
$$ 1 0 
$$ 0 
$$ z4xy 7 1 19 19 19 2 1 8192 1 64
$$ 1 0 
$$ 0 
$$ z4x2y2 7 1 19 19 19 2 1 8192 1 64
$$ 1 0 
$$ 0 
$$ z4y 7 1 19 19 19 2 1 8192 1 64
$$ 1 2851 
$$ 0 
$$ z7 7 1 19 19 19 2 1 8192 1 64
$$ 1 636 
$$ 0 
$$ z5y 7 1 19 19 19 2 1 8192 1 64
$$ 1 0 
$$ 0 
$$ z5x 7 1 19 19 19 2 1 8192 1 64
$$ 1 0 
$$ 0 
$$ z6 7 1 19 19 19 2 1 8192 1 64
$$ 1 -3898 
$$ 0 
$$ zx2y2 7 1 19 19 19 2 1 8192 1 64
$$ 1 -3946 
$$ 0 
$$ zoom 7 1 32767 0 0 4 1 0 1 64
$$ 1 0 
$$ 0 
$$ z8 7 1 19 19 19 2 1 8192 1 64
$$ 1 0 
$$ 0 
$$ zxy 7 1 19 19 19 2 1 8192 1 64
$$ 1 -1912 
$$ 0 
$$ zx3 7 1 19 19 19 2 1 8192 1 64
$$ 1 510 
$$ 0 
$$ zy3 7 1 19 19 19 2 1 8192 1 64
$$ 1 9709 
$$ 0 
$$ 
##$PARAMETERFILE=	(text, ASCII, w:/d71612/Dec09153816/PROTON_01.fid/text, 0)
$$ AW:SA-165-2
$$ 
##XUNITS=	HZ
##YUNITS=	ARBITRARY UNITS
##FIRSTX=	9778.7791748046875
##LASTX=	-1381.9346923828125
##XFACTOR=	-0.085150138987171081206
##YFACTOR=	5.1889300537109376795e-07
##NPOINTS=	131072
##XYDATA=	(X++(Y..Y))
$$ [...]
-27845A43844n0480n0481m681m681l7121l7122J4401J4402m5709M5888J85192J998j25798
$$ 143844 93364 42883 38202 33521 -3600 -40722 -26321 -11919 -57628 -11740 173452 175450 49652
-27832D9652N7398n576r7174q2860q2861L1636K14830O7893k3705Q5068r8128k45064O0260
$$ 49652 107050 101474 4300 -78560 -161421 -129785 85045 152938 129233 214301 116173 -128891 -68631
-27819f8631J23233n9961L87R1985k8237k8237N7636j25558r1210R1986N158j78037N2865
$$ -68631 54602 -5359 -4972 87013 58776 30539 88175 -37383 -128593 -36607 -31449 -209486 -156621
-27806a56621J44463Q7214Q7215m4458m4457q289q289o5536o5538O9950j13244j09428J95897
$$ -156621 -12158 75056 162271 117813 73356 65067 56778 -8758 -74296 -4346 -117590 -227018 -31121
-27793c1121K06869r8456j82419J22905O9473j13721o0290J22905O4941j18253p2455J10739
$$ -31121 175748 77292 -105127 17778 87251 -26470 -86760 36145 101086 -17167 -89622 21117
-27781B1117P6391j06803m9556J33639n6712n6711J1986J1987j59759K3436J15034o8162J59907
$$ 21117 97508 -9295 -58851 74788 18076 -38635 -26649 -14662 -174421 -150985 -35951 -104113 55794
-27768E5794J59908j87399j87398J25559J25558j5654j5654j69747J3448J77558n635p0517
$$ 55794 215702 28303 -159095 -33536 92022 76368 60714 -109033 -95585 81973 76338 5821
-27756E821J12678R631j73563R6158R6160j82449P46J27645n5549J3149J3149q6319q6320
$$ 5821 118499 128130 -45433 50725 146885 -35564 -34818 92827 37278 50427 63576 -22743 -109063
-27743a09063O6343O6342M9168M9168j03495j03493M7409M7408J610J610L1188L1189o0409
$$ -109063 -42720 23622 72790 121958 18463 -85030 -37621 9787 11397 13007 44195 75384 14975
-27730A4975o0408L0950L0949L0950L0950p7823p7821P4841P4839q6587q6589N010N009O2258
$$ 14975 -45433 -14483 16466 47416 78366 543 -77278 -2437 72402 -14185 -100774 -95764 -90755 -28497
-27716b8497O2257k9340k9339o9653o9652R4460R4459r0642R2550J80333j24992k49686N5638
$$ -28497 33760 4420 -24919 -94572 -164224 -69764 24695 -65947 26603 206936 81944 -167742 -112104
-27703a12104K42649N9455j09428j09427L1784L1785n6234n6235j0436j0436K6776K6775l756
$$ -112104 130545 190000 80572 -28855 2929 34714 -21520 -77755 -88191 -98627 -71851 -45076 -48832
-27690d8832J79437O9950k35373j59044K68411J54869j50456m3592m3592j7830j7831K7968
$$ -48832 130605 200555 -34818 -193862 74549 229418 78962 35370 -8222 -26052 -43883 -15915
-27678a5915K7968o56o56m6454m6455L1547L1546L1545L1546o0050o0051R2610R2612m9079
$$ -15915 12053 11397 10741 -35713 -82168 -50621 -19075 12470 44016 -16034 -76085 16525 109137 60058
-27664F0058m9079r4876r4878K9161K9161P4960P4959j5207j5205j5207j5207K5822K5820
$$ 60058 10979 -83897 -178775 -149614 -120453 -45493 29466 14259 -946 -16153 -31360 -5538 20282
-27651B0282K5822K5821n3372n3371m1923m1923m0014J43181Q5931k19392j72222K55233J78900
$$ 20282 46104 71925 18553 -34818 -76741 -118664 -158678 -15497 70434 -148958 -321180 -65947 112953
-27638A12953j26423j7651J65543N4863j28332o2496o2496J7652J7651o202o202L9597L9596
$$ 112953 -13470 -31121 134422 189285 60953 -1543 -64039 -46387 -28736 -34938 -41140 -1543 38053
-27625C8053n8440n8441L3156L3157M3651M3652M3652M3652q7543q7541M055M055O1302O1304
$$ 38053 -20387 -78828 -45672 -12515 31136 74788 118440 162092 74549 -12992 -8937 -4882 56420 117724
-27611A17724r1359r1358J8606J8605J8606J8605L339L340L339L340K7909K7908o3689o3688
$$ 117724 26365 -64993 -46387 -27782 -9176 9429 12768 16108 19447 22787 50696 78604 14915 -48773
-27597d8773k9340k9340k9339k9340R6249R6248M651M652o2138o2138R0523R0524o4285o4284
$$ -48773 -78113 -107453 -136792 -166132 -69883 26365 31016 35668 -26470 -88608 1915 92439 28154 -36130
-27583c6130K7312K7311j7532j7532j7532j7532K2720K2721k3079k3078N9931N9932l1665
$$ -36130 -8818 18493 961 -16571 -34103 -51635 -28915 -6194 -29273 -52351 7580 67512 35847
-27570C5847l1666k5224k5225O6371O6373j05372j05373J08354J08354Q051Q050q3547q3546
$$ 35847 4181 -21043 -46268 20103 86476 -18896 -124269 -15915 92439 100490 108540 24993 -58553
-27557e8553J3776J3775J3776J3775L3573L3574n8024n8023N4564N4565l7032l7032k8445
$$ -58553 -44777 -31002 -17226 -3451 30122 63696 5672 -52351 2213 56778 19746 -17286 -45731
-27544d5731k8446R721J92914J7354j65841j02869j1271M3116M3115m2757m2758Q8914Q8913
$$ -45731 -74177 -64456 128458 145812 -20029 -122898 -134169 -91053 -47938 -90695 -133453 -44539 44374
-27531D4374o3747o3749M5262M5261m0609m0611l5840N5758J13005p0188r5474l876k1051
$$ 44374 -19373 -83122 -37860 7401 -33208 -73819 -109659 -53901 59104 -11084 -106558 -110434 -131485
-27518a31485k1051J2344J2345J03942J03940p4661p4661J6936J6936k2184k2183K3615K3615
$$ -131485 -152536 -140192 -127847 -23905 80035 5374 -69287 -52351 -35415 -57599 -79782 -56167 -32552
-27505c2552P2275P2276j9321j9322l0771l0771k147Q9451M7707j35488r5413Q7780Q2056
$$ -32552 39723 111999 92678 73356 42585 11814 9667 99118 146825 11337 -84076 3704 85760
-27492H5760j01138M7706J39305k4092j15690j2642j2643j9320j9321J33340J33341q2294
$$ 85760 -15378 32328 171633 147541 31851 19209 6566 -12754 -32075 101265 234606 152312
-27480A52312q2295R303R303r5652r5653N8918l2679p8240J04956J39304M7707q3010q3010
$$ 152312 70017 79320 88623 -7029 -102682 -43764 -76443 -154683 -49727 89577 137284 54274 -28736
-27467b8736k862k863N6353l5242n2418J30776J3417j69776j7115J66079p573j90768K6775
$$ -28736 -31598 -34461 21892 -13350 -65768 65008 78425 -91351 -108466 57613 50040 -140728 -113953
-27454a13953K6776m8602J34594J68942j36383j05193P8000L6019L6019K3615j59579p9433
$$ -113953 -87177 -135779 -1185 167757 31374 -73819 4181 40200 76219 99834 -59745 -139178
-27442a39178J03763Q7542r5652J10441J10442j66259j66259N3194N3193n069Q6528J43777
$$ -139178 -35415 52127 -43525 66916 177358 11099 -155160 -101966 -48773 -53842 32686 176463
-27430A76463l9418j42464n0868k4151O7446J66675j6518j63456J9739K7371K7372J53319
$$ 176463 137045 -5419 -56287 -80438 -12992 153683 137165 -26291 -6552 20819 48191 201510
-27418B01510k9877j52961L0235R8932k06392P335J90529j45326j45328J71446J71448m4189
$$ 201510 171633 18672 48907 147839 -58553 -51218 139311 -6015 -151343 20103 191551 147362
-27406A47362M7409J1152j72044k3198O8400l7987l7986l2261l2262N0748N0748m0849m0849
$$ 147362 194771 205923 33879 10681 79081 41094 3108 -29153 -61415 -10667 40081 -768 -41617
-27393d1617L519L518M9316M9318p3767p3767P8896P8895l668l667r5265r5265M4040M4040
$$ -41617 -38098 -34580 14736 64054 -9713 -83480 -4584 74311 70643 66976 -28289 -123554 -79514 -35474
-27379c5474M4038M4040p9521p9522P3141P3140j34861j34862J39931J39930J3507J3507p8090
$$ -35474 8564 52604 -26917 -106439 -33298 39842 -95019 -229881 -89950 49980 63487 76994 -1096
-27366a096p8090O5031O5029k6566k6566J8276J8278J8278J8278j14347j14348L8315L8314
$$ -1096 -79186 -14155 50874 24308 -2258 16018 34296 52574 70852 -43495 -157843 -119528 -81214
-27353h1214M1446M1444m352m353L8582L8583j14078j14080P1024P1024q1639q1639J08236
$$ -81214 -39768 1676 -2676 -7029 31553 70136 -43942 -158022 -86998 -15974 -97613 -179252 -71016
-27340g1016J08234r7858Q5335Q9630r3566j27913N5280o738o739O7683k3912p7345J05849
$$ -71016 37218 -60640 24695 114325 20759 -107154 -51874 -58612 -65351 2332 -21580 -98925 6924
-27327F924J05850p7345q4977O619R2491Q95j03315j1718J98192J4998j58655K4539N6980
$$ 6924 112774 35429 -49548 -42929 49562 50457 -52858 -64576 133616 148614 -10041 14498 71478
-27314G1478N6980l7480j29076l9388J43806O4613j18582r5682m085K3586J15182J68614j36710
$$ 71478 128458 90978 -38098 -77486 66320 130933 12351 -83331 -87416 -63830 51352 219966 83256
-27301H3256k01592J03733J13274o9921n3699L7896p901r9498n6563J26632J20907o2287j5595
$$ 83256 -118336 -14603 98671 28750 -24949 12947 5046 -94452 -151015 -24383 96524 34237 18642
-27288A8642j5594L5929n5667j20550O2646R6993N397m7080m7081L8792L8791M6425M6425
$$ 18642 3048 38977 -16690 -137240 -74594 22399 27796 -19284 -66365 -27573 11218 57643 104068
-27275A04068j06237j06238m0282m0283N1315N1315M3682M3681j9291P2305R84j82210k9549
$$ 104068 -2169 -108407 -148689 -188972 -137657 -86342 -42660 1021 -18270 54035 55019 -127191 -156740
-27262a56740J53647L7240n4355K0067K0065o8935J14257M1744j41451j49084J56240J63873
$$ -156740 -3093 34147 -20208 -141 19924 -49011 65246 106990 -34461 -183545 -27305 136568
-27250A36568j41450j83673J21653J31194n2001j0018Q1579k1468j13065L58L58n368n367
$$ 136568 -4882 -188555 -66902 64292 12291 2273 83852 62384 -50681 -50323 -49965 -55333 -60700
-27237f0700l1128l1129J21534J21532j9679j9679o5478o5477p275p276p275p275K8147K8147
$$ -60700 -91828 -122957 -1423 120109 100430 80751 15273 -50204 -57479 -64755 -72030 -79305 -51158 -23011
-27223b3011L3871L3872q2532R064P2037j11157l5780J47414P8717j2881J4789p6808l1010
$$ -23011 10860 44732 -37800 -28736 43301 -67856 -103636 43778 122495 109614 124403 47595 16585
-27210A6585l1009O202O202l9597l9597j0018j0019Q1580Q1578j22607j22607J52186J52185
$$ 16585 -14424 -8222 -2020 -41617 -81214 -91232 -101251 -19671 61907 -60700 -183307 -31121 121064
-27197A21064r9708r9707N2955N2954k4450k4449O7147O7147n9753n9752j3954j3955l3991
$$ 121064 21356 -78351 -25396 27558 3108 -21341 45806 112953 53200 -6552 -20506 -34461 -68452
-27184f8452l3991J81644R0047k29590m6395J73057j0138j13363O9830O4106j19087p4245
$$ -68452 -102443 79201 169248 -60342 -106737 66320 56182 -57181 12649 76755 -42332 -116577
-27172a16577J7354M5978M5977L5482L5482j0317j0317j1270j1271j1271j1270M8750M8751
$$ -116577 -99223 -53245 -7268 28214 63696 53379 43062 31792 20521 9250 -2020 46730 95481
-27159I5481j03911j03913R631R631O1155O1153n9543L2052J02660q0536j83582J21743R3117
$$ 95481 -8430 -112343 -102712 -93081 -31926 29227 -30316 1736 104396 23860 -159722 -37979 55138
-27146E5138r0076j1241Q0356j37187m5590J82449p45r8067Q5126M9347j33847p0875K0723
$$ 55138 -34938 -46179 34177 -103010 -148600 33849 33104 -64963 20163 69510 -64337 -135212 -114489
-27133a14489l4618l4617J23770J23769M771M770M771M771j09726j09726M2937M2936J1927
$$ -114489 -149107 -183724 -59954 63815 68586 73356 78127 82898 -26828 -136554 -93617 -50681 -38754
-27120c8754J1926J1927J1927j6697j6698j6697j6698J1867J1867J1867J1868p1144p1143
$$ -38754 -26828 -14901 -2974 -19671 -36369 -53066 -69764 -57897 -46030 -34163 -22295 -93439 -164582
-27107a64582Q1520Q1519j1509j1509R7261N666o2079J21116j8188k01383q3428K21897N0152
$$ -164582 -83062 -1543 -13052 -24561 72700 78366 16287 137403 119215 -82168 -165596 56301 106453
-27094A06453j33042L5839L5840j35905M7290M7289j35905J8665J10264j8547j8546R5950
$$ 106453 -26589 9250 45090 -90815 -43525 3764 -132141 -113476 -3212 -21759 -40305 55645
-27082E5645M353r5532Q7661M7588j35607q9808R3386R3386q9808p0726J12469K0872j62323
$$ 55645 59998 -35534 52127 99715 -35892 -125700 -32314 61072 -28736 -99462 13007 33879 -128444
-27069a28444J6101J99296K7551K7551L4051j49145j45327J59997J49502j55823p9491J03702
$$ -128444 -112343 86953 114504 142055 176106 26961 -118366 41631 191133 35310 -44181 59521
-27057E9521J25649n7547r5712r5712O56O56J09428J7830j23799N9395J41451j63873j83911
$$ 59521 185170 127623 31911 -63801 -63145 -62489 46939 64769 -59030 365 141816 -22057 -205968
-27044b05968J21415J80570k624R8038O441j59580K3615M0789j42404l9359J43836N6772N6771
$$ -205968 -84553 96017 93393 191431 197872 38292 61907 102696 -39708 -79067 64769 121541 178312
-27031A78312L7689j45507j45506J59818P9671j03524L578L578j22368O0825J26663n6533
$$ 178312 216001 70494 -75012 84806 164477 60953 64531 68109 -54259 6566 133229 76696
-27019G6696q5156O440J5265J5267k4808k4807R0643R0643j84148j84150K04425K04424j31433
$$ 76696 -8460 -2020 13245 28512 3704 -21103 69540 160183 -23965 -208115 -3690 200734 69301
-27006F9301j31432K3138K3138o8460o8459K5583K5583Q8556l041n5520J27676Q7602r5593
$$ 69301 -62131 -38993 -15855 -84315 -152774 -127191 -101608 -13052 -16093 -71613 56063 143665 48072
-26993D8072j82181J014J51767O0171m3831m3830m9556m9556O5419O5417k6178k6179Q8316
$$ 48072 -134109 -133095 18672 78843 35012 -8818 -58374 -107930 -42511 22906 -3272 -29451 58865
-26980E8865Q8318l280l280r7978r7978q6528q6529N4684K37879k7372j18969J253J252K4152
$$ 58865 147183 143903 140623 42645 -55333 -141861 -228390 -173706 64173 36801 -82168 -80915 -79663 -55511
-26966e5511J15748N9455j23739k6418O5179K8922o2675n426n426l1189l1189l1188l1189
$$ -55511 60237 119692 -4047 -30465 34714 63636 961 -4465 -9891 -41080 -72269 -103457 -134646
-26953a34646O4942O4941O4940O4942j39244j39246P6391j5206l280J79914k8087k11282k1409
$$ -134646 -69704 -4763 60177 125119 -14125 -153371 -76980 -92186 -95466 84448 56361 -154921 -176330
-26940a76330J61787n5758n5757J53437k9757q7005R6188J42942m0252o6969o6968j4968J68226
$$ -176330 -14543 -70301 -126058 27379 -2378 -89383 6805 149747 109495 42526 -24442 -39410 128816
-26927A28816K1289j61905n7904L3693l5005l5005Q4978o619l1427J51767K02338j02988j86952
$$ 128816 150105 -11800 -69704 -36011 -71016 -106021 -21043 -27662 -59089 92678 295016 192028 5076
-26914E076l757J00721q2473p6748J06445j7592j09188M5381M5380n3848n3849n3850n3849
$$ 5076 1319 102040 19567 -57181 49264 31672 -77516 -32135 13245 -40603 -94452 -148302 -202151
-26901b02151P5914P5914q6290N307L04430q95k06988k3794P1620j9977J00244Q647j02391
$$ -202151 -126237 -50323 -136613 -131306 173124 172229 -34759 -58553 13067 -6910 93334 101981 -410
-26888d10j0793o8043o8042J32328J32326j44372n2776J15390o7803j0555Q1042L1427L1427
$$ -410 -11203 -79246 -147288 -14960 117366 -27006 -79782 35608 -32195 -42750 38292 69719 101146
-26875A01146J28749j76576j69359J3835L4826n6771N3909N3909M8183M8184p5615p5615J5982
$$ 101146 229895 53319 -116040 -102205 -67379 -124150 -70241 -16332 31851 80035 4420 -71195 -55213
-26862e5213J5982K624K623q825q826R8991q4202r5653Q7543Q7541r5651q9928R3267N5578
$$ -55213 -39231 -36607 -33984 -42809 -51635 47356 -36846 -132499 -44956 42585 -53066 -142994 -49727 5851
-26848E851l6018l6019N5579J39542m3652j96314j3119J24872L3276n2596L9000L3275n8321
$$ 5851 -30167 -66186 -10607 128935 85283 -111031 -124150 722 33998 -18598 20402 53677 -4644
-26835d644j15570O7625J14376o8816o8818J14377L9001j44194l5422N6175K9995K9995n5876
$$ -4644 -120214 -52589 61787 -7029 -75847 38530 77531 -66663 -102085 -45910 -15915 14080 -41796
-26822d1796n5877L2859L2858l0115O1482N7427j25767l4170J49024J4491p7106L1665L1665
$$ -41796 -97673 -64814 -31956 -62071 -589 56838 -68929 -103099 45925 60416 -16690 14975 46640
-26809D6640K1767K1766j32803m1208O8520j14676k3078J60116P4005j7592J4849j68345r3924
$$ 46640 68407 90173 -42630 -83838 -15318 -129994 -153072 7044 81049 63457 78306 -90039 -183963
-26796a83963K11401N3015k52310P0487J62084j75680P513J78305m890q5037R8156l9716l9715
$$ -183963 27438 80453 -171857 -101370 60714 -114966 -107453 70852 65962 -19075 79081 39365 -350
-26783c50J7531J7533l5899l5900q1698q1698J41869J41868j0794j0794l7510l7508J9738
$$ -350 17181 34714 -1185 -37085 -118783 -200481 -58612 83256 72462 61668 24158 -13350 6388
-26770F388J9738j36739M6455J34235j71089n7547K47778O8400j14795N0510N0510k35732
$$ 6388 26126 -110613 -64158 70077 -101012 -158559 89219 157619 42824 93334 143844 -91888
-26758i1888n2538J91722j13601p5437K29888Q8914k16411q2831J00364J02271J02272J4491
$$ -91888 -144426 47296 -66305 -141742 88146 177060 -39351 -122182 -21818 80453 182725 197216
-26746A97216j68704p0844J12349k147k147n3670n3670L7927L7927L9358L9358P7524k27800
$$ 197216 28512 -42332 70017 67870 65723 12053 -41617 -3690 34237 73595 112953 190477 -37323
-26733c7323p1322K34002o1781k44975N0809J42404j2164j2165P871P871N3670N3671j11157
$$ -37323 -108645 125357 63576 -181399 -130590 11814 -350 -12515 -4644 3227 56897 110568 -589
-26720e89j11157R6845R6845l340r4936j06387P6809Q3665p931J00841J00840j40557j40556
$$ -589 -111746 -14901 81944 78604 -16332 -122719 -45910 37755 29824 130665 231505 90948 -49608
-26707d9608J2106J2106J6399J6398n9931J23263J25171j80154j34354J70969J17777o5418
$$ -49608 -37502 -25396 -8997 7401 -52530 70733 195904 15750 -118604 52365 170142 104724
-26695A04724K8087o3510k32392m9198J16823J16822Q1042Q1043j0556j0555q6886q6886M711
$$ 104724 132811 69301 -163091 -212289 -95466 21356 102398 183441 172885 162330 75444 -11442 -6731
-26682f731M711m7349m7349M4248M4248N9514N9514k68709q5515K67994Q4799k58691M6634
$$ -6731 -2020 -49369 -96718 -52470 -8222 51292 110806 -157903 -243418 24576 109375 -149316 -102682
-26669a02682J25827n7367J789J84983o3450j55047O0588O0587N2000N2001j00662j00661
$$ -102682 23145 -34222 -32433 152550 89100 -65947 -5359 55228 107228 159229 58567 -42094
-26657d2094P7046P7047j4551j4550l9359l9358k7908k7908j0198J72997L9418k65906O8042
$$ -42094 34952 111999 97448 82898 43539 4181 -23727 -51635 -61833 111164 150582 -115324 -47282
-26644d7282K51237j45686j45685R8813R8813n3849n3850r1060r1061P3052P3051j14318O8877
$$ -47282 203955 58269 -87416 11397 110210 56361 2511 -88549 -179610 -106558 -33507 -147825 -78948
-26631g8948K02457j02869q4739K20585O0290k45035n784J77410l6317l6317m3951m3949J08712
$$ -78948 123509 20640 -64099 156486 216776 -28259 -34043 143367 107050 70733 26782 -17167 91545
-26618I1545J08712j42584j42584P1143P1143j0913j0913j0913j0913l5482l5482N6116N6114
$$ 91545 200257 57673 -84911 -13768 57375 46462 35549 24636 13723 -21759 -57241 -1125 54989
-26605E4989m8840m8839J03821J03823r7501r7501N5161N5161J1271J1271j41391j41392L1307
$$ 54989 6149 -42690 61131 164954 67453 -30048 25113 80274 91545 102816 -38575 -179967 -148660
-26592a48660L1308L1308L1308L0353L0353J33401m9794k2542k2541p9790p9790J21533J21534
$$ -148660 -117352 -86044 -54736 -24383 5970 139371 89577 67035 44494 -35296 -115086 6447 127981
-26579A27981k14323l1129K44856o0469j32983N0212m1386m1386J22726J22726p5019p5018
$$ 127981 -86342 -117471 127385 66916 -66067 -15855 -57241 -98627 24099 146825 71806 -3212
-26567c212J6577J6578K3257K3257j37037M6156J05313p7882o6431J16762j2046j2046n97
$$ -3212 13365 29943 53200 76457 -60580 -14424 90889 13007 -53424 63338 51292 39246 38649
-26554C8649n96m4903m4904m4905m4904L5244L5243q6886R6308J91245j14079l3931J49262
$$ 38649 38053 -6850 -51754 -96659 -141563 -106319 -71076 -157962 -61654 129591 15512 -18419 130843
-26541A30843j90410j90411K29412K29411j83375j79J02869q0327q9867R3326k1170k1170
$$ 130843 -59567 -249978 -20566 208845 25470 25291 128160 47833 -42034 51292 30122 8952
-26529H952O9235O9235l3813l3812N4923j28273q2472J00720j18611j18611J67630J67630
$$ 8952 78187 147422 113609 79797 134720 6447 -76025 24695 -93916 -212527 -44897 122733
-26517A22733j97804j97806J99118J99116j09309j09308M3354M3354Q1519Q1519j32208j32208
$$ 122733 -75071 -272877 -73759 125357 16048 -93260 -49906 -6552 74967 156486 24278 -107930
-26505a07930J24813J24814k7849k7849r3684r3685k087k087N0629N0629M829M831O3033O3033
$$ -107930 16883 141697 113848 85999 -7685 -101370 -103457 -105544 -54915 -4286 543 5374 68407 131440
-26491A31440q9630q9629O1303O1304m1744m1743R4698q8496n4147J29046K8863j54331n1286
$$ 131440 41810 -47819 13484 74788 33044 -8699 85999 -2497 -56644 72402 101265 -53066 -104352
-26478a04352J31910J0734J0734n7963n7965j8605J64588K3377j59818n6772J26423J14974
$$ -104352 27558 38292 49026 -8937 -66902 -85507 79081 102458 -57360 -114132 12291 127265
-26466A27265o8221k0037k0037k0036k0037j32625N0569J53616k9578j13781O9414m5083m5083
$$ 127265 59044 39007 18970 -1066 -21103 -153728 -103159 50457 20879 -92902 -23488 -68571 -113654
-26453a13654J7890J7890J09487J09487j15689j15689J09487J09488j70075J3119J39065j66258
$$ -113654 -95764 -77874 31613 141100 25411 -90278 19209 128697 -41378 -28259 110806 -55452
-26441e5452j41571M1625p991p991K82067k3257j87369J17955Q7662r5534j9201j9202L9000
$$ -55452 -197023 -155398 -163389 -171380 110687 87430 -99939 18016 105678 10144 -9057 -28259 10741
-26428A0741L9000j13661j13662R7621R7619n5041n5042n0271n0272J02392J02390m7646m7648
$$ 10741 49741 -63920 -177582 -79961 17658 -37383 -92425 -142696 -192968 -90576 11814 -35832 -83480
-26415h3480j848j849O5895O5895k5702k5702m1564m1565K33227N0033l29715k4390L34366
$$ -83480 -85328 -87177 -21282 44613 18911 -6791 -48355 -89920 143307 193340 -136375 -160765 173601
-26402A73601r3089k31438J96016L1904j51290J24455J24456j61787j61786R1747R1746M5948
$$ 173601 80512 -150926 45090 76994 -74296 50159 174615 12828 -148958 -57211 34535 80483
-26390H0483M5948j21982j21980p2365J10829M4040M4038R691R690M8811M8810j03852j03852
$$ 80483 126431 4449 -117531 -189896 -79067 -35027 9011 18702 28392 77203 126013 22161 -81691
-26377h1691J02957J02958j10770j10769Q9600Q9599j998j997q4530q4531q4532q4531J84537
$$ -81691 21266 124224 13454 -97315 -7715 81884 79886 77889 -6641 -91172 -175704 -260235 -75698
-26364g5698J84537m0641m0640M0014j43180j968J81226L9061j44134J6159J6161M1446M1445
$$ -75698 108839 68198 27558 67572 -75608 -77576 103650 142711 -1423 14736 30897 72343 113788
-26351A13788j64648J8546J30180n3015j21711J83611N5520j27677N904N904j33400M9794
$$ 113788 -50860 -32314 97866 44851 -76860 106751 162271 34594 40498 46402 -86998 -37204
-26339c7204J41391m1803l2978l2976n5877n5877K09373K6180p6868J06327l966j87160R1448
$$ -37204 104187 62384 29406 -3570 -59447 -115324 94049 120229 43361 149688 145722 -41438 50010
-26326E0010R1448k13876l0681K09761r5563j36829J68494N7815k47509J15063J15063j90261
$$ 50010 141458 -72418 -103099 106662 11099 -125730 42764 100579 -146930 -31867 83196 -107065
-26314a07065j90262K14533L1338p1710J11485J01944q1252L3246L3246o6939o6938K4659
$$ -107065 -297327 -82794 -51456 -123166 -11681 90263 9011 42257 75503 8564 -58374 -33715
-26302c3715K4658m9764m9765M1834M1833j7294j7294J96433J3239k31021P4304J65900j39424
$$ -33715 -9057 -58821 -108586 -66752 -24919 -42213 -59507 136926 150165 -80856 -6552 159348 19924
-26289A9924l2559J50634o3092o3093j7293j7293j7294j7294L0413L0412L0414L0413N606
$$ 19924 -12635 137999 74907 11814 -5479 -22772 -40066 -57360 -26947 3465 33879 64292 69898
-26276F9898N605N606N605r0761r0763J22964J22965p1680p1680J9918J9918j0675j0674j0675
$$ 69898 75503 81109 86714 -4047 -94810 28154 151119 79439 7759 27677 47595 36920 26246 15571
-26262A5571j0674K9399K9400n0749n0747p6510J06685R5234R5235l9299l9298O500O500r4400
$$ 15571 4897 34296 63696 12947 -37800 -114310 -7625 87609 182844 143545 104247 110747 117247 22847
-26248B2847r4400Q647Q647o0051J23143J11694j93630l1905J51291j6638j6638O5418O5419
$$ 22847 -71553 -62906 -54259 -114310 8833 120527 -73103 -105008 46283 29645 13007 78425 143844
-26235A43844q7245q7243p753p752L8047L8045m3055m3055M8542M8541l5900l5899N5697N5698
$$ 143844 56599 -30644 -38397 -46149 -8102 29943 -13112 -56167 -7625 40916 5016 -30883 24814 80512
-26221H0512j61845j61846J12946J12947n4267n4267L7331L7331J3477J3477o6670o6671l0413
$$ 80512 -81333 -243179 -130233 -17286 -71553 -125820 -88489 -51158 -37681 -24204 -90874 -157545 -187958
-26208a87958J52782J18432o4763r0523R2670Q707j74488k2661K82664O8936k36387n0331
$$ -187958 -35176 83256 18493 -72030 20640 29347 -145141 -167802 114862 183798 -52589 -102920
-26196a02920J32863K2184j61011K7909K7909k9340k9340K6000K6001K6000K6000J0018J0018
$$ -102920 29943 52127 -108884 -80975 -53066 -82406 -111746 -85746 -59745 -33745 -7745 2273 12291
-26183A2291l5779l5780Q5394Q5396o7267o7266R3505R3506n725j88919p5377J07817o678
$$ 12291 -23488 -59268 26126 111522 44255 -23011 70494 164000 158275 -30644 -106021 1796 -4882
-26170d882o679N784N784N1583N1583J8189J8188M8721j34475k12235R3088J15987o7207o6253
$$ -4882 -11561 -5777 7 51590 103173 121362 139550 188271 53796 -158439 -65351 50636 -16571 -82824
-26156h2824J16941m3353m3353P8775P8776o2436o2436j10144P3052J64648j8546j2822j2821
$$ -82824 34117 -9236 -52589 26186 104962 42526 -19910 -130054 -57002 107646 89100 76278 63457
-26143F3457p0069p0069O8280O8280l4766l4766J36024m7170j57850j57851J57016J57015
$$ 63457 -6612 -76681 -8401 59879 25113 -9653 126371 79201 -78649 -236500 -79484 77531
-26131G7531l280j86474o3391J19804J19804o3391q5335R7858P4960P4960k0693k0693j69538
$$ 77531 74251 -112223 -175614 -55810 63994 603 -84732 13126 88086 163046 142353 121660 -47878
-26118d7878J3656J40556J40557j22786j22786P7583P7584p5079p5079j2105j2105j2106j2106
$$ -47878 -34222 106334 246891 124105 1319 78902 156486 81407 6328 -5777 -17882 -29988 -42094
-26105d2094N2477N2478l9120l9119o0111o0111R2552R2551n1523n1523J62203J62204j92737
$$ -42094 10383 62861 23741 -15378 -75489 -135600 -43048 49503 -2020 -53543 108660 270864 78127
-26092G8127j92736L2441L2441k0037J63157R0644k14681j5266J67928j06864j06863J431
$$ 78127 -114609 -82168 -49727 -69764 93393 184037 -30644 -45910 122018 15154 -91709 -90278
-26080i0278J431o7267J15928M2459j40735O5359O5358j20639j20639R3088R3089j9501j9500
$$ -90278 -88847 -156114 -40186 2273 -138462 -73103 -7745 -128384 -249023 -155935 -62846 -82347 -101847
-26067a01847P2097P2097J0555J0555J0555J0556j849j849l6197l6198n5757J27437L5840
$$ -101847 -29750 42347 52902 63457 74012 84568 82719 80870 44673 8475 -47282 80155 115995
-26054A15995j47355K9161K9160p3885p3887N1107N1106L9655L9657N3015j30180k7134k7133
$$ 115995 -31360 -2199 26961 -46924 -120811 -69704 -18598 21057 60714 113729 -16451 -43585 -70718
-26041g0718j9083j9083j9083j9082J14497J14496m9616m9614J49322l3872j36918M6275L9596
$$ -70718 -89801 -108884 -127967 -147049 -32552 81944 32328 -17286 132036 98164 -38754 7521 47117
-26028D7117j43597m0551J42643l9953l9955J7294J7294P1678P1680j9917j9918k4211k4212
$$ 47117 -96480 -137031 5612 -34341 -74296 -57002 -39708 31970 103650 83733 63815 39604 15392
-26015A5392R0286r2910q3367R9826J79975l220k2243k2244k28337m5143O9355O9353j0794
$$ 15392 105678 12768 -70599 29227 209202 205982 183739 161495 -66842 -111985 -42630 26723 15929
-26002A5929j0794N3134N3134O4583j18611J3059J3060q9986q9988M7528M7529o6969J16225
$$ 15929 5135 58269 111403 175986 57375 70434 83494 -6492 -96480 -48952 -1423 -68392 47833
-25989D7833J3179j70015n904J77291m3116m3114l1665l1666O5657O5656k5941k5940o6790
$$ 47833 61012 -109003 -114907 62384 19268 -23846 -55511 -87177 -21520 44136 18195 -7745 -74535
-25976g4535o6790J35489J35487J908j81286J3358J3358n7248n7249R5414R5413L8166L8166
$$ -74535 -141325 -5836 129651 131559 -49727 -36369 -23011 -80259 -137508 -42094 53319 91485 129651
-25963A29651j14497j14496k7432k7431O4166O4166K5999K6000K6001K6000l8881l8881l8881
$$ 129651 15154 -99342 -126774 -154205 -90039 -25873 126 26126 52127 78127 39246 365 -38516
-25950c8516l8881o1781o1780P9432P9432J65424j7771o321o322j01734j01736N0928N0927
$$ -38516 -77397 -139178 -200958 -121526 -42094 123330 105559 99238 92916 -8818 -110554 -59626 -8699
-25937h699M6156M6156m5441m5440j3000j3000j3000j3000O6908O6909k4688k4689j1330j1331
$$ -8699 37457 83613 38172 -7268 -20268 -33268 -46268 -59268 7640 74549 49861 25172 13842 2511
-25923B511j1329j1331K6835K6835K6835K6835k4688k4688j3239j3239j84566j371J70374
$$ 2511 -8818 -20149 6686 33521 60356 87191 62503 37815 24576 11337 -173229 -174600 -4226
-25910d226J70373p1978p1978Q0684Q0685r4401r4399J72758j0436k06988k3794P5436P5437
$$ -4226 166147 94169 22191 102875 183560 89159 -5240 167518 157082 -49906 -73700 1736 77173
-25897G7173k0454k0455k0454k0454M0610M0611j00602j00602o7685J15511J2464J2463m711
$$ 77173 56719 36264 15810 -4644 35966 76577 -24025 -124627 -192312 -76801 -64337 -51874 -56585
-25884e6585m711P5436P5437r482j92676m0014J43181p574p573L876L876Q3546Q3547o9116
$$ -56585 -61296 14140 89577 80095 -112581 -152595 -9414 -16988 -24561 -20685 -16809 66737 150284 81168
-25870H1168o9115J6757J6757J6757J6757m0372m0371k8922k8923m115J79080L7867j45327
$$ 81168 12053 28810 45567 62324 79081 38709 -1662 -30584 -59507 -63622 115458 153325 7998
-25857G998r4280Q8913k5582k5583M949M950M950M949j2344j2344P9252P9254k5703k5702
$$ 7998 -86282 2631 -22951 -48534 -43585 -38635 -33685 -28736 -41080 -53424 25828 105082 79379 53677
-25843E3677k5702k5702k0931k0931k0932k0931Q2115Q2116M3950j39244j06447P6749N3848
$$ 53677 27975 2273 -18658 -39589 -60521 -81452 663 82779 126729 -12515 -118962 -42213 11635
-25830A1635N3850N3849N3850k74375r1180K52310O9115l0115l0115j02629j02630J22548
$$ 11635 65485 119334 173184 -101191 -192371 59939 129054 98939 68824 -33805 -136435 -13887
-25818a3887J22547j52960L0234J21831o1363M7409M7409j05254j05253j4610J68584O5537
$$ -13887 108660 -44300 -14066 107765 46402 93811 141220 35966 -69287 -83897 84687 150224
-25806A50224O5538m1326m1326m1327m1326k6776k6774m9675J33519J9023j64171J02987J02988
$$ 150224 215762 174436 133110 91783 50457 23681 -3093 -52768 80751 99774 -64397 38590 141578
-25793A41578k8684k8684k8684k8684L757L757p693p693R0882r2313j03762P9432O6074j17120
$$ 141578 112894 84210 55526 26842 30599 34356 26663 18970 109852 17539 -86223 -6791 59283 -57837
-25779e7837k5523J57671O7982j15212p16p16K6001K6000K6000K6001j1211j1212j02808j02808
$$ -57837 -83360 74311 142293 27081 26365 25649 51650 77650 103650 129651 118440 107228 4420 -98388
-25765i8388K6954K6955J5505J5504J38589m4607j47652L5542J55762k7431o5597o5597L3574
$$ -98388 -71434 -44479 -28974 -13470 125119 80512 -67140 -31598 124164 96733 31136 -34461 -887
-25752h87L3573n8023n8023J28987J28988j45805j45804J02749J02748O4584j18612q7124
$$ -887 32686 -25337 -83360 45627 174615 28810 -116994 -14245 88503 153087 34475 -52649
-25740e2649R6069J30419n2775j8427j8427j8427j8427n8500J24694M4546j38649n3252J29942
$$ -52649 43420 173839 121064 102637 84210 65783 47356 -11144 113550 158096 19447 -33805 96137
-25727I6137l0354l0354O0290O0290o1840J21355N1881k53444k0632J62561j17956j17955
$$ 96137 65783 35429 95719 156009 94169 215524 267405 13961 -6671 155890 37934 -80021
-25715h0021J07221J07222j22727j22726K9937K9936p275p276p275p275O0945O0945J5147
$$ -80021 27200 134422 11695 -111031 -81094 -51158 -58433 -65709 -72984 -80259 -19314 41631 56778
-25702E6778J5147m8780m8780M2816M2817m1147m1146m1148m1147P3350P3348p9312p9313
$$ 56778 71925 23145 -25635 17181 59998 18851 -22295 -63443 -104590 -31240 42108 -37204 -116517
-25689a16517N3611N3611N3610N3611j08593j08593J05135J05133o0886o0885J45207l7987
$$ -116517 -62906 -9295 44315 97926 -10667 -119260 -14125 91008 30122 -30763 114444 76457
-25677G6457q5693R7501j6996j6995o8757o8758L0473K13667n785j88978Q9628Q9630j98997
$$ 76457 -9236 88265 71269 54274 -14483 -83241 -52768 160899 155114 -33864 55764 145394 -53603
-25664e3603j5803J36859m6336j3895j3893k5345k5344N0674N0673m0924m0923J02197J02197
$$ -53603 -69406 67453 21117 7222 -6671 -32016 -57360 -6686 43987 3063 -37860 64337 166534
-25651A66534n8098k41293L3500K16693j11530j11529J20325J20326r3401r3401J7995J7994
$$ 166534 108436 -132857 -99357 117336 5806 -105723 14602 134928 41527 -51874 -33879 -15885
-25639a5885j6354j6355j00319Q2876J28674n4520M8050M8050j3015j96210m6410m6410Q3354
$$ -15885 -32239 -48594 -148913 -66037 62637 8117 56167 104217 91202 -105008 -151418 -197828 -114474
-25626a14474Q3353P4482j08712k8565J54630J11694p1501m8601m8602L399L399m2398m2400
$$ -114474 -31121 43361 -65351 -93916 60714 172408 100907 52306 3704 7103 10502 -31896 -74296
-25613g4296J26482J26484j36860j36859k2362J60831l3812l3812k325k326m8125m8124J61308
$$ -74296 52186 178670 41810 -95049 -117411 43420 9608 -24204 -26529 -28855 -76980 -125104 36204
-25600C6204J61310k27979m4785J41271m1922p574p573j18954O4241K51251n4073l02149J25306
$$ 36204 197514 -30465 -75250 66021 24099 16525 8952 -110002 -45761 205490 151417 -150732 -25426
-25587b5426K01636j03688j49487L3708O4240O4241k6403k6403j75248P946J15526J15524
$$ -25426 176210 72522 -76965 -43257 20983 85224 58821 32418 -142830 -134884 -19358 96166
-25575I6166k5687k5687J5341J5340p6255p6257J03121J03122o0991o0991J41288m1908k21285
$$ 96166 70479 44792 60133 75473 -782 -77039 26082 129204 68213 7222 148510 106602 -114683
-25562a14683Q4039K02202j03121j14571j14572k8698J54496J88845j16480j33654M9541P6256
$$ -114683 -30644 171558 68437 -46134 -160706 -189404 -34908 153937 37457 -96197 -46656 29600
-25550B9600j06937K4733K4733J04880J04881j69196j69195N5981N5981r9544Q3652J63798
$$ 29600 -77337 -52604 -27871 77009 181890 12694 -156501 -100520 -44539 -144083 -60431 103367
-25538A03367j41525m8497J34697O9816j13379p6166p6167J26110J26110j17001j17001J57790
$$ 103367 -38158 -86655 48042 117858 4479 -71687 -147854 -21744 104366 -12635 -129636 28154
-25526B8154J57791j20818j20817r0286R2910K40323o5001j48964L4229N7129j26065j1569
$$ 28154 185945 65127 -55690 -145976 -53066 187257 122256 -26708 7521 64650 -61415 -72984
-25514g2984j1569M5918M5917M5918M5918o8579o8578K3019K3018j0853j0853R2193R2194
$$ -72984 -84553 -38635 7282 53200 99118 30539 -38039 -15020 7998 -2855 -13708 78485 170679
-25501A70679k47480o4285J60891k2302o9458J13735J0690j72505N2671N2672n0376n0375
$$ 170679 -76801 -141086 19805 -2497 -71955 41780 52470 -120035 -67364 -14692 -65068 -115443
-25489a15443N3148N3149l8449l8449o008o008Q5589Q5589L295L294J06343p6854p0174p0173
$$ -115443 -62295 -9146 -47595 -86044 -92052 -98060 -12471 73118 76413 79707 186050 109196 39022 -31151
-25475c1151R974R974L3826L3827P9626P9626r6890r6890n292n293K4331K4330o7266o7267
$$ -31151 -21177 -11203 22623 56450 136076 215702 118812 21922 16630 11337 35668 59998 -7268 -74535
-25461g4535P156P157P156P156N8678N8680l2918l2918K8148K8147K8147K8147r7084r7083
$$ -74535 -67379 -60222 -53066 -45910 12768 71448 38530 5612 33760 61907 90054 118201 21117 -75966
-25447g5966N5579N5578J192J193m4605m4606n009n010Q6588Q6588j24276j24277k5046J58149
$$ -75966 -20387 35191 36383 37576 -7029 -51635 -56644 -61654 24934 111522 -12754 -137031 -162077 -3928
-25433c928J29881n3312r1478r1478J39423J39424j3239j96433j28212J77111R6965q6231
$$ -3928 125953 72641 -18837 -110315 29108 168532 155293 -41140 -169352 7759 104724 18493
-25421A8493O0708O0707k78966r5772L03058J19864k15993l2799J80929k266j43479L9716
$$ 18493 79201 139908 -139058 -234830 68228 188092 -27901 -60700 120229 117963 -25516 14200
-25409A4200N0211N0212r1001r1001R6010R6011n6653n6652J01139J01139j12588j12588R3505
$$ 14200 64411 114623 23622 -67379 28631 124642 67989 11337 112476 213615 101027 -11561 81944
-25396H1944R3506o6790k49985r541J73653R541j73653N8203N8203R54R54k4331k4330k4331
$$ 81944 175450 108660 -141325 -150866 22787 32328 -141325 -83122 -24919 -23965 -23011 -47342 -71672 -96003
-25382i6003k4330P7762P7762j3835j3835K862K862K863K862j3358j3357P8239P8240o8102
$$ -96003 -120333 -42571 35191 21356 7521 10383 13245 16108 18970 5612 -7745 70494 148734 80632
-25368H0632o8102R2194r1001k7073J56120p991j91185L936L936J33698J33699k2780k05974
$$ 80632 12530 104724 13723 -13350 142770 134779 -56406 -52470 -48534 85164 218863 196083 -9891
-25355i891O1183O1184j80749K445J05491p7702r6785Q6409Q6409r6785n5758J27437J27437
$$ -9891 51292 112476 -68273 -65828 39663 -38039 -134824 -48415 37994 -58791 -114549 12888 140325
-25342A40325n5757j59759K3437O9233j13959O56J83850q3308q3308Q5574Q5575o7089o7087
$$ 140325 84568 -75191 -51754 17479 -96480 -95824 88026 4718 -78590 6984 92559 25470 -41617
-25329d1617J2106J2106J03702J03703o7088o7088k1289k1290K4212K4211K4212K4211q1699
$$ -41617 -29511 -17405 86297 190000 122912 55824 34535 13245 37457 61668 85880 110091 28392
-25316B8392q1697P0963P0965m5441m5440N7605j25588R2909R2909p1203p1202N4863N4863
$$ 28392 -53305 17658 88623 43182 -2258 55347 -70241 22668 115577 44374 -26828 28035 82898
-25303H2898R064R065j7652j7652o3450o3450N2001N2000M0551M0551P7763j05433j16882
$$ 82898 91962 101027 83375 65723 2273 -61177 -9176 42824 83375 123926 201689 96256 -20626
-25290b0626O6312Q2414j00781p7881p7882O5240O5238P6689j06505P7166P7166k5881k5881
$$ -20626 45686 128100 27319 -50562 -128444 -63204 2034 78723 -27782 49384 126550 100669 74788
-25277G4788r7441r7442J16286J16285m8676m8676k877k878M3876M3875L2426L2426J8114
$$ 74788 -22653 -120095 -3809 112476 63800 15124 12247 9369 53245 97120 129546 161972 180086
-25264A80086j65081K9563K9564p5391p5393K52832O9638k58110p4915J34995J34997R049
$$ 180086 15005 44568 74132 -1259 -76652 176180 245818 -12292 -87207 47788 182785 191834
-25252A91834j74146k1482J61711j19760j19758M4352M4352n4877n4878J58849J58850j26782
$$ 191834 17688 -3794 157917 38157 -81601 -37249 7103 -47774 -102652 56197 215047 88265
-25240H8265j26781R2670R2671r7203n606R7442q5753p4780J6817k5166O6431J91425j13901
$$ 88265 -38516 54154 146825 49622 44016 141458 55705 -19075 -2258 -27424 39007 230432 116531
-25227A16531j27257J78065M4964k60360j55406J49920J06982J5385j7055j7055J16524o6670
$$ 116531 -10726 167339 212303 -48057 -203463 -53543 53439 68824 51769 34714 151238 84568
-25215H4568j92617J12707J38470m4725o5717K5881N2970N2970K0529j62667j3820J69375
$$ 84568 -108049 4658 143128 98403 32686 58567 111537 164507 185036 22369 8549 177924
-25203A77924m4352k27547M0566K23760n1032k34226K4346K07540J04493p8702j4774j4774
$$ 177924 133572 -93975 -53409 170351 119319 -114907 -90561 116979 221472 142770 127996 113222
-25191A13222p2023p2022P171P171P171P171m4830m4830M6768M6767P5392P5392p7270p7270
$$ 113222 41199 -30823 -23652 -16481 -9310 -2139 -46969 -91799 -45031 1736 77128 152520 75250 -2020
-25177b020O8459O8460k3138k3138m055m056Q7543Q7543p2277p2276J9321J9322r2313r2313
$$ -2020 66439 134899 111761 88623 84568 80512 168055 255598 183321 111045 130366 149688 57375 -34938
-25163c4938O0349O0349M1505M1506m294m294l3872l3872j14019j14020O5359K48553j4789
$$ -34938 25411 85760 127265 168771 164477 160183 126311 92439 -21580 -135600 -70241 178312 163523
-25150A63523j97984k4330J58863J0019q1579M9138J40736j7652j09249P2992P2992q5396
$$ 163523 -34461 -58791 100072 110091 28512 77650 218386 200734 91485 164477 237469 152073
-25138A52073q5396L5304L5303j0496j0495j7175j7174P4423P4423o5896o5895K5702K5702
$$ 152073 66677 101981 137284 126788 116293 99118 81944 156367 230790 164894 98999 124701 150403
-25125A50403J6161J6161j2464j04061L1904K15100O2437j20759o0648L0950p7822p7822J05671
$$ 150403 166564 182725 170261 66200 98104 313204 375641 254882 194234 225184 147362 69540 175211
-25112A75211J05671m6991m6992l0771l0771J23800L2202j90112o918K01085J7891n1763n1762
$$ 175211 280882 233891 186899 156128 125357 249157 281359 91247 84329 285414 303305 251542 199780
-25099A99780j31910N1285J83255O0k69009q5812J57492O5896j8069j8069P215R8814P0189
$$ 199780 67870 119155 302410 302470 33461 -52351 105141 171037 152968 134899 142114 240928 311117
-25086C11117j13007k10327k7134J33162J33162j19506j19505R6129M532m5084J38112R2314
$$ 311117 198110 -12217 -39351 93811 226973 107467 -12038 84091 88623 43539 181651 273965
-25074B73965r0882p0368K1229j669j670O917q4680n0331J32865M8184m3414k6239k6238L7688
$$ 273965 183083 112715 133944 132275 130605 137522 52842 2511 135376 183560 140146 113907 87669 125357
-25060A25357L7689L7688L7689m2459m2460l1009l1010j13065P0129J67452j5744p4363J7234
$$ 125357 163046 200734 238423 195964 153504 122495 91485 -21580 48549 216001 200257 125894 143128
-25047A43128m5739m5739J05969J05969j07758j07758n666n665n1463n1464R601R601l6198
$$ 143128 97389 51650 157619 263588 155830 48072 42406 36741 -14722 -66186 -56585 -46984 -83182
-25034h3182l6197M7886M7886N3610N3610o5656K5940Q3189j00005m9436M2160k0811k0812
$$ -83182 -119379 -71493 -23607 30003 83613 17957 43897 127086 27081 -22355 19805 -1006 -21818
-25021b1818j8904j8904P2693P2693j04358j04359J11276J9679j25350N7845R2193N96k266
$$ -21818 -40722 -59626 13067 85760 -18598 -122957 -11681 7998 -117352 -59507 32686 33282 31016
-25008C1016k266Q9332Q9331j74011q2413J33221m9973r0345R2849K4152o7445J25290L3693
$$ 31016 28750 118082 207413 33402 -49011 84210 34237 -56108 36741 60893 -6552 118738 152431
-24995A52431j81942J252Q5693n904k3078k3078j04180P9015P9014j04179L5542L5540k1706
$$ 152431 -29511 -28259 57434 51530 28452 5374 -98806 -19791 59223 -44956 -9414 26126 4420
-24982D420k1706Q8019Q8019j25708j25707J30478J30479q3249q3249Q348Q349R9947R9946
$$ 4420 -17286 70733 158752 33044 -92663 37815 168294 85045 1796 10144 18493 118440 218386
-24969B18386j52007j52006O1722O1720m8005m8005M3592M3592l7509l7510Q289Q290m115
$$ 218386 66379 -85627 -23905 37815 -10190 -58195 -14603 28989 -8520 -46030 -37741 -29451 -33566
-24956c3566m115Q7482Q7483j60891j60892J74965J74965l6854l6853l6854l6854N9038N9037
$$ -33566 -37681 49801 137284 -23607 -184499 -9534 165431 128577 91724 54870 18016 77054 136091
-24943A36091l2560l2560l2560l2560l2559l2560J17239J17240r6488r6486P514P514N3311
$$ 136091 103531 70971 38411 5851 -26708 -59268 57971 175211 78723 -17763 -10249 -2735 50576
-24930E0576N3313j05074j05075M7588M7588K743K743K743K743M472M473M472M473J0197J0197
$$ 50576 103889 -1185 -106260 -58672 -11084 -8341 -5598 -2855 -112 4360 8833 13305 17778 27975 38172
-24915C8172J0198J0197m7051m7050M4545M4547j252j253j252j252l7331l7330N4266N4267
$$ 38172 48370 58567 11516 -35534 9011 53558 52306 51053 49801 48549 11218 -26112 28154 82421
-24901H2421M4725M4726J4192j69002j67570J37754K29351p5974j98102j4909P6688P6690
$$ 82421 127146 171872 186064 17062 -150508 -12754 216597 140623 -57479 -72388 4300 80990
-24889H0990L2575L2575n9023n9023K8759K8758o2839o2838P4556P4557j7040j7040k9445
$$ 80990 113565 146140 87117 28094 56853 85611 22772 -40066 34490 109047 92007 74967 45522
-24876D5522k9444J6355J6354j1733j1733P9865P9865j04285j04284j2687j2687N7918N7920
$$ 45522 16078 32433 48787 37054 25321 105186 185051 80766 -23518 -36205 -48892 9026 66946
-24863F6946N7919N7920n0853n0853l9403l9403n2060J31134J31135n2060R005R004r4042
$$ 66946 124865 182785 131932 81079 41676 2273 -49787 81347 212482 160422 169427 178431 84389
-24850H4389r4042R1537R1538o0n9j1510j1509j03107j03106k6537k6537N3611N3611J59519
$$ 84389 -9653 81884 173422 173362 173303 161793 150284 47177 -55929 -82466 -109003 -55392 -1781 157738
-24836A57738k3674j15273O7923L9776L9776J6876J6877k34062n0868N9813N9812j8621j8620
$$ 157738 134064 18791 86714 126490 166266 183142 200019 -34043 -84911 -25098 34714 16093 -2527
-24823b527P2976P2977j67466j67466J07326J07325j22144j22146K13713K13712j09741j09740
$$ -2527 70449 143426 -24040 -191506 -84180 23145 -98999 -221145 -7432 206280 96539 -13201
-24811a3201M2920M2922q602q603J51694l1501j39320M3875Q2042Q2041n263n262r6861r6860
$$ -13201 29719 72641 64039 55436 207130 175629 36309 80184 162226 244267 239004 233742 136881 40021
-24797D0021N9619N9619k0529k0529j34533M8660J40259m2936j30717j30717J0495J0496Q8735
$$ 40021 99640 159259 138730 118201 -16332 32328 172587 129651 -1066 -131783 -121288 -110792 -22057
-24784b2057Q8734k862k862L816L817L8165L8166P8240j04956q2056q2055p0607J12589J58386
$$ -22057 66677 63815 60953 64769 68586 106751 144917 223157 118201 36145 -45910 -116517 -3928 154458
-24770A54458k4807l340l339j06387j06386R4936R4937j26422N6770K14443k13012k13011
$$ 154458 129651 126311 122972 16585 -89801 5135 100072 -26350 30420 244863 31851 -181160
-24758a81160K14442J01855q1341m3174m3174o918o917Q4679Q4680j0734j0734j0734j0735
$$ -181160 33282 135137 53796 10622 -32552 -39470 -46387 38292 122972 112238 101504 90770 80035
-24745H0035j0614j0615j0615j0615o2137o2139K9459K9459O3331O3331O3331O3331j02689
$$ 80035 69421 58806 48191 37576 -24561 -86700 -57241 -27782 35549 98880 162211 225542 122853
-24732A22853j02690M9973M9973j11276j11276J02450J02451l6854l6854N4744N4744J789
$$ 122853 20163 70136 120109 8833 -102443 7 102458 65604 28750 83494 138238 140027
-24720A40027J789J3239J3239j47058L6139J27735n5459K7312K7312J5863J5863p7644p7643
$$ 140027 141816 155055 168294 21236 57375 185110 129651 156963 184275 200138 216001 138357 60714
-24707F0714P5019P5020j32507j32505K0156K0156P9312P9314j2285j2285k8862k8863k8863
$$ 60714 135733 210753 78246 -54259 -34103 -13947 65365 144679 132394 120109 91247 62384 33521
-24694C3521k8863K1707K1707O7505O7506j31910j31910Q1817Q1818o2258o2257R0404R0405
$$ 33521 4658 26365 48072 115577 183083 51173 -80737 1080 82898 20640 -41617 48787 139192
-24681A39192l2798l2799N8799N8799k1349k1349j12946j12946N4267N4266l7330l7331N1403
$$ 139192 106394 73595 132394 191193 169844 148495 35549 -77397 -23130 31136 -6194 -43525 7878
-24668G878N1405m0193m0193o977o977L8821L8821M473M472N0272N0271l1069l1069l1070
$$ 7878 59283 19090 -21103 -28080 -35057 3764 42585 47058 51530 101802 152073 121004 89935 58865
-24654E8865l1069L0950L0950L0950L0950L4528L4528j18135j18133O4105O4107j03823P9373
$$ 58865 27796 58746 89696 120646 151596 186124 220652 102517 -15616 48489 112596 8773 88146
-24641H8146R7501k07823l6079J47116j01913j01914K37759N4565j77292N904Q6052r7143
$$ 88146 185647 -22176 -58255 88861 -13052 -114966 122793 177358 66 5970 92022 -5121
-24629e121J08950J08951j69658J3537J38768m4427j24575N8620k445k445J15868j89457j56299
$$ -5121 103829 212780 43122 56659 195427 151000 26425 85045 82600 80155 196023 6566 -149733
-24616a49733K71154M2161k63163P812J91007j02868j02868K72347l2978k46704N8620J71208
$$ -149733 121421 163582 -99581 -91769 99238 -3630 -106498 165849 132871 -113833 -55213 115995
-24604A15995J71209q4502q4501N963N964K38K39K6000o5597r0405R2790J08296j97031j05432
$$ 115995 287204 202702 118201 124164 130128 130366 130605 156605 91008 603 93393 201689 4658 -100774
-24590a00774J99892J49323l3872n8679n8680o7744K3853Q6827r6368r4459Q8734K5762o5835
$$ -100774 99118 248441 214569 155890 97210 29466 53319 140146 43778 -50681 38053 63815 -2020
-24577b020O1541O1543p157Q4442O1542j21653p156p156j36620m5024J70612j2583m1207J41988
$$ -2020 59521 121064 113907 198349 259891 138238 131082 123926 -12694 -57718 112894 100311 59104 201092
-24563B01092j2583j04180O6850O6849l0473l0473j848j849R601R601j19208O3987J04061
$$ 201092 188509 84329 151179 218028 187555 157082 155234 153385 162986 172587 53379 117366 221427
-24550B21427J2464R601R601j3298P8299N0152j33043m7171J36025J08355p4841P4006J65603
$$ 221427 233891 243492 253093 239795 318094 368246 235203 188032 324057 432412 357571 431577 597180
-24537E97180p2157j63754N1881N1882k2542O9056M0432j42764j00304Q2891m3055m3056J38231
$$ 597180 525023 361269 413150 465032 442490 511546 551978 409214 308910 391801 348746 305690 443921
-24524D43921m4964k09076k5881J96672J3478p4304p4304n2358J30836R0763r2432K3495J15094
$$ 443921 398957 189881 164000 360672 374150 299846 225542 173184 304020 394783 302351 325846 440940
-24511D40940j0854Q0745N6890j26304j32030N1166R9887q3309j11932k0336O5538O5538l7510
$$ 440940 430086 510831 567721 441417 309387 360553 460440 377131 265199 244863 310401 375939 338429
-24498C38429N4088N7904j25290n6593n6592m2281M9317J06566p6629k6538O5061m3712m3711
$$ 338429 392517 450421 325131 268538 211946 169665 218982 325548 248919 222381 287442 243730 200019
-24485B00019J9262J9261p2336p2336n545n546M0252M0253K2124K2125q0924q0923J36025
$$ 200019 219281 238542 166206 93870 88325 82779 123031 163284 185408 207533 126609 45686 181711
-24472A81711m7170n8620J24575M9198j33998K6299K6299k5703k5702N4446N4446J33639m9556
$$ 181711 134541 75921 200496 249694 115696 141995 168294 142591 116889 171335 225781 359420 309864
-24459C09864o1005J22190o4942k48136Q0088Q0088m7766m7767M3831M3831Q7244Q7244k40980
$$ 309864 248859 371049 306107 57971 138059 218147 170381 122614 166445 210276 297520 384764 143784
-24446A43784n7785J39722m3473j23621N9574l638l637Q4143r9052j47712J57612P7464j05731
$$ 143784 85999 225721 182248 58627 118201 114563 110926 195069 96017 -51695 105917 183381 77650
-24433G7650L0711L0712J9262J9261m7528m7528m7528m7527J50097J50099o3630o3629N4684
$$ 77650 108361 139073 158335 177596 130068 82540 35012 -12515 137582 287681 224051 160422 215106
-24420B15106N4684n9812J23382K3675j59521J07639J07639o9831o9831Q2831Q2832j8010
$$ 215106 269790 209978 333360 357035 197514 305153 412792 342961 273130 355961 438793 420783
-24408D20783j8009P3588P3588l697l697l698l697j6578j6578J43717l9477j75920P275j5624
$$ 420783 402774 476362 549950 546253 542556 538858 535161 518583 502005 645722 606245 430325 437600 421976
-24394D21976j5624J8487J8486p3111p3111R0047R0047o2616o2615P037P036l8762l8762j7770
$$ 421976 406352 424839 443325 370214 297103 387150 477197 414581 351966 359003 366039 327277 288515 270745
-24380B70745j7771j78067N128J14378o8817J5147J98342R4341k10985J0376J93572j3477
$$ 270745 252974 74907 80035 194413 125596 140743 339085 433426 222441 232817 426389 412912
-24368D12912j96673R422R422Q9571Q9570o3093o3093L7808L7808n3790n3789o3332o3331
$$ 412912 216239 225661 235083 324654 414224 351131 288038 325846 363654 309864 256075 192743 129412
-24355A29412J50397J50397r1956r1955r1956r1955P7882P7881k5165k5166J49383l3812k74256
$$ 129412 279809 430206 338250 246295 154339 62384 140266 218147 192982 167816 317199 283387 9131
-24342I131L1069K33347p1978k17006Q8316J58448k4749n5280n5281L4409L4409L4408L4409
$$ 9131 40200 273547 201569 -15437 72879 231327 206578 151298 96017 130426 164835 199243 233652
-24329B33652q1519q1520J7712K00906o8162k51355L4885K18081o3630o3629L9418L9418o56
$$ 233652 152133 70613 88325 289231 221069 -30286 4599 222680 159050 95421 134839 174257 173601
-24316A73601o56o56o56%%R1598R1597n9156n9157R3506R3506k6955k6955J14259J14259k6001
$$ 173601 172945 172289 171633 171633 171633 263231 354828 295672 236515 330021 423527 396572 369617 483876 598135 572134
-24300E72134k09196j17597O5597q826q826J70553j2642j67214J38112J03763p9432N9872
$$ 572134 362938 245341 310938 302112 293286 463839 451197 283983 422095 525858 446426 506298
-24288E06298N9873n4625n4625L2203j50993j39543J65782N4803j28391o262o262R8694R8695
$$ 506298 566171 511546 456921 489124 338131 198588 364370 419173 290782 284520 278258 376952 475647
-24275D75647P096P096O8162O8161q4501q4501O1483O1482r1180r1180K4509K4510P0308P0308
$$ 475647 482743 489839 558001 626162 541661 457160 518643 580125 488945 397765 422274 446784 517092 587400
-24261E87400p1858p1859l3693J49502p75j83971q0923J02272J32805J32804N2657j30539
$$ 587400 515542 443683 409990 559492 558717 374746 293823 396095 528900 661704 714361 583822
-24249E83822j45208J60117j1629j94824j8307j8308q7006q7006J91366Q170m1446m1446n7666
$$ 583822 438614 598731 587102 392278 373971 355663 268657 181651 373017 381187 339741 298295 240629
-24236B40629n7666R4997R4997q5336q5336O7327O7326o2437o2436o2437o2437K9877K9877
$$ 240629 182963 277960 372957 287621 202285 269612 336938 274501 212065 149628 87191 117068 146945
-24223A46945K9876K9877M0372M0372n1225n1226L0145L0145j5654j5654o0498o0499K14294
$$ 146945 176821 206698 247070 287442 236217 184991 215136 245281 229627 213973 153475 92976 307270
-24210C07270L1099k03142J02182K54846n0481j00095Q3100N2567N2567r6756r6756J16972
$$ 307270 338369 135227 237409 492255 441774 341679 424779 477346 529913 433157 336401 453373
-24198D53373J16972j0883j0883j0883j0884O4256O4255j49472j49472R6696R6696N099N099
$$ 453373 570345 559462 548579 537696 526812 591068 655323 505851 356379 453075 549771 554870 559969
-24185E59969j6638j6638P4960P4960K9161K9161K9161K9161M114M115M115M115j44732j44731
$$ 559969 543331 526693 601653 676613 705774 734935 764096 793257 797371 801486 805601 809716 664984 520253
-24171E20253P931P931o4583o4584q7483R5713R0941r2253q0804J02391J0794J0794O8042
$$ 520253 528184 536115 471532 406948 319465 415178 506119 413866 333062 435453 446247 457041 525083
-24158E25083O8042j06565j06566J07162J07162k6448k6447j06596j06595j52395L0801J94913
$$ 525083 593125 486560 379994 487156 594318 567870 541423 434827 328232 175837 206638 401551
-24146D01551J1718j30449N2747J32894n0301j8815j8815o4613o4613K68J83464M9884k55442
$$ 401551 413269 282820 335567 468461 418160 399345 380530 315917 251304 251572 435036 484920 229478
-24133B29478l5035J48160J4581J4580O4196j18999j19000O4196j2135j2136J0764J0764r4490
$$ 229478 194443 342603 357184 371764 435960 316961 197961 262157 250022 237886 248650 259414 164924
-24120A64924Q8706Q8705r4490N3402N3402P6302P6302M7438j35756m4159J39036o8012o8013
$$ 164924 253630 342335 247845 301247 354649 430951 507253 554691 418935 374776 513812 445800 377787
-24107C77787n6562n6563N6861N6861l4737l4737l87l88l88l87M0163M0164n1435n1434M5888
$$ 377787 321225 264662 321523 378384 343647 308910 308523 308135 307747 307360 347523 387687 336252 284818 330706
-24092C30706M5889m5710m5709O56O56R2254R2253j13841j13841L8822L8821l9656l9657M0492
$$ 330706 376595 330885 285176 285832 286488 378742 470995 357154 243313 282135 320956 281300 241643 282135
-24078B82135M0491J54988k8206j35071m3473K3436o8162o2436K9161R8813R8813m8124m8125
$$ 282135 322626 477614 449408 314337 270864 294300 226138 163702 192863 291676 390489 342365 294240
-24065B94240L2978L2977N0152m1445j56897K6299J54153j51172j43866J61458J88175j17151
$$ 294240 327218 360195 410347 368902 212005 238304 392457 241285 97419 258877 447052 329901
-24053C29901k653k654k1737k1736K9787K9787K9787K9787m1773m1774l6048l6049m8214M3384
$$ 329901 327248 324594 302857 281121 310908 340695 370482 400269 358496 316722 280674 244625 196411 239795
-24039B39795O0558j22637j35041M8154K00817J7622j40289M2907L7182j46014P2485J64083
$$ 239795 300353 177716 42675 90829 291646 309268 168979 211886 249068 103054 175539 339622
-24027C39622j16435k08033L3812J25410P9611j1986j63695p2097Q6290n308n6354J26842
$$ 339622 223187 15154 48966 174376 253987 242001 78306 6209 92499 87191 30837 157679
-24015A57679J09666j95658m2042J41153J10621J9023j8904j10501q7602R5593L6436j46759
$$ 157679 267345 71687 29645 170798 281419 300442 281538 171037 83435 179028 215464 68705
-24003F8705n5161J28034Q1281j01915k1766k1766q6648R6547J88145M949o9712o9712j26960
$$ 68705 13544 141578 222859 120944 99178 77412 -9236 87311 275456 280405 210693 140981 14021
-23990A4021j26960K48016K48018q7841q7841o4941o4941Q7721Q7722n7309n7308n7308n7308
$$ 14021 -112939 135077 383095 295254 207413 142472 77531 165252 252974 195665 138357 81049 23741
-23977B3741N4804N4803M3354M3354K5225j57970o6373J16823l6794l6794K0454K0455k2482
$$ 23741 78545 133348 176702 220056 245281 87311 20938 137761 100967 64173 84627 105082 82600
-23964H2600k2482k2482k2482Q348Q349Q349Q349L6973L6973L6973L6973o1781o1781K9817
$$ 82600 60118 37636 15154 23502 31851 40200 48549 85522 122495 159468 196441 134660 72879 102696
-23950A02696K9817K6955K6954j670r3267j27854N5339J06864p6331q6826R6367j8128j8129
$$ 102696 132513 159468 186422 184752 91485 -36369 18970 125834 49503 -37323 59044 40916 22787
-23937B2787J14258J14259r9469r9470L3157L3156P8955P8956n3909n3909O0588j22608j19743
$$ 22787 137045 251304 151835 52365 85522 118678 197633 276589 222680 168771 229359 106751 -12992
-23924a2992O3449O3450j19743q7543R5652j8844j8844J24276J24277j52424o0826K24700
$$ -12992 50457 113907 -5836 -93379 2273 -16571 -35415 88861 213138 60714 -112 224588
-23912B24588M1505k39012n5817K16112L2918o8221K3377Q1579j01616r0167J431N9634N9634
$$ 224588 266093 27081 -28736 187376 220294 152073 175450 257029 155413 65246 66677 126311 185945
-23899A85945k6239k6239r004r005r005r005L8703L8702L8703L8702m0491m0492m0491m0492
$$ 185945 159706 133467 124463 115458 106453 97448 136151 174853 213556 252258 211767 171275 130784 90292
-23885I0292L1070L1069L1069L1069j3059j3060L2739L2739j18970j18969j5923j5921k2601
$$ 90292 121362 152431 183500 214569 201510 188450 221189 253928 134958 15989 66 -15855 -38456
-23872c8456J60593J56777j48548r8932K06393J07162j98164j4371J68823o3987k47181J45923
$$ -38456 122137 278914 130366 31434 237827 344989 146825 132454 301277 237290 -9891 136032
-23860A36032J45924j93751j0555J34952m8244j28392N4804J6637J6638K8088K8087j79j78
$$ 136032 281956 88205 77650 212602 164358 35966 90770 107407 124045 152133 180220 180041 179863
-23847A79863j79j79j79j79j79j79j7830j7831j7830j7831K0335K0335K0335K0336j0913j0913
$$ 179863 179684 179505 179326 179147 178968 178789 160959 143128 125298 107467 127802 148137 168472 188808 177895 166982
-23831A66982j0913j0913j5684j5684J33163n0033q4382q4382M5381M5382J22667o0529j52126
$$ 166982 156069 145156 129472 113788 246951 196918 112536 28154 73535 118917 241584 181055 28929
-23818B8929L1069M8602M8602l1547l1546M711M711M711M711R1061R1061p3051p3052J83613
$$ 28929 59998 108600 157202 125655 94109 98820 103531 108242 112953 204014 295075 222024 148972 332585
-23804C32585M17j71328J33998R4773q8422j2091j2091L4662L4662K3213K3212J80169l026
$$ 332585 333002 161674 295672 390445 302023 289932 277841 312503 347165 370378 393590 573759 570733
-23791E70733l027J80169R2388R2388K18334L5140k49911o6716J983l03342p8165J05030j20148
$$ 570733 567706 747875 840263 932651 1150985 1186125 936214 869498 871481 568139 489974 595004 474856
-23778D74856j20147J01214q1982j73579R616P707P708J9157J9158r0286r0286J11993J11992
$$ 474856 354709 455923 373941 200362 209978 217685 225393 244550 263708 173422 83136 195129 307121
-23765C07121P0965j12231j12231P0964l6377l6376K0871K0872j02212j02212J00065J00066
$$ 307121 378086 265855 153624 224588 188211 151835 172706 193578 91366 -10846 89219 189285
-23753A89285Q3964r9231j10680P2515J23084o0111l7211l7212L0055L0056k7193k7193J05433
$$ 189285 273249 174018 63338 135853 258937 198826 161615 124403 154458 184514 157321 130128 235561
-23740B35561p7763j57910J47414J50382l2813o3347o3346M6381M6380N81N82p7181p7182
$$ 235561 157798 -112 147302 297684 264871 201524 138178 184559 230939 231520 232102 154921 77739
-23727G7739j15345J89977J62309j43017m3786m3786m2833m2831J09830J09831o6686o6685
$$ 77739 -37606 152371 314680 171663 127877 84091 41258 -1573 108257 218088 151402 84717
-23715H4717k0887k0887m3785m3786J20325J20326o9548J13648L3499j49696k2482J60713
$$ 84717 63830 42943 -842 -44628 75697 196023 126475 240123 273622 123926 101444 262157
-23703B62157m5381m5381l3932l3932N7666N7666l4409l4408J60236k2959n3492n3491r5474
$$ 262157 216776 171395 137463 103531 161197 218863 184454 150046 310282 287323 233831 180340 84866
-23690H4866Q7721K16054q9272k41935O3391J30181n3015O9116O9116r4520r4520M6693M6694
$$ 84866 172587 388641 299369 57434 120825 251006 197991 267107 336223 241703 147183 193876 240570
-23677B40570J39245m3950j08832P4363J28869j76457r6308Q6886P2575P2574j29703j29704
$$ 240570 379815 335865 227033 301396 430265 253808 157500 244386 316961 389535 259832 130128
-23665A30128J38887J38887j3775j3775J4848J4849K6299K6298k5344J57851O6253j16942
$$ 130128 269015 407902 394127 380352 395200 410049 436348 462646 437302 595153 661406 544464
-23653E44464M5262M5262j18850j18850M9078M9079m2519m2519p7822p7822J3775J3775j9202
$$ 544464 589726 634988 516138 397288 446366 495445 452926 410407 332585 254763 268538 282313 263111
-23640B63111j9202o5001o5001J41094J41094j22249j22250o8340J14854Q0506j02689j8725
$$ 263111 243909 178908 113907 255001 396095 273846 151596 83256 198110 278616 175927 157202
-23628A57202J64470Q8139k17187j32506J72819N0688j32506o8579J14616J20J19l6615l6616
$$ 157202 321672 409811 192624 60118 232937 283625 151119 82540 197156 197276 197395 160780 124164
-23615A24164m8064J35130o1423o1423J02690J02689p5109p5109J6489J6489L2709L2709j3089
$$ 124164 76100 211230 149807 88384 191074 293763 218654 143545 160034 176523 209232 241941 228852
-23602B28852j3090K0305K0306n9843n9842q7513R5682Q4233Q4233J1241J1241q0357q0356
$$ 228852 215762 236067 256373 196530 136688 49175 144857 229090 313323 324564 335805 255448 175092
-23589A75092J3149J3149J3150J3149r0852r0853J34326J34325j69092J4104J17150o6044
$$ 175092 188241 201390 214540 227689 136837 45984 180310 314635 145543 159647 276797 210753
-23577B10753j18016O5180J45328l7867j6877j6876k8326k8326R4042R4043n8620n8620J5803
$$ 210753 92737 157917 303245 265378 248501 231625 203299 174973 269015 363058 304438 245818 261621
-23564B61621J5803J5802J5804K9160K9161K9161K9161m5262m5262M6336M6335m472m473m472
$$ 261621 277424 293226 309030 338190 367351 396512 425673 380411 335149 381485 427820 423348 418875 414403
-23550D14403m473l1188l1189J21474J21474q4516q4516q4516q4516Q5321Q5321j34131j34132
$$ 414403 409930 378742 347553 469027 590501 505985 421469 336953 252437 337758 423079 288948 154816
-23537A54816J54020O2421k14279l1084J84552J356r0241R2955n52j83747J50203J50203j96151
$$ 154816 308836 371257 156978 125894 310446 311802 221561 314516 313964 130217 280420 430623 234472
-23524B34472j04553J79781l414j66572J38753J2806j70388Q6275Q6275j31269N1926K4853
$$ 234472 129919 309700 306286 139714 278467 291273 120885 207160 293435 162166 214092 238945
-23512B38945j58343N770J88964o6745o6745R7367R7367j43076j43077m3846J39350Q1147
$$ 238945 80602 86372 275336 208591 141846 239213 336580 193504 50427 6581 145931 227078
-23500B27078j02049j19223J86103P9238j2359K7715j55481j43075J62248Q2101j01095O6835
$$ 227078 125029 5806 191909 271147 258788 286503 131022 -12053 150195 232296 131201 198036
-23488A98036O6835j58343j58342J18357J18359r5370r5368J82702J82703r2089r2090L0995
$$ 198036 264871 106528 -51814 66543 184902 89532 -5836 176866 359569 267480 175390 206385
-23476B06385L0994r079r079p8732J2866K22778L9582j82734r1135N0077m1520L0160L0160
$$ 206385 237379 228300 219221 140489 153355 376133 415715 232981 141846 191923 150403 180563 210723
-23463B10723K4435K4435L4931L4930n6667n6667j8024j8025R0748q50r5310Q7886R3610q9585
$$ 210723 235158 259593 294524 329454 272787 216120 198096 180071 270819 269969 174659 262545 356155 266570
-23449B66570o7386J15809J15809o7386j25589N7606m5441j37039L698R5295L697q7900o7864
$$ 266570 199184 314993 430802 363416 237827 295433 249992 112953 116651 211946 215643 127743 59879
-23436E9879K3734K33646N0450k91013j07817K89104J05910k10866k7670J80333k862l1726
$$ 59879 83613 317259 367709 76696 -31121 257983 363893 153027 125357 305690 302828 271102
-23424B71102N9873l7450j29048o918Q4681o918r8515N6980J48578j1718j1718N9842j23352
$$ 271102 330975 293525 164477 157559 242240 235322 136807 193787 342365 330647 318929 378771 255419
-23411B55419k03501J01825J20192o3003l8196N3402J07789J07788j00215j00215M4338M4338
$$ 255419 51918 153743 273935 210932 172736 226138 333927 441715 341500 241285 285623 329961
-23399C29961m7260m7260m1535m1535J11128J11128J640J640J640J640j1719j1718j1718j1718
$$ 329961 282701 235441 193906 152371 263499 374627 376267 377907 379547 381187 369468 357750 346032 334314
-23385C34314K878K877K877K878p4409p4408J41228M9630j33326M9869M4144m7454J8382J09980
$$ 334314 337192 340069 342946 345824 271415 197007 338235 387865 254539 304408 348552 301098 319480 429460
-23371D29460m8408j40005O2750O2749r5637r5638P1337P1337q8959R4236J05448p7748j4774
$$ 429460 381052 241047 303797 366546 270909 175271 246608 317945 228986 323222 428670 350922 336148
-23358C36148P6823n2940n2940K9117j54079o3063K42262R452j73743K03143K03143j46073
$$ 336148 412971 360031 307091 336208 182129 119066 361328 370780 197037 400180 603323 457250
-23346D57250n4476Q7214r5980l8732N2865m383m383J342J341K5196K5195J3746J3745J30151
$$ 457250 402774 489988 394008 355276 408141 403758 399375 400717 402058 427254 452449 466195 479940 610091
-23332F10091n3044n8769J24426l5154j26752J55674J55674n6145L5452K51089O7893j16465
$$ 610091 557047 498278 622704 587550 460798 616472 772146 716001 751453 1002542 1070435 953970
-23320I53970O6730K19393L6198q5932R7262K57559m7767k67696q4501J15868o7326j73237
$$ 953970 1020700 1240093 1276291 1190359 1287621 1545180 1497413 1229717 1145216 1261084 1193758 1020521
-23308A020521q1639n3014n3015P0786P0785l7986N3610J55704k7491j01914K03411R3685
$$ 1020521 938882 885868 832853 903639 974424 936438 990048 1145752 1118261 1016347 1219758 1313443
-23296A313443q9510L8344L8345r5236l637N9335j23859j61787K1409j84686j84687O9116
$$ 1313443 1223933 1262277 1300622 1205386 1201749 1261084 1137225 975438 996847 812161 627474 696590
-23284F96590O9116q3547q3547o978o977Q4621Q4620j21474j21474L1188L1189L0115L0115
$$ 696590 765706 682159 598612 591634 584657 669278 753898 632424 510950 542138 573327 603442 633557
-23271F33557O0648j22548k23687Q1639K34302p1024j04896P8299P693q3905N1583N1584m0015
$$ 633557 694205 571657 347970 429609 663911 592887 487991 566290 573983 490078 541661 593245 553230
-23258E53230m0014l8643N2955J23561n9633j91306J14020J21653j83672l6019K69306L8405
$$ 553230 513216 474573 527528 651089 591456 400150 514170 635823 452151 416132 685438 723843
-23246G23843n3194J33819J33818L6496L6496n1166n1166J62562J62562J02451J02451J88324
$$ 723843 670649 804468 938286 974782 1011278 960112 908946 1071508 1234070 1336521 1438972 1627296
-23234A627296J88324Q5753n844k3018J60176O0946j22250m7826m7826j70076p8478p872j91067
$$ 1627296 1815620 1901373 1895529 1872511 2032687 2093633 1971383 1923557 1875731 1705655 1627177 1619305 1428238
-23221A428238j23323J82003m5083k28279o1065L0533o2974J20222J92737j12589j33580m1982
$$ 1428238 1304915 1486918 1441835 1213556 1152491 1183024 1120050 1240272 1433009 1320420 1186840 1144858
-23209A144858j21176j21176k3854k3853j15451j15452k9578k9578j670r3268K147J85342
$$ 1144858 1023682 902506 878652 854799 739348 623896 594318 564740 563070 469802 471949 657291
-23197F57291l7927j29525Q6112Q6111m3533m3532m3533m3533n367n367n367n367K9459K9459
$$ 657291 619364 489839 575951 662062 618529 574997 531464 487931 482564 477197 471830 466463 495922 525381
-23183E25381j23203j23204J49681J49681k982k981P4304P4303j20341j20341k8744K76582
$$ 525381 402178 278974 428655 578336 575354 572373 646677 720980 600639 480298 451554 728136
-23171G28136J96434j08891l2560J50635j24158j24158L18565L18564j20341O2854J58030
$$ 728136 924570 815679 783119 933754 809596 685438 1004003 1322567 1202226 1265080 1423110
-23160A423110J58030J31313n1881j17718O5478M2579k62747j16763O6432j12946j12947J7771
$$ 1423110 1581140 1712453 1660572 1542854 1608332 1650911 1388164 1271401 1337833 1224887 1111940 1129711
-23148A129711j65424k34123P1203p2992p2992O8221j14974k02755J02570J75085q110l6734
$$ 1129711 964287 730164 801367 728375 655383 723604 608630 405875 508445 683530 675420 638686
-23136F38686l6735j39782j39782J15929J15928l6734l6735k505k504r4102r4103Q9093Q9093
$$ 638686 601951 462169 322387 438316 554244 517510 480775 478270 475766 381664 287561 376654 465747
-23123D65747k504k505K2303K2303j30359j30360P5735P5735j37993j37993J74608J74608
$$ 465747 463243 460738 483041 505344 374985 244625 320360 396095 258102 120109 294717 469325
-23111D69325j00185j00184l6258l6257r3506Q9689J18314J18313k2899k2899p634p633L8166
$$ 469325 369140 268956 232698 196441 102935 192624 310938 429251 406352 383453 375819 368186 406352
-23098D06352L8166p0696p0696K0901K0902J9948J9947J9948J9947m860m860q5008q5008o9742
$$ 406352 444518 373822 303126 324027 344929 364877 384824 404772 424719 419859 414999 329991 244983 175241
-23084A75241J13453J32537n0659j39872J65455Q1489k23836o0677K44648J11068p2127n5668
$$ 175241 288694 421231 370572 230700 396155 477644 253808 193131 437779 548847 476720 421052
-23072D21052n5669P4096P4095P305j75890j30092N3104J04896J04896r7382r7382Q8676Q8675
$$ 421052 365383 439479 513574 520879 344989 214897 268001 372897 477793 380411 283029 371705 460380
-23059D60380O0052l1547j86117k922R4400q8795j013J82181q4978q4978J94346J94347j41511
$$ 460380 520432 488885 302768 299846 394246 305451 304438 486619 401641 316663 511009 705356 563845
-23046E63845j41511p931p932J46640N5042j34117M9079N4804j28392m8244J34952R004R005
$$ 563845 422334 414403 406471 553111 608153 474036 523115 577919 449527 401283 536235 545239 554244
-23033E54244j0764j93959m7021J36174L5034n6562O9384k2214j12857P0338P0338j12857
$$ 554244 543480 349521 302500 438674 473708 417146 486530 464316 351459 421797 492135 379278
-23021C79278m1296N0301n8471n8471K5374K5374J05522J05523K4420j58775p8628J04568
$$ 379278 337982 388283 329812 271341 296715 322089 427611 533134 557554 398779 320151 424719
-23009D24719J24367n8829r3178j580J12916K1319p6003J5594Q8974r4221l6973N4624j7890
$$ 424719 549086 490257 397079 395499 508415 529734 453731 469325 558299 464078 427105 481729 463839
-22996D63839j7890Q5157Q5157m9138M2459J3835j69360Q0625K63820p3946j65543L9239L9239
$$ 463839 445949 531106 616263 567125 609584 623419 454059 534684 798504 724558 559015 598254 637493
-22983F37493L3514L3514M5918M5919m3772j35369p6212J06983J52782l0413j76397q4799
$$ 637493 671007 704521 750439 796358 752586 617217 541005 647988 800770 770357 593960 509161
-22971E09161O5955O5955l5840l5840l5840l5840J05373J05373O7208j15988j44612L8583
$$ 509161 575116 641071 605231 569391 533551 497711 603084 708457 775665 659677 515065 553648
-22959E53648j8666j10263O142R7740K9042K9042P9611j03584j91365J13960J33998j71329
$$ 553648 534982 424719 430861 528601 557643 586685 666296 562712 371347 485307 619305 447976
-22947D47976J3776J05373j12648j12649K21301L8106l3454J49741M6693j36502q2533q2534
$$ 447976 461752 567125 454477 341828 563129 601235 567781 717522 764215 627713 545180 462646
-22935D62646k385k385J23561J23561k9101k9101j08772j08773J04956J04956p2515p2515
$$ 462646 460261 457876 581437 704998 675897 646796 538024 429251 534207 639163 566648 494133
-22923D94133Q0148Q0148K5523K5524K5523K5523Q349Q349q3249q3249m532m533j5981J67213
$$ 494133 574281 654429 679952 705476 730999 756522 764871 773220 689971 606722 602190 597657 581676 748889
-22909G48889o440o441N009N010K1468K1468j92260j92259K44737K44738k13251k13251J28809
$$ 748889 742449 736008 741017 746027 767495 788963 596703 404444 649181 893919 680668 467417 596226
-22896E96226J28809k3853k3854m6753m6753M4845M4845J1211J1211q0386q0387j192j193
$$ 596226 725035 701182 677328 630575 583822 628667 673512 684723 695934 615548 535161 533969 532776
-22883E32776M4606M4606M6515M6514m5083m5083O9413O9414q3249q3249p096p096n2896n2895
$$ 532776 577382 621988 668503 715017 669934 624851 694264 763678 680429 597180 590084 582988 530092 477197
-22869D77197J15034J15033l7628l7629J5803J5803k9996k9996M5381M5382L3931L3932J4014
$$ 477197 592231 707264 669636 632007 647810 663613 633617 603621 649002 694384 728315 762247 776261
-22856G76261j69181p7584J05612L7867L7868J18015o5180j05254P7942O6492j16704N5996
$$ 776261 607080 529496 635108 672975 710843 828858 763678 658424 736366 802858 686154 742150
-22844G42150N5997m7052m7051Q9451Q9451j24277j24277K624K624M8422M8423J6936J6936
$$ 742150 798147 751095 704044 793495 882946 758669 634392 637016 639640 688062 736485 753421 770357
-22831G70357J6936J6936J6936J6936k8862k8863N009N009p5139p5138q6589R6607L9359L9358
$$ 770357 787293 804229 821165 838101 809239 780376 785385 790394 715255 640117 553528 650135 689494 728852
-22817G28852K4092K4092K4092K4092p6092p6093P0845P0845q6529j78126R4758K77953N4685
$$ 728852 752944 777036 801128 825220 749128 673035 743880 814725 728196 550070 644828 922781 977466
-22804I77466j28511o5538K6060q8437q8437P5675P5676n5996L5601R8575q4621m6335J36859
$$ 977466 848955 783417 809477 721040 632603 708278 783954 727958 763559 862134 777513 731178 868037
-22791H68037L3813j49383P7703P7703k00907j7711K22733L9537j62741K0455K7133K7133
$$ 868037 901850 752467 830170 907873 706966 689255 911988 951525 788784 809239 836372 863505
-22779H63505Q4382Q4382r7620r7621J04657J04658j6519j99714j88264J17061J59998k3197
$$ 863505 947887 1032269 934649 837028 941685 1046343 1029824 830110 641846 758907 918905 895708
-22767H95708J3059J3060n1822L9776R7024q6170K9399J20997j06088j06089J61071k2124
$$ 895708 908767 921827 870005 909781 1006805 920635 950034 1071031 964943 858854 1019925 997801
-22755I97801l16000j0675L02762J19566K7968K7968j13245j13244L9418L9418L2798L2799
$$ 997801 681801 671126 973888 1093454 1121422 1149390 1036145 922901 962319 1001737 1034535 1067334
-22743A067334N5698j27497O082J89278J05314k00012r5057Q8139J09130J7533o9295o9295
$$ 1067334 1123032 995535 1001617 1190895 1296209 1096197 1001140 1089279 1198409 1215942 1146647 1077352
-22731A077352J40617M9019j42763M0431R9589q3607r4102K11223j7771j09368J20580K8982
$$ 1077352 1217969 1266988 1124225 1164656 1264245 1180638 1086536 1297759 1279988 1170620 1291200 1320182
-22719A320182j38947M4248J30121j75204r184J74012p0428j62025J12768K04365J7353j65841
$$ 1320182 1181235 1225483 1355604 1180400 1171216 1345228 1274800 1112775 1225543 1429908 1447261 1281420
-22707A281420p9969J03226J53319k9877j10025P3171n2776n2776N0272N0271j00841j00841
$$ 1281420 1201451 1304677 1457996 1428119 1318094 1391265 1338489 1285713 1335985 1386256 1285415 1184574
-22695A184574r243r243J16703J16704l5960l5959J20043J20043r3685r3685R7144R7144p4602
$$ 1184574 1175331 1166088 1282791 1399495 1363535 1327576 1447619 1567662 1473977 1380292 1477436 1574580 1499978
-22682A499978p4602K32155p3171j76218J29107P4721j08474N9455N9455K1766K1767o9831
$$ 1499978 1425376 1657531 1584360 1408142 1537249 1611970 1503496 1562951 1622406 1644172 1665939 1596108
-22670A596108o9832Q7603Q7601o5060o5060Q5574Q5575J08474p4721p6630J06566J06565
$$ 1596108 1526276 1613879 1701480 1636420 1571360 1656934 1742509 1850983 1776262 1699632 1806198 1912763
-22658A912763p6629j3895J69301r7859r7860R6786R6786n5877n5877J4551J4550K6001K6000
$$ 1912763 1836134 1822239 1991540 1893681 1795821 1892607 1989393 1933516 1877639 1892190 1906740 1932741 1958741
-22645A958741m0789J42405J30956j74369J3835J97030K5285j57910J01616J01616j431j432
$$ 1958741 1917952 2060357 2191313 2016944 2030779 2227809 2253094 2095184 2196800 2298416 2296985 2295553
-22633B295553o2615o2616J51112J51113o6432o6433Q6231Q6231O5239O5240k6359k6358l3991
$$ 2295553 2232938 2170322 2321434 2472547 2406115 2339682 2425913 2512144 2577383 2642623 2616264 2589906 2555915
-22620B555915l3991J5624J98819J8427J8427J21474J21474J22428J22429J33878m9317N5638
$$ 2555915 2521924 2537548 2736367 2754794 2773221 2894695 3016169 3138597 3261026 3394904 3345587 3401225
-22608C401225N5638P8538P8538N4685j28512J2702J95897n5041k38238J51053J51053j8785
$$ 3401225 3456863 3535401 3613939 3668624 3540112 3552814 3748711 3693670 3455432 3606485 3757538 3738753
-22596C738753j8785j8785j8784j9262j9262J33401J33401r7501r7502J77292J77291r8037
$$ 3738753 3719968 3701183 3682399 3663137 3643875 3777276 3910677 3813176 3715674 3892966 4070257 3972220
-22584C972220r8039N4625N4625J2642J2642J04241J04239k9816k9818J22846J22846L4111
$$ 3972220 3874181 3928806 3983431 3996073 4008715 4112956 4217195 4187379 4157561 4280407 4403253 4437364
-22572D437364L4110R1359R1359P872J91067R9469q3726Q6112Q6111M4129K27325K71214l4110
$$ 4437364 4471474 4562833 4654192 4662064 4853131 4952600 4868874 4954986 5041097 5085226 5312551 5583765 5549655
-22559E549655J1688L17014J43360l9836K34958K34957J18791J18791J76039p157J07342J07341
$$ 5549655 5561343 5878357 6021717 5981881 6216839 6451796 6570587 6689378 6865417 6858260 6965602 7072943
-22547G072943J34057L17252K25654M2460J11157J11158J59819J59818K05618K05617K50940
$$ 7072943 7207000 7524252 7749906 7792366 7903523 8014681 8174500 8334318 8539936 8745553 8996493
-22536H996493K50940Q3010K66205J81288j24039Q9689L95015K55710P2515K40444K40443
$$ 8996493 9247433 9330443 9596648 9777936 9653897 9743586 10138601 10394311 10466826 10707270 10947713
-22525A0947713L35859L35858K90059K90059M83094M83094K77000M60195O20490M37295M02947
$$ 10947713 11283572 11619430 11909489 12199548 12682642 13165736 13442736 13902931 14523421 14960716 15363663
-22514A5363663N86142N34616N34618N34618P17812O44345O44344P58841P58842P20198R03393
$$ 15363663 15949805 16484421 17019039 17553657 18271469 18915814 19560158 20318999 21077841 21798039 22701432
-22503B2701432J006442Q23246J030294J213490J144792J144790J263106J263107J160057
$$ 22701432 23707874 24531120 25561414 26774904 27919696 29064486 30327592 31590699 32750756
-22494C2750756J343253J285050J285050J651442J651440J639037J944364K196255K196256
$$ 32750756 34094009 35379059 36664109 38315551 39966991 41606028 43550392 45746647 47942903
-22485D7942903K314569K742028K803090K803091L182845L610293L827834M011037M629321
$$ 47942903 50257472 52999500 55802590 58605681 61788526 65398819 69226653 73237690 77867011
-22476G7867011N301031N873522O545238P479341Q517446R670054J1318805J3265254J5646792
$$ 77867011 83168042 89041564 95586802 103066143 111583589 121253643 132572448 145837702 161484494
-22467A61484494J8150470K1020522K4451621K8542995L3214441L8527124M4515331N1049291
$$ 161484494 179634964 200655486 225107107 253650102 286864543 325391667 369906998 420956289
-22459D20956289N9232013P0529020Q5502597J01440585J09997327R7356797N4985371q094883
$$ 420956289 480188302 550717322 636219919 737660504 847657831 945014628 999999999 991905116
-22451I91905116o6977077j00379543j06452676r8208878q6209644p3080587o0012665m9204156
$$ 991905116 924928039 824548496 718095820 619886942 533677298 460596711 400584046 351379890
-22443C51379890m0922218l3899699k8467539k4620457k1460325j8712397j6716333j4945434
$$ 351379890 310457672 276557973 248090434 223469977 202009652 183297255 166580922 151635488
-22435A51635488j3090594j1686100j0585953r303605q105198p189217o490792n574812m864933
$$ 151635488 138544894 126858794 116272841 106969236 98864038 91674821 85184029 79609217 74744284
-22426G4744284m559606m321671l894213l428590l245397l169064k741609k539329k539330
$$ 74744284 70184678 65863007 61968794 58540204 55294807 52125743 49384134 46844805 44305475
-22417D4305475k405751j856163j890513k073708j707319j401992j432527j432523j022959
$$ 44305475 41899724 40043561 38153048 36079340 34372021 32970029 31537502 30104979 29082020
-22408B9082020j022960r31362r31362q93196q93197o79468o79469p80608p80607q60755q60756
$$ 29082020 28059060 27127698 26196336 25303140 24409943 23730475 23051006 22270398 21489791 20629036 19768280
-22397A9768280r46627p63433p13818p13818p00519p00519p00519p00519n53582n53581m54351
$$ 19768280 18821653 18058220 17344402 16630584 15930065 15229546 14529027 13828508 13274926 12721345 12266994
-22386A2266994k71156l19816n03011m80113m80112j36621j36621m11415m11414l00615l00614
$$ 12266994 11995838 11676022 11173011 10692898 10212786 10076165 9939544 9528129 9116715 8816100 8515486
-22375H515486l92212q6886j8189k01383k31917k31915j57016j57016o5419o5419j64648j64650
$$ 8515486 8123274 8036388 8018199 7816816 7584899 7352984 7195968 7038952 6973533 6908114 6743466 6578816
-22363F578816p3051p3052k44200k44201l0473l0473k27026k27026m3831l49156k90000j06804
$$ 6578816 6505765 6432713 6188513 5944312 5913839 5883366 5656340 5429314 5385483 5036327 4746327 4639523
-22351D639523j37337j37337j77411j77411j31612j31612j07400j07401o1602o1602j9619
$$ 4639523 4502186 4364849 4187438 4010027 3878415 3746803 3639403 3532002 3470400 3408798 3389179
-22340C389179j9620j30300j30300k9876l35202k09255K18200J05611j99713j95898j2702
$$ 3389179 3369559 3239259 3108959 3079083 2743881 2534626 2752826 2858437 2658724 2462826 2450124
-22329B450124l9298l9299l9299l9299O5658j17539k05320J00007O1124k44201n3372n3372
$$ 2450124 2410826 2371527 2332228 2292929 2358587 2241048 2035728 2135735 2196859 1952658 1899286 1845914
-22317A845914m0014m0015O3033j20162J6876J6877j58686j58686J34236m8959j82540J22786
$$ 1845914 1805900 1765885 1828918 1708756 1725632 1742509 1583823 1425137 1559373 1510414 1327874 1450660
-22305A450660J05612j99714k0335J62860j14795j14795q4263q4263p931K97394L4051k71274
$$ 1450660 1556272 1356558 1336223 1499083 1384288 1269493 1185230 1100967 1093036 1390430 1424481 1153207
-22293A153207q0446J02749l0831l0831J89338O142j04538j04538O142O142K9042j54153p9731
$$ 1153207 1072761 1175510 1144679 1113848 1303186 1309328 1204790 1100252 1106394 1112536 1141578 987425 907694
-22280I07694J03465k2482k2482J69300j3894j66558J6638M3592M3593R243R243j52006j52007
$$ 907694 1011159 988677 966195 1135495 1121601 955043 971681 1015273 1058866 1068109 1077352 925346 773339
-22267G73339J11336J11337M8601j34593l1547l1546k2959k2959K2840K2840p0189p0190K1409
$$ 773339 884675 996012 1044613 910020 878473 846927 823968 801009 823849 846689 776500 706310 727719
-22254G27719K1409p0190p0189L2859L2858j03942P9253J21236j84090p2455K32871p574j90769
$$ 727719 749128 678938 608749 641608 674466 570524 649777 771013 586923 514468 747339 739765 548996
-22241E48996j8546j8546n2895J30300J60832k2362m9079m9079j53796K9400J32447n0749
$$ 548996 530450 511904 459009 589309 750141 727779 678700 629621 475825 505225 637672 586923
-22229E86923r8455Q4740Q4739r8455j88861n665K76761k8565k06035k2840O8758O8758J4372
$$ 586923 488468 573208 657947 559492 370631 364966 641727 613162 407127 384287 453045 521803 536175
-22216E36175J4372j91723q528J28869n4326j00126Q3070Q2832j00364j46163L7033J43896
$$ 536175 550547 358824 350296 479165 424839 324713 407783 490615 390251 244088 281121 425017
-22204D25017l9298j30897N2299J55287k7909n009n009J5982J5981j48130j48131J19268o3927
$$ 425017 385719 254822 307121 462408 434499 429490 424481 440463 456444 308314 160183 279451 215524
-22191B15524p5378J07818O5836j17359Q587Q587n3909J29287J40735k86719j97030K30425
$$ 215524 140146 247964 313800 196441 205028 213615 159706 288993 429728 143009 -54021 176404
-22179A76404J57910k5284r9947r9946J63397J63396q5634q5634l9836l9835L7689L7688n3909
$$ 176404 334314 309030 209083 109137 272534 435930 350296 264662 224826 184991 222680 260368 206459
-22166B06459n3909P2038P2038q111q110j13066P0130L5780j47415L2918K16113k45691k45691
$$ 206459 152550 224588 296626 288515 280405 167339 237469 273249 125834 158752 374865 129174 -116517
-22153a16517L12660J29465k33109P2217J80034j25291j4610j4610j04300P8896J24694n8501
$$ -116517 196143 325608 92499 164716 344750 219459 204849 190239 85939 164835 289529 231028
-22141B31028J611J610k1290k1289N3492j29704j29703N3491Q4024Q4024L876L877M591M592
$$ 231028 232639 234249 212959 191670 245162 115458 -14245 39246 123270 207294 211170 215047 219638 224230
-22127B24230j90053o858P4244P4244n903n904j9441j9440K6358K6358o2377o2377K9220K9221
$$ 224230 34177 27319 101563 175807 169904 164000 144559 125119 151477 177835 115458 53081 82301 111522
-22113A11522k5881k5881J68764j4432j32745j32744Q468Q468O6968O6969Q9868r3327j27675
$$ 111522 85641 59760 228524 214092 81347 -51397 -42929 -34461 32507 99476 189344 96017 -31658
-22100c1658N5518J35667m7528l8464l8464M1684M1685L518L518q8079q8078P6032P6033j5564
$$ -31658 23860 159527 111999 73535 35071 76755 118440 121958 125476 37397 -50681 25351 101384 85820
-22086H5820j5565P335P335N3134N3134q5694q5694l9894l9895M7886M7885m3711m3711N96
$$ 85820 70255 77590 84925 138059 191193 105499 19805 -20089 -59984 -12098 35787 -7924 -51635 -51039
-22072e1039N96R2193R2194m4248m4248J550J551k7074k7073k7074k7073O5477O5478k6120
$$ -51039 -50443 41750 133944 89696 45448 46998 48549 21475 -5598 -32672 -59745 5732 71210 45090
-22058D5090k6120K4212K4211J38708m4486k25773m2579K32213M9019j81643J550K03828K0633
$$ 45090 18970 43182 67393 206101 161615 -64158 -106737 125476 174495 -7148 -5598 198230 218863
-22045B18863o8102o8102l3752l3753J7115J7115p4482p4483J36382J36383j38411j38409
$$ 218863 150761 82659 48907 15154 32269 49384 -25098 -99581 36801 173184 34773 -103636
-22033a03636R5116R5115j79676L519K59227m6097k06392R8932J82897j22428j30061l8464
$$ -103636 -8520 86595 -93081 -89562 169665 123568 -82824 16108 199005 76577 -53484 -91948
-22021i1948j3656P7942R5115q8079m4188M7409L0233L0234m9912m9914M1684M1683m8719
$$ -91948 -105604 -27662 67453 -20626 -64814 -17405 12828 43062 -6850 -56764 -15080 26603 -22116
-22008b2116m8721M2876M2876o0169o0171L1427L1427K803K803R4399R4401k03291k03292
$$ -22116 -70837 -27961 14915 -45254 -105425 -73998 -42571 -39768 -36965 57434 151835 -51456 -254748
-21995b54748J38291J38290r5712m114J44730l8464n5637L5958k7013k7014L3096L3096n8500
$$ -254748 -116457 21833 -73879 -77993 66737 28273 -27364 8594 -18419 -45433 -12337 20759 -37741
-21982c7741n8500L0234L0234P6033P6033j04359j04359M8304M8302K505K504J9680p1918
$$ -37741 -96241 -66007 -35773 40260 116293 11934 -92425 -44121 4181 6686 9190 28870 -43048
-21969d3048l6138J47056N5460j27735j2285P9312p5257p5258Q5694Q5693l995r5592q2236
$$ -43048 -79186 67870 123330 -4405 -16690 62622 -12635 -87893 -2199 83494 79499 -16093 -98329
-21956i8329J00960M9436m2161r243Q2354j27556j27557J18612J18611r7023n427J65662j7533
$$ -98329 2631 52067 9906 663 83017 -44539 -172096 -53484 65127 -31896 -37323 128339 110806
-21943A10806j14853O8339l8523k21718L459J86654J0613J0615M4964j38230j00066Q3130
$$ 110806 -4047 64292 25769 -195949 -192490 -5836 4777 15392 60356 -77874 -177940 -94810
-21931i4810K0156p1441R6786R6784j24574l2977J33042n0151n0152J33042k2005j13602M0969
$$ -94810 -74654 -146095 -49309 47475 -77099 -110076 22966 -27185 -77337 55705 33700 -79902 -38933
-21918c8933M0967j3416j3418L2380L2381q1786q1788R809R810K6985K6984j8815j8814R7590
$$ -38933 2034 -11382 -24800 7580 39961 -41825 -123613 -113804 -103994 -77009 -50025 -68840 -87654 9936
-21904I936R7591j640j84835m4576J38618J2672J2673P0397j12796j12798P0398q2265q2265
$$ 9936 107527 105887 -78948 -123524 15094 27766 40439 110836 -1960 -114758 -44360 -126625 -208890
-21891b08890J42913J42911j09457j09458J04270J04269n1255n1254j6907j6906J02271q0922
$$ -208890 -65977 76934 -32523 -141981 -37711 66558 15303 -35951 -52858 -69764 32507 -48415
-21879d8415q0923J02272M2160M2161l7987l7985q886q885q886q885k6060k6060Q8437r4758
$$ -48415 -129338 -27066 15094 57255 19268 -18717 -27603 -36488 -45374 -54259 -80319 -106379 -17942 -112700
-21865a12700o9235J13960J21593o1601j06447J98878J53080j52245j32923N0271Q289Q289
$$ -112700 -181935 -67975 53618 -7983 -114430 84448 237528 85283 -47640 2631 10920 19209
-21853A9209J14199o8997k33108m9913K08152K4956p4273p4274L9269L9269L9268L9268m1593
$$ 19209 133408 64411 -168697 -218610 -10458 14498 -59775 -134049 -94780 -55511 -16243 23025 -18568
-21840a8568m1595M204M205O7176O7178r6934r6935J30150n3044r5026K10298J27288j78037
$$ -18568 -60163 -55959 -51754 15422 82600 -14334 -111269 18881 -34163 -129189 81109 208397 30360
-21827C0360r0255R2939L0443L0443L727j79467o4971J18224q7870q7871N5400N5400M3950
$$ 30360 -59895 33044 63487 93930 97657 -81810 -146781 -28557 -116427 -204298 -148898 -93498 -49548
-21814d9548M3950M7766j35428l2381l2381J9142J9143J10740J10739p7226p7225R0703r2492
$$ -49548 -5598 42168 -93260 -125641 -158022 -138880 -119737 -8997 101742 24516 -52709 37994 -54498
-21801e4498j38529J66796J66795j38530j16583O6611n5519n5519N1345N1344N1345N1344
$$ -54498 -193027 -26231 140564 2034 -114549 -47938 -103457 -158976 -107631 -56287 -4942 46402
-21789D6402p8418p8418J3179J3179j9858j9858P1739P1739K1170K1170n8978n8977o1125
$$ 46402 -32016 -110434 -97255 -84076 -103934 -123792 -52053 19686 40856 62026 3048 -55929 -117054
-21776a17054J22070Q7721r5472r1658R1538k2959j14556J50336N8739k38952O6373K16171
$$ -117054 5016 92737 -2735 -94393 -2855 -25814 -140370 9966 68705 -170247 -103874 112297
-21764A12297q9152j48309L4886O4941J56538R3566k11760j39244J66079K1051p0546O3748
$$ 112297 23145 -125164 -90278 -25337 131201 224767 13007 -126237 39842 60893 -9653 54095
-21752E4095k7849r6547Q6647J00006q3189J01914J0317k19869Q5454K99184o143j30181l8583
$$ 54095 26246 -70301 16346 116352 33163 135077 145394 -74475 10979 310163 304020 173839 135256
-21739A35256o3390o3391J00602J00602N4804N4803k7252k7253O4345O4345o7804o7803Q4859
$$ 135256 71866 8475 109077 209679 264483 319286 292034 264781 329126 393471 325667 257864 342723
-21726C42723Q4859K1885K1886J07758J07759J09607J8009n2597J30598L17610J2285j32745
$$ 342723 427582 449467 471353 579111 686870 796477 814486 761889 892487 1210097 1222382 1089637
-21714A089637N0450J71150j2047j62800p1203o2615o2616j19864k8267P276j75920k21719
$$ 1089637 1140087 1311237 1299190 1136390 1065187 1002572 939956 820092 791825 799101 623181 401462
-21702D01462l8524m174r5772P275R8873o2854o2854N1643l9955m8542J34654M8780j34414
$$ 401462 362938 358764 262992 270267 369140 306286 243432 295075 255120 206578 341232 390012 255598
-21689B55598q0625J02570J02570q0625r5891Q7304P5854j07341Q6827Q6827q8735q8735J07818
$$ 255598 174973 277543 380113 299488 203597 290901 366755 259414 346241 433068 344333 255598 363416
-21676C63416p5378M771J87966J09011p4185j60057K3138L6496n5102j5028J68168J04240
$$ 363416 288038 292809 480775 589786 515601 355544 378682 415178 360076 345048 513216 617456
-21664F17456p8955J8367K01562J26186L4587R7561R7561K4629K4629o3152o3153o0289k43486
$$ 617456 538501 556868 758430 884616 919203 1016764 1114325 1138954 1163583 1100431 1037278 976989 733503
-21651G33503K7492L32816O1841j21355J99237J99236O2795O2794O2795O2794N5877N5877
$$ 733503 760995 1093811 1155652 1034297 1233534 1432770 1495565 1558359 1621154 1683948 1739825 1795702
-21639A795702j42585j42584j16823j16823j62621j62622j36860j36859r1061r1061Q170Q170
$$ 1795702 1653117 1510533 1393710 1276887 1114266 951644 814784 677925 586864 495803 503973 512143
-21627E12143l7629l7629l5184l5184J0614J0615j61131j61130L7331L7330o559o560Q8854
$$ 512143 474514 436885 401701 366517 377131 387746 226615 65485 102816 140146 133587 127027 215881
-21614B15881Q8855L4468j48727j48727L4469Q0029Q0028j5385j5386J21057J21057j38470
$$ 215881 304736 339204 190477 41750 76219 156248 236276 220891 205505 326562 447619 309149
-21602C09149j38470J30598J30598j28928j28929K3735K3734K3734K3735L5840L5839L5840
$$ 309149 170679 301277 431875 302947 174018 197753 221487 245221 268956 304796 340635 376475
-21590C76475L5840J2941J2940K4391K4390m5262J37933K18081q7244o0529J22667j0913j0913
$$ 376475 412315 425256 438196 462587 486977 441715 579648 797729 710485 649956 772623 761710 750797
-21577G50797R4759q8438q8437R4759o56o56J8427j64769j34713M8483o9832k53026N8023
$$ 750797 845556 757118 668681 763440 762784 762128 780555 615786 481073 529556 459724 206698 264721
-21564B64721N8024j21355j21355N2120N2120j2761j2762j04359P8836J24635n8561j44195
$$ 264721 322745 201390 80035 132155 184275 171514 158752 54393 133229 257864 199303 55108
-21552E5108j44193j0615J72579N2359j30836j6340j6339l698l697l697l697J9202J9202j41094
$$ 55108 -89085 -99700 72879 125238 -5598 -21938 -38277 -41975 -45672 -49369 -53066 -33864 -14662 -155756
-21538a55756M2102J03405p9790j1092j1092J8486J8487J2761J2762R6994N396j33906M9287
$$ -155756 -113654 -10249 -90039 -101131 -112223 -93737 -75250 -62489 -49727 47267 52663 -81243 -31956
-21525c1956J31343n1852j20549k8952m0402N1196J19892o3300r6696Q6499k2274j13870M1415
$$ -31956 99387 47535 -73014 -101966 -142368 -91172 28720 -34580 -131276 -44777 -67051 -180921 -139506
-21512a39506M1416l3007J50187P7673j05521n3999J29196k4420j16017K1379J12975J1838
$$ -139506 -98090 -131097 19090 96763 -8758 -62757 66439 42019 -73998 -52619 60356 72194
-21500G2194j71357l7778N3819m5143m5143O9355k2244n9455J23740J18015o5179J79J79j18135
$$ 72194 -99163 -136941 -83122 -128265 -173408 -104053 -126297 -185752 -62012 56003 -9176 -8997 -8818 -126953
-21486a26953j18135R4639R4639j2225j2224O2019O2018m4844m4844M2936M2935j17358O5836
$$ -126953 -245088 -150449 -55810 -68035 -80259 -18240 43778 -1066 -45910 -2974 39961 -77397 -11561
-21473a1561P3945j09248j43599L9597J431J431J19745J19744j09278j09279J08265J08265
$$ -11561 62384 -46864 -190463 -150866 -149435 -148004 -28259 91485 -17793 -127072 -18807 89458
-21461H9458m324j87518r2104R1091J38081m5112j51977L1218J03733p9462N4118J45714j04865
$$ 89458 85134 -102384 -194488 -103397 34684 -10428 -162405 -131187 -27454 -106916 -52798 92916 -11949
-21448a1949j96464O8788J60384l727l727m3800m3801L667L668m2131m2132M0879M0879K7521
$$ -11949 -208413 -139625 20759 17032 13305 -30495 -74296 -70629 -66961 -109092 -151224 -110345 -69466 -41945
-21434d1945o4076q3040J00155J05879p7315p0636J12559n3462n3462Q4412p186j15958O7237
$$ -41945 -106021 -189061 -88906 16973 -60342 -130978 -18419 -71881 -125343 -40931 -48117 -164075 -96838
-21421i6838J35935m7259j12142P1054K4122K4122J04269p8926j85788k594K0305K0306K6507
$$ -96838 39097 -8162 -120304 -49250 -25128 -1006 103263 24337 -161451 -164045 -143740 -123434 -96927
-21408i6927K6507R333J00929L8911j44283j19476J85848L1546k73778n2418K52907J05968
$$ -96927 -70420 -61087 39842 78753 -65530 -185006 842 32388 -241390 -293808 -40901 65067
-21396F5067p7225J0556J0554n1463J31730r482j92676j52603L0592J18373J18373P4363j08831
$$ 65067 -12158 -1602 8952 -42511 89219 79737 -112939 -265542 -234950 -116577 1796 76159 -32672
-21383c2672j03107j1509J6161J6161r2612R0584K06034K2840p6391p6390o6850o6849R7263
$$ -32672 -135779 -147288 -131127 -114966 -207578 -116994 89040 111880 35489 -40901 -107751 -174600 -77337
-21370g7337R7261j86086k892J61220k1975q7811R5384J41182m2012k32123m8930J13275K1676
$$ -77337 19924 -166162 -169054 -7834 -29809 -117620 -22236 118946 76934 -155189 -204119 -90844 -69168
-21357f9168n7516J25678L9805j43389p4214J08980J03256p9939p6122J5475M4099M4099q9481
$$ -69168 -126684 -1006 38799 -104590 -178804 -69824 33432 -46507 -122629 -107154 -63055 -18956 -108437
-21344a08437q9480O8907O8907K3108J14705m1774k24968j789Q9809J5385J5386L936j79260
$$ -108437 -197917 -129010 -60103 -36995 77710 35936 -189032 -190821 -101012 -85627 -70241 -66305 -245565
-21331b45565m5679K59646M0431j42763P0964P0964j16047j16047R7680R7680q0625q0625
$$ -245565 -291244 -31598 8833 -133930 -62966 7998 -108049 -224096 -126416 -28736 -109361 -189986
-21319a89986J0973J0972P5855P5854p6808p6809R0167R0165M294M293j40735m9138J66498
$$ -189986 -179013 -168041 -92186 -16332 -93140 -169949 -79782 10383 14677 18970 -121765 -170903 -4405
-21306d405j6698r9767Q3428P7702j05492j9619P1978q2593q2593K0454K0455K0454K0455
$$ -4405 -21103 -120870 -37442 40260 -65232 -84851 -12873 -95466 -178059 -157605 -137150 -116696 -96241
-21293i6241q170q170q170q170J1689J1688J1688J1688P8478P8478p2277j63873r6129Q7065
$$ -96241 -104411 -112581 -120751 -128921 -117232 -105544 -93856 -82168 -3690 74788 2511 -161362 -257491 -170426
-21279a70426O9891O9891m4606m4606J192J193K087K087M7886M7886k4628k4629Q9867r3326
$$ -170426 -100535 -30644 -75250 -119856 -118664 -117471 -115384 -113297 -65411 -17525 -42153 -66782 23085 -70241
-21265g0241p5675J07519j8426j8427J53317k9876j32923N0271R8037q5156o2258o2257P5138
$$ -70241 -145916 -38397 -56823 -75250 78067 48191 -84732 -34461 63576 -21580 -83838 -146095 -70957
-21252g0957P5138Q6589r6606M7944M7946n5102n5101K3137K3138K3138K3138q8376q8378
$$ -70957 4181 90770 -5836 42108 90054 34952 -20149 2988 26126 49264 72402 -15974 -104352
-21239a04352O4286O4284m4486m4487M7111M7110o5954o5955K5642K5643N9991N9991J0377
$$ -104352 -40066 24218 -20268 -64755 -17644 29466 -36488 -102443 -76801 -51158 8833 68824 79201
-21226G9201j72818k6001k6000N4147N4148j2642j2643L3157L3155J0257J0257l5541l5541
$$ 79201 -93617 -119618 -145618 -91471 -37323 -49965 -62608 -29451 3704 13961 24218 -11323 -46864
-21213d6864M532M532j09965P3230R2134r1060p9611J03584l9538l9537O3510O3510k0216
$$ -46864 -42332 -37800 -147765 -74535 17599 -73461 -153072 -49488 -89026 -128563 -65053 -1543 -21759
-21200b1759k0216j42346M0850J53437j51887o7923K37402J5087k90237J75383J75382k21539
$$ -21759 -41975 -184321 -143471 9966 -141921 -209844 27558 42645 -247592 -72209 103173 -118366
-21188a18366k21539J75383J75382k5224k5225n5758J27437J1032k94292q051K97274m8779
$$ -118366 -339905 -164522 10860 -14364 -39589 -95347 32090 43122 -251170 -259221 38053 -10726
-21176a0726m8781R2432r0762j48011J57314k5881k5881Q2414Q2413k0634k0633j1092j94286
$$ -10726 -59507 32925 -57837 -205848 -48534 -74415 -100296 -17882 64531 43897 23264 12172 -182114
-21163a82114J22488J22487j20579j20580R3149R3147K8266K8267k1349k04544O0708O0707
$$ -182114 -59626 62861 -57718 -178298 -85149 7998 36264 64531 43182 -161362 -100654 -39947
-21151c9947j03405j03405J65663J65662j09129j09130M0551M0551K9101K9100R5892q7304
$$ -39947 -143352 -246757 -81094 84568 -24561 -133691 -93140 -52589 -23488 5612 101504 14200
-21139A4200j78901M294J01377J01377q9450q9451k6477J56718O5119j18074K5284K5285n248
$$ 14200 -164701 -160407 -59030 42347 -47103 -136554 -163031 -6313 58806 -59268 -33984 -8699 -13947
-21126a3947n247J55047j50277j61727J43599j2643j95837J51470J51469j19506O3688J59104
$$ -13947 -19194 135853 -14424 -176151 -32552 -45195 -241032 -89562 61907 -57599 6089 165193
-21114A65193j46223k54814J72640J76455j28867K9517K9519j42226j42226O7446O7445k4151
$$ 165193 18970 -235844 -63204 113251 -15616 13901 43420 -98806 -241032 -173586 -106141 -130292
-21102a30292k4152n9455n9455R3208R3208J9261J9262k6537k6537k5583k5583O6015O6014
$$ -130292 -154444 -213899 -273354 -180146 -86938 -67677 -48415 -74952 -101489 -127072 -152655 -86640 -20626
-21089b0626N9335N9336k0812k0813j16225O6968K38714o6611j72222J0972M1505M1506n6772
$$ -20626 38709 98045 77233 56420 -59805 7163 245877 179266 7044 18016 59521 101027 44255
-21076D4255n6770R5890R5891r2552r2550l5304l5303K0037K03231j0495j93690M7469M7467
$$ 44255 -12515 83375 179266 86714 -5836 -41140 -76443 -56406 146825 136330 -57360 -9891 37576
-21063C7576j31909N1285J55286j50038o9891J13303k8384k8386j6936j6936N1762N1761j54331
$$ 37576 -94333 -43048 112238 -37800 -107691 5612 -22772 -51158 -68094 -85030 -33268 18493 -135838
-21050a35838K8863J72639j0556r0702R2491j1509j1509q0207q0207n4446J28749l1546l1546
$$ -135838 -106975 65664 55108 -35594 56897 45388 33879 -46328 -126535 -180981 -52232 -83778 -115324
-21037a15324J02987q0207r1657R1538P4602j08594J7354J7353j02868Q0327R1776r1419r0703
$$ -115324 -12337 -92544 -184201 -92663 -18061 -126655 -109301 -91948 -194816 -114489 -22713 -114132 -204835
-21024b04835R2492O9593O9592o5894o5896K5702K5703p8300p8299N5281N5280J17299j88025
$$ -204835 -112343 -42750 26842 -39052 -104948 -79246 -53543 -131843 -210142 -154861 -99581 17718 -170307
-21011a70307j15510J89814J32565j72758l9180J44016k5821k5822J34474m8721j00065j00065
$$ -170307 -285817 -96003 36562 -136196 -175376 -31360 -57181 -83003 51471 2750 -97315 -197380
-20999a97380M1147M1147K5881K5882Q3128Q3130j83075J19J52781l0413p3349p3350O799
$$ -197380 -156233 -115086 -89205 -63323 19805 102935 -80140 -80021 72760 42347 -31002 -104352 -97553
-20986i7553O798j252j253J0198J0197j01437Q1758Q1758j01437K087K087n5161n5162O6015
$$ -97553 -90755 -92007 -93260 -83062 -72865 -174302 -92544 -10786 -112223 -110136 -108049 -163210 -218372 -152357
-20972a52357O6015J11812j93511j23322L04131P5139k30186k4092J59103o6074o6074R5175
$$ -152357 -86342 25470 -168041 -291363 12768 87907 -142279 -166371 -7268 -73342 -139416 -44241
-20960d4241q8019J06625J06625j47176j47176J81048k147j13572O9622n6324n6324J39275
$$ -44241 -132260 -25635 80990 -66186 -213362 -32314 -34461 -148033 -78411 -134735 -191059 -51784
-20948e1784m3921n5370J27825K9548j53646O650O649Q9659Q9659j938j938l9329l9327l9329
$$ -51784 -95705 -151075 -23250 6298 -147348 -140698 -134049 -44390 45269 43331 41393 2064 -37263 -76592
-20934g6592l9329Q379Q379Q378Q379l071l072l071l071k9787k9787Q378J91573k4360k07555
$$ -76592 -115921 -107542 -99163 -90785 -82406 -85477 -88549 -91620 -94691 -124478 -154265 -145887 45686 21326 -186229
-20919a86229N9604N9604j4819j4819j4819j4819O4375O4374p6838p6838q2563J00632J12082
$$ -186229 -126625 -67021 -81840 -96659 -111478 -126297 -61922 2452 -74386 -151224 -233787 -133155 -21073
-20906b1073p1113j16972O6223m8273m8274Q1490Q1489j24605N8591J68554j4640j13870j13871
$$ -21073 -92186 -209158 -142935 -191208 -239482 -157992 -76503 -201108 -142517 26037 11397 -102473 -216344
-20893b16344J11307J11305m8988k32184o27J82570l3067j24665O0439O0439N4714N4714n2627
$$ -216344 -105037 6268 -42720 -274904 -275531 -92961 -126028 -250693 -190254 -129815 -75101 -20387 -73014
-20880g3014n2627n8352n8351J45834N4237j00334Q2862K6089j57105O0439O0439j62830K0364
$$ -73014 -125641 -183993 -242344 -96510 -42273 -142607 -59745 -33656 -190761 -130322 -69883 -232713 -212349
-20867b12349L9448j43747Q4054L89378o8609l73933n7159J26036R5504R5504q230q229N4743
$$ -212349 -172901 -316648 -232594 156784 88175 -285758 -342917 -216881 -121377 -25873 -34103 -42332 12411
-20854A2411l6853r1240R1955R1955r1239q1221J0376N0450m1147k4927O6671k4927j16525
$$ 12411 -24442 -115682 -23727 68228 -23011 -104232 -93856 -43406 -84553 -109480 -42809 -67736 -184261
-20841a84261L0890J22488q7423q7423J32029J32029q1698q1698p9790p9790J33937J33937
$$ -184261 -153371 -30883 -118306 -205729 -73700 58329 -23369 -105067 -184857 -264647 -130710 3227
-20829C227m5440m5441M6157M6155o8399o8400K3198K3197P931P932q3667q3666J65126J65126
$$ 3227 -42213 -87654 -41497 4658 -63741 -132141 -108943 -85746 -77815 -69883 -153550 -237216 -72090 93036
-20815I3036j76456j76457J35548M3950j10621P2575Q0207j02987N784R7382j9977j9977P7345
$$ 93036 -83420 -259877 -124329 -80379 -191000 -118425 -38218 -141205 -135421 -38039 -58016 -77993 -648
-20802f48P7344q7482q7483M115M115m4547m4546J252J252J2315J2314P5288j6310j05045
$$ -648 76696 -10786 -98269 -94154 -90039 -134586 -179132 -177880 -176628 -164313 -151999 -76711 -93021 -198066
-20788a98066P8150J75472p723j16017O7178O7177j16017q9302R3894k6329k6328K8773o2824
$$ -198066 -119916 55556 47833 -68184 -1006 66171 -49846 -139148 -45254 -71583 -97911 -69138 -131962
-20775a31962K6865K10059L4499j48697l4200l4200k1319k1319k1319k1319K6388K6388K6388
$$ -131962 -105097 104962 139461 -9236 -43436 -77636 -98955 -120274 -141593 -162912 -136524 -110136 -83748
-20762h3748K6388P156P156k1468j13066k9101J54094O2495j20698L1010J22606r3028r3029
$$ -83748 -57360 -50204 -43048 -64516 -177582 -206683 -52589 9906 -110792 -79782 42824 -50204 -143233
-20749a43233K7193K7193J18790J18791k02516k02517l6496J46700J02809J1211j7413j7414
$$ -143233 -116040 -88847 29943 148734 -53782 -256299 -292795 -146095 -43286 -32075 -49488 -66902
-20737f6902L6974L6972j15689j15690J70553J70552j65304j65305J82241J82240k16589j24993
$$ -66902 -29928 7044 -108645 -224335 -53782 116770 -48534 -213839 -31598 150642 -65947 -190940
-20725a90940J32626n0570k16590Q8735J87251M055k6478k6477j5028j5028J3597J05194J01496
$$ -190940 -58314 -108884 -325474 -236739 -49488 -45433 -71911 -98388 -113416 -128444 -114847 -9653 91843
-20712I1843q1699l0173O1422p7881j69480J01497J01497j08176j08176M4487M4487P5019
$$ 91843 10144 -20029 41393 -36488 -205968 -104471 -2974 -111150 -219326 -174839 -130352 -55333
-20700e5333P5019j44432j44434K09017J17418k14621l1427Q3070q528J11694J11694j64768
$$ -55333 19686 -124746 -269180 -60163 57255 -157366 -188793 -105723 -114251 -2557 109137 -55631
-20688e5631J8427J52006j53318j23740J81584Q2355k22971l5362J47832k0097k0096Q94Q95
$$ -55631 -37204 114802 -38516 -162256 19328 101683 -121288 -156650 -8818 -28915 -49011 -48117 -47222
-20675d7222m4905m4904J10859J10859j08592j08594O2198k9399r2373R0822L5005j48190
$$ -47222 -92127 -137031 -26172 84687 -23905 -132499 -70301 -99700 -192073 -101251 -66246 -214436
-20663b14436J80035J80034k12117k12118J23741J23740K4748K4747l2499l2501K2840j60356
$$ -214436 -34401 145633 -66484 -278602 -154861 -31121 -6373 18374 -14125 -46626 -23786 -184142
-20651a84142j3417J69777k206r3804P7941j3656j67273J5922J62860k0335k2482k2482n6831
$$ -184142 -197559 -27782 -29988 -123792 -45851 -59507 -226780 -210858 -47998 -68333 -90815 -113297 -170128
-20638a70128J26364J21593o1602j07399P5794R4101q9092j65424J39901J41809j63516j44433
$$ -170128 -43764 77829 16227 -91172 -15378 78723 -10369 -175793 -35892 105917 -57599 -202032
-20626b02032J60892J1092J1092R8872q4321j53975K9221O7386O7385N0212N0212j02451j02450
$$ -202032 -41140 -30048 -18956 79916 -4405 -158380 -129159 -61773 5612 55824 106036 3585 -98865
-20613i8865K4450K4450r900r899j12947P0249J61846k1349L1129L1128j44432j44433J59401
$$ -98865 -74415 -49965 -59865 -69764 -182711 -112462 49384 28035 59164 90292 -54140 -198573 -39172
-20600c9172k3794p3409p3409M4904M4904M4905M4904J2941J2940J2940J2940j371j372j372
$$ -39172 -62966 -136375 -209784 -164880 -119976 -75071 -30167 -17226 -4286 8654 21594 20223 18851 17479
-20586A7479j371J4252J4253l1546l1546q3070q3070O9593O9593L1904L1903j3895j3893k6299
$$ 17479 16108 30360 44613 13067 -18479 -101549 -184619 -115026 -45433 -13529 18374 4479 -9414 -35713
-20572c5713k6299j29345N3849j2046j2046J52066J52066j58983j58984J69241j3955j26543
$$ -35713 -62012 -191357 -137508 -149554 -161600 -9534 142532 -16451 -175435 -6194 -20149 -146692
-20560a46692N6653K2303K2303R8633q4560j76158P037n010n009R8038R8038P1321P1323K1706
$$ -146692 -90039 -67736 -45433 53200 -31360 -207518 -200481 -205491 -210500 -112462 -14424 56897 128220 149926
-20546A49926j61487O1302O1304m1744m1743j02808j02809J71984J71983j44731j44731J83493
$$ 149926 -11561 49741 111045 69301 27558 -75250 -178059 -6075 165908 21177 -123554 59939
-20534E9939K98r0344R2849o7445o7446J16225J16227k00548j7354N9931N9933o2199o2197
$$ 59939 60237 -30107 62742 -4703 -72149 44076 160303 -40245 -57599 2332 62265 66 -62131
-20521f2131j97925J07401J18850j86475K7253K10447j4730j4728P4243j08950j89099J16226
$$ -62131 -260056 -152655 -33805 -220280 -193027 17420 2690 -12038 62205 -46745 -235844 -119618
-20509a19618J48666l4527o5060o5061N8978N8978l2620l2619k1170k1170P0427P0427p7464
$$ -119618 29048 -5479 -70539 -135600 -76622 -17644 -50264 -82883 -104053 -125223 -54796 15631 -61833
-20496f1833p7464J38172M6573r8455Q4739J66796j38530k16589Q8735R8276q4918k2899O8698
$$ -61833 -139297 -1125 45448 -53007 31732 198528 59998 -156591 -67856 30420 -54498 -77397 -8699
-20483h699q5873q5872j670j670M4129M4129p5138p5139J38589J38588q7720q7722O4942O4941
$$ -8699 -94572 -180444 -182114 -183784 -139655 -95526 -170664 -245803 -107214 31374 -56346 -144068 -79126 -14185
-20469a4185l6198l6198R601R601M354M353m1446m1445l8583l8583N3014N3015K5881K5881
$$ -14185 -50383 -86581 -76980 -67379 -63025 -58672 -100118 -141563 -180146 -218729 -165715 -112700 -86819 -60938
-20455f0938P1679P1680q2890q2891l7093l7092Q7900Q7900o4762o4762j4193j4193j4193
$$ -60938 10741 82421 -469 -83360 -120453 -157545 -69645 18255 -46507 -111269 -125462 -139655 -153848
-20442a53848j4193L7346L7346L7346L7345j6086j6086j6086j6087p499p499p499p498O5015
$$ -153848 -168041 -130695 -93349 -56003 -18658 -34744 -50830 -66916 -83003 -90502 -98001 -105500 -112998 -47983
-20428d7983O5015q7646q7647J14632J14630r9096r9096J03181J03181m9482m9480k8728k8729
$$ -47983 17032 -70614 -158261 -43629 71001 -28095 -127191 -24010 79171 29689 -19791 -48519 -77248
-20415g7248O2869O2868l0637l0636l0637l0637q34q35R6486R6488k08837j17240K81590R8396
$$ -77248 -14379 48489 17852 -12784 -43421 -74058 -74892 -75727 20759 117247 -91590 -208830 72760 171156
-20401A71156k34837n1643J69717j35607p2634J10562L9954n1643K7790K7788r2431R0762
$$ 171156 -63681 -115324 54393 -81214 -153848 -43286 -3332 -54975 -27185 603 -91828 -1066
-20389a066M7826j35368J9202J10799n3789n3790J12230p0963j97865j4670J45626J45624
$$ -1066 46760 -88608 -69406 41393 -12396 -66186 46044 -24919 -222784 -237454 -91828 53796
-20377E3796n6964n6965R5696R5698j05627j05625J10008J8412q3680R9513M7991j35204M6081
$$ 53796 -3168 -60133 35563 131261 25634 -79991 30017 48429 -35251 64262 112253 -22951 23130
-20364B3130M6082p4139J7457P4229j08965j03241P9954j7368j7369P0413j12783j70985J34340
$$ 23130 69212 -4927 12530 86759 -22206 -125447 -45493 -62861 -80230 -9817 -122600 -293585 -159245
-20351a59245J57240k5956j30911N2284M0834n0763l2217N9380N9381l2217m3667M7930r317
$$ -159245 -2005 -27961 -158872 -106588 -65754 -116517 -148734 -89354 -29973 -62190 -105857 -57927 -67244
-20338f7244r318k2676k2676K8848K8848p8970J2627J67198j5997q4754R8440O843j76351
$$ -67244 -76562 -99238 -121914 -93066 -64218 -143188 -130561 36637 20640 -64114 34326 41169 -135182
-20325a35182j7965J65230J0659q0937j4148j4148P1724P1724l4185l4184L4512j48681j8233
$$ -135182 -153147 12083 22742 -58195 -72343 -86491 -14767 56957 22772 -11412 23100 -125581 -143814
-20312a43814J64961Q50j82345Q9585Q9584j96656j3463K14577r0747r0748K14577N1419j31775
$$ -143814 21147 21997 -160348 -70763 18821 -177835 -191298 23279 -67468 -158216 56361 107780 -23995
-20299b3995o1169L0428L4543L4542n531n531l9880l9880p0412J12782J23516j81808j30285
$$ -23995 -85164 -54736 -20193 14349 8818 3287 -36593 -76473 -146885 -34103 89413 -92395 -222680
-20286b22680J75040O4359k7237O0543l1055j40183M3011J34607m8586j4237P7359K0112p1486
$$ -222680 -47640 16719 -10518 50025 18970 -121213 -78202 56405 7819 -6418 70941 91053 19567
-20273A9567p320p320j04642j04643J29123J29121q6513N084J26497n6697j54018K9176J0093
$$ 19567 12247 4927 -99715 -204358 -75235 53886 -32627 -27543 98954 42257 -111761 -82585 -72492
-20260g2492j73102p0055J13140J08847J08846l2366l2366j834j834M3966M3964n9648n9649
$$ -72492 -245594 -315649 -202509 -93662 15184 -17182 -49548 -51382 -53216 -9250 34714 -24934 -84583
-20247h4583j3850j3850L3857L3857J02555q0639o7044J16151M7454M7454j94898j94898K02024
$$ -84583 -98433 -112283 -78426 -44569 57986 -22653 -89697 26454 73908 121362 -73536 -268434 -66410
-20234f6410K02024r1135r1135J83657M62l43028l7704K18007L4810o5850o5850P5362P5361
$$ -66410 135614 44479 -46656 137001 137463 -205565 -243269 -25262 9548 -56302 -122152 -46790 28571
-20221B8571j15465j15466J59327J59326j88204j88204Q6588Q6589k6001k6000l7450l7450
$$ 28571 -86894 -202360 -43033 116293 -71911 -260115 -173527 -86938 -112939 -138939 -176389 -213839
-20209b13839K10149K6954j86772l578J10919J10918r1358r1360J670J670J3119J3120l0771
$$ -213839 -3690 23264 -163508 -167086 -56167 54751 -36607 -127967 -126297 -124627 -111508 -98388 -129159
-20196a29159J52423m9853k33049O8221K51415p6807p6808J27377J27377j47414j47414J4908
$$ -129159 23264 -26589 -259638 -191417 59998 -16809 -93617 33760 161137 13723 -133691 -118783
-20184a18783J4909J4908J4908L9717L9715J6817j66378j25350L02104J57075k70379j83553
$$ -118783 -103874 -88966 -74058 -34341 5374 22191 -144187 -269537 32567 189642 -80737 -264290
-20172b64290J21773Q3606r9588L0950K14144N0033j33163o5417o5418J4729J4730N0987N0986
$$ -264290 -142517 -58911 -158499 -127549 86595 136628 3465 -61952 -127370 -112641 -97911 -46924 4062
-20159D062N0987N0987j13125j13125L9537L9537P693P693P693P692n1464n1464M0134M0134
$$ 4062 55049 106036 -7089 -120214 -80677 -41140 -33447 -25754 -18061 -10369 -61833 -113297 -73163 -33029
-20145c3029k8804k8803O2795O2793j14675j14676M5620K28814N0808j32386j20937O2258
$$ -33029 -61833 -90636 -27841 34952 -79723 -194399 -148779 80035 130843 -1543 -122480 -60222
-20133f0222M8899M8899l1248l1247J0018J0019q1579q1580J4790J4789J4789J4789L7987
$$ -60222 -11323 37576 6328 -24919 -14901 -4882 -86461 -168041 -153251 -138462 -123673 -108884 -70897
-20120g0897L7987J06684p6509j30897N2299J32446n0748n3133n3134K7014K7014J3656J3657
$$ -70897 -32910 73774 -2735 -133632 -81333 51113 365 -52768 -105902 -78888 -51874 -38218 -24561
-20107b4561K5104K5106p3766J09427K9281j53914k2244J60951l161j86355L9299L9299o3749
$$ -24561 543 25649 -48117 61310 90591 -63323 -85567 75384 72223 -114132 -74833 -35534 -99283
-20094i9283o3748J23263J23262k04961k1766J65304j7890j70552J2643J17598o5598M8900
$$ -99283 -163031 -39768 83494 -121467 -143233 22071 4181 -166371 -153728 -36130 -101728 -52828
-20082e2828M8900L2678L2680K146j81047j40975J64351J75800p394j07937j07937L3276K16470
$$ -52828 -3928 28750 61430 63576 -117471 -258446 -94095 81705 74311 -33626 -141563 -108287 108183
-20069A08183J00065k05260j25110N8083O9532O9533p1680p1679q9808q9809J73535J73533
$$ 108183 208248 2988 -122122 -64039 5493 75026 3346 -68333 -158141 -247950 -74415 99118
-20057I9118J5684j67511j10263j10263Q9153Q9153k445k445J01555J01557j12171j12171
$$ 99118 114802 -52709 -162972 -273235 -184082 -94929 -97374 -99819 1736 103293 -8878 -121049
-20045a21049O7207O7207k4390k4390L1427L1426j21234j21236J85998J85997j49860j49859
$$ -121049 -53842 13365 -11025 -35415 -3988 27438 -93796 -215032 -29034 156963 7103 -142756
-20033a42756J2344J2345J2344J2344l7271l7271k5822k5821n069J78126Q6528r6665N2179
$$ -142756 -130412 -118067 -105723 -93379 -130650 -167921 -193743 -219564 -224633 -46507 40021 -56644 -4465
-20020d465N2179l9418l9417q3309R9887J11336p1859o8042J15152r0940r0942K326K326j88503
$$ -4465 47714 8296 -31121 -114430 -14543 96793 24934 -43108 72044 -18896 -109838 -107512 -105186 -293689
-20006b93689J16823K50401n4922j6758j6756j4372j4371j4372j4372J9978J9977J9977J9977
$$ -293689 -176866 73535 18613 1855 -14901 -29273 -43644 -58016 -72388 -52410 -32433 -12456 7521
-19993G521m4904m4904M6693M6693n6353n6354L5243L5244Q050Q051Q051Q049r123r124Q2473
$$ 7521 -37383 -82287 -35594 11099 -45254 -101608 -66365 -31121 -23071 -15020 -6969 1080 -8043 -17167 65306
-19978F5306Q2473q4441q4441J2881J2880l1963N9633P6809j06387r1120R2074R2075r1121
$$ 65306 147779 63338 -21103 -8222 4658 -27305 32328 109137 2750 -88370 3704 95779 4658
-19965D658j56955K6239O4404O4404j7457j7458j7458j7457O395O396O396O396m7037m7036
$$ 4658 -152297 -126058 -61654 2750 -14707 -32165 -49623 -67080 -60685 -54289 -47893 -41497 -88534 -135570
-19951a35570j237j238Q1773Q1772p0889p0889K758K758K758K758J22979J22980r8381k81575
$$ -135570 -136807 -138045 -56272 25500 -45389 -116278 -113520 -110762 -108004 -105246 17733 140713 42332 -239243
-19937b39243K7804K10999o7609o7610J39438m3756j69703J35622J35070m8124o9115K2482
$$ -239243 -211439 -440 -68049 -135659 3779 -39977 -209680 -74058 61012 12888 -56227 -33745
-19925c3745r005r004o6254K5345J38647m4546n0270J32923L5601j47593j4014j4014k14384
$$ -33745 -42750 -51754 -118008 -92663 45984 1438 -48832 84091 119692 -27901 -41915 -55929 -270313
-19912b70313R0942L16118J0794j72401J0794L1784n9812o1244o1244K4629K4629K9399K9400
$$ -270313 -179371 136747 147541 -24860 -14066 17718 -42094 -103338 -164582 -139953 -115324 -85925 -56525
-19899e6525K9399K9399K8848K8848j6951j6951j43851j43852J6444J99639J71969j1226m9392
$$ -56525 -27126 2273 31121 59969 43018 26067 -117784 -261636 -245192 -45553 126416 115190 65798
-19886F5798m9392p8015p8016J35712J35711n2255n2254n7978n7979N6518l5079r8053Q5142
$$ 65798 16406 -61609 -139625 -3913 131798 79543 27289 -30689 -88668 -32150 -67229 -165282 -80140
-19873h0140J17582o5611M8884M8884j41942j41944J93915J93913j45327j45327P0308k1289
$$ -80140 37442 -28169 20715 69599 -72343 -214287 -20372 173541 28214 -117113 -46805 -68094
-19861f8094o3272J19924k3198j14795N9813J51409n8500n8500m7051m7052J68584P6988k79861
$$ -68094 -131366 -11442 -34640 -149435 -89622 61787 3287 -55213 -102264 -149316 19268 96256 -183605
-19848a83605r6667J91485Q289j52007J53319P8896j04300r363Q2236m3712M7886J52841l0354
$$ -183605 -280272 -88787 -80498 -232505 -79186 -290 -104590 -113953 -31717 -75429 -27543 125298 94944
-19835I4944o8519o8519o8340K3257Q6231r6965k8267J54928n1165n1165J56836J56837j17956
$$ 94944 26425 -42094 -110434 -87177 -946 -97911 -126178 28750 -22415 -73580 83256 240093 122137
-19822A22137j17956j02688j02690J16763J16762j22248l0652J79258l935q5991N605j1569
$$ 122137 4181 -98507 -201197 -84434 32328 -89920 -120572 58686 54751 -31240 -25635 -37204
-19810c7204j1569J4670J4670k5404k5404j3954P7643M9018j34175n9396J23800L2202j50992
$$ -37204 -48773 -34103 -19433 -44837 -70241 -84195 -6552 42466 -91709 -151105 -27305 4897 -146095
-19797a46095l1726J51471R9945q3248j14497k2899O6790O6789L7211L7212j09726j09726
$$ -146095 -177821 -26350 73595 -9653 -124150 -147049 -80259 -13470 23741 60953 -48773 -158499
-19785a58499M8900J40496N0808j32386r8992Q4203J24276n8918m1505N0092j8605j8606L3871
$$ -158499 -109599 30897 81705 -50681 -149673 -65470 58806 -112 -41617 8475 -10130 -28736 5135
-19772E135n7724k3377J59818k8624j20221R5413R5414O679O679N2478N2478M5083M5083j7890
$$ 5135 -52589 -75966 83852 55228 -64993 30420 125834 132513 139192 191670 244148 289231 334314 316424
-19758C16424P3708K19691L6496p395p394n6653n6652k8028O3570J2046j71149q5277R7919
$$ 316424 390132 609823 646319 638924 631530 574877 518225 490197 553767 565813 394664 309387 407306
-19745D07306j5863j99057l4946J48250L3753L3753n4029k37223m3652J39543L6496j46699
$$ 407306 391443 192386 157440 305690 339443 373196 319167 81944 38292 177835 214331 67632
-19733F7632M055M055K1229J12828L101j80095L1726L1725j74369Q826L02701k624k06691
$$ 67632 71687 75742 96971 209799 212900 32805 64531 96256 -78113 -69287 233414 230790 24099
-19720B4099k3496N8561l3038m2577m2579j0138J73057K2303j60891n97R1001j09368j7771
$$ 24099 603 59164 26126 -16451 -59030 -69168 103889 126192 -34699 -35296 55705 -53663 -71434
-19707g1434K03589K0395j63634J9559j06386j06387L18205J35012k73361r0167J33818m9376
$$ -71434 132155 152550 -11084 8475 -97911 -204298 113907 248919 -24442 -114609 19209 -30167
-19695c0167L0770L0771j16166O7029J92974j12350j13542O9651o3926o3928J85103J908j01138
$$ -30167 603 31374 -84792 -17763 175211 62861 -50681 18970 -44956 -108884 76219 78127 -23011
-19682b3011Q2055P0130j13066J431J431J8606J8606p8716p8717J28749L7152j93750J11575
$$ -23011 59044 129174 16108 17539 18970 37576 56182 -22534 -101251 27498 64650 -129100 -17525
-19669a7525J63098j42227r4518Q8675l4647N6949P9850j03345p8537J3059o7088K4510J04419
$$ -17525 145573 3346 -91172 -2497 -37144 19805 99655 -3690 -82227 -69168 -136256 -111746 -7327
-19656g327p8777l2977J50217L9537n2060j7712j09308M1923K25117n5400k38594J22070J22070
$$ -7327 -86104 -119081 31136 70673 18613 901 -108407 -66484 158633 103233 -135361 -13291 108779
-19643A08779j64171J9023J86176j19148n0450J32744J074j82121k9459J53735R9588q3606
$$ 108779 -55392 -36369 149807 30659 -19791 112953 114027 -68094 -97553 56182 155770 72164
-19631G2164j17955k6358M6156m5441l9716N1882L4110L4110n1761n1763O8460O8459q4202
$$ 72164 -45791 -72149 -25993 -71434 -111150 -59268 -25158 8952 -42809 -94572 -26112 42347 -41855
-19618d1855q4203N6533N6533l5065l5065j0257j0257j0257j0257Q2891Q2890j30836N2359
$$ -41855 -126058 -69525 -12992 -48057 -83122 -93379 -103636 -113893 -124150 -41259 41631 -89205 -36846
-19605c6846J95479j09846l38838Q8615K27205p8120p4304J08892n7129n7130R5534R5532
$$ -36846 158633 48787 -290051 -201436 25769 -52351 -126655 -17763 -74892 -132022 -36488 59044
-19593E9044J4312j68882j68883J4312J28809J28809p3468p3469K9578K9579q4919R8276J32625
$$ 59044 73356 -95526 -264409 -250097 -121288 7521 -65947 -139416 -109838 -80259 -165178 -66902 65723
-19580F5723n0569j26900J78423R2612k12713l3336J49859n8143n8142N6353N6354k17006
$$ 65723 15154 -111746 66677 159289 -53424 -86760 63099 4956 -53186 3167 59521 -157485
-19568a57485l3813J37933J37933p3887p3885J7711J7711K9637K9638q4858R8336O7803j15390
$$ -157485 -191298 -53365 84568 10681 -63204 -45493 -27782 1855 31493 -53365 44971 112774 -2616
-19555b616j15392O7804L7271j45924m2877J40319q528q527R4518R4520o9712o9711n8262
$$ -2616 -118008 -50204 -12933 -158857 -201734 -61415 -69943 -78470 16048 110568 40856 -28855 -87117
-19542h7117n8263o738J76455K3794j59400J849J848P0547P0546N665j77529l6317J46878
$$ -87117 -145380 -152118 24337 48131 -111269 -109420 -107572 -37025 33521 39186 -138343 -174660 -27782
-19529b7782N1463j31730P4364P4362j968j968j968j968j1986j1986j1986j1986P9610P9611
$$ -27782 23681 -108049 -33685 40677 38709 36741 34773 32805 20819 8833 -3153 -15139 64471 144082
-19515A44082p3051p3051j2702j2702O7445O7446J0197j72997q1400J01795L5004L5005m5141
$$ 144082 71031 -2020 -14722 -27424 40021 107467 117664 -55333 -136733 -34938 66 35071 -10070
-19502a0070m5143K564K564K565K564Q1995Q1997j85162j968J33519m9675j29822N3372r8813
$$ -10070 -55213 -52649 -50085 -47520 -44956 37039 119036 -66126 -68094 65425 15750 -114072 -60700 -159513
-19488a59513r8813O5299O5299j4849j4849J37814J37813j13886j13885R9842R9842q7170
$$ -159513 -258326 -193027 -127728 -142577 -157426 -19612 118201 4315 -109570 -9728 90114 2944
-19476B944q7169J26557J26558j01482j01481j5609j5609L9731n1867l0875J52318Q4099k21226
$$ 2944 -84225 42332 168890 67408 -34073 -49682 -65291 -25560 -77427 -108302 44016 128115 -93111
-19463i3111j5132K90193J7308k88015J5400J06997j17224O5970O7877k37446j2270K93055
$$ -93111 -108243 181950 199258 -88757 -73357 33640 -83584 -17614 50263 -187183 -199453 93602
-19451I3602M905l00420K7551J19149j00304q707Q8616k982K743R4340q8853q8855J30598
$$ 93602 98507 -201913 -174362 -55213 -155517 -164224 -75608 -78590 -75847 18493 -70360 -159215 -28617
-19438b8617J30598o7864o7862o7863o7864J03644J03643m9018m9019J3954J3954J3954J3955
$$ -28617 101981 34117 -33745 -101608 -169472 -65828 37815 -11203 -60222 -46268 -32314 -18360 -4405
-19425d405l0891l0890L2083n9514j9441J63754J1091j72102L3619J25215m0805m0803Q7049
$$ -4405 -35296 -66186 -34103 -93617 -113058 50696 61787 -110315 -76696 48519 7714 -33089 53960
-19412E3960r6143j5997J67197Q4189r9008j27630l6034K132K132P857P857j447j446R0151
$$ 53960 -42183 -58180 109017 193206 94198 -33432 -69466 -67334 -65202 -57345 -49488 -50935 -52381 37770
-19398C7770R0151o6327o6327n4878n4878n9172J24024J12572j92750J893J85088r9245j90843
$$ 37770 127921 61594 -4733 -59611 -114489 -173661 -49637 62935 -129815 -127922 57166 -42079 -232922
-19385b32922J44254J44254p5198p5198l3216l3216N8381N8382J01794J01795j11933j11932
$$ -232922 -88668 55586 -19612 -94810 -128026 -161242 -102861 -44479 57315 159110 47177 -64755
-19373f4755O56O56O56O56R6606R6607j17121j17120J04239J04240j11395j9798M4128j39066
$$ -64755 -64099 -63443 -62787 -62131 34475 131082 13961 -103159 1080 105320 -6075 -25873 18255 -120811
-19359a20811P872J91066N3671j29525o6551K5047J18849J18850q9152q9153m0490m0492N1106
$$ -120811 -112939 78127 131798 2273 -64278 -39231 79618 198468 109316 20163 -20327 -60819 -9713
-19346i713N1106p1023p1024R6905q6290r4878K10447J07401j97924M3771M3770o6908o6909
$$ -9713 41393 -29630 -100654 -3749 -90039 -184917 25530 132931 -64993 -21222 22548 -44360 -111269
-19333a11269M4725M4726M4724M4726m4487m4486K4210j58983o321J76873P3827j09368P514
$$ -111269 -66544 -21818 22906 67632 23145 -21341 2869 -156114 -162435 14438 88265 -21103 -13589
-19320a3589P514p2634J10560Q5754r7442n1642J31551o0230k43424R2432K75627m7826k31021
$$ -13589 -6075 -78709 31851 117605 20163 -31479 100072 39842 -203582 -111150 164477 116651 -114370
-19307a14370R7203R7202Q826Q826q2772q2771J0734J0735j11397P1800K07763r7561j09010
$$ -114370 -17167 80035 88861 97687 14915 -67856 -57122 -46387 -157784 -85984 121779 24218 -84792
-19294h4792P4185r1836r1836P2276P2276N2477N2478K862j80332P5378P5376l9119l9120
$$ -84792 -10607 -102443 -194279 -122003 -49727 2750 55228 58090 -122242 -46864 28512 -10607 -49727
-19281d9727O0110j23083j19268J86058Q2055k23268j909L03417P2753j10442l4111l4110
$$ -49727 10383 -112700 -231968 -45910 36145 -187123 -189032 114385 187138 76696 42585 8475
-19269H475N009N009q6587q6589J55286J55287j19507j19505P4185P4183p8477p8478L9299
$$ 8475 13484 18493 -68094 -154683 603 155890 36383 -83122 -8937 65246 -13231 -91709 -52410
-19256e2410L9298o500o500j0317j0316L5482L5481R243R244J00840J00841j19566j19565
$$ -52410 -13112 -19612 -26112 -36429 -46745 -11263 24218 33461 42705 143545 244386 124820 5255
-19243E255q885q885k11641R3685K57796m7528j81107K087k8445k8446J02272J02271J0675
$$ 5255 -3630 -12515 -224156 -130471 127325 79797 -101310 -99223 -127668 -156114 -53842 48429 59104
-19230E9104J0674p75p75r2372r2373O3719O3718r0852P46J51499l1696j29016N4177M7020
$$ 59104 69778 69003 68228 -24144 -116517 -52798 10920 -79932 -79186 72313 40617 -88399 -34222 12798
-19216A2798j36173J34802K26400n0302j41898q4650q4650Q4949Q4947j30687l9090J19298
$$ 12798 -123375 11427 237827 187525 45627 -39023 -123673 -38724 46223 -84464 -123554 -4256
-19204d256o3898o9622J13572J2911j70284R6875R6874m9107m9109l310l309M1594M1595M1594
$$ -4256 -68154 -137776 -24204 -11293 -181577 -84702 12172 -36935 -86044 -89354 -92663 -51069 -9474 32120
-19190C2120M1594j04388j04389M8274M8273m1416m1415M4457M4457M2548m9048j12022P1173
$$ 32120 73714 -30674 -135063 -86789 -38516 -79932 -121347 -76890 -32433 10115 -38933 -150955 -79782
-19177g9782J22934o0259q737Q2861N0420j32774j38499M4695J26751n6442j32775J72550
$$ -79782 43152 -17107 -25844 57017 107437 -25337 -163836 -119141 7610 -48832 -181607 -9057
-19165i057J43926j61398j0645Q0952j35040M8154J41660j63664q9243K16083q1608j73207
$$ -9057 134869 -26529 -37174 43778 -91262 -43108 98552 -65112 -154355 61728 -19880 -193087
-19153a93087O9623k1975O649J89843o0139j51739J87935R6339j40288M2906m2965k26162
$$ -193087 -123464 -145439 -138790 51053 -9086 -160825 27110 123449 -16839 26067 -16898 -243060
-19141b43060P5347K58542q1132q1131P7255j05939r4489K10834M0044j43150P0577P0576
$$ -243060 -167713 90829 9697 -71434 5821 -100118 -194607 16227 56271 -86879 -16302 54274
-19129E4274l2963l2962n0137M1461j476j84672l2008J51187M3368m8228J4744J4745l0101
$$ 54274 21311 -11651 -61788 -20327 -21803 -206475 -238483 -87296 -43928 -92156 -77412 -62667 -92768
-19116i2768l0100j476R0122J14928o8266j19788O3406P5808j07385M7186J38782m7275m7275
$$ -92768 -122868 -124344 -34222 80706 12440 -107348 -43942 31866 -75519 -28333 110449 63174 15899
-19103A5899K1424p0174p5899J07297m1550j33148J02884J02882N561N561j4476j4477L1323
$$ 15899 37323 -32851 -108750 -1453 -43003 -176151 -73267 29615 35176 40737 26261 11784 43107
-19090D3107L1323j11798j11798J01929J01928j01302j01303N1360N1359K2259K2258K2257
$$ 43107 74430 -37368 -149166 -47237 54691 -46611 -147914 -96554 -45195 -22936 -678 21579
-19078B1579K2259r7963r7964O6149O6149p4587J08607R7159k08166o6954J16241n889n888
$$ 21579 43838 -54125 -152089 -85940 -19791 -94378 14229 111388 -96778 -163732 -47491 -53380 -59268
-19065e9268J0018J0019J0018J0019m4368m4368M7230M7230K9101K9101j6697j6698n0091
$$ -59268 -49250 -39231 -29213 -19194 -63562 -107930 -60700 -13470 15631 44732 28035 11337 -38754
-19052c8754n0093M1505M1506q9928q9928J25708L4111r9470Q3726J23799n9395R303R303
$$ -38754 -88847 -47342 -5836 -95764 -185692 -59984 -25873 -125343 -41617 82182 22787 32090 41393
-19039D1393j62442K0753J18074o5120l0771l0771j1822J71372Q5500r7695k8997O2600r0061
$$ 41393 -121049 -100296 17778 -47342 -78113 -108884 -120706 50666 136166 38471 9474 72074 -17987
-19026a7987j81660p3364J09831K05243J13648j00081j00079M8764m2831n978J77216K4554
$$ -17987 -199647 -273011 -163180 42063 155711 55630 -44449 4315 -38516 -44494 132722 157276
-19014A57276j58640q9943J655R1343R1345l8897l8896l8895l8896K4077K4077J2628J2626
$$ 157276 -1364 -91307 -89652 1691 93036 54139 15243 -23652 -62548 -38471 -14394 -1766 10860
-19001A0860J24531n8665p0115J13081O217j76978M0566M0565j52170L1025K63834m1490k12281
$$ 10860 135391 76726 6611 119692 125909 -51069 -10503 30062 -122108 -91083 172751 131261 -81020
-18988h1020k9086O2511O2510L235L235M9034M9034p7867p7866Q006Q006k3481j15078q6454
$$ -81020 -110106 -47595 14915 18150 21385 70419 119453 41586 -36280 -28274 -20268 -43749 -158827 -245281
-18974b45281R6741K05512K2318o7371K4226m0222m0223l4498l4499L4200L4200L9925L9924
$$ -245281 -148540 56972 79290 11919 36145 -4077 -44300 -78798 -113297 -79097 -44897 -4972 34952
-18961C4952k4480O7118L8494j44701j84775j580J51082l2113q4113R9081R3356q9837k4957
$$ 34952 10472 77590 116084 -28617 -213392 -214972 -63890 -96003 -180116 -81035 12321 -77516 -102473
-18948a02473O6641Q9539Q9540j18939k10537O2347K45542k9251k12444J282J84476Q3905
$$ -102473 -35832 53707 143247 24308 -186229 -123882 121660 92409 -120035 -118753 65723 149628
-18936A49628r9290m2042M9556p693r9290l0592l0592m830J78364J66915j38410q6887R6309
$$ 149628 50338 8296 57852 50159 -49131 -79723 -110315 -115145 63219 230134 91724 4837 101146
-18923A01146k922j86117l1546J51648n4445n4445J09665J09667j04061j04060l9180l9179
$$ 101146 98224 -87893 -119439 32209 -22236 -76681 32984 142651 38590 -65470 -104650 -143829
-18911a43829J13483J13482o5895o5895K5703K5701J1360J1360q5961q5962J58297O6701j56568
$$ -143829 -30346 83136 17241 -48654 -22951 2750 14110 25470 -60491 -146453 11844 78545 -78023
-18898g8023K6626J44462j60861p4990J08206j7741P3856J25380j79944K0901K04096j43211
$$ -78023 -51397 93065 -67796 -142786 -34580 -52321 21535 146915 -33029 -12128 191968 48757
-18886D8757j43209J62113k1080j92825J12499L7598j45595O8132O8131J2791J2791p8805
$$ 48757 -94452 67661 46581 -146244 -33745 3853 -141742 -73610 -5479 7312 20103 -58702
-18874e8702p8806N4804N4803N4803N4803N188N188j5803j07399j16465J88859J10621j94703
$$ -58702 -137508 -82704 -27901 26902 81705 86893 92081 76278 -31121 -147586 41273 151894 -42809
-18861d2809j09786J95538J0436q1161K6537K6536m2160M9436K3674j59519j0675Q0924M0848
$$ -42809 -152595 42943 53379 -27782 -1245 25291 -16869 32567 56241 -103278 -113953 -33029 7819
-18848G819M0849m5024m5022J5087J5088l0712l0711J133J133J133J133L995L996L995L996
$$ 7819 48668 3644 -41378 -26291 -11203 -41915 -72626 -71493 -70360 -69227 -68094 -64099 -60103 -56108 -52112
-18833e2112k1290k1289P0308P0308k2244k2243k2242k2244P3528P3528K2005K2005l4289
$$ -52112 -73402 -94691 -24383 45925 23681 1438 -20804 -43048 30480 104008 126013 148018 113729
-18820A13729j25887l6197J46996N9694j23502k09374k6179J83732R2133o0528L1069O1185
$$ 113729 -12158 -48355 98641 158335 34833 -174541 -200720 -16988 75145 14617 45686 106871
-18808A06871j22010k4689J58506p1441p1441L1605L1606k0394k0394p1919p1918M5441m6157
$$ 106871 -15139 -39828 118678 47237 -24204 7401 39007 18613 -1781 -73700 -145618 -100177 -146334
-18795a46334j09130P4065J17241o5955M8542M8542m0194m0193N1404N1405K1348K1349k4450
$$ -146334 -255464 -181399 -64158 -130113 -81571 -33029 -73223 -113416 -62012 -10607 10741 32090 7640
-18782G640k4449P037P037P035P037J8964J8963m4009M7587L6138j47056o1184J22010Q3845
$$ 7640 -16809 -9772 -2735 4300 11337 30301 49264 5255 52842 88980 -58076 -119260 2750 86595
-18768H6595r9349K0871K0872m2101M9495J12470p0726j60593K2601J08473p4720J0197J01795
$$ 86595 -12754 8117 28989 -13112 36383 148853 78127 -82466 -59865 48608 -26112 -15915 85880
-18755H5880j8427j8427L518j79676j07162J98164O2674j20519N3134N3132j03046j1450J43121
$$ 85880 67453 49026 52544 -127132 -234294 -36130 26544 -93975 -40841 12291 -90755 -102205 40916
-18742D0916m0074j08772P4423n724n725Q9688r3505j04955P8239J08771p4422K8625J20221
$$ 40916 842 -107930 -33507 -39231 -44956 44732 -48773 -153728 -75489 33282 -41140 -12515 107706
-18729A07706n129r6726n129Q6469m174r5771m174Q7422l2322j23918Q5991Q5992P753P752
$$ 107706 102577 5851 722 87191 83017 -12754 -16928 70494 38172 -85746 245 86237 93990 101742
-18715A01742q3845q3844O6968O6968k4628k4629P2693P2694j41034j41033N0748N0749p1382
$$ 101742 17897 -65947 1021 67989 43361 18732 91425 164119 23085 -117948 -67200 -16451 -87833
-18702h7833J11813J21355j83970j00006K05318P2157k33167J10322J10322k7073k7074k7074
$$ -87833 23980 145335 -38635 -138641 66677 138834 -94333 15989 126311 99238 72164 45090
-18690D5090k7074K5404K5404K5404K5404m9019m9019N4028N4029j02347Q0849R2298r0897
$$ 45090 18016 43420 68824 94228 119632 70613 21594 75622 129651 27304 108153 200451 109554
-18677A09554r6622Q6574k7924k7923n024n025n024n024n024n024n024n025J2270J2270J2269
$$ 109554 12932 99506 71582 43659 38635 33610 28586 23562 18538 13514 8490 3465 15735 28005 40274
-18662D0274J2270o7877o7878Q4783Q4785p2649p2648J8948J8949n859n859n859n859L0711
$$ 40274 52544 -15333 -83211 1572 86357 13708 -58940 -39992 -21043 -26902 -32761 -38620 -44479 -13768
-18648a3768L0711o0885o0887N4565N4564Q767Q766l5601l5601l5602l5601M3592M3593M3591
$$ -13768 16943 -43942 -104829 -50264 4300 13067 21833 -13768 -49369 -84971 -120572 -76980 -33387 10204
-18634A0204M3592j15509j15511R8217R8216N0510N0510j02153j02152J04418J04419j20759
$$ 10204 53796 -61713 -177224 -79007 19209 69719 120229 18076 -84076 20342 124761 4002
-18622D002j20757J03464p9730j21713J83613K06824r8500j13766O9428k1215k04409K0768
$$ 4002 -116755 -13291 -93021 -214734 -31121 175703 77203 -36563 32865 11650 -192759 -171991
-18610a71991K03961l7911l7912O5134O5135k8371k8370j42867M0327K06824K3630j78647
$$ -171991 31970 -5941 -43853 21281 86416 58045 29675 -113192 -72865 133959 157589 -21058
-18598b1058M547J5997J5996K7446K7447o1289o1288L0309L0308N8933N8933r3729r3729J0004
$$ -21058 -16511 -514 15482 42928 70375 9086 -52202 -21893 8415 67348 126281 32552 -61177 -51173
-18584e1173J0004M0536j42659o7282K38042P3931k31393P4408P4407j12602P0591J13527
$$ -51173 -41169 -633 -143292 -210574 27468 101399 -129994 -55586 18821 -93781 -23190 90337
-18572I0337j91796j00200K05124J31419n1777p0860p0859j07118P6078k6969k6970J11859
$$ 90337 -101459 -201659 3465 134884 83107 12247 -58612 -165730 -89652 -116621 -143591 -31732
-18560c1732J11857j01869j01869O0334O0335l1263l1263J12587J12589m0074m0074k0991
$$ -31732 80125 -21744 -123613 -63279 -2944 -34207 -65470 47117 159706 119632 79558 58567
-18548E8567k0991r3505r3506o2019K43305J24993l02462p7286L50169M1029k64297O0350
$$ 58567 37576 -55929 -149435 -211454 31851 156844 -145618 -222904 127265 168294 -96003 -35653
-18536c5653O0348j11395j11396J12827J12827l9835l9835L2202L2201j3595j3597k0275k0276
$$ -35653 24695 -86700 -198096 -85269 27558 -12277 -52112 -19910 12291 -1304 -14901 -35176 -55452
-18523e5452q826q825n9918J23279J34726m8467j37202M5993k2706k2705K9772K9772o1825
$$ -55452 -64278 -73103 -133021 -9742 124984 76517 -60685 -14692 -37398 -60103 -30331 -559 -62384
-18510f2384o1826O2213O2212J6415J6414o6237o6239K5360K5359J3909J3910l1889l1889
$$ -62384 -124210 -61997 215 16630 33044 -33193 -99432 -74072 -48713 -34804 -20894 -52783 -84672
-18497h4672J47250J47251p4110k57305m2623J40572K6074K6075j18194j18194J56599J56597
$$ -84672 62578 209829 135719 -121586 -164209 -23637 2437 28512 -89682 -207876 -51277 105320
-18485A05320k6597k6596L936j79259j27974J77351J65900j39423J3239J3239j7294j7294
$$ 105320 78723 52127 56063 -123196 -251170 -73819 92081 -47342 -34103 -20864 -38158 -55452
-18473e5452P0844j12349Q2295Q2294p6092p6093P6570P6569L4110L4111j18552j18551P9909
$$ -55452 15392 -96957 -14662 67632 -8460 -84553 -7983 68586 102696 136807 18255 -100296 -20387
-18460b0387P9908p2752p2753K8385K8386o3212o3212M8423M8423L1248J22845M5798j37396
$$ -20387 59521 -13231 -85984 -57599 -29213 -92425 -155637 -107214 -58791 -27543 95302 141100 3704
-18447C704n1523J31671O2973j20222p4422J08772L8404j44790O7027O7029j43836n2240J57671
$$ 3704 -47819 83852 146825 26603 -47819 60953 99357 -45433 21594 88623 -55213 -107453 50218
-18434E0218k5523j18790k7193N1047N1047M7229j35965N248J88442O4107j19089m592m592
$$ 50218 24695 -94095 -121288 -70241 -19194 28035 -107930 -102682 85760 149867 30778 26186 21594
-18421B1594j9858j9857j9858j9858J22308J22309j54392o2794K00548J7354j41034M2161
$$ 21594 1736 -18121 -37979 -57837 64471 186780 32388 -30406 170142 187496 46462 88623
-18409H8623J18015o5180m2280m2281j3656j3656J4968J06566J4014j69180k0336P1262l1785
$$ 88623 206638 141458 99178 56897 43241 29585 44553 151119 165133 -4047 -24383 46879 15094
-18396A5094l1784Q8436r4757j77649N546J54392J54391L6078j47116o6968J16225R5713q7483
$$ 15094 -16690 71746 -23011 -200660 -195114 -40722 113669 149747 2631 -64337 51888 147601 60118
-18383F0118L2739L2739p6034J5565O7088j16107q0564q0566m17J82777K15218r0107j62620
$$ 60118 92857 125596 49562 65127 132215 16108 -64456 -145022 -145439 37338 252556 162449 -171
-18370a71K0573n5757n5758J08354J08355n5758n5758k7132O4463J19387o3808o9533J13662
$$ -171 20402 -35355 -91113 17241 125596 69838 14080 -13052 51411 170798 106990 37457 151119
-18357A51119n8083k41278R6488J88084q9570q9569P752P752l4229l4230M5918M5918M9256
$$ 151119 93036 -148242 -51754 136330 46760 -42809 -35057 -27305 -61534 -95764 -49846 -3928 45328
-18344D5328j33936j22488J82837Q9331r3863K8267K8265j19625j19625R6010M413p036J76157
$$ 45328 -88608 -211096 -28259 61072 -32791 -4524 23741 -95884 -215509 -119499 -115086 -122122 54035
-18331E4035l1844k15039J7294K00488j7056j7054J32744n0450j47772L5423O3091k8504l4230
$$ 54035 22191 -192848 -175554 24934 7878 -9176 123568 73118 -74654 -39231 23860 -4644 -38874
-18318c8874J48965J6340j66855p5258J07937K3734j59460N4266K37462l7331k20525m890
$$ -38874 110091 126431 -40424 -115682 -7745 15989 -143471 -89205 148257 110926 -109599 -114489
-18306a14489Q6707r422r422K028K027J7294J08890J9203j63993l1486J51707O0111j23083
$$ -114489 -27782 -37204 -46626 -44598 -42571 -25277 83613 102816 -61177 -92663 59044 119155 -3928
-18293c928m3891J39304p2515p2513O5596k6000j34772M8423J38111m5083k7908O3688n3431
$$ -3928 -47819 91485 18970 -53543 12053 -13947 -148719 -100296 37815 -7268 -35176 28512 -24919
-18280b4919n3432M3890M3890P7285P7286j30718j30716N2478J44074N4386j28809j17358
$$ -24919 -78351 -34461 9429 86714 164000 33282 -97434 -44956 99118 153504 24695 -92663
-18268i2663O5835P3468j09725j88503J16823L30550K5225k63879q0685P1978P1978J2582
$$ -92663 -26828 46640 -63085 -251588 -134765 195785 221010 -42869 -123554 -51576 20402 32984
-18256C2984J2583l3216l3215j730j729L2619L2620M1326j41868j01795Q1400Q5216o380l5005
$$ 32984 45567 12351 -20864 -22594 -24323 8296 40916 82242 -59626 -161421 -80021 5195 -1185 -36190
-18242c6190l5005N37N36N37N37J7711J7711J7711J7711L7509L7510L7510L7510p9850p9849
$$ -36190 -71195 -70658 -70122 -69585 -69048 -51337 -33626 -15915 1796 39305 76815 114325 151835 71985 -7864
-18227g864J1747J1748j8545j8546R0225j372r0106R3088R8813q4382j71923J1270n903n904
$$ -7864 3883 15631 -2914 -21460 68765 67393 -22713 70375 169188 84806 -87117 -75847 -81750 -87654
-18213h7654r720Q1877J44850l8345j37813M5382M5380j37813j7592J65602O2556j20638J0316
$$ -87654 -97374 -15497 129353 91008 -46805 -1423 43957 -93856 -111448 54154 116710 -3928 6388
-18200F388J0316j133j133j79j79M5620M5620r0822r0822O1841O1839q9867q9868O2794O2794
$$ 6388 16704 15571 14438 14259 14080 59700 105320 14498 -76324 -14483 47356 -42511 -132379 -69585 -6791
-18185f791M354M352q7243q7245R9768R9766l280l279P4482j08711r7263K08061N4446j28749
$$ -6791 -2437 1915 -85328 -172573 -72805 26961 23681 20402 94884 -13827 -111090 96971 151417 22668
-18171B2668M4904M4904j88218r6622J19014o4181n978J77216l4603l4601N7471l4125r1373
$$ 22668 67572 112476 -75742 -172364 -53350 -117531 -123509 53707 19104 -15497 41974 7849 -83524
-18158h3524R1820N1747l9850n501r7098o5135J18060J12334p0860L6004L6004o7043o7043
$$ -83524 8296 60043 20193 14692 -82406 -147541 -29481 82853 11993 47997 84001 16958 -50085
-18145e0085N233N233O8205k3391j29300N3894J51215l1978q1042J02152Q4978o619j01079
$$ -50085 -44852 -39619 28586 5195 -124105 -70211 81004 49026 -32016 70136 155114 148495 47416
-18132D7416j01079J06923J06923r9886r9886q289q289M0372M0371l0233O1362J47594j57732
$$ 47416 -53663 53260 160183 60297 -39589 -47878 -56167 -15795 24576 -5657 55705 203299 45567
-18119D5567k09254R6070J75263p931k8923O2675m1564m1565l5840l5839J26363J26364j48429
$$ 45567 -163687 -67617 107646 99715 70792 133467 91903 50338 14498 -21341 105022 231386 82957
-18106H2957j48427P3304P3305j6385j07981l3559J49635J0332j72863o5284K40040J48444
$$ 82957 -65470 7834 81139 64754 -43227 -76786 72849 83181 -89682 -154966 85074 233518
-18094B33518j56882j16807O6387L5855L5855k6880k6880k6880k6879j5431j5430j5430j5430
$$ 233518 76636 -40171 26216 62071 97926 71046 44166 17286 -9593 -25024 -40454 -55884 -71314
-18081g1314n412n412Q6185Q6186j3045j3045L2754L2754j65304j65305L1248J22846J39065
$$ -71314 -76726 -82138 4047 90233 77188 64143 96897 129651 -35653 -200958 -169710 -46864 92201
-18068I2201m4129j20460O2735N8679l2918L5780L5781q7304M293J43599l9597j30955N2238
$$ 92201 48072 -72388 -9653 49026 16108 51888 87669 365 4658 148257 108660 -22295 29943
-18055B9943J17121o6074o7029o7027N8917N8918l3633l3633l3633l3634N7010N7009q0385
$$ 29943 147064 80990 13961 -53066 5851 64769 31136 -2497 -36130 -69764 -12754 44255 -36130
-18042c6130q0387O0484O0482m6379m6380J17731J17732m4472m4472o544Q5052J48027j57300
$$ -36130 -116517 -56033 4449 -41930 -88310 29421 147153 102681 58209 51665 136717 284744 127444
-18029A27444k07867R7455J47072l6123n9738n9738p1187p1188N0942N0942N0941N0943j09830
$$ 127444 -80423 17032 164104 127981 68243 8505 -62682 -133870 -82928 -31986 18955 69898 -39932
-18016c9932j09831J19164J19162n3536n3536N3327N3328O380O381j63455p1859J20878o2318
$$ -39932 -149763 -30599 88563 35027 -18509 34818 88146 94526 100907 -62548 -134407 -13529 -75847
-18003g5847k2243J60951L6913j46281o977Q4620p9491p9492R4162R4160O381O381o4226o4224
$$ -75847 -98090 62861 99774 -46507 -53484 31136 -48355 -127847 -33685 60475 66856 73237 9011 -55213
-17989e5213K3555J15152J20878o2317n8501n8501j38648M4547K01025J7830k11163k7968
$$ -55213 -31658 83494 204372 142055 83554 25053 -113595 -69048 131977 149807 -61356 -89324
-17977h9324J88725N532j20415O2778j8322j8323o872o872m0268m0268R7128R7129J0301J0302
$$ -89324 99401 104933 -15482 47296 28974 10651 3779 -3093 -43361 -83629 13499 110628 120929 131231
-17963A31231l5497l5497m5277m5276N22N21K431K430M8228M8228m4322m4322P2081j9515
$$ 131231 95734 60237 14960 -30316 -29794 -29273 -26842 -24412 23816 72044 27722 -16600 55481 35966
-17949C5966j74085J31239J94212J1017r1598r1597q7780R5413J31671j73652j7175J66020
$$ 35966 -138119 -6880 187332 198349 106751 15154 -72626 22787 154458 -19194 -36369 129651
-17937A29651j51708j51708J51708O0110j21175O2019N0569m1027O9890O9891j40020j40020
$$ 129651 -22057 -173765 -22057 38053 -83122 -21103 29466 -11561 58329 128220 -11800 -151820
-17925a51820Q0386j1211k8386J54809P8478j04717j04716P8478J25230n7964r8037Q5156
$$ -151820 -71434 -82645 -111031 43778 122256 17539 -87177 -8699 116531 58567 -39470 45686
-17913D5686P9671j1927k5284k5285p3945p3946L2918L2918Q110Q110Q109Q110K0515K0514
$$ 45686 125357 113430 88146 62861 -11084 -85030 -52112 -19194 -11084 -2974 5135 13245 33760 54274
-17899E4274l1010l1009Q110q3487j00662Q2533J17836o5358m8184M3414J9559J9560K5284
$$ 54274 23264 -7745 365 -83122 -183784 -101251 16585 -48773 -96957 -53543 -33984 -14424 10860
-17886A0860K5285k2422k2422k2422k2422O9651O9652l7211l7212k5761k5762K5762K5761
$$ 10860 36145 13723 -8699 -31121 -53543 16108 85760 48549 11337 -14424 -40186 -14424 11337
-17873A1337o3926K7670R0642r2551m3890J39304N7248j25946L6734J28332m9138k32333n2001
$$ 11337 -52589 -24919 65723 -26828 -70718 68586 125834 -112 36622 164954 115816 -116517 -168518
-17860a68518J31195J25469n7726j01377r780O4644O4642j5505j5505j5505j5504k0991k0991
$$ -168518 -37323 88146 30420 -70957 -80737 -16093 48549 33044 17539 2034 -13470 -34461 -55452
-17847e5452K4808K4808r55r54M4844M4845n2240n2238p16p15j4074P7523L101j80093j0496
$$ -55452 -30644 -5836 -6791 -7745 37099 81944 29704 -22534 -23250 -23965 -38039 39484 42585 -137508 -148004
-17832a48004J72699k3853k3853R2551R54j07817P5376Q3488r9708j7652J65544q7304j78901
$$ -148004 24695 842 -23011 69540 70494 -37323 38053 121541 21833 4181 169725 82421 -96480
-17819i6480L1010J22606o56o56o56o56R840q1757n3134J30060K445j80749k8088J55107J26484
$$ -96480 -65470 57136 56480 55824 55168 54512 64352 -17405 -70539 59521 61966 -118783 -146871 8236 134720
-17804A34720n6712r1060N37R0940o56j49501L3693J40556m2638p1261K0334m0968m0968J17418
$$ 134720 78008 -13052 -12515 78425 77769 -71732 -38039 102517 59879 -11382 8952 -32016 -72984 44434
-17790D4434J17419k7610k7611k7610k7611r183r184j23680N9515J56836k6358n4983L6616
$$ 44434 161853 134243 106632 79022 51411 42228 33044 -90636 -31121 125715 99357 44374 80990
-17777H0990j22965j22965J57553J57552j1331j1330L4468L4469j05791j05789j4193j4193
$$ 80990 -41975 -164940 -7387 150165 138834 127504 161972 196441 90650 -15139 -29332 -43525
-17765d3525J1569J1569J1569J1568N5698N5698r6965r6963N7606N7605Q0506j02690j06147
$$ -43525 -31956 -20387 -8818 2750 58448 114146 17181 -79782 -22176 35429 115935 13245 -92902
-17752i2902P7047J57194k6000j3597j3596j39543M3652J51469l1725k0275P1322r780j01378
$$ -92902 -15855 141339 115339 101742 88146 -51397 -7745 143724 111999 91724 163046 153266 51888
-17739E1888M1744M1744R6129M533j57672K5523K27801p7524k30186P5138J02093q1102M1028
$$ 51888 93632 135376 231505 236038 78366 103889 331690 254166 23980 99118 201211 120109 161137
-17726A61137M1029j05910j05909J07817J07818m4367m4368j5743P5854K0514j62681j3835
$$ 161137 202166 96256 -9653 98164 205982 161615 117247 101504 177358 197872 35191 21356
-17714B1356P7762k0275k0276p7523J4074J62919k0276k47360N7964K47122O3927k7670k7670
$$ 21356 99118 78843 58567 -18956 -4882 158037 137761 -109599 -51635 195487 259414 231744 204074
-17701B04074r4460r4460O0111l1487j04478P8716N0093N0092J11158p2038k24700m1505Q2056
$$ 204074 109614 15154 75265 43778 -60700 18016 68109 118201 229359 157321 -67379 -108884 -26828
-17688b6828Q2056J908J908k6716k6716p2514p2514M0074M0074Q5871Q5873n725n724n725
$$ -26828 55228 57136 59044 32328 5612 -66902 -139416 -99342 -59268 26603 112476 106751 101027 95302
-17674I5302n725q0864q0862J0734J0734J02331J02331j11396j11395K5046K5047J3596J3596
$$ 95302 89577 8713 -72149 -61415 -50681 51650 153981 42585 -68810 -43764 -18717 -5121 8475
-17661H475J01377q1817q1817J01377m1625m1623K36984N3789k91608j08415J66378j6817
$$ 8475 109852 28035 -53782 47595 5970 -35653 201331 255120 -36488 -144903 21475 4658
-17649D658r9826Q3368M9018M9019J29167n4028j45626L7569N3313N3313K6597j56599j42286
$$ 4658 -95168 -11800 37218 86237 215404 161376 15750 53319 106632 159945 186542 29943 -112343
-17636a12343M0909P5257j07936R3387R3385k1110k1110J65901j7294o6909o6909k0216k0216
$$ -112343 -71434 3823 -104113 -10726 82659 61549 40439 206340 189046 122137 55228 35012 14796
-17623A4796M8482j34712q1281J01915K1766K1766J43896l9299j30895N2298N5161N5161O6611
$$ 14796 63278 -71434 -152715 -50800 -29034 -7268 136628 97329 -33566 18732 73893 129054 195665
-17610A95665O6612j32209j32207K0453K0455m354m353K9996K9996K5225j57969j12171P1023
$$ 195665 262277 130068 -2139 18314 38769 34415 30062 60058 90054 115279 -42690 -154861 -83838
-17597h3838J03464J03465l7748l7748n37n37n37n36J15868J15869j58924j58924P1023P1024
$$ -83838 19626 123091 85343 47595 47058 46521 45984 45448 161316 277185 118261 -40663 30360 101384
-17583A01384k0573k0574L2858L2858n8739n8739Q5455Q5455o7207o7207p097p096p5794J07400
$$ 101384 80811 60237 93095 125953 67214 8475 93930 179385 112178 44971 37874 30778 -45016 62384
-17569F2384J491j81704J04538K87733j42585j42583K1526K1528m532m532Q7065Q7066j03763
$$ 62384 63875 -117829 -13291 274442 131857 -10726 10800 32328 27796 23264 110329 197395 93632
-17556I3632j03762j2165j2166R0404R0405j192j84387j8368K86958o918j90113L7689L7689
$$ 93632 -10130 -22295 -34461 55943 146348 145156 -39231 -57599 229359 222441 32328 70017 107706
-17543A07706q8259R4938R064j74130k9101K76223K4807j58387n9157J24039P8239j04955
$$ 107706 19447 114385 123449 -50681 -79782 196441 221248 62861 3704 127743 205982 101027
-17531A01027j85103j908Q2071Q2070J16420o6775j42151M1042Q6842r6354q8719R4474k0022
$$ 101027 -84076 -85984 -3913 78157 194577 127802 -14349 26693 113535 17181 -71538 22936 2914
-17518B914k0021J7188J7190J7189J7190p857p857L593L593q0371J02823J71522j33803m2206
$$ 2914 -17107 81 17271 34460 51650 43793 35936 39529 43122 -37249 65574 237096 103293 61087
-17504F1087m2206p2738p2738K09687K6492k13950R1374J10023j95300k7372J55822J13842
$$ 61087 18881 -53857 -126595 83092 109584 -104366 -12992 97031 -98269 -125641 30181 144023
-17492A44023o9355j07519j07519Q9271Q9271j77886N307K61016P7823k46585o3391J06922
$$ 144023 74668 -32851 -140370 -51099 38172 -139714 -134407 126609 204432 -42153 -105544 1378
-17480A378J06924l4290l4289l8106l8105N3490N3492m0014m0014N1583N1583n1464n1463
$$ 1378 108302 74012 39723 1617 -36488 17002 70494 30480 -9534 42049 93632 42168 -9295
-17467i295M0132M0134n6071n6069L5526L5526k1721k1721J30940J30941r0181r0181J416
$$ -9295 30837 70971 14900 -41169 -5643 29883 8162 -13559 117381 248322 158141 67960 69376
-17454F9376J416j5758j5758J75070j30255k12788R2537J76500j28824n8217J24977j00199
$$ 69376 70792 55034 39276 214346 84091 -128697 -36160 140340 11516 -46701 78276 -21923
-17442b1923j00199K54262P1069j12126j12126J04463p8732p8731J04463l0770l0771K6477
$$ -21923 -122122 132140 203209 91083 -21043 83420 4688 -74043 30420 -350 -31121 -4644
-17430d644K6477O9414O9413q3248q3248j6459j6459P5137P5139n4625n4624R8038R8038j46938
$$ -4644 21833 91247 160660 77412 -5836 -22295 -38754 36383 111522 56897 2273 100311 198349 51411
-17416E1411j46937J27854J27855l3395l3395J2404J2404n5817n5818R6846R6845q3487q3488
$$ 51411 -95526 32328 160183 126788 93393 105797 118201 62384 6566 103412 200257 116770 33282
-17403C3282q3486q3487J26483J26482K7253j55941n7666J25528K01861j03465j64052J41272
$$ 33282 -50204 -133691 -7208 119274 146527 -9414 -67080 58448 260309 156844 -7208 134064
-17391A34064Q7840k17484k3793J59400o5776o5776J57731k5463k65907L9418J86355j18969
$$ 134064 221904 4420 -19373 140027 74251 8475 166206 140743 -125164 -85746 100609 -18360
-17379a8360j11336J93988N1345j31850Q1877Q1877j68107j68108M5620M5620R0107R0106
$$ -18360 -129696 64292 115637 -16213 65664 147541 -20566 -188674 -143054 -97434 -7327 82779
-17367H2779k0574k03768J47354J47356p7823p7821O5775O5776k5821k5821k0097k0097k0096
$$ 82779 62205 -141563 5791 153147 75324 -2497 63278 129054 103233 77412 57315 37218 17122
-17354A7122k0096R2372R2373o0290o0290k087k087l6437l6435p5556J07638J95420j09905
$$ 17122 -2974 89398 181771 121481 61191 59104 57017 20580 -15855 -91411 16227 211647 101742
-17341A01742k17722Q7602R1418r1776M085M085p365p365L9388L9388L9388L9388p4155p4153
$$ 101742 -115980 -28378 63040 -28736 -24651 -20566 -27931 -35296 4092 43480 82868 122256 48101 -26052
-17327b6052k8356k8356l1218l1219n4118J29078J76187p007r8604Q4590O7416j15779k4181
$$ -26052 -54408 -82764 -113982 -145201 -199319 -70241 105946 98939 335 84925 152341 36562 12381
-17314A2381J59014O4553j18641j07192P6003j2732j2732M443M443j9143P2456R7262q5932
$$ 12381 171395 235948 117307 10115 86118 73386 60654 65097 69540 50397 122853 220115 134183
-17301A34183j52721J52602P8180j05016o3271K8326M1684M1684j5564j5565r839r840q5396
$$ 134183 -18538 134064 212244 107228 43957 72283 113967 155651 140087 124522 114683 104843 19447
-17288A9447O202J09250p3946k8148O3451n6772n6770J40973m2220o1304J21892J14258j91067
$$ 19447 25649 134899 60953 32805 96256 39484 -17286 123687 81467 20163 142055 256313 65246
-17275F5246j05193P8000Q975J00573R2939r0256r3118j521j8695j8695L5213L5214j02181
$$ 65246 -39947 38053 47028 147601 240540 150284 57166 55645 36950 18255 53468 88682 -13499
-17262a3499j02183J19177J19179m6843j38439P7672K60869n3999k37193l3007J50187M1416
$$ -13499 -115682 3495 122674 75831 -62608 15064 275933 221934 -15259 -48266 101921 143337
-17250A43337n0182o9742o9741L1397L1397L0443L0443L0443L0443r2969r2968M4427M4426
$$ 143337 93155 23413 -46328 -14931 16466 46909 77352 107795 138238 45269 -47699 -3272 41154
-17237D1154l6675l6674R124R124J13125J13125j52126j52125R6904N308j33997J71328J83910
$$ 41154 4479 -32195 -23071 -13947 99178 212303 60177 -91948 4956 10264 -123733 47595 231505
-17224B31505j21414j71029J2165R303R303k5046k5046P3230P3229l3633l3633J09487J09488
$$ 231505 110091 -60938 -48773 -39470 -30167 -55213 -80259 -7029 66200 32567 -1066 108421 217909
-17211B17909q8974q8974K5047K5046k0753k0752k9340k9339P7523P7524m4606m4606O9891
$$ 217909 128935 39961 65008 90054 69301 48549 19209 -10130 67393 144917 100311 55705 125596
-17198A25596j13305l578J79618J35726j69599j10859j9262r720Q1877N7070l4528q0327J1271
$$ 125596 12291 8713 188331 324057 154458 43599 24337 14617 96494 153564 119036 38709 49980
-17185D9980J53199O1602j40676j40676K0573K0574K0574K0573o5537o5537J32923J32924
$$ 49980 203179 264781 124105 -16571 4002 24576 45150 65723 186 -65351 67572 200496
-17173B00496l2143l2142j19924j19923K48374O5180k21062Q4262J83493j21832p9850J03346
$$ 200496 168353 136211 16287 -103636 144738 209918 -11144 73118 256611 134779 54929 158275
-17161A58275o2854o2854J33699m9496n2359L9239q6707M890J30121n3074j04597P8596J04360
$$ 158275 95421 32567 166266 116770 64411 103650 16943 21833 151954 98880 -5717 72879 177239
-17148A77239p8836j24634N8559J24814n8382j11812P1381J52484j52842p2693J10501j17538
$$ 177239 98403 -26231 32328 157142 98760 -13052 58329 210813 57971 -14722 95779 -21759
-17136b1759j17538R2373R2372j5445j5446r1775R1418J23442j81883p5019K30305J2762j70433
$$ -21759 -139297 -46924 45448 30003 14557 -77218 14200 137642 -44241 -119260 111045 123807 -46626
-17123d6626O8101J59699m9257m9258K1349K1349J17717o5478k60122M5203J93034j12291
$$ -46626 21475 181174 131917 82659 104008 125357 243074 177596 -82526 -37323 155711 43420
-17111D3420j12289J93033J53916j51411q8437L161l1666l1665J43896N2299j56658K6537
$$ 43420 -68869 124164 278080 126669 38232 41393 9727 -21938 121958 174257 17599 44136
-17099D4136J08593p4602p3588J09607M0909n0689k8744j20340J5147J98342K266q9332Q2414
$$ 44136 152729 78127 4539 114146 155055 104366 75622 -44718 -29571 168771 171037 81705 164119
-17086A64119r183j24635N8560n5936n5936Q5991n605j75442P752J48010l5184P3589J65185
$$ 164119 154936 30301 88861 32925 -23011 62980 57375 -118067 -110315 37695 2511 76100 241285
-17073B41285r2432r2433K0157K0156K6835K6835j8963j8964R542R541n3432L8166M7707j35488
$$ 241285 148853 56420 76577 96733 123568 150403 131440 112476 122018 131559 78127 116293 164000 28512
-17059B8512j41212M1982K00607J7413j88680n486K13965r1359j67690J37634O1006j22189
$$ 28512 -112700 -70718 129889 147302 -41378 -46864 167101 75742 -91948 45686 106692 -15497
-17047a5497n1583M0014j3418j3417Q3904Q3904L3097L3097o977o977q2355R244P2216j10978
$$ -15497 -67080 -27066 -40484 -53901 30003 113907 147004 180101 173124 166147 83792 93036 165252 54274
-17033E4274j2106J71089O8043j15153K2243K2244j30420j30418k8326J54868J66319j6876
$$ 54274 42168 213257 281300 166147 188390 210634 80214 -50204 -78530 76338 242657 225781
$$ [...]
##$OBSERVEDINTEGRALS=	(X Y Z)
(2.6739084381853110983, 2.783951957579327896, 4)
(1.2736046538964569397, 1.6422504438664111692, 5.0198303143715792274)
(7.3700156283249436129, 7.5048189395826119252, 0.61929417685106991076)
##$OBSERVEDMULTIPLETS=	
(1, 2.6739084381853110983, 2.783951957579327896, 0, 4, 0, , )
(2, 1.2736046538964569397, 1.6422504438664111692, 0, 5.0198303143715792274, 0, , )
(3, 7.3700156283249436129, 7.5048189395826119252, 0, 0.61929417685106991076, 0, , )
##$OBSERVEDMULTIPLETSPEAKS=	
(1, 2.7322771765338211836, 521.14599172409907624)
(2, 1.4325139884239843635, 14.239984936560068363)
(3, 7.4341237579495889065, 10.425665505512951015)
##END=	
##TITLE=	PROTON_01
##JCAMPDX=	6.0	$$ NMR Plug-in 1.14 of MestReNova 12.0.4-22023
##BLOCKID=	3
##DATATYPE=	NMRPEAKTABLE
##DATACLASS=	PEAKTABLE
##.OBSERVEFREQUENCY=	699.735595703125
##.OBSERVENUCLEUS=	^1H
##NPOINTS=	3
##FIRSTX=	1.4325139884239843635
##LASTX=	7.4341237579495889065
##XFACTOR=	1
##YFACTOR=	1
##FIRSTY=	14.239984936560068363
##XUNITS=	PPM
##YUNITS=	ARBITRARY UNITS
##PEAKTABLE=	(XY..XY)
1.4325139884239843635, 14.239984936560068363
2.7322771765338211836, 521.14599172409907624
7.4341237579495889065, 10.425665505512951015
##END=	
##END=	
