##TITLE=	EvPkuOLmT36RlQvtgtNddQ/Hg
##JCAMPDX=	6.0	$$ NMR Plug-in 1.13 of MestReNova 11.0.4-18998
##DATATYPE=	NMRSPECTRUM
##DATACLASS=	XYDATA
##NUMDIM=	1
##ORIGIN=	Bruker BioSpin GmbH
##OWNER=	nmrsu
##.OBSERVEFREQUENCY=	89.469901127200003543
##.OBSERVENUCLEUS=	^199Hg
##.SOLVENTNAME=	CDCl3
##.PULSESEQUENCE=	zgpg30
##LONGDATE=	2014/12/10 15:12:45.000
##.ACQUISITIONMODE=	SIMULTANEOUS (DQD)
##$ORIGINALFORMAT=	Bruker XWIN-NMR
##$PARAMETERFILE=	(acqus, ASCII, /var/folders/f6/rjf_tdyn2v98c5c0wvkgn4s80000gn/T/EvPkuOLmT36RlQvtgtNddQ/Hg/acqus, 0)
$$ ##TITLE= Parameter file, TOPSPIN		Version 3.2
$$ ##JCAMPDX= 5.0
$$ ##DATATYPE= Parameter Values
$$ ##NPOINTS= 46	$$ modification sequence number
$$ ##ORIGIN= Bruker BioSpin GmbH
$$ ##OWNER= nmrsu
$$ $$ 2014-12-10 15:20:46.290 +0000  nmrsu@nmrpc
$$ $$ /opt/topspin/data/ehs/nmr/Dec10-2014/2/acqus
$$ $$ process /opt/topspin3.2/prog/mod/shimcntl
$$ ##$ACQT0= -2.3109243697479
$$ ##$AMP= (0..31)
$$ 100 100 100 100 100 100 100 100 100 100 100 100 100 100 100 100 100 100
$$ 100 100 100 100 100 100 100 100 100 100 100 100 100 100
$$ ##$AMPCOIL= (0..19)
$$ -1 0 0 0 0 0 0 0 0 0 0 0 0 0 0 0 0 0 0 0
$$ ##$ANAVPT= -1
$$ ##$AQSEQ= 0
$$ ##$AQ_mod= 3
$$ ##$AUNM= <au_zgsinox>
$$ ##$AUTOPOS= <14 >
$$ ##$BF1= 89.577394
$$ ##$BF2= 500.13
$$ ##$BF3= 500.13
$$ ##$BF4= 500.13
$$ ##$BF5= 500.13
$$ ##$BF6= 500.13
$$ ##$BF7= 500.13
$$ ##$BF8= 500.13
$$ ##$BYTORDA= 0
$$ ##$CAGPARS= (0..11)
$$ 0 0 0 0 0 0 0 0 0 0 0 0
$$ ##$CFDGTYP= 0
$$ ##$CFRGTYP= 9
$$ ##$CHEMSTR= <none>
$$ ##$CNST= (0..63)
$$ 1 1 145 1 1 1 1 1 1 1 1 1 1 1 1 1 1 1 1 1 1 1 1 1 1 1 1 1 1 1 1 1 1 1 1
$$ 1 1 1 1 1 1 1 1 1 1 1 1 1 1 1 1 1 1 1 1 1 1 1 1 1 1 1 1 1
$$ ##$CPDPRG= (0..8)
$$ <waltz16> <> <waltz16> <> <mlev> <mlev> <mlev> <mlev> <mlev>
$$ ##$D= (0..63)
$$ 0 1 0.00345 0 0 0 0 19 0 0.06 0 0.03 2e-05 3e-06 0 0 0.0002 0 0 0 0 0 0
$$ 0 0 0 0 0 0 0 0 0 0 0 0 0 0 0 0 0 0 0 0 0 0 0 0 0 0 0 0 0 0 0 0 0 0 0 0
$$ 0 0 0 0 0
$$ ##$DATE= 1418224365
$$ ##$DE= 4.964286
$$ ##$DECBNUC= <off>
$$ ##$DECIM= 768
$$ ##$DECNUC= <off>
$$ ##$DECSTAT= 4
$$ ##$DIGMOD= 1
$$ ##$DIGTYP= 12
$$ ##$DQDMODE= 0
$$ ##$DR= 21
$$ ##$DS= 2
$$ ##$DSPFIRM= 0
$$ ##$DSPFVS= 20
$$ ##$DTYPA= 0
$$ ##$EXP= <se77>
$$ ##$F1LIST= <111111111111111>
$$ ##$F2LIST= <222222222222222>
$$ ##$F3LIST= <333333333333333>
$$ ##$FCUCHAN= (0..9)
$$ 0 1 2 0 0 0 0 0 0 0
$$ ##$FL1= 83
$$ ##$FL2= 83
$$ ##$FL3= 83
$$ ##$FL4= 83
$$ ##$FOV= 20
$$ ##$FQ1LIST= <freqlist>
$$ ##$FQ2LIST= <freqlist>
$$ ##$FQ3LIST= <freqlist>
$$ ##$FQ4LIST= <freqlist>
$$ ##$FQ5LIST= <freqlist>
$$ ##$FQ6LIST= <freqlist>
$$ ##$FQ7LIST= <freqlist>
$$ ##$FQ8LIST= <freqlist>
$$ ##$FRQLO3= 61348.8727999926
$$ ##$FRQLO3N= 2
$$ ##$FS= (0..7)
$$ 83 83 83 83 83 83 83 83
$$ ##$FTLPGN= 0
$$ ##$FW= 250000
$$ ##$FnMODE= 0
$$ ##$FnTYPE= 0
$$ ##$GPNAM= (0..31)
$$ <SINE.100> <SINE.100> <SINE.100> <SINE.100> <SINE.100> <SINE.100> <SINE.100>
$$ <SINE.100> <SINE.100> <SINE.100> <SINE.100> <SINE.100> <SINE.100> <SINE.100>
$$ [...]
$$ ##$SguType= 3
$$ ##$ShimPowMaxUA= (0..63)
$$ 130000 130000 130000 130000 130000 130000 130000 130000 130000 130000 130000
$$ 130000 130000 130000 130000 130000 130000 130000 130000 130000 130000 130000
$$ 130000 130000 130000 130000 130000 130000 130000 130000 130000 130000 130000
$$ 130000 130000 130000 130000 130000 130000 130000 0 0 0 0 0 0 0 0 0 0 0
$$ 0 0 0 0 0 0 0 0 0 0 0 0 0
$$ ##$ShimPowMaxUC= (0..63)
$$ 130000 130000 130000 130000 130000 130000 130000 130000 130000 130000 130000
$$ 130000 130000 130000 130000 130000 130000 130000 130000 130000 130000 130000
$$ 130000 130000 130000 130000 130000 130000 130000 130000 130000 130000 130000
$$ 130000 130000 130000 130000 130000 130000 130000 0 0 0 0 0 0 0 0 0 0 0
$$ 0 0 0 0 0 0 0 0 0 0 0 0 0
$$ ##$ShimPowMaxUG= (0..63)
$$ 524287 524287 524287 524287 524287 524287 524287 524287 524287 524287 524287
$$ 524287 524287 524287 524287 524287 524287 524287 524287 524287 524287 524287
$$ 524287 524287 524287 524287 524287 524287 524287 524287 524287 524287 524287
$$ 524287 524287 524287 524287 524287 524287 0 0 0 0 0 0 0 0 0 0 0 0 0 0 0
$$ 0 0 0 0 0 0 0 0 0 0
$$ ##$ShimPowRcbType= 3
$$ ##$ShimPowRes= (0..63)
$$ 1e-20 1e-20 1e-20 1e-20 1e-20 1e-20 1e-20 1e-20 1e-20 1e-20 1e-20 1e-20
$$ 1e-20 1e-20 1e-20 1e-20 1e-20 1e-20 1e-20 1e-20 1e-20 1e-20 1e-20 1e-20
$$ 1e-20 1e-20 1e-20 1e-20 1e-20 1e-20 1e-20 1e-20 1e-20 1e-20 1e-20 1e-20
$$ 1e-20 1e-20 1e-20 1e-20 0 0 0 0 0 0 0 0 0 0 0 0 0 0 0 0 0 0 0 0 0 0 0 0
$$ ##$ShimPowRng0= (0..63)
$$ 1 1 1 1 1 1 1 1 1 1 1 1 1 1 1 1 1 1 1 1 1 1 1 1 1 1 1 1 1 1 1 1 1 1 1 1
$$ 1 1 1 1 0 0 0 0 0 0 0 0 0 0 0 0 0 0 0 0 0 0 0 0 0 0 0 0
$$ ##$ShimPowRng1= (0..63)
$$ 1 1 1 1 1 1 1 1 1 1 1 1 1 1 1 1 1 1 1 1 1 1 1 1 1 1 1 1 1 1 1 1 1 1 1 1
$$ 1 1 1 1 0 0 0 0 0 0 0 0 0 0 0 0 0 0 0 0 0 0 0 0 0 0 0 0
$$ ##$ShimPowRng2= (0..63)
$$ 1 1 1 1 1 1 1 1 1 1 1 1 1 1 1 1 1 1 1 1 1 1 1 1 1 1 1 1 1 1 1 1 1 1 1 1
$$ 1 1 1 1 0 0 0 0 0 0 0 0 0 0 0 0 0 0 0 0 0 0 0 0 0 0 0 0
$$ ##$ShimPowRng3= (0..63)
$$ 1 1 1 1 1 1 1 1 1 1 1 1 1 1 1 1 1 1 1 1 1 1 1 1 1 1 1 1 1 1 1 1 1 1 1 1
$$ 1 1 1 1 0 0 0 0 0 0 0 0 0 0 0 0 0 0 0 0 0 0 0 0 0 0 0 0
$$ ##$ShimSysFunc= (0..63)
$$ 1 2 3 4 5 6 7 8 9 10 0 37 38 35 16 15 14 13 12 11 28 27 26 25 24 23 36
$$ 22 30 29 20 21 34 33 32 31 17 18 19 0 0 0 0 0 0 0 0 0 0 0 0 0 0 0 0 0 0
$$ 0 0 0 0 0 0 0
$$ ##$ShimSysMatrix= 0
$$ ##$ShimSysType= 4
$$ ##$TFXNUM= 0
$$ ##$TRIPLO2= 0
$$ ##$VTU= 2
$$ ##$VTUETH= <149.236.99.21>
$$ ##$VTUTY= <no>
$$ ##$WBREFAM= (0..15)
$$ 100.1 100 100 100 100 100 100 100 100 100 100 100 100 100 100 100
$$ ##$WBREFLM= (0..15)
$$ 1 0 0 0 0 0 0 0 0 0 0 0 0 0 0 0
$$ ##$WBREFPH= (0..15)
$$ -0.06 0 0 0 0 0 0 0 0 0 0 0 0 0 0 0
$$ ##$WBSGU= (0..15)
$$ 0 0 0 0 0 0 0 0 0 0 0 0 0 0 0 0
$$ ##$XFAC= 2
$$ ##END=
$$ 
##$DECIM=	768
##$DSPFVS=	20
##XUNITS=	HZ
##YUNITS=	ARBITRARY UNITS
##FIRSTX=	-94472.039466666406952
##LASTX=	-120513.30876903449825
##XFACTOR=	-0.39736429850260307495
##YFACTOR=	2.5152324676513674031e-08
##NPOINTS=	65536
##XYDATA=	(X++(Y..Y))
$$ [...]
243724D53859093j748912j748873m5170031m5169993L2023054L2023054r362661r362662j5152162
243733C90189907j5152162k608276r5239922J57567300k7696048L0922468j54340861O7589126
243741C51231532k5042500K5132968K5132967L4782122j50481225J71679162j3584186L8521165
243749D57372005j46742181R7380807M749201Q608817q4022810J22709820o2553509n6764047
243757C40738103J28499320j08869360P6393969o8342971K4288655k1469301k1469339O1513247
243765D11282323O1513209k7258801k7258801k7258801k7258801M4144783M4144784o3925498
243773C88124397o3925497K0021935K0021973K0021935K0021935P960530P960530P960568
243781D28168306P960529j2302664j2302627j2302664j2302627j4714915j4714953p8399173
$$ y = [453859093, 452110181, 450361308, 405191277, 360021284, 392044338, 424067392, 414704731, 405342069, 390189907, 375037745, 372429469, 277189547, 434756847, 407060799, 437983267, 283642406, 351231532, 326189032, 351322000, 376454967, 411237089, 260755864, 432435026, 418850840, 457372005, 310629824, 408010631, 412759832, 421368649, 337345839, 460055659, 397502150, 340738103, 469237423, 360368063, 436762032, 368419061, 392707716, 371238415, 349769076, 411282323, 472795532, 445536731, 418277930, 391019129, 363760328, 407905111, 452049895, 388124397, 324198900, 344220835, 364242808, 384264743, 404286678, 412247208, 420207738, 428168306, 436128835, 423826171, 411523544, 399220880, 386918253, 372203338, 357488385, 279089212]
243789B79089212J06864118M2214976n0416727L0635975o1995652m568265J80695063j01059584
243797D21459116q427920P4554628j10708701p08611p08611J9313362J9313324m4370915M8260712
243806D17976384N9839713j25423654P1418675k1213027O4724577j20538790q608817Q4022809
243814D22197870j50451044J58321145n5889591L6742073k4288655O8342971k4288655k4288693
243822D06397421J1413119J1413118N623656q7008046M7521958j37741334Q8048309Q8048346
243830D33716547j68618567J40153621J11206234p4057095k6293878j18925523J53179969
243837D50361308l2083378j33399237J75372953j14100965P1162326J3569095J3569095l2746756
243845D11704441l2746718J11990222p3273068p3273107J11990222l6606372l6606410L2867366
$$ y = [279089212, 385953330, 428168306, 377751579, 408387554, 346391902, 341823637, 522518700, 421459116, 413031196, 487585824, 376877123, 376168512, 375459901, 394773263, 414086587, 369715672, 417976384, 477816097, 352392443, 423811118, 402598091, 467322668, 346783878, 338175061, 422197870, 271746826, 430067971, 374178380, 410920453, 386631798, 454974769, 430686114, 406397421, 417810540, 429223658, 434847314, 347839268, 395361226, 257619892, 345668201, 433716547, 265097980, 405251601, 516457835, 442400740, 416106862, 297181339, 450361308, 418277930, 284878693, 460251646, 346150681, 417313007, 430882102, 444451197, 411704441, 378957723, 490947945, 417674877, 344401770, 456391992, 419785620, 383179210, 416046576]
243853D16046576L2867329j02220457Q3042834k1167793k1167793K3399147K3399146n3793900
243861C80405089n3793900M100875M100876R6732539q8530788J02039597q3223769R407896
243869C71238415J02039560p8399192J4232473m3662341m3662304J04451849q0811481K3399147
243877C68826126K3399147J4714915J4714953n0899169n0899207J77785279j30986985M2697418
243885D09352477M2697418m4144784m4144783K171067K171029J5137110J5137071R347571
243893D07724176R347609L5400266n7231436M1189728n1441936M5049383m7582282m3722628
243901C38732880M8909037r8722653N5663403K0926572K0926572R64885R64923Q2017624p2368508
243910C98014735K0263195p2368508J6403540p6228124J07587801J4956174k9429868k9429869
$$ y = [416046576, 448913905, 346693448, 429736282, 408568489, 387400696, 410799843, 434198989, 380405089, 326611189, 330712064, 334812940, 431545479, 343014691, 445054288, 361830519, 371238415, 473277975, 394878783, 409111256, 365448915, 321786611, 426238460, 345426979, 368826126, 392225273, 406940188, 421655141, 370755972, 319856765, 497642044, 366655059, 409352477, 452049895, 407905111, 363760328, 365931395, 368102424, 383239534, 398376605, 407724176, 417071785, 452472051, 395240615, 436430343, 384988407, 430037790, 382455508, 338732880, 387641917, 288919264, 344582667, 365509239, 386435811, 387400696, 388365619, 470383243, 398014735, 418277930, 345909422, 362312962, 286084838, 393672639, 408628813, 379198945, 349769076]
243918C49769076J29780841q6359721M4868448M4868485q4550524O9835571r4199641O0186454
243926D34198989r3234717O1151377M1853106n0778559j1699573Q0932091l2927653j25559336
243934C03935725P1282955P1282974L739006q8892621N8256646l4375019l4375056N8256646
243942D09111256l5339942N7291723K0625026K0624988r2269794O2116262l0515364l0515402
243950C81128753N9221569l3410134J326755J326755R4727355j83167676J08236126J5604461
243958D44993964j01150051q518350O6744852q7641261N231624N231643R9793153P161451
243966D31847025q0645636J1986029M07065M07066O859943O859944m5245408M7386294J070443
243975C80932765J070443N8965257l3666407K9052908K9052946j04105107N0281026m8140102
$$ y = [349769076, 479549917, 393190196, 438058644, 482927129, 398376605, 468212176, 374012535, 434198989, 340964272, 402115649, 443968755, 393190196, 381490623, 462422714, 429495061, 303935725, 375218680, 446501654, 450240660, 361348039, 419604685, 385229666, 350854610, 409111256, 373771314, 431063037, 451688063, 472313051, 380043257, 442159519, 411644155, 381128753, 440350322, 406940188, 408266943, 409593698, 504321053, 321153377, 429389503, 444993964, 343843913, 335325563, 402070415, 314429154, 319660778, 324892421, 424685574, 431847025, 351201389, 363187418, 363594483, 364001549, 370861492, 377721436, 332476028, 379862322, 380932765, 382003208, 440968465, 407302058, 436354966, 465407912, 361302805, 411583831, 363443729]
243983C63443729M4491526m4280447m4280485K7047723K7047723K7047723K7047723k3127745
243991D04437470k3127782L4767031n7864633r377752Q3253912o7272528K5359098l7360217
243999C52814599N5271447J01587261j14553303j24865777J53029177j1006015j03637698
244006C08639691O0397513O0397532k2585015k2584978k2585015k2584978O4257186O4257187
244014D67609123p4690329P9695803n3462212n3462211N6975086N6975125n1095195n1095157
244022C77450033r19689r19689n8814446J26448844n4713590n4713590O4935655O4935616
244030D63689144l0590741l0590779Q5198811j00064518n8814465J26448863l5656540l5656577
244038C83963198J9343505J9343505l8551309l8551309Q5198811j00064480O9760194O9760193
$$ y = [363443729, 407935255, 363654808, 319374323, 346422046, 373469769, 400517492, 427565215, 404437470, 381309688, 416076719, 358212086, 348834334, 432088246, 364815718, 390174816, 352814599, 408086046, 509673307, 395120004, 270254227, 423283404, 412277389, 308639691, 369037204, 429434736, 406849721, 384264743, 361679728, 339094750, 403351936, 467609123, 392918794, 472614597, 419152385, 365690174, 422665260, 479640385, 428545190, 377450033, 376530344, 375610655, 316796209, 443245053, 388531463, 333817873, 398753528, 463689144, 433098403, 402507624, 487706435, 387641917, 328827452, 455276315, 419619775, 383963198, 403306703, 422650208, 384098899, 345547590, 430746401, 330681921, 400442115, 470202308]
244046D70202308j23222405J85549784j38661061M6602306p7871515p7871477J45988318l9274973
244054C91441285K4409266K4409303J2830341J2830341j5152162j5152162j5152162j5152124
244062D05311926Q005763Q005764l573200l573199O5237162j20026128m236577m236577o6955911
244071B83959023J18307380P1991585j13271781Q29222Q29222j0749741j0749741K4952070
244079C66097239K4952033K4952070K4952033j8423816j8423778Q5786812r9476518k7108047
244087C63308028k7108047L8506075L8506075j296612j296573j296612j296612M4054316M4054317
244096D96134355o4015966o4015965j477508j477509L3259341L3259342N5452382j29810984
244104C57307488R136493R136531R4531329r0731961r0731981R4531311j959990j959951R618973
$$ y = [470202308, 346979903, 532529687, 393868626, 440470932, 362599417, 284727940, 430716258, 391441285, 415850551, 440259854, 453090195, 465920536, 450768374, 435616212, 420464050, 405311926, 413317689, 421323453, 417750253, 414177054, 479414216, 359388088, 355151511, 350914934, 283959023, 402266403, 474257988, 360986207, 361815429, 362644651, 351894910, 341145169, 366097239, 391049272, 416001342, 440953375, 422529559, 404105781, 489892593, 390416075, 363308028, 336199981, 374706056, 413212131, 411915519, 410618946, 409322334, 408025722, 452080038, 496134355, 432118389, 368102424, 366624916, 365147407, 398406748, 431666090, 487118472, 357307488, 366443981, 375580512, 470111841, 379379880, 288647899, 383179210, 381219220, 379259269, 388878242]
244113C88878242R618974M7476724M7476761o0593519o0593558O7739918O7739918j44540952
244121C63202508M0722338K3836356K3836394m1777729m1777729J5152162J5152124J5152162
244129D13498586J5152162N623618N623656m0692195m0692195j65844j65845j65844j65844
244138C57850255P0755260P0755259o8192217o8192218R965753R965753J5755215J5755216
244146D14418276m3541693M9089934j07225950P8037340P598698P598698J9177623J9177661
244154D44330587m5953982m5954019L1239066L1239066l2445210l2445173P7554880j5076748
244162D12488467p3695262J11568103j02642651Q2620678M462746M462707J0252208J0252208
244170D59769204M8607491m4024173q4550524J00712842j21217220O4046108J7730258J7730295
$$ y = [388878242, 398497216, 445973940, 493450701, 432857182, 372263624, 440003542, 507743460, 363202508, 403924846, 427761202, 451597596, 409819867, 368042138, 383194300, 398346424, 413498586, 428650748, 434274366, 439898022, 399205827, 358513632, 358347788, 358181943, 358016099, 357850255, 428605515, 499360774, 431168557, 362976339, 372942092, 382907845, 398663060, 414418276, 370876583, 419966517, 312740567, 390777907, 398376605, 405975303, 425152926, 444330587, 398376605, 352422586, 383661652, 414900718, 382455508, 350010335, 427565215, 412488467, 338793205, 450361308, 347718657, 430339335, 434802081, 439264788, 449516996, 459769204, 508376695, 464352522, 379801998, 480514840, 359297620, 423343728, 441073986, 458804281]
244178D58804281o8177127o8177165K0594845K0594883J20945856j87826390O3051023O3051042
244186D22861248m3330615m3330652J32283597n2979769j9207804j11839449J19739655K7108047
244194D31304258J5287825J5287864n4185914L8445751O1603676j23659652R0551065r4712227
244202C79922646L4586097L4586097o3835031K8796635m3571874J41691455k07607066J01165085
244210D05734044K1333637K1333638j46561247L8702044P2474028k0157637L000252R5631953
244218D91490712j29916504N5346824R030973R030973n0793612M1838015Q8153867r7109463
244226D17071785l754096r6385779N2210814N2210872l4631330l4631369M2561717M2561717
244234D37214331m0179571m0179572P5609981j09653348k9565513J55697778k5705916k5705877
$$ y = [458804281, 390627154, 322449989, 343044834, 363639717, 484585573, 296759183, 359810206, 422861248, 379530633, 336199981, 468483578, 415503809, 396296005, 284456556, 404196211, 431304258, 446592083, 461879947, 407694033, 446139784, 507743460, 384083808, 474634873, 379922646, 414508743, 449094840, 385259809, 414056444, 370484570, 512176025, 304568959, 405734044, 427067681, 448401319, 301840072, 340542116, 413016144, 392858507, 395858759, 491490712, 361574208, 416921032, 425952005, 434982978, 384189366, 426027381, 514181248, 417071785, 413317689, 316931910, 369142724, 421353596, 386722266, 352090897, 394652614, 437214331, 397034760, 356855188, 432465169, 322811821, 293246308, 448944086, 423238170, 397532293]
244242C97532293n7819399J27443929m4310628j36942273J44812336m0450974l4661474N7970153
244250D13573963o7227294K5404370j5122019P7509683r9069452Q6193877k3806212k3806212
244258C73650704Q6736643r8526684m6421353J38841939o1859988L0771676k1333600k1333637
244266C80525700P9741037j05522330J2197107J04828771j3855551j99118840Q0705922Q0705922
244274D20207738j8077036j8077037K8238777K8238815m5094617m5094616J05431824p9831504
244282C75942344k4831422k4831422P3589705j9041960n9568310J25695018p6936773J08326593
244290D78343773j17824956O7438411l0982792l0982755K3052406o9579297J33052495n2210872
244298D00306413k6881878k6881879L2942744L2942743K1363781p1267884n1969612J33293716
$$ y = [397532293, 339712894, 467156823, 422846195, 285903922, 430716258, 390265284, 355603810, 413573963, 346346669, 371751039, 356629020, 434138703, 335069251, 421263128, 397456916, 373650704, 460387347, 361860663, 315439310, 454281249, 392421261, 423192937, 401859337, 380525700, 460266737, 354744407, 366941514, 471770285, 457914734, 258795894, 339501816, 420207738, 402130702, 384053665, 412292442, 440531257, 395436640, 350342024, 455773848, 375942344, 351110922, 326279500, 399869205, 380827245, 321258935, 446953953, 370017180, 478343773, 360518817, 427957228, 396974436, 365991681, 389044087, 319464790, 452517285, 400306413, 373424535, 346542656, 379485400, 412428143, 433791924, 362524040, 310554428, 443848144]
244306D43848144O0774455l1857210j18699412O6563917L7616529L7616567j32208182N3055146
244314D16709954K4107758K4107720r79976r3611640J21563962o3699329O7528840j17734489
244322C77992800k8178490O4453212j0810065j0810028R6295331q8968035o1950418o1950437
244330B76073870O8795290O8795271j8046894P4584771j22257520O3005846q1731169J03532159
244338D32751624j35148129N0115162l2867347J52395981n3130561L9501141n3130523L9501142
244346D39988490l8898088l8898051J628301J628263Q5575771r9687596m7582281M5049382
244354C48804191M462708M462745J14462797p0800494O392554O392553j20975980O4287311
244362C57488385Q8168957r7094410J8695218J8695180M5712760M5712760l1480287l1480287
$$ y = [443848144, 504622599, 472765389, 354065977, 420629894, 458246423, 495862990, 363654808, 416709954, 440817712, 464925432, 463945456, 370333816, 491897778, 428198449, 495727289, 377992800, 349814310, 414267522, 403457457, 392647429, 488942760, 399974725, 338024307, 276073870, 344869160, 413664431, 395617537, 470202308, 347944788, 410950634, 329219465, 432751624, 297603495, 347718657, 314851310, 467247291, 414116730, 453617871, 400487348, 439988490, 401090402, 362192351, 363820652, 365448915, 451024686, 351337090, 303754809, 348804191, 353266899, 357729644, 472192441, 401391947, 407784501, 414177054, 293201074, 357488385, 445657342, 348562932, 367258150, 385953330, 431666090, 477378850, 445898563, 414418276]
244370D14418276l5701774l5701811P8157970P8157970j15789590k3157887O3684238j21579033
244378C02488359J34846621n0416727m100875Q8530788q4188692Q443011J4232435p8399192
244386C31435728K7017580K7017580K1228079K1228079l4736850l4736888J7368425J7368463
244394C93190196L859654R6491319j62105441K3157925j9298271P3333431j9298271P3333393
244402D62663935j9841038j9841001j4051575j4051538l437498l437498Q3404666p0981429
244410D00427024L4435343L4435343j08371827M6014305j4775239j4775202j4775239j4775240
244418C47839268R3355366o1030766k6293878O6337748j3749992j3750030j3749993j3750030
244426C65207693J18201879K5570214q2500105J0131597j1096482j1096520j01798320N2587737
$$ y = [414418276, 378716502, 343014691, 421172661, 499330631, 383541041, 360383154, 424067392, 302488359, 437334980, 386918253, 382817378, 471348166, 387159474, 395602485, 409834920, 331435728, 358453308, 385470888, 406698967, 427927046, 393190196, 358453308, 375821733, 393190196, 397049850, 493541169, 331435728, 354593653, 335295382, 408628813, 389330542, 462663935, 442822897, 422981896, 408930321, 394878783, 391441285, 388003787, 471408453, 400427024, 434862367, 469297710, 360925883, 406940188, 392164949, 377389747, 362614508, 347839268, 441194634, 380163868, 353869990, 420207738, 406457746, 392707716, 378957723, 365207693, 483409572, 508979786, 426479681, 436611278, 425514796, 414418276, 312619956, 365207693]
244434C65207693L7028567j17357567J37379502j7006594M0888183n1743444L61832L61832
244442C95120004l8717153J15668979j35208434J9177623M1370663M1370663n7050501n7050502
244450C24681342M0043909M0043908m6798294m6798275O7061432q7324607J32675535k1710560
244458D01874390j3026329j3026328J7850906J7850905L1359677o1271988n307020Q7324645
244466D63628858j14176380M0209753M2139560M2139561j08386879j5755216N1788678m0842949
244474C60744986N7095735r7290397P0604506P0604506p9921972P4464160n8693854n8693855
244482C38913815N4442225N4442188m3978940M8652763k1785937k1785936k5645592k5645591
244490C57608995Q6284345o8101750J15231732j62663260J28740541q7400021P4705381j7926282
$$ y = [365207693, 402236260, 284878693, 422258195, 405251601, 446139784, 394396340, 394758172, 395120004, 356402851, 472071830, 336863396, 356041019, 397411682, 438782345, 381731844, 324681342, 364725251, 404769159, 357970865, 311172590, 378234022, 290909415, 423584950, 401874390, 388848061, 375821733, 393672639, 411523544, 442883221, 381611233, 376304213, 463628858, 349452478, 389662231, 431801791, 473941352, 365554473, 349799257, 401587935, 360744986, 417840721, 320550324, 391154830, 461759336, 381837364, 456301524, 397607670, 338913815, 393356040, 447798228, 403819288, 452472051, 430686114, 408900178, 383254586, 357608995, 443893340, 375791590, 491023322, 328360062, 457100603, 369700582, 444405963, 426479681]
244498D26479681n6025254L6606372K5027447K5027448o8569140o8569140J32132767k2253288
244506D29856893r468220Q3163444j46485851O9654636l0696299l0696299K9128323o3503342
244514C30953285R4440862J809236J3388160J06019825k00822557P7072437p9243466J3388160
244522C57005942L9923298L9923259j12532988J03607535j09638257M4747875J1940794q0690850
244530B94286608J39384705m5878604R1139065r4124264o3247067J22016299m5878605M6753060
244538D44451197m7808450m7808413M6753060M6753060q4475147J00788220j5001408j5001371
244546D28650748L4028277j51235051Q2273898j0357728J5694891J5694929n3778848L8852855
244554C99823971Q7098476r8164815r2375353R2887939j4217383j4217382j4217420j4217382
$$ y = [426479681, 370454427, 407060799, 432088246, 457115694, 388546554, 319977414, 452110181, 429856893, 420388673, 503552117, 357066266, 426720902, 396024603, 365328304, 394456627, 330953285, 425394147, 427203383, 440591543, 546611368, 345788811, 422861248, 343617782, 357005942, 396929240, 436852499, 324319511, 427927046, 318288789, 363036664, 374977458, 294286608, 433671313, 387792709, 478931774, 384807510, 321560443, 443576742, 397698137, 444451197, 396642747, 348834334, 395587394, 442340454, 357865307, 458653527, 443652119, 428650748, 462679025, 311443974, 393717872, 383360144, 399055035, 414749964, 360971116, 399823971, 486922447, 388757632, 296382279, 389270218, 375052835, 360835453, 346618033, 332400651]
244562C32400651J30187907n5075460q759570q759609P8082594j07180773M9135205m3496497
244570C66534448L3696589L3696588j2619263j2619263k7092956O5538707j37093027M8170263
244578C58212086L8521128L8521166q8847425R6415942j14900044P0363285N4924668j30338661
244586C22872145K21854648k10426477P9047516j06215831L1766724L1766780p8233347J07029981
244594C99462139l8053776N4577889k6474813O6156889j62527559K2735750Q4490219q141465
244602C92225273q382686q382686N126123N126085r5224850K13547339j4172186j99435458
244610B90426954J90268783j18503386M3602017M3602017m3240185m3240185o0608572L2023054
244618C34330497R9566947q5696344K4303746K4303745M1672209M1672171K6233591j59029737
$$ y = [332400651, 462588558, 407513098, 398753528, 389993919, 468076513, 360895740, 410030945, 366534448, 400231037, 433927625, 421308362, 408689099, 381596143, 447134850, 310041823, 358212086, 396733214, 435254380, 346406955, 442822897, 327922853, 398286138, 453210806, 322872145, 544726793, 334300316, 413347832, 307132001, 338898725, 370665505, 292432158, 399462139, 361408363, 415986252, 389511439, 455668328, 293140769, 315876519, 400366738, 392225273, 383842587, 375459901, 380586024, 385712109, 290487259, 504034598, 489862412, 290426954, 480695737, 362192351, 405794368, 449396385, 406156200, 362916015, 302307443, 334330497, 433897444, 348201100, 372504846, 396808591, 438480800, 480152971, 506386562, 347356825]
244626C47356825J04466901q0796389J1835274J1835237j7112113j7112152M6572163m6059539
244634C60986207n4984954J30278336o8493763o8493744J10980084p4283225J01330948Q699284
244642D46019173j84343620J24428569j4518928j4518928Q4867122p764542j06185669P9077622
244650D07060799m4189980m4190017M4581993M4581992k8751362k8751401n5768961J29494329
244658D24067392m0707248m0707285M8064724M8064762n005512n005474j09216101P6047227
244666C95602485J4051538J4051537J2121730q0509935J41420091j67352137R8963894q6299435
244674C42049768K2796093o9835570M7883789M7883827J0252208J0252208J0252170J0252208
244682D31786701j9177623j9177661j9177660j9177661O1875079O1875041m6195203m6195202
$$ y = [347356825, 451823726, 371027337, 382862611, 394697848, 377585735, 360473583, 407045746, 360986207, 306001253, 436279589, 367785826, 299292082, 410272166, 335988941, 437319889, 446019173, 261675553, 386104122, 371585194, 357066266, 441933388, 434168846, 327983177, 407060799, 362870819, 318680802, 363262795, 407844787, 379093425, 350342024, 294573063, 424067392, 383360144, 342652859, 390717583, 438782345, 433776833, 428771359, 319555258, 395602485, 409654023, 423705560, 435827290, 355317355, 496737446, 329385309, 428349203, 342049768, 364845861, 295010291, 342894080, 390777907, 401030115, 411282323, 421534493, 431786701, 412609078, 393431417, 374253757, 355076096, 416951175, 478826216, 432631013, 386435811]
244690C86435811K6384345K6384346q352543q352543o7212242J18051125j25107056O0156311
244698D08387554r8813102Q6450151j1970938j1970938N8467686l4163940Q1625611j03637717
244706C74374367n216552Q7415112n3462212n3462249N3643146N3643147n4427135n4427135
244714C48080489J4322940J4322941J4322902J4322940M4235251M4235214l2957797l2957834
244722D27927046j8966544j8966583j15457882J93314307m8878894m8878893N9191426N9191387
244730D88475370r6159630Q9103699j5106928j5106928j8001660j8001659q7475399R7787931
244738D25514796K5901865j59361426J10814221J8182594N7744022l4887642o5764876o5764838
244746C12378716Q050997Q050997J23840550o1422742q2650821J02612470k4756045k4756083
$$ y = [386435811, 412820156, 439204502, 430851959, 422499416, 355287174, 473338299, 348231243, 408387554, 309574452, 396024603, 384053665, 372082727, 430550413, 396386473, 478012084, 374374367, 369157815, 456572927, 403110715, 349648466, 403291612, 456934759, 402507624, 348080489, 362403429, 376726370, 391049272, 405372212, 449607463, 493842677, 460884880, 427927046, 408960502, 389993919, 274536037, 467850344, 418971450, 370092557, 429283983, 488475370, 392315740, 481419439, 466312511, 451205583, 433203923, 415202264, 327726865, 425514796, 451416661, 292055235, 402869456, 421052050, 478796072, 443908430, 378143554, 312378716, 320429713, 328480710, 452321260, 390898518, 308247697, 410860167, 386104122, 361348039]
244754C61348039J09366893p5896473J19016047j89756217Q2349314j0282389r3264861R1998430
244762C94878783O0397532j24865796L7239606L7239644l92013l91975l92013l92013R0468
244771D03412223R0467R0468R0467J1669392J1669431q6751735R8511632o9383309K3248393
244780C92647429Q6932632r8330660J4564124J4564161K985199K985199l1631041l1631079
244788C53085964J01526974n2859159K140924K140887L8807620n3824081M1702352n0929351
244796C81792130N035656N035655o4438121Q9948011Q895272Q895309n3884367L8747296L8747296
244805D58774137n3884368m673823m673786R7606996M975331j04059835N0326221m2305405
244813D02085468m2305405L1027988L1027987K3308680o9322985j10844364J67050591q44312
$$ y = [361348039, 470714932, 394818459, 513834506, 324078289, 406427603, 396145214, 302880353, 394878783, 455276315, 330410519, 367650125, 404889769, 404497756, 404105781, 403713768, 403321755, 403412223, 403502690, 403593158, 403683625, 415353017, 427022448, 340270713, 438782345, 369399036, 392647429, 479580061, 381249401, 395813525, 410377686, 413362885, 416348084, 384717043, 353085964, 454612938, 401753779, 403894703, 406035590, 444843210, 391019129, 432721481, 381792130, 386827786, 391863441, 327425320, 417373331, 426268603, 435163912, 381279545, 420026841, 458774137, 404889769, 400215946, 395542160, 493149156, 498124487, 394064652, 444390873, 402085468, 359780063, 390808051, 421836038, 445144718, 375821733, 264977369, 432027960, 431183648]
244821D31183648q44313J7489074p5142629K3278537K3278536l6787345l6787307O1633857
244829D07302058l0997845K6896932K6896969k5208345k5208382O1633858O1633819q6962812
244837D15986252q6962813Q0932129p3454041J3388160J06019862q5274225P357476J3146939
244845C91139739J3146939n6326799L6304864j5800449j5800449J8574570J8574569Q925453
244853C98738437Q925453M3662303j10723791K2434262K2434224K4846512K4846512j08311502
244861C26852410M6074592L6425475L6425475l1118455l1118456M2214976M2214938j3749993
244869D54220962j06381694K1951781K1951781J6162281J6162281m7521957m7521996k4364013
244877C04659426J91776474l9802687N2829015o8750074o8750075L4314732n8316932o211619
$$ y = [431183648, 430339335, 447828409, 372685780, 395964317, 419242853, 382455508, 345668201, 407302058, 376304213, 403201145, 430098114, 404889769, 379681387, 441315245, 502949064, 415986252, 329023439, 409955568, 336501527, 349889687, 455909549, 370635324, 377992800, 391139739, 404286678, 347959879, 384264743, 368464294, 352663845, 371238415, 389812984, 398738437, 407663890, 451326193, 340602402, 363036664, 385470888, 410317400, 435163912, 326852410, 372927002, 409352477, 445777952, 414659497, 383541041, 425756017, 467970955, 454220962, 347839268, 369791049, 391742830, 407905111, 424067392, 376545435, 329023439, 304659426, 496435900, 456633213, 509462228, 440712154, 371962079, 406276811, 347959879, 341748260]
244885C41748260o211657j4895812j4895850N6507697N6507734q623907j01255553k7922178
244893B80958734J26463935O814672O814709m1430949N1200715L7028528n5603136m9813635
244901C62433573M2818028K2554835K2554872L256563q9375063J0493429J0493429M703929
244909C89933595M703967O633775O633774l015342l015379L3651354j20734721K7861836J20493518
244918D63146377q1655754J0975871J6765372J6765372m7160125M5471538p6107551J6524151
244926C64725251J4111862J06743526j09397036M4989058K0263194p2368508P6228163p8157971
244934C67137539K1228080K1228079l4736850l4736888M7039514M7039515j20855369R5285193
244942D08628813q925453q925453l7872840N4758823o7468554Q6917579J1654340J1654340
$$ y = [341748260, 335536603, 320640791, 305744941, 362252638, 418760372, 410136465, 308880912, 280958734, 407422669, 414237341, 421052050, 379621101, 430821816, 467850344, 412247208, 362433573, 405251601, 427806436, 450361308, 453617871, 364242808, 374736237, 385229666, 389933595, 394637562, 401271337, 407905111, 404889769, 401874390, 435525744, 314791023, 342652859, 463146377, 381490623, 392466494, 409231866, 425997238, 378837113, 424308651, 348201100, 364725251, 378837113, 485580639, 376183603, 421172661, 441435855, 369067347, 445295510, 367137539, 388365619, 409593698, 374856848, 340119960, 387159474, 434198989, 313343620, 408628813, 399703360, 390777907, 352905067, 407663890, 340195336, 427112915, 438767255, 450421595]
244950D50421595q2424691J0206974M417474M417512j130768j130729n9025581R5360589k4771136
244959C96341239O7860529j07753683M6632449l5023305l5023344R362662J01994326q4716330
244967C59674543O9669726N2301301j02084793M7235540M7235502J2498653q0133051L814421
244975D10211842L814421m8290856m8290874K6293859K6293879N5241266l7390361p960530
244983C79922646p960567R8179943j17960657Q8772010o5614085n7894757L4736832J45701901
244991D97883266p0438662K6052657j28333438P9243466p5142591K050419K050457J8453959
244999C51819533J8453959l3651355N8980348k050457k050457O5493512k7138190p9243504
245007C50613389P5142628j04331238N0054857K8012646K8012646L7661763L7661763p6197981
$$ y = [450421595, 367996904, 378203878, 382621352, 387038864, 385908096, 384777367, 325751786, 421112375, 396341239, 464201768, 356448085, 403080534, 368057229, 333033885, 342396547, 444390873, 359674543, 429344269, 481645570, 379560777, 426796317, 474031819, 486530472, 406397421, 410211842, 414026263, 365735407, 317444533, 343738392, 370032271, 425273537, 387883176, 379922646, 371962079, 470142022, 352181365, 440953375, 375339290, 317444533, 352181365, 497883266, 427444604, 453497261, 325163823, 404407289, 329264698, 331315117, 333365574, 351819533, 370273492, 336622137, 395602485, 393552028, 391501571, 456995083, 429856893, 350613389, 425756017, 321424779, 371479636, 399492282, 427504928, 465166691, 502828454, 426630473]
245015D26630473p6198019L1872300L1872300J0402962J0402962q8018166M613500O6367929
245023D17946241O6367929q8018165M613500m0858040m0858077J32826364q3314236J115676
245031C69821192J115677L0063065o2568561P3001704q1384390K2826236K2826199k261497
245039C73439625k261534p7524717J38615807j0312532j0312494j9961649j9961649o935320
245047C64785537o935282o935321o935320J5740162J5740125J43108677j65663511L4073473
245055C86978540L4073510J4775240J4775239k9671089k9671090j8092127j8092127p7916711
245063B77159385J07346580N5241266l7390361O513164O513165n065799n065799L2565821
245071D37817422o0065843R0460597r4802694R8255283N623618r8586971Q6676357q4595758
$$ y = [426630473, 350432454, 382304754, 414177054, 424580016, 434982978, 346964812, 351578312, 417946241, 484314170, 396296005, 400909505, 360051465, 319193388, 452019752, 368705516, 369821192, 370936869, 400999934, 338431373, 411433077, 330048687, 352874923, 375701122, 373439625, 371178091, 293653374, 432269181, 421956649, 411644155, 391682506, 371720857, 364785537, 357850255, 350914934, 343979614, 359719776, 375459901, 518568578, 352905067, 386978540, 421052050, 435827290, 450602529, 420931440, 391260350, 373168223, 355076096, 277159385, 384505965, 439747231, 402356870, 408870034, 415383199, 410317400, 405251601, 437817422, 377751579, 468212176, 373409482, 471664765, 477288383, 378701412, 465377769, 380782011]
245079C80782011Q035907M2772795m9858869q126374q126374l1284300O1347364L6742074
245087D32284234j48521217L8671881L8671920k3504667k3504686J21232292o4031056P2504209
245095D43802910k0127493N5135746N5135746j59075009K6188358Q819895q3811731J05311213
245103D31379635p9952115N1276092m1355573J63944782j44827446M6225384M6225384j01406364
245111C71509779j01406306J30172797n5090512J01949092q3314198j9629960P3001704k3972057
245119C93220339k3972057K8133257K8133257O603593O603632l3922719l3922719l3440277
245127C37436306N9191388Q8138776r7124553L8204567L8204530m4778018m4778018k1620055
245135C52874923P1011572r6883331Q8380035p1584520J13678847j29479296N5784033Q020854
$$ y = [380782011, 388817918, 431590713, 381731844, 373605470, 365479096, 334194796, 395542160, 432284234, 283763017, 322434898, 361106818, 337602151, 314097465, 435329757, 371298701, 443802910, 423675417, 478811163, 533946909, 374871900, 401060258, 409880153, 326068422, 431379635, 351427520, 402703612, 361348039, 525292821, 380465375, 426690759, 472916143, 371509779, 270103473, 400276270, 345185758, 447134850, 363820652, 344190692, 417192396, 393220339, 369248282, 397381539, 425514796, 432118389, 438722021, 404799302, 370876583, 337436306, 396627694, 484766470, 387641917, 425846484, 464051014, 419272996, 374494978, 352874923, 423886495, 327003164, 415383199, 343798679, 457477526, 327998230, 383782263, 391803117]
245143C91803117Q020854J3810316J3810317j5860773j08492400k1650236J63613093J2121692
245151D57175980J2121730n3492355n3492393L2445210L2445211o4046109o4046108j1940795
245159B87170371J73322496m8607491j41239155J09397036J09397036j39550606M5712798
245166C95602485l4857499l4857499Q4791745j00471565J96751805j12020365p809776Q4821889
245174D71951220J9690246p2941380j5046642j5046604L1269209L1269247m5923838m5923838
245182C59297620M8637635M8637672j90660797J18111392r5496252Q9767076o724242o724243
245190C64845861J06170617p9092751n2075132n2075151R9174952R9175010q895310q895309
245198D68332787m7491815m7491814M613499M613499l5701811N6929891P4298316j10965013
$$ y = [391803117, 399823971, 413634287, 427444604, 411583831, 303091431, 281441195, 445054288, 457175980, 469297710, 415805355, 362312962, 394758172, 427203383, 363157274, 299111166, 287170371, 460492867, 411885376, 270646221, 380043257, 489440293, 349889687, 395602485, 360744986, 325887487, 410679232, 310207667, 506959472, 394939107, 387129331, 471951220, 491641466, 418700086, 403653444, 388606840, 419876049, 451145296, 405221458, 359297620, 407935255, 456572927, 265912130, 384023522, 288527270, 378294346, 371570104, 364845861, 471016478, 391923727, 339848595, 287773444, 386948396, 486123406, 477228096, 468332787, 420840972, 373349158, 377962657, 382576156, 346874345, 403804236, 478102552, 367137539]
245206C67137539o4649180J20614148r9386088Q5877279k894731k894731Q684231Q684194
245214D21172661J0614040J0614039p6228124J6403540j08070281P7193047m2456159J42807132
245222D52049895q2982548R649155J19649206o5614084j1578963j1578963K3157926K3157925
245230D55909549m3421082m3421120L3771966L3771965k1665326k1665288k1665327k1665326
245238C49950011O317177O317138J16317305o8946063n4231147L8400517L8400555n4231147
245246C78294346o3880245J21383046m6511839m6511839J49848011l5415319p0152207p0152187
245254C16901767J9584707J9584688O0111077l2520587N9628635j25634676R453111J02084793
245262D29193515j03441729Q1821637M7084748m5546915j02099865Q3163425r0520883K110743
$$ y = [367137539, 302488359, 423102507, 323716419, 409593698, 406698967, 403804236, 412488467, 421172661, 431786701, 442400740, 366172616, 382576156, 274505875, 351698922, 309242763, 452049895, 369067347, 378716502, 498365708, 432751624, 421172661, 409593698, 432751624, 455909549, 412488467, 369067347, 402839313, 436611278, 414945952, 393280664, 371615337, 349950011, 356267188, 362584326, 478901631, 409955568, 355724421, 394124938, 432525493, 378294346, 314414101, 435797147, 389285308, 342773469, 492621480, 457206161, 387053954, 316901767, 336486474, 356071162, 416182239, 383661652, 443290287, 317655611, 327108722, 429193515, 325751786, 407573423, 454658171, 409111256, 307011391, 390174816, 299653933, 301764676]
245270C01764676J64216146k1047182l0696299l0696300J17176670o8086698J1036196q1595468
245278C62071741j0191884j0191921J6825696p5805987J91233707j17538501L1058169L1058131
245286D18519151J08251216k00521048J23689833o1573533J7790581J7790582m0104195J45159134
245294E29001721j62648170K2615121j24051608J84720542j28740541N6522825k8389568k8389531
245302C20640791L9154362L9154362o5056265J20207064m8411504m8411503J5272772J5272773
245310C87822852m2622003N0009623p1569429J13693937P4433979j10829311M960240M960279
245318D10860167P854972P855009r0566155R4697174o0653806L1977820q548530q548530K3293589
245327D08221710K3293626k3022224k3022224J0659273J0659273J0659274J0659273j1533729
$$ y = [301764676, 465980822, 444933640, 414237341, 383541041, 500717711, 432631013, 443667209, 362071741, 351879857, 341687936, 358513632, 282707645, 473941352, 356402851, 387461020, 418519151, 526770367, 326249319, 449939152, 388365619, 406156200, 423946782, 383842587, 529001721, 366353551, 388968672, 264917064, 449637606, 320897065, 377419890, 349030322, 320640791, 359795153, 398949515, 333893250, 454100314, 405688810, 357277307, 372550079, 387822852, 345200849, 395210472, 323641043, 437334980, 511768959, 400939648, 405899888, 410860167, 418715139, 426570148, 336003993, 430701167, 370047361, 402025181, 393476651, 384928121, 408221710, 431515336, 408493112, 385470888, 396130161, 406789434, 417448708, 428107981, 416574252]
245335D16574252j1533729j1533729j1533729P282100P282062P8685646j3946017j70261921
245343B91014935J38510269m0963598m0963559J1503548J1503586p5377p5377O9398362j15864967
245352C23987822O5538707O5538708q3540367q3540348N5407091N5407148j522780j522742
245360C95753239M266719M266720m7295826M5335837M5335876j39927492J23493808L0862144
245368D62091025o7559021o7558984K4348980K4348979M1717405n0914222l3545835J51717532
245376D84645859q1791456J0840171p6966879J5664748K1454248K1454248K26131R2857833
245384D88384903N6191098k52581071J88142988j20629220L3756875n8874790N4020070l8611596
245392C49799257N9809532l2822133K3474524K3474523k8630751k8630790L2158755L2158718
$$ y = [416574252, 405040523, 393506794, 381973065, 389255165, 396537227, 475222873, 461276856, 291014935, 429525204, 388561606, 347598047, 359101595, 370605181, 370529804, 370454427, 439852789, 323987822, 389526529, 455065237, 371524870, 287984522, 343391613, 398798761, 397275981, 395753239, 400019958, 404286678, 356990852, 402326689, 447662565, 307735073, 431228881, 462091025, 394532004, 326973020, 351322000, 375670979, 417388384, 366474162, 332928327, 484645859, 402854403, 413694574, 336727695, 352392443, 373846691, 395300939, 395527070, 488384903, 544576001, 291994930, 480137918, 359508698, 393265573, 334390783, 388410853, 349799257, 409608789, 376786656, 400261180, 423735703, 395104952, 366474162, 398632917, 430791635]
245400D30791635p7841335J4790293P1720183j13543146N4351758N4351758j13543146P1720183
245408C92798183J3825407J3825407k2177950k2177912K4137902K4137901R664207R664207
245416D43697352o7528840o7528821J8348420J8348401J8348439J8348438O769439O769476
245424C95572304m809487m809487N9899999j25363330N6040345N6040345m2380782m2380782
245432C47809125N4110498N4110537j41525629J67246597r9069452Q6193877j09683491P5579837
245440D34771899o3367640o3367640K7876907K7876945Q5771759r9491608L1736599L1736599
245448D13543820k6158177k6158215M4280485M4280447j75719713J33052476n895020n895021
245456C95331082K4982214K4982214j15608655O9654635l4555953l4555953N8075710N8075749
$$ y = [430791635, 352950300, 367740593, 439460776, 325917630, 380269388, 434621146, 321078000, 392798183, 406623590, 420448997, 398271047, 376093135, 400231037, 424368938, 434033145, 443697352, 376168512, 308639691, 326988111, 345336512, 363684951, 382033389, 388802828, 395572304, 390762817, 385953330, 445853329, 320489999, 376530344, 432570689, 390189907, 347809125, 401919623, 456030160, 314504531, 481751128, 382681676, 468875553, 359192062, 434771899, 371404259, 308036619, 335913526, 363790471, 449562230, 350070622, 381807221, 413543820, 387385643, 361227428, 405507913, 449788360, 274068647, 407121123, 401226103, 395331082, 420313296, 445295510, 329686855, 399341490, 364785537, 330229584, 388305294, 446381043]
245464D46381043j9117374j9117336K5268668K5268669n1924379n1924416m643643m643642
245472C45547590M1672209M1672171m4024174m4024135O0186454j25076855N5361857N5361915
245480C86677032k532899k532900J4835526J4835564l1480325l1480287M2818028M2818029
245488D33957768O9835609j15427758N804553N804553n774410n774372q669141q669141K6067709
245497C97155370K6067748L3787018j51476273r49833J84313496j13844691P1418638k1212989
245505D25258484k1213027J7805672J7805672j6931216j6931217r7983899Q7279392j6931216
245513C78158645j6931217K9384635K9384635j6931217j6931216J5875826J5875826l0439988
245521C87445929l0439987J869522J869522J869522J869521J7308101J7308139J7308139J7308139
$$ y = [446381043, 427263669, 408146333, 433415001, 458683670, 406759291, 354834875, 350191232, 345547590, 387219799, 428891970, 384867796, 340843661, 401030115, 275953260, 331315117, 386677032, 384144133, 381611233, 396446759, 411282323, 379801998, 348321711, 391139739, 433957768, 503793377, 388365619, 394170172, 399974725, 394200315, 388425943, 379756802, 371087661, 397155370, 423223118, 457010136, 305533863, 304584030, 488897526, 375052835, 446471473, 425258484, 404045457, 421851129, 439656801, 422725585, 405794368, 307810469, 395089861, 378158645, 361227428, 390612063, 419996698, 403065481, 386134265, 402010091, 417885917, 387445929, 357005942, 358875464, 360744986, 362614508, 364484029, 381792130, 399100269, 416408408, 433716547]
245530D33716547n5784033n5784071O3865211O3865174j12713924P2549405P2549443j12713924
245538C69549828m100913m100876k7258801k7258763J22302716o2960575n065798n065799
245546C56041019L377212L377174J07587838p7675527m5833371m5833352J54868556l0394753
245554D25514796k3474562k3474524J1262365J1262327j6720139j6720138j6720138j6720138
245562C34209849P7358929P7358892o1588586o1588624M990422M990421M990384M990422m236577
245571C81475532m236577N9447700l3183965r4938395R0324896j16166474J92605714l2701522
245579D42626909l2701522p7087489J08175801L000289q9631413m7175178J38088113o4227044
245587C81068466K8404622j2121730j2121692j5981384j5981383Q2439780j02823585R2571377
$$ y = [433716547, 377932514, 322148443, 386013654, 449878828, 337164904, 409714309, 482263752, 369549828, 365448915, 361348039, 334089238, 306830475, 429133191, 366172616, 361106818, 356041019, 359418231, 362795405, 470383243, 392707716, 346874345, 301040993, 455909549, 425514796, 402040234, 378565710, 389828075, 401090402, 384370263, 367650125, 350929987, 334209849, 411568778, 488927670, 427339084, 365750460, 370740882, 375731303, 380721687, 385712109, 381475532, 377238955, 436686655, 403502690, 308564295, 398889191, 282722717, 475328431, 442626909, 409925387, 332837898, 441013699, 444013988, 354382575, 307207397, 445295510, 381068466, 409473088, 397351358, 385229666, 369248282, 353266899, 435706679, 332883094, 425454471]
245595D25454471o0324n7955100L4676602q744556q744518k955055k955018m945188m945188
245604C68826126j0734650j0734651M1370626n1261001R9265439q5997890P3695263j8936439
245612D05492823l6304865N6326838P116217q5515447O5011032k7620633N1803767m0827896
245620C95481836r2933172R2330119k1529625P1102039j5740162j5740125J80935J80897J80935
245629D13513677J80897j7187491j7187528j7187528j7187490L8174348L8174387q141427
245637D13151845q141465j387079j387041j387080j387041n005512n005475n005474n005512
245646C79440166K5871760K5871722k0444092k0444129j9298233j9298272N7894776N7894814
245654D67488512m9210582m9210583j4473694j4473693Q8048346r7215021m583356m583318
$$ y = [425454471, 425394147, 367439047, 402115649, 393371093, 384626575, 381671520, 378716502, 373771314, 368826126, 358091476, 347356825, 388727451, 337466450, 436731889, 350733999, 424429262, 405492823, 369187958, 425514796, 432631013, 347115566, 412126598, 384505965, 436309732, 395481836, 302548664, 394878783, 373349158, 444451197, 428711035, 412970910, 413151845, 413332742, 413513677, 413694574, 396507083, 379319555, 362132027, 344944537, 383118885, 421293272, 413151845, 405010380, 403623301, 402236260, 400849180, 399462139, 394456627, 389451152, 384445678, 379440166, 405311926, 431183648, 410739556, 390295427, 370997194, 351698922, 409593698, 467488512, 418277930, 369067347, 354593653, 340119960, 428168306, 330953285, 326369929, 321786611]
245662C21786611J10241349p5022018K9188609K9188648p779633p779595L799330L799368
245670D07422669r8481451Q6781877j7428749P5202915p6288449J6343216J6343216J6343216
245678D26238460j025210j025247j025210j025209k050457k050418k050457k050419j2182054
245687D01753779j2182016J0975872J0975909j8936439j8936401K7379411K7379412m7401385
245695C81008142m7401347j085533j085534L9501141L9501142m9270869m9270869Q5816955
245703C97713228r9446355Q1957281Q1957338p0257765p0257726O8689750O8689751m9512090
245711D09533412m9512128K7680957K7680958J6825658J6825696j2121729j2121730j0674364
245719D14116730j03305990k8042790J57220540j55652563J53119663q985777q985739k7319125
$$ y = [321786611, 432027960, 357005942, 386194551, 415383199, 407603566, 399823971, 403623301, 407422669, 308941218, 395723095, 378294346, 453497261, 377208812, 393552028, 409895244, 426238460, 425213250, 424188003, 423162793, 422137584, 420087127, 418036709, 415986252, 413935833, 401753779, 389571763, 400547635, 411523544, 392587105, 373650704, 401030115, 428409527, 381008142, 333606795, 332521262, 331435728, 370936869, 410438011, 361167142, 311896273, 397713228, 298266873, 380224154, 462181492, 391923727, 321666001, 390355751, 459045502, 409533412, 360021284, 387702241, 415383199, 432208857, 449034553, 436912824, 424791094, 414116730, 310810740, 282767950, 439988490, 284335927, 437455590, 428469813, 419484074, 392164949]
245727C92164949k7319088J8996726J8996726J7549360J7549360K110743j83152566J47812625
245735D04708835l7450685m3240185J42023181k1529625P1102040j77845566J30926661r0038478
245743C78656178R5224888j51792909L3470420j19649226J89122964K7017580o5614084L7149139
245751D23584950n5482526m3903524M8728102K7500022o5131642Q5394836r9868530R9868530
245759D20690218q5394836M7763217m4868448R8782959q6480332n427631Q7204034j31348798
245767C00920383N3914492R4440899r0822466J10361959p4901407N8256646l4375019Q5756630
245775E03552117r9506660J0493429J0493429N3432069j31831260n4638194J30625097K0625026
245783D43245053K0625026r5164563r5164545J88278651j20493518J8453959J8453959O4287367
$$ y = [392164949, 364845861, 383842587, 402839313, 420388673, 437938033, 440048776, 256896210, 404708835, 367258150, 324017965, 466041146, 444511521, 515613561, 337767995, 468694656, 378656178, 473881066, 322088157, 355558577, 235909351, 425032315, 452049895, 386435811, 423584950, 368102424, 324198900, 372927002, 400427024, 335295382, 420690218, 320821688, 420690218, 335295382, 383058599, 338190151, 436973110, 350492778, 345065147, 432269181, 300920383, 354834875, 449275774, 358453308, 468815267, 393913860, 452170506, 417795487, 503552117, 404045457, 414538886, 425032315, 478464384, 346633124, 291994930, 422620027, 443245053, 463870079, 368705516, 273540971, 461819622, 341326104, 359780063, 378234022, 442521389]
245791D42521389j20975999J04813680q0449648P0318051k2313613m945188m945150o392554
245799C77630968o392553J6765372J6765372k4484681k4484680Q5515447p116256r4923342
245807C39275647R0340024m2818028m2818029P3906303P3906341r5918409N8467724l0786767
245815D23554806j23418411J02371229n2014846k1137650k1137593L4827299J27459020j07014891
245823C63488963M7371204l3681498l3681498J1066339J1066339J4925994J07557695j15337290
245831C72776248L9048842m2003898m2003859L3741784L3741822j8363529P4268173k4152992
245839D27052591k4152954j14854810J63040145r6672253J19468347k5268669k5268669o8207308
245847C55136420K4424357l9259883N3371745L9380530n3251171j8514245j8514284m2637074
$$ y = [442521389, 321545390, 426359070, 345909422, 416227473, 393913860, 388968672, 384023522, 377630968, 371238415, 388003787, 404769159, 380284478, 355799798, 441315245, 434198989, 339275647, 429615671, 386797643, 343979614, 417885917, 491792258, 395873849, 454341573, 423554806, 300136395, 402507624, 350492778, 329355128, 308217535, 343044834, 470503854, 363488963, 410860167, 377178669, 343497171, 354563510, 365629849, 380555843, 488113538, 372776248, 411825090, 369821192, 327817333, 361559117, 395300939, 376937410, 451205583, 427052591, 402899637, 288044827, 451084972, 354412719, 473881066, 448612397, 423343728, 355136420, 379560777, 340300894, 393672639, 433053169, 379801998, 361287753, 342773469, 300136395]
245855C00136395m2637113K15959627o1935365M6798294m5833371O271905O271943J1096520
245863D36128835q1535182M5833371m6798294N4517603N4517602k2675445k2675483o4649162
245871C52663845K7982465K2193003K2193002l8928193l8928231O9142050k3489615p7524717
245879C15303609P6861340K0896428K0896391K9580622j24805510O6247357k6384346l7480865
245887C41115026N5150836l5551019l5551020J19619063l4767032N7864633l4767031r196818
245895D23916638r196817o7091631K5540033j2574029j2573991m7310898J07075196k9942454
245903C77842047k9942493J12864716m1521417p357477p357476j7006594j7006593n2708348
245911C17806365n2708385R5888227R5888265j28936528K5449565p1041715Q3344380o03091
$$ y = [300136395, 257499282, 473458909, 411523544, 458321838, 412488467, 418760372, 425032315, 436128835, 354593653, 400427024, 353628730, 408146333, 462663935, 439988490, 417313007, 352663845, 380646310, 402839313, 425032315, 386104122, 347175891, 416317941, 392828326, 315303609, 392164949, 413061377, 433957768, 463538390, 338732880, 404980237, 378595891, 341115026, 396265862, 360714843, 325163823, 444782886, 410015854, 467880487, 433113456, 423916638, 414719821, 347628190, 373168223, 360594194, 348020203, 300709305, 407784501, 377842047, 347899554, 460764270, 419242853, 411885376, 404527900, 387521306, 370514713, 317806365, 265097980, 360986207, 456874472, 327937944, 353387509, 282345794, 365690174, 365087083]
245919C65087083o03054J36414579p9725947r2511054J20611j9177623P3454004M1129404
245927D24188003j13256653J33761068k0625026N9945233r4440862l0756623l0756586j2905699
245935C15152855J41480358k2554834k2554835k2765912k2765951L7058710L7058709j38555502
245943C01553598P7585022J29690374q6450189n9915089L2716613n2195781J02190351k020314
245951D43154585j56406370M8155192M8155192k020276k020313M4295575M4295538o0397532
245959D07211591o0397532j4081719j4081681K5720968K5720930J2212197J2212197l6033500
245967C58483451J18352632J0282389j44103781L2173846L2173808o33235o33196j1729755
245975C94366159j1729716L4586096L4586135o4558732o4558732Q4037900Q4037938q3857003
$$ y = [365087083, 364484029, 500898608, 421172661, 328661607, 328782218, 309604595, 383058599, 424188003, 310931350, 444692418, 424067392, 484012625, 389571763, 358815140, 328058554, 315152855, 456633213, 434078379, 411523544, 388757632, 365991681, 403050391, 440109100, 301553598, 379138620, 508828994, 422378805, 362463716, 395180329, 342984548, 445174899, 443154585, 286748215, 334903407, 383058599, 381038323, 379018010, 423313585, 467609123, 407211591, 346814059, 332732340, 318650659, 344371627, 370092557, 382304754, 394516951, 358483451, 476836083, 487118472, 343014691, 375188537, 407362345, 406729110, 406095914, 394366159, 382636443, 417222539, 451808674, 387249942, 322691210, 406729110, 490767048, 406910045]
245983D06910045P0529129K985199j51400934j7700095J36685962p9454544J3177082l5068577
245991C46663267J19317555o9805427o9805466P1071896P1071897l6998386l6998385J4624448
245999D09141399J4624486m1340520m1340482R5827941n8558192m6979190M5652435J3810317
246007C90838194J3810354l558146l558109M0827896M0827897j01979274r347609N9161245
246015D27022448j56979299J34424464j9961648J4232472J4232473j8574570j8574607j2302627
246023C63519106j2302626j2302665j2302626J3991213J3991251J3991252J3991251o754423
246031C75821733o754386o754385o754385J5197395J5197358p960530p960529O1030766O1030766
246040D92093803m7039515m7039553M5592150M5592149j31951871K2434224J02522040j13618522
$$ y = [406910045, 477439174, 480424373, 329023439, 311323344, 448009306, 368554762, 381731844, 346663267, 465980822, 396175395, 326369929, 397441825, 468513722, 431515336, 394516951, 409141399, 423765885, 382425365, 341084883, 436912824, 378354632, 331375442, 377027877, 390838194, 404648548, 401090402, 397532293, 438360189, 479188086, 377208812, 367861203, 427022448, 270043149, 404467613, 384505965, 398738437, 412970910, 394396340, 375821733, 363519106, 351216480, 338913815, 326611189, 340602402, 354593653, 368584905, 382576156, 375821733, 369067347, 362312962, 355558577, 370755972, 385953330, 377992800, 370032271, 431063037, 492093803, 445054288, 398014735, 443606885, 489199034, 357247163, 379681387, 482203427, 368584905]
246048C68584905l4495667N8136035j4594305j4594304L7510971L7511009l6787307l6787308
246056C64484029R528506R528506K5208383K5208344j5318006j5318007l6546086N6085579
246064D22861248M4506653j09879516M2139598M2139561j3825407j3825407q035907q035906
246072C98044917O1437832j23825497k0097331J65165998j26237786N9025544k7816659O4815044
246080D50512062l3606121l3606121P7479502j07783788n5678494J29584797p4976784J7654918
246088C69579971J33444470n1818858o4121485K8510179K2720678K2720679j22016261O3247030
246096D02266403o226709o226710M1159585j44103743J29931595n5331771r7787893K10984297
246104D74665054j13226548P2036820q5244083J00019284l8928193l8928232Q834986Q834985
$$ y = [368584905, 334089238, 392225273, 377630968, 363036664, 400547635, 438058644, 401271337, 364484029, 374012535, 383541041, 408749424, 433957768, 418639762, 403321755, 366775669, 422861248, 467367901, 357488385, 399627983, 441767544, 427942137, 414116730, 406080823, 398044917, 459482749, 335657252, 315559921, 480725919, 354488133, 413513677, 385697018, 450512062, 416905941, 383299820, 460779322, 352995534, 297317040, 426901837, 351925053, 369579971, 503024441, 451205583, 387084098, 415594277, 438314955, 461035634, 339019373, 402266403, 396039694, 389812984, 430972569, 286868826, 416800421, 361468650, 263680757, 474665054, 361438506, 433475326, 348231243, 448250527, 409322334, 370394102, 379229088, 388064073]
246112C88064073N5150837j30112511J18654159o6609151k924912k924875P2338327k0293338
246120D11342609R5496253q9767077k5359136O7272566j29569763N5693604M8456699m4174927
246128C89390828Q8983088r6280240p5157662J10105628n7789256J27474073j18096320k5464657
246136C43165482J1202041J1202040O859906O859943j6297982j6297982J6026580J6026617
246144C78746645p131308p131308j643391j643353K1514535K1514572N593475N593475N593475
246153D21006817N593475j1774951j1774950N593475q7038190J33926951n1336416P68935
246161D04965146P68898L919979L919940j9237947j9237947J6463827J6463826J6463826J6463827
246170D40953375j8755505j8755466m1913430m1913430M1069117M1069118n246696n246733
$$ y = [388064073, 443214910, 313102399, 431756558, 365147407, 362222495, 359297620, 431635947, 411342609, 506838862, 417071785, 391712649, 458985215, 329415452, 385109056, 433565755, 389390828, 478373916, 382093676, 306936014, 417041642, 359252386, 486726459, 368630139, 343165482, 354367523, 365569563, 372429469, 379289412, 362991430, 346693448, 362720028, 378746645, 371615337, 364484029, 362840638, 361197285, 382711820, 404226392, 409819867, 415413342, 421006817, 426600292, 414825341, 403050391, 408643866, 321605676, 455532627, 404196211, 404965146, 405734044, 409654023, 413573963, 394336016, 375098069, 391561896, 408025722, 424489548, 440953375, 422197870, 403442404, 361528974, 319615544, 360684661, 401753779, 396507083, 391260350]
246178C91260350j2242340j2242341J0915586J0915585K2494548K2494548j22242430O3020861
246186C74374367n3733576L8898050K1529625K1529625k2373937k2373899P0257726j15005582
246194C13102399J40455186m4808161J3086614J3086653q5334512R9928817m281811m281810
246202D40953375k3580044k3580082K2735770K2735769k3580082k3580044n0597623J34665667
246210D76172706l8415608l8415608j31047234N4216019N3251172N3251133J8514283J8514283
246218D66041146o0608610o0608610J51672260l3591030j5257682j5257682j5257682j5257720
246226D01874390j07798860P7464430m2184832J43078572j05869071P9394258n9553257n9553220
246234C26852410K5359136K5359098K5359136K5359136j658443j658444n9553258n9553219
$$ y = [391260350, 379018010, 366775669, 377691255, 388606840, 411101388, 433595936, 311353506, 374374367, 320640791, 359538841, 381068466, 402598091, 380224154, 357850255, 428107981, 313102399, 453557585, 408749424, 421836038, 434922691, 349588179, 449516996, 445235185, 440953375, 417373331, 393793249, 416529019, 439264788, 415684706, 392104662, 341507039, 476172706, 437757098, 399341490, 268294256, 322510275, 375761447, 429012580, 447526863, 466041146, 405432536, 344823926, 496496186, 462905156, 447647474, 432389792, 417132110, 401874390, 294075530, 371539960, 329355128, 472433700, 366564629, 445958887, 386405630, 326852410, 352211546, 377570644, 402929780, 428288916, 426630473, 424972029, 365418771, 305865552]
246242C05865552J07256112p8007179K6203411K6203410J50792J50754J50754J50791q14169
246251C87310228q14131q14131q14170K2343795K2343756j28182665N7080626K7982503K7982465
246260D14418276R7456241q7807125M824578M824577o754386o754423N065799N065798N065799
246269D35405134N065798J1820184J1820184P960530j77302780J7850906J7850887O271905
246277C36742748O271943M0043908M0043908l7149177l7149139K9188609K9188610j7127204
246285C90054206j7127204K5328993K5328955n1864093n1864092L8867945L8867907j9026907
246293C78565710j9026869P5534604j09728725J48868034j59904211J77815403j30956804
246300C61167142K3429290K3429290j9026869j9026907Q5183758j00079608J0583897J0583896
$$ y = [305865552, 413121664, 335114485, 361317896, 387521306, 387672098, 387822852, 387973606, 388124397, 387310228, 386496097, 385681966, 384867796, 407211591, 429555347, 301372682, 358453308, 386435811, 414418276, 511874517, 424067392, 428891970, 433716547, 426962161, 420207738, 425273537, 430339335, 435405134, 440470932, 452291116, 464111300, 472071830, 294769050, 312619956, 330470843, 336742748, 343014691, 383058599, 423102507, 385953330, 348804191, 377992800, 407181410, 390054206, 372927002, 398255995, 423584950, 371720857, 319856765, 358724710, 397592617, 378565710, 359538841, 435073445, 325344720, 474212754, 314308543, 492123946, 361167142, 384596432, 408025722, 388998853, 369971946, 455155704, 355076096, 365659993, 376243889]
246308C76243889J03215561q2047768m0556494m0556513K5057572K5057591L5189187L5189188
246316D36792213n7442515J27820852j51039063L4224264j16302175O8961115L6063643L6063643
246324D15141977r1304909O3081185J0010987q2620697J12291749m2094327p357477p357439
246332C69791049O0186454r4199640J27730384k6655748l6304864J18081268j18865256j18865218
246340B80898429L5520857L5520858m1672171N0959455o935320Q5696382j628301j628300
246348D36731889m7944114M4687551k3821303k3821304j8031802j8031841J2966042J2966004
246356C75701122K6474813K6474813j20191992R5948533p1946314Q2439743K6957294o5674409
246364C76183603M8185335M8185373q8832335L799330n7955100R6431032l9923297l9923260
$$ y = [376243889, 479459450, 397411682, 356855188, 316298675, 341356247, 366413838, 401603025, 436792213, 379349698, 507170550, 356131487, 390355751, 274053576, 343014691, 379078334, 415141977, 323837068, 386918253, 396929240, 314308543, 426600292, 384505965, 377148488, 369791049, 429977503, 335777863, 463508247, 436852499, 400547635, 518628903, 399763647, 280898429, 316419286, 351940144, 310267973, 361227428, 354292108, 439988490, 438360189, 436731889, 388787775, 433475326, 409654023, 385832719, 367800917, 349769076, 362735118, 375701122, 402175935, 428650748, 308458756, 404407289, 332460975, 414900718, 441858012, 376183603, 424368938, 472554311, 383721976, 387521306, 329566206, 425997238, 386073941, 346150681]
246372C46150681N2708367N2708405r1063689J567977m221486m221525O151333O151332O151332
246381C72082727O151295O151332O151332l497822l497823J7669971j36716105Q3284037Q3284093
246390D31063037k1891495j14523102L0213837J22845521p3031885J9599817m6014306M6617359
246398C94878783J04512173j11628390J5740124J5740163j2724821j2724783j2724783j2724782
246406C68343684J4292759J4292797Q503296Q503297L3349809n9281855p176542p176541M2998925
246415D16649629M2998964r2088897N42728P5926617j6705048q8108632M523031K4786189
246423C68524581K4786226L0575688L0575689m8788426m8788426L4194121L4194084m9753312
246431C75520225M2878315j5016460j5016461N2949626l9682077l9682038N2949588m0646961
$$ y = [346150681, 398859048, 451567453, 360503764, 362071741, 357850255, 353628730, 359780063, 365931395, 372082727, 378234022, 384385354, 390536686, 387038864, 383541041, 401211012, 264494907, 347778944, 431063037, 409171542, 294648440, 324862277, 447707798, 374675913, 394275730, 348261424, 394878783, 499390956, 387762566, 403502690, 419242853, 406518032, 393793249, 381068466, 368343684, 382636443, 396929240, 405432536, 413935833, 447285642, 388003787, 380827245, 373650704, 416649629, 459648593, 367559696, 368102424, 444029041, 427323993, 339215361, 343738392, 368524581, 393310807, 423886495, 454462184, 405673758, 356885332, 391079453, 425273537, 375520225, 418398540, 403382080, 388365619, 441315245, 401633168, 361951130, 414900718, 374253757]
246439C74253757m0646962Q8651400o5734695Q1655754p2730339j326755j326755R0340024
246447D53135429k291678n2467146n2467183j0222027Q2409600j6011527j6011527j1186950
246455C74886991j1186950M6707826m5923838n397487Q7234177k6625567k6625567P7585023
246463D70654608p6801034J0041129J0041130m2003897m2003860j6916145P5715520j4021395
246471C74706056j4021395L8083919n4547745O5101499k7530204J8785686J8785647q231932
246479D11131531q231894J417222j52968891J01014332J01014350j42143754J35751200n5301590
246487C91682506n5301590L9259920L9259882k1288366k1288403O9413414O9413452j78569229
246495C32581586L7571295Q0027492p4358640k110743k110743L0696299o1935365J12713923
$$ y = [374253757, 333606795, 422258195, 356523500, 438179254, 365448915, 364122160, 362795405, 453135429, 450843751, 398376605, 345909422, 335687395, 418096995, 402085468, 386073941, 374886991, 363700041, 410407867, 364484029, 359086542, 446320719, 419695152, 393069585, 470654608, 393853574, 403894703, 413935833, 371931936, 329928076, 313011931, 388727451, 374706056, 360684661, 398768580, 344220835, 409322334, 381792130, 400577816, 419363463, 411131531, 402899637, 404316859, 251347968, 352362300, 453376650, 311232896, 446984096, 391682506, 336380916, 375640836, 414900718, 393612352, 372323949, 441737363, 511150815, 332581586, 370152881, 450180373, 375821733, 373710990, 371600247, 402296546, 340361181, 453075104]
246503D53075104m1672170q7988022O6398072J0433143J03064769j38163489P7977035j7549360
246511D25575082j7549360r830052Q2801613k7650776k7650814j08703459M5682560o33196
246519C62041598o33235R0068622o4317511N4366849l8264854P3665082j42475443L8928193
246527C73379301n3703433P1735274q2650840O8116821O8116841p4690329P9695803p4690291
246535C75309147p4690310R5134402K502756j1006053j1006053J22152000r3988600j11356988
246543B93050301J66537968o1181521L1450145J3810316p8821348n487954J48898177k07154785
246551C01101299J94249067j78207378R9687576j7549360j7549360j80935j80897J2362951
246559C93732963J2362951j69040724J08854232J92379584k09024308M3782914j10603142
$$ y = [453075104, 411402934, 323414912, 389812984, 400246127, 503310896, 365147407, 443124442, 425575082, 408025722, 398195670, 480997283, 453346507, 425695693, 316992234, 362674794, 362041598, 361408363, 451476985, 387159474, 441526323, 403261469, 476926551, 334451108, 373379301, 319675868, 391411142, 308760302, 376877123, 444993964, 370303635, 449999438, 375309147, 300618837, 395753239, 398255995, 387249942, 376243889, 498395889, 404407289, 293050301, 459588269, 398406748, 429856893, 443667209, 364845861, 359357907, 508256084, 301101299, 495350366, 317142988, 416830564, 399281204, 381731844, 381550909, 381370012, 393732963, 406095914, 237055190, 345909422, 538289006, 329264698, 373047612, 262444470]
246566B62444470Q5274187Q5274188J1940795J1940832j41239174P4901388J7006593J7006594
246574D24549873J11568065j04572459O1392599j54747927L7812517L7812554k2012105k2012068
246582C69791049L6847632L6847593r468182r468219j9599817j9599779j9599817j9599779
246590C46150681J0312494J0312494l0213818O2417808o7121775J18141554q4490199J00773129
246598D66282368k4665616k4665577K7439698K7439736k8042789j20674454J76518811j32253416
246606C67378761O4588875k8042790n8920023L3711679O4588875j20674453R3536263r1727066
246614C24440121N5904644N5904681l2867366l2867367L6123968L6123929o8086697J17176631
246622D91852544n2648042n2648081j7911230J67352137j81705220J27067007l5038396l5038396
$$ y = [262444470, 347718657, 432992845, 444933640, 456874472, 315635298, 390536686, 407543279, 424549873, 536117938, 431545479, 492938078, 338190151, 376002668, 413815222, 391803117, 369791049, 406638681, 443486274, 434018092, 424549873, 404950056, 385350277, 365750460, 346150681, 356463175, 366775669, 336561851, 398979659, 331857884, 449999438, 365509239, 466282368, 441616752, 416951175, 444390873, 471830609, 443787820, 323113366, 499632177, 367378761, 431967636, 403924846, 345004823, 378716502, 443305377, 322630924, 416167187, 324440121, 380344765, 436249446, 403382080, 370514713, 406638681, 442762610, 374675913, 491852544, 439204502, 386556421, 368645191, 535997328, 354292108, 481359115, 446320719, 411282323]
246630D11282323m0827896m0827897M2154652M2154651o7121774K5509890P7615203j07648125
246638C42291027J2966004J2966042M7702892M7702893n2406859n2406859K4786226K4786188
246646D08387554J0312532J0312494k4424356k4424356q1354228J03909062M0224805n2406821
246654C90536686R8119581q7143709J03909081q1354247R6431032q8832334n4095446n4095446
246662C23475198J37922306m7341060J6343215J6343216o0849831L1781833L1781795j53481477
246670B95975195J14764361K2132678j4533980j4534018K5238487K5238526k1077326k1077325
246678D12126598J1729716J1729755r2480911R2782418l6757126l6757164P3242926j12020403
246686C23595809P3242963j9388739K6927113o5704552K3911732K3911771k8193543k8193581
$$ y = [411282323, 370454427, 329626530, 371781182, 413935833, 346814059, 372323949, 449939152, 342291027, 355257031, 368223073, 415925965, 463628858, 411221999, 358815140, 383601366, 408387554, 418700086, 429012580, 404588224, 380163868, 298809640, 402718702, 442943507, 390536686, 488656267, 401512558, 505421639, 424067392, 520498424, 431666090, 377570644, 323475198, 461397504, 414056444, 430399659, 446742875, 385893044, 417674877, 449456672, 295975195, 410739556, 432872234, 418338254, 403804236, 429042723, 454281249, 433203923, 412126598, 423856314, 435586069, 343105158, 435887576, 399130450, 362373286, 435616212, 323595809, 396838772, 377450033, 404377146, 338672594, 362584326, 386496097, 358302554, 330108973]
246694C30108973P4087238P4087238j07316437P7946893p206685p206685m1943573m1943573
246702C50613389J6916125J6916164J1126626J1126663J3810317p8821348J06441981m7944114
246710D00185803l558109l558109M4687513m7944114j8273024P4358603m7220450m7220412
246718C51457701p1343261J44797265r588831r588830n3914511J62226014j17598788L6787307
246726D33234066l739005Q8892620o7423320o7423320O4769810k7861854n8739088n8739089
246734C02970820R2752275J20611J20611J20610M2546627n0085000J02371248n2014846j11839468
246743C27063488J04301094k1137649k1137612k6203449O6428254m975331r7606996K9761519
246751C56493318J22393222p4449070p4449108R317466R317428R6159630n8226465N6598164
$$ y = [330108973, 404196211, 478283449, 370967012, 448913905, 441707220, 434500535, 392556962, 350613389, 367529514, 384445678, 395572304, 406698967, 420509284, 341687936, 448129917, 400185803, 396627694, 393069585, 437757098, 389812984, 371539960, 445898563, 398678113, 351457701, 280114440, 424911705, 415322874, 405734044, 351819533, 514045547, 396446759, 433234066, 429495061, 518387681, 450964361, 383541041, 448310851, 420448997, 361709909, 302970820, 395723095, 395843706, 395964317, 396084927, 438631554, 388546554, 490917802, 438902956, 327063488, 431364582, 410226933, 389089321, 362885872, 429314126, 424338795, 326731799, 356493318, 478886540, 404437470, 329988362, 339305828, 348623256, 444782886, 386556421, 443154585]
246759D43154585N6598202p0770350p0770351O7694685q6691410M6466605M6466605R799870
246767D41948441R799909m8094906M4536797K2253289p0378338o694099o694061l4676564
246775C52000468N7955100N849787N849786l6123967l6123930O8086698k4544967m9632739
246783C43316236M2998926o1211663L1420001j0252208Q2379456P0800494j45340031P7554879
246791D31666090p6831215M2818029M2818028l4857499l4857461O3563628k9067999L5581163
246799D40832764L5581201j03366353N1019780o482983o483021p0167297Q4218835j15518169
246807C09634757J00622319j1307561j1307598J1609144J1609106o5583941Q8802153r6461176
246815C37617203N7924957j9268128j9268090L5792241L5792241L0002778L0002779l8506075
$$ y = [443154585, 499752787, 428982437, 358212086, 425906771, 339215361, 385681966, 432148571, 441948441, 451748350, 403653444, 448190241, 470443530, 400065192, 393371093, 386677032, 352000468, 409955568, 415805355, 421655141, 385531174, 349407244, 417493942, 392948975, 343316236, 386315162, 325103499, 356523500, 346271292, 428650748, 499451242, 354111211, 431666090, 354834875, 397652904, 440470932, 405613433, 370755972, 434319600, 405251601, 440832764, 476413965, 373047612, 424067392, 417584409, 411101388, 340934091, 425152926, 309634757, 410257076, 398949515, 387641917, 399251061, 410860167, 345276226, 434078379, 337617203, 395542160, 376274032, 357005942, 392798183, 428590424, 458593202, 488595981, 450089906]
246823D50089906j31137740J06230941m8155230R0309843o4076251N9432609l3199017M3029069
246831D72524130m9602558P1976495j44164068M6798294M6798294j3026329j3026328J2061405
246839D30339335J2061405m5833370m5833371J43289612m1973716j4956174j4956137L3289485
246847D55427069L3289523m3903563m3903524J6765372J6765334p2006638p2006619J94309373
246855D84736327R046063j37620760J71151504n9462790n9462790O151332O151332l497822
246863D17192396l497822O0186492l2445211r4953485R0309843q111322q111283o7935944
246871C52633664J17327423l3199055l3199017N638708N638709N1954522j33308769q8922764
246879B44563421K19849425r4712264k080600K7952322K7952321j2573991j2574029j4503875
$$ y = [450089906, 318952166, 425183107, 377027877, 467337720, 403261469, 462694078, 429495061, 472524130, 422921572, 494898067, 350733999, 397532293, 444330587, 431304258, 418277930, 430339335, 442400740, 396567370, 350733999, 494023611, 452049895, 437093721, 422137584, 455427069, 488716592, 444813029, 400909505, 417674877, 434440211, 362433573, 290426954, 484736327, 493782390, 356161630, 527313134, 467850344, 408387554, 414538886, 420690218, 417192396, 413694574, 473881066, 441435855, 346482370, 436792213, 428680891, 420569608, 352633664, 469961087, 436762032, 403563015, 409201723, 414840432, 466794954, 333486185, 244563421, 464412846, 369700582, 367619982, 395572304, 423524625, 410950634, 398376605, 383872730]
246887C83872730j4503837L1811976L1811976j477509j477546j8845934P3785692O3171653
246895E48149201j22091676p5775825J6855839J08236126p7027241R0867701r4395666j3342927
246903C81475532j3342926J31394013n3869277p0031597K2600069O3126456j22136909Q6284344
246911D25499705Q6284345l3364900l3364862j0448233j0448195J130767J130768m7114930
246919C79304465J38148436m3255237m3255238j3101705j3101743N0582571m2049094r8978965
246927C14293490Q6284326n0733325J34530004p1946352p1946352J15246823p0016505N3492393
246935D39204502l9139310n0718234M1913392L075666L075666Q865129Q865166j0433142j0433105
246944C94275730L0093208L0093246k4062525j16694169J47692014l7571333K2253327K2253289
$$ y = [383872730, 369368893, 401180869, 432992845, 431515336, 430037790, 411191856, 484977548, 548149201, 426057525, 350281700, 367137539, 475373665, 398346424, 489214125, 394818459, 381475532, 368132606, 499526619, 445657342, 375625745, 398225814, 461352270, 339215361, 425499705, 511784050, 478419150, 445054288, 434606055, 424157860, 425288627, 426419395, 379304465, 517452901, 474197664, 430942426, 417840721, 404738978, 455321549, 413272455, 314293490, 400577816, 349844491, 484374495, 412428143, 340481791, 455728614, 385712109, 439204502, 400065192, 349346958, 391260350, 394336016, 397411682, 406276811, 415141977, 404708835, 394275730, 424368938, 454462184, 430399659, 313705490, 461397504, 423826171, 446079498, 468332787]
246952D68332787l5641450l5641487N1200677N1200715j20553843k7922178J24534107o0729221
246960D14780107N5060369l7571295k6942203k6942165K5163111K5163111r5451019Q9812310
246968D23072326Q9812310r5451019j2468471j2468509N8935114N8935076r8345750n714085
246976D06306992q4836979J00426350J9554545J9554583r392843r392805k0971805P1659897
246984D92907935j61849130K3414238J9795804J9795805Q9269543r5993786q186698q186699
246992C70967012J30760817n4502511r04599r04599j2483561j2483562L5762098L5762060
247000D91973155j0553716j0553753N367344N367344r8843321Q6420046l0334467l0334467
247008D08508165K7560346K7560347K0866247K0866248k5449604k5449565j9660103j9660104
$$ y = [468332787, 432691337, 397049850, 448250527, 499451242, 378897399, 350975221, 475509328, 414780107, 469840476, 432269181, 405326978, 378384813, 403547924, 428711035, 333260016, 423072326, 512884636, 417433617, 404965146, 392496637, 451431751, 510366827, 412021077, 406306992, 321470013, 421896363, 441450908, 461005491, 451612648, 442219843, 421248038, 492907935, 331058805, 354473043, 374268847, 394064652, 483334195, 387340409, 379153711, 370967012, 501727829, 447225318, 446320719, 445416120, 432932559, 420448997, 456211095, 491973155, 481419439, 470865686, 476233030, 481600374, 382757053, 469177099, 438842632, 408508165, 436068511, 463628858, 484495105, 505361353, 479911749, 454462184, 434802081, 415141977]
247016D15141977K6655710K6655710k2072354k2072392K4243422K4243459m0405740m0405740
247024C91984052J27489163j81283064J16452930K3821303r3898095R1365195l8898050l8898050
247032C98135384M9873922M9873960m643643m643642n0959494n0959455M5531825M5531863
247040D77740720m3240185m3240185Q4007757j01255572J01376183Q744518l1781795l1781833
247048D20569608K9972597J22604300j34062652N1200715o8448530J16814800o7483607K5148058
247056D96315289k1167793k1167793M7521996m5109707N3311458j31951871J15065888p0197440
247064D22620027J26644850n8618477l2565821l2565783K171029K171068M2697418M2697380
247072E15251691m4144784M8486919j11568104P3695263R1063650r4199641q5515409R9747882
$$ y = [415141977, 441797687, 468453397, 446381043, 424308651, 448552073, 472795532, 432389792, 391984052, 519473215, 338190151, 454643081, 478464384, 384566289, 475931484, 437033434, 398135384, 448009306, 497883266, 493239623, 488595981, 437636487, 386677032, 432208857, 477740720, 434500535, 391260350, 475268107, 374012535, 475388718, 484133236, 452351441, 420569608, 450542205, 573146505, 439083853, 490284568, 421836038, 538650838, 471167231, 496315289, 475147496, 453979703, 501501699, 456391992, 509703450, 377751579, 492817467, 422620027, 549264877, 490646400, 458080579, 425514796, 427685825, 429856893, 472554311, 515251691, 471106907, 519593826, 408025722, 481720985, 572784635, 478584994, 393069585, 492817467]
247080D92817467k1831170k1831133K2313613p0318051Q5997889r9265439M6436424M6436462
247088D80756062K3278536K3278536Q6178787r9084505N7231399j28031930M8547205m4084460
247096D48069630L6968242n5663460J24292887o0970443l075666Q9555998j25619603N9643687
247104E13201272l8777440N3854187l6907918N5723747R407895R407896m6557035m6557072
247112D72795532J03969406q1293961K6776359K6776320J5197396J5197396k8223724k8223725
247120E22970999J45460680j63311547K6052656K6052657P0438662k2193003j01315895Q3947432
247128E88102641k6052656k6052657R407895R407934l1118456O1513209o5855306J19408023
247136F38760627p1644844K0986858k9610765O3020899k9610766k9610803J4775239J4775240
$$ y = [492817467, 470986297, 449155164, 471468777, 401150726, 487148615, 387883176, 434319600, 480756062, 504034598, 527313134, 613491921, 514407416, 571638815, 443606885, 492154090, 448069630, 485037872, 429374412, 553667299, 492696856, 489621190, 579177188, 453557585, 513201272, 474423832, 528278019, 491370101, 547093848, 556501743, 565909639, 519352604, 472795532, 576764938, 495470977, 522247336, 549023656, 564221052, 579418448, 551194724, 522970999, 668431679, 505120132, 531172788, 557225445, 627664107, 605471104, 504155209, 588102641, 562049985, 535997328, 545405223, 554813157, 523694701, 585207910, 519352604, 638760627, 567115783, 588102641, 558491876, 621512775, 591902009, 562291206, 577066445, 591841685]
247144E91841685l7330074J47933255n9764260L2867366K7077828K7077905N3130560j32132843
247152F50701422J8393634J8393711j9057088j9057012j9057050j9057050O1995689O1995690
247160G35251946j5197396j5197396R407934R407933R407857R407934n065799n065799M7039515
247169G79396729M7039515m3782914M8848713O0427713j24835691l4133759N8497867j0975910
247177G80482263Q1655793l6787345l6787270M6195203M6195203j4594305j4594305q804842
247185H42960395Q3826860r8421165Q6842164o3684238K8947388j5438617j5438617M8245621
247193H97839791M8245697j05416733P9846519p6469345J6162281N4758823N4758824q0329038
247201H89396819J2302664Q2620678j02642651J8936440J8936439o5975954J19287374m8607491
$$ y = [591841685, 554511611, 702444866, 642680606, 675547972, 702625800, 729703705, 782834265, 650701422, 669095056, 687488767, 668431679, 649374667, 630317617, 611260567, 673256256, 735251946, 720054550, 704857154, 714265088, 723673021, 733080878, 742488812, 737423013, 732357214, 779396729, 826436244, 782653330, 831502043, 891929756, 767094065, 732960306, 791458173, 780482263, 862138056, 825350711, 788563441, 834758644, 880953847, 866359542, 851765237, 842960395, 926787255, 828366090, 915208254, 851524016, 880471404, 865032787, 849594170, 897839791, 946085488, 840668755, 920515274, 844045929, 860208210, 914967033, 969725857, 889396819, 901699483, 984320161, 881677510, 900613950, 919550389, 853574435, 972861809, 924254318]
247209I24254318M4024135L1721546j53541782N4879397l7752231J1458353J1458352m0646962
247217H45855126m0646961K4605253K4605329k1710598k1710522j447327j447404j447403
247225H06655493j447328P23664P23664j09276350j6644799Q5636057r9627271J0372818J0372819
247234F87488767J1096482J1096482l5219292l5219369j5921098j5921059L6184291L6184254
247242F79769458m1250052N1381650j74408106J34364159k1951781k1951781o6337786K6293878
247250E65909639Q1233674j04029730n1924416J33338950p7977036p7977035J78689916j30082425
247258E17181537M1672171n0959456N9040634N9040596o2538418o2538456N1321325N1321325
247266F03541258o5312576K7319125j46365278J62406948o8207308K4424394j01014350Q4248978
$$ y = [924254318, 968278453, 999999999, 846458217, 901337614, 863585383, 875043736, 886502088, 845855126, 805208165, 829813418, 854418747, 832708149, 810997627, 809550300, 808102896, 806655493, 805208165, 805931829, 806655493, 697379143, 680734344, 766370401, 666743130, 677115948, 687488767, 698585249, 709681731, 674462439, 639243070, 623321972, 607400913, 643585204, 679769458, 638519406, 689901056, 515492950, 649857109, 627905328, 605953547, 539615761, 565909639, 647143313, 543113583, 491189167, 624528117, 546551081, 468574046, 647263962, 517181537, 558853708, 507894252, 566934886, 625975482, 563437064, 500898608, 552219933, 603541258, 538228682, 565547807, 419182529, 581589477, 513382169, 537806563, 436792213, 521041191]
247274E21041191j05115226Q0148103N6990177j28273151o0729221J24534108Q744518Q744518
247282E06085017j9343467j9343505K6972346K6972346k1273351k1273314k1273313k1273313
247290D36249446J4428460J4428461l1887353l1887391L2761846L2761809n4080356L8551271
247298D51326193p5670304J09593061j18126501k5494800K7575400K7575399L3364900L3364899
247306D63508247K5163111K5163148j50451101L4812265m4310628M8321036O5689500j19573867
247314C48321711J7232762J7232724N653799N653799K0127493K0127493k0398895P2232806
247322D86183692j30881427N4381901O0171401j25091965j583067j583067J02627561q2635769
247330C61589260o3096238J22167053J16377553o8885738q7219125N412578R272194J01903897
$$ y = [521041191, 415925965, 496074068, 553064245, 424791094, 364061873, 488595981, 497340499, 506085017, 486741550, 467398045, 494370391, 521342737, 500069386, 478796072, 457522759, 436249446, 450677906, 465106367, 433219014, 401331623, 434093469, 466855278, 412774922, 451326193, 375655889, 485248950, 367122449, 341627649, 369203049, 396778448, 430143348, 463508247, 488671358, 513834506, 363383405, 398195670, 353885042, 402206078, 467895578, 348321711, 365554473, 382787197, 388440996, 394094795, 414222288, 434349781, 413950886, 486183692, 355302265, 409684166, 469855567, 344763602, 343180535, 341597468, 444225029, 361589260, 298493022, 420660075, 537037628, 468151890, 380932765, 386345343, 395617537, 497521434]
247338D97521434j32087572N3175757L9666985j45596343J74754809j34017418J8438907J8438868
247346C90295427Q8033256o6352839l1615989l1615988N9085867l3545834K4349017K4348979
247354D22981896m8019528M4612174j3282641P9349024m2230028m2230028n563332Q7068333
247362D82685870o8644517K3987147o4784862K7846764o5749786Q8636347l2942744l2942743
247370C58091476j3162030P9469635p1056806K1574859o407606o407644R7803021N171318
247378D65076223k8570465k8570503l4359928l4359966K3534810K3534848P7569970j38570555
247386C25284434J91429713j48219710M6692736M6692774j57868827J20026129k6640657k6640620
247394C70755972p1147273Q3238822l603343Q9028322j02024507r392805L4993163L4993200
$$ y = [497521434, 365433862, 418609619, 458276604, 312680261, 487435070, 353417652, 371856559, 390295427, 478328683, 411975844, 380359855, 348743867, 407829734, 374283900, 398632917, 422981896, 374962368, 419574542, 406291901, 485640925, 443410897, 401180869, 395617537, 482685870, 414041353, 438028500, 373243638, 401090402, 335340616, 423976963, 391034219, 358091476, 344929446, 424399081, 353342275, 374917134, 368509528, 362101884, 459904905, 465076223, 436505758, 407935255, 373575327, 339215361, 362750171, 386285019, 463854989, 325284434, 516714147, 368494437, 415187173, 461879947, 304011120, 424037249, 397396592, 370755972, 299608699, 382847521, 379244178, 468272500, 366247993, 356855188, 391848351, 426841551]
247402D26841551r2375391J23765211q4656044O9730050j1322651j1322651j02024507N2361626
247410C70997194J19046153r7094372K6414488o6217175N2467145j63673379J33519847M0888183
247418D16348084L1239066j23147029J08432113J5800449j92620767J47028618K291678r0339967
247426C15032245K2434205K2434223P8399192j4232473m0285129J14101003n5723747n5723708
247434C86435811j9780752j9780714J26886110j51008921Q4429876o9956182M5833371m6798294
247442C36260305L2686432n9945214P1282955k1348728R9265477j16875123P9967168p4418927
247450C46874345N9945233l2686432J9418882J9418882n5844357R8541775m0405740m0405740
247458C74856848L2324562o0307065J94430003q3464990m4868448m4868486o8026335K4605253
$$ y = [426841551, 334466160, 458231371, 373575327, 443305377, 431982726, 420660075, 318635568, 370997194, 490043347, 392948975, 419363463, 353146288, 405613433, 241940054, 375459901, 416348084, 447587150, 324440121, 432872234, 448672683, 256051916, 403080534, 405372212, 315032245, 337466450, 359900673, 438299865, 424067392, 383782263, 497883266, 442159519, 386435811, 366655059, 346874345, 473760455, 322751534, 407181410, 337225228, 383058599, 336260305, 368946737, 309001523, 380284478, 358935750, 458201227, 341326104, 421293272, 346874345, 406819578, 374133146, 393552028, 412970910, 357126553, 455668328, 415262588, 374856848, 407181410, 346874345, 541304348, 457839358, 412970910, 368102424, 300076089, 324681342]
247466C24681342J2061406J2061443N8377219N8377256j3991213j06622916K2675445K2675445
247474C90295427j447366j447365N0657948m1973717m1008831m1008774J38465016k01184370
247482B51347968R8662367O030684R8662386O030722r4320289O0065843r0460597K171067
247490C38190151M1250015n1381612O513164O513165P478049P478087P478087P478088k8464946
247499C42532248k8464926J31710630L9078985m2938639m2938639j5921060j5921060J31590039
247507D98727578q4550524l4375056l4375019n9462752L3168874N8256646N8256608m1853106
247515C93793249m1853105n186410n186409Q0690870p3695263J8936439p3695225J0734651
247523C04538797J0734669J16875105r9265477N7050501r7335593J0734669J03366296o8629464
$$ y = [324681342, 336742748, 348804191, 407181410, 465558666, 451567453, 344944537, 367619982, 390295427, 388848061, 387400696, 438058644, 396084927, 355076096, 314067322, 452532338, 251347968, 350010335, 356041019, 454703405, 460734127, 366413838, 426479681, 336019084, 338190151, 379440166, 328058554, 334571718, 341084883, 348562932, 356041019, 363519106, 370997194, 342532248, 314067322, 445777952, 484856937, 441918298, 398979659, 383058599, 367137539, 498727578, 414177054, 379801998, 345426979, 285964227, 319133101, 377389747, 435646355, 393793249, 351940144, 346753734, 341567325, 422258195, 348562932, 367499371, 293804146, 304538797, 315273466, 432148571, 332883094, 389933595, 292598002, 303332671, 406698967, 338069503]
247531C38069503Q5756668m7401347M5230317m7401384m7401347M1370663M1370625o1271987
247539C48321711L1359676p8640394J3991252O4166700k8464946K3640368K3640368m342096
247547C93672639r6973761P4780758j7850906R4079068o0307102l7149139J78991385j80981518
247555C48261424R6913475r7999008n367345J8755505J8755504O5071318q9314777j2845393
247563C42230703j2845394O4347654O4347616p8459478P5926616r7757787N6628346p689166
247571D06729110p689127n0145362M2486340K8012646K8012646Q714374q3917289O784529
247579C78987867O784566n6899748L5731955M8275802m4355861l8566362N4065303j839379
247587C82184143j839378q8681524O5704533L0967702o1664001R0467R0468J5287825J5287863
$$ y = [338069503, 423826171, 376424824, 421655141, 374253757, 326852410, 368223073, 409593698, 348321711, 379681387, 301040993, 315032245, 379198945, 350733999, 374374367, 398014735, 393672639, 296698878, 371479636, 353628730, 447707798, 387400696, 350251557, 529242942, 348261424, 445174899, 347175891, 341808546, 360564051, 379319555, 444390873, 355076096, 342230703, 329385309, 393732963, 458080579, 379621101, 455547717, 357789930, 414418276, 406729110, 399039983, 348894621, 391380961, 419393607, 447406253, 456120627, 372203338, 378987867, 385772433, 328872685, 364604640, 412880442, 368524581, 329958219, 384023522, 382184143, 380344765, 291663241, 357367774, 388335476, 326671475, 326761942, 326852410, 342140235, 357428098]
247596C57428098R498363R498363m975331r7606995J24323029L1691366p4539538P9846557
247604D35163912r9627309N4758824N7653593N7653554j33399236K0986858J9298271p3333431
247612C39155036K8947388K8947426N789463q6842183N0175486m2456197J37258929p8881672
247620C82093676m6074592m6074592J12171157J9539492p1162363K1469301O0789545j55350999
247628B77400625J36052727j8333348K0263195K0263156l5701773l5701774l4947966l4947929
247636B94346913j3719868J40666227k3368966k3369004p1614644K1017021M0797715n1833892
247644C12921502K71364K71402O7815277k4816370P9394258j3237406j4202292j4202330j0342675
247653C83872730j0342637q7535723O6850372O1060910r3325185O2990756k9640947R3867952
$$ y = [357428098, 366926461, 376424824, 371449493, 273842498, 398165527, 429856893, 355317355, 435163912, 335536603, 390295427, 447949020, 505602574, 372203338, 393190196, 412488467, 339155036, 368102424, 397049850, 402839313, 315997130, 366172616, 323716419, 460975348, 382093676, 336019084, 289944492, 402115649, 421655141, 350492778, 371962079, 432751624, 277400625, 413453352, 395120004, 415383199, 435646355, 399944582, 364242808, 329294842, 294346913, 280627045, 421293272, 397924306, 374555302, 302940658, 323957679, 364755394, 312921502, 313192866, 313464268, 381279545, 356463175, 435857433, 422620027, 408417735, 394215405, 383872730, 373530093, 285994370, 352844742, 413905652, 320580467, 383571223, 353930276, 447798228]
247661D47798228o0518143M5622293m7009334j4202330j4202329M4024173j10361922J23147029
247669D14297665j54747945J32796164k1589912p9484725P4901369J4594305J07225969j26282981
247677C61709909l3651355J1699574J1699573N9945233l2686432J15668941l8717115m8366270
247685D07302058m8366308R2511054j23629471N0054857N0054856m9331155M3300472j4594305
247693D07302058j4594342O2598742l0032921o0910118o0910137O7272509k5359098L6395294
247701C81761987L6395332o4920564Q9465531o4920564o4920545M070733J58456808r2420587
247709C82968131O1965509q473116q473153q473154q473153M1099299j13286834J4081681
247717C52935210J4081719J5046604p7585042J21187059l3199056J36143214j41751779r5435909
$$ y = [447798228, 387280085, 432902378, 385893044, 371690714, 357488385, 401512558, 291150636, 414297665, 259549720, 392345884, 370755972, 291271247, 366172616, 380766921, 487992890, 361709909, 328058554, 339758128, 351457701, 411402934, 378716502, 494385443, 455668328, 407302058, 358935750, 451446804, 327817333, 377872190, 427927046, 378595891, 421896363, 407302058, 392707716, 455306458, 425273537, 364363419, 303453282, 370725791, 345366693, 381761987, 418157319, 353236755, 442702286, 377781722, 312861177, 316931910, 475388718, 382968131, 444933640, 436460524, 427987371, 419514217, 411041064, 452140363, 338853529, 352935210, 367016929, 382063533, 304478491, 425665550, 392466494, 528609708, 386857929, 291422020]
247725B91422020J82459046j30172817K4213278J055353J055391L3349809L3349809m3843238
247733C92888651m3843239K472575K472613J4051538J4051538q6781859R8481432n729176
247741C88064073n729176K6112981K6112943N3130561j32132805j748912j748911R0882753
247749D42943507r4380575N005512N005474R7637177q7626190L8053776L8053737j47209533
247757B97482885J61562617l8174387l8174348L9018661L9018699j13889925P1373404l2837186
247765C85380420l2837185L3741784L3741822m3451263m3451225L3018120L3018120j718768
247773C97441825j718730p3122352J12141013r6280240Q8983088j8122270j8122270N035617
247781C96235681N035656p6017085J09246283k9701233k9701233m4657407J40605959r920519
$$ y = [291422020, 473881066, 343708249, 367921527, 368976880, 370032271, 403382080, 436731889, 392888651, 349045412, 351517987, 353990600, 368042138, 382093676, 295311817, 393793249, 388064073, 382334897, 408447878, 434560821, 487691382, 355558577, 353809665, 352060754, 442943507, 348562932, 353568444, 358573918, 456211095, 368584905, 406638681, 444692418, 297482885, 459045502, 420871115, 382696767, 421715428, 460734127, 346844202, 418217606, 385380420, 352543235, 386285019, 420026841, 376575578, 333124353, 366142473, 399160593, 397441825, 395723095, 322600743, 434741756, 338461516, 427444604, 409322334, 391200064, 396235681, 401271337, 325254252, 434500535, 404799302, 375098069, 330440662, 471046621, 461126102]
247789D61126102r920519r5797798r5797760N4728661N4728661o4603927J20659363q7761854
247797C37360929R7501438m6270580m6270617L0922468L0922430L8400517j46862774J07874256
247805D03578067p7389035M7084749M7084749j0810065j0810028j7021684j7021646P5609981
247813D40305088j09653348J15171446p0091883k3776069k3776069N9930142N9930180j52350747
247821B95688740L2912581j0508520j0508481J05281032p9982258k653510k653510L2083378
247829C59659452L2083378J2785070J2785107l3530744l3530706K4605291K4605291p9605374
247837C19856765J05658031o3201834o3201796K412289J87675579j89846647J18925543p0197441
247845C48080489J15065888k5811397k5811436o0548323o0548267M7280717M7280736k9912311
$$ y = [461126102, 451205583, 355407785, 259610025, 314338686, 369067347, 304463420, 425122783, 337360929, 434862367, 388591787, 342321170, 373243638, 404166068, 442566585, 295703811, 403578067, 326189032, 373273781, 420358530, 409548465, 398738437, 381716753, 364695107, 440305088, 330651740, 445823186, 375731303, 351955234, 328179165, 388109307, 448039487, 295688740, 328601321, 318092801, 307584320, 412865352, 332883094, 330229584, 327576074, 359659452, 391742830, 404527900, 417313007, 383782263, 350251557, 374856848, 399462139, 319856765, 425514796, 362312962, 299111166, 301523455, 489199034, 299352387, 418277930, 348080489, 463146377, 437334980, 411523544, 350975221, 290426954, 337707671, 384988407, 355076096]
247853C55076096k9912273L4736850L4736889L4736850L4736888j15261875j15261895J89650640
247861D23238170M387369J9825947J9825948o8946062o8946063K5374189K5374189K5374226
247869D05507913K5374189l3485510l3485473P0725117j14538212J4941046J4941084L362121
247877C53342275L362122k2690536k2690517J2046334J2046315J14568393p0694974K1936691
247885D01226103K1936690K9656000j55607292N6673541N6673579j7956425j7956426Q6254201
247893D60899971r9009165m447655m447617j6026618j6026617O7197151O7197189j83680261
247901B71656378J25091927m7627516m7627496J10618252p4645095J56451641k8811724j75478492
247909B89627875J33293697r5390732Q9872634n2934535n2934517J07241041p8022269K6188320
$$ y = [355076096, 325163823, 359900673, 394637562, 429374412, 464111300, 348849425, 233587530, 423238170, 427625539, 447451486, 467277434, 398331372, 329385309, 354759498, 380133687, 405507913, 430882102, 397396592, 363911119, 434636236, 320098024, 335039070, 349980154, 353342275, 356704397, 334013861, 311323344, 323369678, 335415993, 449984386, 379289412, 401226103, 423162793, 452818793, 297211501, 353885042, 410558621, 392602196, 374645770, 460899971, 361890806, 357443151, 352995534, 336968916, 320942299, 388139450, 455336639, 271656378, 396748305, 349120789, 301493293, 412111545, 337466450, 493918091, 465106367, 289627875, 422921572, 327530840, 417403474, 364468939, 311534422, 418775463, 340753194, 366941514]
247917C66941514K6188358m688876m688876m688877m688876k1921600k1921638K4394213K4394213
247926C79319555q412829q412829L166096L166133k7711100J57552228n4728680n4728643
247934C89209931M131019M131057O2025794j23237496l7480828l7480846P0589396P0589454
247942D02477481r7305450Q7957841m673786m673823r6340508Q8922745l708863l708900o5463312
247951C03483425J19799979l0726442l0726443k0851194k0851157O7920853O7920815j16377553
247959C39592283O8885738J38359515j70412712L8973427L8973465k6640657k6640657k9535389
247967C71555013k9535389K8359426K8359387m4551849J40711479j14025588P1237702j5604423
247975D36505758j5604461j77709865J31062325l301797l301835K7575437K7575400j33565081
$$ y = [366941514, 393129872, 388440996, 383752120, 379063243, 374374367, 352452767, 330531129, 354925342, 379319555, 370906726, 362493897, 365659993, 368826126, 341115026, 498667254, 443938574, 389209931, 393340950, 397472007, 459497801, 336260305, 298779477, 261298631, 331888027, 402477481, 305172031, 393129872, 388456086, 383782263, 287441755, 376364500, 372655637, 368946737, 303483425, 423283404, 392556962, 361830519, 340979325, 320128168, 388049021, 455969836, 339592283, 408478021, 546837536, 376424824, 415398251, 454371716, 427731059, 401090402, 371555013, 342019624, 370379050, 398738437, 354186588, 494898067, 380872479, 452110181, 436505758, 420901297, 243191432, 374253757, 370951960, 367650125, 395225562, 422800962, 289235881]
247983B89235881N1698210R8014099q7249268J3131849J3131886p9499797P4886298n1517313
247991C21831845M1114351p131308Q5500357n2964717n2964678q59365q59365P3438913P3438951
248000D80544984j27262995K7123100N2029937m0601766n9899999R4486134o7619308K5012357
248008C83812444K3082511j31303546M1054046M1054008Q3510224r121441l331978l331940
248016D25424328L7194373n5437291k125796r4757479J21383046l3003068m1687261N0944403
248024D07935255j0810028j0810065q397739q397776P8444425p5941669r362662r362699J23795353
248033D77092395j54099639Q8817243j27323300J44782193p1358351j3463537j3463575M2501430
248041C73484859j11884683K07380935p0514038r1742137J24398387m1566650m1566651J2468509
$$ y = [289235881, 340934091, 438948190, 351698922, 364830771, 377962657, 298462860, 373349158, 321831845, 362946196, 355814888, 441315245, 388350528, 335385850, 334526485, 333667120, 407106033, 480544984, 353281989, 380405089, 432435026, 391833260, 331933261, 426419395, 358800087, 383812444, 406894955, 275591409, 316645455, 357699463, 441209687, 432088246, 428756268, 425424328, 462618701, 407181410, 405055614, 310298135, 431681181, 398678113, 356990852, 407935255, 397125227, 386315162, 377917423, 369519647, 447964072, 372022403, 362659741, 353297042, 477092395, 322992756, 411809999, 284486699, 429268892, 357910541, 344447004, 330983429, 373484859, 261600176, 468981111, 398467073, 306724936, 431123323, 389556673, 347990022, 360458531]
248049C60458531J2468471L8988517n3643146N0567480m2064184o362372o362410o4257168
248057B89793719K8374459K8374478K8374478L4163978L4163941m0134338m0134376J5830593
248065C78806932J08462294k7349269k7349268p9454544J3177082O8177165k4454538j2875574
248073C97140280j2875537k0594883k0594845L5370085L5370122r1998468O2387665k4454499
248081C59749920k4454538q231894q231932P8610269p5775824J5890916J5890916R8873427
248089D52321260n5512669o2508275L0123389J4684772J4684772K11078K11078n1894235M0737429
248098C83058599m975331m975331O2568599l0063103o8659607Q5726525n9010491n9010434
248106C04659426R2239633l91976q7234176O7151917L8204530n4427135N3643147N3643146
$$ y = [360458531, 372927002, 411915519, 358272373, 408839853, 366775669, 360413297, 354050887, 289793719, 318168178, 346542656, 374917134, 409081112, 443245053, 403110715, 362976339, 378806932, 487269226, 459919957, 432570689, 353116145, 366293227, 434470392, 410015854, 397140280, 384264743, 363669860, 343075015, 378445100, 413815222, 321816754, 384204419, 359749920, 335295382, 327063488, 318831556, 397441825, 321666001, 337556917, 353447833, 452321260, 396808591, 334300316, 364423705, 379108477, 393793249, 394004327, 394215405, 342321170, 383058599, 378083268, 373107937, 435676536, 405613433, 336953826, 422680351, 363669860, 304659426, 396899059, 396507083, 309272907, 376424824, 414629354, 360202219, 413845366, 467488512]
248114D67488512m3843238m3843276o1211664L1420001R3174432r2088936k8404621O4227043
248122C86918253n2286248M0345453n970397n970397J0433105J0433142J0433105J0433143
248130D04769159m1491274m1491274L5701774L5701811k0263194k0263157q684231q684232
248138C35295382j3991213J71272077j56798383K8464945Q9254453r6008876l8114062J47149266
248146D66523589m9105024m9105062p6122567J09140687j37877015J70895173r5420875Q9842453
248154D28771359j0267261j0267298o2372574L0259053M3767861j41495449M5697651M5697707
248162C69791049L8159296L8159296o9910986o9910947K5615410K5615448K5615410K5615448
248170D08749424l8551309l8551309J9343505J9343505q5832045R9431283n6884657L5747008
$$ y = [467488512, 423645274, 379801998, 318590334, 350010335, 443184767, 351095831, 322691210, 386918253, 334632005, 374977458, 369007061, 363036664, 373469769, 383902911, 394336016, 404769159, 363277885, 321786611, 357488385, 393190196, 372927002, 352663845, 343979614, 335295382, 321304169, 492576246, 335777863, 364242808, 453497261, 357488385, 319374323, 466523589, 417418565, 368313503, 292190936, 401331623, 263454608, 434349781, 338928906, 428771359, 418504098, 408236800, 345864226, 376123279, 419891140, 278395691, 324093342, 369791049, 407950345, 446109641, 376198655, 306287708, 331903118, 357518566, 383133976, 408749424, 370198115, 331646806, 350990311, 370333816, 284501771, 383933054, 327048397, 362795405]
248178C62795405L271691L271654R061116R061154M5727851M5727812o2342431o2342430M0420792
248187C94652614M0420831j35193362N0069928l0017831O2613795K7876945o4754719k26131
248195C45442070k26169R8194996q7068332j6629671j6629671J51265195j57506976j4217382
248203C02624060P8414263r1410448R3852880m568265Q8063398o0533233o0533233j251340
248211C44658082j251378M5064435M5064473l1163689l1163651R362661q3268983J34680776
248219D31982726n0582571r6898384Q8364944J8891168J11522870j25845772l3214146N6583112
248227D00803947l6048553L3425186L3425224j18066159O7197133n2452093J32811274j51717513
248235C09378446L3545777J22317845o2945522k26131k26168j1805094j1805131J0026077
$$ y = [362795405, 366067096, 369338750, 378399866, 387461020, 433188871, 478916683, 416574252, 354231822, 394652614, 435073445, 299880083, 349950011, 319932180, 382545975, 410422920, 345668201, 345442070, 345215901, 443410897, 356342565, 339712894, 323083223, 474348418, 316841442, 302624060, 381038323, 289627875, 383480755, 378912490, 466975888, 406442655, 345909422, 344658082, 343406704, 388471139, 433535612, 402371923, 371208272, 380570933, 297301950, 431982726, 381400155, 284501771, 372866715, 391757883, 503280753, 377434981, 344220835, 400803947, 364755394, 398180580, 431605804, 313539645, 380736778, 328284685, 461095959, 309378446, 342924223, 465242068, 402296546, 402070415, 401844247, 390039153, 378234022, 388260099]
248243C88260099J0026039n5588045n5588027J94324464j14447782J2920808J2920770R543597
248251D02371923R543596m8351179m8351198J04105088q1158260k3263426O9368199m6240436
248259C38024307M6391190j23433483O1829807J52531663j56240526Q6917541Q6917579j75538778
248267C17399300R724474n714085n714067J74724647j34047561L9636842L9636805k6444632
248275D09201723k6444670J9871182J9871181k7409555k7409555r1093831R4169497J6976412
248283C87732384p5655195N9432590N9432647J1186950q1444715P4871227j10392065K3972057
248291C49135880K3972057r7606996Q7656333N8708908l3922719j20764883O4498407L2053197
248299C63730184L2053198k683653k683654r438076r438039j5227539j5227538Q7023098n608565
$$ y = [388260099, 398286138, 342698093, 287110066, 481434530, 366986748, 379907556, 392828326, 402371923, 411915519, 363564340, 315213142, 419318230, 338159970, 314896544, 384264743, 338024307, 384415497, 260982014, 322811821, 475343484, 319102958, 406020499, 492938078, 317399300, 327123774, 321409689, 315695622, 490420269, 356372708, 396009550, 435646355, 409201723, 382757053, 402628235, 422499416, 395089861, 367680306, 276586475, 370755972, 387732384, 312077189, 371509779, 430942426, 442129376, 360684661, 435555888, 325163823, 349135880, 373107937, 275500941, 363157274, 421866182, 387943463, 267178580, 331676987, 363730184, 395783382, 393099729, 390416075, 380977999, 371539960, 356312421, 341084883, 428107981, 422499416]
248308D22499416j09819155P5444136J4654629p7977073L2023054L2023054k1650235k1650236
248316C45547590K4665615K4665578J507690J507652J507690J507690k0082260k0082259P8338867
248325D39083853j06924423Q7023099n608566J80935J80935p2187573J13075756r5345499
248333C59478517Q9917868p2187573p2187554J18865237K6233554j59120185J49652003q7716657
248341C52935210M915045J5529046p7102561J29388810L6757164r317466j94580738R4893142
248349C53417652K261535n457774n457811J62437092j46335098O362411O362372j2935861
248357C60654518j2935861j356898j356936j2935861j2935861Q2108092j03155236J86318681
248365D84404638j22453508q5786811R9476517q7716639M915026J19588920o5674409N5904644
$$ y = [422499416, 312680261, 388124397, 402779026, 324801953, 356825007, 388848061, 367197826, 345547590, 370213205, 394878783, 396386473, 397894125, 399401815, 400909505, 380827245, 360744986, 439083853, 332159430, 419182529, 413573963, 413754898, 413935833, 341748260, 454824016, 359478517, 449396385, 377208812, 305021258, 423886495, 450120049, 290999864, 440651867, 352935210, 357850255, 373379301, 296276740, 425665550, 462422714, 453105248, 258524510, 353417652, 355679187, 350221413, 344763602, 507200694, 360865596, 367228007, 373590379, 360654518, 347718657, 346361759, 345004823, 332068962, 319133101, 401241193, 298085957, 484404638, 361951130, 276164319, 375640836, 287924197, 292839223, 412428143, 346753734, 402658378]
248373D02658378N5904681j57341150K7922179J6343216p6288449J04150303J1518638N7834490
248381D42702286N7834490n6990178n6990177J4413370J4413408j1277418j03909081J48898140
248389D49094840l6365151j32856470J75915720n5663423L6968205n1803768M0827896O091008
248397D32208857O091008j18382776O6880554r5224850R0038440j8544426j8544426o965464
248405C37556917o965464K0052079K0052116Q3736355q895272j28785756N6477572M4898629
248413D18127176m7733074m311953m311954j0101416j0101454J1367885J1367884J1367885
248421C75670979J1367885n5211123n5211104N2859140N2859120O302086O302124O302086
248429D01241193O302086P267010P266971l9048804l9048842L6968242L6968242n1803806
$$ y = [402658378, 458563059, 301221909, 329144088, 345487304, 269198855, 373349158, 384867796, 442702286, 500536776, 443546598, 386556421, 400969791, 415383199, 404105781, 300196700, 449094840, 412729689, 279873219, 455788939, 400125516, 437093721, 385289953, 426117849, 432208857, 438299865, 319917089, 386797643, 291572793, 381611233, 363066807, 344522381, 337556917, 330591453, 350643532, 370695648, 454432003, 445536731, 316750975, 373228547, 418127176, 370394102, 366082149, 361770195, 351668779, 341567325, 352935210, 364303094, 375670979, 387038864, 331827741, 276616637, 329475777, 382334897, 388636983, 394939107, 401241193, 407543279, 414810289, 422077260, 383028456, 343979614, 380947856, 417916098, 366112292]
248437C66112292n1803749Q6178805r9084504N7231399N7231398l4435343N8196322j67593320
248445B72033300J41178831R950662R950663p4961694J10301635n4155732n4155770J5318006
248453C75459901J5318006p9243485J06019806l8717115N3914511o8146984J17116345n8497867
248461D23223118n8497867k3760979k3760998O3081204k9550479Q1263780j03999549R8632243
248469D26630473q6631124K8193543K8193581J2754926j72508365P1132202P1132163K4816369
248477D03713768K4816370p8429373J06833994m9481947M3149717m5019239m5019239P086074
248485C67650125P086112j1247274j1247274Q7173853r8089438O2086119l0545508j598157
248493C71268558j598119J11296701p3966627r9054361o422697K1936691K1936690L9305116
$$ y = [366112292, 314308543, 400487348, 301402844, 358634243, 415865641, 381430298, 439626620, 272033300, 413212131, 423162793, 433113456, 358151762, 468453397, 414297665, 360141895, 375459901, 390777907, 311534422, 417554228, 378837113, 432751624, 364604640, 481720985, 423223118, 364725251, 340964272, 317203274, 380284478, 350733999, 431997779, 327998230, 426630473, 339999349, 368192892, 396386473, 409141399, 236633034, 307765236, 378897399, 403713768, 428530138, 350100765, 456934759, 407452812, 450602529, 405583290, 360564051, 367650125, 374736237, 363488963, 352241689, 439415542, 341326104, 403412223, 372866715, 371268558, 369670439, 480967140, 407000513, 307946152, 301523455, 323460146, 345396836, 384701952]
248501C84701952L9305154q9028322R6235007p975621p975582P08611P08573P08612P08611
248510D18096995J4217420J4217382j36309058M8954271M1054027M1054027k4560058k4560057
248518C92164949m7717945m7717964J10527784J10527766k11270732R7501456k9867077k9867078
248526C44281159K2238237K2238236K2238236K2238198k3519757k3519758k3519757k3519758
248534C39155036L2445211L2445210N9462790j25800576J1458352J1458352N7774165j27489125
248542B90909415K7861854K7861855J6282891J6282930M1129442M1129403l6063643l6063605
248550C89330542m221486m221524n0537300J34725991j54024262L1239066J58607581j50164609
248558C50733999L7028567L7028528n9462790n9462752O1271987O1271988m6798294m6798293
$$ y = [384701952, 424007106, 334978784, 431213791, 423238170, 415262588, 415971199, 416679772, 417388384, 418096995, 432314415, 446531797, 310222739, 359177010, 400231037, 441285064, 416725006, 392164949, 344447004, 296729040, 407256824, 517784590, 306513858, 404015314, 374148237, 344281159, 366519396, 388757632, 410995868, 433234066, 409714309, 386194551, 362674794, 339155036, 371600247, 404045457, 463508247, 337707671, 349166023, 360624375, 418398540, 290909415, 318771269, 346633124, 362916015, 379198945, 420328387, 461457790, 425394147, 389330542, 385109056, 380887532, 330350232, 465076223, 311051961, 342291027, 500898608, 350733999, 387762566, 424791094, 365328304, 305865552, 367137539, 428409527, 381611233, 334812940]
248566C34812940L6184254L6184216m1008794m1008793J4473694J4473694O0789507O0789545
248574D75690263p6228124p6228162J2543886J2543848J76337913j32434351j6644761j6644762
248582C58935750J08793983p6469383j8574570j8574569M5350928M5350890n1140390n1140391
248590C42532248p1403566J13859725l6666696l6666678K6414470K6414526M5712760M5712760
248598D55909549j61743552J47028637j30866356N4396973L015342L015379K6173268K6173267
248606D23102507j16633883O8629445O8629426j16633864m824577m824521Q7807068r7456222
248614C07795379N8859680N8859737R64885R64923o1513209o1513209M6557035M6557072K3399147
248623D20931440K3399147m8004438m8004438j1051249Q1580378p4735525J7896101O6141799
$$ y = [334812940, 370997194, 407181410, 366172616, 325163823, 339637517, 354111211, 414900718, 475690263, 399462139, 323233977, 335777863, 348321711, 524659624, 392225273, 375580512, 358935750, 467729733, 391260350, 372685780, 354111211, 399462139, 444813029, 393672639, 342532248, 271128682, 384988407, 348321711, 311655033, 338069503, 364484029, 410196789, 455909549, 294165997, 441194634, 310328278, 364725251, 367740593, 370755972, 396929240, 423102507, 306468624, 375098069, 443727495, 327093631, 322269054, 317444533, 405251601, 307795379, 366655059, 425514796, 426479681, 427444604, 365931395, 304418186, 350975221, 397532293, 420931440, 444330587, 396326149, 348321711, 337270462, 418850840, 344115315, 362011416, 428153215]
248631D28153215k6489903k8419674k8419712j47345254J30549701N111032R7742697n3748667
248639C77133435L8882960o9187284K3444381J3312783j41073292J25242700k9143413j9494259
248647C19118011J34891873l8792530l8792530J3312783J3312784p3529419Q0856714j0810027
248655C99567659j0810027M628552M628551n0853935M1777729j0327585j0327585r362661
248663C58920698r362700j9011778j9011798J22347969l2038144L5505785n7125878n3266224
248671C26957930L9365440K0067207p2564477J55034401o1106143N4683408r9702648L9244830
248679D01979948j15141265J26086993k8299101n623618n623656k1062235k1062235Q9902777
248687D21157608k728924n2904355n2904373J9901306J12533026n3432068n3432069L7269750
$$ y = [428153215, 401663312, 373243638, 344823926, 197478672, 328028373, 333139405, 430882102, 377133435, 416016395, 346829111, 370273492, 383586275, 242512983, 367755683, 338612270, 319118011, 454009884, 415217354, 376424824, 389737607, 403050391, 329520972, 410377686, 399567659, 388757632, 393386184, 398014735, 347160800, 388938529, 378610944, 368283359, 358920698, 349557998, 330546220, 311534422, 433882391, 401844247, 437350032, 380224154, 326957930, 366323370, 386390577, 313826100, 468860501, 407754358, 462437766, 362735118, 401979948, 286838683, 412925676, 384626575, 379002957, 373379301, 352317066, 331254831, 421157608, 418428684, 365524329, 312619956, 332521262, 445054288, 391622220, 338190151, 375459901]
248695C75459901n5361877N2708367N2708405j26283019K8103075J14945278l9440817j02160171
248703C00679142N2225925n5844339L6787289O5614122k7017580o1754430R2631626M1491274
248711D44813029n1140390k7982465O4649161j18684302R7456223j2543886j2543848k7982503
248719C56041019O4649199r5526395k894769O5086408q9299667M9647772M9647791j6931178
248727C80420180j6931217k2720717k2720659J19121548K6489866j47194481P191613K4560057
248735C48216190K4560058J21051376l3334757p2172482p2172463k5856670O6775014j7172475
248743C39893791j7172438Q7038190n593475k3926823k3926824L090719L090757J13090846
248751D75584743j03049716J8529335J8529336j3116796j3116758j3116795j3116796J7760438
$$ y = [375459901, 320098024, 372806391, 425514796, 299231777, 327334852, 442280130, 402839313, 300679142, 352905067, 297060728, 333848017, 399462139, 372444559, 310690129, 403321755, 444813029, 393672639, 365690174, 430339335, 311655033, 409111256, 396567370, 384023522, 356041019, 420690218, 325163823, 322269054, 387355462, 298055795, 347703567, 397351358, 380420180, 363488963, 340768246, 318047587, 437169135, 463659001, 316464520, 323656133, 348216190, 372776248, 493827624, 460492867, 388320385, 316147922, 290291252, 357066266, 339893791, 322721353, 409759543, 404166068, 380239245, 356312421, 359403140, 362493897, 475584743, 372535027, 391064362, 409593698, 396476902, 383360144, 370243349, 357126553, 374886991]
248759C74886991J7760438p4871207J10392084j41450234M3813057O6971021j18292308l6274722
248767B42935120J48988607L8988518n3643109j2875574j2875575Q5545590r9717738J3177082
248775C50522921J3177120J3177082J3177083r9717720Q5545571l0244000l0243980J10633304
248783D26027381p4630004k8314154O4317473K2645302o9986363j2091548j2091568N276858
248791C21153377N276877J78961242j29810984J6132137J6132138Q412867Q412829j24745167
248799B99925316O0518124J4202330J4202291n5030188J30233141k0293337k0293338k5117915
248807C98346424k5117877K1197937K1197936j5951241j5951203m372278m372240q8319710
248815B86657748R6943618p0951267K1680398Q5198811j00064518R935572R935609J9584727
$$ y = [374886991, 392647429, 317776222, 428168306, 286718072, 330531129, 397502150, 279209842, 242935120, 391923727, 430912245, 377269136, 364393562, 351517987, 437063577, 337345839, 350522921, 363700041, 376877123, 390054206, 290336486, 375882057, 345638057, 315394077, 426027381, 351397377, 323083223, 387400696, 410045998, 340059635, 327968087, 315876519, 321153377, 326430254, 505391496, 375580512, 391712649, 407844787, 416257654, 424670483, 299925316, 360443440, 374645770, 388848061, 333817873, 464051014, 443757677, 423464339, 398346424, 373228547, 394426484, 415624420, 399673179, 383721976, 379349698, 374977458, 286657748, 383601366, 312650099, 334330497, 419529308, 319464790, 329400362, 339335971, 358920698]
248823C58920698J9584726k6731125k6731125L7676854L7676853l9516194l9516232K7062814
248831C48427269K7062775j9253037j9253000M869773M869811M869773M869811j6358306j6358268
248840C23746601Q2062858j03200489J20176901K7545256l4209174l4209174j5875864P6755838
248848D42792753j20086452O5176875p3861088J8770576L331940R5963642n9387375n9387394
248856C13313477K3595115K3595172N503008N503007k86455k86455L3485511n9146154J08748711
248865D54024937p6514579p7117671J08145659n9749245L2882419L2882457L2882419j06065058
248873C41371338P9198270j02205442r573721N4110518l8521166k5977242O6654384n4924648
248881C10132291J30338641J0297442q2334261P3981718j11281611Q5560643r9702629N0823735
$$ y = [358920698, 378505424, 351774299, 325043174, 362720028, 400396881, 360880687, 321364455, 348427269, 375490044, 356237007, 336984007, 341853780, 346723591, 351593364, 356463175, 340104869, 323746601, 405809459, 302608970, 422785871, 450331127, 416121953, 381912779, 366036915, 442792753, 322706301, 387883176, 314022088, 332792664, 336124604, 432088246, 372700871, 313313477, 336908592, 360503764, 366006772, 371509779, 371223324, 370936869, 404422380, 345276226, 454024937, 377510358, 300392687, 408538346, 348789101, 381671520, 414553977, 447436396, 341371338, 420569608, 318364166, 308790445, 362900963, 324379797, 298402555, 365056939, 310132291, 440470932, 450768374, 368434113, 442415831, 331134220, 416694863, 316992234, 367815969]
248889C67815969m1807872l452588Q9179113o7136864K5494799M07103M07066q6435098R8828192
248898C83299820p1237702J14025588L6832541j48430769J01481721q3781626R9551894k09220276
248906B22521191R5209797K578114Q7490489r7772840J01964183R332519j25755324N9507967
248914C55076096n2783725L9847864O3005846k9625856q1731150J03532140p0152207K2479458
248922C49648466Q1580415j03682950k0700385J64562907p4735525p4735563L3334757L3334718
248930C88606840Q4957590j00305740L904888L904888r19689r19689J0659273J0659274j02235529
248939B98312106Q3027725O3729510j21533819J70834869j37937359K4168045K4168082l6711930
248947C68057229l6711931J13814510p1448818J7323229J7323192j48641847J60130342j77348013
$$ y = [367815969, 326008097, 322555509, 411734622, 344597758, 370092557, 370499660, 370906726, 284471628, 383299820, 312062118, 426087706, 462920247, 314489478, 415971199, 332189573, 431741467, 222521191, 317730988, 320309102, 407799591, 310026751, 411990934, 421323453, 295568129, 355076096, 302292371, 342140235, 405146081, 375520225, 293789075, 397321215, 327169008, 349648466, 431228881, 327545931, 306845546, 471408453, 396672928, 321937365, 355272122, 388606840, 473564430, 373258690, 377163578, 381068466, 380148777, 379229088, 389888361, 400547635, 298312106, 381339831, 445069341, 323535522, 494370391, 356433032, 380601077, 404769159, 368057229, 331345298, 445159808, 373710990, 391034219, 408357411, 259715564, 419845906, 242497893]
248955B42497893J31424175o9277732J15985558j20418123O4845168M9406570M9406570m2260171
248963D21609908m2260210M055680M055642n593475n593513n593475n593474J2498652J2498652
248972C90084387J2498614J2498652n0220701n0220720K6972327K6972346P206685P206685
248980C82998275J417222J417222L1329534o1302131j6916164J68347203k29920698P8851491
248988C56221954o060865o060865R377753R377752m8517043J36746286p9213323p9213342
248996B92658307M0435865M0435921J3418303J3418342p9213361J06050006j17327404O7935886
249004C77811865L3199056n9432609m7853647M4777981P1795559j13467730J70970531j37801657
249012C39999349K4303745K4303746j1398028j1398028j1398065j1398028K110743K110743
$$ y = [242497893, 373922068, 304644336, 420629894, 300211771, 365056939, 414463509, 463870079, 421609908, 379349698, 383405378, 387461020, 381867545, 376274032, 370680557, 365087083, 377585735, 390084387, 402583001, 415081653, 364860952, 314640232, 341612559, 368584905, 375791590, 382998275, 384415497, 385832719, 417162253, 355860122, 338943958, 507291161, 277370463, 356221954, 350161089, 344100224, 353477977, 362855729, 314338686, 451084972, 371871649, 292658307, 333094172, 373530093, 386948396, 400366738, 321153377, 427203383, 309875979, 377811865, 411010921, 351578312, 303724665, 348502646, 420298205, 306830475, 477801006, 339999349, 364303094, 388606840, 377208812, 365810784, 354412719, 343014691, 345125434, 347236177]
249020C47236177P900243J00531908j46485870L8777421m6134898M6496730Q3585600j01677727
249028C30229584J12533026p2730339l3168875l3168893P2971542j9660103O9111907j16151403
249036C09966446R2269814l61870q8168900R7094353j2905718j2905718Q443010Q442973O0548324
249045D62422714j24715043M8969361m3662341M8969361m3662341L5460552L5460590m9451804
249053C69791049M3179861r5767636K13004591j67171201J8092089q563583q563621Q804842
249061C72806391Q804842r528506Q3103121j50405811L4857480J2423237J2423275Q7686477
249069D52170506r7576853l980264Q8651399q5032966P598697Q4927409j00335882N0190558
249077C96612604m2441107O7559021j17704326P9137927j3493680N804553N804553J5052J5091
$$ y = [347236177, 355136420, 455668328, 309182458, 347959879, 301824981, 348321711, 431907311, 330229584, 442762610, 370032271, 336863396, 303694503, 376666045, 357005942, 426117849, 309966446, 402236260, 401874390, 313705490, 410799843, 397894125, 384988407, 393431417, 401874390, 462422714, 337707671, 386677032, 343014691, 391984052, 348321711, 383782263, 419242853, 369791049, 412970910, 317203274, 530207865, 363036664, 381128753, 372565170, 364001549, 372806391, 381611233, 372082727, 455185848, 304780037, 339637517, 352060754, 364484029, 452170506, 354593653, 350613389, 439264788, 354231822, 361830519, 446757928, 346422046, 396612604, 354171497, 421730518, 304026192, 383164119, 369670439, 375474992, 381279545, 381294597, 381309688]
249086C81309688K909822K909821K909822K909822L151043L151043r5270103Q9993226m568265
249095C89405919Q8063399j33866627N1396703L2339690L2339652j49064003L6199326Q0585311
249103D27399370j04678017P4795849j7835815r3656855R1606436o814709o814710j08130549
249111B55871000P7132742k1288404P1343261o9534044J15729246j37077955J71694233j87253442
249119B76616637J21518747m4446329m4446292J45460642l9802687m3662303m3662341J7127242
249127C44703316J7127203J1337704J1337742L4978109n7653555J04451849q0811480m8969361
249135C36501527M3662341M3662303M3662341j66749045J11145909M1672209j12713924k6836664
249143C14006997k6836626J66145955j11749001k1529625k1529606R4259946o0126168N8558192
$$ y = [381309688, 384219510, 387129331, 390039153, 392948975, 396100018, 399251061, 303980958, 393974184, 389405919, 477469318, 343602691, 394999394, 427339084, 459678736, 310614733, 346814059, 427399370, 322721353, 397517202, 379681387, 286024532, 377630968, 370816259, 364001549, 255871000, 333003742, 311715338, 383058599, 313524555, 429253801, 292175846, 463870079, 276616637, 398135384, 353689055, 309242763, 454703405, 414900718, 371238415, 327576074, 344703316, 361830519, 373168223, 384505965, 419484074, 361830519, 466282368, 385470888, 336501527, 380163868, 423826171, 467488512, 300739467, 411885376, 453557585, 340843661, 314006997, 287170371, 453316326, 341567325, 320037700, 298508094, 392768040, 332641872, 391200064]
249151C91200064N8558153p055931r9687595J0614039J0614078J8333348J8333349j04210627
249159B96698878J11929935n5964968L6666697k8464946O4166719j6885982P5745681j73201885
249167C10690129J04693070q6359760O8026411J3358017J3358018L4586096n8045568l4887642
249175C65418771N7744022j08221016J07919471j27036807Q9103680k4756045k4756083J16121278
249183D51537271K3489615r0370168K261535N2195781m0435921l4646383l4646421Q5967708
249191D15353017o663918l1751689l1751652R980806R980843R980805R980844r317466r317428
249200C66474162Q7173853o7212204n5271448R9114686k2464405j15096031K1921619K1921619
249208C36561851J6132138J6132137p025788p025750L3500563j20885512O2447970O2447988
$$ y = [391200064, 449758217, 442702286, 343014691, 353628730, 364242808, 382576156, 400909505, 296698878, 408628813, 352663845, 389330542, 360865596, 425032315, 408146333, 483892014, 310690129, 415383199, 329023439, 397049850, 410407867, 423765885, 458351981, 400306413, 365418771, 423162793, 314941777, 422861248, 295824441, 384928121, 360172076, 335415993, 451537271, 475026886, 384656718, 386918253, 439114034, 398678113, 364031730, 329385309, 415353017, 408689099, 376937410, 345185758, 355166564, 365147407, 375128212, 385109056, 375791590, 366474162, 453648015, 386435811, 331164363, 430279049, 407814644, 292718613, 314640232, 336561851, 352693989, 368826126, 361800338, 354774588, 388275151, 267389639, 329837609, 392285597]
249216C92285597l0183713l0183676M4174927m8456737R438039R438076k11078R2420586j29509420
249225C09212601K4876637O2267054l0364611L1389858L1389820k1680379k1680417k7469879
249233C57940684k7469841Q5334512p297190n1683158J02702975M22119j53963920J41299461
249241D47285642p4841083k7319125k7319069R8119600n6266513m2757685M9873902j1880470
249249C54895199j1880508Q925453Q925452P4539538j8092127o1513209J54627354j46425603
249257C64001549P960530Q6600980o7785152k3399146O9232517k9188609k9188647l4978110
249265C43255912N7653593K7288944o5342720p447944p447906K201210K201211P7464449j38676113
249274B91150636L6938061L6938099k8676023O3955640K2464405K2464367r9114685N5271447
$$ y = [392285597, 362101884, 331918208, 376093135, 327636398, 337074437, 346512513, 346301435, 438722021, 309212601, 334089238, 396356292, 365991681, 397381539, 428771359, 407090980, 385410563, 357940684, 330470843, 415805355, 408508165, 356825007, 459527982, 459950101, 305986181, 447285642, 372444559, 345125434, 317806365, 415925965, 359659452, 316901767, 366775669, 354895199, 343014691, 351940144, 360865596, 435405134, 417313007, 355799798, 510427152, 364001549, 371962079, 458563059, 390777907, 367378761, 436611278, 407422669, 378234022, 343255912, 400909505, 428198449, 362855729, 355407785, 347959879, 350161089, 352362300, 429826749, 291150636, 328088697, 365026796, 336350773, 400306413, 422770818, 445235185, 346120500, 401391947]
249282D01391947p9997349J2634354n2979751J01406307P2458975j43681587M3511511M3511588
249290C98255995j15940344L8445751J44586186j33308769N5814176r8571880N9673830l2957815
249298C15997130Q7927716o6458396J4594304J07225969j13739133k1107469N6085579l6546086
249306C43979614M0646961n1984703j5317949j5318007P6348716p8037321M3541692m9089953
249314B94769050J58909146j18985867M1189728M1189728r9687576N4698518L7330074j17056020
249322B92356781J55531914j22363040K4303745K4303746L8777440L8777477m6134916M6496748
249330D52049895j23358144R2782456k8796635k8796634N9975376l2656250l2656289l2656288
249338C25887487M1883249n0748359N3462193l9169453O7935944O7935906r2239690L92013
$$ y = [401391947, 321394598, 334028952, 281049201, 382455508, 454914483, 311232896, 354744407, 398255995, 282315651, 320761402, 465347588, 332038819, 387852995, 289281115, 348954945, 315997130, 403924846, 337466450, 352060754, 459286723, 345547590, 324440121, 380525700, 343979614, 384626575, 332641872, 317323923, 302005916, 378354632, 300317311, 343859003, 294769050, 453678196, 334692329, 375882057, 417071785, 317384209, 372082727, 409412801, 292356781, 447888695, 325525655, 349829400, 374133146, 412910586, 451688063, 405553147, 452049895, 328691751, 421474207, 392677572, 363880938, 423856314, 391200064, 358543775, 325887487, 367770736, 317022377, 370484570, 331315117, 399251061, 467186967, 374947277, 375339290]
249346C75339290k8676023O3955679q6570838O060865M4657407m7974294N0446869N0446870
249354D27685825k0233013j12864678J55381161j22513832J18714502j59180528P2398651
249361C59388088k0233052P7373983j5257682m0345454m0345416k9731376O2900250l5520838
249369C18228503N7110787q7867392M764272J01255534Q623945q8832315J27308209p3393717
249377C67197826Q0992415j48536308O7604217l4676564l4676564j3448466J40937591k3097601
249385D02296546k3097601o1694125o1694125J64095535R709441p6167838p6167818N3130504
249393C30410519N3130522p523283p523321j733820j733821j0418052Q2213612L7827607j47435721
249402C27214242J51687389j57084877p68897R1862729l6470709l6470671J5634604J5634605
$$ y = [375339290, 346663267, 410618946, 324048108, 330108973, 374766380, 326792086, 377238955, 427685825, 407452812, 294588134, 449969295, 327455463, 446169965, 286989437, 359388088, 339155036, 416529019, 401271337, 360925883, 320580467, 290849091, 353749341, 318228503, 375339290, 287471898, 292236170, 393491704, 402115649, 313283334, 440591543, 367197826, 448190241, 299653933, 367258150, 332581586, 297905022, 284456556, 425394147, 402296546, 379198945, 317504820, 255810695, 419906230, 429615671, 353447833, 277280015, 330410519, 383541041, 376017758, 368494437, 366760617, 365026796, 354608744, 436822356, 474649963, 327214242, 478901631, 321816754, 321047857, 412910586, 376439877, 339969206, 355603810, 371238415]
249410C71238415M055642M055641M055680M055642j2347898j2347861j2347860j2347898r211908
249419C28857595r211870r211908r211908M0963560M0963597n352253n352254k4288693k4288655
249428C23867211N2904354N2904393l1043041l1043078K1062235K1062235m2380782N0250882
249436D17584409r4486133R0777233j08959790P6303501j6328125j6328163j1382937j1382976
249444C25797019R2827690r2435677L1073222L1073222J9494258J9494259j8137360j8137361
249452C91049272j8137323j8137361k8751400k8751381k2961920O9669727J37017669j71754520
249460C09242763J11929898p3333393J9298271J9298272P719270P719309l4254408l4254408
249468C33365574O271943O271905M1973754n0657948M7763179j37500093J66326908j8936439
$$ y = [371238415, 375294057, 379349698, 383405378, 387461020, 375113122, 362765261, 350417401, 338069503, 328857595, 319645725, 310433817, 301221909, 342185469, 383149066, 377796813, 372444559, 348155866, 323867211, 376771565, 429675958, 398632917, 367589839, 388652074, 409714309, 367333527, 417584409, 323098276, 413875509, 304915719, 381219220, 364891095, 348562932, 337179995, 325797019, 418624709, 326189032, 357262254, 388335476, 407829734, 427323993, 409186633, 391049272, 372911949, 354774588, 326023188, 297271807, 274309887, 343979614, 480997283, 309242763, 421172661, 347839268, 367137539, 386435811, 394155081, 401874390, 367619982, 333365574, 339637517, 345909422, 387883176, 337225228, 384988407, 247488314, 413815222, 394878783]
249476C94878783l497822l497785j2182054j2182016P116218P116255j32796164J75976025
249484D20931440r0339987K291641j0252170Q2379456n2708405n2708347R6476209q8787063
249492C07282774N5949877N5949878n804553r8436199J29283252n5980021K2901614o9730051
249500C41416571k3414218O9217446p5519532J09743796q7098513R8164852p5519550J7112151
249508C74103003j7624737j7624737o6835320K5796364J12638528p2624820J00335921q4927447
249516C53236755J9283181J9283181p9137927J06125363j08085352P7177975K1182846p1448819
249524C37617203J36972474m8290893o799619r9431322J16709279o8554049O709152q5922494
249532B89009731O2674101O2674119l0922430l0922467l0922430l0922449N9598434N9598492
$$ y = [394878783, 391380961, 387883176, 375701122, 363519106, 370635324, 377751579, 244955415, 420931440, 330591453, 332883094, 322630924, 405010380, 352301975, 299593628, 396069837, 307282774, 363232651, 419182529, 413377976, 314941777, 444225029, 388245008, 411146622, 341416571, 318002353, 387219799, 311700267, 421444063, 334345550, 432510402, 356990852, 374103003, 356478266, 338853529, 272018209, 297814573, 410453101, 337828281, 438164202, 353236755, 372519936, 391803117, 312665190, 418790553, 310705201, 387883176, 409066022, 337617203, 474589677, 426298784, 419499165, 320067843, 436777122, 368223073, 374932225, 289009731, 351683832, 414357951, 383435521, 352513054, 321590624, 290668175, 350266609, 409865101]
249540D09865101j02506950Q2756379j37243819J71528370q8998141R6265150q5379746P251957
249548C53538301J3041381J3041419l7134087l7134067J11462527J8830881j46892936J61879254
249556D50632673j33384165N1879164R3370418r1892909j6629671P6001993j24699933O0563358
249564C65840928O6352876j18910470K3896661K3896680J2317717J2317717L090719L090756
249572C91893584L090719L090757j3312784j3312783n3839115L8792473k2720679J62542650
249580D96224822j57808540o5176857K4560058K4560038L0349558L0349520n427631n427630
249588C72203338n427669n427630o03053o03091o03054o03091k1589911k1589930N5603116
249597C71359025N5603136o151332o151332j10361922P4901370J8453959J8453958j6282891
$$ y = [409865101, 307358151, 390114530, 252870711, 424399081, 335400940, 431666090, 346286344, 353538301, 366579682, 379621101, 342487014, 305352947, 416815474, 435646355, 288753419, 450632673, 317248508, 369127672, 462498090, 370605181, 353975510, 429977503, 305277570, 365840928, 432193804, 313283334, 337179995, 361076675, 373394392, 385712109, 388802828, 391893584, 394984303, 398075060, 384762276, 371449493, 317610378, 356402851, 333682172, 496224822, 338416282, 273239425, 297799483, 322359521, 352709079, 383058599, 377630968, 372203338, 366775669, 361348039, 360744986, 360141895, 359538841, 358935750, 337345839, 315755909, 371359025, 426962161, 420810829, 414659497, 304297575, 379198945, 397652904, 416106862, 399823971]
249605C99823971j6282930j4353083j4353083n4879415L7752211n2225905J33037385o3804887
249613C54714264K8826777q804804q804842M3300471M3300472n3628056n3628056j3101706
249621C32174520j3101743M6722917m5908748J10407155p4856135O437787O437750n141176
249629C63172327n141175K3806212K3806250n3386872n3386797N5648332N5648331K0911482
249637D31078090K0911481r7772840Q7490489j26720209N8543082Q6043123o588579j30097439
249645C22887198N5165927K1393923p1237740J7534270J10165971p5685395p5685357L8174348
249653C42713145L8174387k7439699k7439736J8876116J8876115K0082259K0082259k6233591
249661C77691255k6233554J7187490J7187528O9292842j15970525N3130561l9501141J025209
$$ y = [399823971, 383541041, 369187958, 354834875, 299955460, 337707671, 285481766, 418519151, 354714264, 383541041, 374736237, 365931395, 409231866, 452532338, 398904282, 345276226, 332174520, 319072777, 365795694, 319886946, 430294101, 355437966, 361875753, 368313503, 363172327, 358031152, 381837364, 405643614, 352256742, 298869945, 354518277, 410166608, 431078090, 451989571, 354216731, 441707220, 314987011, 373530093, 459573216, 452984637, 322887198, 378053125, 399447048, 328209308, 345743578, 455909549, 380224154, 304538797, 342713145, 380887532, 353447833, 326008097, 344884213, 363760328, 383842587, 403924846, 377691255, 351457701, 368645191, 385832719, 455125561, 339155036, 392285597, 352784456, 353809665]
249669C53809665J025210K9972635K9972597j6343215j6343216k593186k593223O1091090
249677D37998357l1540611r8119600Q7143690q0751137J04512154l5973176l5973176K7711101
249685C75007602K7711100o2025832L0605831R4290146r0973258o8297719J16965534r7245163
249693C26038241m613462N0386546N0386545j31017090N4246199K7409555o5222071P7585022
249701C85199485j5046604J18111411j90660797Q7234158n397487j04301057Q0962234P5172772
249709D31274115j7458893n4125627L8506075M4295538m8336127r5224831R0038422j9961611
249717C69007061j9961649J7669971J7669971r2330119R2933172K0082259p2549404L7450684
249725C69971946L7450723j0794975j0794975n7110787n7110788L4857480L4857480L4857499
$$ y = [353809665, 354834875, 384807510, 414780107, 398436892, 382093676, 379500490, 376907267, 437998357, 406457746, 308338146, 395481836, 314730699, 419242853, 383269677, 347296501, 375007602, 402718702, 340692870, 371298701, 465588847, 374615589, 306317870, 423283404, 326038241, 321424779, 371811325, 422197870, 291180780, 345426979, 372836534, 307614463, 385199485, 370152881, 488264292, 297603495, 384837653, 379440166, 275139109, 356101343, 431274115, 413815222, 359689595, 398195670, 442491208, 394155081, 298930250, 388968672, 369007061, 349045412, 366715383, 384385354, 292055235, 384988407, 405070666, 332521262, 369971946, 407422669, 396627694, 385832719, 328721932, 271611144, 306468624, 341326104, 376183603]
249733C76183603L4857461k5932008k5932046N1261001N1261001m6677683m6677645L0515364
249741C98859048L0515364l1239028l1239066J5076747J5076785j8649984j8649946K7665866
249749C87415786K7665867k3474524k3474523J38630879j70141348J53587054l1676275j18518477
249757C40014439k5886793r4395666K14376542r8255282Q7008008p4916460J7715205J1925742
249765C77585735J1925704J05522329p9741037p3951537J8680090j1955885j1955848R8044205
249773D34153756q7219087M0149429M0149428k7394502k7394465O5342720q9043412j1850327
249781C36893540j1850366Q2711184p1674988J07798917m6587215n6236371L6395332K0956715
249789C98406748K0956715l6938098l6938061k201211R0430454j01346039N3040055k2223145
$$ y = [376183603, 411041064, 385109056, 359177010, 410438011, 461699012, 415021329, 368343684, 398859048, 429374412, 398135384, 366896318, 381973065, 397049850, 378399866, 359749920, 387415786, 415081653, 391607129, 368132606, 506763485, 336622137, 490209191, 458532916, 340014439, 314127646, 219731980, 434108522, 335853240, 422861248, 347944788, 365659993, 377585735, 389511439, 495033768, 415292731, 341341194, 360021284, 348065399, 336109551, 434153756, 346934669, 387084098, 427233526, 399839024, 372444559, 437787279, 348743867, 336893540, 325043174, 407754358, 336079370, 443878287, 397291072, 341054701, 377450033, 398406748, 419363463, 382425365, 345487304, 343286093, 433716547, 332370508, 385410563, 363187418]
249797C63187418k2223146k3188050O9443577q6872345O7513749J06833994j71060999M1219871
249805C44854069n1411774Q0781319j1850328j1850365j1850327J1684483J1684521n683943
249813C56357655n683942J54491614j23403340j3403251j3403251P342386P342387P342386
249821C76982644P342386l0289196l0289233J31816169q4324355K3082511o9549116m0601728
249829B84170082J13784367k9022803k9022765O1679054r2707023O6744833k5886812p0272798
249837B79466135Q4113296q518388q518387J0779884J0779884n7894757R6491300m2456159
249845C64242808N0175468l7631620l7631620k2192983k2193003k6776339J27609774j05899214
249853B89703271M8486880J21820274r4320251m4144784J10241311q5455123P176542J19106477
$$ y = [363187418, 340964272, 317776222, 387219799, 300347454, 367861203, 474695197, 303634198, 344854069, 293442295, 374223614, 362373286, 350522921, 338672594, 350357077, 362041598, 356357655, 350673713, 505165327, 381761987, 368358736, 354955485, 362297871, 369640258, 376982644, 384325030, 354035834, 323746601, 455562770, 371238415, 394320926, 324771810, 284170082, 397954449, 368931646, 339908881, 401587935, 308880912, 375625745, 349738933, 279466135, 363579431, 355061043, 346542656, 357322540, 368102424, 310207667, 406698967, 364242808, 414418276, 376786656, 339155036, 316962053, 294769050, 267992711, 395602485, 289703271, 338190151, 460010425, 365690174, 321545390, 431786701, 346331578, 353508120, 472614597]
249861D72614597l5279617M22118j53963919J18141535l6244540j1398066j1398028n9643668
249869B83250412J56496819l9380493N3251133j14643732k2012086K0233032K0233013K6022476
249877C83450574K6022514o0819689o0819650j2574029K03566496l4525773l4525810l648576
249885D06126057l648576j30052187J47842768j4262616j4262616M4536759m8094905P7343839
249893D65528523p7042294J15940344j00200181p5112485P9273647j0704507j0704507N1049960
249901D38028500m1581741j6493969j6494008o6669437J49471050m9934246m9934247R890338
249909C56282240R890376l2565821l2565802P5504442P5504460n9100920n9100958K9671089
249917C63519106K9671090q4188673J01074656K3881589j61381720O3322425O3322407P8761061
$$ y = [472614597, 437334980, 437757098, 283793179, 401934714, 365690174, 354292108, 342894080, 283250412, 439747231, 400366738, 453617871, 338974139, 316962053, 337195085, 357428098, 383450574, 409473088, 348653399, 287833749, 275259720, 478826216, 444300443, 409774633, 406126057, 402477481, 272425294, 420268062, 406005446, 391742830, 436279589, 388184684, 465528523, 388486229, 504426573, 404226392, 329113907, 408387554, 397683047, 386978540, 438028500, 396446759, 379952790, 363458782, 296789345, 446260395, 396326149, 346391902, 356282240, 366172616, 333606795, 301040993, 376545435, 452049895, 392948975, 333848017, 363519106, 393190196, 309001523, 410076179, 433957768, 272576048, 335898473, 399220880, 477981941]
249925D77981941j06502305J567976J567977j0010949j0010987P839920P839919P839919P839919
249934C85953330m9089934m9089952J01436487q3826822M1913392M1913430p3876179J11387150
249942D26720902m9753311m9753349Q141464J93404794j80257854N005474K0444091K0444129
249950C94396340R830052R830052R830051R830052R528506R528506o7664503o7664523K5932028
249959C43376561K5932008K5932046K5932046j809198j809235j809197j809198m8125049m8125029
249968C17685755N9945213N9945233l8415608l8415607P900205P900244M8426594M8426556
249976D73398585j32977080N2286211l0696300l0696299N8075711N8075711p0257727p0257727
249984C06951085L7812517L7812554N427631N427630r8782977Q6480313k2554835k2554834
$$ y = [477981941, 371479636, 373047612, 374615589, 364604640, 354593653, 362433573, 370273492, 378113411, 385953330, 336863396, 287773444, 389209931, 305383109, 347296501, 389209931, 315333752, 426720902, 376967591, 327214242, 335355706, 528760500, 348502646, 353508120, 373952211, 394396340, 404226392, 414056444, 423886495, 433716547, 443245053, 452773559, 385109056, 317444533, 343376561, 369308569, 395240615, 421172661, 419363463, 417554228, 415745031, 413935833, 365810784, 317685755, 377630968, 437576201, 399160593, 360744986, 368645191, 376545435, 424972029, 473398585, 340421505, 392707716, 362011416, 331315117, 389390828, 447466539, 377208812, 306951085, 344763602, 382576156, 388003787, 393431417, 294648440, 381128753, 358573918, 336019084]
249992C36019084R3234717r2028573K2554835K2554834o03053o03091Q9133880r6129487Q081141
250001C82214287Q081140l7541152l7541133L9651914L9651895l5611344l5611306M1581703
250009C64876004M1581742j9931506j9931468j9931505j9931468L31689L31689J04542315
250017D31937492q0721012K442432K442431Q3495134j01768196J03758328q1505001K2705589
250025C82787197K2705626p3062029J12201338k6746215k6746178n5693565J29569725j25167304
250033C39848595O0095987j5890917j5890916M7793360m4838305k2645302k2645302m3873400
250041B81953800J10512694k3369003j16000630J46455708p930349n6176046L6455618O7332853
250049D39234645q7053280k2705588O9926038J7820724J7820763q1565325P2820807m372278
$$ y = [336019084, 429253801, 337225228, 359780063, 382334897, 381731844, 381128753, 470262633, 374133146, 382214287, 390295427, 352754275, 315213142, 354865056, 394516951, 358905607, 323294301, 364876004, 406457746, 386526240, 366594772, 346663267, 326731799, 327063488, 327395177, 431937492, 351216480, 353658912, 356101343, 439596477, 337828281, 441586609, 360081608, 382787197, 405492823, 332430794, 444632132, 417885917, 391139739, 335446174, 465015899, 339848595, 399944582, 384053665, 368162749, 415956109, 371117804, 348472502, 325827200, 281953800, 392466494, 369097491, 253096861, 399552569, 391622220, 335446174, 371901792, 439234645, 352181365, 329475777, 399401815, 417222539, 435043302, 353477977, 426298784, 421926506]
250057D21926506m372278j36082870J8303186J09005023m5381071r2661808J23478717j04240751
250065B89974654N0145306O7332852q7053280Q2771470p1614663J20403089r5737474N6718813
250073D12940767r7667301M5622274M5622292o4377797R0008336L7902984j78237541O6850372
250081C58664386O6850410n0748416M1883249j66537967J11356988K321821K321821k6625567
250089C39486725k6625548M0677124M0677104q6691410O7694685m8094906M4536797K080600
250097C73741171K080562j1126626j1126663j6916126j6916163P2820807j9810857J2996147
250105C85742252p9635460l0162R2601483K5057590K5057591L1812014j22574156j4503838
250113C43527314J39882258q7716658q7716600k0172727J34213386n4909615L7722087m1400806
$$ y = [421926506, 417554228, 281471358, 299774544, 408779567, 363398496, 270736688, 394215405, 289974654, 340119960, 407452812, 320399532, 403171002, 331556339, 451959428, 356221954, 412940767, 315273466, 360895740, 406518032, 342140235, 432148571, 470051555, 291814014, 358664386, 425514796, 374766380, 416649629, 250111662, 361468650, 363790471, 366112292, 339486725, 312861177, 353538301, 394215405, 307523995, 375218680, 327123774, 371660571, 373741171, 375821733, 364695107, 353568444, 336652318, 319736155, 392556962, 372746105, 385742252, 306106792, 306076630, 398678113, 423735703, 448793294, 480605308, 358031152, 343527314, 483409572, 395692914, 307976314, 287803587, 422016973, 367107358, 404829445, 363428639]
250121C63428639m1400806k2102517J32283541l1751652l1751689L4827317L4827356k6927112
250129D11433077j19558758M7371185m5260442J16844924r9295564Q7897536m734110o663918
250137C88033930o663918m9602595M3029107o6970983K5660644P4871226j7760438N5572992
250145D46169965l7058709j24624557K9761558R9235277j16905267J21428298K8796597m0677105
250153D06126057m0677142j7519180j7519216O3533522r0852610L6515905n6115703O3533504
250161C47025137O3533484k2660392k2660355k2660392k2660393m327025m327025L2339652
250169C43602691J24971355r4546420R0716909n4020069n4020069k6037567k6037566J0629111
250177C15258375J03260776j23373178O1890112P3469095j11794235K9083089J21714754j42671469
$$ y = [363428639, 322027833, 299925316, 432208857, 400457205, 368705516, 403532833, 438360189, 411433077, 291874319, 339245504, 293985062, 410829986, 311534422, 399431958, 394697848, 388033930, 381370012, 331767417, 374796524, 307825541, 333486185, 408357411, 390596973, 446169965, 409111256, 284486699, 314248257, 413483534, 296578267, 418006565, 446803162, 406126057, 365448915, 347929735, 330410519, 393944041, 303091431, 339607336, 283491633, 347025137, 410558621, 387898229, 365237874, 342577482, 319917089, 315590064, 311263039, 343602691, 468574046, 374027626, 464744535, 410724466, 356704397, 330666830, 304629264, 315258375, 418519151, 295145973, 357036085, 430505180, 318710945, 347794034, 469508788, 326837319]
250185C26837319M2591860r0566117R4697174K065509K065510j4337993j4337993L1977821
250193C80993090L1977820l6455618l6455657M0737429M0737429j1367885j1367847j03999548
250201B94799213Q1263779q8319710R6943617p267009p267009N8347113j26916234N4487402
250209C56071162N4487459m2486340m2486340L4706745L4706708m1521417m1521398J03215541
250217D15172120q2047767P0649740k1981963l3560887N9070815m9964427m9964389K140905
250225C09514147K140886P2956490P2956470j14236666P1026624n201462r7833145J27956535
250233D39279879j80815674J01662637q3600672J57627586k7635724p1056805K1574858j583066
250241C55453019j583029Q789751q3841912k7876945J57386384k4982214k4982214k4982213
$$ y = [326837319, 369429179, 278863062, 373560236, 375625745, 377691255, 363353262, 349015269, 380993090, 412970910, 376515292, 340059635, 380797064, 421534493, 410166608, 398798761, 294799213, 376062992, 287743282, 384686899, 377419890, 370152881, 428499994, 301583760, 356071162, 410558621, 368072281, 325585941, 360292686, 394999394, 353477977, 311956579, 415172120, 333124353, 403774093, 381792130, 348231243, 407302058, 357337631, 307373242, 309514147, 311655033, 384611523, 457567993, 343331327, 414357951, 409156489, 311323344, 439279879, 258464205, 360126842, 276526170, 434153756, 406518032, 335461227, 357036085, 355453019, 353869990, 362659741, 278817829, 250940884, 408327268, 383345054, 358362840, 333380627]
250249C33380627k4982176J25544227n9719064j824289j824288K7123100K7123100j3403251
250257D11417986j3403251m0224805N2406859j03909081Q1354209K231392K231353j59874049
250265B32230613J48898140j3930927j3930927N1683157N1683157k3580044k3580081j39369615
250273B70103473M5893657J39731484m5531825j47812625L7450685J06924442J4292759l9742362
250281C81309688N2889301j21759949O3503304q7023080N608565J7187509J7187491K2977028
250289C51879857K2976991J80897J80935n7713860J27549468o7363033o7362977r468201r468219
250298B91391858O63377O63378J04874004q0389343L2505516L2505497k5389280k5389279
250306C31435728j2785069j2785107L3530706L3530744m3662304m3662322M5109688M5109669
$$ y = [333380627, 308398451, 433942678, 374223614, 372399325, 370575037, 397698137, 424821237, 411417986, 398014735, 357789930, 410196789, 306287708, 387641917, 389873309, 392104662, 232230613, 381128753, 367197826, 353266899, 404950056, 456633213, 433053169, 409473088, 270103473, 315997130, 455728614, 410196789, 262384164, 299834849, 406759291, 421052050, 381309688, 434198989, 312439040, 375942344, 288919264, 294527829, 311715338, 328902829, 351879857, 374856848, 375037745, 375218680, 317504820, 445054288, 377691255, 310328278, 300860077, 291391858, 292055235, 292718613, 397592617, 317203274, 349708790, 382214287, 356825007, 331435728, 318650659, 305865552, 339396258, 372927002, 329264698, 285602376, 330712064, 375821733]
250314C75821733o5614066J19649226p3333393p3333393J13859743p1403584L2807042L2807042
250322C91260350m52299m52300m52299m52300n276876n276877J22091676j86680532L1148580
250331C45457123L1148598r2360243R2903010k8675986k8676023K9218790K9218753J1066339
250339C89300361J1066377j04723232Q0540097P1855884j13407482K382145K382108j959952
250347C37436306j959989j3538952j3538914J16724332o8538997L5671630L5671630o0126129
250355C67800917o0126149J01979255q3284094j7669932J67593319q7143709R8119619j34183262
250363C53085964N1080104m1551560m1551599K1167794K1167793K1167793K1167755k713796
250371D03020248k713835k713796k713834k3941914k3941913N3251171N3251134q7384969
$$ y = [375821733, 310207667, 429856893, 356523500, 283190107, 397049850, 325646266, 358453308, 391260350, 390808051, 390355751, 389903452, 389451152, 384174276, 378897399, 500989075, 314308543, 345457123, 376605721, 284245478, 377148488, 348472502, 319796479, 349015269, 378234022, 389300361, 400366738, 295643506, 376183603, 448039487, 334632005, 337014150, 339396258, 337436306, 335476317, 321937365, 308398451, 425122783, 356583786, 392255416, 427927046, 367800917, 307674768, 409654023, 326369929, 308699997, 476293316, 389149607, 487269226, 353085964, 404166068, 362614508, 321062909, 342230703, 363398496, 384566289, 405734044, 403020248, 400306413, 397592617, 394878783, 370936869, 346994956, 400246127, 453497261, 366112292]
250379C66112292q7384912P0860799P0860818K9369544j55893784J29720517n5542850j1699573
250387C56402851j1699535j1699574j1699573m1611885J43651444o874996o875034n2708366
250395C56885332n2708367J2905699J2905698Q1414572j03848776P7554898P7554879j8936440
250403D43727495j8936401j23147029O2116263J1940794J1940795k2796056k2796093M462745
250411C46512513M462708J08673372p6589994J7971516J7971517J2182016J2182016r6611930
250419C46753734l980265p7313657J07949670q5032966P598679J23388268o1875078j9177623
250427C38310762P3454004r4440843R0822410K8103113K8103076j2423238j2423275l5038396
250435D04467613j27670060J42505586m2757704k4424357O8207309N0838844m1792819l919941
$$ y = [366112292, 278727380, 349588179, 420448997, 449818541, 293924757, 423645274, 368102424, 356402851, 344703316, 333003742, 321304169, 279692284, 423343728, 416468732, 409593698, 356885332, 304176965, 317082664, 329988362, 411402934, 307554158, 385109056, 462663935, 443727495, 424791094, 301644065, 363760328, 375701122, 387641917, 364845861, 342049768, 346512513, 350975221, 459648593, 383058599, 401030115, 419001632, 431183648, 443365664, 346753734, 342773469, 265459812, 373409482, 288376516, 295975195, 419363463, 357488385, 338310762, 411764766, 317323923, 408146333, 436249446, 464352522, 451929284, 439506009, 404467613, 276797553, 419303139, 376545435, 352121078, 420328387, 471167231, 429374412, 425454471]
250443D25454471r6551642L6606410n6025254J02220456q3042834J5378331J5378293L8023594
250451C97441825L8023633l9169453l9169452m432564m432565m432564m432602J3659562J3659563
250460C66715383J9449025J12080690j75463421R799909P1554339k1077326j3900784j3900784
250468C55257031R6099343q9164023q5304349R9958978j5830630j5830592l92013l91975M5923838
250477C90325608j39339490J70397621j4865707o3111328K9520298O3503341j21759968K2977009
250485C37647384K2976991M7099801j38163470J16573559o8689732J1156788J1156807j2001119
250493C27757009j2001100R7998989q7264320l5159026N7472639L9923260L9923297j04813680
250501C23837068Q0449610l8234672l8234673m2094327J43168964j33278607N1984684J04090016
$$ y = [425454471, 328902829, 365509239, 309483985, 411704441, 328661607, 344039938, 359418231, 397441825, 435465458, 396296005, 357126553, 352693989, 348261424, 343828860, 339396258, 353055820, 366715383, 386164408, 498245098, 322781677, 332581586, 404135925, 383058599, 369157815, 355257031, 451356374, 362192351, 276888002, 376846980, 361016350, 345185758, 344793745, 344401770, 390325608, 250986118, 421383739, 406518032, 343406704, 372927002, 436430343, 314670375, 337647384, 360624375, 407724176, 269560706, 386134265, 317444533, 328601321, 339758128, 327757009, 315755909, 413754898, 326490578, 291331552, 348804191, 388727451, 428650748, 323837068, 404286678, 366052006, 327817333, 285723006, 428891970, 295613363, 347598047, 451688063]
250509D51688063q1173350M2335586n0296116r769727r769765K9550479K9550479q0449648
250517C21666001J04813680J2182054q0449649o3081185J22182106J01918949k06853240J34725991
250525D47104707n0537337q5274169P357458P2971561j9660141m1189729m1189709J78810470
250533D68393111j29961738n6628327L6003319O3020880k9610765M3481368M3481406p0378337
250541C67800917p0378357L6727002L6727021L6726983L6727021m7612425m7612463K9580622
250549C78686321K9580622j6735191j6735228M1159585n1472080l1691365O0940299k3972095
250557C69760868J30414076j45551147P0589453m7129982M5501682k4997267k4997304j3418303
250565C60172076j3418342p628841Q5002824r4471043N9915089o0095986L2535639j9569635
$$ y = [451688063, 370514713, 412850299, 362554183, 352784456, 343014691, 372565170, 402115649, 321666001, 426479681, 438661735, 358212086, 295130901, 417313007, 519231956, 312378716, 447104707, 396567370, 311293201, 318650659, 391622220, 371962079, 330772350, 289582641, 468393111, 338431373, 281803046, 317806365, 380827245, 351216480, 394697848, 438179254, 367800917, 297422560, 334149562, 370876583, 407603566, 444330587, 396718162, 349105699, 378686321, 408266943, 391531752, 374796524, 415956109, 364484029, 332792664, 393732963, 369760868, 500174944, 354623797, 425213250, 378083268, 423584950, 398587683, 373590379, 360172076, 346753734, 339124893, 424127717, 329656674, 389571763, 329475777, 362011416, 342441781]
250573C42441781j9569636J17448033l6938098j08341646M6044449l1631061O1000605l3560887
250581C36893540N9070777j6192462j6192424l5490734l5490695J92952456k08451378J15759427
250589C92858507K3127745n1170534n1170553O724224O724242J37530293p8610270m0013765
250597C45999889m0013708P2881075j9750571o6066384K6565243j2151854j2151873L9953422
250605C35265239n2678205O8900810k3730835K2585015p0046668N7110769l5520838J32374027
250613D34259314q3766536K7198477K7198514p3152495Q1233636j8876115j8876115j5016461
250621C60202219j5016461L3229199n9402466L9018661L9018698l3108587l3108588K2856380
250629C53689055K2856380n1441936J02944158l6003319N6628345l4555953l4555953O3865211
$$ y = [342441781, 322872145, 440320178, 403382080, 295040434, 341084883, 309453822, 370454427, 336893540, 395964317, 379771855, 363579431, 328088697, 292598002, 485550458, 277099080, 392858507, 415986252, 364815718, 313645165, 320369389, 327093631, 464623924, 386013654, 345999889, 305986181, 378867256, 359116685, 293050301, 319615544, 307463690, 295311817, 335265239, 282587034, 351487844, 327757009, 350342024, 280295356, 337406125, 301885287, 434259314, 350492778, 377691255, 404889769, 331737274, 412970910, 394094795, 375218680, 360202219, 345185758, 378414957, 319012491, 358031152, 397049850, 363941263, 330832675, 353689055, 376545435, 325103499, 428047657, 392044338, 448672683, 414116730, 379560777, 443425988]
250637D43425988k8766491J0794974q1836689M9391479m3240185J03909120j12231482j04512134
250645B36934580K35137250j11266558j8634856J01014351j76880643R3656874J025209M5411214
250653D06397421j08974861K1288385K1288404j869522j869522J00290649j15849876M8185372
250661C68886450m4446329R1606455o2779677Q0027492j2604173j11025317M3360776n8920004
250669B94105673R5466090l1902443l1902444K4062524K4062525l196277l196277N8558154
250677D26057525l4073473p4599843P9786252j2845431j2845394K2494548K2494548j8031840
250685C98436892j8031803J1880508J04512135j63733704r347609o4106394R0279662k7439698
250693C22449989J26946396m5773084m5773046N42766N42729P9424439p4961693J1880470
$$ y = [443425988, 414659497, 425454471, 343617782, 393009261, 349769076, 453678196, 341446714, 236934580, 472071830, 360805272, 342170416, 443184767, 266304124, 359960998, 360986207, 406397421, 297422560, 318710945, 339999349, 338129827, 336260305, 436550954, 320701078, 368886450, 324440121, 416046576, 353266899, 433294391, 420690218, 309664901, 353025677, 294105673, 389571763, 357669320, 325766876, 349829400, 373891925, 370695648, 367499371, 426057525, 391984052, 317384209, 397170461, 384325030, 371479636, 393974184, 416468732, 398436892, 380405089, 392285597, 496797732, 333064028, 323716419, 259610025, 349889687, 322449989, 449396385, 403623301, 357850255, 358393021, 358935750, 438360189, 363398496, 375278966]
250701C75278966J1880508j2242340j2242340j8031803P4599862l9395621l9395584k9746447
$$ y = [375278966, 387159474, 374917134, 362674794, 344642991, 419242853, 379847232, 340451648, 310705201]
$$ [...]
##END=	
