##TITLE=	HXHrBNDJRKKZtJPrqVM2xQ.12.fid
##JCAMP-DX=	6.0	$$ MestReNova 14.3.3-33362
##DATA TYPE=	LINK
##BLOCKS=	1    
##ORIGIN=	Mestrelab Research S.L.
##OWNER=	hrzepa
##$MNOVA/METADATA=	(DOCUMENT,BASE64)
eyJuYW1lIjoiL1VzZXJzL2hyemVwYS9Eb3dubG9hZHMvSVVQQUMtRkFJUlNwZWMtbWFpbi8zOC1Db21
wbGV4ZXMvMzhqLzM4ai1GLzM4ai1GLm1ub3ZhIiwicGFnZXMiOlt7Iml0ZW1zIjpbIjEiICAgICBdfV
19
##TITLE=	HXHrBNDJRKKZtJPrqVM2xQ.12.fid
##JCAMP-DX=	6.0	$$ MestReNova 14.3.3-33362
##DATA TYPE=	NMR SPECTRUM
##DATA CLASS=	XYDATA
##BLOCK_ID=	1
##ORIGIN=	Bruker BioSpin GmbH
##OWNER=	nmrsu
##NUMDIM=	1
##$MNOVA/METADATA=	(ITEM,BASE64)
eyJhbmdsZSI6MCwiYXhlcyI6eyJ4Ijp7Im1heCI6NjUuMDgyNzI5OTk5NTk2ODQsIm1pbiI6LTE3OS4
2NzEwNTE3OTY4MTQ2Mn0sInkiOnsibWF4Ijo0MDU4MTU3LjY4NzUsIm1pbiI6LTM3NzU4Mi44NjAzNT
E1NjI1fX0sInBvaW50cyI6W3sieCI6NTMyMSwieSI6NTgzNX0seyJ4Ijo4NzIyLCJ5Ijo1ODM1fSx7I
ngiOjg3MjIsInkiOjgyMDh9LHsieCI6NTMyMSwieSI6ODIwOH0seyJ4Ijo1MzIxLCJ5Ijo1ODM1fV0s
InoiOjB9
##.OBSERVE FREQUENCY=	658.94984375485603323
##.OBSERVE NUCLEUS=	^19F
##.SOLVENT NAME=	None
##.PULSE SEQUENCE=	zg30
##LONGDATE=	2025/01/08 22:52:28.000
##.ACQUISITIONMODE=	SIMULTANEOUS (DQD)
##$ORIGINAL FORMAT=	Bruker XWIN-NMR
##$MNOVA/SCALES_VERSION=	9
##$PARAMETER FILE=	(acqus, ASCII, /private/var/folders/f6/rjf_tdyn2v98c5c0wvkgn4s80000gq/T/HXHrBNDJRKKZtJPrqVM2xQ/12/acqus, 0)
$$ ##TITLE= Parameter file, TopSpin 4.1.3
$$ ##JCAMPDX= 5.0
$$ ##DATATYPE= Parameter Values
$$ ##NPOINTS= 1	$$ modification sequence number
$$ ##ORIGIN= Bruker BioSpin GmbH
$$ ##OWNER= nmrsu
$$ $$ 2025-01-08 22:50:51.483 +0000  nmrsu@CZC7167VR1
$$ $$ Z:/700/data/tds/nmr/RP611/12/acqus
$$ $$ process C:\Bruker\TopSpin4.1.3\prog\mod\dirdata.exe
$$ ##$ACQT0= -3.66750770866894
$$ ##$AMP= (0..31)
$$ 100 100 100 100 100 100 100 100 100 100 100 100 100 100 100 100 100 100
$$ 100 100 100 100 100 100 100 100 100 100 100 100 100 100
$$ ##$AMPCOIL= (0..32)
$$ -1 0 0 0 0 0 0 0 0 0 0 0 0 0 0 0 0 0 0 0 0 0 0 0 0 0 0 0 0 0 0 0 0
$$ ##$AQSEQ= 0
$$ ##$AQ_mod= 3
$$ ##$AUNM= <au_zg>
$$ ##$AUTOPOS= <28 >
$$ ##$BF1= 658.987406037
$$ ##$BF2= 658.987406037
$$ ##$BF3= 658.987406037
$$ ##$BF4= 658.987406037
$$ ##$BF5= 658.987406037
$$ ##$BF6= 658.987406037
$$ ##$BF7= 658.987406037
$$ ##$BF8= 658.987406037
$$ ##$BWFAC= (0..63)
$$ 0 0 0 0 0 0 0 0 0 0 0 0 0 0 0 0 0 0 0 0 0 0 0 0 0 0 0 0 0 0 0 0 0 0 0 0
$$ 0 0 0 0 0 0 0 0 0 0 0 0 0 0 0 0 0 0 0 0 0 0 0 0 0 0 0 0
$$ ##$BYTORDA= 0
$$ ##$CHANFCU= (0..24)
$$ 0 1 0 0 0 0 0 0 0 0 0 0 0 0 0 0 0 0 0 0 0 0 0 0 0
$$ ##$CHANREC= (0..24)
$$ 0 0 0 0 0 0 0 0 0 0 0 0 0 0 0 0 0 0 0 0 0 0 0 0 0
$$ ##$CHEMSTR= <none>
$$ ##$CNST= (0..63)
$$ 1 1 1 1 1 1 1 1 1 1 1 1 1 1 1 1 1 1 1 1 1 1 1 1 1 1 1 1 1 1 1 1 1 1 1 1
$$ 1 1 1 1 1 1 1 1 1 1 1 1 1 1 1 1 1 1 1 1 1 1 1 1 1 1 1 1
$$ ##$CPDPRG= (0..8)
$$ <> <> <> <> <> <> <> <> <>
$$ ##$D= (0..63)
$$ 0 5 0 0 0 0 0 0 0 0 0 0 0 0 0 0 0.0002 0 0 0 0 0 0 0 0 0 0 0 0 0 0 0 0
$$ 0 0 0 0 0 0 0 0 0 0 0 0 0 0 0 0 0 0 0 0 0 0 0 0 0 0 0 0 0 0 0
$$ ##$DATE= 1736376748
$$ ##$DATE_START= 1736376629
$$ ##$DE= 18
$$ ##$DECBNUC= <off>
$$ [...]
$$ ##$ShimPowRng3= (0..63)
$$ 1 1 1 1 1 1 1 1 1 1 1 1 1 1 1 1 1 1 1 1 1 1 1 1 1 1 1 1 1 1 1 1 1 1 1 1
$$ 1 1 1 1 0 0 0 0 0 0 0 0 0 0 0 0 0 0 0 0 0 0 0 0 0 0 0 0
$$ ##$ShimPowType1= 8
$$ ##$ShimPowType2= 8
$$ ##$ShimPowType3= 0
$$ ##$ShimPowType4= 0
$$ ##$ShimPowType5= 0
$$ ##$ShimPowType6= 0
$$ ##$ShimPowType7= 0
$$ ##$ShimPowType8= 0
$$ ##$ShimSysActGrad= (0..63)
$$ 1 2 3 4 13 5 7 11 10 9 6 8 12 18 19 20 21 15 22 23 24 14 25 16 26 17 27
$$ 28 31 32 33 34 35 36 37 38 0 0 0 0 0 0 0 0 0 0 0 0 0 0 0 0 0 0 0 0 0 0
$$ 0 0 0 0 0 0
$$ ##$ShimSysAngle= <>
$$ ##$ShimSysFunc= (0..63)
$$ 1 2 3 4 5 6 7 8 9 10 0 37 38 35 16 15 14 13 12 11 28 27 26 25 24 23 36
$$ 22 30 29 20 21 34 33 32 31 17 18 19 0 0 0 0 0 0 0 0 0 0 0 0 0 0 0 0 0 0
$$ 0 0 0 0 0 0 0
$$ ##$ShimSysMatId= <292722da.dat>
$$ ##$ShimSysMatrix= 1
$$ ##$ShimSysMinMaxUG= 130000
$$ ##$ShimSysOffset= <29 mm>
$$ ##$ShimSysType= 4
$$ ##$ShimUnit= 3
$$ ##$SpectrOsVersion= <4.1.156.20210628>
$$ ##$TCubeEth= <192.168.180.38>
$$ ##$TCubeSeqDevice= <>
$$ ##$TOSITY= <no>
$$ ##$TRIPLO2= 0
$$ ##$TopSpinVersion= <TopSpin 4.1.3>
$$ ##$TrxFreqFormula= (0..23)
$$ <TrxFreqFormula(2.0,700350000.000000,'TRX',Trx(1.0,'TRX 1200.1',1,5.000000,1290.000000))>
$$ <TrxFreqFormula(2.0,700350000.000000,'TRX',Trx(1.0,'TRX 1200.2',1,5.000000,1290.000000))>
$$ <TrxFreqFormula(2.0,700350000.000000,'TRX',Trx(1.0,'TRX 1200.3',1,5.000000,1290.000000))>
$$ <> <> <> <> <> <> <> <> <> <> <> <> <> <> <> <> <> <> <> <> <>
$$ ##$TrxPN= (0..23)
$$ <Z148391> <Z148391> <Z148391> <> <> <> <> <> <> <> <> <> <> <> <> <> <>
$$ <> <> <> <> <> <> <>
$$ ##$TrxSN= (0..23)
$$ <00336> <00337> <00342> <> <> <> <> <> <> <> <> <> <> <> <> <> <> <> <>
$$ <> <> <> <> <>
$$ ##$VCubeEth= (0..23)
$$ <no> <no> <no> <no> <no> <no> <no> <no> <no> <no> <no> <no> <no> <no> <no>
$$ <no> <no> <no> <no> <no> <no> <no> <no> <no>
$$ ##$VTU= 2
$$ ##$VTUETH= <192.168.99.11>
$$ ##$VTUTY= <no>
$$ ##$ValueLine= no
$$ ##$VpuPN= (0..23)
$$ <no> <no> <no> <no> <no> <no> <no> <no> <no> <no> <no> <no> <no> <no> <no>
$$ <no> <no> <no> <no> <no> <no> <no> <no> <no>
$$ ##$VpuSN= (0..23)
$$ <no> <no> <no> <no> <no> <no> <no> <no> <no> <no> <no> <no> <no> <no> <no>
$$ <no> <no> <no> <no> <no> <no> <no> <no> <no>
$$ ##$WBREFAM= (0..31)
$$ 99.8 100 100 100 100 100 100 100 100 100 100 100 100 100 100 100 100 100
$$ 100 100 100 100 100 100 100 100 100 100 100 100 100 100
$$ ##$WBREFLM= (0..31)
$$ 1 0 1 0 0 0 0 0 0 0 0 0 0 0 0 0 0 0 0 0 0 0 0 0 0 0 0 0 0 0 0 0
$$ ##$WBREFPH= (0..31)
$$ 0.05 0 0 0 0 0 0 0 0 0 0 0 0 0 0 0 0 0 0 0 0 0 0 0 0 0 0 0 0 0 0 0
$$ ##$WBSGU= (0..31)
$$ 1 2 4 0 0 0 0 0 0 0 0 0 0 0 0 0 0 0 0 0 0 0 0 0 0 0 0 0 0 0 0 0
$$ ##END=
$$ 
##$DECIM=	124
##$DSPFVS=	22
##XUNITS=	HZ
##YUNITS=	ARBITRARY UNITS
##FIRSTX=	42888.71205716500117
##LASTX=	-118400.99524972747895
##DELTAX=	-0.6152737525201606994
##XFACTOR=	1
##YFACTOR=	112.5896786400952152
##FIRSTY=	3098.2158203125
##MINY=	-8665.3740234375
##MAXY=	3689226
##NPOINTS=	262144
##XYDATA=	(X++(Y..Y))
$$ [...]
-82423e5%%%j%J%jJjJJj%%%%%j%%%J%%jJ%jJ%j%%JjJ%%j%%%J%jJjJJj%jJ%j%%J%j%%jJ%%J
-82465e5j%%%%%jJ%J%%%%jjJJ%%j%Jj%%%%%%%%%J%%j%%%Jj%J%%j%%Jj%jJ%%jK%j%%J%j%J%
-82507e5%%j%%%%j%J%%%%%%%%%%%J%j%J%jJ%jjJ%J%%j%%%Jj%%%%j%J%%%J%j%%%%%%JkK%j%
-82549e6%J%%jJ%%j%%%%%J%j%%J%j%%%%jJJj%%J%j%%%%%%%JjJ%jJ%%%jJjjJ%%%%%jJ%%JkJ
-82591e6JjJj%J%kJ%jJ%%J%j%JjjJ%%%jJ%J%%j%%%%%j%JjJ%%jJ%%%jJ%Jj%Jj%%J%j%J%jJj
-82633e6%%%%jJ%%%%%jJ%j%J%%%%%%JjJj%%%%%%%%%%%jJ%%jJJ%%j%%j%%%%%J%%%%%jJj%%J
-82675e6%jJj%J%%%%%%jJ%%jJj%%%JjJ%%j%%JjJ%%j%%%J%%%%%j%%JJj%%j%J%%Jk%%%%Jj%%
-82716e7Jj%Jj%%%%%%J%%jJ%%%%%%%%jjJ%jJJ%%%jJj%Jj%%J%%%jJ%jjJ%%%%%J%%%%%%%j%j
$$ y = [-55, -55, -55, -55, -56, -56, -55, -55, -56, -55, -56, -55, -54, -55, -55, -55, -55, -55, -55, -56, -56, -56, -56, -55, -55, -55, -56, -55, -55, -56, -55, -55, -56, -56, -56, -55, -56, -55, -55, -55, -56, -56, -56, -56, -55, -55, -56, -55, -56, -55, -54, -55, -55, -56, -55, -55, -56, -56, -56, -55, -55, -56, -56, -56, -57, -56, -56, -56, -55, -56, -56, -56, -56, -56, -56, -57, -56, -56, -55, -55, -55, -55, -55, -56, -57, -56, -55, -55, -55, -56, -56, -55, -56, -56, -56, -56, -56, -56, -56, -56, -56, -56, -55, -55, -55, -56, -56, -56, -56, -55, -56, -56, -55, -55, -55, -56, -56, -56, -55, -56, -56, -57, -56, -56, -56, -57, -55, -55, -56, -56, -56, -55, -55, -56, -56, -55, -55, -55, -55, -56, -56, -56, -56, -56, -57, -57, -56, -56, -56, -56, -56, -56, -56, -56, -56, -56, -56, -56, -55, -55, -56, -56, -55, -55, -56, -55, -55, -56, -57, -56, -56, -55, -55, -55, -56, -56, -56, -56, -55, -56, -56, -56, -56, -56, -57, -57, -56, -56, -56, -56, -55, -55, -56, -56, -56, -56, -56, -56, -56, -55, -57, -55, -55, -56, -56, -56, -55, -55, -55, -56, -55, -55, -55, -56, -56, -56, -56, -56, -56, -55, -55, -56, -56, -56, -55, -55, -56, -56, -56, -56, -56, -57, -56, -55, -56, -56, -56, -55, -55, -56, -56, -56, -56, -56, -56, -56, -56, -55, -56, -55, -55, -56, -55, -55, -55, -55, -56, -55, -56, -57, -56, -56, -56, -56, -56, -56, -57, -56, -56, -56, -55, -57, -56, -55, -56, -55, -56, -56, -55, -55, -57, -56, -56, -57, -56, -56, -56, -55, -55, -56, -56, -55, -56, -57, -56, -56, -56, -56, -57, -56, -56, -55, -55, -55, -56, -56, -56, -56, -56, -56, -57, -57, -56, -57, -56, -56, -56, -57, -56, -56, -56, -56, -57, -56, -56, -55, -56, -56, -55, -56, -56, -56, -55, -55, -56, -56, -55, -55, -56, -55, -56, -56, -56, -56, -56, -57, -56, -56, -56, -56, -56, -56, -57, -56, -56, -57, -57, -56, -56, -56, -56, -56, -56, -56, -55, -56, -55, -56, -56, -56, -56, -56, -56, -56, -56, -56, -56, -56, -56, -57, -56, -56, -56, -57, -56, -55, -55, -55, -56, -56, -56, -57, -57, -57, -57, -57, -57, -56, -56, -56, -56, -56, -56, -57, -56, -57, -57, -57, -56, -56, -57, -56, -57, -57, -56, -56, -56, -56, -56, -56, -56, -57, -56, -56, -56, -57, -56, -57, -57, -57, -57, -56, -57, -56, -56, -56, -57, -57, -57, -56, -57, -56, -56, -56, -57, -57, -57, -57, -56, -56, -56, -56, -56, -56, -57, -57, -57, -56, -55, -56, -56, -56, -57, -57, -56, -56, -56, -55, -57, -57, -57, -57, -57, -56, -57, -57, -57, -56, -57, -57, -56, -57, -57, -57, -57, -57, -57, -57, -56, -56, -56, -57, -56, -56, -56, -56, -56, -56, -56, -56, -56, -57, -58, -57, -57, -58, -57, -56, -56, -56, -56, -57, -56, -57, -57, -56, -57, -57, -57, -56, -56, -56, -56, -57, -56, -56, -57, -58, -57, -57, -57, -57, -57, -57, -56, -56, -56, -56, -56, -56, -56, -56, -57, -57, -58]
-82758e8J%JjJj%J%%%%%%%%jJkKj%J%%%%j%%%%%%J%j%%%%%J%%%%%%jjJ%%%%J%%%j%Jj%%%%
-82800e7%J%j%%JjjJJ%%j%%%%%%%%Jj%JjJ%%j%%J%j%jJJ%j%J%%%j%%Jj%%%%%%%%%%%jJ%Jj
-82842e7%%%%%%%%%J%kJJj%%%%%J%jjJ%%%%%Jj%JjjJjJ%%jJJ%j%%%%jJ%%%%%Jj%Jj%jJ%%%
-82884e7Jj%jJ%%%jJ%%%%%%%%%%%%jJ%%%Jj%jJjJJjjJJ%%kKj%%JkJ%%%%J%j%%%%%%%J%j%%
-82926e7Jk%%J%JjJjj%JKj%j%%%jJ%%%%%%%%%%Jj%%%jJ%%%%jJ%%%%%%Jj%%%%%j%%%J%%jJ%
-82967e7%%%%Jj%%%J%jjJjJj%J%%%%%%jJj%J%%%jK%k%J%%%%%%jJ%%jjJ%J%j%%%Kj%jJ%%%%
-83009e7jJjJ%%j%%%Jj%%J%%jKj%%%%%%jJJkJj%%%%%%%JJj%j%%Jj%%Jj%%%%%%%%J%j%%%%%
-83051e8%%%%JJj%%jJ%%j%J%%jJj%%%%Jj%Jj%%%%%Jj%%JjJ%jJ%%j%JJ%kJj%%%%%jJjKj%%J
$$ y = [-58, -57, -57, -56, -57, -56, -57, -57, -56, -56, -56, -56, -56, -56, -56, -56, -56, -57, -56, -58, -56, -57, -57, -56, -56, -56, -56, -56, -57, -57, -57, -57, -57, -57, -57, -56, -56, -57, -57, -57, -57, -57, -57, -56, -56, -56, -56, -56, -56, -56, -57, -58, -57, -57, -57, -57, -57, -56, -56, -56, -56, -57, -57, -56, -57, -57, -57, -57, -57, -57, -56, -56, -57, -57, -57, -56, -57, -58, -57, -56, -56, -56, -57, -57, -57, -57, -57, -57, -57, -57, -57, -56, -57, -57, -56, -57, -56, -56, -56, -57, -57, -57, -56, -56, -57, -57, -58, -57, -56, -56, -57, -57, -56, -56, -56, -56, -57, -57, -57, -56, -57, -57, -57, -57, -57, -57, -57, -57, -57, -57, -57, -57, -58, -57, -57, -56, -57, -57, -57, -57, -57, -57, -57, -57, -57, -57, -56, -56, -58, -57, -56, -57, -57, -57, -57, -57, -57, -56, -56, -57, -58, -57, -57, -57, -57, -57, -57, -56, -57, -57, -56, -57, -58, -57, -58, -57, -57, -57, -58, -57, -56, -56, -57, -57, -57, -57, -57, -58, -57, -57, -57, -57, -57, -57, -56, -57, -57, -56, -57, -57, -58, -57, -57, -57, -57, -56, -57, -57, -58, -57, -57, -57, -57, -58, -57, -57, -57, -57, -57, -57, -57, -57, -57, -57, -57, -57, -57, -58, -57, -57, -57, -57, -56, -57, -57, -58, -57, -58, -57, -56, -57, -58, -57, -56, -56, -56, -58, -56, -57, -57, -57, -56, -58, -57, -57, -57, -57, -57, -56, -56, -57, -57, -57, -57, -57, -57, -57, -57, -56, -56, -57, -57, -57, -56, -58, -58, -58, -57, -57, -56, -57, -56, -57, -58, -58, -57, -55, -56, -56, -57, -57, -57, -57, -58, -57, -57, -57, -57, -57, -57, -57, -57, -57, -57, -57, -56, -57, -57, -57, -57, -58, -57, -57, -57, -57, -57, -58, -57, -57, -57, -57, -57, -57, -57, -56, -57, -57, -57, -57, -57, -57, -58, -58, -58, -58, -57, -57, -57, -58, -57, -57, -57, -57, -57, -57, -56, -57, -57, -57, -57, -56, -56, -57, -58, -57, -58, -57, -58, -58, -57, -57, -57, -57, -57, -57, -57, -58, -57, -58, -58, -57, -57, -57, -57, -58, -56, -56, -58, -58, -57, -57, -57, -57, -57, -57, -57, -58, -57, -57, -57, -58, -59, -58, -58, -57, -57, -58, -58, -58, -58, -56, -57, -57, -58, -57, -57, -57, -57, -57, -58, -57, -58, -57, -57, -57, -58, -58, -58, -58, -57, -58, -58, -58, -57, -57, -57, -58, -56, -57, -57, -57, -57, -57, -57, -57, -58, -57, -56, -58, -57, -58, -58, -58, -58, -58, -58, -58, -58, -57, -56, -57, -57, -58, -58, -58, -57, -58, -58, -58, -57, -58, -58, -58, -58, -58, -58, -58, -58, -58, -57, -57, -58, -58, -58, -58, -58, -58, -58, -58, -58, -58, -57, -56, -57, -57, -57, -58, -57, -57, -57, -58, -58, -57, -57, -57, -58, -57, -58, -58, -58, -58, -58, -57, -58, -58, -57, -58, -58, -58, -58, -58, -58, -57, -58, -58, -58, -57, -58, -57, -57, -58, -57, -57, -57, -58, -58, -57, -56, -56, -58, -57, -58, -58, -58, -58, -58, -58, -59, -58, -59, -57, -58, -58, -58, -57]
-83093e7%%%%j%%%%%%%%%Jj%%J%j%J%jJkJ%J%jjJ%%%%%%%%%%Jj%%%%%jJKk%Jj%%%J%%j%Jj
-83135e8J%j%%%%%%%%jJjJ%%%%%%%%%%%%%%%Jj%%Jj%Jj%J%%%%j%%JkK%jjJJj%%%%%J%j%%%
-83177e8%%%%%Jj%%%jJJj%Jj%%jJJj%%%%%%%%%jJ%%%%%%%%%%Jj%%%%JkJ%%Jj%%jJ%J%%%jj
-83218e9J%Jj%jJKkjJ%%%%%%%jK%jjJJj%jJ%%JjjKj%%jJ%j%%K%j%jjJJJj%J%j%%J%j%%j%J
-83260e8j%%J%%%%%J%j%%%%j%J%JjkJJ%%JkJJjj%%%%%J%%jJ%jJjJ%%jJ%%j%J%%j%J%%%%j%
-83302e9Jj%JjJ%%%%%j%%%%J%%%%%%j%%JJjjJ%j%%J%jJ%j%J%j%J%%%%j%%J%jJ%%%kKj%JjJ
-83344e8%Jjj%%J%jjK%%%j%J%%jJj%%%J%%%%%%%j%JjJ%%%%kJ%jJ%J%jKk%%%%%%%%Jj%Jj%%
-83386e9J%%j%JjJ%jJjJ%j%jK%%j%%Jj%%%%J%%%j%JjJ%%j%%%%%%Jj%JjjJJj%%%%%%%%%%%%
$$ y = [-57, -57, -57, -57, -57, -58, -58, -58, -58, -58, -58, -58, -58, -58, -58, -57, -58, -58, -58, -57, -57, -58, -58, -57, -57, -58, -57, -59, -58, -58, -57, -57, -58, -59, -58, -58, -58, -58, -58, -58, -58, -58, -58, -58, -58, -57, -58, -58, -58, -58, -58, -58, -59, -58, -56, -58, -58, -57, -58, -58, -58, -58, -57, -57, -57, -58, -58, -57, -58, -57, -57, -58, -58, -58, -58, -58, -58, -58, -58, -58, -59, -58, -59, -58, -58, -58, -58, -58, -58, -58, -58, -58, -58, -58, -58, -58, -58, -58, -58, -57, -58, -58, -58, -57, -58, -58, -57, -58, -58, -57, -57, -57, -57, -57, -58, -58, -58, -57, -59, -57, -57, -58, -59, -58, -57, -58, -58, -58, -58, -58, -58, -57, -57, -58, -58, -58, -58, -58, -58, -58, -58, -58, -57, -58, -58, -58, -58, -59, -58, -57, -58, -58, -57, -58, -58, -58, -59, -58, -57, -58, -58, -58, -58, -58, -58, -58, -58, -58, -58, -59, -58, -58, -58, -58, -58, -58, -58, -58, -58, -58, -58, -57, -58, -58, -58, -58, -58, -57, -59, -58, -58, -58, -57, -58, -58, -58, -59, -58, -58, -57, -57, -57, -57, -58, -59, -58, -58, -57, -58, -58, -59, -58, -56, -58, -59, -58, -58, -58, -58, -58, -58, -58, -58, -59, -57, -57, -58, -59, -58, -57, -58, -58, -59, -58, -58, -58, -57, -58, -59, -57, -58, -58, -58, -59, -58, -58, -59, -59, -59, -57, -57, -58, -58, -59, -60, -59, -58, -57, -58, -58, -57, -57, -58, -58, -58, -57, -57, -58, -58, -58, -59, -59, -58, -59, -59, -59, -58, -58, -58, -58, -58, -58, -57, -57, -58, -58, -58, -58, -58, -59, -59, -58, -58, -57, -58, -60, -59, -58, -58, -58, -57, -59, -58, -57, -58, -59, -59, -59, -59, -59, -59, -58, -58, -58, -59, -58, -58, -59, -58, -59, -58, -58, -58, -59, -58, -58, -58, -59, -59, -58, -58, -58, -59, -59, -58, -58, -58, -58, -58, -59, -59, -58, -59, -59, -58, -59, -58, -58, -58, -58, -58, -58, -59, -59, -59, -59, -59, -58, -58, -58, -58, -58, -58, -58, -59, -59, -59, -58, -57, -58, -59, -58, -58, -59, -59, -59, -58, -58, -59, -58, -58, -59, -59, -58, -58, -59, -59, -58, -58, -58, -58, -58, -59, -59, -59, -58, -58, -59, -58, -58, -58, -58, -60, -58, -59, -59, -58, -59, -58, -58, -57, -58, -59, -59, -59, -58, -58, -59, -60, -58, -58, -58, -58, -59, -59, -58, -58, -58, -59, -58, -59, -59, -59, -59, -58, -58, -58, -58, -58, -58, -58, -58, -59, -59, -58, -59, -58, -58, -58, -58, -58, -60, -59, -59, -60, -59, -59, -58, -58, -59, -57, -59, -59, -59, -59, -59, -59, -59, -59, -59, -58, -59, -59, -58, -59, -59, -59, -58, -58, -58, -59, -59, -58, -59, -58, -58, -59, -58, -59, -58, -58, -59, -59, -60, -58, -58, -58, -59, -59, -59, -58, -59, -59, -59, -59, -59, -58, -58, -58, -58, -59, -59, -58, -59, -58, -58, -58, -59, -59, -59, -59, -59, -59, -59, -58, -59, -59, -58, -59, -60, -59, -58, -59, -59, -59, -59, -59, -59, -59, -59, -59, -59, -59, -59, -59]
-83428e9J%j%%%%%%%Jj%%jKj%%%%%%%%%JjJ%%j%%%%%%%%Jj%%%%%%%jJ%Jj%%jJ%%%%%%%%jJ
-83469e9%%%%J%jjKj%%%%%%%%%%Jj%Jj%jJ%%%%Jj%%%jJjJ%%%%%%%jJJj%%%jJ%%jJ%%%jJ%J
-83511e8%%jjJ%jJ%%%%j%K%j%%%%%jJ%%jJ%%jJ%%jJ%%%JjjJ%%jJ%%JjJj%%%%jJ%%jJJ%k%%
-83553f0J%%%%%%%%%jJ%j%JjJ%%%%%%Jj%%j%%%%%%%Jj%KjjJJkJ%%Jj%%jJkKjJ%jJ%%%%j%%
-83595f0Jj%%J%%%jJ%%%%%%%j%%%J%%%jJj%jJJj%Jj%%%%J%%%%%j%%J%j%%%%%JjJ%%%%%%j%
-83637f0%jJJJjj%KjjJ%j%%%%%%JjJjJ%%%j%Jj%%J%%%%%%%%kJJ%%jJjjJ%%%%%%%%%JjJ%jJ
-83679e9%%%j%%J%jKj%j%JJjjjJJ%%%jJ%j%%%%%%Jj%%%%J%%Jk%%jJ%J%%jjJ%%%J%%%jJj%%
-83720f0Jj%jJ%jJJjJ%%j%%%J%%j%%%%%%%%J%%jjJJjJ%%j%%%%%JjjJJjj%%%%J%%%jJ%%Jj%
$$ y = [-59, -58, -58, -59, -59, -59, -59, -59, -59, -59, -59, -58, -59, -59, -59, -60, -58, -59, -59, -59, -59, -59, -59, -59, -59, -59, -59, -58, -59, -58, -58, -58, -59, -59, -59, -59, -59, -59, -59, -59, -59, -58, -59, -59, -59, -59, -59, -59, -59, -59, -60, -59, -59, -58, -59, -59, -59, -60, -59, -59, -59, -59, -59, -59, -59, -59, -59, -60, -59, -59, -59, -59, -59, -58, -58, -59, -60, -58, -59, -59, -59, -59, -59, -59, -59, -59, -59, -59, -59, -58, -59, -59, -58, -59, -59, -60, -59, -59, -59, -59, -59, -58, -59, -59, -59, -59, -60, -59, -60, -59, -59, -59, -59, -59, -59, -59, -59, -60, -59, -58, -59, -59, -59, -59, -60, -59, -59, -59, -60, -59, -59, -59, -59, -60, -59, -59, -58, -58, -58, -59, -60, -59, -59, -60, -59, -59, -59, -59, -59, -60, -60, -58, -58, -59, -59, -59, -59, -59, -59, -60, -59, -59, -59, -60, -59, -59, -59, -60, -59, -59, -59, -60, -59, -59, -59, -59, -58, -59, -60, -59, -59, -59, -60, -59, -59, -59, -58, -59, -58, -59, -59, -59, -59, -59, -60, -59, -59, -59, -60, -59, -58, -58, -60, -60, -60, -59, -59, -59, -59, -59, -59, -59, -59, -59, -59, -60, -59, -59, -60, -60, -59, -60, -59, -59, -59, -59, -59, -59, -59, -58, -59, -59, -59, -60, -60, -60, -60, -60, -60, -60, -60, -59, -60, -60, -58, -59, -60, -59, -58, -60, -59, -59, -59, -58, -59, -59, -59, -60, -59, -61, -59, -60, -59, -59, -60, -59, -59, -59, -59, -59, -60, -60, -60, -59, -60, -60, -60, -59, -59, -59, -59, -60, -59, -59, -59, -59, -59, -59, -59, -59, -60, -60, -60, -60, -59, -59, -59, -59, -60, -59, -60, -60, -61, -60, -59, -60, -60, -59, -60, -60, -60, -60, -60, -59, -59, -59, -59, -59, -59, -60, -60, -60, -59, -59, -60, -60, -60, -60, -60, -60, -59, -60, -59, -59, -59, -59, -59, -59, -59, -60, -60, -60, -61, -60, -59, -58, -59, -60, -60, -58, -59, -60, -59, -59, -60, -60, -60, -60, -60, -60, -60, -59, -60, -59, -60, -59, -59, -59, -59, -60, -60, -59, -60, -60, -60, -59, -59, -59, -59, -59, -59, -59, -59, -59, -61, -60, -59, -59, -59, -60, -59, -60, -61, -60, -60, -60, -60, -60, -60, -60, -60, -60, -60, -59, -60, -59, -59, -60, -59, -59, -59, -59, -60, -60, -60, -59, -59, -60, -58, -59, -59, -60, -60, -59, -58, -59, -60, -61, -60, -59, -59, -59, -59, -60, -59, -59, -60, -60, -60, -60, -60, -60, -60, -59, -60, -60, -60, -60, -60, -59, -59, -59, -58, -60, -60, -60, -61, -60, -60, -59, -59, -59, -60, -61, -60, -60, -60, -60, -59, -59, -59, -59, -60, -59, -60, -60, -60, -59, -60, -60, -61, -60, -60, -61, -60, -59, -60, -59, -59, -59, -60, -60, -60, -60, -59, -59, -59, -60, -60, -60, -60, -60, -60, -60, -60, -60, -59, -59, -59, -60, -61, -60, -59, -60, -59, -59, -59, -60, -60, -60, -60, -60, -60, -59, -60, -61, -60, -59, -60, -61, -61, -61, -61, -61, -60, -60, -60, -60, -61, -60, -60, -60, -59, -60, -60]
-83762f0%J%j%%%Jj%jJ%%%%jJjJ%Jj%JkJ%%%jK%jjKk%K%jjJ%%%J%j%%%Jj%%%%Jj%Jj%J%%%
-83804e9%%%j%%j%J%jJ%%%%j%%Kj%%%%%%jJJj%%%%%%%%%%%%j%Jj%%%%J%%%%%j%J%%j%JjJ%
-83846f0%j%%J%%%Jk%J%%%j%J%jJ%j%%J%j%%J%j%%%%JJkJ%%%%%%JjjJjJ%%%%%%%%%%%%%j%
-83888f1%%%%JJjjJ%%%%%j%%%JJj%%%%%%%jJ%%jJ%%JjkK%%%%%%%%j%J%%j%J%J%kJ%%jJj%%
-83930f1J%jJ%jJjJ%%%j%J%%jJ%j%J%%%j%%%J%%%j%%%%J%%%%jJ%Jk%J%%jJjJ%%%jJ%%%%%%
-83972f0jJ%%%%%jJ%%%jJ%%jJj%%%J%jjK%%%j%J%jJj%%Jj%%%%K%jjJjjJ%%JjJj%J%%j%%%j
-84013f2JJj%%%%%%J%%%%j%JjJjJ%%j%J%j%JjJj%J%kKj%Jj%%JjjJ%%%%%%%J%%j%%%%%%%%%
-84055f1JkJ%%%J%jjJ%JjjJ%%%JjJ%j%%j%%%JjK%%%%j%JjJjJ%%%j%%%%%%%%%jJ%%%J%j%%J
$$ y = [-60, -60, -59, -59, -60, -60, -60, -60, -59, -60, -60, -61, -60, -60, -60, -60, -60, -61, -60, -61, -60, -60, -59, -60, -60, -59, -61, -60, -60, -60, -60, -61, -59, -59, -60, -61, -59, -61, -61, -59, -59, -60, -61, -60, -60, -60, -60, -59, -59, -60, -60, -60, -60, -59, -60, -60, -60, -60, -60, -59, -60, -60, -59, -60, -60, -59, -59, -59, -59, -59, -59, -59, -60, -60, -60, -61, -61, -60, -60, -61, -60, -60, -60, -60, -60, -61, -61, -61, -59, -60, -60, -60, -60, -60, -60, -60, -61, -60, -59, -60, -60, -60, -60, -60, -60, -60, -60, -60, -60, -60, -60, -60, -61, -61, -60, -61, -61, -61, -61, -61, -60, -60, -60, -60, -60, -60, -61, -61, -60, -60, -60, -61, -61, -60, -61, -60, -60, -60, -61, -61, -61, -60, -60, -60, -60, -59, -61, -61, -60, -60, -60, -60, -61, -61, -60, -60, -61, -60, -60, -61, -61, -61, -60, -60, -61, -61, -61, -60, -60, -61, -61, -61, -61, -61, -60, -59, -61, -60, -60, -60, -60, -60, -60, -60, -59, -60, -61, -60, -61, -60, -60, -60, -60, -60, -60, -60, -60, -60, -60, -60, -60, -60, -60, -61, -61, -61, -61, -61, -61, -60, -59, -60, -61, -60, -60, -60, -60, -60, -60, -61, -61, -61, -61, -60, -59, -60, -60, -60, -60, -60, -60, -60, -60, -61, -60, -60, -60, -61, -60, -60, -60, -59, -60, -62, -60, -60, -60, -60, -60, -60, -60, -60, -60, -61, -61, -60, -60, -60, -61, -61, -60, -60, -59, -59, -61, -60, -60, -60, -61, -60, -61, -61, -61, -60, -60, -61, -60, -60, -61, -60, -61, -60, -60, -60, -60, -61, -61, -60, -60, -60, -61, -60, -60, -61, -61, -60, -60, -60, -60, -61, -61, -61, -61, -60, -60, -60, -60, -61, -61, -61, -61, -61, -60, -60, -60, -60, -60, -61, -60, -60, -59, -61, -61, -60, -60, -60, -61, -60, -61, -60, -60, -60, -60, -61, -60, -60, -60, -60, -60, -60, -60, -61, -60, -60, -60, -60, -60, -60, -61, -60, -60, -60, -60, -61, -60, -60, -60, -61, -60, -61, -61, -61, -61, -60, -60, -61, -62, -60, -60, -60, -60, -61, -61, -60, -60, -61, -60, -61, -61, -61, -60, -61, -61, -61, -61, -61, -59, -59, -60, -61, -60, -61, -62, -61, -61, -61, -60, -61, -60, -61, -61, -60, -60, -60, -61, -61, -61, -61, -62, -61, -60, -61, -61, -61, -61, -61, -61, -61, -60, -60, -60, -60, -60, -61, -61, -60, -61, -60, -61, -60, -60, -60, -61, -61, -60, -60, -61, -61, -60, -61, -60, -61, -61, -60, -60, -62, -60, -61, -61, -60, -61, -61, -61, -60, -61, -62, -61, -61, -61, -61, -61, -61, -61, -61, -60, -60, -60, -61, -61, -61, -61, -61, -61, -61, -61, -61, -61, -60, -62, -61, -61, -61, -61, -60, -60, -61, -62, -61, -61, -60, -61, -62, -61, -61, -61, -61, -60, -61, -60, -60, -61, -61, -61, -62, -62, -62, -62, -61, -62, -60, -60, -60, -60, -60, -61, -61, -60, -61, -60, -61, -60, -60, -60, -60, -61, -61, -61, -61, -61, -61, -61, -61, -61, -61, -62, -61, -61, -61, -61, -60, -60, -61, -61, -61, -60]
-84097f0%%%%j%%%%Jj%jKj%%%%%%J%%j%%%%%%%%%%%%%%%%%%JjJj%jJ%%%%%jJJjjJ%%%j%%J
-84139f1Jj%%jJ%%JjjJ%%%%%Jj%JkJJj%%%%%%%jJ%%jJ%%j%J%%%%JjjJ%j%%J%%%Jj%%%jJ%%
-84181f1JjJj%%%j%Jj%J%%jJ%j%%%%%%%%J%%%%%j%%%%Jj%JjJ%%%%%%%%%jJ%%%%jJ%%Jj%Jj
-84223f1%%j%Jj%%Jj%%%J%jjJ%%J%Jj%%%jJjK%j%jJ%%%%j%J%%%%%%%kJJ%%j%%%%%%%%Jj%%
-84264f2Jj%%J%%%%Jj%%%j%%%%%JjJ%j%J%%Jj%j%%J%jJj%JjJj%%%%%%%%%%%%J%jJj%%jJJ%
-84306f1j%%%jJ%%%J%j%Jj%%%%jJ%%%%%%%%%Jj%%%%%%%%J%%%j%%%%%%%J%jJj%%%%%%%%%%J
-84348f1j%%%%%Jj%jJ%%%J%%%%%j%J%jj%J%%Jj%%%J%%%%%%j%Jj%%%%%%%%%jJ%%%j%J%%%J%
-84390f1j%%Jj%%%%jJJ%%kJ%%%jJ%%%%jK%%j%%%%JjjJ%j%JJJk%%%jJ%%J%j%J%j%Jj%%jJ%j
$$ y = [-60, -60, -60, -60, -60, -61, -61, -61, -61, -61, -60, -61, -61, -62, -60, -61, -61, -61, -61, -61, -61, -61, -60, -60, -60, -61, -61, -61, -61, -61, -61, -61, -61, -61, -61, -61, -61, -61, -61, -61, -61, -61, -61, -61, -60, -61, -60, -61, -61, -62, -61, -61, -61, -61, -61, -61, -62, -61, -60, -61, -62, -61, -61, -61, -61, -62, -62, -62, -61, -60, -61, -61, -61, -62, -61, -61, -61, -60, -61, -62, -61, -61, -61, -61, -61, -61, -60, -61, -61, -60, -62, -61, -60, -61, -61, -61, -61, -61, -61, -61, -61, -62, -61, -61, -61, -62, -61, -61, -61, -62, -62, -61, -61, -61, -61, -61, -60, -61, -62, -61, -61, -62, -62, -62, -61, -61, -61, -61, -60, -61, -61, -61, -61, -62, -61, -61, -61, -60, -61, -60, -61, -61, -61, -61, -62, -62, -61, -62, -62, -61, -61, -61, -62, -61, -61, -62, -62, -62, -62, -62, -62, -62, -62, -62, -61, -61, -61, -61, -61, -61, -62, -62, -62, -62, -62, -61, -62, -62, -61, -62, -61, -61, -61, -61, -61, -61, -61, -61, -61, -61, -62, -61, -61, -61, -61, -61, -62, -61, -61, -61, -60, -61, -61, -60, -61, -61, -61, -62, -62, -61, -62, -62, -62, -61, -62, -62, -62, -62, -61, -61, -62, -63, -62, -62, -62, -61, -61, -60, -61, -61, -61, -61, -62, -61, -62, -60, -60, -61, -61, -62, -61, -61, -61, -61, -61, -62, -62, -61, -61, -61, -61, -61, -61, -61, -61, -63, -62, -61, -61, -61, -62, -62, -62, -62, -62, -62, -62, -62, -62, -61, -62, -62, -62, -61, -62, -62, -62, -61, -61, -61, -61, -61, -60, -61, -61, -61, -61, -62, -62, -62, -62, -62, -62, -61, -62, -61, -61, -62, -62, -61, -61, -61, -60, -61, -61, -62, -62, -62, -61, -61, -62, -61, -62, -62, -61, -62, -61, -62, -62, -62, -62, -62, -62, -62, -62, -62, -62, -62, -62, -62, -61, -61, -62, -61, -62, -62, -62, -63, -62, -61, -61, -62, -62, -62, -62, -63, -62, -62, -62, -62, -61, -61, -62, -62, -61, -62, -62, -62, -62, -62, -63, -62, -62, -62, -62, -62, -62, -62, -62, -62, -62, -61, -62, -62, -62, -62, -62, -62, -62, -62, -62, -61, -61, -61, -61, -62, -62, -62, -62, -62, -62, -62, -62, -61, -61, -62, -61, -62, -62, -62, -62, -62, -62, -62, -62, -62, -62, -62, -61, -62, -62, -62, -62, -62, -62, -61, -62, -62, -63, -62, -62, -62, -62, -61, -61, -61, -61, -61, -61, -62, -62, -61, -61, -62, -63, -63, -62, -62, -62, -61, -62, -62, -62, -62, -61, -61, -61, -61, -61, -61, -61, -62, -62, -61, -62, -62, -62, -62, -62, -62, -62, -62, -62, -62, -63, -62, -62, -62, -62, -63, -63, -62, -62, -62, -62, -61, -61, -62, -62, -62, -61, -62, -62, -62, -62, -62, -63, -62, -61, -61, -61, -63, -62, -62, -62, -62, -63, -62, -62, -62, -62, -62, -63, -61, -61, -61, -62, -62, -62, -62, -62, -61, -62, -63, -62, -62, -63, -63, -62, -61, -60, -62, -62, -62, -62, -63, -62, -62, -62, -61, -61, -62, -62, -61, -61, -62, -62, -61, -62, -62, -62, -63, -62, -62, -63]
-84432f3J%JkJ%%%%%%%%%%Jj%%%%%%%%JkJ%%JjjJ%jJjKj%%%jJ%%%%%j%J%%%%%%%j%J%Jj%%
-84474f2%jJ%%%%%%%%%Jj%j%JJ%jkJ%%J%%%%jJ%%jJ%jJJk%J%%%%%j%%%%%%%J%%%%%%jJj%%
-84515f3%J%jKj%%%%j%J%j%%%%J%%%%jJ%jKj%%%jJj%Jj%J%%%%%%jj%J%J%%%%%%kJJJjjJjJ
-84557f2%jJ%%%%j%%J%%%%%j%%Jj%Jj%%J%%%%%j%%%%%JjJ%j%%%%%J%%%%%%jjJ%%J%%%%Jj%
-84599f2%%jJ%%%jJ%jJ%%jjJ%%jK%%j%jJJj%%%%%Jj%%%%jJ%J%jJ%%%%j%%%%%%%%Jj%J%jJ%
-84641f2jJ%j%%%JjJ%j%%%%Jj%%%JjJ%%j%%%%%%%%JjJ%%%jJ%%%%j%%%%%%jJjKj%%J%%j%%J
-84683f2j%%jJJjJ%j%%%%Jj%%jJJj%%%%%Jj%%%%%%%JjKkJ%%%%j%%%j%%%JjJ%%%%%%Kjj%%%
-84725f3JjjK%j%%%%%%%Jj%%jK%j%%J%%%jjJ%%%%J%%jJkJ%JkJJkJ%%%%%%Jj%%%%%%jJJjjJ
$$ y = [-63, -62, -62, -61, -63, -62, -62, -62, -62, -62, -62, -62, -62, -62, -62, -62, -61, -62, -62, -62, -62, -62, -62, -62, -62, -62, -61, -63, -62, -62, -62, -61, -62, -63, -62, -62, -63, -62, -63, -61, -62, -62, -62, -62, -63, -62, -62, -62, -62, -62, -62, -63, -63, -62, -62, -62, -62, -62, -62, -62, -62, -63, -63, -62, -62, -61, -62, -62, -62, -62, -63, -62, -62, -62, -62, -62, -62, -62, -62, -62, -62, -61, -62, -62, -63, -63, -62, -61, -61, -62, -64, -63, -63, -63, -62, -62, -62, -62, -62, -63, -62, -62, -62, -63, -62, -62, -63, -62, -61, -63, -63, -62, -62, -62, -62, -62, -62, -63, -63, -63, -63, -63, -63, -63, -63, -62, -62, -62, -62, -62, -62, -62, -63, -62, -63, -63, -63, -63, -62, -62, -63, -61, -62, -62, -62, -62, -62, -63, -63, -62, -62, -63, -63, -63, -63, -63, -62, -62, -62, -62, -62, -63, -62, -62, -63, -61, -62, -62, -62, -62, -63, -62, -63, -63, -62, -63, -63, -62, -62, -62, -62, -62, -62, -62, -63, -64, -64, -63, -63, -62, -62, -62, -62, -62, -62, -62, -64, -63, -62, -61, -62, -63, -62, -63, -62, -62, -63, -62, -62, -62, -62, -62, -63, -63, -63, -62, -62, -62, -62, -62, -62, -63, -63, -63, -62, -63, -63, -62, -63, -63, -63, -62, -62, -62, -62, -62, -62, -63, -63, -63, -63, -63, -63, -62, -63, -62, -62, -63, -63, -63, -63, -63, -63, -62, -62, -62, -62, -62, -62, -62, -63, -64, -63, -63, -63, -62, -62, -62, -62, -62, -61, -62, -62, -62, -62, -63, -62, -62, -62, -62, -63, -62, -62, -63, -62, -62, -62, -63, -64, -63, -63, -63, -64, -62, -62, -62, -63, -63, -64, -63, -62, -63, -63, -63, -63, -63, -63, -62, -63, -63, -63, -63, -63, -64, -63, -63, -62, -62, -63, -62, -62, -62, -62, -62, -63, -63, -63, -63, -63, -63, -63, -63, -63, -62, -63, -63, -62, -62, -63, -62, -62, -63, -62, -62, -63, -63, -63, -63, -62, -63, -62, -62, -63, -63, -63, -63, -63, -62, -63, -63, -63, -63, -62, -63, -62, -62, -62, -63, -63, -63, -63, -63, -63, -63, -63, -63, -62, -63, -62, -62, -62, -62, -63, -62, -62, -62, -62, -62, -63, -63, -63, -63, -63, -63, -63, -64, -63, -64, -62, -63, -63, -63, -62, -62, -62, -63, -63, -63, -62, -63, -63, -63, -64, -63, -62, -63, -62, -62, -63, -63, -63, -63, -63, -62, -63, -63, -63, -64, -63, -62, -63, -63, -63, -63, -63, -63, -62, -63, -63, -63, -63, -63, -63, -63, -63, -62, -63, -61, -63, -62, -62, -62, -62, -62, -63, -63, -63, -63, -64, -64, -64, -64, -63, -64, -63, -63, -63, -63, -63, -63, -63, -61, -62, -63, -63, -63, -63, -62, -63, -64, -62, -62, -63, -63, -63, -63, -63, -63, -63, -63, -62, -63, -63, -63, -64, -62, -62, -63, -63, -63, -62, -62, -62, -62, -63, -64, -63, -63, -63, -63, -63, -62, -62, -62, -63, -62, -64, -63, -63, -62, -64, -63, -62, -64, -63, -63, -63, -63, -63, -63, -63, -62, -63, -63, -63, -63, -63, -63, -63, -64, -63, -62, -63, -64, -63]
-84766f3%%%%%%Jj%%J%j%%%%%%jJJj%%%%%%%%%%%%Jj%%%%%%%%%%%jJJjJ%%j%%%%%%%%%j%J
-84808f3Jjj%%%%J%%%Jk%JJjjjJ%J%%%%%jJ%%JkJ%jJ%%%%%jJ%%jJ%kJKj%%%j%JjJj%JJ%%j
-84850f3%%jJjJ%jJjJ%j%Jj%J%%%j%J%jJj%%Jj%J%j%%%JjJ%%j%%%JJj%%%%jJJkJ%jJ%j%%%
-84892f4J%j%%%%JjJ%j%J%%%%%%jJ%j%JjJ%j%J%kJ%%%%JjJ%j%%%Jj%Kjj%J%jKkJ%j%%%Jj%
-84934f4%%%Jj%jJJ%%%%jJj%J%%jJj%%%%J%%jKj%j%j%K%j%%J%%%%jJ%j%Jj%jKjJ%j%%Jj%J
-84976f3jJ%%%%%%Jjj%%%jJ%J%j%%%Jj%%%J%jJ%%jjJJj%%%Jj%jJ%%%%jJJj%%%%%%%%%%%%%
-85017f4%%%JJkJ%jjJjJJj%%%j%JJj%%%%%j%J%%J%%j%%%%JjJ%j%jJ%%%jJ%%%%%kJJJ%%j%%
-85059f4J%jjJ%jJ%%%%%%J%jJ%kJJjjJjJj%%%%%%J%%%%Kl%J%%%J%k%%J%%jK%j%jJ%%Jj%j%
$$ y = [-63, -63, -63, -63, -63, -63, -63, -62, -63, -63, -63, -62, -62, -63, -63, -63, -63, -63, -63, -63, -64, -63, -62, -63, -63, -63, -63, -63, -63, -63, -63, -63, -63, -63, -63, -63, -62, -63, -63, -63, -63, -63, -63, -63, -63, -63, -63, -63, -63, -64, -63, -62, -63, -62, -62, -62, -63, -63, -63, -63, -63, -63, -63, -63, -63, -63, -64, -64, -63, -62, -63, -64, -64, -64, -64, -64, -63, -63, -63, -63, -62, -64, -64, -63, -62, -63, -64, -65, -64, -64, -63, -63, -63, -63, -63, -63, -64, -63, -63, -63, -62, -64, -63, -63, -64, -63, -63, -63, -63, -63, -63, -64, -63, -63, -63, -64, -63, -63, -65, -64, -62, -63, -63, -63, -63, -64, -64, -63, -64, -63, -64, -64, -63, -62, -62, -62, -63, -63, -63, -64, -63, -64, -63, -63, -64, -63, -64, -63, -63, -64, -64, -63, -64, -64, -63, -63, -63, -63, -64, -64, -63, -63, -64, -63, -64, -64, -64, -63, -64, -64, -63, -63, -64, -64, -64, -64, -63, -64, -63, -63, -63, -64, -64, -64, -64, -63, -62, -63, -63, -63, -63, -63, -64, -63, -62, -64, -63, -63, -64, -63, -63, -64, -64, -64, -64, -63, -63, -64, -64, -64, -64, -64, -63, -64, -63, -63, -64, -64, -63, -63, -63, -63, -63, -63, -63, -64, -63, -63, -64, -64, -63, -64, -63, -63, -64, -64, -63, -63, -65, -64, -64, -64, -64, -64, -63, -64, -63, -63, -64, -64, -64, -64, -63, -64, -64, -62, -63, -64, -64, -63, -63, -64, -62, -64, -63, -63, -64, -64, -64, -64, -63, -64, -64, -64, -64, -64, -63, -64, -64, -65, -64, -63, -63, -63, -63, -63, -64, -63, -64, -64, -63, -63, -63, -64, -63, -64, -64, -64, -64, -64, -63, -63, -63, -64, -62, -63, -63, -64, -64, -65, -65, -63, -63, -64, -64, -64, -63, -63, -63, -63, -63, -64, -63, -63, -64, -64, -63, -64, -64, -65, -63, -64, -63, -63, -64, -64, -64, -63, -64, -64, -63, -64, -63, -63, -63, -63, -63, -63, -63, -62, -63, -64, -64, -64, -64, -65, -64, -64, -63, -63, -64, -64, -64, -64, -63, -64, -64, -64, -64, -63, -63, -64, -63, -63, -63, -64, -65, -64, -63, -64, -64, -64, -64, -63, -64, -64, -65, -64, -64, -64, -64, -64, -65, -64, -63, -64, -64, -64, -64, -64, -64, -64, -64, -64, -64, -64, -64, -64, -64, -64, -64, -64, -63, -62, -64, -63, -63, -64, -65, -64, -65, -64, -63, -64, -64, -64, -64, -65, -65, -64, -63, -64, -64, -64, -64, -64, -64, -65, -65, -64, -64, -64, -63, -63, -63, -64, -64, -64, -64, -64, -63, -64, -63, -63, -64, -64, -65, -64, -64, -64, -64, -65, -64, -64, -64, -64, -64, -64, -66, -65, -64, -63, -63, -63, -64, -64, -64, -63, -63, -64, -65, -64, -64, -65, -64, -64, -64, -64, -64, -64, -64, -63, -63, -64, -63, -63, -65, -64, -63, -64, -65, -64, -65, -64, -65, -65, -65, -65, -65, -65, -65, -64, -64, -64, -64, -64, -62, -65, -65, -64, -64, -64, -64, -63, -63, -65, -65, -65, -64, -64, -64, -65, -63, -63, -64, -64, -65, -64, -64, -64, -63, -64, -64, -65, -65]
-85101f5JJj%J%j%j%J%%j%%%%J%%%%kK%jJJj%%%%JjjJ%%%%%JjjJ%%%%%jJ%%%%jJ%%j%J%Jj
-85143f4jJ%%%%j%J%%Jjj%%J%%%jJ%%%%JkJ%%%%%%%JjjJ%%%%%jJ%%%%%%%j%%J%%%%%%jJj%
-85185f5J%%%jJ%%%%%jJ%%%jJj%%J%j%%%%J%%j%%%J%%%j%JJj%j%%%%J%%%Jj%%j%J%Jj%%%j
-85227f5%%J%%%j%J%%%jJ%j%J%%J%%j%%j%%%%Jj%JjJj%%%%%jJJjKjj%%%J%%%j%%J%%%jJ%%
-85269f4jjJ%%%%%%%jJ%jJ%%%%%jJ%%%%%%%%%jJ%J%%%j%%%%JjJ%j%%%%J%%j%%%%%J%j%%Jj
-85310f5%jJ%%J%j%Jk%J%%%Jj%Jj%%%%%%%Jj%%J%j%%%%J%%%j%%Jj%%%%%%JjJ%%%jJjJ%%j%
-85352f5%%%%%Jj%jKj%%%%%%%%%%jJJj%%%%%%%%jJ%%%%%%%%%%jKkJ%jJj%JjJJjjKj%%%%%J
-85394f4j%%%%%%%%%jJ%%%%%%%%J%j%%J%%j%j%%JjJ%%%%jJ%jJ%%%%jJ%%jJ%%%%jJj%%K%%%
$$ y = [-65, -64, -63, -64, -64, -63, -63, -64, -64, -65, -65, -64, -64, -64, -65, -65, -65, -65, -65, -64, -64, -64, -64, -64, -66, -64, -64, -65, -64, -63, -64, -64, -64, -64, -64, -63, -64, -65, -64, -64, -64, -64, -64, -64, -63, -64, -65, -64, -64, -64, -64, -64, -64, -65, -64, -64, -64, -64, -64, -65, -64, -64, -64, -65, -65, -64, -64, -63, -64, -65, -64, -64, -64, -64, -64, -65, -65, -64, -64, -64, -63, -64, -65, -65, -65, -64, -64, -64, -64, -65, -64, -64, -64, -64, -64, -63, -65, -64, -64, -64, -64, -64, -64, -64, -64, -63, -64, -65, -64, -64, -64, -64, -64, -64, -65, -64, -64, -64, -64, -64, -64, -64, -64, -65, -65, -65, -64, -64, -64, -64, -64, -64, -64, -65, -64, -65, -65, -64, -64, -64, -64, -65, -64, -64, -64, -64, -64, -64, -65, -64, -64, -64, -64, -65, -64, -65, -65, -65, -64, -64, -65, -65, -65, -65, -65, -64, -64, -64, -65, -65, -65, -65, -64, -64, -64, -64, -65, -65, -64, -63, -64, -64, -65, -65, -65, -65, -65, -64, -64, -64, -64, -63, -64, -64, -64, -65, -65, -64, -64, -63, -64, -64, -64, -64, -65, -65, -65, -64, -64, -64, -64, -65, -65, -64, -64, -64, -64, -65, -64, -64, -65, -65, -64, -64, -64, -63, -63, -63, -64, -64, -64, -65, -65, -65, -65, -65, -64, -65, -65, -64, -65, -64, -65, -65, -65, -65, -65, -65, -66, -65, -64, -65, -63, -64, -65, -65, -65, -65, -64, -64, -64, -64, -65, -65, -65, -64, -64, -64, -64, -65, -64, -64, -64, -65, -66, -65, -65, -65, -65, -65, -65, -65, -65, -66, -65, -65, -66, -65, -65, -65, -65, -65, -65, -66, -65, -65, -65, -65, -65, -65, -65, -65, -65, -65, -66, -65, -65, -64, -64, -64, -64, -65, -65, -65, -65, -65, -64, -65, -64, -64, -65, -65, -65, -65, -65, -64, -64, -64, -65, -65, -65, -65, -65, -65, -64, -64, -65, -65, -65, -64, -65, -65, -66, -65, -65, -65, -64, -64, -65, -65, -64, -66, -66, -65, -65, -65, -65, -64, -65, -65, -64, -65, -65, -65, -65, -65, -65, -65, -65, -64, -65, -65, -65, -64, -64, -65, -65, -65, -65, -65, -64, -64, -64, -64, -65, -65, -65, -64, -65, -65, -65, -65, -65, -65, -65, -64, -65, -64, -64, -64, -64, -65, -64, -65, -64, -64, -64, -65, -65, -65, -65, -65, -65, -65, -64, -65, -65, -66, -64, -65, -65, -65, -65, -65, -65, -65, -65, -65, -65, -65, -66, -65, -64, -65, -65, -65, -65, -65, -65, -65, -65, -65, -66, -65, -65, -65, -65, -65, -65, -65, -65, -65, -65, -65, -66, -64, -66, -65, -65, -66, -65, -66, -66, -65, -66, -65, -64, -65, -66, -64, -65, -65, -65, -65, -65, -65, -64, -65, -65, -65, -65, -65, -65, -65, -65, -65, -65, -66, -65, -65, -65, -65, -65, -65, -65, -65, -65, -64, -64, -65, -65, -65, -64, -64, -64, -65, -65, -66, -66, -66, -65, -66, -65, -65, -65, -65, -65, -66, -65, -65, -66, -65, -65, -65, -65, -65, -66, -65, -65, -65, -66, -65, -65, -65, -65, -65, -66, -65, -66, -66, -66, -64, -64, -64, -64]
-85436f4j%jJJjjJ%%J%kJ%J%jJj%%J%j%%%%jJ%%%%%jJJjjJ%%%%j%JjJjJ%%%jJjJ%j%JJj%%
-85478f5%%j%%J%%j%JjJ%%J%jJ%jj%J%%%%%%%%jJ%j%KjjJJjjJ%%%jJ%Jj%%%J%jj%%Kjj%Jj
-85520f6%%%J%jJ%%Jk%J%%%%%%%%%j%J%%%%%jJ%jjJ%%%JjJ%%%%%JkJ%%jJJjj%%J%j%%J%jJ
-85561f5%%j%%%%%J%%jJ%%%%%%j%J%%%%jJ%%jJJj%%j%%J%%%j%%J%jJ%%j%%J%%j%J%jJjJ%%
-85603f5jJ%j%jKjJj%%%%%J%%jJjJ%j%J%%j%%%%%%%%%Jj%jKj%%%%%J%j%J%%%%%j%Kj%%j%%
-85645f6JjJ%j%%%%%%%%%J%jJ%j%%%J%jJj%%J%j%%%%%JjJ%j%J%%j%jJJj%J%%Jj%%j%jJJj%
-85687f6%%%Jj%J%jJj%%%%JjJ%kJ%JjjJ%%%J%%%%%%%j%%%%%%J%kJJj%%%%%%%J%j%%%%%%%%
-85729f6%%%%%%%%%%Jj%%%%J%j%%%%%jJ%Jj%%%jJ%Jj%%%%Jj%%%%%%%%%%Jj%%%%jJj%J%%%%
$$ y = [-64, -65, -65, -66, -65, -64, -65, -66, -65, -65, -65, -64, -64, -66, -65, -65, -64, -64, -65, -64, -65, -65, -65, -64, -64, -65, -65, -65, -65, -65, -66, -65, -65, -65, -65, -65, -65, -66, -65, -64, -65, -66, -65, -65, -65, -65, -65, -66, -66, -65, -66, -65, -66, -65, -65, -65, -65, -66, -65, -66, -65, -65, -66, -66, -65, -64, -65, -65, -65, -65, -65, -66, -66, -66, -65, -65, -65, -66, -66, -65, -66, -65, -65, -65, -64, -64, -65, -64, -64, -65, -66, -66, -65, -65, -65, -65, -65, -65, -65, -65, -65, -66, -65, -65, -66, -66, -64, -65, -66, -65, -64, -65, -66, -65, -65, -65, -65, -66, -65, -65, -64, -65, -65, -65, -65, -64, -64, -65, -66, -66, -66, -64, -65, -66, -66, -65, -66, -66, -66, -66, -65, -65, -66, -65, -65, -65, -64, -66, -66, -65, -65, -65, -65, -65, -65, -65, -65, -65, -65, -66, -66, -65, -65, -65, -65, -65, -65, -66, -65, -65, -66, -67, -66, -66, -66, -66, -65, -66, -65, -65, -65, -65, -65, -65, -64, -66, -65, -65, -65, -66, -65, -64, -65, -66, -66, -66, -65, -65, -66, -66, -66, -65, -65, -66, -65, -65, -65, -66, -66, -66, -66, -66, -66, -65, -65, -65, -66, -65, -65, -65, -65, -65, -65, -65, -66, -66, -65, -65, -65, -65, -65, -66, -65, -65, -65, -66, -65, -64, -65, -65, -65, -66, -66, -66, -65, -65, -65, -65, -66, -66, -66, -65, -65, -66, -65, -65, -65, -66, -66, -66, -65, -65, -65, -66, -66, -65, -65, -66, -65, -66, -65, -65, -65, -66, -65, -65, -66, -66, -67, -65, -66, -65, -66, -66, -66, -66, -66, -66, -65, -65, -65, -66, -65, -66, -65, -65, -66, -66, -65, -65, -65, -66, -66, -66, -66, -66, -66, -66, -66, -66, -66, -65, -66, -66, -67, -65, -66, -66, -66, -66, -66, -66, -65, -65, -66, -66, -65, -65, -65, -65, -65, -65, -66, -66, -64, -65, -65, -65, -66, -66, -66, -65, -66, -65, -65, -66, -66, -66, -66, -66, -66, -66, -66, -66, -66, -65, -65, -66, -65, -65, -66, -66, -66, -66, -65, -65, -66, -65, -66, -66, -66, -65, -65, -66, -66, -66, -66, -66, -66, -65, -66, -65, -65, -66, -66, -65, -65, -65, -66, -66, -67, -66, -65, -66, -66, -65, -65, -65, -64, -65, -65, -65, -66, -66, -67, -66, -65, -66, -66, -66, -66, -66, -65, -66, -66, -65, -65, -66, -65, -66, -66, -66, -66, -66, -65, -66, -65, -65, -67, -66, -66, -65, -66, -67, -66, -66, -66, -66, -65, -65, -65, -65, -65, -65, -65, -65, -66, -66, -66, -66, -66, -66, -66, -65, -65, -67, -66, -65, -66, -66, -66, -66, -66, -66, -66, -66, -65, -65, -66, -66, -66, -66, -66, -66, -66, -66, -66, -66, -66, -66, -66, -66, -66, -66, -66, -66, -66, -65, -66, -66, -66, -66, -66, -65, -65, -66, -66, -66, -66, -66, -66, -67, -66, -66, -65, -66, -66, -66, -66, -67, -66, -66, -65, -66, -66, -66, -66, -66, -65, -66, -66, -66, -66, -66, -66, -66, -66, -66, -66, -66, -65, -66, -66, -66, -66, -66, -67, -66, -67, -67, -66, -66, -66, -66, -66]
-85771f6%%%%%%%jJ%%%%J%Jk%jJj%J%%%%%%%%%%jJjJ%Jj%Jj%%%%%%%%%%%%%%%%j%%%J%%Jk
-85812f7J%%%Jj%%j%%jKjJ%%%%%%%jJJ%j%JjjJ%%%%%j%J%jJ%%j%J%jJ%%jJ%jJ%%%%%%%j%J
-85854f6%%J%j%jKj%%%Jjj%J%jJ%%%jJ%%%%jJJkJJjj%J%j%%J%%%%%jJ%%%%%%j%%%JJj%jJ%
-85896f6%%%%%j%J%j%J%%j%JJj%%%%Jj%%%%%%%%j%Jj%%J%j%%%%J%jJj%%%%J%j%%J%%%%%j%
-85938f7%Jj%%%%%%%%%%%%%%%%%%%%%JjJ%%%jJ%%%%%%j%%Jj%Jj%%%JjJ%%j%J%j%J%%kJ%%%
-85980f7%J%%%j%%%Jj%%J%kJ%J%jJjjJ%%J%j%%%%%%%%%%%Jj%%%Jj%%%j%J%%%J%jJ%%%%%%%
-86022f6kJ%JjjJJ%jJ%%j%%%%%Jj%%%jJKk%%%%%%%j%J%JkJ%jJ%j%JJj%%JjJj%%%JkK%jJj%
-86063f7%%JjJj%Jj%%%j%JJjj%JjJ%%j%J%%%%%Jj%Jj%%JjJ%j%%%%JjJ%j%J%j%Jj%%JjJj%%
$$ y = [-66, -66, -66, -66, -66, -66, -66, -66, -67, -66, -66, -66, -66, -66, -65, -65, -64, -66, -66, -67, -66, -67, -67, -66, -66, -66, -66, -66, -66, -66, -66, -66, -66, -66, -67, -66, -67, -66, -66, -65, -66, -66, -65, -66, -66, -66, -66, -66, -66, -66, -66, -66, -66, -66, -66, -66, -66, -66, -66, -66, -67, -67, -67, -67, -66, -66, -66, -65, -67, -66, -66, -66, -66, -65, -66, -66, -66, -67, -67, -67, -68, -66, -67, -66, -66, -66, -66, -66, -66, -66, -66, -67, -66, -65, -65, -66, -66, -65, -66, -67, -66, -66, -66, -66, -66, -66, -67, -67, -66, -66, -67, -66, -66, -66, -67, -67, -66, -66, -67, -66, -66, -66, -67, -66, -66, -67, -66, -66, -66, -66, -66, -66, -66, -66, -67, -67, -66, -66, -66, -65, -65, -66, -66, -67, -65, -66, -66, -66, -66, -65, -66, -67, -67, -66, -66, -67, -66, -66, -66, -66, -67, -66, -66, -66, -66, -66, -67, -66, -65, -67, -66, -65, -66, -67, -67, -66, -66, -67, -67, -67, -66, -66, -66, -66, -66, -66, -67, -66, -66, -66, -66, -66, -66, -66, -67, -67, -67, -67, -66, -65, -66, -66, -67, -66, -66, -66, -66, -66, -66, -66, -67, -67, -66, -66, -67, -67, -66, -66, -66, -67, -67, -66, -65, -66, -66, -66, -66, -66, -65, -66, -66, -66, -66, -66, -66, -66, -66, -66, -67, -67, -66, -67, -67, -67, -66, -66, -67, -67, -67, -67, -67, -66, -66, -67, -66, -67, -67, -67, -67, -67, -66, -66, -67, -67, -67, -66, -66, -66, -66, -66, -66, -67, -67, -67, -66, -67, -67, -67, -67, -67, -67, -67, -67, -67, -67, -67, -67, -67, -67, -67, -67, -67, -67, -67, -67, -67, -67, -66, -67, -66, -66, -66, -66, -67, -66, -66, -66, -66, -66, -66, -66, -67, -67, -67, -66, -67, -67, -66, -67, -67, -67, -67, -66, -67, -66, -66, -66, -67, -67, -66, -66, -67, -67, -66, -66, -66, -68, -67, -67, -67, -67, -67, -66, -66, -66, -66, -67, -67, -67, -67, -66, -67, -67, -67, -66, -66, -68, -67, -67, -66, -66, -67, -66, -67, -68, -67, -67, -67, -66, -66, -67, -67, -67, -67, -67, -67, -67, -67, -67, -67, -67, -67, -66, -67, -67, -67, -67, -66, -67, -67, -67, -67, -68, -68, -67, -67, -67, -67, -66, -66, -67, -66, -66, -66, -66, -66, -66, -66, -66, -68, -67, -67, -66, -67, -68, -67, -66, -66, -67, -66, -66, -66, -67, -67, -67, -67, -67, -67, -66, -67, -67, -67, -67, -68, -67, -65, -67, -67, -67, -67, -67, -67, -67, -67, -68, -68, -67, -67, -66, -68, -67, -67, -68, -67, -67, -68, -68, -67, -66, -67, -67, -67, -66, -67, -66, -67, -67, -67, -67, -66, -68, -66, -66, -67, -66, -67, -67, -67, -67, -66, -67, -66, -67, -67, -66, -67, -67, -67, -67, -68, -68, -67, -66, -67, -68, -68, -67, -68, -67, -67, -67, -68, -68, -67, -67, -67, -67, -67, -67, -66, -67, -67, -66, -67, -67, -67, -66, -67, -66, -66, -67, -67, -67, -67, -67, -66, -67, -66, -66, -67, -67, -66, -66, -67, -67, -66, -67, -67, -67, -66, -67, -66, -67, -67, -67]
-86105f7Jj%jJJj%%%jJ%%j%J%%%j%J%%%%%Jj%%%jJ%%%jJ%%%jJ%%%%%Jj%%jJJj%%%%%%%%%%
-86147f7%jJjJJjjJ%%%%%Jj%%%J%j%%jJ%%%j%J%%j%%%J%%j%JjKjjJ%%%%%%%%%j%%%JJjjJj
-86189f8J%%%%jJj%J%%%jJj%%J%jJkJJj%%J%%%jJ%jJ%%jJ%%%%JkJ%%%%j%J%%%j%%%J%Jj%%
-86231f7%%jJ%%%JjjJ%%j%%J%%%%%%jJJ%j%jJ%%%%%%%%%%%%%jJjJ%%%j%%%J%jjJ%%%J%j%%
-86273f8J%jJ%j%Jj%%%%%%%%J%j%J%j%%Jj%JJj%jJkJJ%j%%Jj%jJJ%j%%%%Jj%%%Jj%JJjjJ%
-86314f7jJJk%J%%%j%%J%j%%J%%%%j%%J%j%Jj%J%jJ%%jjK%%%%JkJ%%%j%%%%%%%%%JjJjJj%
-86356f8Jj%Jj%%%J%j%J%%%j%%%%%%%Jj%Jjj%J%%%jJJ%%%j%%%jJ%Jj%%%Jj%JjjJ%%%%j%J%
-86398f8%%%%jJJ%j%%jJJj%J%%jjKjJj%%jKj%%%%%Jj%J%%j%%%Jj%%%JjJ%j%%%%%%Jj%%%%%
$$ y = [-67, -66, -67, -67, -68, -67, -66, -67, -67, -67, -67, -68, -67, -67, -67, -68, -68, -67, -67, -67, -67, -68, -68, -67, -67, -67, -67, -67, -67, -66, -67, -67, -67, -67, -68, -67, -67, -67, -67, -68, -67, -67, -67, -67, -68, -67, -67, -67, -67, -67, -67, -66, -67, -67, -67, -68, -67, -66, -67, -67, -67, -67, -67, -67, -67, -67, -67, -67, -67, -67, -68, -67, -68, -67, -66, -67, -68, -67, -67, -67, -67, -67, -67, -66, -67, -67, -67, -67, -66, -66, -67, -67, -67, -68, -67, -67, -67, -67, -68, -68, -67, -67, -67, -68, -68, -68, -68, -67, -67, -67, -68, -68, -67, -68, -66, -67, -68, -67, -67, -67, -67, -67, -67, -67, -67, -67, -67, -68, -68, -68, -68, -67, -66, -67, -68, -67, -68, -67, -67, -67, -67, -67, -68, -67, -68, -68, -67, -67, -67, -67, -68, -67, -68, -68, -68, -67, -67, -68, -67, -69, -68, -67, -68, -68, -68, -67, -67, -67, -67, -68, -67, -67, -68, -67, -67, -67, -68, -67, -67, -67, -67, -67, -66, -68, -67, -67, -67, -67, -67, -68, -68, -67, -67, -67, -67, -68, -68, -68, -68, -67, -67, -66, -67, -67, -67, -67, -67, -68, -67, -67, -67, -67, -66, -67, -68, -67, -67, -67, -68, -68, -68, -67, -67, -67, -67, -67, -67, -67, -68, -67, -66, -66, -67, -67, -68, -67, -67, -67, -67, -67, -67, -67, -67, -67, -67, -67, -67, -67, -67, -68, -67, -68, -67, -67, -67, -67, -68, -68, -68, -68, -67, -67, -68, -69, -68, -68, -68, -68, -67, -67, -68, -68, -68, -67, -67, -68, -67, -67, -68, -68, -67, -68, -68, -68, -68, -68, -68, -68, -68, -68, -67, -67, -68, -68, -67, -67, -68, -68, -68, -67, -68, -68, -67, -66, -67, -67, -68, -67, -69, -68, -67, -67, -68, -68, -68, -67, -68, -68, -69, -68, -67, -67, -68, -68, -68, -68, -68, -67, -68, -68, -68, -68, -67, -68, -68, -67, -66, -67, -68, -67, -67, -68, -67, -66, -68, -68, -67, -67, -67, -67, -68, -68, -68, -67, -67, -68, -68, -68, -67, -67, -67, -67, -67, -68, -68, -68, -67, -67, -68, -68, -67, -68, -68, -67, -67, -68, -67, -67, -67, -68, -69, -67, -67, -67, -67, -67, -66, -68, -67, -67, -67, -67, -68, -68, -68, -68, -68, -68, -68, -68, -68, -68, -67, -68, -67, -68, -67, -68, -68, -67, -68, -68, -67, -68, -68, -68, -68, -67, -67, -68, -68, -67, -67, -67, -67, -68, -68, -68, -68, -68, -68, -68, -68, -67, -68, -68, -67, -68, -69, -69, -68, -68, -68, -68, -69, -68, -67, -67, -67, -67, -68, -68, -68, -68, -69, -68, -68, -67, -68, -68, -68, -68, -67, -68, -68, -67, -68, -69, -68, -68, -68, -68, -68, -69, -69, -68, -68, -68, -68, -68, -68, -69, -68, -67, -67, -68, -68, -68, -69, -68, -67, -68, -68, -67, -67, -67, -68, -69, -67, -68, -67, -68, -68, -68, -69, -67, -68, -68, -68, -68, -68, -68, -67, -68, -68, -67, -67, -67, -68, -68, -68, -68, -67, -68, -68, -68, -68, -67, -68, -67, -67, -68, -68, -68, -68, -68, -68, -68, -67, -68, -68, -68, -68, -68, -68]
-86440f8%%%%%%%%%%%Jj%J%%j%%J%%j%%%Jj%jJ%%Jjj%J%%%%%%jJ%%%%%%%jJ%%%%%JkJjJ%j
-86482f9J%%%%%j%%J%jJ%%%%%%%Jj%Jj%%%jJ%%%%jJ%%%jJJj%%%%JkJ%%%JkJ%jJ%%%j%J%jJ
-86524f8%%%JjJj%%%j%%%JKk%%jJ%%jJjJ%jJ%jJ%J%j%jJj%%%%%J%%%%%%%%j%Jj%%%%%jJJ%
-86566f8j%J%%%j%J%Jj%jJjJ%Jj%%j%J%jJ%%%%%%Jj%%%%%%%%%%jJj%%J%%jJ%Jj%%%%%%%%%
-86607f8%%%%%j%Jj%JJk%%%J%j%J%%jJ%%%%%j%J%j%%J%%%J%jj%J%%%j%Jj%%%%Jj%J%%%jJ%
-86649f8%%%%jJj%%%%%%%%J%%j%%jJ%%J%%j%J%j%%%%%J%%jJ%jKjj%%%Jj%JjJ%j%JkKj%%J%
-86691f8jJjJj%%%%J%%%%%%%%jJ%%j%%%Jj%%%jJ%%%j%J%%%J%%%%j%Jj%J%j%%Jj%J%j%%J%%
-86733f8%%j%%%%J%%%j%%JjJjJ%jJjJkJJj%%%%Jk%J%%%%%j%J%%J%jJ%j%%%JjjJ%%%%%%Jj%
$$ y = [-68, -68, -68, -68, -68, -68, -68, -68, -68, -68, -68, -68, -67, -68, -68, -67, -67, -67, -68, -68, -68, -67, -67, -67, -68, -68, -68, -68, -67, -68, -68, -69, -68, -68, -68, -67, -68, -69, -69, -68, -68, -68, -68, -68, -68, -68, -69, -68, -68, -68, -68, -68, -68, -68, -68, -69, -68, -68, -68, -68, -68, -68, -67, -69, -68, -69, -68, -68, -69, -68, -68, -68, -68, -68, -68, -69, -69, -69, -68, -68, -69, -68, -68, -68, -68, -68, -68, -68, -68, -67, -68, -68, -67, -68, -68, -68, -68, -69, -68, -68, -68, -68, -68, -69, -68, -68, -68, -68, -69, -68, -67, -68, -68, -68, -68, -68, -67, -69, -68, -68, -68, -68, -67, -69, -68, -68, -69, -68, -68, -68, -68, -69, -69, -68, -68, -69, -68, -68, -68, -68, -67, -68, -67, -68, -68, -68, -68, -69, -69, -69, -69, -68, -66, -68, -68, -68, -69, -68, -68, -68, -69, -68, -69, -68, -68, -69, -68, -68, -69, -68, -68, -67, -67, -68, -68, -69, -68, -69, -69, -69, -69, -69, -69, -68, -68, -68, -68, -68, -68, -68, -68, -68, -69, -69, -68, -69, -69, -69, -69, -69, -69, -70, -69, -68, -68, -69, -69, -68, -68, -68, -68, -69, -69, -68, -68, -67, -68, -68, -69, -68, -69, -68, -68, -67, -68, -68, -68, -69, -69, -68, -68, -69, -68, -68, -68, -68, -68, -68, -68, -67, -68, -68, -68, -68, -68, -68, -68, -68, -68, -68, -68, -69, -68, -69, -69, -69, -68, -68, -68, -69, -68, -68, -67, -68, -68, -68, -68, -68, -68, -68, -68, -68, -68, -68, -68, -68, -68, -68, -69, -69, -68, -69, -69, -68, -67, -69, -69, -69, -69, -68, -68, -69, -69, -68, -68, -68, -69, -68, -68, -68, -68, -68, -68, -69, -69, -68, -68, -69, -69, -69, -68, -68, -68, -68, -67, -67, -68, -69, -69, -68, -68, -68, -68, -69, -69, -68, -69, -69, -69, -69, -69, -68, -69, -69, -68, -68, -68, -68, -69, -68, -68, -68, -68, -68, -68, -69, -68, -69, -69, -69, -69, -69, -69, -69, -69, -69, -68, -68, -68, -69, -69, -69, -70, -69, -69, -69, -68, -68, -68, -69, -69, -68, -68, -69, -69, -69, -69, -69, -69, -68, -68, -68, -69, -68, -68, -69, -67, -68, -69, -69, -69, -69, -68, -69, -69, -68, -69, -68, -68, -69, -69, -68, -70, -68, -69, -69, -69, -68, -68, -69, -68, -69, -68, -69, -69, -69, -69, -69, -68, -68, -68, -68, -68, -68, -68, -68, -68, -69, -68, -68, -68, -69, -69, -69, -69, -68, -69, -69, -69, -69, -70, -69, -69, -69, -69, -70, -70, -69, -69, -69, -69, -68, -68, -68, -68, -68, -69, -69, -68, -69, -69, -68, -68, -69, -69, -69, -68, -69, -69, -68, -68, -69, -69, -69, -68, -68, -68, -68, -68, -69, -69, -69, -69, -69, -68, -68, -68, -68, -69, -69, -69, -68, -69, -68, -69, -68, -68, -69, -68, -69, -68, -70, -69, -68, -69, -69, -69, -69, -69, -68, -70, -70, -69, -69, -69, -69, -69, -69, -70, -70, -69, -69, -69, -68, -68, -69, -68, -68, -69, -69, -69, -69, -68, -69, -70, -69, -69, -69, -69, -69, -69, -69, -68, -69, -69]
-86775f9%%%Jj%Jj%%%JkJ%%%%JjJj%J%j%%Jj%%%Jj%%%%%J%jjJ%%%%Jj%%%%%%%%%%%J%j%%%
-86817f9%JjJ%jjJ%jJ%j%%JjJJj%%%%Jj%jKj%%%%jJ%%%%%%jKj%%%Jj%%J%j%%jKjj%Kk%J%%
-86858f9%jJ%%%%%%%jJ%jJ%%%%j%%Kj%%%%%%%%%%%jK%jJ%%jJk%J%Jj%%%%%%%%%jJ%%%%%%%
-86900f9%%%%Jj%%%%jK%j%%jJ%%jJ%jJJjj%J%%%%jJ%%jJ%Jj%jJj%KjjJJj%Jj%Jj%%%%%%jJ
-86942f9%j%%%%%%J%jJkJJ%%j%Jj%J%%%%j%%Jj%JjJ%%%JkJjJ%%%%j%%J%%%%%jJj%%%Jj%J%
-86984f9%%j%%%%JJk%%JJj%%%%%%%%%%%jJj%%KjjJ%Jj%%%%%%%jJJ%j%Jj%%%jJ%%%jJj%%%%
-87026g0%J%%%j%%%%J%%%%%%%%%j%%J%%%%%%jjJ%j%Kj%%J%jJ%j%%%%%J%%%j%%%%%%jKj%J%
-87068f9%jJ%kKj%J%%%%j%%%%%%%%%%jJ%jK%jjJJ%%jJj%%%Jj%%%J%%jJ%%j%%%%%%%%%Jj%%
$$ y = [-69, -69, -69, -69, -68, -69, -69, -68, -69, -69, -69, -69, -68, -70, -69, -69, -69, -69, -69, -68, -69, -68, -69, -69, -68, -68, -69, -69, -69, -68, -69, -69, -69, -69, -68, -69, -69, -69, -69, -69, -69, -68, -68, -69, -70, -69, -69, -69, -69, -69, -68, -69, -69, -69, -69, -69, -69, -69, -69, -69, -69, -69, -69, -68, -68, -69, -69, -69, -69, -69, -68, -69, -68, -68, -69, -70, -69, -69, -70, -69, -69, -70, -70, -70, -69, -70, -69, -68, -69, -69, -69, -69, -69, -68, -69, -69, -70, -68, -69, -69, -69, -69, -69, -70, -69, -69, -69, -69, -69, -69, -69, -70, -68, -69, -69, -69, -69, -68, -69, -69, -69, -68, -68, -69, -69, -69, -70, -68, -69, -70, -70, -68, -70, -70, -69, -69, -69, -69, -70, -69, -69, -69, -69, -69, -69, -69, -69, -70, -69, -69, -70, -69, -69, -69, -69, -69, -70, -70, -70, -68, -69, -69, -69, -69, -69, -69, -69, -69, -69, -69, -69, -69, -70, -68, -68, -69, -68, -68, -68, -69, -68, -70, -70, -69, -69, -68, -69, -69, -69, -69, -69, -69, -69, -69, -69, -69, -70, -69, -69, -69, -69, -69, -69, -69, -69, -69, -69, -69, -69, -68, -69, -69, -69, -69, -69, -70, -68, -68, -69, -69, -69, -70, -69, -69, -69, -70, -69, -69, -70, -69, -68, -69, -70, -70, -69, -69, -69, -69, -69, -70, -69, -69, -69, -70, -69, -69, -68, -69, -69, -70, -69, -70, -70, -68, -69, -70, -69, -68, -69, -69, -68, -69, -69, -68, -69, -69, -69, -69, -69, -69, -69, -70, -69, -69, -70, -70, -70, -70, -70, -70, -70, -69, -69, -70, -69, -71, -70, -69, -69, -69, -70, -70, -69, -70, -70, -69, -69, -69, -69, -69, -70, -70, -70, -69, -70, -70, -69, -70, -69, -69, -69, -69, -68, -70, -69, -70, -69, -69, -69, -69, -69, -70, -70, -70, -69, -69, -69, -69, -69, -69, -70, -69, -70, -70, -70, -70, -69, -70, -70, -69, -69, -69, -69, -70, -70, -70, -70, -70, -69, -68, -70, -70, -70, -69, -68, -69, -69, -69, -69, -69, -69, -69, -69, -69, -69, -69, -69, -70, -69, -70, -70, -70, -68, -69, -70, -69, -69, -68, -69, -69, -69, -69, -69, -69, -69, -69, -70, -69, -68, -68, -69, -69, -68, -69, -69, -69, -69, -70, -69, -69, -69, -69, -70, -69, -70, -70, -70, -70, -70, -70, -69, -69, -69, -69, -70, -70, -70, -70, -70, -69, -69, -69, -69, -69, -69, -69, -69, -69, -69, -70, -70, -70, -69, -69, -69, -69, -69, -69, -69, -70, -71, -70, -70, -71, -71, -69, -70, -70, -70, -69, -69, -70, -69, -69, -70, -70, -70, -70, -70, -70, -69, -69, -69, -69, -70, -70, -70, -70, -70, -70, -70, -71, -69, -70, -70, -69, -69, -69, -70, -69, -69, -71, -69, -70, -70, -69, -69, -69, -69, -69, -70, -70, -70, -70, -70, -70, -70, -70, -70, -70, -70, -71, -70, -70, -71, -69, -69, -70, -71, -70, -69, -69, -69, -70, -69, -70, -70, -70, -70, -69, -70, -70, -70, -70, -69, -69, -69, -70, -69, -69, -69, -70, -70, -70, -70, -70, -70, -70, -70, -70, -70, -69, -70, -70, -70]
-87109g0%%%%%JjjJJjJ%%%j%%%%JjJj%%%%J%jj%%J%%%%%%%%%%%%%J%%%%j%Jj%%%%%%Jj%%j
-87151g1JJj%%%%J%jjJ%%Jjj%JJj%%%Jj%jJ%%Jj%jJ%%%%jJ%jJ%%%Jj%j%J%Jj%J%%kJj%J%j
-87193g1J%J%%j%%j%%%JJ%j%%%%%Jj%%%%%%%%%j%%J%%%J%j%%%%%%%%%%JjjJ%%jJ%j%J%%jJ
-87235g0kKjJJkKk%%%JjJ%%jJ%jJJjj%J%%%%%%%%%%%jJ%kLjJj%%%jJ%%%J%%jJj%%j%J%%j%
-87277g1%J%%%%%%Jj%%%%j%%J%j%J%jJ%%%%%%%%%%jJjJ%%%%jJ%%%%j%J%%%%%%jKj%%%%%%%
-87319g0%%%j%%Jj%%%%JjJ%%%%j%J%jJ%%j%%%J%%%%jJ%%%%%jJJkJj%%%J%%%jJ%%%j%%%%%%
-87360g1%%%J%jJ%%%%%%Jj%jJ%jJ%jJ%%%%JjJj%%%j%JjJj%Jj%Jj%%J%JkJ%%%%%%%%%j%J%j
-87402g1%%%%J%jJ%%j%J%%%jJjjK%%%jJ%%j%%%J%%%jJ%%Jk%JJjJj%%%%%%%Jk%%%%%%Jj%%%
$$ y = [-70, -70, -70, -70, -70, -70, -69, -70, -71, -70, -69, -70, -69, -69, -69, -69, -70, -70, -70, -70, -70, -69, -70, -69, -70, -70, -70, -70, -70, -69, -69, -70, -71, -71, -71, -70, -70, -70, -70, -70, -70, -70, -70, -70, -70, -70, -70, -70, -70, -69, -69, -69, -69, -69, -70, -70, -69, -70, -70, -70, -70, -70, -70, -70, -69, -70, -70, -70, -71, -70, -69, -70, -70, -70, -70, -70, -69, -69, -70, -71, -70, -70, -70, -69, -70, -71, -71, -70, -69, -70, -70, -70, -70, -69, -70, -70, -71, -70, -70, -70, -69, -70, -70, -71, -70, -70, -70, -70, -70, -71, -70, -70, -71, -70, -70, -70, -70, -69, -70, -70, -71, -71, -70, -70, -69, -70, -70, -69, -69, -69, -71, -70, -71, -71, -70, -70, -71, -70, -70, -69, -69, -69, -70, -70, -70, -71, -71, -71, -71, -70, -69, -69, -70, -70, -70, -70, -70, -70, -69, -70, -70, -70, -70, -70, -70, -70, -70, -70, -70, -71, -71, -71, -70, -70, -70, -70, -69, -69, -70, -70, -70, -70, -70, -70, -70, -70, -70, -70, -70, -69, -70, -71, -70, -70, -70, -71, -70, -70, -71, -71, -70, -70, -70, -71, -70, -72, -70, -71, -70, -69, -71, -69, -71, -71, -71, -71, -70, -71, -70, -70, -70, -71, -70, -70, -71, -70, -69, -70, -71, -71, -70, -70, -70, -70, -70, -70, -70, -70, -70, -70, -70, -70, -71, -70, -70, -72, -69, -70, -69, -70, -70, -70, -70, -71, -70, -70, -70, -70, -69, -69, -69, -70, -69, -70, -70, -70, -71, -71, -70, -70, -70, -71, -71, -71, -70, -70, -70, -70, -70, -70, -70, -69, -70, -70, -70, -70, -70, -71, -71, -71, -70, -70, -71, -71, -70, -70, -71, -70, -70, -70, -70, -70, -70, -70, -70, -70, -70, -70, -71, -70, -71, -70, -70, -70, -70, -70, -71, -70, -70, -70, -70, -70, -71, -71, -70, -70, -70, -70, -70, -70, -70, -71, -69, -70, -70, -70, -70, -70, -70, -70, -70, -70, -70, -70, -71, -71, -71, -70, -71, -71, -71, -71, -71, -70, -71, -70, -70, -70, -70, -70, -71, -71, -70, -70, -71, -70, -70, -70, -71, -71, -71, -71, -70, -70, -70, -70, -70, -71, -70, -70, -70, -70, -70, -70, -71, -70, -69, -71, -70, -71, -71, -71, -71, -70, -70, -70, -70, -71, -70, -70, -70, -70, -71, -71, -71, -71, -71, -71, -71, -71, -71, -71, -70, -70, -71, -70, -70, -70, -70, -70, -70, -70, -69, -70, -70, -71, -70, -70, -71, -70, -70, -71, -70, -70, -70, -70, -70, -69, -70, -69, -70, -70, -70, -70, -71, -71, -70, -71, -70, -71, -71, -70, -71, -71, -70, -71, -71, -71, -70, -70, -69, -71, -70, -70, -70, -70, -70, -70, -70, -70, -70, -70, -71, -71, -70, -70, -71, -71, -71, -71, -71, -70, -70, -71, -70, -70, -70, -71, -71, -70, -70, -70, -70, -71, -70, -71, -72, -70, -70, -70, -70, -71, -70, -70, -70, -71, -71, -71, -71, -70, -70, -70, -70, -71, -70, -70, -70, -69, -71, -71, -70, -69, -70, -69, -70, -70, -70, -70, -70, -70, -70, -70, -69, -71, -71, -71, -71, -71, -71, -71, -70, -71, -71, -71, -71]
-87444g1%Jj%Jj%%%J%%%j%%Jj%jKj%%Jj%%Jj%JjJj%%%J%j%%Jj%%J%j%JjJ%j%Jj%%%%Jj%JJ
-87486f9j%j%%J%%%%j%J%%%%%j%%%%%%%%%%%%%%%%Jj%%%%%%%%Jj%JkJ%jJ%%J%j%jK%jJjjJ
-87528g1%%%Jj%%%J%j%%%J%j%%JjJj%%%jJ%%J%%jJJk%%%jJJ%JkjK%kJ%Jj%Kjj%JjJ%%%%%j
-87570g1J%jJ%%j%%%%%%JjjJJ%j%%%%%jJJj%JkJ%%%Jj%%Jj%%%%%%%%%%%%J%jjJ%jJ%%%%%%
-87611g1jJ%%%%%%%%jK%j%%%%%JjjJ%%%%Jj%jJJj%%%%%jJ%%kK%%%%%%Jj%%jJJj%%%%jJ%%j
-87653g2J%%%%%jJ%%%%%%%j%J%%%j%%%J%%%%jJ%jJ%%%%jJ%j%J%J%j%%%%%%%j%J%%j%%Kj%j
-87695g2%Jj%%%%J%%%%%%%%J%j%jJjJJj%%%%%%%%%%%%%j%%J%j%%%%Kjj%%%J%jJ%%%%Jj%%J
-87737g0%j%%%%j%J%%jJ%jJjJ%%%%%jJ%%%j%J%%%%%%%j%J%%j%Jj%J%%%jJ%%%j%%%%%J%%j%
$$ y = [-71, -71, -70, -71, -71, -70, -71, -71, -71, -71, -70, -70, -70, -70, -71, -71, -71, -70, -71, -71, -72, -70, -71, -71, -71, -70, -71, -71, -71, -70, -71, -71, -70, -71, -70, -71, -71, -71, -71, -70, -70, -71, -71, -71, -70, -71, -71, -71, -70, -70, -71, -71, -70, -71, -70, -70, -71, -71, -70, -71, -71, -71, -71, -71, -70, -71, -71, -70, -69, -70, -70, -71, -71, -71, -70, -70, -70, -70, -70, -71, -71, -70, -70, -70, -70, -70, -70, -71, -71, -71, -71, -71, -71, -71, -71, -71, -71, -71, -71, -71, -71, -71, -71, -71, -70, -71, -71, -71, -71, -71, -71, -71, -71, -71, -70, -71, -71, -70, -72, -71, -71, -72, -71, -71, -71, -70, -70, -71, -71, -72, -70, -70, -71, -70, -71, -72, -71, -71, -71, -71, -70, -71, -71, -71, -71, -70, -70, -71, -71, -71, -71, -70, -70, -71, -71, -71, -70, -71, -70, -71, -71, -71, -71, -72, -71, -71, -71, -70, -70, -70, -71, -70, -69, -71, -71, -71, -71, -72, -71, -70, -70, -69, -71, -72, -70, -70, -72, -71, -71, -70, -71, -71, -69, -70, -71, -71, -70, -71, -70, -70, -70, -70, -70, -70, -71, -70, -70, -71, -70, -70, -70, -71, -71, -71, -71, -71, -71, -71, -70, -71, -72, -71, -70, -70, -71, -71, -71, -71, -71, -71, -72, -71, -70, -71, -71, -70, -72, -71, -71, -71, -71, -70, -71, -71, -71, -70, -71, -71, -71, -71, -71, -71, -71, -71, -71, -71, -71, -71, -71, -70, -70, -71, -72, -71, -71, -72, -71, -71, -71, -71, -71, -71, -71, -72, -71, -71, -71, -71, -71, -71, -71, -71, -71, -72, -70, -70, -71, -71, -71, -71, -71, -71, -70, -71, -72, -71, -71, -71, -71, -71, -70, -71, -71, -72, -71, -70, -71, -71, -71, -71, -71, -71, -72, -71, -71, -71, -73, -71, -71, -71, -71, -71, -71, -71, -70, -71, -71, -71, -72, -71, -70, -71, -71, -71, -71, -71, -72, -71, -71, -71, -72, -71, -71, -71, -71, -71, -71, -72, -71, -71, -71, -71, -71, -71, -71, -71, -72, -72, -71, -71, -71, -71, -72, -72, -72, -72, -71, -71, -71, -71, -71, -72, -71, -71, -72, -71, -71, -71, -71, -71, -72, -71, -71, -72, -72, -71, -71, -70, -70, -71, -71, -71, -71, -71, -71, -71, -71, -72, -72, -71, -71, -71, -72, -72, -72, -70, -71, -71, -72, -72, -71, -72, -72, -72, -72, -72, -71, -71, -71, -71, -71, -71, -71, -71, -71, -70, -70, -71, -71, -72, -71, -72, -71, -70, -71, -71, -71, -71, -71, -71, -71, -71, -71, -71, -71, -71, -71, -71, -72, -72, -72, -71, -71, -72, -72, -72, -72, -72, -70, -71, -72, -72, -72, -72, -71, -71, -72, -71, -71, -71, -71, -71, -70, -71, -71, -71, -70, -70, -71, -71, -71, -71, -71, -72, -72, -71, -71, -71, -72, -71, -71, -72, -71, -72, -71, -71, -71, -71, -71, -71, -72, -71, -71, -71, -71, -72, -72, -71, -71, -71, -71, -71, -71, -71, -71, -72, -72, -71, -71, -71, -72, -72, -71, -72, -72, -71, -71, -71, -71, -72, -71, -71, -71, -71, -72, -72, -72, -72, -72, -72, -71, -71, -71, -72, -72]
-87779g2%JjJ%j%Jj%Jj%%%%%JjJj%Jj%%%jJJ%%%%%jJjJj%%%%%%%%Jj%%%%J%jJ%%%%jJjJj%
-87821g2J%%jJ%%j%J%%jJjJ%%%jJ%j%J%%%jJ%%j%J%%%%%jJ%jJ%jJ%jJ%%%%j%%%%%%%%J%j%
-87862g2%J%%%jJ%k%%J%%%%j%JJ%j%JjJ%j%J%%j%%%%%%%%%%%%%%%jK%%jJ%%jJ%jKjjJj%J%
-87904g1%%%jJjJj%%%J%jj%%Kj%%%%%%Jj%%%J%%%%%%Jj%%j%%%jKjJ%%j%JjJj%J%jJjJJ%jj
-87946g2Jj%jJ%jJJj%%%%%%%Jj%%%%%%J%%j%%%%%%Jj%Kk%%%j%JJj%%%%%%%J%%%%kJ%%%%%%
-87988g2%%%Jj%%%%%%%%%J%%j%JjjJ%%Jj%Jj%%%%%%jKj%%%jJ%%%%%Jj%%%%%%jJ%JjJj%%%%
-88030g2%J%%jJjJ%jJj%%%%%%%jJ%%%%%%%Jjj%J%JjJ%j%%%%%J%j%JjJj%%%%%%J%jJ%%%%kJ
-88072g2J%jJj%%J%%%jJ%kJJ%%%j%%%J%jJjJ%j%%%J%%jJjjJ%J%%j%J%%%%%%%%jJ%j%%%J%%
$$ y = [-72, -72, -71, -72, -71, -71, -72, -72, -71, -72, -72, -71, -72, -72, -72, -72, -72, -72, -71, -72, -71, -72, -72, -71, -72, -72, -72, -72, -73, -72, -71, -71, -71, -71, -71, -71, -72, -71, -72, -71, -72, -72, -72, -72, -72, -72, -72, -72, -72, -71, -72, -72, -72, -72, -72, -71, -71, -72, -71, -71, -71, -71, -71, -72, -71, -72, -71, -72, -72, -71, -71, -71, -72, -71, -71, -71, -72, -72, -71, -71, -71, -72, -71, -72, -71, -71, -71, -71, -72, -71, -71, -72, -72, -71, -71, -71, -71, -72, -71, -71, -71, -72, -72, -71, -71, -71, -71, -71, -71, -72, -71, -71, -72, -71, -71, -72, -71, -71, -72, -71, -71, -71, -71, -71, -72, -72, -72, -72, -72, -72, -72, -72, -72, -71, -71, -72, -72, -72, -71, -71, -71, -71, -72, -71, -71, -73, -73, -73, -72, -72, -72, -72, -72, -73, -73, -72, -71, -71, -72, -72, -71, -72, -71, -71, -72, -72, -71, -71, -71, -72, -72, -72, -72, -72, -72, -72, -72, -72, -72, -72, -72, -72, -72, -72, -72, -73, -71, -71, -71, -72, -71, -71, -71, -72, -71, -71, -72, -70, -71, -72, -71, -72, -72, -71, -71, -71, -71, -71, -72, -71, -72, -71, -72, -72, -72, -72, -71, -71, -72, -73, -73, -73, -71, -72, -72, -72, -72, -72, -72, -72, -71, -72, -72, -72, -72, -71, -71, -71, -71, -71, -71, -71, -70, -71, -71, -71, -72, -72, -72, -72, -73, -71, -72, -71, -71, -71, -72, -72, -71, -72, -71, -72, -72, -71, -71, -72, -71, -72, -71, -70, -70, -71, -72, -71, -72, -72, -73, -72, -72, -73, -72, -71, -72, -72, -72, -72, -72, -72, -72, -72, -71, -72, -72, -72, -72, -72, -72, -72, -71, -71, -71, -72, -72, -72, -72, -72, -72, -72, -71, -72, -72, -70, -72, -72, -72, -72, -73, -73, -72, -71, -72, -72, -72, -72, -72, -72, -72, -72, -71, -71, -71, -71, -71, -73, -72, -72, -72, -72, -72, -72, -72, -72, -72, -72, -71, -72, -72, -72, -72, -72, -72, -72, -72, -72, -72, -71, -71, -71, -72, -72, -71, -72, -73, -72, -72, -72, -71, -72, -72, -71, -72, -72, -72, -72, -72, -72, -72, -73, -71, -72, -72, -72, -72, -73, -72, -72, -72, -72, -72, -72, -71, -72, -72, -72, -72, -72, -72, -72, -73, -72, -72, -71, -72, -71, -72, -72, -72, -72, -72, -72, -71, -71, -71, -72, -71, -72, -71, -71, -72, -71, -72, -72, -72, -72, -72, -72, -72, -72, -73, -72, -72, -72, -72, -72, -72, -72, -72, -71, -72, -73, -73, -72, -72, -71, -72, -71, -71, -72, -72, -72, -72, -72, -72, -71, -71, -72, -72, -71, -72, -71, -72, -72, -72, -72, -72, -72, -72, -71, -71, -72, -71, -71, -71, -71, -71, -73, -72, -71, -71, -72, -71, -72, -72, -72, -71, -71, -71, -71, -72, -71, -71, -73, -72, -71, -71, -71, -71, -72, -72, -72, -72, -71, -71, -72, -71, -72, -71, -71, -72, -72, -72, -72, -71, -71, -71, -72, -71, -72, -73, -72, -72, -71, -71, -71, -72, -72, -71, -71, -71, -71, -71, -71, -71, -71, -71, -72, -71, -71, -72, -72, -72, -72, -71, -71, -71]
-88114g1%%j%%%Jj%%%%jJ%%J%j%jJ%%%%%Jj%JkJj%J%%%J%jj%%%%J%%%%kJJJj%%j%%%%JJjJ
-88155g1jj%J%j%%Jj%%J%%%%%%%%j%J%%%%%jJ%%J%jj%%Jj%%KkJ%%Jj%%%%%%%jJ%%%jJ%%j%
-88197g3Jj%%J%jJ%%%%%%%%Jj%%jJ%%%%%jJj%J%%%%jKk%JjJjJj%%%%J%%%j%JJkJ%jJJj%%%
-88239g2%%%%%jJjJ%jJJj%%jJjJj%J%%%%%%%jJ%%j%J%%j%JjJjJj%%JjJ%j%%%Jj%%%JjJ%j%
-88281g3%%%%%%%%J%%%JjJj%%j%%Jj%%%%%J%%%%%jJj%J%jJ%%j%%J%jJj%%%%Jj%Jj%%J%%%J
-88323g1k%%J%%%%j%%J%jJ%jjKj%%%JJk%J%%%%j%%J%%j%jJ%%%%%J%%%%j%%%%Jj%jK%%%j%%
-88365g3%jJ%%%%%jJjJ%%%%JjjK%%j%%%%%%J%jJkKj%%%%JkJ%%%%%jJ%%%%J%k%K%j%J%kJ%%
-88406g3%%%%%%%%jJ%%%%%Jj%JkJ%%J%j%%%J%%jJj%%%J%%%j%%%Jk%J%jJJjJ%j%%%%jJ%J%%
$$ y = [-71, -71, -71, -72, -72, -72, -72, -71, -72, -72, -72, -72, -72, -73, -72, -72, -72, -71, -71, -72, -72, -73, -72, -72, -72, -72, -72, -72, -71, -72, -72, -71, -73, -72, -73, -73, -72, -72, -72, -72, -71, -71, -72, -73, -73, -73, -73, -73, -72, -72, -72, -72, -72, -74, -73, -72, -71, -72, -72, -72, -73, -73, -73, -73, -73, -72, -71, -72, -71, -72, -73, -73, -72, -72, -73, -73, -73, -72, -73, -73, -73, -72, -72, -72, -72, -72, -72, -72, -72, -72, -73, -73, -72, -72, -72, -72, -72, -72, -73, -72, -72, -72, -71, -71, -72, -73, -73, -73, -72, -73, -73, -73, -71, -73, -72, -72, -72, -71, -72, -72, -72, -72, -72, -72, -72, -72, -73, -72, -72, -72, -72, -73, -72, -72, -72, -73, -73, -72, -73, -73, -73, -72, -72, -73, -72, -72, -72, -72, -72, -72, -72, -72, -72, -71, -72, -72, -72, -73, -72, -72, -72, -72, -72, -72, -73, -72, -73, -73, -72, -72, -72, -72, -72, -73, -71, -73, -73, -72, -73, -72, -73, -72, -73, -73, -73, -73, -73, -72, -72, -72, -72, -73, -73, -72, -71, -73, -72, -72, -73, -72, -71, -72, -72, -72, -72, -72, -72, -72, -72, -72, -73, -72, -73, -72, -72, -73, -72, -71, -72, -72, -72, -73, -72, -73, -72, -73, -73, -72, -72, -72, -72, -72, -72, -72, -72, -73, -72, -72, -72, -73, -73, -72, -72, -72, -73, -73, -72, -73, -72, -73, -72, -73, -73, -73, -72, -73, -72, -72, -73, -73, -73, -73, -72, -73, -73, -73, -73, -72, -73, -72, -72, -73, -73, -73, -73, -73, -73, -73, -73, -73, -73, -72, -72, -72, -72, -71, -72, -71, -72, -72, -72, -73, -73, -73, -72, -73, -73, -73, -73, -73, -73, -72, -72, -72, -72, -72, -72, -73, -72, -73, -73, -72, -72, -73, -72, -72, -72, -73, -73, -73, -72, -72, -73, -72, -73, -73, -73, -73, -73, -72, -73, -73, -72, -73, -73, -73, -72, -72, -72, -72, -71, -73, -73, -73, -72, -72, -72, -72, -72, -73, -73, -73, -72, -72, -73, -72, -72, -73, -74, -72, -73, -73, -73, -73, -72, -71, -73, -73, -72, -72, -72, -72, -72, -73, -73, -73, -72, -72, -72, -73, -73, -74, -73, -73, -73, -73, -73, -73, -72, -72, -72, -72, -72, -73, -73, -73, -73, -73, -72, -73, -73, -74, -72, -72, -72, -72, -73, -73, -73, -73, -74, -73, -73, -73, -73, -73, -73, -74, -73, -74, -73, -73, -73, -73, -73, -72, -73, -74, -72, -72, -72, -73, -73, -73, -73, -73, -73, -73, -72, -72, -73, -72, -74, -72, -73, -73, -73, -73, -73, -72, -74, -73, -73, -73, -73, -73, -73, -74, -73, -73, -73, -73, -73, -72, -72, -74, -74, -72, -72, -73, -73, -72, -72, -74, -73, -73, -73, -73, -73, -73, -73, -73, -73, -73, -73, -74, -73, -73, -73, -73, -73, -73, -72, -73, -73, -72, -74, -73, -73, -73, -72, -72, -73, -73, -73, -73, -72, -72, -72, -73, -72, -73, -73, -73, -73, -72, -72, -72, -72, -73, -73, -73, -73, -72, -74, -74, -73, -73, -74, -73, -72, -73, -72, -72, -73, -73, -73, -73, -73, -74, -73, -73, -72, -72, -72]
-88448g2j%Jj%%%J%%%%%%%jjJJ%j%J%j%%%Jj%JJjj%%%%%J%%%%%%%%j%%%J%%%%%%%%%%%%%j
-88490g3%%%jKj%J%jJ%kJJjJ%j%jKj%%%%%%Jj%%%%jJ%%%j%J%%%%%%J%j%%Jj%%%j%JJ%j%%%
-88532g3%%%%%%%jJ%%%%%jJ%%Jj%Jj%%Jj%jJJjjKj%%%%%%JkJJjJj%%%%%%jJ%%J%%j%%%%jJ
-88574g3%%%%jJ%%jJ%%%%%%%J%j%%jJ%%%%%%%%Jj%jJjJ%%%JkJJj%%%JjjJ%%%jJ%%jJ%J%j%
-88616g3JkJjJ%J%%j%%%%%Jj%J%%%%%j%%%%jJJ%%Jj%j%J%%%%%jJJjJj%J%%jJj%%%%%%%J%%
-88657g1j%%%%JjJj%J%j%%%jJ%%%%JjJJj%j%%%J%%%%%%%j%Jj%%%J%%%j%jK%%%kJJ%jj%JJj
-88699g2%%%%%%jJ%%%Jj%%%jJ%%%jJ%jJ%%%%jJ%%%%%jJj%%J%jJ%JjjJj%J%%%jJ%jKkJ%%%J
-88741g1j%%%%%j%JJj%JjJj%%%%%%%%%%JkJ%%%%%%%jJJ%%kJ%%%%%jJ%%%Jj%%J%jjJ%%Jj%%
$$ y = [-72, -73, -73, -72, -73, -73, -73, -73, -72, -72, -72, -72, -72, -72, -72, -72, -73, -74, -73, -72, -72, -73, -73, -72, -72, -73, -73, -73, -73, -72, -73, -73, -72, -71, -72, -73, -73, -73, -73, -73, -73, -72, -72, -72, -72, -72, -72, -72, -72, -72, -73, -73, -73, -73, -72, -72, -72, -72, -72, -72, -72, -72, -72, -72, -72, -72, -72, -72, -73, -73, -73, -73, -74, -72, -73, -73, -72, -72, -73, -72, -72, -74, -73, -72, -73, -72, -72, -73, -73, -74, -72, -73, -73, -73, -73, -73, -73, -73, -72, -73, -73, -73, -73, -73, -74, -73, -73, -73, -73, -74, -74, -73, -73, -73, -73, -73, -73, -73, -72, -72, -73, -73, -73, -72, -73, -73, -73, -73, -74, -74, -73, -72, -72, -73, -73, -73, -73, -73, -73, -73, -73, -73, -73, -73, -74, -73, -73, -73, -73, -73, -73, -74, -73, -73, -73, -72, -73, -73, -72, -73, -73, -73, -72, -73, -73, -74, -73, -72, -73, -74, -72, -73, -73, -73, -73, -73, -73, -73, -72, -74, -73, -72, -73, -72, -73, -73, -73, -73, -73, -73, -73, -74, -73, -73, -73, -72, -72, -72, -73, -73, -73, -73, -73, -74, -73, -73, -73, -73, -73, -74, -73, -73, -73, -74, -73, -73, -73, -73, -73, -73, -73, -73, -72, -72, -73, -73, -73, -74, -73, -73, -73, -73, -73, -73, -73, -73, -73, -72, -73, -73, -74, -73, -74, -73, -73, -73, -73, -72, -74, -73, -72, -73, -73, -73, -73, -72, -73, -74, -73, -73, -73, -73, -74, -73, -73, -73, -74, -73, -73, -72, -72, -73, -73, -72, -74, -73, -74, -73, -73, -72, -72, -72, -73, -73, -73, -73, -73, -73, -72, -73, -73, -72, -72, -72, -72, -72, -72, -73, -73, -73, -73, -73, -74, -73, -72, -72, -72, -71, -72, -72, -73, -73, -72, -72, -72, -72, -72, -72, -73, -72, -71, -72, -71, -72, -72, -71, -71, -71, -72, -71, -72, -72, -72, -72, -72, -72, -72, -72, -71, -71, -71, -72, -72, -72, -72, -72, -71, -72, -71, -72, -72, -71, -71, -72, -72, -72, -72, -73, -72, -72, -72, -72, -72, -71, -72, -71, -70, -71, -71, -72, -72, -72, -72, -71, -71, -71, -71, -71, -71, -71, -71, -72, -72, -71, -72, -72, -72, -72, -71, -71, -71, -71, -72, -72, -73, -71, -71, -71, -71, -73, -72, -71, -71, -72, -73, -73, -72, -71, -72, -72, -72, -72, -72, -72, -72, -73, -72, -72, -72, -72, -71, -72, -72, -72, -72, -73, -72, -72, -72, -72, -73, -72, -72, -73, -72, -72, -72, -72, -72, -73, -72, -72, -72, -72, -72, -72, -73, -72, -73, -73, -73, -72, -72, -73, -72, -72, -71, -72, -73, -72, -73, -73, -72, -72, -72, -72, -73, -72, -72, -73, -71, -73, -72, -72, -72, -72, -71, -72, -72, -72, -72, -72, -72, -73, -73, -72, -71, -72, -72, -71, -72, -71, -72, -72, -72, -72, -72, -72, -72, -72, -72, -72, -72, -71, -73, -72, -72, -72, -72, -72, -72, -72, -72, -73, -72, -71, -71, -71, -73, -72, -72, -72, -72, -72, -72, -73, -72, -72, -72, -72, -71, -72, -72, -72, -71, -71, -72, -73, -72, -72, -72, -71, -72, -72, -72]
-88783g2%jJ%%jJj%J%Jj%%j%J%%%%%%%%J%j%%%%J%kJ%Jj%%%JjJj%%%%%Jj%J%%%j%J%Jj%j%
-88825g2%%%%J%%%%J%kJjJ%J%jJ%%%%%%%%jJ%%%%%%%%%%%%%JjJ%%jJ%%%%jKj%Jj%%J%%%%%
-88867f8jJjJJ%jJj%%%%%J%Jj%Jj%J%Jj%Jj%JjJj%%KjJjJ%%Jj%J%%%%J%J%%%jKJj%%%JJjJ
-88908e8%%%%KjJ%%%%JJ%%%J%J%%K%%%%JJJj%J%J%JJJ%JJJJJ%J%K%KJJ%KJJK%KJKKKJKLJK
-88950gLKLKLKMLKKMMMMMNNNNNONNOOPPPPPPQPRPQOQQPPOOPONONOMNMLMMLKLLJKLKJJJ%K%
-88993C04%%%jk%jkkkkkllmlmmmonnnppnopoqoqopnqqqoqpopoonommmnomnmmmmlmljmlkkj
-89034A4kjlmkkmJljkk%k%%jkljkjjjjj%kj%kjj%%jjj%%%jjjj%j%%%jj%j%jjJjj%%%%j%jJ
-89076d9%k%%%%j%%j%%%jJ%jj%%%%Jj%%%j%%j%%%%%%%%%%j%%%jJ%j%%%jJ%%%j%JkJJ%jj%J
$$ y = [-72, -72, -73, -72, -72, -72, -73, -72, -73, -73, -72, -72, -71, -72, -72, -72, -73, -73, -72, -72, -72, -72, -72, -72, -72, -72, -72, -71, -71, -72, -72, -72, -72, -72, -71, -71, -73, -72, -72, -71, -72, -72, -72, -72, -71, -72, -71, -72, -72, -72, -72, -72, -72, -71, -72, -72, -71, -71, -71, -71, -72, -72, -71, -71, -70, -71, -71, -72, -72, -72, -72, -72, -72, -71, -71, -71, -71, -71, -70, -70, -72, -71, -72, -71, -71, -70, -70, -71, -70, -70, -70, -70, -70, -70, -70, -70, -70, -71, -70, -70, -70, -70, -70, -70, -70, -70, -70, -70, -70, -70, -70, -70, -69, -70, -69, -69, -69, -70, -69, -69, -69, -69, -69, -70, -68, -69, -69, -68, -69, -69, -69, -68, -68, -68, -68, -68, -68, -69, -68, -69, -68, -67, -67, -68, -67, -68, -68, -68, -68, -68, -68, -67, -67, -66, -67, -67, -66, -67, -67, -66, -66, -65, -66, -66, -65, -66, -66, -65, -66, -65, -66, -66, -66, -64, -65, -64, -65, -64, -64, -64, -63, -64, -64, -63, -63, -63, -63, -63, -62, -62, -61, -61, -61, -61, -62, -60, -59, -60, -60, -60, -60, -59, -58, -59, -58, -58, -58, -58, -58, -56, -57, -56, -56, -56, -56, -56, -55, -54, -54, -54, -54, -53, -53, -52, -52, -52, -50, -50, -50, -50, -50, -49, -48, -47, -48, -48, -47, -47, -46, -46, -45, -44, -43, -43, -42, -41, -40, -39, -38, -38, -37, -37, -35, -35, -33, -32, -31, -31, -29, -28, -27, -25, -25, -23, -22, -20, -18, -16, -15, -13, -10, -9, -7, -4, -2, 1, 3, 6, 8, 12, 15, 17, 19, 23, 27, 31, 35, 39, 44, 49, 54, 59, 64, 70, 75, 80, 86, 92, 99, 106, 113, 120, 127, 134, 142, 149, 158, 165, 173, 179, 187, 195, 202, 209, 215, 221, 228, 234, 239, 245, 250, 256, 260, 265, 269, 272, 276, 280, 283, 285, 288, 291, 292, 294, 297, 299, 300, 301, 302, 302, 304, 304, 304, 304, 304, 303, 301, 301, 300, 298, 296, 294, 292, 290, 287, 284, 280, 277, 273, 269, 265, 259, 254, 249, 244, 237, 230, 225, 219, 212, 206, 198, 192, 184, 178, 171, 166, 158, 150, 142, 136, 128, 121, 115, 108, 102, 96, 91, 85, 81, 77, 73, 68, 62, 58, 53, 49, 45, 41, 37, 34, 30, 27, 26, 22, 19, 17, 15, 14, 12, 11, 8, 4, 2, 0, -4, -3, -6, -7, -9, -11, -11, -13, -13, -13, -14, -16, -19, -20, -22, -23, -24, -25, -26, -27, -27, -29, -30, -30, -32, -33, -34, -34, -34, -35, -36, -37, -37, -37, -37, -38, -39, -40, -41, -41, -42, -42, -42, -42, -43, -44, -44, -45, -45, -46, -47, -46, -47, -48, -48, -48, -48, -48, -49, -49, -50, -49, -49, -51, -51, -51, -51, -51, -52, -52, -52, -53, -53, -53, -53, -54, -53, -53, -54, -55, -55, -55, -55, -55, -54, -55, -55, -55, -55, -56, -56, -56, -57, -57, -57, -57, -57, -57, -57, -57, -57, -57, -57, -58, -58, -58, -58, -59, -58, -58, -59, -59, -59, -59, -60, -59, -59, -59, -59, -60, -60, -59, -61, -60, -59, -59, -60, -61, -61, -60]
-89118f0j%%%%%Jj%%%%%Jjj%%J%j%Jj%%%%jJjJ%jJ%jJ%jKj%%J%jJ%j%jJj%jJJ%%%JjJ%%j%
-89159f2%jJ%%%%%%%%%J%%jj%jJjKjjJ%J%Jj%%j%%%j%J%%%j%%%%%J%j%%%%j%%jJ%jJ%%%%%
-89201f5%%%Jj%%%%jJ%j%%Kj%%%%jJJj%%%%j%J%%%%%%%jJ%%%%%%%%%%%J%j%%%Jj%J%%%%jJ
-89243f4%%J%%%Jj%%%%%%%%Jj%J%%Jj%%Jj%jJ%%%%J%%j%JjJ%%%%jJjJ%j%J%%%%%j%%JjjJJ
-89285f1%j%%%%%%J%j%%%%%%%J%jjJ%%%%%%%JjjJ%%%%j%J%%%%j%J%j%%%J%j%%jK%%%j%JJ%
-89327f1k%JjJ%%%%%%j%JJkKjJ%Jj%%%J%%%%%%j%%%%J%jKjJjJ%%%%j%%J%jJ%%%%J%j%%Jj%
-89369e9J%%%JJ%j%%J%jjJ%%JJj%Jj%%%%JJ%%%%j%J%J%%%J%%%%%JJ%%%%JJj%%J%%J%J%J%%
-89411d5%J%%%J%JJ%J%%J%JJJ%%%KjJJ%JKj%JJJ%JJJJ%K%%J%JJJJJKJJJJJKJJJKJLKJJKLK
$$ y = [-60, -61, -61, -61, -61, -61, -61, -60, -61, -61, -61, -61, -61, -61, -60, -61, -62, -62, -62, -61, -61, -62, -62, -61, -62, -62, -62, -62, -62, -63, -62, -63, -62, -62, -63, -62, -62, -63, -62, -62, -63, -61, -62, -62, -62, -61, -61, -62, -61, -61, -62, -62, -63, -62, -63, -63, -64, -63, -62, -62, -62, -62, -61, -62, -61, -61, -61, -62, -62, -62, -63, -62, -62, -62, -62, -62, -62, -62, -62, -62, -62, -61, -61, -61, -62, -63, -63, -64, -63, -64, -62, -63, -64, -63, -63, -62, -62, -61, -62, -62, -62, -63, -63, -63, -63, -64, -64, -63, -63, -63, -63, -64, -64, -64, -64, -64, -64, -63, -63, -64, -64, -64, -64, -64, -65, -65, -65, -66, -65, -65, -66, -65, -65, -65, -65, -65, -65, -65, -65, -65, -64, -65, -65, -65, -65, -65, -66, -65, -65, -66, -66, -66, -64, -65, -65, -65, -65, -65, -66, -65, -64, -65, -65, -65, -65, -65, -66, -66, -65, -65, -65, -65, -65, -65, -65, -65, -66, -65, -65, -65, -65, -65, -65, -65, -65, -65, -65, -65, -65, -64, -64, -65, -65, -65, -65, -64, -65, -65, -64, -64, -64, -64, -64, -65, -64, -64, -64, -63, -63, -63, -63, -62, -63, -63, -63, -63, -63, -63, -63, -63, -63, -62, -63, -63, -62, -62, -62, -61, -62, -62, -62, -61, -62, -62, -63, -62, -62, -62, -62, -62, -61, -61, -61, -62, -62, -61, -62, -61, -61, -61, -61, -61, -62, -61, -62, -61, -61, -62, -62, -61, -61, -61, -61, -61, -61, -62, -62, -62, -61, -62, -63, -62, -61, -61, -62, -62, -62, -62, -62, -62, -62, -61, -61, -62, -62, -62, -62, -62, -62, -62, -62, -61, -61, -62, -63, -62, -62, -62, -62, -62, -62, -62, -62, -61, -62, -63, -62, -62, -62, -62, -62, -63, -63, -62, -62, -62, -62, -62, -63, -63, -62, -62, -63, -63, -63, -63, -62, -62, -63, -63, -63, -64, -62, -62, -62, -62, -63, -63, -62, -61, -61, -63, -63, -62, -63, -62, -62, -62, -62, -62, -62, -62, -63, -63, -62, -61, -63, -61, -62, -61, -61, -60, -61, -61, -61, -61, -60, -60, -60, -60, -60, -60, -60, -61, -61, -61, -61, -61, -60, -60, -61, -59, -60, -59, -60, -59, -59, -59, -59, -59, -60, -60, -60, -59, -59, -60, -59, -59, -59, -59, -59, -58, -58, -59, -59, -59, -58, -59, -59, -58, -58, -58, -58, -57, -56, -56, -57, -57, -57, -56, -56, -57, -58, -57, -57, -57, -56, -55, -56, -56, -55, -56, -56, -56, -56, -56, -55, -54, -54, -54, -54, -54, -55, -55, -54, -54, -53, -53, -53, -53, -52, -52, -52, -52, -52, -52, -51, -50, -50, -50, -50, -50, -49, -48, -49, -49, -49, -48, -48, -48, -47, -47, -46, -46, -45, -45, -45, -45, -44, -44, -44, -44, -43, -43, -42, -41, -41, -40, -40, -40, -39, -39, -38, -37, -36, -36, -36, -36, -34, -35, -34, -33, -33, -32, -30, -31, -31, -30, -29, -28, -28, -27, -26, -25, -24, -24, -22, -22, -22, -21, -21, -20, -19, -18, -17, -16, -14, -13, -12, -11, -10, -9, -7, -6, -5, -4, -2, -1, 2, 4, 5, 6, 8, 11, 13]
-89452A3JKKJLKLLLLMLLMMNMOLNOOOPQQRJ0J1J2J4J4J4J4J5J6K0J8J5J6J6J7J9K0J8J7J4J5
-89482D52J4J7J6J8J7J6J3J1J2J0J0J0J1J0QPPQNNMPNPL%l%LJKJkmlkjKKKjkmkmkllmoqqr
-89515F45rrqqrj2j1j4j5j3j4j1j2j1rnljLLNNORJ2J6J7K1K7L6N3P4R5J27J78K37L12L45K91
-89539B343K18K14L28N35P74R58J058J198J475J767J677O40j024k055k076j601j087o73l53
-89550D316r9J34L77O69J034J451J793J753J047r6r51j194j033p96o65o20n36l02M4M02O58
-89563G386P55Q07J021J406J694J315k08j934k523k145j517r77n74k84m1J94M58P83J189J616
-89575H421J853J525M53p93j460j516j308j101r77q60o76m64k93k12k37k96l12k76k27j80
-89588A064j41j14r5q2o7n4m5m2m4m3l8l5k7j9j5qml%%J%lj0j3j5j7j3j3j0rj1rqooopomm
$$ y = [13, 14, 16, 18, 19, 22, 24, 27, 30, 33, 36, 40, 43, 46, 50, 54, 59, 63, 69, 72, 77, 83, 89, 95, 102, 110, 118, 127, 137, 148, 160, 174, 188, 202, 216, 231, 247, 267, 285, 300, 316, 332, 349, 368, 388, 406, 423, 437, 452, 466, 483, 499, 517, 534, 550, 563, 574, 586, 596, 606, 616, 627, 637, 645, 652, 659, 667, 672, 677, 681, 688, 693, 700, 703, 703, 700, 700, 703, 704, 706, 707, 705, 701, 698, 696, 695, 697, 699, 701, 700, 698, 694, 692, 688, 686, 683, 680, 676, 670, 662, 654, 645, 636, 627, 619, 611, 602, 590, 579, 565, 550, 537, 523, 512, 500, 489, 480, 475, 472, 471, 474, 477, 482, 487, 493, 502, 514, 530, 547, 568, 595, 631, 684, 758, 853, 980, 1158, 1395, 1707, 2052, 2343, 2561, 2775, 3103, 3638, 4412, 5370, 6428, 7626, 9101, 10868, 12545, 13185, 12161, 10106, 8030, 6429, 5342, 4669, 4316, 4217, 4351, 4728, 5397, 6431, 7882, 9675, 11428, 12475, 12379, 11428, 10234, 9201, 8405, 7740, 7120, 6584, 6282, 6326, 6728, 7386, 8141, 8948, 9969, 11375, 13069, 14384, 14176, 12242, 9719, 7574, 6057, 5080, 4506, 4222, 4181, 4375, 4833, 5616, 6805, 8421, 10274, 11799, 12252, 11459, 9999, 8483, 7175, 6074, 5097, 4237, 3561, 3097, 2804, 2592, 2355, 2059, 1747, 1471, 1244, 1064, 923, 809, 714, 632, 565, 511, 466, 424, 380, 337, 299, 264, 237, 218, 203, 195, 191, 188, 188, 188, 189, 189, 186, 176, 163, 148, 131, 118, 105, 95, 86, 75, 66, 58, 52, 46, 40, 33, 27, 23, 19]
-89613A9llklkllkjklk%jjlkjj%jk%jjkjj%jj%j%jJjjk%j%%%k%%j%j%%%kJk%%j%%j%%%j%%
-89655d6%j%%jJj%%jJ%%j%%jjJ%%%%%%j%%J%%kJ%jJ%%j%%%%%jjJJ%%%J%jJJ%%J%JJ%J%Jjj
-89697d7Jjjjj%%J%%JK%jJJ%%%%J%JjJjJJKJJJLLNNPMMK%jjlkjJ%jkmkjKLMMKJjkj%JjkjK
-89738a0KLMMKJJklklk%KLL%LORJ4J1Ooj1j2j1ooljjjJMOPPMlrrqomnmk%JKNMPRROkj1j6j3
-89776b6rnlk%JKNPRJ2RMmpj0ropmnkj%jkkkkjj%%j%j%%%j%%%%JkJ%jKj%%%%jJ%%%%%%%%%
-89817f5%%%%%JkJ%%J%%Jj%JK%JJ%KJJj%lj%j%%J%LJKLMKLK%kmlljk%%%KJLLMNKjkkkkljj
-89858d9JJ%KJKJMKKJlnnm%k%JJ%JJKJKJ%j%klljJ%%jjkk%jJJ%Jj%JJ%%K%%%jk%%JJJj%%J
-89900e1jJ%J%%%LKKJKKKJJJLLLJLPJ0J2J8K5M4O3O9L1mPN3J15J71J67J57K32L56M92L48k72
$$ y = [19, 16, 13, 11, 8, 6, 3, 0, -2, -3, -5, -8, -10, -10, -11, -12, -15, -17, -18, -19, -19, -20, -22, -22, -23, -24, -26, -27, -28, -28, -29, -30, -30, -31, -31, -32, -31, -32, -33, -35, -35, -36, -36, -36, -36, -38, -38, -38, -39, -39, -40, -40, -40, -40, -42, -41, -43, -43, -43, -44, -44, -44, -45, -45, -45, -45, -46, -46, -46, -46, -47, -47, -47, -48, -47, -48, -48, -48, -49, -48, -48, -48, -49, -49, -49, -50, -51, -50, -50, -50, -50, -50, -50, -50, -51, -51, -51, -50, -50, -50, -52, -51, -51, -52, -51, -51, -51, -52, -52, -52, -52, -52, -52, -53, -54, -53, -52, -52, -52, -52, -51, -51, -52, -51, -50, -50, -50, -49, -49, -48, -47, -47, -46, -46, -45, -46, -47, -46, -47, -48, -49, -50, -50, -50, -49, -49, -49, -48, -46, -46, -47, -46, -45, -45, -45, -45, -45, -44, -44, -43, -44, -43, -44, -43, -42, -40, -39, -38, -37, -34, -31, -26, -21, -14, -10, -6, -4, -4, -5, -6, -9, -11, -12, -11, -11, -12, -14, -18, -20, -21, -19, -16, -12, -8, -6, -5, -6, -8, -9, -9, -8, -9, -11, -12, -10, -8, -5, -1, 3, 5, 6, 7, 5, 2, 0, -3, -5, -5, -3, 0, 3, 3, 6, 12, 21, 35, 46, 52, 46, 35, 23, 12, 6, 0, -3, -4, -5, -6, -5, -1, 5, 12, 19, 23, 20, 11, 2, -6, -12, -16, -21, -25, -27, -27, -26, -24, -19, -15, -8, 1, 10, 16, 14, 3, -13, -26, -35, -40, -43, -45, -45, -44, -42, -37, -30, -21, -9, 0, 4, 0, -7, -17, -26, -32, -39, -43, -48, -50, -51, -51, -52, -54, -56, -58, -60, -61, -62, -62, -62, -63, -63, -64, -64, -64, -64, -65, -65, -65, -65, -65, -64, -66, -65, -65, -66, -64, -65, -65, -65, -65, -65, -66, -65, -65, -65, -65, -65, -65, -65, -65, -65, -65, -65, -65, -65, -65, -65, -64, -66, -65, -65, -65, -64, -64, -64, -63, -64, -64, -63, -61, -61, -60, -59, -59, -57, -56, -55, -56, -56, -59, -60, -60, -61, -61, -61, -60, -60, -57, -56, -54, -51, -47, -45, -42, -40, -40, -42, -46, -49, -52, -53, -55, -55, -55, -55, -53, -52, -49, -46, -42, -37, -35, -36, -38, -40, -42, -44, -47, -48, -49, -48, -47, -47, -45, -44, -42, -41, -37, -35, -33, -32, -35, -40, -45, -49, -49, -51, -51, -50, -49, -49, -48, -47, -45, -44, -42, -41, -41, -42, -42, -44, -47, -50, -51, -50, -50, -50, -51, -52, -54, -56, -56, -57, -56, -55, -55, -54, -55, -55, -54, -53, -53, -53, -51, -51, -51, -51, -52, -54, -54, -54, -53, -52, -51, -52, -52, -52, -51, -52, -51, -51, -50, -50, -50, -50, -47, -45, -43, -42, -40, -38, -36, -35, -34, -33, -30, -27, -24, -23, -20, -13, -3, 9, 27, 52, 96, 159, 228, 259, 255, 262, 315, 430, 601, 768, 925, 1157, 1513, 2005, 2353, 2081]
-89927B081o12m93l04j72r2m2rK0N0R1J56K63M09N08L58q3l63l37k36j30q4j06j23q1NR3J53
-89943I20J49J12J40K50L91M75L7n77o28m23k40j30o5k8JK9O3J13K01L35M81M77J33l09m10
-89959A497l25k24j57j61j57j04m7jJ0j4m1m3m3m2l5k6j9j8j6j2rmlpqqomm%jjJJ%L%Jjll
-89984c4l%jljjk%%j%j%%j%%%%jj%%jJjJJ%%%%%jJjJ%%%%%%J%jK%%%%J%%j%%JJ%J%%%J%J%
-90026d2%%J%%JJj%%JK%%KJ%%J%JJKJj%K%JKJKJKJJKKLJKMKKLJLKKJKKJKJKJJJKLKLKLLKM
-90068E1LMNKMLMKLNMNNNMLLPJ0J2J3J3J7K1K8K2lk1k1j3ojKNOJ1J1J5J9K7L1L4K2JnkNQJ2
-90098C95J3J8K4L2L8M0M2M8N7P2Q3P8N7M8N0M8L6K3J7K3L7N8Q1J05J30J61J90K11K20K30
-90116B665K48K71K86K95L00L11L25L34L33L14K76K21J56Q4J7l6o8p4o3l3%L3P1J24J85K41
$$ y = [2081, 1469, 976, 672, 500, 408, 366, 357, 377, 427, 518, 674, 937, 1346, 1854, 2212, 2129, 1766, 1429, 1193, 1063, 979, 873, 750, 669, 674, 767, 920, 1069, 1181, 1321, 1571, 1962, 2437, 2474, 1897, 1269, 846, 606, 476, 411, 383, 384, 413, 476, 589, 790, 1125, 1606, 2083, 2216, 1907, 1497, 1172, 948, 791, 630, 473, 369, 322, 321, 331, 317, 276, 233, 190, 148, 113, 87, 68, 50, 34, 22, 13, 9, 6, -1, -9, -17, -23, -27, -31, -31, -32, -33, -32, -31, -31, -28, -28, -27, -28, -31, -34, -37, -37, -38, -41, -42, -43, -45, -45, -45, -46, -46, -47, -47, -47, -48, -48, -48, -48, -48, -49, -50, -50, -50, -51, -50, -51, -50, -49, -49, -49, -49, -49, -49, -50, -49, -50, -49, -49, -49, -49, -49, -49, -49, -48, -48, -49, -47, -47, -47, -47, -47, -46, -46, -46, -47, -47, -47, -46, -45, -45, -44, -44, -44, -44, -43, -43, -42, -42, -42, -42, -41, -41, -41, -40, -39, -40, -40, -40, -39, -37, -37, -37, -35, -34, -34, -34, -33, -33, -32, -31, -29, -28, -29, -29, -27, -27, -26, -24, -23, -21, -20, -18, -17, -16, -14, -12, -9, -8, -6, -2, 0, 2, 5, 6, 9, 11, 13, 14, 16, 18, 19, 21, 22, 24, 25, 26, 27, 29, 32, 34, 37, 39, 42, 45, 47, 51, 54, 58, 63, 65, 69, 72, 76, 78, 81, 86, 90, 95, 100, 105, 109, 112, 115, 122, 132, 144, 157, 170, 187, 208, 236, 258, 255, 234, 213, 200, 194, 193, 195, 200, 206, 217, 228, 243, 262, 289, 320, 354, 376, 377, 372, 370, 375, 383, 395, 408, 426, 450, 482, 520, 560, 602, 650, 707, 779, 862, 940, 997, 1045, 1095, 1143, 1179, 1202, 1219, 1242, 1279, 1337, 1418, 1523, 1653, 1814, 2004, 2215, 2435, 2665, 2913, 3184, 3470, 3765, 4065, 4376, 4701, 5035, 5368, 5682, 5958, 6179, 6335, 6419, 6436, 6400, 6332, 6258, 6195, 6162, 6162, 6195, 6266, 6390, 6575, 6816]
-90132F816K76K80K60K39K30K35K47K59K80L20L64L48J88r9l38l98l18k04j13o5n1o4q5r4
-90147H513p4j2P9J65J68O0j11k25k30j69r9n9m8m8m7l7l4m6o6o5l0J3j6k13n36p61p78o61
-90164D633n18l92k96k23j56r0j6P4J79K80L25K54N1j93l51l88l60l20k84k41j92j41j03q4
-90179A448q3q9r2q6p6o3n4m7m0l5k9k4j9j6j8j9j6j5j6j4j6k3k4k0j5j0qlmkkmkklloj1j5
-90203D24j4j2j1rpomkjjJjknrj1rqnmkj%JLMMKNMLKJKQJ3J3qk4k4j9j2rnmkkJKOJ2J7J9O
-90236C20rj6j2rpppnm%LMKLPJ3J8Rj5k7k3j6j0omljjJLPJ4J7J6jj5j6j5j1rqj0olllnmmn
-90267A37llkklllklkkmkkkkkkkkljkl%mjlkkjlkjkk%kjj%%kjJj%J%J%Jjkjjl%lk%jjkj%j
-90308C4JJ%%jJ%J%J%j%%k%jj%jlkkljkj%jjjj%j%%%j%jjk%jkjkklllklkkkllj%j%%jJjk%
$$ y = [6816, 7092, 7372, 7632, 7871, 8101, 8336, 8583, 8842, 9122, 9442, 9806, 10154, 10342, 10243, 9905, 9507, 9189, 8985, 8872, 8807, 8756, 8692, 8607, 8513, 8439, 8427, 8506, 8671, 8839, 8899, 8788, 8563, 8333, 8164, 8065, 8006, 7958, 7910, 7863, 7826, 7792, 7746, 7680, 7615, 7585, 7598, 7582, 7369, 6833, 6072, 5294, 4633, 4115, 3723, 3427, 3204, 3048, 2958, 2942, 3016, 3195, 3475, 3800, 4054, 4105, 3912, 3561, 3173, 2813, 2493, 2209, 1968, 1776, 1635, 1532, 1448, 1365, 1276, 1184, 1098, 1022, 959, 905, 858, 818, 783, 754, 730, 711, 695, 677, 658, 642, 627, 611, 597, 581, 558, 534, 514, 499, 489, 481, 478, 474, 472, 470, 466, 464, 462, 459, 456, 450, 439, 424, 410, 398, 387, 378, 371, 365, 361, 359, 358, 357, 358, 357, 355, 350, 341, 330, 321, 313, 308, 304, 302, 301, 301, 302, 305, 309, 313, 315, 320, 324, 327, 329, 330, 332, 340, 353, 366, 358, 334, 310, 291, 279, 270, 265, 261, 259, 257, 258, 260, 266, 278, 295, 314, 320, 311, 295, 283, 274, 267, 260, 253, 248, 244, 244, 247, 251, 253, 256, 263, 276, 294, 303, 288, 261, 238, 222, 212, 206, 202, 199, 198, 197, 198, 201, 208, 222, 239, 255, 254, 239, 223, 208, 197, 188, 180, 170, 164, 161, 158, 155, 150, 146, 142, 137, 134, 131, 129, 127, 124, 121, 118, 116, 113, 111, 109, 105, 103, 101, 99, 97, 95, 93, 91, 89, 86, 85, 83, 80, 80, 76, 75, 72, 70, 68, 67, 64, 62, 61, 59, 57, 57, 55, 54, 53, 53, 53, 51, 50, 51, 50, 50, 51, 51, 52, 52, 53, 52, 50, 49, 48, 45, 45, 42, 40, 40, 39, 38, 36, 35, 35, 34, 35, 36, 36, 36, 35, 36, 36, 37, 37, 38, 38, 37, 37, 37, 35, 35, 34, 33, 33, 32, 29, 27, 25, 22, 21, 19, 18, 18, 17, 16, 15, 14, 14, 13, 13, 13, 13, 12, 12, 11, 10, 8, 8, 7, 5, 4, 2, 0, -3, -6, -9, -11, -14, -16, -18, -20, -23, -26, -27, -27, -28, -28, -28, -29, -28, -29, -31, -31]
-90350c1k%kjjjjjjkjj%k%j%%kj%%Jk%j%Jj%%%j%%%j%%%j%jJ%%j%%jJkJj%JJj%%jJjJ%j%J
-90392e8jJj%JJJL%LJL%MNNOQJ0J0Mlqj2j1qnlk%JJMNQRJ1PLmnoommlk%KLNOPQQMmj1j3j3
-90429b9pplk%JKLPQRJ0P%mprqpnmlkkjljkl%%%kJ%jjJ%j%%jJ%jjKj%%jJ%jJ%j%%%%%%%jJ
-90470f7%%j%Jj%%jK%%j%%%%jj%%JJ%j%%%%JjJJjJJ%J%J%JK%KKLJjjlkkkj%%%%JKJKJL%%j
-90512e6jkj%%jj%K%KJKKJ%lllkkj%%%%KJJKKJJ%kkkjjjjj%j%%%j%j%%j%%%%%%%%%j%J%%j
-90554g2%%Jj%%J%jJ%jJ%j%%%JjJjjJ%jJJ%jJ%%jJ%%%%j%KjjJ%%%J%j%%%j%%%%J%%%%%Jj%
-90596g1%%j%JjJ%%JJjK%%jj%%j%%jJ%%%%J%JJj%%jjj%%J%Jj%J%%%%%JkjJjjK%j%%J%J%Jj
-90637g0%%%%%jjjJjJJj%%J%%j%Jj%%J%%%%Jj%%Jjj%%J%%%JkKk%J%jJ%%%%%%J%k%%J%%jJ%
$$ y = [-31, -33, -33, -35, -36, -37, -38, -39, -40, -41, -43, -44, -45, -45, -47, -47, -48, -48, -48, -50, -51, -51, -51, -50, -52, -52, -53, -53, -52, -53, -53, -53, -53, -54, -54, -54, -54, -55, -55, -55, -55, -56, -56, -57, -56, -56, -56, -57, -57, -57, -58, -57, -59, -58, -59, -59, -58, -57, -58, -58, -58, -59, -58, -59, -58, -58, -59, -59, -58, -59, -58, -59, -59, -58, -57, -56, -53, -53, -50, -49, -46, -46, -42, -37, -32, -26, -18, -8, 2, 6, 3, -5, -17, -28, -36, -41, -44, -46, -46, -45, -44, -40, -35, -27, -18, -7, 0, 3, -1, -6, -12, -18, -22, -26, -29, -31, -31, -29, -26, -21, -15, -8, 0, 8, 12, 8, -3, -16, -29, -36, -43, -46, -48, -48, -47, -45, -42, -35, -27, -18, -8, -1, -1, -5, -12, -21, -29, -36, -41, -45, -48, -50, -52, -53, -56, -57, -59, -62, -62, -62, -62, -64, -63, -63, -64, -65, -64, -64, -65, -65, -65, -66, -65, -65, -66, -67, -65, -66, -66, -66, -67, -66, -66, -67, -66, -66, -67, -67, -67, -67, -67, -67, -67, -67, -68, -67, -67, -67, -68, -68, -67, -68, -68, -68, -69, -67, -67, -67, -68, -68, -68, -68, -68, -69, -70, -70, -70, -69, -68, -68, -69, -69, -69, -69, -69, -68, -69, -68, -67, -68, -67, -66, -66, -65, -65, -64, -64, -63, -61, -61, -59, -57, -54, -53, -54, -55, -58, -60, -62, -64, -65, -65, -65, -65, -65, -64, -62, -61, -59, -58, -55, -55, -55, -56, -57, -59, -60, -60, -60, -61, -62, -62, -60, -60, -58, -57, -55, -53, -52, -52, -55, -58, -61, -63, -65, -66, -66, -66, -66, -66, -64, -63, -62, -60, -58, -57, -56, -56, -58, -60, -62, -63, -64, -65, -66, -67, -67, -68, -68, -68, -68, -69, -69, -70, -70, -70, -71, -71, -71, -71, -71, -71, -71, -71, -71, -71, -72, -72, -71, -71, -71, -72, -72, -72, -71, -72, -72, -72, -71, -71, -72, -71, -71, -72, -71, -71, -72, -72, -72, -72, -71, -72, -71, -72, -73, -72, -72, -73, -72, -71, -71, -72, -71, -71, -71, -72, -71, -71, -71, -71, -71, -72, -72, -70, -71, -72, -71, -71, -71, -71, -70, -70, -71, -71, -71, -71, -72, -72, -72, -72, -72, -71, -71, -71, -71, -71, -71, -70, -71, -71, -71, -71, -72, -72, -71, -72, -71, -71, -71, -70, -69, -70, -68, -68, -68, -69, -70, -70, -70, -71, -71, -71, -72, -71, -71, -71, -71, -71, -70, -70, -69, -68, -69, -69, -69, -70, -71, -72, -72, -72, -71, -71, -70, -71, -71, -70, -70, -70, -70, -70, -70, -69, -71, -72, -71, -72, -73, -71, -71, -72, -72, -72, -71, -71, -70, -70, -69, -70, -70, -70, -70, -70, -70, -71, -72, -73, -72, -73, -72, -71, -72, -72, -72, -71, -71, -71, -72, -72, -71, -72, -72, -72, -71, -71, -71, -71, -71, -70, -71, -71, -71, -70, -71, -72, -72, -72, -71, -71, -71, -71, -70, -72, -70, -72, -72, -71, -71, -72, -71, -71, -71, -71, -71, -71, -71, -70, -70, -72, -72, -72, -71, -71, -71, -72, -71, -71]
-90679g1Jj%%%Jjj%J%%%%j%%j%J%%Jj%%JjJjj%J%%%%%j%%J%%%Jj%%%jJjJ%%%jjJJ%Jj%j%%
-90721g3%Jj%Jj%%JjJj%%%%%Jj%JjJkJ%J%%%%j%%JjJj%%%%JjjJJ%%%j%J%%%%j%J%%Jj%%%%
-90763g2%Jj%%%JjjJjJ%%jJ%jJ%%%J%jJj%J%j%%%jJJjJ%%%%j%%%Jj%%%J%%%%%J%j%%%%jJ%
-90805g1%%Jj%JjJ%%j%Jj%Jj%%%%%Kj%%J%%j%%%%%%Jj%J%%%%%J%%J%j%%%%%jJ%%%J%j%J%J
-90847f6%k%JJ%j%%%%%j%%Kk%J%%J%jKjjJ%%%%%%%%%Jj%J%%%%%J%%%%jJJ%%%jJ%j%JJj%J%
-90888f2%%%J%JkJ%%J%%J%%%%%%%%%%J%J%%J%J%%%%%%%J%%%JJ%J%%%Jj%KJ%J%KjK%JJ%%K%
-90930d0JJJKLKKNNQQRROQJ2J2J0JkKKJkoj1j2qojKNRJ0J1PLLPRJ0PL%JjkjjMOROjlkKLjn
-90967A22j0j3qoJMQJ1J4J3J0NOPJ3J3J1NK%jkJLLLLKMNQQJ1J3K0K5K8K9L1L3L4L3L4L5M0
$$ y = [-71, -70, -71, -71, -71, -71, -70, -71, -72, -72, -71, -71, -71, -71, -71, -72, -72, -72, -73, -73, -72, -72, -72, -71, -72, -72, -72, -71, -72, -71, -72, -73, -73, -72, -72, -72, -72, -72, -72, -73, -73, -73, -72, -72, -72, -72, -71, -72, -72, -72, -72, -73, -72, -73, -72, -72, -72, -72, -73, -74, -73, -72, -72, -71, -72, -72, -73, -73, -73, -73, -72, -73, -73, -72, -73, -73, -73, -72, -73, -72, -73, -73, -73, -73, -73, -73, -72, -73, -73, -72, -73, -72, -74, -73, -73, -72, -72, -72, -72, -72, -73, -73, -73, -72, -73, -72, -73, -73, -73, -73, -73, -72, -73, -74, -73, -72, -72, -72, -72, -73, -73, -72, -72, -72, -72, -72, -73, -73, -72, -72, -72, -71, -72, -72, -72, -72, -72, -72, -71, -72, -72, -72, -72, -71, -72, -73, -72, -73, -72, -72, -72, -73, -72, -72, -73, -72, -72, -72, -72, -71, -71, -72, -71, -72, -72, -71, -71, -72, -72, -72, -72, -73, -72, -71, -72, -71, -71, -71, -71, -71, -72, -72, -72, -72, -71, -72, -72, -72, -72, -71, -71, -71, -71, -71, -71, -70, -70, -71, -71, -71, -71, -71, -72, -71, -71, -71, -71, -70, -71, -71, -70, -71, -70, -70, -70, -71, -71, -70, -71, -71, -70, -71, -71, -71, -71, -71, -71, -69, -70, -70, -70, -69, -69, -69, -70, -70, -70, -70, -70, -70, -70, -69, -70, -70, -69, -69, -69, -69, -69, -69, -68, -68, -68, -67, -67, -68, -68, -68, -68, -68, -68, -69, -68, -68, -68, -68, -67, -67, -68, -68, -67, -67, -66, -66, -68, -68, -67, -66, -66, -67, -67, -67, -67, -67, -67, -68, -68, -68, -66, -68, -68, -67, -67, -67, -66, -66, -67, -65, -66, -67, -66, -66, -66, -66, -66, -66, -66, -66, -66, -66, -65, -66, -66, -65, -65, -65, -65, -65, -65, -64, -64, -64, -64, -64, -65, -64, -63, -63, -63, -63, -64, -63, -63, -64, -64, -63, -62, -63, -63, -62, -62, -62, -62, -62, -61, -61, -60, -62, -61, -61, -61, -60, -60, -60, -59, -59, -59, -59, -59, -59, -59, -59, -59, -59, -59, -58, -58, -57, -57, -57, -56, -56, -55, -55, -55, -55, -55, -55, -55, -55, -54, -54, -54, -54, -53, -52, -52, -51, -51, -51, -51, -50, -51, -51, -49, -48, -48, -47, -47, -45, -46, -44, -44, -43, -42, -42, -42, -40, -40, -39, -38, -37, -35, -32, -30, -28, -23, -18, -10, -2, 7, 16, 22, 30, 42, 54, 64, 65, 63, 65, 67, 68, 66, 60, 49, 37, 29, 23, 22, 24, 29, 38, 48, 59, 66, 69, 72, 79, 88, 98, 105, 108, 108, 109, 108, 106, 105, 104, 108, 114, 123, 129, 128, 125, 123, 125, 128, 127, 122, 112, 99, 91, 85, 86, 90, 98, 109, 123, 136, 146, 151, 157, 164, 177, 190, 201, 206, 208, 208, 207, 205, 206, 209, 212, 215, 218, 220, 224, 229, 237, 245, 256, 269, 289, 314, 342, 371, 402, 435, 469, 502, 536, 571, 611]
-90995F11M4M9N3O4Q5J17J59K10K81L90N49P48Q91Q29N91N34Q91J572K327K814K938L153L817
-91009B3717M072J768k792n557n279l853k506j555r06m41n5L03O96J187J881K853M009M781
-91020B2323M083J436j441k628k495k074j740j517j290q29k0Q99J669K113K243K482L290M022
-91031C0526K241k777o376o196m484k866j766j054n68j76J85N79J060J738K704L916M869M400
-91042B5955J643j773l354l315k981k784k559k061j394q19n39n93p73p90o66n21m11l17k51
-91054A697k07j78j46j18j01r8j04j01q8p3n0l3k3j6rkKNPJ1J1Nj0k6l5l4l2l0k6k3j8j4j2
-91074A31j2j1j2j0j0rpnmnmnmklkljljlkljmjkkkkjkkjkjj%j%j%jjkkj%%kjj%jJj%jjk%j
-91112c3j%%%k%%%k%jj%%j%k%Jjj%jJJk%j%%%j%j%%%jj%j%%Jk%J%%j%%j%%%j%jJ%j%%%j%%
$$ y = [611, 655, 704, 757, 821, 906, 1023, 1182, 1392, 1673, 2063, 2612, 3360, 4251, 5080, 5671, 6205, 7096, 8668, 10995, 13809, 16747, 19900, 23717, 27789, 29557, 26765, 21208, 15929, 12076, 9570, 8015, 7109, 6668, 6613, 6916, 7612, 8799, 10680, 13533, 17542, 22323, 26406, 27842, 26401, 23773, 21278, 19204, 17464, 15947, 14657, 13828, 13808, 14707, 16376, 18489, 20732, 23214, 26504, 30526, 32767, 29990, 23614, 17418, 12934, 10068, 8302, 7248, 6680, 6504, 6689, 7268, 8328, 10066, 12770, 16686, 21555, 25955, 27598, 25825, 22471, 19156, 16175, 13391, 10832, 8771, 7377, 6558, 6019, 5426, 4653, 3863, 3197, 2676, 2265, 1948, 1697, 1490, 1312, 1166, 1048, 947, 849, 745, 644, 556, 483, 433, 400, 377, 361, 352, 350, 352, 357, 364, 375, 386, 391, 381, 355, 320, 286, 254, 224, 198, 175, 157, 143, 131, 119, 108, 96, 86, 76, 67, 60, 55, 51, 46, 42, 37, 33, 31, 28, 26, 23, 22, 19, 18, 15, 13, 10, 9, 5, 4, 2, 0, -2, -4, -5, -7, -9, -10, -12, -13, -14, -14, -15, -15, -16, -16, -17, -18, -20, -22, -23, -23, -23, -25, -26, -27, -27, -28, -27, -28, -28, -29, -30, -32, -32, -33, -34, -34, -34, -34, -36, -36, -36, -36, -38, -38, -39, -40, -40, -40, -41, -41, -43, -43, -42, -43, -44, -44, -45, -44, -43, -45, -45, -46, -46, -46, -46, -47, -47, -48, -48, -48, -48, -49, -50, -50, -51, -51, -51, -50, -52, -52, -51, -51, -51, -52, -52, -52, -53, -53, -53, -53, -54, -54, -55, -54, -54, -55, -55, -55, -55, -56, -56, -56]
-91154e6%%%jJjJ%%%%J%j%j%JjjJ%%JjJ%J%J%JjJ%KKLLMMQJ1J5J5J4J2QKoj1j0m%Joj0rqo
-91191a9%KOJ0J3J2RPMJ%kllmJLNQQPMMjrj4j4pjJpj1j2j0pjKNJ1J1J2RPK%mmopponnqj1q
-91226c2onmkkkjl%kjj%jj%jj%Jj%%%%%%%%%%%j%%%%%%j%%Jjj%%%%jJ%%%Jj%j%J%j%%%%%%
-91267f9%%%Jj%J%%j%%%%jJ%%%%Jjj%%J%Jj%%%j%%J%jJ%%%%j%%JjJ%j%%%%%%%%jJjKkJjJ%
-91309g0%%%%%%%j%%%%%%Jj%J%jJ%%%kJ%%%%Kk%%%%%%J%jjJj%JJj%%%%%J%j%%%jJ%j%%Jj%
-91351g2%%%%%%%JjJj%%%%%J%j%%%Jj%JjJj%%%Jj%%Jj%Jj%%%Jj%%%%%j%J%%%%jJ%%%%%%%j
-91393g3J%%%%%%%%%%%Jj%%Jj%%%%%%%%jJJj%%J%jj%K%jjJ%%%Jj%%Jj%%%%%Jj%jJJj%%%jJ
-91435g2%j%J%%JjJj%%%JkJ%JjjJ%%JjJjj%%%J%jJ%%j%%J%%%jJ%%jJJj%%j%%K%kJ%%j%%J%
$$ y = [-56, -56, -56, -56, -57, -56, -57, -56, -56, -56, -56, -56, -55, -55, -56, -56, -57, -57, -56, -57, -58, -57, -57, -57, -56, -57, -56, -56, -55, -55, -54, -54, -53, -54, -53, -53, -51, -49, -46, -43, -39, -35, -27, -16, -1, 14, 28, 40, 48, 50, 44, 33, 23, 19, 19, 20, 14, 4, -5, -13, -19, -19, -17, -11, -1, 12, 24, 33, 40, 44, 45, 45, 43, 40, 37, 33, 34, 37, 42, 50, 58, 65, 69, 73, 72, 63, 49, 35, 28, 27, 28, 21, 10, -2, -12, -19, -20, -18, -13, -2, 9, 21, 30, 37, 39, 39, 35, 31, 25, 18, 11, 5, 0, -5, -13, -24, -32, -38, -43, -47, -49, -51, -53, -54, -57, -57, -59, -60, -61, -61, -62, -63, -63, -64, -65, -65, -64, -65, -65, -65, -65, -65, -65, -65, -65, -65, -65, -65, -65, -66, -66, -66, -66, -66, -66, -66, -67, -67, -67, -66, -67, -68, -68, -68, -68, -68, -69, -68, -68, -68, -68, -67, -68, -68, -69, -69, -68, -68, -69, -69, -69, -69, -69, -69, -69, -69, -69, -69, -68, -69, -69, -68, -68, -68, -69, -69, -69, -69, -69, -70, -69, -69, -69, -69, -69, -68, -69, -70, -70, -70, -69, -69, -68, -69, -69, -69, -69, -70, -70, -70, -69, -69, -70, -69, -69, -69, -69, -69, -70, -70, -70, -69, -70, -69, -69, -70, -70, -70, -70, -70, -70, -70, -70, -70, -71, -70, -71, -69, -71, -70, -71, -70, -70, -70, -70, -70, -70, -70, -70, -70, -71, -71, -71, -71, -71, -71, -71, -70, -71, -71, -70, -70, -71, -70, -70, -70, -70, -72, -71, -71, -71, -71, -71, -69, -71, -71, -71, -71, -71, -71, -71, -70, -70, -71, -72, -71, -72, -72, -71, -70, -71, -71, -71, -71, -71, -71, -70, -70, -71, -71, -71, -71, -72, -71, -71, -72, -72, -72, -71, -72, -72, -72, -72, -72, -72, -72, -72, -72, -71, -72, -71, -72, -72, -72, -72, -72, -72, -71, -71, -72, -72, -72, -72, -71, -72, -72, -71, -72, -71, -72, -72, -72, -72, -71, -72, -72, -72, -71, -72, -72, -71, -72, -72, -72, -72, -71, -72, -72, -72, -72, -72, -72, -73, -73, -72, -72, -72, -72, -72, -73, -72, -72, -72, -72, -72, -72, -72, -72, -73, -72, -72, -72, -72, -72, -72, -72, -72, -72, -72, -72, -72, -71, -72, -72, -72, -71, -72, -72, -72, -72, -72, -72, -72, -72, -72, -73, -72, -71, -72, -72, -72, -71, -71, -72, -73, -73, -71, -71, -72, -73, -72, -72, -72, -72, -71, -72, -72, -72, -71, -72, -72, -72, -72, -72, -72, -71, -72, -72, -73, -72, -71, -72, -72, -72, -72, -73, -72, -72, -73, -73, -72, -72, -72, -71, -72, -71, -72, -72, -72, -72, -71, -73, -72, -72, -71, -72, -73, -72, -72, -72, -71, -72, -71, -72, -73, -73, -73, -73, -72, -72, -73, -72, -72, -72, -73, -73, -73, -72, -72, -72, -72, -73, -72, -72, -72, -73, -72, -71, -72, -72, -72, -73, -73, -73, -71, -71, -73, -72, -72, -72, -73, -73, -73, -72, -72]
-91477g2%%%%%%%%%j%J%%j%%%%JjJ%%%%%j%J%%%jJ%kJ%Jj%jJJj%%%%%jJJ%j%%%%jJ%j%%Jj
-91518g4J%jKkJ%jJ%%j%Jj%J%%%jKj%JjkJ%%%JJjjJ%%%Jj%%%%%%%jJJj%%%%%%%%%JjjJ%%%
-91560g3%%J%j%%J%jJj%J%%%%%jJ%%%%%%j%%J%jJ%%jJ%%jJJ%jjJJj%%%%%%%%%%J%j%%jJKj
-91602g1%%jJ%%kK%jJ%j%%%%%%%%Jj%%Jj%%%%%%j%J%jJ%%%kJ%J%jJ%%j%%%J%j%%%Jj%%%%%
-91644g3Jj%JkJ%%jJ%%%%%jJ%%%%%jJ%jJ%%jJjJ%%%%%Jjj%JjJ%%%j%JjJ%JkJ%%j%%J%%jjJ
-91686g4%J%%%%Jjj%%%jJJjJJjj%%%%Jj%%%%%jJ%Jj%%JjJ%%%%j%%%%%%%%J%j%%Jj%jJ%%Jj
-91728g4Kj%JjjjKj%%%J%j%%%%jJ%Jj%%%JjJ%j%%%jK%j%%J%j%%%%Jj%J%%%j%%%%j%Jj%J%%
-91769g4%%%%J%%jkK%%%j%J%jJ%%%jJ%%%%%%%Jj%%%%Jj%%%%%j%%%%J%%%%%jJ%j%J%%%%%%%
$$ y = [-72, -72, -72, -72, -72, -72, -72, -72, -72, -72, -73, -73, -72, -72, -72, -73, -73, -73, -73, -73, -72, -73, -72, -72, -72, -72, -72, -72, -73, -73, -72, -72, -72, -72, -73, -72, -72, -74, -73, -73, -72, -73, -73, -74, -73, -72, -73, -73, -73, -73, -73, -73, -74, -73, -72, -72, -73, -73, -73, -73, -73, -74, -73, -73, -74, -74, -74, -73, -74, -73, -73, -74, -72, -74, -73, -73, -74, -73, -73, -73, -74, -74, -73, -74, -74, -73, -73, -73, -73, -74, -72, -73, -73, -72, -73, -75, -74, -74, -74, -74, -73, -72, -73, -74, -73, -73, -73, -73, -72, -73, -73, -73, -73, -73, -73, -73, -73, -74, -73, -72, -73, -73, -73, -73, -73, -73, -73, -73, -73, -73, -72, -73, -74, -73, -73, -73, -73, -73, -73, -72, -72, -73, -73, -73, -72, -72, -73, -72, -73, -73, -72, -72, -72, -72, -72, -72, -73, -72, -72, -72, -72, -72, -72, -72, -73, -73, -73, -72, -72, -73, -72, -72, -72, -73, -72, -72, -72, -73, -72, -71, -71, -72, -73, -72, -71, -72, -72, -72, -72, -72, -72, -72, -72, -72, -72, -72, -71, -71, -72, -72, -72, -73, -72, -70, -71, -71, -71, -72, -71, -71, -71, -73, -71, -71, -72, -71, -71, -72, -72, -72, -72, -72, -72, -72, -72, -72, -71, -72, -72, -72, -71, -72, -72, -72, -72, -72, -72, -72, -73, -73, -72, -72, -73, -72, -72, -72, -72, -74, -73, -73, -72, -72, -73, -72, -72, -72, -73, -73, -73, -73, -72, -72, -73, -73, -73, -73, -72, -73, -73, -73, -73, -73, -73, -72, -73, -73, -72, -74, -73, -73, -73, -74, -73, -73, -73, -73, -73, -73, -74, -73, -73, -73, -73, -73, -73, -74, -73, -73, -74, -73, -73, -73, -74, -73, -74, -73, -73, -73, -73, -73, -73, -72, -73, -74, -74, -73, -74, -73, -73, -73, -73, -74, -74, -73, -74, -73, -73, -72, -74, -73, -73, -73, -74, -74, -74, -73, -73, -73, -74, -75, -74, -74, -73, -73, -73, -73, -73, -72, -73, -74, -74, -74, -74, -75, -74, -73, -74, -73, -72, -73, -74, -74, -74, -74, -74, -73, -74, -74, -74, -74, -74, -74, -75, -74, -74, -73, -74, -74, -74, -73, -74, -73, -73, -73, -73, -73, -74, -74, -74, -74, -74, -74, -74, -74, -74, -73, -73, -74, -74, -74, -73, -74, -74, -75, -74, -74, -74, -73, -74, -72, -73, -73, -72, -73, -74, -75, -73, -74, -74, -74, -74, -73, -73, -74, -74, -74, -74, -74, -75, -74, -74, -73, -74, -74, -74, -74, -73, -74, -73, -73, -74, -74, -74, -74, -75, -73, -73, -74, -74, -74, -73, -73, -74, -74, -74, -74, -74, -73, -74, -74, -73, -73, -73, -73, -74, -74, -74, -74, -74, -75, -75, -74, -75, -75, -74, -74, -74, -74, -74, -74, -74, -73, -73, -73, -74, -76, -74, -74, -74, -74, -75, -75, -74, -74, -75, -74, -74, -74, -74, -75, -74, -74, -74, -74, -74, -74, -74, -74, -73, -74, -74, -74, -74, -74, -73, -74, -74, -74, -74, -74, -74, -75, -75, -75, -75, -75, -74, -74, -74, -74, -74, -74, -75, -74, -74, -75, -75, -74, -74, -74, -74, -74, -74, -74, -74]
-91811g4%%%%Jjj%%J%jJ%%%j%%J%J%j%%%%%%%Jj%%%%%Jj%%Jj%%%%%%%%%%jJ%j%J%%%%%%%%
-91853g4jJ%%jJJkJ%Jj%%jJ%Jj%%%%J%%jjJJj%%Jj%%KkJJj%%j%%J%%jJJj%%%Jj%%%%%%Jjj
-91895g4J%%%%%%J%j%J%%%%%Jj%jJ%%%%%jJ%jJ%%%j%JjJ%j%J%%%jJjJj%%%%%j%J%j%J%%j%
-91937g4%%J%%%%%%%j%JjjKjJjJjjJ%%%%%Jj%%%%%%%jJ%%%%jJJj%%%%%%%jJj%%JjJj%%J%%
-91979g4jJ%%%jJ%%jJ%%%Jj%%jJ%J%kJ%%%%%%j%%%JjJ%%%%%j%J%jJjJ%%%jJ%%Jj%jJ%j%JJ
-92021g3j%jJjJj%%%%%%%%J%%j%J%jJ%%%%%%%jJ%%jJ%%%%%%j%J%jJj%%J%jJ%%%%jJ%j%%%%
-92062g5JjJ%%%%%%%%j%JJj%%%%jJjJ%jJ%%%%jJ%%%jJ%j%%J%%%%%Jj%%%%%jJ%%%%%%JJjj%
-92104g4j%J%jJJj%Jj%%j%J%%jJ%J%%%j%%jJ%Jjj%JjjJJ%%Jj%%%%%%Jj%%%%jKjjJjJ%j%J%
$$ y = [-74, -74, -74, -74, -74, -73, -74, -75, -75, -75, -74, -74, -75, -74, -74, -74, -74, -75, -75, -75, -74, -74, -73, -73, -74, -74, -74, -74, -74, -74, -74, -74, -73, -74, -74, -74, -74, -74, -74, -73, -74, -74, -74, -73, -74, -74, -74, -74, -74, -74, -74, -74, -74, -74, -74, -75, -74, -74, -75, -75, -74, -74, -74, -74, -74, -74, -74, -74, -74, -75, -74, -74, -74, -75, -74, -73, -75, -74, -74, -73, -74, -74, -74, -75, -74, -74, -73, -74, -74, -74, -74, -74, -73, -73, -73, -74, -75, -74, -73, -74, -74, -74, -73, -74, -74, -74, -72, -74, -73, -72, -73, -73, -73, -74, -74, -74, -73, -73, -73, -74, -73, -72, -73, -73, -73, -73, -72, -73, -73, -73, -73, -73, -73, -73, -72, -73, -74, -73, -73, -73, -73, -73, -73, -73, -72, -72, -73, -73, -72, -72, -72, -72, -72, -72, -71, -72, -72, -73, -72, -72, -72, -72, -72, -72, -73, -72, -72, -73, -72, -72, -72, -72, -73, -73, -72, -73, -72, -72, -73, -73, -72, -72, -72, -72, -73, -72, -73, -72, -73, -73, -73, -73, -73, -73, -74, -74, -73, -73, -74, -74, -73, -73, -73, -74, -74, -74, -74, -73, -73, -73, -73, -73, -73, -73, -73, -74, -74, -73, -74, -75, -73, -74, -73, -74, -73, -74, -75, -74, -74, -74, -74, -74, -74, -73, -74, -74, -74, -74, -74, -74, -74, -74, -75, -74, -74, -74, -74, -74, -75, -74, -73, -74, -74, -74, -74, -74, -74, -74, -74, -75, -74, -75, -75, -75, -74, -75, -74, -75, -75, -75, -74, -74, -74, -75, -74, -74, -74, -74, -75, -74, -74, -74, -75, -74, -74, -74, -74, -73, -74, -74, -74, -75, -74, -74, -73, -73, -75, -74, -74, -74, -74, -74, -74, -74, -75, -75, -75, -75, -74, -75, -74, -74, -74, -74, -74, -74, -75, -75, -74, -74, -75, -74, -75, -74, -74, -74, -74, -75, -74, -74, -74, -73, -74, -74, -75, -74, -74, -75, -75, -74, -73, -74, -74, -75, -74, -75, -74, -75, -75, -75, -75, -75, -75, -75, -75, -75, -74, -74, -74, -75, -75, -74, -74, -75, -74, -74, -74, -74, -74, -74, -74, -74, -75, -74, -74, -74, -75, -74, -74, -74, -74, -74, -74, -74, -75, -75, -74, -74, -75, -74, -75, -75, -75, -74, -74, -75, -74, -74, -74, -74, -74, -75, -74, -74, -75, -75, -75, -75, -75, -74, -75, -74, -74, -74, -74, -74, -74, -74, -74, -74, -75, -75, -74, -73, -74, -74, -74, -74, -74, -75, -74, -75, -74, -74, -75, -74, -74, -74, -74, -74, -75, -74, -74, -74, -74, -75, -74, -74, -75, -75, -75, -74, -74, -74, -74, -74, -74, -73, -74, -74, -74, -74, -74, -74, -75, -74, -74, -74, -74, -74, -74, -74, -73, -72, -73, -74, -74, -75, -75, -74, -74, -75, -74, -73, -74, -74, -73, -74, -74, -74, -75, -75, -74, -74, -74, -75, -74, -74, -73, -73, -73, -73, -74, -74, -74, -75, -74, -74, -73, -74, -75, -75, -74, -75, -76, -75, -74, -74, -74, -73, -74, -74, -74, -74, -74, -74, -74, -73, -74, -74, -74, -74, -74, -75, -73, -74, -75, -74, -75, -74, -74, -75, -75, -74, -74]
-92146g4Jj%%jJj%%Kj%%%%j%Jj%%J%%%j%J%%jJj%J%%%%%%%%kJJjJjJ%%j%%JjJ%%jJ%%%j%%
-92188g5jJJ%%%%%j%%Jj%%JkK%%%%jJjK%k%%%%JkJJjjJJjKj%%%jJj%%%Jj%JjJj%Jj%JjJ%%
-92230g4J%j%j%%%%%JkJJ%j%%%%%Jj%%J%%j%JjJjJ%jJj%%%J%%%%j%%%%%%%%Jj%%%%%%%J%j
-92272g5Jj%JjJj%%%%%J%%%%jJ%jJj%%Jj%%%%%%Jj%J%jJ%jJjJJkJ%jJ%%%j%%%%%%%%%%%%%
-92313g5%%%%J%%%JjjJjJ%%j%%J%j%%%J%jJj%%%J%j%%JjJj%J%%jJjJ%j%%jK%%%%jjJJjJjJ
-92355g4j%%%%jJJ%j%%%J%jJj%%%KkJj%%J%j%%%J%%jJ%%%%jJ%%%j%%%%%j%J%%%%%Jj%j%J%
-92397g5Jj%%%jJ%%%%%%%%%JJjj%%J%%%j%Jk%KjJj%%Jj%%JjJ%%%%jJ%%jJj%%Jj%JjJ%jJj%
-92439g5%J%%jJ%%j%%JjJ%j%jJ%J%%%%%%%%%%jjJ%%J%J%jJ%%%%%%j%%J%%%jj%J%JjJJj%%%
$$ y = [-74, -73, -74, -74, -74, -75, -74, -75, -75, -75, -73, -74, -74, -74, -74, -74, -75, -75, -74, -75, -75, -75, -74, -74, -74, -74, -75, -75, -74, -74, -74, -75, -74, -75, -75, -74, -74, -74, -74, -74, -74, -74, -74, -74, -76, -75, -74, -75, -74, -75, -74, -74, -74, -75, -75, -75, -74, -75, -74, -74, -74, -75, -74, -74, -74, -74, -75, -75, -75, -76, -75, -74, -74, -74, -74, -74, -74, -75, -75, -75, -74, -75, -75, -75, -74, -76, -74, -74, -74, -74, -74, -75, -74, -75, -73, -73, -75, -75, -75, -75, -75, -74, -76, -75, -74, -75, -76, -75, -74, -75, -73, -74, -74, -74, -74, -75, -74, -75, -75, -75, -75, -74, -75, -75, -74, -75, -74, -75, -75, -74, -75, -75, -74, -75, -74, -74, -74, -73, -73, -74, -74, -75, -75, -75, -75, -75, -75, -74, -76, -75, -74, -74, -75, -75, -75, -75, -75, -75, -74, -75, -75, -75, -74, -74, -74, -75, -75, -74, -75, -74, -75, -74, -74, -75, -74, -75, -75, -75, -75, -74, -74, -74, -74, -74, -75, -75, -75, -75, -75, -75, -75, -75, -75, -74, -75, -75, -75, -75, -75, -75, -75, -75, -74, -74, -75, -74, -75, -75, -74, -75, -74, -75, -75, -75, -75, -75, -75, -74, -74, -74, -74, -74, -75, -74, -74, -75, -74, -75, -75, -75, -74, -75, -75, -75, -75, -75, -75, -75, -74, -75, -75, -74, -74, -75, -74, -74, -75, -74, -75, -74, -73, -75, -74, -74, -75, -74, -74, -74, -74, -75, -75, -75, -75, -75, -75, -75, -75, -75, -75, -75, -75, -75, -75, -75, -75, -75, -75, -74, -74, -74, -74, -73, -74, -75, -74, -75, -74, -74, -74, -75, -75, -75, -74, -74, -75, -75, -75, -75, -74, -74, -75, -74, -75, -75, -75, -75, -74, -74, -75, -75, -75, -74, -75, -74, -75, -75, -74, -74, -74, -75, -74, -75, -74, -74, -75, -75, -75, -76, -74, -74, -74, -74, -74, -75, -76, -75, -74, -75, -74, -75, -74, -75, -75, -75, -75, -75, -76, -75, -74, -74, -75, -75, -75, -75, -74, -74, -75, -74, -75, -75, -75, -75, -73, -75, -74, -75, -75, -75, -74, -74, -75, -75, -75, -75, -74, -74, -74, -75, -74, -74, -74, -74, -74, -75, -74, -74, -74, -74, -75, -75, -75, -75, -75, -75, -76, -76, -75, -75, -75, -75, -75, -75, -74, -75, -75, -76, -76, -75, -75, -74, -75, -75, -75, -75, -76, -75, -75, -75, -75, -75, -75, -75, -75, -75, -75, -74, -73, -74, -75, -75, -75, -74, -74, -74, -74, -75, -75, -74, -76, -76, -74, -75, -74, -75, -75, -75, -74, -75, -75, -75, -74, -75, -74, -74, -74, -74, -74, -75, -74, -74, -74, -75, -74, -75, -75, -75, -74, -75, -75, -74, -75, -74, -74, -75, -74, -75, -75, -75, -74, -74, -74, -75, -74, -74, -74, -75, -75, -75, -74, -75, -74, -74, -75, -75, -76, -75, -75, -74, -74, -74, -74, -74, -74, -74, -74, -74, -74, -74, -75, -76, -75, -75, -75, -74, -74, -73, -73, -74, -73, -73, -73, -73, -73, -73, -73, -74, -74, -74, -73, -73, -73, -73, -74, -75, -75, -74, -74, -73, -74, -73, -72, -73, -73, -73, -73]
-92481g3%Jj%J%jjJjJ%%Jj%%%JjJ%j%j%jK%%Jj%%%JjKjkJj%%jK%%%%j%j%J%%%%%%%%Kk%%%
-92523g4%%%%%j%JjJ%%%j%JjJjJ%%kJ%J%jJk%K%j%%J%jj%%Kj%%%%%%%%%%%JjJj%%%J%jJ%j
-92564g5J%%j%JjJ%%j%%J%%%j%%%%%jJJ%jjJ%%%%%Jj%%J%j%%%%jJ%%%%%jJjKkJ%%JjJ%%j%
-92606g5Jj%jJJ%j%jJ%%%%J%%j%J%j%%jJj%%J%%J%%j%j%%JjJ%%%%%jJ%%%%J%j%%%%%%%j%%
-92648g6J%Kjj%J%%%%%j%J%j%jJJj%%j%K%%Jkj%J%%%%Jj%%%%J%%j%%Jj%%Jj%%J%%%j%%%%%
-92690g5%J%%j%%jJ%%%Jj%%%%%%%%%%jKj%jJ%%%JkJ%%jJ%%%%%%%%%%%%%%jJ%%%%Jj%%J%j%
-92732g5Kjj%Jjj%JJj%%%%j%J%%Jj%%%%%%%%%%j%J%J%j%%%%J%k%%%J%jJ%J%%jjJ%j%%J%j%
-92774g6%JJ%%j%%jJ%jJ%%Jj%%jJ%%%%%Jjj%%J%%%%j%%%%J%%%%jJ%%%jJ%%%jJJ%jj%J%%%j
$$ y = [-73, -73, -72, -73, -73, -72, -72, -73, -74, -73, -74, -73, -73, -73, -72, -73, -73, -73, -73, -72, -73, -72, -72, -73, -73, -74, -74, -75, -73, -73, -73, -72, -73, -73, -73, -73, -72, -73, -71, -72, -74, -73, -74, -74, -74, -75, -73, -73, -73, -73, -73, -74, -74, -75, -75, -74, -74, -74, -74, -74, -74, -74, -74, -74, -72, -74, -74, -74, -74, -74, -74, -74, -74, -74, -75, -75, -74, -75, -74, -74, -74, -74, -75, -75, -74, -75, -74, -75, -74, -74, -74, -76, -75, -75, -74, -74, -75, -74, -76, -76, -74, -74, -75, -75, -75, -74, -74, -75, -76, -76, -76, -74, -75, -75, -75, -75, -75, -75, -75, -75, -75, -75, -75, -75, -74, -75, -74, -75, -75, -75, -75, -74, -74, -75, -74, -74, -75, -74, -74, -74, -75, -75, -74, -75, -74, -74, -74, -75, -75, -75, -74, -74, -74, -74, -75, -75, -75, -75, -75, -75, -76, -75, -74, -74, -75, -76, -75, -75, -75, -75, -75, -75, -74, -75, -75, -75, -74, -74, -75, -75, -75, -75, -75, -76, -75, -75, -75, -75, -75, -75, -76, -75, -76, -74, -76, -75, -75, -75, -74, -75, -74, -74, -74, -75, -75, -74, -75, -75, -76, -75, -74, -74, -75, -75, -76, -75, -75, -75, -75, -75, -74, -74, -74, -75, -75, -74, -74, -75, -75, -75, -76, -75, -76, -76, -76, -75, -75, -75, -74, -74, -74, -75, -75, -76, -76, -76, -75, -76, -75, -75, -75, -75, -75, -75, -76, -75, -75, -75, -75, -75, -74, -74, -75, -75, -75, -75, -75, -75, -75, -75, -76, -76, -76, -75, -75, -73, -74, -75, -75, -74, -74, -74, -74, -74, -74, -75, -75, -74, -74, -75, -75, -76, -75, -74, -75, -75, -75, -76, -76, -74, -74, -74, -73, -75, -76, -76, -75, -75, -75, -75, -75, -74, -75, -75, -75, -75, -75, -74, -74, -74, -75, -75, -75, -74, -75, -75, -75, -74, -75, -75, -75, -74, -74, -74, -74, -75, -75, -75, -75, -75, -75, -75, -74, -74, -74, -75, -75, -75, -76, -75, -75, -75, -75, -74, -75, -75, -75, -75, -75, -75, -75, -75, -75, -75, -75, -76, -74, -75, -75, -76, -75, -75, -75, -75, -74, -76, -75, -75, -75, -76, -75, -75, -75, -75, -75, -75, -75, -75, -75, -75, -75, -75, -75, -75, -75, -76, -75, -75, -75, -75, -75, -74, -75, -75, -75, -74, -74, -75, -75, -73, -74, -75, -75, -74, -75, -76, -76, -75, -74, -75, -75, -75, -75, -75, -76, -76, -75, -75, -75, -74, -75, -75, -75, -75, -75, -75, -75, -75, -75, -75, -75, -76, -76, -75, -75, -74, -74, -75, -75, -75, -75, -75, -74, -74, -76, -76, -76, -76, -75, -75, -76, -75, -75, -74, -74, -74, -75, -76, -75, -75, -76, -76, -76, -75, -75, -76, -76, -76, -75, -74, -74, -74, -75, -75, -75, -76, -75, -75, -76, -75, -75, -75, -74, -75, -75, -75, -76, -75, -75, -75, -75, -75, -75, -74, -75, -76, -76, -76, -75, -75, -75, -75, -75, -76, -76, -76, -76, -76, -75, -75, -75, -75, -75, -76, -75, -75, -75, -75, -76, -75, -75, -75, -75, -76, -75, -74, -74, -75, -76, -76, -75, -75, -75, -75, -76]
-92815g6J%%Jj%JjjJ%jJ%%%Jj%%%%%%%%%%%JjjJJ%jJ%jJj%jJ%Jj%%%jJ%%%%%%%%jJ%%j%%%
-92857g6J%%%%%jJ%%%%%%Jj%%jJ%%%%%%%%%%%%%JjjJjJ%j%J%%%%%j%J%%J%%j%%%%%%%%%%%
-92899g5%Jj%J%%jj%J%%%%%%%%%jJJjj%J%%%jJ%%%j%%%Jj%%%JJj%%%jJJkJJj%Jj%%%%Jj%%
-92941g5jJ%%%%%%%%%%j%%J%J%k%J%%%%j%JJk%J%%%%%%%%j%JjJ%jJ%%%j%%%J%%%%%jJ%%Jk
-92983g6J%jJ%%Jj%%j%%%%JjJ%Jj%%j%J%%%Jj%%%%%%%%j%J%%jJ%%%jJJ%jjJ%%j%JjJ%%%%j
-93025g6%%J%Jj%jJ%%j%J%%Jk%%J%%%%jJJ%j%%%%%%jJjJ%jJj%J%j%J%Jjj%%%J%%%%%jJ%%%
-93066g5j%JJj%j%%J%%j%%JjJ%jJ%jJ%%%jJ%%%%j%%J%%%%%%jJ%%%%%%j%%JJjJjjJ%jJj%%%
-93108g6%%Jj%J%%%j%%J%%%%j%J%Jj%%%j%JjK%j%%%%%%%%%%%j%%JjJjJ%%%%%%jJjJ%jjJJ%
$$ y = [-76, -75, -75, -75, -74, -75, -75, -74, -75, -76, -75, -75, -76, -75, -75, -75, -75, -74, -75, -75, -75, -75, -75, -75, -75, -75, -75, -75, -75, -75, -74, -75, -76, -75, -74, -74, -75, -74, -74, -75, -74, -75, -75, -76, -75, -75, -74, -75, -75, -75, -75, -76, -75, -75, -75, -75, -75, -75, -75, -75, -75, -76, -75, -75, -75, -76, -76, -76, -76, -75, -75, -75, -75, -75, -75, -76, -75, -75, -75, -75, -75, -75, -75, -74, -75, -75, -75, -76, -75, -75, -75, -75, -75, -75, -75, -75, -75, -75, -75, -75, -75, -75, -74, -75, -76, -75, -76, -75, -75, -76, -76, -75, -75, -75, -75, -75, -75, -76, -76, -75, -75, -75, -74, -74, -74, -75, -75, -75, -75, -75, -75, -75, -75, -75, -75, -75, -75, -75, -74, -75, -75, -74, -74, -74, -75, -76, -76, -75, -75, -75, -75, -75, -75, -75, -75, -75, -75, -76, -75, -74, -75, -76, -76, -75, -75, -75, -75, -76, -75, -75, -75, -75, -76, -76, -76, -76, -75, -76, -76, -76, -76, -75, -74, -75, -75, -75, -75, -76, -75, -74, -76, -75, -74, -75, -75, -74, -75, -75, -75, -75, -75, -74, -75, -75, -75, -76, -75, -75, -75, -75, -75, -75, -75, -75, -75, -75, -75, -76, -76, -76, -75, -75, -74, -74, -76, -76, -75, -75, -75, -75, -75, -76, -76, -75, -74, -76, -76, -75, -75, -75, -75, -75, -75, -75, -75, -75, -76, -76, -75, -76, -75, -75, -76, -75, -75, -75, -75, -76, -76, -76, -76, -75, -75, -75, -75, -75, -75, -76, -75, -75, -75, -74, -76, -75, -75, -76, -75, -75, -75, -74, -75, -75, -75, -76, -76, -76, -76, -76, -75, -76, -75, -75, -74, -75, -75, -75, -76, -76, -75, -75, -75, -75, -74, -75, -75, -75, -75, -75, -75, -75, -75, -75, -76, -76, -75, -75, -75, -76, -75, -75, -75, -75, -76, -75, -74, -74, -75, -76, -75, -75, -75, -76, -76, -75, -76, -75, -75, -75, -75, -75, -76, -76, -76, -75, -75, -74, -75, -75, -76, -75, -75, -75, -76, -76, -75, -75, -75, -74, -76, -76, -76, -75, -75, -75, -75, -75, -76, -75, -74, -74, -75, -75, -75, -75, -75, -75, -75, -76, -75, -76, -75, -75, -76, -75, -76, -76, -75, -75, -76, -76, -75, -75, -74, -75, -76, -76, -76, -76, -75, -75, -75, -75, -75, -75, -76, -75, -75, -75, -75, -76, -76, -75, -74, -75, -75, -76, -76, -76, -75, -75, -75, -76, -76, -76, -75, -76, -75, -75, -76, -75, -75, -76, -75, -75, -75, -75, -76, -75, -75, -75, -75, -75, -76, -76, -76, -75, -75, -75, -75, -75, -75, -75, -76, -75, -75, -75, -75, -75, -75, -75, -76, -76, -76, -75, -74, -75, -74, -75, -76, -75, -75, -76, -75, -76, -76, -76, -76, -76, -76, -75, -76, -76, -75, -75, -75, -75, -76, -76, -76, -75, -75, -75, -75, -75, -76, -76, -75, -75, -74, -75, -75, -75, -75, -76, -76, -75, -76, -74, -74, -75, -75, -75, -75, -75, -75, -75, -75, -75, -75, -75, -75, -76, -76, -76, -75, -76, -75, -76, -75, -75, -75, -75, -75, -75, -75, -76, -75, -76, -75, -75, -76, -77, -76, -75, -75]
-93150g5%%jJjJjJJj%%%%%Jj%%J%%j%jJjJ%%%%Jj%%J%j%%%%jJJ%j%%j%J%%%j%%%%%J%Jj%%
-93192g5JjjJ%%%%%%Jj%%j%KjjJ%%%%%%%%%jJ%%%Jj%%jJ%%%%%%jJj%%%J%%%%j%J%jJ%%%j%
-93234g6%JJ%j%j%%J%jJj%Jj%J%jJ%%%%%%Jj%%jJ%j%JJk%%J%%%j%J%%%%%%%%%Jj%jJ%%%Jj
-93276g5%%%%%%%jJ%jJ%%jJ%%%%%%%%%j%%%J%j%J%%j%%J%%%%%j%%J%%%%%jJ%%%jKjjJJj%%
-93318g5%j%JjJjJ%j%J%Jj%%%%%Jj%Jj%jJ%jJ%jJ%%jJ%jjJJJj%Jj%Jj%%%%%j%%%%%%%%J%%
-93359g5j%%%J%j%%%KkJ%jJ%j%J%%kJ%%%J%%%jJ%jJ%JjjJ%%jJj%%J%%%%%%j%%%J%%j%%J%%
-93401g5%%jJJj%j%%J%j%JJj%%jJJk%Jj%%Jj%Jj%%%J%jJ%j%J%%%%%%%%%%j%K%k%%%J%%%jJ
-93443g5%%%%%%%%%%jJ%%%j%J%%jKj%%%jJ%%j%%J%%%Jj%Jj%%%%%%%%jJ%j%%JjJ%%J%%j%%%
$$ y = [-75, -75, -75, -76, -75, -76, -75, -76, -75, -74, -75, -75, -75, -75, -75, -75, -74, -75, -75, -75, -74, -74, -74, -75, -75, -76, -75, -76, -75, -75, -75, -75, -75, -74, -75, -75, -75, -74, -74, -75, -75, -75, -75, -75, -76, -75, -74, -74, -75, -75, -75, -76, -76, -75, -75, -75, -75, -76, -76, -76, -76, -76, -76, -75, -75, -74, -75, -75, -75, -74, -75, -76, -75, -75, -75, -75, -75, -75, -75, -74, -75, -75, -75, -76, -76, -74, -75, -76, -75, -75, -75, -75, -75, -75, -75, -75, -75, -75, -76, -75, -75, -75, -75, -74, -75, -75, -75, -76, -75, -75, -75, -75, -75, -75, -75, -76, -75, -76, -76, -76, -76, -75, -75, -75, -75, -75, -76, -76, -75, -75, -76, -75, -75, -75, -75, -76, -76, -76, -75, -74, -74, -75, -75, -76, -76, -76, -75, -75, -76, -75, -76, -76, -75, -76, -76, -75, -75, -76, -75, -75, -75, -75, -75, -75, -75, -74, -75, -75, -75, -76, -75, -75, -76, -76, -75, -74, -76, -76, -76, -75, -75, -75, -75, -76, -76, -75, -75, -75, -75, -75, -75, -75, -75, -75, -75, -74, -75, -75, -76, -75, -75, -75, -75, -74, -75, -75, -75, -75, -75, -75, -75, -75, -76, -75, -75, -76, -75, -75, -75, -76, -75, -75, -75, -75, -75, -75, -75, -75, -75, -75, -76, -76, -76, -76, -75, -75, -76, -76, -75, -75, -75, -76, -76, -76, -75, -75, -75, -75, -75, -75, -76, -76, -76, -75, -75, -75, -75, -75, -75, -76, -75, -75, -75, -75, -76, -74, -75, -76, -75, -74, -75, -75, -75, -75, -76, -76, -75, -76, -75, -76, -75, -75, -76, -76, -75, -75, -74, -75, -75, -75, -75, -75, -75, -74, -75, -75, -74, -75, -75, -76, -75, -75, -76, -75, -75, -76, -75, -75, -75, -76, -75, -75, -76, -77, -76, -75, -74, -75, -75, -74, -75, -75, -74, -75, -75, -75, -75, -75, -75, -76, -76, -76, -76, -76, -76, -76, -76, -76, -75, -75, -75, -76, -76, -76, -76, -75, -75, -76, -76, -76, -76, -74, -76, -75, -75, -76, -75, -75, -76, -76, -75, -75, -75, -77, -76, -76, -76, -76, -75, -75, -75, -75, -76, -75, -75, -76, -75, -75, -74, -75, -76, -75, -75, -75, -76, -75, -76, -76, -76, -75, -75, -75, -75, -75, -75, -75, -76, -76, -76, -76, -75, -75, -75, -76, -76, -76, -75, -75, -75, -75, -75, -76, -75, -74, -75, -75, -76, -76, -76, -75, -75, -76, -76, -75, -74, -75, -75, -75, -76, -75, -74, -76, -76, -75, -76, -76, -76, -75, -76, -76, -75, -76, -76, -76, -76, -75, -75, -76, -75, -75, -76, -76, -75, -75, -75, -75, -75, -75, -75, -75, -75, -75, -75, -76, -76, -74, -74, -76, -76, -76, -76, -75, -75, -75, -75, -76, -75, -75, -75, -75, -75, -75, -75, -75, -75, -75, -75, -76, -75, -75, -75, -75, -76, -76, -75, -75, -75, -76, -74, -75, -75, -75, -75, -76, -75, -75, -75, -76, -76, -76, -75, -75, -75, -75, -74, -75, -75, -74, -75, -75, -75, -75, -75, -75, -75, -75, -75, -76, -75, -75, -76, -76, -76, -75, -76, -75, -75, -75, -74, -74, -74, -75, -75, -75, -75]
-93485g5%%jJ%JjJkjJJ%%j%%%%%J%%%jJjJ%Jj%%%%%%%j%%J%%%%Jj%%j%J%%j%%Jj%%JJ%j%J
-93527g4j%JjJjj%%J%%%Jj%%Jj%%%j%%%%J%%JkJjJ%%%%%%%jjJJjJj%J%J%j%%j%J%J%%j%jJ
-93569g5jKj%J%Jjj%jJ%%%%%%%%%%%Jj%%%%%%%J%%jJ%jJ%jjJJ%jJj%jJ%%j%Jj%J%%jJ%%jJ
-93610g5%%%%%j%%jJJ%%%jJ%j%J%%j%J%%%j%%%%JjJ%%%jJ%jJ%%%%%%jJ%j%%%J%%j%J%%jJj
-93652g6%%%%Jj%%JJk%%%Jj%J%%%j%%%J%%%%%%j%J%%j%%%JJj%%%%%Jj%%j%%%%%J%%jJ%jKj
-93694g5%%%%%jJ%jJ%%%%jJ%j%J%%%%JjjJj%J%%%j%J%jJ%%%%%jJJj%%%%%jJ%%jJj%JjJ%%j
-93736g6%J%jJ%j%%%JjJ%%%%%%jJ%j%KjjJ%%%Jj%%%%%jJ%jJJjjJ%%%%JjjJ%jJ%%%%jJj%%J
-93778g5%jJj%%%J%jJjJjJ%%Jj%%j%jKj%J%Jj%%%%j%J%%j%J%%Jj%jJJ%jjJ%j%%%%J%j%J%j
$$ y = [-75, -75, -75, -76, -75, -75, -74, -75, -74, -76, -77, -76, -75, -75, -75, -76, -76, -76, -76, -76, -76, -75, -75, -75, -75, -76, -75, -76, -75, -75, -74, -75, -75, -75, -75, -75, -75, -75, -75, -76, -76, -76, -75, -75, -75, -75, -75, -74, -75, -75, -75, -76, -76, -75, -75, -75, -76, -76, -76, -75, -76, -76, -76, -75, -74, -74, -75, -75, -74, -75, -75, -74, -75, -74, -75, -76, -76, -76, -75, -75, -75, -75, -74, -75, -75, -75, -74, -75, -75, -75, -75, -76, -76, -76, -76, -76, -75, -75, -75, -74, -76, -75, -76, -75, -75, -75, -75, -75, -75, -75, -75, -76, -77, -76, -75, -76, -75, -76, -76, -75, -75, -74, -74, -75, -75, -75, -76, -76, -75, -75, -74, -74, -74, -75, -75, -76, -75, -76, -74, -75, -75, -74, -74, -73, -74, -75, -75, -76, -75, -75, -75, -75, -75, -75, -75, -75, -75, -75, -75, -75, -74, -75, -75, -75, -75, -75, -75, -75, -75, -74, -74, -74, -75, -74, -74, -75, -74, -74, -75, -76, -75, -74, -74, -75, -74, -75, -75, -76, -75, -75, -75, -76, -76, -75, -76, -76, -75, -75, -75, -76, -75, -75, -75, -76, -75, -75, -75, -75, -75, -75, -76, -76, -76, -77, -76, -75, -75, -75, -75, -76, -75, -75, -76, -76, -75, -75, -75, -76, -76, -75, -75, -75, -75, -76, -76, -76, -76, -76, -75, -76, -75, -75, -75, -75, -76, -75, -75, -76, -75, -75, -75, -75, -75, -75, -75, -76, -75, -75, -76, -76, -76, -76, -75, -75, -75, -76, -76, -75, -75, -75, -76, -75, -76, -76, -76, -76, -76, -75, -76, -76, -76, -75, -74, -76, -76, -76, -76, -75, -76, -76, -75, -75, -75, -75, -76, -76, -76, -76, -75, -75, -75, -75, -75, -75, -75, -76, -76, -75, -75, -75, -76, -76, -76, -76, -75, -74, -75, -75, -75, -75, -75, -75, -74, -75, -75, -75, -76, -76, -76, -76, -76, -76, -75, -75, -75, -76, -75, -75, -76, -74, -75, -75, -75, -75, -75, -75, -76, -75, -75, -76, -75, -75, -75, -75, -75, -76, -75, -75, -76, -76, -75, -75, -75, -75, -75, -74, -75, -76, -75, -76, -76, -75, -75, -75, -75, -76, -76, -75, -75, -76, -75, -75, -75, -75, -75, -75, -76, -75, -74, -75, -75, -75, -75, -75, -75, -76, -75, -75, -75, -76, -75, -76, -76, -75, -76, -75, -75, -75, -76, -76, -75, -75, -76, -75, -75, -76, -76, -76, -76, -75, -76, -75, -75, -75, -75, -75, -75, -75, -76, -75, -75, -76, -76, -74, -75, -76, -75, -75, -75, -75, -74, -75, -75, -75, -75, -75, -75, -76, -75, -75, -76, -75, -74, -75, -76, -75, -75, -75, -75, -75, -74, -75, -76, -75, -75, -76, -75, -75, -75, -75, -75, -76, -75, -76, -76, -76, -75, -75, -76, -75, -76, -76, -76, -76, -75, -75, -76, -75, -76, -75, -76, -75, -75, -75, -74, -75, -75, -75, -76, -76, -77, -75, -76, -76, -75, -75, -74, -75, -75, -75, -75, -75, -76, -76, -75, -75, -75, -76, -76, -75, -75, -75, -74, -75, -75, -76, -75, -74, -74, -75, -76, -75, -75, -76, -76, -76, -76, -76, -75, -75, -76, -76, -75, -75, -76]
-93820g6%%%J%%%%%%%jJJkJ%%jJ%%jJ%%%%%%%%%%Jj%Jj%jJ%%%jJjJJ%jJj%%jJ%%j%J%%%jJ
-93861g5%%jJ%%%%jJ%%%%%j%%%%%%J%%%%%jJjJ%%j%%Jj%%J%%j%%%J%%j%J%%%%JjJk%%%%J%
-93903g5%%%%%%%jJ%%%j%%J%%%%%%%%j%%%%%%%%%JJjjJjJ%j%%J%%j%%%jJ%J%%j%KjjJ%%%%
-93945g5jJj%%%%%J%%%%%Jj%%%jJkJ%%%%J%j%%%%%J%jJjJ%%jKj%jJjJj%%Jj%J%%j%J%jJjJ
-93987g5%jJ%jjJ%J%%%%%%%%%%j%%JjJ%%j%J%%%%%%jJjJ%%jJ%j%%%%%JjJjJjJ%%%j%J%%%%
-94029g5%%%j%J%%%%j%%%%%%%%%J%jJ%jJ%%%jJ%%%%%%%%%%j%%%Jj%%J%%%%%j%%J%j%%J%%%
-94071g5Jj%jKj%%%%%jJ%jJ%%%%%%jJ%%%%%jJj%J%%%j%%%J%%%%%jJ%%j%Kj%j%%J%j%J%jJ%
-94112g5jJ%%%j%J%%%JkjK%%%jJ%%jJjJ%%%%%%%%%j%%K%jjJ%%JkJ%%%%%%%%j%J%JjjJ%%%%
$$ y = [-76, -76, -76, -76, -75, -75, -75, -75, -75, -75, -75, -75, -76, -75, -74, -76, -75, -75, -75, -76, -75, -75, -75, -76, -75, -75, -75, -75, -75, -75, -75, -75, -75, -75, -75, -74, -75, -75, -74, -75, -75, -76, -75, -75, -75, -75, -76, -75, -76, -75, -74, -74, -75, -74, -75, -75, -75, -76, -75, -75, -75, -76, -76, -75, -75, -75, -75, -76, -75, -75, -75, -76, -75, -75, -75, -75, -75, -76, -75, -75, -75, -75, -75, -75, -76, -76, -76, -76, -76, -76, -76, -75, -75, -75, -75, -75, -75, -76, -75, -76, -75, -75, -75, -76, -76, -76, -75, -76, -76, -76, -75, -75, -75, -76, -76, -76, -76, -75, -75, -75, -76, -76, -75, -75, -75, -75, -75, -74, -75, -74, -76, -76, -76, -76, -76, -75, -75, -75, -75, -75, -75, -75, -75, -75, -76, -75, -75, -75, -75, -76, -76, -76, -75, -75, -75, -75, -75, -75, -75, -75, -75, -76, -76, -76, -76, -76, -76, -76, -76, -76, -76, -75, -74, -75, -76, -75, -76, -75, -75, -76, -76, -76, -75, -75, -75, -76, -76, -76, -76, -77, -76, -76, -75, -75, -75, -76, -76, -74, -75, -76, -75, -75, -75, -75, -75, -76, -75, -76, -76, -76, -76, -76, -76, -75, -75, -75, -75, -75, -75, -74, -75, -75, -75, -75, -76, -75, -77, -76, -76, -76, -76, -76, -75, -75, -76, -76, -76, -76, -76, -76, -75, -75, -76, -75, -76, -75, -75, -75, -76, -74, -75, -75, -76, -75, -76, -75, -76, -76, -76, -75, -76, -76, -75, -75, -75, -76, -76, -75, -75, -76, -75, -76, -75, -75, -76, -75, -75, -76, -77, -76, -76, -75, -75, -75, -75, -75, -75, -75, -75, -75, -75, -75, -76, -76, -76, -75, -76, -75, -75, -75, -76, -76, -75, -75, -75, -75, -75, -75, -75, -76, -75, -76, -75, -75, -75, -76, -75, -75, -76, -76, -76, -76, -76, -76, -75, -76, -75, -76, -75, -76, -75, -75, -75, -75, -76, -76, -75, -75, -75, -75, -75, -75, -75, -75, -76, -76, -75, -75, -75, -75, -75, -76, -76, -76, -76, -76, -76, -76, -76, -76, -76, -75, -75, -76, -75, -75, -76, -75, -75, -75, -75, -76, -75, -75, -75, -75, -75, -75, -75, -75, -75, -75, -75, -76, -76, -76, -76, -75, -76, -76, -76, -75, -75, -75, -75, -75, -75, -76, -76, -76, -75, -75, -76, -76, -76, -75, -75, -75, -75, -74, -75, -75, -76, -74, -75, -75, -75, -75, -75, -75, -76, -75, -75, -76, -75, -75, -75, -75, -75, -75, -75, -76, -75, -75, -75, -75, -75, -75, -76, -75, -76, -76, -75, -75, -75, -75, -76, -76, -76, -76, -75, -75, -75, -75, -75, -75, -76, -75, -75, -75, -76, -76, -74, -75, -75, -76, -76, -76, -75, -75, -76, -76, -75, -75, -76, -75, -75, -76, -75, -75, -75, -75, -76, -76, -75, -75, -75, -75, -74, -76, -77, -75, -75, -75, -75, -76, -75, -75, -75, -76, -75, -76, -75, -75, -75, -75, -75, -75, -75, -75, -75, -75, -76, -76, -76, -74, -74, -75, -76, -75, -75, -75, -74, -76, -75, -75, -75, -75, -75, -75, -75, -75, -75, -76, -76, -75, -75, -74, -75, -76, -75, -75, -75, -75, -75]
-94154g5%%jJ%%%%jJ%%%%Jj%jJ%j%%%%Jj%J%%%%%%%Jj%%%%j%%J%%%j%%%Jj%%%%J%j%%jK%%
-94196g5Jj%%%%%%%%%j%%%%J%%%%%%j%J%%%%%j%%JjJj%%%%%%%%%%J%jJJjj%%%J%jJ%%%%J%
-94238g4%k%%JJkJj%%%%J%%%j%%J%%jJ%%%%j%J%%jJj%JJj%%j%JjJjJ%j%J%%%%%j%J%j%jKJ
-94280g4kJ%%%%%%%%%jJ%%jJ%%%%%jJ%jJ%jJ%j%J%jKj%jJ%j%%%%%%%J%jJj%J%jJ%%%%%%%j
-94322g6%%%%%J%%%%%%%%jJ%jK%j%jJ%%%j%J%%jJ%jJ%%%jJ%%%%%j%%J%%%j%%J%J%jj%%%J%
-94363g5%%%%%%%%%%%jJ%%%%%%%JjjJ%Jj%Jj%j%J%%%jJ%jJ%%%%%%%%j%%%J%jJ%j%JjJJ%k%
-94405g6%jK%%%%%Jk%%J%JjjKj%%kLj%%j%%%%Jj%J%%%%JjjJjJ%%jJ%%kJJ%%%%%j%J%%Jj%j
-94447g6%jKjJ%%%jjJ%%J%%%%%%%%%j%%%JjJJj%j%Jj%Jj%%Jj%%%%%%%%%J%jJ%JkJ%%Jjj%%
$$ y = [-75, -75, -75, -76, -75, -75, -75, -75, -75, -76, -75, -75, -75, -75, -75, -74, -75, -75, -76, -75, -75, -76, -76, -76, -76, -76, -75, -76, -76, -75, -75, -75, -75, -75, -75, -75, -75, -74, -75, -75, -75, -75, -75, -76, -76, -76, -75, -75, -75, -75, -76, -76, -76, -76, -75, -76, -76, -76, -76, -76, -75, -75, -76, -76, -76, -77, -75, -75, -75, -74, -75, -75, -75, -75, -75, -75, -75, -75, -75, -75, -76, -76, -76, -76, -76, -75, -75, -75, -75, -75, -75, -75, -76, -76, -75, -75, -75, -75, -75, -75, -76, -76, -76, -75, -76, -75, -76, -76, -76, -76, -76, -76, -76, -76, -76, -76, -76, -75, -75, -76, -75, -74, -75, -76, -76, -76, -76, -75, -75, -76, -75, -75, -75, -75, -75, -74, -74, -74, -76, -76, -76, -75, -74, -76, -75, -76, -76, -76, -76, -76, -75, -75, -75, -75, -76, -76, -76, -75, -75, -75, -76, -75, -75, -75, -75, -75, -76, -76, -75, -75, -75, -76, -75, -76, -76, -75, -74, -75, -75, -75, -76, -76, -75, -76, -75, -76, -75, -75, -76, -76, -75, -75, -75, -75, -75, -75, -76, -76, -75, -75, -76, -76, -77, -75, -74, -76, -75, -75, -75, -75, -75, -75, -75, -75, -75, -75, -76, -75, -75, -75, -76, -75, -75, -75, -75, -75, -75, -76, -75, -75, -76, -75, -75, -76, -75, -75, -76, -76, -75, -75, -76, -74, -75, -75, -76, -75, -75, -76, -76, -76, -76, -76, -76, -76, -76, -75, -75, -76, -75, -76, -76, -75, -75, -76, -75, -75, -75, -75, -75, -75, -75, -75, -76, -76, -76, -76, -76, -76, -75, -75, -75, -75, -75, -75, -75, -75, -75, -76, -75, -75, -76, -74, -74, -75, -75, -76, -75, -75, -75, -75, -76, -76, -75, -75, -75, -76, -75, -75, -76, -75, -75, -75, -75, -76, -75, -75, -75, -75, -75, -75, -76, -76, -76, -75, -75, -75, -75, -76, -76, -76, -75, -75, -74, -74, -75, -76, -76, -76, -76, -75, -75, -75, -75, -75, -75, -75, -75, -75, -75, -75, -75, -75, -76, -75, -75, -75, -75, -75, -75, -75, -75, -74, -75, -76, -75, -75, -74, -75, -75, -74, -75, -75, -76, -76, -75, -75, -75, -75, -76, -75, -75, -76, -75, -75, -75, -75, -75, -75, -75, -75, -75, -76, -76, -76, -76, -75, -75, -76, -75, -75, -76, -76, -75, -76, -75, -74, -74, -76, -76, -76, -77, -75, -75, -75, -75, -75, -75, -74, -76, -76, -76, -75, -75, -74, -75, -76, -74, -75, -75, -75, -77, -74, -75, -75, -75, -76, -76, -76, -76, -76, -75, -76, -76, -75, -75, -75, -75, -75, -74, -75, -76, -75, -76, -75, -75, -75, -76, -75, -75, -75, -77, -76, -75, -75, -75, -75, -75, -75, -76, -76, -75, -75, -75, -74, -75, -75, -76, -76, -77, -75, -76, -75, -75, -75, -75, -76, -77, -76, -76, -76, -75, -75, -75, -75, -75, -75, -75, -75, -75, -75, -76, -76, -76, -76, -75, -76, -75, -74, -75, -75, -76, -76, -75, -76, -76, -75, -76, -76, -76, -75, -76, -76, -76, -76, -76, -76, -76, -76, -76, -76, -75, -75, -76, -75, -75, -74, -76, -75, -75, -75, -74, -75, -76, -76, -76]
-94489g6J%j%Jj%J%%%%%%jJj%%Jj%Kj%%j%J%%Jjj%%%J%jJjJ%%%%j%%JjJ%jJjJJj%J%kJ%%%
-94531g5%jJ%%jJ%%%j%%%JjJ%kJJ%jJjJ%j%%%J%%%%j%J%j%%%%%J%%%j%J%%jJj%J%%j%%%%%
-94573g6J%%%%%%jJjJj%J%%j%J%Jj%j%Jj%%%J%%%jJ%Jj%%%Jj%%%%%%JkJj%J%%%jJ%%%%J%j
-94615g5%%%%jjJ%%J%%%%%%%%%%jJ%%jJ%%%%%%%jJ%jJ%%%%%%j%JJjj%J%jJ%jJ%j%J%%j%%%
-94656g6J%%%%%%%jJ%%%%jKj%%%%%jJj%JjJj%J%jjJJjJ%%%%%%%%Jj%j%%Jj%J%%%%jJ%Jk%J
-94698g5%%%%%J%%jj%%J%%%j%J%%%%%%%%%%j%%J%%%Jj%%%%jJ%%%%%jJj%%%J%j%%J%%JjkJ%
-94740g6J%%%jJ%%%j%%%Jj%J%%JjjJ%%jJ%%%%%jJ%%%%%%%%jJ%%jJ%%%%jJ%%%%%%jJkJJ%%%
-94782g5%%%%J%j%%%jJ%%jJj%%%KjjJ%%j%Jj%J%%%%%%%%JJjj%%%j%%J%j%%J%%jJ%%j%J%%%
$$ y = [-76, -75, -75, -76, -76, -75, -76, -76, -75, -75, -75, -75, -75, -75, -75, -76, -75, -76, -76, -76, -75, -76, -76, -74, -75, -75, -75, -76, -76, -75, -75, -75, -74, -75, -76, -76, -76, -76, -75, -75, -76, -75, -76, -75, -75, -75, -75, -75, -76, -76, -76, -75, -76, -75, -75, -76, -75, -76, -75, -74, -75, -75, -74, -74, -76, -75, -75, -75, -75, -75, -76, -75, -75, -75, -76, -75, -75, -75, -75, -76, -76, -76, -76, -75, -76, -75, -75, -77, -76, -75, -75, -76, -75, -76, -75, -75, -76, -76, -76, -76, -75, -75, -75, -75, -75, -76, -76, -75, -75, -76, -76, -76, -76, -76, -76, -75, -75, -75, -75, -76, -76, -75, -75, -75, -76, -75, -76, -76, -75, -75, -75, -76, -76, -76, -76, -76, -76, -75, -75, -75, -75, -75, -75, -75, -76, -75, -76, -75, -76, -76, -75, -75, -75, -76, -76, -75, -75, -74, -75, -75, -76, -76, -75, -76, -76, -76, -76, -75, -75, -75, -75, -76, -75, -75, -74, -75, -75, -75, -75, -74, -75, -75, -75, -75, -75, -75, -75, -74, -76, -75, -76, -76, -75, -75, -75, -75, -76, -75, -75, -75, -75, -75, -74, -74, -75, -75, -75, -75, -75, -76, -77, -76, -76, -76, -75, -75, -75, -75, -75, -75, -75, -75, -75, -75, -75, -76, -75, -75, -75, -76, -75, -75, -75, -75, -75, -75, -75, -75, -76, -75, -75, -76, -75, -75, -75, -75, -75, -75, -75, -76, -76, -75, -74, -75, -76, -76, -75, -75, -76, -75, -75, -76, -75, -75, -76, -76, -75, -75, -75, -76, -76, -76, -76, -75, -75, -75, -75, -75, -75, -75, -75, -76, -75, -75, -75, -75, -75, -76, -74, -75, -75, -75, -75, -75, -75, -76, -75, -76, -76, -75, -76, -75, -76, -76, -75, -75, -76, -77, -76, -75, -76, -75, -75, -75, -75, -75, -75, -75, -75, -75, -74, -75, -75, -76, -76, -76, -75, -76, -76, -75, -75, -75, -75, -75, -76, -75, -75, -74, -76, -76, -75, -75, -75, -75, -75, -75, -74, -74, -74, -75, -76, -76, -76, -75, -75, -75, -75, -76, -76, -75, -75, -75, -75, -75, -75, -75, -75, -75, -75, -75, -76, -76, -76, -75, -75, -75, -75, -74, -75, -75, -75, -75, -75, -76, -75, -75, -75, -75, -75, -75, -76, -75, -76, -76, -76, -76, -75, -75, -76, -76, -76, -75, -75, -75, -74, -75, -77, -76, -76, -75, -75, -75, -75, -76, -75, -75, -75, -75, -76, -76, -76, -76, -75, -76, -76, -75, -75, -75, -74, -75, -76, -75, -75, -75, -76, -75, -75, -75, -75, -75, -75, -76, -75, -75, -75, -75, -75, -75, -75, -75, -75, -76, -75, -75, -75, -76, -75, -75, -75, -75, -75, -76, -75, -75, -75, -75, -75, -75, -75, -76, -75, -77, -76, -75, -75, -75, -75, -75, -75, -75, -75, -74, -74, -75, -75, -75, -75, -76, -75, -75, -75, -76, -75, -76, -76, -76, -76, -74, -75, -76, -75, -75, -75, -76, -76, -75, -76, -76, -75, -75, -75, -75, -75, -75, -75, -75, -75, -74, -73, -74, -75, -75, -75, -75, -76, -76, -76, -75, -75, -76, -76, -76, -75, -75, -75, -76, -75, -75, -75, -76, -76, -75, -75, -75, -75]
-94824g5%%%%%%J%%%j%%%%%%j%%J%Jj%Jj%%%%%Jj%%j%%J%%j%%J%kK%%%j%%J%%%%%%%%%%Jj
-94866g5%j%%%%J%%j%J%%J%j%jJ%%jJ%%%%%%%%%%jJjJjJ%jJ%%%%%%j%%%JjJjJ%%%%j%J%%%
-94907g5Jj%%%%%%%J%j%JjjKjj%JJj%%%%%Jj%%J%jj%J%%j%%JJj%Jj%%%jKj%j%J%%%%%%%%%
-94949g5jJ%%jJ%%%%%%J%j%jJJj%j%%%J%j%%J%%%Jj%%%JjjJ%%%%j%J%%j%%%%J%%%%J%j%%%
-94991g5jJ%%J%jjJ%jJ%%%%Jj%%%%%%%kJ%J%jKj%%%%%%%%jJ%j%J%%%%j%%J%jJJj%%%%jJ%%
-95033g5%%j%JjJ%%j%%JjJ%%%%%%%%%Jj%%%%j%J%%%%jJ%%%%%%JjjJ%%%JjjKj%%%%j%%J%%j
-95075g6%%Jj%%%%%J%jJ%%%%%%%j%J%%%%j%%JjJ%%%%jJ%%%%%%%%%%jJjJ%j%J%%%%%%%%jJ%
-95117g5%j%J%%%%%%%%%%%%%%%%%%%%%J%jJj%Jj%%jJ%jJ%%%jJJ%%j%Jj%%%jJ%Jj%%%jKj%%
$$ y = [-75, -75, -75, -75, -75, -75, -75, -74, -74, -74, -74, -75, -75, -75, -75, -75, -75, -75, -76, -76, -76, -75, -75, -74, -75, -75, -74, -75, -75, -75, -75, -75, -75, -74, -75, -75, -75, -76, -76, -76, -75, -75, -75, -76, -76, -76, -75, -75, -77, -75, -75, -75, -75, -76, -76, -76, -75, -75, -75, -75, -75, -75, -75, -75, -75, -75, -75, -74, -75, -75, -76, -76, -76, -76, -76, -75, -75, -75, -76, -76, -75, -75, -75, -74, -74, -75, -75, -76, -75, -75, -75, -76, -75, -75, -75, -75, -75, -75, -75, -75, -75, -75, -75, -76, -75, -76, -75, -76, -75, -75, -76, -75, -75, -75, -75, -75, -75, -75, -76, -76, -76, -76, -75, -76, -75, -76, -75, -75, -75, -75, -75, -76, -76, -75, -75, -75, -75, -74, -75, -75, -75, -75, -75, -75, -75, -75, -74, -74, -75, -75, -74, -75, -76, -74, -75, -76, -76, -75, -74, -75, -75, -75, -75, -75, -75, -74, -75, -75, -75, -74, -74, -75, -76, -76, -75, -75, -75, -76, -76, -76, -75, -74, -75, -75, -74, -75, -75, -75, -75, -76, -74, -75, -75, -76, -76, -75, -75, -75, -75, -75, -75, -75, -75, -75, -75, -76, -75, -75, -75, -76, -75, -75, -75, -75, -75, -75, -75, -74, -74, -75, -75, -76, -75, -74, -75, -75, -76, -76, -76, -76, -75, -75, -76, -76, -76, -75, -75, -75, -75, -74, -75, -75, -75, -75, -74, -75, -76, -75, -75, -75, -75, -75, -76, -76, -75, -75, -75, -76, -76, -76, -76, -76, -75, -75, -75, -75, -75, -74, -74, -75, -75, -75, -75, -76, -75, -75, -75, -74, -74, -75, -76, -75, -75, -76, -75, -75, -75, -75, -75, -74, -75, -75, -75, -75, -75, -75, -75, -75, -77, -76, -76, -75, -75, -76, -74, -75, -75, -75, -75, -75, -75, -75, -75, -75, -76, -75, -75, -76, -76, -75, -75, -75, -75, -75, -76, -76, -76, -75, -75, -76, -75, -74, -75, -75, -75, -75, -75, -76, -75, -75, -75, -75, -75, -76, -76, -75, -76, -75, -75, -75, -76, -76, -76, -75, -76, -75, -75, -75, -75, -75, -75, -75, -75, -75, -75, -74, -75, -75, -75, -75, -75, -76, -76, -75, -75, -75, -75, -75, -76, -75, -75, -75, -75, -75, -75, -75, -74, -75, -76, -75, -75, -75, -75, -74, -75, -76, -74, -75, -75, -75, -75, -75, -76, -76, -76, -75, -75, -75, -76, -76, -76, -75, -76, -76, -76, -76, -76, -76, -75, -75, -76, -75, -75, -75, -75, -75, -75, -75, -75, -76, -76, -75, -75, -75, -75, -75, -76, -76, -76, -75, -76, -75, -75, -75, -75, -75, -76, -75, -75, -75, -75, -75, -75, -75, -75, -75, -75, -75, -76, -75, -76, -75, -75, -76, -76, -75, -75, -75, -75, -75, -75, -75, -75, -75, -76, -75, -75, -75, -76, -76, -75, -75, -75, -75, -75, -75, -75, -75, -75, -75, -75, -75, -75, -75, -75, -75, -75, -75, -75, -75, -75, -75, -74, -74, -75, -74, -75, -75, -74, -75, -75, -75, -76, -75, -75, -76, -75, -75, -75, -75, -76, -75, -74, -74, -74, -75, -75, -74, -75, -75, -75, -75, -76, -75, -75, -74, -75, -75, -75, -75, -76, -74, -75, -75, -75]
-95158g5%j%%%J%%%Jj%J%j%jJj%Kk%J%%%%%%%J%kJj%J%%%Jj%%%j%J%j%J%jJ%%%%jJ%%jJ%%
-95200g5%%%j%JJjJ%%j%%%%%%%%%%Jj%jJ%%%%%Jj%%%%J%%k%J%j%J%jJ%%%%%%%%%jJ%%%%%%
-95242g5J%%%j%J%jj%%J%%%%%%%J%%j%%%%%%%%%%Jj%%Jj%%%JjjJJj%%%JjJj%%%%%jJ%Jj%j
-95284g6JJj%%%%JjJj%%%j%J%%jJ%Jj%%%%jJjJ%%JjJ%j%%%Jj%J%j%JjjJ%%J%j%%Jj%%%%%%
-95326g5Jj%%Jj%%jJ%%%%%%%jJ%jJ%%%%%Jj%Jj%Jk%JJ%%j%%%%%JjjKj%%%%jKj%%%%%%%J%k
-95368g6J%Jj%%%%%%%j%J%jJ%%%%Jj%Jj%%%J%j%%%jJJjJj%j%%J%j%J%%%j%%J%Jj%%%%%%Jj
-95409g5%Jj%%%jJ%%%%%%%%J%j%%%%Jj%%J%j%jJJ%%%j%%J%j%%%%%%%jJ%J%j%%J%j%%%%%%%
-95451g5Jj%%%jJJ%j%%%%jKj%%%%%%%%%%%%jJ%jJ%%%%%%%jJJ%kJJj%%%%%%%%J%jJj%%Jj%J
$$ y = [-75, -75, -76, -76, -76, -76, -75, -75, -75, -75, -74, -75, -75, -74, -74, -75, -75, -76, -75, -76, -76, -74, -76, -76, -75, -75, -75, -75, -75, -75, -75, -75, -74, -74, -76, -75, -76, -76, -75, -75, -75, -75, -74, -75, -75, -75, -75, -76, -76, -75, -75, -76, -76, -75, -75, -76, -75, -75, -75, -75, -75, -76, -75, -75, -75, -76, -75, -75, -75, -75, -75, -75, -76, -76, -75, -74, -75, -74, -74, -74, -75, -75, -75, -75, -75, -75, -75, -75, -75, -75, -75, -74, -75, -75, -76, -75, -75, -75, -75, -75, -75, -74, -75, -75, -75, -75, -75, -74, -74, -74, -76, -76, -75, -75, -76, -76, -75, -75, -76, -75, -75, -75, -75, -75, -75, -75, -75, -75, -75, -76, -75, -75, -75, -75, -75, -75, -75, -74, -74, -74, -74, -75, -75, -74, -74, -75, -76, -76, -76, -75, -75, -75, -75, -75, -75, -75, -75, -74, -74, -74, -75, -75, -75, -75, -75, -75, -75, -75, -75, -75, -75, -74, -75, -75, -75, -74, -75, -75, -75, -75, -74, -75, -76, -75, -74, -75, -75, -75, -75, -74, -75, -74, -75, -75, -75, -75, -75, -75, -76, -75, -75, -74, -75, -75, -76, -75, -74, -75, -75, -75, -75, -75, -74, -75, -74, -75, -75, -75, -75, -76, -76, -75, -75, -75, -76, -75, -75, -74, -75, -75, -75, -75, -75, -76, -75, -76, -75, -75, -75, -74, -75, -74, -74, -75, -75, -75, -75, -74, -75, -75, -74, -74, -75, -75, -74, -75, -76, -75, -75, -75, -74, -74, -75, -75, -75, -74, -75, -75, -75, -75, -75, -75, -75, -74, -75, -75, -75, -74, -75, -75, -75, -76, -75, -75, -75, -75, -75, -75, -75, -75, -76, -75, -75, -76, -75, -75, -75, -75, -75, -75, -74, -75, -75, -74, -75, -75, -74, -76, -76, -75, -74, -74, -74, -75, -75, -75, -75, -75, -75, -74, -75, -76, -74, -75, -75, -75, -75, -75, -76, -74, -75, -75, -75, -75, -75, -75, -75, -75, -74, -74, -76, -75, -75, -74, -75, -75, -75, -75, -75, -75, -75, -75, -76, -76, -75, -75, -76, -75, -75, -75, -75, -75, -74, -75, -75, -74, -75, -75, -75, -75, -74, -74, -75, -75, -75, -75, -76, -75, -74, -75, -74, -75, -75, -76, -76, -76, -75, -75, -76, -76, -75, -75, -75, -75, -76, -76, -76, -75, -75, -74, -75, -75, -75, -75, -75, -75, -75, -74, -75, -75, -74, -75, -75, -75, -75, -76, -75, -75, -75, -75, -75, -75, -75, -75, -75, -74, -74, -75, -75, -75, -75, -75, -74, -75, -75, -75, -74, -74, -75, -75, -76, -75, -74, -74, -74, -74, -75, -75, -75, -74, -74, -75, -75, -75, -75, -75, -75, -75, -75, -76, -75, -75, -74, -74, -75, -75, -75, -74, -74, -75, -75, -75, -75, -75, -75, -75, -75, -74, -75, -75, -75, -75, -76, -75, -74, -74, -75, -75, -75, -75, -75, -76, -74, -75, -75, -75, -75, -75, -75, -75, -75, -75, -75, -75, -75, -75, -76, -75, -75, -76, -75, -75, -75, -75, -75, -75, -75, -75, -76, -75, -74, -74, -76, -75, -74, -75, -75, -75, -75, -75, -75, -75, -75, -75, -74, -74, -75, -74, -75, -75, -75, -74, -75, -75, -74]
-95493g4%%%jjJ%%%%%%%%%Jj%%%Jj%%%%%%%JjJj%Jj%%Jj%%j%%J%%jJ%%J%%j%%%jJ%%Jjj%J
-95535g5%%%jJ%%%%%J%jjJ%%%%%jJ%%jJ%jJ%Jj%%J%jJjJjjJ%%jJ%Jk%K%jJ%j%%%%%%Jj%J%
-95577g4%j%Jj%jJjJ%%%%jJjJ%%%%%%%%%%%%%%%jJ%%%%%%%%%%j%J%JjJj%%%%%%%%%%%j%J%
-95619g5jJ%JkJ%%%%%%%%%J%%%j%J%jJjJ%%jJjj%J%J%%%j%%%%%Jk%JJkK%%jJ%j%%%%%j%JJ
-95660g4jJ%j%Jj%J%%%j%Jj%jJ%Jj%%%JjJjjJj%J%%%J%%%kJ%J%%j%JkJ%%%%Jj%J%%%%j%j%
-95702g6J%%%%J%j%%%%%%JjJj%JjjJjJ%%JkJJj%%%%Jj%%%%%%%j%J%Jj%JjkJJ%%%%%%Jj%%%
-95744g5%%%%%%Jj%%%%Jj%%J%j%%J%j%jJ%%J%j%%%Jj%%%%%Jj%%%%Jj%%%%%%J%%j%%%%jJ%J
-95786g4%j%jJ%%%%Jj%%Jj%%%J%j%%%%%%J%j%jKj%jK%%j%%J%%%%j%%%%Jk%J%%%J%j%%%J%j
$$ y = [-74, -74, -74, -74, -75, -76, -75, -75, -75, -75, -75, -75, -75, -75, -75, -75, -74, -75, -75, -75, -75, -74, -75, -75, -75, -75, -75, -75, -75, -75, -74, -75, -74, -75, -75, -74, -75, -75, -75, -74, -75, -75, -75, -76, -76, -76, -75, -75, -75, -76, -75, -75, -75, -74, -74, -74, -75, -75, -75, -75, -76, -75, -75, -75, -74, -75, -76, -76, -75, -75, -75, -75, -76, -75, -75, -75, -75, -75, -75, -74, -74, -75, -76, -75, -75, -75, -75, -75, -75, -76, -75, -75, -75, -76, -75, -75, -76, -75, -75, -74, -75, -75, -75, -74, -74, -75, -74, -75, -74, -75, -76, -75, -75, -75, -76, -75, -75, -74, -76, -76, -74, -74, -75, -74, -74, -75, -75, -75, -75, -75, -75, -75, -74, -75, -75, -74, -74, -74, -75, -75, -74, -75, -75, -76, -75, -76, -75, -75, -75, -75, -75, -76, -75, -76, -75, -75, -75, -75, -75, -75, -75, -75, -75, -75, -75, -75, -75, -75, -75, -75, -76, -75, -75, -75, -75, -75, -75, -75, -75, -75, -75, -75, -76, -76, -75, -75, -74, -75, -74, -75, -75, -75, -75, -75, -75, -75, -75, -75, -75, -75, -75, -76, -76, -75, -75, -76, -75, -75, -74, -76, -75, -75, -75, -75, -75, -75, -75, -75, -75, -75, -74, -74, -74, -74, -75, -75, -74, -74, -75, -74, -75, -74, -74, -74, -75, -74, -75, -76, -76, -75, -75, -74, -74, -74, -74, -75, -75, -75, -75, -75, -75, -74, -76, -76, -75, -74, -76, -74, -74, -74, -75, -74, -74, -75, -75, -75, -75, -75, -75, -76, -76, -75, -74, -75, -74, -74, -75, -75, -74, -75, -75, -74, -74, -74, -74, -75, -75, -74, -75, -75, -76, -75, -75, -74, -75, -75, -75, -75, -74, -75, -74, -75, -76, -75, -76, -76, -75, -75, -75, -75, -74, -74, -74, -74, -76, -75, -75, -74, -74, -74, -75, -75, -74, -76, -75, -75, -75, -75, -75, -74, -75, -75, -74, -74, -74, -74, -74, -75, -75, -76, -76, -75, -75, -75, -75, -75, -74, -74, -75, -75, -75, -75, -75, -75, -75, -74, -75, -74, -75, -75, -74, -75, -76, -75, -76, -75, -75, -75, -74, -76, -75, -74, -75, -75, -75, -75, -75, -74, -75, -75, -75, -75, -75, -75, -75, -75, -76, -76, -75, -75, -74, -75, -75, -74, -75, -77, -76, -75, -75, -75, -75, -75, -75, -75, -74, -75, -75, -75, -75, -75, -75, -75, -75, -75, -75, -74, -75, -75, -75, -75, -75, -74, -75, -75, -75, -74, -74, -75, -75, -75, -74, -74, -75, -75, -76, -75, -75, -75, -74, -74, -75, -75, -75, -75, -74, -75, -75, -75, -75, -75, -75, -74, -75, -75, -75, -75, -75, -74, -75, -75, -75, -75, -75, -75, -75, -74, -74, -74, -75, -75, -75, -75, -75, -76, -75, -75, -74, -74, -75, -75, -76, -75, -75, -75, -75, -75, -74, -75, -75, -75, -74, -75, -75, -75, -75, -74, -74, -75, -75, -75, -75, -75, -75, -75, -74, -74, -75, -75, -76, -74, -75, -75, -76, -74, -74, -74, -75, -75, -75, -74, -74, -74, -74, -74, -75, -75, -75, -75, -75, -74, -76, -76, -75, -75, -75, -75, -74, -74, -75, -75, -75, -75, -74, -74, -75]
-95828g5%%%%%J%%j%Jj%%%%%%%%J%%%j%%%%%%%%%%%j%Kj%JjJ%jjJ%%%%J%j%Jj%J%jjJJj%%
-95870g5%JkJ%J%%j%%%%J%j%jJ%%%%%Jj%%%J%%j%Jj%%%JjJ%j%J%j%%%J%jJ%%%j%%J%%j%J%
-95912g4%j%j%J%j%%J%%J%%jJ%jJjJ%j%%jKj%JjJj%%%%jJ%Jj%Jj%%%J%jJj%%Jj%J%%j%%J%
-95953g4j%J%%%jjJ%%%%J%j%%%%Jj%%J%%%%j%%J%jJj%%%%jJ%%%%%%J%j%J%%j%%%%%J%%j%%
-95995g5%J%%%j%%JjJjJ%%%%%jJJjjJjJjJ%%jJ%%j%j%%J%%Jj%%%%JkJJJjj%%%jJ%%%Jj%J%
-96037g4%jJ%j%%Jj%J%%%%%%%%j%J%%%j%%%JjJ%%jJkJ%J%%%jJj%J%j%%JjJJjj%Jj%%jJ%J%
-96079g4%%jJ%j%j%%KjJj%JjjJ%%%JjJ%jJj%%J%j%%%jJ%J%%%jJ%%j%Jj%J%%%j%%J%%%%%%k
-96121g6%KJk%J%%%jJjJjJ%%%%%%j%%%Jj%%JjJ%jJj%J%%j%%%%%J%%kJ%%%%JjJ%%jJ%%j%J%
$$ y = [-75, -75, -75, -75, -75, -75, -74, -74, -74, -75, -75, -74, -75, -75, -75, -75, -75, -75, -75, -75, -75, -74, -74, -74, -74, -75, -75, -75, -75, -75, -75, -75, -75, -75, -75, -75, -75, -76, -76, -74, -75, -75, -74, -75, -74, -74, -75, -76, -75, -75, -75, -75, -75, -74, -74, -75, -75, -74, -75, -75, -74, -74, -75, -76, -75, -74, -75, -75, -75, -75, -74, -76, -75, -75, -74, -74, -74, -75, -75, -75, -75, -75, -74, -74, -75, -75, -76, -75, -75, -75, -75, -75, -75, -74, -75, -75, -75, -75, -74, -74, -74, -75, -75, -74, -75, -75, -75, -75, -74, -75, -74, -74, -75, -75, -74, -74, -75, -75, -75, -75, -74, -74, -75, -74, -74, -74, -74, -75, -75, -75, -74, -74, -74, -75, -75, -74, -74, -74, -75, -75, -76, -76, -75, -75, -76, -76, -76, -75, -75, -75, -74, -74, -74, -75, -74, -74, -75, -74, -75, -74, -74, -75, -75, -75, -76, -74, -75, -75, -74, -75, -74, -75, -75, -75, -75, -75, -76, -75, -75, -74, -75, -75, -74, -75, -75, -75, -75, -74, -74, -75, -74, -75, -75, -75, -74, -75, -75, -74, -74, -74, -75, -75, -75, -74, -74, -75, -75, -74, -74, -74, -74, -75, -76, -75, -75, -75, -75, -75, -74, -74, -75, -75, -75, -75, -75, -74, -75, -75, -75, -74, -74, -74, -74, -74, -75, -75, -75, -74, -74, -75, -74, -75, -75, -75, -75, -75, -76, -75, -75, -75, -75, -75, -75, -75, -74, -74, -75, -75, -74, -74, -74, -75, -75, -75, -75, -75, -75, -74, -74, -74, -75, -75, -75, -75, -74, -74, -74, -74, -75, -75, -75, -74, -75, -74, -75, -74, -74, -74, -74, -74, -74, -75, -74, -73, -74, -75, -74, -75, -74, -75, -74, -74, -74, -75, -74, -74, -74, -75, -75, -76, -76, -76, -75, -75, -75, -74, -75, -75, -75, -75, -75, -74, -76, -75, -74, -73, -74, -75, -75, -75, -75, -76, -75, -75, -75, -75, -74, -75, -75, -74, -74, -74, -75, -74, -74, -75, -75, -75, -74, -75, -75, -74, -74, -74, -74, -74, -74, -74, -74, -74, -75, -75, -74, -74, -74, -74, -75, -75, -75, -75, -74, -75, -74, -74, -74, -75, -74, -76, -75, -75, -74, -74, -74, -74, -75, -74, -75, -75, -74, -74, -75, -75, -75, -74, -75, -74, -73, -74, -75, -75, -74, -75, -75, -75, -76, -75, -75, -74, -74, -74, -74, -75, -74, -74, -75, -75, -76, -76, -76, -74, -75, -74, -75, -75, -74, -75, -76, -75, -75, -75, -75, -74, -75, -74, -74, -75, -74, -75, -75, -75, -74, -74, -75, -75, -75, -75, -76, -75, -75, -74, -74, -74, -74, -75, -74, -74, -74, -75, -75, -74, -75, -75, -74, -74, -74, -74, -75, -75, -75, -74, -74, -74, -74, -74, -74, -74, -76, -76, -74, -73, -75, -75, -74, -74, -74, -74, -75, -74, -75, -74, -75, -74, -74, -74, -74, -74, -74, -74, -75, -75, -75, -75, -74, -75, -75, -75, -74, -75, -74, -74, -75, -74, -75, -75, -74, -74, -74, -75, -75, -75, -75, -75, -75, -74, -74, -74, -76, -75, -75, -75, -75, -75, -74, -75, -74, -74, -74, -75, -74, -74, -74, -75, -75, -74, -74]
-96163g4%j%%JkJ%J%%%%j%%%Jj%Jj%%%%%Jj%%%%%J%jJj%%%J%%%%%%%%%jJ%%%%%jJ%j%%%%J
-96204g4%%%jJjJ%j%%%%Jj%%%%J%%%%jJ%%%%J%k%%jJJ%%%%%%jJJj%%%%jJ%%%%j%%J%%j%%%
-96246g5%jJJjJ%j%JjKj%j%J%%%j%%J%j%J%j%%J%j%%Jj%%%%%J%%%jJ%j%J%%%%%j%J%%jJ%%
-96288g4%j%%J%JjjJ%j%%J%%%%j%%%J%%jJ%%%%%j%%J%%jJj%%%J%jJ%%%%%%%%%%%j%%%J%%%
-96330g4jJ%j%%%%%J%Jj%%j%%%%%jKj%JJj%%j%J%j%J%%Jjj%%%JjJ%j%%%%%%%J%%%%%Jj%%%
-96372g4%%%%%%jJ%jJjJ%%%%jJj%JjJjJj%J%jJ%%%j%JjJjJj%%J%jJ%%Jj%JjJj%%%%%%%jJ%
-96414g4jJ%%j%%%%J%jJ%%%%jJ%%j%%%JjJjJ%Jj%jJ%%j%Jj%J%%%j%J%%%%JjjJj%J%%JjjJ%
-96455g4jJjJ%%%kJJ%%%%%j%J%%jJ%Jj%%j%J%%%%%%%%%%%%%Jj%%%jJ%jJjJJk%J%%%J%kJ%j
$$ y = [-74, -74, -75, -75, -75, -74, -76, -75, -75, -74, -74, -74, -74, -74, -75, -75, -75, -75, -74, -75, -75, -74, -75, -75, -75, -75, -75, -75, -74, -75, -75, -75, -75, -75, -75, -74, -74, -75, -74, -75, -75, -75, -75, -74, -74, -74, -74, -74, -74, -74, -74, -74, -74, -75, -74, -74, -74, -74, -74, -74, -75, -74, -74, -75, -75, -75, -75, -75, -74, -74, -74, -74, -75, -74, -75, -74, -74, -75, -75, -75, -75, -75, -74, -75, -75, -75, -75, -75, -74, -74, -74, -74, -74, -75, -74, -74, -74, -74, -74, -73, -73, -75, -75, -75, -76, -75, -74, -74, -74, -74, -74, -74, -74, -75, -74, -73, -74, -74, -74, -74, -74, -75, -74, -74, -74, -74, -74, -75, -75, -75, -74, -74, -74, -75, -75, -75, -75, -75, -76, -75, -74, -75, -74, -74, -75, -75, -74, -75, -73, -74, -74, -75, -75, -74, -74, -74, -74, -75, -75, -75, -74, -74, -75, -75, -74, -74, -75, -75, -75, -74, -74, -75, -75, -75, -74, -75, -75, -75, -75, -75, -75, -74, -74, -74, -74, -75, -74, -74, -75, -75, -74, -74, -74, -74, -74, -74, -75, -75, -74, -74, -74, -75, -74, -74, -74, -74, -75, -75, -75, -74, -74, -73, -74, -75, -74, -74, -75, -75, -75, -74, -74, -74, -74, -74, -75, -75, -75, -75, -74, -74, -74, -75, -74, -74, -74, -74, -74, -74, -75, -75, -75, -74, -74, -74, -75, -74, -75, -75, -75, -75, -74, -74, -75, -74, -74, -74, -74, -74, -74, -74, -74, -74, -74, -74, -74, -75, -75, -75, -75, -74, -74, -74, -74, -75, -74, -74, -75, -75, -75, -75, -75, -75, -74, -74, -73, -74, -74, -74, -75, -75, -75, -75, -75, -75, -76, -74, -75, -75, -74, -73, -74, -74, -74, -75, -75, -74, -74, -75, -75, -74, -74, -74, -73, -74, -75, -75, -75, -75, -74, -75, -74, -74, -75, -75, -75, -75, -75, -75, -75, -75, -74, -74, -74, -74, -74, -74, -73, -74, -74, -74, -74, -74, -74, -74, -74, -74, -74, -75, -74, -74, -75, -74, -75, -74, -74, -74, -74, -74, -75, -74, -75, -75, -74, -75, -74, -75, -74, -75, -75, -74, -74, -75, -74, -74, -74, -74, -75, -75, -74, -75, -74, -75, -74, -75, -75, -75, -74, -74, -75, -74, -74, -74, -73, -74, -74, -73, -74, -73, -74, -74, -74, -74, -74, -74, -74, -74, -75, -74, -74, -75, -74, -74, -74, -75, -75, -75, -75, -75, -74, -74, -75, -74, -74, -74, -74, -74, -75, -74, -74, -74, -75, -75, -75, -75, -74, -75, -74, -75, -74, -74, -73, -74, -74, -75, -74, -74, -74, -75, -75, -74, -75, -75, -74, -74, -74, -74, -75, -75, -74, -74, -74, -74, -74, -73, -74, -75, -74, -75, -75, -74, -74, -74, -73, -74, -75, -74, -74, -75, -74, -75, -74, -74, -74, -74, -76, -75, -74, -74, -74, -74, -74, -74, -75, -75, -74, -74, -74, -75, -74, -74, -73, -74, -74, -74, -75, -75, -74, -74, -74, -74, -74, -74, -74, -74, -74, -74, -74, -74, -74, -74, -73, -74, -74, -74, -74, -75, -74, -74, -75, -74, -75, -74, -73, -75, -75, -74, -74, -74, -74, -73, -73, -75, -74, -74, -75]
-96497g5J%%Jj%j%J%jJ%%%%jJ%%%%%j%K%j%jJ%%%j%%J%%%Jj%%%j%%Jj%JjJJ%%j%%%%%jJ%%
-96539g4jJ%%%jJJj%%%%%%%%j%J%%%j%J%%%%jJ%%%%Jj%%%%Jk%JjJ%%j%Jj%%J%j%JJj%%jjJ
-96581g5Jj%%%Jj%J%%J%%j%j%%Kj%J%j%%%%%%jJ%j%JjJ%%%%j%J%%%j%JjJ%%jJ%%%%%%%%Jj
-96623g4J%j%%%%%%%jJjJ%%jJ%%Jk%%J%%%%%jJJ%jjJ%%%%%%%J%%j%%%%%%Jj%jJ%%J%j%%%%
-96665g4%%%%%jKj%%%%%jJjJ%%JkJ%%%%JjKjjJj%%%%%jJ%%%JjJj%jJ%jJ%jJj%Jj%J%j%Kj%
-96706g4%%%jJJkJJj%%%%%%%jJJj%%j%J%%%%%%%%%%j%%J%%jJ%%%%%%%Jj%%%%%Jj%%%%Jj%%
-96748g4%%JjjJ%%%%Jk%K%jjJj%J%jJ%%%%%jJJkJ%%%%JkJJj%jJ%Jj%%jJ%%jJ%%%%%Jj%%%%
-96790g4J%jJj%JjJ%j%%%%%%%%%%%Jj%%%%%%%%%%%%%%Jj%%%%Jk%JJj%%%JjJj%%%%jJ%%%%%
$$ y = [-75, -74, -74, -74, -73, -74, -74, -75, -75, -74, -74, -75, -74, -74, -74, -74, -74, -75, -74, -74, -74, -74, -74, -74, -75, -75, -73, -73, -74, -74, -75, -74, -74, -74, -74, -75, -75, -75, -74, -74, -74, -74, -73, -74, -74, -74, -74, -75, -75, -75, -74, -75, -75, -74, -75, -74, -73, -73, -73, -74, -74, -74, -74, -74, -74, -75, -74, -74, -74, -75, -74, -74, -74, -74, -75, -74, -73, -74, -74, -74, -74, -74, -74, -74, -74, -74, -75, -75, -74, -74, -74, -74, -75, -75, -74, -74, -74, -74, -74, -75, -74, -74, -74, -74, -74, -73, -74, -74, -74, -74, -74, -73, -75, -75, -74, -75, -74, -74, -74, -75, -75, -74, -75, -75, -75, -74, -74, -75, -75, -74, -73, -74, -74, -74, -75, -76, -75, -74, -75, -75, -75, -75, -74, -75, -75, -74, -74, -74, -73, -73, -73, -74, -74, -75, -75, -75, -73, -74, -74, -73, -73, -74, -74, -74, -74, -74, -74, -74, -75, -74, -74, -75, -75, -74, -75, -74, -74, -74, -74, -74, -75, -75, -74, -74, -74, -74, -75, -75, -74, -75, -74, -74, -74, -75, -74, -74, -74, -74, -74, -74, -74, -74, -74, -73, -74, -73, -73, -74, -74, -74, -74, -74, -74, -74, -74, -75, -74, -75, -74, -74, -74, -75, -74, -74, -74, -73, -75, -75, -75, -74, -74, -74, -74, -74, -74, -75, -74, -73, -73, -74, -75, -74, -74, -74, -74, -74, -74, -74, -74, -73, -73, -73, -74, -74, -74, -74, -74, -74, -74, -73, -74, -74, -75, -74, -74, -74, -73, -73, -74, -74, -74, -74, -74, -74, -74, -74, -74, -74, -75, -73, -74, -74, -74, -74, -74, -74, -75, -74, -75, -74, -74, -74, -73, -75, -74, -74, -74, -74, -74, -73, -74, -72, -73, -74, -73, -74, -74, -74, -74, -74, -74, -75, -74, -74, -74, -74, -73, -74, -73, -74, -74, -75, -74, -74, -75, -74, -74, -75, -74, -75, -75, -74, -75, -75, -74, -74, -75, -75, -73, -74, -74, -74, -74, -74, -75, -74, -73, -75, -74, -73, -74, -74, -74, -74, -74, -74, -74, -74, -75, -74, -73, -74, -74, -74, -75, -75, -74, -74, -74, -74, -74, -74, -74, -74, -74, -74, -74, -75, -75, -75, -74, -74, -74, -75, -74, -74, -74, -74, -74, -74, -74, -74, -73, -74, -74, -74, -74, -74, -74, -73, -74, -74, -74, -74, -74, -73, -74, -74, -74, -74, -74, -73, -74, -75, -74, -74, -74, -74, -74, -73, -75, -75, -73, -73, -74, -75, -74, -75, -75, -74, -74, -75, -74, -74, -74, -74, -74, -74, -75, -74, -73, -75, -74, -74, -74, -74, -74, -73, -75, -74, -73, -74, -74, -75, -74, -74, -73, -74, -74, -74, -75, -74, -74, -74, -75, -74, -74, -74, -74, -74, -74, -73, -74, -74, -74, -74, -74, -73, -73, -74, -73, -74, -74, -73, -74, -73, -73, -74, -74, -74, -74, -74, -74, -74, -74, -74, -74, -74, -74, -73, -74, -74, -74, -74, -74, -74, -74, -74, -74, -74, -74, -74, -74, -74, -74, -73, -74, -74, -74, -74, -74, -73, -75, -75, -74, -73, -74, -74, -74, -74, -73, -74, -73, -74, -74, -74, -74, -74, -75, -74, -74, -74, -74, -74, -74]
-96832g4Jj%%%JkJ%%%jJ%%%%J%%j%jJ%%%Jj%Jj%Jj%JjjJ%%%%jJJj%%J%j%JjJ%j%%jJ%J%%j
-96874g4%%Jk%%J%jJ%%%Jj%%%J%jJj%%JkJJ%j%jJ%%J%j%%%%jJ%Jj%%%%%%%%Jj%%%%%%JjJ%
-96916g3%%%%jjJ%%Jjj%J%%Jj%%%j%%J%Jj%%%%%%%J%%%j%%%%%JjJ%%jJ%%j%%jJ%jJ%%J%%%
-96957g3j%Jj%jJ%%%%%%jKjKkJj%j%JjJ%%JjJj%jJ%Jj%J%%jJ%%%kJ%%%jJ%%jJ%%%%%%J%%%
-96999g3%%%j%%%%%%%%JjJ%%j%%%Jk%JJ%jJjjJ%%%%%%Jj%Jj%J%j%J%j%%Jj%Jj%%Jj%%jJ%J
-97041g3%%j%%%%%%J%j%JjJj%%%%%%%%%%%J%j%%JjJj%%%%%%J%j%%Jj%%%%%%%J%j%%%%%%%%
-97083g4JjjJJjJ%jJ%j%%%Jj%%%%J%j%%j%%J%%%%%jK%Jk%%Jj%%J%j%%jK%j%J%%%%jjJ%J%%
-97125g3%j%%J%j%%J%%%%j%%Jj%JjJ%%j%%J%%%%%jJ%%j%Jj%%J%j%J%%%j%Jj%%KkJj%%%%Jj
$$ y = [-74, -73, -74, -74, -74, -74, -73, -75, -74, -74, -74, -74, -75, -74, -74, -74, -74, -74, -73, -73, -73, -74, -74, -75, -74, -74, -74, -74, -73, -74, -74, -73, -74, -74, -73, -74, -74, -73, -74, -75, -74, -74, -74, -74, -74, -75, -74, -73, -74, -74, -74, -73, -73, -74, -74, -73, -74, -73, -73, -74, -74, -74, -75, -74, -74, -73, -73, -73, -74, -74, -74, -73, -75, -75, -75, -74, -74, -75, -74, -74, -74, -74, -73, -74, -74, -74, -74, -73, -73, -74, -73, -74, -74, -74, -73, -75, -74, -73, -73, -74, -74, -75, -74, -74, -74, -73, -73, -74, -74, -74, -74, -74, -75, -74, -74, -73, -74, -74, -74, -74, -74, -74, -74, -74, -74, -73, -74, -74, -74, -74, -74, -74, -74, -73, -74, -73, -73, -73, -73, -73, -73, -74, -75, -74, -74, -74, -73, -74, -75, -75, -74, -74, -74, -73, -74, -74, -74, -74, -75, -75, -75, -74, -74, -73, -74, -74, -74, -74, -74, -74, -74, -74, -73, -73, -73, -73, -74, -74, -74, -74, -74, -74, -73, -74, -73, -73, -73, -74, -73, -73, -73, -74, -74, -74, -75, -74, -74, -75, -74, -74, -74, -73, -73, -73, -73, -74, -74, -73, -74, -74, -75, -74, -74, -74, -74, -74, -74, -74, -75, -73, -74, -72, -74, -73, -74, -74, -75, -75, -74, -75, -74, -74, -74, -73, -74, -73, -74, -74, -75, -74, -74, -73, -74, -74, -73, -73, -73, -74, -73, -73, -73, -73, -75, -74, -74, -74, -74, -75, -74, -74, -74, -75, -74, -74, -74, -74, -74, -74, -74, -73, -73, -73, -73, -73, -73, -73, -74, -74, -74, -74, -74, -74, -74, -74, -74, -73, -74, -73, -73, -73, -74, -74, -74, -74, -73, -75, -75, -74, -73, -73, -74, -73, -74, -75, -74, -74, -74, -74, -74, -74, -74, -73, -74, -74, -73, -74, -74, -73, -73, -74, -74, -73, -73, -74, -74, -74, -73, -74, -74, -73, -74, -74, -74, -73, -74, -74, -74, -75, -74, -74, -73, -73, -73, -74, -74, -74, -74, -74, -74, -74, -73, -73, -74, -74, -73, -74, -73, -74, -74, -74, -74, -74, -74, -74, -74, -74, -74, -74, -74, -73, -73, -74, -74, -74, -73, -74, -73, -74, -74, -74, -74, -74, -74, -74, -73, -73, -74, -74, -74, -73, -74, -74, -74, -74, -74, -74, -74, -74, -73, -73, -74, -74, -74, -74, -74, -74, -74, -74, -74, -73, -74, -75, -74, -73, -74, -73, -73, -74, -73, -73, -74, -74, -74, -74, -73, -74, -74, -74, -74, -74, -73, -73, -74, -74, -74, -75, -75, -75, -74, -74, -74, -74, -74, -74, -75, -73, -73, -72, -74, -74, -74, -73, -74, -74, -74, -73, -73, -74, -74, -74, -75, -73, -73, -74, -74, -73, -73, -73, -73, -73, -74, -75, -74, -74, -73, -73, -73, -73, -74, -74, -74, -73, -73, -74, -74, -74, -73, -73, -73, -73, -73, -74, -74, -74, -73, -74, -74, -73, -74, -73, -73, -73, -74, -74, -74, -73, -73, -73, -73, -73, -73, -74, -73, -73, -73, -74, -74, -73, -74, -74, -74, -73, -73, -74, -74, -73, -73, -73, -73, -74, -74, -73, -74, -74, -74, -72, -74, -73, -74, -74, -74, -74, -74, -73, -74]
-97167g4%J%%j%%%%%%JjJ%jJ%kK%%j%%%%J%%%j%%%%J%%jjJJ%jJ%jJJj%%%j%J%j%%%%%JjJj
-97209g4%%Kj%%jJ%%%jKj%%jJj%J%k%K%%%%%j%J%%%%jJ%%j%JjJ%%j%%%%%%J%%%JjJjjJ%%%
-97250g3%%jJjJkJ%%JJjj%J%j%JjJ%%jJ%%%%%%%%%%%%%%%%jJ%Jj%%jJJk%%JjJjJ%%Jk%J%J
-97292g2j%%j%J%%%%Jj%jKkJ%j%%J%jJj%%J%j%%%%%%%%%JjJjK%j%j%JjJ%jjJ%%%JjJ%%jJj
-97334g4%Jj%JjJj%J%%%%jJ%Jk%J%%%jJ%jJ%%%jJjJkJJj%J%%%%j%J%%jjJ%J%%j%%Jj%J%j%
-97376g4J%%%%%%%%%%%%%%%j%%JJj%jJj%JjjK%%%%%%%%%%j%J%%%%%%%j%J%jJjJ%%%jJ%%%%
-97418g3%Jj%%%jJ%%%Jj%jJjJ%%jJj%%J%jJ%%%%j%J%%JjjKj%%%%jJ%%j%J%j%%J%jJjjK%Jj
-97460g3%%jJ%%%%%%%%j%%%%%J%%%jJ%%%%%%%jKj%%Jj%%%%jJ%j%%%%%%%%%J%%%%Jj%%%%%j
$$ y = [-74, -74, -73, -73, -73, -74, -74, -74, -74, -74, -74, -74, -73, -74, -73, -73, -74, -73, -73, -75, -73, -73, -73, -74, -74, -74, -74, -74, -73, -73, -73, -73, -74, -74, -74, -74, -74, -73, -73, -73, -74, -75, -74, -73, -73, -74, -73, -73, -74, -73, -72, -73, -73, -73, -73, -74, -74, -73, -73, -74, -74, -74, -74, -74, -74, -73, -74, -73, -74, -74, -74, -72, -73, -73, -73, -74, -73, -73, -73, -73, -74, -72, -73, -73, -73, -74, -73, -74, -74, -73, -73, -75, -75, -73, -73, -73, -73, -73, -73, -74, -74, -73, -73, -73, -73, -73, -74, -73, -73, -73, -74, -74, -73, -74, -73, -73, -73, -74, -74, -74, -74, -74, -74, -74, -73, -73, -73, -73, -72, -73, -72, -73, -74, -73, -73, -73, -73, -73, -73, -74, -73, -74, -73, -75, -74, -74, -74, -73, -72, -73, -74, -74, -73, -73, -74, -74, -73, -74, -73, -73, -73, -74, -73, -73, -73, -73, -73, -73, -73, -73, -73, -73, -73, -73, -73, -73, -73, -73, -73, -74, -73, -73, -72, -73, -73, -73, -74, -73, -72, -74, -74, -74, -73, -74, -73, -74, -73, -73, -73, -72, -74, -74, -73, -73, -72, -73, -73, -73, -74, -74, -73, -73, -73, -73, -73, -72, -73, -73, -74, -72, -74, -73, -73, -74, -74, -74, -73, -73, -74, -73, -74, -74, -74, -73, -73, -74, -74, -74, -74, -74, -74, -74, -74, -74, -74, -73, -74, -73, -74, -72, -72, -73, -73, -74, -74, -73, -74, -73, -73, -74, -75, -74, -74, -74, -74, -73, -74, -73, -73, -73, -74, -73, -74, -74, -73, -74, -74, -73, -74, -73, -74, -74, -73, -73, -73, -73, -73, -74, -73, -73, -72, -74, -74, -73, -73, -73, -73, -74, -73, -73, -74, -73, -73, -73, -73, -74, -73, -74, -73, -75, -74, -73, -74, -74, -73, -73, -73, -73, -73, -74, -74, -73, -73, -73, -74, -75, -74, -74, -73, -73, -73, -74, -74, -74, -73, -74, -74, -73, -73, -74, -74, -73, -73, -73, -73, -73, -73, -73, -73, -73, -73, -73, -73, -73, -73, -73, -73, -74, -74, -74, -73, -72, -73, -73, -74, -73, -74, -74, -73, -74, -75, -73, -73, -73, -73, -73, -73, -73, -73, -73, -73, -73, -74, -74, -73, -73, -73, -73, -73, -73, -73, -73, -74, -74, -73, -73, -74, -73, -74, -73, -73, -73, -73, -74, -73, -73, -73, -73, -73, -73, -72, -73, -73, -73, -73, -74, -73, -73, -73, -73, -72, -73, -73, -74, -73, -74, -73, -73, -73, -74, -73, -74, -74, -74, -73, -73, -74, -73, -73, -73, -73, -73, -74, -74, -73, -73, -73, -72, -73, -74, -72, -73, -73, -73, -73, -73, -74, -73, -73, -73, -74, -74, -73, -73, -74, -74, -74, -73, -73, -74, -73, -74, -75, -73, -73, -72, -73, -73, -73, -74, -73, -73, -73, -73, -73, -73, -73, -73, -73, -74, -74, -74, -74, -74, -74, -73, -73, -73, -73, -74, -73, -73, -73, -73, -73, -73, -73, -73, -74, -72, -73, -73, -73, -72, -73, -73, -73, -73, -73, -74, -73, -73, -74, -74, -74, -74, -74, -74, -74, -74, -74, -74, -73, -73, -73, -73, -73, -72, -73, -73, -73, -73, -73, -73, -74]
-97501g4JjJ%%%%%jJ%%%%%J%j%%j%%J%%%%%jJ%%%%j%Jj%%KjjJ%%%%%%%%%Jj%J%j%%J%kJ%%
-97543g3%%%%j%%%J%%%%j%J%%J%%k%J%%JjJ%%j%%%jK%j%%%Jj%%jJ%j%%J%jJ%%%%Jj%Jj%%%
-97585g3%%%%%%%%%%%%Jj%%%jJ%J%j%Jj%%%%%jJ%%%%%%%%%%j%J%%%%%%%%%jJ%j%J%%%%%%%
-97627g3%%%jJ%jJ%%%%%%%%%%%%%j%J%%%%%%j%%%%J%%%%%%%%%Jj%%j%J%%jJ%%%%%jJ%J%j%
-97669g3%%%%%%%%%%JjjJj%J%%%%%%Jj%%%Jj%%%J%%%j%%Jj%jK%jJj%%%Jj%%J%kJJj%%Jjj%
-97711g4%%JjJ%Jj%jJ%%%Jj%J%%j%%%%Jj%%JjJjjJJj%%%%%Jj%%%%%%%%j%%J%jK%jJj%%jJj
-97752g4Kj%%%%%%%J%j%%%J%jJj%%jJj%JJj%%%%%%%Jj%%%%Jj%jJ%%%%%%%J%j%%%Jj%%j%%J
-97794g3J%jJ%j%%Jj%%%%%%%%%%JjjJJ%%jJ%jJj%%%Jj%%jJ%%%%%%J%j%%%%%%%%%%Kj%j%Jk
$$ y = [-74, -73, -74, -73, -73, -73, -73, -73, -73, -74, -73, -73, -73, -73, -73, -73, -72, -72, -73, -73, -73, -74, -74, -74, -73, -73, -73, -73, -73, -73, -74, -73, -73, -73, -73, -73, -74, -74, -73, -74, -74, -74, -72, -73, -74, -73, -73, -73, -73, -73, -73, -73, -73, -73, -73, -72, -73, -73, -72, -72, -73, -73, -73, -72, -72, -74, -73, -73, -73, -73, -73, -73, -73, -74, -74, -74, -74, -73, -73, -73, -73, -73, -74, -74, -73, -73, -73, -72, -72, -72, -74, -74, -73, -73, -73, -72, -73, -72, -72, -72, -73, -73, -73, -73, -74, -72, -72, -73, -73, -73, -73, -72, -73, -73, -73, -74, -73, -73, -74, -74, -74, -73, -73, -74, -73, -73, -73, -73, -73, -72, -73, -73, -72, -73, -73, -73, -73, -73, -73, -73, -73, -73, -73, -73, -73, -73, -73, -73, -73, -72, -73, -73, -73, -73, -74, -73, -73, -72, -72, -73, -73, -72, -73, -73, -73, -73, -73, -73, -74, -73, -73, -73, -73, -73, -73, -73, -73, -73, -73, -73, -74, -74, -73, -73, -73, -73, -73, -73, -73, -73, -73, -73, -74, -73, -73, -74, -74, -73, -73, -73, -73, -73, -73, -73, -73, -73, -73, -73, -74, -73, -73, -74, -73, -73, -73, -73, -73, -73, -73, -73, -73, -73, -73, -73, -73, -73, -74, -74, -73, -73, -73, -73, -73, -73, -73, -74, -74, -74, -74, -74, -73, -73, -73, -73, -73, -73, -73, -73, -73, -73, -72, -73, -73, -73, -74, -74, -73, -73, -73, -74, -73, -73, -73, -73, -73, -73, -74, -73, -73, -72, -72, -73, -73, -73, -73, -73, -73, -73, -73, -73, -73, -73, -73, -72, -73, -74, -73, -74, -74, -73, -73, -73, -73, -73, -73, -73, -72, -73, -73, -73, -73, -72, -73, -73, -73, -73, -72, -72, -72, -72, -73, -73, -73, -72, -73, -73, -74, -72, -72, -73, -72, -73, -73, -73, -73, -72, -73, -73, -73, -72, -72, -74, -73, -72, -73, -73, -73, -72, -73, -74, -74, -74, -74, -73, -74, -73, -73, -72, -73, -73, -74, -73, -73, -73, -73, -72, -73, -73, -72, -72, -72, -73, -73, -73, -73, -73, -72, -73, -73, -73, -72, -73, -72, -73, -74, -73, -72, -73, -73, -73, -73, -73, -73, -72, -73, -73, -73, -73, -73, -73, -73, -73, -73, -74, -74, -74, -73, -73, -74, -72, -72, -73, -72, -73, -73, -73, -74, -73, -74, -72, -73, -73, -73, -73, -73, -73, -73, -73, -72, -72, -73, -73, -73, -73, -72, -72, -73, -72, -73, -73, -73, -74, -73, -74, -74, -73, -72, -73, -73, -73, -73, -73, -73, -73, -73, -72, -73, -73, -73, -73, -73, -72, -73, -73, -74, -73, -73, -73, -73, -73, -73, -73, -73, -72, -72, -73, -73, -73, -73, -72, -73, -73, -73, -74, -74, -74, -73, -72, -72, -73, -72, -72, -73, -73, -73, -72, -73, -73, -73, -73, -73, -73, -73, -73, -73, -73, -73, -72, -73, -74, -73, -72, -72, -72, -73, -72, -72, -73, -72, -73, -73, -73, -73, -72, -73, -73, -73, -74, -73, -73, -73, -73, -73, -73, -73, -72, -72, -73, -73, -73, -73, -73, -73, -73, -73, -73, -73, -73, -71, -72, -72, -73, -73, -72, -74]
-97836g4J%Jj%%%%%%%%%%%%%%%%%%%%%J%j%%%%%%Jj%%jJ%%%%JjJ%%j%%%%J%%jjJ%J%%j%Jj
-97878g3%%%J%j%%J%j%%J%%jJ%%j%%Jj%%jJjJJ%%j%Jj%J%j%Jj%%%%%%%%%%%%%J%%%%%%%j%
-97920g3%Jj%JjJj%J%%jjJ%Jj%%%J%%j%%jKj%%%%%%JjJ%%jj%J%J%%%j%%%J%j%%%%J%j%%%%
-97962g3JjJjJ%j%%Jj%Jj%%%J%%%%%jjJ%%%%%%J%%jJ%jJ%%%%%JkJ%Jj%j%%%%%%%jJ%%J%%j
-98003g3JJk%Jj%J%jJ%jJj%%Jj%%%J%%%j%J%%%%j%jK%%j%Jj%J%jJ%%jJ%%j%%%Jj%%%%Jj%%
-98045g3%J%j%J%%jJjJ%%j%%J%%%j%%J%%jJ%jJ%%j%Jj%%JkJJ%jJj%%J%%%%%%%%Jj%j%J%j%
-98087g3%%%JjJ%%%j%J%j%%J%%%%j%%%J%jJj%J%jJ%j%Kj%jJjJ%%j%Jj%J%%%%%jJ%%%%j%J%
-98129g2j%%%%%%J%%jjJ%%J%Jj%%%j%%%%JJjjJ%%%%j%%%%J%%%%%Jj%%%jK%j%%JkJJk%%J%j
$$ y = [-74, -73, -73, -72, -73, -73, -73, -73, -73, -73, -73, -73, -73, -73, -73, -73, -73, -73, -73, -73, -73, -73, -73, -73, -73, -73, -72, -72, -73, -73, -73, -73, -73, -73, -73, -72, -73, -73, -73, -74, -73, -73, -73, -73, -73, -72, -73, -72, -72, -72, -73, -73, -73, -73, -73, -72, -72, -72, -73, -74, -73, -73, -72, -72, -72, -73, -73, -72, -73, -73, -73, -73, -72, -72, -73, -73, -73, -72, -72, -73, -73, -73, -72, -72, -72, -73, -72, -72, -72, -73, -73, -73, -72, -73, -73, -73, -74, -73, -74, -73, -72, -72, -72, -73, -73, -72, -73, -73, -72, -72, -73, -73, -72, -73, -73, -73, -73, -73, -73, -73, -73, -73, -73, -73, -73, -73, -73, -72, -72, -72, -72, -72, -72, -72, -72, -73, -73, -73, -72, -73, -73, -72, -73, -72, -73, -73, -72, -72, -72, -73, -74, -73, -73, -72, -73, -73, -73, -73, -72, -72, -72, -73, -73, -73, -74, -72, -73, -73, -73, -73, -73, -73, -73, -72, -73, -72, -72, -72, -73, -74, -74, -73, -73, -72, -72, -72, -72, -73, -73, -73, -73, -72, -72, -73, -73, -73, -73, -73, -72, -72, -73, -73, -73, -73, -73, -72, -73, -72, -73, -72, -72, -73, -73, -73, -72, -73, -73, -72, -73, -73, -73, -73, -72, -72, -72, -72, -72, -72, -73, -74, -73, -73, -73, -73, -73, -73, -73, -72, -72, -72, -73, -72, -72, -73, -72, -72, -72, -72, -72, -72, -71, -73, -72, -72, -71, -72, -72, -73, -73, -73, -73, -73, -73, -73, -73, -74, -73, -73, -73, -72, -72, -72, -73, -72, -71, -73, -73, -72, -73, -73, -72, -72, -73, -72, -72, -73, -72, -73, -73, -73, -72, -73, -73, -73, -73, -72, -72, -72, -72, -73, -73, -72, -72, -72, -72, -72, -73, -73, -74, -72, -72, -72, -73, -73, -72, -73, -73, -72, -72, -73, -72, -72, -72, -73, -72, -72, -72, -73, -73, -73, -73, -72, -73, -73, -73, -73, -73, -72, -73, -73, -73, -73, -72, -72, -73, -73, -72, -72, -72, -73, -72, -73, -72, -72, -72, -73, -73, -73, -72, -72, -72, -72, -73, -73, -73, -72, -72, -72, -73, -72, -72, -73, -72, -72, -72, -73, -73, -72, -73, -73, -73, -72, -74, -73, -72, -72, -73, -72, -73, -73, -73, -72, -72, -72, -72, -72, -72, -72, -72, -72, -71, -72, -72, -73, -73, -72, -72, -73, -73, -73, -73, -73, -72, -73, -72, -72, -72, -72, -73, -73, -72, -72, -73, -73, -73, -72, -72, -72, -72, -72, -73, -73, -73, -73, -72, -72, -73, -72, -73, -73, -72, -72, -73, -72, -72, -73, -73, -71, -72, -72, -73, -72, -73, -72, -72, -72, -73, -73, -72, -73, -73, -72, -72, -72, -72, -72, -72, -73, -72, -72, -72, -72, -72, -73, -73, -72, -72, -73, -73, -73, -73, -73, -73, -73, -72, -72, -72, -73, -74, -73, -73, -73, -72, -72, -71, -72, -72, -72, -72, -73, -73, -73, -73, -73, -72, -71, -72, -73, -72, -72, -72, -72, -72, -73, -73, -73, -73, -73, -72, -72, -72, -72, -72, -72, -71, -72, -72, -72, -72, -73, -71, -71, -72, -72, -72, -71, -73, -72, -71, -73, -73, -73, -72, -72, -73]
-98171g3J%%JkJ%%j%JkK%%%%j%J%%jJj%JjJ%%Jk%%Jj%%%J%%j%%KjjJ%%%%%%jJ%%%%%%%j%J
-98213g2%%%%jJ%Jj%%%%%%%%%%j%JJj%%%%j%JjJ%%%Jj%%%%%%%Jj%Jj%%j%J%%jJ%J%jj%JjJ
-98254g2%%%%%%%j%KkKjJ%%j%%jJ%Jj%%%%%%%jJ%%%j%%%%J%%%%jJ%JjjJjjK%%%%%%%jJjJ%
-98296g2%%%%jKk%J%%j%%J%%Jj%%jJ%%%Jj%%J%j%%%Jj%j%%Kj%jJ%%Jj%%%%jJ%J%j%Jj%%jJ
-98338g2%%%%Jj%%%%%%%%%%Jj%%%%%%Jj%%%%%%%jJjJ%%J%j%%%%%%%Jj%J%j%jJ%%j%J%%%%%
-98380g2%%%%%%%%%%%%%%Jj%%%Jj%jJ%%%J%j%%%jJ%%jJ%%%JjJj%%%%%%%%%%%%%%jJ%%Jj%%
-98422g2%jKkKJjj%%%jJ%%J%j%%%%%%%%JjJ%%j%%%%Jj%%%%%%%%%jJ%J%j%%%%Jj%J%%j%%%%
-98464g2jJ%Jj%%%%%Jj%%JjjJ%%%%%%%%j%J%jJ%Jj%%%%J%j%%Jj%%%jKj%%%%%%%jJ%Jj%%jJ
$$ y = [-73, -72, -72, -72, -71, -73, -72, -72, -72, -73, -73, -72, -74, -72, -72, -72, -72, -72, -73, -73, -72, -72, -72, -73, -72, -73, -73, -72, -73, -72, -72, -72, -71, -73, -73, -73, -72, -73, -73, -73, -73, -72, -72, -72, -73, -73, -73, -71, -72, -73, -72, -72, -72, -72, -72, -72, -72, -73, -72, -72, -72, -72, -72, -72, -72, -72, -73, -73, -72, -72, -72, -72, -72, -73, -72, -72, -71, -72, -72, -72, -72, -72, -72, -72, -72, -72, -72, -72, -73, -73, -72, -71, -72, -72, -72, -72, -72, -73, -73, -72, -73, -72, -72, -72, -72, -71, -72, -72, -72, -72, -72, -72, -72, -72, -71, -72, -72, -71, -72, -72, -72, -73, -73, -72, -72, -72, -73, -72, -72, -71, -71, -72, -73, -73, -72, -73, -72, -72, -72, -72, -72, -72, -72, -72, -73, -73, -71, -73, -71, -72, -71, -71, -71, -72, -72, -72, -73, -72, -72, -71, -72, -72, -72, -72, -72, -72, -72, -72, -73, -72, -72, -72, -72, -73, -73, -73, -73, -73, -72, -72, -72, -72, -72, -73, -72, -72, -71, -72, -73, -72, -73, -74, -72, -72, -72, -72, -72, -72, -72, -72, -73, -72, -73, -72, -72, -72, -72, -72, -72, -73, -71, -73, -73, -72, -72, -72, -73, -73, -73, -72, -72, -72, -71, -72, -72, -72, -73, -72, -72, -72, -72, -71, -72, -72, -72, -71, -71, -72, -72, -72, -72, -71, -72, -72, -73, -73, -73, -71, -72, -72, -73, -72, -72, -72, -71, -72, -72, -72, -72, -72, -73, -72, -72, -71, -71, -72, -72, -71, -72, -72, -72, -73, -72, -72, -72, -72, -72, -71, -72, -72, -72, -72, -72, -72, -72, -72, -72, -72, -72, -71, -72, -72, -72, -72, -72, -72, -72, -71, -72, -72, -72, -72, -72, -72, -72, -72, -73, -72, -73, -72, -72, -72, -71, -71, -72, -72, -72, -72, -72, -72, -72, -72, -71, -72, -72, -71, -71, -72, -72, -73, -72, -72, -72, -73, -73, -72, -72, -72, -72, -72, -72, -72, -72, -72, -72, -72, -72, -72, -72, -72, -72, -72, -72, -72, -72, -71, -72, -72, -72, -72, -71, -72, -72, -73, -72, -72, -72, -72, -71, -71, -72, -72, -72, -72, -73, -72, -72, -72, -73, -72, -72, -72, -72, -71, -72, -71, -72, -72, -72, -72, -72, -72, -72, -72, -72, -72, -72, -72, -72, -72, -72, -73, -72, -72, -72, -71, -72, -72, -72, -72, -73, -71, -73, -71, -70, -71, -72, -72, -72, -72, -73, -72, -72, -72, -71, -71, -72, -72, -72, -72, -72, -72, -72, -72, -72, -71, -72, -71, -71, -71, -72, -72, -72, -72, -72, -71, -72, -72, -72, -72, -72, -72, -72, -72, -72, -72, -73, -72, -72, -71, -71, -72, -72, -72, -72, -72, -71, -72, -72, -71, -71, -71, -72, -72, -72, -72, -72, -73, -72, -72, -71, -72, -72, -72, -72, -72, -72, -71, -72, -72, -72, -71, -72, -73, -72, -72, -72, -72, -72, -72, -72, -72, -72, -73, -73, -72, -72, -73, -72, -72, -71, -72, -72, -72, -72, -72, -71, -71, -72, -72, -72, -71, -72, -72, -72, -72, -73, -71, -72, -72, -72, -72, -72, -72, -72, -72, -73, -72, -72, -71, -72, -72, -72, -73, -72]
-98506g2%%jJJj%%%%%%%%J%%j%%%%%Jj%%%jJ%%jJ%%%%J%jJ%jjJJj%%jJ%%Jj%%jJ%%%%%%J%
-98547g1%j%%J%%jJ%j%%%jJjJ%%J%kJ%%%JjJj%%JjJj%%jJjKj%%%%%%%%%J%%j%%JjjK%j%%J
-98589g1j%%J%jJj%Jj%%%J%jJj%%%%%jKjJj%jJ%%%%%Jj%J%jJ%%%j%JjjJ%%%%%%%%J%%%%%%
-98631g1j%%%%%jKj%%Jj%Jj%jJ%j%J%%J%j%J%%%%%%j%JjJ%%%%%j%%%J%%jJj%%%%%Jj%%J%%
-98673g1%j%Jj%Jj%%J%%%j%%%%J%kJ%jJ%J%%jJj%%%%%Jj%J%j%%%J%%j%%%%J%%%%j%J%%%j%
-98715g2%%%%%%%%%%%%K%kJj%%%%J%%jJjJ%j%%J%j%%%%%%JjJj%%Jj%jJ%%%J%%jJj%%%%%%%
-98757g2Jj%JjJj%%%J%j%%J%%%%j%%jJJ%%%%%%%j%J%j%J%kJJjJjJ%%%%j%J%%%%j%J%j%J%j
-98798g2J%jJ%%%%j%J%jJ%jJjJJj%%%%%%%%%%%%%%%jJ%%jJ%jJj%J%%j%%%%J%jJ%%%%%%%%%
$$ y = [-72, -72, -72, -73, -72, -71, -72, -72, -72, -72, -72, -72, -72, -72, -72, -71, -71, -71, -72, -72, -72, -72, -72, -72, -71, -72, -72, -72, -72, -73, -72, -72, -72, -73, -72, -72, -72, -72, -72, -71, -71, -72, -71, -71, -72, -73, -72, -71, -72, -72, -72, -73, -72, -72, -72, -71, -72, -72, -72, -73, -72, -72, -72, -72, -72, -72, -72, -71, -71, -71, -72, -72, -72, -71, -71, -71, -72, -71, -71, -72, -72, -72, -72, -73, -72, -73, -72, -72, -72, -71, -71, -73, -72, -72, -72, -72, -71, -72, -71, -72, -72, -72, -71, -72, -71, -72, -72, -72, -73, -72, -73, -71, -72, -72, -72, -72, -72, -72, -72, -72, -72, -72, -71, -71, -71, -72, -72, -72, -71, -72, -73, -71, -71, -72, -72, -72, -71, -72, -72, -72, -71, -71, -72, -71, -72, -72, -71, -72, -72, -72, -72, -71, -71, -72, -71, -72, -72, -72, -72, -72, -72, -73, -71, -72, -71, -72, -72, -73, -72, -72, -72, -72, -72, -72, -71, -72, -72, -71, -71, -72, -71, -71, -71, -71, -72, -72, -71, -72, -73, -72, -72, -72, -72, -72, -72, -72, -72, -72, -71, -71, -71, -71, -71, -71, -71, -72, -72, -72, -72, -72, -72, -73, -71, -72, -72, -72, -71, -72, -72, -71, -72, -72, -73, -72, -72, -73, -73, -72, -72, -72, -71, -71, -72, -72, -71, -71, -71, -71, -71, -71, -71, -72, -72, -71, -72, -71, -71, -71, -71, -71, -71, -72, -72, -72, -72, -71, -71, -71, -72, -71, -72, -72, -72, -72, -72, -72, -71, -72, -72, -72, -71, -71, -71, -71, -72, -72, -71, -72, -72, -71, -72, -72, -72, -71, -71, -71, -71, -72, -72, -72, -72, -72, -71, -71, -73, -72, -72, -73, -72, -72, -71, -71, -71, -72, -71, -72, -72, -72, -72, -72, -72, -71, -72, -72, -71, -71, -72, -72, -72, -72, -71, -71, -71, -72, -72, -72, -72, -72, -71, -71, -71, -71, -71, -72, -72, -71, -71, -71, -71, -72, -72, -72, -72, -72, -72, -72, -72, -72, -72, -72, -72, -72, -72, -70, -70, -72, -71, -72, -72, -72, -72, -72, -71, -71, -71, -72, -71, -72, -71, -71, -72, -72, -72, -71, -71, -72, -72, -72, -72, -72, -72, -72, -71, -72, -71, -72, -72, -72, -71, -72, -72, -73, -72, -72, -72, -72, -71, -71, -71, -72, -71, -72, -72, -72, -72, -72, -72, -72, -72, -71, -72, -72, -71, -72, -71, -72, -72, -72, -72, -71, -71, -72, -72, -72, -71, -71, -71, -71, -71, -72, -72, -72, -73, -72, -71, -71, -71, -71, -71, -71, -71, -71, -72, -72, -71, -71, -72, -72, -71, -71, -73, -72, -71, -72, -71, -72, -71, -71, -71, -71, -71, -72, -72, -71, -71, -71, -71, -71, -72, -72, -71, -71, -72, -72, -71, -71, -72, -71, -71, -72, -71, -71, -71, -71, -71, -72, -72, -71, -71, -72, -71, -71, -72, -71, -72, -71, -70, -71, -71, -71, -71, -71, -71, -71, -71, -71, -71, -71, -71, -71, -71, -71, -71, -72, -71, -71, -71, -72, -71, -71, -72, -71, -72, -72, -71, -71, -71, -72, -72, -72, -72, -72, -71, -71, -72, -71, -71, -71, -71, -71, -71, -71, -71, -71, -71]
-98840g1jJ%jJ%%jJ%%%%%%%j%K%jjjKJj%%jJ%j%JjJkJ%Jj%%J%jJJjj%J%%%jJ%J%jjJJ%jj%
-98882g2%%J%jJ%JjjJ%%%%%%Jj%%%%Jj%jJ%%%%%%jJ%%%%KjjJj%%%%%%%%%%%%%%%Jj%%%%%J
-98924g0j%%%J%j%jJ%%%%%%Jj%%%%j%J%%%%%%jJ%%%%%%j%JJj%J%%jj%K%kJ%j%%JjJ%%jJ%%
-98966g1%%%%%%%%Jj%j%%%J%%JjJ%j%Jj%%%jJjJ%%jJj%%%JJj%%%jJJ%j%%%%%%%%%%%%j%J%
-99008g1%%j%JJjjJ%jJ%%%jJj%J%%%J%j%%%%jJ%%%%%Jj%Jj%%%JkJ%%%jK%jjJjJ%%J%%j%%%
-99049g1j%%%J%Jj%J%kJ%%%jJj%J%Jj%%%%%%%%%%%%J%%jJj%JjjKkJ%%%%%Jj%KjjJj%%Jj%%
-99091g1%%%j%J%%j%J%%%%%%jJ%%%%j%J%jJ%%%%%%%%%%%%jJjJ%%%%%%%%%Jj%%%J%j%%%%j%
-99133g2KkJ%%%%%%%%Jj%%%%%J%kJ%%%jJj%J%%%J%%%j%%%Jj%JjJj%Jj%%%%Jj%J%%%%%%j%%
$$ y = [-71, -72, -71, -71, -72, -71, -71, -71, -72, -71, -71, -71, -71, -71, -71, -71, -71, -72, -72, -70, -70, -71, -72, -73, -71, -70, -71, -71, -71, -72, -71, -71, -72, -72, -71, -72, -71, -73, -72, -72, -71, -72, -72, -72, -71, -71, -72, -71, -70, -71, -72, -72, -71, -71, -71, -71, -72, -71, -71, -70, -70, -71, -72, -71, -70, -70, -71, -72, -72, -72, -72, -71, -71, -72, -71, -71, -70, -71, -72, -71, -71, -71, -71, -71, -71, -71, -70, -71, -71, -71, -71, -71, -70, -71, -71, -72, -71, -71, -71, -71, -71, -71, -71, -72, -71, -71, -71, -71, -71, -69, -70, -71, -70, -71, -71, -71, -71, -71, -71, -71, -71, -71, -71, -71, -71, -71, -71, -71, -71, -70, -71, -71, -71, -71, -71, -71, -70, -71, -71, -71, -71, -70, -70, -71, -71, -72, -71, -71, -71, -71, -71, -71, -71, -70, -71, -71, -71, -71, -71, -72, -72, -71, -71, -71, -71, -71, -71, -71, -72, -71, -71, -71, -71, -71, -71, -71, -72, -72, -71, -70, -71, -71, -70, -70, -70, -71, -72, -72, -70, -70, -72, -71, -71, -72, -72, -72, -71, -72, -71, -71, -71, -72, -71, -71, -71, -71, -71, -71, -71, -71, -71, -71, -71, -70, -71, -71, -72, -72, -72, -72, -71, -71, -71, -70, -71, -70, -70, -71, -71, -70, -71, -71, -71, -71, -72, -71, -72, -71, -71, -71, -72, -71, -72, -72, -72, -72, -71, -70, -71, -71, -71, -71, -72, -71, -70, -70, -71, -71, -71, -71, -71, -71, -71, -71, -71, -71, -71, -71, -71, -72, -72, -71, -71, -71, -71, -72, -72, -71, -70, -71, -72, -71, -71, -72, -71, -71, -71, -71, -72, -71, -72, -72, -71, -71, -71, -71, -70, -70, -71, -71, -71, -71, -71, -72, -71, -71, -71, -71, -71, -71, -70, -71, -71, -70, -71, -71, -71, -71, -70, -72, -71, -71, -71, -71, -72, -70, -70, -71, -72, -71, -72, -71, -71, -71, -70, -70, -70, -71, -71, -71, -71, -72, -72, -72, -72, -71, -71, -70, -71, -71, -70, -70, -72, -71, -71, -71, -71, -72, -71, -72, -72, -71, -71, -70, -71, -71, -71, -71, -71, -71, -71, -71, -71, -71, -71, -71, -71, -70, -70, -70, -71, -70, -71, -71, -70, -71, -72, -70, -72, -71, -71, -71, -71, -71, -71, -70, -71, -71, -69, -70, -71, -70, -71, -71, -71, -70, -71, -71, -71, -71, -71, -71, -72, -72, -71, -71, -71, -72, -72, -71, -71, -71, -71, -71, -71, -71, -72, -71, -71, -71, -71, -71, -72, -72, -71, -71, -72, -71, -71, -71, -71, -71, -71, -71, -71, -71, -71, -71, -71, -71, -72, -71, -72, -71, -71, -71, -71, -71, -71, -71, -71, -71, -71, -70, -71, -71, -71, -71, -70, -70, -71, -71, -71, -71, -71, -72, -72, -70, -72, -71, -71, -71, -71, -71, -71, -71, -71, -71, -70, -71, -71, -71, -71, -71, -71, -70, -70, -72, -71, -71, -71, -71, -72, -71, -72, -72, -71, -71, -71, -71, -70, -70, -70, -70, -71, -71, -71, -71, -70, -71, -71, -70, -71, -70, -71, -71, -70, -71, -71, -71, -71, -71, -70, -71, -71, -70, -70, -70, -70, -70, -70, -70, -71, -71, -71]
-99175g1%%Jj%%J%j%%J%j%J%j%%%%%%jJ%Jj%J%%jJj%%Jj%%Jjj%%J%%%%Jj%%%jJ%Jj%%%%%%
-99217g1Jj%J%%j%Jj%%%%J%%%%%%j%JjJ%%%%%%%jKjj%J%%j%J%%j%%%%%%%Jj%%%%J%j%JjJ%
-99259g0%%%jJ%j%%%%%Jj%%%%J%%%%Jjj%%%J%%jJ%%jJj%%jJ%%%%%J%%j%%%Jj%%%%jJ%%J%j
-99300g1%%%%J%j%Jj%J%%%j%J%%%%%%%j%%%J%%%jJj%%JJj%j%J%%%%j%%%%%%%%%Jj%J%%j%%
-99342g1J%jJj%%J%%jJjJj%%%J%%j%%%J%jJ%jK%j%%JkJj%%%%Jj%JJkJJkJ%j%J%%jJ%%jJ%%
-99384g0j%%J%Jjjj%%J%%%%JjJj%%%J%Jj%%%%j%%%%J%%%j%%%Jj%%%%Jj%%%%%%%JJj%%j%J%
-99426g0%%%%%%%%j%%J%%%Jj%jJj%JJj%%kK%%%%%JkJ%%Jj%%jJ%%%%%%%%%%%%%j%J%%jJ%%J
-99468f9jjJJj%%jJ%%%%%%%%%j%J%%%%%%%%%%jJj%J%jJ%%jJJj%%%j%J%j%%%J%%%%%j%J%%%
$$ y = [-71, -71, -71, -70, -71, -71, -71, -70, -70, -71, -71, -71, -70, -70, -71, -71, -70, -70, -71, -71, -71, -71, -71, -71, -71, -72, -71, -71, -70, -71, -71, -70, -70, -70, -71, -70, -71, -71, -71, -70, -71, -71, -71, -70, -71, -72, -72, -72, -71, -71, -71, -71, -71, -70, -71, -71, -71, -71, -72, -71, -71, -70, -71, -71, -71, -71, -71, -71, -71, -70, -71, -71, -70, -70, -70, -71, -71, -70, -71, -71, -71, -71, -71, -70, -70, -70, -70, -70, -70, -70, -71, -71, -70, -71, -70, -70, -70, -70, -70, -70, -70, -70, -71, -69, -70, -71, -71, -70, -70, -70, -71, -71, -70, -70, -70, -71, -71, -71, -71, -71, -71, -71, -71, -70, -71, -71, -71, -71, -71, -70, -70, -71, -71, -70, -71, -70, -70, -70, -70, -70, -71, -70, -70, -71, -71, -71, -71, -71, -71, -70, -71, -71, -71, -71, -71, -70, -70, -70, -70, -70, -69, -70, -71, -71, -71, -71, -70, -70, -70, -71, -70, -70, -70, -71, -70, -71, -71, -71, -72, -71, -71, -71, -71, -71, -71, -70, -70, -70, -71, -71, -71, -71, -70, -71, -71, -71, -71, -71, -72, -71, -71, -71, -70, -70, -71, -71, -71, -71, -71, -70, -70, -71, -71, -70, -71, -71, -70, -70, -70, -70, -71, -71, -70, -70, -70, -70, -70, -70, -70, -70, -71, -71, -71, -71, -70, -70, -70, -70, -71, -70, -71, -71, -71, -70, -69, -70, -70, -71, -71, -70, -70, -70, -70, -70, -71, -71, -71, -71, -71, -71, -71, -71, -71, -71, -70, -71, -71, -70, -70, -70, -71, -71, -71, -70, -70, -71, -70, -71, -71, -71, -70, -70, -70, -71, -70, -71, -70, -71, -71, -71, -71, -70, -70, -70, -71, -71, -71, -71, -70, -70, -71, -70, -70, -71, -69, -69, -70, -70, -70, -69, -71, -70, -71, -71, -71, -71, -71, -70, -71, -71, -70, -69, -71, -70, -69, -71, -70, -70, -71, -71, -70, -70, -70, -71, -70, -70, -70, -71, -70, -70, -70, -71, -71, -71, -70, -70, -69, -70, -71, -72, -72, -72, -71, -71, -71, -71, -71, -70, -71, -70, -71, -71, -71, -71, -70, -70, -69, -70, -70, -70, -70, -70, -71, -71, -71, -71, -71, -70, -70, -70, -70, -71, -71, -71, -71, -70, -71, -71, -71, -71, -71, -70, -71, -71, -71, -71, -71, -71, -71, -71, -70, -69, -70, -70, -70, -71, -71, -70, -70, -70, -70, -70, -70, -70, -70, -70, -70, -71, -71, -71, -70, -70, -70, -70, -69, -70, -70, -71, -70, -71, -71, -70, -69, -70, -70, -70, -72, -70, -70, -70, -70, -70, -70, -69, -71, -70, -70, -70, -69, -70, -70, -70, -71, -70, -70, -70, -70, -70, -70, -70, -70, -70, -70, -70, -70, -70, -70, -71, -71, -70, -70, -70, -71, -70, -70, -70, -69, -70, -71, -70, -69, -70, -70, -70, -71, -70, -70, -70, -70, -70, -70, -70, -70, -70, -70, -71, -71, -70, -70, -70, -70, -70, -70, -70, -70, -70, -70, -70, -71, -70, -71, -71, -70, -70, -71, -70, -70, -70, -71, -70, -69, -70, -70, -70, -70, -71, -71, -70, -70, -71, -71, -71, -71, -70, -70, -70, -70, -70, -70, -71, -71, -70, -70, -70, -70]
-99510g0%%%jJ%%%jJ%%Jj%Jj%%%%%%%%%jJ%%jJJj%jJ%JjJj%%%jJ%%%%%%%%j%Jj%JJ%kKj%%
-99551g0%J%%jjJ%%%%%%%%J%kJ%j%Kj%%%%%JjJj%J%j%%%%%jJ%JjJj%%JjjKjj%%KjjJjJ%%j
-99593g1%%%J%%%%jKj%%%%%%%%%Jjj%JjJjJJkJ%jJ%%%%%%%%J%j%%Jj%%%jJ%%%%jJJ%j%%%J
-99635f9%j%%%%%%%%%%J%j%%%%%%%%jJ%%%%%J%%j%j%%J%%JkJ%%jJ%J%%j%Jj%J%%%j%%%JjJ
-99677f9%j%%j%J%%%jJ%%J%%%j%Jj%%%%%%%jJ%JjjJ%%%jJ%%%Jj%jJ%Jj%%%%%%Jj%%%J%j%%
-99719g0%%%%%%j%J%%Jj%%%%Kj%jj%JJ%j%%JjJ%%j%jJJ%jJj%%J%j%%jK%j%%jJJ%jjJ%J%j%
-99761g0%%%%JjjJJj%jKjJ%j%%%%%J%j%%%%%%%Jj%%%%Jj%%J%j%%J%%j%%%%jJJj%%%Jj%%J%
-99803f9%jJj%Jj%%J%jj%J%j%%J%%%%%Jj%%%J%%j%J%%jJ%j%%Jj%Jj%%J%j%%%J%%%%%j%%Jj
$$ y = [-70, -70, -70, -70, -71, -70, -70, -70, -70, -71, -70, -70, -70, -69, -70, -70, -69, -70, -70, -70, -70, -70, -70, -70, -70, -70, -70, -71, -70, -70, -70, -71, -70, -69, -70, -70, -71, -70, -70, -69, -70, -69, -70, -70, -70, -70, -71, -70, -70, -70, -70, -70, -70, -70, -70, -70, -71, -71, -70, -71, -71, -70, -69, -69, -71, -69, -70, -70, -70, -70, -69, -69, -69, -70, -71, -70, -70, -70, -70, -70, -70, -70, -70, -70, -69, -69, -71, -70, -70, -71, -71, -69, -70, -70, -70, -70, -70, -70, -69, -70, -69, -70, -70, -69, -69, -70, -70, -70, -70, -70, -70, -71, -70, -70, -69, -70, -69, -70, -70, -70, -69, -70, -71, -69, -70, -71, -71, -71, -69, -70, -71, -70, -71, -70, -70, -70, -71, -71, -71, -71, -70, -70, -70, -70, -70, -71, -69, -70, -70, -70, -70, -70, -70, -70, -70, -70, -70, -69, -70, -71, -71, -70, -71, -70, -71, -70, -69, -71, -70, -70, -71, -70, -70, -70, -70, -70, -70, -70, -70, -70, -69, -69, -70, -70, -70, -69, -70, -70, -70, -70, -71, -70, -70, -70, -70, -70, -71, -70, -69, -69, -70, -70, -70, -70, -69, -69, -70, -70, -70, -70, -70, -70, -70, -70, -70, -70, -70, -69, -69, -70, -70, -70, -70, -70, -70, -70, -70, -70, -71, -70, -70, -70, -70, -70, -70, -69, -69, -69, -70, -70, -71, -71, -71, -70, -70, -70, -69, -71, -70, -70, -70, -71, -70, -70, -69, -69, -69, -70, -70, -69, -70, -70, -69, -69, -69, -69, -70, -70, -70, -70, -69, -70, -69, -69, -70, -70, -70, -71, -71, -70, -70, -70, -70, -71, -70, -70, -70, -69, -69, -69, -69, -70, -70, -69, -70, -70, -70, -70, -70, -70, -70, -70, -71, -70, -70, -69, -70, -71, -70, -70, -70, -70, -71, -70, -70, -70, -70, -69, -70, -70, -71, -70, -70, -69, -70, -70, -70, -70, -70, -70, -70, -69, -70, -70, -70, -70, -69, -69, -70, -70, -70, -70, -70, -70, -70, -70, -70, -71, -71, -70, -70, -70, -69, -70, -70, -70, -70, -70, -68, -69, -69, -70, -71, -71, -70, -69, -69, -70, -70, -70, -69, -70, -69, -69, -69, -70, -70, -71, -70, -69, -69, -70, -69, -70, -70, -70, -69, -69, -70, -70, -70, -71, -69, -69, -70, -70, -70, -71, -70, -69, -69, -70, -71, -70, -70, -69, -69, -70, -70, -70, -70, -70, -70, -69, -70, -71, -70, -69, -70, -70, -71, -69, -70, -69, -69, -70, -70, -70, -70, -70, -70, -69, -69, -70, -70, -70, -70, -70, -70, -70, -70, -69, -70, -70, -70, -70, -70, -69, -70, -70, -70, -69, -69, -70, -70, -70, -69, -69, -69, -70, -70, -70, -70, -70, -71, -70, -69, -70, -70, -70, -70, -69, -70, -70, -70, -69, -69, -69, -70, -69, -70, -70, -69, -70, -70, -70, -69, -69, -70, -71, -71, -70, -70, -71, -71, -71, -70, -70, -70, -70, -70, -70, -69, -70, -70, -70, -70, -69, -69, -69, -70, -70, -69, -69, -69, -70, -69, -69, -70, -70, -70, -69, -70, -70, -69, -70, -70, -70, -69, -69, -70, -70, -70, -70, -69, -69, -69, -69, -69, -69, -70, -70, -70, -69, -70]
-99844g0jJ%%%%%J%%%j%%jJ%%J%%%JjjJ%j%%%%J%j%%J%j%%Jj%%%%%%%J%kKj%%%%J%%j%Jj%
-99886g0J%%%j%%JjJ%%%jJ%jJ%%%%%%j%%%%JjJ%%%jJj%%%J%j%%%%J%%%J%%k%JJ%k%%%JjJ%
-99928f9JjjjJJj%%J%jJ%j%%J%Jj%j%JkJ%%JJkJ%%%jJ%%%j%%%jJ%%J%%j%%J%%%%%jJJj%%%
-99970f9%%jJ%%%%%%%j%J%%%%%%%%%%j%%%J%%%%%%%%%j%J%%%%%%%%%%jJ%jKk%JJj%jJJjjJ
-100012f9%%%%jJ%%Jj%J%j%jJ%%%%%%jJ%%%%%%%jJJjj%%%J%%%jJ%%%JjJk%JjJjK%%j%%J%j
-100053f9j%J%%%JkJ%j%Jj%JJjj%JjJ%%%Jj%%%%j%J%%jKj%jJ%%jJjKj%%%%Jj%%J%jjJ%%Jj
-100094f9%%%%%%j%%J%%%%JjJjJjJ%j%%%%%%%%%%%%%%Jj%J%%jjJ%%%JjJj%%%%%%%%%%%%%j
-100135g0JJ%jJ%%j%%jJJ%%kJj%J%jJ%jJ%J%j%%%%%%jJ%jJJjjJ%jJ%%%%%%Jj%%J%%j%%Jjj
$$ y = [-70, -71, -70, -70, -70, -70, -70, -70, -69, -69, -69, -69, -70, -70, -70, -71, -70, -70, -70, -69, -69, -69, -69, -68, -69, -70, -69, -69, -70, -70, -70, -70, -70, -69, -69, -70, -70, -70, -69, -69, -70, -70, -70, -69, -70, -70, -70, -70, -70, -70, -70, -70, -69, -69, -71, -69, -70, -70, -70, -70, -70, -69, -69, -69, -70, -70, -69, -70, -70, -69, -69, -69, -69, -70, -70, -70, -69, -70, -69, -69, -69, -69, -70, -69, -69, -70, -69, -69, -69, -69, -69, -69, -69, -70, -70, -70, -70, -70, -69, -70, -69, -69, -69, -69, -70, -69, -70, -70, -70, -70, -69, -69, -70, -70, -70, -70, -70, -69, -69, -69, -69, -68, -68, -68, -70, -70, -69, -68, -68, -70, -70, -70, -70, -69, -70, -69, -69, -68, -69, -70, -71, -70, -69, -70, -70, -70, -69, -69, -70, -69, -69, -70, -70, -70, -69, -69, -68, -69, -69, -70, -70, -69, -71, -70, -70, -70, -69, -68, -70, -69, -69, -69, -69, -70, -69, -69, -69, -69, -70, -70, -70, -70, -71, -70, -70, -70, -69, -69, -69, -70, -70, -70, -69, -69, -69, -69, -69, -69, -70, -69, -68, -69, -69, -69, -69, -69, -69, -70, -69, -69, -69, -69, -69, -69, -69, -69, -70, -70, -69, -69, -69, -69, -69, -69, -69, -69, -69, -69, -69, -70, -70, -70, -70, -69, -69, -69, -69, -69, -69, -69, -69, -69, -69, -70, -70, -69, -69, -69, -69, -69, -69, -69, -69, -69, -69, -69, -70, -69, -69, -70, -68, -70, -70, -69, -68, -69, -69, -70, -69, -68, -69, -70, -69, -69, -69, -69, -69, -70, -69, -69, -69, -68, -69, -69, -68, -68, -69, -69, -70, -69, -69, -69, -69, -69, -69, -69, -70, -69, -69, -69, -69, -69, -69, -69, -69, -70, -69, -68, -69, -70, -70, -70, -70, -69, -69, -69, -69, -70, -69, -69, -69, -69, -68, -69, -68, -70, -70, -69, -70, -69, -70, -68, -68, -68, -69, -69, -69, -68, -68, -69, -70, -70, -69, -69, -69, -69, -68, -70, -69, -69, -70, -70, -69, -70, -70, -69, -68, -69, -70, -70, -69, -70, -69, -69, -69, -69, -68, -69, -69, -69, -69, -69, -70, -70, -69, -69, -69, -70, -68, -69, -69, -70, -69, -69, -69, -70, -69, -70, -68, -69, -69, -69, -69, -69, -68, -69, -69, -69, -68, -68, -69, -70, -69, -69, -69, -68, -69, -69, -69, -69, -69, -69, -69, -70, -70, -70, -69, -69, -69, -69, -69, -68, -69, -68, -69, -68, -69, -68, -68, -69, -69, -69, -69, -69, -69, -69, -69, -69, -69, -69, -69, -69, -69, -69, -68, -69, -69, -68, -68, -68, -69, -70, -69, -69, -69, -69, -68, -69, -68, -69, -69, -69, -69, -69, -69, -69, -69, -69, -69, -69, -69, -69, -69, -70, -69, -68, -68, -69, -68, -68, -68, -69, -69, -69, -70, -69, -68, -68, -68, -70, -69, -70, -70, -69, -69, -70, -69, -69, -70, -69, -69, -68, -68, -69, -69, -69, -69, -69, -69, -69, -70, -69, -69, -70, -69, -68, -69, -70, -69, -69, -70, -69, -69, -69, -69, -69, -69, -69, -68, -69, -69, -69, -68, -68, -68, -69, -69, -69, -68, -69, -70]
$$ [...]
-118401i
##END=		$$ NMR SPECTRUM
##END=		$$ LINK
