##TITLE=	aZQNDAm8Q0GFQntwST0qQA.11.fid
##JCAMP-DX=	6.0	$$ MestReNova 14.3.3-33362
##DATA TYPE=	LINK
##BLOCKS=	1    
##ORIGIN=	Mestrelab Research S.L.
##OWNER=	hrzepa
##$MNOVA/METADATA=	(DOCUMENT,BASE64)
eyJuYW1lIjoiL1VzZXJzL2hyemVwYS9Eb3dubG9hZHMvSVVQQUMtRkFJUlNwZWMtbWFpbi8zOC1Db21
wbGV4ZXMvMzhqLzM4ai1CLzM4ai1CLm1ub3ZhIiwicGFnZXMiOlt7Iml0ZW1zIjpbIjEiICAgICBdfV
19
##TITLE=	aZQNDAm8Q0GFQntwST0qQA.11.fid
##JCAMP-DX=	6.0	$$ MestReNova 14.3.3-33362
##DATA TYPE=	NMR SPECTRUM
##DATA CLASS=	XYDATA
##BLOCK_ID=	1
##ORIGIN=	Bruker BioSpin GmbH
##OWNER=	nmrsu
##NUMDIM=	1
##$MNOVA/METADATA=	(ITEM,BASE64)
eyJhbmdsZSI6MCwiYXhlcyI6eyJ4Ijp7Im1heCI6MjAxLjk2MzA5OTk5MjM5NTIzLCJtaW4iOi0yMDI
uNjEzMzIzNDg5Mjk0MDZ9LCJ5Ijp7Im1heCI6OTAzOTIuMzk3NDYwOTM3NSwibWluIjotODIyMC4xMz
MyNzE0NTU3NjV9fSwicG9pbnRzIjpbeyJ4Ijo1MzIxLCJ5Ijo1ODM1fSx7IngiOjg3MjIsInkiOjU4M
zV9LHsieCI6ODcyMiwieSI6ODIwOH0seyJ4Ijo1MzIxLCJ5Ijo4MjA4fSx7IngiOjUzMjEsInkiOjU4
MzV9XSwieiI6MH0=
##.OBSERVE FREQUENCY=	224.7001119089999861
##.OBSERVE NUCLEUS=	^11B
##.SOLVENT NAME=	None
##.PULSE SEQUENCE=	zgbs
##LONGDATE=	2025/01/08 22:49:02.000
##.ACQUISITIONMODE=	SIMULTANEOUS (DQD)
##$ORIGINAL FORMAT=	Bruker XWIN-NMR
##$MNOVA/SCALES_VERSION=	9
##$PARAMETER FILE=	(acqus, ASCII, /private/var/folders/f6/rjf_tdyn2v98c5c0wvkgn4s80000gq/T/aZQNDAm8Q0GFQntwST0qQA/11/acqus, 0)
$$ ##TITLE= Parameter file, TopSpin 4.1.3
$$ ##JCAMPDX= 5.0
$$ ##DATATYPE= Parameter Values
$$ ##NPOINTS= 1	$$ modification sequence number
$$ ##ORIGIN= Bruker BioSpin GmbH
$$ ##OWNER= nmrsu
$$ $$ 2025-01-08 22:47:21.754 +0000  nmrsu@CZC7167VR1
$$ $$ Z:/700/data/tds/nmr/RP611/11/acqus
$$ $$ process C:\Bruker\TopSpin4.1.3\prog\mod\dirdata.exe
$$ ##$ACQT0= 0
$$ ##$AMP= (0..31)
$$ 100 100 100 100 100 100 100 100 100 100 100 100 100 100 100 100 100 100
$$ 100 100 100 100 100 100 100 100 100 100 100 100 100 100
$$ ##$AMPCOIL= (0..32)
$$ -1 0 0 0 0 0 0 0 0 0 0 0 0 0 0 0 0 0 0 0 0 0 0 0 0 0 0 0 0 0 0 0 0
$$ ##$AQSEQ= 0
$$ ##$AQ_mod= 3
$$ ##$AUNM= <au_zg>
$$ ##$AUTOPOS= <28 >
$$ ##$BF1= 224.700111909
$$ ##$BF2= 224.700111909
$$ ##$BF3= 224.700111909
$$ ##$BF4= 224.700111909
$$ ##$BF5= 224.700111909
$$ ##$BF6= 224.700111909
$$ ##$BF7= 224.700111909
$$ ##$BF8= 224.700111909
$$ ##$BWFAC= (0..63)
$$ 0 0 0 0 0 0 0 0 0 0 0 0 0 0 0 0 0 0 0 0 0 0 0 0 0 0 0 0 0 0 0 0 0 0 0 0
$$ 0 0 0 0 0 0 0 0 0 0 0 0 0 0 0 0 0 0 0 0 0 0 0 0 0 0 0 0
$$ ##$BYTORDA= 0
$$ ##$CHANFCU= (0..24)
$$ 0 0 0 1 0 0 0 0 0 0 0 0 0 0 0 0 0 0 0 0 0 0 0 0 0
$$ ##$CHANREC= (0..24)
$$ 0 0 0 0 0 0 0 0 0 0 0 0 0 0 0 0 0 0 0 0 0 0 0 0 0
$$ ##$CHEMSTR= <none>
$$ ##$CNST= (0..63)
$$ 1 1 1 1 1 1 1 1 1 1 1 1 1 1 1 1 1 1 1 1 1 1 1 1 1 1 1 1 1 1 1 1 1 1 1 1
$$ 1 1 1 1 1 1 1 1 1 1 1 1 1 1 1 1 1 1 1 1 1 1 1 1 1 1 1 1
$$ ##$CPDPRG= (0..8)
$$ <> <> <> <> <> <> <> <> <>
$$ ##$D= (0..63)
$$ 0 0.4 0 0 0 0 0 0 0 0 0 0 0 0 0 0 0.0002 0 0 0 0 0 0 0 0 0 0 0 0 0 0 0
$$ 0 0 0 0 0 0 0 0 0 0 0 0 0 0 0 0 0 0 0 0 0 0 0 0 0 0 0 0 0 0 0 0
$$ ##$DATE= 1736376542
$$ ##$DATE_START= 1736376276
$$ ##$DE= 18
$$ ##$DECBNUC= <off>
$$ [...]
$$ ##$ShimPowRng3= (0..63)
$$ 1 1 1 1 1 1 1 1 1 1 1 1 1 1 1 1 1 1 1 1 1 1 1 1 1 1 1 1 1 1 1 1 1 1 1 1
$$ 1 1 1 1 0 0 0 0 0 0 0 0 0 0 0 0 0 0 0 0 0 0 0 0 0 0 0 0
$$ ##$ShimPowType1= 8
$$ ##$ShimPowType2= 8
$$ ##$ShimPowType3= 0
$$ ##$ShimPowType4= 0
$$ ##$ShimPowType5= 0
$$ ##$ShimPowType6= 0
$$ ##$ShimPowType7= 0
$$ ##$ShimPowType8= 0
$$ ##$ShimSysActGrad= (0..63)
$$ 1 2 3 4 13 5 7 11 10 9 6 8 12 18 19 20 21 15 22 23 24 14 25 16 26 17 27
$$ 28 31 32 33 34 35 36 37 38 0 0 0 0 0 0 0 0 0 0 0 0 0 0 0 0 0 0 0 0 0 0
$$ 0 0 0 0 0 0
$$ ##$ShimSysAngle= <>
$$ ##$ShimSysFunc= (0..63)
$$ 1 2 3 4 5 6 7 8 9 10 0 37 38 35 16 15 14 13 12 11 28 27 26 25 24 23 36
$$ 22 30 29 20 21 34 33 32 31 17 18 19 0 0 0 0 0 0 0 0 0 0 0 0 0 0 0 0 0 0
$$ 0 0 0 0 0 0 0
$$ ##$ShimSysMatId= <292722da.dat>
$$ ##$ShimSysMatrix= 1
$$ ##$ShimSysMinMaxUG= 130000
$$ ##$ShimSysOffset= <29 mm>
$$ ##$ShimSysType= 4
$$ ##$ShimUnit= 3
$$ ##$SpectrOsVersion= <4.1.156.20210628>
$$ ##$TCubeEth= <192.168.180.38>
$$ ##$TCubeSeqDevice= <>
$$ ##$TOSITY= <no>
$$ ##$TRIPLO2= 0
$$ ##$TopSpinVersion= <TopSpin 4.1.3>
$$ ##$TrxFreqFormula= (0..23)
$$ <TrxFreqFormula(2.0,700350000.000000,'TRX',Trx(1.0,'TRX 1200.1',1,5.000000,1290.000000))>
$$ <TrxFreqFormula(2.0,700350000.000000,'TRX',Trx(1.0,'TRX 1200.2',1,5.000000,1290.000000))>
$$ <TrxFreqFormula(2.0,700350000.000000,'TRX',Trx(1.0,'TRX 1200.3',1,5.000000,1290.000000))>
$$ <> <> <> <> <> <> <> <> <> <> <> <> <> <> <> <> <> <> <> <> <>
$$ ##$TrxPN= (0..23)
$$ <Z148391> <Z148391> <Z148391> <> <> <> <> <> <> <> <> <> <> <> <> <> <>
$$ <> <> <> <> <> <> <>
$$ ##$TrxSN= (0..23)
$$ <00336> <00337> <00342> <> <> <> <> <> <> <> <> <> <> <> <> <> <> <> <>
$$ <> <> <> <> <>
$$ ##$VCubeEth= (0..23)
$$ <no> <no> <no> <no> <no> <no> <no> <no> <no> <no> <no> <no> <no> <no> <no>
$$ <no> <no> <no> <no> <no> <no> <no> <no> <no>
$$ ##$VTU= 2
$$ ##$VTUETH= <192.168.99.11>
$$ ##$VTUTY= <no>
$$ ##$ValueLine= no
$$ ##$VpuPN= (0..23)
$$ <no> <no> <no> <no> <no> <no> <no> <no> <no> <no> <no> <no> <no> <no> <no>
$$ <no> <no> <no> <no> <no> <no> <no> <no> <no>
$$ ##$VpuSN= (0..23)
$$ <no> <no> <no> <no> <no> <no> <no> <no> <no> <no> <no> <no> <no> <no> <no>
$$ <no> <no> <no> <no> <no> <no> <no> <no> <no>
$$ ##$WBREFAM= (0..31)
$$ 99.8 100 100 100 100 100 100 100 100 100 100 100 100 100 100 100 100 100
$$ 100 100 100 100 100 100 100 100 100 100 100 100 100 100
$$ ##$WBREFLM= (0..31)
$$ 1 0 1 0 0 0 0 0 0 0 0 0 0 0 0 0 0 0 0 0 0 0 0 0 0 0 0 0 0 0 0 0
$$ ##$WBREFPH= (0..31)
$$ 0.05 0 0 0 0 0 0 0 0 0 0 0 0 0 0 0 0 0 0 0 0 0 0 0 0 0 0 0 0 0 0 0
$$ ##$WBSGU= (0..31)
$$ 1 2 4 0 0 0 0 0 0 0 0 0 0 0 0 0 0 0 0 0 0 0 0 0 0 0 0 0 0 0 0 0
$$ ##END=
$$ 
##$DECIM=	220
##$DSPFVS=	20
##XUNITS=	HZ
##YUNITS=	ARBITRARY UNITS
##FIRSTX=	45381.145993762394937
##LASTX=	-45527.251334007480182
##DELTAX=	-0.69358132102272718189
##XFACTOR=	1
##YFACTOR=	2.5078535092471083701
##FIRSTY=	3.4145185947418212891
##MINY=	-2.6971647739410400391
##MAXY=	82174.8359375
##NPOINTS=	131072
##XYDATA=	(X++(Y..Y))
$$ [...]
12782A9%%%%%%%%%%%%%%%%%%%%%%J%%%%%%%%%%%%%%%%%%%%%%%%%%%%%%%j%%%%%J%%%%j%%%
$$ 19 19 19 19 19 19 19 19 19 19 19 19 19 19 19 19 19 19 19 19 19 19 19 20 20 20 20 20 20 20 20 20 20 20 20 20 20 20 20 20 20 20 20 20 20 20 20 20 20 20 20 20 20 20 20 19 19 19 19 19 19 20 20 20 20 20 19 19 19 19
12734A9%%%Jj%%%%%%%%%%%J%%%%%%%%%%%%%%%%%%%%%%j%%%%%%%%%%%%%%%%%%%J%%J%%%j%%
$$ 19 19 19 19 20 19 19 19 19 19 19 19 19 19 19 19 19 20 20 20 20 20 20 20 20 20 20 20 20 20 20 20 20 20 20 20 20 20 20 20 19 19 19 19 19 19 19 19 19 19 19 19 19 19 19 19 19 19 19 19 20 20 20 21 21 21 21 20 20 20
12686B0%%j%%%%%%%J%%%%%%%%%%%%%%%%%%%%%%%%j%%%%%%J%%%%%jJ%%%%%%%%%%%%%%%%%%j
$$ 20 20 20 19 19 19 19 19 19 19 19 20 20 20 20 20 20 20 20 20 20 20 20 20 20 20 20 20 20 20 20 20 20 20 20 20 19 19 19 19 19 19 19 20 20 20 20 20 20 19 20 20 20 20 20 20 20 20 20 20 20 20 20 20 20 20 20 20 20 19
12639A9%%%%%J%%%%%%%%%%%%%j%%%%J%%%%%J%%%j%%%%%%%%%%%%%%%%%%%%%%%%%%%%%%%j%%
$$ 19 19 19 19 19 19 20 20 20 20 20 20 20 20 20 20 20 20 20 20 19 19 19 19 19 20 20 20 20 20 20 21 21 21 21 20 20 20 20 20 20 20 20 20 20 20 20 20 20 20 20 20 20 20 20 20 20 20 20 20 20 20 20 20 20 20 20 19 19 19
12591A9%%%J%%%%%%%%%%%%%%%%J%%%%%%%%%j%%%%%%%%%%%%%%%%%%%%j%%%%%%%%J%%%%%%%%
$$ 19 19 19 19 20 20 20 20 20 20 20 20 20 20 20 20 20 20 20 20 20 21 21 21 21 21 21 21 21 21 21 20 20 20 20 20 20 20 20 20 20 20 20 20 20 20 20 20 20 20 20 20 19 19 19 19 19 19 19 19 19 20 20 20 20 20 20 20 20 20
12543B0%%%j%%%%J%%%%%%%%%%%%%%%%%%%%%%%%%%%j%%%J%%%%%%%%%%%%J%%%%%j%%%%J%%%%
$$ 20 20 20 20 19 19 19 19 19 20 20 20 20 20 20 20 20 20 20 20 20 20 20 20 20 20 20 20 20 20 20 20 20 20 20 20 20 19 19 19 19 20 20 20 20 20 20 20 20 20 20 20 20 20 21 21 21 21 21 21 20 20 20 20 20 21 21 21 21 21
12495B1%%j%%%%%j%%%%%%%%J%%%%%%%%%%%%%%%%%%%%j%%%J%%%%%%%%J%%%j%%%%%%%%%%%%j
$$ 21 21 21 20 20 20 20 20 20 19 19 19 19 19 19 19 19 19 20 20 20 20 20 20 20 20 20 20 20 20 20 20 20 20 20 20 20 20 20 19 19 19 19 20 20 20 20 20 20 20 20 20 21 21 21 21 20 20 20 20 20 20 20 20 20 20 20 20 20 19
12447A9%%%%%%%%%J%%%%%%%j%%%%%%%%%%%%%%%%%%%%%%%%J%%%%%%j%%%%%%%%J%%%%%%%%%%
$$ 19 19 19 19 19 19 19 19 19 19 20 20 20 20 20 20 20 20 19 19 19 19 19 19 19 19 19 19 19 19 19 19 19 19 19 19 19 19 19 19 19 19 19 20 20 20 20 20 20 20 19 19 19 19 19 19 19 19 19 20 20 20 20 20 20 20 20 20 20 20
12399B0%%%%%%%%%%j%%%%%%%%j%J%%%%%%%%%%%%%%%%%%%%%%%%%%%J%%%%%%%%%%J%%%%%%%%
$$ 20 20 20 20 20 20 20 20 20 20 20 19 19 19 19 19 19 19 19 19 18 18 19 19 19 19 19 19 19 19 19 19 19 19 19 19 19 19 19 19 19 19 19 19 19 19 19 19 19 19 20 20 20 20 20 20 20 20 20 20 20 21 21 21 21 21 21 21 21 21
12351B1j%%%%%%%%%j%%%%%%%%%J%%%%%%%%%%jJ%%%%%%%j%J%%%%%%%%%%%%%%%%%%%%%%%j%%
$$ 21 20 20 20 20 20 20 20 20 20 20 19 19 19 19 19 19 19 19 19 19 20 20 20 20 20 20 20 20 20 20 20 19 20 20 20 20 20 20 20 20 19 19 20 20 20 20 20 20 20 20 20 20 20 20 20 20 20 20 20 20 20 20 20 20 20 20 19 19 19
12304A9%%%%%%%%J%%%%j%%%J%%%%%%%%%%%%%%%%%%%%%%%%%%%%%%%%%%%%%%%%%%%j%%%%%%%
$$ 19 19 19 19 19 19 19 19 19 20 20 20 20 20 19 19 19 19 20 20 20 20 20 20 20 20 20 20 20 20 20 20 20 20 20 20 20 20 20 20 20 20 20 20 20 20 20 20 20 20 20 20 20 20 20 20 20 20 20 20 20 20 19 19 19 19 19 19 19 19
12256A9%%%%%%%%%%%%%%%%%%%%J%%j%%%%%%%j%%%%%J%%%%J%%%%%%%%%%%%%%%%%%%%%%%%%%
$$ 19 19 19 19 19 19 19 19 19 19 19 19 19 19 19 19 19 19 19 19 19 20 20 20 19 19 19 19 19 19 19 19 18 18 18 18 18 18 19 19 19 19 19 20 20 20 20 20 20 20 20 20 20 20 20 20 20 20 20 20 20 20 20 20 20 20 20 20 20 20
12208B0%%%%J%j%%%%%%%%%%%%%%%%%j%%%%%J%%%%%%%J%%%%%%%%%%j%%%%%%J%%j%%%%%%j%%
$$ 20 20 20 20 20 21 21 20 20 20 20 20 20 20 20 20 20 20 20 20 20 20 20 20 20 19 19 19 19 19 19 20 20 20 20 20 20 20 20 21 21 21 21 21 21 21 21 21 21 21 20 20 20 20 20 20 20 21 21 21 20 20 20 20 20 20 20 19 19 19
12160A9%%j%J%%%%%%%%%%%%%%%%%%%%J%%%%j%%%%%%%%%J%%%%%%%%%%j%%%%%%%%%%%Jj%%%%
$$ 19 19 19 18 18 19 19 19 19 19 19 19 19 19 19 19 19 19 19 19 19 19 19 19 19 19 20 20 20 20 20 19 19 19 19 19 19 19 19 19 19 20 20 20 20 20 20 20 20 20 20 20 19 19 19 19 19 19 19 19 19 19 19 19 20 19 19 19 19 19
12112A9%%%%%%J%%%%j%%%%%%%%%%%%%%%J%%%%%%%%%%%%%%%%%%%%%%%%%%%%%%%%%%%%j%%%%
$$ 19 19 19 19 19 19 19 20 20 20 20 20 19 19 19 19 19 19 19 19 19 19 19 19 19 19 19 19 20 20 20 20 20 20 20 20 20 20 20 20 20 20 20 20 20 20 20 20 20 20 20 20 20 20 20 20 20 20 20 20 20 20 20 20 20 19 19 19 19 19
12064A9%%%%%%%%%J%%%%%%%%%%%%%%%%%%%%%%%%%j%%J%%%%J%%%%%j%%%j%%%%%J%%%%%%%%%
$$ 19 19 19 19 19 19 19 19 19 19 20 20 20 20 20 20 20 20 20 20 20 20 20 20 20 20 20 20 20 20 20 20 20 20 20 20 19 19 19 20 20 20 20 20 21 21 21 21 21 21 20 20 20 20 19 19 19 19 19 19 20 20 20 20 20 20 20 20 20 20
12016B0%%%%j%%%%%%J%%j%%%%%%%%%%%%%%%%%%%%%%%%%%%%J%%%%%%j%%%%%%%%%%%%%%%%%%
$$ 20 20 20 20 20 19 19 19 19 19 19 19 20 20 20 19 19 19 19 19 19 19 19 19 19 19 19 19 19 19 19 19 19 19 19 19 19 19 19 19 19 19 19 19 20 20 20 20 20 20 20 19 19 19 19 19 19 19 19 19 19 19 19 19 19 19 19 19 19 19
11969A9%%%%J%j%%%%J%%%%%%%%%%%%%%%%%%%%%%%%%%%jJ%%%j%%%%%%%%%%%%j%J%%%%%%%%%
$$ 19 19 19 19 19 20 20 19 19 19 19 19 20 20 20 20 20 20 20 20 20 20 20 20 20 20 20 20 20 20 20 20 20 20 20 20 20 20 20 20 19 20 20 20 20 19 19 19 19 19 19 19 19 19 19 19 19 19 18 18 19 19 19 19 19 19 19 19 19 19
11921A9%%%%%%%%%%J%%%%%%%%%%%%J%j%%%%%%%%%%j%%%%%%%%J%%%%%%%%%j%%%%%%%%J%%%%
$$ 19 19 19 19 19 19 19 19 19 19 19 20 20 20 20 20 20 20 20 20 20 20 20 20 21 21 20 20 20 20 20 20 20 20 20 20 20 19 19 19 19 19 19 19 19 19 20 20 20 20 20 20 20 20 20 20 19 19 19 19 19 19 19 19 19 20 20 20 20 20
11873B0%%%%%%%%%j%%%%%J%%%%J%%j%%%%%%j%%%%%J%%%%j%%%J%%%%%%%%J%%%%%%%%%%%j%%
$$ 20 20 20 20 20 20 20 20 20 20 19 19 19 19 19 19 20 20 20 20 20 21 21 21 20 20 20 20 20 20 20 19 19 19 19 19 19 20 20 20 20 20 19 19 19 19 20 20 20 20 20 20 20 20 20 21 21 21 21 21 21 21 21 21 21 21 21 20 20 20
11825B0%%%%%j%%%%J%%%%%%%%%%J%%%%%%j%%%%%%%%j%%%%J%%%%%j%%%%%%%%J%%%%%%%%%%j
$$ 20 20 20 20 20 20 19 19 19 19 19 20 20 20 20 20 20 20 20 20 20 20 21 21 21 21 21 21 21 20 20 20 20 20 20 20 20 20 19 19 19 19 19 20 20 20 20 20 20 19 19 19 19 19 19 19 19 19 20 20 20 20 20 20 20 20 20 20 20 19
11777A9%%%%%%%%%%%%J%%%j%%%%%%%j%%J%%%J%%%%%%%%%%%%%%%%%%%%%%%%%%%%%%%J%%%%%
$$ 19 19 19 19 19 19 19 19 19 19 19 19 19 20 20 20 20 19 19 19 19 19 19 19 19 18 18 18 19 19 19 19 20 20 20 20 20 20 20 20 20 20 20 20 20 20 20 20 20 20 20 20 20 20 20 20 20 20 20 20 20 20 20 20 21 21 21 21 21 21
11729B1%%%%%%j%%%%%%%%%%%%%%%%%%%%%%%%%%%%%J%%%%j%%%%%%%%%%%%%%%%%%%%%%%%%%%
$$ 21 21 21 21 21 21 21 20 20 20 20 20 20 20 20 20 20 20 20 20 20 20 20 20 20 20 20 20 20 20 20 20 20 20 20 20 20 21 21 21 21 21 20 20 20 20 20 20 20 20 20 20 20 20 20 20 20 20 20 20 20 20 20 20 20 20 20 20 20 20
11681B0%%%%%%%%%%%%%%%%%%%%%%%%%%%%j%%%%%%%%%%J%%%%%%%%%%%%j%%%%%%%%%%%%%%%%
$$ 20 20 20 20 20 20 20 20 20 20 20 20 20 20 20 20 20 20 20 20 20 20 20 20 20 20 20 20 20 19 19 19 19 19 19 19 19 19 19 19 20 20 20 20 20 20 20 20 20 20 20 20 20 19 19 19 19 19 19 19 19 19 19 19 19 19 19 19 19 19
11634A9%%%%%%%%%%%%%%%%%J%%%%%%%%%%%%%%%j%%%%%J%%%%%%%%%%%%%%%%%%%%%J%%%%%%%
$$ 19 19 19 19 19 19 19 19 19 19 19 19 19 19 19 19 19 19 20 20 20 20 20 20 20 20 20 20 20 20 20 20 20 20 19 19 19 19 19 19 20 20 20 20 20 20 20 20 20 20 20 20 20 20 20 20 20 20 20 20 20 20 21 21 21 21 21 21 21 21
11586B1%%%%%%%%%j%%%j%%%%%%%%%%%%%%%%J%%%J%j%%%j%%%%%%%%J%%%%%%%%%%%%%%j%%%%
$$ 21 21 21 21 21 21 21 21 21 21 20 20 20 20 19 19 19 19 19 19 19 19 19 19 19 19 19 19 19 19 19 20 20 20 20 21 21 20 20 20 20 19 19 19 19 19 19 19 19 19 20 20 20 20 20 20 20 20 20 20 20 20 20 20 20 19 19 19 19 19
11538A9%%%%%%%%%%%%J%%%%%%%%%%%%%%%%%%%%%%%%%j%%J%%%%%%j%%%%%%%J%%%%%%%%%%%j
$$ 19 19 19 19 19 19 19 19 19 19 19 19 19 20 20 20 20 20 20 20 20 20 20 20 20 20 20 20 20 20 20 20 20 20 20 20 20 20 20 19 19 19 20 20 20 20 20 20 20 19 19 19 19 19 19 19 19 20 20 20 20 20 20 20 20 20 20 20 20 19
11490A9J%%%%%%%%%%%%%%%%%%%%J%%%%%j%%%%%%J%%%%%%%%%%%j%%%%j%%%%%%%%%J%%%%%%j
$$ 19 20 20 20 20 20 20 20 20 20 20 20 20 20 20 20 20 20 20 20 20 20 21 21 21 21 21 21 20 20 20 20 20 20 20 21 21 21 21 21 21 21 21 21 21 21 21 20 20 20 20 20 19 19 19 19 19 19 19 19 19 19 20 20 20 20 20 20 20 19
11442A9%%%%%%%%%%%%%%%%%%%%%%%j%%%%%%%%%J%%%%%%%J%%%%%%%%J%j%%%%%%%%%%%%%%%%
$$ 19 19 19 19 19 19 19 19 19 19 19 19 19 19 19 19 19 19 19 19 19 19 19 19 18 18 18 18 18 18 18 18 18 18 19 19 19 19 19 19 19 19 20 20 20 20 20 20 20 20 20 21 21 20 20 20 20 20 20 20 20 20 20 20 20 20 20 20 20 20
11394B0%%%%j%%%%%%%%%%%%%%%%%J%%%%%%J%%%%%%j%%%J%%%%%%%%%%%%%%%%%%%%%j%%%%%%
$$ 20 20 20 20 20 19 19 19 19 19 19 19 19 19 19 19 19 19 19 19 19 19 19 20 20 20 20 20 20 20 21 21 21 21 21 21 21 20 20 20 20 21 21 21 21 21 21 21 21 21 21 21 21 21 21 21 21 21 21 21 21 21 21 20 20 20 20 20 20 20
11346B0%%%%%%%%%%%%%J%j%%%%%%%%%%%%%%%%%%%%%%%%%%%%%%%%%%%%%%%%%%%%%%%%%%%%%
$$ 20 20 20 20 20 20 20 20 20 20 20 20 20 20 21 21 20 20 20 20 20 20 20 20 20 20 20 20 20 20 20 20 20 20 20 20 20 20 20 20 20 20 20 20 20 20 20 20 20 20 20 20 20 20 20 20 20 20 20 20 20 20 20 20 20 20 20 20 20 20
11299B0%%%%%%%%%%%J%%%%j%%%%%j%%%%j%%%%%%%%%%%%%%%%%%%%%%%%%%%%%%%J%%%%%%%%%
$$ 20 20 20 20 20 20 20 20 20 20 20 20 21 21 21 21 21 20 20 20 20 20 20 19 19 19 19 19 18 18 18 18 18 18 18 18 18 18 18 18 18 18 18 18 18 18 18 18 18 18 18 18 18 18 18 18 18 18 18 18 19 19 19 19 19 19 19 19 19 19
11251A9%%%%%%%%%%%%%%%%%%J%%%%%%%%%%%%%%%%%%%%%%%%%%%%%%%%%%%j%%%J%%%%%j%%%J
$$ 19 19 19 19 19 19 19 19 19 19 19 19 19 19 19 19 19 19 19 20 20 20 20 20 20 20 20 20 20 20 20 20 20 20 20 20 20 20 20 20 20 20 20 20 20 20 20 20 20 20 20 20 20 20 20 19 19 19 19 20 20 20 20 20 20 19 19 19 19 20
11203B0%%%%%%%%%%%%%%%%%%%%%%%%%%%%%%%%%%%%%%%%%%%%%%%%j%%%J%%%%%%%%%%%%%%%%
$$ 20 20 20 20 20 20 20 20 20 20 20 20 20 20 20 20 20 20 20 20 20 20 20 20 20 20 20 20 20 20 20 20 20 20 20 20 20 20 20 20 20 20 20 20 20 20 20 20 20 19 19 19 19 20 20 20 20 20 20 20 20 20 20 20 20 20 20 20 20 20
11155B0%%%%%%%%%j%%%%%J%%%%%%%%%%%%j%%%%%%%%%%%%%%%%%J%%%%%%J%%j%%%%%%%%%%%%
$$ 20 20 20 20 20 20 20 20 20 20 19 19 19 19 19 19 20 20 20 20 20 20 20 20 20 20 20 20 20 19 19 19 19 19 19 19 19 19 19 19 19 19 19 19 19 19 19 20 20 20 20 20 20 20 21 21 21 20 20 20 20 20 20 20 20 20 20 20 20 20
11107B0%%%%%j%%%%%%%%%%%%%%J%%j%%%%J%%%%%%%%%%%%%%%%%%%%%%%%%%%%%%%%%%%%%%%%
$$ 20 20 20 20 20 20 19 19 19 19 19 19 19 19 19 19 19 19 19 19 19 20 20 20 19 19 19 19 19 20 20 20 20 20 20 20 20 20 20 20 20 20 20 20 20 20 20 20 20 20 20 20 20 20 20 20 20 20 20 20 20 20 20 20 20 20 20 20 20 20
11059B0%%%%%%%%%%%%%%j%%%%%%%%%%%%%%%%%%%%%%%J%%%%%%%%%%%%%%%%%%%%%%%%%%j%%%
$$ 20 20 20 20 20 20 20 20 20 20 20 20 20 20 20 19 19 19 19 19 19 19 19 19 19 19 19 19 19 19 19 19 19 19 19 19 19 19 19 20 20 20 20 20 20 20 20 20 20 20 20 20 20 20 20 20 20 20 20 20 20 20 20 20 20 20 19 19 19 19
11011A9%%%%%J%%%%%j%%%%%%%%J%%%%%Jj%%%%%%%%%%%%%%%%%j%%%j%%%%J%%%%%%%%%%%%%%
$$ 19 19 19 19 19 19 20 20 20 20 20 20 19 19 19 19 19 19 19 19 19 20 20 20 20 20 20 21 20 20 20 20 20 20 20 20 20 20 20 20 20 20 20 20 20 20 19 19 19 19 18 18 18 18 18 19 19 19 19 19 19 19 19 19 19 19 19 19 19 19
10964A9%%%%%%%%%%%%%%%%%%%%%%%%%%%%J%%%j%%J%%%%%%%%%%%%%%%%%%%%%%%%%%%%%%%%j
$$ 19 19 19 19 19 19 19 19 19 19 19 19 19 19 19 19 19 19 19 19 19 19 19 19 19 19 19 19 19 20 20 20 20 19 19 19 20 20 20 20 20 20 20 20 20 20 20 20 20 20 20 20 20 20 20 20 20 20 20 20 20 20 20 20 20 20 20 20 20 19
10916A9%%%%%%%%%J%%%%j%%%%%%%%%%%%%%%%%J%j%%%%%%%%%%%%%%%%%j%%J%%%%%%%%%%%J%
$$ 19 19 19 19 19 19 19 19 19 19 20 20 20 20 20 19 19 19 19 19 19 19 19 19 19 19 19 19 19 19 19 19 19 20 20 19 19 19 19 19 19 19 19 19 19 19 19 19 19 19 19 19 19 18 18 18 19 19 19 19 19 19 19 19 19 19 19 19 20 20
10868B0%%%J%%%%%%%%j%%%%%%%%%%%%%%%j%%%%J%%%%%%%%%%%%%%j%%%%%J%%%%%%%%%%%%%%
$$ 20 20 20 20 21 21 21 21 21 21 21 21 21 20 20 20 20 20 20 20 20 20 20 20 20 20 20 20 20 19 19 19 19 19 20 20 20 20 20 20 20 20 20 20 20 20 20 20 20 19 19 19 19 19 19 20 20 20 20 20 20 20 20 20 20 20 20 20 20 20
10820B0%%%%%%%j%%%%%%%%%%%%%%%%%%J%%%%%%%%%%%%%%%%%%Jj%%%%%%%%%%%%%%%%%%%j%%
$$ 20 20 20 20 20 20 20 20 19 19 19 19 19 19 19 19 19 19 19 19 19 19 19 19 19 19 19 20 20 20 20 20 20 20 20 20 20 20 20 20 20 20 20 20 20 20 21 20 20 20 20 20 20 20 20 20 20 20 20 20 20 20 20 20 20 20 20 19 19 19
10772A9%%%%%%%%%%%%%%%%%%%J%%%%%%%%J%j%%%%%%%%%%%%%%%%%%%j%%%%%J%%%%J%%%%%%j
$$ 19 19 19 19 19 19 19 19 19 19 19 19 19 19 19 19 19 19 19 19 20 20 20 20 20 20 20 20 20 21 21 20 20 20 20 20 20 20 20 20 20 20 20 20 20 20 20 20 20 20 20 19 19 19 19 19 19 20 20 20 20 20 21 21 21 21 21 21 21 20
10724B0%%%j%%%%J%%%%%%%%%J%j%%%%%%%%%%%%%%%%%%%%%%%%%%%j%%%%%%%%J%%%%%%%%%%%
$$ 20 20 20 20 19 19 19 19 19 20 20 20 20 20 20 20 20 20 20 21 21 20 20 20 20 20 20 20 20 20 20 20 20 20 20 20 20 20 20 20 20 20 20 20 20 20 20 20 20 19 19 19 19 19 19 19 19 19 20 20 20 20 20 20 20 20 20 20 20 20
10676B0%%%J%%%%%%%%%j%%%%%%%%%%%J%%j%%%J%%%%%%%%%%%%%%%j%%%%%%%%%%%%%%%%%%%%
$$ 20 20 20 20 21 21 21 21 21 21 21 21 21 21 20 20 20 20 20 20 20 20 20 20 20 20 21 21 21 20 20 20 20 21 21 21 21 21 21 21 21 21 21 21 21 21 21 21 21 20 20 20 20 20 20 20 20 20 20 20 20 20 20 20 20 20 20 20 20 20
10629B0%%%%%%%%%j%%J%%%%%%%J%%j%%%%j%%%%%%%%%%%%%%%%J%%%%%%%%%%%%%%%%%%%%%j%
$$ 20 20 20 20 20 20 20 20 20 20 19 19 19 20 20 20 20 20 20 20 20 21 21 21 20 20 20 20 20 19 19 19 19 19 19 19 19 19 19 19 19 19 19 19 19 19 20 20 20 20 20 20 20 20 20 20 20 20 20 20 20 20 20 20 20 20 20 20 19 19
10581A9%%%%%%%J%%%%%%%%%%%j%%j%%%%%%J%%%%J%%%%%%%%%%%%%%%%%%%%%%%%J%%%%%j%%%
$$ 19 19 19 19 19 19 19 19 20 20 20 20 20 20 20 20 20 20 20 20 19 19 19 18 18 18 18 18 18 18 19 19 19 19 19 20 20 20 20 20 20 20 20 20 20 20 20 20 20 20 20 20 20 20 20 20 20 20 20 20 21 21 21 21 21 21 20 20 20 20
10533B0%%%%%%%%%%%%%J%%%%%%j%%%%%%%%%%%%%%%%%%%%%%%%%%%%%%%%%%%%j%%%%%%%%%%%
$$ 20 20 20 20 20 20 20 20 20 20 20 20 20 20 21 21 21 21 21 21 21 20 20 20 20 20 20 20 20 20 20 20 20 20 20 20 20 20 20 20 20 20 20 20 20 20 20 20 20 20 20 20 20 20 20 20 20 20 19 19 19 19 19 19 19 19 19 19 19 19
10485A9J%%%%%%%%%%%%%%%%%%%%%%%j%%%%J%%%%%%%%%j%%%%%%%%%%J%%%%%jJ%%%%%%%%%%%
$$ 19 20 20 20 20 20 20 20 20 20 20 20 20 20 20 20 20 20 20 20 20 20 20 20 20 19 19 19 19 19 20 20 20 20 20 20 20 20 20 20 19 19 19 19 19 19 19 19 19 19 19 20 20 20 20 20 20 19 20 20 20 20 20 20 20 20 20 20 20 20
10437B0%%%%%%%%%%j%%%%J%%%%%%%%%j%%%%%%J%%%%%%%%%%J%%%%Jj%%%%%j%%%%%%%%%%%%%
$$ 20 20 20 20 20 20 20 20 20 20 20 19 19 19 19 19 20 20 20 20 20 20 20 20 20 20 19 19 19 19 19 19 19 20 20 20 20 20 20 20 20 20 20 20 21 21 21 21 21 22 21 21 21 21 21 21 20 20 20 20 20 20 20 20 20 20 20 20 20 20
10389B0j%%%%%J%%%%%%%%%%%%%J%%%%%j%%%%%%%%%%%%j%%%%J%%J%%%%%%%%%%%j%%%%%%%%%
$$ 20 19 19 19 19 19 19 20 20 20 20 20 20 20 20 20 20 20 20 20 20 21 21 21 21 21 21 20 20 20 20 20 20 20 20 20 20 20 20 20 19 19 19 19 19 20 20 20 21 21 21 21 21 21 21 21 21 21 21 21 20 20 20 20 20 20 20 20 20 20
10341B0%%%%%%%%%%%%%%j%%%%J%%%%%%%%%%%%%%%%%%%%%%%%%%%%%%%%%%j%%%%%%%%%%J%%%
$$ 20 20 20 20 20 20 20 20 20 20 20 20 20 20 20 19 19 19 19 19 20 20 20 20 20 20 20 20 20 20 20 20 20 20 20 20 20 20 20 20 20 20 20 20 20 20 20 20 20 20 20 20 20 20 20 19 19 19 19 19 19 19 19 19 19 19 20 20 20 20
10294B0%%%%%%%%%%%%%%%%%%%%%%%%%J%%%%%%%%%%j%%%%%%%%%J%%%%j%%%%%%%%%%%%%%%%%
$$ 20 20 20 20 20 20 20 20 20 20 20 20 20 20 20 20 20 20 20 20 20 20 20 20 20 20 21 21 21 21 21 21 21 21 21 21 21 20 20 20 20 20 20 20 20 20 20 21 21 21 21 21 20 20 20 20 20 20 20 20 20 20 20 20 20 20 20 20 20 20
10246B0%%%%%%%J%%%%j%%%%%%%%%J%%%%%%j%%%%J%%%%%J%%%%%%j%%%%%jJ%%%%%j%%%%%%%j
$$ 20 20 20 20 20 20 20 20 21 21 21 21 21 20 20 20 20 20 20 20 20 20 20 21 21 21 21 21 21 21 20 20 20 20 20 21 21 21 21 21 21 22 22 22 22 22 22 22 21 21 21 21 21 21 20 21 21 21 21 21 21 20 20 20 20 20 20 20 20 19
10198A9%J%%%%%%%%%%%%%%%%%%J%%%%%%%j%%%%%%%%%%%%%%%%%%%%%%%%J%%%%%%%%j%%%%%%
$$ 19 19 20 20 20 20 20 20 20 20 20 20 20 20 20 20 20 20 20 20 20 21 21 21 21 21 21 21 21 20 20 20 20 20 20 20 20 20 20 20 20 20 20 20 20 20 20 20 20 20 20 20 20 20 21 21 21 21 21 21 21 21 21 20 20 20 20 20 20 20
10150B0%%%%%%%%%J%%%%%%%%%%%%%j%J%%%j%%%%%%J%%%%%%%%%%%%j%%%%%jJ%%%%%%%%%%%%
$$ 20 20 20 20 20 20 20 20 20 20 21 21 21 21 21 21 21 21 21 21 21 21 21 21 20 20 21 21 21 21 20 20 20 20 20 20 20 21 21 21 21 21 21 21 21 21 21 21 21 21 20 20 20 20 20 20 19 20 20 20 20 20 20 20 20 20 20 20 20 20
10102B0j%%%J%%%%%J%%%%%%%%%%%%%%j%%%%%J%%%%%%%%%%%%%%%%%%%%J%j%%%j%%%%%%%%%%
$$ 20 19 19 19 19 20 20 20 20 20 20 21 21 21 21 21 21 21 21 21 21 21 21 21 21 21 20 20 20 20 20 20 21 21 21 21 21 21 21 21 21 21 21 21 21 21 21 21 21 21 21 21 21 22 22 21 21 21 21 20 20 20 20 20 20 20 20 20 20 20
10054B0%%%%%%%%%%%%%%J%%%%%%%jJ%%%j%%%J%%%%%%%%%%%%%%%%%%%%%%%%%%%%%%%%%%%%%
$$ 20 20 20 20 20 20 20 20 20 20 20 20 20 20 20 21 21 21 21 21 21 21 21 20 21 21 21 21 20 20 20 20 21 21 21 21 21 21 21 21 21 21 21 21 21 21 21 21 21 21 21 21 21 21 21 21 21 21 21 21 21 21 21 21 21 21 21 21 21 21
10006B1%%%%%%%%%%%j%%%%%%J%j%%%%%%%%J%%%%%%j%%%J%%%%j%%%%%%%%%%%%%%j%%%%%%%J
$$ 21 21 21 21 21 21 21 21 21 21 21 21 20 20 20 20 20 20 20 21 21 20 20 20 20 20 20 20 20 20 21 21 21 21 21 21 21 20 20 20 20 21 21 21 21 21 20 20 20 20 20 20 20 20 20 20 20 20 20 20 20 19 19 19 19 19 19 19 19 20
9959B0%%%J%%%%%%%%%%%%%%%%%%%%%%%%%%%j%%%%%%%%%j%%%J%%%%%%%%%%%%jJ%%%%j%%%%%
$$ 20 20 20 20 21 21 21 21 21 21 21 21 21 21 21 21 21 21 21 21 21 21 21 21 21 21 21 21 21 21 21 21 20 20 20 20 20 20 20 20 20 20 19 19 19 19 20 20 20 20 20 20 20 20 20 20 20 20 20 19 20 20 20 20 20 19 19 19 19 19 19
9910A9%%J%%%%%%%%%%%%%%%j%%%%%%%%%%%%%%%%%%%%%%%%J%%%%%%%%%%%%%%%%%%j%%%%%%J
$$ 19 19 19 20 20 20 20 20 20 20 20 20 20 20 20 20 20 20 20 19 19 19 19 19 19 19 19 19 19 19 19 19 19 19 19 19 19 19 19 19 19 19 19 19 20 20 20 20 20 20 20 20 20 20 20 20 20 20 20 20 20 20 20 19 19 19 19 19 19 19 20
9861B0%%%%%%%J%j%%%%%%%j%%%%%%%%%J%%%J%%j%%%%%%%%%%J%%%j%%%%%%%J%%%%%j%%%%%%
$$ 20 20 20 20 20 20 20 20 21 21 20 20 20 20 20 20 20 20 19 19 19 19 19 19 19 19 19 19 20 20 20 20 21 21 21 20 20 20 20 20 20 20 20 20 20 20 21 21 21 21 20 20 20 20 20 20 20 20 21 21 21 21 21 21 20 20 20 20 20 20 20
9813B0%%%%%%%%%%%%%%%%%%%%%%%%%%%%%J%%%%%%j%%%%%%%%%%%%%%%%J%%%%%%%%%%%%%%%%
$$ 20 20 20 20 20 20 20 20 20 20 20 20 20 20 20 20 20 20 20 20 20 20 20 20 20 20 20 20 20 20 21 21 21 21 21 21 21 20 20 20 20 20 20 20 20 20 20 20 20 20 20 20 20 20 21 21 21 21 21 21 21 21 21 21 21 21 21 21 21 21 21
9764B1%%%j%%%J%%%%%%%%%%j%%%j%%%%%%%%J%%%%%%%%%%%%%%%%%%%j%%%%%%J%%%%%%%%%%J
$$ 21 21 21 21 20 20 20 20 21 21 21 21 21 21 21 21 21 21 21 20 20 20 20 19 19 19 19 19 19 19 19 19 20 20 20 20 20 20 20 20 20 20 20 20 20 20 20 20 20 20 20 20 19 19 19 19 19 19 19 20 20 20 20 20 20 20 20 20 20 20 21
9716B1%%%%%%%%%%%%%j%%%%j%%%%%%J%%%%%%%%%%%%%%J%%%%%%%%%%%j%%%J%j%%%%%%J%%%%
$$ 21 21 21 21 21 21 21 21 21 21 21 21 21 21 20 20 20 20 20 19 19 19 19 19 19 19 20 20 20 20 20 20 20 20 20 20 20 20 20 20 20 21 21 21 21 21 21 21 21 21 21 21 21 20 20 20 20 21 21 20 20 20 20 20 20 20 21 21 21 21 21
9667B1%J%%%%%%j%%%%%%%%%%%%%%%%%%%%%%%%%%%%%%%%%%%%J%%%J%%%%j%%%j%%%%%J%%%j%
$$ 21 21 22 22 22 22 22 22 22 21 21 21 21 21 21 21 21 21 21 21 21 21 21 21 21 21 21 21 21 21 21 21 21 21 21 21 21 21 21 21 21 21 21 21 21 21 22 22 22 22 23 23 23 23 23 22 22 22 22 21 21 21 21 21 21 22 22 22 22 21 21
9619B1%%%%%%%%%%%%%j%%j%%%%%%%%J%%%%%%%%%%%%%%J%%%J%%%%%%%j%%%%%j%%%%%%%J%%%
$$ 21 21 21 21 21 21 21 21 21 21 21 21 21 21 20 20 20 19 19 19 19 19 19 19 19 19 20 20 20 20 20 20 20 20 20 20 20 20 20 20 20 21 21 21 21 22 22 22 22 22 22 22 22 21 21 21 21 21 21 20 20 20 20 20 20 20 20 21 21 21 21
9570B1%%%j%%%%%%%%%%%%%%%%%%%%%%%%%%%%J%%%%%%%j%%%%%J%%%%%%%%%%%%%%%%%%%%%%%
$$ 21 21 21 21 20 20 20 20 20 20 20 20 20 20 20 20 20 20 20 20 20 20 20 20 20 20 20 20 20 20 20 20 20 21 21 21 21 21 21 21 21 20 20 20 20 20 20 21 21 21 21 21 21 21 21 21 21 21 21 21 21 21 21 21 21 21 21 21 21 21 21
9522B1%%%%%%%%%%%%%%%%%%%J%%%%%%%%%%%%%j%J%%%%%%j%%%%%%%%%%%%%%%%J%%%%J%%%%j
$$ 21 21 21 21 21 21 21 21 21 21 21 21 21 21 21 21 21 21 21 21 22 22 22 22 22 22 22 22 22 22 22 22 22 22 21 21 22 22 22 22 22 22 22 21 21 21 21 21 21 21 21 21 21 21 21 21 21 21 21 21 22 22 22 22 22 23 23 23 23 23 22
9473B2%%j%%j%%%%%%%%%%%%%%%%%%%%%%%%%%j%%J%%%%%J%%%%%j%%%%%%%%%%%%%%%%%%%%%%
$$ 22 22 22 21 21 21 20 20 20 20 20 20 20 20 20 20 20 20 20 20 20 20 20 20 20 20 20 20 20 20 20 20 20 19 19 19 20 20 20 20 20 20 21 21 21 21 21 21 20 20 20 20 20 20 20 20 20 20 20 20 20 20 20 20 20 20 20 20 20 20 20
9425B0%J%%%%%%%%%J%%%j%%%%%%%%J%j%%%J%%%%%%%j%%%%%%%%%%%%%%%%%%%%%%%%%%%%%%%
$$ 20 20 21 21 21 21 21 21 21 21 21 21 22 22 22 22 21 21 21 21 21 21 21 21 21 22 22 21 21 21 21 22 22 22 22 22 22 22 22 21 21 21 21 21 21 21 21 21 21 21 21 21 21 21 21 21 21 21 21 21 21 21 21 21 21 21 21 21 21 21 21
9376B1%%%%%%%%%%%%%%%%%%%%%%%%%%%j%%%%%J%%J%%%%j%%%%%j%J%%%%%j%J%%%%%%%%%jJ%
$$ 21 21 21 21 21 21 21 21 21 21 21 21 21 21 21 21 21 21 21 21 21 21 21 21 21 21 21 21 20 20 20 20 20 20 21 21 21 22 22 22 22 22 21 21 21 21 21 21 20 20 21 21 21 21 21 21 20 20 21 21 21 21 21 21 21 21 21 21 20 21 21
9327B1%%%%%%j%J%%%%%%%%%%%%%%%%%%jJ%%%%%%%%%%%%%%%%%%%%%%%%%%%%%%%%%%%%%%%%%
$$ 21 21 21 21 21 21 21 20 20 21 21 21 21 21 21 21 21 21 21 21 21 21 21 21 21 21 21 21 20 21 21 21 21 21 21 21 21 21 21 21 21 21 21 21 21 21 21 21 21 21 21 21 21 21 21 21 21 21 21 21 21 21 21 21 21 21 21 21 21 21 21
9279B1%%%%%%%%%%%%%%%%%%%%%%%%%%%%%%%%%%%j%%%%%%%%%J%%%J%%%j%%%%%J%%%%%%%%%%
$$ 21 21 21 21 21 21 21 21 21 21 21 21 21 21 21 21 21 21 21 21 21 21 21 21 21 21 21 21 21 21 21 21 21 21 21 21 20 20 20 20 20 20 20 20 20 20 21 21 21 21 22 22 22 22 21 21 21 21 21 21 22 22 22 22 22 22 22 22 22 22 22
9230B2j%%%j%%%%%%%%J%%%%%%%%%%%%%%%%%%%%%%%%%%%%%%%%%%%%%%%%%%%%%%%%%%%%%%%%
$$ 22 21 21 21 21 20 20 20 20 20 20 20 20 20 21 21 21 21 21 21 21 21 21 21 21 21 21 21 21 21 21 21 21 21 21 21 21 21 21 21 21 21 21 21 21 21 21 21 21 21 21 21 21 21 21 21 21 21 21 21 21 21 21 21 21 21 21 21 21 21 21
9182B1%%%%%%j%J%%%%%%%%%%J%%%%%%%j%%%%%%%%%%%j%%%%%%%%%%%%%%%%%%J%%j%%%%%%%%
$$ 21 21 21 21 21 21 21 20 20 21 21 21 21 21 21 21 21 21 21 21 22 22 22 22 22 22 22 22 21 21 21 21 21 21 21 21 21 21 21 21 20 20 20 20 20 20 20 20 20 20 20 20 20 20 20 20 20 20 20 21 21 21 20 20 20 20 20 20 20 20 20
9133B0%%%%%%%%%%J%%%%%%%%%%%%%%%%j%J%%%%%%%%%%j%%%%%%%%%J%%%%%%%%%%%%%%%%%%%
$$ 20 20 20 20 20 20 20 20 20 20 20 21 21 21 21 21 21 21 21 21 21 21 21 21 21 21 21 21 20 20 21 21 21 21 21 21 21 21 21 21 21 20 20 20 20 20 20 20 20 20 20 21 21 21 21 21 21 21 21 21 21 21 21 21 21 21 21 21 21 21 21
9085B1%%%%%j%%J%%%%%%%%%%%%%%%%%%%%%%%%%%j%%%%J%%%%%%%%%%%%%%%%%%%%%%%%%%%%%
$$ 21 21 21 21 21 21 20 20 20 21 21 21 21 21 21 21 21 21 21 21 21 21 21 21 21 21 21 21 21 21 21 21 21 21 21 21 20 20 20 20 20 21 21 21 21 21 21 21 21 21 21 21 21 21 21 21 21 21 21 21 21 21 21 21 21 21 21 21 21 21 21
9036B1%%%%%%%%%%%%%%%%%%%%j%%%%%J%%%%%%%%j%%%%J%%%%%%%%%%%%%%%%%%%%%%%%%%%%%
$$ 21 21 21 21 21 21 21 21 21 21 21 21 21 21 21 21 21 21 21 21 21 20 20 20 20 20 20 21 21 21 21 21 21 21 21 21 20 20 20 20 20 21 21 21 21 21 21 21 21 21 21 21 21 21 21 21 21 21 21 21 21 21 21 21 21 21 21 21 21 21 21
8988B1%%%%%%%%%%%%%%%%%J%%%%j%%%%%%%%%%%j%%%%%%J%%%%%%%%%%%%%%%%%%%%%%%%%%%%
$$ 21 21 21 21 21 21 21 21 21 21 21 21 21 21 21 21 21 21 22 22 22 22 22 21 21 21 21 21 21 21 21 21 21 21 21 20 20 20 20 20 20 20 21 21 21 21 21 21 21 21 21 21 21 21 21 21 21 21 21 21 21 21 21 21 21 21 21 21 21 21 21
8939B1%%%%%%%%%%%%%%%%j%%%%%%%%%%%%%%J%%%%%%j%%%%%%%J%%%%%j%%%%%J%%%J%%%J%%%
$$ 21 21 21 21 21 21 21 21 21 21 21 21 21 21 21 21 21 20 20 20 20 20 20 20 20 20 20 20 20 20 20 20 21 21 21 21 21 21 21 20 20 20 20 20 20 20 20 21 21 21 21 21 21 20 20 20 20 20 20 21 21 21 21 22 22 22 22 23 23 23 23
8890B3%j%%%j%%%%%%%%%J%%%%%%%%j%%%j%%%%%%J%%%%%%%J%%%%%%%%%j%%%%%%%%%%%%%%%%
$$ 23 23 22 22 22 22 21 21 21 21 21 21 21 21 21 21 22 22 22 22 22 22 22 22 22 21 21 21 21 20 20 20 20 20 20 20 21 21 21 21 21 21 21 21 22 22 22 22 22 22 22 22 22 22 21 21 21 21 21 21 21 21 21 21 21 21 21 21 21 21 21
8842B1%%%J%%%j%%%%%j%%JjJ%jJ%%%%%%%%%%%%%%%%J%%%%%%%%%%%%%%%%%%%%%%%%%%j%%%%
$$ 21 21 21 21 22 22 22 22 21 21 21 21 21 21 20 20 20 21 20 21 21 20 21 21 21 21 21 21 21 21 21 21 21 21 21 21 21 21 21 22 22 22 22 22 22 22 22 22 22 22 22 22 22 22 22 22 22 22 22 22 22 22 22 22 22 22 21 21 21 21 21
8793B1%%%%%%%%%%%%%%%%%%%%%%%%%%%%%J%%%j%%%%%%%%%%%%%%%J%%%%%%%%%%%%%%%%%%%%
$$ 21 21 21 21 21 21 21 21 21 21 21 21 21 21 21 21 21 21 21 21 21 21 21 21 21 21 21 21 21 21 22 22 22 22 21 21 21 21 21 21 21 21 21 21 21 21 21 21 21 21 22 22 22 22 22 22 22 22 22 22 22 22 22 22 22 22 22 22 22 22 22
8745B2j%%%%%%%%%%%J%%%J%j%%j%%%%%%%%%J%%%%%%%%%%%%J%j%%%%j%%%%%%%%%%%J%%%j%%
$$ 22 21 21 21 21 21 21 21 21 21 21 21 21 22 22 22 22 23 23 22 22 22 21 21 21 21 21 21 21 21 21 21 22 22 22 22 22 22 22 22 22 22 22 22 22 23 23 22 22 22 22 22 21 21 21 21 21 21 21 21 21 21 21 21 22 22 22 22 21 21 21
8696B1%%%%%%%%%%%%%%%%%%%%%%%%%%%%%%%%%%%%%%%%%%%J%%%%%%j%J%%%%%%%%%%%%%j%%%
$$ 21 21 21 21 21 21 21 21 21 21 21 21 21 21 21 21 21 21 21 21 21 21 21 21 21 21 21 21 21 21 21 21 21 21 21 21 21 21 21 21 21 21 21 21 22 22 22 22 22 22 22 21 21 22 22 22 22 22 22 22 22 22 22 22 22 22 22 21 21 21 21
8648B1J%%%%%%%%%%%%%%%%%%j%%%%%%%%%J%%%%%%%j%%%%%%%%%%%%%%%%j%%%%%%%%%%%J%%%
$$ 21 22 22 22 22 22 22 22 22 22 22 22 22 22 22 22 22 22 22 22 21 21 21 21 21 21 21 21 21 21 22 22 22 22 22 22 22 22 21 21 21 21 21 21 21 21 21 21 21 21 21 21 21 21 21 20 20 20 20 20 20 20 20 20 20 20 20 21 21 21 21
8599B1%%%%J%%%%%%%%%%%%%%%%j%%%%%%%%%%J%%%%%%%%%%%%J%%%%%j%%%%%%%%%j%%%%%%%j
$$ 21 21 21 21 21 22 22 22 22 22 22 22 22 22 22 22 22 22 22 22 22 22 21 21 21 21 21 21 21 21 21 21 21 22 22 22 22 22 22 22 22 22 22 22 22 22 23 23 23 23 23 23 22 22 22 22 22 22 22 22 22 22 21 21 21 21 21 21 21 21 20
8551B0%%%J%%%%J%%%%%%%%%%%%%%%%%%j%%%%%%%%%%%J%%%%%%%%%%%j%%%%%%%%%%%%%%%J%%
$$ 20 20 20 20 21 21 21 21 21 22 22 22 22 22 22 22 22 22 22 22 22 22 22 22 22 22 22 22 21 21 21 21 21 21 21 21 21 21 21 21 22 22 22 22 22 22 22 22 22 22 22 22 21 21 21 21 21 21 21 21 21 21 21 21 21 21 21 21 22 22 22
8502B2%%%j%%%%%%%%%%%%%J%%%%%%%%%%%%%%%%%%%%%%%%%%%%%%%%%%j%%%%%%%%%%%%%%%%J
$$ 22 22 22 22 21 21 21 21 21 21 21 21 21 21 21 21 21 21 22 22 22 22 22 22 22 22 22 22 22 22 22 22 22 22 22 22 22 22 22 22 22 22 22 22 22 22 22 22 22 22 22 22 22 21 21 21 21 21 21 21 21 21 21 21 21 21 21 21 21 21 22
8453B2%%%%%j%%%%J%%j%%%%%%%%%%%%%J%%%%%%%%%Jj%%%%%%%%J%%%%%%j%%J%%%%%%j%%%%%
$$ 22 22 22 22 22 22 21 21 21 21 21 22 22 22 21 21 21 21 21 21 21 21 21 21 21 21 21 21 22 22 22 22 22 22 22 22 22 22 23 22 22 22 22 22 22 22 22 22 23 23 23 23 23 23 23 22 22 22 23 23 23 23 23 23 23 22 22 22 22 22 22
8405B2%%%%%%%%%%J%%j%%%%%%%J%%%%%%j%%%%J%%%%%%%%%%%%%%%j%%%%%%%%%j%%%%%J%%%%
$$ 22 22 22 22 22 22 22 22 22 22 22 23 23 23 22 22 22 22 22 22 22 22 23 23 23 23 23 23 23 22 22 22 22 22 23 23 23 23 23 23 23 23 23 23 23 23 23 23 23 23 22 22 22 22 22 22 22 22 22 22 21 21 21 21 21 21 22 22 22 22 22
8356B2%%%J%%%%%%%j%%j%%%%%J%%%%%%%%%%%%%%%j%%%%%%%%%%%%%%%%j%J%%%%%%%%%%%J%%
$$ 22 22 22 22 23 23 23 23 23 23 23 23 22 22 22 21 21 21 21 21 21 22 22 22 22 22 22 22 22 22 22 22 22 22 22 22 22 21 21 21 21 21 21 21 21 21 21 21 21 21 21 21 21 21 20 20 21 21 21 21 21 21 21 21 21 21 21 21 22 22 22
8308B2%%J%%%%%j%%%%%%%%%%%%%%%%%%%%%%J%%%%%%%%%%%%%%%%%%%%%%j%%%%%%%%Jj%%%%%
$$ 22 22 22 23 23 23 23 23 23 22 22 22 22 22 22 22 22 22 22 22 22 22 22 22 22 22 22 22 22 22 22 22 23 23 23 23 23 23 23 23 23 23 23 23 23 23 23 23 23 23 23 23 23 23 23 22 22 22 22 22 22 22 22 22 23 22 22 22 22 22 22
8259B2%%%%%%%%%%%%J%j%%%%%%%%%%%%%%%%%%%%%%%%%%Jj%%%%%%%%%%Jj%%%%%%%%%%%%%%%
$$ 22 22 22 22 22 22 22 22 22 22 22 22 22 23 23 22 22 22 22 22 22 22 22 22 22 22 22 22 22 22 22 22 22 22 22 22 22 22 22 22 22 22 23 22 22 22 22 22 22 22 22 22 22 22 23 22 22 22 22 22 22 22 22 22 22 22 22 22 22 22 22
8211B2%%%%%%%%%%%J%%%%%%%%%%%%%%%%%j%%J%%%%%%%%%%j%%%%%%%%%%%%%%%%%%%%%%%%%%
$$ 22 22 22 22 22 22 22 22 22 22 22 22 23 23 23 23 23 23 23 23 23 23 23 23 23 23 23 23 23 23 22 22 22 23 23 23 23 23 23 23 23 23 23 23 22 22 22 22 22 22 22 22 22 22 22 22 22 22 22 22 22 22 22 22 22 22 22 22 22 22 22
8162B2%%%%%%%%J%%%%%%%%j%%%%%J%%%%%%%%%%%%%%%%j%%%%%%%%%%%%%%%%J%%%%%%%%%%%%
$$ 22 22 22 22 22 22 22 22 22 23 23 23 23 23 23 23 23 23 22 22 22 22 22 22 23 23 23 23 23 23 23 23 23 23 23 23 23 23 23 23 23 22 22 22 22 22 22 22 22 22 22 22 22 22 22 22 22 22 23 23 23 23 23 23 23 23 23 23 23 23 23
8114B3%%%j%%%%%%%J%%%%j%%%%%%%%%%%%%%%%%%%%%%%%Jj%%%%%%%%%%%%%%%%%%%%%%%%j%%
$$ 23 23 23 23 22 22 22 22 22 22 22 22 23 23 23 23 23 22 22 22 22 22 22 22 22 22 22 22 22 22 22 22 22 22 22 22 22 22 22 22 22 22 23 22 22 22 22 22 22 22 22 22 22 22 22 22 22 22 22 22 22 22 22 22 22 22 22 22 21 21 21
8065B1J%%%%%%%%%%%%%%%%%%%%%%%%%%%%%j%%%%%%%J%%%%%%%%%%J%j%%%%%%%%%%%%%%%%%J
$$ 21 22 22 22 22 22 22 22 22 22 22 22 22 22 22 22 22 22 22 22 22 22 22 22 22 22 22 22 22 22 22 21 21 21 21 21 21 21 21 22 22 22 22 22 22 22 22 22 22 22 23 23 22 22 22 22 22 22 22 22 22 22 22 22 22 22 22 22 22 22 23
8017B3%%%%%%%%%%%%%jJ%%%%%j%%%%%%%%%%%%%%%%%%%%%%%J%%%%%%%%%%%%%%%%j%%%%%%%%
$$ 23 23 23 23 23 23 23 23 23 23 23 23 23 23 22 23 23 23 23 23 23 22 22 22 22 22 22 22 22 22 22 22 22 22 22 22 22 22 22 22 22 22 22 22 22 23 23 23 23 23 23 23 23 23 23 23 23 23 23 23 23 23 22 22 22 22 22 22 22 22 22
7968B2%%%%%%%%%%%%%%%%%%J%%%%%%%%%%j%%%%%%%%%%J%j%%%%jJ%%%%J%%%%%%%J%%%%%J%%
$$ 22 22 22 22 22 22 22 22 22 22 22 22 22 22 22 22 22 22 22 23 23 23 23 23 23 23 23 23 23 23 22 22 22 22 22 22 22 22 22 22 22 23 23 22 22 22 22 22 21 22 22 22 22 22 23 23 23 23 23 23 23 23 24 24 24 24 24 24 25 25 25
7919B5%%%%j%%%%%%j%%%%%%%%%%j%%%%%%%%J%%%j%%%%%%%J%%%%j%%%%%%%%%J%%j%%%%%%%%
$$ 25 25 25 25 25 24 24 24 24 24 24 24 23 23 23 23 23 23 23 23 23 23 23 22 22 22 22 22 22 22 22 22 23 23 23 23 22 22 22 22 22 22 22 22 23 23 23 23 23 22 22 22 22 22 22 22 22 22 22 23 23 23 22 22 22 22 22 22 22 22 22
7871B2%%J%%%%%%%%%%%%%%%%%%j%%%j%%%%%%%%%%J%%%%%%%%%%%%%%%%%J%j%%%%%%%%%%%%J
$$ 22 22 22 23 23 23 23 23 23 23 23 23 23 23 23 23 23 23 23 23 23 23 22 22 22 22 21 21 21 21 21 21 21 21 21 21 21 22 22 22 22 22 22 22 22 22 22 22 22 22 22 22 22 22 22 23 23 22 22 22 22 22 22 22 22 22 22 22 22 22 23
7822B3%%%%%%%%%%%j%%%%%%%%%%%%%%%%%%%%%%%%J%%%%%%%%%%j%%%%%%%%%%J%%j%%%%%%%J
$$ 23 23 23 23 23 23 23 23 23 23 23 23 22 22 22 22 22 22 22 22 22 22 22 22 22 22 22 22 22 22 22 22 22 22 22 22 22 23 23 23 23 23 23 23 23 23 23 23 22 22 22 22 22 22 22 22 22 22 22 23 23 23 22 22 22 22 22 22 22 22 23
7774B3%%%Jj%%%%Jj%%%%%%%%%%%%%%%%%%%%%%J%%%%%%%%%%j%%%%J%%j%%%%%%%%%%%%%%%%%
$$ 23 23 23 23 24 23 23 23 23 23 24 23 23 23 23 23 23 23 23 23 23 23 23 23 23 23 23 23 23 23 23 23 23 23 24 24 24 24 24 24 24 24 24 24 24 23 23 23 23 23 24 24 24 23 23 23 23 23 23 23 23 23 23 23 23 23 23 23 23 23 23
7725B3J%%%%%j%%j%%%%%%%%%%%%%%Jj%%J%%%%%%%%%%%%%%%J%%%J%%%j%%%%%%%%%j%%J%%%%
$$ 23 24 24 24 24 24 24 23 23 23 22 22 22 22 22 22 22 22 22 22 22 22 22 22 22 23 22 22 22 23 23 23 23 23 23 23 23 23 23 23 23 23 23 23 23 24 24 24 24 25 25 25 25 24 24 24 24 24 24 24 24 24 24 23 23 23 24 24 24 24 24
7677B4%%%%%%%%%%%%%j%%%%%%%%%%%%J%%%%%%%%%%jJ%%%%j%%%%%%%%%%%%%%%%J%%%%%%j%%
$$ 24 24 24 24 24 24 24 24 24 24 24 24 24 24 23 23 23 23 23 23 23 23 23 23 23 23 23 24 24 24 24 24 24 24 24 24 24 24 23 24 24 24 24 24 23 23 23 23 23 23 23 23 23 23 23 23 23 23 23 23 23 24 24 24 24 24 24 24 23 23 23
7628B3%%%J%%%%%%%%%%%%%%J%%%%%j%%%%%%%j%%%%%J%%%%%%%%j%%J%%%%%%%%%%%%j%%%%%J
$$ 23 23 23 23 24 24 24 24 24 24 24 24 24 24 24 24 24 24 24 25 25 25 25 25 25 24 24 24 24 24 24 24 24 23 23 23 23 23 23 24 24 24 24 24 24 24 24 24 23 23 23 24 24 24 24 24 24 24 24 24 24 24 24 24 23 23 23 23 23 23 24
7580B4%%%%%%%%%j%%%%%%%%%%%%%%%%%jJ%%%%%%%%%%%%%J%%%%%%%%%%%%%%j%%%%%J%%%j%%
$$ 24 24 24 24 24 24 24 24 24 24 23 23 23 23 23 23 23 23 23 23 23 23 23 23 23 23 23 23 22 23 23 23 23 23 23 23 23 23 23 23 23 23 23 24 24 24 24 24 24 24 24 24 24 24 24 24 24 24 23 23 23 23 23 23 24 24 24 24 23 23 23
7531B3%%%%J%%%%%%%%%%%%%%%%%%%%%%%%%J%%j%%%%%%%%%%%%%%%%%%%%%%%%%%%%%j%%%%j%
$$ 23 23 23 23 23 24 24 24 24 24 24 24 24 24 24 24 24 24 24 24 24 24 24 24 24 24 24 24 24 24 24 25 25 25 24 24 24 24 24 24 24 24 24 24 24 24 24 24 24 24 24 24 24 24 24 24 24 24 24 24 24 24 24 24 23 23 23 23 23 22 22
7482B2%%%%J%%%%%%%J%%%%j%%%%%%%%%%%%%%%J%%%%%%%%%%%%%%%%%j%%%%%%%%%%J%%%%%%%
$$ 22 22 22 22 22 23 23 23 23 23 23 23 23 24 24 24 24 24 23 23 23 23 23 23 23 23 23 23 23 23 23 23 23 23 24 24 24 24 24 24 24 24 24 24 24 24 24 24 24 24 24 24 23 23 23 23 23 23 23 23 23 23 23 24 24 24 24 24 24 24 24
7434B4%%%%%%%%%%%%%%j%%%j%%%%%%J%%%%%%%%%%%%%%%%%%%%%%%%%J%%j%%%%%%%%%%%j%%%
$$ 24 24 24 24 24 24 24 24 24 24 24 24 24 24 24 23 23 23 23 22 22 22 22 22 22 22 23 23 23 23 23 23 23 23 23 23 23 23 23 23 23 23 23 23 23 23 23 23 23 23 23 23 24 24 24 23 23 23 23 23 23 23 23 23 23 23 23 22 22 22 22
7385B2J%%%%%%%%%%%jJ%%%%J%%%%%J%%%%%%%j%%%%jJ%%%%%%%%%j%J%%%J%%%%%%%%%%%%%j%
$$ 22 23 23 23 23 23 23 23 23 23 23 23 23 22 23 23 23 23 23 24 24 24 24 24 24 25 25 25 25 25 25 25 25 24 24 24 24 24 23 24 24 24 24 24 24 24 24 24 24 23 23 24 24 24 24 25 25 25 25 25 25 25 25 25 25 25 25 25 25 24 24
7337B4%%%%%%%%%%%%%%%%%%%%%%%J%%%%j%%%%%%%%%%%%J%%%%%%%%%%%j%%%%J%%%%%%%%%j%
$$ 24 24 24 24 24 24 24 24 24 24 24 24 24 24 24 24 24 24 24 24 24 24 24 24 25 25 25 25 25 24 24 24 24 24 24 24 24 24 24 24 24 24 25 25 25 25 25 25 25 25 25 25 25 25 24 24 24 24 24 25 25 25 25 25 25 25 25 25 25 24 24
7288B4%%j%%%%%%J%%%%j%%%%%%J%%%%%%%%%%%%%%%%%%%%%%%%%%%%%%%%%%%%%%%%%%%%%%%j
$$ 24 24 24 23 23 23 23 23 23 23 24 24 24 24 24 23 23 23 23 23 23 23 24 24 24 24 24 24 24 24 24 24 24 24 24 24 24 24 24 24 24 24 24 24 24 24 24 24 24 24 24 24 24 24 24 24 24 24 24 24 24 24 24 24 24 24 24 24 24 24 23
7240B3%J%%%%%%%%%%%%%%%j%%%%J%%j%%%%%%%%%%%%%%J%%%%%%%%%%%%%%%%%%%%%%%%%%%%%
$$ 23 23 24 24 24 24 24 24 24 24 24 24 24 24 24 24 24 24 23 23 23 23 23 24 24 24 23 23 23 23 23 23 23 23 23 23 23 23 23 23 23 24 24 24 24 24 24 24 24 24 24 24 24 24 24 24 24 24 24 24 24 24 24 24 24 24 24 24 24 24 24
7191B4%%%%%Jj%%%%%%%%%%%%%%%%%%%%%%%%%%%%%%%%%%J%%%%j%%%%%%%%J%%%%%%%J%%j%%%
$$ 24 24 24 24 24 24 25 24 24 24 24 24 24 24 24 24 24 24 24 24 24 24 24 24 24 24 24 24 24 24 24 24 24 24 24 24 24 24 24 24 24 24 25 25 25 25 25 24 24 24 24 24 24 24 24 24 25 25 25 25 25 25 25 25 26 26 26 25 25 25 25
7143B5%%%j%%%%%%%%J%%%%%%%%%%%%%%%%%%%%%%%%%%%%%%j%%%%%%%%%%%%%%%%%%%%%%%%%%
$$ 25 25 25 25 24 24 24 24 24 24 24 24 24 25 25 25 25 25 25 25 25 25 25 25 25 25 25 25 25 25 25 25 25 25 25 25 25 25 25 25 25 25 25 25 24 24 24 24 24 24 24 24 24 24 24 24 24 24 24 24 24 24 24 24 24 24 24 24 24 24 24
7094B4%%%%%%%%%%%%%%%%%%%%%%%%J%%%%%j%%%%%%%%J%%%%%%%%%%%%%%%%%%%%%%%%%%%%%%
$$ 24 24 24 24 24 24 24 24 24 24 24 24 24 24 24 24 24 24 24 24 24 24 24 24 24 25 25 25 25 25 25 24 24 24 24 24 24 24 24 24 25 25 25 25 25 25 25 25 25 25 25 25 25 25 25 25 25 25 25 25 25 25 25 25 25 25 25 25 25 25 25
7046B5%%%%%%%Jj%%%%%%%%%J%%j%%%%%%%%%%%%%%%%%%%%%%%%%%%%%%%%%%%%%jJ%%%%%%%%%
$$ 25 25 25 25 25 25 25 25 26 25 25 25 25 25 25 25 25 25 25 26 26 26 25 25 25 25 25 25 25 25 25 25 25 25 25 25 25 25 25 25 25 25 25 25 25 25 25 25 25 25 25 25 25 25 25 25 25 25 25 25 24 25 25 25 25 25 25 25 25 25 25
6997B5%%%Jj%%%%%%%%%%%%%%%%%%%%%j%J%%%%%J%%%j%%%%%%%%%%%%%j%%%%%%%J%%%%%%%%%
$$ 25 25 25 25 26 25 25 25 25 25 25 25 25 25 25 25 25 25 25 25 25 25 25 25 25 25 25 24 24 25 25 25 25 25 25 26 26 26 26 25 25 25 25 25 25 25 25 25 25 25 25 25 25 24 24 24 24 24 24 24 24 25 25 25 25 25 25 25 25 25 25
6948B5%%%%%%%%%%%%%%%%%%%J%%%%j%%%%%%%%%%%%%%%%%%%%%J%j%%%%J%%%%%%%%%%%%%%j%
$$ 25 25 25 25 25 25 25 25 25 25 25 25 25 25 25 25 25 25 25 25 26 26 26 26 26 25 25 25 25 25 25 25 25 25 25 25 25 25 25 25 25 25 25 25 25 25 25 26 26 25 25 25 25 25 26 26 26 26 26 26 26 26 26 26 26 26 26 26 26 25 25
6900B5%%%%%%%%%%%%%%%J%%%%%%%%j%%%j%%%J%%%%%J%%%%%%j%%%%%%%%%%%%%%%%%j%%%%%%
$$ 25 25 25 25 25 25 25 25 25 25 25 25 25 25 25 25 26 26 26 26 26 26 26 26 26 25 25 25 25 24 24 24 24 25 25 25 25 25 25 26 26 26 26 26 26 26 25 25 25 25 25 25 25 25 25 25 25 25 25 25 25 25 25 25 24 24 24 24 24 24 24
6851B4%J%%%J%%%%%%%%%%j%%%%%%%%J%%%%%J%%j%%%%%%%%%%%%%%%%%%%%%%%%%%%%%J%%%%%
$$ 24 24 25 25 25 25 26 26 26 26 26 26 26 26 26 26 26 25 25 25 25 25 25 25 25 25 26 26 26 26 26 26 27 27 27 26 26 26 26 26 26 26 26 26 26 26 26 26 26 26 26 26 26 26 26 26 26 26 26 26 26 26 26 26 26 27 27 27 27 27 27
6803B7%%j%%%%%%%%j%%%%%%%%%%%%%J%%%%%%%%%%%%%%%%%%%%%%%%%%%%%j%%%%%%J%%j%%%%
$$ 27 27 27 26 26 26 26 26 26 26 26 26 25 25 25 25 25 25 25 25 25 25 25 25 25 25 26 26 26 26 26 26 26 26 26 26 26 26 26 26 26 26 26 26 26 26 26 26 26 26 26 26 26 26 26 26 25 25 25 25 25 25 25 26 26 26 25 25 25 25 25
6754B5%%%%%%%%%%%%J%%%%%%%%%%%%%%%%%%%%%%%j%%%%%%%%%%%%%%%%%%%%%%%%%%%%%%J%%
$$ 25 25 25 25 25 25 25 25 25 25 25 25 25 26 26 26 26 26 26 26 26 26 26 26 26 26 26 26 26 26 26 26 26 26 26 26 26 25 25 25 25 25 25 25 25 25 25 25 25 25 25 25 25 25 25 25 25 25 25 25 25 25 25 25 25 25 25 25 26 26 26
6706B6%%%%j%J%%%%%%%%%%%%J%%%%j%%%%%%%%%%%%%%%%%%%j%%J%%%%%%%%%%%%%%%j%%%%%%
$$ 26 26 26 26 26 25 25 26 26 26 26 26 26 26 26 26 26 26 26 26 27 27 27 27 27 26 26 26 26 26 26 26 26 26 26 26 26 26 26 26 26 26 26 26 26 25 25 25 26 26 26 26 26 26 26 26 26 26 26 26 26 26 26 26 25 25 25 25 25 25 25
6657B5%J%%%%%%j%%%%%J%%%%%%%%%%%%J%%j%%%%%J%%%%%%%%%%%%%j%%%%%%%%%%%J%%%%%%%
$$ 25 25 26 26 26 26 26 26 26 25 25 25 25 25 25 26 26 26 26 26 26 26 26 26 26 26 26 26 27 27 27 26 26 26 26 26 26 27 27 27 27 27 27 27 27 27 27 27 27 27 27 26 26 26 26 26 26 26 26 26 26 26 26 27 27 27 27 27 27 27 27
6609B7J%%%j%%%%%%%j%%%%%%%%%%%%%%%%%%%%%%%%%%%%%%%%%%%%%%%%%%%%%%%%%%%J%%%%%
$$ 27 28 28 28 28 27 27 27 27 27 27 27 27 26 26 26 26 26 26 26 26 26 26 26 26 26 26 26 26 26 26 26 26 26 26 26 26 26 26 26 26 26 26 26 26 26 26 26 26 26 26 26 26 26 26 26 26 26 26 26 26 26 26 26 26 27 27 27 27 27 27
6560B7%%%%%j%%%%%%%%%%%%%%J%%%%%%%J%j%%%%%%%J%j%%%%%%J%%%%%%j%j%%%%%J%%%%%%%
$$ 27 27 27 27 27 27 26 26 26 26 26 26 26 26 26 26 26 26 26 26 26 27 27 27 27 27 27 27 27 28 28 27 27 27 27 27 27 27 27 28 28 27 27 27 27 27 27 27 28 28 28 28 28 28 28 27 27 26 26 26 26 26 26 27 27 27 27 27 27 27 27
6511B7%J%%%%%%%%%J%%%%%%j%%%%%%%%j%%%%%%%%%%%%%%%%%%%%%J%%%%%%%%%%j%%%%%%J%%
$$ 27 27 28 28 28 28 28 28 28 28 28 28 29 29 29 29 29 29 29 28 28 28 28 28 28 28 28 28 27 27 27 27 27 27 27 27 27 27 27 27 27 27 27 27 27 27 27 27 27 27 28 28 28 28 28 28 28 28 28 28 28 27 27 27 27 27 27 27 28 28 28
6463B8%%%%%%%%%%%%%%%j%%%%%%J%%%%%%%%j%%%%%%%%%%%%%%%%%%%J%%j%J%%%%%%%%%%%%j
$$ 28 28 28 28 28 28 28 28 28 28 28 28 28 28 28 28 27 27 27 27 27 27 27 28 28 28 28 28 28 28 28 28 27 27 27 27 27 27 27 27 27 27 27 27 27 27 27 27 27 27 27 27 28 28 28 27 27 28 28 28 28 28 28 28 28 28 28 28 28 28 27
6414B7%%%%%%%%%%%%%%%%%%J%%%%%%%%%jJ%%%%%%%%%%%%%%%%%%%%%%%%%J%%j%%%%%%%%%%%
$$ 27 27 27 27 27 27 27 27 27 27 27 27 27 27 27 27 27 27 27 28 28 28 28 28 28 28 28 28 28 27 28 28 28 28 28 28 28 28 28 28 28 28 28 28 28 28 28 28 28 28 28 28 28 28 28 28 29 29 29 28 28 28 28 28 28 28 28 28 28 28 28
6366B8%%%%%%%%%j%%%%%%%%%%%%J%%%%j%%%%J%%%%%%%%%%%%%%j%%%%%%%%%%%%%%%%%%%J%%
$$ 28 28 28 28 28 28 28 28 28 28 27 27 27 27 27 27 27 27 27 27 27 27 27 28 28 28 28 28 27 27 27 27 27 28 28 28 28 28 28 28 28 28 28 28 28 28 28 28 27 27 27 27 27 27 27 27 27 27 27 27 27 27 27 27 27 27 27 27 28 28 28
6317B8%%%%%%%%%j%%%%%%%%%%%%J%%%%%%%%%%%%%%%%%%%%%%%%%J%%%%%%j%%%%%%%%%%%%%%
$$ 28 28 28 28 28 28 28 28 28 28 27 27 27 27 27 27 27 27 27 27 27 27 27 28 28 28 28 28 28 28 28 28 28 28 28 28 28 28 28 28 28 28 28 28 28 28 28 28 28 29 29 29 29 29 29 29 28 28 28 28 28 28 28 28 28 28 28 28 28 28 28
6269B8%%J%%%%j%%%%%%%%%%%%%%%%%%%%%%%%%%%%%%%%j%%%%%J%%%%%%%%%%%%J%%%%%%%J%%
$$ 28 28 28 29 29 29 29 29 28 28 28 28 28 28 28 28 28 28 28 28 28 28 28 28 28 28 28 28 28 28 28 28 28 28 28 28 28 28 28 28 28 27 27 27 27 27 27 28 28 28 28 28 28 28 28 28 28 28 28 28 29 29 29 29 29 29 29 29 30 30 30
6220C0%%%%%j%%%%%%%%%%%%%%%%%%%%%%%%%J%%%%%%%%%%%%%j%%%%%%%%%J%%j%%%%%%%%%%%
$$ 30 30 30 30 30 30 29 29 29 29 29 29 29 29 29 29 29 29 29 29 29 29 29 29 29 29 29 29 29 29 29 29 30 30 30 30 30 30 30 30 30 30 30 30 30 30 29 29 29 29 29 29 29 29 29 29 30 30 30 29 29 29 29 29 29 29 29 29 29 29 29
6172B9%%%%%%j%%%J%%%%%%%%%%%%%%%%%%%%%%%%%%%%%%%%%%%%%%%%%%%%%%%%J%%j%%%%%%%
$$ 29 29 29 29 29 29 29 28 28 28 28 29 29 29 29 29 29 29 29 29 29 29 29 29 29 29 29 29 29 29 29 29 29 29 29 29 29 29 29 29 29 29 29 29 29 29 29 29 29 29 29 29 29 29 29 29 29 29 29 29 30 30 30 29 29 29 29 29 29 29 29
6123B9%%%%%J%%%%%%%%%j%%%%%%%%%%J%%%j%%%%%%%J%%%%%%j%%%%%%%%%J%%%%%%%%%%%%%%
$$ 29 29 29 29 29 29 30 30 30 30 30 30 30 30 30 30 29 29 29 29 29 29 29 29 29 29 29 30 30 30 30 29 29 29 29 29 29 29 29 30 30 30 30 30 30 30 29 29 29 29 29 29 29 29 29 29 30 30 30 30 30 30 30 30 30 30 30 30 30 30 30
6075C0%%%%%%j%%%%J%%%%%%%%%J%%%%j%%%%%%%%%J%%%%%%%%%%%%%%%%%%%%%%%%%%%%%j%%%
$$ 30 30 30 30 30 30 30 29 29 29 29 29 30 30 30 30 30 30 30 30 30 30 31 31 31 31 31 30 30 30 30 30 30 30 30 30 30 31 31 31 31 31 31 31 31 31 31 31 31 31 31 31 31 31 31 31 31 31 31 31 31 31 31 31 31 31 31 30 30 30 30
6026C0%%%%%%%%%%%%%J%%%%%%j%%%%%%%%%%%%%%j%%J%%%%%%%%%%%%%%%%%%%J%%%%%%%%%%%
$$ 30 30 30 30 30 30 30 30 30 30 30 30 30 30 31 31 31 31 31 31 31 30 30 30 30 30 30 30 30 30 30 30 30 30 30 30 29 29 29 30 30 30 30 30 30 30 30 30 30 30 30 30 30 30 30 30 30 30 30 31 31 31 31 31 31 31 31 31 31 31 31
5977C1%%%%%%J%%%%%%%%%j%%%J%%%%%%%%%%%%j%%%%%%%%%%j%%%%%%J%%%%%%%%%%%%%%%%%%
$$ 31 31 31 31 31 31 31 32 32 32 32 32 32 32 32 32 32 31 31 31 31 32 32 32 32 32 32 32 32 32 32 32 32 32 31 31 31 31 31 31 31 31 31 31 31 30 30 30 30 30 30 30 31 31 31 31 31 31 31 31 31 31 31 31 31 31 31 31 31 31 31
5929C1%%%%%%%%J%%%%%j%%%%%%%%%%%J%%%%%%%j%%%%%%%%%%%%%%%%%%%%%%%%%J%%%%%%%%%
$$ 31 31 31 31 31 31 31 31 31 32 32 32 32 32 32 31 31 31 31 31 31 31 31 31 31 31 31 32 32 32 32 32 32 32 32 31 31 31 31 31 31 31 31 31 31 31 31 31 31 31 31 31 31 31 31 31 31 31 31 31 31 32 32 32 32 32 32 32 32 32 32
5880C2%%%%%%%%%%%%%%%%%%%%J%%%j%%%%%%%%%%%%%%%%%%%%%%%%%%%%j%%%%%%%%J%%%%%%%
$$ 32 32 32 32 32 32 32 32 32 32 32 32 32 32 32 32 32 32 32 32 32 33 33 33 33 32 32 32 32 32 32 32 32 32 32 32 32 32 32 32 32 32 32 32 32 32 32 32 32 32 32 32 32 32 31 31 31 31 31 31 31 31 31 32 32 32 32 32 32 32 32
5832C2%%%%%%j%%%%%%%%J%%%%%J%%j%%%%%%%%%%%%%%%%%%j%%%%%%%J%%%%J%%%%%%%%%%%%%
$$ 32 32 32 32 32 32 32 31 31 31 31 31 31 31 31 31 32 32 32 32 32 32 33 33 33 32 32 32 32 32 32 32 32 32 32 32 32 32 32 32 32 32 32 32 31 31 31 31 31 31 31 31 32 32 32 32 32 33 33 33 33 33 33 33 33 33 33 33 33 33 33
5783C3%%%%%%%%%%%%%%%%%%%%%%%j%%%%%%%%%%%%%%%%%%%%%%%%%J%%%%%%%%%%%%%%%%%%%%
$$ 33 33 33 33 33 33 33 33 33 33 33 33 33 33 33 33 33 33 33 33 33 33 33 33 32 32 32 32 32 32 32 32 32 32 32 32 32 32 32 32 32 32 32 32 32 32 32 32 32 32 33 33 33 33 33 33 33 33 33 33 33 33 33 33 33 33 33 33 33 33 33
5735C3%%%Jj%%%%%%%%%%%%%%%%%%%Jj%%%%%J%%%%%j%J%%%%%%%%%%%%%%J%%%%%j%%J%%%%%%
$$ 33 33 33 33 34 33 33 33 33 33 33 33 33 33 33 33 33 33 33 33 33 33 33 33 33 34 33 33 33 33 33 33 34 34 34 34 34 34 33 33 34 34 34 34 34 34 34 34 34 34 34 34 34 34 34 35 35 35 35 35 35 34 34 34 35 35 35 35 35 35 35
5686C5%%%%%%j%J%%%%%%%%%%%%%%%%%%%%%%%%%%%%%%%%%%%j%%%%%%%%%%%%%%J%%%%%%%%%%
$$ 35 35 35 35 35 35 35 34 34 35 35 35 35 35 35 35 35 35 35 35 35 35 35 35 35 35 35 35 35 35 35 35 35 35 35 35 35 35 35 35 35 35 35 35 35 34 34 34 34 34 34 34 34 34 34 34 34 34 34 34 35 35 35 35 35 35 35 35 35 35 35
5638C5%%%%%%%%%%%J%%j%%%%%%%%%%J%%%%j%%%%%%%%%%%%%%J%%%%%%%%%%%%j%%j%%%%J%%%
$$ 35 35 35 35 35 35 35 35 35 35 35 35 36 36 36 35 35 35 35 35 35 35 35 35 35 35 36 36 36 36 36 35 35 35 35 35 35 35 35 35 35 35 35 35 35 35 36 36 36 36 36 36 36 36 36 36 36 36 36 35 35 35 34 34 34 34 34 35 35 35 35
5589C5%%%%%%%%%%%%%%%j%%%%%%%J%%%%%%%%%%%%J%%%%%%j%%%j%%%%%%%J%%J%%%%%%%%%%%
$$ 35 35 35 35 35 35 35 35 35 35 35 35 35 35 35 35 34 34 34 34 34 34 34 34 35 35 35 35 35 35 35 35 35 35 35 35 35 36 36 36 36 36 36 36 35 35 35 35 34 34 34 34 34 34 34 34 35 35 35 36 36 36 36 36 36 36 36 36 36 36 36
5540C6%%%%%%%%%%%%%%%%%%%%%%%%%%%%%%%%%j%%%%%%%%J%%%%J%%%%%%%%j%%%%%%%%%%%%%
$$ 36 36 36 36 36 36 36 36 36 36 36 36 36 36 36 36 36 36 36 36 36 36 36 36 36 36 36 36 36 36 36 36 36 36 35 35 35 35 35 35 35 35 35 36 36 36 36 36 37 37 37 37 37 37 37 37 37 36 36 36 36 36 36 36 36 36 36 36 36 36 36
5492C6%%%%%%%%J%%%%%%%%%j%%%%%%%%%J%%%%%%%J%%j%%%%%%%%j%%%J%%%%%%%%%%%%%%%%%
$$ 36 36 36 36 36 36 36 36 36 37 37 37 37 37 37 37 37 37 37 36 36 36 36 36 36 36 36 36 36 37 37 37 37 37 37 37 37 38 38 38 37 37 37 37 37 37 37 37 37 36 36 36 36 37 37 37 37 37 37 37 37 37 37 37 37 37 37 37 37 37 37
5443C7%%%%%%%%%%%%%%%%%J%%%%%%%%%%%%%%J%%j%%%%%Jj%%%%%%%%%%%%%%J%%%%%%%%%%%j
$$ 37 37 37 37 37 37 37 37 37 37 37 37 37 37 37 37 37 37 38 38 38 38 38 38 38 38 38 38 38 38 38 38 38 39 39 39 38 38 38 38 38 38 39 38 38 38 38 38 38 38 38 38 38 38 38 38 38 38 39 39 39 39 39 39 39 39 39 39 39 39 38
5395C8%%%%%%%%J%%%%%j%%%%%%%%%%%%%%%%%%%%J%%%%%J%%%%j%%%%J%%%j%%%%%%%%%%%%%%
$$ 38 38 38 38 38 38 38 38 38 39 39 39 39 39 39 38 38 38 38 38 38 38 38 38 38 38 38 38 38 38 38 38 38 38 38 38 39 39 39 39 39 39 40 40 40 40 40 39 39 39 39 39 40 40 40 40 39 39 39 39 39 39 39 39 39 39 39 39 39 39 39
5346C9%%%%%J%%%%%%%%%%%%%%%J%%%%%%%j%%%%%%%%%%%%%%%%JjJ%j%%%%%%%%%%%%%%%%%%%
$$ 39 39 39 39 39 39 40 40 40 40 40 40 40 40 40 40 40 40 40 40 40 40 41 41 41 41 41 41 41 41 40 40 40 40 40 40 40 40 40 40 40 40 40 40 40 40 40 41 40 41 41 40 40 40 40 40 40 40 40 40 40 40 40 40 40 40 40 40 40 40 40
5298D0%%J%%%%%%%%%%%j%%%%J%%%%%%%Jj%%%%%%%%%%%%%%%%%%%%%%%%%%%%%%%%%%%%%J%%%
$$ 40 40 40 41 41 41 41 41 41 41 41 41 41 41 41 40 40 40 40 40 41 41 41 41 41 41 41 41 42 41 41 41 41 41 41 41 41 41 41 41 41 41 41 41 41 41 41 41 41 41 41 41 41 41 41 41 41 41 41 41 41 41 41 41 41 41 41 42 42 42 42
5249D2%%%J%%%%%%%%%%%%j%%%j%%%%%%%J%%%%%%%%%%%%%%%%%%%%%%%%%%%%%%J%%%%%%%%%%
$$ 42 42 42 42 43 43 43 43 43 43 43 43 43 43 43 43 43 42 42 42 42 41 41 41 41 41 41 41 41 42 42 42 42 42 42 42 42 42 42 42 42 42 42 42 42 42 42 42 42 42 42 42 42 42 42 42 42 42 42 42 43 43 43 43 43 43 43 43 43 43 43
5201D3%%%%%%%%%%%%%%%%%%%%%%%%J%%%%%%%%%%%%%%%%J%%%%%j%%%%%%%%%%%%%%%%%%%%%J
$$ 43 43 43 43 43 43 43 43 43 43 43 43 43 43 43 43 43 43 43 43 43 43 43 43 43 44 44 44 44 44 44 44 44 44 44 44 44 44 44 44 44 44 45 45 45 45 45 45 44 44 44 44 44 44 44 44 44 44 44 44 44 44 44 44 44 44 44 44 44 44 45
5152D5%%%%%%%%j%%%J%%%%%%%%%%%%%%%%j%%%%%%%%%%J%%%%%%%%%%%%%%%%%%%%%%%%%J%%%
$$ 45 45 45 45 45 45 45 45 45 44 44 44 44 45 45 45 45 45 45 45 45 45 45 45 45 45 45 45 45 45 44 44 44 44 44 44 44 44 44 44 44 45 45 45 45 45 45 45 45 45 45 45 45 45 45 45 45 45 45 45 45 45 45 45 45 45 45 46 46 46 46
5103D6j%%%%%%%%%%J%%%%%%%%%%%%%%%%%%%Jj%%%%%%%%%%%%%%%%%%%J%%j%%%%J%%j%%J%%%
$$ 46 45 45 45 45 45 45 45 45 45 45 45 46 46 46 46 46 46 46 46 46 46 46 46 46 46 46 46 46 46 46 46 47 46 46 46 46 46 46 46 46 46 46 46 46 46 46 46 46 46 46 46 46 47 47 47 46 46 46 46 46 47 47 47 46 46 46 47 47 47 47
5055D7%J%%%%%%J%%j%%%%%%j%%J%%%%%%%%%%%%%%%%%%%Jj%%%%%%%%%%%%%%%%%%J%%%%j%J%
$$ 47 47 48 48 48 48 48 48 48 49 49 49 48 48 48 48 48 48 48 47 47 47 48 48 48 48 48 48 48 48 48 48 48 48 48 48 48 48 48 48 48 48 49 48 48 48 48 48 48 48 48 48 48 48 48 48 48 48 48 48 48 48 49 49 49 49 49 48 48 49 49
5006D9%%%%J%%%%j%%%%%%%%%%%%%%%%%%%%%%%%%Jj%%%%%%%%%%%J%%%%%%%%%%%%%%%%%%%%J
$$ 49 49 49 49 49 50 50 50 50 50 49 49 49 49 49 49 49 49 49 49 49 49 49 49 49 49 49 49 49 49 49 49 49 49 49 49 50 49 49 49 49 49 49 49 49 49 49 49 49 50 50 50 50 50 50 50 50 50 50 50 50 50 50 50 50 50 50 50 50 50 51
4958E1%%%%%%%%%%%%%%%J%%%%%%%%%%%%%%%J%%%%%%%%%%%jJ%%%%%%%%%%%%%%%%%%%%%%%%%
$$ 51 51 51 51 51 51 51 51 51 51 51 51 51 51 51 51 52 52 52 52 52 52 52 52 52 52 52 52 52 52 52 52 53 53 53 53 53 53 53 53 53 53 53 53 52 53 53 53 53 53 53 53 53 53 53 53 53 53 53 53 53 53 53 53 53 53 53 53 53 53 53
4909E3%%%%%%%%%%%%%%%%j%%%%%%J%%%J%%J%%j%%j%%%%%%%%%%%%%%%%%J%%%%%%j%%%%J%%J
$$ 53 53 53 53 53 53 53 53 53 53 53 53 53 53 53 53 53 52 52 52 52 52 52 52 53 53 53 53 54 54 54 55 55 55 54 54 54 53 53 53 53 53 53 53 53 53 53 53 53 53 53 53 53 53 53 54 54 54 54 54 54 54 53 53 53 53 53 54 54 54 55
4861E5%%%%%%%%%%%%%%%%%%J%%%%%%%%%%%%%%%%%%%%%%%%%%%%%%%j%%%%%J%%%%%%%%%%%%%
$$ 55 55 55 55 55 55 55 55 55 55 55 55 55 55 55 55 55 55 55 56 56 56 56 56 56 56 56 56 56 56 56 56 56 56 56 56 56 56 56 56 56 56 56 56 56 56 56 56 56 56 56 55 55 55 55 55 55 56 56 56 56 56 56 56 56 56 56 56 56 56 56
4812E6%%%%%%%J%%%%%%%%%%%%%%%%%%%%%%%%%%%%%%J%%%%%%%%%%%%%%%%J%%%%%j%%%%%%%%
$$ 56 56 56 56 56 56 56 56 57 57 57 57 57 57 57 57 57 57 57 57 57 57 57 57 57 57 57 57 57 57 57 57 57 57 57 57 57 57 57 58 58 58 58 58 58 58 58 58 58 58 58 58 58 58 58 58 59 59 59 59 59 59 58 58 58 58 58 58 58 58 58
4764E8%%%%%%%%%%%%%%%%%J%%%%%%%%%%%%%%%%J%%%%%%%%%%%%%%%%%%%%%j%%%%%J%%%%%%%
$$ 58 58 58 58 58 58 58 58 58 58 58 58 58 58 58 58 58 58 59 59 59 59 59 59 59 59 59 59 59 59 59 59 59 59 59 60 60 60 60 60 60 60 60 60 60 60 60 60 60 60 60 60 60 60 60 60 60 59 59 59 59 59 59 60 60 60 60 60 60 60 60
4715F0%%%%%%%%%J%%%%%%%%%%%%J%%%%%%%%%%%%%%%%%%J%%%%%%%%%%%%%%%%%%%j%%%%J%%%
$$ 60 60 60 60 60 60 60 60 60 60 61 61 61 61 61 61 61 61 61 61 61 61 61 62 62 62 62 62 62 62 62 62 62 62 62 62 62 62 62 62 62 62 63 63 63 63 63 63 63 63 63 63 63 63 63 63 63 63 63 63 63 63 62 62 62 62 62 63 63 63 63
4667F3%%%%%%j%%%%%%%%%%%%%J%%J%j%%%%%%%%%%%%%%%%j%%%%%%%%%%J%%%%%%J%%%%%%%%J
$$ 63 63 63 63 63 63 63 62 62 62 62 62 62 62 62 62 62 62 62 62 62 63 63 63 64 64 63 63 63 63 63 63 63 63 63 63 63 63 63 63 63 63 63 62 62 62 62 62 62 62 62 62 62 62 63 63 63 63 63 63 63 64 64 64 64 64 64 64 64 64 65
4618F5j%%%%%%%%%%%%%%%%%%J%%%%%%%%%%%%%%%%%%%%%%%%%%%%%%%%%%%%%%%%%%%%%%%J%%
$$ 65 64 64 64 64 64 64 64 64 64 64 64 64 64 64 64 64 64 64 64 65 65 65 65 65 65 65 65 65 65 65 65 65 65 65 65 65 65 65 65 65 65 65 65 65 65 65 65 65 65 65 65 65 65 65 65 65 65 65 65 65 65 65 65 65 65 65 65 66 66 66
4569F6%%%%%%%%j%%%J%%%%j%%%%j%J%%%%%%%%%%%%J%%%%%%%%%%%%%j%%%%%%%%%%J%%%%j%%
$$ 66 66 66 66 66 66 66 66 66 65 65 65 65 66 66 66 66 66 65 65 65 65 65 64 64 65 65 65 65 65 65 65 65 65 65 65 65 65 66 66 66 66 66 66 66 66 66 66 66 66 66 66 65 65 65 65 65 65 65 65 65 65 65 66 66 66 66 66 65 65 65
4521F5%%%J%%%%%%%%%%j%%J%%%%%%%Jj%%%%%%%%%%%%%%%%%%%%%%%%%%Jj%%%j%%%%%%%%Jj%
$$ 65 65 65 65 66 66 66 66 66 66 66 66 66 66 66 65 65 65 66 66 66 66 66 66 66 66 67 66 66 66 66 66 66 66 66 66 66 66 66 66 66 66 66 66 66 66 66 66 66 66 66 66 66 66 67 66 66 66 66 65 65 65 65 65 65 65 65 65 66 65 65
4472F5%%%%%%%%%%%%%%%%%%%%%%%%%%%%%%%%%%j%%%%%%%%%%%%%J%%%%%%%%%%%j%%%%%%%%%
$$ 65 65 65 65 65 65 65 65 65 65 65 65 65 65 65 65 65 65 65 65 65 65 65 65 65 65 65 65 65 65 65 65 65 65 65 64 64 64 64 64 64 64 64 64 64 64 64 64 64 65 65 65 65 65 65 65 65 65 65 65 65 64 64 64 64 64 64 64 64 64 64
4424F4%%%Jj%%%%%%%%%%%%%%%%%%%%%%%%%%j%%%%%%j%%%%%%%J%%%%%j%%%%%j%%%%%%%%%%%
$$ 64 64 64 64 65 64 64 64 64 64 64 64 64 64 64 64 64 64 64 64 64 64 64 64 64 64 64 64 64 64 64 64 63 63 63 63 63 63 63 62 62 62 62 62 62 62 62 63 63 63 63 63 63 62 62 62 62 62 62 61 61 61 61 61 61 61 61 61 61 61 61
4375F1%%%%%%%%%%%%%%%%%%j%%%%%%%%%%%%%%%%%%%%%%%%%%%%%%j%%%%%%%%%%%%%j%%%%%%
$$ 61 61 61 61 61 61 61 61 61 61 61 61 61 61 61 61 61 61 61 60 60 60 60 60 60 60 60 60 60 60 60 60 60 60 60 60 60 60 60 60 60 60 60 60 60 60 60 60 60 60 59 59 59 59 59 59 59 59 59 59 59 59 59 59 58 58 58 58 58 58 58
4327E8%%%%%%%J%%%%j%%%%%%%%%%%j%%%%%%%%%%%%%%%%j%%%%%j%%%%J%%%%%%j%%%%%%%%j%
$$ 58 58 58 58 58 58 58 58 59 59 59 59 59 58 58 58 58 58 58 58 58 58 58 58 58 57 57 57 57 57 57 57 57 57 57 57 57 57 57 57 57 57 56 56 56 56 56 56 55 55 55 55 55 56 56 56 56 56 56 56 55 55 55 55 55 55 55 55 55 54 54
4278E4%%%%%%%%%%%%%%j%%%%%%j%%%%%%%%%j%%%%%%%%%%%%%%%%J%%%j%%%%%%%j%%%%%%%%%
$$ 54 54 54 54 54 54 54 54 54 54 54 54 54 54 54 53 53 53 53 53 53 53 52 52 52 52 52 52 52 52 52 52 51 51 51 51 51 51 51 51 51 51 51 51 51 51 51 51 51 52 52 52 52 51 51 51 51 51 51 51 51 50 50 50 50 50 50 50 50 50 50
4230E0%%%%%%%%%%j%%%%%%%%%%j%%%%%%%%%%%j%%%%%%%%%%%%j%J%%%%%%%%%%%%%%%j%%%%j
$$ 50 50 50 50 50 50 50 50 50 50 50 49 49 49 49 49 49 49 49 49 49 49 48 48 48 48 48 48 48 48 48 48 48 48 47 47 47 47 47 47 47 47 47 47 47 47 47 46 46 47 47 47 47 47 47 47 47 47 47 47 47 47 47 47 47 46 46 46 46 46 45
4181D5%%%%%J%%%%%%%j%%%%%j%%%j%%%%%%%%%%%%%%%%%%%%%%%%%%%%%%%%%%j%%%%j%%%%%%
$$ 45 45 45 45 45 45 46 46 46 46 46 46 46 46 45 45 45 45 45 45 44 44 44 44 43 43 43 43 43 43 43 43 43 43 43 43 43 43 43 43 43 43 43 43 43 43 43 43 43 43 43 43 43 43 43 43 43 43 43 42 42 42 42 42 41 41 41 41 41 41 41
4132D1%%%%%%%%j%%%%%j%%%%%%%J%%%%%%j%%%%%%%%%%%%%%%%%%%%%%%%%%%%%%j%%%%%%j%%
$$ 41 41 41 41 41 41 41 41 41 40 40 40 40 40 40 39 39 39 39 39 39 39 39 40 40 40 40 40 40 40 39 39 39 39 39 39 39 39 39 39 39 39 39 39 39 39 39 39 39 39 39 39 39 39 39 39 39 39 39 39 39 38 38 38 38 38 38 38 37 37 37
4084C7%%%%%%%%%%%%%%%%%%j%%%%%%%%%%%%%%%%%%%%%%%%%%%j%%%%%%%%%j%%%%%%%%%%%%%
$$ 37 37 37 37 37 37 37 37 37 37 37 37 37 37 37 37 37 37 37 36 36 36 36 36 36 36 36 36 36 36 36 36 36 36 36 36 36 36 36 36 36 36 36 36 36 36 36 35 35 35 35 35 35 35 35 35 35 34 34 34 34 34 34 34 34 34 34 34 34 34 34
4035C4%%%%%%%%%%%%%%%%%%%%%%%%%%%%%%j%%%j%%%%%%%%%J%%%%%%%%%%J%j%%%%%%j%%%%%
$$ 34 34 34 34 34 34 34 34 34 34 34 34 34 34 34 34 34 34 34 34 34 34 34 34 34 34 34 34 34 34 34 33 33 33 33 32 32 32 32 32 32 32 32 32 32 33 33 33 33 33 33 33 33 33 33 33 34 34 33 33 33 33 33 33 33 32 32 32 32 32 32
3987C2j%%%J%%%%j%%%%%%%%%%%%%%%%%%%%%%%%%%%%%%%%%%%%j%%%%%%%%%%%%%%%%%%%j%%%
$$ 32 31 31 31 31 32 32 32 32 32 31 31 31 31 31 31 31 31 31 31 31 31 31 31 31 31 31 31 31 31 31 31 31 31 31 31 31 31 31 31 31 31 31 31 31 31 31 30 30 30 30 30 30 30 30 30 30 30 30 30 30 30 30 30 30 30 30 29 29 29 29
3938B9%%%%%j%%%j%%%%%%%%J%%%%%%%%%%%%%%%%%%%%%%%%%%%j%%%%%%%%%%%%%%%%%j%%%%%
$$ 29 29 29 29 29 29 28 28 28 28 27 27 27 27 27 27 27 27 27 28 28 28 28 28 28 28 28 28 28 28 28 28 28 28 28 28 28 28 28 28 28 28 28 28 28 28 28 27 27 27 27 27 27 27 27 27 27 27 27 27 27 27 27 27 27 26 26 26 26 26 26
3890B6%%%%%%%%%%%%%%%%%%%J%%j%%%%j%%%J%%%%%%%%%%%%%%%%%%%%%%%%%%%%%%%%%%%j%%
$$ 26 26 26 26 26 26 26 26 26 26 26 26 26 26 26 26 26 26 26 26 27 27 27 26 26 26 26 26 25 25 25 25 26 26 26 26 26 26 26 26 26 26 26 26 26 26 26 26 26 26 26 26 26 26 26 26 26 26 26 26 26 26 26 26 26 26 26 26 25 25 25
3841B5%%%%%%%%%%%%%%%%%%%%%%%%%%%%%J%%%%%%%%j%%%%%%%%j%%%%%%%%J%%%%%%%j%%%%%
$$ 25 25 25 25 25 25 25 25 25 25 25 25 25 25 25 25 25 25 25 25 25 25 25 25 25 25 25 25 25 25 26 26 26 26 26 26 26 26 26 25 25 25 25 25 25 25 25 25 24 24 24 24 24 24 24 24 24 25 25 25 25 25 25 25 25 24 24 24 24 24 24
3793B4%j%%%%%%%%%%%%J%%%%%%%%%%%%%%J%%%%%%%%%%%%%%j%%%%%%j%%J%%%%%%%%%%%%%%%
$$ 24 24 23 23 23 23 23 23 23 23 23 23 23 23 23 24 24 24 24 24 24 24 24 24 24 24 24 24 24 24 25 25 25 25 25 25 25 25 25 25 25 25 25 25 25 24 24 24 24 24 24 24 23 23 23 24 24 24 24 24 24 24 24 24 24 24 24 24 24 24 24
3744B4%%%j%%%%%J%%%%%%%%%%%%%%%%j%%%%%%J%%%j%%%%%%%%%%%J%%%%%%%j%%%j%%%%%%%J
$$ 24 24 24 24 23 23 23 23 23 23 24 24 24 24 24 24 24 24 24 24 24 24 24 24 24 24 24 23 23 23 23 23 23 23 24 24 24 24 23 23 23 23 23 23 23 23 23 23 23 23 24 24 24 24 24 24 24 24 23 23 23 23 22 22 22 22 22 22 22 22 23
3696B3%%j%%%%%%%%%%%%%%%%%%%%j%%%%%J%%%%%%%%%%%%%%%%%%%%%j%%%%%%%%%%%%%%%%%%
$$ 23 23 23 22 22 22 22 22 22 22 22 22 22 22 22 22 22 22 22 22 22 22 22 22 21 21 21 21 21 21 22 22 22 22 22 22 22 22 22 22 22 22 22 22 22 22 22 22 22 22 22 22 21 21 21 21 21 21 21 21 21 21 21 21 21 21 21 21 21 21 21
3647B1%%%%%%%%%%%%%%%%%%%%%%%%%%%%%j%%%J%%%%%J%%%%%j%%%%%%%%%%%%%%%%%j%%%%%J
$$ 21 21 21 21 21 21 21 21 21 21 21 21 21 21 21 21 21 21 21 21 21 21 21 21 21 21 21 21 21 21 20 20 20 20 21 21 21 21 21 21 22 22 22 22 22 22 21 21 21 21 21 21 21 21 21 21 21 21 21 21 21 21 21 21 20 20 20 20 20 20 21
3598B1%j%%%%%%%jJ%%%%%%J%%%%%%%%%%%%%%%%%%%%%%%%%%%%%%%%%%%%j%%%%J%%%%%%Jj%%
$$ 21 21 20 20 20 20 20 20 20 20 19 20 20 20 20 20 20 20 21 21 21 21 21 21 21 21 21 21 21 21 21 21 21 21 21 21 21 21 21 21 21 21 21 21 21 21 21 21 21 21 21 21 21 21 21 20 20 20 20 20 21 21 21 21 21 21 21 22 21 21 21
3550B1%%%%%%%%%%%%%%%%%%%%J%%%%%%j%%%%%%%%%%j%%%%%%%%%%%%%%%%%J%%%j%%%%%%%%%
$$ 21 21 21 21 21 21 21 21 21 21 21 21 21 21 21 21 21 21 21 21 21 22 22 22 22 22 22 22 21 21 21 21 21 21 21 21 21 21 21 20 20 20 20 20 20 20 20 20 20 20 20 20 20 20 20 20 20 21 21 21 21 20 20 20 20 20 20 20 20 20 20
3501B0%%%%%%%%%%%%%%J%%%%%%%%%%%%%%%%%%%j%%%%%%%%%%%%%%%%%%%%%%%%%%%%%%%%%%J
$$ 20 20 20 20 20 20 20 20 20 20 20 20 20 20 20 21 21 21 21 21 21 21 21 21 21 21 21 21 21 21 21 21 21 21 21 20 20 20 20 20 20 20 20 20 20 20 20 20 20 20 20 20 20 20 20 20 20 20 20 20 20 20 20 20 20 20 20 20 20 20 21
3453B1%%%j%%%%j%%%%%%%J%%%%%%%%%%%%%%%%%%jJ%%%%J%%%j%%%%%%%%%%%j%%%%%%J%%%%%
$$ 21 21 21 21 20 20 20 20 20 19 19 19 19 19 19 19 19 20 20 20 20 20 20 20 20 20 20 20 20 20 20 20 20 20 20 20 19 20 20 20 20 20 21 21 21 21 20 20 20 20 20 20 20 20 20 20 20 20 19 19 19 19 19 19 19 20 20 20 20 20 20
3404B0%%%%%%%%%%%%%%%%%%%%%%%%%%%%%%%%%%%%%%%%%%J%%%%%%%%%%%%%%%%%%%%%%%%%%%
$$ 20 20 20 20 20 20 20 20 20 20 20 20 20 20 20 20 20 20 20 20 20 20 20 20 20 20 20 20 20 20 20 20 20 20 20 20 20 20 20 20 20 20 20 21 21 21 21 21 21 21 21 21 21 21 21 21 21 21 21 21 21 21 21 21 21 21 21 21 21 21 21
3356B1%%%%%jJ%%%j%%%%%%%%%%%j%%%%%%%%%%%%%%%%%%%%%%%J%%%%%%%%%%%%%%%%%%%j%%%
$$ 21 21 21 21 21 21 20 21 21 21 21 20 20 20 20 20 20 20 20 20 20 20 20 19 19 19 19 19 19 19 19 19 19 19 19 19 19 19 19 19 19 19 19 19 19 19 19 20 20 20 20 20 20 20 20 20 20 20 20 20 20 20 20 20 20 20 20 19 19 19 19
3307A9%%%%%%%%%%j%%%%%%%%%%J%%%%%%%%%%%%%%J%%%%%%%%%%%%%%%%%%%%%%%%%%%%%%%%%
$$ 19 19 19 19 19 19 19 19 19 19 19 18 18 18 18 18 18 18 18 18 18 18 19 19 19 19 19 19 19 19 19 19 19 19 19 19 19 20 20 20 20 20 20 20 20 20 20 20 20 20 20 20 20 20 20 20 20 20 20 20 20 20 20 20 20 20 20 20 20 20 20
3259B0%%%%%%%%%%%%%%%%%%%%%%%%%%%%j%%%J%%%%%%%%%%%%%%%%%%%%%%%%%%%%%%%%%%%%%
$$ 20 20 20 20 20 20 20 20 20 20 20 20 20 20 20 20 20 20 20 20 20 20 20 20 20 20 20 20 20 19 19 19 19 20 20 20 20 20 20 20 20 20 20 20 20 20 20 20 20 20 20 20 20 20 20 20 20 20 20 20 20 20 20 20 20 20 20 20 20 20 20
3210B0%%%%%j%%%%%%%%%%%%%%%J%%%%j%%%%%%%%%%%%%%%%%%J%%%%%%%%%%%%%%%j%%%%J%%%
$$ 20 20 20 20 20 20 19 19 19 19 19 19 19 19 19 19 19 19 19 19 19 19 20 20 20 20 20 19 19 19 19 19 19 19 19 19 19 19 19 19 19 19 19 19 19 19 20 20 20 20 20 20 20 20 20 20 20 20 20 20 20 20 19 19 19 19 19 20 20 20 20
3161B0j%%%%%%%%%%%%%%J%%%j%%%%%%%J%%%%%%%%%%%%%%j%%%J%%%%%%%%%%%%%%%%%%%%%%%
$$ 20 19 19 19 19 19 19 19 19 19 19 19 19 19 19 19 20 20 20 20 19 19 19 19 19 19 19 19 20 20 20 20 20 20 20 20 20 20 20 20 20 20 20 19 19 19 19 20 20 20 20 20 20 20 20 20 20 20 20 20 20 20 20 20 20 20 20 20 20 20 20
3113B0%%%%%%%%%%%%%%%%%%%%%%%%%%J%%%%%j%%%j%%%%%%%%%J%%%%%%%%%%%j%%%%J%%%%%J
$$ 20 20 20 20 20 20 20 20 20 20 20 20 20 20 20 20 20 20 20 20 20 20 20 20 20 20 20 21 21 21 21 21 21 20 20 20 20 19 19 19 19 19 19 19 19 19 19 20 20 20 20 20 20 20 20 20 20 20 20 19 19 19 19 19 20 20 20 20 20 20 21
3064B1%%%%%%%%%%%%j%%%%%%%%%%%%%%%%%%%%J%%%%%%%%%%%%j%%%j%%%J%%%%%%%%%%j%%%%
$$ 21 21 21 21 21 21 21 21 21 21 21 21 21 20 20 20 20 20 20 20 20 20 20 20 20 20 20 20 20 20 20 20 20 20 21 21 21 21 21 21 21 21 21 21 21 21 21 20 20 20 20 19 19 19 19 20 20 20 20 20 20 20 20 20 20 20 19 19 19 19 19
3016A9%%%%J%%%%%%%%%%%%%%%%Jj%%%%%%%%%%%%%%%%%%%%%%%%%%%%%%%%%%%%%%%%%%%%%%%
$$ 19 19 19 19 19 20 20 20 20 20 20 20 20 20 20 20 20 20 20 20 20 20 21 20 20 20 20 20 20 20 20 20 20 20 20 20 20 20 20 20 20 20 20 20 20 20 20 20 20 20 20 20 20 20 20 20 20 20 20 20 20 20 20 20 20 20 20 20 20 20 20
2967B0%%%%%%%%%%%%%%%%%%%%%%%%%%%%%%%%%%%%%%%%%%%J%%%%%%%%%%%%%%%%%%%%%%%%j%
$$ 20 20 20 20 20 20 20 20 20 20 20 20 20 20 20 20 20 20 20 20 20 20 20 20 20 20 20 20 20 20 20 20 20 20 20 20 20 20 20 20 20 20 20 20 21 21 21 21 21 21 21 21 21 21 21 21 21 21 21 21 21 21 21 21 21 21 21 21 21 20 20
2919B0%%%%%%%%%%%%%%%%%J%%%%j%%%%%%j%%J%%%%%J%%%%%%%%%%%%%%j%%%%%%%%%%%j%%%%
$$ 20 20 20 20 20 20 20 20 20 20 20 20 20 20 20 20 20 20 21 21 21 21 21 20 20 20 20 20 20 20 19 19 19 20 20 20 20 20 20 21 21 21 21 21 21 21 21 21 21 21 21 21 21 21 20 20 20 20 20 20 20 20 20 20 20 20 19 19 19 19 19
2870A9J%%%%%J%%%%%%%%%%%j%%%%%%%%%%%%%%%%%%%%%%%j%%%%%J%%%%%%%%%%%%%%%%%%%%%
$$ 19 20 20 20 20 20 20 21 21 21 21 21 21 21 21 21 21 21 21 20 20 20 20 20 20 20 20 20 20 20 20 20 20 20 20 20 20 20 20 20 20 20 20 19 19 19 19 19 19 20 20 20 20 20 20 20 20 20 20 20 20 20 20 20 20 20 20 20 20 20 20
2822B0%%%%%%%%j%%%%%J%%%%%%%%%%j%%%%%%J%%%j%%J%%%%%%%%%%%%%%%%J%j%%J%%%%%%%%
$$ 20 20 20 20 20 20 20 20 20 19 19 19 19 19 19 20 20 20 20 20 20 20 20 20 20 20 19 19 19 19 19 19 19 20 20 20 20 19 19 19 20 20 20 20 20 20 20 20 20 20 20 20 20 20 20 20 20 21 21 20 20 20 21 21 21 21 21 21 21 21 21
2773B1%%%%%%j%%%%%%%%%%%%%%%%%%%%%%%%%%%%%%j%%%%%%%%%%%%%%%%%J%%%%%%%%%%%%%%
$$ 21 21 21 21 21 21 21 20 20 20 20 20 20 20 20 20 20 20 20 20 20 20 20 20 20 20 20 20 20 20 20 20 20 20 20 20 20 20 19 19 19 19 19 19 19 19 19 19 19 19 19 19 19 19 19 19 20 20 20 20 20 20 20 20 20 20 20 20 20 20 20
2725B0%%%%%%%%%%%%J%%%%%j%%%%%%%%%%%%%%%%%%%%%%%%%%%%%%%%%%%%%%%%%%%%%J%%%%%
$$ 20 20 20 20 20 20 20 20 20 20 20 20 20 21 21 21 21 21 21 20 20 20 20 20 20 20 20 20 20 20 20 20 20 20 20 20 20 20 20 20 20 20 20 20 20 20 20 20 20 20 20 20 20 20 20 20 20 20 20 20 20 20 20 20 20 21 21 21 21 21 21
2676B1%%%%%%%%%%%%%%%%%%%%%%%%%%%%%%j%%%j%%%%%%%%J%%%%%%J%%%%%%%j%%%%%%%%%%%
$$ 21 21 21 21 21 21 21 21 21 21 21 21 21 21 21 21 21 21 21 21 21 21 21 21 21 21 21 21 21 21 21 20 20 20 20 19 19 19 19 19 19 19 19 19 20 20 20 20 20 20 20 21 21 21 21 21 21 21 21 20 20 20 20 20 20 20 20 20 20 20 20
2627B0%%J%%%%j%%%%%%%%%%%%%%%%%%%%%%%%%%%J%%%J%%j%%%%%%%%%%j%%%%%%J%%%%%%%%%
$$ 20 20 20 21 21 21 21 21 20 20 20 20 20 20 20 20 20 20 20 20 20 20 20 20 20 20 20 20 20 20 20 20 20 20 20 20 21 21 21 21 22 22 22 21 21 21 21 21 21 21 21 21 21 21 20 20 20 20 20 20 20 21 21 21 21 21 21 21 21 21 21
2579B1%%j%%J%%%%%%%%%%%%%%%j%%%%%%%%%%j%%J%%%%%%%%%%%%%%%%%%%%%%%%%%%%%%J%%%
$$ 21 21 21 20 20 20 21 21 21 21 21 21 21 21 21 21 21 21 21 21 21 21 20 20 20 20 20 20 20 20 20 20 20 19 19 19 20 20 20 20 20 20 20 20 20 20 20 20 20 20 20 20 20 20 20 20 20 20 20 20 20 20 20 20 20 20 20 21 21 21 21
2530B1%%%%%%%%%%j%%%%%%%%%%%%%%%%%%%%%%%%%%%%%%%%%%%%%%%%%%%%%%%%%%%%%%%%%%%
$$ 21 21 21 21 21 21 21 21 21 21 21 20 20 20 20 20 20 20 20 20 20 20 20 20 20 20 20 20 20 20 20 20 20 20 20 20 20 20 20 20 20 20 20 20 20 20 20 20 20 20 20 20 20 20 20 20 20 20 20 20 20 20 20 20 20 20 20 20 20 20 20
2482B0%%%%%%%%%%J%%%%%%j%%%%%%%J%%%%%%%%%%%%%%%jJ%%%%%%%%%%%%j%%%%%%%%%j%%%%
$$ 20 20 20 20 20 20 20 20 20 20 20 21 21 21 21 21 21 21 20 20 20 20 20 20 20 20 21 21 21 21 21 21 21 21 21 21 21 21 21 21 21 21 20 21 21 21 21 21 21 21 21 21 21 21 21 21 20 20 20 20 20 20 20 20 20 20 19 19 19 19 19
2433A9%%%%%%%%%%%%%%J%%%%%%%%%%%%%%%%%%%%%%%%%%%%%%%J%%%%%%%%%%j%%%%%%%%%%%%
$$ 19 19 19 19 19 19 19 19 19 19 19 19 19 19 19 20 20 20 20 20 20 20 20 20 20 20 20 20 20 20 20 20 20 20 20 20 20 20 20 20 20 20 20 20 20 20 20 21 21 21 21 21 21 21 21 21 21 21 20 20 20 20 20 20 20 20 20 20 20 20 20
2385B0%%%%%%%j%%%%%%%J%%%%%%%%%%%%%%%%%%%%%%%J%%%%%%%j%%%%%%%%%%%%%%%%%%%jJ%
$$ 20 20 20 20 20 20 20 20 19 19 19 19 19 19 19 19 20 20 20 20 20 20 20 20 20 20 20 20 20 20 20 20 20 20 20 20 20 20 20 20 21 21 21 21 21 21 21 21 20 20 20 20 20 20 20 20 20 20 20 20 20 20 20 20 20 20 20 20 19 20 20
2336B0%%%%%%%%%%%%%%%%%%%%%%%%%%%%%%%%%J%%%%%%%%%%j%%%%%J%%%%%j%%%%%%%%%%%J%
$$ 20 20 20 20 20 20 20 20 20 20 20 20 20 20 20 20 20 20 20 20 20 20 20 20 20 20 20 20 20 20 20 20 20 20 21 21 21 21 21 21 21 21 21 21 21 20 20 20 20 20 20 21 21 21 21 21 21 20 20 20 20 20 20 20 20 20 20 20 20 21 21
2288B1%%%%%%%%%%%%%%%%%%%%%%%%j%%%%%%%%%%%%%%%%%%%%J%%%%%%%j%%%%%%%%%%%%J%%%
$$ 21 21 21 21 21 21 21 21 21 21 21 21 21 21 21 21 21 21 21 21 21 21 21 21 21 20 20 20 20 20 20 20 20 20 20 20 20 20 20 20 20 20 20 20 20 20 21 21 21 21 21 21 21 21 20 20 20 20 20 20 20 20 20 20 20 20 20 21 21 21 21
2239B1%%j%J%%%%%j%%%%%%%J%%%%%%%%%%%%%%%%%%j%J%%%%%%%%%%%%%%%j%%%%%%J%%%%%J%
$$ 21 21 21 20 20 21 21 21 21 21 21 20 20 20 20 20 20 20 20 21 21 21 21 21 21 21 21 21 21 21 21 21 21 21 21 21 21 21 20 20 21 21 21 21 21 21 21 21 21 21 21 21 21 21 21 21 20 20 20 20 20 20 20 21 21 21 21 21 21 22 22
2190B2%%%%%j%%%j%%%J%%%%%%%%%%%%%%J%%%%%%%%j%%%j%%%%J%%%%%%%%%%j%%%J%%%%%%%%
$$ 22 22 22 22 22 22 21 21 21 21 20 20 20 20 21 21 21 21 21 21 21 21 21 21 21 21 21 21 21 22 22 22 22 22 22 22 22 22 21 21 21 21 20 20 20 20 20 21 21 21 21 21 21 21 21 21 21 21 20 20 20 20 21 21 21 21 21 21 21 21 21
2142B1%%%%%%%%%%%%%%%%%%%%%j%%%%%%%%%%%J%%%%%%%j%%%%%%%%%%%%%%%%%%%%%%%%J%%%
$$ 21 21 21 21 21 21 21 21 21 21 21 21 21 21 21 21 21 21 21 21 21 21 20 20 20 20 20 20 20 20 20 20 20 20 21 21 21 21 21 21 21 21 20 20 20 20 20 20 20 20 20 20 20 20 20 20 20 20 20 20 20 20 20 20 20 20 20 21 21 21 21
2093B1%%%%%%%%%%%%%%j%%%%%%%%%%%%%J%%%%j%%%%%%%%%%J%%%%%%%%%%%%%%%%j%%%%J%%%
$$ 21 21 21 21 21 21 21 21 21 21 21 21 21 21 21 20 20 20 20 20 20 20 20 20 20 20 20 20 20 21 21 21 21 21 20 20 20 20 20 20 20 20 20 20 20 21 21 21 21 21 21 21 21 21 21 21 21 21 21 21 21 21 20 20 20 20 20 21 21 21 21
2045B1%%%%%%%%%%%%%%%%%%%%%%J%%%%%j%%%%%%%%%%%%%%%%%%%%%%%%%%%%%%j%%%%%J%%%%
$$ 21 21 21 21 21 21 21 21 21 21 21 21 21 21 21 21 21 21 21 21 21 21 21 22 22 22 22 22 22 21 21 21 21 21 21 21 21 21 21 21 21 21 21 21 21 21 21 21 21 21 21 21 21 21 21 21 21 21 21 21 20 20 20 20 20 20 21 21 21 21 21
1996B1%%%%J%%%%j%%%%%%%%%%%%%%%%%%%%%%%%%%%%%%%%J%%%%%%%%%%%%%%%%%%%%j%%%%%%
$$ 21 21 21 21 21 22 22 22 22 22 21 21 21 21 21 21 21 21 21 21 21 21 21 21 21 21 21 21 21 21 21 21 21 21 21 21 21 21 21 21 21 21 21 22 22 22 22 22 22 22 22 22 22 22 22 22 22 22 22 22 22 22 22 22 21 21 21 21 21 21 21
1948B1%%%%J%%%%%j%%%%%j%%J%%%%%%%%%%%%%%%J%%%%%j%%%%%%%%%%j%%%%%%J%%%%%%%%%%
$$ 21 21 21 21 21 22 22 22 22 22 22 21 21 21 21 21 21 20 20 20 21 21 21 21 21 21 21 21 21 21 21 21 21 21 21 21 22 22 22 22 22 22 21 21 21 21 21 21 21 21 21 21 21 20 20 20 20 20 20 20 21 21 21 21 21 21 21 21 21 21 21
1899B1%%%%%%%%%%%%%%%%%%%%%%%%%%%%%%%%%%%%%J%%%%%%%%%%j%%%%%%%%%%%%%%%%%%%%%
$$ 21 21 21 21 21 21 21 21 21 21 21 21 21 21 21 21 21 21 21 21 21 21 21 21 21 21 21 21 21 21 21 21 21 21 21 21 21 21 22 22 22 22 22 22 22 22 22 22 22 21 21 21 21 21 21 21 21 21 21 21 21 21 21 21 21 21 21 21 21 21 21
1851B1%%%%%J%%%%%j%%%%%%%%%%%%%%%%%%%%%%%%%%%%%%%%%%%%%%%%%%J%%%%%%%%%%%j%%%
$$ 21 21 21 21 21 21 22 22 22 22 22 22 21 21 21 21 21 21 21 21 21 21 21 21 21 21 21 21 21 21 21 21 21 21 21 21 21 21 21 21 21 21 21 21 21 21 21 21 21 21 21 21 21 21 21 22 22 22 22 22 22 22 22 22 22 22 22 21 21 21 21
1802B1%%%%%%%%%J%%%%%%%%%%%%%j%J%%%%%%%%%%%%%%%%%%%%%%%%%%%%j%%%%%%%%J%%%%%%
$$ 21 21 21 21 21 21 21 21 21 21 22 22 22 22 22 22 22 22 22 22 22 22 22 22 21 21 22 22 22 22 22 22 22 22 22 22 22 22 22 22 22 22 22 22 22 22 22 22 22 22 22 22 22 22 22 21 21 21 21 21 21 21 21 21 22 22 22 22 22 22 22
1753B2%%%%%%j%%%%%%%%%%%%%%%%%%%%%%%%%%%%%%%%%%%%%%J%%%%%%%%%%%%%%%%%%%%%%%%
$$ 22 22 22 22 22 22 22 21 21 21 21 21 21 21 21 21 21 21 21 21 21 21 21 21 21 21 21 21 21 21 21 21 21 21 21 21 21 21 21 21 21 21 21 21 21 21 22 22 22 22 22 22 22 22 22 22 22 22 22 22 22 22 22 22 22 22 22 22 22 22 22
1705B2%%J%j%%%%%%%%%%%%%%%J%%%%%%%%j%%%%%%%%j%%%J%%%%%%%%%%J%j%%%%%%%%%%%%%j
$$ 22 22 22 23 23 22 22 22 22 22 22 22 22 22 22 22 22 22 22 22 22 23 23 23 23 23 23 23 23 23 22 22 22 22 22 22 22 22 22 21 21 21 21 22 22 22 22 22 22 22 22 22 22 22 23 23 22 22 22 22 22 22 22 22 22 22 22 22 22 22 21
1656B1%%%J%%%%%%%%%%%%%%J%%j%%%%j%%%%J%%j%%%%%%%%%j%%J%%%%%%J%%%%%%%%%%%%%%%
$$ 21 21 21 21 22 22 22 22 22 22 22 22 22 22 22 22 22 22 22 23 23 23 22 22 22 22 22 21 21 21 21 21 22 22 22 21 21 21 21 21 21 21 21 21 21 20 20 20 21 21 21 21 21 21 21 22 22 22 22 22 22 22 22 22 22 22 22 22 22 22 22
1608B2%%J%%%%%%%j%%%%%%%%%%J%%%%%%%%j%%%%%Jj%%%%%%%J%%%%%%%%J%%%%%%j%%%%%%%%
$$ 22 22 22 23 23 23 23 23 23 23 23 22 22 22 22 22 22 22 22 22 22 22 23 23 23 23 23 23 23 23 23 22 22 22 22 22 22 23 22 22 22 22 22 22 22 22 23 23 23 23 23 23 23 23 23 24 24 24 24 24 24 24 23 23 23 23 23 23 23 23 23
1559B3%%%j%%%%%%J%%%%%%%%%%%%%%%%j%%%%%%%%%%%%%%%%%%%J%%%%%%%%%%%%%%%%%%%%%%
$$ 23 23 23 23 22 22 22 22 22 22 22 23 23 23 23 23 23 23 23 23 23 23 23 23 23 23 23 23 22 22 22 22 22 22 22 22 22 22 22 22 22 22 22 22 22 22 22 22 23 23 23 23 23 23 23 23 23 23 23 23 23 23 23 23 23 23 23 23 23 23 23
1511B3%%%%%%%%%%%%%%%J%%%%%%%%%%%j%%%%%%%%%%J%%%%%%%%J%j%%%j%%%%%%%%%J%%%%%%
$$ 23 23 23 23 23 23 23 23 23 23 23 23 23 23 23 23 24 24 24 24 24 24 24 24 24 24 24 24 23 23 23 23 23 23 23 23 23 23 23 24 24 24 24 24 24 24 24 24 25 25 24 24 24 24 23 23 23 23 23 23 23 23 23 23 24 24 24 24 24 24 24
1462B4%%%%%J%%%%%%%%%%%%%%%%j%%%%%J%%%%%%%%%%j%%%%J%%j%%%%j%%%%%%%%%%%J%%%%%
$$ 24 24 24 24 24 24 25 25 25 25 25 25 25 25 25 25 25 25 25 25 25 25 25 24 24 24 24 24 24 25 25 25 25 25 25 25 25 25 25 25 24 24 24 24 24 25 25 25 24 24 24 24 24 23 23 23 23 23 23 23 23 23 23 23 23 24 24 24 24 24 24
1414B4%%%%%%%%%%%%%%%%%%%%%%%%%%%%%J%%%%%%%%%%%%%%%%%%%%%Jj%%%%%%%%%%J%%j%%J
$$ 24 24 24 24 24 24 24 24 24 24 24 24 24 24 24 24 24 24 24 24 24 24 24 24 24 24 24 24 24 24 25 25 25 25 25 25 25 25 25 25 25 25 25 25 25 25 25 25 25 25 25 25 26 25 25 25 25 25 25 25 25 25 25 25 26 26 26 25 25 25 26
1365B6%%%%%%%j%%J%%%%%%%%%%j%%%%%%%%%J%%%%%%%%%%%%%%%j%%%j%%%%%%J%%%%%%J%%%%
$$ 26 26 26 26 26 26 26 26 25 25 25 26 26 26 26 26 26 26 26 26 26 26 25 25 25 25 25 25 25 25 25 25 26 26 26 26 26 26 26 26 26 26 26 26 26 26 26 26 25 25 25 25 24 24 24 24 24 24 24 25 25 25 25 25 25 25 26 26 26 26 26
1317B6%%%%%J%%%%%%%j%%%%%%%J%%%%%%%%%%%%%%%%%%%%%%%%%%%%J%%%%%%%%%%%j%%%%%%%
$$ 26 26 26 26 26 26 27 27 27 27 27 27 27 27 26 26 26 26 26 26 26 26 27 27 27 27 27 27 27 27 27 27 27 27 27 27 27 27 27 27 27 27 27 27 27 27 27 27 27 27 27 28 28 28 28 28 28 28 28 28 28 28 28 27 27 27 27 27 27 27 27
1268B7J%%%%%%%%%%%%%%%%%%%%%J%%%%%%%%%%%%%%%%%%%%%%%%%%%%j%%%%%J%%%j%%%%%J%%
$$ 27 28 28 28 28 28 28 28 28 28 28 28 28 28 28 28 28 28 28 28 28 28 28 29 29 29 29 29 29 29 29 29 29 29 29 29 29 29 29 29 29 29 29 29 29 29 29 29 29 29 29 29 28 28 28 28 28 28 29 29 29 29 28 28 28 28 28 28 29 29 29
1219B9%%%%%%J%%J%%j%%%%%%%%J%%%%%j%%%%%%%%%J%%%%%%%%%%%%J%%%%jJ%%%%%%%%j%%%%
$$ 29 29 29 29 29 29 29 30 30 30 31 31 31 30 30 30 30 30 30 30 30 30 31 31 31 31 31 31 30 30 30 30 30 30 30 30 30 30 31 31 31 31 31 31 31 31 31 31 31 31 31 32 32 32 32 32 31 32 32 32 32 32 32 32 32 32 31 31 31 31 31
1171C1%%J%%%%%%J%j%%%%%%%%%%%J%%%%%%%%%%%%%%%J%%%%%%%%%%%%%%%%%%%%%%%%%J%%%%
$$ 31 31 31 32 32 32 32 32 32 32 33 33 32 32 32 32 32 32 32 32 32 32 32 32 33 33 33 33 33 33 33 33 33 33 33 33 33 33 33 33 34 34 34 34 34 34 34 34 34 34 34 34 34 34 34 34 34 34 34 34 34 34 34 34 34 34 35 35 35 35 35
1122C5%%%J%%%%%%%%%%%%%%%%%%%%%J%%%j%%%%%%J%%%%%%%%%%Jj%%%%%%%%%J%%%%%%%%%%%
$$ 35 35 35 35 36 36 36 36 36 36 36 36 36 36 36 36 36 36 36 36 36 36 36 36 36 36 37 37 37 37 36 36 36 36 36 36 36 37 37 37 37 37 37 37 37 37 37 37 38 37 37 37 37 37 37 37 37 37 37 38 38 38 38 38 38 38 38 38 38 38 38
1074C8%%%%%J%%%%%%J%%%%%%%%%%%%%J%%%%%%%%%%%%%%%%%%%%J%%%%%%%%%J%%%J%%%J%%%%
$$ 38 38 38 38 38 38 39 39 39 39 39 39 39 40 40 40 40 40 40 40 40 40 40 40 40 40 40 41 41 41 41 41 41 41 41 41 41 41 41 41 41 41 41 41 41 41 41 41 42 42 42 42 42 42 42 42 42 42 43 43 43 43 44 44 44 44 45 45 45 45 45
1025D5%%%%%%%%%%%%%%%%%J%%J%%%J%%%%%%%%%j%J%%%%J%%%%%J%%%%J%%%%J%%%%%%J%%%%%
$$ 45 45 45 45 45 45 45 45 45 45 45 45 45 45 45 45 45 45 46 46 46 47 47 47 47 48 48 48 48 48 48 48 48 48 48 47 47 48 48 48 48 48 49 49 49 49 49 49 50 50 50 50 50 51 51 51 51 51 52 52 52 52 52 52 52 53 53 53 53 53 53
977E3%%%%J%%%%%%%%%%J%%%%J%%%%%%%%J%%J%%J%%%%%%%%%%%%%%%J%%%J%J%%J%%%%%%%J%%
$$ 53 53 53 53 53 54 54 54 54 54 54 54 54 54 54 54 55 55 55 55 55 56 56 56 56 56 56 56 56 56 57 57 57 58 58 58 59 59 59 59 59 59 59 59 59 59 59 59 59 59 59 59 60 60 60 60 61 61 62 62 62 63 63 63 63 63 63 63 63 64 64 64
927F4%%%%%%J%%%J%J%J%%%J%%J%%J%%J%%%%%%%%%J%J%J%%J%%%%%%%%J%%J%%J%%J%%%%J%%J
$$ 64 64 64 64 64 64 64 65 65 65 65 66 66 67 67 68 68 68 68 69 69 69 70 70 70 71 71 71 72 72 72 72 72 72 72 72 72 72 73 73 74 74 75 75 75 76 76 76 76 76 76 76 76 76 77 77 77 78 78 78 79 79 79 80 80 80 80 80 81 81 81 82
878H2%%J%%%J%%%J%%J%%J%%%J%J%J%J%%J%%%%J%%J%J%%%J%%J%%J%JJ%J%%J%%J%%%J%J%J%J
$$ 82 82 82 83 83 83 83 84 84 84 84 85 85 85 86 86 86 87 87 87 87 88 88 89 89 90 90 91 91 91 92 92 92 92 92 93 93 93 94 94 95 95 95 95 96 96 96 97 97 97 98 98 99 100 100 101 101 101 102 102 102 103 103 103 103 104 104 105 105 106 106 107
829A07%J%%J%J%J%%%%J%J%J%JJ%J%J%J%%J%J%J%J%JJ%J%J%JJ%JJJ%JJ%JJ%J%%JJJ%JJJ%JJ
$$ 107 107 108 108 108 109 109 110 110 111 111 111 111 111 112 112 113 113 114 114 115 116 116 117 117 118 118 119 119 119 120 120 121 121 122 122 123 123 124 125 125 126 126 127 127 128 129 129 130 131 132 132 133 134 134 135 136 136 137 137 137 138 139 140 140 141 142 143 143 144 145
780A45J%JJJ%JJ%JJJJJJJJ%JJJK%JJJJJJ%JJJJJJJJJJJ%JJJJJJJKJJJJKJJKJJJJJJJJJJKJ
$$ 145 146 146 147 148 149 149 150 151 151 152 153 154 155 156 157 158 159 159 160 161 162 164 164 165 166 167 168 169 170 170 171 172 173 174 175 176 177 178 179 180 181 181 182 183 184 185 186 187 188 190 191 192 193 194 196 197 198 200 201 202 203 204 205 206 207 208 209 210 212 213
732B13KJJKJJJKJJJJKJKKJKJJKJKJKJKJKJKJKJKKJKKKJKKKKKJKKKKKKKKKKKKKKKKLKKKKKL
$$ 213 215 216 217 219 220 221 222 224 225 226 227 228 230 231 233 235 236 238 239 240 242 243 245 246 248 249 251 252 254 255 257 258 260 261 263 265 266 268 270 272 273 275 277 279 281 283 284 286 288 290 292 294 296 298 300 302 304 306 308 310 312 314 316 319 321 323 325 327 329 332
683C32KKLKLLKLKLKLLLLLLKLLMLLLLMLLMLLMLMLMMMMMMMNMMMNMNNMNNNNONNONOONOOPOOPO
$$ 332 334 336 339 341 344 347 349 352 354 357 359 362 365 368 371 374 377 379 382 385 389 392 395 398 401 405 408 411 415 418 421 425 428 432 435 439 443 447 451 455 459 463 468 472 476 480 485 489 494 499 503 508 513 518 523 529 534 539 545 550 556 562 567 573 579 586 592 598 605 611
635F11PPPPPQPQQPQQRQRQRRJ0RJ0J0J0J1J1J1J1J1J1J2J2J2J3J2J3J4J3J4J4J4J5J5J6J6J6
$$ 611 618 625 632 639 646 654 661 669 677 684 692 700 709 717 726 734 743 752 762 771 781 791 801 812 823 834 845 856 867 879 891 903 916 928 941 955 968 982 996 1010 1025 1040 1056 1072 1088
604A088J7J7J7J8J9J8K0J9K0K1K1K2K2K3K3K4K5K5K6K7K7K9K9K9L1L1L2L4L4L5L6L7L8L9M1
$$ 1088 1105 1122 1139 1157 1176 1194 1214 1233 1253 1274 1295 1317 1339 1362 1385 1409 1434 1459 1485 1512 1539 1568 1597 1626 1657 1688 1720 1754 1788 1823 1859 1896 1934 1973 2014
579B014M2M3M5M6M7M9N0N2N4N5N7N9O1O3O4O8O9P2P3P7P8Q1Q4Q6R0R2R4R8J01J03J07J10J12
$$ 2014 2056 2099 2144 2190 2237 2286 2336 2388 2442 2497 2554 2613 2674 2737 2801 2869 2938 3010 3083 3160 3238 3319 3403 3489 3579 3671 3765 3863 3964 4067 4174 4284 4396
556D396J16J19J22J24J28J30J32J34J37J38J39J41J41J42J40J40J38J36J33J29J25J19J14
$$ 4396 4512 4631 4753 4877 5005 5135 5267 5401 5538 5676 5815 5956 6097 6239 6379 6519 6657 6793 6926 7055 7180 7299 7413
540G413J07R9R2Q3P4O4N4M4L4K3J3Lpj7k5l4m2m9n6o2o6p2p5p8q1q3q4q5q5q5q4q3q1q1p8
$$ 7413 7520 7619 7711 7794 7868 7932 7986 8030 8064 8087 8100 8103 8096 8079 8054 8020 7978 7929 7873 7811 7745 7673 7598 7520 7439 7356 7272 7187 7102 7017 6933 6850 6769 6688 6610
516F610p6p4p1o8o6o3o0n7n3n0m6m3l9l5l1k7k3j9j4j0nJNJ1J7K4L0L7M6N3O2P2Q3R4J07J21
$$ 6610 6534 6460 6389 6321 6255 6192 6132 6075 6022 5972 5926 5883 5844 5809 5778 5751 5728 5709 5695 5685 5680 5681 5686 5697 5714 5738 5768 5805 5851 5904 5966 6038 6121 6215 6322 6443
491F443J36J53J72J93K16K43K72L06L44L86M34M89N51O21P00P89Q90J001J123J254J394J532
$$ 6443 6579 6732 6904 7097 7313 7556 7828 8134 8478 8864 9298 9787 10338 10959 11659 12448 13338 14339 15462 16716 18110 19642
476A9642J663J774J844J855J780J600J304Q98M07j23o39j090j442j679j806j840j805j721
$$ 19642 21305 23079 24923 26778 28558 30158 31462 32360 32767 32644 32005 30915 29473 27794 25988 24148 22343 20622
463B0622j609j481j351j223j103r93q91q02p20o48n85n29m78m35l95l60l29l01k77k54k35
$$ 20622 19013 17532 16181 14958 13855 12862 11971 11169 10449 9801 9216 8687 8209 7774 7379 7019 6690 6389 6112 5858 5623
449E623k16k00j86j72j60j49j39j30j22j14j07j00r4q9q3p9p3p0o5o1n8n5n1m8m5m3m0l7l5
$$ 5623 5407 5207 5021 4849 4689 4540 4401 4271 4149 4035 3928 3828 3734 3645 3562 3483 3410 3340 3275 3214 3156 3101 3050 3002 2957 2914 2874 2837 2802
429B802l2l0k7k6k3k2j9j7j6j4j2j0rponlljjJJJLLLMOOPRJ0J3J4J6K0K2K5K9L4L8M3M8N4
$$ 2802 2770 2740 2713 2687 2664 2642 2623 2606 2590 2576 2564 2554 2545 2538 2532 2527 2524 2521 2520 2519 2520 2521 2522 2525 2528 2531 2535 2541 2547 2554 2563 2573 2586 2600 2616 2636 2658 2683 2712 2746 2784 2827 2875 2929
398B929O1O7P5Q4R2J03J13J25J39J53J68J87K06K27K51K77L06L37L71M10M51M94N41N89O38
$$ 2929 2990 3057 3132 3216 3308 3411 3524 3649 3788 3941 4109 4296 4502 4729 4980 5257 5563 5900 6271 6681 7132 7626 8167 8756 9394
381I394O83P25P57P79P80P58P09O27N12L68K01K1j60l27m73n89o73p27p52p54p39p10o74o33
$$ 9394 10077 10802 11559 12338 13118 13876 14585 15212 15724 16092 16293 16314 16154 15827 15354 14765 14092 13365 12613 11859 11120 10410 9736 9103
364I103n90n46n04m64m25l91l59l29l02k78k55k35k17k01j85j72j59j48j37j27j19j11j04
$$ 9103 8513 7967 7463 6999 6574 6183 5824 5495 5193 4915 4660 4425 4208 4007 3822 3650 3491 3343 3206 3079 2960 2849 2745
348B745r7r1q5q0p6p1o7o4o0n7n3n2m8m6m5m1m0l9l6l5l3l2l1k9k9k7k5k5k4k3k2k2k1k0j9
$$ 2745 2648 2557 2472 2392 2316 2245 2178 2114 2054 1997 1944 1892 1844 1798 1753 1712 1672 1633 1597 1562 1529 1497 1466 1437 1408 1381 1356 1331 1307 1284 1262 1240 1219 1199 1180
324A180j9j8j7j7j6j6j6j5j4j4j4j3j3j3j2j2j1j2j0j1j0j0j0j0rrrrrqrqpqqpqpppopooo
$$ 1180 1161 1143 1126 1109 1093 1077 1061 1046 1032 1018 1004 991 978 965 953 941 930 918 908 897 887 877 867 857 848 839 830 821 812 804 795 787 780 772 764 757 749 742 735 728 722 715 709 703 697
293F97ooooononnonmnnnmnmmmnmmmmmmmmlmlmlmllmllllllllkllkllklklkkklkkkkkkkkkk
$$ 697 691 685 679 673 667 662 656 651 646 640 635 631 626 621 616 612 607 603 599 595 590 586 582 578 574 570 566 562 558 555 551 548 544 541 537 534 531 527 524 521 518 515 512 509 506 503 501 498 495 493 490 487 485 482 480 477 475 473 471 468 466 464 462 460 458 456 454 452 450 448
244D48lkkklkkkkkklkklklkklkkkkkkjkkjkjkjkjkjkjkjjkjjjkjjjjkjjjkjjkjjkkjkkjkj
$$ 448 445 443 441 439 436 434 432 430 428 426 424 421 419 417 414 412 409 407 405 402 400 398 396 394 392 390 389 387 385 384 382 381 379 378 376 375 373 372 370 369 367 366 365 363 362 361 360 358 357 356 355 354 352 351 350 349 347 346 345 343 342 341 339 337 336 334 332 331 329 328
196C28jkjjkjjjjjjjkjjjkjjjjjjjjjj%jjjjjjjjjjjjjj%jjjj%jjjjjj%jj%j%jjjj%jjj%j
$$ 328 327 325 324 323 321 320 319 318 317 316 315 314 312 311 310 309 307 306 305 304 303 302 301 300 299 298 297 297 296 295 294 293 292 291 290 289 288 287 286 285 284 283 283 282 281 280 279 279 278 277 276 275 274 273 273 272 271 271 270 270 269 268 267 266 266 265 264 263 263 262
147B62%j%j%%jj%jj%j%%%j%%j%%j%%j%%%%%%%%%J%%J%%J%%JJJ%JJJJJKJKJKKLKLLMMLNMNN
$$ 262 262 261 261 260 260 260 259 258 258 257 256 256 255 255 255 255 254 254 254 253 253 253 252 252 252 251 251 251 251 251 251 251 251 251 251 252 252 252 253 253 253 254 254 254 255 256 257 257 258 259 260 261 262 264 265 267 268 270 272 275 277 280 283 287 291 294 299 303 308 313
99C13NONOOOONONNMLKJ%kklmnnoooooponononmnmmlmlmllklkklkklkjkjkjjkjjkjjjjjjj%
$$ 313 318 324 329 335 341 347 353 358 364 369 374 378 381 383 384 384 382 380 377 373 368 363 357 351 345 339 333 326 320 315 309 304 298 293 289 284 280 276 273 269 266 262 259 256 254 251 249 247 244 242 240 237 235 234 232 231 229 228 227 225 224 223 221 220 219 218 217 216 215 214 214
49B14jjjjjjjj%j%jj%j%jj%jjj%j%%j%j%j%j%jj%j%j%%j%%j%%j%%%j%%j%%j%%j%%j%j%j%j
$$ 214 213 212 211 210 209 208 207 206 206 205 205 204 203 203 202 202 201 200 200 199 198 197 197 196 196 196 195 195 194 194 193 193 192 192 191 190 190 189 189 188 188 188 187 187 187 186 186 186 185 185 185 185 184 184 184 183 183 183 182 182 182 181 181 181 180 180 179 179 178 178 177
0A77%j%j%%j%%%%%%%j%%%%j%%%j%%j%%j%%%%j%%%%%j%%j%%%j%%%%j%%%%%j%%%%%%j%%%%%j
$$ 177 177 176 176 175 175 175 174 174 174 174 174 174 174 174 173 173 173 173 173 172 172 172 172 171 171 171 170 170 170 169 169 169 169 169 168 168 168 168 168 168 167 167 167 166 166 166 166 165 165 165 165 165 164 164 164 164 164 164 163 163 163 163 163 163 163 162 162 162 162 162 162 161
-50A61%%%j%%j%%%%j%%%%%j%%%%%j%%%%%j%%%%%%%%%j%%%j%%%%%j%%%%%%j%%%%%j%%j%%j%
$$ 161 161 161 161 160 160 160 159 159 159 159 159 158 158 158 158 158 158 157 157 157 157 157 157 156 156 156 156 156 156 155 155 155 155 155 155 155 155 155 155 154 154 154 154 153 153 153 153 153 153 152 152 152 152 152 152 152 151 151 151 151 151 151 150 150 150 149 149 149 148 148
-98A48%%%%%%%%%%%%%%%%j%%%j%%j%%%j%%%%J%%j%%%%j%%%%%%%j%J%%%%j%%%%%%%%j%%%%%
$$ 148 148 148 148 148 148 148 148 148 148 148 148 148 148 148 148 148 147 147 147 147 146 146 146 145 145 145 145 144 144 144 144 144 145 145 145 144 144 144 144 144 143 143 143 143 143 143 143 143 142 142 143 143 143 143 143 142 142 142 142 142 142 142 142 142 141 141 141 141 141 141
-147A41j%%%%%j%%%j%%%%j%%%%%%j%%%%%J%%%J%j%%%j%%%%%%%%j%%%%%%%j%%%%%%%%%%%%%
$$ 141 140 140 140 140 140 140 139 139 139 139 138 138 138 138 138 137 137 137 137 137 137 137 136 136 136 136 136 136 137 137 137 137 138 138 137 137 137 137 136 136 136 136 136 136 136 136 136 135 135 135 135 135 135 135 135 134 134 134 134 134 134 134 134 134 134 134 134 134 134
-195A34%%%%j%%%%%%j%%%%%%j%%%%%%J%j%%%%j%%%%%%%%%%J%%j%%%%%%%%%j%%%%%j%%%%%%
$$ 134 134 134 134 134 133 133 133 133 133 133 133 132 132 132 132 132 132 132 131 131 131 131 131 131 131 132 132 131 131 131 131 131 130 130 130 130 130 130 130 130 130 130 130 131 131 131 130 130 130 130 130 130 130 130 130 130 129 129 129 129 129 129 128 128 128 128 128 128 128
-243A28%%%%%%%%%%%%%%%j%%%%%%%%%%%%%%%j%%%%%%j%%%%%%%%%%%%%j%%%%%%%%%%%%J%%j
$$ 128 128 128 128 128 128 128 128 128 128 128 128 128 128 128 128 127 127 127 127 127 127 127 127 127 127 127 127 127 127 127 127 126 126 126 126 126 126 126 125 125 125 125 125 125 125 125 125 125 125 125 125 125 124 124 124 124 124 124 124 124 124 124 124 124 124 125 125 125 124
-290A24%%%%%%%%J%%J%%%%%J%%J%JJ%JJJJ%J%%j%jjj%jjj%j%j%j%%%j%%%%j%%%%%%%%%%%%
$$ 124 124 124 124 124 124 124 124 124 125 125 125 126 126 126 126 126 126 127 127 127 128 128 129 130 130 131 132 133 134 134 135 135 135 134 134 133 132 131 131 130 129 128 128 127 127 126 126 125 125 125 125 124 124 124 124 124 123 123 123 123 123 123 123 123 123 123 123 123 123
-338A23%j%%%%%%%%%%j%%%%%%%%%%%%%j%%%%%%%%%%%%%%%j%%%%%%%%%%%%%%%%%%%%%%%%%%
$$ 123 123 122 122 122 122 122 122 122 122 122 122 122 121 121 121 121 121 121 121 121 121 121 121 121 121 121 120 120 120 120 120 120 120 120 120 120 120 120 120 120 120 120 119 119 119 119 119 119 119 119 119 119 119 119 119 119 119 119 119 119 119 119 119 119 119 119 119 119 119
-386A19%j%%%%%%%%%J%%%%%%%%j%%%j%%%%%%j%%%%J%%%%%%%%%%%%%%%%j%%%%%%j%%%%%%%%
$$ 119 119 118 118 118 118 118 118 118 118 118 118 119 119 119 119 119 119 119 119 119 118 118 118 118 117 117 117 117 117 117 117 116 116 116 116 116 117 117 117 117 117 117 117 117 117 117 117 117 117 117 117 117 117 116 116 116 116 116 116 116 115 115 115 115 115 115 115 115 115
-434A15%%%%%%%%j%%J%%%j%%%%%J%%%%%J%j%%%%%%%%%%%%%%%%%%%%%%%%%%%%%%%J%%%j%%%
$$ 115 115 115 115 115 115 115 115 115 114 114 114 115 115 115 115 114 114 114 114 114 114 115 115 115 115 115 115 116 116 115 115 115 115 115 115 115 115 115 115 115 115 115 115 115 115 115 115 115 115 115 115 115 115 115 115 115 115 115 115 115 115 116 116 116 116 115 115 115 115
-482A15%%%%%%%%%J%%%%%j%%%j%%%%%%%%%j%%%%%%%%%%%j%%%%%%J%%%%%%%%j%%%j%%%%%J%
$$ 115 115 115 115 115 115 115 115 115 115 116 116 116 116 116 116 115 115 115 115 114 114 114 114 114 114 114 114 114 114 113 113 113 113 113 113 113 113 113 113 113 113 112 112 112 112 112 112 112 113 113 113 113 113 113 113 113 113 112 112 112 112 111 111 111 111 111 111 112 112
-530A12%%JjJ%j%%%%%%%%%%%%%%%%%%%%%j%%%%J%%%%%%%%%j%%%%%j%%%%%%%J%%%%%%Jj%%%
$$ 112 112 112 113 112 113 113 112 112 112 112 112 112 112 112 112 112 112 112 112 112 112 112 112 112 112 112 112 112 111 111 111 111 111 112 112 112 112 112 112 112 112 112 112 111 111 111 111 111 111 110 110 110 110 110 110 110 110 111 111 111 111 111 111 111 112 111 111 111 111
-578A11%%%%%%%%%%%%%%%j%%%%%%%%%%%%%%%%%%%%%%%%%%%%%%%%%j%%%%%J%%%%%%%%j%%%%
$$ 111 111 111 111 111 111 111 111 111 111 111 111 111 111 111 111 110 110 110 110 110 110 110 110 110 110 110 110 110 110 110 110 110 110 110 110 110 110 110 110 110 110 110 110 110 110 110 110 110 110 109 109 109 109 109 109 110 110 110 110 110 110 110 110 110 109 109 109 109 109
-625A09%%%%%%%%%%%%%%%%%%%%%%%%%%%%%%%%%j%%%J%%%%%%%%%%%%%%%%%j%%%%%%%%%%%%%
$$ 109 109 109 109 109 109 109 109 109 109 109 109 109 109 109 109 109 109 109 109 109 109 109 109 109 109 109 109 109 109 109 109 109 109 108 108 108 108 109 109 109 109 109 109 109 109 109 109 109 109 109 109 109 109 109 109 108 108 108 108 108 108 108 108 108 108 108 108 108 108
-673A08%%%%%%%%%%%%J%%%%%%%%j%%%%%%%%%%%%%%%%%%%%%%%j%%%%%%%Jj%%%%%%j%%%%J%%
$$ 108 108 108 108 108 108 108 108 108 108 108 108 108 109 109 109 109 109 109 109 109 109 108 108 108 108 108 108 108 108 108 108 108 108 108 108 108 108 108 108 108 108 108 108 108 108 107 107 107 107 107 107 107 107 108 107 107 107 107 107 107 107 106 106 106 106 106 107 107 107
-721A07%%J%%%%%%%%%%%%%%%%%%%j%%%%%%%%%%%%%%%%%%%%%%%%%%%%%%%%%%%%j%%%%J%%j%
$$ 107 107 107 108 108 108 108 108 108 108 108 108 108 108 108 108 108 108 108 108 108 108 108 107 107 107 107 107 107 107 107 107 107 107 107 107 107 107 107 107 107 107 107 107 107 107 107 107 107 107 107 107 107 107 107 107 107 107 107 107 106 106 106 106 106 107 107 107 106 106
-769A06%%%%%%%j%%%J%%%%j%%%%%J%%%%%%%%%%%%%j%%%%%%%J%%%%%%J%j%%%%j%%%%%%%%%j
$$ 106 106 106 106 106 106 106 106 105 105 105 105 106 106 106 106 106 105 105 105 105 105 105 106 106 106 106 106 106 106 106 106 106 106 106 106 106 105 105 105 105 105 105 105 105 106 106 106 106 106 106 106 107 107 106 106 106 106 106 105 105 105 105 105 105 105 105 105 105 104
-817A04%%%%J%%%%%%%%%%%%%%%%%%%%%%%%%%j%%%%%%%%%%%%J%%%j%%J%%%j%%%%%%%%%%%J%
$$ 104 104 104 104 104 105 105 105 105 105 105 105 105 105 105 105 105 105 105 105 105 105 105 105 105 105 105 105 105 105 105 105 104 104 104 104 104 104 104 104 104 104 104 104 104 105 105 105 105 104 104 104 105 105 105 105 104 104 104 104 104 104 104 104 104 104 104 104 105 105
-865A05%%%%%%%%%%%%j%%%%%jJ%%%%%%%%%j%%%j%%%%%%%%%%J%%%%%%%%%%%%%%%%%%%%%%%%
$$ 105 105 105 105 105 105 105 105 105 105 105 105 105 104 104 104 104 104 104 103 104 104 104 104 104 104 104 104 104 104 103 103 103 103 102 102 102 102 102 102 102 102 102 102 102 103 103 103 103 103 103 103 103 103 103 103 103 103 103 103 103 103 103 103 103 103 103 103 103 103
-913A03%%%%%%%%%%%%j%%%%J%%%%%%%j%%%%%%%Jj%%%%%%%%%%%%%%%%%%%J%%%%j%%%%%%%%%
$$ 103 103 103 103 103 103 103 103 103 103 103 103 103 102 102 102 102 102 103 103 103 103 103 103 103 103 102 102 102 102 102 102 102 102 103 102 102 102 102 102 102 102 102 102 102 102 102 102 102 102 102 102 102 102 102 103 103 103 103 103 102 102 102 102 102 102 102 102 102 102
-960A02%%%%%%%%%%j%%%%j%%%%%%%%%%%J%%%%%%%%%%%%%%%%j%%%%%%%%%%%%J%%%%%%%%%%%
$$ 102 102 102 102 102 102 102 102 102 102 102 101 101 101 101 101 100 100 100 100 100 100 100 100 100 100 100 100 101 101 101 101 101 101 101 101 101 101 101 101 101 101 101 101 101 100 100 100 100 100 100 100 100 100 100 100 100 100 101 101 101 101 101 101 101 101 101 101 101 101
-1008A01%%%j%%%%%%%%%%%%%%%%%J%j%%%%%%%%%%%%j%%%j%%J%%%J%%%%%%%%%%j%%%%%%%%%
$$ 101 101 101 101 100 100 100 100 100 100 100 100 100 100 100 100 100 100 100 100 100 100 101 101 100 100 100 100 100 100 100 100 100 100 100 100 100 99 99 99 99 98 98 98 99 99 99 99 100 100 100 100 100 100 100 100 100 100 100 99 99 99 99 99 99 99 99 99 99
-1056I9%%%%%%%%%%%%j%%%%%J%%j%%%%%%%%%%%%%%%%%%%%%%%%%%%%%%%%j%%%%%%%%%%%%%%
$$ 99 99 99 99 99 99 99 99 99 99 99 99 99 98 98 98 98 98 98 99 99 99 98 98 98 98 98 98 98 98 98 98 98 98 98 98 98 98 98 98 98 98 98 98 98 98 98 98 98 98 98 98 98 98 98 97 97 97 97 97 97 97 97 97 97 97 97 97 97 97
-1103I7%%%%%%%%%%%%%%%%%%%%%%%%%j%%%%%%%%%%%%%%%%%%%%%%%%%%%J%%%j%%%%%%jJ%%%
$$ 97 97 97 97 97 97 97 97 97 97 97 97 97 97 97 97 97 97 97 97 97 97 97 97 97 97 96 96 96 96 96 96 96 96 96 96 96 96 96 96 96 96 96 96 96 96 96 96 96 96 96 96 96 96 97 97 97 97 96 96 96 96 96 96 96 95 96 96 96 96
-1151I6%%%%%%%%%%%%%%%%%%%%%j%%%%%%%%%%%%%%%%j%%%%J%%%%%%%%%%j%%%%%%%j%%%%%%
$$ 96 96 96 96 96 96 96 96 96 96 96 96 96 96 96 96 96 96 96 96 96 96 95 95 95 95 95 95 95 95 95 95 95 95 95 95 95 95 95 94 94 94 94 94 95 95 95 95 95 95 95 95 95 95 95 94 94 94 94 94 94 94 94 93 93 93 93 93 93 93
-1199I3%%%%%%%%%%%%%%%%%%%%%%%%%%%%%%%%%%%%%%%%%%%%%j%J%%%%%%%%j%%%%%%%%%%%%
$$ 93 93 93 93 93 93 93 93 93 93 93 93 93 93 93 93 93 93 93 93 93 93 93 93 93 93 93 93 93 93 93 93 93 93 93 93 93 93 93 93 93 93 93 93 93 93 92 92 93 93 93 93 93 93 93 93 93 92 92 92 92 92 92 92 92 92 92 92 92 92
-1247I2%%%j%%%%%%%%%%%%%%%%J%%j%%%%%%%%%%%%%%%%%%%%%%%%%%%%%%%%%%%%%%%%%%%j%
$$ 92 92 92 92 91 91 91 91 91 91 91 91 91 91 91 91 91 91 91 91 91 92 92 92 91 91 91 91 91 91 91 91 91 91 91 91 91 91 91 91 91 91 91 91 91 91 91 91 91 91 91 91 91 91 91 91 91 91 91 91 91 91 91 91 91 91 91 91 90 90
-1295I0%%%%%%%%%%%%%%%j%%%J%%%%%%%%%%%%%j%%%%%%%%%%%%%%%%%%%%%%%%%%%%%%%%%%%
$$ 90 90 90 90 90 90 90 90 90 90 90 90 90 90 90 90 89 89 89 89 90 90 90 90 90 90 90 90 90 90 90 90 90 90 89 89 89 89 89 89 89 89 89 89 89 89 89 89 89 89 89 89 89 89 89 89 89 89 89 89 89 89 89 89 89 89 89 89 89 89
-1343H9%%%%%%%%%%%%%j%%%%%%%%%%J%%%%%%j%%%%%%j%%j%%%%%%%%%%J%%%%%%%%%%j%J%%%
$$ 89 89 89 89 89 89 89 89 89 89 89 89 89 89 88 88 88 88 88 88 88 88 88 88 88 89 89 89 89 89 89 89 88 88 88 88 88 88 88 87 87 87 86 86 86 86 86 86 86 86 86 86 86 87 87 87 87 87 87 87 87 87 87 87 86 86 87 87 87 87
-1391H7%%%%%j%%%%%%%%%%%%%%j%%%%%%%%%%%%%%%%%%%%%%%%%%%%%j%%%%%%%%%%%J%%%%%%
$$ 87 87 87 87 87 87 86 86 86 86 86 86 86 86 86 86 86 86 86 86 86 85 85 85 85 85 85 85 85 85 85 85 85 85 85 85 85 85 85 85 85 85 85 85 85 85 85 85 85 85 85 84 84 84 84 84 84 84 84 84 84 84 84 85 85 85 85 85 85 85
-1438H5%%j%%%j%%%%%%%%J%%%%Jj%%%%%%%%%%%%%%%%%%%%%%%%j%%%%%%%%%%%%%%%%j%%%%J
$$ 85 85 85 84 84 84 84 83 83 83 83 83 83 83 83 83 84 84 84 84 84 85 84 84 84 84 84 84 84 84 84 84 84 84 84 84 84 84 84 84 84 84 84 84 84 84 84 83 83 83 83 83 83 83 83 83 83 83 83 83 83 83 83 83 82 82 82 82 82 83
-1486H3%%%%%%%%%j%%%%%J%%%%%%%%%j%%%%%%%%%%%%%%%%%%jJ%%%%%j%%%%%%%%%%%%%%%%%
$$ 83 83 83 83 83 83 83 83 83 83 82 82 82 82 82 82 83 83 83 83 83 83 83 83 83 83 82 82 82 82 82 82 82 82 82 82 82 82 82 82 82 82 82 82 82 81 82 82 82 82 82 82 81 81 81 81 81 81 81 81 81 81 81 81 81 81 81 81 81 81
-1534H1%%%%%%%%%%%%%%%%%%j%%%%%%%%%%%J%%%%j%%%%%%%%%j%%%%%%%%j%%%%%%%%%%%%%%
$$ 81 81 81 81 81 81 81 81 81 81 81 81 81 81 81 81 81 81 81 80 80 80 80 80 80 80 80 80 80 80 80 81 81 81 81 81 80 80 80 80 80 80 80 80 80 80 79 79 79 79 79 79 79 79 79 78 78 78 78 78 78 78 78 78 78 78 78 78 78 78
-1582G8%%%%%%%%%J%%%%%%%%%%%%%%%%%%%%%%j%%%%%%%%%%%j%%%%%%%%J%%%%%%%%%j%%%%%
$$ 78 78 78 78 78 78 78 78 78 78 79 79 79 79 79 79 79 79 79 79 79 79 79 79 79 79 79 79 79 79 79 79 79 78 78 78 78 78 78 78 78 78 78 78 78 77 77 77 77 77 77 77 77 77 78 78 78 78 78 78 78 78 78 78 77 77 77 77 77 77
-1630G7%%%%%%%%%%%%%%%%%%j%%%%%%%%%%%%%%%%%j%%%%%J%%%%%%%%j%%%%%%%%%%%%%%%%%
$$ 77 77 77 77 77 77 77 77 77 77 77 77 77 77 77 77 77 77 77 76 76 76 76 76 76 76 76 76 76 76 76 76 76 76 76 76 76 75 75 75 75 75 75 76 76 76 76 76 76 76 76 76 75 75 75 75 75 75 75 75 75 75 75 75 75 75 75 75 75 75
-1678G5%%%%%%%j%%%%%%%%J%%%%%%%%%%%%%%%%%%%%%%%%%%%%j%%%%%%%%j%%%%%%%%%%%%%J
$$ 75 75 75 75 75 75 75 75 74 74 74 74 74 74 74 74 74 75 75 75 75 75 75 75 75 75 75 75 75 75 75 75 75 75 75 75 75 75 75 75 75 75 75 75 75 75 74 74 74 74 74 74 74 74 74 73 73 73 73 73 73 73 73 73 73 73 73 73 73 74
-1726G4%%%%%%%%j%%%%%%%%%%%%%%%j%%%%%%%%%%%%%%%%%%j%%%%%%%%%%%%%%%j%%J%%%%%%
$$ 74 74 74 74 74 74 74 74 74 73 73 73 73 73 73 73 73 73 73 73 73 73 73 73 73 72 72 72 72 72 72 72 72 72 72 72 72 72 72 72 72 72 72 72 71 71 71 71 71 71 71 71 71 71 71 71 71 71 71 71 70 70 70 71 71 71 71 71 71 71
-1773G1%%%j%J%%%%%%%j%%%%%%%%%%%%%%%%%%%%%j%%%%%%%%%%%J%%%%%%%%%%j%%%%%%j%%%
$$ 71 71 71 71 70 70 71 71 71 71 71 71 71 71 70 70 70 70 70 70 70 70 70 70 70 70 70 70 70 70 70 70 70 70 70 70 69 69 69 69 69 69 69 69 69 69 69 69 70 70 70 70 70 70 70 70 70 70 70 69 69 69 69 69 69 69 68 68 68 68
-1821F8%%%%%%%J%%%%%%%%%%%j%%%%J%%%%%%%%%%%%%%%%%%%%%%%j%%%%%%%%%%%%j%%%J%%%
$$ 68 68 68 68 68 68 68 68 69 69 69 69 69 69 69 69 69 69 69 69 68 68 68 68 68 69 69 69 69 69 69 69 69 69 69 69 69 69 69 69 69 69 69 69 69 69 69 69 69 68 68 68 68 68 68 68 68 68 68 68 68 68 67 67 67 67 68 68 68 68
-1869F8%%%j%%%%%%%%%%J%%%%%%j%%%%%%%j%%%%%%%%%%%J%%%%%%j%%%%%%%%%J%%%%%%%%%%
$$ 68 68 68 68 67 67 67 67 67 67 67 67 67 67 67 68 68 68 68 68 68 68 67 67 67 67 67 67 67 67 66 66 66 66 66 66 66 66 66 66 66 66 67 67 67 67 67 67 67 66 66 66 66 66 66 66 66 66 66 67 67 67 67 67 67 67 67 67 67 67
-1917F7%%%j%%%%j%%%%%J%%%%%%%%%j%%%%%%%%%%J%%%%%%%%j%%%%%%%%%%%%%%%%%%%%%%%%
$$ 67 67 67 67 66 66 66 66 66 65 65 65 65 65 65 66 66 66 66 66 66 66 66 66 66 65 65 65 65 65 65 65 65 65 65 65 66 66 66 66 66 66 66 66 66 65 65 65 65 65 65 65 65 65 65 65 65 65 65 65 65 65 65 65 65 65 65 65 65 65
-1965F5%j%%%%%%%%%J%%j%%%%%%%%%%j%%%%%%%%J%%j%%%%%%jJ%%%%%%%%%%%%%%%%%%%j%%%
$$ 65 65 64 64 64 64 64 64 64 64 64 64 65 65 65 64 64 64 64 64 64 64 64 64 64 64 63 63 63 63 63 63 63 63 63 64 64 64 63 63 63 63 63 63 63 62 63 63 63 63 63 63 63 63 63 63 63 63 63 63 63 63 63 63 63 63 62 62 62 62
-2013F2%%%%%%%%%%J%j%%%%%%%%%%%%%%%%%%%j%%%%%%%%%%%%%%%%%%%%%%%%%%j%%%%%%%%%
$$ 62 62 62 62 62 62 62 62 62 62 62 63 63 62 62 62 62 62 62 62 62 62 62 62 62 62 62 62 62 62 62 62 62 61 61 61 61 61 61 61 61 61 61 61 61 61 61 61 61 61 61 61 61 61 61 61 61 61 61 61 60 60 60 60 60 60 60 60 60 60
-2061F0J%%%%%%%%%%%J%%%%%%%%%j%%%%%%%j%%%%%%%%%%%%%%%%%%%%%%%j%%%%%%%%%%%%%%
$$ 60 61 61 61 61 61 61 61 61 61 61 61 61 62 62 62 62 62 62 62 62 62 62 61 61 61 61 61 61 61 61 60 60 60 60 60 60 60 60 60 60 60 60 60 60 60 60 60 60 60 60 60 60 60 60 59 59 59 59 59 59 59 59 59 59 59 59 59 59 59
-2108E9%%%%J%%%%%%%%%%%%%j%%%%%%%%j%%%%%%J%%%%%%%%%%%%%%%%%%%%%J%%j%%%%%j%J%
$$ 59 59 59 59 59 60 60 60 60 60 60 60 60 60 60 60 60 60 60 59 59 59 59 59 59 59 59 59 58 58 58 58 58 58 58 59 59 59 59 59 59 59 59 59 59 59 59 59 59 59 59 59 59 59 59 59 59 60 60 60 59 59 59 59 59 59 58 58 59 59
-2156E9%%%%%%j%%%%%%%%%%%%%%%%%%%%%%%%%%%j%%%%%%%J%%%%%%%%j%%%%%%%%%%%%%%%%%
$$ 59 59 59 59 59 59 59 58 58 58 58 58 58 58 58 58 58 58 58 58 58 58 58 58 58 58 58 58 58 58 58 58 58 58 58 57 57 57 57 57 57 57 57 58 58 58 58 58 58 58 58 58 57 57 57 57 57 57 57 57 57 57 57 57 57 57 57 57 57 57
-2204E7%%%%%%%%j%%%%%%%%%%%%%%%%%%%%%%%%%%%%%%%%%%j%%%J%%%%%%%%%%%%%%%%%%%%j
$$ 57 57 57 57 57 57 57 57 57 56 56 56 56 56 56 56 56 56 56 56 56 56 56 56 56 56 56 56 56 56 56 56 56 56 56 56 56 56 56 56 56 56 56 56 55 55 55 55 56 56 56 56 56 56 56 56 56 56 56 56 56 56 56 56 56 56 56 56 56 55
-2252E5%%%j%%%%%%%%%%%%%%%%%%%%%%%%%%%%J%j%%%%%%%%%%%%%%%%%%%%%%%%%%%%%%j%%%
$$ 55 55 55 55 54 54 54 54 54 54 54 54 54 54 54 54 54 54 54 54 54 54 54 54 54 54 54 54 54 54 54 54 54 55 55 54 54 54 54 54 54 54 54 54 54 54 54 54 54 54 54 54 54 54 54 54 54 54 54 54 54 54 54 54 54 54 53 53 53 53
-2300E3%%%%J%%%%J%%%%%%%%%%%j%%%%%j%%%%%%%%%%%%%%%%%%%%%%%%%%%%j%%%%%%%%%%%%
$$ 53 53 53 53 53 54 54 54 54 54 55 55 55 55 55 55 55 55 55 55 55 55 54 54 54 54 54 54 53 53 53 53 53 53 53 53 53 53 53 53 53 53 53 53 53 53 53 53 53 53 53 53 53 53 53 53 53 52 52 52 52 52 52 52 52 52 52 52 52 52
-2348E2%%%%%%%%%%%%%%%%%%%%%%%%%%%%%j%%J%%%%%%%%%%%%J%%%j%%%%%%%%%j%%%%%%%%%
$$ 52 52 52 52 52 52 52 52 52 52 52 52 52 52 52 52 52 52 52 52 52 52 52 52 52 52 52 52 52 52 51 51 51 52 52 52 52 52 52 52 52 52 52 52 52 52 53 53 53 53 52 52 52 52 52 52 52 52 52 52 51 51 51 51 51 51 51 51 51 51
-2396E1%%%%%%%j%%%%%%%%%%%%%%%J%%%%%%%%%j%%%%%%%%%J%%%%%%%%%%%%%%%%%%j%%j%%%
$$ 51 51 51 51 51 51 51 51 50 50 50 50 50 50 50 50 50 50 50 50 50 50 50 50 51 51 51 51 51 51 51 51 51 51 50 50 50 50 50 50 50 50 50 50 51 51 51 51 51 51 51 51 51 51 51 51 51 51 51 51 51 51 51 50 50 50 49 49 49 49
-2443D9%%%%%%%%%%%J%%%%%%%%%%%%%%%%%%%j%%%%%%%%%%%%J%%j%%%%j%%%%%%%J%%%%%%%%
$$ 49 49 49 49 49 49 49 49 49 49 49 49 50 50 50 50 50 50 50 50 50 50 50 50 50 50 50 50 50 50 50 50 49 49 49 49 49 49 49 49 49 49 49 49 49 50 50 50 49 49 49 49 49 48 48 48 48 48 48 48 48 49 49 49 49 49 49 49 49 49
-2491D9%%%%%%%%%%%%j%%%J%%%%%%%%%%%%%%%%%%%J%%%%j%%%%%J%%%%%%j%%%j%%%%j%%%%%
$$ 49 49 49 49 49 49 49 49 49 49 49 49 49 48 48 48 48 49 49 49 49 49 49 49 49 49 49 49 49 49 49 49 49 49 49 49 49 50 50 50 50 50 49 49 49 49 49 49 50 50 50 50 50 50 50 49 49 49 49 48 48 48 48 48 47 47 47 47 47 47
-2539D7%%%%%%%%J%j%%%%%%%J%%%%j%%%%%%%%%%J%%%%%%%%%j%%%%jJ%%%J%j%%%%%%%%%%%%
$$ 47 47 47 47 47 47 47 47 47 48 48 47 47 47 47 47 47 47 47 48 48 48 48 48 47 47 47 47 47 47 47 47 47 47 47 48 48 48 48 48 48 48 48 48 48 47 47 47 47 47 46 47 47 47 47 48 48 47 47 47 47 47 47 47 47 47 47 47 47 47
-2587D7%%%%%%%%%%%%%%%%%%j%%%%%%%%%%%%%%%%%%%%%%%%%%%J%j%%%%j%%%%%%%%J%%%%%%
$$ 47 47 47 47 47 47 47 47 47 47 47 47 47 47 47 47 47 47 47 46 46 46 46 46 46 46 46 46 46 46 46 46 46 46 46 46 46 46 46 46 46 46 46 46 46 46 46 47 47 46 46 46 46 46 45 45 45 45 45 45 45 45 45 46 46 46 46 46 46 46
-2635D6%%%%%%%%%%%%%%%%%%%j%%%%%%%jJ%%%%%%%%%j%%%%%%%%%%%%%%%%%%%%%%%%%%%%%%
$$ 46 46 46 46 46 46 46 46 46 46 46 46 46 46 46 46 46 46 46 46 45 45 45 45 45 45 45 45 44 45 45 45 45 45 45 45 45 45 45 44 44 44 44 44 44 44 44 44 44 44 44 44 44 44 44 44 44 44 44 44 44 44 44 44 44 44 44 44 44 44
-2683D4%%%%%%%%%%%%%%%%%%%j%%%%%%%%%%%%%%%%%%%%%%%%J%%%%%%%%%%%%%%%%%%%j%%%%
$$ 44 44 44 44 44 44 44 44 44 44 44 44 44 44 44 44 44 44 44 44 43 43 43 43 43 43 43 43 43 43 43 43 43 43 43 43 43 43 43 43 43 43 43 43 43 44 44 44 44 44 44 44 44 44 44 44 44 44 44 44 44 44 44 44 44 43 43 43 43 43
-2731D3%%%%%%%%%%%%%%%J%%%%%%%%%%%%%%%%%%%%%%%%%%j%%%%%%%j%%%%J%%%%%%%%J%%%j
$$ 43 43 43 43 43 43 43 43 43 43 43 43 43 43 43 43 44 44 44 44 44 44 44 44 44 44 44 44 44 44 44 44 44 44 44 44 44 44 44 44 44 44 44 43 43 43 43 43 43 43 43 42 42 42 42 42 43 43 43 43 43 43 43 43 43 44 44 44 44 43
-2778D3%%%%%%%%%%j%%%%%%%%%%%J%%%%%%jJ%%%%j%%%%%%J%%%%%%%%%%%%%%%%%%%%%j%%%%
$$ 43 43 43 43 43 43 43 43 43 43 43 42 42 42 42 42 42 42 42 42 42 42 42 43 43 43 43 43 43 43 42 43 43 43 43 43 42 42 42 42 42 42 42 43 43 43 43 43 43 43 43 43 43 43 43 43 43 43 43 43 43 43 43 43 43 42 42 42 42 42
-2826D2%%%%%%%%%%%J%%%%%j%%%J%%%%%j%%%%J%%%%%%%j%%%%%%%%%%%%%j%%%%%%%%%%%%%%
$$ 42 42 42 42 42 42 42 42 42 42 42 42 43 43 43 43 43 43 42 42 42 42 43 43 43 43 43 43 42 42 42 42 42 43 43 43 43 43 43 43 43 42 42 42 42 42 42 42 42 42 42 42 42 42 42 41 41 41 41 41 41 41 41 41 41 41 41 41 41 41
-2874D1%%J%%%%j%%%J%%%%%%%%%%%j%%%%%%%%%%%%%%%%%%%%%j%%%%%%%%%%%%%%%%%%%%%%%
$$ 41 41 41 42 42 42 42 42 41 41 41 41 42 42 42 42 42 42 42 42 42 42 42 42 41 41 41 41 41 41 41 41 41 41 41 41 41 41 41 41 41 41 41 41 41 41 40 40 40 40 40 40 40 40 40 40 40 40 40 40 40 40 40 40 40 40 40 40 40 40
-2922D0%%%%%%j%%%%%%%JjJ%%%%%%%%%%%%%%%%%%%%%%%%%%j%%%%%J%%%%%%%%j%%%%J%%%%%
$$ 40 40 40 40 40 40 40 39 39 39 39 39 39 39 39 40 39 40 40 40 40 40 40 40 40 40 40 40 40 40 40 40 40 40 40 40 40 40 40 40 40 40 40 40 39 39 39 39 39 39 40 40 40 40 40 40 40 40 40 39 39 39 39 39 40 40 40 40 40 40
-2970D0j%%%%%%%%%%J%%%%%%%%%%j%%%%%%%%%%%%%%%%%%%%%%%%%%%%%%%%%%%%%%%J%j%%%%
$$ 40 39 39 39 39 39 39 39 39 39 39 39 40 40 40 40 40 40 40 40 40 40 40 39 39 39 39 39 39 39 39 39 39 39 39 39 39 39 39 39 39 39 39 39 39 39 39 39 39 39 39 39 39 39 39 39 39 39 39 39 39 39 39 40 40 39 39 39 39 39
-3018C9%%%%%%%%%%%%%%%%%%%%%%%%%%%%%%%%%%%%%%%%%%%%%%%%j%%J%%%%%%%%%%%%%%%%%
$$ 39 39 39 39 39 39 39 39 39 39 39 39 39 39 39 39 39 39 39 39 39 39 39 39 39 39 39 39 39 39 39 39 39 39 39 39 39 39 39 39 39 39 39 39 39 39 39 39 39 38 38 38 39 39 39 39 39 39 39 39 39 39 39 39 39 39 39 39 39 39
-3066C9j%%%%%%%%%j%%%%%%%%%%%%J%%%%%%%%%%%%J%%%%%%%%%%%%%%%%j%%%%J%%%%%%%%j%
$$ 39 38 38 38 38 38 38 38 38 38 38 37 37 37 37 37 37 37 37 37 37 37 37 37 38 38 38 38 38 38 38 38 38 38 38 38 38 39 39 39 39 39 39 39 39 39 39 39 39 39 39 39 39 39 38 38 38 38 38 39 39 39 39 39 39 39 39 39 38 38
-3113C8%%%%%%%%%%%%%%%%%%%%%%%%J%%j%%%%%%%%%%%j%%%%%%%%%%%%%%%%%%%%j%%%%%J%%
$$ 38 38 38 38 38 38 38 38 38 38 38 38 38 38 38 38 38 38 38 38 38 38 38 38 38 39 39 39 38 38 38 38 38 38 38 38 38 38 38 38 37 37 37 37 37 37 37 37 37 37 37 37 37 37 37 37 37 37 37 37 37 36 36 36 36 36 36 37 37 37
-3161C7%%%%%%j%%%%J%%%%%%%%%%%%%%j%%%%%%%%%%%%%%%%%%%%%%J%%%%%%%%%%j%%%%J%%J
$$ 37 37 37 37 37 37 37 36 36 36 36 36 37 37 37 37 37 37 37 37 37 37 37 37 37 37 37 36 36 36 36 36 36 36 36 36 36 36 36 36 36 36 36 36 36 36 36 36 36 36 37 37 37 37 37 37 37 37 37 37 37 36 36 36 36 36 37 37 37 38
-3209C8%%%%%%j%%%%%J%%%%%%%%%j%%%j%J%%%%%%%%%Jj%%%%%%%%%%%%%%%%%%%%%%%%%%%%%
$$ 38 38 38 38 38 38 38 37 37 37 37 37 37 38 38 38 38 38 38 38 38 38 38 37 37 37 37 36 36 37 37 37 37 37 37 37 37 37 37 38 37 37 37 37 37 37 37 37 37 37 37 37 37 37 37 37 37 37 37 37 37 37 37 37 37 37 37 37 37 37
-3257C7%%j%%%%%%J%%%%%%%%%%j%%%%%%%%%%%%%%%%j%%%J%%%%%%%%%%j%%%J%%%%%%%%%%%%
$$ 37 37 37 36 36 36 36 36 36 36 37 37 37 37 37 37 37 37 37 37 37 36 36 36 36 36 36 36 36 36 36 36 36 36 36 36 36 36 35 35 35 35 36 36 36 36 36 36 36 36 36 36 36 35 35 35 35 36 36 36 36 36 36 36 36 36 36 36 36 36
-3305C6%%%%%%%%%%%%%%%%j%%%%%%%%%%%J%j%%%%%%%%J%%%%%%%%%%%%%%%%%%%%j%%%J%%%%
$$ 36 36 36 36 36 36 36 36 36 36 36 36 36 36 36 36 36 35 35 35 35 35 35 35 35 35 35 35 35 36 36 35 35 35 35 35 35 35 35 35 36 36 36 36 36 36 36 36 36 36 36 36 36 36 36 36 36 36 36 36 36 35 35 35 35 36 36 36 36 36
-3353C6%%%%%%%%%%%%%j%%%%%%j%%%%%%%%%%%%%%%%%%%J%%%%%%%%j%%%%%%%%%%J%%%%%j%%
$$ 36 36 36 36 36 36 36 36 36 36 36 36 36 36 35 35 35 35 35 35 35 34 34 34 34 34 34 34 34 34 34 34 34 34 34 34 34 34 34 34 34 35 35 35 35 35 35 35 35 35 34 34 34 34 34 34 34 34 34 34 34 35 35 35 35 35 35 34 34 34
-3401C4%%%%%%Jj%%%%%%%%%%%%%%%%%%%%%%%%%%%%%%%%%%%%%%%%%%%%J%%%j%%%%j%%%%%%%
$$ 34 34 34 34 34 34 34 35 34 34 34 34 34 34 34 34 34 34 34 34 34 34 34 34 34 34 34 34 34 34 34 34 34 34 34 34 34 34 34 34 34 34 34 34 34 34 34 34 34 34 34 34 34 35 35 35 35 34 34 34 34 34 33 33 33 33 33 33 33 33
-3448C3%%%J%%%%%%%%%%%%Jj%%%%%%%%%%%%%%%J%%%%%%%%%%%%%%%%%%%%%%%%%%%%%%J%%%%
$$ 33 33 33 33 34 34 34 34 34 34 34 34 34 34 34 34 34 35 34 34 34 34 34 34 34 34 34 34 34 34 34 34 34 34 35 35 35 35 35 35 35 35 35 35 35 35 35 35 35 35 35 35 35 35 35 35 35 35 35 35 35 35 35 35 35 36 36 36 36 36
-3496C6%%j%%%%%%%%%%%%%%%%%%%%%j%%%%%%%%%%%%%%%%%%%%%%j%%%%%%%%%%%%J%%%%%%j%
$$ 36 36 36 35 35 35 35 35 35 35 35 35 35 35 35 35 35 35 35 35 35 35 35 35 35 34 34 34 34 34 34 34 34 34 34 34 34 34 34 34 34 34 34 34 34 34 34 34 33 33 33 33 33 33 33 33 33 33 33 33 33 34 34 34 34 34 34 34 33 33
-3544C3%%%%j%%%%%%%%J%%%%%%%%j%%%%%%%%%%%%%%J%%%%%%%%%%%j%%%%%J%%%J%%%%%%%j%
$$ 33 33 33 33 33 32 32 32 32 32 32 32 32 32 33 33 33 33 33 33 33 33 33 32 32 32 32 32 32 32 32 32 32 32 32 32 32 32 33 33 33 33 33 33 33 33 33 33 33 33 32 32 32 32 32 32 33 33 33 33 34 34 34 34 34 34 34 34 33 33
-3592C3%%%%%%%%%%J%%j%%%%%%%%%%%%%%%%%%%%%J%%%%%J%%%%%J%j%%%%%j%%%%j%%J%%%%%
$$ 33 33 33 33 33 33 33 33 33 33 33 34 34 34 33 33 33 33 33 33 33 33 33 33 33 33 33 33 33 33 33 33 33 33 33 33 34 34 34 34 34 34 35 35 35 35 35 35 36 36 35 35 35 35 35 35 34 34 34 34 34 33 33 33 34 34 34 34 34 34
-3640C4%J%%%%%%%%%%%%%%%%%%J%%%%%%%%%%%%%%%j%%%%j%%%%%%%%J%%%%j%%%%%%%%%%%%%
$$ 34 34 35 35 35 35 35 35 35 35 35 35 35 35 35 35 35 35 35 35 35 36 36 36 36 36 36 36 36 36 36 36 36 36 36 36 36 35 35 35 35 35 34 34 34 34 34 34 34 34 34 35 35 35 35 35 34 34 34 34 34 34 34 34 34 34 34 34 34 34
-3688C4%%J%%%%%%%%%%%%%%%%%%j%%%%%%%%%j%%%%%%%J%%%%%%%%%%%%j%%%%%%%%%%%%%%%%
$$ 34 34 34 35 35 35 35 35 35 35 35 35 35 35 35 35 35 35 35 35 35 35 34 34 34 34 34 34 34 34 34 34 33 33 33 33 33 33 33 33 34 34 34 34 34 34 34 34 34 34 34 34 34 33 33 33 33 33 33 33 33 33 33 33 33 33 33 33 33 33
-3736C3%%%%%J%%%%%%%j%%%%%%%%%%%%%%%%%%%%%J%j%%%%%%%%j%%%J%j%%%%%%%%%%%%%%%%
$$ 33 33 33 33 33 33 34 34 34 34 34 34 34 34 33 33 33 33 33 33 33 33 33 33 33 33 33 33 33 33 33 33 33 33 33 33 34 34 33 33 33 33 33 33 33 33 33 32 32 32 32 33 33 32 32 32 32 32 32 32 32 32 32 32 32 32 32 32 32 32
-3783C2%%%%%%%%%%%%%%%%%%%%J%%%%%%%%%%%%%%%%%J%%%%%%J%%%%%%%J%%j%%%%%%%%%%%%
$$ 32 32 32 32 32 32 32 32 32 32 32 32 32 32 32 32 32 32 32 32 32 33 33 33 33 33 33 33 33 33 33 33 33 33 33 33 33 33 33 34 34 34 34 34 34 34 35 35 35 35 35 35 35 35 36 36 36 35 35 35 35 35 35 35 35 35 35 35 35 35
-3831C5%%%%%%%%%%%j%%%%%%j%%%%%%%%%%%J%%%%%j%%j%%%%%%J%%%%%%%j%%%%%%%%%%%%J%
$$ 35 35 35 35 35 35 35 35 35 35 35 35 34 34 34 34 34 34 34 33 33 33 33 33 33 33 33 33 33 33 33 34 34 34 34 34 34 33 33 33 32 32 32 32 32 32 32 33 33 33 33 33 33 33 33 32 32 32 32 32 32 32 32 32 32 32 32 32 33 33
-3879C3%%%%%%%%j%%%%%%%%%%%%%%%j%%%%%%%%%%%%%%%%%%%%J%%j%%%%%%%%%%%%%%J%%%%%
$$ 33 33 33 33 33 33 33 33 33 32 32 32 32 32 32 32 32 32 32 32 32 32 32 32 32 31 31 31 31 31 31 31 31 31 31 31 31 31 31 31 31 31 31 31 31 31 32 32 32 31 31 31 31 31 31 31 31 31 31 31 31 31 31 31 32 32 32 32 32 32
-3927C2%%%%%%j%%%%%%J%%%%%%%j%%%%%%%%%J%%%%%%%%j%%%%%%%%%%%%J%%j%%j%%%%%%%%%
$$ 32 32 32 32 32 32 32 31 31 31 31 31 31 31 32 32 32 32 32 32 32 32 31 31 31 31 31 31 31 31 31 31 32 32 32 32 32 32 32 32 32 31 31 31 31 31 31 31 31 31 31 31 31 31 32 32 32 31 31 31 30 30 30 30 30 30 30 30 30 30
-3975C0J%%%J%%%%%%%%%%%%%%%%j%%%%j%%%%%%%%J%%%%%%%%%%%%j%%%%%%%%%%%%%%%%j%J%
$$ 30 31 31 31 31 32 32 32 32 32 32 32 32 32 32 32 32 32 32 32 32 32 31 31 31 31 31 30 30 30 30 30 30 30 30 30 31 31 31 31 31 31 31 31 31 31 31 31 31 30 30 30 30 30 30 30 30 30 30 30 30 30 30 30 30 30 29 29 30 30
-4023C0%%%%%%%%%%%%%%%%%%%%%%%%%%%%%%%%J%%%%%%%%%%%%%%J%j%%%j%%%%%%%%%%%%%%%
$$ 30 30 30 30 30 30 30 30 30 30 30 30 30 30 30 30 30 30 30 30 30 30 30 30 30 30 30 30 30 30 30 30 30 31 31 31 31 31 31 31 31 31 31 31 31 31 31 31 32 32 31 31 31 31 30 30 30 30 30 30 30 30 30 30 30 30 30 30 30 30
-4071C0%%%j%%%%%%%%J%%%%%%%%%%%%%%J%%%%%%%j%%%%%%%%%%%%%%%j%%J%%%%J%%%%%%j%%
$$ 30 30 30 30 29 29 29 29 29 29 29 29 29 30 30 30 30 30 30 30 30 30 30 30 30 30 30 30 31 31 31 31 31 31 31 31 30 30 30 30 30 30 30 30 30 30 30 30 30 30 30 30 29 29 29 30 30 30 30 30 31 31 31 31 31 31 31 30 30 30
-4118C0%%j%%J%%%%%%%%%%%%%j%%%%%%%j%%%%%%%%J%%%%%%%%%%%%%%%%%%%%%%%%%J%%j%%%
$$ 30 30 30 29 29 29 30 30 30 30 30 30 30 30 30 30 30 30 30 30 29 29 29 29 29 29 29 29 28 28 28 28 28 28 28 28 28 29 29 29 29 29 29 29 29 29 29 29 29 29 29 29 29 29 29 29 29 29 29 29 29 29 29 30 30 30 29 29 29 29
-4166B9%%%%%%%%%%%%%J%%%%%%%%%j%%%%%%j%J%%%%%J%%%%%%%%j%%%%%%J%%%%%%%j%%%%%%
$$ 29 29 29 29 29 29 29 29 29 29 29 29 29 29 30 30 30 30 30 30 30 30 30 30 29 29 29 29 29 29 29 28 28 29 29 29 29 29 29 30 30 30 30 30 30 30 30 30 29 29 29 29 29 29 29 30 30 30 30 30 30 30 30 29 29 29 29 29 29 29
-4214B9%j%%%%%%%J%%%%%%%%%%J%%%%%%j%%%%j%%J%%%%%%%%J%j%%%%%%%%%%%%%%%%J%%%%%
$$ 29 29 28 28 28 28 28 28 28 28 29 29 29 29 29 29 29 29 29 29 29 30 30 30 30 30 30 30 29 29 29 29 29 28 28 28 29 29 29 29 29 29 29 29 29 30 30 29 29 29 29 29 29 29 29 29 29 29 29 29 29 29 29 29 30 30 30 30 30 30
-4262C0%%%%%%%%%%%%%%j%%%%%%%%J%%%%%%%%%%%%%%j%%%%%%%%%%%%%%%%%%%%%%%%%j%%J%
$$ 30 30 30 30 30 30 30 30 30 30 30 30 30 30 30 29 29 29 29 29 29 29 29 29 30 30 30 30 30 30 30 30 30 30 30 30 30 30 30 29 29 29 29 29 29 29 29 29 29 29 29 29 29 29 29 29 29 29 29 29 29 29 29 29 29 28 28 28 29 29
-4310B9%%%%%%j%%%%%%%J%%%j%%J%%%%j%%%%%%%J%%%%%%%%%%%%%%%%%%%%%j%%%%%%J%%%%%
$$ 29 29 29 29 29 29 29 28 28 28 28 28 28 28 28 29 29 29 29 28 28 28 29 29 29 29 29 28 28 28 28 28 28 28 28 29 29 29 29 29 29 29 29 29 29 29 29 29 29 29 29 29 29 29 29 29 29 28 28 28 28 28 28 28 29 29 29 29 29 29
-4358B9%%%%%j%%%%%%%%%%%%%%%%%J%%%%j%%%%%%%%%%J%%j%%%%%J%%j%%%%J%%%%%%%%%%%%
$$ 29 29 29 29 29 29 28 28 28 28 28 28 28 28 28 28 28 28 28 28 28 28 28 28 29 29 29 29 29 28 28 28 28 28 28 28 28 28 28 28 29 29 29 28 28 28 28 28 28 29 29 29 28 28 28 28 28 29 29 29 29 29 29 29 29 29 29 29 29 29
-4406B9%%%%%%%%%%%%j%%%%%%%%%%%%%%%%%%%%%%%%%%%j%%%J%%%%%%%J%%%j%%%%%%%%%%%%
$$ 29 29 29 29 29 29 29 29 29 29 29 29 29 28 28 28 28 28 28 28 28 28 28 28 28 28 28 28 28 28 28 28 28 28 28 28 28 28 28 28 28 27 27 27 27 28 28 28 28 28 28 28 28 29 29 29 29 28 28 28 28 28 28 28 28 28 28 28 28 28
-4453B8%%%%j%%%%J%%%%%%%J%%%%%%%%%%%%%%%%%%%%%j%%%%%%%%%%%%%%%%%%%%%%%%%%%%%
$$ 28 28 28 28 28 27 27 27 27 27 28 28 28 28 28 28 28 28 29 29 29 29 29 29 29 29 29 29 29 29 29 29 29 29 29 29 29 29 29 29 28 28 28 28 28 28 28 28 28 28 28 28 28 28 28 28 28 28 28 28 28 28 28 28 28 28 28 28 28 28
-4501B8%%%%%%%%%%%%%%%%%%%%%%%%%%%%%%%%%%%%%%%%%%j%%%%%%%%%%%%%%%%%%%%%J%%%%
$$ 28 28 28 28 28 28 28 28 28 28 28 28 28 28 28 28 28 28 28 28 28 28 28 28 28 28 28 28 28 28 28 28 28 28 28 28 28 28 28 28 28 28 28 27 27 27 27 27 27 27 27 27 27 27 27 27 27 27 27 27 27 27 27 27 27 28 28 28 28 28
-4549B8%%%%%%%%%%%%%%%%%%%%%%%%%%%%%%%%%%%%%%%%%j%%%%%%jJ%%%%%%%%%%%%%%%%%%%
$$ 28 28 28 28 28 28 28 28 28 28 28 28 28 28 28 28 28 28 28 28 28 28 28 28 28 28 28 28 28 28 28 28 28 28 28 28 28 28 28 28 28 28 27 27 27 27 27 27 27 26 27 27 27 27 27 27 27 27 27 27 27 27 27 27 27 27 27 27 27 27
-4597B7%%%%%%%%%%%%%%%%%%%%%j%J%%%%%%%%%%J%%%%%%%%%%%%%%%%%%%%%%%%%j%%%%%%%%
$$ 27 27 27 27 27 27 27 27 27 27 27 27 27 27 27 27 27 27 27 27 27 27 26 26 27 27 27 27 27 27 27 27 27 27 27 28 28 28 28 28 28 28 28 28 28 28 28 28 28 28 28 28 28 28 28 28 28 28 28 28 28 27 27 27 27 27 27 27 27 27
-4645B7%%%%%J%%%%%%jJ%%%%%%%%%%%%%%%%%%%%%%%%%%%%%%%j%%%J%%%%%%%%%j%%%%%%%%%
$$ 27 27 27 27 27 27 28 28 28 28 28 28 28 27 28 28 28 28 28 28 28 28 28 28 28 28 28 28 28 28 28 28 28 28 28 28 28 28 28 28 28 28 28 28 28 28 27 27 27 27 28 28 28 28 28 28 28 28 28 28 27 27 27 27 27 27 27 27 27 27
-4693B7%%%%%%%%%%%%j%%%%J%%%%%%%%%%%%%%%%%%%%%j%J%%%%%%%%%%%%%%%%%%%%%%%%%%J
$$ 27 27 27 27 27 27 27 27 27 27 27 27 27 26 26 26 26 26 27 27 27 27 27 27 27 27 27 27 27 27 27 27 27 27 27 27 27 27 27 27 26 26 27 27 27 27 27 27 27 27 27 27 27 27 27 27 27 27 27 27 27 27 27 27 27 27 27 27 27 28
-4741B8%%%%%%%%%%%%%j%%%%%%%%%%%%%%%%%%%%%%%%%%%%%%%%%%j%%%%%%j%%J%%%%%%%%%%
$$ 28 28 28 28 28 28 28 28 28 28 28 28 28 28 27 27 27 27 27 27 27 27 27 27 27 27 27 27 27 27 27 27 27 27 27 27 27 27 27 27 27 27 27 27 27 27 27 27 27 26 26 26 26 26 26 26 25 25 25 26 26 26 26 26 26 26 26 26 26 26
-4788B6j%%%%%J%%%J%%%%%%%%%%%%%j%%%%%%%%J%%%%%%%%%%%%j%%%%%%%%j%%J%%%J%%%%%%
$$ 26 25 25 25 25 25 25 26 26 26 26 27 27 27 27 27 27 27 27 27 27 27 27 27 27 26 26 26 26 26 26 26 26 26 27 27 27 27 27 27 27 27 27 27 27 27 27 26 26 26 26 26 26 26 26 26 25 25 25 26 26 26 26 27 27 27 27 27 27 27
-4836B7%%%%%%%%%%%%%%j%%%%%%%j%%%%%%%%%%%%%%%%%%%%%%%%%%%%%J%%%%%%%%%%%%J%%%
$$ 27 27 27 27 27 27 27 27 27 27 27 27 27 27 27 26 26 26 26 26 26 26 26 25 25 25 25 25 25 25 25 25 25 25 25 25 25 25 25 25 25 25 25 25 25 25 25 25 25 25 25 25 25 26 26 26 26 26 26 26 26 26 26 26 26 26 27 27 27 27
-4884B7%%%%%%j%%%%%%%%j%%J%%%%%%%%%%%%%%%%%%%%%%%%%%j%%%%%%%%%%J%%%%%%%%%%%%
$$ 27 27 27 27 27 27 27 26 26 26 26 26 26 26 26 26 25 25 25 26 26 26 26 26 26 26 26 26 26 26 26 26 26 26 26 26 26 26 26 26 26 26 26 26 26 26 25 25 25 25 25 25 25 25 25 25 25 26 26 26 26 26 26 26 26 26 26 26 26 26
-4932B6%%%%%%%%%%%%%%J%%%%%%%%%%%%%%%%%%%%%%%%%%%%%%%%j%%%%%%%%%%%%%%%%%%%J%
$$ 26 26 26 26 26 26 26 26 26 26 26 26 26 26 26 27 27 27 27 27 27 27 27 27 27 27 27 27 27 27 27 27 27 27 27 27 27 27 27 27 27 27 27 27 27 27 27 27 26 26 26 26 26 26 26 26 26 26 26 26 26 26 26 26 26 26 26 26 27 27
-4980B7%%%%%%%%%Jj%%%%%j%%%%j%%%%%%%%%%%%%J%%%%%j%%%%%%%%%%%%JjJj%%%%%%%%%%%
$$ 27 27 27 27 27 27 27 27 27 27 28 27 27 27 27 27 27 26 26 26 26 26 25 25 25 25 25 25 25 25 25 25 25 25 25 25 26 26 26 26 26 26 25 25 25 25 25 25 25 25 25 25 25 25 25 26 25 26 25 25 25 25 25 25 25 25 25 25 25 25
-5028B5%%J%%%%%%j%%%%%%%%%%%%%J%%%%%%%%%%%%%%%%%%%j%%%%%%%%J%%%%%j%%%J%%%%%%
$$ 25 25 25 26 26 26 26 26 26 26 25 25 25 25 25 25 25 25 25 25 25 25 25 25 26 26 26 26 26 26 26 26 26 26 26 26 26 26 26 26 26 26 26 26 25 25 25 25 25 25 25 25 25 26 26 26 26 26 26 25 25 25 25 26 26 26 26 26 26 26
-5076B6%%%%%j%%%%%%%%%%%%%%J%%%%%%%%%%%%%%%%%%%%%%%%J%%%j%%%%%%%%%%%%%%%%%%%
$$ 26 26 26 26 26 26 25 25 25 25 25 25 25 25 25 25 25 25 25 25 25 26 26 26 26 26 26 26 26 26 26 26 26 26 26 26 26 26 26 26 26 26 26 26 26 26 27 27 27 27 26 26 26 26 26 26 26 26 26 26 26 26 26 26 26 26 26 26 26 26
-5123B6%%%%%%%%%%%%%%%%%%%%%%%%%%%%%%J%%%%%%%%j%%%%%%%%%%%%j%%%%%%%%%%%%%%%j
$$ 26 26 26 26 26 26 26 26 26 26 26 26 26 26 26 26 26 26 26 26 26 26 26 26 26 26 26 26 26 26 26 27 27 27 27 27 27 27 27 27 26 26 26 26 26 26 26 26 26 26 26 26 26 25 25 25 25 25 25 25 25 25 25 25 25 25 25 25 25 24
-5171B4%J%%%%%%%%%%%J%%%%%%%%%%%%%j%%%%%%%J%%%%%%%%J%%%%%%%%%%%%%%j%%%%%%%%%
$$ 24 24 25 25 25 25 25 25 25 25 25 25 25 25 26 26 26 26 26 26 26 26 26 26 26 26 26 26 25 25 25 25 25 25 25 25 26 26 26 26 26 26 26 26 26 27 27 27 27 27 27 27 27 27 27 27 27 27 27 27 26 26 26 26 26 26 26 26 26 26
-5219B6%%%%j%%%%j%%%%%J%%%%%%%%%j%%%%J%%%%%%%%%%j%%%%%%%%%%%%%%%%%%%J%%%%%%%
$$ 26 26 26 26 26 25 25 25 25 25 24 24 24 24 24 24 25 25 25 25 25 25 25 25 25 25 24 24 24 24 24 25 25 25 25 25 25 25 25 25 25 25 24 24 24 24 24 24 24 24 24 24 24 24 24 24 24 24 24 24 24 24 25 25 25 25 25 25 25 25
-5267B5%%%%%%%%%%%%j%%%J%%%%%%%%%%%%%%%%%%%%%%%%%%%%%%%J%%%%%%%%%%%%%%%%%%%%
$$ 25 25 25 25 25 25 25 25 25 25 25 25 25 24 24 24 24 25 25 25 25 25 25 25 25 25 25 25 25 25 25 25 25 25 25 25 25 25 25 25 25 25 25 25 25 25 25 25 25 26 26 26 26 26 26 26 26 26 26 26 26 26 26 26 26 26 26 26 26 26
-5315B6%%%%%%%%%j%%J%%%%%%%%%%%%%%%%%j%%%%%J%%j%%%%%%%J%%%%%%%%%%%%j%%%%%%%%
$$ 26 26 26 26 26 26 26 26 26 26 25 25 25 26 26 26 26 26 26 26 26 26 26 26 26 26 26 26 26 26 26 25 25 25 25 25 25 26 26 26 25 25 25 25 25 25 25 25 26 26 26 26 26 26 26 26 26 26 26 26 26 25 25 25 25 25 25 25 25 25
-5363B5%%%%%%%%%%%%%%%%%%%J%%%%%j%%j%%%%%%J%%%%%%%%%Jj%%%%%%%%%%%%%%%%%%%%%%
$$ 25 25 25 25 25 25 25 25 25 25 25 25 25 25 25 25 25 25 25 25 26 26 26 26 26 26 25 25 25 24 24 24 24 24 24 24 25 25 25 25 25 25 25 25 25 25 26 25 25 25 25 25 25 25 25 25 25 25 25 25 25 25 25 25 25 25 25 25 25 25
-5411B5%%%%%%%%%%%%%%%j%%%%%%%%%%J%%%%%%%%%%%j%%%%%%%%%%%%%%%%%%%%J%%%%%%%%%
$$ 25 25 25 25 25 25 25 25 25 25 25 25 25 25 25 25 24 24 24 24 24 24 24 24 24 24 24 25 25 25 25 25 25 25 25 25 25 25 25 24 24 24 24 24 24 24 24 24 24 24 24 24 24 24 24 24 24 24 24 24 25 25 25 25 25 25 25 25 25 25
-5458B5%%%%%%j%%%%J%%%%%%%%%%%%%%%%%%%%%%%%%%%%%%%%%%%%%%J%%%j%%%%%%%%%%%%%j
$$ 25 25 25 25 25 25 25 24 24 24 24 24 25 25 25 25 25 25 25 25 25 25 25 25 25 25 25 25 25 25 25 25 25 25 25 25 25 25 25 25 25 25 25 25 25 25 25 25 25 25 25 26 26 26 26 25 25 25 25 25 25 25 25 25 25 25 25 25 25 24
-5506B4%%%%jJ%%%%%%%%J%%%%%%%%%%%%%%%%j%%%%%%%%%%J%%j%J%%%%%%%%%%%%%j%%%%J%%
$$ 24 24 24 24 24 23 24 24 24 24 24 24 24 24 24 25 25 25 25 25 25 25 25 25 25 25 25 25 25 25 25 25 24 24 24 24 24 24 24 24 24 24 24 25 25 25 24 24 25 25 25 25 25 25 25 25 25 25 25 25 25 25 24 24 24 24 24 25 25 25
-5554B5%%%%%%j%%%%%%%%%%%%%%%%J%%%%%%%%%%%%j%%%%J%%%%%%%%%%%j%%%%%%%%%%%%J%%
$$ 25 25 25 25 25 25 25 24 24 24 24 24 24 24 24 24 24 24 24 24 24 24 24 24 25 25 25 25 25 25 25 25 25 25 25 25 25 24 24 24 24 24 25 25 25 25 25 25 25 25 25 25 25 25 24 24 24 24 24 24 24 24 24 24 24 24 24 25 25 25
-5602B5%%%%%%%%%%j%%%%%%%%%Jj%%%%%%%%%%%%j%%%%%%%%%%J%%%%%%%%%%J%%%%%j%%%%J%
$$ 25 25 25 25 25 25 25 25 25 25 25 24 24 24 24 24 24 24 24 24 24 25 24 24 24 24 24 24 24 24 24 24 24 24 24 23 23 23 23 23 23 23 23 23 23 23 24 24 24 24 24 24 24 24 24 24 24 25 25 25 25 25 25 24 24 24 24 24 25 25
-5650B5%%%%%%j%%%%%%%%%%%%J%%%%%%%j%%%%%%%%%%%%%%J%%%%%%%%%%%%%%%%%%%%%j%%%%
$$ 25 25 25 25 25 25 25 24 24 24 24 24 24 24 24 24 24 24 24 24 25 25 25 25 25 25 25 25 24 24 24 24 24 24 24 24 24 24 24 24 24 24 24 25 25 25 25 25 25 25 25 25 25 25 25 25 25 25 25 25 25 25 25 25 25 24 24 24 24 24
-5698B4%%J%%%%%%%j%J%%%%%%%%jJ%%%%%%j%%%%%%%%%%%%%%%j%%%J%%%J%%%%%j%%%%J%j%J
$$ 24 24 24 25 25 25 25 25 25 25 25 24 24 25 25 25 25 25 25 25 25 25 24 25 25 25 25 25 25 25 24 24 24 24 24 24 24 24 24 24 24 24 24 24 24 24 23 23 23 23 24 24 24 24 25 25 25 25 25 25 24 24 24 24 24 25 25 24 24 25
-5746B5%%%%%%j%%%%%%%%j%%%%J%%%%%%%%%%%%%%%%J%%j%%%%%%%%%%%%%%%%%%%%%%%%J%%%
$$ 25 25 25 25 25 25 25 24 24 24 24 24 24 24 24 24 23 23 23 23 23 24 24 24 24 24 24 24 24 24 24 24 24 24 24 24 24 24 25 25 25 24 24 24 24 24 24 24 24 24 24 24 24 24 24 24 24 24 24 24 24 24 24 24 24 24 25 25 25 25
-5793B5%%%%%%%%%%%%%%%%%%%j%%%%%%%%%%%%j%%%%%%%%%%J%%%%%%%%%%%%%%%%%%%%%%%%%
$$ 25 25 25 25 25 25 25 25 25 25 25 25 25 25 25 25 25 25 25 25 24 24 24 24 24 24 24 24 24 24 24 24 24 23 23 23 23 23 23 23 23 23 23 23 24 24 24 24 24 24 24 24 24 24 24 24 24 24 24 24 24 24 24 24 24 24 24 24 24 24
-5841B4%%%%%%%%%%%%%%%%%%%%%%%%%%%J%%%%%%%%j%%%%%%%%%%%%%%%%%%%%%j%%%%J%%%%%
$$ 24 24 24 24 24 24 24 24 24 24 24 24 24 24 24 24 24 24 24 24 24 24 24 24 24 24 24 24 25 25 25 25 25 25 25 25 25 24 24 24 24 24 24 24 24 24 24 24 24 24 24 24 24 24 24 24 24 24 24 23 23 23 23 23 24 24 24 24 24 24
-5889B4%%%%%%J%%%%%%j%%%%%%%%%%%%%J%%%%%%%%%%%%%%%j%%%%%%%%%J%%j%%%%%%%%%%%%
$$ 24 24 24 24 24 24 24 25 25 25 25 25 25 25 24 24 24 24 24 24 24 24 24 24 24 24 24 24 25 25 25 25 25 25 25 25 25 25 25 25 25 25 25 25 24 24 24 24 24 24 24 24 24 24 25 25 25 24 24 24 24 24 24 24 24 24 24 24 24 24
-5937B4%%%%%%%%%%%%%%%%%%J%%%%%%%%%%%%j%%j%%%%%%%%%%J%%%%%%%%%%%%%J%j%%%%j%%
$$ 24 24 24 24 24 24 24 24 24 24 24 24 24 24 24 24 24 24 24 25 25 25 25 25 25 25 25 25 25 25 25 25 24 24 24 23 23 23 23 23 23 23 23 23 23 23 24 24 24 24 24 24 24 24 24 24 24 24 24 24 25 25 24 24 24 24 24 23 23 23
-5985B3%%%J%%%%%%%%%%%%%%%%%%%%%%%%%%%%%%%%%%%j%J%%%%%%%%%%%%%%%%%%%%%%%%%%%
$$ 23 23 23 23 24 24 24 24 24 24 24 24 24 24 24 24 24 24 24 24 24 24 24 24 24 24 24 24 24 24 24 24 24 24 24 24 24 24 24 24 23 23 24 24 24 24 24 24 24 24 24 24 24 24 24 24 24 24 24 24 24 24 24 24 24 24 24 24 24 24
-6033B4%%%%%%J%%j%%%%%%%%%%%%%%%j%%%%%%%%%%%%%%%%%%%%%%%%%%J%%%%%%%j%%%%%%J%
$$ 24 24 24 24 24 24 24 25 25 25 24 24 24 24 24 24 24 24 24 24 24 24 24 24 24 24 23 23 23 23 23 23 23 23 23 23 23 23 23 23 23 23 23 23 23 23 23 23 23 23 23 23 23 24 24 24 24 24 24 24 24 23 23 23 23 23 23 23 24 24
-6081B4%%%%%%%%%%%%%j%%%%%%%%%%J%%%%%%%%%%%j%%%%%%%%%%%%%%%%%%%%%%%J%%%%%%%%
$$ 24 24 24 24 24 24 24 24 24 24 24 24 24 24 23 23 23 23 23 23 23 23 23 23 23 24 24 24 24 24 24 24 24 24 24 24 24 23 23 23 23 23 23 23 23 23 23 23 23 23 23 23 23 23 23 23 23 23 23 23 23 24 24 24 24 24 24 24 24 24
-6128B4%%%j%%%%%%%J%%%%%%%%%%%%%%%%%%%%%%%%%%%%%%%%%%J%%%%j%%%%j%%%%%%%%%%%%
$$ 24 24 24 24 23 23 23 23 23 23 23 23 24 24 24 24 24 24 24 24 24 24 24 24 24 24 24 24 24 24 24 24 24 24 24 24 24 24 24 24 24 24 24 24 24 24 24 25 25 25 25 25 24 24 24 24 24 23 23 23 23 23 23 23 23 23 23 23 23 23
-6176B3%%%%%%%%%%%%%%Jj%%%%%%%%%%%J%%%%%%%%%j%%%%%J%%%%%%%j%%%%%%%%%%%%%%%%%
$$ 23 23 23 23 23 23 23 23 23 23 23 23 23 23 23 24 23 23 23 23 23 23 23 23 23 23 23 23 24 24 24 24 24 24 24 24 24 24 23 23 23 23 23 23 24 24 24 24 24 24 24 24 23 23 23 23 23 23 23 23 23 23 23 23 23 23 23 23 23 23
-6224B3%%%%J%%%%%%%j%%%%%%%%%%%%%%%%J%%%%%%%%j%%%%%%%%%%%%j%%%J%%%%%%%%%%%%%
$$ 23 23 23 23 23 24 24 24 24 24 24 24 24 23 23 23 23 23 23 23 23 23 23 23 23 23 23 23 23 23 24 24 24 24 24 24 24 24 24 23 23 23 23 23 23 23 23 23 23 23 23 23 22 22 22 22 23 23 23 23 23 23 23 23 23 23 23 23 23 23
-6272B3%%%%%%%%%J%%j%%%%%j%%%%%%%%J%%%J%%%%%j%%%%%%%%%%%%%%%%%%%%%%%%%%%%%%%
$$ 23 23 23 23 23 23 23 23 23 23 24 24 24 23 23 23 23 23 23 22 22 22 22 22 22 22 22 22 23 23 23 23 24 24 24 24 24 24 23 23 23 23 23 23 23 23 23 23 23 23 23 23 23 23 23 23 23 23 23 23 23 23 23 23 23 23 23 23 23 23
-6320B3%%%%%%%%%%%%%%%%%%%j%%%%J%%%%%%%%%%%%j%%%%%%%%%J%%j%J%%%%%%%%%%%%%%%%
$$ 23 23 23 23 23 23 23 23 23 23 23 23 23 23 23 23 23 23 23 23 22 22 22 22 22 23 23 23 23 23 23 23 23 23 23 23 23 23 22 22 22 22 22 22 22 22 22 22 23 23 23 22 22 23 23 23 23 23 23 23 23 23 23 23 23 23 23 23 23 23
-6368B3%%%%j%J%%%j%%%%%%%%%%%%%%%%%%%%%%%%%%%%%%%%%%%%%%J%%%%%%%%%%%%%%%%%%%
$$ 23 23 23 23 23 22 22 23 23 23 23 22 22 22 22 22 22 22 22 22 22 22 22 22 22 22 22 22 22 22 22 22 22 22 22 22 22 22 22 22 22 22 22 22 22 22 22 22 22 22 23 23 23 23 23 23 23 23 23 23 23 23 23 23 23 23 23 23 23 23
-6416B3%%%%%%%%%%%%%%%J%%%%%j%%%%%%%%%%%%%%%%%%%%%%%%%%%%%%J%%%%%%%%%%%%%%%j
$$ 23 23 23 23 23 23 23 23 23 23 23 23 23 23 23 23 24 24 24 24 24 24 23 23 23 23 23 23 23 23 23 23 23 23 23 23 23 23 23 23 23 23 23 23 23 23 23 23 23 23 23 23 23 24 24 24 24 24 24 24 24 24 24 24 24 24 24 24 24 23
-6463B3%%%%J%%%%%j%%J%%%%%j%%%%%%%%%%%%%%%J%%%%%%%%j%%%%%%%%%%%%%%%Jj%%%%%%%
$$ 23 23 23 23 23 24 24 24 24 24 24 23 23 23 24 24 24 24 24 24 23 23 23 23 23 23 23 23 23 23 23 23 23 23 23 23 24 24 24 24 24 24 24 24 24 23 23 23 23 23 23 23 23 23 23 23 23 23 23 23 23 24 23 23 23 23 23 23 23 23
-6511B3J%%%%%%%%%%%j%%%%%%%%j%J%%%%%%%%%%%J%%%%%%%%%%%%%%j%J%%%%j%%%%%%%%%%%
$$ 23 24 24 24 24 24 24 24 24 24 24 24 24 23 23 23 23 23 23 23 23 23 22 22 23 23 23 23 23 23 23 23 23 23 23 23 24 24 24 24 24 24 24 24 24 24 24 24 24 24 24 23 23 24 24 24 24 24 23 23 23 23 23 23 23 23 23 23 23 23
-6559B3%%%%%%%%%%%%%%J%j%%%%%%%%%%%%J%j%%%%%J%j%%%%%%%%%%%%%%j%%%%%%J%%%%%%%
$$ 23 23 23 23 23 23 23 23 23 23 23 23 23 23 23 24 24 23 23 23 23 23 23 23 23 23 23 23 23 23 24 24 23 23 23 23 23 23 24 24 23 23 23 23 23 23 23 23 23 23 23 23 23 23 23 22 22 22 22 22 22 22 23 23 23 23 23 23 23 23
-6607B3%%%%%%%%%%%%%%%%%%%%%J%%%%%j%%%%%%%%%%%%%%%%%%%%%%%%%%%%%%%%%%%%%%%%%
$$ 23 23 23 23 23 23 23 23 23 23 23 23 23 23 23 23 23 23 23 23 23 23 24 24 24 24 24 24 23 23 23 23 23 23 23 23 23 23 23 23 23 23 23 23 23 23 23 23 23 23 23 23 23 23 23 23 23 23 23 23 23 23 23 23 23 23 23 23 23 23
-6655B3%%%%%%%%%%%%%%%%%J%j%%%%%%%%%J%%%%%%%%%%%%%%%%%%%%%j%%%%%%%%%j%%J%%%%
$$ 23 23 23 23 23 23 23 23 23 23 23 23 23 23 23 23 23 23 24 24 23 23 23 23 23 23 23 23 23 23 24 24 24 24 24 24 24 24 24 24 24 24 24 24 24 24 24 24 24 24 24 24 23 23 23 23 23 23 23 23 23 23 22 22 22 23 23 23 23 23
-6703B3%%%%J%%%%%%%%%%%%%%%%%%%%%%%%jJ%%%%j%%%%%%%%%%%%%%%%%%%%%%%j%%%%%%%%%
$$ 23 23 23 23 23 24 24 24 24 24 24 24 24 24 24 24 24 24 24 24 24 24 24 24 24 24 24 24 24 24 23 24 24 24 24 24 23 23 23 23 23 23 23 23 23 23 23 23 23 23 23 23 23 23 23 23 23 23 23 23 22 22 22 22 22 22 22 22 22 22
-6751B2%%%%%%%%%%%%%%%%j%J%%%%%%%%%%%J%%%%%%%%%%%J%%%%%%%%%j%%j%%%%J%%%%%%%%
$$ 22 22 22 22 22 22 22 22 22 22 22 22 22 22 22 22 22 21 21 22 22 22 22 22 22 22 22 22 22 22 22 23 23 23 23 23 23 23 23 23 23 23 23 24 24 24 24 24 24 24 24 24 24 23 23 23 22 22 22 22 22 23 23 23 23 23 23 23 23 23
-6798B3%%%%%%%%%%j%%%%%%%%%%%%%%%%%%%%%%%%%%%%%%%%%%%%%%%%%%%%%J%%%%%%%%%%%%
$$ 23 23 23 23 23 23 23 23 23 23 23 22 22 22 22 22 22 22 22 22 22 22 22 22 22 22 22 22 22 22 22 22 22 22 22 22 22 22 22 22 22 22 22 22 22 22 22 22 22 22 22 22 22 22 22 22 22 23 23 23 23 23 23 23 23 23 23 23 23 23
-6846B3%%%%%%%%j%%%J%%%%%%%%j%%%%%%%%%%%%%%%%%%%%j%J%%%%%%%%%%%%%%%J%%%%%%%%
$$ 23 23 23 23 23 23 23 23 23 22 22 22 22 23 23 23 23 23 23 23 23 23 22 22 22 22 22 22 22 22 22 22 22 22 22 22 22 22 22 22 22 22 22 21 21 22 22 22 22 22 22 22 22 22 22 22 22 22 22 22 22 23 23 23 23 23 23 23 23 23
-6894B3%%%%%%%%Jj%%%j%%%%%%%%%%%%%%%%%%J%%%%%%%%%%%%%%%%%%%%%%%%%%%%%%%%%%%%
$$ 23 23 23 23 23 23 23 23 23 24 23 23 23 23 22 22 22 22 22 22 22 22 22 22 22 22 22 22 22 22 22 22 22 23 23 23 23 23 23 23 23 23 23 23 23 23 23 23 23 23 23 23 23 23 23 23 23 23 23 23 23 23 23 23 23 23 23 23 23 23
-6942B3%%%j%%%j%%%%J%%%%%%%%%%J%%%%%%%%%%%%%%%%%j%%%J%%%%j%%%%%j%%J%%%%%%%%%
$$ 23 23 23 23 22 22 22 22 21 21 21 21 21 22 22 22 22 22 22 22 22 22 22 22 23 23 23 23 23 23 23 23 23 23 23 23 23 23 23 23 23 23 22 22 22 22 23 23 23 23 23 22 22 22 22 22 22 21 21 21 22 22 22 22 22 22 22 22 22 22
-6990B2%%%%%%%J%%%%%%%%%%%%%%%jJ%%%%%%%%%%%%%%%%j%%%%%%%%%%J%%%%%%%%%%%%j%%%
$$ 22 22 22 22 22 22 22 22 23 23 23 23 23 23 23 23 23 23 23 23 23 23 23 23 22 23 23 23 23 23 23 23 23 23 23 23 23 23 23 23 23 23 22 22 22 22 22 22 22 22 22 22 22 23 23 23 23 23 23 23 23 23 23 23 23 23 22 22 22 22
-7038B2%%%%%%%%%J%%%%%%%%%%%%%%%%%%%%%%%%%%%%%%j%%%%%%%%%%%%%%%%%%%%%%%J%%%%
$$ 22 22 22 22 22 22 22 22 22 22 23 23 23 23 23 23 23 23 23 23 23 23 23 23 23 23 23 23 23 23 23 23 23 23 23 23 23 23 23 23 23 22 22 22 22 22 22 22 22 22 22 22 22 22 22 22 22 22 22 22 22 22 22 22 22 23 23 23 23 23
-7086B3J%%%%%j%%%%%%%%%%%%%%%j%%%%%%%%%%%%%%%%J%%j%%%%%%%%%%%%%%%%%%%%%%%%J%
$$ 23 24 24 24 24 24 24 23 23 23 23 23 23 23 23 23 23 23 23 23 23 23 23 22 22 22 22 22 22 22 22 22 22 22 22 22 22 22 22 22 23 23 23 22 22 22 22 22 22 22 22 22 22 22 22 22 22 22 22 22 22 22 22 22 22 22 22 22 23 23
-7133B3%%%j%%%%%%%%%%%%%%%%j%%%%%%J%%%%%%%%%%%J%%%%%%%j%%%%%%%%%%%%%%j%%%%%%
$$ 23 23 23 23 22 22 22 22 22 22 22 22 22 22 22 22 22 22 22 22 22 21 21 21 21 21 21 21 22 22 22 22 22 22 22 22 22 22 22 22 23 23 23 23 23 23 23 23 22 22 22 22 22 22 22 22 22 22 22 22 22 22 22 21 21 21 21 21 21 21
-7181B1J%%%%%%%%%%%%%%%J%%%%%%%j%%%%%%%%%%j%%%%%%%%%J%%%%j%%%%%J%%%%%%%%%%%%
$$ 21 22 22 22 22 22 22 22 22 22 22 22 22 22 22 22 22 23 23 23 23 23 23 23 23 22 22 22 22 22 22 22 22 22 22 22 21 21 21 21 21 21 21 21 21 21 22 22 22 22 22 21 21 21 21 21 21 22 22 22 22 22 22 22 22 22 22 22 22 22
-7229B2%%%%%%%%%J%%%%%%%%%j%%%%%%%%%J%%%j%J%%%%j%%J%%%%%%j%%%%%%%%%%%%%%%J%%
$$ 22 22 22 22 22 22 22 22 22 22 23 23 23 23 23 23 23 23 23 23 22 22 22 22 22 22 22 22 22 22 23 23 23 23 22 22 23 23 23 23 23 22 22 22 23 23 23 23 23 23 23 22 22 22 22 22 22 22 22 22 22 22 22 22 22 22 22 23 23 23
-7277B3%%%%%%%%%%%%%%%%%%%j%%%%j%%%%%J%%%%%%%J%j%%%%%%%J%%%%j%%%%%J%%%%%%%%%
$$ 23 23 23 23 23 23 23 23 23 23 23 23 23 23 23 23 23 23 23 23 22 22 22 22 22 21 21 21 21 21 21 22 22 22 22 22 22 22 22 23 23 22 22 22 22 22 22 22 22 23 23 23 23 23 22 22 22 22 22 22 23 23 23 23 23 23 23 23 23 23
-7325B3j%%%%%%%jJ%%%%%%%%%%%%%%%%%J%%%%%%j%%%%%J%%%%%%%%%%%%%%%%%%j%%%%%%%%j
$$ 23 22 22 22 22 22 22 22 22 21 22 22 22 22 22 22 22 22 22 22 22 22 22 22 22 22 22 22 23 23 23 23 23 23 23 22 22 22 22 22 22 23 23 23 23 23 23 23 23 23 23 23 23 23 23 23 23 23 23 23 22 22 22 22 22 22 22 22 22 21
-7373B1%%%%%%%%%%%%%%%%%%%%%%J%%%%%%%%%%%%%%%%%%%j%%J%%%%%%%%%j%%%%%%%%%%%%%
$$ 21 21 21 21 21 21 21 21 21 21 21 21 21 21 21 21 21 21 21 21 21 21 21 22 22 22 22 22 22 22 22 22 22 22 22 22 22 22 22 22 22 22 22 21 21 21 22 22 22 22 22 22 22 22 22 22 21 21 21 21 21 21 21 21 21 21 21 21 21 21
-7421B1%%%J%%%%%J%%%%%%%j%%%%%%%%%%%%%%%%%%%%%%%%%%%%%%%%%%%%%%%%%%%%%%%%%%%
$$ 21 21 21 21 22 22 22 22 22 22 23 23 23 23 23 23 23 23 22 22 22 22 22 22 22 22 22 22 22 22 22 22 22 22 22 22 22 22 22 22 22 22 22 22 22 22 22 22 22 22 22 22 22 22 22 22 22 22 22 22 22 22 22 22 22 22 22 22 22 22
-7468B2%%%%%%%%%%%%%J%j%%%%%%%%%%%%%%j%%%%%%%%%%%%%J%%%%J%%%%%%%%j%%%%%%%%%%
$$ 22 22 22 22 22 22 22 22 22 22 22 22 22 22 23 23 22 22 22 22 22 22 22 22 22 22 22 22 22 22 22 21 21 21 21 21 21 21 21 21 21 21 21 21 21 22 22 22 22 22 23 23 23 23 23 23 23 23 23 22 22 22 22 22 22 22 22 22 22 22
-7516B2%%%%%%J%%%%%%%%j%%%%Jj%%%%%%%%%%%%%%%%%%%%j%%%%%%%%J%%%%%%%%%%%%%%%%%
$$ 22 22 22 22 22 22 22 23 23 23 23 23 23 23 23 23 22 22 22 22 22 23 22 22 22 22 22 22 22 22 22 22 22 22 22 22 22 22 22 22 22 22 22 21 21 21 21 21 21 21 21 21 22 22 22 22 22 22 22 22 22 22 22 22 22 22 22 22 22 22
-7564B2%%%%%%J%%j%%%%%%%%%%%%%%%%%%%%%%%%%%%%%%%%%%%%%%%J%%%%%%%%%%%%%%j%%%%
$$ 22 22 22 22 22 22 22 23 23 23 22 22 22 22 22 22 22 22 22 22 22 22 22 22 22 22 22 22 22 22 22 22 22 22 22 22 22 22 22 22 22 22 22 22 22 22 22 22 22 22 23 23 23 23 23 23 23 23 23 23 23 23 23 23 23 22 22 22 22 22
-7612B2%j%%J%%%%%%%%%%%%%%%%%%%%%%%%%%%%%%%%%%%%%%%%%%%%%%%%%%%j%%%%%J%%%%%%
$$ 22 22 21 21 21 22 22 22 22 22 22 22 22 22 22 22 22 22 22 22 22 22 22 22 22 22 22 22 22 22 22 22 22 22 22 22 22 22 22 22 22 22 22 22 22 22 22 22 22 22 22 22 22 22 22 22 22 21 21 21 21 21 21 22 22 22 22 22 22 22
-7660B2%%%%%%%%%j%J%%%%%%%%%%%%j%%%%%%%%%%%%%%%%%J%%%%%%%%j%%%%%%%%%%%%%%%%%
$$ 22 22 22 22 22 22 22 22 22 22 21 21 22 22 22 22 22 22 22 22 22 22 22 22 22 21 21 21 21 21 21 21 21 21 21 21 21 21 21 21 21 21 21 22 22 22 22 22 22 22 22 22 21 21 21 21 21 21 21 21 21 21 21 21 21 21 21 21 21 21
-7708B1%%J%%%%%%%%%%%%%%%%%%%%%%%%%%%%%%%%%%%%%j%%%%%%%%%%%%%%%J%%%%%j%%%%%%
$$ 21 21 21 22 22 22 22 22 22 22 22 22 22 22 22 22 22 22 22 22 22 22 22 22 22 22 22 22 22 22 22 22 22 22 22 22 22 22 22 22 22 21 21 21 21 21 21 21 21 21 21 21 21 21 21 21 21 22 22 22 22 22 22 21 21 21 21 21 21 21
-7756B1%%%%%%%%%%%%J%%%%j%%%%%%%%%%J%%%%%%%%%%%%%%%%%j%%%%%%%%%%%%%%Jj%%%%%%
$$ 21 21 21 21 21 21 21 21 21 21 21 21 21 22 22 22 22 22 21 21 21 21 21 21 21 21 21 21 21 22 22 22 22 22 22 22 22 22 22 22 22 22 22 22 22 22 22 21 21 21 21 21 21 21 21 21 21 21 21 21 21 21 22 21 21 21 21 21 21 21
-7803B1%J%%%%%j%%J%%%%%%j%%%J%%J%%%%%%%%%%%%%%%%%%%%%%%%%%%%%%%%%%%%%j%%%%%%
$$ 21 21 22 22 22 22 22 22 21 21 21 22 22 22 22 22 22 22 21 21 21 21 22 22 22 23 23 23 23 23 23 23 23 23 23 23 23 23 23 23 23 23 23 23 23 23 23 23 23 23 23 23 23 23 23 23 23 23 23 23 23 23 23 22 22 22 22 22 22 22
-7851B2%%%%%%%%%%%%%%%%j%J%%%%%%%%%j%%%%%J%%%%%%%%%%%%%%%%%%%%%%%j%%%%%%%%J%
$$ 22 22 22 22 22 22 22 22 22 22 22 22 22 22 22 22 22 21 21 22 22 22 22 22 22 22 22 22 22 21 21 21 21 21 21 22 22 22 22 22 22 22 22 22 22 22 22 22 22 22 22 22 22 22 22 22 22 22 22 21 21 21 21 21 21 21 21 21 22 22
-7899B2%%%%%%%%%%%%%%%%%%%%J%%%%%%j%%%%%%%%%%%%%%%%%%%%%%j%%%J%j%%%J%%%%%%%%
$$ 22 22 22 22 22 22 22 22 22 22 22 22 22 22 22 22 22 22 22 22 22 23 23 23 23 23 23 23 22 22 22 22 22 22 22 22 22 22 22 22 22 22 22 22 22 22 22 22 22 22 22 21 21 21 21 22 22 21 21 21 21 22 22 22 22 22 22 22 22 22
-7947B2%%%%%%%%%%%%%%%%%%%%%%%%j%%%%%%%J%%%%%%%%%%%%%%%%%%%%j%%%%%%%%%%%%J%%
$$ 22 22 22 22 22 22 22 22 22 22 22 22 22 22 22 22 22 22 22 22 22 22 22 22 22 21 21 21 21 21 21 21 21 22 22 22 22 22 22 22 22 22 22 22 22 22 22 22 22 22 22 22 22 22 21 21 21 21 21 21 21 21 21 21 21 21 21 22 22 22
-7995B2%%%j%%J%%%%%%%%%%%%%%%%j%%%%j%J%%%%%%%%%%%%J%%%%%%%%%%%%%%%%%%%%%J%%%
$$ 22 22 22 22 21 21 21 22 22 22 22 22 22 22 22 22 22 22 22 22 22 22 22 22 21 21 21 21 21 20 20 21 21 21 21 21 21 21 21 21 21 21 21 21 22 22 22 22 22 22 22 22 22 22 22 22 22 22 22 22 22 22 22 22 22 22 23 23 23 23
-8043B3%%%j%%%%%%%%%%%%%%%%%%%%%%%%%%%%%%%%%%J%j%%%%%%%%%%%%%%%%%j%%%J%%j%%%
$$ 23 23 23 23 22 22 22 22 22 22 22 22 22 22 22 22 22 22 22 22 22 22 22 22 22 22 22 22 22 22 22 22 22 22 22 22 22 22 22 23 23 22 22 22 22 22 22 22 22 22 22 22 22 22 22 22 22 22 22 21 21 21 21 22 22 22 21 21 21 21
-8091B1%%%J%%%%%%%%%%%%%%%%%%%%%%%%%%%%%%%%%%%%J%%%%%%%j%%%%%%%%%%%%%%%%%%J%
$$ 21 21 21 21 22 22 22 22 22 22 22 22 22 22 22 22 22 22 22 22 22 22 22 22 22 22 22 22 22 22 22 22 22 22 22 22 22 22 22 22 22 23 23 23 23 23 23 23 23 22 22 22 22 22 22 22 22 22 22 22 22 22 22 22 22 22 22 22 23 23
-8138B3%%j%%%%%%%%%%%%%%%%%%%%%%%%%%%%j%%%%%%%%%%%%%%%%%J%%%%%%%%j%%%%%%%%%%
$$ 23 23 23 22 22 22 22 22 22 22 22 22 22 22 22 22 22 22 22 22 22 22 22 22 22 22 22 22 22 22 22 22 21 21 21 21 21 21 21 21 21 21 21 21 21 21 21 21 21 21 22 22 22 22 22 22 22 22 22 21 21 21 21 21 21 21 21 21 21 21
-8186B1%J%%%%%%%%%%%%%%%%%%%%%%%%%%Jj%%%%%%%%%%%%j%%%%%%%%%%%J%%%%%%%%%%%%j%
$$ 21 21 22 22 22 22 22 22 22 22 22 22 22 22 22 22 22 22 22 22 22 22 22 22 22 22 22 22 22 23 22 22 22 22 22 22 22 22 22 22 22 22 22 21 21 21 21 21 21 21 21 21 21 21 21 22 22 22 22 22 22 22 22 22 22 22 22 22 21 21
-8234B1%%%%%%%%%%%%%%%%%%%%%%%%%%%%%%%%%%%J%%%%%%%%%%%%%%%%%%%%%%%%%%%%%%%J%
$$ 21 21 21 21 21 21 21 21 21 21 21 21 21 21 21 21 21 21 21 21 21 21 21 21 21 21 21 21 21 21 21 21 21 21 21 21 22 22 22 22 22 22 22 22 22 22 22 22 22 22 22 22 22 22 22 22 22 22 22 22 22 22 22 22 22 22 22 22 23 23
-8282B3%%%%j%%%%j%%%%%%%%%%%%%%%%j%%J%%%%%%%%J%%%%%%j%%%%j%%%%%%%J%%%J%%%%%%
$$ 23 23 23 23 23 22 22 22 22 22 21 21 21 21 21 21 21 21 21 21 21 21 21 21 21 21 21 20 20 20 21 21 21 21 21 21 21 21 21 22 22 22 22 22 22 22 21 21 21 21 21 20 20 20 20 20 20 20 20 21 21 21 21 22 22 22 22 22 22 22
-8330B2%%%%j%%%%%%%%%%%J%%%j%%%%%%%%J%%%%%%%%%%%%j%J%%%%%%%%%%%%%%%%%%%%%%%%
$$ 22 22 22 22 22 21 21 21 21 21 21 21 21 21 21 21 21 22 22 22 22 21 21 21 21 21 21 21 21 21 22 22 22 22 22 22 22 22 22 22 22 22 22 21 21 22 22 22 22 22 22 22 22 22 22 22 22 22 22 22 22 22 22 22 22 22 22 22 22 22
-8378B2%%%%%%%%%%%j%%%%%%%%%%%%%%%%%%%%%%%%J%%%%%%%%%%%%%%%%j%%%%%%%%%%%J%%%
$$ 22 22 22 22 22 22 22 22 22 22 22 22 21 21 21 21 21 21 21 21 21 21 21 21 21 21 21 21 21 21 21 21 21 21 21 21 21 22 22 22 22 22 22 22 22 22 22 22 22 22 22 22 22 22 21 21 21 21 21 21 21 21 21 21 21 21 22 22 22 22
-8426B2%%%%j%%%%%%%%%%%%%%%%%%%%%%%%%J%%%%%%j%%%%%%%%%%%j%%%J%%%J%%j%%%%%%J%
$$ 22 22 22 22 22 21 21 21 21 21 21 21 21 21 21 21 21 21 21 21 21 21 21 21 21 21 21 21 21 21 21 22 22 22 22 22 22 22 21 21 21 21 21 21 21 21 21 21 21 21 20 20 20 20 21 21 21 21 22 22 22 21 21 21 21 21 21 21 22 22
-8473B2%%%%%%%%jJ%%%%%%%%%%j%%%%%%j%%%%%%%%%%%%%%%%%%J%%%%%%%%%%%%%%%%%%%%%%
$$ 22 22 22 22 22 22 22 22 22 21 22 22 22 22 22 22 22 22 22 22 22 21 21 21 21 21 21 21 20 20 20 20 20 20 20 20 20 20 20 20 20 20 20 20 20 20 20 21 21 21 21 21 21 21 21 21 21 21 21 21 21 21 21 21 21 21 21 21 21 21
-8521B1%%%%%%%%%%%%%%%%%j%%%%%%%%%%J%%%%%%%%%%%%%%%%%%%%%%%%%%%%%%%%%%%%%%%%
$$ 21 21 21 21 21 21 21 21 21 21 21 21 21 21 21 21 21 21 20 20 20 20 20 20 20 20 20 20 20 21 21 21 21 21 21 21 21 21 21 21 21 21 21 21 21 21 21 21 21 21 21 21 21 21 21 21 21 21 21 21 21 21 21 21 21 21 21 21 21 21
-8569B1%%%%%%%%%%%%%%%%%%%%%%%%%%%%%%%%%%%%%%%%%%%%%%%%%%%%%%%%%J%%%j%%%%%%%
$$ 21 21 21 21 21 21 21 21 21 21 21 21 21 21 21 21 21 21 21 21 21 21 21 21 21 21 21 21 21 21 21 21 21 21 21 21 21 21 21 21 21 21 21 21 21 21 21 21 21 21 21 21 21 21 21 21 21 21 22 22 22 22 21 21 21 21 21 21 21 21
-8617B1%%%%%%%%J%%%%%%%%%%%%%%%%%%%%j%%J%%%%%%%%%%%%%%%J%j%%%%%j%%%%%%%%J%%%
$$ 21 21 21 21 21 21 21 21 21 22 22 22 22 22 22 22 22 22 22 22 22 22 22 22 22 22 22 22 22 22 21 21 21 22 22 22 22 22 22 22 22 22 22 22 22 22 22 22 22 23 23 22 22 22 22 22 22 21 21 21 21 21 21 21 21 21 22 22 22 22
-8665B2%%%%j%%%J%%%%%j%%%%%%%%%%%%%%%%%%J%%%j%%%%%%%%%%%%%%%%%%%%J%%%%%%%%%%
$$ 22 22 22 22 22 21 21 21 21 22 22 22 22 22 22 21 21 21 21 21 21 21 21 21 21 21 21 21 21 21 21 21 21 21 22 22 22 22 21 21 21 21 21 21 21 21 21 21 21 21 21 21 21 21 21 21 21 21 21 22 22 22 22 22 22 22 22 22 22 22
-8713B2%%%%j%%%%%%%%%%%%%j%%%%%%%%%%%%%%%J%%%%%%%%j%%%J%%%%%%%%%%%J%%%%%%%%%
$$ 22 22 22 22 22 21 21 21 21 21 21 21 21 21 21 21 21 21 21 20 20 20 20 20 20 20 20 20 20 20 20 20 20 20 20 21 21 21 21 21 21 21 21 21 20 20 20 20 21 21 21 21 21 21 21 21 21 21 21 21 22 22 22 22 22 22 22 22 22 22
-8761B2%j%%%%%jJ%%%%%J%%j%%%%%j%%%%%J%%%%%%%%%%%%%%%%%%%%%%%%%%J%%%%%%%%%%%%
$$ 22 22 21 21 21 21 21 21 20 21 21 21 21 21 21 22 22 22 21 21 21 21 21 21 20 20 20 20 20 20 21 21 21 21 21 21 21 21 21 21 21 21 21 21 21 21 21 21 21 21 21 21 21 21 21 21 21 22 22 22 22 22 22 22 22 22 22 22 22 22
-8808B2%%j%%%%%Jj%%%%%%%%%%%%%%%%%%%J%%%%%%%%%%%j%%%%%%%j%%%%%%J%%%%%%%%%%%%
$$ 22 22 22 21 21 21 21 21 21 22 21 21 21 21 21 21 21 21 21 21 21 21 21 21 21 21 21 21 21 21 22 22 22 22 22 22 22 22 22 22 22 22 21 21 21 21 21 21 21 21 20 20 20 20 20 20 20 21 21 21 21 21 21 21 21 21 21 21 21 21
-8856B1%%%%%%%%%J%%%%%%%%%%%%%%%%%%%%j%%%J%%%%J%%%%%%%j%%%j%%%%%%%%%%%j%%%%%
$$ 21 21 21 21 21 21 21 21 21 21 22 22 22 22 22 22 22 22 22 22 22 22 22 22 22 22 22 22 22 22 22 21 21 21 21 22 22 22 22 22 23 23 23 23 23 23 23 23 22 22 22 22 21 21 21 21 21 21 21 21 21 21 21 21 20 20 20 20 20 20
-8904B0%J%%%%%%%%%%%%%%%%%%%%%%%%%j%%%J%%%%%%%%%%%%%%%%J%%%%%%j%%%%%%%%%%%%%
$$ 20 20 21 21 21 21 21 21 21 21 21 21 21 21 21 21 21 21 21 21 21 21 21 21 21 21 21 21 20 20 20 20 21 21 21 21 21 21 21 21 21 21 21 21 21 21 21 21 21 22 22 22 22 22 22 22 21 21 21 21 21 21 21 21 21 21 21 21 21 21
-8952B1%%%%%%%%%%%%%%%%%%%%%%%%%j%J%%%%%%J%%%%%%%%%%%%%%%%%%%%%%%%%%%%%%%%%%
$$ 21 21 21 21 21 21 21 21 21 21 21 21 21 21 21 21 21 21 21 21 21 21 21 21 21 21 20 20 21 21 21 21 21 21 21 22 22 22 22 22 22 22 22 22 22 22 22 22 22 22 22 22 22 22 22 22 22 22 22 22 22 22 22 22 22 22 22 22 22 22
-9000B2%%%%%%%%%%%%%j%%%%%%%%%%%%%J%%%%%j%J%%%%%%%%%%%%%j%%%%%%%%%%%%%%J%%%J
$$ 22 22 22 22 22 22 22 22 22 22 22 22 22 22 21 21 21 21 21 21 21 21 21 21 21 21 21 21 22 22 22 22 22 22 21 21 22 22 22 22 22 22 22 22 22 22 22 22 22 22 21 21 21 21 21 21 21 21 21 21 21 21 21 21 21 22 22 22 22 23
-9048B3%%%%j%%%j%%%%%%%%%%%%%%%J%%%%%j%%J%%%%%%%j%%%J%%%%%%%%j%%%%%%%%%%%%%J
$$ 23 23 23 23 23 22 22 22 22 21 21 21 21 21 21 21 21 21 21 21 21 21 21 21 21 22 22 22 22 22 22 21 21 21 22 22 22 22 22 22 22 22 21 21 21 21 22 22 22 22 22 22 22 22 22 21 21 21 21 21 21 21 21 21 21 21 21 21 21 22
-9096B2j%%%%%%%%%%%%%%%%%%%%%%%J%%%%%%%%%j%%%%%%%%j%%%%%J%j%%%%%%J%%%%%%%%%%
$$ 22 21 21 21 21 21 21 21 21 21 21 21 21 21 21 21 21 21 21 21 21 21 21 21 21 22 22 22 22 22 22 22 22 22 22 21 21 21 21 21 21 21 21 21 20 20 20 20 20 20 21 21 20 20 20 20 20 20 20 21 21 21 21 21 21 21 21 21 21 21
-9143B1%%j%%%%%%%%%%%J%%%%J%%%%j%%%%%%%%%%%%%%%%%Jj%%%%%%%%%%%%%j%%%%%%%%%%J
$$ 21 21 21 20 20 20 20 20 20 20 20 20 20 20 20 21 21 21 21 21 22 22 22 22 22 21 21 21 21 21 21 21 21 21 21 21 21 21 21 21 21 21 21 22 21 21 21 21 21 21 21 21 21 21 21 21 21 21 20 20 20 20 20 20 20 20 20 20 20 21
-9191B1%%%%J%%j%%%%%%J%%%%%%%%%%%%%j%%%%%%%%%%%%%%%%%%%%%j%%J%%%%%%%%%%%%%%%
$$ 21 21 21 21 21 22 22 22 21 21 21 21 21 21 21 22 22 22 22 22 22 22 22 22 22 22 22 22 22 21 21 21 21 21 21 21 21 21 21 21 21 21 21 21 21 21 21 21 21 21 21 20 20 20 21 21 21 21 21 21 21 21 21 21 21 21 21 21 21 21
-9239B1%%%%%%Jj%%%%%%%%%%%%%%%%%%%J%j%%%%%%%%%%%%%%%%%%%%%%J%j%%%%%%%%%%%%%%
$$ 21 21 21 21 21 21 21 22 21 21 21 21 21 21 21 21 21 21 21 21 21 21 21 21 21 21 21 21 22 22 21 21 21 21 21 21 21 21 21 21 21 21 21 21 21 21 21 21 21 21 21 21 21 22 22 21 21 21 21 21 21 21 21 21 21 21 21 21 21 21
-9287B1%%%%%%%%%j%%%%J%%%%%%%%%%%%J%%%%%j%%%%%%%%%%%%%%%%%%%j%%%%J%%%%%%%%%%
$$ 21 21 21 21 21 21 21 21 21 21 20 20 20 20 20 21 21 21 21 21 21 21 21 21 21 21 21 21 22 22 22 22 22 22 21 21 21 21 21 21 21 21 21 21 21 21 21 21 21 21 21 21 21 21 20 20 20 20 20 21 21 21 21 21 21 21 21 21 21 21
-9335B1%%%%%%%%%%%%%%%%%%j%%%%%J%%%J%%%%%%%%%j%%%%%j%%%%%%%%%%%%%%%%%%%%%J%%
$$ 21 21 21 21 21 21 21 21 21 21 21 21 21 21 21 21 21 21 21 20 20 20 20 20 20 21 21 21 21 22 22 22 22 22 22 22 22 22 22 21 21 21 21 21 21 20 20 20 20 20 20 20 20 20 20 20 20 20 20 20 20 20 20 20 20 20 20 21 21 21
-9383B1%%J%%%%%%%%%%%%%%%j%%%%%%%%%%%%j%%%%%%%%%J%%%%%%%%%%%%%%%%%%%%%%%%%%%
$$ 21 21 21 22 22 22 22 22 22 22 22 22 22 22 22 22 22 22 22 21 21 21 21 21 21 21 21 21 21 21 21 21 20 20 20 20 20 20 20 20 20 20 21 21 21 21 21 21 21 21 21 21 21 21 21 21 21 21 21 21 21 21 21 21 21 21 21 21 21 21
-9431B1%%%J%%%j%%%%%%%%%%%%%%%%%%%%%%%%%%%%%%%%%%%j%%%%%%%%%%%J%%%%%%%j%%%%%
$$ 21 21 21 21 22 22 22 22 21 21 21 21 21 21 21 21 21 21 21 21 21 21 21 21 21 21 21 21 21 21 21 21 21 21 21 21 21 21 21 21 21 21 21 21 20 20 20 20 20 20 20 20 20 20 20 20 21 21 21 21 21 21 21 21 20 20 20 20 20 20
-9478B0%%%J%%%%%%%%%%J%j%%%%j%%J%%%%%%%%%%%%%%%%%%%%%%%%j%%%%%%%%J%%%%%%%%%%
$$ 20 20 20 20 21 21 21 21 21 21 21 21 21 21 21 22 22 21 21 21 21 21 20 20 20 21 21 21 21 21 21 21 21 21 21 21 21 21 21 21 21 21 21 21 21 21 21 21 21 21 20 20 20 20 20 20 20 20 20 21 21 21 21 21 21 21 21 21 21 21
-9526B1%%%%%%%%%%%%%%%%%%%%%%J%%%%%%%%j%%%J%%%%j%%%%j%%%%%J%%%%j%%%%%J%%%%%%
$$ 21 21 21 21 21 21 21 21 21 21 21 21 21 21 21 21 21 21 21 21 21 21 21 22 22 22 22 22 22 22 22 22 21 21 21 21 22 22 22 22 22 21 21 21 21 21 20 20 20 20 20 20 21 21 21 21 21 20 20 20 20 20 20 21 21 21 21 21 21 21
-9574B1%%%%%%%%%%%%%%%%%%%%%%%%%%%%%%%%%%%%J%%%j%%%%%%%%%%%%%%%%%%%%%%%%%%%%
$$ 21 21 21 21 21 21 21 21 21 21 21 21 21 21 21 21 21 21 21 21 21 21 21 21 21 21 21 21 21 21 21 21 21 21 21 21 21 22 22 22 22 21 21 21 21 21 21 21 21 21 21 21 21 21 21 21 21 21 21 21 21 21 21 21 21 21 21 21 21 21
-9622B1%%%%%j%%%%J%j%%%%%%%Jj%%%%%%J%%%%%%%%%%%%%%%%%%%%j%%%%%%%%%J%%%%%%%%%
$$ 21 21 21 21 21 21 20 20 20 20 20 21 21 20 20 20 20 20 20 20 20 21 20 20 20 20 20 20 20 21 21 21 21 21 21 21 21 21 21 21 21 21 21 21 21 21 21 21 21 21 20 20 20 20 20 20 20 20 20 20 21 21 21 21 21 21 21 21 21 21
-9670B1%%%%%%%%%%%%%%%%%%%%%%J%j%%%%%%j%%%%%%%%%%%%%%%%%%%%%%%%%J%%%%%%%%%%%
$$ 21 21 21 21 21 21 21 21 21 21 21 21 21 21 21 21 21 21 21 21 21 21 21 22 22 21 21 21 21 21 21 21 20 20 20 20 20 20 20 20 20 20 20 20 20 20 20 20 20 20 20 20 20 20 20 20 20 20 21 21 21 21 21 21 21 21 21 21 21 21
-9718B1j%%%%%%%%%%%%%%%%J%%%J%%%j%%%%%%%%%%%%%%j%%%%%%%J%%%%%%%%j%%%%J%%%%%%
$$ 21 20 20 20 20 20 20 20 20 20 20 20 20 20 20 20 20 20 21 21 21 21 22 22 22 22 21 21 21 21 21 21 21 21 21 21 21 21 21 21 21 20 20 20 20 20 20 20 20 21 21 21 21 21 21 21 21 21 20 20 20 20 20 21 21 21 21 21 21 21
-9766B1%%%%%%%%%%%%%%%%%j%%J%%%%%%%%%%%%%%%%%%%%%%%%%%%%%%%%%%%%J%%%%%%%%%%%
$$ 21 21 21 21 21 21 21 21 21 21 21 21 21 21 21 21 21 21 20 20 20 21 21 21 21 21 21 21 21 21 21 21 21 21 21 21 21 21 21 21 21 21 21 21 21 21 21 21 21 21 21 21 21 21 21 21 21 21 22 22 22 22 22 22 22 22 22 22 22 22
-9813B2%%j%%%%%%%%%%%%%%%%j%%J%%%%%%%%%%%%%%%%%%%%%%%%%%%%%%j%%%%%%%%%%%%J%%
$$ 22 22 22 21 21 21 21 21 21 21 21 21 21 21 21 21 21 21 21 21 20 20 20 21 21 21 21 21 21 21 21 21 21 21 21 21 21 21 21 21 21 21 21 21 21 21 21 21 21 21 21 21 21 21 20 20 20 20 20 20 20 20 20 20 20 20 20 21 21 21
-9861B1%%%%%%%%%%%%%%j%%%%%J%%%%%%%%%%%%%%%%%%%%%%%j%%J%%%%%%j%%%%%%%%%%%%%%
$$ 21 21 21 21 21 21 21 21 21 21 21 21 21 21 21 20 20 20 20 20 20 21 21 21 21 21 21 21 21 21 21 21 21 21 21 21 21 21 21 21 21 21 21 21 21 20 20 20 21 21 21 21 21 21 21 20 20 20 20 20 20 20 20 20 20 20 20 20 20 20
-9909B0%%%%%%J%%%%%%%%j%%%%%%%%J%%%J%%%%%%%%%%%j%%%%%%j%%%%%%j%%%%J%%%J%%%%%
$$ 20 20 20 20 20 20 20 21 21 21 21 21 21 21 21 21 20 20 20 20 20 20 20 20 20 21 21 21 21 22 22 22 22 22 22 22 22 22 22 22 22 21 21 21 21 21 21 21 20 20 20 20 20 20 20 19 19 19 19 19 20 20 20 20 21 21 21 21 21 21
-9957B1%%%%%%%%%%%%%%%%%%%%%jJ%%%%%%%j%%%%%%%%%%%%%%%%%%%%J%%%%%%%%%%%%%%%%%
$$ 21 21 21 21 21 21 21 21 21 21 21 21 21 21 21 21 21 21 21 21 21 21 20 21 21 21 21 21 21 21 21 20 20 20 20 20 20 20 20 20 20 20 20 20 20 20 20 20 20 20 20 20 21 21 21 21 21 21 21 21 21 21 21 21 21 21 21 21 21 21
-10005B1j%%%%J%%%%%%%%%%%%%%%%%%%%%%Jj%%%%%%%%%%%%j%%J%%%%%%J%%%j%%%%j%%%%%%
$$ 21 20 20 20 20 20 21 21 21 21 21 21 21 21 21 21 21 21 21 21 21 21 21 21 21 21 21 21 21 22 21 21 21 21 21 21 21 21 21 21 21 21 21 20 20 20 21 21 21 21 21 21 21 22 22 22 22 21 21 21 21 21 20 20 20 20 20 20 20
-10052B0%%%%J%%%%%%%%%%j%%%%%j%%%%J%%%%%%%%%%%J%%%%%%%%%%%%%%%%%%j%%%%%%%%%%
$$ 20 20 20 20 20 21 21 21 21 21 21 21 21 21 21 21 20 20 20 20 20 20 19 19 19 19 19 20 20 20 20 20 20 20 20 20 20 20 20 21 21 21 21 21 21 21 21 21 21 21 21 21 21 21 21 21 21 21 20 20 20 20 20 20 20 20 20 20 20
-10099B0J%%J%%%%%%%%%%%%%%%%%%j%%%%%%%%%%%%%%%%%%%%%%%%%j%%J%%%%%j%%%%%%%%J%
$$ 20 21 21 21 22 22 22 22 22 22 22 22 22 22 22 22 22 22 22 22 22 22 22 21 21 21 21 21 21 21 21 21 21 21 21 21 21 21 21 21 21 21 21 21 21 21 21 21 21 20 20 20 21 21 21 21 21 21 20 20 20 20 20 20 20 20 20 21 21
-10146B1%%%%%%%%%%%%%%%%j%%%%J%%%%%%%%%%%%%%%%%%%%%%%%%%%%%%%%%%%%%%%%%%%%%%
$$ 21 21 21 21 21 21 21 21 21 21 21 21 21 21 21 21 21 20 20 20 20 20 21 21 21 21 21 21 21 21 21 21 21 21 21 21 21 21 21 21 21 21 21 21 21 21 21 21 21 21 21 21 21 21 21 21 21 21 21 21 21 21 21 21 21 21 21 21 21
-10193B1%%%%%%%%%%%%%%%%%%%%Jj%%%%%%%J%%%%%%%%j%%%%%%%%%%%%%%%%%%%%%%%%%%%%%
$$ 21 21 21 21 21 21 21 21 21 21 21 21 21 21 21 21 21 21 21 21 21 22 21 21 21 21 21 21 21 21 22 22 22 22 22 22 22 22 22 21 21 21 21 21 21 21 21 21 21 21 21 21 21 21 21 21 21 21 21 21 21 21 21 21 21 21 21 21 21
-10241B1j%%%%%%%%%%%%%%%%%%%%%%%%%%%%%%%%%%J%%%j%%%%%%%%%%%%%%%%%%%%%%J%%%%%
$$ 21 20 20 20 20 20 20 20 20 20 20 20 20 20 20 20 20 20 20 20 20 20 20 20 20 20 20 20 20 20 20 20 20 20 20 20 21 21 21 21 20 20 20 20 20 20 20 20 20 20 20 20 20 20 20 20 20 20 20 20 20 20 20 21 21 21 21 21 21
-10288B1%%%%%%%%%%%%%%%%%%%%j%%J%%%%%%%%%%%%%%%%%j%%%%%%%%%%%%%%%%%%%%J%%%%%
$$ 21 21 21 21 21 21 21 21 21 21 21 21 21 21 21 21 21 21 21 21 21 20 20 20 21 21 21 21 21 21 21 21 21 21 21 21 21 21 21 21 21 21 20 20 20 20 20 20 20 20 20 20 20 20 20 20 20 20 20 20 20 20 20 21 21 21 21 21 21
-10335B1j%%j%%%%%%%%%%%%%%%J%%%%%%%%%%%%%%%J%%%%%%%%%%%%%%%%%%%%%%%j%%J%%%%%
$$ 21 20 20 20 19 19 19 19 19 19 19 19 19 19 19 19 19 19 19 19 20 20 20 20 20 20 20 20 20 20 20 20 20 20 20 20 21 21 21 21 21 21 21 21 21 21 21 21 21 21 21 21 21 21 21 21 21 21 21 21 20 20 20 21 21 21 21 21 21
-10382B1%%%%%%%%%%%%%%%%%%%%%%%%%j%%%%%%%%J%%%%%%%%%%%%%%%%%j%%%%%%%%%%%%%%%
$$ 21 21 21 21 21 21 21 21 21 21 21 21 21 21 21 21 21 21 21 21 21 21 21 21 21 21 20 20 20 20 20 20 20 20 20 21 21 21 21 21 21 21 21 21 21 21 21 21 21 21 21 21 21 20 20 20 20 20 20 20 20 20 20 20 20 20 20 20 20
-10429B0%%%j%%%%%%%%%%%J%%%%J%%%%%%J%%%%%%%%j%%%%%%%%%%%%%%%%%%%j%%%%%%%J%J%
$$ 20 20 20 20 19 19 19 19 19 19 19 19 19 19 19 19 20 20 20 20 20 21 21 21 21 21 21 21 22 22 22 22 22 22 22 22 22 21 21 21 21 21 21 21 21 21 21 21 21 21 21 21 21 21 21 21 21 20 20 20 20 20 20 20 20 21 21 22 22
-10476B2%%%%%%%%%j%%%%%%%%%%%%j%%J%%%%%%%%%%j%J%%%%%j%%%%%%%%%%%%%%%%%%%%%%%
$$ 22 22 22 22 22 22 22 22 22 22 21 21 21 21 21 21 21 21 21 21 21 21 21 20 20 20 21 21 21 21 21 21 21 21 21 21 21 20 20 21 21 21 21 21 21 20 20 20 20 20 20 20 20 20 20 20 20 20 20 20 20 20 20 20 20 20 20 20 20
-10524B0%%%%%%%%j%%%%%%%%%%%%%J%%%%%%%%%%%%%%%%J%%%%%%%%%%%%%%%%%%%%%%%%%%%%
$$ 20 20 20 20 20 20 20 20 20 19 19 19 19 19 19 19 19 19 19 19 19 19 19 20 20 20 20 20 20 20 20 20 20 20 20 20 20 20 20 20 21 21 21 21 21 21 21 21 21 21 21 21 21 21 21 21 21 21 21 21 21 21 21 21 21 21 21 21 21
-10571B1%%%%%%%%%%%%%%j%%%%%%%J%%%j%%%%%%%J%%%%j%%%%%%%%%%%%%%%%%%%%%%%%%%%%
$$ 21 21 21 21 21 21 21 21 21 21 21 21 21 21 21 20 20 20 20 20 20 20 20 21 21 21 21 20 20 20 20 20 20 20 20 21 21 21 21 21 20 20 20 20 20 20 20 20 20 20 20 20 20 20 20 20 20 20 20 20 20 20 20 20 20 20 20 20 20
-10618B0%%%%%%%%j%%J%%J%%%%%j%%J%%%%j%%%%%%%%%%%%%%%%%%%%%j%%%%%%%%%%%%%%%%%
$$ 20 20 20 20 20 20 20 20 20 19 19 19 20 20 20 21 21 21 21 21 21 20 20 20 21 21 21 21 21 20 20 20 20 20 20 20 20 20 20 20 20 20 20 20 20 20 20 20 20 20 20 19 19 19 19 19 19 19 19 19 19 19 19 19 19 19 19 19 19
-10665A9J%j%%%%%%%%J%%%%%%%%%%%%%%%%%%J%%%%%%%%%%%%j%%%%%%%%%%%%%%%%%%J%j%%%
$$ 19 20 20 19 19 19 19 19 19 19 19 19 20 20 20 20 20 20 20 20 20 20 20 20 20 20 20 20 20 20 20 21 21 21 21 21 21 21 21 21 21 21 21 21 20 20 20 20 20 20 20 20 20 20 20 20 20 20 20 20 20 20 20 21 21 20 20 20 20
-10712B0%%%%%%%%%%%%%J%j%%%%%%%%%%J%%%J%%%%%%%%%j%%j%%%%J%%%%%%%%%%%%%%%%%%%
$$ 20 20 20 20 20 20 20 20 20 20 20 20 20 20 21 21 20 20 20 20 20 20 20 20 20 20 20 21 21 21 21 22 22 22 22 22 22 22 22 22 22 21 21 21 20 20 20 20 20 21 21 21 21 21 21 21 21 21 21 21 21 21 21 21 21 21 21 21 21
-10759B1%%j%%%%%%%%%%%%%%%%%%%J%%%%%%%%%%%%j%%%%%%%%%%%%J%%j%%%J%%%Jj%%%%%%%
$$ 21 21 21 20 20 20 20 20 20 20 20 20 20 20 20 20 20 20 20 20 20 20 20 21 21 21 21 21 21 21 21 21 21 21 21 21 20 20 20 20 20 20 20 20 20 20 20 20 20 21 21 21 20 20 20 20 21 21 21 21 22 21 21 21 21 21 21 21 21
-10807B1%j%%%%%J%%%%%j%%%%J%%%%%%j%%%%%%%J%%%%%%%%%j%%J%%%%%%%%%%%%%%%%%%%%%
$$ 21 21 20 20 20 20 20 20 21 21 21 21 21 21 20 20 20 20 20 21 21 21 21 21 21 21 20 20 20 20 20 20 20 20 21 21 21 21 21 21 21 21 21 21 20 20 20 21 21 21 21 21 21 21 21 21 21 21 21 21 21 21 21 21 21 21 21 21 21
-10854B1%%%%%%%%%%%%%%%%%%%%%%%%%%%%%%%%j%%%%%%%%%%%%%%%%%%%%%%%%%%%%%%%%%%%
$$ 21 21 21 21 21 21 21 21 21 21 21 21 21 21 21 21 21 21 21 21 21 21 21 21 21 21 21 21 21 21 21 21 21 20 20 20 20 20 20 20 20 20 20 20 20 20 20 20 20 20 20 20 20 20 20 20 20 20 20 20 20 20 20 20 20 20 20 20 20
-10901B0%%%J%%%%%%%%%%%%j%%%%%%%%%%%%%%%%%%%%%%J%%%%%j%%%%%%%%%%%%%%%%%%%%%%
$$ 20 20 20 20 21 21 21 21 21 21 21 21 21 21 21 21 21 20 20 20 20 20 20 20 20 20 20 20 20 20 20 20 20 20 20 20 20 20 20 20 21 21 21 21 21 21 20 20 20 20 20 20 20 20 20 20 20 20 20 20 20 20 20 20 20 20 20 20 20
-10948B0%J%%%%%%%%%%%%%j%%%%%%%%%%%%J%%%%j%%%%%%J%%%%%j%%%%%%%%j%%%%%%%J%%%%
$$ 20 20 21 21 21 21 21 21 21 21 21 21 21 21 21 21 20 20 20 20 20 20 20 20 20 20 20 20 20 21 21 21 21 21 20 20 20 20 20 20 20 21 21 21 21 21 21 20 20 20 20 20 20 20 20 20 19 19 19 19 19 19 19 19 20 20 20 20 20
-10995B0%%%%%%%%%%%%%%%%%%%%%%%J%%%%%%%%%j%%J%%%%%j%%%%%%%%J%j%%%%%%%%%%%%%%
$$ 20 20 20 20 20 20 20 20 20 20 20 20 20 20 20 20 20 20 20 20 20 20 20 20 21 21 21 21 21 21 21 21 21 21 20 20 20 21 21 21 21 21 21 20 20 20 20 20 20 20 20 20 21 21 20 20 20 20 20 20 20 20 20 20 20 20 20 20 20
-11042B0J%%%%%j%%%%%jJ%%%%%%%%%%%%%%%%%%%%%%%%%%%%J%%%%%%%%j%%%%%%%%%%%J%%%%
$$ 20 21 21 21 21 21 21 20 20 20 20 20 20 19 20 20 20 20 20 20 20 20 20 20 20 20 20 20 20 20 20 20 20 20 20 20 20 20 20 20 20 20 20 21 21 21 21 21 21 21 21 21 20 20 20 20 20 20 20 20 20 20 20 20 21 21 21 21 21
-11090B1%%%%%%%j%%%%%%%j%%%%%J%%%%%%%%%%%j%%%%%J%%%%%%%%%%%%%%%%%%%%%%%%%%%j
$$ 21 21 21 21 21 21 21 21 20 20 20 20 20 20 20 20 19 19 19 19 19 19 20 20 20 20 20 20 20 20 20 20 20 20 19 19 19 19 19 19 20 20 20 20 20 20 20 20 20 20 20 20 20 20 20 20 20 20 20 20 20 20 20 20 20 20 20 20 19
-11137A9%%%J%%%%%%%%%%%%%%%%%%%%%%%%jJ%%%%Jj%%%%%%%%%%%J%%%%%j%%%%%%%%%%%%%%
$$ 19 19 19 19 20 20 20 20 20 20 20 20 20 20 20 20 20 20 20 20 20 20 20 20 20 20 20 20 20 19 20 20 20 20 20 21 20 20 20 20 20 20 20 20 20 20 20 20 21 21 21 21 21 21 20 20 20 20 20 20 20 20 20 20 20 20 20 20 20
-11184B0%J%%%%%jJ%%%%%%%%%%%%%%%%%%%%%%j%%J%%%%%%%%%%%%%%%%%%%%%%%j%%%%%j%%%
$$ 20 20 21 21 21 21 21 21 20 21 21 21 21 21 21 21 21 21 21 21 21 21 21 21 21 21 21 21 21 21 21 21 20 20 20 21 21 21 21 21 21 21 21 21 21 21 21 21 21 21 21 21 21 21 21 21 21 21 21 20 20 20 20 20 20 19 19 19 19
-11231A9%%%%%%%%J%%%%%%%%%J%j%%%%%%J%%%%%%%%%%%%j%J%%%%%%%%%%%j%%%%%%%%%%%%%
$$ 19 19 19 19 19 19 19 19 19 20 20 20 20 20 20 20 20 20 20 21 21 20 20 20 20 20 20 20 21 21 21 21 21 21 21 21 21 21 21 21 21 20 20 21 21 21 21 21 21 21 21 21 21 21 21 20 20 20 20 20 20 20 20 20 20 20 20 20 20
-11278B0%%%%%%J%%%%%%%%%%%j%%%%%%%%%J%%%%%%%%%%%%%%%%j%%%%J%%%%%%j%%%%J%%%%%
$$ 20 20 20 20 20 20 20 21 21 21 21 21 21 21 21 21 21 21 21 20 20 20 20 20 20 20 20 20 20 21 21 21 21 21 21 21 21 21 21 21 21 21 21 21 21 21 20 20 20 20 20 21 21 21 21 21 21 21 20 20 20 20 20 21 21 21 21 21 21
-11325B1%%%%%%%j%%%J%%%j%J%%%%%%%%%%%%jJ%%%%%%%j%%%J%%%%j%%%%%%%%%%%%%%%%%%%
$$ 21 21 21 21 21 21 21 21 20 20 20 20 21 21 21 21 20 20 21 21 21 21 21 21 21 21 21 21 21 21 21 20 21 21 21 21 21 21 21 21 20 20 20 20 21 21 21 21 21 20 20 20 20 20 20 20 20 20 20 20 20 20 20 20 20 20 20 20 20
-11373B0%%%%%%%%%%%%%%%%%%%%%%%%%%%%%%%%%%%%%%%%%%%%J%%%%%%%%%%%%%%%%%%%%%%%
$$ 20 20 20 20 20 20 20 20 20 20 20 20 20 20 20 20 20 20 20 20 20 20 20 20 20 20 20 20 20 20 20 20 20 20 20 20 20 20 20 20 20 20 20 20 20 21 21 21 21 21 21 21 21 21 21 21 21 21 21 21 21 21 21 21 21 21 21 21 21
-11420B1%%j%%%%%%%J%%%%%%%%%%%%%%%%%%%%j%%%%%%%%%%%%%%%%%%%%%%%%%%%%%%%%%%%%
$$ 21 21 21 20 20 20 20 20 20 20 20 21 21 21 21 21 21 21 21 21 21 21 21 21 21 21 21 21 21 21 21 21 20 20 20 20 20 20 20 20 20 20 20 20 20 20 20 20 20 20 20 20 20 20 20 20 20 20 20 20 20 20 20 20 20 20 20 20 20
-11467B0%%%%%%%%%%%%%%%%%%%%%%%%%%%%%%%%%%%%%j%%%%%%%%%%%%%%J%%%%%%%%%%%%%%%
$$ 20 20 20 20 20 20 20 20 20 20 20 20 20 20 20 20 20 20 20 20 20 20 20 20 20 20 20 20 20 20 20 20 20 20 20 20 20 20 19 19 19 19 19 19 19 19 19 19 19 19 19 19 19 20 20 20 20 20 20 20 20 20 20 20 20 20 20 20 20
-11514B0%%%%%%%%%%%%%%%%%%%%%%%%%%%%%%%%%%%%j%%%%%%%J%%%%%%%%%%%%%%%%%%%%%%%
$$ 20 20 20 20 20 20 20 20 20 20 20 20 20 20 20 20 20 20 20 20 20 20 20 20 20 20 20 20 20 20 20 20 20 20 20 20 20 19 19 19 19 19 19 19 19 20 20 20 20 20 20 20 20 20 20 20 20 20 20 20 20 20 20 20 20 20 20 20 20
-11561B0J%%%%%%%j%%%%%%%%%jJ%%%%%%%%j%J%%%%%%%%%%j%%%%%J%%%%%%%%J%%%%%%%%%%%
$$ 20 21 21 21 21 21 21 21 21 20 20 20 20 20 20 20 20 20 20 19 20 20 20 20 20 20 20 20 20 19 19 20 20 20 20 20 20 20 20 20 20 20 19 19 19 19 19 19 20 20 20 20 20 20 20 20 20 21 21 21 21 21 21 21 21 21 21 21 21
-11608B1j%%%%%%%%%%%%%%%%%%%%%%j%J%%%%%J%%%%%%j%%%%%%%%%J%j%%%%%%%%%%%%%%%%%
$$ 21 20 20 20 20 20 20 20 20 20 20 20 20 20 20 20 20 20 20 20 20 20 20 20 19 19 20 20 20 20 20 20 21 21 21 21 21 21 21 20 20 20 20 20 20 20 20 20 20 21 21 20 20 20 20 20 20 20 20 20 20 20 20 20 20 20 20 20 20
-11656B0J%%%J%j%%%j%%%%j%J%%%J%%%%%%%%%%%%j%%%%%%%%%%%%%%%%%%%%%J%%%%%%jJ%%%
$$ 20 21 21 21 21 22 22 21 21 21 21 20 20 20 20 20 19 19 20 20 20 20 21 21 21 21 21 21 21 21 21 21 21 21 21 20 20 20 20 20 20 20 20 20 20 20 20 20 20 20 20 20 20 20 20 20 20 21 21 21 21 21 21 21 20 21 21 21 21
-11703B1%%%%%%%%j%%%%%%j%%%%%%J%%%%%%%%%%%%%%%%%%%%%%%%%%%%%%%%%%%%%%%%J%%%j
$$ 21 21 21 21 21 21 21 21 21 20 20 20 20 20 20 20 19 19 19 19 19 19 19 20 20 20 20 20 20 20 20 20 20 20 20 20 20 20 20 20 20 20 20 20 20 20 20 20 20 20 20 20 20 20 20 20 20 20 20 20 20 20 20 20 21 21 21 21 20
-11750B0%%J%%%%j%%%%%%%%%%%%%%%j%%%%%J%%%%%%J%%%%%%%%%%%%%%j%%%%j%%%%%%%%%%%
$$ 20 20 20 21 21 21 21 21 20 20 20 20 20 20 20 20 20 20 20 20 20 20 20 20 19 19 19 19 19 19 20 20 20 20 20 20 20 21 21 21 21 21 21 21 21 21 21 21 21 21 21 21 20 20 20 20 20 19 19 19 19 19 19 19 19 19 19 19 19
$$ [...]
-45527a
##END=		$$ NMR SPECTRUM
##END=		$$ LINK
