##TITLE=	FzgP+MLvROK356T4$6MYsg.12.fid
##JCAMP-DX=	6.0	$$ MestReNova 14.3.3-33362
##DATA TYPE=	LINK
##BLOCKS=	1    
##ORIGIN=	Mestrelab Research S.L.
##OWNER=	hrzepa
##$MNOVA/METADATA=	(DOCUMENT,BASE64)
eyJuYW1lIjoiL1VzZXJzL2hyemVwYS9Eb3dubG9hZHMvSVVQQUMtRkFJUlNwZWMtbWFpbi8zOC1Db21
wbGV4ZXMvMzhpLzM4aS1GLzM4aS1GLm1ub3ZhIiwicGFnZXMiOlt7Iml0ZW1zIjpbIjEiICAgICBdfV
19
##TITLE=	FzgP+MLvROK356T4$6MYsg.12.fid
##JCAMP-DX=	6.0	$$ MestReNova 14.3.3-33362
##DATA TYPE=	NMR SPECTRUM
##DATA CLASS=	XYDATA
##BLOCK_ID=	1
##ORIGIN=	Bruker BioSpin GmbH
##OWNER=	nmrsu
##NUMDIM=	1
##$MNOVA/METADATA=	(ITEM,BASE64)
eyJhbmdsZSI6MCwiYXhlcyI6eyJ4Ijp7Im1heCI6NjQuOTU1NzA5OTk5Njc4ODUsIm1pbiI6LTE3OS4
3OTgwNDA3MTAxMzA1fSwieSI6eyJtYXgiOjExODMxMjkuMjAzMTI1LCJtaW4iOi0xMTMyNjMuODU3OT
EwMTU2MjV9fSwicG9pbnRzIjpbeyJ4Ijo1MzIxLCJ5Ijo1ODM1fSx7IngiOjg3MjIsInkiOjU4MzV9L
HsieCI6ODcyMiwieSI6ODIwOH0seyJ4Ijo1MzIxLCJ5Ijo4MjA4fSx7IngiOjUzMjEsInkiOjU4MzV9
XSwieiI6MH0=
##.OBSERVE FREQUENCY=	658.94984375485603323
##.OBSERVE NUCLEUS=	^19F
##.SOLVENT NAME=	None
##.PULSE SEQUENCE=	zg30
##LONGDATE=	2025/01/08 22:38:45.000
##.ACQUISITIONMODE=	SIMULTANEOUS (DQD)
##$ORIGINAL FORMAT=	Bruker XWIN-NMR
##$MNOVA/SCALES_VERSION=	9
##$PARAMETER FILE=	(acqus, ASCII, /private/var/folders/f6/rjf_tdyn2v98c5c0wvkgn4s80000gq/T/FzgP+MLvROK356T4$6MYsg/12/acqus, 0)
$$ ##TITLE= Parameter file, TopSpin 4.1.3
$$ ##JCAMPDX= 5.0
$$ ##DATATYPE= Parameter Values
$$ ##NPOINTS= 1	$$ modification sequence number
$$ ##ORIGIN= Bruker BioSpin GmbH
$$ ##OWNER= nmrsu
$$ $$ 2025-01-08 22:37:13.108 +0000  nmrsu@CZC7167VR1
$$ $$ Z:/700/data/tds/nmr/RP482 tBuOAc/12/acqus
$$ $$ process C:\Bruker\TopSpin4.1.3\prog\mod\dirdata.exe
$$ ##$ACQT0= -3.66750770866894
$$ ##$AMP= (0..31)
$$ 100 100 100 100 100 100 100 100 100 100 100 100 100 100 100 100 100 100
$$ 100 100 100 100 100 100 100 100 100 100 100 100 100 100
$$ ##$AMPCOIL= (0..32)
$$ -1 0 0 0 0 0 0 0 0 0 0 0 0 0 0 0 0 0 0 0 0 0 0 0 0 0 0 0 0 0 0 0 0
$$ ##$AQSEQ= 0
$$ ##$AQ_mod= 3
$$ ##$AUNM= <au_zg>
$$ ##$AUTOPOS= <27 >
$$ ##$BF1= 658.987406037
$$ ##$BF2= 658.987406037
$$ ##$BF3= 658.987406037
$$ ##$BF4= 658.987406037
$$ ##$BF5= 658.987406037
$$ ##$BF6= 658.987406037
$$ ##$BF7= 658.987406037
$$ ##$BF8= 658.987406037
$$ ##$BWFAC= (0..63)
$$ 0 0 0 0 0 0 0 0 0 0 0 0 0 0 0 0 0 0 0 0 0 0 0 0 0 0 0 0 0 0 0 0 0 0 0 0
$$ 0 0 0 0 0 0 0 0 0 0 0 0 0 0 0 0 0 0 0 0 0 0 0 0 0 0 0 0
$$ ##$BYTORDA= 0
$$ ##$CHANFCU= (0..24)
$$ 0 1 0 0 0 0 0 0 0 0 0 0 0 0 0 0 0 0 0 0 0 0 0 0 0
$$ ##$CHANREC= (0..24)
$$ 0 0 0 0 0 0 0 0 0 0 0 0 0 0 0 0 0 0 0 0 0 0 0 0 0
$$ ##$CHEMSTR= <none>
$$ ##$CNST= (0..63)
$$ 1 1 1 1 1 1 1 1 1 1 1 1 1 1 1 1 1 1 1 1 1 1 1 1 1 1 1 1 1 1 1 1 1 1 1 1
$$ 1 1 1 1 1 1 1 1 1 1 1 1 1 1 1 1 1 1 1 1 1 1 1 1 1 1 1 1
$$ ##$CPDPRG= (0..8)
$$ <> <> <> <> <> <> <> <> <>
$$ ##$D= (0..63)
$$ 0 5 0 0 0 0 0 0 0 0 0 0 0 0 0 0 0.0002 0 0 0 0 0 0 0 0 0 0 0 0 0 0 0 0
$$ 0 0 0 0 0 0 0 0 0 0 0 0 0 0 0 0 0 0 0 0 0 0 0 0 0 0 0 0 0 0 0
$$ ##$DATE= 1736375925
$$ ##$DATE_START= 1736375805
$$ ##$DE= 18
$$ [...]
$$ ##$ShimPowRng3= (0..63)
$$ 1 1 1 1 1 1 1 1 1 1 1 1 1 1 1 1 1 1 1 1 1 1 1 1 1 1 1 1 1 1 1 1 1 1 1 1
$$ 1 1 1 1 0 0 0 0 0 0 0 0 0 0 0 0 0 0 0 0 0 0 0 0 0 0 0 0
$$ ##$ShimPowType1= 8
$$ ##$ShimPowType2= 8
$$ ##$ShimPowType3= 0
$$ ##$ShimPowType4= 0
$$ ##$ShimPowType5= 0
$$ ##$ShimPowType6= 0
$$ ##$ShimPowType7= 0
$$ ##$ShimPowType8= 0
$$ ##$ShimSysActGrad= (0..63)
$$ 1 2 3 4 13 5 7 11 10 9 6 8 12 18 19 20 21 15 22 23 24 14 25 16 26 17 27
$$ 28 31 32 33 34 35 36 37 38 0 0 0 0 0 0 0 0 0 0 0 0 0 0 0 0 0 0 0 0 0 0
$$ 0 0 0 0 0 0
$$ ##$ShimSysAngle= <>
$$ ##$ShimSysFunc= (0..63)
$$ 1 2 3 4 5 6 7 8 9 10 0 37 38 35 16 15 14 13 12 11 28 27 26 25 24 23 36
$$ 22 30 29 20 21 34 33 32 31 17 18 19 0 0 0 0 0 0 0 0 0 0 0 0 0 0 0 0 0 0
$$ 0 0 0 0 0 0 0
$$ ##$ShimSysMatId= <292722da.dat>
$$ ##$ShimSysMatrix= 1
$$ ##$ShimSysMinMaxUG= 130000
$$ ##$ShimSysOffset= <29 mm>
$$ ##$ShimSysType= 4
$$ ##$ShimUnit= 3
$$ ##$SpectrOsVersion= <4.1.156.20210628>
$$ ##$TCubeEth= <192.168.180.38>
$$ ##$TCubeSeqDevice= <>
$$ ##$TOSITY= <no>
$$ ##$TRIPLO2= 0
$$ ##$TopSpinVersion= <TopSpin 4.1.3>
$$ ##$TrxFreqFormula= (0..23)
$$ <TrxFreqFormula(2.0,700350000.000000,'TRX',Trx(1.0,'TRX 1200.1',1,5.000000,1290.000000))>
$$ <TrxFreqFormula(2.0,700350000.000000,'TRX',Trx(1.0,'TRX 1200.2',1,5.000000,1290.000000))>
$$ <TrxFreqFormula(2.0,700350000.000000,'TRX',Trx(1.0,'TRX 1200.3',1,5.000000,1290.000000))>
$$ <> <> <> <> <> <> <> <> <> <> <> <> <> <> <> <> <> <> <> <> <>
$$ ##$TrxPN= (0..23)
$$ <Z148391> <Z148391> <Z148391> <> <> <> <> <> <> <> <> <> <> <> <> <> <>
$$ <> <> <> <> <> <> <>
$$ ##$TrxSN= (0..23)
$$ <00336> <00337> <00342> <> <> <> <> <> <> <> <> <> <> <> <> <> <> <> <>
$$ <> <> <> <> <>
$$ ##$VCubeEth= (0..23)
$$ <no> <no> <no> <no> <no> <no> <no> <no> <no> <no> <no> <no> <no> <no> <no>
$$ <no> <no> <no> <no> <no> <no> <no> <no> <no>
$$ ##$VTU= 2
$$ ##$VTUETH= <192.168.99.11>
$$ ##$VTUTY= <no>
$$ ##$ValueLine= no
$$ ##$VpuPN= (0..23)
$$ <no> <no> <no> <no> <no> <no> <no> <no> <no> <no> <no> <no> <no> <no> <no>
$$ <no> <no> <no> <no> <no> <no> <no> <no> <no>
$$ ##$VpuSN= (0..23)
$$ <no> <no> <no> <no> <no> <no> <no> <no> <no> <no> <no> <no> <no> <no> <no>
$$ <no> <no> <no> <no> <no> <no> <no> <no> <no>
$$ ##$WBREFAM= (0..31)
$$ 99.8 100 100 100 100 100 100 100 100 100 100 100 100 100 100 100 100 100
$$ 100 100 100 100 100 100 100 100 100 100 100 100 100 100
$$ ##$WBREFLM= (0..31)
$$ 1 0 1 0 0 0 0 0 0 0 0 0 0 0 0 0 0 0 0 0 0 0 0 0 0 0 0 0 0 0 0 0
$$ ##$WBREFPH= (0..31)
$$ 0.05 0 0 0 0 0 0 0 0 0 0 0 0 0 0 0 0 0 0 0 0 0 0 0 0 0 0 0 0 0 0 0
$$ ##$WBSGU= (0..31)
$$ 1 2 4 0 0 0 0 0 0 0 0 0 0 0 0 0 0 0 0 0 0 0 0 0 0 0 0 0 0 0 0 0
$$ ##END=
$$ 
##$DECIM=	124
##$DSPFVS=	22
##XUNITS=	HZ
##YUNITS=	ARBITRARY UNITS
##FIRSTX=	42805.012888980010757
##LASTX=	-118484.69441791246936
##DELTAX=	-0.6152737525201606994
##XFACTOR=	1
##YFACTOR=	32.824816125980404991
##FIRSTY=	635.6650390625
##MINY=	-5710.58642578125
##MAXY=	1075570.75
##NPOINTS=	262144
##XYDATA=	(X++(Y..Y))
$$ [...]
-81177a18%%%j%Jj%%%%J%k%JJjKkJJ%%kJj%%KjjK%j%jjK%%kJJ%%j%%%%%Jjj%Jj%J%%%Kj%%
-81218a18%%Jk%K%%jjJj%JJk%%%JkKj%JjJJj%%j%Jj%KjkjJJjK%j%jJ%%KkJk%JJjjK%jjJJj
-81259a19JkJJj%%jKjjJ%J%kJ%%jKjjKk%%%J%%%jKjjKkJ%%%jJj%jJJKkJ%%kKjjjJJjJJ%%j
-81301a19%%jjK%J%%j%jJ%j%%KjJ%jjJ%jJJkKJk%jJjJJj%jJKk%%Jj%J%%lJJj%Jj%%%%%%Jj
-81342a20jJ%JJjjKlJ%%%%Jj%%%J%j%JkJJ%%%%jJ%j%KjkKKjkJJj%jJj%%%jJ%%%J%%k%KJkJ
-81383a19%%%jj%%J%J%%k%J%%%%JjjL%k%%%JJj%%j%%%Jk%Kk%J%jJ%%%jJ%%%jJJj%%jJ%%%%
-81424a20%J%%jJkJJj%%%%%%%%%%%%jJ%jjJJ%jJ%jLjjkK%%jJj%%j%K%jJj%K%%j%j%j%JJ%j
-81466a21%%j%J%J%JjjJj%%%jJJkKj%jJ%%%%%%JjJj%J%%k%JJ%jjJJjJ%%%j%%JJjj%jJjJJ%
$$ y = [-118, -118, -118, -118, -119, -119, -118, -119, -119, -119, -119, -119, -118, -118, -120, -120, -119, -118, -119, -117, -119, -118, -117, -117, -117, -119, -118, -119, -119, -119, -117, -118, -119, -117, -117, -118, -118, -119, -120, -118, -118, -118, -120, -119, -118, -118, -118, -119, -119, -119, -119, -119, -119, -118, -119, -120, -120, -119, -120, -120, -119, -119, -119, -119, -117, -118, -118, -118, -118, -118, -117, -119, -119, -117, -117, -117, -118, -119, -118, -119, -119, -118, -117, -119, -119, -119, -119, -118, -120, -118, -119, -119, -118, -119, -118, -117, -118, -118, -118, -119, -119, -118, -119, -119, -117, -118, -120, -121, -120, -119, -120, -118, -118, -119, -119, -120, -119, -119, -119, -117, -119, -118, -120, -120, -119, -118, -119, -120, -118, -118, -119, -120, -119, -118, -119, -118, -120, -119, -118, -119, -119, -119, -120, -118, -119, -120, -119, -119, -118, -118, -120, -119, -119, -119, -120, -118, -119, -120, -118, -120, -120, -120, -120, -119, -119, -119, -119, -120, -118, -119, -120, -118, -120, -119, -119, -119, -119, -120, -119, -120, -120, -121, -120, -119, -117, -119, -118, -118, -118, -120, -118, -119, -120, -121, -120, -119, -120, -119, -118, -118, -118, -119, -119, -119, -120, -121, -119, -119, -118, -118, -118, -119, -119, -120, -119, -119, -120, -120, -120, -118, -119, -118, -118, -119, -120, -119, -119, -120, -119, -118, -120, -118, -117, -119, -119, -120, -119, -120, -119, -118, -119, -119, -120, -119, -117, -119, -119, -119, -118, -119, -119, -118, -118, -118, -121, -120, -119, -120, -120, -119, -120, -120, -120, -120, -120, -120, -120, -119, -120, -121, -120, -120, -119, -118, -119, -120, -118, -121, -120, -120, -120, -120, -120, -119, -120, -120, -120, -120, -119, -119, -120, -120, -119, -121, -120, -119, -119, -119, -119, -119, -120, -119, -119, -120, -120, -118, -119, -121, -119, -117, -118, -120, -119, -118, -119, -119, -120, -119, -120, -120, -120, -120, -121, -120, -120, -120, -120, -119, -119, -119, -121, -121, -119, -118, -120, -119, -119, -119, -119, -120, -121, -121, -121, -120, -120, -119, -119, -119, -121, -121, -120, -120, -120, -120, -120, -119, -120, -121, -118, -118, -120, -120, -120, -120, -119, -118, -119, -119, -119, -120, -120, -120, -120, -119, -121, -121, -119, -121, -121, -120, -120, -121, -120, -120, -120, -120, -121, -120, -120, -120, -120, -121, -120, -119, -120, -120, -120, -121, -120, -120, -120, -120, -120, -120, -119, -119, -119, -120, -119, -121, -120, -119, -120, -120, -120, -120, -120, -120, -120, -120, -120, -120, -120, -120, -120, -121, -120, -120, -121, -122, -121, -120, -120, -121, -120, -120, -121, -118, -119, -120, -122, -120, -120, -120, -121, -120, -121, -121, -121, -122, -122, -120, -120, -121, -120, -121, -121, -119, -119, -119, -120, -120, -121, -121, -122, -122, -121, -120, -120, -121, -121, -121, -122, -122, -121, -121, -120, -120, -119, -120, -121, -120, -121, -121, -121, -121, -122, -121, -120, -122, -120, -121, -121, -122, -121, -121, -121, -121, -121, -121, -121, -120, -121, -120, -121, -121, -120, -120, -120, -122, -122, -121, -120, -120, -121, -122, -121, -120, -121, -120, -120, -120, -120, -121, -121, -121, -120, -119, -120, -121, -121, -122, -121, -122, -121, -120, -120]
-81507a20j%jJ%%%jJjJ%%%%%%%%%j%JJjJ%jKjjJjj%JJ%jjJJ%j%jKkKjjJ%jJj%%%%%Lk%%jJ
-81548a21%%jJ%jJ%%%jKjjJ%Jj%Jj%%%%j%%%jJKj%%%%%j%KkJ%%%%jJ%j%J%%%%%jjJJ%%jKJ
-81589a19jj%j%JjJ%%%jJjJ%%%kJJJJk%J%%k%%%%%Jj%Jj%Jj%jKJk%%j%K%jJ%j%jJ%%%JJk%
-81630a22%Kjj%%jJJ%%jK%kJ%%%%Jk%Jj%jJ%%%%J%kKj%J%j%%JkjJJ%J%%%%jJ%%%%kJJkLk%
-81672a22jJ%%J%%jjJ%%%Jj%JJkJjjK%%k%J%%%%%%J%kJJ%%jJjj%%J%%JjjJJj%%K%lJj%J%%
-81713a22%%%Jj%jjKJjj%J%%%j%%Jj%%%%JjJ%%%%jJKkjjK%%jJ%j%Jj%JkJJ%%Jk%%%%%%J%j
-81754a23J%%jJ%%%%jJ%jJ%j%J%j%JJj%%Jj%kJ%Jj%jJ%%%Jj%%JjJj%J%%jjL%k%%%%%JjJj%
-81795a23K%kJkJJ%j%%%jjJKj%KkJj%%%%jJkJ%%%%J%KjkJ%%%%jKj%J%j%JjJj%j%KkJ%j%%j
$$ y = [-120, -121, -121, -122, -121, -121, -121, -121, -122, -121, -122, -121, -121, -121, -121, -121, -121, -121, -121, -121, -121, -122, -122, -121, -120, -121, -120, -120, -121, -119, -120, -121, -120, -121, -122, -122, -121, -120, -120, -121, -122, -121, -120, -120, -121, -121, -122, -120, -122, -120, -121, -122, -121, -121, -122, -121, -122, -122, -122, -122, -122, -122, -119, -121, -121, -121, -122, -121, -121, -121, -122, -121, -121, -122, -121, -121, -121, -121, -122, -120, -121, -122, -121, -121, -120, -121, -121, -120, -121, -121, -121, -121, -121, -122, -122, -122, -122, -123, -122, -120, -121, -121, -121, -121, -121, -121, -122, -122, -120, -122, -121, -121, -121, -121, -121, -122, -121, -121, -122, -122, -121, -121, -121, -121, -121, -121, -122, -123, -122, -121, -121, -121, -122, -120, -119, -120, -121, -121, -122, -122, -121, -122, -121, -121, -121, -121, -122, -121, -122, -121, -121, -121, -121, -123, -122, -121, -120, -119, -121, -121, -120, -120, -120, -122, -122, -122, -122, -122, -122, -121, -122, -122, -121, -122, -122, -121, -122, -122, -123, -121, -120, -122, -122, -122, -123, -123, -121, -121, -122, -121, -121, -122, -122, -123, -122, -122, -122, -122, -121, -120, -122, -122, -122, -120, -121, -122, -122, -122, -123, -122, -121, -121, -121, -122, -120, -120, -122, -121, -121, -121, -121, -121, -120, -122, -122, -121, -122, -122, -123, -122, -122, -122, -122, -122, -121, -121, -123, -121, -122, -122, -121, -121, -122, -122, -122, -121, -123, -124, -123, -122, -122, -121, -121, -121, -121, -121, -122, -121, -121, -121, -121, -121, -123, -122, -121, -123, -120, -122, -122, -123, -122, -122, -122, -121, -121, -121, -122, -123, -122, -122, -122, -122, -121, -122, -122, -121, -120, -122, -121, -122, -123, -121, -121, -121, -123, -123, -122, -122, -122, -122, -122, -122, -122, -121, -121, -123, -122, -121, -121, -121, -122, -121, -122, -123, -123, -123, -122, -122, -122, -121, -122, -123, -122, -121, -122, -122, -122, -120, -120, -123, -122, -123, -123, -122, -122, -122, -122, -122, -122, -121, -122, -122, -123, -124, -122, -121, -122, -123, -123, -122, -122, -122, -122, -123, -123, -123, -122, -123, -123, -123, -123, -123, -122, -123, -122, -122, -122, -122, -122, -123, -122, -120, -122, -123, -124, -122, -122, -122, -123, -122, -122, -123, -123, -122, -123, -123, -122, -124, -123, -122, -122, -122, -121, -123, -123, -123, -123, -123, -123, -123, -122, -122, -123, -122, -122, -122, -123, -122, -122, -122, -122, -122, -123, -122, -122, -123, -122, -122, -123, -123, -122, -122, -123, -123, -122, -121, -122, -122, -122, -121, -122, -122, -124, -123, -123, -122, -123, -123, -124, -123, -123, -123, -123, -122, -123, -123, -123, -122, -123, -122, -123, -123, -122, -122, -122, -123, -124, -121, -121, -123, -123, -123, -123, -123, -123, -122, -123, -122, -123, -123, -121, -121, -123, -122, -124, -123, -122, -122, -123, -123, -123, -123, -124, -125, -124, -122, -123, -123, -121, -123, -122, -123, -123, -123, -123, -123, -124, -123, -125, -124, -124, -124, -124, -124, -123, -123, -121, -122, -124, -123, -123, -123, -123, -123, -124, -122, -123, -123, -122, -122, -123, -123, -122, -123, -122, -123, -123, -124, -124, -122, -124, -123, -123, -124, -124, -124, -125]
-81837a25JJjJ%%%%%jJJ%j%%Jj%jJJjk%JJjJjjjKJjJjKj%jKj%j%KkJjKkKkJjJ%j%%%%%J%j
-81878a24jJJ%Jj%%%jJ%Jk%%jJJ%kKjJjj%Kj%J%%jJJlLj%j%J%Jjj%jK%jj%KjJjJ%%jJJkj%
-81919a25%%J%Kjj%%KjjJ%k%KkJKjj%%%%j%%KkJ%%%%%JjJ%jjJJJmJ%%%%jJ%J%jJ%jJ%%Jjj
-81960a25K%j%Jjj%Lk%%j%%JjJjjK%kK%%J%%j%jjKjj%K%%%Jkj%J%%%J%jJ%Jl%J%J%%Jj%Jj
-82001a24J%j%j%jK%jJjJj%%J%%%%j%%J%Jk%%%%jK%jJ%%%jjK%j%K%kj%%JJjJ%%%j%%%%%kK
-82043a25jJ%JjJ%%J%jkJ%jK%%%j%JkJJj%%J%JlJ%%JjKk%%%%Jj%J%%j%%%%%%%%%%jJ%%Jj%
-82084a25%j%%J%%JkJ%j%%JJj%%J%%%jJ%kJ%%%%%%%%%%%%%%%%%%%J%kKjjJJj%%%%jjK%Jj%
-82125a25%%%%%%j%Jj%J%JkJ%kKjJkJJjjLjJkJ%j%%JkJ%J%j%J%Jjj%jJJjjJJJkJ%JlJ%Jjk
$$ y = [-125, -124, -123, -124, -123, -123, -123, -123, -123, -123, -124, -123, -122, -122, -123, -123, -123, -122, -123, -123, -124, -123, -122, -123, -125, -125, -124, -123, -124, -123, -124, -125, -126, -124, -123, -124, -123, -124, -122, -123, -123, -124, -122, -123, -123, -124, -124, -122, -124, -123, -124, -122, -124, -122, -124, -123, -124, -123, -123, -124, -124, -124, -124, -124, -124, -123, -123, -124, -125, -124, -123, -123, -122, -123, -123, -123, -123, -124, -123, -123, -122, -124, -124, -124, -125, -124, -123, -123, -125, -123, -124, -123, -124, -125, -125, -123, -124, -124, -123, -123, -123, -124, -123, -122, -125, -122, -123, -123, -124, -124, -123, -123, -122, -123, -124, -124, -125, -123, -123, -124, -125, -125, -123, -124, -123, -124, -123, -123, -123, -124, -123, -122, -124, -125, -125, -125, -125, -124, -124, -122, -123, -124, -124, -124, -122, -123, -124, -123, -123, -125, -125, -123, -125, -124, -122, -123, -124, -124, -124, -124, -124, -125, -125, -125, -123, -125, -124, -124, -124, -124, -124, -124, -123, -124, -123, -123, -124, -125, -124, -123, -122, -126, -125, -125, -125, -125, -125, -126, -125, -125, -124, -124, -125, -124, -124, -125, -124, -124, -124, -123, -124, -125, -123, -123, -124, -124, -123, -124, -125, -125, -122, -124, -124, -124, -125, -125, -125, -124, -125, -124, -125, -126, -124, -124, -126, -124, -124, -124, -123, -123, -123, -124, -124, -125, -126, -124, -125, -126, -126, -124, -124, -124, -124, -123, -125, -126, -126, -125, -125, -125, -125, -124, -124, -125, -124, -124, -123, -126, -126, -125, -125, -124, -124, -124, -123, -124, -124, -123, -124, -123, -123, -124, -124, -125, -125, -126, -124, -124, -125, -124, -125, -124, -125, -125, -125, -124, -124, -124, -124, -124, -125, -125, -125, -124, -124, -123, -125, -125, -125, -125, -125, -126, -124, -124, -125, -124, -124, -124, -124, -125, -126, -124, -124, -125, -125, -123, -123, -125, -126, -126, -126, -125, -124, -125, -124, -124, -124, -124, -125, -125, -125, -125, -125, -125, -127, -125, -126, -125, -125, -124, -125, -124, -124, -124, -123, -123, -124, -126, -125, -125, -126, -124, -124, -124, -124, -125, -125, -124, -126, -125, -124, -125, -125, -125, -124, -124, -123, -126, -125, -125, -125, -124, -125, -123, -125, -125, -125, -125, -125, -124, -125, -125, -124, -124, -124, -125, -125, -125, -125, -125, -125, -125, -125, -125, -125, -125, -126, -125, -125, -125, -124, -125, -125, -125, -126, -126, -126, -125, -125, -125, -124, -126, -125, -125, -126, -126, -126, -125, -124, -125, -125, -125, -124, -124, -124, -124, -125, -124, -124, -126, -125, -125, -125, -125, -125, -125, -125, -125, -125, -125, -125, -125, -125, -125, -125, -125, -125, -125, -125, -125, -124, -124, -126, -124, -125, -126, -125, -124, -125, -125, -125, -125, -125, -126, -127, -125, -125, -124, -125, -125, -125, -125, -125, -125, -125, -125, -126, -126, -125, -126, -126, -125, -125, -124, -126, -125, -125, -127, -125, -126, -125, -127, -126, -125, -126, -127, -124, -125, -124, -126, -125, -125, -126, -126, -126, -125, -127, -126, -126, -125, -125, -126, -126, -125, -125, -124, -125, -126, -126, -127, -126, -125, -126, -127, -126, -125, -124, -126, -125, -125, -124, -127, -126, -126, -125, -126, -128]
-82166a28KJjj%JJ%%%J%%jj%%%%J%jJ%%Jk%%%%%%%%Jj%%%%%%jKj%%%J%%%%j%%%jJJkK%j%%
-82208a26%jJ%jJjJJ%%jJ%j%%%JjkJJ%%j%%%%%J%%%%%jJ%%jJJ%jJj%j%J%j%%%Jj%JjJJ%k%
-82249a27%Jj%%Kk%J%%%jJkK%JjjJJj%%%%j%%J%%j%%K%jj%Jj%J%Jjj%%J%j%J%J%jj%%J%jj
-82290a28Kj%%J%%jJ%%%%%jJjJjJjjJ%%JkKjJkJJ%%%kJ%%JJkJj%%Jj%%Jj%jJJkK%j%Jk%J%
-82331a27%J%%jjJJjJj%%%jJ%%jJJ%j%%%%%%%%J%jjJ%%jJ%J%kJ%%jJ%%%%J%kJKkJk%%%%%%
-82372a28J%%jJKjj%jJJ%%kJj%%%%J%%j%%JKmLjJ%%jj%j%J%%J%%%jJJjj%LkKkj%Jj%%Jj%J
-82414a27jJJ%k%J%JjJJk%%jJ%j%%%JkLj%%%%%%kJKj%%%Jj%j%JJjJjjjJJ%kJ%%jJJ%%jJ%j
-82455a28Jk%JjK%%kJJ%j%j%J%%JjJj%%%%%%%%J%jJ%jKj%j%%Jj%jKj%%J%%jjJ%JJkJ%jJ%j
$$ y = [-128, -126, -125, -126, -127, -127, -126, -125, -125, -125, -125, -124, -124, -124, -125, -126, -126, -126, -126, -126, -125, -125, -126, -125, -125, -125, -124, -126, -126, -126, -126, -126, -126, -126, -126, -126, -125, -126, -126, -126, -126, -126, -126, -126, -127, -125, -126, -126, -126, -126, -125, -125, -125, -125, -125, -126, -126, -126, -126, -127, -126, -125, -127, -125, -125, -126, -126, -126, -126, -127, -126, -126, -127, -126, -127, -126, -125, -125, -125, -126, -125, -125, -126, -126, -126, -126, -125, -126, -128, -127, -126, -126, -126, -127, -127, -127, -127, -127, -127, -126, -126, -126, -126, -126, -126, -127, -126, -126, -126, -127, -126, -125, -125, -126, -125, -126, -126, -127, -127, -126, -126, -127, -127, -127, -127, -126, -127, -127, -126, -127, -126, -125, -125, -127, -127, -127, -126, -127, -127, -127, -125, -127, -127, -126, -126, -126, -126, -127, -126, -128, -126, -126, -125, -126, -127, -126, -125, -126, -126, -126, -126, -126, -127, -127, -127, -126, -126, -126, -127, -127, -127, -125, -125, -126, -127, -127, -126, -127, -127, -126, -126, -125, -126, -127, -127, -127, -126, -126, -127, -127, -126, -126, -125, -125, -126, -127, -127, -127, -126, -126, -127, -128, -126, -127, -127, -127, -126, -126, -126, -127, -126, -126, -126, -126, -126, -126, -127, -126, -127, -126, -127, -126, -127, -128, -127, -127, -127, -126, -128, -126, -127, -126, -128, -127, -126, -126, -126, -126, -128, -127, -127, -127, -126, -125, -127, -126, -127, -127, -127, -126, -127, -127, -127, -126, -127, -127, -128, -127, -126, -128, -126, -126, -127, -127, -126, -128, -128, -127, -127, -127, -126, -126, -126, -127, -128, -127, -126, -127, -126, -127, -127, -127, -127, -128, -127, -127, -127, -128, -127, -126, -126, -127, -127, -127, -127, -127, -127, -127, -127, -127, -126, -126, -127, -128, -127, -127, -127, -128, -127, -127, -126, -126, -128, -127, -127, -127, -128, -127, -127, -127, -127, -127, -126, -126, -128, -127, -125, -127, -126, -128, -128, -128, -128, -128, -128, -128, -127, -127, -127, -128, -127, -125, -126, -127, -127, -128, -127, -126, -126, -126, -128, -127, -128, -128, -128, -128, -128, -127, -127, -127, -128, -128, -128, -127, -125, -129, -126, -127, -126, -126, -126, -127, -128, -128, -129, -129, -128, -128, -128, -127, -127, -127, -127, -128, -127, -126, -127, -128, -128, -125, -127, -125, -127, -128, -128, -127, -128, -128, -128, -127, -128, -128, -127, -128, -127, -126, -126, -128, -128, -127, -127, -126, -127, -126, -125, -127, -127, -127, -128, -127, -127, -128, -128, -128, -128, -127, -129, -126, -127, -127, -127, -127, -127, -127, -127, -129, -128, -126, -127, -127, -127, -127, -126, -127, -127, -128, -128, -127, -126, -127, -126, -127, -128, -129, -128, -127, -127, -129, -128, -128, -128, -129, -128, -127, -127, -127, -128, -127, -127, -128, -127, -129, -129, -128, -129, -127, -127, -127, -129, -128, -127, -127, -128, -128, -129, -129, -128, -128, -128, -127, -128, -127, -128, -128, -128, -128, -128, -128, -128, -128, -128, -127, -127, -128, -127, -127, -128, -126, -127, -127, -128, -128, -128, -127, -128, -128, -129, -127, -128, -128, -128, -127, -127, -127, -128, -129, -128, -128, -127, -126, -128, -127, -127, -128, -127, -127, -128]
-82496a28jJJjJ%%kJJ%%Jjj%j%J%%%%Kk%%%JjjJKkJ%lJ%J%%J%%j%%%%%%%jKj%%JjjJJJl%%
-82537a29%%%%J%jJ%%%j%%J%j%%%JJ%j%j%%Kj%jJ%J%%j%%j%%%JJj%%%%%%%%JlL%j%%%jjK%
-82579a28jkJK%j%%%J%j%%%%%kJJJjJ%%%j%%JjJjJ%jKkJ%Jj%jJJj%%%%jJj%J%j%jJJ%j%%%
-82620a29%J%%j%%jJ%%%%jJ%jJJjjJ%J%jj%KjJj%J%kJjJj%JJkJ%JkJJjJ%j%%jjJJ%jJj%%%
-82661a30J%%kLk%%%%JJjjJj%%%Lk%%JJj%jj%%JJ%%jkK%%%%jJ%%%%%%jKk%%Jj%KkJ%%%JkJ
-82702a29%jJj%JjJ%%JjjKkJJk%%%%jJ%%%J%j%j%K%%%j%Kk%KjJj%j%J%%jjJ%Jj%%%JkK%%%
-82743a29%j%%Jj%%Jj%J%%%jJjj%%J%%JkJ%jJ%%JjJ%%JlJjJJj%j%jK%jJ%J%jJ%%j%Kk%jJk
-82785a32J%J%%%%%Jj%%%Jj%%%%%Jjj%j%KjJ%j%JkK%%Jj%%%JjjKjjJJ%JkKl%%J%j%%JjKJj
$$ y = [-128, -129, -128, -127, -128, -127, -127, -127, -129, -128, -127, -127, -127, -126, -127, -128, -128, -129, -129, -128, -128, -128, -128, -128, -126, -128, -128, -128, -128, -127, -128, -129, -128, -126, -128, -127, -127, -130, -129, -129, -128, -128, -128, -127, -127, -127, -128, -128, -128, -128, -128, -128, -128, -128, -129, -127, -128, -128, -128, -127, -128, -129, -128, -127, -126, -129, -129, -129, -129, -129, -129, -129, -128, -128, -129, -128, -128, -128, -128, -129, -129, -129, -128, -128, -129, -129, -129, -129, -128, -127, -127, -128, -128, -129, -129, -129, -127, -128, -128, -129, -128, -128, -127, -127, -127, -128, -128, -128, -129, -129, -129, -129, -128, -127, -128, -128, -128, -128, -128, -128, -128, -128, -128, -127, -130, -127, -127, -128, -128, -128, -128, -129, -130, -128, -128, -129, -131, -130, -128, -128, -129, -129, -129, -129, -128, -128, -129, -129, -129, -129, -129, -129, -131, -130, -129, -128, -129, -128, -128, -128, -128, -129, -129, -129, -128, -129, -128, -129, -128, -128, -129, -127, -129, -128, -128, -127, -128, -128, -129, -128, -127, -128, -128, -128, -128, -128, -129, -128, -129, -129, -128, -128, -129, -129, -130, -129, -128, -128, -129, -129, -129, -129, -129, -128, -128, -128, -129, -129, -129, -130, -129, -129, -129, -129, -129, -130, -129, -129, -130, -129, -128, -129, -130, -129, -129, -128, -128, -129, -130, -130, -128, -129, -128, -129, -129, -128, -128, -130, -129, -130, -129, -130, -130, -129, -128, -130, -129, -129, -128, -130, -129, -128, -129, -128, -128, -129, -129, -129, -130, -131, -130, -129, -129, -130, -129, -130, -130, -130, -130, -129, -129, -129, -131, -128, -130, -130, -130, -130, -130, -129, -128, -129, -130, -129, -130, -130, -130, -130, -127, -129, -129, -129, -128, -127, -128, -128, -129, -130, -130, -130, -129, -128, -128, -128, -129, -131, -129, -129, -129, -129, -129, -130, -129, -129, -129, -129, -129, -129, -129, -130, -128, -130, -130, -130, -129, -130, -130, -128, -130, -129, -129, -129, -129, -128, -130, -129, -129, -130, -129, -130, -130, -129, -130, -129, -129, -129, -128, -129, -130, -128, -130, -129, -128, -130, -130, -130, -130, -130, -131, -130, -130, -130, -130, -129, -129, -130, -130, -131, -131, -129, -129, -129, -129, -130, -130, -128, -130, -130, -128, -129, -128, -129, -129, -130, -130, -129, -129, -129, -130, -131, -130, -130, -129, -130, -130, -130, -130, -129, -131, -129, -129, -129, -129, -129, -130, -130, -130, -129, -130, -130, -130, -129, -130, -130, -129, -129, -129, -129, -130, -129, -130, -131, -131, -131, -130, -130, -130, -129, -131, -130, -130, -131, -130, -130, -130, -129, -130, -129, -129, -129, -128, -131, -130, -131, -130, -129, -130, -130, -131, -131, -132, -130, -130, -131, -130, -130, -129, -129, -130, -129, -129, -129, -130, -130, -128, -130, -130, -131, -130, -132, -131, -131, -130, -130, -130, -130, -130, -130, -129, -130, -130, -130, -130, -129, -130, -130, -130, -130, -130, -130, -129, -130, -131, -131, -132, -132, -130, -131, -130, -130, -131, -131, -130, -132, -130, -130, -130, -129, -130, -130, -130, -130, -129, -130, -131, -129, -130, -131, -130, -129, -129, -128, -130, -128, -131, -131, -131, -130, -130, -131, -131, -131, -130, -131, -129, -128, -129]
-82826a29jkJ%%%J%%%%jjJjJJj%%j%Kj%%J%%kJJ%j%Ll%J%%jJ%%jJjJJjJkjK%%%%%%%%j%%%
-82867a31%JJjj%J%j%%JjJ%%%jJj%%%%%Kjj%JjJjjLjj%JjjJjK%%%j%%J%%jJjjKjjJJ%%j%%
-82908a31jKjj%J%J%j%%%JkJJj%jJ%kL%j%%%Jj%Jj%jJJjjJ%%%jJ%%j%%J%%jK%jjjKj%J%j%
-82950a32JjJjjK%j%%%JJ%jJjkJJjJ%jJk%K%%%jjK%jJJJk%%kJ%%J%%jJ%jJ%%%%%Jj%j%%%J
-82991a31%%%%jJj%jJJJk%%%%J%%jJkK%%%Jk%%%JkJjJ%%J%kJKj%%jJJjj%%%j%%JKkJj%JkJ
-83032a32KjjKjj%jK%j%J%%Jl%K%%j%%%J%j%jJ%JJjj%j%%JJjj%%%JJj%%J%K%kj%%%%jJJj%
-83073a32j%J%JjjJ%%JjjJJjjJ%%%%%jJ%%%%%%%jJkJLjj%jJjJjKj%%JkJ%j%jKjJ%jJ%jJ%j
-83114a33J%j%JJjj%jK%%%%%%%%%%%j%%%%J%j%%J%jK%kJj%%J%%%%jKj%%%j%%J%jJjJ%Jj%J
$$ y = [-129, -130, -132, -131, -131, -131, -131, -130, -130, -130, -130, -130, -131, -132, -131, -132, -131, -130, -131, -131, -131, -132, -132, -130, -131, -131, -131, -130, -130, -130, -132, -131, -130, -130, -131, -131, -128, -131, -131, -130, -130, -130, -131, -130, -130, -130, -131, -130, -131, -130, -129, -130, -129, -131, -132, -130, -130, -130, -130, -130, -130, -130, -130, -130, -131, -131, -131, -131, -131, -130, -129, -130, -131, -131, -130, -130, -131, -131, -131, -130, -131, -130, -130, -130, -130, -131, -130, -131, -131, -131, -131, -131, -131, -129, -130, -131, -131, -130, -131, -130, -131, -132, -129, -130, -131, -131, -130, -131, -132, -131, -132, -130, -130, -130, -130, -131, -131, -131, -130, -130, -130, -131, -130, -131, -132, -130, -131, -132, -131, -130, -130, -130, -131, -131, -131, -132, -130, -131, -132, -132, -131, -131, -130, -130, -131, -131, -131, -131, -130, -132, -131, -130, -131, -131, -132, -131, -131, -133, -130, -130, -131, -131, -131, -131, -130, -131, -131, -130, -131, -131, -132, -131, -130, -131, -132, -131, -131, -131, -131, -132, -131, -131, -131, -132, -132, -132, -131, -131, -131, -132, -130, -130, -131, -132, -133, -131, -132, -132, -131, -131, -132, -132, -131, -132, -131, -132, -133, -131, -131, -132, -132, -132, -132, -131, -130, -130, -131, -130, -131, -133, -132, -131, -132, -131, -131, -132, -131, -133, -133, -131, -131, -131, -131, -132, -133, -131, -131, -132, -131, -130, -129, -131, -131, -131, -133, -132, -132, -132, -131, -131, -131, -132, -131, -131, -132, -131, -131, -131, -131, -131, -131, -130, -131, -131, -132, -132, -132, -132, -131, -131, -131, -131, -131, -132, -131, -132, -132, -133, -132, -131, -130, -132, -132, -132, -132, -132, -131, -131, -131, -132, -131, -133, -131, -131, -131, -131, -130, -132, -132, -132, -132, -131, -133, -132, -133, -132, -132, -132, -131, -131, -133, -132, -130, -131, -131, -131, -132, -131, -130, -131, -132, -132, -132, -132, -133, -133, -133, -132, -130, -132, -131, -132, -132, -131, -133, -132, -130, -131, -132, -130, -131, -132, -132, -133, -131, -131, -132, -132, -131, -131, -131, -130, -133, -133, -131, -131, -131, -132, -132, -132, -132, -131, -131, -132, -132, -133, -132, -132, -131, -130, -131, -132, -132, -133, -133, -133, -132, -131, -132, -133, -133, -133, -133, -132, -131, -132, -132, -132, -131, -131, -129, -129, -131, -132, -132, -132, -132, -132, -133, -132, -131, -132, -132, -133, -133, -132, -132, -131, -132, -133, -132, -132, -132, -131, -132, -133, -132, -131, -132, -133, -132, -132, -132, -132, -132, -132, -133, -132, -132, -132, -132, -132, -132, -132, -132, -133, -132, -134, -133, -130, -131, -132, -132, -133, -132, -133, -132, -133, -131, -132, -132, -132, -131, -133, -132, -132, -133, -133, -134, -132, -133, -132, -132, -133, -132, -132, -133, -132, -132, -133, -132, -132, -133, -133, -132, -131, -132, -133, -133, -134, -132, -132, -132, -132, -132, -132, -132, -132, -132, -132, -132, -132, -133, -133, -133, -133, -133, -132, -132, -133, -133, -133, -132, -132, -133, -131, -131, -133, -132, -133, -133, -133, -132, -132, -132, -132, -132, -133, -131, -132, -132, -132, -132, -133, -133, -133, -132, -132, -133, -132, -133, -132, -132, -131, -132, -132, -131]
-83156a31j%%j%J%%JjjJ%JjJk%%%Jk%JJjJj%KjjJ%%j%%%Jj%jK%jjJJ%%JjkJ%JkJ%%%%Jj%J
-83197a32j%J%j%%%%jJJ%j%%J%jJKkjjJJjJJlJ%k%J%KjjJkK%JkJ%%%JjKjj%%%%KkJ%kKj%%
-83238a33%%%%Jjj%JjJJkJ%JJjjkKJkK%%kJ%kJKk%%%%JJlJJ%%Jj%J%%jj%jKJj%Jj%j%%%J%
-83279a33%%jj%%%J%%%jJJ%%%%%%%kK%%J%jjJj%%J%%j%%%J%jjJ%J%%jjJJ%%%%%%j%%jJJjK
-83321a32kjJ%%%%Jj%jJjJJjJjjJ%%%jJjJJj%%Jj%%%%%%KjkJ%JjjKj%%j%KjjJ%jJ%j%Kj%j
-83362a35J%KkJ%j%Jj%%Kj%jkKJjkLkJKjk%%%%KkJJj%%%jJjKj%j%%%J%%jJJ%k%%%J%%%%%%
-83403a34%j%JjjJJJj%%j%J%JkJ%j%%Jj%K%%jkJ%jJ%%%J%%jJj%J%k%JJj%%j%Kj%Jj%JJkJ%
-83444a34%%j%J%%j%%%%%Kjj%JjJjJ%jJjJjJ%j%%%J%%%jK%kJj%%j%%%%K%jjJ%%jJJjjK%jJ
$$ y = [-131, -132, -132, -132, -133, -133, -132, -132, -132, -131, -132, -133, -132, -132, -131, -132, -131, -133, -133, -133, -133, -132, -134, -134, -133, -132, -133, -132, -133, -133, -131, -132, -133, -132, -132, -132, -133, -133, -133, -133, -132, -133, -133, -134, -132, -132, -133, -134, -133, -132, -132, -132, -131, -132, -134, -133, -133, -132, -134, -133, -133, -133, -133, -133, -132, -133, -133, -132, -133, -133, -132, -132, -133, -133, -133, -133, -133, -134, -133, -132, -132, -133, -133, -133, -132, -132, -133, -132, -130, -132, -133, -134, -133, -132, -133, -132, -131, -134, -133, -133, -135, -135, -134, -134, -132, -133, -134, -133, -135, -133, -133, -132, -134, -133, -133, -133, -133, -132, -133, -131, -132, -133, -133, -133, -133, -133, -131, -133, -132, -132, -134, -132, -133, -133, -133, -133, -133, -133, -133, -132, -133, -134, -134, -133, -134, -133, -132, -134, -133, -133, -132, -131, -132, -133, -135, -133, -132, -134, -132, -132, -132, -134, -133, -133, -135, -134, -132, -134, -134, -134, -134, -134, -133, -132, -135, -134, -133, -133, -133, -132, -133, -133, -132, -132, -132, -133, -134, -134, -135, -133, -132, -133, -133, -132, -133, -133, -134, -134, -134, -134, -133, -133, -133, -133, -134, -135, -135, -135, -135, -134, -134, -134, -134, -135, -134, -133, -133, -133, -133, -133, -133, -133, -133, -135, -133, -133, -133, -132, -132, -133, -134, -133, -134, -134, -134, -133, -133, -133, -134, -134, -134, -134, -133, -133, -134, -135, -134, -134, -133, -133, -133, -134, -135, -134, -133, -133, -133, -133, -133, -133, -133, -134, -134, -134, -135, -134, -133, -134, -132, -134, -135, -134, -134, -134, -134, -134, -133, -134, -134, -135, -134, -135, -134, -133, -134, -133, -134, -135, -134, -134, -134, -134, -135, -134, -135, -134, -133, -134, -134, -134, -133, -134, -134, -134, -134, -134, -134, -134, -132, -133, -135, -134, -134, -133, -134, -135, -133, -134, -134, -134, -135, -135, -133, -134, -135, -134, -134, -135, -134, -134, -135, -135, -133, -134, -134, -135, -134, -134, -132, -134, -133, -133, -134, -134, -133, -134, -134, -134, -132, -133, -133, -134, -136, -134, -133, -134, -136, -133, -135, -134, -132, -133, -135, -135, -135, -135, -135, -133, -135, -134, -133, -134, -134, -134, -134, -135, -134, -135, -133, -134, -134, -135, -135, -135, -135, -134, -134, -134, -135, -134, -133, -133, -135, -135, -135, -135, -134, -134, -134, -134, -134, -134, -134, -134, -135, -135, -134, -135, -136, -135, -134, -133, -134, -134, -134, -135, -135, -134, -134, -133, -135, -134, -134, -135, -135, -135, -134, -135, -135, -133, -133, -133, -134, -136, -135, -135, -136, -135, -135, -135, -135, -134, -134, -134, -135, -134, -135, -135, -134, -134, -136, -136, -135, -134, -135, -135, -135, -136, -136, -134, -135, -135, -134, -135, -135, -134, -133, -135, -134, -134, -134, -134, -135, -135, -134, -134, -134, -135, -135, -135, -135, -135, -135, -133, -134, -135, -135, -134, -135, -134, -135, -134, -134, -135, -134, -135, -134, -135, -134, -134, -135, -135, -135, -135, -134, -134, -134, -134, -135, -133, -133, -135, -134, -135, -135, -135, -136, -136, -136, -136, -136, -134, -134, -135, -136, -135, -135, -135, -136, -135, -134, -135, -136, -134, -134, -135, -134]
-83485a34kJJjkKjJ%%%Jk%J%j%Jj%K%%j%%%jJJj%%%jJjK%%kJjJ%%%jKj%jJJjJ%j%%%%%%j%
-83527a36JJ%j%%%%%%JkJ%kLj%JkKjJk%%%KjJk%%J%%j%J%%%%jJJj%Jk%J%j%jJ%j%Ljj%%J%
-83568a35j%J%%j%JJjJJkjKj%jJ%%jjKjJ%jJ%j%J%jJ%jJJ%%j%jJJj%%kK%jj%J%J%%jKj%%%
-83609a35j%%JJjj%J%%%jJ%%j%JJjkjK%%jKj%%%%JjKj%%jJj%%%J%%%jKj%%%%jKk%%j%Kj%%
-83650a36%j%J%%JjJkKjj%JJJj%kJjJ%%%JjjJ%%jJKlJjJ%%%jK%k%J%J%JjkJ%J%j%J%%%j%j
-83692a37%%%J%%%%JjJjjKjJ%%jjJJjJ%kJjJ%%jJ%%jJ%%jKj%J%jjKjJjjJJj%%%%JjjJ%jJJ
-83733a35j%%jJJkJ%%Jk%Jk%J%KjJjkJJj%jJ%%KjjJ%j%K%jj%%JjjJJ%%%%jJ%Jj%j%JjJj%%
-83774a37JJjj%%%jJ%%Jj%J%jjKj%%%%Kkj%jK%jKkJJj%%%%%Jk%%J%Kk%J%%j%J%jJjJ%%jj%
$$ y = [-134, -136, -135, -134, -135, -137, -135, -136, -135, -135, -135, -135, -134, -136, -136, -135, -135, -136, -136, -135, -136, -136, -134, -134, -134, -135, -135, -135, -135, -136, -135, -134, -135, -135, -135, -135, -136, -135, -136, -134, -134, -134, -136, -135, -136, -135, -135, -135, -135, -136, -134, -135, -135, -136, -135, -134, -135, -134, -134, -135, -135, -135, -135, -135, -135, -135, -136, -136, -135, -134, -134, -135, -135, -135, -135, -135, -135, -135, -134, -136, -135, -135, -137, -134, -135, -135, -134, -136, -134, -135, -134, -136, -136, -136, -136, -134, -135, -134, -136, -136, -136, -135, -135, -135, -136, -136, -135, -135, -135, -135, -135, -136, -135, -134, -135, -135, -134, -136, -136, -135, -135, -136, -136, -137, -136, -136, -137, -137, -134, -135, -136, -136, -136, -135, -135, -136, -136, -135, -135, -135, -136, -136, -135, -134, -135, -134, -133, -135, -136, -134, -135, -135, -136, -135, -135, -135, -136, -137, -135, -136, -135, -135, -136, -135, -135, -136, -136, -135, -135, -136, -135, -135, -136, -135, -134, -134, -134, -135, -135, -136, -135, -134, -135, -135, -135, -137, -135, -135, -136, -137, -137, -136, -136, -135, -135, -135, -136, -134, -135, -135, -135, -135, -136, -136, -136, -135, -134, -135, -136, -136, -135, -135, -135, -135, -136, -135, -135, -135, -136, -136, -135, -134, -135, -137, -138, -136, -136, -136, -137, -135, -136, -136, -136, -136, -136, -135, -136, -134, -135, -135, -135, -136, -135, -136, -136, -136, -136, -135, -135, -135, -135, -136, -134, -135, -135, -135, -135, -135, -136, -134, -136, -136, -136, -137, -137, -135, -136, -136, -136, -136, -137, -137, -136, -136, -136, -135, -136, -135, -137, -135, -136, -137, -137, -136, -135, -134, -135, -135, -137, -136, -137, -136, -136, -136, -136, -135, -136, -137, -136, -136, -136, -137, -136, -134, -137, -136, -137, -136, -136, -136, -136, -137, -135, -135, -137, -137, -136, -136, -135, -135, -134, -135, -137, -136, -136, -135, -135, -136, -136, -135, -135, -135, -135, -136, -136, -137, -137, -137, -137, -136, -136, -136, -136, -136, -135, -136, -135, -136, -137, -135, -136, -135, -135, -135, -136, -137, -136, -135, -136, -135, -135, -137, -136, -137, -136, -136, -136, -137, -136, -136, -136, -137, -136, -136, -136, -137, -135, -136, -136, -135, -135, -136, -137, -135, -136, -135, -136, -137, -136, -135, -136, -136, -136, -136, -136, -135, -136, -137, -136, -136, -137, -136, -135, -136, -136, -136, -137, -136, -135, -137, -136, -136, -136, -135, -137, -137, -136, -138, -138, -137, -137, -135, -136, -135, -136, -138, -137, -136, -137, -137, -138, -137, -137, -137, -135, -136, -137, -136, -136, -137, -137, -135, -135, -136, -137, -137, -137, -136, -137, -138, -137, -136, -136, -136, -136, -136, -137, -136, -136, -135, -136, -136, -137, -137, -136, -137, -136, -137, -137, -137, -136, -135, -136, -137, -137, -137, -137, -138, -137, -137, -137, -136, -137, -137, -136, -136, -137, -138, -136, -137, -137, -137, -137, -137, -135, -137, -138, -138, -139, -137, -137, -138, -136, -138, -137, -136, -137, -137, -137, -137, -137, -137, -136, -138, -138, -138, -137, -137, -135, -137, -137, -136, -136, -136, -137, -137, -136, -136, -137, -136, -137, -136, -136, -136, -137, -138, -138]
-83815a38%JKlJ%%jJkK%j%%JjKj%%%%%%jKk%J%%%Jk%Jj%Kj%JjkJKjjJKjj%%%Jjj%%JJ%jjJ
-83856a37jJjLjj%%jJ%%jJ%J%%%%%j%j%%jJ%JjjJJ%Jkj%J%J%%%%%j%%J%Kk%jJJkJjjJJ%jJ
-83898a37%%%%jJ%%jJj%J%Jj%j%K%jjJ%%%%j%%%%%%J%jj%KJk%%J%kJ%Jj%%jJ%%J%%JljKJ%
-83939a37%jKk%%%%jJ%%%%j%jL%jjKjJ%%jj%%J%%%jJ%KkJj%%j%J%%%%%%%%JJjjJ%kJ%%%Jj
-83980a38%%%Kjj%J%j%J%kJJkjKJkJ%%%%%%%j%K%jJJkKk%%jJj%%%J%%%%jJJj%j%%Kj%%jKj
-84021a38jJ%%J%jkK%jJj%%%jJ%JJk%%%JKljKJj%%jJ%jJ%%lLJj%jj%J%%%%Jj%jK%%jJ%%%%
-84063a38%%jJ%%%%%j%Jj%%%%JJ%%lJJjKjjjJ%%JjJjJ%Jj%Kl%jJJ%%%j%JkJJj%%J%%%jj%%
-84104a40%L%k%j%JJJjj%%J%JjjKjJj%%%j%%Jj%%%%%%%%%j%J%jK%%%j%j%%%%J%%J%%j%%%k
$$ y = [-138, -138, -137, -135, -138, -137, -137, -137, -138, -137, -139, -137, -137, -138, -138, -138, -137, -138, -136, -137, -137, -137, -137, -137, -137, -137, -138, -136, -138, -138, -137, -137, -137, -137, -136, -138, -138, -137, -138, -138, -136, -137, -137, -136, -137, -139, -138, -136, -137, -138, -137, -135, -136, -137, -137, -137, -137, -136, -137, -138, -138, -138, -137, -136, -136, -137, -138, -137, -138, -137, -138, -135, -136, -137, -137, -137, -138, -137, -137, -137, -138, -137, -137, -136, -136, -136, -136, -136, -136, -137, -137, -138, -138, -138, -139, -138, -138, -137, -138, -139, -138, -137, -137, -136, -138, -139, -139, -138, -138, -137, -137, -137, -137, -137, -137, -138, -138, -138, -137, -137, -135, -137, -137, -138, -137, -136, -138, -137, -138, -139, -138, -137, -137, -138, -137, -137, -137, -137, -137, -138, -137, -137, -137, -138, -137, -138, -138, -137, -137, -136, -137, -137, -138, -138, -136, -136, -137, -138, -137, -137, -137, -137, -137, -138, -138, -138, -138, -138, -138, -138, -137, -137, -138, -139, -139, -137, -136, -138, -138, -138, -137, -137, -139, -138, -138, -137, -138, -138, -138, -139, -138, -138, -138, -137, -137, -137, -136, -139, -140, -138, -137, -137, -137, -138, -136, -138, -138, -138, -138, -138, -139, -138, -138, -138, -138, -138, -139, -139, -140, -137, -137, -138, -139, -137, -138, -137, -137, -137, -138, -139, -139, -139, -138, -138, -138, -138, -139, -138, -138, -136, -138, -137, -138, -138, -138, -139, -139, -138, -138, -138, -138, -138, -138, -138, -138, -138, -137, -136, -137, -138, -137, -137, -139, -138, -138, -138, -138, -137, -138, -138, -138, -138, -136, -137, -138, -138, -137, -137, -138, -138, -137, -137, -139, -138, -137, -139, -140, -138, -137, -139, -138, -138, -138, -138, -138, -138, -138, -138, -139, -139, -137, -137, -138, -137, -136, -138, -136, -138, -138, -138, -139, -138, -139, -139, -139, -139, -138, -138, -138, -138, -138, -139, -138, -137, -138, -138, -139, -139, -139, -137, -138, -138, -138, -139, -137, -138, -139, -138, -138, -138, -137, -137, -138, -140, -138, -138, -139, -138, -139, -139, -139, -139, -140, -139, -139, -138, -137, -139, -139, -139, -139, -138, -136, -139, -140, -138, -137, -138, -138, -138, -139, -138, -138, -139, -138, -138, -138, -141, -138, -137, -138, -138, -139, -140, -140, -139, -139, -139, -139, -139, -138, -139, -139, -140, -138, -138, -138, -139, -138, -138, -138, -138, -138, -138, -138, -139, -138, -138, -138, -138, -138, -138, -139, -139, -138, -139, -139, -139, -139, -139, -138, -137, -137, -137, -140, -139, -138, -139, -137, -138, -139, -140, -139, -139, -139, -138, -139, -138, -139, -138, -138, -137, -138, -138, -136, -139, -139, -140, -139, -138, -138, -138, -138, -139, -139, -138, -140, -139, -138, -139, -139, -139, -138, -138, -138, -138, -139, -140, -140, -140, -140, -137, -137, -139, -139, -140, -140, -139, -138, -137, -138, -139, -139, -139, -138, -138, -137, -138, -139, -137, -138, -137, -138, -138, -138, -138, -139, -139, -139, -138, -139, -139, -139, -139, -139, -139, -139, -139, -139, -139, -140, -140, -139, -139, -140, -138, -138, -138, -138, -139, -139, -140, -140, -140, -140, -140, -139, -139, -139, -138, -138, -138, -139, -139, -139, -139, -141]
-84145a41JJ%K%jj%%J%%%j%J%Jjj%%jK%j%jJjKkJJjJjjKj%Kjj%%JkK%%j%jJjJ%%%JkJjjKJ
-84186a38jJ%jjJ%jJ%JjjLljKjJjJ%j%%J%jjJJ%j%%%%jJJJ%jjJ%%%J%kJjJJj%jJ%j%%%JJ%
-84227a38%jj%Jj%J%jjJ%%jJ%JjJjKj%%%jjKJj%%jJjJj%jJJ%JkJj%J%jjK%j%Jj%%%%%JjJJ
-84269a38jjJ%%%j%%jJJ%j%J%%jJj%J%%j%%%jJ%JjjKj%JjjJjJjJ%%%%Jj%%%jJ%%jJ%%j%J%
-84310a40%jKj%%%Kjk%%%%KkKjkJJj%jKj%JJkkJ%J%%%%%JjJJj%j%%%J%j%%J%jJjJJj%Jj%j
-84351a41KjkJJ%%%%J%jj%J%JkKj%jjJ%J%j%KkJJj%%jKjjJ%jJjJ%%%%kK%JkJ%%l%L%Jj%%%
-84392a40kJ%Jj%J%JkJj%J%%%kKj%jKjJj%K%k%J%jJj%%%%JKkjKkJ%j%%kKJ%%%Jj%%j%jJ%%
-84434a41J%j%jJ%jjK%jKjJ%%%jJJk%%jJJk%%JJjj%J%jK%%%j%JkJj%%JJ%%j%JkK%jjJ%%%%
$$ y = [-141, -140, -139, -139, -137, -137, -138, -139, -139, -139, -138, -138, -138, -138, -139, -139, -138, -138, -137, -138, -139, -139, -139, -140, -138, -138, -139, -139, -140, -139, -140, -138, -140, -139, -138, -139, -138, -139, -140, -138, -139, -139, -137, -138, -139, -139, -139, -138, -140, -138, -138, -138, -139, -139, -140, -139, -140, -139, -139, -139, -139, -138, -140, -139, -140, -141, -139, -138, -139, -138, -138, -139, -140, -139, -139, -140, -139, -139, -138, -139, -140, -137, -140, -141, -139, -140, -139, -140, -139, -139, -140, -140, -140, -139, -139, -140, -141, -140, -139, -139, -140, -140, -140, -140, -140, -141, -140, -139, -138, -138, -139, -140, -139, -139, -139, -139, -138, -138, -140, -139, -140, -139, -138, -139, -139, -140, -139, -139, -140, -140, -140, -140, -139, -138, -138, -138, -139, -140, -140, -139, -140, -140, -139, -139, -140, -141, -140, -140, -140, -141, -140, -140, -139, -140, -139, -140, -138, -139, -139, -139, -139, -140, -141, -139, -138, -139, -139, -139, -140, -139, -140, -139, -140, -140, -141, -140, -139, -139, -138, -140, -139, -140, -140, -139, -139, -140, -141, -139, -139, -140, -140, -139, -140, -140, -140, -140, -140, -140, -139, -140, -139, -138, -139, -140, -139, -139, -139, -139, -140, -140, -140, -141, -140, -139, -139, -140, -140, -139, -139, -139, -140, -139, -140, -140, -139, -139, -139, -140, -140, -140, -140, -141, -140, -140, -139, -140, -141, -139, -140, -140, -139, -140, -141, -140, -141, -140, -141, -140, -140, -140, -140, -140, -139, -140, -140, -140, -140, -141, -140, -140, -140, -141, -140, -140, -140, -141, -141, -140, -140, -140, -141, -139, -140, -140, -140, -140, -138, -139, -141, -141, -141, -141, -141, -139, -141, -139, -140, -142, -141, -140, -141, -141, -142, -140, -141, -141, -140, -139, -141, -143, -142, -142, -141, -141, -141, -141, -141, -141, -140, -141, -140, -139, -140, -140, -141, -141, -141, -141, -140, -140, -141, -141, -141, -140, -140, -141, -140, -141, -140, -139, -140, -140, -139, -140, -140, -141, -139, -140, -142, -141, -140, -140, -140, -140, -140, -139, -139, -140, -141, -141, -140, -140, -139, -141, -139, -140, -140, -141, -142, -141, -141, -140, -140, -141, -141, -139, -141, -140, -139, -140, -140, -140, -141, -139, -140, -141, -140, -140, -141, -140, -141, -140, -140, -140, -140, -140, -142, -140, -140, -139, -141, -140, -140, -140, -143, -143, -140, -140, -139, -140, -140, -140, -140, -142, -141, -141, -140, -141, -141, -140, -140, -139, -141, -140, -141, -141, -140, -140, -140, -140, -142, -140, -141, -141, -142, -140, -141, -140, -141, -141, -139, -139, -141, -141, -140, -140, -141, -140, -141, -141, -141, -141, -141, -140, -138, -140, -141, -139, -141, -140, -140, -141, -141, -141, -143, -141, -140, -140, -140, -140, -139, -140, -140, -140, -141, -141, -142, -141, -141, -141, -140, -140, -141, -141, -142, -141, -141, -142, -143, -141, -141, -142, -140, -141, -140, -140, -140, -140, -141, -140, -139, -141, -141, -141, -142, -141, -140, -142, -142, -142, -141, -140, -141, -142, -142, -141, -141, -142, -140, -140, -140, -140, -141, -141, -140, -142, -141, -142, -142, -142, -141, -140, -140, -140, -141, -141, -140, -142, -140, -140, -141, -142, -141, -141, -141, -141, -141]
-84475a41%j%JJ%Jjj%Jj%%%%jJ%%jKj%%%%%JkK%lK%j%JjJkJJ%%%jKj%%%%Jj%%%%%jJ%%jKk
-84516a42J%j%%J%j%%J%jJ%J%k%JjJjJ%%%%%%%%%%%Kk%jJ%%J%j%%%%jJJj%j%%%J%%j%%%%J
-84557a41%%%%%j%%J%%J%kJjjJ%%%%%%%%%J%j%%%%%%%JlJ%%J%%%J%%%%j%%%JJ%%lLlJ%%j%
-84598a43J%%%J%%%%JjjjLlJJ%j%%%%%%%%%%jJJj%KkjJ%%%Jkj%J%J%%JkKj%%%Jj%%%j%%J%
-84640a42jJ%%%%%j%JJ%%%jkJJ%%%%%%JjjKj%%%Jj%JJlJ%Jj%kKj%%%%J%%%%%Jj%%%j%jKKk
-84681a42jKj%JkJ%kJJjKjj%%%%J%j%%%Jj%%JkK%jJjjK%%%jJ%%%Jjj%Jj%JJkJ%j%jKJkJ%%
-84722a42%jJ%jJj%%JJ%k%JjJ%j%%%%%%J%%%kK%%j%%j%KjKjj%%jJ%JlKjKjKkJj%%kKjKjj%
-84763a44%JjJ%%j%K%j%%jKk%J%%%%J%jj%JjJ%%jJJj%%%J%kJ%%J%j%%JjjJ%%%%%%%%%jJ%%
$$ y = [-141, -141, -142, -142, -141, -140, -140, -139, -140, -141, -141, -140, -141, -141, -141, -141, -141, -142, -141, -141, -141, -142, -140, -141, -141, -141, -141, -141, -141, -140, -142, -140, -140, -143, -141, -141, -142, -142, -141, -142, -141, -143, -142, -141, -141, -141, -141, -142, -140, -141, -141, -141, -141, -141, -140, -141, -141, -141, -141, -141, -141, -142, -141, -141, -141, -142, -140, -142, -141, -141, -142, -142, -142, -141, -141, -142, -142, -142, -141, -141, -142, -141, -141, -140, -140, -142, -142, -141, -142, -141, -142, -141, -141, -141, -141, -141, -141, -141, -141, -141, -141, -141, -141, -139, -141, -141, -142, -141, -141, -141, -140, -140, -141, -141, -141, -141, -141, -142, -141, -140, -141, -141, -142, -142, -142, -142, -141, -141, -141, -142, -142, -142, -142, -142, -141, -141, -141, -141, -141, -141, -142, -142, -142, -141, -141, -141, -140, -140, -142, -141, -142, -143, -142, -142, -142, -142, -142, -142, -142, -142, -142, -142, -141, -141, -142, -142, -142, -142, -142, -142, -142, -142, -141, -144, -143, -143, -143, -142, -142, -142, -142, -141, -141, -141, -141, -141, -142, -142, -142, -142, -141, -140, -140, -140, -143, -140, -143, -142, -142, -142, -143, -143, -142, -142, -142, -142, -141, -141, -141, -141, -141, -140, -141, -142, -143, -140, -143, -142, -141, -141, -142, -142, -142, -142, -142, -142, -142, -142, -142, -142, -142, -143, -142, -141, -142, -142, -140, -142, -143, -142, -142, -142, -142, -141, -143, -144, -144, -143, -143, -142, -142, -142, -141, -143, -141, -142, -142, -142, -142, -141, -142, -142, -142, -142, -143, -143, -143, -142, -142, -143, -142, -142, -142, -142, -142, -142, -143, -143, -142, -141, -141, -141, -141, -142, -144, -143, -142, -142, -142, -142, -142, -142, -142, -141, -142, -143, -141, -142, -142, -142, -142, -141, -142, -142, -141, -140, -143, -142, -142, -141, -142, -142, -144, -142, -143, -143, -143, -143, -143, -142, -142, -142, -142, -142, -142, -141, -142, -142, -142, -142, -143, -143, -144, -142, -140, -142, -143, -141, -142, -142, -141, -143, -142, -142, -144, -143, -142, -143, -141, -142, -143, -143, -143, -143, -143, -142, -142, -143, -143, -143, -143, -142, -143, -143, -143, -142, -144, -142, -142, -143, -142, -143, -144, -142, -142, -142, -142, -143, -142, -142, -142, -142, -141, -142, -143, -143, -142, -143, -143, -142, -141, -143, -142, -142, -143, -143, -144, -142, -141, -143, -142, -142, -142, -142, -143, -142, -142, -143, -142, -143, -143, -143, -142, -141, -141, -143, -143, -142, -143, -142, -142, -143, -143, -143, -143, -143, -143, -143, -142, -142, -142, -142, -144, -142, -142, -142, -143, -143, -143, -144, -144, -142, -143, -141, -142, -143, -143, -143, -144, -143, -143, -142, -145, -143, -144, -142, -143, -141, -143, -142, -143, -143, -143, -145, -143, -144, -142, -143, -144, -144, -144, -143, -144, -143, -143, -143, -144, -144, -142, -142, -143, -143, -143, -144, -142, -144, -144, -143, -143, -143, -143, -143, -142, -142, -143, -144, -144, -143, -144, -143, -143, -143, -144, -143, -142, -143, -143, -143, -143, -142, -142, -144, -143, -143, -143, -142, -142, -143, -143, -143, -142, -143, -144, -143, -143, -143, -143, -143, -143, -143, -143, -143, -143, -144, -143, -143, -143]
-84805a43%%J%kJjJj%%jJJ%%JjJj%J%j%%%%%%j%%%%J%%%j%jK%jJ%%kJJ%%%%JlK%%%%%%%J%
-84846a42kJ%Jj%kJ%%%jJ%JJ%j%%jJ%%jJ%j%JJj%jJJj%J%j%jJ%%jJ%jJ%%j%%%%JjJJj%%%%
-84887a43%jj%%%J%j%%J%%J%%Jj%%%jJj%%KjjJ%%JjJ%%kJkKJj%%%%jJj%j%K%j%J%j%JJjj%
-84928a44%%%%JjJ%jJ%%J%jjK%JkkJjK%%jJjKjj%%%%%%%%%%Jj%Jj%JkJJkK%kJJ%%jJ%JkjJ
-84970a44%%%%jKj%kjK%Jj%KJj%kKJk%%jJ%j%J%%jJ%kJ%JjjKJjJ%j%jJ%%KlJ%jJJjjK%%%%
-85011a43%j%%%Jj%%Jj%%j%JjJ%j%%%%J%Jj%%%%jJ%%JkJJj%%%j%J%jKj%j%JJk%jK%%%JjjJ
-85052a44%%j%JJkKk%%%%J%%%j%jJJjJ%kKj%JKk%%j%%%%%JJj%JkKj%kJ%J%%%jJ%%j%%%JjJ
-85093a44j%%%%%JkKjjK%jJ%Kjj%j%JJk%J%J%jj%j%JJ%kJJkJ%%jKk%jJJjK%jJ%jJJjj%j%%
$$ y = [-143, -143, -143, -142, -142, -144, -143, -144, -143, -144, -144, -144, -145, -144, -143, -143, -143, -142, -143, -142, -143, -143, -142, -142, -143, -143, -143, -143, -143, -143, -143, -144, -144, -144, -144, -144, -143, -143, -143, -143, -144, -144, -145, -143, -143, -144, -143, -143, -143, -145, -144, -143, -143, -143, -143, -143, -142, -145, -143, -143, -143, -143, -143, -143, -143, -143, -142, -142, -144, -143, -143, -142, -143, -143, -145, -144, -144, -144, -144, -145, -144, -144, -143, -142, -142, -143, -143, -143, -144, -143, -143, -143, -144, -143, -143, -144, -144, -143, -142, -143, -143, -144, -143, -142, -143, -143, -142, -142, -143, -143, -144, -143, -143, -143, -144, -143, -143, -144, -143, -143, -143, -144, -144, -144, -144, -144, -143, -144, -143, -142, -143, -143, -143, -143, -143, -143, -144, -145, -145, -145, -145, -144, -144, -145, -145, -145, -144, -144, -144, -143, -143, -143, -142, -143, -143, -143, -143, -144, -143, -144, -144, -144, -142, -143, -144, -143, -143, -143, -142, -143, -142, -142, -142, -144, -143, -145, -143, -142, -143, -143, -143, -143, -143, -144, -143, -144, -144, -145, -145, -143, -143, -144, -144, -143, -143, -144, -144, -143, -142, -143, -144, -144, -144, -144, -144, -144, -143, -144, -143, -143, -144, -143, -143, -143, -142, -142, -143, -144, -142, -142, -141, -143, -145, -144, -145, -143, -143, -143, -144, -143, -144, -142, -143, -144, -144, -144, -144, -144, -144, -144, -144, -144, -144, -144, -143, -144, -144, -143, -144, -144, -143, -145, -144, -143, -145, -143, -143, -145, -144, -143, -143, -143, -144, -143, -143, -142, -144, -145, -144, -144, -144, -144, -144, -145, -143, -144, -144, -146, -147, -145, -145, -144, -145, -145, -143, -142, -143, -143, -145, -143, -142, -144, -144, -144, -145, -144, -144, -145, -145, -144, -144, -144, -145, -144, -144, -146, -145, -145, -144, -145, -146, -144, -143, -144, -143, -143, -144, -144, -145, -144, -144, -144, -142, -145, -144, -144, -145, -144, -143, -144, -145, -143, -143, -143, -143, -143, -143, -144, -144, -144, -144, -143, -144, -144, -144, -143, -144, -144, -144, -145, -145, -144, -145, -144, -144, -145, -145, -145, -145, -145, -144, -144, -143, -144, -144, -144, -144, -144, -145, -144, -144, -144, -143, -145, -144, -143, -144, -144, -144, -144, -145, -145, -144, -144, -145, -143, -144, -144, -145, -145, -144, -143, -145, -145, -146, -144, -144, -144, -144, -143, -144, -145, -144, -144, -144, -145, -145, -144, -143, -145, -143, -145, -145, -145, -145, -145, -144, -144, -144, -144, -145, -145, -146, -145, -144, -145, -144, -144, -146, -144, -145, -145, -144, -142, -144, -144, -144, -145, -145, -145, -145, -145, -145, -144, -143, -144, -144, -143, -145, -143, -144, -144, -146, -145, -145, -144, -144, -144, -144, -145, -144, -144, -144, -145, -145, -145, -145, -144, -145, -144, -145, -145, -145, -145, -145, -145, -144, -146, -144, -145, -146, -144, -144, -145, -144, -144, -142, -143, -144, -144, -145, -145, -144, -143, -145, -145, -144, -144, -143, -143, -144, -145, -145, -146, -146, -145, -144, -144, -146, -145, -144, -146, -145, -145, -145, -146, -144, -146, -146, -147, -146, -145, -146, -144, -144, -145, -144, -144, -145, -144, -143, -144, -145, -145, -146, -146, -146]
-85134a46%%%JJjJj%jJ%J%%%j%%jJ%%jJjJjJJj%J%%jJlK%jJJjj%J%%%jK%k%JJ%kKj%jJ%%J
-85176a44j%kJ%%J%%jKkjJ%%JjJ%%%%%j%JjjJJj%Kj%%Jk%%%JjJJ%j%j%K%jj%%%J%kJK%kJ%
-85217a45j%%%JjJ%j%%jJj%%J%jK%%Jj%%jKk%J%j%j%L%%jjJ%%j%%%J%%kJj%J%J%%j%%KkJ%
-85258a45Jj%%j%%%KjjjJ%%%%%%%jK%%jjJ%J%jj%J%Jj%%%%%JjjJ%%%J%%j%%J%%%%%%kJ%%%
-85299a46%%Jj%%%J%jjJJ%k%J%%%%%jJ%%jKk%J%J%j%%%%J%%Jjj%jJ%%%%%%%%%j%J%%%%%%%
-85341a46jJKk%Jjj%%J%Jjj%JkK%JkjLjj%Jj%%%J%j%%%%%%%%JjKkJ%%jjJ%J%%%Jk%%JkJ%J
-85382a46Jj%%Jj%JkJJ%j%%%%%%%%%J%%kJJ%%j%jJ%%%%%j%%%K%jjJ%%jJJ%kJj%Jj%%jJ%Jj
-85423a47KjJ%kJjJjjJ%%J%jj%JJ%jKJjjjJ%j%JjJJk%JjJ%j%%JJ%jkJ%J%jJJkj%%J%KkJjJ
$$ y = [-146, -146, -146, -146, -145, -144, -145, -144, -145, -145, -146, -145, -145, -144, -144, -144, -144, -145, -145, -145, -146, -145, -145, -145, -146, -145, -146, -145, -146, -145, -144, -145, -145, -144, -144, -144, -145, -144, -147, -145, -145, -146, -145, -144, -145, -146, -146, -145, -145, -145, -145, -146, -144, -144, -146, -146, -145, -144, -144, -146, -144, -145, -145, -146, -145, -145, -145, -144, -145, -145, -147, -146, -146, -146, -145, -145, -145, -146, -144, -146, -147, -146, -146, -146, -145, -146, -145, -145, -145, -145, -145, -145, -146, -146, -145, -146, -147, -146, -145, -146, -146, -144, -145, -145, -145, -144, -146, -146, -146, -146, -145, -146, -145, -144, -144, -145, -145, -146, -146, -144, -144, -145, -146, -146, -146, -146, -145, -145, -147, -146, -144, -144, -146, -145, -145, -146, -146, -146, -146, -145, -146, -145, -145, -146, -146, -146, -147, -146, -147, -147, -147, -146, -146, -147, -145, -145, -145, -144, -145, -145, -145, -146, -144, -146, -146, -145, -145, -146, -146, -147, -147, -144, -144, -144, -145, -146, -145, -145, -145, -146, -146, -146, -146, -145, -145, -145, -147, -146, -147, -147, -146, -146, -145, -145, -145, -146, -146, -146, -144, -146, -145, -145, -144, -145, -145, -145, -146, -146, -146, -146, -144, -145, -146, -147, -146, -146, -146, -146, -146, -146, -146, -146, -147, -145, -145, -145, -146, -147, -146, -146, -145, -145, -146, -147, -147, -146, -146, -145, -146, -146, -146, -146, -146, -146, -145, -146, -147, -146, -146, -146, -146, -145, -145, -145, -146, -146, -146, -145, -145, -145, -145, -145, -145, -145, -147, -146, -146, -146, -146, -146, -146, -145, -146, -146, -146, -146, -145, -145, -146, -147, -146, -145, -145, -147, -147, -146, -146, -146, -146, -146, -146, -147, -146, -146, -146, -147, -145, -147, -147, -146, -146, -145, -145, -146, -146, -146, -146, -146, -145, -145, -145, -144, -145, -146, -146, -147, -146, -146, -146, -146, -146, -146, -146, -146, -146, -146, -147, -147, -146, -146, -146, -146, -146, -146, -146, -146, -147, -146, -144, -146, -146, -145, -146, -147, -147, -147, -146, -146, -145, -146, -147, -147, -146, -148, -146, -146, -145, -147, -148, -145, -146, -147, -147, -146, -147, -147, -147, -147, -146, -146, -147, -147, -147, -147, -147, -147, -147, -147, -147, -146, -147, -145, -147, -146, -146, -146, -147, -148, -147, -147, -146, -146, -146, -146, -145, -147, -147, -147, -146, -148, -147, -147, -146, -145, -146, -146, -146, -145, -146, -146, -145, -147, -146, -145, -145, -146, -146, -146, -146, -146, -146, -146, -146, -146, -146, -145, -145, -145, -147, -146, -145, -145, -145, -146, -146, -147, -146, -146, -146, -146, -146, -146, -147, -147, -147, -147, -145, -145, -146, -147, -146, -146, -146, -147, -146, -145, -145, -147, -146, -147, -147, -146, -147, -147, -147, -148, -147, -147, -146, -147, -145, -146, -145, -145, -147, -146, -147, -146, -147, -148, -147, -147, -147, -146, -146, -147, -148, -148, -147, -146, -146, -147, -145, -144, -145, -146, -147, -146, -146, -147, -147, -146, -147, -146, -145, -147, -147, -146, -147, -146, -146, -147, -147, -147, -146, -145, -145, -146, -148, -147, -147, -146, -146, -147, -146, -145, -147, -148, -148, -148, -147, -147, -145, -147, -146, -147, -146]
-85464a46%jKk%%jJjJ%%JJ%k%jJ%%%jJ%JjJjjK%%j%%%%Jj%Jj%%JJjjJ%%JkKj%jjJJj%jK%%
-85505a46jjJj%jJJ%Jj%%%%jJjKj%%Jj%Jj%jJjJ%Jj%kJ%%%JJj%J%jj%Kj%%kK%J%%%%k%Kjj
-85547a48%%%%%Kj%%jKj%jJj%%%%%kM%j%%j%J%jJkJjJJj%%%%JjKkJ%j%J%k%KjJ%%%Jjj%J%
-85588a47%%%kK%jJjJ%%jJ%jK%k%J%j%%J%jjJJJkj%J%%%JJkJJjJj%j%%%J%j%J%%j%jKjj%K
-85629a47%%kJ%J%jjJJkJj%J%J%jjJ%%%%%%%%jJJ%%%%j%%J%%j%%%%%jJ%%J%%JlJ%j%%JJKk
-85670a47%%%%j%%%KkJJjjJ%%j%%%%JJkjJ%%jJ%%%%J%j%jJJ%j%J%j%%%jJJj%%%J%%%jjJ%K
-85712a46k%%J%kJ%%J%j%%%%jJ%J%%jJJkJjj%%Kj%%KlJ%%%%%J%%%JkJjj%LkkMjk%LkKj%j%
-85753a48J%jJj%jJ%J%j%%%J%JjKj%JjJJ%J%JJ%%LJK%%J%JJJ%jKj%Kk%%j%%%kJj%Jj%%J%J
$$ y = [-146, -146, -147, -145, -147, -147, -147, -148, -147, -148, -147, -147, -147, -146, -145, -145, -147, -147, -148, -147, -147, -147, -147, -148, -147, -147, -146, -147, -146, -147, -148, -146, -146, -146, -147, -147, -147, -147, -147, -146, -147, -147, -146, -147, -147, -147, -146, -145, -146, -147, -146, -146, -146, -145, -147, -145, -146, -146, -147, -148, -147, -146, -147, -147, -148, -146, -146, -146, -147, -148, -147, -148, -148, -149, -148, -147, -147, -146, -147, -147, -147, -147, -147, -148, -147, -148, -146, -147, -147, -147, -146, -147, -147, -146, -147, -147, -148, -147, -148, -147, -147, -146, -147, -147, -149, -148, -148, -148, -148, -147, -146, -147, -147, -146, -146, -147, -148, -148, -146, -147, -147, -147, -149, -147, -147, -146, -146, -146, -146, -146, -148, -148, -146, -147, -148, -148, -148, -148, -148, -148, -146, -147, -147, -147, -148, -146, -147, -147, -148, -147, -148, -148, -148, -148, -148, -148, -150, -146, -146, -147, -147, -147, -148, -148, -147, -147, -148, -147, -149, -148, -149, -148, -147, -148, -148, -148, -148, -148, -147, -148, -146, -148, -147, -147, -148, -148, -147, -147, -149, -149, -147, -148, -147, -147, -147, -147, -146, -147, -148, -148, -147, -147, -147, -147, -147, -149, -147, -147, -148, -147, -148, -147, -147, -147, -148, -147, -147, -148, -146, -146, -148, -148, -147, -147, -148, -148, -148, -147, -147, -148, -149, -148, -147, -146, -148, -149, -149, -148, -148, -148, -148, -147, -146, -148, -147, -146, -147, -146, -147, -147, -148, -148, -148, -148, -147, -147, -148, -148, -147, -147, -147, -148, -148, -149, -147, -148, -149, -149, -147, -147, -147, -149, -148, -148, -147, -147, -148, -149, -148, -147, -149, -148, -149, -149, -148, -148, -147, -147, -148, -149, -148, -148, -148, -148, -148, -148, -148, -148, -148, -149, -148, -147, -147, -147, -147, -147, -148, -148, -148, -147, -147, -147, -148, -148, -148, -148, -148, -148, -149, -148, -148, -148, -147, -147, -147, -146, -149, -148, -148, -149, -149, -149, -148, -147, -145, -147, -147, -147, -147, -147, -148, -148, -148, -148, -146, -148, -147, -146, -147, -148, -147, -147, -147, -148, -148, -148, -148, -148, -147, -146, -148, -149, -148, -148, -148, -149, -148, -148, -148, -148, -148, -147, -147, -148, -148, -149, -148, -147, -147, -148, -148, -147, -147, -148, -148, -148, -148, -149, -148, -147, -148, -148, -148, -148, -147, -147, -147, -147, -148, -149, -148, -148, -146, -148, -148, -148, -147, -147, -149, -148, -148, -148, -147, -147, -148, -148, -148, -148, -148, -149, -148, -148, -147, -147, -147, -148, -147, -146, -148, -147, -148, -149, -149, -149, -147, -148, -148, -148, -146, -149, -148, -148, -148, -148, -148, -148, -147, -147, -147, -147, -146, -148, -147, -148, -149, -149, -146, -148, -150, -146, -147, -149, -149, -146, -148, -146, -147, -147, -148, -148, -147, -147, -148, -147, -148, -148, -149, -148, -148, -147, -147, -148, -148, -148, -148, -147, -147, -146, -147, -145, -146, -146, -145, -146, -145, -144, -144, -143, -143, -142, -141, -141, -141, -138, -137, -135, -135, -135, -134, -134, -133, -132, -131, -131, -132, -130, -131, -131, -129, -131, -131, -131, -132, -132, -132, -132, -134, -133, -134, -134, -133, -134, -134, -134, -133, -133, -132]
-85794a32jLjJ%%jJJkjJj%k%j%jjjkjj%%j%k%Jj%%jj%%%%%Jk%%Jj%J%kJjKjjJ%jJj%%jLjj
-85835a49Jj%J%j%%%%%%%Kj%jJ%j%J%%%%j%JjKk%jJJ%%%%JjJ%jj%%%%jJjJ%Jj%Kj%%jJ%%j
-85876a49J%jjKjJ%j%%%%%%J%j%JjJj%%j%JJjj%%%%JJ%%j%%%%%%JkJjKjj%JJj%%%j%%J%Jk
-85918a50Kjj%%%J%%JkJ%%j%jKjJjK%j%%jJ%%J%j%%%J%%%jj%JkK%j%J%%%%%%%J%%%jjJ%%%
-85959a49%%%Jj%%%%kJ%%Kj%kKJjJjjJ%Jj%%%j%%%JjjJKj%%jKkJjJj%J%JkKk%%J%%%%j%Jj
-86000a50J%Jjjj%Kj%jJj%KjK%jk%JJkJ%JkK%kJ%Kj%j%%JjJj%%kKJj%jJjJK%jjJjKkjJ%%k
-86041a52LkK%%j%%%%%jJJ%kK%J%%k%%KkJj%%jJ%jJ%%kKjJ%%%%%%KjkJ%%jJJj%%%%j%Jk%%
-86083a52K%jJJJk%jJ%%%J%j%j%JjJJ%jJ%%jj%%%Jj%%J%Jj%%%%Jk%JjJ%JkJ%kK%jJjJJ%J%
$$ y = [-132, -133, -130, -131, -130, -130, -130, -131, -130, -129, -131, -132, -131, -132, -132, -134, -134, -135, -135, -136, -137, -138, -140, -141, -142, -142, -142, -143, -143, -145, -145, -144, -145, -145, -145, -146, -147, -147, -147, -147, -147, -147, -146, -148, -148, -148, -147, -148, -148, -147, -147, -149, -148, -149, -147, -148, -149, -148, -148, -149, -148, -149, -149, -149, -150, -147, -148, -149, -148, -149, -149, -148, -148, -149, -149, -149, -149, -149, -149, -149, -149, -147, -148, -148, -149, -148, -148, -149, -149, -148, -148, -148, -148, -148, -149, -149, -148, -149, -147, -149, -149, -150, -149, -148, -148, -148, -148, -148, -147, -148, -147, -147, -148, -149, -149, -149, -149, -149, -150, -149, -150, -149, -149, -148, -149, -149, -147, -148, -148, -148, -149, -148, -148, -148, -149, -148, -148, -149, -150, -148, -149, -148, -148, -149, -149, -149, -149, -149, -149, -149, -148, -148, -149, -149, -148, -149, -148, -149, -149, -149, -150, -150, -149, -148, -149, -150, -150, -150, -150, -150, -149, -148, -148, -148, -149, -149, -149, -149, -149, -149, -149, -148, -150, -149, -150, -148, -149, -150, -150, -149, -148, -149, -149, -149, -149, -150, -150, -150, -149, -149, -148, -150, -148, -149, -150, -150, -150, -150, -149, -149, -149, -148, -150, -149, -149, -149, -150, -150, -151, -149, -150, -149, -150, -148, -148, -149, -149, -149, -150, -149, -149, -149, -148, -148, -149, -149, -149, -149, -148, -148, -148, -148, -149, -150, -150, -149, -151, -149, -149, -150, -150, -149, -149, -149, -149, -149, -149, -149, -149, -148, -148, -148, -148, -149, -150, -149, -149, -149, -149, -149, -149, -149, -148, -149, -149, -149, -149, -149, -151, -150, -150, -150, -148, -149, -149, -151, -149, -148, -149, -148, -149, -150, -149, -149, -148, -149, -149, -149, -149, -150, -150, -150, -150, -149, -150, -151, -150, -148, -149, -149, -149, -150, -148, -150, -149, -150, -149, -150, -150, -149, -149, -148, -150, -148, -150, -150, -150, -149, -149, -149, -149, -149, -150, -150, -149, -150, -149, -149, -148, -149, -150, -151, -151, -149, -150, -150, -151, -150, -151, -151, -149, -150, -148, -148, -149, -151, -151, -150, -149, -151, -150, -150, -149, -151, -149, -149, -151, -150, -150, -148, -149, -149, -150, -150, -150, -149, -150, -149, -150, -150, -150, -152, -150, -149, -150, -150, -151, -150, -151, -150, -148, -148, -149, -150, -149, -150, -148, -150, -151, -150, -150, -150, -152, -149, -151, -149, -149, -149, -150, -150, -150, -150, -150, -150, -151, -150, -149, -149, -151, -149, -149, -148, -148, -148, -150, -150, -150, -148, -150, -149, -150, -150, -150, -151, -150, -150, -151, -150, -150, -150, -152, -150, -151, -150, -150, -150, -150, -150, -150, -150, -148, -149, -151, -150, -150, -150, -151, -150, -149, -150, -150, -150, -150, -150, -151, -151, -150, -152, -152, -152, -150, -150, -151, -150, -149, -148, -150, -150, -151, -150, -150, -150, -150, -149, -149, -150, -150, -151, -151, -150, -151, -150, -149, -149, -150, -149, -149, -149, -150, -151, -151, -151, -151, -150, -151, -151, -151, -150, -150, -149, -150, -150, -150, -150, -150, -149, -151, -151, -150, -151, -150, -150, -149, -151, -150, -150, -152, -150, -150, -151, -150, -151, -150, -149, -149, -148, -148]
-86124a48kjJ%jJJ%jjKk%JJ%j%JjjJ%%%jJJkJj%%J%%JjjKj%jJJj%jJ%jJjJ%jK%jjJ%j%j%K
-86165a50%Jj%%%%%J%jjj%J%%Jj%%Jj%%%jJJ%%%JjjJ%%%JjjJkJJ%%Jk%Jj%J%%%%%%jJ%%j%
-86206a51%%J%k%K%j%%%J%j%j%J%%%%%%%JJkJJ%jjKj%%jJ%%%%j%%J%%j%jJ%JjkK%J%jJJkJ
-86247a50JkjJJ%j%%%kMlKjjJjK%%j%JjjJJ%%%%%kJ%K%kJ%%%%jjJ%%%%%Jj%%%JjK%%jjjJJ
-86289a50kJJj%j%JKkJk%%%Kk%%Kk%%J%J%jKk%Jj%%JjJjJ%j%jJ%%%%Jj%%jjKj%J%J%jjJj%
-86330a52%%%J%J%jjKkjJJ%j%J%j%%J%%%%%J%%j%j%Kj%KkjKjj%%K%kKj%Jj%JjjKj%%jK%%j
-86371a51j%%%J%%j%%J%j%J%JjjJj%Kjj%%%%jK%%jJ%jJjJ%%%%%j%J%jJ%jJjJ%%j%%%%K%j%
-86412a51%%jjJJJj%J%%j%Kk%%%KkjJ%%j%JjJjJ%j%J%%kJKJjj%Jj%j%%%%J%%%%jkJJLlJ%%
$$ y = [-148, -150, -151, -150, -150, -151, -150, -149, -149, -150, -151, -149, -151, -151, -150, -149, -149, -150, -150, -149, -150, -151, -150, -150, -150, -150, -151, -150, -149, -151, -150, -151, -151, -151, -150, -150, -150, -149, -150, -151, -149, -150, -150, -151, -150, -149, -150, -150, -151, -150, -150, -151, -150, -151, -150, -150, -151, -149, -149, -150, -151, -150, -150, -151, -151, -152, -152, -150, -150, -149, -150, -150, -150, -150, -150, -150, -149, -149, -150, -151, -152, -152, -151, -151, -151, -150, -151, -151, -151, -150, -151, -151, -151, -151, -152, -151, -150, -150, -150, -150, -149, -150, -151, -150, -150, -150, -150, -149, -150, -151, -150, -152, -151, -150, -150, -150, -149, -151, -151, -150, -151, -151, -150, -150, -150, -150, -150, -150, -150, -151, -150, -150, -150, -151, -151, -151, -151, -150, -150, -152, -152, -150, -150, -151, -151, -151, -151, -150, -150, -151, -151, -152, -152, -151, -151, -151, -151, -151, -151, -151, -151, -150, -149, -151, -150, -149, -149, -150, -151, -149, -150, -150, -150, -151, -150, -150, -150, -150, -150, -151, -151, -151, -150, -150, -150, -151, -151, -152, -151, -151, -150, -151, -153, -151, -151, -150, -150, -151, -150, -149, -151, -150, -149, -151, -152, -151, -150, -150, -151, -151, -151, -151, -153, -149, -152, -150, -151, -152, -151, -152, -150, -150, -150, -151, -151, -150, -151, -152, -151, -150, -150, -150, -150, -150, -150, -152, -151, -151, -149, -149, -151, -150, -150, -150, -150, -150, -151, -152, -151, -151, -151, -151, -151, -151, -150, -151, -151, -151, -151, -150, -151, -149, -149, -149, -150, -151, -152, -151, -150, -152, -151, -150, -151, -151, -152, -152, -151, -149, -151, -150, -152, -152, -152, -152, -150, -152, -152, -152, -150, -152, -152, -152, -151, -151, -150, -150, -151, -149, -151, -151, -150, -151, -151, -151, -150, -151, -150, -151, -150, -150, -151, -151, -152, -151, -151, -151, -151, -151, -150, -151, -151, -151, -152, -153, -151, -152, -152, -151, -151, -150, -150, -151, -152, -151, -152, -152, -152, -152, -152, -151, -151, -150, -150, -151, -152, -150, -152, -153, -152, -151, -151, -152, -152, -151, -151, -152, -152, -152, -151, -151, -151, -151, -151, -151, -150, -150, -150, -151, -151, -152, -152, -150, -151, -151, -149, -151, -152, -150, -151, -152, -152, -152, -150, -150, -152, -150, -151, -151, -150, -151, -151, -150, -151, -152, -150, -151, -151, -151, -152, -150, -150, -150, -151, -152, -152, -152, -152, -151, -151, -151, -152, -152, -152, -151, -151, -152, -152, -151, -151, -150, -151, -152, -151, -152, -152, -150, -151, -152, -152, -152, -152, -152, -153, -151, -151, -151, -152, -151, -151, -152, -151, -152, -151, -151, -151, -151, -151, -151, -152, -152, -151, -151, -152, -151, -151, -152, -151, -152, -151, -151, -151, -152, -152, -152, -152, -152, -150, -150, -151, -151, -151, -151, -152, -153, -152, -151, -150, -151, -151, -150, -150, -150, -151, -151, -149, -151, -151, -151, -151, -149, -151, -152, -151, -151, -151, -152, -152, -151, -152, -151, -152, -151, -151, -152, -152, -151, -151, -151, -153, -152, -150, -149, -150, -151, -151, -150, -151, -151, -152, -152, -152, -152, -152, -151, -151, -151, -151, -151, -152, -154, -153, -152, -149, -152, -151, -151, -151]
-86454a51%%%%%%%j%%%J%J%j%%%%%%Jj%%j%%%J%%%%%jJ%%j%%%%%%JJjj%%%jJJ%%%%%j%%%%
-86495a52%%%jJ%%J%%%%JkJj%%%J%j%%%%%%J%j%j%%J%%%J%%j%%Jj%%JjjJJ%Jj%j%kK%%J%%
-86536a51j%%j%J%%%%jKjKk%jJ%%%jK%j%jJJj%%%%%%%JjjJ%j%J%JjjJ%%J%%Jk%%%%%%%%%J
-86577a51%%%%jjLj%j%%%%jJK%kjJjJ%%j%%%J%jJ%jJ%jJJj%%jJj%%Kj%JjjJj%%%JJ%jj%J%
-86618a52kKJ%%jj%J%%kJJj%J%%%%jJJjjJ%%%%j%%jJJ%Jk%J%j%KkJ%%jKjJlKJjJj%jJJjJj
-86660a52%%%%j%%J%%%%%%%J%kKjjjKj%%%%%%KJlJ%jJ%%JjkJ%%%%%J%%j%%%jJJj%%JjJjJ%
-86701a52%%%%%%JjjJ%%%Jjk%J%%%%%KkjLjj%%J%jKjjj%JJ%%j%JJjjJ%%Jjj%J%%j%J%%%jj
-86742a54%%JJjjKj%%jKj%kJK%%%jjKj%Jj%%%%%%J%%%%j%Kk%Jj%kJJJ%%%j%%%%%%J%%%%Jj
$$ y = [-151, -151, -151, -151, -151, -151, -151, -151, -152, -152, -152, -152, -151, -151, -150, -150, -151, -151, -151, -151, -151, -151, -151, -150, -151, -151, -151, -152, -152, -152, -152, -151, -151, -151, -151, -151, -151, -152, -151, -151, -151, -152, -152, -152, -152, -152, -152, -152, -151, -150, -151, -152, -152, -152, -152, -153, -152, -151, -151, -151, -151, -151, -151, -152, -152, -152, -152, -152, -152, -152, -152, -153, -152, -152, -152, -151, -151, -151, -151, -151, -150, -152, -151, -152, -152, -152, -152, -151, -151, -152, -152, -152, -152, -152, -152, -152, -151, -151, -152, -152, -153, -153, -153, -152, -152, -152, -152, -151, -151, -151, -152, -152, -152, -151, -152, -152, -152, -151, -152, -153, -152, -151, -151, -150, -151, -151, -152, -152, -154, -152, -152, -152, -151, -151, -151, -152, -152, -152, -153, -153, -152, -152, -152, -152, -152, -153, -151, -152, -150, -152, -152, -153, -152, -152, -152, -152, -153, -151, -151, -152, -152, -153, -152, -151, -152, -152, -152, -152, -152, -152, -152, -152, -151, -152, -153, -152, -152, -153, -153, -152, -152, -151, -152, -153, -152, -152, -152, -151, -151, -151, -150, -152, -152, -152, -152, -152, -152, -152, -152, -152, -152, -151, -151, -151, -151, -151, -152, -153, -150, -151, -151, -152, -152, -152, -152, -152, -153, -152, -150, -150, -152, -153, -152, -153, -152, -152, -152, -153, -153, -153, -153, -152, -152, -153, -152, -152, -153, -152, -152, -153, -152, -151, -152, -152, -152, -153, -152, -153, -153, -153, -151, -152, -152, -151, -152, -153, -152, -153, -153, -153, -153, -152, -151, -151, -152, -153, -153, -152, -152, -154, -152, -151, -151, -151, -152, -153, -153, -152, -152, -152, -154, -153, -152, -153, -153, -152, -152, -152, -152, -152, -153, -152, -151, -152, -153, -152, -152, -152, -152, -152, -153, -153, -153, -154, -153, -152, -152, -151, -153, -153, -152, -152, -153, -153, -151, -153, -152, -152, -152, -153, -151, -152, -151, -154, -152, -151, -152, -151, -152, -152, -153, -152, -151, -152, -151, -152, -152, -152, -152, -152, -153, -153, -153, -152, -152, -152, -152, -152, -152, -152, -152, -151, -151, -153, -151, -152, -153, -154, -152, -153, -153, -153, -153, -153, -153, -153, -151, -150, -153, -152, -152, -153, -152, -152, -152, -151, -152, -154, -153, -153, -153, -153, -153, -153, -152, -152, -152, -153, -153, -153, -153, -154, -153, -152, -153, -153, -153, -152, -153, -152, -153, -152, -152, -152, -152, -152, -152, -152, -152, -151, -152, -153, -152, -152, -152, -152, -151, -152, -154, -154, -153, -153, -153, -153, -153, -153, -151, -153, -154, -151, -152, -153, -153, -153, -152, -152, -153, -151, -152, -153, -154, -154, -153, -152, -152, -152, -153, -153, -152, -151, -152, -153, -152, -152, -152, -151, -152, -153, -153, -152, -152, -152, -153, -153, -152, -152, -152, -152, -153, -154, -154, -154, -153, -152, -153, -154, -152, -153, -153, -153, -154, -152, -153, -153, -155, -154, -152, -152, -152, -152, -153, -154, -152, -153, -153, -152, -153, -153, -153, -153, -153, -153, -153, -152, -152, -152, -152, -152, -153, -153, -151, -153, -153, -152, -153, -153, -155, -154, -153, -152, -152, -152, -152, -153, -153, -153, -153, -153, -153, -153, -152, -152, -152, -152, -152, -151, -152]
-86783a52Jj%%%j%%%%%J%jjJ%J%%%%%%Jjj%%%JjjJJ%%%jK%kJ%%%%%%jj%jJJ%jJJj%K%k%kK
-86825a53Jj%JjJ%jjJ%jJj%KjKjj%jJJj%%%jJj%%JJjJj%%%j%%%kK%K%Jkj%K%%j%jJ%J%%%%
-86866a52jj%J%%%%%JkJjJ%%%%%%jJj%J%%%Jj%jKj%%j%J%JJlJj%JJk%JJ%Jl%JJ%%jjjJ%J%
-86907a53Jj%%KkJ%jJJlK%%jJj%jJ%%%J%%j%%%%J%%%j%%J%%j%J%%%jjJ%%%%%j%%%%J%%jKj
-86948a53Jjj%%%%%jJJj%j%J%J%jJjJ%%%jj%J%%J%%%%JjkJKk%Jj%%%J%%%Jj%%jjK%Jk%%jJ
-86989a54jKJjJ%j%%J%%%j%%%%%jJj%%%Kkj%J%J%%JjjjK%jKjjJjKj%%%%%%jJj%%%J%%%jjJ
-87031a54%%JjJjjJJ%jJ%JjjjJJKkJj%Jjj%%%K%j%%%JkKj%jJ%%jK%j%jJJj%%jJ%%%%JlJ%J
-87072a53JkjJ%J%%j%JjK%kJj%J%j%Kk%jJJj%JjjJ%%kK%%Jj%Jj%%j%K%%%%%%%jJj%JjJJj%
$$ y = [-152, -151, -152, -152, -152, -152, -153, -153, -153, -153, -153, -153, -152, -152, -153, -154, -153, -153, -152, -152, -152, -152, -152, -152, -152, -151, -152, -153, -153, -153, -153, -152, -153, -154, -153, -152, -152, -152, -152, -153, -151, -151, -153, -152, -152, -152, -152, -152, -152, -152, -153, -154, -154, -155, -154, -153, -153, -154, -153, -152, -153, -153, -151, -151, -153, -153, -155, -153, -152, -153, -153, -152, -153, -152, -152, -153, -154, -153, -153, -154, -153, -154, -154, -152, -153, -151, -152, -153, -153, -154, -153, -152, -153, -153, -153, -153, -154, -153, -154, -154, -154, -153, -152, -153, -152, -153, -153, -153, -153, -154, -154, -154, -154, -156, -154, -154, -152, -152, -151, -153, -154, -154, -152, -152, -152, -153, -153, -154, -153, -153, -152, -152, -152, -152, -152, -153, -154, -154, -153, -153, -153, -153, -153, -153, -152, -154, -153, -154, -153, -153, -153, -153, -153, -153, -153, -154, -153, -154, -154, -153, -153, -153, -153, -152, -153, -153, -154, -152, -153, -153, -153, -154, -154, -153, -153, -152, -151, -154, -153, -154, -154, -153, -152, -154, -154, -153, -152, -152, -151, -154, -154, -153, -152, -152, -152, -153, -154, -155, -154, -154, -153, -153, -152, -153, -153, -153, -151, -153, -152, -152, -153, -152, -151, -154, -152, -152, -152, -153, -152, -153, -153, -154, -153, -153, -153, -153, -152, -152, -152, -153, -153, -153, -153, -153, -152, -152, -152, -152, -153, -153, -153, -152, -152, -152, -153, -153, -152, -152, -152, -152, -153, -154, -153, -153, -153, -153, -153, -153, -154, -154, -154, -154, -154, -153, -153, -153, -154, -152, -153, -152, -153, -154, -154, -154, -154, -154, -154, -155, -154, -153, -154, -154, -155, -155, -154, -154, -153, -153, -154, -153, -154, -153, -153, -153, -153, -154, -155, -155, -154, -154, -154, -153, -153, -153, -153, -153, -152, -153, -155, -154, -152, -154, -154, -153, -154, -154, -154, -154, -153, -153, -153, -153, -152, -153, -153, -153, -154, -155, -153, -153, -152, -154, -154, -154, -155, -154, -155, -153, -152, -153, -152, -152, -153, -153, -153, -152, -152, -152, -152, -153, -153, -153, -153, -153, -153, -154, -153, -154, -154, -154, -154, -152, -154, -155, -155, -154, -154, -153, -153, -153, -152, -153, -154, -155, -153, -153, -154, -152, -153, -154, -153, -154, -152, -153, -153, -153, -153, -153, -153, -153, -154, -153, -154, -154, -154, -154, -153, -153, -153, -153, -154, -155, -154, -154, -154, -153, -154, -153, -154, -155, -154, -153, -153, -154, -153, -153, -152, -153, -154, -155, -154, -153, -151, -153, -152, -153, -153, -152, -153, -154, -154, -154, -154, -152, -152, -153, -153, -153, -153, -152, -154, -152, -153, -153, -154, -153, -153, -153, -154, -152, -152, -153, -153, -154, -153, -152, -153, -153, -153, -154, -153, -153, -153, -153, -153, -152, -155, -154, -154, -153, -152, -154, -155, -154, -154, -153, -153, -153, -154, -154, -153, -154, -152, -152, -154, -153, -154, -154, -153, -153, -154, -154, -152, -154, -154, -155, -154, -153, -154, -154, -153, -154, -155, -154, -154, -154, -156, -154, -154, -154, -153, -154, -154, -153, -154, -154, -154, -155, -155, -153, -153, -153, -153, -153, -153, -153, -153, -154, -153, -154, -154, -153, -154, -153, -152, -153, -153]
-87113a53j%%%%JJk%JJjJjjJ%kJJkKj%J%jjJ%J%j%%%J%%%%jJ%j%%JjJ%j%%J%Jj%j%Kj%j%K
-87154a52JjlKj%%J%%kJ%JJjj%%%%%%%%jJJjJKlJJ%j%%%%%%%jJJlJ%%JjJj%K%jj%%%%%Jj%
-87196a54JJj%jJjJj%%J%kK%%%jJ%kJ%%JjKkj%KjjK%%j%%J%j%JjJ%j%%J%Jjj%%jJ%J%kK%%
-87237a53%jJJj%j%%%%%JjJjjJ%%J%%jJ%jJJj%%jJjjK%jJjJ%%Jj%%%Jjj%%%J%%kK%%%jJ%%
-87278a53jJJjjJjjJ%Jj%Jj%J%j%KjjJ%%%%j%J%jJ%j%%%%%Kjj%JJjjJjJJJljKj%J%%%j%%%
-87319a54%%JkLlJ%JjjJ%%J%jJj%%%%JjjJKkJ%J%j%j%JJk%JjjJJJj%%%jKk%%%%JJjj%JkJj
-87360a55J%%%j%J%%%%J%%jKjj%%%%jL%kJ%jJj%%J%%JjjJ%J%j%j%%%%%jJ%%%j%J%%%%J%Jl
-87402a55JJJ%jKl%%J%%j%J%%%%%%%%%%%JlKj%J%%Kl%%J%%%jjJ%J%%%kKJ%%j%%jK%jJ%%jJ
$$ y = [-153, -154, -154, -154, -154, -154, -153, -152, -154, -154, -153, -152, -153, -152, -153, -154, -153, -153, -155, -154, -153, -155, -153, -154, -154, -153, -153, -154, -155, -154, -154, -153, -153, -154, -154, -154, -154, -153, -153, -153, -153, -153, -154, -153, -153, -154, -154, -154, -153, -154, -153, -153, -154, -154, -154, -153, -153, -152, -153, -153, -154, -154, -152, -153, -153, -154, -154, -152, -151, -152, -155, -153, -154, -154, -154, -153, -153, -153, -155, -154, -154, -153, -152, -153, -154, -154, -154, -154, -154, -154, -154, -154, -154, -155, -154, -153, -154, -153, -151, -154, -153, -152, -152, -153, -153, -153, -153, -153, -153, -153, -153, -154, -153, -152, -155, -154, -154, -154, -153, -154, -153, -154, -154, -152, -152, -153, -154, -154, -154, -154, -154, -154, -153, -154, -154, -153, -152, -153, -153, -154, -153, -154, -153, -154, -154, -154, -153, -153, -155, -153, -153, -153, -153, -154, -153, -153, -155, -154, -154, -154, -153, -154, -152, -154, -155, -155, -153, -154, -155, -153, -153, -153, -154, -154, -154, -153, -153, -154, -154, -153, -154, -153, -153, -154, -154, -154, -153, -153, -152, -153, -154, -154, -154, -155, -154, -154, -153, -153, -155, -153, -153, -153, -153, -154, -153, -152, -153, -153, -154, -154, -154, -154, -154, -154, -153, -154, -153, -154, -155, -154, -154, -154, -153, -153, -153, -154, -153, -153, -154, -153, -152, -153, -153, -153, -154, -153, -154, -155, -153, -153, -154, -153, -154, -153, -153, -153, -152, -153, -153, -153, -153, -152, -153, -154, -154, -154, -154, -153, -153, -153, -155, -153, -153, -153, -153, -154, -153, -153, -153, -154, -153, -152, -153, -154, -153, -154, -155, -154, -154, -153, -154, -154, -153, -154, -154, -153, -153, -154, -154, -152, -153, -154, -153, -153, -153, -153, -153, -154, -154, -153, -153, -154, -153, -153, -154, -154, -154, -154, -154, -154, -152, -153, -154, -154, -153, -152, -153, -154, -153, -154, -153, -152, -151, -154, -155, -153, -154, -154, -153, -153, -153, -153, -154, -154, -154, -154, -154, -154, -153, -155, -152, -155, -154, -154, -153, -154, -155, -154, -154, -154, -153, -153, -154, -153, -154, -154, -154, -154, -154, -153, -154, -155, -154, -152, -154, -153, -153, -152, -152, -153, -153, -154, -154, -153, -152, -154, -154, -153, -154, -155, -154, -153, -152, -153, -153, -153, -153, -154, -152, -154, -154, -154, -154, -154, -153, -152, -153, -154, -154, -153, -155, -154, -155, -154, -154, -154, -154, -155, -155, -154, -154, -154, -154, -154, -153, -153, -153, -154, -152, -153, -154, -154, -154, -154, -154, -155, -152, -152, -154, -153, -153, -154, -153, -154, -154, -154, -153, -153, -153, -152, -153, -154, -153, -153, -152, -152, -153, -153, -154, -154, -154, -154, -154, -154, -155, -154, -154, -154, -154, -155, -155, -154, -154, -154, -154, -154, -153, -153, -152, -155, -154, -153, -152, -152, -153, -151, -154, -154, -154, -153, -153, -153, -154, -154, -153, -153, -153, -153, -153, -153, -153, -153, -153, -153, -153, -153, -152, -155, -153, -154, -154, -153, -153, -153, -151, -154, -154, -154, -153, -153, -153, -153, -154, -155, -154, -154, -153, -153, -153, -153, -155, -153, -152, -152, -152, -153, -153, -153, -154, -152, -152, -153, -152, -152, -152, -153, -152]
-87443a52%%Jj%%%jJ%%%%%%%Jj%%Jj%kJKj%%Jj%%JJj%%%Jjj%JjjK%jJj%%Jj%k%JjJJj%Jjk
-87484a55JJj%J%%%jJj%%%%Kjk%Kj%jJKjkKkJjKjKj%j%J%Jj%%jJ%%JjjK%jJ%%%%KjjK%JjL
-87525a47%jkJ%JJ%%J%%%%jJ%%%%%jjJJkJJlJJ%%jJ%%%J%%j%%%%%%%%%jj%%jjJ%%%%jj%%%
-87567a52%j%%%%%J%%j%%%%%%%%%%%%JjjKkKk%%%J%%%JjjJJkJ%%J%%jJ%kjKj%Jj%%%%J%jJ
-87608a53lL%%j%JJj%%%%%kJJJj%j%%%%JJJjj%J%%jj%Kj%JkKj%%%kJ%JjJJj%jJ%JjJ%kK%%
-87649a52Jj%jj%KjJ%JjjJjJ%%%%%%%%%J%kJj%Kj%j%%Jjj%%%%%J%jJj%%jKj%%Jj%J%%JjjJ
-87690a53Jj%%jjK%jJ%jKj%%Jj%J%%%%jJj%Kj%%jJ%%%%%%%Jj%%j%J%Jj%j%JJjj%J%jJJj%J
-87731a51%%%%k%j%K%%kJJ%%%k%K%j%%%J%jJ%%j%JjjJJ%%JkKk%J%%JkK%%jKjjJ%jJ%jJKjj
$$ y = [-152, -152, -152, -151, -152, -152, -152, -152, -153, -152, -152, -152, -152, -152, -152, -152, -152, -151, -152, -152, -152, -151, -152, -152, -154, -153, -151, -152, -152, -152, -151, -152, -152, -152, -151, -150, -151, -151, -151, -151, -150, -151, -152, -152, -151, -152, -153, -151, -151, -152, -151, -152, -152, -152, -151, -152, -152, -154, -154, -153, -154, -153, -152, -153, -153, -152, -153, -155, -154, -153, -154, -154, -153, -153, -153, -153, -154, -153, -154, -154, -154, -154, -154, -152, -153, -155, -155, -153, -154, -154, -155, -154, -152, -153, -155, -153, -155, -154, -155, -153, -154, -152, -153, -153, -154, -154, -153, -153, -152, -153, -153, -153, -154, -153, -153, -153, -152, -153, -154, -152, -152, -153, -152, -152, -152, -152, -152, -150, -151, -152, -150, -150, -149, -150, -147, -147, -148, -150, -149, -149, -148, -147, -147, -147, -146, -146, -146, -146, -146, -147, -146, -146, -146, -146, -146, -146, -147, -148, -147, -146, -148, -147, -146, -149, -148, -147, -147, -147, -148, -147, -147, -147, -147, -146, -146, -146, -147, -147, -147, -147, -147, -147, -147, -147, -147, -147, -148, -149, -149, -149, -150, -151, -150, -150, -150, -150, -150, -151, -152, -152, -152, -152, -152, -153, -153, -153, -153, -153, -153, -152, -152, -152, -153, -153, -153, -153, -153, -153, -153, -153, -153, -153, -153, -153, -153, -152, -153, -154, -152, -154, -152, -154, -154, -154, -154, -153, -153, -153, -153, -152, -153, -154, -153, -152, -154, -153, -153, -153, -152, -152, -152, -153, -152, -152, -154, -155, -153, -154, -154, -153, -154, -154, -154, -154, -154, -153, -153, -154, -153, -156, -153, -153, -153, -154, -154, -153, -152, -153, -153, -153, -153, -153, -153, -155, -154, -153, -152, -153, -153, -154, -154, -154, -154, -154, -153, -152, -151, -152, -153, -153, -152, -152, -152, -153, -154, -154, -152, -153, -153, -152, -154, -152, -153, -153, -153, -153, -155, -154, -154, -153, -154, -153, -152, -153, -153, -154, -153, -153, -152, -153, -152, -152, -154, -152, -152, -152, -151, -152, -152, -153, -154, -154, -152, -153, -152, -152, -151, -152, -153, -152, -153, -152, -152, -152, -152, -152, -152, -152, -152, -152, -152, -151, -151, -153, -152, -153, -153, -151, -152, -152, -153, -153, -153, -152, -153, -154, -154, -154, -154, -154, -154, -153, -153, -154, -153, -154, -154, -154, -155, -153, -154, -154, -154, -153, -154, -154, -153, -153, -153, -152, -153, -154, -153, -152, -153, -153, -153, -154, -155, -153, -153, -154, -153, -153, -154, -152, -153, -153, -153, -152, -153, -153, -152, -152, -152, -152, -152, -153, -152, -153, -153, -151, -152, -152, -152, -153, -152, -152, -152, -152, -152, -152, -152, -152, -151, -152, -152, -152, -153, -153, -152, -152, -151, -152, -152, -153, -153, -152, -151, -152, -153, -153, -152, -152, -153, -152, -151, -152, -152, -151, -151, -151, -151, -151, -153, -153, -154, -154, -152, -152, -152, -154, -153, -152, -152, -152, -152, -154, -154, -152, -152, -153, -153, -153, -153, -152, -152, -153, -152, -152, -152, -153, -153, -152, -153, -154, -153, -152, -152, -152, -151, -153, -151, -153, -153, -152, -152, -152, -151, -153, -151, -151, -151, -152, -150, -151, -152, -151, -151, -152, -151, -151, -152, -151, -149, -150, -151]
-87773a51j%%J%%J%%%jJ%j%JJjJkJj%%Kj%%jJ%%%%%jjJ%%%%%J%%%jj%jJJ%%%jKjj%JJ%%%j
-87814a51%%j%%J%%%%Jj%J%j%%%%%%KkKj%%jjJJjJJkJjJ%%%J%j%%%j%%%KmL%jKj%%JjjJ%J
-87855a49kJj%%%%Jj%Jj%J%%jJ%%j%%%%%%%%%J%%%j%jJ%%Jjj%%JJ%%j%J%jkKKjj%%%%%%%%
-87896a51%Jj%%J%jj%JjJJjjJ%%%%J%Jj%j%%%J%%%Jk%JjJjj%JJJj%%jJ%%%%%jJj%J%j%jJJ
-87938a50kJ%JjJ%KkJj%Jj%jJ%Jjj%KJkJ%kJ%JjJ%Jj%Jk%K%k%JkKjjLk%kJJ%JjjJjJ%%J%J
-87979a48%%%kJ%%%%J%%k%%%J%%%jJjKjjK%kJj%%J%jJ%%j%%%JJj%Kj%jj%K%jJkK%Kjk%%Kj
-88020a48%Jj%jJJjjjKjkKJjK%jjJJj%%%JjjJ%%j%%KJj%%Jj%%JjjJjJ%%%j%%JJj%%%%%%%%
-88061a47Jj%jJJ%jKk%%JjJjJ%j%J%%jJjJ%%jJjK%j%%Jj%%jJ%%%%%%J%%%jJ%%%jJJlK%%%J
$$ y = [-151, -152, -152, -152, -151, -151, -151, -150, -150, -150, -150, -151, -150, -150, -151, -151, -150, -149, -150, -149, -151, -150, -151, -151, -151, -149, -150, -150, -150, -151, -150, -150, -150, -150, -150, -150, -151, -152, -151, -151, -151, -151, -151, -151, -150, -150, -150, -150, -151, -152, -152, -153, -152, -151, -151, -151, -151, -152, -150, -151, -152, -152, -151, -150, -150, -150, -150, -151, -151, -151, -152, -152, -152, -151, -151, -151, -151, -151, -150, -151, -151, -150, -150, -151, -151, -151, -151, -151, -151, -151, -149, -151, -149, -150, -150, -150, -151, -152, -151, -150, -151, -150, -149, -151, -150, -151, -150, -150, -150, -150, -149, -149, -150, -150, -150, -150, -151, -151, -151, -151, -149, -153, -150, -150, -151, -149, -150, -150, -150, -149, -150, -151, -150, -150, -149, -151, -150, -151, -151, -151, -151, -151, -150, -151, -151, -150, -151, -151, -150, -150, -150, -151, -150, -150, -150, -151, -151, -151, -151, -151, -151, -151, -151, -151, -151, -150, -150, -150, -150, -151, -151, -152, -151, -151, -151, -150, -151, -152, -152, -152, -151, -150, -150, -150, -151, -151, -150, -150, -151, -153, -151, -149, -150, -151, -151, -151, -151, -151, -151, -151, -151, -151, -151, -150, -151, -151, -151, -150, -150, -151, -152, -152, -151, -152, -151, -150, -151, -152, -151, -151, -151, -151, -151, -150, -150, -149, -150, -150, -151, -151, -151, -151, -150, -150, -150, -150, -149, -151, -151, -150, -151, -150, -151, -152, -152, -151, -150, -149, -150, -150, -150, -151, -150, -150, -150, -150, -150, -150, -151, -150, -151, -151, -150, -150, -151, -151, -152, -151, -150, -152, -151, -151, -150, -151, -150, -150, -148, -150, -149, -150, -150, -149, -150, -150, -151, -150, -150, -149, -150, -151, -151, -149, -148, -150, -149, -149, -151, -150, -150, -149, -150, -149, -149, -148, -149, -149, -148, -150, -150, -148, -148, -150, -150, -149, -151, -149, -150, -151, -148, -150, -150, -152, -151, -150, -150, -149, -150, -151, -150, -151, -150, -150, -150, -149, -149, -148, -148, -148, -148, -150, -149, -149, -149, -149, -149, -148, -148, -148, -150, -150, -150, -150, -149, -149, -149, -149, -150, -149, -150, -148, -149, -150, -148, -148, -150, -149, -150, -150, -150, -149, -149, -150, -149, -149, -149, -150, -150, -150, -150, -149, -148, -149, -149, -147, -148, -148, -149, -150, -150, -148, -148, -149, -148, -150, -148, -148, -146, -147, -149, -149, -149, -147, -148, -148, -147, -148, -148, -149, -148, -147, -148, -149, -150, -148, -149, -151, -149, -148, -149, -147, -147, -148, -149, -148, -147, -148, -148, -148, -148, -147, -148, -149, -148, -148, -148, -149, -149, -149, -147, -146, -147, -147, -147, -146, -147, -147, -147, -146, -147, -148, -147, -148, -147, -147, -147, -147, -148, -148, -148, -147, -146, -147, -147, -147, -147, -147, -147, -147, -147, -147, -146, -147, -147, -148, -147, -146, -146, -147, -145, -147, -147, -147, -146, -147, -146, -147, -146, -146, -147, -147, -146, -146, -146, -147, -146, -147, -146, -146, -146, -147, -146, -147, -145, -145, -146, -146, -146, -145, -146, -146, -146, -147, -146, -146, -146, -146, -146, -146, -146, -145, -145, -145, -145, -146, -145, -145, -145, -145, -146, -145, -144, -147, -145, -145, -145, -145, -144]
-88102a44jJk%KjJjjKj%jJJ%%%%%Jj%j%%J%%%%%Jjj%jJJj%JjKj%%%jJJj%J%%%%j%%jKJlJ%
-88144a44jLkJJkK%%k%J%J%%jjJ%%J%%j%Jj%%%%%JjJj%J%jJ%%J%%%j%%%%%%%jJjK%Jj%%jJ
-88185a41%JkJ%%j%jKk%%K%%J%%j%%%Kk%JjJj%J%%Jj%%Jj%jJJ%%J%jJj%JlK%Jj%%jJ%%j%L
-88226a37k%J%k%K%%J%kKkJJj%%jJjJJ%kK%%%%%jJj%Jj%%JkKKJk%jjjJK%%j%%%J%%%%%Jj%
-88267a36%J%%%%%j%%J%J%l%JJJ%%%%%jJ%J%j%%%JJj%%%%%kJ%%JJj%%J%JjjJ%JJlJ%%Jj%%
-88309a32%%%J%%%%JjKk%%%%Kk%J%J%%jJjKj%jJK%kkKJ%%J%%JjJ%jjJJj%JjJJk%JJjJ%jJj
-88350a26%J%JkJJ%Jj%%jKj%JjJJj%Jj%J%%%%jJ%KjkJJ%%%%%%%%%KjjJ%%J%%jJJ%jJj%%%K
-88391a17JkJ%J%%jJjJJjJj%JjJJ%%%%JkK%kJKkJ%%%J%J%%%jJ%jL%j%%JJjJ%j%J%%%%%%%%
$$ y = [-144, -145, -144, -146, -146, -144, -145, -144, -145, -146, -144, -145, -145, -146, -145, -144, -144, -144, -144, -144, -144, -143, -144, -144, -145, -145, -145, -144, -144, -144, -144, -144, -144, -143, -144, -145, -145, -146, -145, -144, -145, -145, -144, -145, -143, -144, -144, -144, -144, -145, -144, -143, -144, -144, -143, -143, -143, -143, -143, -144, -144, -144, -145, -143, -142, -145, -144, -144, -145, -142, -144, -143, -142, -144, -142, -142, -142, -144, -144, -143, -143, -142, -142, -142, -143, -144, -143, -143, -143, -142, -142, -142, -143, -143, -142, -143, -143, -143, -143, -143, -143, -142, -143, -142, -143, -143, -142, -142, -143, -142, -142, -142, -141, -141, -141, -141, -142, -142, -142, -142, -142, -142, -142, -142, -143, -142, -143, -141, -141, -140, -141, -141, -141, -142, -141, -141, -140, -142, -141, -141, -141, -142, -142, -143, -141, -143, -143, -143, -141, -141, -141, -140, -140, -140, -141, -141, -141, -141, -139, -141, -141, -140, -141, -140, -141, -141, -140, -140, -140, -139, -140, -140, -140, -139, -140, -140, -141, -140, -139, -139, -139, -138, -138, -139, -138, -139, -139, -138, -141, -139, -139, -138, -139, -139, -139, -140, -139, -139, -139, -140, -140, -137, -139, -139, -138, -138, -140, -140, -138, -138, -138, -137, -137, -139, -137, -139, -138, -137, -138, -138, -138, -139, -138, -139, -138, -137, -137, -139, -137, -137, -137, -137, -137, -137, -138, -137, -138, -138, -137, -138, -138, -138, -137, -139, -137, -135, -134, -136, -136, -137, -138, -139, -138, -136, -136, -136, -137, -137, -137, -137, -136, -136, -136, -136, -136, -136, -135, -136, -136, -136, -135, -135, -135, -135, -135, -135, -136, -136, -136, -135, -135, -134, -134, -137, -137, -136, -135, -134, -134, -134, -134, -134, -134, -135, -134, -134, -133, -133, -134, -134, -134, -134, -133, -132, -133, -133, -133, -133, -133, -133, -135, -134, -134, -134, -133, -132, -133, -133, -133, -132, -132, -131, -132, -133, -132, -132, -131, -130, -133, -132, -132, -132, -131, -132, -132, -132, -132, -132, -132, -131, -131, -131, -131, -131, -130, -131, -129, -131, -131, -131, -131, -131, -129, -131, -131, -130, -130, -129, -129, -129, -130, -129, -130, -128, -129, -129, -130, -129, -127, -127, -129, -131, -129, -128, -128, -128, -127, -127, -127, -126, -127, -126, -126, -127, -128, -127, -126, -127, -127, -126, -127, -126, -125, -127, -127, -126, -125, -126, -125, -125, -126, -125, -126, -126, -125, -125, -124, -126, -125, -124, -124, -123, -124, -124, -124, -125, -123, -124, -124, -123, -124, -123, -122, -123, -123, -122, -123, -123, -122, -122, -122, -122, -122, -123, -122, -122, -120, -121, -123, -122, -121, -121, -121, -121, -121, -121, -121, -121, -121, -121, -119, -120, -121, -120, -120, -120, -119, -119, -119, -120, -119, -118, -118, -119, -118, -119, -119, -119, -119, -117, -116, -118, -117, -117, -116, -116, -116, -117, -116, -117, -116, -115, -116, -115, -116, -116, -115, -116, -115, -114, -114, -114, -114, -114, -113, -115, -113, -113, -115, -114, -112, -114, -113, -113, -113, -113, -112, -112, -111, -111, -111, -111, -112, -111, -111, -112, -109, -109, -110, -110, -110, -109, -108, -109, -108, -108, -109, -109, -108, -108, -108, -108, -108, -108, -108, -108, -108]
-88432a08K%jJKk%JjJJj%J%jJJ%%j%KjK%jjJJ%jJ%%JJ%%jJJJ%jJjJ%J%%%KjJ%jJ%%JjJJJJ
-88473i0j%J%%%Kj%%%JJ%jKjJjJJ%%%%%%JJ%Jj%%JJJ%%%%J%J%JjKjKj%JKj%KjJkKKj%KkJJ
-88515f9%J%JkKJJjKJJjjKJJ%%%J%%JJjKJjK%jJJJ%JJ%%JjJKK%jJJ%%J%%K%%KJ%J%JjKJ%%
-88557c4JJLkK%%JJJJkJLJJJ%JJ%JJJJJ%%KJJ%%KKJ%JJJ%JKJJjKJJJJK%KJ%JL%%KJJJK%JJ
-88599B7L%JKKKJJJKK%L%JJKKJ%KJKKKKK%KJM%MJLJLLKKKLLLMKLKNMLMNNMNLLMLLjOJLKLL
-88641A83LMLLNKJLJKM%KKLOJMNMLLMKM%M%KLLLMLLLLMNJjLJK%KKJM%LMMLKK%MLMNKLMPMM
-88682C70NMMOMMPNMPMPMQMNOPOPONQPOJ0OQPPQOQJ1PRJ1J0QRRJ1J2J1QQRJ4J2J1J1J1J1J0
-88715G83J1J4J4J3J0J1J4J5J4J5J6J6J3J6J6J6J6J7J6J5J9K1J9J9J8J8K1K2K3K1K2K0K1K2
$$ y = [-108, -106, -106, -107, -106, -104, -106, -106, -105, -106, -105, -104, -105, -105, -104, -104, -105, -104, -103, -103, -103, -104, -104, -102, -103, -101, -101, -102, -103, -102, -101, -101, -102, -101, -101, -101, -100, -99, -99, -99, -100, -99, -98, -97, -97, -98, -97, -98, -97, -97, -96, -96, -96, -96, -94, -95, -94, -94, -95, -94, -94, -94, -93, -94, -93, -92, -91, -90, -91, -91, -90, -90, -90, -90, -88, -89, -89, -89, -89, -88, -87, -87, -88, -86, -87, -86, -87, -86, -85, -85, -85, -85, -85, -85, -85, -84, -83, -83, -82, -83, -83, -83, -82, -81, -80, -80, -80, -80, -80, -79, -79, -78, -78, -77, -78, -76, -77, -75, -76, -76, -75, -73, -74, -74, -72, -73, -72, -74, -72, -70, -71, -71, -69, -71, -70, -69, -69, -68, -68, -67, -69, -67, -66, -65, -66, -64, -63, -62, -63, -64, -62, -61, -60, -60, -60, -60, -59, -59, -59, -58, -57, -58, -56, -55, -56, -54, -54, -55, -54, -53, -52, -52, -51, -50, -50, -50, -49, -50, -49, -47, -45, -45, -46, -45, -44, -44, -44, -43, -43, -43, -41, -41, -41, -39, -38, -38, -37, -37, -36, -37, -35, -34, -34, -34, -33, -32, -29, -31, -29, -29, -29, -28, -27, -26, -25, -27, -26, -23, -22, -21, -20, -20, -19, -18, -18, -17, -16, -15, -14, -13, -13, -13, -11, -10, -9, -9, -9, -7, -5, -4, -4, -3, -2, -1, -1, 0, 2, 3, 4, 3, 5, 6, 7, 8, 9, 11, 11, 13, 14, 14, 15, 18, 18, 18, 20, 21, 22, 23, 25, 25, 26, 27, 30, 30, 31, 33, 35, 37, 38, 39, 40, 42, 44, 44, 47, 47, 48, 49, 51, 53, 54, 54, 56, 57, 59, 61, 63, 65, 67, 67, 69, 70, 74, 74, 78, 79, 82, 83, 86, 89, 91, 93, 95, 98, 101, 104, 108, 110, 113, 115, 120, 124, 127, 131, 136, 141, 145, 150, 153, 156, 160, 163, 166, 165, 171, 172, 175, 177, 180, 183, 186, 190, 193, 196, 201, 203, 204, 207, 208, 210, 214, 214, 216, 218, 221, 227, 228, 232, 237, 241, 244, 247, 251, 253, 257, 257, 261, 261, 263, 266, 269, 272, 276, 279, 282, 285, 288, 292, 297, 298, 297, 300, 301, 303, 303, 305, 307, 308, 312, 312, 315, 319, 323, 326, 328, 330, 330, 334, 337, 341, 346, 348, 351, 355, 362, 366, 370, 375, 379, 383, 389, 393, 397, 404, 409, 413, 420, 424, 431, 435, 443, 447, 452, 458, 465, 471, 478, 484, 489, 497, 504, 510, 520, 526, 534, 541, 548, 556, 562, 570, 581, 588, 597, 608, 618, 626, 635, 644, 655, 667, 678, 686, 694, 703, 717, 729, 740, 751, 762, 773, 783, 794, 808, 822, 835, 845, 856, 870, 885, 899, 914, 930, 946, 959, 975, 991, 1007, 1023, 1040, 1056, 1071, 1090, 1111, 1130, 1149, 1167, 1185, 1206, 1228, 1251, 1272, 1294, 1314, 1335, 1357]
-88736A357K5K7K5K3K5K3K8L0K6L0L0K7L1L0K8L0K9L4L4L4L4L3L7L8L6L9M1M2L9M3M4M5M4
-88757B441M7M6N0M9N1N3N7N5N8N9O1O1O2O2P0P3P4P7Q1Q4Q7R4J02J27J78K13Q7M1Q9J48K40
-88776E077L57K01J20L44N99Q16J275K11q58n59k88r5j1J02J33K20K68M57P59J405J071k08
-88789A1396l43k26j31J74K93K22J35J72K75M35N25N80M39L58N31Q67J018J587R18m58l27
-88802A8440K6K32L35M46N00N63O07P44J005J600J629K79j35J8M3L01M32K91K28L18L64M33
-88816B8699M55L51K54K79K77K68K52K49K33K20J94J87J63J51J25J16R4P5N4M3K4Mj9l3n7
-88831C2658p2r7j14j31j51j84k03k21k39k60k79l04l18l44l63l86m03m24m41m60m73m87n01
-88845B5803n09n21n28n33n38n37n47n44n46n40n40n33n27n20n11n02m92m78m69m54m45m32
$$ y = [1357, 1382, 1409, 1434, 1457, 1482, 1505, 1533, 1563, 1589, 1619, 1649, 1676, 1707, 1737, 1765, 1795, 1824, 1858, 1892, 1926, 1960, 1993, 2030, 2068, 2104, 2143, 2184, 2226, 2265, 2308, 2352, 2397, 2441, 2488, 2534, 2584, 2633, 2684, 2737, 2794, 2849, 2907, 2966, 3027, 3088, 3150, 3212, 3282, 3355, 3429, 3506, 3587, 3671, 3758, 3852, 3954, 4081, 4259, 4472, 4559, 4600, 4689, 4837, 5077, 5434, 5635, 5755, 6099, 6698, 7514, 8789, 9000, 8142, 7583, 7295, 7200, 7189, 7291, 7424, 7644, 7912, 8369, 9128, 10533, 11604, 11396, 11053, 10827, 10696, 10870, 11163, 11385, 11520, 11692, 11967, 12402, 12927, 13507, 13946, 14304, 14835, 15702, 16720, 18307, 19225, 18767, 18440, 18466, 18698, 19033, 19479, 19979, 20542, 21149, 21893, 22898, 24498, 26127, 26406, 26271, 26289, 26332, 26633, 27065, 27356, 27584, 27902, 28266, 28699, 29154, 29505, 29759, 30038, 30315, 30583, 30835, 31084, 31317, 31537, 31731, 31918, 32081, 32232, 32357, 32473, 32567, 32642, 32696, 32739, 32763, 32767, 32748, 32715, 32658, 32586, 32489, 32375, 32244, 32093, 31909, 31706, 31485, 31246, 30986, 30707, 30403, 30085, 29741, 29378, 28992, 28589, 28165, 27724, 27264, 26791, 26304, 25803, 25294, 24773, 24245, 23712, 23174, 22637, 22090, 21546, 21000, 20460, 19920, 19387, 18860, 18340, 17829, 17327, 16835, 16357, 15888, 15434, 14989, 14557]
-88859A4557m18m06l95l80l69l59l46l32l24l11l02k90k81k70k62k51k45k36k28k17k11k06
-88872G918j97j90j84j78j74j65j63j53j51j45j41j36j31j29j24j20j16j12j09j05j03r9r7
-88886D696r4r1q5q4q1p9q0p8p3p1o3o7o6o0n1m7l6n4p2p2o5o0n5n3m8m8m6m2l8l1k2k3m3
-88907B718n2n0m7l9l7l6m4l6l6l1k9k6l1l2k5k1j4nk5m7m4l8l1l1k7k4k5k1j9j8qJmk5l4
-88928A707l1l0k3k2k3k1k1j8j6j7j7j8j9j5j6j5j5j7j3j5j4j3j3j5j1j4j2j3j2j2j2j3j1
-88948A160j1j1j0j0j0j0j0j0rprnqqrqj0orrrpnoporlonompnoolnonolmllllkmmkkolmjK
-88984H14lm%%%jjj%kk%%%llk%jllklkkkkjklllkmjmklmllmjmlmlmmlllmmlkppnonnnonol
-89025F25nknnqqpnqnpoopmnmommmkonpnlpnlmmllk%lmkonlkmlnkkllklklkjllk%lklklk%
$$ y = [14557, 14139, 13733, 13338, 12958, 12589, 12230, 11884, 11552, 11228, 10917, 10615, 10325, 10044, 9774, 9512, 9261, 9016, 8780, 8552, 8335, 8124, 7918, 7721, 7531, 7347, 7169, 6995, 6830, 6667, 6514, 6363, 6218, 6077, 5941, 5810, 5681, 5557, 5437, 5321, 5209, 5100, 4995, 4892, 4793, 4696, 4602, 4511, 4426, 4342, 4261, 4182, 4102, 4024, 3951, 3880, 3817, 3750, 3684, 3624, 3573, 3526, 3490, 3436, 3364, 3292, 3227, 3167, 3112, 3059, 3011, 2963, 2917, 2875, 2837, 2806, 2784, 2761, 2718, 2666, 2616, 2569, 2530, 2493, 2457, 2413, 2377, 2341, 2310, 2281, 2255, 2224, 2192, 2167, 2146, 2132, 2127, 2102, 2055, 2011, 1973, 1942, 1911, 1884, 1860, 1835, 1814, 1795, 1777, 1769, 1770, 1766, 1741, 1707, 1676, 1646, 1623, 1601, 1578, 1557, 1536, 1518, 1502, 1485, 1468, 1450, 1431, 1416, 1400, 1385, 1370, 1353, 1340, 1325, 1311, 1298, 1285, 1270, 1259, 1245, 1233, 1220, 1208, 1196, 1184, 1171, 1160, 1149, 1138, 1128, 1118, 1108, 1098, 1088, 1078, 1069, 1062, 1053, 1048, 1040, 1032, 1023, 1015, 1005, 999, 990, 981, 972, 965, 960, 954, 947, 941, 932, 929, 923, 918, 912, 908, 901, 896, 890, 884, 881, 876, 870, 865, 859, 856, 852, 849, 846, 843, 840, 838, 834, 830, 828, 826, 820, 817, 813, 812, 814, 811, 807, 807, 807, 807, 806, 805, 804, 804, 802, 800, 800, 800, 800, 797, 794, 792, 792, 791, 788, 785, 783, 780, 778, 776, 774, 772, 771, 769, 766, 763, 760, 758, 754, 753, 749, 747, 744, 740, 737, 734, 730, 729, 725, 722, 718, 715, 711, 707, 704, 701, 698, 694, 690, 687, 685, 678, 671, 666, 660, 655, 650, 645, 639, 634, 628, 625, 620, 618, 613, 608, 600, 592, 585, 580, 572, 567, 560, 554, 548, 541, 537, 532, 528, 522, 518, 514, 510, 508, 502, 497, 490, 485, 482, 475, 470, 467, 463, 459, 456, 453, 451, 451, 448, 444, 442, 436, 431, 428, 426, 422, 419, 414, 412, 410, 407, 404, 402, 399, 397, 394, 392, 391, 388, 385, 383, 383, 380, 378, 375, 373, 370, 368, 368]
-89066C68lkjljkjljjljjjkjk%kjkkJkkkj%jj%kk%%j%j%jljJkk%k%kJjk%k%j%jlJk%kj%j%
-89107B92jj%jjJj%lJk%kj%%j%jjJkj%%%kjjkjjjJ%%lJJjk%kJk%j%%KlJ%j%%Jjk%%jj%J%%
-89148B56%%k%J%jJkJjjJ%%%%J%%%%JjjJ%jJ%JkK%jJ%JjKjJJj%JJJJJJ%%%JjJ%KJKKLLJK%
-89190B80%jnjkj%%KKJLJKJJk%kjjj%kJJJJJKKLJ%jmjkjjkJ%JJKMJkjk%jj%jjj%JjjJ%JJ%
-89231B77Jj%JJJJJJJJ%JJ%KKKJJKKJJKJJKJKJKKJKJLKJKJ%JKKKJJ%JKJJL%JJKJJ%KJ%KJJ
-89272C58JK%J%JJKJJJ%%%JK%J%JJjKJ%%JjKjJJJ%JJJjJJJJ%JLjJKJKK%JKjLKJKJKK%LKKJ
-89313D21LJKJKLJJLKM%LKLKLJKLKJMKKKLLKLLL%MMJLLKLNKLLLLLKMLKLMNJMMLMKMMKKOML
-89355F01MMMLMMLOLMMMNNKOLMMOMMONMMNMPOMNMNOOMOMPOLQNNNPOOPOOPOOOPOQNRNRPPOQ
$$ y = [368, 365, 363, 362, 359, 358, 356, 355, 352, 351, 350, 347, 346, 345, 344, 342, 341, 339, 339, 337, 336, 334, 332, 333, 331, 329, 327, 326, 326, 325, 324, 324, 322, 320, 320, 320, 319, 319, 318, 318, 317, 314, 313, 314, 312, 310, 310, 308, 308, 306, 307, 306, 304, 304, 302, 302, 301, 301, 300, 297, 298, 296, 296, 294, 293, 293, 292, 292, 291, 290, 290, 289, 288, 289, 288, 288, 285, 286, 284, 284, 282, 281, 281, 281, 280, 280, 279, 278, 279, 277, 276, 276, 276, 276, 274, 273, 272, 270, 269, 268, 267, 268, 268, 268, 265, 266, 267, 266, 264, 264, 262, 263, 261, 261, 260, 260, 260, 262, 259, 260, 260, 259, 259, 259, 260, 259, 257, 257, 257, 256, 255, 255, 256, 256, 256, 256, 256, 254, 254, 255, 255, 254, 255, 253, 254, 253, 252, 253, 253, 253, 253, 253, 254, 254, 254, 254, 254, 255, 254, 253, 254, 254, 253, 254, 254, 255, 253, 255, 255, 254, 255, 255, 256, 255, 257, 256, 257, 258, 257, 257, 258, 259, 260, 261, 262, 263, 263, 263, 263, 264, 263, 264, 264, 266, 267, 269, 271, 274, 277, 278, 280, 280, 280, 279, 274, 273, 271, 270, 270, 270, 272, 274, 275, 278, 279, 281, 282, 283, 281, 281, 279, 278, 277, 276, 276, 274, 275, 276, 277, 278, 279, 281, 283, 286, 287, 287, 286, 282, 281, 279, 278, 277, 275, 276, 276, 277, 278, 280, 284, 285, 283, 282, 280, 280, 279, 278, 278, 277, 276, 275, 275, 276, 275, 274, 275, 275, 276, 277, 277, 278, 277, 277, 278, 279, 280, 281, 282, 283, 284, 285, 285, 286, 287, 287, 289, 291, 293, 294, 295, 297, 299, 300, 301, 303, 304, 305, 307, 308, 310, 311, 313, 315, 316, 318, 319, 322, 324, 325, 327, 328, 328, 329, 331, 333, 335, 336, 337, 337, 338, 340, 341, 342, 345, 345, 346, 347, 349, 350, 351, 351, 353, 354, 354, 356, 357, 358, 359, 361, 361, 362, 362, 363, 364, 366, 367, 368, 369, 369, 369, 369, 370, 372, 372, 373, 373, 374, 375, 374, 376, 377, 377, 377, 378, 377, 379, 378, 379, 380, 381, 381, 382, 383, 384, 383, 384, 385, 386, 387, 387, 388, 391, 390, 391, 393, 394, 396, 398, 398, 399, 401, 400, 403, 405, 406, 408, 409, 411, 413, 413, 416, 418, 420, 421, 424, 425, 427, 428, 430, 433, 434, 435, 438, 440, 444, 444, 447, 449, 452, 454, 457, 458, 460, 463, 465, 466, 470, 472, 474, 476, 479, 482, 484, 487, 490, 493, 493, 497, 501, 502, 505, 508, 510, 513, 518, 520, 523, 526, 529, 532, 535, 537, 541, 544, 546, 549, 553, 558, 559, 563, 567, 570, 574, 576, 580, 584, 586, 588, 594, 598, 601, 605, 609, 613, 616, 620, 624, 627, 633, 636, 640, 644, 648, 653, 658, 660, 666, 669, 673, 677, 683, 687, 691, 697, 702, 706, 710, 715, 719, 726, 732, 736, 741, 745, 750, 756, 762, 766, 772, 776, 783, 789, 792, 800, 805, 810, 815, 822, 828, 834, 841, 847, 853, 860, 866, 872, 878, 885, 891, 899, 904, 913, 918, 927, 934, 941, 947, 955]
-89396I55PPQQQQQPQQRQQJ0RJ0PQJ0QRJ2RJ0QRJ2J0J0J0J1J0RJ2J1J0J1J1J2J1J2J2J1J3J2
-89423A386J2J1J2J2J3J3J5J2J3J4J4J5J3J3J5J5J5J5J4J4J5J6J5J5J5J6J6J6J7J7J7J7J6
-89444A864J6J8J7J9J6J7K0J8K0J7J8K0J8J8J8K1J9K0J9K0K0K1J9K2K0K0J9K1K1K2K2J9K2
-89464B501K2K1K1K1K0K2K2K1K2K1K2K2K1K1K1K1K1K2K1K0K1K0K1K0K0K0K1K0J9J9K0K2K1
-89484C190J7J5J9K1K1J8J3J2J7J8J5J6J6J0J0RJ0J2J3J6J1PNQJ0J1OJ0OMPLjLJJJKMlplk
-89511C572Kmmlrj1j1pqpoj1j4j2j1j1qj4j1j6j5j6j8j8j8j8j9j8j7k1j9k1j7k0j8k3j9k1
-89534C060k0k1k2k5k2k3k0k2k2k4j9k4k2k8k7k3j3j8j7k2j3j7loK5P4K08P7j35j05PJ17L68
-89555C223K94NL15O55R69J893O1j716j213p52m66l33j77j36l3k0Q1J94N92J390K034O2j191
$$ y = [955, 962, 969, 977, 985, 993, 1001, 1009, 1016, 1024, 1032, 1041, 1049, 1057, 1067, 1076, 1086, 1093, 1101, 1111, 1119, 1128, 1140, 1149, 1159, 1167, 1176, 1188, 1198, 1208, 1218, 1229, 1239, 1248, 1260, 1271, 1281, 1292, 1303, 1315, 1326, 1338, 1350, 1361, 1374, 1386, 1398, 1409, 1421, 1433, 1446, 1459, 1474, 1486, 1499, 1513, 1527, 1542, 1555, 1568, 1583, 1598, 1613, 1628, 1642, 1656, 1671, 1687, 1702, 1717, 1732, 1748, 1764, 1780, 1797, 1814, 1831, 1848, 1864, 1880, 1898, 1915, 1934, 1950, 1967, 1987, 2005, 2025, 2042, 2060, 2080, 2098, 2116, 2134, 2155, 2174, 2194, 2213, 2233, 2253, 2274, 2293, 2315, 2335, 2355, 2374, 2395, 2416, 2438, 2460, 2479, 2501, 2523, 2544, 2565, 2586, 2606, 2628, 2650, 2671, 2693, 2714, 2736, 2758, 2779, 2800, 2821, 2842, 2863, 2885, 2906, 2926, 2947, 2967, 2988, 3008, 3028, 3048, 3069, 3089, 3108, 3127, 3147, 3169, 3190, 3207, 3222, 3241, 3262, 3283, 3301, 3314, 3326, 3343, 3361, 3376, 3392, 3408, 3418, 3428, 3437, 3447, 3459, 3472, 3488, 3499, 3506, 3511, 3519, 3529, 3540, 3546, 3556, 3562, 3566, 3573, 3576, 3575, 3578, 3579, 3580, 3581, 3583, 3587, 3584, 3577, 3574, 3572, 3574, 3570, 3566, 3563, 3554, 3543, 3532, 3525, 3517, 3510, 3504, 3493, 3479, 3467, 3456, 3445, 3437, 3423, 3412, 3396, 3381, 3365, 3347, 3329, 3311, 3293, 3274, 3256, 3239, 3218, 3199, 3178, 3161, 3141, 3123, 3100, 3081, 3060, 3040, 3019, 2997, 2972, 2950, 2927, 2907, 2885, 2863, 2839, 2820, 2796, 2774, 2746, 2719, 2696, 2683, 2665, 2648, 2626, 2613, 2596, 2593, 2587, 2612, 2686, 2894, 2971, 2836, 2731, 2738, 2855, 3223, 3517, 3522, 3837, 4492, 5461, 7354, 7415, 5699, 4486, 3734, 3268, 2935, 2758, 2622, 2589, 2569, 2650, 2844, 3436, 4826, 6860, 6922, 5731]
-89569E731p40p62l54o9j87l67l53j89M8K50K98O3j20L27O11J073J845l62j782j163p12m45
-89582B641k97j67j20l5nP7K27O61J566J937l00j190p43p74l27j87m44m08k08j04L8O6j45
-89596A759k02j25r1o7n5m9l9l2l4k2j1qj6k2k6k2j9j9j8j2j1qqj1j3nJnj3j5j2j1j0pj3j4
-89619G15j0j0qpj0qpqqpqopoooopronnnnopnmonmnnmnmnnnnknnmmmnmmllmmllnklnllmlk
-89658C78mllllkkmmklklkknkkkkkkklljlkjjllkjllj%lkjk%lkljjkl%jkj%jljkjjjk%kjk
-89699B43jj%kk%jk%l%%%%m%%%jjJkjjJkJ%k%%jjJ%j%%%jJj%%j%KJ%Kk%KKNLjLM%jjlJKM%
-89740B39jjjKJMNJKMlJKNLj%KLMLMM%OLKLJ%KMPMKKJLNQPJMNLMOOOJJMNNLJPLNNNPOQQNO
-89782D62PPOQQPQJ0RRJ0RJ0J2J3J2J3J0J0J5J3J3J6J5J7J7J8K0J7K1K2K4K3K3K6K6K8L0L1
$$ y = [5731, 4991, 4229, 3875, 3806, 3619, 3252, 2899, 2710, 2758, 3008, 3306, 3369, 3249, 3576, 4187, 5260, 7105, 6743, 4961, 3798, 3086, 2641, 2344, 2177, 2057, 2022, 2017, 2094, 2321, 2982, 4548, 6485, 6185, 4995, 4252, 3478, 3151, 2964, 2520, 2112, 1904, 1800, 1838, 1904, 1759, 1557, 1432, 1341, 1274, 1219, 1170, 1131, 1099, 1065, 1043, 1032, 1024, 1008, 986, 960, 938, 919, 900, 882, 870, 859, 851, 843, 832, 819, 814, 815, 810, 797, 782, 770, 759, 749, 742, 729, 715, 705, 695, 687, 680, 670, 662, 655, 647, 639, 632, 624, 618, 611, 605, 599, 593, 587, 580, 571, 565, 560, 555, 550, 545, 539, 532, 527, 523, 517, 512, 508, 503, 498, 494, 489, 485, 480, 475, 470, 465, 463, 458, 453, 449, 445, 441, 436, 432, 428, 425, 422, 418, 414, 411, 408, 403, 401, 398, 393, 390, 387, 383, 380, 378, 374, 371, 368, 365, 362, 360, 358, 354, 350, 348, 345, 343, 340, 338, 336, 331, 329, 327, 325, 323, 321, 319, 317, 314, 311, 310, 307, 305, 304, 303, 300, 297, 295, 294, 291, 288, 287, 287, 284, 282, 281, 279, 279, 276, 274, 271, 270, 269, 267, 264, 264, 263, 261, 260, 260, 259, 256, 255, 253, 252, 251, 250, 248, 248, 246, 245, 243, 242, 241, 241, 239, 237, 237, 236, 234, 234, 231, 231, 231, 231, 231, 227, 227, 227, 227, 226, 225, 226, 224, 223, 222, 223, 221, 222, 222, 220, 220, 220, 219, 218, 219, 219, 218, 218, 218, 218, 217, 218, 217, 217, 217, 216, 216, 218, 219, 219, 221, 219, 219, 221, 223, 228, 231, 230, 233, 237, 237, 236, 235, 232, 233, 235, 239, 239, 238, 237, 236, 238, 239, 243, 248, 249, 251, 255, 252, 253, 255, 260, 263, 262, 262, 264, 267, 271, 274, 278, 282, 282, 288, 291, 293, 296, 297, 297, 299, 303, 310, 314, 316, 318, 319, 322, 327, 335, 342, 343, 347, 352, 355, 359, 365, 371, 377, 378, 379, 383, 388, 393, 396, 397, 404, 407, 412, 417, 422, 429, 435, 443, 451, 456, 462, 469, 476, 482, 490, 498, 505, 513, 523, 532, 541, 551, 560, 570, 582, 595, 607, 620, 630, 640, 655, 668, 681, 697, 712, 729, 746, 764, 784, 801, 822, 844, 868, 891, 914, 940, 966, 994, 1024, 1055]
-89806A055L2L6L5M1M2M3M5N0N4N5N8O4O9P1P8Q3Q9R6J02J10J16J25J33J40J54J62J70J82
-89823C490J90J99K07K17K20K26K30K29K26K20K12K00J83J69J51J33J17J04R1Q3Q1P8P9Q2
-89838G417Q7Q8Q8Q9Q5P8O9N9M8L6K8J9J3RMOKL%koj5k5l6m8o0p3q3r0r7r9r8r6r3q9q8q9
-89860G041r1r8j06j20j35j51j67j84j98k08k19k25k28k31k27k24k21k13k06j97j89j80j70
-89874B853j61j52j42j34j27j19j09j05r5r2q7p9p4p0o6o1n8n4n1m9m7m3l8m0l7l4l4l1l1
-89892F33k8k8k5k5k4k3k3j9k1k0j8j8j7j5j4j3j4j4j2j3j1j1j1j1j0rj0prqrpoqoqmpono
-89918H0nnolnnmmmmmmmllmlllllllkllll%ml%kll%ljkkkjkjljjkk%kk%jkljjjjjjjjlj%%
-89959h2kj%%kjjlJj%jjJk%j%jk%jj%J%mKk%%jj%j%%jJj%j%%j%%jJjjJJj%%JjJJjK%%%K%J
$$ y = [1055, 1087, 1123, 1158, 1199, 1241, 1284, 1329, 1379, 1433, 1488, 1546, 1610, 1679, 1750, 1828, 1911, 2000, 2096, 2198, 2308, 2424, 2549, 2682, 2822, 2976, 3138, 3308, 3490, 3680, 3879, 4086, 4303, 4523, 4749, 4979, 5208, 5434, 5654, 5866, 6066, 6249, 6418, 6569, 6702, 6819, 6923, 7014, 7097, 7178, 7256, 7335, 7417, 7504, 7592, 7680, 7769, 7854, 7932, 8001, 8060, 8108, 8144, 8172, 8191, 8204, 8213, 8217, 8223, 8225, 8228, 8228, 8226, 8220, 8205, 8180, 8144, 8096, 8036, 7963, 7880, 7790, 7693, 7594, 7496, 7400, 7307, 7218, 7130, 7041, 6950, 6852, 6746, 6626, 6491, 6340, 6173, 5989, 5791, 5583, 5364, 5139, 4911, 4680, 4453, 4229, 4008, 3795, 3589, 3392, 3203, 3023, 2853, 2692, 2540, 2398, 2264, 2137, 2018, 1909, 1804, 1709, 1617, 1530, 1451, 1377, 1307, 1241, 1180, 1122, 1068, 1017, 968, 921, 878, 840, 800, 763, 729, 695, 664, 633, 605, 577, 552, 527, 503, 480, 457, 438, 417, 397, 379, 361, 344, 329, 315, 302, 288, 274, 262, 249, 238, 227, 216, 205, 195, 186, 176, 169, 160, 152, 143, 136, 130, 122, 116, 108, 104, 97, 91, 86, 80, 75, 70, 64, 61, 56, 51, 47, 43, 39, 35, 31, 27, 23, 20, 17, 13, 10, 7, 4, 1, -2, -5, -8, -10, -13, -16, -19, -22, -22, -26, -29, -29, -31, -34, -37, -37, -40, -41, -43, -45, -47, -48, -50, -51, -54, -55, -56, -58, -60, -60, -62, -64, -64, -65, -67, -70, -71, -72, -73, -74, -75, -76, -77, -78, -81, -82, -82, -82, -84, -85, -85, -85, -87, -88, -89, -92, -91, -92, -92, -93, -94, -93, -95, -95, -96, -96, -97, -99, -99, -100, -101, -101, -100, -100, -104, -102, -104, -104, -104, -105, -106, -106, -107, -107, -107, -108, -107, -108, -108, -109, -109, -109, -110, -110, -110, -111, -110, -111, -112, -111, -110, -111, -111, -111, -110, -111, -110, -109, -110, -108, -108, -108, -108, -106, -106, -105]
-90001a05JjK%KJlKKJ%KjJjKJJjj%J%jJJJj%JjJ%jJ%jJjJj%%%%k%jjj%%kJkjjJj%k%jj%jj
-90042a09l%jjjlk%jkJmj%jjjjjkJk%%kj%jJjj%kj%KjjJjk%%%jJjjJjJjjjJ%j%KkJkJJljJ
-90084a51%%kL%j%%jj%JkKJj%%%j%J%jjJJk%%kJKmLjJjjJJjj%J%jJj%%%%jJ%J%j%J%%Kkj%
-90125a56jjJ%%JJk%J%%%%%%%jj%Jj%%JJkKJjj%%%j%kK%j%JjJ%%jJ%Jk%jJjjJJKkkJ%j%Jj
-90166a61%K%%%k%%J%jj%jJJk%KkLk%KkJkK%kKjjJJ%j%JkKj%Jj%JjjJ%kJKjj%jK%j%jjJK%
-90207a62%%j%Jj%J%%%j%jKk%J%%%%%%%%%%%%%%%j%%%Jj%kJJ%%jJ%%%%%%%JkJ%%jJ%%%J%%
-90249a63j%jJJjjJ%jJ%%%%%j%JjjKjJ%jjJJj%%j%K%%%jJ%kJ%%j%%%J%%%%jJ%%jKkJKlJ%%
-90290a65%%jkK%%J%%%JkJjJJkJ%%%k%JJ%%jJj%K%jj%%%%%Jj%%J%%j%Kjj%%j%%j%J%J%j%J
$$ y = [-105, -104, -105, -103, -103, -101, -100, -103, -101, -99, -98, -98, -96, -97, -96, -97, -95, -94, -93, -94, -95, -95, -94, -94, -95, -94, -93, -92, -93, -93, -92, -93, -92, -92, -93, -92, -92, -93, -92, -93, -92, -93, -93, -93, -93, -93, -95, -95, -96, -97, -98, -98, -98, -100, -99, -101, -102, -103, -102, -103, -103, -105, -105, -106, -107, -107, -108, -109, -112, -112, -113, -114, -115, -118, -120, -120, -121, -123, -122, -126, -127, -127, -128, -129, -130, -131, -132, -134, -133, -135, -135, -135, -137, -138, -138, -139, -138, -139, -140, -140, -142, -143, -143, -141, -142, -143, -142, -143, -145, -145, -145, -145, -146, -145, -146, -147, -146, -147, -146, -147, -148, -149, -148, -148, -149, -149, -147, -149, -148, -150, -149, -148, -151, -152, -151, -151, -151, -153, -150, -150, -151, -151, -151, -152, -153, -153, -152, -154, -152, -151, -152, -152, -152, -152, -153, -153, -152, -152, -153, -154, -153, -152, -154, -154, -154, -156, -155, -153, -157, -154, -155, -154, -155, -156, -155, -154, -155, -156, -156, -155, -155, -156, -155, -156, -156, -156, -156, -156, -157, -156, -156, -155, -155, -156, -156, -155, -155, -155, -153, -155, -156, -156, -157, -158, -157, -157, -157, -156, -155, -157, -157, -156, -156, -156, -156, -156, -156, -156, -156, -157, -158, -158, -157, -158, -158, -158, -157, -156, -158, -156, -155, -156, -157, -157, -157, -157, -158, -158, -160, -158, -158, -159, -159, -158, -159, -158, -158, -158, -159, -158, -158, -157, -159, -159, -160, -159, -160, -161, -160, -159, -157, -159, -161, -160, -160, -161, -161, -160, -161, -161, -159, -159, -159, -159, -161, -161, -161, -160, -160, -161, -162, -162, -163, -162, -161, -163, -163, -161, -163, -160, -162, -162, -160, -162, -161, -163, -161, -161, -163, -161, -162, -163, -162, -161, -161, -162, -162, -161, -163, -161, -162, -162, -161, -162, -162, -161, -162, -163, -162, -162, -164, -163, -161, -162, -163, -163, -164, -162, -162, -163, -163, -164, -165, -164, -162, -162, -162, -162, -163, -163, -162, -163, -163, -162, -162, -162, -162, -163, -163, -164, -162, -164, -164, -163, -163, -163, -163, -163, -163, -163, -163, -163, -163, -163, -163, -163, -163, -163, -163, -164, -164, -164, -164, -163, -164, -164, -166, -165, -164, -164, -164, -165, -164, -164, -164, -164, -164, -164, -164, -164, -163, -165, -164, -164, -164, -165, -164, -164, -164, -164, -163, -163, -163, -164, -164, -165, -164, -163, -164, -165, -164, -164, -165, -164, -164, -164, -164, -164, -164, -165, -165, -164, -165, -166, -164, -165, -164, -164, -165, -166, -165, -164, -165, -165, -165, -166, -166, -164, -164, -164, -164, -165, -164, -164, -166, -165, -165, -165, -166, -166, -166, -166, -165, -165, -165, -165, -165, -166, -165, -165, -165, -166, -164, -166, -165, -163, -166, -165, -165, -165, -165, -165, -166, -168, -166, -166, -166, -165, -165, -165, -165, -164, -166, -165, -166, -165, -164, -166, -165, -165, -165, -165, -167, -167, -166, -165, -165, -165, -166, -165, -166, -166, -164, -164, -165, -166, -166, -166, -166, -166, -166, -165, -166, -166, -166, -165, -165, -165, -166, -166, -164, -165, -166, -166, -166, -167, -167, -167, -168, -168, -167, -167, -166, -166, -167, -167, -166]
-90331a66JkJj%%Jj%%JjJkJJjjKJj%j%%KjJj%jJkJ%JJjjJJjjJJjjJjJ%jJ%jJjkJ%JKj%%Jk
-90372a67%%Jj%J%kJJ%jJ%jJJ%kJjKkJj%%%j%JjJJ%%%%jJkJJ%kJ%JJkj%Kj%%jJJk%K%j%%j
-90413a68Jj%J%jjJ%%J%%jKkJjJ%jJ%jJ%%%JjJjj%%jJJJj%jJ%jJJj%%%JjjJ%jJ%%%kJJkJj
-90455a69KJk%J%Jjj%jK%%%%jKj%jjKj%J%j%%%%J%%jJJkJjKjj%Jj%JjJ%%JjJkKj%j%jJJj%
-90496a68JjJ%%%%J%j%jJJj%jJ%%%j%Jj%JJjjjJ%%%Jj%jK%j%%J%Jj%jJ%%%jJjKjk%JJJlJ%
-90537a68%J%j%J%jJj%JjJJlJ%%K%j%jjJ%J%jJ%J%j%jjJ%Lk%%%JjjJj%J%j%%%jJ%KkjJ%%J
-90578a67%j%kKJjJk%%%JjJJjjLjJjjJj%Jj%jJ%JjJjJj%J%%j%%%kJK%j%%%%%%jJ%%%%jKjJ
-90620a67%JkJ%j%JjJ%%jJjJj%%%J%jjJ%%J%jJ%j%JjJ%jj%J%%J%j%Kl%JJk%LjjJj%JjJ%%%
$$ y = [-166, -165, -167, -166, -167, -167, -167, -166, -167, -167, -167, -166, -167, -166, -168, -167, -166, -167, -168, -166, -165, -166, -166, -167, -167, -167, -165, -166, -165, -166, -166, -167, -166, -168, -167, -167, -166, -165, -166, -167, -166, -165, -166, -167, -166, -165, -166, -167, -166, -167, -166, -166, -167, -166, -166, -167, -166, -167, -169, -168, -168, -167, -165, -166, -166, -166, -165, -167, -167, -167, -166, -167, -167, -166, -166, -168, -167, -166, -166, -167, -166, -166, -167, -166, -165, -165, -167, -166, -167, -165, -167, -166, -167, -167, -167, -167, -168, -168, -167, -168, -167, -166, -166, -166, -166, -166, -167, -166, -168, -167, -166, -166, -168, -167, -167, -166, -165, -167, -168, -168, -166, -167, -167, -167, -168, -167, -166, -168, -168, -166, -166, -167, -167, -167, -168, -167, -168, -168, -167, -167, -168, -169, -168, -168, -168, -167, -167, -167, -168, -166, -168, -167, -168, -167, -167, -168, -167, -167, -168, -167, -167, -167, -167, -166, -167, -166, -167, -168, -168, -168, -169, -168, -167, -166, -167, -167, -168, -167, -167, -168, -167, -166, -167, -167, -167, -167, -166, -167, -168, -167, -167, -168, -167, -167, -167, -167, -169, -168, -167, -169, -168, -169, -167, -166, -168, -168, -167, -167, -166, -167, -168, -168, -169, -167, -167, -167, -167, -167, -168, -166, -167, -167, -168, -169, -167, -168, -168, -167, -167, -168, -168, -168, -168, -168, -167, -167, -167, -168, -167, -166, -168, -167, -168, -166, -167, -168, -168, -167, -168, -168, -167, -168, -167, -167, -167, -166, -167, -166, -168, -166, -167, -167, -168, -168, -169, -168, -167, -168, -168, -167, -168, -167, -167, -167, -167, -167, -166, -166, -167, -167, -168, -167, -166, -167, -167, -168, -167, -167, -167, -167, -168, -168, -167, -168, -168, -167, -166, -167, -168, -169, -168, -168, -168, -168, -167, -168, -168, -169, -167, -167, -168, -168, -168, -167, -167, -166, -167, -167, -168, -167, -167, -167, -167, -168, -167, -168, -166, -167, -169, -169, -168, -167, -166, -169, -168, -168, -168, -167, -167, -168, -168, -167, -167, -168, -167, -168, -168, -167, -168, -167, -166, -169, -168, -168, -168, -166, -166, -167, -167, -168, -169, -168, -168, -167, -167, -168, -167, -167, -166, -166, -167, -167, -168, -169, -168, -168, -165, -167, -167, -167, -167, -166, -167, -168, -167, -168, -168, -167, -167, -168, -168, -168, -168, -169, -168, -168, -166, -168, -169, -168, -168, -168, -167, -167, -168, -168, -170, -168, -167, -168, -167, -169, -169, -169, -169, -168, -169, -168, -167, -168, -169, -166, -167, -166, -167, -168, -167, -168, -168, -167, -168, -168, -169, -168, -168, -167, -168, -167, -168, -167, -168, -168, -167, -167, -167, -168, -168, -168, -168, -170, -169, -167, -167, -168, -168, -168, -168, -168, -168, -168, -169, -168, -168, -168, -168, -168, -169, -167, -168, -167, -167, -166, -168, -167, -167, -168, -168, -167, -168, -167, -167, -167, -168, -167, -168, -167, -168, -168, -168, -168, -167, -167, -168, -169, -168, -168, -168, -167, -167, -168, -167, -167, -168, -168, -167, -168, -167, -167, -168, -169, -169, -168, -168, -168, -167, -167, -168, -168, -166, -169, -169, -168, -167, -169, -169, -166, -167, -168, -167, -168, -168, -167, -168, -167, -167, -167, -167]
-90661a67j%%Jj%%Kk%Jk%J%%JjjJ%%%%%J%kJ%j%%Jj%jKjjKjKjjJj%%jJ%%%J%j%JjJKk%Jj%
-90702a68%J%%kJ%%%J%Jk%kJJJj%%%%%jJjKJkjJKkJ%jJJjjJ%%jJj%JjJjJ%%kJ%%%%jJkJKk
-90743a69J%JJkjJJj%%%%%%%%%%J%kKj%%%kJ%KjJ%%jj%J%%%%j%Kj%%%%%j%J%%%%%%JkJjJ%
-90784a68J%jkKJ%%%%jj%J%jJ%%%jK%jj%%Jj%%J%%%%%Jjj%JJkJ%%Jjk%%KJj%Jk%jKJj%%%J
-90826a67%j%%%%%%%%%%Jj%%%JjjK%%%%jjJKk%J%j%%%%J%%%jjJJ%kJ%%%JjJ%%lLk%%JJkJ%
-90867a68%%%%j%J%Jj%%%%kL%%j%%%%%jJ%%%%Jj%%jJjJ%%%%Jj%JjjJ%jJ%%%%Jjj%%J%%%j%
-90908a69%J%%lMjjKj%%%%%%%j%J%kK%%j%JjJ%J%%jj%%%J%%%%jJjJ%JkJJk%%J%%jJJk%%%J
-90949a68j%JjJ%%%%%jJ%j%J%%jJ%%%%JjjK%kK%%k%jK%%jJ%Jj%%%j%Kk%%j%JJj%J%%%%Jjj
$$ y = [-167, -168, -168, -168, -167, -168, -168, -168, -166, -168, -168, -167, -169, -169, -168, -168, -168, -167, -168, -169, -168, -168, -168, -168, -168, -168, -167, -167, -169, -168, -168, -169, -169, -169, -168, -169, -169, -170, -168, -169, -170, -168, -169, -167, -168, -169, -168, -169, -169, -169, -170, -169, -169, -169, -169, -168, -168, -169, -169, -168, -169, -168, -166, -168, -168, -167, -168, -168, -168, -167, -167, -167, -169, -168, -168, -168, -168, -167, -167, -166, -168, -168, -170, -169, -168, -167, -168, -168, -168, -168, -168, -168, -169, -168, -169, -167, -166, -168, -169, -168, -166, -168, -167, -167, -168, -167, -166, -167, -168, -167, -167, -167, -168, -167, -168, -168, -167, -168, -167, -168, -167, -167, -167, -169, -168, -168, -168, -168, -168, -169, -168, -170, -169, -167, -169, -168, -168, -167, -166, -168, -169, -168, -167, -168, -168, -168, -168, -168, -168, -168, -168, -168, -168, -168, -167, -167, -169, -167, -168, -168, -168, -168, -170, -169, -169, -167, -168, -167, -167, -167, -168, -169, -169, -168, -168, -168, -168, -168, -169, -169, -167, -168, -168, -168, -168, -168, -168, -169, -169, -168, -168, -168, -168, -168, -168, -168, -167, -169, -168, -169, -168, -168, -167, -167, -168, -170, -168, -167, -167, -167, -167, -167, -168, -169, -169, -168, -168, -169, -168, -168, -168, -168, -169, -167, -167, -168, -169, -169, -169, -168, -169, -169, -169, -168, -168, -168, -168, -168, -168, -167, -168, -169, -169, -168, -167, -169, -168, -168, -168, -167, -168, -170, -170, -170, -168, -167, -168, -168, -167, -169, -169, -170, -168, -167, -168, -168, -168, -168, -167, -167, -168, -168, -168, -168, -168, -168, -168, -168, -168, -168, -168, -167, -168, -168, -168, -168, -167, -168, -169, -167, -167, -167, -167, -167, -168, -169, -168, -166, -168, -168, -167, -167, -168, -168, -168, -168, -168, -167, -167, -167, -167, -168, -169, -168, -167, -167, -169, -168, -168, -168, -168, -167, -168, -167, -167, -167, -170, -167, -169, -169, -169, -168, -167, -169, -168, -168, -168, -168, -168, -168, -169, -169, -168, -168, -167, -168, -168, -168, -168, -168, -170, -167, -167, -167, -168, -168, -168, -168, -168, -168, -169, -168, -168, -168, -168, -168, -167, -168, -168, -168, -169, -168, -169, -168, -168, -168, -168, -168, -167, -168, -168, -167, -168, -169, -168, -168, -169, -168, -168, -168, -168, -168, -167, -168, -169, -169, -169, -168, -168, -168, -168, -169, -169, -169, -168, -168, -168, -171, -167, -168, -169, -167, -168, -168, -168, -168, -168, -168, -168, -168, -169, -169, -168, -168, -170, -168, -168, -168, -169, -169, -168, -169, -168, -168, -167, -167, -167, -168, -169, -169, -169, -169, -168, -168, -168, -168, -168, -169, -168, -169, -168, -168, -167, -169, -168, -167, -169, -169, -169, -168, -168, -168, -169, -168, -167, -169, -169, -169, -169, -168, -169, -169, -168, -169, -168, -168, -168, -168, -168, -168, -169, -168, -168, -169, -169, -168, -168, -168, -169, -168, -168, -168, -168, -168, -167, -168, -169, -167, -167, -169, -167, -167, -167, -169, -169, -170, -168, -168, -168, -169, -168, -168, -167, -168, -168, -168, -168, -169, -169, -167, -169, -169, -169, -170, -170, -169, -168, -169, -169, -168, -168, -168, -168, -168, -167, -168, -169]
-90991a69JJkJ%j%J%%%%j%JJj%%jJJ%%jjJ%%%%%%j%%JJjjjJJj%%KjjjJJ%Jk%JJj%%j%JJkK
-91032a67j%%%j%JjJ%jJ%j%%JJj%jKl%%JJ%%J%j%%JkjK%%%%%%%%jJjJjjJ%JjJ%jJ%%%kJ%%
-91073a69Kjj%JJj%%%%jjJJjjKJj%%jJjjJJJj%%kJ%%%%%%J%%Kk%JjJlJ%%JkKjJ%JkjJK%j%
-91114a68%%Jjj%J%jJjJjJjjKkK%jjJjJ%J%%%%%%%jjJ%Kj%JjjjK%%j%%J%%kKKlJj%%%%j%K
-91155a68%j%J%%%%J%kJ%jJ%%%j%%%jJ%%Jj%%%jJJkKj%JjJjJj%%Jj%J%%k%%K%j%%%Kj%%jJ
-91197a68k%Kj%%%%J%%j%%%jJ%J%%JkJjJj%%%%%jKjjKjjJJjJ%%%j%%%jJ%j%JkLkK%%Jj%%%
-91238a68%lJJJj%Kk%JkK%kKJjj%%JkJJ%j%%%%J%jJ%%JkjL%kj%jK%%Jkj%J%%JJj%%Jj%%%J
-91279a68jj%%Kj%J%%j%j%jL%%k%%%jKJjjJjJJkjJ%%J%%j%K%j%%j%Kj%%%j%JJjjJj%Jj%%J
$$ y = [-169, -168, -167, -169, -168, -168, -169, -169, -168, -168, -168, -168, -168, -169, -169, -168, -167, -168, -168, -168, -169, -168, -167, -167, -167, -168, -169, -168, -168, -168, -168, -168, -168, -168, -169, -169, -169, -168, -167, -168, -169, -170, -169, -168, -169, -169, -169, -167, -168, -169, -170, -169, -168, -168, -167, -169, -169, -168, -167, -168, -168, -168, -169, -169, -168, -167, -169, -167, -168, -168, -168, -168, -169, -169, -168, -169, -168, -168, -169, -168, -168, -169, -169, -169, -168, -167, -168, -168, -169, -167, -170, -170, -170, -169, -168, -168, -168, -167, -167, -168, -168, -168, -167, -169, -170, -168, -168, -168, -168, -168, -168, -168, -168, -168, -169, -168, -169, -168, -169, -170, -169, -169, -168, -169, -168, -168, -169, -168, -168, -168, -168, -170, -169, -169, -169, -167, -168, -169, -169, -168, -167, -168, -168, -168, -168, -168, -169, -170, -169, -168, -169, -170, -168, -167, -168, -168, -168, -169, -168, -169, -170, -169, -168, -167, -168, -168, -168, -170, -169, -169, -169, -169, -169, -169, -169, -168, -168, -168, -166, -168, -168, -167, -168, -167, -170, -169, -169, -169, -168, -170, -168, -169, -168, -168, -167, -169, -170, -169, -167, -167, -168, -168, -168, -168, -167, -168, -169, -169, -168, -168, -169, -168, -169, -168, -169, -168, -169, -170, -168, -170, -168, -168, -169, -170, -169, -170, -169, -169, -168, -168, -168, -168, -168, -168, -168, -168, -169, -170, -169, -169, -167, -168, -168, -167, -168, -169, -170, -168, -168, -168, -169, -169, -169, -168, -168, -168, -170, -168, -166, -169, -168, -169, -169, -169, -169, -169, -170, -170, -168, -168, -169, -169, -168, -168, -168, -168, -168, -167, -167, -169, -168, -168, -169, -168, -168, -168, -168, -169, -169, -169, -169, -170, -169, -169, -169, -168, -169, -169, -169, -169, -170, -169, -168, -170, -168, -169, -169, -168, -169, -168, -169, -168, -169, -169, -169, -168, -169, -169, -168, -168, -168, -170, -170, -170, -168, -168, -169, -169, -169, -169, -167, -168, -168, -168, -169, -168, -170, -170, -168, -169, -169, -169, -169, -169, -168, -168, -168, -169, -169, -169, -169, -170, -169, -169, -168, -168, -168, -167, -169, -168, -169, -168, -169, -169, -169, -169, -169, -169, -170, -168, -169, -170, -168, -169, -170, -169, -168, -169, -168, -168, -168, -168, -169, -169, -169, -169, -170, -169, -169, -170, -170, -169, -171, -168, -170, -168, -168, -168, -167, -168, -168, -168, -168, -168, -171, -170, -169, -168, -169, -169, -167, -169, -169, -168, -170, -168, -168, -170, -168, -167, -168, -169, -169, -169, -168, -170, -169, -168, -168, -169, -169, -169, -169, -169, -168, -168, -169, -168, -168, -168, -167, -169, -170, -167, -167, -169, -170, -170, -171, -169, -169, -169, -168, -170, -171, -171, -170, -170, -170, -169, -168, -169, -169, -169, -168, -169, -169, -169, -169, -168, -169, -170, -170, -170, -168, -169, -169, -168, -168, -168, -169, -169, -170, -170, -171, -168, -168, -168, -170, -170, -170, -170, -171, -169, -168, -169, -170, -169, -170, -169, -168, -170, -171, -170, -170, -170, -169, -169, -169, -170, -170, -168, -168, -169, -169, -169, -170, -170, -168, -169, -169, -169, -169, -170, -170, -169, -168, -169, -170, -169, -170, -170, -169, -170, -170, -170, -169]
-91320a69jJJkjK%%JjjJ%jK%%%%j%%kJ%%%%%%%%J%%j%Kk%%K%Jk%j%%KkJkJ%%%jkKJ%%%JkK
-91362a69%%%j%%JjJ%%jJ%kK%jKjjJkJ%JJk%%%%JJkJJjkJ%%Jj%J%%j%jJjKJlJJ%%%%%%%%j
-91403a70JkJ%Jj%%JjJ%j%%%%%jJ%%%J%jjJ%%jLk%J%%j%%%%jJK%jkKJk%%%%J%kJ%%%Jj%J%
-91444a69%j%%%%%JkKjJj%jJ%%JJkKkJj%jJ%%JjJ%k%J%%%%%J%jjLjjKj%jJJkkK%JjjJ%%Jk
-91485a71J%%%%JJjj%%%%%%jKjkJJ%%%%%%%%%%%%%Jj%%j%%JJkJ%%%%%%%%%%%jJ%%%%%%%%j
-91526a71%%%%%J%Jj%%%%JjjKj%JJkkKj%JkKJj%%%%%JkJ%%%%%%%%%%%kK%%%%JkJKjkJJk%K
-91568a69jkKjjJJ%%%Jj%j%J%JjjKjjKkJ%%jjK%jKj%jJ%jKk%%J%jJ%J%jjJJj%j%%%%%JJkJ
-91609a70%%%%j%Jk%KjjjKJj%%%JkJ%J%Jk%%%J%jjKjJjjJ%j%%J%Jjj%J%jKJjJ%jjJ%%%j%%
$$ y = [-169, -170, -169, -168, -170, -171, -169, -169, -169, -168, -169, -170, -169, -169, -170, -168, -168, -168, -168, -168, -169, -169, -169, -171, -170, -170, -170, -170, -170, -170, -170, -170, -170, -169, -169, -169, -170, -170, -168, -170, -170, -170, -168, -168, -167, -169, -169, -170, -170, -170, -168, -170, -169, -171, -170, -170, -170, -170, -171, -173, -171, -170, -170, -170, -170, -169, -171, -169, -169, -169, -169, -170, -170, -170, -169, -170, -169, -169, -169, -170, -169, -169, -171, -169, -169, -170, -168, -169, -170, -169, -171, -170, -170, -169, -168, -170, -170, -170, -170, -170, -169, -168, -170, -169, -168, -169, -171, -170, -170, -170, -169, -170, -170, -169, -169, -169, -170, -170, -171, -170, -171, -169, -168, -171, -170, -169, -169, -169, -169, -169, -169, -169, -169, -169, -170, -169, -171, -170, -170, -169, -170, -170, -170, -169, -170, -169, -169, -170, -170, -170, -170, -170, -170, -171, -170, -170, -170, -170, -169, -169, -170, -171, -170, -170, -170, -171, -168, -170, -170, -169, -169, -169, -170, -170, -170, -170, -170, -171, -170, -168, -168, -169, -171, -169, -168, -170, -170, -170, -170, -170, -169, -169, -171, -170, -170, -170, -170, -169, -170, -170, -169, -169, -169, -170, -170, -170, -170, -170, -170, -169, -171, -169, -170, -169, -170, -170, -171, -170, -170, -170, -169, -168, -170, -168, -170, -169, -170, -170, -171, -170, -170, -170, -169, -170, -169, -169, -171, -171, -170, -170, -170, -170, -170, -170, -169, -169, -170, -171, -168, -169, -170, -168, -169, -169, -170, -169, -168, -170, -172, -170, -170, -169, -170, -171, -170, -170, -170, -169, -171, -170, -170, -170, -170, -170, -169, -168, -169, -170, -170, -170, -170, -170, -170, -170, -171, -169, -170, -172, -171, -170, -170, -170, -170, -170, -170, -170, -170, -170, -170, -170, -170, -170, -170, -169, -170, -170, -170, -171, -171, -171, -170, -169, -171, -170, -170, -170, -170, -170, -170, -170, -170, -170, -170, -170, -170, -171, -170, -170, -170, -170, -170, -170, -170, -170, -170, -171, -171, -171, -171, -171, -171, -170, -170, -169, -170, -170, -170, -170, -170, -169, -170, -171, -169, -170, -170, -169, -168, -170, -172, -170, -171, -171, -170, -172, -170, -169, -170, -170, -170, -170, -170, -170, -169, -171, -170, -170, -170, -170, -170, -170, -170, -170, -170, -170, -170, -170, -172, -170, -170, -170, -170, -170, -169, -171, -170, -168, -169, -171, -170, -169, -171, -171, -169, -170, -172, -170, -171, -172, -171, -170, -170, -170, -170, -169, -170, -170, -171, -171, -170, -170, -169, -170, -171, -169, -170, -171, -169, -171, -170, -170, -170, -171, -172, -170, -170, -171, -169, -170, -170, -171, -170, -170, -171, -169, -171, -171, -171, -170, -170, -171, -170, -170, -169, -169, -170, -171, -170, -169, -170, -170, -171, -171, -171, -171, -171, -171, -170, -169, -171, -170, -170, -170, -170, -170, -171, -171, -170, -172, -172, -170, -171, -172, -173, -171, -170, -171, -171, -171, -171, -170, -172, -171, -171, -170, -170, -169, -171, -171, -171, -171, -170, -170, -171, -172, -170, -171, -170, -171, -172, -171, -171, -172, -172, -172, -171, -171, -170, -171, -172, -172, -171, -171, -172, -170, -169, -170, -169, -169, -170, -171, -170, -170, -170, -170, -171, -171, -171]
-91650a71jKJk%j%JJjJjJ%%j%JJ%k%%KkJ%Jjj%%K%k%JjJ%%k%JJJj%jjJ%%%J%j%%JJjj%J%%
-91691a70jjJ%Jjj%J%%jJ%%Jj%J%%JlJJjJj%%jJJ%j%%Jj%%JjjJ%%%jJJkJ%JJkJj%J%J%kJ%
-91733a70jJ%%%%%J%J%JJkKKJL%Jjjj%%J%L%J%j%j%JKJlJjkJjKJ%%JjLj%jj%Jkj%%%%JKJk
-91774a57%j%JjKkj%j%JkK%%Jkjjkk%%j%k%%%JjkJJkJjJ%%%jJjJ%%%%jJ%%%j%%JkKj%Kjj%
-91815a71%J%j%JjjKj%%%%%JjjJKjjJjkJ%%KkJj%%%JjJ%JJk%kK%%%jJ%JkJ%%J%%jjJJ%%kK
-91856a70j%jJ%%jJJjjJ%Jj%%%%%%%jJJj%kK%%%j%%J%J%%jj%Jj%%%%Jj%JJjJj%%%%%jJJj%
-91897a71jJ%%JjjJk%K%%%j%%JJj%%JjjJ%%%%%%%%Jj%JjjJjJJk%%Kj%%jKjjJJjjJJj%%%%%
-91939a71J%j%%j%%Kj%jKkJJjjJ%J%jkKKjj%%%%J%jj%%J%jKjjJ%%%%j%%%%%JJjJk%%%%%%%
$$ y = [-171, -172, -170, -169, -171, -171, -172, -172, -171, -170, -171, -170, -171, -170, -170, -170, -171, -171, -170, -169, -169, -171, -171, -171, -169, -171, -170, -170, -169, -170, -171, -171, -171, -169, -169, -171, -171, -170, -171, -170, -170, -170, -172, -172, -171, -170, -169, -170, -170, -171, -172, -171, -171, -171, -171, -170, -170, -171, -171, -171, -170, -169, -170, -171, -171, -170, -170, -170, -171, -172, -171, -171, -170, -171, -172, -172, -171, -171, -171, -172, -171, -171, -171, -170, -171, -171, -170, -170, -170, -169, -172, -171, -170, -171, -170, -171, -171, -171, -172, -171, -170, -170, -171, -171, -171, -170, -171, -171, -171, -170, -171, -172, -171, -171, -171, -171, -172, -171, -170, -172, -171, -171, -170, -169, -171, -170, -171, -171, -170, -170, -169, -169, -171, -170, -170, -171, -170, -170, -170, -170, -170, -170, -169, -169, -168, -168, -167, -166, -168, -166, -164, -163, -160, -160, -159, -160, -161, -162, -162, -162, -161, -161, -158, -158, -157, -157, -158, -158, -159, -159, -158, -156, -155, -158, -157, -158, -160, -159, -160, -158, -157, -157, -157, -156, -157, -154, -155, -155, -156, -157, -157, -156, -158, -159, -159, -159, -159, -159, -158, -156, -155, -157, -157, -158, -158, -157, -158, -156, -158, -159, -159, -160, -160, -159, -161, -159, -159, -159, -158, -160, -161, -162, -164, -166, -166, -166, -167, -167, -169, -169, -169, -169, -168, -169, -171, -170, -169, -171, -170, -171, -170, -170, -170, -170, -171, -170, -171, -170, -170, -170, -170, -170, -171, -170, -170, -170, -170, -171, -171, -171, -170, -172, -170, -171, -171, -169, -170, -171, -171, -171, -170, -170, -171, -171, -170, -171, -172, -170, -171, -171, -171, -171, -171, -171, -170, -171, -172, -171, -169, -170, -171, -170, -171, -173, -172, -172, -172, -170, -172, -171, -172, -172, -172, -172, -171, -172, -171, -171, -170, -169, -171, -171, -173, -171, -171, -171, -171, -172, -171, -171, -170, -172, -171, -171, -171, -170, -170, -170, -171, -172, -171, -170, -170, -170, -172, -170, -171, -171, -172, -171, -171, -171, -172, -171, -170, -171, -172, -171, -171, -170, -171, -171, -171, -171, -171, -171, -171, -171, -172, -171, -170, -171, -171, -173, -171, -171, -171, -171, -172, -172, -172, -171, -171, -170, -170, -170, -171, -172, -172, -171, -172, -172, -172, -172, -172, -171, -172, -172, -171, -170, -171, -170, -171, -171, -171, -171, -171, -171, -172, -171, -170, -171, -171, -172, -171, -171, -171, -170, -171, -172, -171, -173, -173, -171, -171, -171, -171, -172, -172, -172, -171, -170, -171, -171, -171, -170, -171, -172, -171, -171, -171, -171, -171, -171, -171, -171, -171, -170, -171, -171, -170, -171, -172, -171, -172, -171, -170, -172, -172, -172, -170, -171, -171, -171, -172, -170, -171, -172, -171, -170, -171, -172, -171, -170, -171, -171, -171, -171, -171, -171, -170, -170, -171, -171, -171, -172, -172, -172, -170, -171, -171, -172, -170, -172, -171, -170, -171, -172, -171, -171, -170, -170, -171, -173, -171, -169, -170, -171, -171, -171, -171, -171, -170, -170, -171, -172, -172, -172, -171, -171, -172, -170, -171, -172, -171, -171, -171, -171, -171, -172, -172, -172, -172, -172, -172, -171, -170, -171, -170, -172, -172, -172, -172, -172, -172, -172, -172]
-91980a72J%%%jJ%%%%%jjJJ%%j%J%jjjK%%%J%%j%%JjjJJ%%jK%jjKjKjj%J%%%j%%%jJ%%%JJ
-92021a69jk%JJlJJj%%Jj%Kjj%J%%jJ%%%k%J%j%JJjJ%%J%jjJj%Jj%J%%Jj%%jJJjjjJ%K%jj
-92062a72J%j%kLjKlKjJ%%jJ%%%%kJJ%%J%%k%Jj%%JJ%%%j%%%Jj%jJj%%%JJj%%%%jJj%%%%j
-92104a73J%%%jJJj%%JJj%j%%J%jjK%kJ%%J%J%jj%%%Jj%%%%J%j%%%%%%%%Jj%J%%%%%%j%%%
-92145a72%%%%%%JjJ%%kJJ%%%j%%%J%%jJ%Jk%%%J%%KlJjjJJ%j%%jJJjJjJ%%jJ%%%Jk%J%j%
-92186a72%J%jJj%%J%%%j%JJjjJ%jJ%J%jj%J%%j%jJ%J%Jj%jJj%%%JJj%%%j%%%%J%j%J%JkK
-92227a70jjJjjJ%%J%jJk%%%KjJ%%jJ%%%%%%%%kJKj%j%J%Jj%j%%%%%Kjk%JJj%%JJj%JkjJJ
-92268a71J%jkJ%%j%%JJjjJJJ%j%jjJ%JjKjjJj%%%jJJkJJ%%%%j%j%JJ%jJ%%%j%J%%jJ%%jj
$$ y = [-172, -171, -171, -171, -171, -172, -171, -171, -171, -171, -171, -171, -172, -173, -172, -171, -171, -171, -172, -172, -171, -171, -172, -173, -174, -172, -172, -172, -172, -171, -171, -171, -172, -172, -172, -171, -172, -173, -172, -171, -171, -171, -172, -170, -170, -171, -172, -170, -171, -169, -170, -171, -171, -170, -170, -170, -170, -171, -171, -171, -171, -172, -171, -171, -171, -171, -170, -169, -170, -172, -172, -171, -170, -173, -172, -171, -172, -172, -172, -171, -172, -172, -170, -171, -172, -172, -171, -171, -171, -172, -171, -171, -171, -171, -173, -173, -172, -172, -173, -173, -172, -171, -172, -171, -171, -171, -170, -170, -171, -172, -171, -172, -172, -171, -172, -172, -171, -171, -171, -170, -171, -171, -171, -172, -171, -170, -171, -172, -173, -172, -172, -170, -170, -171, -172, -171, -171, -172, -172, -174, -171, -172, -170, -173, -171, -172, -171, -171, -171, -172, -171, -171, -171, -171, -171, -173, -172, -171, -171, -171, -170, -170, -170, -172, -172, -171, -172, -172, -172, -171, -170, -170, -170, -170, -171, -171, -171, -171, -170, -171, -171, -172, -171, -172, -172, -172, -172, -171, -170, -171, -171, -171, -171, -171, -172, -171, -172, -172, -172, -172, -172, -173, -172, -172, -172, -172, -173, -172, -171, -172, -172, -172, -171, -170, -171, -171, -172, -172, -172, -171, -171, -172, -173, -171, -171, -173, -172, -172, -172, -171, -171, -170, -170, -171, -172, -172, -172, -172, -171, -172, -172, -172, -172, -172, -171, -171, -172, -172, -172, -172, -172, -172, -172, -172, -172, -171, -172, -172, -171, -171, -171, -171, -171, -171, -171, -172, -172, -172, -172, -172, -172, -172, -172, -172, -172, -171, -172, -171, -171, -171, -173, -172, -171, -171, -171, -171, -172, -172, -172, -172, -171, -171, -171, -172, -171, -171, -170, -172, -172, -172, -172, -171, -171, -171, -169, -172, -171, -172, -173, -172, -171, -171, -172, -172, -172, -173, -172, -171, -172, -171, -172, -171, -171, -171, -172, -171, -171, -171, -171, -170, -172, -172, -171, -171, -172, -172, -172, -171, -171, -172, -171, -172, -172, -172, -171, -171, -171, -171, -172, -172, -171, -170, -171, -172, -171, -171, -172, -171, -171, -170, -170, -171, -172, -172, -171, -171, -171, -172, -172, -173, -172, -172, -171, -171, -170, -171, -171, -172, -171, -172, -172, -172, -172, -171, -170, -171, -171, -171, -171, -172, -172, -172, -172, -172, -171, -171, -172, -172, -171, -171, -170, -172, -170, -171, -172, -171, -172, -173, -172, -172, -172, -171, -171, -172, -171, -173, -173, -173, -173, -171, -172, -171, -171, -171, -172, -171, -171, -171, -171, -171, -171, -171, -171, -171, -173, -172, -170, -171, -171, -172, -172, -171, -171, -170, -171, -171, -172, -172, -172, -172, -172, -172, -170, -171, -173, -173, -172, -171, -172, -172, -172, -171, -170, -171, -171, -170, -172, -173, -172, -171, -170, -170, -171, -173, -172, -172, -172, -173, -173, -173, -172, -171, -172, -173, -172, -171, -170, -170, -171, -171, -172, -173, -172, -172, -171, -172, -170, -171, -172, -171, -172, -172, -172, -172, -173, -172, -171, -173, -172, -171, -171, -171, -171, -171, -172, -172, -173, -173, -172, -171, -171, -172, -171, -171, -171, -171, -172, -172, -171, -171, -171, -172, -171, -171, -171, -172, -173]
-92310a73JJ%jJ%j%%J%%%Jk%k%K%%%JjjJJ%Jj%Jk%%%jJJ%%jjJJ%%jj%J%%%%%JjjKjjJJkJJ
-92351a71jJ%j%JjJJjjjK%%%%%jKjj%%%%JjK%k%jKjJJkJj%KkJ%j%%Kj%%%jJjJj%JJjJ%jJj
-92392a71JjkJJjKjkJ%Jj%j%JJj%%%JjKjkK%j%%jJ%JjKkJ%%j%%J%%%k%%%KjJj%%%%j%JJjJ
-92433a71%%%%%jjJ%Jj%j%JKj%jJj%J%jJ%j%%jJ%%JJk%JjJjJ%jJJk%%%KjjJJj%JjJj%j%%%
-92475a72Jj%JkJ%JkJJjJjjJjjK%%j%JKj%j%%jJ%%Jj%Kk%jKkJJ%j%%%%%%JjJjJJkJ%j%%K%
-92516a70j%%%j%%%%%%J%Jj%%jJ%j%%J%%%j%%Kj%%j%JkJJ%jjK%jkKjK%%j%%Jj%%%%J%%%%j
-92557a72%%J%%%%j%KkJ%%jJ%j%%%%%J%jjJ%J%kJJJjj%%%%jLjj%%%%JJmK%J%%%%jjKj%J%j
-92598a72J%Jk%%%JKlJ%%%%%j%JJj%j%%J%%jJ%%%jjJJJkj%J%J%%%J%%jjJ%%%%jJ%jjJ%JkJ
$$ y = [-173, -172, -171, -171, -172, -171, -171, -172, -172, -172, -171, -171, -171, -171, -170, -172, -172, -174, -174, -172, -172, -172, -172, -171, -172, -173, -172, -171, -171, -170, -171, -171, -170, -172, -172, -172, -172, -173, -172, -171, -171, -171, -172, -173, -172, -171, -171, -171, -172, -173, -173, -172, -172, -172, -172, -172, -172, -171, -172, -173, -171, -172, -173, -172, -171, -173, -172, -171, -172, -171, -171, -172, -172, -171, -172, -171, -170, -171, -172, -173, -171, -171, -171, -171, -171, -171, -172, -170, -171, -172, -172, -172, -172, -172, -171, -172, -170, -170, -172, -172, -173, -171, -172, -171, -170, -172, -171, -172, -172, -170, -172, -171, -171, -172, -172, -172, -170, -171, -171, -171, -171, -172, -171, -172, -171, -172, -172, -171, -170, -171, -170, -170, -171, -170, -171, -170, -171, -173, -172, -171, -172, -170, -171, -173, -172, -172, -171, -172, -172, -173, -173, -172, -171, -172, -172, -172, -172, -171, -172, -170, -171, -173, -171, -171, -172, -172, -172, -173, -172, -172, -171, -172, -170, -172, -171, -171, -171, -172, -172, -172, -171, -171, -171, -171, -173, -173, -173, -173, -171, -172, -171, -172, -172, -172, -172, -172, -173, -173, -172, -171, -172, -171, -171, -171, -171, -171, -171, -172, -173, -172, -172, -171, -172, -172, -173, -173, -172, -170, -171, -171, -172, -171, -172, -172, -171, -171, -172, -171, -171, -172, -172, -172, -173, -172, -172, -172, -171, -170, -172, -172, -171, -172, -171, -172, -171, -171, -172, -171, -170, -172, -172, -172, -172, -170, -171, -172, -171, -170, -171, -171, -170, -171, -170, -171, -171, -172, -172, -172, -172, -171, -172, -172, -171, -173, -172, -172, -171, -173, -172, -171, -172, -171, -172, -173, -172, -173, -174, -172, -172, -172, -173, -173, -172, -170, -171, -171, -172, -172, -172, -173, -172, -172, -172, -171, -172, -172, -170, -172, -172, -173, -171, -173, -172, -171, -171, -172, -172, -172, -172, -172, -172, -172, -171, -172, -171, -172, -171, -170, -172, -171, -171, -172, -172, -172, -170, -170, -171, -171, -171, -171, -172, -172, -172, -172, -172, -172, -172, -171, -171, -170, -171, -171, -171, -172, -171, -171, -172, -172, -172, -171, -171, -171, -171, -172, -172, -172, -170, -171, -171, -171, -172, -172, -171, -173, -172, -171, -171, -172, -173, -171, -171, -172, -174, -172, -173, -171, -171, -171, -172, -172, -172, -171, -172, -172, -172, -172, -172, -171, -171, -171, -171, -171, -172, -172, -172, -171, -171, -171, -171, -171, -172, -172, -170, -172, -171, -171, -171, -172, -171, -171, -172, -172, -172, -172, -172, -172, -171, -171, -172, -173, -172, -172, -171, -171, -173, -172, -171, -170, -171, -172, -172, -172, -172, -172, -173, -170, -171, -172, -172, -172, -172, -172, -171, -170, -174, -172, -172, -171, -171, -171, -171, -171, -172, -173, -171, -172, -172, -171, -171, -172, -171, -171, -170, -172, -172, -172, -172, -171, -169, -172, -171, -171, -171, -171, -171, -171, -172, -172, -171, -170, -171, -171, -172, -172, -172, -171, -171, -171, -172, -171, -171, -171, -171, -172, -173, -172, -171, -170, -172, -173, -173, -172, -172, -171, -171, -171, -171, -170, -170, -170, -171, -172, -171, -171, -171, -171, -171, -172, -171, -171, -172, -173, -172, -172, -171, -173, -172]
-92640a72%J%j%JJ%j%%%%%%%jJ%j%KJjjjJJ%j%JJjkKkJ%JjJ%J%%j%JkJJJjj%JJjj%%j%%%J
-92681a70JjkKjJj%J%%%jJJJk%J%jJkjJJkKjjJ%J%j%%j%%Jj%%%%Jj%J%%%%%%j%Jj%%J%Jk%
-92722a72%%Jj%J%%kJkMjj%kK%%%J%j%%JjjJ%J%j%%J%%jJj%%%%JjJj%Kj%jJ%%%%JkJKjjKK
-92763a67jjL%%%kJ%j%%JJ%Jk%%J%JJjj%kJ%JjJJjkJJ%J%Jl%j%JjKJ%%jj%%J%%J%kjJJlKJ
-92804a66%j%%j%j%kJ%j%JjKkj%JJ%%jjJjjKJjjJ%%jJj%Kjj%%%%%Kk%JjJJ%k%JkJ%Jj%%%J
-92846a71%JkjJJkJJj%J%%JjJj%%%%%Jjj%%jJKj%j%%%J%Jj%j%%JkK%j%%Kjj%jLj%j%%J%jj
-92887a73KJk%%%%Jj%Jj%%%%JjJj%%K%jJkJlK%jK%%%%%J%k%J%jJj%J%j%JjJ%%Jj%%JkjJ%%
-92928a72%J%%%%j%jJ%jJJ%jJJkjJ%%%%JJ%k%%Jj%JJkJj%J%%JkJ%jjJJJjj%%jK%j%JJkjJ%
$$ y = [-172, -172, -171, -171, -172, -172, -171, -170, -170, -171, -171, -171, -171, -171, -171, -171, -171, -172, -171, -171, -172, -172, -170, -169, -170, -171, -172, -171, -170, -170, -171, -171, -170, -169, -170, -172, -170, -172, -171, -171, -170, -171, -170, -170, -169, -169, -169, -170, -170, -169, -171, -170, -169, -168, -169, -170, -170, -169, -168, -169, -170, -170, -170, -171, -171, -171, -171, -170, -169, -170, -172, -170, -171, -170, -171, -171, -170, -170, -170, -170, -171, -170, -169, -168, -170, -170, -169, -169, -170, -169, -171, -172, -171, -170, -172, -170, -171, -172, -171, -171, -170, -170, -171, -171, -171, -172, -172, -172, -171, -172, -172, -172, -172, -172, -171, -172, -172, -171, -171, -171, -171, -171, -171, -171, -172, -172, -171, -172, -172, -172, -171, -171, -170, -172, -172, -172, -172, -171, -172, -172, -171, -171, -171, -173, -172, -174, -170, -171, -172, -172, -174, -172, -172, -172, -172, -171, -171, -172, -172, -172, -171, -172, -173, -172, -172, -171, -171, -172, -172, -172, -171, -171, -171, -172, -171, -172, -172, -172, -172, -172, -171, -172, -171, -172, -172, -170, -171, -171, -172, -171, -171, -171, -171, -171, -170, -172, -171, -169, -170, -171, -169, -167, -168, -169, -166, -166, -166, -166, -168, -167, -167, -168, -168, -168, -167, -166, -166, -165, -167, -167, -167, -166, -166, -165, -164, -165, -166, -166, -168, -167, -167, -166, -167, -166, -165, -166, -168, -167, -166, -166, -165, -165, -164, -167, -167, -168, -168, -167, -168, -166, -165, -165, -165, -166, -167, -167, -167, -166, -166, -166, -165, -165, -167, -168, -167, -166, -169, -167, -166, -166, -167, -167, -167, -168, -168, -169, -169, -171, -170, -170, -171, -171, -170, -171, -169, -171, -172, -172, -171, -170, -170, -170, -171, -172, -171, -172, -173, -171, -170, -171, -172, -171, -171, -171, -172, -171, -172, -172, -170, -171, -172, -172, -172, -172, -172, -172, -170, -172, -172, -171, -172, -171, -170, -170, -172, -172, -171, -173, -172, -172, -171, -172, -172, -172, -172, -171, -171, -170, -172, -173, -172, -171, -173, -172, -171, -172, -172, -171, -171, -171, -170, -171, -170, -171, -171, -171, -171, -171, -171, -170, -171, -172, -172, -172, -173, -172, -170, -171, -171, -172, -172, -172, -172, -171, -171, -170, -171, -171, -172, -172, -172, -171, -173, -171, -171, -172, -172, -172, -170, -171, -172, -172, -173, -170, -171, -171, -172, -172, -172, -171, -171, -172, -173, -171, -170, -172, -172, -172, -172, -172, -171, -172, -172, -171, -172, -172, -172, -172, -172, -171, -172, -171, -172, -172, -172, -170, -170, -171, -170, -172, -171, -174, -172, -172, -173, -171, -171, -171, -171, -171, -171, -170, -170, -172, -172, -171, -171, -172, -171, -172, -172, -171, -171, -172, -172, -171, -172, -171, -171, -171, -170, -171, -171, -171, -170, -172, -173, -172, -172, -172, -172, -171, -171, -171, -171, -171, -172, -172, -173, -172, -172, -173, -172, -171, -171, -172, -171, -170, -172, -173, -172, -172, -172, -172, -172, -171, -170, -170, -172, -172, -172, -171, -172, -172, -171, -170, -172, -171, -172, -172, -171, -171, -171, -170, -172, -171, -171, -172, -173, -172, -171, -170, -171, -172, -172, -172, -173, -171, -171, -172, -172, -171, -170, -172, -173, -172, -172]
-92969a72%%JjjKJj%Jk%%%%JjJj%jJJj%JJjjKk%%%jJJ%j%jKjJ%j%%jKjJkJJ%%j%%%%Jj%%J
-93011a71%%%%jK%%jkJ%%JkK%%jKj%%kLl%Jj%%%%J%Jj%%J%%j%J%%%j%JJj%jKjj%%%%J%%%%
-93052a71jJJkJj%%%Jj%%%%J%jJ%J%j%%%jJ%Jjj%JJjjjJjJKjjJ%JJjkJjjJJ%%%Jj%%%%%%j
-93093a72J%%%j%jJjJ%%%%%%K%jkJ%J%%%%%j%%%%jJ%%%kJKkJ%%%J%kJJjjJ%%%jJJkJjKJ%j
-93134a71jjJ%%%%%%%j%J%%%%%%J%%%%jJJj%j%JjjJKj%JjjJj%%%JjKJkJ%jkJ%J%j%KjjjJ%
-93175a72jJ%Jj%J%Jj%k%%J%%kKJjJ%%j%Jj%%%j%JJj%J%j%JjJjJ%j%jJJj%%J%%Jjj%%%K%l
-93217a73J%KkJ%jj%JJj%Jj%%%%JJk%%%%JjjJJJ%%Kk%jj%%%J%jJJk%%%%J%jJ%%%%%j%%%J%
-93258a71%jjJ%%JjJj%j%JJjjJjK%jJjJJj%JkJJk%Jj%J%j%KkJ%%%j%%%%%%JjJjJJ%j%j%Jj
$$ y = [-172, -172, -172, -171, -172, -173, -171, -170, -171, -171, -170, -172, -172, -172, -172, -172, -171, -172, -171, -172, -172, -173, -172, -171, -172, -172, -171, -170, -171, -172, -170, -172, -172, -172, -172, -173, -172, -171, -171, -172, -172, -173, -171, -172, -171, -171, -172, -172, -172, -173, -171, -172, -171, -173, -172, -171, -171, -171, -172, -172, -172, -172, -172, -171, -172, -172, -172, -171, -171, -171, -171, -171, -172, -170, -170, -170, -171, -173, -172, -172, -172, -171, -173, -171, -171, -171, -172, -170, -171, -171, -171, -173, -170, -173, -173, -172, -173, -173, -173, -173, -173, -172, -172, -171, -172, -172, -172, -171, -171, -171, -172, -172, -171, -171, -171, -171, -172, -172, -171, -170, -171, -171, -172, -170, -171, -172, -172, -172, -172, -172, -171, -171, -171, -171, -171, -172, -171, -170, -172, -171, -172, -172, -172, -172, -171, -172, -172, -172, -172, -172, -171, -171, -172, -171, -171, -170, -170, -171, -171, -171, -171, -172, -171, -171, -170, -171, -172, -172, -171, -170, -171, -172, -173, -172, -173, -172, -170, -171, -172, -171, -171, -170, -169, -170, -172, -171, -172, -173, -172, -171, -171, -171, -171, -170, -171, -171, -171, -171, -171, -171, -171, -172, -171, -171, -171, -171, -172, -172, -173, -172, -173, -172, -172, -172, -172, -172, -172, -172, -170, -170, -171, -173, -172, -172, -171, -171, -171, -171, -171, -171, -172, -172, -172, -172, -172, -173, -172, -172, -172, -172, -174, -173, -171, -173, -172, -172, -172, -172, -171, -171, -173, -172, -171, -172, -173, -172, -172, -172, -172, -173, -172, -171, -173, -172, -173, -171, -170, -170, -171, -172, -173, -172, -172, -172, -172, -172, -172, -172, -172, -173, -173, -172, -172, -172, -172, -172, -172, -172, -171, -171, -171, -171, -171, -172, -171, -170, -171, -171, -172, -172, -171, -172, -173, -172, -170, -171, -171, -170, -171, -172, -171, -172, -172, -172, -172, -171, -172, -170, -169, -171, -170, -170, -171, -173, -172, -172, -171, -171, -172, -172, -170, -171, -172, -173, -172, -172, -173, -172, -172, -171, -172, -172, -171, -171, -170, -171, -171, -173, -173, -173, -172, -172, -172, -174, -172, -171, -172, -171, -171, -171, -172, -172, -171, -172, -172, -172, -172, -173, -173, -172, -171, -172, -172, -171, -171, -172, -172, -171, -172, -171, -172, -171, -171, -172, -172, -173, -172, -171, -172, -172, -172, -171, -171, -171, -170, -171, -172, -172, -172, -172, -170, -170, -173, -172, -172, -170, -172, -171, -171, -172, -173, -173, -172, -171, -172, -172, -171, -172, -172, -172, -172, -172, -171, -170, -172, -172, -172, -172, -172, -171, -172, -173, -172, -171, -170, -170, -170, -168, -170, -170, -171, -172, -172, -172, -172, -171, -171, -172, -171, -170, -172, -172, -172, -172, -172, -171, -171, -172, -171, -171, -171, -171, -171, -171, -172, -172, -172, -172, -171, -171, -171, -172, -173, -172, -172, -172, -171, -172, -171, -172, -172, -173, -173, -172, -171, -172, -173, -172, -173, -171, -171, -172, -171, -172, -171, -170, -171, -171, -170, -172, -171, -170, -172, -172, -171, -172, -172, -171, -171, -172, -172, -170, -172, -171, -171, -171, -171, -172, -172, -172, -172, -172, -172, -172, -171, -172, -171, -172, -171, -170, -170, -171, -171, -172, -172, -171, -172]
-93299a72JJj%jJ%%%%j%%KjkKjJj%jJJJj%jJ%JkK%Jj%kJ%JjjJj%%Kj%j%J%jKjj%%%J%%Jk%
-93340a72jK%%jJ%%%%%%JjjJ%j%%JjJ%JkJ%J%%j%JlJ%J%%%%jjJ%%KJk%%j%%J%Jj%%Jk%%%J
-93382a71%JJkKkj%KjjJ%%jJ%Jl%Kj%%%jK%%%%j%%%%%%%%Jj%%J%%%%%jJJkJ%jJj%%%%%%%%
-93423a72J%%%j%KkJ%%Jj%%J%k%J%%%jKk%J%j%%%%%JkJJJj%%j%%%%%J%%jjJ%%J%%%kKj%%%
-93464a72%%Jj%%jKj%JJjj%JjjJJ%j%jK%%Jjj%J%%%%%J%k%J%%%%%%%%jJ%jJjJj%%J%%Jk%K
-93505a70jjK%j%%%j%%%%J%JjjKjkJ%J%%%%%%%Jj%%%j%%jJJ%%%%%j%%%%J%%J%jkJJ%kJ%Jj
-93546a72%%%J%%%%Jj%%%%Jjj%Jj%K%jjJ%J%%j%Jj%jKjjJ%%%JkJKjj%%%%J%j%%JjjJ%%%%%
-93588a71J%j%%%%JkJ%%%%j%%%%%JjJj%%jK%Jjj%J%Jj%Jj%%Jjj%J%%JjjJj%jKjK%jJjj%JJ
$$ y = [-172, -171, -170, -171, -171, -172, -171, -171, -171, -171, -171, -172, -172, -172, -170, -171, -173, -171, -172, -171, -172, -172, -173, -172, -171, -170, -171, -171, -172, -171, -171, -170, -172, -170, -170, -169, -170, -170, -172, -171, -171, -170, -171, -172, -171, -172, -172, -172, -170, -171, -171, -172, -172, -171, -171, -172, -170, -171, -172, -172, -172, -172, -171, -171, -171, -170, -172, -172, -173, -171, -171, -171, -172, -171, -171, -171, -171, -171, -171, -171, -170, -171, -172, -171, -171, -172, -172, -172, -171, -172, -171, -171, -170, -172, -171, -171, -170, -170, -170, -171, -171, -170, -173, -172, -172, -171, -171, -171, -171, -171, -172, -173, -172, -172, -172, -170, -169, -171, -171, -171, -172, -172, -172, -171, -171, -170, -171, -171, -171, -170, -172, -172, -172, -172, -171, -171, -170, -169, -171, -169, -171, -172, -172, -170, -171, -172, -171, -171, -171, -172, -171, -171, -170, -173, -173, -171, -172, -172, -172, -172, -173, -171, -171, -171, -171, -171, -172, -172, -172, -172, -172, -172, -172, -172, -172, -171, -172, -172, -172, -171, -171, -171, -171, -171, -171, -172, -171, -170, -172, -171, -171, -172, -171, -172, -172, -172, -172, -172, -172, -172, -172, -172, -171, -171, -171, -171, -172, -172, -170, -172, -171, -171, -171, -170, -171, -171, -171, -170, -170, -172, -172, -171, -171, -171, -171, -172, -170, -172, -172, -171, -171, -172, -172, -172, -172, -172, -172, -171, -173, -172, -171, -170, -171, -171, -171, -172, -172, -172, -172, -172, -172, -171, -171, -171, -172, -173, -172, -172, -172, -171, -171, -171, -171, -173, -171, -172, -172, -172, -172, -172, -172, -171, -172, -172, -172, -173, -171, -172, -172, -171, -170, -171, -172, -172, -171, -172, -173, -172, -171, -171, -172, -172, -173, -171, -171, -171, -170, -171, -172, -172, -171, -171, -171, -171, -171, -171, -170, -170, -172, -172, -171, -171, -171, -171, -171, -171, -171, -171, -171, -172, -171, -171, -172, -171, -172, -171, -172, -172, -172, -171, -171, -171, -170, -172, -172, -170, -171, -172, -170, -170, -171, -171, -171, -171, -172, -172, -172, -172, -172, -171, -171, -170, -171, -172, -170, -171, -173, -172, -172, -171, -171, -171, -171, -171, -171, -171, -171, -170, -171, -171, -171, -171, -172, -172, -172, -173, -172, -171, -171, -171, -171, -171, -171, -172, -172, -172, -172, -172, -171, -171, -171, -170, -170, -171, -173, -172, -171, -171, -173, -172, -172, -171, -172, -172, -172, -172, -171, -171, -171, -171, -171, -170, -171, -171, -171, -171, -171, -170, -171, -172, -172, -171, -172, -172, -170, -170, -171, -172, -171, -171, -170, -170, -170, -171, -171, -170, -171, -171, -172, -170, -171, -172, -171, -171, -171, -171, -170, -172, -171, -169, -170, -171, -171, -171, -171, -171, -170, -170, -171, -171, -171, -170, -171, -172, -171, -171, -171, -171, -171, -171, -170, -170, -171, -171, -171, -171, -171, -170, -172, -171, -171, -171, -171, -171, -172, -172, -172, -172, -172, -172, -171, -172, -171, -172, -172, -172, -173, -171, -171, -170, -171, -172, -172, -171, -171, -170, -171, -171, -170, -171, -171, -171, -170, -171, -172, -172, -171, -171, -171, -170, -171, -172, -171, -172, -172, -173, -171, -172, -170, -170, -171, -170, -171, -172, -172, -171, -170]
-93629a70j%%%JjkK%jJkJ%J%%jJ%j%%%%JJ%j%%%%jjK%%JjjJ%%%JkJ%%%j%Jj%JJJjjKjjjJ%
-93670a71%kK%%%%%jJ%%%%%%Jj%%J%%j%%%jJ%%%kJjJJkJ%%jjLjJkJJJl%KJj%jKjjKjjLkj%
-93711a72JJj%%%%%jKkK%jj%JJjjJjjJ%%J%%%%JkJ%%j%%%%%J%%%JkKjJj%j%%J%%%%%%%%j%
-93753a72%%%J%j%J%%%%%%%J%%jjJ%%%%%%JkJ%%%j%J%Jjj%%J%KkjjKk%JJJkLjk%jJ%%J%%%
-93794a71JjjJJkKj%%Jj%%jJj%J%%%%J%%j%jJ%%%%jJJ%%jjJJj%%JjjJ%%%%j%%%J%j%%JKjj
-93835a71%%%k%%KjJkKjJjjJJJjj%%Kj%%%Jj%JjJk%Jj%J%jK%kJjJ%jJj%%%KjJ%kK%%kJJkJ
-93876a71j%J%Jj%jJ%JjjKj%jJ%%%%j%J%%JkJJJjjj%J%kKJ%%%k%%%%%%Jj%J%%%%%%Jk%J%j
-93917a72KjjJ%%%j%J%%%%j%Kj%%%jJ%KkJ%%%%%kJJ%%jJk%J%JkJJkJkL%kJ%%%%j%Jj%%JjJ
$$ y = [-170, -171, -171, -171, -171, -170, -171, -173, -171, -171, -172, -171, -173, -172, -172, -171, -171, -171, -172, -171, -171, -172, -172, -172, -172, -172, -171, -170, -170, -171, -171, -171, -171, -171, -172, -173, -171, -171, -171, -170, -171, -172, -171, -171, -171, -171, -170, -172, -171, -171, -171, -171, -172, -172, -171, -172, -172, -171, -170, -169, -170, -171, -169, -170, -171, -172, -171, -171, -171, -173, -171, -171, -171, -171, -171, -171, -172, -171, -171, -171, -171, -171, -171, -171, -170, -171, -171, -171, -170, -170, -170, -171, -171, -171, -171, -172, -171, -171, -171, -171, -173, -172, -173, -172, -171, -173, -172, -172, -172, -173, -174, -171, -172, -171, -173, -172, -171, -170, -173, -173, -171, -170, -171, -171, -172, -170, -171, -172, -170, -171, -172, -169, -171, -172, -172, -171, -170, -171, -171, -171, -171, -171, -171, -172, -170, -172, -170, -170, -171, -172, -172, -171, -170, -171, -172, -171, -172, -173, -172, -172, -172, -171, -171, -171, -171, -171, -170, -172, -171, -171, -171, -172, -172, -172, -172, -172, -172, -171, -171, -171, -171, -170, -172, -170, -171, -170, -171, -171, -172, -172, -172, -171, -171, -171, -171, -171, -171, -171, -171, -171, -172, -172, -172, -172, -172, -171, -171, -172, -172, -171, -171, -171, -171, -171, -171, -171, -171, -170, -170, -170, -171, -172, -171, -171, -171, -171, -171, -171, -171, -170, -172, -171, -171, -171, -171, -172, -172, -171, -171, -170, -171, -172, -172, -172, -171, -171, -169, -171, -172, -173, -171, -173, -173, -172, -171, -170, -172, -169, -170, -172, -172, -173, -172, -172, -172, -171, -171, -171, -171, -170, -171, -172, -171, -170, -172, -170, -171, -171, -171, -170, -171, -171, -171, -172, -171, -172, -172, -171, -171, -171, -171, -171, -170, -170, -170, -171, -171, -172, -171, -171, -171, -171, -171, -172, -171, -170, -170, -170, -171, -172, -171, -170, -171, -171, -171, -170, -171, -172, -171, -171, -171, -171, -171, -172, -172, -172, -172, -171, -171, -172, -172, -172, -171, -169, -170, -171, -171, -171, -171, -173, -173, -173, -171, -172, -171, -173, -171, -172, -171, -172, -173, -172, -171, -170, -171, -172, -172, -172, -170, -171, -171, -171, -171, -170, -171, -171, -170, -171, -170, -172, -172, -171, -172, -172, -171, -171, -172, -170, -170, -172, -171, -172, -171, -171, -172, -171, -172, -172, -172, -172, -170, -171, -170, -170, -172, -170, -170, -170, -172, -171, -170, -172, -171, -172, -172, -171, -171, -170, -171, -171, -172, -171, -171, -170, -171, -172, -170, -171, -171, -172, -171, -171, -171, -171, -171, -172, -172, -171, -171, -171, -170, -172, -171, -170, -169, -170, -171, -172, -172, -171, -171, -173, -171, -170, -170, -170, -170, -172, -172, -172, -172, -172, -172, -172, -171, -172, -172, -171, -171, -171, -171, -171, -171, -171, -170, -172, -172, -171, -171, -172, -170, -171, -172, -171, -171, -171, -171, -172, -172, -171, -171, -171, -171, -171, -172, -172, -170, -171, -171, -171, -171, -172, -171, -171, -169, -171, -170, -170, -170, -170, -170, -170, -172, -171, -170, -170, -170, -171, -170, -172, -172, -171, -171, -170, -172, -171, -170, -172, -171, -173, -170, -170, -172, -171, -171, -171, -171, -171, -172, -172, -171, -172, -172, -172, -171, -172, -171]
-93959a71kJJjK%%kJJj%%JjjjJJjJ%%JjkK%jjJ%%Kj%Kk%%J%jJ%%j%j%JjJ%jJjJJjjJJjjK%
-94000a70%j%LkkJJ%jJjJj%%jJ%%jjLj%%%%JkJ%%%%%JkJ%JjkJ%Kk%JJ%jj%Jj%Kj%jJJ%%%j
-94041a71%%jJJjJJjjJj%%%%JkKj%%jJJj%%%J%Jkj%J%J%j%%JjjJJ%k%Jj%jK%%JjJk%K%j%%
-94082a71%%jJJkJ%j%%%Lk%%J%kjJJjJ%%JjjJjKkKJl%J%%%JlL%j%%%%%%%j%%%Kj%%Jj%Jj%
-94124a71jKj%%%J%j%%JkJ%J%j%Jj%%%%%JjKjkJjJ%%%%%%%%%%jK%j%%%Jj%Jj%%%%%jJKk%%
-94165a71%%Jj%%%jJ%%J%jJJl%JjJJj%J%%j%J%j%%%%%%%%jJj%Lj%%%jKjjJ%j%%%%Jj%%JJj
-94206a70kJJjKjjKl%%JJj%JjJJjjjK%kKjjK%jJj%J%%jJ%%%%j%J%%j%jJJ%%%jJJjj%JkJKj
-94247a70%JkjJ%jJj%Kj%J%%j%JJ%%j%%%%%J%kJj%Kk%%Jj%J%jKjkJKl%K%jJjjJ%JjjKj%Jj
$$ y = [-171, -173, -172, -171, -172, -170, -170, -170, -172, -171, -170, -171, -171, -171, -170, -171, -172, -173, -172, -171, -172, -171, -171, -171, -170, -171, -173, -171, -171, -172, -173, -172, -172, -172, -170, -171, -171, -169, -171, -171, -171, -170, -170, -171, -170, -170, -170, -171, -171, -172, -172, -171, -172, -171, -171, -172, -171, -172, -171, -170, -171, -172, -171, -170, -171, -172, -170, -170, -170, -171, -171, -168, -170, -172, -171, -170, -170, -171, -170, -171, -170, -171, -171, -171, -172, -171, -171, -171, -172, -173, -170, -171, -171, -171, -171, -171, -170, -172, -171, -171, -171, -171, -171, -171, -170, -172, -171, -171, -170, -171, -173, -172, -172, -170, -172, -172, -171, -170, -170, -171, -172, -172, -171, -172, -172, -170, -171, -171, -172, -171, -170, -170, -170, -170, -171, -171, -171, -172, -171, -170, -171, -170, -169, -170, -171, -170, -171, -171, -171, -171, -171, -170, -172, -170, -171, -171, -171, -172, -171, -170, -171, -171, -171, -171, -170, -170, -169, -171, -172, -172, -171, -171, -170, -170, -171, -171, -171, -170, -171, -172, -171, -170, -170, -172, -172, -171, -172, -172, -173, -171, -171, -171, -170, -171, -170, -172, -172, -170, -170, -171, -171, -171, -171, -171, -172, -171, -170, -172, -171, -171, -172, -172, -172, -172, -169, -171, -171, -171, -170, -170, -172, -173, -172, -171, -172, -171, -171, -171, -170, -171, -172, -171, -172, -170, -172, -170, -169, -172, -172, -171, -171, -171, -171, -170, -173, -170, -170, -171, -171, -171, -171, -171, -171, -171, -171, -172, -172, -172, -172, -170, -171, -171, -171, -170, -171, -171, -170, -171, -171, -172, -170, -171, -171, -171, -171, -170, -170, -171, -171, -171, -170, -172, -171, -171, -170, -170, -171, -171, -170, -171, -171, -171, -171, -171, -171, -170, -171, -169, -170, -172, -171, -172, -171, -171, -171, -171, -171, -171, -171, -171, -171, -171, -171, -172, -170, -170, -171, -171, -171, -171, -170, -171, -171, -170, -171, -171, -171, -171, -171, -171, -172, -171, -169, -171, -171, -171, -171, -171, -170, -171, -171, -171, -171, -172, -171, -171, -171, -170, -170, -171, -170, -169, -172, -172, -171, -172, -171, -170, -171, -171, -170, -170, -170, -171, -171, -170, -170, -171, -171, -171, -171, -171, -171, -171, -171, -171, -172, -171, -172, -172, -169, -170, -170, -170, -170, -171, -169, -170, -171, -170, -170, -171, -171, -171, -171, -171, -170, -171, -171, -171, -170, -169, -170, -172, -171, -170, -171, -169, -170, -171, -169, -172, -172, -172, -171, -170, -171, -171, -170, -171, -170, -169, -170, -171, -172, -170, -170, -172, -170, -171, -172, -170, -170, -171, -170, -171, -171, -170, -170, -170, -171, -170, -170, -170, -170, -170, -171, -171, -170, -170, -170, -171, -171, -172, -171, -170, -170, -170, -170, -171, -170, -169, -170, -171, -171, -170, -172, -171, -169, -170, -170, -169, -171, -172, -171, -171, -172, -171, -172, -172, -170, -171, -171, -170, -170, -170, -171, -171, -170, -169, -169, -169, -170, -170, -170, -170, -170, -170, -169, -169, -171, -170, -171, -171, -169, -171, -171, -171, -170, -171, -171, -170, -170, -171, -169, -170, -172, -171, -169, -172, -172, -170, -170, -171, -170, -171, -172, -171, -171, -170, -171, -172, -170, -171, -171, -170, -171]
-94288a71%%%J%%jjKjJJ%j%jJj%J%jjJJk%LjkJJ%jJjjJJ%%j%%jKj%%%%%%%%%Jj%jJ%%jJJj
-94330a71J%kK%j%JjJ%%jjK%%J%%jj%J%j%%jKj%%J%%j%%jJjKj%JjJ%%%JkJj%jJjK%jJkJ%j
-94371a72JjJjJJKjjj%JjJjJj%J%Jj%j%%jK%j%jJ%KJkj%jJ%%jKJjJk%jJ%Kjk%J%jK%%Jk%J
-94412a70%%jJj%j%%J%%J%%kL%j%%kJ%%%%%J%%j%%K%%%jkKjJ%%%jJj%jJJ%%Jj%j%j%K%j%K
-94453a69jjjJ%%%Jj%%%J%%Jk%%%jJ%%%Jj%%%%%%jJ%JJj%%%JjjJ%%j%Kj%%%%Jk%%JjJ%kL%
-94495a69j%%jJ%%jjJ%J%%jkK%JJkJ%jJ%Jjj%J%jJj%jK%%j%%J%kJJj%%%%%%J%%jJ%jJ%%%%
-94536a70%jjK%%jJjJ%j%KjjjJJ%%j%%%%jJJ%%j%%J%%jJ%%kKj%%JjJ%%JjjJ%%%jKj%%Jj%j
-94577a71%J%JjjJJj%Jj%j%J%%%%%%j%jKj%J%j%JJj%%kJJ%%jK%%%j%%jjJ%J%j%%J%jJjJ%J
$$ y = [-171, -171, -171, -171, -170, -170, -170, -171, -172, -170, -171, -170, -169, -169, -170, -170, -171, -170, -171, -171, -170, -170, -171, -172, -171, -170, -172, -172, -169, -170, -172, -171, -170, -170, -171, -170, -171, -172, -171, -170, -170, -170, -171, -171, -171, -172, -170, -171, -171, -171, -171, -171, -171, -171, -171, -171, -171, -170, -171, -171, -172, -171, -171, -171, -172, -171, -170, -171, -170, -170, -172, -170, -170, -171, -171, -170, -171, -170, -170, -170, -171, -172, -170, -170, -170, -169, -169, -169, -170, -171, -171, -170, -170, -171, -171, -171, -172, -170, -171, -171, -171, -170, -170, -170, -171, -171, -171, -172, -171, -172, -170, -171, -171, -170, -171, -170, -170, -170, -170, -169, -171, -170, -171, -171, -172, -171, -172, -170, -170, -171, -170, -172, -171, -171, -172, -171, -172, -171, -172, -171, -170, -168, -169, -170, -171, -171, -170, -171, -170, -171, -170, -171, -171, -170, -170, -169, -170, -170, -171, -171, -171, -172, -170, -170, -171, -171, -172, -171, -171, -169, -168, -170, -171, -171, -172, -171, -171, -171, -172, -170, -169, -170, -169, -171, -171, -172, -171, -171, -169, -170, -172, -172, -171, -171, -172, -170, -170, -170, -169, -171, -171, -170, -170, -170, -171, -170, -171, -171, -172, -172, -172, -171, -171, -171, -170, -170, -170, -172, -169, -169, -170, -170, -170, -172, -171, -171, -171, -171, -171, -171, -170, -170, -170, -171, -171, -171, -169, -169, -169, -169, -170, -172, -170, -171, -170, -170, -170, -170, -171, -170, -171, -171, -172, -171, -170, -170, -170, -169, -170, -170, -171, -171, -172, -172, -170, -170, -171, -171, -169, -170, -171, -172, -171, -171, -171, -171, -170, -171, -171, -171, -171, -170, -170, -170, -169, -171, -171, -171, -171, -172, -171, -171, -171, -171, -170, -171, -171, -171, -171, -171, -171, -171, -172, -171, -171, -170, -169, -170, -170, -170, -170, -169, -170, -171, -170, -170, -170, -171, -171, -169, -170, -170, -170, -170, -170, -169, -171, -171, -171, -170, -171, -170, -170, -172, -169, -169, -170, -170, -170, -171, -170, -170, -170, -171, -172, -171, -171, -170, -170, -170, -171, -173, -171, -171, -170, -169, -171, -170, -170, -171, -170, -170, -169, -170, -171, -171, -170, -170, -171, -170, -171, -171, -172, -170, -170, -170, -171, -171, -171, -170, -170, -172, -171, -170, -171, -171, -171, -171, -171, -171, -171, -170, -170, -170, -171, -170, -170, -171, -170, -170, -170, -170, -170, -170, -171, -172, -170, -170, -170, -171, -170, -171, -170, -170, -171, -171, -169, -170, -171, -172, -171, -170, -170, -170, -171, -171, -171, -171, -171, -172, -171, -170, -170, -170, -171, -171, -171, -170, -170, -170, -171, -170, -170, -170, -172, -170, -171, -171, -171, -170, -171, -170, -170, -170, -169, -170, -171, -170, -170, -170, -170, -171, -169, -170, -170, -170, -169, -170, -170, -171, -171, -170, -170, -169, -170, -171, -170, -169, -170, -170, -169, -170, -170, -171, -171, -170, -170, -170, -170, -170, -170, -170, -171, -171, -172, -170, -171, -171, -170, -170, -171, -171, -170, -169, -170, -170, -170, -172, -171, -170, -170, -170, -171, -169, -169, -169, -169, -170, -170, -170, -171, -172, -171, -171, -170, -170, -171, -171, -171, -170, -170, -171, -170, -171, -170, -170, -169]
-94618a69jkJ%jJ%J%J%%j%jJjJjJJk%JjjJKjJjJkJJk%%%J%%Jk%%JjJ%%JJl%%%J%j%JKjjjJ
-94659a70%%J%kJ%jJ%%%%J%jJj%%%%%%%%jJ%%%%%%JjJj%%Jj%j%%JJ%%j%J%kJ%%j%J%jJj%J
-94701a70%j%%JjJJjJ%kJ%jJJ%%j%j%JJj%jJjK%%j%jj%%JJ%%kK%%JjKk%%%%%j%%J%%%%%j%
-94742a71Jj%J%%%%%%%kKj%%%%%%KkJ%jJJj%%jjJ%%%%%%J%%%jKk%%%%JjJJjj%J%%%J%j%Jj
-94783a70j%%KjJk%%J%jJ%%jJ%%jJjKj%Kj%%%%jJ%%jjJJk%J%%%%%%J%jJ%kJJjjJj%J%%jJ%
-94824a70J%Jjk%J%%jJjKjJlJKj%%%%Jjj%Kj%jJJjJjKjjkKJj%%jK%j%jjKj%JJ%j%%%Jj%%%
-94866a70%Kk%%K%k%%%%j%jKJ%j%%J%%%%%jj%%JJjjJ%jKj%%%J%k%Jj%Kj%JJ%k%%%%%%%jJ%
-94907a70JkJ%%jJ%%jJJ%%jJkK%%jjJjJJk%JjJj%JJ%j%k%Lj%Jj%%%J%j%%jK%%j%JkK%%%Jj
$$ y = [-169, -170, -172, -171, -171, -172, -171, -171, -170, -170, -169, -169, -169, -170, -170, -171, -170, -171, -170, -171, -170, -169, -171, -171, -170, -171, -172, -171, -169, -170, -169, -170, -169, -171, -170, -169, -171, -171, -171, -171, -170, -170, -170, -169, -171, -171, -171, -170, -171, -170, -170, -170, -169, -168, -171, -171, -171, -171, -170, -170, -171, -171, -170, -168, -169, -170, -171, -170, -170, -170, -169, -169, -171, -170, -170, -171, -170, -170, -170, -170, -170, -169, -169, -170, -169, -170, -170, -170, -170, -170, -170, -170, -170, -170, -171, -170, -170, -170, -170, -170, -170, -170, -169, -170, -169, -170, -170, -170, -169, -170, -170, -171, -171, -171, -170, -169, -169, -169, -170, -170, -169, -169, -171, -170, -170, -170, -171, -171, -170, -170, -171, -170, -171, -171, -170, -170, -171, -171, -171, -170, -171, -170, -169, -170, -169, -169, -171, -170, -170, -171, -170, -169, -169, -169, -170, -170, -171, -171, -170, -169, -170, -170, -171, -170, -171, -169, -169, -169, -170, -170, -171, -172, -172, -172, -171, -170, -170, -170, -172, -170, -170, -170, -169, -170, -168, -170, -170, -170, -170, -170, -170, -171, -171, -171, -170, -170, -170, -170, -170, -170, -171, -171, -170, -171, -171, -170, -170, -170, -170, -170, -170, -170, -170, -172, -170, -171, -171, -171, -171, -171, -171, -171, -169, -171, -170, -170, -171, -170, -169, -170, -170, -170, -171, -172, -171, -171, -171, -171, -171, -171, -171, -170, -170, -170, -170, -171, -169, -171, -171, -171, -171, -171, -170, -171, -170, -169, -170, -171, -171, -170, -170, -170, -170, -169, -169, -170, -170, -169, -170, -171, -171, -171, -169, -170, -169, -171, -171, -171, -170, -170, -171, -170, -170, -170, -171, -170, -170, -170, -171, -170, -171, -169, -170, -170, -168, -169, -169, -169, -169, -169, -170, -169, -169, -169, -170, -171, -170, -169, -171, -171, -170, -170, -170, -170, -170, -170, -170, -169, -169, -170, -169, -169, -171, -170, -169, -170, -171, -170, -171, -171, -170, -170, -170, -171, -170, -170, -169, -169, -168, -169, -171, -171, -170, -170, -170, -171, -170, -171, -169, -170, -169, -172, -171, -169, -170, -170, -170, -170, -170, -169, -170, -171, -171, -169, -170, -170, -171, -170, -169, -170, -169, -170, -168, -169, -170, -172, -170, -169, -170, -170, -170, -171, -169, -169, -170, -170, -171, -172, -170, -171, -171, -170, -169, -169, -170, -170, -170, -170, -169, -170, -170, -170, -170, -170, -168, -170, -170, -170, -168, -168, -170, -170, -170, -170, -170, -171, -171, -172, -170, -169, -169, -170, -170, -170, -169, -169, -169, -169, -169, -169, -170, -171, -171, -171, -170, -169, -170, -171, -170, -170, -171, -169, -170, -170, -170, -170, -169, -169, -171, -171, -170, -171, -171, -169, -170, -170, -169, -168, -168, -170, -170, -170, -170, -170, -170, -170, -170, -171, -170, -170, -169, -171, -170, -170, -170, -171, -170, -170, -170, -171, -170, -169, -169, -169, -170, -169, -171, -169, -169, -169, -170, -171, -170, -171, -170, -169, -171, -171, -170, -171, -170, -171, -171, -170, -169, -169, -170, -170, -172, -172, -169, -170, -170, -169, -170, -170, -170, -170, -169, -169, -170, -170, -170, -171, -169, -169, -169, -170, -170, -169, -171, -169, -169, -169, -169, -168, -169]
-94948a69j%%%jJKkKjj%JjjJ%Jj%JjjJJj%%J%j%%JjKjjJj%%jKKkjjKjJjjJJjJJkJj%Jj%%J
-94989a69%%JjjJ%%%%jjJ%%JkK%%jjJJ%Jk%J%%%jJjJ%Jjj%J%j%%%%J%%Jjj%KkJ%j%%J%jJ%
-95030a69jJJk%jJ%%Kk%%%%%%%%%J%%kJjK%j%%%%Jj%%Jj%%jKkJKj%kJJlL%%j%%J%jKj%jjL
-95072a68jj%JjjJ%j%JKk%JJ%k%%JkJJ%jJ%%%j%J%jJjKjj%%%J%jJj%jJ%Jj%LlJ%jjK%jjKJ
-95113a68k%JJkJJjjJ%Jjj%Jj%JjK%jJ%j%%%%%j%%%J%JkJ%%%j%%jJ%%J%j%jKjjK%%jJj%J%
-95154a69j%KJkjJ%%%%j%%Kk%%JjKjj%%%J%j%%jK%%%%%kK%jJKj%%j%JjjJJkKjjJj%J%J%%j
-95195a69jjJJJ%jjJJ%jjj%JjJ%jK%%%%j%%Jj%JjJjJ%JJjj%j%J%jJJ%%jj%%Kj%jJj%JjJkJ
-95237a70KlJ%Jj%JJjk%Kj%JjJkK%%j%J%jLjj%%%J%%k%%%%%KjJkJJkJ%j%K%jJjjjJjLj%%j
$$ y = [-169, -170, -170, -170, -170, -171, -170, -168, -170, -168, -169, -170, -170, -169, -170, -171, -170, -170, -169, -170, -170, -169, -170, -171, -170, -169, -170, -170, -170, -169, -169, -170, -170, -170, -169, -170, -168, -169, -170, -169, -170, -170, -170, -171, -169, -167, -169, -170, -171, -169, -170, -169, -170, -171, -170, -169, -170, -169, -168, -170, -169, -170, -170, -169, -170, -170, -170, -169, -169, -169, -168, -169, -170, -169, -169, -169, -169, -169, -170, -171, -170, -170, -170, -169, -171, -169, -169, -169, -170, -171, -170, -169, -169, -168, -170, -170, -169, -169, -169, -169, -170, -169, -170, -169, -169, -168, -169, -170, -170, -169, -169, -170, -170, -170, -170, -170, -169, -169, -169, -168, -169, -170, -170, -168, -170, -169, -169, -170, -170, -170, -169, -169, -170, -169, -169, -170, -169, -168, -170, -170, -171, -170, -170, -170, -168, -170, -170, -170, -170, -170, -170, -170, -170, -170, -170, -169, -169, -169, -171, -170, -171, -169, -169, -170, -170, -170, -170, -170, -169, -170, -170, -170, -169, -170, -170, -170, -171, -169, -171, -170, -168, -169, -169, -171, -170, -169, -172, -169, -169, -169, -170, -170, -170, -169, -169, -170, -168, -169, -169, -170, -171, -168, -169, -170, -170, -169, -170, -171, -170, -170, -171, -171, -170, -168, -170, -170, -169, -168, -168, -170, -170, -170, -169, -171, -170, -169, -169, -170, -169, -169, -169, -169, -170, -170, -169, -169, -170, -169, -170, -168, -169, -170, -170, -170, -170, -169, -169, -170, -169, -170, -170, -171, -170, -170, -169, -170, -170, -167, -170, -169, -169, -170, -171, -169, -169, -170, -171, -169, -168, -170, -170, -169, -168, -170, -169, -168, -169, -170, -169, -169, -168, -169, -170, -170, -169, -170, -170, -169, -170, -168, -168, -169, -168, -168, -169, -169, -169, -169, -169, -169, -170, -170, -170, -170, -169, -169, -168, -170, -169, -169, -169, -169, -170, -170, -170, -171, -170, -170, -170, -169, -169, -170, -170, -171, -169, -170, -171, -169, -169, -169, -170, -169, -170, -170, -169, -169, -170, -170, -168, -167, -169, -170, -169, -169, -169, -169, -169, -170, -170, -170, -168, -170, -170, -170, -169, -170, -168, -169, -170, -170, -170, -170, -169, -169, -170, -170, -170, -171, -169, -169, -169, -169, -169, -169, -171, -169, -169, -170, -169, -167, -168, -168, -168, -169, -169, -168, -169, -170, -169, -168, -170, -168, -169, -170, -169, -170, -170, -169, -169, -168, -168, -168, -169, -170, -171, -170, -169, -168, -168, -169, -170, -169, -168, -168, -169, -170, -171, -171, -170, -171, -170, -170, -171, -169, -169, -169, -169, -169, -170, -170, -170, -169, -170, -170, -169, -170, -169, -170, -169, -169, -168, -167, -168, -169, -169, -170, -170, -169, -169, -170, -169, -168, -168, -168, -169, -170, -170, -170, -168, -169, -169, -170, -169, -170, -170, -169, -170, -169, -171, -170, -168, -171, -170, -170, -169, -170, -170, -169, -168, -169, -171, -171, -169, -170, -170, -169, -170, -169, -171, -169, -169, -169, -170, -170, -169, -169, -170, -167, -168, -169, -169, -169, -169, -168, -168, -168, -170, -170, -170, -170, -170, -170, -168, -169, -168, -170, -169, -168, -170, -169, -169, -170, -170, -168, -168, -169, -168, -169, -170, -171, -170, -171, -168, -169, -169, -169, -170]
-95278a70%%%LkjjJJ%%%%j%Jj%%%JjJ%%J%jJ%%jJkJ%J%j%Jk%JKjjjJj%%JjK%kK%%%j%jJ%j
-95319a70Jj%J%J%kJ%%%%%j%JJ%kjK%%%%%%j%%Jj%J%%%%Jjj%Jj%Lj%j%%JjJ%JlJ%J%jJjJj
-95360a69%%j%%KlJJJ%JkJjJ%JkJkJ%%JjJJjj%JjJjJkK%k%J%J%%j%JjJ%jJ%jKkKjj%jK%j%
-95401a69%Jj%%jJJ%%kKkKJj%%%j%%J%%%%%%%j%JjJjjJ%j%%%%JJjJ%jJ%jJj%J%jJj%%%J%%
-95443a68%kKj%JkJJjj%JJ%%j%%JkJJ%jJjj%JkLjJ%JJk%%%%j%%jL%m%KJjJ%jKj%%%jJ%j%%
-95484a69%J%%jj%JJJ%k%Jk%JJ%j%%%jJ%Jj%JjJkJJjJjKjjKlKjJj%%Jj%%%JjJ%%%%jJj%%%
-95525a69J%%j%Jj%J%%jjK%j%%KjJ%j%j%JjjJ%%JkJ%Jj%%j%%%%J%%%J%j%%J%%Jl%J%%J%j%
-95566a69J%%%J%jj%%%JKkj%J%%%jjJKjjkJLkJj%Kjj%%%%%%%%%%%%%%jJj%J%J%jjJ%J%Jjj
$$ y = [-170, -170, -170, -170, -167, -169, -170, -171, -170, -169, -169, -169, -169, -169, -170, -170, -169, -170, -170, -170, -170, -169, -170, -169, -169, -169, -168, -168, -169, -168, -168, -168, -169, -168, -170, -169, -169, -168, -168, -169, -169, -168, -170, -170, -169, -167, -168, -169, -170, -169, -170, -170, -170, -169, -170, -168, -168, -170, -168, -168, -168, -168, -169, -169, -170, -169, -169, -170, -169, -170, -170, -169, -169, -168, -168, -170, -169, -169, -169, -169, -169, -169, -170, -170, -169, -168, -168, -170, -171, -169, -169, -169, -169, -169, -169, -169, -170, -170, -170, -169, -170, -170, -169, -169, -169, -169, -169, -168, -169, -170, -170, -169, -170, -170, -167, -168, -168, -169, -169, -169, -168, -169, -168, -168, -167, -170, -169, -169, -168, -168, -169, -168, -169, -168, -169, -169, -169, -170, -170, -170, -168, -171, -170, -169, -168, -168, -167, -169, -168, -169, -168, -168, -167, -169, -168, -170, -169, -169, -169, -168, -169, -168, -167, -168, -169, -169, -168, -169, -168, -169, -168, -170, -168, -168, -170, -170, -169, -169, -168, -168, -168, -169, -169, -168, -169, -168, -168, -169, -168, -168, -169, -167, -169, -167, -168, -169, -169, -170, -168, -168, -169, -169, -169, -168, -169, -169, -169, -170, -169, -168, -168, -168, -170, -168, -170, -168, -167, -168, -168, -168, -168, -169, -169, -169, -168, -168, -168, -168, -168, -168, -168, -168, -169, -169, -168, -169, -168, -169, -170, -169, -169, -170, -170, -170, -170, -170, -169, -168, -169, -168, -168, -169, -168, -168, -169, -168, -169, -169, -168, -168, -169, -168, -169, -169, -169, -169, -168, -168, -168, -168, -170, -168, -169, -169, -168, -170, -169, -168, -169, -170, -170, -169, -168, -168, -168, -169, -169, -169, -168, -170, -169, -168, -168, -169, -168, -169, -170, -170, -169, -171, -168, -169, -168, -168, -167, -166, -168, -168, -168, -168, -168, -169, -169, -169, -170, -167, -167, -171, -171, -169, -168, -169, -168, -168, -169, -167, -168, -168, -168, -168, -169, -168, -168, -169, -169, -169, -169, -168, -168, -168, -169, -170, -170, -169, -168, -167, -167, -169, -169, -168, -170, -170, -169, -168, -168, -169, -169, -169, -169, -170, -169, -169, -168, -169, -169, -168, -169, -168, -170, -169, -168, -169, -168, -169, -167, -168, -169, -167, -170, -168, -169, -168, -169, -169, -169, -168, -169, -169, -169, -169, -168, -169, -168, -168, -168, -168, -168, -169, -168, -169, -169, -169, -169, -168, -168, -168, -169, -169, -168, -169, -169, -168, -168, -168, -169, -170, -168, -168, -169, -169, -169, -167, -168, -167, -167, -168, -168, -169, -169, -168, -169, -170, -169, -169, -169, -168, -170, -169, -169, -168, -169, -169, -169, -170, -170, -170, -170, -170, -169, -169, -169, -169, -168, -168, -169, -169, -169, -168, -168, -168, -167, -170, -170, -169, -169, -169, -168, -168, -169, -169, -168, -168, -168, -168, -167, -167, -168, -169, -169, -169, -169, -168, -166, -168, -169, -169, -168, -168, -168, -168, -169, -170, -169, -167, -168, -169, -171, -170, -167, -169, -168, -169, -169, -167, -168, -169, -169, -169, -169, -169, -169, -169, -169, -169, -169, -169, -169, -169, -169, -169, -170, -169, -170, -170, -169, -169, -168, -168, -169, -170, -169, -169, -168, -168, -167, -168, -169]
-95608a69Kj%%Jj%%%jKj%%%%%jKkJJkJ%%jJ%%%%%%%jjJ%%%%J%jJ%%j%%%KJk%kJ%JJ%j%%%j
-95649a69J%%%%jJJjkKk%KjJjKj%JkJ%%J%jkJ%J%j%%JjKjjJj%JlMk%J%%j%J%%%%%j%%%J%%
-95690a68%jJ%%jJJk%%%JJj%%%Jj%%J%lJJJ%k%KkK%j%%jJJj%j%%JjJJj%Jjj%jJ%%J%j%%%J
-95731a68Jj%%jJ%%%%Kk%%JjjJ%%%jKj%%%%j%%%%%JJjJj%%%jKjjJjJ%%%%%j%J%j%J%jJ%%%
-95772a68%%%%%j%J%%jJjKjjJJ%jj%%%Jj%Kj%%JkJ%j%J%j%Jj%%%J%jJjJJ%k%%%%%%J%%J%%
-95814a67j%%%jJ%J%%j%%jJjJkJ%%J%%%JkJjJJj%%jKjjJJj%%%jK%%j%j%Jj%%JJj%jJJ%j%%
-95855a68jjKj%J%j%J%JjJJk%jJjJJj%jJJjjK%kJjj%LkJ%%%jKj%%%jJ%%%JjjJ%jJ%Kk%Jjj
-95896a69JJ%%jjJ%jKjJkJ%J%j%%%J%%%%j%%%%J%%j%%%%%%%%%%%%JkKkKj%jJjJJjJ%jjKjj
$$ y = [-169, -167, -168, -168, -168, -167, -168, -168, -168, -168, -169, -167, -168, -168, -168, -168, -168, -168, -169, -167, -169, -168, -167, -169, -168, -168, -168, -169, -168, -168, -168, -168, -168, -168, -168, -168, -169, -170, -169, -169, -169, -169, -169, -168, -168, -169, -168, -168, -168, -169, -169, -169, -169, -167, -166, -168, -168, -170, -169, -169, -168, -167, -167, -168, -168, -168, -168, -169, -168, -168, -168, -168, -168, -169, -168, -167, -168, -170, -168, -170, -170, -168, -169, -168, -169, -167, -168, -168, -167, -169, -168, -168, -168, -167, -167, -168, -170, -169, -169, -168, -168, -169, -169, -169, -168, -169, -167, -168, -169, -168, -169, -169, -168, -171, -167, -169, -169, -168, -168, -168, -169, -169, -168, -168, -168, -168, -168, -168, -169, -169, -169, -169, -168, -168, -168, -168, -169, -168, -168, -168, -169, -168, -167, -169, -169, -169, -169, -168, -167, -168, -168, -168, -168, -167, -168, -168, -168, -167, -167, -170, -169, -168, -167, -167, -169, -169, -167, -169, -167, -167, -168, -168, -168, -169, -168, -167, -168, -168, -169, -169, -169, -168, -169, -168, -167, -168, -168, -167, -168, -169, -169, -170, -169, -169, -169, -168, -168, -169, -169, -169, -169, -168, -167, -168, -168, -168, -169, -168, -168, -168, -168, -168, -166, -168, -168, -168, -167, -168, -169, -168, -168, -168, -168, -169, -167, -168, -168, -168, -168, -168, -169, -169, -169, -169, -169, -169, -168, -167, -168, -167, -168, -168, -168, -168, -169, -167, -168, -169, -168, -169, -168, -168, -168, -168, -168, -168, -169, -169, -168, -168, -169, -169, -168, -168, -169, -168, -168, -168, -168, -168, -168, -168, -168, -168, -169, -169, -168, -168, -168, -169, -168, -169, -167, -168, -169, -168, -167, -167, -168, -169, -169, -169, -169, -168, -169, -169, -167, -168, -168, -168, -167, -169, -168, -168, -169, -169, -168, -168, -169, -169, -168, -169, -169, -169, -169, -168, -168, -169, -168, -169, -168, -167, -167, -169, -169, -169, -169, -169, -169, -169, -168, -168, -168, -167, -167, -167, -168, -168, -168, -168, -169, -168, -168, -167, -167, -167, -168, -168, -168, -169, -168, -169, -168, -170, -169, -169, -169, -168, -168, -168, -168, -167, -169, -168, -169, -168, -167, -168, -168, -168, -169, -167, -168, -169, -168, -167, -168, -168, -168, -168, -169, -167, -167, -167, -168, -168, -169, -169, -168, -169, -169, -169, -168, -167, -168, -168, -169, -168, -167, -167, -168, -168, -168, -169, -170, -168, -169, -169, -168, -168, -169, -169, -168, -168, -167, -168, -167, -166, -168, -168, -169, -168, -169, -168, -167, -168, -168, -169, -168, -167, -168, -169, -167, -167, -169, -168, -169, -170, -170, -167, -169, -168, -168, -168, -168, -169, -167, -168, -168, -168, -168, -169, -168, -168, -168, -168, -167, -168, -169, -168, -168, -169, -168, -168, -166, -168, -168, -167, -168, -169, -168, -167, -167, -167, -168, -169, -168, -168, -169, -167, -168, -167, -169, -168, -168, -167, -167, -168, -168, -168, -168, -167, -167, -167, -167, -167, -168, -168, -168, -168, -168, -167, -167, -167, -168, -168, -168, -168, -168, -168, -168, -168, -168, -168, -168, -168, -168, -167, -169, -167, -169, -167, -168, -168, -169, -168, -169, -168, -167, -168, -167, -167, -168, -169, -167, -168, -169]
-95937a69JKjkJ%JJjkJ%jjLj%JjJkJ%%%%%%%%%%jJJ%%jJ%j%%%JJj%%%%kJ%%JjJ%j%JJj%jJ
-95979a67j%%j%J%jJ%%%%JkJ%%%J%%%j%J%kJJjJ%k%J%J%J%lLkKkjJ%%%%Kjj%Jj%jKjJj%Jk
-96020a69JKj%%jJj%%J%%%%jJj%j%JjKjJjJ%Jj%JjKkj%J%%jjKkJKj%jJjjJ%%%%J%j%%%j%J
-96061a68%%J%jJ%%%%j%J%kK%jJ%%%%j%%%%%%%%%J%%j%%jJJj%%JJk%jJ%jJJ%%%j%jJKk%K%
-96102a66j%j%J%%j%JJjj%JJ%k%%%j%JKk%JjJ%%%%kjJJJ%%j%%%JJkJjJJ%%kJ%%%%Jjj%%J%
-96143a67j%j%%JKj%Jjj%%J%jJ%%jJ%jJjJj%%%%J%%%J%j%jJj%KjJjJjj%jJ%%%JjJj%JjJJj
$$ y = [-169, -168, -166, -167, -169, -168, -168, -167, -166, -167, -169, -168, -168, -169, -170, -167, -168, -168, -167, -168, -167, -169, -168, -168, -168, -168, -168, -168, -168, -168, -168, -168, -168, -169, -168, -167, -167, -167, -168, -167, -167, -168, -168, -168, -168, -167, -166, -167, -167, -167, -167, -167, -169, -168, -168, -168, -167, -168, -167, -167, -168, -168, -167, -166, -167, -167, -168, -167, -168, -168, -168, -169, -169, -168, -168, -169, -168, -168, -168, -168, -168, -167, -169, -168, -168, -168, -168, -167, -167, -167, -167, -168, -168, -167, -167, -169, -168, -167, -168, -167, -167, -169, -169, -168, -168, -167, -167, -166, -166, -169, -166, -168, -166, -168, -169, -168, -168, -168, -168, -168, -166, -167, -168, -168, -167, -168, -168, -169, -167, -168, -167, -168, -168, -167, -169, -168, -166, -167, -167, -167, -168, -167, -168, -168, -168, -167, -167, -167, -167, -167, -168, -167, -168, -168, -169, -169, -168, -169, -167, -168, -167, -168, -167, -167, -166, -167, -167, -166, -167, -165, -167, -168, -168, -167, -167, -167, -168, -169, -167, -169, -168, -166, -167, -167, -168, -167, -168, -169, -168, -168, -168, -168, -168, -167, -167, -168, -168, -168, -168, -169, -169, -168, -168, -168, -167, -167, -168, -167, -167, -167, -167, -167, -168, -168, -167, -167, -169, -167, -167, -168, -167, -167, -167, -167, -167, -168, -168, -168, -168, -168, -168, -168, -168, -168, -168, -167, -167, -167, -168, -168, -168, -169, -168, -167, -168, -168, -168, -167, -166, -168, -168, -169, -168, -168, -169, -168, -167, -167, -167, -167, -168, -168, -169, -168, -166, -168, -168, -166, -166, -167, -167, -168, -168, -167, -167, -167, -168, -168, -167, -166, -167, -168, -168, -167, -166, -166, -168, -168, -168, -168, -169, -169, -168, -166, -168, -168, -167, -168, -167, -167, -167, -167, -167, -169, -170, -169, -168, -167, -167, -167, -168, -168, -168, -168, -167, -166, -168, -167, -168, -167, -166, -166, -166, -168, -167, -167, -167, -167, -167, -166, -167, -168, -168, -168, -167, -167, -168, -168, -169, -169, -169, -168, -166, -167, -167, -166, -167, -168, -168, -168, -167, -167, -168, -167, -167, -167, -168, -167, -167, -168, -167, -168, -167, -168, -168, -168, -168, -168, -167, -167, -167, -167, -166, -166, -167, -167, -168, -167, -168, -168, -166, -167, -166, -167, -166, -167, -168, -168, -169, -168, -168, -168, -168, -167, -168, -167, -168, -168, -167, -168, -167, -166, -167]
$$ [...]
-118485a4
##END=		$$ NMR SPECTRUM
##END=		$$ LINK
