##TITLE=	WPO6SJa$Rfa9VHxnD8rLzg.10.fid
##JCAMP-DX=	6.0	$$ MestReNova 14.3.3-33362
##DATA TYPE=	LINK
##BLOCKS=	1    
##ORIGIN=	Mestrelab Research S.L.
##OWNER=	hrzepa
##$MNOVA/METADATA=	(DOCUMENT,BASE64)
eyJuYW1lIjoiL1VzZXJzL2hyemVwYS9Eb3dubG9hZHMvSVVQQUMtRkFJUlNwZWMtbWFpbi8zOC1Db21
wbGV4ZXMvMzhpLzM4aS1ILzM4aS1ILm1ub3ZhIiwicGFnZXMiOlt7Iml0ZW1zIjpbIjEiICAgICBdfV
19
##TITLE=	WPO6SJa$Rfa9VHxnD8rLzg.10.fid
##JCAMP-DX=	6.0	$$ MestReNova 14.3.3-33362
##DATA TYPE=	NMR SPECTRUM
##DATA CLASS=	XYDATA
##BLOCK_ID=	1
##ORIGIN=	Bruker BioSpin GmbH
##OWNER=	nmrsu
##NUMDIM=	1
##$MNOVA/METADATA=	(ITEM,BASE64)
eyJhbmdsZSI6MCwiYXhlcyI6eyJ4Ijp7Im1heCI6MTUuNjM3MTcwMDAwMDYyMjUsIm1pbiI6LTQuMTk
0MDIzODY5NDYxMzUzfSwieSI6eyJtYXgiOjM0ODY3NS44MDA3ODEyNSwibWluIjotMzE3NjQuMDk3OT
kxOTQzMzZ9fSwicG9pbnRzIjpbeyJ4Ijo1MzIxLCJ5Ijo1ODM1fSx7IngiOjg3MjIsInkiOjU4MzV9L
HsieCI6ODcyMiwieSI6ODIwOH0seyJ4Ijo1MzIxLCJ5Ijo4MjA4fSx7IngiOjUzMjEsInkiOjU4MzV9
XSwieiI6MH0=
##.OBSERVE FREQUENCY=	700.35432466099996418
##.OBSERVE NUCLEUS=	^1H
##.SOLVENT NAME=	None
##.PULSE SEQUENCE=	zg30
##LONGDATE=	2025/01/08 22:28:15.000
##.ACQUISITIONMODE=	SIMULTANEOUS (DQD)
##$ORIGINAL FORMAT=	Bruker XWIN-NMR
##$MNOVA/SCALES_VERSION=	9
##$PARAMETER FILE=	(acqus, ASCII, /private/var/folders/f6/rjf_tdyn2v98c5c0wvkgn4s80000gq/T/WPO6SJa$Rfa9VHxnD8rLzg/10/acqus, 0)
$$ ##TITLE= Parameter file, TopSpin 4.1.3
$$ ##JCAMPDX= 5.0
$$ ##DATATYPE= Parameter Values
$$ ##NPOINTS= 1	$$ modification sequence number
$$ ##ORIGIN= Bruker BioSpin GmbH
$$ ##OWNER= nmrsu
$$ $$ 2025-01-08 22:27:04.290 +0000  nmrsu@CZC7167VR1
$$ $$ Z:/700/data/tds/nmr/RP482 tBuOAc/10/acqus
$$ $$ process C:\Bruker\TopSpin4.1.3\prog\mod\dirdata.exe
$$ ##$ACQT0= -2.0981556054023
$$ ##$AMP= (0..31)
$$ 100 100 100 100 100 100 100 100 100 100 100 100 100 100 100 100 100 100
$$ 100 100 100 100 100 100 100 100 100 100 100 100 100 100
$$ ##$AMPCOIL= (0..32)
$$ -1 0 0 0 0 0 0 0 0 0 0 0 0 0 0 0 0 0 0 0 0 0 0 0 0 0 0 0 0 0 0 0 0
$$ ##$AQSEQ= 0
$$ ##$AQ_mod= 3
$$ ##$AUNM= <au_zg>
$$ ##$AUTOPOS= <27 >
$$ ##$BF1= 700.349999998
$$ ##$BF2= 700.349999998
$$ ##$BF3= 700.349999998
$$ ##$BF4= 700.349999998
$$ ##$BF5= 700.349999998
$$ ##$BF6= 700.349999998
$$ ##$BF7= 700.349999998
$$ ##$BF8= 700.349999998
$$ ##$BWFAC= (0..63)
$$ 0 0 0 0 0 0 0 0 0 0 0 0 0 0 0 0 0 0 0 0 0 0 0 0 0 0 0 0 0 0 0 0 0 0 0 0
$$ 0 0 0 0 0 0 0 0 0 0 0 0 0 0 0 0 0 0 0 0 0 0 0 0 0 0 0 0
$$ ##$BYTORDA= 0
$$ ##$CHANFCU= (0..24)
$$ 0 1 0 0 0 0 0 0 0 0 0 0 0 0 0 0 0 0 0 0 0 0 0 0 0
$$ ##$CHANREC= (0..24)
$$ 0 0 0 0 0 0 0 0 0 0 0 0 0 0 0 0 0 0 0 0 0 0 0 0 0
$$ ##$CHEMSTR= <none>
$$ ##$CNST= (0..63)
$$ 1 1 1 1 1 1 1 1 1 1 1 1 1 1 1 1 1 1 1 1 1 1 1 1 1 1 1 1 1 1 1 1 1 1 1 1
$$ 1 1 1 1 1 1 1 1 1 1 1 1 1 1 1 1 1 1 1 1 1 1 1 1 1 1 1 1
$$ ##$CPDPRG= (0..8)
$$ <> <> <> <> <> <> <> <> <>
$$ ##$D= (0..63)
$$ 0 1 0 0 0 0 0 0 0 0 0 0 0 0 0 0 0.0002 0 0 0 0 0 0 0 0 0 0 0 0 0 0 0 0
$$ 0 0 0 0 0 0 0 0 0 0 0 0 0 0 0 0 0 0 0 0 0 0 0 0 0 0 0 0 0 0 0
$$ ##$DATE= 1736375295
$$ ##$DATE_START= 1736375253
$$ ##$DE= 6.901845
$$ [...]
$$ ##$ShimPowRng3= (0..63)
$$ 1 1 1 1 1 1 1 1 1 1 1 1 1 1 1 1 1 1 1 1 1 1 1 1 1 1 1 1 1 1 1 1 1 1 1 1
$$ 1 1 1 1 0 0 0 0 0 0 0 0 0 0 0 0 0 0 0 0 0 0 0 0 0 0 0 0
$$ ##$ShimPowType1= 8
$$ ##$ShimPowType2= 8
$$ ##$ShimPowType3= 0
$$ ##$ShimPowType4= 0
$$ ##$ShimPowType5= 0
$$ ##$ShimPowType6= 0
$$ ##$ShimPowType7= 0
$$ ##$ShimPowType8= 0
$$ ##$ShimSysActGrad= (0..63)
$$ 1 2 3 4 13 5 7 11 10 9 6 8 12 18 19 20 21 15 22 23 24 14 25 16 26 17 27
$$ 28 31 32 33 34 35 36 37 38 0 0 0 0 0 0 0 0 0 0 0 0 0 0 0 0 0 0 0 0 0 0
$$ 0 0 0 0 0 0
$$ ##$ShimSysAngle= <>
$$ ##$ShimSysFunc= (0..63)
$$ 1 2 3 4 5 6 7 8 9 10 0 37 38 35 16 15 14 13 12 11 28 27 26 25 24 23 36
$$ 22 30 29 20 21 34 33 32 31 17 18 19 0 0 0 0 0 0 0 0 0 0 0 0 0 0 0 0 0 0
$$ 0 0 0 0 0 0 0
$$ ##$ShimSysMatId= <292722da.dat>
$$ ##$ShimSysMatrix= 1
$$ ##$ShimSysMinMaxUG= 130000
$$ ##$ShimSysOffset= <29 mm>
$$ ##$ShimSysType= 4
$$ ##$ShimUnit= 3
$$ ##$SpectrOsVersion= <4.1.156.20210628>
$$ ##$TCubeEth= <192.168.180.38>
$$ ##$TCubeSeqDevice= <>
$$ ##$TOSITY= <no>
$$ ##$TRIPLO2= 0
$$ ##$TopSpinVersion= <TopSpin 4.1.3>
$$ ##$TrxFreqFormula= (0..23)
$$ <TrxFreqFormula(2.0,700350000.000000,'TRX',Trx(1.0,'TRX 1200.1',1,5.000000,1290.000000))>
$$ <TrxFreqFormula(2.0,700350000.000000,'TRX',Trx(1.0,'TRX 1200.2',1,5.000000,1290.000000))>
$$ <TrxFreqFormula(2.0,700350000.000000,'TRX',Trx(1.0,'TRX 1200.3',1,5.000000,1290.000000))>
$$ <> <> <> <> <> <> <> <> <> <> <> <> <> <> <> <> <> <> <> <> <>
$$ ##$TrxPN= (0..23)
$$ <Z148391> <Z148391> <Z148391> <> <> <> <> <> <> <> <> <> <> <> <> <> <>
$$ <> <> <> <> <> <> <>
$$ ##$TrxSN= (0..23)
$$ <00336> <00337> <00342> <> <> <> <> <> <> <> <> <> <> <> <> <> <> <> <>
$$ <> <> <> <> <>
$$ ##$VCubeEth= (0..23)
$$ <no> <no> <no> <no> <no> <no> <no> <no> <no> <no> <no> <no> <no> <no> <no>
$$ <no> <no> <no> <no> <no> <no> <no> <no> <no>
$$ ##$VTU= 2
$$ ##$VTUETH= <192.168.99.11>
$$ ##$VTUTY= <no>
$$ ##$ValueLine= no
$$ ##$VpuPN= (0..23)
$$ <no> <no> <no> <no> <no> <no> <no> <no> <no> <no> <no> <no> <no> <no> <no>
$$ <no> <no> <no> <no> <no> <no> <no> <no> <no>
$$ ##$VpuSN= (0..23)
$$ <no> <no> <no> <no> <no> <no> <no> <no> <no> <no> <no> <no> <no> <no> <no>
$$ <no> <no> <no> <no> <no> <no> <no> <no> <no>
$$ ##$WBREFAM= (0..31)
$$ 99.8 100 100 100 100 100 100 100 100 100 100 100 100 100 100 100 100 100
$$ 100 100 100 100 100 100 100 100 100 100 100 100 100 100
$$ ##$WBREFLM= (0..31)
$$ 1 0 1 0 0 0 0 0 0 0 0 0 0 0 0 0 0 0 0 0 0 0 0 0 0 0 0 0 0 0 0 0
$$ ##$WBREFPH= (0..31)
$$ 0.05 0 0 0 0 0 0 0 0 0 0 0 0 0 0 0 0 0 0 0 0 0 0 0 0 0 0 0 0 0 0 0
$$ ##$WBSGU= (0..31)
$$ 1 2 4 0 0 0 0 0 0 0 0 0 0 0 0 0 0 0 0 0 0 0 0 0 0 0 0 0 0 0 0 0
$$ ##END=
$$ 
##$DECIM=	1440
##$DSPFVS=	21
##XUNITS=	HZ
##YUNITS=	ARBITRARY UNITS
##FIRSTX=	10951.496976041209564
##LASTX=	-2937.2859490347559586
##DELTAX=	-0.1059638129340278595
##XFACTOR=	1
##YFACTOR=	9.673697050386058649
##FIRSTY=	-66.50389862060546875
##MINY=	-66.50389862060546875
##MAXY=	316978.03125
##NPOINTS=	131072
##XYDATA=	(X++(Y..Y))
$$ [...]
$$ plain form
2638 35 35 35 35 35 35 35 35 35 35 35 35 35 35 35 35 35 35 35 35 35 35 35 35 35 35 35 35 35 35 35 35 35 35 35 35 35 35 35 35 35 35 35 35 35 35 35 35 35 35 35 35 35 35 35 35 35 35 35 35 35 35 35 35 35 35 35 35 35 35 35
2631 35 35 35 35 35 35 35 35 35 35 35 35 35 35 35 35 35 35 35 35 35 35 35 35 35 35 35 35 35 35 35 35 35 35 35 36 36 35 35 35 35 36 36 36 36 36 35 35 35 35 35 35 35 35 35 35 35 35 35 35 36 36 35 35 35 36 36 36 36 36 36
2624 36 36 36 36 36 36 36 36 36 35 35 35 35 35 36 36 36 36 36 36 36 36 36 36 36 36 36 36 36 36 36 36 36 36 36 36 36 36 36 36 36 36 36 36 36 36 36 36 36 36 36 36 36 36 36 36 36 36 36 36 36 36 36 36 36 36 36 36 36 36 36
2616 36 36 36 36 36 36 36 36 36 36 36 36 36 36 36 36 36 36 36 36 36 36 36 36 36 36 36 36 36 36 36 36 36 36 36 36 36 36 36 36 36 36 36 36 36 36 36 36 36 36 36 36 36 36 36 36 36 36 36 36 36 36 36 36 36 36 36 36 36 36 36
2609 36 36 36 36 36 36 36 36 36 36 36 36 36 36 36 36 36 36 36 36 36 36 36 36 36 36 36 36 36 36 36 36 36 36 36 36 36 36 36 36 36 36 36 36 36 36 36 36 36 36 36 36 36 36 36 36 36 36 36 36 36 36 36 36 36 36 36 36 36 36 36
2601 36 36 36 36 36 36 36 36 36 36 36 36 36 36 36 36 36 36 36 36 36 36 36 36 36 36 36 36 36 36 36 36 36 36 36 36 36 36 36 36 36 36 36 36 36 36 36 36 36 36 36 36 36 36 36 36 36 36 36 36 36 36 36 36 36 36 36 36 36 36 36
2594 36 36 36 36 36 36 36 36 36 36 36 36 36 36 36 36 36 36 36 36 36 36 36 36 36 36 36 36 36 36 36 36 36 36 37 37 37 37 36 36 36 36 36 36 36 36 36 36 36 36 36 36 36 36 36 36 36 36 36 36 36 36 36 37 37 37 37 36 36 36 36
2587 36 36 36 36 36 36 37 36 36 36 36 36 36 36 36 36 37 37 37 37 37 37 37 37 37 36 36 36 36 37 37 37 37 36 36 36 37 37 37 37 37 37 37 37 37 36 36 37 37 37 37 37 37 37 37 37 37 37 37 37 37 37 37 37 37 37 37 37 37 37 37
$$ packed form
2638C5%%%%%%%%%%%%%%%%%%%%%%%%%%%%%%%%%%%%%%%%%%%%%%%%%%%%%%%%%%%%%%%%%%%%%%
2631C5%%%%%%%%%%%%%%%%%%%%%%%%%%%%%%%%%%J%j%%%J%%%%j%%%%%%%%%%%%%J%j%%J%%%%%
2624C6%%%%%%%%j%%%%J%%%%%%%%%%%%%%%%%%%%%%%%%%%%%%%%%%%%%%%%%%%%%%%%%%%%%%%%
2616C6%%%%%%%%%%%%%%%%%%%%%%%%%%%%%%%%%%%%%%%%%%%%%%%%%%%%%%%%%%%%%%%%%%%%%%
2609C6%%%%%%%%%%%%%%%%%%%%%%%%%%%%%%%%%%%%%%%%%%%%%%%%%%%%%%%%%%%%%%%%%%%%%%
2601C6%%%%%%%%%%%%%%%%%%%%%%%%%%%%%%%%%%%%%%%%%%%%%%%%%%%%%%%%%%%%%%%%%%%%%%
2594C6%%%%%%%%%%%%%%%%%%%%%%%%%%%%%%%%%J%%%j%%%%%%%%%%%%%%%%%%%%%%%%J%%%j%%%
2587C6%%%%%Jj%%%%%%%%J%%%%%%%%j%%%J%%%j%%J%%%%%%%%j%J%%%%%%%%%%%%%%%%%%%%%%%
$$ plain form
2579 37 37 37 37 37 37 37 37 37 37 37 37 37 37 37 37 37 37 37 37 37 37 37 37 37 37 37 37 37 37 37 37 37 37 37 37 37 37 37 37 37 37 37 37 37 37 37 37 37 37 37 37 37 37 37 37 37 37 37 37 37 37 37 37 37 37 37 37 37 37 37
2572 37 37 37 37 37 37 37 37 37 37 37 37 37 37 37 37 37 37 37 37 37 37 37 37 37 37 37 37 37 37 37 37 37 37 37 37 37 37 37 37 37 37 37 37 37 37 37 37 37 37 37 37 37 37 37 37 37 37 37 37 37 37 37 37 37 37 37 38 38 38 38
2564 38 38 38 38 38 38 38 38 38 38 38 38 38 38 38 38 38 38 38 38 38 38 38 39 39 39 39 39 40 40 40 40 40 40 40 40 40 40 40 40 40 40 40 40 39 39 39 39 39 39 39 39 39 39 39 39 39 39 39 39 39 39 39 39 39 39 39 39 39 39 39
2557 39 39 39 39 39 39 39 39 39 39 39 39 39 39 39 39 39 39 40 40 40 40 40 40 40 40 40 40 41 41 41 41 41 41 41 41 41 42 42 42 41 41 41 41 41 41 41 41 41 41 41 41 41 41 41 41 41 41 41 41 41 41 40 40 40 40 40 40 40 40 40
2549 40 39 39 39 39 39 39 39 39 39 39 39 39 39 39 39 39 39 39 39 39 39 39 39 39 39 39 39 39 39 39 40 40 40 40 40 40 41 41 41 41 41 41 41 41 41 41 41 41 40 40 40 40 40 40 40 40 40 39 39 39 39 39 39 39 39 39 39 39 39 39
2542 39 39 38 38 38 38 38 38 38 38 38 38 38 38 38 38 38 38 38 38 38 38 38 38 38 38 38 38 38 38 38 38 38 38 38 38 38 38 38 38 38 38 38 38 38 38 38 38 38 38 38 38 38 38 38 38 38 38 38 38 38 38 38 38 38 38 38 38 38 38 38
2535 38 38 38 38 38 38 38 38 38 38 38 38 38 38 38 38 38 38 38 38 38 38 38 38 38 38 38 38 38 38 38 38 38 38 38 38 38 38 38 38 38 38 38 38 38 38 38 38 38 38 38 38 38 38 38 38 38 38 38 38 38 38 38 38 38 38 38 38 38 38 38
2527 38 38 38 38 38 38 38 38 38 38 38 38 38 38 38 38 38 38 38 38 38 38 38 38 38 38 38 38 38 38 38 38 38 38 38 38 38 38 38 38 38 38 38 38 38 38 38 38 38 38 38 38 38 38 38 38 38 38 38 38 38 38 38 38 38 38 38 38 38 38 38
$$ packed form
2579C7%%%%%%%%%%%%%%%%%%%%%%%%%%%%%%%%%%%%%%%%%%%%%%%%%%%%%%%%%%%%%%%%%%%%%%
2572C7%%%%%%%%%%%%%%%%%%%%%%%%%%%%%%%%%%%%%%%%%%%%%%%%%%%%%%%%%%%%%%%%%%J%%%
2564C8%%%%%%%%%%%%%%%%%%%%%%J%%%%J%%%%%%%%%%%%%%%j%%%%%%%%%%%%%%%%%%%%%%%%%%
2557C9%%%%%%%%%%%%%%%%%J%%%%%%%%%J%%%%%%%%J%%j%%%%%%%%%%%%%%%%%%%%%j%%%%%%%%
2549D0j%%%%%%%%%%%%%%%%%%%%%%%%%%%%%J%%%%%J%%%%%%%%%%%j%%%%%%%%j%%%%%%%%%%%%
2542C9%j%%%%%%%%%%%%%%%%%%%%%%%%%%%%%%%%%%%%%%%%%%%%%%%%%%%%%%%%%%%%%%%%%%%%
2535C8%%%%%%%%%%%%%%%%%%%%%%%%%%%%%%%%%%%%%%%%%%%%%%%%%%%%%%%%%%%%%%%%%%%%%%
2527C8%%%%%%%%%%%%%%%%%%%%%%%%%%%%%%%%%%%%%%%%%%%%%%%%%%%%%%%%%%%%%%%%%%%%%%
$$ plain form
2520 38 38 38 38 38 38 38 38 38 38 38 38 38 38 38 38 39 38 38 38 38 38 38 38 38 38 38 38 38 38 38 38 38 38 38 38 38 38 38 38 38 38 38 38 38 38 38 38 38 39 39 39 39 39 39 39 39 39 39 39 39 39 39 39 39 39 39 39 39 39 39
2512 39 39 39 39 39 39 39 39 39 39 39 39 39 39 39 39 39 39 39 39 39 39 39 39 39 39 39 39 39 39 39 39 39 39 39 39 39 39 39 39 39 39 39 39 39 39 39 39 39 39 39 39 39 39 39 39 39 39 39 39 39 39 39 39 39 39 39 39 39 39 39
2505 39 39 39 39 39 39 39 39 39 39 39 39 39 39 39 39 39 39 39 39 39 39 39 39 39 39 39 39 39 39 39 39 39 39 39 39 39 39 39 39 39 39 39 39 39 39 39 39 39 39 39 39 39 39 39 39 39 39 39 39 39 39 39 39 39 39 39 39 39 39 39
2497 39 39 39 39 39 39 39 39 39 39 39 39 39 39 39 39 39 39 39 39 39 39 39 39 39 39 39 39 39 39 39 39 39 39 39 39 39 39 39 39 39 39 39 39 39 39 39 39 39 39 39 39 39 39 39 39 39 40 40 40 40 40 40 40 40 40 40 40 40 40 40
2490 40 40 40 40 40 40 40 39 39 39 39 39 39 39 40 40 40 40 40 40 40 40 40 40 40 40 40 40 40 40 40 40 40 40 40 40 40 40 40 40 40 40 40 40 40 40 40 40 40 40 40 40 40 40 40 40 40 40 40 40 40 40 40 40 40 40 40 40 40 40 40
2483 40 40 40 40 40 40 40 40 40 40 40 40 40 40 40 40 40 40 40 40 40 40 40 40 40 40 40 40 40 40 40 40 40 40 40 40 40 40 40 40 40 40 40 40 40 40 40 40 40 40 40 40 40 40 40 40 40 40 40 40 40 40 40 40 40 40 40 40 40 40 40
2475 40 40 40 40 40 40 40 40 40 40 40 40 40 40 40 40 40 40 40 40 40 40 40 40 40 40 40 40 40 40 40 40 40 40 40 40 40 40 40 40 40 40 40 40 40 40 40 40 40 40 40 40 40 40 40 40 40 40 40 40 40 40 40 40 40 40 40 40 40 40 40
2468 40 40 40 40 40 40 40 40 40 40 40 40 40 40 40 40 40 40 40 40 40 40 40 40 40 40 40 40 40 40 40 40 40 40 40 40 40 40 40 40 40 40 40 40 40 40 40 40 40 40 40 40 40 40 40 40 40 40 40 40 40 40 40 40 40 40 40 40 40 40 40
$$ packed form
2520C8%%%%%%%%%%%%%%%Jj%%%%%%%%%%%%%%%%%%%%%%%%%%%%%%%J%%%%%%%%%%%%%%%%%%%%%
2512C9%%%%%%%%%%%%%%%%%%%%%%%%%%%%%%%%%%%%%%%%%%%%%%%%%%%%%%%%%%%%%%%%%%%%%%
2505C9%%%%%%%%%%%%%%%%%%%%%%%%%%%%%%%%%%%%%%%%%%%%%%%%%%%%%%%%%%%%%%%%%%%%%%
2497C9%%%%%%%%%%%%%%%%%%%%%%%%%%%%%%%%%%%%%%%%%%%%%%%%%%%%%%%%J%%%%%%%%%%%%%
2490D0%%%%%%j%%%%%%J%%%%%%%%%%%%%%%%%%%%%%%%%%%%%%%%%%%%%%%%%%%%%%%%%%%%%%%%
2483D0%%%%%%%%%%%%%%%%%%%%%%%%%%%%%%%%%%%%%%%%%%%%%%%%%%%%%%%%%%%%%%%%%%%%%%
2475D0%%%%%%%%%%%%%%%%%%%%%%%%%%%%%%%%%%%%%%%%%%%%%%%%%%%%%%%%%%%%%%%%%%%%%%
2468D0%%%%%%%%%%%%%%%%%%%%%%%%%%%%%%%%%%%%%%%%%%%%%%%%%%%%%%%%%%%%%%%%%%%%%%
$$ plain form
2460 40 40 40 40 40 40 41 41 41 40 40 40 40 40 41 41 41 41 41 41 40 40 40 41 41 41 41 41 41 41 41 41 41 41 41 41 41 41 41 41 41 41 41 41 41 41 41 41 41 41 41 41 41 41 41 41 41 41 41 41 41 41 41 41 41 41 41 41 41 41 41
2453 41 41 41 41 41 41 41 41 41 41 41 41 41 41 41 41 41 41 41 41 41 41 41 41 41 41 41 41 41 41 41 41 41 41 41 41 41 41 41 41 41 41 41 41 41 41 41 41 41 41 41 41 41 41 41 41 41 41 41 41 41 41 41 41 41 41 41 41 41 41 41
2446 41 41 41 41 41 41 41 41 41 41 41 41 41 41 41 41 41 41 41 41 41 41 41 41 41 41 41 41 41 41 41 41 41 41 41 41 41 41 41 41 41 41 42 42 42 42 42 42 42 42 42 42 42 42 42 42 42 42 42 42 42 42 42 43 43 43 43 43 44 44 45
2438 45 45 46 47 48 49 50 51 52 52 52 51 50 50 49 48 47 46 46 45 45 45 45 44 44 44 44 44 44 43 43 43 43 43 43 43 43 43 43 43 43 43 43 43 43 43 43 43 43 43 43 43 44 44 44 44 44 44 45 45 46 46 47 47 48 49 51 52 54 57 60
2431 60 63 67 70 72 74 74 72 69 66 63 60 58 56 55 53 52 51 51 50 49 49 48 48 47 47 47 46 46 46 45 45 45 45 45 45 45 44 44 44 44 44 44 44 44 44 44 44 44 45 45 45 45 45 46 46 46 47 47 48 49 50 51 53 55 58 61 64 67 71 73
2423 73 74 74 73 70 67 64 61 59 57 55 54 53 52 51 50 49 49 48 48 47 47 47 46 46 46 45 45 45 45 45 44 44 44 44 44 44 44 44 44 44 44 44 44 44 44 44 44 44 44 44 44 44 44 44 45 45 45 46 46 47 48 49 50 51 52 53 53 53 53 52
2416 52 51 50 49 48 47 47 46 46 45 45 45 45 45 44 44 44 44 44 43 43 43 43 43 43 43 43 43 43 43 43 43 43 43 43 43 42 42 43 43 43 43 42 42 42 42 42 42 42 42 42 42 42 42 42 42 42 42 42 42 42 42 42 42 42 42 42 42 42 42 42
2408 42 42 42 42 42 42 42 42 42 42 42 42 42 42 42 42 42 42 42 42 42 42 42 42 42 42 42 42 42 42 42 42 42 42 42 42 42 42 42 42 42 42 42 42 42 42 42 42 42 42 42 42 42 42 42 42 42 42 42 42 42 42 42 42 42 42 42 42 42 42 42
$$ packed form
2460D0%%%%%J%%j%%%%J%%%%%j%%J%%%%%%%%%%%%%%%%%%%%%%%%%%%%%%%%%%%%%%%%%%%%%%%
2453D1%%%%%%%%%%%%%%%%%%%%%%%%%%%%%%%%%%%%%%%%%%%%%%%%%%%%%%%%%%%%%%%%%%%%%%
2446D1%%%%%%%%%%%%%%%%%%%%%%%%%%%%%%%%%%%%%%%%%J%%%%%%%%%%%%%%%%%%%%J%%%%J%J
2438D5%JJJJJJJ%%jj%jjjj%j%%%j%%%%%j%%%%%%%%%%%%%%%%%%%%%%J%%%%%J%J%J%JJKJKLL
2431F0LMLKK%kllllkkjkjj%jj%j%j%%j%%j%%%%%%j%%%%%%%%%%%J%%%%J%%J%JJJJKKLLLLMK
2423G3J%jllllkkkjjjjjj%j%j%%j%%j%%%%j%%%%%%%%%%%%%%%%%%%%%%%J%%J%JJJJJJJ%%%j
2416E2jjjjj%j%j%%%%j%%%%j%%%%%%%%%%%%%%%%j%J%%%j%%%%%%%%%%%%%%%%%%%%%%%%%%%%
2408D2%%%%%%%%%%%%%%%%%%%%%%%%%%%%%%%%%%%%%%%%%%%%%%%%%%%%%%%%%%%%%%%%%%%%%%
$$ plain form
2401 42 42 42 42 42 42 42 42 42 42 42 42 42 42 42 42 42 42 42 42 42 42 42 42 42 42 42 42 42 42 42 42 42 42 42 42 42 42 42 42 42 42 42 42 42 42 42 42 42 42 42 42 43 43 43 43 43 43 43 43 43 43 43 43 43 43 43 43 43 43 43
2394 43 42 42 42 42 42 42 42 42 42 43 43 43 43 43 43 43 43 42 42 43 43 43 43 43 43 43 43 43 43 43 43 43 43 43 43 43 43 43 43 43 43 43 43 43 43 43 43 43 43 43 43 43 43 43 43 43 43 43 43 43 43 43 43 43 43 43 43 43 43 43
2386 43 43 43 43 43 43 43 43 43 43 43 43 43 43 43 43 43 43 43 43 43 43 43 43 43 43 43 43 43 43 43 43 43 43 43 43 43 43 43 43 43 43 43 43 43 43 43 43 43 43 43 43 43 43 43 43 43 43 43 43 43 43 43 43 43 43 43 43 43 43 43
2379 43 43 43 43 43 43 43 43 43 43 43 43 43 43 43 43 43 43 43 43 43 43 43 43 43 43 43 43 43 43 43 43 43 43 43 43 43 43 43 43 43 43 43 43 43 43 43 43 43 43 43 43 43 43 43 43 43 44 44 44 44 44 44 43 44 44 44 44 44 44 44
2371 44 44 44 44 44 44 44 44 44 44 44 44 44 44 44 44 44 44 44 44 44 44 44 44 44 44 44 44 44 44 44 44 44 44 44 44 44 44 44 44 44 44 44 44 44 44 44 44 44 44 44 44 44 44 44 44 44 44 44 44 44 44 44 44 44 44 44 44 44 44 44
2364 44 44 44 44 44 44 44 44 44 44 44 44 44 44 44 44 44 44 44 44 44 44 44 44 44 44 44 44 44 44 44 44 44 44 44 44 44 44 44 44 44 44 44 44 44 44 44 44 44 44 44 44 44 44 44 44 44 44 44 44 44 44 44 44 44 44 44 44 44 44 44
2357 44 44 44 44 44 44 44 44 44 44 44 44 44 44 44 44 44 44 44 44 44 44 44 44 44 45 45 44 44 44 44 44 44 44 44 44 44 44 45 45 45 45 45 45 45 45 45 45 45 45 45 45 45 45 45 45 45 45 45 45 45 45 45 45 45 45 45 45 45 45 45
2349 45 45 45 45 45 45 45 45 45 45 45 45 45 45 45 45 45 45 45 45 45 45 45 45 45 45 45 45 45 45 45 45 45 45 45 45 45 45 45 45 45 45 45 45 45 45 45 45 45 45 45 45 45 45 45 45 45 45 45 45 45 45 45 45 45 45 45 45 45 45 45
$$ packed form
2401D2%%%%%%%%%%%%%%%%%%%%%%%%%%%%%%%%%%%%%%%%%%%%%%%%%%%J%%%%%%%%%%%%%%%%%%
2394D3j%%%%%%%%J%%%%%%%j%J%%%%%%%%%%%%%%%%%%%%%%%%%%%%%%%%%%%%%%%%%%%%%%%%%%
2386D3%%%%%%%%%%%%%%%%%%%%%%%%%%%%%%%%%%%%%%%%%%%%%%%%%%%%%%%%%%%%%%%%%%%%%%
2379D3%%%%%%%%%%%%%%%%%%%%%%%%%%%%%%%%%%%%%%%%%%%%%%%%%%%%%%%%J%%%%%jJ%%%%%%
2371D4%%%%%%%%%%%%%%%%%%%%%%%%%%%%%%%%%%%%%%%%%%%%%%%%%%%%%%%%%%%%%%%%%%%%%%
2364D4%%%%%%%%%%%%%%%%%%%%%%%%%%%%%%%%%%%%%%%%%%%%%%%%%%%%%%%%%%%%%%%%%%%%%%
2357D4%%%%%%%%%%%%%%%%%%%%%%%%J%j%%%%%%%%%%J%%%%%%%%%%%%%%%%%%%%%%%%%%%%%%%%
2349D5%%%%%%%%%%%%%%%%%%%%%%%%%%%%%%%%%%%%%%%%%%%%%%%%%%%%%%%%%%%%%%%%%%%%%%
$$ plain form
2342 45 45 45 45 45 45 45 45 45 45 45 45 45 45 45 45 45 45 45 45 45 45 45 45 45 45 45 45 45 45 45 45 45 45 45 45 45 45 45 45 45 45 45 45 45 45 45 45 45 45 45 45 45 45 45 45 45 45 45 45 45 45 45 45 45 45 45 45 45 45 45
2334 45 45 45 45 45 45 45 45 45 45 45 45 45 45 45 45 45 45 45 45 45 45 45 45 45 45 45 45 45 45 45 45 45 45 45 45 45 45 45 45 45 45 45 45 45 45 45 45 45 45 45 45 45 45 46 46 46 46 46 46 46 46 46 46 46 46 46 46 46 46 46
2327 46 46 46 46 46 46 46 46 46 46 46 46 46 46 46 46 46 46 46 46 46 46 46 46 46 46 46 46 46 46 46 46 46 46 46 46 46 46 46 46 46 46 46 46 46 46 46 46 46 46 46 46 46 46 46 46 46 46 46 46 46 46 46 46 46 46 46 46 46 46 46
2319 46 46 46 46 46 46 46 46 46 46 46 46 46 46 46 46 46 46 46 46 46 46 46 46 46 46 46 46 46 46 46 46 46 46 46 46 46 46 46 46 46 46 46 46 46 46 46 46 46 46 46 46 46 46 46 46 46 46 46 46 47 46 46 46 46 46 46 46 46 47 47
2312 47 47 47 47 47 47 46 46 46 47 47 47 46 47 47 47 46 46 46 47 47 47 47 47 47 47 47 47 47 47 47 47 47 47 47 47 47 47 47 47 47 47 47 47 47 47 47 47 47 47 47 47 47 47 47 47 47 47 47 47 47 47 47 47 47 47 47 47 47 47 47
2305 47 47 47 47 47 47 47 47 47 47 47 47 47 47 47 47 47 47 47 47 47 47 47 47 47 47 47 47 47 47 47 47 47 47 47 47 47 47 47 47 47 47 47 47 47 47 47 47 47 47 47 47 47 47 47 47 47 47 47 47 47 47 47 47 47 47 47 47 47 47 47
2297 47 47 47 47 47 47 47 47 47 47 47 47 47 47 47 47 47 47 47 47 47 47 47 47 47 47 47 47 47 47 47 47 47 47 47 47 47 47 47 47 47 47 47 47 47 47 47 47 47 47 47 47 47 47 47 47 47 47 47 47 47 47 47 47 47 47 47 47 47 47 47
2290 47 47 47 47 47 47 47 47 47 47 47 47 47 47 47 47 47 47 47 47 47 47 47 47 47 47 47 47 47 47 47 47 47 47 47 47 47 47 47 47 47 47 47 47 47 47 47 47 47 47 47 47 47 47 48 48 48 48 48 48 48 48 48 48 48 48 48 48 48 48 48
$$ packed form
2342D5%%%%%%%%%%%%%%%%%%%%%%%%%%%%%%%%%%%%%%%%%%%%%%%%%%%%%%%%%%%%%%%%%%%%%%
2334D5%%%%%%%%%%%%%%%%%%%%%%%%%%%%%%%%%%%%%%%%%%%%%%%%%%%%%J%%%%%%%%%%%%%%%%
2327D6%%%%%%%%%%%%%%%%%%%%%%%%%%%%%%%%%%%%%%%%%%%%%%%%%%%%%%%%%%%%%%%%%%%%%%
2319D6%%%%%%%%%%%%%%%%%%%%%%%%%%%%%%%%%%%%%%%%%%%%%%%%%%%%%%%%%%%Jj%%%%%%%J%
2312D7%%%%%j%%J%%jJ%%j%%J%%%%%%%%%%%%%%%%%%%%%%%%%%%%%%%%%%%%%%%%%%%%%%%%%%%
2305D7%%%%%%%%%%%%%%%%%%%%%%%%%%%%%%%%%%%%%%%%%%%%%%%%%%%%%%%%%%%%%%%%%%%%%%
2297D7%%%%%%%%%%%%%%%%%%%%%%%%%%%%%%%%%%%%%%%%%%%%%%%%%%%%%%%%%%%%%%%%%%%%%%
2290D7%%%%%%%%%%%%%%%%%%%%%%%%%%%%%%%%%%%%%%%%%%%%%%%%%%%%%J%%%%%%%%%%%%%%%%
$$ plain form
2282 48 48 48 48 48 48 48 48 48 48 48 48 48 48 48 48 48 48 48 48 48 48 48 48 48 48 48 48 48 48 48 48 48 49 49 49 49 49 49 50 50 50 51 51 52 52 53 53 53 52 52 52 51 51 50 50 50 50 50 50 50 50 49 49 49 49 49 49 49 49 49
2275 49 49 49 49 49 49 49 49 49 49 49 49 49 49 49 49 49 49 49 49 49 49 49 49 49 49 49 49 49 49 49 49 49 49 49 49 49 49 49 49 49 49 49 49 49 49 49 49 49 49 49 49 49 49 49 49 49 49 49 49 49 49 49 49 49 49 49 49 49 49 49
2268 49 49 49 49 49 49 49 49 49 49 49 49 49 49 49 49 49 49 49 49 49 50 50 50 50 50 50 50 50 50 50 50 50 50 50 50 50 50 50 50 50 50 50 50 50 50 50 50 50 50 50 50 50 50 50 50 50 50 50 50 50 50 50 50 50 50 50 50 50 50 50
2260 50 50 50 51 51 51 51 51 51 51 51 51 51 51 51 51 51 51 51 51 51 52 52 52 52 52 52 52 52 52 53 53 53 53 54 54 54 55 55 55 56 57 57 58 59 60 62 63 65 68 71 75 79 84 90 96 102 106 109 111 109 106 102 97 91 87 83 79 76 74 71
2253 71 70 68 67 65 64 63 62 61 60 59 59 58 57 57 56 56 55 55 55 54 54 54 53 53 53 53 53 53 52 52 52 52 52 52 52 52 52 52 51 51 51 51 51 51 51 51 51 51 51 51 51 51 51 51 51 51 51 51 51 51 51 51 51 51 51 51 51 51 50 50
2245 50 50 50 50 50 50 50 50 50 50 50 50 50 50 50 50 50 50 50 50 50 50 50 50 50 50 50 50 50 50 50 50 50 50 50 50 50 50 50 50 50 50 50 50 50 50 50 50 50 50 50 50 50 50 50 50 50 50 50 50 50 50 50 50 50 50 50 50 50 50 50
2238 50 50 50 50 50 50 50 50 50 50 50 50 50 50 50 50 50 50 50 50 50 50 50 50 50 50 50 50 50 50 50 50 50 50 50 50 50 50 50 50 50 50 50 50 50 50 50 50 50 50 50 50 50 50 50 50 50 50 50 50 50 50 50 50 50 50 50 50 50 50 50
2230 50 50 50 50 50 50 50 50 50 50 50 51 51 51 50 51 51 51 51 51 51 51 51 51 51 51 51 51 51 51 51 51 51 51 51 51 51 51 51 51 51 51 51 51 51 51 51 51 51 51 51 51 51 51 51 51 51 51 51 51 51 51 51 51 51 51 51 51 51 51 51
$$ packed form
2282D8%%%%%%%%%%%%%%%%%%%%%%%%%%%%%%%%J%%%%%J%%J%J%J%%j%%j%j%%%%%%%j%%%%%%%%
2275D9%%%%%%%%%%%%%%%%%%%%%%%%%%%%%%%%%%%%%%%%%%%%%%%%%%%%%%%%%%%%%%%%%%%%%%
2268D9%%%%%%%%%%%%%%%%%%%%J%%%%%%%%%%%%%%%%%%%%%%%%%%%%%%%%%%%%%%%%%%%%%%%%%
2260E0%%J%%%%%%%%%%%%%%%%%J%%%%%%%%J%%%J%%J%%JJ%JJJKJKLLMMNOOOMLKklmnommmlkl
2253G1jkjkjjjjjj%jj%j%j%%j%%j%%%%%j%%%%%%%%%j%%%%%%%%%%%%%%%%%%%%%%%%%%%%%j%
2245E0%%%%%%%%%%%%%%%%%%%%%%%%%%%%%%%%%%%%%%%%%%%%%%%%%%%%%%%%%%%%%%%%%%%%%%
2238E0%%%%%%%%%%%%%%%%%%%%%%%%%%%%%%%%%%%%%%%%%%%%%%%%%%%%%%%%%%%%%%%%%%%%%%
2230E0%%%%%%%%%%J%%jJ%%%%%%%%%%%%%%%%%%%%%%%%%%%%%%%%%%%%%%%%%%%%%%%%%%%%%%%
$$ plain form
2223 51 51 51 51 51 51 51 51 51 51 51 51 51 51 51 51 51 51 51 51 51 51 51 51 51 51 51 51 51 51 51 51 51 51 51 51 51 51 51 51 51 51 51 51 51 51 51 51 52 52 52 52 52 52 52 52 52 52 52 52 52 52 52 52 52 52 52 52 52 52 52
2216 52 52 52 52 52 52 52 52 52 52 52 52 52 52 52 52 52 52 52 52 52 52 52 52 52 52 52 52 52 52 52 52 52 52 52 52 52 52 52 52 52 52 52 52 52 52 52 52 52 52 52 52 52 52 52 52 52 52 52 52 52 52 52 52 52 52 52 52 52 52 52
2208 52 52 52 52 52 52 52 52 52 52 52 52 52 52 52 52 52 52 52 52 52 52 52 52 52 52 52 52 52 52 53 52 52 52 52 53 53 53 53 52 52 53 53 53 53 53 53 53 53 53 53 53 53 53 53 53 53 53 53 53 53 53 53 53 53 53 53 53 53 53 53
2201 53 53 53 53 53 53 53 53 53 53 53 53 53 53 53 53 53 53 53 53 53 53 53 53 53 53 53 53 53 53 53 53 53 53 53 53 53 53 53 53 53 53 53 53 53 53 53 53 53 53 53 53 53 53 53 53 53 53 53 53 53 54 54 54 54 54 54 54 54 54 54
2193 54 54 54 54 54 54 54 54 54 54 54 54 54 54 54 54 54 54 54 54 54 54 54 54 54 54 54 54 54 54 54 54 54 54 54 54 54 54 54 54 54 54 54 54 54 54 54 54 55 55 55 55 55 55 55 55 54 54 54 54 54 54 54 54 54 54 54 54 54 54 54
2186 54 54 54 54 54 54 54 54 54 54 54 54 54 54 54 54 54 54 54 54 54 54 54 54 54 54 54 54 54 54 54 54 54 54 54 54 54 54 54 54 54 54 54 54 54 54 54 54 54 54 54 54 54 55 55 55 55 55 55 55 55 55 55 55 55 55 55 55 55 55 55
2179 55 55 55 55 55 55 55 55 55 55 55 55 55 55 55 55 55 55 55 55 55 55 55 55 55 55 55 55 55 55 55 55 55 55 55 55 55 55 55 55 55 55 55 55 55 55 55 55 55 55 55 55 55 55 55 55 55 55 55 55 55 55 55 55 55 55 55 55 55 55 55
2171 55 55 55 55 55 55 55 55 55 55 55 55 55 55 55 55 55 55 55 55 55 55 55 55 55 55 55 55 55 55 55 55 55 55 55 55 55 55 55 55 55 55 55 55 55 55 55 55 56 56 56 56 56 56 56 56 56 56 56 56 56 56 56 56 56 56 56 56 56 56 56
$$ packed form
2223E1%%%%%%%%%%%%%%%%%%%%%%%%%%%%%%%%%%%%%%%%%%%%%%%J%%%%%%%%%%%%%%%%%%%%%%
2216E2%%%%%%%%%%%%%%%%%%%%%%%%%%%%%%%%%%%%%%%%%%%%%%%%%%%%%%%%%%%%%%%%%%%%%%
2208E2%%%%%%%%%%%%%%%%%%%%%%%%%%%%%Jj%%%J%%%j%J%%%%%%%%%%%%%%%%%%%%%%%%%%%%%
2201E3%%%%%%%%%%%%%%%%%%%%%%%%%%%%%%%%%%%%%%%%%%%%%%%%%%%%%%%%%%%%J%%%%%%%%%
2193E4%%%%%%%%%%%%%%%%%%%%%%%%%%%%%%%%%%%%%%%%%%%%%%%J%%%%%%%j%%%%%%%%%%%%%%
2186E4%%%%%%%%%%%%%%%%%%%%%%%%%%%%%%%%%%%%%%%%%%%%%%%%%%%%J%%%%%%%%%%%%%%%%%
2179E5%%%%%%%%%%%%%%%%%%%%%%%%%%%%%%%%%%%%%%%%%%%%%%%%%%%%%%%%%%%%%%%%%%%%%%
2171E5%%%%%%%%%%%%%%%%%%%%%%%%%%%%%%%%%%%%%%%%%%%%%%%J%%%%%%%%%%%%%%%%%%%%%%
$$ plain form
2164 56 56 56 56 56 56 56 56 56 56 56 56 56 56 56 56 56 56 56 56 56 56 56 56 56 56 56 56 56 56 56 56 56 56 56 56 56 56 56 56 56 56 56 56 56 56 56 56 56 56 56 56 56 56 56 56 56 56 56 56 56 56 56 56 56 56 56 56 56 56 56
2156 56 56 56 56 56 56 56 56 56 56 56 56 56 56 56 56 56 56 56 56 56 56 56 56 56 56 56 56 56 56 56 56 56 57 57 57 57 57 57 57 56 57 57 57 57 57 57 57 57 57 57 57 57 57 57 57 57 57 57 57 57 57 57 57 57 57 57 57 57 57 57
2149 57 57 57 57 57 57 57 57 57 57 57 57 57 57 57 57 57 57 57 57 57 57 57 57 57 57 57 57 57 57 57 57 57 57 57 57 57 57 57 57 57 57 57 57 57 57 57 57 57 57 57 57 57 57 57 57 57 57 57 57 57 57 57 57 57 57 57 57 57 57 57
2141 57 57 57 57 57 57 57 57 57 57 57 57 57 57 57 57 57 57 57 57 57 57 57 57 57 57 57 57 58 58 58 58 58 58 58 58 58 58 58 58 58 58 58 58 58 58 58 58 58 58 58 58 58 58 58 58 58 58 58 58 58 58 58 58 58 58 58 58 58 58 58
2134 58 58 58 58 58 58 58 58 58 58 58 58 58 58 58 58 58 58 58 58 58 58 58 58 58 58 58 58 58 58 58 58 58 58 58 58 58 58 58 58 58 58 58 58 58 58 58 58 58 58 58 58 58 58 58 58 58 58 58 58 58 58 58 58 58 58 58 58 58 58 58
2127 58 58 58 58 58 58 58 58 58 58 58 58 58 58 58 58 58 58 58 58 58 58 58 58 58 58 58 58 58 58 58 59 59 59 59 59 59 59 59 59 59 59 59 59 59 59 59 59 59 59 59 59 59 59 59 59 59 59 59 59 59 59 59 59 59 59 59 59 59 59 59
2119 59 59 59 59 59 59 59 59 59 59 59 59 59 59 59 59 59 59 59 59 59 59 59 59 59 59 59 59 59 59 59 59 59 59 59 59 59 59 59 59 59 59 59 59 59 59 59 59 59 59 59 59 59 59 59 59 59 59 59 59 59 59 59 59 59 59 60 60 60 60 60
2112 60 60 60 60 60 60 60 60 60 60 60 60 60 60 60 60 60 60 60 60 60 60 60 60 60 60 60 60 60 60 60 60 60 60 60 60 60 60 60 60 60 60 60 60 60 60 60 60 60 60 60 60 60 60 60 60 60 60 60 60 60 60 60 60 60 60 60 60 60 60 60
$$ packed form
2164E6%%%%%%%%%%%%%%%%%%%%%%%%%%%%%%%%%%%%%%%%%%%%%%%%%%%%%%%%%%%%%%%%%%%%%%
2156E6%%%%%%%%%%%%%%%%%%%%%%%%%%%%%%%%J%%%%%%jJ%%%%%%%%%%%%%%%%%%%%%%%%%%%%%
2149E7%%%%%%%%%%%%%%%%%%%%%%%%%%%%%%%%%%%%%%%%%%%%%%%%%%%%%%%%%%%%%%%%%%%%%%
2141E7%%%%%%%%%%%%%%%%%%%%%%%%%%%J%%%%%%%%%%%%%%%%%%%%%%%%%%%%%%%%%%%%%%%%%%
2134E8%%%%%%%%%%%%%%%%%%%%%%%%%%%%%%%%%%%%%%%%%%%%%%%%%%%%%%%%%%%%%%%%%%%%%%
2127E8%%%%%%%%%%%%%%%%%%%%%%%%%%%%%%J%%%%%%%%%%%%%%%%%%%%%%%%%%%%%%%%%%%%%%%
2119E9%%%%%%%%%%%%%%%%%%%%%%%%%%%%%%%%%%%%%%%%%%%%%%%%%%%%%%%%%%%%%%%%%J%%%%
2112F0%%%%%%%%%%%%%%%%%%%%%%%%%%%%%%%%%%%%%%%%%%%%%%%%%%%%%%%%%%%%%%%%%%%%%%
$$ plain form
2104 60 60 60 60 60 60 60 60 60 60 60 60 60 60 60 60 60 60 60 60 60 60 60 60 60 60 60 60 61 61 61 61 61 61 61 61 61 61 61 61 61 61 61 61 61 61 61 61 61 61 61 61 61 61 61 61 61 61 61 61 61 61 61 61 61 61 61 61 61 61 61
2097 61 61 61 61 61 61 61 61 61 61 61 61 61 61 61 61 61 61 61 61 61 61 61 61 61 61 61 61 61 61 61 61 61 61 61 61 61 61 61 61 61 61 62 62 62 62 62 62 62 62 62 62 62 62 62 62 62 62 62 62 62 62 62 62 62 62 62 62 62 62 62
2090 62 62 62 62 62 62 62 62 62 62 62 62 62 62 62 62 62 62 62 62 62 62 62 62 62 62 62 62 62 62 62 62 62 62 62 62 62 62 62 62 62 62 62 62 62 62 62 62 62 62 62 62 63 63 63 63 63 63 63 63 63 63 63 63 63 63 63 63 63 63 63
2082 63 63 63 63 63 63 63 63 63 63 63 63 63 63 63 63 63 63 63 63 63 63 63 63 63 63 63 63 63 63 63 63 63 63 63 63 63 63 63 63 63 63 63 63 63 63 63 63 63 63 63 63 63 63 63 63 63 63 63 63 63 63 63 63 64 64 64 64 64 64 64
2075 64 64 64 64 64 64 64 64 64 64 64 64 64 64 64 64 64 64 64 64 64 64 64 64 64 64 64 64 64 64 64 64 64 64 64 64 64 64 64 64 64 64 64 64 64 64 64 64 64 64 64 64 64 64 64 64 64 64 64 64 64 64 64 64 64 64 64 65 65 65 65
2067 65 65 65 65 65 65 65 65 65 65 65 65 65 65 64 64 65 65 65 65 65 65 65 65 65 65 65 65 65 65 65 65 65 65 65 65 65 65 65 65 65 65 65 65 65 65 65 65 65 65 65 65 65 65 65 65 65 65 65 65 65 65 65 65 65 65 65 65 65 65 65
2060 65 65 65 65 65 65 65 65 65 65 65 65 65 65 65 65 66 66 66 66 66 66 66 66 66 66 66 66 66 66 66 66 66 66 66 66 66 66 66 66 66 66 66 66 66 66 66 66 66 66 66 66 66 66 66 66 66 66 66 66 66 66 66 66 66 66 66 66 66 66 66
2052 66 66 66 66 66 66 66 66 66 66 66 66 66 66 66 66 66 66 66 66 66 66 66 66 66 66 66 66 66 66 66 66 66 66 66 66 66 67 67 67 67 67 67 67 67 67 67 67 67 67 67 67 67 67 67 67 67 67 67 67 67 67 67 67 67 67 67 67 67 67 67
$$ packed form
2104F0%%%%%%%%%%%%%%%%%%%%%%%%%%%J%%%%%%%%%%%%%%%%%%%%%%%%%%%%%%%%%%%%%%%%%%
2097F1%%%%%%%%%%%%%%%%%%%%%%%%%%%%%%%%%%%%%%%%%J%%%%%%%%%%%%%%%%%%%%%%%%%%%%
2090F2%%%%%%%%%%%%%%%%%%%%%%%%%%%%%%%%%%%%%%%%%%%%%%%%%%%J%%%%%%%%%%%%%%%%%%
2082F3%%%%%%%%%%%%%%%%%%%%%%%%%%%%%%%%%%%%%%%%%%%%%%%%%%%%%%%%%%%%%%%J%%%%%%
2075F4%%%%%%%%%%%%%%%%%%%%%%%%%%%%%%%%%%%%%%%%%%%%%%%%%%%%%%%%%%%%%%%%%%J%%%
2067F5%%%%%%%%%%%%%j%J%%%%%%%%%%%%%%%%%%%%%%%%%%%%%%%%%%%%%%%%%%%%%%%%%%%%%%
2060F5%%%%%%%%%%%%%%%J%%%%%%%%%%%%%%%%%%%%%%%%%%%%%%%%%%%%%%%%%%%%%%%%%%%%%%
2052F6%%%%%%%%%%%%%%%%%%%%%%%%%%%%%%%%%%%%J%%%%%%%%%%%%%%%%%%%%%%%%%%%%%%%%%
$$ plain form
2045 67 67 67 67 67 67 67 67 67 67 67 67 67 67 67 67 67 67 67 67 67 67 67 67 67 67 67 67 67 67 67 67 67 67 67 67 67 67 67 67 67 67 67 67 67 67 67 67 67 67 67 67 67 67 67 67 67 67 67 67 67 67 67 67 67 67 67 67 67 67 67
2038 67 67 67 67 67 67 67 67 67 68 68 68 68 68 68 68 68 68 68 68 68 68 68 68 68 68 68 68 68 68 68 68 68 68 68 68 68 68 68 68 68 68 68 68 68 68 68 68 68 68 68 68 68 68 68 68 68 68 68 68 68 68 68 68 68 68 68 68 68 68 68
2030 68 68 68 68 68 68 68 68 68 69 69 69 69 69 69 69 69 69 69 69 69 69 69 69 69 69 69 69 69 69 69 69 69 69 69 69 69 69 69 69 69 69 69 69 69 69 69 69 69 69 69 70 70 70 70 70 70 70 70 70 70 70 70 70 70 70 70 70 70 70 70
2023 70 70 70 70 70 70 70 70 70 70 70 70 70 70 70 70 70 70 70 70 70 70 70 70 70 70 70 70 70 70 70 70 70 70 70 70 70 70 70 70 70 70 70 70 70 70 70 70 70 70 70 70 70 70 70 70 70 70 70 70 70 70 70 70 70 70 70 70 70 71 71
2015 71 71 71 71 71 71 71 70 71 71 71 71 71 71 71 71 71 71 71 71 71 71 71 71 71 71 71 71 71 71 71 71 71 71 71 71 71 71 71 71 71 71 71 71 71 71 71 71 71 71 71 71 71 71 71 71 71 71 71 71 71 71 71 71 72 72 72 72 72 72 72
2008 72 72 72 72 72 72 72 72 72 72 72 72 72 72 72 72 72 72 72 72 72 72 72 72 72 72 72 72 72 72 72 72 72 72 72 72 72 72 72 72 72 72 72 72 72 72 72 72 72 73 73 73 73 73 73 73 73 73 73 73 73 73 73 73 73 73 73 73 73 73 73
2001 73 73 73 73 73 73 73 73 73 73 73 73 73 73 73 73 73 73 73 73 73 73 73 73 73 73 73 73 73 73 73 73 73 73 73 73 73 73 73 73 73 73 73 74 74 74 74 74 74 74 74 74 74 74 74 74 74 74 74 74 74 74 74 74 74 74 74 74 74 74 74
1993 74 74 74 74 74 74 74 74 74 74 74 74 74 74 74 74 74 74 74 74 74 74 74 74 74 74 74 74 74 74 74 74 74 74 74 74 74 74 74 74 74 74 74 74 74 74 74 74 74 75 75 75 75 75 75 75 75 75 75 75 75 75 75 75 75 75 75 75 75 75 75
$$ packed form
2045F7%%%%%%%%%%%%%%%%%%%%%%%%%%%%%%%%%%%%%%%%%%%%%%%%%%%%%%%%%%%%%%%%%%%%%%
2038F7%%%%%%%%J%%%%%%%%%%%%%%%%%%%%%%%%%%%%%%%%%%%%%%%%%%%%%%%%%%%%%%%%%%%%%
2030F8%%%%%%%%J%%%%%%%%%%%%%%%%%%%%%%%%%%%%%%%%%%%%%%%%%J%%%%%%%%%%%%%%%%%%%
2023G0%%%%%%%%%%%%%%%%%%%%%%%%%%%%%%%%%%%%%%%%%%%%%%%%%%%%%%%%%%%%%%%%%%%%J%
2015G1%%%%%%jJ%%%%%%%%%%%%%%%%%%%%%%%%%%%%%%%%%%%%%%%%%%%%%%%%%%%%%%%J%%%%%%
2008G2%%%%%%%%%%%%%%%%%%%%%%%%%%%%%%%%%%%%%%%%%%%%%%%%J%%%%%%%%%%%%%%%%%%%%%
2001G3%%%%%%%%%%%%%%%%%%%%%%%%%%%%%%%%%%%%%%%%%%J%%%%%%%%%%%%%%%%%%%%%%%%%%%
1993G4%%%%%%%%%%%%%%%%%%%%%%%%%%%%%%%%%%%%%%%%%%%%%%%%J%%%%%%%%%%%%%%%%%%%%%
$$ plain form
1986 75 75 75 75 75 75 75 75 75 75 75 75 75 75 75 75 75 75 75 75 75 75 75 75 75 75 75 75 75 75 75 75 75 75 75 75 75 75 75 75 75 76 76 76 76 76 76 76 76 76 76 76 76 76 76 76 76 76 76 76 76 76 76 76 76 76 76 76 76 76 76
1978 76 76 76 76 76 76 76 76 76 76 76 76 76 76 76 76 76 76 77 77 77 77 77 77 77 77 77 77 77 77 77 77 77 77 77 77 77 77 77 77 77 77 77 77 77 77 77 77 77 77 77 77 77 77 77 77 77 77 77 77 77 77 77 77 78 78 78 78 78 78 78
1971 78 78 78 78 78 78 78 78 78 78 78 78 78 78 78 78 78 78 78 78 78 78 78 78 78 78 78 78 78 78 78 78 78 78 78 78 78 78 78 78 78 78 78 78 78 78 78 78 78 78 78 78 78 78 78 78 78 78 79 79 79 79 79 79 79 79 79 79 79 79 79
1963 79 79 79 79 79 79 79 79 79 79 79 79 79 79 79 79 79 79 79 79 79 79 79 79 79 79 79 79 79 79 79 79 79 79 79 79 79 79 79 79 79 79 79 79 79 79 79 79 79 79 79 79 79 79 79 79 79 79 79 79 79 79 79 79 79 79 79 79 79 80 80
1956 80 80 80 80 80 80 80 80 80 80 80 80 80 80 80 80 80 80 80 80 80 80 80 80 80 80 80 80 80 80 80 80 80 80 80 80 80 80 80 80 80 80 80 80 80 80 81 81 81 81 81 81 81 81 81 81 81 81 81 81 81 81 81 81 81 81 81 81 81 81 81
1949 81 81 81 81 81 81 81 81 81 81 81 81 81 81 81 81 81 81 81 82 82 82 82 82 82 82 82 82 82 82 82 82 82 82 82 82 82 82 82 82 82 82 82 82 82 82 82 82 82 82 82 82 82 82 82 82 82 82 82 83 83 83 83 83 83 83 83 83 83 83 83
1941 83 83 83 83 83 83 83 83 83 83 83 83 83 83 83 83 83 83 83 83 83 83 83 83 83 83 84 84 84 84 84 84 84 84 84 84 84 84 84 84 84 84 84 84 84 84 84 84 84 84 84 84 84 84 84 84 84 84 84 84 84 84 84 84 84 84 84 84 85 85 85
1934 85 85 85 85 85 85 85 85 85 85 85 85 85 85 85 85 85 85 85 85 85 85 85 85 85 85 85 85 85 85 85 85 85 85 85 85 85 85 85 85 85 85 85 85 85 85 85 85 85 85 86 86 86 86 86 86 86 86 86 86 86 86 86 86 86 86 86 86 86 86 86
$$ packed form
1986G5%%%%%%%%%%%%%%%%%%%%%%%%%%%%%%%%%%%%%%%%J%%%%%%%%%%%%%%%%%%%%%%%%%%%%%
1978G6%%%%%%%%%%%%%%%%%J%%%%%%%%%%%%%%%%%%%%%%%%%%%%%%%%%%%%%%%%%%%%%J%%%%%%
1971G8%%%%%%%%%%%%%%%%%%%%%%%%%%%%%%%%%%%%%%%%%%%%%%%%%%%%%%%%%J%%%%%%%%%%%%
1963G9%%%%%%%%%%%%%%%%%%%%%%%%%%%%%%%%%%%%%%%%%%%%%%%%%%%%%%%%%%%%%%%%%%%%J%
1956H0%%%%%%%%%%%%%%%%%%%%%%%%%%%%%%%%%%%%%%%%%%%%%J%%%%%%%%%%%%%%%%%%%%%%%%
1949H1%%%%%%%%%%%%%%%%%%J%%%%%%%%%%%%%%%%%%%%%%%%%%%%%%%%%%%%%%%J%%%%%%%%%%%
1941H3%%%%%%%%%%%%%%%%%%%%%%%%%J%%%%%%%%%%%%%%%%%%%%%%%%%%%%%%%%%%%%%%%%%J%%
1934H5%%%%%%%%%%%%%%%%%%%%%%%%%%%%%%%%%%%%%%%%%%%%%%%%%J%%%%%%%%%%%%%%%%%%%%
$$ plain form
1926 86 86 86 86 86 86 86 86 86 86 86 86 86 86 86 86 86 86 86 86 86 86 86 86 86 86 86 86 87 87 87 87 87 87 87 87 87 87 87 87 87 87 87 87 87 87 87 87 87 87 87 87 87 87 87 87 87 87 87 87 87 87 87 87 87 87 87 87 87 87 87
1919 87 87 87 87 87 87 87 87 87 88 88 88 88 88 88 88 88 88 88 88 88 88 88 88 88 88 88 88 88 88 88 88 88 88 88 88 88 88 88 88 88 88 88 88 88 88 88 88 88 88 88 88 88 88 88 88 88 88 88 88 89 89 89 89 89 89 89 89 89 89 89
1912 89 89 89 89 89 89 89 89 89 89 89 89 89 89 89 89 89 89 89 89 89 89 89 89 89 89 89 89 89 89 89 89 89 89 89 89 89 89 89 89 89 89 89 89 89 89 89 89 89 89 89 89 90 90 90 90 90 90 90 90 90 90 90 90 90 90 90 90 90 90 90
1904 90 90 90 90 90 90 90 90 90 90 90 90 90 90 90 90 90 90 90 90 90 90 90 90 91 91 91 91 91 91 91 91 91 91 91 91 91 91 91 91 91 91 91 91 91 91 91 91 91 91 91 91 91 91 91 91 92 92 92 92 92 92 92 92 92 92 92 92 92 92 92
1897 92 92 92 92 92 92 92 92 92 92 92 92 92 93 93 93 93 93 93 93 93 93 93 93 93 93 93 93 93 93 93 93 93 93 93 93 93 93 93 93 93 93 93 93 93 94 94 94 94 94 94 94 94 94 94 94 94 94 94 94 94 94 94 94 94 94 94 94 94 94 94
1889 94 94 94 94 94 94 94 94 94 94 94 94 94 94 94 94 94 94 94 95 95 95 95 95 95 95 95 95 95 95 95 95 95 95 95 95 95 95 95 95 95 95 95 95 95 95 95 95 95 95 95 95 95 95 95 95 95 95 95 95 95 95 96 95 95 96 96 96 96 96 96
1882 96 96 96 96 96 96 96 96 96 96 96 96 96 96 96 96 96 96 96 96 96 96 96 96 96 96 96 97 97 97 97 97 97 97 97 97 97 97 97 97 97 97 97 97 97 97 97 97 97 97 97 97 97 97 97 97 98 98 98 98 98 98 98 98 98 98 98 98 98 98 98
1874 98 98 98 98 98 98 98 98 98 98 98 98 98 98 98 99 99 99 99 99 99 99 99 99 99 99 99 99 99 99 99 99 99 99 99 99 99 99 99 99 99 99 99 99 99 99 99 99 99 100 100 100 100 100 100 100 100 100 100 100 100 100 100 100 100 100 100 100 100 100 100
$$ packed form
1926H6%%%%%%%%%%%%%%%%%%%%%%%%%%%J%%%%%%%%%%%%%%%%%%%%%%%%%%%%%%%%%%%%%%%%%%
1919H7%%%%%%%%J%%%%%%%%%%%%%%%%%%%%%%%%%%%%%%%%%%%%%%%%%%%%%%%%%%J%%%%%%%%%%
1912H9%%%%%%%%%%%%%%%%%%%%%%%%%%%%%%%%%%%%%%%%%%%%%%%%%%%J%%%%%%%%%%%%%%%%%%
1904I0%%%%%%%%%%%%%%%%%%%%%%%J%%%%%%%%%%%%%%%%%%%%%%%%%%%%%%%J%%%%%%%%%%%%%%
1897I2%%%%%%%%%%%%J%%%%%%%%%%%%%%%%%%%%%%%%%%%%%%%J%%%%%%%%%%%%%%%%%%%%%%%%%
1889I4%%%%%%%%%%%%%%%%%%J%%%%%%%%%%%%%%%%%%%%%%%%%%%%%%%%%%%%%%%%%%Jj%J%%%%%
1882I6%%%%%%%%%%%%%%%%%%%%%%%%%%J%%%%%%%%%%%%%%%%%%%%%%%%%%%%J%%%%%%%%%%%%%%
1874I8%%%%%%%%%%%%%%J%%%%%%%%%%%%%%%%%%%%%%%%%%%%%%%%%J%%%%%%%%%%%%%%%%%%%%%
$$ plain form
1867 100 100 100 100 100 100 100 100 100 100 101 101 101 101 101 101 101 101 101 101 101 101 101 101 101 101 101 101 101 101 101 101 101 101 101 101 101 101 101 101 101 101 101 101 101 101 101 101 101 101 102 102 102 102 102 102 102 102 102 102 102 102 102 102 102 102 102 102 102 102
1860 102 102 102 102 102 102 102 102 102 102 103 103 103 103 103 103 103 103 103 103 103 103 103 103 103 103 103 103 103 103 103 103 103 103 103 103 103 103 104 104 104 104 104 104 104 104 104 104 104 104 104 104 104 104 104 104 104 104 104 105 105 105 105 105 105 105 105 105 105 105
1852 105 105 105 105 105 105 105 105 105 105 105 105 105 105 106 106 106 106 106 106 106 106 106 106 106 106 106 106 106 106 106 106 106 106 107 107 107 107 107 107 107 107 107 107 107 107 107 107 107 107 107 107 107 108 108 108 108 108 108 108 108 108 108 108 108 108 108 108 108 108
1845 108 108 108 108 109 109 109 109 109 109 109 109 109 109 109 109 109 109 109 109 109 109 109 110 110 110 110 110 110 110 110 110 110 110 110 110 110 110 110 110 110 110 111 111 111 111 111 111 111 111 111 111 111 111 111 111 111 111 111 111 111 111 111 111 111 111 112 112 112 112
1838 112 112 112 112 112 112 112 112 112 112 112 112 112 112 112 112 112 112 112 112 112 113 113 113 113 113 113 113 113 113 113 113 113 113 113 113 113 113 113 113 113 113 113 113 113 114 114 114 114 114 114 114 114 114 114 114 114 114 114 114 114 114 114 114 114 114 114 115 115 115
1830 115 115 115 115 115 115 115 115 115 115 115 115 115 115 115 115 115 115 115 115 115 116 116 116 116 116 116 116 116 116 116 116 116 116 116 116 116 116 117 117 117 117 117 117 117 117 117 117 117 117 117 117 117 117 117 117 118 118 118 118 118 118 118 118 118 118 118 118 118 118
1823 118 118 118 118 118 119 119 119 119 119 119 119 119 119 119 119 119 119 119 119 120 120 120 120 120 120 120 120 120 120 120 120 120 120 120 120 121 121 121 121 121 121 121 121 121 121 121 121 121 121 121 122 122 122 122 122 122 122 122 122 122 122 122 122 122 122 123 123 123 123
1816 123 123 123 123 123 123 123 123 123 123 123 124 124 124 124 124 124 124 124 124 124 124 124 124 125 125 125 125 125 125 125 125 125 125 125 125 126 126 126 126 126 126 126 126 126 126 126 126 127 127 127 127 127 127 127 127 127 127 127 127 127 127 127 128 128 128 128 128 128 128
$$ packed form
1867A00%%%%%%%%%J%%%%%%%%%%%%%%%%%%%%%%%%%%%%%%%%%%%%%%%J%%%%%%%%%%%%%%%%%%%
1860A02%%%%%%%%%J%%%%%%%%%%%%%%%%%%%%%%%%%%%J%%%%%%%%%%%%%%%%%%%%J%%%%%%%%%%
1852A05%%%%%%%%%%%%%J%%%%%%%%%%%%%%%%%%%J%%%%%%%%%%%%%%%%%%J%%%%%%%%%%%%%%%%
1845A08%%%J%%%%%%%%%%%%%%%%%%J%%%%%%%%%%%%%%%%%%J%%%%%%%%%%%%%%%%%%%%%%%J%%%
1838A12%%%%%%%%%%%%%%%%%%%%J%%%%%%%%%%%%%%%%%%%%%%%J%%%%%%%%%%%%%%%%%%%%%J%%
1830A15%%%%%%%%%%%%%%%%%%%%J%%%%%%%%%%%%%%%%J%%%%%%%%%%%%%%%%%J%%%%%%%%%%%%%
1823A18%%%%J%%%%%%%%%%%%%%J%%%%%%%%%%%%%%%J%%%%%%%%%%%%%%J%%%%%%%%%%%%%%J%%%
1816A23%%%%%%%%%%J%%%%%%%%%%%%J%%%%%%%%%%%J%%%%%%%%%%%J%%%%%%%%%%%%%%J%%%%%%
$$ plain form
1809 128 128 128 128 128 128 128 128 128 129 129 129 129 129 129 129 129 129 129 129 130 130 130 130 130 130 130 130 130 130 130 130 131 131 131 131 131 131 131 131 131 131 131 131 132 132 132 132 132 132 132 132 132 132 132 132 133 133 133 133 133 133 133 133 133 133 133 134 134 134
1801 134 134 134 134 134 134 134 134 134 135 135 135 135 135 135 135 135 135 135 136 136 136 136 136 136 136 136 136 136 136 137 137 137 137 137 137 137 137 137 138 138 138 138 138 138 138 138 138 139 139 139 139 139 139 139 139 139 140 140 140 140 140 140 140 140 140 141 141 141 141
1794 141 141 141 141 141 141 141 142 142 142 142 142 142 142 142 143 143 143 143 143 143 143 143 143 144 144 144 144 144 144 144 144 145 145 145 145 145 145 145 145 146 146 146 146 146 146 146 147 147 147 147 147 147 147 147 147 148 148 148 148 148 148 148 149 149 149 149 149 149 149
1787 149 149 150 150 150 150 150 150 150 151 151 151 151 151 151 151 151 152 152 152 152 152 152 152 153 153 153 153 153 153 153 154 154 154 154 154 154 154 155 155 155 155 155 155 155 156 156 156 156 156 156 156 157 157 157 157 157 157 157 158 158 158 158 158 158 159 159 159 159 159
1779 159 159 160 160 160 160 160 160 161 161 161 161 161 162 162 162 162 162 162 163 163 163 163 163 164 164 164 164 164 164 165 165 165 165 165 166 166 166 166 166 167 167 167 167 168 168 168 168 168 169 169 169 169 169 170 170 170 170 171 171 171 171 171 172 172 172 172 173 173 173
1772 173 173 173 174 174 174 174 175 175 175 175 176 176 176 176 177 177 177 177 178 178 178 178 179 179 179 180 180 180 180 181 181 181 181 182 182 182 182 183 183 183 184 184 184 184 185 185 185 185 186 186 186 187 187 187 188 188 188 188 189 189 189 190 190 190 190 191 191 191 192
1765 192 192 192 193 193 193 194 194 194 195 195 195 195 196 196 196 197 197 197 198 198 198 199 199 199 200 200 200 201 201 201 202 202 202 203 203 203 204 204 204 205 205 206 206 206 207 207 207 208 208 209 209 209 210 210 210 211 211 212 212 212 213 213 214 214 215 215 215 216 216
1757 216 217 217 218 218 218 219 219 220 220 221 221 222 222 223 223 224 224 225 225 226 226 227 227 228 228 228 229 229 230 230 230 231 231 231 232 232 233 233 234 234 235 235 235 236 236 237 237 238 238 239 239 240 240 241 241 242 242 243 243 243 244 244 245 245 246 246 247 247 248
$$ packed form
1809A28%%%%%%%%J%%%%%%%%%%J%%%%%%%%%%%J%%%%%%%%%%%J%%%%%%%%%%%J%%%%%%%%%%J%%
1801A34%%%%%%%%J%%%%%%%%%J%%%%%%%%%%J%%%%%%%%J%%%%%%%%J%%%%%%%%J%%%%%%%%J%%%
1794A41%%%%%%J%%%%%%%J%%%%%%%%J%%%%%%%J%%%%%%%J%%%%%%J%%%%%%%%J%%%%%%J%%%%%%
1787A49%J%%%%%%J%%%%%%%J%%%%%%J%%%%%%J%%%%%%J%%%%%%J%%%%%%J%%%%%%J%%%%%J%%%%
1779A59%J%%%%%J%%%%J%%%%%J%%%%J%%%%%J%%%%J%%%%J%%%J%%%%J%%%%J%%%J%%%%J%%%J%%
1772A73%%J%%%J%%%J%%%J%%%J%%%J%%J%%%J%%%J%%%J%%J%%%J%%%J%%J%%J%%%J%%J%%%J%%J
1765A92%%J%%J%%J%%%J%%J%%J%%J%%J%%J%%J%%J%%J%%J%J%%J%%J%J%%J%%J%J%%J%J%J%%J%
1757B16J%J%%J%J%J%J%J%J%J%J%J%J%%J%J%%J%%J%J%J%J%%J%J%J%J%J%J%J%J%%J%J%J%J%J
$$ plain form
1750 248 248 249 249 250 250 251 251 252 252 253 253 254 254 255 255 256 256 257 258 258 258 259 259 260 260 261 261 262 262 263 263 264 264 265 265 266 266 267 267 268 268 269 269 270 270 271 271 272 272 273 273 274 274 275 275 276 276 277 277 278 278 278 279 279 280 280 281 281 282
1743 282 282 283 283 283 284 284 285 285 286 286 287 287 288 288 288 289 289 290 290 290 291 291 292 292 292 293 293 294 294 294 295 295 296 296 296 297 297 298 298 298 299 299 299 300 300 300 301 301 301 302 302 302 303 303 303 303 304 304 304 305 305 305 305 306 306 306 306 307 307
1735 307 307 307 308 308 308 308 309 309 309 309 309 309 310 310 310 310 310 310 310 311 311 311 311 311 311 311 311 311 311 312 312 312 312 312 312 312 312 312 312 312 312 312 312 312 312 312 312 312 312 312 312 312 312 312 312 311 311 311 311 311 311 311 311 311 311 310 310 310 310
1728 310 310 310 310 309 309 309 309 309 308 308 308 308 308 308 307 307 307 307 306 306 306 306 305 305 305 305 304 304 304 304 303 303 303 303 302 302 302 301 301 301 300 300 300 300 299 299 299 298 298 298 297 297 297 296 296 296 295 295 295 294 294 294 293 293 293 292 292 292 291
1721 291 291 290 290 290 289 289 289 288 288 287 287 287 286 286 285 285 285 284 284 284 283 283 282 282 282 281 281 280 280 280 279 279 279 278 278 277 277 277 276 276 275 275 275 274 274 273 273 273 272 272 272 271 271 270 270 270 269 269 268 268 268 267 267 267 266 266 266 265 265
1713 265 264 264 264 263 263 263 262 262 262 261 261 260 260 260 259 259 259 258 258 258 257 257 257 256 256 256 255 255 255 254 254 254 253 253 253 252 252 252 251 251 251 250 250 250 249 249 249 248 248 248 248 247 247 247 246 246 246 246 245 245 245 244 244 244 244 243 243 243 243
1706 243 242 242 242 241 241 241 241 240 240 240 240 240 239 239 239 239 238 238 238 238 237 237 237 237 237 236 236 236 236 235 235 235 235 235 235 234 234 234 234 233 233 233 233 233 233 232 232 232 232 232 231 231 231 231 231 231 231 230 230 230 230 230 230 229 229 229 229 229 229
1699 229 228 228 228 228 228 228 228 227 227 227 227 227 227 227 226 226 226 226 226 226 225 225 225 225 225 225 225 225 224 224 224 224 224 224 224 224 223 223 223 223 223 223 223 223 222 222 222 222 222 222 222 222 222 222 222 222 222 222 222 222 221 221 221 221 220 220 220 220 220
$$ packed form
1750B48%J%J%J%J%J%J%J%J%JJ%%J%J%J%J%J%J%J%J%J%J%J%J%J%J%J%J%J%J%J%J%%J%J%J%J
1743B82%J%%J%J%J%J%J%%J%J%%J%J%%J%J%%J%J%%J%J%%J%%J%%J%%J%%J%%%J%%J%%%J%%%J%
1735C07%%J%%%J%%%%%J%%%%%%J%%%%%%%%%J%%%%%%%%%%%%%%%%%%%%%%%%%j%%%%%%%%%j%%%
1728C10%%%j%%%%j%%%%%j%%%j%%%j%%%j%%%j%%%j%%j%%j%%%j%%j%%j%%j%%j%%j%%j%%j%%j
1721B91%j%%j%%j%j%%j%j%%j%%j%j%%j%j%%j%%j%j%%j%j%%j%j%%j%%j%j%%j%j%%j%%j%%j%
1713B65j%%j%%j%%j%j%%j%%j%%j%%j%%j%%j%%j%%j%%j%%j%%j%%j%%%j%%j%%%j%%j%%%j%%%
1706B43j%%j%%%j%%%%j%%%j%%%j%%%%j%%%j%%%%%j%%%j%%%%%j%%%%j%%%%%%j%%%%%j%%%%%
1699B29j%%%%%%j%%%%%%j%%%%%j%%%%%%%j%%%%%%%j%%%%%%%j%%%%%%%%%%%%%%%j%%%j%%%%
$$ plain form
1692 220 220 219 219 219 219 219 219 219 218 218 218 218 218 218 218 218 218 217 217 217 217 217 217 217 217 217 217 216 216 216 216 216 216 216 216 216 216 215 215 215 215 215 215 215 215 215 215 215 215 215 215 215 216 216 216 216 217 217 217 217 217 217 216 216 215 215 215 214 214
1684 214 214 214 214 213 213 213 213 213 213 212 212 212 212 212 212 212 212 212 212 212 212 211 211 211 211 211 211 211 211 211 211 211 211 211 211 211 211 211 211 210 210 210 210 210 210 210 210 210 210 210 210 210 210 210 210 210 210 210 210 209 209 209 209 209 209 209 209 209 209
1677 209 209 209 209 209 209 209 209 209 209 209 209 209 209 209 209 209 209 208 208 208 208 208 208 208 208 208 208 208 208 208 208 208 208 208 208 208 208 208 208 208 208 208 208 208 208 208 208 208 208 208 208 208 208 208 208 208 208 208 208 208 208 208 208 208 208 207 207 207 207
1670 207 207 207 207 208 208 208 208 208 208 208 208 208 208 208 208 208 208 208 208 208 208 208 208 208 208 208 208 208 208 208 208 208 208 208 208 208 208 208 208 208 208 208 208 208 208 208 208 208 208 208 208 208 208 208 208 208 208 208 208 208 208 208 208 208 208 208 208 208 208
1662 208 208 208 208 208 208 208 209 209 209 209 209 209 209 209 209 209 209 209 209 209 209 209 209 209 209 209 209 209 209 209 209 209 209 209 209 209 209 209 209 210 210 210 210 210 210 210 210 210 210 210 210 210 210 210 210 210 210 210 210 210 210 210 210 210 210 210 210 210 210
1655 210 210 211 211 211 211 211 211 211 211 211 211 211 211 211 211 211 211 211 211 211 211 211 211 211 211 211 211 211 212 212 212 212 212 212 212 212 212 212 212 212 212 212 212 212 212 212 212 212 213 213 213 213 213 213 213 213 213 214 214 214 214 214 214 214 214 214 214 214 214
1648 214 214 214 214 215 215 215 215 215 215 215 215 216 216 216 216 216 216 216 216 216 216 217 217 217 217 217 217 217 217 217 217 217 217 217 217 217 217 218 218 218 218 218 218 218 218 219 219 219 219 219 220 220 220 220 220 220 221 221 221 221 221 221 221 222 222 222 222 222 222
1640 222 222 223 223 223 223 223 223 224 224 224 224 224 225 225 225 225 225 225 226 226 226 226 226 226 226 226 226 226 226 226 226 226 226 227 227 227 227 227 227 227 227 227 226 226 226 226 226 226 226 226 226 227 227 227 227 227 227 227 227 228 228 228 229 229 229 229 230 230 230
$$ packed form
1692B20%j%%%%%%j%%%%%%%%j%%%%%%%%%j%%%%%%%%%j%%%%%%%%%%%%%%J%%%J%%%%%j%j%%j%
1684B14%%%j%%%%%j%%%%%%%%%%%j%%%%%%%%%%%%%%%%%j%%%%%%%%%%%%%%%%%%%j%%%%%%%%%
1677B09%%%%%%%%%%%%%%%%%j%%%%%%%%%%%%%%%%%%%%%%%%%%%%%%%%%%%%%%%%%%%%%%%j%%%
1670B07%%%J%%%%%%%%%%%%%%%%%%%%%%%%%%%%%%%%%%%%%%%%%%%%%%%%%%%%%%%%%%%%%%%%%
1662B08%%%%%%J%%%%%%%%%%%%%%%%%%%%%%%%%%%%%%%%J%%%%%%%%%%%%%%%%%%%%%%%%%%%%%
1655B10%J%%%%%%%%%%%%%%%%%%%%%%%%%%J%%%%%%%%%%%%%%%%%%%J%%%%%%%%J%%%%%%%%%%%
1648B14%%%J%%%%%%%J%%%%%%%%%J%%%%%%%%%%%%%%%J%%%%%%%J%%%%J%%%%%J%%%%%%J%%%%%
1640B22%J%%%%%J%%%%J%%%%%J%%%%%%%%%%%%%%J%%%%%%%%j%%%%%%%%J%%%%%%%J%%J%%%J%%
$$ plain form
1633 230 230 230 230 230 230 230 231 231 231 231 231 231 232 232 232 232 232 232 232 232 233 233 233 233 233 233 234 234 234 234 234 235 235 235 235 236 236 236 236 236 237 237 237 238 238 238 238 239 239 240 240 241 241 241 242 242 243 243 244 244 245 245 246 247 248 248 249 250 251
1626 251 252 253 254 255 256 257 259 260 262 264 266 268 270 271 273 275 278 280 283 287 290 295 300 306 312 320 329 341 354 371 391 417 450 491 542 603 673 749 823 889 933 946 924 870 798 723 653 592
1621 592 541 500 468 442 420 402 386 372 360 349 339 330 321 312 305 299 294 289 285 281 277 274 271 269 267 264 263 261 260 259 258 257 256 255 254 253 252 251 250 250 249 248 248 247 247 246 246 245 245 245 245 244 244 244 244 244 244 244
1614 244 244 244 244 244 244 244 244 244 244 244 244 244 244 244 244 244 244 244 244 244 244 244 244 244 244 244 244 244 244 244 244 244 244 244 244 244 244 244 244 245 245 245 245 245 245 245 246 246 246 246 246 246 247 247 247 247 247 247 247 247 248 248 248 248 248 248 248 248 248
1607 248 248 248 248 248 248 248 247 247 247 247 247 247 248 248 248 248 248 248 248 248 247 247 247 247 247 247 247 247 248 248 248 248 248 248 248 249 249 249 249 249 249 250 250 250 250 250 251 251 251 251 251 251 251 252 252 252 252 252 252 253 253 253 253 253 253 254 254 254 254
1600 254 254 255 255 255 255 255 256 256 256 256 256 256 256 256 256 256 257 257 257 257 257 257 257 257 257 257 257 258 258 258 258 258 258 258 259 259 259 259 259 259 260 260 260 260 260 260 261 261 261 261 261 261 261 262 262 262 262 262 262 262 263 263 263 263 263 263 264 264 264
1593 264 264 264 265 265 265 265 265 265 265 265 265 265 266 266 266 266 266 267 267 267 267 267 267 268 268 268 268 268 268 269 269 269 269 269 269 270 270 270 270 270 270 271 271 271 271 271 272 272 272 272 272 272 273 273 273 273 273 274 274 274 274 274 274 274 274 274 275 275 275
1585 275 275 275 275 276 276 276 276 277 277 277 277 277 277 277 277 277 277 278 278 278 278 278 279 279 279 279 279 279 280 280 280 280 281 281 281 281 282 282 282 283 283 284 284 284 284 285 285 285 285 285 285 285 285 286 286 286 286 286 286 286 287 287 287 287 287 288 288 288 288
$$ packed form
1633B30%%%%%%J%%%%%J%%%%%%%J%%%%%J%%%%J%%%J%%%%J%%J%%%J%J%J%%J%J%J%J%JJJ%JJJ
1626B51JJJJJJKJKKKKKJKKLKLMLNNOOQRJ2J3J7K0K6L3M1N1O1P0P6P4O6M4J3k2n4p2p5p0o1
1621E92n1m1l2k6k2j8j6j4j2j1j0rrrponnmmmllkkljkjjjjjjjjjjj%jj%j%j%j%%%j%%%%%%
1614B44%%%%%%%%%%%%%%%%%%%%%%%%%%%%%%%%%%%%%%%J%%%%%%J%%%%%J%%%%%%%J%%%%%%%%
1607B48%%%%%%j%%%%%J%%%%%%%j%%%%%%%J%%%%%%J%%%%%J%%%%J%%%%%%J%%%%%J%%%%%J%%%
1600B54%J%%%%J%%%%%%%%%J%%%%%%%%%%J%%%%%%J%%%%%J%%%%%J%%%%%%J%%%%%%J%%%%%J%%
1593B64%%J%%%%%%%%%J%%%%J%%%%%J%%%%%J%%%%%J%%%%%J%%%%J%%%%%J%%%%J%%%%%%%%J%%
1585B75%%%J%%%J%%%%%%%%%J%%%%J%%%%%J%%%J%%%J%%J%J%%%J%%%%%%%J%%%%%%J%%%%J%%%
$$ plain form
1578 288 289 289 289 289 290 290 290 290 291 291 291 291 292 292 292 293 293 293 293 294 294 294 295 295 296 296 296 297 297 297 298 298 299 299 300 300 301 302 302 303 304 305 306 307 308 309 310 310 311 311 312 312 313 313 314 315 316 317 318 320 321 323 326 328 332 335 340 345 352
1571 352 360 371 385 402 423 449 477 506 533 555 566 562 543 516 486 458 433 413 397 384 375 367 360 355 350 346 342 339 335 332 329 327 325 323 322 321 319 318 318 317 316 316 316 316 316 316 316 316 316 316 316
1565 316 315 315 314 314 313 313 312 312 312 312 312 312 312 312 312 312 312 312 312 312 312 312 312 312 312 313 313 313 313 313 313 314 314 314 314 314 314 314 315 315 315 315 315 316 316 316 316 316 317 317 317 317 317 318 318 318 318 318 319 319 319 320 320 320 321 321 321 322 322
1558 322 322 322 323 323 323 323 323 323 323 324 324 324 325 325 325 325 325 326 326 326 327 327 328 329 329 330 330 330 331 330 330 330 330 330 329 329 330 330 330 330 330 330 330 330 330 331 331 331 331 331 331 332 332 332 332 332 333 333 333 333 334 334 334 334 335 335 335 335 336
1551 336 336 336 336 337 337 337 337 338 338 338 338 339 339 339 339 339 340 340 340 341 341 341 341 342 342 342 342 343 343 343 343 344 344 344 344 345 345 345 345 346 346 346 346 347 347 347 347 348 348 348 348 349 349 349 349 350 350 350 350 351 351 351 352 352 352 352 353 353 353
1543 353 354 354 354 354 355 355 355 356 356 356 356 357 357 357 358 358 358 359 359 359 359 360 360 361 361 361 361 362 362 362 363 363 363 364 364 364 365 365 365 366 366 366 366 366 367 367 367 367 368 368 368 368 369 369 369 370 370 370 370 371 371 371 372 372 372 373 373 373 373
1536 373 374 374 374 375 375 375 375 376 376 376 377 377 377 378 378 378 378 379 379 379 380 380 380 381 381 381 382 382 382 383 383 383 383 384 384 384 385 385 385 386 386 386 387 387 387 388 388 388 388 389 389 389 390 390 391 391 391 391 392 392 392 393 393 393 394 394 394 394 395
1529 395 395 395 396 396 396 397 397 397 398 398 398 399 399 399 400 400 400 401 401 401 402 402 402 403 403 403 403 404 404 404 405 405 406 406 406 407 407 407 408 408 408 409 409 409 410 410 410 411 411 411 412 412 412 413 413 414 414 414 415 415 415 416 416 417 417 417 418 418 418
$$ packed form
1578B88J%%%J%%%J%%%J%%J%%%J%%J%J%%J%%J%J%J%JJ%JJJJJJJJ%J%J%J%JJJJJKJKLKMLNNP
1571C52QJ1J4J7K1K6K8K9K7K2J1mj9k7l0k8k5k0j6j3rqpnnmmlmllkkkjjkj%jj%%%%%%%%%%
1565C16j%j%j%j%%%%%%%%%%%%%%%%%%J%%%%%J%%%%%%J%%%%J%%%%J%%%%J%%%%J%%J%%J%%J%
1558C22%%J%%%%%%J%%J%%%%J%%J%JJ%J%%Jj%%%%j%J%%%%%%%%J%%%%%J%%%%J%%%J%%%J%%%J
1551C36%%%J%%%J%%%J%%%%J%%J%%%J%%%J%%%J%%%J%%%J%%%J%%%J%%%J%%%J%%%J%%J%%%J%%
1543C53J%%%J%%J%%%J%%J%%J%%%J%J%%%J%%J%%J%%J%%J%%%%J%%%J%%%J%%J%%%J%%J%%J%%%
1536C73J%%J%%%J%%J%%J%%%J%%J%%J%%J%%J%%%J%%J%%J%%J%%J%%%J%%J%J%%%J%%J%%J%%%J
1529C95%%J%%J%%J%%J%%J%%J%%J%%J%%%J%%J%J%%J%%J%%J%%J%%J%%J%%J%J%%J%%J%J%%J%%
$$ plain form
1521 418 419 419 419 420 420 421 421 421 422 422 422 423 423 424 424 424 425 425 426 426 426 427 427 428 428 428 429 429 430 430 430 431 431 432 432 433 433 433 434 434 435 435 436 436 436 437 437 438 438 439 439 439 440 440 441 441 442 442 442 443 443 444 444 445 445 446 446 446 447
1514 447 447 448 448 449 449 450 450 450 451 451 452 452 453 453 454 454 454 455 455 456 456 457 457 458 458 459 459 459 460 460 461 461 461 462 462 463 463 464 464 465 465 466 466 466 467 467 468 468 469 469 470 470 470 471 471 472 472 473 473 474 474 475 475 475 476 476 477 477 478
1507 478 478 479 479 479 480 480 481 481 482 482 483 483 484 484 485 485 485 486 486 487 487 488 488 489 490 490 491 491 492 492 493 493 494 495 495 495 496 496 496 497 497 497 498 498 499 499 499 500 500 501 501 502 502 503 503 504 504 504 505 505 506 506 507 507 508 508 509 509 510
1499 510 510 511 511 512 512 513 513 514 514 515 516 516 517 517 518 518 519 519 520 521 521 522 522 523 523 524 524 525 526 526 527 527 528 529 529 530 530 531 532 532 533 534 534 535 535 536 537 537 538 539 539 540 541 541 542 543 543 544 545 545 546 547 547 548 548 549 550 550 551
1492 551 551 552 553 553 554 554 555 556 556 557 558 558 559 560 560 561 562 562 563 564 564 565 566 566 567 568 568 569 570 570 571 572 572 573 574 575 575 576 577 577 578 579 580 580 581 582 582 583 584 584 585 586 586 587 588 588 589 590 590 591 592 592 593 594 594 595 596 596 597
1485 597 597 598 599 599 600 601 601 602 603 603 604 605 606 606 607 608 608 609 610 610 611 612 612 613 614 614 615 616 617 617 618 619 619 620 621 622 622 623 624 625 626 626 627 628 628 629 630 631 632 632 633 634 635 636 637 638 638 639 640 641 642 643 644 645 646 647 648 649 650
1477 650 651 653 653 654 655 655 656 656 656 657 657 658 658 659 660 660 661 662 663 664 665 665 666 667 668 669 669 670 671 672 673 674 675 676 676 677 678 679 680 681 682 683 684 685 686 687 688 689 690 691 691 692 693 694 695 696 697 698 699 700 701 701 702 703 704 705 706 707 708
1470 708 709 710 711 712 713 714 715 716 717 718 718 719 720 721 722 723 724 725 726 727 728 729 730 731 732 733 734 735 736 737 738 739 740 741 742 743 744 745 746 747 748 749 750 751 752 753 754 756 757 758 759 760 761 762 763 764 766 767 768 769 770 771 772 774 775 776 777 778 779
$$ packed form
1521D18J%%J%J%%J%%J%J%%J%J%%J%J%%J%J%%J%J%J%%J%J%J%%J%J%J%%J%J%J%%J%J%J%J%%J
1514D47%J%J%J%%J%J%J%J%%J%J%J%J%J%%J%J%%J%J%J%J%J%%J%J%J%J%%J%J%J%J%J%%J%J%J
1507D78%J%%J%J%J%J%J%J%%J%J%J%JJ%J%J%J%JJ%%J%%J%%J%J%%J%J%J%J%J%%J%J%J%J%J%J
1499E10%J%J%J%J%JJ%J%J%J%JJ%J%J%J%JJ%J%JJ%J%JJ%JJ%J%JJ%JJ%JJ%JJ%JJ%JJ%J%JJ%J
1492E51%JJ%J%JJ%JJ%JJ%JJ%JJ%JJ%JJ%JJ%JJ%JJJ%JJ%JJJ%JJ%JJ%JJ%JJ%JJ%JJ%JJ%JJ%J
1485E97%JJ%JJ%JJ%JJJ%JJ%JJ%JJ%JJ%JJJ%JJ%JJJ%JJJJ%JJ%JJJJ%JJJJJJ%JJJJJJJJJJJJ
1477F50JK%JJ%J%%J%J%JJ%JJJJJ%JJJJ%JJJJJJJ%JJJJJJJJJJJJJJJ%JJJJJJJJJJ%JJJJJJJ
1470G08JJJJJJJJJJ%JJJJJJJJJJJJJJJJJJJJJJJJJJJJJJJJJJJJKJJJJJJJJKJJJJJJKJJJJJ
$$ plain form
1463 779 780 782 783 784 785 786 787 789 790 791 792 793 795 796 797 798 799 800 801 802 803 804 805 806 807 809 810 811 812 813 815 816 817 818 819 821 822 823 825 826 827 828 830 831 832 834 835 836 837 839 840 841 842 844 845 846 847 849 850 851 853 854 855 857 858 860 861 863 864
1456 864 866 867 868 870 871 872 874 875 876 878 879 881 882 884 885 887 888 890 892 893 895 896 898 899 901 902 904 905 907 908 910 911 913 915 916 918 919 921 923 924 926 928 929 931 933 934 936 938 939 941 943 944 946 948 949 951 953 954 956 957 959 960 962 963 965 966 968 970 972
1448 972 973 975 977 978 980 982 983 985 987 989 991 993 995 998 1000 1002 1004 1006 1008 1010 1012 1015 1017 1019 1021 1023 1025 1027 1029 1031 1033 1035 1037 1039 1041 1043 1046 1048 1050 1052 1054 1057 1059 1061 1063 1066 1068 1070 1073 1075 1077 1079 1081 1084 1086 1088 1090 1091 1093 1095 1097 1099 1100 1102 1104 1106 1108 1110 1113
1441 1113 1115 1118 1120 1123 1125 1126 1128 1129 1131 1132 1134 1135 1137 1139 1142 1144 1147 1150 1152 1155 1158 1160 1163 1165 1168 1171 1174 1177 1180 1183 1186 1188 1191 1194 1197 1200 1203 1207 1210 1213 1217 1220 1223 1226 1229 1232 1236 1239 1242 1245 1248 1251 1254 1258 1261 1264 1267 1270 1274 1277 1280 1284 1287 1291 1294 1298 1301 1305
1434 1305 1309 1312 1316 1320 1324 1328 1332 1336 1340 1344 1349 1353 1357 1361 1366 1370 1375 1380 1385 1389 1394 1400 1405 1410 1415 1421 1426 1431 1437 1443 1449 1456 1463 1470 1477 1484 1491 1498 1506 1514 1522 1531 1540 1550 1560 1571 1583 1595 1607 1620 1634 1647 1661 1675 1690 1706
1428 1706 1724 1744 1767 1791 1819 1850 1885 1924 1970 2023 2086 2160 2249 2355 2484 2639 2822 3028 3245 3456 3637 3762 3799 3728 3552 3302 3025 2762
1425 2762 2534 2344 2192 2076 1988 1919 1864 1818 1779 1746 1718 1693 1670 1647 1627 1610 1596 1586 1579 1573 1568 1563 1560 1559 1558 1558 1558 1559 1560 1562 1564 1566 1568 1570 1572 1574 1577 1581 1584 1588 1593 1597 1601 1605 1609 1613
1420 1613 1618 1622 1627 1631 1636 1641 1646 1651 1656 1662 1667 1673 1678 1683 1689 1694 1700 1705 1711 1717 1722 1728 1733 1739 1745 1750 1756 1761 1767 1773 1779 1784 1790 1796 1802 1808 1813 1819 1825 1831 1837 1842 1848 1854 1860 1867 1873 1879 1886 1892 1899 1905 1912 1918 1925 1931 1938 1945 1952 1959 1966 1973 1980 1987 1994 2001 2008 2015
$$ packed form
1463G79JKJJJJJKJJJJKJJJJJJJJJJJJKJJJJKJJJJKJJKJJJKJJKJJJKJJJKJJJKJJKJJKJKJKJ
1456H64KJJKJJKJJKJKJKJKJKKJKJKJKJKJKJKJKKJKJKKJKKJKKJKKJKKJKKJKKJKJKJKJKJKKK
1448I72JKKJKKJKKKKKKLKKKKKKKLKKKKKKKKKKKKKKLKKKKLKKKLKKLKKKKLKKKJKKKKJKKKKKL
1441A113KLKLKJKJKJKJKKLKLLKLLKLKLLLLLLLKLLLLLMLLMLLLLLMLLLLLLMLLLLMLLMLMLMLM
1434A305MLMMMMMMMMNMMMNMNNNMNONNNONNOOOPPPPPPPQQQRRJ0J0J1J2J2J2J3J4J3J4J4J5J6
1428A706J8K0K3K4K8L1L5L9M6N3O3P4Q9J06J29J55J83K06K17K11J81J25L7p1j76k50k77k63
1425B762k28j90j52j16q8o9n5m6l9l3k8k5k3k3k0j7j4j0ponnljj%%JJKKKKKKKLMLMNMMMMM
1420A613NMNMNNNNNONONNONONOONONOONONOOONOOOONOOOONOOOPOOPOPOPOPOPPPPPPPPPPPP
$$ plain form
1413 2015 2022 2029 2037 2044 2051 2057 2064 2071 2078 2086 2093 2100 2108 2115 2122 2129 2136 2143 2150 2157 2164 2171 2178 2185 2193 2201 2209 2217 2224 2232 2240 2248 2255 2263 2270 2278 2286 2294 2302 2311 2319 2328 2336 2345 2354 2363 2373 2382 2391 2401 2410 2420 2429 2439 2449 2459 2468 2478 2488 2498
1406 2498 2508 2518 2528 2539 2549 2560 2571 2581 2592 2603 2614 2625 2637 2648 2660 2671 2683 2695 2708 2720 2733 2746 2759 2773 2787 2802 2817 2833 2850 2867 2884 2902 2919 2935
1403 2935 2951 2966 2979 2991 3002 3012 3022 3030 3038 3045 3051 3057 3062 3067 3072 3078 3086 3094 3104 3114 3125 3137 3150 3163 3176 3190 3203 3217 3232 3246 3260 3275 3290 3304 3319 3334 3350 3365 3381 3396
1399 3396 3412 3428 3444 3461 3477 3493 3510 3527 3544 3561 3579 3597 3614 3633 3651 3669 3688 3706 3725 3744 3763 3782 3801 3820 3839 3859 3878 3898 3918 3939 3959 3980 4001 4022
1395 4022 4044 4065 4087 4109 4130 4153 4175 4197 4220 4243 4266 4289 4313 4337 4361 4385 4409 4434 4459 4484 4509 4535 4561 4587 4613 4640 4667 4694 4722 4749 4777 4805 4833 4861
1391 4861 4889 4918 4946 4975 5005 5034 5065 5095 5126 5158 5189 5222 5254 5287 5319 5353 5386 5420 5454 5488 5523 5558 5594 5630 5666 5703 5740 5777 5815 5853 5891 5929 5968 6007
1388 6007 6047 6087 6128 6169 6210 6252 6294 6337 6380 6424 6468 6513 6558 6603 6650 6696 6743 6791 6839 6887 6936 6986 7035 7086 7137 7189 7241 7294 7347 7401 7456 7511 7567 7623
1384 7623 7680 7737 7795 7854 7913 7974 8035 8096 8158 8221 8284 8349 8414 8480 8546 8614 8682 8751 8821 8892 8964 9037 9110 9185 9260 9337 9414 9493 9572 9653 9734 9816 9899 9983
$$ packed form
1413B015PPQPPOPPPQPPQPPPPPPPPPPPQQQQPQQQPQPQQQQRQRQRRRJ0RRJ0RJ0RJ0J0J0RJ0J0J0
1406B498J0J0J0J1J0J1J1J0J1J1J1J1J2J1J2J1J2J2J3J2J3J3J3J4J4J5J5J6J7J7J7J8J7J6
1403B935J6J5J3J2J1J0J0QQPOONNNOQQJ0J0J1J2J3J3J3J4J3J4J5J4J4J5J5J4J5J5J6J5J6J5
1399C396J6J6J6J7J6J6J7J7J7J7J8J8J7J9J8J8J9J8J9J9J9J9J9J9J9K0J9K0K0K1K0K1K1K1
1395D022K2K1K2K2K1K3K2K2K3K3K3K3K4K4K4K4K4K5K5K5K5K6K6K6K6K7K7K7K8K7K8K8K8K8
1391D861K8K9K8K9L0K9L1L0L1L2L1L3L2L3L2L4L3L4L4L4L5L5L6L6L6L7L7L7L8L8L8L8L9L9
1388F007M0M0M1M1M1M2M2M3M3M4M4M5M5M5M7M6M7M8M8M8M9N0M9N1N1N2N2N3N3N4N5N5N6N6
1384G623N7N7N8N9N9O1O1O1O2O3O3O5O5O6O6O8O8O9P0P1P2P3P3P5P5P7P7P9P9Q1Q1Q2Q3Q4
$$ plain form
1381 9983 10068 10155 10243 10332 10422 10513 10606 10699 10794 10891 10989 11088 11189 11291 11394 11499 11604 11711 11820 11930 12042 12154 12268 12384 12500 12617 12736
1378 12736 12857 12980 13104 13230 13357 13486 13617 13749 13883 14019 14156 14295 14435 14578 14722 14868 15016 15166 15318 15471 15626 15783 15942
1375 15942 16103 16265 16429 16595 16763 16933 17105 17279 17455 17633 17812 17994 18178 18364 18551 18740 18931 19123 19317 19513 19710 19910 20110
1373 20110 20313 20517 20723 20930 21139 21349 21561 21773 21987 22203 22419 22636 22854 23073 23293 23513 23734 23956 24177 24399 24621 24844 25066
1370 25066 25287 25508 25729 25948 26167 26384 26600 26814 27027 27238 27447 27654 27859 28061 28261 28458 28651 28841 29027 29210 29388 29562 29732
1368 29732 29898 30059 30215 30366 30510 30647 30778 30902 31019 31130 31233 31329 31417 31497 31568 31629 31679 31717 31743 31754 31751 31736 31710 31677 31642 31611 31589 31575 31566
1365 31566 31553 31530 31493 31442 31376 31296 31202 31095 30975 30842 30695 30534 30359 30172 29972 29760 29535 29299 29054 28809 28567 28331 28096 27861 27621
1362 27621 27377 27129 26876 26623 26371 26115 25851 25586 25329 25086 24857 24639 24430 24228 24034 23847 23666 23487 23300 23100 22888 22668 22446
$$ packed form
1381I983Q5Q7Q8Q9R0R1R3R3R5R7R8R9J01J02J03J05J05J07J09J10J12J12J14J16J16J17J19
1378A2736J21J23J24J26J27J29J31J32J34J36J37J39J40J43J44J46J48J50J52J53J55J57J59
1375A5942J61J62J64J66J68J70J72J74J76J78J79J82J84J86J87J89J91J92J94J96J97K00K00
1373B0110K03K04K06K07K09K10K12K12K14K16K16K17K18K19K20K20K21K22K21K22K22K23K22
1370B5066K21K21K21K19K19K17K16K14K13K11K09K07K05K02K00J97J93J90J86J83J78J74J70
1368B9732J66J61J56J51J44J37J31J24J17J11J03R6Q8Q0P1O1N0L8K6J1lj5k6l3l5l1k2j4r
1365C1566j3k3l7n1o6q0r4j07j20j33j47j61j75j87k00k12k25k36k45k45k42k36k35k35k40
1362B7621k44k48k53k53k52k56k64k65k57k43k29k18k09k02j94j87j81j79j87k00k12k20k22
$$ plain form
1360 22446 22230 22023 21818 21605 21385 21165 20947 20734 20525 20319 20117 19920 19728 19540 19351 19160 18963 18761 18554 18345 18139 17937 17741
1357 17741 17551 17363 17175 16984 16793 16602 16411 16219 16027 15834 15643 15453 15265 15081 14899 14721 14545 14371 14200 14032 13866 13703 13543
1355 13543 13385 13230 13078 12930 12785 12641 12499 12357 12216 12076 11936 11799 11662 11528 11395 11264 11135 11007 10881 10755 10631 10507 10384
1352 10384 10260 10137 10015 9895 9775 9656 9538 9422 9307 9193 9081 8971 8864 8758 8654 8553 8453 8355 8258 8162 8066 7971 7876 7783 7690
1350 7690 7599 7510 7422 7335 7249 7164 7081 6998 6917 6837 6758 6679 6602 6527 6452 6379 6308 6237 6167 6098 6029 5962 5894 5828 5763 5698 5633 5569 5505 5443 5381 5320 5260 5201
1346 5201 5142 5084 5027 4971 4916 4861 4806 4752 4697 4644 4591 4539 4488 4437 4387 4338 4290 4242 4195 4148 4102 4056 4011 3966 3922 3879 3837 3794 3752 3711 3670 3629 3589 3550
1343 3550 3511 3473 3436 3398 3361 3324 3287 3251 3215 3180 3146 3111 3077 3043 3010 2977 2944 2911 2879 2847 2816 2786 2757 2728 2700 2672 2644 2616 2589 2562 2535 2509 2482 2456
1339 2456 2431 2405 2380 2355 2331 2307 2283 2259 2235 2212 2189 2166 2143 2120 2098 2076 2053 2032 2010 1989 1969 1948 1928 1907 1887 1867 1847 1828 1809 1790 1772 1753 1735 1717
$$ packed form
1360B2446k16k07k05k13k20k20k18k13k09k06k02j97j92j88j89j91j97k02k07k09k06k02j96
1357A7741j90j88j88j91j91j91j91j92j92j93j91j90j88j84j82j78j76j74j71j68j66j63j60
1355A3543j58j55j52j48j45j44j42j42j41j40j40j37j37j34j33j31j29j28j26j26j24j24j23
1352A0384j24j23j22j20j20j19j18j16j15j14j12j10j07j06j04j01j00r8r7r6r6r5r5r3r3
1350G690r1q9q8q7q6q5q3q3q1q0p9p9p7p5p5p3p1p1p0o9o9o7o8o6o5o5o5o4o4o2o2o1o0n9
1346E201n9n8n7n6n5n5n5n4n5n3n3n2n1n1n0m9m8m8m7m7m6m6m5m5m4m3m2m3m2m1m1m1m0l9
1343C550l9l8l7l8l7l7l7l6l6l5l4l5l4l4l3l3l3l3l2l2l1l0k9k9k8k8k8k8k7k7k7k6k7k6
1339B456k5k6k5k5k4k4k4k4k4k3k3k3k3k3k2k2k3k1k2k1k0k1k0k1k0k0k0j9j9j9j8j9j8j8
$$ plain form
1335 1717 1700 1683 1666 1649 1632 1615 1599 1583 1566 1550 1534 1517 1501 1485 1469 1453 1438 1422 1407 1393 1379 1365 1351 1338 1324 1311 1298 1285 1272 1259 1246 1233 1221 1208
1332 1208 1196 1184 1172 1160 1148 1137 1125 1114 1102 1091 1080 1069 1058 1048 1037 1026 1016 1005 995 985 975 965 956 946 936 927 918 908 899 890 881 873 864 855 846 838 829 820 812 804 795 787 779
1327 779 771 764 756 749 741 734 726 719 711 704 697 690 683 676 669 662 655 649 642 636 629 623 617 611 605 599 593 587 581 576 570 564 558 553 547 542 536 531 526 520 515 510 504 499 494 489 484 480 475 470 466 461 456 452 447 443 439 434 430 426 421 417 413 409 404 400 396 392 388
1320 388 384 380 376 372 368 364 361 357 353 349 345 342 338 335 331 328 325 322 319 316 313 310 307 304 301 298 295 292 289 286 283 280 277 275 272 269 266 264 261 259 256 253 251 248 246 243 241 239 236 234 232 230 228 225 223 221 219 217 215 212 210 208 206 203 201 198 196 193 191
1313 191 188 186 184 182 180 179 177 175 173 171 168 165 162 160 157 154 152 150 147 145 144 142 140 138 136 135 133 131 129 127 126 124 123 121 120 118 117 115 114 113 112 111 109 108 107 106 105 104 103 102 100 99 98 97 96 95 93 92 91 90 89 87 86 85 84 83 82 81 79
1305 79 78 77 76 75 74 73 73 72 71 70 69 68 67 66 66 65 64 63 63 62 61 61 60 60 59 59 58 58 57 57 56 56 55 55 55 56 56 56 56 57 57 57 57 58 59 60 61 63 65 67 70 73 76 79 81 84 86 89 93 97 102 109 117 127 139 153 171
1298 171 193 221 257 303 362 440 542 674 842 1043 1271 1512 1743 1935 2055 2077 2002 1853 1669 1482 1308 1154 1025 919 833 762 702
1295 702 649 603 563 528 495 464 434 406 380 358 339 322 306 292 279 268 257 248 239 230 222 214 206 199 191 184 176 169 162 155 149 143 138 132 127 121 116 111 107 102 98 94 91 88 85 82 80 77 75 73 71 69
$$ packed form
1335A717j7j7j7j7j7j7j6j6j7j6j6j7j6j6j6j6j5j6j5j4j4j4j4j3j4j3j3j3j3j3j3j3j2j3
1332A208j2j2j2j2j2j1j2j1j2j1j1j1j1j0j1j1j0j1j0j0j0j0rj0j0rrj0rrrqrrrqrrqqrqq
1327G79qpqpqpqpqppppppppopopoooooooonooonononnonnonnnnmnnmnnmnmmnmmnmmmnmmmm
1320C88mmmmmmlmmmmlmlmllllllllllllllllllklllklkllklklkklkkkklkkkkklkkklklklk
1313A91lkkkkjkkkklllkllkklkjkkkkjkkkkjkjkjkjkjjjjkjjjjjjjkjjjjjkjjjjkjjjjjjk
1305G9jjjjjj%jjjjjjj%jjj%jj%j%j%j%j%j%j%%J%%%J%%%JJJJKKKLLLLKLKLMMNPQJ0J2J4J8
1298A71K2K8L6M6N9P8J02J32J68K01K28K41K31J92J20K2p5j49j84j87j74j54j29j06q6p1o0
1295G02n3m6m0l5l3l1l0k8k6k2j9j7j6j4j3j1j1rrrqqqpqpqpppoonononnmnmmllllklkkkk
$$ plain form
1290 69 68 66 64 63 61 60 59 57 56 55 54 53 52 51 50 49 48 47 46 45 45 44 43 42 41 41 40 39 38 37 37 36 36 35 35 34 34 34 33 33 33 32 32 32 32 32 32 32 32 33 33 33 33 33 33 33 34 34 34 34 34 34 34 34 35 35 36 37 37 38
1282 38 39 39 40 42 44 46 49 53 58 64 71 77 83 87 90 93 95 98 100 103 106 109 110 111 112 112 111 110 109 107 105 104 102 101 99 95 91 86 80 74 68 63 59 55 52 49 47 45 43 42 41 39 38 37 36 35 34 34 33 33 32 32 31 31 31 31 31 31 31 31
1275 31 31 31 31 31 31 31 31 31 31 31 31 31 31 31 31 31 31 31 31 31 31 31 31 31 31 31 31 31 31 32 32 32 33 33 33 33 34 34 34 35 35 35 35 35 36 36 36 37 37 37 38 38 38 38 38 39 39 39 40 40 41 41 41 42 43 43 44 44 44 45
1268 45 45 45 45 45 45 46 46 46 47 47 47 48 48 49 49 49 49 50 50 50 51 51 52 52 52 52 53 53 53 53 53 54 54 55 55 55 56 56 57 57 58 58 58 58 59 59 59 59 60 60 60 61 62 62 63 63 64 64 64 65 65 66 66 67 68 68 69 70 71 72
1260 72 72 73 74 74 75 76 76 77 78 78 79 80 81 82 83 83 84 85 85 86 87 87 88 89 90 91 92 92 93 93 94 94 95 95 96 97 97 98 99 99 99 99 99 99 99 100 100 101 102 103 104 105 105 106 106 106 107 108 109 110 111 113 114 116 117 118 119 121 122 123
1253 123 125 126 128 129 131 132 134 135 137 139 140 142 144 146 148 150 152 154 156 157 159 161 162 164 166 168 169 171 172 173 174 174 175 176 176 177 178 180 181 182 182 182 182 180 179 177 176 176 176 176 177 177 177 176 175 174 172 171 169 169 168 168 169 169 170 171 172 173 173
1245 173 173 174 174 175 176 178 180 182 185 188 190 193 195 198 200 203 207 210 214 218 221 225 228 232 235 239 242 247 251 256 261 266 272 278 285 293 302 312 323 335 348 360 373 384 393 401 406 410 413 416 419 423 428 435 442 450 457 462 466 467 467 465
1239 465 462 460 458 457 458 461 465 471 477 484 492 501 510 520 532 545 559 575 593 612 633 655 679 706 734 765 797 832 868 906 946 991 1040 1094 1156 1224 1300 1384 1476 1578 1692
$$ packed form
1290F9jkkjkjjkjjjjjjjjjjjj%jjjj%jjjj%j%j%j%%j%%j%%%%%%%J%%%%%%J%%%%%%%J%JJ%J
1282C8J%JKKKLMNOPOOMLLKLKLLLJJJ%jjjkkjkjkmmnooonmmllkkkjjkjjjjj%j%j%j%%%%%%%
1275C1%%%%%%%%%%%%%%%%%%%%%%%%%%%%%J%%J%%%J%%J%%%%J%%J%%J%%%%J%%J%J%%JJ%J%%J
1268D5%%%%%J%%J%%J%J%%%J%%J%J%%%J%%%%J%J%%J%J%J%%%J%%%J%%JJ%J%J%%J%J%JJ%JJJJ
1260G2%JJ%JJ%JJ%JJJJJ%JJ%JJ%JJJJJ%J%J%J%JJ%JJ%%%%%%J%JJJJJ%J%%JJJJJKJKJJJKJJ
1253A23KJKJKJKJKKJKKKKKKKKJKKJKKKJKJJJ%JJ%JJKJJ%%%kjkj%%%J%%jjjkjk%j%J%JJJJ%
1245A73%J%JJKKKLLKLKLKLMLMMLMLMLMLNMNNNOOPQRJ0J1J2J3J2J3J1RQNMLLLMNPPQPNMJ%k
1239D65lkkjJLMOOPQRRJ0J2J3J4J6J8J9K1K2K4K7K8L1L2L5L6L8M0M5M9N4O2O8P6Q4R2J02J14
$$ plain form
1235 1692 1824 1980 2166 2390 2661 2985 3361 3778 4217 4649 5041 5353 5553 5638 5640 5629 5678 5833 6095 6433 6801 7135 7366 7433 7314
1232 7314 7026 6633 6224 5870 5603 5431 5347 5322 5310 5254 5111 4866 4537 4165 3795 3448 3129 2844 2597 2386 2205 2048 1909 1784
1229 1784 1671 1569 1476 1389 1306 1227 1153 1085 1023 966 912 862 817 776 739 705 673 643 614 587 562 537 514 493 473 455 439 424 411 398 387 377 367
1226 367 357 348 340 333 326 319 312 306 301 296 291 287 283 279 276 273 269 266 263 260 257 255 252 250 248 246 244 242 240 238 236 235 233 232 230 229 228 227 227 226 226 226 226 226 226 226 225 226 226 226 227 229 230 230 231 231 232 232 232 233 234 235 236 237 237 237 236 235
1219 235 234 233 232 232 232 232 232 232 231 230 228 226 224 221 218 216 215 214 213 213 212 211 210 208 206 203 201 199 198 197 197 197 197 197 197 197 197 197 197 196 196 197 197 198 198 199 201 202 203 204 204 205 206 207 208 210 211 213 214 216 217 218 220 221 223 224 226 227 229
1211 229 230 232 233 234 235 237 238 239 241 243 244 245 247 247 248 248 249 249 250 251 252 253 254 255 256 256 256 257 257 257 258 258 259 260 261 262 263 264 265 265 266 267 268 269 269 271 272 273 274 275 276 277 278 279 280 282 283 284 285 287 288 290 291 292 294 295 296 297 298
1204 298 299 300 301 303 304 306 307 309 310 311 312 313 314 315 316 317 318 319 321 322 323 324 325 326 327 328 329 330 331 332 334 335 336 337 338 339 340 342 343 345 346 347 348 349 350 352 353 354 355 357 358 360 361 363 364 365 366 368 369 370 372 373 375 376 378 380 381 383 385
1197 385 386 388 390 392 394 395 397 400 402 404 407 409 412 416 420 424 428 434 440 447 455 464 474 484 494 504 512 518 523 525 525 525 524 523 523 524 526 530 533 537 539 539 538 534 529 522 514 506 498 491 486 481 477 474 471 470 468 467 467 466 466 466 466 466 466
$$ packed form
1235A692J32J56J86K24K71L24L76M17M39M32L92L12K00Q5Kj1M9J55K62L38L68L34K31O7j19
1232G314k88l93m09l54k67j72q4k5j2n6j43k45l29l72l70l47l19k85k47k11j81j57j39j25
1229A784j13j02r3q7q3p9p4o8o2n7n4n0m5m1l7l4l2l0k9k7k5k5k3k1k0j8j6j5j3j3j1j0j0
1226C67j0rqpppponnnmmmllmllllklkkkkkkkkjkjkjjj%j%%%%%%jJ%%JKJ%J%J%%JJJJJ%%jj
1219B35jjj%%%%%jjkkkllkjjj%jjjkklkkjj%%%%%%%%%j%J%J%JKJJJ%JJJJKJKJKJJKJKJKJK
1211B29JKJJJKJJKKJJK%J%J%JJJJJJJ%%J%%J%JJJJJJJ%JJJJ%KJJJJJJJJJKJJJKJKJJKJJJJ
1204B98JJJKJKJKJJJJJJJJJJKJJJJJJJJJJJKJJJJJJKJKJJJJJKJJJKJKJKJJJKJJKJKJKKJKK
1197C85JKKKKJKLKKLKLMMMMOOPQRJ0J0J0J0QONK%%jj%JKMLMK%jmnpqqqpnnmlljkj%j%%%%%
$$ plain form
1190 466 466 467 467 468 469 470 471 472 472 473 474 476 477 478 479 480 481 482 484 485 486 488 489 490 492 493 494 496 497 499 500 501 503 504 505 507 508 510 511 513 514 516 517 519 520 522 523 525 526 528 529 531 533 534 536 537 539 540 542 543 545 547 548 550 551 553 554 556 558
1182 558 559 561 562 564 566 567 569 570 572 573 575 577 578 580 582 583 585 587 588 590 592 594 595 597 599 600 602 604 606 607 609 611 612 614 616 618 619 621 623 625 626 628 630 632 634 635 637 639 641 642 644 646 648 650 652 653 655 657 659 661 662 664 666 668 670 672 674 676 677
1175 677 679 681 683 685 687 689 691 693 695 697 699 701 703 705 707 709 711 713 715 717 719 721 723 726 728 730 732 734 737 739 741 743 746 748 750 753 755 758 760 763 765 768 771 773 777 780 783 787 791 795 799 803 807 812 816 820 823 827 831 834 838 841 844 847 850 852 854 856 857
1168 857 858 858 859 860 861 861 862 863 863 863 864 864 864 864 864 864 865 865 867 868 869 871 872 874 876 878 880 882 884 886 888 891 893 895 897 900 902 904 907 909 912 914 917 919 921 924 926 929 931 934 937 939 942 944 947 950 952 955 958 961 963 966 969 971 974 976 979 981 983
1161 983 986 988 991 994 996 999 1001 1004 1007 1009 1012 1015 1017 1020 1023 1026 1028 1031 1034 1037 1040 1043 1045 1048 1051 1054 1057 1060 1063 1066 1069 1071 1074 1077 1080 1083 1086 1089 1092 1095 1098 1101 1105 1108 1111 1114 1117 1120 1123 1126 1129 1132 1136 1139 1142 1145 1148 1152 1155 1158 1161 1164 1168 1171 1174 1177 1181 1184 1187
1153 1187 1190 1193 1196 1200 1203 1206 1210 1213 1216 1219 1223 1226 1230 1233 1236 1240 1243 1247 1250 1254 1257 1261 1264 1268 1271 1275 1279 1282 1286 1290 1293 1297 1301 1305 1308 1312 1316 1319 1323 1327 1331 1334 1338 1342 1346 1349 1353 1357 1361 1365 1368 1372 1376 1380 1384 1388 1392 1396 1400 1404 1408 1412 1416 1420 1424 1428 1432 1436
1146 1436 1440 1444 1448 1452 1456 1460 1465 1469 1473 1477 1481 1485 1490 1494 1498 1502 1507 1511 1515 1520 1524 1528 1533 1537 1541 1546 1550 1555 1559 1564 1568 1573 1577 1582 1587 1591 1596 1601 1605 1610 1615 1619 1624 1629 1633 1638 1643 1648 1653 1657 1662 1667 1672 1677 1682 1687 1692 1696 1701 1706 1711 1716 1721 1727 1732 1737 1742 1747
1139 1747 1752 1757 1763 1768 1773 1778 1784 1789 1794 1799 1805 1810 1815 1821 1826 1831 1837 1842 1848 1853 1859 1864 1870 1876 1881 1887 1892 1898 1904 1910 1915 1921 1927 1933 1938 1944 1950 1956 1962 1968 1974 1980 1986 1992 1998 2004 2010 2016 2022 2028 2035 2041 2047 2053 2060 2066 2072 2079 2085 2092 2098 2105 2111 2118 2124 2131 2137 2144
$$ packed form
1190D66%J%JJJJJ%JJKJJJJJJKJJKJJKJJKJKJJKJJKJKJKJKJKJKJKJKJKKJKJKJKJKKJKJKJKK
1182E58JKJKKJKJKJKKJKKJKKJKKKJKKJKKKJKKJKKKJKKKJKKKKJKKKJKKKKKJKKKKJKKKKKKKJ
1175F77KKKKKKKKKKKKKKKKKKKKKKKLKKKKLKKKLKKLKLKLKLLKMLLMMMMMMNMMLMMLMLLLLKKKJ
1168H57J%JJJ%JJ%%J%%%%%J%KJJKJKKKKKKKKLKKKLKKLKLKLKKLKLKLLKLKLLKLLLKLLKLKLKK
1161I83LKLLKLKLLKLLKLLLKLLLLLKLLLLLLLLKLLLLLLLLLLMLLLLLLLLLMLLLLMLLLLMLLLMLL
1153A187LLLMLLMLLLMLMLLMLMLMLMLMLMMLMMLMMMLMMLMMMLMMMLMMMMLMMMMMMMMMMMMMMMMM
1146A436MMMMMMNMMMMMNMMMNMMNMMNMMNMNMNMNMNNMNNMNNMNNMNNNNMNNNNNNNMNNNNNONNNN
1139A747NNONNNONNNONNONNONONONOONONOOONOOONOOOOOOOOOOOOOOOPOOOPOOPOPOPOPOPOP
$$ plain form
1132 2144 2151 2157 2164 2171 2178 2184 2191 2198 2205 2213 2220 2227 2234 2241 2248 2255 2263 2270 2277 2284 2291 2298 2306 2313 2320 2327 2335 2342 2350 2357 2364 2372 2379 2387 2395 2402 2410 2418 2425 2433 2441 2449 2457 2465 2473 2481 2488 2496 2504 2512 2520 2528 2536 2544 2552 2560 2568 2576 2585 2593 2601 2610 2618 2626 2635 2644 2653 2661
1124 2661 2670 2679 2689 2698 2707 2716 2726 2735 2745 2755 2764 2774 2784 2793 2803 2813 2822 2832 2842 2851 2861 2871 2881 2890 2900 2910 2920 2930 2941 2951 2961 2971 2982 2992 3002 3013 3023 3034 3045 3055
1120 3055 3066 3077 3087 3098 3108 3119 3129 3140 3150 3161 3171 3181 3192 3202 3213 3223 3234 3244 3255 3266 3276 3287 3298 3309 3320 3331 3342 3353 3364 3375 3387 3398 3409 3421
1117 3421 3432 3444 3456 3468 3481 3493 3506 3519 3532 3546 3560 3573 3587 3601 3616 3630 3645 3659 3674 3689 3704 3720 3735 3750 3766 3782 3797 3813 3829 3845 3861 3877 3893 3910
1113 3910 3926 3942 3958 3975 3991 4008 4025 4041 4058 4075 4092 4110 4127 4144 4162 4180 4198 4216 4234 4253 4272 4291 4310 4329 4349 4369 4389 4409 4430 4451 4472 4493 4515 4536
1109 4536 4559 4581 4604 4627 4650 4674 4698 4723 4748 4773 4799 4825 4852 4879 4906 4934 4963 4992 5022 5053 5084 5117 5149 5183 5218 5254 5290 5328 5367 5407 5449 5493 5538 5585
1106 5585 5634 5685 5739 5796 5856 5919 5986 6057 6132 6213 6298 6389 6486 6590 6703 6824 6955 7098 7253 7422 7603 7796 8000 8209 8419 8624 8815
1103 8815 8985 9126 9232 9296 9314 9283 9204 9080 8913 8705 8463 8196 7912 7617 7318 7023 6742 6480 6241 6028 5842 5684 5553 5446
$$ packed form
1132B144POPPPOPPPQPPPPPPQPPPPPQPPPQPQPPQPQQPQQPQQQQQQQPQQQQQQQQQQQRQQRQQRRRQ
1124B661RRJ0RRRJ0RJ0J0RJ0J0RJ0J0RJ0J0RJ0J0J0RJ0J0J0J0J1J0J0J0J1J0J0J1J0J1J1J0
1120C055J1J1J0J1J0J1J0J1J0J1J0J0J1J0J1J0J1J0J1J1J0J1J1J1J1J1J1J1J1J1J2J1J1J2
1117C421J1J2J2J2J3J2J3J3J3J4J4J3J4J4J5J4J5J4J5J5J5J6J5J5J6J6J5J6J6J6J6J6J6J7
1113C910J6J6J6J7J6J7J7J6J7J7J7J8J7J7J8J8J8J8J8J9J9J9J9J9K0K0K0K0K1K1K1K1K2K1
1109D536K3K2K3K3K3K4K4K5K5K5K6K6K7K7K7K8K9K9L0L1L1L3L2L4L5L6L6L8L9M0M2M4M5M7
1106E585M9N1N4N7O0O3O7P1P5Q1Q5R1R7J04J13J21J31J43J55J69J81J93K04K09K10K05J91
1103H815J70J41J06O4J8l1p9j24j67k08k42k67k84k95k99k95k81k62k39k13j86j58j31j07
$$ plain form
1100 5446 5361 5294 5243 5206 5179 5161 5150 5145 5145 5148 5155 5166 5178 5194 5211 5230 5251 5274 5299 5325 5352 5380 5410 5441 5472 5504 5536 5569 5602 5635 5668 5701 5735 5768 5801 5835
1097 5835 5868 5902 5935 5969 6002 6036 6070 6103 6137 6171 6205 6239 6273 6306 6340 6374 6408 6442 6476 6510 6544 6577 6611 6645 6679 6713 6747 6781 6814 6848 6882 6917 6951 6985
1093 6985 7019 7054 7088 7123 7158 7193 7228 7263 7299 7334 7370 7406 7442 7478 7515 7552 7588 7625 7663 7700 7737 7775 7813 7850 7888 7926 7965 8003 8041 8080 8118 8157 8195 8234
1089 8234 8273 8312 8351 8390 8429 8468 8507 8547 8586 8626 8665 8705 8744 8784 8824 8864 8904 8944 8985 9026 9067 9108 9150 9192 9234 9276 9319 9362 9405 9448 9492 9536 9580 9624
1086 9624 9669 9714 9759 9804 9850 9896 9942 9989 10036 10083 10131 10179 10228 10276 10325 10374 10423 10473 10523 10573 10623 10674 10724 10775 10826 10878 10929 10981 11033 11085 11137 11190 11243 11296
1082 11296 11349 11403 11457 11511 11566 11621 11676 11731 11787 11842 11899 11955 12012 12069 12126 12183 12241 12298 12357 12415 12473 12532 12591 12650 12710 12769 12829 12889 12950 13011 13072 13133 13195 13256
1079 13256 13319 13381 13444 13508 13571 13635 13699 13764 13829 13894 13960 14026 14092 14158 14225 14293 14360 14428 14497 14565 14634 14703 14772 14842 14912 14982 15053 15124 15195 15266 15338 15410 15483 15556
1075 15556 15629 15702 15776 15850 15925 16000 16075 16150 16226 16303 16379 16456 16533 16611 16688 16765 16842 16918 16995 17071 17147 17224 17301 17379 17458 17538 17618 17700 17781 17863 17946 18029 18111 18194
$$ packed form
1100E446q5o7n1l7k7j8j1n%LPJ1J2J6J7J9K1K3K5K6K7K8L0L1L1L2L2L3L3L3L3L3L4L3L3L4
1097E835L3L4L3L4L3L4L4L3L4L4L4L4L4L3L4L4L4L4L4L4L4L3L4L4L4L4L4L4L3L4L4L5L4L4
1093F985L4L5L4L5L5L5L5L5L6L5L6L6L6L6L7L7L6L7L8L7L7L8L8L7L8L8L9L8L8L9L8L9L8L9
1089H234L9L9L9L9L9L9L9M0L9M0L9M0L9M0M0M0M0M0M1M1M1M1M2M2M2M2M3M3M3M3M4M4M4M4
1086I624M5M5M5M5M6M6M6M7M7M7M8M8M9M8M9M9M9N0N0N0N0N1N0N1N1N2N1N2N2N2N2N3N3N3
1082A1296N3N4N4N4N5N5N5N5N6N5N7N6N7N7N7N7N8N7N9N8N8N9N9N9O0N9O0O0O1O1O1O1O2O1
1079A3256O3O2O3O4O3O4O4O5O5O5O6O6O6O6O7O8O7O8O9O8O9O9O9P0P0P0P1P1P1P1P2P2P3P3
1075A5556P3P3P4P4P5P5P5P5P6P7P6P7P7P8P7P7P7P6P7P6P6P7P7P8P9Q0Q0Q2Q1Q2Q3Q3Q2Q3
$$ plain form
1071 18194 18277 18360 18443 18525 18607 18688 18770 18851 18934 19017 19101 19186 19272 19358 19445 19532 19619 19707 19795 19882 19970 20059 20147 20236 20325 20415 20505 20595 20686 20777 20868 20959 21050 21142
1068 21142 21233 21324 21416 21508 21600 21692 21784 21877 21970 22062 22155 22249 22342 22435 22528 22622 22715 22808 22902 22996 23090 23184 23278 23372 23466 23561 23655 23749 23843 23938 24032 24126 24220 24315
1064 24315 24409 24503 24597 24691 24785 24879 24973 25066 25160 25254 25347 25441 25534 25627 25720 25813 25906 25999 26091 26183 26275 26367 26458 26550 26641 26732 26823 26913 27003 27093 27182 27271 27360 27448
1061 27448 27537 27624 27712 27799 27886 27972 28058 28143 28228 28312 28396 28479 28562 28644 28726 28807 28888 28969 29048 29128 29207 29286 29364 29441 29518 29594 29670 29745 29819 29893 29966 30039 30110 30181
1057 30181 30251 30320 30388 30455 30522 30588 30653 30717 30780 30842 30903 30964 31024 31083 31141 31199 31255 31311 31366 31420 31472 31524 31575 31624 31673 31721 31768 31814 31859 31903 31946 31989 32030 32070
1053 32070 32109 32147 32183 32219 32253 32286 32319 32350 32381 32410 32439 32466 32492 32517 32540 32563 32584 32604 32623 32640 32657 32672 32687 32700 32712 32723 32732 32741 32748 32754 32759 32763 32766 32767 32767 32766 32764 32761 32756 32751 32744
1049 32744 32736 32727 32716 32705 32692 32679 32664 32648 32630 32612 32592 32571 32549 32526 32502 32476 32450 32422 32394 32364 32333 32301 32268 32234 32199 32162 32125 32087 32047 32007 31966 31924 31880 31835 31789
1045 31789 31742 31694 31645 31595 31544 31492 31439 31385 31330 31274 31216 31158 31099 31038 30977 30914 30849 30783 30716 30648 30578 30507 30434 30361 30287 30214 30140 30066 29993 29920 29848 29776 29705 29633
$$ packed form
1071A8194Q3Q3Q3Q2Q2Q1Q2Q1Q3Q3Q4Q5Q6Q6Q7Q7Q7Q8Q8Q7Q8Q9Q8Q9Q9R0R0R0R1R1R1R1R1R2
1068B1142R1R1R2R2R2R2R2R3R3R2R3R4R3R3R3R4R3R3R4R4R4R4R4R4R4R5R4R4R4R5R4R4R4R5
1064B4315R4R4R4R4R4R4R4R3R4R4R3R4R3R3R3R3R3R3R2R2R2R2R1R2R1R1R1R0R0R0Q9Q9Q9Q8
1061B7448Q9Q7Q8Q7Q7Q6Q6Q5Q5Q4Q4Q3Q3Q2Q2Q1Q1Q1P9Q0P9P9P8P7P7P6P6P5P4P4P3P3P1P1
1057C0181P0O9O8O7O7O6O5O4O3O2O1O1O0N9N8N8N6N6N5N4N2N2N1M9M9M8M7M6M5M4M3M3M1M0
1053C2070L9L8L6L6L4L3L3L1L1K9K9K7K6K5K3K3K1K0J9J7J7J5J5J3J2J1RRPONMLJ%jklnnp
1049C2744qrj1j1j3j3j5j6j8j8k0k1k2k3k4k6k6k8k8l0l1l2l3l4l5l7l7l8m0m0m1m2m4m5m6
1045C1789m7m8m9n0n1n2n3n4n5n6n8n8n9o1o1o3o5o6o7o8p0p1p3p3p4p3p4p4p3p3p2p2p1p2
$$ plain form
1042 29633 29561 29487 29412 29334 29252 29167 29078 28987 28895 28805 28716 28629 28541 28452 28361 28270 28177 28084 27990 27898 27803 27705 27606 27507 27411 27321 27235 27155 27078 27006 26937 26871 26807 26742
1038 26742 26676 26607 26535 26463 26393 26326 26262 26201 26138 26071 25999 25924 25848 25771 25694 25616 25536 25455 25373 25288 25203 25118 25035 24954 24872 24791 24710 24630 24552 24474 24397 24321 24244 24165
1034 24165 24086 24006 23925 23843 23762 23679 23597 23514 23431 23349 23267 23186 23104 23023 22941 22860 22780 22701 22623 22546 22468 22391 22314 22238 22162 22088 22013 21938 21864 21789 21714 21640 21565 21490
1031 21490 21415 21340 21266 21192 21118 21043 20969 20895 20821 20746 20672 20597 20522 20447 20372 20296 20221 20145 20070 19995 19921 19846 19772 19698 19624 19551 19479 19407 19336 19265 19193 19123 19052 18982
1027 18982 18912 18842 18773 18704 18635 18566 18498 18430 18362 18294 18227 18159 18092 18026 17960 17894 17829 17764 17699 17635 17571 17507 17444 17380 17317 17254 17191 17128 17065 17002 16940 16877 16815 16753
1024 16753 16691 16631 16571 16511 16450 16390 16329 16269 16208 16147 16086 16025 15964 15903 15843 15783 15723 15663 15603 15544 15485 15426 15368 15309 15251 15194 15136 15079 15021 14964 14906 14849 14793 14736
1020 14736 14680 14624 14569 14513 14458 14403 14348 14293 14238 14183 14129 14075 14021 13968 13914 13860 13807 13754 13701 13649 13597 13545 13494 13443 13392 13341 13291 13241 13191 13141 13092 13043 12994 12945
1016 12945 12896 12847 12798 12750 12702 12654 12606 12559 12511 12464 12417 12371 12324 12277 12231 12184 12138 12092 12047 12002 11957 11912 11868 11823 11779 11734 11690 11646 11603 11559 11516 11473 11430 11387
$$ packed form
1042B9633p2p4p5p8q2q5q9r1r2r0q9q7q8q9r1r1r3r3r4r2r5r8r9r9r6r0q6q0p7p2o9o6o4o5
1038B6742o6o9p2p2p0o7o4o1o3o7p2p5p6p7p7p8q0q1q2q5q5q5q3q1q2q1q1q0p8p8p7p6p7p9
1034B4165p9q0q1q2q1q3q2q3q3q2q2q1q2q1q2q1q0p9p8p7p8p7p7p6p6p4p5p5p4p5p5p4p5p5
1031B1490p5p5p4p4p4p5p4p4p4p5p4p5p5p5p5p6p5p6p5p5p4p5p4p4p4p3p2p2p1p1p2p0p1p0
1027A8982p0p0o9o9o9o9o8o8o8o8o7o8o7o6o6o6o5o5o5o4o4o4o3o4o3o3o3o3o3o3o2o3o2o2
1024A6753o2o0o0o0o1o0o1o0o1o1o1o1o1o1o0o0o0o0o0n9n9n9n8n9n8n7n8n7n8n7n8n7n6n7
1020A4736n6n6n5n6n5n5n5n5n5n5n4n4n4n3n4n4n3n3n3n2n2n2n1n1n1n1n0n0n0n0m9m9m9m9
1016A2945m9m9m9m8m8m8m8m7m8m7m7m6m7m7m6m7m6m6m5m5m5m5m4m5m4m5m4m4m3m4m3m3m3m3
$$ plain form
1013 11387 11344 11302 11260 11219 11177 11136 11095 11054 11013 10972 10931 10889 10848 10806 10765 10724 10683 10642 10602 10563 10523 10484 10445 10406 10367 10329 10290 10251 10213 10175 10137 10099 10062 10024
1009 10024 9987 9950 9912 9875 9838 9801 9765 9729 9693 9657 9622 9586 9551 9515 9480 9445 9410 9375 9340 9305 9271 9237 9202 9168 9134 9101 9067 9033 9000 8966 8933 8900 8867 8834
1006 8834 8802 8769 8736 8704 8671 8639 8606 8574 8542 8510 8478 8446 8414 8383 8351 8320 8289 8257 8226 8195 8164 8134 8103 8072 8042 8011 7981 7950 7920 7889 7858 7828 7797 7766
1002 7766 7736 7706 7675 7645 7615 7585 7555 7524 7494 7463 7432 7401 7370 7339 7308 7276 7244 7213 7181 7148 7116 7084 7051 7018 6985 6952 6918 6884 6850 6815 6780 6744 6708 6671
998 6671 6633 6595 6558 6523 6493 6472 6467 6488 6545 6644 6791 6984 7210 7446 7659 7818 7903 7918 7882 7814 7730 7640 7551 7469 7394 7326 7262 7204 7149 7097 7049 7003
995 7003 6958 6914 6871 6829 6789 6751 6715 6679 6643 6607 6573 6539 6506 6473 6441 6409 6378 6348 6319 6291 6263 6236 6209 6183 6158 6132 6108 6083 6059 6035 6011 5988 5965 5942 5919
991 5919 5896 5874 5852 5830 5808 5787 5765 5744 5723 5702 5681 5660 5639 5619 5598 5578 5557 5537 5517 5497 5478 5458 5439 5419 5400 5381 5362 5343 5325 5306 5288 5270 5251 5233 5215
988 5215 5198 5180 5162 5145 5128 5110 5093 5076 5059 5042 5025 5009 4992 4975 4959 4942 4926 4910 4893 4877 4861 4845 4829 4813 4797 4781 4765 4749 4733 4717 4701 4686 4670 4654 4638
$$ packed form
1013A1387m3m2m2m1m2m1m1m1m1m1m1m2m1m2m1m1m1m1m0l9m0l9l9l9l9l8l9l9l8l8l8l8l7l8
1009A0024l7l7l8l7l7l7l6l6l6l6l5l6l5l6l5l5l5l5l5l5l4l4l5l4l4l3l4l4l3l4l3l3l3l3
1006H834l2l3l3l2l3l2l3l2l2l2l2l2l2l1l2l1l1l2l1l1l1l0l1l1l0l1l0l1l0l1l1l0l1l1
1002G766l0l0l1l0l0l0l0l1l0l1l1l1l1l1l1l2l2l1l2l3l2l2l3l3l3l3l4l4l4l5l5l6l6l7
998F671l8l8l7l5l0k1nK1N7R9J47J93K26K36K13J59Q5J5l6o8q4r0q9q2p5o8o4n8n5n2m8m6
995G003m5m4m3m2m0l8l6l6l6l6l4l4l3l3l2l2l1l0k9k8k8k7k7k6k5k6k4k5k4k4k4k3k3k3k3
991E919k3k2k2k2k2k1k2k1k1k1k1k1k1k0k1k0k1k0k0k0j9k0j9k0j9j9j9j9j8j9j8j8j9j8j8
988E215j7j8j8j7j7j8j7j7j7j7j7j6j7j7j6j7j6j6j7j6j6j6j6j6j6j6j6j6j6j6j6j5j6j6j6
$$ plain form
984 4638 4623 4607 4591 4575 4560 4544 4528 4512 4497 4481 4466 4450 4434 4418 4402 4386 4370 4353 4336 4320 4303 4286 4269 4253 4236 4220 4203 4187 4170 4152 4135 4117 4099 4082 4063
980 4063 4045 4027 4008 3989 3970 3951 3932 3913 3893 3874 3854 3834 3814 3794 3774 3754 3733 3713 3692 3672 3651 3631 3611 3592 3575 3560 3548 3541 3541 3551 3572 3609 3663 3738 3837 3960
976 3960 4107 4276 4463 4665 4875 5085 5288 5478 5650 5799 5920 6012 6073 6107 6113 6094 6052 5991 5917 5833 5742 5647 5552 5458 5368 5283 5202 5126 5055 4988
973 4988 4925 4865 4808 4754 4702 4652 4604 4558 4514 4472 4431 4392 4355 4320 4286 4253 4222 4192 4164 4136 4110 4085 4061 4038 4015 3994 3973 3953 3933 3914 3896 3878 3860 3843 3826
969 3826 3809 3793 3777 3761 3746 3731 3716 3702 3688 3674 3661 3647 3634 3622 3609 3597 3584 3572 3560 3548 3536 3524 3513 3501 3490 3479 3468 3457 3446 3435 3425 3414 3404 3393 3383
966 3383 3373 3363 3353 3343 3333 3323 3313 3304 3294 3285 3275 3266 3257 3248 3239 3231 3222 3214 3205 3197 3189 3182 3174 3167 3159 3152 3145 3138 3131 3124 3117 3110 3103 3096 3089 3082 3075 3068 3061 3053 3046 3038 3031 3023 3016 3008 3000 2992 2984 2977 2969 2961 2953 2946 2938 2931 2923 2915 2908 2900
959 2900 2893 2885 2878 2870 2863 2855 2848 2840 2833 2825 2818 2811 2803 2796 2789 2782 2776 2769 2762 2756 2749 2743 2736 2730 2724 2718 2711 2705 2699 2694 2688 2682 2676 2671 2665 2660 2654 2649 2643 2638 2632 2626 2621 2615 2610 2604 2599 2593 2587 2582 2576 2571 2566 2560 2555 2549 2544 2539 2533 2528 2523 2517 2512 2507 2502 2496 2491 2486 2481
952 2481 2475 2470 2465 2460 2454 2449 2444 2438 2433 2428 2423 2417 2412 2407 2402 2397 2392 2387 2382 2377 2372 2367 2363 2358 2353 2349 2344 2339 2335 2330 2326 2321 2317 2312 2308 2303 2299 2294 2289 2285 2280 2276 2271 2267 2263 2258 2254 2249 2245 2241 2237 2232 2228 2224 2220 2215 2211 2207 2202 2198 2194 2189 2185 2181 2176 2172 2168 2164 2160
$$ packed form
984D638j5j6j6j6j5j6j6j6j5j6j5j6j6j6j6j6j6j7j7j6j7j7j7j6j7j6j7j6j7j8j7j8j8j7j9
980D063j8j8j9j9j9j9j9j9k0j9k0k0k0k0k0k0k1k0k1k0k1k0k0j9j7j5j2p%J0K1L7N4P5R9J23
976C960J47J69J87K02K10K10K03J90J72J49J21R2O1L4Oj9m2o1p4q4r1r5r5r4r0q5q1p6p1o7
973D988o3o0n7n4n2n0m8m6m4m2m1l9l7l5l4l3l1l0k8k8k6k5k4k3k3k1k1k0k0j9j8j8j8j7j7
969C826j7j6j6j6j5j5j5j4j4j4j3j4j3j2j3j2j3j2j2j2j2j2j1j2j1j1j1j1j1j1j0j1j0j1j0
966C383j0j0j0j0j0j0j0rj0rj0rrrrqrqrqqpqpqppppppppppppppqpqpqpqqqqpqqqpqpqqpq
959B900pqpqpqpqpqppqpppoppopopooopoonooononononoonononoononnononnonnonnnonnn
952B481onnnonnonnnonnnnnnnnnnmnnmnnmnmnmnmnmnnmnmnmmnmnmmmnmmmnmmnmmnmmnmmmm
$$ plain form
945 2160 2156 2152 2148 2144 2140 2136 2132 2128 2123 2119 2115 2111 2107 2103 2099 2094 2090 2086 2082 2078 2074 2071 2067 2063 2059 2055 2051 2047 2043 2040 2036 2032 2028 2024 2021 2017 2013 2009 2006 2002 1998 1995 1991 1987 1984 1980 1977 1973 1970 1966 1962 1959 1955 1952 1948 1945 1941 1938 1934 1931 1928 1924 1921 1917 1914 1911 1907 1904 1901
937 1901 1898 1894 1891 1888 1885 1882 1879 1875 1872 1869 1866 1863 1860 1857 1853 1850 1846 1843 1839 1836 1833 1829 1826 1823 1819 1816 1813 1810 1807 1804 1801 1798 1795 1792 1790 1787 1785 1783 1780 1778 1776 1774 1771 1769 1767 1764 1762 1759 1756 1753 1750 1747 1744 1741 1738 1735 1731 1728 1725 1722 1719 1716 1713 1710 1707 1704 1701 1698 1696
930 1696 1693 1690 1687 1685 1682 1679 1676 1673 1670 1667 1664 1661 1658 1655 1652 1649 1646 1643 1640 1638 1635 1632 1629 1627 1624 1621 1619 1616 1614 1611 1608 1606 1603 1601 1598 1595 1593 1590 1588 1585 1582 1580 1577 1575 1572 1570 1567 1565 1562 1560 1558 1555 1553 1551 1548 1546 1544 1541 1539 1537 1534 1532 1530 1528 1525 1523 1521 1519 1516
923 1516 1514 1512 1509 1507 1504 1502 1499 1497 1495 1492 1490 1487 1485 1483 1480 1478 1476 1473 1471 1468 1466 1464 1461 1459 1457 1455 1452 1450 1448 1446 1443 1441 1439 1437 1435 1432 1430 1428 1426 1424 1422 1420 1418 1416 1414 1411 1409 1407 1405 1403 1401 1399 1396 1394 1392 1390 1388 1386 1384 1382 1380 1378 1376 1374 1372 1370 1368 1366 1364
916 1364 1362 1360 1358 1356 1354 1352 1350 1348 1346 1345 1343 1341 1338 1336 1334 1332 1330 1328 1326 1324 1322 1320 1319 1317 1315 1313 1311 1309 1307 1305 1303 1301 1299 1297 1295 1294 1292 1290 1288 1286 1284 1282 1281 1279 1277 1275 1273 1272 1270 1268 1266 1265 1263 1261 1259 1258 1256 1254 1252 1250 1249 1247 1245 1244 1242 1240 1238 1237 1235
908 1235 1233 1232 1230 1228 1227 1225 1223 1222 1220 1218 1217 1215 1213 1212 1210 1208 1206 1205 1203 1201 1200 1198 1197 1195 1193 1192 1190 1188 1187 1185 1183 1182 1180 1179 1177 1175 1174 1172 1171 1169 1168 1166 1164 1163 1161 1160 1158 1157 1155 1154 1152 1150 1149 1147 1146 1144 1143 1141 1140 1138 1137 1135 1134 1132 1131 1129 1128 1126 1125
901 1125 1123 1122 1120 1119 1117 1116 1114 1113 1111 1110 1108 1107 1105 1104 1103 1101 1100 1098 1097 1095 1094 1093 1091 1090 1088 1087 1085 1084 1083 1081 1080 1079 1077 1076 1074 1073 1072 1070 1069 1068 1066 1065 1064 1062 1061 1060 1058 1057 1056 1054 1053 1052 1050 1049 1048 1046 1045 1044 1042 1041 1040 1038 1037 1036 1034 1033 1032 1031 1029
894 1029 1028 1027 1025 1024 1023 1022 1020 1019 1018 1017 1015 1014 1013 1012 1010 1009 1008 1007 1005 1004 1003 1002 1000 999 998 997 996 994 993 992 991 990 988 987 986 985 984 982 981 980 979 978 976 975 974 973 972 971 969 968 967 966 965 964 962 961 960 959 958 957 955 954 953 952 951 950 949 947 946
$$ packed form
945B160mmmmmmmmnmmmmmmnmmmmmlmmmmmmmlmmmmlmmmlmmlmmlmlmlmmlmlmlmlmllmlmllmll
937A901lmlllllmllllllmlmlmllmllmlllllllllklkklkkklkklklllllllllmlllllllllllk
930A696lllklllllllllllllllklllkllklkllklkllklkllklklklklkklkklkklkklkkklkkkl
923A516kklklklkklklkklkklklkklkkklkkklkkkklkkkkkkkkklkkkkkklkkkkkkkkkkkkkkkk
916A364kkkkkkkkkjkklkkkkkkkkkjkkkkkkkkkkkkjkkkkkkjkkkkjkkkjkkkjkkkkjkkjkkkjk
908A235kjkkjkkjkkjkkjkkkjkkjkjkkjkkjkkjkjkkjkjkjkkjkjkjkjkkjkjkjkjkjkjkjkjkj
901A125kjkjkjkjkjkjkjjkjkjkjjkjkjkjjkjjkjkjjkjjkjjkjjkjjkjjkjjkjjkjjkjjkjjjk
894A029jjkjjjkjjjkjjjkjjjkjjjkjjjjkjjjjkjjjjkjjjjkjjjjjkjjjjjkjjjjjkjjjjjjkj
$$ plain form
886 946 945 944 943 942 941 940 938 937 936 935 934 933 932 931 930 929 927 926 925 924 923 922 921 920 919 918 917 915 914 913 912 911 910 909 908 907 906 905 904 903 902 900 899 898 897 896 895 894 893 892 891 890 889 888 887 886 885 884 883 882 881 880 879 878 877 876 875 874 873 872
879 872 871 870 869 868 867 866 865 864 863 862 861 860 859 858 857 856 855 854 853 852 851 850 849 848 847 846 846 845 844 843 842 841 840 839 838 838 837 836 835 834 833 832 832 831 830 829 828 828 827 826 825 824 824 823 822 821 820 820 819 818 817 816 815 814 814 813 812 811 810 809
871 809 808 807 806 805 805 804 803 802 801 800 799 798 797 796 795 795 794 793 792 791 790 789 788 787 786 785 784 784 783 782 781 780 779 779 778 777 776 776 775 774 774 773 772 772 771 770 770 769 768 767 766 765 764 763 762 761 760 760 759 758 757 756 755 754 754 753 752 751 750 750
864 750 749 748 747 747 746 745 744 744 743 742 741 740 739 739 738 737 736 735 735 734 733 732 731 731 730 729 728 728 727 726 725 725 724 723 722 721 721 720 719 719 718 717 716 716 715 714 713 713 712 711 711 710 709 708 708 707 706 706 705 705 704 703 703 702 701 701 700 699 699 698
857 698 697 696 696 695 694 693 693 692 691 690 690 689 688 688 687 686 686 685 684 684 683 682 682 681 680 680 679 678 678 677 676 676 675 674 674 673 672 672 671 670 670 669 668 668 667 667 666 665 665 664 663 663 662 661 661 660 659 659 658 657 657 656 655 655 654 653 653 652 652 651
849 651 650 650 649 648 648 647 647 646 646 645 644 644 643 642 642 641 640 640 639 639 638 637 637 636 635 634 634 633 632 632 631 630 630 629 629 628 627 627 626 625 625 624 623 623 622 621 621 620 620 619 619 618 617 617 616 616 615 615 614 614 614 613 613 614 614 615 616 618 621 624
842 624 627 630 632 633 632 631 628 626 623 620 618 616 614 612 611 609 608 607 606 605 604 603 602 601 600 599 598 597 596 596 595 594 593 593 592 591 590 590 589 588 588 587 586 586 585 585 584 584 583 583 582 582 581 581 581 581 581 581 582 583 584 587 590 595 600 607 614 620 625 628
834 628 627 624 620 615 610 606 601 598 595 592 590 588 586 584 582 581 579 578 576 575 574 573 571 570 569 568 568 567 566 565 564 563 562 562 561 560 559 559 558 558 557 556 556 555 555 554 554 553 552 552 551 551 551 551 551 551 551 552 554 556 558 561 564 567 569 570 570 568 566 563
$$ packed form
886I46jjjjjjkjjjjjjjjjkjjjjjjjjjjkjjjjjjjjjjjjjkjjjjjjjjjjjjjjjjjjjjjjjjjjjj
879H72jjjjjjjjjjjjjjjjjjjjjjjjjj%jjjjjjjj%jjjjjj%jjjj%jjjj%jjjj%jjjjjj%jjjjj
871H09jjjj%jjjjjjjjjj%jjjjjjjjjjj%jjjjj%jjj%jj%jj%jj%jjjjjjjjjj%jjjjjj%jjjj%
864G50jjj%jjj%jjjjj%jjjj%jjjj%jjj%jjj%jjjj%jj%jjj%jjj%jj%jjj%jj%j%jj%jj%jj%j
857F98jj%jjj%jjj%jj%jj%jj%jj%jj%jj%jj%jj%jj%jj%jj%j%jj%jj%jj%jj%jj%jj%jj%j%j
849F51j%jj%j%j%jj%jj%jj%j%jj%jjj%jj%jj%j%jj%jj%jj%jj%j%j%jj%j%j%j%%j%J%JJKLL
842F24LLKJjjlkllkkkkjkjjjjjjjjjjjjj%jjj%jjj%jj%jj%j%j%j%j%j%%%%%JJJLLNNPPONL
834F28jlmnnmnlllkkkkkjkjkjjjkjjj%jjjjjj%jjj%j%jj%j%j%jj%j%%%%%%JKKKLLLKJ%kkl
$$ plain form
827 563 561 558 556 554 552 550 549 548 546 545 544 543 542 541 541 540 539 538 537 537 536 535 535 534 534 533 532 532 531 530 530 529 529 528 528 527 527 526 526 525 525 524 524 523 523 522 522 521 521 520 519 519 518 518 517 517 516 516 516 515 515 514 514 513 512 511 511 510 509 509
820 509 508 508 507 507 506 506 505 504 504 503 503 502 502 501 501 500 500 499 499 499 498 498 497 497 496 496 496 495 495 494 494 494 493 493 492 492 491 491 490 490 490 489 489 488 488 487 487 486 486 485 485 484 484 483 483 482 482 481 481 480 480 479 479 478 478 477 477 476 476 475
812 475 475 474 474 473 473 473 472 472 471 471 470 469 469 468 468 467 467 466 466 465 465 464 464 463 463 462 462 461 461 461 460 460 460 460 460 461 461 462 462 463 464 465 466 467 468 469 470 473 476 480 486 494 507 525 550 584 630 686 751 821 890
806 890 946 979 985 963 925 880 835 794 758 727 703 682 665 649 636 625 614 605 597 589 581 575 568 563 557 552 547 542 537 533 529 525 521 517 514 510 507 505 502 500 498 496 494 492 490 489 487 486 484 483 482 480 479 478
800 478 476 475 474 473 472 471 470 469 468 467 467 466 465 464 464 463 462 462 461 460 459 459 458 457 457 456 456 455 454 454 453 453 452 452 451 450 450 449 449 448 448 447 447 446 446 445 445 444 444 443 443 442 442 442 441 441 440 440 440 439 439 439 438 438 438 437 437 437 436 436
793 436 436 435 435 434 434 434 433 433 433 432 432 432 431 431 430 430 429 429 428 427 427 427 426 426 426 425 425 425 424 424 423 422 422 422 421 421 420 420 419 419 419 418 418 417 417 417 417 416 416 416 416 415 415 415 415 414 414 414 413 413 412 412 412 412 411 411 410 410 410 410
785 410 409 409 409 408 408 408 408 407 407 407 407 406 406 406 406 405 405 405 404 404 404 403 403 403 403 402 402 402 402 401 401 401 400 400 400 399 399 399 399 398 398 398 398 398 398 398 399 399 399 399 399 399 398 398 397 397 396 396 396 396 395 395 395 395 394 394 393 393 392 392
778 392 392 391 391 391 390 390 390 390 389 389 389 388 388 388 387 387 387 386 386 386 385 385 385 385 384 384 384 384 383 383 383 383 383 382 382 382 382 381 381 381 381 381 381 381 381 382 382 383 384 384 385 385 385 384 384 383 382 382 381 381 380 380 380 380 380 380 380 380 379 379
$$ packed form
827E63klkkkkjjkjjjjj%jjjj%jj%j%jj%jj%j%j%j%j%j%j%j%j%j%jj%j%j%j%%j%j%jjj%jj%
820E09j%j%j%jj%j%j%j%j%j%%j%j%j%%j%j%%j%j%j%j%%j%j%j%j%j%j%j%j%j%j%j%j%j%j%j
812D75%j%j%%j%j%jj%j%j%j%j%j%j%j%j%%j%%%%J%J%JJJJJJJJLLMOQJ3J8K5L4M6N6O5P0O9
806H90N6L3Ok2l8m5m5m1l6l1k4k1j7j6j3j1j1rqqqopnonnnnmmmmmlmlklkkkkkkjkjkjjkjj
800D78kjjjjjjjjj%jjj%jj%jjj%jj%j%jj%j%j%jj%j%j%j%j%j%j%j%j%%j%j%%j%%j%%j%%j%
793D36%j%j%%j%%j%%j%j%j%jj%%j%%j%%j%jj%%j%j%j%%j%j%%%j%%%j%%%j%%j%j%%%j%j%%%
785D10j%%j%%%j%%%j%%%j%%j%%j%%%j%%%j%%j%%j%%%j%%%%%%J%%%%%j%j%j%%%j%%%j%j%j%
778C92%j%%j%%%j%%j%%j%%j%%j%%%j%%%j%%%%j%%%j%%%%%%%J%JJ%J%%j%jj%j%j%%%%%%%j%
$$ plain form
770 379 378 377 377 376 375 375 375 374 374 373 373 373 372 372 372 371 371 371 370 370 370 369 369 369 369 368 368 368 368 367 367 367 366 366 366 366 365 365 365 365 365 365 364 364 364 364 364 364 364 365 365 365 365 365 365 364 364 363 363 362 362 361 361 361 360 360 360 360 359 359
763 359 359 359 358 358 358 358 358 358 358 358 358 358 358 358 357 357 356 356 356 355 355 355 354 354 354 354 353 353 353 353 353 354 354 354 355 356 357 357 358 358 357 357 356 355 355 354 354 353 352 352 351 351 350 350 350 349 349 348 348 348 348 347 347 347 347 347 347 347 346 346
755 346 346 346 346 346 346 346 346 345 345 344 344 343 343 343 343 342 342 342 342 342 342 341 341 341 340 340 340 340 340 339 339 340 340 340 340 340 340 340 339 339 338 338 337 337 336 336 335 335 335 334 334 334 334 333 333 333 332 332 332 332 331 331 331 331 330 330 330 330 330 329
748 329 329 329 329 328 328 328 328 328 327 327 327 327 327 326 326 326 326 326 325 325 325 325 325 325 324 324 324 324 325 325 325 325 325 325 325 325 325 324 324 323 323 322 322 322 321 321 321 321 321 320 320 320 320 320 320 320 320 320 320 320 320 319 319 319 318 318 318 317 317 317
741 317 316 316 316 316 315 315 315 315 314 314 314 313 313 313 313 313 312 312 312 312 311 311 311 311 311 310 310 310 310 310 309 309 309 309 309 309 308 308 308 308 308 307 307 307 307 307 306 306 306 306 306 305 305 305 305 305 304 304 304 304 304 303 303 303 303 303 302 302 302 302
733 302 302 302 301 301 301 301 301 300 300 300 300 300 299 299 299 299 299 298 298 298 298 298 297 297 297 297 297 297 296 296 296 296 296 296 295 295 295 295 294 294 294 294 294 293 293 293 293 293 293 292 292 292 292 292 292 292 291 291 291 291 290 290 290 290 289 289 289 289 289 289
726 289 288 288 288 288 288 288 287 287 287 287 287 286 286 286 286 286 286 285 285 285 285 285 284 284 284 284 284 283 283 283 283 283 283 282 282 282 282 282 282 281 281 281 281 281 280 280 280 280 279 279 279 279 279 278 278 278 278 278 277 277 277 277 277 277 276 276 276 276 276 276
718 276 275 275 275 275 275 275 274 274 274 274 274 273 273 273 273 273 273 273 272 272 272 272 272 271 271 271 271 271 271 271 270 270 270 270 270 270 270 269 269 269 269 269 269 268 268 268 268 268 267 267 267 267 267 266 266 266 266 266 265 265 265 264 264 263 263 263 262 262 262 262
$$ packed form
770C79jj%jj%%j%j%%j%%j%%j%%j%%%j%%%j%%j%%%j%%%%%j%%%%%%J%%%%%j%j%j%j%%j%%%j%
763C59%%j%%%%%%%%%%%j%j%%j%%j%%%j%%%%J%%JJJ%J%j%jj%j%jj%j%j%%j%j%%%j%%%%%%j%
755C46%%%%%%%j%j%j%%%j%%%%%j%%j%%%%j%J%%%%%%j%j%j%j%j%%j%%%j%%j%%%j%%%j%%%%j
748C29%%%j%%%%j%%%%j%%%%j%%%%%j%%%J%%%%%%%%j%j%j%%j%%%%j%%%%%%%%%%%j%%j%%j%%
741C17j%%%j%%%j%%j%%%%j%%%j%%%%j%%%%j%%%%%j%%%%j%%%%j%%%%j%%%%j%%%%j%%%%j%%%
733C02%%j%%%%j%%%%j%%%%j%%%%j%%%%%j%%%%%j%%%j%%%%j%%%%%j%%%%%%j%%%j%%%j%%%%%
726B89j%%%%%j%%%%j%%%%%j%%%%j%%%%j%%%%%j%%%%%j%%%%j%%%j%%%%j%%%%j%%%%%j%%%%%
718B76j%%%%%j%%%%j%%%%%%j%%%%j%%%%%%j%%%%%%j%%%%%j%%%%j%%%%j%%%%j%%j%j%%j%%%
$$ plain form
711 262 261 261 261 261 260 260 260 260 259 259 259 259 258 258 258 258 258 257 257 257 257 257 257 257 256 256 256 256 256 256 255 255 255 255 255 254 254 254 254 254 253 253 253 253 252 252 252 252 251 251 251 251 251 250 250 250 250 249 249 249 249 249 248 248 248 248 248 247 247 247
704 247 247 247 247 246 246 246 245 245 245 244 244 244 244 244 243 243 243 243 243 242 242 242 242 242 242 242 242 242 242 242 243 243 244 245 246 247 248 249 251 252 254 256 258 260 263 268 273 281 291 306 326 353 390 435 489 550 611 667 708
697 708 728 723 697 659 617 575 537 505 478 456 437 422 408 396 386 377 369 362 355 348 342 337 332 327 322 318 313 309 305 301 298 295 291 289 286 284 281 279 278 276 274 273 272 270 269 268 267 266 265 264 263 262 261 260 259 259
691 259 258 257 257 256 256 255 255 254 254 254 253 253 253 252 252 251 251 250 250 249 249 248 248 247 247 247 246 246 245 245 245 244 244 244 244 243 243 243 242 242 242 241 241 241 241 241 240 240 240 240 240 239 239 239 239 239 239 239 239 238 238 238 238 237 237 237 237 237 236 236
684 236 236 236 236 236 236 236 236 236 235 235 235 234 234 233 233 233 232 232 232 232 232 232 232 232 232 232 231 231 230 230 229 229 229 228 228 227 227 227 227 227 226 226 226 226 226 226 226 226 226 226 226 225 225 225 225 225 225 225 225 225 225 225 225 225 225 225 225 226 226 227
677 227 228 229 231 233 235 238 240 242 244 244 243 241 239 237 236 234 233 232 232 232 232 232 233 234 235 237 238 240 241 241 242 241 240 239 238 236 235 233 232 231 230 229 229 228 228 227 226 226 226 225 225 225 225 225 225 225 225 225 224 224 223 222 222 221 220 220 220 219 219 219
669 219 218 218 218 218 218 218 218 218 219 219 219 220 220 221 222 223 224 225 227 229 231 234 238 242 246 249 252 254 254 253 251 248 245 242 239 237 235 233 232 231 229 229 228 227 227 226 226 226 225 225 224 223 222 221 220 219 218 218 217 216 216 215 215 215 214 214 213 213 213 212
662 212 212 212 212 211 211 211 211 211 211 211 211 211 211 211 212 212 213 213 214 215 217 218 220 222 223 225 225 226 225 224 223 221 219 218 217 215 214 213 213 212 211 211 210 209 209 208 208 208 207 207 207 207 206 206 207 207 207 207 207 207 207 207 206 206 205 205 204 204 204 203
$$ packed form
711B62j%%%j%%%j%%%j%%%%j%%%%%%j%%%%%j%%%%j%%%%j%%%j%%%j%%%%j%%%j%%%%j%%%%j%%
704B47%%%j%%j%%j%%%%j%%%%j%%%%%%%%%%J%JJJJJJKJKKKKLNNQJ0J5K0K7L7M5N4O1O1N6M1
697G08K0nk6l8m2m2l8l2k7k2j9j5j4j2j0rqppponnnnmnmmmllmklklkjkkjjkjjjjjjjjjjj%
691B59jj%j%j%j%%j%%j%j%j%j%j%j%%j%j%%j%%%j%%j%%j%%%%j%%%%j%%%%%%%j%%%j%%%%j%
684B36%%%%%%%%j%%j%j%%j%%%%%%%%%j%j%j%%j%j%%%%j%%%%%%%%%%j%%%%%%%%%%%%%%%J%J
677B27JJKKKLKKK%jkkkjkjj%%%%JJJKJKJ%Jjjjjkjkjjjj%j%jj%%j%%%%%%%%j%jj%jj%%j%%
669B19j%%%%%%%J%%J%JJJJJKKKLMMMLLK%jkllllkkkjjk%jj%j%%j%jjjjjjj%jj%j%%j%j%%j
662B12%%%j%%%%%%%%%%J%J%JJKJKKJK%Jjjjkkjjkjj%jj%jj%j%%j%%%j%J%%%%%%%j%j%j%%j
$$ plain form
654 203 203 203 202 202 202 202 201 201 201 201 200 200 200 200 200 199 199 199 199 199 199 198 198 198 198 198 198 198 197 197 197 197 197 197 197 196 196 196 196 196 196 196 196 195 195 195 195 195 195 195 195 194 194 194 194 194 194 194 194 194 193 193 193 193 193 193 193 193 193 193
647 193 192 192 192 192 192 192 192 192 192 192 191 191 191 191 191 191 191 191 190 190 190 190 190 190 190 190 190 189 189 189 189 189 189 189 189 189 189 188 188 188 188 188 188 188 188 188 187 187 187 187 187 187 187 187 187 186 186 186 186 186 186 186 186 186 186 186 186 185 185 185
639 185 185 185 185 185 185 185 185 185 185 185 185 185 185 184 184 184 184 184 184 184 184 183 183 183 183 183 183 183 183 183 183 183 182 182 182 182 182 182 182 182 182 182 182 182 182 182 182 182 182 182 182 182 182 183 183 182 182 182 182 182 182 182 181 181 181 181 181 181 180 180
632 180 180 180 180 180 180 180 180 179 179 179 179 179 179 179 179 178 178 178 178 178 178 178 178 178 178 178 177 177 177 177 177 177 177 177 177 177 177 177 176 176 176 176 176 176 176 176 176 176 176 176 176 176 176 176 176 176 176 175 175 175 175 175 175 175 175 174 174 174 174 174
625 174 174 174 174 174 173 173 173 173 173 173 173 173 173 173 173 172 172 172 172 172 172 172 172 172 172 172 172 171 171 171 171 171 171 171 171 171 171 171 171 171 171 171 170 170 170 170 170 170 170 170 170 170 169 169 169 169 169 169 169 169 169 169 169 169 169 168 168 168 168 168
617 168 168 168 168 168 168 168 168 168 167 167 167 167 167 167 167 167 167 167 167 167 167 166 166 166 166 166 166 166 166 166 166 166 166 166 166 166 166 165 165 165 165 165 165 165 165 165 165 165 165 165 164 164 164 164 164 164 164 164 164 164 164 164 164 164 164 163 163 163 163 163
610 163 163 163 163 163 163 163 163 163 162 162 162 162 162 162 162 162 162 162 162 162 162 162 162 161 161 161 161 161 161 161 161 161 161 161 161 161 161 161 161 160 160 160 160 160 160 160 160 160 160 160 160 159 159 159 159 159 159 159 159 159 159 159 159 159 159 159 159 159 159 158
602 158 158 158 158 158 158 158 158 158 158 158 158 158 157 157 157 157 157 157 157 157 157 157 157 157 157 157 157 156 156 156 156 156 156 156 156 156 156 156 156 156 156 156 156 156 155 155 155 155 155 155 155 155 155 155 155 155 155 154 154 154 154 154 154 154 154 154 154 154 154 154
$$ packed form
654B03%%j%%%j%%%j%%%%j%%%%%j%%%%%%j%%%%%%j%%%%%%%j%%%%%%%j%%%%%%%%j%%%%%%%%%
647A93j%%%%%%%%%j%%%%%%%j%%%%%%%%j%%%%%%%%%j%%%%%%%%j%%%%%%%%j%%%%%%%%%%%j%%
639A85%%%%%%%%%%%%%j%%%%%%%j%%%%%%%%%%j%%%%%%%%%%%%%%%%%%%%J%j%%%%%%j%%%%%j%
632A80%%%%%%%j%%%%%%%j%%%%%%%%%%j%%%%%%%%%%%j%%%%%%%%%%%%%%%%%%j%%%%%%%j%%%%
625A74%%%%j%%%%%%%%%%j%%%%%%%%%%%j%%%%%%%%%%%%%%j%%%%%%%%%j%%%%%%%%%%%%j%%%%
617A68%%%%%%%%j%%%%%%%%%%%%j%%%%%%%%%%%%%%%j%%%%%%%%%%%%j%%%%%%%%%%%%%%j%%%%
610A63%%%%%%%%j%%%%%%%%%%%%%%j%%%%%%%%%%%%%%%j%%%%%%%%%%%j%%%%%%%%%%%%%%%%%j
602A58%%%%%%%%%%%%j%%%%%%%%%%%%%%j%%%%%%%%%%%%%%%%j%%%%%%%%%%%%j%%%%%%%%%%%%
$$ plain form
595 154 154 154 154 154 153 153 153 153 153 153 153 153 153 153 153 153 153 153 153 152 152 152 152 152 152 152 152 152 152 152 152 152 152 152 152 151 151 151 151 151 151 151 151 151 151 151 151 151 151 151 151 151 151 150 150 150 150 150 150 150 150 150 150 150 150 150 150 150 150 150
587 150 149 149 149 149 149 149 149 149 149 149 149 149 149 149 149 148 148 148 148 148 148 148 148 148 148 148 148 148 148 148 148 148 147 147 147 147 147 147 147 147 147 147 147 147 147 147 147 147 147 147 147 146 146 146 146 146 146 146 146 146 146 146 146 146 146 146 146 146 145 145
580 145 145 145 145 145 145 145 145 145 145 145 145 145 145 145 145 145 144 144 144 144 144 144 144 144 144 144 144 144 144 144 144 144 144 144 143 143 143 143 143 143 143 143 143 143 143 143 143 143 143 143 143 143 143 143 142 142 142 142 142 142 142 142 142 142 142 142 142 142 142 142
573 142 142 141 141 141 141 141 141 141 141 141 141 141 141 141 141 141 141 141 141 141 141 140 140 140 140 140 140 140 140 140 140 140 140 140 140 140 140 140 139 139 139 139 139 139 139 139 139 139 139 139 139 139 139 139 139 139 139 139 138 138 138 138 138 138 138 138 138 138 138 138
565 138 138 138 138 138 138 138 137 137 137 137 137 137 137 137 137 137 137 137 137 137 137 137 137 137 137 137 137 136 136 136 136 136 136 136 136 136 136 136 136 136 136 136 136 136 136 136 136 135 135 135 135 135 135 135 135 135 135 135 135 135 135 135 135 135 135 135 135 135 135 135
558 135 135 135 135 134 134 134 134 134 134 134 134 134 134 134 134 134 134 134 133 133 133 133 133 133 133 133 133 133 133 133 133 133 133 133 133 133 133 133 132 132 132 132 132 132 132 132 132 132 132 132 132 132 132 132 132 132 132 132 132 131 131 131 131 131 131 131 131 131 131 131
550 131 131 131 131 131 131 131 131 131 131 131 131 130 130 130 130 130 130 130 130 130 130 130 130 130 130 130 130 130 130 130 129 129 129 129 129 129 129 129 129 129 129 129 129 129 129 129 129 129 129 129 128 129 128 128 128 128 128 128 128 128 128 128 128 128 128 128 128 128 128 128
543 128 128 128 128 128 128 127 127 127 127 127 127 127 127 127 127 127 127 127 127 127 127 127 127 127 127 127 126 126 126 126 126 126 126 126 126 126 126 126 126 126 126 126 126 126 126 125 125 125 125 125 125 125 125 125 125 125 125 125 125 125 125 125 125 125 125 125 124 124 124 124
$$ packed form
595A54%%%%j%%%%%%%%%%%%%%j%%%%%%%%%%%%%%%j%%%%%%%%%%%%%%%%%j%%%%%%%%%%%%%%%%
587A50j%%%%%%%%%%%%%%j%%%%%%%%%%%%%%%%j%%%%%%%%%%%%%%%%%%j%%%%%%%%%%%%%%%%j%
580A45%%%%%%%%%%%%%%%%j%%%%%%%%%%%%%%%%%j%%%%%%%%%%%%%%%%%%%j%%%%%%%%%%%%%%%
573A42%j%%%%%%%%%%%%%%%%%%%j%%%%%%%%%%%%%%%%j%%%%%%%%%%%%%%%%%%%j%%%%%%%%%%%
565A38%%%%%%j%%%%%%%%%%%%%%%%%%%%j%%%%%%%%%%%%%%%%%%%j%%%%%%%%%%%%%%%%%%%%%%
558A35%%%j%%%%%%%%%%%%%%j%%%%%%%%%%%%%%%%%%%j%%%%%%%%%%%%%%%%%%%%j%%%%%%%%%%
550A31%%%%%%%%%%%j%%%%%%%%%%%%%%%%%%j%%%%%%%%%%%%%%%%%%%jJj%%%%%%%%%%%%%%%%%
543A28%%%%%j%%%%%%%%%%%%%%%%%%%%j%%%%%%%%%%%%%%%%%%j%%%%%%%%%%%%%%%%%%%%j%%%
$$ plain form
536 124 124 124 124 124 124 124 124 124 124 124 124 124 124 124 124 124 124 124 124 123 123 123 123 123 123 123 123 123 123 123 123 123 123 123 123 123 123 123 123 123 123 123 122 122 122 122 122 122 122 122 122 122 122 122 122 122 122 122 122 122 122 122 122 122 122 122 121 121 121 121
528 121 121 121 121 121 121 121 121 121 121 121 121 121 121 121 121 121 121 121 120 120 120 120 120 120 120 120 120 120 120 120 120 120 120 120 120 120 120 120 120 120 120 120 120 119 119 119 119 119 119 119 119 119 119 119 119 119 119 119 119 119 119 119 119 119 119 119 119 119 119 118
521 118 118 118 118 118 118 118 118 118 118 118 118 118 118 118 118 118 118 118 118 118 118 118 117 117 117 117 117 117 117 117 117 117 117 117 117 117 117 117 117 117 117 117 117 117 117 117 117 117 117 117 116 116 116 116 116 116 116 116 116 116 116 116 116 116 116 116 116 116 116 116
513 116 116 116 116 116 116 116 116 116 115 115 115 115 115 115 115 115 115 115 115 115 115 115 115 115 115 115 115 115 115 115 115 115 115 115 115 114 114 114 114 114 114 114 114 114 114 114 114 114 114 114 114 114 114 114 114 114 114 114 114 114 114 114 114 114 113 113 113 113 113 113
506 113 113 113 113 113 113 113 113 113 113 113 113 113 113 113 113 113 113 113 112 112 112 112 112 112 112 112 112 112 112 112 112 112 112 112 112 112 112 112 112 112 112 112 112 112 112 112 112 112 112 112 112 111 111 111 111 111 111 111 111 111 111 111 111 111 111 111 111 111 111 111
498 111 111 111 111 111 111 111 111 111 111 111 111 111 110 110 110 110 110 110 110 110 110 110 110 110 110 110 110 110 110 110 110 110 110 110 110 110 110 110 110 110 109 109 109 109 109 109 109 109 109 109 109 109 109 109 109 109 109 109 109 109 109 109 109 109 109 109 109 109 109 109
491 109 109 108 108 108 108 108 108 108 108 108 108 108 108 108 108 108 108 108 108 108 108 108 108 108 108 108 108 108 108 108 108 108 108 108 108 108 107 107 107 107 107 107 107 107 107 107 107 107 107 107 107 107 107 107 107 107 107 107 107 107 107 107 107 107 107 107 106 106 106 106
484 106 106 106 106 106 106 106 106 106 106 106 106 106 106 106 106 106 106 106 106 106 106 106 106 106 106 106 106 106 106 106 105 105 105 105 105 105 105 105 105 105 105 105 105 105 105 105 105 105 105 105 105 105 105 105 105 105 105 105 105 105 105 105 105 104 104 104 104 104 104 104
$$ packed form
536A24%%%%%%%%%%%%%%%%%%%j%%%%%%%%%%%%%%%%%%%%%%j%%%%%%%%%%%%%%%%%%%%%%%j%%%
528A21%%%%%%%%%%%%%%%%%%j%%%%%%%%%%%%%%%%%%%%%%%%j%%%%%%%%%%%%%%%%%%%%%%%%%j
521A18%%%%%%%%%%%%%%%%%%%%%%j%%%%%%%%%%%%%%%%%%%%%%%%%%%j%%%%%%%%%%%%%%%%%%%
513A16%%%%%%%%j%%%%%%%%%%%%%%%%%%%%%%%%%%j%%%%%%%%%%%%%%%%%%%%%%%%%%%%j%%%%%
506A13%%%%%%%%%%%%%%%%%%j%%%%%%%%%%%%%%%%%%%%%%%%%%%%%%%%j%%%%%%%%%%%%%%%%%%
498A11%%%%%%%%%%%%j%%%%%%%%%%%%%%%%%%%%%%%%%%%j%%%%%%%%%%%%%%%%%%%%%%%%%%%%%
491A09%j%%%%%%%%%%%%%%%%%%%%%%%%%%%%%%%%%%j%%%%%%%%%%%%%%%%%%%%%%%%%%%%%j%%%
484A06%%%%%%%%%%%%%%%%%%%%%%%%%%%%%%j%%%%%%%%%%%%%%%%%%%%%%%%%%%%%%%%j%%%%%%
$$ plain form
476 104 104 104 104 104 104 104 104 104 104 104 104 104 104 104 104 104 104 104 104 104 104 104 104 104 104 104 104 104 104 103 103 103 103 103 103 103 103 103 103 103 103 103 103 103 103 103 103 103 103 103 103 103 103 103 102 102 102 102 102 102 102 102 102 102 102 102 102 102 102 102
469 102 102 102 102 102 102 102 102 102 102 102 102 102 102 101 101 101 102 101 101 101 101 101 101 101 101 101 101 101 101 101 101 101 101 101 101 101 101 101 101 101 101 101 101 101 101 101 101 100 100 100 100 100 100 100 100 100 100 100 100 100 100 100 100 100 100 100 100 100 100 100
461 100 100 100 100 100 100 100 99 99 99 99 99 99 99 99 99 99 99 99 99 99 99 99 99 99 99 99 99 99 99 99 99 99 99 99 99 99 99 99 99 99 98 98 98 98 98 98 98 98 98 98 98 98 98 98 98 98 98 98 98 98 98 98 98 98 98 98 98 98 98 98
454 98 98 98 97 97 97 97 97 97 97 97 97 97 97 97 97 97 97 97 97 97 97 97 97 97 97 97 97 97 97 97 97 96 96 96 96 96 96 96 96 96 96 96 96 96 96 96 96 96 96 96 96 96 96 96 96 96 96 96 96 96 96 96 96 96 96 96 96 96 96 96 96
446 96 95 95 95 95 95 95 95 95 95 95 95 95 95 95 95 95 95 95 95 95 95 95 95 95 95 95 95 95 95 95 95 95 95 95 95 95 95 95 94 94 94 94 94 94 94 94 94 94 94 94 94 94 94 94 94 94 94 94 94 94 94 94 94 94 94 94 94 94 94 94 94
439 94 94 94 94 94 94 94 94 93 93 93 93 93 93 93 93 93 93 93 93 93 93 93 93 93 93 93 93 93 93 93 93 93 93 93 93 93 93 93 93 93 93 93 93 93 93 93 93 93 93 93 93 93 93 93 93 93 93 93 92 92 92 92 92 92 92 92 92 92 92 92 92
431 92 92 92 92 92 92 92 92 92 92 92 92 92 92 92 92 92 92 92 92 92 92 92 92 92 92 92 92 92 92 92 92 92 91 91 91 91 91 91 91 91 91 91 91 91 91 91 91 91 91 91 91 91 91 91 91 91 91 91 91 91 91 91 91 91 91 91 91 91 91 91 91
424 91 91 91 91 91 91 91 91 90 90 90 90 90 90 90 90 90 90 90 90 90 90 90 90 90 90 90 90 90 90 90 90 90 90 90 90 90 90 90 90 90 90 90 90 90 90 90 90 90 90 89 89 89 89 89 89 89 89 89 89 89 89 89 89 89 89 89 89 89 89 89 89
$$ packed form
476A04%%%%%%%%%%%%%%%%%%%%%%%%%%%%%j%%%%%%%%%%%%%%%%%%%%%%%%j%%%%%%%%%%%%%%%
469A02%%%%%%%%%%%%%j%%Jj%%%%%%%%%%%%%%%%%%%%%%%%%%%%%j%%%%%%%%%%%%%%%%%%%%%%
461A00%%%%%%j%%%%%%%%%%%%%%%%%%%%%%%%%%%%%%%%%j%%%%%%%%%%%%%%%%%%%%%%%%%%%%%
454I8%%j%%%%%%%%%%%%%%%%%%%%%%%%%%%%j%%%%%%%%%%%%%%%%%%%%%%%%%%%%%%%%%%%%%%%
446I6j%%%%%%%%%%%%%%%%%%%%%%%%%%%%%%%%%%%%%j%%%%%%%%%%%%%%%%%%%%%%%%%%%%%%%%
439I4%%%%%%%j%%%%%%%%%%%%%%%%%%%%%%%%%%%%%%%%%%%%%%%%%%%%%%%%%%j%%%%%%%%%%%%
431I2%%%%%%%%%%%%%%%%%%%%%%%%%%%%%%%%j%%%%%%%%%%%%%%%%%%%%%%%%%%%%%%%%%%%%%%
424I1%%%%%%%j%%%%%%%%%%%%%%%%%%%%%%%%%%%%%%%%%%%%%%%%%j%%%%%%%%%%%%%%%%%%%%%
$$ plain form
416 89 89 89 89 89 89 89 89 89 89 89 89 89 89 89 89 89 89 88 88 88 88 88 88 88 88 88 88 88 88 88 88 88 88 88 88 88 88 88 88 88 88 88 88 88 88 88 88 88 88 88 88 88 88 88 88 88 88 87 87 87 87 87 87 87 87 87 87 87 87 87 87
409 87 87 87 87 87 87 87 87 87 87 87 87 87 87 87 87 87 87 87 87 87 87 87 87 87 87 87 86 86 86 86 86 86 86 86 86 86 86 86 86 86 86 86 86 86 86 86 86 86 86 86 86 86 86 86 86 86 86 86 86 86 86 86 86 86 86 86 86 85 85 85 85
401 85 85 85 85 85 85 85 85 85 85 85 85 85 85 85 85 85 85 85 85 85 85 85 85 85 85 85 85 85 85 85 85 85 85 85 85 85 85 85 85 85 85 85 85 84 84 84 84 84 84 85 84 84 84 84 84 84 84 84 84 84 84 84 84 84 84 84 84 84 84 84 84
394 84 84 84 84 84 84 84 84 84 84 84 84 84 84 84 84 84 84 84 84 84 84 84 84 84 84 84 84 84 84 84 84 84 84 84 83 83 83 83 83 83 83 83 83 83 83 83 83 83 83 83 83 83 83 83 83 83 83 83 83 83 83 83 83 83 83 83 83 83 83 83 83
386 83 83 83 83 83 83 83 83 83 83 83 83 83 83 83 83 83 83 83 83 83 83 83 83 83 83 83 83 83 83 83 83 83 82 82 82 82 82 82 82 82 82 82 82 82 82 82 82 82 82 82 82 82 82 82 82 82 82 82 82 82 82 82 82 82 82 82 82 82 82 82 82
379 82 82 82 82 82 82 82 82 82 82 82 82 82 82 82 82 82 82 82 82 82 82 82 82 82 82 82 82 82 81 81 81 81 81 81 81 81 81 81 81 81 81 81 81 81 81 81 81 81 81 81 81 81 81 81 81 81 81 81 81 81 81 81 81 81 81 81 81 81 81 81 81
371 81 81 81 81 81 81 81 81 81 81 81 81 81 81 81 81 81 81 81 81 81 81 81 81 81 81 81 81 80 80 80 80 80 80 80 80 80 80 80 80 80 80 80 80 80 80 80 80 80 80 80 80 80 80 80 80 80 80 80 80 80 80 80 80 80 80 80 80 80 80 80 80
364 80 80 80 80 80 80 80 80 80 80 80 80 80 80 80 80 80 80 80 80 80 79 79 79 79 79 79 79 79 79 79 79 79 79 79 79 79 79 79 79 79 79 79 79 79 79 79 79 79 79 79 79 79 79 79 79 79 79 79 79 79 79 79 79 79 79 79 79 79 79 79 79
$$ packed form
416H9%%%%%%%%%%%%%%%%%j%%%%%%%%%%%%%%%%%%%%%%%%%%%%%%%%%%%%%%%j%%%%%%%%%%%%%
409H7%%%%%%%%%%%%%%%%%%%%%%%%%%j%%%%%%%%%%%%%%%%%%%%%%%%%%%%%%%%%%%%%%%%j%%%
401H5%%%%%%%%%%%%%%%%%%%%%%%%%%%%%%%%%%%%%%%%%%%j%%%%%Jj%%%%%%%%%%%%%%%%%%%%
394H4%%%%%%%%%%%%%%%%%%%%%%%%%%%%%%%%%%j%%%%%%%%%%%%%%%%%%%%%%%%%%%%%%%%%%%%
386H3%%%%%%%%%%%%%%%%%%%%%%%%%%%%%%%%j%%%%%%%%%%%%%%%%%%%%%%%%%%%%%%%%%%%%%%
379H2%%%%%%%%%%%%%%%%%%%%%%%%%%%%j%%%%%%%%%%%%%%%%%%%%%%%%%%%%%%%%%%%%%%%%%%
371H1%%%%%%%%%%%%%%%%%%%%%%%%%%%j%%%%%%%%%%%%%%%%%%%%%%%%%%%%%%%%%%%%%%%%%%%
364H0%%%%%%%%%%%%%%%%%%%%j%%%%%%%%%%%%%%%%%%%%%%%%%%%%%%%%%%%%%%%%%%%%%%%%%%
$$ plain form
356 79 79 79 78 78 78 78 78 78 78 78 78 78 78 78 78 78 78 78 78 78 78 78 78 78 78 78 78 78 78 78 78 78 78 78 78 78 78 78 78 78 78 78 78 78 78 78 78 78 78 78 78 78 78 78 78 78 78 78 78 77 77 78 78 77 77 77 77 77 77 77 77
349 77 77 77 77 77 77 77 77 77 77 77 77 77 77 77 77 77 77 77 77 77 77 77 77 77 77 77 77 77 77 77 77 77 77 77 77 77 77 77 77 77 77 77 77 77 77 77 77 77 76 76 76 76 76 76 76 76 76 76 76 76 76 76 76 76 76 76 76 76 76 76 76
341 76 76 76 76 76 76 76 76 76 76 76 76 76 76 76 76 76 76 76 76 76 76 76 76 76 76 76 76 76 76 76 76 75 75 75 75 75 75 75 75 75 75 75 75 75 75 75 75 75 75 75 75 75 75 75 75 75 75 75 75 75 75 75 75 75 75 75 75 75 75 75 75
334 75 75 75 75 75 75 75 75 75 75 75 75 75 75 75 75 75 75 75 75 75 75 75 76 76 76 75 75 75 75 75 75 75 75 75 75 75 75 76 76 76 76 76 76 77 77 78 78 79 80 82 84 86 89 92 95 99 102 104 104 104 102 100 97 95 93 91 89 88 86 85 84
326 84 84 83 82 82 81 81 80 80 79 79 79 78 78 78 78 77 77 77 77 77 77 77 77 77 77 76 76 76 76 76 76 76 76 75 75 75 75 75 75 75 75 75 75 75 75 75 75 74 74 74 74 74 74 74 74 74 74 74 74 74 74 74 74 74 74 74 74 74 74 74 74
319 74 74 74 74 74 73 73 73 73 73 73 73 73 73 73 73 73 73 73 73 73 73 73 73 73 73 73 73 73 73 73 73 73 73 73 73 73 73 73 73 73 73 73 73 73 73 73 73 73 73 73 72 72 72 72 72 72 72 72 72 72 72 72 72 72 72 72 72 72 72 72 72
311 72 72 72 72 72 72 72 72 72 72 72 72 72 72 72 72 72 72 72 72 72 72 72 72 71 71 71 71 71 71 71 71 71 71 71 71 71 71 71 71 71 71 71 71 71 71 71 71 71 71 71 71 71 71 71 71 71 71 71 71 71 71 71 71 71 71 71 71 71 71 71 71
304 71 71 71 71 71 71 71 71 71 71 71 71 71 71 71 71 71 71 71 71 71 71 71 71 70 71 71 71 71 70 70 71 71 70 70 71 71 71 71 71 71 71 71 71 71 72 72 72 73 73 74 75 75 76 76 76 76 75 75 74 74 74 73 73 73 72 72 72 72 72 71 71
$$ packed form
356G9%%j%%%%%%%%%%%%%%%%%%%%%%%%%%%%%%%%%%%%%%%%%%%%%%%%%%%%%%%%j%J%j%%%%%%%
349G7%%%%%%%%%%%%%%%%%%%%%%%%%%%%%%%%%%%%%%%%%%%%%%%%j%%%%%%%%%%%%%%%%%%%%%%
341G6%%%%%%%%%%%%%%%%%%%%%%%%%%%%%%%j%%%%%%%%%%%%%%%%%%%%%%%%%%%%%%%%%%%%%%%
334G5%%%%%%%%%%%%%%%%%%%%%%J%%j%%%%%%%%%%%J%%%%%J%J%JJKKKLLLMLK%%kklkkkkjkjj
326H4%jj%j%j%j%%j%%%j%%%%%%%%%j%%%%%%%j%%%%%%%%%%%%%j%%%%%%%%%%%%%%%%%%%%%%%
319G4%%%%j%%%%%%%%%%%%%%%%%%%%%%%%%%%%%%%%%%%%%%%%%%%%%j%%%%%%%%%%%%%%%%%%%%
311G2%%%%%%%%%%%%%%%%%%%%%%%j%%%%%%%%%%%%%%%%%%%%%%%%%%%%%%%%%%%%%%%%%%%%%%%
304G1%%%%%%%%%%%%%%%%%%%%%%%jJ%%%j%J%j%J%%%%%%%%%J%%J%JJ%J%%%j%j%%j%%j%%%%j%
$$ plain form
296 71 71 71 71 71 71 71 71 71 70 70 70 70 70 70 70 70 70 70 70 70 70 70 70 70 70 70 70 70 70 70 70 70 70 70 69 69 69 69 69 69 69 69 69 69 69 69 69 69 69 69 69 69 69 69 69 69 69 69 69 69 69 69 69 69 69 69 69 69 69 69 69
288 69 69 69 69 69 69 69 69 69 69 68 68 68 68 68 68 68 68 68 68 68 68 68 68 68 68 68 68 68 68 68 68 68 68 68 68 68 68 68 68 68 68 68 68 68 68 68 68 68 68 68 68 68 68 68 68 68 68 68 68 68 68 68 68 68 68 68 68 68 68 68 68
281 68 68 69 69 69 70 70 71 71 71 71 71 71 71 71 70 70 70 69 69 69 69 69 69 69 69 68 68 68 68 68 68 68 68 68 68 68 68 68 68 68 68 68 67 67 67 67 67 67 67 67 67 67 67 67 67 67 67 67 67 67 67 67 67 67 67 67 67 67 67 67 67
273 67 67 67 67 67 67 67 67 67 67 67 67 67 67 67 67 67 67 67 67 67 67 67 67 67 67 67 66 66 66 66 66 66 66 66 66 66 66 66 66 66 66 66 66 66 66 66 66 66 66 66 66 66 66 66 66 66 66 66 66 66 66 66 66 66 66 66 66 66 66 66 66
266 66 66 67 67 67 67 67 66 66 66 66 66 66 66 66 66 66 66 66 66 66 66 66 66 66 66 66 66 66 66 66 66 66 66 66 66 66 66 66 66 66 66 66 66 66 66 65 65 65 65 65 65 65 65 65 65 65 65 65 65 65 65 65 65 65 65 65 65 65 65 65 65
258 65 65 65 65 65 65 65 65 65 65 65 65 65 65 65 65 65 65 65 65 65 65 65 65 65 65 65 65 65 65 65 65 65 65 65 65 65 65 65 65 65 65 65 65 65 65 65 65 65 65 65 65 65 65 65 65 64 64 64 64 64 64 64 64 64 64 64 64 64 64 64 64
251 64 64 64 64 64 64 64 64 64 64 64 64 64 64 64 64 64 64 64 64 64 64 64 64 64 64 64 64 64 64 64 64 64 64 64 64 64 64 64 64 64 64 64 64 64 64 64 64 64 64 64 64 64 64 64 64 64 64 64 64 64 64 64 64 64 64 63 63 63 63 63 63
243 63 63 63 63 63 63 63 63 63 63 63 63 63 63 63 63 63 63 63 63 63 63 63 63 63 63 63 63 63 63 63 63 63 63 63 63 63 63 63 63 63 63 63 63 64 64 64 64 64 64 64 65 65 65 66 66 66 66 66 66 65 65 65 65 64 64 64 64 64 64 64 64
$$ packed form
296G1%%%%%%%%j%%%%%%%%%%%%%%%%%%%%%%%%%j%%%%%%%%%%%%%%%%%%%%%%%%%%%%%%%%%%%%
288F9%%%%%%%%%j%%%%%%%%%%%%%%%%%%%%%%%%%%%%%%%%%%%%%%%%%%%%%%%%%%%%%%%%%%%%%
281F8%J%%J%J%%%%%%%j%%j%%%%%%%j%%%%%%%%%%%%%%%%j%%%%%%%%%%%%%%%%%%%%%%%%%%%%
273F7%%%%%%%%%%%%%%%%%%%%%%%%%%j%%%%%%%%%%%%%%%%%%%%%%%%%%%%%%%%%%%%%%%%%%%%
266F6%J%%%%j%%%%%%%%%%%%%%%%%%%%%%%%%%%%%%%%%%%%%%j%%%%%%%%%%%%%%%%%%%%%%%%%
258F5%%%%%%%%%%%%%%%%%%%%%%%%%%%%%%%%%%%%%%%%%%%%%%%%%%%%%%%j%%%%%%%%%%%%%%%
251F4%%%%%%%%%%%%%%%%%%%%%%%%%%%%%%%%%%%%%%%%%%%%%%%%%%%%%%%%%%%%%%%%%j%%%%%
243F3%%%%%%%%%%%%%%%%%%%%%%%%%%%%%%%%%%%%%%%%%%%J%%%%%%J%%J%%%%%j%%%j%%%%%%%
$$ plain form
236 64 63 63 63 63 63 63 63 63 63 63 63 63 63 63 63 63 63 63 63 63 63 63 63 63 63 63 63 63 63 62 62 62 62 62 62 62 62 62 62 62 62 62 62 62 62 62 62 62 62 62 62 62 62 62 62 62 62 62 62 62 62 62 62 62 62 62 62 62 62 62 62
228 62 62 62 62 62 62 62 62 62 62 62 62 62 62 62 62 62 62 62 62 62 62 62 62 62 62 62 62 62 62 62 62 62 62 62 62 62 62 62 62 62 62 62 62 62 62 62 62 62 62 62 62 62 62 62 62 62 62 62 62 62 62 62 62 62 62 62 62 62 62 62 62
221 62 63 63 63 63 64 64 65 65 65 64 64 64 64 63 63 63 63 63 63 63 63 62 62 62 62 62 62 62 62 62 62 61 61 61 61 61 61 61 61 61 61 61 61 61 61 61 61 62 62 62 62 62 62 62 62 62 62 62 62 62 62 62 62 62 61 61 61 61 61 61 61
213 61 61 61 61 61 61 61 61 61 61 61 61 60 60 60 60 61 61 60 60 60 60 60 60 60 60 60 60 60 60 60 60 60 60 60 60 60 60 60 60 60 60 60 60 60 60 60 60 60 60 60 60 60 60 60 60 60 60 60 60 60 60 60 60 60 60 60 60 60 60 60 60
206 60 60 60 60 60 60 60 60 60 60 60 60 60 60 60 60 60 60 60 60 60 60 60 60 60 60 60 60 60 59 59 59 59 59 59 59 59 59 59 59 59 59 59 59 59 59 59 59 59 59 59 59 59 59 59 59 59 59 59 59 59 59 59 59 59 59 59 60 60 60 60 60
198 60 60 60 61 61 61 61 61 61 61 62 62 63 64 64 66 67 67 68 69 69 68 68 67 66 65 65 64 64 63 63 62 62 62 62 62 62 62 61 61 61 61 61 61 61 60 60 60 60 60 60 60 60 59 59 59 59 59 59 59 59 59 59 59 59 59 59 59 59 59 59 59
191 59 59 58 58 58 58 58 58 58 58 58 58 58 58 58 58 58 58 58 58 58 58 58 58 58 58 58 58 58 58 58 58 58 58 58 58 58 58 58 58 58 58 58 58 58 58 58 58 58 58 58 58 58 58 58 58 58 58 58 58 58 58 58 58 57 57 57 57 57 57 57 57
183 57 57 57 57 57 57 57 57 57 57 57 57 57 57 57 57 57 57 57 57 57 57 57 57 57 57 57 57 57 57 57 57 57 57 57 57 57 57 57 57 57 57 57 57 57 57 57 57 57 57 57 57 57 57 57 57 57 57 57 57 57 57 57 57 57 57 57 57 57 57 57 57
$$ packed form
236F4j%%%%%%%%%%%%%%%%%%%%%%%%%%%%j%%%%%%%%%%%%%%%%%%%%%%%%%%%%%%%%%%%%%%%%%
228F2%%%%%%%%%%%%%%%%%%%%%%%%%%%%%%%%%%%%%%%%%%%%%%%%%%%%%%%%%%%%%%%%%%%%%%%
221F2J%%%J%J%%j%%%j%%%%%%%j%%%%%%%%%j%%%%%%%%%%%%%%%J%%%%%%%%%%%%%%%%j%%%%%%
213F1%%%%%%%%%%%j%%%J%j%%%%%%%%%%%%%%%%%%%%%%%%%%%%%%%%%%%%%%%%%%%%%%%%%%%%%
206F0%%%%%%%%%%%%%%%%%%%%%%%%%%%%j%%%%%%%%%%%%%%%%%%%%%%%%%%%%%%%%%%%%%J%%%%
198F0%%J%%%%%%J%JJ%KJ%JJ%j%jjj%j%j%j%%%%%%j%%%%%%j%%%%%%%j%%%%%%%%%%%%%%%%%%
191E9%j%%%%%%%%%%%%%%%%%%%%%%%%%%%%%%%%%%%%%%%%%%%%%%%%%%%%%%%%%%%%%j%%%%%%%
183E7%%%%%%%%%%%%%%%%%%%%%%%%%%%%%%%%%%%%%%%%%%%%%%%%%%%%%%%%%%%%%%%%%%%%%%%
$$ plain form
176 57 57 57 57 57 57 57 57 57 57 57 57 57 57 57 57 57 57 57 57 57 57 57 56 56 56 56 56 56 56 56 56 56 56 56 56 56 56 56 56 56 56 56 56 56 56 56 56 56 56 56 56 56 56 56 56 56 56 56 56 56 56 56 56 56 56 56 56 56 56 56 56
168 56 56 56 56 56 56 56 56 56 56 56 56 56 56 56 56 56 56 56 56 56 56 56 56 56 56 56 56 56 56 56 56 56 56 56 56 56 56 56 56 56 56 56 56 56 56 56 56 56 56 56 56 56 56 56 56 56 56 56 56 56 56 56 56 56 56 56 56 56 56 56 56
161 56 56 56 56 56 56 56 56 56 56 56 55 55 55 55 55 55 55 56 55 55 55 55 55 55 55 55 55 55 55 55 55 55 55 55 55 55 55 55 55 55 55 55 55 55 55 55 55 55 55 55 55 55 55 55 55 55 55 55 55 55 55 55 55 55 55 55 55 55 55 55 55
153 55 55 55 56 56 56 56 56 56 55 55 55 55 55 55 55 55 55 55 55 55 55 55 55 55 55 55 55 55 55 55 55 55 55 55 55 55 55 55 55 55 55 55 55 55 55 55 55 55 55 55 55 55 55 55 55 55 55 55 55 55 55 55 55 55 55 55 55 55 55 55 55
146 55 55 55 55 55 55 55 55 55 55 55 55 55 55 55 55 55 55 55 55 54 54 54 54 54 54 54 54 54 54 54 54 54 54 54 54 54 54 54 54 54 54 54 54 54 54 54 54 54 54 54 54 54 54 54 54 54 54 54 54 54 54 54 54 54 54 54 54 54 54 54 54
138 54 54 54 54 54 54 54 54 54 54 54 54 54 54 54 54 54 54 54 54 54 54 54 54 54 54 54 54 54 54 54 54 54 54 54 54 54 54 54 54 54 54 54 54 54 54 54 54 54 54 54 54 54 54 54 54 54 54 54 54 54 54 54 54 54 54 54 54 54 54 54 54
130 54 54 54 54 54 54 54 55 55 55 55 55 55 55 55 55 55 55 55 54 54 54 54 54 54 54 54 54 54 54 54 54 54 54 54 54 54 54 54 54 54 54 54 54 54 54 54 54 54 54 54 53 53 53 53 53 53 53 53 53 53 53 53 53 53 53 53 53 53 53 53 53
123 53 53 53 53 53 53 53 53 53 53 53 53 53 53 53 53 53 53 53 53 53 53 53 53 53 53 53 53 53 53 53 53 53 53 53 53 53 53 53 53 53 53 53 53 53 53 53 53 53 53 53 53 53 53 53 53 53 53 53 53 52 52 52 52 52 52 52 52 52 52 52 52
$$ packed form
176E7%%%%%%%%%%%%%%%%%%%%%%j%%%%%%%%%%%%%%%%%%%%%%%%%%%%%%%%%%%%%%%%%%%%%%%%
168E6%%%%%%%%%%%%%%%%%%%%%%%%%%%%%%%%%%%%%%%%%%%%%%%%%%%%%%%%%%%%%%%%%%%%%%%
161E6%%%%%%%%%%j%%%%%%Jj%%%%%%%%%%%%%%%%%%%%%%%%%%%%%%%%%%%%%%%%%%%%%%%%%%%%
153E5%%J%%%%%j%%%%%%%%%%%%%%%%%%%%%%%%%%%%%%%%%%%%%%%%%%%%%%%%%%%%%%%%%%%%%%
146E5%%%%%%%%%%%%%%%%%%%j%%%%%%%%%%%%%%%%%%%%%%%%%%%%%%%%%%%%%%%%%%%%%%%%%%%
138E4%%%%%%%%%%%%%%%%%%%%%%%%%%%%%%%%%%%%%%%%%%%%%%%%%%%%%%%%%%%%%%%%%%%%%%%
130E4%%%%%%J%%%%%%%%%%%j%%%%%%%%%%%%%%%%%%%%%%%%%%%%%%%j%%%%%%%%%%%%%%%%%%%%
123E3%%%%%%%%%%%%%%%%%%%%%%%%%%%%%%%%%%%%%%%%%%%%%%%%%%%%%%%%%%%j%%%%%%%%%%%
$$ plain form
115 52 52 52 52 52 52 52 52 52 52 52 52 52 52 52 52 52 52 52 52 52 52 52 52 52 52 52 52 52 52 52 52 52 52 52 52 52 52 52 52 52 52 52 52 52 52 52 52 52 52 52 52 52 52 52 52 52 52 52 52 52 52 52 52 52 52 52 52 52 52 52 52
108 52 52 52 52 52 52 52 52 52 52 52 52 52 52 52 52 52 52 52 52 52 52 52 52 52 52 52 52 51 51 52 52 52 52 52 52 52 51 51 51 51 51 51 51 52 52 52 52 52 52 51 51 51 51 51 51 51 51 51 51 51 51 51 51 51 51 51 51 51 51 51 51
100 51 51 51 51 51 51 51 51 51 51 51 51 51 51 51 51 51 51 51 51 51 51 51 51 51 51 51 51 51 51 51 51 51 51 51 51 51 51 51 51 51 51 51 51 51 51 51 51 51 51 51 51 51 51 51 51 51 51 51 51 51 51 51 51 51 51 51 51 51 51 51 51
93 51 51 51 51 51 51 51 51 51 51 51 51 51 51 51 51 51 51 51 51 51 51 51 51 51 51 51 51 51 51 51 51 51 51 51 51 51 51 51 51 51 51 51 51 51 51 51 51 51 51 51 51 51 51 51 51 51 51 51 51 51 51 51 51 51 51 51 51 51 51 51 51 51
85 51 51 51 51 51 51 51 51 51 51 51 50 50 50 50 50 50 50 50 50 50 50 50 50 50 50 50 50 50 50 50 50 50 50 50 50 50 50 50 50 50 50 50 50 50 50 50 50 50 50 50 50 50 50 50 50 50 50 50 50 50 50 50 50 50 50 50 50 50 50 50 50 50
78 50 50 50 50 50 50 50 50 50 50 50 50 50 50 50 50 50 50 50 50 50 50 50 50 50 50 50 50 50 50 50 50 50 50 50 50 50 50 50 50 50 50 50 50 50 50 50 50 50 50 50 50 50 50 50 50 50 50 50 50 50 50 50 50 50 50 50 50 50 50 50 50 50
70 50 50 50 50 50 50 50 50 50 50 50 50 50 50 50 50 50 50 50 50 50 50 50 50 49 49 49 49 49 49 49 49 49 49 49 49 49 49 49 49 49 49 49 49 49 49 49 49 49 49 49 49 49 49 49 49 49 49 49 49 49 49 49 49 49 49 49 49 49 49 49 49 49
62 49 49 49 49 49 49 49 49 49 49 49 49 49 49 49 49 49 49 49 49 49 49 49 49 49 49 49 49 49 49 49 49 49 49 49 49 49 49 49 49 49 49 49 49 49 49 49 49 49 49 49 49 49 49 49 49 49 49 49 49 49 49 49 49 49 49 49 49 49 49 49 49 49
$$ packed form
115E2%%%%%%%%%%%%%%%%%%%%%%%%%%%%%%%%%%%%%%%%%%%%%%%%%%%%%%%%%%%%%%%%%%%%%%%
108E2%%%%%%%%%%%%%%%%%%%%%%%%%%%j%J%%%%%%j%%%%%%J%%%%%j%%%%%%%%%%%%%%%%%%%%%
100E1%%%%%%%%%%%%%%%%%%%%%%%%%%%%%%%%%%%%%%%%%%%%%%%%%%%%%%%%%%%%%%%%%%%%%%%
93E1%%%%%%%%%%%%%%%%%%%%%%%%%%%%%%%%%%%%%%%%%%%%%%%%%%%%%%%%%%%%%%%%%%%%%%%%
85E1%%%%%%%%%%j%%%%%%%%%%%%%%%%%%%%%%%%%%%%%%%%%%%%%%%%%%%%%%%%%%%%%%%%%%%%%
78E0%%%%%%%%%%%%%%%%%%%%%%%%%%%%%%%%%%%%%%%%%%%%%%%%%%%%%%%%%%%%%%%%%%%%%%%%
70E0%%%%%%%%%%%%%%%%%%%%%%%j%%%%%%%%%%%%%%%%%%%%%%%%%%%%%%%%%%%%%%%%%%%%%%%%
62D9%%%%%%%%%%%%%%%%%%%%%%%%%%%%%%%%%%%%%%%%%%%%%%%%%%%%%%%%%%%%%%%%%%%%%%%%
$$ plain form
55 49 49 49 49 49 49 49 49 49 48 48 48 48 48 48 48 48 48 48 48 48 48 48 48 48 48 48 48 48 48 48 48 48 48 48 48 48 48 48 48 48 48 48 48 48 48 48 48 48 48 48 48 48 48 48 48 48 48 48 48 48 48 48 48 48 48 48 48 48 48 48 48 48
47 48 48 48 48 48 48 48 48 48 48 48 48 48 48 48 48 48 48 48 48 48 48 48 48 48 48 48 48 48 48 48 48 48 48 48 48 48 48 48 48 48 48 48 48 48 48 48 48 48 48 48 48 48 48 48 48 48 48 48 48 48 48 48 48 48 48 48 48 48 48 48 48 48
39 48 48 48 48 48 48 48 48 48 48 48 48 48 48 48 48 48 47 47 47 47 47 48 48 48 48 47 47 47 47 47 47 47 47 47 47 47 47 47 47 47 47 47 47 47 47 47 47 47 47 47 47 47 47 47 47 47 47 47 47 47 47 47 47 47 47 47 47 47 47 47 47 47
32 47 47 47 47 47 47 47 47 47 47 47 47 47 47 47 47 47 47 47 47 47 47 47 47 47 47 47 47 47 47 47 47 47 47 47 47 47 47 47 47 47 47 47 47 47 47 47 47 47 47 47 47 47 47 47 47 47 47 47 47 47 47 47 47 47 47 47 47 47 47 47 47 47
24 47 47 47 47 47 47 47 47 47 47 47 47 47 47 47 47 47 47 47 47 47 47 47 47 47 47 47 47 47 47 47 47 47 47 47 47 47 47 47 47 47 47 47 47 47 47 47 47 47 47 47 47 47 47 47 47 47 47 47 47 47 47 47 47 46 46 46 46 46 46 46 46 46
17 46 46 46 46 46 46 46 46 46 46 46 46 46 46 46 46 46 46 46 46 46 46 46 46 46 46 46 46 46 46 46 46 46 46 46 46 46 46 46 46 46 46 46 46 46 46 46 46 46 46 46 46 46 46 46 46 46 46 46 46 46 46 46 46 46 46 46 46 46 46 46 46 46
9 46 46 46 46 46 46 46 46 46 46 46 46 46 46 46 46 46 46 46 46 46 46 46 46 46 46 46 46 46 46 46 46 46 46 46 46 46 46 46 46 46 46 46 46 46 46 46 46 46 46 45 45 45 45 45 45 45 45 45 45 45 45 45 45 45 45 45 45 45 45 45 45 45 45
1 45 45 45 45 45 45 45 45 45 45 45 45 45 45 45 45 45 45 45 45 45 45 45 45 45 45 45 45 45 45 45 45 45 45 45 45 45 45 45 45 45 45 45 45 45 45 45 45 45 45 45 45 45 45 45 45 45 45 45 45 45 45 45 45 45 45 45 45 45 45 45 45 45 45
$$ packed form
55D9%%%%%%%%j%%%%%%%%%%%%%%%%%%%%%%%%%%%%%%%%%%%%%%%%%%%%%%%%%%%%%%%%%%%%%%%
47D8%%%%%%%%%%%%%%%%%%%%%%%%%%%%%%%%%%%%%%%%%%%%%%%%%%%%%%%%%%%%%%%%%%%%%%%%
39D8%%%%%%%%%%%%%%%%j%%%%J%%%j%%%%%%%%%%%%%%%%%%%%%%%%%%%%%%%%%%%%%%%%%%%%%%
32D7%%%%%%%%%%%%%%%%%%%%%%%%%%%%%%%%%%%%%%%%%%%%%%%%%%%%%%%%%%%%%%%%%%%%%%%%
24D7%%%%%%%%%%%%%%%%%%%%%%%%%%%%%%%%%%%%%%%%%%%%%%%%%%%%%%%%%%%%%%%j%%%%%%%%
17D6%%%%%%%%%%%%%%%%%%%%%%%%%%%%%%%%%%%%%%%%%%%%%%%%%%%%%%%%%%%%%%%%%%%%%%%%
9D6%%%%%%%%%%%%%%%%%%%%%%%%%%%%%%%%%%%%%%%%%%%%%%%%%j%%%%%%%%%%%%%%%%%%%%%%%
1D5%%%%%%%%%%%%%%%%%%%%%%%%%%%%%%%%%%%%%%%%%%%%%%%%%%%%%%%%%%%%%%%%%%%%%%%%%
$$ plain form
-7 45 45 45 45 45 45 45 45 45 45 45 45 45 45 45 45 45 45 45 45 45 45 45 45 45 45 45 45 45 45 45 45 45 45 45 45 45 45 45 45 45 45 45 45 45 45 45 45 45 45 45 45 45 45 45 45 45 45 45 45 45 45 45 45 45 45 45 45 45 45 45 45 45
-14 45 45 45 45 45 44 45 45 45 45 45 45 45 45 45 45 44 44 45 45 45 45 45 44 44 44 44 44 44 44 44 44 44 44 44 44 44 44 44 44 44 44 44 44 44 45 44 44 44 44 44 44 44 44 44 44 44 44 44 44 44 44 44 44 44 44 44 44 44 44 44 44
-22 44 44 44 44 44 44 44 44 44 44 44 44 44 44 44 44 44 44 44 44 44 44 44 44 44 44 44 44 44 44 44 44 44 44 44 44 44 44 44 44 44 44 44 44 44 44 44 44 44 44 44 44 44 44 44 44 44 44 44 44 44 44 44 44 44 44 44 44 44 44 44 44
-29 44 44 44 44 44 44 44 44 44 44 44 44 44 44 44 44 44 44 44 44 44 44 44 44 44 44 44 44 44 44 44 44 44 44 44 44 44 44 44 44 44 44 44 44 44 44 44 44 44 44 44 44 44 44 44 44 44 44 44 44 44 44 44 44 44 44 44 44 44 44 44 44
-37 44 44 44 44 44 44 44 44 44 43 43 43 43 43 43 44 44 44 44 44 44 43 43 43 43 43 43 43 43 43 43 43 43 43 43 43 43 43 43 43 43 43 43 43 43 43 43 43 43 43 43 43 43 43 43 43 43 43 43 43 43 43 43 43 43 43 43 43 43 43 43 43
-44 43 43 43 43 43 43 43 43 43 43 43 43 43 43 43 43 43 43 43 43 43 43 43 43 43 43 43 43 43 43 43 43 43 43 43 43 43 43 43 43 43 43 43 43 43 43 43 43 43 43 43 43 43 43 43 43 43 43 43 43 43 43 43 43 43 43 43 43 43 43 43 43
-52 43 43 43 43 43 43 43 43 43 43 43 43 43 43 43 43 43 43 43 43 43 43 43 43 43 43 43 43 43 43 43 43 43 43 43 43 43 43 43 43 43 43 43 43 43 43 43 43 43 43 43 43 43 43 43 43 43 43 43 43 43 43 43 43 43 43 43 43 43 43 43 43
-59 43 43 43 43 43 43 43 43 43 43 43 43 43 43 43 43 43 43 43 43 43 42 42 43 42 42 42 42 42 42 42 42 42 42 42 42 42 43 42 42 42 42 42 42 42 42 42 42 42 42 42 42 42 42 42 42 42 42 42 42 42 42 42 42 42 42 42 42 42 42 42 42
$$ packed form
-7D5%%%%%%%%%%%%%%%%%%%%%%%%%%%%%%%%%%%%%%%%%%%%%%%%%%%%%%%%%%%%%%%%%%%%%%%%
-14D5%%%%jJ%%%%%%%%%j%J%%%%j%%%%%%%%%%%%%%%%%%%%%Jj%%%%%%%%%%%%%%%%%%%%%%%%%
-22D4%%%%%%%%%%%%%%%%%%%%%%%%%%%%%%%%%%%%%%%%%%%%%%%%%%%%%%%%%%%%%%%%%%%%%%%
-29D4%%%%%%%%%%%%%%%%%%%%%%%%%%%%%%%%%%%%%%%%%%%%%%%%%%%%%%%%%%%%%%%%%%%%%%%
-37D4%%%%%%%%j%%%%%J%%%%%j%%%%%%%%%%%%%%%%%%%%%%%%%%%%%%%%%%%%%%%%%%%%%%%%%%
-44D3%%%%%%%%%%%%%%%%%%%%%%%%%%%%%%%%%%%%%%%%%%%%%%%%%%%%%%%%%%%%%%%%%%%%%%%
-52D3%%%%%%%%%%%%%%%%%%%%%%%%%%%%%%%%%%%%%%%%%%%%%%%%%%%%%%%%%%%%%%%%%%%%%%%
-59D3%%%%%%%%%%%%%%%%%%%%j%Jj%%%%%%%%%%%%Jj%%%%%%%%%%%%%%%%%%%%%%%%%%%%%%%%%
$$ plain form
-67 42 42 42 42 42 42 42 42 42 42 42 42 42 42 42 42 42 42 42 42 42 42 42 42 42 42 42 42 42 42 42 42 42 42 42 42 42 42 42 42 42 42 42 42 42 42 42 42 42 42 42 42 42 42 42 42 42 42 42 42 42 42 42 42 42 42 42 42 42 42 42 42
-74 42 42 42 42 42 42 42 42 42 42 42 42 42 42 42 42 42 42 42 42 42 42 42 42 42 42 42 42 42 42 42 42 42 42 42 42 42 42 42 42 42 42 42 42 42 42 42 42 42 42 42 42 42 42 42 42 42 42 42 42 42 42 42 42 42 42 42 42 42 42 42 42
-82 42 42 42 42 42 42 42 42 42 42 42 42 42 42 42 42 42 42 42 42 42 42 42 42 42 42 42 42 42 42 42 42 42 42 42 42 42 42 42 42 42 42 42 42 42 42 42 42 42 42 42 42 42 42 42 42 42 42 42 42 42 42 42 42 42 42 42 42 42 42 42 42
-89 42 42 42 42 42 42 42 42 42 42 42 42 42 42 42 42 42 42 42 42 42 42 41 41 41 42 41 41 41 41 41 41 41 41 41 41 41 41 41 41 41 41 41 41 41 41 41 41 41 41 41 41 41 41 41 41 41 41 41 41 41 41 41 41 41 41 41 41 41 41 41 41
-97 41 41 41 41 41 41 41 41 41 41 41 41 41 41 41 41 41 41 41 41 41 41 41 41 41 41 41 41 41 41 41 41 41 41 41 41 41 41 41 41 41 41 41 41 41 41 41 41 41 41 41 41 41 41 41 41 41 41 41 41 41 41 41 41 41 41 41 41 41 41 41 41
-104 41 41 41 41 41 41 41 41 41 41 41 41 41 41 41 41 41 41 41 41 41 41 41 41 41 41 41 41 41 41 41 41 41 41 41 41 41 41 41 41 41 41 41 41 41 41 41 41 41 41 41 41 41 41 41 41 41 41 41 41 41 41 41 41 41 41 41 41 41 41 41
-112 41 41 41 41 41 41 41 41 41 41 41 41 41 41 41 41 41 41 41 41 41 41 41 41 41 41 41 41 41 41 41 40 40 40 40 41 41 41 41 41 41 41 41 41 41 41 41 41 41 41 40 40 40 40 40 40 40 41 41 41 40 40 40 40 40 41 41 41 41 41 41
-119 41 40 40 40 40 40 40 40 40 40 40 40 40 40 40 40 40 40 40 40 40 40 40 40 40 40 40 40 40 40 40 40 40 40 40 40 40 40 40 40 40 40 40 41 41 41 41 41 40 40 40 40 40 40 40 40 40 40 40 40 40 40 40 40 40 40 40 40 40 40 40
$$ packed form
-67D2%%%%%%%%%%%%%%%%%%%%%%%%%%%%%%%%%%%%%%%%%%%%%%%%%%%%%%%%%%%%%%%%%%%%%%%
-74D2%%%%%%%%%%%%%%%%%%%%%%%%%%%%%%%%%%%%%%%%%%%%%%%%%%%%%%%%%%%%%%%%%%%%%%%
-82D2%%%%%%%%%%%%%%%%%%%%%%%%%%%%%%%%%%%%%%%%%%%%%%%%%%%%%%%%%%%%%%%%%%%%%%%
-89D2%%%%%%%%%%%%%%%%%%%%%j%%Jj%%%%%%%%%%%%%%%%%%%%%%%%%%%%%%%%%%%%%%%%%%%%%
-97D1%%%%%%%%%%%%%%%%%%%%%%%%%%%%%%%%%%%%%%%%%%%%%%%%%%%%%%%%%%%%%%%%%%%%%%%
-104D1%%%%%%%%%%%%%%%%%%%%%%%%%%%%%%%%%%%%%%%%%%%%%%%%%%%%%%%%%%%%%%%%%%%%%%
-112D1%%%%%%%%%%%%%%%%%%%%%%%%%%%%%%j%%%J%%%%%%%%%%%%%%j%%%%%%J%%j%%%%J%%%%%
-119D1j%%%%%%%%%%%%%%%%%%%%%%%%%%%%%%%%%%%%%%%%%J%%%%j%%%%%%%%%%%%%%%%%%%%%%
$$ plain form
-127 40 40 40 40 40 40 40 40 40 40 40 40 40 40 40 40 40 40 40 40 40 40 40 40 40 40 40 40 40 40 40 40 40 40 40 40 40 40 40 40 40 40 40 40 40 40 40 40 40 40 40 40 40 40 40 40 40 40 40 40 40 40 40 40 40 40 40 40 40 40 40
-134 40 40 40 40 40 40 40 40 40 40 40 40 40 40 40 40 40 40 40 40 40 40 40 40 40 40 40 40 40 40 40 40 40 40 40 40 40 40 40 40 40 40 40 40 40 40 40 40 40 40 40 40 40 40 40 40 40 40 40 40 40 40 40 40 40 40 40 40 40 40 40
-142 40 40 40 40 40 40 40 40 40 40 40 40 40 40 40 40 40 40 40 40 40 40 40 40 40 40 40 40 40 40 40 40 40 40 40 40 40 40 40 40 40 40 40 40 40 40 40 40 40 40 40 40 40 40 40 40 40 40 40 40 40 40 40 40 40 40 40 40 40 40 40
-149 40 40 40 40 40 40 40 40 40 40 40 40 40 40 40 40 40 40 40 40 40 40 40 40 40 40 40 40 40 40 40 40 40 40 40 40 40 40 40 39 40 40 40 40 39 39 39 39 39 39 39 39 39 39 39 39 39 39 39 39 39 39 39 39 39 39 39 39 39 39 39
-156 39 39 39 39 39 39 39 39 39 39 39 39 39 39 39 39 39 39 39 39 39 39 39 39 39 39 39 39 39 39 39 39 39 39 39 39 39 39 39 39 39 39 39 39 39 39 39 39 39 39 39 39 39 39 39 39 39 39 39 39 39 39 39 39 39 39 39 39 39 39 39
-164 39 39 39 39 39 39 39 39 39 39 39 39 39 39 39 39 39 39 39 39 39 39 39 39 39 39 39 39 39 39 39 39 39 39 39 39 39 39 39 39 39 39 39 39 39 39 39 39 39 39 39 39 39 39 39 39 39 39 39 39 39 39 39 39 39 39 39 39 39 39 39
-171 39 39 39 39 39 39 39 39 39 39 39 39 39 39 39 39 39 39 39 39 39 39 39 39 39 39 39 39 39 39 39 39 39 39 39 39 39 39 39 39 38 38 39 39 39 39 39 39 39 39 39 39 39 39 39 39 39 39 39 39 39 38 38 38 39 39 39 39 39 39 39
-179 39 39 39 39 39 39 39 39 39 39 39 39 39 39 39 39 39 39 38 38 38 38 38 38 38 38 38 38 38 38 38 38 38 38 38 38 38 38 38 38 38 39 39 38 38 38 38 38 38 38 38 38 38 38 38 38 38 38 38 38 38 38 38 38 38 38 38 38 38 38 38
$$ packed form
-127D0%%%%%%%%%%%%%%%%%%%%%%%%%%%%%%%%%%%%%%%%%%%%%%%%%%%%%%%%%%%%%%%%%%%%%%
-134D0%%%%%%%%%%%%%%%%%%%%%%%%%%%%%%%%%%%%%%%%%%%%%%%%%%%%%%%%%%%%%%%%%%%%%%
-142D0%%%%%%%%%%%%%%%%%%%%%%%%%%%%%%%%%%%%%%%%%%%%%%%%%%%%%%%%%%%%%%%%%%%%%%
-149D0%%%%%%%%%%%%%%%%%%%%%%%%%%%%%%%%%%%%%%jJ%%%j%%%%%%%%%%%%%%%%%%%%%%%%%%
-156C9%%%%%%%%%%%%%%%%%%%%%%%%%%%%%%%%%%%%%%%%%%%%%%%%%%%%%%%%%%%%%%%%%%%%%%
-164C9%%%%%%%%%%%%%%%%%%%%%%%%%%%%%%%%%%%%%%%%%%%%%%%%%%%%%%%%%%%%%%%%%%%%%%
-171C9%%%%%%%%%%%%%%%%%%%%%%%%%%%%%%%%%%%%%%%j%J%%%%%%%%%%%%%%%%%%j%%J%%%%%%
-179C9%%%%%%%%%%%%%%%%%j%%%%%%%%%%%%%%%%%%%%%%J%j%%%%%%%%%%%%%%%%%%%%%%%%%%%
$$ plain form
-186 38 38 38 38 38 38 38 38 38 38 38 38 38 38 38 38 38 38 38 38 38 38 38 38 38 38 38 38 38 38 38 38 38 38 38 38 38 38 38 38 38 38 38 38 38 38 38 38 38 38 38 38 38 38 38 38 38 38 38 38 38 38 38 38 38 38 38 38 38 38 38
-193 38 38 38 38 38 38 38 38 38 38 38 38 38 38 38 38 38 38 38 38 38 38 38 38 38 38 38 38 38 38 38 38 38 38 38 38 38 38 38 38 38 38 38 38 38 38 38 38 38 38 38 38 38 38 38 38 38 38 38 38 38 38 38 38 38 38 38 38 38 38 38
-201 38 38 38 38 38 38 38 38 38 38 38 38 38 38 38 38 38 38 38 38 38 38 38 38 38 38 38 38 38 38 38 38 38 38 38 38 38 38 38 38 38 38 38 38 38 38 38 38 38 38 38 38 38 38 38 38 38 38 38 38 38 38 38 38 38 38 38 38 38 38 38
-208 38 38 38 38 38 38 38 38 38 38 38 38 38 38 38 38 38 38 38 38 38 38 38 38 38 38 38 38 38 38 38 38 38 38 38 38 38 38 38 38 38 38 38 38 38 38 38 38 38 38 38 38 38 38 38 38 38 38 38 38 38 38 38 38 38 38 38 38 37 37 37
-216 37 37 37 38 38 38 37 37 38 38 38 38 38 38 38 38 38 38 38 38 38 38 37 37 38 38 38 37 37 37 37 38 37 37 37 37 37 37 37 37 37 38 37 37 37 37 37 37 37 37 37 37 37 37 37 37 37 37 37 37 37 37 37 37 37 37 37 37 37 37 37
-223 37 37 37 37 37 37 37 37 37 37 37 37 37 37 37 37 37 37 37 37 37 37 37 37 37 37 37 37 37 37 37 37 37 37 37 37 37 37 37 37 37 37 37 37 37 37 37 37 37 37 37 37 37 37 37 37 37 37 37 37 37 37 37 37 37 37 37 37 37 37 37
-231 37 37 37 37 37 37 37 37 37 37 37 37 37 37 37 37 37 37 37 37 37 37 37 37 37 37 37 37 37 37 37 37 37 37 37 37 37 37 37 37 37 37 37 37 37 37 37 37 37 37 37 37 37 37 37 37 37 37 37 37 37 37 37 37 37 37 37 37 37 37 37
-238 37 37 37 37 37 37 37 37 37 37 37 37 37 37 37 37 37 37 37 37 37 37 37 37 37 37 37 37 37 37 37 37 37 37 37 37 37 37 37 37 37 37 37 37 37 37 37 37 37 37 37 37 37 37 37 37 37 37 37 37 37 37 37 37 37 37 37 37 37 37 37
$$ packed form
-186C8%%%%%%%%%%%%%%%%%%%%%%%%%%%%%%%%%%%%%%%%%%%%%%%%%%%%%%%%%%%%%%%%%%%%%%
-193C8%%%%%%%%%%%%%%%%%%%%%%%%%%%%%%%%%%%%%%%%%%%%%%%%%%%%%%%%%%%%%%%%%%%%%%
-201C8%%%%%%%%%%%%%%%%%%%%%%%%%%%%%%%%%%%%%%%%%%%%%%%%%%%%%%%%%%%%%%%%%%%%%%
-208C8%%%%%%%%%%%%%%%%%%%%%%%%%%%%%%%%%%%%%%%%%%%%%%%%%%%%%%%%%%%%%%%%%%%j%%
-216C7%%J%%j%J%%%%%%%%%%%%%j%J%%j%%%Jj%%%%%%%%Jj%%%%%%%%%%%%%%%%%%%%%%%%%%%%
-223C7%%%%%%%%%%%%%%%%%%%%%%%%%%%%%%%%%%%%%%%%%%%%%%%%%%%%%%%%%%%%%%%%%%%%%%
-231C7%%%%%%%%%%%%%%%%%%%%%%%%%%%%%%%%%%%%%%%%%%%%%%%%%%%%%%%%%%%%%%%%%%%%%%
-238C7%%%%%%%%%%%%%%%%%%%%%%%%%%%%%%%%%%%%%%%%%%%%%%%%%%%%%%%%%%%%%%%%%%%%%%
$$ plain form
-245 37 37 37 37 37 37 37 37 37 37 37 37 37 37 36 36 36 36 36 36 36 36 36 36 36 36 36 36 36 36 36 36 36 36 36 36 36 36 36 36 36 36 36 36 36 36 36 36 36 36 36 36 36 36 36 36 36 36 36 36 36 36 36 36 36 36 36 36 36 36 36
-253 36 36 36 36 36 36 36 36 36 36 36 36 36 36 36 36 36 36 36 36 36 36 36 36 36 36 36 36 36 36 36 36 36 36 36 36 36 36 36 36 36 36 36 36 36 36 36 36 36 36 36 36 36 36 36 36 36 36 36 36 36 36 36 36 36 36 36 36 36 36 36
-260 36 36 36 36 36 36 36 36 36 36 36 36 36 36 36 36 36 36 36 36 36 36 36 36 36 36 36 36 36 36 36 36 36 36 36 36 36 36 36 36 36 36 36 36 36 36 36 36 36 36 36 36 36 36 36 36 36 36 36 36 36 36 36 36 36 36 36 36 36 36 36
-268 36 36 36 36 36 36 36 36 36 36 36 36 36 36 36 36 36 36 36 36 36 36 36 36 36 36 36 36 36 36 36 36 36 36 36 36 36 36 36 36 36 36 36 36 36 36 36 36 36 36 36 36 36 36 36 36 36 36 36 36 36 36 36 36 36 36 36 36 36 36 36
-275 36 36 36 36 36 36 36 36 36 36 36 36 36 36 36 36 36 36 36 36 36 36 36 36 36 36 36 36 36 36 36 36 36 36 36 36 36 36 36 36 36 36 36 36 36 36 35 35 36 36 36 36 36 36 36 36 35 35 35 35 35 35 35 36 36 36 36 35 35 35 35
-282 35 35 35 35 35 35 35 35 35 35 35 35 36 35 35 35 35 35 35 35 35 35 35 35 36 36 36 36 36 35 35 35 35 36 36 36 36 36 36 36 36 36 36 35 36 36 36 35 35 36 36 36 36 36 36 36 36 36 35 36 36 36 35 36 36 36 36 35 35 35 35
-290 35 35 35 35 35 35 35 35 35 35 35 36 36 36 36 36 36 36 36 36 36 36 36 36 36 36 36 36 36 36 36 35 35 35 35 35 35 35 35 35 35 35 35 35 35 35 36 36 36 35 35 36 36 36 35 35 35 35 35 35 35 35 35 35 35 35 35 35 35 35 35
-297 35 35 35 35 35 35 35 35 35 35 35 35 35 35 35 35 35 35 35 35 35 35 35 35 35 35 35 35 35 35 35 35 35 35 35 35 35 35 35 35 35 35 35 35 35 35 35 35 35 35 35 35 35 35 35 35 35 35 35 35 35 35 35 35 35 35 35 35 35 35 35
$$ packed form
-245C7%%%%%%%%%%%%%j%%%%%%%%%%%%%%%%%%%%%%%%%%%%%%%%%%%%%%%%%%%%%%%%%%%%%%%%
-253C6%%%%%%%%%%%%%%%%%%%%%%%%%%%%%%%%%%%%%%%%%%%%%%%%%%%%%%%%%%%%%%%%%%%%%%
-260C6%%%%%%%%%%%%%%%%%%%%%%%%%%%%%%%%%%%%%%%%%%%%%%%%%%%%%%%%%%%%%%%%%%%%%%
-268C6%%%%%%%%%%%%%%%%%%%%%%%%%%%%%%%%%%%%%%%%%%%%%%%%%%%%%%%%%%%%%%%%%%%%%%
-275C6%%%%%%%%%%%%%%%%%%%%%%%%%%%%%%%%%%%%%%%%%%%%%j%J%%%%%%%j%%%%%%J%%%j%%%
-282C5%%%%%%%%%%%Jj%%%%%%%%%%J%%%%j%%%J%%%%%%%%%jJ%%j%J%%%%%%%%jJ%%jJ%%%j%%%
-290C5%%%%%%%%%%J%%%%%%%%%%%%%%%%%%%j%%%%%%%%%%%%%%J%%j%J%%j%%%%%%%%%%%%%%%%
-297C5%%%%%%%%%%%%%%%%%%%%%%%%%%%%%%%%%%%%%%%%%%%%%%%%%%%%%%%%%%%%%%%%%%%%%%
$$ plain form
-305 35 35 35 35 35 35 35 35 35 35 35 35 35 35 35 35 35 35 35 35 35 35 35 35 35 35 35 35 35 35 35 35 35 35 35 35 35 35 35 35 35 35 35 35 35 35 35 35 35 35 35 35 35 35 35 35 35 35 35 35 35 35 35 35 35 35 35 35 35 35 35
-312 35 35 35 35 35 35 35 35 35 35 35 35 35 35 35 35 35 35 35 35 35 35 35 35 35 35 35 35 35 35 35 35 35 35 35 35 35 35 35 35 35 35 35 35 35 35 35 35 35 35 35 35 35 35 35 35 35 35 35 35 35 35 35 35 35 35 35 35 35 35 35
-320 35 35 35 35 35 35 35 35 35 35 35 35 35 35 35 35 35 35 35 35 35 35 35 35 35 35 35 35 35 35 35 35 35 35 35 35 35 35 35 35 35 35 35 35 35 35 35 35 35 35 35 35 35 35 35 35 35 35 35 35 35 34 34 34 34 35 35 35 35 35 35
-327 35 35 34 34 34 35 35 35 35 35 35 35 35 35 34 34 34 34 34 34 34 35 35 35 35 35 34 34 34 34 34 34 34 34 34 34 34 34 34 34 34 34 34 34 34 34 34 34 34 34 34 34 34 34 34 34 34 34 34 34 34 34 34 34 34 34 34 34 34 34 34
-334 34 34 34 34 34 34 34 34 34 34 34 34 34 34 34 34 34 34 34 34 34 34 34 34 34 34 34 34 34 34 34 34 34 34 34 34 34 34 34 34 34 34 34 34 34 34 34 34 34 34 34 34 34 34 34 34 34 34 34 34 34 34 34 34 34 34 34 34 34 34 34
-342 34 34 34 34 34 34 34 34 34 34 34 34 34 34 34 34 34 34 34 34 34 34 34 34 34 34 34 34 34 34 34 34 34 34 34 34 34 34 34 34 34 34 34 34 34 34 34 34 34 34 34 34 34 34 34 34 34 34 34 34 34 34 34 34 34 34 34 34 34 34 34
-349 34 34 34 34 34 34 34 34 34 34 34 34 34 34 34 34 34 34 34 34 34 34 34 34 34 34 34 34 34 34 34 34 34 34 34 34 34 34 34 34 34 34 34 34 34 34 34 34 34 34 34 34 34 34 34 34 34 34 34 34 34 34 34 34 34 34 34 34 34 34 34
-357 34 34 34 34 34 34 34 34 34 34 34 34 34 34 34 34 34 34 34 34 34 34 34 34 34 34 34 34 34 34 34 34 34 34 34 34 34 34 34 34 34 34 34 34 34 34 34 34 34 34 34 34 34 34 34 34 34 34 34 34 34 34 34 34 34 34 34 34 34 34 34
$$ packed form
-305C5%%%%%%%%%%%%%%%%%%%%%%%%%%%%%%%%%%%%%%%%%%%%%%%%%%%%%%%%%%%%%%%%%%%%%%
-312C5%%%%%%%%%%%%%%%%%%%%%%%%%%%%%%%%%%%%%%%%%%%%%%%%%%%%%%%%%%%%%%%%%%%%%%
-320C5%%%%%%%%%%%%%%%%%%%%%%%%%%%%%%%%%%%%%%%%%%%%%%%%%%%%%%%%%%%%j%%%J%%%%%
-327C5%j%%J%%%%%%%%j%%%%%%J%%%%j%%%%%%%%%%%%%%%%%%%%%%%%%%%%%%%%%%%%%%%%%%%%
-334C4%%%%%%%%%%%%%%%%%%%%%%%%%%%%%%%%%%%%%%%%%%%%%%%%%%%%%%%%%%%%%%%%%%%%%%
-342C4%%%%%%%%%%%%%%%%%%%%%%%%%%%%%%%%%%%%%%%%%%%%%%%%%%%%%%%%%%%%%%%%%%%%%%
-349C4%%%%%%%%%%%%%%%%%%%%%%%%%%%%%%%%%%%%%%%%%%%%%%%%%%%%%%%%%%%%%%%%%%%%%%
-357C4%%%%%%%%%%%%%%%%%%%%%%%%%%%%%%%%%%%%%%%%%%%%%%%%%%%%%%%%%%%%%%%%%%%%%%
$$ plain form
-364 34 34 34 34 34 34 34 34 34 34 34 34 34 34 34 34 34 34 34 34 34 34 34 34 34 34 34 34 34 34 34 34 34 34 34 34 34 34 34 34 34 34 34 34 34 34 34 34 34 34 34 34 34 34 34 34 34 34 34 34 34 34 34 34 34 34 34 34 34 34 34
-371 34 34 34 34 34 34 34 34 34 34 34 34 34 34 34 34 34 33 33 33 34 34 34 34 34 34 34 34 34 34 34 34 34 34 34 34 34 34 34 33 33 33 34 34 34 34 34 34 34 34 34 34 34 34 34 34 34 34 33 33 33 33 33 33 33 33 33 33 33 34 33
-379 33 33 33 33 33 33 33 33 33 33 33 33 33 33 33 33 33 33 33 33 33 33 33 33 33 33 33 33 33 33 33 33 33 33 33 33 33 33 33 33 33 33 33 33 33 33 33 33 33 33 33 33 33 33 33 33 33 33 33 33 33 33 33 33 33 33 33 33 33 33 33
-386 33 33 33 33 33 33 33 33 33 33 33 33 33 33 33 33 33 33 33 33 33 33 33 33 33 33 33 33 33 33 33 33 33 33 33 33 33 33 33 33 33 33 33 33 33 33 33 33 33 33 33 33 33 33 33 33 33 33 33 33 33 33 33 33 33 33 33 33 33 33 33
-394 33 33 33 33 33 33 33 33 33 33 33 33 33 33 33 33 33 33 33 33 33 33 33 33 33 33 33 33 33 33 33 33 33 33 33 33 33 33 33 33 33 33 33 33 33 33 33 33 33 33 33 33 33 33 33 33 33 33 33 33 33 33 33 33 33 33 33 33 33 33 33
-401 33 33 33 33 33 33 33 33 33 33 33 33 33 33 33 33 33 33 33 33 33 33 33 33 33 33 33 33 33 33 33 33 33 33 33 33 33 33 33 33 33 33 33 33 33 33 33 33 33 33 33 33 33 33 33 33 33 33 33 33 33 33 33 33 33 33 33 33 33 33 33
-409 33 33 33 33 33 33 33 33 33 33 33 33 33 33 33 33 33 33 33 33 33 33 33 33 33 33 33 33 33 33 33 33 33 33 33 33 33 33 33 33 33 33 33 33 33 33 33 33 33 33 33 33 33 33 33 33 33 33 33 33 33 33 33 33 33 33 33 33 33 33 33
-416 33 33 33 33 33 33 33 33 33 33 33 33 33 33 33 33 33 33 33 33 33 33 33 33 33 33 33 33 33 33 33 33 33 33 33 33 33 33 33 33 33 33 33 33 33 33 33 33 33 33 33 33 33 33 33 33 33 33 33 33 33 33 33 33 33 33 33 33 33 33 33
$$ packed form
-364C4%%%%%%%%%%%%%%%%%%%%%%%%%%%%%%%%%%%%%%%%%%%%%%%%%%%%%%%%%%%%%%%%%%%%%%
-371C4%%%%%%%%%%%%%%%%j%%J%%%%%%%%%%%%%%%%%%j%%J%%%%%%%%%%%%%%%j%%%%%%%%%%Jj
-379C3%%%%%%%%%%%%%%%%%%%%%%%%%%%%%%%%%%%%%%%%%%%%%%%%%%%%%%%%%%%%%%%%%%%%%%
-386C3%%%%%%%%%%%%%%%%%%%%%%%%%%%%%%%%%%%%%%%%%%%%%%%%%%%%%%%%%%%%%%%%%%%%%%
-394C3%%%%%%%%%%%%%%%%%%%%%%%%%%%%%%%%%%%%%%%%%%%%%%%%%%%%%%%%%%%%%%%%%%%%%%
-401C3%%%%%%%%%%%%%%%%%%%%%%%%%%%%%%%%%%%%%%%%%%%%%%%%%%%%%%%%%%%%%%%%%%%%%%
-409C3%%%%%%%%%%%%%%%%%%%%%%%%%%%%%%%%%%%%%%%%%%%%%%%%%%%%%%%%%%%%%%%%%%%%%%
-416C3%%%%%%%%%%%%%%%%%%%%%%%%%%%%%%%%%%%%%%%%%%%%%%%%%%%%%%%%%%%%%%%%%%%%%%
$$ plain form
-423 33 33 33 33 33 33 33 33 33 33 33 33 33 33 33 33 33 33 33 33 33 33 33 33 33 33 33 33 33 33 33 33 33 33 33 33 33 33 33 32 32 32 32 32 32 33 32 32 32 32 32 32 32 32 33 33 32 32 32 32 32 32 32 32 32 32 32 32 32 32 32
-431 32 32 32 32 32 32 32 32 32 32 32 32 32 32 32 32 32 32 32 32 32 32 32 32 32 32 32 32 32 32 32 32 32 32 32 32 32 32 32 32 32 32 32 32 32 32 32 32 32 32 32 32 32 32 32 32 32 32 32 32 32 32 32 32 32 32 32 32 32 32 32
-438 32 32 32 32 32 32 32 32 32 32 32 32 32 32 32 32 32 32 32 32 32 32 32 32 32 32 32 32 32 32 32 32 32 32 32 32 32 32 32 32 32 32 32 32 32 32 32 32 32 32 32 32 32 32 32 32 32 32 32 32 32 32 32 32 32 32 32 32 32 32 32
-446 32 32 32 32 32 32 32 32 32 32 32 32 32 32 32 32 32 32 32 32 32 32 32 32 32 32 32 32 32 32 32 32 32 32 32 32 32 32 32 32 32 32 32 32 32 32 32 32 32 32 32 32 32 32 32 32 32 32 32 32 32 32 32 32 32 32 32 32 32 32 32
-453 32 32 32 32 32 32 32 32 32 32 32 32 32 32 32 32 32 32 32 32 32 32 32 32 32 32 32 32 32 32 32 32 32 32 32 32 32 32 32 32 32 32 32 32 32 32 32 32 32 32 32 32 32 32 32 32 32 32 32 32 32 32 32 32 32 32 32 32 32 32 32
-460 32 32 32 32 32 32 32 32 32 32 32 32 32 32 32 32 32 32 32 32 32 32 32 32 32 32 32 32 32 32 32 32 32 32 32 32 32 32 32 32 32 32 32 32 32 32 32 32 32 32 32 32 32 32 32 32 32 32 32 32 32 32 32 32 32 32 32 32 32 32 32
-468 32 32 32 32 32 32 32 32 32 32 32 32 32 32 32 32 32 32 32 32 32 32 32 32 32 32 32 32 32 32 32 32 32 32 32 32 32 32 32 32 32 32 32 32 32 32 32 32 32 32 32 32 32 32 32 32 32 32 32 32 32 32 32 32 32 32 32 32 32 32 32
-475 32 32 32 32 32 32 32 32 32 32 32 32 32 32 32 32 32 32 32 32 32 32 32 32 32 32 32 32 32 32 32 32 32 32 32 32 32 32 32 32 32 32 32 32 32 32 32 32 32 32 32 32 32 32 32 32 32 32 32 32 32 32 32 32 32 32 32 32 32 32 32
$$ packed form
-423C3%%%%%%%%%%%%%%%%%%%%%%%%%%%%%%%%%%%%%%j%%%%%Jj%%%%%%%J%j%%%%%%%%%%%%%%
-431C2%%%%%%%%%%%%%%%%%%%%%%%%%%%%%%%%%%%%%%%%%%%%%%%%%%%%%%%%%%%%%%%%%%%%%%
-438C2%%%%%%%%%%%%%%%%%%%%%%%%%%%%%%%%%%%%%%%%%%%%%%%%%%%%%%%%%%%%%%%%%%%%%%
-446C2%%%%%%%%%%%%%%%%%%%%%%%%%%%%%%%%%%%%%%%%%%%%%%%%%%%%%%%%%%%%%%%%%%%%%%
-453C2%%%%%%%%%%%%%%%%%%%%%%%%%%%%%%%%%%%%%%%%%%%%%%%%%%%%%%%%%%%%%%%%%%%%%%
-460C2%%%%%%%%%%%%%%%%%%%%%%%%%%%%%%%%%%%%%%%%%%%%%%%%%%%%%%%%%%%%%%%%%%%%%%
-468C2%%%%%%%%%%%%%%%%%%%%%%%%%%%%%%%%%%%%%%%%%%%%%%%%%%%%%%%%%%%%%%%%%%%%%%
-475C2%%%%%%%%%%%%%%%%%%%%%%%%%%%%%%%%%%%%%%%%%%%%%%%%%%%%%%%%%%%%%%%%%%%%%%
$$ plain form
-483 32 32 32 32 32 32 32 32 32 32 32 32 32 32 32 32 32 32 32 32 32 32 32 32 32 32 32 32 32 32 32 32 32 32 32 32 32 32 32 32 32 32 32 32 32 32 32 32 32 32 32 32 32 32 32 32 32 32 32 32 32 32 32 32 32 32 32 32 32 32 32
-490 32 32 32 32 32 32 32 32 32 32 32 32 32 32 32 32 32 32 32 32 32 32 32 32 32 32 32 32 32 32 32 31 31 31 32 31 32 32 32 32 32 32 32 32 32 32 32 32 32 32 32 31 31 31 31 31 31 32 32 32 32 32 31 31 31 32 32 32 32 31 31
-498 31 31 31 31 32 32 32 32 32 31 31 31 31 31 31 31 31 31 32 32 32 32 32 32 32 32 32 32 31 31 32 32 32 32 32 32 32 32 31 31 31 31 31 31 31 31 32 32 31 31 31 31 31 31 31 31 31 31 31 31 31 31 31 31 31 31 31 31 31 31 31
-505 31 32 31 31 32 32 32 32 32 31 32 32 32 32 32 32 31 31 31 31 31 31 31 31 32 32 32 32 32 31 31 31 31 31 32 32 31 31 31 31 31 31 31 31 31 31 31 31 31 31 31 31 31 31 31 31 31 31 31 31 31 31 31 31 31 31 31 31 31 31 31
-512 31 31 31 31 31 31 31 31 31 31 31 31 31 32 32 32 32 32 32 32 32 32 32 32 32 31 32 32 31 31 31 31 31 31 31 31 31 31 31 31 31 31 32 32 32 31 32 32 32 32 32 31 31 31 31 31 31 31 31 31 31 31 31 31 31 31 31 31 31 31 31
-520 31 31 31 31 31 32 32 32 31 31 31 31 31 31 31 31 31 31 31 31 31 31 31 31 31 31 31 31 31 31 31 31 31 31 31 31 31 31 31 31 31 31 31 31 31 31 31 31 31 31 31 31 31 31 31 31 31 31 31 31 31 31 31 31 31 31 31 31 31 31 31
-527 31 31 31 31 31 31 31 31 31 31 31 31 31 31 31 31 31 31 31 31 31 31 31 31 31 31 31 31 31 31 31 31 31 31 31 31 31 31 31 31 31 31 31 31 31 31 31 31 31 31 31 31 31 31 31 31 31 31 31 31 31 31 31 31 31 31 31 31 31 31 31
-535 31 31 31 31 31 31 31 31 31 31 31 31 31 31 31 31 31 31 31 31 31 31 31 31 31 31 31 31 31 31 31 31 31 31 31 31 31 31 31 31 31 31 31 31 31 31 31 31 31 31 31 31 31 31 31 31 31 31 31 31 31 31 31 31 31 31 31 31 31 31 31
$$ packed form
-483C2%%%%%%%%%%%%%%%%%%%%%%%%%%%%%%%%%%%%%%%%%%%%%%%%%%%%%%%%%%%%%%%%%%%%%%
-490C2%%%%%%%%%%%%%%%%%%%%%%%%%%%%%%j%%JjJ%%%%%%%%%%%%%%j%%%%%J%%%%j%%J%%%j%
-498C1%%%J%%%%j%%%%%%%%J%%%%%%%%%j%J%%%%%%%j%%%%%%%J%j%%%%%%%%%%%%%%%%%%%%%%
-505C1Jj%J%%%%jJ%%%%%j%%%%%%%J%%%%j%%%%J%j%%%%%%%%%%%%%%%%%%%%%%%%%%%%%%%%%%
-512C1%%%%%%%%%%%%J%%%%%%%%%%%jJ%j%%%%%%%%%%%%%J%%jJ%%%%j%%%%%%%%%%%%%%%%%%%
-520C1%%%%J%%j%%%%%%%%%%%%%%%%%%%%%%%%%%%%%%%%%%%%%%%%%%%%%%%%%%%%%%%%%%%%%%
-527C1%%%%%%%%%%%%%%%%%%%%%%%%%%%%%%%%%%%%%%%%%%%%%%%%%%%%%%%%%%%%%%%%%%%%%%
-535C1%%%%%%%%%%%%%%%%%%%%%%%%%%%%%%%%%%%%%%%%%%%%%%%%%%%%%%%%%%%%%%%%%%%%%%
$$ plain form
-542 31 31 31 31 31 31 31 31 31 31 31 31 31 31 31 31 31 31 31 31 31 31 31 31 31 31 31 31 31 31 31 31 31 31 31 31 31 31 31 31 31 31 31 31 31 31 31 31 31 31 31 31 31 31 31 31 31 31 31 31 31 31 31 31 31 31 31 31 31 31 31
-549 31 31 31 31 31 31 31 31 31 31 31 31 31 30 31 31 31 31 31 31 31 31 30 30 30 30 30 30 30 30 30 30 30 30 30 30 30 30 30 30 30 30 30 30 30 30 30 30 30 30 30 30 30 30 30 30 30 30 30 30 30 30 30 30 30 30 30 30 30 30 30
-557 30 30 30 30 30 30 30 30 30 30 30 30 30 30 30 31 31 31 30 30 30 30 30 30 30 30 30 30 30 30 31 31 31 31 31 31 31 31 31 31 31 31 31 31 31 31 31 31 31 31 31 31 31 31 31 31 31 31 31 31 31 31 31 31 31 31 31 31 31 31 31
-564 31 31 31 31 31 31 31 31 31 31 31 31 31 31 31 31 31 31 31 31 31 31 31 31 30 30 31 31 31 31 31 31 31 31 31 31 31 31 31 31 31 31 31 31 31 31 31 31 30 31 31 31 31 31 30 30 30 30 30 30 30 30 30 30 30 30 30 30 30 30 30
-572 30 30 30 30 30 30 30 30 30 30 30 30 30 30 30 30 30 30 30 30 30 30 30 30 30 30 30 30 30 30 30 30 30 30 30 30 30 30 30 30 30 30 30 30 30 30 30 30 30 30 30 30 30 30 30 30 30 30 30 30 30 30 30 30 30 30 30 30 30 30 30
-579 30 30 30 30 30 30 30 30 30 30 30 30 30 30 30 30 30 30 30 30 30 30 30 30 30 30 30 30 30 30 30 30 30 30 30 30 30 30 30 30 30 30 30 30 30 30 30 30 30 30 30 30 30 30 30 30 30 30 30 30 30 30 30 30 30 30 30 30 30 30 30
-587 30 30 30 30 30 30 30 30 30 30 30 30 30 30 30 30 30 30 30 30 30 30 30 30 30 30 30 30 30 30 30 30 30 30 30 30 30 30 30 30 30 30 30 30 30 30 30 30 30 30 30 30 30 30 30 30 30 30 30 30 30 30 30 30 30 30 30 30 30 30 30
-594 30 30 30 30 30 30 30 30 30 30 30 30 30 30 30 30 30 30 30 30 30 30 30 30 30 30 30 30 30 30 30 30 30 30 30 30 30 30 30 30 30 30 30 30 30 30 30 30 30 30 30 30 30 30 30 30 30 30 30 30 30 30 30 30 30 30 30 30 30 30 30
$$ packed form
-542C1%%%%%%%%%%%%%%%%%%%%%%%%%%%%%%%%%%%%%%%%%%%%%%%%%%%%%%%%%%%%%%%%%%%%%%
-549C1%%%%%%%%%%%%jJ%%%%%%%j%%%%%%%%%%%%%%%%%%%%%%%%%%%%%%%%%%%%%%%%%%%%%%%%
-557C0%%%%%%%%%%%%%%J%%j%%%%%%%%%%%J%%%%%%%%%%%%%%%%%%%%%%%%%%%%%%%%%%%%%%%%
-564C1%%%%%%%%%%%%%%%%%%%%%%%j%J%%%%%%%%%%%%%%%%%%%%%jJ%%%%j%%%%%%%%%%%%%%%%
-572C0%%%%%%%%%%%%%%%%%%%%%%%%%%%%%%%%%%%%%%%%%%%%%%%%%%%%%%%%%%%%%%%%%%%%%%
-579C0%%%%%%%%%%%%%%%%%%%%%%%%%%%%%%%%%%%%%%%%%%%%%%%%%%%%%%%%%%%%%%%%%%%%%%
-587C0%%%%%%%%%%%%%%%%%%%%%%%%%%%%%%%%%%%%%%%%%%%%%%%%%%%%%%%%%%%%%%%%%%%%%%
-594C0%%%%%%%%%%%%%%%%%%%%%%%%%%%%%%%%%%%%%%%%%%%%%%%%%%%%%%%%%%%%%%%%%%%%%%
$$ plain form
-601 30 30 30 30 30 30 30 30 30 30 30 30 30 30 30 30 30 30 30 30 30 30 30 30 30 30 30 30 30 30 30 30 30 30 30 30 30 30 30 30 30 30 30 30 30 30 30 30 30 30 30 30 30 30 30 30 30 30 30 30 30 30 30 30 30 30 30 30 30 30 30
-609 30 30 30 30 30 30 30 30 30 30 30 30 30 30 30 30 30 30 30 30 30 30 30 30 30 30 30 30 30 30 30 30 30 30 30 30 30 30 30 30 30 30 30 30 30 30 30 30 30 30 30 30 30 30 30 30 30 30 30 30 30 30 30 30 30 30 30 30 30 30 30
-616 30 30 30 30 30 30 30 30 30 30 30 30 30 30 30 30 30 30 30 30 30 30 30 30 30 30 30 30 30 30 30 30 30 30 30 30 30 30 30 30 30 30 30 30 30 30 30 30 30 30 30 30 30 30 30 30 30 30 30 30 30 30 30 30 30 30 30 30 30 30 30
-624 30 30 30 30 30 30 30 30 30 30 30 30 30 30 30 30 30 30 30 30 30 30 30 30 30 30 30 30 30 30 30 30 30 30 30 30 30 30 30 30 30 30 30 30 30 30 30 30 30 30 30 30 30 30 30 30 30 30 30 30 30 30 30 30 30 30 30 30 30 30 30
-631 30 30 30 30 30 30 30 30 30 30 30 30 30 30 30 30 30 30 30 30 30 30 30 30 30 30 30 30 30 30 30 30 30 30 30 30 30 30 30 30 30 30 30 30 30 30 30 30 30 30 30 30 30 30 30 30 30 30 30 30 30 30 30 30 30 29 29 29 29 29 30
-639 30 30 30 30 30 29 29 29 29 29 29 29 29 29 29 29 29 29 29 29 29 29 29 29 29 29 29 29 29 29 29 29 29 29 29 29 29 29 29 29 29 29 29 29 29 29 29 29 29 29 29 29 29 29 29 29 29 29 29 29 29 29 29 29 29 29 29 29 29 29 29
-646 29 29 29 29 29 29 29 29 29 29 29 29 29 29 29 29 29 29 29 29 29 29 29 29 29 29 29 29 29 29 29 29 29 29 29 29 29 29 29 29 29 29 29 29 29 29 29 29 29 29 29 29 29 29 29 29 29 29 29 29 29 29 29 29 29 29 29 29 29 29 29
-653 29 29 29 29 29 29 29 29 29 29 29 29 29 29 29 29 29 29 29 29 29 29 29 29 29 29 29 29 29 29 29 29 29 29 29 29 29 29 29 29 29 29 29 29 29 29 29 29 29 29 29 29 29 29 29 29 29 29 29 29 29 29 29 29 29 29 29 29 29 29 29
$$ packed form
-601C0%%%%%%%%%%%%%%%%%%%%%%%%%%%%%%%%%%%%%%%%%%%%%%%%%%%%%%%%%%%%%%%%%%%%%%
-609C0%%%%%%%%%%%%%%%%%%%%%%%%%%%%%%%%%%%%%%%%%%%%%%%%%%%%%%%%%%%%%%%%%%%%%%
-616C0%%%%%%%%%%%%%%%%%%%%%%%%%%%%%%%%%%%%%%%%%%%%%%%%%%%%%%%%%%%%%%%%%%%%%%
-624C0%%%%%%%%%%%%%%%%%%%%%%%%%%%%%%%%%%%%%%%%%%%%%%%%%%%%%%%%%%%%%%%%%%%%%%
-631C0%%%%%%%%%%%%%%%%%%%%%%%%%%%%%%%%%%%%%%%%%%%%%%%%%%%%%%%%%%%%%%%%j%%%%J
-639C0%%%%j%%%%%%%%%%%%%%%%%%%%%%%%%%%%%%%%%%%%%%%%%%%%%%%%%%%%%%%%%%%%%%%%%
-646B9%%%%%%%%%%%%%%%%%%%%%%%%%%%%%%%%%%%%%%%%%%%%%%%%%%%%%%%%%%%%%%%%%%%%%%
-653B9%%%%%%%%%%%%%%%%%%%%%%%%%%%%%%%%%%%%%%%%%%%%%%%%%%%%%%%%%%%%%%%%%%%%%%
$$ plain form
-661 29 29 29 29 29 29 29 29 29 29 29 29 29 29 29 29 29 29 29 29 29 29 29 29 29 29 29 29 29 29 29 29 29 29 29 29 29 29 29 29 29 29 29 29 29 29 29 29 29 29 29 29 29 29 29 29 29 29 29 29 29 29 29 29 29 29 29 29 29 29 29
-668 29 29 29 29 29 29 29 29 29 29 29 29 29 29 29 29 29 29 29 29 29 29 29 29 29 29 29 29 29 29 29 29 29 29 29 29 29 29 29 29 29 29 29 29 29 29 29 29 29 29 29 29 29 29 29 29 29 29 29 29 29 29 29 29 29 29 29 29 29 29 29
-676 29 29 29 29 29 29 29 29 29 29 29 29 29 29 29 29 29 29 29 29 29 29 29 29 29 29 29 29 29 29 29 29 29 29 29 29 29 29 29 29 29 29 29 29 29 29 29 29 29 29 29 29 29 29 29 29 29 29 29 29 29 29 29 29 29 29 29 29 29 29 29
-683 29 29 29 29 29 29 29 29 29 29 29 29 29 29 29 29 29 29 29 29 29 29 29 29 29 29 29 29 29 29 29 29 29 29 29 29 29 29 29 29 29 29 29 29 29 29 29 29 29 29 29 29 29 29 29 29 29 29 29 29 29 29 29 29 29 29 29 29 29 29 29
-690 29 29 29 29 29 29 29 29 29 29 29 29 29 29 29 29 29 29 29 29 29 29 29 29 29 29 29 29 29 29 29 29 29 29 29 29 29 29 29 29 29 29 29 29 29 29 29 29 29 29 29 29 29 29 29 29 29 29 29 29 29 29 29 29 29 29 29 29 29 29 29
$$ packed form
-661B9%%%%%%%%%%%%%%%%%%%%%%%%%%%%%%%%%%%%%%%%%%%%%%%%%%%%%%%%%%%%%%%%%%%%%%
-668B9%%%%%%%%%%%%%%%%%%%%%%%%%%%%%%%%%%%%%%%%%%%%%%%%%%%%%%%%%%%%%%%%%%%%%%
-676B9%%%%%%%%%%%%%%%%%%%%%%%%%%%%%%%%%%%%%%%%%%%%%%%%%%%%%%%%%%%%%%%%%%%%%%
-683B9%%%%%%%%%%%%%%%%%%%%%%%%%%%%%%%%%%%%%%%%%%%%%%%%%%%%%%%%%%%%%%%%%%%%%%
-690B9%%%%%%%%%%%%%%%%%%%%%%%%%%%%%%%%%%%%%%%%%%%%%%%%%%%%%%%%%%%%%%%%%%%%%%
$$ [...]
-2937A0
##END=		$$ NMR SPECTRUM
##END=		$$ LINK
