##TITLE=	mIQJYdxwQZ63yz+UjakyVg.12.fid
##JCAMP-DX=	6.0	$$ MestReNova 14.3.3-33362
##DATA TYPE=	LINK
##BLOCKS=	1    
##ORIGIN=	Mestrelab Research S.L.
##OWNER=	hrzepa
##$MNOVA/METADATA=	(DOCUMENT,BASE64)
eyJuYW1lIjoiL1VzZXJzL2hyemVwYS9Eb3dubG9hZHMvSVVQQUMtRkFJUlNwZWMtbWFpbi8zOC1Db21
wbGV4ZXMvMzhoLzM4aC1GLzM4aC1GLm1ub3ZhIiwicGFnZXMiOlt7Iml0ZW1zIjpbIjEiICAgICBdfV
19
##TITLE=	mIQJYdxwQZ63yz+UjakyVg.12.fid
##JCAMP-DX=	6.0	$$ MestReNova 14.3.3-33362
##DATA TYPE=	NMR SPECTRUM
##DATA CLASS=	XYDATA
##BLOCK_ID=	1
##ORIGIN=	Bruker BioSpin GmbH
##OWNER=	nmrsu
##NUMDIM=	1
##$MNOVA/METADATA=	(ITEM,BASE64)
eyJhbmdsZSI6MCwiYXhlcyI6eyJ4Ijp7Im1heCI6NjQuOTk1NjMwMDAwMTc5MjMsIm1pbiI6LTE3OS4
3NTgxMzA0Nzk1NjUzMn0sInkiOnsibWF4Ijo2NjcxMjA0LjEyNSwibWluIjotNjE0MTE4LjY4NjAzNT
E1NjJ9fSwicG9pbnRzIjpbeyJ4Ijo1MzIxLCJ5Ijo1ODM1fSx7IngiOjg3MjIsInkiOjU4MzV9LHsie
CI6ODcyMiwieSI6ODIwOH0seyJ4Ijo1MzIxLCJ5Ijo4MjA4fSx7IngiOjUzMjEsInkiOjU4MzV9XSwi
eiI6MH0=
##.OBSERVE FREQUENCY=	658.94984375485603323
##.OBSERVE NUCLEUS=	^19F
##.SOLVENT NAME=	None
##.PULSE SEQUENCE=	zg30
##LONGDATE=	2025/01/08 23:20:17.000
##.ACQUISITIONMODE=	SIMULTANEOUS (DQD)
##$ORIGINAL FORMAT=	Bruker XWIN-NMR
##$MNOVA/SCALES_VERSION=	9
##$PARAMETER FILE=	(acqus, ASCII, /private/var/folders/f6/rjf_tdyn2v98c5c0wvkgn4s80000gq/T/mIQJYdxwQZ63yz+UjakyVg/12/acqus, 0)
$$ ##TITLE= Parameter file, TopSpin 4.1.3
$$ ##JCAMPDX= 5.0
$$ ##DATATYPE= Parameter Values
$$ ##NPOINTS= 1	$$ modification sequence number
$$ ##ORIGIN= Bruker BioSpin GmbH
$$ ##OWNER= nmrsu
$$ $$ 2025-01-08 23:18:41.812 +0000  nmrsu@CZC7167VR1
$$ $$ Z:/700/data/tds/nmr/RP613 A/12/acqus
$$ $$ process C:\Bruker\TopSpin4.1.3\prog\mod\dirdata.exe
$$ ##$ACQT0= -3.66750770866894
$$ ##$AMP= (0..31)
$$ 100 100 100 100 100 100 100 100 100 100 100 100 100 100 100 100 100 100
$$ 100 100 100 100 100 100 100 100 100 100 100 100 100 100
$$ ##$AMPCOIL= (0..32)
$$ -1 0 0 0 0 0 0 0 0 0 0 0 0 0 0 0 0 0 0 0 0 0 0 0 0 0 0 0 0 0 0 0 0
$$ ##$AQSEQ= 0
$$ ##$AQ_mod= 3
$$ ##$AUNM= <au_zg>
$$ ##$AUTOPOS= <30 >
$$ ##$BF1= 658.987406037
$$ ##$BF2= 658.987406037
$$ ##$BF3= 658.987406037
$$ ##$BF4= 658.987406037
$$ ##$BF5= 658.987406037
$$ ##$BF6= 658.987406037
$$ ##$BF7= 658.987406037
$$ ##$BF8= 658.987406037
$$ ##$BWFAC= (0..63)
$$ 0 0 0 0 0 0 0 0 0 0 0 0 0 0 0 0 0 0 0 0 0 0 0 0 0 0 0 0 0 0 0 0 0 0 0 0
$$ 0 0 0 0 0 0 0 0 0 0 0 0 0 0 0 0 0 0 0 0 0 0 0 0 0 0 0 0
$$ ##$BYTORDA= 0
$$ ##$CHANFCU= (0..24)
$$ 0 1 0 0 0 0 0 0 0 0 0 0 0 0 0 0 0 0 0 0 0 0 0 0 0
$$ ##$CHANREC= (0..24)
$$ 0 0 0 0 0 0 0 0 0 0 0 0 0 0 0 0 0 0 0 0 0 0 0 0 0
$$ ##$CHEMSTR= <none>
$$ ##$CNST= (0..63)
$$ 1 1 1 1 1 1 1 1 1 1 1 1 1 1 1 1 1 1 1 1 1 1 1 1 1 1 1 1 1 1 1 1 1 1 1 1
$$ 1 1 1 1 1 1 1 1 1 1 1 1 1 1 1 1 1 1 1 1 1 1 1 1 1 1 1 1
$$ ##$CPDPRG= (0..8)
$$ <> <> <> <> <> <> <> <> <>
$$ ##$D= (0..63)
$$ 0 5 0 0 0 0 0 0 0 0 0 0 0 0 0 0 0.0002 0 0 0 0 0 0 0 0 0 0 0 0 0 0 0 0
$$ 0 0 0 0 0 0 0 0 0 0 0 0 0 0 0 0 0 0 0 0 0 0 0 0 0 0 0 0 0 0 0
$$ ##$DATE= 1736378417
$$ ##$DATE_START= 1736378298
$$ ##$DE= 18
$$ ##$DECBNUC= <off>
$$ [...]
$$ ##$ShimPowRng3= (0..63)
$$ 1 1 1 1 1 1 1 1 1 1 1 1 1 1 1 1 1 1 1 1 1 1 1 1 1 1 1 1 1 1 1 1 1 1 1 1
$$ 1 1 1 1 0 0 0 0 0 0 0 0 0 0 0 0 0 0 0 0 0 0 0 0 0 0 0 0
$$ ##$ShimPowType1= 8
$$ ##$ShimPowType2= 8
$$ ##$ShimPowType3= 0
$$ ##$ShimPowType4= 0
$$ ##$ShimPowType5= 0
$$ ##$ShimPowType6= 0
$$ ##$ShimPowType7= 0
$$ ##$ShimPowType8= 0
$$ ##$ShimSysActGrad= (0..63)
$$ 1 2 3 4 13 5 7 11 10 9 6 8 12 18 19 20 21 15 22 23 24 14 25 16 26 17 27
$$ 28 31 32 33 34 35 36 37 38 0 0 0 0 0 0 0 0 0 0 0 0 0 0 0 0 0 0 0 0 0 0
$$ 0 0 0 0 0 0
$$ ##$ShimSysAngle= <>
$$ ##$ShimSysFunc= (0..63)
$$ 1 2 3 4 5 6 7 8 9 10 0 37 38 35 16 15 14 13 12 11 28 27 26 25 24 23 36
$$ 22 30 29 20 21 34 33 32 31 17 18 19 0 0 0 0 0 0 0 0 0 0 0 0 0 0 0 0 0 0
$$ 0 0 0 0 0 0 0
$$ ##$ShimSysMatId= <292722da.dat>
$$ ##$ShimSysMatrix= 1
$$ ##$ShimSysMinMaxUG= 130000
$$ ##$ShimSysOffset= <29 mm>
$$ ##$ShimSysType= 4
$$ ##$ShimUnit= 3
$$ ##$SpectrOsVersion= <4.1.156.20210628>
$$ ##$TCubeEth= <192.168.180.38>
$$ ##$TCubeSeqDevice= <>
$$ ##$TOSITY= <no>
$$ ##$TRIPLO2= 0
$$ ##$TopSpinVersion= <TopSpin 4.1.3>
$$ ##$TrxFreqFormula= (0..23)
$$ <TrxFreqFormula(2.0,700350000.000000,'TRX',Trx(1.0,'TRX 1200.1',1,5.000000,1290.000000))>
$$ <TrxFreqFormula(2.0,700350000.000000,'TRX',Trx(1.0,'TRX 1200.2',1,5.000000,1290.000000))>
$$ <TrxFreqFormula(2.0,700350000.000000,'TRX',Trx(1.0,'TRX 1200.3',1,5.000000,1290.000000))>
$$ <> <> <> <> <> <> <> <> <> <> <> <> <> <> <> <> <> <> <> <> <>
$$ ##$TrxPN= (0..23)
$$ <Z148391> <Z148391> <Z148391> <> <> <> <> <> <> <> <> <> <> <> <> <> <>
$$ <> <> <> <> <> <> <>
$$ ##$TrxSN= (0..23)
$$ <00336> <00337> <00342> <> <> <> <> <> <> <> <> <> <> <> <> <> <> <> <>
$$ <> <> <> <> <>
$$ ##$VCubeEth= (0..23)
$$ <no> <no> <no> <no> <no> <no> <no> <no> <no> <no> <no> <no> <no> <no> <no>
$$ <no> <no> <no> <no> <no> <no> <no> <no> <no>
$$ ##$VTU= 2
$$ ##$VTUETH= <192.168.99.11>
$$ ##$VTUTY= <no>
$$ ##$ValueLine= no
$$ ##$VpuPN= (0..23)
$$ <no> <no> <no> <no> <no> <no> <no> <no> <no> <no> <no> <no> <no> <no> <no>
$$ <no> <no> <no> <no> <no> <no> <no> <no> <no>
$$ ##$VpuSN= (0..23)
$$ <no> <no> <no> <no> <no> <no> <no> <no> <no> <no> <no> <no> <no> <no> <no>
$$ <no> <no> <no> <no> <no> <no> <no> <no> <no>
$$ ##$WBREFAM= (0..31)
$$ 99.8 100 100 100 100 100 100 100 100 100 100 100 100 100 100 100 100 100
$$ 100 100 100 100 100 100 100 100 100 100 100 100 100 100
$$ ##$WBREFLM= (0..31)
$$ 1 0 1 0 0 0 0 0 0 0 0 0 0 0 0 0 0 0 0 0 0 0 0 0 0 0 0 0 0 0 0 0
$$ ##$WBREFPH= (0..31)
$$ 0.05 0 0 0 0 0 0 0 0 0 0 0 0 0 0 0 0 0 0 0 0 0 0 0 0 0 0 0 0 0 0 0
$$ ##$WBSGU= (0..31)
$$ 1 2 4 0 0 0 0 0 0 0 0 0 0 0 0 0 0 0 0 0 0 0 0 0 0 0 0 0 0 0 0 0
$$ ##END=
$$ 
##$DECIM=	124
##$DSPFVS=	22
##XUNITS=	HZ
##YUNITS=	ARBITRARY UNITS
##FIRSTX=	42831.317967936003697
##LASTX=	-118458.38933895647642
##DELTAX=	-0.6152737525201606994
##XFACTOR=	1
##YFACTOR=	185.08624530777916561
##FIRSTY=	-13.6552734375
##MINY=	-7643.841796875
##MAXY=	6064721
##NPOINTS=	262144
##XYDATA=	(X++(Y..Y))
$$ [...]
-41290c2%%%%%%%%%%%%%%%%%%Jj%Jj%%%%%%%%%%%%%%%%%%%%%%%%%Jj%%%%%%%%%%%%%%%%%%
-41331c2%%Jj%%%Jj%%%%%%%%%%%%%%%%%%%%%%%%%%%%%%%%%%%%%%%%%%%%%%%%%%%%%%%%%%%
-41373c2%%%%%%%%%%%%%%%%%%%%%%%%%%%%%%%%%%%%%%%%%%%%%%%%%%%%%%%%%%%%%%%%%%%%
-41415c2%%%%%%%%%%%%%%%%%%%%%%%%%%%%%%%%%%%%%%%%%%%%%%%%%%%%%%%%%%%%%%%%%%%%
-41457c2%%%%%%%%%%%%%%%%%%%%%%%%%%%%%%%%%%%%%%%%%%%%%%%%%%%%%%%%%%%%%%%%%%%%
-41499c2%%%%%%%%%%%%%%%%%%%%%%%%%%%%%%%%%%%%%%%%%%%%%%%%%%%%%%%%%%%%%%%%%%%%
-41541c2%%%%%%%%%%%%%%%%%%%%%%%%%%%%%%%%%%%%%%%%%%%%%%%%%%%%%%%%%%%%%%%%%%%%
-41582c2%%%%%%%%%%%%%%%%%%%%%%%%%%%%%%%%%%%%%%%%%%%%%%%%%%%%%%%%%%%%%%%%%%jJ
$$ y = [-32, -32, -32, -32, -32, -32, -32, -32, -32, -32, -32, -32, -32, -32, -32, -32, -32, -32, -32, -31, -32, -32, -31, -32, -32, -32, -32, -32, -32, -32, -32, -32, -32, -32, -32, -32, -32, -32, -32, -32, -32, -32, -32, -32, -32, -32, -32, -32, -32, -31, -32, -32, -32, -32, -32, -32, -32, -32, -32, -32, -32, -32, -32, -32, -32, -32, -32, -32, -32, -32, -32, -31, -32, -32, -32, -32, -31, -32, -32, -32, -32, -32, -32, -32, -32, -32, -32, -32, -32, -32, -32, -32, -32, -32, -32, -32, -32, -32, -32, -32, -32, -32, -32, -32, -32, -32, -32, -32, -32, -32, -32, -32, -32, -32, -32, -32, -32, -32, -32, -32, -32, -32, -32, -32, -32, -32, -32, -32, -32, -32, -32, -32, -32, -32, -32, -32, -32, -32, -32, -32, -32, -32, -32, -32, -32, -32, -32, -32, -32, -32, -32, -32, -32, -32, -32, -32, -32, -32, -32, -32, -32, -32, -32, -32, -32, -32, -32, -32, -32, -32, -32, -32, -32, -32, -32, -32, -32, -32, -32, -32, -32, -32, -32, -32, -32, -32, -32, -32, -32, -32, -32, -32, -32, -32, -32, -32, -32, -32, -32, -32, -32, -32, -32, -32, -32, -32, -32, -32, -32, -32, -32, -32, -32, -32, -32, -32, -32, -32, -32, -32, -32, -32, -32, -32, -32, -32, -32, -32, -32, -32, -32, -32, -32, -32, -32, -32, -32, -32, -32, -32, -32, -32, -32, -32, -32, -32, -32, -32, -32, -32, -32, -32, -32, -32, -32, -32, -32, -32, -32, -32, -32, -32, -32, -32, -32, -32, -32, -32, -32, -32, -32, -32, -32, -32, -32, -32, -32, -32, -32, -32, -32, -32, -32, -32, -32, -32, -32, -32, -32, -32, -32, -32, -32, -32, -32, -32, -32, -32, -32, -32, -32, -32, -32, -32, -32, -32, -32, -32, -32, -32, -32, -32, -32, -32, -32, -32, -32, -32, -32, -32, -32, -32, -32, -32, -32, -32, -32, -32, -32, -32, -32, -32, -32, -32, -32, -32, -32, -32, -32, -32, -32, -32, -32, -32, -32, -32, -32, -32, -32, -32, -32, -32, -32, -32, -32, -32, -32, -32, -32, -32, -32, -32, -32, -32, -32, -32, -32, -32, -32, -32, -32, -32, -32, -32, -32, -32, -32, -32, -32, -32, -32, -32, -32, -32, -32, -32, -32, -32, -32, -32, -32, -32, -32, -32, -32, -32, -32, -32, -32, -32, -32, -32, -32, -32, -32, -32, -32, -32, -32, -32, -32, -32, -32, -32, -32, -32, -32, -32, -32, -32, -32, -32, -32, -32, -32, -32, -32, -32, -32, -32, -32, -32, -32, -32, -32, -32, -32, -32, -32, -32, -32, -32, -32, -32, -32, -32, -32, -32, -32, -32, -32, -32, -32, -32, -32, -32, -32, -32, -32, -32, -32, -32, -32, -32, -32, -32, -32, -32, -32, -32, -32, -32, -32, -32, -32, -32, -32, -32, -32, -32, -32, -32, -32, -32, -32, -32, -32, -32, -32, -32, -32, -32, -32, -32, -32, -32, -32, -32, -32, -32, -32, -32, -32, -32, -32, -32, -32, -32, -32, -32, -32, -32, -32, -32, -32, -32, -32, -32, -32, -32, -32, -32, -32, -32, -32, -32, -32, -32, -32, -32, -32, -32, -32, -32, -32, -32, -32, -32, -32, -32, -32, -32, -32, -33, -32]
-41624c2%%%%%%%%%%%%%%%%%%%%%%%%%%%%%%%%%%%%%%%%%%%%%%%%%%%%%%%%%%%%%%%%%%%%
-41666c2%%%%%%%%%%%%%%%%%%%%%%%%%%%%%%%%j%JjJ%%%%jJ%%jJjJ%%jJj%%J%%%j%J%%j%J
-41708c2%%j%J%%j%%Jj%%J%%jJ%%%j%J%%jJ%%%%%%%%jJjJj%%J%%%%%%%j%%%Jj%J%%%%%j%%
-41750c3%%%%%%%%%%J%%%%jJ%jJ%j%%J%j%%%%%%J%j%%%%%%JjJj%%%%%%%%%%%%%%%%%%J%j%
-41792c3%%%%%%%%%%%%Jj%%%Jj%%%%%%%J%j%%%%%%%%%%%%%%%%%%%%%%%Jj%%%%%%%%%%%%%%
-41833c3%%%%%%%%%%%%%%%%%%%%%%%%%%%%%%Jj%%%%%%%%%%%%%%%%%%%%%%%%%%%%%%%%%%%%
-41875c3%%%%%%%%%%%%%%%%%%%%%%%%%%%%%%%%%%%%%%%%%%%%%%%%%%%%%%%%%%%%%%%%%%%%
-41917c3%%%%%%%%%%%%%%%%%%%%%%%%%%%%%%%%%%%%%%%%%%%%%%%%%%%%%%%%%%%%%%%%%%%%
$$ y = [-32, -32, -32, -32, -32, -32, -32, -32, -32, -32, -32, -32, -32, -32, -32, -32, -32, -32, -32, -32, -32, -32, -32, -32, -32, -32, -32, -32, -32, -32, -32, -32, -32, -32, -32, -32, -32, -32, -32, -32, -32, -32, -32, -32, -32, -32, -32, -32, -32, -32, -32, -32, -32, -32, -32, -32, -32, -32, -32, -32, -32, -32, -32, -32, -32, -32, -32, -32, -32, -32, -32, -32, -32, -32, -32, -32, -32, -32, -32, -32, -32, -32, -32, -32, -32, -32, -32, -32, -32, -32, -32, -32, -32, -32, -32, -32, -32, -32, -32, -32, -32, -33, -33, -32, -33, -32, -32, -32, -32, -32, -33, -32, -32, -32, -33, -32, -33, -32, -32, -32, -33, -32, -33, -33, -33, -32, -32, -32, -32, -33, -33, -32, -32, -32, -33, -33, -32, -32, -32, -33, -33, -32, -32, -32, -33, -33, -33, -32, -33, -33, -33, -32, -32, -32, -33, -32, -32, -32, -32, -33, -33, -32, -32, -32, -33, -32, -32, -32, -32, -32, -32, -32, -32, -32, -33, -32, -33, -32, -33, -33, -33, -32, -32, -32, -32, -32, -32, -32, -32, -33, -33, -33, -33, -32, -33, -33, -32, -32, -32, -32, -32, -32, -33, -33, -33, -33, -33, -33, -33, -33, -33, -33, -33, -33, -33, -32, -32, -32, -32, -32, -33, -32, -32, -33, -32, -32, -33, -33, -33, -32, -32, -33, -33, -33, -33, -33, -33, -33, -32, -32, -33, -33, -33, -33, -33, -33, -33, -32, -33, -32, -33, -33, -33, -33, -33, -33, -33, -33, -33, -33, -33, -33, -33, -33, -33, -33, -33, -33, -33, -32, -32, -33, -33, -33, -33, -33, -33, -33, -33, -33, -33, -33, -33, -33, -33, -32, -33, -33, -33, -33, -32, -33, -33, -33, -33, -33, -33, -33, -33, -32, -32, -33, -33, -33, -33, -33, -33, -33, -33, -33, -33, -33, -33, -33, -33, -33, -33, -33, -33, -33, -33, -33, -33, -33, -33, -32, -33, -33, -33, -33, -33, -33, -33, -33, -33, -33, -33, -33, -33, -33, -33, -33, -33, -33, -33, -33, -33, -33, -33, -33, -33, -33, -33, -33, -33, -33, -33, -33, -33, -33, -33, -33, -33, -33, -33, -33, -33, -33, -33, -33, -33, -32, -33, -33, -33, -33, -33, -33, -33, -33, -33, -33, -33, -33, -33, -33, -33, -33, -33, -33, -33, -33, -33, -33, -33, -33, -33, -33, -33, -33, -33, -33, -33, -33, -33, -33, -33, -33, -33, -33, -33, -33, -33, -33, -33, -33, -33, -33, -33, -33, -33, -33, -33, -33, -33, -33, -33, -33, -33, -33, -33, -33, -33, -33, -33, -33, -33, -33, -33, -33, -33, -33, -33, -33, -33, -33, -33, -33, -33, -33, -33, -33, -33, -33, -33, -33, -33, -33, -33, -33, -33, -33, -33, -33, -33, -33, -33, -33, -33, -33, -33, -33, -33, -33, -33, -33, -33, -33, -33, -33, -33, -33, -33, -33, -33, -33, -33, -33, -33, -33, -33, -33, -33, -33, -33, -33, -33, -33, -33, -33, -33, -33, -33, -33, -33, -33, -33, -33, -33, -33, -33, -33, -33, -33, -33, -33, -33, -33, -33, -33, -33, -33, -33, -33, -33, -33, -33, -33, -33, -33, -33, -33, -33, -33, -33, -33, -33, -33, -33, -33, -33, -33, -33, -33, -33]
-41959c3%%%%%%%%%%%%%%%%%%%%%%%%%%%%%%%%%%%%%%%%%%%%%%%%%%%%%%%%%%%%%%%%%%%%
-42001c3%%%%%%%%%%%%%%%%%%%%%%%%%%%%%%%%%%%%%%%%%%%%%%%%%%%%%%%%%%%%%%%%%%%%
-42043c3%%%%%%%%%%%%%%%%%%%%%%%%%%%%%%%%%%%%%%%%%%%%%%%%%%%%%%%%%%%%%%%%%%%%
-42084c3%%%%%%%%%%%%%%%%%%%%%%%%%%%%%%%%%%%%%%%%%%%%%%%%%%%%%%%%%%%%%%%%%%%%
-42126c3%%%%%%%%%%%%%%%%%%%%%%%%%%%%%%%%%%%%%%%%%%%%%%%%%%%%%%%%%%%%%%%%%%%%
-42168c3%%%%%%%%%%%%%%%%%%%%%%%%%%%%%%%%%%%%%%%%jJ%%jJ%%%j%%J%%%%jJ%jJ%%%%%%
-42210c3j%J%%%%%%%%%%%%%%%%%%%%jJ%jJ%%%%%%%%%%%%%%%%%%%%%%%%%%%%%%jJ%jJ%j%J%
-42252c3%%j%%J%%%%%%%%%j%%%%J%%%j%%Jj%%%%J%j%Jj%%%%Jj%%%%%%%%J%%%%j%Jj%%J%j%
$$ y = [-33, -33, -33, -33, -33, -33, -33, -33, -33, -33, -33, -33, -33, -33, -33, -33, -33, -33, -33, -33, -33, -33, -33, -33, -33, -33, -33, -33, -33, -33, -33, -33, -33, -33, -33, -33, -33, -33, -33, -33, -33, -33, -33, -33, -33, -33, -33, -33, -33, -33, -33, -33, -33, -33, -33, -33, -33, -33, -33, -33, -33, -33, -33, -33, -33, -33, -33, -33, -33, -33, -33, -33, -33, -33, -33, -33, -33, -33, -33, -33, -33, -33, -33, -33, -33, -33, -33, -33, -33, -33, -33, -33, -33, -33, -33, -33, -33, -33, -33, -33, -33, -33, -33, -33, -33, -33, -33, -33, -33, -33, -33, -33, -33, -33, -33, -33, -33, -33, -33, -33, -33, -33, -33, -33, -33, -33, -33, -33, -33, -33, -33, -33, -33, -33, -33, -33, -33, -33, -33, -33, -33, -33, -33, -33, -33, -33, -33, -33, -33, -33, -33, -33, -33, -33, -33, -33, -33, -33, -33, -33, -33, -33, -33, -33, -33, -33, -33, -33, -33, -33, -33, -33, -33, -33, -33, -33, -33, -33, -33, -33, -33, -33, -33, -33, -33, -33, -33, -33, -33, -33, -33, -33, -33, -33, -33, -33, -33, -33, -33, -33, -33, -33, -33, -33, -33, -33, -33, -33, -33, -33, -33, -33, -33, -33, -33, -33, -33, -33, -33, -33, -33, -33, -33, -33, -33, -33, -33, -33, -33, -33, -33, -33, -33, -33, -33, -33, -33, -33, -33, -33, -33, -33, -33, -33, -33, -33, -33, -33, -33, -33, -33, -33, -33, -33, -33, -33, -33, -33, -33, -33, -33, -33, -33, -33, -33, -33, -33, -33, -33, -33, -33, -33, -33, -33, -33, -33, -33, -33, -33, -33, -33, -33, -33, -33, -33, -33, -33, -33, -33, -33, -33, -33, -33, -33, -33, -33, -33, -33, -33, -33, -33, -33, -33, -33, -33, -33, -33, -33, -33, -33, -33, -33, -33, -33, -33, -33, -33, -33, -33, -33, -33, -33, -33, -33, -33, -33, -33, -33, -33, -33, -33, -33, -33, -33, -33, -33, -33, -33, -33, -33, -33, -33, -33, -33, -33, -33, -33, -33, -33, -33, -33, -33, -33, -33, -33, -33, -33, -33, -33, -33, -33, -33, -33, -33, -33, -33, -33, -33, -33, -33, -33, -33, -33, -33, -33, -33, -33, -33, -33, -33, -33, -34, -33, -33, -33, -34, -33, -33, -33, -33, -34, -34, -34, -33, -33, -33, -33, -33, -34, -33, -33, -34, -33, -33, -33, -33, -33, -33, -33, -34, -34, -33, -33, -33, -33, -33, -33, -33, -33, -33, -33, -33, -33, -33, -33, -33, -33, -33, -33, -33, -33, -33, -34, -33, -33, -34, -33, -33, -33, -33, -33, -33, -33, -33, -33, -33, -33, -33, -33, -33, -33, -33, -33, -33, -33, -33, -33, -33, -33, -33, -33, -33, -33, -33, -33, -33, -33, -34, -33, -33, -34, -33, -33, -34, -34, -33, -33, -33, -33, -34, -34, -34, -33, -33, -33, -33, -33, -33, -33, -33, -33, -33, -34, -34, -34, -34, -34, -33, -33, -33, -33, -34, -34, -34, -33, -34, -34, -34, -34, -34, -33, -33, -34, -34, -33, -34, -34, -34, -34, -34, -33, -34, -34, -34, -34, -34, -34, -34, -34, -34, -33, -33, -33, -33, -33, -34, -34, -33, -34, -34, -34, -33, -33, -34, -34]
-42294c4%%%%J%%%j%%%%%%%%%%J%%jJ%%%%%%%j%J%%j%%Jj%%%%Jj%%%%%%%%%%%%%%%%%%%%%
-42335c4%%%%Jj%%%%J%%%j%%%%J%j%%%%%%%%%%%%%Jj%%%%%%%%%%%%%%%%%%Jj%%%%%%%%%%%
-42377c4%%%%%%%%%%%%%%%%%%%%%%%%%%%%%%%%%%%%%%%%%%%%%%%%%%%%%%%%%%%%%%%%%%%%
-42419c4%%%%%%%%%%%%%%%%%%%%%%%%%%%%%%%%%%%%%%%%%%%%%%%%%%%%%%%%%%%%%%%%%%%%
-42461c4%%%%%%%%%%%%%%%%%%%%%%%%%%%%%%%%%%%%%%%%%%%%%%%%%%%%%%%%%%%%%%%%%%%%
-42503c4%%%%%%%%%%%%%%%%%%%%%%%%%%%%%%%%%%%%%%%%%%%%%%%%%%%%%%%%%%%%%%%%%%%%
-42545c4%%%%%%%%%%%%%%%%%%%%%%%%%%%%%%%%%%%%%%%%%%%%%%%%%%%%%%%%%%%%%%%%%%%%
-42587c4%%%%%%%%%%%%%%%%%%%%%%%%%%%%%%%%%%%%%%%%%%%%%%%%%%%%%%%%%%%%%%%%%%%%
$$ y = [-34, -34, -34, -34, -34, -33, -33, -33, -33, -34, -34, -34, -34, -34, -34, -34, -34, -34, -34, -34, -33, -33, -33, -34, -33, -33, -33, -33, -33, -33, -33, -33, -34, -34, -33, -33, -33, -34, -34, -34, -33, -34, -34, -34, -34, -34, -33, -34, -34, -34, -34, -34, -34, -34, -34, -34, -34, -34, -34, -34, -34, -34, -34, -34, -34, -34, -34, -34, -34, -34, -34, -34, -34, -33, -34, -34, -34, -34, -34, -33, -33, -33, -33, -34, -34, -34, -34, -34, -33, -33, -34, -34, -34, -34, -34, -34, -34, -34, -34, -34, -34, -34, -34, -34, -33, -34, -34, -34, -34, -34, -34, -34, -34, -34, -34, -34, -34, -34, -34, -34, -34, -34, -34, -34, -33, -34, -34, -34, -34, -34, -34, -34, -34, -34, -34, -34, -34, -34, -34, -34, -34, -34, -34, -34, -34, -34, -34, -34, -34, -34, -34, -34, -34, -34, -34, -34, -34, -34, -34, -34, -34, -34, -34, -34, -34, -34, -34, -34, -34, -34, -34, -34, -34, -34, -34, -34, -34, -34, -34, -34, -34, -34, -34, -34, -34, -34, -34, -34, -34, -34, -34, -34, -34, -34, -34, -34, -34, -34, -34, -34, -34, -34, -34, -34, -34, -34, -34, -34, -34, -34, -34, -34, -34, -34, -34, -34, -34, -34, -34, -34, -34, -34, -34, -34, -34, -34, -34, -34, -34, -34, -34, -34, -34, -34, -34, -34, -34, -34, -34, -34, -34, -34, -34, -34, -34, -34, -34, -34, -34, -34, -34, -34, -34, -34, -34, -34, -34, -34, -34, -34, -34, -34, -34, -34, -34, -34, -34, -34, -34, -34, -34, -34, -34, -34, -34, -34, -34, -34, -34, -34, -34, -34, -34, -34, -34, -34, -34, -34, -34, -34, -34, -34, -34, -34, -34, -34, -34, -34, -34, -34, -34, -34, -34, -34, -34, -34, -34, -34, -34, -34, -34, -34, -34, -34, -34, -34, -34, -34, -34, -34, -34, -34, -34, -34, -34, -34, -34, -34, -34, -34, -34, -34, -34, -34, -34, -34, -34, -34, -34, -34, -34, -34, -34, -34, -34, -34, -34, -34, -34, -34, -34, -34, -34, -34, -34, -34, -34, -34, -34, -34, -34, -34, -34, -34, -34, -34, -34, -34, -34, -34, -34, -34, -34, -34, -34, -34, -34, -34, -34, -34, -34, -34, -34, -34, -34, -34, -34, -34, -34, -34, -34, -34, -34, -34, -34, -34, -34, -34, -34, -34, -34, -34, -34, -34, -34, -34, -34, -34, -34, -34, -34, -34, -34, -34, -34, -34, -34, -34, -34, -34, -34, -34, -34, -34, -34, -34, -34, -34, -34, -34, -34, -34, -34, -34, -34, -34, -34, -34, -34, -34, -34, -34, -34, -34, -34, -34, -34, -34, -34, -34, -34, -34, -34, -34, -34, -34, -34, -34, -34, -34, -34, -34, -34, -34, -34, -34, -34, -34, -34, -34, -34, -34, -34, -34, -34, -34, -34, -34, -34, -34, -34, -34, -34, -34, -34, -34, -34, -34, -34, -34, -34, -34, -34, -34, -34, -34, -34, -34, -34, -34, -34, -34, -34, -34, -34, -34, -34, -34, -34, -34, -34, -34, -34, -34, -34, -34, -34, -34, -34, -34, -34, -34, -34, -34, -34, -34, -34, -34, -34, -34, -34, -34, -34, -34, -34, -34, -34, -34, -34, -34, -34, -34, -34, -34, -34]
-42628c4%%%%%%%%%%%%%%%%%%%%%%%%%%%%%%%%%%%%%%%%%%%%%%%%%%%%%%%%%%%%%%%%%%%%
-42670c4%%%%%%%%%%%%%%%%%%%%%%%%%%%%%%%%%%%%%%%%%%%%%%%%%%%%%%%%%%%%%%%%%%%%
-42712c4%%%%%%%%%%%%%%%%%%%%%%%jJ%%%%%%%%%%%jJ%%%%%%%%%%%%%jJ%%%%%%%%%%%%%%%
-42754c4%%jJ%%%%%%jJ%%%%%%%%%%%%%%%%%%%%%%%%%%%%%%%%%jJj%J%%%%%%%%%%jJ%j%J%%
-42796c4%%%%%%%%%%%j%J%%%%%jJ%%%%%%%%jJ%%%j%J%%%%j%%%J%%jJ%j%Jj%J%jJj%%%%J%%
-42838c4%%jJ%%%j%%J%%jJj%J%j%%%%%J%j%Jj%%%%%%%%%%%JjJ%%%j%%JjJj%%%%%%J%j%%%%
-42879c5%%%%JjJ%%%%j%%%%%%%%%%%%%%%%%%%%%%%%%%%%%%%%%Jj%%%%%%%%%%%%%%%%%%%Jj
-42921c5%%%%%%Jj%%%%%%%%%%%%%%%%%%%%%%%%%%%%%%%%%%%%%%%%Jj%%%%%%%%%%%%%%%%%%
$$ y = [-34, -34, -34, -34, -34, -34, -34, -34, -34, -34, -34, -34, -34, -34, -34, -34, -34, -34, -34, -34, -34, -34, -34, -34, -34, -34, -34, -34, -34, -34, -34, -34, -34, -34, -34, -34, -34, -34, -34, -34, -34, -34, -34, -34, -34, -34, -34, -34, -34, -34, -34, -34, -34, -34, -34, -34, -34, -34, -34, -34, -34, -34, -34, -34, -34, -34, -34, -34, -34, -34, -34, -34, -34, -34, -34, -34, -34, -34, -34, -34, -34, -34, -34, -34, -34, -34, -34, -34, -34, -34, -34, -34, -34, -34, -34, -34, -34, -34, -34, -34, -34, -34, -34, -34, -34, -34, -34, -34, -34, -34, -34, -34, -34, -34, -34, -34, -34, -34, -34, -34, -34, -34, -34, -34, -34, -34, -34, -34, -34, -34, -34, -34, -34, -34, -34, -34, -34, -34, -34, -34, -34, -34, -34, -34, -34, -34, -34, -34, -34, -34, -34, -34, -34, -34, -34, -34, -34, -34, -34, -34, -35, -34, -34, -34, -34, -34, -34, -34, -34, -34, -34, -34, -34, -35, -34, -34, -34, -34, -34, -34, -34, -34, -34, -34, -34, -34, -34, -34, -35, -34, -34, -34, -34, -34, -34, -34, -34, -34, -34, -34, -34, -34, -34, -34, -34, -34, -34, -35, -34, -34, -34, -34, -34, -34, -34, -35, -34, -34, -34, -34, -34, -34, -34, -34, -34, -34, -34, -34, -34, -34, -34, -34, -34, -34, -34, -34, -34, -34, -34, -34, -34, -34, -34, -34, -34, -34, -34, -34, -34, -34, -35, -34, -35, -35, -34, -34, -34, -34, -34, -34, -34, -34, -34, -34, -34, -35, -34, -34, -35, -35, -34, -34, -34, -34, -34, -34, -34, -34, -34, -34, -34, -34, -34, -34, -35, -35, -34, -34, -34, -34, -34, -34, -35, -34, -34, -34, -34, -34, -34, -34, -34, -34, -35, -34, -34, -34, -34, -35, -35, -34, -34, -34, -34, -34, -35, -35, -35, -35, -34, -34, -34, -35, -34, -34, -35, -35, -34, -35, -35, -34, -34, -35, -34, -35, -35, -35, -35, -35, -34, -34, -34, -34, -34, -35, -34, -34, -34, -34, -35, -35, -35, -34, -34, -34, -35, -34, -35, -35, -34, -34, -35, -35, -35, -35, -35, -35, -34, -34, -35, -35, -34, -35, -35, -35, -35, -35, -35, -35, -35, -35, -35, -35, -35, -34, -35, -34, -34, -34, -34, -35, -35, -35, -34, -35, -34, -35, -35, -35, -35, -35, -35, -35, -34, -34, -35, -35, -35, -35, -35, -35, -35, -35, -35, -34, -35, -34, -34, -34, -34, -34, -35, -35, -35, -35, -35, -35, -35, -35, -35, -35, -35, -35, -35, -35, -35, -35, -35, -35, -35, -35, -35, -35, -35, -35, -35, -35, -35, -35, -35, -35, -35, -35, -35, -35, -34, -35, -35, -35, -35, -35, -35, -35, -35, -35, -35, -35, -35, -35, -35, -35, -35, -35, -35, -35, -35, -34, -35, -35, -35, -35, -35, -35, -35, -34, -35, -35, -35, -35, -35, -35, -35, -35, -35, -35, -35, -35, -35, -35, -35, -35, -35, -35, -35, -35, -35, -35, -35, -35, -35, -35, -35, -35, -35, -35, -35, -35, -35, -35, -35, -35, -35, -35, -35, -35, -35, -34, -35, -35, -35, -35, -35, -35, -35, -35, -35, -35, -35, -35, -35, -35, -35, -35, -35, -35, -35]
-42963c5%%%%%%%%%%%%%%%%%%%%%%%%%%%%%%%%%%%%%%%%%%%%%%%%%%%%%%%%%%%%%%%%%%%%
-43005c5%%%%%%%%%%%%%%%%%%%%%%%%%%%%%%%%%%%%%%%%%%%%%%%%%%%%%%%%%%%%%%%%%%%%
-43047c5%%%%%%%%%%%%%%%%%%%%%%%%%%%%%%%%%%%%%%%%%%%%%%%%%%%%%%%%%%%%%%%%%%%%
-43089c5%%%%%%%%%%%%%%%%%%%%%%%%%%%%%%%%%%%%%%%%%%%%%%%%%%%%%%%%%%%%%%%%%%%%
-43130c5%%%%%%%%%%%%%%%%%%%%%%%%%%%%%%%%%%%%%%%%%%%%%%%%%%%%%%%%%%%%%%%%%%%%
-43172c5%%%%%%%%%%%%%%%%%%%%%%%%%%%%%%%%%%%%%%%%%%%%%%%%%%%%%%%%%%%%%%%%%%%%
-43214c5%%%%%%%%%%%%%%%%%%%%%%%%%%%%%%%%%%%%%%%%%%%%%%%%%%%%%%%%%%%%%%%%%jJ%
-43256c5%%%%%%%%%%%%%%%%%%%%%%%%%%%%%%%%%%%%%%%%%%%%%%%%%%%%%%%%%%%%%%%%%%%%
$$ y = [-35, -35, -35, -35, -35, -35, -35, -35, -35, -35, -35, -35, -35, -35, -35, -35, -35, -35, -35, -35, -35, -35, -35, -35, -35, -35, -35, -35, -35, -35, -35, -35, -35, -35, -35, -35, -35, -35, -35, -35, -35, -35, -35, -35, -35, -35, -35, -35, -35, -35, -35, -35, -35, -35, -35, -35, -35, -35, -35, -35, -35, -35, -35, -35, -35, -35, -35, -35, -35, -35, -35, -35, -35, -35, -35, -35, -35, -35, -35, -35, -35, -35, -35, -35, -35, -35, -35, -35, -35, -35, -35, -35, -35, -35, -35, -35, -35, -35, -35, -35, -35, -35, -35, -35, -35, -35, -35, -35, -35, -35, -35, -35, -35, -35, -35, -35, -35, -35, -35, -35, -35, -35, -35, -35, -35, -35, -35, -35, -35, -35, -35, -35, -35, -35, -35, -35, -35, -35, -35, -35, -35, -35, -35, -35, -35, -35, -35, -35, -35, -35, -35, -35, -35, -35, -35, -35, -35, -35, -35, -35, -35, -35, -35, -35, -35, -35, -35, -35, -35, -35, -35, -35, -35, -35, -35, -35, -35, -35, -35, -35, -35, -35, -35, -35, -35, -35, -35, -35, -35, -35, -35, -35, -35, -35, -35, -35, -35, -35, -35, -35, -35, -35, -35, -35, -35, -35, -35, -35, -35, -35, -35, -35, -35, -35, -35, -35, -35, -35, -35, -35, -35, -35, -35, -35, -35, -35, -35, -35, -35, -35, -35, -35, -35, -35, -35, -35, -35, -35, -35, -35, -35, -35, -35, -35, -35, -35, -35, -35, -35, -35, -35, -35, -35, -35, -35, -35, -35, -35, -35, -35, -35, -35, -35, -35, -35, -35, -35, -35, -35, -35, -35, -35, -35, -35, -35, -35, -35, -35, -35, -35, -35, -35, -35, -35, -35, -35, -35, -35, -35, -35, -35, -35, -35, -35, -35, -35, -35, -35, -35, -35, -35, -35, -35, -35, -35, -35, -35, -35, -35, -35, -35, -35, -35, -35, -35, -35, -35, -35, -35, -35, -35, -35, -35, -35, -35, -35, -35, -35, -35, -35, -35, -35, -35, -35, -35, -35, -35, -35, -35, -35, -35, -35, -35, -35, -35, -35, -35, -35, -35, -35, -35, -35, -35, -35, -35, -35, -35, -35, -35, -35, -35, -35, -35, -35, -35, -35, -35, -35, -35, -35, -35, -35, -35, -35, -35, -35, -35, -35, -35, -35, -35, -35, -35, -35, -35, -35, -35, -35, -35, -35, -35, -35, -35, -35, -35, -35, -35, -35, -35, -35, -35, -35, -35, -35, -35, -35, -35, -35, -35, -35, -35, -35, -35, -35, -35, -35, -35, -35, -35, -35, -35, -35, -35, -35, -35, -35, -35, -35, -35, -35, -35, -35, -35, -35, -35, -35, -35, -35, -35, -35, -35, -35, -35, -35, -35, -35, -35, -35, -35, -35, -35, -35, -35, -35, -35, -35, -35, -35, -35, -35, -35, -35, -35, -35, -35, -35, -35, -35, -35, -35, -35, -35, -35, -35, -36, -35, -35, -35, -35, -35, -35, -35, -35, -35, -35, -35, -35, -35, -35, -35, -35, -35, -35, -35, -35, -35, -35, -35, -35, -35, -35, -35, -35, -35, -35, -35, -35, -35, -35, -35, -35, -35, -35, -35, -35, -35, -35, -35, -35, -35, -35, -35, -35, -35, -35, -35, -35, -35, -35, -35, -35, -35, -35, -35, -35, -35, -35, -35, -35, -35, -35, -35, -35, -35, -35]
-43298c5%%%%%%%%%%%%%%%%%%%%%%%%%%%%%%%%%%%%%%%%%%%%%%%%%%%%%%%%%%%%%%%%%%%%
-43340c5%%%%%%%%%%%%%%%%%%%%%%%%%%%%%%%jJ%%%%%%%%%%%%%%%%%%%%%%%%%%%%%%%%%%%
-43381c5%%%%%%%%%jJ%%%%%%%%%j%J%%%%jJjJ%jJ%%%jJ%%jJ%%%%%%%%%%%%%j%%J%jJ%%jJ%
-43423c5jJ%jJ%j%Jj%J%%%%%j%J%j%%%%J%j%%J%jJj%%%%%J%jJjJ%j%%%%%%%%%%J%%%jJ%j%
-43465c6%JjJj%%Jj%%%%%Jj%%%JjJ%j%Jj%%%JjJ%j%%%%%Jj%%%%Jj%%Jj%%JjJj%%%%Jj%%Jj
-43507c6%%%J%jJ%j%%%%%%%%%%%%%J%%j%%%%%%Jj%Jj%%%%Jj%%%%%%%%%%%%%%%%%%%%%%%%%
-43549c6%%%%%%%%%%%%%%%%%%%%%%%%%%%%%%%%%%%%%%%%%%%%%%%%%%%%%%%%%%%%%%%%%%%%
-43591c6%%%%%%%%%%%%%%%%%%%%%%%%%%%%%%%%%%%%%%%%%%%%%%%%%%%%%%%%%%%%%%%%%%%%
$$ y = [-35, -35, -35, -35, -35, -35, -35, -35, -35, -35, -35, -35, -35, -35, -35, -35, -35, -35, -35, -35, -35, -35, -35, -35, -35, -35, -35, -35, -35, -35, -35, -35, -35, -35, -35, -35, -35, -35, -35, -35, -35, -35, -35, -35, -35, -35, -35, -35, -35, -35, -35, -35, -35, -35, -35, -35, -35, -35, -35, -35, -35, -35, -35, -35, -35, -35, -35, -35, -35, -35, -35, -35, -35, -35, -35, -35, -35, -35, -35, -35, -35, -35, -35, -35, -35, -35, -35, -35, -35, -35, -35, -35, -35, -35, -35, -35, -35, -35, -35, -35, -36, -35, -35, -35, -35, -35, -35, -35, -35, -35, -35, -35, -35, -35, -35, -35, -35, -35, -35, -35, -35, -35, -35, -35, -35, -35, -35, -35, -35, -35, -35, -35, -35, -35, -35, -35, -35, -35, -35, -35, -35, -35, -35, -35, -35, -35, -36, -35, -35, -35, -35, -35, -35, -35, -35, -35, -35, -36, -36, -35, -35, -35, -35, -35, -36, -35, -36, -35, -35, -36, -35, -35, -35, -35, -36, -35, -35, -35, -36, -35, -35, -35, -35, -35, -35, -35, -35, -35, -35, -35, -35, -35, -35, -36, -36, -36, -35, -35, -36, -35, -35, -35, -36, -35, -35, -36, -35, -35, -36, -35, -35, -36, -36, -35, -36, -36, -35, -35, -35, -35, -35, -35, -36, -36, -35, -35, -36, -36, -36, -36, -36, -35, -35, -36, -36, -36, -35, -35, -36, -35, -36, -36, -36, -36, -36, -36, -35, -35, -36, -35, -36, -35, -35, -36, -36, -36, -36, -36, -36, -36, -36, -36, -36, -36, -35, -35, -35, -35, -36, -35, -35, -36, -36, -36, -35, -36, -35, -36, -36, -36, -35, -36, -36, -36, -36, -36, -36, -35, -36, -36, -36, -36, -35, -36, -35, -35, -36, -36, -35, -36, -36, -36, -36, -35, -36, -35, -35, -36, -36, -36, -36, -36, -36, -35, -36, -36, -36, -36, -36, -35, -36, -36, -36, -35, -36, -36, -36, -35, -36, -35, -36, -36, -36, -36, -36, -35, -36, -36, -36, -35, -36, -36, -36, -36, -35, -35, -36, -35, -35, -36, -36, -36, -36, -36, -36, -36, -36, -36, -36, -36, -36, -36, -36, -35, -35, -35, -36, -36, -36, -36, -36, -36, -36, -35, -36, -36, -35, -36, -36, -36, -36, -36, -35, -36, -36, -36, -36, -36, -36, -36, -36, -36, -36, -36, -36, -36, -36, -36, -36, -36, -36, -36, -36, -36, -36, -36, -36, -36, -36, -36, -36, -36, -36, -36, -36, -36, -36, -36, -36, -36, -36, -36, -36, -36, -36, -36, -36, -36, -36, -36, -36, -36, -36, -36, -36, -36, -36, -36, -36, -36, -36, -36, -36, -36, -36, -36, -36, -36, -36, -36, -36, -36, -36, -36, -36, -36, -36, -36, -36, -36, -36, -36, -36, -36, -36, -36, -36, -36, -36, -36, -36, -36, -36, -36, -36, -36, -36, -36, -36, -36, -36, -36, -36, -36, -36, -36, -36, -36, -36, -36, -36, -36, -36, -36, -36, -36, -36, -36, -36, -36, -36, -36, -36, -36, -36, -36, -36, -36, -36, -36, -36, -36, -36, -36, -36, -36, -36, -36, -36, -36, -36, -36, -36, -36, -36, -36, -36, -36, -36, -36, -36, -36, -36, -36, -36, -36, -36, -36, -36, -36, -36, -36, -36, -36, -36]
-43632c6%%%%%%%%%%%%%%%%%%%%%%%%%%%%%%%%%%%%%%%%%%%%%%%%%%%%%%%%%%%%%%%%%%%%
-43674c6%%%%%%%%%%%%%%%%%%%%%%%%%%%%%%%%%%%%%%%%%%%%%%%%%%%%%%%%%%%%%%%%%%%%
-43716c6%%%%%%%%%%%%%%%%%%%%%%%%%%%%%%%%%%%%%%%%%%%%%%%%%%%%%%%%%%%%%%%%%%%%
-43758c6%%%%%%%%%%%%%%%%%%%%%%%%%%%%%%%%%%%%%%%%%%%%%%%%%%%%%%%%%%%%%%%%%%%%
-43800c6%%%%%%%%%%%%%%%%%%%%%%%%%%%%%%%%%%%%%%%%%%%%%%%%%%%%%%%%%%%%%%%%%%%%
-43842c6%%%%%%%%%%%%%%%%%%%%%%%%%%%%%%%%%%%%%%%%%%%%%%%%%%%%%%%%%%%%%%%%%%%%
-43884c6%%%%%%%%%%%%%%%%%%%%%%%%%%%%%%%%%%%%%%%%%%%%%%%%%%%%%%%%%%%%%%%%%%%%
-43925c6%%%%%%%%%%%%%%%%%%%%%%%%%%%%%%%%%%%jJ%%%%%%%%%%%%%%%%%%%%%%%%%%%%%%%
$$ y = [-36, -36, -36, -36, -36, -36, -36, -36, -36, -36, -36, -36, -36, -36, -36, -36, -36, -36, -36, -36, -36, -36, -36, -36, -36, -36, -36, -36, -36, -36, -36, -36, -36, -36, -36, -36, -36, -36, -36, -36, -36, -36, -36, -36, -36, -36, -36, -36, -36, -36, -36, -36, -36, -36, -36, -36, -36, -36, -36, -36, -36, -36, -36, -36, -36, -36, -36, -36, -36, -36, -36, -36, -36, -36, -36, -36, -36, -36, -36, -36, -36, -36, -36, -36, -36, -36, -36, -36, -36, -36, -36, -36, -36, -36, -36, -36, -36, -36, -36, -36, -36, -36, -36, -36, -36, -36, -36, -36, -36, -36, -36, -36, -36, -36, -36, -36, -36, -36, -36, -36, -36, -36, -36, -36, -36, -36, -36, -36, -36, -36, -36, -36, -36, -36, -36, -36, -36, -36, -36, -36, -36, -36, -36, -36, -36, -36, -36, -36, -36, -36, -36, -36, -36, -36, -36, -36, -36, -36, -36, -36, -36, -36, -36, -36, -36, -36, -36, -36, -36, -36, -36, -36, -36, -36, -36, -36, -36, -36, -36, -36, -36, -36, -36, -36, -36, -36, -36, -36, -36, -36, -36, -36, -36, -36, -36, -36, -36, -36, -36, -36, -36, -36, -36, -36, -36, -36, -36, -36, -36, -36, -36, -36, -36, -36, -36, -36, -36, -36, -36, -36, -36, -36, -36, -36, -36, -36, -36, -36, -36, -36, -36, -36, -36, -36, -36, -36, -36, -36, -36, -36, -36, -36, -36, -36, -36, -36, -36, -36, -36, -36, -36, -36, -36, -36, -36, -36, -36, -36, -36, -36, -36, -36, -36, -36, -36, -36, -36, -36, -36, -36, -36, -36, -36, -36, -36, -36, -36, -36, -36, -36, -36, -36, -36, -36, -36, -36, -36, -36, -36, -36, -36, -36, -36, -36, -36, -36, -36, -36, -36, -36, -36, -36, -36, -36, -36, -36, -36, -36, -36, -36, -36, -36, -36, -36, -36, -36, -36, -36, -36, -36, -36, -36, -36, -36, -36, -36, -36, -36, -36, -36, -36, -36, -36, -36, -36, -36, -36, -36, -36, -36, -36, -36, -36, -36, -36, -36, -36, -36, -36, -36, -36, -36, -36, -36, -36, -36, -36, -36, -36, -36, -36, -36, -36, -36, -36, -36, -36, -36, -36, -36, -36, -36, -36, -36, -36, -36, -36, -36, -36, -36, -36, -36, -36, -36, -36, -36, -36, -36, -36, -36, -36, -36, -36, -36, -36, -36, -36, -36, -36, -36, -36, -36, -36, -36, -36, -36, -36, -36, -36, -36, -36, -36, -36, -36, -36, -36, -36, -36, -36, -36, -36, -36, -36, -36, -36, -36, -36, -36, -36, -36, -36, -36, -36, -36, -36, -36, -36, -36, -36, -36, -36, -36, -36, -36, -36, -36, -36, -36, -36, -36, -36, -36, -36, -36, -36, -36, -36, -36, -36, -36, -36, -36, -36, -36, -36, -36, -36, -36, -36, -36, -36, -36, -36, -36, -36, -36, -36, -36, -36, -36, -36, -36, -36, -36, -36, -36, -36, -36, -36, -36, -36, -36, -36, -36, -36, -36, -36, -36, -36, -36, -36, -36, -36, -36, -36, -36, -36, -36, -36, -36, -36, -36, -37, -36, -36, -36, -36, -36, -36, -36, -36, -36, -36, -36, -36, -36, -36, -36, -36, -36, -36, -36, -36, -36, -36, -36, -36, -36, -36, -36, -36, -36, -36, -36, -36]
-43967c6%%%%%%%%%%%%%%%%%%%%%%%%%%%%%%jJ%%%%%%jJ%%%%%%%%%%%%%%%%%%%%%jJ%%%%%
-44009c6%%%%%%%%%%%%%%%%%%%%%%j%%%%J%%%j%%J%%%%%%%%%%%%j%J%j%J%%%%%%%%%%%%j%
-44051c7%Jj%%J%%jJjJ%%%j%Jj%%%Jj%Jj%J%%j%JjJj%%%Jj%%J%%%%%jJ%j%%%%%%%%%%%J%j
-44093c7%J%%%%%%%%%%%j%JjJjJ%%j%JjJj%Jj%%%%Jj%%%%%%%%%JjJ%j%%%%J%j%%%%%Jj%J%
-44135c6j%J%j%%%Jj%Jj%%%Jj%%%Jj%%%%%%%J%j%%%%%%%%%%%%%%%%%Jj%%%%%%Jj%%%%%%%%
-44176c7%%%%%%%%%%%%%%%%%%%%%%%%%%%%%%%%%%%%%%%%%%%%%%%%%%%%%%%%%%%%Jj%%%%%%
-44218c7%%%%Jj%%%%%%%%%%%%%%%%%%%%%%%%%%%%%%%%%%%%%%%%%%%%%%%%%%%%%%%%%%%Jj%
-44260c7%%%%%%%%%%%%%%%%%%%%%%%%%%%%%%%%%%%%%%%%%%%%%%%%%%%%%%%%%%%%%%%%%%%%
$$ y = [-36, -36, -36, -36, -36, -36, -36, -36, -36, -36, -36, -36, -36, -36, -36, -36, -36, -36, -36, -36, -36, -36, -36, -36, -36, -36, -36, -36, -36, -36, -36, -37, -36, -36, -36, -36, -36, -36, -36, -37, -36, -36, -36, -36, -36, -36, -36, -36, -36, -36, -36, -36, -36, -36, -36, -36, -36, -36, -36, -36, -36, -36, -37, -36, -36, -36, -36, -36, -36, -36, -36, -36, -36, -36, -36, -36, -36, -36, -36, -36, -36, -36, -36, -36, -36, -36, -36, -36, -36, -36, -36, -37, -37, -37, -37, -37, -36, -36, -36, -36, -37, -37, -37, -36, -36, -36, -36, -36, -36, -36, -36, -36, -36, -36, -36, -36, -37, -37, -36, -36, -37, -37, -36, -36, -36, -36, -36, -36, -36, -36, -36, -36, -36, -36, -36, -37, -37, -37, -36, -37, -37, -37, -36, -36, -36, -37, -36, -37, -36, -36, -36, -36, -37, -37, -36, -37, -37, -37, -37, -36, -37, -37, -36, -37, -37, -36, -36, -36, -37, -37, -36, -37, -36, -37, -37, -37, -37, -36, -37, -37, -37, -36, -36, -36, -36, -36, -36, -37, -36, -36, -37, -37, -37, -37, -37, -37, -37, -37, -37, -37, -37, -37, -36, -36, -37, -37, -36, -36, -36, -36, -36, -36, -36, -36, -36, -36, -36, -36, -37, -37, -36, -37, -36, -37, -36, -36, -36, -37, -37, -36, -37, -36, -37, -37, -36, -37, -37, -37, -37, -37, -36, -37, -37, -37, -37, -37, -37, -37, -37, -37, -37, -36, -37, -36, -36, -37, -37, -37, -37, -37, -36, -36, -37, -37, -37, -37, -37, -37, -36, -37, -37, -36, -36, -37, -37, -36, -36, -37, -37, -37, -37, -36, -37, -37, -36, -37, -37, -37, -37, -36, -37, -37, -37, -37, -36, -37, -37, -37, -37, -37, -37, -37, -37, -36, -36, -37, -37, -37, -37, -37, -37, -37, -37, -37, -37, -37, -37, -37, -37, -37, -37, -37, -37, -36, -37, -37, -37, -37, -37, -37, -37, -36, -37, -37, -37, -37, -37, -37, -37, -37, -37, -37, -37, -37, -37, -37, -37, -37, -37, -37, -37, -37, -37, -37, -37, -37, -37, -37, -37, -37, -37, -37, -37, -37, -37, -37, -37, -37, -37, -37, -37, -37, -37, -37, -37, -37, -37, -37, -37, -37, -37, -37, -37, -37, -37, -37, -37, -37, -37, -37, -37, -37, -37, -37, -37, -37, -37, -37, -37, -37, -37, -36, -37, -37, -37, -37, -37, -37, -37, -37, -37, -37, -37, -36, -37, -37, -37, -37, -37, -37, -37, -37, -37, -37, -37, -37, -37, -37, -37, -37, -37, -37, -37, -37, -37, -37, -37, -37, -37, -37, -37, -37, -37, -37, -37, -37, -37, -37, -37, -37, -37, -37, -37, -37, -37, -37, -37, -37, -37, -37, -37, -37, -37, -37, -37, -37, -37, -37, -37, -37, -37, -37, -37, -37, -36, -37, -37, -37, -37, -37, -37, -37, -37, -37, -37, -37, -37, -37, -37, -37, -37, -37, -37, -37, -37, -37, -37, -37, -37, -37, -37, -37, -37, -37, -37, -37, -37, -37, -37, -37, -37, -37, -37, -37, -37, -37, -37, -37, -37, -37, -37, -37, -37, -37, -37, -37, -37, -37, -37, -37, -37, -37, -37, -37, -37, -37, -37, -37, -37, -37, -37, -37, -37, -37, -37]
-44302c7%%%%%%%%%%%%%%%%%%%%%%%%%%%%%%%%%%%%%%%%%%%%%%%%%%%%%%%%%%%%%%%%%%%%
-44344c7%%%%%%%%%%%%%%%%%%%%%%%%%%%%%%%%%%%%%%%%%%%%%%%%%%%%%%%%%%%%%%%%%%%%
-44386c7%%%%%%%%%%%%%%%%%%%%%%%%%%%%%%%%%%%%%%%%%%%%%%%%%%%%%%%%%%%%%%%%%%%%
-44427c7%%%%%%%%%%%%%%%%%%%%%%%%%%%%%%%%%%%%%%%%%%%%%%%%%%%%%%%%%%%%%%%%%%%%
-44469c7%%%%%%%%%%%%%%%%%%%%%%%%%%%%%%%%%%%%%%%%%%%%%%%%%%%%%%%%%%%%%%%%%%%%
-44511c7%%%%%%%%%%%%%%%%%%%%%%%%%%%%%%%%%%%%%%%%%%%%%%%%%%%%%%%%%%%%%%%%%%%%
-44553c7%%%%%%%%%%%%%%%%%%%%%%%%%%%%%%%%%%%%%%%%%%%%%%%%%%%%%%%%%%%%%%%%%%%%
-44595c7%%%%%%%%%%%%%%%%%%%%%%%%%%%%%%%%%%%%%%%%%%%%%%%%%%%%%%%%%%%%%%%%%%%%
$$ y = [-37, -37, -37, -37, -37, -37, -37, -37, -37, -37, -37, -37, -37, -37, -37, -37, -37, -37, -37, -37, -37, -37, -37, -37, -37, -37, -37, -37, -37, -37, -37, -37, -37, -37, -37, -37, -37, -37, -37, -37, -37, -37, -37, -37, -37, -37, -37, -37, -37, -37, -37, -37, -37, -37, -37, -37, -37, -37, -37, -37, -37, -37, -37, -37, -37, -37, -37, -37, -37, -37, -37, -37, -37, -37, -37, -37, -37, -37, -37, -37, -37, -37, -37, -37, -37, -37, -37, -37, -37, -37, -37, -37, -37, -37, -37, -37, -37, -37, -37, -37, -37, -37, -37, -37, -37, -37, -37, -37, -37, -37, -37, -37, -37, -37, -37, -37, -37, -37, -37, -37, -37, -37, -37, -37, -37, -37, -37, -37, -37, -37, -37, -37, -37, -37, -37, -37, -37, -37, -37, -37, -37, -37, -37, -37, -37, -37, -37, -37, -37, -37, -37, -37, -37, -37, -37, -37, -37, -37, -37, -37, -37, -37, -37, -37, -37, -37, -37, -37, -37, -37, -37, -37, -37, -37, -37, -37, -37, -37, -37, -37, -37, -37, -37, -37, -37, -37, -37, -37, -37, -37, -37, -37, -37, -37, -37, -37, -37, -37, -37, -37, -37, -37, -37, -37, -37, -37, -37, -37, -37, -37, -37, -37, -37, -37, -37, -37, -37, -37, -37, -37, -37, -37, -37, -37, -37, -37, -37, -37, -37, -37, -37, -37, -37, -37, -37, -37, -37, -37, -37, -37, -37, -37, -37, -37, -37, -37, -37, -37, -37, -37, -37, -37, -37, -37, -37, -37, -37, -37, -37, -37, -37, -37, -37, -37, -37, -37, -37, -37, -37, -37, -37, -37, -37, -37, -37, -37, -37, -37, -37, -37, -37, -37, -37, -37, -37, -37, -37, -37, -37, -37, -37, -37, -37, -37, -37, -37, -37, -37, -37, -37, -37, -37, -37, -37, -37, -37, -37, -37, -37, -37, -37, -37, -37, -37, -37, -37, -37, -37, -37, -37, -37, -37, -37, -37, -37, -37, -37, -37, -37, -37, -37, -37, -37, -37, -37, -37, -37, -37, -37, -37, -37, -37, -37, -37, -37, -37, -37, -37, -37, -37, -37, -37, -37, -37, -37, -37, -37, -37, -37, -37, -37, -37, -37, -37, -37, -37, -37, -37, -37, -37, -37, -37, -37, -37, -37, -37, -37, -37, -37, -37, -37, -37, -37, -37, -37, -37, -37, -37, -37, -37, -37, -37, -37, -37, -37, -37, -37, -37, -37, -37, -37, -37, -37, -37, -37, -37, -37, -37, -37, -37, -37, -37, -37, -37, -37, -37, -37, -37, -37, -37, -37, -37, -37, -37, -37, -37, -37, -37, -37, -37, -37, -37, -37, -37, -37, -37, -37, -37, -37, -37, -37, -37, -37, -37, -37, -37, -37, -37, -37, -37, -37, -37, -37, -37, -37, -37, -37, -37, -37, -37, -37, -37, -37, -37, -37, -37, -37, -37, -37, -37, -37, -37, -37, -37, -37, -37, -37, -37, -37, -37, -37, -37, -37, -37, -37, -37, -37, -37, -37, -37, -37, -37, -37, -37, -37, -37, -37, -37, -37, -37, -37, -37, -37, -37, -37, -37, -37, -37, -37, -37, -37, -37, -37, -37, -37, -37, -37, -37, -37, -37, -37, -37, -37, -37, -37, -37, -37, -37, -37, -37, -37, -37, -37, -37, -37, -37, -37, -37, -37, -37, -37, -37, -37, -37, -37]
-44637c7%%%%%%%%%%%%%%%%%%%%%%%%%%%%%%%jJ%%%%%%%%%%%%%%%%%%%%%%%%%%%%%%%%%%%
-44678c7%%%%%%%%%jJ%%%%%%j%J%%%%%%%%%%%%j%J%%%%%%%%%%%%%%%%%%%%%%j%J%%%%%jJ%
-44720c7%%%%%%%j%JjJ%%jJ%j%%%J%%%j%%%JjJ%jJ%%%%jJ%%j%J%j%%%%J%j%%%%J%%%%%%jJ
-44762c7j%%%%%J%%%j%%%J%jJj%J%%%j%%%%%JjJ%%%jJ%%%%%%%%%jJ%%jJ%%jJj%J%j%%%%%%
-44804c8Jj%%%%Jj%%%Jj%%%%%%%J%%%j%J%j%J%%%%j%%J%%j%%Jj%%Jj%%%%%J%%j%%%%%%%%J
-44846c7jJj%Jj%%%J%j%%%%%%%%%%%%%%%%%%J%%j%%%%%J%j%%%%%%%JjJj%%%%%%%%%Jj%%%%
-44888c8%%%%%%%%%%%%%%%%Jj%%%%%%%%%%%%%%%%%%%%%%%%%%%%%%%%%%%%%%%%%%%%%%%%%%
-44929c8%%%%%%%%%%%%%%%%%Jj%%%%%%%%%%%%%%%%%%%%%%%%%%%%%%%%%%%%%%%%%%%%%%%%%
$$ y = [-37, -37, -37, -37, -37, -37, -37, -37, -37, -37, -37, -37, -37, -37, -37, -37, -37, -37, -37, -37, -37, -37, -37, -37, -37, -37, -37, -37, -37, -37, -37, -37, -38, -37, -37, -37, -37, -37, -37, -37, -37, -37, -37, -37, -37, -37, -37, -37, -37, -37, -37, -37, -37, -37, -37, -37, -37, -37, -37, -37, -37, -37, -37, -37, -37, -37, -37, -37, -37, -37, -37, -37, -37, -37, -37, -37, -37, -37, -38, -37, -37, -37, -37, -37, -37, -37, -38, -38, -37, -37, -37, -37, -37, -37, -37, -37, -37, -37, -37, -37, -37, -38, -38, -37, -37, -37, -37, -37, -37, -37, -37, -37, -37, -37, -37, -37, -37, -37, -37, -37, -37, -37, -37, -37, -37, -37, -38, -38, -37, -37, -37, -37, -37, -37, -38, -37, -37, -37, -37, -37, -37, -37, -37, -37, -38, -38, -37, -38, -37, -37, -37, -38, -37, -37, -38, -38, -38, -38, -37, -37, -37, -37, -38, -38, -38, -38, -37, -38, -37, -37, -38, -37, -37, -37, -37, -37, -38, -37, -37, -37, -38, -38, -37, -37, -38, -38, -38, -38, -38, -37, -37, -38, -38, -38, -38, -38, -37, -37, -37, -37, -37, -37, -37, -38, -37, -38, -38, -38, -38, -38, -38, -37, -37, -37, -37, -38, -38, -38, -38, -37, -37, -38, -37, -38, -38, -37, -37, -37, -37, -38, -38, -38, -38, -38, -38, -37, -38, -37, -37, -37, -37, -38, -37, -37, -37, -37, -37, -37, -37, -37, -37, -37, -38, -37, -37, -37, -38, -37, -37, -37, -38, -37, -38, -38, -37, -37, -38, -38, -38, -38, -38, -38, -38, -37, -38, -38, -38, -38, -38, -37, -38, -38, -38, -38, -37, -38, -38, -38, -38, -38, -38, -38, -38, -37, -37, -37, -37, -38, -38, -37, -37, -38, -38, -37, -37, -37, -37, -37, -38, -38, -38, -37, -37, -37, -38, -38, -38, -37, -38, -38, -38, -37, -38, -38, -38, -38, -38, -38, -37, -37, -37, -38, -38, -38, -38, -38, -38, -38, -38, -38, -37, -38, -37, -38, -38, -37, -38, -38, -38, -38, -37, -37, -38, -38, -38, -38, -38, -38, -38, -38, -38, -38, -38, -38, -38, -38, -38, -38, -38, -38, -38, -37, -37, -37, -38, -38, -38, -38, -38, -38, -37, -37, -38, -38, -38, -38, -38, -38, -38, -38, -37, -38, -37, -38, -38, -38, -38, -38, -38, -38, -38, -38, -38, -37, -38, -38, -38, -38, -38, -38, -38, -38, -38, -38, -38, -38, -38, -38, -38, -38, -38, -38, -38, -38, -38, -37, -38, -38, -38, -38, -38, -38, -38, -38, -38, -38, -38, -38, -38, -38, -38, -38, -38, -38, -38, -38, -38, -38, -38, -38, -38, -38, -38, -38, -38, -38, -38, -38, -38, -38, -38, -38, -38, -38, -38, -38, -38, -38, -38, -38, -38, -38, -38, -38, -38, -38, -38, -38, -38, -38, -38, -38, -38, -38, -38, -38, -38, -38, -38, -38, -38, -38, -38, -38, -37, -38, -38, -38, -38, -38, -38, -38, -38, -38, -38, -38, -38, -38, -38, -38, -38, -38, -38, -38, -38, -38, -38, -38, -38, -38, -38, -38, -38, -38, -38, -38, -38, -38, -38, -38, -38, -38, -38, -38, -38, -38, -38, -38, -38, -38, -38, -38, -38, -38, -38]
-44971c8%%Jj%%%%%%%%%%%%%%%%%%%%%%%%%%%%%%%%%%%%%%%%%%%%%%%%%%%%%%%%%%%%%%%%
-45013c8%%%%%%%%%%%%%%%%%%%%%%%%%%%%%%%%%%%%%%%%%%%%%%%%%%%%%%%%%%%%%%%%%%%%
-45055c8%%%%%%%%%%%%%%%%%%%%%%%%%%%%%%%%%%%%%%%%%%%%%%%%%%%%%%%%%%%%%%%%%%%%
-45097c8%%%%%%%%%%%%%%%%%%%%%%%%%%%%%%%%J%%j%%%%%%%%%%%%%J%%j%%%%%%%%%%%%%%%
-45139c8%%%%%%%%%%%%%%%%%%%%%%%%%%%%%%%%%%%%%%%%%%%%%%%%%%%%%%%%%%%%%%%%%%%%
-45181c8%%%%%%%%%%%%%%%%%%%%%%%%%%%%%%%%%%%%%%%%%%%%%%%%%%%%%%%%%%%%%%%%%%%%
-45222c8%%%%%%%%%%%%%%%%%%%%%%%%%%%%%%%%%%%%%%%%%%%%%%%%%%%%%%%%%%%%%%%%%%%%
-45264c8%%%%%%%%%%%%%%%%%%%%%%%%%%%%%%%%%%%%%%%%%%%%%%%%%%%%%%%%%%%%%%%%%%%%
$$ y = [-38, -38, -38, -37, -38, -38, -38, -38, -38, -38, -38, -38, -38, -38, -38, -38, -38, -38, -38, -38, -38, -38, -38, -38, -38, -38, -38, -38, -38, -38, -38, -38, -38, -38, -38, -38, -38, -38, -38, -38, -38, -38, -38, -38, -38, -38, -38, -38, -38, -38, -38, -38, -38, -38, -38, -38, -38, -38, -38, -38, -38, -38, -38, -38, -38, -38, -38, -38, -38, -38, -38, -38, -38, -38, -38, -38, -38, -38, -38, -38, -38, -38, -38, -38, -38, -38, -38, -38, -38, -38, -38, -38, -38, -38, -38, -38, -38, -38, -38, -38, -38, -38, -38, -38, -38, -38, -38, -38, -38, -38, -38, -38, -38, -38, -38, -38, -38, -38, -38, -38, -38, -38, -38, -38, -38, -38, -38, -38, -38, -38, -38, -38, -38, -38, -38, -38, -38, -38, -38, -38, -38, -38, -38, -38, -38, -38, -38, -38, -38, -38, -38, -38, -38, -38, -38, -38, -38, -38, -38, -38, -38, -38, -38, -38, -38, -38, -38, -38, -38, -38, -38, -38, -38, -38, -38, -38, -38, -38, -38, -38, -38, -38, -38, -38, -38, -38, -38, -38, -38, -38, -38, -38, -38, -38, -38, -38, -38, -38, -38, -38, -38, -38, -38, -38, -38, -38, -38, -38, -38, -38, -38, -38, -38, -38, -38, -38, -38, -38, -38, -38, -38, -38, -38, -38, -38, -38, -38, -38, -38, -38, -38, -38, -38, -38, -38, -38, -38, -37, -37, -37, -38, -38, -38, -38, -38, -38, -38, -38, -38, -38, -38, -38, -38, -38, -37, -37, -37, -38, -38, -38, -38, -38, -38, -38, -38, -38, -38, -38, -38, -38, -38, -38, -38, -38, -38, -38, -38, -38, -38, -38, -38, -38, -38, -38, -38, -38, -38, -38, -38, -38, -38, -38, -38, -38, -38, -38, -38, -38, -38, -38, -38, -38, -38, -38, -38, -38, -38, -38, -38, -38, -38, -38, -38, -38, -38, -38, -38, -38, -38, -38, -38, -38, -38, -38, -38, -38, -38, -38, -38, -38, -38, -38, -38, -38, -38, -38, -38, -38, -38, -38, -38, -38, -38, -38, -38, -38, -38, -38, -38, -38, -38, -38, -38, -38, -38, -38, -38, -38, -38, -38, -38, -38, -38, -38, -38, -38, -38, -38, -38, -38, -38, -38, -38, -38, -38, -38, -38, -38, -38, -38, -38, -38, -38, -38, -38, -38, -38, -38, -38, -38, -38, -38, -38, -38, -38, -38, -38, -38, -38, -38, -38, -38, -38, -38, -38, -38, -38, -38, -38, -38, -38, -38, -38, -38, -38, -38, -38, -38, -38, -38, -38, -38, -38, -38, -38, -38, -38, -38, -38, -38, -38, -38, -38, -38, -38, -38, -38, -38, -38, -38, -38, -38, -38, -38, -38, -38, -38, -38, -38, -38, -38, -38, -38, -38, -38, -38, -38, -38, -38, -38, -38, -38, -38, -38, -38, -38, -38, -38, -38, -38, -38, -38, -38, -38, -38, -38, -38, -38, -38, -38, -38, -38, -38, -38, -38, -38, -38, -38, -38, -38, -38, -38, -38, -38, -38, -38, -38, -38, -38, -38, -38, -38, -38, -38, -38, -38, -38, -38, -38, -38, -38, -38, -38, -38, -38, -38, -38, -38, -38, -38, -38, -38, -38, -38, -38, -38, -38, -38, -38, -38, -38, -38, -38, -38, -38, -38, -38, -38, -38, -38, -38, -38, -38, -38, -38]
-45306c8%%%%%%%%%%%%%%%%%%%%%%%%%%%%%%%%%%%%%%%%jJ%%%%%%%%%%%%%%%%%%%%%%%%%%
-45348c8%%%%%%%%%%%%%%%%%%%%%%%%%%%%%%%%%%%%%%%%%%%%%%%%%%%%%%%%%%%%%%%%%jJ%
-45390c8%%%%%%%%%%%%%%%%%%%%%%%%%%%%%%%%jJ%%%%%%%%%%%%%%%%%%%%%jJ%%%%jJ%%%%j
-45432c9%J%%%%%%jJ%%%%%%%jJ%j%%J%%%%%%%%%%%%%jJ%%%jJjJ%%%%%%%%%%%%%%%%jJ%%jJ
-45473c8%%jJ%%%jJ%%%%%%%%%%jJ%%%%jJ%%%%%%%%%%%j%%J%%%%%%%%%jJ%%%jJ%%%%%%jJ%%
-45515c8%%%%%%%jJ%jJjJ%%%%%jJjJ%%jJ%%%%%%%jJ%j%%%%%%%J%jJj%%%%J%%%%%j%%%J%%%
-45557c8j%%%J%%%%%j%J%%%%%j%%%%%J%%jJjJj%%%%%%%J%j%%%%%%Jj%%Jj%%%%%%JjJ%j%J%
-45599c8j%%%%Jj%%%%%%%Jj%J%%%%%j%%%%%%%%JjJj%%%%J%j%%%%J%j%%%%%%%J%%j%J%%j%%
$$ y = [-38, -38, -38, -38, -38, -38, -38, -38, -38, -38, -38, -38, -38, -38, -38, -38, -38, -38, -38, -38, -38, -38, -38, -38, -38, -38, -38, -38, -38, -38, -38, -38, -38, -38, -38, -38, -38, -38, -38, -38, -38, -39, -38, -38, -38, -38, -38, -38, -38, -38, -38, -38, -38, -38, -38, -38, -38, -38, -38, -38, -38, -38, -38, -38, -38, -38, -38, -38, -38, -38, -38, -38, -38, -38, -38, -38, -38, -38, -38, -38, -38, -38, -38, -38, -38, -38, -38, -38, -38, -38, -38, -38, -38, -38, -38, -38, -38, -38, -38, -38, -38, -38, -38, -38, -38, -38, -38, -38, -38, -38, -38, -38, -38, -38, -38, -38, -38, -38, -38, -38, -38, -38, -38, -38, -38, -38, -38, -38, -38, -38, -38, -38, -38, -38, -39, -38, -38, -38, -38, -38, -38, -38, -38, -38, -38, -38, -38, -38, -38, -38, -38, -38, -38, -38, -38, -38, -38, -38, -38, -38, -38, -38, -38, -38, -38, -38, -38, -38, -38, -39, -38, -38, -38, -38, -38, -38, -38, -38, -38, -38, -38, -38, -38, -38, -38, -38, -38, -38, -38, -38, -38, -38, -39, -38, -38, -38, -38, -38, -39, -38, -38, -38, -38, -38, -39, -39, -38, -38, -38, -38, -38, -38, -38, -39, -38, -38, -38, -38, -38, -38, -38, -38, -39, -38, -38, -39, -39, -39, -38, -38, -38, -38, -38, -38, -38, -38, -38, -38, -38, -38, -38, -38, -39, -38, -38, -38, -38, -39, -38, -39, -38, -38, -38, -38, -38, -38, -38, -38, -38, -38, -38, -38, -38, -38, -38, -38, -38, -39, -38, -38, -38, -39, -38, -38, -38, -39, -38, -38, -38, -38, -39, -38, -38, -38, -38, -38, -38, -38, -38, -38, -38, -38, -39, -38, -38, -38, -38, -38, -39, -38, -38, -38, -38, -38, -38, -38, -38, -38, -38, -38, -38, -39, -39, -39, -38, -38, -38, -38, -38, -38, -38, -38, -38, -38, -39, -38, -38, -38, -38, -39, -38, -38, -38, -38, -38, -38, -38, -39, -38, -38, -38, -38, -38, -38, -38, -38, -38, -38, -39, -38, -38, -39, -38, -39, -38, -38, -38, -38, -38, -38, -39, -38, -39, -38, -38, -38, -39, -38, -38, -38, -38, -38, -38, -38, -38, -39, -38, -38, -39, -39, -39, -39, -39, -39, -39, -39, -38, -38, -39, -38, -39, -39, -39, -39, -39, -38, -38, -38, -38, -38, -38, -39, -39, -39, -39, -38, -38, -38, -38, -39, -39, -39, -39, -38, -38, -38, -38, -38, -38, -39, -39, -38, -38, -38, -38, -38, -38, -39, -39, -39, -39, -39, -39, -38, -38, -38, -39, -38, -39, -38, -39, -39, -39, -39, -39, -39, -39, -39, -38, -38, -39, -39, -39, -39, -39, -39, -39, -38, -39, -39, -39, -38, -39, -39, -39, -39, -39, -39, -39, -38, -39, -38, -38, -39, -39, -38, -38, -39, -39, -39, -39, -39, -38, -39, -39, -39, -39, -39, -39, -39, -39, -38, -39, -39, -38, -38, -38, -38, -38, -38, -39, -39, -39, -39, -39, -39, -39, -39, -39, -38, -39, -38, -39, -39, -39, -39, -39, -38, -38, -39, -39, -39, -39, -39, -38, -38, -39, -39, -39, -39, -39, -39, -39, -39, -38, -38, -38, -39, -39, -38, -38, -38, -39, -39, -39]
-45641c9%Jj%%%%%%%%JjJj%%Jj%%%%J%%%j%%%%%%%%%%%%Jj%Jj%%%%%%%J%j%Jj%Jj%%%%%%%
-45683c9Jj%%%%%%%%%%%%%%%%%%Jj%%%%%%%%%%%Jj%%%%%Jj%%%%%%%%%%%%%%%%%%%%%%%%%%
-45724c9%%%%%%%%%%%%%%%%%%%%%%Jj%%%%%%%%%%%%%%%%%%%%%%%%%%%%%%%%%%%%%%%%%%%%
-45766c9%%%%%%%%%%%%%%%%%%%%%%%%%%%%%%%%%%%%%%%%%%%%%%%%%%%%%%%%%%%%%%%%%%%%
-45808c9%%%%%%%%%%%%%%%%%%%%%%%%%%%%%%%%%%%%%%%%%%%%%%%%%%%%%%%%%%%%%%%%%%%%
-45850c9%%%%%%%%%%%%%%%%%%%%%%%%%%%%%%%%%%%%%%%%%%%%%%%%%%%%%%%%%%%%%%%%%%%%
-45892c9%%%%%%%%%%%%%%%%%%%%%%%%%%%%%%%%%%%%%%%%%%%%%%%%%%%%%%%%%%%%%%%%%%%%
-45934c9%%%%%%%%%%%%%%%%%%%%%%%%%%%%%%%%%%%%%%%%%%%%%%%%%%%%%%%%%%%%%%%%%%%%
$$ y = [-39, -39, -38, -39, -39, -39, -39, -39, -39, -39, -39, -39, -38, -39, -38, -39, -39, -39, -38, -39, -39, -39, -39, -39, -38, -38, -38, -38, -39, -39, -39, -39, -39, -39, -39, -39, -39, -39, -39, -39, -39, -38, -39, -39, -38, -39, -39, -39, -39, -39, -39, -39, -39, -38, -38, -39, -39, -38, -39, -39, -38, -39, -39, -39, -39, -39, -39, -39, -39, -38, -39, -39, -39, -39, -39, -39, -39, -39, -39, -39, -39, -39, -39, -39, -39, -39, -39, -39, -39, -38, -39, -39, -39, -39, -39, -39, -39, -39, -39, -39, -39, -39, -38, -39, -39, -39, -39, -39, -39, -38, -39, -39, -39, -39, -39, -39, -39, -39, -39, -39, -39, -39, -39, -39, -39, -39, -39, -39, -39, -39, -39, -39, -39, -39, -39, -39, -39, -39, -39, -39, -39, -39, -39, -39, -39, -39, -39, -39, -39, -39, -39, -39, -39, -39, -39, -39, -39, -39, -39, -38, -39, -39, -39, -39, -39, -39, -39, -39, -39, -39, -39, -39, -39, -39, -39, -39, -39, -39, -39, -39, -39, -39, -39, -39, -39, -39, -39, -39, -39, -39, -39, -39, -39, -39, -39, -39, -39, -39, -39, -39, -39, -39, -39, -39, -39, -39, -39, -39, -39, -39, -39, -39, -39, -39, -39, -39, -39, -39, -39, -39, -39, -39, -39, -39, -39, -39, -39, -39, -39, -39, -39, -39, -39, -39, -39, -39, -39, -39, -39, -39, -39, -39, -39, -39, -39, -39, -39, -39, -39, -39, -39, -39, -39, -39, -39, -39, -39, -39, -39, -39, -39, -39, -39, -39, -39, -39, -39, -39, -39, -39, -39, -39, -39, -39, -39, -39, -39, -39, -39, -39, -39, -39, -39, -39, -39, -39, -39, -39, -39, -39, -39, -39, -39, -39, -39, -39, -39, -39, -39, -39, -39, -39, -39, -39, -39, -39, -39, -39, -39, -39, -39, -39, -39, -39, -39, -39, -39, -39, -39, -39, -39, -39, -39, -39, -39, -39, -39, -39, -39, -39, -39, -39, -39, -39, -39, -39, -39, -39, -39, -39, -39, -39, -39, -39, -39, -39, -39, -39, -39, -39, -39, -39, -39, -39, -39, -39, -39, -39, -39, -39, -39, -39, -39, -39, -39, -39, -39, -39, -39, -39, -39, -39, -39, -39, -39, -39, -39, -39, -39, -39, -39, -39, -39, -39, -39, -39, -39, -39, -39, -39, -39, -39, -39, -39, -39, -39, -39, -39, -39, -39, -39, -39, -39, -39, -39, -39, -39, -39, -39, -39, -39, -39, -39, -39, -39, -39, -39, -39, -39, -39, -39, -39, -39, -39, -39, -39, -39, -39, -39, -39, -39, -39, -39, -39, -39, -39, -39, -39, -39, -39, -39, -39, -39, -39, -39, -39, -39, -39, -39, -39, -39, -39, -39, -39, -39, -39, -39, -39, -39, -39, -39, -39, -39, -39, -39, -39, -39, -39, -39, -39, -39, -39, -39, -39, -39, -39, -39, -39, -39, -39, -39, -39, -39, -39, -39, -39, -39, -39, -39, -39, -39, -39, -39, -39, -39, -39, -39, -39, -39, -39, -39, -39, -39, -39, -39, -39, -39, -39, -39, -39, -39, -39, -39, -39, -39, -39, -39, -39, -39, -39, -39, -39, -39, -39, -39, -39, -39, -39, -39, -39, -39, -39, -39, -39, -39, -39, -39, -39, -39, -39, -39, -39, -39, -39, -39]
-45975c9%%%%%%%%%%%%%%%%%%%%%%%%%%%%%%%%%%%%%%%%%%%%%%%%%%%%%%%%%%%%%%%%%%%%
-46017c9%%%%%%%%%%%%%%%%%%%%%%%%%%%%%%%%%%%%%%%%%%%%%%%%%%%%%%%%%%%%%%%%%%%%
-46059c9%%%%%%%%%%%%%%%%%%%%%%%%%%%%%%%%%%%%%%%%%%%%%%%%%%%%%%%%%%%%%%%%%%%%
-46101c9%%%%%%%%%%%%%%%%%%%%%%%%%%%%%%%%%%%%%%%%%%%%%%%%%%%%%%%%%%%%%%%%%%%%
-46143c9%%%%%%%%%%%%%%%%%%%%%%%%%%%%%%%%%%%%%%%%%%%%%%%%%%%%%%%%%%%%%%%%%%%%
-46185c9%%%%%%%%%%%%%%%%%%%%%%%%%%%%%%%%%%%%%%%%%%%%%%%%%%%%%%%%%%%%%%%%%%%%
-46226c9%%%%%%%%%%%jJ%%%%%%%%%%%%%%%%%%%%%%%%%%%%%%%%%%%%%%%%%%%%%%%%%%%%%%%
-46268c9%%%%%%%%%%%%%%%%%%%%%%%%%%%%%%%%%%%%%%%%%%%%%%%%%%%%%%%%%%%%%%%%%%%%
$$ y = [-39, -39, -39, -39, -39, -39, -39, -39, -39, -39, -39, -39, -39, -39, -39, -39, -39, -39, -39, -39, -39, -39, -39, -39, -39, -39, -39, -39, -39, -39, -39, -39, -39, -39, -39, -39, -39, -39, -39, -39, -39, -39, -39, -39, -39, -39, -39, -39, -39, -39, -39, -39, -39, -39, -39, -39, -39, -39, -39, -39, -39, -39, -39, -39, -39, -39, -39, -39, -39, -39, -39, -39, -39, -39, -39, -39, -39, -39, -39, -39, -39, -39, -39, -39, -39, -39, -39, -39, -39, -39, -39, -39, -39, -39, -39, -39, -39, -39, -39, -39, -39, -39, -39, -39, -39, -39, -39, -39, -39, -39, -39, -39, -39, -39, -39, -39, -39, -39, -39, -39, -39, -39, -39, -39, -39, -39, -39, -39, -39, -39, -39, -39, -39, -39, -39, -39, -39, -39, -39, -39, -39, -39, -39, -39, -39, -39, -39, -39, -39, -39, -39, -39, -39, -39, -39, -39, -39, -39, -39, -39, -39, -39, -39, -39, -39, -39, -39, -39, -39, -39, -39, -39, -39, -39, -39, -39, -39, -39, -39, -39, -39, -39, -39, -39, -39, -39, -39, -39, -39, -39, -39, -39, -39, -39, -39, -39, -39, -39, -39, -39, -39, -39, -39, -39, -39, -39, -39, -39, -39, -39, -39, -39, -39, -39, -39, -39, -39, -39, -39, -39, -39, -39, -39, -39, -39, -39, -39, -39, -39, -39, -39, -39, -39, -39, -39, -39, -39, -39, -39, -39, -39, -39, -39, -39, -39, -39, -39, -39, -39, -39, -39, -39, -39, -39, -39, -39, -39, -39, -39, -39, -39, -39, -39, -39, -39, -39, -39, -39, -39, -39, -39, -39, -39, -39, -39, -39, -39, -39, -39, -39, -39, -39, -39, -39, -39, -39, -39, -39, -39, -39, -39, -39, -39, -39, -39, -39, -39, -39, -39, -39, -39, -39, -39, -39, -39, -39, -39, -39, -39, -39, -39, -39, -39, -39, -39, -39, -39, -39, -39, -39, -39, -39, -39, -39, -39, -39, -39, -39, -39, -39, -39, -39, -39, -39, -39, -39, -39, -39, -39, -39, -39, -39, -39, -39, -39, -39, -39, -39, -39, -39, -39, -39, -39, -39, -39, -39, -39, -39, -39, -39, -39, -39, -39, -39, -39, -39, -39, -39, -39, -39, -39, -39, -39, -39, -39, -39, -39, -39, -39, -39, -39, -39, -39, -39, -39, -39, -39, -39, -39, -39, -39, -39, -39, -39, -39, -39, -39, -39, -39, -39, -39, -39, -39, -39, -39, -39, -39, -39, -39, -39, -39, -39, -39, -39, -39, -39, -39, -39, -39, -39, -40, -39, -39, -39, -39, -39, -39, -39, -39, -39, -39, -39, -39, -39, -39, -39, -39, -39, -39, -39, -39, -39, -39, -39, -39, -39, -39, -39, -39, -39, -39, -39, -39, -39, -39, -39, -39, -39, -39, -39, -39, -39, -39, -39, -39, -39, -39, -39, -39, -39, -39, -39, -39, -39, -39, -39, -39, -39, -39, -39, -39, -39, -39, -39, -39, -39, -39, -39, -39, -39, -39, -39, -39, -39, -39, -39, -39, -39, -39, -39, -39, -39, -39, -39, -39, -39, -39, -39, -39, -39, -39, -39, -39, -39, -39, -39, -39, -39, -39, -39, -39, -39, -39, -39, -39, -39, -39, -39, -39, -39, -39, -39, -39, -39, -39, -39, -39, -39, -39, -39, -39, -39, -39, -39, -39]
-46310c9jJ%%%%%%%%%%%%%%%%%%%%%%%%%%%jJ%%%%%%%%%%%%%%%%%%%%%%%%%%%%%%%%%%%%%
-46352c9%%%%%%%%%%jJ%%%%%jJ%%%%%%%%%%%%%%jJ%%%%%%%%%%%%%%%%%%%%%jJ%%%%jJ%%%%
-46394c9%jJ%%%%%%%jJ%%%%%%jJ%%jJ%j%J%%jJ%%%%%%%%%%%%jJjJjJ%%%%%%%j%%%JjJ%%j%
-46436d0J%%%%%%j%%%%%J%%%%%%%%%j%J%%%%%%%jJ%%%j%%%%%%J%%jJ%%jJ%j%JjJjJ%jJ%%%
-46478c9%%%%%%jJ%%j%%%J%%j%JjJ%%j%%%J%%%%%j%%%%%%%%%%%%%%JjJj%%%%%%%%J%%%%jJ
-46519c9%j%%%%%%J%%%j%%%Jj%%%%%%%%J%j%J%%j%%%%J%j%%%%%%%%Jj%%%%%JjJj%%%J%j%%
-46561d0J%j%J%%%%%%j%%J%j%%%%%%%%%%%%%%J%jJj%%%J%j%JjJj%%%Jj%%%%%%Jj%%%%%%%%
-46603d0%%%%%%Jj%%%%J%%j%JjJj%%%%%J%j%%%%%%%%%%%%%%%%%Jj%%%%J%j%%%%%%%Jj%%%%
$$ y = [-39, -40, -39, -39, -39, -39, -39, -39, -39, -39, -39, -39, -39, -39, -39, -39, -39, -39, -39, -39, -39, -39, -39, -39, -39, -39, -39, -39, -39, -39, -40, -39, -39, -39, -39, -39, -39, -39, -39, -39, -39, -39, -39, -39, -39, -39, -39, -39, -39, -39, -39, -39, -39, -39, -39, -39, -39, -39, -39, -39, -39, -39, -39, -39, -39, -39, -39, -39, -39, -39, -39, -39, -39, -39, -39, -39, -39, -39, -39, -40, -39, -39, -39, -39, -39, -39, -40, -39, -39, -39, -39, -39, -39, -39, -39, -39, -39, -39, -39, -39, -39, -39, -40, -39, -39, -39, -39, -39, -39, -39, -39, -39, -39, -39, -39, -39, -39, -39, -39, -39, -39, -39, -39, -39, -39, -40, -39, -39, -39, -39, -39, -40, -39, -39, -39, -39, -39, -39, -40, -39, -39, -39, -39, -39, -39, -39, -39, -40, -39, -39, -39, -39, -39, -39, -39, -40, -39, -39, -39, -40, -39, -39, -40, -40, -39, -39, -39, -40, -39, -39, -39, -39, -39, -39, -39, -39, -39, -39, -39, -39, -39, -40, -39, -40, -39, -40, -39, -39, -39, -39, -39, -39, -39, -39, -40, -40, -40, -40, -39, -40, -39, -39, -39, -40, -40, -39, -39, -39, -39, -39, -39, -39, -40, -40, -40, -40, -40, -40, -39, -39, -39, -39, -39, -39, -39, -39, -39, -39, -40, -40, -39, -39, -39, -39, -39, -39, -39, -39, -40, -39, -39, -39, -39, -40, -40, -40, -40, -40, -40, -40, -39, -39, -39, -40, -39, -39, -39, -40, -39, -39, -40, -40, -39, -40, -39, -40, -39, -39, -40, -39, -39, -39, -39, -39, -39, -39, -39, -39, -39, -40, -39, -39, -39, -40, -40, -40, -40, -39, -39, -39, -40, -40, -39, -40, -39, -39, -39, -40, -40, -40, -40, -39, -39, -39, -39, -39, -39, -40, -40, -40, -40, -40, -40, -40, -40, -40, -40, -40, -40, -40, -40, -40, -39, -40, -39, -40, -40, -40, -40, -40, -40, -40, -40, -40, -39, -39, -39, -39, -39, -40, -39, -39, -40, -40, -40, -40, -40, -40, -40, -39, -39, -39, -39, -40, -40, -40, -40, -39, -40, -40, -40, -40, -40, -40, -40, -40, -40, -39, -39, -40, -40, -39, -39, -39, -40, -40, -40, -40, -40, -39, -39, -40, -40, -40, -40, -40, -40, -40, -40, -40, -39, -40, -40, -40, -40, -40, -40, -39, -40, -39, -40, -40, -40, -40, -39, -39, -40, -40, -40, -39, -39, -40, -40, -39, -39, -39, -39, -39, -39, -39, -40, -40, -40, -39, -39, -40, -40, -40, -40, -40, -40, -40, -40, -40, -40, -40, -40, -40, -40, -40, -39, -39, -40, -39, -40, -40, -40, -40, -39, -39, -40, -40, -39, -40, -39, -40, -40, -40, -40, -39, -40, -40, -40, -40, -40, -40, -40, -39, -40, -40, -40, -40, -40, -40, -40, -40, -40, -40, -40, -40, -40, -40, -40, -39, -40, -40, -40, -40, -40, -39, -39, -39, -40, -40, -39, -40, -39, -40, -40, -40, -40, -40, -40, -39, -39, -40, -40, -40, -40, -40, -40, -40, -40, -40, -40, -40, -40, -40, -40, -40, -40, -40, -40, -39, -40, -40, -40, -40, -40, -39, -39, -40, -40, -40, -40, -40, -40, -40, -40, -39, -40, -40, -40, -40, -40]
-46645d0%%%%%%%%%%%%%%%%%%%%%%%%%%%%%%%%%%%%%%%%%%%%%%%%%%%%%%%%%%%%%%%%%%%%
-46687d0%%%%%%%%%%%%%%%%%%%%%%%%%%%%%%%%%%%%%%%%%%%%%%%%%%%%%%%%%%%%%%%%%%%%
-46729d0%%%%%%%%%%%%%%%%%%%%%%%%%%Jj%%%%%%%%%%%%%%%%%%%%%%%%%%%%%%%%%%%%%%%%
-46770d0%%%%%%%%%%%%%%%%%%%%%%%%%%%%%%%%%%%%%%%%%%%%%%%%%%%%%%%%%%%%%%%%%%%%
-46812d0%%%%%%%%%%%%%%%%%%%%%%%%%%%%%%%%%%%%%%%%%%%%%%%%%%%%%%%%%%%%%%%%%%%%
-46854d0%%%%%%%%%%%%%%%%%%%%%%%%%%%%%%%%%%%%%%%%%%%%%%%%%%%%%%%%%%%%%%%%%%%%
-46896d0%%%%%%%%%%%%%%%%%%%%%%%%%%%%%%%%%%%%%%%%%%%%%%%%%%%%%%%%%%%%%%%%%%%%
-46938d0%%%%%%%%%%%%%%%%%%%%%%%%%%%%%%%%%%%%%%%%%%%%%%%%%%%%%%%%%%%%%%%%%%%%
$$ y = [-40, -40, -40, -40, -40, -40, -40, -40, -40, -40, -40, -40, -40, -40, -40, -40, -40, -40, -40, -40, -40, -40, -40, -40, -40, -40, -40, -40, -40, -40, -40, -40, -40, -40, -40, -40, -40, -40, -40, -40, -40, -40, -40, -40, -40, -40, -40, -40, -40, -40, -40, -40, -40, -40, -40, -40, -40, -40, -40, -40, -40, -40, -40, -40, -40, -40, -40, -40, -40, -40, -40, -40, -40, -40, -40, -40, -40, -40, -40, -40, -40, -40, -40, -40, -40, -40, -40, -40, -40, -40, -40, -40, -40, -40, -40, -40, -40, -40, -40, -40, -40, -40, -40, -40, -40, -40, -40, -40, -40, -40, -40, -40, -40, -40, -40, -40, -40, -40, -40, -40, -40, -40, -40, -40, -40, -40, -40, -40, -40, -40, -40, -40, -40, -40, -40, -40, -40, -40, -40, -40, -40, -40, -40, -40, -40, -40, -40, -40, -40, -40, -40, -40, -40, -40, -40, -40, -40, -40, -40, -40, -40, -40, -40, -39, -40, -40, -40, -40, -40, -40, -40, -40, -40, -40, -40, -40, -40, -40, -40, -40, -40, -40, -40, -40, -40, -40, -40, -40, -40, -40, -40, -40, -40, -40, -40, -40, -40, -40, -40, -40, -40, -40, -40, -40, -40, -40, -40, -40, -40, -40, -40, -40, -40, -40, -40, -40, -40, -40, -40, -40, -40, -40, -40, -40, -40, -40, -40, -40, -40, -40, -40, -40, -40, -40, -40, -40, -40, -40, -40, -40, -40, -40, -40, -40, -40, -40, -40, -40, -40, -40, -40, -40, -40, -40, -40, -40, -40, -40, -40, -40, -40, -40, -40, -40, -40, -40, -40, -40, -40, -40, -40, -40, -40, -40, -40, -40, -40, -40, -40, -40, -40, -40, -40, -40, -40, -40, -40, -40, -40, -40, -40, -40, -40, -40, -40, -40, -40, -40, -40, -40, -40, -40, -40, -40, -40, -40, -40, -40, -40, -40, -40, -40, -40, -40, -40, -40, -40, -40, -40, -40, -40, -40, -40, -40, -40, -40, -40, -40, -40, -40, -40, -40, -40, -40, -40, -40, -40, -40, -40, -40, -40, -40, -40, -40, -40, -40, -40, -40, -40, -40, -40, -40, -40, -40, -40, -40, -40, -40, -40, -40, -40, -40, -40, -40, -40, -40, -40, -40, -40, -40, -40, -40, -40, -40, -40, -40, -40, -40, -40, -40, -40, -40, -40, -40, -40, -40, -40, -40, -40, -40, -40, -40, -40, -40, -40, -40, -40, -40, -40, -40, -40, -40, -40, -40, -40, -40, -40, -40, -40, -40, -40, -40, -40, -40, -40, -40, -40, -40, -40, -40, -40, -40, -40, -40, -40, -40, -40, -40, -40, -40, -40, -40, -40, -40, -40, -40, -40, -40, -40, -40, -40, -40, -40, -40, -40, -40, -40, -40, -40, -40, -40, -40, -40, -40, -40, -40, -40, -40, -40, -40, -40, -40, -40, -40, -40, -40, -40, -40, -40, -40, -40, -40, -40, -40, -40, -40, -40, -40, -40, -40, -40, -40, -40, -40, -40, -40, -40, -40, -40, -40, -40, -40, -40, -40, -40, -40, -40, -40, -40, -40, -40, -40, -40, -40, -40, -40, -40, -40, -40, -40, -40, -40, -40, -40, -40, -40, -40, -40, -40, -40, -40, -40, -40, -40, -40, -40, -40, -40, -40, -40, -40, -40, -40, -40, -40, -40, -40, -40, -40, -40, -40, -40, -40, -40, -40]
-46980d0%%%%%%%%%%%%%%%%%%%%%%%%%%%%%%%%%%%%%%%%%%%%%%%%%%%%%%%%%%%%%%%%%%%%
-47021d0%%%%%%%%%%%%%%%%%%%%%%%%%%%%%%%%%%%%%%%%%%%%%%%%%%%%%%%%%%%%%%%%%%%%
-47063d0%%%%%%%%%%%%%%%%%%%%%%%%%%%%%%%%%%%%%%%%%%%%%%%%%%%%%%%%%%%%%%%%%%%%
-47105d0%%%%%%%%%%%%%%%%%%%%%%%%%%%%%%%%%%%%%%%%%%%%%%%%%%%%%%%%%%%%%%%%%%%%
-47147d0%%%%%%%%%%%%%%%%%%%%%%%%%%%%%%%%%%%%%%%%%%%%%%%%%%%%%%%%%%%%%%%%%%%%
-47189d0%%%%%%%%%%%%%%%%%%%%%%%%%%%%%%%%%%%%%%%%%%%%%%%%%%%%%%%%%%%%%%%%%%%%
-47231d0%%%%%%%%%%%%%%%%%%%%%%%%%%%%%%%%%%%%%%%%%%%%%%%%%%%%%%%%%%%%%%%%%%%%
-47272d0%%%%%%%%%%%%%%%%%%%%%%%%%%%%%%%%%%%%%%%%%%%%%%%%%%%%%%%%%%%%%%%%%%%%
$$ y = [-40, -40, -40, -40, -40, -40, -40, -40, -40, -40, -40, -40, -40, -40, -40, -40, -40, -40, -40, -40, -40, -40, -40, -40, -40, -40, -40, -40, -40, -40, -40, -40, -40, -40, -40, -40, -40, -40, -40, -40, -40, -40, -40, -40, -40, -40, -40, -40, -40, -40, -40, -40, -40, -40, -40, -40, -40, -40, -40, -40, -40, -40, -40, -40, -40, -40, -40, -40, -40, -40, -40, -40, -40, -40, -40, -40, -40, -40, -40, -40, -40, -40, -40, -40, -40, -40, -40, -40, -40, -40, -40, -40, -40, -40, -40, -40, -40, -40, -40, -40, -40, -40, -40, -40, -40, -40, -40, -40, -40, -40, -40, -40, -40, -40, -40, -40, -40, -40, -40, -40, -40, -40, -40, -40, -40, -40, -40, -40, -40, -40, -40, -40, -40, -40, -40, -40, -40, -40, -40, -40, -40, -40, -40, -40, -40, -40, -40, -40, -40, -40, -40, -40, -40, -40, -40, -40, -40, -40, -40, -40, -40, -40, -40, -40, -40, -40, -40, -40, -40, -40, -40, -40, -40, -40, -40, -40, -40, -40, -40, -40, -40, -40, -40, -40, -40, -40, -40, -40, -40, -40, -40, -40, -40, -40, -40, -40, -40, -40, -40, -40, -40, -40, -40, -40, -40, -40, -40, -40, -40, -40, -40, -40, -40, -40, -40, -40, -40, -40, -40, -40, -40, -40, -40, -40, -40, -40, -40, -40, -40, -40, -40, -40, -40, -40, -40, -40, -40, -40, -40, -40, -40, -40, -40, -40, -40, -40, -40, -40, -40, -40, -40, -40, -40, -40, -40, -40, -40, -40, -40, -40, -40, -40, -40, -40, -40, -40, -40, -40, -40, -40, -40, -40, -40, -40, -40, -40, -40, -40, -40, -40, -40, -40, -40, -40, -40, -40, -40, -40, -40, -40, -40, -40, -40, -40, -40, -40, -40, -40, -40, -40, -40, -40, -40, -40, -40, -40, -40, -40, -40, -40, -40, -40, -40, -40, -40, -40, -40, -40, -40, -40, -40, -40, -40, -40, -40, -40, -40, -40, -40, -40, -40, -40, -40, -40, -40, -40, -40, -40, -40, -40, -40, -40, -40, -40, -40, -40, -40, -40, -40, -40, -40, -40, -40, -40, -40, -40, -40, -40, -40, -40, -40, -40, -40, -40, -40, -40, -40, -40, -40, -40, -40, -40, -40, -40, -40, -40, -40, -40, -40, -40, -40, -40, -40, -40, -40, -40, -40, -40, -40, -40, -40, -40, -40, -40, -40, -40, -40, -40, -40, -40, -40, -40, -40, -40, -40, -40, -40, -40, -40, -40, -40, -40, -40, -40, -40, -40, -40, -40, -40, -40, -40, -40, -40, -40, -40, -40, -40, -40, -40, -40, -40, -40, -40, -40, -40, -40, -40, -40, -40, -40, -40, -40, -40, -40, -40, -40, -40, -40, -40, -40, -40, -40, -40, -40, -40, -40, -40, -40, -40, -40, -40, -40, -40, -40, -40, -40, -40, -40, -40, -40, -40, -40, -40, -40, -40, -40, -40, -40, -40, -40, -40, -40, -40, -40, -40, -40, -40, -40, -40, -40, -40, -40, -40, -40, -40, -40, -40, -40, -40, -40, -40, -40, -40, -40, -40, -40, -40, -40, -40, -40, -40, -40, -40, -40, -40, -40, -40, -40, -40, -40, -40, -40, -40, -40, -40, -40, -40, -40, -40, -40, -40, -40, -40, -40, -40, -40, -40, -40, -40, -40, -40, -40, -40, -40, -40]
-47314d0%%%%%%%%%%%%%%%%%%%%%%%%%%%%%%%%%%%%%%%%%%%%%%%%%%%%%%%%%%%%%%%%%%%%
-47356d0%%%%%%%%%%%%%%%%%%%%%%%%%%%%%%%%%%%%%%%%%%%%%%%%%%%%%%%%%%%%%%%%%%%%
-47398d0%%%%%%%%%%%%%%%%%%jJ%%%%%%%%%%%%%%%%%%%%%%%%%%%%%%%%%%%%%%%%%%%%%%%j
-47440d1J%%%%%%%%%%%%%%%%%%%%%%%%%%%%%%%%%%%%%%%%%%%%%%%%%%%%%jJ%%%%%%%%%%%%
-47482d0%jJ%%%%%%%%%%%%%%%%%%%%%%%%%%%%%%%%%%%%%%%%%%jJ%%%%%%%%%%%%jJjJ%%jJ%
-47523d0%%j%J%%%j%Jj%%%%J%%%%%%%%%jJ%%%%%%%jJ%%%%jJ%j%%%JjJ%%jJ%%%%%%%%%%%%j
-47565d1J%%%%%%%%%%j%J%%%%%%%%%%%%%%%%%j%%%J%j%J%%%jJ%%%%%%%%%%%%%%%%jJ%%%%j
-47607d1J%jJj%%J%%%%%%%%%%%%%%jJj%J%jJj%J%%%%%%%%%%%jJ%%%%%%jJ%%%%jJ%j%%%Jj%
$$ y = [-40, -40, -40, -40, -40, -40, -40, -40, -40, -40, -40, -40, -40, -40, -40, -40, -40, -40, -40, -40, -40, -40, -40, -40, -40, -40, -40, -40, -40, -40, -40, -40, -40, -40, -40, -40, -40, -40, -40, -40, -40, -40, -40, -40, -40, -40, -40, -40, -40, -40, -40, -40, -40, -40, -40, -40, -40, -40, -40, -40, -40, -40, -40, -40, -40, -40, -40, -40, -40, -40, -40, -40, -40, -40, -40, -40, -40, -40, -40, -40, -40, -40, -40, -40, -40, -40, -40, -40, -40, -40, -40, -40, -40, -40, -40, -40, -40, -40, -40, -40, -40, -40, -40, -40, -40, -40, -40, -40, -40, -40, -40, -40, -40, -40, -40, -40, -40, -40, -40, -40, -40, -40, -40, -40, -40, -40, -40, -40, -40, -40, -40, -40, -40, -40, -40, -40, -40, -40, -40, -40, -40, -40, -40, -40, -40, -40, -40, -40, -40, -40, -40, -40, -40, -40, -40, -41, -40, -40, -40, -40, -40, -40, -40, -40, -40, -40, -40, -40, -40, -40, -40, -40, -40, -40, -40, -40, -40, -40, -40, -40, -40, -40, -40, -40, -40, -40, -40, -40, -40, -40, -40, -40, -40, -40, -40, -40, -40, -40, -40, -40, -40, -40, -40, -40, -41, -40, -40, -40, -40, -40, -40, -40, -40, -40, -40, -40, -40, -40, -40, -40, -40, -40, -40, -40, -40, -40, -40, -40, -40, -40, -40, -40, -40, -40, -40, -40, -40, -40, -40, -40, -40, -40, -40, -40, -40, -40, -40, -40, -40, -40, -40, -40, -40, -40, -40, -40, -40, -40, -40, -41, -40, -40, -40, -40, -40, -40, -40, -40, -40, -40, -40, -40, -40, -40, -41, -40, -40, -40, -40, -40, -40, -40, -40, -40, -40, -40, -40, -40, -40, -40, -40, -40, -40, -40, -40, -40, -40, -40, -40, -40, -40, -40, -40, -40, -40, -40, -40, -40, -40, -40, -40, -40, -40, -40, -40, -40, -40, -40, -41, -40, -40, -40, -40, -40, -40, -40, -40, -40, -40, -40, -40, -40, -41, -40, -41, -40, -40, -40, -41, -40, -40, -40, -40, -41, -41, -40, -40, -40, -40, -41, -41, -40, -41, -41, -41, -41, -41, -40, -40, -40, -40, -40, -40, -40, -40, -40, -40, -41, -40, -40, -40, -40, -40, -40, -40, -40, -41, -40, -40, -40, -40, -40, -41, -40, -40, -41, -41, -41, -41, -40, -41, -40, -40, -40, -41, -40, -40, -40, -40, -40, -40, -40, -40, -40, -40, -40, -40, -40, -41, -40, -40, -40, -40, -40, -40, -40, -40, -40, -40, -40, -41, -41, -40, -40, -40, -40, -40, -40, -40, -40, -40, -40, -40, -40, -40, -40, -40, -40, -40, -40, -41, -41, -41, -41, -40, -40, -41, -41, -40, -40, -40, -40, -41, -40, -40, -40, -40, -40, -40, -40, -40, -40, -40, -40, -40, -40, -40, -40, -40, -40, -41, -40, -40, -40, -40, -40, -41, -40, -40, -41, -40, -41, -41, -41, -40, -40, -40, -40, -40, -40, -40, -40, -40, -40, -40, -40, -40, -40, -40, -41, -40, -41, -41, -40, -40, -41, -40, -41, -41, -40, -40, -40, -40, -40, -40, -40, -40, -40, -40, -40, -40, -41, -40, -40, -40, -40, -40, -40, -40, -41, -40, -40, -40, -40, -40, -41, -40, -40, -41, -41, -41, -41, -40, -41, -41]
-47649d1J%%%%%%%%jJ%%%%%%%jJ%%%%%j%J%%%%j%%J%j%Jj%%%J%%%jJ%%jJ%jJ%%%jJ%j%%%%
-47691d1%%%%%JjJ%%%j%%%%%%%%%%%%J%jJ%j%%%%%J%jJj%%J%j%%%%%%%%%%%Jj%%%%%%%Jj%
-47733d1Jj%%%%%J%j%%%%Jj%%%J%j%%%%JjJj%J%%%j%%JjJ%j%%%%%%%%%%%%%%J%%j%%%%%%%
-47775d1%%%%%%%%%%J%%j%J%j%%%%Jj%%%%%%%%%%%JjJj%%%%%%%JjJ%%j%%%%Jj%%%%%%%%%%
-47816d1JjJj%%%%%%%%%Jj%%%%%%%%%Jj%%%%%%%%%%%J%j%%J%%j%%JjJjJ%%%j%%%%%%%%%%%
-47858d1%%%%%%%Jj%%%%%%%%%%%%%%Jj%%%%%JjJ%%j%%%%%%%Jj%Jj%%%%%%%Jj%%%%%%%%Jj%
-47900d1Jj%Jj%%%%%%%%%Jj%%%%%%%%%%%%%%%%J%%j%%%%%%%%%%%%%%%Jj%%%%%%%%%%%%%%%
-47942d1Jj%%%%%%Jj%%%%%%%%%%%%%%%%%%%%%%%%%%%%%%%%%%%Jj%%%%%%%%%%%%%%%%%%%%%
$$ y = [-41, -40, -40, -40, -40, -40, -40, -40, -40, -40, -41, -40, -40, -40, -40, -40, -40, -40, -40, -41, -40, -40, -40, -40, -40, -40, -41, -41, -40, -40, -40, -40, -40, -41, -41, -41, -40, -40, -41, -41, -40, -41, -41, -41, -41, -40, -40, -40, -40, -41, -40, -40, -40, -41, -40, -40, -41, -40, -40, -40, -40, -41, -40, -40, -41, -41, -41, -41, -41, -41, -41, -41, -41, -41, -40, -41, -40, -40, -40, -40, -41, -41, -41, -41, -41, -41, -41, -41, -41, -41, -41, -41, -41, -40, -40, -41, -40, -40, -41, -41, -41, -41, -41, -41, -40, -40, -41, -40, -41, -41, -41, -40, -40, -41, -41, -41, -41, -41, -41, -41, -41, -41, -41, -41, -41, -40, -41, -41, -41, -41, -41, -41, -41, -41, -40, -41, -41, -40, -41, -41, -41, -41, -41, -41, -40, -40, -41, -41, -41, -41, -41, -40, -41, -41, -41, -41, -40, -40, -41, -41, -41, -41, -41, -40, -41, -40, -41, -41, -40, -40, -40, -40, -41, -41, -41, -40, -41, -40, -40, -41, -41, -41, -41, -41, -41, -41, -41, -41, -41, -41, -41, -41, -41, -41, -40, -40, -40, -41, -41, -41, -41, -41, -41, -41, -41, -41, -41, -41, -41, -41, -41, -41, -41, -41, -41, -40, -40, -40, -41, -41, -40, -40, -41, -41, -41, -41, -41, -40, -41, -41, -41, -41, -41, -41, -41, -41, -41, -41, -41, -41, -40, -41, -40, -41, -41, -41, -41, -41, -41, -41, -41, -40, -41, -40, -40, -40, -41, -41, -41, -41, -41, -40, -41, -41, -41, -41, -41, -41, -41, -41, -41, -41, -41, -40, -41, -40, -41, -41, -41, -41, -41, -41, -41, -41, -41, -41, -40, -41, -41, -41, -41, -41, -41, -41, -41, -41, -41, -40, -41, -41, -41, -41, -41, -41, -41, -41, -41, -41, -41, -41, -40, -40, -41, -41, -41, -40, -40, -40, -41, -41, -41, -40, -41, -40, -41, -40, -40, -40, -40, -41, -41, -41, -41, -41, -41, -41, -41, -41, -41, -41, -41, -41, -41, -41, -41, -41, -41, -41, -40, -41, -41, -41, -41, -41, -41, -41, -41, -41, -41, -41, -41, -41, -41, -41, -40, -41, -41, -41, -41, -41, -41, -40, -41, -40, -40, -40, -41, -41, -41, -41, -41, -41, -41, -41, -40, -41, -41, -40, -41, -41, -41, -41, -41, -41, -41, -41, -40, -41, -41, -41, -41, -41, -41, -41, -41, -41, -40, -41, -41, -40, -41, -41, -40, -41, -41, -41, -41, -41, -41, -41, -41, -41, -41, -40, -41, -41, -41, -41, -41, -41, -41, -41, -41, -41, -41, -41, -41, -41, -41, -41, -41, -40, -40, -40, -41, -41, -41, -41, -41, -41, -41, -41, -41, -41, -41, -41, -41, -41, -41, -41, -40, -41, -41, -41, -41, -41, -41, -41, -41, -41, -41, -41, -41, -41, -41, -41, -41, -40, -41, -41, -41, -41, -41, -41, -41, -40, -41, -41, -41, -41, -41, -41, -41, -41, -41, -41, -41, -41, -41, -41, -41, -41, -41, -41, -41, -41, -41, -41, -41, -41, -41, -41, -41, -41, -41, -41, -41, -41, -41, -41, -41, -41, -40, -41, -41, -41, -41, -41, -41, -41, -41, -41, -41, -41, -41, -41, -41, -41, -41, -41, -41, -41, -41, -41, -41]
-47984d1%%%%%%%%%Jj%%%%%%%%%%%%%%%%%%%%%%%%%%%%%%%%%%%%%Jj%%%%%%%%%%%%Jj%%%%
-48026d1%%%%%%%%%%%%%%%%%%%%%%%%%%%%%%%%%%Jj%%%%%%%%%%%%%%%%%%%%%%%%%%%%%%%%
-48067d1%%%%%%%%%%%%%%%%%%%%%%%%%%%%%%%%%%%%Jj%%%%%%%%%%%%%%%%%%%%%%%%%%%%%%
-48109d1%%%%%%%%%%%%%%%%%%%Jj%%%%%%%%%%%%%%%%%%%%%%%%%%%%%%%%%%%%%%%%%%%%%%%
-48151d1%%%%%%%%%%%%%%%%%%%%%%%%%%%%%%%%%%%%%%%%%%%%%%%%%%%%%%%%%%%%%%%%%%%%
-48193d1%%%%%%%%%%%%%%%%%%%%%%%%%%%%%%%%%%%%%%%%%%%%%%%%%%%%%%%%%%%%%%%%%%%%
-48235d1%%%%%%%%%%%%%%%%%%%%%%%%%%%%%%%%%%%%%%%%%%%%%%%%%%%%%%%%%%%%%%%%%%%%
-48277d1%%%%%%%%%%%%%%%%%%%%%%%%%%%%%%%%%%%%%%%%%%%%%%%%%%%%%%%%%%%%%%%%%%%%
$$ y = [-41, -41, -41, -41, -41, -41, -41, -41, -41, -41, -40, -41, -41, -41, -41, -41, -41, -41, -41, -41, -41, -41, -41, -41, -41, -41, -41, -41, -41, -41, -41, -41, -41, -41, -41, -41, -41, -41, -41, -41, -41, -41, -41, -41, -41, -41, -41, -41, -41, -40, -41, -41, -41, -41, -41, -41, -41, -41, -41, -41, -41, -41, -41, -40, -41, -41, -41, -41, -41, -41, -41, -41, -41, -41, -41, -41, -41, -41, -41, -41, -41, -41, -41, -41, -41, -41, -41, -41, -41, -41, -41, -41, -41, -41, -41, -41, -41, -41, -41, -41, -41, -41, -41, -40, -41, -41, -41, -41, -41, -41, -41, -41, -41, -41, -41, -41, -41, -41, -41, -41, -41, -41, -41, -41, -41, -41, -41, -41, -41, -41, -41, -41, -41, -41, -41, -41, -41, -41, -41, -41, -41, -41, -41, -41, -41, -41, -41, -41, -41, -41, -41, -41, -41, -41, -41, -41, -41, -41, -41, -41, -41, -41, -41, -41, -41, -41, -41, -41, -41, -41, -41, -41, -41, -40, -41, -41, -41, -41, -41, -41, -41, -41, -41, -41, -41, -41, -41, -41, -41, -41, -41, -41, -41, -41, -41, -41, -41, -41, -41, -41, -41, -41, -41, -41, -41, -41, -41, -41, -41, -41, -41, -41, -41, -41, -41, -41, -41, -41, -41, -41, -41, -41, -41, -41, -40, -41, -41, -41, -41, -41, -41, -41, -41, -41, -41, -41, -41, -41, -41, -41, -41, -41, -41, -41, -41, -41, -41, -41, -41, -41, -41, -41, -41, -41, -41, -41, -41, -41, -41, -41, -41, -41, -41, -41, -41, -41, -41, -41, -41, -41, -41, -41, -41, -41, -41, -41, -41, -41, -41, -41, -41, -41, -41, -41, -41, -41, -41, -41, -41, -41, -41, -41, -41, -41, -41, -41, -41, -41, -41, -41, -41, -41, -41, -41, -41, -41, -41, -41, -41, -41, -41, -41, -41, -41, -41, -41, -41, -41, -41, -41, -41, -41, -41, -41, -41, -41, -41, -41, -41, -41, -41, -41, -41, -41, -41, -41, -41, -41, -41, -41, -41, -41, -41, -41, -41, -41, -41, -41, -41, -41, -41, -41, -41, -41, -41, -41, -41, -41, -41, -41, -41, -41, -41, -41, -41, -41, -41, -41, -41, -41, -41, -41, -41, -41, -41, -41, -41, -41, -41, -41, -41, -41, -41, -41, -41, -41, -41, -41, -41, -41, -41, -41, -41, -41, -41, -41, -41, -41, -41, -41, -41, -41, -41, -41, -41, -41, -41, -41, -41, -41, -41, -41, -41, -41, -41, -41, -41, -41, -41, -41, -41, -41, -41, -41, -41, -41, -41, -41, -41, -41, -41, -41, -41, -41, -41, -41, -41, -41, -41, -41, -41, -41, -41, -41, -41, -41, -41, -41, -41, -41, -41, -41, -41, -41, -41, -41, -41, -41, -41, -41, -41, -41, -41, -41, -41, -41, -41, -41, -41, -41, -41, -41, -41, -41, -41, -41, -41, -41, -41, -41, -41, -41, -41, -41, -41, -41, -41, -41, -41, -41, -41, -41, -41, -41, -41, -41, -41, -41, -41, -41, -41, -41, -41, -41, -41, -41, -41, -41, -41, -41, -41, -41, -41, -41, -41, -41, -41, -41, -41, -41, -41, -41, -41, -41, -41, -41, -41, -41, -41, -41, -41, -41, -41, -41, -41, -41, -41, -41, -41, -41, -41, -41, -41, -41, -41]
-48318d1%%%%%%%%%%%%%%%%%%%%%%%%%%%%%%%%%%%%%%%%%%%%%%%%%%%%%%%%%%%%%%%%%%%%
-48360d1%%%%%%%%%%%%%%%%%%%%%%%%%%%%%%%%%%%%%%%%%%%%%%%%%%%%%%%%%%%%%%%%%%%%
-48402d1%%%%%%%%%%%%%%%%%%%%%%%%%%%%%%%%%%%%%%%%%%%%%%%%%%%%%%%%%%%%%%%%%%%%
-48444d1%%%%%%%%%%%%%%%%%%%%%%%%%%%%%%%%%%%%%%%%%%%%%%%%%%%%%%%%%%%%%%%%%%%%
-48486d1%%%%%%%%%%%%%%%%%%%%%%%%%%%%%%%%%%%%%%%%%%%%%%%%%%%%%%%%%%%%%%%%%%%%
-48528d1%%%%%%%%%%%%%%%%%%%%%%%%%%%%%%%%%%%%%%%%%%%%%%%%%%%%%%%%%%%%%%%%%%%%
-48569d1%%%%%%%%%%%%%%%%%%%%%%%%%%%%%%%%%%%%%%%%%%%%%%%%%%%%%%%%%%%%%%%%%%%%
-48611d1%%%%%%%%%%%%%%%%%%%%%%%%%%%%%%%%%%%%%%%%%%%%%%%%%%%%%%%%%%%%%%%%%%%%
$$ y = [-41, -41, -41, -41, -41, -41, -41, -41, -41, -41, -41, -41, -41, -41, -41, -41, -41, -41, -41, -41, -41, -41, -41, -41, -41, -41, -41, -41, -41, -41, -41, -41, -41, -41, -41, -41, -41, -41, -41, -41, -41, -41, -41, -41, -41, -41, -41, -41, -41, -41, -41, -41, -41, -41, -41, -41, -41, -41, -41, -41, -41, -41, -41, -41, -41, -41, -41, -41, -41, -41, -41, -41, -41, -41, -41, -41, -41, -41, -41, -41, -41, -41, -41, -41, -41, -41, -41, -41, -41, -41, -41, -41, -41, -41, -41, -41, -41, -41, -41, -41, -41, -41, -41, -41, -41, -41, -41, -41, -41, -41, -41, -41, -41, -41, -41, -41, -41, -41, -41, -41, -41, -41, -41, -41, -41, -41, -41, -41, -41, -41, -41, -41, -41, -41, -41, -41, -41, -41, -41, -41, -41, -41, -41, -41, -41, -41, -41, -41, -41, -41, -41, -41, -41, -41, -41, -41, -41, -41, -41, -41, -41, -41, -41, -41, -41, -41, -41, -41, -41, -41, -41, -41, -41, -41, -41, -41, -41, -41, -41, -41, -41, -41, -41, -41, -41, -41, -41, -41, -41, -41, -41, -41, -41, -41, -41, -41, -41, -41, -41, -41, -41, -41, -41, -41, -41, -41, -41, -41, -41, -41, -41, -41, -41, -41, -41, -41, -41, -41, -41, -41, -41, -41, -41, -41, -41, -41, -41, -41, -41, -41, -41, -41, -41, -41, -41, -41, -41, -41, -41, -41, -41, -41, -41, -41, -41, -41, -41, -41, -41, -41, -41, -41, -41, -41, -41, -41, -41, -41, -41, -41, -41, -41, -41, -41, -41, -41, -41, -41, -41, -41, -41, -41, -41, -41, -41, -41, -41, -41, -41, -41, -41, -41, -41, -41, -41, -41, -41, -41, -41, -41, -41, -41, -41, -41, -41, -41, -41, -41, -41, -41, -41, -41, -41, -41, -41, -41, -41, -41, -41, -41, -41, -41, -41, -41, -41, -41, -41, -41, -41, -41, -41, -41, -41, -41, -41, -41, -41, -41, -41, -41, -41, -41, -41, -41, -41, -41, -41, -41, -41, -41, -41, -41, -41, -41, -41, -41, -41, -41, -41, -41, -41, -41, -41, -41, -41, -41, -41, -41, -41, -41, -41, -41, -41, -41, -41, -41, -41, -41, -41, -41, -41, -41, -41, -41, -41, -41, -41, -41, -41, -41, -41, -41, -41, -41, -41, -41, -41, -41, -41, -41, -41, -41, -41, -41, -41, -41, -41, -41, -41, -41, -41, -41, -41, -41, -41, -41, -41, -41, -41, -41, -41, -41, -41, -41, -41, -41, -41, -41, -41, -41, -41, -41, -41, -41, -41, -41, -41, -41, -41, -41, -41, -41, -41, -41, -41, -41, -41, -41, -41, -41, -41, -41, -41, -41, -41, -41, -41, -41, -41, -41, -41, -41, -41, -41, -41, -41, -41, -41, -41, -41, -41, -41, -41, -41, -41, -41, -41, -41, -41, -41, -41, -41, -41, -41, -41, -41, -41, -41, -41, -41, -41, -41, -41, -41, -41, -41, -41, -41, -41, -41, -41, -41, -41, -41, -41, -41, -41, -41, -41, -41, -41, -41, -41, -41, -41, -41, -41, -41, -41, -41, -41, -41, -41, -41, -41, -41, -41, -41, -41, -41, -41, -41, -41, -41, -41, -41, -41, -41, -41, -41, -41, -41, -41, -41, -41, -41, -41, -41, -41, -41, -41, -41, -41, -41, -41]
-48653d1%%%%%%%%%%%%%%%%%%%%%%%%%%%%%%%%%%%%%%%%%%%%%%%%%%%%%%%%%%%%%%%%%%%%
-48695d1%%%%%%%%%%%%%%%%%%%%%%%%%%%%%%%%%%%%%%%%%%%%%%%%%%%%%%%%%%%%%%%%%%%%
-48737d1%%%%%%%%%%%%%%%%%%%%%%%%%%%%%%%%%%%%%%%%%%%%%%%%%%%%%%%%%%%%%%%%%%%%
-48779d1%%%%%%%%%%%%%%%%%%%%%%%%%%%%%%%%%%%%%%%%%%%%%%%%%%%%%%%%%%%%%%%%%%%%
-48820d1%%%%%%%%%%%%%%%%%%%%%%%%%%%%%%%%%%%%%%%%%%%%%%%%%%%%%%%%%%%%%%%%%%%%
-48862d1%%%%%%%%%%%%%%%%%J%j%%%%%%%%%%J%%j%%%%%%%%%%Jj%%%%%%%%%%%%%%J%%j%%%%
-48904d1%%%%%JJ%jj%%%%%%%%%%J%%j%%%%%%%%%%%%%%%%%%%%%%%%%%%%%%%%%%%%%%%%%%%%
-48946d1%%%%%%%%%%%%%%%%%%%%%%%%%%%%%%%%%%%%%%%%%%%%%%%%%%%%%%%%%%%JJj%j%%%%
$$ y = [-41, -41, -41, -41, -41, -41, -41, -41, -41, -41, -41, -41, -41, -41, -41, -41, -41, -41, -41, -41, -41, -41, -41, -41, -41, -41, -41, -41, -41, -41, -41, -41, -41, -41, -41, -41, -41, -41, -41, -41, -41, -41, -41, -41, -41, -41, -41, -41, -41, -41, -41, -41, -41, -41, -41, -41, -41, -41, -41, -41, -41, -41, -41, -41, -41, -41, -41, -41, -41, -41, -41, -41, -41, -41, -41, -41, -41, -41, -41, -41, -41, -41, -41, -41, -41, -41, -41, -41, -41, -41, -41, -41, -41, -41, -41, -41, -41, -41, -41, -41, -41, -41, -41, -41, -41, -41, -41, -41, -41, -41, -41, -41, -41, -41, -41, -41, -41, -41, -41, -41, -41, -41, -41, -41, -41, -41, -41, -41, -41, -41, -41, -41, -41, -41, -41, -41, -41, -41, -41, -41, -41, -41, -41, -41, -41, -41, -41, -41, -41, -41, -41, -41, -41, -41, -41, -41, -41, -41, -41, -41, -41, -41, -41, -41, -41, -41, -41, -41, -41, -41, -41, -41, -41, -41, -41, -41, -41, -41, -41, -41, -41, -41, -41, -41, -41, -41, -41, -41, -41, -41, -41, -41, -41, -41, -41, -41, -41, -41, -41, -41, -41, -41, -41, -41, -41, -41, -41, -41, -41, -41, -41, -41, -41, -41, -41, -41, -41, -41, -41, -41, -41, -41, -41, -41, -41, -41, -41, -41, -41, -41, -41, -41, -41, -41, -41, -41, -41, -41, -41, -41, -41, -41, -41, -41, -41, -41, -41, -41, -41, -41, -41, -41, -41, -41, -41, -41, -41, -41, -41, -41, -41, -41, -41, -41, -41, -41, -41, -41, -41, -41, -41, -41, -41, -41, -41, -41, -41, -41, -41, -41, -41, -41, -41, -41, -41, -41, -41, -41, -41, -41, -41, -41, -41, -41, -41, -41, -41, -41, -41, -41, -41, -41, -41, -41, -41, -41, -41, -41, -41, -41, -41, -41, -41, -41, -41, -41, -41, -41, -41, -41, -41, -41, -41, -41, -41, -41, -41, -41, -41, -41, -41, -41, -41, -41, -41, -41, -41, -41, -41, -41, -41, -41, -41, -41, -41, -41, -41, -41, -41, -41, -41, -41, -41, -41, -41, -41, -41, -41, -40, -40, -41, -41, -41, -41, -41, -41, -41, -41, -41, -41, -41, -40, -40, -40, -41, -41, -41, -41, -41, -41, -41, -41, -41, -41, -41, -40, -41, -41, -41, -41, -41, -41, -41, -41, -41, -41, -41, -41, -41, -41, -41, -40, -40, -40, -41, -41, -41, -41, -41, -41, -41, -41, -41, -41, -40, -39, -39, -40, -41, -41, -41, -41, -41, -41, -41, -41, -41, -41, -41, -40, -40, -40, -41, -41, -41, -41, -41, -41, -41, -41, -41, -41, -41, -41, -41, -41, -41, -41, -41, -41, -41, -41, -41, -41, -41, -41, -41, -41, -41, -41, -41, -41, -41, -41, -41, -41, -41, -41, -41, -41, -41, -41, -41, -41, -41, -41, -41, -41, -41, -41, -41, -41, -41, -41, -41, -41, -41, -41, -41, -41, -41, -41, -41, -41, -41, -41, -41, -41, -41, -41, -41, -41, -41, -41, -41, -41, -41, -41, -41, -41, -41, -41, -41, -41, -41, -41, -41, -41, -41, -41, -41, -41, -41, -41, -41, -41, -41, -41, -41, -41, -41, -41, -41, -41, -41, -41, -40, -39, -40, -40, -41, -41, -41, -41, -41]
-48988d1%%%%J%Ljkj%%%%%%%%%JJ%jj%%%%%%%%%%%%%%%%%%%%%%%%%%%%%%%%%%%%%%%%%%%%
-49030d1%%%%%%%%%%%%%%%%%%%%%%%%%%%%%%%%%%%%%%%%%%%%%%%%%%%%%%%%%%%%%%%%%%%%
-49072d1%%%%%%%%%%%%%%%%%%%%%%%%%%%%%%%%%%%%%%%%%%%%%%%%%%%%%%%%%%%%%%%%%%%%
-49113d1%%%%%%%%%%%%%%%%%%%%%%%%%%%%%%%%%%%%%%%%%%%%%%%%%%%%%%%%%%%%%%%%%%%%
-49155d1%%%%%%%%%%%%%%%%%%%%%%%%%%%%%%%%%%%%%%%%%%%%%%%%%%%%%%%%%%%%%%%%%%%%
-49197d1%%%%%%%%%%%%%%%%%%%%%%%%%%%%%%%%%%%%%%%%%%%%%%%%%%%%%%%%%%%%%%%%%%%%
-49239d1%%%%%%%%%%%%%%%%%%%%%%%%%%%%%%%%%%%%%%%%%%%%Jj%%%%%%%%%%J%%j%%%%%%%%
-49281d1%%%J%%j%%%%%%%%%%%%%%%%%%%%%%%%%%%%%%%%%%%%%%%%%%%%%%%%%%%%%%%%%%%%%
$$ y = [-41, -41, -41, -41, -41, -40, -40, -37, -38, -40, -41, -41, -41, -41, -41, -41, -41, -41, -41, -41, -40, -39, -39, -40, -41, -41, -41, -41, -41, -41, -41, -41, -41, -41, -41, -41, -41, -41, -41, -41, -41, -41, -41, -41, -41, -41, -41, -41, -41, -41, -41, -41, -41, -41, -41, -41, -41, -41, -41, -41, -41, -41, -41, -41, -41, -41, -41, -41, -41, -41, -41, -41, -41, -41, -41, -41, -41, -41, -41, -41, -41, -41, -41, -41, -41, -41, -41, -41, -41, -41, -41, -41, -41, -41, -41, -41, -41, -41, -41, -41, -41, -41, -41, -41, -41, -41, -41, -41, -41, -41, -41, -41, -41, -41, -41, -41, -41, -41, -41, -41, -41, -41, -41, -41, -41, -41, -41, -41, -41, -41, -41, -41, -41, -41, -41, -41, -41, -41, -41, -41, -41, -41, -41, -41, -41, -41, -41, -41, -41, -41, -41, -41, -41, -41, -41, -41, -41, -41, -41, -41, -41, -41, -41, -41, -41, -41, -41, -41, -41, -41, -41, -41, -41, -41, -41, -41, -41, -41, -41, -41, -41, -41, -41, -41, -41, -41, -41, -41, -41, -41, -41, -41, -41, -41, -41, -41, -41, -41, -41, -41, -41, -41, -41, -41, -41, -41, -41, -41, -41, -41, -41, -41, -41, -41, -41, -41, -41, -41, -41, -41, -41, -41, -41, -41, -41, -41, -41, -41, -41, -41, -41, -41, -41, -41, -41, -41, -41, -41, -41, -41, -41, -41, -41, -41, -41, -41, -41, -41, -41, -41, -41, -41, -41, -41, -41, -41, -41, -41, -41, -41, -41, -41, -41, -41, -41, -41, -41, -41, -41, -41, -41, -41, -41, -41, -41, -41, -41, -41, -41, -41, -41, -41, -41, -41, -41, -41, -41, -41, -41, -41, -41, -41, -41, -41, -41, -41, -41, -41, -41, -41, -41, -41, -41, -41, -41, -41, -41, -41, -41, -41, -41, -41, -41, -41, -41, -41, -41, -41, -41, -41, -41, -41, -41, -41, -41, -41, -41, -41, -41, -41, -41, -41, -41, -41, -41, -41, -41, -41, -41, -41, -41, -41, -41, -41, -41, -41, -41, -41, -41, -41, -41, -41, -41, -41, -41, -41, -41, -41, -41, -41, -41, -41, -41, -41, -41, -41, -41, -41, -41, -41, -41, -41, -41, -41, -41, -41, -41, -41, -41, -41, -41, -41, -41, -41, -41, -41, -41, -41, -41, -41, -41, -41, -41, -41, -41, -41, -41, -41, -41, -41, -41, -41, -41, -41, -41, -41, -41, -41, -41, -41, -41, -41, -41, -41, -41, -41, -41, -41, -41, -41, -41, -41, -41, -41, -41, -41, -41, -41, -41, -41, -41, -41, -41, -41, -41, -41, -41, -41, -41, -41, -41, -41, -41, -41, -41, -41, -41, -41, -41, -41, -41, -41, -41, -40, -41, -41, -41, -41, -41, -41, -41, -41, -41, -41, -41, -40, -40, -40, -41, -41, -41, -41, -41, -41, -41, -41, -41, -41, -41, -41, -40, -40, -40, -41, -41, -41, -41, -41, -41, -41, -41, -41, -41, -41, -41, -41, -41, -41, -41, -41, -41, -41, -41, -41, -41, -41, -41, -41, -41, -41, -41, -41, -41, -41, -41, -41, -41, -41, -41, -41, -41, -41, -41, -41, -41, -41, -41, -41, -41, -41, -41, -41, -41, -41, -41, -41, -41, -41, -41, -41, -41, -41, -41, -41, -41]
-49323d1%%%%%%%%%Jj%%%%%%%%%%%%%%%%%%%%%%%%%%%%%%%%%%%%%%%%%%%%%%%%%%%%%%%%%
-49364d1%%%Jj%%Jj%%%%%%%%%%%%%%%%%%%%%%%%%%%%%%%%%%%%%%%%%%%%%%%%%%%%%%%%%%%
-49406d1%%%%%%%%%%%Jj%%%%%%%J%j%J%j%%%J%%jJ%j%%%J%%%j%%Jj%%%%%%J%j%%%%J%%%%%
-49448d0jJ%jJj%%%%%%%J%%%%%j%JjJ%%%%j%%%%J%%%jJ%%%j%Jj%%J%%%%%%%%%%%%%%%%%%%
-49490d0%%%%%%%%%%%%%%%%%%%%%%%%%jJ%%%j%%%%J%jJ%%%%%%%%%%%%%%%%%%%%%%%%%%%%%
-49532d0%%%%%%%%%%%%%%%%%%%%%%%%%%%%%%%%%%%%%%%%%%%%%%%%%%%%%%%%%%%%%%%%%%%%
-49574d0%%%%%%%%%%%%%%%%%%%%%%%%%%%%%%%%%%%%%%%%%%%%%%%%%J%%jJj%JjJjJ%%%%%%%
-49615c9%%%%%%%%%%%%jJ%%%%%%%%%%%%%%%%%%%%%%%%%%%%%%%%%%%%%%%%%%%%%%%%%%%%%%
$$ y = [-41, -41, -41, -41, -41, -41, -41, -41, -41, -41, -40, -41, -41, -41, -41, -41, -41, -41, -41, -41, -41, -41, -41, -41, -41, -41, -41, -41, -41, -41, -41, -41, -41, -41, -41, -41, -41, -41, -41, -41, -41, -41, -41, -41, -41, -41, -41, -41, -41, -41, -41, -41, -41, -41, -41, -41, -41, -41, -41, -41, -41, -41, -41, -41, -41, -41, -41, -41, -41, -41, -41, -41, -40, -41, -41, -41, -40, -41, -41, -41, -41, -41, -41, -41, -41, -41, -41, -41, -41, -41, -41, -41, -41, -41, -41, -41, -41, -41, -41, -41, -41, -41, -41, -41, -41, -41, -41, -41, -41, -41, -41, -41, -41, -41, -41, -41, -41, -41, -41, -41, -41, -41, -41, -41, -41, -41, -41, -41, -41, -41, -41, -41, -41, -41, -41, -41, -41, -41, -41, -41, -41, -41, -41, -41, -41, -41, -41, -41, -40, -41, -41, -41, -41, -41, -41, -41, -41, -40, -40, -41, -41, -40, -40, -41, -41, -41, -41, -40, -40, -40, -41, -40, -40, -41, -41, -41, -41, -40, -40, -40, -40, -41, -41, -41, -40, -41, -41, -41, -41, -41, -41, -41, -40, -40, -41, -41, -41, -41, -41, -40, -40, -40, -40, -40, -40, -41, -40, -40, -41, -40, -41, -41, -41, -41, -41, -41, -41, -41, -40, -40, -40, -40, -40, -40, -41, -41, -40, -41, -40, -40, -40, -40, -40, -41, -41, -41, -41, -41, -40, -40, -40, -40, -41, -40, -40, -40, -40, -41, -41, -40, -41, -41, -41, -40, -40, -40, -40, -40, -40, -40, -40, -40, -40, -40, -40, -40, -40, -40, -40, -40, -40, -40, -40, -40, -40, -40, -40, -40, -40, -40, -40, -40, -40, -40, -40, -40, -40, -40, -40, -40, -40, -40, -40, -40, -40, -40, -40, -40, -41, -40, -40, -40, -40, -41, -41, -41, -41, -41, -40, -40, -41, -40, -40, -40, -40, -40, -40, -40, -40, -40, -40, -40, -40, -40, -40, -40, -40, -40, -40, -40, -40, -40, -40, -40, -40, -40, -40, -40, -40, -40, -40, -40, -40, -40, -40, -40, -40, -40, -40, -40, -40, -40, -40, -40, -40, -40, -40, -40, -40, -40, -40, -40, -40, -40, -40, -40, -40, -40, -40, -40, -40, -40, -40, -40, -40, -40, -40, -40, -40, -40, -40, -40, -40, -40, -40, -40, -40, -40, -40, -40, -40, -40, -40, -40, -40, -40, -40, -40, -40, -40, -40, -40, -40, -40, -40, -40, -40, -40, -40, -40, -40, -40, -40, -40, -40, -40, -40, -40, -40, -40, -40, -40, -40, -40, -40, -40, -40, -40, -40, -40, -40, -40, -40, -40, -40, -40, -40, -40, -40, -40, -40, -40, -40, -40, -40, -40, -40, -40, -40, -40, -40, -40, -40, -40, -40, -40, -40, -40, -39, -39, -39, -40, -39, -40, -40, -39, -40, -39, -40, -39, -39, -39, -39, -39, -39, -39, -39, -39, -39, -39, -39, -39, -39, -39, -39, -39, -39, -39, -39, -40, -39, -39, -39, -39, -39, -39, -39, -39, -39, -39, -39, -39, -39, -39, -39, -39, -39, -39, -39, -39, -39, -39, -39, -39, -39, -39, -39, -39, -39, -39, -39, -39, -39, -39, -39, -39, -39, -39, -39, -39, -39, -39, -39, -39, -39, -39, -39, -39, -39, -39, -39, -39, -39, -39, -39]
-49657c9%%%%%%%%%%%%%%%%%%%%%%%%%%%%%Jj%%%%%%%%J%jJ%%%%%%%%%%%%%%%%%%%%%%jJ%
-49699c8%%%%%%%%%%%%%%%%%%%%%%%%%%%Jj%%%%%%%%Jj%%Jj%%Jj%J%%%%%%%%%%%%%%%%%%%
-49741c7%%%%%%%%%%%%%%%%%%%%%%%%%%%%%%%%%%%%%%%Jj%J%%%%%%%%%%%%%%%%%%%%%%%%%
-49783c6%%%%%J%%%%%%%%%%%%%%%%%%%%%%J%jJ%%%%%%%%%%%%%%%%%%%%J%%%%%%%jJ%%%%%%
-49825c3%%%J%%%%%%%%%%%%%%%%%%J%%%%%%%%%%%%%%%%%%JjJ%%%%%%%%%%%%%%J%%%%%%%%%
-49866b9%J%%JJ%j%j%%J%%%%%%JKJ%kj%%%%%%%%%JJJ%jj%%%%%JjJ%J%%KKLjljjjJ%%%J%JJ
-49908a9LOMnnlj%JJ%JJ%JJKMJkk%LLMMPJ1K0M2J05J56nj35j00n2j8r%jNOJ9K5O3J36L14J71
-49938G63k27k58j45o0k8j2qk%NRK2M5J16J42m1j42r5m6j9j1mmJj%%jk%j%j%j%%JJKKL%JK
$$ y = [-39, -39, -39, -39, -39, -39, -39, -39, -39, -39, -39, -39, -39, -39, -39, -39, -39, -39, -39, -39, -39, -39, -39, -39, -39, -39, -39, -39, -39, -39, -38, -39, -39, -39, -39, -39, -39, -39, -39, -39, -38, -38, -39, -38, -38, -38, -38, -38, -38, -38, -38, -38, -38, -38, -38, -38, -38, -38, -38, -38, -38, -38, -38, -38, -38, -38, -39, -38, -38, -38, -38, -38, -38, -38, -38, -38, -38, -38, -38, -38, -38, -38, -38, -38, -38, -38, -38, -38, -38, -38, -38, -38, -38, -38, -38, -38, -37, -38, -38, -38, -38, -38, -38, -38, -38, -38, -37, -38, -38, -38, -37, -38, -38, -38, -37, -38, -38, -37, -37, -37, -37, -37, -37, -37, -37, -37, -37, -37, -37, -37, -37, -37, -37, -37, -37, -37, -37, -37, -37, -37, -37, -37, -37, -37, -37, -37, -37, -37, -37, -37, -37, -37, -37, -37, -37, -37, -37, -37, -37, -37, -37, -37, -37, -37, -37, -37, -37, -37, -37, -37, -37, -37, -37, -37, -37, -37, -36, -37, -37, -36, -36, -36, -36, -36, -36, -36, -36, -36, -36, -36, -36, -36, -36, -36, -36, -36, -36, -36, -36, -36, -36, -36, -36, -36, -36, -36, -36, -36, -36, -36, -35, -35, -35, -35, -35, -35, -35, -35, -35, -35, -35, -35, -35, -35, -35, -35, -35, -35, -35, -35, -35, -35, -35, -34, -34, -35, -34, -34, -34, -34, -34, -34, -34, -34, -34, -34, -34, -34, -34, -34, -34, -34, -34, -34, -34, -34, -34, -33, -33, -33, -33, -33, -33, -33, -33, -34, -33, -33, -33, -33, -33, -33, -33, -33, -33, -33, -32, -32, -32, -32, -32, -32, -32, -32, -32, -32, -32, -32, -32, -32, -32, -32, -32, -32, -32, -31, -31, -31, -31, -31, -31, -31, -31, -31, -31, -31, -31, -31, -31, -31, -31, -31, -31, -31, -30, -31, -30, -30, -30, -30, -30, -30, -30, -30, -30, -30, -30, -30, -30, -30, -30, -29, -29, -29, -29, -29, -29, -29, -29, -29, -29, -29, -28, -28, -28, -27, -26, -26, -27, -27, -28, -28, -28, -27, -27, -27, -27, -27, -27, -27, -26, -24, -23, -23, -25, -26, -26, -26, -26, -26, -26, -26, -26, -26, -26, -25, -24, -23, -23, -24, -25, -25, -25, -25, -25, -25, -24, -25, -24, -24, -23, -23, -23, -21, -19, -16, -17, -20, -21, -22, -23, -22, -22, -22, -22, -21, -21, -20, -19, -16, -10, -6, -11, -16, -19, -20, -20, -19, -18, -18, -17, -16, -16, -15, -14, -12, -8, -7, -9, -11, -11, -8, -5, -1, 3, 10, 21, 41, 83, 188, 344, 339, 204, 104, 52, 34, 25, 25, 24, 29, 35, 54, 79, 142, 278, 592, 763, 536, 278, 133, 73, 45, 33, 25, 23, 23, 28, 37, 59, 104, 220, 362, 321, 179, 84, 38, 19, 8, 4, 0, 1, 0, 0, 0, -1, -3, -3, -4, -4, -5, -5, -6, -6, -6, -5, -4, -2, 0, 3, 3, 4, 6]
-49965FJmlk%jJ%J%KKJLP%nnkj%%%%J%JJKOLmmk%jJ%%J%%JJLNJmkkJjJ%J%J%J%LKjjj%%%J
-50008A6%J%J%J%J%J%%J%%JJ%JJ%J%J%J%JJ%JJ%JJJ%J%K%J%K%J%JJJJJ%JJJ%K%JJJJJ%K%K
-50050F2%K%JJK%KJJJJJKJJJJJKJJKJJKJKJJKKJKJKKKJKKKKKKKKLKKLKLLKMKMMNMMKKKLKM
-50092A90LMNNPJ1J7J2lkkKKNNOORQJ2J6L2K4mnLRJ1J2J2J1J1J0RJ0J1J8K0NLRJ5J6J6J6J5
-50120F07RQNMKLNNPJ0J1J2J2J4J3J2J1J3J2J2J1J5J7J8J9K2K3K1K0K5L2L9M1M1M2M1M5N0
-50143A309N4N5O4O8P0P1Q8J02J26J18J39J54K09K63M69R93K123O94j354r77l73J12K08L73
-50158E158L52M94N08P22P97J273K024M557L220j629j658k00Q50J119J223J064R29O68N26
-50170B1997L64M77P36J949K271q1m80M64J126J345J240R28M31j35p10j170j464j564j505
$$ y = [6, 7, 3, 0, -2, -2, -3, -2, -2, -1, -1, 1, 3, 4, 7, 14, 14, 9, 4, 2, 1, 1, 1, 1, 1, 2, 2, 3, 4, 6, 12, 15, 11, 7, 5, 5, 4, 5, 5, 5, 6, 6, 6, 7, 8, 11, 16, 17, 13, 11, 9, 10, 9, 10, 10, 11, 11, 12, 12, 13, 13, 16, 18, 17, 16, 15, 15, 15, 15, 16, 16, 17, 17, 18, 18, 19, 19, 20, 20, 21, 21, 21, 22, 22, 22, 23, 24, 24, 25, 26, 26, 27, 27, 28, 28, 29, 29, 30, 31, 31, 32, 33, 33, 34, 35, 36, 36, 37, 37, 39, 39, 40, 40, 42, 42, 43, 43, 44, 45, 46, 47, 48, 48, 49, 50, 51, 51, 53, 53, 54, 55, 56, 57, 58, 58, 60, 60, 62, 62, 64, 64, 65, 66, 68, 68, 70, 71, 72, 73, 74, 75, 77, 78, 79, 80, 81, 82, 84, 85, 86, 88, 89, 90, 92, 93, 95, 96, 97, 99, 101, 102, 104, 105, 107, 109, 111, 112, 114, 116, 118, 120, 122, 124, 126, 128, 131, 133, 135, 138, 140, 143, 146, 148, 152, 154, 158, 162, 167, 171, 175, 177, 179, 181, 184, 186, 190, 193, 197, 202, 207, 214, 225, 242, 254, 251, 249, 247, 249, 251, 256, 261, 267, 273, 282, 290, 302, 318, 350, 374, 370, 365, 368, 377, 388, 400, 412, 423, 434, 444, 453, 463, 474, 492, 512, 517, 520, 529, 544, 560, 576, 592, 607, 616, 624, 629, 633, 635, 638, 643, 648, 655, 665, 676, 688, 700, 714, 727, 739, 750, 763, 775, 787, 798, 813, 830, 848, 867, 889, 912, 933, 953, 978, 1010, 1049, 1090, 1131, 1173, 1214, 1259, 1309, 1363, 1418, 1482, 1550, 1620, 1691, 1779, 1881, 2007, 2125, 2264, 2418, 2627, 2890, 3359, 4352, 6475, 7169, 5815, 4838, 4465, 4577, 4785, 5158, 5510, 6004, 6512, 7234, 8031, 9304, 11328, 15885, 19105, 17476, 15818, 15618, 16468, 17587, 18810, 19874, 20803, 21471, 21997, 22361, 22838, 23574, 25523, 27794, 27713, 27233, 27697, 28823, 30168, 31408, 32336, 32767, 32632, 31922, 30752, 29288, 27724, 26219]
-50181B6219j323j087q32n97l96k84k66l59n42p80j019j226j350j394j356j273j151j045r48
-50193H991q36p30o46n65m98m37l89l45l11k76k47k18j91j71j66j49j36j26j18j07j02r5r4
-50207B038q8q6q2p8p3o8o3n9n4n3m9m6m4m3m1m1l9l9l7l6l2l2l0k8k6k5k3k3k2k2j9k1j8
-50228E98j8j7j6j4j5j3j3j2j2j1j2j0j2j1j1rj1rrrrpqpqopopoononnmomnmnlnlmmmlllm
-50259A92kmkmklkllkklklkkkkkkkkkkkkjkjkjkjkjkjjjkjjjjjk%k%k%jjk%jjjjj%k%jj%j
-50300H6j%j%jj%j%j%j%%j%%j%%%j%%%%j%%%j%%%%%%%jJ%%jJjJj%%J%%%%%%%J%%%J%%%J%%
-50342G7%J%J%%%J%J%J%%J%JJ%J%J%JJ%JJJ%JJJJJJJJJJJKJKJJKKKMOJ1NnmjJKLLLMNNQJ2
-50383A78K2J9mpjNPOOOMMLLNJ0J3KkLOQPMKjnoqqqpnnlkkkkmnoqprqpppnomnmmlmllkllk
$$ y = [26219, 24896, 23809, 22977, 22380, 21984, 21700, 21434, 21075, 20533, 19753, 18734, 17508, 16158, 14764, 13408, 12135, 10984, 9939, 8991, 8155, 7425, 6779, 6214, 5716, 5279, 4890, 4545, 4234, 3958, 3711, 3493, 3302, 3131, 2965, 2816, 2680, 2554, 2436, 2329, 2227, 2132, 2038, 1950, 1864, 1782, 1704, 1631, 1563, 1500, 1441, 1387, 1334, 1285, 1239, 1195, 1152, 1111, 1070, 1031, 992, 955, 919, 887, 855, 825, 797, 771, 746, 723, 700, 678, 656, 637, 616, 598, 580, 563, 547, 533, 518, 505, 492, 480, 468, 457, 445, 435, 423, 412, 401, 392, 381, 372, 363, 354, 345, 338, 330, 323, 315, 309, 302, 296, 289, 283, 277, 272, 266, 261, 256, 252, 246, 242, 237, 233, 228, 225, 220, 217, 213, 209, 205, 202, 199, 196, 192, 190, 186, 184, 180, 178, 175, 173, 170, 167, 165, 163, 160, 158, 155, 153, 151, 149, 147, 145, 143, 141, 139, 137, 135, 133, 131, 130, 128, 127, 125, 124, 122, 121, 119, 118, 116, 115, 114, 113, 111, 110, 109, 108, 107, 106, 104, 104, 102, 102, 100, 100, 99, 98, 96, 96, 95, 94, 93, 92, 91, 91, 89, 89, 88, 87, 87, 86, 85, 85, 84, 84, 83, 82, 82, 81, 81, 80, 80, 79, 79, 79, 78, 78, 78, 77, 77, 77, 77, 76, 76, 76, 76, 76, 75, 75, 75, 75, 74, 74, 74, 74, 74, 74, 74, 74, 73, 74, 74, 74, 73, 74, 73, 74, 73, 73, 73, 74, 74, 74, 74, 74, 74, 74, 74, 75, 75, 75, 75, 76, 76, 76, 76, 77, 77, 77, 77, 78, 78, 79, 79, 79, 79, 80, 80, 81, 81, 82, 82, 82, 83, 83, 84, 85, 85, 86, 86, 87, 87, 88, 89, 89, 90, 91, 92, 92, 93, 94, 95, 96, 97, 98, 99, 100, 101, 102, 103, 105, 106, 108, 109, 110, 112, 114, 116, 120, 126, 137, 142, 137, 133, 132, 133, 135, 138, 141, 144, 148, 153, 158, 166, 178, 200, 219, 215, 208, 207, 212, 219, 225, 231, 237, 241, 245, 248, 251, 256, 266, 279, 281, 279, 282, 288, 296, 303, 307, 309, 308, 303, 297, 289, 281, 273, 266, 261, 256, 253, 251, 249, 247, 245, 241, 236, 230, 222, 215, 206, 198, 191, 184, 177, 172, 166, 162, 157, 153, 149, 146, 142, 139, 136, 134, 131, 128, 126]
-50421A26lkklkkklkkkkklkkkkkkkkkkkkkjkkkjkkjkkjkkjkjkjjkjjkjjjkjjjjjjjjjjjjj
-50463A4jjjjj%jjj%jjj%jj%jj%j%jj%%j%jj%j%j%j%%j%j%j%%j%%j%%j%%j%%%j%%j%%%j%%
-50504b0j%%%%j%%%%j%%%%%j%%%%%j%%%%%%%%j%%%%%%j%%%%%%%%%j%%%%%%%jJj%%%%%%%%%
-50546b9%%%%j%%%%%%%%%%%%%%%%%j%%%%%%%%%%%%%%%%%j%%%%%%%%%%%%%%%%%%j%%%%%%%%
-50588c3%%%%%%%%%jJ%%%j%%%%%%%%%%%%%%%%%jJj%%%%%%%%%%%%%jJ%%j%%Jj%%%%%%%%%%%
-50630c6%%%%%%%%%%j%%J%%j%%%%%%%%%%%%%%%%%%%%%%%%%%%jJjJ%j%%%%%%%%%%%%%%%%%%
-50672c8%%%%%%%%%%jJ%j%%%%%J%%j%%%%%%%%%%%%%%%%%%%%%%%%%%%%%%%%%%%%%%%%%%%%%
-50714c9%%jJ%%jJ%%jJ%%%j%%%Jj%%Jj%%%%%%J%j%%%%%%%%%%%J%%j%%%%%%%%%%%Jj%%%%%%
$$ y = [126, 123, 121, 119, 116, 114, 112, 110, 107, 105, 103, 101, 99, 97, 94, 92, 90, 88, 86, 84, 82, 80, 78, 76, 74, 72, 70, 68, 67, 65, 63, 61, 60, 58, 56, 55, 53, 51, 50, 48, 46, 45, 43, 42, 40, 39, 38, 36, 35, 34, 32, 31, 30, 29, 27, 26, 25, 24, 23, 22, 21, 20, 19, 18, 17, 16, 15, 14, 13, 12, 11, 10, 9, 9, 8, 7, 6, 6, 5, 4, 3, 3, 2, 1, 1, 0, -1, -1, -2, -2, -3, -4, -4, -4, -5, -5, -6, -7, -7, -8, -8, -9, -9, -10, -10, -10, -11, -11, -12, -12, -13, -13, -13, -14, -14, -14, -15, -15, -15, -16, -16, -16, -17, -17, -17, -17, -18, -18, -18, -19, -19, -19, -19, -20, -20, -20, -21, -21, -21, -21, -21, -22, -22, -22, -22, -22, -23, -23, -23, -23, -23, -23, -24, -24, -24, -24, -24, -24, -25, -25, -25, -25, -25, -25, -25, -25, -25, -26, -26, -26, -26, -26, -26, -26, -27, -27, -27, -27, -27, -27, -27, -27, -27, -27, -28, -28, -28, -28, -28, -28, -28, -28, -29, -28, -29, -29, -29, -29, -29, -29, -29, -29, -29, -29, -29, -29, -29, -29, -30, -30, -30, -30, -30, -30, -30, -30, -30, -30, -30, -30, -30, -30, -30, -30, -30, -30, -31, -31, -31, -31, -31, -31, -31, -31, -31, -31, -31, -31, -31, -31, -31, -31, -31, -31, -32, -32, -32, -32, -32, -32, -32, -32, -32, -32, -32, -32, -32, -32, -32, -32, -32, -32, -32, -33, -33, -33, -33, -33, -33, -33, -33, -33, -33, -33, -33, -33, -33, -33, -33, -33, -33, -34, -33, -33, -33, -33, -34, -34, -34, -34, -34, -34, -34, -34, -34, -34, -34, -34, -34, -34, -34, -34, -34, -34, -35, -34, -35, -35, -35, -35, -35, -35, -35, -35, -35, -35, -35, -35, -35, -35, -36, -35, -35, -35, -36, -36, -36, -35, -36, -36, -36, -36, -36, -36, -36, -36, -36, -36, -36, -36, -36, -36, -36, -36, -36, -36, -36, -36, -36, -36, -37, -37, -37, -36, -36, -36, -37, -37, -37, -37, -37, -37, -37, -37, -37, -37, -37, -37, -37, -37, -37, -37, -37, -37, -37, -37, -37, -37, -37, -37, -37, -37, -37, -37, -38, -37, -38, -37, -37, -38, -38, -38, -38, -38, -38, -38, -38, -38, -38, -38, -38, -38, -38, -38, -38, -38, -38, -38, -38, -38, -38, -38, -38, -38, -38, -38, -38, -38, -39, -38, -38, -39, -39, -39, -39, -39, -39, -38, -38, -38, -39, -39, -39, -39, -39, -39, -39, -39, -39, -39, -39, -39, -39, -39, -39, -39, -39, -39, -39, -39, -39, -39, -39, -39, -39, -39, -39, -39, -39, -39, -39, -39, -39, -39, -39, -39, -39, -39, -39, -39, -39, -39, -39, -39, -39, -39, -39, -39, -40, -39, -39, -39, -40, -39, -39, -39, -40, -39, -39, -39, -39, -40, -40, -40, -40, -39, -40, -40, -40, -39, -40, -40, -40, -40, -40, -40, -40, -39, -39, -40, -40, -40, -40, -40, -40, -40, -40, -40, -40, -40, -40, -39, -39, -39, -40, -40, -40, -40, -40, -40, -40, -40, -40, -40, -40, -40, -39, -40, -40, -40, -40, -40, -40, -40]
-50756d0%%%%%%%%%%%%%%%%%%%%%%%%%%%%%%%%%%%%%%%%%%%%%%%%%%%%%%%%%%%%%%%%%%%%
-50797d0%%%%%%%%%%%%%%%%%%%%%%%%%%%%%%%%%%%%%%%%%%%%%%%%%%%%%%%%%%%%jJ%%%%%%
-50839d0%%%%%%%%%%%%%%jJjJ%%%%%%%jJ%%j%%%Jj%J%jJjJ%j%%Jj%%%%%%J%%%j%J%jJ%%jJ
-50881d0j%%J%jJj%%%%%%%%J%j%%Jj%J%j%%%%%%%%%%%Jj%%%%%%%%%%%%%%%Jj%%%%%%%%%%%
-50923d1%%%%%%%%%%%%%%%%%%%%%%%%%%%%%%%%%%%%%%%%%%%%%%%%%%%%%%%%%%%%%%%%%%%%
-50965d1%%%%%%%%%%%%%%%%%%%%%%%%%%%%%%%%%%%%%%%%%%%%%%%%%%%%%%%%%%%%%%%%%%%%
-51007d1%%%%%%%%%%%%%%%%%%%%%%%%%%%%%%%%%%%%%%%%%%%%%%%%%%%%%%%%%%%%%%%%%%%%
-51048d1%%%%%%%%%%%%%%%%%%%%%%%%%%%%%%%%%%%%%%%%%%%%%%%%%%%%%%%%%%%%%%%%%%%%
$$ y = [-40, -40, -40, -40, -40, -40, -40, -40, -40, -40, -40, -40, -40, -40, -40, -40, -40, -40, -40, -40, -40, -40, -40, -40, -40, -40, -40, -40, -40, -40, -40, -40, -40, -40, -40, -40, -40, -40, -40, -40, -40, -40, -40, -40, -40, -40, -40, -40, -40, -40, -40, -40, -40, -40, -40, -40, -40, -40, -40, -40, -40, -40, -40, -40, -40, -40, -40, -40, -40, -40, -40, -40, -40, -40, -40, -40, -40, -40, -40, -40, -40, -40, -40, -40, -40, -40, -40, -40, -40, -40, -40, -40, -40, -40, -40, -40, -40, -40, -40, -40, -40, -40, -40, -40, -40, -40, -40, -40, -40, -40, -40, -40, -40, -40, -40, -40, -40, -40, -40, -40, -40, -40, -40, -40, -40, -40, -40, -40, -40, -41, -40, -40, -40, -40, -40, -40, -40, -40, -40, -40, -40, -40, -40, -40, -40, -40, -40, -40, -40, -40, -40, -41, -40, -41, -40, -40, -40, -40, -40, -40, -40, -40, -41, -40, -40, -40, -41, -41, -41, -41, -40, -41, -41, -40, -40, -41, -40, -41, -40, -40, -41, -41, -41, -40, -41, -41, -41, -41, -41, -41, -41, -40, -40, -40, -40, -41, -41, -40, -40, -41, -40, -40, -40, -41, -40, -41, -41, -41, -40, -40, -41, -40, -41, -41, -41, -41, -41, -41, -41, -41, -41, -40, -40, -41, -41, -41, -40, -41, -41, -40, -40, -41, -41, -41, -41, -41, -41, -41, -41, -41, -41, -41, -41, -40, -41, -41, -41, -41, -41, -41, -41, -41, -41, -41, -41, -41, -41, -41, -41, -41, -40, -41, -41, -41, -41, -41, -41, -41, -41, -41, -41, -41, -41, -41, -41, -41, -41, -41, -41, -41, -41, -41, -41, -41, -41, -41, -41, -41, -41, -41, -41, -41, -41, -41, -41, -41, -41, -41, -41, -41, -41, -41, -41, -41, -41, -41, -41, -41, -41, -41, -41, -41, -41, -41, -41, -41, -41, -41, -41, -41, -41, -41, -41, -41, -41, -41, -41, -41, -41, -41, -41, -41, -41, -41, -41, -41, -41, -41, -41, -41, -41, -41, -41, -41, -41, -41, -41, -41, -41, -41, -41, -41, -41, -41, -41, -41, -41, -41, -41, -41, -41, -41, -41, -41, -41, -41, -41, -41, -41, -41, -41, -41, -41, -41, -41, -41, -41, -41, -41, -41, -41, -41, -41, -41, -41, -41, -41, -41, -41, -41, -41, -41, -41, -41, -41, -41, -41, -41, -41, -41, -41, -41, -41, -41, -41, -41, -41, -41, -41, -41, -41, -41, -41, -41, -41, -41, -41, -41, -41, -41, -41, -41, -41, -41, -41, -41, -41, -41, -41, -41, -41, -41, -41, -41, -41, -41, -41, -41, -41, -41, -41, -41, -41, -41, -41, -41, -41, -41, -41, -41, -41, -41, -41, -41, -41, -41, -41, -41, -41, -41, -41, -41, -41, -41, -41, -41, -41, -41, -41, -41, -41, -41, -41, -41, -41, -41, -41, -41, -41, -41, -41, -41, -41, -41, -41, -41, -41, -41, -41, -41, -41, -41, -41, -41, -41, -41, -41, -41, -41, -41, -41, -41, -41, -41, -41, -41, -41, -41, -41, -41, -41, -41, -41, -41, -41, -41, -41, -41, -41, -41, -41, -41, -41, -41, -41, -41, -41, -41, -41, -41, -41, -41, -41, -41, -41, -41, -41, -41, -41, -41, -41, -41, -41, -41, -41]
-51090d1%%%%%%%%%%%%%%%%%%%%%%%%%%%%%%%%%%%%%%%%%%%%%%%%%%%%%%%%%%%%%%%%%%%%
-51132d1%%%%%%%%%%%%%%%%%%%%%%%%%%%%%%%%%%%%%%%%%%%%%%%%%%%%%%%%%%%%%%%%%%%%
-51174d1%%%%%%%%%%%%%%%%%%%%%%%%%%%%%%%%%%%%%%%%%%%%%%%%%%%%%%%%%%%%%%%%%%%%
-51216d1%%%%%%%%%%%%%%%%%%%%%%%%%%%%%%%%%%%%%%%%%%%%%%%%%%%%%%%%%%%%%%%%%%%%
-51258d1%%%%%%%%%%%%%%%%%%%%%%%%%%%%%%%%%%%%%%%%%%%%%%%%%%%%%%%%%%%%%%%%%%%%
-51299d1%%%%%%%%%%%%%%%%%%%%%%%%%%%%%%%%%%%%%%%%%%%%%%%%%%%%%%%%%%%%%%%%%%%%
-51341d1%%%%%%%%%%%%%%%%%%%%%%%%%%%%%%%%%%%%%%Jj%%%Jj%%%%%%%%%%%%%%%%%%%%%%%
-51383d1%%%%%%%%%%%%%%%%%%%%%%%%%%%%%%%%%%%%%%%%%%%%%%Jj%%%%%%%%%%%%%%%%%%%%
$$ y = [-41, -41, -41, -41, -41, -41, -41, -41, -41, -41, -41, -41, -41, -41, -41, -41, -41, -41, -41, -41, -41, -41, -41, -41, -41, -41, -41, -41, -41, -41, -41, -41, -41, -41, -41, -41, -41, -41, -41, -41, -41, -41, -41, -41, -41, -41, -41, -41, -41, -41, -41, -41, -41, -41, -41, -41, -41, -41, -41, -41, -41, -41, -41, -41, -41, -41, -41, -41, -41, -41, -41, -41, -41, -41, -41, -41, -41, -41, -41, -41, -41, -41, -41, -41, -41, -41, -41, -41, -41, -41, -41, -41, -41, -41, -41, -41, -41, -41, -41, -41, -41, -41, -41, -41, -41, -41, -41, -41, -41, -41, -41, -41, -41, -41, -41, -41, -41, -41, -41, -41, -41, -41, -41, -41, -41, -41, -41, -41, -41, -41, -41, -41, -41, -41, -41, -41, -41, -41, -41, -41, -41, -41, -41, -41, -41, -41, -41, -41, -41, -41, -41, -41, -41, -41, -41, -41, -41, -41, -41, -41, -41, -41, -41, -41, -41, -41, -41, -41, -41, -41, -41, -41, -41, -41, -41, -41, -41, -41, -41, -41, -41, -41, -41, -41, -41, -41, -41, -41, -41, -41, -41, -41, -41, -41, -41, -41, -41, -41, -41, -41, -41, -41, -41, -41, -41, -41, -41, -41, -41, -41, -41, -41, -41, -41, -41, -41, -41, -41, -41, -41, -41, -41, -41, -41, -41, -41, -41, -41, -41, -41, -41, -41, -41, -41, -41, -41, -41, -41, -41, -41, -41, -41, -41, -41, -41, -41, -41, -41, -41, -41, -41, -41, -41, -41, -41, -41, -41, -41, -41, -41, -41, -41, -41, -41, -41, -41, -41, -41, -41, -41, -41, -41, -41, -41, -41, -41, -41, -41, -41, -41, -41, -41, -41, -41, -41, -41, -41, -41, -41, -41, -41, -41, -41, -41, -41, -41, -41, -41, -41, -41, -41, -41, -41, -41, -41, -41, -41, -41, -41, -41, -41, -41, -41, -41, -41, -41, -41, -41, -41, -41, -41, -41, -41, -41, -41, -41, -41, -41, -41, -41, -41, -41, -41, -41, -41, -41, -41, -41, -41, -41, -41, -41, -41, -41, -41, -41, -41, -41, -41, -41, -41, -41, -41, -41, -41, -41, -41, -41, -41, -41, -41, -41, -41, -41, -41, -41, -41, -41, -41, -41, -41, -41, -41, -41, -41, -41, -41, -41, -41, -41, -41, -41, -41, -41, -41, -41, -41, -41, -41, -41, -41, -41, -41, -41, -41, -41, -41, -41, -41, -41, -41, -41, -41, -41, -41, -41, -41, -41, -41, -41, -41, -41, -41, -41, -41, -41, -41, -41, -41, -41, -41, -41, -41, -41, -41, -41, -41, -41, -41, -41, -41, -41, -41, -41, -41, -41, -41, -41, -41, -41, -41, -41, -41, -41, -41, -41, -41, -40, -41, -41, -41, -41, -40, -41, -41, -41, -41, -41, -41, -41, -41, -41, -41, -41, -41, -41, -41, -41, -41, -41, -41, -41, -41, -41, -41, -41, -41, -41, -41, -41, -41, -41, -41, -41, -41, -41, -41, -41, -41, -41, -41, -41, -41, -41, -41, -41, -41, -41, -41, -41, -41, -41, -41, -41, -41, -41, -41, -41, -41, -41, -41, -41, -41, -41, -41, -41, -41, -41, -41, -41, -41, -41, -41, -40, -41, -41, -41, -41, -41, -41, -41, -41, -41, -41, -41, -41, -41, -41, -41, -41, -41, -41, -41, -41, -41]
-51425d1%%%%%%Jj%%%%%%%%%%%%%%%%%%%%%%%%%%%%%%%%%%%%%%%%%%%%%%%%%%%%%%%%%%%%
-51467d1%%%%%%%%%%%%%%%%%%%%%%%%%%%%%%%%%%%%%%%%%%%%%%%%%%Jj%%%%%%%%%%%%%%%%
-51509d1%%%%%%%%%Jj%%%%%%%%%%%%%%%%%%%%%%%%%%%%%%%%%%%%%%%%%%Jj%%%%%%%%%%%%%
-51550d1Jj%%%%%%%%Jj%%J%j%%%%%%%%%%Jj%%%%%%%%%%%%%%%%%%%%%%%%%%%%%%%%%%%%Jj%
-51592d1%%%%%%J%%j%J%j%%J%%jJ%j%%%%Jj%%%%%%%%%%%%%%Jj%%%%%%%%%%%%%%%%%%J%j%%
-51634d1Jj%%%%%%Jj%%%%%%%%Jj%%%%%%%%%%%%%JjJj%%%%%%%Jj%%%%%%%JjJj%%%%Jj%%%%%
-51676d1%%%%%%%J%j%%%%%%Jj%%%Jj%%%%Jj%J%j%%%Jj%%%%%%J%j%%%%Jj%%%%%%%%Jj%J%j%
-51718d1%J%%%%%%jJ%%j%J%%j%J%%%%j%%%J%j%%J%%jJj%%%%J%%%jJjJ%jJ%jJ%%j%%%%%Jj%
$$ y = [-41, -41, -41, -41, -41, -41, -41, -40, -41, -41, -41, -41, -41, -41, -41, -41, -41, -41, -41, -41, -41, -41, -41, -41, -41, -41, -41, -41, -41, -41, -41, -41, -41, -41, -41, -41, -41, -41, -41, -41, -41, -41, -41, -41, -41, -41, -41, -41, -41, -41, -41, -41, -41, -41, -41, -41, -41, -41, -41, -41, -41, -41, -41, -41, -41, -41, -41, -41, -41, -41, -41, -41, -41, -41, -41, -41, -41, -41, -41, -41, -41, -41, -41, -41, -41, -41, -41, -41, -41, -41, -41, -41, -41, -41, -41, -41, -41, -41, -41, -41, -41, -41, -41, -41, -41, -41, -41, -41, -41, -41, -41, -41, -41, -41, -41, -41, -41, -41, -41, -40, -41, -41, -41, -41, -41, -41, -41, -41, -41, -41, -41, -41, -41, -41, -41, -41, -41, -41, -41, -41, -41, -41, -41, -41, -41, -41, -40, -41, -41, -41, -41, -41, -41, -41, -41, -41, -41, -41, -41, -41, -41, -41, -41, -41, -41, -41, -41, -41, -41, -41, -41, -41, -41, -41, -41, -41, -41, -41, -41, -41, -41, -41, -41, -41, -41, -41, -41, -41, -41, -41, -40, -41, -41, -41, -41, -41, -41, -41, -41, -41, -41, -41, -41, -41, -41, -40, -41, -41, -41, -41, -41, -41, -41, -41, -41, -40, -41, -41, -41, -40, -40, -41, -41, -41, -41, -41, -41, -41, -41, -41, -41, -41, -40, -41, -41, -41, -41, -41, -41, -41, -41, -41, -41, -41, -41, -41, -41, -41, -41, -41, -41, -41, -41, -41, -41, -41, -41, -41, -41, -41, -41, -41, -41, -41, -41, -41, -41, -41, -41, -41, -40, -41, -41, -41, -41, -41, -41, -41, -41, -40, -40, -40, -41, -41, -40, -40, -41, -41, -41, -40, -40, -40, -41, -40, -40, -41, -41, -41, -41, -41, -40, -41, -41, -41, -41, -41, -41, -41, -41, -41, -41, -41, -41, -41, -41, -41, -40, -41, -41, -41, -41, -41, -41, -41, -41, -41, -41, -41, -41, -41, -41, -41, -41, -41, -41, -41, -40, -40, -41, -41, -41, -40, -41, -41, -41, -41, -41, -41, -41, -40, -41, -41, -41, -41, -41, -41, -41, -41, -41, -40, -41, -41, -41, -41, -41, -41, -41, -41, -41, -41, -41, -41, -41, -41, -40, -41, -40, -41, -41, -41, -41, -41, -41, -41, -41, -40, -41, -41, -41, -41, -41, -41, -41, -41, -40, -41, -40, -41, -41, -41, -41, -41, -40, -41, -41, -41, -41, -41, -41, -41, -41, -41, -41, -41, -41, -41, -40, -40, -41, -41, -41, -41, -41, -41, -41, -40, -41, -41, -41, -41, -40, -41, -41, -41, -41, -41, -40, -41, -41, -40, -40, -41, -41, -41, -41, -40, -41, -41, -41, -41, -41, -41, -41, -40, -40, -41, -41, -41, -41, -41, -40, -41, -41, -41, -41, -41, -41, -41, -41, -41, -40, -41, -41, -40, -40, -41, -41, -41, -40, -40, -40, -40, -40, -40, -40, -41, -40, -40, -40, -41, -41, -40, -40, -40, -41, -41, -40, -40, -40, -40, -40, -41, -41, -41, -41, -40, -40, -41, -41, -41, -40, -40, -40, -41, -40, -41, -41, -41, -41, -41, -40, -40, -40, -40, -41, -40, -41, -40, -40, -41, -40, -40, -41, -40, -40, -40, -41, -41, -41, -41, -41, -41, -40, -41, -41]
-51760d1Jj%%%%%%%%%%%J%%%%j%J%j%%%%Jj%%JjJ%%%j%%J%%%%j%%%%%J%j%%%%%%%%%%%%%J
-51801d0j%%Jj%%%%%%J%%%j%%%%%%J%%%j%%%%%J%%j%%%JjJ%j%%J%%%%%%%%%%j%%%%J%%%%j
-51843d1J%%j%%%Jj%J%%%%%%%j%%%%J%%j%%J%%%jJ%jJj%J%%j%%JjJj%J%%%%%%%%%%%jJ%%%
-51885d0%%%%%%%%%%%%%jJ%%%j%%J%%%%%%jJ%%%%%%%%%jJj%%J%%%%%%%%%%%%%%%%%%%%%%j
-51927d1%J%%%%%jJ%%jJ%%%%%%j%Jj%J%%%%%%%%%%%%%%%%%%jJ%%%%%%%%%%j%%J%%j%%%%%%
-51969d1J%%%jJ%%jJ%%%%%%%%%%%%%%%%%%%%%%%%%%%%%%%%%%%%%%%%%%%%%%%%%%%%%%%%%%
-52011d0%%%jJ%%%%%%%%%%%%%%%%%%%%%%%%%%%%%%%%%%%%%%%%%%%%%%%%%%%%%%%%%%%%%%%
-52053d0%%%%%%%%%%%%%%%%%%%%%%%%%%%%%%%%%%%%%%%%%%%%%%%%%%%%%%%%%%%%%%%%%%%%
$$ y = [-41, -40, -41, -41, -41, -41, -41, -41, -41, -41, -41, -41, -41, -41, -40, -40, -40, -40, -40, -41, -41, -40, -40, -41, -41, -41, -41, -41, -40, -41, -41, -41, -40, -41, -40, -40, -40, -40, -41, -41, -41, -40, -40, -40, -40, -40, -41, -41, -41, -41, -41, -41, -40, -40, -41, -41, -41, -41, -41, -41, -41, -41, -41, -41, -41, -41, -41, -41, -40, -41, -41, -41, -40, -41, -41, -41, -41, -41, -41, -41, -40, -40, -40, -40, -41, -41, -41, -41, -41, -41, -41, -40, -40, -40, -40, -41, -41, -41, -41, -41, -41, -40, -40, -40, -41, -41, -41, -41, -40, -41, -40, -40, -41, -41, -41, -40, -40, -40, -40, -40, -40, -40, -40, -40, -40, -40, -41, -41, -41, -41, -41, -40, -40, -40, -40, -40, -41, -40, -40, -40, -41, -41, -41, -41, -40, -41, -41, -40, -40, -40, -40, -40, -40, -40, -40, -41, -41, -41, -41, -41, -40, -40, -40, -41, -41, -41, -40, -40, -40, -40, -41, -40, -40, -41, -40, -41, -41, -40, -40, -40, -41, -41, -41, -40, -41, -40, -41, -41, -40, -40, -40, -40, -40, -40, -40, -40, -40, -40, -40, -40, -41, -40, -40, -40, -40, -40, -40, -40, -40, -40, -40, -40, -40, -40, -40, -40, -40, -40, -41, -40, -40, -40, -40, -41, -41, -41, -40, -40, -40, -40, -40, -40, -40, -41, -40, -40, -40, -40, -40, -40, -40, -40, -40, -40, -41, -40, -41, -41, -41, -40, -40, -40, -40, -40, -40, -40, -40, -40, -40, -40, -40, -40, -40, -40, -40, -40, -40, -40, -40, -40, -40, -40, -41, -41, -40, -40, -40, -40, -40, -40, -41, -40, -40, -40, -41, -40, -40, -40, -40, -40, -40, -40, -41, -41, -40, -41, -41, -40, -40, -40, -40, -40, -40, -40, -40, -40, -40, -40, -40, -40, -40, -40, -40, -40, -40, -40, -41, -40, -40, -40, -40, -40, -40, -40, -40, -40, -40, -40, -41, -41, -41, -40, -40, -40, -41, -41, -41, -41, -41, -41, -41, -40, -40, -40, -40, -41, -40, -40, -40, -41, -40, -40, -40, -40, -40, -40, -40, -40, -40, -40, -40, -40, -40, -40, -40, -40, -40, -40, -40, -40, -40, -40, -40, -40, -40, -40, -40, -40, -40, -40, -40, -40, -40, -40, -40, -40, -40, -40, -40, -40, -40, -40, -40, -40, -40, -40, -40, -40, -40, -40, -40, -40, -40, -40, -40, -40, -40, -40, -40, -40, -40, -40, -41, -40, -40, -40, -40, -40, -40, -40, -40, -40, -40, -40, -40, -40, -40, -40, -40, -40, -40, -40, -40, -40, -40, -40, -40, -40, -40, -40, -40, -40, -40, -40, -40, -40, -40, -40, -40, -40, -40, -40, -40, -40, -40, -40, -40, -40, -40, -40, -40, -40, -40, -40, -40, -40, -40, -40, -40, -40, -40, -40, -40, -40, -40, -40, -40, -40, -40, -40, -40, -40, -40, -40, -40, -40, -40, -40, -40, -40, -40, -40, -40, -40, -40, -40, -40, -40, -40, -40, -40, -40, -40, -40, -40, -40, -40, -40, -40, -40, -40, -40, -40, -40, -40, -40, -40, -40, -40, -40, -40, -40, -40, -40, -40, -40, -40, -40, -40, -40, -40, -40, -40, -40, -40, -40, -40, -40, -40, -40, -40, -40, -40, -40, -40]
-52094d0%%%%%%%%%%%%%%%%%%%%%%%%%%%%%%%%%%%%%%%%%%%%%%%%%%%%%%%%%%%%%%%%%%%%
-52136d0%%%%%%%%%%jJ%%%%%%%%%%%%%%%%%%%%%%%%%%%%%%%%%%%%%%%%%%%%%%%%%%%%%%%%
-52178d0%%%%%%%%%%%%%%%%%%%%%%%%%%%%%%%%%%%%%%%%%%%%%%%%%%%%%%%%%%%%%%%%%%%%
-52220d0%%%%%%%%%%%%%%%%%%%%%%%%%%%%%%%%%%%%%%%%%%%%%%%%%%%%%%%%%%%%%%%%%%%%
-52262d0%%%%%%%%%%%%%%%%%%%%%%%%%%%%%%%%%%%%%%%%%%%%%%%%%%%%%%%%%%%%%%%%%%%%
-52304d0%%%%%%%%%%%%%%%%%%%%%%%%%%%%%%%%%%%%%%%%%%%%%%%%%%%%%%%%%%%%%%%%%%%%
-52345d0%%%%%%%%%%%%%%%%%%%%%%%%%%%%%%%%%%%%%%%%%%%%%%%%%%%%%%%%%%%%%%%%%%%%
-52387d0%%%%%%%%%%%%%%%%%%%%%%%%%%%%%%%%%%%%%%%%%%%%%%%%%%%%%%%%%%%%%%%%%%%%
$$ y = [-40, -40, -40, -40, -40, -40, -40, -40, -40, -40, -40, -40, -40, -40, -40, -40, -40, -40, -40, -40, -40, -40, -40, -40, -40, -40, -40, -40, -40, -40, -40, -40, -40, -40, -40, -40, -40, -40, -40, -40, -40, -40, -40, -40, -40, -40, -40, -40, -40, -40, -40, -40, -40, -40, -40, -40, -40, -40, -40, -40, -40, -40, -40, -40, -40, -40, -40, -40, -40, -40, -40, -40, -40, -40, -40, -40, -40, -40, -40, -41, -40, -40, -40, -40, -40, -40, -40, -40, -40, -40, -40, -40, -40, -40, -40, -40, -40, -40, -40, -40, -40, -40, -40, -40, -40, -40, -40, -40, -40, -40, -40, -40, -40, -40, -40, -40, -40, -40, -40, -40, -40, -40, -40, -40, -40, -40, -40, -40, -40, -40, -40, -40, -40, -40, -40, -40, -40, -40, -40, -40, -40, -40, -40, -40, -40, -40, -40, -40, -40, -40, -40, -40, -40, -40, -40, -40, -40, -40, -40, -40, -40, -40, -40, -40, -40, -40, -40, -40, -40, -40, -40, -40, -40, -40, -40, -40, -40, -40, -40, -40, -40, -40, -40, -40, -40, -40, -40, -40, -40, -40, -40, -40, -40, -40, -40, -40, -40, -40, -40, -40, -40, -40, -40, -40, -40, -40, -40, -40, -40, -40, -40, -40, -40, -40, -40, -40, -40, -40, -40, -40, -40, -40, -40, -40, -40, -40, -40, -40, -40, -40, -40, -40, -40, -40, -40, -40, -40, -40, -40, -40, -40, -40, -40, -40, -40, -40, -40, -40, -40, -40, -40, -40, -40, -40, -40, -40, -40, -40, -40, -40, -40, -40, -40, -40, -40, -40, -40, -40, -40, -40, -40, -40, -40, -40, -40, -40, -40, -40, -40, -40, -40, -40, -40, -40, -40, -40, -40, -40, -40, -40, -40, -40, -40, -40, -40, -40, -40, -40, -40, -40, -40, -40, -40, -40, -40, -40, -40, -40, -40, -40, -40, -40, -40, -40, -40, -40, -40, -40, -40, -40, -40, -40, -40, -40, -40, -40, -40, -40, -40, -40, -40, -40, -40, -40, -40, -40, -40, -40, -40, -40, -40, -40, -40, -40, -40, -40, -40, -40, -40, -40, -40, -40, -40, -40, -40, -40, -40, -40, -40, -40, -40, -40, -40, -40, -40, -40, -40, -40, -40, -40, -40, -40, -40, -40, -40, -40, -40, -40, -40, -40, -40, -40, -40, -40, -40, -40, -40, -40, -40, -40, -40, -40, -40, -40, -40, -40, -40, -40, -40, -40, -40, -40, -40, -40, -40, -40, -40, -40, -40, -40, -40, -40, -40, -40, -40, -40, -40, -40, -40, -40, -40, -40, -40, -40, -40, -40, -40, -40, -40, -40, -40, -40, -40, -40, -40, -40, -40, -40, -40, -40, -40, -40, -40, -40, -40, -40, -40, -40, -40, -40, -40, -40, -40, -40, -40, -40, -40, -40, -40, -40, -40, -40, -40, -40, -40, -40, -40, -40, -40, -40, -40, -40, -40, -40, -40, -40, -40, -40, -40, -40, -40, -40, -40, -40, -40, -40, -40, -40, -40, -40, -40, -40, -40, -40, -40, -40, -40, -40, -40, -40, -40, -40, -40, -40, -40, -40, -40, -40, -40, -40, -40, -40, -40, -40, -40, -40, -40, -40, -40, -40, -40, -40, -40, -40, -40, -40, -40, -40, -40, -40, -40, -40, -40, -40, -40, -40, -40, -40, -40, -40, -40, -40, -40, -40, -40]
-52429d0%%%%%%%%%%%%%%%%%%%%%%%%%%%%%%%%%%%%%%%%%%%%%%%%%%%%%%%%%%%%%%%%%%%%
-52471d0%%%%%%%%%%%%%%%%%%%%%%%%%%%%%%%%%%%%%%%%%%%%%%%%%%%%%%%%%%%%%%%%%%%%
-52513d0%%%%%%%%%%%%%%%%%%%%%%%%%%%%%%%%%%%%%%%%%%%%%%%%%%%%%%%%%%%%%%%%%%%%
-52555d0%%%%%%%%%%%%%%%%%%%%%%%%%%%%%%%%%%%%%%%%%%%%%%%%%%%%%%%%%%%%%%%%%%%%
-52596d0%%%%%%%%%%%%%%%%%%%%%%%%%%%%%%%%%%%%%%%%%%%%%%%%%%%%%%%%%%%%%%%%%%%%
-52638d0%%%%%%%%%%%%%%%%%%%%%%%%%%%%%%%%%%%%%%%%%%%%%%%%%%%%%%%%%%%%%%%%%%%%
-52680d0%%%%%%%%%%%%%%%%%%%%%%%%%%%%%%%%%%%%%%%%%%%%%%%%%%%%%%%%%%%%%%%%%%%%
-52722d0%%%%%%%%%%%%%%%%%%%%%%%%%%%%%%%%%%%%%%%%%%%%%%%%%%%%%%%%%%%%%%%%%%%%
$$ y = [-40, -40, -40, -40, -40, -40, -40, -40, -40, -40, -40, -40, -40, -40, -40, -40, -40, -40, -40, -40, -40, -40, -40, -40, -40, -40, -40, -40, -40, -40, -40, -40, -40, -40, -40, -40, -40, -40, -40, -40, -40, -40, -40, -40, -40, -40, -40, -40, -40, -40, -40, -40, -40, -40, -40, -40, -40, -40, -40, -40, -40, -40, -40, -40, -40, -40, -40, -40, -40, -40, -40, -40, -40, -40, -40, -40, -40, -40, -40, -40, -40, -40, -40, -40, -40, -40, -40, -40, -40, -40, -40, -40, -40, -40, -40, -40, -40, -40, -40, -40, -40, -40, -40, -40, -40, -40, -40, -40, -40, -40, -40, -40, -40, -40, -40, -40, -40, -40, -40, -40, -40, -40, -40, -40, -40, -40, -40, -40, -40, -40, -40, -40, -40, -40, -40, -40, -40, -40, -40, -40, -40, -40, -40, -40, -40, -40, -40, -40, -40, -40, -40, -40, -40, -40, -40, -40, -40, -40, -40, -40, -40, -40, -40, -40, -40, -40, -40, -40, -40, -40, -40, -40, -40, -40, -40, -40, -40, -40, -40, -40, -40, -40, -40, -40, -40, -40, -40, -40, -40, -40, -40, -40, -40, -40, -40, -40, -40, -40, -40, -40, -40, -40, -40, -40, -40, -40, -40, -40, -40, -40, -40, -40, -40, -40, -40, -40, -40, -40, -40, -40, -40, -40, -40, -40, -40, -40, -40, -40, -40, -40, -40, -40, -40, -40, -40, -40, -40, -40, -40, -40, -40, -40, -40, -40, -40, -40, -40, -40, -40, -40, -40, -40, -40, -40, -40, -40, -40, -40, -40, -40, -40, -40, -40, -40, -40, -40, -40, -40, -40, -40, -40, -40, -40, -40, -40, -40, -40, -40, -40, -40, -40, -40, -40, -40, -40, -40, -40, -40, -40, -40, -40, -40, -40, -40, -40, -40, -40, -40, -40, -40, -40, -40, -40, -40, -40, -40, -40, -40, -40, -40, -40, -40, -40, -40, -40, -40, -40, -40, -40, -40, -40, -40, -40, -40, -40, -40, -40, -40, -40, -40, -40, -40, -40, -40, -40, -40, -40, -40, -40, -40, -40, -40, -40, -40, -40, -40, -40, -40, -40, -40, -40, -40, -40, -40, -40, -40, -40, -40, -40, -40, -40, -40, -40, -40, -40, -40, -40, -40, -40, -40, -40, -40, -40, -40, -40, -40, -40, -40, -40, -40, -40, -40, -40, -40, -40, -40, -40, -40, -40, -40, -40, -40, -40, -40, -40, -40, -40, -40, -40, -40, -40, -40, -40, -40, -40, -40, -40, -40, -40, -40, -40, -40, -40, -40, -40, -40, -40, -40, -40, -40, -40, -40, -40, -40, -40, -40, -40, -40, -40, -40, -40, -40, -40, -40, -40, -40, -40, -40, -40, -40, -40, -40, -40, -40, -40, -40, -40, -40, -40, -40, -40, -40, -40, -40, -40, -40, -40, -40, -40, -40, -40, -40, -40, -40, -40, -40, -40, -40, -40, -40, -40, -40, -40, -40, -40, -40, -40, -40, -40, -40, -40, -40, -40, -40, -40, -40, -40, -40, -40, -40, -40, -40, -40, -40, -40, -40, -40, -40, -40, -40, -40, -40, -40, -40, -40, -40, -40, -40, -40, -40, -40, -40, -40, -40, -40, -40, -40, -40, -40, -40, -40, -40, -40, -40, -40, -40, -40, -40, -40, -40, -40, -40, -40, -40, -40, -40, -40, -40, -40, -40, -40, -40, -40, -40, -40]
-52764d0%%%%%%%%%%%%%%%%%%%%%%%%%%%%%%%%%%%%%%%%%%%%%%%%%%%%%%%%%%%%%%%%%%%%
-52806d0%%%%%%%%%%%%%%%%%%%%%%%%%%%%%%%%%%%%%%%%%%%%%%%%%%%%%%%%%%%%%%%%%%%%
-52847d0%%%%%%%%%%%%%%%%%%%%%%%%%%%%%%%%%%%%%%Jj%%%%%%%%%%%%%%%%%%%%%%%%%%%%
-52889d0%%%%%%%%%%%%%%%%%%%%%%%%%%%%%%%%%Jj%%%%%%%%%%%%%%%%J%j%%%%%%%%%%%%%%
-52931d0%%%%%%Jj%%%%%%%%%%%%%%%JjJj%%%%%%%%%%%%%%%%%%Jj%%%%%%%%%%Jj%%%%%%%%%
-52973d0%%%%%%%%%%Jj%%%%%%%%%%%%%%%%%%%%%%%%J%j%%%%%%%%%%%%%%%%%%%%%%%%%%%%%
-53015d0JjJj%%%%%%%%%%%JjJ%j%%%%%%%%%%%%%%Jj%%%%%%%%%%%J%jJ%j%%%Jj%Jj%Jj%%Jj
-53057d0%%%%%%%%%%%%%Jj%%%%%%%Jj%%%%%%%JjJj%%%%%%%%%%%%%%Jj%%%%%%%%%%J%%j%Jj
$$ y = [-40, -40, -40, -40, -40, -40, -40, -40, -40, -40, -40, -40, -40, -40, -40, -40, -40, -40, -40, -40, -40, -40, -40, -40, -40, -40, -40, -40, -40, -40, -40, -40, -40, -40, -40, -40, -40, -40, -40, -40, -40, -40, -40, -40, -40, -40, -40, -40, -40, -40, -40, -40, -40, -40, -40, -40, -40, -40, -40, -40, -40, -40, -40, -40, -40, -40, -40, -40, -40, -40, -40, -40, -40, -40, -40, -40, -40, -40, -40, -40, -40, -40, -40, -40, -40, -40, -40, -40, -40, -40, -40, -40, -40, -40, -40, -40, -40, -40, -40, -40, -40, -40, -40, -40, -40, -40, -40, -40, -40, -40, -40, -40, -40, -40, -40, -40, -40, -40, -40, -40, -40, -40, -40, -40, -40, -40, -40, -40, -40, -40, -40, -40, -40, -40, -40, -40, -40, -40, -40, -40, -40, -40, -40, -40, -40, -40, -40, -40, -40, -40, -40, -40, -40, -40, -40, -40, -40, -40, -40, -40, -40, -40, -40, -40, -40, -40, -40, -40, -40, -40, -40, -40, -40, -40, -40, -39, -40, -40, -40, -40, -40, -40, -40, -40, -40, -40, -40, -40, -40, -40, -40, -40, -40, -40, -40, -40, -40, -40, -40, -40, -40, -40, -40, -40, -40, -40, -40, -40, -40, -40, -40, -40, -40, -40, -40, -40, -40, -40, -40, -40, -40, -40, -40, -40, -40, -40, -40, -40, -40, -40, -40, -40, -40, -40, -40, -40, -40, -40, -39, -40, -40, -40, -40, -40, -40, -40, -40, -40, -40, -40, -40, -40, -40, -40, -40, -40, -39, -39, -40, -40, -40, -40, -40, -40, -40, -40, -40, -40, -40, -40, -40, -40, -40, -40, -40, -40, -40, -40, -40, -39, -40, -40, -40, -40, -40, -40, -40, -40, -40, -40, -40, -40, -40, -40, -40, -40, -39, -40, -39, -40, -40, -40, -40, -40, -40, -40, -40, -40, -40, -40, -40, -40, -40, -40, -40, -40, -40, -40, -39, -40, -40, -40, -40, -40, -40, -40, -40, -40, -40, -40, -39, -40, -40, -40, -40, -40, -40, -40, -40, -40, -40, -40, -40, -40, -40, -40, -40, -40, -40, -40, -40, -39, -40, -40, -40, -40, -40, -40, -40, -40, -40, -40, -40, -40, -40, -40, -40, -40, -40, -40, -40, -40, -40, -40, -40, -40, -40, -39, -39, -40, -40, -40, -40, -40, -40, -40, -40, -40, -40, -40, -40, -40, -40, -40, -40, -40, -40, -40, -40, -40, -40, -40, -40, -40, -40, -40, -40, -40, -40, -39, -40, -39, -40, -40, -40, -40, -40, -40, -40, -40, -40, -40, -40, -40, -39, -40, -39, -39, -40, -40, -40, -40, -40, -40, -40, -40, -40, -40, -40, -40, -40, -40, -40, -39, -40, -40, -40, -40, -40, -40, -40, -40, -40, -40, -40, -40, -39, -39, -40, -39, -39, -40, -40, -40, -40, -39, -40, -40, -39, -40, -40, -39, -40, -40, -40, -39, -40, -40, -40, -40, -40, -40, -40, -40, -40, -40, -40, -40, -40, -40, -39, -40, -40, -40, -40, -40, -40, -40, -40, -39, -40, -40, -40, -40, -40, -40, -40, -40, -39, -40, -39, -40, -40, -40, -40, -40, -40, -40, -40, -40, -40, -40, -40, -40, -40, -40, -39, -40, -40, -40, -40, -40, -40, -40, -40, -40, -40, -40, -39, -39, -39, -40, -40, -39, -40]
-53098d0Jj%Jj%%%%%%%%%%%%%%%%%%%%%%%%%%JjJ%%%%%%%%j%%%%%J%%%%%j%%Jj%%J%jJj%%
-53140d0%Jj%J%%%j%JjJj%%Jj%J%%%%%jJ%j%%%%%%%J%%jJ%%j%%%J%%%j%J%%%%j%%%%%JjJj
-53182d0%%%%%J%%%%jJ%%jJj%%J%%%%%%%%%%%%jJ%%%jJ%j%J%%jJ%%%%%%%%%%%%%%%%%%jJ%
-53224c9%%%%%%%%%%%%%%%%%%%%%%%%%%%%%%%%%%%%%%%%%%%%%%%%%%%%%%%%%%%%%%%%%%%%
-53266c9%%%%%%%%%%%jJ%%%%%%%%%jJ%%%%%%%jJ%%%%%%j%J%%%%%%%%%%%%%jJ%%%%jJ%%%j%
-53308d0J%%%%%%%%%jJ%%%%jJ%%%jJ%%%%%%%jJ%%%%%jJjJ%%%%%jJ%%%%%jJ%jJjJ%%%%%%%%
-53350c9%%%%%%jJ%%%%%%%%%%%%%%%%%%jJ%jJ%%%jJ%%%%%%%%%%%%%%%%%%%%%%%%%%%%%%%%
-53391c9%%%%%%%%%%%%%%%%%%%%%%%%%%%%%%%%%%%%%%%%%%%%%%%%%%%%%%%%%%%%%%%%%%%%
$$ y = [-40, -39, -40, -40, -39, -40, -40, -40, -40, -40, -40, -40, -40, -40, -40, -40, -40, -40, -40, -40, -40, -40, -40, -40, -40, -40, -40, -40, -40, -40, -40, -40, -39, -40, -39, -39, -39, -39, -39, -39, -39, -39, -39, -40, -40, -40, -40, -40, -40, -39, -39, -39, -39, -39, -39, -40, -40, -40, -39, -40, -40, -40, -39, -39, -40, -39, -40, -40, -40, -40, -39, -40, -40, -39, -39, -39, -39, -40, -40, -39, -40, -39, -40, -40, -40, -39, -40, -40, -39, -39, -39, -39, -39, -39, -40, -39, -39, -40, -40, -40, -40, -40, -40, -40, -40, -39, -39, -39, -40, -39, -39, -39, -40, -40, -40, -40, -39, -39, -39, -39, -40, -40, -39, -39, -39, -39, -39, -40, -40, -40, -40, -40, -40, -39, -40, -39, -40, -40, -40, -40, -40, -40, -39, -39, -39, -39, -39, -40, -39, -39, -39, -40, -39, -40, -40, -40, -39, -39, -39, -39, -39, -39, -39, -39, -39, -39, -39, -39, -39, -40, -39, -39, -39, -39, -40, -39, -39, -40, -40, -39, -39, -39, -40, -39, -39, -39, -39, -39, -39, -39, -39, -39, -39, -39, -39, -39, -39, -39, -39, -39, -39, -39, -40, -39, -39, -39, -39, -39, -39, -39, -39, -39, -39, -39, -39, -39, -39, -39, -39, -39, -39, -39, -39, -39, -39, -39, -39, -39, -39, -39, -39, -39, -39, -39, -39, -39, -39, -39, -39, -39, -39, -39, -39, -39, -39, -39, -39, -39, -39, -39, -39, -39, -39, -39, -39, -39, -39, -39, -39, -39, -39, -39, -39, -39, -39, -39, -39, -39, -39, -39, -39, -39, -39, -39, -39, -39, -39, -39, -39, -39, -39, -39, -39, -39, -40, -39, -39, -39, -39, -39, -39, -39, -39, -39, -39, -40, -39, -39, -39, -39, -39, -39, -39, -39, -40, -39, -39, -39, -39, -39, -39, -39, -40, -40, -39, -39, -39, -39, -39, -39, -39, -39, -39, -39, -39, -39, -39, -39, -40, -39, -39, -39, -39, -39, -40, -39, -39, -39, -39, -40, -40, -39, -39, -39, -39, -39, -39, -39, -39, -39, -39, -40, -39, -39, -39, -39, -39, -40, -39, -39, -39, -39, -40, -39, -39, -39, -39, -39, -39, -39, -39, -40, -39, -39, -39, -39, -39, -39, -40, -39, -40, -39, -39, -39, -39, -39, -39, -40, -39, -39, -39, -39, -39, -39, -40, -39, -39, -40, -39, -40, -39, -39, -39, -39, -39, -39, -39, -39, -39, -39, -39, -39, -39, -39, -39, -40, -39, -39, -39, -39, -39, -39, -39, -39, -39, -39, -39, -39, -39, -39, -39, -39, -39, -39, -39, -40, -39, -39, -40, -39, -39, -39, -39, -40, -39, -39, -39, -39, -39, -39, -39, -39, -39, -39, -39, -39, -39, -39, -39, -39, -39, -39, -39, -39, -39, -39, -39, -39, -39, -39, -39, -39, -39, -39, -39, -39, -39, -39, -39, -39, -39, -39, -39, -39, -39, -39, -39, -39, -39, -39, -39, -39, -39, -39, -39, -39, -39, -39, -39, -39, -39, -39, -39, -39, -39, -39, -39, -39, -39, -39, -39, -39, -39, -39, -39, -39, -39, -39, -39, -39, -39, -39, -39, -39, -39, -39, -39, -39, -39, -39, -39, -39, -39, -39, -39, -39, -39, -39, -39, -39, -39, -39, -39, -39, -39]
-53433c9%%%%%%%%%%%%%%%%%%%%%%%%%jJ%%%%%%%%%%%%%%%%%%%%%%%%%%%%%%%%%%%%%%%%%
-53475c9%%%%%%%%%%%%%%%%%%%%%%%%%%%%%%%%%%%%%%%%%%%%%%%%%%%%%%%%%%%%%%%%%%%%
-53517c9%%%%%%%%%%%%%%%%%%%%%%%%%%%%%%%%%%%%%%%%%%%%%%%%%%%%%%%%%%%%%%%jJ%%%
-53559c9%%%%%%%%%%%%%%%%%%%%%%%%%%%%%%%%%%%%%%%%%%%%%%%%%%%%%%%%%%%%%%%%%%%%
-53601c9%%%%%%%%%%%%%%%%%%%%%%%%%%%%%%%%%%%%%%%%%%%%%%%%%%%%%%%%%%%%%%%%%%%%
-53642c9%%%%%%%%%%%%%%%%%%%%%%%%%%%%%%%%%%%%%%%%%%%%%%%%%%%%%%%%%%%%%%%%%%%%
-53684c9%%%%%%%%%%%%%%%%%%%%%%%%%%%%%%%%%%%%%%%%%%%%%%%%%%%%%%%%%%%%%%%%%%%%
-53726c9%%%%%%%%%%%%%%%%%%%%%%%%%%%%%%%%%%%%%%%%%%%%%%%%%%%%%%%%%%%%%%%%%%%%
$$ y = [-39, -39, -39, -39, -39, -39, -39, -39, -39, -39, -39, -39, -39, -39, -39, -39, -39, -39, -39, -39, -39, -39, -39, -39, -39, -39, -40, -39, -39, -39, -39, -39, -39, -39, -39, -39, -39, -39, -39, -39, -39, -39, -39, -39, -39, -39, -39, -39, -39, -39, -39, -39, -39, -39, -39, -39, -39, -39, -39, -39, -39, -39, -39, -39, -39, -39, -39, -39, -39, -39, -39, -39, -39, -39, -39, -39, -39, -39, -39, -39, -39, -39, -39, -39, -39, -39, -39, -39, -39, -39, -39, -39, -39, -39, -39, -39, -39, -39, -39, -39, -39, -39, -39, -39, -39, -39, -39, -39, -39, -39, -39, -39, -39, -39, -39, -39, -39, -39, -39, -39, -39, -39, -39, -39, -39, -39, -39, -39, -39, -39, -39, -39, -39, -39, -39, -39, -39, -39, -39, -39, -39, -39, -39, -39, -39, -39, -39, -39, -39, -39, -39, -39, -39, -39, -39, -39, -39, -39, -39, -39, -39, -39, -39, -39, -39, -39, -39, -39, -39, -39, -39, -39, -39, -39, -39, -39, -39, -39, -39, -39, -39, -39, -39, -39, -39, -39, -39, -39, -39, -39, -39, -39, -39, -39, -39, -39, -39, -39, -39, -39, -40, -39, -39, -39, -39, -39, -39, -39, -39, -39, -39, -39, -39, -39, -39, -39, -39, -39, -39, -39, -39, -39, -39, -39, -39, -39, -39, -39, -39, -39, -39, -39, -39, -39, -39, -39, -39, -39, -39, -39, -39, -39, -39, -39, -39, -39, -39, -39, -39, -39, -39, -39, -39, -39, -39, -39, -39, -39, -39, -39, -39, -39, -39, -39, -39, -39, -39, -39, -39, -39, -39, -39, -39, -39, -39, -39, -39, -39, -39, -39, -39, -39, -39, -39, -39, -39, -39, -39, -39, -39, -39, -39, -39, -39, -39, -39, -39, -39, -39, -39, -39, -39, -39, -39, -39, -39, -39, -39, -39, -39, -39, -39, -39, -39, -39, -39, -39, -39, -39, -39, -39, -39, -39, -39, -39, -39, -39, -39, -39, -39, -39, -39, -39, -39, -39, -39, -39, -39, -39, -39, -39, -39, -39, -39, -39, -39, -39, -39, -39, -39, -39, -39, -39, -39, -39, -39, -39, -39, -39, -39, -39, -39, -39, -39, -39, -39, -39, -39, -39, -39, -39, -39, -39, -39, -39, -39, -39, -39, -39, -39, -39, -39, -39, -39, -39, -39, -39, -39, -39, -39, -39, -39, -39, -39, -39, -39, -39, -39, -39, -39, -39, -39, -39, -39, -39, -39, -39, -39, -39, -39, -39, -39, -39, -39, -39, -39, -39, -39, -39, -39, -39, -39, -39, -39, -39, -39, -39, -39, -39, -39, -39, -39, -39, -39, -39, -39, -39, -39, -39, -39, -39, -39, -39, -39, -39, -39, -39, -39, -39, -39, -39, -39, -39, -39, -39, -39, -39, -39, -39, -39, -39, -39, -39, -39, -39, -39, -39, -39, -39, -39, -39, -39, -39, -39, -39, -39, -39, -39, -39, -39, -39, -39, -39, -39, -39, -39, -39, -39, -39, -39, -39, -39, -39, -39, -39, -39, -39, -39, -39, -39, -39, -39, -39, -39, -39, -39, -39, -39, -39, -39, -39, -39, -39, -39, -39, -39, -39, -39, -39, -39, -39, -39, -39, -39, -39, -39, -39, -39, -39, -39, -39, -39, -39, -39, -39, -39, -39, -39, -39, -39, -39, -39, -39, -39, -39]
-53768c9%%%%%%%%%%%%%%%%%%%%%%%%%%%%%%%%%%%%%%%%%%%%%%%%%%%%%%%%%%%%%%%%%%%%
-53810c9%%%%%%%%%%%%%%%%%%%%%%%%%%%%%%%%%%%%%%%%%%%%%%%%%%%%%%%%%%%%%%%%%%%%
-53852c9%%%%%%%%%%%%%%%%%%%%%%%%%%%%%%%%%%%%%%%%%%%%%%%%%%%%%%%%%%%%%%%%%%%%
-53893c9%%%%%%%%%%%%%%%%%%%%%%%%%%%%%%%%%%%%%%%%%%%%%%%%%%%%%%%%%%%%%%%%%%%%
-53935c9%%%%%%%%%%%%%%%%%%%%%%%%%%%%%%%%%%%%%%%%%%%%%%%%%%%%%%%%%%%%%%%%%%%%
-53977c9%%%%%%%%%%%%%%%%%%%%%%%%%%%%%%%%%%%%%%%%%%%%%%%%%%%%%%%%%%%%%%%%%%%%
-54019c9%%%%%%%%%%%%%%%%%%%%%%%%%%%%%%%%%%%%%%%%%%%%%%%%%%%%%%%%%%%%%%%%%%%%
-54061c9%%%%%%%%%%%%Jj%%%%%%%%%%%%%%%%%%%%%%%%%%%%%%%%%%J%j%%%%%%%%%%%%%%%%%
$$ y = [-39, -39, -39, -39, -39, -39, -39, -39, -39, -39, -39, -39, -39, -39, -39, -39, -39, -39, -39, -39, -39, -39, -39, -39, -39, -39, -39, -39, -39, -39, -39, -39, -39, -39, -39, -39, -39, -39, -39, -39, -39, -39, -39, -39, -39, -39, -39, -39, -39, -39, -39, -39, -39, -39, -39, -39, -39, -39, -39, -39, -39, -39, -39, -39, -39, -39, -39, -39, -39, -39, -39, -39, -39, -39, -39, -39, -39, -39, -39, -39, -39, -39, -39, -39, -39, -39, -39, -39, -39, -39, -39, -39, -39, -39, -39, -39, -39, -39, -39, -39, -39, -39, -39, -39, -39, -39, -39, -39, -39, -39, -39, -39, -39, -39, -39, -39, -39, -39, -39, -39, -39, -39, -39, -39, -39, -39, -39, -39, -39, -39, -39, -39, -39, -39, -39, -39, -39, -39, -39, -39, -39, -39, -39, -39, -39, -39, -39, -39, -39, -39, -39, -39, -39, -39, -39, -39, -39, -39, -39, -39, -39, -39, -39, -39, -39, -39, -39, -39, -39, -39, -39, -39, -39, -39, -39, -39, -39, -39, -39, -39, -39, -39, -39, -39, -39, -39, -39, -39, -39, -39, -39, -39, -39, -39, -39, -39, -39, -39, -39, -39, -39, -39, -39, -39, -39, -39, -39, -39, -39, -39, -39, -39, -39, -39, -39, -39, -39, -39, -39, -39, -39, -39, -39, -39, -39, -39, -39, -39, -39, -39, -39, -39, -39, -39, -39, -39, -39, -39, -39, -39, -39, -39, -39, -39, -39, -39, -39, -39, -39, -39, -39, -39, -39, -39, -39, -39, -39, -39, -39, -39, -39, -39, -39, -39, -39, -39, -39, -39, -39, -39, -39, -39, -39, -39, -39, -39, -39, -39, -39, -39, -39, -39, -39, -39, -39, -39, -39, -39, -39, -39, -39, -39, -39, -39, -39, -39, -39, -39, -39, -39, -39, -39, -39, -39, -39, -39, -39, -39, -39, -39, -39, -39, -39, -39, -39, -39, -39, -39, -39, -39, -39, -39, -39, -39, -39, -39, -39, -39, -39, -39, -39, -39, -39, -39, -39, -39, -39, -39, -39, -39, -39, -39, -39, -39, -39, -39, -39, -39, -39, -39, -39, -39, -39, -39, -39, -39, -39, -39, -39, -39, -39, -39, -39, -39, -39, -39, -39, -39, -39, -39, -39, -39, -39, -39, -39, -39, -39, -39, -39, -39, -39, -39, -39, -39, -39, -39, -39, -39, -39, -39, -39, -39, -39, -39, -39, -39, -39, -39, -39, -39, -39, -39, -39, -39, -39, -39, -39, -39, -39, -39, -39, -39, -39, -39, -39, -39, -39, -39, -39, -39, -39, -39, -39, -39, -39, -39, -39, -39, -39, -39, -39, -39, -39, -39, -39, -39, -39, -39, -39, -39, -39, -39, -39, -39, -39, -39, -39, -39, -39, -39, -39, -39, -39, -39, -39, -39, -39, -39, -39, -39, -39, -39, -39, -39, -39, -39, -39, -39, -39, -39, -39, -39, -39, -39, -39, -39, -39, -39, -39, -39, -39, -39, -39, -39, -39, -39, -39, -39, -39, -38, -39, -39, -39, -39, -39, -39, -39, -39, -39, -39, -39, -39, -39, -39, -39, -39, -39, -39, -39, -39, -39, -39, -39, -39, -39, -39, -39, -39, -39, -39, -39, -39, -39, -39, -39, -38, -38, -39, -39, -39, -39, -39, -39, -39, -39, -39, -39, -39, -39, -39, -39, -39, -39, -39, -39]
-54103c9%%%%%%%%%%%%%%%%%Jj%%%%%Jj%%%%%%%%%%%%%%%%%%%%%%J%j%%%%%%%%%%Jj%%Jj%
-54144c9%%%%%Jj%%%%%%%%%%%%%%%%%%%Jj%J%j%%%%%%%%%%%Jj%%%%%%%%%%%%%%%%%%%%%%%
-54186c9%%%%%%%%%Jj%Jj%JjJj%%%%%%%%%%%%%%%%%%%%J%j%%%%%%%Jj%%%%%%Jj%%%%Jj%%%
-54228c9%%%Jj%Jj%%Jj%%%%%%%%%%%%%%%J%j%%%%Jj%%%%%%%%J%%%%j%%%%%J%%%jJ%%j%J%%
-54270c8j%%%%%%%JjJ%%%%jJ%%%j%%J%%j%J%jJ%jJ%%%%%j%%%%%%%Jj%J%%%%%%%jJjJ%jJ%j
-54312c9J%%%%%%%j%J%%j%%J%j%%%Jj%J%j%%%%%J%%%%%%%jJj%J%%%j%J%%%%%%%j%%J%%jJ%
-54354c8j%J%%%jJ%jJ%%%%%%%%jJjJ%%%%%%%%%jJ%%%jJ%%jJ%%%jJ%%%%%%%%%%%jJ%%%%%%%
-54395c8jJ%%%%%%%jJ%%%%%%%%%%%%%%%%%%%%%%%j%J%%%%j%J%%%jJ%%%%%%%%%%%%%%%%%%%
$$ y = [-39, -39, -39, -39, -39, -39, -39, -39, -39, -39, -39, -39, -39, -39, -39, -39, -39, -39, -38, -39, -39, -39, -39, -39, -39, -38, -39, -39, -39, -39, -39, -39, -39, -39, -39, -39, -39, -39, -39, -39, -39, -39, -39, -39, -39, -39, -39, -39, -39, -38, -38, -39, -39, -39, -39, -39, -39, -39, -39, -39, -39, -39, -38, -39, -39, -39, -38, -39, -39, -39, -39, -39, -39, -39, -38, -39, -39, -39, -39, -39, -39, -39, -39, -39, -39, -39, -39, -39, -39, -39, -39, -39, -39, -39, -39, -38, -39, -39, -38, -38, -39, -39, -39, -39, -39, -39, -39, -39, -39, -39, -39, -39, -38, -39, -39, -39, -39, -39, -39, -39, -39, -39, -39, -39, -39, -39, -39, -39, -39, -39, -39, -39, -39, -39, -39, -39, -39, -39, -39, -39, -39, -39, -39, -39, -39, -39, -38, -39, -39, -38, -39, -39, -38, -39, -38, -39, -39, -39, -39, -39, -39, -39, -39, -39, -39, -39, -39, -39, -39, -39, -39, -39, -39, -39, -39, -39, -38, -38, -39, -39, -39, -39, -39, -39, -39, -39, -38, -39, -39, -39, -39, -39, -39, -39, -38, -39, -39, -39, -39, -39, -38, -39, -39, -39, -39, -39, -39, -39, -38, -39, -39, -38, -39, -39, -39, -38, -39, -39, -39, -39, -39, -39, -39, -39, -39, -39, -39, -39, -39, -39, -39, -39, -38, -38, -39, -39, -39, -39, -39, -38, -39, -39, -39, -39, -39, -39, -39, -39, -39, -38, -38, -38, -38, -38, -39, -39, -39, -39, -39, -39, -38, -38, -38, -38, -39, -38, -38, -38, -39, -39, -38, -38, -38, -39, -39, -39, -39, -39, -39, -39, -39, -38, -39, -38, -38, -38, -38, -38, -39, -38, -38, -38, -38, -39, -39, -39, -38, -38, -38, -39, -39, -38, -38, -39, -38, -38, -39, -38, -38, -38, -38, -38, -38, -39, -39, -39, -39, -39, -39, -39, -39, -38, -39, -39, -38, -38, -38, -38, -38, -38, -38, -38, -39, -38, -39, -38, -38, -39, -38, -38, -39, -38, -38, -38, -38, -38, -38, -38, -38, -39, -39, -38, -38, -38, -39, -39, -39, -38, -38, -39, -39, -39, -39, -38, -39, -39, -38, -38, -39, -39, -39, -39, -39, -39, -38, -38, -38, -38, -38, -38, -38, -38, -39, -38, -39, -39, -38, -38, -38, -38, -39, -39, -38, -38, -38, -38, -38, -38, -38, -38, -39, -39, -39, -38, -38, -38, -39, -38, -38, -39, -39, -38, -38, -38, -38, -39, -38, -38, -39, -38, -38, -38, -38, -38, -38, -38, -38, -38, -39, -38, -39, -38, -38, -38, -38, -38, -38, -38, -38, -38, -38, -39, -38, -38, -38, -38, -39, -38, -38, -38, -39, -38, -38, -38, -38, -39, -38, -38, -38, -38, -38, -38, -38, -38, -38, -38, -38, -38, -39, -38, -38, -38, -38, -38, -38, -38, -38, -39, -38, -38, -38, -38, -38, -38, -38, -38, -39, -38, -38, -38, -38, -38, -38, -38, -38, -38, -38, -38, -38, -38, -38, -38, -38, -38, -38, -38, -38, -38, -38, -38, -38, -39, -39, -38, -38, -38, -38, -38, -39, -39, -38, -38, -38, -38, -39, -38, -38, -38, -38, -38, -38, -38, -38, -38, -38, -38, -38, -38, -38, -38, -38, -38, -38, -38, -38]
-54437c8%%%%%%%%%%%%%jJ%%%%%%%%jJ%%%%%%%%%%%%%jJ%%%%%%%%%%%%%%%%%%%%%%%%%%%%
-54479c8%%%%%%%%%%%%%%%%%%%%%%%%%%%%%%%jJ%%%%%%%%%%%%%%%%%%%%%%%%%%%%%%%%%%%
-54521c8%%%%%%%%%%%%%%%%jJ%%%%%%%%%%%%%%%%%%%%%%%%%%%%%%%%%%%%%%%%%%%%%%%%%%
-54563c8%%%%%%%%%%%%%%%%%%%%%%%%%%%%%%%%%%%%%%%%%%%%%%%%%%%%%%%%%%%%%%%%%%%%
-54605c8%%%%%%%%%%%%%%%%%%%%%%%%%%%%%%%%%%%%%%%%%%%%%%%%%%%%%%%%%%%%%%%%%%%%
-54647c8%%%%%%%%%%%%%%%%%%%%%%%%%%%%%%%%%%%%%%%%%%%%%%%%%%%%%%%%%%%%%%%%%%%%
-54688c8%%%%%%%%%%%%%%%%%%%%%%%%%%%%%%%%%%%%%%%%%%%%%%%%%%%%%%%%%%%%%%%%%%%%
-54730c8%%%%%%%%%%%%%%%%%%%%%%%%%%%%%%%%%%%%%%%%%%%%%%%%%%%%%%%%%%%%%%%%%%%%
$$ y = [-38, -38, -38, -38, -38, -38, -38, -38, -38, -38, -38, -38, -38, -38, -39, -38, -38, -38, -38, -38, -38, -38, -38, -38, -39, -38, -38, -38, -38, -38, -38, -38, -38, -38, -38, -38, -38, -38, -38, -39, -38, -38, -38, -38, -38, -38, -38, -38, -38, -38, -38, -38, -38, -38, -38, -38, -38, -38, -38, -38, -38, -38, -38, -38, -38, -38, -38, -38, -38, -38, -38, -38, -38, -38, -38, -38, -38, -38, -38, -38, -38, -38, -38, -38, -38, -38, -38, -38, -38, -38, -38, -38, -38, -38, -38, -38, -38, -38, -38, -38, -39, -38, -38, -38, -38, -38, -38, -38, -38, -38, -38, -38, -38, -38, -38, -38, -38, -38, -38, -38, -38, -38, -38, -38, -38, -38, -38, -38, -38, -38, -38, -38, -38, -38, -38, -38, -38, -38, -38, -38, -38, -38, -38, -38, -38, -38, -38, -38, -38, -38, -38, -38, -38, -39, -38, -38, -38, -38, -38, -38, -38, -38, -38, -38, -38, -38, -38, -38, -38, -38, -38, -38, -38, -38, -38, -38, -38, -38, -38, -38, -38, -38, -38, -38, -38, -38, -38, -38, -38, -38, -38, -38, -38, -38, -38, -38, -38, -38, -38, -38, -38, -38, -38, -38, -38, -38, -38, -38, -38, -38, -38, -38, -38, -38, -38, -38, -38, -38, -38, -38, -38, -38, -38, -38, -38, -38, -38, -38, -38, -38, -38, -38, -38, -38, -38, -38, -38, -38, -38, -38, -38, -38, -38, -38, -38, -38, -38, -38, -38, -38, -38, -38, -38, -38, -38, -38, -38, -38, -38, -38, -38, -38, -38, -38, -38, -38, -38, -38, -38, -38, -38, -38, -38, -38, -38, -38, -38, -38, -38, -38, -38, -38, -38, -38, -38, -38, -38, -38, -38, -38, -38, -38, -38, -38, -38, -38, -38, -38, -38, -38, -38, -38, -38, -38, -38, -38, -38, -38, -38, -38, -38, -38, -38, -38, -38, -38, -38, -38, -38, -38, -38, -38, -38, -38, -38, -38, -38, -38, -38, -38, -38, -38, -38, -38, -38, -38, -38, -38, -38, -38, -38, -38, -38, -38, -38, -38, -38, -38, -38, -38, -38, -38, -38, -38, -38, -38, -38, -38, -38, -38, -38, -38, -38, -38, -38, -38, -38, -38, -38, -38, -38, -38, -38, -38, -38, -38, -38, -38, -38, -38, -38, -38, -38, -38, -38, -38, -38, -38, -38, -38, -38, -38, -38, -38, -38, -38, -38, -38, -38, -38, -38, -38, -38, -38, -38, -38, -38, -38, -38, -38, -38, -38, -38, -38, -38, -38, -38, -38, -38, -38, -38, -38, -38, -38, -38, -38, -38, -38, -38, -38, -38, -38, -38, -38, -38, -38, -38, -38, -38, -38, -38, -38, -38, -38, -38, -38, -38, -38, -38, -38, -38, -38, -38, -38, -38, -38, -38, -38, -38, -38, -38, -38, -38, -38, -38, -38, -38, -38, -38, -38, -38, -38, -38, -38, -38, -38, -38, -38, -38, -38, -38, -38, -38, -38, -38, -38, -38, -38, -38, -38, -38, -38, -38, -38, -38, -38, -38, -38, -38, -38, -38, -38, -38, -38, -38, -38, -38, -38, -38, -38, -38, -38, -38, -38, -38, -38, -38, -38, -38, -38, -38, -38, -38, -38, -38, -38, -38, -38, -38, -38, -38, -38, -38, -38, -38, -38, -38, -38, -38, -38, -38, -38, -38, -38, -38]
-54772c8%%%%%%%%%%%%%%%%%%%%%%%%%%%%%%%%%%%%%%%%%%%%%%%%%%%%%%%%%%%%%%%%%%%%
-54814c8%%%%%%%%%%%%%%%%%%%%%%%%%%%%%%%%%%%%%%%%%%%%%%%%%%%%%%%%%%%%%%%%%%%%
-54856c8%%%%%%%%%%%%%%%%%%%%%%%%%%%%%%%%%%%%%%%%%%%%%%%%%%%%%%%%%%%%%%%%%%%%
-54898c8%%%%%%%%%%%%%%%%%%%%%%%%%%%%%%%%%%%%%%%%%%%%%%%%%%%%%%%%%%%%%%%%%%%%
-54939c8%%%%%%%%%%%%%%%%%%%%%%%%%%%%%%%%%%%%%%%%%%%%%%%%%%%%%%%%%%%%%%%%%%%J
-54981c7j%%%%%%%%%%%%%%%%%%%%%%%%%%%%%%%%%%%%%%%%%%%%%%%%%%%%%%%%%%%Jj%%%%%J
-55023c7j%%%%%%%%%%%%%%%%%%%%%%%%%%%%%%%%%%%%%%%%%%%%%%%%%%%%%%%%%%%%%%%%%%%
-55065c8%%%%%%%%%%%%%%%Jj%%%%%%%%%%JjJj%%%%%%%%%%%%%%%%%%%%Jj%%%%%Jj%%%%%J%j
$$ y = [-38, -38, -38, -38, -38, -38, -38, -38, -38, -38, -38, -38, -38, -38, -38, -38, -38, -38, -38, -38, -38, -38, -38, -38, -38, -38, -38, -38, -38, -38, -38, -38, -38, -38, -38, -38, -38, -38, -38, -38, -38, -38, -38, -38, -38, -38, -38, -38, -38, -38, -38, -38, -38, -38, -38, -38, -38, -38, -38, -38, -38, -38, -38, -38, -38, -38, -38, -38, -38, -38, -38, -38, -38, -38, -38, -38, -38, -38, -38, -38, -38, -38, -38, -38, -38, -38, -38, -38, -38, -38, -38, -38, -38, -38, -38, -38, -38, -38, -38, -38, -38, -38, -38, -38, -38, -38, -38, -38, -38, -38, -38, -38, -38, -38, -38, -38, -38, -38, -38, -38, -38, -38, -38, -38, -38, -38, -38, -38, -38, -38, -38, -38, -38, -38, -38, -38, -38, -38, -38, -38, -38, -38, -38, -38, -38, -38, -38, -38, -38, -38, -38, -38, -38, -38, -38, -38, -38, -38, -38, -38, -38, -38, -38, -38, -38, -38, -38, -38, -38, -38, -38, -38, -38, -38, -38, -38, -38, -38, -38, -38, -38, -38, -38, -38, -38, -38, -38, -38, -38, -38, -38, -38, -38, -38, -38, -38, -38, -38, -38, -38, -38, -38, -38, -38, -38, -38, -38, -38, -38, -38, -38, -38, -38, -38, -38, -38, -38, -38, -38, -38, -38, -38, -38, -38, -38, -38, -38, -38, -38, -38, -38, -38, -38, -38, -38, -38, -38, -38, -38, -38, -38, -38, -38, -38, -38, -38, -38, -38, -38, -38, -38, -38, -38, -38, -38, -38, -38, -38, -38, -38, -38, -38, -38, -38, -38, -38, -38, -38, -38, -38, -38, -38, -38, -38, -38, -38, -38, -38, -38, -38, -38, -38, -38, -38, -38, -38, -38, -38, -38, -38, -38, -38, -38, -38, -38, -38, -38, -38, -38, -38, -38, -38, -38, -38, -38, -38, -38, -38, -38, -38, -38, -38, -38, -38, -38, -38, -38, -38, -38, -38, -38, -38, -38, -38, -38, -38, -38, -38, -38, -38, -38, -38, -38, -38, -38, -38, -38, -38, -38, -38, -37, -38, -38, -38, -38, -38, -38, -38, -38, -38, -38, -38, -38, -38, -38, -38, -38, -38, -38, -38, -38, -38, -38, -38, -38, -38, -38, -38, -38, -38, -38, -38, -38, -38, -38, -38, -38, -38, -38, -38, -38, -38, -38, -38, -38, -38, -38, -38, -38, -38, -38, -38, -38, -38, -38, -38, -38, -38, -38, -38, -38, -37, -38, -38, -38, -38, -38, -38, -37, -38, -38, -38, -38, -38, -38, -38, -38, -38, -38, -38, -38, -38, -38, -38, -38, -38, -38, -38, -38, -38, -38, -38, -38, -38, -38, -38, -38, -38, -38, -38, -38, -38, -38, -38, -38, -38, -38, -38, -38, -38, -38, -38, -38, -38, -38, -38, -38, -38, -38, -38, -38, -38, -38, -38, -38, -38, -38, -38, -38, -38, -38, -38, -38, -38, -38, -38, -38, -38, -38, -38, -38, -38, -38, -38, -38, -38, -38, -38, -38, -38, -38, -38, -37, -38, -38, -38, -38, -38, -38, -38, -38, -38, -38, -38, -37, -38, -37, -38, -38, -38, -38, -38, -38, -38, -38, -38, -38, -38, -38, -38, -38, -38, -38, -38, -38, -38, -38, -38, -37, -38, -38, -38, -38, -38, -38, -37, -38, -38, -38, -38, -38, -38, -37, -37, -38]
-55107c8%%%Jj%%J%j%Jj%%%%%%%%%%%%%%%%%%Jj%%Jj%%%J%%%%jJ%%jJj%%%%J%%j%%%%Jj%%
-55149c8%%%Jj%%%J%jJ%j%%J%%%jJj%%%%J%jJj%%J%j%%%%%%%J%%%%%%j%Jj%J%j%%%J%jJ%j
-55190c8J%%jJ%%%j%%J%%%%%%%%%%%%%%j%%%J%%%%%%jJ%%%j%%%J%%%%%%%%%j%%J%%%%%%%%
-55232c7jJ%jJ%j%J%%%%%%%jJ%j%J%%jJ%%%%j%%%Jj%JjJ%%%%%%%%%%%%%%%jJ%%jJ%%%%%%j
-55274c8J%%%%%jJ%%%%%%j%J%%%%%%%%%%%%%%%%%%%%%%%%%%%%%%%%%%%%%%%%%%%%%%%%%%%
-55316c7%%jJ%%%%%%%%%%%%j%%J%%%%%%%%%%%%%%%jJ%%%%%%%%%%%%%%%%%%%%%%%%%%%%%%%
-55358c7%%%%%%%%%%%%%%%%%%%%%%%%%%%%%%%%%%%%%%%%%%%%%%%%%%%%%%%%%%%%%%%%%%%%
-55400c7%%%%%%%%%%%%%%%%%%%%%%%%%%%%%%%%%%%%%%%%%%%%%%%%%%%%%%%%%%%%%%%%%%%%
$$ y = [-38, -38, -38, -38, -37, -38, -38, -38, -37, -37, -38, -38, -37, -38, -38, -38, -38, -38, -38, -38, -38, -38, -38, -38, -38, -38, -38, -38, -38, -38, -38, -38, -37, -38, -38, -38, -37, -38, -38, -38, -38, -37, -37, -37, -37, -37, -38, -37, -37, -37, -38, -37, -38, -38, -38, -38, -38, -37, -37, -37, -38, -38, -38, -38, -38, -37, -38, -38, -38, -38, -38, -38, -37, -38, -38, -38, -38, -37, -37, -38, -37, -37, -38, -38, -38, -37, -37, -37, -37, -38, -37, -38, -38, -38, -38, -38, -37, -37, -38, -37, -38, -38, -38, -37, -37, -38, -38, -38, -38, -38, -38, -38, -38, -37, -37, -37, -37, -37, -37, -37, -38, -38, -37, -38, -38, -37, -37, -38, -38, -38, -38, -37, -37, -38, -37, -37, -38, -37, -37, -37, -38, -37, -37, -37, -37, -38, -38, -38, -37, -37, -37, -37, -37, -37, -37, -37, -37, -37, -37, -37, -37, -37, -37, -38, -38, -38, -38, -37, -37, -37, -37, -37, -37, -37, -38, -37, -37, -37, -37, -38, -38, -38, -38, -37, -37, -37, -37, -37, -37, -37, -37, -37, -37, -38, -38, -38, -37, -37, -37, -37, -37, -37, -37, -37, -37, -38, -37, -37, -38, -37, -37, -38, -38, -37, -37, -37, -37, -37, -37, -37, -37, -38, -37, -37, -38, -38, -37, -37, -37, -38, -37, -37, -37, -37, -37, -38, -38, -38, -38, -37, -38, -38, -37, -38, -37, -37, -37, -37, -37, -37, -37, -37, -37, -37, -37, -37, -37, -37, -37, -37, -38, -37, -37, -37, -38, -37, -37, -37, -37, -37, -37, -37, -38, -37, -37, -37, -37, -37, -37, -38, -37, -37, -37, -37, -37, -37, -37, -38, -38, -37, -37, -37, -37, -37, -37, -37, -37, -37, -37, -37, -37, -37, -37, -37, -37, -37, -37, -37, -37, -37, -37, -37, -37, -37, -37, -37, -37, -37, -37, -37, -37, -37, -37, -37, -37, -37, -37, -37, -37, -37, -37, -37, -37, -37, -37, -37, -37, -37, -37, -37, -37, -37, -37, -38, -37, -37, -37, -37, -37, -37, -37, -37, -37, -37, -37, -37, -37, -38, -38, -38, -37, -37, -37, -37, -37, -37, -37, -37, -37, -37, -37, -37, -37, -37, -37, -37, -38, -37, -37, -37, -37, -37, -37, -37, -37, -37, -37, -37, -37, -37, -37, -37, -37, -37, -37, -37, -37, -37, -37, -37, -37, -37, -37, -37, -37, -37, -37, -37, -37, -37, -37, -37, -37, -37, -37, -37, -37, -37, -37, -37, -37, -37, -37, -37, -37, -37, -37, -37, -37, -37, -37, -37, -37, -37, -37, -37, -37, -37, -37, -37, -37, -37, -37, -37, -37, -37, -37, -37, -37, -37, -37, -37, -37, -37, -37, -37, -37, -37, -37, -37, -37, -37, -37, -37, -37, -37, -37, -37, -37, -37, -37, -37, -37, -37, -37, -37, -37, -37, -37, -37, -37, -37, -37, -37, -37, -37, -37, -37, -37, -37, -37, -37, -37, -37, -37, -37, -37, -37, -37, -37, -37, -37, -37, -37, -37, -37, -37, -37, -37, -37, -37, -37, -37, -37, -37, -37, -37, -37, -37, -37, -37, -37, -37, -37, -37, -37, -37, -37, -37, -37, -37, -37, -37, -37, -37, -37, -37, -37, -37, -37, -37, -37, -37, -37, -37]
-55441c7%%%%%%%%%%%%%%%%%%%%%%%%%%%%%%%%%%%%%%%%%%%%%%%%%%%%%%%%%%%%%%%%%%%%
-55483c7%%%%%%%%%%%%%%%%%%%%%%%%%%%%%%%%%%%%%%%%%%%%%%%%%%%%%%%%%%%%%%%%%%%%
-55525c7%%%%%%%%%%%%%%%%%%%%%%%%%%%%%%%%%%%%%%%%%%%%%%%%%%%%%%%%%%%%%%%%%%%%
-55567c7%%%%%%%%%%%%%%%%%%%%%%%%%%%%%%%%%%%%%%%%%%%%%%%%%%%%%%%%%%%%%%%%%%%%
-55609c7%%%%%%%%%%%%%%%%%%%%%%%%%%%%%%%%%%%%%%%%%%%%%%%%%%%%%%%%%%%%%%%%%%%%
-55651c7%%%%%%%%%%%%%%%%%%%%%%%%%%%%%%%%%%%%%%%%%%%%%%%%%%%%%%%%%%%%%%%%%%%%
-55692c7%%%%%%%%%%%%%%%%%%%%%%%%%%%%%%%%%%%%%%%%%%%%%%%%%%%%%%%%%%%%%%%%%%%%
-55734c7%%%%%%%%%%%%%%%%%%%%%%%%%%%%%%%%%%%%%%%%%%%%%%%%%%%%%%%%%%%%%%%%%%%%
$$ y = [-37, -37, -37, -37, -37, -37, -37, -37, -37, -37, -37, -37, -37, -37, -37, -37, -37, -37, -37, -37, -37, -37, -37, -37, -37, -37, -37, -37, -37, -37, -37, -37, -37, -37, -37, -37, -37, -37, -37, -37, -37, -37, -37, -37, -37, -37, -37, -37, -37, -37, -37, -37, -37, -37, -37, -37, -37, -37, -37, -37, -37, -37, -37, -37, -37, -37, -37, -37, -37, -37, -37, -37, -37, -37, -37, -37, -37, -37, -37, -37, -37, -37, -37, -37, -37, -37, -37, -37, -37, -37, -37, -37, -37, -37, -37, -37, -37, -37, -37, -37, -37, -37, -37, -37, -37, -37, -37, -37, -37, -37, -37, -37, -37, -37, -37, -37, -37, -37, -37, -37, -37, -37, -37, -37, -37, -37, -37, -37, -37, -37, -37, -37, -37, -37, -37, -37, -37, -37, -37, -37, -37, -37, -37, -37, -37, -37, -37, -37, -37, -37, -37, -37, -37, -37, -37, -37, -37, -37, -37, -37, -37, -37, -37, -37, -37, -37, -37, -37, -37, -37, -37, -37, -37, -37, -37, -37, -37, -37, -37, -37, -37, -37, -37, -37, -37, -37, -37, -37, -37, -37, -37, -37, -37, -37, -37, -37, -37, -37, -37, -37, -37, -37, -37, -37, -37, -37, -37, -37, -37, -37, -37, -37, -37, -37, -37, -37, -37, -37, -37, -37, -37, -37, -37, -37, -37, -37, -37, -37, -37, -37, -37, -37, -37, -37, -37, -37, -37, -37, -37, -37, -37, -37, -37, -37, -37, -37, -37, -37, -37, -37, -37, -37, -37, -37, -37, -37, -37, -37, -37, -37, -37, -37, -37, -37, -37, -37, -37, -37, -37, -37, -37, -37, -37, -37, -37, -37, -37, -37, -37, -37, -37, -37, -37, -37, -37, -37, -37, -37, -37, -37, -37, -37, -37, -37, -37, -37, -37, -37, -37, -37, -37, -37, -37, -37, -37, -37, -37, -37, -37, -37, -37, -37, -37, -37, -37, -37, -37, -37, -37, -37, -37, -37, -37, -37, -37, -37, -37, -37, -37, -37, -37, -37, -37, -37, -37, -37, -37, -37, -37, -37, -37, -37, -37, -37, -37, -37, -37, -37, -37, -37, -37, -37, -37, -37, -37, -37, -37, -37, -37, -37, -37, -37, -37, -37, -37, -37, -37, -37, -37, -37, -37, -37, -37, -37, -37, -37, -37, -37, -37, -37, -37, -37, -37, -37, -37, -37, -37, -37, -37, -37, -37, -37, -37, -37, -37, -37, -37, -37, -37, -37, -37, -37, -37, -37, -37, -37, -37, -37, -37, -37, -37, -37, -37, -37, -37, -37, -37, -37, -37, -37, -37, -37, -37, -37, -37, -37, -37, -37, -37, -37, -37, -37, -37, -37, -37, -37, -37, -37, -37, -37, -37, -37, -37, -37, -37, -37, -37, -37, -37, -37, -37, -37, -37, -37, -37, -37, -37, -37, -37, -37, -37, -37, -37, -37, -37, -37, -37, -37, -37, -37, -37, -37, -37, -37, -37, -37, -37, -37, -37, -37, -37, -37, -37, -37, -37, -37, -37, -37, -37, -37, -37, -37, -37, -37, -37, -37, -37, -37, -37, -37, -37, -37, -37, -37, -37, -37, -37, -37, -37, -37, -37, -37, -37, -37, -37, -37, -37, -37, -37, -37, -37, -37, -37, -37, -37, -37, -37, -37, -37, -37, -37, -37, -37, -37, -37, -37, -37, -37, -37, -37, -37, -37, -37, -37, -37]
-55776c7%Jj%%%%%%%%%%%%%%%%%%%%%%%%%%%%%%%%%%%%%%%%%%%%%%%%%%%%%%%%%%%%%%%%%
-55818c7%%%%%%%%%%%%%%%%%%%%%%%%%%%%%%%%%%%%%%%%%%%%%%%%%%%%%%%%%%Jj%%%%%Jj%
-55860c7%Jj%%%J%j%%%%%%%%%%%J%%j%%%%%J%%j%Jj%%J%j%%%%J%%%%j%%%%%%%%%%%%%%%%%
-55902c7%Jj%%%Jj%Jj%JjJj%Jj%%%%%%%%%%%JjJ%%%j%%%%%%J%jJ%j%%%%%%%%J%j%%%J%%j%
-55943c7%Jj%Jj%%%Jj%%J%%j%Jj%%J%%%%j%%%%%%%J%jJj%%JjJj%J%%%%%%%%j%%%%J%%%j%%
-55985c7%J%%%%%%%%%%%%%j%%%%Jj%J%%%jJ%%j%%%%%J%j%%Jj%%J%%%%%j%J%%%%%j%%J%%%%
-56027c6%%%%jJ%jJ%%jJ%%%%%%%%%%%%%%%%%%%%%%%jJ%%%%%%%%%%%%%%%jJ%%%%%%%jJj%Jj
-56069c7J%%%%%%%%%%jJ%j%J%%%%%%jJ%%%%%%%%%%%%%%%%%%%%%%%%%%%%%%%%%%%%%%%%%%%
$$ y = [-37, -37, -36, -37, -37, -37, -37, -37, -37, -37, -37, -37, -37, -37, -37, -37, -37, -37, -37, -37, -37, -37, -37, -37, -37, -37, -37, -37, -37, -37, -37, -37, -37, -37, -37, -37, -37, -37, -37, -37, -37, -37, -37, -37, -37, -37, -37, -37, -37, -37, -37, -37, -37, -37, -37, -37, -37, -37, -37, -37, -37, -37, -37, -37, -37, -37, -37, -37, -37, -37, -37, -37, -37, -37, -37, -37, -37, -37, -37, -37, -37, -37, -37, -37, -37, -37, -37, -37, -37, -37, -37, -37, -37, -37, -37, -37, -37, -37, -37, -37, -37, -37, -37, -37, -37, -37, -37, -37, -37, -37, -37, -37, -37, -37, -37, -37, -37, -37, -37, -37, -37, -37, -37, -37, -37, -37, -37, -36, -37, -37, -37, -37, -37, -37, -36, -37, -37, -37, -36, -37, -37, -37, -37, -36, -36, -37, -37, -37, -37, -37, -37, -37, -37, -37, -37, -37, -37, -36, -36, -36, -37, -37, -37, -37, -37, -37, -36, -36, -36, -37, -37, -36, -37, -37, -37, -36, -36, -37, -37, -37, -37, -37, -36, -36, -36, -36, -36, -37, -37, -37, -37, -37, -37, -37, -37, -37, -37, -37, -37, -37, -37, -37, -37, -37, -37, -37, -36, -37, -37, -37, -37, -36, -37, -37, -36, -37, -37, -36, -37, -36, -37, -37, -36, -37, -37, -37, -37, -37, -37, -37, -37, -37, -37, -37, -37, -36, -37, -36, -36, -36, -36, -37, -37, -37, -37, -37, -37, -37, -36, -36, -37, -36, -36, -37, -37, -37, -37, -37, -37, -37, -37, -37, -36, -36, -37, -37, -37, -37, -36, -36, -36, -37, -37, -37, -36, -37, -37, -36, -37, -37, -37, -37, -36, -37, -37, -37, -36, -36, -36, -37, -37, -36, -37, -37, -37, -36, -36, -36, -36, -36, -37, -37, -37, -37, -37, -37, -37, -37, -36, -36, -37, -36, -37, -37, -37, -36, -37, -36, -37, -37, -36, -36, -36, -36, -36, -36, -36, -36, -36, -37, -37, -37, -37, -37, -36, -36, -36, -36, -37, -37, -37, -37, -36, -36, -36, -36, -36, -36, -36, -36, -36, -36, -36, -36, -36, -36, -37, -37, -37, -37, -37, -36, -37, -37, -36, -36, -36, -36, -37, -36, -36, -36, -37, -37, -37, -37, -37, -37, -36, -36, -37, -37, -37, -36, -37, -37, -37, -36, -36, -36, -36, -36, -36, -37, -37, -36, -36, -36, -36, -36, -36, -37, -37, -37, -36, -36, -36, -36, -36, -36, -36, -36, -36, -37, -36, -36, -37, -36, -36, -36, -37, -36, -36, -36, -36, -36, -36, -36, -36, -36, -36, -36, -36, -36, -36, -36, -36, -36, -36, -36, -36, -36, -36, -36, -36, -37, -36, -36, -36, -36, -36, -36, -36, -36, -36, -36, -36, -36, -36, -36, -36, -36, -37, -36, -36, -36, -36, -36, -36, -36, -36, -37, -36, -37, -37, -36, -37, -36, -36, -36, -36, -36, -36, -36, -36, -36, -36, -36, -37, -36, -36, -37, -37, -36, -36, -36, -36, -36, -36, -36, -37, -36, -36, -36, -36, -36, -36, -36, -36, -36, -36, -36, -36, -36, -36, -36, -36, -36, -36, -36, -36, -36, -36, -36, -36, -36, -36, -36, -36, -36, -36, -36, -36, -36, -36, -36, -36, -36, -36, -36, -36, -36, -36, -36, -36]
-56111c6%%%%%%%%%%%%%%%%%%%%%%%%%%%%%%%%%%%%%%%%%%%%%%%%%%%%%%%%%%%%%%%%%%%%
-56153c6%%%%%%%%%%%%%%%%%%%%%%%%%%%%%%%%%%%%%%%%%%%%%%%%%%%%%%%%%%%%%%%%%%%%
-56195c6%%%%%%%%%%%%%%%%%%%%%%%%%%%%%%%%%%%%%%%%%%%%%%%%%%%%%%%%%%%%%%%%%%%%
-56236c6%%%%%%%%%%%%%%%%%%%%%%%%%%%%%%%%%%%%%%%%%%%%%%%%%%%%%%%%%%%%%%%%%%%%
-56278c6%%%%%%%%%%%%%%%%%%%%%%%%%%%%%%%%%%%%%%%%%%%%%%%%%%%%%%%%%%%%%%%%%%%%
-56320c6%%%%%%%%%%%%%%%%%%%%%%%%%%%%%%%%%%%%%%%%%%%%%%%%%%%%%%%%%%%%%%%%%%%%
-56362c6%%%%%%%%%%%%%%%%%%%%%%%%%%%%%%%%%%%%%%%%%%%%%%%%%%%%%%%%%%%%%%%%%%%%
-56404c6%%%%%%%%%%%%%%%%%%%%%%%%%%%%%%%%%%%%%%%%%%%%%%%%%%%%%%%%%%%%%%%%%%%%
$$ y = [-36, -36, -36, -36, -36, -36, -36, -36, -36, -36, -36, -36, -36, -36, -36, -36, -36, -36, -36, -36, -36, -36, -36, -36, -36, -36, -36, -36, -36, -36, -36, -36, -36, -36, -36, -36, -36, -36, -36, -36, -36, -36, -36, -36, -36, -36, -36, -36, -36, -36, -36, -36, -36, -36, -36, -36, -36, -36, -36, -36, -36, -36, -36, -36, -36, -36, -36, -36, -36, -36, -36, -36, -36, -36, -36, -36, -36, -36, -36, -36, -36, -36, -36, -36, -36, -36, -36, -36, -36, -36, -36, -36, -36, -36, -36, -36, -36, -36, -36, -36, -36, -36, -36, -36, -36, -36, -36, -36, -36, -36, -36, -36, -36, -36, -36, -36, -36, -36, -36, -36, -36, -36, -36, -36, -36, -36, -36, -36, -36, -36, -36, -36, -36, -36, -36, -36, -36, -36, -36, -36, -36, -36, -36, -36, -36, -36, -36, -36, -36, -36, -36, -36, -36, -36, -36, -36, -36, -36, -36, -36, -36, -36, -36, -36, -36, -36, -36, -36, -36, -36, -36, -36, -36, -36, -36, -36, -36, -36, -36, -36, -36, -36, -36, -36, -36, -36, -36, -36, -36, -36, -36, -36, -36, -36, -36, -36, -36, -36, -36, -36, -36, -36, -36, -36, -36, -36, -36, -36, -36, -36, -36, -36, -36, -36, -36, -36, -36, -36, -36, -36, -36, -36, -36, -36, -36, -36, -36, -36, -36, -36, -36, -36, -36, -36, -36, -36, -36, -36, -36, -36, -36, -36, -36, -36, -36, -36, -36, -36, -36, -36, -36, -36, -36, -36, -36, -36, -36, -36, -36, -36, -36, -36, -36, -36, -36, -36, -36, -36, -36, -36, -36, -36, -36, -36, -36, -36, -36, -36, -36, -36, -36, -36, -36, -36, -36, -36, -36, -36, -36, -36, -36, -36, -36, -36, -36, -36, -36, -36, -36, -36, -36, -36, -36, -36, -36, -36, -36, -36, -36, -36, -36, -36, -36, -36, -36, -36, -36, -36, -36, -36, -36, -36, -36, -36, -36, -36, -36, -36, -36, -36, -36, -36, -36, -36, -36, -36, -36, -36, -36, -36, -36, -36, -36, -36, -36, -36, -36, -36, -36, -36, -36, -36, -36, -36, -36, -36, -36, -36, -36, -36, -36, -36, -36, -36, -36, -36, -36, -36, -36, -36, -36, -36, -36, -36, -36, -36, -36, -36, -36, -36, -36, -36, -36, -36, -36, -36, -36, -36, -36, -36, -36, -36, -36, -36, -36, -36, -36, -36, -36, -36, -36, -36, -36, -36, -36, -36, -36, -36, -36, -36, -36, -36, -36, -36, -36, -36, -36, -36, -36, -36, -36, -36, -36, -36, -36, -36, -36, -36, -36, -36, -36, -36, -36, -36, -36, -36, -36, -36, -36, -36, -36, -36, -36, -36, -36, -36, -36, -36, -36, -36, -36, -36, -36, -36, -36, -36, -36, -36, -36, -36, -36, -36, -36, -36, -36, -36, -36, -36, -36, -36, -36, -36, -36, -36, -36, -36, -36, -36, -36, -36, -36, -36, -36, -36, -36, -36, -36, -36, -36, -36, -36, -36, -36, -36, -36, -36, -36, -36, -36, -36, -36, -36, -36, -36, -36, -36, -36, -36, -36, -36, -36, -36, -36, -36, -36, -36, -36, -36, -36, -36, -36, -36, -36, -36, -36, -36, -36, -36, -36, -36, -36, -36, -36, -36, -36, -36, -36, -36, -36, -36, -36, -36, -36, -36, -36]
-56446c6%%%%%%%%%%%%%%%%%%%%%%%%%%%%%%%%%%%%%%%%%%%%%%%%%%%%%%%%%%%%%%%%%%%%
-56487c6%%%%%%%%%%%%%%%%%%%%%%%Jj%%%%%%%%%%%%%%%%%%%%%%%%Jj%%%%%%%%%%%%%%%%%
-56529c6%%%%%%%%%%%%%%%%%%%%%%%%%%%%%%%%%%%Jj%%%%%%%%%Jj%%%%%%%%%%%%%%%%%%%%
-56571c6%%%%%%%%%%%%%%%%%%%%%%%%%%%%JjJj%%%%%%%%%%%%%%%%%%%%%%%%%%%J%jJj%J%%
-56613c5j%%%%%%J%%%%j%%Jj%%%%%%%%%%%Jj%Jj%%Jj%J%jJj%%Jj%%%%%%%Jj%Jj%%%%%%JjJ
-56655c5%%%%j%J%%j%JjJ%j%J%%%j%J%%j%%%J%%jJj%J%%%%j%J%j%%J%j%%JjJ%j%J%jJj%%%
-56697c6%%J%%%jJ%jJjJ%%%%%%%%%j%%J%%j%%J%%%%%%%%%%%jJ%%%%%%j%%J%jJ%%%%%%%%jJ
-56738c5%jJ%%%%jJ%%j%J%%%%%%%jJ%%%%%%%%%%%%%%%%%%%%jJ%%%%%%jJ%%%%%%%%%%%%%%%
$$ y = [-36, -36, -36, -36, -36, -36, -36, -36, -36, -36, -36, -36, -36, -36, -36, -36, -36, -36, -36, -36, -36, -36, -36, -36, -36, -36, -36, -36, -36, -36, -36, -36, -36, -36, -36, -36, -36, -36, -36, -36, -36, -36, -36, -36, -36, -36, -36, -36, -36, -36, -36, -36, -36, -36, -36, -36, -36, -36, -36, -36, -36, -36, -36, -36, -36, -36, -36, -36, -36, -36, -36, -36, -36, -36, -36, -36, -36, -36, -36, -36, -36, -36, -36, -36, -36, -36, -36, -36, -36, -36, -36, -36, -35, -36, -36, -36, -36, -36, -36, -36, -36, -36, -36, -36, -36, -36, -36, -36, -36, -36, -36, -36, -36, -36, -36, -36, -36, -36, -35, -36, -36, -36, -36, -36, -36, -36, -36, -36, -36, -36, -36, -36, -36, -36, -36, -36, -36, -36, -36, -36, -36, -36, -36, -36, -36, -36, -36, -36, -36, -36, -36, -36, -36, -36, -36, -36, -36, -36, -36, -36, -36, -36, -36, -36, -36, -36, -36, -36, -36, -36, -36, -36, -35, -36, -36, -36, -36, -36, -36, -36, -36, -36, -36, -35, -36, -36, -36, -36, -36, -36, -36, -36, -36, -36, -36, -36, -36, -36, -36, -36, -36, -36, -36, -36, -36, -36, -36, -36, -36, -36, -36, -36, -36, -36, -36, -36, -36, -36, -36, -36, -36, -36, -36, -36, -36, -36, -36, -36, -36, -36, -36, -36, -36, -35, -36, -35, -36, -36, -36, -36, -36, -36, -36, -36, -36, -36, -36, -36, -36, -36, -36, -36, -36, -36, -36, -36, -36, -36, -36, -36, -36, -36, -36, -36, -35, -35, -36, -35, -36, -36, -35, -35, -35, -36, -36, -36, -36, -36, -36, -36, -35, -35, -35, -35, -35, -36, -36, -36, -35, -36, -36, -36, -36, -36, -36, -36, -36, -36, -36, -36, -36, -35, -36, -36, -35, -36, -36, -36, -35, -36, -36, -35, -35, -36, -35, -36, -36, -36, -35, -36, -36, -36, -36, -36, -36, -36, -36, -35, -36, -36, -35, -36, -36, -36, -36, -36, -36, -36, -35, -36, -35, -35, -35, -35, -35, -36, -36, -35, -35, -35, -36, -36, -35, -36, -35, -35, -36, -36, -35, -35, -35, -35, -36, -36, -35, -35, -35, -36, -36, -36, -36, -35, -35, -35, -36, -35, -36, -36, -35, -35, -35, -35, -35, -36, -36, -35, -35, -36, -36, -36, -35, -35, -36, -36, -36, -35, -36, -35, -35, -36, -36, -35, -35, -36, -35, -36, -36, -36, -36, -36, -36, -35, -35, -35, -35, -36, -35, -35, -36, -35, -36, -35, -35, -35, -35, -35, -35, -35, -35, -35, -35, -36, -36, -36, -35, -35, -35, -36, -36, -36, -35, -35, -35, -35, -35, -35, -35, -35, -35, -35, -35, -35, -36, -35, -35, -35, -35, -35, -35, -35, -36, -36, -36, -35, -35, -36, -35, -35, -35, -35, -35, -35, -35, -35, -35, -36, -35, -35, -36, -35, -35, -35, -35, -35, -36, -35, -35, -35, -36, -36, -35, -35, -35, -35, -35, -35, -35, -35, -36, -35, -35, -35, -35, -35, -35, -35, -35, -35, -35, -35, -35, -35, -35, -35, -35, -35, -35, -35, -35, -35, -36, -35, -35, -35, -35, -35, -35, -35, -36, -35, -35, -35, -35, -35, -35, -35, -35, -35, -35, -35, -35, -35, -35, -35, -35]
-56780c5%%%%%%%%%%%%%%%%%%%%%%%%%%%%%%%%%%%%%%%%%%%%%%%%%%%%%%%%%%%%%%%%%%%%
-56822c5%%%%%%%%%%%%%%%%%%%%%%%%%%%%%%%%%%%%%%%%%%%%%%%%%%%%%%%%%%%%%%%%%jJ%
-56864c5%%%%%%%%%%%%%%%%%%%%%%%%%%%%%%%%%%%%%%%%%%%%%%%%%%%%%%%%%%%%%%%%%%%%
-56906c5%%%%%%%%%%%%%%%%%%%%%%%%%%%%%%%%%%%%%%%%%%%%%%%%%%%%%%%%%%%%%%%%%%%%
-56948c5%%%%%%%%%%%%%%%%%%%%%%%%%%%%%%%%%%%%%%%%%%%%%%%%%%%%%%%%%%%%%%%%%%%%
-56989c5%%%%%%%%%%%%%%%%%%%%%%%%%%%%%%%%%%%%%%%%%%%%%%%%%%%%%%%%%%%%%%%%%%%%
-57031c5%%%%%%%%%%%%%%%%%%%%%%%%%%%%%%%%%%%%%%%%%%%%%%%%%%%%%%%%%%%%%%%%%%%%
-57073c5%%%%%%%%%%%%%%%%%%%%%%%%%%%%%%%%%%%%%%%%%%%%%%%%%%%%%%%%%%%%%%%%%%%%
$$ y = [-35, -35, -35, -35, -35, -35, -35, -35, -35, -35, -35, -35, -35, -35, -35, -35, -35, -35, -35, -35, -35, -35, -35, -35, -35, -35, -35, -35, -35, -35, -35, -35, -35, -35, -35, -35, -35, -35, -35, -35, -35, -35, -35, -35, -35, -35, -35, -35, -35, -35, -35, -35, -35, -35, -35, -35, -35, -35, -35, -35, -35, -35, -35, -35, -35, -35, -35, -35, -35, -35, -35, -35, -35, -35, -35, -35, -35, -35, -35, -35, -35, -35, -35, -35, -35, -35, -35, -35, -35, -35, -35, -35, -35, -35, -35, -35, -35, -35, -35, -35, -35, -35, -35, -35, -35, -35, -35, -35, -35, -35, -35, -35, -35, -35, -35, -35, -35, -35, -35, -35, -35, -35, -35, -35, -35, -35, -35, -35, -35, -35, -35, -35, -35, -35, -36, -35, -35, -35, -35, -35, -35, -35, -35, -35, -35, -35, -35, -35, -35, -35, -35, -35, -35, -35, -35, -35, -35, -35, -35, -35, -35, -35, -35, -35, -35, -35, -35, -35, -35, -35, -35, -35, -35, -35, -35, -35, -35, -35, -35, -35, -35, -35, -35, -35, -35, -35, -35, -35, -35, -35, -35, -35, -35, -35, -35, -35, -35, -35, -35, -35, -35, -35, -35, -35, -35, -35, -35, -35, -35, -35, -35, -35, -35, -35, -35, -35, -35, -35, -35, -35, -35, -35, -35, -35, -35, -35, -35, -35, -35, -35, -35, -35, -35, -35, -35, -35, -35, -35, -35, -35, -35, -35, -35, -35, -35, -35, -35, -35, -35, -35, -35, -35, -35, -35, -35, -35, -35, -35, -35, -35, -35, -35, -35, -35, -35, -35, -35, -35, -35, -35, -35, -35, -35, -35, -35, -35, -35, -35, -35, -35, -35, -35, -35, -35, -35, -35, -35, -35, -35, -35, -35, -35, -35, -35, -35, -35, -35, -35, -35, -35, -35, -35, -35, -35, -35, -35, -35, -35, -35, -35, -35, -35, -35, -35, -35, -35, -35, -35, -35, -35, -35, -35, -35, -35, -35, -35, -35, -35, -35, -35, -35, -35, -35, -35, -35, -35, -35, -35, -35, -35, -35, -35, -35, -35, -35, -35, -35, -35, -35, -35, -35, -35, -35, -35, -35, -35, -35, -35, -35, -35, -35, -35, -35, -35, -35, -35, -35, -35, -35, -35, -35, -35, -35, -35, -35, -35, -35, -35, -35, -35, -35, -35, -35, -35, -35, -35, -35, -35, -35, -35, -35, -35, -35, -35, -35, -35, -35, -35, -35, -35, -35, -35, -35, -35, -35, -35, -35, -35, -35, -35, -35, -35, -35, -35, -35, -35, -35, -35, -35, -35, -35, -35, -35, -35, -35, -35, -35, -35, -35, -35, -35, -35, -35, -35, -35, -35, -35, -35, -35, -35, -35, -35, -35, -35, -35, -35, -35, -35, -35, -35, -35, -35, -35, -35, -35, -35, -35, -35, -35, -35, -35, -35, -35, -35, -35, -35, -35, -35, -35, -35, -35, -35, -35, -35, -35, -35, -35, -35, -35, -35, -35, -35, -35, -35, -35, -35, -35, -35, -35, -35, -35, -35, -35, -35, -35, -35, -35, -35, -35, -35, -35, -35, -35, -35, -35, -35, -35, -35, -35, -35, -35, -35, -35, -35, -35, -35, -35, -35, -35, -35, -35, -35, -35, -35, -35, -35, -35, -35, -35, -35, -35, -35, -35, -35, -35, -35, -35, -35, -35, -35, -35, -35, -35, -35, -35]
-57115c5%%%%%%%%%%%%%%%%%%%%%%%%%%%%%%%%%%%%%%%%%%%%%%%%%%%%%%%%%%%%%%%%%%%%
-57157c5%%%%%%%%%%%%%%%%%%%%%%%%%%Jj%%%%%%%%%%%%%%%%%%%%%%%%%%%%%%%%J%j%%%%%
-57199c5%%%%%%Jj%%%%%%%%%%%%Jj%%%%%%%%%%%%%%%%%%%Jj%%%%%%%%J%j%Jj%%%%%%Jj%%%
-57240c5J%j%%%%%%J%j%%%%%%%%%%%%Jj%%%%%J%j%%%%%%%Jj%%Jj%%%%%%%%%%%J%j%%%%%Jj
-57282c5%J%j%%%%%Jj%J%jJ%%j%%%J%%j%%%%%%%%%%%%%J%j%J%jJ%jJ%%j%%J%%%%%%%j%%%%
-57324c5%J%j%%Jj%%%%JjJ%%%%%jJj%%%J%%jJ%%%%j%%%%J%%%%%%%%%%j%J%%%%%%%%%jJ%j%
-57366c5J%%%%%%jJ%%%%%%%%%%%j%J%%%%%%%%%jJ%%%%%%%%%%%%%jJ%%%%%%%%%%%%%%%%%%%
-57408c4jJ%jJ%%%%%%%%%jJ%%%%%%%%%%%%%%%%%%%%%%%%%jJ%jJ%%%%%%%%%%%%%%%%%%%%%%
$$ y = [-35, -35, -35, -35, -35, -35, -35, -35, -35, -35, -35, -35, -35, -35, -35, -35, -35, -35, -35, -35, -35, -35, -35, -35, -35, -35, -35, -35, -35, -35, -35, -35, -35, -35, -35, -35, -35, -35, -35, -35, -35, -35, -35, -35, -35, -35, -35, -35, -35, -35, -35, -35, -35, -35, -35, -35, -35, -35, -35, -35, -35, -35, -35, -35, -35, -35, -35, -35, -35, -35, -35, -35, -35, -35, -35, -35, -35, -35, -35, -35, -35, -35, -35, -35, -35, -35, -35, -35, -35, -35, -35, -35, -35, -35, -35, -34, -35, -35, -35, -35, -35, -35, -35, -35, -35, -35, -35, -35, -35, -35, -35, -35, -35, -35, -35, -35, -35, -35, -35, -35, -35, -35, -35, -35, -35, -35, -35, -35, -35, -34, -34, -35, -35, -35, -35, -35, -35, -35, -35, -35, -35, -35, -35, -34, -35, -35, -35, -35, -35, -35, -35, -35, -35, -35, -35, -35, -35, -34, -35, -35, -35, -35, -35, -35, -35, -35, -35, -35, -35, -35, -35, -35, -35, -35, -35, -35, -35, -35, -34, -35, -35, -35, -35, -35, -35, -35, -35, -35, -34, -34, -35, -35, -34, -35, -35, -35, -35, -35, -35, -35, -34, -35, -35, -35, -35, -34, -34, -35, -35, -35, -35, -35, -35, -35, -34, -34, -35, -35, -35, -35, -35, -35, -35, -35, -35, -35, -35, -35, -35, -34, -35, -35, -35, -35, -35, -35, -34, -34, -35, -35, -35, -35, -35, -35, -35, -35, -34, -35, -35, -35, -34, -35, -35, -35, -35, -35, -35, -35, -35, -35, -35, -35, -35, -34, -34, -35, -35, -35, -35, -35, -35, -34, -35, -35, -34, -34, -35, -35, -35, -35, -35, -35, -34, -35, -35, -34, -34, -35, -34, -34, -34, -35, -35, -35, -35, -34, -34, -34, -35, -35, -35, -35, -35, -35, -35, -35, -35, -35, -35, -35, -35, -35, -34, -34, -35, -35, -34, -34, -35, -34, -34, -35, -34, -34, -34, -35, -35, -35, -34, -34, -34, -34, -34, -34, -34, -34, -35, -35, -35, -35, -35, -35, -34, -34, -35, -35, -35, -34, -35, -35, -35, -35, -35, -34, -35, -34, -34, -34, -34, -34, -34, -35, -34, -35, -35, -35, -35, -34, -34, -34, -35, -34, -34, -34, -34, -34, -35, -35, -35, -35, -35, -34, -34, -34, -34, -34, -34, -34, -34, -34, -34, -34, -35, -35, -34, -34, -34, -34, -34, -34, -34, -34, -34, -34, -35, -34, -34, -35, -35, -34, -34, -34, -34, -34, -34, -34, -35, -34, -34, -34, -34, -34, -34, -34, -34, -34, -34, -34, -34, -35, -35, -34, -34, -34, -34, -34, -34, -34, -34, -34, -34, -35, -34, -34, -34, -34, -34, -34, -34, -34, -34, -34, -34, -34, -34, -34, -35, -34, -34, -34, -34, -34, -34, -34, -34, -34, -34, -34, -34, -34, -34, -34, -34, -34, -34, -34, -34, -35, -34, -34, -35, -34, -34, -34, -34, -34, -34, -34, -34, -34, -34, -35, -34, -34, -34, -34, -34, -34, -34, -34, -34, -34, -34, -34, -34, -34, -34, -34, -34, -34, -34, -34, -34, -34, -34, -34, -34, -34, -35, -34, -34, -35, -34, -34, -34, -34, -34, -34, -34, -34, -34, -34, -34, -34, -34, -34, -34, -34, -34, -34, -34, -34, -34, -34, -34]
-57450c4%%%%%%%%%%%%%%%%%%%%%%%%%%%%%%%%%%%%%%%%%%%%%%%%%%%%%%%%%%%%%%%%%%%%
-57492c4%%%%%%%%%%%%%%%%%%%%%%%%%%%%%%%%%%%%%%%%%%%%%%%%%%%%%%%%%%%%%%%%%%%%
-57533c4%%%%%%%%%%%%%%%%%%%%%%%%%%%%%%%%%%%%%%%%%%%%%%%%%%%%%%%%%%%%%%%%%%%%
-57575c4%%%%%%%%%%%%%%%%%%%%%%%%%%%%%%%%%%%%%%%%%%%%%%%%%%%%%%%%%%%%%%%%%%%%
-57617c4%%%%%%%%%%%%%%%%%%%%%%%%%%%%%%%%%%%%%%%%%%%%%%%%%%%%%%%%%%%%%%%%%%%%
-57659c4%%%%%%%%%%%%%%%%%%%%%%%%%%%%%%%%%%%%%%%%%%%%%%%%%%%%%%%%%%%%%%%%%%%%
-57701c4%%%%%%%%%%%%%%%%%%%%%%%%%%%%%%%%%%%%%%%%%%%%%%%%%%%%%%%%%%%%%%%%%%%%
-57743c4%%%%%%%%%%%%%%%%%%%%%%%%%%%%%%%%%%%%%%%%%%%%%%%%%%%%%%%%%%%%%%%%%%%%
$$ y = [-34, -34, -34, -34, -34, -34, -34, -34, -34, -34, -34, -34, -34, -34, -34, -34, -34, -34, -34, -34, -34, -34, -34, -34, -34, -34, -34, -34, -34, -34, -34, -34, -34, -34, -34, -34, -34, -34, -34, -34, -34, -34, -34, -34, -34, -34, -34, -34, -34, -34, -34, -34, -34, -34, -34, -34, -34, -34, -34, -34, -34, -34, -34, -34, -34, -34, -34, -34, -34, -34, -34, -34, -34, -34, -34, -34, -34, -34, -34, -34, -34, -34, -34, -34, -34, -34, -34, -34, -34, -34, -34, -34, -34, -34, -34, -34, -34, -34, -34, -34, -34, -34, -34, -34, -34, -34, -34, -34, -34, -34, -34, -34, -34, -34, -34, -34, -34, -34, -34, -34, -34, -34, -34, -34, -34, -34, -34, -34, -34, -34, -34, -34, -34, -34, -34, -34, -34, -34, -34, -34, -34, -34, -34, -34, -34, -34, -34, -34, -34, -34, -34, -34, -34, -34, -34, -34, -34, -34, -34, -34, -34, -34, -34, -34, -34, -34, -34, -34, -34, -34, -34, -34, -34, -34, -34, -34, -34, -34, -34, -34, -34, -34, -34, -34, -34, -34, -34, -34, -34, -34, -34, -34, -34, -34, -34, -34, -34, -34, -34, -34, -34, -34, -34, -34, -34, -34, -34, -34, -34, -34, -34, -34, -34, -34, -34, -34, -34, -34, -34, -34, -34, -34, -34, -34, -34, -34, -34, -34, -34, -34, -34, -34, -34, -34, -34, -34, -34, -34, -34, -34, -34, -34, -34, -34, -34, -34, -34, -34, -34, -34, -34, -34, -34, -34, -34, -34, -34, -34, -34, -34, -34, -34, -34, -34, -34, -34, -34, -34, -34, -34, -34, -34, -34, -34, -34, -34, -34, -34, -34, -34, -34, -34, -34, -34, -34, -34, -34, -34, -34, -34, -34, -34, -34, -34, -34, -34, -34, -34, -34, -34, -34, -34, -34, -34, -34, -34, -34, -34, -34, -34, -34, -34, -34, -34, -34, -34, -34, -34, -34, -34, -34, -34, -34, -34, -34, -34, -34, -34, -34, -34, -34, -34, -34, -34, -34, -34, -34, -34, -34, -34, -34, -34, -34, -34, -34, -34, -34, -34, -34, -34, -34, -34, -34, -34, -34, -34, -34, -34, -34, -34, -34, -34, -34, -34, -34, -34, -34, -34, -34, -34, -34, -34, -34, -34, -34, -34, -34, -34, -34, -34, -34, -34, -34, -34, -34, -34, -34, -34, -34, -34, -34, -34, -34, -34, -34, -34, -34, -34, -34, -34, -34, -34, -34, -34, -34, -34, -34, -34, -34, -34, -34, -34, -34, -34, -34, -34, -34, -34, -34, -34, -34, -34, -34, -34, -34, -34, -34, -34, -34, -34, -34, -34, -34, -34, -34, -34, -34, -34, -34, -34, -34, -34, -34, -34, -34, -34, -34, -34, -34, -34, -34, -34, -34, -34, -34, -34, -34, -34, -34, -34, -34, -34, -34, -34, -34, -34, -34, -34, -34, -34, -34, -34, -34, -34, -34, -34, -34, -34, -34, -34, -34, -34, -34, -34, -34, -34, -34, -34, -34, -34, -34, -34, -34, -34, -34, -34, -34, -34, -34, -34, -34, -34, -34, -34, -34, -34, -34, -34, -34, -34, -34, -34, -34, -34, -34, -34, -34, -34, -34, -34, -34, -34, -34, -34, -34, -34, -34, -34, -34, -34, -34, -34, -34, -34, -34, -34, -34, -34, -34, -34, -34, -34, -34, -34, -34]
-57784c4%%%%%%%%%%%%%%%%%%%%%%%%%%%%%%%%%%%%%%%%%%%%%%%%%%%%%%%%%%%%%%%%%%%%
-57826c4%%%%%%%%%%%%%%%%%%%%%%%%%%%%%%%Jj%%%%%%%%%%%%%%%%Jj%%%%%J%%j%%%%%Jj%
-57868c4%%%Jj%%%J%jJ%jJj%Jj%%J%%%j%%%%%%%J%%%%%%%%%jJ%%%%j%%%%%%J%jJ%%%jJ%%%
-57910c3%jJj%%J%jJ%%j%%%%J%%j%%%%%%J%%%%j%JjJ%%%j%J%%%j%J%%%j%J%%%j%%J%%j%Jj
-57952c4%J%%%%%%%%%%jJ%%%j%%Jj%J%%%%%%%%%jJ%%%%%%%%%%%jJ%%%%%j%J%%%%%%j%J%%%
-57994c3jJ%%%%%%%%%%%%%%%%%%%%%%%jJ%%%%%%jJ%%%%%%%%%%%jJ%%%%%%%%%%%%%%%%%%%%
-58035c3%%%%%%%%%%%%%%%%%%%%%%%%%%%%%%%%%%%%%%%%%%%%%%%%%%%%%%%%%%%%%%%%%%%%
-58077c3%%%%%%%%%%%%%%%%%%%%%%%%%%%%%%%%%%%%%%%%%%%%%%%%%%%%%%%%%%%%%%%%%%%%
$$ y = [-34, -34, -34, -34, -34, -34, -34, -34, -34, -34, -34, -34, -34, -34, -34, -34, -34, -34, -34, -34, -34, -34, -34, -34, -34, -34, -34, -34, -34, -34, -34, -34, -34, -34, -34, -34, -34, -34, -34, -34, -34, -34, -34, -34, -34, -34, -34, -34, -34, -34, -34, -34, -34, -34, -34, -34, -34, -34, -34, -34, -34, -34, -34, -34, -34, -34, -34, -34, -34, -34, -34, -34, -34, -34, -34, -34, -34, -34, -34, -34, -34, -34, -34, -34, -34, -34, -34, -34, -34, -34, -34, -34, -34, -34, -34, -34, -34, -34, -34, -34, -33, -34, -34, -34, -34, -34, -34, -34, -34, -34, -34, -34, -34, -34, -34, -34, -34, -34, -33, -34, -34, -34, -34, -34, -34, -33, -33, -33, -34, -34, -34, -34, -34, -34, -33, -34, -34, -34, -34, -34, -33, -34, -34, -34, -34, -33, -33, -34, -33, -33, -34, -33, -34, -34, -33, -34, -34, -34, -33, -33, -33, -33, -34, -34, -34, -34, -34, -34, -34, -34, -33, -33, -33, -33, -33, -33, -33, -33, -33, -33, -34, -33, -33, -33, -33, -33, -34, -34, -34, -34, -34, -34, -34, -33, -33, -34, -33, -33, -33, -33, -34, -33, -33, -33, -33, -33, -34, -33, -34, -34, -34, -33, -33, -34, -33, -33, -33, -34, -34, -34, -34, -34, -33, -33, -33, -34, -34, -34, -34, -34, -34, -34, -33, -33, -33, -33, -33, -34, -34, -33, -34, -33, -33, -33, -33, -34, -34, -33, -33, -33, -33, -34, -34, -33, -33, -33, -33, -34, -34, -33, -33, -33, -33, -34, -34, -34, -33, -33, -33, -34, -34, -33, -34, -34, -33, -33, -33, -33, -33, -33, -33, -33, -33, -33, -33, -34, -33, -33, -33, -33, -34, -34, -34, -33, -34, -34, -33, -33, -33, -33, -33, -33, -33, -33, -33, -33, -34, -33, -33, -33, -33, -33, -33, -33, -33, -33, -33, -33, -33, -34, -33, -33, -33, -33, -33, -33, -34, -34, -33, -33, -33, -33, -33, -33, -33, -34, -34, -33, -33, -33, -33, -34, -33, -33, -33, -33, -33, -33, -33, -33, -33, -33, -33, -33, -33, -33, -33, -33, -33, -33, -33, -33, -33, -33, -33, -33, -34, -33, -33, -33, -33, -33, -33, -33, -34, -33, -33, -33, -33, -33, -33, -33, -33, -33, -33, -33, -33, -34, -33, -33, -33, -33, -33, -33, -33, -33, -33, -33, -33, -33, -33, -33, -33, -33, -33, -33, -33, -33, -33, -33, -33, -33, -33, -33, -33, -33, -33, -33, -33, -33, -33, -33, -33, -33, -33, -33, -33, -33, -33, -33, -33, -33, -33, -33, -33, -33, -33, -33, -33, -33, -33, -33, -33, -33, -33, -33, -33, -33, -33, -33, -33, -33, -33, -33, -33, -33, -33, -33, -33, -33, -33, -33, -33, -33, -33, -33, -33, -33, -33, -33, -33, -33, -33, -33, -33, -33, -33, -33, -33, -33, -33, -33, -33, -33, -33, -33, -33, -33, -33, -33, -33, -33, -33, -33, -33, -33, -33, -33, -33, -33, -33, -33, -33, -33, -33, -33, -33, -33, -33, -33, -33, -33, -33, -33, -33, -33, -33, -33, -33, -33, -33, -33, -33, -33, -33, -33, -33, -33, -33, -33, -33, -33, -33, -33, -33, -33, -33, -33, -33, -33, -33, -33, -33, -33, -33]
-58119c3%%jJ%%%%%%%%%%%%%%%%%%%%%%%%%%%%%%%%%%%%%%%%%%%%%%%%%%%%%%%%%%%%%%%%
-58161c3%%%%%%%%%%%%%%%%%%%%%%%%%%%%%%%%%%%%%%%%%%%%%%%%%%%%%%%%%%%%%%%%%%%%
-58203c3%%%%%%%%%%%%%%%%%%%%%%%%%%%%%%%%%%%%%%%%%%%%%%%%%%%%%%%%%%%%%%%%%%%%
-58245c3%%%%%%%%%%%%%%%%%%%%%%%%%%%%%%%%%%%%%%%%%%%%%%%%%%%%%%%%%%%%%%%%%%%%
-58286c3%%%%%%%%%%%%%%%%%%%%%%%%%%%%%%%%%%%%%%%%%%%%%%%%%%%%%%%%%%%%%%%%%%%%
-58328c3%%%%%%%%%%%%%%%%%%%%%%%%%%%%%%%%%%%%%%%%%%%%%%%%%%Jj%%%%%%%%%%%%%%%%
-58370c3%%%%%%%%%%%%%%%%%%%%%%%%%%%%%%%%%%%%%%%Jj%%%%%%%Jj%%%%%%%Jj%%%Jj%%%%
-58412c3%%%%%%Jj%%%%%%%%Jj%%Jj%J%%j%Jj%%%%Jj%%%%Jj%J%j%Jj%%Jj%%Jj%%%%%%%%%%%
$$ y = [-33, -33, -33, -34, -33, -33, -33, -33, -33, -33, -33, -33, -33, -33, -33, -33, -33, -33, -33, -33, -33, -33, -33, -33, -33, -33, -33, -33, -33, -33, -33, -33, -33, -33, -33, -33, -33, -33, -33, -33, -33, -33, -33, -33, -33, -33, -33, -33, -33, -33, -33, -33, -33, -33, -33, -33, -33, -33, -33, -33, -33, -33, -33, -33, -33, -33, -33, -33, -33, -33, -33, -33, -33, -33, -33, -33, -33, -33, -33, -33, -33, -33, -33, -33, -33, -33, -33, -33, -33, -33, -33, -33, -33, -33, -33, -33, -33, -33, -33, -33, -33, -33, -33, -33, -33, -33, -33, -33, -33, -33, -33, -33, -33, -33, -33, -33, -33, -33, -33, -33, -33, -33, -33, -33, -33, -33, -33, -33, -33, -33, -33, -33, -33, -33, -33, -33, -33, -33, -33, -33, -33, -33, -33, -33, -33, -33, -33, -33, -33, -33, -33, -33, -33, -33, -33, -33, -33, -33, -33, -33, -33, -33, -33, -33, -33, -33, -33, -33, -33, -33, -33, -33, -33, -33, -33, -33, -33, -33, -33, -33, -33, -33, -33, -33, -33, -33, -33, -33, -33, -33, -33, -33, -33, -33, -33, -33, -33, -33, -33, -33, -33, -33, -33, -33, -33, -33, -33, -33, -33, -33, -33, -33, -33, -33, -33, -33, -33, -33, -33, -33, -33, -33, -33, -33, -33, -33, -33, -33, -33, -33, -33, -33, -33, -33, -33, -33, -33, -33, -33, -33, -33, -33, -33, -33, -33, -33, -33, -33, -33, -33, -33, -33, -33, -33, -33, -33, -33, -33, -33, -33, -33, -33, -33, -33, -33, -33, -33, -33, -33, -33, -33, -33, -33, -33, -33, -33, -33, -33, -33, -33, -33, -33, -33, -33, -33, -33, -33, -33, -33, -33, -33, -33, -33, -33, -33, -33, -33, -33, -33, -33, -33, -33, -33, -33, -33, -33, -33, -33, -33, -33, -33, -33, -33, -33, -33, -33, -33, -33, -33, -33, -33, -33, -33, -33, -33, -33, -33, -33, -33, -33, -33, -33, -33, -33, -33, -33, -33, -33, -33, -33, -33, -33, -33, -33, -33, -33, -33, -33, -33, -33, -33, -33, -33, -33, -33, -33, -33, -33, -33, -33, -33, -33, -33, -33, -33, -33, -33, -33, -33, -33, -33, -33, -33, -33, -33, -33, -33, -33, -33, -33, -33, -33, -33, -33, -33, -33, -33, -33, -33, -33, -33, -32, -33, -33, -33, -33, -33, -33, -33, -33, -33, -33, -33, -33, -33, -33, -33, -33, -33, -33, -33, -33, -33, -33, -33, -33, -33, -33, -33, -33, -33, -33, -33, -33, -33, -33, -33, -33, -33, -33, -33, -33, -33, -33, -33, -33, -33, -33, -33, -33, -33, -33, -33, -33, -33, -33, -33, -33, -32, -33, -33, -33, -33, -33, -33, -33, -33, -32, -33, -33, -33, -33, -33, -33, -33, -33, -32, -33, -33, -33, -33, -32, -33, -33, -33, -33, -33, -33, -33, -33, -33, -33, -33, -32, -33, -33, -33, -33, -33, -33, -33, -33, -33, -32, -33, -33, -33, -32, -33, -33, -32, -32, -32, -33, -33, -32, -33, -33, -33, -33, -33, -32, -33, -33, -33, -33, -33, -32, -33, -33, -32, -32, -33, -33, -32, -33, -33, -33, -32, -33, -33, -33, -32, -33, -33, -33, -33, -33, -33, -33, -33, -33, -33, -33, -33]
-58454c3%%%%%%%%%%%%%%%%%J%%jJj%%Jj%J%j%%%%%Jj%%%%Jj%J%j%%Jj%J%j%%%%J%%%%j%%
-58496c3Jj%%%%J%%%jJ%%%j%%JjJ%%%%j%J%%%%%%%%jJ%%%%%%%%%%%%%%%j%%%J%%%%%%%%%j
-58537c3J%%%%jJ%%%j%J%%jJ%%%%%%jJ%%%%%%%%%%%%%%%%%jJ%%jJ%%jJ%%%%%%%%%%%%%%%%
-58579c2%%%%%%%%%%%%%%%%%%%%%%%%%%%%%%%%%%%%%%%%%%%%%%%%%%%%%%%%%%%%%%%%%%%%
-58621c2%%%%%%%%%%%%%%%%jJ%%%%%%%%%%%%%%%%%%%%%%%%%%%%%%%%%%%%%%%%%%%%%%%%%%
-58663c2%%%%%%%%%%%%%%%%%%%%%%%%%%%%%%%%%%%%%%%%%%%%%%%%%%%%%%%%%%%%%%%%%%%%
-58705c2%%%%%%%%%%%%%%%%%%%%%%%%%%%%%%%%%%%%%%%%%%%%%%%%%%%%%%%%%%%%%%%%%%%%
-58747c2%%%%%%%%%%%%%%%%%%%%%%%%%%%%%%%%%%%%%%%%%%%%%%%%%%%%%%%%%%%%%%%%%%%%
$$ y = [-33, -33, -33, -33, -33, -33, -33, -33, -33, -33, -33, -33, -33, -33, -33, -33, -33, -33, -32, -32, -32, -33, -32, -33, -33, -33, -32, -33, -33, -32, -32, -33, -33, -33, -33, -33, -33, -32, -33, -33, -33, -33, -33, -32, -33, -33, -32, -32, -33, -33, -33, -32, -33, -33, -32, -32, -33, -33, -33, -33, -33, -32, -32, -32, -32, -32, -33, -33, -33, -32, -33, -33, -33, -33, -33, -32, -32, -32, -32, -33, -32, -32, -32, -32, -33, -33, -33, -32, -33, -32, -32, -32, -32, -32, -33, -33, -32, -32, -32, -32, -32, -32, -32, -32, -32, -33, -32, -32, -32, -32, -32, -32, -32, -32, -32, -32, -32, -32, -32, -32, -32, -32, -33, -33, -33, -33, -32, -32, -32, -32, -32, -32, -32, -32, -32, -32, -33, -32, -32, -32, -32, -32, -33, -32, -32, -32, -32, -33, -33, -32, -32, -32, -33, -32, -32, -32, -32, -32, -32, -32, -33, -32, -32, -32, -32, -32, -32, -32, -32, -32, -32, -32, -32, -32, -32, -32, -32, -32, -32, -33, -32, -32, -32, -33, -32, -32, -32, -33, -32, -32, -32, -32, -32, -32, -32, -32, -32, -32, -32, -32, -32, -32, -32, -32, -32, -32, -32, -32, -32, -32, -32, -32, -32, -32, -32, -32, -32, -32, -32, -32, -32, -32, -32, -32, -32, -32, -32, -32, -32, -32, -32, -32, -32, -32, -32, -32, -32, -32, -32, -32, -32, -32, -32, -32, -32, -32, -32, -32, -32, -32, -32, -32, -32, -32, -32, -32, -32, -32, -32, -32, -32, -32, -32, -32, -32, -32, -32, -32, -32, -32, -32, -32, -32, -32, -32, -32, -32, -32, -32, -32, -32, -32, -32, -32, -32, -32, -32, -32, -32, -33, -32, -32, -32, -32, -32, -32, -32, -32, -32, -32, -32, -32, -32, -32, -32, -32, -32, -32, -32, -32, -32, -32, -32, -32, -32, -32, -32, -32, -32, -32, -32, -32, -32, -32, -32, -32, -32, -32, -32, -32, -32, -32, -32, -32, -32, -32, -32, -32, -32, -32, -32, -32, -32, -32, -32, -32, -32, -32, -32, -32, -32, -32, -32, -32, -32, -32, -32, -32, -32, -32, -32, -32, -32, -32, -32, -32, -32, -32, -32, -32, -32, -32, -32, -32, -32, -32, -32, -32, -32, -32, -32, -32, -32, -32, -32, -32, -32, -32, -32, -32, -32, -32, -32, -32, -32, -32, -32, -32, -32, -32, -32, -32, -32, -32, -32, -32, -32, -32, -32, -32, -32, -32, -32, -32, -32, -32, -32, -32, -32, -32, -32, -32, -32, -32, -32, -32, -32, -32, -32, -32, -32, -32, -32, -32, -32, -32, -32, -32, -32, -32, -32, -32, -32, -32, -32, -32, -32, -32, -32, -32, -32, -32, -32, -32, -32, -32, -32, -32, -32, -32, -32, -32, -32, -32, -32, -32, -32, -32, -32, -32, -32, -32, -32, -32, -32, -32, -32, -32, -32, -32, -32, -32, -32, -32, -32, -32, -32, -32, -32, -32, -32, -32, -32, -32, -32, -32, -32, -32, -32, -32, -32, -32, -32, -32, -32, -32, -32, -32, -32, -32, -32, -32, -32, -32, -32, -32, -32, -32, -32, -32, -32, -32, -32, -32, -32, -32, -32, -32, -32, -32, -32, -32, -32, -32, -32, -32, -32, -32, -32, -32, -32, -32, -32, -32, -32]
-58789c2%%%%%%%%%%%%%%%%%%%%%%%%%%%%%%%%%%%%%%%%%%%%%%%%%%%%%%%%%%%%%%%%%%%%
-58830c2%%%%%%%%%%%%%%%%%%%%%%%%%%%%%%%%%%%%%%%%%%%%%%%%%%%%%%%%%%%%%%%%%%%%
-58872c2%%%%%%%%%%%%%%%%%%%%%%%%%%%%%%%%%%%%%%%%%%%%%%%%%%%%%%%%%%%%%%%%%%%%
-58914c2%%%%%%%%%%%%%%Jj%%%%%%%%%%%%%%%%%%%%%%%%%%%%%%%%%%%%%%%%%%%%%%Jj%%%%
-58956c2%%Jj%%%%%%%%%%%%%%Jj%%%%%%%%%%%%%%%Jj%%%%%%Jj%%%%%%%JjJ%j%%%%%%%%%%J
-58998c1%j%%%%%%%%%J%j%J%j%%Jj%%%Jj%%%J%%j%Jj%%%J%j%%%%J%j%%%%%%%%%%%%J%jJjJ
-59040c1j%%J%j%%%Jj%%J%jJ%%%%%%j%J%jJ%jJ%%%%%jJ%%j%%J%%%%%%%%%%%%%%%%%%%%%%%
-59081c1%%%%%jJ%%%%jJ%%%%j%%J%%%%%%%%%%%%%%%%%%%%%%%%%%%%%%%%%%jJ%%%%%%%%%%%
$$ y = [-32, -32, -32, -32, -32, -32, -32, -32, -32, -32, -32, -32, -32, -32, -32, -32, -32, -32, -32, -32, -32, -32, -32, -32, -32, -32, -32, -32, -32, -32, -32, -32, -32, -32, -32, -32, -32, -32, -32, -32, -32, -32, -32, -32, -32, -32, -32, -32, -32, -32, -32, -32, -32, -32, -32, -32, -32, -32, -32, -32, -32, -32, -32, -32, -32, -32, -32, -32, -32, -32, -32, -32, -32, -32, -32, -32, -32, -32, -32, -32, -32, -32, -32, -32, -32, -32, -32, -32, -32, -32, -32, -32, -32, -32, -32, -32, -32, -32, -32, -32, -32, -32, -32, -32, -32, -32, -32, -32, -32, -32, -32, -32, -32, -32, -32, -32, -32, -32, -32, -32, -32, -32, -32, -32, -32, -32, -32, -32, -32, -32, -32, -32, -32, -32, -32, -32, -32, -32, -32, -32, -32, -32, -32, -32, -32, -32, -32, -32, -32, -32, -32, -32, -32, -32, -32, -32, -32, -32, -32, -32, -32, -32, -32, -32, -32, -32, -32, -32, -32, -32, -32, -32, -32, -32, -32, -32, -32, -32, -32, -32, -32, -32, -32, -32, -32, -32, -32, -32, -32, -32, -32, -32, -32, -32, -32, -32, -32, -32, -32, -32, -32, -32, -32, -32, -32, -32, -32, -32, -32, -32, -32, -32, -32, -32, -32, -32, -32, -32, -32, -31, -32, -32, -32, -32, -32, -32, -32, -32, -32, -32, -32, -32, -32, -32, -32, -32, -32, -32, -32, -32, -32, -32, -32, -32, -32, -32, -32, -32, -32, -32, -32, -32, -32, -32, -32, -32, -32, -32, -32, -32, -32, -32, -32, -32, -32, -32, -32, -31, -32, -32, -32, -32, -32, -32, -32, -31, -32, -32, -32, -32, -32, -32, -32, -32, -32, -32, -32, -32, -32, -32, -32, -31, -32, -32, -32, -32, -32, -32, -32, -32, -32, -32, -32, -32, -32, -32, -32, -32, -31, -32, -32, -32, -32, -32, -32, -32, -31, -32, -32, -32, -32, -32, -32, -32, -32, -31, -32, -31, -31, -32, -32, -32, -32, -32, -32, -32, -32, -32, -32, -32, -31, -31, -32, -32, -32, -32, -32, -32, -32, -32, -32, -32, -31, -31, -32, -32, -31, -31, -32, -32, -32, -31, -32, -32, -32, -32, -31, -32, -32, -32, -32, -31, -31, -31, -32, -32, -31, -32, -32, -32, -32, -31, -31, -32, -32, -32, -32, -32, -31, -31, -32, -32, -32, -32, -32, -32, -32, -32, -32, -32, -32, -32, -32, -31, -31, -32, -31, -32, -31, -32, -32, -32, -31, -31, -32, -32, -32, -32, -31, -32, -32, -32, -31, -31, -32, -31, -31, -31, -31, -31, -31, -31, -32, -32, -31, -31, -32, -31, -31, -32, -31, -31, -31, -31, -31, -31, -32, -31, -31, -31, -32, -32, -32, -31, -31, -31, -31, -31, -31, -31, -31, -31, -31, -31, -31, -31, -31, -31, -31, -31, -31, -31, -31, -31, -31, -31, -31, -31, -31, -31, -31, -31, -32, -31, -31, -31, -31, -31, -32, -31, -31, -31, -31, -31, -32, -32, -32, -31, -31, -31, -31, -31, -31, -31, -31, -31, -31, -31, -31, -31, -31, -31, -31, -31, -31, -31, -31, -31, -31, -31, -31, -31, -31, -31, -31, -31, -31, -31, -31, -31, -31, -31, -32, -31, -31, -31, -31, -31, -31, -31, -31, -31, -31, -31, -31]
-59123c1%%%%%%%%%%%%jJ%%%%%%%%%%%%%%%%%%%%%%%%%%%%%%%%%%%%%%%%%%%%%%%%%%%%%%
$$ y = [-31, -31, -31, -31, -31, -31, -31, -31, -31, -31, -31, -31, -31, -32, -31, -31, -31, -31, -31, -31, -31, -31, -31, -31, -31, -31, -31, -31, -31, -31, -31, -31, -31, -31, -31, -31, -31, -31, -31, -31, -31, -31, -31, -31, -31, -31, -31, -31, -31, -31, -31, -31, -31, -31, -31, -31, -31, -31, -31, -31, -31, -31, -31, -31, -31, -31, -31, -31, -31]
$$ [...]
-118458@
##END=		$$ NMR SPECTRUM
##END=		$$ LINK
