##TITLE=	FJ07QmtpSD+ygfejAd4DkQ.11.fid
##JCAMP-DX=	6.0	$$ MestReNova 14.3.3-33362
##DATA TYPE=	LINK
##BLOCKS=	1    
##ORIGIN=	Mestrelab Research S.L.
##OWNER=	hrzepa
##$MNOVA/METADATA=	(DOCUMENT,BASE64)
eyJuYW1lIjoiL1VzZXJzL2hyemVwYS9Eb3dubG9hZHMvSVVQQUMtRkFJUlNwZWMtbWFpbi8zOC1Db21
wbGV4ZXMvMzhoLzM4aC1CLzM4aC1CLm1ub3ZhIiwicGFnZXMiOlt7Iml0ZW1zIjpbIjEiICAgICBdfV
19
##TITLE=	FJ07QmtpSD+ygfejAd4DkQ.11.fid
##JCAMP-DX=	6.0	$$ MestReNova 14.3.3-33362
##DATA TYPE=	NMR SPECTRUM
##DATA CLASS=	XYDATA
##BLOCK_ID=	1
##ORIGIN=	Bruker BioSpin GmbH
##OWNER=	nmrsu
##NUMDIM=	1
##$MNOVA/METADATA=	(ITEM,BASE64)
eyJhbmdsZSI6MCwiYXhlcyI6eyJ4Ijp7Im1heCI6MjAxLjg3NTkwMDAwMTQ3MzE4LCJtaW4iOi0yMDI
uNzAwNDg4MjA4Mjc5Mn0sInkiOnsibWF4Ijo0MzUyMy4wMjUzOTA2MjUsIm1pbiI6LTM5NTguNzA5MT
UwMzE0MzMxfX0sInBvaW50cyI6W3sieCI6NTMyMSwieSI6NTgzNX0seyJ4Ijo4NzIyLCJ5Ijo1ODM1f
Sx7IngiOjg3MjIsInkiOjgyMDh9LHsieCI6NTMyMSwieSI6ODIwOH0seyJ4Ijo1MzIxLCJ5Ijo1ODM1
fV0sInoiOjB9
##.OBSERVE FREQUENCY=	224.7001119089999861
##.OBSERVE NUCLEUS=	^11B
##.SOLVENT NAME=	None
##.PULSE SEQUENCE=	zgbs
##LONGDATE=	2025/01/08 23:16:39.000
##.ACQUISITIONMODE=	SIMULTANEOUS (DQD)
##$ORIGINAL FORMAT=	Bruker XWIN-NMR
##$MNOVA/SCALES_VERSION=	9
##$PARAMETER FILE=	(acqus, ASCII, /private/var/folders/f6/rjf_tdyn2v98c5c0wvkgn4s80000gq/T/FJ07QmtpSD+ygfejAd4DkQ/11/acqus, 0)
$$ ##TITLE= Parameter file, TopSpin 4.1.3
$$ ##JCAMPDX= 5.0
$$ ##DATATYPE= Parameter Values
$$ ##NPOINTS= 1	$$ modification sequence number
$$ ##ORIGIN= Bruker BioSpin GmbH
$$ ##OWNER= nmrsu
$$ $$ 2025-01-08 23:14:58.820 +0000  nmrsu@CZC7167VR1
$$ $$ Z:/700/data/tds/nmr/RP613 A/11/acqus
$$ $$ process C:\Bruker\TopSpin4.1.3\prog\mod\dirdata.exe
$$ ##$ACQT0= 0
$$ ##$AMP= (0..31)
$$ 100 100 100 100 100 100 100 100 100 100 100 100 100 100 100 100 100 100
$$ 100 100 100 100 100 100 100 100 100 100 100 100 100 100
$$ ##$AMPCOIL= (0..32)
$$ -1 0 0 0 0 0 0 0 0 0 0 0 0 0 0 0 0 0 0 0 0 0 0 0 0 0 0 0 0 0 0 0 0
$$ ##$AQSEQ= 0
$$ ##$AQ_mod= 3
$$ ##$AUNM= <au_zg>
$$ ##$AUTOPOS= <30 >
$$ ##$BF1= 224.700111909
$$ ##$BF2= 224.700111909
$$ ##$BF3= 224.700111909
$$ ##$BF4= 224.700111909
$$ ##$BF5= 224.700111909
$$ ##$BF6= 224.700111909
$$ ##$BF7= 224.700111909
$$ ##$BF8= 224.700111909
$$ ##$BWFAC= (0..63)
$$ 0 0 0 0 0 0 0 0 0 0 0 0 0 0 0 0 0 0 0 0 0 0 0 0 0 0 0 0 0 0 0 0 0 0 0 0
$$ 0 0 0 0 0 0 0 0 0 0 0 0 0 0 0 0 0 0 0 0 0 0 0 0 0 0 0 0
$$ ##$BYTORDA= 0
$$ ##$CHANFCU= (0..24)
$$ 0 0 0 1 0 0 0 0 0 0 0 0 0 0 0 0 0 0 0 0 0 0 0 0 0
$$ ##$CHANREC= (0..24)
$$ 0 0 0 0 0 0 0 0 0 0 0 0 0 0 0 0 0 0 0 0 0 0 0 0 0
$$ ##$CHEMSTR= <none>
$$ ##$CNST= (0..63)
$$ 1 1 1 1 1 1 1 1 1 1 1 1 1 1 1 1 1 1 1 1 1 1 1 1 1 1 1 1 1 1 1 1 1 1 1 1
$$ 1 1 1 1 1 1 1 1 1 1 1 1 1 1 1 1 1 1 1 1 1 1 1 1 1 1 1 1
$$ ##$CPDPRG= (0..8)
$$ <> <> <> <> <> <> <> <> <>
$$ ##$D= (0..63)
$$ 0 0.4 0 0 0 0 0 0 0 0 0 0 0 0 0 0 0.0002 0 0 0 0 0 0 0 0 0 0 0 0 0 0 0
$$ 0 0 0 0 0 0 0 0 0 0 0 0 0 0 0 0 0 0 0 0 0 0 0 0 0 0 0 0 0 0 0 0
$$ ##$DATE= 1736378199
$$ ##$DATE_START= 1736377933
$$ ##$DE= 18
$$ ##$DECBNUC= <off>
$$ [...]
$$ ##$ShimPowRng3= (0..63)
$$ 1 1 1 1 1 1 1 1 1 1 1 1 1 1 1 1 1 1 1 1 1 1 1 1 1 1 1 1 1 1 1 1 1 1 1 1
$$ 1 1 1 1 0 0 0 0 0 0 0 0 0 0 0 0 0 0 0 0 0 0 0 0 0 0 0 0
$$ ##$ShimPowType1= 8
$$ ##$ShimPowType2= 8
$$ ##$ShimPowType3= 0
$$ ##$ShimPowType4= 0
$$ ##$ShimPowType5= 0
$$ ##$ShimPowType6= 0
$$ ##$ShimPowType7= 0
$$ ##$ShimPowType8= 0
$$ ##$ShimSysActGrad= (0..63)
$$ 1 2 3 4 13 5 7 11 10 9 6 8 12 18 19 20 21 15 22 23 24 14 25 16 26 17 27
$$ 28 31 32 33 34 35 36 37 38 0 0 0 0 0 0 0 0 0 0 0 0 0 0 0 0 0 0 0 0 0 0
$$ 0 0 0 0 0 0
$$ ##$ShimSysAngle= <>
$$ ##$ShimSysFunc= (0..63)
$$ 1 2 3 4 5 6 7 8 9 10 0 37 38 35 16 15 14 13 12 11 28 27 26 25 24 23 36
$$ 22 30 29 20 21 34 33 32 31 17 18 19 0 0 0 0 0 0 0 0 0 0 0 0 0 0 0 0 0 0
$$ 0 0 0 0 0 0 0
$$ ##$ShimSysMatId= <292722da.dat>
$$ ##$ShimSysMatrix= 1
$$ ##$ShimSysMinMaxUG= 130000
$$ ##$ShimSysOffset= <29 mm>
$$ ##$ShimSysType= 4
$$ ##$ShimUnit= 3
$$ ##$SpectrOsVersion= <4.1.156.20210628>
$$ ##$TCubeEth= <192.168.180.38>
$$ ##$TCubeSeqDevice= <>
$$ ##$TOSITY= <no>
$$ ##$TRIPLO2= 0
$$ ##$TopSpinVersion= <TopSpin 4.1.3>
$$ ##$TrxFreqFormula= (0..23)
$$ <TrxFreqFormula(2.0,700350000.000000,'TRX',Trx(1.0,'TRX 1200.1',1,5.000000,1290.000000))>
$$ <TrxFreqFormula(2.0,700350000.000000,'TRX',Trx(1.0,'TRX 1200.2',1,5.000000,1290.000000))>
$$ <TrxFreqFormula(2.0,700350000.000000,'TRX',Trx(1.0,'TRX 1200.3',1,5.000000,1290.000000))>
$$ <> <> <> <> <> <> <> <> <> <> <> <> <> <> <> <> <> <> <> <> <>
$$ ##$TrxPN= (0..23)
$$ <Z148391> <Z148391> <Z148391> <> <> <> <> <> <> <> <> <> <> <> <> <> <>
$$ <> <> <> <> <> <> <>
$$ ##$TrxSN= (0..23)
$$ <00336> <00337> <00342> <> <> <> <> <> <> <> <> <> <> <> <> <> <> <> <>
$$ <> <> <> <> <>
$$ ##$VCubeEth= (0..23)
$$ <no> <no> <no> <no> <no> <no> <no> <no> <no> <no> <no> <no> <no> <no> <no>
$$ <no> <no> <no> <no> <no> <no> <no> <no> <no>
$$ ##$VTU= 2
$$ ##$VTUETH= <192.168.99.11>
$$ ##$VTUTY= <no>
$$ ##$ValueLine= no
$$ ##$VpuPN= (0..23)
$$ <no> <no> <no> <no> <no> <no> <no> <no> <no> <no> <no> <no> <no> <no> <no>
$$ <no> <no> <no> <no> <no> <no> <no> <no> <no>
$$ ##$VpuSN= (0..23)
$$ <no> <no> <no> <no> <no> <no> <no> <no> <no> <no> <no> <no> <no> <no> <no>
$$ <no> <no> <no> <no> <no> <no> <no> <no> <no>
$$ ##$WBREFAM= (0..31)
$$ 99.8 100 100 100 100 100 100 100 100 100 100 100 100 100 100 100 100 100
$$ 100 100 100 100 100 100 100 100 100 100 100 100 100 100
$$ ##$WBREFLM= (0..31)
$$ 1 0 1 0 0 0 0 0 0 0 0 0 0 0 0 0 0 0 0 0 0 0 0 0 0 0 0 0 0 0 0 0
$$ ##$WBREFPH= (0..31)
$$ 0.05 0 0 0 0 0 0 0 0 0 0 0 0 0 0 0 0 0 0 0 0 0 0 0 0 0 0 0 0 0 0 0
$$ ##$WBSGU= (0..31)
$$ 1 2 4 0 0 0 0 0 0 0 0 0 0 0 0 0 0 0 0 0 0 0 0 0 0 0 0 0 0 0 0 0
$$ ##END=
$$ 
##$DECIM=	220
##$DSPFVS=	20
##XUNITS=	HZ
##YUNITS=	ARBITRARY UNITS
##FIRSTX=	45361.556094371895597
##LASTX=	-45546.841233397979522
##DELTAX=	-0.69358132102272718189
##XFACTOR=	1
##YFACTOR=	1.2075055982390821008
##FIRSTY=	1.3209924697875976563
##MINY=	-2.0973060131072998047
##MAXY=	39566.3359375
##NPOINTS=	131072
##XYDATA=	(X++(Y..Y))
$$ [...]
17314 41 41 41 41 41 41 41 41 41 41 41 41 41 41 41 41 41 41 41 41 41 40 40 40 40 40 40 40 40 40 40 40 40 40 40 40 41 41 41 42 41 41 41 40 40 40 40 40 40 40 40 40 41 41 40 40 40 40 40 40 40 40 40 40 40 40 40 41 41 41
17266 41 41 41 42 42 42 42 42 42 41 41 40 40 40 40 40 40 40 40 40 40 40 40 40 40 41 41 41 41 41 41 41 42 42 42 42 42 42 42 42 41 41 41 41 41 41 41 41 41 41 40 40 40 40 40 40 40 40 40 40 40 40 40 40 40 40 40 41 40 40
17218 40 40 40 40 40 40 40 40 40 40 40 39 39 39 39 39 39 39 39 40 40 40 40 41 41 40 40 40 40 40 41 41 41 41 41 41 41 41 41 41 41 41 41 40 40 40 40 40 40 39 39 39 39 39 39 39 39 39 39 39 39 40 40 40 40 40 40 40 40 40
17170 40 40 40 40 40 39 39 39 38 38 38 39 39 39 39 39 39 40 40 40 40 39 39 39 39 39 39 39 39 39 39 39 39 39 39 39 39 39 39 39 39 40 40 40 40 40 40 39 39 39 39 39 39 39 39 40 40 40 40 40 40 40 40 40 40 40 40 40 40 40
17122 40 40 40 40 40 40 40 40 40 40 40 40 40 40 40 40 40 40 40 39 39 39 39 39 39 39 39 39 39 39 39 39 40 40 40 40 40 40 40 40 40 40 40 40 39 39 39 39 39 39 39 39 40 40 40 40 40 40 40 40 40 40 40 39 39 39 39 39 40 40
17075 40 40 40 40 40 40 40 40 40 40 40 40 40 39 39 39 39 39 39 39 39 39 39 39 39 39 39 39 39 39 40 40 40 40 40 40 40 40 39 39 39 39 39 39 39 39 40 40 40 41 41 41 41 41 41 40 40 40 40 40 40 40 40 40 40 40 40 41 41 41
17027 41 41 41 40 40 40 40 40 40 40 40 40 39 39 39 38 38 38 38 38 38 38 38 39 39 39 40 40 40 40 41 41 41 40 40 40 40 40 40 41 41 41 41 42 42 42 42 41 41 41 41 41 40 40 40 40 40 41 41 41 41 41 41 42 42 42 42 42 42 42
16979 42 41 41 41 41 41 41 41 41 41 41 41 41 41 40 40 40 40 39 39 39 39 39 39 39 39 39 40 40 40 40 40 40 40 40 40 40 41 41 41 41 41 41 41 41 40 40 40 40 40 40 40 40 40 40 40 40 40 40 40 40 40 40 41 41 41 41 41 41 41
16931 41 41 41 42 42 42 42 41 41 41 41 41 41 41 41 41 41 41 41 41 41 40 40 40 40 40 40 40 40 40 40 40 40 40 40 40 40 40 39 39 40 40 40 40 40 40 39 39 39 39 39 39 39 40 40 40 39 39 39 39 39 39 39 39 40 40 40 40 40 39
16883 39 39 39 39 39 39 39 39 39 39 39 39 39 39 39 39 39 39 39 39 39 39 39 38 38 39 39 40 40 40 40 40 40 40 40 39 39 39 39 39 40 40 40 40 40 40 39 39 39 39 39 39 39 39 39 40 40 40 40 40 40 40 40 40 40 40 40 40 40 40
16835 40 40 40 40 40 40 40 40 40 40 41 41 41 41 41 41 41 41 41 41 41 41 40 40 40 40 40 41 40 40 40 40 39 39 39 39 39 40 40 40 40 40 40 41 40 40 40 40 40 40 39 39 39 39 39 39 39 39 39 39 39 39 39 39 39 39 39 39 39 39
16787 39 40 40 40 40 40 40 40 40 40 40 40 40 40 40 40 40 41 41 41 41 41 41 41 41 41 40 40 40 40 40 40 40 40 41 41 41 41 41 41 41 40 40 40 40 40 40 40 40 40 40 40 40 41 41 41 41 41 41 40 40 40 40 40 40 40 40 40 41 41
16740 41 41 41 41 40 40 40 40 40 40 40 40 40 40 40 40 39 39 39 39 40 40 40 40 40 40 40 40 40 40 40 40 40 41 41 41 41 41 41 41 41 41 40 40 39 39 39 39 38 38 38 38 38 38 39 39 39 39 39 39 39 39 39 39 39 39 39 39 39 39
16692 39 39 39 40 39 39 39 39 39 39 38 38 38 38 39 39 39 39 39 39 39 39 39 39 39 39 39 40 40 39 39 39 38 38 39 39 39 39 39 39 39 40 39 39 39 40 40 40 40 40 40 40 40 40 40 39 39 39 39 39 39 39 39 39 39 39 38 38 38 38
16644 38 38 38 38 38 39 39 40 40 40 41 41 41 41 40 40 40 40 40 40 39 39 39 40 40 40 41 41 41 41 41 41 41 41 41 41 41 41 41 41 41 41 41 41 41 41 41 41 41 41 41 41 41 41 42 42 42 42 42 42 41 41 41 41 40 40 40 40 40 40
16596 40 40 40 40 40 40 39 40 40 40 41 41 41 41 41 41 41 40 40 40 40 39 39 39 39 39 39 39 39 39 39 39 39 39 39 39 39 39 39 40 40 40 40 40 40 40 40 40 40 40 40 40 40 40 41 41 41 41 41 40 40 40 40 40 40 40 40 40 40 41
16548 41 41 41 40 40 40 39 39 40 40 40 40 40 41 41 41 41 41 41 41 41 41 42 42 42 42 42 42 42 42 42 42 42 42 42 42 42 42 42 42 42 42 42 42 42 42 42 42 42 42 42 41 41 41 40 40 40 40 41 41 41 41 41 41 40 40 40 40 40 39
16500 39 39 40 40 40 40 40 39 39 39 40 40 40 40 40 40 41 40 40 40 40 40 40 40 40 40 40 40 40 41 41 41 41 41 41 41 41 41 41 41 41 41 41 41 41 41 40 40 40 40 40 41 41 41 41 41 41 41 41 40 40 40 40 40 40 40 40 40 40 40
16452 40 40 40 41 41 41 41 41 41 41 41 41 41 41 41 41 41 41 41 40 40 40 39 39 39 38 38 39 39 39 39 39 39 39 39 40 40 40 41 41 40 40 39 39 39 39 39 39 39 39 39 39 40 40 40 41 41 41 41 41 41 41 41 41 41 40 40 40 40 40
16405 40 40 40 40 40 40 41 41 41 41 41 41 41 41 41 40 40 40 40 40 40 40 40 40 40 40 40 40 40 40 41 40 40 40 40 40 40 40 40 40 40 40 40 40 40 39 39 39 39 39 39 39 39 40 40 40 40 40 40 40 40 40 40 40 40 40 39 39 39 38
16357 38 38 38 38 38 38 39 39 40 40 40 40 40 40 40 40 40 40 40 40 40 40 40 40 40 39 39 40 40 40 40 40 40 40 39 39 39 39 40 40 40 40 40 40 40 40 41 41 41 41 41 40 40 40 40 40 39 39 39 39 39 39 40 40 40 40 40 40 41 41
16309 41 41 41 41 41 41 40 40 40 40 40 40 41 40 40 40 40 40 40 40 40 39 39 39 39 39 40 40 41 41 41 41 41 41 41 41 41 40 40 40 40 40 40 40 40 40 40 39 39 39 39 39 39 40 40 40 40 40 41 41 41 41 41 41 41 40 40 40 40 40
16261 40 40 41 41 41 41 41 41 41 40 40 40 40 40 40 40 40 40 40 41 41 41 41 41 41 40 40 40 40 39 39 39 39 39 39 39 39 39 39 40 40 40 40 40 40 40 40 40 40 39 39 39 39 39 40 40 40 40 40 40 40 40 40 40 40 41 41 41 41 41
16213 41 41 41 41 41 41 41 41 41 41 40 40 40 39 39 39 39 39 39 39 39 39 39 39 39 39 39 39 39 39 39 39 39 40 40 40 40 40 40 41 41 41 41 41 41 42 42 42 42 42 42 42 42 42 41 41 41 41 41 41 41 41 40 40 39 39 38 38 38 38
16165 38 39 39 39 39 39 39 39 39 39 39 39 39 39 40 40 40 40 40 40 40 40 40 40 39 39 39 39 39 39 39 39 39 39 39 39 39 39 39 39 39 39 39 40 40 39 39 39 39 40 40 40 40 41 41 41 41 42 42 42 42 42 42 41 41 40 40 40 40 39
16117 39 39 39 39 40 40 40 40 40 40 40 41 41 40 40 41 41 41 41 40 40 40 39 39 39 39 39 39 39 39 39 39 39 40 40 40 41 41 41 41 41 41 42 42 42 42 42 42 41 41 41 41 41 41 41 40 40 40 40 39 39 38 38 38 38 38 38 38 38 38
16070 38 38 38 38 38 38 39 39 39 39 39 38 38 38 38 38 39 39 39 39 39 39 39 39 40 40 40 40 40 40 40 40 40 40 39 39 39 39 40 40 40 40 40 40 39 39 39 39 38 38 39 39 39 39 39 39 40 40 40 41 41 40 40 40 40 40 40 40 40 40
16022 40 40 40 40 40 40 40 40 40 40 40 40 40 40 40 40 40 40 40 40 40 40 41 41 41 41 41 41 41 40 40 40 40 40 40 39 40 39 40 40 40 41 41 42 42 42 42 42 42 42 42 42 42 41 41 41 41 41 41 41 41 41 41 41 42 42 42 41 41 41
15974 41 41 41 41 41 41 40 40 40 40 40 40 40 40 40 40 40 40 40 40 40 40 40 40 40 40 40 40 40 41 41 41 41 42 42 42 42 43 42 42 42 42 41 41 41 41 41 41 41 41 42 42 42 42 42 42 42 42 41 41 41 40 40 40 40 40 39 39 39 39
15926 39 39 39 39 40 39 39 39 39 39 39 39 39 39 39 39 39 39 39 39 39 39 39 39 39 40 40 40 40 40 39 39 39 39 40 40 40 40 40 40 40 40 40 40 40 41 41 41 41 41 41 41 41 42 42 42 42 42 42 42 42 42 41 41 41 40 40 40 39 39
15878 39 39 39 39 39 39 39 39 39 39 39 39 39 39 38 38 39 39 40 40 40 40 40 40 40 40 40 40 40 40 40 40 40 40 40 41 40 40 40 40 40 40 40 40 40 40 40 40 40 40 40 40 40 40 41 41 40 40 40 40 40 40 40 39 39 40 40 40 40 40
15830 40 40 40 40 40 40 41 41 41 41 41 41 42 42 42 42 42 42 41 41 41 40 40 40 40 40 40 41 41 41 41 41 41 41 41 42 42 42 41 41 41 40 40 40 40 40 41 41 40 40 39 39 39 39 39 39 39 40 40 40 41 41 41 41 41 41 41 41 41 41
15782 41 41 40 40 40 40 40 40 40 40 40 40 40 41 41 41 41 41 41 41 41 41 41 41 41 41 41 41 40 40 40 40 40 40 40 40 40 40 40 40 39 39 39 40 40 40 40 40 40 39 39 39 39 39 39 39 38 38 38 39 39 39 39 40 40 40 40 40 40 40
15735 40 40 40 40 40 40 40 40 40 40 40 40 39 39 39 39 39 39 39 40 40 41 41 41 41 40 40 40 39 39 39 39 39 40 40 40 40 40 41 41 41 41 41 41 41 41 41 41 41 40 40 39 39 39 39 39 39 39 40 40 40 40 40 40 40 40 40 40 40 40
15687 40 40 40 40 39 39 39 39 39 38 39 39 39 39 40 40 40 39 39 39 39 40 40 40 41 41 41 42 42 41 41 41 41 41 41 41 41 41 41 41 41 41 41 41 42 42 42 42 42 42 42 41 41 41 41 41 41 41 41 40 40 40 40 40 40 40 40 40 40 40
15639 40 40 40 40 40 40 40 40 39 39 39 39 39 39 39 39 39 38 38 38 38 38 38 38 39 39 39 39 39 40 40 40 40 40 40 40 40 40 40 40 40 40 40 40 40 40 40 40 39 39 39 39 39 39 39 39 40 40 40 40 40 40 40 40 40 39 39 39 40 40
15591 40 40 40 41 41 40 40 40 39 39 39 39 39 39 40 40 40 40 40 40 40 40 40 40 40 40 40 40 41 41 41 41 41 41 41 41 41 41 40 40 39 39 40 40 40 41 41 41 41 41 41 41 41 41 41 41 41 41 41 41 41 41 41 41 41 41 41 41 41 41
15543 41 41 41 41 41 41 41 41 41 41 40 40 40 40 39 39 39 38 38 38 38 39 39 39 39 39 39 39 39 39 39 39 39 39 39 39 39 39 39 39 39 39 39 40 40 40 40 40 40 40 40 40 40 40 39 39 39 39 39 39 39 39 39 40 40 40 41 41 41 41
15495 41 41 41 40 40 41 41 41 41 41 41 40 40 40 40 40 40 40 40 40 40 40 40 41 41 41 41 42 42 42 42 42 42 42 42 42 41 41 41 42 42 42 42 42 42 43 43 43 43 42 42 42 42 42 42 42 41 41 41 41 41 41 41 41 41 41 40 40 40 40
15447 40 39 39 39 39 39 40 40 40 40 40 40 40 41 41 41 40 40 40 39 39 39 39 39 39 38 38 39 39 39 40 40 40 41 41 40 40 40 40 40 40 40 40 41 41 41 40 40 41 41 41 41 41 42 42 42 42 41 41 41 41 41 41 41 41 41 41 41 41 41
15400 41 41 41 41 41 41 41 41 41 41 41 41 41 41 42 42 42 42 42 42 42 42 42 42 42 42 42 41 41 41 41 41 40 40 40 40 40 40 40 39 39 39 40 40 40 41 41 41 41 41 41 41 41 41 41 41 42 42 42 41 41 41 41 41 41 41 41 41 41 41
15352 41 42 42 42 42 42 42 42 42 41 41 41 41 42 42 42 42 41 41 41 40 40 41 41 41 41 41 41 41 41 41 41 41 41 40 40 40 40 40 40 40 40 40 40 40 40 40 40 40 40 40 40 40 40 40 40 40 39 39 39 39 39 40 40 40 40 39 39 39 39
15304 39 39 39 39 39 39 39 39 39 39 39 39 40 40 40 41 41 41 41 41 41 41 41 41 41 41 41 41 41 41 41 41 41 41 40 40 40 40 40 39 39 39 39 39 39 39 39 40 40 41 41 41 41 41 40 40 40 40 40 40 40 40 40 40 40 40 40 40 40 40
15256 40 40 40 40 39 39 39 39 39 40 40 40 40 40 40 40 40 40 40 40 40 40 40 40 40 40 40 40 40 40 40 40 41 40 40 40 40 40 40 40 40 40 40 40 40 40 41 41 41 41 40 40 40 40 40 40 40 40 41 41 40 40 40 40 40 41 41 41 41 41
15208 41 41 41 41 41 41 41 41 41 41 40 40 40 40 40 40 40 40 40 40 40 40 40 40 40 40 40 39 39 39 39 39 39 39 39 39 39 39 39 39 39 39 39 39 39 39 39 39 39 39 39 39 39 39 39 39 39 39 39 40 40 40 40 40 40 40 40 40 40 40
15160 40 40 40 40 40 41 41 41 41 41 41 41 41 41 41 41 41 41 41 42 42 42 41 41 41 41 40 40 40 40 40 40 41 41 41 41 41 41 41 41 40 40 40 40 40 40 40 40 40 40 40 40 40 40 40 40 40 39 39 39 39 39 39 39 39 39 39 39 39 39
15112 39 39 39 39 39 39 40 40 40 40 40 41 41 41 41 41 41 40 40 40 40 41 41 41 41 41 41 41 41 41 41 41 41 41 41 41 41 41 41 41 41 41 41 41 41 41 41 41 41 41 41 41 41 41 41 41 40 40 40 40 40 40 40 40 40 40 40 40 41 41
15065 41 41 41 41 41 41 41 41 41 41 41 42 42 42 43 42 42 42 42 42 42 42 42 42 42 42 42 42 42 42 42 42 41 41 41 41 41 41 41 40 40 40 40 40 40 40 40 40 40 40 39 40 40 40 40 40 41 41 41 41 41 42 42 42 42 42 42 42 41 41
15017 41 40 40 39 39 39 39 40 40 40 40 41 41 41 41 41 41 41 41 41 41 41 40 40 39 39 39 39 39 39 40 40 40 41 41 41 40 40 40 39 39 39 39 40 40 40 40 40 40 40 40 40 40 40 40 40 40 40 40 40 40 40 40 41 41 41 41 41 41 42
14969 42 42 41 41 41 40 40 40 39 39 39 39 39 40 40 39 39 39 39 39 39 39 39 39 39 39 39 39 39 39 38 38 38 38 38 38 38 38 38 38 38 38 38 38 38 38 38 39 39 39 39 39 39 39 39 40 40 40 40 40 40 41 41 41 41 41 41 40 40 40
14921 40 39 39 39 39 39 39 39 39 39 39 40 40 40 40 40 40 40 40 40 41 41 41 41 41 41 41 41 41 40 40 40 40 40 39 39 39 39 39 39 39 39 39 39 39 39 39 39 39 40 40 40 40 40 41 41 42 42 42 42 41 41 41 41 41 41 41 41 41 41
14873 41 42 42 42 41 41 41 41 41 41 41 41 40 40 40 40 40 40 41 41 41 41 41 41 41 41 41 41 41 41 41 41 40 40 40 40 40 40 40 40 40 40 40 40 40 39 39 39 39 39 40 40 40 40 40 40 40 40 40 40 40 40 39 39 39 39 40 40 40 40
14825 40 40 40 40 39 39 39 39 39 39 39 40 40 41 41 42 42 42 42 41 41 41 41 41 41 41 41 40 40 40 40 40 39 39 39 39 39 39 39 39 39 39 38 38 38 37 37 38 38 38 38 38 39 39 39 39 39 39 39 39 39 39 39 39 39 39 39 39 39 39
14777 39 40 40 40 41 41 41 41 41 41 41 41 41 41 41 41 41 41 41 40 40 40 40 40 40 40 40 40 40 40 40 40 40 40 40 40 40 39 39 39 39 39 39 39 39 40 40 40 40 40 40 40 40 40 40 40 40 40 40 41 41 41 40 40 40 40 40 40 40 40
14730 40 40 40 39 40 40 40 40 40 41 41 41 41 41 41 41 42 42 42 42 42 42 42 42 42 41 41 41 41 41 41 40 40 40 40 40 40 40 40 40 40 41 41 40 40 39 39 39 39 39 39 39 39 39 39 39 39 39 39 39 39 39 39 40 39 39 39 39 39 39
14682 39 40 40 40 40 40 40 40 40 40 40 40 40 40 40 40 40 40 40 40 40 40 39 40 40 40 40 40 40 41 41 41 41 41 41 41 40 40 40 40 40 40 40 40 40 40 40 40 40 40 40 40 40 40 40 40 41 41 41 41 41 42 42 41 41 41 41 41 41 41
14634 41 41 41 41 41 41 41 41 41 41 41 40 40 40 40 40 40 40 39 39 39 39 40 40 40 40 41 41 41 41 41 41 41 41 41 41 41 42 42 41 41 41 41 41 41 40 40 40 40 39 39 39 39 39 39 40 40 40 41 41 41 41 41 41 41 40 40 40 40 40
14586 40 40 39 39 39 38 38 38 38 38 39 39 40 40 41 41 41 40 40 40 39 39 39 39 40 41 41 41 41 41 41 41 41 40 41 40 40 41 41 41 41 42 42 42 42 43 43 43 43 43 42 42 42 42 41 41 41 41 41 40 40 40 41 41 41 41 41 41 41 41
14538 41 41 41 41 41 41 41 41 41 41 41 41 41 41 40 40 40 40 40 40 40 40 40 40 41 41 41 42 42 42 42 42 42 42 41 41 41 41 40 40 40 40 40 40 40 40 40 40 40 40 40 40 40 40 40 40 40 39 39 40 40 40 40 41 41 41 41 41 41 41
14490 41 41 41 41 41 40 40 40 40 40 40 40 40 40 40 40 40 39 39 39 40 40 40 40 40 40 40 40 40 40 40 40 40 41 41 41 41 41 42 42 42 42 42 41 41 41 40 40 40 40 39 39 39 39 39 39 39 39 39 39 40 40 40 40 40 41 41 41 41 40
14442 40 40 40 40 40 40 40 40 40 40 40 40 40 40 40 41 41 41 41 41 41 40 40 40 40 40 41 41 41 41 41 41 40 40 40 40 40 40 40 41 41 41 41 41 42 42 42 42 42 41 41 41 41 41 41 41 41 41 41 41 41 41 40 40 40 40 40 40 40 40
14395 40 40 40 40 40 40 40 39 39 39 39 39 39 39 39 39 39 39 39 39 39 39 39 40 40 40 40 41 41 41 41 41 40 40 40 40 40 40 40 39 39 39 39 39 39 39 39 39 39 39 39 39 39 40 40 40 40 40 39 39 39 39 39 39 39 40 40 40 40 40
14347 40 40 40 40 40 40 40 41 41 41 41 41 41 41 41 41 41 41 41 40 40 40 39 39 39 39 39 40 40 40 40 40 40 40 40 41 41 41 41 42 42 41 41 41 41 41 42 42 42 42 42 42 41 41 40 40 40 40 40 40 40 40 41 41 41 42 42 42 41 41
14299 41 41 41 41 41 41 41 41 41 41 41 41 41 41 41 41 41 40 40 40 40 40 40 40 40 41 41 40 40 40 39 39 39 39 39 40 40 40 40 40 40 41 41 41 41 41 41 41 41 42 42 42 42 42 41 41 41 41 40 40 41 41 41 41 42 42 42 42 43 42
14251 42 42 42 42 42 42 42 42 42 42 42 41 41 41 41 41 41 41 42 42 42 42 42 41 41 41 41 41 41 41 41 41 41 41 41 42 42 42 42 42 42 43 42 42 42 42 42 42 42 41 41 41 41 40 40 40 40 40 40 40 40 40 40 40 40 40 40 40 40 40
14203 40 40 40 39 39 39 39 39 38 39 39 39 39 39 39 40 40 40 40 40 40 40 40 41 41 41 41 41 41 41 41 40 40 40 40 41 41 41 41 41 41 42 42 42 42 42 42 42 42 42 42 42 42 42 42 42 42 42 42 42 42 42 41 41 41 40 40 40 40 40
14155 40 40 40 40 40 40 40 40 40 40 40 40 40 40 41 41 40 40 40 39 39 39 39 39 40 40 40 40 40 40 40 40 40 39 39 39 39 39 40 40 40 40 40 40 40 40 40 41 41 41 41 41 40 40 40 40 40 41 41 41 41 41 41 41 40 40 40 40 40 40
14107 40 40 40 41 41 42 42 42 42 42 41 41 41 40 40 40 40 39 39 38 38 38 38 39 39 40 40 40 40 40 41 40 40 40 40 40 40 40 40 40 40 40 40 40 41 41 41 42 42 42 42 42 42 42 42 42 42 42 42 42 42 42 42 42 43 43 43 43 43 43
14060 43 43 43 43 43 44 43 43 43 43 43 43 43 43 43 42 42 42 42 42 42 42 42 42 42 42 42 41 41 41 41 41 41 41 41 41 41 41 41 41 41 41 40 40 40 40 40 40 40 40 40 40 40 40 40 40 40 40 40 40 40 41 40 40 40 40 40 40 40 40
14012 40 40 40 40 40 40 40 40 40 40 40 40 39 39 40 40 40 40 40 40 40 40 40 40 40 40 40 40 41 41 41 41 41 41 41 41 41 41 41 41 41 41 41 42 42 42 42 42 41 41 41 41 40 40 40 40 40 40 40 40 39 40 40 40 40 40 39 39 39 39
13964 39 39 39 39 39 39 39 39 39 39 39 38 39 39 39 40 40 40 40 40 41 41 41 41 41 41 40 40 40 40 40 40 40 40 40 40 40 40 40 41 41 41 41 41 40 40 40 40 40 40 40 40 40 40 40 39 39 39 39 39 39 39 39 39 39 40 40 40 40 40
13916 40 40 41 41 41 42 42 42 42 42 42 41 41 41 41 41 40 40 40 40 40 40 40 40 40 41 41 41 42 42 42 41 41 41 41 41 41 41 41 40 40 40 40 40 40 39 39 39 39 39 39 39 39 40 40 40 40 40 40 40 40 40 40 40 41 41 42 42 42 42
13868 42 42 42 42 41 41 41 42 42 42 42 42 42 42 42 42 41 41 42 42 42 42 42 42 42 41 41 40 40 40 40 40 40 40 40 40 40 40 40 40 40 40 41 41 41 41 41 41 41 41 41 41 40 40 40 40 40 40 40 40 40 40 40 40 40 40 40 40 40 40
13820 40 40 40 40 40 40 40 40 39 39 39 39 40 40 40 40 40 40 40 40 39 39 38 38 37 37 37 37 37 37 38 38 39 39 39 39 40 40 40 40 40 40 40 40 40 40 39 39 39 40 40 40 40 40 41 41 41 41 41 42 42 42 42 42 42 42 42 42 41 41
13772 41 41 41 41 41 41 41 42 42 42 42 42 42 42 43 43 43 43 43 42 42 42 41 41 41 41 40 40 40 40 40 40 40 41 41 42 42 42 42 42 42 42 42 42 41 41 41 40 40 40 40 40 40 40 40 40 40 40 40 40 40 40 40 40 41 41 41 42 42 41
13725 41 41 41 40 40 40 40 40 40 40 40 40 40 40 40 40 40 40 40 40 40 40 40 40 40 40 41 41 40 40 40 40 40 41 41 40 40 40 39 39 39 39 39 39 39 39 39 39 40 40 40 40 40 40 40 40 40 40 40 40 40 39 39 39 39 39 39 39 40 40
13677 40 40 40 40 40 41 41 41 41 40 40 40 40 40 40 40 40 40 40 40 40 40 39 39 39 39 39 39 39 39 39 39 38 38 38 38 38 38 38 39 39 39 40 40 40 41 41 41 42 42 42 42 42 42 41 41 41 41 41 41 40 40 40 40 40 41 41 42 42 41
13629 41 41 41 41 40 40 40 40 40 40 40 40 40 40 41 41 41 41 42 42 42 42 42 42 42 42 42 42 42 42 42 42 42 41 41 40 40 40 40 40 39 39 40 39 40 40 40 40 40 40 40 40 40 40 40 40 41 41 41 41 41 41 40 40 40 40 40 40 40 40
13581 40 40 40 40 40 40 39 39 39 39 39 39 39 39 39 40 40 39 39 39 39 39 39 39 39 39 39 39 39 39 39 40 40 40 40 41 41 40 40 40 39 39 39 39 39 39 39 39 39 39 39 39 39 39 39 39 39 39 39 39 39 39 39 39 39 39 39 39 39 39
13533 39 39 38 39 39 39 39 40 40 40 41 41 41 42 42 42 42 41 41 41 41 41 41 40 40 40 40 40 40 40 40 40 40 40 40 40 40 40 40 40 41 41 41 41 42 42 42 42 42 41 41 41 40 40 40 39 39 39 39 38 39 38 38 39 39 39 39 39 40 40
13485 40 40 40 40 40 40 40 41 41 41 41 41 41 41 41 41 41 41 41 41 41 41 41 41 41 41 41 41 40 40 40 40 40 40 40 40 40 40 40 40 40 40 40 40 40 40 40 40 40 40 40 40 40 40 40 40 40 40 40 41 41 41 41 41 41 41 41 41 41 41
13437 41 41 41 41 41 41 41 41 41 41 42 42 42 42 42 42 42 41 41 40 40 40 40 40 40 40 41 41 42 42 42 42 42 42 42 42 42 42 42 41 41 41 41 41 41 41 41 41 41 41 41 41 41 41 40 40 40 40 41 41 41 41 41 42 42 42 42 42 42 42
13390 42 42 42 42 42 42 42 42 42 41 41 41 41 41 42 42 42 42 42 42 41 41 41 41 41 41 41 41 41 41 40 40 40 40 40 40 40 40 40 40 40 40 41 41 40 40 40 40 40 39 40 40 40 40 41 41 41 41 41 41 41 41 41 41 40 40 40 40 40 40
13342 40 40 40 40 40 40 40 40 40 41 41 41 41 41 40 40 40 40 40 40 40 40 40 40 40 40 40 40 40 40 40 40 40 40 40 40 40 40 39 39 39 40 40 40 40 40 40 40 40 40 40 40 40 40 40 41 41 40 40 39 39 39 39 39 39 39 39 39 39 39
13294 39 39 40 40 39 39 39 39 39 39 40 40 40 39 39 39 39 39 39 39 39 39 39 39 39 39 40 40 39 39 39 39 39 39 39 39 40 40 40 40 40 40 40 39 39 39 39 39 39 40 40 40 40 40 41 41 41 40 40 40 40 40 40 40 40 40 40 40 40 40
13246 40 40 40 40 40 40 40 41 41 41 40 40 40 40 40 40 40 40 40 41 41 40 40 40 40 40 40 40 40 40 40 40 40 40 40 39 39 39 39 39 39 40 40 40 40 40 40 40 41 41 40 40 40 40 40 41 41 41 41 41 41 41 41 41 40 40 40 40 40 40
13198 40 40 40 40 40 40 40 40 40 40 40 40 40 39 39 39 39 39 39 39 40 40 41 41 41 41 41 41 41 41 41 40 40 40 40 40 40 40 40 40 40 40 41 41 41 41 41 41 41 41 41 41 42 42 42 42 41 41 41 41 41 41 41 41 40 40 40 39 39 39
13150 39 40 40 40 40 39 39 39 39 39 39 39 39 39 39 39 39 40 40 41 41 41 41 41 41 41 41 41 41 41 40 40 40 40 40 40 40 40 40 40 39 39 39 38 39 39 39 40 40 41 41 42 42 42 42 42 41 41 41 41 41 41 41 41 41 41 41 41 41 41
13102 41 41 41 41 41 41 42 42 42 42 42 42 41 41 41 41 41 41 41 40 40 40 39 39 39 39 39 39 39 39 39 39 39 39 40 40 40 40 40 41 41 41 41 42 42 42 42 42 42 42 42 42 42 42 42 42 42 42 42 41 41 41 41 41 41 41 41 40 40 40
13055 40 40 40 40 40 40 40 40 40 40 40 40 39 39 38 38 38 38 38 38 38 38 39 39 39 39 39 39 39 40 39 39 39 39 39 38 38 38 38 38 39 39 39 40 40 40 40 40 40 40 40 40 40 40 40 41 41 41 41 42 42 42 41 41 41 41 41 40 40 40
13007 40 41 41 41 41 41 41 41 41 41 40 40 40 40 39 39 39 39 39 39 39 40 40 40 40 40 40 40 40 40 41 41 41 42 42 42 41 41 41 40 40 40 40 40 40 40 40 40 40 40 39 39 39 40 40 40 40 41 41 41 41 41 41 41 41 41 41 40 40 40
12959 40 40 40 40 40 40 40 40 40 40 40 40 40 40 39 39 39 39 39 39 40 40 40 40 40 41 41 41 41 41 41 41 41 41 41 40 40 40 40 39 39 39 39 39 39 40 40 40 40 41 41 41 41 41 41 41 41 41 41 42 42 42 42 42 42 42 41 41 41 41
12911 41 41 41 41 41 41 40 40 40 40 40 40 40 40 40 40 39 39 39 39 39 39 39 39 39 39 39 39 39 40 40 40 40 40 40 40 41 41 41 41 41 41 41 40 40 40 40 39 39 39 39 39 39 39 39 40 40 40 40 40 40 40 40 40 41 41 41 40 40 40
12863 40 40 40 40 40 40 40 40 40 40 40 40 40 40 40 39 39 39 39 39 39 40 40 40 40 41 41 41 42 42 42 42 42 42 41 41 41 41 41 41 41 41 41 41 41 40 40 40 40 40 39 39 39 39 39 39 39 39 39 40 40 40 41 41 40 40 40 40 40 40
12815 40 40 40 40 40 40 39 39 39 39 39 39 39 40 40 40 40 40 40 40 40 41 41 41 41 41 41 41 40 40 40 40 40 40 40 40 40 40 40 40 40 40 40 40 39 39 39 39 39 39 40 40 40 40 40 40 41 41 41 41 41 41 41 41 41 41 41 41 41 41
12767 41 41 41 40 40 40 40 39 39 39 39 40 40 40 40 41 41 41 41 41 41 41 41 41 41 41 41 41 41 41 41 41 41 41 41 41 41 41 41 41 41 41 41 40 40 41 41 41 42 42 42 42 42 42 42 41 41 41 41 40 40 40 40 40 40 40 41 41 41 41
12720 41 41 41 41 40 40 41 41 41 41 41 41 41 41 41 40 40 40 40 40 40 40 40 40 41 41 41 41 41 41 41 41 40 40 40 40 41 41 41 40 40 40 40 40 40 40 40 40 40 40 40 40 40 40 40 40 39 39 39 39 39 39 39 39 39 39 39 39 39 39
12672 39 39 39 39 39 39 40 40 40 40 40 41 41 41 40 40 40 40 40 40 40 40 39 39 39 39 39 39 39 39 39 39 39 39 40 40 41 41 41 41 41 41 41 41 42 41 41 41 41 41 41 41 40 40 40 40 40 39 39 39 39 39 39 39 39 39 39 40 40 40
12624 40 39 39 39 40 40 40 40 40 40 40 40 40 40 40 40 40 40 40 40 40 40 40 40 40 40 40 40 40 40 40 40 40 40 40 40 40 40 40 40 40 40 40 40 40 40 40 40 40 40 40 41 40 40 40 40 40 40 40 40 40 40 40 40 40 40 40 40 40 39
12576 39 39 39 38 38 38 38 38 38 39 39 39 39 39 39 40 40 40 40 40 41 41 41 41 41 41 41 41 41 41 41 41 41 40 40 40 40 40 40 40 40 40 39 39 39 39 40 40 40 41 41 41 40 40 40 40 40 40 39 39 39 39 39 39 39 39 39 39 39 39
12528 39 39 39 39 39 39 40 40 40 41 41 41 41 41 41 41 41 41 41 41 41 41 41 41 41 41 40 40 40 40 40 40 40 40 40 40 40 40 39 39 39 39 39 39 39 40 40 40 40 40 40 40 39 39 39 38 38 39 39 39 39 39 39 39 39 39 39 40 40 41
12480 41 41 41 41 41 41 41 40 40 40 40 39 39 39 40 40 40 40 40 40 40 40 40 40 40 40 40 40 40 40 40 40 39 39 39 39 40 40 40 40 41 41 41 40 40 40 40 40 39 39 40 40 40 41 41 41 41 41 41 41 41 41 41 40 40 40 39 39 40 40
12432 40 40 40 41 41 41 41 41 41 41 40 40 41 41 41 41 41 41 40 40 40 40 41 41 41 41 41 41 41 41 40 40 41 41 41 41 41 41 41 41 41 41 41 41 41 41 41 41 41 41 41 41 41 41 41 41 41 41 41 41 41 41 41 41 41 42 42 42 42 42
12385 42 42 42 41 41 41 41 41 41 40 40 40 40 40 41 41 40 40 40 40 40 40 39 39 39 39 39 39 39 39 39 39 39 39 38 38 38 38 38 38 38 38 37 37 37 37 38 38 38 39 39 40 40 40 40 39 39 39 39 38 38 38 38 39 39 38 38 38 38 38
12337 38 38 38 38 38 38 38 38 38 38 39 39 39 40 40 40 41 41 41 41 41 41 41 41 42 42 42 42 42 42 42 42 41 41 41 41 40 40 40 40 40 40 40 40 40 40 39 39 39 39 39 39 39 39 39 40 40 40 40 41 41 42 42 42 42 42 41 42 42 42
12289 42 42 41 41 41 41 41 41 41 41 40 40 40 41 41 41 41 41 41 41 41 41 41 41 41 41 41 41 40 40 39 39 39 39 40 40 39 39 39 39 39 39 39 39 39 39 38 38 38 38 39 39 40 40 40 41 41 41 41 41 41 41 41 41 41 41 41 41 41 41
12241 41 42 42 42 42 41 41 41 40 40 40 39 39 39 39 39 39 39 39 39 39 39 40 40 40 39 39 39 39 39 39 39 39 39 39 39 39 39 39 39 39 40 40 40 40 40 40 40 40 40 40 40 40 40 40 41 41 41 41 41 41 41 41 41 41 40 40 40 40 40
12193 40 39 39 39 39 39 39 39 39 39 39 39 39 39 39 40 40 40 40 40 40 39 39 39 39 39 39 39 39 39 40 40 40 40 40 41 41 41 41 40 40 40 39 39 39 39 38 38 38 38 38 38 38 38 38 38 38 38 38 38 38 39 39 39 39 39 39 39 39 38
12145 38 38 38 38 38 38 38 38 38 39 39 39 39 39 39 39 39 39 39 40 40 40 40 40 40 40 40 40 40 40 40 40 40 40 40 40 40 40 40 39 39 39 39 39 39 39 40 40 40 41 41 41 40 40 40 40 39 39 39 39 39 39 39 40 40 40 40 39 39 39
12097 39 40 40 40 40 40 40 39 39 39 39 40 40 40 40 40 40 40 40 40 40 40 40 41 41 41 41 41 41 40 40 40 40 40 40 40 40 40 41 41 41 41 41 41 41 41 40 40 40 40 40 40 39 39 39 39 39 39 39 40 40 40 40 40 40 40 40 41 41 41
12050 41 41 41 41 41 40 40 40 40 40 40 39 40 40 40 40 41 41 41 41 41 41 42 42 42 42 42 43 43 43 42 42 41 41 41 40 40 40 40 40 40 40 40 40 40 40 40 40 40 40 40 40 40 40 40 40 40 40 40 40 40 40 41 41 41 41 42 42 43 43
12002 43 43 43 43 43 43 43 43 43 43 42 42 42 42 42 41 41 41 40 40 40 40 40 40 40 40 40 41 41 41 41 41 41 41 41 41 41 41 41 41 40 40 40 40 40 40 40 40 40 40 40 40 40 40 39 39 39 39 39 39 39 39 39 39 39 39 39 39 39 39
11954 39 39 39 39 39 40 39 39 39 39 39 39 39 39 39 40 40 40 41 41 42 42 42 42 42 42 41 41 41 41 41 41 41 41 40 40 40 41 41 41 41 41 41 41 41 41 40 40 40 40 40 41 41 41 41 42 41 41 41 41 40 40 40 39 39 39 39 39 39 40
11906 40 40 39 39 39 39 40 40 40 40 40 40 40 40 40 40 40 40 40 40 40 40 40 40 40 40 40 40 40 40 40 40 40 40 40 40 40 40 40 40 41 41 41 41 41 41 41 40 40 40 40 40 40 40 40 40 40 40 40 40 40 40 40 40 40 40 41 41 41 41
11858 41 41 41 40 40 40 40 41 41 41 41 40 40 40 40 40 41 41 42 42 42 42 42 42 41 41 40 40 40 40 40 40 41 41 41 41 41 40 40 40 40 40 40 40 40 39 39 39 39 38 38 38 38 38 38 38 38 38 38 38 39 39 39 39 39 39 40 40 40 40
11810 40 40 40 40 40 40 40 40 39 39 39 39 38 38 38 38 38 38 38 39 39 39 40 40 40 40 40 40 40 40 40 40 40 40 41 40 40 40 40 40 40 40 39 39 40 40 40 40 40 40 41 41 41 41 41 41 41 41 41 41 40 40 40 39 39 40 40 40 40 40
11762 40 40 40 40 40 40 40 40 40 40 39 39 39 39 39 39 39 40 40 41 41 41 41 41 41 41 41 41 41 40 40 40 40 41 41 41 41 41 41 41 41 41 41 41 41 41 40 40 40 40 40 40 40 40 40 40 40 39 39 39 39 40 40 40 40 40 40 40 39 39
11715 39 39 39 38 38 38 39 39 39 39 39 39 39 40 40 40 39 39 39 39 39 40 40 40 41 41 41 41 41 41 41 41 41 41 42 42 43 43 43 43 43 43 43 42 42 42 42 41 41 41 40 40 40 40 40 40 40 39 39 39 39 40 40 40 40 40 41 41 41 41
11667 41 41 41 40 40 41 41 41 41 41 41 41 41 40 40 40 40 40 40 40 40 40 40 40 40 40 40 40 40 40 40 40 40 40 40 41 41 41 41 41 41 41 40 40 40 40 40 41 41 41 41 41 41 41 41 41 41 41 41 42 42 41 41 41 42 42 42 42 42 42
11619 42 42 42 41 41 41 40 40 40 40 40 40 40 40 40 40 40 40 40 40 40 40 40 41 41 41 41 41 41 41 41 41 41 41 41 41 40 40 40 40 40 40 40 40 40 40 40 40 40 40 40 40 40 40 40 40 40 40 40 40 40 40 41 41 41 41 41 41 41 41
11571 41 41 40 40 39 39 39 39 39 39 39 39 39 39 39 39 39 39 39 39 39 39 39 39 39 39 40 40 40 40 40 40 40 41 41 41 41 41 41 41 41 41 41 40 40 40 40 40 40 40 40 40 40 40 40 41 41 41 41 41 41 41 41 41 41 41 40 40 40 40
11523 40 40 40 40 40 41 41 42 42 42 42 42 42 42 42 42 42 42 42 42 42 42 42 41 41 41 41 41 40 40 40 40 40 40 40 40 40 39 39 39 39 39 39 39 39 39 39 39 39 39 40 40 40 40 40 40 40 40 40 39 39 38 38 38 39 39 39 39 40 40
11475 40 40 40 40 40 40 40 40 40 40 40 40 41 41 40 40 40 39 39 39 39 39 39 40 40 41 41 41 41 41 42 42 42 42 42 42 42 42 43 42 42 41 41 40 40 40 40 40 40 40 40 40 40 41 41 40 40 40 40 40 40 39 40 40 40 40 40 41 41 41
11427 41 41 41 41 41 41 41 41 40 40 40 40 40 40 40 40 40 40 40 40 40 40 40 40 40 40 40 40 40 40 40 39 39 39 38 38 38 37 37 38 38 39 39 39 39 39 39 39 39 39 39 39 39 39 39 39 39 39 39 38 38 38 38 38 38 38 38 38 38 39
11380 39 39 39 39 40 40 40 40 40 40 40 40 40 41 41 41 41 41 41 41 41 41 41 41 41 40 40 40 40 40 40 40 40 39 39 40 40 40 40 40 40 40 40 40 40 41 41 41 41 41 40 40 40 40 41 41 41 41 41 41 41 42 42 42 42 42 42 42 42 42
11332 42 42 42 42 42 42 42 41 41 41 41 41 40 40 40 40 40 40 40 40 40 40 39 39 39 39 39 39 39 39 40 40 40 40 40 40 40 40 39 39 39 39 40 40 40 40 40 39 39 40 40 40 40 40 40 40 40 40 40 41 41 41 41 41 41 41 41 40 40 40
11284 40 40 40 40 40 40 40 40 40 40 40 40 40 40 40 41 40 40 40 39 39 39 39 38 39 39 39 39 39 39 40 40 40 40 40 40 40 40 40 39 39 39 39 39 40 40 40 40 40 40 41 41 41 41 41 41 41 41 41 40 40 40 40 39 40 40 40 40 40 40
11236 40 40 40 40 40 40 41 41 41 41 41 41 41 41 41 40 40 40 40 40 40 40 40 40 40 40 40 40 40 40 39 39 39 39 40 40 40 40 40 40 40 40 40 40 40 41 41 40 40 40 40 40 40 40 40 40 40 41 41 41 41 41 41 41 41 41 41 40 40 39
11188 39 39 39 39 39 40 40 40 40 40 40 40 40 40 40 41 41 41 41 41 41 41 41 41 40 40 40 40 40 40 40 40 40 41 41 41 41 41 41 41 41 41 41 41 41 41 41 41 41 41 41 41 41 41 41 42 42 42 42 42 42 42 42 42 42 42 41 41 41 41
11140 41 41 41 41 41 41 41 41 41 41 41 41 40 40 40 40 40 40 40 40 40 40 40 40 41 41 41 41 41 41 41 41 41 41 41 41 41 41 41 41 41 41 41 42 42 41 41 41 41 41 41 41 41 41 41 41 41 41 41 41 40 40 40 41 41 40 40 40 40 40
11092 40 40 40 40 40 40 40 40 40 39 39 39 39 39 39 39 39 40 40 40 40 40 40 40 40 40 40 39 39 39 40 40 40 41 41 41 41 42 42 42 42 42 42 42 42 42 42 41 41 41 41 42 42 42 41 41 41 41 41 41 41 41 41 41 41 41 41 41 41 41
11045 41 41 41 41 41 41 41 41 41 40 40 40 40 40 40 40 40 40 41 41 41 41 41 41 41 41 41 41 41 41 40 40 40 40 40 39 39 39 39 39 38 39 39 39 38 38 39 39 40 40 40 41 41 41 41 41 40 40 40 40 40 40 41 41 41 41 42 42 42 42
10997 42 42 42 42 42 42 42 42 42 42 42 42 42 42 42 41 41 41 41 41 41 41 41 41 41 41 41 41 41 41 41 41 41 41 41 41 41 41 41 41 41 40 40 40 40 40 39 39 39 39 39 39 39 39 39 39 39 39 39 39 40 40 40 40 40 40 40 40 40 40
10949 40 40 40 40 40 40 40 40 40 40 40 40 40 40 41 41 41 41 41 41 41 41 41 41 41 41 41 41 40 40 40 40 40 40 40 40 40 40 40 40 39 39 39 39 39 39 39 39 39 39 39 39 39 39 39 39 40 40 40 40 40 40 40 40 40 40 40 40 41 41
10901 41 41 41 41 41 41 41 41 41 41 41 41 41 41 41 41 41 42 42 42 42 42 42 42 42 42 42 42 41 41 40 40 40 40 40 40 40 40 40 40 40 40 40 40 40 40 39 39 39 39 39 40 40 40 40 41 41 41 41 41 41 41 42 42 42 42 42 42 42 41
10853 41 41 40 40 39 39 39 39 39 39 39 40 40 40 41 41 41 41 41 41 41 41 41 41 41 41 41 41 41 41 41 41 41 40 40 40 40 40 40 40 40 40 40 39 39 39 39 39 39 39 39 39 39 39 39 39 39 39 39 39 39 39 39 39 39 39 39 39 39 39
10805 39 39 39 39 39 39 39 39 39 39 38 39 39 39 39 39 39 40 40 40 40 40 40 40 40 40 41 41 41 41 41 41 40 40 39 39 39 39 39 39 39 39 39 39 39 39 40 40 40 40 41 41 41 41 41 41 41 41 41 41 41 41 40 40 40 40 40 40 40 39
10757 39 39 39 39 39 39 40 40 40 40 40 40 40 40 40 39 39 39 39 38 38 38 38 38 38 38 38 39 39 39 39 39 39 39 39 39 39 39 39 39 39 38 38 38 38 38 38 38 39 39 39 40 40 40 40 41 41 41 41 41 41 41 41 41 41 41 41 40 40 40
10710 40 40 40 40 40 40 39 39 39 40 40 40 41 41 41 41 41 41 41 40 40 39 39 39 39 40 40 40 40 40 40 40 40 40 40 39 40 40 40 40 40 41 41 41 41 41 40 40 40 40 40 41 41 41 41 41 41 41 41 41 41 41 41 41 41 41 41 41 41 41
10662 41 41 40 40 40 40 39 40 40 40 40 40 40 40 40 41 41 41 41 41 41 41 42 41 41 41 41 41 41 41 41 41 40 40 40 40 40 41 41 41 41 41 41 41 41 41 40 40 40 40 40 40 40 40 41 40 40 40 40 40 40 40 40 40 40 40 40 40 41 41
10614 41 41 41 41 42 42 42 42 42 42 42 41 41 41 41 41 41 41 41 41 41 41 41 41 40 40 40 40 40 40 40 40 40 40 41 41 41 41 41 41 41 41 41 41 41 41 41 41 41 41 41 41 41 41 41 41 41 41 41 41 41 41 41 41 41 41 41 41 41 41
10566 41 41 40 40 40 40 40 40 41 41 41 41 41 41 41 41 42 41 41 41 40 40 39 39 39 40 40 40 40 40 40 41 41 41 41 40 40 40 41 41 41 41 41 41 41 41 41 41 41 40 40 40 40 40 39 39 39 39 40 40 40 40 40 40 41 41 41 41 41 41
10518 41 42 42 42 41 41 40 40 40 40 40 41 41 41 41 41 41 41 41 41 41 41 41 41 41 41 41 41 41 41 41 41 41 41 41 41 40 40 40 40 40 40 40 40 40 40 40 40 40 40 40 40 40 40 40 40 40 40 39 39 40 40 40 40 40 40 40 40 40 40
10470 40 40 39 39 40 40 40 40 40 40 40 40 40 41 41 41 41 41 41 41 41 40 40 40 40 40 40 40 40 40 40 40 40 40 39 40 40 40 40 40 40 40 40 40 40 40 40 40 40 40 40 40 40 40 40 40 40 40 40 40 40 40 40 40 41 41 40 40 40 40
10422 40 41 41 41 41 42 42 42 42 42 42 42 43 43 43 42 42 42 42 42 41 41 41 41 41 41 41 41 42 42 41 41 41 40 40 40 40 40 40 40 40 40 40 40 40 40 40 40 40 40 41 41 41 41 41 41 41 40 40 40 40 39 39 39 38 39 39 39 40 40
10375 40 40 41 40 40 40 40 40 40 40 40 41 41 41 41 41 41 41 41 41 41 42 42 42 42 41 41 41 41 41 41 41 41 41 40 40 40 40 40 40 40 40 40 40 40 40 41 41 41 41 41 41 42 42 42 41 41 41 41 41 41 41 41 41 40 40 40 40 40 40
10327 40 40 40 40 40 40 40 40 40 40 40 40 40 40 40 40 40 40 41 41 41 41 41 41 41 41 41 41 41 41 40 40 40 40 40 40 40 40 40 40 40 40 41 41 41 41 41 41 41 41 41 41 41 41 41 40 40 40 40 40 40 40 40 40 40 40 40 40 40 41
10279 41 41 42 42 42 42 42 41 41 41 40 40 40 40 40 40 40 40 40 40 40 40 40 41 41 41 42 42 42 42 41 41 41 41 41 41 41 41 41 41 42 42 42 41 41 41 40 40 40 40 40 40 40 40 40 41 41 41 41 41 40 40 40 40 40 40 40 40 40 40
10231 40 39 40 40 40 40 40 40 40 40 40 40 40 40 41 41 41 41 41 41 41 41 41 40 40 40 40 40 40 40 40 41 41 41 41 41 42 42 42 42 42 42 42 42 42 42 42 43 43 43 43 42 42 41 41 41 40 40 40 40 40 40 40 41 41 42 42 42 42 43
10183 43 43 43 43 43 43 43 42 42 42 42 42 41 41 41 40 40 40 40 41 41 41 41 42 41 41 41 41 41 41 40 40 40 40 40 40 40 40 40 40 40 40 41 41 42 42 42 42 42 42 42 42 42 42 42 42 42 42 41 41 41 41 41 42 42 42 42 42 42 42
10135 42 42 41 41 41 41 41 41 41 40 40 40 40 40 40 39 39 39 40 40 40 40 40 40 40 40 40 40 40 40 40 40 40 40 40 39 39 39 39 40 40 40 41 41 41 41 41 42 42 42 42 42 41 41 41 41 41 41 41 41 41 41 40 40 41 41 41 42 42 42
10087 42 42 41 41 41 40 40 40 39 39 39 39 39 38 38 39 39 39 39 39 39 40 40 40 40 40 40 40 40 40 41 41 41 41 41 41 40 40 40 40 40 41 41 41 41 41 42 42 42 42 42 42 42 41 41 41 41 40 40 40 40 40 40 40 40 40 40 40 40 40
10040 40 40 40 40 41 40 40 40 40 40 40 40 40 40 41 41 41 42 42 41 41 41 41 41 41 41 42 42 42 42 41 41 41 41 41 41 41 40 40 40 40 40 40 40 41 41 41 42 41 41 41 41 41 41 41 41 41 41 40 40 40 40 40 40 40 40 40 40 41 41
9992 41 42 42 43 43 43 43 43 43 43 42 42 42 42 42 42 41 41 41 40 40 41 41 41 41 41 41 41 40 40 40 39 40 40 40 40 41 41 40 40 40 40 40 40 40 40 40 40 40 40 40 40 40 40 40 40 40 40 40 40 40 40 40 40 41 41 41 41 41 41 41
9943 41 41 41 41 41 41 42 42 42 42 42 41 41 41 40 40 40 40 40 40 40 41 41 41 42 42 42 43 43 43 43 42 42 42 41 41 41 41 41 41 41 41 41 41 41 41 41 40 40 40 40 40 40 40 41 41 41 41 41 41 42 42 42 42 42 42 42 42 43 43 43
9895 43 43 42 42 42 42 41 41 41 41 41 41 41 42 42 42 42 42 42 42 42 41 41 41 40 40 40 40 39 39 39 39 39 39 39 40 40 39 39 40 40 40 40 40 40 40 40 40 40 40 40 40 40 40 40 41 41 41 41 41 41 41 41 40 40 41 41 41 41 41 41
9846 41 41 42 41 41 41 41 40 40 40 40 40 40 40 40 40 40 40 40 40 40 40 40 40 40 40 40 39 39 40 40 40 40 40 40 40 41 41 41 41 41 42 42 42 42 42 42 42 41 41 41 41 41 41 41 41 41 41 41 41 41 41 41 41 41 41 41 41 41 41 41
9797 41 41 41 41 41 41 41 41 41 41 41 41 41 41 40 40 40 40 40 40 40 41 41 41 41 41 41 41 41 41 41 41 41 41 40 40 40 40 40 40 40 40 40 40 41 41 41 41 41 41 41 41 41 41 41 42 41 41 41 41 40 40 40 40 40 40 39 39 39 39 39
9749 39 39 39 40 40 40 40 40 40 40 40 40 40 40 40 40 41 41 41 41 41 41 41 42 42 43 43 43 42 42 42 41 41 41 41 41 41 41 41 41 41 41 40 40 40 40 40 40 40 40 41 41 41 41 41 41 41 41 41 41 42 42 42 41 41 41 41 41 41 41 41
9700 41 41 41 41 41 40 40 40 40 40 40 40 41 41 41 41 41 41 41 41 41 41 41 41 41 41 41 41 41 41 41 41 41 41 41 41 41 41 41 41 41 41 41 41 41 40 40 40 40 40 40 40 40 40 41 41 41 41 41 41 41 42 41 41 41 41 41 41 41 41 41
9652 41 41 41 41 41 42 42 42 42 42 41 42 42 42 42 42 42 42 42 42 42 41 41 42 42 42 42 42 42 42 42 42 42 42 42 42 41 41 41 41 41 41 42 41 41 41 41 41 41 41 40 41 41 41 42 42 42 42 43 43 43 42 42 42 42 42 42 42 42 42 42
9603 42 42 42 42 41 41 41 40 40 39 39 39 39 39 39 40 40 40 40 40 40 40 40 41 41 41 41 41 41 42 41 41 41 41 41 41 41 41 41 40 40 40 40 40 40 40 39 39 39 40 40 40 40 40 40 40 40 40 40 40 40 40 40 40 39 39 39 39 39 39 39
9555 39 39 39 39 39 40 40 40 40 40 40 40 40 39 39 40 40 40 41 41 42 41 41 41 41 41 41 41 41 41 40 40 40 40 40 41 41 41 41 41 41 41 41 40 40 40 41 41 41 41 41 41 42 42 42 42 42 42 42 42 42 42 42 42 42 42 42 42 42 41 41
9506 41 41 41 41 41 41 41 41 41 41 41 40 40 40 41 41 41 41 41 41 41 41 41 40 40 40 40 41 41 41 41 41 42 42 42 42 42 42 42 42 42 42 42 42 42 42 42 42 42 42 42 42 41 41 41 41 41 41 41 41 41 41 41 41 40 40 40 40 40 40 40
9458 40 41 41 41 41 41 41 41 42 42 42 42 42 42 42 42 42 42 42 42 42 41 41 41 41 41 40 40 40 40 40 40 40 40 40 40 40 40 40 40 40 40 40 40 40 40 40 40 40 41 41 41 41 41 41 41 41 40 40 41 41 41 42 42 42 42 42 42 42 41 41
9409 41 41 41 41 41 41 41 41 41 41 41 41 41 41 41 41 41 41 41 41 42 42 42 42 42 42 42 42 42 42 43 43 43 43 43 43 43 43 42 42 42 42 42 43 43 42 42 42 42 42 42 42 42 42 42 42 42 42 42 42 42 42 42 41 41 41 42 42 42 43 43
9361 43 43 43 43 42 42 42 42 42 42 42 42 42 42 42 42 42 42 41 41 41 41 42 42 42 42 42 42 41 41 41 41 41 42 42 42 42 42 42 42 42 42 42 42 43 43 43 43 43 43 43 43 43 44 44 44 43 43 43 43 43 43 44 43 43 43 43 43 42 42 42
9312 42 42 42 42 41 41 41 41 40 40 40 40 41 41 41 42 42 42 43 42 42 42 42 42 42 42 42 42 43 42 42 42 42 42 42 42 42 42 42 42 42 42 42 42 43 43 43 43 43 43 44 44 44 43 43 42 42 41 41 41 41 41 42 42 43 43 43 43 44 44 44
9263 44 44 44 44 44 44 43 43 42 42 42 42 42 41 41 41 42 42 42 42 42 42 42 42 42 42 42 42 42 42 42 42 42 42 42 42 42 42 42 42 42 42 42 42 42 42 42 42 42 42 42 42 42 42 42 41 41 40 40 40 40 41 41 41 41 41 42 42 42 42 42
9215 42 42 42 42 42 42 41 41 41 41 42 42 42 42 43 43 43 43 43 43 43 43 43 42 42 42 42 42 42 42 42 42 42 42 42 42 42 42 42 43 43 43 42 42 42 42 42 42 42 42 42 42 42 42 42 42 43 43 43 43 43 43 43 43 43 43 43 43 43 43 43
9166 43 43 43 43 43 43 43 43 43 43 42 42 42 42 42 42 42 42 41 41 41 41 41 41 41 41 41 41 41 41 42 42 42 42 42 42 42 42 42 42 42 42 42 42 43 43 43 43 43 43 42 42 42 42 42 42 42 42 43 42 42 42 42 42 42 41 41 41 41 41 41
9118 41 41 41 41 41 41 41 41 41 42 42 43 43 44 44 43 43 43 42 42 42 42 43 43 43 43 43 43 43 42 42 42 42 42 42 42 42 42 42 42 41 41 41 41 40 40 40 40 40 40 40 40 41 41 42 42 42 43 43 43 44 44 44 44 44 43 43 43 43 43 43
9069 43 43 43 43 43 42 42 42 42 42 42 42 42 42 42 41 41 41 41 41 41 41 41 41 41 41 41 41 41 41 40 41 41 41 41 41 41 41 41 41 41 42 42 42 42 43 43 43 42 42 42 41 42 42 42 42 42 43 43 43 43 43 43 42 42 42 42 42 42 42 42
9021 42 42 41 41 41 41 41 42 42 42 42 42 42 42 42 42 42 42 41 41 41 41 41 41 40 40 40 40 40 40 41 41 41 41 42 42 42 43 43 43 43 43 43 43 43 43 43 43 43 43 43 43 43 43 43 42 42 42 42 42 42 42 42 42 43 43 43 42 42 41 41
8972 41 41 40 40 40 40 40 40 40 40 40 41 41 41 41 41 41 41 41 42 42 42 43 43 43 43 43 43 43 43 43 42 42 42 42 42 42 42 42 41 41 41 41 42 42 42 42 42 42 42 43 43 43 43 43 43 43 43 42 42 42 42 41 41 41 41 41 41 41 41 41
8924 41 41 40 40 40 40 40 40 40 40 41 41 42 42 42 42 43 42 42 42 42 42 42 43 43 43 43 43 43 43 43 43 43 43 43 43 43 42 42 42 42 42 42 42 42 42 42 42 43 43 43 43 43 43 43 42 42 42 43 43 43 43 43 42 42 42 41 41 41 41 41
8875 41 41 41 42 42 42 42 42 43 43 44 44 44 44 44 43 43 43 43 43 43 43 43 43 43 43 43 43 43 43 43 43 43 43 43 43 43 43 43 43 42 42 42 42 42 43 43 43 42 42 42 42 42 42 42 43 43 43 44 44 44 44 44 44 44 43 43 43 43 43 43
8826 43 43 44 44 44 44 44 44 45 45 45 45 45 45 45 44 44 44 44 44 44 44 43 43 43 43 43 42 42 42 43 43 43 42 42 42 41 41 41 41 41 41 41 41 41 41 41 41 41 41 42 42 43 43 43 44 44 44 44 44 43 43 43 43 43 43 43 43 42 42 42
8778 42 42 41 41 41 41 41 41 41 41 42 42 42 42 42 42 42 42 42 42 42 42 42 42 42 43 43 43 43 43 43 43 44 44 44 44 44 44 44 44 44 44 44 43 43 43 43 42 42 42 42 42 42 42 42 42 42 42 42 42 42 42 42 42 43 43 43 43 43 43 42
8729 42 42 42 42 42 41 41 41 42 42 42 42 42 42 42 42 42 42 42 42 42 42 42 42 42 42 42 42 42 42 42 42 42 42 42 42 42 43 43 44 44 44 44 44 44 44 44 44 43 43 43 42 42 42 42 42 42 42 42 42 42 43 43 43 44 44 44 44 44 43 43
8681 43 43 43 43 43 42 42 42 42 42 42 42 41 41 41 41 41 41 42 42 42 42 42 42 42 42 42 42 43 43 43 44 44 44 44 43 43 43 43 43 43 43 43 43 42 42 42 42 42 42 43 43 43 43 43 43 43 43 42 42 43 43 43 43 43 43 43 43 43 43 43
8632 43 43 43 43 43 43 43 43 43 43 43 43 43 44 44 44 44 44 44 44 44 44 44 44 44 44 44 44 44 44 44 44 44 43 43 43 43 43 43 43 42 42 42 42 42 42 42 43 43 43 43 43 43 43 43 44 44 44 44 44 44 44 44 44 44 44 43 43 43 43 43
8584 43 43 44 44 44 44 44 44 44 44 44 44 44 44 44 44 44 43 43 42 42 41 41 42 42 42 42 43 43 43 44 44 44 44 43 43 43 43 43 43 43 43 43 43 42 42 42 42 42 42 42 42 42 42 43 43 42 42 42 42 43 43 43 43 43 43 43 43 43 43 43
8535 43 43 43 42 42 42 43 43 43 44 44 44 44 43 43 43 43 43 42 42 42 42 42 42 42 42 42 42 43 43 43 43 43 43 43 42 43 43 43 43 43 43 43 43 43 43 43 43 43 44 44 44 44 43 43 43 43 43 43 43 43 43 43 43 43 43 43 43 44 44 43
8487 43 43 43 43 43 43 43 43 43 44 44 44 44 44 44 43 43 43 43 43 42 42 42 42 43 43 43 43 43 43 43 43 43 43 43 43 43 43 43 43 42 42 42 42 42 42 42 42 42 42 42 42 42 42 42 42 42 42 42 42 42 42 43 43 43 43 43 43 43 43 43
8438 43 43 44 44 44 44 44 44 44 43 43 43 43 43 43 43 43 43 43 44 44 44 44 44 44 44 44 43 43 44 44 44 44 44 44 44 44 44 44 45 45 45 45 44 44 43 43 42 42 42 43 43 43 43 43 43 43 43 44 44 44 44 44 44 43 43 43 43 42 42 42
8390 42 42 42 42 42 42 42 41 41 41 41 41 41 41 41 41 41 42 42 42 42 43 43 43 43 43 43 43 43 43 43 43 43 44 44 44 44 44 44 44 44 44 43 43 43 43 43 43 44 44 44 44 44 43 43 43 43 43 43 43 44 44 44 44 44 45 45 45 44 44 44
8341 44 44 43 43 43 43 43 43 43 43 42 42 42 42 41 41 41 41 42 42 42 42 43 43 43 43 43 43 43 43 43 43 43 43 43 43 43 43 43 44 44 44 44 44 44 44 44 44 44 44 44 44 43 43 43 43 42 42 42 42 42 42 42 42 42 42 42 43 43 43 43
8292 43 43 43 43 44 44 44 44 44 44 43 43 43 43 43 43 43 43 43 43 43 43 43 43 43 43 43 43 43 43 43 44 44 44 44 44 44 43 43 43 43 43 43 43 44 44 44 44 43 43 43 43 43 43 43 44 44 44 44 44 44 44 44 44 44 44 45 45 45 45 45
8244 45 45 44 44 44 44 44 44 43 43 43 43 43 43 43 43 43 43 43 43 44 44 44 44 44 44 44 44 43 43 43 42 42 42 43 42 42 42 42 42 42 42 42 42 42 42 42 42 43 43 43 43 42 42 42 43 43 43 44 44 44 45 45 45 46 46 46 46 46 45 45
8195 45 45 45 45 45 46 45 45 45 45 45 45 45 45 45 45 45 45 45 45 45 45 44 45 45 45 45 45 45 45 45 44 44 44 44 44 44 44 45 45 45 46 46 46 46 45 45 45 45 45 45 45 45 44 44 44 44 44 45 45 45 45 45 45 44 44 44 44 44 44 43
8147 43 43 43 43 43 43 43 43 43 43 43 44 44 44 44 44 45 45 44 44 44 44 44 44 44 44 44 44 44 44 44 43 44 44 44 44 43 43 43 42 42 42 43 43 43 44 44 44 44 44 44 44 44 44 44 44 45 45 44 44 44 44 44 44 44 44 44 44 44 44 45
8098 45 45 45 45 45 45 45 44 44 44 45 45 45 45 45 46 46 46 46 46 46 46 46 45 45 45 45 45 45 45 45 45 45 45 45 45 45 45 44 44 45 45 45 45 44 44 44 44 44 44 44 44 44 44 44 44 44 44 44 45 45 45 45 46 46 45 45 45 44 43 43
8050 43 43 43 43 42 43 43 43 43 43 44 44 44 44 45 45 45 45 46 46 46 46 46 46 45 45 45 45 45 45 45 45 45 45 45 45 44 44 44 44 44 45 45 45 45 45 45 44 44 44 44 43 43 43 43 43 43 44 44 44 44 44 44 44 44 44 44 44 44 44 44
8001 44 44 44 44 44 44 44 44 44 44 44 45 45 45 45 45 45 45 45 45 45 45 44 44 44 44 44 44 44 44 45 45 45 45 45 46 46 46 46 46 46 46 46 46 45 45 45 45 45 45 45 45 45 45 44 44 45 45 45 45 44 44 44 44 44 44 44 44 45 45 45
7953 45 45 45 45 45 45 46 46 45 45 45 45 45 46 46 46 46 46 46 46 46 46 46 46 46 46 46 46 46 46 46 46 46 46 46 45 45 45 45 45 45 45 45 45 45 45 45 45 45 45 45 45 45 45 44 44 44 44 44 44 44 44 44 44 44 44 43 43 43 43 43
7904 43 43 43 43 43 43 44 44 44 45 45 45 45 45 45 45 45 45 45 45 45 44 44 44 45 45 45 45 45 45 45 45 45 45 45 45 45 45 45 45 45 45 45 45 45 45 45 46 46 46 46 46 46 46 46 46 46 45 45 45 45 45 45 45 45 44 44 44 44 44 44
7855 44 45 45 45 45 45 46 46 46 46 45 45 45 44 44 44 44 44 45 45 45 45 45 45 45 45 45 45 45 45 45 44 44 44 44 44 44 44 44 44 44 44 44 44 44 44 44 44 44 44 44 44 45 45 45 45 45 45 45 45 45 45 45 45 45 44 44 44 44 44 44
7807 44 43 43 43 44 44 44 44 44 44 44 44 44 44 44 45 45 45 45 45 45 44 44 44 44 44 44 44 44 44 44 44 44 44 44 45 45 45 45 45 45 46 46 46 46 46 46 46 46 47 47 47 47 47 47 47 47 47 47 47 47 47 47 48 48 48 48 48 48 48 48
7758 48 48 47 47 46 46 45 45 45 45 45 45 45 45 45 45 45 45 45 46 46 46 46 46 46 46 45 45 45 45 45 45 45 45 45 46 46 47 47 47 47 47 47 47 47 47 47 47 47 47 46 46 46 46 46 47 47 47 47 47 47 47 47 47 46 46 46 46 46 46 46
7710 46 46 46 45 45 45 46 46 46 46 47 47 47 47 47 47 47 47 47 47 46 46 46 46 46 46 46 46 47 47 47 47 47 47 47 47 47 47 47 47 47 46 46 46 46 46 46 46 46 46 46 46 46 46 46 46 46 46 46 46 47 47 46 46 46 46 47 47 47 47 47
7661 47 46 46 46 46 46 46 46 46 46 46 46 47 46 46 45 45 45 45 46 46 46 46 46 47 47 47 47 47 47 47 47 47 47 47 47 48 48 48 48 48 48 47 47 47 47 47 47 47 47 47 47 47 47 47 47 47 47 47 47 47 47 47 47 47 47 47 47 47 47 47
7613 47 47 47 47 47 47 47 47 47 47 48 48 48 47 47 47 46 46 46 46 46 46 46 46 46 47 47 47 47 47 48 48 48 48 48 48 47 47 46 46 46 46 46 46 46 45 45 46 46 46 46 46 47 47 47 47 47 47 47 47 47 48 48 47 47 47 47 46 46 46 45
7564 45 45 45 45 45 45 46 46 46 46 47 47 47 47 47 47 47 47 47 47 47 47 47 47 47 48 48 48 48 48 49 49 49 49 49 49 49 49 49 48 48 48 48 48 48 48 48 48 48 48 48 48 48 48 48 48 48 48 48 47 47 47 47 47 46 46 46 46 46 46 46
7516 46 46 47 47 47 47 47 47 47 46 46 46 46 46 46 46 45 45 45 45 46 46 46 46 46 46 46 47 47 47 48 48 47 47 47 47 47 47 47 47 47 47 47 47 48 48 48 48 48 48 47 47 47 47 46 46 46 46 46 46 46 46 46 46 47 47 47 47 47 47 47
7467 47 47 47 47 47 47 47 48 48 48 48 48 48 48 48 48 48 48 48 48 48 48 48 48 48 48 48 48 48 48 48 47 47 47 47 48 48 48 48 48 48 48 48 48 48 48 48 48 48 48 49 49 49 49 49 49 49 49 49 49 49 49 49 49 49 49 49 49 49 49 49
7418 49 49 49 49 49 48 48 48 48 48 47 47 47 47 47 47 47 47 47 47 47 47 47 47 48 48 48 48 48 48 48 49 49 49 49 49 49 49 49 49 49 49 49 49 49 49 49 49 49 50 50 50 49 49 49 49 49 49 49 49 49 49 49 49 49 49 49 48 48 48 48
7370 48 48 47 47 47 47 47 47 47 47 47 47 48 48 48 48 48 48 48 48 48 48 48 48 48 48 48 48 48 48 48 48 48 48 48 48 49 49 49 49 50 50 50 50 50 50 49 49 48 48 48 48 48 48 48 48 48 48 48 48 48 48 48 48 48 48 48 48 48 48 48
7321 48 48 48 48 47 47 47 47 47 47 47 48 48 48 48 49 49 49 49 49 49 49 49 49 49 49 48 48 48 47 47 47 48 48 48 48 48 48 48 49 49 49 49 50 50 50 51 51 51 50 50 49 49 48 48 48 47 47 47 47 48 48 48 49 49 50 50 50 50 50 49
7273 49 49 49 49 48 48 48 48 48 48 48 48 48 48 48 48 48 48 48 48 48 48 48 48 48 48 48 47 47 47 47 47 47 47 47 47 47 48 48 48 49 49 49 49 49 49 49 49 49 49 49 49 49 49 50 50 50 50 50 50 50 50 50 50 50 49 49 49 49 49 49
7224 49 49 50 50 50 51 51 51 50 50 50 49 49 49 50 50 50 51 51 51 51 51 51 51 51 51 51 51 51 51 51 50 50 50 50 50 50 50 50 50 50 50 50 49 49 49 49 49 49 49 50 50 50 50 50 50 49 49 49 49 49 49 49 49 49 49 49 49 49 49 49
7176 49 49 49 49 49 48 48 48 48 48 48 48 49 49 49 49 49 49 49 50 50 50 49 49 49 49 49 50 50 49 49 49 49 49 49 49 49 49 49 49 49 49 49 49 50 50 50 50 50 50 49 49 49 49 49 49 49 49 49 49 49 50 50 50 51 51 51 51 51 51 51
7127 51 50 50 50 50 50 49 50 50 50 50 51 51 51 51 51 51 51 51 51 51 51 51 50 50 50 50 50 49 50 50 50 50 50 50 50 50 50 49 49 49 49 49 49 49 50 50 50 49 49 49 49 49 49 49 50 50 50 50 50 50 50 50 50 50 50 50 50 51 51 51
7079 51 51 51 51 51 51 51 51 51 51 51 51 50 51 51 51 51 51 51 51 51 51 51 51 51 52 52 52 52 52 52 52 52 52 52 52 52 52 52 52 51 51 51 50 50 50 50 50 51 51 52 52 52 51 51 51 51 51 51 50 50 50 50 50 50 50 50 50 49 49 49
7030 49 49 49 50 50 50 51 51 51 51 50 50 50 50 49 50 50 50 50 50 51 51 51 51 52 52 52 52 51 51 51 51 51 51 51 51 51 51 51 51 51 51 52 52 52 52 52 52 52 52 51 51 51 50 50 50 49 49 49 49 50 50 50 50 49 49 49 49 49 50 50
6982 50 51 51 51 51 51 51 51 51 51 51 51 51 51 51 51 51 51 51 51 51 51 50 50 50 50 50 50 50 50 50 50 50 50 50 50 50 50 50 50 50 50 50 51 51 51 51 51 51 52 52 52 52 52 52 53 53 53 52 52 52 52 52 52 52 52 52 52 52 52 52
6933 52 52 52 52 52 52 52 52 52 52 52 52 52 52 52 52 52 51 51 51 51 52 52 53 53 53 53 53 54 54 53 53 53 53 53 53 52 52 52 51 51 51 51 51 51 51 51 51 51 51 51 51 51 51 51 51 51 50 50 50 50 50 50 50 51 51 51 51 51 52 52
6884 52 51 51 51 50 50 50 50 50 51 51 52 52 52 52 52 51 51 51 51 51 51 51 51 51 51 51 51 51 51 51 52 52 52 52 52 53 53 53 53 53 53 53 53 53 53 53 53 53 53 53 52 52 52 52 52 52 52 52 52 52 52 52 52 52 52 51 51 51 52 52
6836 52 52 52 53 53 53 53 54 53 53 53 53 53 53 53 53 52 52 52 52 52 52 52 52 53 53 53 53 53 54 54 54 55 55 55 55 55 55 55 55 55 55 55 54 54 54 54 53 54 54 53 53 53 53 53 53 54 54 54 54 54 54 54 54 54 54 54 54 54 54 53
6787 53 53 53 53 53 53 54 54 54 54 54 54 54 54 54 54 54 54 54 54 54 54 54 54 54 54 54 54 54 53 53 53 53 53 53 54 54 53 53 53 53 54 54 54 54 54 54 54 54 54 54 54 53 53 53 53 52 53 53 53 54 54 53 53 53 53 53 53 53 53 53
6739 53 53 53 54 54 54 54 54 54 54 55 55 55 55 55 55 55 54 54 53 52 52 53 53 53 54 54 54 54 54 53 53 52 52 52 52 52 53 53 53 53 53 53 53 54 54 54 54 54 54 54 54 54 54 55 55 55 55 55 55 55 55 55 55 55 55 56 56 56 55 55
6690 55 55 56 56 56 55 55 55 55 55 54 54 54 54 54 54 55 55 55 55 55 55 55 54 54 54 54 54 53 53 53 53 53 53 53 53 53 53 53 53 53 53 53 54 54 54 54 54 53 54 54 54 54 54 54 54 54 53 53 53 53 53 53 53 53 53 53 54 54 54 54
6642 54 55 55 55 55 55 55 55 54 54 54 54 55 55 55 55 55 56 56 56 56 56 57 57 56 56 56 55 55 54 54 54 55 55 55 55 55 55 55 55 55 55 55 55 55 55 55 55 55 55 56 56 56 56 56 56 56 56 57 56 56 56 56 56 56 56 56 56 56 56 56
6593 56 56 56 56 57 57 57 57 57 56 56 56 56 56 56 55 55 55 55 55 55 55 56 56 56 56 56 56 57 56 56 56 56 56 56 56 56 56 56 56 56 56 56 57 57 57 57 57 57 57 57 57 57 57 57 57 56 56 56 56 55 55 55 55 55 55 55 55 55 55 55
6545 55 55 56 56 56 56 56 56 56 56 57 56 56 56 56 56 56 56 56 56 56 56 56 56 56 56 56 56 56 56 56 56 56 56 56 56 56 56 56 56 56 56 56 56 56 56 56 56 57 57 57 57 57 57 57 57 57 57 58 57 57 57 57 57 57 57 58 58 58 58 58
6496 58 58 58 59 59 58 58 58 58 57 57 57 56 56 55 55 55 56 56 56 56 56 57 57 57 57 57 58 58 58 58 58 59 59 59 58 58 58 58 58 58 58 58 58 58 58 58 58 58 58 58 58 58 58 59 59 59 59 59 59 59 59 58 58 58 58 58 58 58 58 57
6447 57 57 57 57 57 56 56 56 56 56 56 56 56 56 56 56 57 57 57 57 57 57 57 57 57 57 57 57 57 57 57 57 57 57 57 57 57 57 58 58 58 58 58 58 59 59 59 59 59 59 59 59 59 59 59 59 58 58 58 58 58 58 58 58 58 57 57 57 57 58 58
6399 58 58 58 58 59 59 59 59 59 58 58 58 58 58 58 59 59 59 59 60 60 60 60 59 59 59 58 58 59 59 59 59 59 59 59 60 60 60 60 60 60 60 60 60 59 59 58 58 58 58 57 57 57 57 57 57 58 58 58 59 59 59 59 60 60 60 60 60 60 60 60
6350 60 60 60 61 61 61 61 61 61 61 61 61 61 61 61 60 60 60 60 60 60 60 60 60 60 60 60 60 59 59 59 59 59 59 59 59 59 59 59 59 59 59 58 59 59 59 59 59 59 60 60 60 60 60 60 59 59 59 59 59 60 60 60 60 60 60 60 60 61 61 61
6302 61 61 61 61 61 61 61 61 60 60 60 60 59 59 59 59 59 59 59 59 59 59 59 59 60 60 60 60 60 60 60 60 61 61 60 60 60 60 60 59 59 59 60 60 60 60 60 60 60 60 61 61 61 61 61 61 61 61 61 61 61 61 61 61 61 61 61 60 60 60 60
6253 60 60 60 60 61 61 61 61 61 62 62 62 62 62 62 62 62 62 62 62 62 62 62 62 62 62 61 61 61 61 60 60 60 60 60 60 60 60 61 61 60 60 60 60 60 60 60 60 60 60 61 61 61 61 61 61 61 61 61 61 61 61 61 61 62 62 62 62 62 61 61
6205 61 61 61 61 61 61 61 62 62 62 63 63 63 63 63 63 63 63 62 62 61 61 61 61 61 61 61 62 62 62 61 61 61 61 61 61 61 61 61 61 61 61 62 62 62 62 62 63 63 63 63 63 63 63 62 62 61 61 61 61 61 61 62 62 62 62 62 62 62 62 62
6156 62 62 62 61 62 62 62 62 62 62 62 62 63 63 63 63 63 63 63 63 63 63 63 63 63 63 64 64 64 64 64 64 64 64 64 64 64 64 64 64 65 65 65 65 65 65 65 65 65 64 64 64 64 64 64 64 64 64 64 64 64 64 64 64 64 65 65 65 64 64 64
6108 64 64 64 64 64 64 64 64 64 64 64 64 64 64 64 64 64 64 64 64 64 64 64 64 64 64 64 64 64 64 64 64 63 63 63 63 63 63 63 63 64 64 63 63 63 63 64 64 64 64 64 64 64 64 64 64 64 64 64 64 65 65 65 65 65 65 66 66 66 66 66
6059 66 66 66 66 66 66 66 66 66 66 66 66 66 65 65 65 65 65 66 65 65 65 65 65 65 65 65 65 66 66 66 65 65 65 65 65 65 65 65 64 64 64 64 64 65 65 65 65 66 66 67 67 67 67 67 67 67 67 67 67 67 67 67 67 67 67 67 67 67 67 66
6011 66 66 66 66 66 66 66 67 67 67 68 67 67 67 67 67 67 67 67 66 66 66 66 66 66 67 67 67 67 67 67 67 67 67 67 67 67 67 68 68 68 68 68 68 68 68 68 68 67 67 67 66 66 67 67 67 67 67 68 68 68 68 67 67 67 67 67 67 67 67 67
5962 67 67 67 67 67 67 67 67 67 68 68 68 68 68 69 69 69 69 69 69 69 68 68 69 69 69 69 69 69 68 68 68 69 69 69 69 69 69 70 69 69 69 69 69 70 70 70 70 70 70 70 70 70 70 70 70 71 71 71 71 70 70 70 69 69 69 68 68 68 68 68
5913 68 68 69 69 69 69 69 69 69 69 69 70 70 70 70 71 71 71 71 71 71 71 71 71 71 71 71 71 71 71 71 71 71 70 70 70 70 70 70 70 70 70 70 71 71 71 71 71 71 71 71 71 71 71 71 71 71 71 71 71 71 71 71 71 71 71 71 71 70 70 70
5865 70 70 70 71 71 71 71 71 71 71 71 71 71 71 71 71 71 71 72 72 72 72 72 72 73 72 72 72 72 71 72 72 72 72 72 72 72 72 72 72 72 72 72 72 72 72 72 73 73 74 74 74 74 74 74 74 74 74 74 74 74 74 74 74 74 74 74 74 74 74 74
5816 74 73 73 73 73 73 73 73 73 74 74 74 74 73 73 73 73 73 74 74 74 74 74 74 74 74 75 75 74 74 74 74 74 74 75 75 75 75 75 74 74 74 74 74 74 74 74 73 73 73 74 74 74 75 75 75 75 76 76 76 76 76 76 76 76 76 75 75 75 74 75
5768 75 74 74 75 75 75 75 75 75 75 75 75 75 75 75 75 75 75 75 75 75 76 75 75 75 74 74 74 75 75 75 76 76 76 76 76 75 75 75 75 75 75 75 75 75 75 75 75 75 75 75 76 76 76 76 76 76 76 76 76 76 76 76 76 76 76 76 76 76 77 77
5719 77 77 77 77 77 77 77 77 77 78 78 78 79 78 78 78 78 78 78 78 78 78 78 78 78 78 78 79 79 78 78 78 78 78 78 78 78 78 78 78 79 79 79 79 79 79 79 79 79 78 78 78 78 78 78 78 79 79 79 80 80 80 80 80 80 80 80 80 80 80 79
5671 79 79 79 79 79 79 79 79 78 78 78 78 78 78 79 79 79 79 79 79 79 80 80 80 80 80 80 80 81 81 81 81 82 82 81 81 81 81 81 81 81 81 81 81 81 81 81 81 81 81 81 81 81 81 81 81 81 81 81 81 81 81 81 81 81 81 81 81 80 80 80
5622 80 80 80 80 80 80 80 80 80 80 80 81 81 82 82 82 82 82 82 83 83 83 83 83 83 83 83 84 84 84 84 84 84 84 84 84 84 83 83 84 84 84 84 85 85 85 85 85 86 86 86 85 85 85 85 85 85 85 85 85 85 85 85 85 85 85 85 86 86 86 86
5574 86 85 85 85 85 85 85 85 85 85 86 86 85 86 85 86 86 85 86 86 86 86 86 86 86 86 85 86 86 86 86 86 86 87 87 87 87 88 88 88 87 87 87 86 86 86 86 87 87 88 88 88 88 88 88 88 88 88 88 88 88 88 88 88 89 89 89 89 88 88 88
5525 88 88 88 88 88 89 89 89 89 88 88 88 88 88 88 88 88 88 88 88 88 88 88 89 88 88 88 88 88 88 88 88 88 89 89 90 90 90 90 90 90 90 90 89 89 89 89 89 89 89 89 89 89 89 89 90 90 90 90 90 90 90 90 90 90 90 91 91 91 91 91
5476 91 91 91 91 91 90 90 90 90 90 90 90 90 91 91 91 91 91 92 92 92 91 91 92 92 92 92 93 93 93 93 93 92 92 92 92 92 91 91 91 91 92 92 92 92 93 93 93 93 93 93 93 94 94 94 94 94 94 94 94 94 94 94 94 94 94 94 95 95 95 95
5428 95 95 95 95 95 95 95 95 95 95 95 95 95 95 95 95 95 96 96 96 96 96 96 96 96 96 96 96 96 96 96 97 97 97 97 96 96 97 97 97 98 97 97 97 97 97 97 97 97 97 98 98 99 99 99 100 100 100 100 99 99 98 98 98 98 98 98 99 99 99 99
5379 99 99 99 99 99 98 98 98 99 99 99 99 100 100 101 101 101 100 100 100 99 99 99 99 99 99 99 99 99 99 99 99 99 99 99 99 99 99 99 99 100 100 100 100 100 100 100 100 100 100 100 101 101 102 102 102 103 103 103 103 103 103 103 103 103 103 103 103 103 103 103
5331 103 103 103 102 102 102 102 102 102 102 102 102 103 103 103 103 104 104 104 104 104 104 104 104 104 104 104 104 104 104 105 105 105 106 106 105 105 105 105 105 105 105 106 106 107 107 107 108 108 108 108 108 108 107 107 107 107 107 107 107 108 108 108 108 108 108 108 109 109 109
5283 109 109 109 109 109 109 110 110 110 110 110 110 110 110 110 110 110 110 110 110 110 110 110 110 110 110 110 111 111 111 111 112 112 112 112 112 112 112 112 112 113 113 113 113 113 113 113 113 114 114 114 114 113 113 113 113 113 113 113 113 113 113 113 114 114 114 115 115 115 115
5235 115 116 116 116 116 115 115 114 114 114 113 113 114 114 114 115 116 116 116 116 116 116 115 115 115 116 116 116 116 116 116 116 116 116 116 116 117 117 117 117 117 118 118 118 118 119 119 119 119 120 120 120 120 119 119 119 119 119 119 119 120 120 120 120 120 120 120 120 120 120
5187 120 120 120 120 120 120 121 121 121 122 122 122 123 123 123 123 124 124 124 124 124 124 124 124 123 123 124 124 124 124 124 124 124 124 123 123 123 123 123 123 123 124 124 124 124 125 125 125 125 125 125 125 125 125 125 125 125 125 125 125 126 126 126 127 127 127 128 127 128 128
5139 128 128 128 128 128 128 129 129 130 130 130 130 130 131 131 131 131 131 131 131 131 131 132 132 132 132 132 132 132 132 132 132 132 132 133 133 133 133 133 133 133 133 133 133 133 133 134 134 134 135 135 135 135 135 135 135 135 135 136 136 136 136 136 137 137 137 137 137 137 137
5092 137 137 137 137 137 137 138 138 138 138 138 138 138 138 138 139 139 139 138 139 139 139 139 139 139 140 140 140 141 141 141 142 142 142 142 142 142 142 142 142 142 142 142 142 142 143 143 144 144 144 145 145 145 145 145 145 145 145 144 144 144 143 143 143 143 144 144 145 145 145
5044 145 145 146 146 147 147 148 148 148 149 149 149 150 150 150 150 150 150 150 150 150 150 150 150 150 151 151 151 151 151 152 152 152 152 153 153 153 153 153 154 154 154 154 154 154 154 154 154 155 155 155 156 156 156 157 157 157 157 157 157 158 158 158 158 158 159 159 159 159 159
4996 159 159 159 159 159 159 160 160 160 160 160 160 160 160 160 160 160 161 161 161 162 162 162 162 163 163 164 165 165 166 166 166 166 166 166 166 166 166 166 166 166 166 167 167 167 168 168 168 168 168 168 168 168 168 168 169 169 169 170 170 170 171 171 171 171 171 171 171 171 172
4948 172 172 172 173 173 174 174 174 175 175 175 175 175 176 176 176 177 177 177 177 177 177 177 177 177 178 178 178 178 178 178 178 178 178 179 179 179 179 180 180 180 181 181 182 182 182 182 183 183 183 183 183 184 184 184 185 185 185 186 186 186 187 187 188 188 188 189 189 190 190
4900 190 189 189 189 189 189 189 189 190 190 190 190 191 191 192 193 193 193 193 193 193 193 193 193 194 194 194 194 194 195 195 195 196 196 197 197 197 197 198 198 198 198 198 199 199 199 199 199 200 200 200 200 201 201 202 202 202 203 203 203 204 204 204 205 205 205 206 206 206 207
4852 207 207 207 207 207 207 207 207 207 208 208 208 209 209 209 210 210 210 210 211 211 211 212 212 213 213 214 214 215 215 215 215 216 216 216 216 217 217 218 218 218 218 219 219 219 219 219 220 220 220 220 221 221 221 221 222 222 223 223 224 224 225 225 226 226 227 227 228 229 229
4804 229 230 230 231 231 231 231 231 231 231 231 232 232 233 233 234 234 234 235 235 235 236 236 237 237 237 237 237 236 236 236 237 237 237 238 239 239 240 240 241 242 242 243 243 244 244 244 244 244 245 245 245 245 245 246 246 246 247 247 248 248 249 249 249 249 249 249 250 250 250
4757 250 251 251 252 252 253 253 253 253 254 254 254 254 254 255 255 255 256 256 257 257 258 258 259 259 260 261 261 262 263 263 264 265 265 265 266 266 266 267 267 268 268 268 268 268 269 269 269 270 270 270 271 271 272 272 272 273 273 273 274 274 274 275 276 276 277 278 278 279 279
4709 279 279 280 280 280 281 281 281 281 281 281 282 283 283 284 285 285 285 286 286 287 287 287 287 287 287 287 288 288 289 290 290 290 290 291 291 291 292 292 292 293 294 294 295 295 296 297 298 298 298 299 299 299 300 300 301 301 302 302 303 303 303 304 304 304 304 304 304 304 304
4661 304 304 305 305 306 306 307 307 307 307 307 307 308 308 308 309 309 309 309 309 309 310 310 311 311 311 312 312 312 313 313 313 314 314 314 314 315 315 316 316 316 317 317 317 317 317 318 318 318 318 318 319 319 319 319 320 320 321 321 321 322 322 322 322 322 323 323 323 324 324
4613 324 325 325 325 325 325 325 325 326 326 326 326 327 327 327 327 327 327 327 328 328 328 328 329 329 329 329 329 329 329 329 329 330 330 330 330 330 330 330 330 330 330 330 329 329 329 329 329 329 329 328 328 328 328 328 328 328 328 328 328 328 328 329 329 329 329 329 329 328 328
4565 328 328 328 328 327 327 327 327 327 327 327 327 327 327 327 327 327 327 327 327 326 326 326 326 326 327 327 327 327 327 326 326 326 325 325 325 325 324 324 324 323 323 323 323 323 323 323 322 322 322 321 321 321 320 319 319 318 318 317 317 316 316 315 315 315 314 314 313 313 313
4517 313 313 312 312 312 312 312 312 311 311 310 310 310 309 309 308 308 308 307 307 306 305 305 304 304 304 303 303 302 302 301 301 300 300 299 298 298 297 297 297 296 296 295 295 294 293 293 292 291 291 290 289 289 288 287 286 285 284 284 283 283 282 281 281 280 280 280 279 279 278
4469 278 278 277 277 276 275 275 274 274 273 272 271 271 269 268 267 266 265 265 264 263 262 261 260 260 259 258 258 257 257 256 255 255 254 253 253 252 251 250 250 249 248 247 246 245 244 243 243 242 241 241 240 239 238 237 237 236 235 235 235 234 234 233 232 231 230 229 228 227 226
4422 226 225 224 223 223 222 221 220 219 219 218 217 217 216 216 215 214 214 213 213 212 212 211 210 210 209 208 207 206 206 205 204 203 202 201 201 200 199 198 197 196 195 194 194 193 192 191 191 190 189 189 189 188 188 187 187 186 185 184 184 183 182 181 180 179 179 178 177 176 176
4374 176 175 174 174 173 172 171 171 170 169 169 168 167 166 165 165 164 163 162 162 161 160 160 159 159 158 158 157 157 156 155 154 153 153 152 151 150 149 149 148 147 147 147 146 146 145 145 144 143 142 141 140 139 139 138 138 138 138 137 137 136 136 135 134 133 133 132 131 130 130
4326 130 129 129 129 129 128 128 127 127 126 126 125 125 124 124 124 123 123 122 122 121 121 120 120 119 118 118 117 116 115 115 114 113 112 112 111 110 110 109 109 108 108 107 106 106 106 105 105 104 104 103 103 103 102 102 102 101 101 100 99 99 98 98 97 97 97 96 95 95 94
4278 94 93 93 92 92 92 91 91 91 90 90 90 89 89 89 88 88 87 86 86 85 85 84 84 84 84 83 83 83 82 82 82 81 81 81 81 80 80 80 80 79 79 79 79 79 79 79 78 78 77 77 76 76 75 75 75 74 74 73 73 72 72 71 71 70 70 70 69 69 69 68
4229 68 68 68 68 68 68 68 67 67 66 66 65 65 65 65 64 64 64 64 63 63 63 63 63 63 62 62 62 62 62 62 61 61 61 61 60 60 60 60 60 59 59 58 58 57 57 57 56 56 56 55 55 55 54 54 54 54 54 53 53 53 52 52 52 51 51 51 51 51 50 50
4181 50 50 50 50 51 51 51 51 51 50 49 49 48 48 47 47 47 47 46 46 46 46 46 46 46 45 45 45 45 45 45 45 45 45 45 44 44 44 44 44 44 43 43 43 43 43 43 43 43 42 42 42 42 41 41 41 40 40 40 39 39 39 39 39 39 39 38 38 38 38 38
4132 38 38 37 37 37 37 36 36 36 36 36 36 36 36 36 37 37 37 37 36 36 36 36 36 35 35 35 35 35 35 35 35 35 35 35 34 34 34 34 34 33 33 33 33 32 33 33 33 34 34 34 34 34 34 34 34 34 34 34 34 34 34 33 33 33 33 32 32 32 32 31
4084 31 31 31 30 30 30 30 31 31 30 30 30 30 30 30 30 30 30 30 30 30 30 30 30 30 29 29 29 29 29 28 28 28 28 28 28 28 28 29 29 29 29 29 29 28 28 28 28 27 27 27 27 27 27 27 27 27 27 27 27 27 27 27 26 25 25 24 24 24 24 24
4035 24 24 24 24 24 24 24 24 24 24 24 23 23 23 23 23 23 24 24 24 25 25 25 25 25 25 26 26 26 26 26 26 26 26 26 26 26 26 26 25 25 25 25 25 25 25 25 26 26 26 26 26 26 26 26 26 26 26 26 26 26 26 26 26 26 26 25 25 25 25 25
3987 25 25 25 25 25 25 26 26 25 25 25 24 24 24 24 24 24 25 25 25 24 24 24 24 24 24 24 24 25 25 25 25 25 25 24 24 24 24 24 24 24 24 24 24 24 25 25 25 25 25 25 26 26 26 26 26 27 26 26 26 25 25 25 25 25 25 25 26 26 26 26
3938 26 26 26 26 26 25 25 25 25 26 26 26 26 26 26 26 25 25 25 25 26 26 26 26 26 26 25 25 25 25 25 25 25 26 26 26 26 26 26 25 25 25 26 26 26 26 27 27 27 28 28 28 28 28 28 28 28 27 27 27 27 27 27 27 26 26 26 26 26 26 26
3890 26 26 26 26 25 25 25 25 25 25 25 25 25 25 25 25 25 25 25 25 25 25 25 25 25 25 25 25 25 25 25 25 24 24 24 24 24 23 23 23 23 23 23 23 23 23 23 23 24 24 24 24 24 24 24 24 24 24 24 24 24 24 24 24 24 24 24 24 24 24 24
3841 24 24 24 23 23 23 23 22 22 22 22 22 22 21 21 21 21 21 21 21 21 21 22 22 22 22 22 22 21 21 21 21 20 20 20 20 20 20 19 19 19 19 19 20 20 20 19 19 19 19 19 19 19 19 19 19 19 19 19 20 20 19 19 19 19 19 19 18 18 19 19
3792 19 19 19 19 18 18 18 18 18 18 18 18 18 18 18 18 18 18 17 17 17 17 17 16 16 16 16 16 16 16 16 16 16 16 16 16 16 16 16 16 16 16 16 16 16 16 16 16 16 16 16 16 16 16 16 16 16 15 15 15 15 15 14 14 14 14 14 14 14 14 14
3744 14 14 14 13 13 14 14 14 15 15 15 16 16 17 17 17 16 16 15 15 15 15 15 15 15 16 16 16 16 16 16 15 15 15 14 14 13 13 13 13 13 13 13 12 12 12 12 12 12 12 12 12 13 13 13 13 13 13 13 13 13 13 13 13 13 13 13 13 13 12 12
3695 12 12 12 12 12 12 12 12 12 12 12 12 13 13 13 14 14 14 14 14 13 13 13 13 13 13 13 13 13 13 13 13 14 14 14 14 14 14 14 13 13 13 13 13 13 14 15 15 15 15 15 15 15 16 16 16 16 15 15 15 15 15 15 15 15 14 14 14 14 13 13
3647 13 13 13 13 13 13 13 12 12 12 12 12 12 12 13 13 13 13 13 13 13 13 13 13 13 13 13 13 14 14 14 14 14 13 13 13 13 13 13 13 13 13 13 13 13 13 13 13 13 12 12 12 11 11 11 11 12 12 13 13 14 14 14 14 14 14 14 14 14 13 13
3598 13 13 13 13 12 12 12 13 13 13 14 14 14 14 14 14 14 14 13 14 14 14 14 14 14 14 14 14 15 15 15 15 15 15 15 15 14 14 14 14 14 14 15 15 14 15 14 14 14 13 13 13 13 12 12 12 12 12 12 12 12 12 12 12 13 13 13 13 13 13 13
3550 13 14 14 14 14 15 15 14 14 14 14 14 14 14 14 14 14 14 13 13 13 13 13 14 14 14 14 13 13 13 13 13 13 13 13 13 13 13 13 13 13 13 13 13 13 13 13 13 13 13 13 13 13 13 13 13 13 13 13 13 12 13 13 13 13 13 13 13 14 14 14
3501 14 14 14 14 13 13 13 13 14 14 14 14 14 14 14 14 15 14 14 14 14 14 14 14 14 14 14 15 15 15 15 15 15 15 15 15 15 14 14 14 14 14 13 14 14 14 14 14 14 14 14 14 14 14 14 14 14 14 14 14 14 14 15 15 15 14 14 14 13 13 13
3453 13 13 13 14 14 14 14 15 15 16 16 16 15 15 15 15 15 15 15 15 15 15 15 15 15 15 16 16 16 15 15 15 15 15 15 15 15 15 15 14 14 14 14 14 14 14 15 15 15 15 15 15 15 15 15 15 16 15 15 15 15 15 14 14 14 14 14 15 15 15 15
3404 15 16 16 16 16 17 17 17 16 16 16 16 16 16 16 16 16 16 16 16 16 16 16 16 16 15 15 15 15 15 16 16 16 16 16 16 15 15 15 15 15 15 15 14 14 14 14 14 14 14 14 15 15 15 15 15 15 15 15 14 14 15 15 15 15 16 16 16 16 16 16
3355 16 16 16 16 16 16 16 16 17 17 18 18 18 18 18 18 18 18 18 18 19 19 19 19 18 18 17 17 17 17 17 17 17 17 17 17 17 17 16 16 16 16 16 16 16 16 16 16 16 16 16 16 16 16 16 16 16 16 16 16 16 16 16 17 17 17 17 17 17 17 17
3307 17 17 17 18 18 18 18 18 18 18 18 18 18 18 18 18 18 18 18 18 18 17 17 17 17 17 17 18 18 18 18 18 18 18 18 18 18 18 18 18 18 18 17 17 17 17 16 16 16 16 15 16 16 16 16 17 17 17 17 17 18 18 18 18 18 18 18 18 18 19 19
3258 19 19 19 19 19 19 18 18 18 18 18 18 18 18 18 18 18 18 18 18 18 18 18 19 19 19 19 19 19 19 19 19 19 19 19 18 18 18 18 18 18 18 18 18 18 18 18 19 19 19 19 19 19 19 19 19 19 19 19 19 20 20 20 20 20 20 20 20 20 19 19
3210 19 19 18 18 18 18 18 17 17 17 17 17 17 17 17 17 17 17 17 17 17 17 17 17 17 17 18 18 18 18 18 19 19 19 19 19 19 19 19 19 19 19 19 19 19 19 19 19 19 19 19 19 20 20 20 20 20 20 20 20 20 20 20 20 20 20 20 21 21 21 21
3161 21 21 21 21 21 21 21 20 20 20 20 20 20 20 20 20 20 20 20 20 20 20 20 21 21 21 21 21 22 22 21 21 21 21 21 21 21 21 21 21 21 21 21 21 20 20 20 20 20 20 20 20 20 21 21 21 21 21 21 21 21 21 21 21 21 21 20 20 20 20 20
3113 20 20 20 20 20 20 20 20 20 20 20 21 21 21 21 21 21 21 21 21 21 21 21 21 21 21 21 21 21 22 22 22 22 22 22 22 22 22 22 22 22 22 22 23 23 23 23 23 22 22 22 22 22 22 22 22 22 22 23 23 23 23 23 23 23 23 23 23 24 24 24
3064 24 24 24 24 23 23 23 22 22 22 22 21 21 21 21 21 21 21 21 21 22 22 22 23 23 23 23 23 22 22 22 22 22 22 22 23 23 23 23 23 23 24 24 24 24 24 23 23 23 23 23 23 23 23 23 23 23 23 23 23 23 23 23 23 23 23 23 22 22 22 22
3016 22 22 22 22 23 23 23 23 23 23 23 23 23 23 23 23 23 23 23 23 23 22 22 22 22 22 22 22 22 21 21 21 21 21 21 21 22 22 23 23 23 23 23 23 23 23 23 23 23 23 23 23 23 24 24 24 24 24 24 24 24 23 23 23 23 23 23 23 23 23 23
2967 23 23 23 23 23 23 23 23 23 23 23 22 22 23 23 23 23 23 23 23 24 24 24 24 24 24 24 24 24 24 24 23 23 23 23 23 23 23 23 23 23 23 24 24 24 24 24 25 25 25 25 25 25 25 24 24 24 25 25 25 25 25 25 25 25 25 25 24 24 23 23
2919 23 22 22 22 22 23 23 23 23 23 23 23 23 23 23 23 23 24 24 24 25 25 25 24 24 24 23 23 23 23 23 23 23 23 23 23 23 23 23 23 23 23 24 24 24 24 24 24 24 24 24 24 24 24 24 24 24 24 25 25 25 25 25 25 26 26 26 26 26 27 27
2870 27 27 27 26 26 26 26 26 26 26 26 26 26 26 26 26 26 26 26 27 27 27 27 26 26 27 27 27 27 27 26 26 26 26 25 25 25 25 25 25 25 26 26 26 26 26 26 26 26 26 26 26 26 26 26 26 26 26 26 26 26 26 26 26 26 26 26 26 26 26 26
2821 26 26 26 26 27 27 27 27 27 27 27 27 27 27 26 26 26 25 25 25 25 25 25 25 25 25 25 25 26 26 26 26 26 27 27 27 27 27 27 27 27 27 27 27 27 26 26 27 27 27 27 27 27 27 27 27 27 27 27 27 27 27 27 28 28 28 28 29 29 29 30
2773 30 30 30 30 31 31 30 30 30 30 30 29 29 29 29 28 28 28 28 28 27 27 27 27 27 27 27 27 27 27 27 28 28 28 28 28 28 28 28 28 28 28 28 28 29 29 29 30 30 30 30 30 29 29 29 28 28 28 28 28 28 28 27 27 27 27 27 27 27 27 28
2724 28 28 28 28 28 28 28 28 28 28 28 28 28 29 29 29 29 29 29 28 28 28 28 28 28 28 28 28 28 28 29 29 29 29 30 30 30 30 30 30 30 30 30 31 31 31 31 31 31 31 31 31 30 30 30 30 30 30 30 30 30 30 30 30 30 30 30 29 29 29 29
2676 29 30 30 30 31 31 31 31 31 31 31 31 31 31 31 31 30 31 31 31 31 31 32 32 32 32 32 32 32 32 31 31 31 30 30 30 29 29 29 29 29 29 30 30 30 30 30 30 30 30 30 30 30 30 30 30 30 30 30 30 31 31 31 31 31 31 31 32 32 32 32
2627 32 32 32 33 33 34 34 34 34 34 33 33 33 32 33 33 33 33 34 34 34 34 34 34 34 34 34 34 34 34 34 34 34 33 33 33 33 33 33 34 34 34 34 34 34 34 34 34 34 34 33 34 34 34 34 34 34 34 34 34 34 34 34 34 34 34 34 34 34 34 33
2579 33 33 33 33 34 34 34 34 35 35 35 35 35 35 34 34 34 34 34 34 34 34 34 34 34 34 34 34 34 34 33 33 33 33 33 33 33 33 33 33 34 34 34 34 34 34 33 33 33 33 33 34 34 34 34 34 34 34 34 34 34 34 35 35 35 35 35 35 35 35 35
2530 35 35 34 34 34 34 34 34 34 34 35 35 35 35 35 36 36 36 36 36 36 36 36 36 36 36 36 36 37 37 37 37 37 37 38 37 37 37 37 37 37 36 36 36 36 36 35 35 35 35 35 35 35 35 35 35 35 35 35 35 35 35 35 36 36 36 37 36 36 36 36
2482 36 36 36 36 36 36 36 36 35 35 34 34 34 34 35 35 35 35 35 35 35 35 35 35 35 36 36 36 36 37 37 38 38 38 38 38 38 38 37 37 37 37 37 37 37 37 37 37 37 37 37 37 37 37 37 37 37 38 38 38 38 38 37 37 37 37 38 38 38 38 38
2433 38 38 38 38 38 38 38 38 37 37 37 37 37 37 37 37 37 37 37 37 37 38 38 39 39 39 39 39 40 40 40 40 40 40 40 40 39 39 39 39 38 38 38 38 38 38 38 38 38 38 38 38 38 38 38 38 38 38 38 38 37 37 38 38 38 38 38 38 38 38 38
2384 38 39 39 39 39 39 39 39 39 39 39 39 39 39 39 39 40 40 40 40 40 39 39 39 39 39 39 39 39 39 39 39 39 39 39 39 39 39 39 39 40 40 40 40 40 40 40 40 39 39 39 39 39 39 39 39 40 40 40 41 41 41 40 41 41 41 41 41 41 41 41
2336 41 42 42 42 42 42 43 42 42 42 42 42 42 41 41 41 41 41 42 42 41 41 41 41 41 41 41 41 41 41 41 41 41 40 40 40 40 41 41 41 41 41 41 41 41 41 42 42 42 42 42 42 42 41 41 41 41 42 42 42 43 43 43 43 43 44 44 44 44 44 44
2287 44 45 45 45 45 45 45 45 45 45 45 45 45 44 44 44 44 44 44 44 44 44 44 44 44 44 44 44 43 43 43 42 42 42 42 43 43 43 44 44 45 45 45 45 45 45 45 45 45 45 46 46 46 46 46 46 45 45 45 45 45 45 44 44 44 44 44 43 43 43 44
2239 44 44 44 44 44 44 44 44 44 44 44 44 45 45 45 45 45 45 45 45 45 45 45 45 45 45 45 45 46 46 46 47 47 47 47 47 47 47 47 48 48 48 48 48 48 48 49 49 49 49 49 49 49 48 48 48 48 48 48 48 48 49 49 49 50 50 50 50 50 49 49
2190 49 49 49 49 49 49 49 49 49 48 48 47 47 47 47 47 48 48 48 48 48 48 49 49 49 50 50 50 51 51 50 50 50 50 50 50 49 49 49 49 49 49 49 49 49 49 49 49 49 49 49 50 50 50 51 51 51 51 51 50 50 50 50 51 51 51 51 51 51 51 51
2142 51 52 52 52 52 52 52 51 51 51 51 51 51 51 51 51 52 52 52 53 53 53 54 54 54 53 53 53 52 52 51 51 51 51 51 51 51 51 52 52 52 52 52 53 53 53 53 53 53 52 52 52 52 52 52 53 53 53 53 54 54 54 55 55 55 55 55 55 55 55 55
2093 55 55 55 55 55 55 55 55 55 55 55 55 56 55 55 55 55 55 55 55 55 55 55 55 56 56 56 56 56 56 55 55 55 55 55 55 55 55 55 56 56 56 56 56 56 56 56 57 57 57 57 57 57 57 57 58 58 58 58 58 58 58 58 59 59 59 59 59 59 59 59
2045 59 59 59 59 59 60 60 60 60 60 60 60 60 60 60 60 60 60 60 60 60 60 60 60 61 61 61 61 61 61 60 61 61 61 61 61 61 61 61 61 60 60 60 60 60 60 61 61 61 62 62 62 62 62 62 62 63 63 63 63 63 63 63 63 63 63 63 63 63 63 63
1996 63 63 62 62 62 62 62 62 62 62 63 63 63 64 64 64 64 65 65 65 65 65 65 65 65 65 65 65 65 65 65 65 66 65 65 65 65 65 65 65 65 65 65 65 66 66 66 67 67 67 68 68 68 68 68 68 68 68 68 68 68 68 68 69 69 69 69 69 69 69 69
1948 69 69 69 69 69 70 70 70 70 70 70 70 70 70 70 70 70 70 70 70 70 71 71 71 71 71 71 71 71 71 71 71 72 72 72 72 73 73 73 73 73 73 73 73 73 73 73 74 74 74 74 74 74 74 74 74 74 74 74 74 74 74 74 74 75 75 75 75 75 75 75
1899 75 75 75 75 75 75 75 76 76 76 77 77 77 78 78 78 79 79 79 79 79 78 78 78 78 78 79 79 79 79 79 79 79 79 80 80 80 80 80 81 81 81 81 82 82 82 81 81 81 81 81 81 81 81 81 81 80 81 81 81 82 82 82 83 83 83 83 83 83 83 83
1850 83 83 84 84 84 84 84 84 84 85 85 85 85 85 85 85 85 86 86 86 86 86 87 87 87 87 88 88 88 88 88 88 88 87 87 88 88 88 89 89 89 89 89 89 89 89 89 89 89 89 89 90 91 91 92 92 92 93 93 93 93 93 93 94 94 94 95 95 95 95 95
1802 95 95 95 95 96 96 96 96 96 96 96 96 97 97 97 97 97 97 97 97 97 97 97 97 97 97 97 97 97 97 97 97 97 97 97 97 97 97 97 98 98 99 100 100 100 101 101 101 101 102 102 102 103 103 104 104 104 105 105 105 105 105 105 105 105 106 106 106 106 106 106
1753 106 106 106 106 106 107 107 107 107 108 108 109 109 109 110 110 110 110 110 111 111 111 111 111 111 111 111 111 111 110 110 110 110 110 111 111 111 111 111 112 112 113 113 113 114 114 114 114 114 114 115 115 115 116 116 116 117 117 117 117 118 118 118 119 119 120 120 121 121 122
1705 122 122 123 123 123 123 123 123 123 123 124 124 124 124 124 124 125 125 125 126 126 126 127 127 127 127 127 128 128 128 129 129 129 129 129 130 130 131 131 131 132 132 132 133 134 134 135 135 135 136 136 137 137 138 138 138 138 138 139 139 139 140 140 140 141 141 141 141 141 141
1658 141 142 142 142 142 142 143 143 143 144 144 145 145 145 146 146 146 147 147 147 147 148 148 149 149 149 150 150 151 151 151 151 152 152 153 153 154 154 155 155 156 156 156 157 157 157 158 159 159 160 160 160 160 160 160 160 161 161 162 162 162 163 164 164 165 165 166 166 167 167
1610 167 167 167 168 168 169 169 170 170 171 171 172 173 173 174 174 174 175 175 175 176 176 177 177 178 178 179 179 180 180 181 181 181 182 182 182 183 184 184 185 186 186 186 187 187 188 188 189 189 190 190 191 192 193 194 194 195 195 196 196 196 197 197 198 198 199 200 200 201 202
1562 202 202 203 203 204 204 205 206 206 207 208 209 210 210 211 211 212 212 213 214 214 215 215 216 217 218 219 220 221 221 222 222 223 224 225 226 227 228 229 229 230 231 231 232 232 233 233 234 235 236 237 237 238 239 240 240 241 243 244 245 246 246 247 248 248 249 250 251 252 252
1514 252 253 254 255 255 256 257 258 259 260 261 261 262 263 264 265 266 268 269 269 270 271 272 273 275 276 277 278 279 279 280 281 281 282 283 284 285 286 287 288 289 290 291 292 293 294 296 297 298 299 300 301 303 304 305 306 308 309 310 311 312 313 314 316 317 318 319 321 322 323
1466 323 324 326 327 328 330 331 333 334 336 337 339 340 341 342 343 345 346 347 348 349 350 351 353 354 356 357 359 361 362 364 365 367 369 370 372 373 375 377 378 380 382 383 385 387 388 390 392 393 395 396 398 400 401 403 405 406 408 409 411 413 415 417 419 421 423 425 427 428 430
1418 430 432 434 436 438 441 443 445 448 450 453 455 457 460 462 464 467 469 471 473 475 477 480 482 485 487 490 492 494 497 499 502 504 506 509 511 514 516 519 521 524 527 529 532 535 538 541 544 547 549 552 555 557 560 562 565 568 571 574 577 581 584 587 590 594 597 600 604 607 610
1370 610 613 616 620 623 626 629 633 637 640 644 647 651 655 659 663 666 670 673 677 681 685 689 694 698 702 706 710 715 719 723 728 732 737 741 746 750 754 759 763 767 772 777 782 787 792 797 802 807 813 818 823 828 833 838 843 848 853 859 864 870 875 881 887 893 899 905 911 917 924
1323 924 930 937 944 951 957 964 971 977 984 991 998 1006 1013 1020 1027 1035 1042 1049 1057 1064 1071 1079 1087 1095 1103 1111 1119 1128 1136 1144 1152 1161 1170 1179 1188 1197 1206 1215 1224 1233 1243 1252 1262 1272 1282 1293 1303 1313 1324 1334 1344 1355 1365 1376 1386
1284 1386 1397 1409 1421 1433 1445 1457 1470 1482 1495 1508 1521 1534 1547 1560 1574 1587 1600 1614 1628 1642 1656 1671 1686 1701 1717 1733 1749 1765 1781 1797 1814 1831 1848 1864
1261 1864 1881 1898 1916 1934 1953 1972 1991 2010 2030 2050 2070 2090 2111 2132 2153 2175 2197 2219 2241 2264 2287 2310 2333 2358 2382 2407 2432 2458 2484 2511 2537 2564 2592 2620
1237 2620 2649 2678 2707 2737 2768 2799 2830 2863 2895 2929 2962 2996 3031 3066 3102 3138 3175 3212 3250 3289 3328 3368 3409 3450 3492 3535 3579 3623 3668 3714 3761 3808 3857 3907
1214 3907 3958 4009 4062 4115 4169 4224 4280 4337 4396 4455 4516 4578 4641 4705 4771 4838 4906 4976 5046 5118 5191 5266 5343 5421 5501 5582 5665 5750 5836 5924 6014 6105 6199 6294
1190 6294 6392 6491 6593 6697 6803 6911 7022 7135 7251 7369 7489 7612 7738 7866 7997 8132 8269 8410 8553 8700 8850 9003 9159 9319
1173 9319 9483 9650 9822 9997 10176 10359 10546 10738 10933 11133 11338 11547 11761 11979 12203 12431 12664 12902 13146 13394 13648 13908 14173
1158 14173 14443 14719 15001 15288 15582 15880 16185 16495 16811 17132 17460 17793 18131 18476 18825 19180 19539 19904 20273 20647 21025 21407 21792
1142 21792 22181 22572 22966 23362 23759 24157 24556 24955 25352 25749 26143 26534 26921 27303 27680 28050 28412 28767 29113 29448 29772 30085 30384
1126 30384 30669 30940 31194 31432 31653 31855 32039 32204 32348 32472 32574 32655 32715 32752 32767 32760 32731 32680 32607 32513 32398 32263 32108 31934 31741 31531
1108 31531 31303 31059 30800 30526 30238 29938 29626 29304 28971 28629 28280 27923 27560 27192 26820 26444 26064 25683 25300 24916 24532 24148 23765
1092 23765 23383 23003 22626 22250 21878 21509 21144 20783 20426 20073 19725 19381 19042 18709 18380 18057 17739 17426 17118 16816 16519 16228 15942
1076 15942 15662 15387 15117 14852 14593 14338 14089 13844 13605 13371 13141 12917 12697 12481 12270 12064 11861 11664 11470 11280 11095 10913 10736
1060 10736 10561 10391 10224 10061 9901 9745 9592 9442 9295 9151 9011 8873 8738 8606 8477 8351 8227 8106 7987 7870 7756 7644 7534
1044 7534 7427 7321 7218 7117 7018 6921 6826 6733 6641 6551 6464 6377 6293 6210 6129 6049 5971 5894 5818 5744 5672 5600 5531 5462 5395 5329 5264 5200 5138 5076 5016 4956
1022 4956 4898 4841 4784 4729 4674 4621 4568 4517 4466 4416 4366 4318 4271 4224 4178 4134 4089 4046 4003 3960 3919 3878 3838 3799 3760 3722 3684 3647 3611 3575 3540 3505 3471 3438
998 3438 3405 3372 3340 3308 3277 3246 3216 3186 3156 3127 3099 3071 3043 3016 2989 2962 2936 2909 2884 2859 2834 2809 2785 2762 2738 2716 2693 2670 2648 2626 2604 2582 2561 2540 2519
974 2519 2499 2479 2459 2439 2420 2401 2383 2364 2346 2328 2311 2293 2276 2259 2243 2227 2210 2194 2178 2163 2147 2131 2116 2101 2087 2072 2058 2044 2030 2016 2002 1989 1975 1962 1948
949 1948 1935 1922 1909 1897 1885 1873 1861 1849 1837 1825 1814 1802 1791 1780 1769 1757 1746 1735 1724 1713 1703 1692 1682 1672 1662 1652 1642 1633 1624 1614 1605 1597 1588 1579 1570 1561 1553 1544 1536 1527 1519
921 1519 1510 1502 1494 1486 1478 1470 1463 1455 1448 1440 1433 1426 1418 1411 1404 1397 1390 1382 1376 1369 1362 1355 1348 1342 1335 1329 1323 1317 1311 1306 1300 1294 1288 1282 1277 1271 1266 1260 1254 1249 1243 1238 1233 1227 1222 1217 1211 1206 1201 1196 1191 1186 1182 1177 1172 1168 1163 1158 1154 1150 1145 1141 1137 1133 1129 1125 1121 1118 1114
873 1114 1110 1106 1102 1098 1094 1090 1086 1082 1079 1075 1072 1068 1065 1061 1058 1055 1051 1048 1045 1042 1039 1035 1032 1029 1026 1023 1020 1017 1014 1011 1008 1005 1002 1000 997 994 992 990 988 986 984 981 979 977 975 973 971 969 967 965 963 960 958 956 954 952 951 949 948 946 945 944 943 941 940 939 938 936 935
825 935 934 933 932 931 930 929 928 927 926 925 925 924 923 922 921 920 919 918 917 917 917 917 917 916 916 916 917 917 917 917 917 917 918 919 919 920 921 921 922 923 924 925 926 927 928 929 930 931 932 933 935 937 939 940 942 944 946 949 951 953 956 958 961 963 966 968 971 974 977 981
777 981 985 989 993 997 1001 1005 1009 1013 1018 1022 1027 1032 1037 1043 1048 1053 1059 1064 1070 1075 1081 1088 1094 1101 1109 1116 1124 1131 1139 1148 1157 1166 1175 1184 1194 1204 1214 1224 1235 1246 1257 1269 1282 1295 1308 1321 1335 1348 1363 1377 1392 1408
741 1408 1424 1440 1457 1475 1493 1511 1530 1549 1569 1590 1611 1633 1655 1678 1702 1726 1750 1776 1802 1829 1856 1884 1913 1943 1973 2004 2036 2069 2102 2136 2170 2205 2241 2277 2314
716 2314 2351 2389 2428 2467 2507 2547 2588 2629 2670 2711 2753 2795 2836 2878 2919 2960 3001 3041 3080 3119 3156 3193 3229 3263 3296 3327 3356 3384 3411 3435 3457 3478 3496 3512 3526
692 3526 3537 3546 3552 3555 3556 3555 3551 3544 3535 3524 3510 3494 3476 3456 3434 3410 3384 3357 3328 3297 3266 3233 3199 3165 3129 3093 3056 3018 2981 2943 2905 2866 2828 2789 2751 2712 2674 2636 2598
665 2598 2561 2524 2488 2452 2416 2381 2346 2312 2279 2247 2214 2182 2151 2120 2090 2060 2031 2003 1976 1949 1922 1897 1872 1847 1823 1799 1776 1753 1730 1708 1687 1666 1646 1626 1607
641 1607 1588 1570 1552 1535 1518 1502 1485 1470 1454 1439 1424 1409 1395 1381 1367 1354 1341 1328 1315 1303 1291 1280 1268 1257 1247 1236 1226 1215 1206 1196 1187 1177 1168 1159 1151 1142 1134 1126 1118
614 1118 1110 1102 1095 1088 1081 1074 1067 1060 1053 1047 1041 1035 1029 1023 1017 1012 1006 1000 995 990 985 980 975 970 965 961 956 951 947 943 939 935 931 927 923 919 915 911 907 903 900 896 893 890 887 884 881 878 875 873 870 867 865 863 861 858 856 854 852 850 848 846 845 843 841 839 838 836 835
566 835 833 832 831 831 830 829 828 827 827 826 825 825 825 825 824 824 824 824 824 824 824 824 824 825 825 826 826 827 828 828 829 830 831 832 834 835 837 838 840 841 843 845 846 848 851 853 856 859 861 864 867 870 872 875 878 881 884 887 890 894 897 900 904 908 911 915 919 923 927 931
517 931 935 939 944 948 952 956 960 963 967 971 975 979 983 986 990 994 997 1000 1003 1005 1008 1010 1013 1015 1017 1018 1020 1021 1022 1023 1023 1023 1023 1023 1023 1022 1021 1020 1018 1016 1014 1012 1009 1007 1004 1001 997 994 990 986 982 978 973 968 964 959 954 949 943 937 931 925 919 913 907 901 896 890 884 878
469 878 872 866 860 854 848 842 836 831 825 819 813 807 801 795 789 784 778 773 767 762 756 751 746 740 735 730 725 720 715 710 705 700 696 691 687 682 678 673 669 664 660 656 652 648 644 641 637 633 629 625 621 617 613 610 607 603 600 597 594 590 587 584 580 577 574 570 567 564 561 558
420 558 555 553 550 548 545 543 540 538 535 533 530 528 526 523 521 519 516 514 512 510 508 506 504 502 500 498 497 495 493 491 489 487 485 483 481 479 477 475 473 470 468 467 465 463 462 460 459 457 456 454 453 451 450 448 446 444 442 441 439 438 437 436 435 433 432 431 429 428 426 425
372 425 423 422 420 419 418 417 416 415 413 412 411 410 409 408 407 405 404 403 401 400 399 397 396 394 393 391 390 389 388 387 386 385 383 382 381 380 379 378 377 375 374 373 372 371 370 369 368 367 366 365 364 364 363 362 362 361 359 358 357 355 354 353 351 350 349 349 348 347 347 346
323 346 345 345 344 343 342 342 341 340 339 338 337 336 335 334 333 332 332 331 331 330 330 329 329 328 328 327 326 325 325 324 323 322 321 320 319 318 317 317 316 315 314 314 313 312 312 311 311 310 310 309 308 308 307 307 306 306 305 304 304 303 303 302 302 302 301 301 300 299 298 297
275 297 297 296 295 295 294 293 293 292 291 291 290 290 289 288 288 287 287 286 286 286 286 285 284 284 283 282 282 281 281 281 280 280 279 279 278 277 277 276 276 275 275 274 274 273 273 272 272 272 271 271 271 270 270 270 269 269 269 268 268 267 267 266 265 265 264 264 263 263 262 261
226 261 261 260 260 259 259 259 258 258 258 258 257 257 257 257 256 256 256 255 255 254 254 253 253 252 252 252 251 251 251 250 250 250 250 249 249 249 248 248 248 247 247 246 246 245 245 245 244 244 244 245 244 244 244 244 243 243 243 242 242 241 241 241 241 240 240 239 239 239 238 238
178 238 237 237 237 237 237 237 236 236 235 235 235 234 234 233 233 233 233 232 232 232 232 232 232 231 231 231 231 230 230 230 230 229 229 229 229 229 229 229 228 228 228 228 227 227 227 227 226 226 225 225 225 225 225 225 225 225 224 224 223 223 222 222 221 221 221 220 220 220 220 220
129 220 220 220 220 220 219 219 219 219 219 218 218 218 218 218 218 218 218 218 218 218 218 217 217 217 217 217 216 216 216 216 216 216 216 215 215 214 214 214 214 214 214 214 214 214 213 213 213 213 213 212 212 212 212 212 212 211 211 211 211 210 210 210 210 210 210 210 210 211 210 210
80 210 210 210 210 209 209 209 209 209 209 209 210 210 209 209 209 209 209 209 209 210 211 211 212 213 214 215 216 216 218 219 220 222 223 225 227 229 231 234 236 239 241 243 245 246 246 246 246 244 243 241 239 236 234 232 230 228 226 225 223 222 221 219 218 217 216 215 214 213 212 211 211
31 211 211 210 210 209 209 208 207 206 206 205 204 204 204 203 203 203 203 202 202 202 202 202 202 201 201 202 201 201 201 201 200 200 199 199 198 198 198 197 197 198 198 198 198 198 198 198 198 198 198 197 197 197 197 196 196 196 196 196 195 195 195 195 194 194 194 194 194 194 194 194 194
-18 194 194 194 194 193 193 194 194 194 194 194 193 193 193 193 193 192 192 192 192 192 192 192 192 192 191 191 191 191 191 191 191 191 191 190 190 190 189 189 188 188 188 188 188 189 189 189 189 189 190 190 190 190 190 190 189 189 189 188 188 187 187 186 186 186 186 186 186 186 186 186
-67 186 186 186 186 186 186 185 186 186 186 186 186 186 186 186 186 186 186 186 186 186 186 187 187 186 186 186 186 186 186 186 186 186 186 186 186 186 186 186 186 186 186 186 186 185 185 185 185 185 185 185 184 184 184 183 183 183 183 183 183 183 183 183 183 183 182 182 182 182 182 182
-115 182 182 182 183 183 183 183 183 183 183 183 183 183 183 183 183 183 183 183 183 183 183 183 182 182 182 182 182 181 181 181 181 181 181 181 181 181 181 181 182 182 182 182 182 182 182 181 181 181 181 182 182 182 182 182 182 182 182 181 181 181 181 181 181 181 181 181 180 180 180
-163 180 180 180 180 180 180 180 180 180 180 180 180 180 180 180 180 179 179 179 179 179 180 180 180 180 180 179 179 179 180 180 180 180 180 180 180 180 180 180 180 179 179 179 179 179 179 179 179 179 179 179 179 179 179 178 178 178 178 178 177 177 177 177 177 177 178 178 179 179 179
-211 179 180 180 180 180 180 179 179 179 179 179 179 179 179 179 179 180 180 180 179 179 179 179 179 179 179 179 179 178 178 178 178 178 178 178 178 178 178 177 177 177 177 177 177 177 177 176 176 176 176 176 176 176 176 176 176 176 176 176 176 176 176 176 176 176 176 176 176 176 176
-259 176 176 176 175 175 175 175 175 176 176 176 177 176 176 176 176 176 176 176 176 176 176 176 176 177 177 177 176 176 176 176 177 177 177 177 177 178 178 178 177 177 177 177 177 177 176 176 176 176 176 177 177 177 177 177 177 177 177 177 177 177 176 176 176 176 176 176 176 176 176
-307 176 177 176 176 176 175 175 175 175 175 175 175 175 175 175 175 175 175 176 176 176 176 176 176 175 175 175 176 176 176 177 177 177 177 177 177 177 177 177 177 177 177 177 178 178 177 177 177 177 177 176 176 176 175 175 175 175 175 175 175 175 175 175 176 176 176 175 175 175 175
-354 175 175 175 175 175 176 176 176 176 176 176 176 176 176 175 175 175 175 175 175 176 175 175 176 176 176 176 176 176 176 177 177 177 177 177 176 176 176 176 176 176 176 176 175 175 175 175 175 175 175 175 175 175 175 176 176 176 177 177 177 177 177 177 177 177 177 176 176 176 176
-402 176 176 176 176 176 176 176 176 176 176 176 176 177 177 177 177 177 177 177 177 177 177 176 176 176 176 175 175 175 175 176 176 176 175 175 175 175 174 174 174 174 174 174 174 175 175 175 175 175 175 175 175 175 175 175 175 175 175 175 175 175 176 176 176 176 176 176 176 176 176
-450 176 176 176 176 175 175 175 175 175 175 175 175 175 175 175 175 175 175 175 175 175 175 175 175 175 175 175 175 175 175 175 175 176 176 176 176 176 176 176 176 176 176 176 176 176 176 176 176 176 176 176 176 175 175 175 175 175 175 175 175 175 175 175 175 176 176 176 176 176 176
-498 176 176 176 176 176 176 176 176 177 177 177 177 177 177 177 177 177 177 177 176 176 176 176 176 177 177 177 177 177 177 177 177 177 177 177 177 177 177 177 177 177 176 176 176 176 176 177 177 177 176 176 176 176 175 175 175 175 175 175 175 175 176 176 176 176 176 176 176 176 176
-546 176 176 176 176 176 176 176 176 176 176 176 176 176 176 176 176 176 176 176 175 175 175 175 176 176 176 176 177 177 177 177 177 177 177 176 176 176 176 176 175 175 175 175 174 175 175 175 175 175 175 175 176 176 176 176 176 176 175 175 175 175 175 175 175 176 176 176 177 177 177
-594 177 177 177 177 177 177 177 177 176 176 175 175 175 175 175 175 175 175 175 175 175 175 175 175 175 175 175 175 175 175 176 176 176 176 176 176 176 176 176 176 176 176 176 176 176 176 176 176 176 176 176 176 176 176 176 177 177 178 178 178 178 179 179 179 179 179 179 178 178 177
-642 177 176 176 176 175 175 175 174 174 175 175 175 175 175 175 175 175 176 176 177 177 178 178 178 178 178 177 177 177 177 177 177 177 177 177 177 177 177 176 176 176 176 176 176 176 176 176 176 176 176 176 176 176 176 176 176 176 176 176 176 176 176 175 175 175 175 175 175 175 176
-689 176 176 176 176 176 176 176 176 176 177 177 177 177 177 177 177 177 177 177 177 177 176 176 176 176 176 175 175 175 175 175 176 176 176 176 176 176 176 176 177 177 177 177 177 177 177 177 178 178 178 177 177 177 177 177 177 177 177 177 177 177 178 177 177 177 177 177 177 177 177
-737 177 177 177 177 177 177 177 177 177 177 177 177 177 177 177 177 176 176 176 176 176 176 176 176 176 176 176 176 176 176 176 176 176 176 176 177 176 176 176 176 176 176 176 176 176 176 176 176 176 176 175 175 176 176 176 176 176 176 176 176 176 176 176 176 176 176 176 176 176 176
-785 176 176 176 176 175 175 175 175 176 176 176 176 176 176 176 176 175 175 175 175 175 175 175 175 175 175 175 175 176 176 176 176 176 176 177 177 177 177 177 176 176 176 176 176 176 176 175 175 175 175 175 175 175 174 174 175 175 175 176 176 176 176 176 176 175 175 175 175 175 174
-833 174 174 174 174 174 174 174 174 174 174 174 174 174 175 175 175 175 175 176 176 176 177 177 177 176 176 176 175 175 174 174 174 174 174 174 174 174 175 175 175 176 176 176 175 175 175 175 175 175 175 175 175 175 175 176 176 176 176 176 175 175 175 174 174 174 174 174 174 174 174
-881 174 174 174 174 174 175 175 175 175 175 175 175 174 174 174 173 173 172 172 172 172 172 172 172 173 173 173 173 173 173 173 174 174 174 175 175 175 175 175 175 175 175 174 174 174 174 174 174 174 174 174 174 174 175 175 175 175 175 175 175 175 175 176 176 176 176 176 176 175 175
-929 175 175 175 175 175 175 175 175 175 175 174 174 174 174 174 174 174 175 175 175 175 175 175 174 174 174 174 174 174 174 174 174 174 174 174 174 174 173 173 174 174 174 174 174 174 174 174 174 174 174 174 174 174 174 174 174 174 174 174 174 174 174 174 173 173 173 173 173 173 173
-977 173 173 174 174 174 174 174 174 174 173 173 173 173 173 173 173 173 173 173 173 173 174 174 174 173 173 173 173 173 173 173 172 172 172 172 171 171 171 172 172 172 173 173 173 172 172 172 172 172 172 172 172 172 172 172 172 172 173 173 173 173 173 172 172 172 172 171 171 171 170
-1024 170 170 170 170 170 170 170 171 171 171 171 171 172 172 172 172 172 172 172 172 172 172 172 171 171 171 171 171 170 170 170 171 171 171 171 171 172 172 172 171 171 171 171 171 171 171 171 171 171 171 171 171 171 171 171 171 171 171 171 171 171 171 171 171 171 171 171 171 171
-1072 171 172 172 172 172 172 171 171 171 170 170 169 169 169 169 169 169 169 169 169 169 169 169 169 170 170 170 170 170 170 170 170 170 170 170 169 169 169 169 169 169 169 170 170 170 170 170 170 170 170 170 170 170 170 170 170 170 170 169 169 169 169 169 169 168 168 168 168 168
-1119 168 169 169 169 169 169 169 169 169 169 169 169 169 170 170 170 170 169 169 169 169 168 168 168 168 168 168 168 168 168 168 168 168 168 168 168 168 168 168 168 168 168 167 167 167 167 167 166 166 166 166 166 166 166 166 166 166 166 167 167 167 168 168 168 168 168 167 167 167
-1166 167 166 166 166 166 166 166 166 166 166 166 166 166 166 166 166 166 166 166 166 166 166 166 166 166 166 166 166 165 165 165 165 165 165 164 164 164 163 163 163 163 164 164 164 164 164 164 164 164 164 164 164 164 164 164 164 164 164 164 164 164 164 164 164 163 163 163 163 163
-1213 163 163 163 163 163 163 163 163 162 162 162 162 162 162 162 162 162 162 162 162 162 163 163 163 163 163 163 163 164 164 164 164 164 164 164 164 164 164 164 164 163 163 163 163 163 163 163 164 164 164 164 164 164 164 164 163 163 163 163 162 162 161 160 160 160 160 160 160 161
-1260 161 161 161 161 161 161 161 161 161 161 160 160 160 160 160 160 161 161 161 161 161 161 161 161 161 162 162 162 162 162 162 162 161 161 161 161 161 161 161 161 160 160 160 160 160 160 160 160 160 160 160 159 159 159 159 159 159 159 159 159 159 159 159 159 159 158 158 158 158
-1307 158 158 158 158 158 157 157 157 157 157 157 156 156 155 155 155 155 156 156 156 157 157 157 158 158 158 159 159 158 158 158 158 158 158 158 158 158 157 157 157 157 157 157 157 157 157 157 156 156 156 156 156 156 156 156 156 156 156 156 155 155 155 155 155 155 155 155 155 154
-1355 154 154 154 155 154 154 154 154 154 154 155 155 155 155 155 155 155 155 155 155 155 155 155 155 155 155 155 155 155 155 155 155 155 155 155 155 155 155 155 154 154 154 154 154 154 154 154 155 155 155 155 155 155 155 155 154 154 153 153 153 152 152 152 152 153 153 153 153 153
-1402 153 153 153 153 153 153 152 152 152 151 151 151 151 151 152 152 152 152 152 152 152 153 153 153 153 153 153 153 153 152 152 152 152 152 152 152 153 153 153 154 154 154 154 154 154 154 153 152 152 151 151 151 151 151 150 150 150 150 150 150 150 150 149 149 149 149 149 149 149
-1449 149 149 149 149 149 149 150 150 150 150 151 151 151 151 151 151 151 150 150 150 150 149 149 149 149 149 149 149 149 148 148 148 148 148 148 148 147 147 147 147 147 147 147 147 147 147 147 147 147 147 147 147 147 147 147 147 147 146 146 146 146 146 146 146 146 146 147 147 147
-1496 147 147 147 147 147 147 147 147 147 147 147 147 147 147 147 147 147 147 147 147 147 147 147 147 147 147 146 146 146 146 146 146 146 146 146 146 146 146 145 145 145 145 145 145 145 146 146 146 146 146 146 146 145 145 145 144 144 144 144 144 144 144 144 144 144 144 143 143 143
-1543 143 143 143 142 142 141 141 141 141 141 141 141 141 141 141 141 142 142 142 142 142 142 142 142 142 142 143 143 143 143 143 144 144 144 143 143 143 143 143 143 143 142 142 142 142 142 142 142 141 141 141 141 141 140 140 140 140 140 140 141 141 142 142 142 142 142 142 143 143
-1590 143 143 143 143 143 143 142 142 142 142 143 143 143 143 142 142 142 141 141 140 140 139 139 139 139 138 138 138 138 138 138 138 138 137 137 137 137 137 138 138 138 137 137 137 137 137 137 137 137 137 137 137 137 137 138 138 138 138 138 137 137 137 137 137 136 136 137 137 137
-1638 137 138 138 138 138 137 137 137 137 136 136 136 137 137 137 136 136 136 136 136 136 136 136 135 135 135 135 135 135 135 135 135 135 136 135 135 135 135 135 135 136 136 136 136 136 136 136 136 136 135 135 135 135 135 135 134 134 134 134 134 134 134 134 134 133 133 133 133 133
-1685 133 133 132 132 132 132 132 132 132 132 132 132 132 132 133 133 132 132 132 131 131 131 131 131 131 131 132 132 132 132 133 133 133 133 133 133 133 133 133 133 133 133 133 133 133 133 133 133 133 133 133 133 133 133 133 133 133 133 132 132 132 132 132 131 131 131 131 131 131
-1732 131 131 131 130 130 130 130 130 130 129 129 130 130 130 130 130 130 130 130 130 130 130 130 129 129 129 129 129 129 129 129 129 129 129 129 129 129 129 129 129 129 129 129 128 128 128 127 128 127 127 127 127 127 127 127 127 127 127 127 127 127 127 127 126 126 126 126 126 126
-1779 126 126 127 127 127 127 127 127 127 127 127 127 126 126 126 126 126 126 126 125 125 125 125 125 125 125 125 125 125 125 125 125 125 125 125 126 126 126 126 126 126 127 127 127 127 127 127 126 126 126 126 126 126 126 126 126 126 126 126 126 125 125 125 125 125 125 125 124 124
-1826 124 124 124 124 124 124 125 125 125 126 126 126 126 126 126 125 125 125 124 124 124 124 124 124 124 124 124 124 124 124 123 123 123 123 123 123 123 123 123 123 123 123 123 123 124 124 124 123 123 123 123 123 123 123 123 123 124 123 123 123 122 122 121 121 121 121 121 121 122
-1873 122 122 122 121 121 121 121 121 121 121 121 121 120 120 120 120 120 120 120 120 120 120 120 120 120 120 119 119 119 119 119 119 119 119 119 119 119 120 119 119 119 119 119 119 119 119 118 118 118 118 118 118 118 118 118 118 118 118 118 118 118 118 117 117 117 117 117 116 116
-1921 116 116 116 116 117 117 117 117 117 117 117 117 118 118 118 117 117 117 117 117 117 117 117 117 117 117 116 116 116 116 117 117 117 117 117 117 117 117 117 117 117 117 117 117 117 117 117 117 117 117 117 117 117 117 116 116 116 116 116 116 116 116 116 116 116 116 116 116 116
-1968 116 116 116 117 117 117 117 117 117 116 116 116 116 116 116 116 116 116 116 115 115 115 115 115 114 114 114 114 113 113 113 113 113 113 113 113 113 113 114 114 114 114 114 114 113 113 113 113 113 113 113 113 113 113 113 113 113 113 113 113 113 113 113 113 114 114 114 113 113
-2015 113 113 113 113 113 113 113 113 113 112 112 112 112 112 112 112 112 112 112 112 111 111 111 111 111 111 111 111 111 111 111 111 111 111 111 111 111 111 111 111 111 111 111 111 111 110 110 111 111 111 111 111 111 111 111 111 111 110 110 111 111 111 110 110 110 110 110 109 109
-2062 109 109 110 110 110 110 109 109 109 109 109 109 109 108 108 108 108 108 108 108 108 108 108 108 108 108 108 108 108 109 109 109 109 108 108 108 108 108 108 108 108 108 108 108 108 108 108 108 108 108 108 108 108 109 109 109 109 109 109 109 109 109 108 108 107 107 107 107 107
-2109 107 106 106 106 106 106 106 106 106 106 107 107 107 107 106 106 106 105 106 106 106 106 105 105 105 105 105 105 105 105 105 105 105 105 105 105 105 105 105 105 105 105 105 104 104 104 104 105 105 104 104 104 104 104 104 103 103 103 103 103 103 103 103 103 103 103 103 103 103
-2156 103 103 103 103 103 103 103 103 103 104 104 104 104 104 104 104 104 104 104 104 104 104 104 104 104 103 103 102 102 101 101 101 102 102 102 102 102 102 102 102 102 102 102 102 102 102 102 103 103 103 103 102 102 102 102 102 102 102 102 102 102 102 102 102 102 102 102 101 101
-2204 101 101 101 101 101 101 101 101 101 101 101 101 101 101 101 101 101 101 101 101 101 101 101 101 100 100 100 100 100 100 101 101 101 101 101 101 101 101 102 101 101 101 100 100 100 100 100 100 100 99 99 99 99 99 99 99 99 99 100 100 100 101 101 100 101 100 100 100 100
-2251 100 100 100 100 100 100 100 99 99 99 99 99 99 99 99 99 99 99 99 100 100 100 100 99 99 99 99 98 98 98 98 98 98 98 98 98 98 98 98 98 98 98 98 98 98 98 98 97 97 97 97 97 97 97 97 97 97 97 97 97 98 98 98 98 98 98 98 98 98
-2298 98 97 97 97 97 98 98 98 99 99 99 99 98 98 98 98 98 98 97 97 97 97 97 97 97 96 96 96 96 96 96 96 96 95 95 95 95 95 95 95 95 95 95 95 96 96 96 96 96 96 96 96 96 95 95 95 95 95 95 95 95 95 95 95 95 95 95 95 95 96
-2346 96 96 96 95 95 95 96 96 96 95 95 95 95 95 94 94 94 94 94 94 94 94 94 94 94 94 94 94 94 94 94 93 93 93 93 93 93 93 93 92 92 93 93 94 94 94 94 94 94 94 93 93 92 92 92 92 92 92 92 92 92 91 91 91 91 91 91 91 91 91
-2394 91 91 91 91 92 92 92 92 92 93 93 93 93 94 94 94 94 94 94 93 93 93 92 92 92 92 92 92 92 93 93 93 93 93 92 92 92 92 92 92 93 93 93 93 93 93 93 93 93 93 93 93 92 92 92 92 92 92 91 91 91 91 91 91 90 90 90 90 90 90
-2441 90 91 91 91 91 91 91 91 91 91 91 91 91 91 90 90 90 90 90 90 91 91 91 90 90 90 90 90 90 90 90 90 89 89 89 89 89 89 89 89 89 89 89 89 89 90 90 90 90 90 90 89 89 89 89 89 89 89 89 89 89 89 89 89 89 88 88 88 88 88
-2489 88 88 89 89 89 89 89 89 89 89 88 88 88 88 88 88 89 89 89 89 89 89 89 89 89 89 89 89 88 88 88 88 88 88 88 88 88 89 89 88 88 88 87 87 87 86 86 86 86 86 86 86 86 86 86 87 87 87 87 87 87 87 87 87 87 87 87 87 87 87
-2537 87 87 87 87 87 87 87 87 86 86 86 86 86 85 85 85 86 86 86 86 86 86 87 87 87 87 87 86 86 86 86 86 86 86 86 86 86 85 85 85 85 86 86 87 87 87 87 87 87 87 87 86 86 86 86 86 86 86 85 85 85 84 84 84 84 84 84 84 85 85
-2585 85 85 85 85 85 85 85 85 85 85 85 84 84 84 84 84 84 83 83 83 83 83 83 83 84 84 83 83 83 83 84 84 84 84 84 83 83 83 83 83 82 82 82 82 82 82 82 82 82 82 82 82 83 83 83 83 83 83 83 82 82 82 82 81 81 81 81 82 82 82
-2633 82 82 82 82 82 81 81 81 81 82 82 82 82 83 83 83 83 83 83 82 82 82 82 82 82 82 82 82 82 82 83 83 82 82 82 82 82 81 81 80 80 80 79 79 80 80 80 80 81 81 81 81 81 81 81 80 80 80 80 80 80 80 80 80 80 80 80 80 80 79
-2681 79 79 79 80 80 80 80 80 80 81 81 81 81 81 81 81 81 80 80 81 81 81 81 81 81 82 82 81 81 81 81 81 82 82 81 81 81 81 81 81 81 81 81 80 80 80 80 80 80 80 80 79 79 79 79 79 79 79 79 79 79 79 79 79 79 79 79 79 79 79
-2729 79 79 79 79 79 79 79 78 78 78 78 78 78 78 79 79 79 79 79 79 79 79 79 78 78 78 78 78 78 78 78 78 78 78 78 78 78 78 78 78 79 78 78 78 78 78 78 78 78 78 78 79 79 79 78 78 78 78 78 78 78 78 78 78 78 78 78 78 78 78
-2776 78 78 77 77 77 77 77 77 78 78 78 78 78 78 78 78 77 77 78 78 78 78 78 78 78 78 78 78 78 78 78 78 78 78 78 78 77 77 77 77 77 77 77 77 77 77 77 77 77 77 77 77 77 77 77 77 77 78 78 77 77 77 77 77 77 77 76 76 76 76
-2824 76 77 77 77 77 77 77 77 77 77 77 76 76 76 76 76 76 76 76 76 76 76 76 76 76 76 76 76 76 76 76 76 76 76 76 76 76 76 76 76 76 76 76 75 75 75 75 75 75 74 74 74 74 74 74 74 74 74 74 74 75 75 75 75 75 75 74 74 74 75
-2872 75 75 75 76 76 76 76 76 76 76 76 75 75 75 75 75 75 75 75 76 76 76 76 75 75 75 75 75 74 74 74 75 75 75 75 75 75 75 75 75 75 75 74 74 74 74 74 74 73 73 73 73 73 73 73 73 74 74 74 74 74 74 74 74 74 74 73 73 73 73
-2920 73 73 73 73 73 73 73 73 74 74 74 74 74 73 73 73 73 72 72 72 72 72 72 72 72 73 73 73 73 73 73 73 72 72 72 72 72 72 72 73 73 73 73 72 72 72 72 72 72 72 72 72 72 72 72 72 72 72 72 72 72 72 72 73 73 73 73 73 73 73
-2968 73 73 73 73 73 73 73 73 73 73 73 73 73 73 73 72 73 73 73 73 73 73 73 73 72 72 72 71 71 71 71 71 71 71 71 71 71 71 71 71 71 71 71 71 71 71 71 70 70 70 70 70 70 70 70 69 69 69 69 69 69 69 69 70 70 70 70 69 69 69
-3016 69 69 69 69 69 69 69 69 69 69 69 70 70 70 71 71 71 70 70 70 70 69 69 69 69 69 70 70 70 70 70 70 70 70 71 71 70 70 70 70 70 70 70 70 70 70 70 70 70 70 70 70 70 70 69 69 69 69 69 69 70 70 70 70 71 71 71 71 71 71
-3064 71 70 70 70 69 69 69 69 69 69 69 69 69 69 69 69 69 69 69 69 69 69 68 68 68 68 68 68 68 68 68 67 67 67 67 67 68 68 68 69 69 69 68 68 68 68 68 68 68 67 67 67 67 67 67 67 67 67 67 68 68 68 68 69 69 69 69 69 69 69
-3111 69 69 69 69 69 69 69 69 69 69 68 68 67 67 67 66 67 67 67 67 67 67 67 67 67 67 67 67 68 68 68 69 69 69 69 69 69 69 69 69 69 68 68 68 68 68 68 68 67 67 67 67 67 67 67 67 67 67 67 68 68 68 68 68 68 68 67 67 67 67
-3159 67 67 67 67 67 67 67 67 68 68 68 68 68 68 68 68 68 67 67 67 67 67 67 67 67 67 66 66 66 66 66 66 65 65 65 65 65 64 64 65 65 65 65 65 65 65 65 65 65 65 65 65 66 66 65 65 65 65 65 65 65 66 66 66 66 67 67 67 67 67
-3207 67 67 67 67 67 67 67 67 67 67 67 67 66 66 66 65 65 66 66 66 67 67 67 67 67 67 67 67 67 67 67 67 67 66 66 66 66 66 66 66 66 65 65 66 66 66 66 66 66 66 66 66 66 66 66 66 66 66 66 66 66 66 66 66 67 67 67 67 67 66
-3255 66 66 66 66 66 66 66 66 66 66 65 65 65 65 65 65 65 65 65 65 65 65 65 64 64 64 64 64 64 64 64 64 64 64 64 64 64 65 65 65 65 65 66 66 66 67 66 66 66 66 65 65 65 64 64 64 64 64 64 64 64 64 64 64 64 64 64 64 65 65
-3303 65 65 65 65 65 65 65 65 65 65 65 65 64 64 64 63 63 63 64 64 64 64 64 64 64 64 64 64 64 65 65 65 65 66 66 66 65 65 65 64 64 64 64 64 64 64 64 64 64 64 64 64 64 64 64 64 64 64 64 64 64 64 63 63 63 63 63 63 62 62
-3351 62 62 62 62 62 62 62 62 62 62 62 62 62 62 62 62 62 62 62 62 62 63 63 63 63 64 64 64 64 63 63 63 63 63 63 63 63 63 63 63 63 63 64 64 64 64 64 63 63 64 64 64 64 64 64 64 64 65 65 65 64 64 64 64 64 64 63 63 63 63
-3399 63 63 63 63 62 62 62 62 62 62 62 62 62 62 62 61 62 62 62 62 61 61 61 61 61 61 61 61 61 61 61 61 61 62 62 62 62 63 63 63 62 62 62 62 63 63 63 63 64 64 64 64 64 64 64 63 63 63 63 63 63 63 63 63 63 63 62 62 63 63
-3446 63 63 63 63 63 63 63 63 64 64 64 64 64 64 64 64 63 63 63 63 63 63 63 63 63 63 62 62 62 62 61 61 61 61 61 61 61 61 61 61 61 62 62 62 62 61 61 61 60 60 60 60 60 60 61 61 61 61 61 61 61 61 61 61 61 61 61 61 61 61
-3494 61 61 61 61 61 61 61 61 61 61 61 62 62 62 62 61 61 61 61 61 61 60 60 60 60 60 60 60 60 60 60 60 60 60 61 61 61 61 61 60 60 60 60 60 60 60 60 60 61 61 61 61 61 61 61 61 61 61 61 61 61 61 61 60 60 60 60 60 60 60
-3542 60 60 60 60 60 59 59 59 59 59 58 58 58 59 59 59 59 59 59 59 59 59 59 59 59 59 59 59 59 59 59 59 59 59 59 60 60 60 60 60 60 61 61 61 61 61 61 60 60 60 59 59 59 59 59 59 59 59 59 59 59 59 59 59 59 59 59 60 60 60
-3590 60 60 60 60 59 59 59 59 59 58 58 58 58 58 58 59 59 59 59 59 58 58 58 58 58 59 59 59 59 59 59 59 60 60 60 60 59 59 59 59 59 59 59 59 59 58 58 58 58 58 58 58 58 58 58 58 58 58 58 58 58 58 59 58 58 58 58 58 58 58
-3638 58 58 58 58 57 57 57 57 58 58 57 57 57 58 58 58 59 59 59 59 59 59 59 59 59 59 60 60 60 60 60 60 60 59 59 59 59 59 58 58 58 58 58 58 58 57 57 57 57 57 57 57 57 57 57 57 58 58 58 58 58 58 58 58 58 58 59 59 59 59
-3686 59 59 59 59 59 59 58 58 58 57 57 57 57 58 58 58 58 58 58 58 58 58 58 57 57 57 57 58 58 58 58 59 59 59 59 59 59 59 59 59 59 59 59 59 59 59 59 59 58 58 58 58 58 58 58 58 58 58 58 58 58 58 58 58 58 58 58 58 58 58
-3734 58 58 58 58 58 57 57 57 57 57 57 57 57 57 57 57 57 57 57 57 57 57 56 56 57 57 57 57 57 57 57 57 57 57 57 57 57 57 57 56 57 57 57 57 57 57 56 56 56 55 55 56 56 56 57 56 56 56 56 57 57 58 58 58 58 58 58 58 58 58
-3781 58 58 58 58 58 58 58 58 58 58 57 57 57 56 56 56 56 56 56 57 57 57 57 57 57 57 57 57 57 57 57 57 57 57 57 57 57 56 56 56 56 56 56 56 56 56 56 56 55 55 55 55 55 55 55 55 55 55 56 56 56 57 57 58 58 58 57 57 57 56
-3829 56 56 56 56 56 56 56 56 56 56 56 57 57 57 57 57 57 57 57 57 56 56 56 56 57 57 56 56 56 56 56 56 55 55 55 56 56 56 56 56 56 56 56 56 56 56 56 56 56 56 56 56 56 56 56 56 56 56 56 56 56 56 56 56 56 56 56 56 56 57
-3877 57 57 57 57 57 57 57 57 57 57 56 56 56 56 56 56 56 56 56 56 56 55 55 55 55 55 55 55 55 55 55 55 55 56 56 56 56 56 56 56 57 57 56 56 56 56 56 56 56 56 56 55 55 55 55 55 55 55 55 55 55 55 55 55 55 55 55 55 54 54
-3925 54 54 54 54 54 54 54 54 54 54 54 54 54 55 55 55 55 55 55 55 55 55 55 55 55 55 55 56 56 56 56 56 56 56 56 56 56 56 56 55 55 55 55 55 55 55 55 55 55 55 55 55 55 55 55 55 55 55 54 54 54 54 54 54 54 54 54 54 54 54
-3973 54 53 53 54 54 54 54 54 54 55 55 55 55 55 54 54 54 54 54 54 55 55 55 55 54 54 54 54 54 54 53 53 53 53 54 54 54 54 54 54 54 54 54 54 54 54 54 54 54 54 54 53 53 53 53 53 53 54 54 54 54 54 54 54 54 54 54 54 54 54
-4021 54 54 54 54 54 54 53 53 53 53 53 53 53 53 54 54 54 54 54 54 54 54 54 54 54 54 53 53 53 53 53 53 53 54 54 54 55 55 55 55 54 54 54 54 54 54 54 54 54 54 54 54 54 54 54 54 53 53 53 53 53 53 53 53 53 53 53 53 54 54
-4069 54 54 54 54 53 53 53 53 53 53 53 54 54 54 54 54 55 55 55 55 55 54 54 54 54 54 54 54 54 54 54 54 54 55 55 55 55 55 55 55 54 54 54 54 54 54 54 53 53 54 54 54 55 55 54 54 54 54 54 54 54 53 53 53 53 53 53 53 53 54
-4116 54 54 54 54 54 54 54 54 54 54 53 53 53 53 52 52 52 52 52 52 52 52 52 51 51 51 51 51 52 52 52 52 53 53 53 53 53 54 54 54 54 54 54 54 53 53 53 53 53 52 52 52 52 52 52 52 52 52 52 52 52 51 51 51 51 51 52 52 52 53
-4164 53 53 53 53 53 53 53 54 54 54 54 54 54 53 53 52 52 52 52 52 52 52 53 53 53 53 53 53 53 53 53 53 52 52 52 52 52 52 51 51 51 51 51 51 51 51 51 51 51 52 52 52 52 52 53 53 53 53 53 53 53 53 53 53 53 52 52 52 52 52
-4212 52 52 52 52 52 52 52 52 52 52 52 52 52 52 52 52 52 51 51 50 50 50 50 51 51 51 51 51 51 51 52 52 52 52 52 52 52 52 52 52 53 53 53 53 53 53 53 52 52 51 51 51 51 50 50 50 50 51 51 51 51 52 52 52 52 52 52 52 52 52
-4260 52 52 52 52 52 52 52 52 51 51 51 51 51 51 52 52 52 53 53 53 53 52 52 52 52 52 52 52 52 52 52 51 51 51 51 51 51 51 51 51 51 51 51 51 52 52 52 52 53 53 53 53 53 53 52 52 52 52 52 52 52 52 52 52 52 52 53 52 52 52
-4308 52 52 52 52 52 52 52 52 52 52 52 51 51 51 51 52 52 52 52 53 53 52 52 52 52 52 51 51 51 51 50 50 50 50 50 50 50 50 50 51 51 51 51 52 52 52 52 52 52 52 52 52 52 52 52 52 52 52 52 52 52 52 52 53 53 53 53 53 53 52
-4356 52 52 52 52 52 52 52 52 52 52 52 52 52 52 52 52 52 53 53 53 53 53 54 54 54 54 54 54 54 54 54 53 53 53 54 54 54 54 54 54 53 53 53 53 53 52 52 52 52 52 52 52 52 52 52 52 52 52 52 52 52 52 51 51 51 51 51 51 51 51
-4404 51 52 52 52 52 52 52 52 52 52 52 52 51 51 51 51 52 52 51 51 51 51 51 51 51 51 51 51 51 51 51 51 51 51 51 51 51 51 51 51 51 51 51 51 51 51 51 50 50 50 50 50 50 50 50 50 49 49 49 50 50 50 50 50 50 51 51 51 51 51
-4451 51 50 50 49 49 49 49 49 49 49 49 49 49 49 50 50 50 50 50 50 50 50 50 50 49 49 49 49 49 49 49 49 49 49 49 49 49 50 50 50 50 50 50 50 50 50 50 50 51 51 51 51 51 51 51 51 51 50 50 50 50 50 51 51 51 51 51 51 51 50
-4499 50 50 50 49 49 49 50 50 50 50 51 51 51 50 50 50 50 50 50 50 50 50 49 49 49 49 49 49 49 49 49 49 50 50 50 50 50 50 50 49 49 49 50 50 50 50 50 50 49 49 49 49 49 49 49 49 49 49 49 49 50 50 50 50 50 50 51 51 51 51
-4547 51 52 52 52 52 51 51 50 50 50 50 50 51 51 51 51 50 50 50 49 49 49 49 49 49 49 48 49 49 49 49 49 49 49 49 49 49 49 49 49 49 49 49 49 50 50 51 51 51 51 51 51 51 51 51 51 51 50 50 49 49 49 49 49 50 50 50 50 50 50
-4595 50 50 50 50 50 50 50 50 50 50 50 50 50 51 50 50 50 50 50 50 49 49 49 49 49 49 49 49 49 50 50 50 50 50 50 50 50 50 50 50 50 50 50 50 50 49 49 49 49 48 48 48 48 48 47 47 48 48 48 48 49 49 49 49 49 49 49 49 49 49
-4643 49 49 49 49 49 49 49 49 49 49 49 49 49 49 48 48 48 48 48 48 48 48 49 49 48 48 48 48 48 49 49 49 50 50 50 50 50 50 50 49 49 49 49 48 48 48 48 48 48 48 48 49 49 48 48 48 48 48 48 49 49 49 49 49 49 49 49 49 49 49
-4691 49 49 49 49 49 49 49 49 49 48 48 48 48 48 48 48 48 48 48 48 48 48 48 48 48 48 48 48 48 48 48 48 49 49 49 49 49 49 50 50 50 50 50 50 50 50 50 50 49 49 48 48 48 48 48 48 48 48 48 48 48 48 48 47 47 48 48 48 48 48
-4739 48 48 48 48 48 48 49 49 49 49 49 48 48 48 47 48 48 48 48 48 48 49 49 49 49 49 49 49 49 49 49 49 49 49 49 49 49 48 48 47 47 47 48 48 48 48 48 48 48 48 49 49 49 49 49 49 49 49 49 49 49 49 49 49 49 49 49 49 49 49
-4786 49 50 50 50 50 50 50 50 51 51 51 51 51 50 50 50 50 50 50 50 50 50 50 50 50 51 51 51 51 51 50 50 50 49 49 49 49 50 50 50 50 50 49 49 49 49 49 49 49 48 48 48 48 48 48 48 48 48 47 47 47 47 47 47 47 48 48 48 48 49
-4834 49 49 49 49 49 49 49 48 48 48 49 49 49 49 49 49 49 49 50 50 50 50 50 50 50 49 49 49 49 49 49 49 48 49 49 49 49 49 50 50 49 49 49 49 50 50 50 50 50 50 50 49 49 49 49 49 48 48 48 48 48 48 47 47 47 47 47 47 47 47
-4882 47 47 47 47 47 47 47 48 48 48 49 49 49 49 49 50 49 49 49 49 48 48 47 47 47 47 47 47 47 47 47 47 47 47 47 47 47 47 47 47 47 47 47 47 47 47 47 47 47 47 47 47 47 47 47 48 48 47 47 47 47 47 47 47 47 47 47 47 47 47
-4930 47 47 47 47 46 47 47 47 48 48 48 48 49 49 49 49 49 49 48 48 48 48 48 48 48 48 48 48 48 48 48 48 48 47 47 47 46 46 46 46 46 46 46 47 47 47 48 48 48 49 49 49 49 49 49 49 49 49 49 48 48 48 48 48 48 48 48 48 48 48
-4978 48 48 48 48 48 48 48 48 48 48 49 49 49 49 50 50 50 50 49 49 48 48 48 48 48 48 48 48 48 48 48 48 48 48 48 48 48 48 48 49 49 48 48 48 48 48 48 49 49 49 49 49 49 49 49 49 49 48 48 48 48 48 48 48 48 48 48 48 48 48
-5026 48 48 47 47 47 47 47 47 47 47 47 47 47 47 47 47 47 47 47 47 48 48 48 48 48 48 48 48 48 48 48 48 48 47 47 46 46 46 46 46 46 47 47 47 47 47 47 47 46 46 46 46 45 45 45 46 46 46 46 46 47 47 47 48 48 48 48 48 48 48
-5074 48 47 47 47 48 48 48 48 48 48 48 48 48 48 47 47 47 48 48 48 48 48 48 48 48 47 47 47 47 47 46 46 46 46 46 46 46 46 46 46 46 46 46 46 46 46 46 46 46 47 47 48 48 48 48 48 48 48 48 48 48 48 48 48 48 47 47 47 47 47
-5121 47 47 48 48 48 48 48 49 49 49 49 49 49 49 49 48 48 48 48 48 48 48 48 48 48 48 47 47 47 46 46 46 45 45 46 46 46 47 47 47 47 47 47 47 47 47 47 47 47 47 47 47 47 46 46 46 47 47 47 47 47 47 47 47 47 47 47 47 47 47
-5169 47 47 47 46 46 46 46 46 46 46 46 47 47 47 47 47 47 47 47 47 47 47 47 47 47 47 47 47 47 46 46 46 46 46 47 47 47 48 48 48 49 49 49 49 49 49 48 48 48 48 48 48 47 47 47 47 47 46 47 47 47 47 47 47 47 47 47 47 47 47
-5217 47 47 47 47 47 47 47 48 48 48 48 48 48 48 48 48 48 48 47 47 47 47 47 47 46 46 46 46 46 46 46 46 46 46 46 47 47 47 46 46 46 46 46 46 46 47 47 47 47 47 47 47 47 47 47 47 47 47 48 48 48 48 48 48 48 48 48 47 47 47
-5265 47 47 47 47 47 47 47 47 48 48 47 47 47 47 47 47 47 47 48 48 48 48 48 48 48 48 48 48 47 47 47 46 46 46 46 46 46 46 46 46 46 46 46 46 46 46 46 46 46 46 46 46 46 46 46 46 46 46 46 46 46 46 46 46 46 47 47 47 47 47
-5313 47 47 47 47 47 47 47 47 47 47 47 47 47 47 47 47 48 48 48 48 48 48 48 48 48 48 48 48 48 48 48 48 47 47 47 47 47 47 47 47 46 46 46 46 46 46 46 46 46 46 46 46 46 46 46 46 46 46 46 46 46 46 46 46 47 47 47 47 47 47
-5361 47 47 47 47 47 47 46 46 46 46 46 46 46 46 46 46 46 46 46 46 46 46 46 46 46 46 46 46 46 46 46 46 46 46 47 47 48 48 48 48 47 47 47 47 47 47 47 46 46 46 46 46 46 45 46 46 46 46 46 46 47 47 47 46 46 46 46 46 46 46
-5409 46 46 46 46 46 45 45 45 45 45 45 45 46 46 46 46 47 46 46 46 46 46 46 46 46 46 46 46 46 47 47 47 47 47 46 46 46 46 46 46 46 46 47 47 47 47 47 47 47 46 46 46 46 46 46 46 46 46 46 46 46 46 46 46 46 46 46 46 46 46
-5456 46 46 46 46 46 46 46 46 46 46 46 46 46 46 46 46 46 46 45 45 45 45 44 44 44 44 45 45 45 45 46 45 45 45 45 45 45 45 45 46 46 46 46 47 46 46 46 46 46 46 46 46 45 45 45 44 44 44 44 44 44 45 45 45 45 45 46 46 46 46
-5504 46 46 46 46 46 46 46 46 45 45 45 45 45 45 46 46 46 47 47 47 48 48 48 48 47 47 47 46 46 46 46 46 46 46 46 46 46 46 46 46 46 46 46 46 45 45 45 45 45 45 45 45 45 45 44 44 44 44 44 44 44 44 44 43 43 43 43 43 43 43
-5552 43 43 44 44 44 44 45 45 45 45 45 45 45 45 45 45 45 45 45 45 45 45 45 45 45 45 45 45 45 45 45 46 46 46 46 45 45 45 45 45 45 45 45 45 46 45 45 45 45 45 45 45 45 45 45 46 46 46 46 46 46 46 46 45 45 45 45 44 44 44
-5600 44 44 44 44 44 44 44 44 44 45 45 45 45 45 45 45 45 45 45 45 45 45 45 45 45 45 45 46 46 46 46 46 46 46 47 47 47 47 46 46 46 46 46 46 46 46 46 46 46 46 46 46 46 45 45 44 44 43 43 43 43 44 44 44 45 45 45 45 45 46
-5648 46 46 46 46 46 45 45 45 45 46 46 46 46 47 46 46 46 46 46 45 45 45 44 44 44 44 45 45 45 46 46 46 46 46 46 46 46 45 45 45 45 45 45 45 45 45 45 45 45 45 46 46 46 45 45 45 45 45 46 46 46 46 46 46 46 46 46 45 45 45
-5696 45 45 45 45 45 45 45 46 46 46 46 46 46 46 46 46 45 45 45 45 44 44 44 43 43 43 43 43 44 44 44 44 44 44 45 45 45 46 46 46 46 46 46 46 46 46 46 45 45 45 45 45 45 45 46 46 46 46 47 47 47 46 46 46 46 46 46 46 45 45
-5744 45 45 44 44 44 43 43 43 43 43 43 43 43 43 43 43 43 43 43 43 43 43 44 44 44 44 45 45 45 45 45 45 45 45 45 45 45 45 45 45 45 45 45 45 45 45 46 45 46 46 46 46 46 46 46 46 46 46 46 46 46 46 46 46 47 47 47 47 46 46
-5791 46 46 45 45 46 46 46 46 46 45 45 45 45 45 44 44 44 44 44 44 44 44 44 44 44 44 44 44 45 45 45 45 45 45 45 45 45 45 45 45 45 45 45 45 45 45 45 45 45 45 45 45 45 44 44 44 44 44 44 44 44 44 44 45 45 45 45 45 45 45
-5839 45 45 45 45 45 45 46 46 46 46 46 46 46 46 46 46 46 46 47 47 47 46 46 46 46 46 45 45 45 45 46 46 46 45 45 45 45 45 45 45 45 45 45 45 45 45 45 44 44 44 44 44 44 44 44 44 44 44 44 45 45 45 45 45 45 45 45 45 45 45
-5887 45 45 45 45 45 45 45 45 45 45 45 46 46 46 46 46 45 45 45 45 45 45 45 45 45 45 45 45 45 44 44 44 44 44 44 44 44 44 44 44 44 44 44 44 44 43 43 43 43 43 43 43 44 44 44 44 44 44 44 44 44 45 45 45 45 45 45 45 45 45
-5935 45 44 44 44 44 44 44 44 44 45 45 45 45 45 45 45 44 44 44 44 44 44 44 44 44 44 44 44 44 44 44 44 43 43 43 43 43 43 43 43 43 43 43 43 43 43 43 43 43 43 43 43 44 44 44 44 43 43 43 43 43 43 43 44 44 44 44 45 45 45
-5983 45 45 45 44 44 43 43 43 43 43 43 43 43 43 43 43 43 43 43 43 43 44 44 44 44 44 44 44 44 44 44 43 43 44 44 44 44 44 44 44 44 44 44 44 44 44 44 44 44 44 44 44 44 44 44 44 44 44 44 44 44 44 44 44 44 44 44 43 43 43
-6031 43 43 44 44 44 44 44 44 44 44 44 44 44 44 45 45 45 45 45 45 45 46 46 46 47 46 47 46 46 46 45 45 44 44 44 44 44 44 44 45 45 45 45 45 45 45 45 45 45 45 45 45 45 45 45 46 46 46 46 46 46 46 46 46 46 46 46 46 46 45
-6079 45 45 45 44 44 44 44 44 44 44 43 43 43 43 43 43 43 43 43 43 43 43 43 43 43 43 44 44 44 44 45 45 45 45 45 45 45 45 45 45 45 45 46 45 45 45 44 44 44 43 43 43 43 43 43 43 43 43 44 44 44 44 44 44 44 44 44 44 44 44
-6126 44 44 44 44 44 44 44 44 44 44 44 44 44 44 44 43 43 43 43 44 44 44 44 44 44 44 44 44 44 44 44 44 44 44 44 44 44 44 44 44 44 44 44 44 43 43 43 43 43 43 43 43 43 44 44 44 44 44 44 44 45 45 45 45 45 45 44 44 44 43
-6174 43 43 44 44 44 44 44 45 45 45 45 44 44 44 44 44 44 44 44 43 43 43 43 43 43 43 44 44 44 44 44 44 44 44 44 44 44 44 44 44 44 44 44 43 43 43 43 43 44 44 44 44 45 45 44 44 44 44 44 44 44 44 44 44 44 44 45 45 45 45
-6222 45 45 45 46 45 45 45 45 45 45 45 44 44 44 44 44 45 45 45 45 45 45 45 45 45 44 44 44 43 43 43 43 42 42 42 42 42 42 42 42 42 42 42 42 42 42 42 42 42 42 42 42 42 42 43 43 43 43 44 44 44 44 44 44 44 44 44 44 44 44
-6270 44 44 44 44 45 45 45 44 44 44 43 43 44 44 44 44 44 43 43 43 43 42 43 43 43 43 43 43 43 43 43 43 43 43 43 43 43 43 44 44 44 44 44 44 44 45 45 45 45 46 46 46 46 45 45 45 45 44 44 44 44 45 45 45 44 44 44 44 44 44
-6318 44 44 44 44 45 45 45 45 45 45 45 45 45 45 44 44 44 44 44 44 44 44 44 44 45 45 45 45 45 45 44 44 44 44 44 45 45 45 45 44 44 44 44 44 43 43 43 44 44 44 45 45 45 45 45 45 44 44 43 43 43 43 43 43 43 43 43 43 43 43
-6366 43 43 43 43 43 43 43 43 43 43 43 43 43 43 43 43 43 43 43 43 43 43 43 43 43 43 43 43 44 44 44 44 44 44 43 43 43 43 43 43 43 43 43 43 43 43 43 43 43 43 43 43 43 43 43 43 43 43 43 43 43 42 42 42 42 42 42 42 42 42
-6414 42 43 43 43 43 43 43 43 43 43 43 43 43 43 43 43 43 44 44 44 44 43 43 43 43 43 43 44 44 44 44 44 44 44 44 44 44 44 44 43 44 44 44 44 44 44 45 45 45 45 44 44 44 44 44 44 44 43 43 43 43 43 43 43 42 43 43 43 43 44
-6461 44 44 44 44 45 45 45 45 45 45 45 45 44 44 44 43 43 43 43 43 43 43 43 43 44 44 44 44 45 45 45 45 45 45 45 45 45 45 45 45 45 45 44 44 45 45 45 44 44 44 44 43 43 43 43 43 43 43 42 43 43 43 43 43 43 43 43 43 43 43
-6509 43 43 43 43 43 43 43 43 43 43 44 44 44 44 44 44 44 45 44 44 44 44 44 44 44 44 44 44 44 44 44 44 44 44 44 44 44 44 45 45 45 45 45 45 45 45 45 45 44 44 44 44 44 44 44 44 44 44 44 44 43 43 43 43 43 43 43 43 43 43
-6557 43 43 43 43 43 43 43 43 43 43 43 43 43 43 43 44 44 44 44 45 45 45 45 44 44 44 44 44 44 44 44 44 44 43 43 43 43 43 43 43 43 43 44 44 44 44 44 44 44 44 44 43 43 43 43 44 44 44 44 44 44 44 44 44 43 43 42 42 42 42
-6605 42 42 42 42 42 42 42 42 42 43 43 43 43 43 43 43 43 43 43 43 43 43 43 43 43 43 43 43 43 43 43 42 42 42 42 42 42 42 42 42 42 43 43 43 43 43 43 43 43 43 43 43 43 43 44 44 44 44 44 44 44 44 44 43 43 43 42 42 42 42
-6653 42 42 42 42 42 43 43 43 43 43 43 43 43 44 44 44 43 43 43 43 43 43 43 43 43 43 42 42 43 43 43 43 43 43 43 43 43 43 43 42 42 42 42 42 42 41 41 41 41 41 41 41 42 42 42 42 42 42 42 42 42 42 42 42 42 43 43 43 43 43
-6701 43 43 43 43 43 43 43 42 42 42 41 41 41 41 41 41 42 42 42 42 42 42 42 42 42 42 42 42 42 42 42 42 42 42 42 43 43 43 43 43 43 42 42 42 42 42 42 42 42 42 42 42 42 42 42 43 43 43 43 43 43 43 43 43 43 43 43 42 42 42
-6749 42 42 41 41 41 41 41 41 41 41 41 41 42 42 42 42 42 42 42 42 42 43 43 43 43 43 42 42 42 42 42 42 42 42 42 42 42 42 42 42 42 42 42 43 43 43 42 42 42 42 42 42 42 42 42 42 42 42 43 43 43 43 44 44 44 44 44 43 43 43
-6796 43 43 43 42 42 42 42 42 41 41 41 41 42 42 42 42 43 43 43 43 43 43 43 43 43 43 43 43 43 43 43 43 43 43 43 43 43 43 43 43 43 43 43 44 44 44 44 44 44 44 43 43 43 44 44 44 44 44 44 44 44 44 44 43 43 43 43 43 43 43
-6844 43 43 43 43 42 42 42 42 42 42 42 42 42 42 43 43 43 43 43 43 43 43 43 43 43 43 43 43 43 43 42 42 42 42 42 42 41 41 41 41 41 41 41 41 41 42 42 42 42 42 42 42 42 42 42 42 42 42 42 42 42 42 42 42 42 42 42 42 41 41
-6892 41 41 41 41 41 41 41 41 41 41 41 41 41 41 41 41 41 41 41 41 42 42 42 42 42 43 43 44 44 44 44 43 43 43 43 43 43 43 43 43 43 43 43 44 44 44 44 44 44 44 43 43 43 43 42 42 42 42 42 42 41 41 42 42 42 42 42 42 42 42
-6940 42 42 43 43 43 43 43 43 43 43 43 43 43 43 43 43 43 43 43 43 43 43 43 43 42 42 42 42 43 43 43 43 43 43 43 43 43 43 43 43 43 43 43 44 44 44 44 44 44 44 43 43 43 43 43 43 43 43 43 44 44 44 44 44 44 44 44 43 43 43
-6988 43 43 43 44 44 44 44 44 44 44 43 43 43 43 43 42 42 42 42 42 41 41 41 41 41 41 41 41 41 41 41 41 41 41 41 42 42 42 42 43 43 43 43 44 44 44 44 44 44 44 43 43 43 44 44 44 44 44 44 43 43 43 42 42 43 43 43 43 43 43
-7036 43 43 43 43 43 43 42 42 42 42 42 42 42 42 42 42 42 42 42 42 42 42 42 42 42 41 41 41 41 41 41 41 41 41 42 42 42 41 41 41 41 40 40 40 40 41 41 42 42 42 42 42 42 42 42 42 42 42 42 42 42 42 42 42 42 41 41 41 41 41
-7084 41 41 41 41 41 41 41 41 41 41 42 42 42 42 42 42 43 43 43 43 42 42 42 42 42 42 42 42 42 42 43 43 43 43 43 43 44 44 44 44 44 44 44 44 43 43 43 43 43 43 43 43 43 43 43 43 42 42 42 41 41 41 41 42 43 43 43 43 43 43
-7131 43 43 43 43 43 43 42 42 42 41 41 41 41 41 42 42 42 43 43 43 43 43 43 42 42 42 42 41 41 41 41 41 42 41 41 41 41 41 41 41 41 41 42 42 42 41 41 41 41 42 42 42 42 42 42 42 42 42 42 42 42 43 43 43 43 43 43 43 43 43
-7179 43 43 43 43 42 42 42 42 42 42 42 42 42 42 42 42 42 42 42 42 42 41 41 41 41 42 42 42 41 41 41 41 41 41 41 41 41 41 41 41 41 41 42 42 42 42 42 42 42 42 42 42 42 42 42 42 42 42 42 42 42 42 42 42 42 42 42 42 42 42
-7227 42 42 42 42 42 42 41 41 41 42 42 42 42 42 42 42 42 42 42 41 41 41 41 41 41 42 42 42 42 42 43 43 43 43 43 43 43 43 44 43 43 43 43 43 42 42 42 42 42 42 42 42 42 43 43 43 43 43 43 43 43 43 43 42 42 42 42 42 42 42
-7275 42 42 42 42 42 42 42 42 42 42 42 42 43 43 43 43 43 43 43 42 42 42 42 42 42 43 43 43 43 43 43 43 43 43 43 43 43 43 42 42 42 42 42 42 42 42 42 42 42 42 43 43 43 42 42 42 42 42 42 43 43 43 43 43 42 42 42 42 42 42
-7323 42 42 42 42 42 42 42 42 41 41 42 42 42 42 42 41 41 41 41 41 41 41 40 40 40 41 41 41 41 41 41 41 41 41 41 42 42 42 42 42 43 43 43 43 42 42 42 42 42 42 42 42 42 42 42 42 41 41 41 41 41 41 41 41 41 41 42 42 42 43
-7371 43 43 44 44 44 44 44 43 43 43 43 43 43 42 42 42 42 42 42 42 42 42 41 41 42 42 42 42 42 41 41 42 42 42 43 43 43 43 43 42 42 42 42 41 41 41 41 41 41 40 40 40 40 39 39 40 40 40 40 40 41 41 41 42 42 43 43 43 43 43
-7419 43 43 43 43 43 43 43 43 42 42 42 41 41 41 41 41 41 41 41 41 41 41 41 41 42 42 42 42 42 41 41 40 40 40 39 39 39 39 39 39 40 40 40 40 40 41 41 41 42 42 43 42 42 42 42 42 42 41 41 41 42 42 42 42 42 42 42 42 41 41
-7466 41 41 41 41 40 40 40 39 40 40 40 41 41 41 41 42 42 42 42 42 42 42 42 42 42 42 42 42 41 41 41 41 41 41 41 42 42 41 41 41 41 41 42 42 42 42 42 41 41 41 41 41 41 41 41 42 42 42 42 42 42 42 41 41 41 41 41 41 41 41
-7514 41 41 42 42 42 42 42 42 43 43 42 42 42 42 42 42 42 42 42 42 42 42 42 42 42 43 43 43 43 43 43 43 43 42 42 42 42 42 42 42 42 42 42 42 42 42 42 42 42 42 42 42 42 42 42 42 42 42 43 43 43 43 43 43 43 43 43 42 42 42
-7562 42 41 41 41 40 40 40 39 39 39 39 39 39 40 40 40 40 40 41 41 41 41 41 42 42 42 43 43 42 42 42 42 42 41 41 41 41 41 41 41 41 41 41 41 40 40 40 40 41 41 41 41 42 42 42 42 42 42 41 41 41 41 41 41 41 41 41 41 41 41
-7610 41 41 41 42 42 42 42 42 42 42 42 42 42 42 42 42 42 42 42 42 42 43 43 43 43 43 43 43 43 43 43 43 43 43 43 42 42 42 42 42 42 42 41 42 42 42 42 41 41 41 41 41 41 41 41 41 41 41 41 41 41 41 41 41 41 41 41 41 41 42
-7658 42 42 42 42 42 42 42 43 43 43 43 43 43 43 43 42 42 42 42 42 42 42 41 41 41 41 40 40 40 40 41 41 41 41 42 42 42 42 42 42 42 43 43 44 44 44 44 43 43 43 42 42 42 42 42 41 41 41 41 41 41 41 41 42 41 41 41 41 41 41
-7706 41 41 41 41 41 41 41 40 40 40 40 40 40 40 40 40 40 40 40 41 41 41 41 41 42 42 42 43 43 43 43 43 43 43 43 43 43 43 42 42 42 42 41 41 41 41 41 41 41 41 41 40 40 40 40 40 40 40 41 41 41 41 42 41 41 41 41 41 41 40
-7754 40 40 40 40 40 41 41 41 41 41 41 41 41 41 42 42 41 41 41 41 41 41 42 42 43 43 43 43 43 43 43 43 43 43 43 43 43 43 43 43 43 43 43 43 43 43 43 43 42 42 42 42 41 41 40 40 40 39 39 39 39 39 39 39 39 39 40 41 41 41
-7801 41 41 42 42 42 42 42 42 43 43 43 42 42 42 41 41 41 41 41 41 42 42 42 42 42 42 42 42 42 42 42 42 42 42 42 42 42 42 42 42 42 42 42 42 42 42 42 42 43 43 43 44 44 44 43 43 43 43 43 43 43 42 42 42 42 41 41 41 41 40
-7849 40 40 40 40 40 40 40 41 41 41 41 41 41 42 42 42 42 42 42 42 42 42 42 42 42 41 41 41 41 41 41 41 41 41 41 41 41 41 41 41 41 41 41 41 41 41 41 41 41 41 42 41 41 41 41 41 41 41 41 41 41 41 41 41 41 41 42 42 42 42
-7897 42 42 42 42 42 42 41 41 41 41 41 41 42 42 42 42 42 42 42 42 42 42 43 42 42 42 42 42 42 42 42 42 42 43 43 43 43 43 43 43 43 42 42 42 41 41 41 41 41 41 41 42 42 42 42 42 42 42 42 42 42 42 42 42 42 42 42 43 43 43
-7945 43 42 42 42 42 42 42 42 42 42 41 41 41 41 41 41 41 41 41 41 41 41 41 41 42 42 42 42 43 43 43 43 43 43 43 44 44 44 44 43 43 43 42 42 42 42 41 41 41 41 41 41 40 40 40 40 39 39 39 39 39 40 40 40 40 40 40 40 40 40
-7993 40 40 40 40 40 40 40 40 39 39 39 39 39 39 39 40 40 40 40 41 41 41 40 40 40 40 40 41 41 41 41 41 41 41 41 41 41 41 41 41 41 41 41 41 41 41 41 41 41 42 42 42 42 42 42 42 42 42 42 42 42 41 41 41 41 40 40 40 41 41
-8041 41 41 41 41 41 42 42 42 42 42 42 42 42 42 42 42 42 42 42 42 42 42 42 42 42 42 42 42 42 41 41 41 42 42 42 42 42 42 42 42 42 42 42 42 41 41 41 41 40 40 40 41 41 41 41 41 41 41 41 41 42 42 42 42 42 42 42 41 41 41
-8089 41 41 41 41 41 41 41 41 41 41 41 41 40 41 41 41 41 41 41 41 41 41 41 41 41 41 41 42 42 42 42 42 41 41 41 42 42 42 42 42 42 42 42 42 42 42 42 42 42 41 41 41 40 40 40 40 40 40 40 40 40 39 39 39 39 39 40 40 40 40
-8136 40 40 41 41 41 41 41 41 41 41 41 41 41 41 41 41 42 42 42 43 43 43 42 42 42 42 41 41 42 42 42 42 42 42 42 42 42 41 41 41 41 41 41 41 41 41 41 41 41 41 41 41 41 42 42 42 42 42 41 41 41 41 41 41 41 41 41 41 41 41
-8184 41 41 41 41 41 41 41 41 41 41 41 41 41 41 41 41 40 40 40 39 39 39 39 39 39 40 40 40 40 41 41 41 41 41 41 41 40 40 40 40 41 41 41 41 41 41 42 41 41 42 41 41 41 41 40 40 40 40 40 40 40 40 40 40 40 40 40 40 40 40
-8232 40 40 40 40 41 41 41 41 41 40 40 40 40 40 40 40 41 41 41 41 41 41 41 41 41 41 42 42 42 43 43 43 42 42 42 42 42 42 42 42 42 42 42 42 42 42 42 42 42 41 41 41 41 41 41 41 42 42 42 42 42 42 42 42 42 42 41 41 41 41
-8280 41 41 41 41 41 41 40 40 40 40 40 40 40 40 40 40 40 40 40 40 40 40 40 40 40 40 40 40 40 40 40 40 40 40 40 40 40 40 40 40 40 40 40 40 40 40 41 41 41 41 41 41 41 41 41 41 41 41 40 40 40 39 39 39 39 40 40 40 40 40
-8328 40 41 41 41 41 41 41 41 41 41 41 41 41 41 41 40 40 40 40 40 40 41 41 41 41 41 41 41 40 40 40 40 40 41 41 41 41 41 41 42 42 42 42 42 42 42 42 42 41 41 41 40 40 40 40 40 40 40 40 40 40 40 41 41 41 41 41 41 41 41
-8376 41 40 40 41 41 41 41 41 41 41 42 42 42 42 42 42 42 41 41 41 41 41 41 41 41 41 41 41 41 42 42 42 42 42 43 43 43 43 42 42 42 42 42 42 42 42 43 43 43 43 42 42 43 43 43 43 42 42 42 42 42 42 43 43 43 43 43 43 43 43
-8424 43 43 43 43 42 42 42 42 42 43 43 43 42 42 42 42 42 42 42 42 42 42 42 42 42 42 41 41 41 41 41 41 40 40 40 40 40 40 40 40 41 41 41 41 41 41 41 41 41 41 41 41 41 41 41 41 41 41 41 41 40 40 40 40 39 39 39 39 39 39
-8471 39 39 40 40 41 41 41 42 42 42 42 42 42 42 42 42 42 42 42 42 42 42 42 42 42 42 42 42 42 42 42 41 41 41 42 42 42 42 42 42 42 42 42 42 42 41 41 41 41 41 41 41 41 41 42 42 42 42 42 42 42 42 42 43 43 42 42 42 41 41
-8519 41 41 41 41 41 41 41 42 41 41 41 41 41 40 40 40 40 40 40 40 41 41 41 41 41 41 41 41 41 41 41 41 41 41 41 42 42 42 42 42 42 42 43 43 43 43 42 42 42 42 42 42 42 42 42 42 42 42 41 41 41 40 40 41 41 41 41 42 42 42
-8567 42 42 42 42 41 41 41 41 41 41 41 41 41 41 41 41 41 41 41 41 40 40 40 40 40 41 41 41 41 41 41 41 40 40 40 40 39 39 39 39 39 40 40 40 41 41 41 42 42 42 42 42 42 42 42 42 41 41 41 41 40 40 41 41 41 42 42 42 42 41
-8615 41 41 41 41 41 40 40 40 40 39 40 40 40 40 40 40 41 41 41 41 41 41 41 41 41 41 41 41 41 41 41 41 41 41 41 42 42 42 42 42 42 41 41 41 41 41 41 41 41 41 41 41 41 42 42 43 43 43 44 44 44 44 43 43 42 42 41 41 41 40
-8663 40 40 40 40 40 40 40 40 40 40 40 40 40 40 40 40 40 40 40 40 40 40 40 40 40 40 41 41 41 41 41 42 42 43 43 43 43 43 43 43 43 42 42 42 42 42 42 42 42 42 42 42 42 42 42 42 42 42 42 42 42 42 41 41 40 40 40 40 40 40
-8711 40 40 40 41 41 40 40 40 40 40 40 40 40 40 40 40 40 40 40 40 41 41 41 41 41 41 41 41 41 41 41 41 41 41 41 41 41 40 40 40 40 40 40 40 40 40 40 40 41 41 41 41 42 42 42 42 42 42 43 42 42 42 42 42 42 41 41 41 41 41
-8759 41 41 42 42 42 43 43 43 43 43 43 43 43 42 42 42 42 42 42 42 42 41 41 41 41 41 40 41 41 41 41 41 41 41 41 42 42 42 42 42 42 42 42 42 42 41 41 41 41 41 41 41 41 41 41 41 41 41 42 42 42 42 42 42 42 41 41 41 40 40
-8806 40 40 39 39 39 40 40 40 40 40 40 40 40 40 40 40 40 40 40 40 40 40 40 41 41 41 41 41 41 41 41 40 40 41 41 41 41 41 41 41 41 41 41 41 41 41 41 41 41 41 41 41 41 41 41 41 40 40 40 39 39 39 38 38 38 38 38 38 38 38
-8854 38 38 38 38 38 39 39 39 39 39 40 40 40 40 40 40 40 39 39 39 39 39 39 39 39 39 39 39 39 39 39 39 39 38 38 38 38 39 39 39 39 39 39 39 40 40 40 40 40 40 40 41 41 41 41 41 42 42 42 42 42 42 42 42 42 42 42 42 42 42
-8902 42 42 42 42 42 42 42 41 41 41 40 40 40 40 40 40 40 40 41 41 41 41 41 41 41 40 40 40 40 41 40 40 40 40 40 39 39 40 40 40 41 41 42 42 42 42 42 42 42 41 41 41 41 41 41 40 40 40 40 40 40 40 40 40 40 40 40 40 40 40
-8950 40 40 40 40 41 41 41 41 41 42 42 42 42 42 42 42 41 41 41 41 41 41 41 40 39 39 39 38 38 39 39 39 39 39 40 39 39 39 39 39 39 39 38 39 39 39 39 40 40 40 40 40 40 40 40 40 40 40 40 40 40 40 40 40 40 40 40 40 40 40
-8998 40 40 40 40 40 40 39 39 39 38 39 39 39 39 39 39 39 39 40 40 40 40 40 40 41 41 41 40 40 40 40 40 40 40 40 40 40 39 39 39 39 39 39 39 40 40 40 40 40 40 40 40 40 41 40 40 40 39 39 39 39 39 39 40 40 41 41 42 42 42
-9046 42 41 41 41 41 41 40 40 40 40 40 40 40 40 40 40 40 40 40 40 40 39 39 39 39 39 39 39 39 39 39 39 39 39 39 39 40 40 40 40 41 41 40 40 40 40 40 40 40 40 40 40 40 40 40 40 41 41 41 41 41 41 41 41 41 41 41 41 40 40
-9094 40 40 40 40 40 40 40 40 40 40 40 40 40 40 40 40 40 40 40 40 40 40 41 41 41 41 41 41 41 41 41 41 41 41 42 42 41 41 41 41 41 41 41 41 41 41 42 42 42 42 42 42 42 41 41 40 40 40 40 41 41 42 42 42 41 41 41 41 40 40
-9141 40 40 39 39 39 39 39 39 40 40 40 40 40 40 40 40 40 41 41 40 40 40 40 40 41 41 41 41 41 41 41 41 41 41 41 41 41 41 41 41 41 41 41 41 41 41 41 41 41 41 41 41 40 40 40 40 40 40 39 39 40 40 40 40 40 40 40 40 41 41
-9189 41 41 41 41 41 41 41 41 41 41 41 41 41 41 41 40 40 40 40 39 40 40 40 40 40 41 41 41 40 40 40 40 40 40 40 40 40 40 40 40 40 40 40 40 40 40 40 40 40 40 40 40 39 39 39 39 39 38 38 38 39 39 39 39 39 39 39 39 39 39
-9237 39 39 39 40 40 40 40 40 40 40 41 41 41 41 41 41 40 40 40 40 40 40 41 41 41 41 41 41 41 41 41 41 41 41 40 40 40 40 40 40 40 40 40 40 40 40 40 39 39 39 39 39 39 39 39 40 40 40 41 41 41 41 41 41 40 40 40 40 40 40
-9285 40 40 40 39 39 40 40 40 40 41 41 41 41 40 40 40 40 40 40 40 40 40 41 41 41 41 41 41 41 41 41 41 41 40 40 40 40 40 40 40 40 40 40 40 40 40 40 40 39 39 40 40 40 40 40 40 40 39 40 40 40 40 40 40 40 40 40 40 40 40
-9333 40 40 40 40 40 41 41 41 41 41 42 42 42 42 42 42 42 42 42 42 41 42 41 41 41 40 40 40 39 39 39 39 39 40 40 40 40 40 40 40 40 40 40 40 40 40 40 40 40 40 40 40 40 40 40 40 40 40 40 39 39 39 39 39 39 39 40 40 40 40
-9381 40 40 40 40 39 39 39 39 39 39 39 39 39 39 39 39 39 39 38 38 38 38 38 38 38 38 39 39 39 39 39 39 39 40 40 40 40 40 40 40 40 39 39 39 39 39 40 40 40 40 40 40 40 41 41 41 41 42 42 42 42 42 41 41 41 41 40 40 40 41
-9429 41 41 42 42 42 42 41 41 41 41 41 41 41 41 41 41 41 41 41 41 41 40 40 40 40 40 40 40 40 39 39 39 39 39 39 39 38 38 38 38 38 39 39 39 39 39 39 39 39 39 39 38 38 38 38 38 38 39 39 39 39 39 39 39 39 39 40 40 40 40
-9476 40 40 40 40 39 39 39 39 39 39 39 39 39 40 40 40 40 40 40 40 40 40 40 40 40 40 40 40 40 40 40 40 40 40 40 40 40 40 40 40 40 41 41 41 41 41 41 41 41 41 41 40 40 40 41 40 40 40 40 40 40 40 39 39 39 39 39 39 39 39
-9524 39 39 40 40 40 40 39 39 39 39 39 39 40 40 40 40 41 41 41 40 40 40 40 40 40 40 40 40 40 40 40 40 40 40 40 40 40 40 40 40 40 39 39 39 39 40 40 40 40 39 39 39 39 39 38 38 38 38 38 38 39 39 39 39 40 40 40 40 40 40
-9572 40 40 40 40 40 40 39 39 39 39 39 40 40 40 39 39 39 39 39 39 39 40 40 40 40 40 40 40 40 40 40 41 41 41 41 41 41 41 41 41 41 41 41 41 41 41 41 40 40 40 40 41 41 41 41 41 41 41 41 41 41 41 41 41 41 41 41 41 41 41
-9620 41 41 41 41 40 40 40 40 40 40 41 40 40 40 40 39 39 39 39 39 39 39 39 40 40 40 40 41 41 41 41 41 41 41 41 41 41 41 41 41 41 41 40 40 40 40 40 40 40 40 40 41 41 40 40 40 40 39 40 40 40 40 40 40 40 41 41 41 40 40
-9668 40 39 39 39 38 38 38 38 38 39 39 39 39 39 39 39 39 39 39 39 39 39 39 40 40 40 40 40 40 40 41 41 41 41 41 41 41 41 40 40 40 40 40 40 40 40 41 41 41 41 41 41 41 41 41 40 40 40 40 40 40 40 40 40 41 41 41 41 41 41
-9716 41 41 41 41 41 41 41 41 41 41 41 41 40 40 40 40 40 40 40 41 41 41 41 41 41 41 41 41 41 41 41 41 41 41 41 42 42 42 42 42 42 42 42 41 41 41 41 40 40 40 40 40 40 40 41 41 41 41 41 41 41 41 40 40 39 39 39 38 38 38
-9764 38 38 38 38 38 38 39 39 39 39 39 39 39 39 39 39 39 39 39 39 39 39 39 39 40 40 40 40 40 40 40 40 40 40 40 41 41 41 41 42 41 41 41 41 41 41 41 41 41 42 42 42 42 42 42 42 42 42 42 42 42 42 41 41 41 41 40 40 40 39
-9811 39 39 40 40 40 40 40 40 40 41 41 41 41 40 40 40 40 40 40 40 40 40 41 41 41 41 41 41 41 41 40 40 40 39 39 39 39 39 39 39 39 39 38 38 38 38 38 38 38 39 39 39 39 39 39 39 39 39 39 39 39 39 38 38 38 38 38 38 38 38
-9859 38 39 39 39 39 39 40 40 40 40 40 40 40 40 40 40 40 40 40 40 40 40 41 41 41 41 41 41 41 41 41 41 41 40 40 40 39 39 40 40 40 40 40 39 39 39 39 39 39 39 39 39 39 39 39 39 39 39 39 39 39 39 39 39 39 39 39 40 40 40
-9907 40 40 40 40 40 40 40 40 40 40 40 40 40 40 40 40 40 40 40 40 40 40 40 40 39 39 39 38 38 38 38 38 38 39 39 40 40 40 40 40 39 39 39 39 39 39 39 39 39 39 38 38 38 38 38 38 39 39 39 39 39 39 39 39 39 39 39 39 39 39
-9955 39 40 40 40 40 40 40 40 40 39 39 39 39 39 39 39 40 40 40 40 40 40 40 40 41 41 41 40 40 40 40 40 40 40 40 40 40 40 40 40 40 40 40 40 40 40 40 41 41 41 41 41 41 42 42 42 42 42 41 41 40 40 39 39 39 40 40 40 40 40
-10003 40 40 40 41 41 41 41 41 41 41 41 41 41 41 41 41 41 41 40 40 40 40 40 40 40 40 40 40 40 40 40 40 40 40 39 39 39 39 39 39 39 39 39 39 39 39 39 39 39 39 39 39 39 40 40 40 40 40 40 40 39 39 39 39 39 39 39 39 39
-10050 39 39 39 39 39 39 40 40 40 40 40 41 41 41 40 40 39 39 39 39 39 39 39 39 39 39 39 39 39 39 39 39 39 39 39 40 40 40 41 41 41 41 41 41 41 41 42 42 42 42 42 42 42 42 41 41 41 41 41 41 41 41 41 41 41 41 41 41 41
-10097 41 40 40 40 40 40 40 40 40 39 39 39 39 39 39 38 38 38 38 39 39 39 39 39 39 39 39 39 38 38 38 38 38 38 38 38 38 39 39 40 40 40 40 40 40 40 40 40 40 41 41 41 41 41 40 40 41 41 41 41 41 41 40 40 39 39 38 38 39
-10144 39 39 39 39 39 39 38 38 39 39 39 40 40 40 40 40 40 40 40 40 40 40 40 40 40 40 40 40 40 39 39 39 39 39 39 39 39 39 40 40 40 40 40 40 40 40 40 40 41 41 41 40 40 40 40 40 41 41 41 41 41 41 41 41 41 41 41 41 41
-10192 41 41 41 41 41 41 41 41 41 41 41 41 41 41 41 41 41 41 41 40 40 40 40 40 39 39 39 39 39 39 39 39 39 39 39 39 40 40 40 40 40 40 40 40 40 40 40 40 40 40 40 40 40 40 41 41 41 41 41 40 40 40 40 40 40 40 40 41 41
-10239 41 41 40 40 40 40 40 40 40 40 40 40 40 39 39 39 39 39 39 39 39 39 39 39 39 39 39 39 39 39 40 40 40 40 40 41 41 41 41 41 41 41 41 41 41 41 40 40 40 40 39 39 39 40 40 40 40 40 40 40 40 40 40 40 40 41 41 41 41
-10286 41 41 41 41 41 41 42 42 42 42 41 41 41 40 40 40 40 40 40 41 41 41 42 42 42 42 42 41 41 41 41 41 40 40 40 40 40 40 39 39 39 39 39 39 39 39 40 40 39 39 39 39 39 39 39 39 39 39 39 39 40 40 40 40 40 40 40 39 39
-10333 39 39 39 39 39 39 39 40 40 40 40 40 40 40 40 41 41 41 40 40 40 40 40 40 40 40 40 41 41 41 41 41 41 41 41 41 41 41 41 41 41 41 41 41 41 41 41 40 40 40 40 40 40 40 40 40 39 39 39 39 39 39 39 39 39 40 40 40 41
-10380 41 41 41 41 41 40 40 40 39 39 39 39 39 40 40 40 41 41 41 41 40 40 40 40 40 40 40 40 41 40 40 40 40 40 40 40 40 40 40 40 40 40 39 39 39 39 39 40 40 40 40 40 39 40 40 40 40 40 40 40 40 40 40 40 40 40 40 40 40
-10427 40 40 40 40 40 40 39 40 40 40 40 40 40 40 40 40 40 40 40 40 40 39 39 39 39 39 40 40 40 40 40 41 41 41 40 40 40 40 40 40 40 40 40 40 40 40 39 39 39 39 39 39 40 40 40 40 40 40 40 40 40 40 40 39 39 39 39 39 39
-10475 39 39 39 38 38 39 39 39 40 40 40 40 40 40 40 39 39 39 39 39 39 39 39 39 39 39 39 39 39 39 39 39 39 39 40 40 40 40 40 40 41 40 40 40 40 40 40 39 39 39 39 39 39 39 39 38 38 38 38 38 38 38 38 38 39 39 39 39 39
-10522 39 40 40 40 40 40 40 40 40 40 40 40 40 40 40 40 39 39 39 39 39 39 39 39 39 39 39 39 39 39 39 39 39 39 39 39 39 39 39 39 39 39 39 39 39 39 39 39 39 39 39 40 40 40 40 39 39 39 38 38 38 38 38 39 39 39 39 39 39
-10569 39 40 40 40 41 41 41 40 40 40 40 40 40 40 40 40 40 40 40 41 41 41 41 41 41 40 40 40 40 39 39 39 39 38 38 38 38 39 39 39 39 39 39 39 39 39 39 39 39 39 39 39 38 39 39 39 39 39 39 39 39 39 39 39 39 39 39 39 39
-10616 39 39 39 39 39 39 39 40 40 40 39 39 39 39 39 39 39 39 39 39 39 39 39 38 38 38 38 38 38 39 39 39 40 40 40 40 40 40 40 40 40 40 40 40 40 40 40 40 40 40 40 40 40 40 40 40 40 40 40 40 39 39 39 39 39 39 39 39 39
-10663 39 39 39 39 39 40 40 40 40 39 39 38 38 38 38 38 38 38 38 38 38 38 38 38 38 39 39 39 39 39 39 40 40 40 40 40 40 40 41 41 41 41 41 41 40 40 40 40 39 40 40 40 40 40 40 40 40 40 40 40 40 40 39 39 39 39 39 39 39
-10710 39 39 39 39 39 39 39 39 39 39 39 39 38 38 38 38 38 38 39 39 39 39 39 39 39 39 39 39 39 39 39 39 39 39 39 39 39 39 40 40 40 40 40 40 40 40 40 40 40 40 40 41 41 41 41 41 41 41 41 41 41 41 40 40 40 40 40 40 40
-10757 40 40 40 40 40 40 40 40 40 39 39 39 39 39 39 39 39 39 39 40 40 40 40 40 40 40 40 40 40 40 40 39 39 39 40 39 39 39 39 39 38 38 38 37 37 37 37 37 37 37 37 37 37 38 38 38 39 39 39 39 40 40 40 40 40 40 40 40 40
-10805 40 40 40 40 40 40 40 40 40 40 40 40 40 40 40 40 40 40 40 40 40 39 39 39 39 39 39 39 39 39 39 39 39 39 39 39 39 39 39 39 39 40 40 40 41 41 41 41 41 40 40 40 40 40 40 41 41 41 41 41 41 40 40 40 40 39 39 39 39
-10852 39 39 39 39 39 39 39 39 39 39 39 39 39 39 39 39 39 39 39 38 38 38 38 38 38 38 39 39 39 40 40 40 40 40 40 40 40 40 41 41 41 41 41 41 41 41 40 40 39 39 39 39 38 38 38 38 38 38 39 39 39 39 39 39 39 39 39 39 39
-10899 39 39 39 39 40 40 40 40 40 40 39 39 39 38 38 38 39 39 39 40 40 40 40 40 40 40 40 39 39 39 39 39 39 39 39 39 39 39 39 39 39 39 39 39 39 39 39 39 38 38 38 38 38 38 38 39 39 39 39 40 40 40 40 40 40 40 39 39 39
-10946 39 39 39 39 39 39 39 39 39 39 39 39 39 39 39 39 39 39 39 40 40 39 39 39 39 39 39 39 39 39 39 38 38 38 38 38 38 39 39 40 40 40 40 40 40 40 40 40 41 41 41 41 41 41 41 41 41 41 41 41 41 41 41 41 41 41 41 41 41
-10993 41 41 41 41 41 41 41 41 41 41 41 41 42 42 41 41 41 41 41 41 40 40 40 40 40 40 41 41 41 41 41 41 41 41 40 40 40 40 41 41 41 41 41 40 40 40 40 40 40 40 40 40 40 41 41 41 41 41 41 41 41 41 40 40 40 40 40 40 40
-11040 40 40 40 40 40 40 40 40 40 40 40 40 40 40 40 40 40 40 40 41 41 41 41 41 41 41 41 41 41 41 41 41 41 40 40 40 40 40 40 39 39 39 39 39 39 39 39 39 39 39 39 39 39 39 39 38 38 38 38 39 39 39 39 38 38 38 38 39 39
-11088 39 39 39 39 39 39 39 39 39 39 39 39 39 39 39 39 40 40 40 40 40 40 40 41 41 41 41 40 40 40 40 39 39 39 38 38 38 39 39 39 40 40 40 40 39 39 39 39 39 39 39 39 39 39 39 39 39 40 40 40 40 40 40 40 40 40 40 40 40
-11135 40 40 40 40 40 40 40 40 40 39 39 39 39 39 38 38 39 39 39 39 39 39 39 39 40 39 39 39 39 39 39 39 39 39 39 39 39 39 39 39 39 39 40 40 40 40 40 40 40 40 40 40 40 40 40 40 40 40 40 39 39 39 39 40 40 40 40 40 40
-11182 40 40 39 39 39 40 40 40 40 41 41 41 41 41 41 41 41 41 41 41 41 41 41 41 41 41 41 41 41 40 40 40 40 40 40 40 40 40 40 41 41 41 40 40 40 40 41 41 41 41 41 41 41 41 41 41 41 41 41 41 40 40 40 40 41 41 41 41 41
-11229 41 41 40 40 40 40 40 40 40 40 40 41 40 40 40 40 40 40 40 40 40 40 39 39 39 39 39 39 39 39 39 39 39 39 39 40 40 40 39 39 39 39 39 39 39 38 38 38 38 38 38 38 38 39 39 39 39 39 39 39 39 39 39 39 39 39 39 39 39
-11276 39 39 39 39 39 39 39 39 39 39 39 39 39 39 39 39 39 39 40 40 40 39 39 39 39 38 38 38 38 38 38 38 39 39 39 39 39 39 39 39 40 40 40 40 40 40 40 40 40 40 40 40 40 40 40 40 40 41 41 41 41 41 41 40 40 40 39 39 39
-11323 39 39 39 38 38 38 39 39 39 39 39 39 39 40 40 40 40 40 40 40 40 40 40 40 40 40 40 40 40 40 39 39 39 39 39 39 39 39 39 39 39 39 39 38 38 38 39 39 39 39 39 39 39 39 39 39 39 39 39 39 39 39 39 39 39 38 38 38 38
-11371 38 38 38 38 38 39 39 40 40 40 40 40 40 40 39 39 39 38 38 38 38 39 39 39 40 40 40 40 40 40 40 40 40 39 39 39 39 39 39 39 39 39 39 39 39 39 39 39 39 39 39 39 39 39 39 39 39 39 39 39 39 39 39 39 39 39 39 39 39
-11418 39 40 40 40 40 40 40 40 40 40 40 40 40 40 40 40 40 40 40 41 41 41 41 41 41 41 41 40 40 40 40 40 40 40 40 40 40 40 40 40 39 39 39 39 39 39 40 40 40 40 40 40 40 40 39 39 39 39 39 38 38 38 39 39 39 39 39 39 40
-11465 40 40 40 40 40 40 40 40 40 40 40 39 39 39 38 38 38 39 39 40 40 40 40 41 41 41 41 41 41 40 40 40 40 40 40 40 40 40 40 40 40 40 40 40 40 39 39 39 39 39 39 39 38 38 39 39 39 39 39 39 39 39 39 39 39 40 40 40 39
-11512 39 39 39 39 39 39 39 39 39 39 39 39 39 38 38 38 38 39 39 39 39 40 40 41 41 41 41 41 41 41 41 41 41 41 41 40 40 40 40 40 40 40 40 40 40 40 40 40 40 40 39 39 39 39 39 38 38 38 38 38 38 38 38 38 38 39 39 40 40
-11559 40 40 40 39 39 39 39 39 39 39 39 38 38 39 39 39 39 39 39 39 39 39 39 39 40 40 40 40 40 40 40 40 40 40 40 40 40 40 39 39 39 39 39 39 39 39 39 39 39 39 39 39 39 39 39 40 40 40 40 40 40 40 41 41 40 40 40 40 40
-11606 40 40 39 39 39 40 40 40 40 41 41 41 41 41 41 41 41 41 42 42 42 42 42 42 41 41 41 41 41 41 41 41 41 41 41 40 40 40 40 40 40 40 40 40 40 41 41 41 41 41 41 41 41 41 41 40 40 40 40 39 39 39 39 39 38 39 39 39 39
-11654 39 40 40 40 40 40 40 40 40 40 40 40 40 40 40 40 40 40 40 40 40 40 40 40 40 40 40 40 40 40 40 40 40 40 40 40 40 40 39 39 40 40 40 40 40 40 40 40 39 39 39 39 39 39 39 39 39 38 38 38 38 38 38 38 38 38 38 38 38
-11701 38 38 39 39 39 39 39 40 40 40 40 40 40 40 40 40 40 41 41 41 41 41 41 41 41 41 41 41 40 40 40 39 39 39 39 39 39 39 39 39 39 39 39 39 39 39 39 39 39 39 40 40 40 39 39 39 39 39 39 39 39 38 38 38 38 38 38 38 39
-11748 39 39 39 39 39 39 39 39 39 39 39 38 38 39 39 39 39 39 39 39 40 40 40 40 40 40 40 39 39 39 38 38 37 37 37 38 38 38 38 38 39 39 39 39 39 39 39 39 40 40 40 40 40 40 40 40 40 40 40 40 40 40 40 40 40 40 40 40 40
-11795 40 40 39 39 39 38 38 37 37 37 37 37 37 38 38 38 38 38 38 39 39 39 39 38 39 39 39 40 40 41 41 40 40 40 40 40 40 40 40 40 40 40 40 40 40 40 40 40 40 40 40 40 40 40 41 41 41 41 41 40 40 40 39 39 39 39 39 39 39
-11842 39 40 40 40 40 40 40 39 39 39 39 39 39 40 39 39 39 39 38 38 38 39 39 39 40 40 40 39 39 39 38 38 38 38 38 38 38 38 38 38 38 38 38 38 39 39 39 39 39 39 39 39 39 39 39 39 39 39 39 39 39 39 39 39 39 39 39 40 40
-11889 40 40 40 40 39 39 39 39 39 39 39 39 39 39 39 39 39 39 40 40 40 40 40 40 40 39 39 39 39 39 39 39 38 38 38 38 39 39 39 39 39 39 40 40 40 40 40 40 40 40 39 39 39 39 39 39 39 39 39 39 39 39 39 39 39 39 39 39 39
-11937 39 39 39 39 39 39 39 40 40 40 40 40 40 40 40 40 39 39 39 39 39 39 39 39 40 40 40 40 41 41 40 40 40 40 40 40 40 40 39 39 39 39 40 40 40 40 40 40 39 39 39 39 39 39 39 39 40 40 40 40 40 40 40 40 40 40 40 40 40
-11984 40 40 40 40 40 39 39 39 39 39 40 40 40 40 40 40 41 41 40 40 40 40 40 40 40 41 41 41 41 42 41 41 41 41 40 40 40 40 40 40 41 41 41 41 41 41 41 41 41 41 41 41 41 40 40 40 40 40 40 40 40 40 40 40 40 40 39 39 39
-12031 39 39 39 39 39 39 39 39 40 40 40 40 41 41 41 41 41 40 40 40 40 39 39 39 39 39 39 39 39 39 39 40 40 40 40 40 40 39 39 39 38 38 38 38 38 38 37 37 37 37 37 38 38 38 38 39 39 39 40 40 40 40 39 39 39 39 39 39 39
-12078 39 39 39 39 39 39 39 38 38 38 38 38 38 38 38 38 38 38 38 39 39 39 39 39 40 40 40 40 39 39 39 39 39 39 39 39 40 39 39 39 39 39 39 39 38 39 39 39 39 39 40 40 40 40 39 39 39 38 38 38 38 38 39 39 39 39 39 39 39
-12125 39 39 39 39 40 40 39 39 39 40 40 40 40 40 40 40 40 40 40 39 39 39 38 38 38 38 38 38 37 37 37 37 37 37 38 38 39 39 39 39 40 40 40 40 40 40 40 40 40 40 40 40 41 41 40 40 40 40 40 40 40 40 40 39 39 39 38 38 39
-12172 39 39 39 39 39 39 39 39 38 38 38 38 38 38 39 39 39 39 39 39 39 39 39 38 38 39 39 39 39 39 39 39 39 39 39 39 39 39 39 39 39 39 39 40 40 40 39 39 39 39 39 39 39 39 39 39 39 39 39 39 39 39 39 39 39 39 39 39 39
-12220 39 39 39 39 39 39 39 39 38 38 38 38 38 38 38 38 39 39 39 40 40 40 40 40 40 39 39 39 39 39 38 38 38 38 38 38 38 38 38 38 38 38 39 39 39 40 40 40 40 40 40 39 39 39 40 40 40 40 40 40 40 40 39 39 39 38 38 38 38
-12267 38 38 39 39 39 39 39 39 39 39 39 39 39 40 40 40 39 39 39 39 39 39 39 40 40 40 40 40 40 40 41 41 41 41 40 40 40 40 40 40 41 41 40 40 40 40 40 40 40 40 40 39 39 39 39 39 39 40 40 40 40 40 40 39 39 40 40 40 40
-12314 40 40 40 40 40 40 40 40 40 40 40 40 40 40 40 40 40 40 40 40 40 40 40 40 40 40 40 41 41 40 40 40 40 40 40 40 40 40 40 40 40 39 39 39 38 38 38 38 38 38 39 39 39 39 39 40 40 40 40 40 40 40 40 39 39 39 39 39 38
-12361 38 39 39 39 39 39 39 39 39 39 39 39 39 39 39 38 38 38 38 38 38 38 38 38 38 38 38 38 38 38 38 38 38 38 38 38 38 38 38 38 38 38 39 39 39 39 39 39 40 40 39 39 39 40 40 40 40 40 40 40 40 40 40 40 40 40 40 40 40
-12408 40 40 40 40 40 40 40 40 40 40 40 40 40 40 40 40 40 40 40 40 40 40 39 39 39 39 39 39 39 39 39 39 40 40 39 39 39 39 39 39 39 39 39 39 39 39 39 39 39 39 39 39 39 39 39 38 38 38 38 38 38 38 38 38 38 38 38 38 38
-12455 38 38 39 39 40 40 40 40 41 41 41 41 41 40 40 40 40 40 40 40 40 40 40 40 40 40 40 40 40 40 40 40 40 40 40 40 40 40 40 40 40 40 40 40 40 40 39 40 40 40 40 40 40 40 39 39 39 39 38 38 38 39 39 39 40 40 40 40 41
-12503 41 41 41 41 41 40 40 40 40 39 39 39 40 40 40 40 40 40 40 40 40 40 40 40 40 40 40 40 39 39 40 40 40 40 40 40 40 40 40 40 40 39 39 39 39 39 39 40 40 40 40 40 40 40 39 39 39 39 39 39 39 39 39 39 39 39 38 38 38
-12550 38 38 38 39 39 39 39 39 39 39 39 40 40 40 40 40 40 40 39 39 39 39 38 38 38 38 38 39 39 39 40 40 40 40 40 40 40 40 40 40 40 40 40 40 40 40 40 40 40 40 40 40 39 39 39 39 39 39 38 38 38 38 38 38 38 38 38 38 38
-12597 38 38 39 39 39 40 40 40 40 40 40 40 40 40 40 40 40 40 40 40 39 39 39 39 39 39 39 39 39 39 39 39 40 40 40 40 40 40 40 40 40 40 40 40 40 40 40 39 39 39 39 40 40 40 40 40 40 40 40 40 39 39 40 40 40 40 40 40 40
-12644 40 40 41 41 41 41 41 41 41 41 41 41 41 41 40 40 39 39 39 39 39 39 39 39 39 39 39 39 39 39 39 39 39 39 39 39 39 40 40 40 40 40 40 40 40 40 39 39 39 39 39 38 38 38 38 38 38 38 38 38 38 38 38 38 38 38 38 38 37
-12691 37 37 37 37 37 37 37 37 38 38 38 39 39 39 39 39 39 39 39 39 39 40 40 40 40 40 40 40 40 40 40 39 39 39 39 39 39 39 39 39 39 39 39 39 39 39 39 39 38 39 39 39 40 40 40 40 40 40 40 40 40 40 40 40 40 40 40 39 39
-12738 39 39 39 39 39 39 39 40 40 40 40 40 40 40 40 40 40 39 39 39 39 39 39 40 40 40 40 40 40 40 40 40 41 41 41 41 41 42 41 41 41 41 41 40 40 40 40 40 40 40 40 40 40 40 40 40 40 40 40 39 39 39 39 39 39 39 39 39 39
-12786 39 39 39 39 39 39 39 40 40 40 40 40 40 40 40 40 40 40 39 39 39 38 38 38 38 38 38 38 38 38 38 39 39 39 39 40 40 40 40 40 40 40 40 40 40 40 39 39 39 39 39 38 38 38 38 38 38 39 39 39 39 39 39 39 39 39 39 39 39
-12833 39 39 39 39 39 39 39 39 39 39 39 39 39 39 39 39 39 39 39 39 39 40 40 40 40 40 40 40 40 40 40 40 41 41 41 41 41 41 41 41 41 40 40 40 40 40 40 41 41 41 41 41 41 41 41 40 40 40 40 40 39 39 39 39 39 39 39 39 39
-12880 39 39 39 39 39 39 39 39 39 39 39 39 40 40 40 40 40 40 40 40 40 39 39 39 39 39 39 39 39 39 39 39 39 39 39 40 40 40 40 40 40 39 39 39 38 38 38 38 38 38 38 38 38 38 39 39 39 39 39 40 40 40 40 40 40 40 40 39 39
-12927 39 39 39 39 40 40 40 41 41 41 41 41 41 40 40 40 40 40 40 40 39 39 39 39 39 39 39 39 39 39 39 38 38 38 38 38 38 38 38 38 39 39 39 39 40 40 40 40 40 40 40 40 40 40 39 39 38 38 38 38 38 38 37 37 37 37 37 37 37
-12974 37 37 37 37 37 37 37 38 38 38 38 38 38 39 39 39 39 39 39 40 40 40 40 40 40 40 40 40 40 40 40 40 39 39 39 39 39 39 40 40 40 40 40 39 39 39 39 40 40 40 40 40 40 40 40 39 39 39 39 39 39 39 39 39 38 38 38 38 38
-13021 38 39 39 39 40 40 40 41 41 41 41 41 41 41 41 41 41 41 41 41 41 41 41 40 40 40 40 39 39 39 39 39 40 40 39 39 39 40 40 40 40 40 40 40 39 39 39 39 39 39 39 39 39 39 39 39 39 39 39 39 39 39 39 39 40 39 39 39 39
-13069 39 38 38 38 37 37 37 37 38 38 38 38 38 39 39 39 39 39 39 39 39 39 39 39 40 40 40 40 40 40 40 40 39 39 39 39 39 39 39 40 40 40 40 40 40 40 40 40 40 40 39 39 39 39 39 38 38 38 39 39 39 39 39 39 39 39 38 38 38
-13116 38 38 38 38 38 38 38 39 39 39 39 40 40 40 40 40 40 39 39 39 39 39 39 39 39 39 39 39 39 39 39 39 39 39 40 40 40 40 40 39 39 39 39 39 39 39 39 40 40 40 40 40 40 39 39 39 39 39 39 39 39 39 39 39 39 39 39 39 39
-13163 39 39 39 39 39 39 39 39 39 39 39 39 39 39 39 39 39 40 40 40 40 40 40 40 40 40 39 39 39 39 39 39 39 39 39 39 39 39 39 39 39 39 39 39 39 39 39 39 39 39 39 39 39 39 39 40 40 40 40 40 40 40 39 39 39 39 39 39 39
-13210 39 39 38 38 38 38 38 38 38 37 37 37 38 38 38 38 39 39 39 39 39 39 38 38 38 38 38 37 37 37 37 38 38 39 39 39 39 39 39 39 39 39 39 39 39 39 39 40 40 40 40 39 39 39 38 38 37 37 38 38 38 38 38 38 38 38 37 37 38
-13257 38 38 38 38 38 38 38 38 38 39 39 39 38 38 38 38 38 39 39 39 39 39 39 39 39 39 39 39 39 39 39 40 40 40 40 40 40 40 40 39 39 39 38 38 38 38 39 39 39 39 39 39 39 39 39 39 39 39 39 39 40 40 40 40 40 40 40 40 40
-13304 40 40 39 39 39 39 39 38 38 38 38 38 38 38 39 39 39 39 39 39 39 39 39 38 38 38 38 38 38 38 38 38 38 38 38 38 38 38 38 38 38 38 38 38 38 38 38 38 39 39 39 39 39 39 39 40 40 40 40 40 39 39 39 39 39 38 38 38 38
-13351 38 37 37 38 38 38 38 38 38 38 38 38 38 37 37 37 37 37 37 38 38 39 39 40 40 40 40 40 40 40 40 40 40 40 40 40 39 39 39 38 38 38 38 38 37 37 38 38 38 38 38 38 38 38 39 39 39 39 39 40 40 40 39 39 39 39 39 38 38
-13399 38 38 37 37 37 38 38 38 38 39 39 39 39 39 40 40 40 40 39 39 39 39 39 39 39 39 39 39 39 39 39 39 39 39 39 39 39 38 38 38 38 38 38 37 37 38 38 38 38 38 38 39 39 39 40 40 40 40 40 40 40 40 39 39 38 38 38 38 38
-13446 38 39 39 39 39 39 39 39 39 39 39 39 39 38 38 38 38 38 38 38 38 38 38 38 38 38 38 38 38 38 38 38 38 38 39 39 39 39 39 39 39 40 40 40 40 40 40 40 40 40 41 41 41 41 40 40 40 40 40 40 40 40 39 39 39 39 39 39 39
-13493 39 39 39 39 39 39 39 39 39 39 39 39 39 39 39 39 39 39 39 39 39 39 39 39 39 39 39 39 39 38 38 38 38 37 37 37 37 37 37 37 37 37 37 37 37 37 37 37 37 38 38 38 38 38 38 38 37 37 38 38 38 38 39 39 39 39 39 39 39
-13540 39 39 39 40 40 40 40 40 40 39 39 39 38 38 38 38 38 38 38 38 38 38 39 39 39 39 39 39 39 39 39 39 39 39 38 38 38 38 38 38 38 38 38 38 38 38 38 38 38 39 39 39 39 39 40 40 40 40 40 40 40 40 40 40 40 39 39 38 38
-13587 38 38 38 38 38 38 38 38 39 39 39 39 39 39 40 40 40 40 40 40 40 39 39 39 39 39 39 39 39 39 39 39 39 39 39 39 39 39 39 39 38 38 38 39 39 39 39 39 39 39 39 39 39 39 39 39 39 39 39 39 39 39 39 38 38 38 38 38 38
-13634 38 38 38 38 39 39 39 39 39 39 39 39 39 38 38 38 37 37 37 37 38 38 38 39 39 39 39 39 39 39 39 38 38 38 38 38 38 38 38 38 38 38 38 38 38 38 39 39 39 39 39 39 38 39 39 39 39 39 39 39 40 40 40 40 40 40 40 39 39
-13682 39 39 39 40 40 39 39 39 38 38 38 38 37 37 37 37 37 38 38 38 38 38 38 39 39 39 39 40 40 40 40 40 40 40 40 40 40 40 39 39 39 39 39 39 39 39 39 39 39 39 39 39 39 39 39 39 39 39 39 39 39 39 39 39 39 39 39 39 39
-13729 39 40 40 40 40 40 40 39 39 39 38 38 38 38 38 38 38 38 38 38 38 38 38 38 39 39 39 39 39 39 39 39 39 39 39 38 38 38 38 38 39 39 39 40 40 40 40 40 40 40 40 40 40 40 40 40 40 41 41 41 41 41 41 41 41 40 40 40 40
-13776 40 40 40 40 40 40 40 39 39 39 39 39 39 39 39 39 39 38 38 38 38 38 38 38 39 39 39 40 40 40 40 40 40 40 40 40 40 40 40 40 40 40 40 39 39 39 39 39 39 39 39 39 39 39 40 40 40 40 40 40 39 39 39 39 39 38 38 38 38
-13823 38 38 38 38 38 39 39 39 39 39 39 39 39 39 39 39 39 39 39 39 40 40 40 40 40 40 39 39 38 38 38 38 38 38 38 38 38 38 38 38 38 38 38 38 38 38 38 38 38 38 38 39 39 39 39 39 38 38 38 38 38 38 38 38 38 38 38 38 38
-13870 38 38 38 38 38 38 38 38 38 38 38 38 38 38 38 38 38 38 38 38 38 38 38 38 38 38 39 39 39 39 39 39 39 39 39 39 39 39 39 39 39 38 38 38 38 38 38 38 39 39 39 39 39 39 39 39 39 39 39 40 39 39 39 39 39 39 40 40 40
-13917 40 40 40 40 40 40 39 39 39 39 39 39 39 39 39 39 39 39 38 38 38 38 38 37 37 37 37 38 38 38 39 39 39 38 38 38 38 39 39 39 39 39 39 39 39 39 39 39 39 39 39 40 40 40 40 40 39 39 39 39 39 39 39 39 39 39 39 39 39
-13965 39 39 39 39 39 38 39 39 39 39 39 39 39 39 39 38 38 38 38 38 38 38 38 38 39 39 39 39 39 39 38 38 38 38 39 39 39 39 40 39 39 39 39 39 39 39 39 39 39 38 38 38 38 38 39 39 39 39 39 39 39 40 40 40 40 39 39 39 39
-14012 39 39 39 39 39 39 39 39 39 39 39 39 40 40 39 39 39 39 39 39 39 39 39 39 39 39 39 38 38 38 39 39 39 39 39 38 38 38 38 38 37 37 37 37 37 37 37 38 38 38 38 38 38 38 38 38 38 38 38 38 38 38 39 39 39 39 40 40 40
-14059 40 40 39 39 39 39 38 38 38 38 38 38 38 39 39 39 39 39 39 39 39 39 39 39 39 39 40 40 40 40 40 39 39 39 39 38 38 38 38 38 38 38 38 38 38 38 37 37 37 37 38 38 38 38 38 38 38 38 38 38 38 39 39 39 39 39 40 40 40
-14106 40 40 40 40 40 40 40 40 40 40 40 39 39 39 39 39 38 38 38 38 38 38 38 38 38 38 39 39 39 39 39 40 40 40 40 40 40 40 39 39 39 39 39 38 38 38 38 38 38 38 38 38 38 39 39 39 39 39 39 39 39 39 39 39 39 40 40 40 40
-14153 40 40 40 40 40 39 39 39 39 39 39 40 40 40 40 40 40 40 40 40 40 40 40 39 39 39 39 39 39 39 38 38 38 38 38 38 38 39 39 39 39 39 39 39 39 39 39 39 39 39 39 39 39 39 40 40 40 40 40 41 41 41 40 40 40 39 39 39 39
-14200 39 39 39 39 39 39 39 39 38 38 38 37 37 36 36 36 36 36 37 37 37 38 38 38 38 39 39 39 39 40 40 40 40 39 39 39 39 39 39 38 38 38 38 37 37 37 38 38 38 38 38 38 38 38 38 38 38 37 37 36 36 36 36 36 37 37 37 38 38
-14248 38 39 39 39 39 40 40 40 40 40 40 40 40 39 39 38 38 38 38 38 38 38 38 38 38 38 38 38 38 39 39 39 39 39 39 39 39 39 39 39 39 39 39 39 39 39 39 39 39 38 38 38 37 37 37 37 37 37 37 37 37 38 38 38 38 38 39 39 39
-14295 39 39 38 38 38 38 38 37 37 37 37 37 37 37 37 37 37 37 37 37 38 38 38 38 38 38 38 38 38 38 38 38 38 38 38 38 37 37 37 38 38 38 39 39 39 39 39 38 38 38 38 38 38 38 38 38 38 38 38 38 38 38 37 37 37 37 37 37 37
-14342 37 38 38 38 39 39 39 39 40 40 41 41 41 41 41 41 41 41 41 41 41 41 41 40 40 40 40 40 39 39 39 39 39 39 39 39 38 38 38 38 38 38 38 38 38 38 37 37 37 37 37 37 37 37 37 37 37 37 37 37 37 37 37 37 37 38 38 38 38
-14389 38 38 38 38 38 38 38 38 37 37 37 37 37 37 37 38 38 38 38 38 38 38 38 38 38 38 38 38 38 38 38 38 38 38 38 39 39 39 39 39 38 38 39 39 39 39 39 39 39 39 39 39 39 39 39 39 39 39 39 39 39 39 39 39 38 38 38 38 38
-14436 38 38 38 38 38 38 38 38 38 38 38 38 38 38 38 38 39 39 39 39 39 39 39 39 39 39 39 39 39 39 39 39 39 39 40 40 40 40 40 40 40 39 39 39 39 39 39 39 39 39 39 39 39 39 39 39 39 39 39 39 39 39 39 39 39 39 39 39 39
-14483 39 39 39 40 40 40 41 41 41 41 41 41 41 40 40 40 40 39 39 39 39 39 39 39 40 40 39 39 39 39 39 39 39 39 39 39 39 39 38 38 38 38 38 38 38 38 37 37 36 36 36 36 36 36 36 37 37 37 38 38 38 38 38 38 38 38 37 37 37
-14531 37 37 37 37 37 38 38 39 39 39 39 39 39 39 39 39 39 39 39 39 39 39 39 39 39 39 39 38 38 38 38 38 37 38 38 38 38 38 38 38 38 38 38 38 38 38 38 38 38 38 38 38 39 39 38 38 38 38 38 38 38 38 38 38 38 38 38 38 38
-14578 38 38 38 38 38 38 38 38 38 38 38 38 38 38 38 38 38 38 38 39 39 39 39 39 39 39 39 39 38 38 38 38 38 38 38 38 38 39 39 39 40 40 40 40 39 39 39 38 38 38 37 37 36 36 36 36 36 36 37 37 37 37 37 37 37 37 37 37 37
-14625 37 37 37 37 37 37 37 37 37 37 37 37 37 37 37 37 37 38 38 38 38 38 38 38 38 38 38 38 38 38 38 38 38 38 38 38 39 39 39 39 39 39 39 39 39 39 39 39 39 39 39 39 39 39 40 40 40 40 40 40 40 39 39 39 38 38 39 39 39
-14672 39 39 39 39 39 39 39 39 39 39 39 40 40 40 40 40 40 40 40 40 40 40 40 40 39 39 39 39 39 39 39 39 39 39 39 39 38 38 38 38 37 37 38 38 38 38 38 38 38 38 38 38 38 38 38 39 39 39 39 39 39 39 39 39 39 39 39 40 40
-14719 40 40 40 40 40 40 40 40 40 40 40 40 39 39 39 39 39 39 39 39 39 39 39 39 40 40 40 40 40 40 40 39 39 40 40 40 40 40 40 40 39 39 39 39 38 38 38 37 37 37 37 37 36 37 37 37 37 38 38 38 38 38 38 38 38 38 38 38 38
-14766 38 38 38 38 38 39 39 39 39 39 39 39 39 39 40 39 39 39 38 38 38 38 38 38 38 38 38 38 38 38 38 38 38 38 38 38 37 37 37 37 37 37 37 37 37 37 38 38 38 38 38 39 39 39 39 39 39 40 40 40 40 39 39 40 40 40 40 40 40
-14814 40 40 40 39 39 39 39 39 39 39 39 39 39 39 39 39 39 39 39 39 39 39 39 40 40 40 39 39 39 39 39 39 39 39 39 39 39 39 39 39 40 40 40 40 40 40 40 40 40 40 40 40 40 40 40 40 39 39 39 39 39 39 39 38 38 38 38 38 38
-14861 38 38 37 37 37 37 37 37 37 37 38 38 38 38 38 38 38 38 38 38 38 38 37 37 37 37 37 37 38 38 38 38 38 38 38 37 37 37 37 37 37 37 37 38 38 38 38 38 38 39 39 39 39 39 39 39 38 38 38 38 38 38 38 38 38 38 38 38 38
$$ [...]
-45547a
##END=		$$ NMR SPECTRUM
##END=		$$ LINK
