##TITLE=	uivLdqQgRuGYWe4nX+HnOg.11.fid
##JCAMP-DX=	6.0	$$ MestReNova 14.3.3-33362
##DATA TYPE=	LINK
##BLOCKS=	1    
##ORIGIN=	Mestrelab Research S.L.
##OWNER=	hrzepa
##$MNOVA/METADATA=	(DOCUMENT,BASE64)
eyJuYW1lIjoiL1VzZXJzL2hyemVwYS9Eb3dubG9hZHMvSVVQQUMtRkFJUlNwZWMtbWFpbi8zOC1Db21
wbGV4ZXMvMzhnLzM4Zy1CLzM4Zy1CLm1ub3ZhIiwicGFnZXMiOlt7Iml0ZW1zIjpbIjEiICAgICBdfV
19
##TITLE=	uivLdqQgRuGYWe4nX+HnOg.11.fid
##JCAMP-DX=	6.0	$$ MestReNova 14.3.3-33362
##DATA TYPE=	NMR SPECTRUM
##DATA CLASS=	XYDATA
##BLOCK_ID=	1
##ORIGIN=	Bruker BioSpin GmbH
##OWNER=	nmrsu
##NUMDIM=	1
##$MNOVA/METADATA=	(ITEM,BASE64)
eyJhbmdsZSI6MCwiYXhlcyI6eyJ4Ijp7Im1heCI6MjAxLjg0Mzc5OTk5MTIxMTc3LCJtaW4iOi0yMDI
uNzMyNTc1MjM0MjU1Njh9LCJ5Ijp7Im1heCI6NzQ3MzYuNDE1MDM5MDYyNSwibWluIjotNjgwMC42ND
UyNjAzMzQwMTV9fSwicG9pbnRzIjpbeyJ4Ijo1MzIxLCJ5Ijo1ODM1fSx7IngiOjg3MjIsInkiOjU4M
zV9LHsieCI6ODcyMiwieSI6ODIwOH0seyJ4Ijo1MzIxLCJ5Ijo4MjA4fSx7IngiOjUzMjEsInkiOjU4
MzV9XSwieiI6MH0=
##.OBSERVE FREQUENCY=	224.7001119089999861
##.OBSERVE NUCLEUS=	^11B
##.SOLVENT NAME=	None
##.PULSE SEQUENCE=	zgbs
##LONGDATE=	2025/01/08 23:43:20.000
##.ACQUISITIONMODE=	SIMULTANEOUS (DQD)
##$ORIGINAL FORMAT=	Bruker XWIN-NMR
##$MNOVA/SCALES_VERSION=	9
##$PARAMETER FILE=	(acqus, ASCII, /private/var/folders/f6/rjf_tdyn2v98c5c0wvkgn4s80000gq/T/uivLdqQgRuGYWe4nX+HnOg/11/acqus, 0)
$$ ##TITLE= Parameter file, TopSpin 4.1.3
$$ ##JCAMPDX= 5.0
$$ ##DATATYPE= Parameter Values
$$ ##NPOINTS= 1	$$ modification sequence number
$$ ##ORIGIN= Bruker BioSpin GmbH
$$ ##OWNER= nmrsu
$$ $$ 2025-01-08 23:41:39.878 +0000  nmrsu@CZC7167VR1
$$ $$ Z:/700/data/tds/nmr/RP613 B(OCH2CF3)3 tBuOAc/11/acqus
$$ $$ process C:\Bruker\TopSpin4.1.3\prog\mod\dirdata.exe
$$ ##$ACQT0= 0
$$ ##$AMP= (0..31)
$$ 100 100 100 100 100 100 100 100 100 100 100 100 100 100 100 100 100 100
$$ 100 100 100 100 100 100 100 100 100 100 100 100 100 100
$$ ##$AMPCOIL= (0..32)
$$ -1 0 0 0 0 0 0 0 0 0 0 0 0 0 0 0 0 0 0 0 0 0 0 0 0 0 0 0 0 0 0 0 0
$$ ##$AQSEQ= 0
$$ ##$AQ_mod= 3
$$ ##$AUNM= <au_zg>
$$ ##$AUTOPOS= <32 >
$$ ##$BF1= 224.700111909
$$ ##$BF2= 224.700111909
$$ ##$BF3= 224.700111909
$$ ##$BF4= 224.700111909
$$ ##$BF5= 224.700111909
$$ ##$BF6= 224.700111909
$$ ##$BF7= 224.700111909
$$ ##$BF8= 224.700111909
$$ ##$BWFAC= (0..63)
$$ 0 0 0 0 0 0 0 0 0 0 0 0 0 0 0 0 0 0 0 0 0 0 0 0 0 0 0 0 0 0 0 0 0 0 0 0
$$ 0 0 0 0 0 0 0 0 0 0 0 0 0 0 0 0 0 0 0 0 0 0 0 0 0 0 0 0
$$ ##$BYTORDA= 0
$$ ##$CHANFCU= (0..24)
$$ 0 0 0 1 0 0 0 0 0 0 0 0 0 0 0 0 0 0 0 0 0 0 0 0 0
$$ ##$CHANREC= (0..24)
$$ 0 0 0 0 0 0 0 0 0 0 0 0 0 0 0 0 0 0 0 0 0 0 0 0 0
$$ ##$CHEMSTR= <none>
$$ ##$CNST= (0..63)
$$ 1 1 1 1 1 1 1 1 1 1 1 1 1 1 1 1 1 1 1 1 1 1 1 1 1 1 1 1 1 1 1 1 1 1 1 1
$$ 1 1 1 1 1 1 1 1 1 1 1 1 1 1 1 1 1 1 1 1 1 1 1 1 1 1 1 1
$$ ##$CPDPRG= (0..8)
$$ <> <> <> <> <> <> <> <> <>
$$ ##$D= (0..63)
$$ 0 0.4 0 0 0 0 0 0 0 0 0 0 0 0 0 0 0.0002 0 0 0 0 0 0 0 0 0 0 0 0 0 0 0
$$ 0 0 0 0 0 0 0 0 0 0 0 0 0 0 0 0 0 0 0 0 0 0 0 0 0 0 0 0 0 0 0 0
$$ ##$DATE= 1736379800
$$ ##$DATE_START= 1736379534
$$ ##$DE= 18
$$ [...]
$$ ##$ShimPowRng3= (0..63)
$$ 1 1 1 1 1 1 1 1 1 1 1 1 1 1 1 1 1 1 1 1 1 1 1 1 1 1 1 1 1 1 1 1 1 1 1 1
$$ 1 1 1 1 0 0 0 0 0 0 0 0 0 0 0 0 0 0 0 0 0 0 0 0 0 0 0 0
$$ ##$ShimPowType1= 8
$$ ##$ShimPowType2= 8
$$ ##$ShimPowType3= 0
$$ ##$ShimPowType4= 0
$$ ##$ShimPowType5= 0
$$ ##$ShimPowType6= 0
$$ ##$ShimPowType7= 0
$$ ##$ShimPowType8= 0
$$ ##$ShimSysActGrad= (0..63)
$$ 1 2 3 4 13 5 7 11 10 9 6 8 12 18 19 20 21 15 22 23 24 14 25 16 26 17 27
$$ 28 31 32 33 34 35 36 37 38 0 0 0 0 0 0 0 0 0 0 0 0 0 0 0 0 0 0 0 0 0 0
$$ 0 0 0 0 0 0
$$ ##$ShimSysAngle= <>
$$ ##$ShimSysFunc= (0..63)
$$ 1 2 3 4 5 6 7 8 9 10 0 37 38 35 16 15 14 13 12 11 28 27 26 25 24 23 36
$$ 22 30 29 20 21 34 33 32 31 17 18 19 0 0 0 0 0 0 0 0 0 0 0 0 0 0 0 0 0 0
$$ 0 0 0 0 0 0 0
$$ ##$ShimSysMatId= <292722da.dat>
$$ ##$ShimSysMatrix= 1
$$ ##$ShimSysMinMaxUG= 130000
$$ ##$ShimSysOffset= <29 mm>
$$ ##$ShimSysType= 4
$$ ##$ShimUnit= 3
$$ ##$SpectrOsVersion= <4.1.156.20210628>
$$ ##$TCubeEth= <192.168.180.38>
$$ ##$TCubeSeqDevice= <>
$$ ##$TOSITY= <no>
$$ ##$TRIPLO2= 0
$$ ##$TopSpinVersion= <TopSpin 4.1.3>
$$ ##$TrxFreqFormula= (0..23)
$$ <TrxFreqFormula(2.0,700350000.000000,'TRX',Trx(1.0,'TRX 1200.1',1,5.000000,1290.000000))>
$$ <TrxFreqFormula(2.0,700350000.000000,'TRX',Trx(1.0,'TRX 1200.2',1,5.000000,1290.000000))>
$$ <TrxFreqFormula(2.0,700350000.000000,'TRX',Trx(1.0,'TRX 1200.3',1,5.000000,1290.000000))>
$$ <> <> <> <> <> <> <> <> <> <> <> <> <> <> <> <> <> <> <> <> <>
$$ ##$TrxPN= (0..23)
$$ <Z148391> <Z148391> <Z148391> <> <> <> <> <> <> <> <> <> <> <> <> <> <>
$$ <> <> <> <> <> <> <>
$$ ##$TrxSN= (0..23)
$$ <00336> <00337> <00342> <> <> <> <> <> <> <> <> <> <> <> <> <> <> <> <>
$$ <> <> <> <> <>
$$ ##$VCubeEth= (0..23)
$$ <no> <no> <no> <no> <no> <no> <no> <no> <no> <no> <no> <no> <no> <no> <no>
$$ <no> <no> <no> <no> <no> <no> <no> <no> <no>
$$ ##$VTU= 2
$$ ##$VTUETH= <192.168.99.11>
$$ ##$VTUTY= <no>
$$ ##$ValueLine= no
$$ ##$VpuPN= (0..23)
$$ <no> <no> <no> <no> <no> <no> <no> <no> <no> <no> <no> <no> <no> <no> <no>
$$ <no> <no> <no> <no> <no> <no> <no> <no> <no>
$$ ##$VpuSN= (0..23)
$$ <no> <no> <no> <no> <no> <no> <no> <no> <no> <no> <no> <no> <no> <no> <no>
$$ <no> <no> <no> <no> <no> <no> <no> <no> <no>
$$ ##$WBREFAM= (0..31)
$$ 99.8 100 100 100 100 100 100 100 100 100 100 100 100 100 100 100 100 100
$$ 100 100 100 100 100 100 100 100 100 100 100 100 100 100
$$ ##$WBREFLM= (0..31)
$$ 1 0 1 0 0 0 0 0 0 0 0 0 0 0 0 0 0 0 0 0 0 0 0 0 0 0 0 0 0 0 0 0
$$ ##$WBREFPH= (0..31)
$$ 0.05 0 0 0 0 0 0 0 0 0 0 0 0 0 0 0 0 0 0 0 0 0 0 0 0 0 0 0 0 0 0 0
$$ ##$WBSGU= (0..31)
$$ 1 2 4 0 0 0 0 0 0 0 0 0 0 0 0 0 0 0 0 0 0 0 0 0 0 0 0 0 0 0 0 0
$$ ##END=
$$ 
##$DECIM=	220
##$DSPFVS=	20
##XUNITS=	HZ
##YUNITS=	ARBITRARY UNITS
##FIRSTX=	45354.344671069993638
##LASTX=	-45554.052656699881481
##DELTAX=	-0.69358132102272718189
##XFACTOR=	1
##YFACTOR=	2.0734940546128726169
##FIRSTY=	6.7634644508361816406
##MINY=	-6.4956502914428710938
##MAXY=	67942.1796875
##NPOINTS=	131072
##XYDATA=	(X++(Y..Y))
$$ [...]
15918C1j%%J%JJ%%%jj%jj%%%%%%%%J%%J%%%%%%%%%%%%%J%%J%%%j%j%%%%%%%%%%%%%%j%%%J
15870C1%%J%J%%%jj%%%%%%%%J%%j%%j%%%%%J%%%%j%%%%j%%%%%%%%%J%%%%%j%j%j%%%%JJJJ
15822C1Jj%j%%j%%%%J%%%j%%%%%%%%%%%%%%%%%J%%%%%%jJ%%%J%%J%%j%%jj%%%%%j%%jJ%J%
15774B9J%J%%J%%%%%%j%j%%%%%%%J%%%%%%jJ%%%%%%J%J%%%j%%j%%%j%%%%%J%%%%%%%%%J%%
15727C2j%j%j%%%J%%%%%%%%J%%%%%%%%%j%%%%%%%%%J%%%%%%%%%%%%%%%%%%%%%%%%%%%%jJ%
15679C1%%%%%J%%%J%J%%%j%%%%%%j%%%%j%%J%%%J%%j%%%%%j%%%%j%%%%%%%%%%J%J%%%%%%%
15631C2%%%%%%%j%%%%%%%%jJ%%J%%%%%%j%%j%%%%%%%%J%J%%%%%%jJ%%%%%%%%%%%%j%%%%%%
15583C1%%%%%%%%%%%%%%%%%%j%j%jJ%%%%%J%%%j%%%%%J%%%%J%%%%%%%%%J%%%%%J%%J%%%j%
$$ plain form
15918 31 30 30 30 31 31 32 33 33 33 33 32 31 31 30 29 29 29 29 29 29 29 29 29 30 30 30 31 31 31 31 31 31 31 31 31 31 31 31 31 31 32 32 32 33 33 33 33 32 32 31 31 31 31 31 31 31 31 31 31 31 31 31 31 31 30 30 30 30 31
15870 31 31 31 32 32 33 33 33 33 32 31 31 31 31 31 31 31 31 31 32 32 32 31 31 31 30 30 30 30 30 30 31 31 31 31 31 30 30 30 30 30 29 29 29 29 29 29 29 29 29 29 30 30 30 30 30 30 29 29 28 28 27 27 27 27 27 28 29 30 31
15822 31 32 31 31 30 30 30 29 29 29 29 29 30 30 30 30 29 29 29 29 29 29 29 29 29 29 29 29 29 29 29 29 29 29 30 30 30 30 30 30 30 29 30 30 30 30 31 31 31 32 32 32 31 31 31 30 29 29 29 29 29 29 28 28 28 27 28 28 29 29
15774 29 30 30 31 31 31 32 32 32 32 32 32 32 31 31 30 30 30 30 30 30 30 30 31 31 31 31 31 31 31 30 31 31 31 31 31 31 31 32 32 33 33 33 33 32 32 32 31 31 31 31 30 30 30 30 30 30 31 31 31 31 31 31 31 31 31 31 32 32 32
15727 32 31 31 30 30 29 29 29 29 30 30 30 30 30 30 30 30 30 31 31 31 31 31 31 31 31 31 31 30 30 30 30 30 30 30 30 30 30 31 31 31 31 31 31 31 31 31 31 31 31 31 31 31 31 31 31 31 31 31 31 31 31 31 31 31 31 31 30 31 31
15679 31 31 31 31 31 31 32 32 32 32 33 33 34 34 34 34 33 33 33 33 33 33 33 32 32 32 32 32 31 31 31 32 32 32 32 33 33 33 32 32 32 32 32 32 31 31 31 31 31 30 30 30 30 30 30 30 30 30 30 30 31 31 32 32 32 32 32 32 32 32
15631 32 32 32 32 32 32 32 32 31 31 31 31 31 31 31 31 31 30 31 31 31 32 32 32 32 32 32 32 31 31 31 30 30 30 30 30 30 30 30 30 31 31 32 32 32 32 32 32 32 31 32 32 32 32 32 32 32 32 32 32 32 32 32 31 31 31 31 31 31 31
15583 31 31 31 31 31 31 31 31 31 31 31 31 31 31 31 31 31 31 31 30 30 29 29 28 29 29 29 29 29 29 30 30 30 30 29 29 29 29 29 29 30 30 30 30 30 31 31 31 31 31 31 31 31 31 31 32 32 32 32 32 32 33 33 33 34 34 34 34 33 33
15535C3%j%%J%%%%j%j%%jJ%%J%%J%%j%%%%%%%%%%%%%%%%j%%%%%%j%%%%%%%j%%%%jJ%%JJ%J
15487C2%j%%j%%%%%%J%%%%%%%%%%%%%%%%%%%J%%J%J%%j%%j%%%J%%Jj%j%%%%%%%%j%%%%%%%
15439C1%%%J%%j%%%j%%%%%%%j%%%%%%%%%%j%%%%%%%JJ%J%%%%%j%j%J%%%%%%%%%%%%%%%j%%
15392B9%%j%%%%%J%J%J%%J%%J%%%%%%j%%j%%jJ%%JJ%%%j%%%%Jj%j%%j%%%j%J%%%%J%%%%%%
15344C1%j%%J%%J%%J%j%%j%%jJ%%%%j%%%%%%%%j%J%%%%%%%%%J%%%j%%%J%%%%%j%%%%%%%%%
15296C0%%%%%%%%%%%%%%%%J%%J%j%j%j%%%%%%%J%%J%%%%%%%%%%%%%%%%%%j%J%%%%%%j%J%%
15248C1%%%%J%%j%%%j%%%%%%%%j%%%%%%%%J%J%%J%%%%%%j%%%%%Jj%%j%%j%%%%%J%J%J%%%%
15200C2j%%%%%%J%%J%J%%%%j%%%%%%%%%%%%%%%J%%%%%%%%%jjj%%%%%J%j%%%j%%%%%%%%%%J
$$ plain form
15535 33 33 32 32 32 33 33 33 33 33 32 32 31 31 31 30 31 31 31 32 32 32 33 33 33 32 32 32 32 32 32 32 32 32 32 32 32 32 32 32 32 32 31 31 31 31 31 31 31 30 30 30 30 30 30 30 30 29 29 29 29 29 28 29 29 29 30 31 31 32
15487 32 32 31 31 31 30 30 30 30 30 30 30 31 31 31 31 31 31 31 31 31 31 31 31 31 31 31 31 31 31 31 31 32 32 32 33 33 34 34 34 33 33 33 32 32 32 32 33 33 33 34 33 33 32 32 32 32 32 32 32 32 32 31 31 31 31 31 31 31 31
15439 31 31 31 31 32 32 32 31 31 31 31 30 30 30 30 30 30 30 30 29 29 29 29 29 29 29 29 29 29 29 28 28 28 28 28 28 28 28 29 30 30 31 31 31 31 31 31 30 30 29 29 30 30 30 30 30 30 30 30 30 30 30 30 30 30 30 30 29 29 29
15392 29 29 29 28 28 28 28 28 28 29 29 30 30 31 31 31 32 32 32 33 33 33 33 33 33 33 32 32 32 31 31 31 30 31 31 31 32 33 33 33 33 32 32 32 32 32 33 32 32 31 31 31 30 30 30 30 29 29 30 30 30 30 30 31 31 31 31 31 31 31
15344 31 31 30 30 30 31 31 31 32 32 32 33 33 32 32 32 31 31 31 30 31 31 31 31 31 30 30 30 30 30 30 30 30 30 29 29 30 30 30 30 30 30 30 30 30 30 31 31 31 31 30 30 30 30 31 31 31 31 31 31 30 30 30 30 30 30 30 30 30 30
15296 30 30 30 30 30 30 30 30 30 30 30 30 30 30 30 30 30 31 31 31 32 32 31 31 30 30 29 29 29 29 29 29 29 29 30 30 30 31 31 31 31 31 31 31 31 31 31 31 31 31 31 31 31 31 31 31 30 30 31 31 31 31 31 31 31 30 30 31 31 31
15248 31 31 31 31 31 32 32 32 31 31 31 31 30 30 30 30 30 30 30 30 30 29 29 29 29 29 29 29 29 29 30 30 31 31 31 32 32 32 32 32 32 32 31 31 31 31 31 31 32 31 31 31 30 30 30 29 29 29 29 29 29 30 30 31 31 32 32 32 32 32
15200 32 31 31 31 31 31 31 31 32 32 32 33 33 34 34 34 34 34 33 33 33 33 33 33 33 33 33 33 33 33 33 33 33 33 34 34 34 34 34 34 34 34 34 34 33 32 31 31 31 31 31 31 32 32 31 31 31 31 30 30 30 30 30 30 30 30 30 30 30 31
15152C1%%%%%j%jj%%%%J%%%%%%%%%%J%J%%%%%j%%%J%%%j%%jj%%%J%%%J%%J%%%%%j%%%%%%%
15104C0J%%%%%%%%%%%%j%%%%%%%%%j%%%%%%%%%%%%%J%%%%%%%%%J%%%J%J%%%%j%%%%%%%j%%
15057C1%%%%%%%%%%%%%%%%%%%%%j%%j%j%%j%J%J%%%%%J%%%J%j%%jJ%%%j%J%%J%%j%%%%%%J
15009C1%%%%%%%%j%%%J%%J%J%%j%j%%%%%%%%j%%%J%%%%%j%%%%%%%%%%%%JJJ%%%%%%j%%j%%
14961C1%%%J%%J%J%%%%jj%j%j%%%J%%%%J%%%J%%%%J%%%%j%jj%j%%%%J%J%%%%%%%%j%%%%j%
14913C0%%%%%%%%%%%jJj%%%j%%%%%%JJ%%J%J%%%%%%Jj%%%%%%%%%%%%%%%%%%%%%%%%J%Jj%%
14865C3%%%%%%%%%%J%%%j%%%%j%%%j%%%%%j%%%%%%%%%%%%%%%%Jj%%%%%%%%%%%%%%%%%%%%%
14817C0%J%%%%%%%%%%%%%%%%J%%%%%%%%%J%%%%%%%j%%%j%%%%%%%%%%%%%%Jj%%%%%%J%%%Jj
$$ plain form
15152 31 31 31 31 31 31 30 30 29 28 28 28 28 28 29 29 29 29 29 29 29 29 29 29 29 30 30 31 31 31 31 31 31 30 30 30 30 31 31 31 31 30 30 30 29 28 28 28 28 29 29 29 29 30 30 30 31 31 31 31 31 31 30 30 30 30 30 30 30 30
15104 30 31 31 31 31 31 31 31 31 31 31 31 31 31 30 30 30 30 30 30 30 30 30 30 29 29 29 29 29 29 29 29 29 29 29 29 29 29 30 30 30 30 30 30 30 30 30 30 31 31 31 31 32 32 33 33 33 33 33 32 32 32 32 32 32 32 32 31 31 31
15057 31 31 31 31 31 31 31 31 31 31 31 31 31 31 31 31 31 31 31 31 31 31 30 30 30 29 29 28 28 28 27 27 28 28 29 29 29 29 29 29 30 30 30 30 31 31 30 30 30 29 30 30 30 30 29 29 30 30 30 31 31 31 30 30 30 30 30 30 30 31
15009 31 31 31 31 31 31 31 31 31 30 30 30 30 31 31 31 32 32 33 33 33 32 32 31 31 31 31 31 31 31 31 31 30 30 30 30 31 31 31 31 31 31 30 30 30 30 30 30 30 30 30 30 30 30 30 31 32 33 33 33 33 33 33 33 32 32 32 31 31 31
14961 31 31 31 31 32 32 32 33 33 34 34 34 34 34 33 32 32 31 31 30 30 30 30 31 31 31 31 31 32 32 32 32 33 33 33 33 33 34 34 34 34 34 33 33 32 31 31 30 30 30 30 30 31 31 32 32 32 32 32 32 32 32 32 31 31 31 31 31 30 30
14913 30 30 30 30 30 30 30 30 30 30 30 30 29 30 29 29 29 29 28 28 28 28 28 28 28 29 30 30 30 31 31 32 32 32 32 32 32 32 33 32 32 32 32 32 32 32 32 32 32 32 32 32 32 32 32 32 32 32 32 32 32 32 32 32 33 33 34 33 33 33
14865 33 33 33 33 33 33 33 33 33 33 33 34 34 34 34 33 33 33 33 33 32 32 32 32 31 31 31 31 31 31 30 30 30 30 30 30 30 30 30 30 30 30 30 30 30 30 30 31 30 30 30 30 30 30 30 30 30 30 30 30 30 30 30 30 30 30 30 30 30 30
14817 30 30 31 31 31 31 31 31 31 31 31 31 31 31 31 31 31 31 31 32 32 32 32 32 32 32 32 32 32 33 33 33 33 33 33 33 33 32 32 32 32 31 31 31 31 31 31 31 31 31 31 31 31 31 31 31 32 31 31 31 31 31 31 31 32 32 32 32 33 32
14769C2%%j%j%%%%J%%J%%J%%%%j%%j%%J%J%%%%%j%%%%%%%%%J%%%j%%%%j%%%%%%%%%%%j%%%
14722C0%J%JJ%%jjj%j%%%J%%%%J%%%%Jj%%j%%%%%J%J%J%J%%%%j%%j%Jj%j%j%%J%%J%%%%J%
14674C3%%J%j%%%j%J%%%%%%J%%j%j%j%%j%%%j%%%%J%J%J%%%%%%%j%%%j%%%%%%%%%%%%%%J%
14626C1%J%%%J%%%%j%%%%%%j%%%J%%%%%%%%%%%%%%%j%%%%j%%%j%J%JJ%%%%%%%%%J%%%%J%j
14578C3j%j%%%jJ%%%%J%J%j%%%j%j%%j%%%%%%%J%J%%%%%%%%%J%%%%%%%j%%%J%%j%%%%%%%%
14530C1J%%%%%J%%%%%%%jj%j%%j%%%JJJJ%%%%%j%%%%%J%%%%j%j%jj%%%%J%%%%%%%J%JJ%%%
14482C3%%%%j%%%%%%%jJ%%%%%%%%j%%%%JJ%J%%%%j%%%%%JJJ%%%%j%%%%%%%%j%%j%%%%%j%%
14434C2%%%%%%%Jj%%%%%%%%%%%%%%%%j%jj%%%%%J%%%%%%%%%%%J%J%%%%j%j%j%%J%%%%j%j%
$$ plain form
14769 32 32 32 31 31 30 30 30 30 30 31 31 31 32 32 32 33 33 33 33 33 32 32 32 31 31 31 32 32 33 33 33 33 33 33 32 32 32 32 32 32 32 32 32 32 33 33 33 33 32 32 32 32 32 31 31 31 31 31 31 31 31 31 31 31 31 30 30 30 30
14722 30 30 31 31 32 33 33 33 32 31 30 30 29 29 29 29 30 30 30 30 30 31 31 31 31 31 32 31 31 31 30 30 30 30 30 30 31 31 32 32 33 33 34 34 34 34 34 33 33 33 32 32 33 32 32 31 31 30 30 30 31 31 31 32 32 32 32 32 33 33
14674 33 33 33 34 34 33 33 33 33 32 32 33 33 33 33 33 33 33 34 34 34 33 33 32 32 31 31 31 30 30 30 30 29 29 29 29 29 30 30 31 31 32 32 32 32 32 32 32 32 31 31 31 31 30 30 30 30 30 30 30 30 30 30 30 30 30 30 30 31 31
14626 31 31 32 32 32 32 33 33 33 33 33 32 32 32 32 32 32 32 31 31 31 31 32 32 32 32 32 32 32 32 32 32 32 32 32 32 32 32 31 31 31 31 31 30 30 30 30 29 29 30 30 31 32 32 32 32 32 32 32 32 32 32 33 33 33 33 33 34 34 33
14578 33 32 32 31 31 31 31 30 31 31 31 31 31 32 32 33 33 32 32 32 32 31 31 30 30 30 29 29 29 29 29 29 29 29 30 30 31 31 31 31 31 31 31 31 31 31 32 32 32 32 32 32 32 32 31 31 31 31 32 32 32 31 31 31 31 31 31 31 31 31
14530 31 32 32 32 32 32 32 33 33 33 33 33 33 33 33 32 31 31 30 30 30 29 29 29 29 30 31 32 33 33 33 33 33 33 32 32 32 32 32 32 33 33 33 33 33 32 32 31 31 30 29 29 29 29 29 30 30 30 30 30 30 30 30 31 31 32 33 33 33 33
14482 33 33 33 33 33 32 32 32 32 32 32 32 32 31 32 32 32 32 32 32 32 32 32 31 31 31 31 31 32 33 33 34 34 34 34 34 33 33 33 33 33 33 34 35 36 36 36 36 36 35 35 35 35 35 35 35 35 35 34 34 34 33 33 33 33 33 33 32 32 32
14434 32 32 32 32 32 32 32 32 33 32 32 32 32 32 32 32 32 32 32 32 32 32 32 32 32 32 31 31 30 29 29 29 29 29 29 30 30 30 30 30 30 30 30 30 30 30 30 31 31 32 32 32 32 32 31 31 30 30 29 29 29 30 30 30 30 30 29 29 28 28
14387B8j%%%J%%J%%J%%%J%%%%J%J%%J%j%%jj%%j%%j%j%J%%%%J%%%J%%J%%%j%%%%%%%J%%%%
14339C2%%%%%%%%J%%%Jj%%%j%j%j%j%%J%%J%J%%j%%%%%%%J%%J%%%%%J%%%%%%%%%%j%j%%j%
14291C1j%%J%J%%J%%J%%j%%j%J%%%%%j%j%%%j%%j%%%%%J%%%J%%%J%%%%%%%%%J%%J%%%%%%%
14243C4j%%%j%j%%%%J%%%%%%%%%j%%%%j%J%%%%%%%%J%%%%J%%%%J%%%%%%j%%%j%%%%%%%%%j
14195C1%%j%%%%J%JJ%JJ%%%%%j%%%j%j%%J%%%j%%%%jJ%%J%%%%Jj%%%j%j%j%%%J%%J%%J%%%
14147C3%j%J%%%J%%J%%%%%%%j%%%%%%%%%%%%j%j%jj%%%%%J%%%%J%%%%%J%%J%%j%%%%%%j%%
14099C2%%%j%%%%%j%j%%J%J%j%%%%j%J%J%J%%%Jj%jj%%j%%%%%J%J%%J%%J%%%j%j%j%j%J%%
14052C0%%J%%%%%%%%J%%%%%%%%%%%%%J%J%j%%%%%%%%%Jj%%j%%%%%%%%%%%%J%JJ%%j%j%J%%
$$ plain form
14387 28 27 27 27 27 28 28 28 29 29 29 30 30 30 30 31 31 31 31 31 32 32 33 33 33 34 34 33 33 33 32 31 31 31 30 30 30 29 29 28 28 29 29 29 29 29 30 30 30 30 31 31 31 32 32 32 32 31 31 31 31 31 31 31 31 32 32 32 32 32
14339 32 32 32 32 32 32 32 32 32 33 33 33 33 34 33 33 33 33 32 32 31 31 30 30 29 29 29 30 30 30 31 31 32 32 32 31 31 31 31 31 31 31 31 32 32 32 33 33 33 33 33 33 34 34 34 34 34 34 34 34 34 34 34 33 33 32 32 32 31 31
14291 31 30 30 30 31 31 32 32 32 33 33 33 34 34 34 33 33 33 32 32 33 33 33 33 33 33 32 32 31 31 31 31 30 30 30 29 29 29 29 29 29 30 30 30 30 31 31 31 31 32 32 32 32 32 32 32 32 32 32 33 33 33 34 34 34 34 34 34 34 34
14243 34 33 33 33 33 32 32 31 31 31 31 31 32 32 32 32 32 32 32 32 32 32 31 31 31 31 31 30 30 31 31 31 31 31 31 31 31 31 32 32 32 32 32 33 33 33 33 33 34 34 34 34 34 34 34 33 33 33 33 32 32 32 32 32 32 32 32 32 32 31
14195 31 31 31 30 30 30 30 30 31 31 32 33 33 34 35 35 35 35 35 35 34 34 34 34 33 33 32 32 32 33 33 33 33 32 32 32 32 32 31 32 32 32 33 33 33 33 33 34 33 33 33 33 32 32 31 31 30 30 30 30 31 31 31 32 32 32 33 33 33 33
14147 33 33 32 32 33 33 33 33 34 34 34 35 35 35 35 35 35 35 35 34 34 34 34 34 34 34 34 34 34 34 34 34 33 33 32 32 31 30 30 30 30 30 30 31 31 31 31 31 32 32 32 32 32 32 33 33 33 34 34 34 33 33 33 33 33 33 33 32 32 32
14099 32 32 32 32 31 31 31 31 31 31 30 30 29 29 29 30 30 31 31 30 30 30 30 30 29 29 30 30 31 31 32 32 32 32 33 32 32 31 30 30 30 29 29 29 29 29 29 30 30 31 31 31 32 32 32 33 33 33 33 32 32 31 31 30 30 29 29 30 30 30
14052 30 30 30 31 31 31 31 31 31 31 31 31 32 32 32 32 32 32 32 32 32 32 32 32 32 32 33 33 34 34 33 33 33 33 33 33 33 33 33 33 34 33 33 33 32 32 32 32 32 32 32 32 32 32 32 32 32 33 33 34 35 35 35 34 34 33 33 34 34 34
14004C4%%j%%j%j%%jJ%%J%%%%%%J%j%%%%j%%%%%%%%%%%%%%J%%%%%J%j%%%j%%%%%%%%%%%%%
13956C1%%%%%Jj%%jJ%%%%%%j%J%%%%JJ%%%%%j%%%%%%%%%%%j%%%J%J%%%%J%%%%%j%%%%%%%J
13908C4%j%%j%%%%%%%%%%%j%%%jJ%%J%Jj%j%%%%J%%J%%Jj%%%%%%%%j%%%%%%%%%%J%%%%%%%
13860C3%J%%J%%j%%%j%jj%%j%%%%%J%%J%%%%%%%%%%%%%%j%%%%%%j%%J%%%%%J%%%%%%%%%%%
13812C2%%%J%%%%j%j%j%%%%%%%%%J%%%J%%%%%%%jJ%%%%%j%%J%%%%j%%%%JJ%J%%j%%j%%%%j
13764C1%%%%J%%%%%j%%%%%%%j%%j%%j%J%J%%J%%%%%%%%%J%J%%%%%j%%%%j%%%%%%Jj%%j%%%
13717C0%J%j%%%%J%%%%%j%%%J%%%%j%j%%%J%j%%j%%J%%%J%%%%%%%%%%J%J%%J%%%%%j%%%%%
13669C2%%%%%%j%%J%%J%%%j%%j%%%%%%%%j%%%%%%%J%%%%%%%%j%%J%%%J%%%%%j%j%J%%%%%%
$$ plain form
14004 34 34 34 33 33 33 32 32 31 31 31 30 31 31 31 32 32 32 32 32 32 32 33 33 32 32 32 32 32 31 31 31 31 31 31 31 31 31 31 31 31 31 31 31 32 32 32 32 32 32 33 33 32 32 32 32 31 31 31 31 31 31 31 31 31 31 31 31 31 31
13956 31 31 31 31 31 31 32 31 31 31 30 31 31 31 31 31 31 31 30 30 31 31 31 31 31 32 33 33 33 33 33 33 32 32 32 32 32 32 32 32 32 32 32 32 31 31 31 31 32 32 33 33 33 33 33 34 34 34 34 34 34 33 33 33 33 33 33 33 33 34
13908 34 34 33 33 33 32 32 32 32 32 32 32 32 32 32 32 32 31 31 31 31 30 31 31 31 32 32 33 32 32 31 31 31 31 31 32 32 32 33 33 33 34 33 33 33 33 33 33 33 33 33 32 32 32 32 32 32 32 32 32 32 32 33 33 33 33 33 33 33 33
13860 33 33 34 34 34 35 35 35 34 34 34 34 33 33 32 31 31 31 30 30 30 30 30 30 31 31 31 32 32 32 32 32 32 32 32 32 32 32 32 32 32 32 31 31 31 31 31 31 31 30 30 30 31 31 31 31 31 31 32 32 32 32 32 32 32 32 32 32 32 32
13812 32 32 32 32 33 33 33 33 33 32 32 31 31 30 30 30 30 30 30 30 30 30 30 31 31 31 31 32 32 32 32 32 32 32 32 31 32 32 32 32 32 32 31 31 31 32 32 32 32 32 31 31 31 31 31 32 33 33 34 34 34 33 33 33 32 32 32 32 32 31
13764 31 31 31 31 31 32 32 32 32 32 32 31 31 31 31 31 31 31 31 30 30 30 29 29 29 28 28 29 29 30 30 30 31 31 31 31 31 31 31 31 31 31 32 32 33 33 33 33 33 33 32 32 32 32 32 31 31 31 31 31 31 31 32 31 31 31 30 30 30 30
13717 30 30 31 31 30 30 30 30 30 31 31 31 31 31 31 30 30 30 30 31 31 31 31 31 30 30 29 29 29 29 30 30 29 29 29 28 28 28 29 29 29 29 30 30 30 30 30 30 30 30 30 30 30 31 31 32 32 32 33 33 33 33 33 33 32 32 32 32 32 32
13669 32 32 32 32 32 32 32 31 31 31 32 32 32 33 33 33 33 32 32 32 31 31 31 31 31 31 31 31 31 30 30 30 30 30 30 30 30 31 31 31 31 31 31 31 31 31 30 30 30 31 31 31 31 32 32 32 32 32 32 31 31 30 30 31 31 31 31 31 31 31
13621C1%J%J%%%%%%j%%%j%%%%%%j%%%%J%J%%%%%%%%%%%%%j%%%j%%%J%%%%%%%%%jj%%%%%J%
13573C0J%%%j%j%J%J%J%J%%j%j%J%%%%%%%%%%%%%%j%%%j%%%%%%J%%%%J%j%%%%%%j%%j%%%%
13525B9%J%%%%J%%%%J%%%%%%J%%%%%%%%%%%%%j%%%%jj%j%%J%%J%J%%%J%j%%%%J%%%%%%%j%
13477C2%%%%%%%%%%%J%%%j%j%%%%%%%%%%J%%j%%%%J%%J%%%%%%%Jj%%%%jJ%%J%%%%J%%%%j%
13429C4j%%%%%j%%%%J%J%%J%%%%%%j%%%j%%j%%%%%%%%%%%%%%%%%j%%%%%%%%%%%%%J%%%%%J
13382C3%%jj%j%%%%J%J%J%j%j%j%%%%J%J%%J%%Jj%%j%j%%%j%%%%J%%J%%%%%%%%%j%%%%%%%
13334C1j%%%%J%%%%J%%%%%%%%%%%J%%%%%%%j%%%%j%%J%%%%%%%%j%%j%j%J%%%%%%%%J%%%%%
13286C1%%%%J%%J%%%j%%%%%J%%%j%%J%%j%%%%%j%%j%%%J%J%%%%%J%%J%%J%j%j%jj%%%%%Jj
$$ plain form
13621 31 31 32 32 33 33 33 33 33 33 33 32 32 32 32 31 31 31 31 31 31 31 30 30 30 30 30 31 31 32 32 32 32 32 32 32 32 32 32 32 32 32 32 31 31 31 31 30 30 30 30 31 31 31 31 31 31 31 31 31 31 30 29 29 29 29 29 29 30 30
13573 30 31 31 31 31 30 30 29 29 30 30 31 31 32 32 33 33 33 32 32 31 31 32 32 32 32 32 32 32 32 32 32 32 32 32 32 32 31 31 31 31 30 30 30 30 30 30 30 31 31 31 31 31 32 32 31 31 31 31 31 31 31 30 30 30 29 29 29 29 29
13525 29 29 30 30 30 30 30 31 31 31 31 31 32 32 32 32 32 32 32 33 33 33 33 33 33 33 33 33 33 33 33 33 33 32 32 32 32 32 31 30 30 29 29 29 30 30 30 31 31 32 32 32 32 33 33 32 32 32 32 32 33 33 33 33 33 33 33 33 32 32
13477 32 32 32 32 32 32 32 32 32 32 32 32 33 33 33 33 32 32 31 31 31 31 31 31 31 31 31 31 31 32 32 32 31 31 31 31 31 32 32 32 33 33 33 33 33 33 33 33 34 33 33 33 33 33 32 33 33 33 34 34 34 34 34 35 35 35 35 35 34 34
13429 34 33 33 33 33 33 33 32 32 32 32 32 33 33 34 34 34 35 35 35 35 35 35 35 34 34 34 34 33 33 33 32 32 32 32 32 32 32 32 32 32 32 32 32 32 32 32 32 32 31 31 31 31 31 31 31 31 31 31 31 31 31 31 32 32 32 32 32 32 33
13382 33 33 33 32 31 31 30 30 30 30 30 31 31 32 32 33 33 32 32 31 31 30 30 30 30 30 31 31 32 32 32 33 33 33 34 33 33 33 32 32 31 31 31 31 30 30 30 30 30 31 31 31 32 32 32 32 32 32 32 32 32 32 31 31 31 31 31 31 31 31
13334 31 30 30 30 30 30 31 31 31 31 31 32 32 32 32 32 32 32 32 32 32 32 32 33 33 33 33 33 33 33 33 32 32 32 32 32 31 31 31 32 32 32 32 32 32 32 32 32 31 31 31 30 30 29 29 30 30 30 30 30 30 30 30 30 31 31 31 31 31 31
13286 31 31 31 31 31 32 32 32 33 33 33 33 32 32 32 32 32 32 33 33 33 33 32 32 32 33 33 33 32 32 32 32 32 32 31 31 31 30 30 30 30 31 31 32 32 32 32 32 32 33 33 33 34 34 34 35 35 34 34 33 33 32 31 31 31 31 31 31 32 31
13238C1%%%%%%%J%%%%%%%j%%%%j%j%%%%%J%%%%%%J%%J%%%J%%%%j%%%j%j%%%%%%JJ%J%%J%%
13190C4%Jj%%%%j%%j%%%J%%J%%%%%%%%j%%%%%%%%j%%j%%%%%%%%%J%%j%%%%J%%j%%%%%%%%j
13142C0%%%%%%%J%%%%%J%%%JJ%J%Jj%%j%%%j%%%%%%%%%%%j%j%%%j%%J%%%%J%%%%%%%%%%j%
13094C1%%%J%%%%%%J%%j%%%J%J%%J%%%%j%%%%%%j%%%%J%J%%jj%j%%%jJ%%%J%JJ%%%j%j%j%
13047C2%%%%j%%J%%J%%%%%jJ%%%%%Jj%%j%%%%%%J%J%%%%j%%%%%J%%%%%j%j%%%j%%%%J%%%%
12999C2%%%%%%%%%%%%%J%%%J%%%%%%j%%j%%%%%%%%j%%%%%%%J%%%%%%j%%%j%%J%%%%%J%J%%
12951C3Jj%%%j%j%%%%J%%J%%%j%jj%%%%%JJ%J%J%%%%%%j%%%j%j%%%%%%J%%%j%%%%J%%%%J%
12903C3%%j%%%%%%%%%%%j%%%%%%j%J%JJ%%%%%%%%%%%%%%j%j%j%%j%%J%%J%J%JJ%%%%jj%%j
$$ plain form
13238 31 31 31 31 31 31 31 31 32 32 32 32 32 32 32 32 31 31 31 31 31 30 30 29 29 29 29 29 29 30 30 30 30 30 30 30 31 31 31 32 32 32 32 33 33 33 33 33 32 32 32 32 31 31 30 30 30 30 30 30 30 31 32 32 33 33 33 34 34 34
13190 34 34 35 34 34 34 34 34 33 33 33 32 32 32 32 33 33 33 34 34 34 34 34 34 34 34 34 33 33 33 33 33 33 33 33 33 32 32 32 31 31 31 31 31 31 31 31 31 31 32 32 32 31 31 31 31 31 32 32 32 31 31 31 31 31 31 31 31 31 30
13142 30 30 30 30 30 30 30 30 31 31 31 31 31 31 32 32 32 32 33 34 34 35 35 36 35 35 35 34 34 34 34 33 33 33 33 33 33 33 33 33 33 33 33 32 32 31 31 31 31 30 30 30 31 31 31 31 31 32 32 32 32 32 32 32 32 32 32 32 31 31
13094 31 31 31 31 32 32 32 32 32 32 32 33 33 33 32 32 32 32 33 33 34 34 34 35 35 35 35 35 34 34 34 34 34 34 34 33 33 33 33 33 34 34 35 35 35 34 33 33 32 32 32 32 31 32 32 32 32 33 33 34 35 35 35 35 34 34 33 33 32 32
13047 32 32 32 32 32 31 31 31 32 32 32 33 33 33 33 33 33 32 33 33 33 33 33 33 34 33 33 33 32 32 32 32 32 32 32 33 33 34 34 34 34 34 33 33 33 33 33 33 34 34 34 34 34 34 33 33 32 32 32 32 31 31 31 31 31 32 32 32 32 32
12999 32 32 32 32 32 32 32 32 32 32 32 32 32 32 33 33 33 33 34 34 34 34 34 34 34 33 33 33 32 32 32 32 32 32 32 32 32 31 31 31 31 31 31 31 31 32 32 32 32 32 32 32 31 31 31 31 30 30 30 31 31 31 31 31 31 32 32 33 33 33
12951 33 34 33 33 33 33 32 32 31 31 31 31 31 32 32 32 33 33 33 33 32 32 31 30 30 30 30 30 30 31 32 32 33 33 34 34 34 34 34 34 34 33 33 33 33 32 32 31 31 31 31 31 31 31 32 32 32 32 31 31 31 31 31 32 32 32 32 32 33 33
12903 33 33 33 32 32 32 32 32 32 32 32 32 32 32 32 31 31 31 31 31 31 31 30 30 31 31 32 33 33 33 33 33 33 33 33 33 33 33 33 33 33 33 32 32 31 31 30 30 30 29 29 29 30 30 30 31 31 32 32 33 34 34 34 34 34 33 32 32 32 31
12855C1%%j%J%%%%%%%%%%%J%J%j%%j%%j%%%%%%%%%%%%%%%%%%%%%J%%%%%%%%%%%j%%%%%%%%
12807C0%%%%%%%%J%%%%%%j%%%JJ%J%%%%%%%%j%%%%%%%%J%%%%%j%j%%%%J%%J%%%%%%%J%%%%
12759C4%%%j%%j%%%j%%%%j%%%J%%%%%%%%%%%%%%j%%%%j%%%J%%jJ%J%J%%%j%J%%Jj%j%%%J%
12712C2%%%%%j%%%%J%%%J%%J%J%%%%j%j%%%%%%%%%%j%j%%j%%%%%J%%%J%J%%j%%jJ%J%%%%%
12664C3%j%%%%%J%%%%%J%j%%%%j%%%%%%%J%%%%%%%%%%%%%J%%%%J%j%%%%%%%%%j%%%%%j%%%
12616C2%%%%%%%%%J%%%%%%%%%J%%%%%%j%%%%%%%%J%%%%%%%%%%%%j%%%%%%%%%%j%%j%%j%%J
12568C1%%%%%%%J%%J%j%%%%%%J%%%%%%%%%j%%%%%%%%%J%%%%j%%J%%%J%j%%j%%%%%%J%%j%%
12520C2%%%%%%%J%J%%%j%%%%%J%%%%j%%%j%j%%%J%j%%J%%%j%%j%%%%%%%%%j%%%J%J%%%%%J
$$ plain form
12855 31 31 31 30 30 31 31 31 31 31 31 31 31 31 31 31 31 32 32 33 33 32 32 32 31 31 31 30 30 30 30 30 30 30 30 30 30 30 30 30 30 30 30 30 30 30 30 30 30 31 31 31 31 31 31 31 31 31 31 31 31 30 30 30 30 30 30 30 30 30
12807 30 30 30 30 30 30 30 30 30 31 31 31 31 31 31 31 30 30 30 30 31 32 32 33 33 33 33 33 33 33 33 33 32 32 32 32 32 32 32 32 32 33 33 33 33 33 33 32 32 31 31 31 31 31 32 32 32 33 33 33 33 33 33 33 33 34 34 34 34 34
12759 34 34 34 34 33 33 33 32 32 32 32 31 31 31 31 31 30 30 30 30 31 31 31 31 31 31 31 31 31 31 31 31 31 31 31 30 30 30 30 30 29 29 29 29 30 30 30 29 30 30 31 31 32 32 32 32 31 31 32 32 32 33 32 32 31 31 31 31 32 32
12712 32 32 32 32 32 32 31 31 31 31 31 32 32 32 32 33 33 33 34 34 35 35 35 35 35 34 34 33 33 33 33 33 33 33 33 33 33 33 32 32 31 31 31 30 30 30 30 30 30 31 31 31 31 32 32 33 33 33 32 32 32 31 32 32 33 33 33 33 33 33
12664 33 33 32 32 32 32 32 32 33 33 33 33 33 33 34 34 33 33 33 33 33 32 32 32 32 32 32 32 32 33 33 33 33 33 33 33 33 33 33 33 33 33 33 34 34 34 34 34 35 35 34 34 34 34 34 34 34 34 34 34 33 33 33 33 33 33 32 32 32 32
12616 32 32 32 32 32 32 32 32 32 32 33 33 33 33 33 33 33 33 33 33 34 34 34 34 34 34 34 33 33 33 33 33 33 33 33 33 34 34 34 34 34 34 34 34 34 34 34 34 34 33 33 33 33 33 33 33 33 33 33 33 32 32 32 31 31 31 30 30 30 31
12568 31 31 31 31 31 31 31 31 32 32 32 33 33 32 32 32 32 32 32 32 33 33 33 33 33 33 33 33 33 33 32 32 32 32 32 32 32 32 32 32 33 33 33 33 33 32 32 32 33 33 33 33 34 34 33 33 33 32 32 32 32 32 32 32 33 33 33 32 32 32
12520 32 32 32 32 32 32 32 32 33 33 34 34 34 34 33 33 33 33 33 33 34 34 34 34 34 33 33 33 33 32 32 31 31 31 31 32 32 31 31 31 32 32 32 32 31 31 31 30 30 30 30 30 30 30 30 30 30 29 29 29 29 30 30 31 31 31 31 31 31 32
12472C2%%J%%%%%%%%%%j%%%J%%%J%%%J%j%%%%%%%%%%%%%%%%%%%%%%%%%%%%J%J%%%%%%%%%%
12424C6%%%%%j%j%%%%%j%%%jJ%%%%%%%%%%%%%%%%%%%%%j%%%%%%%J%%%j%%%%%J%%%%J%%%j%
12377C3%%%%%%%%%%%j%%j%%%J%%%%%%%%%J%%J%%%%%j%j%jJ%%%%%%%%%J%%%%%%%%j%j%%J%J
12329C3J%J%%j%j%%j%j%%%%%J%%J%%%%J%%%%%J%%%%%%%j%%%%%%%%%%J%%%j%%%%%%%%%%j%%
12281C3%j%%%%%j%%%%J%J%%%%%%%%%%%%jJ%J%%%%%%%%%%%%J%%%%%j%J%%%%j%%%%j%j%j%%J
12233C2%%%%%%%%%%%%%%%%%%%j%%j%%%%%%%J%%%%J%%%%jJ%J%%%%%%j%%%%%%%j%%%J%%%J%j
12185C2%%%%%J%%%%j%%%%%j%%%%%%J%J%%%%%%j%%%%%%%%%%%%%%J%%J%%%Jj%j%j%%j%%j%%j
12137B9%%%%%J%%J%%J%%%%%%j%J%%%%%%%%%%%j%%j%J%J%J%%j%%%J%J%j%%%%%%%%%J%%%%%j
$$ plain form
12472 32 32 32 33 33 33 33 33 33 33 33 33 33 33 32 32 32 32 33 33 33 33 34 34 34 34 35 35 34 34 34 34 34 34 34 34 34 34 34 34 34 34 34 34 34 34 34 34 34 34 34 34 34 34 34 34 34 35 35 36 36 36 36 36 36 36 36 36 36 36
12424 36 36 36 36 36 36 35 35 34 34 34 34 34 34 33 33 33 33 32 33 33 33 33 33 33 33 33 33 33 33 33 33 33 33 33 33 33 33 33 33 33 32 32 32 32 32 32 32 32 33 33 33 33 32 32 32 32 32 32 33 33 33 33 33 34 34 34 34 33 33
12377 33 33 33 33 33 33 33 33 33 33 33 33 32 32 32 31 31 31 31 32 32 32 32 32 32 32 32 32 32 33 33 33 34 34 34 34 34 34 33 33 32 32 31 32 32 32 32 32 32 32 32 32 32 33 33 33 33 33 33 33 33 33 32 32 31 31 31 32 32 33
12329 33 34 34 35 35 35 34 34 33 33 33 32 32 31 31 31 31 31 31 32 32 32 33 33 33 33 33 34 34 34 34 34 34 35 35 35 35 35 35 35 35 34 34 34 34 34 34 34 34 34 34 34 35 35 35 35 34 34 34 34 34 34 34 34 34 34 34 33 33 33
12281 33 33 32 32 32 32 32 32 31 31 31 31 31 32 32 33 33 33 33 33 33 33 33 33 33 33 33 33 32 33 33 34 34 34 34 34 34 34 34 34 34 34 34 34 35 35 35 35 35 35 34 34 35 35 35 35 35 34 34 34 34 34 33 33 32 32 31 31 31 32
12233 32 32 32 32 32 32 32 32 32 32 32 32 32 32 32 32 32 32 32 32 31 31 31 30 30 30 30 30 30 30 30 31 31 31 31 31 32 32 32 32 32 31 32 32 33 33 33 33 33 33 33 32 32 32 32 32 32 32 32 31 31 31 31 32 32 32 32 33 33 32
12185 32 32 32 32 32 32 33 33 33 33 33 32 32 32 32 32 32 31 31 31 31 31 31 31 32 32 33 33 33 33 33 33 33 32 32 32 32 32 32 32 32 32 32 32 32 32 32 32 33 33 33 34 34 34 34 35 34 34 33 33 32 32 32 31 31 31 30 30 30 29
12137 29 29 29 29 29 29 30 30 30 31 31 31 32 32 32 32 32 32 32 31 31 32 32 32 32 32 32 32 32 32 32 32 32 31 31 31 30 30 31 31 32 32 33 33 33 32 32 32 32 33 33 34 34 33 33 33 33 33 33 33 33 33 33 34 34 34 34 34 34 33
12089C3%%%%%J%%%%J%%%j%%%%%%%j%%%%%%%%%%%%%j%%j%j%%J%%%%%%%%j%%%%%%J%J%%%J%J
12042C4%J%%%j%%%%j%%j%%%%%%%%j%%%%%%J%%%J%%%%%%%%%J%%%%%j%%%%J%%%J%%%%%%j%%%
11994C4%j%%%%%%j%j%%%j%%%%%%J%J%JJ%%%%%%j%%j%%%%%%%%%%J%%J%J%%%j%j%%%%%%%j%%
11946C2%%j%%%j%%%J%J%%%%%%%%%J%%%%%%%%J%%%%%j%%%j%%j%J%J%J%%%%j%j%%%%%%%%%%%
11898C2%%J%J%%%%%%%%%%%%J%j%%%j%%j%%%%j%J%%%J%%%%%%%%%%%%%%%%%%jJ%%%%J%%J%%%
11850C5%%j%%jj%%j%%%%%%J%%%%%%%%%j%J%%%%%j%%%%%%J%J%%J%j%%j%%%J%%J%%j%%j%j%%
11802C1%%J%%%%%%%j%j%%%%%%%%%%J%%%%%%%%%%%J%%%%%%j%%%%%%%%%j%%j%%J%%%%%Jj%%%
11754C0%%%%%%%%J%%%%J%%J%J%%j%j%J%%%%J%j%%%%%%J%J%%j%%%J%J%j%%j%%j%%%%%%%%%%
$$ plain form
12089 33 33 33 33 33 33 34 34 34 34 34 35 35 35 35 34 34 34 34 34 34 34 34 33 33 33 33 33 33 33 33 33 33 33 33 33 33 32 32 32 31 31 30 30 30 31 31 31 31 31 31 31 31 31 30 30 30 30 30 30 30 31 31 32 32 32 32 33 33 34
12042 34 34 35 35 35 35 34 34 34 34 34 33 33 33 32 32 32 32 32 32 32 32 32 31 31 31 31 31 31 31 32 32 32 32 33 33 33 33 33 33 33 33 33 33 34 34 34 34 34 34 33 33 33 33 33 34 34 34 34 35 35 35 35 35 35 35 34 34 34 34
11994 34 34 33 33 33 33 33 33 33 32 32 31 31 31 31 30 30 30 30 30 30 30 31 31 32 32 33 34 34 34 34 34 34 34 33 33 33 32 32 32 32 32 32 32 32 32 32 32 33 33 33 34 34 35 35 35 35 34 34 33 33 33 33 33 33 33 33 32 32 32
11946 32 32 32 31 31 31 31 30 30 30 30 31 31 32 32 32 32 32 32 32 32 32 32 33 33 33 33 33 33 33 33 33 34 34 34 34 34 34 33 33 33 33 32 32 32 31 31 32 32 33 33 34 34 34 34 34 33 33 32 32 32 32 32 32 32 32 32 32 32 32
11898 32 32 32 33 33 34 34 34 34 34 34 34 34 34 34 34 34 34 35 35 34 34 34 34 33 33 33 32 32 32 32 32 31 31 32 32 32 32 33 33 33 33 33 33 33 33 33 33 33 33 33 33 33 33 33 33 33 32 33 33 33 33 33 34 34 34 35 35 35 35
11850 35 35 35 34 34 34 33 32 32 32 31 31 31 31 31 31 31 32 32 32 32 32 32 32 32 32 32 31 31 32 32 32 32 32 32 31 31 31 31 31 31 31 32 32 33 33 33 34 34 33 33 33 32 32 32 32 33 33 33 34 34 34 33 33 33 32 32 31 31 31
11802 31 31 31 32 32 32 32 32 32 32 32 31 31 30 30 30 30 30 30 30 30 30 30 30 31 31 31 31 31 31 31 31 31 31 31 31 32 32 32 32 32 32 32 31 31 31 31 31 31 31 31 31 31 30 30 30 29 29 29 30 30 30 30 30 30 31 30 30 30 30
11754 30 30 30 30 30 30 30 30 30 31 31 31 31 31 32 32 32 33 33 34 34 34 33 33 32 32 33 33 33 33 33 34 34 33 33 33 33 33 33 33 34 34 35 35 35 34 34 34 34 35 35 36 36 35 35 35 34 34 34 33 33 33 33 33 33 33 33 33 33 33
11707C3j%%%j%%%%%%%%%%%%J%%%J%%%%%%%%j%j%%%%%%%%j%J%%J%%%J%%%%%J%%%%%J%j%%%%
11659C4j%%%%j%%%J%J%JJ%%%%j%%%%%%J%j%j%%j%%%%%%%Jj%%%%%%%j%j%%%%%%%J%%%j%%%J
11611C2%%%%J%%%%%%%%%%%%%%j%%%j%%%%%%%%J%%%%%%j%%J%%%J%j%j%j%%%%%J%%%%J%%J%%
11563C3%%%%%%%%%%J%%%%%%%%j%j%j%%%j%%%J%%%J%%%%%%%%%%%j%%%%%%%JJ%%%%%%%J%%%j
11515C3%%%%J%%%%%%%%%j%%%%%%%%J%J%%%%%%%%Jj%%%%j%%j%%%j%%%%%%%%%j%j%%%%%%J%%
11467C1%%%j%%%%%%%J%%%J%%J%%%%jj%j%jj%%%%%%%J%%%%%JJ%JJ%J%%J%%%%%%%j%%%%%j%J
11419C4%%%%%%%%%j%j%%j%%%J%JJ%JJ%%%%j%%%%%j%j%%%%%%jJ%%J%j%%%%%%%%%%%%J%%%%%
11372C4%%%j%J%J%%%%%j%%%j%%%j%j%%%%%%%%J%%%J%%%%%j%%J%%%%Jj%%%j%J%%j%j%j%%%%
$$ plain form
11707 33 32 32 32 32 31 31 31 31 31 31 31 31 31 31 31 31 31 32 32 32 32 33 33 33 33 33 33 33 33 33 32 32 31 31 31 31 31 31 31 31 31 30 30 31 31 31 32 32 32 32 33 33 33 33 33 33 34 34 34 34 34 34 35 35 34 34 34 34 34
11659 34 33 33 33 33 33 32 32 32 32 33 33 34 34 35 36 36 36 36 36 35 35 35 35 35 35 35 36 36 35 35 34 34 34 33 33 33 33 33 33 33 33 34 33 33 33 33 33 33 33 33 32 32 31 31 31 31 31 31 31 31 32 32 32 32 31 31 31 31 32
11611 32 32 32 32 32 33 33 33 33 33 33 33 33 33 33 33 33 33 33 33 32 32 32 32 31 31 31 31 31 31 31 31 31 32 32 32 32 32 32 32 31 31 31 32 32 32 32 33 33 32 32 31 31 30 30 30 30 30 30 31 31 31 31 31 32 32 32 33 33 33
11563 33 33 33 33 33 33 33 33 33 33 33 34 34 34 34 34 34 34 34 34 33 33 32 32 31 31 31 31 30 30 30 30 31 31 31 31 32 32 32 32 32 32 32 32 32 32 32 32 31 31 31 31 31 31 31 31 32 33 33 33 33 33 33 33 33 34 34 34 34 33
11515 33 33 33 33 33 34 34 34 34 34 34 34 34 34 34 33 33 33 33 33 33 33 33 33 34 34 35 35 35 35 35 35 35 35 35 36 35 35 35 35 35 34 34 34 33 33 33 33 32 32 32 32 32 32 32 32 32 32 31 31 30 30 30 30 30 30 30 31 31 31
11467 31 31 31 31 30 30 30 30 30 30 30 30 31 31 31 31 32 32 32 33 33 33 33 33 32 31 31 30 30 29 28 28 28 28 28 28 28 28 29 29 29 29 29 29 30 31 31 32 33 33 34 34 34 35 35 35 35 35 35 35 35 34 34 34 34 34 34 33 33 34
11419 34 34 34 34 34 34 34 34 34 34 33 33 32 32 32 31 31 31 31 32 32 33 34 34 35 36 36 36 36 36 35 35 35 35 35 35 34 34 33 33 33 33 33 33 33 32 33 33 33 34 34 33 33 33 33 33 33 33 33 33 33 33 33 33 34 34 34 34 34 34
11372 34 34 34 34 33 33 34 34 35 35 35 35 35 35 34 34 34 34 33 33 33 33 32 32 31 31 31 31 31 31 31 31 31 32 32 32 32 33 33 33 33 33 33 32 32 32 33 33 33 33 33 34 33 33 33 33 32 32 33 33 33 32 32 31 31 30 30 30 30 30
11324C0J%%%%J%J%%%J%%%J%%%%%%%%%%%%%%%%%%%%%j%J%%%J%j%j%%%J%j%%j%%%j%%%%j%J%
11276C2%J%%%%J%%%J%%%%%%%%%%%J%%%%%%%j%%%%%%%%%j%%%%%%J%%%%%%%%%%%%%%%%%j%%%
11228C4%%%%%%%J%j%%%%J%%J%%j%j%%%%j%J%%Jj%j%%%%%%J%%%%jj%%%%%J%%j%%%j%%%J%JJ
11180C4%J%%%%%%j%j%%j%jJ%%%J%%%J%%J%%%%J%%j%j%j%%%j%J%%%%%%%%%%%%j%J%%%%%%%J
11132C4j%%%%%%%%%%j%%%%%j%%%%%J%%J%%j%%%%%%%%%j%%J%%%%JJ%J%%%%%%%%j%%jj%j%%J
11084C2J%J%J%%J%%%%j%%%j%%%%j%%%%j%%%J%%%%J%%%%%%%%%%%%%%%j%%%%%%j%%%%%%%J%%
11037C3J%%%%%%J%%%j%%%%%j%J%J%%%%j%%%%j%%J%%%%%%%%%%%JJJ%%%jj%%J%%%j%%j%j%J%
10989C4%j%%%%%%%%%%%j%j%%J%%%%%J%%%%%%%J%J%%%%%j%jj%J%%%%%%%%%%%%J%J%%%jJ%%j
$$ plain form
11324 30 31 31 31 31 31 32 32 33 33 33 33 34 34 34 34 35 35 35 35 35 35 35 35 35 35 35 35 35 35 35 35 35 35 35 35 35 35 34 34 35 35 35 35 36 36 35 35 34 34 34 34 35 35 34 34 34 33 33 33 33 32 32 32 32 32 31 31 32 32
11276 32 32 33 33 33 33 33 34 34 34 34 35 35 35 35 35 35 35 35 35 35 35 35 36 36 36 36 36 36 36 36 35 35 35 35 35 35 35 35 35 35 34 34 34 34 34 34 34 35 35 35 35 35 35 35 35 35 35 35 35 35 35 35 35 35 35 34 34 34 34
11228 34 34 34 34 34 34 34 34 35 35 34 34 34 34 34 35 35 35 36 36 36 35 35 34 34 34 34 34 33 33 34 34 34 35 34 34 33 33 33 33 33 33 33 34 34 34 34 34 33 32 32 32 32 32 32 33 33 33 32 32 32 32 31 31 31 31 32 32 33 34
11180 34 34 35 35 35 35 35 35 35 34 34 33 33 33 32 32 31 32 32 32 32 33 33 33 33 34 34 34 35 35 35 35 35 36 36 36 35 35 34 34 33 33 33 33 32 32 33 33 33 33 33 33 33 33 33 33 33 33 33 32 32 33 33 33 33 33 33 33 33 34
11132 34 33 33 33 33 33 33 33 33 33 33 33 32 32 32 32 32 32 31 31 31 31 31 31 32 32 32 33 33 33 32 32 32 32 32 32 32 32 32 32 31 31 31 32 32 32 32 32 33 34 34 35 35 35 35 35 35 35 35 35 34 34 34 33 32 32 31 31 31 32
11084 32 33 33 34 34 35 35 35 36 36 36 36 36 35 35 35 35 34 34 34 34 34 33 33 33 33 33 32 32 32 32 33 33 33 33 33 34 34 34 34 34 34 34 34 34 34 34 34 34 34 34 34 33 33 33 33 33 33 33 32 32 32 32 32 32 32 32 33 33 33
11037 33 34 34 34 34 34 34 34 35 35 35 35 34 34 34 34 34 34 33 33 34 34 35 35 35 35 35 34 34 34 34 34 33 33 33 34 34 34 34 34 34 34 34 34 34 34 34 35 36 37 37 37 37 36 35 35 35 36 36 36 36 35 35 35 34 34 33 33 34 34
10989 34 34 33 33 33 33 33 33 33 33 33 33 33 33 32 32 31 31 31 32 32 32 32 32 32 33 33 33 33 33 33 33 33 34 34 35 35 35 35 35 35 34 34 33 32 32 33 33 33 33 33 33 33 33 33 33 33 33 33 34 34 35 35 35 35 34 35 35 35 34
10941C4%%%j%jj%%%%%J%%%%%J%%J%%%%%%%J%%j%%%%%%%%%j%%j%J%%J%%%%%j%j%%%%%%%J%%
10893C3J%%%%%%%%%%%%%%j%%%%j%%%%%J%%%J%%%%j%%%%j%%%%%%J%Jj%%%%%J%%%J%%%%%%%j
10845C4%%%%%j%%j%J%%%%%J%%J%%%%%%j%j%j%%%%J%%%J%%%%%%%%%%%%J%%%%j%%%%%%%%%%%
10797C4%%%%j%%%%%j%%J%J%%J%%j%%%%J%J%%%j%%%%%%%%j%%%%%j%%%%J%%%%%%%%%%j%%%%%
10749C3JJ%%%%%%%%j%%%%%%%%%%%%j%%%J%%%%%%j%%%%%Jj%j%j%%%J%%%%J%%J%%j%j%j%%J%
10702C2%%J%%%%%%%%%J%J%J%%%%%%%%J%J%j%%j%%%%j%j%j%%j%j%%%JJ%%%Jj%%%%jJ%J%%%%
10654C4j%%%%%%%%%%%%J%J%J%J%jj%jj%%%%%%%%J%%%%%%%%j%%%J%%J%%%%%%%%%%%j%j%j%%
10606C2%J%J%J%%%%%%%%%j%%j%%j%%J%%%%%%%j%%%%%%%%%%%%J%%JJ%J%%%%%%j%%%J%%J%%j
$$ plain form
10941 34 34 34 34 33 33 32 31 31 31 31 31 31 32 32 32 32 32 32 33 33 33 34 34 34 34 34 34 34 34 35 35 35 34 34 34 34 34 34 34 34 34 34 33 33 33 32 32 33 33 33 34 34 34 34 34 34 33 33 32 32 32 32 32 32 32 32 33 33 33
10893 33 34 34 34 34 34 34 34 34 34 34 34 34 34 34 34 33 33 33 33 33 32 32 32 32 32 32 33 33 33 33 34 34 34 34 34 33 33 33 33 33 32 32 32 32 32 32 32 33 33 34 33 33 33 33 33 33 34 34 34 34 35 35 35 35 35 35 35 35 34
10845 34 34 34 34 34 34 33 33 33 32 32 33 33 33 33 33 33 34 34 34 35 35 35 35 35 35 35 34 34 33 33 32 32 32 32 32 33 33 33 33 34 34 34 34 34 34 34 34 34 34 34 34 34 35 35 35 35 35 34 34 34 34 34 34 34 34 34 34 34 34
10797 34 34 34 34 34 33 33 33 33 33 33 32 32 32 33 33 34 34 34 35 35 35 34 34 34 34 34 35 35 36 36 36 36 35 35 35 35 35 35 35 35 35 34 34 34 34 34 34 33 33 33 33 33 34 34 34 34 34 34 34 34 34 34 34 33 33 33 33 33 33
10749 33 34 35 35 35 35 35 35 35 35 35 34 34 34 34 34 34 34 34 34 34 34 34 34 33 33 33 33 34 34 34 34 34 34 34 33 33 33 33 33 33 34 33 33 32 32 31 31 31 31 32 32 32 32 32 33 33 33 34 34 34 33 33 32 32 31 31 31 32 32
10702 32 32 32 33 33 33 33 33 33 33 33 33 33 34 34 35 35 36 36 36 36 36 36 36 36 36 37 37 38 38 37 37 37 36 36 36 36 36 35 35 34 34 33 33 33 32 32 31 31 31 31 32 33 33 33 33 34 33 33 33 33 33 32 33 33 34 34 34 34 34
10654 34 33 33 33 33 33 33 33 33 33 33 33 33 33 34 34 35 35 36 36 37 37 36 35 35 34 33 33 33 33 33 33 33 33 33 34 34 34 34 34 34 34 34 34 33 33 33 33 34 34 34 35 35 35 35 35 35 35 35 35 35 35 35 34 34 33 33 32 32 32
10606 32 32 33 33 34 34 35 35 35 35 35 35 35 35 35 35 34 34 34 33 33 33 32 32 32 33 33 33 33 33 33 33 33 32 32 32 32 32 32 32 32 32 32 32 32 32 33 33 33 34 35 35 36 36 36 36 36 36 36 35 35 35 35 36 36 36 37 37 37 36
10558C6%j%j%j%%jJ%%%%%j%%%J%%%%J%%%%%%j%%%j%%%J%JJ%j%%%%%%%j%%%J%%%jJ%%%J%%J
10510C6%%j%j%%j%%%%%%%%%%J%%%%%%%%J%%%%j%%j%%j%%%j%J%%%j%%J%J%%%%J%%%j%%j%%%
10462C2%%%%%J%J%J%J%%%j%%j%j%%%%J%%%%%J%%%%%J%%%%%%%%%%j%%j%%J%%%%%j%J%%j%%%
10414C4%J%J%%%%j%%%%%%%%J%%%%%J%%%%%%%j%j%jj%%%%%%%%J%J%%%%%j%j%%J%J%%%%j%%%
10367C4%j%%%%%J%%%%%J%%%%jJ%%%%J%%j%%%%J%%Jj%%%%%%%%%%j%jjJ%%%J%%J%%%%%j%%%j
10319C4%%%%j%J%%%%%j%%J%%%%%%%%%%%%%%%%%%%%J%%%%%J%j%j%jj%%%%%%%%J%%%%%J%%%j
10271C3%%%%%%%%Jj%%%j%j%%%%%%%%%%J%%J%%%%J%%%%j%%%%J%%%%%%%J%%%%%%JJ%J%%%%j%
10223C7%%%%j%%j%%%%%%j%%%%%%%J%%%%%J%%J%%j%%%%j%j%%jJ%%J%Jj%%j%%%%%J%%%J%%%J
$$ plain form
10558 36 36 35 35 34 34 33 33 33 32 33 33 33 33 33 33 32 32 32 32 33 33 33 33 33 34 34 34 34 34 34 34 33 33 33 33 32 32 32 32 33 33 34 35 35 34 34 34 34 34 34 34 34 33 33 33 33 34 34 34 34 33 34 34 34 34 35 35 35 36
10510 36 36 36 35 35 34 34 34 33 33 33 33 33 33 33 33 33 33 33 34 34 34 34 34 34 34 34 34 35 35 35 35 35 34 34 34 33 33 33 32 32 32 32 31 31 32 32 32 32 31 31 31 32 32 33 33 33 33 33 34 34 34 34 33 33 33 32 32 32 32
10462 32 32 32 32 32 32 33 33 34 34 35 35 36 36 36 36 35 35 35 34 34 33 33 33 33 33 34 34 34 34 34 34 35 35 35 35 35 35 36 36 36 36 36 36 36 36 36 36 36 35 35 35 34 34 34 35 35 35 35 35 35 34 34 35 35 35 34 34 34 34
10414 34 34 35 35 36 36 36 36 36 35 35 35 35 35 35 35 35 35 36 36 36 36 36 36 37 37 37 37 37 37 37 37 36 36 35 35 34 33 33 33 33 33 33 33 33 33 34 34 35 35 35 35 35 35 34 34 33 33 33 34 34 35 35 35 35 35 34 34 34 34
10367 34 34 33 33 33 33 33 33 34 34 34 34 34 34 35 35 35 35 35 34 35 35 35 35 35 36 36 36 35 35 35 35 35 36 36 36 37 36 36 36 36 36 36 36 36 36 36 36 35 35 34 33 34 34 34 34 35 35 35 36 36 36 36 36 36 35 35 35 35 34
10319 34 34 34 34 34 33 33 34 34 34 34 34 34 33 33 33 34 34 34 34 34 34 34 34 34 34 34 34 34 34 34 34 34 34 34 34 34 35 35 35 35 35 35 36 36 35 35 34 34 33 32 32 32 32 32 32 32 32 32 33 33 33 33 33 33 34 34 34 34 33
10271 33 33 33 33 33 33 33 33 33 34 33 33 33 33 32 32 31 31 31 31 31 31 31 31 31 31 31 32 32 32 33 33 33 33 33 34 34 34 34 34 33 33 33 33 33 34 34 34 34 34 34 34 34 35 35 35 35 35 35 35 36 37 37 38 38 38 38 38 37 37
10223 37 37 37 37 37 36 36 36 35 35 35 35 35 35 35 34 34 34 34 34 34 34 34 35 35 35 35 35 35 36 36 36 37 37 37 36 36 36 36 36 35 35 34 34 34 33 34 34 34 35 35 36 35 35 35 34 34 34 34 34 34 35 35 35 35 36 36 36 36 37
10175C7%%%%%%%j%%%%j%%%j%%%%%%%%%%%%%%%%%%%%%%%%%%j%%%j%%%%J%%%%%%%j%%%%%%%J
10127C3%%%J%%%%%%%%%j%%%jJ%%%%%J%%%%j%%J%%%%%j%j%%%%%JJJ%J%%Jj%%j%%%%%%%%%J%
10079C6%%%%%%%J%%j%j%j%%j%%%%%%%%%%J%j%%%%J%%%%J%%%%j%%j%%J%%%J%%%%%%%%%J%%%
10032C6%%%%%%%%%%%%%J%%%%%j%%%%j%%j%jj%%J%J%%%%%%%%%%%%%%%%%J%%%%%J%%%%J%%%%
9984C7%%%%j%%%J%%%%%j%jj%%%%%%%%%%%%%%%%%%%%%%%%%%j%%j%%J%J%J%%j%J%J%%%j%%%%
9935C5%%%%%%%J%%j%%%%%j%%J%%%%%%%%%J%%%%%J%%%%%%%%%%%J%%j%%j%j%j%%%%%J%%J%%%
9887C6%%j%%%%Jj%%%%%%%%%%%%%%%J%J%%%%jj%%%J%J%%%%%j%%j%%%%%j%%J%%%%%%%%j%%J%
9838C5%%j%%%%%%%%%%%%%%J%%J%%%j%%%%%%%%%%J%J%%j%%j%j%%%%%%%j%%%J%%%%J%%%%%J%
$$ plain form
10175 37 37 37 37 37 37 37 37 36 36 36 36 36 35 35 35 35 34 34 34 34 34 34 34 34 34 34 34 34 34 34 34 34 34 34 34 34 34 34 34 34 34 34 34 33 33 33 33 32 32 32 32 32 33 33 33 33 33 33 33 33 32 32 32 32 32 32 32 32 33
10127 33 33 33 33 34 34 34 34 34 34 34 34 34 34 33 33 33 33 32 33 33 33 33 33 33 34 34 34 34 34 33 33 33 34 34 34 34 34 34 33 33 32 32 32 32 32 32 33 34 35 35 36 36 36 37 36 36 36 35 35 35 35 35 35 35 35 35 35 36 36
10079 36 36 36 36 36 36 36 36 37 37 37 36 36 35 35 34 34 34 33 33 33 33 33 33 33 33 33 33 33 34 34 33 33 33 33 33 34 34 34 34 34 35 35 35 35 35 34 34 34 33 33 33 34 34 34 34 35 35 35 35 35 35 35 35 35 35 36 36 36 36
10032 36 36 36 36 36 36 36 36 36 36 36 36 36 36 37 37 37 37 37 37 36 36 36 36 36 35 35 35 34 34 33 32 32 32 33 33 34 34 34 34 34 34 34 34 34 34 34 34 34 34 34 34 34 34 35 35 35 35 35 35 36 36 36 36 36 37 37 37 37 37
9984 37 37 37 37 37 36 36 36 36 37 37 37 37 37 37 36 36 35 34 34 34 34 34 34 34 34 34 34 34 34 34 34 34 34 34 34 34 34 34 34 34 34 34 34 34 33 33 33 32 32 32 33 33 34 34 35 35 35 34 34 35 35 36 36 36 36 35 35 35 35 35
9935 35 35 35 35 35 35 35 35 36 36 36 35 35 35 35 35 35 34 34 34 35 35 35 35 35 35 35 35 35 35 36 36 36 36 36 36 37 37 37 37 37 37 37 37 37 37 37 37 38 38 38 37 37 37 36 36 35 35 34 34 34 34 34 34 35 35 35 36 36 36 36
9887 36 36 36 35 35 35 35 35 36 35 35 35 35 35 35 35 35 35 35 35 35 35 35 35 35 36 36 37 37 37 37 37 36 35 35 35 35 36 36 37 37 37 37 37 37 36 36 36 35 35 35 35 35 35 34 34 34 35 35 35 35 35 35 35 35 35 34 34 34 35 35
9838 35 35 35 34 34 34 34 34 34 34 34 34 34 34 34 34 34 34 35 35 35 36 36 36 36 35 35 35 35 35 35 35 35 35 35 35 36 36 37 37 37 36 36 36 35 35 34 34 34 34 34 34 34 34 33 33 33 33 34 34 34 34 34 35 35 35 35 35 35 36 36
9790C6%j%J%%J%%%%j%%%%%j%%J%J%%%%%j%j%%%%%%%J%%%Jj%%%%%J%%%%%j%j%%J%J%%%%%%%
9741C7%j%%%%%%%%%%%%%%%%j%%%%%j%%j%j%J%%J%%J%J%%%J%%j%%%%j%%J%%J%%J%%%%j%%%%
9692C7%%%%%%%%%%%%%j%jj%%%%J%j%%j%%%%%%J%J%%%%%%%j%%%%%J%%J%%J%%J%j%%%%%%J%%
9644C8%%J%%%%j%%%%%%j%%%%J%%%j%j%%%%%%%%j%%%j%%%%%%J%%J%J%%%%%%%j%%%%j%%%%%%
9595C5%%%J%J%j%%%j%%%%%J%%J%%J%%%%%%j%%%%%%%%%%j%J%%%j%%jJ%%%Jj%%%%%%J%JJ%%%
9547C9j%%%%%%j%%%%%%%j%%%%%j%%%%jJ%%%%%%%J%%%%%j%%j%%%%j%%J%%J%J%%%%%%%%J%%%
9498C7%%%%%%%%%%j%%%%%%%%%%%%j%%%%j%%%J%%J%%%%j%%%%%%%%%J%%%J%%%j%%%%%%%%%j%
9450C5%jJ%%%%%%%%%J%j%%%%%J%%%%%%%j%%j%%J%%%J%%%%J%%%%j%j%jJ%%%J%%J%%%%%%%%%
$$ plain form
9790 36 36 35 35 36 36 36 37 37 37 37 37 36 36 36 36 36 36 35 35 35 36 36 37 37 37 37 37 37 36 36 35 35 35 35 35 35 35 35 36 36 36 36 37 36 36 36 36 36 36 37 37 37 37 37 37 36 36 35 35 35 36 36 37 37 37 37 37 37 37 37
9741 37 37 36 36 36 36 36 36 36 36 36 36 36 36 36 36 36 36 36 35 35 35 35 35 35 34 34 34 33 33 32 32 33 33 33 34 34 34 35 35 36 36 36 36 37 37 37 36 36 36 36 36 35 35 35 36 36 36 37 37 37 38 38 38 38 38 37 37 37 37 37
9692 37 37 37 37 37 37 37 37 37 37 37 37 37 37 36 36 35 34 34 34 34 34 35 35 34 34 34 33 33 33 33 33 33 33 34 34 35 35 35 35 35 35 35 35 34 34 34 34 34 34 35 35 35 36 36 36 37 37 37 38 38 37 37 37 37 37 37 37 38 38 38
9644 38 38 38 39 39 39 39 39 38 38 38 38 38 38 38 37 37 37 37 37 38 38 38 38 37 37 36 36 36 36 36 36 36 36 36 35 35 35 35 34 34 34 34 34 34 34 35 35 35 36 36 37 37 37 37 37 37 37 37 36 36 36 36 36 35 35 35 35 35 35 35
9595 35 35 35 35 36 36 37 37 36 36 36 36 35 35 35 35 35 35 36 36 36 37 37 37 38 38 38 38 38 38 38 37 37 37 37 37 37 37 37 37 37 37 36 36 37 37 37 37 36 36 36 35 36 36 36 36 37 36 36 36 36 36 36 36 37 37 38 39 39 39 39
9547 39 38 38 38 38 38 38 38 37 37 37 37 37 37 37 37 36 36 36 36 36 36 35 35 35 35 35 34 35 35 35 35 35 35 35 35 36 36 36 36 36 36 35 35 35 34 34 34 34 34 33 33 33 34 34 34 35 35 36 36 36 36 36 36 36 36 36 37 37 37 37
9498 37 37 37 37 37 37 37 37 37 37 37 36 36 36 36 36 36 36 36 36 36 36 36 36 35 35 35 35 35 34 34 34 34 35 35 35 36 36 36 36 36 35 35 35 35 35 35 35 35 35 35 36 36 36 36 37 37 37 37 36 36 36 36 36 36 36 36 36 36 35 35
9450 35 35 34 35 35 35 35 35 35 35 35 35 35 36 36 35 35 35 35 35 35 36 36 36 36 36 36 36 36 35 35 35 34 34 34 35 35 35 35 36 36 36 36 36 37 37 37 37 37 36 36 35 35 34 35 35 35 35 36 36 36 37 37 37 37 37 37 37 37 37 37
9401C7%%%%%%%J%%%J%%j%j%j%j%%jJ%%%J%%J%J%%%%J%J%JJ%%%jjj%j%%%%%%%%%j%%%%%%%%
9353C7j%J%%%%%%%%%%%%%%j%%j%%%%J%%J%%J%j%j%%j%%%%J%%%%%%j%%%%%%%%%%J%J%%%%%J
9304C8%%%%%%j%j%j%%%%J%J%%%%%%%%%%j%%%%%%%%%%%%%%j%%%%J%%%%%%%J%j%%%%%%%%%%%
9256C6%%%J%%%%%%%j%%%%%%%%%%J%%J%J%%jjjj%%%%%%%%J%%%J%%J%%%j%%%%%%%%%%%%%%%%
9207C7%J%%%%%%%%%%%%%%%J%J%J%%%j%%j%%%J%%%%%%j%j%%%%%%%J%%%%%%%%%%%%%%%%%j%J
9158C9%%J%%%j%%j%%%%%%J%%J%%%%J%%j%j%j%%j%%%%%%%%%%%%%%j%%%%%%%j%J%%J%%%%%J%
9110C8j%%%%%J%%%%%j%j%%%%j%%%%%%J%%%%%J%J%J%%J%%jj%j%%j%%j%%%%J%J%%%%%%%%%J%
9061C8%J%%J%%%%j%%%j%%j%j%J%%J%J%%%j%%j%J%%J%%J%%%%%%j%%j%%%%%%%%%%%j%%%%%j%
$$ plain form
9401 37 37 37 37 37 37 37 37 38 38 38 38 39 39 39 38 38 37 37 36 36 35 35 35 34 35 35 35 35 36 36 36 37 37 38 38 38 38 38 39 39 40 40 41 42 42 42 42 41 40 39 39 38 38 38 38 38 38 38 38 38 38 37 37 37 37 37 37 37 37 37
9353 37 36 36 37 37 37 37 37 37 37 37 37 37 37 37 37 37 37 36 36 36 35 35 35 35 35 36 36 36 37 37 37 38 38 37 37 36 36 36 35 35 35 35 35 36 36 36 36 36 36 36 35 35 35 35 35 35 35 35 35 35 35 36 36 37 37 37 37 37 37 38
9304 38 38 38 38 38 38 38 37 37 36 36 35 35 35 35 35 36 36 37 37 37 37 37 37 37 37 37 37 37 36 36 36 36 36 36 36 36 36 36 36 36 36 36 36 35 35 35 35 35 36 36 36 36 36 36 36 36 37 37 36 36 36 36 36 36 36 36 36 36 36 36
9256 36 36 36 36 37 37 37 37 37 37 37 37 36 36 36 36 36 36 36 36 36 36 36 37 37 37 38 38 39 39 39 38 37 36 35 35 35 35 35 35 35 35 35 36 36 36 36 37 37 37 38 38 38 38 37 37 37 37 37 37 37 37 37 37 37 37 37 37 37 37 37
9207 37 37 38 38 38 38 38 38 38 38 38 38 38 38 38 38 38 38 39 39 40 40 41 41 41 41 40 40 40 39 39 39 39 40 40 40 40 40 40 40 39 39 38 38 38 38 38 38 38 38 39 39 39 39 39 39 39 39 39 39 39 39 39 39 39 39 39 39 38 38 39
9158 39 39 39 40 40 40 40 39 39 39 38 38 38 38 38 38 38 39 39 39 40 40 40 40 40 41 41 41 40 40 39 39 38 38 38 37 37 37 37 37 37 37 37 37 37 37 37 37 37 37 36 36 36 36 36 36 36 36 35 35 36 36 36 37 37 37 37 37 37 38 38
9110 38 37 37 37 37 37 37 38 38 38 38 38 38 37 37 36 36 36 36 36 35 35 35 35 35 35 35 36 36 36 36 36 36 37 37 38 38 39 39 39 40 40 40 39 38 38 37 37 37 36 36 36 35 35 35 35 35 36 36 37 37 37 37 37 37 37 37 37 37 38 38
9061 38 38 39 39 39 40 40 40 40 40 39 39 39 39 38 38 38 37 37 36 36 37 37 37 38 38 39 39 39 39 38 38 38 37 37 38 38 38 39 39 39 40 40 40 40 40 40 40 39 39 39 38 38 38 38 38 38 38 38 38 38 38 38 37 37 37 37 37 37 36 36
9013C6%%%%%%%%JJ%J%J%%j%j%%%%J%%%%%j%%%%%%%jJ%%%%%j%%%%%J%%%%%J%%%%j%%%J%%j%
8964C8%%%%J%%%%%%%%%%%%%%%%%j%%%%%%%%%Jj%%%%J%%%%%%%%%%j%%j%%%%%%%J%j%j%%%%J
8916C7%J%J%%j%j%%%%%J%%%J%%%%J%%J%%%%jj%j%J%%%j%%%%%Jj%%%j%%%%%%%%%%%JJ%Jj%%
8867C9j%%j%%j%J%JJ%J%%%%%j%j%%%%%%%%%%J%%%%%%%%%%%%J%%%j%%%%%J%%J%%%%%j%%%%%
8819D0%J%%%j%%%%%%%J%%%%%%%%%%%%%j%%j%%j%%J%%%%J%j%%%%j%%j%%%%%%%%%J%%j%%%%%
8770C7%J%%%%%J%%%%%%j%j%%%%%%%%%J%%%J%%%%%%%%%%J%%%%%j%%%%J%%%%%%J%%%%%%%%%%
8721D1%j%j%%%j%%%%%%%J%%%%J%%%j%j%%j%%%j%%J%%%j%%%%%%%J%%%%J%%%%%%%J%%%J%%J%
8673D1%%%%%j%%%%%%jJ%%%%%%%J%J%J%%%%%%j%%%%j%%%%%%J%%%j%%%%j%%%j%%jJ%%%%J%%%
$$ plain form
9013 36 36 36 36 36 36 36 36 36 37 38 38 39 39 40 40 40 39 39 38 38 38 38 38 39 39 39 39 39 39 38 38 38 38 38 38 38 38 37 38 38 38 38 38 38 37 37 37 37 37 37 38 38 38 38 38 38 39 39 39 39 39 38 38 38 38 39 39 39 38 38
8964 38 38 38 38 38 39 39 39 39 39 39 39 39 39 39 39 39 39 39 39 39 39 39 38 38 38 38 38 38 38 38 38 38 39 38 38 38 38 38 39 39 39 39 39 39 39 39 39 39 39 38 38 38 37 37 37 37 37 37 37 37 38 38 37 37 36 36 36 36 36 37
8916 37 37 38 38 39 39 39 38 38 37 37 37 37 37 37 38 38 38 38 39 39 39 39 39 40 40 40 41 41 41 41 41 40 39 39 38 38 39 39 39 39 38 38 38 38 38 38 39 38 38 38 38 37 37 37 37 37 37 37 37 37 37 37 37 38 39 39 40 39 39 39
8867 39 38 38 38 37 37 37 36 36 37 37 38 39 39 40 40 40 40 40 40 39 39 38 38 38 38 38 38 38 38 38 38 38 39 39 39 39 39 39 39 39 39 39 39 39 39 40 40 40 40 39 39 39 39 39 39 40 40 40 41 41 41 41 41 41 40 40 40 40 40 40
8819 40 40 41 41 41 41 40 40 40 40 40 40 40 40 41 41 41 41 41 41 41 41 41 41 41 41 41 41 40 40 40 39 39 39 38 38 38 39 39 39 39 39 40 40 39 39 39 39 39 38 38 38 37 37 37 37 37 37 37 37 37 37 38 38 38 37 37 37 37 37 37
8770 37 37 38 38 38 38 38 38 39 39 39 39 39 39 39 38 38 37 37 37 37 37 37 37 37 37 37 38 38 38 38 39 39 39 39 39 39 39 39 39 39 39 40 40 40 40 40 40 39 39 39 39 39 40 40 40 40 40 40 40 41 41 41 41 41 41 41 41 41 41 41
8721 41 41 40 40 39 39 39 39 38 38 38 38 38 38 38 38 39 39 39 39 39 40 40 40 40 39 39 38 38 38 37 37 37 37 36 36 36 37 37 37 37 36 36 36 36 36 36 36 36 37 37 37 37 37 38 38 38 38 38 38 38 38 39 39 39 39 40 40 40 41 41
8673 41 41 41 41 41 41 40 40 40 40 40 40 40 39 40 40 40 40 40 40 40 40 41 41 42 42 43 43 43 43 43 43 43 42 42 42 42 42 41 41 41 41 41 41 41 42 42 42 42 41 41 41 41 41 40 40 40 40 39 39 39 38 39 39 39 39 39 40 40 40 40
8624D0%%%%%%%%%j%j%%%J%%%j%%%%%%%j%%%J%%%%%%J%%%%J%J%%j%%%j%%J%J%%%%%j%%%%%%
8576D0Jj%%j%%%%J%J%%J%%%%%%j%j%j%%j%%j%J%J%J%J%J%%%%j%%%J%%j%j%j%%%%%J%%%J%%
8527D1%%%j%%%j%%%j%%%%%%J%%%J%%J%%%%%%J%%%j%%%%%%%%%%%%%%j%j%%%J%%%J%%jj%jj%
8479C7J%%%%%%%%%%j%%%%%J%%%%J%J%%J%%%%%%%%%%j%%%j%j%%%%J%J%%J%%%%%j%%%J%%Jj%
8430D1%%%%%%%J%J%%%%%%%j%%%%jJ%%%%%%%j%%%%%%%%%%%%%%%%%J%%%J%%%%jJ%%%%j%%%%%
8382D2%%j%%%%J%J%%%%%%%%%j%%%%j%J%%%%%%%j%J%%%%%%%%%%%%%%j%%J%%%%%j%%%%%J%J%
8333D3J%%%%jj%%j%%Jj%%%%%%J%%%%%%%%%%J%%%j%j%j%jJ%%%J%%%%%%%J%%%J%%j%j%jJ%J%
8285D2%Jj%%j%%%%%%%%%%jJ%J%%%%%%%%%%%%%%%%%%%%jJ%%%%%%%%J%%%J%%%%%%%j%%j%j%%
$$ plain form
8624 40 40 40 40 40 40 40 40 40 40 39 39 38 38 38 38 39 39 39 39 38 38 38 38 38 38 38 38 37 37 37 37 38 38 38 38 38 38 38 39 39 39 39 39 40 40 41 41 41 40 40 40 40 39 39 39 40 40 41 41 41 41 41 41 40 40 40 40 40 40 40
8576 40 41 40 40 40 39 39 39 39 39 40 40 41 41 41 42 42 42 42 42 42 42 41 41 40 40 39 39 39 38 38 38 37 37 38 38 39 39 40 40 41 41 42 42 42 42 42 41 41 41 41 42 42 42 41 41 40 40 39 39 39 39 39 39 40 40 40 40 41 41 41
8527 41 41 41 41 40 40 40 40 39 39 39 39 38 38 38 38 38 38 38 39 39 39 39 40 40 40 41 41 41 41 41 41 41 42 42 42 42 41 41 41 41 41 41 41 41 41 41 41 41 41 41 41 40 40 39 39 39 39 40 40 40 40 41 41 41 40 39 39 38 37 37
8479 37 38 38 38 38 38 38 38 38 38 38 38 37 37 37 37 37 37 38 38 38 38 38 39 39 40 40 40 41 41 41 41 41 41 41 41 41 41 41 40 40 40 40 39 39 38 38 38 38 38 39 39 40 40 40 41 41 41 41 41 41 40 40 40 40 41 41 41 42 41 41
8430 41 41 41 41 41 41 41 41 42 42 43 43 43 43 43 43 43 43 42 42 42 42 42 41 42 42 42 42 42 42 42 42 41 41 41 41 41 41 41 41 41 41 41 41 41 41 41 41 41 41 42 42 42 42 43 43 43 43 43 42 43 43 43 43 43 42 42 42 42 42 42
8382 42 42 42 41 41 41 41 41 42 42 43 43 43 43 43 43 43 43 43 43 42 42 42 42 42 41 41 42 42 42 42 42 42 42 42 41 41 42 42 42 42 42 42 42 42 42 42 42 42 42 42 42 41 41 41 42 42 42 42 42 42 41 41 41 41 41 41 42 42 43 43
8333 43 44 44 44 44 44 43 42 42 42 41 41 41 42 41 41 41 41 41 41 41 42 42 42 42 42 42 42 42 42 42 42 43 43 43 43 42 42 41 41 40 40 39 40 40 40 40 41 41 41 41 41 41 41 41 42 42 42 42 43 43 43 42 42 41 41 40 41 41 42 42
8285 42 42 43 42 42 42 41 41 41 41 41 41 41 41 41 41 41 40 41 41 42 42 42 42 42 42 42 42 42 42 42 42 42 42 42 42 42 42 42 42 42 41 42 42 42 42 42 42 42 42 42 43 43 43 43 44 44 44 44 44 44 44 44 43 43 43 42 42 41 41 41
8236D1%%j%%%%%%J%J%%J%%%J%%j%%J%%%%%%%%%j%%%%%%%%j%%jJ%%J%%%%%%j%%%%%J%%%%%%
8187D3%%%%%%%j%%%%J%%%%%%%%%%%%%J%%%%%j%%%J%J%Jj%j%%%%%%j%%%%%%%%%%%%%%%%%%%
8139D3%%%%J%%J%j%%%%J%%j%%j%%%%%j%%j%%%%%%%%%%%%%J%JJ%%J%%j%%%j%j%J%%%%%%J%%
8090D4%%%%%%%%%%%J%%%%%%%%%%%%%%%J%j%%%%%j%%J%%%%j%%%%%%J%%%%%%%%%%%%%%j%J%%
8042D5%J%j%j%j%%%%%%%J%%%J%%J%%%%%%%%j%%%%j%%j%%%%%%%%%%%%%%%j%%%J%%J%%%%%Jj
7993D4%%%%J%%%%%j%J%%j%%j%J%J%J%%%%%%%%%%%%j%%%%%%%%%%%%%%%%%%%%j%%%%%J%J%%%
7945D6%%%J%%%%%J%j%j%%j%%%%%%%JJ%%%%%%%%%%%%%%%%%j%%%%%%%J%%%%j%%j%%%%J%%%%j
7896D5j%j%%%Jj%%%%J%J%J%%%%%%%%%%%%%%%%%%%%j%%%j%J%%%%%%%%%%%%j%%%%%%%%%%J%%
$$ plain form
8236 41 41 41 40 40 40 40 40 40 40 41 41 42 42 42 43 43 43 43 44 44 44 43 43 43 44 44 44 44 44 44 44 44 44 44 43 43 43 43 43 43 43 43 43 42 42 42 41 42 42 42 43 43 43 43 43 43 43 42 42 42 42 42 42 43 43 43 43 43 43 43
8187 43 43 43 43 43 43 43 43 42 42 42 42 42 43 43 43 43 43 43 43 43 43 43 43 43 43 43 44 44 44 44 44 44 43 43 43 43 44 44 45 45 46 45 45 44 44 44 44 44 44 44 43 43 43 43 43 43 43 43 43 43 43 43 43 43 43 43 43 43 43 43
8139 43 43 43 43 43 44 44 44 45 45 44 44 44 44 44 45 45 45 44 44 44 43 43 43 43 43 43 42 42 42 41 41 41 41 41 41 41 41 41 41 41 41 41 41 42 42 43 44 44 44 45 45 45 44 44 44 44 43 43 42 42 43 43 43 43 43 43 43 44 44 44
8090 44 44 44 44 44 44 44 44 44 44 44 44 45 45 45 45 45 45 45 45 45 45 45 45 45 45 45 45 46 46 45 45 45 45 45 45 44 44 44 45 45 45 45 45 44 44 44 44 44 44 44 45 45 45 45 45 45 45 45 45 45 45 45 45 45 45 44 44 45 45 45
8042 45 45 46 46 45 45 44 44 43 43 43 43 43 43 43 43 44 44 44 44 45 45 45 46 46 46 46 46 46 46 46 46 45 45 45 45 45 44 44 44 43 43 43 43 43 43 43 43 43 43 43 43 43 43 43 43 42 42 42 42 43 43 43 44 44 44 44 44 44 45 44
7993 44 44 44 44 44 45 45 45 45 45 45 44 44 45 45 45 44 44 44 43 43 44 44 45 45 46 46 46 46 46 46 46 46 46 46 46 46 46 45 45 45 45 45 45 45 45 45 45 45 45 45 45 45 45 45 45 45 45 45 44 44 44 44 44 44 45 45 46 46 46 46
7945 46 46 46 46 47 47 47 47 47 47 48 48 47 47 46 46 46 45 45 45 45 45 45 45 45 46 47 47 47 47 47 47 47 47 47 47 47 47 47 47 47 47 47 47 46 46 46 46 46 46 46 46 47 47 47 47 47 46 46 46 45 45 45 45 45 46 46 46 46 46 45
7896 45 44 44 43 43 43 43 44 43 43 43 43 43 44 44 45 45 46 46 46 46 46 46 46 46 46 46 46 46 46 46 46 46 46 46 46 46 46 45 45 45 45 44 44 45 45 45 45 45 45 45 45 45 45 45 45 45 44 44 44 44 44 44 44 44 44 44 44 45 45 45
7848D5%%%%j%%%%%%%%%%%%%%%J%J%%%%%j%%%%%%%%%%%%%%%%J%%J%%%%%%%%%j%%%%%jJ%%%j
7799D5%%j%J%%%J%%J%J%%%%j%J%%%%j%%%%%j%%%%jJ%%%J%%Jj%%%%%%%%%%Jj%%%%%%%%%%%%
7750D7%j%%j%j%%%%%%J%%%%%%J%%j%%%j%%%J%%J%%J%%%%%%%J%J%J%%%j%j%%%%%%%%%%%%%%
7702D8%%%%J%%%%j%%%%%%%%%J%%%%j%%%%%%j%%%J%j%j%%%%%j%%%J%%%J%%%%%%J%%%J%J%J%
7653E1%j%j%%%J%%%%%J%%%j%%%%j%%%%%%%j%%j%%%%%%%j%J%J%%J%%%%%%%%%J%J%j%j%j%%%
7605D8%j%%%%J%%J%%J%j%%%%%%%%%%%%%%%j%%%%J%J%%J%%J%%%%%j%j%j%j%%j%%%%%J%J%%%
7556D9%%%%%%J%%%J%%%%j%%%%J%%%%%%%j%%%%j%%%%%%J%%%J%%%%%Jj%j%%%%j%J%%j%%j%%j
7508D7%%%%%J%%J%%%%%%J%%%%J%%j%%%%%%%%%%%%%%j%%%%%%%%%J%%J%%%%%%J%%%%%%%%%%j
$$ plain form
7848 45 45 45 45 45 44 44 44 44 44 44 44 44 44 44 44 44 44 44 44 44 45 45 46 46 46 46 46 46 45 45 45 45 45 45 45 45 45 45 45 45 45 45 45 45 45 46 46 46 47 47 47 47 47 47 47 47 47 47 46 46 46 46 46 46 45 46 46 46 46 45
7799 45 45 45 44 44 45 45 45 45 46 46 46 47 47 48 48 48 48 48 47 47 48 48 48 48 48 47 47 47 47 47 47 46 46 46 46 46 45 46 46 46 46 47 47 47 48 47 47 47 47 47 47 47 47 47 47 47 48 47 47 47 47 47 47 47 47 47 47 47 47 47
7750 47 47 46 46 46 45 45 44 44 44 44 44 44 44 45 45 45 45 45 45 45 46 46 46 45 45 45 45 44 44 44 44 45 45 45 46 46 46 47 47 47 47 47 47 47 47 48 48 49 49 50 50 50 50 49 49 48 48 48 48 48 48 48 48 48 48 48 48 48 48 48
7702 48 48 48 48 48 49 49 49 49 49 48 48 48 48 48 48 48 48 48 48 49 49 49 49 49 48 48 48 48 48 48 48 47 47 47 47 48 48 47 47 46 46 46 46 46 46 45 45 45 45 46 46 46 46 47 47 47 47 47 47 47 48 48 48 48 49 49 50 50 51 51
7653 51 51 50 50 49 49 49 49 50 50 50 50 50 50 51 51 51 51 50 50 50 50 50 49 49 49 49 49 49 49 49 48 48 48 47 47 47 47 47 47 47 47 46 46 47 47 48 48 48 49 49 49 49 49 49 49 49 49 49 50 50 51 51 50 50 49 49 48 48 48 48
7605 48 48 47 47 47 47 47 48 48 48 49 49 49 50 50 49 49 49 49 49 49 49 49 49 49 49 49 49 49 49 49 48 48 48 48 48 49 49 50 50 50 51 51 51 52 52 52 52 52 52 51 51 50 50 49 49 48 48 48 47 47 47 47 47 47 48 48 49 49 49 49
7556 49 49 49 49 49 49 49 50 50 50 50 51 51 51 51 51 50 50 50 50 50 51 51 51 51 51 51 51 51 50 50 50 50 50 49 49 49 49 49 49 49 50 50 50 50 51 51 51 51 51 51 52 51 51 50 50 50 50 50 49 49 50 50 50 49 49 49 48 48 48 47
7508 47 47 47 47 47 47 48 48 48 49 49 49 49 49 49 49 50 50 50 50 50 51 51 51 50 50 50 50 50 50 50 50 50 50 50 50 50 50 50 49 49 49 49 49 49 49 49 49 49 50 50 50 51 51 51 51 51 51 51 52 52 52 52 52 52 52 52 52 52 52 51
7459E1%j%j%%%%%%J%%%%%%%%%%%%%%j%J%J%%J%%%j%%%%J%%%%%J%%%%%j%%%%%%%%%%%%j%%%
7411E1%%J%%j%%%%%%%%J%J%%%%J%%%%%j%%%%jJ%%%%j%%%%%%J%%%%%%%%%%%%%%%%%%%%j%%%
7362E2J%%%%%%%%%%%%j%%%j%J%J%J%%%%J%%%J%j%%j%j%%j%%%%%%%%%%%%J%%J%%%%%%J%%j%
7313E4%%j%%%%%%J%%%%%%j%jj%%%%%J%%J%%J%J%%%j%%j%%%%%%j%%%%%%%j%%J%%%%%%%%j%%
7265E1%%jJ%%J%J%%%J%%%%%j%%j%%j%%%%%%%J%%%%%%%J%%%%j%%%%J%%%%J%%%%%%%%%%J%%%
7216E5%J%%J%jj%j%%%%%J%%%%%%%%%%j%J%%%J%%%J%%%%%%%%%%%j%%%%%%%%%J%%J%%%%J%j%
7168E8%j%%j%%J%%%%%%%%%%%jJ%%%%j%%%%%%%j%%%%J%%%%j%%%%%%%%%%J%%%%%%%%%%%%j%j
7119E4%%%%%%%%J%%Jj%%J%%%J%%%j%%%J%J%%%%%j%j%%%%%%J%%%%%%%%%%%%%%%%j%%%%%%%%
$$ plain form
7459 51 51 50 50 49 49 49 49 49 49 49 50 50 50 50 50 50 50 50 50 50 50 50 50 50 50 49 49 50 50 51 51 51 52 52 52 52 51 51 51 51 51 52 52 52 52 52 52 53 53 53 53 53 53 52 52 52 52 52 52 52 52 52 52 52 52 52 51 51 51 51
7411 51 51 51 52 52 52 51 51 51 51 51 51 51 51 51 52 52 53 53 53 53 53 54 54 54 54 54 54 53 53 53 53 53 52 53 53 53 53 53 52 52 52 52 52 52 52 53 53 53 53 53 53 53 53 53 53 53 53 53 53 53 53 53 53 53 53 53 52 52 52 52
7362 52 53 53 53 53 53 53 53 53 53 53 53 53 53 52 52 52 52 51 51 52 52 53 53 54 54 54 54 54 55 55 55 55 56 56 55 55 55 54 54 53 53 53 52 52 52 52 52 52 52 52 52 52 52 52 52 53 53 53 54 54 54 54 54 54 54 55 55 55 54 54
7313 54 54 54 53 53 53 53 53 53 53 54 54 54 54 54 54 54 53 53 52 51 51 51 51 51 51 52 52 52 53 53 53 54 54 55 55 55 55 54 54 54 53 53 53 53 53 53 53 52 52 52 52 52 52 52 52 51 51 51 52 52 52 52 52 52 52 52 52 51 51 51
7265 51 51 51 50 51 51 51 52 52 53 53 53 53 54 54 54 54 54 54 53 53 53 52 52 52 51 51 51 51 51 51 51 51 52 52 52 52 52 52 52 52 53 53 53 53 53 52 52 52 52 52 53 53 53 53 53 54 54 54 54 54 54 54 54 54 54 54 55 55 55 55
7216 55 55 56 56 56 57 57 56 55 55 54 54 54 54 54 54 55 55 55 55 55 55 55 55 55 55 55 54 54 55 55 55 55 56 56 56 56 57 57 57 57 57 57 57 57 57 57 57 57 56 56 56 56 56 56 56 56 56 56 57 57 57 58 58 58 58 58 59 59 58 58
7168 58 58 57 57 57 56 56 56 57 57 57 57 57 57 57 57 57 57 57 57 56 57 57 57 57 57 56 56 56 56 56 56 56 56 55 55 55 55 55 56 56 56 56 56 55 55 55 55 55 55 55 55 55 55 55 56 56 56 56 56 56 56 56 56 56 56 56 56 55 55 54
7119 54 54 54 54 54 54 54 54 54 55 55 55 56 55 55 55 56 56 56 56 57 57 57 57 56 56 56 56 57 57 58 58 58 58 58 58 57 57 56 56 56 56 56 56 56 57 57 57 57 57 57 57 57 57 57 57 57 57 57 57 57 57 56 56 56 56 56 56 56 56 56
7071E6%%%J%%%J%%%J%%J%%j%%%%jJ%%%%%%%%%j%j%%j%%%%%J%%J%%%%%%%%J%%%%%%%%J%%%%
7022F0jjj%%%%%J%%%%J%%%%J%%%%%%%j%%%%%%%%%%%%%%%%%%J%%j%%j%j%%%%%J%J%%%%%%%%
6974E9%%J%%%%%%%%%%%%%%%%%J%%%%%%%%j%%%%%%%%j%%%j%%%%%%J%%j%%%%%J%%%%%%%%%J%
6925F0%%%%%%%j%%%%%%%%J%%%%%J%%%%%%%%%%%%%%%%%%%%%%%J%J%%%%%j%j%%%%J%%%j%%%j
6877F0%j%%%JJ%J%J%%J%j%%%%%%%%J%JJ%%%%%%j%%%%%%%%%%j%%%j%%%%%%%%%J%%%%%%%%%j
6828F3%J%%%%%%%%%%%%j%%%%%j%%%%J%J%%j%%%Jj%%%%j%%J%j%%%J%%%%%%j%%%%%%J%%J%%J
6779F5%%J%j%%%jj%%j%%jJ%%%%%JJ%%%%J%%%%j%%j%%%%%%J%%J%%%%jJj%%%%%%%%jJ%%%%%j
6731F3%%j%%J%%%j%J%%%%%%%%%J%J%%J%%%%%%%%%%j%%%%%%J%%%Jj%%j%%J%%%%%%%j%%%%%%
$$ plain form
7071 56 56 56 56 57 57 57 57 58 58 58 58 59 59 59 60 60 60 59 59 59 59 59 58 59 59 59 59 59 59 59 59 59 59 58 58 57 57 57 56 56 56 56 56 56 57 57 57 58 58 58 58 58 58 58 58 58 59 59 59 59 59 59 59 59 59 60 60 60 60 60
7022 60 59 58 57 57 57 57 57 57 58 58 58 58 58 59 59 59 59 59 60 60 60 60 60 60 60 60 59 59 59 59 59 59 59 59 59 59 59 59 59 59 59 59 59 59 59 60 60 60 59 59 59 58 58 57 57 57 57 57 57 58 58 59 59 59 59 59 59 59 59 59
6974 59 59 59 60 60 60 60 60 60 60 60 60 60 60 60 60 60 60 60 60 60 61 61 61 61 61 61 61 61 61 60 60 60 60 60 60 60 60 60 59 59 59 59 58 58 58 58 58 58 58 59 59 59 58 58 58 58 58 58 59 59 59 59 59 59 59 59 59 59 60 60
6925 60 60 60 60 60 60 60 60 59 59 59 59 59 59 59 59 59 60 60 60 60 60 60 61 61 61 61 61 61 61 61 61 61 61 61 61 61 61 61 61 61 61 61 61 61 61 61 62 62 63 63 63 63 63 63 62 62 61 61 61 61 61 62 62 62 62 61 61 61 61 60
6877 60 60 59 59 59 59 60 61 61 62 62 63 63 63 64 64 63 63 63 63 63 63 63 63 63 64 64 65 66 66 66 66 66 66 66 65 65 65 65 65 65 65 65 65 65 65 64 64 64 64 63 63 63 63 63 63 63 63 63 63 64 64 64 64 64 64 64 64 64 64 63
6828 63 63 64 64 64 64 64 64 64 64 64 64 64 64 64 63 63 63 63 63 63 62 62 62 62 62 63 63 64 64 64 63 63 63 63 64 63 63 63 63 63 62 62 62 63 63 62 62 62 62 63 63 63 63 63 63 63 62 62 62 62 62 62 62 63 63 63 64 64 64 65
6779 65 65 65 66 66 65 65 65 65 64 63 63 63 62 62 62 61 62 62 62 62 62 62 63 64 64 64 64 64 65 65 65 65 65 64 64 64 63 63 63 63 63 63 63 64 64 64 65 65 65 65 65 64 65 64 64 64 64 64 64 64 64 64 63 64 64 64 64 64 64 63
6731 63 63 63 62 62 62 63 63 63 63 62 62 63 63 63 63 63 63 63 63 63 63 64 64 65 65 65 66 66 66 66 66 66 66 66 66 66 66 65 65 65 65 65 65 65 66 66 66 66 67 66 66 66 65 65 65 66 66 66 66 66 66 66 66 65 65 65 65 65 65 65
6682F5%J%%J%%J%%%%%j%%%%%%%%j%%%%%%J%%%%%%%%%%%%%%%%J%%Jj%%j%%%%%%%%%%%J%%J%
6634F9%j%%%%%%%J%%%%%%%%%%%Jj%%%j%%%%%%%J%%%%%jJ%%%%%%j%j%%%J%%%%%%%J%%%J%%%
6585G0%%J%%%%%%%j%J%%%%j%j%%%%%J%%%J%%%%%jJ%%%%%%j%%%%%%%%%J%%J%J%%%%%j%%%J%
6537G3%%%%%%%%%%j%j%%%%%%%%%jJ%%%%J%%J%%%%%J%%%%%%j%%%%%%%%%j%%%%%%%J%JJ%%%j
6488G4%j%%%j%%%j%%J%%%J%%%%%%%J%%%%%%%%%%%%%j%%%%J%%%J%%%%%j%J%%J%%%j%%%%%J%
6440G6%%%%%%%j%%j%%j%%%%%%%%j%%J%JJ%J%%%%%j%%%%%%%J%%%%%%j%%%%%%J%%%J%%%%%%%
6391G7%%%%%%%%%%%%%J%%j%%%%%%j%j%%j%%J%J%J%JJ%J%%%%%%%%%%j%%j%%%%%%%%%j%j%%%
6342G6%%%J%%J%%%%%%J%%%%%%%J%%J%%%Jj%%%j%j%%%%%%%%%%%%%%%%%%j%%%%%J%J%%%%%%%
$$ plain form
6682 65 65 66 66 66 67 67 67 68 68 68 68 68 68 67 67 67 67 67 67 67 67 67 66 66 66 66 66 66 66 67 67 67 67 67 67 67 67 67 67 67 67 67 67 67 67 67 68 68 68 69 68 68 68 67 67 67 67 67 67 67 67 67 67 67 67 68 68 68 69 69
6634 69 69 68 68 68 68 68 68 68 68 69 69 69 69 69 69 69 69 69 69 69 69 70 69 69 69 69 68 68 68 68 68 68 68 68 69 69 69 69 69 69 68 69 69 69 69 69 69 69 68 68 67 67 67 67 68 68 68 68 68 68 68 68 69 69 69 69 70 70 70 70
6585 70 70 70 71 71 71 71 71 71 71 71 70 70 71 71 71 71 71 70 70 69 69 69 69 69 69 70 70 70 70 71 71 71 71 71 71 70 71 71 71 71 71 71 71 70 70 70 70 70 70 70 70 70 70 71 71 71 72 72 73 73 73 73 73 73 72 72 72 72 73 73
6537 73 73 73 73 73 73 73 73 73 73 73 72 72 71 71 71 71 71 71 71 71 71 71 70 71 71 71 71 71 72 72 72 73 73 73 73 73 73 74 74 74 74 74 74 74 73 73 73 73 73 73 73 73 73 73 72 72 72 72 72 72 72 72 73 73 74 75 75 75 75 74
6488 74 74 73 73 73 73 72 72 72 72 71 71 71 72 72 72 72 73 73 73 73 73 73 73 73 74 74 74 74 74 74 74 74 74 74 74 74 74 74 73 73 73 73 73 74 74 74 74 75 75 75 75 75 75 74 74 75 75 75 76 76 76 76 75 75 75 75 75 75 76 76
6440 76 76 76 76 76 76 76 76 75 75 75 74 74 74 73 73 73 73 73 73 73 73 73 72 72 72 73 73 74 75 75 76 76 76 76 76 76 75 75 75 75 75 75 75 75 76 76 76 76 76 76 76 75 75 75 75 75 75 75 76 76 76 76 77 77 77 77 77 77 77 77
6391 77 77 77 77 77 77 77 77 77 77 77 77 77 77 78 78 78 77 77 77 77 77 77 77 76 76 75 75 75 74 74 74 75 75 76 76 77 77 78 79 79 80 80 80 80 80 80 80 80 80 80 80 79 79 79 78 78 78 78 78 78 78 78 78 78 77 77 76 76 76 76
6342 76 76 76 76 77 77 77 78 78 78 78 78 78 78 79 79 79 79 79 79 79 79 80 80 80 81 81 81 81 82 81 81 81 81 80 80 79 79 79 79 79 79 79 79 79 79 79 79 79 79 79 79 79 79 79 78 78 78 78 78 78 79 79 80 80 80 80 80 80 80 80
6294H0J%%J%J%%j%%%%j%%J%%J%%J%%%%%%j%%J%%%%%%%%j%%%J%j%%%%%%%%J%J%j%%%%%%%%j
6245H3j%j%%%%%%JJJ%J%%%%j%%%%J%%J%J%%j%j%j%%%%J%%%%%%J%%Jj%%jj%%%J%%J%%J%J%%
6197H8J%%%j%%j%%%%%%%%%%%%j%%%%%%%%%%%%%%J%%%%%%j%%%j%%%%%J%%J%jJ%%J%%%%%%J%
6148H9%%J%%%j%j%%%%%%J%J%J%J%%%%j%j%%j%%%%%%%J%%%%%j%%%J%%%J%%%J%%%%%%%%%jjj
6100H9%%%%%JJ%J%J%%J%%J%%%%j%j%j%J%%J%%%j%%%%%%%%%%%%%%%%%j%%%%J%JJJ%%J%%j%%
6051I6%%J%%%%%%j%%j%J%%j%%%%%j%%jJ%%%J%%%%%%J%%%%%%%%%J%%%%%%%j%%J%JJ%J%%%%J
6003A01%j%%j%j%%j%%%%%%J%%J%%J%%j%%J%%%J%%%%%%%J%%%%%%%j%%j%%%%J%%%%%%J%%%%%
5955A02j%%%J%%%%%%%%%%%%J%%j%%%%j%%%%%J%%%%%%%%%%%J%%%%%J%%%%%%J%j%%%%J%%%%%
$$ plain form
6294 80 81 81 81 82 82 83 83 83 82 82 82 82 82 81 81 81 82 82 82 83 83 83 84 84 84 84 84 84 84 83 83 83 84 84 84 84 84 84 84 84 84 83 83 83 83 84 84 83 83 83 83 83 83 83 83 83 84 84 85 85 84 84 84 84 84 84 84 84 84 83
6245 83 82 82 81 81 81 81 81 81 81 82 83 84 84 85 85 85 85 85 84 84 84 84 84 85 85 85 86 86 87 87 87 86 86 85 85 84 84 84 84 84 85 85 85 85 85 85 85 86 86 86 87 86 86 86 85 84 84 84 84 85 85 85 86 86 86 87 87 88 88 88
6197 88 89 89 89 89 88 88 88 87 87 87 87 87 87 87 87 87 87 87 87 87 86 86 86 86 86 86 86 86 86 86 86 86 86 86 86 87 87 87 87 87 87 87 86 86 86 86 85 85 85 85 85 85 86 86 86 87 87 86 87 87 87 88 88 88 88 88 88 88 89 89
6148 89 89 89 90 90 90 90 89 89 88 88 88 88 88 88 88 89 89 90 90 91 91 92 92 92 92 92 91 91 90 90 90 89 89 89 89 89 89 89 89 90 90 90 90 90 90 89 89 89 89 90 90 90 90 91 91 91 91 92 92 92 92 92 92 92 92 92 92 91 90 89
6100 89 89 89 89 89 89 90 91 91 92 92 93 93 93 94 94 94 95 95 95 95 95 94 94 93 93 92 92 93 93 93 94 94 94 94 93 93 93 93 93 93 93 93 93 93 93 93 93 93 93 93 93 93 92 92 92 92 92 93 93 94 95 96 96 96 97 97 97 96 96 96
6051 96 96 96 97 97 97 97 97 97 97 96 96 96 95 95 96 96 96 95 95 95 95 95 95 94 94 94 93 94 94 94 94 95 95 95 95 95 95 95 96 96 96 96 96 96 96 96 96 96 97 97 97 97 97 97 97 97 96 96 96 97 97 98 99 99 100 100 100 100 100 101
6003 101 101 100 100 100 99 99 98 98 98 97 97 97 97 97 97 97 98 98 98 99 99 99 100 100 100 99 99 99 100 100 100 100 101 101 101 101 101 101 101 101 102 102 102 102 102 102 102 102 101 101 101 100 100 100 100 100 101 101 101 101 101 101 101 102 102 102 102 102 102
5955 102 101 101 101 101 102 102 102 102 102 102 102 102 102 102 102 102 102 103 103 103 102 102 102 102 102 101 101 101 101 101 101 102 102 102 102 102 102 102 102 102 102 102 102 103 103 103 103 103 103 104 104 104 104 104 104 104 105 105 104 104 104 104 104 105 105 105 105 105 105
5907A05%%%%J%%%%%%%%j%%j%j%J%J%%J%J%%J%%%%%%%%%%%%%%j%%%%%%%%%%%J%J%%J%%%%%%
5859A10%%%j%%%%%J%J%j%%%%%%%%%%%J%%%j%%%%%J%%%J%%j%J%%%%%%%%%%%%j%%%%%%%J%J%
5811A13%J%%%%j%j%j%%%%%J%%%%%J%J%J%JJ%%%j%j%j%%%%J%J%J%%%j%j%%%%%J%J%%%j%%%%
5763A16%j%%j%%%J%J%J%J%%%%%%%%%%%%%%%%%%%%J%%%%%%%%%%%%j%j%j%J%%J%J%%%%%%%%%
5715A19%%J%%JJ%J%%J%%J%%%%J%%%%%%%J%%%%%%j%%%j%j%J%%%%%%J%J%%J%%%J%%J%%%j%j%
5668A28%J%%%%J%j%%j%%%%%%%%%%%J%J%%j%%%%%%%J%%j%j%%%%%%%%%j%%J%%%%%%%%%%%%%%
5620A28J%%J%J%%%%%%%%%%%J%%J%%%%%%%j%j%j%%J%JJJJ%%%%%%%%%%J%%J%%%%%%%%%jJ%%J
5572A38%%J%%%%J%%J%%J%%j%j%J%%J%%J%%%%%%%%%j%%%J%%J%%%j%%%%%%j%%J%%%%j%%%J%J
$$ plain form
5907 105 105 105 105 105 106 106 106 106 106 106 106 106 106 105 105 105 104 104 103 103 104 104 105 105 105 106 106 107 107 107 108 108 108 108 108 108 108 108 108 108 108 108 108 108 108 107 107 107 107 107 107 107 107 107 107 107 107 108 108 109 109 109 110 110 110 110 110 110 110
5859 110 110 110 110 109 109 109 109 109 109 110 110 111 111 110 110 110 110 110 110 110 110 110 110 110 110 111 111 111 111 110 110 110 110 110 110 111 111 111 111 112 112 112 111 111 112 112 112 112 112 112 112 112 112 112 112 112 112 111 111 111 111 111 111 111 111 112 112 113 113
5811 113 113 114 114 114 114 114 113 113 112 112 111 111 111 111 111 111 112 112 112 112 112 112 113 113 114 114 115 115 116 117 117 117 117 116 116 115 115 114 114 114 114 114 115 115 116 116 117 117 117 117 116 116 115 115 115 115 115 115 116 116 117 117 117 117 116 116 116 116 116
5763 116 116 115 115 115 114 114 114 114 115 115 116 116 117 117 118 118 118 118 118 118 118 118 118 118 118 118 118 118 118 118 118 118 118 118 118 119 119 119 119 119 119 119 119 119 119 119 119 119 118 118 117 117 116 116 117 117 117 118 118 119 119 119 119 119 119 119 119 119 119
5715 119 119 119 120 120 120 121 122 122 123 123 123 124 124 124 125 125 125 125 125 126 126 126 126 126 126 126 126 127 127 127 127 127 127 127 126 126 126 126 125 125 124 124 125 125 125 125 125 125 125 126 126 127 127 127 128 128 128 128 129 129 129 130 130 130 130 129 129 128 128
5668 128 128 129 129 129 129 129 130 130 129 129 129 128 128 128 128 128 128 128 128 128 128 128 128 129 129 130 130 130 129 129 129 129 129 129 129 129 130 130 130 129 129 128 128 128 128 128 128 128 128 128 128 127 127 127 128 128 128 128 128 128 128 128 128 128 128 128 128 128 128
5620 128 129 129 129 130 130 131 131 131 131 131 131 131 131 131 131 131 131 132 132 132 133 133 133 133 133 133 133 133 132 132 131 131 130 130 130 131 131 132 133 134 135 135 135 135 135 135 135 135 135 135 135 136 136 136 137 137 137 137 137 137 137 137 137 137 136 137 137 137 138
5572 138 138 138 139 139 139 139 139 140 140 140 141 141 141 142 142 142 141 141 140 140 141 141 141 142 142 142 143 143 143 143 143 143 143 143 143 143 142 142 142 142 143 143 143 144 144 144 144 143 143 143 143 143 143 143 142 142 142 143 143 143 143 143 142 142 142 142 143 143 144
5524A44%%J%%%%%%%%%%J%%%%%J%%j%%%%%%%%J%%%J%%%%%%%%%%%%%J%%%%%j%%JJ%JJJ%%J%%
5476A54Jj%%%jJ%%%%J%%j%%%%%J%%%%%%%%%J%%J%%J%%j%%%%%j%%%J%%%J%%%J%%%%%J%%J%%
5428A61%%j%%j%%%J%%%%%j%%%%%J%%J%%J%%J%%%%%%%j%%%%J%%J%%%%J%J%J%%J%%%%J%%J%%
5380A70%j%%%%%%J%%%%%j%%%%%%%%J%J%%J%%%%%%j%J%%%J%%J%%%j%%%J%JJ%J%%%%J%%%J%%
5333A79%%%%%%%J%J%J%%j%%%%%%%%J%%%%%%%J%%%%%%J%%%%%%JJ%J%%%%%%%%%%%%%%%J%JJJ
5285A91%%%%J%JJ%%%%%%j%%%J%%jJ%%J%J%%j%%%%%%%%J%%%%%%%%J%%%JJ%J%J%%J%%%%%%j%
5237B01%%J%%Jj%%%%%%JJ%JJ%%%%%%%%%%J%JJ%%%%%%%%%%J%JJ%%%J%%%J%J%%%j%%%J%J%%%
5189B16J%%%J%J%%%%j%j%%%%J%J%J%%%%%%J%%J%J%J%J%J%J%%%%J%%%j%%%JJ%J%%%J%%%%%%
$$ plain form
5524 144 144 144 145 145 145 145 145 145 145 145 145 145 145 146 146 146 146 146 146 147 147 147 146 146 146 146 146 146 146 146 146 147 147 147 147 148 148 148 148 148 148 148 148 148 148 148 148 148 148 149 149 149 149 149 149 148 148 148 149 150 150 151 152 153 153 153 154 154 154
5476 154 155 154 154 154 154 153 154 154 154 154 154 155 155 155 154 154 154 154 154 154 155 155 155 155 155 155 155 155 155 155 156 156 156 157 157 157 158 158 158 157 157 157 157 157 157 156 156 156 156 157 157 157 157 158 158 158 158 159 159 159 159 159 159 160 160 160 161 161 161
5428 161 161 161 160 160 160 159 159 159 159 160 160 160 160 160 160 159 159 159 159 159 159 160 160 160 161 161 161 162 162 162 163 163 163 163 163 163 163 163 162 162 162 162 162 163 163 163 164 164 164 164 164 165 165 166 166 167 167 167 168 168 168 168 168 169 169 169 170 170 170
5380 170 170 169 169 169 169 169 169 169 170 170 170 170 170 170 169 169 169 169 169 169 169 169 169 170 170 171 171 171 172 172 172 172 172 172 172 171 171 172 172 172 172 173 173 173 174 174 174 174 173 173 173 173 174 174 175 176 176 177 177 177 177 177 178 178 178 178 179 179 179
5333 179 179 179 179 179 179 179 179 180 180 181 181 182 182 182 181 181 181 181 181 181 181 181 181 182 182 182 182 182 182 182 182 183 183 183 183 183 183 183 184 184 184 184 184 184 184 185 186 186 187 187 187 187 187 187 187 187 187 187 187 187 187 187 187 187 188 188 189 190 191
5285 191 191 191 191 191 192 192 193 194 194 194 194 194 194 194 193 193 193 193 194 194 194 193 194 194 194 195 195 196 196 196 195 195 195 195 195 195 195 195 195 196 196 196 196 196 196 196 196 196 197 197 197 197 198 199 199 200 200 201 201 201 202 202 202 202 202 202 202 201 201
5237 201 201 201 202 202 202 203 202 202 202 202 202 202 202 203 204 204 205 206 206 206 206 206 206 206 206 206 206 206 207 207 208 209 209 209 209 209 209 209 209 209 209 209 210 210 211 212 212 212 212 213 213 213 213 214 214 215 215 215 215 214 214 214 214 215 215 216 216 216 216
5189 216 217 217 217 217 218 218 219 219 219 219 219 218 218 217 217 217 217 217 218 218 219 219 220 220 220 220 220 220 220 221 221 221 222 222 223 223 224 224 225 225 226 226 227 227 227 227 227 228 228 228 228 227 227 227 227 228 229 229 230 230 230 230 231 231 231 231 231 231 231
5141B31J%%%%%J%%%%%%%%j%%j%%J%JJJJJJ%J%%J%J%%J%%%%%%%%%%%%%J%J%%%%%%J%%J%J%%
5093B47JJ%J%J%%%%J%%%J%%%%%%%%J%%J%%J%%%%%%J%J%JJ%J%J%%%%%J%%JJ%J%J%JJ%%%%%%
5045B69%%%%J%J%%J%%J%%J%%J%%%%J%%%%J%%J%J%%J%J%%%J%%%J%J%J%%J%JJ%%%J%%%J%%J%
4998B91J%J%%%%%J%J%J%%%%%J%JJ%JJ%J%%J%%J%%J%J%J%J%%%%J%%%%J%%%%J%JJJ%%J%%J%J
4950C17JJJJ%JJ%J%JJ%J%J%%j%%%%J%J%JJJ%J%J%JJ%%J%J%%%%j%J%%JJJ%JJJ%%%%%J%JJJ%
4902C48JJJ%%%%JJJ%J%%J%JJJJ%J%%J%J%KJJJJ%%J%%%J%J%J%J%%J%%%%J%JJJJJ%JJ%J%J%J
4854C86%J%JJJJJJJJJ%%J%J%JJJ%J%%%J%JJ%JJJJJ%%J%J%J%J%JJJJ%J%%J%J%J%JJJ%JJJJJ
4806D30J%J%JJJJJJ%JJ%J%J%JJJ%JJJJJJJ%JJKJKJJ%J%J%JJJJJJJJJJJ%%JJ%J%JJJ%JJ%%J
$$ plain form
5141 231 232 232 232 232 232 232 233 233 233 233 233 233 233 233 233 232 232 232 231 231 231 232 232 233 234 235 236 237 238 238 239 239 239 240 240 241 241 241 242 242 242 242 242 242 242 242 242 242 242 242 242 242 243 243 244 244 244 244 244 244 244 245 245 245 246 246 247 247 247
5093 247 248 249 249 250 250 251 251 251 251 251 252 252 252 252 253 253 253 253 253 253 253 253 253 254 254 254 255 255 255 256 256 256 256 256 256 256 257 257 258 258 259 260 260 261 261 262 262 262 262 262 262 263 263 263 264 265 265 266 266 267 267 268 269 269 269 269 269 269 269
5045 269 269 269 269 269 270 270 271 271 271 272 272 272 273 273 273 274 274 274 275 275 275 275 275 276 276 276 276 276 277 277 277 278 278 279 279 279 280 280 281 281 281 281 282 282 282 282 283 283 284 284 285 285 285 286 286 287 288 288 288 288 289 289 289 289 290 290 290 291 291
4998 291 292 292 293 293 293 293 293 293 294 294 295 295 296 296 296 296 296 296 297 297 298 299 299 300 301 301 302 302 302 303 303 303 304 304 304 305 305 306 306 307 307 308 308 308 308 308 309 309 309 309 309 310 310 310 310 310 311 311 312 313 314 314 314 315 315 315 316 316 317
4950 317 318 319 320 321 321 322 323 323 324 324 325 326 326 327 327 328 328 328 327 327 327 327 327 328 328 329 329 330 331 332 332 333 333 334 334 335 336 336 336 337 337 338 338 338 338 338 337 337 338 338 338 339 340 341 341 342 343 344 344 344 344 344 344 345 345 346 347 348 348
4902 348 349 350 351 351 351 351 351 352 353 354 354 355 355 355 356 356 357 358 359 360 360 361 361 361 362 362 363 363 365 366 367 368 369 369 369 370 370 370 370 371 371 372 372 373 373 374 374 374 375 375 375 375 375 376 376 377 378 379 380 381 381 382 383 383 384 384 385 385 386
4854 386 386 387 387 388 389 390 391 392 393 394 395 396 396 396 397 397 398 398 399 400 401 401 402 402 402 402 403 403 404 405 405 406 407 408 409 410 410 410 411 411 412 412 413 413 414 414 415 416 417 418 418 419 419 419 420 420 421 421 422 422 423 424 425 425 426 427 428 429 430
4806 430 431 431 432 432 433 434 435 436 437 438 438 439 440 440 441 441 442 442 443 444 445 445 446 447 448 449 450 451 452 452 453 454 456 457 459 460 461 461 462 462 463 463 464 465 466 467 468 469 470 471 472 473 474 474 474 475 476 476 477 477 478 479 480 480 481 482 482 482 483
4758D83J%JJJJJJ%JJJJJKJJJJJJJJJ%JJJJJJJJJ%JJ%KJJJJJJJJKJJJJJJ%JJKJJJJJ%JKJKJ
4710E51JJJJ%JKJJKJJJJJJJJJJJK%KJJKJJKJJJK%JJJ%JJKJJJKJKKJJJKJKJJKJKJJKJJKJJK
4663F34KJKJJJKJJJJKJKJKKKJKJJJJJJKKKKKJKJJKJKKJKJJJJJJJJKJKKKKKJKKJKJKJKJKKK
4615G36KKKJKJKKJKKJJKJKKKKKKKKJKKJJKJKKLKJKKKKKKKKKKKKKKKKKKKKKKKLKKKKLKKKKK
4567H66KKLKJKKKKKLKKKLKKKLKKLLKLKLJKKKLKKLKLLKLKKLLLKLKLLKLLKLLLKLKKKKLKLLKL
4519A031LLLLLLLLKLLLLLLKLLLLLLLLLLLLLLLLMLLLLLMLLLMLLMLLLMLLLLLLKLLKLKLLMMLM
4472A238MMMMLMMMMLMMLMMLMMLMLLMLMLMMMMMMMMLMMMMMMMMMMNMMMMMLMMLMMNNMNMNMNMNM
4425A505NMNNMMNMMNMMMNNNNNNNMNMMNMNMNNNNMNNNMNONNONOOONNONNONNONONONONNONOOO
$$ plain form
4758 483 484 484 485 486 487 488 489 490 490 491 492 493 494 495 497 498 499 500 501 502 503 504 505 506 506 507 508 509 510 511 512 513 514 515 515 516 517 517 519 520 521 522 523 524 525 526 527 529 530 531 532 533 534 535 535 536 537 539 540 541 542 543 544 544 545 547 548 550 551
4710 551 552 553 554 555 555 556 558 559 560 562 563 564 565 566 567 568 569 570 571 572 573 575 575 577 578 579 581 582 583 585 586 587 588 590 590 591 592 593 593 594 595 597 598 599 600 602 603 605 607 608 609 610 612 613 615 616 617 619 620 622 623 624 626 627 628 630 631 632 634
4663 634 636 637 639 640 641 642 644 645 646 647 648 650 651 653 654 656 658 660 661 663 664 665 666 667 668 669 671 673 675 677 679 680 682 683 684 686 687 689 691 692 694 695 696 697 698 699 700 701 702 704 705 707 709 711 713 715 716 718 720 721 723 724 726 727 729 730 732 734 736
4615 736 738 740 742 743 745 746 748 750 751 753 755 756 757 759 760 762 764 766 768 770 772 774 776 777 779 781 782 783 785 786 788 790 793 795 796 798 800 802 804 806 808 810 812 814 816 818 820 822 824 826 828 830 832 834 836 838 840 842 845 847 849 851 853 856 858 860 862 864 866
4567 866 868 870 873 875 876 878 880 882 884 886 889 891 893 895 898 900 902 904 907 909 911 914 917 919 922 924 927 928 930 932 934 937 939 941 944 946 949 952 954 957 959 961 964 967 970 972 975 977 980 983 985 988 991 993 996 999 1002 1004 1007 1009 1011 1013 1015 1018 1020 1023 1026 1028 1031
4519 1031 1034 1037 1040 1043 1046 1049 1052 1055 1057 1060 1063 1066 1069 1072 1075 1077 1080 1083 1086 1089 1092 1095 1098 1101 1104 1107 1110 1113 1116 1119 1122 1125 1129 1132 1135 1138 1141 1144 1148 1151 1154 1157 1161 1164 1167 1171 1174 1177 1180 1184 1187 1190 1193 1196 1199 1202 1204 1207 1210 1212 1215 1217 1220 1223 1227 1231 1234 1238
4472 1238 1242 1246 1250 1254 1257 1261 1265 1269 1273 1276 1280 1284 1287 1291 1295 1298 1302 1306 1309 1313 1316 1319 1323 1326 1330 1333 1337 1341 1345 1349 1353 1357 1361 1365 1368 1372 1376 1380 1384 1388 1392 1396 1400 1404 1408 1413 1417 1421 1425 1429 1433 1436 1440 1444 1447 1451 1455 1460 1465 1469 1474 1478 1483 1487 1492 1496 1501 1505
4425 1505 1510 1514 1519 1524 1528 1532 1537 1541 1545 1550 1554 1558 1562 1567 1572 1577 1582 1587 1592 1597 1601 1606 1610 1614 1619 1623 1628 1632 1637 1642 1647 1652 1656 1661 1666 1671 1675 1680 1686 1691 1696 1702 1707 1713 1719 1725 1730 1735 1741 1746 1751 1757 1762 1767 1773 1778 1784 1789 1795 1800 1806 1811 1816 1822 1827 1833 1839 1845
4378A845NOOONOOOOOOOPOOPPOPOPPPOPPPPPPOPOPPPPPPOQPPPQQQQQPQPQQQQQRQRQRQRRRRR
4330B330RJ0RRJ0RRJ0RRJ0RJ0RJ0J0J0J0J0J0J1J1J1J1J1J1J1J2J1J2J1J2J2J2J2J2J2J3J2
4303B741J2J3J3J2J3J3J4J3J3J3J4J4J4J5J4J5J6J4J5J5J4J5J5J6J5J5J6J5J5J6J6J6J6J6
4280C232J6J7J6J7J7J7J8J7J8J8J8J8J8J9J9J8J9J9J9J8J9J9K0J9K0K0K1K0K1K0K0K1K0K0
4256C868K1K0K1K0K1K1K1K1K1K0K1K0K0K1K0K0K1K0K0K1K0K2K1K1K1K0K1K0K1K0K0J9K0K0
4233D565K0J9K0J9J9J9J9J8J9J8J9J7J8J7J8J8J7J8J8J7J8J8J7J8J7J7J8J7J6J7J7J7J8J7
4209E174J7J7J7J7J7J7J8J7J7J7J7J8J8J8J9J8J9J9J9J9K0K0K1K0K1K2K1K2K2K3K3K4K4K4
4185E836K4K5K5K5K6K7K6K8K7K9K9K9L0L0L0L1L1L2L2L3L3L5L4L6L6L7L7L8L8M0M0M1M2M2
$$ plain form
4378 1845 1850 1856 1862 1868 1873 1879 1885 1891 1897 1903 1909 1915 1922 1928 1934 1941 1948 1954 1961 1967 1974 1981 1988 1994 2001 2008 2015 2022 2029 2036 2042 2049 2055 2062 2069 2076 2083 2090 2097 2103 2111 2118 2125 2132 2140 2148 2156 2164 2172 2179 2187 2194 2202 2210 2218 2226 2234 2243 2251 2260 2268 2277 2285 2294 2303 2312 2321 2330
4330 2330 2339 2349 2358 2367 2377 2386 2395 2405 2414 2423 2433 2442 2452 2461 2471 2481 2491 2501 2511 2521 2532 2543 2554 2565 2576 2587 2598 2610 2621 2633 2644 2656 2668 2680 2692 2704 2716 2729 2741
4303 2741 2753 2766 2779 2791 2804 2817 2831 2844 2857 2870 2884 2898 2912 2927 2941 2956 2972 2986 3001 3016 3030 3045 3060 3076 3091 3106 3122 3137 3152 3168 3184 3200 3216 3232
4280 3232 3248 3265 3281 3298 3315 3332 3350 3367 3385 3403 3421 3439 3457 3476 3495 3513 3532 3551 3570 3588 3607 3626 3646 3665 3685 3705 3726 3746 3767 3787 3807 3828 3848 3868
4256 3868 3889 3909 3930 3950 3971 3992 4013 4034 4055 4075 4096 4116 4136 4157 4177 4197 4218 4238 4258 4279 4299 4321 4342 4363 4384 4404 4425 4445 4466 4486 4506 4525 4545 4565
4233 4565 4585 4604 4624 4643 4662 4681 4700 4718 4737 4755 4774 4791 4809 4826 4844 4862 4879 4897 4915 4932 4950 4968 4985 5003 5020 5037 5055 5072 5088 5105 5122 5139 5157 5174
4209 5174 5191 5208 5225 5242 5259 5276 5294 5311 5328 5345 5362 5380 5398 5416 5435 5453 5472 5491 5510 5529 5549 5569 5590 5610 5631 5653 5674 5696 5718 5741 5764 5788 5812 5836
4185 5836 5860 5885 5910 5935 5961 5988 6014 6042 6069 6098 6127 6156 6186 6216 6246 6277 6308 6340 6372 6405 6438 6473 6507 6543 6579 6616 6653 6691 6729 6769 6809 6850 6892 6934
4162F934M3M3M4M4M5M6M6M7M8M9M9N0N2N2N4N4N5N5N7N7N8N9N9O1O1O2O3O4O5O6O8O9O9P1
4138H819P1P3P3P5P6P7P8P9Q0Q1Q2Q4Q4Q6Q8Q9R0R2R3R4R6R7R8R9J01J03J04J05J07J08J09
4117A1591J11J13J15J16J18J19J21J23J25J26J27J29J31J33J35J36J39J41J43J45J46J49J50
4101A4582J52J54J55J58J60J62J64J67J68J70J73J75J77J79J81J83J85J88J89J91J93J95J97
4085A8598J99K01K03K05K07K08K11K13K15K16K18K19K21K23K24K25K27K28K29K30K31K33K33
4069B3617K34K35K35K35K36K35K35K35K35K34K34K33K32K30K29K27K26K24K22K19K16K14K11
4053B8883K07K04K00J97J92J88J84J79J74J68J63J57J51J46J39J33J26J19J12J04R7R0Q2P4
4036C2469O6N9N0M2L3K5J6Pjj0j8k6l5m4n3o1o9p7q5r3j01j08j16j23j31j38j45j51j58j65
$$ plain form
4162 6934 6977 7020 7064 7108 7153 7199 7245 7292 7340 7389 7438 7488 7540 7592 7646 7700 7755 7810 7867 7924 7982 8041 8100 8161 8222 8284 8347 8411 8476 8542 8610 8679 8748 8819
4138 8819 8890 8963 9036 9111 9187 9264 9342 9421 9501 9582 9664 9748 9832 9918 10006 10095 10185 10277 10370 10464 10560 10657 10755 10854 10955 11058 11162 11267 11374 11482 11591
4117 11591 11702 11815 11930 12046 12164 12283 12404 12527 12652 12778 12905 13034 13165 13298 13433 13569 13708 13849 13992 14137 14283 14432 14582
4101 14582 14734 14888 15043 15201 15361 15523 15687 15854 16022 16192 16365 16540 16717 16896 17077 17260 17445 17633 17822 18013 18206 18401 18598
4085 18598 18797 18998 19201 19406 19613 19821 20032 20245 20460 20676 20894 21113 21334 21557 21781 22006 22233 22461 22690 22920 23151 23384 23617
4069 23617 23851 24086 24321 24556 24792 25027 25262 25497 25732 25966 26200 26433 26665 26895 27124 27351 27577 27801 28023 28242 28458 28672 28883
4053 28883 29090 29294 29494 29691 29883 30071 30255 30434 30608 30776 30939 31096 31247 31393 31532 31665 31791 31910 32022 32126 32223 32313 32395 32469
4036 32469 32535 32594 32644 32686 32719 32744 32760 32767 32766 32756 32738 32712 32677 32633 32580 32519 32450 32373 32288 32195 32094 31986 31870 31747 31616 31478 31333 31182 31024 30859
4016C0859j70j76j82j88j92j98k02k06k11k15k18k23k25k28k32k34k36k39k41k43k44k46k46
4000B5864k48k48k50k50k50k50k50k50k49k49k49k48k47k46k45k45k43k42k40k39k37k36k34
3984B0219k33k30k29k27k24k22k20k18k17k14k12k09k08k05k02k01j98j96j94j91j90j87j85
3968A5407j83j81j78j75j73j71j69j66j65j62j60j59j56j54j53j50j48j45j44j41j40j39j36
3952A1759j35j33j30j29j27j25j24j21j20j18j17j14j14j12j11j09j07j06j05j02j01j00r8
3936I101r6r6r4r3r2r0q9q8q7q5q3q3q1q1p9p9p7p6p6p4p3p2p1p0o9o8o8o6o6o4o4o3o2o1
3912F465o0o0n8n8n7n6n6n5n5n4n3n2n2n1n1n0m9m8m7m7m5m5m5m4m4m4m3m3m2m2m1m0m0l9
3889D799l8l9l7l8l6l6l6l5l5l5l5l5l4l3l3l3l2l2l2l1l1l0l1l0k9l0l0k8k9k8k7k7k7k6
$$ plain form
4016 30859 30689 30513 30331 30143 29951 29753 29551 29345 29134 28919 28701 28478 28253 28025 27793 27559 27323 27084 26843 26600 26356 26110 25864
4000 25864 25616 25368 25118 24868 24618 24368 24118 23868 23619 23370 23121 22873 22626 22380 22135 21890 21647 21405 21165 20926 20689 20453 20219
3984 20219 19986 19756 19527 19300 19076 18854 18634 18416 18199 17985 17773 17564 17356 17151 16949 16748 16550 16354 16160 15969 15779 15592 15407
3968 15407 15224 15043 14865 14690 14517 14346 14177 14011 13846 13684 13524 13365 13209 13055 12902 12752 12604 12459 12315 12174 12034 11895 11759
3952 11759 11624 11491 11361 11232 11105 10980 10856 10735 10615 10497 10380 10266 10152 10040 9929 9820 9713 9607 9502 9400 9299 9199 9101
3936 9101 9005 8909 8815 8722 8630 8540 8451 8363 8276 8191 8108 8025 7944 7863 7784 7705 7628 7552 7476 7402 7329 7257 7186 7116 7047 6979 6911 6845 6779 6715 6651 6588 6526 6465
3912 6465 6405 6345 6287 6229 6172 6116 6060 6005 5950 5896 5843 5791 5739 5688 5637 5587 5538 5490 5443 5396 5351 5306 5261 5217 5173 5129 5086 5043 5001 4959 4918 4878 4838 4799
3889 4799 4761 4722 4685 4647 4611 4575 4539 4504 4469 4434 4399 4364 4330 4297 4264 4231 4199 4167 4135 4104 4073 4043 4012 3982 3953 3923 3893 3865 3836 3808 3781 3754 3727 3701
3865C701k6k6k6k6k6k5k5k5k5k4k3k4k4k4k3k4k3k2k3k2k2k2k2k1k1k2k1k2k1k1k0k0k0j9
3841B921k0j9j9j9j9j8j9j8j8j8j8j8j7j8j8j7j6j7j7j7j7j6j7j7j6j7j6j6j6j6j5j6j5j5
3818B336j5j5j4j5j4j4j5j4j4j3j4j4j3j3j3j4j3j3j3j3j3j2j3j3j2j3j2j2j2j2j1j2j2j1
3794A890j2j1j1j1j1j2j1j1j1j0j1j0j0j0j0j1j0j0j1j0j0rj0j0j0rrrrrj0rrrrrrrrqqqq
3764A468qqqqrqqqpqqppqpqqppqppoppppppppppopppopopoopnoooonoonnnnoooonomnnnon
3717A020noonnonnnonnnmmnmnmmmmmnmmmmmmmmmmnmmnmmnmmlmmlmmmmmmmllmlmllmlmllll
3670G37mlmlmlllllkllllmllllllllllllllllllklklkkllklklkklkkklkllklkkkkkkklklk
3622E49lkkkkklkkkkklkkkkkkkkjkjkjkkkkkkkkkkkklkjkkkkkjkkjkkjjkjjkkkkjkjkjjkj
$$ plain form
3865 3701 3675 3649 3623 3597 3571 3546 3521 3496 3471 3447 3424 3400 3376 3352 3329 3305 3282 3260 3237 3215 3193 3171 3149 3128 3107 3085 3064 3042 3021 3000 2980 2960 2940 2921
3841 2921 2901 2882 2863 2844 2825 2807 2788 2770 2752 2734 2716 2698 2681 2663 2645 2628 2612 2595 2578 2561 2544 2528 2511 2494 2478 2461 2445 2429 2413 2397 2382 2366 2351 2336
3818 2336 2321 2306 2292 2277 2263 2249 2234 2220 2206 2193 2179 2165 2152 2139 2126 2112 2099 2086 2073 2060 2047 2035 2022 2009 1997 1984 1972 1960 1948 1936 1925 1913 1901 1890
3794 1890 1878 1867 1856 1845 1834 1822 1811 1800 1789 1779 1768 1758 1748 1738 1728 1717 1707 1697 1686 1676 1666 1657 1647 1637 1627 1618 1609 1600 1591 1582 1572 1563 1554 1545 1536 1527 1518 1509 1500 1492 1484 1476 1468
3764 1468 1460 1452 1444 1436 1427 1419 1411 1403 1396 1388 1380 1373 1366 1358 1351 1343 1335 1328 1321 1313 1306 1299 1293 1286 1279 1272 1265 1258 1251 1244 1237 1230 1223 1217 1210 1203 1196 1190 1183 1177 1170 1164 1158 1151 1146 1140 1134 1128 1122 1117 1111 1105 1100 1095 1090 1085 1079 1073 1067 1061 1056 1050 1046 1041 1036 1031 1025 1020
3717 1020 1015 1009 1003 998 993 987 982 977 972 966 961 956 951 947 943 938 934 929 925 921 917 913 909 904 900 896 892 888 884 880 876 872 868 864 859 855 851 846 842 838 833 829 825 822 818 814 811 807 803 799 795 791 787 783 780 777 773 770 766 763 760 756 753 749 746 743 740 737
3670 737 733 730 726 723 719 716 713 710 707 704 702 699 696 693 690 686 683 680 677 674 671 668 665 662 659 656 653 650 647 644 641 638 635 632 630 627 625 622 620 618 615 612 610 607 605 602 600 598 595 593 591 589 586 584 581 578 576 573 571 569 567 565 563 561 559 556 554 551 549
3622 549 546 544 542 540 538 536 533 531 529 527 525 523 520 518 516 514 512 510 508 506 504 503 501 500 498 497 495 493 491 489 487 485 483 481 479 477 475 473 470 468 467 465 463 461 459 457 456 454 452 451 449 447 446 445 443 442 441 439 437 435 433 432 430 429 427 426 425 423 422
3574D22jkjjkkkkkkkjkjjkkkkkkkkjjkjkjjjjjjjkjkjjjkjjjjkjkjkjjjjjjk%jj%jjjjjkk
3527C27jjjjj%jjjjjjkjkjkjjjjjjjj%jjjjjjjjjj%kjjjkjkjjjj%jjjjjjjj%j%jj%jjjj%j
3479B60j%jjjjkjkj%jjjj%jj%jj%%%%%%jjjjjjj%jj%jjjjj%jj%j%jjjjj%jj%%j%jj%jjjjj
3431B09jjjj%jj%j%jjjjj%j%%j%%jjj%jj%j%j%j%j%%%j%%%j%jj%%%j%j%jj%jj%j%j%jj%j%
3383A71j%j%j%j%jj%jj%j%%%%%j%j%jj%jj%%j%jj%jj%j%j%%%j%%%%j%%j%j%j%%%%j%j%j%%
3335A41j%j%%j%%j%%%j%%%%%%jjjjj%%%%%j%j%j%%%j%%j%j%j%j%j%%j%j%jj%j%j%j%%j%%%
3287A14%%%%%j%%%j%%%j%%%j%%%%%j%j%j%%%%%%J%j%%j%%%j%%%j%jj%j%j%%j%%%j%%%%j%%
3239I7j%%%j%%j%%%j%%j%%%%j%%%%%%%%j%%%%j%%%j%%%%%%%j%%jj%j%%%J%%%jj%j%%%%%%%
$$ plain form
3574 422 421 419 418 417 415 413 411 409 407 405 403 402 400 399 398 396 394 392 390 388 386 384 382 381 380 378 377 375 374 373 372 371 370 369 368 366 365 363 362 361 360 358 357 356 355 354 352 351 349 348 346 345 344 343 342 341 340 338 338 337 336 336 335 334 333 332 331 329 327
3527 327 326 325 324 323 322 322 321 320 319 318 317 316 314 313 311 310 308 307 306 305 304 303 302 301 300 300 299 298 297 296 295 294 293 292 291 290 290 288 287 286 285 283 282 280 279 278 277 276 276 275 274 273 272 271 270 269 268 268 267 267 266 265 265 264 263 262 261 261 260
3479 260 259 259 258 257 256 255 253 252 250 249 249 248 247 246 245 245 244 243 243 242 241 241 241 241 241 241 241 240 239 238 237 236 235 234 234 233 232 232 231 230 229 228 227 227 226 225 225 224 224 223 222 221 220 219 219 218 217 217 217 216 216 215 214 214 213 212 211 210 209
3431 209 208 207 206 205 205 204 203 203 202 202 201 200 199 198 197 197 196 196 196 195 195 195 194 193 192 192 191 190 190 189 189 188 188 187 187 186 186 186 186 185 185 185 185 184 184 183 182 182 182 182 181 181 180 180 179 178 178 177 176 176 175 175 174 174 173 172 172 171 171
3383 171 170 170 169 169 168 168 167 167 166 165 165 164 163 163 162 162 162 162 162 162 161 161 160 160 159 158 158 157 156 156 156 155 155 154 153 153 152 151 151 150 150 149 149 149 149 148 148 148 148 148 147 147 147 146 146 145 145 144 144 144 144 144 143 143 142 142 141 141 141
3335 141 140 140 139 139 139 138 138 138 137 137 137 137 136 136 136 136 136 136 136 135 134 133 132 131 131 131 131 131 131 130 130 129 129 128 128 128 128 127 127 127 126 126 125 125 124 124 123 123 122 122 122 121 121 120 120 119 118 118 117 117 116 116 115 115 115 114 114 114 114
3287 114 114 114 114 114 114 113 113 113 113 112 112 112 112 111 111 111 111 110 110 110 110 110 110 109 109 108 108 107 107 107 107 107 107 107 108 108 107 107 107 106 106 106 106 105 105 105 105 104 104 103 102 102 101 101 100 100 100 99 99 99 99 98 98 98 98 98 97 97 97
3239 97 96 96 96 96 95 95 95 94 94 94 94 93 93 93 92 92 92 92 92 91 91 91 91 91 91 91 91 91 90 90 90 90 90 89 89 89 89 88 88 88 88 88 88 88 88 87 87 87 86 85 85 84 84 84 84 85 85 85 85 84 83 83 82 82 82 82 82 82 82 82
3191H2%j%%j%%j%%j%j%%j%%%j%%%j%%%%%%%j%%j%J%%%%j%%j%%J%%%%%%%%j%j%j%j%%%%%%%
3142F8%%%%j%%%%%%%%%%%%j%%j%%%j%%%J%j%j%%%%%%j%%j%j%%j%%%%%%%%%%%j%%%%%%%%%%
3094E8%%%j%%%%%%j%%j%%%j%%%%j%%Jj%%j%%jJ%%%%%j%%%%%%%%%j%j%%%%%J%%Jj%%%%%J%%
3045E1j%%j%%%%jj%%j%%%%j%%%%%%%%%%%J%%%%j%%%%%%%%%%%%%%%%j%%%%%%%j%j%j%j%%%%
2997D0%%%%%%%%%%%%%%%%%%%%j%%%%%%j%j%%%j%%%jJj%%%%J%%J%J%%%%%%%j%%j%%j%%%%%%
2948C5%j%%j%j%%%J%%%J%%%%%jj%%%%%%%%%J%%%%j%%%%%%%J%%j%%%%j%j%%%%%%%%%%%%j%%
2900B9%%%%%%%%%%%%J%%%J%%%Jj%%%j%%jj%j%%j%%%%%%J%%J%%%%%j%%%J%%j%%%%%%%%j%%j
2851B5%%%%%J%J%j%%j%%%%%%j%%j%%%J%%J%%%j%%%j%%%%%%%%%%%%J%%%%%%j%j%%J%%%%%j%
$$ plain form
3191 82 82 81 81 81 80 80 80 79 79 79 78 78 77 77 77 76 76 76 76 75 75 75 75 74 74 74 74 74 74 74 74 73 73 73 72 72 73 73 73 73 73 72 72 72 71 71 71 72 72 72 72 72 72 72 72 72 71 71 70 70 69 69 68 68 68 68 68 68 68 68
3142 68 68 68 68 68 67 67 67 67 67 67 67 67 67 67 67 67 67 66 66 66 65 65 65 65 64 64 64 64 65 65 64 64 63 63 63 63 63 63 63 62 62 62 61 61 60 60 60 59 59 59 59 59 59 59 59 59 59 59 59 58 58 58 58 58 58 58 58 58 58 58
3094 58 58 58 58 57 57 57 57 57 57 57 56 56 56 55 55 55 55 54 54 54 54 54 53 53 53 54 53 53 53 52 52 52 51 52 52 52 52 52 52 51 51 51 51 51 51 51 51 51 51 50 50 49 49 49 49 49 49 50 50 50 51 50 50 50 50 50 50 51 51 51
3045 51 50 50 50 49 49 49 49 49 48 47 47 47 46 46 46 46 46 45 45 45 45 45 45 45 45 45 45 45 45 46 46 46 46 46 45 45 45 45 45 45 45 45 45 45 45 45 45 45 45 45 45 44 44 44 44 44 44 44 44 43 43 42 42 41 41 40 40 40 40 40
2997 40 40 40 40 40 40 40 40 40 40 40 40 40 40 40 40 40 40 40 40 40 39 39 39 39 39 39 39 38 38 37 37 37 37 36 36 36 36 35 36 35 35 35 35 35 36 36 36 37 37 38 38 38 38 38 38 38 38 37 37 37 36 36 36 35 35 35 35 35 35 35
2948 35 35 34 34 34 33 33 32 32 32 32 33 33 33 33 34 34 34 34 34 34 33 32 32 32 32 32 32 32 32 32 32 33 33 33 33 33 32 32 32 32 32 32 32 32 33 33 33 32 32 32 32 32 31 31 30 30 30 30 30 30 30 30 30 30 30 30 30 29 29 29
2900 29 29 29 29 29 29 29 29 29 29 29 29 29 30 30 30 30 31 31 31 31 32 31 31 31 31 30 30 30 29 28 28 27 27 27 26 26 26 26 26 26 26 27 27 27 28 28 28 28 28 28 27 27 27 27 28 28 28 27 27 27 27 27 27 27 27 27 26 26 26 25
2851 25 25 25 25 25 25 26 26 27 27 26 26 26 25 25 25 25 25 25 25 24 24 24 23 23 23 23 24 24 24 25 25 25 25 24 24 24 24 23 23 23 23 23 23 23 23 23 23 23 23 23 24 24 24 24 24 24 24 23 23 22 22 22 23 23 23 23 23 23 22 22
2802B2%j%%%%%%%J%%%%%%%%%%%%%%%%%%%j%%%%%%j%%%j%%%j%%%j%%j%%%j%J%%J%%%%%%%J%
2754A8J%%JJ%%%%%%j%j%%j%%%%J%j%%%%j%%%J%%%%%%j%%%%%%%j%j%j%%%%%%J%J%J%%%%%%%
2705A7%%%J%%%%%%%j%%%j%%%%J%%%%%jjj%%%J%J%J%%J%j%%j%%%%%%%%%%j%%%%%%%%j%j%%j
2657A2%%%%%%%%%%%%%%%%%%%j%%%%%J%%J%%%%%%%%%J%%j%J%%%%%j%%%%%%%j%%%%%%%%J%J%
2608A4%j%%j%jj%%j%%%%%%J%%J%%j%%%%%%%%%J%%J%%%%%j%%%%j%%%%J%%%%%j%%%%%%%j%%%
2560I%%%J%%%%%%%J%%%%%%%j%%%%%%%Jj%%jj%j%%%%%j%%%%%%%%%%J%%%J%%%%%%jJ%%%%%J%
2510I%%%%%%%%j%%%%%%%%%%%%%%%%%%%%j%j%%%%%%%J%%j%j%%%%%%J%J%J%%%%%J%%%j%%%%%
2461H%%%%%%%j%%%%%%J%%%%J%%j%%%%%%%%%%%%j%%J%%%%j%%%j%%%%J%j%%%%%Jj%j%%%%%%%
$$ plain form
2802 22 22 21 21 21 21 21 21 21 21 22 22 22 22 22 22 22 22 22 22 22 22 22 22 22 22 22 22 22 22 21 21 21 21 21 21 21 20 20 20 20 19 19 19 19 18 18 18 18 17 17 17 16 16 16 16 15 15 16 16 16 17 17 17 17 17 17 17 17 18 18
2754 18 19 19 19 20 21 21 21 21 21 21 21 20 20 19 19 19 18 18 18 18 18 19 19 18 18 18 18 18 17 17 17 17 18 18 18 18 18 18 18 17 17 17 17 17 17 17 17 16 16 15 15 14 14 14 14 14 14 14 15 15 16 16 17 17 17 17 17 17 17 17
2705 17 17 17 17 18 18 18 18 18 18 18 18 17 17 17 17 16 16 16 16 16 17 17 17 17 17 17 16 15 14 14 14 14 15 15 16 16 17 17 17 18 18 17 17 17 16 16 16 16 16 16 16 16 16 16 16 15 15 15 15 15 15 15 15 15 14 14 13 13 13 12
2657 12 12 12 12 12 12 12 12 12 12 12 12 12 12 12 12 12 12 12 12 11 11 11 11 11 11 12 12 12 13 13 13 13 13 13 13 13 13 13 14 14 14 13 13 14 14 14 14 14 14 13 13 13 13 13 13 13 13 12 12 12 12 12 12 12 12 12 13 13 14 14
2608 14 14 13 13 13 12 12 11 10 10 10 9 9 9 9 9 9 9 10 10 10 11 11 11 10 10 10 10 10 10 10 10 10 10 11 11 11 12 12 12 12 12 12 11 11 11 11 11 10 10 10 10 10 11 11 11 11 11 11 10 10 10 10 10 10 10 10 9 9 9 9
2560 9 9 9 9 10 10 10 10 10 10 10 10 11 11 11 11 11 11 11 11 10 10 10 10 10 10 10 10 11 10 10 10 9 8 8 7 7 7 7 7 7 6 6 6 6 6 6 6 6 6 6 6 7 7 7 7 8 8 8 8 8 8 8 7 8 8 8 8 8 8 9 9
2510 9 9 9 9 9 9 9 9 9 8 8 8 8 8 8 8 8 8 8 8 8 8 8 8 8 8 8 8 8 8 7 7 6 6 6 6 6 6 6 6 7 7 7 6 6 5 5 5 5 5 5 5 6 6 7 7 8 8 8 8 8 8 9 9 9 9 8 8 8 8 8 8
2461 8 8 8 8 8 8 8 8 7 7 7 7 7 7 7 8 8 8 8 8 9 9 9 8 8 8 8 8 8 8 8 8 8 8 8 8 7 7 7 8 8 8 8 8 7 7 7 7 6 6 6 6 6 7 7 6 6 6 6 6 6 7 6 6 5 5 5 5 5 5 5 5
2412E%%%J%%J%%J%%%j%%%%%j%%%%%%%%%%j%%j%%%%J%%%%%%%%%J%%j%%%j%%%%J%%%%J%%%%%
2363FJ%J%%%%%%%j%%%%j%j%%%%%%%%%J%%J%%%%%j%j%%%J%%%%j%%%%%J%%j%%%%%%%%%%%%J%
2313F%%J%j%j%%%%%%%%%%%%%%j%%%%%%%%%j%J%%%%%%%%%%%%%%%j%%%%%%%%%%%J%%%%J%%%%
2264Ej%%j%%%%J%%J%J%%%%%%%%%%%%%%%%%%%%%%%j%j%%j%%%%J%%Jj%%%%%%J%%%%%%%j%%J%
2215E%%%%%Jj%%%%%%%%%%%%%%J%%%%%%%j%%j%%%%%%j%%%%%J%%J%%J%%%%%%%%%%%%%Jj%%%%
2166F%%jj%jj%J%%J%%J%%%%%%%j%%%%%%%%%%%%%%%%%%%%J%%%%%%%j%j%%%J%%J%%j%%%j%%%
2116Cj%%%%%%%%%J%%%j%J%%%%%%%%J%%%J%%J%%%j%%J%%%%%j%j%%%%%%%%j%%j%J%%%%J%%%J
2067E%%j%%%%j%%%%%%%%%%%j%J%%J%j%%%%%%%%%%%%%j%%%%%%J%%%%%%%%Jj%%%%%%%%%J%%%
$$ plain form
2412 5 5 5 5 6 6 6 7 7 7 8 8 8 8 7 7 7 7 7 7 6 6 6 6 6 6 6 6 6 6 6 5 5 5 4 4 4 4 4 5 5 5 5 5 5 5 5 5 5 6 6 6 5 5 5 5 4 4 4 4 4 5 5 5 5 5 6 6 6 6 6 6
2363 6 7 7 8 8 8 8 8 8 8 8 7 7 7 7 7 6 6 5 5 5 5 5 5 5 5 5 5 6 6 6 7 7 7 7 7 7 6 6 5 5 5 5 6 6 6 6 6 5 5 5 5 5 5 6 6 6 5 5 5 5 5 5 5 5 5 5 5 5 5 6 6
2313 6 6 6 7 7 6 6 5 5 5 5 5 5 5 5 5 5 5 5 5 5 5 4 4 4 4 4 4 4 4 4 4 3 3 4 4 4 4 4 4 4 4 4 4 4 4 4 4 4 4 3 3 3 3 3 3 3 3 3 3 3 3 4 4 4 4 4 5 5 5 5 5
2264 5 4 4 4 3 3 3 3 3 4 4 4 5 5 6 6 6 6 6 6 6 6 6 6 6 6 6 6 6 6 6 6 6 6 6 6 6 6 5 5 4 4 4 3 3 3 3 3 4 4 4 5 4 4 4 4 4 4 4 5 5 5 5 5 5 5 5 4 4 4 5 5
2215 5 5 5 5 5 5 6 5 5 5 5 5 5 5 5 5 5 5 5 5 5 5 6 6 6 6 6 6 6 6 5 5 5 4 4 4 4 4 4 4 3 3 3 3 3 3 4 4 4 5 5 5 6 6 6 6 6 6 6 6 6 6 6 6 6 6 7 6 6 6 6 6
2166 6 6 6 5 4 4 3 2 2 3 3 3 4 4 4 5 5 5 5 5 5 5 5 4 4 4 4 4 4 4 4 4 4 4 4 4 4 4 4 4 4 4 4 4 5 5 5 5 5 5 5 5 4 4 3 3 3 3 4 4 4 5 5 5 4 4 4 4 3 3 3 3
2116 3 2 2 2 2 2 2 2 2 2 2 3 3 3 3 2 2 3 3 3 3 3 3 3 3 3 4 4 4 4 5 5 5 6 6 6 6 5 5 5 6 6 6 6 6 6 5 5 4 4 4 4 4 4 4 4 4 3 3 3 2 2 3 3 3 3 3 4 4 4 4 5
2067 5 5 5 4 4 4 4 4 3 3 3 3 3 3 3 3 3 3 3 3 2 2 3 3 3 4 4 3 3 3 3 3 3 3 3 3 3 3 3 3 3 2 2 2 2 2 2 2 3 3 3 3 3 3 3 3 3 4 3 3 3 3 3 3 3 3 3 3 4 4 4 4
2018D%%%%%%%%J%%%%J%%%J%J%%%%%j%j%j%%j%j%%%j%%%%J%%%%J%%%j%%%%%%%%%j%%J%%%%%
1969CJ%%%%J%%j%%%%j%J%%%%%%%%%%%%J%J%%Jj%%j%j%%%%J%%%%%%jjj%j%J%%%%JJJJ%%%j%
1920E%j%J%%j%%%%j%%%j%%%J%J%%%%%%%%%%J%%%%%j%%J%%%%%%%%%%%%%%%j%%%j%%%%%j%%%
1870Bj%%%%%J%%%J%%%J%%%J%J%%%%%%j%%%%J%%%jj%j%%%J%J%J%%%%%j%%%%%j%%%%%%%%%JJ
1821F%J%%%jj%%j%%J%%%%%J%%J%%%j%%%%%%j%%%j%%J%%J%%%j%%j%%%j%%%j%%J%%J%%j%%J%
1772D%J%J%J%%%%%%%%j%%%j%%%%%%j%%JjJ%%J%%%%%%j%%%%%%J%%J%%%%%%%%J%j%%j%%%%%%
1723F%j%%J%J%%%%%j%j%%%%J%J%%J%j%%j%j%jj%%J%%%%%J%J%%%%%%%%%J%%%%%%%%%J%%%j%
1673Gj%%j%%%%%%%%%%%%%%%%%%%%J%%J%%j%%%%%%%%%J%%%%%jJ%%J%%%%%%%%%J%%%%%%%%j%
$$ plain form
2018 4 4 4 4 4 4 4 4 4 5 5 5 5 5 6 6 6 6 7 7 8 8 8 8 8 8 7 7 6 6 5 5 5 4 4 3 3 3 3 2 2 2 2 2 3 3 3 3 3 4 4 4 4 3 3 3 3 3 3 3 3 3 3 2 2 2 3 3 3 3 3 3
1969 3 4 4 4 4 4 5 5 5 4 4 4 4 4 3 3 4 4 4 4 4 4 4 4 4 4 4 4 4 5 5 6 6 6 7 6 6 6 5 5 4 4 4 4 4 5 5 5 5 5 5 5 4 3 2 2 1 1 2 2 2 2 2 3 4 5 6 6 6 6 5 5
1920 5 5 4 4 5 5 5 4 4 4 4 4 3 3 3 3 2 2 2 2 3 3 4 4 4 4 4 4 4 4 4 4 4 5 5 5 5 5 5 4 4 4 5 5 5 5 5 5 5 5 5 5 5 5 5 5 5 5 4 4 4 4 3 3 3 3 3 3 2 2 2 2
1870 2 1 1 1 1 1 1 2 2 2 2 3 3 3 3 4 4 4 4 5 5 6 6 6 6 6 6 6 5 5 5 5 5 6 6 6 6 5 4 4 3 3 3 3 4 4 5 5 6 6 6 6 6 6 5 5 5 5 5 5 4 4 4 4 4 4 4 4 4 4 5 6
1821 6 6 7 7 7 7 6 5 5 5 4 4 4 5 5 5 5 5 5 6 6 6 7 7 7 7 6 6 6 6 6 6 6 5 5 5 5 4 4 4 5 5 5 6 6 6 6 5 5 5 4 4 4 4 3 3 3 3 2 2 2 3 3 3 4 4 4 3 3 3 4 4
1772 4 4 5 5 6 6 7 7 7 7 7 7 7 7 7 6 6 6 6 5 5 5 5 5 5 5 4 4 4 5 4 5 5 5 6 6 6 6 6 6 6 5 5 5 5 5 5 5 6 6 6 7 7 7 7 7 7 7 7 7 8 8 7 7 7 6 6 6 6 6 6 6
1723 6 6 5 5 5 6 6 7 7 7 7 7 7 6 6 5 5 5 5 5 6 6 7 7 7 8 8 7 7 7 6 6 5 5 4 3 3 3 4 4 4 4 4 4 5 5 6 6 6 6 6 6 6 6 6 6 7 7 7 7 7 7 7 7 7 7 8 8 8 8 7 7
1673 7 6 6 6 5 5 5 5 5 5 5 5 5 5 5 5 5 5 5 5 5 5 5 5 5 6 6 6 7 7 7 6 6 6 6 6 6 6 6 6 6 7 7 7 7 7 7 6 7 7 7 8 8 8 8 8 8 8 8 8 8 9 9 9 9 9 9 9 9 9 8 8
1624H%j%%%j%%%J%%%%%%%j%%%J%%%%%%J%%%%j%j%%%%%%%%%%%%J%J%J%%%%%%%%%%%J%%j%j%
1575H%j%j%%J%J%J%%%%%%%%j%%%j%%J%J%%%%%%%j%%%J%%%%%%%%j%j%%%%%J%J%J%%J%%%j%%
1526A0j%jj%%%%%%%Jj%%%j%%%%J%%%%%%%%%%%%%%%%%%%%J%%%%J%%%%%%%%%J%%%j%%%%%%%%
1477Ij%%%%%%%%J%%%J%j%%jJ%%J%%%%j%%j%%%%%J%%J%%J%%%%%J%%%%Jj%%%%j%%%%%%%%%%j
1428A0%%%%%%%%%%%%%%%J%%%%%%%%%%%j%%%%%%%%%%j%%%%%%%%%%%%%J%%%%%%%j%%j%%%%%J
1379I%%%%J%%J%%%j%j%%%%%%%%%%jJ%%%%%%%J%%J%J%%j%%JJ%J%%%%%j%%%%%%%%%%%%j%%%%
1330A2%j%%%%%%%%%%%%J%%%%%j%%%%%%%j%%%%%%%%%%%%%%%J%%%%%%%%%%J%J%J%%%j%%%%%%
1281A3%%%jJ%%%%%%%%j%%%%%%%%%%%jJ%%%J%%%%%%%%%%%%%%%%%%J%%%%J%%%%%%%%%%j%%j%
$$ plain form
1624 8 8 7 7 7 7 6 6 6 6 7 7 7 7 7 7 7 7 6 6 6 6 7 7 7 7 7 7 7 8 8 8 8 8 7 7 6 6 6 6 6 6 6 6 6 6 6 6 6 7 7 8 8 9 9 9 9 9 9 9 9 9 9 9 9 10 10 10 9 9 8 8
1575 8 8 7 7 6 6 6 7 7 8 8 9 9 9 9 9 9 9 9 9 8 8 8 8 7 7 7 8 8 9 9 9 9 9 9 9 9 8 8 8 8 9 9 9 9 9 9 9 9 9 8 8 7 7 7 7 7 7 8 8 9 9 10 10 10 11 11 11 11 10 10 10
1526 10 9 9 8 7 7 7 7 7 7 7 7 8 7 7 7 7 6 6 6 6 6 7 7 7 7 7 7 7 7 7 7 7 7 7 7 7 7 7 7 7 7 7 8 8 8 8 8 9 9 9 9 9 9 9 9 9 9 10 10 10 10 9 9 9 9 9 9 9 9 9
1477 9 8 8 8 8 8 8 8 8 8 9 9 9 9 10 10 9 9 9 8 9 9 9 10 10 10 10 10 9 9 9 8 8 8 8 8 8 9 9 9 10 10 10 11 11 11 11 11 11 12 12 12 12 12 13 12 12 12 12 12 11 11 11 11 11 11 11 11 11 11 11 10
1428 10 10 10 10 10 10 10 10 10 10 10 10 10 10 10 10 11 11 11 11 11 11 11 11 11 11 11 11 10 10 10 10 10 10 10 10 10 10 10 9 9 9 9 9 9 9 9 9 9 9 9 9 9 10 10 10 10 10 10 10 10 9 9 9 8 8 8 8 8 8 9
1379 9 9 9 9 9 10 10 10 11 11 11 11 10 10 9 9 9 9 9 9 9 9 9 9 9 8 9 9 9 9 9 9 9 9 10 10 10 11 11 12 12 12 11 11 11 12 13 13 14 14 14 14 14 14 13 13 13 13 13 13 13 13 13 13 13 13 13 12 12 12 12 12
1330 12 12 11 11 11 11 11 11 11 11 11 11 11 11 11 12 12 12 12 12 12 11 11 11 11 11 11 11 11 10 10 10 10 10 10 10 10 10 10 10 10 10 10 10 10 11 11 11 11 11 11 11 11 11 11 11 12 12 13 13 14 14 14 14 13 13 13 13 13 13 13
1281 13 13 13 13 12 13 13 13 13 13 13 13 13 13 12 12 12 12 12 12 12 12 12 12 12 12 11 12 12 12 12 13 13 13 13 13 13 13 13 13 13 13 13 13 13 13 13 13 13 13 14 14 14 14 14 15 15 15 15 15 15 15 15 15 15 15 14 14 14 13 13
1233A3%%%J%J%%J%%%%j%%%J%%%%%%j%%%%%J%%%%%%%%%%%%%j%%%%j%%j%J%%J%%%J%%J%%j%%
1184A6%%j%%%J%j%%%%%J%%%%%%%%jJ%%%J%%%J%%%%%%%j%j%%%J%%%%%%j%j%%%%%%j%%%J%%J
1136A6%%%%%%%%%%%j%j%%%%%%%%%%J%%JJ%J%%%%%J%%j%%%j%%%%%%%%%%%%%%%%%%%%j%%j%%
1087A5J%J%%%J%%%j%%%%%%%%%J%%%J%%%j%%%%%%%%%%j%%%J%%J%%%%%%%%%%%%%%%%%%J%J%%
1039B1%%%j%%%%%%j%%%%%j%j%%%%%%J%%J%%%%%%j%%%%%%%%%J%%%jj%j%%%J%%%%%%%%J%%%%
990A8J%J%J%JJ%%%%j%%%%%j%%%j%%j%%%%%J%%J%%J%%%%%%j%%j%J%%%j%%%%j%J%%%%%%J%%%
941B1%%%%J%%J%%%%j%%j%%j%%%%%%%%%%%%%%%%J%J%%%%%%%J%J%%%%%%%%j%%%%%%%%%%%%%%
892B3%%%%J%%%%%J%%J%%%%J%%%%%%%%%j%j%j%%j%%%J%%%%j%%%%%%%%J%%%J%%J%%%%%j%%jJ
$$ plain form
1233 13 13 13 13 14 14 15 15 15 16 16 16 16 16 15 15 15 15 16 16 16 16 16 16 16 15 15 15 15 15 15 16 16 16 16 16 16 16 16 16 16 16 16 16 16 15 15 15 15 15 14 14 14 13 13 14 14 14 15 15 15 15 16 16 16 17 17 17 16 16 16
1184 16 16 16 15 15 15 15 16 16 15 15 15 15 15 15 16 16 16 16 16 16 16 16 16 15 16 16 16 16 17 17 17 17 18 18 18 18 18 18 18 18 17 17 16 16 16 16 17 17 17 17 17 17 17 16 16 15 15 15 15 15 15 15 14 14 14 14 15 15 15 16
1136 16 16 16 16 16 16 16 16 16 16 16 16 15 15 14 14 14 14 14 14 14 14 14 14 14 15 15 15 16 17 17 18 18 18 18 18 18 19 19 19 18 18 18 18 17 17 17 17 17 17 17 17 17 17 17 17 17 17 17 17 17 17 17 17 17 16 16 16 15 15 15
1087 15 16 16 17 17 17 17 18 18 18 18 17 17 17 17 17 17 17 17 17 17 18 18 18 18 19 19 19 19 18 18 18 18 18 18 18 18 18 18 18 17 17 17 17 18 18 18 19 19 19 19 19 19 19 19 19 19 19 19 19 19 19 19 19 19 19 20 20 21 21 21
1039 21 21 21 21 20 20 20 20 20 20 20 19 19 19 19 19 19 18 18 17 17 17 17 17 17 17 18 18 18 19 19 19 19 19 19 19 18 18 18 18 18 18 18 18 18 18 19 19 19 19 18 17 17 16 16 16 16 17 17 17 17 17 17 17 17 17 18 18 18 18 18
990 18 19 19 20 20 21 21 22 23 23 23 23 23 22 22 22 22 22 22 21 21 21 21 20 20 20 19 19 19 19 19 19 20 20 20 21 21 21 22 22 22 22 22 22 22 21 21 21 20 20 21 21 21 21 20 20 20 20 20 19 19 20 20 20 20 20 20 20 21 21 21 21
941 21 21 21 21 21 22 22 22 23 23 23 23 23 22 22 22 21 21 21 20 20 20 20 20 20 20 20 20 20 20 20 20 20 20 20 20 21 21 22 22 22 22 22 22 22 22 23 23 24 24 24 24 24 24 24 24 24 23 23 23 23 23 23 23 23 23 23 23 23 23 23 23
892 23 23 23 23 23 24 24 24 24 24 24 25 25 25 26 26 26 26 26 27 27 27 27 27 27 27 27 27 27 26 26 25 25 24 24 24 23 23 23 23 24 24 24 24 24 23 23 23 23 23 23 23 23 23 24 24 24 24 25 25 25 26 26 26 26 26 26 25 25 25 24 25
842B5%%%%J%%%J%J%J%%%%%%j%%jj%%jJ%%%J%%%%%%%%%%%%%%%%%j%j%%%%%%%%%%%%%J%%%%J
793B7j%%%%%j%%J%J%%%j%%%J%J%J%%J%%%j%%%%%%%%%J%%J%j%j%%%%%%%j%%j%%%%J%%%j%%%
744B7J%%%%%%%J%%%%%%%%%%%%%%%%%%%%%%%%%%Jj%J%j%%%%%J%J%%%%%j%%J%%J%J%%j%%%%j
695C1%j%%%%%%J%%%J%%%%%j%%%%%%J%%%%%J%%%%%J%%%%%%J%%%j%%J%%%%%j%J%%%%jj%%j%%
645C2%%%%%%j%%%%%%%%%%%J%%%%J%%J%%%%%j%%j%J%%J%%%%%%j%%%%%%%%J%%%J%%%%%%JJ%J
596C8%%%%%%j%%j%%%%J%%Jj%%j%j%j%%%%%%%%%%%%%JJJ%Jj%%%%j%%%%%%%%%%%%J%%%%J%%%
547C8%%%%%j%%j%%%%%%%%%%%%%%J%%%J%%%%Jj%%%J%%J%%%%j%j%%j%%%%%%J%%%J%%%%%%%%%
498C9%J%%%%%%%%%J%%%j%%j%%%%%%%%%%%%%%%%J%%%%J%%%%%%j%%%%%%J%%%J%%J%%jJ%%%%J
$$ plain form
842 25 25 25 25 25 26 26 26 26 27 27 28 28 29 29 29 29 29 29 29 28 28 28 27 26 26 26 25 26 26 26 26 27 27 27 27 27 27 27 27 27 27 27 27 27 27 27 27 27 27 26 26 25 25 25 25 25 25 25 25 25 25 25 25 25 25 26 26 26 26 26 27
793 27 26 26 26 26 26 26 25 25 25 26 26 27 27 27 27 26 26 26 26 27 27 28 28 29 29 29 30 30 30 30 29 29 29 29 29 29 29 29 29 29 30 30 30 31 31 30 30 29 29 29 29 29 29 29 29 28 28 28 27 27 27 27 27 28 28 28 28 27 27 27 27
744 27 28 28 28 28 28 28 28 28 29 29 29 29 29 29 29 29 29 29 29 29 29 29 29 29 29 29 29 29 29 29 29 29 29 29 29 30 29 29 30 30 29 29 29 29 29 29 30 30 31 31 31 31 31 31 30 30 30 31 31 31 32 32 33 33 33 32 32 32 32 32 31
695 31 31 30 30 30 30 30 30 30 31 31 31 31 32 32 32 32 32 32 31 31 31 31 31 31 31 32 32 32 32 32 32 33 33 33 33 33 33 34 34 34 34 34 34 34 35 35 35 35 34 34 34 35 35 35 35 35 35 34 34 35 35 35 35 35 34 33 33 33 32 32 32
645 32 32 32 32 32 32 32 31 31 31 31 31 31 31 31 31 31 31 31 32 32 32 32 32 33 33 33 34 34 34 34 34 34 33 33 33 32 32 33 33 33 34 34 34 34 34 34 34 33 33 33 33 33 33 33 33 33 34 34 34 34 35 35 35 35 35 35 35 36 37 37 38
596 38 38 38 38 38 38 38 37 37 37 36 36 36 36 36 37 37 37 38 37 37 37 36 36 35 35 34 34 34 34 34 34 34 34 34 34 34 34 34 34 35 36 37 37 38 37 37 37 37 37 36 36 36 36 36 36 36 36 36 36 36 36 36 37 37 37 37 37 38 38 38 38
547 38 38 38 38 38 38 37 37 37 36 36 36 36 36 36 36 36 36 36 36 36 36 36 36 37 37 37 37 38 38 38 38 38 39 38 38 38 38 39 39 39 40 40 40 40 40 39 39 38 38 38 37 37 37 37 37 37 37 38 38 38 38 39 39 39 39 39 39 39 39 39 39
498 39 39 40 40 40 40 40 40 40 40 40 40 41 41 41 41 40 40 40 39 39 39 39 39 39 39 39 39 39 39 39 39 39 39 39 39 40 40 40 40 40 41 41 41 41 41 41 41 40 40 40 40 40 40 40 41 41 41 41 42 42 42 43 43 43 42 43 43 43 43 43 44
448D4%J%%%%%j%%J%J%%j%%%%%%%%J%%%JJ%%jjj%%%%%%j%%%%%%%J%%%J%%%%%j%%%J%J%J%%%
399D8j%%%%%%%j%J%%%J%%%J%%j%%j%j%%%%%%J%J%%%J%%%%%%%%j%j%%j%%%jj%J%JJ%J%Jj%%
350D8j%%%%%%J%%%J%%j%j%jJ%%J%%%%J%%%J%J%J%%j%%%%%%%%%%%%%%J%%%%%%j%%%%J%J%Jj
301E3%%%j%j%%%%%%%%%%j%J%J%J%%J%%j%%%%%%%%jJ%%%%%%%%%j%%%%%J%%J%%J%%J%%%J%%%
251E7j%%j%%%%J%J%j%%%%%%%%%%%%%%%J%%%%%%%%%J%J%J%%%%%%%%%%%%%j%j%J%%%%%j%%%%
202E8Jj%J%%%%J%%%%%J%%%%%%%%%%%J%j%%%%%%%%j%%%j%J%%J%%%%%j%%%%J%%J%%J%%J%%%%
153F4%%%%J%%%%J%%j%j%%%j%%%%%%%J%%J%J%%%%%%%%%%%J%%%%%%j%%%j%%%%%%%J%J%%%%%%
104F7J%%%%%%%%%%%%%j%%%%%%%%%j%%J%J%%J%%%J%%j%%%%%j%%J%%%%%%%%%%%%J%%%%%%%%%
$$ plain form
448 44 44 45 45 45 45 45 45 44 44 44 45 45 46 46 46 45 45 45 45 45 45 45 45 45 46 46 46 46 47 48 48 48 47 46 45 45 45 45 45 45 45 44 44 44 44 44 44 44 44 45 45 45 45 46 46 46 46 46 46 45 45 45 45 46 46 47 47 48 48 48 48
399 48 47 47 47 47 47 47 47 47 46 46 47 47 47 47 48 48 48 48 49 49 49 48 48 48 47 47 46 46 46 46 46 46 46 47 47 48 48 48 48 49 49 49 49 49 49 49 49 49 48 48 47 47 47 46 46 46 46 45 44 44 45 45 46 47 47 48 48 49 48 48 48
350 48 47 47 47 47 47 47 47 48 48 48 48 49 49 49 48 48 47 47 46 47 47 47 48 48 48 48 48 49 49 49 49 50 50 51 51 52 52 52 51 51 51 51 51 51 51 51 51 51 51 51 51 51 51 52 52 52 52 52 52 52 51 51 51 51 51 52 52 53 53 54 53
301 53 53 53 53 52 52 51 51 51 51 51 51 51 51 51 51 51 50 50 51 51 52 52 53 53 53 54 54 54 53 53 53 53 53 53 53 53 53 52 53 53 53 53 53 53 53 53 53 53 52 52 52 52 52 52 53 53 53 54 54 54 55 55 55 56 56 56 56 57 57 57 57
251 57 56 56 56 55 55 55 55 55 56 56 57 57 56 56 56 56 56 56 56 56 56 56 56 56 56 56 56 56 57 57 57 57 57 57 57 57 57 57 58 58 59 59 60 60 60 60 60 60 60 60 60 60 60 60 60 60 59 59 58 58 59 59 59 59 59 59 58 58 58 58 58
202 58 59 58 58 59 59 59 59 59 60 60 60 60 60 60 61 61 61 61 61 61 61 61 61 61 61 61 62 62 61 61 61 61 61 61 61 61 61 60 60 60 60 59 59 60 60 60 61 61 61 61 61 61 60 60 60 60 60 61 61 61 62 62 62 63 63 63 64 64 64 64 64
153 64 64 64 64 64 65 65 65 65 65 66 66 66 65 65 64 64 64 64 63 63 63 63 63 63 63 63 64 64 64 65 65 66 66 66 66 66 66 66 66 66 66 66 66 67 67 67 67 67 67 67 66 66 66 66 65 65 65 65 65 65 65 65 66 66 67 67 67 67 67 67 67
104 67 68 68 68 68 68 68 68 68 68 68 68 68 68 68 67 67 67 67 67 67 67 67 67 67 66 66 66 67 67 68 68 68 69 69 69 69 70 70 70 69 69 69 69 69 69 68 68 68 69 69 69 69 69 69 69 69 69 69 69 69 69 70 70 70 70 70 70 70 70 70 70
54G0j%%%%j%%%%j%%%%%J%J%JJ%J%JJ%J%%%%%%%%%%%%j%%%%j%J%%%%%%%%%j%%%%%%%%%%%%%
5G3%%%%J%%j%%J%JJ%J%%%%%%%%%%%%%%%%%J%%J%J%%j%%j%%j%%%%%J%%%%%%%JJ%J%J%%j%j%
-46H0%%j%%%j%%J%J%%%%%%J%%J%%%%j%J%J%J%J%%j%%%%%%j%%%%%J%%J%j%%%%j%%%j%%%%%%
-95H2J%%J%J%%%%%%%J%j%%%%%%%J%%%j%%J%%J%%J%%J%%%%%%Jj%%%%%J%%%%%%%%%%j%%%%J%
-145I0%%j%%j%%%%%%%%%%%%%JJJ%J%%%J%%%j%%%%%%J%J%%%%%%%%%%%%%j%%%%%%%J%%%%Jj%
-193I4%%%%%%%%J%%%%%J%%J%%%%%%%%%J%J%%J%%j%%%%j%%%%%%%%%%%%%%%%jj%%%%JJ%%J%%
-242I9%j%%j%%%%J%%J%J%J%J%J%%%%%j%%%%%%%%%%%%%%%%%%j%%%%%%j%J%J%J%%%%%%J%JJ%
-290A06J%%%%j%j%j%%j%j%%j%%J%%J%%J%%J%%J%%%%J%%%%%%%j%%%j%%%%%%J%%J%%%%%%%%%
$$ plain form
54 70 69 69 69 69 69 68 68 68 68 68 67 67 67 67 67 67 68 68 69 69 70 71 71 72 72 73 74 74 75 75 75 75 75 75 75 75 75 75 75 75 75 74 74 74 74 74 73 73 74 74 74 74 74 74 74 74 74 74 73 73 73 73 73 73 73 73 73 73 73 73 73 73
5 73 73 73 73 73 74 74 74 73 73 73 74 74 75 76 76 77 77 77 77 77 77 77 77 77 77 77 77 77 77 77 77 77 77 78 78 78 79 79 80 80 80 79 79 79 78 78 78 77 77 77 77 77 77 78 78 78 78 78 78 78 78 79 80 80 81 81 82 82 82 81 81 80 80
-46 80 80 80 79 79 79 79 78 78 78 79 79 80 80 80 80 80 80 80 81 81 81 82 82 82 82 82 81 81 82 82 83 83 84 84 85 85 85 84 84 84 84 84 84 84 83 83 83 83 83 83 84 84 84 85 85 84 84 84 84 84 83 83 83 83 82 82 82 82 82 82 82
-95 82 83 83 83 84 84 85 85 85 85 85 85 85 85 86 86 85 85 85 85 85 85 85 85 86 86 86 86 85 85 85 86 86 86 87 87 87 88 88 88 89 89 89 89 89 89 89 90 89 89 89 89 89 89 90 90 90 90 90 90 90 90 90 90 90 89 89 89 89 89 90 90
-145 90 90 90 89 89 89 88 88 88 88 88 88 88 88 88 88 88 88 88 88 89 90 91 91 92 92 92 92 93 93 93 93 92 92 92 92 92 92 92 93 93 94 94 94 94 94 94 94 94 94 94 94 94 94 94 93 93 93 93 93 93 93 93 94 94 94 94 94 95 94 94
-193 94 94 94 94 94 94 94 94 94 95 95 95 95 95 95 96 96 96 97 97 97 97 97 97 97 97 97 97 98 98 99 99 99 100 100 100 99 99 99 99 99 98 98 98 98 98 98 98 98 98 98 98 98 98 98 98 98 98 97 96 96 96 96 96 97 98 98 98 99 99 99
-242 99 99 98 98 98 97 97 97 97 97 98 98 98 99 99 100 100 101 101 102 102 103 103 103 103 103 103 102 102 102 102 102 102 102 102 102 102 102 102 102 102 102 102 102 102 102 101 101 101 101 101 101 101 100 100 101 101 102 102 103 103 103 103 103 103 103 104 104 105 106 106
-290 106 107 107 107 107 107 106 106 105 105 104 104 104 103 103 102 102 102 101 101 101 102 102 102 103 103 103 104 104 104 105 105 105 106 106 106 106 106 107 107 107 107 107 107 107 107 106 106 106 106 105 105 105 105 105 105 105 106 106 106 107 107 107 107 107 107 107 107 107 107
-338A07%jJ%%J%J%%%%%%%%%JJ%%%%%%%%%%%%%%%J%%%%J%%%J%%%%%%%%%%%%%%%J%%%%%%%%%
-386A15%%%%%%%J%%%J%%%%%%J%%j%j%%%%%%%%%%%%%%%%%J%J%%%%%j%%%%%%%J%J%%%%j%%%%
-434A18%j%J%J%JJ%%%%j%j%%J%J%%%%%J%%%J%%%%J%%%%J%%%%%%j%%j%%%%J%%%%%jJ%J%JJ%
-482A27J%%j%%%%%%%%j%j%%%%j%%%%%%%%J%%%%%JJJ%J%%%j%%%J%%%%%%%%j%%J%%%%%%%J%J
-530A31%%%J%%%j%%%J%%%%%%J%%%j%%j%%%J%%%J%%J%%J%%%%%%%%%%J%%%J%%J%%j%j%%j%%J
-577A36%J%%%%%%%%%j%%%%%%%%%J%%%j%J%J%%%%%%J%%%%%%%j%%J%%%%%%%Jj%%%%%%%%%%J%
-625A40%%J%%J%%J%%%%%%%%%J%%%%%%%%%%%%%%%%%%j%%%%%%%%%%%%%%%%%%%JJ%%Jj%%j%%J
-673A45%J%%%%j%%j%%%%%%J%%J%%J%J%%%J%%j%%j%%j%J%%%J%%JJ%J%%%%%%%%%%%%j%%%%j%
$$ plain form
-338 107 107 106 107 107 107 108 108 109 109 109 109 109 109 109 109 109 109 110 111 111 111 111 111 111 111 111 111 111 111 111 111 111 111 111 112 112 112 112 112 113 113 113 113 114 114 114 114 114 114 114 114 114 114 114 114 114 114 114 114 115 115 115 115 115 115 115 115 115 115
-386 115 115 115 115 115 115 115 115 116 116 116 116 117 117 117 117 117 117 117 118 118 118 117 117 116 116 116 116 116 116 116 116 116 116 116 116 116 116 116 116 116 116 117 117 118 118 118 118 118 118 117 117 117 117 117 117 117 117 118 118 119 119 119 119 119 118 118 118 118 118
-434 118 118 117 117 118 118 119 119 120 121 121 121 121 121 120 120 119 119 119 120 120 121 121 121 121 121 121 122 122 122 122 123 123 123 123 123 124 124 124 124 124 125 125 125 125 125 125 125 124 124 124 123 123 123 123 123 124 124 124 124 124 124 123 124 124 125 125 126 127 127
-482 127 128 128 128 127 127 127 127 127 127 127 127 127 126 126 125 125 125 125 125 124 124 124 124 124 124 124 124 124 125 125 125 125 125 125 126 127 128 128 129 129 129 129 128 128 128 128 129 129 129 129 129 129 129 129 129 128 128 128 129 129 129 129 129 129 129 129 130 130 131
-530 131 131 131 131 132 132 132 132 131 131 131 131 132 132 132 132 132 132 132 133 133 133 133 132 132 132 131 131 131 131 132 132 132 132 133 133 133 134 134 134 135 135 135 135 135 135 135 135 135 135 135 136 136 136 136 137 137 137 138 138 138 137 137 136 136 136 135 135 135 136
-577 136 136 137 137 137 137 137 137 137 137 137 137 136 136 136 136 136 136 136 136 136 136 137 137 137 137 136 136 137 137 138 138 138 138 138 138 138 139 139 139 139 139 139 139 139 138 138 138 139 139 139 139 139 139 139 139 140 139 139 139 139 139 139 139 139 139 139 139 140 140
-625 140 140 140 141 141 141 142 142 142 143 143 143 143 143 143 143 143 143 143 144 144 144 144 144 144 144 144 144 144 144 144 144 144 144 144 144 144 144 143 143 143 143 143 143 143 143 143 143 143 143 143 143 143 143 143 143 143 143 144 145 145 145 146 145 145 145 144 144 144 145
-673 145 145 146 146 146 146 146 145 145 145 144 144 144 144 144 144 144 145 145 145 146 146 146 147 147 148 148 148 148 149 149 149 148 148 148 147 147 147 146 146 147 147 147 147 148 148 148 149 150 150 151 151 151 151 151 151 151 151 151 151 151 151 151 150 150 150 150 150 149 149
-721A49%%%J%%%%%J%%J%%%%%%%%%%%%%%%%%J%J%%J%%%%j%%%%%%%%%j%%%j%%%J%J%%%%%%%J
-769A55%%%%%j%J%%J%%%%%j%%%%%%%%j%%jJ%J%%%%%%JJ%%J%%J%J%J%J%j%%%Jj%%%j%%J%J%
-817A62j%%%j%%%%%%%%%%%%%%%%%Jj%%%%%%%J%J%%%%%j%jJ%%%%%J%%J%%%%%%%%%%%%j%%%%
-865A62%%%j%%%%%J%%%%%%%%%%%%J%%%%%%%%J%J%J%%%%J%j%j%%%%%%%%J%%%%%%%%%j%%%%%
-912A65J%J%%j%%j%%%%%%%%J%%%%j%%%%%%%%%%%%%j%%J%%%%%%%%%%%%%%%J%%j%%%%%J%%J%
-960A67%%%%J%%%%%%j%j%J%%%%%%%j%%%%%%%%J%%J%%%%%j%%%JJ%%%%%%%j%%%%%%%%%%%%%%
-1008A68%%%J%%%%%j%j%%%%%%%%J%J%%J%%%%%%%j%%%%%%%j%J%%%%%J%%%%%%%J%%%%%%%%%J
-1055A72%%%%%%jj%j%%J%%J%J%J%%J%%%j%%%%%j%j%%j%%%%%%J%J%%%%j%%J%%%J%%%%j%j%j
$$ plain form
-721 149 149 149 149 150 150 150 150 150 150 151 151 151 152 152 152 152 152 152 152 152 152 152 152 152 152 152 152 152 152 152 153 153 154 154 154 155 155 155 155 155 154 154 154 154 154 154 154 154 154 154 153 153 153 153 152 152 152 152 153 153 154 154 154 154 154 154 154 154 155
-769 155 155 155 155 155 155 154 154 155 155 155 156 156 156 156 156 156 155 155 155 155 155 155 155 155 155 154 154 154 153 154 154 155 155 155 155 155 155 155 156 157 157 157 158 158 158 159 159 160 160 161 161 162 162 161 161 161 161 162 161 161 161 161 160 160 160 161 161 162 162
-817 162 161 161 161 161 160 160 160 160 160 160 160 160 160 160 160 160 160 160 160 160 160 160 161 160 160 160 160 160 160 160 160 161 161 162 162 162 162 162 162 161 161 160 161 161 161 161 161 161 162 162 162 163 163 163 163 163 163 163 163 163 163 163 163 163 162 162 162 162 162
-865 162 162 162 162 161 161 161 161 161 161 162 162 162 162 162 162 162 162 162 162 162 162 162 163 163 163 163 163 163 163 163 163 164 164 165 165 166 166 166 166 166 167 167 166 166 165 165 165 165 165 165 165 165 165 166 166 166 166 166 166 166 166 166 166 165 165 165 165 165 165
-912 165 166 166 167 167 167 166 166 166 165 165 165 165 165 165 165 165 165 166 166 166 166 166 165 165 165 165 165 165 165 165 165 165 165 165 165 165 164 164 164 165 165 165 165 165 165 165 165 165 165 165 165 165 165 165 165 166 166 166 165 165 165 165 165 165 166 166 166 167 167
-960 167 167 167 167 167 168 168 168 168 168 168 168 167 167 166 166 167 167 167 167 167 167 167 167 166 166 166 166 166 166 166 166 166 167 167 167 168 168 168 168 168 168 167 167 167 167 168 169 169 169 169 169 169 169 169 168 168 168 168 168 168 168 168 168 168 168 168 168 168 168
-1008 168 168 168 168 169 169 169 169 169 169 168 168 167 167 167 167 167 167 167 167 167 168 168 169 169 169 170 170 170 170 170 170 170 170 169 169 169 169 169 169 169 169 168 168 169 169 169 169 169 169 170 170 170 170 170 170 170 170 171 171 171 171 171 171 171 171 171 171 172
-1055 172 172 172 172 172 172 172 171 170 170 169 169 169 170 170 170 171 171 172 172 173 173 173 174 174 174 174 173 173 173 173 173 173 172 172 171 171 171 170 170 170 170 170 170 170 171 171 172 172 172 172 172 171 171 171 172 172 172 172 173 173 173 173 173 172 172 171 171 170
-1102A70%%J%JJ%%%%%%%%%%%%jJ%%%J%j%%%j%%%%jJ%%%%J%%%%%J%J%%J%%j%%%%%%%%%%%%j
-1150A74%j%j%J%%J%%%%J%%%%j%%%%%%%%%j%%%J%%%%J%%%%%%%j%j%%%%%%%%%%j%%%%%%%%%
-1197A72%J%JJ%%%%%%%%%j%%%%%%J%%%%j%%%%%%%j%j%%%%%j%J%J%%J%%%%%%%%%%%%%%%%%%
-1244A74j%%%%%%%%%%%J%%%%%%%jj%%%%%j%%%%%%%%%J%%J%J%%%%%%%%%j%j%%%j%%J%%%%%%
-1291A72%%%%J%%J%%%%%%%%j%%%%%%j%%%%%%%%J%J%%%%%%%%%%%%%%j%jj%%%%J%Jj%%%j%%%
-1338A71%%j%%%%%%J%JJ%%%j%%%j%%j%%%J%J%%%%%%j%%%%J%%%%%%%%%%j%%j%%%%%%%%%%%%
-1385A70%%%%%%%%%%J%%%%%%%%%%%%%%%J%%%%%%%%%%%J%%%%%%%J%%%j%jjj%j%%%%J%j%jj%
-1433A67%%%%%%%%%J%%%J%%%%%%%%%%%%%%%%%%%%J%%J%%%%%%j%j%%j%%%%j%%%%%%j%%%%%%
$$ plain form
-1102 170 170 170 171 171 172 173 173 173 173 173 173 173 173 173 173 173 173 173 172 173 173 173 173 174 174 173 173 173 173 172 172 172 172 172 171 172 172 172 172 172 173 173 173 173 173 173 174 174 175 175 175 176 176 176 175 175 175 175 175 175 175 175 175 175 175 175 175 174
-1150 174 174 173 173 172 172 173 173 173 174 174 174 174 174 175 175 175 175 175 174 174 174 174 174 174 174 174 174 174 173 173 173 173 174 174 174 174 174 175 175 175 175 175 175 175 175 174 174 173 173 173 173 173 173 173 173 173 173 173 172 172 172 172 172 172 172 172 172 172
-1197 172 172 173 173 174 175 175 175 175 175 175 175 175 175 175 174 174 174 174 174 174 174 175 175 175 175 175 174 174 174 174 174 174 174 174 173 173 172 172 172 172 172 172 171 171 172 172 173 173 173 174 174 174 174 174 174 174 174 174 174 174 174 174 174 174 174 174 174 174
-1244 174 173 173 173 173 173 173 173 173 173 173 173 173 174 174 174 174 174 174 174 174 173 172 172 172 172 172 172 171 171 171 171 171 171 171 171 171 171 172 172 172 173 173 174 174 174 174 174 174 174 174 174 174 173 173 172 172 172 172 171 171 171 172 172 172 172 172 172 172
-1291 172 172 172 172 172 173 173 173 174 174 174 174 174 174 174 174 174 173 173 173 173 173 173 173 172 172 172 172 172 172 172 172 172 173 173 174 174 174 174 174 174 174 174 174 174 174 174 174 174 174 173 173 172 171 171 171 171 171 172 172 173 172 172 172 172 171 171 171 171
-1338 171 171 171 170 170 170 170 170 170 170 171 171 172 173 173 173 173 172 172 172 172 171 171 171 170 170 170 170 171 171 172 172 172 172 172 172 172 171 171 171 171 171 172 172 172 172 172 172 172 172 172 172 172 171 171 171 170 170 170 170 170 170 170 170 170 170 170 170 170
-1385 170 170 170 170 170 170 170 170 170 170 170 171 171 171 171 171 171 171 171 171 171 171 171 171 171 171 171 172 172 172 172 172 172 172 172 172 172 172 172 173 173 173 173 173 173 173 173 174 174 174 174 173 173 172 171 170 170 169 169 169 169 169 170 170 169 169 168 167 167
-1433 167 167 167 167 167 167 167 167 167 167 168 168 168 168 169 169 169 169 169 169 169 169 169 169 169 169 169 169 169 169 169 169 169 169 169 170 170 170 171 171 171 171 171 171 171 170 170 169 169 169 168 168 168 168 168 167 167 167 167 167 167 167 166 166 166 166 166 166 166
-1480A66J%Jj%%%%%%%%J%%%%JJ%%%%%%j%%%%%%jj%%j%j%%%%J%%%%%J%j%j%%%%%%%%%%J%%%
-1527A66j%%%%%%%%%%%%%%%Jj%%%%j%%%%%%%%%%%J%%%J%%%%%%%J%j%j%j%%j%%%%%%%%%J%%
-1574A64J%%j%j%j%j%j%j%%%%J%J%%%%%%%%%J%%J%%%%%j%%j%%%%%J%%%%%%%j%%j%%%J%%%%
-1621A61%jj%j%%%%%%%%%J%%%%%j%%%%J%%%%%j%%%J%%%%%%%%%%J%%%%%j%%%j%%j%%j%%%J%
-1668A57J%Jj%%%j%%j%%j%%%%j%%%%%%%%J%%%%%%%j%%%J%j%%%%%%%%%%J%%J%%J%%%%%%j%j
-1716A55%jj%%%%%%%%%%%%%%%%%%%%%%%%%%%J%%%%%%%%%%%%%%j%%J%%%%j%%%j%%%%%J%%j%
-1763A52%j%%j%%%%%%%%%%%%%%%%%%%%%j%%%%%%%%%j%%%%J%%%%%j%%%%j%%%%j%%%%%J%%%J
-1810A48%J%%%j%%%%%%j%%%%%%%J%%%%j%%%%%J%%%%%%%%%%%j%%%%%%%%j%%%%%%%%%j%%%%%
$$ plain form
-1480 166 167 167 168 167 167 167 167 167 167 167 167 167 168 168 168 168 168 169 170 170 170 170 170 170 170 169 169 169 169 169 169 169 168 167 167 167 166 166 165 165 165 165 165 166 166 166 166 166 166 167 167 166 166 165 165 165 165 165 165 165 165 165 165 165 166 166 166 166
-1527 166 165 165 165 165 165 165 165 165 165 165 165 165 165 165 165 165 166 165 165 165 165 165 164 164 164 164 164 164 164 164 164 164 164 164 165 165 165 165 166 166 166 166 166 166 166 166 167 167 166 166 165 165 164 164 164 163 163 163 163 163 163 163 163 163 163 164 164 164
-1574 164 165 165 165 164 164 163 163 162 162 161 161 160 160 159 159 159 159 159 160 160 161 161 161 161 161 161 161 161 161 161 162 162 162 163 163 163 163 163 163 162 162 162 161 161 161 161 161 161 162 162 162 162 162 162 162 162 161 161 161 160 160 160 160 161 161 161 161 161
-1621 161 161 160 159 159 158 158 158 158 158 158 158 158 158 158 159 159 159 159 159 159 158 158 158 158 158 159 159 159 159 159 159 158 158 158 158 159 159 159 159 159 159 159 159 159 159 159 160 160 160 160 160 160 159 159 159 159 158 158 158 157 157 157 156 156 156 156 157 157
-1668 157 158 158 159 158 158 158 158 157 157 157 156 156 156 155 155 155 155 155 154 154 154 154 154 154 154 154 154 155 155 155 155 155 155 155 155 154 154 154 154 155 155 154 154 154 154 154 154 154 154 154 154 154 155 155 155 156 156 156 157 157 157 157 157 157 157 156 156 155
-1716 155 155 154 153 153 153 153 153 153 153 153 153 153 153 153 153 153 153 153 153 153 153 153 153 153 153 153 153 153 153 153 154 154 154 154 154 154 154 154 154 154 154 154 154 154 154 153 153 153 154 154 154 154 154 153 153 153 153 152 152 152 152 152 152 153 153 153 152 152
-1763 152 152 151 151 151 150 150 150 150 150 150 150 150 150 150 150 150 150 150 150 150 150 150 150 150 150 150 149 149 149 149 149 149 149 149 149 149 148 148 148 148 148 149 149 149 149 149 149 148 148 148 148 148 147 147 147 147 147 146 146 146 146 146 146 147 147 147 147 148
-1810 148 148 149 149 149 149 148 148 148 148 148 148 148 147 147 147 147 147 147 147 147 148 148 148 148 148 147 147 147 147 147 147 148 148 148 148 148 148 148 148 148 148 148 148 147 147 147 147 147 147 147 147 147 146 146 146 146 146 146 146 146 146 146 145 145 145 145 145 145
-1857A45j%%J%Jj%%j%%%%%%%j%%%%%%%%%%%%JJ%J%%J%j%%j%j%%j%j%%%%%%j%%j%%%%%%%%%
-1904A40%%%%%%%%%%%%j%%%%%%%%%J%%%J%j%%%%j%%%%%%j%%%J%%J%%Jj%%j%%%%%%%%%%%%%
-1951A39%j%%%%%%%%%%J%%%j%%%%%%%%%%%%%%%j%%%%%%%%J%%%j%%%J%%%%j%%%j%%%%%%%%%
-1999A36%j%%J%%%%%%%%%j%%%%%J%%%%%j%%J%%%j%%j%%%%%j%%%jJ%%%%%%%%%%%%%%%%%%j%
-2046A32%%%j%J%%J%%%%%%%%j%%%%j%%%%%%%%%%%Jj%%%%%%%%%%%j%%j%j%%%%%%%j%%%JJ%J
-2093A30%%J%%%%%j%j%%%%J%%%J%j%%%%%%%%%%%j%%%j%%%%J%%%j%%j%%%%%j%j%%j%%J%%%%
-2140A25%j%%%J%J%J%%%%%%%%%%%%%j%j%%%j%%J%%%%%Jj%%j%%%%%%%j%%%%%%%%%J%%%%%%%
-2187A24%%%%%%%%j%%j%j%j%%J%J%%%%%j%%jJ%%%J%%j%%j%%%%J%%%%%%%%%%%%j%%%%%j%%j
$$ plain form
-1857 145 144 144 144 145 145 146 145 145 145 144 144 144 144 144 144 144 144 143 143 143 143 143 143 143 143 143 143 143 143 143 144 145 145 146 146 146 147 147 146 146 146 145 145 144 144 144 143 143 142 142 142 142 142 142 142 141 141 141 140 140 140 140 140 140 140 140 140 140
-1904 140 140 140 140 140 140 140 140 140 140 140 140 140 139 139 139 139 139 139 139 139 139 139 140 140 140 140 141 141 140 140 140 140 140 139 139 139 139 139 139 139 138 138 138 138 139 139 139 140 140 140 141 140 140 140 139 139 139 139 139 139 139 139 139 139 139 139 139 139
-1951 139 139 138 138 138 138 138 138 138 138 138 138 138 139 139 139 139 138 138 138 138 138 138 138 138 138 138 138 138 138 138 138 138 137 137 137 137 137 137 137 137 137 138 138 138 138 137 137 137 137 138 138 138 138 138 137 137 137 137 136 136 136 136 136 136 136 136 136 136
-1999 136 136 135 135 135 136 136 136 136 136 136 136 136 136 136 135 135 135 135 135 135 136 136 136 136 136 136 135 135 135 136 136 136 136 135 135 135 134 134 134 134 134 134 133 133 133 133 132 133 133 133 133 133 133 133 133 133 133 133 133 133 133 133 133 133 133 133 132 132
-2046 132 132 132 132 131 131 132 132 132 133 133 133 133 133 133 133 133 133 132 132 132 132 132 131 131 131 131 131 131 131 131 131 131 131 131 132 131 131 131 131 131 131 131 131 131 131 131 131 130 130 130 129 129 128 128 128 128 128 128 128 128 127 127 127 127 128 129 129 130
-2093 130 130 130 131 131 131 131 131 131 130 130 129 129 129 129 129 130 130 130 130 131 131 130 130 130 130 130 130 130 130 130 130 130 130 129 129 129 129 128 128 128 128 128 129 129 129 129 128 128 128 127 127 127 127 127 127 126 126 125 125 125 124 124 124 125 125 125 125 125
-2140 125 125 124 124 124 124 125 125 126 126 127 127 127 127 127 127 127 127 127 127 127 127 127 127 126 126 125 125 125 125 124 124 124 125 125 125 125 125 125 126 125 125 125 124 124 124 124 124 124 124 124 123 123 123 123 123 123 123 123 123 123 124 124 124 124 124 124 124 124
-2187 124 124 124 124 124 124 124 124 124 123 123 123 122 122 121 121 120 120 120 121 121 122 122 122 122 122 122 121 121 121 120 121 121 121 121 122 122 122 121 121 121 120 120 120 120 120 121 121 121 121 121 121 121 121 121 121 121 121 121 120 120 120 120 120 120 119 119 119 118
-2234A18%j%%%%%%%%%%%%%%%%%%%%%%%j%J%%%%%%%%J%%%%%%%%%J%%%%%%j%%%j%%%%%%%%%%
-2282A17%%%%%j%J%%%%%%Jj%%%j%%%%%%%j%%%%%j%%%%%%%%%%%%jJ%%%%%%%%%%%%%j%%J%%%
-2329A14%%%%j%%%%%%%%%%%%%%%%%j%%%%%%%%%%%J%%%%%j%j%%%%%%%%%%J%%%%%%%%j%%%%%
-2376A11j%%%J%%%%J%%%j%%%%%%%J%J%%%%%%%%%%j%%%%%J%%%j%%%%j%jj%j%%%%%J%%j%%j%
-2423A07%%J%J%%J%%j%%%j%%%%%%%%%%%%%%%%%%%j%%j%%j%%%%%%J%%%%J%%J%%%%%%%%j%%%
-2470A07%%%j%%%%%J%%J%j%%%j%J%%%j%%%%%%j%%%j%%%%%J%%%%%J%%%%j%%%%%%%%%%%%%%%
-2517A05j%jj%j%%%%J%%%J%%%%%%j%%%%%%%%%%%J%%%%%%%%j%%%%%%J%%j%%%%%%%j%%%%%%%
-2564A01%j%%%%%%%%%%%J%%%%%%%%%%%%%%%j%j%%%%%%%J%%Jj%j%%j%%%%%%%%%J%%J%%j%%%
$$ plain form
-2234 118 118 117 117 117 117 117 117 117 117 117 117 117 117 117 117 117 117 117 117 117 117 117 117 117 117 116 116 117 117 117 117 117 117 117 117 117 118 118 118 118 118 118 118 118 118 118 119 119 119 119 119 119 119 118 118 118 118 117 117 117 117 117 117 117 117 117 117 117
-2282 117 117 117 117 117 117 116 116 117 117 117 117 117 117 117 118 117 117 117 117 116 116 116 116 116 116 116 116 115 115 115 115 115 115 114 114 114 114 114 114 114 114 114 114 114 114 114 113 114 114 114 114 114 114 114 114 114 114 114 114 114 114 113 113 113 114 114 114 114
-2329 114 114 114 114 114 113 113 113 113 113 113 113 113 113 113 113 113 113 113 113 113 113 113 112 112 112 112 112 112 112 112 112 112 112 112 113 113 113 113 113 113 112 112 111 111 111 111 111 111 111 111 111 111 111 112 112 112 112 112 112 112 112 112 111 111 111 111 111 111
-2376 111 110 110 110 110 111 111 111 111 111 112 112 112 112 111 111 111 111 111 111 111 111 112 112 113 113 113 113 113 113 113 113 113 113 113 112 112 112 112 112 112 113 113 113 113 112 112 112 112 112 111 111 110 109 109 108 108 108 108 108 108 109 109 109 108 108 108 107 107
-2423 107 107 107 108 108 109 109 109 110 110 110 109 109 109 109 108 108 108 108 108 108 108 108 108 108 108 108 108 108 108 108 108 108 108 108 107 107 107 106 106 106 105 105 105 105 105 105 105 106 106 106 106 106 107 107 107 108 108 108 108 108 108 108 108 108 107 107 107 107
-2470 107 107 107 107 106 106 106 106 106 106 107 107 107 108 108 107 107 107 107 106 106 107 107 107 107 106 106 106 106 106 106 106 105 105 105 105 104 104 104 104 104 104 105 105 105 105 105 105 106 106 106 106 106 105 105 105 105 105 105 105 105 105 105 105 105 105 105 105 105
-2517 105 104 104 103 102 102 101 101 101 101 101 102 102 102 102 103 103 103 103 103 103 103 102 102 102 102 102 102 102 102 102 102 102 102 103 103 103 103 103 103 103 103 103 102 102 102 102 102 102 102 103 103 103 102 102 102 102 102 102 102 102 101 101 101 101 101 101 101 101
-2564 101 101 100 100 100 100 100 100 100 100 100 100 100 100 101 101 101 101 101 101 101 101 101 101 101 101 101 101 101 101 100 100 99 99 99 99 99 99 99 99 100 100 100 101 100 100 99 99 99 98 98 98 98 98 98 98 98 98 98 99 99 99 100 100 100 99 99 99 99
-2612I9J%%j%%%j%%%%%%%%%%%%%%%j%%%%%J%%j%%%%%%%j%%j%J%%%J%%%%%%%%j%%%%J%%%%%
-2660I7%%%%%%%%%%%%J%%j%%%%%J%%%%%j%%%j%%%%%%%%%%%JJ%J%%j%jj%%j%%j%%j%%%j%%%
-2707I2%%%%%%jJ%%%%%%%%J%%%J%%%%%%j%%%%j%%%%%%%%j%%%%J%%J%%%%jj%j%%%%%j%%J%%
-2755I0%%%%%%%%%%J%%%%%%j%%%%%%%J%%%j%%%%%j%%%%%%J%J%%%j%%%%%%%%%%%%%%%%j%%%
-2803H9j%%%%%%%%%%%J%%%%%%%%%j%%J%j%j%%jJ%%%%%J%%%%%%%%Jj%%j%%%%J%j%%j%%%%%%
-2851H6J%%%%%%%%%%%%%%J%%%%%%%%%%%%%j%%j%%%%%%j%%%j%%J%%j%J%%%%JJ%%J%%J%%j%j
-2899H7%j%jj%%%%%%%%J%%%%J%j%j%j%%J%%%%J%%%%j%%%j%%%%%%%J%%J%%%%%j%j%J%%%%%%
-2947H4%j%j%%J%%%J%%%j%%J%%%%%j%%%%%%J%j%%%j%%j%%%j%J%%%%%%%%jJ%J%J%%%j%%%%%
$$ plain form
-2612 99 100 100 100 99 99 99 99 98 98 98 98 98 98 98 98 98 98 98 98 98 98 98 98 97 97 97 97 97 97 98 98 98 97 97 97 97 97 97 97 97 96 96 96 95 95 96 96 96 96 97 97 97 97 97 97 97 97 97 96 96 96 96 96 97 97 97 97 97 97
-2660 97 97 97 97 97 97 97 97 97 97 97 97 97 98 98 98 97 97 97 97 97 97 98 98 98 98 98 98 97 97 97 97 96 96 96 96 96 96 96 96 96 96 96 96 97 98 98 99 99 99 98 98 97 96 96 96 95 95 95 94 94 94 93 93 93 93 92 92 92 92
-2707 92 92 92 92 92 92 92 91 92 92 92 92 92 92 92 92 92 93 93 93 93 94 94 94 94 94 94 94 93 93 93 93 93 92 92 92 92 92 92 92 92 92 91 91 91 91 91 92 92 92 93 93 93 93 93 92 91 91 90 90 90 90 90 90 89 89 89 90 90 90
-2755 90 90 90 90 90 90 90 90 90 90 90 91 91 91 91 91 91 91 90 90 90 90 90 90 90 90 91 91 91 91 90 90 90 90 90 90 89 89 89 89 89 89 89 90 90 91 91 91 91 90 90 90 90 90 90 90 90 90 90 90 90 90 90 90 90 90 89 89 89 89
-2803 89 88 88 88 88 88 88 88 88 88 88 88 88 89 89 89 89 89 89 89 89 89 89 88 88 88 89 89 88 88 87 87 87 86 87 87 87 87 87 87 88 88 88 88 88 88 88 88 88 89 88 88 88 87 87 87 87 87 88 88 87 87 87 86 86 86 86 86 86 86
-2851 86 87 87 87 87 87 87 87 87 87 87 87 87 87 87 87 88 88 88 88 88 88 88 88 88 88 88 88 88 88 87 87 87 86 86 86 86 86 86 86 85 85 85 85 84 84 84 85 85 85 84 84 85 85 85 85 85 86 87 87 87 88 88 88 89 89 89 88 88 87
-2899 87 87 86 86 85 84 84 84 84 84 84 84 84 84 85 85 85 85 85 86 86 85 85 84 84 83 83 83 84 84 84 84 84 85 85 85 85 85 84 84 84 84 83 83 83 83 83 83 83 83 84 84 84 85 85 85 85 85 85 84 84 83 83 84 84 84 84 84 84 84
-2947 84 84 83 83 82 82 82 83 83 83 83 84 84 84 84 83 83 83 84 84 84 84 84 84 83 83 83 83 83 83 83 84 84 83 83 83 83 82 82 82 81 81 81 81 80 80 81 81 81 81 81 81 81 81 81 80 81 81 82 82 83 83 83 83 82 82 82 82 82 82
-2995H2J%%%j%%j%J%%J%j%%j%%%%%%%%%%%%J%j%%%%%%j%%%%%%%%%%%%%J%%%%%%%%%%%%%%%
-3042H1%%j%%j%%j%%%%%JJ%%%%%%j%%%%%j%%%J%%%%j%%%%%%%%%%%%%%%%%%%Jj%j%%%%%j%%
-3090G6%%J%%J%%%%%%%%%j%%%%%j%%%J%J%%j%%j%%%j%%%J%%%%%%%%%%Jj%%%%j%j%%%%%J%%
-3138G5%%%%%%%j%%j%%%%%J%%%%%%%%%J%%%%%%%%%%%j%%%%%%%%%%J%J%J%%%j%j%%j%%%%%%
-3186G4%%%%%J%%j%%%%%%%%j%%%j%J%J%J%%j%%%%%%%%%%%%J%%j%%%j%%%%%%%%%J%%%%%%%%
-3234G4j%%J%%%%J%J%%%%Jj%%%j%%j%%j%%j%%%jJ%%%%%%%%%%J%%%%%%%%%%%%%%%%j%%%%J%
-3282G3J%%%%j%%%%%%%%%%%j%%%j%%%%%%%%%%%%%%j%j%%%%%%%%JJJ%%J%%%%%%%%%%%%%%%%
-3330G3j%%%%%%%%%j%j%%%%%j%%%%J%%J%J%J%%%%%%jJj%%j%%j%%%%%J%%J%%%%%%j%%%%%%%
$$ plain form
-2995 82 83 83 83 83 82 82 82 81 81 82 82 82 83 83 82 82 82 81 81 81 81 81 81 81 81 81 81 81 81 81 82 82 81 81 81 81 81 81 81 80 80 80 80 80 80 80 80 80 80 80 80 80 80 81 81 81 81 81 81 81 81 81 81 81 81 81 81 81 81
-3042 81 81 81 80 80 80 79 79 79 78 78 78 78 78 78 79 80 80 80 80 80 80 80 79 79 79 79 79 79 78 78 78 78 79 79 79 79 79 78 78 78 78 78 78 78 78 78 78 78 78 78 78 78 78 78 78 78 78 79 78 78 77 77 77 77 77 77 76 76 76
-3090 76 76 76 77 77 77 78 78 78 78 78 78 78 78 78 78 77 77 77 77 77 77 76 76 76 76 77 77 78 78 78 77 77 77 76 76 76 76 75 75 75 75 76 76 76 76 76 76 76 76 76 76 76 77 76 76 76 76 76 75 75 74 74 74 74 74 74 75 75 75
-3138 75 75 75 75 75 75 75 75 74 74 74 73 73 73 73 73 73 74 74 74 74 74 74 74 74 74 74 75 75 75 75 75 75 75 75 75 75 75 75 74 74 74 74 74 74 74 74 74 74 74 75 75 76 76 77 77 77 77 76 76 75 75 75 74 74 74 74 74 74 74
-3186 74 74 74 74 74 74 75 75 75 74 74 74 74 74 74 74 74 74 73 73 73 73 72 72 73 73 74 74 75 75 75 74 74 74 74 74 74 74 74 74 74 74 74 74 75 75 75 74 74 74 74 73 73 73 73 73 73 73 73 73 73 74 74 74 74 74 74 74 74 74
-3234 74 73 73 73 74 74 74 74 74 75 75 76 76 76 76 76 77 76 76 76 76 75 75 75 74 74 74 73 73 73 72 72 72 72 71 72 72 72 72 72 72 72 72 72 72 72 73 73 73 73 73 73 73 73 73 73 73 73 73 73 73 73 73 72 72 72 72 72 73 73
-3282 73 74 74 74 74 74 73 73 73 73 73 73 73 73 73 73 73 73 72 72 72 72 71 71 71 71 71 71 71 71 71 71 71 71 71 71 71 70 70 69 69 69 69 69 69 69 69 69 70 71 72 72 72 73 73 73 73 73 73 73 73 73 73 73 73 73 73 73 73 73
-3330 73 72 72 72 72 72 72 72 72 72 72 71 71 70 70 70 70 70 70 69 69 69 69 69 70 70 70 71 71 72 72 73 73 73 73 73 73 73 72 73 72 72 72 71 71 71 70 70 70 70 70 70 71 71 71 72 72 72 72 72 72 72 71 71 71 71 71 71 71 71
-3377G1j%J%%%%%%%%%j%j%j%%%%%%%%%j%%%%%J%%%%%%%%%%%%%%%%%%%j%%%j%%%%%%%%%J%J
-3425F8%%j%%j%%%J%%J%j%%Jj%%%%%%%j%%j%J%%%%%%J%%%%%%%%j%%%j%%%%%%%%%%%j%%%%J
-3473F5%%%%%%%%%j%J%J%%J%j%%%%j%J%%%%%%%%%j%j%%%%J%%%%%%%%%%%%%%%%%%%J%J%%%J
-3521F8j%%j%%%%%%%%%j%%j%%j%%j%%%%J%J%Jj%%j%%%%%%j%j%%J%J%%%%j%%%%%%%j%%J%%J
-3569F3%%%%%%%%%%%j%%%j%j%%%%%J%J%%J%J%j%%%%%%%%j%%J%%%%%%j%%%%%%%%%J%j%j%%%
-3617F1%%%%%%%%J%%%j%%%%J%%%%%%%%%%%%%%%%%J%%%%%j%%j%j%%%J%%%%%%j%%%%%%%J%%J
-3665F2%%%%%%%%%%%j%%%J%%%%%j%%jJ%J%%%%%%j%j%%%jJ%%J%J%%%%j%%%j%%jJ%J%JJ%Jj%
-3712F3j%jjj%%j%%%J%j%%%J%%%%J%%J%Jj%%j%%%j%%J%J%Jj%%j%%%%%j%%%%%%%%%%%%%%%%
$$ plain form
-3377 71 70 70 71 71 71 71 71 71 71 71 71 71 70 70 69 69 68 68 68 68 68 68 68 68 68 68 67 67 67 67 67 67 68 68 68 68 68 68 68 68 68 68 68 68 68 68 68 68 68 68 68 68 67 67 67 67 66 66 66 66 66 66 66 66 66 66 67 67 68
-3425 68 68 68 67 67 67 66 66 66 66 67 67 67 68 68 67 67 67 68 67 67 67 67 67 67 67 67 66 66 66 65 65 66 66 66 66 66 66 66 67 67 67 67 67 67 67 67 67 66 66 66 66 65 65 65 65 65 65 65 65 65 65 65 65 64 64 64 64 64 65
-3473 65 65 65 65 65 65 65 65 65 65 64 64 65 65 66 66 66 67 67 66 66 66 66 66 65 65 66 66 66 66 66 66 66 66 66 66 65 65 64 64 64 64 64 65 65 65 65 65 65 65 65 65 65 65 65 65 65 65 65 65 65 65 65 66 66 67 67 67 67 68
-3521 68 67 67 67 66 66 66 66 66 66 66 66 66 66 65 65 65 64 64 64 63 63 63 62 62 62 62 62 63 63 64 64 65 64 64 64 63 63 63 63 63 63 63 62 62 61 61 61 62 62 63 63 63 63 63 62 62 62 62 62 62 62 62 61 61 61 62 62 62 63
-3569 63 63 63 63 63 63 63 63 63 63 63 63 62 62 62 62 61 61 60 60 60 60 60 60 61 61 62 62 62 63 63 64 64 63 63 63 63 63 63 63 63 63 62 62 62 63 63 63 63 63 63 63 62 62 62 62 62 62 62 62 62 62 63 63 62 62 61 61 61 61
-3617 61 61 61 61 61 61 61 61 61 62 62 62 62 61 61 61 61 61 62 62 62 62 62 62 62 62 62 62 62 62 62 62 62 62 62 62 63 63 63 63 63 63 62 62 62 61 61 60 60 60 60 61 61 61 61 61 61 61 60 60 60 60 60 60 60 60 61 61 61 62
-3665 62 62 62 62 62 62 62 62 62 62 62 62 61 61 61 61 62 62 62 62 62 62 61 61 61 60 61 61 62 62 62 62 62 62 62 61 61 60 60 60 60 59 60 60 60 61 61 62 62 62 62 62 61 61 61 61 60 60 60 59 60 60 61 61 62 63 63 64 63 63
-3712 63 62 62 61 60 59 59 59 58 58 58 58 59 59 58 58 58 58 59 59 59 59 59 60 60 60 61 61 62 61 61 61 60 60 60 60 59 59 59 60 60 61 61 62 61 61 61 60 60 60 60 60 60 59 59 59 59 59 59 59 59 59 59 59 59 59 59 59 59 59
-3760E9%%j%%%%%%J%%%%%%%%%%j%j%%%%%%%%%%j%%%J%%%%%%J%J%%J%%%j%%%%j%%%%%%%J%%
-3808E9%%%%%%%%%%%%%%%%j%%J%%%%J%%j%%%%j%%%j%%j%%%%%%%%%J%j%%j%%%%%%%%J%%%%%
-3856E6j%%%%%%%jJ%%%%J%%%%%%%%J%%%%%%%%%%J%%%%j%%%j%%J%%%%%%j%%%%%%%%%%%%%%%
-3904E6%%%%J%%%%%%%%%j%%%%%%%%%%%%%j%%j%J%%%%%J%%%%%%j%J%%%J%%%%%%%%%%%%j%%%
-3952E6j%j%%%%%%J%%%%%%j%%%%%%%%%%%%%%%%%J%%%%%%%%%j%%%%%%J%%%%%%%%%%%%%%%%j
-4000E4%%%j%%%%J%%%j%%%%J%%%%%%%%j%%%%%%%J%%%J%%%jJ%%%%%%%%%j%%%%%%%%%Jj%%%j
-4047E3%%Jj%%%%%%%%%%%%%%J%J%%%%%j%%%J%%j%j%%%%%%%%%%J%%J%%%%%%%%%%%%%%%%%%j
-4095E4%%%%%%%%%%J%%%%%j%j%%%%%J%%%%%%%%%J%J%J%%j%%%%j%j%%%%j%%j%%%%j%%%%%J%
$$ plain form
-3760 59 59 59 58 58 58 58 58 58 58 59 59 59 59 59 59 59 59 59 59 59 58 58 57 57 57 57 57 57 57 57 57 57 57 56 56 56 56 57 57 57 57 57 57 57 58 58 59 59 59 60 60 60 60 59 59 59 59 59 58 58 58 58 58 58 58 58 59 59 59
-3808 59 59 59 59 59 59 59 59 59 59 59 59 59 59 59 59 59 58 58 58 59 59 59 59 59 60 60 60 59 59 59 59 59 58 58 58 58 57 57 57 56 56 56 56 56 56 56 56 56 56 57 57 56 56 56 55 55 55 55 55 55 55 55 55 56 56 56 56 56 56
-3856 56 55 55 55 55 55 55 55 55 54 55 55 55 55 55 56 56 56 56 56 56 56 56 56 57 57 57 57 57 57 57 57 57 57 57 58 58 58 58 58 57 57 57 57 56 56 56 57 57 57 57 57 57 57 56 56 56 56 56 56 56 56 56 56 56 56 56 56 56 56
-3904 56 56 56 56 56 57 57 57 57 57 57 57 57 57 57 56 56 56 56 56 56 56 56 56 56 56 56 56 56 55 55 55 54 54 55 55 55 55 55 55 56 56 56 56 56 56 56 55 55 56 56 56 56 57 57 57 57 57 57 57 57 57 57 57 57 57 56 56 56 56
-3952 56 55 55 54 54 54 54 54 54 54 55 55 55 55 55 55 55 54 54 54 54 54 54 54 54 54 54 54 54 54 54 54 54 54 54 55 55 55 55 55 55 55 55 55 55 54 54 54 54 54 54 54 55 55 55 55 55 55 55 55 55 55 55 55 55 55 55 55 55 54
-4000 54 54 54 54 53 53 53 53 53 54 54 54 54 53 53 53 53 53 54 54 54 54 54 54 54 54 54 53 53 53 53 53 53 53 53 54 54 54 54 55 55 55 55 54 55 55 55 55 55 55 55 55 55 55 54 54 54 54 54 54 54 54 54 54 55 54 54 54 54 53
-4047 53 53 53 54 53 53 53 53 53 53 53 53 53 53 53 53 53 53 53 54 54 55 55 55 55 55 55 54 54 54 54 55 55 55 54 54 53 53 53 53 53 53 53 53 53 53 53 54 54 54 55 55 55 55 55 55 55 55 55 55 55 55 55 55 55 55 55 55 55 54
-4095 54 54 54 54 54 54 54 54 54 54 54 55 55 55 55 55 55 54 54 53 53 53 53 53 53 54 54 54 54 54 54 54 54 54 54 55 55 56 56 57 57 57 56 56 56 56 56 55 55 54 54 54 54 54 53 53 53 52 52 52 52 52 51 51 51 51 51 51 52 52
-4143E2JJ%%J%%%j%%%%%%%%%%%j%%%%J%%j%%%%%%%%%j%%%%%j%j%%%%%%%%j%j%%%%%%%J%%%
-4191D9%%%%%%J%%J%%%%%%J%%%%Jj%%%J%%%%%%jjj%%J%%%%%%Jj%%%%%%j%j%j%%%%%%%JJ%J
-4239E1j%%%j%%%%J%J%%j%%%J%%J%J%%%%%%%%j%%j%%%j%%j%%%jJ%JJJJ%%%%%%j%%%J%%%j%
-4287E2J%%%%%%%%j%%%J%%%%%%%%J%%%j%%%%j%%%j%%%%%%%j%%%%J%%%%jj%j%j%%%J%%%%%J
-4335D9%%J%J%%%%j%%j%%%%%%%J%J%%j%%%%%%%%jJ%%J%%j%%%j%%%%%%j%%%%%%%%%jJ%%%%j
-4382D7%%%%%%%%j%%J%%%%%%J%%%J%%%%%%%%%%Jj%%%%%j%%%%%%%%%%%%j%J%%%%%j%%%%%J%
-4430D8J%%%Jj%%j%%j%%%%%%%%%%%%%%%%J%%%%J%%%%j%%j%%%j%%%%J%%J%%%%%%%%%j%%%%%
-4478D7%%%%J%%%%%%j%%%J%%j%jj%Jj%%%%%%%j%%%J%J%J%J%%%j%%J%%%%%jJ%j%%%j%%%J%%
$$ plain form
-4143 52 53 54 54 54 55 55 55 55 54 54 54 54 54 54 54 54 54 54 54 54 53 53 53 53 53 54 54 54 53 53 53 53 53 53 53 53 53 53 52 52 52 52 52 52 51 51 50 50 50 50 50 50 50 50 50 49 49 48 48 48 48 48 48 48 48 49 49 49 49
-4191 49 49 49 49 49 49 49 50 50 50 51 51 51 51 51 51 51 52 52 52 52 52 53 52 52 52 52 53 53 53 53 53 53 53 52 51 50 50 50 51 51 51 51 51 51 51 52 51 51 51 51 51 51 51 50 50 49 49 48 48 48 48 48 48 48 48 49 50 50 51
-4239 51 50 50 50 50 49 49 49 49 49 50 50 51 51 51 50 50 50 50 51 51 51 52 52 53 53 53 53 53 53 53 53 53 52 52 52 51 51 51 51 50 50 50 49 49 49 49 48 49 49 50 51 52 53 53 53 53 53 53 53 52 52 52 52 53 53 53 53 52 52
-4287 52 53 53 53 53 53 53 53 53 53 52 52 52 52 53 53 53 53 53 53 53 53 53 54 54 54 54 53 53 53 53 53 52 52 52 52 51 51 51 51 51 51 51 51 50 50 50 50 50 51 51 51 51 51 50 49 49 48 48 47 47 47 47 48 48 48 48 48 48 49
-4335 49 49 49 50 50 51 51 51 51 51 50 50 50 49 49 49 49 49 49 49 49 50 50 51 51 51 50 50 50 50 50 50 50 50 50 49 50 50 50 51 51 51 50 50 50 50 49 49 49 49 49 49 49 48 48 48 48 48 48 48 48 48 48 47 48 48 48 48 48 47
-4382 47 47 47 47 47 47 47 47 47 46 46 46 47 47 47 47 47 47 47 48 48 48 48 49 49 49 49 49 49 49 49 49 49 49 50 49 49 49 49 49 49 48 48 48 48 48 48 48 48 48 48 48 48 48 47 47 48 48 48 48 48 48 47 47 47 47 47 47 48 48
-4430 48 49 49 49 49 50 49 49 49 48 48 48 47 47 47 47 47 47 47 47 47 47 47 47 47 47 47 47 47 48 48 48 48 48 49 49 49 49 49 48 48 48 47 47 47 47 46 46 46 46 46 47 47 47 48 48 48 48 48 48 48 48 48 48 47 47 47 47 47 47
-4478 47 47 47 47 47 48 48 48 48 48 48 48 47 47 47 47 48 48 48 47 47 46 45 45 46 45 45 45 45 45 45 45 45 44 44 44 44 45 45 46 46 47 47 48 48 48 48 47 47 47 48 48 48 48 48 48 47 48 48 47 47 47 47 46 46 46 46 47 47 47
-4526D7J%J%%%j%%%%%J%%%%%%j%%%%J%%j%j%j%j%%J%%J%J%J%%%j%j%%j%%%%%%J%%J%%J%%%
-4574D9%%j%j%j%%J%%%%jj%%%%%%%%%%J%J%%%%%j%j%%%%%J%%%jj%%%%J%%%J%%J%%%%%%%%%
-4622D7j%%%%%%J%%%%%%j%%%%J%%J%%%%%%%jjj%%%%%%J%%j%%%j%%%%%J%%J%%%%%%j%%%j%%
-4670D4%J%%%%%%%%%%%%%%%J%%%j%%%J%%%%%%%j%%%%%%%%J%%j%%%%%%%%%J%%%%%%%%%J%%%
-4717D7%J%j%%%j%%%%%%%%%%%%%j%%j%%j%J%%%J%%j%%%%%%%%%%%%%jJ%%J%J%J%%%%%%%%j%
-4765D6j%%%%%j%%%%%%J%%%%%%%%j%%j%%%%%%%%%%J%%J%%J%J%J%%J%%%%%%j%jj%%%%j%%Jj
-4813D5%%%%j%%%%%j%%%%%%%%j%%%%%%%J%J%%J%%%%%%%%%%%%j%%j%%%%%%%%%j%%%J%%J%%J
-4861D5J%%%%j%%%%%%%%%%%%%%%%J%%%j%%%%%%%%%%%j%%%J%%%%%%%%%j%%%%J%%%%%%%j%%%
$$ plain form
-4526 47 48 48 49 49 49 49 48 48 48 48 48 48 49 49 49 49 49 49 49 48 48 48 48 48 49 49 49 48 48 47 47 46 46 45 45 45 46 46 46 47 47 48 48 49 49 49 49 48 48 47 47 47 46 46 46 46 46 46 46 47 47 47 48 48 48 49 49 49 49
-4574 49 49 49 48 48 47 47 46 46 46 47 47 47 47 47 46 45 45 45 45 45 45 45 45 45 45 45 46 46 47 47 47 47 47 47 46 46 45 45 45 45 45 45 46 46 46 46 45 44 44 44 44 44 45 45 45 45 46 46 46 47 47 47 47 47 47 47 47 47 47
-4622 47 46 46 46 46 46 46 46 47 47 47 47 47 47 47 46 46 46 46 46 47 47 47 48 48 48 48 48 48 48 48 47 46 45 45 45 45 45 45 45 46 46 46 45 45 45 45 44 44 44 44 44 44 45 45 45 46 46 46 46 46 46 46 45 45 45 45 44 44 44
-4670 44 44 45 45 45 45 45 45 45 45 45 45 45 45 45 45 45 45 46 46 46 46 45 45 45 45 46 46 46 46 46 46 46 46 45 45 45 45 45 45 45 45 45 46 46 46 45 45 45 45 45 45 45 45 45 45 46 46 46 46 46 46 46 46 46 46 47 47 47 47
-4717 47 47 48 48 47 47 47 47 46 46 46 46 46 46 46 46 46 46 46 46 46 46 45 45 45 44 44 44 43 43 44 44 44 44 45 45 45 44 44 44 44 44 44 44 44 44 44 44 44 44 44 43 44 44 44 45 45 46 46 47 47 47 47 47 47 47 47 47 46 46
-4765 46 45 45 45 45 45 45 44 44 44 44 44 44 44 45 45 45 45 45 45 45 45 45 44 44 44 43 43 43 43 43 43 43 43 43 43 43 44 44 44 45 45 45 46 46 47 47 48 48 48 49 49 49 49 49 49 49 48 48 47 46 46 46 46 46 45 45 45 46 45
-4813 45 45 45 45 45 44 44 44 44 44 44 43 43 43 43 43 43 43 43 43 42 42 42 42 42 42 42 42 43 43 44 44 44 45 45 45 45 45 45 45 45 45 45 45 45 45 44 44 44 43 43 43 43 43 43 43 43 43 43 42 42 42 42 43 43 43 44 44 44 45
-4861 45 46 46 46 46 46 45 45 45 45 45 45 45 45 45 45 45 45 45 45 45 45 45 46 46 46 46 45 45 45 45 45 45 45 45 45 45 45 45 44 44 44 44 45 45 45 45 45 45 45 45 45 45 44 44 44 44 44 45 45 45 45 45 45 45 45 44 44 44 44
-4909D4J%%%%%%J%%%%%%%%J%%%j%j%%j%j%%j%%jJ%%%J%%%%j%%%%%%%%%%%%J%%%%J%%J%%%J
-4957D6j%j%jj%%%J%%%%%%J%%%%%%%%j%j%%%%%%%%%J%%%j%%%%%J%%%J%%%%J%%%%%%%%%j%%
-5005D4j%%%%%%J%%%%%%%%j%%%%%%%%%%%%%J%%%%%%%j%%j%j%J%J%%Jj%%%J%j%%%j%%J%%%%
-5052D3j%JJ%%%j%j%%%%JJ%%%%%%%j%j%%%%%%%J%%%%%%%%%%j%%%%%J%%%%j%%%%J%%%J%j%%
-5100D3%jJ%%J%%j%j%%j%%%J%%J%j%%%%%%%j%J%%%%J%%%j%jJ%%J%%%%%J%%%j%%j%j%%%%%%
-5148D1%J%J%J%%%J%%j%%j%%%%%%%%%%%%%J%%%%%J%%%%%j%%%j%jj%j%J%JJ%%%%%%%%%%%j%
-5196D2%%%j%%%%%%%J%%%%%J%J%%J%j%%%%%%%%%%%%%j%j%j%%%%%%%%%%%%%%%%%%%%%%J%%%
-5244D2%%%J%%%%%%%jJ%%%%%%j%%%%%j%%%j%%%J%%%%J%J%%%%j%j%%%%%%%j%%%%%%J%%%J%%
$$ plain form
-4909 44 45 45 45 45 45 45 45 46 46 46 46 46 46 46 46 46 47 47 47 47 46 46 45 45 45 44 44 43 43 43 42 42 42 41 42 42 42 42 43 43 43 43 43 42 42 42 42 42 42 42 42 42 42 42 42 42 43 43 43 43 43 44 44 44 45 45 45 45 46
-4957 46 45 45 44 44 43 42 42 42 42 43 43 43 43 43 43 43 44 44 44 44 44 44 44 44 44 43 43 42 42 42 42 42 42 42 42 42 42 43 43 43 43 42 42 42 42 42 42 43 43 43 43 44 44 44 44 44 45 45 45 45 45 45 45 45 45 45 44 44 44
-5005 44 43 43 43 43 43 43 43 44 44 44 44 44 44 44 44 44 43 43 43 43 43 43 43 43 43 43 43 43 43 43 44 44 44 44 44 44 44 44 43 43 43 42 42 41 41 42 42 43 43 43 44 43 43 43 43 44 44 43 43 43 43 42 42 42 43 43 43 43 43
-5052 43 42 42 43 44 44 44 44 43 43 42 42 42 42 42 43 44 44 44 44 44 44 44 44 43 43 42 42 42 42 42 42 42 42 43 43 43 43 43 43 43 43 43 43 43 42 42 42 42 42 42 43 43 43 43 43 42 42 42 42 42 43 43 43 43 44 44 43 43 43
-5100 43 43 42 43 43 43 44 44 44 43 43 42 42 42 41 41 41 41 42 42 42 43 43 42 42 42 42 42 42 42 42 41 41 42 42 42 42 42 43 43 43 43 42 42 41 42 42 42 43 43 43 43 43 43 44 44 44 44 43 43 43 42 42 41 41 41 41 41 41 41
-5148 41 41 42 42 43 43 44 44 44 44 45 45 45 44 44 44 43 43 43 43 43 43 43 43 43 43 43 43 43 43 44 44 44 44 44 44 45 45 45 45 45 45 44 44 44 44 43 43 42 41 41 40 40 41 41 42 43 43 43 43 43 43 43 43 43 43 43 43 42 42
-5196 42 42 42 42 41 41 41 41 41 41 41 41 42 42 42 42 42 42 43 43 44 44 44 45 45 44 44 44 44 44 44 44 44 44 44 44 44 44 44 43 43 42 42 41 41 41 41 41 41 41 41 41 41 41 41 41 41 41 41 41 41 41 41 41 41 41 42 42 42 42
-5244 42 42 42 42 43 43 43 43 43 43 43 43 42 43 43 43 43 43 43 43 42 42 42 42 42 42 41 41 41 41 40 40 40 40 41 41 41 41 41 42 42 43 43 43 43 43 42 42 41 41 41 41 41 41 41 41 40 40 40 40 40 40 40 41 41 41 41 42 42 42
-5292D2%%%%%J%%%%J%%%%%%%%%%%%%%j%%%%%%j%j%%j%%%%%J%J%%%%%%j%%%%j%J%%%J%%J%%
-5340D3%%%%%%%%%%%%%Jj%%%%%%j%%%%%%%%%%j%%%%j%J%%%J%%%%%%%%%%%%%%j%%%%%%%%%j
-5387D0%%%j%%%j%%%JJJ%%%%%%%j%%%%%%%%%%J%%%J%%%%%%j%%J%%%%%Jj%%%%%%%%%j%%%%%
-5435D1%%%%%%j%%%%%%%%%%%%%%%J%%%j%%%%%%%%j%%j%%%JJ%J%%J%%J%%%%%%%%%j%%%j%%%
-5483D1%%j%%%%j%%%%j%%%%%%J%%%%%j%%%%%%%%%%%%j%%%%J%%%%%%J%%J%%J%%%%%%j%%%%%
-5531D0%%j%%%%%J%J%Jj%%%%%%%%%j%%%j%%j%j%%%J%%%J%%J%%%%J%j%%j%%J%J%%%j%j%%%%
-5579C9%%%%%%%J%%%%%%%%%%%%%%%J%j%%%%j%%%%j%%%j%J%%J%%J%J%%%%%%%%j%%%J%%j%jj
-5627C8%%j%j%%j%%%J%%J%%%%%%%%%%%%%J%%%J%%%J%%%%j%%%%J%%%%jJ%%J%J%%%%%%j%%j%
$$ plain form
-5292 42 42 42 42 42 42 43 43 43 43 43 44 44 44 44 44 44 44 44 44 44 44 44 44 44 44 43 43 43 43 43 43 43 42 42 41 41 41 40 40 40 40 40 40 41 41 42 42 42 42 42 42 42 41 41 41 41 41 40 40 41 41 41 41 42 42 42 43 43 43
-5340 43 43 43 43 43 43 43 43 43 43 43 43 43 43 44 43 43 43 43 43 43 43 42 42 42 42 42 42 42 42 42 42 42 41 41 41 41 41 40 40 41 41 41 41 42 42 42 42 42 42 42 42 42 42 42 42 42 42 42 41 41 41 41 41 41 41 41 41 41 40
-5387 40 40 40 40 39 39 39 39 38 38 38 38 39 40 41 41 41 41 41 41 41 41 40 40 40 40 40 40 40 40 40 40 40 41 41 41 41 42 42 42 42 42 42 42 41 41 41 42 42 42 42 42 42 43 42 42 42 42 42 42 42 42 42 42 41 41 41 41 41 41
-5435 41 41 41 41 41 41 41 40 40 40 40 40 40 40 40 40 40 40 40 40 40 40 40 41 41 41 41 40 40 40 40 40 40 40 40 40 39 39 39 38 38 38 38 39 40 40 41 41 41 42 42 42 43 43 43 43 43 43 43 43 43 43 42 42 42 42 41 41 41 41
-5483 41 41 41 40 40 40 40 40 39 39 39 39 39 38 38 38 38 38 38 38 39 39 39 39 39 39 38 38 38 38 38 38 38 38 38 38 38 38 38 37 37 37 37 37 38 38 38 38 38 38 38 39 39 39 40 40 40 41 41 41 41 41 41 41 40 40 40 40 40 40
-5531 40 40 40 39 39 39 39 39 39 40 40 41 41 42 41 41 41 41 41 41 41 41 41 41 40 40 40 40 39 39 39 38 38 37 37 37 37 38 38 38 38 39 39 39 40 40 40 40 40 41 41 40 40 40 39 39 39 40 40 41 41 41 41 40 40 39 39 39 39 39
-5579 39 39 39 39 39 39 39 39 40 40 40 40 40 40 40 40 40 40 40 40 40 40 40 40 41 41 40 40 40 40 40 39 39 39 39 39 38 38 38 38 37 37 38 38 38 39 39 39 40 40 41 41 41 41 41 41 41 41 41 40 40 40 40 41 41 41 40 40 39 38
-5627 38 38 38 37 37 36 36 36 35 35 35 35 36 36 36 37 37 37 37 37 37 37 37 37 37 37 37 37 37 38 38 38 38 39 39 39 39 40 40 40 40 40 39 39 39 39 39 40 40 40 40 40 39 40 40 40 41 41 42 42 42 42 42 42 42 41 41 41 40 40
-5675D0%j%%%%%%J%J%%%%%j%%%%%J%%%%j%%J%%%%j%%%%J%%%%%%j%%j%%j%%%J%%%%%%%%%j%
-5722C8%%%%j%%%%%%Jj%%%J%%%%%%J%%%%J%%%%%%%%j%%%%%%%%%%%%J%%j%%%%%%%%%%%%%%j
-5770C8%%%%%%j%%j%%%j%J%%%%%J%J%%%%%%%%%%j%%%%%%%%%%%%J%%J%%%%%%j%%%%%j%%%%J
-5818C8%%%%%%%J%J%%j%%%%%%%j%%j%j%%j%%%%%JJ%%J%j%j%%%%%%%%%%%%Jj%%%%%%%%J%%%
-5866C7%%%%%%%%%%%J%J%%%jj%jJ%J%J%J%%%j%%%J%%j%%%%j%%%%%%%%%%j%%%%%%%%%%J%%%
-5914C8%%%%%%%%%%J%J%%%%J%%%%j%%%j%%%%%%%j%%%%%%%%%%%j%%%%%%%%%%jJ%%%%%%%%j%
-5962C6%%%%%%%%JJJ%%%%%%%%%%j%%%%j%jj%%%%%%%J%%J%%%%J%%%%%%%%%%j%%j%%J%%%%%J
-6010C8j%%%%%%%%j%%%jJ%%%%J%%%%%%%%%%%%%J%%%%j%%%%%j%J%%JJ%%%j%%%j%%%%%J%%%%
$$ plain form
-5675 40 40 39 39 39 39 39 39 39 40 40 41 41 41 41 41 41 40 40 40 40 40 40 41 41 41 41 41 40 40 40 41 41 41 41 41 40 40 40 40 40 41 41 41 41 41 41 41 40 40 40 39 39 39 38 38 38 38 39 39 39 39 39 39 39 39 39 39 38 38
-5722 38 38 38 38 38 37 37 37 37 37 37 37 38 37 37 37 37 38 38 38 38 38 38 38 39 39 39 39 39 40 40 40 40 40 40 40 40 40 39 39 39 39 39 39 39 39 39 39 39 39 39 40 40 40 39 39 39 39 39 39 39 39 39 39 39 39 39 39 39 38
-5770 38 38 38 38 38 38 38 37 37 37 36 36 36 36 35 35 36 36 36 36 36 36 37 37 38 38 38 38 38 38 38 38 38 38 38 37 37 37 37 37 37 37 37 37 37 37 37 37 38 38 38 39 39 39 39 39 39 39 38 38 38 38 38 38 37 37 37 37 37 38
-5818 38 38 38 38 38 38 38 38 39 39 40 40 40 39 39 39 39 39 39 39 39 38 38 38 37 37 36 36 36 35 35 35 35 35 35 36 37 37 37 38 38 37 37 36 36 36 36 36 36 36 36 36 36 36 36 36 37 36 36 36 36 36 36 36 36 36 37 37 37 37
-5866 37 37 37 37 37 37 37 37 37 37 37 37 38 38 39 39 39 39 38 37 37 36 37 37 38 38 39 39 40 40 40 40 39 39 39 39 40 40 40 39 39 39 39 39 38 38 38 38 38 38 38 38 38 38 38 37 37 37 37 37 37 37 37 37 37 37 38 38 38 38
-5914 38 38 38 38 38 38 38 38 38 38 38 39 39 40 40 40 40 40 41 41 41 41 41 40 40 40 40 39 39 39 39 39 39 39 39 38 38 38 38 38 38 38 38 38 38 38 38 37 37 37 37 37 37 37 37 37 37 37 36 37 37 37 37 37 37 37 37 37 36 36
-5962 36 36 36 36 36 36 36 36 36 37 38 39 39 39 39 39 39 39 39 39 39 39 38 38 38 38 38 37 37 36 35 35 35 35 35 35 35 35 36 36 36 37 37 37 37 37 38 38 38 38 38 38 38 38 38 38 38 37 37 37 36 36 36 37 37 37 37 37 37 38
-6010 38 37 37 37 37 37 37 37 37 37 36 36 36 36 35 36 36 36 36 36 37 37 37 37 37 37 37 37 37 37 37 37 37 37 38 38 38 38 38 37 37 37 37 37 37 36 36 37 37 37 38 39 39 39 39 38 38 38 38 37 37 37 37 37 37 38 38 38 38 38
-6057C8%%%%%J%j%%%j%%%%%%%%%%%J%%%%%J%%%%%%j%%%J%%%%%%%j%%%%%%%j%%%%%j%%%J%%
-6105C7%%j%%%%j%%J%%%j%J%%%%j%%%%%%J%%%%%%%%j%%%%J%%%%%J%%%%J%%J%%%%%%%%%%%%
-6153C9%%%%%%j%j%%%%j%%%%%%jJ%%%%%%%%%%%J%%%%%%%j%%%J%J%%J%%%%%%j%%%%%J%%%%j
-6201C8%%%%%%%%%%%%%%%j%jj%jJ%JJJJ%%%%%%%%%%j%%j%%J%%%%%%j%%%%J%%%%%%j%%%%%j
-6249C6%%%%%j%J%%J%J%%J%j%%j%%j%j%j%%J%%J%%%%%%J%%%J%%%%%%%%%j%%%%j%%%%%%%%%
-6297C6%jJ%%J%%jj%j%j%J%J%%J%j%J%%JJ%J%%j%j%j%%%%%%%j%%j%%%%%J%J%J%j%%%%%%%j
-6345C5%%%%%%%%%%%%%%J%J%%%J%%%%j%j%%%j%%%%%j%%J%%%%%%%%%J%%%%%%%%%%%%%%%%%%
-6392C6%%%%jJj%%%%%j%%%j%%%%%%%%%%%%J%%%J%J%j%%%J%%%%j%%%%%%%j%J%%%J%%%%%J%%
$$ plain form
-6057 38 38 38 38 38 38 39 39 38 38 38 38 37 37 37 37 37 37 37 37 37 37 37 37 38 38 38 38 38 38 39 39 39 39 39 39 39 38 38 38 38 39 39 39 39 39 39 39 39 38 38 38 38 38 38 38 38 37 37 37 37 37 37 36 36 36 36 37 37 37
-6105 37 37 37 36 36 36 36 36 35 35 35 36 36 36 36 35 35 36 36 36 36 36 35 35 35 35 35 35 35 36 36 36 36 36 36 36 36 36 35 35 35 35 35 36 36 36 36 36 36 37 37 37 37 37 38 38 38 39 39 39 39 39 39 39 39 39 39 39 39 39
-6153 39 39 39 39 39 39 39 38 38 37 37 37 37 37 36 36 36 36 36 36 36 35 36 36 36 36 36 36 36 36 36 36 36 36 37 37 37 37 37 37 37 37 36 36 36 36 37 37 38 38 38 39 39 39 39 39 39 39 38 38 38 38 38 38 39 39 39 39 39 38
-6201 38 38 38 38 38 38 38 38 38 38 38 38 38 38 38 38 37 37 36 35 35 34 35 35 36 37 38 39 39 39 39 39 39 39 39 39 39 39 38 38 38 37 37 37 38 38 38 38 38 38 38 37 37 37 37 37 38 38 38 38 38 38 38 37 37 37 37 37 37 36
-6249 36 36 36 36 36 36 35 35 36 36 36 37 37 38 38 38 39 39 38 38 38 37 37 37 36 36 35 35 34 34 34 35 35 35 36 36 36 36 36 36 36 37 37 37 37 38 38 38 38 38 38 38 38 38 38 37 37 37 37 37 36 36 36 36 36 36 36 36 36 36
-6297 36 36 35 36 36 36 37 37 37 36 35 35 34 34 33 33 34 34 35 35 35 36 36 35 35 36 36 36 37 38 38 39 39 39 38 38 37 37 36 36 36 36 36 36 36 36 35 35 35 34 34 34 34 34 34 35 35 36 36 37 37 36 36 36 36 36 36 36 36 35
-6345 35 35 35 35 35 35 35 35 35 35 35 35 35 35 35 36 36 37 37 37 37 38 38 38 38 38 37 37 36 36 36 36 35 35 35 35 35 35 34 34 34 35 35 35 35 35 35 35 35 35 35 36 36 36 36 36 36 36 36 36 36 36 36 36 36 36 36 36 36 36
-6392 36 36 36 36 36 35 36 35 35 35 35 35 35 34 34 34 34 33 33 33 33 33 33 33 33 33 33 33 33 33 34 34 34 34 35 35 36 36 35 35 35 35 36 36 36 36 36 35 35 35 35 35 35 35 35 34 34 35 35 35 35 36 36 36 36 36 36 37 37 37
-6440C7%%%j%%%%%%J%%%%j%%jJ%%%%%%%%%%%%%%j%%%%%%%%%%%%%J%J%%%%%%%%j%%%%%%%%%
-6488C6%%%%%%%%%%%%%%%%j%%%%JJ%J%%%%%%j%%j%%%%%%%%%%%%%%%%%%%%%%j%%j%%%%%%%%
-6536C4%%%J%%%J%%%%%%%%%%%%%%%%%%%%%%%j%%%%%J%%%%%%%%%%%J%%J%%%%%j%%%%%J%%%%
-6584C8j%%%j%jj%%%%%%%jJ%%J%%J%%%%%%%%%%%j%%%%%J%%%%%%j%J%%%j%%%%%j%%%%%%%%%
-6632C4J%%%J%%%%%%%J%J%%j%j%%j%%J%j%j%j%%%%%%%%%%J%J%J%%J%%%J%%%j%j%%%%%%j%%
-6680C5%%%%J%%j%j%%%%%%%%j%%%%%%%J%%%%%j%%%j%%%J%J%%Jj%%j%%%%%%j%J%%%%%%%%%j
-6727C2%%J%%J%%%%%J%%%%%%%%j%%%%%%%Jj%%%%jJ%%J%%%%%%j%%j%j%%%%%J%%%J%%J%%%%%
-6775C5%%J%%%j%%%%%%%J%J%%%%%%%%%%%%%j%%%%%J%%j%jj%j%%%%%J%%%%%%J%%%%%%%%%%j
$$ plain form
-6440 37 37 37 37 36 36 36 36 36 36 36 37 37 37 37 37 36 36 36 35 36 36 36 36 36 36 36 36 36 36 36 36 36 36 36 35 35 35 35 35 35 35 35 35 35 35 35 35 35 36 36 37 37 37 37 37 37 37 37 37 36 36 36 36 36 36 36 36 36 36
-6488 36 36 36 36 36 36 36 36 36 36 36 36 36 36 36 36 36 35 35 35 35 35 36 37 37 38 38 38 38 38 38 38 37 37 37 36 36 36 36 36 36 36 36 36 36 36 36 36 36 36 36 36 36 36 36 36 36 36 35 35 35 34 34 34 34 34 34 34 34 34
-6536 34 34 34 34 35 35 35 35 36 36 36 36 36 36 36 36 36 36 36 36 36 36 36 36 36 36 36 36 36 36 36 36 35 35 35 35 35 35 36 36 36 36 36 36 36 36 36 36 36 36 37 37 37 38 38 38 38 38 38 37 37 37 37 37 37 38 38 38 38 38
-6584 38 37 37 37 37 36 36 35 34 34 34 34 34 34 34 34 33 34 34 34 35 35 35 36 36 36 36 36 36 36 36 36 36 36 36 35 35 35 35 35 35 36 36 36 36 36 36 36 35 35 36 36 36 36 35 35 35 35 35 35 34 34 34 34 34 34 34 34 34 34
-6632 34 35 35 35 35 36 36 36 36 36 36 36 36 37 37 38 38 38 37 37 36 36 36 35 35 35 36 36 35 35 34 34 33 33 33 33 33 33 33 33 33 33 33 34 34 35 35 36 36 36 37 37 37 37 38 38 38 38 37 37 36 36 36 36 36 36 36 35 35 35
-6680 35 35 35 35 35 36 36 36 35 35 34 34 34 34 34 34 34 34 34 33 33 33 33 33 33 33 33 34 34 34 34 34 34 33 33 33 33 32 32 32 32 33 33 34 34 34 35 34 34 34 33 33 33 33 33 33 33 32 32 33 33 33 33 33 33 33 33 33 33 32
-6727 32 32 32 33 33 33 34 34 34 34 34 34 35 35 35 35 35 35 35 35 35 34 34 34 34 34 34 34 34 35 34 34 34 34 34 33 34 34 34 35 35 35 35 35 35 35 34 34 34 33 33 32 32 32 32 32 32 33 33 33 33 34 34 34 35 35 35 35 35 35
-6775 35 35 35 36 36 36 36 35 35 35 35 35 35 35 35 36 36 37 37 37 37 37 37 37 37 37 37 37 37 37 37 36 36 36 36 36 36 37 37 37 36 36 35 34 34 33 33 33 33 33 33 34 34 34 34 34 34 34 35 35 35 35 35 35 35 35 35 35 35 34
-6823C4%%%%%%%%j%%%%j%%%J%%%%%%jJ%%J%J%%%j%%%%%%%J%J%j%%%%%%%%%%%%%%%%%J%%%J
-6871C7%%%%j%j%%%%%%%%jJ%%J%%%%J%j%j%%j%%%%%%%%%%j%%J%%%%%%%%%%%%%j%%j%J%%%%
-6919C3%%%%%%J%%%J%%J%%j%j%%%j%j%jj%%%JJ%J%J%%%%%j%%%%%J%%%J%%J%%J%j%j%%%%J%
-6967C6%%%%j%%%j%%j%%%%J%%%J%%%J%%%%j%j%%%%%%%%%%%J%%%J%%j%%%%%%%j%j%%%%%J%%
-7015C4%%%J%%%%J%%%%%%%%%%%%%%%%%J%j%%j%%%%J%J%%%%j%%%j%%%j%%J%%%%j%%%%%%%%%
-7062C4j%j%%%%%j%%%%jJ%JJJJ%%%j%%%%%%%J%%J%%j%%j%J%%%J%%%%j%%%%%%J%%%j%%%%%%
-7110C5%%%%%%%%%%%%%%%%%%J%%%%j%%j%%%%%%%%%%%%%%%%J%%%%j%J%%j%%%%%%%%J%%%%%j
-7158C4%%jj%j%%%%%J%%J%J%J%%J%J%j%%%%%J%%%Jj%%j%j%%%%J%j%%%%%%%%%%%%%%%%%%%J
$$ plain form
-6823 34 34 34 34 34 34 34 34 34 33 33 33 33 33 32 32 32 32 33 33 33 33 33 33 33 32 33 33 33 34 34 35 35 35 35 34 34 34 34 34 34 34 34 35 35 36 36 35 35 35 35 35 35 35 35 35 35 35 35 35 35 35 35 35 35 36 36 36 36 37
-6871 37 37 37 37 37 36 36 35 35 35 35 35 35 35 35 35 34 35 35 35 36 36 36 36 36 37 37 36 36 35 35 35 34 34 34 34 34 34 34 34 34 34 34 33 33 33 34 34 34 34 34 34 34 34 34 34 34 34 34 34 33 33 33 32 32 33 33 33 33 33
-6919 33 33 33 33 33 33 33 34 34 34 34 35 35 35 36 36 36 35 35 34 34 34 34 33 33 32 32 31 30 30 30 30 31 32 32 33 33 34 34 34 34 34 34 33 33 33 33 33 33 34 34 34 34 35 35 35 36 36 36 37 37 36 36 35 35 35 35 35 36 36
-6967 36 36 36 36 36 35 35 35 35 34 34 34 33 33 33 33 33 34 34 34 34 35 35 35 35 36 36 36 36 36 35 35 34 34 34 34 34 34 34 34 34 34 34 34 35 35 35 35 36 36 36 35 35 35 35 35 35 35 35 34 34 33 33 33 33 33 33 34 34 34
-7015 34 34 34 34 35 35 35 35 35 36 36 36 36 36 36 36 36 36 36 36 36 36 36 36 36 36 36 37 37 36 36 36 35 35 35 35 35 36 36 37 37 37 37 37 36 36 36 36 35 35 35 35 34 34 34 35 35 35 35 35 34 34 34 34 34 34 34 34 34 34
-7062 34 33 33 32 32 32 32 32 32 31 31 31 31 31 30 31 31 32 33 34 35 35 35 35 34 34 34 34 34 34 34 34 35 35 35 36 36 36 35 35 35 34 34 35 35 35 35 36 36 36 36 36 35 35 35 35 35 35 35 36 36 36 36 35 35 35 35 35 35 35
-7110 35 35 35 35 35 35 35 35 35 35 35 35 35 35 35 35 35 35 35 36 36 36 36 36 35 35 35 34 34 34 34 34 34 34 34 34 34 34 34 34 34 34 34 34 35 35 35 35 35 34 34 35 35 35 34 34 34 34 34 34 34 34 34 35 35 35 35 35 35 34
-7158 34 34 34 33 32 32 31 31 31 31 31 31 32 32 32 33 33 34 34 35 35 35 36 36 37 37 36 36 36 36 36 36 37 37 37 37 38 37 37 37 36 36 35 35 35 35 35 36 36 35 35 35 35 35 35 35 35 35 35 35 35 35 35 35 35 35 35 35 35 36
-7206C6%%%%J%%%j%jj%%%J%%%%%j%%%%%%J%%J%%j%%j%J%%j%%%%%%%%%jJ%%J%J%J%j%%%%%%
-7254C6%j%%%%j%j%j%%j%%jJ%%%%J%%%%%%%%j%J%%%%%J%%%%J%%j%%J%%J%%J%%%j%%%%%J%%
-7302C6j%j%%%%%%%%%%%%%%%%%%%%j%j%%%%J%%%J%%%%%%%%%J%%%j%%%%%J%%%%%%%%%%%j%%
-7350C4%j%%%%%%%J%%%%%%j%%%%%%%%j%J%%%%%%%%%%%Jj%%%%jJ%%%%%j%j%j%%%%J%J%J%%J
-7397C4JJ%%%j%jj%j%%J%%j%%%%%%%%J%%%%%j%%%%J%%j%%%j%%%%%J%%%%%%%%J%%j%%%%%%%
-7445C2%jJ%J%%J%%%%%j%%%%%%%%J%%%%%%%%j%%j%%%J%J%J%%j%%j%%%%%%%%%%%J%%j%%%%%
-7493C3J%%%%%%J%j%%%%%%%%J%J%%%%%j%%%%%%j%%%%%%J%%J%%%j%%%%%j%%j%j%%%%%%%J%%
-7541C3%%%%J%j%%j%J%%J%%%%j%%%%%%J%%%%j%%%%%%%%%%%%%j%j%J%%%J%J%%%Jj%%%%%j%%
$$ plain form
-7206 36 36 36 36 36 37 37 37 37 36 36 35 34 34 34 34 35 35 35 35 35 35 34 34 34 34 34 34 34 35 35 35 36 36 36 35 35 35 34 34 35 35 35 34 34 34 34 34 34 34 34 34 34 33 34 34 34 35 35 36 36 37 37 36 36 36 36 36 36 36
-7254 36 36 35 35 35 35 35 34 34 33 33 32 32 32 31 31 31 30 31 31 31 31 31 32 32 32 32 32 32 32 32 32 31 31 32 32 32 32 32 32 33 33 33 33 33 34 34 34 33 33 33 34 34 34 35 35 35 36 36 36 36 35 35 35 35 35 35 36 36 36
-7302 36 35 35 34 34 34 34 34 34 34 34 34 34 34 34 34 34 34 34 34 34 34 34 34 33 33 32 32 32 32 32 33 33 33 33 34 34 34 34 34 34 34 34 34 34 35 35 35 35 34 34 34 34 34 34 35 35 35 35 35 35 35 35 35 35 35 35 34 34 34
-7350 34 34 33 33 33 33 33 33 33 33 34 34 34 34 34 34 34 33 33 33 33 33 33 33 33 33 32 32 33 33 33 33 33 33 33 33 33 33 33 33 34 33 33 33 33 33 32 33 33 33 33 33 33 32 32 31 31 30 30 30 30 30 31 31 32 32 33 33 33 34
-7397 34 35 36 36 36 36 35 35 34 33 33 32 32 32 33 33 33 32 32 32 32 32 32 32 32 32 33 33 33 33 33 33 32 32 32 32 32 33 33 33 32 32 32 32 31 31 31 31 31 31 32 32 32 32 32 32 32 32 32 33 33 33 32 32 32 32 32 32 32 32
-7445 32 32 31 32 32 33 33 33 34 34 34 34 34 34 33 33 33 33 33 33 33 33 33 34 34 34 34 34 34 34 34 34 33 33 33 32 32 32 32 33 33 34 34 35 35 35 34 34 34 33 33 33 33 33 33 33 33 33 33 33 33 34 34 34 33 33 33 33 33 33
-7493 33 34 34 34 34 34 34 34 35 35 34 34 34 34 34 34 34 34 34 35 35 36 36 36 36 36 36 35 35 35 35 35 35 35 34 34 34 34 34 34 34 35 35 35 36 36 36 36 35 35 35 35 35 35 34 34 34 33 33 32 32 32 32 32 32 32 32 33 33 33
-7541 33 33 33 33 33 34 34 33 33 33 32 32 33 33 33 34 34 34 34 34 33 33 33 33 33 33 33 34 34 34 34 34 33 33 33 33 33 33 33 33 33 33 33 33 33 33 32 32 31 31 32 32 32 32 33 33 34 34 34 34 35 34 34 34 34 34 34 33 33 33
-7589C3J%%%%%%%%%%%%J%%%%%%%j%%%j%%j%J%J%%%%%%%J%%%%%%%%%%%j%%%%%%j%%%%%J%%%
-7637C4%%J%%%%%%j%%j%%%%%J%%%j%j%%%%J%J%%%%%%j%%J%%%%%%j%j%%j%%%%%%%%J%%%J%%
-7685C3Jj%%jJ%%%%%%j%%%%J%%%%%%%%j%%%j%%j%%%%%%%J%J%%j%%%%%%J%%J%%j%%J%%%j%%
-7732C2%%%Jj%%%%%%%J%J%%%%%%J%%%j%j%%%%J%%J%%%%%J%j%jj%%%%J%Jj%%j%j%%%%%j%%%
-7780C1J%%J%%J%%j%%%%%%%%%%%%%%%%%%%%%%j%%%%%%%%%%%%%%j%%%%%%%%%%%%j%%J%%%%%
-7828C1%%%%%J%%%%%%j%%%%%%%%%J%%%%%%%%%J%%%j%%J%%J%j%%j%%j%%J%%J%%j%J%%J%%J%
-7876C5%%%j%%%%%%%%%j%j%%%%%%%J%j%%%j%%%%%%%%%%j%%%%%%%%%%%%%%%%%J%J%J%%%%%%
$$ plain form
-7589 33 34 34 34 34 34 34 34 34 34 34 34 34 34 35 35 35 35 35 35 35 35 34 34 34 34 33 33 33 32 32 33 33 34 34 34 34 34 34 34 34 35 35 35 35 35 35 35 35 35 35 35 35 34 34 34 34 34 34 34 33 33 33 33 33 33 34 34 34 34
-7637 34 34 34 35 35 35 35 35 35 35 34 34 34 33 33 33 33 33 33 34 34 34 34 33 33 32 32 32 32 32 33 33 34 34 34 34 34 34 34 33 33 33 34 34 34 34 34 34 34 33 33 32 32 32 31 31 31 31 31 31 31 31 31 32 32 32 32 33 33 33
-7685 33 34 33 33 33 32 33 33 33 33 33 33 33 32 32 32 32 32 33 33 33 33 33 33 33 33 33 32 32 32 32 31 31 31 30 30 30 30 30 30 30 30 31 31 32 32 32 31 31 31 31 31 31 31 32 32 32 33 33 33 32 32 32 33 33 33 33 32 32 32
-7732 32 32 32 32 33 32 32 32 32 32 32 32 32 33 33 34 34 34 34 34 34 34 35 35 35 35 34 34 33 33 33 33 33 34 34 34 35 35 35 35 35 35 36 36 35 35 34 33 33 33 33 33 34 34 35 34 34 34 33 33 32 32 32 32 32 32 31 31 31 31
-7780 31 32 32 32 33 33 33 34 34 34 33 33 33 33 33 33 33 33 33 33 33 33 33 33 33 33 33 33 33 33 33 33 33 32 32 32 32 32 32 32 32 32 32 32 32 32 32 32 31 31 31 31 31 31 31 31 31 31 31 31 31 30 30 30 31 31 31 31 31 31
-7828 31 31 31 31 31 31 32 32 32 32 32 32 32 31 31 31 31 31 31 31 31 31 31 32 32 32 32 32 32 32 32 32 32 33 33 33 33 32 32 32 33 33 33 34 34 33 33 33 32 32 32 31 31 31 32 32 32 33 33 33 32 32 33 33 33 34 34 34 35 35
-7876 35 35 35 35 34 34 34 34 34 34 34 34 34 34 33 33 32 32 32 32 32 32 32 32 33 33 32 32 32 32 31 31 31 31 31 31 31 31 31 31 31 30 30 30 30 30 30 30 30 30 30 30 30 30 30 30 30 30 30 31 31 32 32 33 33 33 33 33 33 33
$$ [...]
-45554b
##END=		$$ NMR SPECTRUM
##END=		$$ LINK
