##TITLE=	3QYWrB12T9arDJYM4383cQ.11.fid
##JCAMP-DX=	6.0	$$ MestReNova 14.3.3-33362
##DATA TYPE=	LINK
##BLOCKS=	1    
##ORIGIN=	Mestrelab Research S.L.
##OWNER=	hrzepa
##$MNOVA/METADATA=	(DOCUMENT,BASE64)
eyJuYW1lIjoiL1VzZXJzL2hyemVwYS9Eb3dubG9hZHMvSVVQQUMtRkFJUlNwZWMtbWFpbi8zOC1Db21
wbGV4ZXMvMzhmLzM4Zi1CLzM4Zi1CLm1ub3ZhIiwicGFnZXMiOlt7Iml0ZW1zIjpbIjEiICAgICBdfV
19
##TITLE=	3QYWrB12T9arDJYM4383cQ.11.fid
##JCAMP-DX=	6.0	$$ MestReNova 14.3.3-33362
##DATA TYPE=	NMR SPECTRUM
##DATA CLASS=	XYDATA
##BLOCK_ID=	1
##ORIGIN=	Bruker BioSpin GmbH
##OWNER=	root
##NUMDIM=	1
##$MNOVA/METADATA=	(ITEM,BASE64)
eyJhbmdsZSI6MCwiYXhlcyI6eyJ4Ijp7Im1heCI6MjAyLjc5MjcwMDAwNzQzMDQ1LCJtaW4iOi0yMDc
uMjA0Njc2NjgzNTk2Mzh9LCJ5Ijp7Im1heCI6Njc3MDQuOTM5OTQxNDA2MjUsIm1pbiI6LTExNzQzLj
cyMDIxNDg0Mzc1fX0sInBvaW50cyI6W3sieCI6NTMyMSwieSI6NTgzNX0seyJ4Ijo4NzIyLCJ5Ijo1O
DM1fSx7IngiOjg3MjIsInkiOjgyMDh9LHsieCI6NTMyMSwieSI6ODIwOH0seyJ4Ijo1MzIxLCJ5Ijo1
ODM1fV0sInoiOjB9
##.OBSERVE FREQUENCY=	160.46157916600000704
##.OBSERVE NUCLEUS=	^11B
##.SOLVENT NAME=	None
##.PULSE SEQUENCE=	zgbs
##LONGDATE=	2025/01/14 12:15:06.000
##.ACQUISITIONMODE=	SIMULTANEOUS (DQD)
##$ORIGINAL FORMAT=	Bruker XWIN-NMR
##$MNOVA/SCALES_VERSION=	9
##$PARAMETER FILE=	(acqus, ASCII, /private/var/folders/f6/rjf_tdyn2v98c5c0wvkgn4s80000gq/T/3QYWrB12T9arDJYM4383cQ/11/acqus, 0)
$$ ##TITLE= Parameter file, TopSpin 4.1.3
$$ ##JCAMPDX= 5.0
$$ ##DATATYPE= Parameter Values
$$ ##NPOINTS= 1	$$ modification sequence number
$$ ##ORIGIN= Bruker BioSpin GmbH
$$ ##OWNER= root
$$ $$ 2025-01-14 12:15:07.239 +0000  root@CZC036BXXF
$$ $$ Y:/data/tds/nmr/RP612 A 70 C 18 hrs/11/acqus
$$ $$ process C:\Bruker\TopSpin4.1.3\prog\mod\dirdata.exe
$$ ##$ACQT0= 0
$$ ##$AMP= (0..31)
$$ 100 100 100 100 100 100 100 100 100 100 100 100 100 100 100 100 100 100
$$ 100 100 100 100 100 100 100 100 100 100 100 100 100 100
$$ ##$AMPCOIL= (0..32)
$$ -1 0 0 0 0 0 0 0 0 0 0 0 0 0 0 0 0 0 0 0 0 0 0 0 0 0 0 0 0 0 0 0 0
$$ ##$AQSEQ= 0
$$ ##$AQ_mod= 3
$$ ##$AUNM= <au_zg>
$$ ##$AUTOPOS= <26 >
$$ ##$BF1= 160.461579166
$$ ##$BF2= 160.461579166
$$ ##$BF3= 160.461579166
$$ ##$BF4= 160.461579166
$$ ##$BF5= 160.461579166
$$ ##$BF6= 160.461579166
$$ ##$BF7= 160.461579166
$$ ##$BF8= 160.461579166
$$ ##$BWFAC= (0..63)
$$ 0 0 0 0 0 0 0 0 0 0 0 0 0 0 0 0 0 0 0 0 0 0 0 0 0 0 0 0 0 0 0 0 0 0 0 0
$$ 0 0 0 0 0 0 0 0 0 0 0 0 0 0 0 0 0 0 0 0 0 0 0 0 0 0 0 0
$$ ##$BYTORDA= 0
$$ ##$CHANFCU= (0..24)
$$ 0 0 1 0 0 0 0 0 0 0 0 0 0 0 0 0 0 0 0 0 0 0 0 0 0
$$ ##$CHANREC= (0..24)
$$ 0 0 1 0 0 0 0 0 0 0 0 0 0 0 0 0 0 0 0 0 0 0 0 0 0
$$ ##$CHEMSTR= <none>
$$ ##$CNST= (0..63)
$$ 1 1 1 1 1 1 1 1 1 1 1 1 1 1 1 1 1 1 1 1 1 1 1 1 1 1 1 1 1 1 1 1 1 1 1 1
$$ 1 1 1 1 1 1 1 1 1 1 1 1 1 1 1 1 1 1 1 1 1 1 1 1 1 1 1 1
$$ ##$CPDPRG= (0..8)
$$ <> <> <> <> <> <> <> <> <>
$$ ##$D= (0..63)
$$ 0 0.3 0 0 0 0 0 0 0 0 0 0 0 0 0 0 0.0002 0 0 0 0 0 0 0 0 0 0 0 0 0 0 0
$$ 0 0 0 0 0 0 0 0 0 0 0 0 0 0 0 0 0 0 0 0 0 0 0 0 0 0 0 0 0 0 0 0
$$ ##$DATE= 1736856906
$$ ##$DATE_START= 1736856830
$$ ##$DE= 6.5
$$ ##$DECBNUC= <off>
$$ [...]
$$ 1 1 1 1 0 0 0 0 0 0 0 0 0 0 0 0 0 0 0 0 0 0 0 0 0 0 0 0
$$ ##$ShimPowRng3= (0..63)
$$ 1 1 1 1 1 1 1 1 1 1 1 1 1 1 1 1 1 1 1 1 1 1 1 1 1 1 1 1 1 1 1 1 1 1 1 1
$$ 1 1 1 1 0 0 0 0 0 0 0 0 0 0 0 0 0 0 0 0 0 0 0 0 0 0 0 0
$$ ##$ShimPowType1= 8
$$ ##$ShimPowType2= 8
$$ ##$ShimPowType3= 0
$$ ##$ShimPowType4= 0
$$ ##$ShimPowType5= 0
$$ ##$ShimPowType6= 0
$$ ##$ShimPowType7= 0
$$ ##$ShimPowType8= 0
$$ ##$ShimSysActGrad= (0..63)
$$ 1 2 3 4 13 5 7 11 10 9 6 8 12 18 19 20 21 15 22 23 24 14 25 16 26 17 27
$$ 28 31 32 33 34 35 36 37 38 0 0 0 0 0 0 0 0 0 0 0 0 0 0 0 0 0 0 0 0 0 0
$$ 0 0 0 0 0 0
$$ ##$ShimSysAngle= <>
$$ ##$ShimSysFunc= (0..63)
$$ 1 2 3 4 5 6 7 8 9 10 0 37 38 35 16 15 14 13 12 11 28 27 26 25 24 23 36
$$ 22 30 29 20 21 34 33 32 31 17 18 19 0 0 0 0 0 0 0 0 0 0 0 0 0 0 0 0 0 0
$$ 0 0 0 0 0 0 0
$$ ##$ShimSysMatId= <292722ba.dat>
$$ ##$ShimSysMatrix= 1
$$ ##$ShimSysMinMaxUG= 130000
$$ ##$ShimSysOffset= <58 mm>
$$ ##$ShimSysType= 4
$$ ##$ShimUnit= 3
$$ ##$SpectrOsVersion= <4.1.156.20210628>
$$ ##$TCubeEth= <192.168.180.18>
$$ ##$TCubeSeqDevice= <>
$$ ##$TOSITY= <no>
$$ ##$TRIPLO2= 0
$$ ##$TopSpinVersion= <TopSpin 4.1.3>
$$ ##$TrxFreqFormula= (0..23)
$$ <TrxFreqFormula(2.0,500130000.000000,'TRX',Trx(1.0,'TRX 1200.1',2,5.000000,1290.000000))>
$$ <TrxFreqFormula(2.0,500130000.000000,'TRX',Trx(1.0,'TRX 1200.2',2,5.000000,1290.000000))>
$$ <> <> <> <> <> <> <> <> <> <> <> <> <> <> <> <> <> <> <> <> <> <>
$$ ##$TrxPN= (0..23)
$$ <Z148391> <Z148391> <> <> <> <> <> <> <> <> <> <> <> <> <> <> <> <> <>
$$ <> <> <> <> <>
$$ ##$TrxSN= (0..23)
$$ <05365> <05364> <> <> <> <> <> <> <> <> <> <> <> <> <> <> <> <> <> <> <>
$$ <> <> <>
$$ ##$VCubeEth= (0..23)
$$ <no> <no> <no> <no> <no> <no> <no> <no> <no> <no> <no> <no> <no> <no> <no>
$$ <no> <no> <no> <no> <no> <no> <no> <no> <no>
$$ ##$VTU= 2
$$ ##$VTUETH= <192.168.99.10>
$$ ##$VTUTY= <no>
$$ ##$ValueLine= no
$$ ##$VpuPN= (0..23)
$$ <no> <no> <no> <no> <no> <no> <no> <no> <no> <no> <no> <no> <no> <no> <no>
$$ <no> <no> <no> <no> <no> <no> <no> <no> <no>
$$ ##$VpuSN= (0..23)
$$ <no> <no> <no> <no> <no> <no> <no> <no> <no> <no> <no> <no> <no> <no> <no>
$$ <no> <no> <no> <no> <no> <no> <no> <no> <no>
$$ ##$WBREFAM= (0..31)
$$ 99.9 100 100 100 100 100 100 100 100 100 100 100 100 100 100 100 100 100
$$ 100 100 100 100 100 100 100 100 100 100 100 100 100 100
$$ ##$WBREFLM= (0..31)
$$ 2 0 0 0 0 0 0 0 0 0 0 0 0 0 0 0 0 0 0 0 0 0 0 0 0 0 0 0 0 0 0 0
$$ ##$WBREFPH= (0..31)
$$ 0.91 0 0 0 0 0 0 0 0 0 0 0 0 0 0 0 0 0 0 0 0 0 0 0 0 0 0 0 0 0 0 0
$$ ##$WBSGU= (0..31)
$$ 1 1 2 0 0 0 0 0 0 0 0 0 0 0 0 0 0 0 0 0 0 0 0 0 0 0 0 0 0 0 0 0
$$ ##END=
$$ 
##$DECIM=	304
##$DSPFVS=	20
##XUNITS=	HZ
##YUNITS=	ARBITRARY UNITS
##FIRSTX=	32540.508721406207769
##LASTX=	-33248.463028953556204
##DELTAX=	-0.50193385074013141534
##XFACTOR=	1
##YFACTOR=	1.8827896111178930028
##FIRSTY=	-228.77783203125
##MINY=	-5585.14013671875
##MAXY=	61693.3671875
##NPOINTS=	131072
##XYDATA=	(X++(Y..Y))
$$ [...]
$$ plain form
8976 6057 6025 5993 6327 6660 6916 6335 5754 6010 6717 7425 6740 6891 7052 7213 7426 7639 7068 6498 6345 6192 6136 6079 6927 6383
8964 6383 5229 6025 6108 5354 4589 3824 3320 4487 4897 5307 5404 5500 5214 4927 5059 5190 6192 7194 7500 7805 7413 7021 6211
8952 6211 5401 5410 5418 4730 4042 4320 4599 4720 5678 6313 5277 4815 5189 5606 6858 7380 6229 5680 5130 5173 5215 5952 6689 6172
8940 6172 5655 6156 6658 7160 7662 5976 4290 4259 5899 6346 5957 6143 6330 6089 5849 5608 5368 4744 4120 3532 4614 4916
8929 4916 5218 4928 4638 4453 4267 4082 3896 4549 5201 5853 6506 5722 4938 4850 4762 5061 5359 5657 5955 6140 6325 5936 6382 7087
8917 7087 6121 5677 6068 5729 5389 5520 5650 5442 5233 4607 3980 4494 5008 5522 6036 6038 6041 5625 5210 5351 5493 5635 5777 6185
8905 6185 6592 6582 6572 5840 5107 5349 5592 5967 6342 5742 5142 5361 5579 5798 6016 5602 5188 4774 4360 4172 3984 4215 4445 4995
8893 4995 5545 5120 4695 5010 5325 5640 5955 5600 5245 5864 6484 6381 6278 6593 6908 7032 7155 6583 6010 5593 5177 5457 5738
$$ packed form
8976F057l2l2L34L33K56n81n81K56P07P08o85J51J61J61K13K13n71n70j53j53n6n7Q48n44
8964F383j154P96Q3p54p65p65n04J167M10M10R7R6k86k87J32J31J002J002L06L05l92l92q10
8952F211q10RQo88o88K78K79J21R58O35j036m62L74M17J252N22j151n49n50M3M2P37P37n17
8940F172n17N01N02N02N02j686j686l1J640M47l89J86J87k41k40k41k40o24o24n88J082L02
8929D916L02k90k90j85j86j85j86O53O52O52O53p84p84q8q8K99K98K98K98J85J85l89M46P05
8917G087r66m44L91l39l40J31J30k08k09o26o27N14N14N14N14KLm16m15J41J42J42J42M08
8905F185M07j0j0p32p33K42K43L75L75o00o00K19K18K19K18m14m14m14m14j88j88K31K30N50
8893D995N50m25m25L15L15L15L15l55l55O19O20j03j03L15L15J24J23n72n73m17m16K80K81
$$ plain form
8881 5738 6305 6872 6186 6335 6989 6251 5930 5609 5293 4976 5356 5736 6029 6322 6424 5132 4897 4661 5034 5408 6051 6695 6363
8870 6363 6031 5578 5124 4758 4391 4269 5539 6391 5851 5553 5256 4872 4487 4965 5442 5223 5004 4964 4923 5579 6235 6647 7059
8858 7059 6775 5655 4283 4305 4988 4835 4596 5192 5266 5339 5348 5356 5365 5373 5695 6017 6338 6660 6181 5701 5221 4742 4785 4827 4870 4913 4668
8845 4668 4423 5084 4352 3481 4560 5569 5742 6017 5457 4949 5834 5971 6107 5634 5161 4733 4306 4854 5401 5514 5626 5320
8834 5320 5015 5687 6358 5776 5194 5657 6120 6165 6210 6009 5808 6025 6241 6119 5996 5926 5855 5143 5266 5338 5409 5054 4698 5597 6495
8821 6495 7015 7534 7027 6519 6838 6322 5806 6125 5711 5297 5388 6314 6388 5625 5385 5146 5613 6080 5573 5065 5027 4990 4900 4810 5785
8809 5785 5923 5278 4633 5268 5902 6311 5883 6303 6722 6079 4600 4706 5648 6433 7218 6515 4977 4414 4686 4924 5162 5034
8798 5034 4906 5270 5634 5580 5526 5333 5140 5417 5694 4881 4903 5430 5957 6189 6420 6651 6882 6802 6722 6642 6562 6456 6350 5722 5929
$$ packed form
8881E738N67N67o86J49O54p38l21l21l16l17L80L80K93K93J02j292k35k36L73L74O43O44l32
8870F363l32m53m54l66l67j22J270Q52n40k98k97l84l85M78M77k19k19m0m1O56O56M12M12
8858G059k84j120j372K2O83j53k39N96P4P3RQRQL22L22L21L22m79m80m80m79M3M2M3M3k45
8845D668k45O61p32q71J079J009J73K75n60n08Q85J37J36m73m73m28m27N48N47J13J12l06
8834E320l05O72O71n82n82M63M63M5M5k01k01K17K16j22j23p0p1p12J23P2P1l55l56Q99Q98
8821F495N20N19n07n08L19n16n16L19m14m14R1R26P4p63k40k39M67M67n07n08l8l7r0r0R75
8809E785J38o45o45O35O34M09m28M20M19o43j479J06R42P85P85p03j538n63K72K38K38j28
8798E034j28L64L64n4n4j93j93K77K77q13K2N27N27K32K31K31K31q0q0q0q0j06j06o28K07
$$ plain form
8785 5929 6591 6417 5599 4781 4433 5478 6523 6175 6016 5858 6030 6202 6087 5972 5300 5463 6301 5745 5155 5957 6560 5769
8774 5769 5066 5755 6114 6472 6500 6528 6085 5643 5305 6360 6556 5359 5033 4707 4302 3898 4242 4586 4769 5788 5745 3752 2916
8762 2916 4031 4901 5772 5820 5868 6386 6068 5594 5119 5011 4902 4989 5076 5163 5250 5511 5772 5981 6190 7042 7057 5541 4860 5433 6006
8750 6006 6578 7151 7535 7082 6212 6178 6100 6022 5996 5970 5947 5924 5901 5878 5829 5780 5731 5682 5922 6163 5985 5808 6396 6985 6320 5655 5480
8736 5480 5305 4608 4747 5513 5443 5198 4954 5210 5467 5723 5979 6235 6492 5860 6064 6048 6031 6067 6103 5948 5792 5114 5272 5573 5039
8724 5039 4975 5746 5786 5827 6442 6221 6096 6806 7047 6452 6205 5958 5711 5464 5383 6137 6003 5870 6154 6438 6200 6797 7311 6989
8712 6989 6772 6554 6197 5841 5484 5127 4873 4618 4868 5955 5822 5689 6480 5877 4739 4994 5301 5608 5741 5038 4701 5200
8701 5200 5753 5470 4839 5601 6424 5855 4710 4401 5299 6197 6173 6148 6088 6029 5969 5909 5502 5094 4686 4278 4602 4925 5249 5572 5826
$$ packed form
8785E929O62j74q18q18l48J045J045l48j59j58J72J72j15j15o72J63Q38n56n90Q02O03p91
8774E769p03O89L59L58K8K8m43m42l38J055J96j197l26l26m05m04L44L44J83J019m3j993q36
8762B916J115Q70Q71M8M8N18l18m74m75j08j09Q7Q7Q7Q7K61K61K09K09Q52J5j516o81N73N73
8750F006N72N73L84m53q70l4p8p8k6k6k3k3k3k3m9m9m9m9K40K41j78j77N88N89o65o65j75
8736E480j75o97J39P66p0k45k44K56K57K56K56K56K57o32K04j6j7L6L6j55j56o78J58L01n34
8724E039o4P71M0M1O15k21j25P10K41n95k47k47k47k47q1P54j34j33K84K84k38N97N14l22
8712F989k17k18l57l56l57l57k54k55K50J087j33j33P91o03j138K55L07L07J33p03l37M99
8701E200N53k83o31P62Q23n69j145l09Q98Q98k4k5o0n9o0o0m07m08m08m08L24L23L24L23K54
$$ plain form
8688 5826 6081 6335 6590 6026 5462 4532 3602 3946 5125 5138 5151 5286 5420 4667 4749 5204 5659 5190 4722 5334 5945 6051 5322 4925
8676 4925 4529 5055 5582 5394 5207 5020 4832 5082 5332 5581 5831 6037 6244 6276 5472 5154 5671 6136 5766 5326 4885 5316 5746
8665 5746 5872 5162 4922 4682 4860 5038 5216 5394 5195 4996 4693 5226 5767 5473 5701 5929 5696 5464 5231 4999 4479 3959 3387
8653 3387 3650 4071 4491 4964 5436 5935 6433 6984 6700 6038 5377 5116 5691 6074 5622 5692 5761 5596 5431 5266 5101 5310 5519 6199
8641 6199 6042 6122 6203 5813 5423 5373 5322 5272 5222 5354 5487 5567 5647 5910 5338 4765 5028 5351 5674 5631 5588 6146 6704 6253 4965 4052
8628 4052 3974 4105 5073 5709 5510 5502 5494 5394 6686 6691 5859 5890 5920 6073 4832 4488 5537 5716 5894 5794 5694 6116 5703 5542 6216
8615 6216 6421 5790 5533 5276 4863 5285 6164 6208 6356 6504 6747 6991 6208 5424 5695 5131 4201 4663 5797 6094 5643 5191 5876
8604 5876 5725 5121 4518 4845 6009 6807 6769 6366 6798 7178 6722 6510 6299 5564 5666 6263 6861 7093 6489 5825 6553 6916 6443
$$ packed form
8688E826K55K54K55n64n64r30r30L44J179J3J3J35J34p53Q2M55M55m69m68O12O11J06p29l97
8676D925l96N26N27j88j87j87j88K50K50K49K50K06K07L2q04l18N17M65l70m40m41M31M30
8665E746J26p10k40k40J78J78J78J78j99j99l03N33N41k94K28K28k33k32k33k32n20n20n72
8653C387K63M21M20M73M72M99M98N51k84o62o61k61N75L83m52P0O9j65j65j65j65K09K09O80
8641F199j57Q0Q1l90l90n0n1n0n0J32J33Q0Q0K63n72n73K63L23L23m3m3N58N58m51j288r13
8628D052p8J31R68O36j99qqj00J292Nq32L1L0J53j241l44J049J79J78j00j00M22m13j61O74
8615F216K05o31k57k57m13M22Q79M4J48J48K43K44p83p84K71n64r30M62J134K97m51m52O85
8604E876j51o04o03L27J164P98l8m03M32L80m56k12k11p35J02N97N98K32o04o64P28L63m73
$$ plain form
8592 6443 5909 5375 4788 4202 4077 3952 3967 4817 5554 4898 4555 5049 5786 5687 5414 5141 4948 4754 4613 4472 4453 5269 5563 5857
8580 5857 6467 6241 6067 5893 5415 4936 5433 5929 5569 5209 5823 6438 6026 5613 5027 5833 6703 6179 5604 5028 4914 5635 5887
8569 5887 6138 5437 4736 4732 4728 4810 4893 4871 5685 5886 5250 5137 5024 5389 5755 5703 5650 5387 5123 5277 5431 4984 4537 4508 4480 5019 5558
8555 5558 6149 6741 5957 6008 6060 5276 5892 6507 5816 5126 5376 5625 5405 5185 5724 5427 5079 5566 5957 5512 4754 5389 5777 5328
8543 5328 5437 5546 6116 6686 7257 7827 6778 5729 5655 5581 5089 4597 4001 4240 4688 4301 4436 4571 4828 5085 4819 5389 6362
8532 6362 6499 5957 5415 5013 5446 5409 5372 5921 6469 6322 6174 6522 6871 6802 6732 6798 6863 6511 6159 6163 6168 5476 4784 4970 5156 5342
8518 5342 5527 5200 4872 5188 5505 6306 6272 4985 4533 5700 6868 7025 6347 5522 4697 4795 4893 5217 5542 5866 6190 6151 6112 6073
8506 6073 6034 6308 6582 6160 5738 6153 6568 5729 4891 4993 5094 6171 7248 7095 6942 7207 7472 7789 8107 7170 6234 6393 6552
$$ packed form
8592F443n34n34n87n86j25j25J5Q50P37o56l43M94P37r9k73k73j93j94j41j41j9Q16K94K94
8580E857O10k26j74j74m78m79M97M96l60l60O14O15m12m13n86Q06Q70n24n75n76j14P21K52
8569E887K51p01p01mmQ2Q3k2Q14K01o36j13j13L65L66n2n3k63k64J54J54m47m47k9k8N39N39
8555E558N91N92p84N1N2p84O16O15o91o90K50K49k20k20N39k97l48M87L91m45p58O35L88m49
8543E328J09J09N70N70N71N70j049j049p4p4m92m92n96K39M48l87J35J35K57K57k66N70R73
8532F362J37n42n42m02M33l7l7N49N48j47j48L48L49o9p0O6O5l52l52MNo92o92J86J86J86
8518E342J85l27l28L16L17Q01l4j287m52J167J168J57o78q25q25R8R8L24L25L24L24l9l9l9
8506F073l9K74K74m22m22M15M15q39q38J02J01J077J077j53j53K65K65L17L18r37r36J59J59
$$ plain form
8495 6552 6293 6034 6219 6404 6589 6774 6619 6464 5892 5320 5357 5394 5431 5468 5165 4863 5535 6208 5740 5272 4804 4336 4347 4358 4369
8482 4369 4379 5122 5864 5909 5955 5658 5360 5481 5601 5452 5303 5571 5840 6148 6455 6763 7071 7161 7251 7341 7431 7081 6732 6382 6032
8470 6032 6092 6152 5793 5435 5334 5232 5131 5029 5258 5488 5717 5946 6018 6090 5743 5397 5738 6080 6421 6763 6695 6627 6559 6492 6363 6234
8457 6234 6523 6813 6482 6151 5820 5489 5376 5263 5846 6430 6134 5838 6517 7196 7152 7109 7065 7022 6344 5666 5406 5147 6175 7204
8445 7204 6700 6197 5876 5555 5234 4914 5472 6031 5893 5755 5167 4580 5803 5633 5576 6356 5637 5755 6040 5489 5461 5433 5622 5812
8433 5812 5670 5529 4660 5184 6683 6789 6555 6322 6698 7074 6734 6394 6054 5714 5826 5939 5634 5328 4989 4650 4364 4077 4295
8421 4295 5349 6769 6795 5015 4071 3911 3750 3973 5588 6473 6521 6568 6616 6611 6606 6488 6370 5834 5298 5088 4879 5644 6410 5896
8409 5896 5382 5564 5746 5853 5961 6068 6175 5681 5188 5391 5594 6467 7340 6960 6580 6243 5906 6266 6626 6464 6302 5305 5701
$$ packed form
8495F552k59k59J85J85J85J85j55j55n72n72L7L7L7L7l03l02O72O73m68m68m68m68J1J1J1
8482D369J0P43P42M5M6k97k98J21J20j49j49K68K69L08L07L08L08R0R0R0R0l50l49l50l50
8470F032O0O0l59l58j01j02j01j02K29K30K29K29P2P2l47l46L41L42L41L42o8o8o8o7j29j29
8457F234K89K90l31l31l31l31j13j13N83N84k96k96O79O79m4m3m4m3o78o78k60k59J028J029
8445G204n04n03l21l21l21l20N58N59j38j38n88n87J223j70n7P80p19J18K85n51k8k8J89J90
8433E812j42j41q69N24J499J06k34k33L76L76l40l40l40l40J12J13l05l06l39l39k86k87K18
8421D295J054J420K6j780r44j60j61K23J615Q85M8M7M8nnj18j18n36n36k10k09P65P66n14
8409E896n14J82J82J07J08J07J07m94m93K03K03Q73Q73l80l80l37l37L60L60j62j62r97L96
$$ plain form
8397 5701 6906 7275 7192 6273 5733 6028 6219 6410 6148 5887 5625 5363 5390 5418 5445 5472 5560 5648 6433 7218 7014 6811 6607 6404 6165
8385 6165 5927 5689 5450 5038 4626 4719 4813 4435 5451 7129 7971 7955 7939 7871 7803 7065 6326 6006 5685 6569 7453 7640 7827 7605
8373 7605 7383 7161 6939 6989 7039 6671 6303 6005 5707 5409 5111 5782 6453 6149 5845 6090 6334 6579 6824 6892 6960 7028 7097 6930 6763
8360 6763 5430 4096 3795 4886 5664 5606 5792 5977 6111 6245 5538 4832 5379 5926 5898 5871 5843 5816 5344 4871 4817 4762 4995 5228
8348 5228 5461 5694 5835 5977 6118 6260 6784 7309 6858 6408 6850 7292 6758 6225 6101 5977 5435 4893 4978 5063 5148 5233 6406 7579
8336 7579 7220 6861 6135 5409 5937 6464 6322 6179 6037 5894 5900 5905 6328 6752 6600 6449 6298 6147 6955 7764 7040 6316 6907 7498
8324 7498 7114 6730 6224 5718 6466 7213 6324 5435 4964 4493 4522 4552 4999 5447 4980 4514 4796 5078 4847 5451 5585 5719 5932 6144
8312 6144 6461 5942 5003 4900 4449 4833 6567 7465 6518 5570 5436 5303 4699 4931 5712 6492 6350 6208 6351 6494 5993 5492 4921
$$ packed form
8397E701J205L69q3r19n40K95J91J91k62k61k62k62K7K8K7K7Q8Q8P85P85k04k03k04k03k39
8385F165k38k38k39m12m12R3R4l78J016J678Q42j6j6o8o8p38p39l20l21Q84Q84J87J87k22
8373G605k22k22k22N0N0l68l68k98k98k98k98O71O71l04l04K45K44K45K45O8O8O8O9j67j67
8360F763j333j334l01J091P78n8J86J85J34J34p07p06N47N47k8k7k8k7m72m73n4n5K33K33
8348E228K33K33J41J42J41J42N24N25m51m50M42M42n34n33j24j24n42n42Q5Q5Q5Q5J173J173
8336G579l59l59p26p26N28N27j42j43j42j43ONM23M24j52j51j51j51Q08Q09p24p24N91N91
8324G498l84l84n06n06P48P47q89q89m71m71K9L0M47M48m67m66K82K82k31O04J34J34K13K12
8312F144L17n19r39j03m51L84J734Q98r47r48j34j33o04K32P81P80j42j42J43J43n01n01n71
$$ plain form
8301 4921 5186 6147 7109 7916 7330 7161 6993 6529 6901 7272 6808 6420 6032 5592 5152 5556 5961 6417 6874 6507 6977 7081 6349
8289 6349 6357 7201 7941 8680 7687 6693 6361 7422 7700 6584 5869 5990 5943 5896 5902 5907 5564 5222 6080 6939 6590 5405 5438 5472 5001
8277 5001 5365 5730 5259 5208 5156 5053 4950 5412 5875 5641 5407 5622 5837 6052 6267 6996 7725 7949 7337 6917 6497 6999 7502 6698
8264 6698 5895 5788 5681 6231 6782 6879 6141 5560 5814 6191 6567 7520 7637 7058 7314 6822 6330 6308 6286 5967 5647 5746 5844 5368 4892
8252 4892 5670 6447 6628 6809 6294 5779 5769 5758 6166 6573 6215 5856 5915 5975 5799 5623 5448 5272 4561 3849 4392 4934 5782 6629
8240 6629 7058 7487 7560 7632 7287 6941 6613 6285 5539 4793 5092 5390 6107 6824 6260 5697 5552 6242 6766 5897 5864 5831 5868 5904 5940
8227 5940 5977 6540 7103 6413 5722 6016 6309 6184 6060 6234 6408 5608 4807 4729 4651 5269 5888 6014 6141 6267 6394 6956 7517 7383
8215 7383 7248 7108 6968 6828 6688 6739 6790 6424 6057 5822 5586 5350 5114 5313 5513 5712 5912 5450 4989 5781 6573 7218 7862 7252
$$ packed form
8301D921K65R61R62Q07n86j69j68m64L72L71m64l88l88m40m40M04M05M56M57l67M70J04p32
8289F349QQ44P40P39r93r94l32J061K78j116p15J21m7m7ONl43l42Q58Q59l49j185L3L4m71
8277E001L64L65m71n1n2j03j03M62M63k34k34K15K15K15K15P29P29K24o12m20m20N02N03q04
8264F698q03j07j07N50N51R7p38n81K54L77L76R53J17n79K56m92m92k2k2l19l20R9R8m76m76
8252D892P78P77J81J81n15n15j0j1M08M07l58l59N9O0j76j76j75j76p11p12N43N42Q48Q47
8240F629M29M29P3P2l45l46l28l28p46p46K99K98P17P17n64n63j45O90N24q69l3l3L7L6L6
8227E940L7N63N63o90o91K94K93j25j24J74J74q00q01p8p8O18O19J26J27J26J27N62N61j34
8215G383j35j40j40j40j40N1N1l66l67k35k36k36k36J99K00J99K00m62m61P92P92O45O44o10
$$ plain form
8203 7252 6643 6177 5711 5664 5616 5637 5659 5681 5703 6099 6495 6891 7287 7483 7679 7875 8071 7196 6321 5585 5685 7030 6982 7074 7165 6362
8190 6362 5558 5729 5901 6629 7358 7895 7039 6784 6529 6604 6680 6651 6622 7064 6669 6782 6894 6955 7015 6832 6648 6517 6386 5963 6376
8178 6376 6789 6367 5700 5033 4506 5372 6142 6912 7316 6885 6018 5987 6408 6830 6603 6376 6515 6654 6540 5591 5198 4806 4502
8166 4502 5591 6000 5574 5009 5279 5550 4984 3962 3775 3241 3541 4330 4283 4340 4397 4706 5014 5323 5632 5810 5988 6114 6240
8155 6240 6547 6018 5959 5900 6337 6774 7211 7648 7832 8016 7503 6990 7104 7218 6914 6610 6594 6577 6560 6544 6580 6615 6651 6686 5853 5019
8142 5019 5439 5859 5705 5550 5396 5241 5685 6129 6991 7853 7818 7783 7331 6878 6345 5812 5975 6138 6301 6464 6158 5851 6750 6813
8129 6813 6371 5929 6101 6273 5888 6338 7324 6917 6667 7252 6784 6316 7067 7818 8345 7479 6717 6791 6347 5903 6190 5642 5492
8118 5492 5341 5348 5354 5109 4863 5365 5868 5555 6077 6599 6286 6212 6138 6012 5886 5815 5744 5987 5394 4526 4495 4829 4327 4870 5413 5904
$$ packed form
8203G252o09m66m66m7m8K1K2K2K2L96L96L96L96J96J96J96J96q75q75p36J00J345m8R2R1q03
8190F362q04J71J72P28P29N37q56k55k55P5P6k9k9M42l95J13J12O1O0j83j84j31j31m23M13
8178F376M13m22o67o67n27Q66P70P70M04m31q67l1M21M22k27k27J39J39j14r49l93l92l04
8166D502J089M09m26n65K70K71n66j022j87n34L00P89m7N7N7L09L08L09L09J78J78J26J26
8155F240L07n29n9n9M37M37M37M37J84J84n13n13J14J14l04l04j6j7j7j6L6L5L6L5q33q34
8142E019M20M20j54j55j54j55M44M44Q62Q62l5l5m52m53n33n33J63J63J63J63l06l07Q99O3
8129F813m42m42J72J72l85M50R86m07k50N85m68m68P51P51N27q66p62P4m44m44K87n48j50
8118E492j51POk45k46N02N03l13N22N22l13p4p4j26j26p1p1K43n93q68l1L34n02N43N43M91
$$ plain form
8105 5904 6395 6485 6575 6300 6025 5906 6623 6870 7117 6886 6654 6840 7026 6979 6932 6520 6108 5508 5744 5771 4963 5623 6284 6196 6108
8092 6108 6041 5975 5908 5842 5995 6149 5606 5063 5451 5840 5810 5781 6481 7181 6627 6073 6842 7611 8433 8419 7491 6562 6783 7004 7034 6227
8079 6227 6100 5973 5933 5894 6063 6233 6150 6067 6628 7189 7583 7141 7169 7197 7216 7235 7255 7274 6984 6695 6405 6115 6208 6302 6395 6488 6157 5826
8065 5826 5495 5164 5451 5738 5433 5964 6941 5969 4944 5312 5593 5874 6765 6819 6040 6097 6328 6559 6272 5985 5907 5829 5511 5194
8053 5194 5573 5952 5952 5952 5953 5953 5940 5927 5915 5902 5506 5110 5637 6164 6341 5682 5998 7150 7057 6964 7341 7718 7386 7053 6773 6493 6448 7238
8039 7238 6775 5476 5474 5471 5834 6197 5815 5434 5975 6517 6773 6193 5823 6288 6157 6026 6417 6808 6189 6406 7320 7397 7209 7021
8027 7021 6050 5914 6479 6208 5990 6607 7246 7885 7845 6969 5792 5451 5841 6230 7195 8159 8393 7790 6565 6176 6187 6198 6766
8016 6766 6499 6336 6173 5289 5241 6203 5772 5450 5128 5973 6817 6345 5872 5609 5346 5670 5994 6737 7479 7803 8127 7720 6478
$$ packed form
8105E904M91R0R0k75k75j19P17K47K47k31k32J86J86m7m7m12m12o00K36K7q08O60O61q8q8
8092F108o7o6o7o6J53J54n43n43L88L89l0k9P00P00n54n54P69P69Q22j4r28r29K21K21L0q07
8079F227j27j27m0l9J69J70q3q3N61N61L94m42K8K8J9J9K0J9k90k89k90k90R3R4R3R3l31l31
8065E826l31l31K87K87l05N31R77r72j025L68K81K81Q91N4p79N7K31K31k87k87p8p8l18l17
8053E194L79L79%%J%j3j3j2j3l96l96N27N27J77o59L16J152r3r3L77L77l32l33k80k80m5P90
8039G238m63j299klL63L63l82l81N41N42K56n80l70M65j31j31L91L91o19K17R14P7j88j88
8027G021r71j36N65k71k18O17O39O39m0q76j177l41L90L89R65R64K34o03j225l89J1J1N68
8016F766k67j63j63q84m8R62m31l22l22Q45Q44m72m73k63k63L24L24P43P42L24L24m07j242
$$ plain form
8004 6478 5862 6081 5988 5894 5925 5955 6195 6434 6639 6843 6073 5302 4802 4303 4499 4696 4867 5037 5626 6214 6485 6756 7026 7297
7992 7297 7646 7995 7926 7857 7168 6479 6765 7051 7015 6979 6942 6906 6417 5929 6693 7458 6595 5732 6122 6512 6485 6458 5735 5012 5054 5097
7979 5097 4722 4347 4940 5533 5430 5327 5590 5852 6115 6377 6200 6023 5846 5669 6084 6499 6496 6493 6220 5947 6371 6794 7758 8721
7967 8721 7873 7026 7562 8099 7660 7222 6696 6171 6063 5955 6200 6445 5993 5542 6117 6693 6572 6451 6102 5753 6100 6447 6315
7955 6315 6184 6052 5920 6217 6515 6115 5716 6091 6467 6842 7218 7308 7399 7490 7581 7968 8355 7488 6621 6070 5519 5664 5809 5633
7943 5633 5456 5697 5938 6037 6137 6236 6336 6183 6030 6295 6560 6749 6938 6430 5923 6077 6230 6384 6538 6412 6285 5689 5928 6228
7931 6228 6528 6880 7233 7241 7250 6805 5525 4811 4933 5507 6081 6009 5937 6039 6977 7427 7042 8067 8256 7885 7515 6953 7227 7867
7919 7867 7114 6308 6338 6629 6920 6898 6876 6714 7388 6896 6404 7191 7978 8069 6767 6240 6548 6352 6155 5513 5706 6317 6092 6155
$$ packed form
8004F478o16K19r3r4L1L0K40K39K05K04p70p71n00m99J96J97J71J70N89N88K71K71K70K71
7992G297L49L49o9o9o89o89K86K86l6l6l7l6m89m88P64P65q63q63L90L90k7k7p23p23M2M3
7979E097l75l75N93N93j03j03K63K62K63K62j77j77j77j77M15M15llk73k73M24M23R64R63
7967H721q48q47N36N37m39m38n26n25j08j08K45K45m52m51N75N76j21j21l49l49L47L47j32
7955F315j31j32j32K97K98m00l99L75L76L75L76R0R1R1R1L87L87q67q67n51n51J45J45j76
7943E633j77K41K41R9J00R9J00j53j53K65K65J89J89n08n07J54J53J54J54j26j27n96K39L00
7931F228L00L52L53QRm45j280p14J22N74N74p2p2J02R38M50l85J025J89l71l70n62K74O40
7919G867p53q06L0K91K91k2k2j62O74m92m92P87P87R1j302n27L08j96j97o42J93O11k25O3
$$ plain form
7907 6155 6217 6280 6343 5761 6015 6269 5687 5541 5395 5614 5833 6339 6845 6933 7022 7162 7302 7861 8419 7835 7250 7084 6917 6925 6932 6940 6948
7894 6948 6758 6568 5908 6084 6164 6244 6376 6508 7293 8078 7610 7141 7395 7650 7451 6417 6362 7144 7542 7104 6641 7570 8447 7931
7882 7931 7585 7239 6441 5642 5479 6151 5936 5720 5748 5777 6449 7122 7403 6848 6763 6678 6906 7135 6388 5642 5661 5681 5701 5720 6070 6419
7868 6419 6821 6387 5579 4771 5442 6114 6488 6861 6538 6215 6223 6231 6709 6351 6560 6769 6925 7081 7238 7394 7464 7533 8153 7380 6607
7856 6607 7227 6742 6256 6780 7305 7596 7053 6509 6801 6614 6427 6710 6993 7224 7455 6154 4853 5423 5994 6617 6404 6369 6334
7844 6334 6248 6161 6300 6440 7050 6824 6615 6406 7120 7835 8166 8497 7905 7313 7142 7807 8524 8405 7703 7836 7918 7163 6992 6821
7832 6821 6597 6374 6865 7355 6923 6491 5748 5841 6440 7038 7140 7242 7344 7446 7613 7781 6729 6513 7325 7301 7050 6800 6978
7821 6978 6321 6134 5946 6203 6460 6491 5685 5553 5420 5705 5990 6101 7048 7298 6713 6362 6012 6584 7157 7276 7396 7620 7009
$$ packed form
7907F155O2O3O3n82K54K54n82j46j46K19K19N06N06Q8Q9J40J40N59N58n84n85j66j67QPQQ
7894F948j90j90o60J76Q0Q0J32J32P85P85m68m69K54K55j99j034n5P82L98m38m63R29Q77n16
7882G931l46l46p98p99j63O72k15k16K8K9O72O73K81n55q5q5K28K29p47p46J9K0K0J9L50L49
7868F419M02m34q08q08O71O72L74L73l23l23QQM78l58K09K09J56J56J57J56P0O9O20p73p73
7856F607O20m85m86N24N25K91n43n44K92j87j87K83K83K31K31j301j301N70N71O23k13l5l5
7844F334q6q7J39J40O10k26k09k09P14P15L31L31n92n92j71O65P17j19p02J33Q2p55j71j71
7832F821k24k23M91M90m32m32p43R3N99N98J02J02J02J02J67J68j052k16Q12k4k51k50J78
7821F978o57j87j88K57K57L1q06j32j33K85K85J11R47K50n85l51l50N72N73J19J20K24o11
$$ plain form
7809 7009 6848 7522 7500 6643 5742 5677 6343 7009 6731 6453 5705 5793 6064 6334 7127 7921 7012 6938 8119 8464 7746 7029 6677 6325
7797 6325 5970 5615 6235 6855 6735 6615 6130 5644 5415 6022 6159 6296 5980 5664 4878 4928 4992 5056 6148 7239 7051 6863 7092
7786 7092 7322 7084 6845 6973 7100 7515 7093 6672 7087 7233 7379 7107 6834 6397 5124 5104 5920 6499 7078 7483 7052 6343 5633
7774 5633 5098 5398 6140 6883 5901 5755 6489 6387 6807 7227 6705 6183 5556 5765 6540 6479 6523 6567 6219 5871 5697 6358 7464 7734
7762 7734 7047 6359 5935 6346 6287 6229 5761 5293 5522 5751 6463 7175 6581 5987 6803 6784 6817 6850 6384 5919 6951 7147 6507 6703
7750 6703 6795 6887 6792 6697 6271 5845 5698 6944 7772 7207 6731 6255 6667 7079 6821 6563 6479 7231 7715 7364 7587 7810 7076 7177
7738 7177 7226 7275 7355 7434 7514 7594 6968 6342 6187 6031 5861 6527 6862 5803 5381 5794 6346 6899 6715 6532 6871 6375 5660 5782 6077
7725 6077 6373 6199 6025 6269 6513 6070 5626 5879 6131 6058 5984 5910 5837 6007 6177 6347 6517 6498 6480 6932 7384 6835 7121 7826 7694
$$ packed form
7809G009j61O74k2q57r01o5O66O66k78k78p48Q8K71K70P93P94r09p4J181L45p18p17l52l52
7797F325l55l55O20O20j20j20m85m86k29O07J37J37l16l16p86N0O4O4J092J091j88j88K29
7786G092K30k38k39J28J27M15m22m21M15J46J46k72k73m37j273k0Q16N79N79M05m31p09p10
7774E633n35L00P42P43r82j46P34j02M20M20n22n22o27K09P75o1M4M4l48l48j74O61J106K70
7762G734o87o88m24M11n9n8m68m68K29K29P12P12n94n94Q16j9L3L3m66m65J032J96o40J96
7750F703R2R2r5r5m26m26j47J246Q28n65m76m76M12M12k58k58q4P52M84l51K23K23p34J01
7738G177M9M9Q0P9Q0Q0o26o26j55j56j70O66L35j059m22M13N52N53j84j83L39m96p15J22K95
7725F077K96j74j74K44K44m43m44K53K52p3p4p4p3J70J70J70J70j9j8M52M52n49K86P05j32
$$ plain form
7713 7694 7114 6535 6913 8126 7877 6793 6874 6956 7969 8146 7348 7385 6970 6555 6192 5829 6051 6274 5713 6545 6820 7095 7509
7701 7509 7087 6697 6307 6561 6815 6721 6627 7003 7379 6510 6476 7418 7524 7622 7719 7294 7705 8101 8496 7969 7442 7324 7206 7035 7701
7689 7701 8068 8435 7880 7324 7073 6822 6572 6321 6699 7077 7508 7102 7506 7911 7793 7675 7189 5867 5242 5452 5907 6361 5980
7677 5980 6434 6748 7062 7202 6506 6698 6890 6560 7065 7386 7706 8549 8556 7640 6725 5704 5520 6164 6807 6998 6353 6736 7118
7666 7118 6752 6386 6211 6037 6036 6871 7620 7532 7270 7009 7490 7972 7810 7647 7311 7810 8362 8077 7941 8640 8817 8995 8327 7660
7654 7660 7410 7161 7174 7187 7199 7212 7094 6976 7329 6845 6884 6923 6962 7001 6718 7270 7718 8166 8435 7868 7771 7673 7333 6992 6599 6205
7641 6205 6940 6838 6040 6078 6891 7703 7315 6926 6940 6954 7385 7817 7622 7427 7232 7037 6872 6708 6073 6274 6762 7251 8261 8436
7629 8436 8406 8376 7319 6262 6232 6202 6869 7535 7523 7510 7498 7485 7647 7808 7552 7296 7264 7232 7147 7063 7344 6790 5870 6343 7573 7967
$$ packed form
7713G694n80n79L78J213k49j084Q1Q2J013J77p98L7m15m15l63l63K22K23n61Q32K75K75M14
7701G509m22l90l90K54K54r4r4L76L76q69l4R42J06R8R7m25M11L96L95n27n27j18j18j71O66
7689G701L67L67n55n56k51k51k50k51L78L78M31m06M04M05j18j18m86j322o25K10M55M54l81
7677E980M54L14L14J40o96J92J92l30N05L21L20Q43Pr16r15j021j84O44O43J91o45L83L82
7666G118l66l66j75j74jQ35P49q8k62k61M81M82j62j63l36M99N52k85j36O99J77J78o68o67
7654G660k50k49J3J3J2J3j18j18L53m84L9L9L9L9k83N52M48M48K69n67r7r8l40l41l93l94
7641F205P35j02p98L8Q13Q12l88l89J4J4M31M32j95j95j95j95j65j64o35K01M88M89J010J75
7629H436l0l0j057j057l0l0O67O66j2j3j2j3J62J61k56k56l2l2q5q4K81n54r20M73J230L94
$$ plain form
7615 7967 7892 7816 8533 8413 7232 6051 6558 7065 7154 7243 6853 6463 7240 7181 6921 6662 6350 6039 6241 6443 7115 6952 6883 6814 6745
7603 6745 6677 5903 5964 7280 7759 7564 7369 7122 6875 7472 8069 8492 8079 7515 7786 7953 6727 5570 5249 5399 5548 5745 6778
7591 6778 7167 6720 6099 6314 7173 7196 7797 8398 7971 7545 7502 7459 7468 6641 6193 5745 5697 6485 7230 7139 7100 7897 7879 7861 7721 6745
7578 6745 5787 5665 5995 6325 6538 6751 6963 7176 6336 5495 5403 6704 7646 8588 8554 7685 7060 6435 7011 7588 7446 7303 7858
7567 7858 8412 7870 7327 7203 7078 7247 7417 7220 7024 6131 6074 6243 6412 6281 6150 6680 8047 9013 8028 7357 8079 8362 7808
7555 7808 7812 7816 8064 8311 8141 7971 7927 7882 7142 6401 6732 7062 7392 7722 7083 6443 6500 6557 7206 7855 7807 7759 7638 7516 7395 7273
7542 7273 7465 7657 7848 8040 8367 8694 8603 8511 7924 7337 6749 6162 6158 6154 6150 6146 5994 5841 5689 5537 5240 4943 5116 5289 4975 5496
7529 5496 6331 5772 5529 5285 5929 6573 7191 7810 7731 7653 7892 8132 7675 7218 6987 6756 6943 7130 6707 6284 6836 7387 7216 7046
$$ packed form
7615G967p5p6P17j20j181j181N07N07Q9Q9l90l90P77n9k60k59l12l11K02K02O72j63o9o9o9
7603F745o8p74O1J316M79j95j95k47k47N97N97M23m13n64K71J67j226j157l21J50J49J97J033
7591F778L89m47o21K15Q59K3O01O01m27m26m3m3Rq27m48m48m8P88P45r1l9P97j8j8j40r76
7578F745r58j22L30L30K13K13K12K13q40q41r2J301R42R42l4q69o25o25N76N77j42j43N55
7567G858N54n42n43j24j25J69J70j97j96q93n7J69J69j31j31N30J367R66r85o71P22K83n54
7555G808MMK48K47j70j70m4m5p40p41L31L30L30L30o39o40N7N7O49O49m8m8j21j22j21j22
7542G273J92J92J91J92L27L27r1r2n87n87n88n87mmmmj52j53j52j52k97k97J73J73l14N21
7529E496Q35n59k43k44O44O44O18O19p9p8K39K40m57m57k31k31J87J87m23m23N52N51j71j70
$$ plain form
7517 7046 6875 6704 6636 6568 6082 5596 6712 7828 7690 7553 7193 6833 6474 6114 6808 7502 6663 5825 6094 6363 7050 7738 7598
7506 7598 7458 7318 7178 6886 6594 6720 6845 6980 7114 7249 7383 7272 7162 7052 6941 7118 7295 7472 7648 7494 7340 7883 8425
7494 8425 8419 8413 7711 7009 6519 6029 6236 6443 6571 6700 6828 6956 7694 8432 8752 9072 8373 7675 7672 7670 6900 6130 6614 7098 7799 8501
7481 8501 7948 7396 7066 6735 6405 6075 6432 6790 6729 6669 5449 4229 5377 6525 6820 7115 6992 6869 7361 7853 7648 7444
7470 7444 7553 7662 7770 7879 7241 6602 5964 5325 5862 6399 6518 6636 6989 7342 7695 8048 7521 6995 7165 7335 7608 7881 6900
7458 6900 5919 6305 6691 7077 7463 7299 7134 7388 7641 7920 8200 8061 7923 7483 7043 7021 6999 7281 7564 7847 8129 8057 7985 8610
7446 8610 9234 8352 7471 7564 7657 8277 8896 8819 8742 8056 7369 7101 6832 7391 7949 8090 8231 7431 6632 6250 5868 5967 6065 6860 7655
7434 7655 7632 7608 7585 7561 7490 7419 7348 7276 7449 7621 7794 7966 7737 7508 7279 7050 7378 7706 8452 9198 9356 9515 8419 7324 7134
$$ packed form
7517G046j71j71o8o8m86m86J116J116j38j37l60l60l59l60O94O94q39q38K69K69O87O88j40
7506G598j40j40j40k92k92J26J25J35J34J35J34j11j10j10j11J77J77J77J76j54j54N43N42
7494H425oop02p02m90m90K07K07J28J29J28J28P38P38L20L20o99o98lkp70p70M84M84P01P02
7481H501n53n52l30l31l30l30L57L58o1o0j220j220J148J148K95K95j23j23M92M92k05k04
7470G444J09J09J08J09o38o39o38o39N37N37J19J18L53L53L53L53n27n26J70J70K73K73r81
7458F900r81L86L86L86L86j64j65K54K53K79K80j39j38m40m40k2k2K82K83K83K82p2p2O25
7446H610O24q82q81R3R3O20O19p7p7o86o87k68k69N59N58J41J41q00p99l82l82R9R8P95P95
7434G655k3k4k3k4p1p1p1p2J73J72J73J72k29k29k29k29L28L28P46P46J58J59j096j095j90
$$ plain form
7421 7134 6944 7172 7400 7381 7362 6151 5775 6844 7495 7737 7979 7947 7915 7857 7799 8211 8205 8294 7548 6538 6920 7634 7511 6649 5786
7409 5786 5847 5907 6194 6481 6245 6845 7132 6583 6060 6373 7377 7962 7852 8159 8405 7816 7618 8256 8772 8452 8237 8022 7380
7397 7380 6738 6793 6848 6675 6502 6617 6313 6410 7343 7362 7381 7726 8071 8521 8135 6669 6040 6420 6800 6714 6628 6960 7292 7589 7886
7385 7886 8157 8428 8224 7603 6694 6621 6818 6179 6289 7235 7366 7496 7261 7026 6521 6016 5798 5163 5132 5938 6482 6608 6987 7366
7373 7366 7588 7392 7179 7803 7930 8058 8376 8695 8605 8097 7667 8073 9149 9390 9056 8721 8335 7949 7792 7635 7191 7165 7679
7361 7679 7357 7035 7548 8049 8132 7997 7026 6778 6530 6229 5929 6639 7349 7642 7934 7965 7996 7609 7222 7203 7184 6591 6833 7989
7349 7989 7474 6263 6722 7211 6864 6674 6483 6606 6729 7270 7811 7503 7195 7305 7415 7551 7687 7249 7646 8897 8477 8126
7338 8126 7776 7251 7562 8395 7557 7559 8397 7963 7530 7671 7812 7536 7259 7298 7338 7377 7417 7038 6660 6978 7296 7324 7353 7382 7410 7404 7398 7391
$$ packed form
7421G134j90K28K28j9j9j211l76J069O51K42K42l2l2n8n8M12oQ9p46j010L82P14j23q62q63
7409E786O1O0K87K87k36O00K87n49n23L13J004N85j10L07K46n89j98O38N16l20k15k15o42
7397G380o42N5N5j73j73J15l04R7R33J9J9L45L45M50l86j466o29L80L80q6q6L32L32K97K97
7385G886K71K71k04o21r09p3J97o39J10R46J31J30k35k35n05n05k18o35l1Q06N44J26L79L79
7373G366K22j96k13O24J27J28L18L19r0n08m30M06J076K41l34l35l86l86j57j57m44k6N14
7361G679l22l22N13N01Q3j35r71k48k48l01l00P10P10K93K92L1L1l87l87j9j9n93K42J156
7349G989n15j211M59M89l47j90j91J23J23N41N41l08l08J10J10J36J36m38L97J251m20l51
7338H126l50n25L11Q33q38KQ38m34m33J41J41k76k77L9M0L9M0l79l78L18L18K8K9K9K8oop
$$ plain form
7324 7391 7385 6887 6390 6310 6230 6533 6837 6722 6608 6750 6892 7034 7176 7171 7165 6741 6318 7062 7806 7279 7587 8410 7560 6659 7429 7951
7311 7951 6802 6645 7323 8002 8681 8158 7635 7610 7584 7559 7533 7603 7673 7744 7814 7869 7924 7979 8034 8350 8666 8564 8462 8241 8020 8216 8412
7297 8412 8687 8962 8819 8676 8522 8368 8214 8060 8106 8152 7502 6852 6457 6062 6920 7779 7558 7337 6698 6060 6230 6401 6990 7579
7285 7579 7010 6441 6603 7601 8313 8190 8033 8711 9423 8743 7959 8010 8148 7450 6805 6996 7273 7551 7184 6817 7184 7551 7918
7274 7918 8285 7686 7086 7688 8291 8257 7388 6884 7216 7949 7846 7290 6734 6982 7229 6780 6331 7083 7835 8169 8504 8033 7562
7262 7562 7735 7909 8569 8394 7749 7940 8475 8174 7977 7780 7636 7491 7347 7202 7295 7388 7428 7469 8267 8229 7164 6935 7382 6994
7250 6994 7128 7262 7666 8070 8248 7590 7069 6548 6201 6690 7004 7319 7268 7218 7192 7166 7837 8508 8282 8057 8353 7814 7954 8929
7238 8929 8686 8443 8243 8043 7426 6808 7345 7882 7723 7564 6960 6357 6171 6821 7594 6973 6717 7298 6951 6605 7286 7966 7758
$$ packed form
7324G391om98m97q0q0L03L04j15j14J42J42J42J42nom24m23P44P44n27L08Q23q50r01P70N22
7311G951j149j57O78O79O79n23n23k5k6k5k6P0P0P1P0N5N5N5N5L16L16j02j02k21k21J96J96
7297H412K75K75j43j43j54j54j54j54M6M6o50o50l95l95Q58Q59k21k21o39o38J70J71N89N89
7285G579n69n69J62R98P12j23j57O78P12o80p84N1J38o98o45J91K77K78l67l67L67L67L67
7274G918L67n99o00O02O03l4q69n04L32P33j03n56n56K48K47m49m49P52P52L34L35m71m71
7262G562J73J74O60j75o45J91N35l01j97j97j44j45j44j45R3R3M0M1P98l8j065k29M47l88
7250F994J34J34M04M04J78o58n21n21l47M89L14L15n1n0k6k6O71O71k26k25K96n39J40R75
7238H929k43k43k00k00o17o18N37N37j59j59o04o03j86O50P73o21k56N81l47l46O81O80k08
$$ plain form
7226 7758 7549 6993 7272 7425 6185 5415 6038 6802 7567 7443 7320 7597 7874 7733 7592 7820 8048 8694 7947 6956 6801 6820 7675
7215 7675 8769 9027 8520 7176 6999 7658 7847 7200 7380 7560 6712 5865 5836 5807 6474 7141 7682 8224 8068 7913 7845 7776 8161 7152
7203 7152 6426 7093 7777 7626 6895 6165 6914 7664 7647 7631 7405 7179 7228 7277 7326 7374 7245 7116 7962 8809 8653 8498 8761 9024 8397
7190 8397 7769 7560 7350 7628 7906 7767 7627 7468 7309 7847 9220 9792 8972 8569 8166 8317 8467 8199 7931 7611 7292 7668 8880
7179 8880 9796 9319 8703 8087 7658 7229 7009 6789 7452 8116 7804 7493 8109 8724 8922 9120 8473 7826 7598 7369 7332 7294 7675 8055
7167 8055 8142 8229 7619 7010 6000 4989 6121 7252 6607 6798 7215 7632 8119 8606 8674 8743 8466 8189 8608 9027 8363 7698 7295
7155 7295 6891 7135 8215 8825 8598 9160 8886 9030 9174 8870 8565 8261 7956 8331 8706 8384 8062 7669 7276 7058 7675 7891 7272
7144 7272 7123 7810 7634 7459 6918 6377 7112 7847 8372 8898 9259 9620 9285 8950 8101 7252 6908 7400 7788 8175 8354 8532 8906
$$ packed form
7226G758k09n56K79J53j240p70O23P64P65j24j23K77K77j41j41K28K28O46p47r91j55J9Q55
7215G675J094K58n07j344j77O59J89o47J80J80q48q47k9k9O67O67N41N42j56j55o8o9L85j009
7203G152p26O67O84j51p31p30P49P50j7j6k26k26M9M9M9M8j29j29Q46Q47j56j55K63K63o27
7190H397o28k09k10K78K78j39j40j59j59N38J373N72q20m03m03J51J50k68k68l20l19L76J212
7179H880R16m77o16o16m29m29k20k20O63O64l12l11O16O15J98J98o47o47k28k29l7l8L81L80
7167H055Q7Q7o10o09j010j011J132J131o45J91M17M17M87M87O8O9k77k77M19M19o64o65m03
7155G295m04K44J080O10k27N62k74J44J44l04l05l04l05L75L75l22l22l93l93k18O17K16o19
7144G272j49O87j76j75n41n41P35P35N25N26L61L61l35l35q49q49l44M92L88L87J79J78L74
$$ plain form
7132 8906 8445 7339 7070 6471 6709 8008 7915 7561 7206 7461 7716 8006 8295 8167 8039 7824 7609 8334 8223 7631 7875 7963 8050
7121 8050 9147 9409 9165 8922 9009 9096 9288 8644 7635 7461 7461 7461 7264 7066 7339 7611 7309 7843 8586 8493 8435 8376 8475 8573 8128 7682
7108 7682 6871 6060 6222 7221 8010 7964 7687 7410 6715 6020 6103 7021 7991 8125 8294 9299 10252 10369 9587 8805 8946 9087 8584
7096 8584 8080 7804 8362 8185 8009 7884 7759 7261 6762 6489 7052 7641 8231 7671 7111 6377 6479 7085 7692 8629 9567 9721 9039
7084 9039 8636 8233 7255 7113 7500 7052 7178 7303 6968 7468 8334 7807 6085 5199 6072 6944 7469 7157 6846 7370 7421 7472 7993
7073 7993 8514 8434 8354 8745 9135 8463 8627 9540 9617 8675 8570 9387 9368 8609 7849 7038 6226 6120 6013 6795 6741 6587 6432 6731 7865
7060 7865 7397 6930 7454 7144 6520 6733 7398 8063 8424 8784 9092 9401 9056 7875 7670 8300 8661 9021 8703 7548 6922 7132
7049 7132 7515 7899 7064 6228 6177 6961 7540 8120 8055 7990 8396 8801 8788 8776 8974 9172 8447 7722 7172 7457 7690 7923 8071 8219 7949
$$ packed form
7132H906m61j106k69n99K38J299r3l54l55K55K55K90K89j28j28k15k15P25j11n92K44Q8Q7
7121H050J097K62k44k43Q7Q7J92o44j009j74%%j97j98K73K72l02N34P43r3n8n9R9R8m45m46
7108G682q11q11J62R99P89m6k77k77o95o95Q3R18R70J34J69J005R53J17p82p82J41J41n03
7096H584n04k76N58j77j76j25j25m98m99k73N63N89N90n60n60p34J02O06O07R37R38J54o82
7084I039m03m03r78j42L87m48J26J25l35N00Q66n27j722q86Q73Q72N25l12l11N24N1N1N21
7073G993N21q0q0L91L90o72J64R13P7r42j05Q17j9p59p60q11q12j06j07P82n4j54j55K99J134
7060G865m68m67N24l10o24K13O65O65L61L60L08L09l45j181k05O30L61L60l18j155o26K10
7049G132L83L84q35q36n1P84N79N80o5o5M06M05j3j2J98J98p25p25n50K85K33K33J48J48k70
$$ plain form
7037 7949 7679 7670 7662 7653 7644 7856 8069 8228 8388 8731 8238 7850 7461 7099 7572 8046 7683 7121 6558 6361 7557 8477 8561 8002 7442 7065
7024 7065 7523 7982 7605 7269 6933 7329 8560 8555 8551 8598 8645 7869 7092 7012 6932 7558 8183 7833 7483 7860 8237 7918 7598 7688 7778 7868
7011 7868 7958 8294 8630 8548 8467 8551 8634 8074 7514 7750 8822 8117 7413 7972 7694 7887 8079 8058 8036 7596 7157 7239 7322 7875 8428 7997
6998 7997 8402 8336 8271 8136 8001 8563 9124 8563 8001 7440 6878 7396 7914 7962 8010 8545 8245 7892 8375 8789 8367 7770 7174 7703
6986 7703 8232 8709 9186 8958 7894 8554 10049 10691 9941 9103 8265 7349 7269 7276 6447 6272 7489 8236 7591 7215 6839 7352 7864
6974 7864 8237 8610 8757 8067 7552 7037 7445 7853 7743 7632 7574 6680 7605 8531 8708 8885 8504 8124 7744 7363 7401 7438 7006 7409
6962 7409 7429 7448 8721 8602 8055 7509 7050 7426 8347 8432 8343 8254 8643 9033 8447 7862 7853 7844 7835 7826 7834 7843 8373 8069 7703 8172 7946 6883
6948 6883 6674 7301 7927 7718 7365 7847 9008 10170 9999 8993 8875 8756 8307 7858 7357 7691 8147 8603 8694 8785 8470 8156 7476
$$ packed form
7037G949k70rqrrK12K13J59J60L43m93l88l89l62M73M74l63n62n63j97J196R20Q4n59n60l77
7024G065M58M59l77l36l36L96J231nmM7M7p76p77q0q0O26O25l50l50L77L77l19l20R0R0R0
7011G868R0L36L36q2q1Q4Q3n60n60K36J072p05p04N59k78J93J92k1k2m40m39Q2Q3N53N53m31
6998G997M05o6o5j35j35N62N61n61n62n61n62N18N18M8M8N35l00l53M83M14m22n97n96N29
6986G703N29M77M77k28j064O60J495O42p50q38q38r16q0Pq29j75J217P47o45l76l76N13N12
6974G864L73L73J47o90n15n15M08M08j10j11n8q94R25R26J77J77l81l80l80l81L8L7m32M03
6962G409K0J9J273j19n47n46m59L76R21Q5q9q9L89L90n86n85rrrrQRN30l04l66M69k26j063
6948F883k09O27O26k09l53M82J161J162j71j006j18j19m49m49n01L34M56M56R1R1l15l14o80
$$ plain form
6936 7476 6796 5942 5924 7212 7664 6912 6996 7202 7408 8554 8865 7921 7814 8167 8520 8507 8494 7994 7493 7219 7781 8249 8718 8855
6924 8855 8157 6710 7213 8847 9646 9597 9547 9079 8612 8153 8529 8436 8343 8680 9018 8572 8126 8603 7687 6771 7248 7764 8279 8412
6912 8412 8544 8677 7973 7740 7507 7306 7106 6766 7262 8019 7383 7113 7679 8059 8439 8175 7911 7490 7069 7623 8177 8264 8350 8436
6900 8436 8522 8861 9200 9034 8032 7321 6610 6630 7486 7811 8137 7817 7498 7588 7678 7298 7754 7409 7064 7467 7870 7672 7473 7327
6888 7327 7181 7173 8002 8413 7988 8133 8279 7849 8256 9428 9765 9597 9429 9635 9005 8846 8687 8754 8820 8835 8850 8682 7678 7614 7551
6876 7551 7409 8102 8796 8654 8581 8509 8384 8259 8003 7748 7493 7237 7265 7292 8016 8740 8315 7890 7464 7039 7425 7810 8248 7850
6864 7850 7147 6444 6664 7720 8471 7830 6822 7208 8029 8849 8782 8715 8748 8782 8397 8012 7767 7522 7695 7867 7840 7812 8254 8697
6852 8697 8460 9060 9676 8343 7506 8062 7347 6633 6823 7850 8458 8231 8012 7793 8167 8540 8452 7528 6605 6517 7505 8494 8839
$$ packed form
6936G476o80q54j8J288M52p52Q4K06K06J146L11r44j07L53L53j3j3n00n01k74N62M68M69J37
6924H855o98j447N03J634P99m9n0m68m67m59L76r3r3L37L38m46m46M77r16r16M77N16N15J33
6912H412J32J33p04k33k33k01k00l40M96P57o36k70N66L80L80k64k64m21m21N54N54Q7Q6Q6
6900H436Q6L39L39j66j002p11p11K0Q56L25L26l20l19R0R0l80M56l45l45M03M03j98j99j46
6888G327j46qQ29M11m25J45J46m30M07J172L37j68j68K06o30j59j59O7O6J5J5j68j004o4o3
6876G551j42O93O94j42p3p2j25j25k56k55k55k56K8K7P24P24m25m25m26m25L86L85M38l98
6864G850p03p03K20J056P51o41j008L86Q21Q20o7o7L3L4l85l85k45k45J73J72k7k8M42M43
6852H697k37O00O16j333q37N56p15p14J90J027O08k27k19k19L74L73q8r24r23q8R88R89L45
$$ plain form
6840 8839 9183 9519 9855 9773 9691 9069 8447 7199 7622 9224 9155 8599 8042 8355 8667 8666 8665 9191 8045 7544 8714 9174 8799 8302
6828 8302 7805 7473 7141 6809 6478 7239 8001 8066 8132 8084 8036 7292 6547 6911 7274 7220 7165 7302 7440 7577 7714 7851 7988 8125 8262
6815 8262 8295 8328 8360 8393 8415 8436 8458 8480 8319 8158 7997 7836 7627 7418 8184 8950 8998 9046 8885 8724 9207 9690 9477 9263 8920 8576
6802 8576 8824 9072 9522 8301 7812 7322 7694 8066 8230 8393 7881 7370 7851 7496 6266 6708 7690 8671 8659 8646 8216 7786 8382
6791 8382 8979 8601 8223 8498 8773 8629 8486 8583 8679 8079 7479 7697 7915 7924 7934 7573 7212 7826 8441 8474 8507 8540 8573 8829 9084 9339
6778 9339 9594 9477 9360 9504 8813 8056 7299 7274 8084 8169 8255 8392 8530 8319 8109 7898 7688 7392 7097 8055 7620 6863 6942 7387
6766 7387 7831 7592 6518 6610 6702 7386 8070 8336 8602 9065 9528 9016 8504 8296 8089 8631 9172 8599 8862 9177 8656 8418 9016
6754 9016 9771 9690 9702 9715 9257 8800 8843 8886 9051 9216 10090 9571 9157 9579 8912 8246 8380 8515 8487 9296 9687 9242 8770 8299 8281
$$ packed form
6840H839L44L36L36q2q2o22o22j248M23J602o9n56n57L13L12jjN26j146n01J170M60l75m97
6828H302m97l32l32l32l31P61P62O5O6m8m8p44p45L64L63n4n5J37J38J37J37J37J37J37J37
6815H262L3L3L2L3K2K1K2K2j61j61j61j61k09k09P66P66M8M8j61j61M83M83k13k14l43l44
6802H576K48K48M50j221m89m90L72L72J64J63n12n11M81l55j230M42R82R81j2j3m30m30N96
6791H382N97l78l78K75K75j44j43R7R6o00o00K18K18RJ0l61l61O14O15L3L3L3L3K56K55K55
6778I339K55j17j17J44o91p57p57k5Q10Q5Q6J37J38k11k10k11k10k96k95R58m35p57P9M45
6766G387M44k39j074R2R2O84O84K66K66M63M63n12n12k08k07N42N41n73K63L15n21k38N98
6754I016P55q1J2J3m58m57M3M3J65J65Q74n19m14M22o67o66J34J35k8Q09L91m45m72m71j8
$$ plain form
6742 8281 8262 7665 8460 8942 8589 8296 8003 8442 8880 7850 8212 8958 8867 8968 9070 8509 7949 7132 7707 8196 8684 9173 9662
6730 9662 9698 8898 8084 8106 8023 7940 8301 8663 9024 9385 9220 9054 8245 7435 6721 6843 7522 8201 7836 8306 9229 10151 10382 9777
6718 9777 8911 8880 9185 8654 8280 7905 7653 8236 8610 8149 8158 8166 8819 9472 8476 7479 7178 7714 8301 7496 6691 7278 7927 7740 8110
6705 8110 8480 8441 8402 8362 8323 8476 8628 8171 7714 6819 7318 8199 8245 8543 8841 9087 9333 8984 8635 8704 8773 8841 8910 8561 8212 8688
6692 8688 9164 9117 9907 9912 9082 8775 8467 8893 9318 9326 9334 9333 9332 8914 8495 8429 8363 7931 7499 7233 7802 7902 8001 8294 8588 8463 8338 8318
6678 8318 8298 8696 9094 9204 9315 9373 9431 9628 8990 8874 8758 8040 8157 8221 8286 9422 10557 10352 9311 8949 8588 8400 9048 9200
6666 9200 9352 9503 9655 10306 10120 9239 9193 9164 9136 9682 9392 8597 8638 8575 8511 8239 7967 7869 8606 8743 8044 7867 7691 7558 7425
6654 7425 7710 7995 9078 10162 9713 9264 8859 8454 8049 7644 7790 7937 8449 8961 9682 9567 9922 10278 9873 9469 9239 8173
$$ packed form
6742H281j9n97P95M82l53k93k93M39M38j030L62P46r1J01J02n61n60q17N75M89M88M89M89
6730I662L6q00q14K2q3q3L61L62L61L61j65j66q09q10p14J22O79O79l65M70R23R22K31o05
6718I777q66l1L05n31l74l75k52N83L74m61RQO53O53r96r97l01N36N87q05q05N87O49j87L70
6705H110L70l9l9m0l9J53J52m57m57q95M99Q81M6K98K98K46K46l49l49O9O9O8O9l49l49M76
6692H688M76m7P90Nq30l07l08M26M25QQjjm18m19o6o6m32m32k66N69J00R9K93K94j25j25k0
6678H318k0L98L98J10J11N8N8J97o38j16j16p18J17O4O5J136J135k05j041l62l61j88O48J52
6666I200J52J51J52O51j86q81m6k9k8N46k90p95M1o3o4k72k72r8P37J37o99j77j76j33j33
6654G425K85K85J083J084m49m49m05m05m05m05J46J47N12N12P21j15L55L56m05m04k30j066
$$ plain form
6643 8173 7229 8235 8928 8785 8968 8316 8081 7847 7899 7952 7900 8684 9273 9025 8882 8739 8352 7965 7996 8027 7888 7749 7975 8201
6631 8201 8210 7383 6556 6565 7799 9033 9535 9202 8756 8310 8508 8706 8937 9168 9451 8898 9102 9307 8989 9507 10075 10643 10567 10491
6619 10491 10162 9834 9975 10117 8925 8570 8441 8312 8697 9082 9466 9851 9637 9423 9627 9831 9243 8655 9321 9986 9515 9045
6608 9045 8400 9148 9975 9408 9068 8728 8277 8662 9099 8700 8910 9957 9976 9159 9404 9649 9789 9929 10235 9705 9645 9586 9552 9518
6596 9518 9397 9276 10331 9993 9236 8480 8281 8917 9084 9250 9704 10158 10786 10021 8487 8347 9095 9842 10790 10902 10283 9664
6585 9664 9042 9256 9052 8848 8496 8979 9916 10852 10563 9439 8732 8861 8554 8248 8934 8785 8570 9190 10177 10328 9712 9097 8429
6573 8429 7762 8049 8337 8625 8913 8652 8392 8549 8706 8602 8498 8394 8291 8631 8971 8614 8258 7965 7671 7796 7921 8219 8518
6561 8518 8817 9115 8990 8864 8686 8508 9044 8744 8270 7796 7516 8072 8523 8974 9460 9110 9091 9908 10730 10159 9170 9575 10205
$$ packed form
6643H173r44J006O93j43J83o52k35k34N2N3n2P84N89k48j43j43l87l87L1L1j39j39K26K26
6631H201Rq27q27RJ234J234N02l33m46m46J98J98K31K31K83n53K04K05l18N18N68N68p6p6
6619A0491l29l28J41J42j192l55j29j29L85L85L84L85k14k14K04K04n88n88O66O65m71m70
6608I045o45P48Q27n67l40l40m51L85M37l99K10J047J9q17K45K45J40J40L06n30o0n9l4l4
6596I518j21j21J055l38p57p56j99O36J67J66M54M54O28p65j534j40P48P47R48J12o19o19
6585I664o22K14k04k04l52M83R37R36k89j124p07J29l07l06O86j49k15O20R87J51o16o15o68
6573H429o67K87K88K88K88k61k60J57J57j04j04j04j03L40L40l57l56k93k94J25J25K98K99
6561H518K99K98j25j26j78j78N36l00m74m74k80N56M51M51M86l50j9Q17Q22n71r89M05O30
$$ plain form
6550 10205 10000 9882 9764 9522 8444 8306 8169 7752 8172 9096 10021 9913 9804 9278 8752 9349 9946 10125 10304 9751 9199 8647
6539 8647 8095 8134 8174 8266 8358 7923 8324 8673 9022 9075 9127 9180 9233 8541 7850 8185 8521 8988 10290 10338 9551 9533 9515 9619 10558 10671
6526 10671 9948 9747 9546 9406 9267 9545 9823 9178 8533 8306 8079 8012 7946 7879 7812 8424 9036 8673 8310 8356 8403 8449 8495 8507 8518 8529
6513 8529 8541 8267 7993 8085 8177 7730 6446 6381 7709 7801 7893 8072 8251 8570 8888 8040 7191 7022 8246 9470 9300 9671 10041 9350
6501 9350 8658 8541 8424 8307 8190 8578 8966 9354 9742 9676 9611 9127 8643 8638 8633 9325 10016 9554 9093 9327 9562 9204 8847 9186 9525
6488 9525 9575 9625 9344 9063 8060 8449 9309 8776 8534 9128 9165 9202 9300 9398 9914 10430 10919 11407 10364 9320 9478 9636 9793 9951
6476 9951 9695 9440 9184 8928 8986 9044 9798 10552 9910 9269 9324 9379 8824 8270 8412 8554 9083 9613 9446 9279 9094 8910 9143 9377
6464 9377 9244 9112 9398 9683 9377 9071 8764 8458 8478 8498 8518 8539 8872 9206 8564 7923 8535 9148 8786 8423 8958 9492 9608 9725
$$ packed form
6550A0205k05j18j18k42j078j38j37m17M20R24R25j08j09n26n26N97N97J79J79n53n52n52
6539H647n52L9M0R2R2m35M01L49L49N3N2N3N3o92o91L35L36M67J302M8p87j8j8J04R39J13
6526A0671p23k01k01j40j39K78K78o45o45k27k27o7o6o7o7O12O12l63l63M6M7M6M6J2J1J1
6513H529J2k74k74R2R2m47j284o5J328R2R2J79J79L19L18q48q49j69J224J224j70L71L70o91
6501I350o92j17j17j17j17L88L88L88L88o6o5m84m84nnO92O91m62m61K34K35l58l57L39L39
6488I525N0N0k81k81j003L89Q60n33k42N94L7L7R8R8N16N16M89M88j043j044J58J58J57J58
6476I951k56k55k56k56N8N8P54P54o42o41N5N5n55n54J42J42N29N30j67j67j85j84K33K34
6464I377j33j32K86K85l06l06l07l06K0K0K0K1L33L34o42o41O12O13l62l63N35N34J16J17
$$ plain form
6452 9725 9354 8983 8612 8240 8688 9135 8886 8637 8692 8748 8803 8859 8583 8308 8729 9150 9486 9823 10159 10495 9996 9496 8997 8497
6440 8497 8259 8021 8757 9494 9917 10341 10346 10352 9893 9435 8977 8519 8740 8961 9600 10238 9856 9475 9093 8711 8764 8817 8871 8924 9521 10119
6427 10119 10020 9921 10013 10106 9502 8898 8982 9065 9149 9233 8925 8617 9005 9394 9608 9823 9062 8301 8446 8591 8736 8880 9128 9375 9623
6414 9623 9871 10136 10401 10248 10095 10630 11165 9889 8613 8512 8411 9286 10160 10337 10515 10692 10870 10194 9518 9539 9559 9384 9209
6403 9209 9034 8859 8945 9031 9116 9202 9717 10231 10327 10423 10293 10163 10033 9903 9408 8912 9391 9871 9514 9158 9498 9838 10165 10491 10766
6390 10766 11040 11027 10178 10218 10257 10379 10501 9927 9352 9143 8934 9422 9910 10105 10300 10320 9506 8656 8642 9080 9519 9779 10040 9882
6378 9882 9724 9540 9357 9695 9198 8592 8823 9697 9736 8912 8089 8467 8846 9161 9476 8572 8504 9010 8681 9292 9903 10124 10344 9868
6366 9868 9392 9342 9293 9713 9298 8924 8551 8629 9544 9519 9493 9938 10382 10202 10022 9790 9558 9257 8119 7400 7516 7728 7940 8204
$$ packed form
6452I725l71l71l71l72M48M47k49k49N5N6N5N6k76k75M21M21L36L37L36L36m99n00m99n00
6440H497k38k38P36P37M23M24NOm59m58m58m58K21K21O39O38l82l81l82l82N3N3N4N3N97N98
6427A0119r9r9R2R3o04o04Q4Q3Q4Q4l08l08L88L89K14K15p61p61J45J45J45J44K48K47K48
6414I623K48K65K65j53j53N35N35j276j276j01j01Q75Q74J77J78J77J78o76o76K1K0j75j75
6403I209j75j75Q6Q6Q5Q6N15N14R6R6j30j30j30j30m95m96M79M80l57l56L40L40L27L26K75
6390A0766K74j3q49M0L9J22J22n74n75k09k09M88M88J95J95K0q14q50j4M38M39K60K61j58
6378I882j58j84j83L38m97o06K31Q74L9q24q23L78L79L15L15r04o8N06l29O11O11K21K20m76
6366I868m76n0m9M20m15l74l73P8R15k5k6M45M44j80j80k32k32l01j138p19J16K12K12K64
$$ plain form
6354 8204 8468 8558 8648 8877 8271 7943 9008 9238 9467 9627 9786 9946 10106 10355 10604 10435 10266 10123 9980 10255 10530 10101 9671
6343 9671 10217 9927 8958 9382 10137 10056 9855 9654 8983 8312 8886 9460 9669 9877 9636 10230 10824 10582 10036 9490 10650 11810 11529
6331 11529 10413 9348 8284 8499 8715 9296 9877 9783 8853 7924 7830 7788 7746 8453 9160 9160 9159 9159 9158 9201 9245 9288 9331 9180 9029 8355 8517
6317 8517 9307 9260 8760 8261 8347 8433 8154 7874 7952 8865 9134 8567 8354 8978 9079 9180 8749 8319 8551 10175 11338 11108 10496 9883
6305 9883 9731 9580 9428 9276 8822 8368 8802 9236 10567 10505 9223 8778 8485 8192 8926 9661 10012 10363 10018 9673 9108 8544 8676
6294 8676 8809 9515 10222 10877 11531 11716 11064 10883 10702 9807 8912 8522 8967 9914 10860 10883 10907 10521 10135 10272 9572 8638 8540 8615
6282 8615 8691 9367 10044 10302 10561 10055 9550 9794 10037 9793 10385 10924 10628 10819 10175 9478 9617 9678 9738 10321 10069 9531 8993 8629
6270 8629 9101 9460 9819 9307 8795 9135 10310 10318 10327 10004 9682 9777 9873 10041 10210 9961 9712 9750 9788 9826 9864 10057 10249 10860 11470 10314
$$ packed form
6354H204K64R0R0K29o06l28J065K30K29J60J59J60J60K49K49j69j69j43j43K75K75m29m30
6343I671N46k90r69M24P55q1k01k01o71o71N74N74K09K08k41N94N94k42n46n46J160J160k81
6331A1529j116j065j064K15K16N81N81r4r30r29r4m2m2P07P07%j%jM3M4M3M3j51j51o74J62
6317H517P90m7n00m99Q6Q6k79k80P8R13K69n67k13O24J01J01m31m30K32J624J163k30o12o13
6305I883j52j51j52j52m54m54M34M34J331o2j282m45k93k93P34P35L51L51l45l45n65n64J32
6294H676J33P06P07O55O54J85o52j81j81q95q95l90M45R47R46K3K4l86l86J37p00r34r8P5
6282H615P6O76O77K58K59n06n05K44K43k44N92N39k96J91o44o97J39O1O0N83k52n38n38l64
6270H629M72L59L59n12n12L40J175QRl23l22R5R6J68J69k49k49L8L8L8L8J93J92O11O10j156
$$ plain form
6257 10314 9157 9254 9350 9912 10474 10617 10761 10600 10439 10278 10117 10252 10386 11218 12049 11131 10212 9294 8375 8423 8470 8517 8565 8690
6245 8690 8816 9360 9903 10075 10246 10417 10589 10734 10879 10607 10334 10118 9902 10104 10306 9829 9352 9571 9790 10164 10538 10494 10450 9866
6233 9866 9282 9482 9681 9046 9803 10665 10691 10386 10082 9586 10482 11327 11335 10648 9960 10038 10117 9777 9438 10351 11264 11202 11140 11077 11015 10257
6220 10257 9498 9497 9496 9913 10330 10050 9771 9909 10047 10700 11354 10754 10154 10546 10938 11191 10608 9656 10096 10588 10245 10563 10882 10730
6208 10730 10578 10209 9839 10166 10493 10254 10015 9776 9538 9667 9796 9228 8661 8877 9093 8612 8132 8468 8804 9140 9476 9821 10166
6196 10166 9536 8905 9400 9895 9694 9492 9709 9925 9724 9522 9528 9533 9956 10379 9976 9572 9864 10157 10090 10024 9957 9891 10260 10628 10353
6183 10353 10077 9619 9996 9904 9811 9135 8459 8200 9335 10476 10782 10913 10209 9940 10507 11073 10804 10418 10867 11264 10825 10595 10365
6172 10365 10031 10532 10215 9898 9808 10553 11298 11208 10699 11026 11870 11878 11467 11893 11814 10899 10924 10949 10552 10155 9114 8072 8467 9698
$$ packed form
6257A0314j157R7R6N62N62J43J44j61j61j61j61J35J34Q32Q31r18r19r18r19M8M7M7M8J25
6245H690J26N44N43J72J71J71J72J45J45k72k73k16k16K02K02m77m77K19K19L74L74m4m4n84
6233I866n84K00J99o35P57Q62K6l05l04m96Q96Q45Qo87o88P8P9l40l39R13R13o2o2o3o2p58
6220A0257p59jjM17M17k80k79J38J38O53O54o00o00L92L92K53n83r52M40M92l43L18L19j52
6208A0730j52l69l70L27L27k39k39k39k38J29J29n68n67K16K16m81m80L36L36L36L36L45L45
6196A0166o30o31M95M95k01k02K17K16k01k02ONM23M23m03m04K92K93o7o6o7o6L69L68k75
6183A0353k76m58L77r2r3o76o76k59J135J141L06J31p04k69N67N66k69l86M49L97m39k30k30
6172A0365l34N01l17l17r0P45P45r0n09L27Q44Qm11M26p9r15K5K5l97l97j041j042L95J231
$$ plain form
6160 9698 10929 11325 11435 11545 11185 10824 10264 9704 10119 10533 10720 10906 10117 9328 9392 9457 9887 10317 10570 9987 9821 10492 10135
6148 10135 9779 9892 10006 10735 11464 10696 10764 10275 8949 9731 10513 10147 10618 10722 9991 10009 10863 10724 10585 10704 9989 9325 10055
6137 10055 10218 9546 9483 9420 9002 9420 10343 11266 11379 11492 11187 10883 11068 11253 11020 10787 11076 11366 10733 10099 9176 9089 9786 10482
6125 10482 11074 11666 11614 11562 10713 10700 11436 11335 10713 10926 11505 11248 10542 9835 9772 9710 9847 9985 10540 11096 10840 10583 10327 10071
6113 10071 9649 9227 9224 9220 9196 9173 9846 10519 10235 9950 10083 10217 10709 11202 11520 11002 10833 11500 11418 10500 10428 10357 10930 11503 11493 11482
6100 11482 11472 11462 10957 10453 10366 10280 10350 10420 9881 9342 8944 9939 10621 10467 10061 9654 9422 10025 10940 11854 12595 12500 11726 10951 10821
6087 10821 10691 11126 11562 11823 11248 9960 9507 9176 8846 9882 10082 10334 10587 10500 10413 9908 9403 9846 10289 10731 11174 11295 11416
6076 11416 10318 10056 11156 11420 11006 10591 10115 10476 10888 10465 9886 10144 10297 10450 9897 9345 9489 9633 10254 10875 11026 11177
$$ packed form
6160I698J231L96J10J10l60l61n60n60M15M14J87J86p89p89O4O5M30M30K53n83j66O71l57
6148A0135l56J13J14P29P29p68O8m89j326P82P82l66M71J04p31J8Q54j39j39J19p15o64P30
6137A0055J63o72o3o3m18M18R23R23J13J13l05l04J85J85k33k33K89K90o33o34r23q7O97O96
6125A0482N92N92n2n2q49j3P36j01o22K13N79k57p06p07o3o2J37J38N55N56k56k57k56k56
6113A0071m22m22lmk4k3O73O73k84k85J33J34M92M93L18n18j69O67q2r18p2p1N73N73j0j1
6100A1482j0j0n05n04q7q6P0P0n39n39l98R95O82j54m06m07k32O03R15R14P41r5p74p75j30
6087A0821j30M35M36K61n75j288m53l31l30J036K00K52K53q7q7n05n05M43M43M42M43J21J21
6076A1416j098k62J100K64m14m15m76L61M12m23n79K58J53J53n53n52J44J44O21O21J51J51
$$ plain form
6065 11177 11571 11130 10462 9794 10230 10666 10684 10702 10363 10024 10608 11192 11369 10710 10051 10228 9560 8892 9757 10622 11039 10622 9507
6053 9507 9229 9986 10743 11379 11179 10848 11353 11806 11422 10656 9890 10047 10204 10184 10164 10145 10125 10245 10365 10902 11440 11094 10748 10402
6041 10402 10056 10188 10321 10558 9960 9502 9879 10100 10321 10342 9527 8816 9498 9850 10201 10640 11079 10986 10894 10697 11335 11938 11705 11020
6029 11020 10334 9919 9503 9540 10413 10441 9633 9348 9063 9170 9276 9383 9490 9990 10490 10990 11490 11267 11045 10300 10391 10934 10642 10176
6017 10176 9710 9374 9038 9869 10700 11374 10655 10302 9949 10318 10688 10361 10034 10203 10372 10542 10711 10671 10631 10592 10552 10849 11146 10468
6005 10468 9790 10479 11168 11717 10874 9839 9640 9580 9520 10035 10550 9811 9072 9960 10848 11039 11231 10169 9107 9768 10430 11096
5994 11096 10369 9538 9542 10382 11222 10774 10326 11351 10984 9920 10249 10596 10943 10958 10974 10792 10610 10845 11081 10272 9463 9907 10352
5982 10352 10617 10882 10450 9183 9126 10462 11745 11636 11404 11173 11273 11372 10532 9691 10104 10517 10895 11273 11652 12030 11581 11132
$$ packed form
6065A1177L94m41o68o68M36M36J8J8l39l39N84N84J77o59o59J77o68o68Q65Q65M17m17j115
6053I507k78P57P57O36k00l31N05M53l84p66p66J57J57k0k0j9k0J20J20N37N38l46l46l46
6041A0402l46J32J33K37n98m58L77K21K21K1q15p11O82L52L51M39M39r3r2j97O38O03k33o85
6029A1020o86m15m16L7Q73K8q08k85k85J07J06J07J07N00N00N00N00k23k22p45R1N43k92m66
6017A0176m66l36l36Q31Q31O74p19l53l53L69L70l27l27J69J69J70J69m0m0l9m0K97K97o78
6005A0468o78O89O89N49q43j035j99o0o0N15N15p39p39Q88Q88J91J92j062j062O61O62O66
5994A1096p27q31MQ40Q40m48m48J025l67j064L29L47L47J5J6j82j82K35K36q09q09M44M45
5982A0352K65K65m32j267n7J336J283j09k32k31J00R9q40q41M13M13L78L78L79L78m49m49
$$ plain form
5971 11132 11101 11070 11415 11761 10853 9945 10334 10723 11112 11501 10817 10133 10145 10158 10667 11175 11075 10974 10738 11896 12635 11982 11224 10466
5959 10466 10596 10726 9956 9185 10225 11266 11314 11362 11549 10900 10373 11240 11688 12136 12071 12006 11244 10482 10497 10513 10528 10543 9888 9233 8769
5947 8769 9699 10574 11449 11436 11422 11897 12371 12428 12485 12579 12673 12070 11468 10814 10159 10201 10243 10622 11001 10963 10924 10903 10882 11174 11466 12375 11613
5933 11613 10433 10924 10997 11071 10552 10034 10493 10951 10992 11033 11291 11550 11808 12067 11748 11430 11530 11629 11851 12072 12294 12515 12138 11761
5921 11761 12080 12400 12493 12586 11704 10822 11138 11455 11772 12088 11369 10650 9861 10743 11974 11533 10884 10234 10377 10519 11358 12197 12397
5909 12397 12598 12798 12998 12441 11884 12023 12162 12110 12058 11588 11118 10874 10630 11257 11884 12965 12375 12307 12239 11213 10187 9858 9529
5898 9529 9635 9741 10544 11346 11600 11854 12109 12363 12296 12229 11744 11259 10905 10551 10614 10678 11412 12146 12184 12221 11240 10259 10532 10804 10740
5885 10740 10675 10610 10545 10454 10364 10273 10182 10439 10697 10954 11211 11312 11413 11095 10778 11600 12421 11989 11557 10812 10067 10105 10143 10320 11890
$$ packed form
5971A1132l1l1L45L46r08r08L89L89L89L89o84o84J2J3N09N08j00j01k36J158P39o53p58p58
5959A0466J30J30p70p71J040J041M8M8J87o49n27Q67M48M48o5o5p62p62J5J6J5J5o55o55m64
5947H769R30Q75Q75j3j4M75M74N7N7R4R4o03o02o54o55M2M2L79L79l8l9k1k1K92K92R09p62
5933A1613j180M91P3P4n19n18M59M58M1M1K58K59K58K59l19l18J00R9K22K21K22K21l77l77
5921A1761L19L20R3R3q82q82L16L17L17L16p19p19p89Q82J231m41o49o50J43J42Q39Q39K00
5909A2397K01K00K00n57n57J39J39n2n2m70m70k44k44O27O27J081n90o8o8j026j026l29l29
5898I529J06J06Q03Q02K54K54K55K54o7o7m85m85l54l54O3O4P34P34L8L7r81r81K73K72o4
5885A0740o5o5o5r1r0r1r1K57K58K57K57J01J01l18l17Q22Q21m32m32p45p45L8L8J77J570
$$ plain form
5873 11890 12207 11131 11012 10894 10270 11039 12071 12267 12045 11823 11792 11762 11314 10865 11623 12380 12441 12502 11658 10813 11501 12189 12326
5861 12326 12464 12184 11903 11710 11517 11324 11131 10898 10666 10434 10201 10805 11408 11037 10665 11116 11567 11600 11634 11527 11421 11315 11209
5850 11209 11203 11197 11191 11185 11580 11974 11498 12415 12693 11578 11334 11089 10976 10862 10748 10635 10464 10294 10820 11346 11394 11441 11628 10421 9847
5837 9847 10108 10787 11466 10770 10073 10352 10630 11214 11797 11684 11570 11266 10961 11074 11187 11163 11138 10696 10253 11151 12050 12530 13010 12158
5825 12158 11307 11152 10996 11155 11313 11471 11629 11489 11348 11208 11067 11728 12388 12352 12316 11890 11465 11457 11449 11502 11555 11191 10826 10839 10852 10866
5812 10866 10879 11110 11341 10596 9852 10005 10157 11006 11855 12164 12473 12365 12256 11990 11723 11874 12026 11620 11214 11279 11343 10722 10936 11325
5800 11325 11714 11911 11272 11156 11039 10947 11690 11962 12235 12047 11858 11670 11481 11623 11766 11020 11110 11191 11273 11824 12376 12049 11722 10455
5788 10455 10024 10620 10380 10524 12060 12517 12138 12647 13156 13099 11649 11401 12545 12879 12377 12432 12487 11671 10855 11015 11174 11356 11537
$$ packed form
5873A1890L17j076j19j18o24P69J032J96k22k22l1l0m48m49P58P57O1O1q44q45O88O88J37
5861A2326J38k80k81j93j93j93j93k33k32k32k33O04O03l71l72M51M51L3L4j07j06j06j06
5850A1209ooooL95L94m76R17K78j115k44k45j13j14j14j13j71j70N26N26M8M7J87j207n74
5837I847K61O79O79o96o97K79K78N84N83j13j14l04l05J13J13k4k5m42m43Q98Q99M80M80q52
5825A2158q51j55j56J59J58J58J58j40j41j40j41O61O60l6l6m26m25qqN3N3l64l65J3J3J4
5812A0866J3K31K31p45p44J53J52Q49Q49L09L09j08j09k66k67J51J52m06m06O5O4o21K14L89
5800A1325L89J97o39j16j17r2P43K72K73j88j89j88j89J42J43p46R0Q1Q2N51N52l27l27j267
5788A0455m31N96k40J44J536M57l79N09N09n7j450k48J144L34n02N5N5q16q16J60J59J82J81
$$ plain form
5776 11537 11666 11795 12272 11913 12077 12241 11485 11565 12063 11725 11761 11798 10912 11418 12053 11295 10851 11242 12286 11937 10666 10787 10836
5765 10836 10884 11490 11260 11823 12385 13034 12848 11447 11439 12598 12921 13357 13793 13672 13551 14242 13540 12837 13528 13557 13586 13528 12635 12374
5753 12374 12950 13560 13334 12212 12483 13084 12850 12198 11546 11817 12087 11644 11201 10305 10802 12192 12188 12132 12076 12090 12940 13372 12968 12137
5741 12137 11307 11207 11944 12158 12372 12220 12069 12324 12580 12139 11698 11335 10972 11306 11640 11493 11345 11198 11050 10572 10094 11148
5730 11148 12202 12283 12364 12915 12630 12677 12723 12195 12502 13624 13911 13467 13022 12856 12690 12524 12358 12510 12662 12866 12234 12464 12695
5718 12695 12176 11658 11814 11970 11708 11446 12055 12664 12489 11479 11159 10838 10935 11033 10895 11593 12291 12154 12484 12814 12674 12535 12525
5707 12525 12516 12507 12498 12948 13398 13848 14298 13250 12203 12130 12058 12353 12648 12247 11846 12158 12471 12366 12260 11785 11310 10782 11091 12078 13065
5694 13065 13130 13194 12607 12019 12442 13700 14088 13640 13296 12952 12713 12474 12653 12832 12540 12249 11958 11666 11647 11629 11697 11765 10902 11432
$$ packed form
5776A1537J29J29M77l59J64J64p56Q0M98l38L6L7q86N06O35p58m44L91J044l49j271J21M9
5765A0836M8O06k30N63N62O49j86j401qJ159L23M36M36j21j21O91p02p03O91K9K9n8q93k61
5753A2374N76O10k26j122K71O01k34o52o52K71K70m43m43q96M97J390mn6n6J4Q50M32m04q31
5741A2137q30j00P37K14K14j52j51K55K56m41m41l63l63L34L34j47j48j47j48m78m78J054
5730A1148J054Q1Q1N51k85M7M6n28L07J122K87m44m45j66j66j66j66J52J52K04o32K30K31
5718A2695n19n18J56J56k62k62O09O09j75j010l20l21R7R8j38O98O98j37L30L30j40j39j0
5707A2525rrrM50M50M50M50j048j047p3p2K95K95m01m01L12L13j05j06m75m75n28L09R87R87
5694A3065O5O4n87n88M23J258L88m48l44l44k39k39J79J79k92k91k91k92j9j8O8O8q63N30
$$ plain form
5682 11432 13180 14093 13965 13838 13658 13478 13142 12805 12469 12132 12498 12865 12535 12205 12267 12328 12338 12347 12570 11957 11031 11498 11729 11961
5670 11961 12279 12598 12648 12698 12330 11962 12456 12950 13026 13103 12609 12115 12317 12519 12104 11688 12247 12807 12800 12794 12787 12781 12809 12837 12865 12894 13013 13133
5656 13133 12835 12537 12500 12463 12426 12389 12232 12076 12337 12599 12721 12843 12965 13087 12487 11887 12818 13750 13394 13037 12680 12323 12166 12008
5644 12008 12826 13644 13738 13833 13510 13188 12477 11767 12310 12853 12387 11920 11872 11823 12569 13315 13364 13414 12976 12538 12796 13055 12998 12941 12466
5631 12466 11990 12343 12695 12907 12284 11638 12386 12767 12313 12372 12431 12020 13003 13138 12438 12991 13544 13628 13711 13376 13042 12505 11969 12930
5619 12930 13055 12605 12992 13274 13555 13350 13144 13304 13464 13798 13296 12847 12397 12350 12302 12619 12937 12942 12110 12219 12328 12680 13869 13803
5607 13803 12902 12654 12406 12106 11806 11850 11895 12357 12820 12603 12387 12536 12685 13069 12617 12688 12759 11985 12047 11691 11335 11760 13020 13758
5595 13758 14496 14450 13568 13575 13581 13283 12985 12739 11658 11934 12210 12382 12554 13056 12722 12388 12889 13121 13353 13637 13921 13289 12656 12721
$$ packed form
5682A1432J748R13j28j27j80j80l36l37l36l37L66L67l30l30O2O1J0RK23o13r26M67K31K32
5670A1961L18L19N0N0l68l68M94M94P6P7m94m94K02K02m15m16N59N60popoK8K8K8K9J19J20
5656A3133k98k98l7l7l7l7j57j56K61K62J22J22J22J22o00o00R31R32l56l57l57l57j57j58
5644A2008Q18Q18R4R5l23l22p11p10N43N43m66m67m8m9P46P46M9N0m38m38K58K59n7n7m75
5631A2466m76L53L52K12o23o46P48L81m54N9N9m11R83J35p00N53N53Q4Q3l35l34n37n36R61
5619A2930J25m50L87K82K81k05k06J60J60L34n02m49m50m7m8L17L18Nq32J09J09L52J189o6
5607A3803r01k48k48l00l00M4M5M62M63k17k16J49J49L84m52P1P1p74O2l56l56M25J260P38
5595A3758P38m6q82POk98k98k46j081K76K76J72J72N02l34l34N01K32K32K84K84o32o33O5
$$ plain form
5583 12721 12785 13084 13383 13317 13251 12773 13131 14551 14578 13456 13170 14051 14931 14999 13675 13552 13429 12723 12017 12790 13564 13819 13238
5572 13238 12604 12807 13061 12480 11951 12258 12613 12968 12678 12389 12456 12524 13514 14504 14315 13290 12369 12841 12905 12968 13640 13477 12689 12737
5560 12737 12680 12624 12846 13068 13760 13616 13506 13395 13127 13696 14212 13892 14095 14298 14542 14786 14577 13533 13272 13846 13899 13951 14160 14368
5548 14368 13845 12486 12546 13442 13920 13562 13487 14248 14347 13054 12474 12730 12429 12128 12449 12771 13092 13414 13265 13117 13665 14213 13877
5536 13877 13541 13623 13706 13257 12808 12411 12014 12378 13578 14360 14306 14078 13850 13570 13290 13671 14053 13459 12865 13186 13506 13130 12754
5524 12754 13062 13370 13260 13151 12840 12530 12917 13303 13086 12870 12653 12437 13274 14110 14495 14043 13160 13114 13519 13925 13783 13640 13028
5513 13028 13251 13724 14197 14027 13856 13302 12748 12890 13033 12789 12544 12300 12056 12325 12594 12167 11740 12362 12984 13188 13392 13683 13974
5501 13974 14596 15218 16073 15535 14614 14528 14478 14427 14429 14430 14508 14586 14716 14846 14480 14949 15419 15053 14292 13530 13135 12739 12683 12627 13268 13908
$$ packed form
5583A2721O4K99K99o6o6m78L58J420K7j122k86Q81Q80O8j324j23j23p06p06P73P74K55n81
5572A3238o34K03K54n81n29L07L55L55k90k89O7O8R90R90j89j025r21M72O4O3O72j63p88M8
5560A2737n7n6K22K22O92j44j10j11k68N69N16l20K03K03K44K44k09j044k61N74N3N2K09K08
5548A4368n23j359O0Q96M78l58p5P61R9j293n80K56l01l01L21L22L21L22j49j48N48N48l36
5536A3877l36Q2Q3m49m49l97l97L64J200P82n4k28k28k80k80L81L82n94n94L21L20l76l76
5524A2754L08L08j10j09l11l10L87L86k17k16k17k16Q37Q36L85m52q83m6M05M06j42j43o12
5513A3028K23M73M73j70j71n54n54J42J43k44k45k44k44K69K69m27m27O22O22K04K04K91K91
5501A3974O22O22Q55n38r21q6n0n1KJP8P8J30J30l66M69M70l66p61p62l95l96n6n6O41O40
$$ plain form
5488 13908 13660 13413 13061 13544 14411 14442 13550 13494 14014 14534 15245 15120 14090 14453 14868 14448 13618 12788 13195 14437 14765 14257 14272
5477 14272 14287 13838 13389 14194 14999 14620 14242 13863 13484 13827 14171 14096 14022 13191 12359 12729 13098 13961 13988 13789 13589 13416 13243 13713
5465 13713 14184 14390 13759 13129 13334 13610 13885 14212 14539 14219 13900 13998 14096 14038 13979 13921 13862 13366 12870 13576 14281 14386 13655 13620 14422
5452 14422 14563 14705 15004 14466 14016 14401 14630 14859 14509 13323 13304 13284 12960 12636 13287 13938 14088 14238 13830 14258 15792 15933 14629
5441 14629 14160 13740 13319 13647 13975 13816 13657 14194 14731 15120 15509 15149 14789 15004 14384 14337 15684 16471 15866 15486 15107 14597 14923
5429 14923 14779 14635 14699 14762 14356 13949 14701 14616 14584 14552 14884 15215 15076 14937 14964 14155 13398 13477 13029 13417 14275 14298 14894 15491 15340
5417 15340 15188 15245 15302 15307 15312 15334 14521 14230 13938 13234 13365 13671 13977 14291 13769 13300 12831 12727 12623 12938 13252 13488 13724 14517 14474
5404 14474 13564 14048 14618 15189 15507 14989 14471 14789 15003 15217 15482 15748 15814 15879 15893 15906 15605 14468 13663 14250 14680 14275 14374 14474
$$ packed form
5488A3908k48k47l52M83Q67L1q92n6N20N20P11j25j030L63M15m20q30q30M07J242L28n08J5
5477A4272J5m49m49Q05Q05l79l78l79l79L43L44p5p4q31q32L70L69Q63K7j99k00j73j73M70
5465A3713M71K06o31o30K05K76K75L27L27l20l19R8R8n8n9n8n9m96m96P06P05J05p31l5Q02
5452A4422J41J42K99n38m50L85K29K29l50j186j9k0l24l24O51O51J50J50m08M28J534J41j304
5441A4629m69m20m21L28L28j59j59N37N37L89L89l60l60K15o20m7J347P87o05l80l79n10L26
5429A4923j44j44O4O3m06m07P52q5l2l2L32L31j39j39K7q09p57P9m48L88Q58K3N96N97j51
5417A5340j52N7N7NNK2q13k91k92p04J31L06L06L14n22m69m69j04j04L15L14K36K36P93m3
5404A4474r10M84N70N71L18n18n18L18K14K14K65K66O6O5J4J3l01j137q05N87M30m05R9J00
$$ plain form
5392 14474 14034 12758 12370 13375 14632 15054 15058 15061 14672 14282 14537 14792 14907 14187 14389 15427 15695 15127 14332 13538 14345 14317 13505
5380 13505 14086 14501 14080 14634 15188 14976 14763 14551 14339 14031 13723 13415 13107 13191 13275 13358 13442 13049 12655 13463 14271 14853 14599 14171
5368 14171 13743 13467 14027 14064 14102 14783 14629 14110 14983 15785 15751 15856 15961 15457 14953 15372 15791 15861 15096 14330 14401 14637 14873 16049
5356 16049 16389 15822 15256 14219 13182 13460 13738 14068 14398 13833 14104 15386 15274 15205 15137 15156 16010 16975 17104 16727 16351 16488 15790
5345 15790 15092 15229 14698 14168 14385 14603 15335 16066 15823 15579 15472 15365 14839 14314 14206 14099 13991 13884 14290 14696 15016 15335 15602
5333 15602 14475 14028 14417 14464 13675 14139 15439 16078 15880 14952 14023 14697 15370 15347 15324 15257 15190 15072 14953 15830 15872 15165 15293 16449
5321 16449 16769 16080 15390 15314 15238 15162 15087 15550 16014 16530 16211 15895 15580 15265 14949 14913 15712 16041 16370 16457 16544 16214 15883 15727 15570
5309 15570 15414 15257 15618 15979 15835 14856 14782 14707 15033 16195 16846 16661 16475 17126 17271 16581 15943 16141 16353 16564 16132 15699 15754
$$ packed form
5392A4474m40j276l88J005J257M22MLl89l90K55K55J15p20K02J038K68n68p95p94Q07k8q12
5380A3505N81M15m21N54N54k12k13k12k12l08l08l08l08Q4Q4Q3Q4l93l94Q08Q08N82k54m28
5368A4171m28k76N60L7L8O81j54n19Q73Q02l4J05J05n04n04M19M19P0p65p66P1K36K36J176
5356A6049L40n67n66j037j037K78K78L30L30n65K71J282j12o9o8J9Q54R65J29l77l76J37o98
5345A5790o98J37n31n30K17K18P32P31k43k44j07j07n26n25j08j07j08j07M06M06L20L19K67
5333A5602j127m47L89M7p89M64J300O39j98r28r29O74O73k3k3o7o7j18j19Q77M2p07J28J156
5321A6449L20o89o90p6p6p6p5M63M64N16l19l16l15l15l16l6P99L29L29Q7Q7l30l31j56j57
5309A5570j56j57L61L61j44r79p4p5L26J162O51j85j86O51J45o90o38J98K12K11m32m33N5
$$ plain form
5297 15754 15809 16386 16128 15795 16299 15862 15425 15676 15927 15760 15593 15151 14709 15242 15775 15917 16058 15260 15297 15677 15223 14768 15149
5286 15149 15886 15788 15795 15801 15195 14589 14401 14213 14111 14010 14884 15758 15583 15408 15650 15893 15805 15717 15733 14913 14782 15487 15251 15016 15215
5273 15215 15415 15615 15815 15583 15352 15121 14890 15085 15280 15476 15671 15591 15510 16127 16743 17655 18567 17947 17327 16820 16313 15807 15300
5261 15300 15289 15279 15216 15153 15477 14966 14977 14989 15139 16125 16641 16322 17160 17162 15772 14381 14610 14839 15486 16132 15948 15763 16275 16786 16584
5249 16584 16382 16075 16605 17454 17467 17028 16588 16271 15953 15862 16607 16807 17008 16285 15563 16338 17113 16913 16713 16999 17284 17622 17124
5237 17124 16791 16458 16491 16524 16181 15838 15495 15152 15401 15650 16264 16879 17102 16489 16346 16203 16818 17432 17019 16607 17466 17490 16730 15970
5225 15970 16516 17062 16964 16866 16202 16373 17276 18179 18647 18279 16657 15871 16119 16366 16248 16130 16186 16242 15933 15623 15984 17180 17680
5214 17680 17345 16739 16133 15893 16489 17314 16745 16229 17105 16719 16334 16453 16572 16643 16715 16089 15464 15570 15676 15365 15053 15409 15764
$$ packed form
5297A5754N5N77k58l33N04m37m37K51K51j67j67m42m42N33N33J42J41p98L7L80m54m55L81
5286A5149P37r8POo06o06j88j88j02j01Q74Q74j75j75K42K43q8q8J6q20j31P05k36k35J99
5273A5215K00K00K00k32k31k31k31J95J95J96J95q0q1O17O16R12R12o20o20n07n07n06n07
5261A5300j1j0o3o3L24n11J1J2J50R86N16l19Q38Kj390j391K29K29O47O46j84j85N12N11k02
5249A6584k02l07N30Q49J3m39m40l17l18r1P45K00K01p23p22P75P75k00k00K86K85L38m98
5237A7124l33l33L3L3l43l43l43l43K49K49O14O15K23o13j43j43O15O14m13m12Q59K4p60p60
5225A5970N46N46r8r8o64J71R03R03M68l68j622p86K48K47j18j18N6N6l09l10L61J196N00
5214A7680l35o06o06k40N96Q25n69n16Q76l86l85J19J19P1P2o26o25J06J06l11l12L56L55
$$ plain form
5202 15764 16225 15849 15831 16648 16943 17238 16784 16330 16521 16711 17624 17702 17082 17299 16715 16130 16016 15902 16249 16596 17413 17395 16939 16483
5190 16483 16427 17207 17335 16626 16440 16254 16407 16559 16242 16760 17426 18093 18393 17301 16960 17454 17443 17433 16282 15966 16626 16450 16972
5179 16972 17493 17266 17039 17038 17037 16897 17593 18510 18035 17229 17259 17018 16778 16590 16402 17098 17795 18073 18351 18952 19552 18620 17688 18245
5167 18245 18802 18663 18523 17809 17095 16799 16502 16492 16482 16890 17298 17836 18375 18495 18616 18040 17464 16888 16312 16981 17650 17622 17595 18132
5154 18132 18670 18232 17794 17696 17598 17499 17401 17142 16883 17877 18871 18847 18823 18102 17382 17083 16784 16903 17021 17132 17242 17352 17462 17133 16803
5142 16803 16892 16980 17835 18689 18569 18448 18669 18889 19110 19331 18898 18466 18034 17601 17968 18334 18701 19067 18467 17867 17685 17503 17521 17539
5130 17539 17557 17574 17592 17610 17627 17645 17946 18246 18129 18012 18129 18247 18365 18483 18871 19259 19647 20035 19004 17973 17916 17860 17885 17909 17934 17958
5117 17958 18392 18826 18284 17743 17965 18188 17993 17797 18507 19217 19231 19245 19384 19524 18968 18411 18394 18377 18778 19179 19274 19369 19045 18722 19061
$$ packed form
5202A5764M61l76j8Q17K95K95m54m54J91J90R13P8o20K17n84n85j14j14L47L47Q17j8m56m56
5190A6483n6P80J28p09j86j86J53J52l17N18O66O67L00j092l41M94j1j0j151l16O60j76N22
5179A6972N21k27k27jjj40O96R17m75q06L0k41k40j88j88O96O97K78K78O01O00r32r32N57
5167A8245N57j39j40p14p14k96k97j0j0M08M08N38N39J20J21n76n76n76n76O69O69k8k7N37
5154A8132N38m38m38r8r8r9r8k59k59R94R94k4k4p21p20k99k99J19J18J11J10J10J10l29l30
5142A6803Q9Q8Q55Q54j20j21K21K20K21K21m33m32m32m33L67L66L67L66o00o00j82j82J8J8
5130A7539J8J7J8J8J7J8L01L00j17j17J17J18J18J18L88L88L88L88j031j031n7n6K5K4K5K4
5117A7958M34M34n42n41K22K23j95j96P10P10J4J4J39J40n56n57j7j7M01M01R5R5l24l23L39
$$ plain form
5104 19061 19399 18815 18230 17816 18237 19389 19149 18229 17310 17034 17595 17964 17497 16908 16319 16662 17841 17853 17865 18565 19264 20434
5093 20434 20768 20005 19242 18427 17612 18153 18695 18295 18732 18881 18195 18727 19260 19266 19271 19381 18656 18757 19695 19692 19689 20047 20405 20711 21017
5081 21017 21350 20846 19925 19839 19518 19197 19260 19322 19767 18820 18238 19049 19599 19314 18053 16793 17265 17737 18261 18785 18295 18641 18935
5069 18935 19228 19261 19293 19325 19358 19108 18859 19027 19196 19321 19445 20458 20635 20051 19466 19247 19028 18940 18851 18763 18674 19134 19594 19357 19121
5057 19121 19450 19779 20108 20437 20466 20495 20994 20657 20268 19879 19438 18997 19356 19716 19605 20331 20481 20632 20887 20307 20538 20769 20252
5045 20252 19734 19983 20232 20254 19441 18885 18329 18696 19063 19360 19658 20373 21088 20761 20434 20524 20615 20366 20117 19868 19619 19858 20096 20474
5033 20474 21688 22066 21051 20871 20692 20326 19959 20289 20619 20409 20200 19990 19780 19981 20182 19687 19191 19680 20168 20238 20309 20295 20280
5021 20280 20962 21644 21908 22173 21462 20751 20392 20034 20372 20710 20831 20952 20654 20357 20588 20820 21051 21283 21410 21537 21664 21791 21755
$$ packed form
5104A9061L38n84n85m14M21J152k40r20r19k76N61L69m67n89n89L43J179J2J2P00O99J170
5093B0434L34p63p63q15q15N41N42m00M37J49o86N32N33ONJ10p25J01R38llL58L58L06L06
5081B1017L33n04r21q6l21l21O3O2M45r47n82Q11N50k85j261j260M72M72N24N24m90L46K94
5069A8935K93L3L2L2L3k50k49J68J69J25J24J013J77n84n85k19k19q8q9q8q9M60M60k37k36
5057A9121L29L29L29L29K9K9M99l37l89l89m41m41L59L60j11P26J50J51K55n80K31K31n17
5045B0252n18K49K49K2q13n56n56L67L67K97K98P15P15l27l27R0R1k49k49k49k49K39K38L78
5033B0474J214L78j015j80j79l66l67L30L30k10k09k10k10K01K01m95m96M89M88P0P1j4j5
5021B0280O82O82K64K65p11p11l59l58L38L38J21J21k98k97K31K32K31K32J27J27J27J27l6
$$ plain form
5010 21755 21719 22100 22482 22272 22062 21851 21641 21424 21207 21408 21609 21184 20758 21029 21299 21067 20835 20603 20371 20609 20847 21085 21323
4998 21323 21405 21486 21149 20813 21303 21794 21588 21382 21759 22137 21817 21498 21319 21139 21377 21615 21607 21599 22009 22419 21802 21184 20672 21552 23227
4986 23227 23510 22852 22195 21677 21158 20274 20783 21527 22272 22406 22541 22266 21992 22135 22279 22087 21894 21755 21615 21179 21579 21927 22274
4974 22274 22485 22695 22906 23117 22413 21709 21702 21695 21536 21376 21914 22451 21908 21366 22025 22683 23432 23344 22839 23169 22855 22541 22976 23410
4962 23410 22724 22037 22325 22614 21283 19952 20710 21469 22336 23204 23374 23545 22880 22216 22247 22279 22269 22259 21831 21404 21629 21854 22027
4951 22027 22200 22319 21602 21860 22953 23438 23922 24319 23323 22970 23453 23326 23199 23804 23573 22645 22553 22500 22447 22447 22446 22211 21975 22384 22792
4938 22792 23502 23377 23112 22847 22173 22891 23297 22866 22360 21853 22043 22233 21578 21760 22115 22470 23422 23538 23427 23317 22719 22121 22219
4927 22219 22318 22795 23272 23331 23391 23511 23631 23752 23872 24065 24258 23755 23252 22705 22158 22865 23571 23680 23788 24314 24840 24313 23786 23259
$$ packed form
5010B1755l6L81L82k10k10k11k10k17k17K01K01m25m26K71K70k32k32k32k32K38K38K38K38
4998B1323Q2Q1l37l36M90M91k06k06L77L78l20l19j79j80K38K38qqM10M10o17o18n12Q80J675
4986B3227K83o58o57n18n19q84N09P44P45J34J35k75k74J43J44j92j93j39j40m36M00L48L47
4974B2274K11K10K11K11p04p04ppj59j60N38N37n43n42O59O58P49q8n05L30l14l14M35M34
4962B3410o86o87K88K89j331j331P58P59Q67Q68J70J71o65o64L1L2j0j0m28m27K25K25J73
4951B2027J73J19p17K58J093M85M84L97r96l53M83j27j27O05k31r28r2n3n3%jk35k36M09M08
4938B2792P10j25k65k65o74P18M06m31n06n07J90J90o55J82L55L55R52J16j11j10n98n98R8
4927B2219R9M77M77N9O0J20J20J21J20J93J93n03n03n47n47P07P06J09J08N26N26n27n27n27
$$ plain form
4915 23259 22731 22998 23265 23114 22963 23021 23079 23085 23090 23673 23420 23219 23018 23191 23364 23955 24547 24146 23746 24565 24548 23120 22528 22947 23365
4902 23365 24109 24854 24867 24045 23788 24367 24894 24586 24047 23508 23892 24277 24313 24348 25081 25813 25409 25006 24602 24198 24195 24192 24606 25021 24784
4889 24784 24547 24362 24177 23600 23859 24344 24829 25378 25926 25221 24516 24560 24603 24647 24690 24394 24098 23854 23610 24314 25855 26699 26708 26283
4877 26283 25858 25434 25009 24515 24856 25615 25539 25409 25279 25097 24915 25404 25892 25858 26660 26691 25887 25657 25427 25476 26360 26043 24890 24557
4865 24557 25059 25735 26412 26313 26215 26116 26018 26063 26108 26571 27034 27201 27368 27535 27702 27079 26456 26530 26603 26067 25531 25692 25852 26174 26496
4853 26496 27339 27348 26128 25745 25535 25326 26330 27333 27554 26938 26750 26561 26320 26079 26658 27238 26842 26447 26704 26961 26801 26640
4842 26640 26812 26983 26737 26490 26923 27355 26813 26270 26831 27392 26700 26007 26846 27686 27551 27415 27641 27867 27449 27031 26883 27570 28571
4830 28571 28179 28061 27943 27564 28578 28539 27107 27015 26923 27307 28527 29050 28737 28312 27886 28104 28323 28204 28085 27444 27638 28433 28393
$$ packed form
4915B3259n28K67K67j51j51N8N8ONN83k53k01k01J73J73N91N92m01m00Q19j7j428n92M19M18
4902B3365P44P45J3q22k57N79N27l08n39n39L84L85L6L5P33P32m04m03m04m04llM14M15k37
4889B4784k37j85j85n77K59M85M85N49N48p05p05M4M3M4M3k96k96k44k44P04J541Q44Rm25
4877B6283m25m24m25m94L41P59p6j30j30j82j82M89M88l4Q02L1q04k30k30M9Q84l17j153l33
4865B4557N02O76O77r9r8r9r8M5M5M63M63J67J67J67J67o23o23P4P3n36n36J61J60L22L22
4853B6496Q43Rj220l83k10k09J004J003K21o16j88j89k41k41N79N80l96l95K57K57j60j61
4842B6640J72J71k46k47M33M32n42n43N61N61o92o93Q39Q40j35j36K26K26m18m18j48O87J001
4830B8571l92j18j18l79J014l9j432r2r2L84J220N23l13m25m26K18K19j19j19o41J94P95m0
$$ plain form
4819 28393 28178 27964 27384 26805 27200 27596 27425 27255 27137 27019 26598 27014 27847 27844 27893 27943 27940 27937 27675 27412 28350 29289 29618 29112 28605
4806 28605 28934 29246 29558 29225 28893 29031 29168 29306 29444 29373 29303 28815 28327 28248 28169 28090 28011 28242 28472 28180 28723 29197 28835 28891 29783
4794 29783 30239 29859 29027 28194 28572 28949 28770 29426 29447 28075 27399 28116 29260 29568 28935 29139 29671 29368 29482 30433 30469 29669 29392
4782 29392 29115 29256 29396 28840 28285 28573 28862 29203 28708 28629 28551 28368 29020 29412 29803 29550 29298 29145 28992 28422 27851 28291 28730
4771 28730 29640 29713 29568 29423 29225 29028 29379 29730 30081 30432 30173 29915 30074 30234 29845 29456 29119 28782 29026 30106 30629 31152 31919
4759 31919 31292 31032 30771 30815 30859 30486 30112 29268 28424 28642 29696 30379 31062 31658 31418 31126 32227 32265 31468 31331 31193 31421 31649
4747 31649 31207 30765 30374 29984 29284 29420 30060 30701 30349 29997 30098 31034 31402 30935 31077 31219 30038 30250 31158 32066 31938 30974
4736 30974 30532 30090 29753 30251 30279 30308 30001 29694 30641 31587 31611 31635 31659 31683 31603 31522 30745 29968 30410 30852 31294 31735 32251 32767 32586
$$ packed form
4819B8393k15k14n80n79L95L96j71j70j18j18m21M16Q33lM9N0llk62k63R38R39L29n06n07
4806B8605L29L12L12l33l32J38J37J38J38p1p0m88m88p9p9p9p9K31K30k92N43M74l62N6Q92
4794B9783M56l80q32q33L78L77j79O56K1j372o76P17J144L08o33K04N32l03J14R51L6q00k77
4782B9392k77J41J40n56n55K88K89L41m95p9p8j83O52L92L91k53k52j53j53n70n71M40M39
4771B8730R10P3j45j45j98j97L51L51L51L51k59k58J59J60l89l89l37l37K44J080N23N23P67
4759C1919o27k60k61M4M4l73l74q44q44K18J054O83O83N96k40k92J101L8p97j37j38K28K28
4747C1649m42m42l91l90p00J36O40O41l52l52J01R36L68m67J42J42j181K12R08R08j28r64
4736C0974m42m42l37M98K8K9l07l07R47R46K4K4K4K4q0q1p77p77M42M42M42M41N16N16j81
$$ plain form
4724 32586 32406 32094 31783 31524 31265 30899 31368 31420 31472 30749 30861 31374 30494 29893 30685 30710 29900 29272 29481 30420 31360 31597 31833 31600
4712 31600 31366 31725 31247 30352 30293 30403 30514 31321 32127 32464 31965 31988 32012 31459 31741 31502 31262 31449 30800 30151 30338 30488 30638 31258
4700 31258 31878 31122 30367 30586 30806 30595 30383 30172 29960 29810 29660 29561 29463 29585 30542 31029 31517 31847 32178 32090 32003 32290 32578 31942
4688 31942 31307 30602 30732 31838 32108 32430 32752 32326 31899 31490 31081 31090 31099 30907 30715 31219 31724 32124 32524 32018 30120 28855 29540
4676 29540 30016 30492 30472 30452 30432 30412 30107 29802 29671 30376 30890 30567 30245 30758 31345 31097 30431 30600 30909 30382 30430 30477 30366 31089 31169
4664 31169 30413 30371 31165 31436 31707 31275 30844 30830 30816 31115 31415 31297 31178 30999 30821 30642 30463 30275 30088 29483 28877 28605 28332 28478
4652 28478 28623 28551 28479 28494 28509 27896 28676 29839 30166 30066 29967 29955 29107 28283 28851 29472 29258 28573 27888 27847 27807 28139 28471 27828 27185
4639 27185 27631 28076 27825 27574 27658 27742 27826 27910 27846 27782 27718 27654 27583 27511 27440 27368 27819 28270 28773 28440 28639 28837 28286 27736 27612 27489 27365
$$ packed form
4724C2586j80l12l11k59k59l66M69N2N2p23J12N13q80o01P92K5q10o28K09R39R40K37K36k33
4712C1600k34L59m78q95n9J10J11Q07Q06L37m99K3K4n53K82k39k40J87o49o49J87J50J50O20
4700C1258O20p56p55K19K20k11k12k11k12j50j50r9r8J22R57M87M88L30L31q8q7K87K88o36
4688C1942o35p05J30J106K70L22L22m26m27m09m09RRj92j92N04N05M00M00n06j898j265O85
4676B9540M76M76k0k0k0k0l05l05j31P05N14l23l22N13N87k48o66J69L09n27M8M7j11P23Q0
4664C1169p56m2P94K71K71m32m31j4j4K99L00j18j19j79j78j79j79j88j87o05o06k72k73J46
4652B8478J45p2p2J5J5o13P80J163L27j00r9j2q48q24N68O21k14o85o85m1m0L32L32o43o43
4639B7185M46M45k51k51Q4Q4Q4Q4o4o4o4o4p1p2p1p2M51M51N03l33J99J98n51n50j24j23j24
$$ plain form
4625 27365 27241 27434 27627 27124 26621 27136 27651 27714 26941 27273 28441 28338 28236 27915 26759 26299 26675 26942 27209 27477 27744 28394
4614 28394 28208 27744 27280 27782 27449 27115 27617 27214 26811 26408 26005 26654 26468 25550 26025 26335 26645 26380 24723 23892 24455 24843
4603 24843 25231 25132 25032 25351 25670 25419 25168 25614 26060 26184 26308 25230 24153 23978 24640 25301 25127 24508 23890 23916 23941 24120 24298
4592 24298 23780 23262 22971 22679 22805 22932 22603 22274 22364 22453 23021 23589 23739 23889 23947 24005 24010 24015 24230 23608 22517 22261 22458 21819 21233
4579 21233 21482 21905 22329 23274 23384 23200 23015 23474 23934 22966 21997 21813 22464 22340 22216 22145 22073 21679 21286 20422 20394 20207 20020 19363
4567 19363 19542 20269 20160 20574 20988 20523 20057 20009 19962 20524 21085 21699 21478 21379 21280 20572 20700 21045 19997 19420 20235 20506 20777 21240
4555 21240 20867 20512 20992 20950 20907 20373 19839 19305 18771 19195 19618 19346 19073 18861 18649 18576 19339 20050 19368 18355 18178 18525 18872
4544 18872 18819 17930 17250 17406 17404 17403 17418 16596 16105 17007 17962 18080 17502 16925 17298 17671 17626 17582 17929 18276 18205 18135 18166 18198 18699 18365 17796
$$ packed form
4625B7365j24J93J93n03n03N15N15O3p73L32J168j03j02l21j156m60L76K67K67K68K67O50
4614B8394j86m64m64N02l33l34N02m03m03m03m03O49j86r18M75L10L10k65j657q31N63L88
4603B4843L88r9j00L19L19k51k51M46M46J24J24j078j077j75O62O61j74o19o18K6K5J79J78
4592B4298n18n18k91k92J26J27l29l29R0Q9N68N68J50J50N8N8NNK15o22j091k56J97o39n86
4579B1233K49M23M24R45J10j84j85M59M60r68r69j84O51j24j24p1p2l94l93q64k8j87j87o57
4567A9363J79P27j09M14M14m65m66m8m7N62N61O14k21r9r9p08J28L45j048n77Q15K71K71M63
4555B1240l73l55M80m2m3n34n34n34n34M24M23k72k73k12k12p3P63P11o82j013j77L47L47
4544A8872n3q89o80J56kjJ5q22m91R02R55J18n78n77L73L73m5m4L47L47p1p0L1L2N01l34n69
$$ plain form
4530 17796 17227 16553 16716 16442 16168 16365 16561 16457 16353 16946 17538 17169 16799 16221 15643 15669 15696 15723 15749 16244 16738 15979 15220 15632
4518 15632 16044 16038 16032 16004 15977 15740 15503 15780 16057 15916 15775 15793 15810 15949 16088 17145 16810 15813 15651 16243 16835 16225 15615 15328 15040
4505 15040 14753 14465 15224 15984 15489 14995 15397 15800 15227 14654 15710 16765 16010 15254 14542 13830 13815 13799 13944 14089 14234 14379 14576
4494 14576 14774 14274 13775 14029 14283 14537 14791 14522 14253 13985 13716 13946 14176 13988 13800 13686 13572 13040 12508 12582 12655 12519 12383
4482 12383 12835 13287 13739 14191 13534 12876 12915 12955 12323 11692 12872 14052 14326 14600 13899 13198 12820 12441 12062 11684 11951 12219 13183
4471 13183 14147 13658 13168 13375 13581 12757 11932 12082 12232 12330 12428 13222 14017 13400 12783 12862 12942 13038 13135 12814 12493 11902 11311 11138 10965
4458 10965 11062 11159 12144 13129 13416 12309 11517 11560 11472 11384 12045 12707 13102 13498 13197 12896 13222 13548 13177 12807 12150 11494 11534 11574 11788
4446 11788 12002 12634 13266 12305 11344 11079 10814 10880 10946 10595 10243 11070 11897 11750 11602 11820 12038 11559 11081 11508 11934 11943 11952 12344 12736
$$ packed form
4530A7796n69o74J63k74k74J97J96j04j04N93N92l69l70n78n78K6K7K7K6M95M94p59p59M12
4518A5632M12ook8k7k37k37K77K77j41j41J8J7J39J39J057l35r97j62N92N92o10o10k87k88
4505A5040k87k88P59P60m95m94M02M03n73n73J056J055p55p56p12p12j5j6J45J45J45J45J97
4494A4576J98n00m99K54K54K54K54k69k69k68k69K30K30j88j88j14j14n32n32P4P3j36j36
4482A2383M52M52M52M52o57o58L9M0o32o31J180J180K74K74p01p01l78l79l79l78K67K68R64
4471A3183R64m89m90K07K06q24q25J50J50R8R8P94P95o17o17P9Q0R6R7l21l21n91n91j73j73
4458A0965R7R7R85R85K87j107p92M3q8q8O61O62L95L96l01l01L26L26l71l70o57o56M0M0K14
4446A1788K14O32O32r61r61k65k65O6O6l51l52Q27Q27j47j48K18K18m79m78M27M26RRL92L92
$$ plain form
4433 12736 12432 12128 11560 10992 11121 11249 11552 11855 11183 10511 11005 11499 11297 11095 10893 10691 11464 12236 11619 11001 11079 11158 11707
4422 11707 12255 12386 12517 11479 10441 10100 9759 10061 10364 10249 10134 10100 10066 10450 10834 10539 10243 10645 11046 10971 10895 10402 9909
4410 9909 10042 10176 9892 9607 10536 11464 11418 11371 10998 10625 10461 10297 10181 10065 9949 9833 10182 10532 10907 11283 10849 10833 11078 10488
4398 10488 10611 11152 10709 10267 10385 10502 9976 9449 9411 10207 10987 10373 9108 9235 10241 10411 10095 10195 9957 9718 10147 9739
4387 9739 8967 9029 9388 10583 11220 10465 9970 10312 10357 9985 10352 11138 11227 10898 10473 10466 10146 9826 10577 10491 9658 9660 9796 9097 8921
4374 8921 8744 8994 9244 9494 9744 9829 9914 9998 10083 9880 9677 9475 9272 9023 8775 8944 9113 9526 9939 10352 10765 10015 9264 8932
4362 8932 8600 9085 9571 9648 9307 8910 9349 10232 10280 9787 10131 10840 10713 10426 10139 10244 10349 10846 11761 12336 11518 10402 10678
4351 10678 11007 11335 11655 11140 10162 9603 9901 10199 9522 8846 9605 9947 9583 10056 10071 9251 9137 9440 10108 10777 10775 10774 10933 11093
$$ packed form
4433A2736l04l04n68n68J29J28L03L03o72o72M94M94k02k02k02k02P73P72o17o18P8P9N49
4422A1707N48J31J31j038j038l41l41L02L03j15j15l4l4L84L84k95k96M02M01p5p6m93m93
4410I909J33J34k84k85R29R28m6m7l73l73j64j64j16j16j16j16L49L50L75L76m34j6K45n90
4398A0488J23N41m43m42J18J17n26n27l8P96P80o14j265J27J006J70l16J00k38k39M29m08
4387I739p72O2L59J195O37p55m95L42M5l72L67P86Q9l29m25pl20l20P51q6q33KJ36o99j76
4374H921j77K50K50K50K50Q5Q5Q4Q5k03k03k02k03k49k48J69J69M13M13M13M13p50p51l32
4362H932l32M85M86P7l41l97M39Q83M8m93L44P09j27k87k87J05J05M97R15N75q18j116K76
4351A0678L29L28L20n15r78n59K98K98o77o76P59L42l64M73J5q20j14L03O68O69kjJ59J60
$$ plain form
4339 11093 11252 11412 11562 11713 11446 11179 11344 11510 11258 11006 10501 9996 9492 8987 8709 8430 9127 9824 10634 11444 10721 9999 10314
4327 10314 10630 10527 10425 10244 10063 10578 11094 10808 10523 10238 9952 10050 10148 10245 10343 9862 9380 9317 9254 9312 9371 9429 9488 10142 10797 11034
4314 11034 11271 10690 10108 10223 10339 10336 10334 10331 10329 10474 10620 10348 10075 10469 10863 10838 10814 10738 10661 11003 11344 10673 10001 10583 11166 10407 9649
4301 9649 10057 10465 11452 11046 9978 9747 9341 8935 9278 9620 9282 8943 8709 9311 10662 10062 9828 10987 10832 10676 10607 10539 11045
4289 11045 11551 10525 9498 9992 10485 10283 10080 10582 11084 11168 11253 11176 11099 11023 10946 11052 11158 10568 9977 9439 8900 9336 9773 10766
4277 10766 11760 11778 11797 11086 10376 10919 11462 11299 11137 10975 10813 10336 9858 10356 10853 11116 11378 11223 11068 11285 11501 11300 11099
4266 11099 11151 11202 11253 11305 11604 11903 11227 10551 10145 9738 10307 10876 11114 11352 10894 10435 10125 9815 10479 11144 10903 10662 10422 10181
4254 10181 9966 9751 10233 10715 10365 10016 10363 10710 10369 10028 10105 10182 10638 11093 11549 12005 10789 9573 10447 11320 11132 10943 10755
$$ packed form
4339A1093J59J60J50J51k67k67J65J66k52k52n05n05n04n05k78k79O97O97Q10Q10p23p22L15
4327A0314L16j03j02j81j81N15N16k86k85k85k86R8R8R7R8m81m82o3o3N8N9N8N9O54O55K37
4314A1034K37n81n82J15J16lklkJ45J46k72k73L94L94k5k4p6p7L42L41o71o72N82N83p59p58
4301I649M08M08R87m06j068k31m06m06L43L42l38l39k34O02J351o00k34J159j55j56o9o8N06
4289A1045N06j026j027M94M93k02k03N02N02Q4Q5p7p7p6p7J06J06n90n91n38n39M36M37R93
4277A0766R94J8J9p11p10N43N43j63j62j62j62m77m78M98M97K63K62j55j55K17K16k01k01
4266A1099N2N1N1N2K99K99o76o76m06m07N69N69K38K38m58m59l10l10O64O65k41k41k40k41
4254A0181k15k15M82M82l50l49L47L47l41l41P7P7M56M55M56M56j216j216Q74Q73j88j89j88
$$ plain form
4242 10755 10566 11213 11860 11811 11762 11859 11956 12053 12150 11821 11492 11580 11668 10799 9930 10593 11256 11257 11259 11260 11261 11451 11641 11830 12020 11339 10658 10673
4228 10673 10689 10369 10050 10426 10803 10780 10756 10872 10151 8952 9146 9757 10369 10606 10844 11081 11318 11555 11792 11333 10874 10955 11035 11533
4216 11533 12032 12007 11982 11957 11932 11593 11255 10916 10578 10018 9457 9593 9729 10022 10315 10555 10796 11290 10948 10432 9916 10045 11009 11503
4204 11503 11997 11538 11079 11316 11553 11668 11784 11377 11806 12168 11695 11378 11061 10744 11264 11783 11466 10879 10293 9602 9747 10353 10959
4192 10959 11722 11649 11524 12235 12528 11985 11294 11439 11062 10685 10954 11223 12188 13154 12457 11759 11758 11758 12240 12722 11951 11180 11157 11135 11112
4180 11112 11089 11282 11475 11668 11861 11732 11603 11526 11449 10638 10662 11662 11826 11651 11475 11195 10915 11475 11200 10872 11380 12201 12187 12277
4168 12277 12367 12501 12634 12541 11613 12130 12646 12414 12182 11541 10900 10955 11010 10996 10981 10549 9281 8988 10088 10996 11904 11803 10865 10572
4156 10572 11115 11819 11687 10545 10796 11639 11646 11793 11939 12185 12431 12258 12086 11783 11480 11177 10875 11721 12567 12996 13424 13008 12592
$$ packed form
4242A0755j89O47O47m9m9R7R7R7R7l29l29Q8Q8q69q69O63O63JKJJJ90J90J89J90o81o81J5
4228A0673J6l20l19L76L77k3k4J16p21j199J94O11O12K37K38K37K37K37K37m59m59Q1Q0M98
4216A1533M99k5k5k5k5l39l38l39l38n60n61J36J36K93K93K40K41M94l42n16n16J29R64M94
4204A1503M94m59m59K37K37J15J16m07M29L62m73l17l17l17N20N19l17n87n86o91J45O06O06
4192A0959P63p3j25P11K93n43o91J45l77l77K69K69R65R66o97o98j%M82M82p71p71k3k2k3
4180A1112k3J93J93J93J93j29j29p7p7q11K4J000J64j75j76k80k80N60k75l28N08Q21j4R0
4168A2277R0J34J33r3r28N17N16k32k32o41o41N5N5j4j5m32j268k93J100R08R08j01r38k93
4156A0572N43P04j32j142K51Q43PJ47J46K46K46j73j72l03l03l03l02Q46Q46M29M28m16m16
$$ plain form
4144 12592 12925 13257 12500 12578 12831 13083 13971 14023 13344 12665 12117 12404 12221 12038 11969 11899 12474 13048 13725 13566 12954 12342 11739 11971
4132 11971 12901 12994 13020 13046 12497 12784 13088 12557 12548 12539 12686 12833 12511 12188 12239 11455 10671 10722 10475 10229 10504 9944 11108 12272 12408
4120 12408 12544 12038 11531 11199 11702 12528 12518 12333 12149 12095 12041 12040 12038 11836 12470 13801 14295 13797 13299 12696 12930 13137 13344 13603 13862
4107 13862 12994 12126 12007 11887 11393 11735 12582 13429 12936 12444 12839 12399 11784 11169 10920 12064 12347 11793 12545 13297 12874 13287
4096 13287 13595 13904 13934 13128 12322 12352 12591 12830 13068 13307 13063 11983 11599 12051 12599 13147 13051 12955 12678 12401 13064 12892 12528 12999
4084 12999 12531 12062 12743 13424 13408 13392 13751 14109 13771 13433 13475 13517 13558 13600 12945 12290 12611 12931 12894 12857 12821 12784 12878 12972 12369 11766 12735
4070 12735 13704 13471 13239 12963 13522 14395 13875 13107 12339 12181 13415 14327 14404 14254 13268 12508 11748 11353 10959 11661 12363 12648 12932
4059 12932 13334 13736 13442 13148 12287 11427 11489 11552 12288 12188 11688 12581 13100 12225 12221 12217 12523 12828 13133 13438 12899 12360 12517 12674 12851
$$ packed form
4144A2592L33L32p57P8K53K52Q88N2o79o79n48K87j83j83o9p0N75N74O77j59o12o12o03K32
4132A1971R30R3K6K6n49K87L04n31rrJ47J47l22l23N1p84p84N1k47k46K75n60J164J164J36
4120A2408J36n06n07l32N03Q26j0j85j84n4n4jkk02O34J331M94m98m98o03K34K07K07K59K59
4107A3862q68q68j19j20m94L42Q47Q47m93m92L95m40o15o15k49J144K83n54P52P52m23M13
4096A3287L08L09L0q06q06L0K39K39K38K39k44j080l84M52N48N48r6r6k77k77O63j72l64M71
4084A2999m68m69O81O81j6j6L59L58l38l38M2M2M1M2o55o55L21L20l7l7l6l7R4R4o03o03R69
4070A2735R69k33k32k76N59Q73n20p68p68j58J234R12P7j50r86p60p60l95l94P02P02K85K84
4059A2932M02M02k94k94q61q60O2O3P36j00n00Q93N19q75mmL06L05L05L05n39n39J57J57J77
$$ plain form
4046 12851 13029 13206 13383 12812 12241 12645 13048 13163 13277 13391 13505 13785 14065 13926 13788 13270 12752 12931 13109 13079 13048 12600 12152
4035 12152 12535 12918 12883 12848 12944 13040 13832 14624 14396 14167 13939 13710 13569 13427 13286 13145 12831 12518 12901 13284 13275 13267 13258 13250 13419 13589 13759
4021 13759 13929 14099 14269 14351 14434 15033 14238 13392 13938 14367 13960 13588 14052 14437 13987 13850 13713 14033 14354 13977 13601 13567 13532 14020
4009 14020 13672 13694 14552 14504 15292 16204 15166 15696 16225 15196 14166 13590 13849 14283 13880 14209 14538 13922 13307 13666 14025 13718
3998 13718 13411 13521 13632 12858 12085 12287 12489 12795 13102 13617 14132 13790 13448 13523 13599 14552 15504 15761 16017 16204 16390 16124 15022
3986 15022 13934 13681 13915 13314 12939 14514 15933 15958 15756 15553 15473 15392 15560 15727 16156 15749 15018 14287 13642 13834 14626 14025 12868
3975 12868 12545 12717 13725 14628 14696 14994 16128 16792 16620 16605 16589 15599 14609 13732 13690 13875 14060 14206 14353 14499 14645 14895 15146
3963 15146 15396 15647 15260 14873 15461 16049 15953 15858 15344 14831 15143 15456 15925 16395 17034 16837 16692 16548 16647 16747 15592 14438 14494
$$ packed form
4046A2851J78J77J77n71n71M04M03J15J14J14J14K80K80j39j38n18n18J79J78l0l1m48m48
4035A2152L83L83l5l5R6R6P92P92k28k29k28k29j41j42j41j41l14l13L83L83rqrqJ69J70J70
4021A3759J70J70J70Q2Q3N99p95q46N46M29m07l72M64L85m50j37j37L20L21l77l76l4l5M88
4009A4020l48K2Q58m8P88R12j038N30N29j029j030n76K59M34m03L29L29o16o15L59L59l07
3998A3718l07J10J11p74p73K02K02L06L07N15N15l42l42P5P6R53R52K57K56J87J86k66j102
3986A5022j088k53K34o01l75J575J419K5k02k03q0q1J68J67M29m07p31p31o45J92P92o01j157
3975A2868l23J72J008R03O8K98J134O64j72j5j6r90r90q77m2J85J85J46J47J46J46K50K51
3963A5146K50K51l87l87N88N88r6r5n14n13L12L13M69M70O39j97j45j44R9J00j155j154N6
$$ plain form
3952 14494 14549 14657 14765 14027 14124 14952 15781 16087 15557 14662 15159 16216 16438 16519 16601 16431 16260 15724 15188 14429 14507 14811 15115 14936
3940 14936 14756 14786 14816 14647 14479 14363 14246 14596 15781 16026 16272 16177 15246 15255 15265 15240 16050 16164 15442 15265 15087 15275 15463 15181 14899
3927 14899 14791 15519 16284 16214 16249 16284 16370 16457 16126 15795 15890 15986 16778 17570 16821 16072 15271 15305 15174 15042 14963 14884 14670 14456 14242 14028
3914 14028 14536 15045 15762 16479 16296 16112 15981 15014 15352 15691 15037 15219 16198 16341 15752 15164 15472 15780 15880 15979 15316 14654 14740
3903 14740 14826 14461 14932 15629 16326 16549 16771 17307 17007 16063 15955 15794 14798 14903 15008 14852 16089 17552 17065 15482 14734 14757
3892 14757 14779 14854 14929 15165 15400 15375 15350 15808 15430 15156 14883 14963 15879 15906 15934 15614 15293 15669 16045 16497 16950 16705 16461 16147 15833
3879 15833 15658 16877 17660 17608 17940 17435 16913 17227 16844 15625 14820 14851 15056 15261 16110 16959 16833 16707 16334 15960 16005 16050 16477
3868 16477 16905 16166 15427 15422 16809 17779 17355 16741 16126 15842 15558 16639 17721 17514 16472 15804 15971 16087 15366 15484 15601 15249
$$ packed form
3952A4494N5J08J08p38R7Q28Q29L06n30q95M97J057K22Q1Q2j70j71n36n36p59P8L04L04j79
3940A4936j80L0L0j69j68j16j17L50J185K45K46r5r31RJ0k5Q10J14p22j77j78J88J88k82k82
3927A4899j08P28P65p0L5L5Q6Q7l31l31R5R6P92P92p49p49q01L4j31j32p9p9k14k14k14k14
3914A4028N08N09P17P17j83j84j31r67L38L39o54J82R79J43n89n88L08L08J00R9o63o62Q6
3903A4740Q6l65M71O97O97K23K22N36l00r44j08j61r96J05J05j56J237J463m87j583p48K3
3892A4757K2P5P5K36K35k5k5M58l78k74k73Q0R16K7K8l20l21L76L76M52M53k45k44l14l14
3879A5833j75J219P83n2L32n05n22L14l83j219q05L1K05K05Q49Q49j26j26l73l74M5M5M27
3868A6477M28p39p39nJ387R70m24o14o15k84k84J081J082k07j042o68J67J16p21J18J17l52
$$ plain form
3856 15249 14896 15005 15114 15588 16063 16942 16985 16524 16063 16350 16637 16977 16481 16117 15754 15164 15967 16779 16198 16539 16881 16710 17375
3845 17375 17152 16929 16488 16047 16355 16663 15938 16047 17185 17486 16943 17236 18155 17125 15714 15139 15260 16217 16730 16408 15632 14857
3834 14857 15028 15200 15040 14881 14556 15624 16797 17133 17446 17759 18020 18280 17714 17148 17034 17756 18591 18591 18364 18137 18101 17230 16777
3822 16777 17160 16608 16056 16566 17912 18587 18427 17814 17201 17313 17425 17484 17544 17795 17210 17096 16981 16779 16577 16793 17008 17694 18380
3811 18380 17812 17244 17075 16905 16736 16567 17181 17795 18182 17734 17811 17888 17913 17938 18206 18475 19266 19221 18227 18069 17806 17544 17360 17175
3799 17175 17409 17643 17498 17354 17383 18249 18409 17734 17110 17323 18297 19271 18992 18712 18572 17597 16307 16411 16395 16378 16867 17355 17600
3787 17600 17845 16923 16837 17154 17471 17788 18104 18203 17466 17949 18431 18431 19266 18849 17595 17821 18048 17804 17560 17871 18183 18163 18143 17741
3775 17741 18731 19356 19145 19336 18691 17681 18064 18107 18150 17584 17018 17218 17418 17670 17922 17313 17539 17991 18444 18727 19011 18407 17803
$$ packed form
3856A5249l53J09J09M74M75Q79M3m61m61K87K87L40m96l64l63n90Q03Q12n81L41L42j71O65
3845A7375k23k23m41m41L08L08p25J09J138L01n43K93R19j030j411n75J21R57N13l22p76p75
3834A4857J71J72j60j59l25J068J173L36L13L13K61K60n66n66j14P22Q35%k27k27l6q71m53
3822A6777L83n52n52N10J346O75j60o13o13J12J12N9O0K51n85j14j15k02k02K16K15O86O86
3811A8380n68n68j69j70j69j69O14O14L87m48P7P7K5K5K68K69P91m5r94j58k63k62j84j85
3799A7175K34K34j45j44K9Q66J60o75o24K13R74R74k79k80j40r75j290J04j6j7M89M88K45
3787A7600K45r22q6L17L17L17L16R9p37M83M82%Q35m17j254K26K27k44k44L11L12k0k0m02
3775A7741R90O25k11J91o45j010L83M3M3n66n66K00K00K52K52o09K26M52M53K83K84o04o04
$$ plain form
3764 17803 17407 18405 19821 19843 18978 18112 18135 18158 18598 19038 19061 19084 19017 18951 18467 17983 18370 18757 18447 18137 19168 20198 20533 20867
3752 20867 20653 20439 20225 20011 20039 20067 19677 19287 19237 19186 19136 19086 18739 18393 18047 17700 17023 16346 16644 16942 17868 18795 19303 19812 19920
3739 19920 20028 19161 18294 17897 17500 17799 18099 18390 18680 18971 19262 18758 18254 18725 19196 19127 19058 19407 19756 19706 19655 19605 19555 19504 19454
3726 19454 19404 19353 19188 19022 19274 19526 19605 19683 19761 19839 20181 20524 20170 19816 19244 18673 18798 18923 19487 20050 19918 19785 19862 19938 19597
3714 19597 19256 18609 17963 18292 18621 18758 18896 19033 19171 18993 18815 18638 18460 18369 18279 18885 19491 19304 19118 19349 19581 19795 20009
3702 20009 19805 19602 19083 18564 18742 18919 19280 19640 20001 20361 19652 18943 19487 20031 19401 18770 18835 18901 18941 18982 19162 18506 18355 19597
3690 19597 20473 20514 20583 20653 20619 20584 20828 20237 20010 20620 21599 21742 20596 19450 19515 19579 19644 19708 20282 20856 21012 21168 20523 19877 19650
3678 19650 19423 19552 19682 19811 19940 20017 20094 19753 19412 19497 19581 19666 19751 19905 20059 20213 20368 19946 19525 20322 20284 19862 20277 20587 20897
$$ packed form
3764A7803l96R98J416K2q65q66K3K3M40M40K3K3o7o6m84m84L87L87l10l10J031J030L35L34
3752B0867k14k14k14k14K8K8l90l90n0n1n0n0l47l46l46l47o77o77K98K98R26R27N08N09J08
3739A9920J08q67q67l97l97K99L00K91K90K91K91n04n04M71M71o9o9L49L49n0n1n0n0n1n0
3726A9454n0n1j65j66K52K52P9P8P8P8L42L43l54l54n72n71J25J25N64N63j32j33P7P6l41
3714A9597l41o47o46L29L29J37J38J37J38j78j78j77j78r1r0O06O06j87j86K31K32K14K14
3702B0009k04k03n19n19J78J77L61L60L61L60p09p09N44N44o30o31O5O6M0M1J80o56j51J242
3690A9597Q76M1O9P0l4l5K44n91k27O10R79J43j146j146O5O4O5O4N74N74J56J56o45o46k27
3678A9650k27J29J30J29J29P7P7l41l41Q5Q4Q5Q5J54J54J54J55m22m21P97l8m22M15L10L10
$$ plain form
3665 20897 20824 20752 20123 20330 21206 20690 18973 18648 19697 20746 21151 20720 20220 20555 21256 21121 20815 20509 20848 21186 20462 19739
3654 19739 18911 18918 20086 20418 20297 20176 20473 20770 21538 21469 21005 20542 20026 19510 20074 20638 19982 20163 20985 20972 21063 21153 21166 21178 21191
3642 21191 21203 20894 20584 20170 20592 20961 20495 20081 20503 20771 21039 20715 20392 20233 20911 21223 20699 20379 20895 20245 19595 20494 22230
3630 22230 22154 21243 21480 21717 21483 21250 21479 21707 21935 22163 22770 23377 24071 23372 22734 22096 21006 21308 22130 22953 22330 21707 21529
3619 21529 21350 21171 20992 21245 21497 20774 20051 20878 21705 21556 21408 20979 20551 20122 19693 19621 19549 20731 21913 21906 21900 21476 21051 20818
3607 20818 20585 21049 21513 21171 20829 20905 20981 21206 21430 21654 21878 21608 21338 21486 21634 20851 20067 19702 20729 22014 22464 22217 21970
3595 21970 21723 21476 21925 22374 22674 22973 22854 22736 22321 21906 21910 21913 22212 22512 22393 22274 22295 22316 21918 21521 21437 21354 21688 22022 22164
3582 22164 22307 21474 20642 21141 21641 21723 21804 21564 21323 21779 22235 22056 21876 21696 21517 21668 21819 21361 20903 20755 22000 23245 23097
$$ packed form
3665B0897p3p2o29K07Q76n16j717l25J049J049M05m31n00L35P01j35l06l06L39L38p24p23
3654A9739q28PJ168L32j21j21K97K97P68o9m64m63n16n16N64N64o56J81Q22j3R1R0J3J2J3
3642B1191J2l09l10m14M22L69m66m14M22K68K68l24l23j59O78L12n24l20N16o50o50Q99J736
3630B2230p6r11K37K37k34k33K29K28K28K28O07O07O94o99o38o38j090L02Q22Q23o23o23j78
3619B1529j79j79j79K53K52p23p23Q27Q27j49j48m29m28m29m29p2p2J182J182pom24m25k33
3607B0818k33M64M64l42l42P6P6K25K24K24K24k70k70J48J48p83p84l65J027J285M50k47k47
3595B1970k47k47M49M49L00K99j19j18m15m15MLK99L00j19j19K1K1l98l97q4q3L34L34J42
3582B2164J43q33q32M99N00Q2Q1k40k41M56M56j79j80j80j79J51J51m58m58j48J245J245j48
$$ plain form
3571 23097 23088 23080 23402 23724 23232 22740 22248 21756 21717 21678 21639 21600 21668 21737 21387 21038 21403 21767 22132 22496 22273 22050 22245 22440 22643 22847
3558 22847 23050 23254 23138 23023 22908 22792 22825 22858 22890 22923 23256 23589 23504 23419 22934 22448 21963 21478 21975 22473 23388 24304 24088 23871 24021
3545 24021 24170 24102 23198 21980 22156 23480 24805 24406 24007 23647 23287 22927 22567 22564 22561 23255 23948 23170 22392 22590 22787 22026 21266
3534 21266 20924 20581 21050 21519 22406 23293 23744 24196 23673 23149 23087 23025 23381 23737 23483 23230 23586 23941 24488 23641 22690 22575 23208
3522 23208 23841 24109 24377 23268 22159 23139 24120 23969 23817 23805 22958 21846 22126 23016 23071 23056 23040 22973 22905 23183 23460 23738 24015 23840
3510 23840 23665 23072 22479 22546 22613 22262 21911 21943 21975 21798 23014 24400 23836 23289 23578 23510 23442 23426 23410 22945 22480 22764 23048 22923 23633
3498 23633 23873 24113 24145 24176 24730 24447 23948 24284 24097 23911 23889 23868 24264 24661 24900 25140 25484 24993 24475 24793 25059 24489 24763 25038
3486 25038 24564 24089 24260 24431 24427 23588 23515 24277 23821 23365 23248 23131 23432 23734 24305 24876 24228 24416 24664 24076 24010 23945 23888 23831 23774
$$ packed form
3571B3097rqL22L22m92m92m92m92l9l9l9l9O8O9l50l49L65L64L65L64k23k23J95J95K03K04
3558B2847K03K04j16j15j15j16L3L3L2L3L33L33q5q5m85m86m85m85M97M98R15R16k16k17J50
3545B4021J49o8r04j218J76J324J325l99l99l60l60l60l60llO94O93p78p78J98J97p61p60
3534B1266l42l43M69M69Q87Q87M51M52n23n24o2o2L56L56k54k53L56L55N47q47r51j15O33
3522B3208O33K68K68j109j109R80R81j51j52j2q47j112K80Q90N5j5j6o7o8K78K77K78K77j75
3510B3840j75n93n93O7O7l51l51L2L2j77J216J386n64n47K89o8o8j6j6m65m65K84K84j25P10
3498B3633K40K40L2L1N54k83m99L36j87j86k2k1L96L97K39K40L44m91n18L18K66n70K74K75
3486B5038m74m75J71J71mq39p3P62m56m56j17j17L01L02N71N71o48J88K48n88o6o5n7n7n7
$$ plain form
3473 23774 23717 23747 23778 23808 23838 24364 24891 24721 24551 24773 24995 25165 25335 25210 24248 23234 23056 23879 23866 23209 23388 24541 25695 26065
3461 26065 25600 25648 24860 23655 23842 23603 22528 22707 22886 23622 24358 24397 24437 24894 25351 25391 25430 25730 26029 25075 24121 24943 25765 25298
3449 25298 23996 23573 23986 24294 24602 24205 23808 23829 23850 23935 24020 23635 24086 24650 25214 25412 25611 26125 26639 26700 25925 24846 24603 24307
3437 24307 24011 23759 24344 25293 24850 24538 25061 25392 25724 26114 25669 24440 24604 25143 24845 24635 25260 25638 26015 25975 25934 25693 24617
3425 24617 23958 24135 25078 26022 26512 26167 25325 24484 24600 25552 25944 25501 25580 25659 25703 25747 25373 24999 25237 25475 25713 25950 25927 25904 25880
3413 25880 25857 26096 26334 26121 25071 25057 25880 25204 24529 25306 26082 26354 25789 25591 25392 25559 25726 25902 26078 25470 24862 26083 25910
3401 25910 25320 26122 26616 27109 26436 25763 25874 25984 25729 25474 24996 25355 25888 26420 27127 26998 26643 26288 25902 25516 26053 26590 26675
3390 26675 25923 25172 25256 25485 25715 25996 26278 25994 25709 25425 25141 25357 25573 25093 24613 25343 26073 25828 25583 25464 25345 25644 25943
$$ packed form
3473B3774n7L0L1L0L0N26N27j70j70K22K22J70J70j25r62j014j78Q23j3o57J79J153J154L70
3461B6065m65M8p88j205J87k39j075J79J79P36P36L9M0M57M57M0L9L00K99r54r54Q22Q22m67
3449B5298j302m23M13L08L08l97l97K1K1Q5Q5l85M51N64N64J98J99N14N14O1p75j079k43k96
3437B4307k96k52N85R49m43l12N23L31L32L90m45j229J64N39k98k10O25L78L77m0m1k41j076
3425B4617o59J77R43R44M90l45q42q41J16R52L92m43P9P9M4M4l74l74K38K38K38K37k3k3k4
3413B5880k3K39K38k13j050j4Q23o76o75P77P76K72n65j98j99J67J67J76J76o08o08J221j73
3401B5910n90Q02M94M93o73o73J11J10k55k55m78L59N33N32P07j29l55l55l86l86N37N37Q5
3390B6675p52p51Q4K29K30K81K82k84k85k84k84K16K16m80m80P30P30k45k45j19j19K99K99
$$ plain form
3378 25943 25824 25705 25255 24806 24382 25351 26425 26663 26414 26164 26315 27302 27340 26543 26738 26932 26344 26591 27308 27190 26288 26222 26051
3367 26051 25880 26458 27036 26413 25789 25549 26144 27158 27335 26572 25810 25500 26025 26812 27599 27463 27327 27122 26916 26293 25670 25729 25789
3355 25789 24683 24412 25281 26151 26654 27158 27000 26843 27207 26736 26439 26978 26942 26906 27385 27028 25974 25757 25748 25739 25783 25826 26114 26401 27054
3343 27054 27707 28011 27480 26949 27254 27546 27838 27434 27029 27130 26395 25659 25760 25891 26022 25874 25727 24822 25310 26773 26843 27183 27523
3331 27523 26887 27088 27236 27385 28003 28622 27817 27012 26956 26900 26626 27188 26862 26536 26601 26665 26730 26795 27173 27551 26763 26810 26936 27061 27187
3318 27187 27313 28100 28052 27551 27049 26352 26491 26160 25828 25802 25775 26166 26558 26842 27127 26715 26303 26544 26785 26608 26431 26793 27155 26960
3306 26960 27600 28737 28480 27493 27898 28423 27555 27193 26830 26946 27897 28431 28129 27687 27244 26750 26255 26187 26119 25598 26470 27425 26987
3295 26987 26445 25902 26405 26907 26939 26971 26813 25820 26550 27280 27166 27052 26937 26823 26696 26568 27138 27707 27388 27069 26750 26431 26587
$$ packed form
3378B5943j19j19m50m49m24R69J074K38k49k50J51R87L8p97J95J94n88K47P17j18r02o6j71
3367B6051j71N78N78o23o24k40N95J014J77p63p62l10N25P87P87j36j36k05k06o23o23N9O0
3355B5789j106k71Q69Q70N03N04j58j57L64m71k97N39l6l6M79l57j054k17rrM4M3K88K87O53
3343B7054O53L04n31n31L05K92K92m04m05J01p35p36J01J31J31j48j47r05M88J463P0L40L40
3331B7523o36K01J48J49O18O19q05q05n6n6k74N62l26l26O5O4O5O5L78L78p88M7J26J25J26
3318B7187J26P87m8n01n02o97J39l31l32k6k7L91L92K84K85m12m12K41K41j77j77L62L62j95
3306B6960O40J137k57r87M05N25q68l62l63J16R51N34l02m42m43m94m95o8o8n21Q72R55m38
3295B6987n42n43N03N02L2L2j58r93P30P30j14j14j15j14j27j28N70N69l19l19l19l19J56
$$ plain form
3283 26587 26743 27229 27715 28420 27731 27355 27816 27949 28083 28269 28455 27954 27452 27368 27284 27421 27557 28164 27934 27539 27145 27168 27191 27253
3271 27253 28151 28353 27719 27381 27042 27070 27097 27940 28782 28093 27403 27436 27469 26614 26595 27032 27470 27960 28450 28008 27567 26760 25953 26638
3259 26638 28160 28236 28313 27658 27003 27097 27191 27289 28223 27990 27758 27430 27101 27678 26862 25813 26715 27320 27090 27556 28022 28383 28745 28595
3247 28595 27609 26989 27205 27673 27306 26520 26571 27441 27475 26587 26535 26935 27335 27892 27613 26712 26646 27033 27421 27468 27516 28033 27715 27669 27623
3235 27623 27421 28054 27799 26708 27115 27522 27443 27364 27808 27416 26850 27120 27285 27450 27648 27845 28043 28241 27995 27749 28199 28649 28673
3223 28673 28696 27989 26445 26138 26667 26255 25844 25604 25364 25264 25999 27292 27191 27561 27931 26768 26442 26898 27355 26976 26597 26915
3212 26915 27232 27471 27710 28315 28919 28531 27307 26693 26914 27475 26644 25446 25641 26054 26467 26967 27467 27432 27397 28058 28719 28892 29066
3200 29066 28543 28020 27906 27793 27731 27670 27304 27773 27773 27772 27469 27167 27422 26840 26851 28255 28318 27546 27143 26740 26790 27676 28014 28351 29211
$$ packed form
3283B6587J56M86M86P05o89l76M61J33J34J86J86n01n02q4q4J37J36O07k30l95l94K3K3O2
3271B7253Q98K02o34l38l39K8K7Q43Q42o89o90L3L3q55j9M37M38M90M90m42m41q07q07O85
3259B6638J522P6P7o55o55R4R4R8R34k33k32l28l29N77q16j049R02O05k30M66M66L61L62j50
3247B8595r86o20K16M68l67p86N1Q70L4q88n2M00M00N57k79r01o6L87L88M7M8N17l18m6m6
3235B7623k02O33k55j091M07M07p9p9M44l92n66K70J65J65J98J97J98J98k46k46M50M50K4
3223B8673K3p07j544l07N29m12m11k40k40j00P35J293j01L70L70j163l26M56M57l79l79L18
3212B6915L17K39K39O05O04l88j224o14K21N61q31j198J95M13M13N00N00l5l5O61O61J73J74
3200B9066n23n23j14j13o2o1l66M69%jl03l02K55n82J1J404O3p72m03m03N0Q86L38L37Q60
$$ plain form
3188 29211 29235 28454 27674 27904 28969 29094 29219 28700 28181 28113 28044 27976 27907 27717 27526 26813 26936 27934 28097 28364 28631 28593 28555 28465 28375
3175 28375 28883 28556 28229 28737 28636 28535 28069 27602 27206 26811 26833 26855 26912 26968 27913 28022 28038 28053 27320 26587 26994 27401 27443 27485 26945
3163 26945 27242 27903 27172 26624 26912 27060 27208 27424 27640 26968 27131 27756 28381 29006 29631 29397 28328 27955 28417 28837 29256 28752
3152 28752 28249 28220 28190 27796 27401 26884 27203 27749 28294 28365 28436 27532 26627 27046 27465 26160 25691 25873 26055 25401 25583 26104 26625 27721
3140 27721 27981 26900 26655 27142 27628 27610 27591 27573 27554 27159 26764 26543 27158 27939 27883 27932 27981 27733 27486 26820 26155 26273 26391 26927 27463
3127 27463 26998 26533 26764 26995 27113 27231 27767 28303 28087 27871 28491 27718 27031 27181 26774 26366 26672 26979 26589 26198 26069 25941 26038
3116 26038 26971 27071 27171 27271 27372 27202 26196 25765 26727 27620 27119 27437 28590 27872 27154 26906 26658 26654 26651 26648 26645 26267 25889 26765 27641
3103 27641 26768 25894 26552 27210 26598 25985 25372 24760 25336 25912 26488 27065 26666 26267 26286 26305 26394 26482 26989 27496 26792 26089 25803 25517
$$ packed form
3188B9211K4p81p80K30J065J25J25n19n19o8o9o8o9j90j91p13J23R98J63K67K67l8l8r0r0
3175B8375N08l27l27N08j01j01m66m67l96l95K2K2N7N6R45J09J6J5p33p33M07M07M2M2n40
3163B6945K97O61p31n48K88J48J48K16K16o72J63O25O25O25O25k34j069l73M62M20M19n04
3152B8752n03k9l0l94l95n17L19N46N45P1P1r04r05M19M19j305m69J82J82o54J82N21N21J096
3140B7721K60j081k45M87M86j8j9j8j9l95l95k21O15P81n6M9M9k48k47o66o65J18J18N36N36
3127B7463m65m65K31K31J18J18N36N36k16k16O20p73o87J50m07m08L06L07l90l91j29j28R7
3116B6038R33J00J00J00J01j70j006m31R62Q93n01L18J153p18p18k48k48mllll78l78Q76Q76
3103B7641q73q74O58O58o12o13o13o12N76N76N76N77l99l99J9J9Q9Q8N07N07p04p03k86k86
$$ plain form
3091 25517 25628 25738 25762 25785 26635 26093 25446 25635 26178 26722 26343 25963 26211 26459 26288 26118 26242 26367 26073 25779 25120 24461 24777
3080 24777 25093 25840 26586 26132 27070 27321 27571 27909 28246 28276 28306 26803 25301 25191 25081 25390 25698 25847 25997 26146 26295 25635 24975
3068 24975 25289 25604 24844 24085 24300 24515 25340 26164 25457 24749 24625 24500 24794 25087 25747 26406 26647 26888 25583 24278 24784 25290
3057 25290 25378 25466 25553 25641 25594 25547 25500 25453 25702 25951 25782 25613 25281 24950 25593 26237 25931 25625 25320 25014 25196 25378 25665 25116 24148
3044 24148 24017 24530 24207 24353 24499 24541 24582 26052 26685 25735 25620 25848 25241 25157 25072 24030 22988 22085 22575 23504 23598 23413 24621
3033 24621 25132 24808 24675 24542 24113 24520 24457 24394 24444 24494 24962 25430 25344 25258 24754 24251 24687 25123 25142 25160 25388 25615 25146 24677 24104
3020 24104 23530 23374 23219 23790 24360 24513 24666 24828 24989 24733 24477 24342 24208 24074 23939 24205 24471 24737 25004 25557 26110 26159 25371
3009 25371 24567 23762 23880 23998 24103 24208 24870 24697 23304 23305 24193 24246 24489 24732 24087 24835 25348 25025 25259 25493 25003 24512 24022
$$ packed form
3091B5517J11J10K4K3Q50n42o47J89N43N44l79l80K48K48j71j70J24J25k94k94o59o59L16
3080B4777L16P47P46m54R38K51K50L38L37L0L0j503j502j10j10L09L08J49J50J49J49o60o60
3068B4975L14L15p60p59K15K15Q25Q24p07p08j24j25K94K93O60O59K41K41j305j305N06N06
3057B5290Q8Q8Q7Q8m7m7m7m7K49K49j69j69l32l31O43O44l06l06l05l06J82J82K87n49r68
3044B4148j31N13l23J46J46M2M1J470O33r50j15K28o07q4q5j042j042r03M90R29R4j85J208
3033B4621N11l24j33j33m29M07o3o3N0N0M68M68q6q6n04n03M36M36J9J8K28K27m69m69n73
3020B4104n74j56j55N71N70J53J53J62J61k56k56j35j34j34j35K66K66K66K67N53N53M9p88
3009B5371q04q05J18J18J05J05O62j73j393JQ88N3K43K43o45P48N13l23K34K34m90m91m90
$$ plain form
2997 24022 23531 23119 22707 23270 23833 23726 23620 23514 23407 23231 23055 23297 23539 23328 23117 23376 22800 22650 22500 22716 22932 23274 23616
2986 23616 23262 22908 23868 24828 25371 25913 25296 24678 24061 23443 22730 22016 22557 23097 23527 23958 23918 23878 24265 23816 23367 23754 23199
2974 23199 22643 22836 23030 22770 22510 22251 21991 22470 22950 22454 21958 21819 21680 21958 22237 22457 22677 21923 21168 21370 21573 21601 20794
2963 20794 21378 22797 21605 20412 21214 22015 22363 21876 21421 21803 21661 21520 21396 21273 21149 21025 20767 20508 20145 20618 21761
2952 21761 22069 21958 22683 21683 19846 20065 20283 20536 20789 20102 20250 21292 21498 21530 21563 21647 21731 21345 21795 21912 22029 22199 22368
2940 22368 21693 21017 21039 21060 20884 20708 20585 20461 19868 20110 19882 19654 20460 21265 21375 21484 21332 21181 21029 20877 21270 21664 21134
2929 21134 20605 20189 20608 20923 21238 21316 20558 20688 20818 20243 19668 19789 19911 19824 19737 19649 19562 19528 19493 19458 19423 20222 21021 21123 21225 20727
2916 20727 20228 20984 21739 21630 21521 20716 19911 19279 18648 19271 19893 19824 19754 19057 20033 21295 20886 20546 20207 20303 20400 20496 20593 19950
$$ packed form
2997B4022m91m12m12N63N63j07j06j06j07j76j76K42K42k11k11K59n76j50j50K16K16L42L42
2986B3616l54l54R60R60N43N42o17o18o17o18p13p14N41N40M30M31m0m0L87m49m49L87n55
2974B3199n56J93J94k60k60k59k60M79M80m96m96j39j39K78K79K20K20p54p55K02K03K8q07
2963B0794N84J419j192j193Q02Q01L48m87m55L82j42j41j24j23j24j24k58k59l63M73J143
2952B1761L08j11P25j000j837K19K18K53K53o87J48J042K06L2L3Q4Q4l86M50J17J17J70J69
2940B2368o75o76K2K1j76j76j23j24n93K42k28k28Q06Q05J10J09j52j51j52j52L93L94n30
2929B1134n29m16M19L15L15P8p58J30J30n75n75J21J22q7q7q8q7l4l5l5l5P99P99J02J02m98
2916B0727m99P56P55j09j09q05q05o32o31O23O22o9p0o97R76J262m09l40l39R6R7R6R7o43
$$ plain form
2904 19950 19306 19638 19969 19881 19793 19286 18780 19458 20135 19838 19541 19202 18863 18942 19022 18831 18640 18449 18259 18397 18535 19090 19646 19584
2892 19584 19522 19459 19397 19591 19785 19980 20174 19855 19535 19216 18896 17863 16830 17050 17271 18092 18913 19037 19162 18791 18421 18747 19073
2880 19073 18946 18819 18274 17730 17551 17372 18168 18964 18872 18780 18688 18596 18737 18877 19018 19159 19587 20015 19746 19478 19031 18584 18137 17690
2868 17690 18087 18485 19300 20115 19729 19342 18538 17733 17547 17360 17592 17823 17850 17877 17904 17931 18768 19604 19466 19327 18533 17740 18008 18276
2856 18276 17622 18360 18837 18479 18129 18615 19048 18646 18157 17668 17544 17421 17889 18357 17850 17342 17262 17181 17101 17020 17527 18035 17845 17656
2844 17656 17423 17190 17375 17560 17674 17788 17483 17179 17267 17354 18138 18923 18388 17853 17318 16783 16762 16741 17137 17534 16890 16247 16299 16352 17049
2832 17049 17746 17747 17747 17434 17122 17227 17332 16566 15800 15731 15662 15565 15467 16066 16666 16742 16819 16896 16972 16998 17024 17049 17075 17257 17439 17204 16968 17435
2817 17435 17903 17952 18002 17712 17422 17132 16842 16929 17017 16687 16356 16461 16567 16672 16777 16947 17117 17705 18292 17609 16926 16661 16396 16714
$$ packed form
2904A9950o44L32L31q8q8n07n06O78O77k97k97l39l39P9Q0j91j91j91j90J38J38N55N56o2
2892A9584o2o3o2J94J94J95J94l19l20l19l20j033j033K20K21Q21Q21J24J25l71l70L26L26
2880A9073j27j27n45n44j79j79P96P96r2r2r2r2J41J40J41J41M28M28k69k68m47m47m47m47
2868A7690L97L98Q15Q15l86l87q04q05j86j87K32K31K7K7K7K7Q37Q36j38j39p94p93K68K68
2856A8276o54P38M77l58l50M86M33m02m89m89j24j23M68M68n07n08q0q1q0q1N07N08j90j89
2844A7656k33k33J85J85J14J14l05l04Q8Q7P84P85n35n35n35n35k1k1L96L97o44o43N2N3O97
2832A7049O97J%l13l12J05J05p66p66o9o9r7r8N99O00P6P7P7P6K6K6K5K6J82J82k35k36M67
2817A7435M68M9N0k90k90k90k90Q7Q8l30l31J05J06J05J05J70J70N88N87o83o83k65k65L18
$$ plain form
2805 16714 17032 17350 17668 17019 16371 16141 15910 16111 16311 16146 15981 15424 15703 16348 15599 14546 14329 14808 15287 15914 16541 17342
2794 17342 16750 16211 17065 17466 16474 15351 15065 15196 15327 15309 15291 15221 15151 15472 14958 15140 16158 16472 16785 16925 16228 15845 15462
2783 15462 15479 16333 16804 16439 15430 15257 15459 15660 15914 16167 16577 16987 16665 15508 14908 15143 15553 15963 15917 15872 15827 15782 15737 15692
2771 15692 15594 15497 16402 16472 15479 15880 16132 15549 15523 15497 15273 15048 14354 14496 14541 14587 14633 14678 16014 16513 15759 15841 15269 14698 15659 15227
2758 15227 14825 14424 13883 14178 13846 13514 13652 13790 14131 14472 14116 13760 14484 15207 15513 15819 15036 14254 13646 13873 14832 14955 14120
2746 14120 13285 13009 13567 13761 13118 13276 14270 14794 14483 13675 12867 12703 12539 12802 13065 13275 13486 13801 13280 12812 12343 12580 12816
2735 12816 13053 13290 13165 13041 13473 13070 12232 12786 13201 13616 13680 13743 13110 12477 12706 12935 13163 13392 13634 13876 13700 13524 12886
2723 12886 12249 12029 11810 11947 12085 13197 14310 14194 14079 13964 13849 13308 12766 12642 12518 13387 14256 13871 13486 13462 13438 13415 13391
$$ packed form
2805A6714L18L18L18o49o48k30k31K01K00j65j65n57K79O45p49j053k17M79M79O27O27Q01
2794A7342n92n39Q54M01r92j123k86J31J31j8j8p0p0L21n14J82J018L14L13J40o97l83l83
2783A5462J7Q54M71l65j009j73K02K01K54K53M10M10l22j157o00K35M10M10m6m5m5m5m5m5
2771A5692r8r7R05P0r93M01K52n83k6k6k24k25o94J42M5M6M6M5J336M99p54Q2n72n71R61m32
2758A5227m02m01n41K95l32l32J38J38L41L41l56l56P24P23L06L06p83p82o08K27R59J23q35
2746A4120q35k76N58J94o43J58R94N24l11q08q08j64j64K63K63K10K11L15n21m68m69K37K36
2735A2816K37K37j25j24M32m03q38N54M15M15O4O3o33o33K29K29K28K29K42K42j76j76o38
2723A2886o37k20k19J37J38J112J113j16j15j15j15n41n42j24j24Q69Q69l85l85k4k4k3k4
$$ plain form
2712 13391 13115 12839 12389 13331 14470 14215 14222 14229 12791 12745 13361 13142 13248 13354 12989 12625 12295 11966 12333 12700 13298 13895 13797 13698
2700 13698 13059 12421 12757 13094 12965 12837 13126 13415 13008 12600 12193 11786 12293 12800 13306 13813 13223 12633 12739 12846 13362 13879 13699
2688 13699 13519 13836 14152 14051 13949 13591 13233 12874 12516 12297 12078 11859 11640 12349 13058 12513 11969 11677 11384 11510 11636 12271 12906
2676 12906 12844 12783 12382 11981 11580 11179 11818 12457 12679 12900 12312 11724 12111 11662 10638 11008 11238 11468 11690 11911 12133 12354 12034
2665 12034 11715 11813 11911 11974 12038 12101 12165 11939 11712 11904 12096 11478 10860 11218 11575 11893 12211 12111 12011 11345 10680 10240 10637 10922 11208
2652 11208 11545 11883 12429 12976 12547 12119 11645 11172 10698 10224 10673 11123 11520 11916 11545 10338 9827 10152 10756 11360 11964 12567
2641 12567 12756 12110 11515 10921 10535 10150 9764 9379 9209 9039 9287 9534 9713 9891 10069 10247 9552 8857 9137 9417 9584 9750 9499
2630 9499 9248 9361 9473 8941 8409 8426 9278 9608 9938 10887 11001 10331 9661 9382 9104 9766 9592 9020 9284 9965 9811 9857 10738 11150
$$ packed form
2712A3391k76k76m50R42J139k55PPj438m6O16k19J06J06l65l64l30l29L67L67N98N97r8r9
2700A3698o39o38L36L37j29j28K89K89m07m08m07m07N07N07N06N07n90n90J06J07N16N17j80
2688A3699j80L17L16j01j02l58l58l59l58k19k19k19k19P09P09n45n44k92k93J26J26O35O35
2676A2906o2o1m01m01m01m01O39O39K22K21n88n88L87m49j024L70K30K30K22K21K22K21l20
2665A2034l19R8R8O3O4O3O4k26k27J92J92o18o18L58L57L18L18j00j00o66o65m40L97K85K86
2652A1208L37L38N46N47m29m28m74m73m74m74M49M50L97L96l71j207n11L25O04O04O04O03
2641A2567J89o46n95n94l86l85l86l85j70j70K48K47J79J78J78J78o95o95K80K80J67J66k51
2630I499k51J13J12n32n32J7Q52L30L30R49J14o70o70k79k78O62j74n72K64O81j54M6Q81M12
$$ plain form
2618 11150 10726 10458 10190 9870 9550 9438 9327 9634 10776 11248 10327 9772 10052 10516 10979 11599 11383 10299 10051 9976 9902 9889 9876
2606 9876 9862 9849 10253 10658 10645 10631 10627 10622 10252 9882 9068 9090 10088 10249 9384 8518 8331 8980 10052 10287 9792 9296 9932 10568 9672 8776
2593 8776 8463 8150 8289 9264 10101 10101 10206 10310 10223 10137 9945 10590 11060 10695 9685 9512 9631 9750 9278 8805 8350 8731 9338 9945
2581 9945 10116 10288 9485 8681 9088 9495 9431 9368 9821 9438 8689 9333 9751 9333 9472 9612 8872 8132 8367 8602 8593 8584 8576 8567 7910 7252
2568 7252 7570 7888 8310 8732 8180 7627 7916 8206 8443 8680 9222 8928 8408 7888 7823 7757 8580 8567 8536 8506 8841 9176 9379 9581 10149
2555 10149 10717 10519 9485 8452 8254 8230 8206 8235 8263 8370 8477 8584 8691 9024 9358 9273 9188 8625 8061 7916 7770 8668 9566 10047
2543 10047 10527 9797 9067 9034 9000 8666 8332 8521 7874 7444 7850 7734 7618 7606 7594 7581 7569 7426 7283 7141 6998 6964 6930 6478 6026
2531 6026 6627 7229 7134 7039 7397 7754 7694 7633 7381 7129 7574 8018 8483 8947 7879 6811 7057 7303 8246 9189 8946 8702 8459 8215
$$ packed form
2618A1150m24k68k68l20l20j12j11L07J142M72r21n55K80M64M63O20k16j084k48p5p4j3j3
2606I876j4j3M04M05j3j4mnl70l70q14K2R98J61q65q66j87O49J072K35m95m96O36O36q96q96
2593H776l13l13J39R75Q37%J05J04q7q6j92O45M70l65j010j73J19J19m72m73m55L81O07O07
2581I945J71J72q03q04M07M07o4o3M53l83p49O44M18m18J39J40p40p40K35K35rrqro57o58
2568G252L18L18M22M22n52n53K89K90K37K37N42k94n20n20o5o6Q23j3l1l0L35L35K03K02N68
2555A0149N68j98j034j033j98k4k4K9K8J07J07J07J07L33L34q5q5n63n64j45j46Q98Q98M81
2543A0047M80p30p30l3l4l34l34J89o47m30M06j16j16j2j2j3j2j43j43j42j43l4l4m52m52
2531F026O01O02r5r5L58L57o0o1k52k52M45M44M65M64j068j068K46K46R43R43k43k44k43k44
$$ plain form
2519 8215 7955 7694 7433 7172 7956 8739 9384 8635 8157 8514 8314 8114 7990 7865 7740 7616 7517 7419 7320 7222 7178 7134 7508 7881 8098
2506 8098 8316 7836 7357 7354 7351 7400 7449 6428 6242 7066 6497 6229 5960 6022 6085 6199 6314 5732 5150 5320 5490 6078 6666 7045 7424
2494 7424 6828 6232 6833 7434 7617 7800 7478 7156 7531 7905 7333 6760 6606 6451 6427 6404 7355 8306 8075 7844 7614 7383 7422 7461
2482 7461 7083 6704 6741 6777 6396 6015 6522 7029 7118 7207 7037 6867 7672 8477 8159 7841 7575 7309 6939 7404 7452 6664 6755 6846 6467
2469 6467 6088 5853 5617 5835 6888 7053 6382 6234 6086 6394 6702 7010 7318 7068 6819 6796 7609 7974 8338 8059 7779 7595 7411
2458 7411 7227 7043 6991 6939 7583 8227 7653 7078 6922 6765 6434 6103 6242 5546 5955 6364 5746 5128 5930 6731 6558 4991 4913 5671
2446 5671 5872 6073 6328 6583 6420 6258 6330 6402 6475 6547 6228 5909 5590 5271 5604 5938 5297 4656 5527 6399 7183 7967 8212 7064
2434 7064 6229 6229 6223 6217 5897 5578 5171 5600 6029 5622 5464 5305 5512 5719 5735 5750 5766 5781 5704 5628 6300 6972 6756 7375 7995 7779 7319
$$ packed form
2519H215k60k61k61k61P84P83O45p49m78L57k00k00j24j25j25j24r9r8r9r8m4m4L74L73K17
2506H098K18m80m79llM9M9j021j86Q24n69k68k69O2O3J14J15n82n82J70J70N88N88L79L79
2494G424n96n96O01O01J83J83l22l22L75L74n72n73j54j55k4k3R51R51k31k31k30k31L9L9
2482G461l78l79L7L6l81l81N07N07Q9Q9j70j70Q05Q05l18l18k66k66l70M65M8p88R1R1l79
2469F467l79k35k36K18J053J65o71j48j48L08L08L08L08k50k49k3Q13L65L64k79k80j84j84
2458G411j84j84n2n2O44O44n74n75j56j57l31l31J39o96M09M09o18o18Q02Q01j73j567p8P58
2446E671K01K01K55K55j63j62P2P2P3P2l19l19l19l19L33L34o41o41Q71Q72P84P84K45j148
2434G064q35%ool20l19m07M29M29m07j58j59K07K07J6J5J6J5p7p6O72O72k16O19O20k16m60
$$ plain form
2420 7319 6859 7288 6880 5767 5490 5614 5738 6635 6696 6810 6924 6881 6838 6272 6543 6526 5673 5395 5117 4526 4770 5519 6269 5754
2408 5754 5240 5143 5046 5002 4958 4757 5391 7197 7331 7239 7983 7586 6353 6060 5768 5839 5910 6085 6261 5696 6803 7493 6510 6923
2396 6923 7336 6669 6002 5858 5713 5569 5424 5470 5515 5560 5606 5451 5296 5141 4987 5709 6431 6736 7040 6683 6326 5969 5611 5844
2384 5844 6077 5891 5706 5956 6206 6456 6706 6586 6466 6764 7062 7386 7710 7059 6408 6400 6393 5689 4984 5203 5422 4944 4466 4986
2372 4986 5505 6442 7379 7549 7720 7021 6321 4987 5324 5418 5511 6266 7022 6802 6582 5862 5141 5674 6208 6219 6229 6397 5729 4485
2360 4485 4912 5322 5732 5437 5142 5264 5387 5451 5515 5579 5643 6029 6415 6383 6351 5773 5195 5592 5989 5985 5982 5978 5975 5547 5119 4743 4367 4140
2346 4140 4748 5826 5233 4470 3707 4093 5872 6781 6854 7066 7278 7229 7181 7132 7083 5998 4913 4838 5598 5918 5402 5043 4684 4604
2334 4604 5359 6010 6660 7028 6560 5622 5520 5548 4741 3985 4066 3789 3511 3982 4453 5107 5761 6241 5886 4485 3920 4870 5820
$$ packed form
2420G319m60M29m08j113k77J24J24Q97O1J14J14m3m3n66K71j7q53k78k78n91K44P49P50n15
2408E754n14r7r7m4m4k01O34J806J34r2P44l97j233k93k92P1P1J75J76n65J107O90r83M13
2396F923M13o67o67j44j45j44j45M6M5M5M6j55j55j55j54P22P22L05L04l57l57l57l58K33
2384E844K33j86j85K50K50K50K50j20j20K98K98L24L24o51o51qpp04p05K19K19m78m78N20
2372D986N19R37R37J70J71o99p00j334L37R4R3P55P56k20k20p20p21N33N34J1J0J68o68j244
2360D485M27M10M10k95k95J22J23O4O4O4O4L86L86l2l2n78n78L97L97mlmlm28m28l76l76k27
2346D140O08J078n93p63p63L86J779R09P3K12K12m9m8m9m9j085j085p5P60L20n16l59l59q0
2334D604P55O51O50L68m68r38j02K8q07p56Q1k77k78M71M71O54O54M80l55j401n65R50R50
$$ plain form
2322 5820 5534 4412 3708 3840 4386 4932 4834 4736 5274 5812 5600 5389 5738 5250 4397 4937 5285 4797 4867 4937 5170 5403 5270 5138
2310 5138 5388 6475 6673 5479 4922 5200 4922 4644 4975 5306 4941 4575 4730 4885 5040 5194 4966 4738 4510 4281 4284 4286 4985 5684
2298 5684 5373 5062 4804 4545 5241 6773 6250 5728 5788 5013 4708 4403 4181 3959 3737 3514 2892 2269 2569 2869 3882 4059 3818
2286 3818 4413 4982 5551 6120 6689 6935 6346 5531 4716 4440 4164 3889 3613 4054 4495 4187 3879 4398 4081 3538 2995 2866 2736
2275 2736 3669 5437 5247 5056 5440 4989 4353 4554 4649 5581 5624 4275 4545 4815 4164 4906 5648 4998 4486 3975 3324 3509 3581
2263 3581 3652 3777 3901 4051 4201 4351 4501 4229 3957 3685 3413 3594 3774 3955 4136 4248 4360 4472 4584 4687 4791 5416 5206
2252 5206 4307 4242 4352 4462 4729 4995 5628 6260 6487 5878 5217 5391 5227 4226 3748 3269 3448 3627 3284 3777 4330 4048 3870
2240 3870 3692 3611 3530 3501 3472 3765 4894 4857 4819 4329 3839 4045 4251 4274 4298 3799 4136 4808 4645 4308 3971 4496 5021 4849 4678
$$ packed form
2322E820k86j122p04J32N46N46r8r8N38N38k12k11L49m88q53N40L48m88P0P0K33K33j33j32
2310E138K50J087J98j194n57K78k78k78L31L31l65l66J55J55J55J54k28k28k28k29LKO99O99
2298E684l11l11k58k59O96J532n23n22O0p75l05l05k22k22k22k23o22o23L00L00J013J77k41
2286C818N95N69N69N69N69K46n89q15q15k76k76k75k76M41M41l08l08N19l17n43n43j29j30
2275B736R33J768j90j91L84m51o36K01R5R32M3j349K70K70o51P42P42o50n12n11o51J85P2
2263C581P1J25J24J50J50J50J50k72k72k72k72J81J80J81J81J12J12J12J12J03J04O25k10
2252E206q99o5J10J10K67K66O33O32K27o09o61J74j64j001m78m79J79J79l43M93N53k82j78
2240C870j78q1q1k9k9K93J129l7l8m90m90K06K06K3K4m99L37O72j63l37l37N25N25j72j71
$$ plain form
2228 4678 4358 4038 4136 4235 4255 4274 4294 4314 4329 4344 4777 5210 5495 5779 5646 5513 5376 5239 4405 3571 3599 3627 3655 3683 3797 3910 4668
2214 4668 5426 5253 4243 3791 3339 3089 4233 5062 5056 4807 4557 4307 4057 3536 3851 3695 3539 3096 2653 2385 2952 3573 3359
2203 3359 3667 3975 3786 3598 4385 5172 5464 5755 5351 4946 5047 5147 5108 4234 3707 4574 4970 5366 5545 4888 4231 4410 4332 4254
2191 4254 3758 3262 3932 3767 3184 3437 3707 3977 4300 4622 4718 4814 4910 5006 5060 5113 5218 4488 4080 3672 3630 3587 3214 2841 2885 2930
2178 2930 3331 3733 3438 3143 3318 3494 4191 4053 3105 2993 2864 3570 4441 5313 5819 6325 6170 6014 5493 4971 3782 3428 4606
2166 4606 4949 4360 3771 2015 1095 1094 1928 2345 2761 3918 5074 4751 4427 3496 3401 3531 3662 3715 3767 4290 4813 4556 5135 5714
2154 5714 5458 4609 3761 3835 3909 3952 3994 4037 4079 4653 5226 4790 3518 3342 4003 4246 3652 3704 4591 4259 3927 4148 4369 3423 3313
2141 3313 4187 5061 4455 3848 4276 4704 5044 5385 5464 4151 3168 3578 4162 3353 2578 3197 4259 4486 3789 3093 3439 4622
$$ packed form
2228D678l20l20R8R9K0J9K0K0J5J5M33M33K85K84j33j33j37j37q34q34K8K8K8K8J14J13P58
2214D668P58j73j010m52m52k50J144Q29ok49k50k50k50n21L15j56j56m43m43k68N67O21k14
2203C359L08L08j89j88P87P87K92K91m04m05J01J00l9q74n27Q67L96L96J79o57o57J79p8p8
2191D254m96m96O70j65n83K53K70K70L23L22R6R6R6R6N4N3J05p30m08m08m2m3l73l73M4M5
2178B930M01M02k95k95J75J76O97j38r48j12j29P06Q71Q72N06N06j55j56n21n22j189l54J178
2166D606L43n89n89j756r20jQ34M17M16J157J156l23l24r31r5J30J31N3N2N23N23k57N79N79
2154E714k56q49q48P4P4M3M2M3M2N74N73m36j272j76O61K43n94N2Q87l32l32K21K21r46j10
2141C313Q74Q74o06o07M28M28L40L41P9j313r83M10N84q09p75O19J062K27o97o96L46J183
$$ plain form
2130 4622 5107 4757 3710 2664 3097 3531 4089 4648 4231 3815 3799 3783 3714 3646 4207 3932 3291 4043 4534 4190 4036 3883 3779 4510
2118 4510 4353 4197 4562 4928 5346 4928 4094 3261 3629 3996 4268 4540 4813 5085 5115 5144 4756 4369 4198 4028 4275 4523 4379 4235
2106 4235 3725 3215 3341 4302 4846 4554 4372 4190 3485 3617 4679 5742 5883 4630 4404 5014 4650 4285 3694 3102 2929 2756
2095 2756 3550 4344 4163 3982 3227 2471 2412 2353 2512 2670 3473 4276 4348 3583 3202 4214 4275 4335 4588 4004 3455 3742 4203 4665
2083 4665 4407 4150 3998 3009 2604 3035 2943 2852 2698 2544 3313 4082 4190 3461 3203 2945 3956 4967 5002 5038 4516 3995 3891 3787
2071 3787 3702 3617 3532 3447 2839 2232 2599 2967 3180 3393 3084 3610 4145 3845 3544 4079 4215 3515 2867 3055 2877 2700 3271 3842
2059 3842 3769 3695 3988 4280 5234 5353 4775 5032 4149 3266 3184 3102 2863 3460 4109 3922 3525 3963 3826 3689 4911 5297 4673 4049
2047 4049 3792 4372 4063 3755 3307 2859 3386 3914 3490 3066 3339 3611 4101 4592 4664 4736 4160 3584 2538 2327 2970 3612 4133
$$ packed form
2130D622M85l50j047j046M33M34N58N59m17m16j6j6o9o8N61k75o41P52M91l44j54j53j04P31
2118D510j57j56L65L66M18m18q34q33L68L67K72K72K73K72L0K9l88l87j71j70K47K48j44j44
2106D235n10n10J26R61N44k92j82j82p05J32J062J063J41j253k26O10l64l65n91n92j73j73
2095B756P94P94j81j81p55p56n9n9J59J58Q03Q03P2p65l81J012O1O0K53n84n49K87M61M62
2083D665k58k57j52r89m05M31r2r1j54j54P69P69J08p29k58k58J011J011L5L6n22n21j04j04
2071C787q5q5q5q5o08o07L67L68K13K13l09N26N35l00l01N35J36p00o48J88j78j77N71N71
2059C842p3p4K93K92R54J19n78K57q83q83q2q2k39N97O49j87l97M38j37j37J222L86o24o24
2047D049k57N80l09l08m48m48N27N28m24m24K73K72M90M91P2P2n76n76j046k11O43O42N21
$$ plain form
2035 4133 3818 3329 3675 3970 3428 3401 3373 2875 2377 2626 2875 2759 2643 2369 2932 2972 3013 3514 3180 2794 3243 3188 2297 1562 2220
2023 2220 3002 3784 3678 3572 3239 2907 2575 2242 2763 3284 3804 4325 4071 3817 2622 3100 2998 2897 3876 4854 4483 4112 3741
2011 3741 3370 3508 3646 3784 3922 3625 3328 3728 4127 3379 2632 2859 3087 2844 2601 2776 2952 2820 2688 2975 3261 3669 4077
2000 4077 3789 3500 3653 3806 2984 2162 2358 2554 2751 2947 3660 4372 3830 3289 3688 4087 3911 4571 5313 4383 3471 2559 2752
1988 2752 2946 3557 4168 4151 4133 4533 4933 4080 3226 3069 2912 3601 4289 4002 3715 3497 3280 3463 4482 5577 5000 4476 4787
1977 4787 5116 4610 4625 4641 4178 3716 3254 2792 3444 4096 3773 3450 2883 2317 2446 2576 2384 2192 2696 3200 3432 3664 3896 4128
1965 4128 4160 4192 3806 3420 3704 3988 3855 3721 4023 4324 3930 3535 2815 2095 2628 3162 3965 4768 4318 3868 3886 3903 3921 3939 3643
1952 3643 3347 3469 3592 3680 3768 3857 3945 4269 4592 3993 3393 3293 4027 4745 4069 2985 3293 3932 3178 3087 2996 2818 2640 2846 3051
$$ packed form
2035D133l15m89L46K95n42k7k8m98m98K49K49j16j16k74N63M0M1N01l34l86M49n5q91p35O58
2023B220P82P82j06j06l33l32l32l33N21N21N20N21k54k54j195M78j02j01R79R78l71l71l71
2011C741l71J38J38J38J38k97k97M00L99p48p47K27K28k43k43J75J76j32j32K87K86M08M08
2000D077k88k89J53J53q22q22J96J96J97J96P13P12n42n41L99L99j76O60P42r30r12r12J93
1988B752J94O11O11j7j8M00M00q53q54j57j57O89O88k87k87k18k17J83J019J095n77n24L11
1977D787L29n06J5J6m63m62m62m62O52O52l23l23n67n66J29J30j92j92N04N04K32K32K32K32
1965D128L2L2l86l86K84K84j33j34L02L01l94l95p20p20N33N34Q03Q03m50m50J8J7J8J8k96
1952C643k96J22J23Q8Q8Q9Q8L24L23n99o00j00P34P18o76j084L08O39p54r1r1j78j78K06K05
$$ plain form
1940 3051 3256 3461 3327 3192 2640 2088 2293 2498 3121 3744 3353 2961 2988 3015 2536 2058 2555 3052 3353 3654 2979 2305 1866 1427
1928 1427 1963 2499 2528 2558 2587 2616 2811 3006 3201 3396 2942 2488 2034 1580 1980 2379 1804 1228 2139 3050 2707 2364 2100 1835
1916 1835 1571 1306 1673 2040 2824 3609 3810 4012 3795 3578 3202 2827 3147 4303 5172 4648 4438 5063 5627 5356 4718 4917 4628
1904 4628 4339 4102 3866 3268 2670 2768 2867 2417 1967 2770 3574 3368 3162 3373 3585 3527 3469 2488 1506 1482 2294 3105 3081 3135 3189 2773
1891 2773 2357 2686 3014 2925 2835 3564 4293 4325 4358 3598 2838 2304 2607 3484 4360 4088 3816 3128 3275 3649 4024 4372 4719 4423
1879 4423 4127 3823 4354 4885 4581 4607 4634 4103 3572 4149 3333 2517 3094 3845 4597 4094 2756 2987 3218 3396 3575 4076 4577
1867 4577 4695 3420 2569 3111 4228 4509 4015 3521 4229 4937 4734 4532 4799 4231 3777 3322 2362 2795 3657 3126 2769 2412
1856 2412 2194 1977 1985 2830 3047 3265 3639 3178 2360 2377 3631 4884 4919 4118 3787 3457 3248 3039 2882 2725 2836 3783 4033 3447
$$ packed form
1940C051K05K05j34j35n52n52K05K05O23O23l91l92K7K7m79m78M97M97L01L01o75o74m39m39
1928A427N36N36K9L0K9K9J95J95J95J95m54m54m54m54M00L99n75n76R11R11l43l43k64k65
1916A835k64k65L67L67P84P85K01K02k17k17l76l75L20J156Q69n24k10O25N64k71o38J99k89
1904D628k89k37k36n98n98R8R9m50m50Q03Q04k06k06K11K12n8n8r81r82k4Q12Q11k4N4N4m16
1891B773m16L29L28q9r0P29P29L2L3p60p60n34L03Q77Q76k72k72o88J47L74L75L48L47k96
1879D423k96l04N31N31l04K6K7n31n31N77q16q16N77P51P52n03j338K31K31J78J79N01N01
1867D577J18j275q51N42J117K81m94m94P08P08k03k02K67n68m54m55r60M33Q62n31l57l57
1856B412k18k17QQ45K17K18L74m61q18J7J254J253L5q01l31l30k09k09j57j57J11R47K50n86
$$ plain form
1844 3447 2844 2240 2560 2880 2908 2936 2442 2783 3403 3187 2797 2408 2242 2076 2468 2023 891 1152 2023 2057 2011 1965 1815 2500
1832 2500 2567 2634 2754 2873 2596 2319 2460 2600 2906 3212 3100 2989 2740 2491 3217 3943 3947 3950 4006 4062 3504 3781 4790 4407 3753
1820 3753 3099 2776 2453 3018 3583 3452 3321 2719 2118 2212 2307 2605 2903 3618 4334 3787 3240 3581 3922 4142 2968 2160 2188 2633
1808 2633 3915 5562 5816 5101 4387 4282 4177 3645 3114 3000 2886 2538 2189 2258 2327 2945 3562 3762 3962 3679 3396 3113 2830
1796 2830 2355 1881 2381 2882 2636 2390 2144 1898 2427 2956 3938 3526 2655 3177 3525 3872 3846 3819 3792 3766 3584 3403 2143 1718
1784 1718 1458 2591 4247 4510 3475 3275 3494 3712 3478 3244 3706 4168 4134 4100 4484 4868 4225 3581 3913 4244 4190 4136 3386
1772 3386 2635 2598 2562 2856 3150 4012 3481 2846 3046 3499 3952 3482 3013 3168 3324 3532 3741 3287 3669 3686 2867 2502 2974 3393
1760 3393 2977 3135 3293 2702 2112 2147 2182 2269 2356 1869 2218 3315 3576 2784 2828 2872 2080 1244 1245 1924 2603 3420 3400 2963 3361 3716
$$ packed form
1844C447o03o04L20L20K8K8m94L41O20k16l90l89j66j66L92m45j132K61Q71L4m6m6j50O85
1832B500O7O7J20J19k77k77J41J40L06L06j12j11k49k49P26P26MLN6N6n58K77J009l83o54
1820C753o54l23l23N65N65j31j31o02o01R4R5K98K98P15P16n47n47L41L41K20j174q08K8M45
1808B633J282J647K54p15p14j05j05n32n31j14j14l48l49O9O9O18O17K00K00k83k83k83k83
1796B830m75m74N00N01k46k46k46k46N29N29R82m12q71N22L48L47k6k7k7k6j82j81j260m25
1784A718k60J133J656K63j035k00K19K18k34k34M62M62l4l4L84L84o43o44L32L31n4n4p50
1772C386p51l7l6K94K94Q62n31o35K00M53M53m70m69J55J56K08K09m54L82J7q19l65M72M19
1760C393m16J58J58n91n90L5L5Q7Q7m87L49J097K61p92M4M4p92q36JO79O79Q17k0m37L98L55
$$ plain form
1747 3716 4070 3502 2934 3222 3509 3796 4083 3666 3248 3195 3143 3234 2488 2909 3330 3255 3180 3105 3030 3379 3729 2824 1920 2226 2532
1735 2532 1897 2098 2280 1626 2138 2650 2571 1655 1157 1496 1962 2429 2530 2631 2932 3233 3639 3208 2912 3452 3469 3486 2824 2162
1723 2162 2754 3346 3149 2953 2757 2561 2487 2412 2338 2264 2229 2194 2855 3516 2855 2193 2419 2645 3635 3232 3090 3784 3477 2334 2410
1710 2410 2486 3137 3789 3466 3142 3324 3505 3321 3137 2343 2385 2845 3305 4531 4365 3536 3544 2733 1922 2417 2912 2911 2910 3379 3013
1698 3013 2383 1752 2324 2895 2753 2610 1945 2116 2905 2858 2359 1859 2692 3524 3886 4249 4966 4847 4224 3600 3604 3607 3192 2778 2303
1685 2303 1828 2293 1922 1569 2052 2952 3017 2498 2816 3777 3903 3402 2901 2852 3639 4162 4685 4512 4338 4147 3120 2511 2738
1674 2738 3074 3410 3902 3559 2998 3273 3443 3613 3683 3753 3770 3787 3822 3021 3108 3195 3047 2899 3274 2812 2368 2760 3326 3892 3642
1661 3642 3391 3141 2891 2449 2007 1652 1298 1587 3269 3193 3117 3885 4654 5004 3962 3764 4402 4118 3833 3052 3107 3667 4227
$$ packed form
1747C716L54n68n68K88K87K87K87m17m18n3n2R1p46M21M21p5p5p5p5L49L50r05r04L06L06
1735B532o35K01J82o54N12N12p9r16m98L39M66M67J01J01L01L01M06m31k96N40J7J7o62o62
1723B162N92N92j97j96j96j96p4p5p4p4l5l5O61O61o61o62K26K26R90m03j42O94l07j143P6
1710B410P6O51O52l23l24J82J81j84j84p94M2M60M60J226j66q29Qq11q11M95M95jjM69l66
1698C013o30o31N72N71j42j43o65J71P89m7m99n00Q33Q32L62L63P17j19o23o24MLm15m14m75
1685B303m75M65l71l53M83R00O5n19L18R61J26n01n01m9P87N23N23j73j74j91j027o09K27
1674B738L36L36M92l43n61K75J70J70P0P0J7J7L5q01Q7Q7j48j48L75m62m44L92N66N66k50
1661C642k51k50k50m42m42l55l54K89J682p6p6P68P69L50j042j98O38k84k85p81N5N60N60
$$ plain form
1649 4227 4121 4015 3909 3803 3845 3886 3040 3030 3539 4048 4661 4438 3841 3244 3292 3339 2751 2163 1522 882 1930 2143 1294 444
1637 444 843 1242 1641 2040 2421 2803 2540 2277 2206 2970 3177 3385 4593 4409 3284 2995 3198 3401 4353 5304 4663 4021 3380
1626 3380 2738 3085 3432 3082 2732 3296 3860 3450 3039 3167 3296 3006 2717 2323 1929 2005 2081 2318 3391 3768 3309 3737 4166
1614 4166 4090 3178 2529 2717 3078 3439 3235 3030 2773 2516 3731 4110 3513 3753 3774 3796 3870 3944 3950 3956 4014 4073 3347 3458 3098 2738
1601 2738 2842 2946 3050 3154 2997 2840 2578 3152 4093 4198 3624 3050 2763 3312 3391 3470 3350 3231 2694 2157 2273 2389 1774 322
1589 322 908 2329 2200 2071 1960 1013 675 1731 2890 3214 3121 3027 3107 3187 3268 3348 3453 3557 4132 3871 4089 4307 3776 3245
1577 3245 3154 3063 2972 2881 2642 2403 2860 3317 3560 3802 3104 3242 3458 2838 2793 2748 2607 3302 3109 2916 3106 3296 3486 3676 4109
1565 4109 4541 3719 2898 2808 2717 3132 4383 4371 4359 4399 4440 4637 4834 4056 3278 2973 2668 2415 2162 1961 2597 3597 3205 2478
$$ packed form
1649D227j06j06j06j06M2M1q46j0N09N09O13k23n97n97M8M7n88n88o41o40J048K13q49q50
1637D44L99L99L99L99L81L82k63k63p1P64K07K08J208j84j125k89K03K03R52R51o41o42o41
1626C380o42L47L47l50l50N64N64m10m11J28J29k90k89l94l94P6P6K37J073L77m59M28M29
1614D166p6r12o49J88L61L61k04k05k57k57J215L79n97K40K1K2P4P4OON8N9p26J11l60l60
1601B738J04J04J04J04j57j57k62N74R41J05n74n74k87N49P9P9j20j19n37n37J16J16o15j452
1589C22N86J421j29j29j11r47l38J056J159L24r3r4Q0Q0Q1Q0J05J04N75k61K18K18n31n31
1577C245r1r1r1r1k39k39M57M57K43K42o98J38K16o20m5m5j41O95j93j93J90J90J90J90M33
1565D109M32q22q21r0r1M15J251j2j2M0M1J97J97p78p78l05l05k53k53k01O36J000l92p27
$$ plain form
1553 2478 2586 3339 4092 4540 4152 3816 3481 3127 2773 2315 2693 3019 2508 2973 4274 4469 3828 3292 2755 2959 3162 3314 3465
1541 3465 3422 2543 1994 2839 3196 2717 2796 2874 3432 3989 3850 3711 3702 3694 3267 2841 2949 3057 3584 4110 3626 3143 3356 3569 3107
1529 3107 2645 2601 2557 3358 4158 4175 3356 3437 3517 3545 3574 2958 2341 1673 1841 1914 1988 2062 2136 2819 2667 2114 2954 3246 2146 2334
1515 2334 2522 2658 2794 2930 3066 2999 2933 3284 3636 3970 4304 3941 3578 3930 4281 4633 4984 4116 3249 2799 2350 2412 2474 2536 2597
1503 2597 2424 2251 2496 2741 3305 3870 4017 4163 3770 3377 2984 2591 2932 3272 3613 3953 3301 2649 2972 3296 3683 4070 3482
1491 3482 2894 3412 3929 3751 3572 3480 3389 3297 3205 3592 3979 3670 3361 3209 3058 3324 3590 2943 2295 2344 2392 2471 2551 2630 2709 2858
1478 2858 3007 3155 3304 3175 3046 3335 3624 3773 3923 4072 4222 3403 2584 3297 4010 3626 3242 3277 3311 3140 2970 2799 2629 2789
1466 2789 2950 3110 3271 3938 4605 4019 3433 3143 2853 2981 3108 2853 2599 2344 2089 1964 1840 2134 2427 2860 3293 3029 2766
$$ packed form
1553B478J08P53P53M48l88l36l35l54l54m58L78L26n11M65J301J95o41n36n37K04K03J52J51
1541C465m3q79n49Q45L57m79P9P8N58N57j39j39rqm27m26J08J08N27N26m84m83K13K13m62
1529C107m62m4m4Q01Q00J7q19Q1Q0K8K9o16o17o68J68P3P4P4P4O83j52n53Q40K92j100J88
1515B334J88J36J36J36J36o7o6L51L52L34L34l63l63L52L51L52L51q68q67m50m49O2O2O2O1
1503B597j73j73K45K45N64N65J47J46l93l93l93l93L41L40L41L40o52o52L23L24L87L87n88
1491C482n88N18N17j78j79r2r1r2r2L87L87l09l09j52j51K66K66o47o48M9M8P9Q0P9P9J49
1478B858J49J48J49j29j29K89K89J49J50J49J50q19q19P13P13l84l84L5L4j71j70j71j70J60
1466B789J61J60J61O67O67n86n86k90k90J28J27k55k54k55k55j25j24K94K93M33M33k64k63
$$ plain form
1455 2766 3164 3562 4290 5019 5449 4486 3139 2628 3232 3836 3238 2640 2360 2081 2218 2356 2973 3590 3284 2978 2569 2996 3737
1443 3737 3084 2824 2563 2215 1868 1910 1952 1993 2035 2469 2903 2640 2377 2679 2980 3281 3583 3867 4151 3460 2769 2794 2819 2844 2869 3486
1430 3486 4103 3745 3387 3559 3730 3902 4074 3401 2728 3309 3890 3278 2666 2472 2278 1605 932 1513 2094 2408 2721 3035 3349
1419 3349 4046 4742 4464 4186 3820 3455 3090 2724 2498 2272 2742 3213 3376 3538 3701 3864 3739 3614 3908 4201 3352 2502 2906
1407 2906 3311 4098 4885 3862 2838 2534 2230 1839 2841 2937 3033 2886 2738 2632 3919 4788 4264 3792 3321 2866 3805 4439
1396 4439 3680 4209 4739 4528 4317 4107 3896 4016 4137 3839 3541 3479 3416 3354 3291 3222 3153 3084 3015 2528 2041 2250 2460 2674 2887 2683
1383 2683 2479 2406 2332 2955 3578 3277 2976 2674 2373 2707 3041 3375 3709 3460 3211 3014 2817 2742 3502 3793 4083 3915 3746 3525
1371 3525 3304 3066 1992 1614 2072 2213 2353 2911 3470 3262 2218 2115 3404 3325 3247 3673 4099 3550 3001 2678 3191 3156 3120
$$ packed form
1455B766L98L98P28P29M30r63j347n11O04O04n98n98k80k79J37J38O17O17l06l06m09M27P41
1443C737o53k60k61l48l47M2M2M1M2M34M34k63k63L02L01L01L02K84K84o91o91K5K5K5K5O17
1430C486O17l58l58J72J71J72J72o73o73N81N81o12o12j94j94o73o73N81N81L14L13L14L14
1419C349O97O96k78k78l66l65l65l66k26k26M70M71J63J62J63J63j25j25K94K93q49q50M04
1407B906M05P87P87j023j024l04l04l91J002R6R6j47j48j06J287Q69n24m72m71m55R39O34
1396D439p59N29N30k11k11k10k11J20J21k98k98o2o3o2o3o9o9o9o9m87m87K09K10K14K13k04
1383B683k04p3p4O23O23l01l01l02l01L34L34L34L34k49k49j97j97p5P60K91K90j68j69k21
1371C525k21k38j074l78M58J41J40N58N59k08j044j03J289p9p8M26M26n49n49l23N13l5l6
$$ plain form
1359 3120 2719 2318 3032 3745 4232 3883 3718 3553 2918 2283 2563 2842 3591 3504 3122 2739 1417 930 1426 1923 2420 2917 3383
1348 3383 3014 3062 3111 3559 3173 2002 2225 3074 3088 3241 3393 3433 3473 3513 3552 3700 3847 3577 3306 3732 4159 3331 2503 2653 2803
1335 2803 2952 3102 3452 3802 3786 3770 2950 2966 3157 3347 3667 3152 2185 1217 1662 2942 4223 4668 4312 3956 3599 3243 2902
1324 2902 3397 3840 4283 4020 3757 3495 3232 3527 3822 4639 4620 3748 3712 3623 2699 2757 2814 2819 2824 3073 3322 3571 3820 3555 3291 3026
1311 3026 2761 2749 2737 2724 2712 3315 3917 3545 3173 3610 4047 3509 2971 2984 2997 3427 3858 3967 4075 4184 4292 4111 3931 3332 2733
1298 2733 2613 2493 3069 3646 3768 3889 3593 3297 3523 3749 3278 2808 2961 3114 2571 2028 2181 2334 3184 4033 3098 2163 2482
1287 2482 2800 3189 3577 3269 2960 2826 2692 2976 3260 4179 5098 5321 5544 5205 4866 4580 4293 3676 3895 4426 3565 2989 2412
1275 2412 3281 4150 4096 4042 3987 3933 3500 3068 3331 3595 3780 3965 4151 4336 4073 3810 3547 3285 3431 3577 3724 3870 3546 3223
$$ packed form
1359C120m01m01P14P13M87l49j65j65o35o35K80K79P49q7l82l83j322m87M96M97M97M97M66
1348C383l69M8M9M48l86j171K23Q49J4J53J52M0M0M0L9J48J47k70k71M26M27q28q28J50J50
1335B803J49J50L50L50j6j6q20J6J91J90L20n15r67r68M45J280J281M45l56l56l57l56l41
1324B902M95M43M43k63k63k62k63K95K95Q17j9q72l6q9r24N8N7NNK49K49K49K49k65k64k65
1311C026k65j2j2j3j2O03O02l72l72M37M37n38n38J3J3M30M31J09J08J09J08j81j80n99n99
1298B733j20j20N76N77J22J21k96k96K26K26m71m70J53J53n43n43J53J53Q50Q49r35r35L19
1287B482L18L89L88l08l09j34j34K84K84R19R19K23K23l39l39k86k87o17K19N31q61n76n77
1275B412Q69Q69n4n4n5n4m33m32K63K64J85J85J86J85k63k63k63k62J46J46J47J46l24l23
$$ plain form
1263 3223 3317 3411 3923 4435 4947 5459 4034 2610 2161 1711 1610 1509 1407 1306 1906 2505 2409 2312 2711 3111 3510 3909 3673 3438
1251 3438 3202 2966 2617 2268 2371 3311 3728 3309 3413 3516 3759 4002 3880 3757 3497 4073 4179 4285 3877 3469 3810 4151 2890
1239 2890 2465 3102 3738 4349 4960 5118 4440 3645 3685 3725 2929 2473 2853 3076 3299 4118 4102 3302 2502 2807 3113 3366 3620 3877
1227 3877 3297 2353 2244 2065 2722 3606 4489 4859 4393 4398 4402 4180 3957 3735 3513 3259 3006 3222 3438 2662 2721 3007 3293 3305 3317
1215 3317 3328 3340 3291 3242 3192 3143 3539 3935 4331 4727 4139 3551 2963 2375 2903 3432 3177 2922 3529 2743 2010 3226 3845 3629 3587
1202 3587 3545 3703 3862 3498 3969 4863 4921 4526 4132 3877 3621 3314 3006 3372 2902 2851 3635 4079 4523 4324 4124 3721 3319 3335
1190 3335 3350 3000 2650 2771 2891 2490 2925 3308 2298 2411 3359 3751 4142 4266 4390 4096 3802 4021 4241 4095 3948 3195 3278
1179 3278 3534 3791 4099 3572 3098 2623 2825 3027 3125 4058 4731 4567 4230 3892 3339 2787 3262 3736 3010 3119 3680 4242 4811
$$ packed form
1263C223R4R4N12N12N12N12j425j424m49m50j01j01j02j01O00N99r6r7L99M00L99L99k36k35
1251C438k36k36l49l49J03R40M17m19J04J03K43K43j22j23k60N76J06J06m08m08L41L41j261
1239B890m25O37O36O11O11J58o78p95M0M0p96m56L80K23K23Q19j6q00q00L05L06K53K54K57
1227C877n80r44j09j79O57Q84Q83L70m66NMk22k23k22k22k54k53K16K16p76N9K86K86J2J2
1215C317J1J2m9m9n0m9L96L96L96L96n88n88n88n88N28N29k55k55O07p86p33J216O19k16m2
1202C587m2J58J59l64M71Q94N8l95l94k55k56l07l08L66m70n1P84M44M44j99k00m03m02J6
1190C335J5l50l50J21J20m01M35L83j010J13R48L92L91J24J24k94k94K19K20j46j47p53Q3
1179C278K56K57L08n27m74m75K02K02R8R33O73j64l37l38n53n52M75M74p26J09N61N62N69
$$ plain form
1167 4811 4543 4136 3730 3419 4501 4381 4262 4170 4077 3985 3893 3749 3604 2989 3211 4126 5042 4756 4470 4158 3846 3586 3326 2874
1155 2874 3259 3120 2982 3497 3176 2855 3370 3704 4038 3449 3696 4361 3633 2905 3570 4205 4005 3666 3326 3143 2960 2673 3222
1144 3222 3903 3748 4116 4484 4199 3914 3994 4075 4561 4212 3167 2121 1781 2834 3103 3372 3863 4354 4462 3734 2693 3602
1132 3602 4145 3296 3326 3357 3719 4080 3702 3323 3415 3507 2763 2854 3642 3595 3521 3447 3374 3300 3707 4950 5339 4336 3559 4175 4756 3944
1119 3944 2936 2764 2819 3709 4486 5263 5640 5180 4443 4542 5041 5539 5751 5127 4277 3426 3686 3945 4153 4360 4210 3225 3162 3935
1107 3935 4380 3989 3702 4808 4626 3608 3843 4079 4252 4424 3900 3376 3165 2955 3719 4484 4668 4852 4670 4488 4159 4665
1096 4665 5171 4841 4043 3245 3092 3774 4988 4808 4211 3613 4129 4644 3679 2714 2368 2857 3346 3000 4085 5171 5194 4382
1085 4382 3029 2513 3233 3953 4715 4642 4568 5331 5248 5166 4718 4271 3786 3301 3791 4281 3962 3643 3741 3840 3757 3675 4062 3614 3175
$$ packed form
1167D811k68m07m06l11J082j20j19r2r3r2r2j44j45o15K22R15R16k86k86l12l12k60k60m52
1155B874L85j39j38N15l21l21N15L34L34n89K47O65p28p28O65O35k00l39l40j83j83k87N49
1144C222O81j55L68L68k85k85Q0Q1M86l49j045j046l40J053K69K69M91M91J08p28j041R09
1132C602N43q49L0L1L62L61l78l79R2R2p44R1P88m7p4p4p3p4M07J243L89j003p77O16N81q12
1119C944j008j72N5Q90P77P77L77m60p37R9M99M98K12o24q50q51K60K59K08K07j50r85o3P73
1107C935M45l91k87J106j82j018K35K36J73J72n24n24k11k10P64P65J84J84j82j82l29N06
1096D665N06l30p98p98j53O82J214j80n97n98N16N15r65r65l46M89M89l46J085J086K3q12
1085D382j353n16P20P20P62p3p4P63q3q2m48m47m85m85M90M90l19l19R8R9q3q2L87m48m39
$$ plain form
1073 3175 2736 2418 2936 4105 4439 4650 4861 4368 4710 5052 4558 4564 4569 3879 3188 3098 3843 4537 4395 4675 4119 3145 3564 4715
1061 4715 5030 4648 4266 4317 4367 3529 2692 2298 3297 3513 3729 3957 4186 3719 3251 3123 2995 3842 4688 4683 4678 4255 3832 4010 4187
1048 4187 4365 4543 3750 2957 3139 3321 3268 3214 3579 3944 4256 4567 5244 5921 5606 4455 3321 3581 4789 4604 4872 5140 4781
1037 4781 4422 4064 3705 3861 4016 4172 4328 4728 5128 5527 5927 5552 5177 4801 4426 4991 5556 5704 5851 5859 5867 5457 5048 4255
1025 4255 3462 2756 2051 1776 2894 3699 3668 3680 3693 3653 3613 4283 4953 4648 4342 4368 4394 4419 4445 4716 4988 4563 4138 3739 3340 3638
1012 3638 3935 3971 4007 4460 4914 4653 4393 4551 4708 4944 5180 4719 4259 3850 3442 4009 4575 5118 5660 5227 4794 5232 5670 5689
999 5689 5709 5492 5274 5475 5675 5171 4666 4161 3657 4234 4811 3891 3806 5045 5448 4562 3676 3618 3559 3501 3442 4237 5032 4346 3661
987 3661 3587 4348 5110 5036 4613 4191 3664 3972 4168 4364 5082 4964 4541 4119 3644 3169 3115 3060 2536 2847 3193 3539 4355 3779 3206
$$ packed form
1073C175m39l18N18J169L34K11K11m93L42L42m94ONo90o91r0P45O94j42K80n56r74M19J151
1061D715L15l82l82N1N0q38q37l94R99K16K16K28K29m67m68j28j28Q47Q46nnm23m23J78J77
1048D187J78J78p93p93J82J82n3n4L65L65L12L11O77O77l15j151j134K60J208j85K68K68l59
1037D781l59l58l59J56J55J56J56M00M00L99M00l75l75l76l75N65N65J48J47QQm10m09p93
1025D255p93p06p05k75J118Q05l1J2J3m0m0O70O70l05l06K6K6K5K6K71K72m25m25l99l99K98
1012C638K97L6L6M53M54k61k60J58J57K36K36m61m60m09m08N67N66N43N42m33m33M38M38J9
999E689K0k17k18K01K00n04n05n05n04N77N77r20q5J239M03q86q86n8n9n8n9P95P95o86o85
987C661p4P61P62p4m23m22n27L08J96J96P18j18m23m22m75m75n4n5n24L11L46L46Q16n76n73
$$ plain form
974 3206 3470 3872 4275 3903 3531 3158 2786 3144 3502 4034 5402 5769 5300 4935 4571 4737 4904 3904 3740 4315 4891 5989
963 5989 6251 5623 4995 4263 4366 3991 3615 3989 4362 4909 5457 5255 5054 5236 4582 4346 4945 4610 4275 4166 4893 5368 5006
952 5006 4645 5119 5692 5428 4991 4554 4908 5263 5479 4858 3686 3907 5573 6404 5980 5557 4663 3770 4089 4408 5144 5881 5939
940 5939 5997 5601 4371 3859 4182 4402 4621 4718 4816 5331 5846 5561 5275 5634 5992 5184 3540 3429 4153 4823 5493 5484 4639 4256
928 4256 4709 4586 4464 4551 3802 3750 4533 4576 4619 4715 4810 4896 4981 4596 5046 5619 6192 6120 6049 5744 5440 5553 5667 5136 4605 4579 5389
915 5389 5055 4720 4856 4991 4743 4496 4666 4836 4495 4154 4231 4308 4193 4078 4433 4789 4137 4322 5203 6084 6460 5443 5627 5812
903 5812 5347 4883 4785 4686 4797 4071 4043 4850 4590 4331 4820 5310 5373 5436 5081 4725 4801 4877 4953 5029 5227 5425 6040 6656 6367 6079
890 6079 5790 5501 5317 5133 5367 5600 5690 5781 6341 6065 6085 6106 6074 6042 6389 6736 6108 6315 6889 6069 5615 5997 5516 5036 5810
$$ packed form
974C206K64M02M03l72l72l73l72L58L58N32J368L67m69l65l64J66J67j000j64N75N76J098
963E989K62o28o28p32J03l75l76L74L73N47N48k02k01J82o54k36N99l35l35j09P27M75l62
952E006l61M74N73k64m37m37L54L55K16o21j172K21J666Q31m24m23q94q93L19L19P36P37N8
940E939N8l96j230n12L23K20K19R7R8N15N15k85k86L59L58q08j644j11P24O70O70rq45l83
928D256M53j23j22Q7p49n2P83M3M3R6R5Q6Q5l85M50N73N73p2p1l05l04J13J14n31n31k6Q10
915E389l34l35J36J35k48k47J70J70l41l41P7P7j15j15L55L56o52J85Q81Q81L76j017J84J85
903E812m65m64r8r9J11p26k8Q07k60k59M89M90O3O3l55l56P6P6P6P6J98J98O15O16k89k88
890F079k89k89j84j84K34K33R0R1N60k76K0K1l2l2L47L47o28K07N74q20m54L82m81m80P74
$$ plain form
877 5810 6583 6582 5745 4490 4070 4876 5683 6593 6668 6255 5843 5604 6201 6859 7517 7758 7998 7672 6511 5906 5302 4476 5042 6305
865 6305 6175 5862 5549 5149 4749 4950 5151 5352 5553 4883 4213 4240 4266 4645 5025 4986 4947 5274 5601 5754 6743 7420 6148 5659
853 5659 6562 6108 5654 5983 6312 6804 7296 6256 5216 5813 6410 5752 5095 5098 5100 5521 5941 6274 6608 6244 5881 6402 6922 6467
841 6467 6013 6368 6723 6103 5483 5168 4852 4537 4222 4672 5123 5156 5189 5414 5638 5863 6088 5764 5440 5117 4793 5083 5373 5663
829 5663 5953 6487 7021 6858 6695 6782 6868 7373 7877 7615 7354 6674 5994 6662 7330 7022 6715 6817 6918 7577 7400 7090 8173 7915
817 7915 6821 7007 7194 7327 7461 7097 6732 6368 6003 6457 6911 6389 5868 5641 5413 4768 5516 6315 6279 6801 7322 7730 8138
805 8138 8546 8954 8353 7751 7201 6652 6496 7176 7385 7595 7552 7510 7920 6937 5788 6033 5964 5060 4460 5253 5906 6560 6143 5726
793 5726 6563 7399 6773 6147 5991 5835 5817 6634 6754 6039 6055 6071 6174 7113 8074 7642 7350 7058 6556 6055 6006 6793 7295 6961 6175
$$ packed form
877E810P73jq37j255m20Q06Q07R10P5m13m12k39N97O58O58K41K40l26j161o05o04q26N66J263
865F305j30l13l13m00m00K01K01K01K01o70o70K7K6L79L80l9l9L27L27J53R89O77j272m89
853E659R03m54m54L29L29M92M92j040j040N97N97o58o57LKM21M20L33L34l64l63N21N20m55
841F467m54L55L55o20o20l15l16l15l15M50M51L3L3K25K24K25K25l24l24l23l24K90K90K90
829E663K90N34N34j63j63Q7Q6N05N04k62k61o80o80O68O68l08l07J02J01O59j77l10J083k58
817G915j094J86J87J33J34l64l65l64l65M54M54n22n21k27k28o45P48P99l6N22N21M08M08
805H138M08M08o01o02n50n49j56O80K09K10m3m2M10r83j149K45o9r04o00P93O53O54m17m17
793E726Q37Q36o26o26j56j56j8Q17J20p15J6J6J03R39R61m32k92k92n02n01m9P87N02l34p86
$$ plain form
781 6175 5388 5847 6305 6763 7222 6901 6580 6677 6775 7046 7317 7536 7755 7998 7405 7178 7787 8439 8255 7897 7540 7623 7707 6815 5924
768 5924 6486 7048 6670 7128 7632 7300 7490 7680 8227 8774 8346 7918 8624 9330 8748 7330 6677 6861 6940 7019 6629 6238 6543 6849
756 6849 7311 7773 8235 8698 8356 8014 8194 7539 7310 7917 8054 7355 7363 7372 7380 7388 6779 7005 7945 6935 6509 7476 7538 7599 7914 8228
743 8228 7567 6906 6905 6904 7425 7110 5890 5505 5295 5085 5516 5948 6901 7019 6789 7395 7478 7561 7294 7027 7213 8234 9029 8988 8999
730 8999 9847 9725 9604 9309 8177 7952 7726 7500 7274 6509 6579 6823 7067 8104 8305 7722 7139 7560 7980 8227 7638 7814 8827
719 8827 8534 7405 6839 6274 7467 8661 8800 8940 10229 9568 8379 8026 8056 8086 7524 6962 7323 7683 8314 8109 7538 8360
708 8360 8703 8211 8276 8341 8518 8696 8404 8948 9030 9112 9247 9381 8129 6877 7436 7995 7543 7092 7059 7026 7061 7097 7132 7167 7203 7238 7274
694 7274 7309 7830 8350 8453 8556 8537 8518 8133 7749 7441 7970 8498 8191 8206 8221 8235 8250 8152 8889 9157 9424 8986 8548 8110 7672 7566
$$ packed form
781F175p87M59M58M58M59l21l21R7R8K71K71K19K19K43n93k27O09O52j84l58l57Q3Q4q92q91
768E924N62N62l78M58N04l32J90J90N47N47m28m28P06P06n82j418o53J84P9P9l90l91L05L06
756F849M62M62M62M63l42l42J80o55k29O07J37o99QRQQo09K26R40j010m26R67O2O1L15L14
743H228o61o61jjN21l15j220l85k10k10M31M32R53J18k30O06Q3Q3k67k67J86J021P95m1J1
730H999Q48j22j21k95j132k25k26k26k26p65P0K44K44J037K01n83n83M21M20K47n89J76J013
719H827k93j129n66n65J193J194J39J40J289o61j189l53L0L0n62n62L61L60O31k05n71Q22
708H360L43m92O5O5J77J78k92N44Q2Q2J35J34j252j252N59N59m52m51l3l3L5L6L5L5L6L5L6
694G274L5N21N20J03J03j9j9l85l84l08N29N28l07J5J5J4J5r8P37K68K67m38m38m38m38j06
$$ plain form
681 7566 7460 7999 8537 8266 7158 6469 6616 6884 7152 6777 6401 7714 9027 9365 9703 9230 8757 9258 9760 8965 8169 7792
670 7792 7414 7831 8248 8665 9082 8585 8088 8009 7929 7751 7573 7812 8052 8474 8896 8622 8348 8499 8649 8799 8949 9439 9929 9165
658 9165 8402 8001 7601 8175 8750 8358 7966 7992 8018 8040 8062 8084 8106 8005 7905 7387 6869 7317 7764 8211 8658 8601 8543 8485 8428 8265 8103
645 8103 7523 6943 7599 8256 7937 7618 7859 8100 8341 8582 8449 8316 8182 8049 8016 7983 7949 7916 8510 9103 8443 7783 7812 7841 8236
632 8236 8630 8607 7747 6993 7631 8426 9221 9406 9592 9255 8918 8164 7409 8089 8769 9032 9294 9556 9818 9106 8393 8381 8369 7939
620 7939 7509 7428 7346 7264 7183 7470 7757 8045 8332 8637 8941 8550 8158 7544 6930 7570 8210 7971 7731 7910 8088 7994 7900 7859 7817 7419
607 7419 7856 8241 8626 9119 9613 9968 8929 7969 7845 8104 7527 7324 7956 8537 8282 8070 7858 8291 8724 8138 7552 7941 8330
595 8330 8466 8603 9262 9085 8293 8337 8833 9330 8729 8129 8416 7868 7786 7703 7517 7330 6986 5807 6386 7801 8405 8174 8465 8756
$$ packed form
681G566j06N39N38k71j108o89J47K68K68l75l76J313J313L38L38m73m73N01N02p95p96l77
670G792l78M17M17M17M17m97m97p9q0j78j78K39K40M22M22k74k74J51J50J50J50M90M90p64
658I165p63m01m00N74N75l92l92K6K6K2K2K2K2j01j00n18n18M48M47M47M47n7n8n8n7j63j62
645H103n80n80O56O57l19l19K41K41K41K41j33j33j34j33l3l3l4l3N94N93o60o60K9K9L95
632H236L94k3q60p54O38P95P95J85J86l37l37p54p55O80O80K63K62K62K62p12p13j2j2m30
620G939m30q1q2q2q1K87K87K88K87L05L04l91l92o14o14O40O40k39k40J79J78r4r4m1m2l98
607G419M37L85L85M93M94L55j039r60j24K59n77k03O32N81k55k12k12M33M33n86n86L89L89
595H330J36J37O59j77p92M4M96M97o01o00K87n48q2q3j86j87l44j179N79J415O04k31K91K91
$$ plain form
583 8756 8421 8085 8271 7622 7339 7891 7747 6767 5970 6008 6500 6991 7848 8705 8500 7459 7202 6944 6165 6221 6475 6729 7505 7446
571 7446 7648 7850 8417 8985 8285 7584 6780 6811 8147 8649 8471 8293 8282 9108 9045 8147 7814 8875 8995 7722 7320 8311 8431
560 8431 8551 7992 7432 7570 7707 7623 7538 7453 7369 7598 7826 8055 8284 7438 6593 7280 7966 7782 7598 7084 6569 6035 6893 7752 7218
547 7218 6640 6062 5902 5742 5810 7270 7808 6953 6586 7054 7661 8269 8674 9079 8422 6929 6107 5284 6220 7157 7339 7521 8174
536 8174 7990 7624 7258 7814 8371 7913 7456 7938 7585 6727 6705 7083 7461 7385 6473 6257 6877 7088 7299 7335 6536 6847 7158 6947
524 6947 7571 7665 7758 7207 6656 7068 7480 6951 7259 7122 6150 6396 6643 6513 6383 6201 6018 6593 6333 5654 5812 6467 7123 7135
512 7135 7147 6714 6282 7104 7925 8117 8310 8415 8520 9035 8156 6668 6016 5396 5612 5828 6043 6416 6788 5437 4921 5111 5301
500 5301 5960 6620 6609 6599 6588 6578 6463 6349 6600 6852 7051 6414 6196 6813 6350 5888 5477 5067 5345 5622 5900 6177 6289 6401 6513
$$ packed form
583H756l35l36J86o49k83N52j44r80p97L8M92M91Q57Q57k05j041k57k58p79N6K54K54P76n9
571G446K02K02N67N68p00p01q04L1J336N02j78j78j1Q26o3q98l33J061J20j273m02R91J20
560H431J20n59n60J38J37q4q5q5q4K29K28K29K29q46q45O87O86j84j84n14n15n34Q58Q59n34
547G218n78n78j60j60O8J460N38q55l67M68O07O08M05M05o57j493q22q23R36R37J82J82O53
536H174j84l66l66N56N57m58m57M82l53q58k2L78L78p6r12k16O20K11K11L6p99L11L11k11
524F947O24R4R3n51n51M12M12n29L08j37r72K46K47j30j30j82j83N75k60o79J58O55O56J2
512G135J2m33m32Q22Q21J92J93J05J05N15q79j488o52o20K16K16K15L73L72j351n16J90J90
500E301O59O60j1j0j1j0j15j14K51K52J99o37k18O17m63m62m11m10K78K77K78K77J12J12J12
$$ plain form
488 6513 6624 6806 6987 6525 6062 5477 5728 6484 7240 7030 6820 6609 6399 5948 5496 5462 5428 5081 4734 5083 5433 5730 6027 6324
$$ packed form
488F513J11J82J81m62m63n85K51P56P56k10k10k11k10m51m52l4l4l47l47L49L50K97K97K97
$$ [...]
-33248d87
##END=		$$ NMR SPECTRUM
##END=		$$ LINK
