##TITLE=	38e-H
##JCAMP-DX=	6.0	$$ MestReNova 14.3.3-33362
##DATA TYPE=	LINK
##BLOCKS=	2    
##ORIGIN=	Mestrelab Research S.L.
##OWNER=	hrzepa
##$MNOVA/METADATA=	(DOCUMENT,BASE64)
eyJuYW1lIjoiL1VzZXJzL2hyemVwYS9Eb3dubG9hZHMvSVVQQUMtRkFJUlNwZWMtbWFpbi8zOC1Db21
wbGV4ZXMvMi1DbChDNkg0KUIoT0gpMiB0QnVPQWMvMzhlLUgvMzhlLUgubW5vdmEiLCJwYWdlcyI6W3
siaXRlbXMiOlsiMSIgICAgIF19LHsiaXRlbXMiOlsiMiIgICAgIF19XX0=
##TITLE=	$1z6PVEQQhe0pta96RF3Pg.11.fid
##JCAMP-DX=	6.0	$$ MestReNova 14.3.3-33362
##DATA TYPE=	NMR SPECTRUM
##DATA CLASS=	XYDATA
##BLOCK_ID=	1
##ORIGIN=	Bruker BioSpin GmbH
##OWNER=	root
##NUMDIM=	1
##$MNOVA/METADATA=	(ITEM,BASE64)
eyJhbmdsZSI6MCwiYXhlcyI6eyJ4Ijp7Im1heCI6MjA1LjA0OTA5OTk5NzM5MDQ0LCJtaW4iOi0yMDQ
uOTQ5MjAxNjI0MTQzODh9LCJ5Ijp7Im1heCI6NTI4NjMzLjIyMjY1NjI1LCJtaW4iOi01MzEzMS41MD
A0ODgyODEyNX19LCJwb2ludHMiOlt7IngiOjUzMjEsInkiOjU4MzV9LHsieCI6ODcyMiwieSI6NTgzN
X0seyJ4Ijo4NzIyLCJ5Ijo4MjA4fSx7IngiOjUzMjEsInkiOjgyMDh9LHsieCI6NTMyMSwieSI6NTgz
NX1dLCJ6IjowfQ==
##.OBSERVE FREQUENCY=	160.46157916600000704
##.OBSERVE NUCLEUS=	^11B
##.SOLVENT NAME=	None
##.PULSE SEQUENCE=	zgbs
##LONGDATE=	2025/01/09 10:08:02.000
##.ACQUISITIONMODE=	SIMULTANEOUS (DQD)
##$ORIGINAL FORMAT=	Bruker XWIN-NMR
##$MNOVA/SCALES_VERSION=	9
##$PARAMETER FILE=	(acqus, ASCII, /private/var/folders/f6/rjf_tdyn2v98c5c0wvkgn4s80000gq/T/$1z6PVEQQhe0pta96RF3Pg/11/acqus, 0)
$$ ##TITLE= Parameter file, TopSpin 4.1.3
$$ ##JCAMPDX= 5.0
$$ ##DATATYPE= Parameter Values
$$ ##NPOINTS= 1	$$ modification sequence number
$$ ##ORIGIN= Bruker BioSpin GmbH
$$ ##OWNER= root
$$ $$ 2025-01-09 10:08:04.902 +0000  root@CZC036BXXF
$$ $$ Y:/data/tds/nmr/RP612 ClPHB(OH)2 tBuOAc/11/acqus
$$ $$ process C:\Bruker\TopSpin4.1.3\prog\mod\dirdata.exe
$$ ##$ACQT0= 0
$$ ##$AMP= (0..31)
$$ 100 100 100 100 100 100 100 100 100 100 100 100 100 100 100 100 100 100
$$ 100 100 100 100 100 100 100 100 100 100 100 100 100 100
$$ ##$AMPCOIL= (0..32)
$$ -1 0 0 0 0 0 0 0 0 0 0 0 0 0 0 0 0 0 0 0 0 0 0 0 0 0 0 0 0 0 0 0 0
$$ ##$AQSEQ= 0
$$ ##$AQ_mod= 3
$$ ##$AUNM= <au_zg>
$$ ##$AUTOPOS= <43 >
$$ ##$BF1= 160.461579166
$$ ##$BF2= 160.461579166
$$ ##$BF3= 160.461579166
$$ ##$BF4= 160.461579166
$$ ##$BF5= 160.461579166
$$ ##$BF6= 160.461579166
$$ ##$BF7= 160.461579166
$$ ##$BF8= 160.461579166
$$ ##$BWFAC= (0..63)
$$ 0 0 0 0 0 0 0 0 0 0 0 0 0 0 0 0 0 0 0 0 0 0 0 0 0 0 0 0 0 0 0 0 0 0 0 0
$$ 0 0 0 0 0 0 0 0 0 0 0 0 0 0 0 0 0 0 0 0 0 0 0 0 0 0 0 0
$$ ##$BYTORDA= 0
$$ ##$CHANFCU= (0..24)
$$ 0 0 1 0 0 0 0 0 0 0 0 0 0 0 0 0 0 0 0 0 0 0 0 0 0
$$ ##$CHANREC= (0..24)
$$ 0 0 1 0 0 0 0 0 0 0 0 0 0 0 0 0 0 0 0 0 0 0 0 0 0
$$ ##$CHEMSTR= <none>
$$ ##$CNST= (0..63)
$$ 1 1 1 1 1 1 1 1 1 1 1 1 1 1 1 1 1 1 1 1 1 1 1 1 1 1 1 1 1 1 1 1 1 1 1 1
$$ 1 1 1 1 1 1 1 1 1 1 1 1 1 1 1 1 1 1 1 1 1 1 1 1 1 1 1 1
$$ ##$CPDPRG= (0..8)
$$ <> <> <> <> <> <> <> <> <>
$$ ##$D= (0..63)
$$ 0 0.3 0 0 0 0 0 0 0 0 0 0 0 0 0 0 0.0002 0 0 0 0 0 0 0 0 0 0 0 0 0 0 0
$$ 0 0 0 0 0 0 0 0 0 0 0 0 0 0 0 0 0 0 0 0 0 0 0 0 0 0 0 0 0 0 0 0
$$ ##$DATE= 1736417282
$$ ##$DATE_START= 1736417208
$$ [...]
$$ 1 1 1 1 0 0 0 0 0 0 0 0 0 0 0 0 0 0 0 0 0 0 0 0 0 0 0 0
$$ ##$ShimPowRng3= (0..63)
$$ 1 1 1 1 1 1 1 1 1 1 1 1 1 1 1 1 1 1 1 1 1 1 1 1 1 1 1 1 1 1 1 1 1 1 1 1
$$ 1 1 1 1 0 0 0 0 0 0 0 0 0 0 0 0 0 0 0 0 0 0 0 0 0 0 0 0
$$ ##$ShimPowType1= 8
$$ ##$ShimPowType2= 8
$$ ##$ShimPowType3= 0
$$ ##$ShimPowType4= 0
$$ ##$ShimPowType5= 0
$$ ##$ShimPowType6= 0
$$ ##$ShimPowType7= 0
$$ ##$ShimPowType8= 0
$$ ##$ShimSysActGrad= (0..63)
$$ 1 2 3 4 13 5 7 11 10 9 6 8 12 18 19 20 21 15 22 23 24 14 25 16 26 17 27
$$ 28 31 32 33 34 35 36 37 38 0 0 0 0 0 0 0 0 0 0 0 0 0 0 0 0 0 0 0 0 0 0
$$ 0 0 0 0 0 0
$$ ##$ShimSysAngle= <>
$$ ##$ShimSysFunc= (0..63)
$$ 1 2 3 4 5 6 7 8 9 10 0 37 38 35 16 15 14 13 12 11 28 27 26 25 24 23 36
$$ 22 30 29 20 21 34 33 32 31 17 18 19 0 0 0 0 0 0 0 0 0 0 0 0 0 0 0 0 0 0
$$ 0 0 0 0 0 0 0
$$ ##$ShimSysMatId= <292722ba.dat>
$$ ##$ShimSysMatrix= 1
$$ ##$ShimSysMinMaxUG= 130000
$$ ##$ShimSysOffset= <58 mm>
$$ ##$ShimSysType= 4
$$ ##$ShimUnit= 3
$$ ##$SpectrOsVersion= <4.1.156.20210628>
$$ ##$TCubeEth= <192.168.180.18>
$$ ##$TCubeSeqDevice= <>
$$ ##$TOSITY= <no>
$$ ##$TRIPLO2= 0
$$ ##$TopSpinVersion= <TopSpin 4.1.3>
$$ ##$TrxFreqFormula= (0..23)
$$ <TrxFreqFormula(2.0,500130000.000000,'TRX',Trx(1.0,'TRX 1200.1',2,5.000000,1290.000000))>
$$ <TrxFreqFormula(2.0,500130000.000000,'TRX',Trx(1.0,'TRX 1200.2',2,5.000000,1290.000000))>
$$ <> <> <> <> <> <> <> <> <> <> <> <> <> <> <> <> <> <> <> <> <> <>
$$ ##$TrxPN= (0..23)
$$ <Z148391> <Z148391> <> <> <> <> <> <> <> <> <> <> <> <> <> <> <> <> <>
$$ <> <> <> <> <>
$$ ##$TrxSN= (0..23)
$$ <05365> <05364> <> <> <> <> <> <> <> <> <> <> <> <> <> <> <> <> <> <> <>
$$ <> <> <>
$$ ##$VCubeEth= (0..23)
$$ <no> <no> <no> <no> <no> <no> <no> <no> <no> <no> <no> <no> <no> <no> <no>
$$ <no> <no> <no> <no> <no> <no> <no> <no> <no>
$$ ##$VTU= 2
$$ ##$VTUETH= <192.168.99.10>
$$ ##$VTUTY= <no>
$$ ##$ValueLine= no
$$ ##$VpuPN= (0..23)
$$ <no> <no> <no> <no> <no> <no> <no> <no> <no> <no> <no> <no> <no> <no> <no>
$$ <no> <no> <no> <no> <no> <no> <no> <no> <no>
$$ ##$VpuSN= (0..23)
$$ <no> <no> <no> <no> <no> <no> <no> <no> <no> <no> <no> <no> <no> <no> <no>
$$ <no> <no> <no> <no> <no> <no> <no> <no> <no>
$$ ##$WBREFAM= (0..31)
$$ 99.9 100 100 100 100 100 100 100 100 100 100 100 100 100 100 100 100 100
$$ 100 100 100 100 100 100 100 100 100 100 100 100 100 100
$$ ##$WBREFLM= (0..31)
$$ 2 0 0 0 0 0 0 0 0 0 0 0 0 0 0 0 0 0 0 0 0 0 0 0 0 0 0 0 0 0 0 0
$$ ##$WBREFPH= (0..31)
$$ 0.91 0 0 0 0 0 0 0 0 0 0 0 0 0 0 0 0 0 0 0 0 0 0 0 0 0 0 0 0 0 0 0
$$ ##$WBSGU= (0..31)
$$ 1 1 2 0 0 0 0 0 0 0 0 0 0 0 0 0 0 0 0 0 0 0 0 0 0 0 0 0 0 0 0 0
$$ ##END=
$$ 
##$DECIM=	304
##$DSPFVS=	20
##XUNITS=	HZ
##YUNITS=	ARBITRARY UNITS
##FIRSTX=	32902.500800155707111
##LASTX=	-32886.470950204056862
##DELTAX=	-0.50193385074013141534
##XFACTOR=	1
##YFACTOR=	14.663625942258979862
##FIRSTY=	602.451171875
##MINY=	-5199.9111328125
##MAXY=	480483.03125
##NPOINTS=	131072
##XYDATA=	(X++(Y..Y))
$$ [...]
10513A47o9qJ53J55N8p8p9l5l6n8n7N6N6J1J1j0j07%R7K6K7M3j18j67nN6N7m7m7n5n6L5L6
10496hk4J38J02Nk5k6J7J7K0J9J3J3K6p1j20k2P6P6JKk7k7N4N3j68j69J4J10J16J8l4l4j7
10480A18j7j7j7klllK6K5k3k3o6o6Q0Q0JJJJL2L1n0m9J4J4J4J4k6k5K3K3J5J4r8r9N8N7M7
10461A02M7O6r6o0L8%%OOn9n9j01O0J27J26J14m8r8r8n3J08Q3Q3n2n2L9L9n8J04L8n9N5N4
10444D02p8p9L5L4mnq6q5onnoQQqj05m9J13O4O5k3k2p1p1L5L5j4j3N0N0o3o3j9j9j8j9j4j4
10425f5J32J32n6n5K5K6k0k1k0k0k3k3K5K5O6O7J2j50J7J6m2m2R9R8m7m7%J%%M2M2l9l9o9
10407D7o9J2J2J00J00m6m5m4m3m4m4kkM7M6n0n1L1L1K0K1j8j8j00O1J48j3J0J07M2M2M2M2
10391C72j90j90j4J48J12J5l8l7m4m4J8J8O6O6n6n6n6n7J13J12o5o5M9M9o4o4OPp4p4K9K9
$$ plain form
10513 147 78 70 223 378 436 358 279 244 208 150 93 149 205 216 227 217 110 110 207 233 260 303 185 18 13 69 126 79 32 -23 -79 -44 -8
10496 -8 -32 106 208 213 188 162 179 196 216 235 248 261 287 216 96 74 150 226 227 229 202 175 229 282 114 -55 -41 69 185 203 169 135 118
10480 118 101 84 67 65 62 59 56 82 107 84 61 -5 -71 9 89 90 91 92 93 125 156 106 57 71 85 99 113 87 62 85 108 123 137 39 -60 -2 55 102
10461 102 149 215 119 59 97 97 97 103 109 50 -9 -110 -50 77 203 317 269 171 73 20 128 211 294 242 190 229 268 210 314 352 293 348 402
10444 402 324 245 280 314 310 305 219 134 128 123 118 112 120 128 120 15 -34 79 143 208 185 163 92 21 56 91 77 64 114 164 101 38 19 0 -18 -37 -51 -65
10425 -65 67 199 143 88 113 139 119 98 78 58 35 12 37 62 128 195 207 57 74 90 48 6 105 203 156 109 109 110 110 110 152 194 155 116 47
10407 47 -22 -10 2 102 202 156 111 67 24 -20 -64 -66 -68 -21 25 -25 -76 -45 -14 6 27 9 -9 -109 -48 100 87 97 204 246 288 330 372
10391 372 182 -8 -22 126 238 253 215 178 134 90 108 126 192 258 202 146 90 33 146 258 193 128 177 226 162 98 104 111 37 -37 -8 21
10375B1j9j9j7j8L2L1Q2Q1JJNOOOL3L3j5j5p1p1MMN9l8l3J30M5n1J3J4l8l8M3M3o9o9P6P6
10356B64n2n1mlK4K4K4K4n6n6J9J8Qr0p7Q4M1M2N7l9k2k1q2J5RJ0J5J6rrrqj9j8j3j2k9O9
10337H4N6N7J06Qj04po5o5N4N5onnnJ1J2n0M8J28L2n3n3o7o6o0o1J2J09J51j0j06qM0M0j61
10319D6j60Q2Q2L5L4k6P1Qq8m0N6J01Lj7j7N4N4l1j28j47n1J32J32K5K6m3N4J23j04j10N2
10303B08l5l5L0o7k2k2K5J22rj06j26j25O9O9RJ05j0j08L4L4N8N8J13J6J1J0m8j45j0Q6J0
10288A99j52j30l3j1j0j9P8R9R8O9k8p7K1K2K3k0k0L3L3j6j6j%ppL3o5k2P5J06Rj30l4J8J7
10270A35k5k5L5L6k9O7M1j22j5j4r4O7J48j3k4k3r4LO9k7k1P5L0K9m6m5l1l0N0N1k5k5Q4j2
10253A80o1L7p2p3J7J8l8O0P4P5l3l2J8J9k4k4l8N9kkM6n0n1M6j07j08m6m7J09K06nj01qr
$$ plain form
10375 21 2 -17 -34 -52 -20 11 93 174 175 176 181 187 193 199 232 265 250 235 164 93 97 101 160 122 89 219 264 213 226 240 202 164 207 250 181 112 188 264
10356 264 212 161 157 154 178 202 226 250 194 138 157 175 183 93 16 100 141 183 240 201 179 158 76 91 100 110 125 141 132 123 114 106 87 69 56 44 15 84
10337 84 140 197 303 311 207 200 135 70 124 179 173 168 163 158 169 181 131 179 307 339 286 233 166 100 40 -21 -9 100 251 241 135 127 167 207 46
10319 46 -114 -32 50 85 119 93 164 172 84 44 100 201 204 187 170 224 278 247 119 -28 -79 53 185 210 236 193 247 370 266 156 208
10303 208 173 138 168 101 79 57 82 204 195 89 -37 -162 -93 -24 -15 90 80 -28 6 40 98 156 269 285 296 306 258 113 103 189 199
10288 199 47 -83 -116 -127 -137 -156 -78 21 119 188 160 83 104 126 149 129 109 142 175 159 143 142 142 135 128 161 96 74 149 255 264 134 100 118 135
10270 135 110 85 120 156 127 194 235 113 98 84 -10 57 205 192 168 145 51 54 123 96 75 150 180 209 163 118 87 57 107 158 133 108 192 180
10253 180 119 156 84 11 28 46 8 68 142 217 184 152 170 189 165 141 103 162 160 158 204 154 103 149 42 -66 -112 -159 -50 156 151 50 42 33
10236C3L4L4l5l6P8P7K7K7q6q6poM6J43K9o7n9j56o0L6J16J16K2p6k1k0l3l3J46J45j9j8j00
10220A91r9k2k2k2k2M1M2ppo1o1K0K0J48J48l0k9L6L6L6L6j5j4j5j4n3n2j01j01k3k4N8N8
10203G6J0J0p1p0nonnPPN6N5R1R1n5n4o7o6P9Q0K9L0P8P9o9o8o8o9o1o1j3j3m9m9J29J29N8
10184A70N9RJ0r5r6qqK8J25K2j40r1NN4N4m7m6KLM2M3M3M2k9k9J9K0OOm2m3k4k4Q9Q9O2O2
10166C42j5j12j33R3J4q2LLn1n2NMN3N2K3K3n8n8MMMLP5P4l8l9opopk7k6N4N4n6n5opJ8J8
10146H2K3K4k5P1J08n4j2j2p7K1j0j0Qq9l6O1J04Pk4k4P4P3k7j90j04pR2R3R3R2O0l7o3o4
10129B21o3o4l7O0M0M0M6M6m6m6KLq7q7K7K6M5M5l7l6M7M6N9l8j1Q6P4q8q1J5m9m9l0l1N0
10111I8N0RRQRl0l1l1l0K3K4K4K4m8m8JJl2l2l2l2Q2Q3k5k5oR2J40M2n6n6o2o2nnnmN0N0J04
$$ plain form
10236 33 67 101 66 30 108 185 212 239 153 67 60 54 100 243 272 205 146 -10 -70 -34 82 198 220 144 123 103 70 37 183 328 309 291 191
10220 191 92 70 48 26 4 45 87 80 73 12 -49 -29 -9 139 287 257 228 264 300 336 372 357 343 328 314 261 209 108 7 -16 -40 18 76
10203 76 86 96 25 -45 -50 -56 -61 -66 -59 -52 4 59 150 241 186 132 65 -1 78 158 187 217 295 374 305 237 169 100 39 -22 -35 -48 -97 -146 -17 112 170
10184 170 229 238 248 153 57 49 41 69 194 216 76 -15 -10 44 98 51 5 7 10 52 95 138 180 151 122 141 161 167 173 131 88 64 40 129 218 280 342
10166 342 327 215 82 175 189 107 110 113 62 10 15 19 72 124 147 170 112 54 58 62 66 69 144 218 180 141 135 128 122 115 88 62 116 170 114 59 53 46 64 82
10146 82 105 129 104 175 283 229 217 205 128 149 139 129 137 48 12 73 177 184 160 136 210 283 256 66 -38 -45 47 140 233 325 385 348 285 221
10129 221 158 94 57 117 157 197 243 289 243 197 199 202 115 28 55 81 126 171 134 98 145 191 250 212 201 287 361 273 192 207 158 109 79 48 98
10111 98 148 157 166 174 183 153 122 91 61 84 108 132 156 108 60 61 62 30 -2 -34 -66 16 99 74 49 43 135 275 317 261 205 143 81 76 71 66 62 112 162 266
10091B66Qn4n4Jr6j35l7M7M8n5n5O5O5J1J08N4N3l5l5J4J3n6n6K4K5j01j02M4M5M9M9r6r7
10075g5J6J5J6J5L9L9N9J56M9m8mj00r9O4J4J5K0K1q7q7RJ06M6M5k0j17mR4K1K2k7k7J8p9
10057A25pQ9M6j16p4K4L9L9N8m0p3K4O7l1o2o3P0P1L5o1qpq9q9N7N7M6M7M6M7l8l7P2k5j71
10040F8p4J7J7l4O2O3l5L8L9p5p5J9J17N5N6O0l7l1l1l6l6r7%J08J1KJo3R8J4q3P0P1j14j13
10022E2M7M7q9QP4P3l4l4P2P1J9p8m7M9nj02J9J9r1PM2M2M8M9O1O1J3J3p9q0L4L4n5n6l5O2
10004B31L1o6n3n4r8r9N3N4p1K7J44j7MNq0q0mR3J39k3q1Q0O1O0n7n7K3K4j6j5L8n8K9K9k6
9987A70k6oo%%JR7M8m8PP%Jq4q4O5r6o1J01j%O8O7M1n6j4j4j01j01M8M9l3l2O8O8j3j3o6o7
9967a6N7J54ppkjK6K5K5K5j2j1r3r3n2n3R4R3K7K8K7K7J4J3J3J3q3q2kkp5p5p4p5J2J2J57
$$ plain form
10091 266 274 220 166 167 71 -64 -101 -54 -6 -61 -116 -51 14 25 133 187 240 205 170 184 197 141 85 109 134 33 -69 -25 20 69 118 22 -75
10075 -75 -59 -44 -28 -13 26 65 124 280 329 281 277 177 78 142 156 171 191 212 125 38 47 153 199 244 224 107 103 197 218 240 213 186 204 125
10057 125 118 207 253 137 63 87 126 165 223 183 110 134 201 170 108 45 115 186 221 160 152 145 56 -33 24 81 127 174 220 267 229 192 264 239 68
10040 68 -6 11 28 -6 56 119 84 122 161 86 11 30 147 202 258 318 281 250 219 183 147 50 50 158 169 171 172 109 207 221 138 208 279 165 52
10022 52 99 146 57 65 139 212 178 144 216 287 306 228 181 230 225 123 142 161 70 77 119 161 209 258 319 380 393 406 327 247 281 315 260 204 169 231
10004 231 262 196 143 89 -9 -108 -55 -1 -72 -45 99 82 86 91 11 -69 -73 20 159 136 55 135 196 256 199 142 165 189 173 158 196 138 167 196 170
9987 170 144 138 132 132 132 133 230 278 230 237 244 244 245 161 77 142 46 -15 86 85 85 153 220 261 205 191 177 76 -25 23 72 39 7 75 143 130 117 51 -16
9967 -16 41 195 188 181 179 178 204 229 254 279 267 256 163 70 18 -35 59 152 179 207 234 261 275 288 301 314 231 149 147 145 70 -5 -79 -154 -142 -130 27
9949B7J57n0n0m9n0m3m3m3m2P7P8P7P7LLN1N2k4k3K5K5m4m3m4m4J10J10l6l5o0o0o0o0N6N6
9931H1QPk2k3N8N8MMjkR1pj70N7J41k1MMm7m7m7m7qqM1M1o7o8j9j9N5N4N5N5qrn7n7J54J55
9911C73q8q9K8K8P6P6k7k7p5p5p1p1J0J0kkklk8k9k8k9qrP3P2QPm1m2N4N4k7k7N3N4NNJ1J1
9891B08l7l7o2o1P9P8M5n2j19P5J35o0m2N5PPl6l5J6J7J6J6L8L8p6p5k0k0O1O1L1L0n0n0J00
9873B81J00q4q4j1j07j19P4Q0j6N0M9l2l2M9M9j7j6L1L2o2o2o3o2L9M0j0rL8L9L8L8m1m1K6
9856A85p2j24P1J55N8o5o5J0J1N3N4jjL2o4j19P5k3k3n9o0q4q4J26J27J0RJ0J0j6j5O5O5n0
9839B01m9O4O4J3J4o8o8o6o7M7M7qqqpl7l7l7l7J3J3J3J3J08J08K8K7j17j18R3R3l2l3J7J6
9822A95M7M7jjp2p2M2M1o8o7p0J25Jr6J9K0M5M6l6l5M9N0JJr9r8M7M7j7j7Kr6mJ90J83j0l9
$$ plain form
9949 27 184 134 84 35 -15 -58 -101 -144 -186 -109 -31 46 123 126 129 180 232 208 185 210 235 191 148 104 60 170 280 244 209 149 89 29 -31 25 81
9931 81 89 96 74 51 109 167 171 175 174 172 263 256 86 143 284 263 267 271 224 177 130 83 75 67 108 149 82 14 -5 -24 31 85 140 195 187 178 121 64 218 373
9911 373 285 196 224 252 328 404 377 350 275 200 129 58 68 78 76 74 72 69 41 12 -16 -45 -53 -62 11 83 91 98 57 15 69 123 96 69 122 176 181 186 197 208
9891 208 171 134 72 11 90 168 213 161 42 117 252 192 150 205 212 219 183 148 164 181 197 213 251 289 213 138 118 98 159 220 251 281 231 181 281
9873 281 381 297 213 202 95 -24 50 130 114 164 213 181 149 198 247 230 214 245 277 215 153 90 28 67 107 97 88 126 165 203 241 200 159 185
9856 185 113 -11 60 215 273 208 143 153 164 217 271 270 269 301 237 118 193 170 147 88 28 -56 -140 -14 113 123 132 142 152 136 121 186 251 201
9839 201 152 216 280 293 307 239 171 105 38 85 132 124 116 108 101 64 27 -10 -47 -34 -21 -8 5 113 221 249 276 159 41 134 227 195 162 179 195
9822 195 242 289 288 287 215 143 185 226 158 91 21 146 147 51 70 90 135 181 145 110 159 209 210 211 112 14 61 108 91 74 76 -20 -24 166 349 339 300
9803C00l9r9j00L3L2L3L3J4J5o7o6K5K5K5K6p9p9l1l0K0K1J01J02L4L5p9p8QRm0m0M9N0R1
9786B54j04j02R3k8k9N8N7k3k4M3M3nom9m9m9m9N7N6k5k5L3L3m2m2N6J52n2j49r6KK1K2L0
9769F2L1L0L0N6N5J4J3j29l2ooJ7J8J7J8poP5P4j0j1r1r1qqqqm8m8O5O4rj0j0j0j0j0mmn2
9749CM4P1P1O0O1Qq9l4O2N7m0n3n3n2n3k2P5O9O9l5l5q4q4P4P4o6o5p7K1O8O9P0r1NNp8J8
9730D3M5M4J13J12l9l9Or1m6J15o1o2Lr4J01J01J4J4o0o0Q1j5r5Ln9n8L1L1k4P3O1O0Q0j8
9713C10j20k3J22K6j26k9K3K4j8j8L0L0K7K6k2k2j06j05M0M0J3J4O2O2m9n0R6R6j37j38P3
9698A51P3k7k8k7k7L3L4M9j12l7N9n9L8K3K3L0K9j9k0j00j01K7K7K7K7K3K2k6k6o3o3Q2Q2
9681A24rqP2P2j2j2j1j2K4K5M1n7j81j8Q4j3N7N8o2o2k9k8k9k9O0O0J1J1L3L2j6j6q5q5l0
$$ plain form
9803 300 261 162 62 95 127 160 193 207 222 155 89 114 139 164 190 111 32 1 -29 -9 12 113 215 249 284 205 127 135 144 104 64 113 163 254
9786 254 150 48 141 113 84 142 199 176 152 195 238 233 227 178 129 80 31 88 144 119 94 127 160 118 76 132 284 232 83 -13 -11 10 32 62
9769 62 93 123 153 209 264 278 291 162 130 124 118 135 153 170 188 181 175 250 324 314 303 212 121 113 105 97 89 41 -7 58 122 113 103 93 83 73 63 59 55 3
9749 3 47 118 189 249 310 318 229 195 257 314 274 221 168 116 63 41 116 185 254 219 184 100 16 90 164 98 33 -44 -23 45 114 184 93 98 103 25 43
9730 43 88 132 245 357 318 279 285 194 148 263 202 140 143 49 150 251 265 279 219 159 240 225 130 133 74 16 47 78 54 127 188 248 328 310
9713 310 190 167 289 315 189 160 183 207 189 171 201 231 258 284 262 240 134 29 69 109 122 136 198 260 211 161 257 353 216 78 151
9698 151 224 197 169 142 115 148 182 231 119 82 141 82 120 143 166 196 225 206 186 86 -15 12 39 66 93 116 138 112 86 23 -40 42 124
9681 124 115 107 179 251 239 227 216 204 228 253 294 237 56 38 122 109 166 224 162 100 71 43 14 -15 45 105 116 127 160 192 176 160 75 -10 -40
9663d0l0J11K08O7r5jjr2r2L6L5llq2P9J61kq4q5j3j4m8m9J30J29j5j5j5j5R5R5J4J4k6k6
9646C28k6k6L3L4j13j12l4l4M7M6J6J7l2l3L0K9L0K9n5n4P8P9J26o8p1p2j00j00M5M6N2N2
9630A87K8K8l7l8M4M3j26j27Q3Q3L6L5m6m6j5j6j5j5jjj%N6N7N7N7l8l8q7q7L4L4m8m7llM6
9611G3M5J0Rj4j5J8J7o4o3O7O7J28o6n8n8k2k2M7M7kjK2K2n9n8J2J2O0O1k0j9q9q8k8J66L3
9593A70L3K6K6JKj2j2l7l6NMm3m4j6j6R7R8l8l8q6q6qqR1R1R2j34q6J1k9k9Q4Q4J8p9r9r9
9575a02K4J21M0n7Q4Q4o8o8m2m3l6l7L7J34K1p7J%M3M3L7L7K7K7L3j28l2l1n2M5P2P1l5l5
9558A38l5l5n3n3k3k3N9J56N2N3n8n8K3K2j2j3j3j2O4O4m9m9MMM7M7l0j27m6N1O5O6l6l5q6
9540F9J2L6o1q4q4K7J24L5o3qQ9N0N1kr9j35j35NNJ41J42J8p8O2O2K6K6J5q2j06j0L4L4rq
$$ plain form
9663 -40 -70 41 249 316 221 220 219 127 35 71 106 103 100 18 97 258 256 172 87 74 60 12 -37 93 222 207 192 177 162 257 352 366 380 354 328
9646 328 302 276 309 343 230 118 84 50 97 143 159 176 144 111 141 170 200 229 174 120 198 277 403 335 264 192 92 -8 37 83 135 187
9630 187 215 243 206 168 212 255 129 2 85 168 204 239 193 147 132 116 101 86 85 84 83 83 139 196 253 310 272 234 147 60 94 128 80 33 30 27 73
9611 73 118 128 137 123 108 126 143 79 16 83 150 278 212 154 96 74 52 99 146 144 143 165 187 128 70 82 94 154 215 195 176 87 -1 -29 137 170
9593 170 203 229 255 256 258 246 234 197 161 166 170 127 83 67 51 148 246 208 170 84 -2 -10 -18 73 164 256 122 36 47 18 -11 73 157 175 96 -3 -102
9575 -102 -78 43 83 26 110 194 126 58 16 -27 -63 -100 -63 71 92 15 16 16 59 102 139 176 203 230 263 135 103 72 20 65 137 208 173 138
9558 138 103 68 15 -38 -61 -84 -25 131 183 236 178 120 143 165 153 140 127 115 179 243 194 145 149 153 200 247 217 90 44 95 160 226 190 155 69
9540 69 81 117 56 -28 -112 -85 39 74 11 3 92 142 193 191 92 -43 -178 -173 -168 -27 115 133 55 117 179 205 231 246 164 58 48 82 116 107 99
9522I9M0M1M0M1k1k0Q8qj03nJ01Nl0l1J3J2o9o8M4M5l9l9J0J0r3r2J18J18kjkjL8L8p6p5p5
9504E1p6J03K00L1j29J9J17q4j80l6O2j5j12l5J26Q9qQQk1k2k7k7J21K3r3O8R9R9l7l7m8m9
9487A88m8m9L5L6L5L5m4m5m4m4K4K4K5K4OOOOj5j4j4j5j5j5j5j5r7r7M9M8P9P9P9P8N8N7k3
9469C68k4j05j05M1M1j05j05P3P3j5j5o4o3j4j4j4j4O0N9J6j47l1J30Q4j3k9k8J3J4Q8Q7P
9453B49Oo1o2j4j3J1J1R2R1RRj04j04qpppK5K6K6K6J9J8O8O7ppqpjjkjr9r9n0n1J0J0J1J0
9432G4Q9R0RRj01j02P7P6l9l9M2M2Q8Q7r1r0%J%%j24j23K1K2J05J06p3p2l8l8J0J0O2O2J4
9415A66J3m9m9m9n0P5P5P5P4k9k9l0k9L1L0j7j8J7J6l2l2qrrqLMLMl3l2J6J5p0p0M4M3j4j3
9395B5O7O8L3L3m8m8l5l5J4J4p6p5J2J1p3K4J15J15P9P9l9j36j10j4P2P2kjN3m3j3j3o7K9
$$ plain form
9522 99 139 180 220 261 240 220 308 300 197 192 293 298 268 237 250 262 193 125 169 214 175 136 146 156 63 -29 89 207 205 204 202 201 239 277 201 126 51
9504 51 -25 78 278 309 180 199 316 232 52 16 78 63 -49 -84 42 131 123 131 139 118 96 69 42 163 186 93 161 260 359 322 285 237 188
9487 188 140 91 126 162 197 232 188 143 99 55 79 103 128 152 158 164 170 176 161 147 133 118 103 88 73 58 -39 -136 -87 -39 40 119 198 276 334 391 368
9469 368 344 239 134 175 216 111 6 79 152 137 122 58 -5 -19 -33 -47 -61 -1 58 74 -73 -104 26 110 97 68 40 53 67 155 242 249
9453 249 255 194 132 118 105 116 127 219 310 319 328 224 120 112 105 98 91 116 142 168 194 213 231 299 366 359 352 344 337 336 335 333 332 233 134 84 33 43 53 64 74
9432 74 163 253 262 271 170 68 145 221 182 143 185 227 315 402 311 221 221 222 222 222 98 -25 -4 18 123 229 156 84 46 8 18 28 90 152 166
9415 166 179 130 81 32 -18 57 132 207 281 252 223 193 164 195 225 208 190 207 223 191 159 151 142 133 125 128 132 135 139 106 74 90 105 35 -35 9 52 38 25
9395 25 92 160 193 226 178 130 95 60 74 88 12 -63 -51 -40 -113 -89 26 141 220 299 260 124 14 0 72 144 142 141 194 151 138 125 58 87
9378H7m6N1J38M0NMqqJ1q7l2l2l6l7J2J2M1M0k0P7M4n3l4l5p7K0M6M6k9k9k3k3r1O%%J3J2
9359ER4J90R8o5q0q1k4k5K4K4KKPQn4M4j1j2Q2Q2o4o3k1k1N4N4N2m4l8l8M2M1M2M1%%n2j50
9340A45q2J6L5L6N7N8O4l3k7k7J6J6M2M2p7p7nj03n8J04RRP3k3llklq7J0J1q7rj0O5O5l4l5
9321H8M6M6nmM4M4LMl5l5r3O9R0R1l8l7j19j18N3N3N2N3j17j17R4mq7P4L8n9j46m8J00J01
9304H1J3J3PPm3j40r5O6R4R3K3K3P5P5l8l8R3R2n3n3q1q2%jk5k4K3K4J1J0p0p0L0L0l4O3J41
9285B40k0j01j01l0k9l0k9M9M9M9N0O5O6J6J7k4k5m4J17J9j43m7M9P2P2lll4l3K1K1j1Q6J16
9268D67j10j28l2j9j9ppM2M1k3k3K5j36o3L5l0l1R4R4O8l0n0n1K4K5O1O1n2n3m7m7L8J35K3
9251B75p4qpn4M3M5j17o0J65J26l7q7J0o1o0J03Pj3j4o7L0P8j8J4J5o7o6k3P4L2o6qQ8J8J8
$$ plain form
9378 87 41 92 230 270 275 279 271 263 274 187 155 123 87 50 62 74 115 155 135 212 256 203 169 134 57 77 123 169 140 111 88 65 -26 -20 -20 -20 -7 5
9359 5 99 289 387 322 242 161 137 112 136 160 162 164 171 179 125 169 158 146 228 310 246 183 162 141 195 249 301 257 219 181 223 264 306 347 347 347 295 145
9340 145 63 79 114 150 207 265 329 296 269 242 258 274 316 358 281 204 199 96 38 142 151 160 233 210 207 204 202 199 112 122 133 46 37 27 92 157 123 88
9321 88 134 180 175 171 215 259 262 266 231 196 103 172 262 353 315 278 159 41 94 147 199 252 135 18 112 108 21 95 133 74 -72 -120 -20 81
9304 81 94 107 114 121 78 -62 -157 -91 3 96 119 142 217 292 254 216 309 401 348 295 214 132 132 131 106 82 105 129 140 150 80 10 40 70 36 99 240
9285 240 220 119 18 -12 -41 -71 -100 -51 -2 47 97 162 228 244 261 237 212 168 285 304 161 114 163 235 307 304 301 267 234 255 276 265 351 467
9268 467 357 229 197 178 159 152 145 187 228 205 182 207 71 8 43 13 -18 76 170 238 208 158 107 131 156 217 278 226 173 126 79 117 252 275
9251 275 201 193 186 132 175 220 103 43 208 334 297 210 220 159 99 202 209 196 182 115 145 223 205 219 234 167 101 78 152 184 118 110 198 216 234
9233B34J25l6p4K3j03nN9O0poj2j3R8Jn4M4m6j42l0O8O3l5K7K6onooK4K4Mr3o5L1J9K0K6K6
9214B58q7j84qJ54N7N6M4M5j7Q1M4n3o7o7o9K8l9N8O3l5P5P4rqn7n7%Jj13j12L5L5M1M1j7
9197A91Q0k2k3P7P7K8K9l8l7q6q6k6k5k6k6M3M3M3M3L0L0n0n1k2k1j67oJ36L8r6%j0j0mmR9
9179A51R8R9R9j08j08k6k7ooo1o1N3m4j68oJ94R7J6J6q2q3L0L0K4K4P2P3m5m5L6L6j27j26
9162A9K0J9N9N9n4n5ppqpJ00J00j4j10p2R0Q4p8o9o9O6O7J19J19n8n9l2l1l2l1M2M2l9l9j6
9144A18j5O5O5L3L4m8m7k8k9k8k8O7O8J9J9p6p6NNM8M9M8M9L6L6ooq3J4O9j25o0o0p3p2O1
9126D8O2J3J2k6k7N5N4M1M1j04j05Q6Q6k8k8N4N4k7k7L7L8m2j38j10Q5J8J8O4O4j6j7m3m3
9110A49r1r1J65J66m5m5l0l1Q3Q3r5r6M9N0jjjjM8M8jjk4k4k3k4QPQ9Q8r4r4m5m5o3o4j5j5
$$ plain form
9233 234 359 323 249 272 169 164 223 283 276 270 258 245 343 344 290 334 288 146 116 184 247 212 239 265 259 254 248 242 266 290 294 201 136 167 186 206 232 258
9214 258 171 -13 -21 133 190 246 290 335 318 399 443 390 323 256 187 215 176 234 297 262 337 411 402 394 337 280 280 281 168 56 91 126 167 208 191
9197 191 271 249 226 303 380 408 437 399 362 276 190 164 139 113 87 130 173 216 259 289 319 269 218 196 175 8 2 138 176 80 80 70 60 56 52 151
9179 151 249 348 447 339 231 205 178 172 166 105 44 97 53 -115 -121 73 170 186 202 120 37 67 97 121 145 217 290 245 200 236 272 145 19
9162 19 39 58 117 176 122 67 60 53 45 38 138 238 224 114 42 132 216 138 69 0 66 133 252 371 313 254 222 191 159 128 170 212 173 134 118
9144 118 103 168 233 266 300 252 205 177 148 120 92 159 227 246 265 189 113 118 123 171 220 268 317 353 389 383 377 294 308 377 252 192 132 59 -13 48
9126 48 110 123 135 109 82 137 191 232 273 169 64 150 236 208 180 234 288 261 234 271 309 267 129 19 104 122 140 204 268 252 235 192 149
9110 149 58 -33 132 298 253 208 178 147 230 313 218 122 171 221 220 219 218 217 265 313 312 311 287 263 240 216 224 231 320 408 314 220 175 130 67 3 -12 -27
9091b7O9P0j2j2M0M0K7K8Q2j13p0J24J3q5j7j8j2j1q1q0l3J61J00MN8l9n0M6Or0q4J3L8L9
9074A24mlK8K9K8K9m5m4L6L7N1N2k9l0l6l6J3J2m0m0l4l4m5N2llj5j6R7R8RQm5N1M2M3o5o5
9055B07N7N6k4k5j7j8j7j7l0l0N1N1K8K8n3n3j0j0n3n2m3N5J03Oo4o5j8P9Q0j6l6l6l2l2M9
9037I9M9N7N7pQ9k8j89q3q2q9P4M6n0j2J50K22o9r7%k5k4N2N2N8l9l5l5j5Q3m4m5O6l2KLR9
9019B58R9Q8p5j29L3mj01m8M9J39M3j29j29j33K8J06QO0O1k7k6j4j3L5L5qqN2m5q4J3J3q4
9002F3l4O3llJ03Pm6m6qQ8Qq9L0L0j9j9j07j0P6k0J8J15%%K9o8j27j26M4M4M5M4Q2Q1o3o4
8984A18L4L4j33l7R7R8m2m3j0j1j1j1M9M9o5o4M6M6o8o7j5j5L3L4M4M4p4K4J79m6j50J2L3
8968A12L3j1j1N2m4RJ0L7L8j2j1k9k8P4k2j03j02j7P9P3P4J4J12J02n9l7l7j58o0L6L6l5O2
$$ plain form
9091 -27 42 112 100 88 128 168 195 223 305 192 122 246 259 174 157 139 127 116 35 -45 -78 83 183 187 245 206 156 202 208 118 34 47 85 124
9074 124 120 117 145 174 202 231 186 142 178 215 266 318 289 259 223 187 200 212 172 132 98 64 19 71 68 65 50 34 131 229 238 246 201 252 294 337 272 207
9055 207 264 320 296 271 254 236 219 202 172 142 193 244 272 300 247 194 184 174 121 69 26 81 184 190 126 61 43 122 202 186 150 114 82 50 99
9037 99 148 205 262 255 344 316 127 44 -38 -127 -53 -7 -57 -69 81 303 234 137 137 112 88 140 192 250 211 176 141 126 209 165 120 186 154 156 159 258
9019 258 357 445 370 241 274 270 169 121 170 309 352 223 94 -39 -11 95 103 163 224 197 171 157 144 179 214 206 198 250 205 121 134 147 63
9002 63 29 92 89 86 189 196 150 104 96 184 192 103 133 163 144 125 18 8 84 64 82 197 197 197 226 158 31 -95 -51 -7 38 82 164 245 182 118
8984 118 152 186 53 16 113 211 169 126 116 105 94 83 132 181 116 52 98 144 76 9 -6 -21 12 46 90 134 60 84 263 217 67 79 112
8968 112 145 134 123 175 131 140 150 187 225 213 202 173 145 219 197 94 -8 -25 54 127 201 215 327 429 370 333 296 138 78 114 150 115 177
8951A77O2l6L8L8q7q7L0o6k3P3l4j30P6P6L2L2K6K7L4o2j11j3L7L8mnJ5J4q8RR6R7m9m9M8
8934B31m8m9M9L2L3J29l2kkk8j26n4J07J01o1J2J2N0N0L2L2M4n3r7Jo0o0J2J2l7l7J5J6l3
8917A91l4O3O3J4J5m6m5m6m5k0k0k1k0O1O2O1O1P1P2K2K3p8p8k9l0M5M5pj04j25k8Q9Q9M4
8900C15M3mnp2p2p2p2l7l6M4M4J02J01J7q1j52n5J16K0j7j6k2k2O6O7J4q3n0M7j4j3J00J01
8883C02p8p7k7k6K2K1o5o5Q1Q0K1K1J02J01k2k3j03j04k5k4k5k5N3N3k8k8L6L7p7p7J0J0N9
8866A10N8N2N1l6l6M9m7m2J20K5p2n5j53r8O4O9P0J09n2j66mP8P8M0M0LLMLL9L9j0rj06j06
8849A12P3P2J7J6l1l2klkkL9L9L9M0m5m4m5m4m1m0QQO0O1k0k0l9l8J39J40j57j57p6p6N7N8
8831F4RRJ14J14l1l1L5L6j3j3n4n4K6K7j1j0j1j1n0n0J17J18Q8p4j18j18j24L7O0N9M2M3k3
$$ plain form
8951 177 239 203 241 279 192 105 135 69 46 119 85 -45 31 107 139 171 197 224 258 196 85 72 109 147 143 138 153 167 79 88 184 281 232 183 231
8934 231 183 134 183 215 248 377 345 343 341 313 187 133 240 341 280 292 304 354 404 436 468 512 459 362 363 303 243 255 267 230 193 208 224 191
8917 191 157 220 283 297 312 266 221 175 130 110 90 69 49 110 172 233 294 365 437 459 482 404 326 297 267 312 357 350 246 121 93 182 271 315
8900 315 358 354 349 277 205 133 61 24 -12 32 76 178 279 296 215 63 8 124 144 127 111 89 67 133 200 214 131 81 128 114 101 201 302
8883 302 224 147 120 94 116 137 72 7 88 168 189 210 312 413 391 368 265 161 136 112 87 62 115 168 140 112 148 185 108 31 41 51 110
8866 110 168 220 271 235 199 248 201 159 279 304 232 177 24 -74 -10 59 129 238 186 20 16 94 172 212 252 255 258 262 265 304 343 333 324 218 112
8849 112 185 257 274 290 259 227 225 222 220 218 257 296 335 375 330 286 241 197 156 116 124 132 192 253 233 213 174 136 275 415 258 101 25 -51 6 64
8831 64 73 82 196 310 279 248 283 319 306 293 239 185 211 238 227 217 206 195 145 95 212 330 418 344 226 108 -16 21 81 140 182 225 202
8814B02P5O1j00j39m1J1J1J7J7K1K1NJ01P3q9r6KO4O5K2K2m0m0j36K5P3k4qqKJm7m7M2M2j2
8796A48j2Q4j2p1K6Mj59p7Q4K2p6J03J02opn9J03J33k9m1m1O2O2J0q8q4J3J6q0q3P8J59kq
8779B74R0J8J9j3j09m9m9r4LK3K3O4l2K2K3RRRRQQQQkkq3q3J6J7l3l2j3j4J00J00l3l3k7k8
8759A31N4J51Nr2n3n2n9n8N5N6m7M9LMR0R0j1j1n9o0l8l7M3M3J0J0RJ0M3M2l8l9RRl9m0J1
8741A94J2N9O0l6l5q4q4k4k5J22J21OOj07j07j5j5R9R8J1J1J0J1k3k2K6K6J6J6o5o5k8k9k8
8724A12k9R2R2O8j27j50M5Q8Q9J47m7j8j9j7j7r8r8J9J9O8O8j0j0L8L9PPPPj08j09k7k8kl
8706I5J11J11j13j14L2L3l4l4l3l4L9L9Q1Q1pj04n8J37J02r3j35N9K0p8L8L8n6n6n5n6m5m4
8690a33O9O8j2j2L6L6K9K8L4L4oR1J58l7k12j9L9L8Q1Q0%%n0n0n6M2onJ%k4k5k4k5ppj4j3
$$ plain form
8814 202 277 338 238 99 58 69 80 97 114 135 156 161 262 335 246 150 152 216 281 303 325 285 245 109 134 207 183 175 167 169 170 123 76 118 160 148
8796 148 136 220 208 137 163 167 8 -69 15 37 -39 64 166 160 153 94 197 330 301 260 219 281 343 353 265 181 194 210 130 47 125 284 282 274
8779 274 364 382 401 388 279 230 181 87 90 113 136 200 168 190 213 222 231 240 249 257 265 273 281 279 277 194 111 127 144 111 79 66 52 152 252 219 186 159 131
8759 131 185 336 341 249 196 144 85 27 82 138 91 140 143 147 237 327 316 305 246 186 148 111 154 197 207 217 226 236 279 321 283 244 253 262 223 183 194
8741 194 206 265 325 289 254 170 86 62 37 159 280 286 292 185 78 63 48 147 245 256 267 277 288 265 243 269 295 311 327 262 197 169 140 112
8724 112 83 175 267 335 208 58 103 191 280 427 380 362 343 326 309 211 113 132 151 219 287 277 267 305 344 351 358 365 372 264 155 128 100 98 95
8706 95 206 317 204 90 122 155 121 87 54 20 59 98 179 260 253 149 91 228 330 237 102 161 181 103 141 179 123 67 12 -44 -89 -133
8690 -133 -64 4 -8 -20 16 52 81 109 143 177 171 262 420 383 171 152 191 229 310 390 390 390 340 290 234 276 270 265 266 266 242 217 193 168 161 154 140 127
8671A27n5j52oR1N0N1J12J4rro3o3M1M1K1p6m6N1j5j5M5n1LMr2r2N4N4J7J7R3R2J06Rj36m0
8653A73M6M5o2o2J3J4J4J4K1K1l1j29p4K2R7R7Q4p8o8o7M8M9M2M3qj05kjk9k9K0J9J1J0l2
8636A26l2m8M9M3M3m4m4P0P0po%r7RRn1M5K3K4J20m2p3p4%R8P4k3r8kJ%J3J3L4J30N4j07o0
8616B40n9M4M3k4k4k4k4k5k6K3K2m9m9l2J28K7p0n5n4L2L2L1L2KKm7m7N0M9M9N0l1l1l1l1
8599A23Q4Q5k9k9o1o2j2Q4M8j14n9J02Q9Q8J7J8llj16j15P8P8l5l5o2o1L0K9j08N3J31L3Q0
8582C46Q1j36j35m3m3m4m3j5j4j5j5M6M6lkLKJ16J16L9M0j39j38Q6Q6L7L8j2j2o0o1o6o7M7
8565F6M7K5K5J05J06K3K3j22j23p5p6M4M4k8O9K4j37L6L5K5K5L6L5L6L5J5J6o5o6n0n0L0L1
8549A64k5k4J20J21q3q4L0L0o9o8J8J8M3J39J6k10k24KP0P1J15J15KKJJm7m7j3j3N6m2j07
$$ plain form
8671 127 72 -80 -86 5 55 106 218 232 223 214 151 88 129 170 191 115 69 120 105 90 135 84 87 91 -1 -93 -39 15 32 49 142 234 340 349 213 173
8653 173 219 264 202 140 153 167 181 195 216 237 206 77 3 25 122 219 303 225 157 90 138 187 229 272 264 159 157 156 127 98 118 137 148 158 126
8636 126 94 46 95 138 181 137 93 163 233 226 220 220 123 132 141 90 135 158 182 302 260 187 113 113 211 285 262 164 162 163 163 176 189 223 353 407 300 240
8616 240 181 225 268 244 220 196 172 147 121 144 166 117 68 36 164 191 121 66 12 44 76 107 139 141 143 96 49 99 148 197 247 216 185 154 123
8599 123 207 292 263 234 173 111 99 183 231 117 58 160 249 337 354 372 369 366 250 135 213 291 256 221 159 98 128 157 49 102 233 266 346
8582 346 427 291 156 113 70 26 -17 -32 -46 -61 -76 -30 16 13 11 14 16 132 248 287 327 188 50 136 222 259 297 285 273 213 152 86 19 66
8565 66 113 138 163 268 374 397 420 298 175 100 24 68 112 84 153 177 40 76 111 136 161 197 232 268 303 318 334 269 203 153 103 133 164
8549 164 139 115 235 356 273 189 219 249 180 112 130 148 191 330 346 136 -88 -86 -16 55 170 285 287 289 290 291 244 197 184 171 227 185 78
8532G8J20M1n7J8J7J1J2O2O3n1n0P0O9p6p5LMp2p1j3Q5K1j40j50P6J72P4l1l1M4M4r0r0K3
8515A10K3R0R0P3q8j68p2M1M2L3L4L3L3j2j2j2j2J6J6o4o5k4k3K5K5N8N9j52j52P4P4P4P4
8498B41QQRQm9n0m9m9P1P1P1P1ook2P5k2j84r2MrqklRRlR3J04On2n3O2l5k3k3k9O8J11n2m8
8478B30M9r7r6J04J04J7J7L6o1o1L7m6m5P4k3j17M5J19m2m1m1L0L0J0J0Q0Q1L1j30m9J12R
8462C76RK5p1p1p1MNL0L0j8j8L7L6m4m4l0l0l0l0L2L3L2L3l1l1k5k5K1J18RRK6p1p7K0L5o3
8443A40kjJ0J0l2l2Q9J85P7q5j12j12m2m1K2K1K2K2N5N5O1l6o5o6j8P8P4k3%jnJ57J1j50l0
8426B36l0k1P7J1q7k0k0J4J12M0j21j7Q0QRP1k7n3n3m2m1P7P7j09j3O8k9j2j3p3K4J9J8RJ06
8408B75M8j13NJ01L5o3m4m4k1P6o0n9K3K2n8n9LKKKK2K3O5O5J0q7j29L2J41M4l4O4O0l7j11
$$ plain form
8532 78 198 239 182 200 217 228 240 302 365 314 264 334 403 327 252 255 259 187 116 103 188 209 69 -81 -5 167 241 210 179 223 267 177 87 110
8515 110 133 223 313 386 298 130 58 99 141 174 208 241 274 262 250 238 226 242 258 194 129 105 82 107 132 190 249 97 -55 19 93 167 241
8498 241 249 257 266 274 225 175 126 77 148 219 290 361 355 349 327 402 380 196 104 108 99 91 89 86 95 104 101 194 298 304 252 199 261 226 203 180 151 219 330 278 230
8478 230 279 182 86 190 294 311 328 364 303 242 279 233 188 262 239 122 167 286 244 203 162 192 222 232 242 322 403 434 304 255 367 376
8462 376 385 410 339 268 197 201 206 236 266 248 230 267 303 259 215 185 155 125 95 127 160 192 225 194 163 138 113 134 252 261 270 296 225 148 168 203 140
8443 140 138 137 147 157 125 93 182 367 444 359 247 135 93 52 74 95 117 139 194 249 310 274 209 143 125 203 277 254 254 253 248 405 416 266 236
8426 236 206 185 262 273 186 166 146 160 272 312 191 174 254 262 271 342 315 262 209 167 126 203 280 171 158 226 197 185 172 99 123 142 160 169 275
8408 275 323 210 215 316 351 288 244 200 179 255 195 136 159 181 123 64 67 69 71 73 95 118 183 248 258 171 42 74 215 259 225 289 349 312 201
8391B01j5M2M2K2p6l3l4J00J00L7o1oop0p0J1J1k0k1L2J29L4o3p8p7k8O9J4J5j4j4O8O7j5
8373B93j4j5j5KKKKm4m5O9O9K3K3l1l2L5o1n0n0K2J19L7n9L2L2K5K6r9r9r9r9P2P2rj0K6K6
8355A78K5K6r7r7m8m8J9J9O7O8M0M0M0M0j3j4o2o2NNQ5Q6k5k5k5k4j7j7j7j6KKj4Q3N6j06
8337A59j5Q2o6o7K0K1N5N4K01L8o3L3p9q0M9M8o4o5m8m8m9m8L6L7L6L7N7N6q2q3k2P5J11n0
8320B76n2n2N2N1J4J4L0o7k9J33J3j48k3k4J6J5P2P2p4p4J8J7L4o4p3Q9P3P2n8n7N5N6m1m0
8303B96m1m0J8J8K9K8j23L9N1N1J45j7o1o1j07N5OOO3l5q6q7K0J18Nr3%%pol5l5K1K0k5P3
8285B03J09n3j2j2K1K0j6j12n3n2l1O6R2R3J6J7J0J1K5p1p8K0j2j09j02oJ67J66R6o5p3Q9
8269C64M2n4kjo3L5K3K3j07j07j11M9J37k4j7Q0J55J55r4j91j10j3N2N3P0k6q2J5m5m5Q1Q0
$$ plain form
8391 201 186 228 270 292 216 183 149 249 349 386 325 319 313 243 173 184 195 175 154 186 315 349 286 208 131 103 172 186 201 187 173 241 308 293
8373 293 279 264 249 251 253 255 257 213 168 237 306 329 352 321 289 324 263 213 163 185 304 341 282 314 346 371 397 298 199 100 1 73 145 136 126 152 178
8355 178 203 229 132 35 -13 -61 -42 -23 44 112 152 192 232 272 259 245 183 121 126 131 216 302 277 252 227 203 186 169 152 136 138 140 126 209 265 159
8337 159 144 226 160 93 113 134 189 243 444 482 419 452 373 293 342 390 326 261 213 165 116 68 104 141 177 214 271 327 245 162 140 215 326 276
8320 276 224 172 224 275 289 303 333 266 237 370 383 235 212 188 204 219 291 363 289 215 233 250 284 220 147 236 309 381 323 266 321 377 336 296
8303 296 255 215 233 251 280 308 185 224 275 326 471 454 393 332 225 280 286 292 355 320 234 147 167 285 290 197 197 197 190 184 149 114 135 155 130 203
8285 203 312 259 247 235 256 276 260 148 95 43 12 78 170 263 279 296 306 317 342 271 193 213 201 92 -10 -16 151 317 413 348 275 364
8269 364 406 352 350 349 286 321 344 367 260 153 42 91 228 204 187 267 422 577 483 292 182 169 221 274 344 318 236 251 206 161 242 322
8253C22K3p5k0j9oR2L9n8J4q2K6J22q4q3M0M1L4L5J1q6j74p6J09J2K4K4p3p2P3P3R7R7k6j23
8235B51l1l2n0M8J22K5q0q1k1J73Nr2lkqqP7P7o8o9o9o9J14J15l5O2P5j20j54n7N5N4P0P0
8218C44j1j1K2K3n9n8J3J2j08Q5R5j00q1J6o9o9Q3Q3LMJ18p6j05qNOk9l0J9J9k0k0K8K8j8
8201A34j9L0L1l6l6M5M5R3R4n2n2q2q1O4O4Q3Q2o3o3N5N5r0r0O3O4n0n0L1L0j8j8l4l4M7M7
8183B89l9m0q7q8KKLKllP8P8k3k3k3k3m5m4L6L6J08J08K7K7j53j53K5K5N8N8N9N8q6q6onK5
8165A74K5q8q9Q1Q0Q1Q1k9k9k8k9o7o7M5M6M9M9J%K7K8n4n4K6K5k4k3q0q1O6O5j7j7j6j7P
8147A47QN6N6J4J3o7o7K8K8K8K8qrq9q9P0P0P0P0J0J0l8l8m4m4MNK1K2K2K1M4M3l7l8M5M4
8128D09o9o8P2P2m1m1k2k2M3n4j55OR1p1k7J35Q8rK0K0J4J4J8J7J7J7o3o2j4j4q4q4R4R4j02
$$ plain form
8253 322 345 270 250 231 225 317 356 298 312 230 256 378 294 211 251 292 326 361 372 286 112 36 145 157 181 205 132 60 133 206 303 400 374 251
8235 251 220 188 138 186 308 333 253 172 151 324 329 237 234 232 224 216 293 370 302 233 164 95 209 324 289 351 426 306 152 95 150 204 274 344
8218 344 333 322 344 367 308 250 263 275 167 252 347 247 166 182 113 44 127 210 213 217 335 259 154 146 151 157 128 98 117 136 116 96 124 152 134
8201 134 115 145 176 140 104 149 194 287 381 329 277 195 114 178 242 325 407 344 281 336 391 301 211 274 338 288 238 269 299 281 263 229 195 242 289
8183 289 250 210 123 35 37 39 42 44 41 38 116 194 171 148 125 102 57 13 49 85 193 301 328 355 202 49 74 99 157 215 274 332 246 160 154 149 174
8165 174 199 111 22 103 183 264 345 316 287 259 230 163 96 141 187 236 285 286 286 313 341 287 233 259 284 260 237 157 76 142 207 190 173 157 140 147
8147 147 155 211 267 281 294 227 160 188 216 244 272 264 255 166 77 147 217 287 357 367 377 339 301 257 213 217 222 243 265 287 308 352 395 358 320 365 409
8128 409 340 272 344 416 375 334 312 290 333 279 124 130 221 150 123 258 346 337 357 377 391 405 423 440 457 474 411 349 335 321 237 153 247 341 239
8110B39j03k1k2M9M9l1l2m7m7O7O6J6J6l3l3l8l7J1J1M4M4mml7l7l7l7M9N0l1l1LKLLL9L8
8092A37L9L9ooO5O5M7j14j52n6M7J44J11n1p0K6M3M2o7o8k0j9l0l1l0l1m7m8J31J30J2J3l7
8075B08l6n0m9O3O4k4k3N7N7%jP5P4J0q6j29L3P2k5rrRRJ0RKKm6m6j2j2O9O9k4k4k5k4k1k1
8056A96K7K7k1k0O0O0j7j7L2L1o6o6J4J5N4N4k7k7j1j1j0j1lkllK3K3q0q0n1J11J33J33j4
8038D53j3r5r4l6l7l7l6NNQ5Q6K0K1l5l4k5j22K8K22J9p9j13j12n4J41R8Jj03R2R2j02r1O
8022A56j2j2L2L2L3L2L7L7j2j2n2n2n2n2J23J24n7M1Q7j07QRL6L7j2j2r5r5N1N1k7k6k7k7
8005A85m0m1l5l4N5J52J65l0j23k7j2j3n7n8K3K3M4M3k5k5p2J22J16J9J2J3N6N5r6r5J7J8
7989C35k5k5p3p4O0O0q6q6O5O5J6J6l2l3l2l3J43J42jr8j38N6P0k7K8p0r1J02R8o3r6JP2P1
$$ plain form
8110 239 136 115 93 142 191 160 128 81 34 101 167 183 199 166 133 95 58 69 80 124 168 164 160 123 86 49 12 61 111 80 49 52 54 57 60 99 137
8092 137 176 215 209 203 268 333 380 266 114 58 105 249 360 309 239 265 308 350 283 215 195 176 146 115 85 54 7 -41 90 220 232 245 208
8075 208 172 122 73 136 200 176 153 210 267 267 266 341 415 425 339 210 243 315 290 281 272 281 290 300 309 311 313 267 221 209 197 266 335 311 287 262 238 217 196
8056 196 223 250 229 209 269 329 312 295 327 358 292 226 240 255 309 363 336 309 298 287 277 266 263 261 258 255 278 301 221 141 90 201 334 467 453
8038 453 440 345 251 215 178 141 105 110 115 200 286 306 327 292 258 233 111 139 361 380 301 188 76 22 163 261 262 159 251 343 241 150 156
8022 156 144 132 164 196 229 261 298 335 323 311 259 207 155 103 226 350 293 334 421 314 322 331 367 404 392 380 285 190 241 292 265 239 212 185
8005 185 145 104 69 35 90 242 407 377 254 227 215 202 145 87 110 133 177 220 195 170 98 220 336 355 367 380 436 491 395 300 317 335
7989 335 310 285 212 138 198 258 172 86 151 216 232 248 216 183 151 118 261 403 402 304 166 222 292 265 293 223 132 234 332 269 173 174 246 317
7971C17l5l5j5j4L4L4o6o7M6M6L6L7j3j2J0J0J0J0j6j6j6j6l8l8J08J07M2M2j03j03o1o1K0
7955A84K0N0M9KJo3o3o2o3NMQ5Q6r3r3K1K1L3L3L3L4N6N6QQj05j05M1M0K9L0K9K9l0l0N0N1
7936C81M2M3j04j03J6J5J5J6k7k7k7k8J9J8O7O7n8n9m2J19K8o9O1l7j04N7R6jr6r6J2J1k4
7920A81k4N7N7J6J6J6J6%j%%M7M6r8r9L0K9j9j9O9O9p6p7rrJ05J04l3l4l3l3N2N3r3r3L8L9
7901B90j0j0m8m7J1J1q4P8M1n5O2O3k4k5k2k3N8N9%JJ%j6j6O4O5j4j4j5j4m6m6KLp6p5P0P0
7882B69J5J4o6o6N3N3J01J02OPp4j72r8O3O9k8J7J8l8l7N3N4N4N3m5m4m5m5j3j4O8O7k7k7
7865B97k7k8l7l8J2J1NMJ1J1p3K4J15m6r2Ml9N7J18K1lj00j16j9NJ02P8j9p2p2M8M7jjj3j3
7847A61L6L5O4O3j7j7m8m9m8m9N8N8J0RJ0J0N8N8n5n6n5n5O0O1k0k0m1m1P1P2l3l4M8M7J6
$$ plain form
7971 317 282 247 232 218 252 286 220 153 199 245 281 318 305 293 303 313 323 333 317 301 285 269 231 193 301 408 450 492 389 286 225 164 184
7955 184 204 254 303 305 306 243 180 118 55 60 64 149 235 142 49 70 91 124 157 190 224 280 336 344 352 247 142 183 223 252 282 311 340 310 280 330 381
7936 381 423 466 362 259 275 290 305 321 294 267 240 212 231 249 316 383 325 266 224 343 371 302 363 326 222 279 375 374 278 182 194 205 181
7920 181 157 214 271 287 303 319 335 335 334 334 334 381 427 329 230 260 289 270 251 320 389 313 236 227 218 323 427 394 360 327 294 346 399 306 213 251 290
7901 290 280 270 222 175 186 197 113 191 232 177 239 302 278 253 231 208 266 325 325 326 327 327 311 295 359 424 410 396 381 367 321 275 277 280 204 129 199 269
7882 269 284 298 232 166 219 272 373 475 481 488 414 242 144 207 276 248 265 283 245 208 261 315 369 422 377 333 288 243 230 216 284 351 324 297
7865 297 270 242 205 167 179 190 195 199 210 221 148 172 287 241 149 153 114 171 289 310 307 207 91 72 77 179 257 238 166 94 142 189 188 187 174 161
7847 161 197 232 296 359 342 325 277 228 180 131 189 247 257 266 276 286 344 402 347 291 236 181 241 302 282 262 221 180 251 323 290 256 304 351 367
7829C67J6L1o5j86k5K4K3N3N2o0o1M2M3opj0j1L8L8l8l8M3M3PQPQP3P3P4P3r0q9r0q9J4J5
7811C00J4J5M8M8l2l3L2L1n0m9O0O0n4n3P9Q0j31j31k7k7j28L4J76J4k0P8m9m9NOJ0J1J0J1
7794B89L0L0q4q3j2j1J01J02%%q1q1L4L5m7m6K5K5k3k3Q9Q8Q9Q9l1l2p4p5j11j5P7P6r0r1
7777A69l5l6J9J15M1n6q0J7O0l8nnP6P5p9J8M5M4j8j9j8j8k5k5k4k5J5J5J4J5j08j09O9P0
7760A54L8L8Q0Q1mj01m6N1J0J06J43q3j13j5q4q4R1R1%jJ00o2j39m3j1j2j6j5N5j07j07N5
7744E0j0rJ72J72P8j8m6m5j7j8j8j8J4J4m0m1J0q7q7J0J19J18k0k1k9k9m1N5P4k4L6L7n7n8
7727B26qrL1L2M3n3o3L5L4o2j01lM5n2J2J09j%kln1n0J61J61q1q1p3p3M0M0L8L8Q7Q6n7n8
7708C37j0r%%j%J4J5l4l4M5M6lkPQK6p2j31O2J69k5j26j27POQ2Q1J%j4j4L4L5o9o8k1k0l0
$$ plain form
7829 367 383 414 349 163 138 162 185 238 290 230 169 211 254 248 241 231 220 258 296 258 220 263 306 313 321 328 336 409 482 556 629 539 450 360 271 285 300
7811 300 314 329 377 425 393 360 392 423 373 324 384 444 390 337 416 496 365 234 207 180 52 86 262 276 256 334 285 236 241 247 257 268 278 289
7794 289 319 349 265 182 170 159 260 362 362 362 281 200 234 269 222 176 201 226 203 180 269 357 446 535 504 472 398 323 212 197 274 350 260 169
7777 169 134 98 117 232 273 217 137 154 214 176 171 166 242 317 238 256 301 345 327 308 290 272 247 222 198 173 188 203 217 232 124 15 84 154
7760 154 192 230 310 391 387 286 240 291 301 407 550 467 354 339 255 171 262 353 353 352 452 390 251 208 197 185 169 154 209 102 -5 50
7744 50 40 31 203 375 453 435 389 344 327 309 291 273 287 301 261 220 230 143 56 66 185 303 283 262 233 204 163 218 292 268 304 341 284 226
7727 226 218 209 240 272 315 262 199 234 268 206 105 102 147 95 107 216 215 215 213 210 159 109 270 431 350 269 196 123 163 203 241 279 366 452 395 337
7708 337 327 318 318 318 317 317 331 346 312 278 323 369 366 364 371 379 405 333 202 264 433 408 282 155 162 168 250 331 332 332 318 304 338 373 304 236 215 195 165
7689A65l0J09J09Q7j0j84J0P0k8m2m2j0j0L9L9n4n5M7M7R8r6l5O2k1P6Q9j06l8l8kjMMm4m4
7671A65N4N5k6k6N1N1l0k9j1j0j1j0j15j14PK02R9r5k9O9k3k3j8j7llM5M6l8l9M3M3Q7Q7n9
7654C75n8n5n5J9K0rj05l5J27O5l1j5j5N6N6n8n7o4o4J78J79JKm7m7l5l6l5l5k0k1O7O7q2
7637B33J5J00o2k0k0l1l0M5M4R3R3n5n5n4n5N9N9J0J0n2n1K9L0L3L4p9q0K3K2r1PR0p2p6Q5
7619B31J56oq4q3m5m5L1J93J77J5r4r4o6o7J4J5l5l4M6J44J01o0p7p7m1m2P2P2n7n7n7n7L7
7603A26L7Q5Q6k7k7N4N5rrn7n7K1K0k9k8K9K9L0K9P9Q0r9r9pqqpk6k6K3K2n1n1O2O2J0J0l9
7583B85l8NNNMN2N2j26j26M3M2l8l8P8P8llj3j2j2j2k9k9J9J9r3r2N2N3L5L5j4j3j0rL9L9
7565B30O7O6j4j4mnP7P7J3J3o8o8j9k0L0K9o1o1K0K0m7m6KJpqM1M0j3j4L4L5L7L8j1j2n1n2
$$ plain form
7689 165 135 244 353 440 430 246 256 326 298 256 214 204 194 233 272 218 163 210 257 355 259 224 286 265 341 430 324 286 248 246 245 249 253 209 165
7671 165 219 274 248 222 273 324 294 265 254 244 233 223 108 -6 1 203 302 207 178 247 224 201 183 166 163 160 205 251 213 174 217 260 347 434 375
7654 375 317 262 207 226 246 237 132 97 224 289 258 243 228 284 340 282 225 161 97 275 454 455 457 410 363 328 292 257 222 202 181 248 315 233
7637 233 248 348 286 266 246 215 185 230 274 367 460 405 350 296 241 300 359 369 379 327 276 305 335 368 402 323 243 266 288 197 204 294 222 146 231
7619 231 387 381 297 214 169 124 155 348 525 540 446 352 286 219 233 248 213 179 225 369 470 410 333 256 215 173 245 317 260 203 146 89 126
7603 126 163 248 334 307 280 334 389 380 371 314 257 278 298 269 241 270 299 329 358 437 517 418 319 312 304 296 289 263 237 260 282 231 180 242 304 314 324 285
7583 285 247 252 257 262 266 318 370 244 118 161 203 165 127 205 283 280 277 264 252 240 228 199 170 189 208 115 23 75 128 163 198 184 171 161 152 191 230
7565 230 297 363 349 335 331 326 403 480 493 506 438 370 351 331 361 390 329 268 288 308 261 215 217 218 211 203 244 284 271 257 291 326 363 401 390 378 327 275
7546B75K9L0j0rL3L3j5j11j48J4Q5Q6J4J5k5k4k5k5L2L3L2L2j8j8L0L1l2l1M9N0k7k8p5p6
7529B06p1p1M3M2N5N4k6k6J05J04o7o7o2L5j9k0J00J00j4j3j16j15O2O3k3k2l8N9R7o5j0j0
7513B70n3M5L8L8j8j9L0L0lmp9p9k4P3L0o6m5N2M0M0m3m2P0P0o1o2J9J9QPN5N6q1q0J1J07
7495C49J7J7Kr4pR0P8P8KLm7m6n3n2n3n2L7L7m3m4Q9Q9J5J4r1OO0l6q3J4N7m1POj3Q5Q2j5
7476D64l5l6o2o3j17k0n2n2R9J00j4j3j4j4O7O6J8J8P1P2j0rr4r3J13J6m0N6N1m7m0m0m6m6
7458B54n3n4O0O0POOOj6j6j6j6O3O2j8j8MNp6p5P3P3j05j05K1K1l4l4J52N4O6r7j00O2P4P5
7440C71K1K1K1K1m5m4m5m4l0k9k9l0J07J08opllllj0j0j0j0%j%jnnonM7M7m0m0m2j40l1J31
7420B18R0Q9j3j4K5K5q8q9l8l7P5P6n4n4N9N9m4m5L7L6K2K3k7k6PPl1l1q7P5L8n8R1R1k8k8
$$ plain form
7546 275 304 334 324 315 348 381 366 255 107 121 206 292 306 321 296 272 247 222 254 287 319 351 333 315 345 376 344 313 362 412 385 357 282 206
7529 206 135 64 107 149 204 258 232 206 311 415 348 281 219 254 235 215 315 415 401 388 272 157 219 282 259 237 199 258 355 290 280 270
7513 270 217 262 300 338 320 301 331 361 358 354 275 196 172 245 275 209 164 216 256 296 253 211 281 351 290 228 247 266 274 281 336 392 311 231 242 349
7495 349 366 383 385 291 284 374 452 530 532 535 488 442 389 337 284 232 269 306 263 219 308 397 412 426 335 341 401 365 282 296 353 312 319 325 312 397 479 464
7476 464 429 393 331 268 151 131 79 27 126 226 212 199 185 171 238 304 322 340 411 483 473 464 370 277 390 406 366 422 473 426 386 346 300 254
7458 254 201 147 207 267 274 280 286 292 276 260 244 228 291 353 335 317 321 326 250 175 248 321 216 111 132 153 119 85 237 291 357 260 160 222 296 371
7440 371 392 413 434 455 410 366 321 277 247 218 189 159 266 374 368 361 358 355 352 349 339 329 319 309 309 308 308 307 302 297 291 286 333 380 340 300 258 118 87 218
7420 218 308 397 384 370 395 420 332 243 205 168 243 319 265 211 270 329 285 240 277 313 335 358 331 305 312 319 288 257 170 245 283 225 316 407 379 351
7402C51m9m8%%j9k0j9k0K4K4K4K4j8j7j8j8K6K6J01J00l1j27p4p3QPQQR2R2k2k1j4j4j54Q
7384A47J17J18M0M1l8j34q0J7l4O2J11n0j15j7J18K1p4p5q6J0L8L8nnK3K2l2O4QPJ3J3k6k5
7367B32L5o2j2Q5Q6j2k8O9O2l4k4k4j01j02l5J26J9j43N9J57n4n4m3m3J2J2J2J08ONR3R3n3
7351D47n2m2m2PPl1l1l1l1RRRJ0K0K1k8k8M4M4K4p4j82q6J19J18J39k3polR4M5n1L9M0j39
7332C58j38n4M4n4n3K2J20Q1q1rQ8K3K3kkn0n1noM3M3jjm9m9j0j0j0rJ7J8NJ02K5p2r3r2j9
7313I2j9k5k5N6m1L0J92R5jJ05J06l8j35j84q6P3P3L1L1j%j14j14O1O1N1N1J19m4j56NL6L6
7297C21J42j9j39m2k6k6N0M9K4p4l7l7ONl9l9R7R6R7o4k2k2j3j4o9K9L2L2L8L8K8K8q5J2N9
7279D16j02j15j7J28L1k1k2M6M6l5l5j44j44O6O6K5K5n6n7L2L2R2mPJ04K7p0r3O8J33L7n7
$$ plain form
7402 351 302 254 254 254 235 215 196 176 200 224 248 272 254 237 219 201 227 253 354 454 423 296 222 149 157 164 172 180 272 364 342 321 307 293 139 147
7384 147 264 382 422 463 425 291 211 228 194 256 367 317 202 185 303 324 250 175 89 99 137 175 170 165 188 210 178 242 250 257 270 283 257 232
7367 232 267 205 193 278 364 352 324 393 455 421 397 373 272 170 135 261 280 137 196 353 299 245 202 159 171 183 195 303 309 314 407 500 447
7351 447 395 353 311 318 325 294 263 232 201 210 219 228 238 258 279 251 223 267 311 335 261 79 -7 112 230 369 346 339 333 330 424 469 418 457 497 358
7332 358 220 166 210 156 103 125 245 326 245 236 324 347 370 368 366 316 265 260 254 297 340 339 338 289 240 230 220 210 201 218 236 241 343 368 296 203 111 92
7313 92 73 48 23 79 38 68 260 355 354 459 565 527 392 208 122 195 268 299 330 329 329 215 101 162 223 274 325 444 400 244 249 285 321
7297 321 463 444 305 263 237 211 261 310 334 260 223 186 192 197 158 119 216 312 409 345 323 301 288 274 205 234 266 298 336 374 402 430 345 357 416
7279 416 314 199 182 310 341 320 298 344 390 355 320 176 32 98 164 189 214 158 101 133 165 257 253 260 364 391 321 228 296 429 466 409
7263D09j54m7N1n9n9K8K8O0O0J1J2n2n1JR8jr8m3N3j4j4N6m0q2P9J51N3m1m0Qr0J4J4PQKJ
7245C19N6m1L8L7L1L2j9j8L6o0%%n4n5K5K4J8J9Q5j2r3NJ07J08o9j65k6P2J0J1q8q7k9O9q5
7227B01q5O6O7L0L1P8P9j16j16L5L5oR1R1oj11j10K9K9N0N1kj00o7L1N0N0kkp7p7o5L3M9M9
7210B83P0r1n5M1J01J01N4m3m1N5M9m8l8l7m4m4P6P7K8K8n4n4n4n3k4k3J9J9N5m3m8M9J5q2
7192B44O0O0M6M7m0m1L0o8j10N2oj02P6P5p2p3k1P7M5n2O2J59K5p2r2r3k7k8J11J12Kr6r6
7176A94KJ35J35m7j44NOpR1QQJ4J4J7J6l3l2k0k0k0k0o1o1Q5Q5j0j1M4n4k1k1j24L8P4k3R1
7158C33R0JKq0q0L9L9R4mk8k7l4l4L2L3K0J17m0j38MMk5k5k5k5K5K4K5K4J7J6J7J6n0n1O3
7140C69O3PQm8m7M4n2n9L9N3m3r2NJ33L7j6j6n0n0N8N7J7q0p4p4M8M8j26k9J04Qj10N2J66
$$ plain form
7263 409 255 208 259 200 141 169 197 257 317 328 340 288 237 238 336 335 237 194 247 233 219 275 235 153 232 383 436 395 355 363 273 287 301 308 316 318 319
7245 319 375 334 372 409 440 472 453 435 471 411 411 411 357 302 327 351 369 388 473 461 368 373 480 588 519 354 328 400 410 421 333 246 217 286 201
7227 201 116 182 249 279 310 388 467 351 235 270 305 299 390 481 475 364 254 283 312 362 413 411 311 244 275 325 375 373 371 294 217 152 185 234 283
7210 283 353 262 207 248 349 450 504 461 420 475 524 476 438 401 357 313 389 466 494 522 468 414 360 307 283 260 279 298 353 310 262 311 326 244
7192 244 304 364 410 457 417 376 406 338 228 280 274 172 248 323 251 178 157 234 279 227 289 448 473 401 309 216 189 161 272 384 386 290 194
7176 194 196 331 466 419 275 280 286 279 370 378 386 400 414 431 447 414 382 362 342 322 302 241 180 265 350 340 329 373 319 298 277 153 191 265 242 333
7158 333 423 424 426 346 266 305 344 438 434 406 379 345 311 343 376 396 513 473 335 339 343 318 293 268 243 268 292 317 341 358 374 391 407 357 306 369
7140 369 432 439 447 399 352 396 344 285 324 377 334 242 247 380 417 401 385 335 285 343 400 417 337 263 189 237 285 159 130 234 242 132 184 350
7123C50O9m3m4k1k0Q0q1j57OM5n1M0J36J31L3n5n4rQ9n0j47JJL9J35O9j57o2L4J5J4j33j34
7106F9J8J8m2N6N5N5m7N0Q6p5N6N7k8k8r5JJ14J7k4k4N1N1L9M0R3lr1r1j0j0j01mN4N5jjN9
7088D19l7m0N7M5M6n8n8K3K3qpqpm2m2K3p4l7J25P1P0O1l5j17j9nnp4p3J2J10J52j0j44m6
7070B91L5L4O7O7m6m6l3l3k7k7p2K4J16m6j38m1M0L9L6L6m5m5j2j1L7L7jjQ0P9n8n8j0j0O9
7052C27O9j2j1j2j1L7L7MMQ5Q5nmmmj05j04o0J02R2p0m3m4%R7J70n7r7r8JKM7M7l4l4RRp2
7033C43p2r7r7J13J13L6L5L5L6L3L3m7m8k3k3k3k3K2K1K2K2J20J20q6k47l0J31L6o0l0k9J3
7017C49J3PPm1m2J7J7l2l1k6k5J52J52m9n0L7L8o4L3rj06N1J47OOk8k8N2N3j50j49l6l5qq
7000B20J32J32N9l8n8n8m9M8N8l9k1J41K8j34o3L4l1l0o2o2K0J9N3N2O5l2r1OJ27l4p4Q8R0
$$ plain form
7123 350 419 376 332 311 291 371 290 133 139 184 133 173 309 440 473 418 364 355 444 394 247 248 249 288 423 492 335 273 307 322 336 203 69
7106 69 87 105 63 119 174 229 182 232 318 243 299 356 328 300 205 206 320 337 313 289 340 391 430 470 563 560 469 378 368 358 257 253 307 362 361 360 419
7088 419 382 342 399 444 490 432 374 397 420 412 405 397 390 348 306 329 255 218 343 414 484 545 510 393 374 369 364 290 217 229 339 491 481 337 291
7070 291 326 360 427 494 448 402 369 336 309 282 210 234 350 304 166 125 165 204 240 276 231 186 174 163 200 237 236 235 315 394 336 278 268 258 327
7052 327 396 384 373 361 350 387 424 428 432 517 602 597 593 589 585 480 376 316 418 510 440 397 353 353 450 620 563 466 368 369 371 418 465 431 397 406 415 343
7033 343 271 174 77 190 303 339 374 409 445 478 511 464 416 393 370 347 324 346 367 389 411 531 651 565 318 288 419 455 395 365 336 349
7017 349 362 369 376 335 293 310 327 295 264 238 213 365 517 468 418 455 493 429 462 453 347 398 545 551 557 529 501 553 606 456 307 271 236 228 220
7000 220 352 484 543 505 447 389 340 388 446 407 386 527 555 421 358 392 361 331 269 207 227 246 299 351 416 384 293 299 426 392 318 406 496
6983D96pj9j9k5k5k3k2j6j6m5N1N2m6N5N5K8o9p8J9N5j07o2L5N1N1j9k0j9k0l0l1Q3Q3k5k4
6966C47K4K4l6l5OPK9o8j3j3lkN3N2n8L8K7j35Q5Q5j2j2j4j11o8K8J11J3Q0Q0j25k9R5R5k5
6948E20k5j4j4m0J22Mr2K8K8k7k7N3N2k8k8q9q9o3L5P3P2l4l4J2J2m2m3j6j13m3J20R4mJ4
6931C74J3J4J4m6N1O0l8Mr4o1L7p3p2R1R1R7Jr3r2j8Q0P7q6p9Q3Q6Q7J0Rm1j39PJ04l0l0j8
6913C80j14LMMLn8L9K6K7R1onR1j53j54O9O9l3O4J22J23L5L4M7n0p7K0m7m7L3o4j45m8jjN3
6895C34N3j6j7j6j6R7R8m8m7o4o3P3k5O6O6m7m7j14j6k3k3M4M4O4r7o2J00M7M7q6q6N9O0N0
6878C89N0k4k5K0J17J4j47kR5k8k8O0j02r2r1L8L9L9L8l6l6M5M5rrrrK9K9L0K9O7O7m7m6r2
6860D08r2j1j1P4P5l8l9L7L6j2j2r2r3m3m4O2O2J3J3lkM6M6J4J4l5l4L7L6m4m4J8J8J7J8n4
$$ plain form
6983 496 489 470 451 426 401 378 356 340 324 279 330 382 336 391 446 474 405 327 346 401 294 232 267 318 369 350 330 311 291 261 230 313 396 371 347
6966 347 371 395 359 324 330 337 366 298 285 272 269 267 320 372 314 352 379 244 329 414 402 390 376 265 197 225 336 349 429 509 384 355 450 545 520
6948 520 495 481 467 427 549 553 461 489 517 490 463 516 568 540 512 423 334 271 306 379 451 417 383 395 407 365 322 306 193 150 270 364 360 374
6931 374 387 401 415 369 420 480 442 446 352 291 328 255 183 274 365 462 463 370 278 260 340 417 331 252 335 421 508 518 527 486 347 354 458 428 398 380
6913 380 266 269 273 277 280 222 261 287 314 405 399 394 485 332 178 247 316 283 347 469 592 627 661 708 658 581 601 554 507 540 476 331 283 282 281 334
6895 334 387 371 354 338 322 419 517 469 422 358 295 368 343 409 475 428 381 267 251 228 205 249 293 357 260 198 298 345 392 306 220 279 339 389
6878 389 439 415 390 410 527 541 394 392 487 459 431 491 389 297 206 244 283 322 360 324 288 333 378 369 360 351 342 371 400 430 459 526 593 546 500 408
6860 408 316 305 294 368 443 405 366 403 439 427 415 323 230 187 143 205 267 280 293 290 288 334 380 394 408 373 339 376 412 368 324 342 360 377 395 341
6842C41n4N9N9J1J1J0J1K2K1K2k04j86J06L1o6O7O8j9j9J0J0J0J0ooP5P6m4m3NOK0K0o0o1
6824C13J0RRRJ9J8l0l0J19J19r2r2J6J5O4O4j9j9L0K9ppn6n5q3q3O3O2J4J3J3J3M9M9o5o5
6806D16j3j3L6L5m5m5LLm2m3L9L8M3M2ooN9N9Q7j08j17j17J6J7l2l1J14J14NMp6p6p0o9M3
6788B64M3M9N0l2l1PPQ7Q8m4m3MNppM1M1r4r4J9J9O5O6m8m8q1q1L2L2k2k2k1k2J24J24k1k2
6770D27l9l9j48M6J58J58qpRJ0r2r1j87QJ08J09P3P4p1p2J9J9o1o2M8M7r8r8LLN2N1K2K1n4
6752C38n3M5J43O1l5N0N1o3o2j01mJ41M5p0o9NON7N7n7n6MNn7M1K2p5r5r4O3O3O3O3M6M6M0
6734E64M0K3p3j9j9p1p0J0J0J8J8P3k5m6m5mlJ5J6O4O3J6J5J0Rk8j25p0p0R2R3k1k0L9L8L9
6716E56L9o8o8j4j3l8O0NNklm4m5PJ04N6m2j3j3j9k0L4L4M1M0j36l9P5k3j8j8rQ9L9j22q1
$$ plain form
6842 341 287 346 405 416 427 437 448 470 491 513 309 123 229 260 194 261 329 310 291 301 311 321 331 325 319 394 470 426 383 388 394 414 434 374 313
6824 313 323 332 341 350 369 387 357 327 446 565 473 381 397 412 476 540 521 502 532 561 554 547 491 436 353 270 333 395 409 422 435 448 497 546 481 416
6806 416 403 390 426 461 416 371 374 377 335 292 331 369 412 454 448 442 501 560 647 539 422 305 321 338 306 275 389 503 508 512 436 360 290 221 264
6788 264 307 356 406 374 343 350 357 444 532 488 445 449 454 447 440 481 522 428 334 353 372 437 503 455 407 326 245 277 309 287 265 244 222 346 470 449 427
6770 427 388 349 201 247 405 563 555 548 557 567 475 384 197 205 313 422 495 569 498 426 445 464 403 341 389 436 338 240 243 246 298 349 371 392 338
6752 338 285 330 473 534 499 549 600 537 475 374 370 511 556 486 417 422 428 485 542 485 429 433 438 381 422 444 369 274 180 243 306 369 432 478 524 564
6734 564 604 627 554 535 516 445 375 385 395 413 431 504 479 433 388 384 381 396 412 476 539 555 570 580 589 561 436 366 296 388 481 460 440 479 517 556
6716 556 595 527 459 445 432 394 454 459 464 462 459 415 370 377 481 537 495 482 469 450 430 464 498 539 579 443 404 479 456 438 420 411 500 539 417 336
6698C36J7l0l0K4K5R8R8P2k6n4n5K0K0q2q2L1L1L0L0L0K9r4r5K3J20K9o8j4Q3klJ0J0q6J2
6680D57%jj9j17l6O1L4L3j71j71J06J06N1N1L5o2J3J10k0j17l6O2j7j14L4L4j1Q7L2L2ooM8
6664D82m8k4k3k9k9K8K8n2n3N3N2N3N3k3k3K6K5K0J9K0K0J3J4m1m1j6j13n8n9M3M3M3M2KJ
6646D48o0L8J27K9k3k3l3l3J6J5j2j1M3n4K7K7q3q2j5J46J53rp8K0Rq8k2k1p6Q5N5m3k7k6
6629D19o0n9m0N8J48N1l4l5jjkjj9j8O2O2M4M4nnm8m8m8m8K8K9k0k0N0N0Lr3q8J05N2j43J4
6611C83J4m6m7L6L6L6L6M5M5l5l6p1p1M2M2K8K8k1k0k0j9L0K9M1M2ppl3l2J6J6L8L8j40j39
6593B77J18J19ONk0k1K8K8o0o1K1K0j9j8j9j9J00J01m5m4k8k8N4N3j07j07k7k6j0j0L8L8J14
6577D51J14L2L3r8r9M1M1j4j10n8J36Qq8j0j06n7M1K6J23R5j00m0N8N0N0k5k5J4J3J4J3jj
$$ plain form
6698 336 353 323 293 317 342 440 538 610 584 530 475 495 515 433 351 382 413 443 473 503 532 438 343 366 486 515 447 433 516 514 511 521 531 445 457
6680 457 457 456 437 320 284 345 379 412 241 70 176 282 333 384 419 357 370 480 460 343 307 369 352 238 272 306 295 382 414 446 440 434 482
6664 482 434 410 387 358 329 357 385 333 280 333 385 438 491 468 445 471 496 516 535 555 575 588 602 561 520 504 391 333 274 317 360 403 445 447 448
6646 448 388 426 553 582 559 536 503 470 486 501 489 478 521 467 494 521 438 356 341 487 640 631 553 573 582 494 472 451 375 460 515 472 445 419
6629 419 359 300 260 318 466 517 483 448 447 446 444 443 424 406 468 530 574 618 613 608 560 512 464 416 444 473 453 433 483 533 536 443 355 460 512 369 383
6611 383 397 351 304 340 376 412 448 493 538 503 467 396 325 367 409 437 465 444 424 404 385 415 444 485 527 520 513 480 448 464 480 518 556 416 277
6593 277 395 514 520 525 505 484 512 540 480 419 440 460 441 423 404 385 485 586 541 497 469 441 495 548 441 334 307 281 271 261 299 337 451
6577 451 565 597 630 532 433 474 515 501 391 333 469 477 389 379 273 216 257 283 406 501 401 361 419 469 519 494 469 483 496 510 523 522 521
6560E21P9Q0l9l8l9l9j1j1j1j1j1j1j2j1N1N0N1N0k5k6k5k6k0k0o8o9K3K4n8n7O5O4j5j6P
6542C96PPQK6K6o1o0J00Lj25L8M2j18O3O3p1p0J1J0M8M7jjL7L8j1j2q2q2k7k7j4Q2J30l3r9
6524B88O3J0J0R0R0k4k3L2L3q1q1m5m4O8O9j8j9L1L0p3p3J8J9o1J01J14J6K9L0k5k5k8k9k8
6507D64k8J06J07p2p1J6J6l2l2k5k5J21J20o7o7o8o7P4P4K5K6k8k8k8k7J7J8N4N4J1j83j34
6491C21O0j3j3jjK1K2K1K1N4N5k7k6ooooJ6J7J6J6n1n1klONOOO5O5j6j5lkq3q4O8O9j3j2J
6470D91Km7m7ONN5N4m2m2m2m2J0J0J22J23l3l2l3l3J3J2l5l6L8L8j1j1%%q2q1K0K0O8O9RQ
6452E24l9m0P9Q0l4l4J03J03j40j39OON4N4k4k5K5K4k3k2p1p1R7R7P2j21pJ88m6m7J1J2l7
6435F15l7o4o3j5j5M9M8o5o4J8J8o3o2O4O3q2q2R5R5j8j8K4K4K3K4M2M2M2M2j03j02j51j52
$$ plain form
6560 521 600 680 641 603 564 525 514 503 492 481 470 459 447 436 487 537 588 638 613 587 562 536 516 496 428 359 382 406 348 291 356 420 405 389 396
6542 396 403 410 418 444 470 409 349 449 452 327 365 407 289 352 415 344 274 285 295 343 390 389 388 425 463 452 440 358 276 249 222 208 290 420 387 288
6524 288 351 361 371 461 551 527 504 536 569 488 407 362 318 386 455 437 418 449 479 406 333 351 370 309 410 524 540 569 599 574 549 521 492 464
6507 464 436 542 649 577 506 522 538 506 474 449 424 545 665 598 531 463 396 470 544 569 595 567 539 511 484 501 519 573 627 638 455 321
6491 321 381 368 355 354 353 374 396 417 438 492 547 520 494 488 482 476 470 486 503 519 535 484 433 431 428 434 439 445 451 516 581 565 550 547 545 462 378 446 515 502 490 491
6470 491 493 446 399 405 410 465 519 477 435 393 351 361 371 493 616 583 551 518 485 498 510 475 439 477 515 504 493 493 493 411 330 350 370 438 507 516 524
6452 524 485 445 524 604 570 536 639 742 602 463 469 475 529 583 559 534 559 583 560 538 467 396 493 590 662 541 534 722 676 629 640 652 615
6435 615 578 514 451 436 421 470 518 453 389 407 425 362 300 364 427 345 263 358 453 435 417 441 465 488 512 554 596 638 680 577 475 324 172
6418A72Q5Q4J03Nj11Q3L7L6J07q7n9n8j6j5N3N3P8j16K0J17l6l6k9l0O9O8p7p7j4j5O7O6l2
6402D95l3M8M9n7n6N7N7K5K5k4k4p5p6NNl8l7J1J1R2R2M3M3j1j1j2j1l0l0l0l0l8l8p2J21
6384D46J23K5q6q6J10J11o8o8r5r5N1N0Q7Q7L3L2m1j39n3J40M3n5J2J3m4m4j11Q3P5k3l1l1
6368D51j02nN4N3O0O0J1J1j2j3o0o1N1N0o3o2K9K8P8P7j4j5o3o3K1K2K1K1p0p1n9J04J36k5
6351E80r2MJ8J7J5j47k5K02J06n5m7m7n1n1oR2L7L6J5J5J5J4n3n3n3n3P6P7K4p4j37m0n2n2
6334B55L2L2k3P5O6O7J8J8K6p2L1L2m7m7M0M0k6P0J19K2p9q0r2OK8K9L4L5L4L3p9q0J1J0o
6317E32R2R9o3m1m0m7N0R9Kn1n0qQ8N3j09n1n0j14M8R2nM0M0m7m7o2o2j3j3K0K0K0K0M7M8
6299E37jkkkn1n0K3K4k5k5N2N2RJ0p6K0J75n2j11j10K7J88KJL2j30j18M4Q4j3n1M6K7K8L2
$$ plain form
6418 172 257 341 444 449 338 421 458 494 601 514 455 397 381 366 419 472 550 434 454 571 535 499 470 440 509 577 500 423 409 394 461 527 495
6402 495 462 510 559 502 446 503 560 585 610 586 562 487 411 416 421 383 346 357 368 460 552 595 638 627 616 604 593 563 533 503 473 435 397 325 446
6384 446 569 594 508 422 532 643 575 507 412 317 368 418 505 592 625 657 616 477 424 564 607 552 564 577 533 489 378 461 536 513 482 451
6368 451 349 344 398 451 511 571 582 593 581 568 508 447 498 548 485 423 452 480 558 635 621 606 543 480 501 523 544 565 495 424 365 469 605 580
6351 580 488 492 510 527 542 395 370 572 678 623 576 529 478 427 421 513 550 586 601 616 631 645 592 539 486 433 509 586 610 536 399 359 307 255
6334 255 287 319 296 371 437 504 522 540 566 494 525 557 510 463 503 543 517 587 706 728 649 569 477 483 511 540 574 609 643 676 597 517 528 538 532
6317 532 624 723 660 619 579 532 582 681 683 632 582 574 662 715 606 555 505 391 439 531 526 566 606 559 512 450 388 375 362 382 402 422 442 489 537
6299 537 536 534 532 530 479 429 452 476 451 426 478 530 539 549 473 493 668 616 505 395 422 610 612 613 645 515 397 441 525 512 461 507 534 562 594
6281E94o5j1Q6J5J13rk36m0J21J1J0%r8n5M2P0k8L3L3nnonm0m1o1J01J08n5n0J11M2n6l9l9
6264E46O5O5P1k6m6m6O6O7l2O4L0j96r8jj25k7R8R8K3K4llllj2j2o6o7P1k6l3O5O1l6q4J2
6246D81R9Jp3p4j64lJ39M2O4O4j1Q7P4j52j51P4M7n1Kr5j13M8N8N9N6m0o7o7J27J27J4J3o9
6229E46o9k1k1M8M7R6R6n7n8rrn6n7N7N7l2l2k0j17p6K1RRL5L5j3j4P7P7JKm9M9jr7O8O8J3
6210F03q3q7P5Q7j0r0PJ2q6m2J19P7k0j5j5k2k1P4P3ppm7m7k0P6L2L2j0j0m0m0M1M1j06j06
6193D18OPJ03J03nmj07j0o4o4J26J26M5n2j10N3N2j10j8P8J4J4qpo2L5L5L5J5q2j1j0mJ57
6176F94O2r9m7m7p4p4L9L9K4K4K4K3J0J0P0k6j17k0J%l3l3K2K2l9N8P8P9N2m5j40K2J11n0
6158F20KJ64K6p0m8m9o6L1p2p2kkQ4Q5p7K0K7p1k5P2J02o0k6k6r1OJ09J08O6r6p6K1m4m3M
$$ plain form
6281 594 529 518 604 619 732 723 487 447 568 579 589 589 491 436 478 548 520 553 586 581 576 570 565 525 484 423 524 632 577 527 638 680 624 585 546
6264 546 611 676 747 721 675 629 695 762 730 794 824 628 530 529 404 377 475 573 596 620 617 614 611 608 596 584 518 451 522 496 463 528 589 553 469 481
6246 481 580 581 508 434 270 267 406 448 512 576 565 652 726 574 423 497 544 493 495 400 287 335 393 452 508 468 401 334 461 588 602 615 546
6229 546 477 456 435 483 530 626 722 665 607 598 589 533 476 533 590 558 526 506 389 313 334 343 352 387 422 409 395 472 549 550 552 503 552 551 454 522 590 603
6210 603 520 433 508 595 585 495 502 514 428 386 505 582 562 547 532 510 489 563 636 629 622 575 528 508 584 616 648 638 628 588 548 589 630 524 418
6193 418 424 431 534 637 632 628 521 511 447 383 509 635 680 628 518 571 623 513 495 573 587 601 593 586 524 559 594 629 644 562 551 541 537 694
6176 694 756 657 610 563 489 415 454 493 517 541 565 588 598 608 678 652 535 515 516 516 483 450 472 494 455 513 591 670 722 677 537 559 670 620
6158 620 622 786 812 742 694 645 579 610 538 466 464 462 546 631 554 574 601 530 505 577 679 619 593 567 476 482 591 699 765 669 593 614 570 527 531
6141E31Mm5m4N2N2k2k3qQ8M0n7o9o8J1J2MJ01J07J0l5O2R9o3k7P0j0j72j75p7n1M6J78J78
6124F99P2P1k2k2k2k2p5p4OOj7j7j1j1k3P4K0J9L3L3j6j12l7J24k0k1M2M3p1p1k3k2l4O2L7
6107E98o0m8m8j2j2L7L7N7N8k3k4K1K0K0K0qrM4J41J42M5j37j37q1q2jjK7K6l8N9R1p2k3k2
6089F05n6n7pQ9O1j02N5J51MMm2j40kR6K7j35j26J01J31L4l2l1k8k7o2J00J44M8j9j9l0l1
6073G04K9o8qpLJ01M7M6m9m9m2m3n1M5rrj8j8L0L1j0ro4L3K4K4Q3q0p1R1n9n9jjkjooj8P9
6053F12j4j11n7M1L1L1J34k8j02oJ1J1M4M4M4M4p6p7k7k8J00R9J3J3k4j21j57NN0N1O0O1o3
6036F08o3j4j4P4P4K6K6m8m9J%k4k5k5k4M9M9%Jo3o3J48j5j05qM0M0k6k7K1K2J5J4J5J4L9
6018F83L8p4p5MMm4m4NONOL3L4L4L4P1P1j0rn4n5n4n4p0p0M3n3J04K67M6M7N8j04j81q4j4
$$ plain form
6141 531 535 490 446 498 550 528 505 497 585 625 568 499 431 442 454 458 559 666 676 641 703 802 739 712 782 772 600 425 348 297 343 521 699
6124 699 771 842 820 798 776 754 679 605 611 617 600 583 572 561 538 612 632 651 684 717 701 589 552 676 656 635 677 720 649 578 555 533 499 561 598
6107 598 538 490 442 430 418 455 492 549 607 584 560 581 601 621 641 633 624 668 809 951 996 859 722 641 559 558 557 584 610 572 631 722 650 627 605
6089 605 549 492 485 574 635 533 588 739 743 747 705 565 563 659 686 551 425 526 657 691 659 628 600 573 511 611 755 803 784 765 735 704
6073 704 733 665 657 650 653 754 801 847 798 749 707 664 613 658 649 640 622 604 634 665 655 646 582 615 639 663 746 666 595 686 627 568 567 566 564 563 557 551 533 612
6053 612 598 487 430 471 502 533 667 639 537 531 542 553 597 641 685 729 653 576 549 521 621 720 733 746 722 601 444 449 499 550 610 671 608
6036 608 545 531 517 591 665 691 717 669 620 621 621 597 572 547 523 572 621 621 622 559 496 644 629 524 516 556 596 570 543 564 586 601 615 630 644 683
6018 683 721 647 572 576 580 536 492 497 503 508 514 547 581 615 649 720 791 781 772 718 663 609 555 485 415 458 405 509 776 822 869 927 823 642 558 544
6000E44j5LJ65J38k3r0r0j34K8J05Qk9k9l5l5J19J20k6k6p3p3QQl6l6M4M4R2R1J1J0J0Rr1
5983G16P0Q9p3j72p5J13J13r1r1L8L8L8L7n6n6qpn2n1O2O2O9P0P0P0p8p8q4q5N1m7q4P9Q0
5966F77P9O8r4m6m6K5K5kkkkR0R0n5n6m0l9M1M1p2p2P4P3j09j10O8O9LMQ4Q5m6m5ppN8j04
5948F98j42m6N2J49J06RM4M4m4m3j10j11LLM6M6M7M6k7k7m3j41m2J20J03J04poj20j20j2j3
5932E66L6L6n3n2K8K9P7P6K3K2M2n6j78j7K5p2M2M2P9Q0l4l4l7l8M3M3q0q0l2l2Q1Q1J%l0
5914F27l0N0N1K0K0r3r3R0Q9k3k4j36j37P3P4O8O8m6m5k5k5K4K3N4N5r2r1K7K7P6P5K9L0K9
5897H19K9L9L8j07j07n6n7R0Q9M9M9l2l1m5m4o9R3J27r9j40K3M2n4j58o1R0R0R7R6J5J6o6
5881G65o5l4l4j15j15J57J57M3M4j5j5j5j5k4k4k4k4K2K3P1P0J1J0l8l8M1M1p3p2j2j1O9O9
$$ plain form
6000 544 529 532 697 835 812 722 632 498 526 631 639 610 581 546 511 630 750 724 698 625 552 560 568 532 496 540 584 676 767 778 788 798 807 716
5983 716 786 875 802 630 555 668 781 690 599 637 675 713 750 694 638 630 623 571 520 582 644 713 783 853 923 845 767 683 598 649 602 518 597 677
5966 677 756 824 730 684 638 663 688 686 684 682 680 770 860 805 749 709 670 711 752 680 608 682 755 646 536 604 673 676 680 764 849 803 758 751 744 802 698
5948 698 556 510 562 711 817 826 870 914 870 827 717 606 609 612 658 704 751 797 770 743 700 559 517 637 740 844 837 831 711 591 579 566
5932 566 602 638 585 533 561 590 667 743 766 788 830 774 596 579 604 532 574 616 695 775 741 707 670 632 675 718 638 558 526 494 575 656 657 657 627
5914 627 597 647 698 718 738 645 552 642 731 708 684 548 411 484 558 626 694 648 603 578 553 577 600 654 709 617 526 553 580 656 731 760 790 819
5897 819 848 887 925 818 711 655 598 688 777 826 875 843 812 767 723 654 747 874 775 635 658 700 646 488 427 517 607 704 800 815 831 765
5881 765 700 666 632 517 402 559 716 759 803 788 773 758 743 719 695 671 647 669 692 763 833 844 854 816 778 819 860 787 715 703 692 761 830
5864H30J7J7J6J7l7l7l1l1lR5O0j02j44J9R5R5ooP5P4o1o1N1m5j92l2N0N0R4R4n1n2l5l6l5
5847G52l5J6J6J6J6J6J6J6J6l1l2l1l1%%%%J66J67m4m4r1r1K3K3klkkM8M7jjn6n6pqK6K6k2
5827H16k3k7k8k7k8M2M2ooL4L5p9p8J0J0NMM1n5r8O4Rq7j1J51J11n0LKP5P5l8l8J2J2l6l6
5808H02J33J33p7p7j23j23m2J20J02Nm3m3j1j0j1j1j0j1j1j0o8o7M6M6K9L0j9j9N9O0N9N9
5792H97j1j0r8r7J26K9L6L5j7j7j7j8k7k7L3o4N8J54L6o2p6p6l3l3n8n8Q8Q8l9l9P5P4l3l3
5775G86J0RJ2q6q3P8J19m3k3k3l3l4qQ9qrklo3o2J11J4r5KK2K2M7M7M1M1Kr6j5Q3O4O4J2q5
5756I04l3l4RRMMMMPPJ3J3n9L8j7j7n9o0p1K6J29L2k1k1PPm2m2K1K1K2K1J2J2o9o9O5O4m9
5736G92m9N2N2LMl7l8ONJ12J6m0N8N4m4l2l1k9k9K0K0K1K0K1K0m9m9L1L2q2q2O4O4j7j6j6
$$ plain form
5864 830 847 864 880 897 860 823 792 761 758 853 913 811 667 686 781 876 870 864 939 1013 952 891 942 897 705 673 723 773 867 961 910 858 823 787 752
5847 752 717 733 749 765 781 797 813 829 845 814 782 751 720 720 720 720 720 886 1053 1009 965 874 783 806 829 827 824 822 820 868 915 914 913 857 801 794 786 812 838 816
5827 816 793 766 738 711 683 725 767 761 755 789 824 745 667 677 687 692 696 737 682 584 648 657 570 559 710 821 771 774 776 851 926 888 850 862 874 838 802
5808 802 935 1068 991 914 791 668 626 746 848 853 810 767 756 746 735 724 714 703 692 682 614 547 593 639 668 698 679 660 719 779 838 897
5792 897 886 876 778 681 807 836 872 907 890 873 856 838 811 784 817 753 811 965 1001 939 863 787 754 721 663 605 693 781 742 703 778 852 819 786
5775 786 796 805 817 731 648 726 845 802 779 756 723 689 681 770 762 753 751 748 685 623 734 748 653 655 677 699 746 793 834 875 877 781 766 849 913 977 989 904
5756 904 871 837 846 855 859 863 867 871 878 885 898 911 852 890 873 856 797 737 666 692 821 853 832 811 818 825 783 741 762 783 805 826 838 850 781 712 777 841 792
5736 792 743 795 847 850 854 817 779 785 790 902 918 878 936 990 946 914 883 854 825 845 865 886 906 927 947 898 849 880 912 830 748 812 876 859 843 827
5718H27j6jkn0n0M2M1M1M1o7o6j8j7Q2Q2JKM4M4nmLKLKq2q3kkL9M0m2m1J1J2R2R2M8M7l3l3
5698A024j18j18l7l8J9J8O7O7m9m9m9m9K3K3P1P1P6P5R2p0j71p3M0M0j8j7j8j7J7J8O6O7m7
5681I36m7O7O6LLLLK1K2k7k8l1l1j12j12O5O4O4O4L5L5p8p9l0l0N1N1J9K0k9j27n8J02J07
5664I82n5j09N2M9j14o3L3N0N0M6M7kkPPJ3q4j13j13pJ56K9o7llOPl7l6J9J16k5k5J17K0r7
5646H51r7l5O3O9k8n3M5R7R7M4M4M3M4j56j55j0j0J16J16mlQq9q9PJ%M9M8l2j29m8M9L0L0
5628I13L6L6jjM7M7m7m7L4L3QPp4p3Q9Q8j17k1J16J9j63j62J9K0J9J9M5M5o8o9M3M4o6L1J60
5611A009O4m8m8n3M4Kr6N2J49l0l1k7j25J6J12J02Nq0q0j2j1R1ok2k2qR0Q5j1mj00k4P2m9
5594A006M8Q2j5l6l5K3K3j83q6N2m5K1K1k7P0K2p6M8M8j8P8Q0j6j02j01K3K3l7N9R6jk1k2
$$ plain form
5718 827 811 810 808 758 708 750 791 832 873 806 740 722 705 787 869 870 872 916 960 955 951 954 956 959 961 879 796 794 792 831 871 829 788 799 811 903 995 1043 1090 1057 1024
5698 1024 906 788 751 713 732 750 817 884 835 786 737 688 711 734 805 876 952 1027 1119 1049 878 805 845 885 867 850 832 815 832 850 916 983 936
5681 936 889 956 1022 1025 1028 1031 1034 1055 1077 1050 1022 991 960 848 736 801 865 929 993 1028 1063 985 906 876 846 897 948 967 987 958 831 773 875 982
5664 982 927 818 870 919 805 742 775 825 875 921 968 966 964 971 978 991 907 794 681 674 830 859 792 789 786 792 799 762 726 745 861 836 811 928 948 851
5646 851 754 719 782 851 823 770 815 912 1009 1053 1097 1140 1184 1028 873 863 853 969 1085 1081 1078 1086 997 908 915 916 916 965 1013 981 852 804 853 883 913
5628 913 949 985 984 983 1030 1077 1030 983 1017 1050 1058 1065 991 918 1007 1095 978 957 1073 1092 929 767 786 806 825 844 889 934 866 797 840 884 818 849 1009
5611 1009 1073 1025 977 924 968 970 874 926 1075 1045 1014 987 862 878 990 1092 1097 1017 937 925 914 1005 999 977 955 947 1037 1122 1111 1107 1007 983 1055 1006
5594 1006 1054 1136 1121 1085 1050 1073 1096 913 827 879 834 855 876 849 919 941 865 913 961 943 1021 1101 1085 983 882 905 928 891 950 1046 1045 1024 1002
5577A002k7k7k6k7N0M9N0N0l4l4M7M7NMNMn3n4mnK3K4k5k6k1k1k1k1K8K8N3j09j19J07N0N1
5559A023J2J2l6l7noM7J44P9j8o5o4j12j5R8Kk3k3N2N1k0k1l7j34l8J23K7K6P9P9K4K4L9n7
5542A230j43j43M2J40k9k8l8l7J08J08jjONq6J0MNnmj18j17O3O3j7j8%%%jK6K7K6K6l6l7J2
5524A042J3LLm5m6R0R1n5n6J2J1R3R2RRm0m0o8o8J3J3m6m7L5L4l6l6J2J3l9l9J07J06O2O2
5506A264q3q3%jm8m9P8P8l5l6LLLLP3P3K4K5j3j3o1o1J3J2J3J3l1l0p9p9l0k9J9J9O3O4J6
5487A098J5m4m4L7L6J9J9J8J9QPm0m1O5O5m2m2J3J10R7o4m4m4nol4l4J5J5O6O5m7m8k9k9J3
5469A163J3K2p5L9J35MMl3l2j06rM9N0l2l2l9N9%jNOm1m1m7M9L2L1L7L7J01J01m4j42j11N0
5452A202R3R2M5n3nR3p1p2L8o0m1m1n9L7n5j52pR0N5m2J8J9M3M3j1j1Q9qj4Q3J4q2p7K0op
$$ plain form
5577 1002 975 948 922 895 945 994 1044 1094 1060 1026 1073 1120 1125 1129 1134 1138 1085 1031 1027 1022 1045 1069 1044 1018 997 976 955 934 962 990 1043 934 815 922 972 1023
5559 1023 1035 1047 1011 974 969 963 1010 1154 1233 1215 1150 1086 974 959 1057 1059 1036 1013 1065 1116 1096 1075 1038 904 866 989 1016 1042 1121 1200 1224 1248 1287 1230
5542 1230 1087 944 986 1126 1097 1069 1031 994 1102 1210 1209 1208 1214 1219 1133 1143 1147 1152 1147 1143 1025 908 971 1034 1017 999 999 999 999 998 1024 1051 1077 1103 1067 1030 1042
5524 1042 1055 1058 1061 1016 970 1060 1151 1096 1040 1052 1063 1156 1248 1257 1266 1226 1186 1118 1050 1063 1076 1030 983 1018 1052 1016 980 992 1005 966 927 1034 1140 1202 1264
5506 1264 1181 1098 1098 1097 1049 1000 1078 1156 1121 1085 1088 1091 1094 1097 1170 1243 1267 1292 1279 1266 1205 1144 1157 1169 1182 1195 1164 1134 1055 976 946 917 936 955 1018 1082 1098
5487 1098 1113 1069 1025 1062 1098 1117 1136 1154 1173 1181 1188 1148 1107 1172 1237 1195 1153 1166 1276 1373 1309 1265 1221 1216 1210 1176 1142 1157 1172 1238 1303 1256 1208 1179 1150 1163
5469 1163 1176 1198 1123 1162 1297 1301 1305 1272 1240 1134 1125 1174 1224 1192 1160 1121 1180 1180 1179 1184 1190 1149 1108 1061 1110 1142 1173 1210 1247 1348 1449 1405 1263 1152 1202
5452 1202 1295 1387 1432 1379 1374 1467 1396 1324 1362 1302 1261 1220 1161 1198 1143 991 984 1074 1129 1087 1105 1124 1167 1210 1199 1188 1277 1269 1255 1338 1352 1270 1193 1213 1207 1200
5434A200Nr2qrj4j4P3P4K5K5n5n5ooK7K8k2k1K6K6K5K6mnM4M4j0rj0rp0p0M3M3K2K1K8K8p3
5414A271K5N1N1p2p1RRJ5J4o7o6K3K4p7Q4J30l2p7p6K0K1k9k8O1O0j4j4q1J6R8%m4m3j04p
5397A080R1R1j6j6N5N5%JJ8p8q5J2M8m9L2J28o9j67J4J3j3Q4L0L0M0M0M0M0J2J2J2J2K2K2
5379A541J5J6J4q4j32l4N4N4k1k1o5o5M8M8RQK0p6p0K6l4l4QPO9k9j02mJ39J39P4k3q1q1n4
5362A279n3k7P1N3N3J1J1O2O2n0n1K2K2K3K2L7L8j1j1m0m0J3J09L1o6P6P5j27j27m6m6J1J1
5345A397N9N9O0O1q6q5l5l5QQmj00j9P8R0R1P1k6n2n1n1n1j5Q2K2K2P0k6j08j0O3O4m4m4l6
5328A427l7j7Q1%r7k5J37J90K9m9m8rrN2m6j12j5O4O4j6j12j06rl2O5J46M8L7o1o7L1j17j17
5311A270L0J27J81m5j16M5L8L7j1j1K3j38j33R4J45M7n6n6J9J16P8q4k3P4l3l3m8M9R8Jp7
$$ plain form
5434 1200 1205 1113 1105 1096 1082 1068 1141 1215 1240 1265 1210 1155 1149 1143 1170 1198 1176 1155 1181 1207 1232 1258 1254 1249 1293 1337 1327 1318 1308 1299 1229 1159 1202 1245 1267 1288 1316 1344 1271
5414 1271 1296 1347 1398 1326 1255 1264 1273 1288 1302 1235 1169 1192 1216 1139 1223 1353 1321 1244 1168 1188 1209 1180 1152 1213 1273 1259 1245 1164 1180 1278 1278 1234 1191 1087 1080
5397 1080 1171 1262 1246 1230 1285 1340 1340 1341 1359 1281 1196 1208 1256 1207 1239 1367 1298 1131 1145 1158 1145 1229 1259 1289 1329 1369 1409 1449 1461 1473 1485 1497 1519 1541
5379 1541 1556 1572 1586 1502 1370 1336 1390 1444 1423 1402 1337 1272 1320 1368 1377 1385 1405 1329 1259 1285 1251 1217 1225 1232 1301 1272 1170 1166 1305 1444 1518 1495 1414 1333 1279
5362 1279 1226 1199 1270 1323 1376 1387 1398 1460 1522 1472 1421 1443 1465 1488 1510 1547 1585 1574 1563 1523 1483 1496 1605 1636 1570 1646 1721 1594 1467 1421 1375 1386 1397
5345 1397 1456 1515 1575 1636 1550 1465 1430 1395 1403 1411 1407 1307 1288 1366 1456 1547 1618 1592 1540 1489 1438 1387 1372 1454 1476 1498 1568 1542 1434 1424 1487 1551 1507 1463 1427
5328 1427 1390 1373 1454 1454 1357 1332 1469 1659 1688 1639 1591 1582 1573 1625 1579 1467 1452 1516 1580 1564 1452 1346 1337 1305 1370 1516 1564 1601 1540 1473 1504 1387 1270
5311 1270 1300 1427 1608 1563 1447 1492 1530 1567 1556 1545 1568 1430 1297 1391 1536 1583 1527 1471 1490 1606 1684 1600 1577 1651 1618 1585 1537 1586 1684 1685 1608
5296A608p6p2p2K0J82J88K6q3J4Nr3l0l0M4M5k1k0K7K8ONONk0k1k1k1J1J0J1J1K7K7o0n9P
5278A614r0m2N6J8J9K4K4R2R1k2k2m7m7j07j0R0pNNk5k5l6O0R7jq5q5M1M2ppNOM3M4Q4p8r4
5258A623r4l8N9ooJ65Kp3K3N7N8n6n6N7m0J5J4L2L2M3n3j21k4O1O1NNQ0Q0Qq9q3J4L2J29O8
5240A984j57m8N0p3K3K9K9J4q3m2N4L6L6P8j9j32l4k1k1O7O6kjqpj3j10l6O2L1o5JJr6KJ53
5222A748N6m0N7j0rQ4j2j2Q4kkJ0q8K2K1L2o5r4O8k3j20K9L0J36J37n6n5ppK0K1o0o1J9J8
5205A869l0l0mmM4M5K6K6n5n5J5J5o6o6Q1Q2%Jk0k0j33j33K9L0J10J11j7j6j6j7J10J10K9
5188B051K9p1p1M2M2p2p1k2k3M8M8R6R7M5M5j00j01L6L6L7L6m2m1m2m1N9O0O0O0L2L2q2q1
5172B131NOj08j08J45J45jjq8q8ppklkkk5k4Q8Q9N7N7n6n6n3n2K7K8J39J40j04j03o9o9M4
$$ plain form
5296 1608 1532 1460 1388 1408 1590 1778 1804 1721 1735 1740 1647 1617 1587 1631 1676 1655 1635 1662 1690 1696 1701 1707 1712 1692 1671 1650 1629 1640 1650 1661 1672 1699 1726 1666 1607 1614
5278 1614 1524 1482 1538 1556 1575 1599 1623 1715 1806 1784 1762 1715 1668 1561 1551 1641 1634 1639 1644 1619 1594 1558 1618 1715 1714 1629 1544 1585 1627 1620 1613 1618 1624 1667 1711 1795 1717 1623
5258 1623 1529 1491 1550 1544 1538 1703 1705 1632 1655 1712 1770 1714 1658 1715 1675 1690 1704 1736 1768 1811 1758 1637 1613 1674 1735 1740 1745 1825 1905 1913 1824 1741 1755 1787 1916 1984
5240 1984 1827 1779 1829 1756 1779 1808 1837 1851 1768 1726 1780 1816 1852 1930 1911 1779 1745 1724 1703 1770 1836 1834 1833 1825 1818 1805 1695 1659 1721 1752 1687 1688 1689 1593 1595 1748
5222 1748 1804 1764 1821 1811 1802 1886 1874 1862 1946 1944 1942 1952 1864 1886 1907 1939 1874 1780 1848 1825 1705 1734 1764 1900 2037 1981 1926 1919 1912 1932 1953 1893 1832 1851 1869
5205 1869 1839 1809 1805 1801 1845 1890 1916 1942 1887 1832 1847 1862 1796 1730 1811 1893 1893 1894 1874 1854 1721 1588 1617 1647 1757 1868 1851 1835 1819 1802 1912 2022 2051
5188 2051 2080 2009 1938 1980 2022 1950 1879 1857 1834 1882 1930 2026 2123 2168 2213 2113 2012 2048 2084 2121 2157 2115 2074 2032 1991 2050 2110 2170 2230 2262 2294 2212 2131
5172 2131 2136 2142 2034 1926 2071 2216 2215 2214 2126 2038 2031 2024 2022 2019 2017 2015 1990 1966 2054 2143 2200 2257 2201 2145 2092 2040 2067 2095 2234 2374 2270 2167 2098 2029 2073
5154B073M4J3J3J3J3k2k2K6K7k1k1k7k7O4l4l3O4l3l3M7M8O3l5k3k2j6Q2P5k1N9l7r2NkkP8
5136B284P9J6q1K3K2M6M7klJ6J6K7o9j80q4M0M0J1J08oj02J3J3r6%R1R2m9m8QRO3O2r6%L3
5118B343L3mR4R3lj8j8j8j8q3J5J01Ml8O0n0n0k3k4N7N8q2q1j%P1P1K3K3n9n9n2n3L7J33O9
5100B551O8J04n8p0K6k4k5o8o7l9l9J0J0P2P2rqM6M5l5l5J8J7OJ02M8n0l8l7K3K3K3K3RRR
5082B712Rl8l9l8l9J0J0Q1Q1J00o2j9k0l7l7O6O6O9r1q2q2J4J4O2O2ooq8q7j01j01P6P7l4
5065B502l5P9P9RRQ9R0jjq2q2L8L7Q7Q6j9j9K9L0o5o6M8M8j7j7n5n6k1J41R8o4q6J1n3n4L3
5047B750L2L2L3K3K3k5k5J5J5J5J6l2l1l1l2L6L5p8p7J08J08K7K8j5j4j5j4k4k3K5K5P9P9
5030C068jkK0J9O9O8j3j2j3j2O7O7j10j11MMK0p7j6J47J04Pp5p5l2l3P6P6K7K8m4m3P0O9n5
$$ plain form
5154 2073 2117 2130 2143 2156 2169 2147 2125 2151 2178 2157 2136 2109 2082 2146 2112 2079 2143 2110 2077 2124 2172 2235 2200 2177 2155 2139 2221 2296 2275 2334 2297 2205 2210 2208 2206 2284
5136 2284 2363 2379 2298 2321 2343 2389 2436 2434 2431 2447 2463 2490 2421 2241 2157 2197 2237 2248 2356 2350 2248 2261 2274 2178 2178 2269 2361 2312 2264 2272 2281 2344 2406 2310 2310 2343
5118 2343 2376 2372 2466 2559 2556 2538 2520 2502 2484 2401 2416 2517 2521 2483 2543 2493 2443 2420 2396 2453 2511 2429 2348 2347 2347 2418 2489 2512 2535 2476 2417 2365 2312 2349 2482 2551
5100 2551 2619 2723 2665 2595 2621 2597 2572 2504 2437 2398 2359 2369 2379 2451 2523 2514 2506 2552 2597 2562 2527 2545 2562 2568 2670 2718 2668 2630 2593 2616 2639 2662 2685 2694 2703 2712
5082 2712 2721 2683 2644 2606 2567 2577 2587 2668 2749 2849 2787 2768 2748 2711 2674 2740 2806 2875 2784 2702 2620 2634 2648 2710 2772 2766 2760 2672 2585 2484 2383 2459 2536 2502
5065 2502 2467 2546 2625 2634 2643 2732 2822 2821 2820 2738 2656 2694 2731 2818 2904 2885 2866 2895 2925 2860 2794 2842 2890 2873 2856 2801 2745 2724 2865 2963 2899 2813 2824 2771 2717 2750
5047 2750 2782 2814 2847 2870 2893 2868 2843 2858 2873 2888 2904 2872 2841 2810 2778 2814 2849 2771 2694 2802 2910 2937 2965 2950 2936 2921 2907 2883 2860 2885 2910 2989 3068
5030 3068 3067 3065 3085 3104 3173 3241 3228 3216 3203 3191 3258 3325 3215 3104 3108 3112 3132 3055 3039 3186 3290 3297 3222 3147 3115 3082 3158 3234 3261 3289 3245 3202 3272 3341 3286
5013C286n6N8N8m1m1M1M0J11J11o7o7j03j04M2M3P8P9l5l4K5K5k3k4j0j0L8L8noonK6K7K7
4995C516K6P1P0m3m3l5l5l4l5N8N7RRLKN0N1M7M6o6o6p7p6L6L7J16J16r4r4k5k4k5k4J7J7
4978C558l1l1N9O0J1J1K9K8K9K8K6K5K6K6n2n2n1n2J02J01N2N3o5o4o4o5lkP8P8noj18j19
4961C600J06J06N8N7L3L3m7m8O8O9j2j3jkkjO2O2j9j8L7L8K4p3j00R4J15J8NOM8M8o7o6M7
4943D265M7j1j0j0j1L6L6j2j3mnnnK0J9l5l5O3l3r4J00O8l0L8L7K0J9O8O8m6m6O7O7L9L9j0
4925D701j0n0n0L0L1l2l2Q1Q1M7M7o7o6M5M5LLjR6J7j78j09Q4M3M4ONQ6Q6j0j0LJ01N3j42
4908D981l3O5P2P3lkl4l4l3l4K4K4J04J05J1J1p1p0n3n3J78J77Q2j11j38m1R2R3J7J8k3k2
4892E372J9K0J45M7r8%L5L6p2p2l8l9M6J43K7p0J7J14L4L5M1M1M2M1p1p1k0k0J26J26LLML
$$ plain form
5013 3286 3230 3288 3346 3305 3264 3305 3345 3456 3567 3500 3433 3330 3226 3268 3311 3389 3468 3433 3399 3424 3449 3426 3402 3392 3382 3420 3458 3453 3447 3441 3436 3462 3489 3516
4995 3516 3542 3613 3683 3640 3597 3562 3527 3493 3458 3516 3573 3582 3591 3594 3596 3646 3697 3744 3790 3724 3658 3581 3505 3541 3578 3694 3810 3716 3622 3597 3573 3548 3524 3541 3558
4978 3558 3527 3496 3555 3615 3626 3637 3666 3694 3723 3751 3777 3802 3828 3854 3802 3750 3699 3647 3749 3850 3902 3955 3890 3826 3762 3697 3694 3692 3770 3848 3843 3837 3719 3600
4961 3600 3706 3812 3870 3927 3960 3993 3946 3898 3966 4035 4023 4010 4009 4007 4005 4004 4066 4128 4109 4091 4128 4166 4190 4117 4017 4111 4226 4244 4249 4255 4303 4351 4284 4218 4265
4943 4265 4312 4301 4291 4281 4270 4306 4342 4330 4317 4313 4308 4303 4298 4318 4337 4302 4267 4330 4297 4203 4303 4371 4341 4379 4416 4436 4455 4523 4591 4545 4499 4566 4633 4672 4711 4701
4925 4701 4691 4641 4591 4621 4652 4620 4588 4669 4750 4797 4844 4777 4711 4756 4801 4804 4807 4806 4902 4919 4741 4632 4716 4759 4803 4809 4814 4900 4986 4976 4966 4969 5070 5123 4981
4908 4981 4948 5013 5085 5158 5155 5153 5119 5085 5052 5018 5042 5066 5170 5275 5286 5297 5226 5156 5103 5050 5228 5405 5487 5376 5238 5197 5289 5382 5399 5417 5394 5372
4892 5372 5391 5411 5556 5603 5505 5505 5540 5576 5504 5432 5394 5355 5401 5544 5571 5501 5518 5632 5666 5701 5742 5783 5825 5866 5795 5724 5704 5684 5810 5936 5939 5942 5946 5949
4875E949m1m2J36J36%%%jk0k1j4j4k3P5Q0j6K2J18N9N8j4j3j4j3N1N0r5r5J11J10N2m6J%n4
4857F472n4N5N6N6N6l9m0j9P7J02NNJ02O6l0m5m5k6P0O4O5K8K9R3mj6J46j0j07N6N5N0M9M0
4840G362M1o7o7j5Q2J30L3PPJJLMO3l3j0Q6J34L8j05rJ03J02K0p7LJ01P2P1l5l6NNNNJJKJ
4820H035O3O2O3O3L6L5p7p8L1L0L1L1N9O0O5O5J4J11J72k2lR5Kr5M7M7M2M1L7L8L7L8qqP3
4803I232P2N5N5N5N5MNMMNMQ5Q6J71J71J7j76j07Q7J11J11Q3Q3l0l0M9N0l2l1Q9Q8QQJ3J2
4785A0466J3J2J33J32N2N2P7P8lmL7L6j3j2P6P7P6P7N6N6N7N6OON4N5m2m1P1P2J20J20M0L9
4768A2087Q7Q7k7k6j9j8j9j8K6K6J71J72N3N3N3N3jjM7M7O1O1J10J3J15J8j06N6J49J49J69
4753A3628PQ8Q8J26J27P4P4Q0j7M2M3L6L7R5R4J4J4J16J16N8m0QPJ73J73M8m9N8J55J04PK5
$$ plain form
4875 5949 5908 5866 6002 6138 6138 6138 6138 6137 6117 6096 6082 6068 6045 6120 6200 6184 6206 6324 6383 6441 6427 6414 6400 6387 6438 6488 6393 6298 6409 6519 6571 6525 6526 6526 6472
4857 6472 6418 6473 6529 6585 6641 6602 6562 6543 6620 6722 6727 6732 6834 6900 6870 6825 6780 6754 6824 6888 6953 6981 7010 7103 7099 7083 7229 7219 7112 7168 7223 7273 7322 7362
4840 7362 7403 7336 7269 7254 7336 7466 7499 7506 7513 7514 7515 7518 7522 7585 7552 7542 7628 7762 7800 7695 7686 7789 7891 7911 7834 7837 7938 8010 8081 8046 8010 8015 8020 8025 8030 8031 8032 8034 8035
4820 8035 8098 8160 8223 8286 8322 8357 8280 8202 8233 8263 8294 8325 8384 8444 8509 8574 8588 8699 8871 8849 8846 8941 8943 8848 8895 8942 8984 9025 9062 9100 9137 9175 9167 9159 9232
4803 9232 9304 9359 9414 9469 9524 9528 9533 9537 9541 9546 9550 9635 9721 9892 10063 10080 9904 9797 9884 9995 10106 10189 10272 10242 10212 10261 10311 10279 10248 10337 10425 10433 10441 10454 10466
4785 10466 10479 10491 10624 10756 10808 10860 10937 11015 11012 11008 11045 11081 11068 11056 11132 11209 11285 11362 11418 11474 11531 11587 11593 11599 11653 11708 11666 11625 11696 11768 11888 12008 12048 12087
4768 12087 12174 12261 12234 12208 12189 12171 12152 12134 12160 12186 12357 12529 12582 12635 12688 12741 12740 12739 12786 12833 12894 12955 13065 13078 13193 13211 13105 13161 13310 13459 13628
4753 13628 13635 13723 13811 13937 14064 14138 14212 14292 14275 14317 14360 14396 14433 14528 14622 14636 14650 14766 14882 14940 14900 14908 14915 15088 15261 15309 15260 15318 15473 15577 15584 15609
4736A5609K5J3J10J16J9J1J08J48j3O1K23R6jJ56J56R7JK8J26J14m9R1J89P4P5O1O1J96R9
4722A8000j6j6R2R1P5P5R6J92J76P9l8l9J13J12NNM4J41Q7Q6J63J62Q8Q7K1J18J66O9L7L7
4707B0308M1M1P6K36J95R7J13J5O4O4J89J88J40J40N3N2N3N3Q0Q0J19J18J28l5NK30K12J16
4693B3171NOJ26J25P7P6J83J82O9O9Q6Q6K00J99P8P7P8P7J21J22J21J21O4O3O4O4O4O4O4O3
4678B5965J09J09J10J09J87J88J07J07K4K4J05J05K28K28N0N0M5M6J26J26N7N7N7N8J43J42
4665B8662J43J43J01J00J9K0J35J34Q6Q6O8O8J38J39J92L1m6N1J12J11NMJ19J18NNJ09J09
4651C0967O1O0P9P9P8P9P1P0P1P1P7P8llJ5J4R5R5K5K5J06J06M0L9m2m1P7P7K9K8ONQ6Q7m1
4633C2666m1m1m0R5R6J5J5l7l8q5q6l6l7M5M5N8N7N8N8n3n4nmn2n1n2n1m8m9m8m8l2l2l2l2
$$ plain form
4736 15609 15634 15647 15757 15873 15892 15903 16011 16159 16146 16207 16430 16526 16525 16681 16837 16934 16935 16963 17089 17203 17154 17245 17434 17508 17583 17644 17705 17901 18000
4722 18000 17984 17968 18060 18151 18226 18301 18397 18589 18765 18844 18806 18767 18880 18992 18997 19002 19046 19187 19274 19360 19523 19685 19773 19860 19881 19999 20165 20234 20271 20308
4707 20308 20349 20390 20466 20702 20897 20994 21107 21122 21186 21250 21439 21627 21767 21907 21960 22012 22065 22118 22198 22278 22397 22515 22643 22608 22613 22843 23055 23171
4693 23171 23176 23182 23308 23433 23510 23586 23769 23951 24020 24089 24175 24261 24461 24660 24738 24815 24893 24970 25091 25213 25334 25455 25519 25582 25646 25710 25774 25838 25902 25965
4678 25965 26074 26183 26293 26402 26589 26777 26884 26991 27015 27039 27144 27249 27477 27705 27755 27805 27850 27896 28022 28148 28205 28262 28319 28377 28520 28662
4665 28662 28805 28948 29049 29149 29168 29188 29323 29457 29543 29629 29697 29765 29903 30042 30234 30265 30219 30270 30382 30493 30498 30502 30621 30739 30744 30749 30858 30967
4651 30967 31028 31088 31167 31246 31324 31403 31474 31544 31615 31686 31763 31841 31838 31835 31850 31864 31959 32054 32079 32104 32210 32316 32356 32395 32353 32312 32389 32466 32495 32523 32529 32534 32620 32707 32666
4633 32666 32625 32584 32544 32639 32735 32750 32765 32728 32690 32605 32519 32483 32446 32491 32536 32594 32651 32709 32767 32714 32660 32655 32651 32599 32548 32496 32445 32397 32348 32300 32252 32220 32188 32156 32124
4616C2124pqn6n6l7l7q5q6j2j3o1o1q4q3j33j32m0m0q9q9o6o7o6o7j17j17j17j17k6k6j39
4600B9990j38j33j33o6j63j96kl6l6l1l1j12j12j87j87j06j07j06j06j87j87j35j34j20k3
4587B7216J01r3r1r0j65j65j65j65j08j08j08j08k20k20j07j06j27j27m6m6j64j63j64j63
4575B4298j32j31j80j79j40j40j40j40j12j13J%j35j36j21k4k0k15k34j38p6p6j83j83j13
4563B1238j13l3l2j76j75j76j75j49j48j00j00l6l6j49j50r6r7j78j77o1o1j10j09j03j04
4550A8394j51j52j19j19j00j98j59L5q4k79p8p9rj0j90j89p7p6j69j70j39N5r5j91p7p6K3
4537A5521K2n8n8j80j79j65o9M7j46k87r2o6o6j35j35M1M0j05j06q5q5q5q5j36j37j36j37
4523A2938j8j8r9j00r0r0k4j21j95kM1j53p7p7r0q9n1n1n1n1o5o6j52j53L1o7p8J15K5p3j19
$$ plain form
4616 32124 32117 32109 32053 31997 31960 31923 31838 31752 31740 31727 31666 31605 31521 31438 31305 31173 31133 31093 31004 30915 30849 30782 30716 30649 30532 30415 30298 30181 30155 30129 29990
4600 29990 29852 29719 29586 29520 29357 29161 29159 29123 29087 29056 29025 28913 28801 28614 28427 28321 28214 28108 28002 27815 27628 27493 27359 27239 27216
4587 27216 27317 27224 27133 27043 26878 26713 26548 26383 26275 26167 26059 25951 25731 25511 25404 25298 25171 25044 24998 24952 24788 24625 24461 24298
4575 24298 24166 24035 23855 23676 23536 23396 23256 23116 23004 22891 22892 22892 22757 22621 22500 22476 22456 22241 22007 21869 21793 21717 21534 21351 21238
4563 21238 21125 21092 21060 20884 20709 20533 20358 20209 20061 19961 19861 19825 19789 19640 19490 19394 19297 19119 18942 18881 18820 18710 18601 18498 18394
4550 18394 18243 18091 17972 17853 17753 17555 17396 17431 17347 17068 16990 16911 16902 16892 16702 16513 16436 16360 16191 16021 15882 15937 15842 15651 15574 15498 15521
4537 15521 15543 15485 15427 15247 15068 14903 14834 14881 14735 14448 14356 14290 14224 14089 13954 13995 14035 13930 13824 13739 13654 13569 13484 13348 13211 13075 12938
4523 12938 12920 12902 12803 12703 12613 12523 12499 12378 12183 12181 12222 12069 11992 11915 11825 11736 11685 11634 11583 11532 11467 11401 11249 11096 11127 11060 10982 11097 11122 11049 10930
4508A0930j19p5p4j13j13j18M4m2j38j09j08j15j15J5J5q9Rj18j19O6O5m2m2m1m2j11j11j10
4494I080j11J7J7r6r6l9l9j49n1Kr4q8Rlkj42j42k0k1j01j02o4o4j9J42qj70j23k6k8k7p0
4477G372o9n6n6qpm1m1m1m1j5j5Jr6j13M9J01o1j58ML8n9l3l3n9j56r5JK2K2j01j00j00j01
4461E955N2N2K6p1j23j22l8N9J3J4k9k9m2m2m3m2p8p7L5L5l5l5m2m1m3j41n9L7m7m7k9j27
4445D896j2Q5K4K4J5J5P2r0q8J38k5j23o9p0L1L1j6j13l2O5m4m3m3m4R9Lq3q3r2NL2L1p6p7
4428D343k8k8N2N3n6M0Lr4p6p7j27l1l0j28J%j8Q0J00Mj7j6o5o4j6j6k0k1k1k1o8o8j3j3l2
4410C512O6j5j13K7K6K0K1p2p1k3k4ONl7l8q5J1J35J34m1m2PQp7p7k2k2o4L4L9n7m2N5Or0
4393C100l6O2m7m8J1J0J0J0p3p4k6k5P1P0N5j07k16j19K6K7M2M2M7M8m6N1Qq8o4L4K2K1o6
$$ plain form
4508 10930 10811 10736 10662 10549 10436 10318 10362 10320 10182 10073 9965 9850 9735 9750 9765 9676 9685 9567 9448 9514 9579 9537 9495 9454 9412 9301 9190 9080
4494 9080 8969 8986 9003 8907 8811 8772 8733 8584 8533 8535 8441 8353 8362 8359 8357 8215 8073 8053 8032 7931 7829 7765 7701 7682 7824 7816 7646 7523 7497 7469 7442 7372
4477 7372 7303 7247 7191 7183 7176 7135 7094 7053 7012 6997 6982 6983 6887 6774 6823 6924 6863 6705 6709 6747 6688 6655 6622 6563 6407 6312 6313 6335 6357 6256 6156 6056 5955
4461 5955 6007 6059 6085 6014 5891 5769 5731 5790 5803 5817 5788 5759 5717 5675 5632 5590 5512 5435 5470 5505 5470 5435 5393 5352 5309 5168 5109 5146 5099 5052 5023 4896
4445 4896 4884 4969 4993 5017 5032 5047 5119 5029 4941 5079 5054 4931 4862 4792 4823 4854 4838 4725 4693 4758 4714 4671 4628 4584 4683 4686 4603 4520 4428 4433 4465 4496 4420 4343
4428 4343 4315 4287 4339 4392 4336 4376 4379 4285 4209 4132 4005 3974 3944 3816 3817 3817 3799 3879 3979 3983 3966 3950 3885 3821 3805 3789 3769 3748 3727 3706 3638 3570 3557 3544 3512
4410 3512 3578 3563 3450 3477 3503 3523 3544 3472 3401 3378 3354 3360 3365 3328 3290 3205 3216 3351 3485 3444 3402 3409 3417 3340 3263 3241 3219 3155 3189 3228 3171 3129 3184 3190 3100
4393 3100 3064 3126 3079 3031 3042 3052 3062 3072 2999 2925 2899 2874 2945 3015 3070 2963 2747 2628 2654 2681 2723 2765 2812 2860 2814 2865 2873 2785 2721 2755 2777 2798 2732
4376B732o6M7M7l4l4l4l4mmmmm4m3NNl4l4l5l4j14j14O4O4l7l7M4M5j8j8j7j8L6L5p8p8K0
4358B173K0k8J33J16J9jr8j59o2N0M9l6j32r5O8j9j16L6L6j1Q6J22l9j04j03O5O4l2l3J6J5
4342B000LLLKr3r3m4m5Q2Q1o3o4n0n1kkL3L2Q1Q1o1o1K0J9j04j05M1M1K9K9K3K3R5kQj54j42
4324A593J9j%o6o5j7j8P3P3rqK8K8M4n2j13M8N5m2POj39K2mnK2p5j05N6M0M0o2o1N1N2Q1Q2
4305A578o4o3n5n5N9N8m7m8L3L4l4l4l4l3M3M3nok0k0k0k0o4o3N0M9MLN2N2j8j7o7o6lkll
4286A194noonJ8J8J7J8o9o9M4M4m9n0L1L1k2k3j03j03N6N7M6M6Q9p3r1OK9o7o1L5noM9M8l
4268A060ln2n1L9L9L9L9j2j3j3j3p4p5j17M5M7M6N6N7mnq5q5qrrrJ16J15l0k9k5k5j05j06
4250G41O4O5J5J6L4L3j5j5J2J2J2J2j%M1M2K3p5p4K2m0m0l4l4j6j5L2L3l5l5N0J47M3n4l6
$$ plain form
4376 2732 2666 2713 2760 2726 2692 2658 2624 2620 2616 2612 2608 2564 2521 2526 2531 2497 2463 2428 2394 2280 2166 2230 2294 2257 2220 2264 2309 2291 2273 2256 2238 2274 2309 2231 2153 2173
4358 2173 2193 2165 2298 2414 2433 2432 2334 2175 2113 2163 2212 2176 2044 1949 2017 1998 1882 1918 1954 1943 2029 2151 2112 2008 1905 1970 2034 2002 1969 1985 2000
4342 2000 2003 2006 2009 2011 1918 1825 1781 1736 1818 1899 1836 1772 1722 1671 1669 1667 1700 1732 1813 1894 1833 1772 1792 1811 1707 1602 1643 1684 1713 1742 1765 1788 1883 1881 1889 1735 1593
4324 1593 1612 1611 1611 1545 1480 1463 1445 1518 1591 1582 1574 1602 1630 1674 1622 1509 1557 1612 1570 1577 1583 1444 1466 1462 1457 1479 1404 1299 1355 1395 1435 1373 1312 1363 1415 1496 1578
4305 1578 1514 1451 1396 1341 1400 1458 1411 1363 1396 1430 1396 1362 1328 1295 1338 1381 1376 1370 1350 1330 1310 1290 1226 1163 1213 1262 1266 1269 1321 1373 1355 1338 1271 1205 1202 1200 1197 1194
4286 1194 1189 1183 1177 1172 1190 1208 1225 1243 1174 1105 1149 1193 1144 1094 1125 1156 1134 1111 1008 905 961 1018 1064 1110 1199 1126 1035 1041 1070 1003 942 977 972 966 1015 1063 1060
4268 1060 1057 1005 954 993 1032 1071 1110 1098 1085 1072 1059 985 910 793 838 885 931 987 1044 1040 1035 950 865 857 848 839 830 946 1061 1031 1002 977 952 847 741
4250 741 805 870 885 901 935 968 953 938 950 962 974 986 985 985 1026 1068 1091 1016 942 964 924 884 850 816 800 785 817 850 815 780 830 977 1020 966 930
4233I30l6q0J8l7l7M2M3p0p1R1R0L8o0j32l5M4M4O8k9j2j3j53QJ77P9j5j12o4o4K4K5k5k4
4216F52P1P1J2q5m0m0k1P7l9l9M8M8MNn6M0J19K2n3n3n7J04O8k8m3m2r7r6K6K7p5Q7J38k4
4199G31j59j59J0J08k8k8K3K4K3K4P2P3qpl6l5N5J53RRp5j73K4K5j21j21J11K09L0o6m8m8
4183F01noK9K9k0j9M1M1p3p2k7k6k7k7l0k9N1N1K0K1K0K1l5l6J3J3O7O7j5j4j14j14jjL7L6
4165D67L6L7QRj2J50L1j30m1N6Q4j4o0o0j3Q3M0j23l3l4M8M7q2Q0J28l3l4l4o0J02L0o7n1
4148E55n1k1k1k1k1P5P4j41j41l6j32k3J39O6O7K9K8J8J9J8J8k8k8k8k8r5r4N1N1M6M6R9o3
4132D27j45J7Q3j4Q3Q2mnk9l0l0l0o2o1Q5Q4O6O7j4j5m7m8m7m8M6M6kkp3p3QPJ3J2J3J2N4
4113D26N4N3N4m9n0m9m9qqqqL2L2k3k3J50N3r9jl1j27j9j8MMn1n1j4j12lJ60P0P0L2L2l4l4
$$ plain form
4233 930 894 814 832 795 758 800 843 773 702 793 883 921 861 729 694 738 782 850 821 809 796 643 651 828 907 892 780 716 652 676 701 676 652
4216 652 723 794 806 721 681 641 620 697 658 619 667 715 719 724 668 708 827 849 796 743 686 790 858 830 787 745 648 552 578 605 530 617 755 731
4199 731 572 413 423 531 503 475 498 522 545 569 641 714 706 699 663 628 683 836 845 854 779 606 630 655 534 413 524 733 763 697 649 601
4183 601 596 590 619 648 628 609 650 691 618 546 519 493 466 439 409 380 431 482 502 523 543 564 529 493 506 519 586 653 638 624 510 396 395 394 431 467
4165 467 503 540 548 557 545 695 726 596 555 611 695 681 621 561 548 631 671 548 515 481 529 576 494 574 702 669 635 601 541 643 673 606 555
4148 555 504 483 462 441 420 495 569 428 287 251 119 96 235 301 368 397 425 443 462 480 498 470 442 414 386 291 197 248 299 345 391 490 427
4132 427 282 299 382 368 451 533 529 524 495 465 435 405 343 282 367 451 517 584 570 555 508 460 413 365 411 457 455 453 380 307 315 322 335 347 360 372 426
4113 426 480 533 587 538 488 439 390 382 374 366 358 390 422 399 376 526 579 480 479 448 321 302 284 288 292 241 190 176 64 61 221 291 361 393 425 391 357
4095C57j8P9J14m8r7r7p3p4P2P2L3L3L2L3j03j03J1J0j0j0rj0j5j5R9R8noq0q0q0J6P0O9R4
4077C59llml6j32n2M4OOP2k5o3L4Q6Q7M1M1qpn5n5L2L3j08j0J6J6o7o7Q4Q5j84q6L1L1M2n5
4058A26OOq6J1R6R5R9Jk5k5klN8l9p1K6K6p0l5O3N6m0K6K7m4N3O3r9j05pn8n7R4R4Q5Q5%r7
4039C33o5L3O9r3j54n7K5K4M4M4L8L9j4j10L5J32j1j2Jr6m4m4L1L2O3O3k3k4k1j19N6N5m4
4023A86N3n0n0L0L0L0K9qqq3q3o3L3J14J8k2k2K1K1K5K6%r8J6J5J0J0K6K7P5P6o1o0K0K1J1
4005C15J2J1J1mnQr0r8kQ0j8qQ8Kr6k6k7oR0J6J5k7k7q4q5J26J26l5l5l4l5M4M4M5M4JJn4
3986B83n4n0j48o3J32J17K1n9n8M0M0j06j06J5J5J6J5jjM8M7oooon6n5L3K27J43n2l7l7q1
3969B04J6P1j24K5K5o8o7J5J6O5O4onn5n4j6j6O5O5P9Q0r7j94j18P5J28L0j0j1O4O4O8O9p8
$$ plain form
4095 357 339 418 532 484 387 290 217 143 215 287 320 353 385 418 315 212 223 233 223 213 204 194 179 164 263 361 356 350 270 190 110 126 196 265 359
4077 359 356 353 349 313 181 129 173 179 185 257 232 169 203 289 376 417 458 450 443 388 333 365 398 290 280 296 312 245 178 262 347 163 77 108 139 181 126
4058 126 132 138 52 63 159 254 353 354 329 304 302 299 357 318 247 273 299 229 194 257 313 273 299 326 282 335 398 299 194 187 129 72 166 260 345 430 430 333
4039 333 268 301 370 277 123 66 91 115 159 203 241 280 266 156 191 323 312 300 301 205 161 117 148 180 243 306 283 259 238 119 175 230 186
4023 186 239 189 139 169 199 229 258 250 242 159 76 13 46 160 178 156 134 155 176 201 227 227 129 145 160 170 180 206 233 308 384 323 263 283 304 315
4005 315 327 338 349 345 340 348 258 160 158 238 220 212 300 302 206 180 153 147 237 253 268 241 214 130 45 171 297 262 227 193 158 202 246 291 335 336 337 283
3986 283 229 179 31 -32 100 217 238 179 121 161 201 95 -11 4 19 35 50 49 48 96 143 137 131 125 119 63 8 41 268 411 359 322 285 204
3969 204 220 291 167 192 217 149 82 97 113 178 242 236 231 176 122 106 90 155 220 299 379 282 88 -30 45 173 203 193 182 246 310 378 447 369
3951C69p7q1q2%%K5K5k4k3PQQQm8m8L3L3N1N1N9j36j84RQ6Q6Q0j15j21P3J5q2j6j6J25J25
3934B23M3M4l0l0p9p8O4O4j7j6M7M7r9r8kjjjj16j16R4R4L4L4L4L5J7J7l1l2jjq2q2J08J08
3916A94nnm7m7P5K69P6j17j09j09j41j41P0O9O8O7J9J9KKM5M5k1j17j03R1J89oj17j9j4j4
3900A68M1M1J1J2p0p0jjm9n0R0Q9k3k4rj0n8n8opM2M2l6l6J3J2%j%jrj0N1N2q7J07J56l9j07
3880A65j07l8l9N8N7RRL4L4Q3Q3l3l3l3l2l3l3l3l2M0M0qrm4m5m4m5O4O3K2K1m6N2J06q8n8
3862A07n9P5P4J6J5l4l3j13j13J%N6N6k5k4L2L2L2L2m4m4NNN7N8n5n6l8l8l8l8O4O5J14J13
3845B57j04j04j04j04O1O1O1O1r1r0N5N5n7n7N6N7NMNNj9j9K9K9N1N0o2o3J3J4K9o7n9J03
3827F1POm0m1M1M1PPPQQQPQk8k9N3N2O3O2J4J4j17j18l6l7l6l7P7P7k6k6k6k6QQQRM2M3oo
$$ plain form
3951 369 292 211 129 129 129 154 179 155 132 139 147 155 163 115 67 100 133 184 235 294 158 -26 -17 69 155 235 120 -1 72 87 5 -11 -27 98 223
3934 223 266 310 280 250 171 93 157 221 204 188 235 282 183 85 83 82 81 80 -36 -152 -58 36 70 104 138 173 190 207 176 144 143 142 60 -22 86 194
3916 194 189 184 137 90 165 434 510 393 284 175 34 -107 -37 32 100 167 186 205 207 209 254 299 278 161 58 149 338 332 215 196 182 168
3900 168 209 250 261 273 203 133 132 131 82 32 122 211 188 164 155 145 87 29 23 16 58 100 64 28 41 53 53 52 52 51 42 32 83 135 48 155 311 272 165
3880 165 58 20 -19 39 96 105 114 148 182 265 348 315 282 249 217 184 151 118 86 126 166 158 149 105 60 16 -29 35 98 120 141 95 147 253 165 107
3862 107 48 123 197 213 228 194 161 48 -65 -64 -64 -8 48 23 -1 31 63 95 127 83 39 44 49 106 164 109 53 15 -23 -61 -99 -35 30 144 257
3845 257 153 49 -55 -159 -98 -37 24 85 -6 -96 -41 14 -43 -100 -44 13 18 22 27 32 13 -6 23 52 103 153 91 28 41 55 84 17 -42 61
3827 61 68 74 34 -7 34 75 82 89 96 104 112 120 127 135 107 78 131 183 246 308 322 336 219 101 65 28 -8 -45 32 109 83 57 31 5 13 21 29 38 80 123 117 111
3806A11N8N7k3k3j7j7j7j7J3J4J3J4m4m4q3q2p1R1N4m2O4O5k3k2POn4M3J26K9M1M1o0o0o0
3789H8o0P0O9M3n4J3J3n4M3P4k2L2L2K1p5k1k1m2m2l6l6J5J12J01o1m5m4K7K6n0n0O3O3J6
3772B08J7n9n8p8J9J3J2n3n4Q5Q6N0m6j42K0J11m9mR4k3k3L1L2%%J3q5l0O6N5N4J2J1m2j38
3754A05K2J19N3N2l8j35k7k6q1J7K3p5KR8m3m3P6P5l7l8M9M8n9n9q4J3N0j12poJ0J07k2k2
3737EQ8j0KLmlj3j3j3j3J04J04rrp8p9O7O7p5p4OOO6O6m8m8n5n6Q0Q0N0j12NJ03j5j5j21j22
3718h3N1N0LKJ0J1l9l8j5j5o3o3J61J61j7j7l9m0P4P4m0m0m0m0J9J9R9J00n0m9kjK1K1K2K1
3700B28o4o4o3o4m1m0M0M1n4n4O0N9PON5N5llJ32J33M8j14j24L8P0r1q8P5O3l4n0m9n6n6K5
3682B3K5k6k6k6k6K9K9K9K8L4L4j4j5M0L9k6P2N1j10j3j3n0n0O3O2k9k8k9k9l2l2M9M9M2M2
$$ plain form
3806 111 169 226 203 180 163 146 129 112 125 139 152 166 122 78 -5 -87 -158 -67 -13 -55 9 74 51 29 36 42 -12 31 157 186 227 268 208 148 88
3789 88 28 98 167 210 156 169 182 128 171 245 223 255 287 308 233 212 191 149 107 71 35 50 162 263 202 157 113 140 166 116 66 129 192 208
3772 208 225 166 108 30 49 62 74 21 -33 52 138 188 142 0 20 131 82 78 172 149 126 157 189 189 189 202 117 87 153 208 262 274 285 243 105
3754 105 127 246 299 351 313 178 151 125 44 61 84 9 11 109 66 23 99 174 137 99 148 196 137 78 -6 7 57 -55 -62 -68 -58 49 27 5
3737 5 93 83 85 88 84 81 68 55 42 29 133 237 228 219 141 62 129 196 121 47 53 59 125 191 143 95 40 -16 64 144 194 82 87 190 175 160 39 -83
3718 -83 -32 18 21 23 33 44 5 -33 -48 -63 -126 -189 -28 133 116 99 60 20 94 168 128 88 48 8 27 46 145 245 195 146 144 143 164 185 207 228
3700 228 164 100 37 -27 -68 -108 -68 -27 -81 -135 -75 -16 -9 -3 52 107 104 101 233 366 414 300 176 214 284 193 105 180 243 209 159 110 54 -2 23
3682 23 48 22 -4 -30 -56 -27 2 31 59 93 127 113 98 138 177 151 223 274 164 151 138 88 38 101 163 134 106 77 48 16 -16 33 82 124 166
3665A66j03j03j7j6R7R7K7K6n4n4m8m8O5O5l1l1q0p9K8K7J09J08o1o1P8P8p0j67j8J76K4p3
3649E7opN9N8j38N6M8m9J8J7K4K3n7n7K3K3K4K3L9M0L9M0j00r9M5M6K2K2K1K2k5k6pj04j07
3631GQ7J07J0Q2Q3o9p0k9l0J9J8p7p7j1j07j24P0J01J01j8j7j8j7Q5Q6o0o0l3l3l3l3L5L5
3615A0j4j4J02J01p7p7n8n9Q8Q7k8k8K1K1K7K7k2k1O2O2J3J4M5M4LKr2MM8j15l4O4N3m4o2
3597A53o2j9k0LKn2M5K4K5%%o5j63n0M7M8M8O0O0j4Q3Q3j4k1k1k7k7KLK2J20L7o0%Jk5k5o2
3578A39L6rj06n2M6M4M4j18k0O9O8onj3j2J1J2L3L3k2k1jr7j22k4O8O9ooN3N2K8K9r5r4J15
3560A20J16l2l3l2l2l9l9l8l9J17J17k8k9l5l5N2N1o9K7Q3j5j01mQ1Q1L3L2m2m2j49n2PPQ2
3543A21Q1o4o4OOj30l2M8M8P5J71O0l7q5J1Rq7k1k1LJ00M6M5l7l6q6q5K6K5N0N0l5l6n1M5
$$ plain form
3665 166 63 -40 -57 -73 24 121 148 174 120 66 18 -30 35 100 69 38 -42 -121 -93 -66 43 151 90 29 107 185 115 -52 -70 106 130 57
3649 57 51 44 103 161 23 79 127 78 96 113 137 160 103 46 69 92 116 139 178 218 257 297 197 98 143 189 211 233 254 276 251 225 218 114 7
3631 7 94 201 211 293 376 307 237 208 178 197 215 138 61 50 -57 -181 -111 -10 91 73 56 38 21 106 192 132 72 39 6 -27 -60 -25 10
3615 10 -4 -18 84 185 108 31 -27 -86 2 89 61 33 54 75 102 129 107 86 148 210 223 237 282 326 329 331 239 243 291 176 142 206 259 215 153
3597 153 91 72 52 55 57 5 50 74 99 99 99 34 -129 -179 -132 -84 -36 24 84 70 153 236 222 201 180 153 126 128 131 153 273 310 250 250 251 226 201 139
3578 139 175 166 60 8 54 98 142 24 4 73 141 135 130 117 105 116 128 161 194 172 151 150 53 -69 -93 -25 44 38 32 85 137 165 194 99 5 120
3560 120 236 204 171 139 107 68 29 -9 -48 69 186 158 129 94 59 111 162 93 120 203 188 87 83 164 245 278 310 268 226 77 25 32 39 121
3543 121 202 138 74 80 86 -44 -76 -28 20 95 266 326 289 204 215 224 137 116 95 98 198 244 289 252 216 130 45 71 96 146 196 161 125 74 119
3525A19J03n8o4L3pojjj0j0r2r1J18J18O5l1j23k6N5m2k3P3O1O1m5m5O8O8pon6n5k0k1l2O5
3507A35J4q2l4O3Qq8KKm2N4M3M2J02On4n3K9L0j9j9L9L9m2m2n0n0kjK6K5k9k9J27L0LMl5l4
3488A18J07J1n2M6L9n7L8L8m9m9m3m2m3m3k8k7N3N4N4N4NOnnk9k9l4l5M7M7k7k7lkppn6n6
3469c8qrk9J33J50j2j4j4j06N5M4n4j4j5k0k1L9L8m2m2K4K4q9q9N7N7Q2Q1K3K4jjl9m0j5j5
3451A04j5j5j5j5l1l2J8J7P3P3K4K4L5L5m5m6o2o2Q4Q3MMN3N2j13j13O4O5q1q0%Jo2o1j3j2
3433f0K0K1K0K0jjQ7rj18M4O0O0k1k0LMl3l2M9M8N5N5POm2m3NOn7n7l3l2M6M6P0P1KLLKn5
3412A99n6K6K5jkM7M7p5p4n1n0J08J09N0m7mmq6q5k4P3J22K4m8m9l0l0m7m7r5r5R2R3J1J2
3395C8p7p8O3O2Q0j7l6l7n0M7qqJ7J7J03J03l2O4J5q1p7p7l5l4j9j8M0J38kkM7M7Qq9q2P9
$$ plain form
3525 119 222 164 100 133 126 120 119 118 108 98 6 -85 33 151 216 185 62 36 91 49 26 99 160 221 176 131 199 267 260 254 198 143 123 102 70 135
3507 135 149 67 33 96 104 16 18 20 -22 32 75 117 219 225 171 118 147 177 158 139 178 217 175 133 83 33 31 30 56 81 52 23 150 180 183 187 152 118
3488 118 225 236 184 230 269 212 250 288 239 190 147 105 62 19 -9 -36 17 71 125 179 184 190 185 180 151 122 88 53 100 147 120 93 90 88 81 74 18 -38
3469 -38 -46 -55 -84 49 199 187 173 159 53 108 152 98 84 69 49 28 67 105 63 21 45 69 -20 -109 -52 5 87 168 191 215 214 213 174 134 119 104
3451 104 89 74 59 44 13 -19 -1 16 89 162 186 210 245 280 235 189 127 65 149 232 236 240 293 345 232 119 183 248 167 87 87 88 26 -35 -48 -60
3433 -60 -40 -19 1 21 20 19 106 97 -21 23 83 143 122 102 105 109 76 44 93 141 196 251 258 264 222 179 184 190 133 76 43 11 57 103 173 244 246 249 252 254 199
3412 199 143 169 194 193 191 238 285 210 136 85 35 143 252 302 255 251 247 161 76 52 125 247 271 223 174 144 114 67 20 -75 -170 -78 15 26 38
3395 38 -39 -117 -54 8 88 71 35 -2 -52 -5 -13 -21 -4 13 116 219 187 251 266 185 108 31 -4 -38 -57 -75 -35 103 101 99 146 193 201 112 30 109
3377A09O5l2p1K7O9O9N4m2j20k4llKLm5m6J9K0O2O2L2o5r0QJ8J7lj00nnl5l5O0O0k6k7R8J
3358G8m7N0llJ9J16N6j07m0N8mmp8p9K1K1k7k7LLm5m5L6L6j3j3J1J1L1J29K8o9M0M1rqj4j5
3339A38k3j21L1J28j8P8P2q9p0o9M4M4j17M5O1O1Q5j1p1p0O0O0Jr5j6j6q2J4N2m6RJ07RRr8
3321I6r8N7N8N7N8J7J7P2k5m4m3j47m9NJ02J08J1K2K1j63j62P8P9o6o7k0k0K9K8N4N4O6l1
3304A54p3K4J8p8opj2j2ONM8M8Q3j4j37K4J47M9N5m2o0o0j8j8r0r1K2K2L5L4m6m7K5K4J2J09
3286A33R8Jj9j9k4k4k4k4M9M9O5l2o7R4M6n1J1q6m8J13N7N7m7m7j1j1nnjR7L0j96q8J0n9n9
3268c7RRQ9R0k6k7K2K2M1M2ppL4L3m7m7R2R3q5q5M8M9l3l3J3J2r0r1k4J38M6n0J8q0nR2j7
3250B01j7L7L8j1j0L8L8k6k5j17M5J29J28opj25j25m4m5p6p7R8J94J04j22m3N4k3k3o5R7k5
$$ plain form
3377 109 174 142 71 98 167 236 290 248 128 104 101 98 100 103 58 12 31 51 113 175 207 142 52 60 78 95 92 -8 -13 -18 -53 -88 -28 32 6 -21 77 78
3358 78 31 81 78 75 94 210 266 159 119 177 173 169 91 12 33 54 27 0 3 6 -39 -84 -48 -12 -25 -38 -27 -16 15 144 172 103 143 184 175 167 153 138
3339 138 115 -6 25 153 135 213 285 196 126 57 101 145 28 73 134 195 280 269 198 128 188 248 249 154 138 122 40 54 106 60 69 176 185 194 96
3321 96 -2 55 113 170 228 245 262 334 309 265 222 75 26 31 133 241 252 274 295 132 -30 48 127 61 -6 -26 -46 -17 11 65 119 185 154
3304 154 81 105 123 45 39 32 20 8 14 19 67 115 198 184 47 71 218 267 322 280 220 160 142 124 34 -57 -35 -13 22 56 10 -37 -12 12 24 133
3286 133 231 232 213 194 170 146 122 98 147 196 261 229 162 256 302 251 262 176 128 241 298 355 308 261 250 239 234 229 228 325 355 159 71 81 22 -37
3268 -37 -28 -19 70 160 134 107 129 151 192 234 227 220 254 287 240 193 285 378 293 208 256 305 272 239 252 264 174 83 59 197 243 193 211 131 126 218 201
3250 201 184 221 259 248 238 276 314 288 263 146 191 320 448 442 435 310 185 141 96 20 -57 41 235 339 217 174 228 205 182 117 214 189
3234A89j22Q8Q9l1l0l0l1k7k8K2K1K4K5k4k4P7P7l6l6o8o8M6M5m2m1L3L3L0o6O9O9J3J3J17
3217C76J9o7o7o7o8p4K3P8k0L9J35m8j46J6J5RRj5j6o4o4O2O3n1n1P6P6nnj8j7L0L1K7K8K8
3199B77K8J3J2O7k9l7l7j34K8M0L9r5r6K9K8p5K1l0l1Q9Q9L4L4n1j48l2O6l8l8j2Q5L0L0P2
3181B28P2M7n1m5m6j11j5O8k9q2q1L8L8k2P4P9j8j30j30L4J30P0P0J03Pp9p9m7M9J09J08l5
3165C24l6K0J9j26k9K3K4J14J8j06N6N3m5j15j7ooJ03Pj06j06L4L4O1O1q5q4MLLMK0J9p7Q4
3148A44J44M7m0m0K7o9j06N6M6M5N6N6M4M4p0o9KKm6m7j11j11KKNNN3N4L0L1O8O9M6j16p3
3130A80K3l0O7O1j00l0k9M1M2N1N1k9l0j31j31P9P9o2o3J8J9j4j4L5L5n4n5N9O0K8K9k0j9
3114A46l0l0N1N1P1P1j07j07K8K7P7P6n7n6n6n6L3L3m8m8J1J1J1J1lllmL4L3j02j03l2J29
$$ plain form
3234 189 67 155 244 213 183 153 122 95 67 89 110 134 159 135 111 188 265 229 193 125 57 103 148 106 65 98 131 161 95 164 233 246 259 376
3217 376 395 328 261 194 126 52 75 153 133 172 307 259 113 129 144 153 162 147 131 67 3 65 128 77 26 102 178 173 168 150 133 163 194 221 249 277
3199 277 305 318 330 397 368 331 294 160 188 228 267 172 76 105 133 58 79 49 18 107 196 230 264 213 65 33 99 61 23 11 96 126 156 228
3181 228 300 347 296 251 205 94 79 147 118 36 -45 -7 31 9 83 162 144 14 -116 -82 48 118 188 291 298 219 140 93 142 251 359 324
3165 324 288 308 327 201 172 195 219 333 351 245 301 354 309 194 177 171 165 268 275 169 63 97 131 192 253 168 84 88 91 94 98 118 137 60 144
3148 144 288 335 295 255 282 213 107 163 209 254 310 366 410 454 384 315 317 319 273 226 115 4 6 8 13 18 71 125 155 186 254 323 369 253 180
3130 180 203 173 240 301 201 171 142 183 225 276 327 298 268 137 6 85 164 102 39 57 76 62 48 83 118 64 9 68 128 156 185 165 146
3114 146 116 86 137 188 259 330 223 116 144 171 248 324 267 211 155 99 132 165 117 69 80 91 102 113 110 107 104 100 134 167 65 -38 -70 59
3097E9J29l2rqj9j8QRm0l9P0P1P1P1k5k5k6k5kkklk0k0N4N4m3j41o9R2J26K9j38m1N4N5n2
3078A53n2r1r1N5N5P4P4L4j28j68N8J20K4j8j7N7N7J3J3l6l6n2n2R3R4p7p6NML6L7j2j3l2
3061A05l2M8M8j7j8O3O3p1p0p1p0N8N8N9N8l9m0l0k9o5R7J10J2O0N9j14j14n7J05J60kj14
3045B10j6L2L2KKm7m7j5j5M9m8o1J01J06J0QRp8j76mJ58k0k0p8p9L4L5j2j2L7L6M5M5l7l6
3027A50RJ0N7N8o9o8j0Q7n2n3m6m6m0m0r5LJ39J40Q8j0q2q1L5J33K5K4M3n4j52n6O2O2ppq
3010A49pL1L1j8j7J7J8l8O0l8l8J21m0o2J64J12j15j07rKKk8k8N3N3n9n8p5K3J22m0RJ71N
2993C66r3K1K1r2r2O0N9q9QKJm0m1m0m1L6L6R7%j21k5J48N0l0k9P1P2J0q7q4P7J24l7j7j7
2975B84J0J0J1J0k6k6K8o8P3P3p5K3P0k7j02j02l0J32Q3p9n0n0m0N7J25K9k4k4L0L1j8j15
$$ plain form
3097 59 188 156 147 139 120 102 110 119 79 40 110 181 252 323 298 273 247 222 220 218 216 213 193 173 227 281 238 97 28 120 246 275 137 96 150 205 153
3078 153 101 10 -81 -26 29 103 177 211 83 -85 -27 93 117 99 82 139 196 209 222 186 150 98 46 139 233 156 80 85 89 125 162 150 137 105
3061 105 73 121 169 152 134 197 260 189 119 48 -22 36 94 153 211 172 132 102 73 8 105 215 227 287 346 232 118 61 166 326 324 210
3045 210 194 226 258 260 262 215 168 153 138 187 139 78 179 285 295 303 312 234 58 54 212 192 172 94 15 49 84 72 60 97 133 178 223 186 150
3027 150 159 169 226 284 215 147 137 224 172 119 73 27 -13 -53 -148 -145 -6 134 222 212 130 49 84 217 242 266 309 255 103 47 109 171 164 157 149
3010 149 142 173 204 186 169 186 204 166 226 188 150 271 231 169 333 445 330 223 214 216 218 190 162 215 268 209 151 76 99 221 181 190 361 366
2993 366 273 294 315 223 131 191 250 161 169 171 172 132 91 51 10 46 82 179 179 58 33 181 231 201 172 243 315 325 238 154 231 355 318 301 284
2975 284 294 304 315 325 299 273 301 233 306 379 304 327 397 370 268 166 136 268 351 272 222 172 132 189 314 343 319 295 325 356 338 223
2959B23j02O0J09n3p4K3m2m1P9P9kjM7M8l3j95j02nM3M4KLLLK8K8K8K8r1r1j1j0K7K8P0P0
2941B20J7p9k5k5J1J2J1J1K0J9L2o6r7%M7M6K4p4p4K3qrK4J21K4K4K3K4Qq9q3P9K7p0j7P9
2923B10L5o3p6p7j7Q0l0k9R5km4J17O5l2m8m9l8l8l9l8Q6Q6k7k7o1o0K0K1MMN3N3O7O7M7n0
2905B65j47n0L5L5NNm4m4M1M2m0m0LLN1N1N1N1r4r5M5M4l7l6j5j6j5j5j7j6%R7J10n1o8o8
2887B6J3J3O2O2l8l7M3M4P1P1m1m2k6k6k5k6j8j8j8j8j9j9O2O1KKKJM4M3R6o6j65kLMJ0q8
2868D3m3J19P1P1o4o4J01J01N7j04j75j2N4m3k7k8l4l3Q5Q6NNL1L0n6n7K9o7n6J06K6K7L6
2851B20L6k5k5p3p4O5O5j6j6L2L3j7j6J9K0J9J9K4K3q9r0jkn0n0Q7Q8L8L9N5N4n8n8M0M1q
2833C49qk1k1l9N8O2j32j25O8P2P3MLl8l8l7l8L7L6L7L7j41j41r2r3J9J9J8J9Q8Q9M0L9k3
$$ plain form
2959 223 121 181 290 237 163 186 144 103 182 261 259 258 305 353 320 125 23 18 61 105 107 110 113 116 144 172 200 228 137 46 35 25 52 80 150 220
2941 220 237 158 133 108 119 131 142 153 173 192 224 158 61 61 108 154 178 104 30 53 45 36 60 181 205 229 252 276 284 195 112 191 218 148 131 210
2923 210 245 182 106 29 12 92 62 33 128 126 82 199 264 232 184 135 97 59 20 -18 68 154 127 100 39 -21 -1 20 24 28 81 134 201 268 315 265
2905 265 118 68 103 138 143 148 104 60 101 143 103 63 66 69 120 171 222 273 179 84 129 173 136 100 85 69 54 39 22 6 6 103 213 162 94 26
2887 26 39 52 114 176 138 101 144 188 259 330 289 247 221 195 170 144 126 108 90 72 53 34 96 157 159 161 163 164 208 251 347 281 116 114 117 121 131 43
2868 43 0 119 190 261 197 133 234 335 392 288 113 101 155 112 85 57 23 -10 75 161 166 171 202 232 176 119 148 81 25 131 157 184 220
2851 220 256 231 206 133 59 124 189 173 157 189 222 205 189 208 228 247 266 290 313 224 134 133 131 81 31 118 206 244 283 338 392 334 276 316 357 349
2833 349 341 320 299 260 318 380 248 123 191 263 336 340 343 305 267 230 192 229 265 302 339 198 57 -35 -128 -109 -90 -72 -53 35 124 164 203 180
2816A80k2o0n9o9J24J31o3PJ05j1j1k5k5k6k5L9M0L9L9j08j08NNL9M0m2m1L8L9L8L9J6J6J31
2799D15o2j05qk8O8M2j53P6P6n2n2mml5l5P8P8k3k4k4k3kjkjJ3J3O2O2ooP5P5q6q6nnn3n3
2779A95n2n3j1j2P0O9M7M7M7M8p3p2k3k4%jq1q1j4j5O7O6J6J6J6J6m7m6m7m7j7j8R6R6L7L7
2761B52K7K7M6j15q0J8%%OOL6L7j3j2OOm7J15J06n6o3L3pj04j35K8N0N1k0k0r6r5N0N1J21
2744B09J21j22j21N7N8n5n5J8J9J8J8P1P0K2K1l2l3M8M8k4k4k4k4m1m1JJJ8q0l5J27MMJ4J5
2726B71n0n0L0L1o5o5J5J6J64J64j10j11MNm4m4N8N8RJ0K1K2J1J2O5r7j03N9Lr4k9k9j3j4
2709A10L6L5QQQQLKLLl7l7l6l7L0L0j9j9J3J2l6l6jjP9Q0K5K5k4k3O6O6j44j44K7K6k1k2J0
2690G6J1J0J1J3J2J3J2n0n0M2M3p5J20J25o8l9N8n7n7L2L1L2L2k9l0K0J9R5R5j15j16K7K7
$$ plain form
2816 180 158 98 39 -30 94 225 162 169 274 263 252 227 202 176 151 190 230 269 308 200 92 97 102 141 181 139 98 136 175 213 252 268 284 415
2799 415 353 248 240 212 280 322 169 245 321 269 217 213 209 174 139 217 295 272 248 224 201 199 198 196 195 208 221 283 345 339 333 408 483 397 311 306 301 248 195
2779 195 143 90 79 67 137 206 253 300 347 395 322 250 227 203 203 202 121 40 26 11 78 144 160 176 192 208 161 115 68 21 4 -14 82 178 215 252
2761 252 279 306 352 237 157 175 175 175 181 187 223 260 247 235 241 247 200 315 421 365 302 335 328 224 89 117 167 218 198 178 82 -13 37 88 209
2744 209 330 208 87 144 202 147 92 110 129 147 165 236 306 328 349 317 284 332 380 356 332 308 284 243 202 203 204 222 142 107 234 238 242 256 271
2726 271 221 171 201 232 167 102 117 133 297 461 351 240 244 249 205 161 219 277 286 296 317 339 350 362 427 330 227 286 289 195 166 137 124 110
2709 110 146 181 189 197 205 213 216 218 221 224 187 150 114 77 107 137 118 99 112 124 88 52 51 50 129 209 234 259 235 212 278 344 200 56 83 109 88 66 76
2690 76 87 97 108 121 133 146 158 108 58 100 143 68 188 313 245 206 264 207 150 182 213 245 277 248 218 238 257 352 447 332 216 243 270
2673B70k1k2N2N1LKo8o8j9k0k9l0l0k9M3M4M3M3k0k0K8K8M3M2M3M2n2n1llL9M0j06j06j1j1
2655A37L8L7n6n6R0Q9n0n1n1n1j04j03J39J39K6K6K6K6m0m0RQM6M6kko1o0j6J46O5r7r9kQ2
2637B34Q1n2n2j43m6J03J04J1q5l7O0llRq7r3r2J11K74O2l5m1m1m9J13J18m3j55n9K3K3O5
2621B75O5J17m4j29L3M5M4MLp8p7J7J8l8l7P6k2m8m7onM3M3p4p4PPO7O7m5m6O6O6j5j5J5J5
2603B93l3l3m2m2R8R7M7n0p7p6k7k7K2K2J01J02M3M3Pj54j91L6Q2Q1n0n0p8p8LJ64K4p3KK
2586A88o2R9Q4Q3N9l9j20k2o4o4J3J3J11n1n0J11P2P3KJl7l8J1J1m4m5NMm4m4L8L7nmK0K0
2568C22M1M0j04j05L1L0R6kq8P4L2o6k4k3N9l8n2J09K3j39k4k4j32L1L5o3KLQ2Q3l0l0j4j4
2551A21O7O8pol1l0L2L3j6j6M8M8j%n2n1k8k7qqJ05J05n3n3nmJ0J1J1J0l8l9RJ0Q0Q1jjl5
$$ plain form
2673 270 249 227 279 330 333 335 267 199 180 160 131 101 71 42 85 129 172 215 195 175 203 231 274 316 359 401 349 298 295 292 331 371 265 159 148 137
2655 137 175 212 156 100 190 279 229 178 127 76 -28 -131 8 147 173 199 225 251 211 171 180 188 234 280 278 276 215 155 139 285 350 253 154 152 234
2637 234 315 263 211 68 22 125 229 240 155 118 178 175 172 181 94 1 -91 20 294 356 321 280 239 190 303 421 378 223 164 187 210 275
2621 275 340 457 413 284 317 362 406 410 413 335 258 275 293 255 218 294 272 224 177 171 166 209 252 178 104 111 118 185 252 207 161 227 293 278 263 278 293
2603 293 260 227 185 143 241 338 385 335 258 182 155 128 150 172 273 375 418 461 468 314 123 159 241 322 272 222 144 66 69 233 257 184 186 188
2586 188 126 225 309 392 451 412 292 270 206 142 155 168 279 228 178 289 361 434 436 437 400 362 373 384 340 295 300 304 260 216 254 291 286 282 302 322
2568 322 363 403 299 194 225 255 351 349 261 335 367 301 277 254 313 275 223 332 355 216 192 168 36 67 102 39 41 44 126 209 179 149 135 121
2551 121 188 256 249 243 212 182 214 247 231 215 263 311 310 310 258 207 179 152 144 136 241 346 293 240 235 231 241 252 263 273 235 196 205 215 295 376 375 374 339
2531C39l5M6M6o8o8M5M5m3m2OOk4k4m9m9j4j3O7O7J0J0p0p1K9K9j9k0qpJ6J6Q5Q5j9j8j50
2513A36J3J22K4k7k7j6Q0N0j12o9K7L7L7o4o5q4J2R4mmmJ4J5o6o6l9N7P3P3J15J8j09j2RQ
2495B46n8n7q8RM5M4K4p4l0l0J2J3lkJ33L7k4k4j09j2Q3Q3L0o7R9R9k7k7J5q2kR6L1L1m4m3
2477C27q6q5l1l1l1O6O0O0P3P3j05j05l6l7o7L0P6P6l0l1P6P7N7m1p2K4OOJ7q0m4m4k2P5k9
2460A72k8o0n9K8K8m0N7J12J5j03pP3P2L5o2kkp1K5K6p2L4L5K8K8jkN4m4J3J2l6l6p0K6J08
2442B86J0rj0j6j5O6O6J8J7n1n1L0L0k3k3p1p1N4N5OOQQr5Kl3l3M8M8K0p7j14M8K8K8L2L2
2423B54L9n8M5M5l4l3l4l4N2N3rQ9M9m7m2N6l3l4k7k7l1l0L5o3p7Q5R7%m2N5N1j76j01O1L1
2406A65L0M9m8j01j01K8J25K1K2L3L4L3L4l7l6J3J2o3o2m7N1J03n8j94r7J10J10O2O1lj01
$$ plain form
2531 339 304 350 396 328 260 305 350 307 265 271 277 253 229 180 131 117 104 171 238 248 258 188 117 146 175 156 136 128 121 137 153 238 323 304 286 136
2513 136 149 271 295 268 241 225 305 355 243 174 201 238 275 211 146 62 74 168 164 160 156 170 185 119 53 14 71 144 217 332 350 241 229 238 246
2495 246 188 131 43 52 97 141 165 91 61 31 43 56 53 51 184 221 197 173 64 52 135 218 248 181 280 379 352 325 340 258 256 352 383 414 370 327
2477 327 241 156 125 94 63 129 189 249 322 395 290 185 149 112 45 75 151 227 197 166 242 319 376 335 263 287 293 299 316 236 192 148 126 201 172
2460 172 144 84 25 53 81 41 98 210 225 122 115 188 260 295 233 231 229 158 183 209 137 171 206 234 262 261 259 313 269 282 294 258 222 152 178 286
2442 286 296 287 277 261 246 312 378 396 413 362 311 341 371 348 325 254 183 237 292 298 304 312 320 225 227 194 161 209 257 277 200 86 134 162 190 222 254
2423 254 293 235 280 325 291 258 224 190 242 295 286 375 424 377 335 391 358 324 297 270 239 209 244 181 104 189 286 286 244 299 350 174 73 134 165
2406 165 195 244 196 95 -6 22 147 168 190 223 257 290 324 287 251 264 276 213 151 104 155 258 200 6 -91 19 129 191 252 249 148
2390A48LLl2l2J03J04O6r6n9L7l2l2N4N5m8m7O5O6N4N4j56j56LMQ4Q5m6m5KLj5j5O5O6Q1Q0
2372D74L3L2q9q9j38j37J11J11kkr7r7m8m9K3K3J04J03m6m6L5L5l7l8k5J36P8q5l1l2n3n4
2356A03K7J24J26l5n2n2j12j13J30J31j3j2r3r4R1R1R0R1r8r8J5J4o1o1K0K0R3R2q5J2J36
2340D27k6j06j07m0l9QRR6R6n0n0l6l5M5M5k3k4p2R0Q6j2k7k8K1K2k7k8L5L4j4j4L6L6L6L6
2323D00r0r0Q7Q8l1l1p9p9MLN2N2l7l7J1J1J6J5l3l4q9q9L1J92L1L1p2p1J8J7J8J8n3n2O0
2305A88O0J7J6J6J6k4k4k4k4o4o3J8J7R0R1n6n5J8J8J8J8l3l2l3l3mnM3M4k8k8k8k8N3N3N3
2287B61N3r8r9j7j8P0P1j1j0mlJ86R0j7j78j77j7K7J25J04j23j38K4Q6j0L6L5L0L0k0k0k1
2271B47k0K4K3K3K4m4m4O9O9n8n8rj0mnnmN3N3R1R2O1j00n8n7r9j00M7M6K0J9J9K0O2O3q3
$$ plain form
2390 148 151 154 122 90 193 297 363 267 208 245 213 181 235 290 242 195 260 326 380 434 278 122 125 129 213 298 252 207 209 212 197 182 247 313 394 474
2372 474 507 539 450 361 223 86 197 308 306 304 207 110 62 13 36 59 163 266 220 174 209 244 207 169 144 280 358 273 242 210 157 103
2356 103 130 254 380 345 293 241 129 16 146 277 264 252 159 65 156 247 337 428 330 232 247 261 200 139 159 179 272 364 279 291 427
2340 427 401 295 188 148 109 117 126 222 318 268 218 182 147 192 237 214 190 118 208 294 282 255 227 248 270 243 215 250 284 270 256 292 328 364 400
2323 400 310 220 307 395 364 333 254 175 179 182 234 286 249 212 223 234 250 265 232 198 109 20 51 243 274 305 233 162 180 197 215 233 180 128 188
2305 188 248 265 281 297 313 289 265 241 217 153 90 108 125 215 306 250 195 213 231 249 267 234 202 169 136 132 127 170 214 186 158 130 102 155 208 261
2287 261 314 216 117 100 82 152 223 212 202 198 195 381 471 454 276 99 82 109 234 338 215 77 101 187 177 213 248 278 308 288 268 247
2271 247 227 251 274 297 321 277 233 302 371 313 255 246 236 232 227 222 218 271 324 415 507 568 468 410 353 254 154 201 247 267 286 305 325 387 450 367
2253C67q2N5N6PQj1j1j1j1K7K8K7K8l4l5l4l4n6n7N7N6L6L5m5m6j0j0n9n9J8J9o3o3L5L5j4
2235A49j4J4J3J4J4k5k5N6N6J7J8R8R8k6k6R0j05j50n4opM3M4l7l8O8O8j3j3p7p7L6L6K3K2
2217B84K3K3k0k0K8K8m9n0L2L1L7L7m3m4L8L8L2L2L4o3k05j1K1p6L8L9K7K6k2k2J1J1j10Q4
2200B19J98Lj30O5PQo0j56o2J33P7j9k2P4O9k8l9l8m5m5K8K7K1K1N5m2o3o2n9L9L2J30Q3p9
2183C40J8J9j33j34K3J19L3L3R4mo1o1j8j9j2j2K7K6J30l2j46J7J01J01l3l4N3N3r3r3P6P5
2167D53p0p0KLKLqrqqN7N7P0k8r6Jo0o0KJN7N6q6J2R6R6J3q5q5J3r4r3J23J23k4k4N7N8l9
2148D08l8q8q7NNN8J54L7o0%JPOJ%j2j08k8O9k3k3L7n9MNo2L4M3n4N5N5n0m9LJ00O1l5n6n6
2128B60l6l7M5M4n5n5ooJ12J12l3l4L5L6j4j3j11j11L4L5k0k1K9K8K0K0k8k9OON5N4K8K8n3
$$ plain form
2253 367 285 340 396 403 411 400 389 378 367 394 422 449 477 443 408 374 340 284 227 284 340 376 411 366 320 310 300 241 182 200 219 156 93 128 163 149
2235 149 135 149 162 176 190 165 140 196 252 269 287 385 483 457 431 521 416 266 212 206 199 242 286 249 211 279 347 334 321 244 167 203 239 262 284
2217 284 307 330 310 290 318 346 297 247 279 310 347 384 341 297 335 373 405 437 471 408 203 192 213 137 175 214 241 267 245 223 234 245 135 219
2200 219 417 420 290 355 362 370 310 154 92 225 302 283 261 335 404 376 337 299 254 209 237 264 285 306 361 319 256 194 135 174 206 336 419 340
2183 340 358 377 244 110 133 252 285 318 412 408 347 286 268 249 237 225 252 278 408 376 230 247 348 449 416 382 435 488 395 302 378 453
2167 453 383 313 315 318 320 323 315 306 298 290 347 404 474 446 350 351 291 231 233 234 291 347 261 273 369 465 478 393 308 321 227 134 257 380 356 332 389 447 408
2148 408 370 282 195 200 205 263 417 454 394 394 395 402 408 409 409 397 289 261 330 307 284 321 262 266 271 209 243 286 232 287 342 292 243 246 346 407 372 316 260
2128 260 224 187 232 276 221 166 160 154 266 378 345 311 346 382 368 355 244 133 167 202 182 161 190 218 238 258 230 201 207 213 268 322 350 378 325
2110C25n3o9o8M5M5M8M9M8M8NNN3N3p9q0j22j21k3P4J65Lp4K2OOM3M3p1p1J08J07l8l9j6j6
2093C61j6j6n5n6n6n5m2m1L9L9M0L9M8K09M8j79n8J05P9j9j03N9P8q4o3o4j7j7j7j7P1P1j0
2076C01j0N9O0k1k1O8O8j10j10N9N9n4n3PQp9p9Q7j0n2J10Pq9n9n9pK20J39q8l8l8K3K3L1
2059C52o5o6L2M3M4N0M9L4L4J4q3q5J2m9m9L7L7p0p0m3N5P4P4P6k1j66p0lkLLL9L9k2P5K1
2041C33p7O6O5jjM1M1L8o0n4n3r0q9KR9O9P0Q1j5kkj3j4k1j18p5K1M5n2LR9p8p9M1M1r2r1
2023G8Q6Q6opn5n5O5O4J7J6n6n7Q9Q9L2L1k3k3M5n1N1N2m4m5o4R7J15m7j18j18j7Q0K5K6l7
2005C21l6m6m7N9j03j39Q7N5N5K0K0n5n4K6K6L7L7L7L7n1n2lmj4j4L4L4k4k4K5K4K5K4K5K4
1987C66k2k3k2k3l6l7P7P6o4o5Q1Q1K6K6k8k9J00Lj65L0k9k8j6j7RRm0m0m7m7R9R8l8l8P5
$$ plain form
2110 325 272 203 135 180 225 273 322 370 418 423 428 481 534 455 375 253 132 109 183 348 351 277 299 305 311 354 397 326 255 363 470 432 393 377 361
2093 361 345 329 274 218 162 107 65 24 63 102 142 181 229 438 486 307 249 354 433 414 311 370 448 364 301 237 220 203 186 169 240 311 301
2076 301 291 350 410 389 368 436 504 394 284 343 402 348 295 302 310 231 152 239 229 177 287 294 205 146 87 80 300 439 351 313 275 298 321 352
2059 352 287 221 253 296 340 390 439 473 507 521 438 353 365 316 267 304 341 271 201 158 213 287 361 437 416 250 180 177 175 178 181 220 259 237 312 333
2041 333 256 322 387 386 385 426 467 505 445 391 338 248 159 161 260 329 399 480 465 463 461 448 434 413 295 220 241 286 234 237 336 258 179 220 261 169 78
2023 78 164 250 244 237 182 127 192 256 273 289 233 176 265 354 386 417 394 371 416 365 416 468 424 379 315 412 527 480 362 244 227 307 332 358 321
2005 321 285 239 192 251 148 9 96 151 206 226 246 191 137 163 189 226 263 300 337 286 234 231 227 213 199 233 267 243 219 244 268 293 317 342 366
1987 366 344 321 299 276 240 203 280 356 292 227 308 389 415 441 413 384 484 487 322 352 323 295 279 262 271 280 240 200 153 106 205 303 265 227 302
1970C02P4q2q3O2O3l0l0J9J9j4j4O7O7L5L4j11j12j8j8O2O3L7L7j10j3Q6j07QQM8M8l3l3J0
1953C41RJ0J0J7J7l1l1M8M8o6o5L4L4L5L4n5n4n5n4l4l3Q0P9M4M3M4M3r7r7m9m8J06J06j04
1936C09j04ooJ08J07K1K2r2r2K1K1K1K1K1K1K1K1r8r9J5J5J9J9J8J9K8K7n3n4j8j8L1L0K9
1919C45L0J3j49kR6L0L0k1k2l7N9K7j34k2J41j5j11j08j1J45M9l7l7%%j%L9M0Q7Q8q8q7l9
1902B98l9M9N0mnK3p3j64lO7l0k0P7O3O3m4m4nnnmNNNNJ7J8J7J7j3j3j3j4j9j9K9K9nmn4n3
1881A85K8K9k0k0K2K2K3K2qqp3K5J65Mj41K0Q0j7M8M7l0k9l0l0NMP2k6r1J04M3n4rqj5j4k8
1862B97k8K0K1l5l4l4l4J13J12O4O4j43j43L4L5L5L6l8J57M8j45j2j3j19P5K6j68j2j2R1o
1847B52o7J28J21p2P5P5n0n1m8m8m8m8P0P1j1j1n6n7N6N7k7k8K1K2l1l1l0l1K0K0K0K0k6k5
$$ plain form
1970 302 376 294 211 273 336 306 276 295 314 300 286 353 420 455 489 378 266 248 230 292 355 392 429 319 306 392 285 293 301 349 397 364 331 341
1953 341 350 360 370 387 404 373 342 390 438 372 307 341 375 410 444 389 335 280 226 192 159 239 318 362 405 449 492 395 298 249 201 307 413 309
1936 309 205 199 193 301 408 429 451 359 267 288 309 330 351 372 393 414 435 337 238 253 268 287 306 324 343 371 398 345 291 273 255 286 316 345
1919 345 375 388 239 237 333 363 393 372 350 313 372 399 265 243 384 369 258 150 139 284 333 296 259 259 259 258 258 297 337 424 512 424 337 298
1902 298 259 308 358 354 349 372 299 135 132 199 169 149 226 289 352 308 264 259 254 249 245 250 255 260 265 282 300 317 334 321 308 295 281 262 243 272 301 296 292 238 185
1881 185 213 242 222 202 224 246 269 291 283 275 202 227 392 396 255 275 355 338 386 433 403 374 344 314 319 323 395 369 278 382 425 371 362 354 339 325 297
1862 297 269 289 310 275 241 207 173 286 398 462 526 383 240 274 309 344 380 342 499 547 402 390 377 258 333 359 191 179 167 258 252
1847 252 185 313 434 362 437 512 462 411 363 315 267 219 289 360 349 338 282 225 281 338 311 283 304 326 295 264 234 203 223 243 263 283 257 232
1830B32Q8Q8n1n0L0L0K2K2n8n9kkM6M7j23j22K3K4J3J3O2O1J11J11l5l5o8o9J3J3j4j3j3j3
1813C22j2j1j1j1O1O1OPJ3q3r0J04L8L8JJm6m7m6m6Q6Q7j16P9R7r8n7n6QRQRm2m2L8L9mmn
1793B85mqpP4P3J8J8l0l1l3l2J6J6KKQ3Q3m4m5r3r3J19J18NOr0r0rrO4O4j7j7rrq1J12J24
1774E31o9LLo4o5J7J6j2j2j2j2K2K3K2K3q2q1j%J4J3J4J4k5k4K4K4N4N4r1r1K9K8K9K8J2J1
1755C67O0O0o3o3N1N0J6J6o4o5o2o3J9J8M1M1m0m0J1J2O0O0nnm7m7m3N3J1q6j0Q7L2o4J2J3
1737C23P2k6q4P8P7q4p2K6RRM5M4o8o9M6M6o8o7j0j0J1J07M5n3QQM8M9j03j03N2m5q7P4J24
1720C52K7n4n3O1O1j4j3j33l6N5N5K1K0r2r3K2K1P6k1l0l0K3J20nnN6m1mmj1j0qqq9r0N8N8
1701B42J5J5m1N6JJL3L4L3L3k8k8l8l9J00o3j06j0P2P2n7L9O7O7m1m1K4K5Lr3o9K7P0P0P2
$$ plain form
1830 232 320 408 357 307 337 367 389 411 353 294 292 290 336 383 260 138 161 185 198 211 273 334 445 556 521 486 418 349 362 375 361 348 335 322
1813 322 310 299 288 277 338 399 405 412 425 342 252 356 394 432 433 434 388 341 295 249 335 422 306 385 482 384 327 271 279 288 296 305 263 221 259 298 294 290 285
1793 285 281 273 266 340 413 431 449 419 388 355 323 339 355 357 359 442 525 481 436 343 250 369 487 492 498 408 318 309 300 364 428 411 394 385 376 295 407 531
1774 531 462 465 468 404 339 356 372 360 348 336 324 346 369 391 414 332 251 250 250 264 277 291 305 280 256 280 304 358 412 321 230 259 287 316 344 356 367
1755 367 427 487 424 361 412 462 478 494 430 365 303 240 259 277 318 359 319 279 290 302 362 422 417 412 365 318 275 328 339 253 243 330 362 298 310 323
1737 323 395 369 285 363 440 356 284 310 319 328 373 417 349 280 326 372 304 237 227 217 228 335 380 327 335 343 391 440 337 234 286 241 154 228 352
1720 352 379 325 272 333 394 380 367 234 198 253 308 329 349 257 164 186 207 283 262 232 202 225 345 340 335 391 350 346 342 331 321 313 305 216 126 184 242
1701 242 257 272 231 287 288 289 322 356 389 422 394 366 328 289 389 326 220 210 282 354 297 336 403 470 429 388 412 437 440 347 278 305 375 445 517
1684E17q9j02n%JJ8p9j3Q3J6J7R1oj2Q6r7j94o8R3J11J5j8j9L6L5jr7q0J8O6l0K4J22lj65
1666B71j57o0J02J02J02J02Jr6p0K7J18K1n0n0j10j4L3L3M0L9N9N9m3m4k7j24l3O4Rq8P0P0
1650C56o2o2R4R3K7p0k8O9N4m4q6J1L8L8n2j50J3J74R4mj17M4J41k1p8J8m7m7j21j21R8R9
1634C51K5p3p3K4J05J05J4J4k1k0k0k1k3k3L1L1j5Q1Lk23j26L6J52J51K5p3j2j2k8O9J5J4
1618D83o9p0k7P0M6M5N6j06p0R2M5n2m7m7J09J09OOm8m8j1j08j1Q6M3M3m9m8l6l6J3J2k9k9
1601C23J9J9PPPPKJKKm1m1N7N6m1m2m1m1K6K5p2p1k5k5J8J14P1P0K7K8n5n6o1L5J0RK7o9k4
1581B64P3J8p9M6M6p0K8J18K2k1k1L9n7rQ8j8j9m9j46mR3J6J12P4q9r3P0J83K2j00lL7o0n4
1564D57M3o8o8o3o2M3M3j2Q6j3j2M8m9j2j2o0J01J4J3p3p3K9L0L0L0JJQ7Q8k7j88p5Q7N5N5
$$ plain form
1684 517 428 326 321 321 322 340 261 248 331 347 364 455 449 437 523 426 232 164 257 368 383 365 346 382 417 416 319 239 257 323 293 317 439 436 271
1666 271 114 54 156 258 360 462 463 367 297 324 442 463 413 363 253 239 272 305 345 384 443 502 459 415 388 264 231 295 304 216 286 356
1650 356 294 232 326 419 446 376 348 417 471 427 341 352 390 428 376 226 239 413 507 503 386 430 571 550 472 490 443 396 275 154 252 351
1634 351 376 303 230 254 359 464 478 492 471 451 431 410 387 364 395 426 411 492 495 272 146 182 334 485 510 437 425 413 385 454 469 483
1618 483 414 344 317 387 433 478 534 428 358 450 495 443 396 349 458 567 573 579 531 483 472 364 353 439 482 525 476 428 392 356 369 381 352 323
1601 323 342 361 368 375 382 389 391 392 394 396 355 314 371 427 386 344 303 262 288 313 241 170 145 120 138 252 323 393 420 448 393 337 276 311 321 330 357 288 264
1581 264 337 355 276 322 368 298 326 444 466 445 424 463 406 397 485 467 448 399 253 249 342 358 470 544 455 362 432 615 637 537 534 571 511 457
1564 457 500 432 364 301 239 282 325 313 399 386 374 422 373 361 349 289 390 404 417 344 271 300 330 360 390 391 392 479 567 540 352 277 364 419 474
1547D74j5j6mmP1P1j7j15j62o6K0K0K7K6M4M5L8L9P8j8q3q3K6p1p7J9J54N6q9PM0n7n7M0J34
1529D95L7J7J6p7p8q9PJ04OJ8J9n0n1L1L1l4l4p7p6j6Q1P5P5K2K3k7j23m9J14K2p5J0RkR4
1512D48k7k7J58J57m6m6j26j27L1L1j7j7K1K1k8k7m3m3OOM4M3R9Jm9m8ool1l2L9M0O5r6m4
1494C24m4j17M5J26J26M9m8p4p5m1m1M3J41N4m3J7J8L7L7L7L7j24j24K1K1ppP4P3POp5p5r
1477C89j0j0rN4N4NOj11j11l1l0N4N5k6k7J03J03K3K2N8N9k2k2j8j8r9r8k4k4K5K5J8J7l0
1460C50j28m4J18P5k1n0m9N7N8J7J8J7J7RRp2p1P3P4m0l9J0J1J0J1M0M0m1m1m9m8%%k6k5N6
1442C26N5J7J6J1J0O9k8o4R7M5M5k2j84r8O4M4M4K3K2n8n8J3J3R3R4J6J7l3l2n2n2m7m6m3
1425C17N4R6o5l4O3j1j2J08n3j41j40M7M8R6R6k2k2k2k3m7m7L3L3K6K5k3k3l2l1N0M9n3n4
$$ plain form
1547 474 459 443 439 435 506 577 560 445 283 217 237 257 284 310 354 399 437 476 554 536 453 370 396 325 248 267 421 477 388 395 435 378 321 361 495
1529 495 532 549 565 488 410 321 328 432 438 456 475 425 374 405 436 402 368 291 215 199 280 355 430 452 475 448 325 276 390 412 337 347 356 354 448
1512 448 421 394 552 709 663 617 491 364 395 426 409 392 413 434 406 379 336 293 299 305 349 392 491 492 443 395 389 383 352 320 359 399 464 368 324
1494 324 280 163 208 334 460 509 461 387 312 271 230 273 414 468 425 442 460 497 534 571 608 484 360 381 402 395 388 462 535 542 548 473 398 389
1477 389 379 369 360 414 468 473 479 368 257 226 196 250 305 279 252 355 458 481 503 561 620 598 576 558 540 441 343 319 295 320 345 363 380 350
1460 350 222 178 296 371 350 300 251 308 366 383 401 418 435 444 453 381 310 383 457 417 378 388 399 409 420 460 500 459 418 369 321 321 321 295 270 326
1442 326 381 398 414 425 435 504 476 412 509 554 599 577 393 295 359 403 447 470 492 434 376 389 402 495 589 605 622 589 557 505 453 406 360 317
1425 317 371 467 402 368 431 420 408 516 463 322 182 229 277 373 469 447 425 403 380 333 286 319 352 378 403 380 357 325 294 344 393 340 286
1408B86K1K1Or1j28L4J36J36O6r7m2N4R9Jr1PooL3L4m7m8rrj0rl5l4l5l4L4L4L5L4K9L0K9
1390D28L0k3k3j03j03kjJ12J12o3o2j4j4k9k9Q4Q4J8J8J8J8J8J8J8J9ppj21j20P4P4ppk1k2
1372C65k1k2O1O0J2J2p9p9L5L4k3k3k4k3mmJ31J31Q3p9j23k6llLLM3M2l2l2j45m9P5P5M0M0
1354D51qqq8q9LR9lmLKK8K8K8K8j2j2L1L1N4m3m3N4RQJ5J5m9m8Or1MLllQQp8p9O1l7l6O1N3
1332C57N3J1J1l9l9l9l8K8K8K2K2O3l5m0N6M9m7J3J3L9L9m2m1Q8Q9j22j22J3J2m2N6N9N9L9
1315E73n8K0K0q9Po6o6J22m0j00O2l9l9J27J27N0j11m0J22r3r2n3n2L8J35j0j0q5q5k4k4m4
1299A83J18J11n2mR2K3K2l0j27K8K9K2K2N9N9M6j15q4P6M1n6l4J27L1o6J7p9j93r6l1O6R9
1283C04R8n2n3O1O1n8n9n8n8P8P8K9L0k5k6p4p3K8K8K8K9jjP9Q0p7p6L6L6M4M4p0o9jjQ0Q0
$$ plain form
1408 286 307 328 334 243 115 149 285 421 487 390 348 402 501 502 411 418 412 406 439 473 426 378 369 360 350 341 306 272 237 203 237 271 306 340 369 399 428
1390 428 458 435 412 309 206 204 203 315 427 364 302 288 274 245 216 300 384 402 420 438 456 474 492 510 529 522 515 394 274 348 422 415 408 387 365
1372 365 344 322 383 443 455 467 388 309 344 378 355 332 308 285 281 277 408 539 622 543 420 394 391 388 391 394 437 479 447 415 270 221 296 371 411 451
1354 451 443 435 347 258 261 360 357 353 356 358 386 414 442 470 458 446 477 508 562 519 476 530 539 547 562 577 528 480 486 395 399 402 399 396 404 412 334 255 316 279 243 304 357
1332 357 410 421 432 393 354 315 277 305 333 355 377 440 405 365 421 470 423 436 449 488 527 485 444 532 621 499 377 390 402 360 416 475 534 573
1315 573 515 535 555 466 473 407 341 463 423 323 385 346 307 434 561 611 500 460 582 489 397 344 292 330 465 455 445 360 275 251 227 183
1299 183 301 412 360 356 448 471 493 463 336 364 393 415 437 496 555 601 486 402 478 519 463 429 556 587 521 538 459 266 170 139 205 304
1283 304 402 350 297 358 419 361 302 244 186 264 342 371 401 376 350 276 203 231 259 287 316 315 314 393 473 396 320 356 392 436 480 410 341 340 339 419 499
1265D99n3n2nmk2k1k2k1m1m1M0M0k6k5J19J20n9o0K1K2J9J9O8O8K6K6j52j52j0j0OJ03J47
1248E67j5r5r6J07J07p2p1K1K2o0o0O4O4j7j8JJM9M9m4m5m5m4L3L3m8m7j8j7j7j7J10J11j32
1231C61j32O1O1N1N0P5q7n0M6M3M2r1r0q7J0J01o1l8N9n5n5q2q3J27J28Q1Q1%%m5m6L5L5L3
1214D78L3j6j5K6K6k2k2K8K8M0n6n8L9O0O0n8n8j00j00p7K1J4J4L6L6m6m5M1M1M1M1n5n6Q5
1197D04j1p2K6l6l5N9N9J07n4j25k8N4N3RQl9m0j1j1M2J39O9k8M8m8q7P5L2o5jkq8q8O3O4
1179D42P0k8q8q8l6O2L7L8L6j26j92L5O9O9M5n1n2M5N7N7J4J4n6n7R6R5o6L1J11J5q0p9j1
1163D28j1J02Mj45J6nnNNNNNOK6K6n5n4M0M0j4Q3K1K2P6P5k9k9o7o8j33K8o2o3O3O3qpq2Q0
1143C87Q0q2k6k6l6l6N4N4N4N4K7K7n5n4J4J5K0K0n9L9mj01k8O9O9k8k8O9RQL2L1j6j7m2m2
$$ plain form
1265 499 446 394 389 385 363 342 320 299 258 217 257 297 271 246 365 485 426 366 387 409 428 447 515 583 609 635 483 331 321 311 317 420 567
1248 567 552 457 361 468 575 503 432 453 475 415 355 419 483 466 448 449 450 499 548 504 459 414 370 403 436 388 341 323 306 289 272 382 493 361
1231 361 229 290 351 402 452 527 440 390 436 479 521 430 340 253 263 364 303 265 324 269 214 132 49 176 304 385 466 466 466 421 375 410 445 478
1214 478 511 495 480 506 532 510 488 516 544 584 528 470 509 569 629 571 513 413 313 236 257 271 285 321 357 311 266 307 348 389 430 375 319 404
1197 404 393 321 347 311 276 335 394 501 447 322 294 348 401 410 418 379 339 328 317 359 498 567 539 587 539 452 527 559 494 493 491 403 315 378 442
1179 442 512 484 396 308 272 334 371 409 445 319 127 162 231 300 345 294 242 287 344 401 415 429 373 316 412 507 441 472 583 598 518 439 428
1163 428 417 519 523 378 394 389 384 389 394 399 404 409 415 441 467 412 358 398 438 424 507 528 550 626 701 672 643 576 508 375 403 341 278 341 404 396 389 307 387
1143 387 467 385 359 333 297 261 315 369 423 477 504 531 476 422 436 451 471 491 432 471 467 366 338 407 476 448 420 489 498 506 538 569 553 536 494 452
1125D52M5M4kR5O4j62j16M6N1m7J1J09j0j08k0k1M8M8K6p2RJ07j3j3n6n5N9O0k1k2n7n8N5
1109D76N6q6q6jR6Q2j5l5l6o4o4j6j5PQm7N0R2R2j4j5J4J5O3O2m8m8L2L2j14j14jjJ2J2J2
1090C93J2L9L9lmnR1K1j41mR2n3n3ONNOr3r3N3J50Q6p5n4n3l0O8J04n7l0l0m0m1m6m6R9R9
1072D17nmM3M4k0k0k0k0M8M8l3l3l0l0P4P3O0j02j14j6P7P7o2L5P9q2m0N8j3j2n5n5L3L3j5
1054D18j6K8K8K8K8ONp5p6J7J7R7R8k4k4K5K5kjj15j15J06J06p2p1Q4Q3r4r4qpM0M1J2J3o9
1036D42o8RQR0R0r1r1j0j1M8M8M7M8k1k2M4n3j20M2J46M8k1k2k7k8M9M8M9M8j0j1r1r1N0N1
1019F17JKo2o2o2o2Q0Q1o5o5m2m2n8L9J57nj08j2K4K5L0L0jjM7M8L0L0j48j47j1j2L7L8N1
1001D02N1LLlln2n2m8m7J30J30QQp2p3MMQ5Q5m5m5L6L6j56j56N4N4K1K1P0O9J00J00p8p8K
$$ plain form
1125 452 497 541 539 634 698 536 420 466 517 470 481 590 580 472 452 431 479 527 553 481 490 597 584 571 515 460 519 579 558 536 479 421 476
1109 476 532 446 360 359 455 537 522 487 451 387 323 307 292 299 307 260 310 402 494 480 465 479 494 557 619 571 523 555 587 473 359 358 357 369 381 393
1090 393 405 444 483 480 476 471 562 583 442 438 530 477 424 430 435 440 446 353 260 313 463 549 474 420 367 337 405 509 452 422 392 352 311 265 219 318 417
1072 417 412 408 451 495 475 455 435 415 463 511 478 445 415 385 459 532 592 490 376 360 437 514 452 487 566 484 444 502 489 477 422 367 400 433 418
1054 418 402 430 458 486 514 520 525 450 374 391 408 505 603 579 555 580 605 603 602 487 372 478 584 512 441 525 608 514 420 412 405 445 486 498 511 442
1036 442 374 383 391 481 571 480 389 379 368 416 464 511 559 538 516 560 507 387 429 575 623 602 580 553 525 574 622 671 719 709 698 607 516 566 617
1019 617 618 620 558 496 434 372 452 533 468 403 361 319 261 300 457 452 344 332 356 381 411 441 440 439 486 534 564 594 446 299 288 276 313 351 402
1001 402 453 456 459 456 453 401 349 301 254 384 514 522 530 458 385 389 393 478 563 518 473 509 545 389 233 287 341 362 383 453 522 622 722 644 566 568
983E68Lm7m6OPOOnnonp1p1RJ0J5J5J5J4OOm3m3M5M5R4R4k8k8J5J5L3o3k6J37P6k1p0p0n9o0
962D73K2K1l3l3J5J5l6l7M4M4K8K8j17j18O1O2J3J2L8L7p6p7m1m2J3J3r5LJ59mK9J26j9k0
945E08nonnkjjjOO%%K5p2jJ61rj06PPj4j3j4j4l8l8l2l3N8J54Q4p8j32l4P8P9J7J7r6r7k5
925C35k6N6N5n9n9K2K2rqJ04J05j1j1P0O9n3n4n3n4J7J8J7J7l9l8l9l8l2l3M9M8MMN2N3k7
907D74k7k6k7M8M8M8M8o1o1j3j3J0J0RJ0%Jm8m8L2L1j6j7M3M3onJ4J5o6o6j0j1L9L8ooooL1
887D47L2L2L2N6N6j22j22R1R1k2k2m4m5j45J6O0j03n5M1L4L5Q8Q9ooooK4K4k4k5OOONm3m4
868D31O9P0kjn0n0J3J3OPN0m8q3P7p3p4N0M9O5O4NOJ7j45j45J6N4N4M7j14j8P9R5R5J7J8P0
850G34r1j39K2j8j14p1K6J4J4J9J9q4q4l9J22J45J44L7L8j1j1m9m8PPj9P8k5j86kR6L1L1j6
$$ plain form
983 568 571 524 478 484 491 497 503 498 493 487 482 411 340 349 359 374 389 404 418 424 430 387 344 389 434 528 622 594 566 581 596 629 566 540 677 753 732 662 592 533 473
962 473 495 516 483 450 465 480 444 407 451 495 523 551 434 316 377 439 452 464 502 539 463 386 345 303 316 329 234 237 396 392 421 547 528 508
945 508 503 497 492 487 485 484 483 482 488 494 494 494 519 447 446 607 598 492 499 506 492 479 465 451 413 375 343 310 368 522 606 528 396 362 440 519 536 553 457 360 335
925 335 309 365 420 361 302 324 346 337 329 433 538 527 516 586 655 602 548 495 441 458 476 493 510 471 433 394 356 324 291 340 388 392 396 448 501 474
907 474 447 421 394 442 490 538 586 525 464 451 438 448 458 467 477 477 478 430 382 414 445 429 412 455 498 492 487 501 516 450 384 374 363 402 440 434 428 422 416 447
887 447 479 511 543 599 655 533 411 502 593 571 549 505 460 315 331 391 288 233 274 308 343 431 520 514 508 502 496 520 544 520 495 501 507 513 518 475 431
868 431 500 570 568 567 517 467 480 493 499 506 556 508 425 502 429 355 405 454 519 583 588 594 611 466 321 337 391 445 492 378 360 439 534 629 646 664 734
850 734 643 504 526 508 394 323 349 363 377 396 415 331 247 208 330 475 619 656 694 683 672 623 575 582 589 570 648 623 437 435 531 562 593 577
832E77j6j5j6M0M1K4j37o7L0J12J11n6n6n5n6N4N5k7k6k7k7K2K1J0RR0R1r8r7j6j7m9n0L1
815D10L1QRQRL9M0p4p3k1k1K8J25J26l6n3n2%%%%p6p6J02J02J0J0p2p1O0N9N9O0k1k1o9o9
797D90M1M1ppk3k3l5j33p3J53J59lj18j18J8J7P1P1m2m2l8l8l8l7O2O2J4J4l1l0J8J9LLLL
779D26m0l9LKO0l8q4P7J43j9o3o4P4P4P4P4n0n1K0K0N9j04j03N9n2n1J26J26J3j49n7n8M1
762D49M0pql9m0J0RP4P4K6K5n5n6N8N8k7k6N4N4l5l5MMrj71m8N0RJ06O4l3m8m8N9N9NMNMk7
742E92k6k7k7j2j1O9O9MMLMj00j01n1n2J7J6O6O5K5K5n6n6LLN1J48M3j20p7K0o3o3K4K4O2
724D95O1J9J9j9P9M0j22o4L3l2l1P1P0m2m2j5j5O6O5M7M6j32j32k4k5J54J53j26j25J9K0J8
708E29J8J8J8ononl5l5l5l4R7R7m9m8K9L0n2n1k9k8K1K0J25J26J2J2n4n4j02j03k1k2K7K7
$$ plain form
832 577 561 546 530 570 611 635 498 431 461 573 684 628 572 517 461 515 570 543 517 490 463 485 506 516 525 615 706 608 511 495 478 429 379 410
815 410 441 449 458 466 475 514 554 480 407 386 365 393 518 644 608 555 503 503 503 503 503 427 351 453 555 565 575 503 432 492 551 610 670 649 628 559 490
797 490 531 572 565 558 535 512 477 344 271 424 583 580 462 344 362 379 450 521 479 437 399 361 323 286 348 410 424 438 407 377 395 414 417 420 423 426
779 426 386 347 350 352 412 374 290 367 510 491 428 364 438 512 586 660 610 559 579 599 658 554 451 510 458 407 533 659 672 523 466 408 449
762 449 489 482 474 435 395 405 414 488 562 588 613 558 502 560 618 591 565 619 673 638 603 607 611 602 431 383 433 442 548 612 579 531 483 542 601 606 610 615 619 592
742 592 566 539 512 500 489 558 627 631 635 638 642 542 441 390 338 355 371 437 502 527 552 496 440 443 446 497 645 688 568 491 511 448 385 409 433 495
724 495 556 575 594 575 654 694 572 508 541 509 478 549 619 577 535 520 505 571 636 683 729 597 465 441 416 570 723 597 472 491 511 529
708 529 547 565 583 577 572 566 561 526 491 456 422 519 616 567 519 548 578 526 475 446 418 439 459 584 710 722 734 680 626 524 421 400 378 405 432
690D32J4J5O3O3M3M3ooqrm5m5j38N6O0O0n1n0kkk4k3N7N8kjkjl1l1N0N0q9q8Q9R0K2K1k6k7
670E79rqrrl3l4M7M7j11j12O7O7M4M3nnm5m4m5m5K1K2K1K1L2L3L3L3K5K6K6K6j0j0j23j24
652D32J07J06K6K5j32j33M6M6RRj40K1J51j1n2M6L4o2n7M1J4J5P0O9j01j01J14J15j08j2P9
637F66q2l1O6KJK4K4n6n7RRm0m0R7R8j7j6j1j1j1j1r1r1j0j0L7L7L8L7l3l3l3l3L1L1j8j8
618D54j4j5j5j5KLKKP0O9P0O9q7q7K0K0J3q3j26L5J16J8o2o2j3j2O8O9m9m9L3L2J1J2mR2Q0
600F67q3m0N8l2l2K3K3P0P0j0j1j08j08L8L7L3L2m8m8M1M2M2M1o3o4N0N0l3l3l3l3O2O2J4
582F76J3j5j6j6j5ppopK4K4K3K4n5n5K6K6l7l8J1J2J46J47o4o3p7p6k8k7J9K0K0J9r2r2Q5
564E22Q5JJm8m8J5J5J6J5k6k6N5N5J3J3o8o8K1K1o0o0p1p1J38J39J2J1o9o9L6L7Q5Q5m0l9
$$ plain form
690 432 446 461 524 587 630 673 667 661 653 644 599 554 416 472 532 592 541 491 489 487 463 440 497 555 553 552 550 549 518 487 537 587 498 410 499 589 611 632 606 579
670 579 570 562 553 544 511 477 524 571 460 348 415 482 526 569 564 559 514 470 425 380 401 423 444 465 497 530 563 596 621 647 673 699 689 679 556 432
652 432 539 645 671 696 564 431 477 523 532 541 401 422 573 562 510 556 590 528 471 512 526 541 611 680 579 478 592 707 599 587 666
637 666 584 553 619 621 622 646 670 614 557 566 575 535 495 592 690 673 657 646 635 624 613 522 431 421 411 448 485 523 560 527 494 461 428 459 490 472 454
618 454 440 425 410 395 397 400 402 404 474 543 613 682 595 508 528 548 561 478 352 387 503 521 459 397 384 372 440 509 460 411 444 476 487 499 495 587 667
600 667 584 544 602 570 538 561 584 654 724 714 703 595 487 525 562 595 627 579 531 572 614 656 697 634 570 620 670 637 604 571 538 600 662 676
582 676 689 674 658 642 627 620 613 607 600 624 648 671 695 640 585 611 637 600 562 573 585 731 878 814 751 674 598 570 543 562 582 602 621 529 437 522
564 522 607 608 609 561 513 528 543 559 574 548 522 577 632 645 658 590 522 543 564 504 444 373 302 440 579 591 602 533 464 500 537 622 707 667 628
547F28P4P4j4j4j4j4j8j8j8j8M9N0j28j28M4M4M4M4l9l8J0J0P6P5j02j02MLQ4Q5j32j32j9
530D50j9O5O4J7J6l0k9J9J9%j%jO0O0k1k0j9j8q0J8lj00n6J06J26K9Kr4J3J3p4p4L3L4P6P6
512F57L8n9nmn1n0j05pl3l3Q6Q6j5j5p0K8P9P9k9k8P9P9o0o1j2Q5L0L1l0l0l1l0M1M1J4q3
494F12k9l0J9J9o8K9J24l8j36K5O3O4K7p0p0K7%jOONNO5l1k6P0j03j03O0N9J41J41q0q0JJ
476G04o3o2j24k6O6l1Q2J79P2k4m4m5N1N0l7l7j3j09r8O5mmJ19J20J2J2p2j70o6L1J9J9j0
459E62j1L8L8J2J1J1J2RRRJ0p0p0M3M3j2j1L7L7m8m8m8m8k0k0M7n0n1J43O2j32JR7n0n0J2
441E04J2o8o9P6P6K8K7RRQRQQJ65k9j18j18j58L5Q0Q0k1k1m4m4P0O9QQPQL7L7j2j2k1k0k1
422F02k1K2K3K2K2j09j09j17P7J15p8o1L7MMJ0J0O4O3O3O3J8J9o3o2K9L0n2n2RRp2p2P2P1
$$ plain form
547 628 702 776 762 748 734 720 702 684 666 648 697 747 619 491 535 579 623 667 628 590 600 610 686 761 659 557 561 564 648 733 601 469 450
530 450 431 496 560 577 593 563 534 553 572 572 571 571 570 630 690 669 649 630 612 532 550 547 447 391 497 623 652 654 560 573 586 512 438 471 505 581 657
512 657 695 636 631 627 576 526 421 414 381 348 434 520 505 490 420 448 527 606 577 549 628 707 647 586 574 659 689 720 690 660 629 599 640 681 695 612
494 612 583 553 572 591 523 552 676 638 502 527 590 654 681 611 541 568 568 567 573 579 584 589 654 623 597 667 564 461 521 580 721 862 782 702 703 704
476 704 641 579 455 429 495 464 546 725 797 773 729 684 735 785 748 711 698 589 491 556 552 548 667 787 799 811 739 569 503 534 553 572 562
459 562 551 589 627 639 650 661 673 682 691 700 710 640 570 613 656 644 633 670 707 659 611 563 515 495 475 522 472 421 564 626 494 495 592 542 492 504
441 504 516 448 379 455 531 559 586 595 604 612 621 629 637 802 773 655 537 379 414 494 574 553 532 488 444 514 583 591 599 606 614 651 688 676 664 643 623 602
422 602 581 603 626 648 670 561 452 335 412 527 449 388 425 429 433 443 453 517 580 643 706 724 743 680 618 647 677 625 573 582 591 519 447 519 590
404E90rrJ6J6K2K2r8jJ35o0q1q0K0K0P4P3m0m0j5j6r0r1R5J91Rj84OJ03J18J17m2m3m3m3J0
387F52J0J0J0M1M0m6m6K7p0q3J12L1o5n9L8k2j19o5L3J28J27K1K0p8p9l0l0ONN4N4l1l1k5
370E40k5j4Q3J37n6o7o6l0l1P3P2qrp8p8O7O8OPOOj2j1j2j2Q6Q5j56j57O5O6N9O0J3q3JJ95
351G90L2o5j12j12RJ0RRJ04J03N5N5j1j1o0o0j04j04k4k3M9M9%Jj5j5j4j5nnP6P6O5O5j13
334F89j12K8K8n3n3K9K9j9k0jjjjM4M3nnNNNNKKKLonnnM0M0m0m1%%%%N1N2J00R9j24j25j2
311F67j2p1p1k3k3K6K7K6K6j9k0J91L0j20k3poj9j9R5R4o3o3N0N0p0o9J2J1L9M0m2m2l1l2
294E39P2P2Q9p1j17j9R6R5j1j1m9m8%%m3m4l3l3j6J45J52N5j1j07o0n9MNMNk3k2K5K6K9K9
276F65K9K9MMp7p7j7j6L1L2K0K0P4P5j62o5J49j2K5K5p6Q6o9p0N4N4l7l7l6l7K9L0j9j9M8
$$ plain form
404 590 581 572 588 604 626 648 550 549 684 624 543 463 483 503 577 650 610 570 555 539 449 358 453 644 653 469 475 578 696 813 771 728 685 642 652
387 652 662 672 682 723 763 717 671 698 628 545 657 688 623 564 602 580 461 396 429 557 684 705 725 647 568 538 508 514 519 573 627 596 565 540
370 540 515 501 584 721 665 598 532 502 471 544 616 608 599 521 443 510 578 584 591 597 603 591 580 568 556 642 727 571 414 479 545 604 664 677 594 595 790
351 790 822 757 645 533 542 552 561 570 674 777 832 887 876 865 805 745 641 537 513 490 539 588 588 589 574 559 545 530 525 520 596 672 737 802 689
334 689 577 605 633 580 527 556 585 566 546 545 544 543 542 586 629 624 619 624 629 634 639 641 643 645 648 642 637 632 627 667 707 667 626 626 626 626 626 677 729 829 928 804 679 667
311 667 655 584 513 490 467 493 520 546 572 553 533 724 754 634 611 604 598 579 560 655 749 686 623 673 723 653 584 596 607 646 686 644 602 571 539
294 539 611 683 772 701 584 565 661 756 745 734 685 637 637 637 594 550 517 484 468 613 765 820 809 702 642 583 587 592 596 601 578 556 581 607 636 665
276 665 694 723 727 731 654 577 560 544 575 607 627 647 721 796 634 569 718 706 731 756 680 766 697 627 681 735 698 661 625 588 617 647 628 609 657
258F57M9M9M9n7n7n7n7L2L1m8m9m1m1QPl9l8P4P4J20J20PPn6n6N8N7l9l9RRJ7J6l2l2k1k2
240F69k1k1Q5Q5o1o0k8k8K0K1n5n4K7K6R2R1J1J0m7m7m7m7Q5Q5L6L6L7L8j09j08LLm5m6j1
222F25j1L8L7J2J2O0O0j7j8j8j7l9m0J0Ro3o4J8J7J4J3J4J3P7P7l6l6L1L1n0n0n2n1n2n2N1
204E53N2N2N2m3m2m2m3P0P0j7j7K7p0j6j6RQn1M5J30L3m6m5n8L9J30l2j20k4j3j3J61O3q7
187F99Rk9j26l3O4n4M2J34J34l6j34RQl3O5J5q1l1l1J2J2N9N8J1J0P1P1p4j72j15M6O2O2m4
170F60m4j8Q0K1K0K7K7mlKLo2L5J10J3k8j25k2k3p8J9J00LM5M6L9L9n0n1n1n1J3J3J3J3L5
152G66L5j11j11J5J4n0M7J07n5o0L6jjNMN2N2j8Q0P6j51n9J02k4k4o2o2P9Q0kjL9M0p4p4J4
134G03J3o2o1o7L0R0Q9l1l0K4K5l7O1k1j17J43J44rqj7j6nj02n4M3K4K5N7m0m1N7mlKKN9N8
$$ plain form
258 657 706 755 804 747 690 633 576 608 639 591 542 501 460 468 475 436 398 472 546 666 786 793 800 744 688 746 803 764 725 734 743 760 776 744 712 691 669
240 669 648 627 712 797 736 676 648 620 640 661 606 552 579 605 697 788 799 809 762 715 668 621 706 791 827 863 900 938 829 721 724 727 682 636 625
222 625 614 652 689 701 713 773 833 816 798 780 763 724 684 694 703 640 576 594 611 625 638 652 665 742 819 783 747 778 809 759 709 657 606 554 502 553
204 553 605 657 709 666 624 582 539 609 679 662 645 672 602 586 570 579 587 536 581 711 744 698 653 595 634 764 732 612 588 575 562 723 786 699
187 699 708 679 553 520 584 530 572 706 840 804 670 679 687 654 719 734 653 622 591 603 615 674 732 743 753 824 895 821 649 534 580 642 704 660
170 660 616 598 678 699 719 746 773 769 766 768 771 709 744 854 867 839 714 692 669 591 610 710 713 758 804 843 882 832 781 730 679 692 705 718 731 766
152 766 801 690 579 594 608 558 605 712 657 597 633 632 631 636 640 692 744 726 806 882 731 672 774 750 726 664 602 681 761 759 758 797 837 763 689 703
134 703 716 654 593 526 556 646 735 704 674 698 723 686 747 726 609 752 896 887 879 862 846 841 739 685 728 752 777 834 794 753 810 806 803 805 807 866 924
115I24O4l2r9r8p8J9P5P5Q7j1J9J8l7l6q2q2l3l3K8K8k6P1N2N2J0J0MNj02j03j10j4O8O7L0
98G30j32q9q9N5N6M9M9K7p0p0K8j5j5J37J37L7L7p6p6m5m5O3O2J0q7J6J6K1K0J23K7p1p0Q
81G58J05k4j21l4O4LMLMM9m8m2m2J1J2O0O0J8J7O6O6n0n0n1n0N3N3ooK7j35r9kL8L7mnO0O1
61H60k0k0j35j35J39J40mmq4q5O7O7qpn8M0Q2p9j42m4P8J76N1N2M1j20j54n7rqo8o8J42K39
44H65M8j14j7j7ppn5n6L2L2L2L2o6o6j7j8n0m9L1L1R5R6j8j7m5m6MLllJ11J10q0p9l1l2j8
25F11j7j8j8J08J08O0l7j17M6Lr4j7j8N7N8P5P6l8l8j7j8j7j8k6k7J19J19j20j19poM4M4j9
8G22j9O0j67m9J12J03J03o5o4JJKJKKN1N1o7o7k5k5J06Rl4J28L6o1J1q7k5k4l0l0J22J23k7
-10H80j24lR4K7K8k8j25j13M9Q4Q4L5o1K2K1j46m9o0L7J18K0L5o2j05N7L9L9N5m2KKlmK4K4
$$ plain form
115 924 988 956 857 759 681 700 775 850 937 926 945 963 926 890 808 726 693 660 688 716 690 761 813 865 875 885 889 894 792 689 579 565 633 700 730
98 730 598 509 420 475 531 580 629 656 586 516 544 529 514 651 788 825 862 786 710 665 620 683 745 755 668 684 700 721 741 864 891 820 750 758
81 758 863 839 718 684 748 751 755 758 762 811 763 721 679 690 702 762 822 840 857 923 989 939 889 838 788 841 894 888 882 909 774 675 673 711 748 744 739 799 860
61 860 840 820 685 550 689 829 825 821 737 652 719 786 778 771 713 753 835 756 614 570 648 824 875 927 968 848 694 637 628 620 552 484 626 865
44 865 913 799 782 765 758 751 696 640 672 704 736 768 702 636 619 601 551 502 533 564 659 755 737 720 675 629 633 636 633 630 741 851 771 692 661 629 611
25 611 594 576 558 666 774 834 797 680 726 729 635 618 600 657 715 790 866 828 790 773 755 738 720 694 667 786 905 785 666 659 653 697 741 722
8 722 703 763 596 547 659 762 865 800 736 737 738 740 741 743 745 796 847 780 713 688 663 769 778 744 872 908 847 858 771 746 722 692 662 784 907 880
-10 880 756 753 847 874 902 874 749 636 685 769 853 888 827 849 870 724 675 615 652 770 790 825 763 658 715 754 793 848 806 808 810 807 803 827 851
-27H51J9J8K5p1r2r2K9J25j0j0J8J8k5k4rQ7N0j13o5L2l8l9j3j11j5K11N7j05N0M9L7L7q3
-44G98q2R8Kq0J7o7o8Q4Q4M2M1j04j04K4K3n7n8J2J1jR6L1o7j41m4J3J4J24l7k4K01J06n5
-60H32l1l1l5l5N0J47L4o4k5k4l1l1K0K1J02J01j62j62J0J0O1l7m2N4Mr3l3l3L8L8m3m3O8
-77F35O8j3j3L8L9k2P5R2oLr4j22k6l3O3J01LLJ01J05RK0K1q2q1opk7j23m7J14Q4Q3Lr5M1
-95I04M1j7j15j26k8K8J25P5k1o8o8qQ9Q9qkkqqm0m1J01Ln4M2j26j26%R6J42j9q3P8l3l4J24
-113I02l7n0M7l8l7O9r2o8R3J00J00n6j53K1K1p6K0K7p0j30l3K0J9J%M9M9P8P7l6l6p4p3J3
-130F47J3pR0Q4Q3n0n0L1L1j7j6j7j7n7n6mR2M7n1O9O8j12M8R6j31r8O4O6O6l5j32q4J3L7
-147G11L6L3L2Q6p6j56NP0O9j1j08M0M0L5L4j8j7Q6j2o0n9n0j46m1J21P9j8Q1Q1l8l9q4q5
$$ plain form
-27 851 870 888 913 842 750 658 687 812 802 792 810 828 803 779 770 857 907 794 729 761 723 684 671 560 545 756 813 708 758 807 844 881 798
-44 798 716 814 816 736 753 686 618 702 786 828 869 765 661 685 708 651 593 605 616 615 711 742 675 534 490 503 517 641 604 580 781 887 832
-60 832 801 770 735 700 750 897 931 867 842 818 787 756 776 797 899 1000 838 676 686 696 757 720 678 732 736 643 610 577 615 653 610 567 635
-77 635 703 690 677 715 754 732 807 899 893 896 802 680 654 621 684 785 788 791 892 997 1006 1026 1047 965 884 878 871 844 721 674 788 872 955 958 863 904
-95 904 945 928 813 687 659 687 812 887 866 798 730 722 811 900 892 890 888 880 872 832 791 892 895 841 883 757 631 631 727 869 850 767 845 812 778 902
-113 902 865 815 862 824 787 856 764 696 789 889 989 933 780 801 822 746 766 793 723 593 560 580 599 600 600 649 698 776 853 817 781 707 634 647
-130 647 660 653 743 827 910 860 810 841 872 855 839 822 805 748 692 688 780 827 776 845 913 801 849 945 814 716 780 846 912 877 745 661 674 711
-147 711 747 780 812 898 822 666 671 741 810 799 691 731 771 806 840 822 805 891 879 819 760 710 564 523 644 723 705 786 867 829 790 706 621
-164F21k6P1N1N1N8N7N8N9j52j52p6p6k8J35J67P1K2K2j9j8j8j8M4M5r5r5rQ8Q8rj2j3N7N7
-181A006J04Qq4q4J6J5l9N8r0r0p9p8m4N4J11J12K0K0o1o1L1L1j2j1q8QJ5q2j2Q4J25l6n5
-198H12J07O0l7m5m5Q9Q9nj02n3M4J2J3l0l0K6K7K6K6K1K2K7p0n4n5m0N7k9j25K7K6n0J12
-214H53O9r3L6J33Q1j7p5K3l8l8p4p3m7N0r6r5Q9qnJ57N9O0NMm3m4k5k6l1O5k7k7P6q5j04
-232F89pJ33J33K5p2k4k3K1p6k2k1m6m5KLQ9Q9PQO0O0q5q6J8J8l1l1J29J28k1j17j09j2RQ
-249H01jjjjl9m0P4P4K1K2Q2j4l8N9n0n0M6M7k8k9n3M4R2nNNjjo0o1J17J18j34j33m8M9Q0
-268I48j7o6L2Jr6k9k9k3P4K0J9RQJ55J54k8k8q8Rj1j08JJj1j1p2K6M4n3mR3kr8J1J1RRJ58
-287A018lq9P3K6p1n6n6J9J9Q4Q5R7jj38m2L3o4K4K4r0q9j7P9P9j7N0N0l7l7p8p8o1L5J65
$$ plain form
-164 621 595 666 717 768 826 883 941 1000 848 696 620 544 516 651 818 889 911 933 914 896 878 860 904 949 854 759 750 838 926 917 905 892 949 1006
-181 1006 1110 1118 1034 950 966 981 942 1000 910 820 741 663 619 673 784 896 916 936 875 814 845 876 864 853 765 773 788 706 694 778 903 867 812
-198 812 919 979 942 897 852 941 1030 1025 923 870 914 926 939 909 879 905 932 958 984 1005 1027 1054 984 930 875 835 892 863 738 765 791 741 853
-214 853 922 829 865 998 1079 1062 987 1010 972 934 860 787 740 790 694 599 688 680 675 832 891 951 956 960 917 873 848 822 791 856 829 802 878 793 689
-232 689 682 815 948 973 901 877 854 875 799 777 756 710 665 667 670 759 848 855 863 923 983 898 812 830 848 817 786 915 1043 1022 905 796 784 793 801
-249 801 800 799 798 797 758 718 792 866 887 909 991 977 939 998 948 898 944 991 963 934 881 925 1017 1012 1017 1022 1021 1020 960 899 1016 1134 1000 867 819 868 948
-268 948 931 865 897 898 802 773 744 721 795 815 834 843 851 1006 1160 1132 1104 1016 1025 1014 906 907 908 897 886 814 840 884 831 827 920 918 820 831 842 851 860 1018
-287 1018 1015 926 999 1025 954 898 842 861 880 964 1049 1146 1145 1007 965 998 934 958 982 892 803 786 865 944 927 977 1027 990 953 875 797 736 771 936
-304I36Lo8L0n3n3Q8qo0n9o5o5N5N4%R7LLJ0Rm8m8o8R3K4j37K1J19N9N9J6J6k1k1K8K7l1l1
-323I14l7l7R2om8J14K9o7klj5j4L3L4q9r0N7N6N2N2r4r3m5m6L6L5j8j8L0L1j8j7j7j8P6P6
-341I25noM9M9M9M8o5o5o6o5J8J8J8J8L5L4j4j4L6L6m5m5j3j2L6L6p5p5OPN2N3R1R1J10n2
-359A198j62o4j0rn2n2o8o9M5M6J8J9l0k9j9j8pJ56P6q5J6J6m7m8m7m7M5M6lkj%Q1Q1l1l0
-377I13N0N0P3P2j06j05k1k1O0O1j4j4o2o2J22J22q6j83o6J29J71k3o8o7L3L4m5m4MMm1m0
-393H30M0M0o3o3Q2Q2J6J5l3l3k8k9K0K0M9M8%%j8j7r8r8j7j8R6R6M3M3p0p1L4L4L3L4K0J9
-411A038k9l0n0n0kkk3k4Q4Q4o5j63j3J81J09J1o7o7j4j4j3j4Q3Q4l0l0n7n7Q8Q9p0o9q8J0
-428H20J05q8q9J05N7m1n4n5LLN1N1K6K5q7q8K6K5P4P4LLm6m5PQQQm6m5KLL4L5j5j4J0J0p1
$$ plain form
-304 936 939 871 901 848 795 883 875 815 756 691 626 681 735 735 832 835 838 848 857 809 761 693 786 810 673 694 813 872 931 947 963 942 921 949 976 945 914
-323 914 877 840 932 926 878 992 1021 954 952 949 934 920 953 987 898 808 865 921 973 1025 931 838 793 747 783 818 800 782 812 843 825 808 791 773 849 925
-341 925 920 914 963 1012 1061 1109 1044 979 913 848 866 884 902 920 955 989 975 961 997 1033 988 943 930 918 954 990 915 840 846 853 905 958 1049 1140 1250 1198
-359 1198 1036 972 962 953 901 849 781 712 757 803 821 840 810 781 762 744 737 893 969 884 900 916 869 821 774 727 772 818 815 813 812 812 893 974 943 913
-377 913 963 1013 1086 1158 1052 947 926 905 965 1026 1012 998 936 874 996 1118 1032 849 783 912 1083 1060 992 925 958 992 947 903 907 911 870 830
-393 830 870 910 847 784 866 948 964 979 946 913 885 856 876 896 945 993 993 993 975 958 860 762 745 727 823 919 962 1005 935 864 898 932 965 999 1019 1038
-411 1038 1009 979 929 879 877 875 852 828 912 996 931 768 755 936 1045 1056 989 922 908 894 881 867 950 1034 1004 974 917 860 948 1037 967 898 810 820
-428 820 925 837 748 853 910 869 815 760 763 766 817 868 894 919 832 744 770 795 869 943 946 949 903 858 865 873 881 889 843 798 800 803 837 872 857 843 853 863 792
-447G92p1L5L5L5L5J4J3n6n5j05Q9K40M7j23k5K0K1n2n2lmQ4Q4o2o1j%%%n6n5K5K5P0O9P0
-466A022P0o7o7KKO2j32k9O7n0n0L1L1jr9m0J54O9O8%jM0M0m1m0Q9R0RQq4q4K9K9q8q8K5K5
-484A001L5L4m6m7J2J1J2J2kkn0n0P7P6l7l7j09j08MNQ6Q7Q7Q7k6k7j07j07L2L2L2L1KKJK
-502A005K4K4n7n7MMm5m4ooj3j2J05Rn3J42O1l5j7j7klllL7L6p7p7j1j1J02J02r3r4j4Q2O9
-521A056j24m4J50Mr3k6k7k7k7N4N3N5N4j24j23N7N8n6n6L7L7L7L7o0n9n9n9M4M4M4M3RRQ
-538I26RP8P8r9j00l3l4J5J4NNQ6Q6K7K7k1k2%jm8m9K6K7k1k2N1N1N1N2j0rj23j23K1K2K1
-556I63K1J0J0P7j17p1K6M7M6l1O5J21p4M9M9j09j09lklkl0l0k9l0M6M6M6M7n2n2mlJ6J5j47
-574H02M6Q6j1k5k5K2K2o0n9l7l7M4M4J53J53k5k5q9r0m1m1O9O8p8p7J01J02j2j2M8M8l3l3
$$ plain form
-447 792 721 756 791 826 861 875 888 832 777 672 761 1001 1048 925 900 920 941 889 837 834 830 914 998 936 875 874 874 874 874 818 763 788 813 883 952 1022
-466 1022 1092 1025 958 960 962 1024 892 863 930 880 830 861 892 891 792 752 906 975 1043 1043 1042 1082 1122 1081 1041 1130 1220 1229 1237 1153 1069 1098 1127 1039 951 976 1001
-484 1001 1036 1070 1024 977 989 1000 1012 1024 1022 1020 970 920 997 1073 1036 999 890 782 786 791 877 964 1051 1138 1112 1085 978 871 903 935 967 998 1000 1002 1003 1005
-502 1005 1029 1053 996 939 943 947 902 858 852 846 833 821 926 935 882 1024 1085 1050 1033 1016 1014 1011 1008 1005 1042 1078 1001 924 913 902 1004 1106 1013 919 905 987 1056
-521 1056 932 888 1038 1042 949 923 896 869 842 896 949 1004 1058 934 811 868 926 870 814 851 888 925 962 902 843 784 725 769 813 857 900 909 918 926
-538 926 935 1013 1091 992 892 859 825 840 854 859 864 950 1036 1063 1090 1069 1047 1047 1046 998 949 975 1002 981 959 1010 1061 1112 1164 1154 1145 1022 899 920 942 963
-556 963 984 994 1004 1081 964 893 919 966 1012 981 1046 1167 1093 1142 1191 1082 973 970 968 965 963 933 903 874 844 890 936 982 1029 977 925 921 918 934 949 802
-574 802 848 934 923 898 873 895 917 857 798 761 724 768 812 965 1118 1093 1068 979 889 848 807 876 944 866 789 890 992 980 968 1016 1064 1031 998
-591I98l5l5l5l5Q0Q0l3l3j2j2j2j2n7n8l3J61J85qq8Rj5j5n7n8k9k9J82J81j0j0j0j0k6k6
-608A083K3K2m8m8j29j29P9Q0Q0P9l0l1l0l1mlmmk8k8K1K0NON9O0MJ00N4j41j85QO5O5l1l0
-626I79l0l0P4P5P4P4n0n0n1n0J4J4l4l5q8q8ppM1M2J22J22p2p2p2p2J3J3J3J3o6o6J12J12
-643I67J1J0l8l8n6n6qpQ2Q2KJMLN2N2q9q9qrQ8Q8J30l1n3n3o3o3L9L9L9L9RJ0RJ0n1n1K9
-662A032L0PON6j07j40m3k6k7M3M4L7L7O1l7j54QM8M7RRL6L6m4m5K5K4K5K4j2j3o2o1O3O3
-680I99J5J4o8o9J3J2O8O7ppr1NJ24l9j3j4k3k4o1o0N2N2j1j0o0n9R8R8J8J7n9n9K1K2p2p1
-698H18j7j7KJ00N0m6L3L2K7K6k4k4k4k4M1M1m0m1M8M8l3l4N1N1N1N0j03j04n4n5O9P0J4J5
-715I97J4q3J4J4O3l5q9QN7m0q2J4N4N4p5K1noOPJ9J17J3J4p5p4OOo5o5M7M8M1M1L5L5M0n7
$$ plain form
-591 998 963 928 893 858 938 1018 985 952 940 928 916 904 847 789 756 917 1102 1094 1006 1015 1000 985 928 870 841 812 994 1175 1165 1155 1145 1135 1109 1083
-608 1083 1106 1128 1080 1032 903 774 853 933 1013 1092 1062 1031 1001 970 966 963 959 955 927 899 920 940 945 951 1010 1070 1074 1174 1228 1087 902 910 975 1040 1009 979
-626 979 949 919 993 1068 1142 1216 1166 1116 1065 1015 1029 1043 1009 974 886 798 791 784 825 867 989 1111 1039 967 895 823 836 849 862 875 809 743 855 967
-643 967 978 988 950 912 856 800 792 785 867 949 951 952 956 959 1011 1063 974 885 877 868 956 1044 1174 1143 1090 1037 974 911 950 989 1028 1067 1076 1086 1095 1105 1054 1003 1032
-662 1032 1062 1069 1075 1131 1024 884 841 815 788 831 875 912 949 1010 973 819 827 875 922 931 940 976 1012 968 923 948 972 997 1021 1009 996 934 873 936 999
-680 999 1014 1028 960 891 904 916 984 1051 1044 1037 946 951 1075 1036 1023 1009 986 962 901 841 893 945 934 924 864 805 903 1001 1019 1036 977 918 939 961 889 818
-698 818 801 784 786 886 936 890 923 955 982 1008 984 960 936 912 953 994 954 913 961 1009 976 942 993 1044 1095 1145 1042 938 884 829 898 968 982 997
-715 997 1011 928 942 956 1019 984 895 903 960 920 838 852 906 960 885 906 901 895 901 908 927 1044 1057 1071 996 922 928 934 869 804 851 899 940 981 1016 1051 1091 1034
-734A034lkk3k3k3k3l2l2l8N9J6J7J7J7K9o8k0P8k8k7Q0q2p0R2N5m1J0J72O3j63j44m7O2O2
-751I74M7M8m3m4Q4p8O8O8o6L2j04j05J00J00M8n0n7M0K8K8m1m1m1m1J9J9J9K0jjNNm1N6R8
-769A152o3j14j7jjn3n3K8K7R6R5R6R5j29j29k2k2N5m2m2N5qqM0M0rj06p2Q9O1j01j1Q5K9
-786A040o7ppQ2Q2L4L3j05j05k4k4j6j6n8n9j9P8P8j9N4N4j52n5k5k6J26J26l7l7P7P6j6j5
-802A051j6j6l9l9P4P4j7j8k4k4O4l3l3O5p3p4j8j9m2m1POL6L5m6m6rj0R8R7l5j31j9P8k0
-820H43k1N0m6r2P1J08J2L0L0J7J8Q7j0r0Ol0l0m1N7P1r1r1P1L8n9m9M9M3M3JJpopoL0L1j7
-839A014j8L0L0q4q3kjjkP3P4m0m0LMm5m5M2M2opj2j3O9O8K2K2n8n9m1m0QQR3R3J3J2q2q3
-859I58kjk9l0K0J9l0l1J9J8nnnnppppK9K9J2q4r2P0J51j1p4K4PPO8O8J9J9m8m9r7r7K4K3
$$ plain form
-734 1034 1031 1029 1006 983 960 937 905 873 835 894 910 927 944 961 990 922 902 980 952 925 1005 923 853 945 1000 959 969 1141 1204 1041 897 850 912 974
-751 974 1021 1069 1026 982 1066 988 1056 1124 1058 1090 986 881 981 1081 1129 1079 1022 1062 1090 1118 1077 1036 995 954 973 992 1011 1031 1030 1029 1034 1039 998 1054 1152
-769 1152 1089 975 958 957 956 903 850 878 905 1001 1096 1192 1287 1158 1029 1007 985 1040 998 956 1011 1003 995 1035 1075 1066 960 888 977 1038 937 926 1011 1040
-786 1040 973 966 959 1041 1123 1157 1190 1085 980 956 932 916 900 842 783 764 842 920 901 955 1009 857 802 777 751 877 1003 966 929 1006 1082 1066 1051
-802 1051 1035 1019 980 941 1015 1089 1072 1054 1030 1006 1070 1037 1004 1069 996 922 904 885 843 802 809 815 851 886 840 794 785 775 873 970 935 804 785 863 843
-820 843 822 872 826 734 805 913 925 955 985 1002 1020 1107 1097 1007 1013 983 953 912 969 1040 949 858 929 967 908 859 908 951 994 995 996 989 983 976 970 1000 1031 1014
-839 1014 996 1026 1056 972 889 887 886 885 883 956 1030 990 950 953 957 912 867 909 951 945 938 926 913 982 1050 1072 1094 1036 977 936 896 904 912 1005 1098 1111 1123 1041 958
-859 958 956 955 926 896 916 935 905 874 893 911 906 901 896 891 884 877 870 863 892 921 933 849 757 827 978 967 893 917 924 931 999 1067 1086 1105 1057 1008 911 814 838 861
-879H61K3K4K5K5n5n6m8m9L2L3P4P5poq8q9K5K5P3P3P3P3J1J1k7k7p3Q8Mr4k9l0q5q4K3K3
-897H27K3K3J31J31K2j40r5O6J11n1qR0l4j31K8K9K2K3o1o2rQ9J06Rl7l8p2K4l0l0R9J00R
-913A164q8j08j07l3J29R6kj7j8llJ00Kj19j19l4O3J11J10lkl5j32j32l5l4l4J11J12m1j37
-929G62QJ05J04J04O1j00q5J3Qq9o6L1N2N2J1J1nj02o3R9J38M0jkN8m0j43J9k4j21J3J4N5
-945I17N6J2J3j01j01l3l2M8M9M8M9%%k2k1O6O6r5LJ27J26OOj40j40m2m3J03J03K2K2r1r1
-962H90L2L1L2L1J6J6l3l3q7q7N8N8m0m1K0p7r6JJ08J1RQK2J20J8p9O3O3K0K0o1o1K9K9k0
-980I90j9J7J6J7J7l9l9J0J0k4k4K5K5n0n0L1L1k9k9K4J20P8k0r5LK6K7Q8j0k1k1k7k6RRR
-998A059RN5N5q5q5l1O6O7l1j29j29J1J1j4j3P2J69qj05l9l8k9O8Q9Q8pj05o2L5K7o9M0L9
$$ plain form
-879 861 884 908 933 958 903 847 799 750 782 815 889 964 957 951 863 774 799 824 897 970 1043 1116 1127 1138 1111 1084 1011 1099 1103 1009 980 950 865 781 804 827
-897 827 850 873 1004 1135 1157 1017 922 988 1099 1048 1040 1130 1096 965 993 1022 1044 1067 1006 944 935 1024 1130 1139 1102 1064 992 1016 986 956 1055 1155 1164
-913 1164 1076 968 861 828 957 1053 1051 1034 1016 1013 1010 1110 1112 993 874 840 903 1014 1124 1121 1119 1084 952 820 785 751 717 828 940 899 762
-929 762 770 875 979 1083 1144 1044 959 972 980 891 825 856 908 960 971 982 977 875 812 911 1049 1089 1088 1086 1144 1104 961 980 956 835 848 862 917
-945 917 973 985 998 897 796 763 731 779 828 876 925 925 925 903 882 948 1014 919 922 1049 1175 1181 1187 1047 907 865 822 925 1028 1050 1072 981 890
-962 890 922 953 985 1016 1032 1048 1015 982 895 808 866 924 884 843 863 786 690 691 799 810 819 827 849 969 987 908 971 1034 1054 1074 1013 952 981 1010 990
-980 990 971 988 1004 1021 1038 999 960 970 980 956 932 957 982 932 882 913 944 915 886 910 1030 1108 1088 993 996 1022 1049 1137 1127 1106 1085 1058 1032 1041 1050 1059
-998 1059 1068 1123 1178 1093 1008 977 1043 1110 1079 950 821 832 843 829 816 888 1057 1049 944 905 867 838 906 995 1083 1076 971 909 944 971 902 942 981
-1014I81L3L3L2L3n0n0j31j31J58J57J2J1o1o2j3j3P1P1m2m2k0k1k0k0J6J6m8M8Q7p5j23L8
-1030H75Q3j4o3o2M8M8L7L8k7j88pR1m1m1l5l4R4R5j8j9L4L4L3L4O3O3n0n0L2L3j6j6qqqq
-1048A022klkkn3n2K8K8P1P1j0rp8p7LMo2o2n1n2K5J87L7n9nmj1j0L8L9rj0noJ1J08J37k5
-1067A150p3p4j6j6j6j7k9k9p8p8J22J22RRl4l4P8P9p6p6p6p6J2J3n2M6M7j15k3P3L6L6P9
-1084I23P8J74k0k4k5q2q2q1q2N9N9N5j39j8j8J9J9L2L3L2L3L8L9L8L9k6k6K3K3r8r7J6J6
-1101I30P8P8kkn3n3nmL0L0j9j8K0K1M9j44l5l4m6m7N4N4J02J02L7L6m4m4q9q9K4K5L7L7m4
-1118I72m3l2l2l1l2J7J7J6J7N9N9J1J1p7p7k8k9%%m8m9J35J34J11q4j08Q5J4J3RJ0l9l9k0
-1135I22k1k1k0NONNO2O2n1n1K9K9p2p2n2J42Q2Q2rqq9q9j8j8L0L1n1n2L4J31J2q4L1L0o9
$$ plain form
-1014 981 1014 1047 1079 1112 1062 1012 881 750 908 1065 1077 1088 1027 965 952 939 1010 1081 1039 997 977 956 936 916 932 948 900 948 1035 960 837 875
-1030 875 958 944 881 819 867 915 952 990 963 775 768 859 818 777 742 708 802 897 879 860 894 928 961 995 1058 1121 1071 1021 1053 1086 1070 1054 1046 1038 1030 1022
-1048 1022 1020 1017 1015 1013 960 908 936 964 1035 1106 1096 1087 1009 932 935 939 877 815 764 712 737 924 961 902 897 893 882 872 910 949 940 930 925 919 930 1038 1175 1150
-1067 1150 1077 1003 987 971 955 938 909 880 802 724 846 968 977 986 952 918 996 1075 999 923 847 771 783 796 744 790 837 722 699 772 808 844 923
-1084 923 1001 1175 1155 1131 1106 1024 942 861 779 838 897 952 813 795 777 796 815 847 880 912 945 983 1022 1060 1099 1073 1047 1070 1093 995 898 914 930
-1101 930 1008 1086 1084 1082 1029 976 971 967 997 1027 1008 990 1010 1031 1080 936 901 867 821 774 828 882 984 1086 1123 1159 1115 1071 982 893 917 942 979 1016 972
-1118 972 929 897 865 834 802 819 836 852 869 928 987 998 1009 932 855 827 798 798 798 750 701 836 970 1081 997 889 974 988 1001 1010 1020 981 942 922
-1135 922 901 880 860 865 871 876 881 943 1005 954 903 932 961 889 817 765 907 989 1071 1062 1054 965 876 858 840 870 901 850 798 832 963 975 891 922 952 883
-1153H83K8k0k1k9O9J11n1J0J07j03j03L7L6j2j2M2M3M2M3l0l0l7l6Jr7m8M9K9K9j3j4L0L0
-1170I63L0L0p6p6k2k2m3N4Or2M8M8opJKPq9K0J9R5R4l8l8J1J1J8J7J8J8o7o7J4J3RRmR4R7
-1189A099%j17j17K8K9K2J20OPK9o8j23L9P8k0p2p2l6l6Q5j3p1p1M3M3M3M4M2M2R7%o4o3o4
-1206H89o3QJ05N7m0l7l7m3m4L5L5J16J15j4j4O1O0k8j25k3k2j0j0n9n8J19J19r1r1o5o5J6
-1222G96J6qpqpR4R3J3J3J8J7QQoj68j31l4M9N0PQJ3J3J3J4q7q7L3L2k5P2J85Q8o0n9j8j7
-1241I31JJm1m1r4LO1O2o6o5J12J12K4K5n7n7J2J3J2J2m5m4MMM1M0M1M0N1N1n7n6m4N4jjj0
-1260A028j0j78q0J17J18j7P9l0j27J5J5m9m9%%n4n5N9N9m7m7O7O6m7m8JR8P6q6m9M7P9j8
-1276I33n8J03L7j24k4k4j3j3j4j3J6J6J6J6mmmmj2j2j1j2L5L4Q4Q3l5l4q3q3k0j9j9k0N4
$$ plain form
-1153 883 911 891 870 841 910 1021 970 980 1087 984 881 918 954 942 930 972 1015 1057 1100 1070 1040 1003 967 968 871 823 872 901 930 917 903 933 963
-1170 963 993 1023 947 871 849 827 784 838 844 752 800 848 842 835 836 838 845 756 776 795 890 984 946 908 919 930 948 965 983 1001 934 867 881 894 903 912 908 1002 1099
-1189 1099 1099 982 865 893 922 944 1064 1070 1077 1106 1038 915 954 1032 1012 940 868 832 796 881 868 797 726 769 812 855 899 941 983 1080 1080 1016 953 889
-1206 889 826 834 939 996 956 919 882 839 795 830 865 981 1096 1082 1068 1129 1189 1161 1036 1013 991 981 971 912 854 973 1092 1001 910 845 780 796
-1222 796 812 804 797 789 782 876 969 982 995 1013 1030 1038 1046 1040 872 741 707 756 806 813 821 834 847 860 874 787 700 733 765 740 812 997 1085 1025 966 948 931
-1241 931 932 933 892 851 757 760 821 883 817 752 864 976 1000 1025 968 911 923 936 948 960 915 871 875 879 920 960 1001 1041 1092 1143 1086 1030 986 1040 1039 1038 1028
-1260 1028 1018 840 760 877 995 978 1057 1027 900 915 930 881 832 832 832 778 723 782 841 794 747 814 880 833 785 786 884 960 874 825 872 951 933
-1276 933 875 978 1015 891 867 843 830 817 803 790 806 822 838 854 850 846 842 838 826 814 803 791 826 860 944 1027 992 958 875 792 772 753 734 714 768
$$ [...]
-1887@
##END=		$$ NMR SPECTRUM
##END=		$$ LINK
