##TITLE=	RP603 14-25 13C.10.fid
##JCAMP-DX=	6.0	$$ MestReNova 14.3.3-33362
##DATA TYPE=	LINK
##BLOCKS=	1    
##ORIGIN=	Mestrelab Research S.L.
##OWNER=	hrzepa
##$MNOVA/METADATA=	(DOCUMENT,BASE64)
eyJuYW1lIjoiL1VzZXJzL2hyemVwYS9Eb3dubG9hZHMvSVVQQUMtRkFJUlNwZWMtbWFpbi9Qcm9jdGV
yLzMwLzMwLUgvMzAtMUgubW5vdmEiLCJwYWdlcyI6W3siaXRlbXMiOlsiMSIgICAgIF19XX0=
##TITLE=	RP603 14-25 13C.10.fid
##JCAMP-DX=	6.0	$$ MestReNova 14.3.3-33362
##DATA TYPE=	NMR SPECTRUM
##DATA CLASS=	XYDATA
##BLOCK_ID=	1
##ORIGIN=	Bruker BioSpin GmbH
##OWNER=	nmrsu
##NUMDIM=	1
##$MNOVA/METADATA=	(ITEM,BASE64)
eyJhbmdsZSI6MCwiYXhlcyI6eyJ4Ijp7Im1heCI6MTYuMDY0MjU5OTk5OTM5MTI1LCJtaW4iOi0zLjc
2Njk0MjMzOTE1NjYyMjZ9LCJ5Ijp7Im1heCI6MTY0Mzc4LjMyODEyNSwibWluIjotMTQ2MTYuOTY3ND
k4Nzc5Mjk3fX0sInBvaW50cyI6W3sieCI6NTMyMSwieSI6NTgzNX0seyJ4Ijo4NzIyLCJ5Ijo1ODM1f
Sx7IngiOjg3MjIsInkiOjgyMDh9LHsieCI6NTMyMSwieSI6ODIwOH0seyJ4Ijo1MzIxLCJ5Ijo1ODM1
fV0sInoiOjB9
##.OBSERVE FREQUENCY=	700.35432466099996418
##.OBSERVE NUCLEUS=	^1H
##.SOLVENT NAME=	CDCl3
##.PULSE SEQUENCE=	zg30
##LONGDATE=	2025/01/15 11:51:39.000
##.ACQUISITIONMODE=	SIMULTANEOUS (DQD)
##$ORIGINAL FORMAT=	Bruker XWIN-NMR
##$MNOVA/SCALES_VERSION=	9
##$PARAMETER FILE=	(acqus, ASCII, /private/var/folders/f6/rjf_tdyn2v98c5c0wvkgn4s80000gq/T/0pDiAE7CRPG0zY$ZkZW5Rw/10/acqus, 0)
$$ ##TITLE= Parameter file, TopSpin 4.1.3
$$ ##JCAMPDX= 5.0
$$ ##DATATYPE= Parameter Values
$$ ##NPOINTS= 1	$$ modification sequence number
$$ ##ORIGIN= Bruker BioSpin GmbH
$$ ##OWNER= nmrsu
$$ $$ 2025-01-15 11:52:06.333 +0000  nmrsu@CZC7167VR1
$$ $$ Z:/700/data/tds/nmr/RP603 14-25 13C/10/acqus
$$ $$ process C:\Bruker\TopSpin4.1.3\prog\mod\dirdata.exe
$$ ##$ACQT0= -2.0981556054023
$$ ##$AMP= (0..31)
$$ 100 100 100 100 100 100 100 100 100 100 100 100 100 100 100 100 100 100
$$ 100 100 100 100 100 100 100 100 100 100 100 100 100 100
$$ ##$AMPCOIL= (0..32)
$$ -1 0 0 0 0 0 0 0 0 0 0 0 0 0 0 0 0 0 0 0 0 0 0 0 0 0 0 0 0 0 0 0 0
$$ ##$AQSEQ= 0
$$ ##$AQ_mod= 3
$$ ##$AUNM= <au_zg>
$$ ##$AUTOPOS= <22 >
$$ ##$BF1= 700.349999998
$$ ##$BF2= 700.349999998
$$ ##$BF3= 700.349999998
$$ ##$BF4= 700.349999998
$$ ##$BF5= 700.349999998
$$ ##$BF6= 700.349999998
$$ ##$BF7= 700.349999998
$$ ##$BF8= 700.349999998
$$ ##$BWFAC= (0..63)
$$ 0 0 0 0 0 0 0 0 0 0 0 0 0 0 0 0 0 0 0 0 0 0 0 0 0 0 0 0 0 0 0 0 0 0 0 0
$$ 0 0 0 0 0 0 0 0 0 0 0 0 0 0 0 0 0 0 0 0 0 0 0 0 0 0 0 0
$$ ##$BYTORDA= 0
$$ ##$CHANFCU= (0..24)
$$ 0 1 0 0 0 0 0 0 0 0 0 0 0 0 0 0 0 0 0 0 0 0 0 0 0
$$ ##$CHANREC= (0..24)
$$ 0 0 0 0 0 0 0 0 0 0 0 0 0 0 0 0 0 0 0 0 0 0 0 0 0
$$ ##$CHEMSTR= <none>
$$ ##$CNST= (0..63)
$$ 1 1 1 1 1 1 1 1 1 1 1 1 1 1 1 1 1 1 1 1 1 1 1 1 1 1 1 1 1 1 1 1 1 1 1 1
$$ 1 1 1 1 1 1 1 1 1 1 1 1 1 1 1 1 1 1 1 1 1 1 1 1 1 1 1 1
$$ ##$CPDPRG= (0..8)
$$ <> <> <> <> <> <> <> <> <>
$$ ##$D= (0..63)
$$ 0 1 0 0 0 0 0 0 0 0 0 0 0 0 0 0 0.0002 0 0 0 0 0 0 0 0 0 0 0 0 0 0 0 0
$$ 0 0 0 0 0 0 0 0 0 0 0 0 0 0 0 0 0 0 0 0 0 0 0 0 0 0 0 0 0 0 0
$$ ##$DATE= 1736941899
$$ ##$DATE_START= 1736941856
$$ ##$DE= 6.901845
$$ ##$DECBNUC= <off>
$$ [...]
$$ ##$ShimPowRng3= (0..63)
$$ 1 1 1 1 1 1 1 1 1 1 1 1 1 1 1 1 1 1 1 1 1 1 1 1 1 1 1 1 1 1 1 1 1 1 1 1
$$ 1 1 1 1 0 0 0 0 0 0 0 0 0 0 0 0 0 0 0 0 0 0 0 0 0 0 0 0
$$ ##$ShimPowType1= 8
$$ ##$ShimPowType2= 8
$$ ##$ShimPowType3= 0
$$ ##$ShimPowType4= 0
$$ ##$ShimPowType5= 0
$$ ##$ShimPowType6= 0
$$ ##$ShimPowType7= 0
$$ ##$ShimPowType8= 0
$$ ##$ShimSysActGrad= (0..63)
$$ 1 2 3 4 13 5 7 11 10 9 6 8 12 18 19 20 21 15 22 23 24 14 25 16 26 17 27
$$ 28 31 32 33 34 35 36 37 38 0 0 0 0 0 0 0 0 0 0 0 0 0 0 0 0 0 0 0 0 0 0
$$ 0 0 0 0 0 0
$$ ##$ShimSysAngle= <>
$$ ##$ShimSysFunc= (0..63)
$$ 1 2 3 4 5 6 7 8 9 10 0 37 38 35 16 15 14 13 12 11 28 27 26 25 24 23 36
$$ 22 30 29 20 21 34 33 32 31 17 18 19 0 0 0 0 0 0 0 0 0 0 0 0 0 0 0 0 0 0
$$ 0 0 0 0 0 0 0
$$ ##$ShimSysMatId= <292722da.dat>
$$ ##$ShimSysMatrix= 1
$$ ##$ShimSysMinMaxUG= 130000
$$ ##$ShimSysOffset= <29 mm>
$$ ##$ShimSysType= 4
$$ ##$ShimUnit= 3
$$ ##$SpectrOsVersion= <4.1.156.20210628>
$$ ##$TCubeEth= <192.168.180.38>
$$ ##$TCubeSeqDevice= <>
$$ ##$TOSITY= <no>
$$ ##$TRIPLO2= 0
$$ ##$TopSpinVersion= <TopSpin 4.1.3>
$$ ##$TrxFreqFormula= (0..23)
$$ <TrxFreqFormula(2.0,700350000.000000,'TRX',Trx(1.0,'TRX 1200.1',1,5.000000,1290.000000))>
$$ <TrxFreqFormula(2.0,700350000.000000,'TRX',Trx(1.0,'TRX 1200.2',1,5.000000,1290.000000))>
$$ <TrxFreqFormula(2.0,700350000.000000,'TRX',Trx(1.0,'TRX 1200.3',1,5.000000,1290.000000))>
$$ <> <> <> <> <> <> <> <> <> <> <> <> <> <> <> <> <> <> <> <> <>
$$ ##$TrxPN= (0..23)
$$ <Z148391> <Z148391> <Z148391> <> <> <> <> <> <> <> <> <> <> <> <> <> <>
$$ <> <> <> <> <> <> <>
$$ ##$TrxSN= (0..23)
$$ <00336> <00337> <00342> <> <> <> <> <> <> <> <> <> <> <> <> <> <> <> <>
$$ <> <> <> <> <>
$$ ##$VCubeEth= (0..23)
$$ <no> <no> <no> <no> <no> <no> <no> <no> <no> <no> <no> <no> <no> <no> <no>
$$ <no> <no> <no> <no> <no> <no> <no> <no> <no>
$$ ##$VTU= 2
$$ ##$VTUETH= <192.168.99.11>
$$ ##$VTUTY= <no>
$$ ##$ValueLine= no
$$ ##$VpuPN= (0..23)
$$ <no> <no> <no> <no> <no> <no> <no> <no> <no> <no> <no> <no> <no> <no> <no>
$$ <no> <no> <no> <no> <no> <no> <no> <no> <no>
$$ ##$VpuSN= (0..23)
$$ <no> <no> <no> <no> <no> <no> <no> <no> <no> <no> <no> <no> <no> <no> <no>
$$ <no> <no> <no> <no> <no> <no> <no> <no> <no>
$$ ##$WBREFAM= (0..31)
$$ 99.8 100 100 100 100 100 100 100 100 100 100 100 100 100 100 100 100 100
$$ 100 100 100 100 100 100 100 100 100 100 100 100 100 100
$$ ##$WBREFLM= (0..31)
$$ 1 0 1 0 0 0 0 0 0 0 0 0 0 0 0 0 0 0 0 0 0 0 0 0 0 0 0 0 0 0 0 0
$$ ##$WBREFPH= (0..31)
$$ 0.05 0 0 0 0 0 0 0 0 0 0 0 0 0 0 0 0 0 0 0 0 0 0 0 0 0 0 0 0 0 0 0
$$ ##$WBSGU= (0..31)
$$ 1 2 4 0 0 0 0 0 0 0 0 0 0 0 0 0 0 0 0 0 0 0 0 0 0 0 0 0 0 0 0 0
$$ ##END=
$$ 
##$DECIM=	1440
##$DSPFVS=	21
##XUNITS=	HZ
##YUNITS=	ARBITRARY UNITS
##FIRSTX=	11250.604788156719223
##LASTX=	-2638.1781369192458442
##DELTAX=	-0.10596381293402784562
##XFACTOR=	1
##YFACTOR=	4.5605320329905083554
##FIRSTY=	394.457733154296875
##MINY=	326.366912841796875
##MAXY=	149434.953125
##NPOINTS=	131072
##XYDATA=	(X++(Y..Y))
$$ [...]
2323C460M26M82N35N78O08O19O10N76N15M28L17J86M2j02k40l62m62n32n72n81n66n29m77
2320D959m18l57k97k40j86j32q0k6K9Q7J48K13K77L41M03M57N01N32N46N37N04M44L56K45
2318H843J12l3j82l24m50n52o24o64o69o47o00n39m70m01l37k80k33j94j63j36j14r8q4p3
2315A088o3n7n1m8m4m2m0l8l8l5l3l1l0k8k6k3k2j9j8j6j5j5j3j2j1rrqqponmmmmllkkkkk
2311B36kkjjjkjjjj%j%%j%JJKKJJJ%%jjllmmnnnmmnmnmllllkj%%JJKLLLKKKJJj%jlllnnnn
2303A48nonmmmllkkjkj%%%jJJJJJJJJKJ%%J%%J%%jj%J%%%%%J%%J%JJ%J%J%J%JJJKJJJJKJJ
2296A37KJKJJKJJKKJLLKLMLLMNOPOQRJ2J3J5J7K0K1K3K4K5K5K3K2J8J4QLlrj5j9k2k4k3k2
2291C65k1j8j5j3j0qoml%JMNPJ0J3J5J7K0K1K3K3K2K0J8J4J0Njqj4k0k4k7k8k8k6k4k2j9j7
$$ y = [3460, 3886, 4368, 4903, 5481, 6089, 6708, 7318, 7894, 8409, 8837, 9154, 9340, 9382, 9280, 9040, 8678, 8216, 7684, 7112, 6531, 5965, 5436, 4959, 4541, 4184, 3887, 3647, 3461, 3329, 3249, 3223, 3252, 3339, 3487, 3700, 3977, 4318, 4721, 5178, 5679, 6211, 6757, 7294, 7798, 8242, 8598, 8843, 8955, 8922, 8740, 8416, 7966, 7414, 6790, 6126, 5457, 4810, 4210, 3671, 3201, 2800, 2463, 2183, 1950, 1756, 1593, 1457, 1343, 1245, 1161, 1088, 1025, 968, 917, 869, 825, 783, 743, 705, 667, 632, 599, 568, 538, 510, 484, 461, 439, 420, 402, 386, 371, 356, 343, 331, 320, 311, 302, 294, 286, 279, 273, 268, 264, 260, 256, 252, 249, 246, 244, 242, 240, 238, 236, 234, 232, 231, 230, 229, 227, 226, 225, 224, 223, 223, 222, 222, 222, 221, 221, 222, 223, 225, 227, 228, 229, 230, 230, 230, 229, 228, 225, 222, 218, 214, 209, 204, 199, 195, 191, 186, 182, 177, 173, 170, 167, 164, 161, 159, 158, 158, 158, 159, 160, 162, 165, 168, 171, 173, 175, 177, 178, 179, 178, 178, 177, 174, 171, 168, 163, 158, 153, 148, 143, 137, 132, 128, 124, 120, 117, 114, 112, 110, 109, 107, 106, 106, 106, 106, 105, 106, 107, 108, 109, 110, 111, 112, 113, 115, 116, 116, 116, 117, 117, 117, 118, 118, 118, 117, 116, 116, 117, 117, 117, 117, 117, 117, 118, 118, 118, 119, 119, 120, 121, 121, 122, 122, 123, 123, 124, 124, 125, 126, 127, 129, 130, 131, 132, 133, 135, 136, 137, 139, 140, 142, 143, 144, 146, 147, 148, 150, 152, 153, 156, 159, 161, 164, 168, 171, 174, 178, 183, 189, 196, 202, 210, 219, 231, 244, 259, 276, 296, 317, 340, 364, 389, 414, 437, 459, 477, 491, 499, 502, 499, 490, 475, 456, 434, 410, 387, 365, 344, 326, 311, 298, 288, 280, 274, 270, 267, 267, 268, 272, 277, 284, 294, 307, 322, 339, 359, 380, 403, 426, 448, 468, 486, 500, 510, 515, 514, 506, 492, 472, 448, 421, 393, 365, 339, 315, 293, 274, 257]
2286B57j5j1j1rqponmllkkkkkjjjkjjkjj%jj%%%j%%j%%jj%%j%kjjjjj%j%%%j%%j%j%%%%j%
2279A35%%%j%%j%%%%%%%%j%%jjjj%%%j%%j%%jj%jj%j%jj%%j%%jj%%%%j%%j%j%j%%jj%j%%%
2272A09%%%%%%%%%%%J%JJ%%j%J%%%j%%jjj%%j%%j%%%jJ%%%J%%Jj%%%%Jj%j%%%%%%%%%%Jj%
2265A06%%%%%%%%%%%%%J%%j%%j%%%%%%%%J%%%%j%j%%Jj%%%%%%%%%jJ%J%%%%%%%j%%%JJ%%%
2258A06%%J%%%%j%%JJ%%J%%J%%J%%J%J%J%%j%%%%%JKJKJKKLMLLLLLLLKK%kjkklllllkkkkk
2250A24jj%%%J%JKLKKLKLLLKJJJj%kkmklmlllllkkjjjj%jj%%%jj%%%j%%%%%%jJ%%j%%%%%%
2243A05J%%%j%%%j%%j%%JJ%%j%%%%%%%jJ%J%j%%%%%%%%%%%%j%J%%%%%%j%%%%j%%%%%%J%%J
2236A04jj%Jj%%J%%%%%%j%%%J%%j%%%%%J%%%%%J%%%j%%%Jj%%%%J%%%%%%j%%%%%%%%%%%%J%
$$ y = [257, 242, 231, 220, 211, 203, 196, 190, 185, 181, 178, 175, 173, 171, 169, 167, 165, 164, 163, 162, 160, 159, 158, 156, 155, 154, 154, 153, 152, 152, 152, 152, 151, 151, 151, 150, 150, 150, 149, 148, 148, 148, 147, 147, 145, 144, 143, 142, 141, 140, 140, 139, 139, 139, 139, 138, 138, 138, 137, 137, 136, 136, 136, 136, 136, 135, 135, 135, 135, 135, 134, 134, 134, 133, 133, 133, 133, 133, 133, 133, 133, 133, 132, 132, 132, 131, 130, 129, 128, 128, 128, 128, 127, 127, 127, 126, 126, 126, 125, 124, 124, 123, 122, 122, 121, 121, 120, 119, 119, 119, 118, 118, 118, 117, 116, 116, 116, 116, 116, 115, 115, 115, 114, 114, 113, 113, 112, 112, 112, 111, 110, 110, 109, 109, 109, 109, 109, 109, 109, 109, 109, 109, 109, 109, 109, 109, 109, 110, 110, 111, 112, 112, 112, 111, 111, 112, 112, 112, 112, 111, 111, 111, 110, 109, 108, 108, 108, 107, 107, 107, 106, 106, 106, 106, 105, 106, 106, 106, 106, 107, 107, 107, 108, 107, 107, 107, 107, 107, 108, 107, 107, 106, 106, 106, 106, 106, 106, 106, 106, 106, 106, 106, 107, 106, 106, 106, 106, 106, 106, 106, 106, 106, 106, 106, 106, 106, 106, 106, 107, 107, 107, 106, 106, 106, 105, 105, 105, 105, 105, 105, 105, 105, 105, 106, 106, 106, 106, 106, 105, 105, 104, 104, 104, 105, 104, 104, 104, 104, 104, 104, 104, 104, 104, 104, 103, 104, 104, 105, 105, 105, 105, 105, 105, 105, 105, 104, 104, 104, 104, 105, 106, 106, 106, 106, 106, 106, 107, 107, 107, 107, 107, 106, 106, 106, 107, 108, 108, 108, 109, 109, 109, 110, 110, 110, 111, 111, 111, 112, 112, 113, 113, 114, 114, 114, 113, 113, 113, 113, 113, 113, 114, 116, 117, 119, 120, 122, 124, 127, 131, 134, 137, 140, 143, 146, 149, 152, 154, 156, 156, 154, 153, 151, 149, 146, 143, 140, 137, 134, 132, 130, 128, 126, 124, 123, 122, 122, 122, 122, 123, 123, 124, 126, 129, 131, 133, 136, 138, 141, 144, 147, 149, 150, 151, 152, 151, 151, 149, 147, 143, 141, 138, 134, 131, 128, 125, 122, 119, 117, 115, 114, 113, 112, 111, 111, 110, 109, 109, 109, 109, 108, 107, 107, 107, 107, 106, 106, 106, 106, 106, 106, 106, 105, 106, 106, 106, 105, 105, 105, 105, 105, 105, 105, 106, 106, 106, 106, 105, 105, 105, 105, 104, 104, 104, 103, 103, 103, 104, 105, 105, 105, 104, 104, 104, 104, 104, 104, 104, 104, 103, 104, 104, 105, 105, 104, 104, 104, 104, 104, 104, 104, 104, 104, 104, 104, 104, 104, 103, 103, 104, 104, 104, 104, 104, 104, 104, 103, 103, 103, 103, 103, 102, 102, 102, 102, 102, 102, 102, 103, 103, 103, 104, 103, 102, 102, 103, 102, 102, 102, 103, 103, 103, 103, 103, 103, 103, 102, 102, 102, 102, 103, 103, 103, 102, 102, 102, 102, 102, 102, 103, 103, 103, 103, 103, 103, 104, 104, 104, 104, 103, 103, 103, 103, 104, 103, 103, 103, 103, 103, 104, 104, 104, 104, 104, 104, 104, 103, 103, 103, 103, 103, 103, 103, 103, 103, 103, 103, 103, 103, 104, 104]
2228A04%%Jj%%%%%j%J%%%Jj%Jj%%%%%%%%%J%%J%j%j%%%J%%j%J%%%%%%%%%%%%%%J%j%j%%%%
2221A04%%j%%%%%%%%%J%%%%%J%%%%%%%J%%j%%%%%%%%j%%j%J%%%%J%j%J%%j%j%%%%j%%%%%j
2214A01j%%%%%%%JJJ%%%J%%%J%%%J%j%%%%%%j%%j%jj%%%Jj%%J%%%J%%%%J%%j%%%j%%%%J%%
2206A03%%%%%J%%%J%J%j%jJ%%%%%J%%j%%%%%%Jj%%j%%%%j%%%J%j%%%%J%%%%%%Jj%%%%%%%%
2199A04%%%%%%jJ%%%%%%%%J%Jj%j%%%%J%%%%%%%%%jJ%%%%%%%%%%%J%%%%%%%%%J%%%j%%%%%
2192A06%%j%%%%%%%j%%%%j%%%J%%%%%%%%j%jJ%%%%%%%jJ%%%%%%%%%%%%%%%%%%%%%%%j%J%%
2184A03%j%%%%%%%J%%J%j%%J%%j%%%%%%%%%j%J%%%%j%%jJ%J%%%j%%%%%%%%%Jj%%JJ%%j%%%
2177A03%%J%%%%j%%%J%%%j%%%%%%%%%%%%%%%%%%%%%%%%%%%%%%%%%jJ%%%%%%J%%%%%%%%%%%
$$ y = [104, 104, 104, 105, 104, 104, 104, 104, 104, 104, 103, 103, 104, 104, 104, 104, 105, 104, 104, 105, 104, 104, 104, 104, 104, 104, 104, 104, 104, 104, 105, 105, 105, 106, 106, 105, 105, 104, 104, 104, 104, 105, 105, 105, 104, 104, 105, 105, 105, 105, 105, 105, 105, 105, 105, 105, 105, 105, 105, 105, 105, 106, 106, 105, 105, 104, 104, 104, 104, 104, 104, 104, 103, 103, 103, 103, 103, 103, 103, 103, 103, 103, 104, 104, 104, 104, 104, 104, 105, 105, 105, 105, 105, 105, 105, 105, 106, 106, 106, 105, 105, 105, 105, 105, 105, 105, 105, 105, 104, 104, 104, 103, 103, 104, 104, 104, 104, 104, 105, 105, 104, 104, 105, 105, 105, 104, 104, 103, 103, 103, 103, 103, 102, 102, 102, 102, 102, 102, 101, 100, 100, 100, 100, 100, 100, 100, 100, 101, 102, 103, 103, 103, 103, 104, 104, 104, 104, 105, 105, 105, 105, 106, 106, 105, 105, 105, 105, 105, 105, 105, 104, 104, 104, 103, 103, 102, 101, 101, 101, 101, 102, 101, 101, 101, 102, 102, 102, 102, 103, 103, 103, 103, 103, 104, 104, 104, 103, 103, 103, 103, 102, 102, 102, 102, 102, 103, 103, 103, 103, 103, 103, 103, 103, 104, 104, 104, 104, 105, 105, 106, 106, 105, 105, 104, 105, 105, 105, 105, 105, 105, 106, 106, 106, 105, 105, 105, 105, 105, 105, 105, 106, 105, 105, 105, 104, 104, 104, 104, 104, 103, 103, 103, 103, 104, 104, 103, 103, 103, 103, 103, 104, 104, 104, 104, 104, 104, 104, 105, 104, 104, 104, 104, 104, 104, 104, 104, 104, 104, 104, 104, 104, 104, 104, 103, 104, 104, 104, 104, 104, 104, 104, 104, 104, 105, 105, 106, 105, 105, 104, 104, 104, 104, 104, 105, 105, 105, 105, 105, 105, 105, 105, 105, 105, 104, 105, 105, 105, 105, 105, 105, 105, 105, 105, 105, 105, 105, 106, 106, 106, 106, 106, 106, 106, 106, 106, 106, 107, 107, 107, 107, 106, 106, 106, 106, 106, 106, 106, 106, 105, 105, 105, 105, 105, 105, 105, 105, 104, 104, 104, 104, 104, 103, 103, 103, 103, 104, 104, 104, 104, 104, 104, 104, 104, 104, 103, 103, 102, 103, 103, 103, 103, 103, 103, 103, 103, 102, 103, 103, 103, 103, 103, 103, 103, 103, 103, 103, 103, 103, 103, 103, 103, 103, 103, 103, 103, 103, 103, 103, 103, 103, 102, 102, 103, 103, 103, 103, 102, 102, 102, 102, 102, 102, 102, 102, 103, 103, 103, 104, 104, 103, 103, 103, 104, 104, 104, 103, 103, 103, 103, 103, 103, 103, 103, 103, 103, 102, 102, 103, 103, 103, 103, 103, 102, 102, 102, 101, 102, 102, 103, 103, 103, 103, 102, 102, 102, 102, 102, 102, 102, 102, 102, 102, 103, 102, 102, 102, 103, 104, 104, 104, 103, 103, 103, 103, 103, 103, 104, 104, 104, 104, 104, 103, 103, 103, 103, 104, 104, 104, 104, 103, 103, 103, 103, 103, 103, 103, 103, 103, 103, 103, 103, 103, 103, 103, 103, 103, 103, 103, 103, 103, 103, 103, 103, 103, 103, 103, 103, 103, 103, 103, 103, 103, 103, 102, 103, 103, 103, 103, 103, 103, 103, 104, 104, 104, 104, 104, 104, 104, 104, 104, 104, 104, 104]
2170A04%%%%J%%%%%jJ%%%%%%%j%J%%%j%%j%%JJj%%%%%%%%%%%J%j%J%%%jJ%%%J%%%%j%%%%%
2163A05%%j%%j%JJ%%%%%%%J%%%%%j%Jj%%%%%%%%%%J%%%j%J%%%%%%j%j%%%J%%j%%%%%%%%%J
2155A05%%J%%j%j%%J%%%%%j%%%%%%J%%%%%%j%%%J%%%%%%%%%%%j%%%j%%%jJJ%%%j%%%J%Jj%
2148A04%%%j%%%%%%%%%%%J%%j%%Jj%%J%%j%%%j%%%%%%%%J%%%%j%%%%%%%%%%%%%jJj%%%J%%
2141A02%%%%%%J%%j%%jJ%%J%%%j%%%%%%%%j%%%%%J%%%%%%%%%%%%%%%%%%%%%%%%J%j%%%%%%
2133A02%%%%j%J%%%%%j%%%%%JJ%j%J%j%%%%%%%%%%%%%%%%%%%%%%%%%%j%J%J%%%j%%%J%%%j
2126A02%%%%%%%%%%%%J%%%%%%j%%j%Jj%%J%%%%%%%%%%%%%%J%j%%%%Jj%%%%j%%%%J%%%%%%%
2119A02%%%%%%%%%j%%%%%%J%%%%%%%%%%%%%%%J%%Jj%Jj%%%%%%%jJ%%%%%%%%%%%%%%%%%%%%
$$ y = [104, 104, 104, 104, 104, 105, 105, 105, 105, 105, 105, 104, 105, 105, 105, 105, 105, 105, 105, 105, 104, 104, 105, 105, 105, 105, 104, 104, 104, 103, 103, 103, 104, 105, 104, 104, 104, 104, 104, 104, 104, 104, 104, 104, 104, 104, 105, 105, 104, 104, 105, 105, 105, 105, 104, 105, 105, 105, 105, 106, 106, 106, 106, 106, 105, 105, 105, 105, 105, 105, 105, 105, 104, 104, 104, 103, 103, 104, 105, 105, 105, 105, 105, 105, 105, 105, 106, 106, 106, 106, 106, 106, 105, 105, 106, 105, 105, 105, 105, 105, 105, 105, 105, 105, 105, 105, 106, 106, 106, 106, 105, 105, 106, 106, 106, 106, 106, 106, 106, 105, 105, 104, 104, 104, 104, 105, 105, 105, 104, 104, 104, 104, 104, 104, 104, 104, 104, 104, 105, 105, 105, 106, 106, 106, 105, 105, 104, 104, 104, 105, 105, 105, 105, 105, 105, 104, 104, 104, 104, 104, 104, 104, 105, 105, 105, 105, 105, 105, 105, 104, 104, 104, 104, 105, 105, 105, 105, 105, 105, 105, 105, 105, 105, 105, 105, 104, 104, 104, 104, 103, 103, 103, 103, 102, 103, 104, 104, 104, 104, 103, 103, 103, 103, 104, 104, 105, 104, 104, 104, 104, 104, 103, 103, 103, 103, 103, 103, 103, 103, 103, 103, 103, 103, 104, 104, 104, 103, 103, 103, 104, 103, 103, 103, 104, 104, 104, 103, 103, 103, 103, 102, 102, 102, 102, 102, 102, 102, 102, 102, 103, 103, 103, 103, 103, 102, 102, 102, 102, 102, 102, 102, 102, 102, 102, 102, 102, 102, 102, 101, 102, 101, 101, 101, 101, 102, 102, 102, 102, 102, 102, 102, 102, 102, 103, 103, 103, 102, 102, 102, 101, 102, 102, 102, 103, 103, 103, 103, 102, 102, 102, 102, 102, 102, 102, 102, 102, 101, 101, 101, 101, 101, 101, 102, 102, 102, 102, 102, 102, 102, 102, 102, 102, 102, 102, 102, 102, 102, 102, 102, 102, 102, 102, 102, 102, 102, 102, 102, 103, 103, 102, 102, 102, 102, 102, 102, 102, 102, 102, 102, 102, 101, 101, 102, 102, 102, 102, 102, 102, 101, 101, 101, 101, 101, 101, 102, 103, 103, 102, 102, 103, 103, 102, 102, 102, 102, 102, 102, 102, 102, 102, 102, 102, 102, 102, 102, 102, 102, 102, 102, 102, 102, 102, 102, 102, 102, 102, 102, 102, 101, 101, 102, 102, 103, 103, 103, 103, 102, 102, 102, 102, 103, 103, 103, 103, 102, 102, 102, 102, 102, 102, 102, 102, 102, 102, 102, 102, 102, 103, 103, 103, 103, 103, 103, 103, 102, 102, 102, 101, 101, 102, 101, 101, 101, 102, 102, 102, 102, 102, 102, 102, 102, 102, 102, 102, 102, 102, 102, 102, 103, 103, 102, 102, 102, 102, 102, 103, 102, 102, 102, 102, 102, 101, 101, 101, 101, 101, 102, 102, 102, 102, 102, 102, 102, 102, 102, 102, 102, 102, 102, 102, 102, 102, 102, 101, 101, 101, 101, 101, 101, 101, 102, 102, 102, 102, 102, 102, 102, 102, 102, 102, 102, 102, 102, 102, 102, 102, 103, 103, 103, 104, 103, 103, 104, 103, 103, 103, 103, 103, 103, 103, 103, 102, 103, 103, 103, 103, 103, 103, 103, 103, 103, 103, 103, 103, 103, 103, 103, 103, 103, 103, 103, 103, 103]
2111A03J%%%%j%j%%%J%%J%%j%%%%%%j%%%%%Jj%%%%%%%%%jJ%%%%%JJ%j%%%%%%J%%j%J%%%%%
2104A04%%%%%%j%%%%%%%%%j%%%%%J%%%%J%j%%%j%%%%%%%J%Jj%%%%j%%%%J%%j%%J%%%%%%%%
2097A03%%%%%%%%%%J%%%j%%j%%%%j%%%%%%%%%J%%J%j%%%J%%%%%%%%%j%%Jj%%%JjJ%%%%%%j
2089A02%%%j%%J%%%%%%J%%%%%%%%%j%%%%%%%%%%%%j%J%%%%%%%%%%%%%%j%%%J%%J%%%%%%%%
2082A03%%%%%j%%%%jJ%%%%%%%%J%%%j%j%%%JjJ%%j%%J%j%%%%JjJ%%%%%%j%J%%%%%j%%%%%%
2075A01%%%J%%%%%%%%j%%%J%%%%%%jj%%%J%%%%%%%%%J%%%%%%%%j%%%J%%%%%%%j%%J%%j%%%
2067A01%%%J%%%%j%J%%j%%%%%%%%%%%%%j%J%%%%J%j%%%%J%%%j%%%%%%jJ%J%%%j%%j%Jj%%%
2060A00J%J%%%%%%j%%J%%%%%%j%%J%%j%J%j%%%Jj%%%%%%J%%J%%%%%%j%j%%%jJ%J%jJ%%%%%
$$ y = [103, 104, 104, 104, 104, 104, 103, 103, 102, 102, 102, 102, 103, 103, 103, 104, 104, 104, 103, 103, 103, 103, 103, 103, 103, 102, 102, 102, 102, 102, 102, 103, 102, 102, 102, 102, 102, 102, 102, 102, 102, 102, 101, 102, 102, 102, 102, 102, 102, 103, 104, 104, 103, 103, 103, 103, 103, 103, 103, 104, 104, 104, 103, 103, 104, 104, 104, 104, 104, 104, 104, 104, 104, 104, 104, 104, 103, 103, 103, 103, 103, 103, 103, 103, 103, 103, 102, 102, 102, 102, 102, 102, 103, 103, 103, 103, 103, 104, 104, 103, 103, 103, 103, 102, 102, 102, 102, 102, 102, 102, 102, 103, 103, 104, 103, 103, 103, 103, 103, 102, 102, 102, 102, 102, 103, 103, 103, 102, 102, 102, 103, 103, 103, 103, 103, 103, 103, 103, 103, 103, 103, 103, 103, 103, 103, 103, 103, 103, 103, 104, 104, 104, 104, 103, 103, 103, 102, 102, 102, 102, 102, 101, 101, 101, 101, 101, 101, 101, 101, 101, 101, 102, 102, 102, 103, 103, 102, 102, 102, 102, 103, 103, 103, 103, 103, 103, 103, 103, 103, 103, 102, 102, 102, 103, 102, 102, 102, 102, 103, 102, 103, 103, 103, 103, 103, 103, 103, 102, 102, 102, 102, 101, 101, 101, 102, 102, 102, 102, 102, 102, 102, 103, 103, 103, 103, 103, 103, 103, 103, 103, 103, 102, 102, 102, 102, 102, 102, 102, 102, 102, 102, 102, 102, 102, 101, 101, 102, 102, 102, 102, 102, 102, 102, 102, 102, 102, 102, 102, 102, 102, 102, 101, 101, 101, 101, 102, 102, 102, 103, 103, 103, 103, 103, 103, 103, 103, 103, 103, 103, 103, 103, 103, 102, 102, 102, 102, 102, 101, 102, 102, 102, 102, 102, 102, 102, 102, 102, 103, 103, 103, 103, 102, 102, 101, 101, 101, 101, 102, 101, 102, 102, 102, 101, 101, 101, 102, 102, 101, 101, 101, 101, 101, 102, 101, 102, 102, 102, 102, 102, 102, 102, 101, 101, 102, 102, 102, 102, 102, 102, 101, 101, 101, 101, 101, 101, 101, 101, 101, 101, 102, 102, 102, 102, 102, 102, 102, 102, 102, 101, 101, 101, 101, 102, 102, 102, 102, 102, 102, 102, 101, 100, 100, 100, 100, 101, 101, 101, 101, 101, 101, 101, 101, 101, 101, 102, 102, 102, 102, 102, 102, 102, 102, 102, 101, 101, 101, 101, 102, 102, 102, 102, 102, 102, 102, 102, 101, 101, 101, 102, 102, 102, 101, 101, 101, 101, 101, 101, 101, 102, 102, 102, 102, 102, 101, 101, 102, 102, 102, 101, 101, 101, 101, 101, 101, 101, 101, 101, 101, 101, 101, 101, 101, 100, 100, 101, 101, 101, 101, 101, 102, 102, 101, 101, 101, 101, 101, 102, 102, 102, 102, 101, 101, 101, 101, 101, 101, 101, 100, 101, 101, 102, 102, 102, 102, 101, 101, 101, 100, 100, 101, 100, 100, 100, 100, 101, 101, 102, 102, 102, 102, 102, 102, 102, 101, 101, 101, 102, 102, 102, 102, 102, 102, 102, 101, 101, 101, 102, 102, 102, 101, 101, 102, 102, 101, 101, 101, 101, 102, 101, 101, 101, 101, 101, 101, 101, 102, 102, 102, 103, 103, 103, 103, 103, 103, 103, 102, 102, 101, 101, 101, 101, 100, 101, 101, 102, 102, 101, 102, 102, 102, 102, 102, 102]
2053A02%%jJJ%%jj%%%%%%%%%%%%Jj%J%%%%%%%%%%%J%%%%%%jJ%j%%%%%J%%j%%%%%J%j%j%%%
2046A01%%J%%%%J%%%%%%%%J%%%j%%%%j%%j%%J%%%%%%%%Jj%%%J%%jJ%j%%%J%%%j%%%%%%%%J
2038A03%%%j%%%%j%J%%%%J%%%j%%%%J%%j%%%J%%Jj%%%%j%%%%%%%%%J%%j%%%%%%%%Jj%%%%j
2031A01%J%%%%%%%%%%J%%%%%%%%jj%%J%%JJ%j%j%J%%%jJ%%%j%J%J%%%%%j%%%%%J%j%%j%%%
2024A02%%%J%%Jj%%%%%%%%j%%%%J%%j%J%j%%%%%%%%%%%j%%%%J%%%%%%%%%%J%%%%j%%J%%%%
2016A03j%%J%j%%%%J%j%%J%%%%%%%%%%%%%%%J%%%J%%%%j%%%%J%%%%%%j%%%%%%jJ%%%j%%%%
2009A03%%j%%%%j%%%J%%%J%J%%%j%%J%j%%J%%%j%%%JJJ%%%%j%%%%%%J%j%%%J%%j%%j%%%J%
2002A05%%%jj%%j%%%%%%%%%%%%%%%%%%%%%%%%J%Jj%%%%j%%%%%J%%J%%jJ%%%%%%%%%%%%%%%
$$ y = [102, 102, 102, 101, 102, 103, 103, 103, 102, 101, 101, 101, 101, 101, 101, 101, 101, 101, 101, 101, 101, 101, 102, 101, 101, 102, 102, 102, 102, 102, 102, 102, 102, 102, 102, 102, 102, 103, 103, 103, 103, 103, 103, 103, 102, 103, 103, 102, 102, 102, 102, 102, 102, 103, 103, 103, 102, 102, 102, 102, 102, 102, 103, 103, 102, 102, 101, 101, 101, 101, 101, 101, 102, 102, 102, 102, 102, 103, 103, 103, 103, 103, 103, 103, 103, 103, 104, 104, 104, 104, 103, 103, 103, 103, 103, 102, 102, 102, 101, 101, 101, 102, 102, 102, 102, 102, 102, 102, 102, 102, 103, 102, 102, 102, 102, 103, 103, 103, 102, 103, 103, 102, 102, 102, 102, 103, 103, 103, 103, 102, 102, 102, 102, 102, 102, 102, 102, 102, 103, 103, 103, 103, 102, 102, 102, 102, 102, 101, 101, 102, 102, 102, 102, 102, 103, 103, 103, 103, 102, 102, 102, 102, 102, 103, 103, 103, 102, 102, 102, 102, 103, 103, 103, 104, 103, 103, 103, 103, 103, 102, 102, 102, 102, 102, 102, 102, 102, 102, 102, 103, 103, 103, 102, 102, 102, 102, 102, 102, 102, 102, 102, 103, 102, 102, 102, 102, 102, 101, 101, 102, 102, 102, 102, 102, 102, 102, 102, 102, 102, 102, 103, 103, 103, 103, 103, 103, 103, 103, 103, 102, 101, 101, 101, 102, 102, 102, 103, 104, 104, 103, 103, 102, 102, 103, 103, 103, 103, 102, 103, 103, 103, 103, 102, 102, 103, 103, 104, 104, 104, 104, 104, 104, 103, 103, 103, 103, 103, 103, 104, 104, 103, 103, 103, 102, 102, 102, 102, 102, 102, 102, 103, 103, 103, 104, 103, 103, 103, 103, 103, 103, 103, 103, 103, 102, 102, 102, 102, 102, 103, 103, 103, 102, 102, 103, 103, 102, 102, 102, 102, 102, 102, 102, 102, 102, 102, 102, 102, 101, 101, 101, 101, 101, 102, 102, 102, 102, 102, 102, 102, 102, 102, 102, 102, 103, 103, 103, 103, 103, 102, 102, 102, 103, 103, 103, 103, 103, 102, 102, 102, 103, 103, 102, 102, 102, 102, 102, 103, 103, 102, 102, 102, 103, 103, 103, 103, 103, 103, 103, 103, 103, 103, 103, 103, 103, 103, 103, 103, 104, 104, 104, 104, 105, 105, 105, 105, 105, 104, 104, 104, 104, 104, 105, 105, 105, 105, 105, 105, 105, 104, 104, 104, 104, 104, 104, 104, 103, 104, 104, 104, 104, 103, 103, 103, 103, 103, 103, 103, 102, 102, 102, 102, 102, 101, 101, 101, 101, 102, 102, 102, 102, 103, 103, 104, 104, 104, 104, 103, 103, 103, 104, 104, 103, 103, 103, 104, 104, 104, 104, 103, 103, 103, 103, 104, 105, 106, 106, 106, 106, 106, 105, 105, 105, 105, 105, 105, 105, 106, 106, 105, 105, 105, 105, 106, 106, 106, 105, 105, 105, 104, 104, 104, 104, 105, 105, 105, 105, 105, 104, 103, 103, 103, 102, 102, 102, 102, 102, 102, 102, 102, 102, 102, 102, 102, 102, 102, 102, 102, 102, 102, 102, 102, 102, 102, 102, 102, 102, 103, 103, 104, 103, 103, 103, 103, 103, 102, 102, 102, 102, 102, 102, 103, 103, 103, 104, 104, 104, 103, 104, 104, 104, 104, 104, 104, 104, 104, 104, 104, 104, 104, 104, 104, 104, 104]
1994A04%%%j%%%j%%j%%%%J%%%%j%%%j%J%%J%%%j%%J%%%j%%%%%%j%JJ%%%%%%j%%J%%%j%%%%
1987A01%%%%%%%%%%%j%%%J%%%J%j%J%%%%%%%%%%%%%%%%%%%%%%%j%%%%J%%%j%%jJ%%%%%%%%
1980A01%J%%%%%%%j%%%%J%J%%%%%%%%%%%jJ%%%%j%%%%%%%%%%%%%J%%%%%%%j%%j%J%%j%j%J
1972A01J%%%J%j%%%%%j%%%J%%%%J%%%%%j%%%%%%%%%%%%j%%jJ%%J%j%%%%%%%%J%%%%%%%%j%
1965A01%%%J%%%%%%%%%%%%%%%%J%jJ%%j%%%%%%%j%%J%%%%%%%%%J%%jj%J%%%%%%j%%J%%%%J
1958A03j%%%%J%J%jj%j%J%%j%%JJ%Jj%%%j%J%j%%%J%%%%j%%%j%%%%%%%%J%%J%%j%%J%%%j%
1950A02%%%%%%%J%%%%%%j%%%J%%%%j%%%%%%J%%%%%%%jj%J%%%%%%%J%%%%%j%J%%J%j%%j%%%
1943A02%%j%J%%J%%%%%jj%J%%J%%%%%%%%%%%%%j%%j%%jJ%%%%%JJ%%j%J%%%jJ%j%%j%%%%%J
$$ y = [104, 104, 104, 104, 103, 103, 103, 103, 102, 102, 102, 101, 101, 101, 101, 101, 102, 102, 102, 102, 102, 101, 101, 101, 101, 100, 100, 101, 101, 101, 102, 102, 102, 102, 101, 101, 101, 102, 102, 102, 102, 101, 101, 101, 101, 101, 101, 101, 100, 100, 101, 102, 102, 102, 102, 102, 102, 102, 101, 101, 101, 102, 102, 102, 102, 101, 101, 101, 101, 101, 101, 101, 101, 101, 101, 101, 101, 101, 101, 101, 101, 100, 100, 100, 100, 101, 101, 101, 101, 102, 102, 101, 101, 102, 102, 102, 102, 102, 102, 102, 102, 102, 102, 102, 102, 102, 102, 102, 102, 102, 102, 102, 102, 102, 102, 102, 102, 101, 101, 101, 101, 101, 102, 102, 102, 102, 101, 101, 101, 100, 101, 101, 101, 101, 101, 101, 101, 101, 101, 101, 102, 102, 102, 102, 102, 102, 102, 102, 101, 101, 101, 101, 101, 102, 102, 103, 103, 103, 103, 103, 103, 103, 103, 103, 103, 103, 103, 102, 103, 103, 103, 103, 103, 102, 102, 102, 102, 102, 102, 102, 102, 102, 102, 102, 102, 102, 102, 103, 103, 103, 103, 103, 103, 103, 103, 102, 102, 102, 101, 101, 102, 102, 102, 101, 101, 100, 100, 101, 102, 102, 102, 102, 103, 103, 102, 102, 102, 102, 102, 102, 101, 101, 101, 101, 102, 102, 102, 102, 102, 103, 103, 103, 103, 103, 103, 102, 102, 102, 102, 102, 102, 102, 102, 102, 102, 102, 102, 102, 101, 101, 101, 100, 101, 101, 101, 102, 102, 101, 101, 101, 101, 101, 101, 101, 101, 101, 102, 102, 102, 102, 102, 102, 102, 102, 102, 101, 101, 101, 101, 101, 102, 102, 102, 102, 102, 102, 102, 102, 102, 102, 102, 102, 102, 102, 102, 102, 102, 103, 103, 102, 103, 103, 103, 102, 102, 102, 102, 102, 102, 102, 102, 101, 101, 101, 102, 102, 102, 102, 102, 102, 102, 102, 102, 102, 103, 103, 103, 102, 101, 101, 102, 102, 102, 102, 102, 102, 102, 101, 101, 101, 102, 102, 102, 102, 102, 103, 102, 102, 102, 102, 102, 103, 103, 104, 104, 103, 102, 102, 101, 101, 102, 102, 102, 101, 101, 101, 102, 103, 103, 104, 103, 103, 103, 103, 102, 102, 103, 103, 102, 102, 102, 102, 103, 103, 103, 103, 103, 102, 102, 102, 102, 101, 101, 101, 101, 101, 101, 101, 101, 101, 102, 102, 102, 103, 103, 103, 102, 102, 102, 103, 103, 103, 103, 102, 102, 102, 102, 102, 102, 102, 102, 102, 103, 103, 103, 103, 103, 103, 103, 102, 102, 102, 102, 103, 103, 103, 103, 103, 102, 102, 102, 102, 102, 102, 102, 103, 103, 103, 103, 103, 103, 103, 103, 102, 101, 101, 102, 102, 102, 102, 102, 102, 102, 102, 103, 103, 103, 103, 103, 103, 102, 102, 103, 103, 103, 104, 104, 103, 103, 103, 102, 102, 102, 102, 102, 102, 101, 101, 102, 102, 102, 103, 103, 103, 103, 103, 103, 102, 101, 101, 102, 102, 102, 103, 103, 103, 103, 103, 103, 103, 103, 103, 103, 103, 103, 103, 103, 102, 102, 102, 101, 101, 101, 100, 101, 101, 101, 101, 101, 101, 102, 103, 103, 103, 102, 102, 103, 103, 103, 103, 102, 103, 103, 102, 102, 102, 101, 101, 101, 101, 101, 101, 102]
1936A02J%J%j%%%%j%J%%%%%%%%j%%%%%%%j%J%%%J%j%%%%J%j%%%%%j%J%%%%%J%%%%%%%%%%%
1929A03%%%%%%%%%%%j%%%jJ%%%%%%%%%%jJ%%J%j%%j%%%%J%%%%%%j%J%%%%%%J%j%%%%%J%%j
1921A02%%%%%%%%%%%%%j%Jj%J%%j%%JjJ%%%j%%%%%J%%jJ%%j%%%%%%%%%%%%%%%%%%%%%%%J%
1914A02%%%%j%%Jj%%J%%j%JJ%%%%%jj%%%%%%%j%%%%J%%%%J%%%%%%%%%%%%j%%J%%%%j%%%%%
1907A01%%J%%%j%%%%%%J%%%j%%%%%%%%%%J%Jj%%%%%%%%%%%j%J%%%%%%%%J%j%%%%%J%%%%%%
1899A03jjJ%%%%%%jJ%%%jJ%%jJ%%%%%%%%%%j%%J%%%%%%j%%%%%%%%%J%%%%%%%%%%%%%%%%j%
1892A01%%J%J%%%%%%j%%%%%%j%%%%%J%%%%j%%%%%J%%%%%%%%%Jj%j%%JJ%%%%%%%%%%%j%%%%
1885A02%%%%%%%J%%%%%%%%%j%%J%%%%j%%%%j%%%%%%%%%%%%J%%j%J%%J%%%%%%%%%%%%jj%%%
$$ y = [102, 103, 103, 104, 104, 103, 103, 103, 103, 103, 102, 102, 103, 103, 103, 103, 103, 103, 103, 103, 103, 102, 102, 102, 102, 102, 102, 102, 102, 101, 101, 102, 102, 102, 102, 103, 103, 102, 102, 102, 102, 102, 103, 103, 102, 102, 102, 102, 102, 102, 101, 101, 102, 102, 102, 102, 102, 102, 103, 103, 103, 103, 103, 103, 103, 103, 103, 103, 103, 103, 103, 103, 103, 103, 103, 103, 103, 103, 103, 103, 103, 102, 102, 102, 102, 101, 102, 102, 102, 102, 102, 102, 102, 102, 102, 102, 102, 101, 102, 102, 102, 103, 103, 102, 102, 102, 101, 101, 101, 101, 101, 102, 102, 102, 102, 102, 102, 102, 101, 101, 102, 102, 102, 102, 102, 102, 102, 103, 103, 102, 102, 102, 102, 102, 102, 103, 103, 103, 102, 102, 102, 102, 102, 102, 102, 102, 102, 102, 102, 102, 102, 102, 101, 101, 102, 101, 101, 102, 102, 102, 101, 101, 101, 102, 101, 102, 102, 102, 102, 101, 101, 101, 101, 101, 101, 102, 102, 102, 101, 102, 102, 102, 101, 101, 101, 101, 101, 101, 101, 101, 101, 101, 101, 101, 101, 101, 101, 101, 101, 101, 101, 101, 101, 101, 101, 101, 102, 102, 102, 102, 102, 102, 101, 101, 101, 102, 101, 101, 101, 102, 102, 102, 101, 101, 102, 103, 103, 103, 103, 103, 103, 102, 101, 101, 101, 101, 101, 101, 101, 101, 100, 100, 100, 100, 100, 101, 101, 101, 101, 101, 102, 102, 102, 102, 102, 102, 102, 102, 102, 102, 102, 102, 102, 101, 101, 101, 102, 102, 102, 102, 102, 101, 101, 101, 101, 101, 101, 101, 101, 102, 102, 102, 102, 101, 101, 101, 101, 101, 101, 101, 102, 102, 102, 102, 101, 101, 101, 101, 101, 101, 101, 101, 101, 101, 101, 102, 102, 103, 102, 102, 102, 102, 102, 102, 102, 102, 102, 102, 102, 102, 101, 101, 102, 102, 102, 102, 102, 102, 102, 102, 102, 103, 103, 102, 102, 102, 102, 102, 102, 103, 103, 103, 103, 103, 103, 103, 102, 101, 102, 102, 102, 102, 102, 102, 102, 101, 102, 102, 102, 102, 101, 102, 102, 102, 101, 102, 102, 102, 102, 102, 102, 102, 102, 102, 102, 102, 101, 101, 101, 102, 102, 102, 102, 102, 102, 102, 101, 101, 101, 101, 101, 101, 101, 101, 101, 101, 102, 102, 102, 102, 102, 102, 102, 102, 102, 102, 102, 102, 102, 102, 102, 102, 102, 101, 101, 101, 101, 102, 102, 103, 103, 103, 103, 103, 103, 103, 102, 102, 102, 102, 102, 102, 102, 101, 101, 101, 101, 101, 101, 102, 102, 102, 102, 102, 101, 101, 101, 101, 101, 101, 102, 102, 102, 102, 102, 102, 102, 102, 102, 102, 103, 102, 102, 101, 101, 101, 102, 103, 103, 103, 103, 103, 103, 103, 103, 103, 103, 103, 103, 102, 102, 102, 102, 102, 102, 102, 102, 102, 102, 102, 102, 103, 103, 103, 103, 103, 103, 103, 103, 103, 103, 102, 102, 102, 103, 103, 103, 103, 103, 102, 102, 102, 102, 102, 101, 101, 101, 101, 101, 101, 101, 101, 101, 101, 101, 101, 101, 102, 102, 102, 101, 101, 102, 102, 102, 103, 103, 103, 103, 103, 103, 103, 103, 103, 103, 103, 103, 103, 102, 101, 101, 101, 101]
1877A01JJ%%%%%%%%j%%%J%%j%%%%%%%%%%%%%%%%j%%%J%J%%j%%%Jj%%J%%j%%%%%%%%%%%%%J
1870A03%%%%j%j%%%%J%%%%%%%%J%%%%%%%%%%%%%j%%%%%%%%%%%%%Jj%%%%%%J%%%%%%%%%%%%
1863A03j%%%J%%J%%%%j%j%jJ%%%%%j%%%%J%%jJjJ%%%%%%%%%%%%%%%%%%%J%%%%%%%j%%%%%%
1855A02%j%%%%%%%J%%%%%%j%%%%J%%%j%%%J%%%%%%%%%%%%%J%%%%%J%j%j%%%%%j%%%%%%%%%
1848A01JjJ%%%Jj%%jJ%%%J%%%j%%%%%%jJj%%%J%%%%j%%J%%%%%j%%J%%%%%%%j%%%%%%%%%%%
1841A01%%J%%j%%J%%%%jJ%%j%%%%%%%%%%%%%J%j%J%Jj%%%%J%j%%%%%%%%%j%%%%J%%%%j%J%
1833A02%%%J%%%j%%%%%%j%%J%%%%%j%%J%%%%%%%%%%%j%%%J%%%%%%J%%%%%%%%%JJJJJJJJJJ
1826A13J%Jj%kjkkjj%%%j%j%%%J%j%J%%%%%j%%%%%%%%%J%%%%%%%%%%Jj%J%%J%%%%%%%%%%%
$$ y = [101, 102, 103, 103, 103, 103, 103, 103, 103, 103, 103, 102, 102, 102, 102, 103, 103, 103, 102, 102, 102, 102, 102, 102, 102, 102, 102, 102, 102, 102, 102, 102, 102, 102, 102, 101, 101, 101, 101, 102, 102, 103, 103, 103, 102, 102, 102, 102, 103, 102, 102, 102, 103, 103, 103, 102, 102, 102, 102, 102, 102, 102, 102, 102, 102, 102, 102, 102, 102, 103, 103, 103, 103, 103, 102, 102, 101, 101, 101, 101, 101, 102, 102, 102, 102, 102, 102, 102, 102, 102, 103, 103, 103, 103, 103, 103, 103, 103, 103, 103, 103, 103, 103, 103, 102, 102, 102, 102, 102, 102, 102, 102, 102, 102, 102, 102, 102, 102, 103, 102, 102, 102, 102, 102, 102, 102, 103, 103, 103, 103, 103, 103, 103, 103, 103, 103, 103, 103, 103, 102, 102, 102, 102, 103, 103, 103, 104, 104, 104, 104, 104, 103, 103, 102, 102, 101, 102, 102, 102, 102, 102, 102, 101, 101, 101, 101, 101, 102, 102, 102, 101, 102, 101, 102, 102, 102, 102, 102, 102, 102, 102, 102, 102, 102, 102, 102, 102, 102, 102, 102, 102, 102, 102, 103, 103, 103, 103, 103, 103, 103, 103, 102, 102, 102, 102, 102, 102, 102, 102, 101, 101, 101, 101, 101, 101, 101, 101, 102, 102, 102, 102, 102, 102, 102, 101, 101, 101, 101, 101, 102, 102, 102, 102, 101, 101, 101, 101, 102, 102, 102, 102, 102, 102, 102, 102, 102, 102, 102, 102, 102, 102, 103, 103, 103, 103, 103, 103, 104, 104, 103, 103, 102, 102, 102, 102, 102, 102, 101, 101, 101, 101, 101, 101, 101, 101, 101, 101, 102, 101, 102, 102, 102, 102, 103, 102, 102, 102, 101, 102, 102, 102, 102, 103, 103, 103, 103, 102, 102, 102, 102, 102, 102, 102, 101, 102, 101, 101, 101, 101, 102, 102, 102, 102, 102, 101, 101, 101, 102, 102, 102, 102, 102, 102, 101, 101, 101, 102, 102, 102, 102, 102, 102, 102, 102, 101, 101, 101, 101, 101, 101, 101, 101, 101, 101, 101, 101, 101, 101, 102, 102, 102, 101, 101, 101, 102, 102, 102, 102, 102, 101, 102, 102, 102, 101, 101, 101, 101, 101, 101, 101, 101, 101, 101, 101, 101, 101, 101, 102, 102, 101, 101, 102, 102, 103, 102, 102, 102, 102, 102, 103, 103, 102, 102, 102, 102, 102, 102, 102, 102, 102, 102, 101, 101, 101, 101, 101, 102, 102, 102, 102, 102, 101, 101, 102, 102, 102, 102, 102, 103, 103, 103, 103, 102, 102, 102, 102, 102, 102, 102, 101, 101, 101, 102, 102, 102, 102, 102, 102, 101, 101, 101, 102, 102, 102, 102, 102, 102, 102, 102, 102, 102, 102, 102, 101, 101, 101, 101, 102, 102, 102, 102, 102, 102, 102, 103, 103, 103, 103, 103, 103, 103, 103, 103, 103, 104, 105, 106, 107, 108, 109, 110, 111, 112, 113, 114, 114, 115, 114, 114, 112, 111, 109, 107, 106, 105, 105, 105, 105, 104, 104, 103, 103, 103, 103, 104, 104, 103, 103, 104, 104, 104, 104, 104, 104, 103, 103, 103, 103, 103, 103, 103, 103, 103, 103, 104, 104, 104, 104, 104, 104, 104, 104, 104, 104, 104, 105, 104, 104, 105, 105, 105, 106, 106, 106, 106, 106, 106, 106, 106, 106, 106, 106, 106]
1819A06%%J%jj%j%jjJ%j%%%%J%J%%%%%%%%%%%%%%%%%%%%%%%j%%%%J%%%j%J%J%%%%%%J%J%j
1812A06%%%J%%J%jj%%j%%%%%%j%j%%%%%%J%%%%%%j%%%%%%%%j%%%%J%%j%JJj%%%j%%%J%j%%
1804A02J%%%J%%J%%%%%%%%%%%j%%%%%%%%j%%%%%%%%%%%%j%%%%%%%%%%%%%%%J%%%J%%%%j%%
1797A03%j%%%J%%%%%%%%%%%%%%%%J%%%%%%J%%jJ%j%%j%jjJ%J%%%%%%%%%%%%%%%%%%%%%%%%
1790A03%%%%%j%%%J%%j%%J%J%%%%%j%J%%%%%%%%%j%%j%%%%J%J%%%%jJ%%%%%%%%j%%%jJ%%%
1782A03%%%%%%%%%Jj%%%%Jj%%%%%%%%%J%%j%%%%%%%Jjj%J%%J%%%%J%%%%%%j%%%%%j%%%%%%
1775A03%%%Jj%j%J%j%%J%%%%%%%J%%J%%j%%%%%%%%J%%j%jj%%%J%J%j%%%%%J%Jj%%%j%%%%%
1768A03%%%%%%%J%j%%JJ%j%%%%%%%%%j%%J%J%%%j%%%%Jj%%%%%%%%%%%J%%%JJj%%j%%%%J%j
$$ y = [106, 106, 106, 107, 107, 106, 105, 105, 104, 104, 103, 102, 103, 103, 102, 102, 102, 102, 102, 103, 103, 104, 104, 104, 104, 104, 104, 104, 104, 104, 104, 104, 104, 104, 104, 104, 104, 104, 104, 104, 104, 104, 104, 104, 104, 103, 103, 103, 103, 103, 104, 104, 104, 104, 103, 103, 104, 104, 105, 105, 105, 105, 105, 105, 105, 106, 106, 107, 107, 106, 106, 106, 106, 107, 107, 107, 108, 108, 107, 106, 106, 106, 105, 105, 105, 105, 105, 105, 105, 104, 104, 103, 103, 103, 103, 103, 103, 103, 104, 104, 104, 104, 104, 104, 104, 103, 103, 103, 103, 103, 103, 103, 103, 103, 102, 102, 102, 102, 102, 103, 103, 103, 102, 102, 103, 104, 103, 103, 103, 103, 102, 102, 102, 102, 103, 103, 102, 102, 102, 103, 103, 103, 103, 104, 104, 104, 105, 105, 105, 105, 105, 105, 105, 105, 105, 105, 105, 105, 104, 104, 104, 104, 104, 104, 104, 104, 104, 103, 103, 103, 103, 103, 103, 103, 103, 103, 103, 103, 103, 103, 102, 102, 102, 102, 102, 102, 102, 102, 102, 102, 102, 102, 102, 102, 102, 102, 103, 103, 103, 103, 104, 104, 104, 104, 104, 103, 103, 103, 103, 102, 102, 102, 102, 103, 103, 103, 103, 103, 103, 103, 103, 103, 103, 103, 103, 103, 103, 103, 103, 103, 104, 104, 104, 104, 104, 104, 104, 105, 105, 105, 104, 105, 105, 104, 104, 104, 103, 103, 102, 101, 102, 102, 103, 103, 103, 103, 103, 103, 103, 103, 103, 103, 103, 103, 103, 103, 103, 103, 103, 103, 103, 103, 103, 103, 103, 103, 103, 103, 103, 103, 103, 103, 102, 102, 102, 102, 103, 103, 103, 102, 102, 102, 103, 103, 104, 104, 104, 104, 104, 104, 103, 103, 104, 104, 104, 104, 104, 104, 104, 104, 104, 104, 103, 103, 103, 102, 102, 102, 102, 102, 103, 103, 104, 104, 104, 104, 104, 103, 104, 104, 104, 104, 104, 104, 104, 104, 104, 103, 103, 103, 103, 102, 103, 103, 103, 103, 103, 103, 103, 103, 103, 103, 103, 103, 103, 104, 103, 103, 103, 103, 103, 104, 103, 103, 103, 103, 103, 103, 103, 103, 103, 103, 104, 104, 104, 103, 103, 103, 103, 103, 103, 103, 103, 104, 103, 102, 102, 103, 103, 103, 104, 104, 104, 104, 104, 105, 105, 105, 105, 105, 105, 105, 104, 104, 104, 104, 104, 104, 103, 103, 103, 103, 103, 103, 103, 103, 103, 103, 104, 103, 103, 102, 102, 103, 103, 102, 102, 102, 103, 103, 103, 103, 103, 103, 103, 103, 104, 104, 104, 105, 105, 105, 104, 104, 104, 104, 104, 104, 104, 104, 104, 105, 105, 105, 104, 104, 103, 102, 102, 102, 102, 103, 103, 104, 104, 103, 103, 103, 103, 103, 103, 104, 104, 105, 104, 104, 104, 104, 103, 103, 103, 103, 103, 103, 103, 103, 103, 103, 103, 103, 103, 104, 104, 103, 103, 103, 104, 105, 105, 104, 104, 104, 104, 104, 104, 104, 104, 104, 104, 103, 103, 103, 104, 104, 105, 105, 105, 105, 104, 104, 104, 104, 104, 105, 104, 104, 104, 104, 104, 104, 104, 104, 104, 104, 104, 104, 105, 105, 105, 105, 106, 107, 106, 106, 106, 105, 105, 105, 105, 105, 106, 106, 105]
1760A05%%%%Jj%%%%%%jJ%J%%%J%%%j%%%%j%%%%%%%j%J%%%J%%J%%J%J%J%%%%%j%%%%j%%%%%
1753A08J%%j%%J%%%%%%Jj%%%%j%%%j%%%%%J%j%%%%%%%J%%J%%J%J%JJ%%%%j%%%%%%j%%%%%%
1746A11%%%%%JJ%J%%%%jjj%%j%%%j%%jjJ%%%%%%%%%%J%J%J%%%%J%%%%%%jj%%%%%j%%%%%%J
1738A10%J%J%j%%%j%j%%%j%%%%%%%%%%%j%%%%%J%%%%%%%%%%%%%%%%%%%%j%%%%%%%J%%%%%%
1731A08J%%%jj%%J%%%%%%%%J%%%%J%%%%j%%%%%jj%%%J%j%%%%%%J%JJ%%j%J%%%%%%%%%%%j%
1724A09j%J%j%%JJJ%JJJ%%%JJJ%%j%j%jj%j%%%j%%j%%%%%%J%JJ%JJ%JJJ%J%%%jjjjjj%j%%
1717A12%%%JJ%JJJJKJ%JJ%J%j%kjkjjj%%j%j%%j%%j%%J%%JJK%JJJJJJ%%%%jjjjjjjj%j%%%
1709A13%J%%%JJ%JJJ%%%%%jjjj%jj%j%jjJ%j%%jJ%JJJ%%JJ%JKJJ%%%%jjjjjjj%j%j%%%%%%
$$ y = [105, 105, 105, 105, 105, 106, 105, 105, 105, 105, 105, 105, 105, 104, 105, 105, 106, 106, 106, 106, 107, 107, 107, 107, 106, 106, 106, 106, 106, 105, 105, 105, 105, 105, 105, 105, 105, 104, 104, 105, 105, 105, 105, 106, 106, 106, 107, 107, 107, 108, 108, 109, 109, 110, 110, 110, 110, 110, 110, 109, 109, 109, 109, 109, 108, 108, 108, 108, 108, 108, 109, 109, 109, 108, 108, 108, 109, 109, 109, 109, 109, 109, 109, 110, 109, 109, 109, 109, 109, 108, 108, 108, 108, 107, 107, 107, 107, 107, 107, 108, 108, 107, 107, 107, 107, 107, 107, 107, 107, 108, 108, 108, 109, 109, 109, 110, 110, 111, 111, 112, 113, 113, 113, 113, 113, 112, 112, 112, 112, 112, 112, 112, 111, 111, 111, 111, 111, 111, 111, 111, 111, 111, 111, 111, 112, 113, 113, 114, 114, 114, 114, 114, 113, 112, 111, 111, 111, 110, 110, 110, 110, 109, 109, 109, 108, 107, 108, 108, 108, 108, 108, 108, 108, 108, 108, 108, 108, 109, 109, 110, 110, 111, 111, 111, 111, 111, 112, 112, 112, 112, 112, 112, 112, 111, 110, 110, 110, 110, 110, 110, 109, 109, 109, 109, 109, 109, 109, 110, 110, 111, 111, 112, 112, 111, 111, 111, 111, 110, 110, 109, 109, 109, 109, 108, 108, 108, 108, 108, 108, 108, 108, 108, 108, 108, 108, 107, 107, 107, 107, 107, 107, 108, 108, 108, 108, 108, 108, 108, 108, 108, 108, 108, 108, 108, 108, 108, 108, 108, 108, 108, 108, 108, 107, 107, 107, 107, 107, 107, 107, 107, 108, 108, 108, 108, 108, 108, 108, 109, 109, 109, 109, 108, 107, 107, 107, 108, 108, 108, 108, 108, 108, 108, 108, 108, 109, 109, 109, 109, 109, 110, 110, 110, 110, 110, 109, 109, 109, 109, 109, 109, 108, 107, 107, 107, 107, 108, 108, 107, 107, 107, 107, 107, 107, 107, 108, 108, 109, 110, 110, 110, 109, 109, 110, 110, 110, 110, 110, 110, 110, 110, 110, 110, 110, 110, 109, 109, 108, 108, 109, 109, 108, 108, 108, 109, 110, 111, 111, 112, 113, 114, 114, 114, 114, 115, 116, 117, 117, 117, 116, 116, 115, 115, 114, 113, 113, 112, 112, 112, 112, 111, 111, 111, 110, 110, 110, 110, 110, 110, 110, 111, 111, 112, 113, 113, 114, 115, 115, 116, 117, 118, 118, 119, 119, 119, 119, 118, 117, 116, 115, 114, 113, 113, 112, 112, 112, 112, 112, 112, 113, 114, 114, 115, 116, 117, 118, 120, 121, 121, 122, 123, 123, 124, 124, 123, 123, 121, 120, 118, 117, 116, 115, 115, 115, 114, 114, 113, 113, 113, 112, 112, 112, 111, 111, 111, 112, 112, 112, 113, 114, 116, 116, 117, 118, 119, 120, 121, 122, 122, 122, 122, 122, 121, 120, 119, 118, 117, 116, 115, 114, 114, 113, 113, 113, 113, 113, 114, 114, 114, 114, 115, 116, 116, 117, 118, 119, 119, 119, 119, 119, 119, 118, 117, 116, 115, 115, 114, 113, 113, 112, 112, 111, 110, 111, 111, 110, 110, 110, 109, 110, 110, 111, 112, 113, 113, 113, 114, 115, 115, 116, 118, 119, 120, 120, 120, 120, 120, 119, 118, 117, 116, 115, 114, 113, 113, 112, 112, 111, 111, 111, 111, 111, 111, 111]
1702A11j%%%J%J%%J%%j%%%%j%j%j%%%j%%%%J%%%%%%J%J%%%%%J%j%%Jj%%j%%%jj%%%%%%%%J
1695A09%J%%%%%j%%J%%j%%j%%J%%%jJ%%%%%J%%%%%%%J%%%%%jJ%Jjj%%%%%j%J%J%Jj%%%%%J
1687A12%%j%J%%j%%%%%%j%%%J%%%J%%%J%%%Jj%%J%J%%%%%j%%%%J%%%%j%J%%%%%%J%J%%j%%
1680A16j%j%%%%%%%J%%%%J%%J%J%%JJ%JJ%%%%J%J%j%%%%%%%J%J%JKJJKJKKLLKLMLMMOOQQR
1673B00J1J0RRQPNKjlopj0rqpnmlkjjkj%%JJKLLMNOPRRJ0J0J0RRPOLJkklkjJMORJ0J4J6K1
1666C77K5K9L5M2M8N5N9O1O1O0N4M8L8K4Qj1l1m9o0o5o2n5m4l7k8k1j7j4j2rqom%MJ0J6K2
1662E43K8L5M2M9N4N8N9N7N4M8M0K9J5kj9l5m5n0m7l9k8j7nNJ4K4L3M3N6P0Q6J06J23J39J49
1659A672J53J50J43J29J10Q1M2mn7j07j50j73j76j62j38j12q9o8n4m3l6l1k7k4j6qMJ5L0M5
$$ y = [111, 110, 110, 110, 110, 111, 111, 112, 112, 112, 113, 113, 113, 112, 112, 112, 112, 112, 111, 111, 110, 110, 109, 109, 109, 109, 108, 108, 108, 108, 108, 109, 109, 109, 109, 109, 109, 109, 110, 110, 111, 111, 111, 111, 111, 111, 112, 112, 111, 111, 111, 112, 111, 111, 111, 110, 110, 110, 110, 109, 108, 108, 108, 108, 108, 108, 108, 108, 108, 109, 109, 110, 110, 110, 110, 110, 110, 109, 109, 109, 110, 110, 110, 109, 109, 109, 108, 108, 108, 109, 109, 109, 109, 108, 109, 109, 109, 109, 109, 109, 110, 110, 110, 110, 110, 110, 110, 110, 111, 111, 111, 111, 111, 111, 110, 111, 111, 112, 111, 110, 110, 110, 110, 110, 110, 109, 109, 110, 110, 111, 111, 112, 111, 111, 111, 111, 111, 111, 112, 112, 112, 111, 111, 112, 112, 112, 111, 111, 111, 111, 111, 111, 111, 110, 110, 110, 110, 111, 111, 111, 111, 112, 112, 112, 112, 113, 113, 113, 113, 114, 113, 113, 113, 114, 114, 115, 115, 115, 115, 115, 115, 114, 114, 114, 114, 114, 115, 115, 115, 115, 115, 114, 114, 115, 115, 115, 115, 115, 115, 115, 116, 116, 117, 117, 117, 116, 116, 116, 115, 115, 114, 114, 114, 114, 114, 114, 114, 114, 115, 115, 115, 115, 115, 116, 116, 116, 117, 117, 118, 118, 118, 119, 120, 120, 121, 122, 122, 122, 122, 122, 123, 123, 124, 124, 123, 123, 123, 123, 123, 123, 123, 123, 124, 124, 125, 125, 126, 128, 129, 130, 132, 133, 135, 137, 140, 143, 145, 148, 152, 155, 159, 163, 169, 175, 183, 191, 200, 211, 221, 230, 239, 247, 254, 259, 261, 260, 257, 251, 244, 234, 225, 217, 210, 205, 201, 198, 196, 195, 194, 192, 191, 191, 191, 192, 193, 195, 198, 201, 205, 210, 216, 223, 232, 241, 251, 261, 271, 280, 289, 296, 302, 305, 306, 304, 302, 299, 297, 296, 297, 301, 307, 316, 326, 340, 356, 377, 402, 431, 466, 508, 556, 611, 670, 731, 792, 852, 906, 954, 992, 1016, 1024, 1013, 982, 933, 873, 808, 746, 691, 647, 610, 582, 561, 544, 530, 518, 509, 501, 495, 491, 491, 495, 505, 521, 543, 571, 606, 648, 697, 751, 809, 868, 925, 979, 1027, 1067, 1096, 1111, 1109, 1090, 1055, 1010, 960, 913, 874, 846, 829, 824, 829, 843, 867, 900, 943, 999, 1069, 1155, 1261, 1384, 1523, 1672, 1825, 1975, 2118, 2247, 2357, 2438, 2480, 2476, 2419, 2312, 2162, 1989, 1813, 1651, 1513, 1401, 1312, 1244, 1190, 1147, 1111, 1080, 1053, 1029, 1013, 1005, 1009, 1024, 1054, 1099]
1655A099O2Q0R8J17J32J42J48J46J40J30J12Q7N2J1l8q6j28j54j59j48j24r5o8m3k3nJ0K5
1653A520M1N8P9J05J32J58J79J90J93J88J75J55J23Q1K4m3j13j81k28k49k41k13j78j43j12
1650A700q8o9n7m9m2l7k9k0pRK7M8O8R3J17J43J67J85J96J99J94J82J63J34R4M2k2r2j58k12
1647B879k38k37k12j75j37j02p4n2l4k1qNJ9L7O0Q3J04J18J26J29J23J12R4O7L2j4o3j15j58
1644B348j85j90j78j54j27j03q1o4n2m4l8l3k8k1j2jJ2K6M2N8P7R6J14J31J43J47J47J40J28
1641B298J11Q5N1Nm5r8j47j79j91j81j60j31j05q1o3m9m0l2k7k0j4nOJ7K6L4L7L9L5L0K3J1
1637A240lk2m0n8p1p7p6o9o1n0m0l4k7k3k0j7j4j1rlKPJ3K0K7L3M0M7N3N7N7N6N2M7L7K6J0
1633A099rl0n1o7p6p7p2o2n1m1l4k8k4k0j9j6j5j3j1qnkj%%J%kmprj2j3j5j5j5j3j2j0qoo
$$ y = [1099, 1161, 1241, 1339, 1456, 1588, 1730, 1878, 2024, 2164, 2294, 2406, 2493, 2545, 2556, 2518, 2432, 2304, 2150, 1991, 1843, 1719, 1624, 1556, 1513, 1490, 1485, 1495, 1520, 1561, 1619, 1698, 1803, 1935, 2093, 2272, 2462, 2655, 2843, 3018, 3173, 3296, 3377, 3401, 3358, 3245, 3064, 2836, 2587, 2346, 2133, 1955, 1812, 1700, 1612, 1543, 1486, 1437, 1395, 1358, 1329, 1309, 1302, 1311, 1338, 1386, 1454, 1547, 1664, 1807, 1974, 2159, 2355, 2554, 2748, 2930, 3093, 3227, 3321, 3363, 3341, 3249, 3091, 2879, 2641, 2404, 2192, 2017, 1880, 1778, 1704, 1652, 1618, 1597, 1589, 1594, 1613, 1650, 1710, 1793, 1897, 2015, 2141, 2270, 2393, 2505, 2599, 2666, 2698, 2684, 2621, 2506, 2348, 2163, 1973, 1795, 1641, 1514, 1411, 1330, 1266, 1214, 1170, 1132, 1099, 1071, 1050, 1038, 1037, 1049, 1075, 1117, 1175, 1252, 1348, 1462, 1593, 1736, 1883, 2030, 2170, 2298, 2409, 2494, 2545, 2550, 2505, 2407, 2260, 2081, 1890, 1709, 1549, 1418, 1313, 1232, 1169, 1120, 1080, 1048, 1021, 1001, 987, 982, 988, 1005, 1031, 1065, 1102, 1141, 1176, 1206, 1229, 1240, 1237, 1215, 1175, 1117, 1046, 969, 893, 824, 763, 713, 673, 639, 612, 589, 569, 552, 538, 527, 518, 515, 517, 524, 537, 557, 584, 617, 657, 704, 757, 814, 871, 927, 979, 1026, 1063, 1089, 1099, 1090, 1060, 1009, 942, 866, 789, 717, 655, 604, 563, 529, 501, 477, 457, 438, 422, 407, 394, 383, 375, 370, 368, 367, 367, 367, 368, 368, 366, 362, 355, 346, 334, 321, 306, 291, 276, 263, 251, 241, 233, 227, 221]
1629B21onllkj%JKLMNPQQRJ0RQPPNKjmqj0j2j4j3j1rpoommjkkkj%%Jj%jkkllmmlmmlljkkj
1622A37jj%%%%%JJKKKLKKKKKKKJJJ%jkkkkkjj%J%KJLLMNONPOPONLKJjmnoppopnnllkkjj%%
1615A52%JKLKMLMMOOONONMMKJjmmononnmlj%JJLMMOPQQQQPPNMK%lnprrj0qponmkkj%j%%%J
1608A81JKLLMNPPQQPPONMKjlnqrrqponmkj%JJLLMMNMMNLMLKjjlmnonmmlk%%%%%%jjkkkjj%
1600A90JKLNNNNOMMLL%jkmononmljjjJJJK%%jkkkljjjj%jjjjj%JJJKLKLKKJ%klmmnmnkk%%
1593A70%KKKLLKKKJJ%%jj%%JKJKJKJJ%jllnoonnllkjj%JJJKKLMLLKKJ%%kllmnmmlkkjjj%J
1586A46%JJKJJJKKJJKJKJKKJKKJ%jkmlmnmlllkj%%JJ%JKJKJJJ%J%jjjkkkkkkjjjjj%%%J%J
1578A34J%%JJ%JJ%%J%%%J%%%j%kkkkkjjjjj%J%jJJJJ%JJJ%%j%jjjjjjj%%j%%%%%%%jJ%J%J
$$ y = [221, 215, 210, 207, 204, 202, 201, 201, 202, 204, 207, 211, 216, 223, 231, 239, 248, 258, 267, 275, 282, 289, 294, 296, 295, 291, 283, 273, 261, 247, 234, 223, 214, 207, 201, 195, 191, 187, 186, 184, 182, 180, 179, 179, 179, 180, 179, 179, 178, 176, 174, 171, 168, 164, 160, 157, 153, 149, 146, 143, 142, 140, 138, 137, 136, 135, 135, 135, 135, 135, 135, 136, 137, 139, 141, 143, 146, 148, 150, 152, 154, 156, 158, 160, 161, 162, 163, 163, 162, 160, 158, 156, 154, 152, 151, 150, 150, 151, 151, 153, 154, 157, 160, 164, 169, 175, 180, 187, 193, 200, 206, 211, 214, 216, 217, 216, 212, 207, 201, 194, 187, 181, 174, 169, 164, 161, 158, 156, 154, 153, 152, 152, 152, 152, 153, 155, 158, 160, 164, 167, 171, 175, 181, 187, 193, 198, 204, 209, 213, 217, 219, 220, 219, 215, 211, 205, 200, 194, 189, 184, 180, 177, 176, 176, 177, 178, 181, 185, 189, 195, 202, 210, 218, 226, 234, 241, 248, 253, 257, 259, 259, 256, 251, 244, 235, 226, 216, 208, 201, 195, 190, 186, 184, 182, 181, 181, 180, 180, 180, 180, 181, 182, 184, 187, 190, 194, 199, 206, 213, 221, 229, 236, 243, 249, 254, 258, 260, 259, 256, 251, 243, 234, 225, 217, 210, 204, 199, 195, 193, 192, 192, 193, 194, 197, 200, 204, 208, 213, 217, 221, 226, 229, 233, 236, 238, 237, 236, 233, 229, 224, 218, 213, 209, 205, 202, 200, 200, 200, 200, 200, 200, 200, 199, 198, 196, 194, 192, 191, 190, 190, 191, 193, 196, 201, 206, 211, 216, 222, 226, 230, 233, 236, 236, 235, 233, 229, 223, 218, 212, 207, 203, 200, 199, 198, 197, 198, 199, 200, 202, 202, 202, 201, 199, 197, 195, 192, 191, 190, 189, 188, 188, 187, 186, 185, 184, 183, 183, 184, 185, 186, 188, 191, 193, 196, 198, 200, 201, 201, 199, 196, 192, 188, 183, 179, 174, 172, 170, 170, 170, 170, 172, 174, 176, 179, 182, 184, 186, 188, 189, 190, 190, 190, 189, 188, 188, 188, 189, 191, 192, 194, 195, 197, 198, 199, 199, 198, 195, 192, 187, 181, 175, 170, 165, 162, 159, 157, 156, 155, 155, 156, 157, 158, 160, 162, 165, 169, 172, 175, 177, 179, 180, 180, 180, 178, 175, 172, 168, 163, 159, 155, 152, 150, 148, 147, 146, 145, 145, 146, 146, 147, 148, 150, 151, 152, 153, 155, 157, 158, 159, 161, 162, 164, 165, 167, 169, 170, 172, 174, 175, 175, 174, 172, 168, 165, 161, 156, 152, 149, 146, 143, 141, 140, 140, 140, 141, 142, 142, 143, 145, 146, 148, 149, 150, 151, 151, 152, 152, 151, 150, 149, 147, 145, 143, 141, 139, 137, 136, 135, 134, 133, 132, 132, 132, 132, 133, 133, 134, 135, 135, 135, 136, 137, 137, 138, 139, 139, 139, 140, 140, 140, 140, 141, 141, 141, 141, 140, 140, 138, 136, 134, 132, 130, 129, 128, 127, 126, 125, 125, 126, 126, 125, 126, 127, 128, 129, 129, 130, 131, 132, 132, 132, 131, 131, 130, 129, 128, 127, 126, 125, 124, 124, 124, 123, 123, 123, 123, 123, 123, 123, 123, 122, 123, 123, 124, 124, 125]
1571A25j%%%j%J%%%%J%J%%%%j%j%%j%j%%%%%Jj%%%%J%%j%%j%%j%%%%%%%%%%%%J%%JJJKJJK
1564A30KKKKLKKLLKKJ%j%jkklklkjkjkjjjjk%j%jJj%%%%j%%JJ%%J%J%JKJKJLKKKLMMNNPPQ
1556A88RPQPPNMK%kmnoppqqpoonmmmklkljjjjjj%j%Jj%%J%JJJKJKKKKLMMNNOPPRJ0J1J3J3
1550B49J3J3J2J2J0PNJjnqj1j2j4j4j4j3j2j1rqppnmmllkkkkjjj%jj%%J%JJJJJJKJLKLMMN
1544A75OOPQRJ1J1J3J3J3J2J2J1QOL%lorj2j3j5j6j4j3j2j0j0qooomklllkkkkjk%jj%%%%J
1538A38%J%%JJKKKJJLKMMONNPOQPQPPOML%%mnoprj0rrqponnlmllkkjkjj%jj%jJ%%j%j%%%%
1531A25%%%J%J%JJ%JKJLKKKLKKKKKJJ%%kkkllmlllkkkjjjjj%j%j%%j%j%j%%%%%%%%%%%J%J
1524A18%%%%%%J%JJJ%JJ%J%J%Jjj%%j%%j%j%j%jj%j%%J%%J%%%J%JJKKKKNOORJ2J5J4J5J4J4
$$ y = [125, 124, 124, 124, 124, 123, 123, 124, 124, 124, 124, 124, 125, 125, 126, 126, 126, 126, 126, 125, 125, 124, 124, 124, 123, 123, 122, 122, 122, 122, 122, 122, 123, 122, 122, 122, 122, 122, 123, 123, 123, 122, 122, 122, 121, 121, 121, 120, 120, 120, 120, 120, 120, 120, 120, 120, 120, 120, 120, 120, 121, 121, 121, 122, 123, 124, 126, 127, 128, 130, 132, 134, 136, 138, 141, 143, 145, 148, 151, 153, 155, 156, 156, 155, 155, 154, 152, 150, 147, 145, 142, 140, 139, 137, 136, 134, 133, 132, 131, 130, 128, 128, 127, 127, 126, 127, 126, 126, 126, 126, 126, 125, 125, 125, 126, 127, 127, 127, 128, 128, 129, 129, 130, 132, 133, 135, 136, 139, 141, 143, 145, 148, 152, 156, 161, 166, 173, 180, 188, 197, 204, 212, 219, 226, 231, 235, 237, 237, 235, 231, 226, 220, 213, 206, 198, 190, 183, 177, 171, 166, 162, 158, 154, 152, 149, 147, 144, 143, 142, 141, 140, 139, 138, 138, 137, 137, 138, 137, 137, 137, 138, 138, 139, 140, 141, 143, 144, 146, 148, 150, 152, 155, 159, 163, 168, 173, 179, 186, 193, 202, 212, 223, 236, 249, 262, 275, 287, 299, 309, 316, 321, 322, 321, 316, 308, 297, 285, 271, 257, 243, 230, 218, 207, 198, 190, 183, 176, 171, 167, 163, 160, 157, 155, 153, 151, 149, 148, 147, 146, 146, 145, 144, 144, 144, 145, 145, 146, 147, 148, 149, 150, 151, 153, 154, 157, 159, 162, 166, 170, 175, 181, 187, 194, 202, 211, 222, 233, 246, 259, 272, 284, 296, 307, 315, 321, 324, 324, 321, 315, 306, 294, 281, 266, 250, 236, 223, 211, 201, 191, 183, 177, 171, 165, 161, 159, 156, 153, 150, 148, 146, 144, 142, 141, 139, 139, 138, 137, 137, 137, 137, 137, 138, 138, 139, 139, 139, 140, 141, 143, 145, 147, 148, 149, 152, 154, 158, 162, 168, 173, 178, 185, 191, 199, 206, 214, 221, 228, 234, 238, 241, 241, 241, 237, 232, 226, 219, 210, 200, 191, 182, 174, 167, 161, 156, 151, 148, 144, 141, 138, 136, 134, 133, 131, 130, 129, 129, 128, 127, 127, 126, 127, 127, 127, 126, 126, 125, 125, 125, 125, 125, 125, 125, 125, 126, 126, 127, 127, 128, 129, 129, 130, 132, 133, 136, 138, 140, 142, 145, 147, 149, 151, 153, 155, 156, 157, 157, 157, 155, 153, 151, 148, 145, 141, 138, 135, 132, 130, 128, 126, 125, 124, 123, 122, 121, 121, 120, 120, 119, 119, 119, 118, 118, 117, 117, 116, 116, 116, 116, 116, 116, 116, 116, 116, 116, 116, 116, 117, 117, 118, 118, 118, 118, 118, 118, 118, 119, 119, 120, 121, 122, 122, 123, 124, 124, 125, 125, 126, 126, 127, 126, 125, 125, 125, 124, 124, 124, 123, 123, 122, 122, 121, 121, 120, 119, 119, 118, 118, 118, 119, 119, 119, 120, 120, 120, 120, 121, 121, 122, 123, 125, 127, 129, 131, 136, 142, 148, 157, 169, 184, 198, 213, 227, 241]
1517B41J3J3J1PKmj4k2k7k5k0j4j0qnmllkkjjjj%%j%j%Jj%j%j%%%%j%%%%j%%%%J%%%%%j%%
1511A14%%%%%%%j%%%%%%%J%%%%j%jJ%J%%j%%%%%%%%%%%%%%J%%%%%J%%%J%%%J%%%j%%%j%%J
1503A16%%%%%j%%j%j%%%%%%%%%%%%%j%%J%%%%%%%%%%j%%%J%%J%J%%%%j%%%%J%%j%J%%%%j%
1496A14%%%j%%%%%%%%%%%%%%%%%%%J%%%J%%j%J%%%%JJ%J%%%%%Jj%%%j%%j%j%%%%jj%%j%%%
1489A12J%%%%%j%%%%JJj%%%%%%%%%J%%j%%%%%%%%%%jJ%%%%%J%%%J%%%j%J%%%%%%%%%%%%%%
1481A15J%%%JJJJJ%JJJ%j%%%jj%jjjj%%%jj%%%J%JJ%j%%%%%%%%%%%%%%%%%%%%%%%%%j%%j%
1474A15%J%%%Jj%Jj%%J%%%%%%J%%%%%J%%%%%%J%%JJ%%J%%Jj%%%j%%J%%%%%%%j%j%%j%j%%%
1467A19j%%%%%%%%%%%%%jJ%%%J%%%%%%%%%%j%%J%%%%J%J%J%JJJ%%%J%j%%%jj%j%j%j%%j%%
$$ y = [241, 254, 267, 278, 285, 287, 283, 269, 247, 220, 195, 175, 161, 151, 143, 138, 134, 131, 128, 126, 124, 123, 122, 121, 120, 120, 120, 119, 119, 118, 118, 119, 118, 118, 117, 117, 116, 116, 116, 116, 116, 115, 115, 115, 115, 115, 114, 114, 114, 114, 114, 115, 115, 115, 115, 115, 115, 114, 114, 114, 114, 114, 114, 114, 114, 114, 114, 113, 113, 113, 113, 113, 113, 113, 113, 114, 114, 114, 114, 114, 113, 113, 112, 113, 113, 114, 114, 114, 113, 113, 113, 113, 113, 113, 113, 113, 113, 113, 113, 113, 113, 113, 113, 114, 114, 114, 114, 114, 114, 115, 115, 115, 115, 116, 116, 116, 116, 117, 117, 117, 117, 116, 116, 116, 116, 115, 115, 115, 116, 116, 116, 116, 116, 116, 115, 115, 115, 114, 114, 113, 113, 113, 113, 113, 113, 113, 113, 113, 113, 113, 113, 113, 113, 112, 112, 112, 113, 113, 113, 113, 113, 113, 113, 113, 113, 113, 113, 112, 112, 112, 112, 113, 113, 113, 114, 114, 115, 115, 115, 115, 115, 114, 114, 114, 114, 114, 115, 115, 115, 114, 114, 115, 115, 115, 115, 115, 114, 114, 114, 114, 114, 113, 113, 113, 113, 113, 113, 113, 113, 113, 113, 113, 113, 113, 113, 113, 113, 113, 113, 113, 113, 114, 114, 114, 114, 115, 115, 115, 114, 114, 115, 115, 115, 115, 115, 116, 117, 117, 118, 118, 118, 118, 118, 118, 119, 118, 118, 118, 118, 117, 117, 117, 116, 116, 115, 115, 115, 115, 115, 114, 113, 113, 113, 112, 112, 112, 112, 113, 113, 113, 113, 113, 113, 112, 112, 112, 112, 112, 113, 114, 113, 113, 113, 113, 113, 113, 113, 113, 113, 113, 114, 114, 114, 113, 113, 113, 113, 113, 113, 113, 113, 113, 113, 113, 112, 113, 113, 113, 113, 113, 113, 114, 114, 114, 114, 115, 115, 115, 115, 114, 114, 115, 115, 115, 115, 115, 115, 115, 115, 115, 115, 115, 115, 115, 115, 115, 116, 116, 116, 116, 117, 118, 119, 120, 121, 121, 122, 123, 124, 124, 123, 123, 123, 123, 122, 121, 121, 120, 119, 118, 117, 117, 117, 117, 116, 115, 115, 115, 115, 116, 116, 117, 118, 118, 117, 117, 117, 117, 117, 117, 117, 117, 117, 117, 117, 117, 117, 117, 117, 117, 117, 117, 117, 117, 117, 117, 117, 117, 117, 117, 116, 116, 116, 115, 115, 115, 116, 116, 116, 116, 117, 116, 116, 117, 116, 116, 116, 117, 117, 117, 117, 117, 117, 117, 118, 118, 118, 118, 118, 118, 119, 119, 119, 119, 119, 119, 119, 120, 120, 120, 121, 122, 122, 122, 123, 123, 123, 124, 123, 123, 123, 123, 122, 122, 122, 123, 123, 123, 123, 123, 123, 123, 123, 122, 122, 121, 121, 121, 120, 120, 119, 119, 119, 119, 118, 118, 118, 118, 118, 118, 118, 118, 118, 118, 118, 118, 118, 118, 117, 118, 118, 118, 118, 119, 119, 119, 119, 119, 119, 119, 119, 119, 119, 119, 118, 118, 118, 119, 119, 119, 119, 119, 120, 120, 121, 121, 122, 122, 123, 124, 125, 125, 125, 125, 126, 126, 125, 125, 125, 125, 124, 123, 123, 122, 122, 121, 121, 120, 120, 120, 119, 119, 119]
1459A19%%%J%J%j%%%j%%%%%%%J%%%J%%%j%%%J%%%%J%JJ%J%J%%J%%j%jj%%%%j%%%%%j%%%%%
1452A22%%J%%%%%%j%%%%%j%%J%%%%%%J%%%%J%%%J%%%J%J%%J%%%j%%j%%%%j%%J%%%%%%%%%J
1445A27J%JJJ%J%JJ%J%%%%%%%jjj%jj%%j%%JJJ%%%%%J%K%%j%%j%%j%%j%J%%J%J%J%JJKJJK
1437A43J%JJ%JKJ%%J%%%Jj%%%%%%%%%%%j%j%j%%%%Jj%%j%j%%j%%%JJ%JJJKKJKKKLKLKLMLL
1430A84MNNOQRJ1J4J9K5L0L6M0M1M1M0L8L5L0K2J0pk6m6n8o4n9n1m0k9k2j7j4j1qqoomklk
1426A70jkjj%j%%%%%%JJ%J%%J%J%JJJJ%%%JJ%%%%%j%%%jkjkjjkjkjkkjjjjj%%%%%J%JKJJJ
1418A58JJJJJ%%jjjkjj%%J%%%JJ%JJJKJJJKJJJJJ%%Jjjjkjjkkklkj%j%%jJ%J%J%J%J%J%%%
1411A60%%%JJKKKLKLLLMMNMNNOOPPQJ0J1J3J6K0K4K9L6M5N9P4Q7R5R7R4R0Q0P2O0M2J9j3m8
$$ y = [119, 119, 119, 119, 120, 120, 121, 121, 120, 120, 120, 120, 119, 119, 119, 119, 119, 119, 119, 119, 120, 120, 120, 120, 121, 121, 121, 121, 120, 120, 120, 120, 121, 121, 121, 121, 121, 122, 122, 123, 124, 124, 125, 125, 126, 126, 126, 127, 127, 127, 126, 126, 125, 124, 124, 124, 124, 124, 123, 123, 123, 123, 123, 123, 122, 122, 122, 122, 122, 122, 122, 122, 123, 123, 123, 123, 123, 123, 123, 122, 122, 122, 122, 122, 122, 121, 121, 121, 122, 122, 122, 122, 122, 122, 122, 123, 123, 123, 123, 123, 124, 124, 124, 124, 125, 125, 125, 125, 126, 126, 127, 127, 127, 128, 128, 128, 128, 127, 127, 127, 126, 126, 126, 126, 126, 125, 125, 125, 126, 126, 126, 126, 126, 126, 126, 126, 126, 126, 127, 128, 128, 129, 130, 131, 131, 132, 132, 133, 134, 134, 135, 135, 135, 135, 135, 135, 135, 135, 134, 133, 132, 132, 131, 130, 130, 130, 129, 129, 129, 130, 131, 132, 132, 132, 132, 132, 132, 133, 133, 135, 135, 135, 134, 134, 134, 133, 133, 133, 132, 132, 132, 131, 131, 132, 132, 132, 133, 133, 134, 134, 135, 135, 136, 137, 139, 140, 141, 143, 144, 144, 145, 146, 146, 147, 149, 150, 150, 150, 151, 151, 151, 151, 152, 151, 151, 151, 151, 151, 151, 151, 151, 151, 151, 151, 151, 150, 150, 149, 149, 148, 148, 148, 148, 148, 149, 148, 148, 148, 147, 147, 146, 146, 146, 145, 145, 145, 145, 146, 147, 147, 148, 149, 150, 152, 154, 155, 157, 159, 161, 164, 166, 169, 171, 174, 178, 181, 184, 188, 193, 198, 204, 212, 221, 232, 246, 265, 290, 320, 356, 396, 437, 478, 518, 556, 591, 621, 643, 653, 646, 620, 574, 516, 452, 393, 342, 302, 273, 251, 234, 220, 209, 201, 193, 187, 181, 177, 175, 172, 170, 169, 167, 166, 165, 165, 164, 164, 164, 164, 164, 164, 164, 165, 166, 166, 167, 167, 167, 168, 168, 169, 169, 170, 171, 172, 173, 173, 173, 173, 174, 175, 175, 175, 175, 175, 175, 174, 174, 174, 174, 173, 171, 170, 168, 167, 166, 164, 163, 161, 160, 158, 156, 155, 154, 153, 152, 151, 151, 151, 151, 151, 151, 152, 152, 153, 155, 156, 157, 158, 159, 160, 161, 162, 163, 163, 163, 162, 161, 160, 158, 157, 156, 156, 156, 157, 157, 157, 157, 158, 159, 159, 160, 161, 162, 164, 165, 166, 167, 169, 170, 171, 172, 173, 174, 174, 174, 175, 174, 173, 172, 170, 169, 168, 166, 164, 162, 159, 157, 156, 156, 155, 155, 155, 154, 155, 155, 156, 156, 157, 157, 158, 158, 159, 159, 160, 160, 160, 160, 160, 160, 160, 161, 162, 164, 166, 168, 171, 173, 176, 179, 182, 186, 190, 195, 199, 204, 209, 215, 221, 228, 235, 243, 253, 264, 277, 293, 313, 337, 366, 402, 447, 506, 580, 667, 762, 859, 953, 1043, 1123, 1195, 1255, 1297, 1316, 1303, 1255]
1406A255q1j03j22j27j15r3p1n1l6k7k0j4j1rqj0j3j6j8j9j9j7j4j2rpoonmlllkkjjj%%%J
1402A77JKKKKKJJj%kkkmmlmllkljkjj%j%%jj%%%j%%j%%%j%j%%%%%%j%%%J%J%JJJ%JJJKKKK
1394A60JJJ%J%%jkjjkkkjjjjjkjj%j%%%jj%%%%JJJ%%J%J%%j%j%%jj%j%%%%%jJ%JJ%J%%J%J
1387A46J%jj%%%J%J%J%J%JJj%%%j%jj%%jjjj%j%%J%%%%%j%%%%jJ%%%%%%%%J%%%%%%%%%%%%
1380A43%%%%%%%%%jJ%%%%%%%j%JJj%j%%JJ%%%%%J%jJ%%%%%%%%jJ%%%%J%%%JJ%%%J%%%%%J%
1372A50%%j%j%%%J%%%j%%%%%jJ%J%%J%JJ%J%%J%%%J%%%%%%%j%%%%%%%%%%jJ%%%%%j%%%J%%
1365A54%%J%%%%%%%%%J%J%J%%J%JJ%J%%J%%J%%%jJ%%%%%%j%%%%%j%%j%jJ%J%%%j%%%J%%%%
1358A62%%J%%%%J%J%J%%%J%JJ%%%J%%%J%%%%Jj%%%%%%%%%j%%%%%%J%%j%j%%%%%%J%J%%%%%
$$ y = [1255, 1174, 1071, 949, 822, 707, 614, 543, 492, 456, 429, 409, 395, 384, 375, 367, 357, 344, 328, 310, 291, 272, 255, 241, 229, 220, 213, 207, 201, 196, 192, 189, 186, 183, 181, 179, 178, 177, 176, 176, 176, 176, 177, 178, 180, 182, 184, 186, 188, 189, 190, 189, 189, 187, 185, 183, 179, 175, 172, 168, 165, 162, 160, 157, 156, 154, 153, 152, 152, 151, 151, 151, 150, 149, 149, 149, 149, 148, 148, 148, 147, 147, 147, 147, 146, 146, 145, 145, 145, 145, 145, 145, 145, 144, 144, 144, 144, 145, 145, 146, 146, 147, 148, 149, 149, 150, 151, 152, 154, 156, 158, 160, 161, 162, 163, 163, 164, 164, 164, 163, 161, 160, 159, 157, 155, 153, 152, 151, 150, 149, 148, 146, 145, 144, 144, 143, 143, 143, 143, 142, 141, 141, 141, 141, 141, 142, 143, 144, 144, 144, 145, 145, 146, 146, 146, 145, 145, 144, 144, 144, 143, 142, 142, 141, 141, 141, 141, 141, 141, 140, 141, 141, 142, 143, 143, 144, 144, 144, 145, 145, 146, 147, 147, 146, 145, 145, 145, 145, 146, 146, 147, 147, 148, 148, 149, 149, 150, 151, 150, 150, 150, 150, 149, 149, 148, 147, 147, 147, 146, 145, 144, 143, 143, 142, 142, 142, 143, 143, 143, 143, 143, 143, 142, 142, 142, 142, 142, 141, 142, 142, 142, 142, 142, 142, 142, 142, 142, 143, 143, 143, 143, 143, 143, 143, 143, 143, 143, 143, 143, 143, 143, 143, 143, 143, 143, 143, 143, 143, 143, 142, 143, 143, 143, 143, 143, 143, 143, 143, 142, 142, 143, 144, 143, 143, 142, 142, 142, 143, 144, 144, 144, 144, 144, 144, 145, 145, 144, 145, 145, 145, 145, 145, 145, 145, 145, 145, 144, 145, 145, 145, 145, 145, 146, 146, 146, 146, 147, 148, 148, 148, 148, 149, 149, 149, 149, 149, 149, 150, 150, 150, 150, 149, 149, 148, 148, 148, 148, 149, 149, 149, 149, 148, 148, 148, 148, 148, 148, 147, 148, 148, 149, 149, 149, 150, 150, 151, 152, 152, 153, 153, 153, 154, 154, 154, 154, 155, 155, 155, 155, 155, 155, 155, 155, 154, 154, 154, 154, 154, 154, 154, 154, 154, 154, 154, 153, 154, 154, 154, 154, 154, 154, 153, 153, 153, 153, 154, 154, 154, 154, 154, 155, 155, 155, 155, 155, 155, 155, 155, 155, 155, 156, 156, 157, 157, 158, 158, 158, 159, 159, 160, 161, 161, 162, 162, 162, 163, 163, 163, 164, 164, 164, 164, 163, 164, 164, 164, 164, 164, 164, 164, 163, 163, 163, 163, 163, 163, 162, 162, 162, 161, 161, 160, 161, 161, 162, 162, 162, 162, 161, 161, 161, 161, 162, 162, 162, 162, 162, 162, 162, 163, 163, 163, 163, 163, 164, 164, 165, 165, 166, 166, 166, 166, 167, 167, 168, 169, 169, 169, 169, 170, 170, 170, 170, 171, 171, 171, 171, 171, 172, 171, 171, 171, 171, 171, 171, 171, 171, 171, 171, 170, 170, 170, 170, 170, 170, 170, 171, 171, 171, 170, 170, 169, 169, 169, 169, 169, 169, 169, 170, 170, 171, 171, 171, 171, 171, 171]
1350A71JJ%%%%%%%jJ%%J%J%J%%J%J%J%j%%%%%J%%%%%%%%%%J%%%%%j%%%%%%J%j%%%JJJJ%%%
1343A83%%J%%%%J%%%J%%J%JJJ%J%%%Jjjj%%%%%%j%%%%jJj%%%%%%%J%%%%J%%%J%%%J%%J%J%
1336A93%%%%%j%%J%J%%%J%%JJ%%%%J%J%%Jj%%%J%%%%%%j%J%%J%%J%J%J%%%JJ%J%%%%%%%J%
1328B08J%J%%%%j%%%%%J%%J%%%%%J%J%%JJ%J%%%%JJ%J%%J%%J%%%%%%J%%JJ%%%J%%%J%J%J%
1321B28%J%%%%%JJ%%%J%%JJJ%J%J%%%%%J%J%J%%JJ%%%%JJ%%JJ%J%J%%%J%J%J%J%%J%%J%J%
1314B55%JJ%JJ%%JJ%J%JJJ%%%JJ%JJJ%J%%J%J%JJ%J%%J%%JJJ%J%JJ%JJJJJ%JJ%jJJJJJJ%J
1307B96%J%JJJJ%J%JJJJJJJ%JJ%%JJJJJ%JJ%JJ%JJJ%%JJKJJ%J%JJ%JJJJJJJJJJKJJ%J%J%K
1299C50JJJJJJJJJJJJJJJJJJKJJJJJJJJJJJJJKJJKJKKJJJJJJJJJJJKJKJKJJJJKKJJJJKJKJ
$$ y = [171, 172, 173, 173, 173, 173, 173, 173, 173, 173, 172, 173, 173, 173, 174, 174, 175, 175, 176, 176, 176, 177, 177, 178, 178, 179, 179, 178, 178, 178, 178, 178, 178, 179, 179, 179, 179, 179, 179, 179, 179, 179, 179, 179, 180, 180, 180, 180, 180, 180, 179, 179, 179, 179, 179, 179, 179, 180, 180, 179, 179, 179, 179, 180, 181, 182, 183, 183, 183, 183, 183, 183, 184, 184, 184, 184, 184, 185, 185, 185, 185, 186, 186, 186, 187, 187, 188, 189, 190, 190, 191, 191, 191, 191, 192, 191, 190, 189, 189, 189, 189, 189, 189, 189, 188, 188, 188, 188, 188, 187, 188, 187, 187, 187, 187, 187, 187, 187, 187, 188, 188, 188, 188, 188, 189, 189, 189, 189, 190, 190, 190, 190, 191, 191, 191, 192, 192, 193, 193, 193, 193, 193, 193, 193, 192, 192, 192, 193, 193, 194, 194, 194, 194, 195, 195, 195, 196, 197, 197, 197, 197, 197, 198, 198, 199, 199, 199, 200, 199, 199, 199, 199, 200, 200, 200, 200, 200, 200, 200, 199, 199, 200, 200, 200, 201, 201, 201, 202, 202, 203, 203, 204, 204, 204, 204, 205, 206, 206, 207, 207, 207, 207, 207, 207, 207, 207, 208, 208, 209, 209, 210, 210, 210, 210, 210, 209, 209, 209, 209, 209, 209, 210, 210, 210, 211, 211, 211, 211, 211, 211, 212, 212, 213, 213, 213, 214, 215, 215, 216, 216, 216, 216, 216, 217, 218, 218, 219, 219, 219, 220, 220, 220, 221, 221, 221, 221, 221, 221, 221, 222, 222, 222, 223, 224, 224, 224, 224, 225, 225, 225, 225, 226, 226, 227, 227, 228, 228, 228, 229, 229, 229, 229, 229, 229, 230, 231, 231, 231, 231, 232, 232, 232, 233, 234, 235, 235, 236, 236, 237, 237, 237, 237, 237, 237, 238, 238, 239, 239, 240, 240, 240, 241, 242, 242, 242, 242, 242, 243, 244, 244, 244, 245, 246, 246, 247, 247, 248, 248, 248, 248, 249, 249, 250, 250, 251, 251, 252, 252, 252, 253, 253, 253, 254, 254, 255, 255, 255, 256, 257, 257, 258, 259, 259, 259, 260, 261, 261, 262, 262, 263, 264, 265, 265, 265, 265, 266, 267, 267, 268, 269, 270, 270, 271, 271, 271, 272, 272, 273, 273, 274, 275, 275, 276, 276, 276, 277, 277, 277, 278, 279, 280, 280, 281, 281, 282, 283, 283, 284, 285, 286, 287, 288, 288, 289, 290, 290, 289, 290, 291, 292, 293, 294, 295, 295, 296, 296, 297, 297, 298, 299, 300, 301, 301, 302, 302, 303, 304, 305, 306, 307, 308, 309, 309, 310, 311, 311, 311, 312, 313, 314, 315, 316, 316, 317, 318, 318, 319, 320, 320, 321, 322, 323, 323, 323, 324, 325, 327, 328, 329, 329, 330, 330, 331, 332, 332, 333, 334, 335, 336, 337, 338, 339, 340, 341, 342, 344, 345, 346, 346, 347, 347, 348, 348, 350, 351, 352, 353, 354, 355, 356, 357, 358, 359, 360, 361, 362, 363, 364, 365, 366, 367, 368, 370, 371, 372, 373, 374, 375, 376, 377, 378, 379, 380, 381, 382, 383, 385, 386, 387, 389, 390, 392, 394, 395, 396, 397, 398, 399, 400, 401, 402, 403, 404, 405, 407, 408, 410, 411, 413, 414, 415, 416, 417, 419, 421, 422, 423, 424, 425, 427, 428, 430, 431]
1292D31KJKJKJKKKJJJKJKKKJKKKJKLKKKKKJLKKKLLLKMLLMLLKKJJ%%%JJJJ%KJKJKKLKKKLKL
1285E59KKLKKKKKKLKLLKLKLKLLKKLKLLLKLLLLLLLLLLLLMLLLLLLLLLLMLLMLMLMMLMLMLMMMM
1277G62MMLMMMNMLMMNMMMNMNNMNMNNMNNNNMNNNNNMNOONNONONOONOOONPNONOOPOPOPOQOPPO
1270A118PPPPOPQPQQQPQQPQQQQQRRQRQQQRRRRRRRRRJ0RRJ0J0J0J0J0J0J0J0J0J0J0J1J1J0
1264A578J1J1J1J2J1J2J1J2J2J1J2J2J2J2J3J2J2J2J3J2J3J4J3J2J2J4J3J4J4J4J4J4J4J4
1261B003J4J4J5J4J5J4J5J5J4J5J5J6J6J5J6J5J5J6J5J6J6J6J6J6J6J7J7J6J6J6J6J6J7J7
1257B531J7J7J7J7J7J6J7J7J7J7J7J6J7J7J7J7J7J6J7J6J7J6J7J6J7J6J6J7J6J6J6J5J6J5
1254C093J6J6J6J4J5J5J4J4J4J4J4J3J4J3J3J3J3J2J2J2J1J2J0J1J0J1J0J0RRQQQQQPPOOO
$$ y = [431, 433, 434, 436, 437, 439, 440, 442, 444, 446, 447, 448, 449, 451, 452, 454, 456, 458, 459, 461, 463, 465, 466, 468, 471, 473, 475, 477, 479, 481, 482, 485, 487, 489, 491, 494, 497, 500, 502, 506, 509, 512, 516, 519, 522, 524, 526, 527, 528, 528, 528, 528, 529, 530, 531, 532, 532, 534, 535, 537, 538, 540, 542, 545, 547, 549, 551, 554, 556, 559, 561, 563, 566, 568, 570, 572, 574, 576, 578, 581, 583, 586, 589, 591, 594, 596, 599, 601, 604, 607, 609, 611, 614, 616, 619, 622, 625, 627, 630, 633, 636, 639, 642, 645, 648, 651, 654, 657, 660, 663, 667, 670, 673, 676, 679, 682, 685, 688, 691, 694, 697, 701, 704, 707, 711, 714, 718, 721, 725, 729, 732, 736, 739, 743, 746, 750, 754, 758, 762, 766, 770, 773, 777, 781, 785, 790, 794, 797, 801, 805, 810, 814, 818, 822, 827, 831, 836, 841, 845, 850, 854, 859, 864, 868, 873, 878, 883, 888, 892, 897, 902, 907, 912, 917, 921, 926, 932, 938, 943, 948, 954, 959, 965, 970, 976, 982, 987, 993, 999, 1005, 1010, 1017, 1022, 1028, 1033, 1039, 1045, 1052, 1058, 1065, 1071, 1078, 1084, 1092, 1098, 1105, 1112, 1118, 1125, 1132, 1139, 1146, 1152, 1159, 1167, 1174, 1182, 1190, 1198, 1205, 1213, 1221, 1228, 1236, 1244, 1252, 1260, 1268, 1277, 1286, 1294, 1303, 1311, 1319, 1327, 1336, 1345, 1354, 1363, 1372, 1381, 1390, 1399, 1408, 1418, 1427, 1436, 1446, 1456, 1466, 1476, 1486, 1496, 1506, 1516, 1526, 1536, 1546, 1557, 1568, 1578, 1589, 1600, 1611, 1623, 1634, 1646, 1657, 1669, 1681, 1692, 1704, 1716, 1728, 1740, 1753, 1765, 1777, 1789, 1802, 1814, 1827, 1841, 1854, 1866, 1878, 1892, 1905, 1919, 1933, 1947, 1961, 1975, 1989, 2003, 2017, 2031, 2046, 2060, 2075, 2089, 2104, 2119, 2133, 2148, 2163, 2179, 2195, 2210, 2226, 2241, 2256, 2272, 2287, 2303, 2319, 2335, 2351, 2367, 2383, 2400, 2417, 2433, 2449, 2465, 2481, 2497, 2514, 2531, 2548, 2565, 2582, 2599, 2616, 2632, 2649, 2666, 2683, 2700, 2717, 2733, 2750, 2767, 2784, 2801, 2818, 2834, 2851, 2867, 2884, 2900, 2917, 2933, 2950, 2966, 2982, 2999, 3015, 3031, 3047, 3062, 3078, 3093, 3109, 3125, 3141, 3155, 3170, 3185, 3199, 3213, 3227, 3241, 3255, 3268, 3282, 3295, 3308, 3321, 3334, 3346, 3358, 3370, 3381, 3393, 3403, 3414, 3424, 3435, 3445, 3455, 3464, 3473, 3481, 3489, 3497, 3505, 3513, 3520, 3527, 3533, 3539, 3545]
1249C545NNMMLLLLKJJJK%%%jkkkkllmmmmnnnpoopqpqqqqqj0rj0j0j1j0j1j1j2j3j2j4j4j3
1243C295j4j3j4j5j5j4j5j5j4j5j5j5j5j6j6j5j5j5j5j6j6j6j6j5j6j6j6j6j6j7j7j7j6j8
1240B770j7j8j7j8j7j8j7j7j7j7j6j7j7j7j6j7j6j6j6j6j7j7j6j7j5j6j6j5j5j5j5j5j5j5
1236B214j5j4j4j4j4j3j3j3j3j3j3j4j3j4j5j4j4j5j5j5j4j5j5j4j4j4j4j3j3j4j3j2j3j1
1233A747j2j2j1j1j1j1j1j0j0j0j0j0j0j0j0rj0j1j0j1j2j1j2j2j2j1j1j0j1j0j0rj0rrrr
1229A360qrqrrrqrqqrqrqrqqqqqppqpqppqoopoonnnoonomnnonooomnmmnmmmmmnnonooppop
1222I19ppoooonnnmmmmmllllmmlmnnnnnnmnmmmnmmmmnmmlmlmmlmlmmmmlnmmlmmkllkllkkl
1214F40kkllmlkllmmmlmlmllklkllklkljkkjkjkkkjkkjkjlklklklkklkkkkkjkjkkkjkkkkk
$$ y = [3545, 3550, 3555, 3559, 3563, 3566, 3569, 3572, 3575, 3577, 3578, 3579, 3580, 3582, 3582, 3582, 3582, 3581, 3579, 3577, 3575, 3573, 3570, 3567, 3563, 3559, 3555, 3551, 3546, 3541, 3536, 3529, 3523, 3517, 3510, 3502, 3495, 3487, 3479, 3471, 3463, 3455, 3445, 3436, 3426, 3416, 3405, 3395, 3384, 3373, 3361, 3348, 3336, 3322, 3308, 3295, 3281, 3268, 3254, 3239, 3224, 3210, 3195, 3180, 3166, 3151, 3136, 3121, 3106, 3090, 3074, 3059, 3044, 3029, 3014, 2998, 2982, 2966, 2950, 2935, 2919, 2903, 2887, 2871, 2855, 2838, 2821, 2804, 2788, 2770, 2753, 2735, 2718, 2700, 2683, 2665, 2648, 2631, 2614, 2597, 2581, 2564, 2547, 2530, 2514, 2497, 2481, 2465, 2449, 2433, 2416, 2399, 2383, 2366, 2351, 2335, 2319, 2304, 2289, 2274, 2259, 2244, 2229, 2214, 2199, 2185, 2171, 2157, 2143, 2130, 2117, 2104, 2091, 2078, 2065, 2051, 2038, 2024, 2009, 1995, 1981, 1966, 1951, 1936, 1922, 1907, 1892, 1878, 1864, 1850, 1836, 1823, 1810, 1796, 1783, 1771, 1758, 1747, 1735, 1723, 1712, 1701, 1690, 1679, 1668, 1658, 1648, 1638, 1628, 1618, 1608, 1598, 1588, 1579, 1569, 1558, 1548, 1537, 1525, 1514, 1502, 1490, 1478, 1467, 1456, 1446, 1435, 1425, 1415, 1406, 1396, 1387, 1378, 1369, 1360, 1352, 1343, 1335, 1326, 1317, 1308, 1300, 1291, 1283, 1275, 1266, 1258, 1249, 1241, 1232, 1224, 1216, 1208, 1200, 1192, 1185, 1178, 1170, 1163, 1155, 1148, 1141, 1133, 1127, 1121, 1114, 1108, 1102, 1097, 1092, 1087, 1081, 1075, 1070, 1064, 1060, 1055, 1050, 1044, 1039, 1033, 1027, 1021, 1017, 1012, 1008, 1004, 999, 995, 991, 987, 983, 979, 974, 969, 963, 958, 952, 946, 939, 932, 926, 919, 912, 905, 899, 893, 887, 881, 876, 871, 866, 862, 858, 854, 850, 846, 843, 840, 837, 834, 830, 826, 823, 819, 814, 809, 804, 799, 794, 789, 785, 780, 776, 772, 768, 763, 759, 755, 751, 747, 742, 738, 734, 731, 727, 724, 720, 716, 713, 709, 706, 702, 698, 694, 690, 687, 682, 678, 674, 671, 667, 663, 661, 658, 655, 653, 650, 647, 645, 643, 640, 638, 636, 633, 630, 626, 623, 621, 618, 615, 611, 607, 603, 600, 596, 593, 589, 586, 583, 581, 578, 576, 573, 570, 568, 565, 563, 560, 559, 557, 555, 554, 552, 551, 549, 547, 545, 544, 542, 540, 539, 537, 536, 533, 531, 528, 526, 523, 521, 518, 516, 514, 511, 509, 507, 505, 503, 501, 500, 498, 497, 495, 493, 491, 490, 488, 486, 484, 482, 480]
1207D80kkjklkkkkkkkkkjjjkjkjjkjkkj%kjjkkjjjkkkjkkljjkjjjkjjjjk%jj%jjjjjkkjjk
1200C79jkk%jjjjkjjjjjjjjjkjkjjjjkjjjjj%jj%jjkjjjjjj%jjj%%jjj%jjjjj%jjj%%kjkj
1192C11jjjjj%jj%jj%jjj%j%jjjjj%j%jj%jj%jj%j%jj%j%jj%%jjjj%jjj%jJ%jj%jjj%j%%j
1185B66j%jj%%%jjj%j%j%j%j%%jj%jj%j%j%j%j%j%j%%j%j%%jj%jj%%%j%jj%%%j%%%j%%j%%
1178B34j%j%j%%%j%%jj%%%jj%%%j%j%j%%%%kj%%%%j%%%j%%%%%j%j%%%%%%jj%j%j%j%%j%j%
1170B09j%%j%Jj%j%%j%%%%J%jj%%j%%j%%%%j%%j%%%j%j%%%%%%%%%j%%jJ%j%%%j%j%%%%%%j
1163A93%j%%%j%%j%%%%j%j%j%%%jJ%%%%j%%j%%j%%%%%%j%%%%%%j%%%%%%j%%J%%%jj%%%%%%
1156A80%jj%%%%j%%j%%%j%j%%%j%%%%%%%%j%%%%jJ%%%%%%%%j%%%j%%%%%%%%%j%%%%J%%jj%
$$ y = [480, 478, 476, 475, 473, 470, 468, 466, 464, 462, 460, 458, 456, 454, 452, 451, 450, 449, 447, 446, 444, 443, 442, 440, 439, 437, 435, 434, 434, 432, 431, 430, 428, 426, 425, 424, 423, 421, 419, 417, 416, 414, 412, 409, 408, 407, 405, 404, 403, 402, 400, 399, 398, 397, 396, 394, 394, 393, 392, 392, 391, 390, 389, 388, 387, 385, 383, 382, 381, 379, 378, 376, 374, 374, 373, 372, 371, 370, 368, 367, 366, 365, 364, 363, 362, 361, 360, 359, 357, 356, 354, 353, 352, 351, 350, 348, 347, 346, 345, 344, 343, 343, 342, 341, 341, 340, 339, 337, 336, 335, 334, 333, 332, 331, 331, 330, 329, 328, 328, 328, 327, 326, 325, 325, 324, 323, 322, 321, 320, 320, 319, 318, 317, 317, 317, 315, 314, 312, 311, 310, 309, 308, 307, 306, 306, 305, 304, 304, 303, 302, 302, 301, 300, 299, 299, 298, 298, 297, 296, 295, 294, 293, 293, 292, 292, 291, 290, 290, 289, 288, 288, 287, 286, 286, 285, 285, 284, 283, 283, 282, 282, 281, 280, 280, 280, 279, 278, 277, 276, 276, 275, 274, 273, 273, 272, 273, 273, 272, 271, 271, 270, 269, 268, 268, 267, 267, 267, 266, 265, 265, 264, 263, 263, 263, 263, 262, 261, 260, 260, 259, 259, 258, 258, 257, 257, 256, 256, 256, 255, 254, 254, 253, 252, 252, 251, 251, 250, 250, 249, 249, 248, 248, 247, 247, 246, 246, 246, 245, 245, 244, 244, 244, 243, 242, 242, 241, 240, 240, 240, 240, 239, 239, 238, 237, 237, 237, 237, 236, 236, 236, 236, 235, 235, 235, 234, 234, 234, 233, 233, 232, 232, 231, 231, 231, 231, 230, 230, 230, 229, 228, 228, 228, 228, 227, 226, 226, 226, 226, 225, 225, 224, 224, 223, 223, 223, 223, 223, 221, 220, 220, 220, 220, 220, 219, 219, 219, 219, 218, 218, 218, 218, 218, 218, 217, 217, 216, 216, 216, 216, 216, 216, 216, 215, 214, 214, 213, 213, 212, 212, 211, 211, 211, 210, 210, 209, 209, 208, 208, 208, 207, 207, 208, 207, 207, 206, 206, 206, 205, 205, 205, 205, 205, 206, 206, 205, 204, 204, 204, 203, 203, 203, 202, 202, 202, 202, 202, 201, 201, 201, 200, 200, 200, 200, 199, 199, 198, 198, 198, 198, 198, 198, 198, 198, 198, 198, 197, 197, 197, 196, 197, 197, 196, 196, 196, 196, 195, 195, 194, 194, 194, 194, 194, 194, 194, 193, 193, 192, 192, 192, 192, 191, 191, 191, 190, 190, 190, 190, 190, 189, 189, 188, 188, 187, 187, 187, 187, 186, 187, 187, 187, 187, 187, 186, 186, 186, 185, 185, 185, 184, 184, 184, 184, 184, 184, 184, 183, 183, 183, 183, 183, 183, 183, 182, 182, 182, 182, 182, 182, 182, 181, 181, 181, 182, 182, 182, 182, 181, 180, 180, 180, 180, 180, 180, 180, 180, 179, 178, 178, 178, 178, 178, 177, 177, 177, 176, 176, 176, 176, 175, 175, 174, 174, 174, 174, 173, 173, 173, 173, 173, 173, 173, 173, 173, 172, 172, 172, 172, 172, 171, 172, 172, 172, 172, 172, 172, 172, 172, 172, 171, 171, 171, 171, 170, 170, 170, 170, 170, 170, 170, 170, 170, 170, 169, 169, 169, 169, 169, 170, 170, 170, 169, 168, 168]
1148A68%%%%%j%%%%%%%j%%%j%%J%%j%%%%%%%j%%jjJ%%j%j%%%%j%%%%%%Jj%j%%%J%%%%%j%%
1141A59%j%%%%%%%j%%%%%%J%%j%%j%%%%%j%%%%%%%%j%%%%%%%j%%%%%%%%%%%jJJj%%%J%%%j
1134A53%jj%%Jj%%j%%%%%J%%%%Jj%%j%%%%%%%%%j%%%%jj%%J%%%%%J%%%%j%%%%%%%%jj%%%J
1127A47%%%%%%%%j%%%%%%%%J%%%%%%%j%%jJ%%%%j%%j%%%j%%%%%%Jj%%%%%%%%%j%%J%%%%j%
1119A42%%%%%%%%%j%%%J%%%J%j%%%JJj%%j%%%%jJ%%jj%%%%%%%%j%%%%%J%%%%%%j%%%jJj%%
1112A38J%%%%%%%%j%%%%%%J%%%%j%j%%J%j%%%%j%%%%%%%%%%J%%%%%%j%%%%%Jj%%%%%%%j%%
1105A35J%j%%J%jJJ%%jj%%Jj%%%%%%%j%%%Jj%%%%%%%%%J%%%%%%j%%%j%%%%%%%j%%%%%%J%j
1097A32j%%Jj%%%%jJ%%%%J%%%j%Jj%j%%%%J%%J%%%J%%%%jJ%j%Jj%%%JJ%J%J%%%%%%jj%%%j
$$ y = [168, 168, 168, 168, 168, 168, 167, 167, 167, 167, 167, 167, 167, 167, 166, 166, 166, 166, 165, 165, 165, 166, 166, 166, 165, 165, 165, 165, 165, 165, 165, 165, 164, 164, 164, 163, 162, 163, 163, 163, 162, 162, 161, 161, 161, 161, 161, 160, 160, 160, 160, 160, 160, 160, 161, 160, 160, 159, 159, 159, 159, 160, 160, 160, 160, 160, 160, 159, 159, 159, 159, 158, 158, 158, 158, 158, 158, 158, 158, 157, 157, 157, 157, 157, 157, 157, 158, 158, 158, 157, 157, 157, 156, 156, 156, 156, 156, 156, 155, 155, 155, 155, 155, 155, 155, 155, 155, 154, 154, 154, 154, 154, 154, 154, 154, 153, 153, 153, 153, 153, 153, 153, 153, 153, 153, 153, 153, 152, 153, 154, 153, 153, 153, 153, 154, 154, 154, 154, 153, 153, 152, 151, 151, 151, 152, 151, 151, 151, 150, 150, 150, 150, 150, 150, 151, 151, 151, 151, 151, 152, 151, 151, 151, 150, 150, 150, 150, 150, 150, 150, 150, 150, 150, 149, 149, 149, 149, 149, 148, 147, 147, 147, 148, 148, 148, 148, 148, 148, 149, 149, 149, 149, 149, 148, 148, 148, 148, 148, 148, 148, 148, 148, 147, 146, 146, 146, 146, 147, 147, 147, 147, 147, 147, 147, 147, 147, 146, 146, 146, 146, 146, 146, 146, 146, 146, 147, 147, 147, 147, 147, 147, 147, 147, 146, 146, 146, 145, 146, 146, 146, 146, 146, 145, 145, 145, 144, 144, 144, 144, 143, 143, 143, 143, 143, 143, 143, 144, 143, 143, 143, 143, 143, 143, 143, 143, 143, 143, 142, 142, 142, 143, 143, 143, 143, 143, 142, 142, 142, 142, 142, 142, 142, 142, 142, 142, 142, 141, 141, 141, 141, 142, 142, 142, 142, 143, 143, 142, 142, 142, 142, 143, 144, 143, 143, 143, 142, 142, 142, 142, 142, 141, 142, 142, 142, 141, 140, 140, 140, 140, 140, 140, 140, 140, 140, 139, 139, 139, 139, 139, 139, 140, 140, 140, 140, 140, 140, 140, 139, 139, 139, 139, 138, 139, 138, 138, 138, 139, 139, 139, 139, 139, 139, 139, 139, 139, 138, 138, 138, 138, 138, 138, 138, 139, 139, 139, 139, 139, 138, 138, 137, 137, 137, 138, 138, 137, 137, 137, 137, 137, 136, 136, 136, 136, 136, 136, 136, 136, 136, 136, 136, 137, 137, 137, 137, 137, 137, 137, 136, 136, 136, 136, 136, 136, 137, 136, 136, 136, 136, 136, 136, 136, 136, 135, 135, 135, 136, 136, 135, 135, 135, 136, 136, 135, 136, 137, 137, 137, 136, 135, 135, 135, 136, 135, 135, 135, 135, 135, 135, 135, 135, 134, 134, 134, 134, 135, 134, 134, 134, 134, 134, 134, 134, 134, 134, 134, 135, 135, 135, 135, 135, 135, 135, 134, 134, 134, 134, 133, 133, 133, 133, 133, 133, 133, 133, 132, 132, 132, 132, 132, 132, 132, 133, 133, 132, 131, 131, 131, 132, 131, 131, 131, 131, 131, 130, 131, 131, 131, 131, 131, 132, 132, 132, 132, 131, 131, 132, 131, 131, 130, 130, 130, 130, 130, 131, 131, 131, 132, 132, 132, 132, 133, 133, 133, 133, 133, 132, 133, 133, 132, 132, 133, 132, 132, 132, 132, 133, 134, 134, 135, 135, 136, 136, 136, 136, 136, 136, 136, 135, 134, 134, 134, 134, 133]
1090A33j%j%%j%%j%%%j%%%%%%%%%%%%%%%%j%%%%%%%%%%%%%%%j%%%%%%%%%%%j%%j%%%%J%%%
1083A25%%%%%%%%%%j%%%%%%%%%jJ%%%%jJ%%%%j%%%%%%%%%%%%%%%%%%%j%%%%%%%%%%%%J%%J
1075A24%%%%j%%%%%j%%%%%%%j%%%%%%%%%%%%%%%%%j%%%%j%J%%%%%jJ%%j%%%%%%%%%%%%%J%
1068A20J%j%%%%J%%jj%%%J%%j%%%J%%%%j%%%%%J%%j%%%j%%%%%%J%%j%%%%%%%%J%%%%%%%%j
1061A18J%%%%j%j%%J%%%j%%%%%%%j%JJJj%%%%%%%J%%j%jjJJ%%%%%j%j%J%%%%%%%%%%J%%%j
1053A17J%%j%%J%%%j%%%%%%%%j%%%%J%%%%%%%%%%%%%%%j%%%%J%%%%%%%%%%J%%%%j%j%%%J%
1046A17%%%%j%%jJ%Jj%%%%%%%%%J%j%%%%%%%jJ%J%%%j%%J%%%%%%%%%jj%J%%%%%%%%%%%%%%
1039A16%%%j%%%%%%%%%%%%j%%%%%%%%J%%%%%J%J%j%J%%%j%%%%Jj%%%j%%%%%%j%%%%%%Jj%%
$$ y = [133, 132, 132, 131, 131, 131, 130, 130, 130, 129, 129, 129, 129, 128, 128, 128, 128, 128, 128, 128, 128, 128, 128, 128, 128, 128, 128, 128, 128, 128, 127, 127, 127, 127, 127, 127, 127, 127, 127, 127, 127, 127, 127, 127, 127, 127, 126, 126, 126, 126, 126, 126, 126, 126, 126, 126, 126, 126, 125, 125, 125, 124, 124, 124, 124, 124, 125, 125, 125, 125, 125, 125, 125, 125, 125, 125, 125, 125, 125, 125, 124, 124, 124, 124, 124, 124, 124, 124, 124, 124, 123, 124, 124, 124, 124, 124, 123, 124, 124, 124, 124, 124, 123, 123, 123, 123, 123, 123, 123, 123, 123, 123, 123, 123, 123, 123, 123, 123, 123, 123, 123, 123, 122, 122, 122, 122, 122, 122, 122, 122, 122, 122, 122, 122, 122, 123, 123, 123, 124, 124, 124, 124, 124, 123, 123, 123, 123, 123, 123, 122, 122, 122, 122, 122, 122, 122, 122, 121, 121, 121, 121, 121, 121, 121, 121, 121, 121, 121, 121, 121, 121, 121, 121, 121, 121, 120, 120, 120, 120, 120, 119, 119, 120, 120, 120, 120, 120, 120, 119, 120, 120, 120, 119, 119, 119, 119, 119, 119, 119, 119, 119, 119, 119, 119, 119, 119, 120, 120, 121, 121, 120, 120, 120, 120, 120, 121, 121, 121, 120, 119, 119, 119, 119, 120, 120, 120, 119, 119, 119, 119, 120, 120, 120, 120, 120, 119, 119, 119, 119, 119, 119, 120, 120, 120, 119, 119, 119, 119, 118, 118, 118, 118, 118, 118, 118, 119, 119, 119, 118, 118, 118, 118, 118, 118, 118, 118, 118, 119, 119, 119, 119, 119, 119, 119, 119, 119, 118, 119, 119, 119, 119, 119, 118, 118, 117, 117, 117, 118, 118, 118, 118, 117, 117, 117, 117, 117, 117, 117, 117, 116, 116, 117, 118, 119, 118, 118, 118, 118, 118, 118, 118, 118, 119, 119, 119, 118, 118, 117, 116, 117, 118, 118, 118, 118, 118, 118, 117, 117, 116, 116, 117, 117, 117, 117, 117, 117, 117, 117, 117, 117, 117, 118, 118, 118, 118, 117, 118, 118, 118, 117, 117, 117, 118, 118, 118, 118, 117, 117, 117, 117, 117, 117, 117, 117, 117, 116, 116, 116, 116, 116, 117, 117, 117, 117, 117, 117, 117, 117, 117, 117, 117, 117, 117, 117, 117, 117, 116, 116, 116, 116, 116, 117, 117, 117, 117, 117, 117, 117, 117, 117, 117, 117, 118, 118, 118, 118, 118, 117, 117, 116, 116, 116, 116, 117, 117, 117, 117, 117, 117, 116, 116, 116, 115, 116, 116, 117, 116, 116, 116, 116, 116, 116, 116, 116, 116, 116, 117, 117, 116, 116, 116, 116, 116, 116, 116, 116, 115, 116, 116, 117, 117, 117, 117, 116, 116, 116, 117, 117, 117, 117, 117, 117, 117, 117, 117, 117, 116, 115, 115, 116, 116, 116, 116, 116, 116, 116, 116, 116, 116, 116, 116, 116, 116, 116, 116, 116, 116, 115, 115, 115, 115, 115, 115, 115, 115, 115, 115, 115, 115, 115, 114, 114, 114, 114, 114, 114, 114, 114, 114, 115, 115, 115, 115, 115, 115, 116, 116, 117, 117, 116, 116, 117, 117, 117, 117, 116, 116, 116, 116, 116, 117, 116, 116, 116, 116, 115, 115, 115, 115, 115, 115, 115, 114, 114, 114, 114, 114, 114, 114, 115, 114, 114, 114]
1031A14Jj%%%%%%%J%%%%%%%%%%%%%%%%%%%%%%%%%%%%%J%j%%%JJ%%Jj%%%%jjJ%%%j%%%%%%J
1024A16%JJ%J%%JJj%%%%%j%jj%%jj%j%%%%%j%%%%%j%%J%%%%%%j%%J%J%%j%j%%%%%%j%J%j%
1017A11%%%%%%%%%j%%%J%j%%%%%%J%%%%%%%%jJ%%%%%%%J%%%%%j%%%%%%%J%%%%J%%j%%%J%%
1010A13%%J%%J%%J%Jj%%%jjjj%%%%%%%j%%%Jj%%%j%%%%%%J%%%%%%j%J%%%%%%%%%%jJ%%%JJ
1002A13%%%%%%%%%%%%%%J%%%%j%%%%J%%%J%%%%J%JJJ%JJKJKKKLLNNPQRJ0J0RJ0RQOMKjnqj1
995B13j3j3j2j1rpnmlkkkjjj%j%%%%%j%%%%%%%jjjj%j%j%%%j%%j%%j%%%J%JJJ%%JJ%J%J%J
988A25J%JJ%JJJKKKLNNORJ1J1J2J3J3J2J1RQMKmqj3j5j8j5j4j2rpnllkkkjjj%j%j%jj%jjj
982A29j%jJ%%%%J%%%%%J%%JK%JKJJJ%%%jkkjkkjkjjjjj%%%%%J%%%%%%%%%J%%JJJ%KJJK%JK
$$ y = [114, 115, 114, 114, 114, 114, 114, 114, 114, 114, 115, 115, 115, 115, 115, 115, 115, 115, 115, 115, 115, 115, 115, 115, 115, 115, 115, 115, 115, 115, 115, 115, 115, 115, 115, 115, 115, 115, 115, 115, 116, 116, 115, 115, 115, 115, 116, 117, 117, 117, 118, 117, 117, 117, 117, 117, 116, 115, 116, 116, 116, 116, 115, 115, 115, 115, 115, 115, 115, 116, 116, 117, 118, 118, 119, 119, 119, 120, 121, 120, 120, 120, 120, 120, 120, 119, 119, 118, 117, 117, 117, 116, 115, 115, 114, 114, 114, 114, 114, 114, 113, 113, 113, 113, 113, 113, 112, 112, 112, 113, 113, 113, 113, 113, 113, 113, 112, 112, 112, 113, 113, 114, 114, 114, 113, 113, 112, 112, 112, 112, 112, 112, 112, 111, 111, 112, 112, 111, 111, 111, 111, 111, 111, 111, 111, 111, 111, 111, 110, 110, 110, 110, 111, 111, 110, 110, 110, 110, 110, 110, 110, 111, 111, 111, 111, 111, 111, 111, 111, 111, 110, 111, 111, 111, 111, 111, 111, 111, 111, 112, 112, 112, 112, 112, 112, 111, 111, 111, 111, 111, 111, 111, 111, 112, 112, 112, 112, 112, 113, 113, 113, 112, 112, 112, 112, 113, 113, 113, 113, 113, 114, 114, 114, 115, 115, 115, 116, 116, 117, 116, 116, 116, 116, 115, 114, 113, 112, 112, 112, 112, 112, 112, 112, 112, 111, 111, 111, 111, 112, 111, 111, 111, 111, 110, 110, 110, 110, 110, 110, 110, 111, 111, 111, 111, 111, 111, 111, 110, 110, 111, 111, 111, 111, 111, 111, 111, 111, 111, 111, 111, 110, 111, 111, 111, 111, 112, 113, 113, 113, 113, 113, 113, 113, 113, 113, 113, 113, 113, 113, 113, 113, 114, 114, 114, 114, 114, 113, 113, 113, 113, 113, 114, 114, 114, 114, 115, 115, 115, 115, 115, 116, 116, 117, 118, 119, 119, 120, 121, 123, 124, 126, 128, 130, 133, 136, 141, 146, 153, 161, 170, 180, 190, 199, 209, 218, 226, 232, 236, 238, 237, 232, 224, 213, 200, 187, 175, 164, 155, 148, 143, 139, 136, 134, 132, 130, 129, 128, 127, 127, 126, 126, 126, 126, 126, 126, 125, 125, 125, 125, 125, 125, 125, 125, 124, 123, 122, 121, 121, 120, 120, 119, 119, 119, 119, 118, 118, 118, 117, 117, 117, 116, 116, 116, 116, 117, 117, 118, 119, 120, 120, 120, 121, 122, 122, 123, 123, 124, 124, 125, 126, 126, 127, 128, 128, 129, 130, 131, 133, 135, 137, 140, 145, 150, 156, 165, 176, 187, 199, 212, 225, 237, 248, 257, 265, 269, 271, 267, 259, 246, 231, 213, 198, 184, 172, 163, 156, 151, 148, 145, 143, 141, 139, 138, 137, 136, 136, 135, 135, 134, 134, 133, 132, 132, 131, 130, 129, 128, 128, 127, 128, 128, 128, 128, 128, 129, 129, 129, 129, 129, 129, 130, 130, 130, 131, 133, 133, 134, 136, 137, 138, 139, 139, 139, 139, 138, 136, 134, 133, 131, 129, 128, 126, 125, 124, 123, 122, 121, 121, 121, 121, 121, 121, 122, 122, 122, 122, 122, 122, 122, 122, 122, 122, 123, 123, 123, 124, 125, 126, 126, 128, 129, 130, 132, 132, 133, 135]
975A35KJKKKKLLMLMLMLKKJJjjkkjkkklkjkkk%j%jj%j%%%jjj%jjj%jjjkjkjjj%j%jj%%%%J%
967A31%%%j%j%%j%jjj%j%jj%j%%j%%%%j%%%%%%%%%%%J%%J%J%J%JJJJKJJJJJ%%Jj%jjjkjjj
960A26jj%%%j%j%%J%%%%j%%%JJJ%%%%j%%j%%jjj%jj%%%j%%j%%%%%%j%%%j%%%%Jj%Jj%J%%J
953A16j%%%%%%%j%%%J%%%%%%j%%%%j%%%%%J%J%%%%%J%%%%J%%%%J%%%J%%J%J%JJJJKKKKLLL
945A42LLLKLJJJ%%jjklllllkllkkkkkkjjjj%j%%%j%j%J%%j%%%%J%%j%%%%%%J%%%J%%%%%%%
938A15%%%%j%%%%%j%%J%j%%%j%%%jJ%%%%J%%%%%%%J%jJJJ%J%J%J%%J%JJJJJJKLKKLLLKLLK
930A54K%%kkmmmmmlkkjjkjj%%j%jjj%%%j%%%%j%%%%%j%J%%J%%%%%%%Jj%%J%%%J%%%%%%%%%
923A16J%%%%J%J%JJ%J%%%J%%%jj%jj%%%J%JJJJJ%%J%%%jjjj%%%jjJ%J%j%%%J%%%j%%%%%%%
$$ y = [135, 137, 138, 140, 142, 144, 146, 149, 152, 156, 159, 163, 166, 170, 173, 175, 177, 178, 179, 178, 177, 175, 173, 172, 170, 168, 166, 163, 161, 160, 158, 156, 154, 154, 153, 153, 152, 151, 151, 150, 150, 150, 150, 149, 148, 147, 147, 146, 145, 144, 144, 143, 142, 141, 139, 138, 136, 135, 134, 133, 133, 132, 132, 131, 130, 130, 130, 130, 130, 131, 131, 131, 131, 131, 130, 130, 129, 129, 129, 128, 128, 127, 126, 125, 125, 124, 124, 123, 122, 122, 121, 121, 121, 120, 120, 120, 120, 120, 119, 119, 119, 119, 119, 119, 119, 119, 119, 119, 119, 119, 120, 120, 120, 121, 121, 122, 122, 123, 123, 124, 125, 126, 127, 129, 130, 131, 132, 133, 134, 134, 134, 135, 134, 134, 133, 132, 131, 129, 128, 127, 126, 125, 124, 124, 124, 124, 123, 123, 122, 122, 122, 123, 123, 123, 123, 123, 122, 122, 122, 122, 123, 124, 125, 125, 125, 125, 125, 124, 124, 124, 123, 123, 123, 122, 121, 120, 120, 119, 118, 118, 118, 118, 117, 117, 117, 116, 116, 116, 116, 116, 116, 116, 115, 115, 115, 115, 114, 114, 114, 114, 114, 115, 114, 114, 115, 114, 114, 115, 115, 115, 116, 115, 115, 115, 115, 115, 115, 115, 115, 114, 114, 114, 114, 115, 115, 115, 115, 115, 115, 115, 114, 114, 114, 114, 114, 113, 113, 113, 113, 113, 113, 114, 114, 115, 115, 115, 115, 115, 115, 116, 116, 116, 116, 116, 117, 117, 117, 117, 117, 118, 118, 118, 118, 119, 119, 119, 120, 120, 121, 121, 122, 123, 124, 125, 127, 129, 131, 133, 136, 139, 142, 145, 148, 151, 153, 156, 157, 158, 159, 159, 159, 158, 157, 155, 152, 149, 146, 143, 140, 138, 135, 132, 130, 128, 126, 124, 122, 120, 119, 118, 117, 116, 116, 115, 115, 115, 115, 114, 114, 113, 113, 114, 114, 114, 113, 113, 113, 113, 113, 114, 114, 114, 113, 113, 113, 113, 113, 113, 113, 114, 114, 114, 114, 115, 115, 115, 115, 115, 115, 115, 115, 115, 115, 115, 115, 114, 114, 114, 114, 114, 114, 113, 113, 113, 114, 114, 113, 113, 113, 113, 112, 112, 112, 112, 111, 112, 112, 112, 112, 112, 113, 113, 113, 113, 113, 113, 113, 113, 114, 114, 113, 114, 115, 116, 116, 117, 117, 118, 118, 119, 119, 119, 120, 120, 121, 122, 123, 124, 125, 126, 128, 131, 133, 135, 138, 141, 144, 146, 149, 152, 154, 156, 156, 156, 154, 152, 148, 144, 140, 136, 132, 129, 127, 125, 124, 123, 121, 120, 119, 119, 119, 118, 118, 117, 116, 115, 115, 115, 115, 114, 114, 114, 114, 114, 113, 113, 113, 113, 113, 113, 112, 112, 113, 113, 113, 114, 114, 114, 114, 114, 114, 114, 114, 115, 114, 114, 114, 115, 115, 115, 115, 116, 116, 116, 116, 116, 116, 116, 116, 116, 116, 117, 117, 117, 117, 117, 118, 118, 119, 119, 120, 121, 121, 122, 122, 122, 122, 123, 123, 123, 123, 122, 121, 121, 120, 119, 119, 119, 119, 120, 120, 121, 122, 123, 124, 125, 125, 125, 126, 126, 126, 126, 125, 124, 123, 122, 122, 122, 122, 121, 120, 121, 121, 122, 122, 121, 121, 121, 121, 122, 122, 122, 122, 121, 121, 121, 121, 121, 121, 121, 121]
915A21%J%J%J%J%%J%Jj%j%%%j%%%%%JJ%J%JJ%J%J%j%j%j%%%j%j%%%%j%%%%%%%%%%%%j%%%%
908A24j%J%J%J%%%J%%%J%%%J%%J%%J%%J%%J%J%JJJJ%J%JJ%%%J%J%JJJKKKLLNORJ1J3J5J4J4
901B45J3J2J1J0OLlj0j5k0k0k0j5j2rpmlkkjjj%%%J%J%JJJKJKJJKKLLKKKJJJKJJjllmmmll
895A65j%%JJJ%JJ%J%jjjkjkkkjjjjj%j%jj%j%Jj%jjJ%j%%j%j%j%j%j%j%%J%%JJ%%JJJ%J%K
887A50JJKJKJKKLLMNORRJ1J0J0J0QQON%nrj4j5j5j2j0onllkkkjj%%%%%J%JKJJKKKKLKLLKL
881A94MLLMMLMNMNOOOPQJ0J2J5K0K3K5K9K9K9L0K9K9K8K6K2J4QKjLJ1K3L5M6N5O2O9P2P5P6
876A172P3O8N8M7L3J5kk0l6n1o4p2p9q2q1p8p2o6n9n3m7m1l6l2k9k5k2k0j7j5j3j3j0rqon
872C03ljjLNQRJ0J1J1J3J4J4J5J4J4J2J2J2J4K2K9M0M9N7O2O7O9P1O9O4N6M6L1J7jj7l5m9
$$ y = [121, 121, 122, 122, 123, 123, 124, 124, 125, 125, 125, 126, 126, 127, 126, 126, 125, 125, 125, 125, 124, 124, 124, 124, 124, 124, 125, 126, 126, 127, 127, 128, 129, 129, 130, 130, 131, 131, 130, 130, 129, 129, 128, 128, 128, 128, 127, 127, 126, 126, 126, 126, 126, 125, 125, 125, 125, 125, 125, 125, 125, 125, 125, 125, 125, 125, 124, 124, 124, 124, 124, 123, 123, 124, 124, 125, 125, 126, 126, 126, 126, 127, 127, 127, 127, 128, 128, 128, 128, 129, 129, 129, 130, 130, 130, 131, 131, 131, 132, 132, 132, 133, 133, 134, 134, 135, 136, 137, 138, 138, 139, 139, 140, 141, 141, 141, 141, 142, 142, 143, 143, 144, 145, 146, 148, 150, 152, 155, 158, 163, 169, 178, 189, 202, 217, 231, 245, 258, 270, 281, 291, 297, 300, 297, 287, 272, 252, 232, 212, 197, 185, 176, 169, 165, 162, 160, 158, 157, 156, 155, 155, 155, 155, 156, 156, 157, 157, 158, 159, 160, 162, 163, 165, 166, 167, 169, 171, 174, 177, 179, 181, 183, 184, 185, 186, 188, 189, 190, 189, 186, 183, 179, 175, 171, 168, 165, 164, 164, 164, 165, 166, 167, 167, 168, 169, 169, 170, 170, 169, 168, 167, 165, 164, 162, 160, 158, 157, 156, 155, 154, 153, 153, 152, 152, 151, 150, 150, 149, 149, 150, 149, 149, 148, 147, 148, 148, 147, 147, 147, 146, 146, 145, 145, 144, 144, 143, 143, 142, 142, 141, 141, 141, 142, 142, 142, 143, 144, 144, 144, 145, 146, 147, 147, 148, 148, 150, 151, 152, 154, 155, 157, 158, 160, 162, 165, 168, 172, 177, 183, 192, 201, 212, 222, 232, 242, 250, 258, 264, 269, 269, 264, 255, 241, 226, 211, 199, 189, 183, 178, 175, 172, 170, 168, 166, 165, 164, 164, 164, 164, 164, 164, 165, 165, 166, 168, 169, 170, 172, 174, 176, 178, 181, 183, 186, 189, 191, 194, 198, 201, 204, 208, 212, 215, 219, 224, 228, 233, 239, 245, 251, 258, 266, 276, 288, 303, 323, 346, 371, 400, 429, 458, 488, 517, 546, 574, 600, 622, 636, 644, 646, 645, 648, 659, 682, 717, 763, 818, 880, 949, 1021, 1096, 1172, 1245, 1313, 1371, 1418, 1451, 1466, 1464, 1444, 1408, 1357, 1293, 1221, 1142, 1060, 979, 901, 829, 763, 704, 651, 604, 563, 527, 495, 466, 441, 419, 399, 382, 367, 354, 341, 331, 322, 314, 308, 303, 300, 299, 298, 301, 306, 314, 323, 333, 344, 355, 368, 382, 396, 411, 425, 439, 451, 463, 475, 489, 511, 540, 580, 629, 686, 748, 815, 884, 955, 1024, 1088, 1144, 1190, 1221, 1238, 1237, 1220, 1185, 1136]
868A136o1p1p7q0q0p5p0o3n6m9m2l7l0k5k0j8j5j3j1j0qqonmmmlllljklkllllllkkjjk%%k
863A46j%jj%jj%jjjjj%%jj%j%j%jjj%jj%%%%%%j%jj%%%JJ%j%%%%%%%%j%jj%%j%%%%%%%%Jj
855A21%%%%%%J%j%%jjjj%j%%%j%%j%%%j%%%%J%%J%%J%j%%j%%%%%%%%%J%%%%%%J%%%JJ%J%J
848A20JJJJKKKKKKJK%Jj%kjjjkkjkkkjj%jjjj%j%%J%%%%%j%%%%%J%%j%%j%j%%%%%%%%%%%%
841A14%j%%j%jj%%J%%%%%%J%%%%%J%%J%%%%%%%%%%%%j%%%%%%Jj%%%%j%%j%%%%%%%j%%%%j%
833A09%%%J%%%%%%%%j%%%j%%%%%%J%%%%%J%%J%%%%%%%jJ%%%%%%%%%J%%%J%JJ%%%%%%jj%j%
826A12jj%j%%Jj%%jJ%J%%J%%%J%%%%%%%%%%j%%%%%%%%%%%%%%%%%%%J%%%j%%%%J%%%%%%%%%
818A12%%%%%%%JJ%JJ%%%%Jj%j%j%%jJ%%%%%%%%%J%%%%j%%j%%%%%%%%j%%%JJ%%%JJ%J%J%%%
$$ y = [1136, 1075, 1004, 927, 847, 767, 692, 622, 559, 503, 454, 412, 375, 345, 320, 300, 282, 267, 254, 243, 233, 225, 217, 211, 206, 202, 198, 194, 191, 188, 185, 182, 181, 179, 176, 174, 171, 168, 165, 162, 159, 156, 154, 152, 151, 150, 148, 148, 148, 146, 145, 145, 144, 143, 143, 142, 141, 141, 140, 139, 138, 137, 136, 136, 136, 135, 134, 134, 133, 133, 132, 132, 131, 130, 129, 129, 128, 127, 127, 127, 127, 127, 127, 127, 126, 126, 125, 124, 124, 124, 124, 125, 126, 126, 125, 125, 125, 125, 125, 125, 125, 125, 125, 124, 124, 123, 122, 122, 122, 121, 121, 121, 121, 121, 121, 121, 121, 121, 122, 121, 121, 121, 121, 121, 121, 121, 122, 122, 121, 121, 121, 120, 119, 118, 117, 117, 116, 116, 116, 116, 115, 115, 115, 114, 114, 114, 114, 113, 113, 113, 113, 113, 114, 114, 114, 115, 115, 115, 116, 116, 115, 115, 115, 114, 114, 114, 114, 114, 114, 114, 114, 114, 114, 115, 115, 115, 115, 115, 115, 115, 116, 116, 116, 116, 117, 118, 118, 119, 119, 120, 121, 122, 123, 124, 126, 128, 130, 132, 134, 136, 137, 139, 139, 140, 139, 139, 137, 136, 135, 134, 132, 130, 129, 127, 125, 123, 122, 121, 121, 120, 119, 118, 117, 117, 116, 116, 116, 117, 117, 117, 117, 117, 117, 116, 116, 116, 116, 116, 116, 117, 117, 117, 116, 116, 116, 115, 115, 114, 114, 114, 114, 114, 114, 114, 114, 114, 114, 114, 114, 114, 114, 113, 113, 113, 112, 112, 111, 110, 110, 110, 111, 111, 111, 111, 111, 111, 111, 112, 112, 112, 112, 112, 112, 113, 113, 113, 114, 114, 114, 114, 114, 114, 114, 114, 114, 114, 114, 114, 114, 113, 113, 113, 113, 113, 113, 113, 114, 113, 113, 113, 113, 113, 112, 112, 112, 111, 111, 111, 111, 111, 111, 111, 111, 110, 110, 110, 110, 110, 109, 109, 109, 109, 109, 110, 110, 110, 110, 110, 110, 110, 110, 110, 109, 109, 109, 109, 108, 108, 108, 108, 108, 108, 108, 109, 109, 109, 109, 109, 109, 110, 110, 110, 111, 111, 111, 111, 111, 111, 111, 111, 110, 111, 111, 111, 111, 111, 111, 111, 111, 111, 111, 112, 112, 112, 112, 113, 113, 114, 115, 115, 115, 115, 115, 115, 115, 114, 113, 113, 112, 112, 111, 110, 110, 109, 109, 109, 110, 109, 109, 109, 108, 109, 109, 110, 110, 110, 111, 111, 111, 111, 112, 112, 112, 112, 112, 112, 112, 112, 112, 112, 112, 111, 111, 111, 111, 111, 111, 111, 111, 111, 111, 111, 111, 111, 111, 111, 111, 111, 111, 111, 111, 112, 112, 112, 112, 111, 111, 111, 111, 111, 112, 112, 112, 112, 112, 112, 112, 112, 112, 112, 112, 112, 112, 112, 112, 112, 112, 113, 114, 114, 115, 116, 116, 116, 116, 116, 117, 116, 116, 115, 115, 114, 114, 114, 113, 114, 114, 114, 114, 114, 114, 114, 114, 114, 114, 115, 115, 115, 115, 115, 114, 114, 114, 113, 113, 113, 113, 113, 113, 113, 113, 113, 112, 112, 112, 112, 113, 114, 114, 114, 114, 115, 116, 116, 117, 117, 118, 118, 118, 118]
811A18%%%%j%%%%j%jjkjjkjjkk%jjjjJ%J%JJ%J%JJJJ%J%J%jJJ%J%J%%%%J%%J%JJ%%%%%%J%
804A17%%j%%jkkjjjjjj%jkjj%jJ%%%jJ%JJ%J%JJJ%JJ%J%%j%%JJ%JJ%%%J%J%%%%%%%%%j%jj
796A11%%j%%%%j%J%j%%%%%j%%J%Jj%%%JJ%%J%J%J%J%%%j%%%%J%J%J%%%J%%%jjj%j%j%%%j%
789A12%%%%%%%%J%%%%%%j%%JJ%J%J%J%JJ%%%jJ%J%jj%j%%j%J%%%J%%%j%j%j%jjj%%%%%%%%
781A12J%J%%%%%%%%J%J%J%%J%JJJ%JJ%%%%%%%%%%jj%jj%%%%%j%%%Jj%%jjj%%%J%jj%J%%J%
774A16%J%jJJ%JJ%%J%%J%%%%J%%%J%%%%Jj%%%%%j%%%%j%JJ%%Jj%%%J%%%%%%%%%%%%%JJ%J%
766A28%%KJKJJJKJKLKLLLMLLMMOOPQRJ2J4J6K0K5K9L5M1M7N1N4N5N5N3M9M2L3K1Prk5l9m8
761G47n3n2m8m5m0l6l4l2l0k7k5k2k0j6j4j1j0qopnmlllkkkj%jJ%JKLLMMNOQQJ0J2J5J7K3
$$ y = [118, 118, 118, 118, 118, 117, 117, 117, 117, 117, 116, 116, 115, 114, 112, 111, 110, 108, 107, 106, 104, 102, 102, 101, 100, 99, 98, 99, 99, 100, 100, 101, 102, 102, 103, 103, 104, 105, 106, 107, 107, 108, 108, 109, 109, 108, 109, 110, 110, 111, 111, 112, 112, 112, 112, 112, 113, 113, 113, 114, 114, 115, 116, 116, 116, 116, 116, 116, 116, 117, 117, 117, 117, 116, 116, 116, 115, 113, 111, 110, 109, 108, 107, 106, 105, 105, 104, 102, 101, 100, 100, 99, 100, 100, 100, 100, 99, 100, 100, 101, 102, 102, 103, 103, 104, 105, 106, 106, 107, 108, 108, 109, 109, 109, 108, 108, 108, 109, 110, 110, 111, 112, 112, 112, 112, 113, 113, 114, 114, 114, 114, 114, 114, 114, 114, 114, 114, 113, 113, 112, 111, 111, 111, 110, 110, 110, 110, 110, 109, 109, 110, 110, 109, 109, 109, 109, 109, 109, 108, 108, 108, 109, 109, 110, 109, 109, 109, 109, 110, 111, 111, 111, 112, 112, 113, 113, 114, 114, 115, 115, 115, 115, 114, 114, 114, 114, 114, 115, 115, 116, 116, 117, 117, 117, 117, 118, 118, 118, 118, 117, 116, 115, 115, 114, 114, 113, 113, 113, 113, 112, 112, 112, 112, 112, 112, 112, 112, 112, 112, 113, 113, 113, 113, 113, 113, 113, 112, 112, 112, 113, 114, 114, 115, 115, 116, 116, 117, 117, 118, 119, 119, 119, 119, 118, 119, 119, 120, 120, 119, 118, 118, 117, 117, 117, 116, 116, 117, 117, 117, 117, 118, 118, 118, 118, 117, 117, 116, 116, 115, 115, 114, 113, 112, 112, 112, 112, 112, 112, 112, 112, 112, 113, 113, 114, 114, 114, 114, 114, 114, 114, 114, 114, 115, 115, 116, 116, 117, 117, 117, 118, 118, 119, 120, 121, 121, 122, 123, 123, 123, 123, 123, 123, 123, 123, 123, 123, 123, 122, 121, 121, 120, 119, 119, 119, 119, 119, 119, 118, 118, 118, 118, 119, 118, 118, 118, 117, 116, 115, 115, 115, 115, 116, 116, 115, 114, 114, 115, 115, 115, 116, 116, 116, 117, 117, 116, 117, 118, 118, 119, 120, 120, 120, 121, 121, 121, 122, 122, 122, 122, 122, 123, 123, 123, 123, 124, 124, 124, 124, 124, 125, 124, 124, 124, 124, 124, 124, 123, 123, 123, 123, 123, 122, 122, 123, 124, 124, 124, 125, 124, 124, 124, 124, 125, 125, 125, 125, 125, 125, 125, 125, 125, 125, 125, 125, 125, 125, 126, 127, 127, 128, 128, 128, 128, 130, 131, 133, 134, 135, 136, 138, 139, 141, 144, 146, 149, 152, 155, 159, 162, 165, 169, 173, 179, 185, 192, 200, 209, 221, 235, 251, 271, 296, 325, 360, 401, 448, 499, 553, 608, 663, 716, 765, 807, 840, 861, 868, 859, 834, 795, 747, 694, 642, 594, 549, 509, 473, 439, 407, 377, 350, 325, 303, 283, 267, 253, 242, 232, 224, 218, 211, 206, 202, 199, 196, 193, 191, 189, 187, 186, 186, 185, 186, 186, 187, 189, 192, 195, 199, 203, 208, 214, 222, 230, 240, 252, 267, 284, 307]
756C07K7L3L9M5N0N2N4N4N1M8M2L4K2Qqk5l8m8n3n2n0m4m0l6l3l1l0k7k5k1j9j6j3j2j0qq
752B19poponnnmmllllkkjkjkjjj%jjjj%jjjj%j%jjkkkkklkkkj%JJJJKKKLKKLJKJJJ%J%%%%
745A41%%%%%J%%%j%j%jj%j%j%%%%%%%%%j%%jjjjkkllkjjj%jJJJJJ%JJJ%%J%JJ%JK%J%J%JJ
737A33%%JJ%J%J%JJ%J%J%%%%J%%%%Jj%JJJJKJKJKJJJ%%j%j%j%%%%JJJJJJJKKLLLNNOPPQRQ
730B29QPPNMJkmoqqqrqqpooonmmlllkkj%%J%JKJ%J%%%%KJJ%JJKJKKKJLLMMNMNOOOPOOONNM
723B55LK%lmprrj0qponkk%j%%J%j%%k%%J%KJKKKLMLMLLKJ%jjkklllkkjJJKLMMNNNNLLJjjm
715B34noqj0j1j1j2j3j1j0qqonnmnmmkk%LMOPQRRRJ0J1J0J1J0J0RRPONNMLLLLLNOQJ1J3J7
710C21K0K3K6K7K9K8K7K5K1J7J0Lnj4j9k5k8k9k8k4k1j6j3pm%NJ0J4J8K4K7L2L6L8L8L9L5
$$ y = [307, 334, 367, 406, 451, 501, 553, 607, 661, 712, 760, 802, 836, 858, 866, 858, 833, 795, 747, 694, 642, 592, 548, 508, 472, 439, 408, 378, 351, 326, 305, 286, 270, 257, 245, 235, 227, 219, 212, 206, 199, 193, 188, 183, 178, 174, 170, 167, 164, 161, 158, 156, 154, 153, 151, 150, 148, 147, 146, 145, 145, 144, 143, 142, 141, 141, 140, 139, 138, 137, 137, 136, 136, 135, 134, 132, 130, 128, 126, 124, 121, 119, 117, 115, 114, 114, 115, 116, 117, 118, 120, 122, 124, 127, 129, 131, 134, 135, 137, 138, 139, 140, 140, 141, 141, 141, 141, 141, 141, 141, 141, 141, 141, 142, 142, 142, 142, 141, 141, 140, 140, 139, 138, 138, 137, 137, 136, 136, 136, 136, 136, 136, 136, 136, 136, 136, 135, 135, 135, 134, 133, 132, 131, 129, 127, 124, 121, 119, 118, 117, 116, 116, 115, 116, 117, 118, 119, 120, 120, 121, 122, 123, 123, 123, 124, 124, 125, 126, 126, 127, 129, 129, 130, 130, 131, 131, 132, 133, 133, 133, 134, 135, 135, 136, 136, 137, 137, 138, 139, 139, 140, 140, 141, 141, 141, 141, 141, 142, 142, 142, 142, 142, 143, 142, 142, 143, 144, 145, 146, 148, 149, 151, 152, 154, 155, 156, 157, 157, 157, 156, 156, 155, 155, 154, 154, 154, 154, 154, 155, 156, 157, 158, 159, 160, 161, 163, 165, 168, 171, 174, 179, 184, 190, 197, 204, 212, 221, 229, 237, 244, 251, 256, 260, 261, 259, 255, 249, 241, 233, 225, 216, 208, 200, 193, 187, 181, 175, 170, 166, 162, 159, 156, 153, 151, 149, 148, 148, 148, 149, 149, 150, 152, 153, 153, 154, 154, 154, 154, 154, 156, 157, 158, 158, 159, 160, 162, 163, 165, 167, 169, 170, 173, 176, 180, 184, 189, 193, 198, 204, 210, 216, 223, 229, 235, 241, 246, 251, 255, 258, 260, 260, 257, 253, 246, 237, 228, 218, 210, 203, 197, 192, 190, 188, 188, 187, 187, 187, 188, 188, 187, 187, 187, 185, 185, 185, 186, 186, 188, 189, 191, 193, 195, 198, 202, 205, 209, 212, 215, 217, 218, 218, 217, 216, 214, 212, 209, 206, 203, 201, 199, 198, 199, 200, 202, 205, 209, 213, 218, 223, 228, 233, 236, 239, 240, 239, 238, 234, 229, 223, 215, 205, 194, 183, 171, 158, 147, 137, 129, 121, 115, 110, 105, 101, 96, 92, 88, 86, 84, 84, 87, 91, 97, 104, 112, 121, 130, 139, 149, 160, 170, 181, 191, 201, 210, 219, 226, 232, 237, 242, 246, 249, 252, 255, 258, 261, 266, 272, 280, 291, 304, 321, 341, 364, 390, 417, 446, 474, 501, 526, 547, 564, 574, 577, 572, 558, 539, 514, 486, 457, 429, 405, 384, 368, 355, 348, 344, 344, 349, 359, 373, 391, 415, 442, 474, 510, 548, 586, 625, 660]
706F60L2K6J9J0MlorrokJQJ4K0K7L4M2M8N5O4P2Q0R0J01J14J26J39J55J70J87K06K26K48K73
702C216L01L36L83M41N19O19P49R14J125J376J658J944K198K384K480K478K384K205J935J564
700C1209J080M78k18r57j665k256k662k842k808k613k327k015j715j442j202r93q14o63n40
698E035m40l60k96k47k07j78j53j35j22j12j01q9p7o1m4k6pJ2L1N0P0R0J11J33J57J82K12
695C428K44K85L34L97M78N81P12Q76J081J328J607J890K146K335K438K446K365K197J945J595
693C0708J132N52j23q46j543k133k542k731k706k520k243j939j648j385j160r72q18o95n98
691E790n22m59m03l52l09k70k40k17k00j87j76j66j57j44j32j20j08r8q7p9p1o4n8n3m8m3
688A027l9l6l1k8k5k2j8j5j1pmjKNOQRJ0J3J5J9K3L1L8M7N8O9Q0Q7R2R1Q8P8O4M7K5jl0n8
$$ y = [660, 692, 718, 737, 747, 751, 748, 742, 733, 724, 718, 716, 717, 725, 739, 759, 786, 820, 862, 910, 965, 1029, 1101, 1181, 1271, 1372, 1486, 1612, 1751, 1906, 2076, 2263, 2469, 2695, 2943, 3216, 3517, 3853, 4236, 4677, 5196, 5815, 6564, 7478, 8603, 9979, 11637, 13581, 15779, 18163, 20643, 23121, 25505, 27710, 29645, 31209, 32289, 32767, 32549, 31592, 29927, 27671, 25009, 22167, 19359, 16746, 14419, 12404, 10689, 9247, 8045, 7052, 6238, 5575, 5035, 4595, 4235, 3939, 3692, 3485, 3307, 3154, 3019, 2897, 2785, 2684, 2595, 2518, 2457, 2413, 2387, 2380, 2392, 2423, 2473, 2543, 2633, 2744, 2877, 3034, 3216, 3428, 3672, 3957, 4291, 4688, 5166, 5747, 6459, 7335, 8416, 9744, 11351, 13241, 15387, 17722, 20160, 22606, 24971, 27168, 29113, 30708, 31840, 32392, 32269, 31423, 29880, 27747, 25205, 22474, 19768, 17248, 15005, 13066, 11418, 10033, 8873, 7901, 7083, 6388, 5790, 5268, 4809, 4406, 4054, 3745, 3475, 3235, 3018, 2818, 2631, 2455, 2289, 2132, 1988, 1856, 1736, 1628, 1530, 1443, 1364, 1293, 1229, 1171, 1118, 1070, 1027, 988, 952, 921, 893, 868, 846, 828, 813, 802, 795, 791, 790, 792, 797, 803, 811, 820, 830, 843, 858, 877, 900, 931, 969, 1016, 1074, 1143, 1223, 1310, 1402, 1493, 1581, 1659, 1723, 1770, 1795, 1794, 1764, 1706]
684A706q4j04j17j19j15j04r1p7o4n3m4l7l3k7k4k1j8j6j3j1pnlJNRJ4J9K6L4M2M8N5N9O2
680H93O3O2N9N1M3L1J5mk2l8n2n9o2o0n7n2m7m2l6k9k3j6j2rnlk%KOQJ3J7K2K8L6M6N6O6P8
676I65Q5R2R4R2Q7P7O4M7K6Kk3m8p0q5r4r4q7p2n4l4j6KJ6K7L3L6L6L4K8J8Mj4l1n0o5p4p9
672H75p8p0o1n1m1l2k4j7j2pnjJLMPRJ2J5K1K7L3M1N0O1P0P9Q6R1R1Q9Q3P3N8M1J8ol1n6p8
668A368r4j02j04r9q9p8o7n6m7m0l4k8k4k1j7j4j2rqoomlkjj%JLNQJ0J4J7K2K8L5M4N3O2P2
663G76Q2R1R5R8R7R0Q3O9N2L1Ok1m8p3r3j06j10j06r7q4p0n7m6l5k8k0j7j1j0qppppponmm
659D76%JMPQJ0J1J1J0J0QPNMMPRJ4J9K5L3M1N0O0P1Q0Q8R4R6R5Q8Q0O7N0L1Pj9m7p3r4j08
655A340j15j13j05r3p9o5n3m2l2k2j5qkLPJ1J1J3J3J2RNJmqj4j7k1k5k6k7k7k6k4k2k0j6j2
$$ y = [1706, 1622, 1518, 1401, 1282, 1167, 1063, 972, 895, 831, 778, 734, 697, 664, 637, 613, 592, 574, 558, 545, 534, 527, 522, 519, 520, 525, 534, 548, 567, 593, 627, 669, 717, 772, 831, 893, 956, 1018, 1077, 1128, 1171, 1202, 1217, 1213, 1191, 1153, 1101, 1042, 980, 920, 863, 811, 764, 722, 686, 657, 634, 618, 606, 597, 592, 589, 587, 587, 589, 595, 603, 616, 633, 655, 683, 719, 765, 821, 887, 965, 1050, 1142, 1236, 1328, 1415, 1492, 1556, 1603, 1629, 1631, 1608, 1560, 1490, 1405, 1311, 1217, 1130, 1058, 1004, 970, 954, 956, 972, 999, 1032, 1068, 1104, 1138, 1166, 1184, 1188, 1174, 1143, 1093, 1028, 954, 875, 797, 727, 666, 615, 574, 542, 518, 501, 489, 482, 477, 476, 477, 480, 484, 491, 500, 512, 527, 548, 575, 608, 649, 699, 760, 830, 909, 995, 1086, 1177, 1266, 1349, 1422, 1480, 1521, 1539, 1533, 1502, 1446, 1368, 1274, 1172, 1068, 969, 880, 802, 735, 679, 632, 592, 558, 530, 506, 485, 468, 454, 442, 433, 425, 419, 413, 409, 406, 404, 403, 402, 402, 403, 406, 411, 419, 429, 443, 460, 482, 510, 545, 589, 642, 704, 776, 858, 949, 1044, 1142, 1239, 1329, 1412, 1481, 1533, 1564, 1570, 1549, 1501, 1428, 1335, 1229, 1119, 1013, 916, 832, 762, 705, 659, 624, 596, 576, 559, 548, 538, 530, 523, 516, 509, 502, 495, 489, 484, 480, 476, 476, 477, 481, 488, 496, 506, 517, 528, 538, 548, 556, 563, 568, 572, 576, 583, 592, 606, 625, 650, 683, 724, 774, 834, 905, 985, 1073, 1167, 1263, 1358, 1446, 1526, 1593, 1643, 1674, 1681, 1662, 1615, 1542, 1448, 1340, 1225, 1112, 1007, 914, 835, 770, 717, 675, 643, 621, 606, 598, 596, 599, 606, 617, 628, 641, 654, 666, 675, 680, 681, 677, 669, 655, 638, 617, 592, 566, 539, 512, 486, 462, 440, 420, 404, 392]
651C92j0ok%LNPRRRQQNMJkorj1j2j3j2j3j2j0qqqpoomlj%JKLNQRJ0J1J2J0J0RPOK%mpj0j2
645C63j4j3j4j2j0qpnmmk%%%LMNNMMLK%klpqj0rj1j0qppnnmlkkjkjjjkj%%%JKKMMMNOOONN
638B38LLJJjjj%%%JLKMNPJ0J1J3J3J4J4J3J2J0PNJmqj0j2j2j2rqplkJJLNOOPRRJ0J1J1J2J3
633D05J3J4J5J4J5J5J5J3J1J0PMKkmprj0j3j4j3j3j0qmJOJ2J6J9K4K7K9K9K9K8K4K1J5RKp
628G30j5k2k7l0l2l1k8k6k3j9j6j4j1qmkjKMOQRJ0J1J2J1J0RPNKjmoqrj0j0j0j0ppmlk%%K
623D38LMPQJ0J1J3J3J4J3J1QPM%lnrj2j4j5j6j6j4j3j3j2j2j2j1j1j2j1j2j2j2j1j1j0j0q
619B67ppommljjjj%J%jjkjkkjjjk%%j%JJKKLKMLLLKLLMLLKLLKLKKJJ%%jjjjkklkllllmlll
612B41lkjj%JJJJKKJKJJ%jjkkklmlllkkj%KKLMMNNMNLKJjknnoprrj0j0j0j0rqnnnmnonmlk
$$ y = [392, 382, 376, 374, 374, 377, 382, 389, 398, 407, 416, 424, 432, 437, 441, 442, 440, 434, 425, 414, 402, 389, 377, 364, 352, 342, 334, 326, 318, 311, 305, 299, 295, 292, 291, 291, 292, 294, 297, 302, 310, 319, 329, 340, 352, 362, 372, 381, 388, 394, 396, 396, 392, 385, 375, 363, 349, 336, 322, 310, 300, 292, 285, 280, 276, 272, 270, 270, 270, 270, 273, 277, 282, 287, 291, 295, 298, 300, 300, 298, 295, 288, 280, 270, 261, 250, 240, 232, 225, 218, 213, 208, 204, 201, 199, 197, 196, 194, 193, 192, 191, 189, 188, 188, 188, 188, 189, 191, 193, 197, 201, 205, 210, 216, 222, 228, 233, 238, 241, 244, 245, 246, 245, 244, 243, 243, 243, 243, 244, 247, 249, 253, 258, 265, 275, 286, 299, 312, 326, 340, 353, 365, 375, 382, 387, 388, 384, 376, 366, 354, 342, 330, 321, 313, 306, 303, 301, 302, 303, 306, 311, 317, 323, 330, 339, 348, 358, 369, 380, 392, 405, 418, 432, 447, 461, 476, 491, 506, 519, 530, 540, 547, 551, 553, 551, 547, 540, 531, 521, 508, 494, 481, 468, 458, 450, 446, 447, 453, 465, 481, 500, 524, 551, 580, 609, 638, 666, 690, 711, 726, 735, 737, 730, 715, 693, 666, 636, 604, 573, 545, 519, 496, 477, 461, 447, 436, 428, 424, 422, 421, 423, 427, 433, 441, 450, 460, 471, 483, 494, 504, 513, 520, 525, 527, 526, 522, 516, 508, 499, 489, 479, 469, 459, 452, 445, 441, 438, 436, 436, 436, 438, 441, 445, 452, 460, 470, 481, 494, 507, 521, 534, 545, 553, 560, 564, 564, 561, 556, 547, 535, 521, 506, 490, 474, 460, 447, 434, 422, 410, 398, 387, 376, 364, 353, 341, 329, 317, 306, 295, 285, 275, 267, 260, 253, 247, 243, 239, 236, 235, 234, 233, 232, 232, 233, 233, 232, 231, 229, 228, 226, 224, 223, 222, 221, 219, 219, 219, 218, 218, 219, 220, 222, 224, 227, 229, 233, 236, 239, 242, 244, 247, 250, 254, 257, 260, 262, 265, 268, 270, 273, 275, 277, 278, 279, 279, 279, 278, 277, 276, 275, 273, 271, 268, 266, 263, 260, 257, 254, 250, 247, 244, 241, 238, 236, 235, 234, 234, 235, 236, 237, 238, 240, 242, 243, 245, 246, 247, 247, 246, 245, 243, 241, 239, 236, 232, 229, 226, 223, 221, 219, 218, 218, 220, 222, 225, 229, 233, 238, 243, 247, 252, 255, 257, 258, 257, 255, 250, 245, 239, 232, 223, 214, 204, 194, 184, 174, 165, 157, 152, 147, 142, 138, 133, 127, 122, 118, 115, 113]
605A13%JNNPRQRRRRJ0RQQPNMLJ%%%%j%j%JKLMNOQRRRRRPOML%jmnprj0j1j0qpnlj%LNOQJ2J5
598B99J9K1K4K6K7K6K6K4K2K2J9J7J5J4J3J3J3J4J6K1K6L3L9M6N2O0O6P4Q2R1J01J12J25J39
594A737J53J72J91K15K42K73L09L54M09M79N66O74P99R47J118J317J547J800K055K267K402
592B0026K425K332K134J852J501J086O02M2n85j241j871k407k780k941k882k636k280j893
590A0484j533j228r79p83o28n05m08l31k73k26j91j62j40j22j10r8q8p7o7n2l7j8JK0M1O2
587B552Q4J06J32J57J87K21K59L05L60M30N16O21P46Q90J056J252J478J731J986K207K355
585A9631K397K324K149J890J564J173P15J81m23j062j686k227k621k812k790k585k269j917
583A1632j588j310j084r04p59o36n33m45l72l13k66k29k02j83j69j60j53j46j39j32j23j14
$$ y = [113, 113, 114, 119, 124, 131, 140, 148, 157, 166, 175, 184, 194, 203, 211, 219, 226, 231, 235, 238, 239, 239, 239, 239, 239, 238, 238, 237, 237, 238, 240, 243, 247, 252, 258, 266, 275, 284, 293, 302, 311, 318, 324, 328, 331, 331, 330, 326, 321, 314, 305, 295, 284, 274, 266, 259, 254, 251, 250, 250, 253, 258, 264, 272, 284, 299, 318, 339, 363, 389, 416, 442, 468, 492, 514, 536, 555, 572, 587, 601, 614, 627, 640, 654, 670, 691, 717, 750, 789, 835, 887, 947, 1013, 1087, 1169, 1260, 1361, 1473, 1598, 1737, 1890, 2062, 2253, 2468, 2710, 2983, 3292, 3646, 4055, 4534, 5100, 5774, 6573, 7520, 8638, 9955, 11502, 13302, 15357, 17624, 20026, 22451, 24783, 26917, 28769, 30270, 31356, 31958, 32000, 31415, 30174, 28303, 25896, 23116, 20175, 17293, 14657, 12377, 10484, 8951, 7723, 6744, 5961, 5333, 4828, 4420, 4089, 3816, 3590, 3399, 3237, 3097, 2975, 2865, 2767, 2679, 2602, 2535, 2483, 2446, 2428, 2429, 2449, 2490, 2552, 2636, 2742, 2874, 3031, 3218, 3439, 3698, 4003, 4363, 4793, 5309, 5930, 6676, 7566, 8622, 9874, 11352, 13083, 15069, 17276, 19631, 22028, 24352, 26501, 28391, 29955, 31128, 31843, 32024, 31601, 30539, 28853, 26626, 24005, 21193, 18403, 15818, 13549, 11632, 10044, 8734, 7650, 6746, 5987, 5351, 4818, 4373, 4001, 3688, 3422, 3193, 2991, 2808, 2639, 2479, 2326, 2180, 2041, 1909, 1786, 1672]
581A672j03r3q4p6o9o2n7n1m7m2l7l2k7k4k0j6j3rpkJOJ0J4J8K1K7L1L6M3N1O1O9P7Q1Q0P7
577A504P0O1M7L0Rj6m2p1r6j16j27j29j23j10r3p7o1m8l7k9k3j9j7j5j3j2j1j1j2j1j1j2j0
573C69j1j1rqookjJKMNOPPQQOPOMLKjknoqrj0j2j3j3j3j3j2j2j1j0j1j0j1j1j0qpnljJJJJ
568A68J%%%kjkkllmmnmmmlkj%JJJKLLLLKKKJ%J%JJJ%KJJKJJJKJK%J%%jjklkjkkjkkkkkjjj
560A40j%j%%j%%%j%%jjj%j%%j%%%%%%%J%%jJJ%Jj%%jkkkkkljkjkjjj%JKJJJJJJ%%jjjjjjj
553A12jjjj%%%%j%%%jjjj%jjjj%%%JJJKLKKKKKKJJ%%jjkkkkkjjj%j%%%%JJ%%%jJ%J%%%%JJ
545A10%J%%J%%J%JJ%%J%J%J%%%jjjjkkjkkkkjjjjj%%%%%%%J%%%J%%%J%%%%%j%%JJ%%J%J%J
538A03JJJJJJJJJK%J%%%%%jjjkkjjjjjkj%%j%%%%%%%%%%%J%%J%%%%%j%%%%%%%%%%%J%%JJ%
$$ y = [1672, 1569, 1476, 1392, 1316, 1247, 1185, 1128, 1077, 1030, 988, 951, 919, 892, 868, 848, 832, 819, 810, 803, 801, 802, 808, 818, 832, 850, 871, 898, 929, 965, 1008, 1059, 1120, 1189, 1266, 1347, 1427, 1504, 1574, 1635, 1682, 1712, 1721, 1705, 1663, 1592, 1496, 1380, 1253, 1124, 1001, 891, 798, 721, 660, 612, 575, 546, 523, 504, 487, 472, 459, 447, 436, 425, 413, 402, 391, 379, 369, 358, 347, 338, 330, 324, 318, 316, 315, 316, 318, 322, 327, 333, 340, 347, 355, 363, 369, 376, 382, 386, 389, 391, 390, 388, 383, 377, 369, 360, 350, 338, 325, 312, 299, 286, 274, 262, 251, 241, 230, 220, 209, 198, 188, 180, 173, 168, 165, 164, 165, 166, 167, 168, 169, 169, 169, 169, 167, 166, 164, 162, 159, 156, 152, 148, 143, 139, 135, 131, 128, 126, 125, 125, 126, 127, 128, 130, 133, 136, 139, 142, 144, 146, 148, 149, 149, 150, 150, 151, 152, 153, 153, 155, 156, 157, 159, 160, 161, 162, 164, 165, 167, 167, 168, 168, 168, 167, 166, 164, 161, 159, 158, 156, 154, 153, 151, 149, 147, 145, 143, 142, 141, 140, 139, 139, 138, 138, 138, 137, 137, 137, 137, 136, 136, 136, 135, 134, 133, 133, 132, 132, 132, 131, 131, 131, 131, 131, 131, 131, 131, 132, 132, 132, 131, 132, 133, 133, 134, 133, 133, 133, 132, 130, 128, 126, 124, 122, 119, 118, 116, 115, 113, 112, 111, 110, 110, 111, 113, 114, 115, 116, 117, 118, 119, 119, 119, 118, 117, 116, 115, 114, 113, 112, 111, 110, 109, 108, 108, 108, 108, 108, 107, 107, 107, 107, 106, 105, 104, 103, 103, 102, 101, 100, 99, 99, 99, 99, 100, 101, 102, 104, 107, 109, 111, 113, 115, 117, 119, 120, 121, 121, 121, 120, 119, 117, 115, 113, 111, 109, 108, 107, 106, 106, 105, 105, 105, 105, 105, 106, 107, 107, 107, 107, 106, 107, 107, 108, 108, 108, 108, 108, 109, 110, 110, 111, 111, 111, 112, 112, 112, 113, 113, 114, 115, 115, 115, 116, 116, 117, 117, 118, 118, 118, 118, 117, 116, 115, 114, 112, 110, 109, 107, 105, 103, 101, 100, 99, 98, 97, 96, 96, 96, 96, 96, 96, 96, 96, 97, 97, 97, 97, 98, 98, 98, 98, 99, 99, 99, 99, 99, 99, 98, 98, 98, 99, 100, 100, 100, 101, 101, 102, 102, 103, 104, 105, 106, 107, 108, 109, 110, 111, 112, 114, 114, 115, 115, 115, 115, 115, 115, 114, 113, 112, 110, 108, 107, 106, 105, 104, 103, 101, 100, 100, 100, 99, 99, 99, 99, 99, 99, 99, 99, 99, 99, 99, 99, 100, 100, 100, 101, 101, 101, 101, 101, 101, 100, 100, 100, 100, 100, 100, 100, 100, 100, 100, 100, 100, 101, 101, 101, 102, 103, 103]
531A03J%J%KJJJJKKJKLLMMNOQPRJ1J2J2J3J3J3J0ROM%korj3j5j5j6j5j2j0rpnmmlkkkjjjj
525A15%%jjj%j%j%%%%JJJJJJJJKKLLMNOPQRJ0J1J3J3J2J2J1RPMKkorj2j4j4j5j4j3j1qpon
519A35nlmkkkk%jj%jj%jjj%j%jj%jj%j%j%j%%%%%%j%%%%%%%%%J%%J%J%%%%%%J%%%%jj%jj%
511I9%J%%%%%%J%%Jjj%j%%%%j%%%j%%%j%j%J%%%%%%%%j%%%%Jj%%%j%%%%J%%%%%%%%%%%%%J
504I6%%%%%%%j%J%%j%%%%%%%%%j%%%%j%J%%%j%%%%%%%%J%%%%%%%J%%%%%%%%%Jj%%%%%Jj%%
496I5j%%%%%%%%%%%%%%Jj%%%%J%%j%%%%%j%J%%J%%%J%%j%%%%%%j%j%j%Jj%%%%%%%J%%%%%%
489I3J%jJ%%%%%%J%J%%j%%%J%%j%j%%%%%%%%%j%j%j%j%j%%jjjj%%%%%J%%J%%%JJKJJJJKJJ
481I9KJKKJKKKKKKJJJJjjkjlklkkjkkjjjjjjjjjjjj%jjj%%%%%%%%J%JJJJ%JJJKJKJJJKLKK
$$ y = [103, 104, 104, 105, 105, 107, 108, 109, 110, 111, 113, 115, 116, 118, 121, 124, 128, 132, 137, 143, 151, 158, 167, 178, 190, 202, 215, 228, 241, 251, 260, 266, 270, 270, 268, 262, 253, 240, 225, 210, 194, 179, 167, 157, 148, 141, 136, 132, 128, 125, 123, 121, 119, 118, 117, 116, 115, 115, 115, 114, 113, 112, 112, 111, 111, 110, 110, 110, 110, 110, 111, 112, 113, 114, 115, 116, 117, 118, 120, 122, 125, 128, 132, 137, 143, 150, 158, 167, 177, 188, 201, 214, 226, 238, 249, 258, 265, 269, 271, 269, 263, 254, 242, 228, 214, 199, 185, 172, 161, 153, 146, 140, 135, 130, 127, 123, 121, 119, 117, 115, 115, 114, 113, 113, 112, 111, 111, 110, 109, 108, 108, 107, 107, 106, 105, 105, 104, 103, 103, 102, 102, 101, 101, 100, 100, 100, 100, 100, 100, 100, 99, 99, 99, 99, 99, 99, 99, 99, 99, 99, 100, 100, 100, 101, 101, 102, 102, 102, 102, 102, 102, 102, 103, 103, 103, 103, 103, 102, 101, 101, 100, 99, 99, 99, 100, 100, 100, 100, 100, 100, 100, 101, 101, 101, 102, 101, 100, 100, 99, 99, 99, 99, 99, 98, 98, 98, 98, 97, 97, 97, 97, 96, 96, 95, 95, 96, 96, 96, 96, 96, 96, 96, 96, 96, 95, 95, 95, 95, 95, 96, 95, 95, 95, 95, 94, 94, 94, 94, 94, 95, 95, 95, 95, 95, 95, 95, 95, 95, 95, 95, 95, 95, 95, 96, 96, 96, 96, 96, 96, 96, 96, 95, 95, 96, 96, 96, 95, 95, 95, 95, 95, 95, 95, 95, 95, 95, 94, 94, 94, 94, 94, 93, 93, 94, 94, 94, 94, 93, 93, 93, 93, 93, 93, 93, 93, 93, 94, 94, 94, 94, 94, 94, 94, 94, 95, 95, 95, 95, 95, 95, 95, 95, 95, 95, 96, 95, 95, 95, 95, 95, 95, 96, 95, 95, 95, 94, 94, 94, 94, 94, 94, 94, 94, 94, 94, 94, 94, 94, 94, 94, 95, 94, 94, 94, 94, 94, 95, 95, 95, 94, 94, 94, 94, 94, 94, 93, 93, 94, 94, 94, 95, 95, 95, 95, 96, 96, 96, 95, 95, 95, 95, 95, 95, 95, 94, 94, 93, 93, 92, 92, 93, 92, 92, 92, 92, 92, 92, 92, 92, 93, 93, 93, 93, 93, 93, 93, 94, 94, 93, 94, 94, 94, 94, 94, 94, 94, 95, 95, 96, 96, 96, 95, 95, 95, 95, 96, 96, 96, 95, 95, 94, 94, 94, 94, 94, 94, 94, 94, 94, 94, 93, 93, 92, 92, 91, 91, 90, 90, 89, 89, 89, 88, 87, 86, 85, 85, 85, 85, 85, 85, 86, 86, 86, 87, 87, 87, 87, 88, 89, 91, 92, 93, 94, 95, 97, 98, 99, 101, 102, 104, 106, 107, 109, 111, 113, 115, 117, 119, 120, 121, 122, 123, 122, 121, 119, 118, 115, 113, 110, 108, 106, 105, 103, 101, 100, 99, 98, 97, 96, 95, 94, 93, 92, 91, 90, 89, 89, 88, 87, 86, 86, 86, 86, 86, 86, 86, 86, 86, 87, 87, 88, 89, 90, 91, 91, 92, 93, 94, 96, 97, 99, 100, 101, 102, 104, 107, 109, 111]
474A11LKJKJJJ%%jjklkkkkkkjjjj%jjj%%%%%%%jj%j%j%j%%J%%j%j%JJJ%j%%%%%%%%J%%%J%
466I4%%%%j%%%J%j%%%%%J%j%j%JJ%%%j%%%%J%%%j%%%%%%%%%%%%%%j%%%%jJ%%J%%%%%%%%%%
459I3j%%J%%%%%J%j%%%%j%%%J%%%%%%%%%%%%j%%%j%%J%%%j%%%%%%%%J%%%%%%%%%J%%%%%%J
451I4j%jJ%%%%%%%%%%%%%%%%%%jJ%%%%j%%J%%jj%%%%%%%%J%%%%jJ%%j%%%%%%%%%J%%%j%%J
444I2%j%%j%J%%%%%%J%%j%J%%%Jj%%%J%%%j%J%j%%Jj%%j%%%%J%%j%j%%%Jj%%jJ%%J%%%J%j
436I1%%%%j%J%J%%j%%%J%%%Jjj%J%%%j%%%%J%j%%%%%%%jj%%JJ%%jjJ%J%j%J%j%%%%%%%j%J
429I0%J%%%%%%%%%%%%%%%%Jj%%%%%%%%%%j%j%%%J%%J%j%%%%%j%Jj%%%%%%%%%J%%%%%%%%%%
421I0%%j%%%%%J%%%%%%%%%%J%%j%j%%%J%%%%%j%%%%%%%%%%%%%%J%%%%%%%%%%%%j%%%J%%%%
$$ y = [111, 114, 116, 117, 119, 120, 121, 122, 122, 122, 121, 120, 118, 115, 113, 111, 109, 107, 105, 103, 102, 101, 100, 99, 99, 98, 97, 96, 96, 96, 96, 96, 96, 96, 96, 95, 94, 94, 93, 93, 92, 92, 91, 91, 91, 92, 92, 92, 91, 91, 90, 90, 91, 92, 93, 93, 92, 92, 92, 92, 92, 92, 92, 92, 92, 93, 93, 93, 93, 94, 94, 94, 94, 94, 94, 93, 93, 93, 93, 94, 94, 93, 93, 93, 93, 93, 93, 94, 94, 93, 93, 92, 92, 93, 94, 94, 94, 94, 93, 93, 93, 93, 93, 94, 94, 94, 94, 93, 93, 93, 93, 93, 93, 93, 93, 93, 93, 93, 93, 93, 93, 93, 92, 92, 92, 92, 92, 91, 92, 92, 92, 93, 93, 93, 93, 93, 93, 93, 93, 93, 93, 93, 92, 92, 92, 93, 93, 93, 93, 93, 93, 94, 94, 93, 93, 93, 93, 93, 92, 92, 92, 92, 93, 93, 93, 93, 93, 93, 93, 93, 93, 93, 93, 93, 93, 92, 92, 92, 92, 91, 91, 91, 92, 92, 92, 92, 91, 91, 91, 91, 91, 91, 91, 91, 91, 92, 92, 92, 92, 92, 92, 92, 92, 92, 92, 93, 93, 93, 93, 93, 93, 93, 94, 93, 93, 92, 93, 93, 93, 93, 93, 93, 93, 93, 93, 93, 93, 93, 93, 93, 93, 93, 93, 93, 93, 92, 93, 93, 93, 93, 93, 92, 92, 92, 93, 93, 93, 92, 91, 91, 91, 91, 91, 91, 91, 91, 91, 92, 92, 92, 92, 92, 91, 92, 92, 92, 91, 91, 91, 91, 91, 91, 91, 91, 91, 91, 92, 92, 92, 92, 91, 91, 91, 92, 92, 91, 91, 91, 90, 90, 91, 91, 91, 91, 91, 91, 91, 92, 92, 92, 91, 91, 92, 92, 92, 92, 93, 92, 92, 92, 92, 93, 93, 93, 93, 92, 92, 93, 93, 92, 92, 92, 93, 92, 92, 92, 91, 91, 91, 91, 91, 92, 92, 92, 91, 91, 90, 90, 90, 90, 91, 90, 90, 90, 89, 90, 90, 90, 91, 91, 91, 91, 92, 92, 91, 91, 91, 91, 91, 90, 90, 91, 91, 92, 92, 92, 91, 91, 91, 91, 92, 92, 92, 92, 93, 92, 91, 91, 92, 92, 92, 92, 91, 91, 91, 91, 91, 92, 92, 91, 91, 91, 91, 91, 91, 91, 91, 90, 89, 89, 89, 90, 91, 91, 91, 90, 89, 90, 90, 91, 91, 90, 90, 91, 91, 90, 90, 90, 90, 90, 90, 90, 90, 89, 89, 90, 90, 91, 91, 91, 91, 91, 91, 91, 91, 91, 91, 91, 91, 91, 91, 91, 91, 91, 92, 91, 91, 91, 91, 91, 91, 91, 91, 91, 91, 91, 90, 90, 89, 89, 89, 89, 90, 90, 90, 91, 91, 90, 90, 90, 90, 90, 90, 89, 89, 90, 89, 89, 89, 89, 89, 89, 89, 89, 89, 89, 90, 90, 90, 90, 90, 90, 90, 90, 90, 90, 90, 90, 90, 89, 89, 89, 89, 89, 89, 90, 90, 90, 90, 90, 90, 90, 90, 90, 90, 90, 91, 91, 91, 90, 90, 89, 89, 89, 89, 90, 90, 90, 90, 90, 90, 89, 89, 89, 89, 89, 89, 89, 89, 89, 89, 89, 89, 89, 89, 89, 90, 90, 90, 90, 90, 90, 90, 90, 90, 90, 90, 90, 90, 89, 89, 89, 89, 90, 90, 90, 90, 90]
414I0j%%%%%%%JJ%j%%%%j%%%%%%%%%%%%%%%%J%%J%%j%%%%%%j%%%%%jJJ%Jj%%%%%%%%%%%J%
406I1j%%%j%J%%%%%%%%%%%%%%%%%%J%%%j%%%%%%%jJ%%Jj%%%%%%%%J%Jj%%%%%%%%j%%%Jj%%
399I0j%J%%%%%%%%%%%%%%J%%j%%%%%%%%%%%%%%%%%%%%%%j%%%J%J%%%%J%j%%%j%j%%%%%Jj%
391H9%%%%%%%%%%%%%%%%JJ%%%%j%%%%%j%%J%%%%%%%%%%%%%%%j%%%%%%J%%%%%%j%%%%J%J%%
383I1j%%%%JJj%%%%%%%%%%%j%%%%%%%j%%J%%%%j%JJ%%jj%J%%%%%%%%%jJ%J%%j%%%jJ%J%JJ
376I3%%%j%J%%%%%j%%%%%%%%j%%%%%%%j%J%%%%%%%%%%%j%jJ%Jj%%%%%%jJ%%J%%%J%j%%%%%
368I1%%%%%J%%j%%%%%%J%j%%%%jJ%%%%j%%%%%%%%%%%%%%%%%%%%j%%%j%J%J%%J%J%%j%%J%%
361I2%%%jj%%J%%%%%J%Jj%%%%%%%%%%%%%%%%%%%J%J%%J%%J%J%J%JK%JJ%j%%%%j%j%jjj%j%
$$ y = [90, 89, 89, 89, 89, 89, 89, 89, 89, 90, 91, 91, 90, 90, 90, 90, 90, 89, 89, 89, 89, 89, 89, 89, 89, 89, 89, 89, 89, 89, 89, 89, 89, 89, 90, 90, 90, 91, 91, 91, 90, 90, 90, 90, 90, 90, 90, 89, 89, 89, 89, 89, 89, 88, 89, 90, 90, 91, 90, 90, 90, 90, 90, 90, 90, 90, 90, 90, 90, 90, 91, 91, 90, 90, 90, 90, 89, 89, 90, 90, 90, 90, 90, 90, 90, 90, 90, 90, 90, 90, 90, 90, 90, 90, 90, 90, 90, 91, 91, 91, 91, 90, 90, 90, 90, 90, 90, 90, 90, 89, 90, 90, 90, 91, 90, 90, 90, 90, 90, 90, 90, 90, 90, 91, 91, 92, 91, 91, 91, 91, 91, 91, 91, 91, 91, 90, 90, 90, 90, 91, 90, 90, 90, 89, 89, 90, 90, 90, 90, 90, 90, 90, 90, 90, 90, 90, 90, 90, 90, 90, 91, 91, 91, 90, 90, 90, 90, 90, 90, 90, 90, 90, 90, 90, 90, 90, 90, 90, 90, 90, 90, 90, 90, 90, 90, 90, 89, 89, 89, 89, 90, 90, 91, 91, 91, 91, 91, 92, 92, 91, 91, 91, 91, 90, 90, 89, 89, 89, 89, 89, 89, 90, 89, 89, 89, 89, 89, 89, 89, 89, 89, 89, 89, 89, 89, 89, 89, 89, 89, 89, 90, 91, 91, 91, 91, 91, 90, 90, 90, 90, 90, 90, 89, 89, 89, 90, 90, 90, 90, 90, 90, 90, 90, 90, 90, 90, 90, 90, 90, 90, 90, 89, 89, 89, 89, 89, 89, 89, 90, 90, 90, 90, 90, 90, 90, 89, 89, 89, 89, 89, 90, 90, 91, 91, 91, 90, 90, 90, 90, 90, 91, 92, 91, 91, 91, 91, 91, 91, 91, 91, 91, 91, 91, 91, 90, 90, 90, 90, 90, 90, 90, 90, 89, 89, 89, 90, 90, 90, 90, 90, 89, 89, 90, 91, 91, 91, 90, 89, 89, 90, 90, 90, 90, 90, 90, 90, 90, 90, 90, 89, 90, 90, 91, 91, 91, 90, 90, 90, 90, 89, 90, 90, 91, 91, 92, 93, 93, 93, 93, 92, 92, 93, 93, 93, 93, 93, 93, 92, 92, 92, 92, 92, 92, 92, 92, 92, 91, 91, 91, 91, 91, 91, 91, 91, 90, 90, 91, 91, 91, 91, 91, 91, 91, 91, 91, 91, 91, 91, 90, 90, 89, 90, 90, 91, 90, 90, 90, 90, 90, 90, 90, 89, 90, 90, 90, 91, 91, 91, 91, 92, 92, 91, 91, 91, 91, 91, 91, 91, 91, 91, 91, 91, 92, 92, 92, 91, 91, 91, 91, 91, 91, 91, 92, 92, 91, 91, 91, 91, 91, 90, 91, 91, 91, 91, 91, 90, 90, 90, 90, 90, 90, 90, 90, 90, 90, 90, 90, 90, 90, 90, 90, 90, 90, 90, 90, 90, 89, 89, 89, 89, 88, 88, 89, 89, 90, 90, 90, 91, 91, 92, 92, 92, 91, 91, 91, 92, 92, 92, 92, 92, 92, 91, 90, 90, 90, 91, 91, 91, 91, 91, 91, 92, 92, 93, 92, 92, 92, 92, 92, 92, 92, 92, 92, 92, 92, 92, 92, 92, 92, 92, 92, 92, 92, 92, 93, 93, 94, 94, 94, 95, 95, 95, 96, 96, 97, 97, 98, 98, 99, 101, 101, 102, 103, 103, 102, 102, 102, 102, 102, 101, 101, 100, 100, 99, 98, 97, 97, 96, 96]
353I6j%Jj%j%Jj%%%%%%j%%%%Jj%%%%%%%%%J%%J%%J%%J%J%J%J%J%J%%%k%%%jjj%j%j%j%j%%
346I3%%%Jj%%%j%%j%%%%%%%%%%%%%Jj%%%%%%%%%%j%%%J%%%%%%%jJ%%%%%J%j%%%j%%J%%%J%
338I2%%%%j%%jJ%%%Jjj%%%%%%J%%j%J%j%%%%%%J%J%j%%%%%%%j%%Jj%J%%jJ%%%%%%j%jJ%%%
331I0%%%%%%%J%%%%%j%%%%%%%%%%Jj%%%j%%%J%%%%%%%%%%%Jj%j%%%J%%%j%J%%%j%%%%%%%%
323H9Jj%%%J%%%%J%%j%%%%%%%%%%%%%%%%%%Jj%%j%J%%%Jj%%%%%%j%J%j%%%%%%%J%%%j%J%%
316I0%%%%%%%%%%Jj%%%%%%%%%%%%%%%%%%%Jj%%%%%%%%%%%%J%%%Jj%%%%%j%%%%%%%%%%%%%%
308I0%%%%%%Jj%%j%%%%J%%j%%J%%%%%%%%jJ%%%%%%%%%%%%%%%%Jj%%j%J%%%%%%%j%%%%Jj%%
301H9%J%%%%%%%%%%%%%%%%%%%%%%%%%%%%%%Jj%jJ%%%%j%%%%%%%%%%%%%%%%%%%%%%%%%%%%%
$$ y = [96, 95, 95, 96, 95, 95, 94, 94, 95, 94, 94, 94, 94, 94, 94, 94, 93, 93, 93, 93, 93, 94, 93, 93, 93, 93, 93, 93, 93, 93, 93, 93, 94, 94, 94, 95, 95, 95, 96, 96, 96, 97, 97, 98, 98, 99, 99, 100, 100, 101, 101, 102, 102, 102, 102, 100, 100, 100, 100, 99, 98, 97, 97, 96, 96, 95, 95, 94, 94, 93, 93, 93, 93, 93, 93, 94, 93, 93, 93, 93, 92, 92, 92, 91, 91, 91, 91, 91, 91, 91, 91, 91, 91, 91, 91, 91, 91, 92, 91, 91, 91, 91, 91, 91, 91, 91, 91, 91, 91, 90, 90, 90, 90, 91, 91, 91, 91, 91, 91, 91, 91, 90, 91, 91, 91, 91, 91, 91, 92, 92, 91, 91, 91, 91, 90, 90, 90, 91, 91, 91, 91, 92, 92, 92, 92, 92, 92, 91, 91, 91, 90, 91, 91, 91, 91, 92, 91, 90, 90, 90, 90, 90, 90, 90, 91, 91, 91, 90, 90, 91, 91, 90, 90, 90, 90, 90, 90, 90, 91, 91, 92, 92, 91, 91, 91, 91, 91, 91, 91, 91, 90, 90, 90, 91, 90, 90, 91, 91, 91, 90, 91, 91, 91, 91, 91, 91, 91, 90, 90, 89, 90, 90, 90, 90, 90, 90, 90, 90, 90, 90, 90, 91, 91, 91, 91, 91, 91, 90, 90, 90, 90, 90, 90, 90, 90, 90, 90, 90, 91, 90, 90, 90, 90, 89, 89, 89, 89, 90, 90, 90, 90, 90, 90, 90, 90, 90, 90, 90, 90, 91, 90, 90, 89, 89, 89, 89, 90, 90, 90, 90, 89, 89, 90, 90, 90, 90, 89, 89, 89, 89, 89, 89, 89, 89, 89, 90, 89, 89, 89, 89, 90, 90, 90, 90, 90, 91, 91, 91, 90, 90, 90, 90, 90, 90, 90, 90, 90, 90, 90, 90, 90, 90, 90, 90, 90, 90, 90, 91, 90, 90, 90, 89, 89, 90, 90, 90, 90, 91, 90, 90, 90, 90, 90, 90, 90, 89, 89, 90, 90, 89, 89, 89, 89, 89, 89, 89, 89, 90, 90, 90, 90, 89, 89, 90, 90, 90, 90, 90, 90, 90, 90, 90, 90, 90, 90, 90, 91, 90, 90, 90, 90, 90, 90, 90, 90, 90, 90, 90, 90, 90, 90, 90, 90, 90, 90, 90, 90, 91, 90, 90, 90, 90, 90, 90, 90, 90, 90, 90, 90, 90, 90, 91, 91, 91, 91, 92, 91, 91, 91, 91, 91, 91, 90, 90, 90, 90, 90, 90, 90, 90, 90, 90, 90, 90, 90, 90, 90, 90, 90, 90, 90, 90, 90, 91, 90, 90, 90, 89, 89, 89, 89, 89, 90, 90, 90, 89, 89, 89, 90, 90, 90, 90, 90, 90, 90, 90, 90, 89, 90, 90, 90, 90, 90, 90, 90, 90, 90, 90, 90, 90, 90, 90, 90, 90, 90, 91, 90, 90, 90, 89, 89, 90, 90, 90, 90, 90, 90, 90, 90, 89, 89, 89, 89, 89, 90, 89, 89, 89, 89, 90, 90, 90, 90, 90, 90, 90, 90, 90, 90, 90, 90, 90, 90, 90, 90, 90, 90, 90, 90, 90, 90, 90, 90, 90, 90, 90, 90, 90, 90, 90, 91, 90, 90, 89, 90, 90, 90, 90, 90, 89, 89, 89, 89, 89, 89, 89, 89, 89, 89, 89, 89, 89, 89, 89, 89, 89, 89, 89, 89, 89, 89, 89, 89, 89, 89, 89, 89, 89, 89]
293H9%J%%j%J%%%%%%%%jj%%%%J%%%%%%%%J%Jj%j%%j%%J%%%%jJ%%%%j%%%%J%%%%J%%%%%%%j
286H9%%%%%J%%%j%%%%%%%%%%%J%%j%Jj%J%%%%%%%j%%%%%J%Jjj%%%%%J%%%Jj%%jJ%J%j%%j%
278H9%%%%%%%%%J%%%%jJ%%%%j%%%%%%%%Jjj%J%%Jj%%J%%%J%j%%j%J%%%j%%%%%%j%%%%%%J%
271H9%%%J%%%%%%jjJ%%jJ%%%%%%%%%%%%%%Jj%%%%%J%%%j%J%%%%%%jJ%%%%%j%%%J%j%%%%%%
263H9%%%%%%%%%J%%%%j%J%%j%%%%%%%J%%%%%J%j%%%%j%J%%%%%%%%%j%%%%J%%%%%J%j%%%%%
256I0%%%%%%%%j%%J%%%%%%%%%%%%%%%j%%J%%%%j%%J%%%%%%%%%%%%jJ%%%%%%%%%%j%%%%%%%
248H9%%%%%%%%jJ%J%%%JjJ%%%%%%%%%%jj%%J%%%%%%%%%J%%%%%%j%%%%%j%%K%%jJj%j%J%%%
241I0%%%%%j%%%J%%%%%%%jJ%J%%jj%%%%%%%%%J%%%%j%%j%%J%%J%%%%%j%J%jJ%J%j%%%%%%%
$$ y = [89, 89, 90, 90, 90, 89, 89, 90, 90, 90, 90, 90, 90, 90, 90, 90, 89, 88, 88, 88, 88, 88, 89, 89, 89, 89, 89, 89, 89, 89, 89, 90, 90, 91, 90, 90, 89, 89, 89, 88, 88, 88, 89, 89, 89, 89, 89, 88, 89, 89, 89, 89, 89, 88, 88, 88, 88, 88, 89, 89, 89, 89, 89, 90, 90, 90, 90, 90, 90, 90, 90, 89, 89, 89, 89, 89, 89, 90, 90, 90, 90, 89, 89, 89, 89, 89, 89, 89, 89, 89, 89, 89, 89, 90, 90, 90, 89, 89, 90, 89, 89, 90, 90, 90, 90, 90, 90, 90, 90, 89, 89, 89, 89, 89, 89, 90, 90, 91, 90, 89, 89, 89, 89, 89, 89, 90, 90, 90, 90, 91, 90, 90, 90, 89, 90, 90, 91, 91, 90, 90, 90, 89, 89, 89, 89, 89, 89, 89, 89, 89, 89, 89, 90, 90, 90, 90, 90, 89, 90, 90, 90, 90, 90, 89, 89, 89, 89, 89, 89, 89, 89, 89, 90, 89, 88, 88, 89, 89, 89, 90, 89, 89, 89, 90, 90, 90, 90, 91, 91, 90, 90, 90, 89, 89, 90, 90, 90, 90, 89, 89, 89, 89, 89, 89, 89, 88, 88, 88, 88, 88, 88, 88, 89, 89, 89, 89, 89, 90, 90, 90, 90, 90, 90, 90, 89, 88, 89, 89, 89, 88, 89, 89, 89, 89, 89, 89, 89, 89, 89, 89, 89, 89, 89, 89, 89, 90, 89, 89, 89, 89, 89, 89, 90, 90, 90, 90, 89, 89, 90, 90, 90, 90, 90, 90, 90, 89, 90, 90, 90, 90, 90, 90, 89, 89, 89, 89, 90, 90, 89, 89, 89, 89, 89, 89, 89, 89, 89, 89, 89, 89, 89, 89, 89, 89, 90, 90, 90, 90, 90, 89, 89, 90, 90, 90, 89, 89, 89, 89, 89, 89, 89, 89, 90, 90, 90, 90, 90, 90, 91, 91, 90, 90, 90, 90, 90, 89, 89, 90, 90, 90, 90, 90, 90, 90, 90, 90, 90, 89, 89, 89, 89, 89, 90, 90, 90, 90, 90, 90, 91, 91, 90, 90, 90, 90, 90, 90, 90, 90, 90, 90, 90, 90, 90, 90, 89, 89, 89, 90, 90, 90, 90, 90, 90, 90, 90, 90, 90, 90, 90, 90, 90, 90, 90, 89, 89, 89, 90, 90, 90, 90, 90, 89, 89, 89, 90, 90, 90, 90, 90, 90, 90, 90, 90, 90, 90, 90, 90, 89, 90, 90, 90, 90, 90, 90, 90, 90, 90, 90, 90, 89, 89, 89, 89, 89, 89, 89, 89, 89, 89, 89, 89, 89, 89, 89, 89, 88, 89, 89, 90, 90, 90, 90, 91, 90, 91, 91, 91, 91, 91, 91, 91, 91, 91, 91, 91, 90, 89, 89, 89, 90, 90, 90, 90, 90, 90, 90, 90, 90, 90, 91, 91, 91, 91, 91, 91, 91, 90, 90, 90, 90, 90, 90, 89, 89, 89, 91, 91, 91, 90, 91, 90, 90, 89, 89, 90, 90, 90, 90, 90, 90, 90, 90, 90, 89, 89, 89, 89, 90, 90, 90, 90, 90, 90, 90, 90, 89, 90, 90, 91, 91, 91, 90, 89, 89, 89, 89, 89, 89, 89, 89, 89, 89, 90, 90, 90, 90, 90, 89, 89, 89, 88, 88, 88, 89, 89, 89, 90, 90, 90, 90, 90, 90, 89, 89, 90, 90, 89, 90, 90, 91, 91, 90, 90, 90, 90, 90, 90, 90, 90]
233I0%%%j%%%%%%%J%%Jj%%%j%%%%%%%%%%%j%J%j%%%J%J%%%%j%%%j%%%JJ%j%J%%%j%%%J%%%
225I0%%%%%%j%%J%%%%%j%%%%%J%%%%j%%%%%J%%%%jJ%%%%%%Jj%%%%%J%%Jj%jj%%%Jj%%%J%%
218I0j%%%j%%%%J%%%%%%%%%J%%%j%%%J%%%%%%j%%%%%%%J%%%%j%%%J%%%%j%%%%%%%%%%%J%%
210I0%%%%%j%%%j%%J%%%j%%J%%%%%J%%%%%%%%j%%%%%%%%%%%j%J%J%j%%j%%%J%Jj%%%%%%%%
203H9%%%J%%%%j%%%%%%%%%%%%%%JJ%jj%Jj%J%%%%jjJJ%%%%%j%%%Jj%%jJJ%%%%%%%%j%%%J%
195I0%%%%%%%%j%%J%Jj%%%%%%%%%%j%%%%%%J%%%%%j%%%%%J%%j%%%%J%%%%%%%%j%%%%%%j%%
188H8J%%%%J%%j%%%J%%j%%%%%J%%j%%%%%%J%%%j%J%%%j%%jJ%%%%%%%%%%%%j%J%%%j%%J%%%
180H9%%J%%%j%%%%%%jJ%%J%jJj%%%Jj%%J%J%%j%j%%%J%%j%%j%%%J%%%%%%%%Jj%%%%%%%%%%
$$ y = [90, 90, 90, 90, 89, 89, 89, 89, 89, 89, 89, 89, 90, 90, 90, 91, 90, 90, 90, 90, 89, 89, 89, 89, 89, 89, 89, 89, 89, 89, 89, 89, 88, 88, 89, 89, 88, 88, 88, 88, 89, 89, 90, 90, 90, 90, 90, 89, 89, 89, 89, 88, 88, 88, 88, 89, 90, 90, 89, 89, 90, 90, 90, 90, 89, 89, 89, 89, 90, 90, 90, 90, 90, 90, 90, 90, 90, 90, 89, 89, 89, 90, 90, 90, 90, 90, 90, 89, 89, 89, 89, 89, 89, 90, 90, 90, 90, 90, 89, 89, 89, 89, 89, 89, 90, 90, 90, 90, 90, 89, 90, 90, 90, 90, 90, 90, 90, 91, 90, 90, 90, 90, 90, 90, 91, 91, 91, 92, 91, 91, 90, 89, 89, 89, 89, 90, 89, 89, 89, 89, 90, 90, 90, 89, 89, 89, 89, 88, 88, 88, 88, 88, 89, 89, 89, 89, 89, 89, 89, 89, 89, 89, 90, 90, 90, 90, 89, 89, 89, 89, 90, 90, 90, 90, 90, 90, 90, 89, 89, 89, 89, 89, 89, 89, 89, 90, 90, 90, 90, 90, 89, 89, 89, 89, 90, 90, 90, 90, 90, 89, 89, 89, 89, 89, 89, 89, 89, 89, 89, 89, 89, 90, 90, 90, 90, 90, 90, 90, 90, 89, 89, 89, 89, 88, 88, 88, 89, 89, 89, 89, 88, 88, 88, 89, 89, 89, 89, 89, 89, 90, 90, 90, 90, 90, 90, 90, 90, 90, 89, 89, 89, 89, 89, 89, 89, 89, 89, 89, 89, 89, 88, 88, 89, 89, 90, 90, 89, 89, 89, 88, 88, 88, 88, 89, 89, 90, 89, 89, 89, 89, 89, 89, 89, 89, 89, 89, 89, 89, 90, 90, 90, 90, 90, 89, 89, 89, 89, 89, 89, 89, 89, 89, 89, 89, 89, 89, 89, 89, 90, 91, 91, 90, 89, 89, 90, 89, 89, 90, 90, 90, 90, 90, 89, 88, 89, 90, 90, 90, 90, 90, 90, 89, 89, 89, 89, 90, 89, 89, 89, 88, 89, 90, 90, 90, 90, 90, 90, 90, 90, 90, 89, 89, 89, 89, 90, 90, 90, 90, 90, 90, 90, 90, 90, 90, 89, 89, 89, 90, 90, 91, 90, 90, 90, 90, 90, 90, 90, 90, 90, 90, 90, 89, 89, 89, 89, 89, 89, 89, 90, 90, 90, 90, 90, 90, 89, 89, 89, 89, 89, 89, 90, 90, 90, 89, 89, 89, 89, 89, 90, 90, 90, 90, 90, 90, 90, 90, 90, 89, 89, 89, 89, 89, 89, 89, 88, 88, 88, 89, 89, 89, 89, 89, 90, 90, 90, 89, 89, 89, 89, 90, 90, 90, 89, 89, 89, 89, 89, 89, 90, 90, 90, 89, 89, 89, 89, 89, 89, 89, 90, 90, 90, 90, 89, 89, 90, 90, 90, 90, 89, 89, 89, 88, 89, 89, 89, 89, 89, 89, 89, 89, 89, 89, 89, 89, 89, 88, 88, 89, 89, 89, 89, 88, 88, 88, 89, 89, 89, 89, 89, 89, 90, 90, 90, 90, 89, 89, 89, 89, 89, 89, 89, 88, 89, 89, 89, 90, 90, 89, 90, 89, 89, 89, 89, 90, 89, 89, 89, 90, 90, 91, 91, 91, 90, 90, 89, 89, 89, 89, 90, 90, 90, 89, 89, 89, 88, 88, 88, 88, 89, 89, 89, 89, 89, 89, 89, 89, 89, 90, 89, 89, 89, 89, 89, 89, 89, 89, 89, 89, 89]
173H9%%%%%%%%%%%%%%%%%J%%%%%%%%%%%%j%%%%%Jj%j%J%%%%%%J%%%jJ%j%%%j%%%%J%%%%%J
165I0%%%j%%%j%%%JJ%JjJ%j%j%%%%%%%%%%J%%j%J%%j%J%J%%%%j%%%%%j%%%%%%%J%%Jj%%%%
158I0%%%%%j%J%%%%%%%%%%%%j%%%%J%j%%%%%%%%j%J%%%%j%J%%%J%jJ%%%%%%%%%%%j%%%%%%
150H9%%%%%%%J%%%%%%%%%%j%%%%%%%%%%%%%%%%%%%jJ%%%%J%%%j%%%%%%%%%%%%%J%%%%jJ%%
143I0%%%%%%%j%J%%%%j%%j%%%%%%%J%%%%%%%j%%Jj%%%J%%J%%j%%J%%%%%%j%%J%%%j%j%%%J
135H9%Jj%J%%%%Jj%%%%%%%%j%%%%Jj%%%%%J%%%j%%%j%%%%%J%%J%%%j%%jJ%%%%j%%J%%%%%%
128H9%%%%%%%%%%%%%%J%%%%j%%J%%j%j%%%%%J%%%%J%jj%%J%%Jj%j%%%%J%%%%%%j%%J%%%j%
120H8%%%J%%%%%%%%%%%j%%%%%%%Jj%%%%%%%%%J%%%%%j%%%%%%%%J%Jj%%j%%%%%%%J%%%j%%%
$$ y = [89, 89, 89, 89, 89, 89, 89, 89, 89, 89, 89, 89, 89, 89, 89, 89, 89, 89, 90, 90, 90, 90, 90, 90, 90, 90, 90, 90, 90, 90, 90, 89, 89, 89, 89, 89, 89, 90, 89, 89, 88, 88, 89, 89, 89, 89, 89, 89, 89, 90, 90, 90, 90, 89, 90, 90, 89, 89, 89, 89, 88, 88, 88, 88, 88, 89, 89, 89, 89, 89, 89, 90, 90, 90, 90, 89, 89, 89, 89, 88, 88, 88, 88, 89, 90, 90, 91, 90, 91, 91, 90, 90, 89, 89, 89, 89, 89, 89, 89, 89, 89, 89, 89, 90, 90, 90, 89, 89, 90, 90, 90, 89, 89, 90, 90, 91, 91, 91, 91, 91, 90, 90, 90, 90, 90, 90, 89, 89, 89, 89, 89, 89, 89, 89, 90, 90, 90, 91, 90, 90, 90, 90, 90, 90, 90, 90, 90, 90, 89, 89, 90, 90, 90, 90, 90, 90, 90, 90, 90, 90, 90, 90, 90, 89, 89, 89, 89, 89, 90, 90, 89, 89, 89, 89, 89, 89, 89, 89, 89, 88, 88, 89, 89, 89, 89, 89, 88, 88, 89, 89, 89, 89, 90, 90, 89, 90, 90, 90, 90, 90, 90, 90, 90, 90, 90, 90, 90, 89, 89, 89, 89, 89, 89, 89, 89, 89, 89, 89, 89, 89, 89, 90, 90, 90, 90, 90, 90, 90, 90, 90, 90, 90, 89, 89, 89, 89, 89, 89, 89, 89, 89, 89, 89, 89, 89, 89, 89, 89, 89, 89, 89, 89, 88, 89, 89, 89, 89, 89, 90, 90, 90, 90, 89, 89, 89, 89, 89, 89, 89, 89, 89, 89, 89, 89, 89, 89, 90, 90, 90, 90, 90, 89, 90, 90, 90, 90, 90, 90, 90, 90, 90, 90, 89, 89, 90, 90, 90, 90, 90, 89, 89, 89, 88, 88, 88, 88, 88, 88, 88, 88, 89, 89, 89, 89, 89, 89, 89, 89, 88, 88, 88, 89, 88, 88, 88, 88, 89, 89, 89, 90, 90, 90, 89, 89, 89, 90, 90, 90, 90, 90, 90, 90, 89, 89, 89, 90, 90, 90, 90, 89, 89, 88, 88, 88, 88, 89, 89, 90, 89, 89, 90, 90, 90, 90, 90, 91, 90, 90, 90, 90, 90, 90, 90, 90, 90, 89, 89, 89, 89, 89, 90, 89, 89, 89, 89, 89, 89, 90, 90, 90, 90, 89, 89, 89, 89, 88, 88, 88, 88, 88, 88, 89, 89, 89, 90, 90, 90, 90, 89, 89, 89, 88, 89, 89, 89, 89, 89, 88, 88, 88, 89, 89, 89, 89, 89, 89, 89, 89, 89, 89, 89, 89, 89, 89, 89, 89, 89, 89, 89, 89, 89, 90, 90, 90, 90, 90, 89, 89, 89, 90, 90, 90, 89, 89, 88, 88, 88, 88, 88, 88, 89, 89, 89, 89, 89, 90, 90, 89, 88, 88, 88, 89, 89, 89, 90, 89, 89, 88, 88, 88, 88, 88, 89, 89, 89, 89, 89, 89, 89, 88, 88, 88, 89, 89, 89, 89, 88, 88, 88, 88, 88, 89, 89, 89, 89, 89, 89, 89, 89, 89, 89, 89, 89, 88, 88, 88, 88, 88, 88, 88, 88, 89, 88, 88, 88, 88, 88, 88, 88, 88, 88, 88, 89, 89, 89, 89, 89, 89, 88, 88, 88, 88, 88, 88, 88, 88, 88, 89, 89, 90, 89, 89, 89, 88, 88, 88, 88, 88, 88, 88, 88, 89, 89, 89, 89, 88, 88, 88, 88]
113H8Jj%%J%%%%j%%Jj%j%J%%J%%%%j%%%%%%%%J%%%%%j%%%J%%%%%jJ%%%j%%%%%J%%%%%%j%%
105H8j%%%%%%J%%%%J%%j%%%J%%%%%j%%%J%%%%%%%%%%j%jJ%Jj%%%%%%%%%%%J%j%%%%%J%%j%
98H8%%%J%%j%%%%j%%%J%%J%jj%%J%%J%%%%%%J%%j%%%%j%%%J%%%%%j%%%%%%%J%%%%j%%%%J%
90H9%%Jj%%%%%%%%j%jJJJ%%j%%%%%%%%%%%%%%%%%%%%%%%%%%%%%%j%J%%%j%%%J%J%j%%%%%%
82H9%%%%%J%%%%%%%%%%jJ%Jjj%%%%%%%J%%%%%%j%jJ%%%%J%%j%%%%j%%JJj%%%%%%%%Jj%%jJ
75H9%%%%%%%%%%%%%%JJ%j%%j%%%%J%%%%%%%j%%%%%%J%%%%%%%%%%%%j%%%J%%%%%%j%%jJ%%%
67H9%%%%%j%J%%%%%J%%%%j%%%%%J%%j%%%%%%%%%%%%%%%J%j%%%%%%J%%%%%%%%j%%Jj%%jJ%J
59I0%J%%%J%J%%Jj%%%j%%j%%%%%j%%%%%jJ%%%%%%jJ%j%%j%J%%%%%%%%%Jj%%%%%jJ%%j%J%%
$$ y = [88, 89, 88, 88, 88, 89, 89, 89, 89, 89, 88, 88, 88, 89, 88, 88, 87, 87, 88, 88, 88, 89, 89, 89, 89, 89, 88, 88, 88, 88, 88, 88, 88, 88, 88, 89, 89, 89, 89, 89, 89, 88, 88, 88, 88, 89, 89, 89, 89, 89, 89, 88, 89, 89, 89, 89, 88, 88, 88, 88, 88, 88, 89, 89, 89, 89, 89, 89, 89, 88, 88, 88, 87, 87, 87, 87, 87, 87, 87, 88, 88, 88, 88, 88, 89, 89, 89, 88, 88, 88, 88, 89, 89, 89, 89, 89, 89, 88, 88, 88, 88, 89, 89, 89, 89, 89, 89, 89, 89, 89, 89, 89, 88, 88, 87, 88, 88, 89, 88, 88, 88, 88, 88, 88, 88, 88, 88, 88, 88, 88, 89, 89, 88, 88, 88, 88, 88, 88, 89, 89, 89, 88, 88, 88, 88, 88, 89, 89, 89, 88, 88, 88, 88, 88, 87, 87, 87, 87, 88, 88, 88, 89, 89, 88, 87, 87, 87, 88, 88, 88, 89, 89, 89, 89, 89, 89, 89, 90, 90, 90, 89, 89, 89, 89, 89, 88, 88, 88, 88, 89, 89, 89, 89, 89, 89, 88, 88, 88, 88, 88, 88, 88, 88, 89, 89, 89, 89, 89, 88, 88, 88, 88, 88, 89, 89, 89, 89, 90, 89, 89, 89, 89, 89, 89, 89, 89, 89, 88, 88, 87, 88, 89, 90, 90, 90, 89, 89, 89, 89, 89, 89, 89, 89, 89, 89, 89, 89, 89, 89, 89, 89, 89, 89, 89, 89, 89, 89, 89, 89, 89, 89, 89, 89, 89, 89, 89, 88, 88, 89, 89, 89, 89, 88, 88, 88, 88, 89, 89, 90, 90, 89, 89, 89, 89, 89, 89, 89, 89, 89, 89, 89, 89, 90, 90, 90, 90, 90, 90, 90, 90, 90, 90, 90, 89, 90, 90, 91, 90, 89, 89, 89, 89, 89, 89, 89, 89, 90, 90, 90, 90, 90, 90, 90, 89, 89, 88, 89, 89, 89, 89, 89, 90, 90, 90, 89, 89, 89, 89, 89, 88, 88, 88, 89, 90, 89, 89, 89, 89, 89, 89, 89, 89, 89, 90, 89, 89, 89, 88, 89, 89, 89, 89, 89, 89, 89, 89, 89, 89, 89, 89, 89, 89, 89, 90, 91, 91, 90, 90, 90, 89, 89, 89, 89, 89, 90, 90, 90, 90, 90, 90, 90, 90, 89, 89, 89, 89, 89, 89, 89, 90, 90, 90, 90, 90, 90, 90, 90, 90, 90, 90, 90, 90, 89, 89, 89, 89, 90, 90, 90, 90, 90, 90, 90, 89, 89, 89, 88, 89, 89, 89, 89, 89, 89, 89, 89, 89, 88, 88, 89, 89, 89, 89, 89, 89, 90, 90, 90, 90, 90, 89, 89, 89, 89, 89, 89, 90, 90, 90, 89, 89, 89, 89, 89, 89, 89, 89, 89, 89, 89, 89, 89, 89, 89, 89, 90, 90, 89, 89, 89, 89, 89, 89, 89, 90, 90, 90, 90, 90, 90, 90, 90, 90, 89, 89, 89, 90, 89, 89, 89, 88, 89, 89, 90, 90, 91, 91, 91, 91, 92, 92, 93, 93, 93, 94, 93, 93, 93, 93, 92, 92, 92, 91, 91, 91, 91, 91, 91, 90, 90, 90, 90, 90, 90, 89, 90, 90, 90, 90, 90, 90, 90, 89, 90, 90, 89, 89, 89, 88, 88, 89, 89, 89, 89, 89, 89, 89, 89, 89, 89, 90, 89, 89, 89, 89, 89, 89, 88, 89, 89, 89, 88, 88, 89, 89, 89]
52H9J%%%%%%%J%%J%%%%%%%%%JJ%JJ%%%JJJJJJJJJJJKKKKKKKJKJKJJJ%%jjklklmmlllkkjjj
44I4jj%%%j%%j%%%%%%%%%%%Jj%j%%%%%%%j%%%%%%J%j%%J%j%%%%%%%%%%%J%%%%%%j%%%%%%%
37H8%j%%%%%%%J%%J%%%%%%%j%j%%%Jj%JjJ%J%%%%%%%%%%j%%%%%%%J%%%%j%%%%J%%J%%%%J%
29I1%j%%%%%j%%%%%j%%jJ%%%%%%jJ%%j%j%J%%%%%J%%J%%j%%%%%%%%%J%%%%%%%%%%%Jj%%jJ
21H9%%%%%%%%%%%%%%%%jJ%%%%%%%%j%J%%%%%%%%%%%%%%%%%%%%%%%%%%%%%j%%%J%%%%%%j%%
14H8J%%%%%%%%%%%%%%J%%%j%%%j%%%%J%%%%%%%%%%%%j%%%%%Jj%%%%%J%%%%%%%jJJ%%j%%jJ
6H9%%%J%j%j%%%%%%%%%%J%%%%%j%%%JJ%%%%%%jJ%j%%j%%%%%J%%j%%%%J%%%%%J%j%j%J%%%%
-2H9%%%%j%%%%%%%%%%%J%%jJ%%%j%%%%%%%j%%%%%%%%%J%J%Jj%J%jj%%%J%%%%%j%%j%J%%%%
$$ y = [89, 90, 90, 90, 90, 90, 90, 90, 90, 91, 91, 91, 92, 92, 92, 92, 92, 92, 92, 92, 92, 92, 93, 94, 94, 95, 96, 96, 96, 96, 97, 98, 99, 100, 101, 102, 103, 104, 105, 106, 107, 109, 111, 113, 115, 117, 119, 121, 122, 124, 125, 127, 128, 129, 130, 130, 130, 129, 128, 126, 123, 121, 118, 114, 110, 107, 104, 101, 99, 97, 96, 95, 94, 93, 92, 92, 92, 92, 91, 91, 91, 90, 90, 90, 90, 90, 90, 90, 90, 90, 90, 90, 90, 91, 90, 90, 89, 89, 89, 89, 89, 89, 89, 89, 88, 88, 88, 88, 88, 88, 88, 89, 89, 88, 88, 88, 89, 89, 88, 88, 88, 88, 88, 88, 88, 88, 88, 88, 88, 88, 89, 89, 89, 89, 89, 89, 89, 88, 88, 88, 88, 88, 88, 88, 88, 88, 87, 87, 87, 87, 87, 87, 87, 87, 88, 88, 88, 89, 89, 89, 89, 89, 89, 89, 89, 88, 88, 87, 87, 87, 87, 88, 87, 87, 88, 87, 88, 88, 89, 89, 89, 89, 89, 89, 89, 89, 89, 89, 89, 88, 88, 88, 88, 88, 88, 88, 88, 89, 89, 89, 89, 89, 88, 88, 88, 88, 88, 89, 89, 89, 90, 90, 90, 90, 90, 91, 91, 91, 90, 90, 90, 90, 90, 90, 89, 89, 89, 89, 89, 89, 88, 88, 88, 87, 88, 88, 88, 88, 88, 88, 88, 87, 88, 88, 88, 87, 87, 86, 86, 87, 87, 87, 87, 87, 87, 88, 88, 88, 89, 89, 89, 88, 88, 88, 88, 88, 88, 88, 88, 88, 88, 89, 89, 89, 89, 89, 89, 89, 89, 89, 89, 89, 89, 90, 89, 89, 89, 88, 89, 89, 89, 89, 89, 89, 89, 89, 89, 89, 89, 89, 89, 89, 89, 89, 89, 88, 89, 89, 89, 89, 89, 89, 89, 89, 89, 88, 88, 89, 89, 89, 89, 89, 89, 89, 89, 89, 89, 89, 89, 89, 89, 89, 89, 89, 89, 89, 89, 89, 89, 89, 89, 89, 89, 89, 89, 89, 89, 88, 88, 88, 88, 89, 89, 89, 89, 89, 89, 89, 88, 88, 88, 89, 89, 89, 89, 89, 89, 89, 89, 89, 89, 89, 89, 89, 89, 89, 90, 90, 90, 90, 89, 89, 89, 89, 88, 88, 88, 88, 88, 89, 89, 89, 89, 89, 89, 89, 89, 89, 89, 89, 89, 89, 88, 88, 88, 88, 88, 88, 89, 88, 88, 88, 88, 88, 88, 89, 89, 89, 89, 89, 89, 89, 89, 88, 89, 90, 90, 90, 89, 89, 89, 88, 89, 89, 89, 89, 90, 90, 89, 89, 88, 88, 88, 88, 88, 88, 88, 88, 88, 88, 88, 89, 89, 89, 89, 89, 89, 88, 88, 88, 88, 89, 90, 90, 90, 90, 90, 90, 90, 89, 90, 90, 89, 89, 89, 88, 88, 88, 88, 88, 88, 89, 89, 89, 88, 88, 88, 88, 88, 89, 89, 89, 89, 89, 89, 90, 90, 89, 89, 88, 88, 89, 89, 89, 89, 89, 89, 89, 89, 89, 88, 88, 88, 88, 88, 88, 88, 88, 88, 88, 88, 88, 89, 89, 89, 88, 89, 89, 89, 89, 88, 88, 88, 88, 88, 88, 88, 88, 87, 87, 87, 87, 87, 87, 87, 87, 87, 87, 88, 88, 89, 89, 90, 89, 89, 90, 90, 89, 88, 88, 88, 88, 89, 89, 89, 89, 89, 89, 88, 88, 88, 87, 87, 88, 88, 88, 88, 88]
-9H8%%%%%j%%%%%%J%%%J%%%%%j%%%%%%%%%%%%%%j%%Jj%%J%%%%J%jj%%jJ%%%%%%J%%%J%j%%
-17H8%%%%%jJ%%%%%%%jJ%%%%j%%J%%%%%jJj%%%%%%%%%%%%%J%%%%%%%%j%jJJ%J%j%%%%%%%%
-24H8%%%%j%%%%J%%%%%%%%%%%Jj%%%%%%%%%%%%j%J%%%j%%%%%J%%%j%%J%%%%%J%%%%%%j%j%
-32H7J%%j%J%%j%%%%%J%%%%j%%%%J%%Jj%%j%%%%%J%%%%%%%%j%%%%%%%J%j%%%%%J%%j%J%J%
-40H9J%%j%%j%%%%%Jj%%J%%j%%%%J%j%%%%%%%%%%%%%%%%%%%%%J%j%%%%%%%%%%%%%%%%%%%%
-47H8%%%%%%J%jj%%%J%%%%%J%J%%j%%%%%%%%j%Jj%%%%%J%%%%%%%%%%%j%%%%%%jj%J%J%%%%
-55H8%%%%%j%%J%%%%%%%%%j%%%%J%%%%%%%%%%%%%%%%j%%%J%%JJ%%jjj%%J%j%%J%%%J%j%%J
-62H9j%J%%%%%%j%%%%J%%j%%J%%%%%%%%%%%%jJ%j%%J%%%%%%%%j%%%%%%%%%%%%%%%%%%%%%%
$$ y = [88, 88, 88, 88, 88, 88, 87, 87, 87, 87, 87, 87, 87, 88, 88, 88, 88, 89, 89, 89, 89, 89, 89, 88, 88, 88, 88, 88, 88, 88, 88, 88, 88, 88, 88, 88, 88, 88, 87, 87, 87, 88, 87, 87, 87, 88, 88, 88, 88, 88, 89, 89, 88, 87, 87, 87, 86, 87, 87, 87, 87, 87, 87, 87, 88, 88, 88, 88, 89, 89, 88, 88, 88, 88, 88, 88, 88, 88, 87, 88, 88, 88, 88, 88, 88, 88, 88, 87, 88, 88, 88, 88, 88, 87, 87, 87, 88, 88, 88, 88, 88, 88, 87, 88, 87, 87, 87, 87, 87, 87, 87, 87, 87, 87, 87, 87, 87, 87, 88, 88, 88, 88, 88, 88, 88, 88, 88, 87, 87, 86, 87, 88, 88, 89, 89, 88, 88, 88, 88, 88, 88, 88, 88, 88, 88, 88, 88, 88, 87, 87, 87, 87, 87, 88, 88, 88, 88, 88, 88, 88, 88, 88, 88, 88, 88, 89, 88, 88, 88, 88, 88, 88, 88, 88, 88, 88, 88, 88, 88, 87, 87, 88, 88, 88, 88, 87, 87, 87, 87, 87, 87, 88, 88, 88, 88, 87, 87, 87, 88, 88, 88, 88, 88, 88, 89, 89, 89, 89, 89, 89, 89, 88, 88, 87, 87, 88, 88, 88, 87, 87, 88, 88, 88, 87, 87, 87, 87, 87, 87, 88, 88, 88, 88, 88, 87, 87, 87, 87, 87, 88, 88, 88, 89, 88, 88, 88, 87, 87, 87, 87, 87, 87, 88, 88, 88, 88, 88, 88, 88, 88, 88, 87, 87, 87, 87, 87, 87, 87, 87, 88, 88, 87, 87, 87, 87, 87, 87, 88, 88, 88, 87, 87, 88, 88, 89, 89, 90, 90, 90, 89, 89, 89, 88, 88, 88, 88, 88, 88, 89, 88, 88, 88, 89, 89, 89, 88, 88, 88, 88, 88, 89, 89, 88, 88, 88, 88, 88, 88, 88, 88, 88, 88, 88, 88, 88, 88, 88, 88, 88, 88, 88, 88, 88, 88, 89, 89, 88, 88, 88, 88, 88, 88, 88, 88, 88, 88, 88, 88, 88, 88, 88, 88, 88, 88, 88, 88, 88, 88, 88, 88, 88, 88, 88, 89, 89, 88, 87, 87, 87, 87, 88, 88, 88, 88, 88, 88, 89, 89, 90, 90, 90, 89, 89, 89, 89, 89, 89, 89, 89, 89, 88, 88, 89, 88, 88, 88, 88, 88, 88, 89, 89, 89, 89, 89, 89, 89, 89, 89, 89, 89, 89, 88, 88, 88, 88, 88, 88, 88, 87, 86, 86, 87, 87, 88, 88, 88, 88, 88, 88, 88, 88, 88, 88, 87, 87, 87, 88, 88, 88, 88, 88, 88, 88, 88, 88, 88, 87, 87, 87, 87, 87, 88, 88, 88, 88, 88, 88, 88, 88, 88, 88, 88, 88, 88, 88, 88, 88, 88, 87, 87, 87, 87, 88, 88, 88, 89, 90, 90, 90, 89, 88, 87, 87, 87, 88, 88, 87, 87, 87, 88, 88, 88, 88, 89, 89, 88, 88, 88, 89, 88, 88, 89, 89, 89, 89, 89, 89, 89, 88, 88, 88, 88, 88, 89, 89, 89, 88, 88, 88, 89, 89, 89, 89, 89, 89, 89, 89, 89, 89, 89, 89, 89, 88, 89, 89, 88, 88, 88, 89, 89, 89, 89, 89, 89, 89, 89, 89, 88, 88, 88, 88, 88, 88, 88, 88, 88, 88, 88, 88, 88, 88, 88, 88, 88, 88, 88, 88, 88, 88, 88]
-70H8%j%J%%%j%%%%%%%%%%%%%J%%%%jJ%%%J%j%%%%%j%%jJ%J%j%%Jj%%%%%Jj%J%%%%j%%J%%
-77H8J%%%%j%%%%%%%%%%j%%%%%%%%%%%J%%%j%J%%%%%%%%%%%%%%%%%%%%%%%%%%j%%%%%%J%%
-85H8%%%%%%%%j%%%%%%%%J%j%%%%%%J%%%%j%%%%%%%jJj%%J%%%%%%%%%%%%%%%%%Jj%%%%%%%
-92H7%j%%%J%%%%%j%%%%%J%%%%%%%%%j%JJ%J%jjJ%%%j%%J%%%%%%%%%%%%j%%JJ%%j%%%%%j%
-100H7%%%J%%%%%J%%j%j%J%%%Jjj%%%J%%%%%%%%%j%%J%%%%%%%%%Jj%%%%j%%%j%%J%%%%%Jj
-107H7%%%%%%J%%jJ%%%%j%%%%%%JJ%j%%j%%%%%%%%%%%%%%%%%%%%%%%%%%%%%%%%%%%%%%%%%
-115H7%%%J%%%%%%j%%%%%J%%j%J%%%%%%%j%%%%J%%%%%%%%%%%%j%J%%%%j%%%%%%J%%j%%jJ%
-122H7%J%%%j%%%%%%%J%%%j%J%%J%%j%%%%j%%%%%%%%%%%%%j%%%%%J%%%%JJ%j%%%%j%%%%%%
$$ y = [88, 88, 87, 87, 88, 88, 88, 88, 87, 87, 87, 87, 87, 87, 87, 87, 87, 87, 87, 87, 87, 87, 88, 88, 88, 88, 88, 87, 88, 88, 88, 88, 89, 89, 88, 88, 88, 88, 88, 88, 87, 87, 87, 86, 87, 87, 88, 88, 87, 87, 87, 88, 87, 87, 87, 87, 87, 87, 88, 87, 87, 88, 88, 88, 88, 88, 87, 87, 87, 88, 88, 88, 89, 89, 89, 89, 89, 88, 88, 88, 88, 88, 88, 88, 88, 88, 88, 88, 87, 87, 87, 87, 87, 87, 87, 87, 87, 87, 87, 87, 88, 88, 88, 88, 87, 87, 88, 88, 88, 88, 88, 88, 88, 88, 88, 88, 88, 88, 88, 88, 88, 88, 88, 88, 88, 88, 88, 88, 88, 88, 88, 88, 88, 87, 87, 87, 87, 87, 87, 87, 88, 88, 88, 88, 88, 88, 88, 88, 88, 88, 88, 87, 87, 87, 87, 87, 87, 87, 87, 87, 88, 88, 87, 87, 87, 87, 87, 87, 87, 88, 88, 88, 88, 88, 87, 87, 87, 87, 87, 87, 87, 87, 86, 87, 86, 86, 86, 87, 87, 87, 87, 87, 87, 87, 87, 87, 87, 87, 87, 87, 87, 87, 87, 87, 87, 88, 87, 87, 87, 87, 87, 87, 87, 87, 87, 86, 86, 86, 86, 87, 87, 87, 87, 87, 87, 86, 86, 86, 86, 86, 86, 87, 87, 87, 87, 87, 87, 87, 87, 87, 87, 86, 86, 87, 88, 88, 89, 89, 88, 87, 88, 88, 88, 88, 87, 87, 87, 88, 88, 88, 88, 88, 88, 88, 88, 88, 88, 88, 88, 88, 87, 87, 87, 88, 89, 89, 89, 88, 88, 88, 88, 88, 88, 87, 87, 87, 87, 87, 88, 88, 88, 88, 88, 88, 89, 89, 89, 88, 88, 87, 87, 88, 88, 88, 88, 89, 88, 87, 87, 87, 87, 88, 88, 88, 88, 88, 88, 88, 88, 88, 88, 87, 87, 87, 88, 88, 88, 88, 88, 88, 88, 88, 88, 88, 89, 88, 88, 88, 88, 88, 87, 87, 87, 87, 86, 86, 86, 87, 87, 87, 87, 87, 87, 88, 87, 87, 87, 87, 87, 87, 87, 88, 88, 88, 87, 88, 88, 88, 88, 88, 87, 87, 87, 87, 87, 87, 87, 88, 89, 89, 88, 88, 88, 87, 87, 87, 87, 87, 87, 87, 87, 87, 87, 87, 87, 87, 87, 87, 87, 87, 87, 87, 87, 87, 87, 87, 87, 87, 87, 87, 87, 87, 87, 87, 87, 87, 87, 87, 87, 87, 87, 87, 87, 87, 87, 87, 87, 87, 88, 88, 88, 88, 88, 88, 88, 87, 87, 87, 87, 87, 87, 88, 88, 88, 87, 87, 88, 88, 88, 88, 88, 88, 88, 88, 87, 87, 87, 87, 87, 88, 88, 88, 88, 88, 88, 88, 88, 88, 88, 88, 88, 88, 87, 87, 88, 88, 88, 88, 88, 87, 87, 87, 87, 87, 87, 87, 88, 88, 88, 87, 87, 87, 86, 87, 87, 87, 88, 88, 88, 88, 87, 87, 87, 87, 87, 87, 87, 87, 88, 88, 88, 88, 87, 87, 88, 88, 88, 89, 89, 89, 88, 88, 88, 88, 88, 87, 87, 87, 87, 87, 87, 87, 87, 87, 87, 87, 87, 87, 87, 86, 86, 86, 86, 86, 86, 87, 87, 87, 87, 87, 88, 89, 89, 88, 88, 88, 88, 88, 87, 87, 87, 87, 87, 87, 87]
-129H7J%%%%%%%%%%%jJ%%%%J%%%j%%%J%%%%j%%%%%%%%%%%%%%j%%J%%%%%%jJ%%%%%%%%j%%%
-137H7J%%%Jj%%%J%j%j%%%%%%J%%%%%%%J%%%%%j%%%%%%%%%%j%J%%%%%%%j%%%%%%J%%%j%%%
-144H7%%%jJ%%%%%%%%%%jJ%%%%%%%%%%%%%jJ%%%%%%%%%%%%%%%%%%%%%%J%%%%%%%%%j%%%%%
-152H7%%%%%%%%%%J%%j%%%j%J%%%J%%j%%%%%j%J%J%j%%%%%%%%%%%%%Jj%%%%%J%%%%%%%%j%
-159H7%J%j%j%%%%%J%%%%%%%%%%Jj%%%%%%%%%%%%%j%%%%%J%%%J%%%j%%%%%%%%%%%%%%%%%%
-166H7j%%%%%J%%%%j%%%%%%J%%%jJ%%%%%%%%%%%%%J%%%%%%%%%%%J%j%%%%%%%%%%j%%%%J%%
-174H8j%%%J%j%%%%J%%%%%%%%%%%%j%%%%%%J%j%%%%%%%jJ%j%J%%j%%%%%%%Jj%%J%%%%%j%%
-181H6J%%%%%%%%%%%%%%%%%%J%%j%%%%%j%%%%J%%%%%%%jJ%%%%%JjJ%%%%%%%j%%%%%%%J%%%
$$ y = [87, 88, 88, 88, 88, 88, 88, 88, 88, 88, 88, 88, 88, 87, 88, 88, 88, 88, 88, 89, 89, 89, 89, 88, 88, 88, 88, 89, 89, 89, 89, 89, 88, 88, 88, 88, 88, 88, 88, 88, 88, 88, 88, 88, 88, 88, 88, 87, 87, 87, 88, 88, 88, 88, 88, 88, 88, 87, 88, 88, 88, 88, 88, 88, 88, 88, 88, 87, 87, 87, 87, 88, 88, 88, 88, 89, 88, 88, 88, 88, 89, 89, 88, 88, 87, 87, 87, 87, 87, 87, 87, 88, 88, 88, 88, 88, 88, 88, 88, 89, 89, 89, 89, 89, 89, 88, 88, 88, 88, 88, 88, 88, 88, 88, 88, 88, 87, 87, 88, 88, 88, 88, 88, 88, 88, 88, 87, 87, 87, 87, 87, 87, 87, 88, 88, 88, 88, 87, 87, 87, 87, 87, 87, 87, 86, 87, 87, 87, 87, 87, 87, 87, 87, 87, 87, 87, 86, 87, 87, 87, 87, 87, 87, 87, 87, 87, 87, 87, 87, 87, 87, 86, 87, 87, 87, 87, 87, 87, 87, 87, 87, 87, 87, 87, 87, 87, 87, 87, 87, 87, 87, 87, 87, 87, 87, 88, 88, 88, 88, 88, 88, 88, 88, 88, 88, 87, 87, 87, 87, 87, 87, 87, 87, 87, 87, 87, 87, 87, 87, 87, 87, 88, 88, 88, 87, 87, 87, 87, 86, 86, 87, 87, 87, 87, 88, 88, 88, 87, 87, 87, 87, 87, 87, 86, 86, 87, 87, 88, 88, 87, 87, 87, 87, 87, 87, 87, 87, 87, 87, 87, 87, 87, 87, 88, 87, 87, 87, 87, 87, 87, 88, 88, 88, 88, 88, 88, 88, 88, 88, 87, 87, 87, 88, 88, 87, 87, 86, 86, 86, 86, 86, 86, 87, 87, 87, 87, 87, 87, 87, 87, 87, 87, 87, 88, 87, 87, 87, 87, 87, 87, 87, 87, 87, 87, 87, 87, 87, 87, 86, 86, 86, 86, 86, 86, 87, 87, 87, 87, 88, 88, 88, 88, 87, 87, 87, 87, 87, 87, 87, 87, 87, 87, 87, 87, 87, 87, 87, 87, 87, 87, 87, 86, 86, 86, 86, 86, 86, 87, 87, 87, 87, 87, 86, 86, 86, 86, 86, 86, 86, 87, 87, 87, 87, 86, 87, 87, 87, 87, 87, 87, 87, 87, 87, 87, 87, 87, 87, 87, 88, 88, 88, 88, 88, 88, 88, 88, 88, 88, 88, 88, 89, 89, 88, 88, 88, 88, 88, 88, 88, 88, 88, 88, 88, 87, 87, 87, 87, 87, 88, 88, 88, 87, 87, 87, 87, 88, 88, 87, 87, 87, 87, 87, 88, 88, 88, 88, 88, 88, 88, 88, 88, 88, 88, 88, 88, 87, 87, 87, 87, 87, 87, 87, 88, 88, 87, 87, 87, 87, 87, 87, 87, 87, 86, 87, 87, 86, 86, 87, 87, 87, 86, 86, 86, 86, 86, 86, 86, 86, 87, 86, 86, 86, 87, 87, 87, 87, 87, 87, 86, 86, 86, 87, 87, 87, 87, 87, 87, 87, 87, 87, 87, 87, 87, 87, 87, 87, 87, 87, 87, 87, 88, 88, 88, 87, 87, 87, 87, 87, 87, 86, 86, 86, 86, 86, 87, 87, 87, 87, 87, 87, 87, 87, 86, 87, 87, 87, 87, 87, 87, 88, 87, 88, 88, 88, 88, 88, 88, 88, 88, 87, 87, 87, 87, 87, 87, 87, 87, 88, 88, 88, 88]
-189H8%j%%%%%%%JJj%%%j%%%J%%%%%%j%j%J%%%%%%%%%%Jj%%J%%j%%%%%%%%%J%%%%j%%%%J%
-196H8j%%%%%Jj%%%%%%%%%%j%%%%%J%%%%%%%%%%%%%%%%j%%%%%%%%%%J%%%%%%%%%%%%%j%jJ
-204H6%%%%J%%%%J%%Jj%%jJ%%%%%j%%%J%%%%%%%%%%%%%%%%j%%%J%%%j%%%%%%j%%%%%%%%%%
-211H6%%%%%%J%%%%%%Jj%%J%%%j%%%%jJ%%%%%%J%%j%%%j%%%%%%%j%%J%%%%%J%j%%%j%%%J%
-218H6%%J%%%%%%%%%%%%%%%%%%%%%%%%j%%%J%%%%%%%%j%%%%%%%%%%%%%%%J%%%%%Jj%%%%%%
-226H7%%%%J%%%%%%%%j%%%%%%%%%%%%J%%%%%%%%%%%%j%%%%%%%%%%%%%%%%j%%%%%%%%%%%%J
-233H7jJ%%%%%%%%%jJ%%%%%%%%j%%%JJ%%%%%j%j%J%%%%%%j%%%%%J%%%%%%%%%j%J%%J%j%%%
-241H7%%%%%%%%%%%%%j%%%J%%%%%%%%%%%%%%J%%%%j%%JjjJ%%%%%%%%%%jJ%%%%j%%%J%%%%j
$$ y = [88, 88, 87, 87, 87, 87, 87, 87, 87, 87, 88, 89, 88, 88, 88, 88, 87, 87, 87, 87, 88, 88, 88, 88, 88, 88, 88, 87, 87, 86, 86, 87, 87, 87, 87, 87, 87, 87, 87, 87, 87, 87, 88, 87, 87, 87, 88, 88, 88, 87, 87, 87, 87, 87, 87, 87, 87, 87, 87, 88, 88, 88, 88, 88, 87, 87, 87, 87, 87, 88, 88, 87, 87, 87, 87, 87, 87, 88, 87, 87, 87, 87, 87, 87, 87, 87, 87, 87, 87, 86, 86, 86, 86, 86, 86, 87, 87, 87, 87, 87, 87, 87, 87, 87, 87, 87, 87, 87, 87, 87, 87, 87, 86, 86, 86, 86, 86, 86, 86, 86, 86, 86, 86, 87, 87, 87, 87, 87, 87, 87, 87, 87, 87, 87, 87, 87, 87, 86, 86, 85, 86, 86, 86, 86, 86, 87, 87, 87, 87, 87, 88, 88, 88, 89, 88, 88, 88, 87, 88, 88, 88, 88, 88, 88, 87, 87, 87, 87, 88, 88, 88, 88, 88, 88, 88, 88, 88, 88, 88, 88, 88, 88, 88, 88, 88, 87, 87, 87, 87, 88, 88, 88, 88, 87, 87, 87, 87, 87, 87, 87, 86, 86, 86, 86, 86, 86, 86, 86, 86, 86, 86, 86, 86, 86, 86, 86, 86, 87, 87, 87, 87, 87, 87, 87, 88, 87, 87, 87, 88, 88, 88, 88, 87, 87, 87, 87, 87, 86, 87, 87, 87, 87, 87, 87, 87, 88, 88, 88, 87, 87, 87, 87, 86, 86, 86, 86, 86, 86, 86, 86, 85, 85, 85, 86, 86, 86, 86, 86, 86, 87, 87, 86, 86, 86, 86, 85, 85, 85, 85, 86, 86, 86, 86, 87, 87, 87, 87, 87, 87, 87, 87, 87, 87, 87, 87, 87, 87, 87, 87, 87, 87, 87, 87, 87, 87, 87, 87, 87, 86, 86, 86, 86, 87, 87, 87, 87, 87, 87, 87, 87, 87, 86, 86, 86, 86, 86, 86, 86, 86, 86, 86, 86, 86, 86, 86, 86, 86, 87, 87, 87, 87, 87, 87, 88, 87, 87, 87, 87, 87, 87, 87, 87, 87, 87, 87, 88, 88, 88, 88, 88, 88, 88, 88, 88, 87, 87, 87, 87, 87, 87, 87, 87, 87, 87, 87, 87, 87, 88, 88, 88, 88, 88, 88, 88, 88, 88, 88, 88, 88, 88, 87, 87, 87, 87, 87, 87, 87, 87, 87, 87, 87, 87, 87, 87, 87, 87, 87, 86, 86, 86, 86, 86, 86, 86, 86, 86, 86, 86, 86, 86, 87, 86, 87, 87, 87, 87, 87, 87, 87, 87, 87, 87, 86, 87, 87, 87, 87, 87, 87, 87, 87, 87, 86, 86, 86, 86, 87, 88, 88, 88, 88, 88, 88, 87, 87, 86, 86, 87, 87, 87, 87, 87, 87, 87, 86, 86, 86, 86, 86, 86, 87, 87, 87, 87, 87, 87, 87, 87, 87, 87, 86, 86, 87, 87, 87, 88, 88, 87, 87, 87, 87, 87, 87, 87, 87, 87, 87, 87, 87, 87, 87, 87, 87, 87, 86, 86, 86, 86, 87, 87, 87, 87, 87, 87, 87, 87, 87, 87, 87, 87, 87, 87, 87, 88, 88, 88, 88, 88, 87, 87, 87, 88, 87, 86, 87, 87, 87, 87, 87, 87, 87, 87, 87, 87, 87, 86, 87, 87, 87, 87, 87, 86, 86, 86, 86, 87, 87, 87, 87, 87, 86]
-248H6%J%%%%%%%%%%J%j%%%J%%%%%%jjJ%%J%%j%%%%%%%%%J%%%j%J%%%%j%%%%%%j%%%%j%%%
-255H5J%J%J%j%%%%J%%jJ%%Jjj%Jj%%%%jJ%%%%%%%%jJ%%%%J%%%%j%%%%jJ%%%%%%%%J%jj%%
-263H6J%%%J%%jjJ%%%%%%%%j%J%%%%j%%%%%%%%%J%%J%j%j%%%J%%%%%%%%%J%%%j%J%%%%j%%
-270H7%%%%%%J%%%%j%%%%j%JJ%j%%%%%%j%%%%%%%%%%%%%%%%%J%%%%%%%%%%j%%%%jJ%%%%%%
-278H6%%jJ%%Jj%%%%j%%%%%J%%j%J%%%%%%j%%%J%Jj%%%%J%%%%J%%j%%%%%j%%%%%J%%j%j%%
-285H5Jj%%J%%J%%%%%%%%%%J%%%%j%%%%%%%%%%%%%jj%%%J%Jj%%%%%%jJ%%%j%J%%%J%j%%%%
-293H6%%%%%%%%%%%%%%%%%%%%%%%%%%%%%%%%%%%%J%%%%j%%%%%%%%%%%%%%%%%J%j%%jJ%%jJ
-300H6%%%%%%%%%%J%%%%j%%%%%j%%%%J%%%%Jj%%%%Jj%%%%%%j%J%%JjJ%%%%%j%%%%%%%%%%%
$$ y = [86, 86, 87, 87, 87, 87, 87, 87, 87, 87, 87, 87, 87, 88, 88, 87, 87, 87, 87, 88, 88, 88, 88, 88, 88, 88, 87, 86, 87, 87, 87, 88, 88, 88, 87, 87, 87, 87, 87, 87, 87, 87, 87, 87, 88, 88, 88, 88, 87, 87, 88, 88, 88, 88, 88, 87, 87, 87, 87, 87, 87, 87, 86, 86, 86, 86, 86, 85, 85, 85, 85, 86, 86, 87, 87, 88, 88, 87, 87, 87, 87, 87, 88, 88, 88, 87, 88, 88, 88, 89, 88, 87, 87, 88, 87, 87, 87, 87, 87, 86, 87, 87, 87, 87, 87, 87, 87, 87, 87, 86, 87, 87, 87, 87, 87, 88, 88, 88, 88, 88, 87, 87, 87, 87, 87, 86, 87, 87, 87, 87, 87, 87, 87, 87, 87, 88, 88, 87, 86, 86, 86, 87, 87, 87, 87, 88, 88, 88, 87, 86, 87, 87, 87, 87, 87, 87, 87, 87, 87, 86, 86, 87, 87, 87, 87, 87, 86, 86, 86, 86, 86, 86, 86, 86, 86, 86, 87, 87, 87, 88, 88, 87, 87, 86, 86, 86, 86, 87, 87, 87, 87, 87, 87, 87, 87, 87, 87, 88, 88, 88, 88, 87, 87, 88, 88, 88, 88, 88, 87, 87, 87, 87, 87, 87, 87, 87, 87, 88, 88, 88, 88, 88, 87, 87, 87, 87, 87, 86, 86, 87, 88, 88, 87, 87, 87, 87, 87, 87, 87, 86, 86, 86, 86, 86, 86, 86, 86, 86, 86, 86, 86, 86, 86, 86, 86, 86, 86, 87, 87, 87, 87, 87, 87, 87, 87, 87, 87, 87, 86, 86, 86, 86, 86, 85, 86, 86, 86, 86, 86, 86, 86, 86, 86, 85, 86, 86, 86, 87, 86, 86, 86, 86, 86, 85, 85, 85, 85, 85, 85, 86, 86, 86, 85, 85, 86, 86, 86, 86, 86, 86, 86, 85, 85, 85, 85, 86, 86, 87, 86, 86, 86, 86, 86, 87, 87, 87, 87, 87, 88, 88, 88, 87, 87, 87, 87, 87, 87, 86, 86, 86, 86, 86, 86, 87, 87, 87, 86, 86, 85, 85, 85, 86, 85, 85, 85, 86, 86, 86, 87, 87, 87, 87, 87, 87, 87, 87, 87, 87, 87, 88, 88, 88, 88, 88, 87, 87, 87, 87, 87, 87, 87, 87, 87, 87, 87, 87, 87, 87, 86, 85, 85, 85, 85, 86, 86, 87, 86, 86, 86, 86, 86, 86, 86, 85, 86, 86, 86, 86, 85, 85, 86, 86, 86, 86, 87, 87, 86, 86, 86, 86, 86, 86, 86, 86, 86, 86, 86, 86, 86, 86, 86, 86, 86, 86, 86, 86, 86, 86, 86, 86, 86, 86, 86, 86, 86, 86, 86, 86, 86, 86, 86, 86, 86, 86, 86, 86, 86, 87, 87, 87, 87, 87, 86, 86, 86, 86, 86, 86, 86, 86, 86, 86, 86, 86, 86, 86, 86, 86, 86, 86, 87, 87, 86, 86, 86, 85, 86, 86, 86, 85, 86, 86, 86, 86, 86, 86, 86, 86, 86, 86, 86, 87, 87, 87, 87, 87, 86, 86, 86, 86, 86, 86, 85, 85, 85, 85, 85, 86, 86, 86, 86, 86, 87, 86, 86, 86, 86, 86, 87, 86, 86, 86, 86, 86, 86, 86, 85, 85, 86, 86, 86, 87, 86, 87, 87, 87, 87, 87, 87, 86, 86, 86, 86, 86, 86, 86, 86, 86, 86, 86, 86]
-307H6%%%%%%J%%j%%Jj%%%J%%%j%%%j%J%%%%%%%%Jj%j%%%%J%J%jJ%%%%j%%%%%J%%k%%%%%%
-315H5%JjJj%%%J%%J%j%%%%%%%%%%%J%%%%jJ%j%J%%j%%%Jj%%%%%%%%%%%%%%%%%J%%%%%%Jj
-322H7%%%%%%%j%Jj%J%j%%%%%J%jJj%%%%%%%J%%J%%%j%j%%jJ%%%%J%%j%J%j%%%J%Jj%%%%%
-330H7%j%%%%%%%%%%J%%%%%%j%j%%%%%J%%J%j%%%%%%%J%%%j%%%%%%%%%%%%%%J%%jJ%%%%%%
-337H7%%%%%%%%J%j%%%%%%%%%%%%%%%%%%%j%%%%J%%%%%%jjJ%J%%%%%j%%%%%%%%%%%%%%%J%
-344H7%%J%%%%%%%%%j%%%%%%%%%%%%J%%j%%%%%%%j%%J%%%%%%%%%%%%%%%%%%J%j%%%%%%%%%
-352H7%%%%%%%%%%jJ%%%%j%%J%%%%%%%%%%%%j%%%j%%j%%J%%%J%%%%%%%%%%%%%%%%j%%%%%%
-359H5%%%%%%%%j%%J%%J%%j%J%%%%%j%%%%%j%%J%%%%%%%%%%%%%%%%%%J%%%J%%%j%%%%j%%%
$$ y = [86, 86, 86, 86, 86, 86, 86, 87, 87, 87, 86, 86, 86, 87, 86, 86, 86, 86, 87, 87, 87, 87, 86, 86, 86, 86, 85, 85, 86, 86, 86, 86, 86, 86, 86, 86, 86, 87, 86, 86, 85, 85, 85, 85, 85, 86, 86, 87, 87, 86, 87, 87, 87, 87, 87, 86, 86, 86, 86, 86, 86, 87, 87, 87, 85, 85, 85, 85, 85, 85, 85, 85, 86, 85, 86, 85, 85, 85, 85, 86, 86, 86, 87, 87, 86, 86, 86, 86, 86, 86, 86, 86, 86, 86, 86, 86, 87, 87, 87, 87, 87, 86, 87, 87, 86, 86, 87, 87, 87, 86, 86, 86, 86, 87, 86, 86, 86, 86, 86, 86, 86, 86, 86, 86, 86, 86, 86, 86, 86, 86, 86, 86, 87, 87, 87, 87, 87, 87, 87, 88, 87, 87, 87, 87, 87, 87, 87, 87, 86, 86, 87, 86, 86, 87, 87, 86, 86, 86, 86, 86, 86, 87, 87, 86, 87, 86, 86, 86, 86, 86, 86, 86, 86, 87, 87, 87, 88, 88, 88, 88, 87, 87, 86, 86, 86, 85, 86, 86, 86, 86, 86, 87, 87, 87, 86, 86, 87, 87, 86, 86, 86, 86, 87, 87, 88, 87, 87, 87, 87, 87, 87, 87, 86, 86, 86, 86, 86, 86, 86, 86, 86, 86, 86, 87, 87, 87, 87, 87, 87, 87, 86, 86, 85, 85, 85, 85, 85, 85, 86, 86, 86, 87, 87, 86, 86, 86, 86, 86, 86, 86, 86, 87, 87, 87, 87, 86, 86, 86, 86, 86, 86, 86, 86, 86, 86, 86, 86, 86, 86, 86, 87, 87, 87, 86, 87, 87, 87, 87, 87, 87, 87, 87, 87, 87, 87, 87, 87, 87, 87, 88, 88, 87, 87, 87, 87, 87, 87, 87, 87, 87, 87, 87, 87, 87, 87, 87, 87, 87, 87, 87, 87, 86, 86, 86, 86, 86, 87, 87, 87, 87, 87, 87, 87, 86, 85, 86, 86, 87, 87, 87, 87, 87, 87, 86, 86, 86, 86, 86, 86, 86, 86, 86, 86, 86, 86, 86, 86, 86, 86, 87, 87, 87, 87, 88, 88, 88, 88, 88, 88, 88, 88, 88, 88, 87, 87, 87, 87, 87, 87, 87, 87, 87, 87, 87, 87, 87, 88, 88, 88, 87, 87, 87, 87, 87, 87, 87, 87, 86, 86, 86, 87, 87, 87, 87, 87, 87, 87, 87, 87, 87, 87, 87, 87, 87, 87, 87, 87, 87, 87, 88, 88, 87, 87, 87, 87, 87, 87, 87, 87, 87, 87, 87, 87, 87, 87, 87, 87, 87, 87, 87, 87, 86, 87, 87, 87, 87, 87, 86, 86, 86, 87, 87, 87, 87, 87, 87, 87, 87, 87, 87, 87, 87, 87, 86, 86, 86, 86, 85, 85, 85, 84, 84, 84, 85, 85, 85, 85, 86, 86, 86, 86, 86, 86, 86, 86, 86, 86, 86, 86, 86, 86, 86, 86, 86, 85, 85, 85, 85, 85, 85, 85, 85, 85, 85, 85, 85, 85, 85, 85, 84, 84, 84, 85, 85, 85, 86, 86, 86, 85, 85, 86, 86, 86, 86, 86, 86, 85, 85, 85, 85, 85, 85, 84, 84, 84, 85, 85, 85, 85, 85, 85, 85, 85, 85, 85, 85, 85, 85, 85, 85, 85, 85, 85, 85, 86, 86, 86, 86, 87, 87, 87, 87, 86, 86, 86, 86, 86, 85, 85, 85, 85]
-367H5%%%%%%%%%%%%%J%%%%%%%%%%%j%%%%%J%%%%%%%%%%%J%%%J%%j%%j%j%%%J%%%%j%%%%%
-374H5J%%%J%%J%%jj%%%%%j%%%%J%%%%%%%%%J%%%%%%%%%%%j%%J%%%%%%%%j%%%%%J%Jj%%%%
-382H7j%%J%%%%%%%%%j%%%%%%%J%%%%%%%jj%%J%%%%%%J%%%%%%j%%j%J%%%%%%%%%J%%%J%%j
-389H7%jjJ%%%%Jj%%%jJ%J%%%%%%j%%%%%%%%%%%%%%%%%%%%%J%%j%%%%%%jJ%j%J%%%%%%%%%
-396H6%%%j%%J%%%%J%%j%%%%%%%j%%JjJ%%%%%%%%%%J%%j%%%j%%J%jJ%%%jJ%%%%%%%j%J%%%
-404H6j%%%%%%%J%%%%j%J%%%%%%%%%J%%%%jJ%%%%j%Jj%%%%%%%%%%%%%j%Jj%j%%%JJ%j%%Jj
-411H5%%%%J%J%j%j%%%J%%%%%j%%j%%J%%%%%J%%j%J%%%J%%%j%j%%%%J%jJjJ%%%%%%%%%%%%
-419H6j%%%J%%%%j%%%%%%%J%%%%%%%%%J%%%j%%jJ%%%j%%%%%%%%%Jj%%%%%%%%%%%%%%%%j%J
$$ y = [85, 85, 85, 85, 85, 85, 85, 85, 85, 85, 85, 85, 85, 85, 86, 86, 86, 86, 86, 86, 86, 86, 86, 86, 86, 86, 85, 85, 85, 85, 85, 85, 86, 86, 86, 86, 86, 86, 86, 86, 86, 86, 86, 86, 87, 87, 87, 87, 88, 88, 88, 87, 87, 87, 86, 86, 85, 85, 85, 85, 86, 86, 86, 86, 86, 85, 85, 85, 85, 85, 85, 86, 86, 86, 86, 87, 87, 87, 88, 88, 88, 87, 86, 86, 86, 86, 86, 86, 85, 85, 85, 85, 85, 86, 86, 86, 86, 86, 86, 86, 86, 86, 86, 87, 87, 87, 87, 87, 87, 87, 87, 87, 87, 87, 87, 86, 86, 86, 87, 87, 87, 87, 87, 87, 87, 87, 87, 86, 86, 86, 86, 86, 86, 87, 87, 88, 87, 87, 87, 87, 87, 86, 86, 86, 87, 87, 87, 87, 87, 87, 87, 87, 87, 87, 86, 86, 86, 86, 86, 86, 86, 86, 87, 87, 87, 87, 87, 87, 87, 87, 86, 85, 85, 85, 86, 86, 86, 86, 86, 86, 86, 87, 87, 87, 87, 87, 87, 87, 86, 86, 86, 85, 85, 86, 86, 86, 86, 86, 86, 86, 86, 86, 86, 87, 87, 87, 87, 88, 88, 88, 87, 87, 86, 85, 86, 86, 86, 86, 86, 87, 86, 86, 86, 86, 85, 86, 86, 87, 87, 87, 87, 87, 87, 87, 86, 86, 86, 86, 86, 86, 86, 86, 86, 86, 86, 86, 86, 86, 86, 86, 86, 86, 86, 86, 86, 86, 87, 87, 87, 86, 86, 86, 86, 86, 86, 86, 85, 86, 86, 85, 85, 86, 86, 86, 86, 86, 86, 86, 86, 86, 86, 86, 86, 86, 85, 85, 85, 86, 86, 86, 86, 86, 87, 87, 87, 86, 86, 86, 86, 86, 86, 86, 86, 85, 85, 85, 86, 85, 86, 86, 86, 86, 86, 86, 86, 86, 86, 86, 86, 87, 87, 87, 86, 86, 86, 86, 85, 85, 85, 86, 86, 85, 86, 86, 86, 86, 85, 86, 86, 86, 86, 86, 86, 86, 86, 85, 85, 86, 86, 86, 86, 85, 85, 85, 85, 85, 85, 85, 85, 86, 86, 86, 86, 86, 85, 85, 86, 86, 86, 86, 86, 86, 86, 86, 86, 86, 87, 87, 87, 87, 87, 86, 87, 87, 87, 87, 87, 86, 86, 87, 86, 86, 86, 86, 86, 86, 86, 86, 86, 86, 86, 86, 86, 86, 85, 85, 86, 85, 85, 84, 84, 84, 84, 85, 86, 86, 85, 85, 85, 86, 85, 85, 85, 85, 85, 86, 86, 87, 87, 86, 86, 85, 85, 85, 85, 86, 86, 86, 86, 86, 86, 85, 85, 85, 84, 84, 84, 85, 85, 85, 85, 85, 85, 86, 86, 86, 85, 85, 86, 86, 86, 86, 87, 87, 87, 87, 86, 86, 85, 85, 85, 85, 85, 86, 86, 85, 86, 85, 86, 86, 86, 86, 86, 86, 86, 86, 86, 86, 86, 86, 86, 85, 85, 85, 85, 86, 86, 86, 86, 86, 85, 85, 85, 85, 85, 85, 85, 85, 86, 86, 86, 86, 86, 86, 86, 86, 86, 86, 87, 87, 87, 87, 86, 86, 86, 85, 86, 86, 86, 86, 85, 85, 85, 85, 85, 85, 85, 85, 85, 85, 86, 85, 85, 85, 85, 85, 85, 85, 85, 85, 85, 85, 85, 85, 85, 85, 85, 85, 84, 84, 85]
-426H5%%%%%%%%%%%%%%%%%%%J%j%%%%%j%%%J%%%%%%%%%%%Jj%%%%%%%%J%%%j%%j%JjJ%%%J%
-433H6%%%Jj%%%j%%%%%Jj%%%%%%%%%J%%j%%Jj%%J%%Jj%%%%%%J%%%j%%%%%%%%%%%%%%%%%%%
-441H6%%%%%%%%%%%%J%j%%%j%%%%J%%%%%%%%%%%%j%J%%%%%%%j%%J%%J%%j%%%%%%%%%%%%%%
-448H6j%%%J%%j%%%J%%%%%%%J%%%%%%%%%j%jJ%%%jJ%%Jj%j%J%J%%%%j%%%%J%%%%%%%%j%%j
-456H5%%%J%%%j%%%%%%%%%%%%J%%%%j%%J%%%j%%%%%J%%%%%%%%%%%j%J%%j%J%j%%%%J%%%%%
-463H6%%%%j%%%%J%%%j%%%%%%%%%J%%%%%%J%%%%%j%%%%%%%%%j%%%%%J%%%%%j%%%J%%%%%%%
-471H6jJ%%%%%%%%%%%j%%%J%%%%%%%%%%%%%%j%%%%%%J%%%%%j%j%J%%%%%%j%J%%%%%%%%%%%
-478H5%%jJ%%%%%%%%%%j%%J%%%%%J%%J%%j%%j%%%%j%J%%J%j%%%%%%%%%%%%%Jj%%%%%%%%%%
$$ y = [85, 85, 85, 85, 85, 85, 85, 85, 85, 85, 85, 85, 85, 85, 85, 85, 85, 85, 85, 85, 86, 86, 85, 85, 85, 85, 85, 85, 84, 84, 84, 84, 85, 85, 85, 85, 85, 85, 85, 85, 85, 85, 85, 85, 86, 85, 85, 85, 85, 85, 85, 85, 85, 85, 86, 86, 86, 86, 85, 85, 85, 84, 84, 85, 84, 85, 85, 85, 85, 86, 86, 86, 86, 86, 87, 86, 86, 86, 86, 85, 85, 85, 85, 85, 85, 86, 85, 85, 85, 85, 85, 85, 85, 85, 85, 85, 86, 86, 86, 85, 85, 85, 86, 85, 85, 85, 86, 86, 86, 87, 86, 86, 86, 86, 86, 86, 86, 87, 87, 87, 87, 86, 86, 86, 86, 86, 86, 86, 86, 86, 86, 86, 86, 86, 86, 86, 86, 86, 86, 86, 86, 86, 86, 86, 86, 86, 86, 86, 86, 86, 86, 86, 86, 87, 87, 86, 86, 86, 86, 85, 85, 85, 85, 85, 86, 86, 86, 86, 86, 86, 86, 86, 86, 86, 86, 86, 86, 85, 85, 86, 86, 86, 86, 86, 86, 86, 86, 85, 85, 85, 86, 86, 86, 87, 87, 87, 86, 86, 86, 86, 86, 86, 86, 86, 86, 86, 86, 86, 86, 86, 86, 85, 85, 85, 85, 86, 86, 86, 85, 85, 85, 85, 86, 86, 86, 86, 86, 86, 86, 86, 87, 87, 87, 87, 87, 87, 87, 87, 87, 87, 86, 86, 85, 86, 86, 86, 86, 85, 86, 86, 86, 87, 86, 86, 85, 85, 86, 86, 87, 87, 87, 87, 87, 86, 86, 86, 86, 86, 87, 87, 87, 87, 87, 87, 87, 87, 87, 86, 86, 86, 85, 85, 85, 85, 86, 86, 86, 86, 85, 85, 85, 85, 85, 85, 85, 85, 85, 85, 85, 85, 85, 86, 86, 86, 86, 86, 85, 85, 85, 86, 86, 86, 86, 85, 85, 85, 85, 85, 85, 86, 86, 86, 86, 86, 86, 86, 86, 86, 86, 86, 86, 85, 85, 86, 86, 86, 85, 85, 86, 86, 85, 85, 85, 85, 85, 86, 86, 86, 86, 86, 86, 86, 86, 86, 86, 85, 85, 85, 85, 85, 86, 86, 86, 86, 85, 85, 85, 85, 85, 85, 85, 85, 85, 85, 86, 86, 86, 86, 86, 86, 86, 87, 87, 87, 87, 87, 87, 86, 86, 86, 86, 86, 86, 86, 86, 86, 86, 85, 85, 85, 85, 85, 85, 86, 86, 86, 86, 86, 86, 85, 85, 85, 85, 86, 86, 86, 86, 86, 86, 86, 86, 85, 86, 86, 86, 86, 86, 86, 86, 86, 86, 86, 86, 86, 85, 85, 85, 85, 86, 86, 86, 86, 86, 86, 86, 86, 86, 86, 86, 86, 86, 86, 86, 85, 85, 85, 85, 85, 85, 85, 86, 86, 86, 86, 86, 86, 85, 85, 84, 84, 85, 85, 85, 85, 85, 85, 85, 84, 84, 85, 85, 85, 85, 85, 85, 85, 85, 85, 85, 85, 85, 85, 85, 84, 85, 85, 85, 85, 85, 85, 85, 85, 85, 85, 85, 84, 84, 84, 85, 85, 85, 85, 85, 85, 86, 86, 86, 87, 87, 87, 86, 86, 86, 85, 85, 85, 85, 85, 84, 84, 85, 85, 85, 86, 86, 85, 85, 85, 85, 85, 85, 85, 85, 85, 85, 85, 85, 85, 85, 86, 85, 85, 85, 85, 85, 85, 85, 85, 85, 85, 85]
-485H5%%%%%%%%J%j%%%%%%%%%%jJJ%%%%%%%%j%j%%JJ%%%j%%j%JJ%j%%%%%%%jJ%J%%%jj%J%
-493H5%%%%%%J%%%jJ%%%j%j%%%%%J%%%%%%%%%J%%%%%%%j%%%j%%J%%%%j%%J%%J%%%%j%%%%%
-500H5%%%%%%%%%%%%%%%%%%%%%%%%%%%%%%j%%%J%%%%%jJ%%%%%%%%%%%%%j%%J%%%%%%%%%jJ
-508H5%%%%j%%%Jj%%%%%%%%%%%%Jj%J%%%%j%%%%%%%J%Jj%%jJ%%%%%%%%%J%%j%jJ%%%%%%%J
-515H6j%%%J%j%%%%%%%%J%j%%%%%%%%J%%%%%%%j%j%%J%%%%%%%%J%j%%%J%%%%%%%%%%%%%j%
-523H5%%%%%%%%J%j%%%%%%%%%%%%%%%%%%%%%%%%%%%%%%J%%%%%%j%j%J%%%%J%j%%%%%%%%%%
-530H5%%%%J%%%%%j%%%j%%%%%%%%%%%%J%%%%%%%%j%J%Jj%%j%%%J%%%Jj%%%j%%%%%J%%j%%%
-537H4J%%%%%j%%%%%%%%%%%%JjJ%%jJj%%%%JJj%%%%%%%%Jj%%%%%%%%%%%%%%%%%%%%%%j%%%
$$ y = [85, 85, 85, 85, 85, 85, 85, 85, 85, 86, 86, 85, 85, 85, 85, 85, 85, 85, 85, 85, 85, 85, 84, 85, 86, 86, 86, 86, 86, 86, 86, 86, 86, 85, 85, 84, 84, 84, 85, 86, 86, 86, 86, 85, 85, 85, 84, 84, 85, 86, 86, 85, 85, 85, 85, 85, 85, 85, 85, 84, 85, 85, 86, 86, 86, 86, 85, 84, 84, 85, 85, 85, 85, 85, 85, 85, 85, 86, 86, 86, 86, 85, 86, 86, 86, 86, 85, 85, 84, 84, 84, 84, 84, 84, 85, 85, 85, 85, 85, 85, 85, 85, 85, 85, 86, 86, 86, 86, 86, 86, 86, 86, 85, 85, 85, 85, 84, 84, 84, 85, 85, 85, 85, 85, 84, 84, 84, 85, 85, 85, 86, 86, 86, 86, 86, 85, 85, 85, 85, 85, 85, 85, 85, 85, 85, 85, 85, 85, 85, 85, 85, 85, 85, 85, 85, 85, 85, 85, 85, 85, 85, 85, 85, 85, 85, 85, 85, 85, 85, 85, 85, 84, 84, 84, 84, 85, 85, 85, 85, 85, 85, 84, 85, 85, 85, 85, 85, 85, 85, 85, 85, 85, 85, 85, 85, 85, 84, 84, 84, 85, 85, 85, 85, 85, 85, 85, 85, 85, 85, 84, 85, 85, 85, 85, 85, 84, 84, 84, 84, 85, 84, 84, 84, 84, 84, 84, 84, 84, 84, 84, 84, 84, 84, 85, 84, 84, 85, 85, 85, 85, 85, 84, 84, 84, 84, 84, 84, 84, 84, 85, 85, 86, 85, 85, 85, 84, 85, 85, 85, 85, 85, 85, 85, 85, 85, 85, 86, 86, 86, 85, 85, 84, 85, 85, 85, 85, 85, 85, 85, 85, 86, 85, 85, 85, 85, 86, 86, 85, 85, 85, 85, 85, 85, 85, 85, 85, 86, 86, 85, 85, 85, 85, 85, 85, 85, 85, 85, 86, 86, 86, 86, 86, 86, 86, 86, 85, 85, 84, 84, 84, 85, 85, 85, 85, 85, 85, 85, 85, 85, 86, 86, 85, 85, 85, 85, 86, 86, 86, 86, 86, 86, 86, 86, 86, 86, 86, 86, 86, 86, 85, 85, 85, 85, 85, 85, 85, 85, 85, 85, 86, 86, 85, 85, 85, 85, 85, 85, 85, 85, 85, 85, 85, 85, 85, 85, 85, 85, 85, 85, 85, 85, 85, 85, 85, 85, 85, 85, 85, 85, 85, 85, 85, 86, 86, 86, 86, 86, 86, 86, 85, 85, 84, 84, 85, 85, 85, 85, 85, 86, 86, 85, 85, 85, 85, 85, 85, 85, 85, 85, 85, 85, 85, 85, 85, 85, 86, 86, 86, 86, 86, 86, 85, 85, 85, 85, 84, 84, 84, 84, 84, 84, 84, 84, 84, 84, 84, 84, 84, 85, 85, 85, 85, 85, 85, 85, 85, 85, 84, 84, 85, 85, 86, 85, 85, 85, 84, 84, 84, 84, 85, 85, 85, 85, 86, 85, 85, 85, 85, 84, 84, 84, 84, 84, 84, 85, 85, 85, 84, 84, 84, 84, 85, 85, 85, 85, 85, 85, 84, 84, 84, 84, 84, 84, 84, 84, 84, 84, 84, 84, 84, 85, 84, 85, 85, 85, 84, 85, 84, 84, 84, 84, 84, 85, 86, 85, 85, 85, 85, 85, 85, 85, 85, 85, 86, 85, 85, 85, 85, 85, 85, 85, 85, 85, 85, 85, 85, 85, 85, 85, 85, 85, 85, 85, 85, 85, 85, 85, 84, 84, 84, 84]
-545H4%%%J%Jjj%%%%%J%%%%%%%%%%%%%%%jJ%%%j%%%%%J%%%%%%j%J%J%%%j%%%%%%j%%%%%%%
-552H4j%J%%%jJ%%J%%%%%%%%%%%%%%%%%%%%%%J%j%%%%%%j%%%%%%J%j%J%%J%j%%%j%%%%%J%
-560H5%%%%%%%%%%%%Jj%%j%%%J%%%%%J%%%%j%%%%j%%%%%%%J%%%%%%%%%%%%%j%%JJ%j%j%%%
-567H4J%j%J%%%%%%%%%%%%%%%j%%%%%%jJ%J%%%%%%j%%%J%%%%%%%j%%%%%%%J%%%j%%%J%jJj
-574H4%J%%%j%%J%%%j%%Jj%%%%J%%%%j%%jJ%%%%J%j%%j%J%%Jj%J%%%%%Jj%%%%J%%j%%%%%%
-582H5J%%%%%%%%%j%%%%%%%%%%%j%J%%jJ%%%%%j%%%%%%J%%%%%%%%%%%%%%j%Jj%J%%%J%%%%
-589H6%j%%%%%%j%%J%%%%%%%%%%%%j%J%%%%%J%%%%%%%%%%j%%%j%%%%%%%%%%%%JJ%%%jj%%J
-597H5%%%%J%jjJ%%j%%%%%%%%%%%%J%%%%%%%%%%%%%%%%%%%Jj%%jJ%%%%%j%Jj%%%%%%%%%%%
$$ y = [84, 84, 84, 84, 85, 85, 86, 85, 84, 84, 84, 84, 84, 84, 85, 85, 85, 85, 85, 85, 85, 85, 85, 85, 85, 85, 85, 85, 85, 85, 84, 85, 85, 85, 85, 84, 84, 84, 84, 84, 84, 85, 85, 85, 85, 85, 85, 85, 84, 84, 85, 85, 86, 86, 86, 86, 85, 85, 85, 85, 85, 85, 85, 84, 84, 84, 84, 84, 84, 84, 84, 83, 83, 84, 84, 84, 84, 83, 84, 84, 84, 85, 85, 85, 85, 85, 85, 85, 85, 85, 85, 85, 85, 85, 85, 85, 85, 85, 85, 85, 85, 85, 85, 85, 86, 86, 85, 85, 85, 85, 85, 85, 85, 84, 84, 84, 84, 84, 84, 84, 85, 85, 84, 84, 85, 85, 85, 86, 86, 85, 85, 85, 85, 84, 84, 84, 84, 84, 84, 85, 85, 85, 85, 85, 85, 85, 85, 85, 85, 85, 85, 85, 85, 86, 85, 85, 85, 84, 84, 84, 84, 85, 85, 85, 85, 85, 85, 86, 86, 86, 86, 86, 85, 85, 85, 85, 85, 84, 84, 84, 84, 84, 84, 84, 84, 85, 85, 85, 85, 85, 85, 85, 85, 85, 85, 85, 85, 85, 85, 84, 84, 84, 85, 86, 86, 85, 85, 84, 84, 84, 84, 85, 85, 84, 84, 85, 85, 85, 85, 85, 85, 85, 85, 85, 85, 85, 85, 85, 85, 85, 85, 84, 84, 84, 84, 84, 84, 84, 83, 84, 84, 85, 85, 85, 85, 85, 85, 85, 84, 84, 84, 84, 85, 85, 85, 85, 85, 85, 85, 85, 84, 84, 84, 84, 84, 84, 84, 84, 85, 85, 85, 85, 84, 84, 84, 84, 85, 85, 84, 85, 84, 84, 85, 85, 85, 85, 84, 84, 84, 85, 85, 85, 85, 84, 84, 84, 85, 84, 84, 84, 84, 84, 85, 85, 85, 85, 85, 84, 84, 84, 83, 84, 84, 84, 84, 84, 85, 85, 84, 84, 84, 83, 83, 84, 84, 84, 85, 84, 84, 85, 85, 85, 85, 85, 85, 86, 85, 85, 85, 85, 85, 86, 86, 86, 85, 85, 85, 85, 85, 85, 85, 86, 86, 86, 86, 86, 86, 86, 86, 86, 86, 85, 85, 85, 85, 85, 85, 85, 85, 85, 85, 85, 85, 84, 84, 85, 85, 85, 84, 85, 85, 85, 85, 85, 85, 84, 84, 84, 84, 84, 84, 84, 85, 85, 85, 85, 85, 85, 85, 85, 85, 85, 85, 85, 85, 85, 85, 84, 84, 85, 84, 84, 85, 85, 85, 85, 86, 86, 86, 86, 86, 86, 85, 85, 85, 85, 85, 85, 85, 84, 84, 84, 85, 85, 85, 85, 85, 85, 85, 85, 85, 85, 85, 85, 85, 84, 84, 85, 85, 85, 85, 85, 85, 86, 86, 86, 86, 86, 86, 86, 86, 86, 86, 86, 85, 85, 85, 85, 84, 84, 84, 84, 84, 84, 84, 84, 84, 84, 84, 84, 84, 85, 86, 86, 86, 86, 85, 84, 84, 84, 85, 85, 85, 85, 85, 86, 86, 85, 84, 85, 85, 85, 84, 84, 84, 84, 84, 84, 84, 84, 84, 84, 84, 84, 84, 85, 85, 85, 85, 85, 85, 85, 85, 85, 85, 85, 85, 85, 85, 85, 85, 85, 85, 85, 85, 86, 85, 85, 85, 84, 85, 85, 85, 85, 85, 85, 84, 84, 85, 84, 84, 84, 84, 84, 84, 84, 84, 84, 84, 84, 84]
-604H4%%%%J%%%%%%jJ%%%%%j%%%%%%%%J%%Jj%j%%%%%%%%%j%%%%%%%J%%J%%%%%j%j%%J%%%%
-612H4%%%%%%j%%%%J%%%%%J%%%%%%%%j%%%%%%%%%%%%%%%%%%%%J%%%%%%%%j%%%%J%%%%%%%%
-619H5%%%jj%%%J%J%j%%%%%jJ%%%J%%j%%jJ%Jj%%%%Jj%J%%%%j%%%J%%%%%%%%Jj%%%%%%%%%
-626H5%%%%%%%%%%%jJ%%%%j%%%%%%%%%%%%%%%%%%%%%%%%%%%%Jj%%%%%%%%%Jj%%%%%%%%%%J
-634H5%%%%%%%%j%J%%%%j%%%%j%J%Jj%%%%%%%%%%%%J%%%%j%%Jj%%%J%%%j%%%%%%%%%%%%%%
-641H4J%%Jj%%%%%%j%%%%J%%%%%jJ%%%%%%%j%%%%J%%%%%%jJ%%%j%J%j%JJ%%%%%j%%%%%%%%
-649H5%%%%%%%%%%%%%%%%%%%%j%%%%%j%%%%J%%%%Jj%%%%%%%j%%%%%%%%%%%%%%J%%%%%%j%%
-656H3%%%%J%%%%J%%j%%%jJ%J%%%%%%%%%J%j%j%%%%%%%%Jj%%%%%J%%%j%%%%%%%%%%%%%JJ%
$$ y = [84, 84, 84, 84, 84, 85, 85, 85, 85, 85, 85, 85, 84, 85, 85, 85, 85, 85, 85, 84, 84, 84, 84, 84, 84, 84, 84, 84, 85, 85, 85, 86, 85, 85, 84, 84, 84, 84, 84, 84, 84, 84, 84, 84, 83, 83, 83, 83, 83, 83, 83, 83, 84, 84, 84, 85, 85, 85, 85, 85, 85, 84, 84, 83, 83, 83, 84, 84, 84, 84, 84, 84, 84, 84, 84, 84, 84, 83, 83, 83, 83, 83, 84, 84, 84, 84, 84, 84, 85, 85, 85, 85, 85, 85, 85, 85, 85, 84, 84, 84, 84, 84, 84, 84, 84, 84, 84, 84, 84, 84, 84, 84, 84, 84, 84, 84, 84, 84, 85, 85, 85, 85, 85, 85, 85, 85, 85, 84, 84, 84, 84, 84, 85, 85, 85, 85, 85, 85, 85, 85, 85, 85, 85, 85, 84, 83, 83, 83, 83, 84, 84, 85, 85, 84, 84, 84, 84, 84, 84, 83, 84, 84, 84, 84, 85, 85, 85, 84, 84, 84, 83, 84, 84, 85, 84, 84, 84, 84, 84, 85, 84, 84, 85, 85, 85, 85, 85, 84, 84, 84, 84, 85, 85, 85, 85, 85, 85, 85, 85, 85, 86, 85, 85, 85, 85, 85, 85, 85, 85, 85, 85, 85, 85, 85, 85, 85, 85, 85, 85, 85, 85, 85, 84, 85, 85, 85, 85, 85, 84, 84, 84, 84, 84, 84, 84, 84, 84, 84, 84, 84, 84, 84, 84, 84, 84, 84, 84, 84, 84, 84, 84, 84, 84, 84, 84, 84, 84, 85, 84, 84, 84, 84, 84, 84, 84, 84, 84, 84, 85, 84, 84, 84, 84, 84, 84, 84, 84, 84, 84, 84, 85, 85, 85, 85, 85, 85, 85, 85, 85, 84, 84, 85, 85, 85, 85, 85, 84, 84, 84, 84, 84, 83, 83, 84, 84, 85, 84, 84, 84, 84, 84, 84, 84, 84, 84, 84, 84, 84, 84, 85, 85, 85, 85, 85, 84, 84, 84, 85, 84, 84, 84, 84, 85, 85, 85, 85, 84, 84, 84, 84, 84, 84, 84, 84, 84, 84, 84, 84, 84, 84, 84, 85, 85, 85, 86, 85, 85, 85, 85, 85, 85, 85, 84, 84, 84, 84, 84, 85, 85, 85, 85, 85, 85, 84, 85, 85, 85, 85, 85, 85, 85, 85, 84, 84, 84, 84, 84, 85, 85, 85, 85, 85, 85, 85, 84, 85, 85, 85, 85, 84, 84, 85, 85, 84, 84, 85, 86, 86, 86, 86, 86, 86, 85, 85, 85, 85, 85, 85, 85, 85, 85, 85, 85, 85, 85, 85, 85, 85, 85, 85, 85, 85, 85, 85, 85, 85, 85, 85, 85, 85, 85, 84, 84, 84, 84, 84, 84, 83, 83, 83, 83, 83, 84, 84, 84, 84, 84, 85, 84, 84, 84, 84, 84, 84, 84, 84, 83, 83, 83, 83, 83, 83, 83, 83, 83, 83, 83, 83, 83, 83, 83, 84, 84, 84, 84, 84, 84, 84, 83, 83, 83, 83, 83, 83, 83, 84, 84, 84, 84, 84, 85, 85, 85, 84, 84, 84, 84, 83, 84, 84, 85, 85, 85, 85, 85, 85, 85, 85, 85, 85, 86, 86, 85, 85, 84, 84, 84, 84, 84, 84, 84, 84, 84, 85, 84, 84, 84, 84, 84, 84, 85, 85, 85, 85, 84, 84, 84, 84, 84, 84, 84, 84, 84, 84, 84, 84, 84, 84, 85, 86, 86]
-663H6%j%j%%J%J%j%%%j%%Jj%%J%%%%%%%%%j%%%Jj%%%%J%%j%%%Jj%%%j%%%%Jj%%%%%%J%%%
-671H4%%%%%%%%%%%%J%%%%j%%%%%%%J%j%Jj%%%%%%%%jJ%JJj%j%%%%%%%%%%J%j%%%%%j%%JJ
-678H5j%%%J%j%J%%jJj%%%%%%%%%%%%%%%%%%%%%%j%J%%%%%%%%%%%%%%J%%%%%%%j%%%j%%%%
-686H3J%jJ%jJ%%%%%%%%%J%jJ%%Jj%%%j%%j%%J%%%%J%j%%%%%%%j%%%%J%j%%%%%J%%%j%%%%
-693H3%J%%%%%%Jj%%%%%jJ%%%%%%%%%%%%%%J%%%%%%%%%j%%%%%j%%J%%%%%%%%%%%%j%%J%%%
-701H4%%%%%%%%%%%%j%%%%%%%%J%Jj%j%%%J%%%%%%%%%%%%%%%%%%%%j%%%%%%%%%%%%J%%j%%
-708H3%%%%%%%%J%%%%Jj%j%%%J%%%%j%%%%J%J%%%%%j%j%%%%J%%%%%%%jJ%j%J%%%%%%%%%Jj
-715H4%%jJ%%%%%%Jj%%%%%%%%%%J%J%%j%j%Jj%%%%j%%J%%%%%%%j%%%%J%%%%%J%%%%%j%%%%
$$ y = [86, 86, 85, 85, 84, 84, 84, 85, 85, 86, 86, 85, 85, 85, 85, 84, 84, 84, 85, 84, 84, 84, 85, 85, 85, 85, 85, 85, 85, 85, 85, 85, 84, 84, 84, 84, 85, 84, 84, 84, 84, 84, 85, 85, 85, 84, 84, 84, 84, 85, 84, 84, 84, 84, 83, 83, 83, 83, 83, 84, 83, 83, 83, 83, 83, 83, 83, 84, 84, 84, 84, 84, 84, 84, 84, 84, 84, 84, 84, 84, 84, 84, 84, 85, 85, 85, 85, 85, 84, 84, 84, 84, 84, 84, 84, 84, 85, 85, 84, 84, 85, 84, 84, 84, 84, 84, 84, 84, 84, 84, 83, 84, 84, 85, 86, 85, 85, 84, 84, 84, 84, 84, 84, 84, 84, 84, 84, 84, 85, 85, 84, 84, 84, 84, 84, 84, 83, 83, 83, 84, 85, 84, 84, 84, 84, 85, 85, 84, 84, 85, 85, 85, 84, 85, 84, 84, 84, 84, 84, 84, 84, 84, 84, 84, 84, 84, 84, 84, 84, 84, 84, 84, 84, 84, 84, 84, 84, 83, 83, 84, 84, 84, 84, 84, 84, 84, 84, 84, 84, 84, 84, 84, 84, 84, 85, 85, 85, 85, 85, 85, 85, 85, 84, 84, 84, 84, 83, 83, 83, 83, 83, 84, 84, 83, 84, 84, 83, 84, 84, 84, 84, 84, 84, 84, 84, 84, 84, 85, 85, 84, 85, 85, 85, 86, 85, 85, 85, 85, 84, 84, 84, 83, 83, 83, 84, 84, 84, 84, 84, 85, 85, 84, 84, 84, 84, 84, 84, 84, 84, 83, 83, 83, 83, 83, 84, 84, 83, 83, 83, 83, 83, 83, 84, 84, 84, 84, 83, 83, 83, 83, 83, 83, 84, 84, 84, 84, 84, 84, 84, 85, 84, 84, 84, 84, 84, 84, 83, 84, 84, 84, 84, 84, 84, 84, 84, 84, 84, 84, 84, 84, 84, 84, 85, 85, 85, 85, 85, 85, 85, 85, 85, 85, 84, 84, 84, 84, 84, 84, 83, 83, 83, 84, 84, 84, 84, 84, 84, 84, 84, 84, 84, 84, 84, 84, 83, 83, 83, 84, 84, 84, 84, 84, 84, 84, 84, 84, 84, 84, 84, 84, 84, 84, 84, 83, 83, 83, 83, 83, 83, 83, 83, 83, 84, 84, 85, 84, 84, 83, 83, 83, 83, 84, 84, 84, 84, 84, 84, 84, 84, 84, 84, 84, 84, 84, 84, 84, 84, 84, 84, 84, 84, 84, 83, 83, 83, 83, 83, 83, 83, 83, 83, 83, 83, 83, 83, 84, 84, 84, 83, 83, 83, 83, 83, 83, 83, 83, 83, 83, 83, 84, 84, 84, 84, 84, 85, 84, 84, 83, 83, 83, 83, 84, 84, 84, 84, 84, 83, 83, 83, 83, 83, 84, 84, 85, 85, 85, 85, 85, 85, 84, 84, 83, 83, 83, 83, 83, 84, 84, 84, 84, 84, 84, 84, 84, 83, 84, 84, 83, 83, 84, 84, 84, 84, 84, 84, 84, 84, 84, 84, 85, 84, 84, 84, 83, 84, 84, 84, 84, 84, 84, 84, 85, 84, 84, 84, 84, 84, 84, 84, 84, 84, 84, 84, 85, 85, 86, 86, 86, 85, 85, 84, 84, 85, 84, 84, 84, 84, 84, 83, 83, 83, 84, 84, 84, 84, 84, 84, 84, 84, 83, 83, 83, 83, 83, 84, 84, 84, 84, 84, 84, 85, 85, 85, 85, 85, 85, 84, 84, 84, 84, 84]
-723H4%%%%%J%j%%%%J%%%j%j%J%J%j%%%%%%%%%j%J%%%%%j%%%%%%%J%j%%%%%J%%%%%%%%j%%
-730H3J%%j%%J%%j%%%%%%%%J%j%%%%%%J%%%%%%%%%%%J%%j%%%%%%%%%%%%%%jJ%%%%j%%j%J%
-738H3%%%J%%j%%%%%Jj%%J%j%%J%%Jj%%%%%%%Jj%j%%J%%%%%%%%%%%%%%J%%%j%%%%%%%%%%%
-745H4%%%%%%%j%%J%j%%%%%%%%J%%%%%%%%%%%%%%%%%%%%%%%%%%%J%%j%%%%j%%%%%%%Jj%J%
-752H4%j%J%jj%%J%%%%%j%J%J%j%%%%J%%%%%j%J%%%%%%%%%%%%J%%%j%%%%%%%j%%%J%j%%%J
-760H4Jjj%%J%%%%%%%%J%%%%j%%%%%J%j%%%%%%%%%j%%%%%J%j%%J%%%%%%%j%%%%%%JJ%%j%%
-767H4j%%%%J%%%%%%j%J%%%%%%%%j%%%%%%%J%%%%j%%%jJ%J%%j%%%j%%%J%%%%%%%%%%%%%%%
-775H3%%%JJj%j%%%%%%%%%%%%J%%%%%Jj%%%%j%%%%%%%%%%%%Jjj%%J%%%%%%%%%%%%%Jj%%%%
$$ y = [84, 84, 84, 84, 84, 84, 85, 85, 84, 84, 84, 84, 84, 85, 85, 85, 85, 84, 84, 83, 83, 84, 84, 85, 85, 84, 84, 84, 84, 84, 84, 84, 84, 84, 84, 83, 83, 84, 84, 84, 84, 84, 84, 83, 83, 83, 83, 83, 83, 83, 83, 84, 84, 83, 83, 83, 83, 83, 83, 84, 84, 84, 84, 84, 84, 84, 84, 84, 83, 83, 83, 84, 84, 84, 83, 83, 83, 84, 84, 84, 83, 83, 83, 83, 83, 83, 83, 83, 83, 84, 84, 83, 83, 83, 83, 83, 83, 83, 84, 84, 84, 84, 84, 84, 84, 84, 84, 84, 84, 84, 85, 85, 85, 84, 84, 84, 84, 84, 84, 84, 84, 84, 84, 84, 84, 84, 84, 84, 83, 84, 84, 84, 84, 84, 83, 83, 83, 82, 82, 83, 83, 83, 83, 83, 84, 84, 84, 83, 83, 83, 83, 83, 83, 84, 83, 83, 83, 84, 84, 83, 83, 83, 84, 84, 84, 85, 84, 84, 84, 84, 84, 84, 84, 84, 85, 84, 84, 83, 83, 83, 84, 84, 84, 84, 84, 84, 84, 84, 84, 84, 84, 84, 84, 84, 84, 85, 85, 85, 85, 84, 84, 84, 84, 84, 84, 84, 84, 84, 84, 84, 84, 84, 84, 84, 84, 84, 84, 84, 83, 83, 83, 84, 84, 83, 83, 83, 83, 83, 83, 83, 83, 83, 84, 84, 84, 84, 84, 84, 84, 84, 84, 84, 84, 84, 84, 84, 84, 84, 84, 84, 84, 84, 84, 84, 84, 84, 84, 84, 84, 84, 85, 85, 85, 84, 84, 84, 84, 84, 83, 83, 83, 83, 83, 83, 83, 83, 84, 83, 83, 84, 84, 84, 83, 83, 84, 84, 83, 82, 82, 82, 83, 83, 83, 83, 83, 83, 82, 82, 83, 83, 84, 84, 83, 83, 83, 83, 83, 84, 84, 84, 84, 84, 84, 83, 83, 84, 84, 84, 84, 84, 84, 84, 84, 84, 84, 84, 84, 84, 85, 85, 85, 85, 84, 84, 84, 84, 84, 84, 84, 84, 83, 83, 83, 83, 84, 84, 83, 83, 83, 83, 84, 85, 84, 83, 83, 83, 84, 84, 84, 84, 84, 84, 84, 84, 84, 85, 85, 85, 85, 85, 84, 84, 84, 84, 84, 84, 85, 85, 84, 84, 84, 84, 84, 84, 84, 84, 84, 84, 83, 83, 83, 83, 83, 83, 84, 84, 83, 83, 83, 84, 84, 84, 84, 84, 84, 84, 84, 83, 83, 83, 83, 83, 83, 83, 84, 85, 85, 85, 84, 84, 84, 83, 83, 83, 83, 83, 84, 84, 84, 84, 84, 84, 84, 83, 83, 84, 84, 84, 84, 84, 84, 84, 84, 84, 83, 83, 83, 83, 83, 83, 83, 83, 84, 84, 84, 84, 84, 83, 83, 83, 83, 82, 83, 83, 84, 84, 84, 83, 83, 83, 83, 82, 82, 82, 82, 83, 83, 83, 83, 83, 83, 83, 83, 83, 83, 83, 83, 83, 83, 83, 83, 83, 83, 83, 84, 85, 84, 84, 83, 83, 83, 83, 83, 83, 83, 83, 83, 83, 83, 83, 83, 84, 84, 84, 84, 84, 84, 85, 84, 84, 84, 84, 84, 83, 83, 83, 83, 83, 83, 83, 83, 83, 83, 83, 83, 83, 84, 83, 82, 82, 82, 83, 83, 83, 83, 83, 83, 83, 83, 83, 83, 83, 83, 83, 83, 84, 83, 83, 83, 83, 83]
-782H3%%j%%%%%J%jJ%j%%J%%J%%%j%%J%%%j%%%%%%%%%%%%%%j%%JJ%%%%j%%j%%%%%%J%%%J%
-790H4j%%%%%%%%%%%%%jJ%%%%%%%%%%%%%%%J%%%%%%%%%%%%j%%J%j%%%%%%%%%J%%%%j%%%%%
-797H3jJ%%%%j%J%%%j%J%%%%%%%%j%j%%J%J%J%j%%%%%%%%j%%%J%%%%%J%%%%%%%jj%J%%%Jj
-804H3%%%%%%%j%J%J%%%%%%%%j%%%%%%%J%%j%%%%%%%%%%%J%%%%%%%%j%%Jj%%%%%%%%%%%%%
-812H3J%j%%J%%%j%%J%%%%%j%%%%%J%%%j%%%%%%%%%%%%%%%%%JJ%%%j%%%%%%%%j%%%%%%%%%
-819H3%%J%%%j%J%j%%%%J%jJ%%%Jj%%%j%%%J%%%J%%j%J%jj%%%%%%%%J%%%%%%%J%%j%%%%J%
-827H5%%%j%%%%%%%%j%%%%J%%%%%j%%%%%%%%%%%%%J%%j%%%j%%J%J%%%%%%%%%%%%%%%%%%j%
-834H3%%%%%%%%%%%J%%j%%%Jj%%j%%JjJ%%%%j%jJJ%J%j%%%%%%%%%j%J%%%J%%%j%%%%%%%%J
$$ y = [83, 83, 83, 82, 82, 82, 82, 82, 82, 83, 83, 82, 83, 83, 82, 82, 82, 83, 83, 83, 84, 84, 84, 84, 83, 83, 83, 84, 84, 84, 84, 83, 83, 83, 83, 83, 83, 83, 83, 83, 83, 83, 83, 83, 83, 83, 82, 82, 82, 83, 84, 84, 84, 84, 84, 83, 83, 83, 82, 82, 82, 82, 82, 82, 82, 83, 83, 83, 83, 84, 84, 83, 83, 83, 83, 83, 83, 83, 83, 83, 83, 83, 83, 83, 83, 82, 83, 83, 83, 83, 83, 83, 83, 83, 83, 83, 83, 83, 83, 83, 83, 83, 84, 84, 84, 84, 84, 84, 84, 84, 84, 84, 84, 84, 84, 83, 83, 83, 84, 84, 83, 83, 83, 83, 83, 83, 83, 83, 83, 83, 84, 84, 84, 84, 84, 83, 83, 83, 83, 83, 83, 82, 83, 83, 83, 83, 83, 82, 82, 83, 83, 83, 83, 82, 82, 83, 83, 83, 83, 83, 83, 83, 83, 83, 82, 82, 81, 81, 81, 82, 82, 83, 83, 84, 84, 83, 83, 83, 83, 83, 83, 83, 83, 83, 82, 82, 82, 82, 83, 83, 83, 83, 83, 83, 84, 84, 84, 84, 84, 84, 84, 84, 83, 82, 82, 83, 83, 83, 83, 84, 83, 83, 83, 83, 83, 83, 83, 83, 82, 82, 83, 83, 84, 84, 84, 84, 84, 84, 84, 84, 84, 83, 83, 83, 83, 83, 83, 83, 83, 84, 84, 84, 83, 83, 83, 83, 83, 83, 83, 83, 83, 83, 83, 83, 84, 84, 84, 84, 84, 84, 84, 84, 84, 83, 83, 83, 84, 83, 83, 83, 83, 83, 83, 83, 83, 83, 83, 83, 83, 83, 83, 84, 84, 83, 83, 83, 84, 84, 84, 84, 83, 83, 83, 84, 84, 84, 84, 84, 84, 83, 83, 83, 83, 83, 83, 84, 84, 84, 84, 83, 83, 83, 83, 83, 83, 83, 83, 83, 83, 83, 83, 83, 83, 83, 83, 83, 83, 84, 85, 85, 85, 85, 84, 84, 84, 84, 84, 84, 84, 84, 84, 83, 83, 83, 83, 83, 83, 83, 83, 83, 83, 83, 83, 84, 84, 84, 84, 83, 83, 84, 84, 83, 83, 83, 83, 83, 84, 84, 83, 84, 84, 84, 84, 85, 84, 84, 84, 84, 83, 83, 83, 83, 84, 84, 84, 84, 85, 85, 85, 84, 84, 85, 85, 84, 83, 83, 83, 83, 83, 83, 83, 83, 83, 84, 84, 84, 84, 84, 84, 84, 84, 85, 85, 85, 84, 84, 84, 84, 84, 85, 85, 85, 85, 85, 84, 84, 84, 84, 84, 84, 84, 84, 84, 83, 83, 83, 83, 83, 84, 84, 84, 84, 84, 84, 83, 83, 83, 83, 83, 83, 83, 83, 83, 83, 83, 83, 83, 83, 84, 84, 84, 83, 83, 83, 83, 82, 82, 82, 83, 83, 84, 84, 84, 84, 84, 84, 84, 84, 84, 84, 84, 84, 84, 84, 84, 84, 84, 84, 84, 83, 83, 83, 83, 83, 83, 83, 83, 83, 83, 83, 83, 83, 84, 84, 84, 83, 83, 83, 83, 84, 83, 83, 83, 82, 82, 82, 83, 82, 83, 83, 83, 83, 83, 82, 82, 81, 82, 83, 83, 84, 84, 83, 83, 83, 83, 83, 83, 83, 83, 83, 83, 82, 82, 83, 83, 83, 83, 84, 84, 84, 84, 83, 83, 83, 83, 83, 83, 83, 83, 83, 84]
-841H4%%%%j%jJ%%%JJ%%jj%%%%%%%Jj%%j%J%%%%%%%%%%%J%%%%%%%%%j%%%%J%%j%%%j%%%%J
-849H3%%%%%%%%%J%j%%%%%%%%J%%j%%%%%%%%jJ%%%%%J%%%%%%%jj%%%JjJ%%%%%%%%%%%%%%%
-856H3%%%%%%%%%%%j%%J%%%%%%J%%%%%%%%%%%%%%%%%%%j%%%%%%%%%%J%jj%J%J%%%%%Jjj%%
-864H3jJJj%%%%%%%%%%J%%%%jj%j%%%JJ%%%%%Jj%%J%%%%%j%%%%%J%%%%%%j%j%%%Jj%%%%%%
-871H2%%%%%%%%%%%%%%%%%%%%%%j%%J%%%%%%%%%%%J%%%j%%J%%%jJ%%%%%%%%%%%%J%j%%%%%
-879H3%%%%%%%%J%%%j%j%%%%%%%J%%%%%j%%J%%%%%j%%%%%J%%%%%j%%%%%%%%%%J%%%%j%J%%
-886H3%%%%%%j%%%Jj%%%%%%%%%%%j%%J%J%%%j%%%%%%%%%J%%%%%%jj%%%J%J%j%%%%J%%%j%%
-893H2%%%%%%%J%%j%%%%%J%%%%j%J%%J%%%%%j%%%%%%%%j%%%%%%%%%%J%%%%J%%%j%%%%%%%%
$$ y = [84, 84, 84, 84, 84, 83, 83, 82, 83, 83, 83, 83, 84, 85, 85, 85, 84, 83, 83, 83, 83, 83, 83, 83, 83, 84, 83, 83, 83, 82, 82, 83, 83, 83, 83, 83, 83, 83, 83, 83, 83, 83, 83, 84, 84, 84, 84, 84, 84, 84, 84, 84, 84, 83, 83, 83, 83, 83, 84, 84, 84, 83, 83, 83, 83, 82, 82, 82, 82, 82, 83, 83, 83, 83, 83, 83, 83, 83, 83, 83, 84, 84, 83, 83, 83, 83, 83, 83, 83, 83, 83, 84, 84, 84, 83, 83, 83, 83, 83, 83, 83, 83, 83, 82, 83, 83, 83, 83, 83, 83, 84, 84, 84, 84, 84, 84, 84, 84, 83, 82, 82, 82, 82, 83, 82, 83, 83, 83, 83, 83, 83, 83, 83, 83, 83, 83, 83, 83, 83, 83, 83, 83, 83, 83, 83, 83, 83, 83, 83, 83, 83, 83, 82, 82, 82, 83, 83, 83, 83, 83, 83, 83, 84, 84, 84, 84, 84, 84, 84, 84, 84, 84, 84, 84, 84, 84, 84, 84, 84, 84, 84, 84, 83, 83, 83, 83, 83, 83, 83, 83, 83, 83, 83, 84, 84, 83, 82, 82, 83, 83, 84, 84, 84, 84, 84, 84, 85, 84, 83, 83, 83, 82, 83, 84, 83, 83, 83, 83, 83, 83, 83, 83, 83, 83, 83, 84, 84, 84, 84, 84, 83, 82, 82, 81, 81, 81, 81, 82, 83, 83, 83, 83, 83, 83, 84, 83, 83, 83, 84, 84, 84, 84, 84, 84, 83, 83, 83, 83, 83, 83, 84, 84, 84, 84, 84, 84, 84, 83, 83, 82, 82, 82, 82, 83, 82, 82, 82, 82, 82, 82, 82, 82, 82, 82, 82, 82, 82, 82, 82, 82, 82, 82, 82, 82, 82, 82, 82, 82, 82, 82, 82, 82, 82, 81, 81, 81, 82, 82, 82, 82, 82, 82, 82, 82, 82, 82, 82, 82, 83, 83, 83, 83, 82, 82, 82, 83, 83, 83, 83, 82, 83, 83, 83, 83, 83, 83, 83, 83, 83, 83, 83, 83, 83, 84, 84, 83, 83, 83, 83, 83, 83, 83, 83, 83, 83, 83, 83, 83, 83, 84, 84, 84, 84, 83, 83, 82, 82, 82, 82, 82, 82, 82, 82, 83, 83, 83, 83, 83, 83, 82, 82, 82, 83, 83, 83, 83, 83, 83, 82, 82, 82, 82, 82, 82, 83, 83, 83, 83, 83, 83, 82, 82, 82, 82, 82, 82, 82, 82, 82, 82, 82, 83, 83, 83, 83, 83, 82, 82, 83, 83, 83, 83, 83, 83, 83, 83, 83, 82, 82, 82, 82, 83, 82, 82, 82, 82, 82, 82, 82, 82, 82, 82, 82, 82, 81, 81, 81, 82, 82, 83, 83, 83, 83, 82, 82, 82, 82, 82, 82, 82, 82, 82, 82, 83, 83, 83, 83, 83, 83, 83, 82, 81, 81, 81, 81, 82, 82, 83, 83, 82, 82, 82, 82, 82, 83, 83, 83, 83, 82, 82, 82, 82, 82, 82, 82, 82, 82, 82, 83, 83, 83, 82, 82, 82, 82, 82, 82, 83, 83, 83, 83, 83, 82, 82, 83, 83, 83, 84, 84, 84, 84, 84, 84, 83, 83, 83, 83, 83, 83, 83, 83, 83, 82, 82, 82, 82, 82, 82, 82, 82, 82, 82, 82, 83, 83, 83, 83, 83, 84, 84, 84, 84, 83, 83, 83, 83, 83, 83, 83, 83, 83]
-901H3%%%%%j%%jJ%%%%%%%%%%%%%%%%%%%%%%%%%%%%%%%%%%jJ%%%%Jj%%%%%%%J%%%j%J%%%%
-908H3%%%%j%jJ%%%%J%%%%%%%%%J%j%%%%j%%J%%%%%%%j%jJ%%J%%%j%%%%J%%%J%%%j%%%J%%
-916H4%j%%J%j%%J%%%%%j%j%%J%%j%%%%%%%J%%%%%%%%%%j%J%%%%%%%%%j%%%%%%%%%%%%%%%
-923H2%%%Jj%%%Jjj%%%%%%%%%%%%J%j%%%%J%%%%%%%%%%%%%%%%%%%%%%%%j%%jJ%%%%%%%%J%
-930H2%%%%%%%%%J%%%%jJ%%%%%%%%%%%%%%%%%%%%%%%%%j%%%%J%%%%j%J%%%j%%%J%%%j%%%%
-938H2%j%%J%%J%%%%%%%%%%%%%j%%JjJ%j%j%%J%J%%%j%%J%%%%j%%%%%%%J%%j%%%%%%%%%%%
-945H2%%%%%%%%%%%%%%%%J%j%%j%%%%%%jJJ%J%j%%%j%%%%%J%%%%%%J%J%j%%%%%j%J%%Jj%j
-953H2%J%j%%J%j%%%%%%%%%%%%%%%%J%%%%%%j%%%J%jJ%%%%%%j%%%%%Jj%%%%%J%J%%j%%j%%
$$ y = [83, 83, 83, 83, 83, 83, 82, 82, 82, 81, 82, 82, 82, 82, 82, 82, 82, 82, 82, 82, 82, 82, 82, 82, 82, 82, 82, 82, 82, 82, 82, 82, 82, 82, 82, 82, 82, 82, 82, 82, 82, 82, 82, 82, 82, 81, 82, 82, 82, 82, 82, 83, 82, 82, 82, 82, 82, 82, 82, 82, 83, 83, 83, 83, 82, 82, 83, 83, 83, 83, 83, 83, 83, 83, 83, 82, 82, 81, 82, 82, 82, 82, 82, 83, 83, 83, 83, 83, 83, 83, 83, 83, 83, 84, 84, 83, 83, 83, 83, 83, 82, 82, 82, 83, 83, 83, 83, 83, 83, 83, 83, 82, 82, 81, 82, 82, 82, 83, 83, 83, 83, 82, 82, 82, 82, 82, 83, 83, 83, 83, 84, 84, 84, 84, 83, 83, 83, 83, 84, 84, 84, 84, 83, 83, 83, 84, 84, 83, 83, 83, 84, 84, 84, 84, 84, 84, 83, 83, 82, 82, 82, 83, 83, 83, 82, 82, 82, 82, 82, 82, 82, 82, 83, 83, 83, 83, 83, 83, 83, 83, 83, 83, 83, 82, 82, 83, 83, 83, 83, 83, 83, 83, 83, 83, 83, 82, 82, 82, 82, 82, 82, 82, 82, 82, 82, 82, 82, 82, 82, 82, 82, 82, 82, 82, 83, 82, 82, 82, 82, 83, 82, 81, 81, 81, 81, 81, 81, 81, 81, 81, 81, 81, 81, 81, 82, 82, 81, 81, 81, 81, 81, 82, 82, 82, 82, 82, 82, 82, 82, 82, 82, 82, 82, 82, 82, 82, 82, 82, 82, 82, 82, 82, 82, 82, 82, 82, 81, 81, 81, 80, 81, 81, 81, 81, 81, 81, 81, 81, 81, 82, 82, 82, 82, 82, 82, 82, 82, 82, 82, 82, 83, 83, 83, 83, 83, 82, 83, 83, 83, 83, 83, 83, 83, 83, 83, 83, 83, 83, 83, 83, 83, 83, 83, 83, 83, 83, 83, 83, 83, 83, 83, 83, 82, 82, 82, 82, 82, 83, 83, 83, 83, 83, 82, 82, 83, 83, 83, 83, 82, 82, 82, 82, 83, 83, 83, 83, 82, 82, 82, 82, 82, 82, 81, 81, 81, 82, 82, 82, 83, 83, 83, 83, 83, 83, 83, 83, 83, 83, 83, 83, 83, 83, 82, 82, 82, 83, 82, 83, 83, 82, 82, 81, 81, 81, 82, 82, 83, 83, 83, 83, 82, 82, 82, 83, 83, 83, 83, 83, 82, 82, 82, 82, 82, 82, 82, 82, 83, 83, 83, 82, 82, 82, 82, 82, 82, 82, 82, 82, 82, 82, 82, 82, 82, 82, 82, 82, 82, 82, 82, 82, 82, 82, 82, 82, 82, 82, 82, 83, 83, 82, 82, 82, 81, 81, 81, 81, 81, 81, 81, 80, 81, 82, 82, 83, 83, 82, 82, 82, 82, 81, 81, 81, 81, 81, 81, 82, 82, 82, 82, 82, 82, 82, 83, 83, 84, 84, 83, 83, 83, 83, 83, 83, 82, 82, 83, 83, 83, 84, 83, 83, 82, 82, 83, 83, 82, 82, 82, 83, 83, 82, 82, 82, 82, 82, 82, 82, 82, 82, 82, 82, 82, 82, 82, 82, 82, 82, 83, 83, 83, 83, 83, 83, 83, 82, 82, 82, 82, 83, 83, 82, 83, 83, 83, 83, 83, 83, 83, 82, 82, 82, 82, 82, 82, 83, 82, 82, 82, 82, 82, 82, 83, 83, 84, 84, 84, 83, 83, 83, 82, 82, 82]
-960H2%%%J%%j%%J%%%%%j%%j%%%JJj%%%Jj%%%%%%Jj%Jj%j%%J%%%%%%Jj%%%%%%%%%%%%%%jJ
-968H2%%%%%%%%%%%%Jj%%%%%%%%J%%j%%%%%j%%J%%%%J%%Jj%j%%%%Jj%%%%J%%j%%%%%%J%%%
-975H3%%%%%j%%%%%JJ%j%%jJ%%%%j%%%%%%%%%%%%J%%%%%j%%%%%J%%%%%j%%%%%%%%%%%%j%%
-982H1%%%J%J%%%%%j%%jJ%%%%%%%%%%%%Jj%jJ%%%%%%%%%%%%%%%Jj%%%%%%j%%J%%J%j%%%%%
-990H2%%%%%%%%%%%%%%%%%%%%%%%%jJ%%Jj%%%%%%J%j%%%%J%j%%J%%j%%%%Jj%%%%%%%J%%%j
-997H2%J%%%%%%%%%%%%j%%j%%%%%%%J%Jj%j%%%%J%%%J%%j%J%%j%%%%%%%%%%%%%%%%%%%%%%
$$ y = [82, 82, 82, 82, 83, 83, 83, 82, 82, 82, 83, 83, 83, 83, 83, 83, 82, 82, 82, 81, 81, 81, 81, 82, 83, 82, 82, 82, 82, 83, 82, 82, 82, 82, 82, 82, 82, 83, 82, 82, 83, 82, 82, 81, 81, 81, 82, 82, 82, 82, 82, 82, 82, 83, 82, 82, 82, 82, 82, 82, 82, 82, 82, 82, 82, 82, 82, 82, 82, 81, 82, 82, 82, 82, 82, 82, 82, 82, 82, 82, 82, 82, 82, 83, 82, 82, 82, 82, 82, 82, 82, 82, 82, 83, 83, 83, 82, 82, 82, 82, 82, 82, 81, 81, 81, 82, 82, 82, 82, 82, 83, 83, 83, 84, 83, 83, 82, 82, 82, 82, 82, 83, 82, 82, 82, 82, 82, 83, 83, 83, 82, 82, 82, 82, 82, 82, 82, 83, 83, 83, 83, 83, 83, 83, 83, 83, 82, 82, 82, 82, 82, 82, 83, 84, 84, 83, 83, 83, 82, 83, 83, 83, 83, 83, 82, 82, 82, 82, 82, 82, 82, 82, 82, 82, 82, 82, 82, 83, 83, 83, 83, 83, 83, 82, 82, 82, 82, 82, 82, 83, 83, 83, 83, 83, 83, 82, 82, 82, 82, 82, 82, 82, 82, 82, 82, 82, 82, 82, 81, 81, 81, 81, 81, 81, 82, 82, 83, 83, 83, 83, 83, 83, 82, 82, 82, 81, 82, 82, 82, 82, 82, 82, 82, 82, 82, 82, 82, 82, 82, 83, 82, 82, 81, 82, 82, 82, 82, 82, 82, 82, 82, 82, 82, 82, 82, 82, 82, 82, 82, 83, 82, 82, 82, 82, 82, 82, 82, 81, 81, 81, 82, 82, 82, 83, 83, 82, 82, 82, 82, 82, 82, 82, 82, 82, 82, 82, 82, 82, 82, 82, 82, 82, 82, 82, 82, 82, 82, 82, 82, 82, 82, 82, 82, 82, 82, 81, 82, 82, 82, 83, 82, 82, 82, 82, 82, 82, 82, 83, 83, 82, 82, 82, 82, 82, 83, 83, 82, 82, 82, 83, 83, 83, 82, 82, 82, 82, 82, 83, 82, 82, 82, 82, 82, 82, 82, 82, 83, 83, 83, 83, 82, 82, 83, 83, 83, 83, 83, 83, 83, 83, 83, 83, 83, 83, 83, 82, 82, 82, 81, 81, 81, 81, 81, 81, 81, 81, 82, 82, 83, 82, 82, 81, 81, 81, 81, 81, 82, 82, 82, 82, 83, 83, 83, 82, 82, 83, 83, 83, 82, 82, 82, 82, 82, 82, 82, 82, 82, 82, 82, 82, 82, 82, 82, 82, 82, 82, 82, 82, 82, 82, 82]
$$ [...]
-2638I1
##END=		$$ NMR SPECTRUM
##END=		$$ LINK
