##TITLE=	wWQrXOeXTACniA+mWqiCew.11.fid
##JCAMP-DX=	6.0	$$ MestReNova 14.3.3-33362
##DATA TYPE=	LINK
##BLOCKS=	1    
##ORIGIN=	Mestrelab Research S.L.
##OWNER=	hrzepa
##$MNOVA/METADATA=	(DOCUMENT,BASE64)
eyJuYW1lIjoiL1VzZXJzL2hyemVwYS9MaWJyYXJ5L01vYmlsZSBEb2N1bWVudHMvY29tfmFwcGxlfkN
sb3VkRG9jcy9TaGVwcGFyZC9OTVIgZmlsZXMgemlwcy0yL0Jvcm94aW5lIC0gYW1pbmUgYWRkdWN0cy
9UcmlwaGVueWxib3JveGluZSArIGFtaW5vIHB5cmlkaW5lL3RyaXBoZW55bGJvcm94aW5lICsgYW1pb
m8gcHlyaWRpbmUtQi90cmlwaGVueWxib3JveGluZSArIGFtaW5vIHB5cmlkaW5lLUIubW5vdmEiLCJw
YWdlcyI6W3siaXRlbXMiOlsiMSIgICAgIF19XX0=
##TITLE=	wWQrXOeXTACniA+mWqiCew.11.fid
##JCAMP-DX=	6.0	$$ MestReNova 14.3.3-33362
##DATA TYPE=	NMR SPECTRUM
##DATA CLASS=	XYDATA
##BLOCK_ID=	1
##ORIGIN=	Bruker BioSpin GmbH
##OWNER=	root
##NUMDIM=	1
##$MNOVA/METADATA=	(ITEM,BASE64)
eyJhbmdsZSI6MCwiYXhlcyI6eyJ4Ijp7Im1heCI6MjA1LjAwMDY5OTk5ODk5MDY4LCJtaW4iOi0yMDQ
uOTk3NTgxNzgyNjk0NjJ9LCJ5Ijp7Im1heCI6MzQ0MjA0LjYwOTM3NSwibWluIjotNDU3NTguMjY5NT
MxMjV9fSwicG9pbnRzIjpbeyJ4Ijo1MzIxLCJ5Ijo1ODM1fSx7IngiOjg3MjIsInkiOjU4MzV9LHsie
CI6ODcyMiwieSI6ODIwOH0seyJ4Ijo1MzIxLCJ5Ijo4MjA4fSx7IngiOjUzMjEsInkiOjU4MzV9XSwi
eiI6MH0=
##.OBSERVE FREQUENCY=	160.46157916600000704
##.OBSERVE NUCLEUS=	^11B
##.SOLVENT NAME=	CDCl3
##.PULSE SEQUENCE=	zg
##LONGDATE=	2022/12/01 16:55:20.000
##.ACQUISITIONMODE=	SIMULTANEOUS (DQD)
##$ORIGINAL FORMAT=	Bruker XWIN-NMR
##$MNOVA/SCALES_VERSION=	9
##$PARAMETER FILE=	(acqus, ASCII, /private/var/folders/f6/rjf_tdyn2v98c5c0wvkgn4s80000gq/T/wWQrXOeXTACniA+mWqiCew/11/acqus, 0)
$$ ##TITLE= Parameter file, TopSpin 4.1.3
$$ ##JCAMPDX= 5.0
$$ ##DATATYPE= Parameter Values
$$ ##NPOINTS= 1	$$ modification sequence number
$$ ##ORIGIN= Bruker BioSpin GmbH
$$ ##OWNER= root
$$ $$ 2022-12-01 16:55:21.717 +0000  root@CZC036BXXF
$$ $$ Z:/500/data/tds/nmr/RP278 Ph3B3O3 + NH2Py/11/acqus
$$ $$ process C:\Bruker\TopSpin4.1.3\prog\mod\dirdata.exe
$$ ##$ACQT0= -9.23096511331805
$$ ##$AMP= (0..31)
$$ 100 100 100 100 100 100 100 100 100 100 100 100 100 100 100 100 100 100
$$ 100 100 100 100 100 100 100 100 100 100 100 100 100 100
$$ ##$AMPCOIL= (0..32)
$$ -1 0 0 0 0 0 0 0 0 0 0 0 0 0 0 0 0 0 0 0 0 0 0 0 0 0 0 0 0 0 0 0 0
$$ ##$AQSEQ= 0
$$ ##$AQ_mod= 3
$$ ##$AUNM= <au_zg>
$$ ##$AUTOPOS= <26 >
$$ ##$BF1= 160.461579166
$$ ##$BF2= 160.461579166
$$ ##$BF3= 160.461579166
$$ ##$BF4= 160.461579166
$$ ##$BF5= 160.461579166
$$ ##$BF6= 160.461579166
$$ ##$BF7= 160.461579166
$$ ##$BF8= 160.461579166
$$ ##$BWFAC= (0..63)
$$ 0 0 0 0 0 0 0 0 0 0 0 0 0 0 0 0 0 0 0 0 0 0 0 0 0 0 0 0 0 0 0 0 0 0 0 0
$$ 0 0 0 0 0 0 0 0 0 0 0 0 0 0 0 0 0 0 0 0 0 0 0 0 0 0 0 0
$$ ##$BYTORDA= 0
$$ ##$CHANFCU= (0..24)
$$ 0 0 1 0 0 0 0 0 0 0 0 0 0 0 0 0 0 0 0 0 0 0 0 0 0
$$ ##$CHANREC= (0..24)
$$ 0 0 1 0 0 0 0 0 0 0 0 0 0 0 0 0 0 0 0 0 0 0 0 0 0
$$ ##$CHEMSTR= <none>
$$ ##$CNST= (0..63)
$$ 1 1 1 1 1 1 1 1 1 1 1 1 1 1 1 1 1 1 1 1 1 1 1 1 1 1 1 1 1 1 1 1 1 1 1 1
$$ 1 1 1 1 1 1 1 1 1 1 1 1 1 1 1 1 1 1 1 1 1 1 1 1 1 1 1 1
$$ ##$CPDPRG= (0..8)
$$ <> <> <> <> <> <> <> <> <>
$$ ##$D= (0..63)
$$ [...]
$$ 1 1 1 1 0 0 0 0 0 0 0 0 0 0 0 0 0 0 0 0 0 0 0 0 0 0 0 0
$$ ##$ShimPowRng3= (0..63)
$$ 1 1 1 1 1 1 1 1 1 1 1 1 1 1 1 1 1 1 1 1 1 1 1 1 1 1 1 1 1 1 1 1 1 1 1 1
$$ 1 1 1 1 0 0 0 0 0 0 0 0 0 0 0 0 0 0 0 0 0 0 0 0 0 0 0 0
$$ ##$ShimPowType1= 8
$$ ##$ShimPowType2= 8
$$ ##$ShimPowType3= 0
$$ ##$ShimPowType4= 0
$$ ##$ShimPowType5= 0
$$ ##$ShimPowType6= 0
$$ ##$ShimPowType7= 0
$$ ##$ShimPowType8= 0
$$ ##$ShimSysActGrad= (0..63)
$$ 1 2 3 4 13 5 7 11 10 9 6 8 12 18 19 20 21 15 22 23 24 14 25 16 26 17 27
$$ 28 31 32 33 34 35 36 37 38 0 0 0 0 0 0 0 0 0 0 0 0 0 0 0 0 0 0 0 0 0 0
$$ 0 0 0 0 0 0
$$ ##$ShimSysAngle= <>
$$ ##$ShimSysFunc= (0..63)
$$ 1 2 3 4 5 6 7 8 9 10 0 37 38 35 16 15 14 13 12 11 28 27 26 25 24 23 36
$$ 22 30 29 20 21 34 33 32 31 17 18 19 0 0 0 0 0 0 0 0 0 0 0 0 0 0 0 0 0 0
$$ 0 0 0 0 0 0 0
$$ ##$ShimSysMatId= <292722ba.dat>
$$ ##$ShimSysMatrix= 1
$$ ##$ShimSysMinMaxUG= 130000
$$ ##$ShimSysOffset= <58 mm>
$$ ##$ShimSysType= 4
$$ ##$ShimUnit= 3
$$ ##$SpectrOsVersion= <4.1.156.20210628>
$$ ##$TCubeEth= <192.168.180.18>
$$ ##$TCubeSeqDevice= <>
$$ ##$TOSITY= <no>
$$ ##$TRIPLO2= 0
$$ ##$TopSpinVersion= <TopSpin 4.1.3>
$$ ##$TrxFreqFormula= (0..23)
$$ <TrxFreqFormula(2.0,500130000.000000,'TRX',Trx(1.0,'TRX 1200.1',2,5.000000,1290.000000))>
$$ <TrxFreqFormula(2.0,500130000.000000,'TRX',Trx(1.0,'TRX 1200.2',2,5.000000,1290.000000))>
$$ <> <> <> <> <> <> <> <> <> <> <> <> <> <> <> <> <> <> <> <> <> <>
$$ ##$TrxPN= (0..23)
$$ <Z148391> <Z148391> <> <> <> <> <> <> <> <> <> <> <> <> <> <> <> <> <>
$$ <> <> <> <> <>
$$ ##$TrxSN= (0..23)
$$ <05365> <05364> <> <> <> <> <> <> <> <> <> <> <> <> <> <> <> <> <> <> <>
$$ <> <> <>
$$ ##$VCubeEth= (0..23)
$$ <no> <no> <no> <no> <no> <no> <no> <no> <no> <no> <no> <no> <no> <no> <no>
$$ <no> <no> <no> <no> <no> <no> <no> <no> <no>
$$ ##$VTU= 2
$$ ##$VTUETH= <192.168.99.10>
$$ ##$VTUTY= <no>
$$ ##$ValueLine= no
$$ ##$VpuPN= (0..23)
$$ <no> <no> <no> <no> <no> <no> <no> <no> <no> <no> <no> <no> <no> <no> <no>
$$ <no> <no> <no> <no> <no> <no> <no> <no> <no>
$$ ##$VpuSN= (0..23)
$$ <no> <no> <no> <no> <no> <no> <no> <no> <no> <no> <no> <no> <no> <no> <no>
$$ <no> <no> <no> <no> <no> <no> <no> <no> <no>
$$ ##$WBREFAM= (0..31)
$$ 99.9 100 100 100 100 100 100 100 100 100 100 100 100 100 100 100 100 100
$$ 100 100 100 100 100 100 100 100 100 100 100 100 100 100
$$ ##$WBREFLM= (0..31)
$$ 2 0 0 0 0 0 0 0 0 0 0 0 0 0 0 0 0 0 0 0 0 0 0 0 0 0 0 0 0 0 0 0
$$ ##$WBREFPH= (0..31)
$$ 0.91 0 0 0 0 0 0 0 0 0 0 0 0 0 0 0 0 0 0 0 0 0 0 0 0 0 0 0 0 0 0 0
$$ ##$WBSGU= (0..31)
$$ 1 1 2 0 0 0 0 0 0 0 0 0 0 0 0 0 0 0 0 0 0 0 0 0 0 0 0 0 0 0 0 0
$$ ##END=
$$ 
##$DECIM=	304
##$DSPFVS=	20
##XUNITS=	HZ
##YUNITS=	ARBITRARY UNITS
##FIRSTX=	32894.736052135405771
##LASTX=	-32894.235698224358202
##DELTAX=	-0.50193385074013141534
##XFACTOR=	1
##YFACTOR=	9.5505615405743586876
##FIRSTY=	-40.15234375
##MINY=	-14739.1923828125
##MAXY=	312943.25
##NPOINTS=	131072
##XYDATA=	(X++(Y..Y))
$$ [...]
8076C162j28noq0J20J03r7P8P8LKj0j0K7j74p4J27J50J50nnj3j3J2j89j67L4RRK7K8K8K7j17
$$ 3162 3034 3029 3023 2943 3063 3166 3069 3147 3225 3228 3230 3220 3210 3237 3063 2989 3116 3266 3416 3411 3406 3393 3380 3392 3203 3036 3070 3079 3088 3115 3143 3171 3198 3081
8059C081j18N0M9M0M1p3p3K6j76j25P6J27J27J8j82n3n3o5o6M6M5M5M6M6M5M6M6J81J82J4
$$ 3081 2963 3013 3062 3102 3143 3070 2997 3023 2847 2722 2798 2925 3052 3070 2888 2835 2782 2717 2651 2697 2742 2787 2833 2879 2924 2970 3016 3197 3379 3393
8043C393J5j06j06r4r3n6J45J58m3k43m1O8O7Q7Q6j4j4K9K9j39j39R2R2J04r7n6n5L8L8J31
$$ 3393 3408 3302 3196 3102 3009 2953 3098 3256 3213 2970 2929 2997 3064 3151 3237 3223 3209 3238 3267 3128 2989 3081 3173 3277 3180 3124 3069 3107 3145 3276
8028C276K31R0p6J04o3k60j59q5Q2J76n7j27j26R9J00n7M3J81J4n9n9j24M4J94K7k26j26L4
$$ 3276 3507 3597 3521 3625 3562 3302 3143 3058 3140 3316 3259 3132 3006 3105 3205 3148 3191 3372 3386 3327 3268 3144 3188 3382 3409 3183 3057 3091
8014C091L5mlp9K0K26N9p5p5q5q5%%J%nnKJm7N3J98L1n2M8k9k9Q1q7j05nm3j43j4J55K1q0
$$ 3091 3126 3122 3119 3040 3060 3286 3345 3270 3195 3110 3025 3025 3025 3026 3026 3021 3016 3018 3019 2972 3025 3223 3254 3202 3250 3221 3192 3273 3186 3081 3076 3033 2890 2876 3031 3052 2972
7996B972Q9Q8q2q1J9J9L5L5j33l2P6r1p3J62Q0P9K0j46n6n6J02J01kjl5j35J9J85k5k6J86
$$ 2972 3061 3149 3067 2986 3005 3024 3059 3094 2961 2929 3005 2914 2841 3003 3083 3162 3182 3036 2980 2924 3026 3127 3125 3124 3089 2954 2973 3158 3133 3107 3293
7980C293J8j78p8O5O4l0l0m6m7m6m7j0j0j15N2R7p0L5L5j2j1L8L9o9o9R9R8R4R5p3p3k1k1
$$ 3293 3311 3133 3055 3120 3184 3154 3124 3078 3031 2985 2938 2928 2918 2803 2855 2952 2882 2917 2952 2940 2929 2967 3006 2937 2868 2967 3065 3159 3254 3181 3108 3087 3066
7964C066k0k1j6j5Q5Q5o4o4o3o4nmnnP7P7P7P6mnl0J71K2j78m0m1r0J11J11r0K5K5J2J2j13
$$ 3066 3046 3025 3009 2994 3079 3164 3100 3036 2973 2909 2904 2900 2895 2890 2967 3044 3121 3197 3193 3188 3158 3329 3351 3173 3133 3092 3002 3113 3224 3134 3159 3184 3196 3208 3095
7946C095j13J08J08K45M3p7p8j67j66JJJ28J29n2n1P5j25j25P5J36J36j8j9j26j26p2J29J6
$$ 3095 2982 3090 3198 3443 3486 3409 3331 3164 2998 2999 3000 3128 3257 3205 3154 3229 3104 2979 3054 3190 3326 3308 3289 3163 3037 2965 3094 3110
7932C110J6p1p2k7k6P4P4R3R2p4p5m9n0m9m9J41J41r3r4n9o0K21K0n1n2o3o4K1K0L3L3j74
$$ 3110 3126 3055 2983 2956 2930 3004 3078 3171 3263 3189 3114 3065 3015 2966 2917 3058 3199 3106 3012 2953 2893 3114 3134 3083 3031 2968 2904 2925 2945 2978 3011 2837
7916B837K7Q2Q1N2N2p4J28J39o1j44J90K25j11k02k02o2o2J06J05j22j23M5M5J28J29Pj94
$$ 2837 2864 2946 3027 3079 3131 3057 3185 3324 3263 3119 3309 3534 3423 3221 3019 2957 2895 3001 3106 2984 2861 2906 2951 3079 3208 3215 3021
7902C021J02J03p8p8KKJKL3L2L3L3PQPQn8n9n8n8R3R2p5p5J35J34j68j67J5J5J5J5j05j05
$$ 3021 3123 3226 3148 3070 3072 3074 3075 3077 3110 3142 3175 3208 3215 3223 3230 3238 3180 3121 3063 3005 3098 3190 3115 3040 3175 3309 3141 2974 2989 3004 3019 3034 2929 2824
7885B824n0J50J82J82j53M8J83J83l9l8r1r1k04lN3N4l5l4M7M7j20j20N3N3j14j14J65J64
$$ 2824 2774 2924 3106 3288 3135 3183 3366 3549 3510 3472 3381 3290 3086 3083 3136 3190 3155 3121 3168 3215 3095 2975 3028 3081 2967 2853 3018 3182
7871C182j37j37N2N1N2N2L7L7o4o3QQK34L3j60M2P1P0Qj93r3J08L3L3j22j22J07J07o1o0k1
$$ 3182 3045 2908 2960 3011 3063 3115 3152 3189 3125 3062 3070 3078 3312 3345 3185 3227 3298 3368 3376 3183 3090 3198 3231 3264 3142 3020 3127 3234 3173 3113 3092
7856C092k1R2j08L1L2o9o9j17Q4K51N0j00j00j3j2J7J6q3q4J75J75P5P5llj5j5l2k32KK03
$$ 3092 3071 3163 3055 3086 3118 3049 2980 2863 2947 3198 3248 3148 3048 3035 3023 3040 3056 2973 2889 3064 3239 3314 3389 3386 3383 3368 3353 3321 3089 3091 3294
7840C294MMMMP6j24j1j2l6l6P6j24M9M9L6L6j39j40q5J16P7P7j99j99Q3K85P0P1j03j03j02
$$ 3294 3298 3302 3306 3310 3386 3262 3251 3239 3203 3167 3243 3119 3168 3217 3253 3289 3150 3010 2925 3041 3118 3195 2996 2797 2880 3165 3235 3306 3203 3100 2998
7825B998j03J10J11n7n7M1M2K8K9j1k13r9r9M7M6o7J35M6M6N9N9k5k4j3j2k9J72K6l10j23
$$ 2998 2895 3005 3116 3059 3002 3043 3085 3113 3142 3131 2918 2819 2720 2767 2813 2746 2881 2927 2973 3032 3091 3066 3042 3029 3017 2988 3160 3186 2876 2753
7810B753P8J11J11Q0Q0Q0Q0j21j21k1k1J5J5j0J91J11r0o4o5n4n4JK01K3K2K3K3J11r0j03
$$ 2753 2831 2942 3053 3133 3213 3293 3373 3252 3131 3110 3089 3104 3119 3109 3300 3411 3321 3257 3192 3138 3084 3085 3286 3309 3331 3354 3377 3488 3398 3295
7795C295R8J39o2l8l7j06j06oJ96J95j40j52M9j2j1j54j55q8J13J13q8r4r4opJ41J41M0M0
$$ 3295 3393 3532 3470 3432 3395 3289 3183 3177 3373 3568 3428 3276 3325 3313 3302 3148 2993 2905 3018 3131 3043 2949 2855 2849 2842 2983 3124 3164 3204
7780C204ooj8j8J36o4M8M9l3l3l3l3K3K4p5j76j08R3J30L0m5m4n1n1J31J31j03j03L3L2j32
$$ 3204 3198 3192 3174 3156 3292 3228 3276 3325 3292 3259 3226 3193 3216 3240 3165 2989 2881 2974 3104 3134 3089 3045 2994 2943 3074 3205 3102 2999 3032 3064 2932
7764B932k33r7J03P9P9J3q6m9J52K44J43k2k1j37j37j6J85J12J12m9m9J9q0j37O4P6P6M7j53
$$ 2932 2699 2602 2705 2784 2863 2876 2790 2741 2893 3137 3280 3258 3237 3100 2963 2947 3132 3244 3356 3307 3258 3277 3197 3060 3124 3200 3276 3323 3170
7750C170k03jJ61J62J11q9j33l3qqqqm3j44j00J01N3N3O6O5P6P6j58j58J14J15j86j87K7K7
$$ 3170 2967 2966 3127 3289 3400 3311 3178 3145 3137 3129 3121 3113 3070 2926 2826 2927 2980 3033 3099 3164 3240 3316 3158 3000 3114 3229 3043 2856 2883 2910
7735B910K7K7J0J1J0J1j7j7j42N9L25J25m1O0j41j42l6O4J37o4n7J44N3N4O6O6k1k2k2k2M
$$ 2910 2937 2964 2974 2985 2995 3006 2989 2972 2830 2889 3214 3339 3298 3358 3217 3075 3039 3103 3240 3176 3119 3263 3316 3370 3436 3502 3481 3459 3437 3415 3419
7719C419Lr7r7o9o9Q5Q6L5j66N2J53m4j45k01%Kr9J50J51o2J39k9k29k9k9n3J47J26J26k8
$$ 3419 3422 3325 3228 3159 3090 3175 3261 3296 3130 3182 3335 3291 3146 2945 2945 2947 2848 2998 3149 3087 3226 3197 2968 2939 2910 2857 3004 3130 3256 3228
7704C228k9j20j21M7M6o9p0R7R8R7R8j2k12j52M8J36o5RRQ3Q4L7j65n1n1L6L7q9J11K59N8
$$ 3228 3199 3079 2958 3005 3051 2982 2912 3009 3107 3204 3302 3290 3078 2926 2974 3110 3045 3054 3063 3146 3230 3267 3102 3051 3000 3036 3073 2984 3095 3354 3412
7689C412J6J6K9K9p2p2l2l2l2l2m0m0Q5j16j91RN2N1K2K2K2K2j7j8K64O2j22j22L3L3l5l5
$$ 3412 3428 3444 3473 3502 3430 3358 3326 3294 3262 3230 3190 3150 3235 3119 2928 2937 2989 3040 3062 3084 3106 3128 3111 3093 3357 3419 3297 3175 3208 3241 3206 3171
7673C171l5l5LLKLJ43J43r1r1m7m8N4N3L9M0o1o1N4N4N5N4RRr2r2NNK30L0k16j5j6k16j55
$$ 3171 3136 3101 3104 3107 3109 3112 3255 3398 3307 3216 3169 3121 3175 3228 3267 3307 3246 3185 3239 3293 3348 3402 3411 3420 3328 3236 3241 3246 3476 3506 3290 3275 3259 3043 2888
7655B888M5Q8Q7R0R1j0j0j31j32K29K8k13j1K10J0K4K4J1J2r3r2J4J4m6N4J17q4j08pJ8J8
$$ 2888 2933 3021 3108 3198 3289 3279 3269 3138 3006 3235 3263 3050 3039 3249 3259 3283 3307 3318 3330 3237 3145 3159 3173 3127 3181 3298 3214 3106 3099 3117 3135
7639C135Nr5j58M3J52N2m3N8K06J06j30k31j15Q6J24K4Q6Q6j55j54N4N4N4N4PQk3j24j67L3
$$ 3135 3140 3045 2887 2930 3082 3134 3091 3149 3355 3461 3331 3100 2985 3071 3195 3219 3305 3391 3236 3082 3136 3190 3244 3298 3305 3313 3290 3166 2999 3032
7624C032O9O9J49n2k20j9J18J17l7l7m8m8J20J19M4M4N0N0k28j28J08r2j22P9m7m7J6J6J42
$$ 3032 3101 3170 3319 3267 3047 3028 3146 3263 3226 3189 3141 3093 3213 3332 3376 3420 3470 3520 3292 3164 3272 3180 3058 3137 3090 3043 3059 3075 3217
7610C217n9j91RJ15J4K4J25P4j26j02j03j4j5J7J7J6J7J40J40r5r5k7k8R8j03j00J00J32L2
$$ 3217 3158 2967 2976 3091 3105 3129 3254 3328 3202 3100 2997 2983 2968 2985 3002 3018 3035 3175 3315 3220 3125 3098 3070 3168 3065 2965 3065 3197 3229
7595C229L3L4K7K7O5O5j02j03j09j08N8N9Q8Q8j3j2p3p4p3p3j6j6K18K18NNj50j50j01R9J13
$$ 3229 3262 3296 3323 3350 3415 3480 3378 3275 3166 3058 3116 3175 3263 3351 3338 3326 3253 3179 3106 3033 3017 3001 3219 3437 3442 3447 3297 3147 3046 3145 3258
7580C258q9k1J79N4N3r7r8MLl9l9k6k7j35O5J74J74J09r1q0p9M6M6j88J2K82n2p8J24K2j79
$$ 3258 3169 3148 3327 3381 3434 3337 3239 3243 3246 3207 3168 3142 3115 2980 3045 3219 3393 3502 3411 3331 3252 3298 3344 3156 3168 3450 3398 3320 3444 3466 3287
7564C287j66L5o6o5J14J14j9k0j9k0k4k4P7P7k4k3k3k3M1M2M2M1llmlJ08J07j94j93K8K9K8
$$ 3287 3121 3156 3090 3025 3139 3253 3234 3214 3195 3175 3151 3127 3204 3281 3257 3234 3211 3188 3229 3271 3313 3354 3351 3348 3344 3341 3449 3556 3362 3169 3197 3226 3254
7548C254K8k6k6k5k6K2K2j33j32q9J12K25K4j49N2K7K7P1P0P1P1q1q1J9K0M5M4n6n6j21j21
$$ 3254 3282 3256 3230 3205 3179 3201 3223 3090 2958 2869 2981 3206 3230 3081 3133 3160 3187 3258 3328 3399 3470 3389 3308 3327 3347 3392 3436 3380 3324 3203 3082
7532C082j00j01qL27L26qj81j81L3L2%jjjL5L5J36J35j21j22k1k2J88J87j14j14q2q3J31p0
$$ 3082 2982 2881 2873 3200 3526 3518 3337 3156 3189 3221 3221 3220 3219 3218 3253 3288 3424 3559 3438 3316 3295 3273 3461 3648 3534 3420 3338 3255 3386 3316
7517C316j1j0r2QJ21q0n4n5lR8O6j35j47N4R5R6M0M0M0M0n2n2n2n2m4m5N6N6j16j16rrM8J49
$$ 3316 3305 3295 3203 3211 3332 3252 3198 3143 3140 3238 3304 3169 3022 3076 3171 3267 3307 3347 3387 3427 3375 3323 3271 3219 3175 3130 3186 3242 3126 3010 3001 2992 3040 3189
7500C189K05Mj02j03j4j5L4L3K6K7N2m8j8J84l6k38o8L2N6N5O2O1r4r4r4r4m0m0J40J40%K01
$$ 3189 3394 3398 3296 3193 3179 3164 3198 3231 3257 3284 3336 3288 3270 3454 3418 3180 3112 3144 3200 3255 3317 3378 3284 3190 3096 3002 2962 2922 3062 3202 3202 3403
7484C403J21k14j15Q6J19J19o3o4o3o4j26j26L9J40J03r7p8p9L9L9L9L8Q3Q3Q2Q3j28j29M1
$$ 3403 3524 3310 3195 3281 3400 3519 3456 3392 3329 3265 3139 3013 3052 3192 3295 3198 3120 3041 3080 3119 3158 3196 3279 3362 3444 3527 3399 3270 3311
7469C311o0j23P8K39L8p9p9RRL7L8o3o3j19j19M8M8L3L3L2L3q8q9J46J46n3n4n3n4J37J37
$$ 3311 3251 3128 3206 3445 3483 3404 3325 3334 3343 3380 3418 3355 3292 3173 3054 3102 3150 3183 3216 3248 3281 3193 3104 3250 3396 3343 3289 3236 3182 3319 3456
7454C456l0l0M3M4Kj99j78K3o1J40L09J07j14j13k25J10J47n3j22Q0m7m6mnmmp5p5R3R2k0
$$ 3456 3426 3396 3439 3483 3485 3286 3108 3131 3070 3210 3519 3626 3512 3399 3174 3284 3431 3378 3256 3336 3289 3243 3239 3234 3230 3226 3151 3076 3169 3261 3241
7438C241k0k1k0k0k0Q0Q0m5m5J22J22n9o0n9n9L9L9p4J27ppONj36j37R8R8M9M9nk06j6j5j83
$$ 3241 3221 3200 3180 3160 3140 3220 3300 3255 3210 3332 3454 3395 3335 3276 3217 3256 3295 3221 3348 3341 3334 3340 3345 3209 3072 3170 3268 3317 3366 3361 3155 3139 3124 2941
7421B941j83M4K45K45M4p3p3J5J5L8L8L8L8n5n4M7M6K1K1J34o6r0r0j15Q7Q1Q2ool5l5j15
$$ 2941 2758 2802 3047 3292 3336 3263 3190 3205 3220 3258 3296 3334 3372 3317 3263 3310 3356 3377 3398 3532 3466 3376 3286 3171 3258 3339 3421 3415 3409 3374 3339 3224
7405C224j15q4K50J62j72r7J04Q3j18k2k2l4l4n3n3J14J14m3m4m3m4K0J9J9K0L0K9p0p1J16
$$ 3224 3109 3025 3275 3437 3265 3168 3272 3355 3237 3215 3193 3159 3125 3072 3019 3133 3247 3204 3160 3117 3073 3093 3112 3131 3151 3181 3210 3140 3069 3185
7390C185J15n1n2j7j8k31k9J18J19L1L1l6l5j48N3j8j9onJ51J51j6j6M7M7M7M6k03k03j49
$$ 3185 3300 3249 3197 3180 3162 2931 2902 3020 3139 3170 3201 3165 3130 2982 3035 3017 2998 2992 2987 3138 3289 3273 3257 3304 3351 3398 3444 3241 3038 2889
7375B889N2L5L5M8M8K20K20L2j68j38j37Q4Q4K4K4j44j43L4L4L5L4J40J39k29k29j9k0ppJ7
$$ 2889 2941 2976 3011 3059 3107 3327 3547 3579 3411 3273 3136 3220 3304 3328 3352 3208 3065 3099 3133 3168 3202 3342 3481 3252 3023 3004 2984 2977 2970 2987
7360B987K18o3o3l7l8l7l8PPJ75J74m1m1O0N9L3L2o7o8M5M6n6n5N9O0m2m1J07J07PPj1j1j2
$$ 2987 3205 3142 3079 3042 3004 2967 2929 2936 2943 3118 3292 3251 3210 3270 3329 3362 3394 3327 3259 3304 3350 3294 3239 3298 3358 3316 3275 3382 3489 3496 3503 3492 3481 3469
7343C469j1l6l6l7l6k1k2j21j22R8R8p0o9P5P5k5k5L5L6L5L6j36j35j3J87J26J27r6r5J9J8
$$ 3469 3458 3422 3386 3349 3313 3292 3270 3149 3027 3125 3223 3153 3084 3159 3234 3209 3184 3219 3255 3290 3326 3190 3055 3042 3229 3355 3482 3386 3291 3310 3328
7327C328L2j70kkj28P3L3L3M5M5p4p4p4p3L0L0J31J30o2o2J06J05K8K7K8K8J9J9q1q2q9r0
$$ 3328 3360 3190 3188 3186 3058 3131 3164 3197 3242 3287 3213 3139 3065 2992 3022 3052 3183 3313 3251 3189 3295 3400 3428 3455 3483 3511 3530 3549 3468 3386 3297 3207
7311C207p7p7J3K14J01J00k6k6k6k7p6p7l4J66J71l0p2p2J3J4J4J4n6n5M4M5K0K0K0J9j24
$$ 3207 3130 3053 3066 3280 3381 3481 3455 3429 3403 3376 3300 3223 3189 3355 3526 3496 3424 3352 3365 3379 3393 3407 3351 3296 3340 3385 3405 3425 3445 3464 3340
7296C340j25k5k4J05J05J06J05j36j36L1L1Q7Q8j9j9j42k42lJ97J8q3j4j4L2L2L1L2OPOPQ9
$$ 3340 3215 3190 3166 3271 3376 3482 3587 3451 3315 3346 3377 3464 3552 3533 3514 3372 3130 3127 3324 3342 3259 3245 3231 3263 3295 3326 3358 3364 3371 3377 3384 3473
7280C473Q9J33L2j72l73j43m3M0K42R2j08n8J43P4k6j05j05J23J23L9L9k9P0J15q5k3P7n7
$$ 3473 3562 3695 3727 3555 3182 3039 2996 3036 3278 3370 3262 3204 3347 3421 3395 3290 3185 3308 3431 3470 3509 3480 3550 3665 3580 3557 3634 3577
7265C577n6J9q2j23P8Q4j17r1J09R7j05j6j7j48N3R0j0n2j53m4m4o9J31J00%O9O9O4O5O5O4
$$ 3577 3521 3540 3458 3335 3413 3497 3380 3289 3398 3495 3390 3374 3357 3209 3262 3352 3342 3290 3137 3093 3049 2980 3111 3211 3211 3280 3349 3413 3478 3543 3607
7250C607k5k5k5k5j87j86J16J15kkkkq3q3R1R0j10j0J54m8j49m9L9o1J6J6j5J86O0j41j40
$$ 3607 3582 3557 3532 3507 3320 3134 3250 3365 3363 3361 3359 3357 3274 3191 3282 3372 3262 3252 3406 3358 3209 3160 3199 3138 3154 3170 3155 3341 3401 3260 3120
7234C120O0J88j4j00J00n7n7J81j9j83J9l9j38R0K91nk05q7J13M3n6N3N4M7M7k2k2k2k2O8
$$ 3120 3180 3368 3354 3254 3354 3297 3240 3421 3402 3219 3238 3199 3061 3151 3442 3437 3232 3145 3258 3301 3245 3298 3352 3399 3446 3424 3402 3380 3358 3426
7219C426O7K6j75p4J26K14J4j8j8l7l7p5j75lJ97J08Ok4k5L0L0k05k04O6O7N4N3J07r5j07
$$ 3426 3493 3519 3344 3270 3396 3610 3624 3606 3588 3551 3514 3439 3264 3261 3458 3566 3572 3548 3523 3553 3583 3378 3174 3240 3307 3361 3414 3521 3426 3319
7204C319R3N1j51j50N1J59m2p9K1K3p7j4j4J09J09n9n8O8O8O2O1J2q9j46N6m2m2R0j11L7J38
$$ 3319 3412 3463 3312 3162 3213 3372 3330 3251 3272 3295 3218 3204 3190 3299 3408 3349 3291 3359 3427 3489 3550 3562 3473 3327 3383 3341 3299 3389 3278 3315 3453
7189C453l1l2j30j30J63l8j03R8P3P3N7N8N7N7o8o9L9L8j36l6K0j80p4p3Q1Q1k4k5k4k5J24
$$ 3453 3422 3390 3260 3130 3293 3255 3152 3250 3323 3396 3453 3511 3568 3625 3557 3488 3527 3565 3429 3393 3413 3233 3159 3086 3167 3248 3224 3199 3175 3150 3274
7173C274J25K3K4k9k8P2P2j10j10N8N7j7j7j7j6n5n4n5n5j5j6J51J51n1n2n1n2%%O9l2j26
$$ 3274 3399 3422 3446 3417 3389 3461 3533 3423 3313 3371 3428 3411 3394 3377 3361 3306 3252 3197 3142 3127 3111 3262 3413 3362 3310 3259 3207 3207 3207 3276 3244 3118
7157C118P5O9j32k2k2l4l5P5P4Q1Q1kR8J55m6j31j32k3J78J02J01n3n3j64j64MLK1K1K2K1
$$ 3118 3193 3262 3130 3108 3086 3052 3017 3092 3166 3247 3328 3326 3424 3579 3533 3402 3270 3247 3425 3527 3628 3575 3522 3358 3194 3198 3201 3222 3243 3265 3286
7142C286l3l4L6o4k4J77J77k4q6J4n5n5R5R6nnj6j5Q5Q5O2O1j06j06ononononr4r3PPR5R6
$$ 3286 3253 3219 3255 3191 3167 3344 3521 3497 3411 3425 3370 3315 3410 3506 3501 3496 3480 3465 3550 3635 3697 3758 3652 3546 3540 3535 3529 3524 3518 3513 3507 3502 3408 3315 3322 3329 3424 3520
7122C520J21q0j76K4%jq3q3J7J7q5q5Q2Q2KJKKL5L5pk07j31P1o7o8L49J48L5K36J8j84M3M2
$$ 3520 3641 3561 3385 3409 3409 3408 3325 3242 3259 3276 3191 3106 3188 3270 3272 3273 3275 3277 3312 3347 3340 3133 3002 3073 3006 2938 3287 3435 3470 3706 3724 3540 3583 3625
7105C625J7J8r2k92j39O3L7L7M3M4M3M4j09j08j34O8J42n8l3l3K7K7K7K7j11j11J23J23p2
$$ 3625 3642 3660 3568 3276 3137 3200 3237 3274 3317 3361 3404 3448 3339 3231 3097 3165 3307 3249 3216 3183 3210 3237 3264 3291 3180 3069 3192 3315 3243
7091C243p1p2p1p0o9K31K32J20J20m8k48j48J87R9j02R7R7P2P3R0j09LLj95j96M0L9r9r9m5
$$ 3243 3172 3100 3029 2959 2890 3121 3353 3473 3593 3545 3297 3149 3336 3435 3333 3430 3527 3599 3672 3762 3653 3656 3659 3464 3268 3308 3347 3248 3149 3104
7076C104J57M4M4N6N7L1L2o9o9l5l4l5l4J66J67J24p6j36O5nj04m5m5O8l3j09R1n9j60K7K27
$$ 3104 3261 3305 3349 3405 3462 3493 3525 3456 3387 3352 3318 3283 3249 3415 3582 3706 3630 3494 3559 3554 3450 3405 3360 3428 3395 3286 3377 3318 3158 3185 3412
7060C412O1j41J8J18N5m4r7r6O3J63R0j12r2r3klK9J29P4j27K3J24J11r1j41O0M9n2q3q3n5
$$ 3412 3473 3332 3350 3468 3523 3479 3382 3286 3349 3512 3602 3490 3398 3305 3303 3300 3329 3458 3532 3405 3428 3552 3663 3572 3431 3491 3540 3488 3405 3322 3267
7045C267n5o8J33O6O6J91j0p0p1j83j84J35J35l3l3LLKLJ3J3J14J13j37j38k9J72L2j69j69
$$ 3267 3212 3144 3277 3343 3409 3600 3590 3520 3449 3266 3082 3217 3352 3319 3286 3289 3292 3294 3297 3310 3323 3437 3550 3413 3275 3246 3418 3450 3281 3112
7030C112L2J60m0p8J23L5L4n3n3m6m6J22J21P6P5r1r2Q4Q3r1k93r0J11K11J1k01%k4k5J2J2
$$ 3112 3144 3304 3264 3186 3309 3344 3378 3325 3272 3226 3180 3302 3423 3499 3574 3483 3391 3475 3558 3467 3174 3084 3195 3406 3417 3216 3216 3192 3167 3179 3191
7014C191K5K4n9J42q2j82J27J27L3L2j5J86J35o6qrL0K9j45j44R0Q9N0N0j18j18j75j75J26
$$ 3191 3216 3240 3181 3323 3241 3059 3186 3313 3346 3378 3363 3549 3684 3618 3610 3601 3631 3660 3515 3371 3461 3550 3600 3650 3532 3414 3239 3064 3190
6999C190J26PPP0P0j62L9R5j06r1J0L5L5m0j41m2J58J45n5j06R5J70l2l1J69O0j41j23j22
$$ 3190 3316 3323 3330 3400 3470 3308 3347 3442 3336 3245 3255 3290 3325 3285 3144 3102 3260 3405 3350 3244 3339 3509 3477 3446 3615 3675 3534 3411 3289
6985C289J6q5K0K20J18J7pqO9J70J47j88k00%p1j71j9Q2k2k24k6J74n2n1J38J38Q7Q8j75j74
$$ 3289 3305 3220 3240 3460 3578 3595 3588 3580 3649 3819 3966 3778 3578 3578 3507 3336 3317 3399 3377 3153 3127 3301 3249 3198 3336 3474 3561 3649 3474 3300
6970C300ppR6R6mmN7N7j84j84J25K4q3J19J17J18L0L0j18j18N0M9MMk31k31O7O8j00j00Q7
$$ 3300 3293 3286 3382 3478 3474 3470 3527 3584 3400 3216 3341 3365 3282 3401 3518 3636 3666 3696 3578 3460 3510 3559 3563 3567 3336 3105 3172 3240 3140 3040 3127
6954C127Q6J37J37OOOOk6k6l2l2j6j16j7J83O8j33j21Q0l4l5k2k3J5J5J5J5M0M0o0o1o3o3
$$ 3127 3213 3350 3487 3493 3499 3505 3511 3485 3459 3427 3395 3379 3263 3246 3429 3497 3364 3243 3323 3289 3254 3232 3209 3224 3239 3254 3269 3309 3349 3289 3228 3165 3102
6938C102J04J04P3P3r5r4K2K1K2K1l0l1l1l1P4P4J87j4n0m9n0m9m6J56J51j83k22J12J92J92
$$ 3102 3206 3310 3383 3456 3361 3267 3289 3310 3332 3353 3323 3292 3261 3230 3304 3378 3565 3551 3501 3452 3402 3353 3307 3463 3614 3431 3209 3321 3513 3705
6923C705Nj95l3l2l4l3O7O6q4q4K17K17o6o5o5o6P8P8q9q9nmq0J21Nj95L1L0J7J7J05J05L8
$$ 3705 3710 3515 3482 3450 3416 3383 3450 3516 3432 3348 3565 3782 3716 3651 3586 3520 3598 3676 3587 3498 3493 3489 3409 3530 3535 3340 3371 3401 3418 3435 3540 3645 3683
6906C683j62l7l6j31P0N7N8PPj60j60J12J12J1j89k22J12J93rJ10J11j15Q5L7L8N0M9l8l8
$$ 3683 3521 3484 3448 3317 3387 3444 3502 3509 3516 3356 3196 3308 3420 3431 3242 3020 3132 3325 3316 3426 3537 3422 3507 3544 3582 3632 3681 3643 3605
6892C605l7l8P1P1m1m2J02j00j99JOPQ2j19p4p4l7l6L2L3j31P0J03J02J66J65k5k4k5k4l2
$$ 3605 3568 3530 3601 3672 3631 3589 3691 3591 3392 3393 3399 3406 3488 3369 3295 3221 3184 3148 3180 3213 3082 3152 3255 3357 3523 3688 3663 3639 3614 3590 3558
6876C558l2m4m5J53m8j02j02j3j2J55J55K2K3p8p8M0L9j1j1P5P5K5K5QQL4j68j11R0N3N3n3
$$ 3558 3526 3482 3437 3590 3542 3440 3338 3325 3313 3468 3623 3645 3668 3590 3512 3552 3591 3580 3569 3644 3719 3744 3769 3777 3785 3819 3651 3540 3630 3683 3736 3683
6860C683k54m1m0M7M7llK00J99K3j78k36l6J8J9k5J75P5j26l3l3m6m5K9L0L0K9J3J3J13J14
$$ 3683 3429 3388 3348 3395 3442 3439 3436 3636 3835 3858 3680 3444 3408 3426 3445 3420 3595 3670 3544 3511 3478 3432 3387 3416 3446 3476 3505 3518 3531 3644 3758
6844C758j63j63NMM6M7M6M7J2J3J3J3j60j59j27K09J10r1M4M3KLLKr8r7J24J24M6j55N8N9
$$ 3758 3595 3432 3437 3441 3487 3534 3580 3627 3639 3652 3665 3678 3518 3359 3232 3441 3551 3460 3504 3547 3549 3552 3555 3557 3459 3362 3486 3610 3656 3501 3559 3618
6828C618O7O7j68j67k3k4P7P7J75J75j26j26k3k3k3k3Q8Q8M6j55j57M5J9J9l0l1J36J37q7
$$ 3618 3685 3752 3584 3417 3394 3370 3447 3524 3699 3874 3748 3622 3599 3576 3553 3530 3618 3706 3752 3597 3440 3485 3504 3523 3493 3462 3598 3735 3648
6814C648q6J4J4o1o1L9L9P8P7j57j57J17J17n0n0JJo8L2N9j41p8K2P8P8m1J60l0k31P2J72
$$ 3648 3562 3576 3590 3529 3468 3507 3546 3624 3701 3544 3387 3504 3621 3571 3521 3522 3523 3455 3487 3546 3405 3327 3349 3427 3505 3464 3624 3594 3363 3435 3607
6798C607r0r1Q3Q4RJ0J0J0j08j07p7K4J96nj00J02m6m5J34J35J7J7p1p0j93RK47J46j0j11
$$ 3607 3517 3426 3509 3593 3602 3612 3622 3632 3524 3417 3340 3364 3560 3555 3455 3557 3511 3466 3600 3735 3752 3769 3698 3628 3435 3444 3691 3837 3827 3716
6783C716k87q6O9j31poj0j1j0j1J89J89K1K2q8q7q7q8J37J36l1l0qqO1l9j15Q6J21J21J1j91
$$ 3716 3429 3343 3412 3281 3274 3268 3258 3247 3237 3226 3415 3604 3625 3647 3559 3472 3385 3297 3434 3570 3539 3509 3501 3493 3554 3515 3400 3486 3607 3728 3739 3548
6767C548l3O7J1J1J7J7j29j29L2L2P5k5q7J13J49M8Or4L7L6L0L0j4j4j08j08PJ07n9k59j37
$$ 3548 3515 3582 3593 3604 3621 3638 3509 3380 3412 3444 3519 3494 3407 3520 3669 3717 3723 3629 3666 3702 3732 3762 3748 3734 3626 3518 3525 3632 3573 3314 3177
6752C177O3K26K26K2j78j79K3p4p4J73J73m2m1m1m1J3J3J4J3m7m7J87J88r3r3PQj0rj34O6
$$ 3177 3240 3466 3692 3714 3536 3357 3380 3306 3232 3405 3578 3536 3495 3454 3413 3426 3439 3453 3466 3419 3372 3559 3747 3654 3561 3568 3576 3566 3557 3423 3489
6736C489J66l4p6p6ononQ2Q3j8j8j41j40j41j40J44J44p7p8oJ94O9O9Q5j15j15Q5R6R5j27
$$ 3489 3655 3621 3545 3469 3463 3458 3452 3447 3529 3612 3594 3576 3435 3295 3154 3014 3158 3302 3225 3147 3141 3335 3404 3473 3558 3443 3328 3413 3509 3604 3477
6720C477j26j02j01J20J21J03r8r8J04Q4Q4lmn5n5J13J13J2J2J2J3l4l4l4l4r0r0K3K2OK06
$$ 3477 3351 3249 3148 3268 3389 3492 3394 3296 3400 3484 3568 3565 3561 3506 3451 3564 3677 3689 3701 3713 3726 3692 3658 3624 3590 3500 3410 3433 3455 3461 3667
6705C667R3R4j4j3j4j3n3n2j66L5O5O4P7P8m5m5m4m5q6q6q7q6N1N0N1N1K5K6J26J26j02j02
$$ 3667 3760 3854 3840 3827 3813 3800 3747 3695 3529 3564 3629 3693 3770 3848 3803 3758 3714 3669 3583 3497 3410 3324 3375 3425 3476 3527 3552 3578 3704 3830 3728 3626
6689C626J1J2j40O1O2j40PPj39O1K29j06noQ8Q7j3j3n5n6onm5m4j24j23j58J78K84n0k8P2
$$ 3626 3637 3649 3509 3570 3632 3492 3499 3506 3367 3428 3657 3551 3546 3540 3628 3715 3702 3689 3634 3578 3572 3567 3522 3478 3354 3231 3073 3251 3535 3485 3457 3529
6673C529P1j30j39O2R2R1Q9j11o1J39PPPOJ33o9k34j33k2J80K29K9j26k27k11J25J38L8J4
$$ 3529 3600 3470 3331 3393 3485 3576 3665 3554 3493 3632 3639 3646 3653 3659 3792 3723 3489 3356 3334 3514 3743 3772 3646 3419 3208 3333 3471 3509 3523
6658C523J5M5M5o2o2N1m9j12Q8J35L4o7L4J07r4j88J3J33J33k2k1M1M0n9o0n7n7j6J85J25
$$ 3523 3538 3583 3628 3566 3504 3555 3506 3394 3482 3617 3651 3584 3618 3725 3631 3443 3456 3589 3722 3700 3679 3720 3760 3701 3641 3584 3527 3511 3696 3821
6643C821p6o2j62m5m5lJ98Q3j6J59N8q9q9ONj07j06j01j00o3L7J00j01m6N4J52J53j40j39
$$ 3821 3745 3683 3521 3476 3431 3428 3626 3709 3693 3852 3910 3821 3732 3738 3743 3636 3530 3429 3329 3266 3303 3403 3302 3256 3310 3462 3615 3475 3336
6629C336K8K8l2l2J9J8J78J78j91j90J12J12J1J2N8N9m2m2o6o6j16j17J61J62poj3j2o3o3
$$ 3336 3364 3392 3360 3328 3347 3365 3543 3721 3530 3340 3452 3564 3575 3587 3645 3704 3662 3620 3554 3488 3372 3255 3416 3578 3571 3565 3552 3540 3477 3414
6613C414O0O0O0O0MLJ04J05l6l5J5J4J10J11j25j24j44j43J7J8Q3j7r5J07J11k24j98KJ96
$$ 3414 3474 3534 3594 3654 3658 3661 3765 3870 3834 3799 3814 3828 3938 4049 3924 3800 3656 3513 3530 3548 3631 3614 3519 3626 3737 3513 3315 3317 3513
6599C513nj04lR4R4%jJ09J08QQj29j29k9k9J14J13J3J3o9o9L1L2o7o8L2J32J36o5j59M3K0
$$ 3513 3508 3404 3401 3495 3589 3589 3588 3697 3805 3813 3821 3692 3563 3534 3505 3619 3732 3745 3758 3689 3620 3651 3683 3616 3548 3580 3712 3848 3783 3624 3667 3687
6583C687K0Q3Q3j31j30j56M5K56N4n4n4j49j49K0q1m4J56R3pJ21J20J4J4o5o4K3K3R9j01j65
$$ 3687 3707 3790 3873 3742 3612 3456 3501 3757 3811 3757 3703 3554 3405 3425 3344 3300 3456 3549 3542 3663 3783 3797 3811 3746 3682 3705 3728 3827 3726 3561
6568C561L7J67l4K9J29N8m3o9o8j25P6Q3j19l3O8l3j34l5J66lj05M4n7j20Q1R4R3OOp4p3m3
$$ 3561 3598 3765 3731 3760 3889 3947 3904 3835 3767 3642 3718 3801 3682 3649 3717 3684 3550 3515 3681 3678 3573 3617 3560 3440 3521 3615 3708 3714 3720 3646 3573 3530
6552C530N8j1k11j12R0O6l4J36J35N0N0n1n0p6p6j02J00Q5j16m0O0K4J24J24K4j35k36j3Q6
$$ 3530 3588 3577 3366 3254 3344 3410 3376 3512 3647 3697 3747 3696 3646 3570 3494 3392 3492 3577 3461 3421 3481 3505 3629 3753 3777 3642 3406 3393 3479
6537C479j3j14j3Q7M6n5m9N2R2R2R8R8j72j71nmP5P6P5P6n0n0n1n0m2m2N8N8k9l0l0k9Q5Q5
$$ 3479 3466 3352 3339 3426 3472 3417 3368 3420 3512 3604 3702 3800 3628 3457 3452 3448 3523 3599 3674 3750 3700 3650 3599 3549 3507 3465 3523 3581 3552 3522 3492 3463 3548 3633
6520C633j6j5j14j13J81J81j57k59q0J21J58J58MLMLLLj16j16jK00Rr2J45J45o0o0J08J07
$$ 3633 3617 3602 3488 3375 3556 3737 3580 3321 3241 3362 3520 3678 3682 3685 3689 3692 3695 3698 3582 3466 3465 3665 3674 3582 3727 3872 3812 3752 3860 3967
6505C967q5q4q5q4m9m9J24J25l9O0K4j78m4N7N0n0j46m5mR7O5l5p3p3J0J0J0J0q0q0P4P5J89
$$ 3967 3882 3798 3713 3629 3580 3531 3655 3780 3741 3801 3825 3647 3603 3660 3710 3660 3514 3469 3465 3562 3627 3592 3519 3446 3456 3466 3476 3486 3406 3326 3400 3475 3664
6488C664j2k59n8J47n3q3q3j1J90J77J78k6k5k6k5Q4Q5j6j6j85j86p2p2p5J26K26K6L1L2J9
$$ 3664 3652 3393 3335 3482 3429 3346 3263 3252 3442 3619 3797 3771 3746 3720 3695 3779 3864 3848 3832 3647 3461 3389 3317 3242 3368 3594 3620 3651 3683 3702
6473C702J9R3R3p5p5o8o9Q7Q6J2j90q8J12k9k8j5j6J07J08K07K08j48j48m7m7o0o1m7m7o5
$$ 3702 3721 3814 3907 3832 3757 3689 3620 3707 3793 3805 3615 3527 3639 3610 3582 3567 3551 3658 3766 3973 4181 4033 3885 3838 3791 3731 3670 3623 3576 3511
6458C511J37K4K3p0p0J64J64j61j60PPN0M9n1n1J6J6J6J6m3m2j69L3K67O6m3m2j33j34L5L4
$$ 3511 3648 3672 3695 3625 3555 3719 3883 3722 3562 3569 3576 3626 3675 3624 3573 3589 3605 3621 3637 3594 3552 3383 3416 3683 3749 3706 3664 3531 3397 3432 3466
6443C466K43K44n8n8j36j36j49N3J46J46k9k30J9J8POJ9J8J9J9k3k3P8P7j31j32L6L6k7k6
$$ 3466 3709 3953 3895 3837 3701 3565 3416 3469 3615 3761 3732 3502 3521 3539 3546 3552 3571 3589 3608 3627 3604 3581 3659 3736 3605 3473 3509 3545 3518 3492
6428C492k7k6M0M1M0M1j23j23J11J11J12J11j23j23k3k3k3k3l1l0K0K0KLJ70J70L8L8j96j97
$$ 3492 3465 3439 3479 3520 3560 3601 3478 3355 3466 3577 3689 3800 3677 3554 3531 3508 3485 3462 3431 3401 3421 3441 3443 3446 3616 3786 3824 3862 3666 3469
6413C469ooM4M3M3M3n8n7J84J85n0n0l7l6O4O4o2o2j2j1j18j17j30P1J71J72Q3j17k22J13
$$ 3469 3463 3457 3501 3544 3587 3630 3572 3515 3699 3884 3834 3784 3747 3711 3775 3839 3777 3715 3703 3692 3574 3457 3327 3398 3569 3741 3824 3707 3485 3598
6398C598J25p5p4p3Q8Q8L5J36R8j03O5J65j5j15q6q6n9J42K11j23l52j7J35L4J2J1L5L6N4
$$ 3598 3723 3648 3574 3501 3589 3677 3712 3848 3946 3843 3908 4073 4058 3943 3857 3771 3712 3854 4065 3942 3590 3573 3708 3742 3754 3765 3800 3836 3890
6383C890m6j25P5M0j61k03J32K21J22j2j1j18j19j35j36r4J07J60m0JK02J86j50r9Kl8O3%
$$ 3890 3844 3719 3794 3834 3673 3470 3602 3823 3945 3933 3922 3804 3685 3550 3414 3320 3427 3587 3547 3548 3750 3936 3786 3687 3689 3651 3714 3714
6369C714JJ58m3k31J04J64l6J85J86P1j30j83j84j70j69O5O5M0L9M0L9OOj49j48p2J29O6l5
$$ 3714 3715 3873 3830 3599 3703 3867 3831 4016 4202 4273 4143 3960 3776 3606 3437 3502 3567 3607 3646 3686 3725 3731 3737 3588 3440 3368 3497 3563 3528
6354C528J50N0j27P5K6j74j75K7J63l7Q8Q8m0m0k2j21M6K48J53m7k06nL7L7N4N3n3n3nj06
$$ 3528 3678 3728 3601 3676 3702 3528 3353 3380 3543 3506 3594 3682 3642 3602 3580 3459 3505 3753 3906 3859 3653 3648 3685 3722 3776 3829 3776 3723 3718 3612
6339C612o9J33N7m3nj06n5J46J40o1K7K7j52j53L4L4L5L4Q7Q6J20q0l14K0K28K7Q4j7k9P1
$$ 3612 3543 3676 3733 3690 3685 3579 3524 3670 3810 3749 3776 3803 3651 3498 3532 3566 3601 3635 3722 3808 3928 3848 3534 3554 3782 3809 3893 3876 3847 3918
6324C918r7r6J96mj90r1n8n9L0L0L1L0noR5R5r4r4P1J71J0j90j7J84P4P5M4j56p9J21mmj0
$$ 3918 3821 3725 3921 3917 3727 3636 3578 3519 3549 3579 3610 3640 3635 3629 3724 3819 3725 3631 3702 3873 3883 3693 3676 3860 3934 4009 4053 3897 3818 3939 3935 3931 3921
6308C921j0o1o0m0m0O0O0r3r3j06R5J00R9J31p0j90r0n9J43K61p3k20j8q3q3L1L0K2K2J22
$$ 3921 3911 3850 3790 3750 3710 3770 3830 3737 3644 3538 3633 3733 3832 3963 3893 3703 3613 3554 3697 3958 3885 3665 3647 3564 3481 3512 3542 3564 3586 3708
6293C708J22l2l3J35J35JJr9j00j2j2j79j79o2o1j1j1J31J30J30J31n9n9M1M1P6P6r1r1K3
$$ 3708 3830 3798 3765 3900 4035 4036 4037 3938 3838 3826 3814 3635 3456 3394 3333 3322 3311 3442 3572 3702 3833 3774 3715 3756 3797 3873 3949 3858 3767 3790
6278C790K4p6p7l3l3l2l3J06J07ppQ0j21j78K3n3j53Q3Q2J47J47j40O1J27K8K09Rj27j28l9
$$ 3790 3814 3738 3661 3628 3595 3563 3530 3636 3743 3736 3729 3809 3688 3510 3533 3480 3327 3410 3492 3639 3786 3646 3707 3834 3862 4071 4080 3953 3825 3786
6263C786l9k7k7k0k1QJ08P1j30j06mK4J25J16q5j22k2n2n3MMK1K1K1K1N1N1j18j8K04Lj02
$$ 3786 3747 3720 3693 3673 3652 3660 3768 3839 3709 3603 3599 3623 3748 3864 3779 3657 3635 3583 3530 3534 3538 3559 3580 3601 3622 3673 3724 3606 3588 3792 3795 3693
6247C693kj1j2J62J61q0q1n0N1n2k52p9J22J0J1p8p8J15J15J02J02J07r4j00J00oj06L1o9
$$ 3693 3691 3680 3668 3830 3991 3911 3830 3780 3831 3779 3527 3448 3570 3580 3591 3513 3435 3550 3665 3767 3869 3976 3882 3782 3882 3876 3770 3801 3732
6232C732n5J46p4p5m8m8LKJ40J39r4r5r8r9Q1Q1n9J42R1j09J51J51r6r6l5l4O5O6j35j35k6
$$ 3732 3677 3823 3749 3674 3626 3578 3581 3583 3723 3862 3768 3673 3575 3476 3557 3638 3579 3721 3812 3703 3854 4005 3909 3813 3778 3744 3809 3875 3740 3605 3579
6216C579J74K37L6poj2j2j3j2q2q2r5J06opk7k29k5L10K22K1l1l1m4m3o4o3n1n1p9J23J0R
$$ 3579 3753 3990 4026 4019 4013 4001 3989 3976 3964 3882 3800 3705 3811 3805 3798 3771 3542 3517 3827 4049 4070 4039 4008 3964 3921 3857 3794 3743 3692 3613 3736 3746 3755
6200C755j3j4j01j02o3J38J89j3o8o7P5P4J2j89k1J79l9m0q9r0R8j04J0J0J27J28K7K7R2R1
$$ 3755 3742 3728 3627 3525 3462 3600 3789 3776 3708 3641 3716 3790 3802 3613 3592 3771 3732 3692 3603 3513 3611 3507 3517 3527 3654 3782 3809 3836 3928 4019
6185D019k1k1m6k47q0J21Q7Q8j%PQr3r3r3r3PQM3M3J44J44q7q6J4J4R6R7j38j37n6n6M4M4
$$ 4019 3998 3977 3931 3684 3604 3725 3812 3900 3899 3899 3906 3914 3821 3728 3635 3542 3549 3557 3600 3643 3787 3931 3844 3758 3772 3786 3882 3979 3841 3704 3648 3592 3636 3680
6168C680k7k7k7k7m2m2N9N9K2K2p8p9R4R3Q1Q0J04r8K8K8n2J49J37j98j62L9J41M1j24P7J14
$$ 3680 3653 3626 3599 3572 3530 3488 3547 3606 3628 3650 3572 3493 3587 3680 3761 3841 3945 3847 3875 3903 3851 4000 4137 3939 3777 3816 3957 3998 3874 3951 4065
6152D065J4p2p1rj09o9J31J38o3k11j0L3L2J20J20m8m7l8l8l8l7K7K7K7K7OOOOk5k5k5k5P4
$$ 4065 4079 4007 3936 3927 3818 3749 3880 4018 3955 3744 3734 3767 3799 3919 4039 3991 3944 3906 3868 3830 3793 3820 3847 3874 3901 3907 3913 3919 3925 3900 3875 3850 3825 3899
6135C899P5k6k6r5r5ONM3M2j25j26k0k1K8K28J51N1J9J9n0n0N1N0M3M4j91j92J32J31L0L1
$$ 3899 3974 3948 3922 3827 3732 3738 3743 3786 3828 3703 3577 3557 3536 3564 3792 3943 3994 4013 4032 3982 3932 3983 4033 4076 4120 3929 3737 3869 4000 4030 4061
6120D061NOj04l04j98LJ75P4q5J4J20J19K1K1L3L4j55M6M6j54k7k8O1O1MMqqJ42n8l4l3j51
$$ 4061 4066 4072 3968 3664 3466 3469 3644 3718 3633 3647 3767 3886 3907 3928 3961 3995 3840 3886 3932 3778 3751 3723 3784 3845 3849 3853 3845 3837 3979 3921 3887 3854 3703
6103C703N1O3j38q6J16J02r8ONppJ24J25K4K5O9P0O9P0j12j13j2j2k0k0Q0Q0l5l5l5l5L4L4
$$ 3703 3754 3817 3679 3593 3709 3811 3713 3719 3724 3717 3710 3834 3959 3983 4008 4077 4147 4216 4286 4174 4061 4049 4037 4017 3997 4077 4157 4122 4087 4052 4017 4051 4085
6086D085o7o6j8j9j19j18M1M2n9n8mnQ4Q4K18J8r1r1j83J7P2P3Q7Q8p9q0J5J4K7K7k6J75J79
$$ 4085 4018 3952 3934 3915 3796 3678 3719 3761 3702 3644 3640 3635 3719 3803 4021 4039 3948 3857 3674 3691 3763 3836 3923 4011 3932 3852 3867 3881 3908 3935 3909 4084 4263
6070D263k90k16J18O8O8j02j02O6O5L9L8o2o3J1J1J0J1n2n2M8M8j2j2k5k5j00l01o7J34jk
$$ 4263 3973 3757 3875 3943 4011 3909 3807 3873 3938 3977 4015 3953 3890 3901 3912 3922 3933 3881 3829 3877 3925 3913 3901 3876 3851 3751 3450 3383 3517 3516 3514
6054C514J2J1J89J89K2K2n2n2J15J16q6q5J49J49OPr4r4j04j04n0J51j9j9poM6M5L4L3K3j78
$$ 3514 3526 3537 3726 3915 3937 3959 3907 3855 3970 4086 4000 3915 4064 4213 4219 4226 4132 4038 3934 3830 3780 3931 3912 3893 3886 3880 3926 3971 4005 4038 4061 3883
6038C883j21k1l5l5k8k8M8M8kkK1K2J23J22p5p6R2R2K2K1p8p9NNJ24K4j83J8J99j35q5J15
$$ 3883 3762 3741 3706 3671 3643 3615 3663 3711 3709 3707 3728 3750 3873 3995 3920 3844 3936 4028 4050 4071 3993 3914 3919 3924 4048 4072 3889 3907 4106 3971 3886 4001
6022D001Q8j2n1n1n7n7M9N0j12j12j6Q4R7j05m5N6j4j4o3o2J04J05l5l4l5l5L5L4J35J35q9
$$ 4001 4089 4077 4026 3975 3918 3861 3910 3960 3848 3736 3720 3804 3901 3796 3751 3807 3793 3779 3716 3654 3758 3863 3828 3794 3759 3724 3759 3793 3928 4063 3974
6007C974q8J1J2J14J14m6m7q9J2P4j26j13j2Q6Q6m6m6r6r6P2P2r5r5J19J20J9J9k4k4j24j25
$$ 3974 3886 3897 3909 4023 4137 4091 4044 3955 3967 4041 3915 3802 3790 3876 3962 3916 3870 3774 3678 3750 3822 3727 3632 3751 3871 3890 3909 3885 3861 3737 3612
5991C612M3M4p6K4J45n7P6P6j65L6k1j21R0R1Q4Q4r9r9r8r9O0O0O1O0N7N7N7N7k8k9k8k9p6
$$ 3612 3655 3699 3623 3647 3792 3735 3811 3887 3722 3758 3737 3616 3706 3797 3881 3965 3866 3767 3669 3570 3630 3690 3751 3811 3868 3925 3982 4039 4011 3982 3954 3925 3849
5975C849p5K4K5J10J09J47J48P5j25j13j13r4r4m3m4P1P1P2P1N4N3j14j13K4K5p6p5N5N5m5
$$ 3849 3774 3798 3823 3933 4042 4189 4337 4412 4287 4174 4061 3967 3873 3830 3786 3857 3928 4000 4071 4125 4178 4064 3951 3975 4000 3924 3849 3904 3959 3914
5959C914m6n9o0j0j0Q6Q5j5j5r3r3J42J41r7r7J96nj15Q5O1O1q8q8J3J3J9J9K0J9o7o8j7j7
$$ 3914 3868 3809 3749 3739 3729 3815 3900 3885 3870 3777 3684 3826 3967 3870 3773 3969 3964 3849 3934 3995 4056 3968 3880 3893 3906 3925 3944 3964 3983 3916 3848 3831 3814
5943C814Q5Q6j5j5RRr2r1Q0Q0O8O8Q2j19k94M0J79J79J45n5p0p0J8J7PPJ20q1j88j88M2K44
$$ 3814 3899 3985 3970 3955 3964 3973 3881 3790 3870 3950 4018 4086 4168 4049 3755 3795 3974 4153 4298 4243 4173 4103 4121 4138 4145 4152 4272 4191 4003 3815 3857 4101
5927D101J36o5l9m0k3k3m7J52J30p2m6m6q0q0J55J54j04j04lmN8N7Q2j18j95OQ1k54j14Q6
$$ 4101 4237 4172 4133 4093 4070 4047 4000 4152 4282 4210 4164 4118 4038 3958 4113 4267 4163 4059 4056 4052 4110 4167 4249 4131 3936 3942 4023 3769 3655 3741
5912C741PK08PPl1l1j01j01j14Q8J38J39J63l7m2m3mnr2r1RRJ46J47M7n2j54M7K09PJ29J29
$$ 3741 3748 3956 3963 3970 3939 3908 3807 3706 3592 3680 3818 3957 4120 4083 4041 3998 3994 3989 3897 3806 3815 3824 3970 4117 4164 4112 3958 4005 4214 4221 4350 4479
5896D479n1n1r6r6NNj09j08N9N9q4q4J7J7LLJ03J04M0L9j0j1j8j7j2j2j31l1L8j62n5J45R6
$$ 4479 4428 4377 4281 4185 4190 4195 4086 3978 4037 4096 4012 3928 3945 3962 3965 3968 4071 4175 4215 4254 4244 4233 4215 4198 4186 4174 4043 4012 4050 3888 3833 3978 4074
5879D074j05j27P3J16J15Q4Q4j6j7k1k2p2p2N1N0j17j16m8m7O6O5K3K24N6j45m0m0j03j02
$$ 4074 3969 3842 3915 4031 4146 4230 4314 4298 4281 4260 4238 4166 4094 4145 4195 4078 3962 3914 3867 3933 3998 4021 4245 4301 4156 4116 4076 3973 3871
5865C871N5N5NNk7k8K3K3j1j2j1j2O5O4KJJ58m4k08j09L3K34J2j88j83q2m0O0M5M4N1N1k7
$$ 3871 3926 3981 3986 3991 3964 3936 3959 3982 3971 3959 3948 3936 4001 4065 4067 4068 4226 4182 3974 3865 3898 4132 4144 3956 3773 3691 3651 3711 3756 3800 3851 3902 3875
5848C875k7O2O1k7k27N3N2j58j59J43J43Q3Q3Q4Q3o6o5L5L5r0q9J9K20J09r2L4L3K7K7k66
$$ 3875 3848 3910 3971 3944 3717 3770 3822 3664 3505 3648 3791 3874 3957 4041 4124 4058 3993 4028 4063 3973 3884 3903 4123 4232 4140 4174 4207 4234 4261 3995
5833C995o5J84j7QQj12j13k4k5J13q7j29j30L9K40J39o2j21j20l2l3K26K26k0k1O4j37p4p4
$$ 3995 3930 4114 4097 4105 4113 4001 3888 3864 3839 3952 3865 3736 3606 3645 3885 4024 3962 3841 3721 3689 3656 3882 4108 4088 4067 4131 3994 3920 3846
5818C846j00r9RK10K00%m2m3N2N2J8j82j30K04J6j84J15J16J03J03p9p9p9p9K9K9K9K9PPM5
$$ 3846 3746 3647 3656 3866 4066 4066 4024 3981 4033 4085 4103 3921 3791 3995 4011 3827 3942 4058 4161 4264 4185 4106 4027 3948 3977 4006 4035 4064 4071 4078 4123
5803D123M5M4j57N7N7J45J46j56j55j24j24M3M3Q6Q5j5j6j16j17j6j7k9l0K0K0J55J54M5j55
$$ 4123 4168 4212 4055 4112 4169 4314 4460 4304 4149 4025 3901 3944 3987 4073 4158 4143 4127 4011 3894 3878 3861 3832 3802 3822 3842 3997 4151 4196 4041
5788D041j36O6M0M0K0K1K0K0O7O6K5j77r3J09j8j7m1m0o6J35J37o4l9l9l0l1nk06j19Q2N8
$$ 4041 3905 3971 4011 4051 4071 4092 4112 4132 4199 4265 4290 4113 4020 4129 4111 4094 4053 4013 3947 4082 4219 4155 4116 4077 4047 4016 4011 3805 3686 3768 3826
5773C826N7PPPPM1M1M1M1o8o8J00R9J10J10j24j25PQPPJ7J6j51j52Q4Q3Q3Q3j16j16J18J19
$$ 3826 3883 3890 3897 3904 3911 3952 3993 4034 4075 4007 3939 4039 4138 4248 4358 4234 4109 4116 4124 4131 4138 4155 4171 4020 3868 3952 4035 4118 4201 4085 3969 4087 4206
5756D206p6p7K5K4J04J04J7J6k12j1R0j11ooj9j9J30J30J30J30r2r3L2j68k27k5J6J5P5P4
$$ 4206 4130 4053 4078 4102 4206 4310 4327 4343 4131 4120 4210 4099 4093 4087 4068 4049 4179 4309 4439 4569 4477 4384 4416 4248 4021 3996 4012 4027 4102 4176
5741D176k6k6j06j06n1J50J24J25J49n1p0p0J8J7rqk2k2n0k52j60J76K9L0N1N0p0p1L0L0k1
$$ 4176 4150 4124 4018 3912 3861 4011 4135 4260 4409 4358 4288 4218 4236 4253 4244 4236 4214 4192 4142 3890 3730 3906 3935 3965 4016 4066 3996 3925 3955 3985 3964
5726C964k0k1k0L8L8J38J39NMNNj2j3J%k64o4J04J04K52q2j83j83r3J06R5R4j00j00P6K76
$$ 3964 3944 3923 3903 3941 3979 4117 4256 4261 4265 4270 4275 4263 4250 4251 4251 3987 3923 4027 4131 4383 4301 4118 3935 3842 3948 4043 4137 4037 3937 4013 4289
5710D289lk04p8p8J21J20J21J20p5p5p5p5%J%%J8J8J8J8L9L8o1o2k2k1P8P9m3m3m3m2o5o4
$$ 4289 4286 4082 4004 3926 4047 4167 4288 4408 4333 4258 4183 4108 4108 4109 4109 4109 4127 4145 4163 4181 4220 4258 4197 4135 4113 4092 4170 4249 4206 4163 4120 4078 4013 3949
5693C949o5o4P8P7k2k3P5P5k6k6J0J0J22J23q2J18J19q3P9P9j01j01nnj06j05J27J27J39o1
$$ 3949 3884 3820 3898 3975 3953 3930 4005 4080 4054 4028 4038 4048 4170 4293 4211 4329 4448 4365 4444 4523 4422 4321 4316 4311 4205 4100 4227 4354 4493 4432
5678D432n7n6o9o9L3L4L3L3kkkko5o4L5L6M6M7j67L4j6j6j6j6Q4j16mlL2L2L2L2p5p5K5K5
$$ 4432 4375 4319 4250 4181 4214 4248 4281 4314 4312 4310 4308 4306 4241 4177 4212 4248 4294 4341 4174 4208 4192 4176 4160 4144 4228 4112 4108 4105 4137 4169 4201 4233 4158 4083 4108 4133
5660D133r0r0J1J1l3l2L15L15J0l26j37j36N8N9M6M6M6j55j42j43M0M0J27J28K90Q9j67j66
$$ 4133 4043 3953 3964 3975 3942 3910 4225 4540 4550 4224 4087 3951 4009 4068 4114 4160 4206 4051 3909 3766 3806 3846 3973 4101 4391 4480 4313 4147
5646D147l6l5k12j0J94qpJ93J35o7m1m1j02j02Q6K87j19j20O0O1L5L5o5o5M8M8n3n3l3l4P9
$$ 4147 4111 4076 3864 3854 4048 4040 4033 4226 4361 4294 4253 4212 4110 4008 4094 4381 4262 4142 4202 4263 4298 4333 4268 4203 4251 4299 4246 4193 4160 4126 4205
5630D205j22mnl0J71L9M0m9m9J37J37k77p6J8J9L1L2L3L3m2J58J01r9j42j42J36J36r9r9k
$$ 4205 4083 4079 4074 4044 4215 4254 4294 4245 4196 4333 4470 4193 4117 4135 4154 4185 4217 4250 4283 4241 4399 4500 4401 4259 4117 4253 4389 4290 4191 4189
5615D189lklM6M6M5M6J4J4J02J03L7j63n0n0llj03j04P1P0K0K1n5n5nnj04j03mlQQJ64J63
$$ 4189 4186 4184 4181 4227 4273 4318 4364 4378 4392 4494 4597 4634 4471 4421 4371 4368 4365 4262 4158 4229 4299 4319 4340 4285 4230 4225 4220 4116 4013 4009 4006 4014 4022 4186 4349
5598D349O8j33k0k0L2L3j02J00Q0k54j66L4N5N4J17J17q4q4J6J6j27j27J07J07P1P1N8N8J39
$$ 4349 4417 4284 4264 4244 4276 4309 4207 4307 4387 4133 3967 4001 4056 4110 4227 4344 4260 4176 4192 4208 4081 3954 4061 4168 4239 4310 4368 4426 4565
5583D565o1j83j82l7l7J85J85N1j49n0J52J01J00j21j21j52j52J49J49j3j2j2j2Q2Q2M0j61
$$ 4565 4504 4321 4139 4102 4065 4250 4435 4486 4337 4287 4439 4540 4640 4519 4398 4246 4094 4243 4392 4379 4367 4355 4343 4425 4507 4547 4386
5569D386j93RJ71J71O5j36j24j23N6N6N7N6K9K9j38j38LLq5q5p2J28K96R5j07j08p7J22N7
$$ 4386 4193 4202 4373 4544 4609 4473 4349 4226 4282 4338 4395 4451 4480 4509 4371 4233 4236 4239 4154 4069 3997 4125 4421 4516 4409 4301 4224 4346 4403
5555D403j43j07j06p3J28K67o9q9J11p3p2K6K6j41j42R2R2qqJ8J9q2q1J04J05o3o3j1j1j2
$$ 4403 4260 4153 4047 3974 4102 4369 4300 4211 4322 4249 4177 4203 4229 4088 3946 4038 4130 4122 4114 4132 4151 4069 3988 4092 4197 4134 4071 4060 4049 4037
5540D037j1O0O0m1m0P0P0P0P1o5o5L6L6J5J4O5O5J3J4q7q7k9l0P1P1j84j84j7j7J57J56J69
$$ 4037 4026 4086 4146 4105 4065 4135 4205 4275 4346 4281 4216 4252 4288 4303 4317 4382 4447 4460 4474 4387 4300 4271 4241 4312 4383 4199 4015 3998 3981 4138 4294 4463
5524D463l2m6m6qpm7m7J21J21o3o2K5K6q9k90p6p6M7M7J48J48l8l8l8l8oopoL2L3L2L3o8o8
$$ 4463 4431 4385 4339 4331 4324 4277 4230 4351 4472 4409 4347 4372 4398 4309 4019 3943 3867 3914 3961 4109 4257 4219 4181 4143 4105 4099 4093 4086 4080 4112 4145 4177 4210 4142 4074
5506D074Q7Q7J15q5KK03Q3j18j59j60K9L0Q0P9l5l5J4J5P9P9k2k2L4L3M7j55j01j01N4N3k3
$$ 4074 4161 4248 4363 4278 4280 4483 4566 4448 4289 4129 4158 4188 4268 4347 4312 4277 4291 4306 4385 4464 4442 4420 4454 4487 4534 4379 4278 4177 4231 4284 4261
5491D261k4J02r9j8J84P0j30n5n5j81K1J33J34k1k1K1K1o7o8p6J24J37o4j1J89K2j79j41O0
$$ 4261 4237 4339 4240 4222 4406 4476 4346 4291 4236 4055 4076 4209 4343 4322 4301 4322 4343 4276 4208 4132 4256 4393 4329 4318 4507 4529 4350 4209 4269
5476D269K2K2J57m3J9J9r1r1RJ0N9O0j08j08Q2Q1J31J32mmj03j04M9M9j06j06p9J23RRN8N7
$$ 4269 4291 4313 4470 4427 4446 4465 4374 4283 4292 4302 4361 4421 4313 4205 4287 4368 4499 4631 4627 4623 4520 4416 4465 4514 4408 4302 4223 4346 4355 4364 4422 4479
5460D479K6p5j07R4J42J42p1p1J05r6k15j3K8K9J7J7q4q3M8M8M9M8n7n7M4M3q4q4L2K31Q8
$$ 4479 4505 4430 4323 4417 4559 4701 4630 4559 4664 4568 4353 4340 4368 4397 4414 4431 4347 4264 4312 4360 4409 4457 4400 4343 4387 4430 4346 4262 4294 4525 4613
5444D613j3J5j87j19Q1m4m4J31J30Q3j19r7LL8J39N4m6J42n9k96r5J1J12P9j21j60M2N7J58
$$ 4613 4600 4615 4428 4309 4390 4346 4302 4433 4563 4646 4527 4430 4433 4471 4610 4664 4618 4760 4701 4405 4310 4321 4433 4512 4391 4231 4273 4330 4488
5430D488J39o2k43m3J85j5O7J67kko7o8j7j8R1R0p7p7o2o2L9L8P2P2j01j02P6k4j82K0R3R2
$$ 4488 4627 4565 4322 4279 4464 4449 4516 4683 4681 4679 4612 4544 4527 4509 4600 4690 4613 4536 4474 4412 4451 4489 4561 4633 4532 4430 4506 4482 4300 4320 4413 4505
5414D505j29j29J79J79J2J2N8N8j10j10j19j19J16J15RQj52j53N5J56K12J0N4N4rrK7K7j41
$$ 4505 4376 4247 4426 4605 4617 4629 4687 4745 4635 4525 4406 4287 4403 4518 4527 4535 4383 4230 4285 4441 4653 4663 4717 4771 4762 4753 4780 4807 4666
5399D666l41r2K43R9jqqQ7Q6l9l9k8k9q7Q0J81J3mnj15j16l6l6J4J4K0K1j47m7J53j4NK39
$$ 4666 4325 4233 4476 4575 4574 4566 4558 4645 4731 4692 4653 4625 4596 4509 4589 4770 4783 4779 4774 4659 4543 4507 4471 4485 4499 4519 4540 4393 4346 4499 4485 4490 4729
5383D729o2o1MLP0P0K0K0j41j41K6K6J9K0q1q1j4j5j4j4L7L7L8L7J2J2J2J2o3o3Mr6n4J13
$$ 4729 4667 4606 4610 4613 4683 4753 4773 4793 4652 4511 4537 4563 4582 4602 4521 4440 4426 4411 4397 4383 4420 4457 4495 4532 4544 4556 4568 4580 4517 4454 4458 4362 4308 4421
5366D421O9l2j5j6J45J45J14J13j20j21p3p3K8K7l7l8l1l1j66o6J21j14j42K6Q4Q4M6M7R7
$$ 4421 4490 4458 4443 4427 4572 4717 4831 4944 4824 4703 4630 4557 4585 4612 4575 4537 4506 4475 4309 4243 4364 4250 4108 4134 4218 4302 4348 4395 4492
5351D492R7j23j24M3M4L5L5L5L5L3L2o7o8m9m8N1N2j32j33l2l2K70K69r9r8L8L8Q9Q8qqj09
$$ 4492 4589 4466 4342 4385 4429 4464 4499 4534 4569 4602 4634 4567 4499 4450 4402 4453 4505 4373 4240 4208 4176 4446 4715 4616 4518 4556 4594 4683 4771 4763 4755 4646
5335D646j09k0k1n9n8lJ98J97lk3k3l5l6K6K6K6K5N1N1N1N0r2r2r2r2J3J3j13Q8J41o0O6O6
$$ 4646 4537 4517 4496 4437 4379 4376 4574 4771 4768 4745 4722 4687 4651 4677 4703 4729 4754 4805 4856 4907 4957 4865 4773 4681 4589 4602 4615 4502 4590 4731 4671 4737 4803
5318D803J8J8q2q3MMMMK3K3K2K3o9o9p0o9K6K6K6K6K5K5P5P5n0m9j50j50J9K0J20J20r8r7
$$ 4803 4821 4839 4757 4674 4678 4682 4686 4690 4713 4736 4758 4781 4712 4643 4573 4504 4530 4556 4582 4608 4633 4658 4733 4808 4758 4709 4559 4409 4428 4448 4568 4688 4590 4493
5301D493KLM4M4n7n6M8M8M8M8J6J6j17Q3K27j07j20Q1m0l9k7k8j54j55j76J59J86J86K19J8
$$ 4493 4495 4498 4542 4586 4529 4473 4521 4569 4617 4665 4681 4697 4580 4663 4890 4783 4663 4744 4704 4665 4638 4610 4456 4301 4125 4284 4470 4656 4875 4893
5286D893j11j11j24j24N5N6O8O8j72K9Q0j22o0n9q5J16J4J3P6P7K4K4K4K5N2N3N2N3r2r2K1
$$ 4893 4782 4671 4547 4423 4478 4534 4602 4670 4498 4527 4607 4485 4425 4366 4281 4397 4411 4424 4500 4577 4601 4625 4649 4674 4726 4779 4831 4884 4792 4700 4721
5271D721j80m1m2m2m1k9J72J72k8j0j0j79k80q1K54K70J70n6k57r5J05J07J07J25J26j26k5
$$ 4721 4541 4500 4458 4416 4375 4346 4518 4690 4662 4652 4642 4463 4183 4102 4356 4626 4796 4740 4483 4388 4493 4600 4707 4832 4958 4832 4807
5257D807L2j70N2N2q6J14J21q0j7Q3l7j38j32l2O5O5P1P1L6L7L6L6J07J07j27j27j35j35R9
$$ 4807 4839 4669 4721 4773 4687 4801 4922 4842 4825 4908 4871 4733 4601 4569 4634 4699 4770 4841 4877 4914 4950 4986 5093 5200 5073 4946 4811 4676 4775
5243D775J00m5m5N5N6j4j3j4j4Q7Q7k14k15Q8Q8R4R4K1J22R0j11j68L2K6j74j71p0L5L4M4
$$ 4775 4875 4830 4785 4840 4896 4882 4869 4855 4841 4928 5015 4801 4586 4674 4762 4856 4950 4971 5093 5183 5072 4904 4936 4962 4788 4617 4547 4582 4616 4660
5228D660J43J88j47k02jL3L3LLLLK8K8p3p2j0rj0j0M5M4J4q8q3J17K22J22m0l9N4N5L1L2k03
$$ 4660 4803 4991 4844 4642 4641 4674 4707 4710 4713 4716 4719 4747 4775 4702 4630 4620 4611 4601 4591 4636 4680 4694 4606 4523 4640 4862 4984 4944 4905 4959 5014 5045 5077 4874
5211D874k03n1n0J17J17m7m7m7m7Q4Q5j6j6o7o7q0J21P8P7j1j1lmllp5p4o2o2K1K22J22p9
$$ 4874 4671 4620 4570 4687 4804 4757 4710 4663 4616 4700 4785 4769 4753 4686 4619 4539 4660 4738 4815 4804 4793 4790 4786 4783 4780 4705 4631 4569 4507 4528 4750 4872 4793
5194D793K2K1RRj13j12M2M3J45n6j57M5J33J32l4l5L5j66N9O0j03R8j6j5J9J8J8J8r3r4J5
$$ 4793 4815 4836 4845 4854 4741 4629 4671 4714 4859 4803 4646 4691 4824 4956 4922 4887 4922 4756 4815 4875 4772 4870 4854 4839 4858 4876 4894 4912 4819 4725 4740
5178D740K15J43n8j68j67J41J41r3r3M8M9L7L6N8j43j42N8J27J27L1j70n5J46K21j14k97r7
$$ 4740 4955 5098 5040 4872 4705 4846 4987 4894 4801 4849 4898 4935 4971 5029 4886 4744 4802 4929 5056 5087 4917 4862 5008 5229 5115 4818 4721
5165D721rrJ84j6r2K42L6L5O9j31n2n1rJ91J0Rp8p9K5K4q8J12K9K8M2M1K2K3p8p8j20j20j9
$$ 4721 4712 4703 4887 4871 4779 5021 5057 5092 5161 5030 4978 4927 4918 5109 5119 5128 5050 4971 4996 5020 4932 5044 5073 5101 5143 5184 5206 5229 5151 5073 4953 4833 4814
5148D814k0N2N1N2N1Q1Q1j54j54j4j3J11q9j88J4N5N5LKJ70J71n4n4O6j36j52n1k1J81J37
$$ 4814 4794 4846 4897 4949 5000 5081 5162 5008 4854 4840 4827 4938 4849 4661 4675 4730 4785 4788 4790 4960 5131 5077 5023 5089 4953 4801 4750 4729 4910 5047
5133E047j99j16Q4O3l8o9o9J44J45k3k4J7J6J83J84n3n3n3n3o7o6L1J32P6j26j31O9J32o9
$$ 5047 4848 4732 4816 4879 4841 4772 4703 4847 4992 4969 4945 4962 4978 5161 5345 5292 5239 5186 5133 5066 5000 5031 5163 5239 5113 4982 5051 5183 5114
5119E114m4m3m4m4j2Q8O0j41L5J35n9J42M7j53L2L2j93Pm3m3O4O3R5pj75K5J02r8j73J61P6
$$ 5114 5070 5027 4983 4939 4927 5015 5075 4934 4969 5104 5045 5187 5234 5081 5113 5145 4952 4959 4916 4873 4937 5000 5095 5088 4913 4938 5040 4942 4769 4930 5006
5103E006j24n4M8R1j0p2J29J64l7j45j46j6j6k2k2Q3j8Q1K82J60m0k06j05M5M4N1N2o7o6o6
$$ 5006 4882 4828 4876 4967 4957 4885 5014 5178 5141 4996 4850 4834 4818 4796 4774 4857 4839 4920 5202 5362 5322 5116 5011 5056 5100 5151 5203 5136 5070 5004
5088E004o6LLJ03J04r6r5NNR1R1M9j52j46N5J43n7NOppNOONn6n6M4M4kkqqJ54N4k43m2J96
$$ 5004 4938 4941 4944 5047 5151 5055 4960 4965 4970 5061 5152 5201 5049 4903 4958 5101 5044 5049 5055 5048 5041 5046 5052 5058 5063 5007 4951 4995 5039 5037 5035 5027 5019 5173 5227 4984 4942 5138
5069E138R6klj15j16j16j15j3j3J12q9j2J89J07PR9j02j09R3O5O4r0r0N2N2N2N2o7o7L4L4
$$ 5138 5234 5232 5229 5114 4998 4882 4767 4754 4741 4853 4764 4752 4941 5048 5055 5154 5052 4943 5036 5101 5165 5075 4985 5037 5089 5141 5193 5126 5059 5093 5127
5053E127oop5K5o9k71m0O0L9M0N8N8r7J04J04r7R2R1j34O6O5O4k4k4R6R6p2p2l5l4l5l5k8
$$ 5127 5121 5115 5040 5065 4996 4725 4685 4745 4784 4824 4882 4940 4843 4947 5051 4954 5046 5137 5003 5069 5134 5198 5174 5150 5246 5342 5270 5198 5163 5129 5094 5059 5031
5037E031k8J85j6Q7Q6k6k6K4K4p7p6q1q1r9J01J27K6j29k9J88J87R4j08k91M3J22p8j24j24
$$ 5031 5003 5188 5172 5259 5345 5319 5293 5317 5341 5264 5188 5107 5026 4927 5028 5155 5181 5052 5023 5211 5398 5492 5384 5093 5136 5258 5180 5056 4932
5022D932L9K40J56m5q7q6N1N0J52J51m2m1m1m2o4o5o5o5J05J04j96j97O3O4O4O3o4o4o4o4
$$ 4932 4971 5211 5367 5322 5235 5149 5200 5250 5402 5553 5511 5470 5429 5387 5323 5258 5193 5128 5233 5337 5141 4944 5007 5071 5135 5198 5134 5070 5006 4942
5007D942N4N4J73k8j54n3M3J44J84j7j32j32N7N7N8N7L2L2j8j8j49j49m8m8%jJ01J00j48j48
$$ 4942 4996 5050 5223 5195 5041 4988 5031 5175 5359 5342 5210 5078 5135 5192 5250 5307 5339 5371 5353 5335 5186 5037 4989 4941 4941 4940 5041 5141 4993 4845
4992D845J54J54K2K3l3l4N7m3j2J90lk04l5O6l6l7J38J37P2P2j62j62O1O1J0J1p6p7l5J66
$$ 4845 4999 5153 5175 5198 5165 5131 5188 5145 5133 5323 5320 5116 5081 5147 5111 5074 5212 5349 5421 5493 5331 5169 5230 5291 5301 5312 5236 5159 5124 5290
4977E290R1j10J6J5J0J1j09rJk00K8K29J73k9j37j37L3L2L3L2ONr5r5R0R0N8m1o6J35J73k9
$$ 5290 5381 5271 5287 5302 5312 5323 5214 5205 5206 5006 5034 5263 5436 5407 5270 5133 5166 5198 5231 5263 5269 5274 5179 5084 5174 5264 5322 5281 5215 5350 5523 5494
4961E494J7q3r7No9o9o3o3M6M6M7M6m6m5m6m5J07J07J08J07j36j37L1L1j68j68J46J46j37
$$ 5494 5511 5428 5331 5336 5267 5198 5135 5072 5118 5164 5211 5257 5211 5166 5120 5075 5182 5289 5397 5504 5368 5231 5262 5293 5125 4957 5103 5249 5112
4947E112O3J07OL5L5k2k1M8M9j78K3K05Lr0J10J7q3M9n2q9J1m6m5q9J2P5j26qR1l4O7J22J23
$$ 5112 5175 5282 5288 5323 5358 5336 5315 5363 5412 5234 5257 5462 5465 5375 5485 5502 5419 5468 5416 5327 5338 5292 5247 5158 5170 5245 5119 5111 5202 5168 5235 5357 5480
4930E480Nr5J71l0k58n8n1J50J69l3JJ00L2L1m6m7LLPOr4r4j5j6llk2J78J21K1O0N9P2k8j72
$$ 5480 5485 5390 5561 5531 5273 5215 5164 5314 5483 5450 5451 5551 5583 5614 5568 5521 5524 5527 5534 5540 5446 5352 5337 5321 5318 5315 5293 5471 5592 5613 5673 5732 5804 5776 5604
4912E604K9J34L4j26j25L6L6q1q1j00J01k5j26M2J43J2j88j9Q2lR7J03KR7R7M9j52k56n5J21
$$ 5604 5633 5767 5801 5675 5550 5586 5622 5541 5460 5360 5461 5436 5310 5352 5495 5507 5319 5300 5382 5379 5476 5579 5581 5678 5775 5824 5672 5416 5361 5482
4897E482J21N0M9n0n1j06j06J29J29j02j01j02j01M6M6M6M6M0M0L9M0j8j9j18j19J07J07o0
$$ 5482 5603 5653 5702 5652 5601 5495 5389 5518 5647 5545 5444 5342 5241 5287 5333 5379 5425 5465 5505 5544 5584 5566 5547 5429 5310 5417 5524 5464
4883E464o0J13J13J00J00m4k45j45N7J21J22l3l3r8r8KLj1j1j1j1nmJKK1J21J72k9m6j47j15
$$ 5464 5404 5517 5630 5730 5830 5786 5541 5396 5453 5574 5696 5663 5630 5532 5434 5436 5439 5428 5417 5406 5395 5390 5386 5387 5389 5410 5531 5703 5674 5628 5481 5366
4867E366Q6O8O7M9n2k0J81K3p7k8P2P3k9k1P8LLn1k52l8l9p2p2M1M0m8J52K49q7k34J00J12
$$ 5366 5452 5520 5587 5636 5584 5564 5745 5768 5691 5663 5735 5808 5779 5758 5836 5839 5842 5791 5539 5501 5462 5390 5318 5359 5399 5351 5503 5752 5665 5431 5531 5643
4851E643J13J7j83k6P4j2j2nonnJ20q1k77p7Q9j2K6K6K0K0J0RJ0RL1L0L0L1J14J14j20j20
$$ 5643 5756 5773 5590 5564 5638 5626 5614 5609 5603 5598 5593 5713 5632 5355 5278 5367 5355 5381 5407 5427 5447 5457 5466 5476 5485 5516 5546 5576 5607 5721 5835 5715 5595
4835E595p6p5R2R1l1l2l1l2p7p8J59N9j95OJ78P7N6N7n1n0mnmmPOPPO9O9j64j65MNJ05J05
$$ 5595 5519 5444 5536 5627 5596 5564 5533 5501 5424 5346 5505 5564 5369 5375 5553 5630 5686 5743 5692 5642 5638 5633 5629 5625 5632 5638 5645 5652 5721 5790 5626 5461 5465 5470 5575 5680
4817E680L2L2r4J07K14J3j52n2NMJ1J1%jj00j01lkO7l4j09R3J86j4R6R6j52n2nk06j94PK0
$$ 5680 5712 5744 5650 5757 5971 5984 5832 5780 5785 5789 5800 5811 5811 5810 5710 5609 5606 5604 5671 5637 5528 5621 5807 5793 5889 5985 5833 5781 5776 5570 5376 5383 5403
4800E403J21J39L9J07K07K3j78k3k3j61M0J23p8M8M8%%j%j04j04llo7o6J68J69j9k0j9j9j3
$$ 5403 5524 5663 5702 5809 6016 6039 5861 5838 5815 5654 5694 5817 5739 5787 5835 5835 5835 5834 5834 5730 5626 5623 5620 5553 5487 5655 5824 5805 5785 5766 5747 5734
4784E734j2l8J63Q1j20k07oJ88J88l4l4q8q9j9j20K4K25O3l9m6m7M8M8O6O7j01j01o6o6o6
$$ 5734 5722 5684 5847 5928 5808 5601 5595 5783 5971 5937 5903 5815 5726 5707 5587 5611 5836 5899 5860 5814 5767 5815 5863 5929 5996 5895 5794 5728 5662 5596
4769E596o6J00R9K2J22K12j22j48N3Pr4j1j2q0J22J21p9MNrql3l4l3l3j03j02O5O5N2N3N2
$$ 5596 5530 5630 5729 5751 5873 6085 5963 5815 5868 5875 5781 5770 5758 5678 5800 5921 5842 5846 5851 5842 5834 5801 5767 5734 5701 5598 5496 5561 5626 5678 5731 5783
4753E783N3MMNMj3j2j2j3K06K07J8j83r8r8o0o0J25J26K4K5l4l4l4l5o2o2j2j3jjr0q9j26
$$ 5783 5836 5840 5844 5849 5853 5840 5828 5816 5803 6009 6216 6234 6051 5953 5855 5795 5735 5860 5986 6010 6035 6001 5967 5933 5898 5836 5774 5762 5749 5748 5747 5657 5568 5442
4736E442P5J30J29J74J74o0o0P6P5P6P6l7l7j37j38j7j7L3L3jjj14Q7N8N9k9l0J%%JO5O5j02
$$ 5442 5517 5647 5776 5950 6124 6064 6004 6080 6155 6231 6307 6270 6233 6096 5958 5941 5924 5957 5990 5989 5988 5874 5961 6019 6078 6049 6019 6020 6020 6020 6021 6086 6151 6049
4719F049j02Q3Q3q4q4K1K2K1K2M8M8lkk05k05R6R6J8J8l2l2K7K8k3k3P5P4L7L7r7J04K04L
$$ 6049 5947 6030 6113 6029 5945 5966 5988 6009 6031 6079 6127 6124 6122 5917 5712 5808 5904 5922 5940 5908 5876 5903 5931 5908 5885 5960 6034 6071 6108 6011 6115 6319 6322
4702F322j05j05N0N0o9p0L1L1n3n2n3n3l0l0K04K05r7r8LLN4N3J1j89j35O6J07J08K2K2k9
$$ 6322 6217 6112 6162 6212 6143 6073 6104 6135 6082 6030 5977 5924 5894 5864 6068 6273 6176 6078 6081 6084 6138 6191 6202 6013 5878 5944 6051 6159 6181 6203 6174
4687F174k8KLN2N3k7k6k7k7j10j11n5J45J9K0L2L2k6k6P5P5K0K0j47j47K9K8K9K9M0M0k2k3
$$ 6174 6146 6148 6151 6203 6256 6229 6203 6176 6149 6039 5928 5873 6018 6037 6057 6089 6121 6095 6069 6144 6219 6239 6259 6112 5965 5994 6022 6051 6080 6120 6160 6138 6115
4670F115M1j59p1J29R9j02j43j44M5M4J45J46J40J41r3r4o8o8L2L2j02j02J33J32N8N8m3m2
$$ 6115 6156 5997 5926 6055 6154 6052 5909 5765 5810 5854 5999 6145 6285 6426 6333 6239 6171 6103 6135 6167 6065 5963 6096 6228 6286 6344 6301 6259
4656F259J1J2J00R9n1k53l1J71l1k32PPQK09J08r3opj08j07k9J71J72l0q5q6j24P8K03MJ5
$$ 6259 6270 6282 6382 6481 6430 6177 6146 6317 6286 6054 6061 6068 6076 6285 6393 6300 6294 6287 6179 6072 6043 6214 6386 6356 6271 6185 6061 6139 6342 6346 6361
4640F361J6P0j31j7j8M5M6M5M6N8N8j76j77m4m5p0J31J98lj11j12n0n0N0N1Q2Q2Q2Q1j02j02
$$ 6361 6377 6447 6316 6299 6281 6326 6372 6417 6463 6521 6579 6403 6226 6182 6137 6067 6198 6396 6393 6282 6170 6120 6070 6120 6171 6253 6335 6417 6498 6396 6294
4625F294O5O5qpn7n8K7K6p3p4N9N9j17Q4J22p8o0M1L4L4n3n4R5J95J51n0j1j1p4p4j4j5j4
$$ 6294 6359 6424 6416 6409 6352 6294 6321 6347 6274 6200 6259 6318 6201 6285 6407 6329 6269 6310 6344 6378 6325 6271 6366 6561 6712 6662 6651 6640 6566 6492 6478 6463 6449
4608F449j4r9r9N5N6J46n6o1J39O2l9l9O2j7k18j55n4R0Q9j25j26l4J67K68O7J8J9%%Pr3o1
$$ 6449 6435 6336 6237 6292 6348 6494 6438 6377 6516 6578 6539 6500 6562 6545 6327 6172 6118 6208 6297 6172 6046 6012 6179 6447 6514 6532 6551 6551 6551 6558 6465 6404
4592F404J39J02r9K6K6j8j8j9j8rrn9n9R0R1j0j0j32j32l2l1J73J73ONj1j1L9L9m2m2PQj14
$$ 6404 6543 6645 6546 6572 6598 6580 6562 6543 6525 6516 6507 6448 6389 6479 6570 6560 6550 6418 6286 6254 6223 6396 6569 6575 6580 6569 6558 6597 6636 6594 6552 6559 6567 6453
4575F453j15N1J51kk02j59M2J09r3k4P7J22J23K8K8k04k04K31K31q5q4J49J50o3o3j13j13
$$ 6453 6338 6389 6540 6538 6336 6177 6219 6328 6235 6211 6288 6410 6533 6561 6589 6385 6181 6412 6643 6558 6474 6623 6773 6710 6647 6534 6421
4562F421M1M0j14j14lJ98J97ln8n8k1k0J10J11n8n7o5o5J48n2l5l5LLj1j0j0j1L5L5M7M7o
$$ 6421 6462 6502 6388 6274 6271 6469 6666 6663 6605 6547 6526 6506 6616 6727 6669 6612 6547 6482 6630 6578 6543 6508 6511 6514 6503 6493 6483 6472 6507 6542 6589 6636 6630
4545F630J94K07Oj57M4q2q2onooooooj03j02j03j02J20J21J20J20J0Rm1m1P2P2r6r5J4J4O4
$$ 6630 6824 7031 7037 6880 6924 6842 6760 6754 6749 6743 6737 6731 6725 6719 6713 6610 6508 6405 6303 6423 6544 6664 6784 6794 6803 6762 6721 6793 6865 6769 6674 6688 6702 6766
4528F766O4p1p1q3J17J08J07O6j35j14j14k6k6J0J0R8R8L1j69j5J86J44n6k41R5L24j0j02
$$ 6766 6830 6759 6688 6605 6722 6830 6937 7003 6868 6754 6640 6614 6588 6598 6608 6706 6804 6835 6666 6651 6837 6981 6925 6684 6779 7103 7093 6991
4514F991j02j44j43m3m2J62J62p2p2M2M1o7K67K35j00n8n8j20j21p0p1J2J2k01%J44J45N6
$$ 6991 6889 6745 6602 6559 6517 6679 6841 6769 6697 6739 6780 6713 6980 7215 7115 7057 6999 6879 6758 6688 6617 6629 6641 6440 6440 6584 6729 6785
4500F785N7O1O1k7k8j53M8J54m6M3J44j05j05J20q2j92r2kkMMQ7Q6Q7Q6j6j6j0j0j63o4J15
$$ 6785 6842 6903 6964 6937 6909 6756 6804 6958 6912 6955 7099 6994 6889 7009 6927 6735 6643 6641 6639 6643 6647 6734 6820 6907 6993 6977 6961 6951 6941 6778 6714 6829
4484F829q6j32K02J52N2M4n6o2L8O5O5k9k9J03J02j32j32j7j7j7j7P4P3r4r4L1L2K5K5m7j47
$$ 6829 6743 6611 6813 6965 7017 7061 7005 6943 6981 7046 7111 7082 7053 7156 7258 7126 6994 6977 6960 6943 6926 7000 7073 6979 6885 6916 6948 6973 6998 6951 6804
4468F804j09R2K55J54J23J23o6o6o7o6j8j8Q0J81L4j67m8m8O9P0r8r8k2k2k2k1N5N6j05j06
$$ 6804 6695 6787 7042 7196 7319 7442 7376 7310 7243 7177 7159 7141 7221 7402 7436 7269 7221 7173 7242 7312 7214 7116 7094 7072 7050 7029 7084 7140 7035 6929
4453F929K3J23Q0j22rqk2k1l2l2%J00K50N0p2p1J00%j69L1J70l2mj05j99KJ16J17J6J6J04
$$ 6929 6952 7075 7155 7033 7024 7016 6994 6973 6941 6909 6909 7009 7259 7309 7237 7166 7266 7266 7097 7128 7298 7266 7262 7157 6958 6960 7076 7193 7209 7225 7329
4438G329J05R8j03j40m0o2L7K14J2j99Kj24j24N5N4m7m6J2J2q8q8j5j5J54N5rJ93Q5j15p9
$$ 7329 7434 7532 7429 7289 7249 7187 7224 7438 7450 7251 7253 7129 7005 7060 7114 7067 7021 7033 7045 6957 6869 6854 6839 6993 7048 7039 7232 7317 7202 7123
4423G123q0j17Q3R3j07r6J06L4L5M7M7n6n6q2J20K32L2j40l9L5o6k8J73J29p2j80j81R9J00
$$ 7123 7043 6926 7009 7102 6995 6899 7005 7039 7074 7121 7168 7112 7056 6974 7094 7326 7358 7218 7179 7214 7148 7120 7293 7422 7350 7170 6989 7088 7188
4408G188jjk6k6P4P4r0r0J31J31J48n2j08j07q9q9J0J09J25p7j14j4J35J34P1J72J12r0j92
$$ 7188 7187 7186 7160 7134 7208 7282 7192 7102 7233 7364 7512 7460 7352 7245 7156 7067 7077 7186 7311 7234 7120 7106 7241 7375 7446 7618 7730 7640 7448
4393G448j92m8J52J02KJ2J12mk05o5o4K4K4O5O6O5O6k2k1J04r7j26P5J16J17j07j07J12q8
$$ 7448 7256 7208 7360 7462 7464 7476 7588 7584 7379 7314 7250 7274 7298 7363 7429 7494 7560 7538 7517 7621 7524 7398 7473 7589 7706 7599 7492 7604 7516
4379G516n3M7k7k8L4o6j28P2J18J7Q7Q7k2k2k3k2M5M5j89j90J29J30q4J17O4O5r1r0K0J9K0
$$ 7516 7463 7510 7483 7455 7489 7423 7295 7367 7485 7502 7589 7676 7654 7632 7609 7587 7632 7677 7488 7298 7427 7557 7473 7590 7654 7719 7628 7538 7558 7577 7597
4363G597J9L4L5K1K2Q8j12%Jm3m4m3m3m0l9J28J29L2L1m7m8j65J69R4j07R6R6p2p1j69L3J33
$$ 7597 7616 7650 7685 7706 7728 7816 7704 7704 7705 7662 7618 7575 7532 7492 7453 7581 7710 7742 7773 7726 7678 7513 7682 7776 7669 7765 7861 7789 7718 7549 7582 7715
4347G715o8o9o8J9J9P6P7K6K6M5M4j9j9J33o8ono7o6lml8J63J13q9l2l3k09pl4l4k1k1K0K1
$$ 7715 7647 7578 7510 7529 7548 7624 7701 7727 7753 7798 7842 7823 7804 7937 7869 7863 7858 7791 7725 7722 7718 7680 7843 7956 7867 7835 7802 7593 7586 7552 7518 7497 7476 7496 7517
4330G517J88J88N4N5MNJJJKk3k2j48N3L1j69ONr4r5ON%jL7L7J81k0R3R3m2m1m2m2P2P3P2P2
$$ 7517 7705 7893 7947 8002 8006 8011 8012 8013 8014 8016 7993 7971 7823 7876 7907 7738 7744 7749 7655 7560 7566 7571 7571 7570 7607 7644 7825 7805 7898 7991 7949 7908 7866 7824 7896 7969 8041 8113
4311H113l3l3l4l3k8k8K2K2R3R2qqm2m2R3j09j70J64J4J4M3M3j24j25J01J00k4J75J24p8j20
$$ 8113 8080 8047 8013 7980 7952 7924 7946 7968 8061 8153 8145 8137 8095 8053 8146 8037 7867 8031 8045 8059 8102 8145 8021 7896 7997 8097 8073 8248 8372 8294 8174
4295H174j19m2m3P1P1r7J04j10j10M3M4p0J31Q5Q4o9p0K6K6q6J14Q3Q4p2p1ononl5l4r7r7
$$ 8174 8055 8013 7970 8041 8112 8015 8119 8009 7899 7942 7986 7916 8047 8132 8216 8147 8077 8103 8129 8043 8157 8240 8324 8252 8181 8175 8170 8164 8159 8124 8090 7993 7896
4278G896K47M6qqQ1Q1Q1Q2j39j38n5K80L53j16j33j33kkM8M8k8k8R7j03k29k9Q1Q0k5k5L8
$$ 7896 8143 8189 8181 8173 8254 8335 8416 8498 8359 8221 8166 8446 8799 8683 8550 8417 8415 8413 8461 8509 8481 8453 8550 8447 8218 8189 8270 8350 8325 8300 8338
4263H338L8j71L1J7J8K4K3K4K4OPM9K49j8k19r3r4P4P4O2O1J39o2n0m9n6n6R9R9J45n6j78
$$ 8338 8376 8205 8236 8253 8271 8295 8318 8342 8366 8372 8379 8428 8677 8659 8440 8347 8253 8327 8401 8463 8524 8663 8601 8551 8502 8446 8390 8489 8588 8733 8677 8499
4247H499j78l8l9q8q9J7J8J18J18J46J46J04r6k21k0m4m5P7P6N2K52J52m9k4k4p7p7j27j28
$$ 8499 8321 8283 8244 8156 8067 8084 8102 8220 8338 8484 8630 8734 8638 8417 8397 8353 8308 8385 8461 8513 8765 8917 8868 8844 8820 8743 8666 8539 8411
4232H411m8m8J20J19J6J6J6J6K3K4p8p7L8L8j88J3K39L9p2K9J27p3RQk11j1K23K3M6M5j34
$$ 8411 8363 8315 8435 8554 8570 8586 8602 8618 8641 8665 8587 8510 8548 8586 8398 8411 8650 8689 8617 8646 8773 8700 8709 8717 8506 8495 8718 8741 8787 8832 8698
4217H698j34L7L8opQ9J89L3l03j36O5L5J36Kr8O5O4J34J34j68j67P8P8K8K8qqNMj68L3K0K0
$$ 8698 8564 8601 8639 8633 8626 8715 8904 8937 8634 8498 8563 8598 8734 8736 8638 8703 8767 8901 9035 8867 8700 8778 8856 8884 8912 8904 8896 8901 8905 8737 8770 8790 8810
4200H810KKJKO1O1J12J11q3q4J42n8j99Kj6j17K2K2M7J47J76k5oo%%j00j01n8n9M2M2O2O1
$$ 8810 8812 8814 8815 8817 8878 8939 9051 9162 9079 8995 9137 9079 8880 8882 8866 8749 8771 8793 8840 8987 9163 9138 9132 9126 9126 9126 9026 8925 8867 8808 8850 8892 8954 9015
4183I015L6K37J82j9NOLLm8m7L7L7o3o3p6p6K4K4o0o0j0j1l3l4O7O7N1N1n0m9J75J74j27j27
$$ 9015 9051 9288 9470 9451 9456 9462 9465 9468 9420 9373 9410 9447 9384 9321 9245 9169 9193 9217 9157 9097 9087 9076 9043 9009 9076 9143 9194 9245 9195 9146 9321 9495 9368 9241
4166I241j5j6k7k6N6j12K7J27PQq7q6k3k3P8P8O4O4r7r7N0J50J43k3j00%L4L3j46j47K0K1
$$ 9241 9226 9210 9183 9157 9213 9101 9128 9255 9262 9270 9183 9097 9074 9051 9129 9207 9271 9335 9238 9141 9191 9341 9484 9461 9361 9361 9395 9428 9282 9135 9155 9176
4150I176J6J6O7O6j2j2J05No2J05J51N1K5j42j49J9J34J34l0k9j05k05p5R2L9L8J50j8k4P8
$$ 9176 9192 9208 9275 9341 9329 9317 9422 9427 9365 9470 9621 9672 9697 9555 9406 9425 9559 9693 9663 9634 9529 9324 9249 9341 9380 9418 9568 9550 9526 9604
4135I604J16J7o8o9R3R3l0l1l0l0O4O4j03j04J19J19m9m8j9j8M2M3r9O9L2o9noQ9J90mj70
$$ 9604 9720 9737 9669 9600 9693 9786 9756 9725 9695 9665 9729 9793 9690 9586 9705 9824 9775 9727 9708 9690 9732 9775 9676 9745 9777 9708 9703 9697 9786 9976 9972 9802
4119I802k6P4j39j39J01J02k8k9P2P3N5N6n8n8j10l11k19J15J47J47N5N5J29p2q5J16K42M0
$$ 9802 9776 9850 9711 9572 9673 9775 9747 9718 9790 9863 9918 9974 9916 9858 9748 9437 9218 9333 9480 9627 9682 9737 9866 9794 9709 9825 10067 10107
4105A0107j47j48J34o7M6M5J3J2j13Q7K60N9n0n0j50j51J7J7N5N5N4N5n0n0N0N1J5J5J5J5
$$ 10107 9960 9812 9946 9879 9925 9970 9983 9995 9882 9969 10229 10288 10238 10188 10038 9887 9904 9921 9976 10031 10085 10140 10090 10040 10090 10141 10156 10171 10186 10201
4090A0201l2l1l1l1J28J27l9m0P9Q0q8q8n5n4M5M6kklkJ1J1R9R9J5j86p3p2J40J39r4r4J42
$$ 10201 10169 10138 10107 10076 10204 10331 10292 10252 10331 10411 10323 10235 10180 10126 10171 10217 10215 10213 10210 10208 10219 10230 10329 10428 10443 10257 10184 10112 10252 10391 10297 10203 10345
4073A0345J42L3j68k12j1L1L1R0Q9j1j1k2k3P8P8N7N7N7N7n7n7n7n7J32J31j03j03q5q5J49
$$ 10345 10487 10520 10352 10140 10129 10160 10191 10281 10370 10359 10348 10326 10303 10381 10459 10516 10573 10630 10687 10630 10573 10516 10459 10591 10722 10619 10516 10431 10346 10495
4058A0495J50Q2Q2R5j06j21j20r1J10O7j33R3R3j12j12j1j2J35J35j00r9K3K3J23J24R0R0
$$ 10495 10645 10727 10809 10904 10798 10677 10557 10466 10576 10643 10510 10603 10696 10584 10472 10461 10449 10584 10719 10619 10520 10543 10566 10689 10813 10903 10993
4045A0993j7j7m9j49j06R5n9o0J23K2k05nR8R9R8j03k03kJ17J18l8l7ooR4R5p2p1p1p2J65
$$ 10993 10976 10959 10910 10761 10655 10750 10691 10631 10754 10776 10571 10566 10664 10763 10861 10758 10555 10553 10670 10788 10750 10713 10707 10701 10795 10890 10818 10747 10676 10604 10769
4029A0769J65klM3M2n8n7j00j00O8O7J4J3J14J14k6k6R3j08L5J35l4l4P0P1P0P1k0k0k0k0
$$ 10769 10934 10932 10929 10972 11014 10956 10899 10799 10699 10767 10834 10848 10861 10975 11089 11063 11037 11130 11022 11057 11192 11158 11124 11194 11265 11335 11406 11386 11366 11346 11326
4013A1326kjjjR2R2rqr5r4q8q8nR6J58m3p8K2o0n9K67O6k96r5J10K11K67O6O3j38j50N1kj
$$ 11326 11324 11323 11322 11321 11413 11505 11496 11488 11393 11299 11211 11123 11118 11214 11372 11329 11251 11273 11213 11154 11421 11487 11191 11096 11206 11417 11684 11750 11813 11675 11525 11576 11574 11573
3996A1573J30p1mR6j1j11q0K0M6M6J01j00j13Q8R5j06l7O3L7L6n7n7N7N8N8N8n9n9m6m6j45
$$ 11573 11703 11632 11628 11724 11713 11602 11522 11542 11588 11634 11735 11635 11522 11610 11705 11599 11562 11625 11662 11698 11641 11584 11641 11699 11757 11815 11756 11697 11651 11605 11460
3981A1460N6L04J02j34O7N4j47J9J8OPMNj08R2Q3Q2R5R4j55j55J2J2n7n7J10J11J00J01j%
$$ 11460 11516 11820 11922 11788 11855 11909 11762 11781 11799 11805 11812 11816 11821 11713 11805 11888 11970 12065 12159 12004 11849 11861 11873 11816 11759 11869 11980 12080 12181 12180 12180
3965A2180J9J9L1j70k1k2j47N4R7R8n7n7m4m4J24J23K6K5K5K5o4o5K3K3K05Nj63L7N3N3l5
$$ 12180 12199 12218 12249 12079 12058 12036 11889 11943 12040 12138 12081 12024 11980 11936 12060 12183 12209 12234 12259 12284 12220 12155 12178 12201 12406 12411 12248 12285 12338 12391 12356
3950A2356l5%J%JK7K7j40j41l7l8J30J29k6k6J28J29J54m7q9q9j01J00K68O7k01k01Q8Q8l8
$$ 12356 12321 12321 12322 12322 12323 12350 12377 12237 12096 12059 12021 12151 12280 12254 12228 12356 12485 12639 12592 12503 12414 12313 12413 12681 12748 12547 12346 12434 12522 12484
3935A2484l8O2O3n1n0n1n0J05J05k8J72J51j83r6J06llJ35o6k47m7J83J83J00j02K5K4j72
$$ 12484 12446 12508 12571 12520 12470 12419 12369 12474 12579 12551 12723 12874 12691 12595 12701 12698 12695 12830 12764 12517 12470 12653 12836 12936 12834 12859 12883 12711
3921A2711K8J29p2ppj9j9P3P2P3P3p5p6R3R2kkj5j5M4j58m5m4J8J8J8J8JJJJn2n1J16J15N6
$$ 12711 12739 12868 12796 12789 12782 12763 12744 12817 12889 12962 13035 12960 12884 12977 13069 13067 13065 13050 13035 13079 12921 12876 12832 12850 12868 12886 12904 12905 12906 12907 12908 12856 12805 12921 13036 13092
3903A3092N6N6N6K5K4p6p6P7P7k4k3J2J2J2J2m1m1qJ94K58p6k44R1J19q1m9m8MMR2R2P5j26
$$ 13092 13148 13204 13260 13285 13309 13233 13157 13234 13311 13287 13264 13276 13288 13300 13312 13271 13230 13222 13416 13674 13598 13354 13445 13564 13483 13434 13386 13390 13394 13486 13578 13653 13527
3886A3527j3j3o3o3j76K4K26K25J29p1n5J46M6j56r4J06J06r4o8J34r3r2j2j1Q9Q9J35J35
$$ 13527 13514 13501 13438 13375 13199 13223 13449 13674 13803 13732 13677 13823 13869 13713 13619 13725 13831 13737 13669 13803 13710 13618 13606 13595 13684 13773 13908 14043
3872A4043L4L5N8N9l0k9j56M6L4L3P3P4k7k7kkJ24p7j25P5m9n0n9n8M2M2K3K2J77J77M9j51
$$ 14043 14077 14112 14170 14229 14199 14170 14014 14060 14094 14127 14200 14274 14247 14220 14218 14216 14340 14263 14138 14213 14164 14114 14055 13997 14039 14081 14104 14126 14303 14480 14529 14378
3856A4378j51M9llr0r1J14J14J02J02J8j83q2J18R6R5n9o0n0n0N0N0O7O7j59M2K01Jm0m1L2
$$ 14378 14227 14276 14273 14270 14180 14089 14203 14317 14419 14521 14539 14356 14274 14392 14488 14583 14524 14464 14414 14364 14414 14464 14531 14598 14439 14481 14682 14683 14643 14602 14634
3840A4634L2r3J08O1j40M0K40q7q8K5K6l9l8O1O2J04J04LLl4l4j34j35J63J63J08r3onQ2Q2
$$ 14634 14666 14573 14681 14742 14602 14642 14882 14795 14707 14732 14758 14719 14681 14742 14804 14908 15012 15015 15018 14984 14950 14816 14681 14844 15007 15115 15022 15016 15011 15093 15175
3825A5175j82j81q1q1K36K36LKJ46J47q8q8l4l5P9j22m9m9j62J73M6j55J47J46Q1Q0r5J06
$$ 15175 14993 14812 14731 14650 14886 15122 15125 15127 15273 15420 15332 15244 15210 15175 15254 15132 15083 15034 14872 15045 15091 14936 15083 15229 15310 15390 15295 15401
3811A5401N2j48P8P7MLr7r7O6O6N4N4J60m1P3P2rrrrK8K9o0n9j45N7M3M4J36J35q6q6j05R5
$$ 15401 15453 15305 15383 15460 15464 15467 15370 15273 15339 15405 15459 15513 15673 15632 15705 15777 15768 15759 15750 15741 15769 15798 15738 15679 15534 15591 15634 15678 15814 15949 15863 15777 15672 15767
3794A5767J50J50R1R2j8k18j55M7Q8Q8m6m5mJ97K30L0j0j11k16j6l4l4L1L0P5P4k9j29j9J83
$$ 15767 15917 16067 16158 16250 16232 16014 15859 15906 15994 16082 16036 15991 15987 16184 16414 16444 16434 16323 16107 16091 16057 16023 16054 16084 16159 16233 16204 16075 16056 16239
3779A6239J07J07Mj96m2N9Q8J89J25p6k47j47N8N8R6J96R3j08j44j44l2J68J11J1L2L3j00
$$ 16239 16346 16453 16457 16261 16219 16278 16366 16555 16680 16604 16357 16210 16268 16326 16422 16618 16711 16603 16459 16315 16283 16451 16562 16573 16605 16638 16538
3765A6538J01J44n7O3J63L1L1j30j30J55J56N5N5q0p9L4L3j94OK51J51J00J01k07k07n7n6
$$ 16538 16639 16783 16726 16789 16952 16983 17014 16884 16754 16909 17065 17120 17175 17095 17016 17050 17083 16889 16895 17146 17297 17397 17498 17291 17084 17027 16971
3751A6971M4M4R4R5ooK1K1p9p9P8P7P8P8ppppM5M6J14q7K8J28j09j08J20J19J9J9J07J07j27
$$ 16971 17015 17059 17153 17248 17242 17236 17257 17278 17199 17120 17198 17275 17353 17431 17424 17417 17410 17403 17448 17494 17608 17521 17549 17677 17568 17460 17580 17699 17718 17737 17844 17951 17824
3735A7824j27J24J24j10j10R4R4M4M4O4O5O5O4j17j17nmn3J49J98kr8r7j0j0K5K5K5K5J56
$$ 17824 17697 17821 17945 17835 17725 17819 17913 17957 18001 18065 18130 18195 18259 18142 18025 18020 18016 17963 18112 18310 18308 18210 18113 18103 18093 18118 18143 18168 18193 18349
3720A8349J57j1j0O7O8j00r9J6J7J17J17k1k0j96NJ26p6N0N0p6p5R1R2J16J15J6J5q9r0j8
$$ 18349 18506 18495 18485 18552 18620 18520 18421 18437 18454 18571 18688 18667 18647 18451 18456 18582 18506 18556 18606 18530 18455 18546 18638 18754 18869 18885 18900 18811 18721 18703
3705A8703j8k24J10J57J56l1l2O9P0j24j23r9K37L22j2k5k5k72p0N8K60J51m9k4k5j12j12
$$ 18703 18685 18461 18571 18728 18884 18853 18821 18890 18960 18836 18713 18614 18851 19173 19161 19136 19111 18839 18769 18827 19087 19238 19189 19165 19140 19028 18916
3691A8916P6K77J10J10m4m5m1m2RRJ83J83Q3Q3r5r6m4m5L5L5L5L5J81J80n4n3j36j36L1L2
$$ 18916 18992 19269 19379 19489 19445 19400 19359 19317 19326 19335 19518 19701 19784 19867 19772 19676 19632 19587 19622 19657 19692 19727 19908 20088 20034 19981 19845 19709 19740 19772
3676A9772rrJ58J58K6K6P6P6J4J4m8m9Lj98j48N2J28J29M0M0J7J7J8J7K2K3o2J40K70o6k11
$$ 19772 19763 19754 19912 20070 20096 20122 20198 20274 20288 20302 20254 20205 20208 20010 19862 19914 20042 20171 20211 20251 20268 20285 20303 20320 20342 20365 20303 20443 20713 20647 20436
3661B0436j1L7L8%jQ6Q5j4j5j7j7L3L3l9m0j4L20K75n9k77p6K06Nq2J18j08j08J40J39M7M8
$$ 20436 20425 20462 20500 20500 20499 20585 20670 20656 20641 20624 20607 20640 20673 20634 20594 20580 20900 21175 21116 20839 20763 20969 20974 20892 21010 20902 20794 20934 21073 21120 21168
3645B1168n2n3L6L7k7k6K97R6k72p1l5l5k2k2Q4Q3Q3Q4j%j01j00K04K05j7j7r8J03M1M0R7
$$ 21168 21116 21063 21099 21136 21109 21083 21380 21476 21204 21133 21098 21063 21041 21019 21103 21186 21269 21353 21352 21352 21251 21151 21355 21560 21543 21526 21428 21531 21572 21612 21709
3629B1709R6RRj37O4m9m9J13J14J13J13j10j11J24J23K5K5K5K5n3n2M7M8j07j07ppR7R7M6
$$ 21709 21805 21814 21823 21686 21750 21701 21652 21765 21879 21992 22105 21995 21884 22008 22131 22156 22181 22206 22231 22178 22126 22173 22221 22114 22007 22000 21993 22090 22187 22233
3614B2233M7O5O4m8J53J93J94r5r6J0RRJ0J3J4J3J4q3q3Q5Q5J5J6J04J03R2j08rJ93j31j32
$$ 22233 22280 22345 22409 22361 22514 22707 22901 22806 22710 22720 22729 22738 22748 22761 22775 22788 22802 22719 22636 22721 22806 22821 22837 22941 23044 23136 23028 23019 23212 23081 22949
3599B2949j9j8K8K8K8K8O3O4j6j6j58J76K10K10J74k7o8o8p8J23J23p8j07j08J15J15n3n2
$$ 22949 22930 22912 22940 22968 22996 23024 23087 23151 23135 23119 22961 23137 23347 23557 23731 23704 23636 23568 23490 23613 23736 23658 23551 23443 23558 23673 23620 23568
3585B3568n3n2J33J34L3L4l7l7N2N1J39o2j62L9k2k2J58J58K6K6K6K7M8M9n1n2PPJ08J07M8
$$ 23568 23515 23463 23596 23730 23763 23797 23760 23723 23775 23826 23965 23903 23741 23780 23758 23736 23894 24052 24078 24104 24130 24157 24205 24254 24203 24151 24158 24165 24273 24380 24428
3569B4428M8J61m0j11j11J10J11qqpqj52j52J5J5J33J32L2L2rj0k2J78Q4Q4mmn7n6M4M4O1
$$ 24428 24476 24637 24597 24486 24375 24485 24596 24588 24580 24573 24565 24413 24261 24276 24291 24424 24556 24588 24620 24611 24601 24579 24757 24841 24925 24921 24917 24860 24804 24848 24892 24953
3553B4953O2n2J49M3M2N5N5M5M4o8J32j29j29j7j6O8O8n7J43P4j26jjM4M5M5M4l6l7O3O4K5
$$ 24953 25015 24963 25112 25155 25197 25252 25307 25352 25396 25328 25460 25331 25202 25185 25169 25237 25305 25248 25391 25465 25339 25338 25337 25381 25426 25471 25515 25479 25442 25505 25569 25594
3537B5594K4K5K5P1P1P1P1J36J36l9k40j23P8m8m8J31J30l6l7K2K2K1K2QPnJ96l0l1Q3Q3O1
$$ 25594 25618 25643 25668 25739 25810 25881 25952 26088 26224 26185 25945 25822 25900 25852 25804 25935 26065 26029 25992 26014 26036 26057 26079 26087 26094 26089 26285 26255 26224 26307 26390 26451
3521B6451O2O7O8l7O3J26p4%J00L1L1OOOOr7r6Q3Q4o1J40L9j61J21J21QQJ6J6J7J6K2K2K2
$$ 26451 26513 26580 26648 26611 26674 26800 26726 26726 26826 26857 26888 26894 26900 26906 26912 26815 26719 26802 26886 26825 26965 27004 26843 26964 27085 27093 27101 27117 27133 27150 27166 27188 27210 27232
3504B7232K2J5J6J5J6r4r5POJ90J91m4m4j9j9j3j3P3J73P6j26n2J50K4K4n0m9J24J25N2J52
$$ 27232 27254 27269 27285 27300 27316 27222 27127 27134 27140 27330 27521 27477 27433 27414 27395 27382 27369 27442 27615 27691 27565 27513 27663 27687 27711 27661 27612 27736 27861 27913 28065
3488B8065J08r2r0r1n5J47M9n0N6J56Q4j7j1Q9J03J02%k01j42N8o1o1N7J57rk09L2K32J63
$$ 28065 28173 28081 27991 27900 27845 27992 28041 27991 28047 28203 28287 28270 28259 28348 28451 28553 28553 28352 28210 28268 28207 28146 28203 28360 28351 28142 28174 28406 28569
3474B8569O3k3k3l0k9k7k7P3P3j5j5N3m6j33O9J16J17K8K9K9K8L3L3K0K0j16l17k8J73K27
$$ 28569 28632 28609 28586 28556 28527 28500 28473 28546 28619 28604 28589 28642 28596 28463 28532 28648 28765 28793 28822 28851 28879 28912 28945 28965 28985 28869 28552 28524 28697 28924
3459B8924K6p9K2J09Qk9k9K9K9L0K9L7L6O2j39K6K27J58N7m7m7M7M8LLMLJ7J7J7J7K3K3K3
$$ 28924 28950 28871 28893 29002 29010 28981 28952 28981 29010 29040 29069 29106 29142 29204 29065 29091 29318 29476 29533 29486 29439 29486 29534 29537 29540 29544 29547 29564 29581 29598 29615 29638 29661 29684
3442B9684K4j24j24k9l0K07J06L7K39J2j88M6K47J03r8r2J09m1j41p1p2J33J33J21J21p8k79
$$ 29684 29708 29584 29460 29431 29401 29608 29714 29751 29990 30002 29814 29860 30107 30210 30112 30020 30129 30088 29947 29876 29804 29937 30070 30191 30312 30234 29955
3428B9955K2K23M8M7J80k2q0K0N2N1L3L3p4p4j7j18j74K7ppJ06J07JKJ02J02N6N6m5m4N3N2
$$ 29955 29977 30200 30248 30295 30475 30453 30373 30393 30445 30496 30529 30562 30488 30414 30397 30279 30105 30132 30125 30118 30224 30331 30332 30334 30436 30538 30594 30650 30605 30561 30614 30666
3412C0666j08j08O9J70O0j42m0m1M8M7P9P9k1k1M3M3L6L7lj03j67L5K2p8R2R1N4N4N3N4lk
$$ 30666 30558 30450 30519 30689 30749 30607 30567 30526 30574 30621 30700 30779 30758 30737 30780 30823 30859 30896 30893 30790 30623 30658 30680 30602 30694 30785 30839 30893 30946 31000 30997 30995
3396C0995llO6O7l4l5J4J4J4J3k8k8k8k8K5K4%K00J54m6p2K9j21k0J55m6j37O3J12J11K9J29
$$ 30995 30992 30989 31055 31122 31088 31053 31067 31081 31095 31108 31080 31052 31024 30996 31021 31045 31045 31245 31399 31353 31281 31310 31189 31169 31324 31278 31141 31204 31316 31427 31456 31585
3380C1585J79k1r3j93r4J06L8L8N1N1m2m1m1m2M9M9J49J50L2L2j33k34r3J08Q9Q9n1n2J17
$$ 31585 31764 31743 31650 31457 31363 31469 31507 31545 31596 31647 31605 31564 31523 31481 31530 31579 31728 31878 31910 31942 31809 31575 31482 31590 31679 31768 31717 31665 31782
3365C1782J16onnnP2P2l4l5oj07rJ92J36o5j74j74Q4Q4j7j6j07j06opQ1Q0Q0Q0J02J01%Jl3
$$ 31782 31898 31892 31887 31882 31877 31949 32021 31987 31952 31946 31839 31830 32022 32158 32093 31919 31745 31829 31913 31896 31880 31773 31667 31661 31654 31735 31815 31895 31975 32077 32178 32178 32179 32146
3348C2146l2l3l3l9l9l9l9%%J%j5j4Q6Q6j2j2j1j2R3R3k0k0K7j74j11j1j3Q8K51N0R4R3q6
$$ 32146 32114 32081 32048 32009 31970 31931 31892 31892 31892 31893 31893 31878 31864 31950 32036 32024 32012 32001 31989 32082 32175 32155 32135 32162 31988 31877 31866 31853 31941 32192 32242 32336 32429 32343
3331C2343q6ONj61j62NMJ04J05O9O9J3J3j6j16j36O6J05r7k1k1JJJ08J07L6J36J04r6j10R2
$$ 32343 32257 32263 32268 32107 31945 31950 31954 32058 32163 32232 32301 32314 32327 32311 32195 32059 32125 32230 32133 32112 32091 32092 32093 32201 32308 32344 32480 32584 32488 32378 32470
3316C2470l4l5L2L2K51N1k08j08n8j58j32O9J74P3r7r6j16Q6n8n8N5N6J2J2l8l8PPN8N7N9
$$ 32470 32436 32401 32433 32465 32716 32767 32559 32451 32393 32235 32103 32172 32346 32419 32322 32226 32110 32196 32138 32080 32135 32191 32203 32215 32177 32139 32146 32153 32211 32268 32327
3300C2327N8RQr4r4P3P3O4O4j71j70j6j6Q5Q5N6N7m3m4o9o9J58m4j57M4J9K0l8l7k5k5q9J12
$$ 32327 32385 32394 32402 32308 32214 32287 32360 32424 32488 32317 32147 32131 32115 32200 32285 32341 32398 32355 32311 32242 32173 32331 32287 32130 32174 32193 32213 32175 32138 32113 32088 31999 32111
3284C2111K12J2q0p9m8m8J39M0j18Q3p3p2J53m8j08j09J20J19k2P9M1j60j6Q3l5l5n6n5m9
$$ 32111 32323 32335 32255 32176 32128 32080 32219 32259 32141 32224 32151 32079 32232 32184 32076 31967 32087 32206 32184 32263 32304 32144 32128 32211 32176 32141 32085 32030 31981
3269C1981m9J3J14Q2j19o9J33J19q1opj8j9J2J3j9j20j21Q0M9M8J08r3k4k4n6M4Pj94m3N8
$$ 31981 31932 31945 32059 32141 32022 31953 32086 32205 32124 32118 32111 32093 32074 32086 32099 32080 31960 31839 31919 31968 32016 32124 32031 32007 31983 31927 31971 31978 31784 31741 31799
3254C1799Q9Q9n1n1l8l9p0J32M3j58j39O2M3M3m0O0J29p2q8J14j12j13l6l6J4J5N9O0m1m1
$$ 31799 31888 31977 31926 31875 31837 31798 31728 31860 31903 31745 31606 31668 31711 31754 31714 31774 31903 31831 31743 31857 31745 31632 31596 31560 31574 31589 31648 31708 31667 31626
3238C1626J07J07N2j48n4n4p9J21N1N0O3O4l5l5l5l4PPr3r4q6q6J50N0k36l6J2J2k4k5P6P6
$$ 31626 31733 31840 31892 31744 31690 31636 31557 31678 31729 31779 31842 31906 31871 31836 31801 31767 31774 31781 31688 31594 31508 31422 31572 31622 31386 31350 31362 31374 31350 31325 31401 31477
3222C1477M3M3k7P4k1k22lkm7m6q4q4r1J10Mr7J35J35j06j05J%J01J02j06j06j06j06k2k2
$$ 31477 31520 31563 31536 31610 31589 31367 31364 31362 31315 31269 31185 31101 31010 31120 31124 31027 31162 31297 31191 31086 31087 31087 31188 31290 31184 31078 30972 30866 30844 30822
3207C0822P9P8KJJ02J01j49j49J8J9P8P9k1k2k4k4Q9j12j60j60n2J50L2L1j23j23%%J%r6r5
$$ 30822 30901 30979 30981 30982 31084 31185 31036 30887 30905 30924 31002 31081 31060 31038 31014 30990 31079 30967 30807 30647 30595 30745 30777 30808 30685 30562 30562 30562 30563 30563 30467 30372
3191C0372J39J39j02j02j02j01M9M9M9M9m5m5m5m5j11j12J22J22MLj10R1JJJ3J4m3m3N7N7
$$ 30372 30511 30650 30548 30446 30344 30243 30292 30341 30390 30439 30394 30349 30304 30259 30148 30036 30158 30280 30284 30287 30177 30268 30269 30270 30283 30297 30254 30211 30268 30325
3176C0325j01j02K4j77j24P6N1N1L1L1p0p0J04J04j97j98J4J4J4J4m0m0J14J14N6j46m5m5
$$ 30325 30224 30122 30146 29969 29845 29921 29972 30023 30054 30085 30015 29945 30049 30153 29956 29758 29772 29786 29800 29814 29774 29734 29848 29962 30018 29872 29827 29782
3162B9782Lj98j98LK6K6L8L9P4P4q1q1p4J26J26p5n2n1o5o4n5n5n4n5R8R7o9p0j08j08r6r6
$$ 29782 29785 29587 29389 29392 29418 29444 29482 29521 29595 29669 29588 29507 29433 29559 29685 29610 29558 29507 29442 29378 29323 29268 29214 29159 29257 29354 29285 29215 29107 28999 28903 28807
3146B8807m4J58M4M4l6l6l6l6j2j1j1j1j5j6j6j5J31J31j04j03J32J32m2m2j08k10k71p1J87
$$ 28807 28763 28921 28965 29009 28973 28937 28901 28865 28853 28842 28831 28820 28805 28789 28773 28758 28889 29020 28916 28813 28945 29077 29035 28993 28885 28675 28404 28333 28520
3132B8520Q7N6N6n1n1Q3j17k85N1J41M0MNkjj8j7m9j49nJ96l2k33j19Q2j06oO7l3L0L0m7m6
$$ 28520 28607 28663 28719 28668 28617 28700 28583 28298 28349 28490 28530 28534 28539 28537 28536 28518 28501 28452 28303 28298 28494 28462 28229 28110 28192 28086 28080 28147 28114 28144 28174 28127 28081
3115B8081m7m6r5r5r4r5J06J06NNk6k6J41J42j82j82q1q1ook5J76L2o8m1k42k10j0R9J00O3
$$ 28081 28034 27988 27893 27798 27704 27609 27715 27821 27826 27831 27805 27779 27920 28062 27880 27698 27617 27536 27530 27524 27499 27675 27707 27639 27598 27356 27146 27136 27235 27335 27398
3099B7398O4l1l1O2J61rk11r9Ko7o7k4k3QJ08R5j06k06oQ7j4m5m6J5J4J4J5N2N2L9L9k10m10
$$ 27398 27462 27431 27400 27462 27623 27614 27403 27304 27306 27239 27172 27148 27125 27133 27241 27336 27230 27024 27018 27105 27091 27046 27000 27015 27029 27043 27058 27110 27162 27201 27240 27030 26620
3083B6620j92J44J60O0K7p4m9m9n5n6O0O0K9p2j31P1m9m9K6K7O0j41j39J97M5n4j3j13j20
$$ 26620 26428 26572 26732 26792 26819 26745 26696 26647 26592 26536 26596 26656 26685 26613 26482 26553 26504 26455 26481 26508 26568 26427 26288 26485 26530 26476 26463 26350 26230
3068B6230j9k8k9k2k2Q6Q7q7q7r2j92k7J74J32o9j65j65q8J13J14q8j02j02N2N3j2j1J44J43
$$ 26230 26211 26183 26154 26132 26110 26196 26283 26196 26109 26017 25825 25798 25972 26104 26035 25870 25705 25617 25730 25844 25756 25654 25552 25604 25657 25645 25634 25778 25921
3054B5921M3j57j01jj41j40k2k1m4J56O5k71q2q2J32J31m6m7J21J21j24j25j12j12JK02L8
$$ 25921 25964 25807 25706 25705 25564 25424 25402 25381 25337 25493 25558 25287 25205 25123 25255 25386 25340 25293 25414 25535 25411 25286 25174 25062 25063 25265 25303
3040B5303o2o5j65o5L5n0N0K26K5k6J74nk06j56j56kjk1k1j21j22N4N5M8M8Pr4j56M5O3l7
$$ 25303 25241 25176 25011 24946 24981 24931 24981 25207 25232 25206 25380 25375 25169 25013 24857 24855 24854 24833 24812 24691 24569 24623 24678 24726 24774 24781 24687 24531 24576 24639 24602
3025B4602l1P0N8m2m9N2K3j78j16j5j20j21j4j4N5N5N5N5m6m6m7m6p8p7K2K3q0q1j93PK1K0
$$ 24602 24571 24641 24699 24657 24608 24660 24683 24505 24389 24374 24254 24133 24119 24105 24160 24215 24270 24325 24279 24233 24186 24140 24062 23985 24007 24030 23950 23869 23676 23683 23704 23724
3009B3724L2L3j1j1j11j11O0O1O0O0Q9Q9p8p9K7K6K6K6j51j51J6J7P5P4r2r3n9o0j85J6J43
$$ 23724 23756 23789 23778 23767 23656 23545 23605 23666 23726 23786 23875 23964 23886 23807 23834 23860 23886 23912 23761 23610 23626 23643 23718 23792 23700 23607 23548 23488 23303 23319 23462
2993B3462n7k13j1J33J33k2k2j29j28q7J14K6j76j63L8K6K5L8L8LLJ12k23k67O8J3J3J14q7
$$ 23462 23405 23192 23181 23314 23447 23425 23403 23274 23146 23059 23173 23199 23023 22860 22898 22924 22949 22987 23025 23028 23031 23143 22920 22653 22721 22734 22747 22861 22774
2978B2774p4p5NNJ8J8j1J91J91j0k05k05k30k8O6O6P8P9r7r7LMRJ0RJ0n5n6k68o8K43K43K2
$$ 22774 22700 22625 22630 22635 22653 22671 22660 22851 23042 23032 22827 22622 22392 22364 22430 22496 22574 22653 22556 22459 22462 22466 22475 22485 22494 22504 22449 22393 22125 22057 22300 22543 22565
2962B2565K1j08j09Nj96l9m0n2n1O9P0Q2j19J8J8j59k60q5J17K11J0kjq2J7J37o4m5m5j07
$$ 22565 22586 22478 22369 22374 22178 22139 22099 22047 21996 22065 22135 22217 22098 22116 22134 21975 21715 21630 21747 21958 21968 21966 21965 21883 21900 22037 21973 21928 21883 21776
2947B1776j07j07j07J50J50q4q4O0O0j07j07rrrqj32j32J69J69L2L1p6p5M6n5j23P7O1j41
$$ 21776 21669 21562 21455 21605 21755 21671 21587 21647 21707 21600 21493 21484 21475 21466 21458 21326 21194 21363 21532 21564 21595 21519 21444 21490 21435 21312 21389 21450 21309
2932B1309p1K9N0M9r9r9p8J22J17q5j09k09j93J42J00%L3o7j45j45Q4Q3j01j00J33J34n0m9
$$ 21309 21238 21267 21317 21366 21267 21168 21090 21212 21329 21244 21135 20926 20733 20875 20975 20975 21008 20941 20796 20651 20735 20818 20717 20617 20750 20884 20834 20785
2918B0785J11J12jj02j58M2nnl4k35j60M1Q3Q2l3l4l4l4M0L9o1o1ooR4R5q2q1Q6Q6j20j20
$$ 20785 20896 21008 21007 20905 20747 20789 20784 20779 20745 20510 20350 20391 20474 20556 20523 20489 20455 20421 20461 20500 20439 20378 20372 20366 20460 20555 20473 20392 20478 20564 20444 20324
2902B0324j9k0P2P3k8k8j19j19j9j8J3J2j54j55L4L4L3L4J1J1J36o5j50N0L8j64j13j13M2
$$ 20324 20305 20285 20357 20430 20402 20374 20255 20136 20117 20099 20112 20124 19970 19815 19849 19883 19916 19950 19961 19972 20108 20043 19893 19943 19981 19817 19704 19591 19633
2888A9633M2Q0Q0qqj16Q4J72j63r8J02m4m4J4j86k0J82NMj38j38q9J11j02j03N3N3n9J40P
$$ 19633 19675 19755 19835 19827 19819 19703 19787 19959 19796 19698 19800 19756 19712 19726 19540 19520 19702 19707 19711 19573 19435 19346 19457 19355 19252 19305 19358 19299 19439 19446
2873A9446PK0K0j52j51LLJ50n1j52N0M3M4K57p8j99Kpk07k57n5L2L2K22j12k04mP3P4q2q2
$$ 19446 19453 19473 19493 19341 19190 19193 19196 19346 19295 19143 19193 19236 19280 19537 19459 19260 19262 19255 19048 18791 18736 18768 18800 19022 18910 18706 18702 18775 18849 18767 18685
2857A8685Q4Q4j7j7N8N8J71k9j68j68q0J21J46j88j01J01J02J03j19j20Q8Q8p9q0n6n7M4M4
$$ 18685 18769 18853 18836 18819 18877 18935 19106 19077 18909 18741 18661 18782 18928 18740 18639 18740 18842 18945 18826 18706 18794 18882 18803 18723 18667 18610 18654 18698
2843A8698ooJ06r4p3p3q6q6k2k2J45J45j02j02j02j02M0M1j14j14k11rJ78J79P7P7O5O5N4
$$ 18698 18692 18686 18792 18698 18625 18552 18466 18380 18358 18336 18481 18626 18524 18422 18320 18218 18258 18299 18185 18071 17860 17851 18029 18208 18285 18362 18427 18492 18546
2828A8546j47j34j34j2j1j13j12K7K7K7K7jkn2n2Q8Q8j2j2l3l3q3q3M7M8r9r8k43R2K39L7
$$ 18546 18399 18265 18131 18119 18108 17995 17883 17910 17937 17964 17991 17990 17988 17936 17884 17972 18060 18048 18036 18003 17970 17887 17804 17851 17899 17800 17702 17459 17551 17790 17827
2813A7827Q5j16j79K2M9M8l9m0N2N1p4J27j1k12q7q6L6L7L7L7PPk20j8J88j3n5n5l4l4q4q4
$$ 17827 17912 17796 17617 17639 17688 17736 17697 17657 17709 17760 17686 17813 17802 17590 17503 17417 17453 17490 17527 17564 17571 17578 17358 17340 17528 17515 17460 17405 17371 17337 17253 17169
2797A7169n4n4M6M7k3k3J45J44o0o1K7K8m0k41pJ94Q5Q6p0o9p4p4K7K6l7l7l7l8K3K3P3P3
$$ 17169 17115 17061 17107 17154 17131 17108 17253 17397 17337 17276 17303 17331 17291 17050 17043 17237 17322 17408 17338 17269 17195 17121 17148 17174 17137 17100 17063 17025 17048 17071 17144 17217
2781A7217j22j23k23J12J73k8ONj19j20k0j9m7m6N5N4l2l1l2l1o4o4L7L7p4p4q7J14J38J37
$$ 17217 17095 16972 16749 16861 17034 17006 17012 17017 16898 16778 16758 16739 16692 16646 16701 16755 16723 16692 16660 16629 16565 16501 16538 16575 16501 16427 16340 16454 16592 16729
2766A6729j7j7j34j34q0J21J04J03j19k0R5j05k66o6J68J68J2J3l5l5j0k11RK11J42M1r6r6
$$ 16729 16712 16695 16561 16427 16347 16468 16572 16675 16556 16536 16631 16526 16260 16194 16362 16530 16542 16555 16520 16485 16475 16264 16273 16484 16626 16667 16571 16475
2752A6475N3N2J2j89j45N6J11J1p5p5m0J61Pj95j24P6l6j37RJ09Rr1l2O9m4m5non6n6O1O0
$$ 16475 16528 16580 16592 16403 16258 16314 16425 16436 16361 16286 16246 16407 16414 16219 16095 16171 16135 15998 16007 16116 16125 16034 16002 16071 16027 15982 15977 15971 15915 15859 15920 15980
2736A5980j07j07R0R0M0M0l5l4O6O6M7M7j20j20p9p8R5R6oR6N1j50j43j43j01R9L0L0n8n9
$$ 15980 15873 15766 15856 15946 15986 16026 15991 15957 16023 16089 16136 16183 16063 15943 15864 15786 15881 15977 15971 16067 16118 15968 15825 15682 15581 15680 15710 15740 15682 15623
2720A5623rj0j0j0k8k8O7O6kj03o0J42L4L4M6M7j13j12N6m3j74K7QRn1n0N0N0O8O9l3l2n7
$$ 15623 15614 15604 15594 15584 15556 15528 15595 15661 15659 15556 15496 15638 15672 15706 15752 15799 15686 15574 15630 15587 15413 15440 15448 15457 15406 15356 15406 15456 15524 15593 15560 15528 15471
2704A5471n8J10J10r0r0J0J0m0m0O0O1q5q5Q9Q9j56n6J01r9QQj05j04p0p1j20j21J93J92R1
$$ 15471 15413 15523 15633 15543 15453 15463 15473 15433 15393 15453 15514 15429 15344 15433 15522 15366 15310 15411 15312 15320 15328 15223 15119 15049 14978 14858 14737 14930 15122 15213
2689A5213j09j66J68J74k6j0j10j23k2o6o7M1M0N8N8n6n5M0j61j17Q4O4l7j87J4O9l1L7L8
$$ 15213 15104 14938 15106 15280 15254 15244 15134 15011 14989 14923 14856 14897 14937 14995 15053 14997 14942 14982 14821 14704 14788 14852 14815 14628 14642 14711 14680 14717 14755
2674A4755o7o7j86J4O7l4L5L6K7K8m2N9J24p7n8n9n7n8J16J16m7N3J16q5j13j3J8J9r9r8n7
$$ 14755 14688 14621 14435 14449 14516 14482 14517 14553 14580 14608 14566 14625 14749 14672 14614 14555 14498 14440 14556 14672 14625 14678 14794 14709 14596 14583 14601 14620 14521 14423 14366
2659A4366J44m2k43J0K11L7J38J06r5j24j25L1L0j01j02j%l0k9l5l5J26K5l7J63J75P5M3M3
$$ 14366 14510 14468 14225 14235 14446 14483 14621 14727 14632 14508 14383 14414 14444 14343 14241 14240 14240 14210 14181 14146 14111 14237 14262 14225 14388 14563 14638 14681 14724
2644A4724j29j28k8k8O2O3L0o9j80K2P2j30m1N8j0j1k6k6j4j3j09R2R1j09K0K0PPm3m3PPq1
$$ 14724 14595 14467 14439 14411 14473 14536 14566 14497 14317 14339 14411 14281 14240 14298 14288 14277 14251 14225 14211 14198 14089 14181 14272 14163 14183 14203 14210 14217 14174 14131 14138 14145 14064
2628A4064q0L2L2l6J64J14q7j40j40Q2Q1J38J39r7k97k76N9R2R2n8n9L0L0Q4j17j05K31Q4
$$ 14064 13984 14016 14048 14012 14176 14290 14203 14063 13923 14005 14086 14224 14363 14266 13969 13693 13752 13844 13936 13878 13819 13849 13879 13963 13846 13741 13972 14056
2614A4056j16q3q3K4K4p7p7J2J2J1J2N6N5n7n7J34o7j67L4opJ07J07K0K0L3L3k41l9J5J5O
$$ 14056 13940 13857 13774 13798 13822 13745 13668 13680 13692 13703 13715 13771 13826 13769 13712 13846 13779 13612 13646 13640 13633 13740 13847 13867 13887 13920 13953 13712 13673 13688 13703 13709
2598A3709PN6N7q0q1q0q0L3L4j34j33R1R1M1M1M9M8n1n2mnJ21q0j90J0J11q9j22Q0P9j21j0
$$ 13709 13716 13772 13829 13749 13668 13588 13508 13541 13575 13441 13308 13399 13490 13531 13572 13621 13669 13618 13566 13562 13557 13678 13598 13408 13418 13529 13440 13318 13398 13477 13356 13346
2581A3346J91O6O5m7m8m8m7o1o2o1o1nnmnJ06J06j83j82p8J23J77J77jkkjj38j37K9L0n8n8
$$ 13346 13537 13603 13668 13621 13573 13525 13478 13417 13355 13294 13233 13228 13223 13219 13214 13320 13426 13243 13061 12983 13106 13283 13460 13459 13457 13455 13454 13316 13179 13208 13238 13180 13122
2565A3122M2M3q4q3Q4Q5O4O5j02j03n8n9N4j46R5R6j7j7j52j51Q3Q3J4J3J4J3k2k2l5J67m
$$ 13122 13164 13207 13123 13040 13124 13209 13273 13338 13236 13133 13075 13016 13070 12924 13019 13115 13098 13081 12929 12778 12861 12944 12958 12971 12985 12998 12976 12954 12919 13086 13082
2549A3082lr1r1K8K8p2p3K1K1K1K1j16j15N2N3l1l0n6J45J64l6j21K15K69o4k03knmRQm2m2
$$ 13082 13079 12988 12897 12925 12953 12881 12808 12829 12850 12871 12892 12776 12661 12713 12766 12735 12705 12649 12794 12958 12922 12801 13016 13285 13221 13018 13016 13011 13007 13016 13024 12982 12940
2533A2940m2m1l0k9j42N8L0K9K9K9P4j28j15j15j0j0j0j0K8K8K16j19j14j14l4l5J06J06J18
$$ 12940 12898 12857 12827 12798 12656 12714 12744 12773 12802 12831 12905 12777 12662 12547 12537 12527 12517 12507 12535 12563 12779 12660 12546 12432 12398 12363 12469 12575 12693
2518A2693q2j65j66j0j0L8L7L8L8pol2J69J56m4j45N6J25p7p7J24L6j64o5J37M1j59j60M1
$$ 12693 12611 12446 12280 12270 12260 12298 12335 12373 12411 12404 12398 12366 12535 12691 12647 12502 12558 12683 12606 12529 12653 12689 12525 12460 12597 12638 12479 12319 12360
2504A2360J6j85p8J23P3k7N5N5j80K1K8j73Q2J82N7J57k5k5j8j9j11j11J34L3l07K7J94j40
$$ 12360 12376 12191 12113 12236 12309 12282 12337 12392 12212 12233 12261 12088 12170 12352 12409 12566 12541 12516 12498 12479 12368 12257 12391 12424 12117 12144 12338 12198
2490A2198p2L0j11j1M9n3M8J49M5n5o2L9J64l7p4K6n5n5N2N2R4R3j38k39j08R3R9j01j50N2
$$ 12198 12126 12156 12045 12034 12083 12030 12078 12227 12272 12217 12155 12194 12358 12321 12247 12273 12218 12163 12215 12267 12361 12454 12316 12077 11969 12062 12161 12060 11910 11962
2475A1962J37L6N3j47j60M0J08PP6P7QQQRq4q4q4q4L0L0K9L0j25j25k5k5j3j3Q5J86J39o1
$$ 11962 12099 12135 12188 12041 11881 11921 12029 12036 12112 12189 12197 12205 12213 12222 12138 12054 11970 11886 11916 11946 11975 12005 11880 11755 11730 11705 11692 11679 11764 11950 12089 12028
2458A2028j10j09L2L2L2L2q5q5J62J62r6J05M3n8l3j33q3q3QPr3r3N6N6N5N6N3N3N3N3l9l9
$$ 12028 11918 11809 11841 11873 11905 11937 11852 11767 11929 12091 11995 12100 12143 12085 12052 11919 11836 11753 11761 11768 11675 11582 11638 11694 11749 11805 11858 11911 11964 12017 11978 11939
2442A1939l3l3o8L3J02r9j33O8R3pj13k14P9K80N4j46j78p8L6L6n8n8l8l7j37j38J80J81J3
$$ 11939 11906 11873 11805 11838 11940 11841 11708 11776 11869 11862 11749 11535 11614 11894 11948 11802 11624 11546 11582 11618 11560 11502 11464 11427 11290 11152 11332 11513 11526
2428A1526J3j0j0j0j0J76J75j25j25P5P6k5k5L5L6K9L0%j00j70L2R2j09j84J51K07Pj55j55
$$ 11526 11539 11529 11519 11509 11499 11675 11850 11725 11600 11675 11751 11726 11701 11736 11772 11801 11831 11831 11731 11561 11593 11685 11576 11392 11543 11750 11757 11602 11447
2413A1447j8Q1J51n0j67L4L3j67r6J05k0k0L4L4L4L4mlmlk3k2k3k2n5n4M6M5J9J9J19J19j41
$$ 11447 11429 11510 11661 11611 11444 11478 11511 11344 11248 11353 11333 11313 11347 11381 11415 11449 11445 11442 11438 11435 11412 11390 11367 11345 11290 11236 11282 11327 11346 11365 11484 11603 11462
2397A1462j40K7K7QQRQQQr2r2J0J1J10J11L9L9Qr3k33l2Q3Q3Q3Q3j52j51K0K0K0K0q5q5q6
$$ 11462 11322 11349 11376 11384 11392 11401 11409 11417 11425 11333 11241 11251 11262 11372 11483 11522 11561 11569 11476 11243 11211 11294 11377 11460 11543 11391 11240 11260 11280 11300 11320 11235 11150 11064
2380A1064q5Q0Q1Q0Q0p8p9K2K2P5P4k6k6j24j23q2J20J55m6q8q8M8M7M8M8j60j59P5P5R0R0
$$ 11064 10979 11059 11140 11220 11300 11222 11143 11165 11187 11262 11336 11310 11284 11160 11037 10955 11075 11230 11184 11096 11008 11056 11103 11151 11199 11039 10880 10955 11030 11120 11210
2364A1210j1j0J9J9J9J8k0j9J05r5r8J04R1j10noJ37J37k0k20j08j08M7M7o7J35n8n8J22J22
$$ 11210 11199 11189 11208 11227 11246 11264 11244 11225 11330 11235 11137 11241 11332 11222 11217 11211 11348 11485 11465 11245 11137 11029 11076 11123 11056 11191 11133 11075 11197 11319
2349A1319j65j65O9P0opj06j07J10J09m5m6j64L6R0R1o2o2o3o2j0j0rj0K4K5K5K4R4R4p4p4
$$ 11319 11154 10989 11058 11128 11122 11115 11009 10902 11012 11121 11076 11030 10866 10902 10992 11083 11021 10959 10896 10834 10824 10814 10805 10795 10819 10844 10869 10893 10987 11081 11007 10933
2333A0933J0J0J0J0m2m2m3m2J1J1J1J1r6r6J38J39LMLMppppr1r2p8p9N5K56Q8j12o1o0K7K7
$$ 10933 10943 10953 10963 10973 10931 10889 10846 10804 10815 10826 10837 10848 10752 10656 10794 10933 10936 10940 10943 10947 10940 10933 10926 10919 10828 10736 10658 10579 10634 10890 10978 10866 10805 10745 10772 10799
2315A0799j27j28N3N2r1J09J60N9l9O2N5m5k8k8l5l4j08j07N8J58J26p5o2o2j02k02l0J70
$$ 10799 10672 10544 10597 10649 10558 10667 10827 10886 10847 10909 10964 10919 10891 10863 10828 10794 10686 10579 10637 10795 10921 10846 10784 10722 10620 10418 10388 10558
2301A0558J21K0p7p8poppL0K9M9j53q8J3J19L21M0j61k3k3q4J18O0l9n1n1J10J11q3q2q2q2
$$ 10558 10679 10699 10622 10544 10537 10531 10524 10517 10547 10576 10625 10472 10384 10397 10516 10837 10877 10716 10693 10670 10586 10704 10764 10725 10674 10623 10733 10844 10761 10679 10597 10515
2285A0515J1J0p7p7p4J25K0J9N7J58K14J3k44k44q9q9rqJ59J58J7J6J0J1l4j33k03kJ45n6
$$ 10515 10526 10536 10459 10382 10308 10433 10453 10472 10529 10687 10901 10914 10670 10426 10337 10248 10239 10231 10390 10548 10565 10581 10591 10602 10568 10435 10232 10230 10375 10319
2270A0319j55n4L6L6Q4K84P2j30mlL4L5L5L5j57j58J0J0j24j24L8L7J02KL3K34J16q6o0o0
$$ 10319 10164 10110 10146 10182 10266 10550 10622 10492 10488 10485 10519 10554 10589 10624 10467 10309 10319 10329 10205 10081 10119 10156 10258 10260 10293 10527 10643 10557 10497 10437
2255A0437RRJ5J5j12j1J45n5j4j4l8J62j62j62J9J8L9L9K7K6J33o8M4M5k0k0qqj49N2K28j07
$$ 10437 10446 10455 10470 10485 10373 10362 10507 10452 10438 10424 10386 10548 10386 10224 10243 10261 10300 10339 10366 10392 10525 10457 10501 10546 10526 10506 10498 10490 10341 10393 10621 10514
2239A0514q0q0J2J2k04lJ05J06N5j45m5J55j08j09MNj34j34J01J00J34J33j01j01N8N7r6r7
$$ 10514 10434 10354 10366 10378 10174 10171 10276 10382 10437 10292 10247 10402 10294 10185 10189 10194 10060 9926 10027 10127 10261 10394 10293 10192 10250 10307 10211 10114
2225A0114j71L0Q4Q4R7R7p0p1r1r1P6P6J8J8L0j71J48J48l1l2r1r0J31J31m9k50q3J18Q4Q5
$$ 10114 9943 9973 10057 10141 10238 10335 10265 10194 10103 10012 10088 10164 10182 10200 10230 10059 10207 10355 10324 10292 10201 10111 10242 10373 10324 10074 9991 10109 10193 10278
2210A0278mln5n4M6M5n8n9m6m7j39O1n1n2J0RmJ98l7l8l7l7J76k5j25P6L1L0M4M3p8p8L5j66
$$ 10278 10274 10271 10216 10162 10208 10253 10195 10136 10090 10043 9904 9965 9914 9862 9872 9881 9877 10075 10038 10000 9963 9926 10102 10077 9952 10028 10059 10089 10133 10176 10098 10020 10055 9889
2192I889o1o1q7J15J38J38j8j7N6N6j11j11nmJ29p1k53Q3J62l9o2o2K86Q4j97MR2j09P1P1
$$ 9889 9828 9767 9680 9795 9933 10071 10053 10036 10092 10148 10037 9926 9921 9917 10046 9975 9722 9805 9967 9928 9866 9804 10090 10174 9977 9981 10073 9964 10035 10106
2177A0106j76j76J5J4j0J90J80k1j97j97M2M3p1J31%JJ3J3R1R1k02jJ19q3M3M3n3n2n2n3Q2
$$ 10106 9930 9754 9769 9783 9773 9963 10143 10122 9925 9728 9770 9813 9742 9873 9873 9874 9887 9900 9991 10082 9880 9879 9998 9915 9958 10001 9948 9896 9844 9791 9873
2162I873Q2j53j53O4O3j04j03K8K8J41J41p1J31J8J8j6j6j03j04p8J23J0Rj9k0j9k0p3p3j06
$$ 9873 9955 9802 9649 9713 9776 9672 9569 9597 9625 9766 9907 9836 9967 9985 10003 9987 9971 9868 9764 9686 9809 9819 9828 9809 9789 9770 9750 9677 9604 9498
2147I498R4K43r1j17Q4J39o3j71j71P4P4P4P4n9n9M1M1n4n5P0j30r0J11K19K20M0L9j5k15
$$ 9498 9592 9835 9744 9627 9711 9850 9787 9616 9445 9519 9593 9667 9741 9682 9623 9664 9705 9651 9596 9666 9536 9446 9557 9776 9996 10036 10075 10060 9845
2132I845m9m8o1o1O0O0O1O0m5m5p1J31N9j41j29P2R0R1pk07k17j7L8L8j3J87L1p0Q7Q7q6q7
$$ 9845 9796 9748 9687 9626 9686 9746 9807 9867 9822 9777 9706 9837 9896 9755 9626 9698 9788 9879 9872 9665 9448 9431 9469 9507 9494 9681 9712 9642 9729 9816 9730 9643
2116I643J32J32j02j03j8j9O9O9%k00j07R5oj06P5P6r9J02J08r2j89q8J2q8rJ93J17J7R2j09
$$ 9643 9775 9907 9805 9702 9684 9665 9734 9803 9803 9603 9496 9591 9585 9479 9554 9630 9531 9633 9741 9649 9460 9372 9384 9296 9287 9480 9597 9614 9706 9597
2101I597j15Q6K7K8L9M0J01J00k00k01L0L1L1L0J0J0r1r1P1P0N8N8N0j52j64L7K39L9o9j69
$$ 9597 9482 9568 9595 9623 9662 9702 9803 9903 9703 9502 9532 9563 9594 9624 9634 9644 9553 9462 9533 9603 9661 9719 9769 9617 9453 9490 9729 9768 9699 9530
2086I530j68L2J32o8m1N9m1j42o0J41J34o6J7J7k1J80M4j57q7J2Q3Q3p8p9j5j6Q5Q5q9q9q8
$$ 9530 9362 9394 9526 9458 9417 9476 9435 9293 9233 9374 9508 9442 9459 9476 9455 9635 9679 9522 9435 9447 9530 9613 9535 9456 9441 9425 9510 9595 9506 9417 9329
2070I329q9J0RJ10J10K8K7j40j40Q0P9p5p5p2J29P2k8nnj1j1L7L6j30j31O8O9l3l2M5M6J45
$$ 9329 9240 9250 9259 9369 9479 9507 9534 9394 9254 9334 9413 9338 9263 9191 9320 9392 9364 9359 9354 9343 9332 9369 9405 9275 9144 9212 9281 9248 9216 9261 9307 9452
2054I452J46J4J4JKJ1j90K3K3m5m6m6m6onoommj17Q4J36J37J07r4j99LJ1j90k07J29K8K8M4
$$ 9452 9598 9612 9626 9627 9629 9640 9450 9473 9496 9451 9405 9359 9313 9307 9302 9296 9290 9286 9282 9165 9249 9385 9522 9629 9535 9336 9339 9350 9160 8953 9082 9110 9138 9182
2037I182M5J45J45k5k5k6k5j61j62OOJ49J48M8M8J02J02KKm8m7k15k14n2n1l9l9pJ95Q2Q1
$$ 9182 9227 9372 9517 9492 9467 9441 9416 9255 9093 9099 9105 9254 9402 9450 9498 9600 9702 9704 9706 9658 9611 9396 9182 9130 9079 9040 9001 8994 9189 9271 9352
2022I352L6L6o5o5n2n2J15J15q2q1J9J9J34J35k25k4J45n6l0l1l9l9l8l9n4n3J13J14j07j08
$$ 9352 9388 9424 9359 9294 9242 9190 9305 9420 9338 9257 9276 9295 9429 9564 9339 9315 9460 9404 9374 9343 9304 9265 9227 9188 9134 9081 9194 9308 9201 9093
2007I093O0N9J08J08QPp3p3o1o0j00J00J13q8r1J09k9k9Q4j16j17Q4KLJ5J5J1J1j57j56J43
$$ 9093 9153 9212 9320 9428 9436 9443 9370 9297 9236 9176 9076 9176 9289 9201 9110 9219 9190 9161 9245 9129 9012 9096 9098 9101 9116 9131 9142 9153 8996 8840 8983
1991H983J43M3M3p6p6J1J2O3j38j38O2J03J03J4J5j42j42K6K5J7J7J7J7lkllK6K7O0j41j93
$$ 8983 9126 9169 9212 9136 9060 9071 9083 9146 9008 8870 8932 9035 9138 9152 9167 9025 8883 8909 8934 8951 8968 8985 9002 8999 8997 8994 8991 9017 9044 9104 8963 8770
1975H770J43J09J08j8j9j9j9Q0P9k1k1k9k9j55M6m2k42J18J18N9N9N9N9L7L7o3o3ppponnm
$$ 8770 8913 9022 9130 9112 9093 9074 9055 9135 9214 9193 9172 9143 9114 8959 9005 8963 8721 8839 8957 9016 9075 9134 9193 9230 9267 9204 9141 9134 9127 9120 9114 9109 9104 9100
1958I100nk3k4k3k3J31J32j70j70J4J4KK03J1J1K3K4o8o9L2L2j6j6j6j6lmmln5n5K4K4K63
$$ 9100 9095 9072 9048 9025 9002 9133 9265 9095 8925 8939 8953 8955 9158 9169 9180 9203 9227 9159 9090 9122 9154 9138 9122 9106 9090 9087 9083 9079 9076 9021 8966 8990 9014 9277
1941I277p1j64L7q6q5p3p3J47J46L4L4K17J6j51j52j40J94NOn3n3M7M8r7r7n5J46J11q9n2
$$ 9277 9206 9042 9079 8993 8908 8835 8762 8909 9055 9089 9123 9340 9356 9205 9053 8913 9107 9112 9118 9065 9012 9059 9107 9010 8913 8858 9004 9115 9026 8974
1926H974n2n4J47o7o6N4N5N4N4J36J36r8r9j30j29J04J05m2m2m2m2K0K0K0K1r5r5ONM1M0M1
$$ 8974 8922 8868 9015 8948 8882 8936 8991 9045 9099 9235 9371 9273 9174 9044 8915 9019 9124 9082 9040 8998 8956 8976 8996 9016 9037 8942 8847 8853 8858 8899 8939 8980
1910H980M0J2J1J1J1l9m0M9M8K03Kk32k32j34K00J25p6Q6Q5k8k8N1N2n0m9l0l0l1l0L6L5j77
$$ 8980 9020 9032 9043 9054 9065 9026 8986 9035 9083 9286 9288 9056 8824 8690 8890 9015 8939 9025 9110 9082 9054 9105 9157 9107 9058 9028 8998 8967 8937 8973 9008 8831
1894H831K3j9j8J61J62l4l4l4l4j48j49Q5Q6l8l8O2O2k1k1k1k2m8m8j60L9N9N9k9k9M1M2J54
$$ 8831 8854 8835 8817 8978 9140 9106 9072 9038 9004 8856 8707 8792 8878 8840 8802 8864 8926 8905 8884 8863 8841 8793 8745 8585 8624 8683 8742 8713 8684 8725 8767 8921
1878H921m7r4r5opP8P9k2k2O6O6j01j01l2l1O9O8qqrqK7K8j40j40J37J36L6L6k8k8j5j6j13
$$ 8921 8874 8780 8685 8679 8672 8750 8829 8807 8785 8851 8917 8816 8715 8683 8652 8721 8789 8781 8773 8764 8756 8783 8811 8671 8531 8668 8804 8840 8876 8848 8820 8805 8789 8676
1861H676Q7J75j60o8J32pqN6m6j01R9J38J38j51j50J7J6q3q4P6P6P6P6n0n0j18j9P1j30j30
$$ 8676 8763 8938 8778 8710 8842 8835 8827 8883 8837 8736 8835 8973 9111 8960 8810 8827 8843 8760 8676 8752 8828 8904 8980 8930 8880 8762 8743 8814 8684 8554
1846H554P1M0o1O4l5J13J14j27j26o4o4J03J03kllkk4k3P7P7J7J7J8J7kjkjk9k8R7j04p8J22
$$ 8554 8625 8665 8604 8668 8633 8746 8860 8733 8607 8543 8479 8582 8685 8683 8680 8677 8675 8651 8628 8705 8782 8799 8816 8834 8851 8849 8848 8846 8845 8816 8788 8885 8781 8703 8825
1828H825llk5k4k4k4k2k2P8P8kkkkj0j0j1j0m1m0N7J59J12q9k50m9N0N0Q8j13o5J36j00k01
$$ 8825 8822 8819 8794 8770 8746 8722 8700 8678 8756 8834 8832 8830 8828 8826 8816 8806 8795 8785 8744 8704 8761 8920 9032 8943 8693 8644 8694 8744 8832 8719 8654 8790 8690 8489
1811H489J86J86j13Q8J59m2j7j6j10j10rro4o3q3J19J65O5k9P2J46M7m6m6j07R3R9j01j35
$$ 8489 8675 8861 8748 8836 8995 8953 8936 8920 8810 8700 8691 8682 8618 8555 8472 8591 8756 8821 8792 8864 9010 9057 9011 8965 8858 8951 9050 8949 8814
1796H814l4j03j04N7N7N6N7O5O5j02j02k8k8P3P3j09j09rqO7O8O8O7p4p5K6K6K4K4L0L1j69
$$ 8814 8780 8677 8573 8630 8687 8743 8800 8865 8930 8828 8726 8698 8670 8743 8816 8707 8598 8589 8581 8648 8716 8784 8851 8777 8702 8728 8754 8778 8802 8832 8863 8694
1780H694o8J69l3j48N2N2j48j84J6J15J5m1m1m7m7NONNP5P6P5P5J09J09j92j93q1q2K6K5L2
$$ 8694 8626 8795 8762 8614 8666 8718 8570 8386 8402 8517 8532 8491 8450 8403 8356 8361 8367 8372 8377 8452 8528 8603 8678 8787 8896 8704 8511 8430 8348 8374 8399 8431
1764H431J32J76j59K1K22j2j2p5p5oj07q1J20J02J01P2P2k9k8m1m1m2m1k2k2k2k3q1q2q7q8
$$ 8431 8563 8739 8580 8601 8823 8811 8799 8724 8649 8643 8536 8455 8575 8677 8778 8850 8922 8893 8865 8824 8783 8741 8700 8678 8656 8634 8611 8530 8448 8361 8273
1749H273R8kj65L6K20J21m5m5R3R3p4p4l5l4l5l4J69J68JJQ4Q4j7j7p9p9q0p9j0rMLj7J83
$$ 8273 8371 8369 8204 8240 8460 8581 8536 8491 8584 8677 8603 8529 8494 8460 8425 8391 8560 8728 8729 8730 8814 8898 8881 8864 8785 8706 8626 8547 8537 8528 8532 8535 8518 8701
1732H701Q3j18r1r1j03R8LK04K05j31j76K5j09j09O6O7j01j00M7M6M7M7N3N3l5l4j60M1K17
$$ 8701 8784 8666 8575 8484 8381 8479 8482 8686 8891 8760 8584 8609 8500 8391 8457 8524 8423 8323 8370 8416 8463 8510 8563 8616 8581 8547 8387 8428 8645
1717H645K17k8k29k04J31%jK1K1M1M2M2M1j76j76o7J34J40o1k16j5J05J05O3j37o7o7p9p9
$$ 8645 8862 8834 8605 8401 8532 8532 8531 8552 8573 8614 8656 8698 8739 8563 8387 8320 8454 8594 8533 8317 8302 8407 8512 8575 8438 8371 8304 8225 8146
1703H146J17J16K30K9r1r0llJ2J2J3J2J56J56KJk77p7K24K4O3O3j63L8o6o7n4n4l3l3j46N5
$$ 8146 8263 8379 8609 8638 8547 8457 8454 8451 8463 8475 8488 8500 8656 8812 8814 8815 8538 8461 8685 8709 8772 8835 8672 8710 8644 8577 8523 8469 8436 8403 8257 8312
1686H312J54J54jjm9m9m9m9K1K0J34o8j55j55o7K67J63l9N4j47m4J56J44n7j37j37k8J72q4
$$ 8312 8466 8620 8619 8618 8569 8520 8471 8422 8443 8463 8597 8529 8374 8219 8152 8419 8582 8543 8597 8450 8406 8562 8706 8649 8512 8375 8347 8519 8435
1672H435q5K8K8J14J14j20j20L0L0J43n7l8l8n0n0N8N9N8N9K3K4K4K3q5q5q5q5l5l4k2k2j92
$$ 8435 8350 8378 8406 8520 8634 8514 8394 8424 8454 8597 8540 8502 8464 8414 8364 8422 8481 8539 8598 8621 8645 8669 8692 8607 8522 8437 8352 8317 8283 8261 8239 8047
1656H047J0J31J31j%j4j3J90j1j11Q9n0n1O2O2n7n7L1L1J32p0M4M4o8o7K1K0J46n5m3m2o8
$$ 8047 8057 8188 8319 8318 8318 8304 8291 8481 8470 8359 8448 8398 8347 8409 8471 8414 8357 8388 8419 8551 8481 8525 8569 8501 8434 8455 8475 8621 8566 8523 8481 8413
1640H413o8o7o8M0M0M0M1K7K8r8J03M9j53k6k7j50j51J52J51m6m6n8n9K49M9j49J87K36r9
$$ 8413 8345 8278 8210 8250 8290 8330 8371 8398 8426 8328 8431 8480 8327 8301 8274 8124 7973 8125 8276 8230 8184 8126 8067 8316 8365 8216 8403 8639 8540
1625H540n7n6O6O7l4l4o3o3o3o3J61J61p4p3K7K8j40j40J57J57p7p7k02k02l5l5K2K1J90J89
$$ 8540 8483 8427 8493 8560 8526 8492 8429 8366 8303 8240 8401 8562 8488 8415 8442 8470 8330 8190 8347 8504 8427 8350 8148 7946 7911 7876 7898 7919 8109 8298
1610H298j8j8j8j9n9o0o0o0k0k1Q1Q0J32J33L2L2J7J7q3q3j08j08NNo2J39J26J27j08j08O0
$$ 8298 8280 8262 8244 8225 8166 8106 8046 7986 7966 7945 8026 8106 8238 8371 8403 8435 8452 8469 8386 8303 8195 8087 8092 8097 8035 8174 8300 8427 8319 8211 8271
1595H271N9l9m0O1O1J6J5KLj3k13k12j3N7N7P0O9J42J41r4r3J0Rr1r1O9O9r9r8j00j01J34
$$ 8271 8330 8291 8251 8312 8373 8389 8404 8406 8409 8396 8183 7971 7958 8015 8072 8142 8211 8353 8494 8400 8307 8317 8326 8235 8144 8213 8282 8183 8085 7985 7884 8018
1579H018J34n0m9m9m9J30J31L0L1K9K9J6J6M4j57j53J81L12k4j15j16o9o9q2q2J03r8r8J03
$$ 8018 8152 8102 8053 8004 7955 8085 8216 8246 8277 8306 8335 8351 8367 8411 8254 8101 8282 8594 8570 8455 8339 8270 8201 8119 8037 8140 8042 7944 8047
1564H047J61J62o0o1J04J04MLMMLMm3m2m3m2jjJ2J2q4J16rrO7j35L3K33r7r7J6J6j02j01j
$$ 8047 8208 8370 8310 8249 8353 8457 8461 8464 8468 8472 8475 8479 8436 8394 8351 8309 8308 8307 8319 8331 8247 8363 8354 8345 8412 8277 8310 8543 8446 8349 8365 8381 8279 8178 8177
1546H177jr9r9O8O8K6K7J26J27j30j30N0N0j38O4%JM5M4J58m3j08j09p0p0Q5Q6q1q1K6K6P7
$$ 8177 8176 8077 7978 8046 8114 8140 8167 8293 8420 8290 8160 8210 8260 8122 8186 8186 8187 8232 8276 8434 8391 8283 8174 8104 8034 8119 8205 8124 8043 8069 8095 8172
1530H172P6O2O2J25p7j8j9J9J9O8O7O8O8p4p3p4p3j57j56P8P8q5q5LLK19J7J8K19j16j16j04
$$ 8172 8248 8310 8372 8497 8420 8402 8383 8402 8421 8489 8556 8624 8692 8618 8545 8471 8398 8241 8085 8163 8241 8156 8071 8074 8077 8296 8313 8331 8550 8434 8318 8214
1514H214j03m8m8q1K54J59m2p5p5M4M3n7n7k3k3J8K19k2k23P0P0L0L0p0p1l9l9l9l9J05J04
$$ 8214 8111 8063 8015 7934 8188 8347 8305 8230 8155 8199 8242 8185 8128 8105 8082 8100 8319 8297 8074 8144 8214 8244 8274 8204 8133 8094 8055 8016 7977 8082 8186
1499H186o3o3R4R4M4M5j02j01J25p6j81K0K42M1p6p7l8l9NMN5N4q2q3J8J8o7o8j30P1J86J87
$$ 8186 8123 8060 8154 8248 8292 8337 8235 8134 8259 8183 8002 8022 8264 8305 8229 8152 8114 8075 8080 8084 8139 8193 8111 8028 8046 8064 7997 7929 7799 7870 8056 8243
1483H243k3k2j56M6J00R9J00J00j34j35l7l6O9P0JJ01O4j37MJ04j32j32j9j9Q2Q1l0l0L9o1
$$ 8243 8220 8198 8042 8088 8188 8287 8387 8487 8353 8218 8181 8145 8214 8284 8285 8386 8450 8313 8317 8421 8289 8157 8138 8119 8201 8282 8252 8222 8261 8200
1468H200j06R4o8j69J33J33P7P7j69j69n4J47m1j41R6R5L5L4L5L5rqqql4l3J34J34kkj02j02
$$ 8200 8094 8188 8120 7951 8084 8217 8294 8371 8202 8033 7979 8126 8085 7944 8040 8135 8170 8204 8239 8274 8265 8257 8249 8241 8207 8174 8308 8442 8440 8438 8336 8234
1452H234q1q2l9J61J12q8o4o4L9L9L9L9o6o6L5L4r7r8P0P0M2M2n9n9j4j3J53J54l2l3q2q3
$$ 8234 8153 8071 8032 8193 8305 8217 8153 8089 8128 8167 8206 8245 8179 8113 8148 8182 8085 7987 8057 8127 8169 8211 8152 8093 8079 8066 8219 8373 8341 8308 8226 8143
1436H143l7l8q7q8L7L7Q1Q1k6j26L9K40J41o0O6O5j02j01j02j02n7n8M3M3Q7Q7j48j47k6k5
$$ 8143 8106 8068 7981 7893 7930 7967 8048 8129 8103 7977 8016 8256 8397 8337 8403 8468 8366 8265 8163 8061 8004 7946 7989 8032 8119 8206 8058 7911 7885 7860
1420G860J42J42L6L7L6L6m2m2K1K0p0J31L0j71n3n3L6L5m7m6J21J21qrqqn0n0J17J17p5p5
$$ 7860 8002 8144 8180 8217 8253 8289 8247 8205 8226 8246 8176 8307 8337 8166 8113 8060 8096 8131 8084 8038 8159 8280 8272 8263 8255 8247 8197 8147 8264 8381 8306 8231
1404H231p4p5ooooM2M1M1M2k8k7k8k7O8O9l0j30p8J23J16q4j17j17L5J36N9j43m8J53R9j02
$$ 8231 8157 8082 8076 8070 8064 8058 8100 8141 8182 8224 8196 8169 8141 8114 8182 8251 8221 8091 8013 8136 8252 8168 8051 7934 7969 8105 8164 8021 7973 8126 8225 8123
1388H123r6J05L6o5NMr0r0J0J0Q3Q4j8j7o4o4J77J77p3K8R8j04j54M8M0j59m5N5J44M3KJp3
$$ 8123 8027 8132 8168 8103 8108 8112 8022 7932 7942 7952 8035 8119 8101 8084 8020 7956 8133 8310 8237 8265 8363 8259 8105 8153 8193 8034 7989 8044 8188 8231 8233 8234 8161
1372H161K7J59m3k3k3j%j%j53j54J4J5MNJ05J05N7N7m4m3l2l2l2l2K0K1K0K0p1p1p2p1O1O0
$$ 8161 8188 8347 8304 8281 8258 8257 8257 8256 8256 8103 7949 7963 7978 7982 7987 8092 8197 8254 8311 8267 8224 8192 8160 8128 8096 8116 8137 8157 8177 8106 8035 7963 7892 7953 8013
1354H013m0m0P0P0P0P0l1l0l1l0j09j08J26J27o0o0M8K50J6j85p2J29j31j31J83J84M7M7j88
$$ 8013 7973 7933 8003 8073 8143 8213 8182 8152 8121 8091 7982 7874 8000 8127 8067 8007 8055 8305 8321 8136 8064 8193 8062 7931 8114 8298 8345 8392 8204
1340H204j87k2k2k3k2onK28K28p2p3j73j74j4j4j4j4J05J05j09R3K01K00q7q8j7j7j7j7k0
$$ 8204 8017 7995 7973 7950 7928 7922 7917 8145 8373 8301 8228 8055 7881 7867 7853 7839 7825 7930 8035 7926 8019 8220 8420 8333 8245 8228 8211 8194 8177 8157
1325H157k0k1k0L0L0p1p0M4M4N7j44mmj6j7J22J22m5m5p1p0R7R7k6k6k6k6j7j7l0J71o6o5
$$ 8157 8137 8116 8096 8126 8156 8085 8015 8059 8103 8160 8016 8012 8008 7992 7975 8097 8219 8174 8129 8058 7988 8085 8182 8156 8130 8104 8078 8061 8044 8014 8185 8119 8054
1308H054n3n3K8K9J6J6P7j24j1j1m5m5N6N6O0N9m0m1J0Rj16Q5N7j43j8j7JJJ4J3j03R8P2P3
$$ 8054 8001 7948 7976 8005 8021 8037 8114 7990 7979 7968 7923 7878 7934 7990 8050 8109 8069 8028 8038 8047 7931 8016 8073 7930 7912 7895 7896 7897 7911 7924 7821 7919 7991 8064
1291H064J35o6j66L5PPJ9K0J38J39r6r5j30j30j7j7k7J73n0j51O2O2K24K23j3j3J2j88j64
$$ 8064 8199 8133 7967 8002 8009 8016 8035 8055 8193 8332 8236 8141 8011 7881 7864 7847 7820 7993 7943 7792 7854 7916 8140 8363 8350 8337 8349 8161 7997
1276G997L7K5j76rrk1k2M6M5J46J46L1L1j36j37J11J11n6n7KKKKm1m2m2m2K8K9P8P8r9r9J
$$ 7997 8034 8059 7883 7874 7865 7844 7822 7868 7913 8059 8205 8236 8267 8131 7994 8105 8216 8160 8103 8105 8107 8109 8111 8070 8028 7986 7944 7972 8001 8079 8157 8058 7959 7960
1259G960JJ07J06o0o1p8p8R2rj22P9m1m0O0N9K21K21q5j85j42O0J14J15J2j89L2J32j71j71
$$ 7960 7961 8068 8174 8114 8053 7975 7897 7989 7980 7858 7937 7896 7856 7916 7975 8196 8417 8332 8147 8005 8065 8179 8294 8306 8117 8149 8281 8110 7939
1245G939k0j9L1L1O3O3l7l7N1N2m9m8K6K7K6K7k3k3k4k3o5o5n9n9J3J14J77k5k6P4NNK3K3
$$ 7939 7919 7900 7931 7962 8025 8088 8051 8014 8065 8117 8068 8020 8046 8073 8099 8126 8103 8080 8056 8033 7968 7903 7844 7785 7798 7912 8089 8064 8038 8112 8117 8122 8145 8168
1228H168p7p8o3o2n1n0o1J41J40o1j0j1j6j7nR6J52m8j8j8k5k4NJ07K13J2o6o7j79j79Q3Q3
$$ 8168 8091 8013 7950 7888 7837 7787 7726 7867 8007 7946 7936 7925 7909 7892 7887 7983 8135 8087 8069 8051 8026 8002 8007 8114 8327 8339 8273 8206 8027 7848 7931 8014
1212H014P7P7kj03j59M1P3P3J98kq5q6r1r1J3J14J26p4j22k1J0J1R1R2qrj28j27k8k7L5L6
$$ 8014 8091 8168 8166 8063 7904 7945 8018 8091 8289 8287 8202 8116 8025 7934 7947 8061 8187 8113 7991 7970 7980 7991 8082 8174 8166 8157 8029 7902 7874 7847 7882 7918
1196G918L6L5K8K7K7K7m9m9J12J12j1j12o8J33n6n6l0l1l1J69J19q2j83j84L9L8J2J3J2J2
$$ 7918 7954 7989 8017 8044 8071 8098 8049 8000 8112 8224 8213 8101 8033 8166 8110 8054 8024 7993 7962 8131 8250 8168 7985 7801 7840 7878 7890 7903 7915 7927
1181G927O1O1O0O1j19j19j1J90K03Kk30j29r1r1l5l4J50J50N0M9m4m4r5r5J09J09RQk2k2J46
$$ 7927 7988 8049 8109 8170 8051 7932 7921 8111 8314 8316 8086 7957 7866 7775 7740 7706 7856 8006 8056 8105 8061 8017 7922 7827 7936 8045 8054 8062 8040 8018 8164
1165H164J45j47j47K0K0L1L1Q0Q1m1m1r1r1NNNNo9o8L2L1o2o2N6j44n5M5k4k5J30J30Q5Q6
$$ 8164 8309 8162 8015 8035 8055 8086 8117 8197 8278 8237 8196 8105 8014 8019 8024 8029 8034 7965 7897 7929 7960 7898 7836 7892 7748 7693 7738 7714 7689 7819 7949 8034 8120
1148H120J4J16P7j23j06nL0J31N9m0q3j83j03kj4j5l2l2J36J35o4o5n1n2l9J61J56m6p8j78
$$ 8120 8134 8250 8327 8204 8098 8093 8123 8254 8313 8273 8190 8007 7904 7902 7888 7873 7841 7809 7945 8080 8016 7951 7900 7848 7809 7970 8126 8080 8002 7824
1133G824k0J82N6m4k5k5O8O7l2l3k1k2k1k2j9k0j07j08m7J53K07K08j56j57J1J1J34J34L3
$$ 7824 7804 7986 8042 7998 7973 7948 8016 8083 8051 8018 7997 7975 7954 7932 7913 7893 7786 7678 7631 7784 7991 8199 8043 7886 7897 7908 8042 8176 8209
1119H209L3q1q2o9o9p6J24L1j70n1M9k0j9N1N0m9n0O6O6N9N9M7n4j23P8J04r8j23k2r6NJ22
$$ 8209 8242 8161 8079 8010 7941 7865 7989 8020 7850 7799 7848 7828 7809 7860 7910 7861 7811 7877 7943 8002 8061 8108 8054 7931 8009 8113 8015 7892 7870 7774 7779 7901
1103G901J22n2n1M9M8J50J49r3k94j51M9K4K4J74J73o0o1j07j06n7n6O4O5M5J46J12q9j27
$$ 7901 8023 7971 7920 7969 8017 8167 8316 8223 7929 7778 7827 7851 7875 8049 8222 8162 8101 7994 7888 7831 7775 7839 7904 7949 8095 8207 8118 7991
1089G991k7L7L7ppk1k1k0k1l9m0qR2J97ln2n2q5q5Q2Q3l6l6J5J4J25J24m3m3q5q6l5l6N7N6
$$ 7991 7964 8001 8038 8031 8024 8003 7982 7962 7941 7902 7862 7854 7946 8143 8140 8088 8036 7951 7866 7948 8031 7995 7959 7974 7988 8113 8237 8194 8151 8066 7980 7945 7909 7966 8022
1071H022j19Q2L3j67r8KJ28J28Q7j15q9J1L6L6o7j67j24P8K0K0K00K00l3l2q2q3l7l7j07o
$$ 8022 7903 7985 8018 7851 7753 7755 7883 8011 8098 7983 7894 7905 7941 7977 7910 7743 7619 7697 7717 7737 7937 8137 8104 8072 7990 7907 7870 7833 7726 7720
1056G720J32p0o3J38J5J4M6j55OJ07L8L8r8r8O9P0J8J8J8J8j14j14j3j4N6N6Q8J87J05r5p7
$$ 7720 7852 7782 7719 7857 7872 7886 7932 7777 7783 7890 7928 7966 7868 7770 7839 7909 7927 7945 7963 7981 7867 7753 7740 7726 7782 7838 7926 8113 8218 8123 8046
1041H046p7M9M9jjl0k9n5J47O6j35j67o6n7n8J16J16M8M7M8M7j1j1j1j1K7K6j41j40P8P9r
$$ 8046 7969 8018 8067 8066 8065 8035 8006 7951 8098 8164 8029 7862 7796 7739 7681 7797 7913 7961 8008 8056 8103 8092 8081 8070 8059 8086 8112 7971 7831 7909 7988 7979
1024G979rj75K6O8O8J87j3o9o8K1K1K1K0l2l3L1L0j59M1R6R7q3q3Q5Q4l5l6j36j36O9O9K37
$$ 7979 7970 7795 7821 7889 7957 8144 8131 8062 7994 8015 8036 8057 8077 8045 8012 8043 8073 7914 7955 8051 8148 8065 7982 8067 8151 8116 8080 7944 7808 7877 7946 8183
1008H183K36J7J6j50j51m6m6m6m6O7O8O7O7j47j48r7r7K5K5J25J26K6K5p4p5K8K7J28J28k8
$$ 8183 8419 8436 8452 8302 8151 8105 8059 8013 7967 8034 8102 8169 8236 8089 7941 7844 7747 7772 7797 7922 8048 8074 8099 8025 7950 7978 8005 8133 8261 8233
993H233k8K3K2j14j13J66l4n9n9k2k2j14j14j40O2J16q5k2J79J34J34j55j54J50J50o4o3p3
$$ 8233 8205 8228 8250 8136 8023 8189 8155 8096 8037 8015 7993 7879 7765 7625 7687 7803 7718 7696 7875 8009 8143 7988 7834 7984 8134 8070 8007 7934
979G934K62J74k7k3k25j11j12K1K22K47q8q1q0jkR7R6mmj17j17j6j7K1K2J21J22M6M6j21j21
$$ 7934 8196 8370 8343 8320 8095 7984 7872 7893 8115 8362 8274 8193 8113 8112 8110 8207 8303 8299 8295 8178 8061 8045 8028 8049 8071 8192 8314 8360 8406 8285 8164
964H164M2M3j25j25M4M3m4m4j19Q2J9J9LLMLr5r4j08R4J27J27J52m9O7O7N4N5m7m7k02k02
$$ 8164 8206 8249 8124 7999 8043 8086 8042 7998 7879 7961 7980 7999 8002 8005 8009 8012 7917 7823 7715 7809 7936 8063 8215 8166 8233 8300 8354 8409 8362 8315 8113 7911
948G911n6J45Q3Q3K3K2l9m0L0j70j08j08K33K33o8o8n0n0n1n0N7N6N6N7NNNNk4k4j03j04N9
$$ 7911 7855 8000 8083 8166 8189 8211 8172 8132 8162 7992 7884 7776 8009 8242 8174 8106 8056 8006 7955 7905 7962 8018 8074 8131 8136 8141 8146 8151 8127 8103 8000 7896 7955
931G955L94J52n0j37j37n0m9j8j7m3J59Q2j18N8N8ooM4M4jkj69j70j2j2M2K43K5K6L7L8q8
$$ 7955 8349 8501 8451 8314 8177 8127 8078 8060 8043 8000 8159 8241 8123 8181 8239 8233 8227 8271 8315 8314 8312 8143 7973 7961 7949 7991 8234 8259 8285 8322 8360 8272
915H272q9q9q8R1R1q9q9J06r6q3q3J14J14N9j41j60j60J96J96k2k3K8K8J20J21j13j14L0L0
$$ 8272 8183 8094 8006 8097 8188 8099 8010 8116 8020 7937 7854 7968 8082 8141 8000 7840 7680 7876 8072 8050 8027 8055 8083 8203 8324 8211 8097 8127 8157
900H157p1p1J26J25K5K5o1o1j61j61M5M5M4M5P8P7P7P7L6L6j5j5j20j20k0k0J19J18j82j83
$$ 8157 8086 8015 8141 8266 8291 8316 8255 8194 8033 7872 7917 7962 8006 8051 8129 8206 8283 8360 8396 8432 8417 8402 8282 8162 8142 8122 8241 8359 8177 7994
885G994MMLMj2j3J55J55RQr1r2L4L4M7M7q1J20R5R4P7j24k78p8k2J80J67j68M1M2K0K1j79
$$ 7994 7998 8002 8005 8009 7997 7984 8139 8294 8303 8311 8220 8128 8162 8196 8243 8290 8209 8329 8424 8518 8595 8471 8193 8115 8093 8273 8440 8272 8313 8355 8375 8396 8217
869H217j78j1j1J00R9J12q9j85j85k2J79O8j34R3R3J13J14J3J3j41j41Q0Q1M9j51k27J08q7
$$ 8217 8039 8028 8017 8117 8216 8328 8239 8054 7869 7847 8026 8094 7960 8053 8146 8259 8373 8386 8399 8258 8117 8197 8278 8327 8176 7949 8057 7970
855G970q7J68J69J37J37l0l0j35j34l4l4o6o7J01J01j9k0L0L1l1l0K0K0l4l4J21J21M2j58
$$ 7970 7883 8051 8220 8357 8494 8464 8434 8299 8165 8131 8097 8031 7964 8065 8166 8147 8127 8157 8188 8157 8127 8147 8167 8133 8099 8220 8341 8383 8225
840H225r6r5J31J31O9O8k9k31N0N0K4K4J49n1j96Ok0k0R4R4ooo7o7j7j7O5O5J5J5j58j59J42
$$ 8225 8129 8034 8165 8296 8365 8433 8404 8173 8223 8273 8297 8321 8470 8419 8223 8229 8209 8189 8283 8377 8371 8365 8298 8231 8214 8197 8262 8327 8342 8357 8199 8040 8182
824H182J43k3k4P7P8n3n3m0m0j14Q7Q7j14J2J1jjJ4J4J4J4p3p4R4R3k0k0Q1Q0QRo8J34J42
$$ 8182 8325 8302 8278 8355 8433 8380 8327 8287 8247 8133 8220 8307 8193 8205 8216 8215 8214 8228 8242 8256 8270 8197 8123 8217 8310 8290 8270 8351 8431 8439 8448 8380 8514 8656
807H656n9j02j01o9p0L1L0K1K0P0P0m9n0n0n0P9P9R2j09m9m8J07J06j52j51J5J6OPN6N7j09
$$ 8656 8597 8495 8394 8325 8255 8286 8316 8337 8357 8427 8497 8448 8398 8348 8298 8377 8456 8548 8439 8390 8342 8449 8555 8403 8252 8267 8283 8289 8296 8352 8409 8300
791H300j08N9N9LKm7m8p0p0L0L1O8O8J8J7o7o8l4J67J55j81j43N8j11j12O8O8l3l4K47M6p1
$$ 8300 8192 8251 8310 8313 8315 8268 8220 8150 8080 8110 8141 8209 8277 8295 8312 8245 8177 8143 8310 8465 8284 8141 8199 8088 7976 8044 8112 8079 8045 8292 8338 8267
774H267p2Q4Q3J08J09n9n9j04j03J31J31o4o3j64j64R4R3R4R4o0o0j0rR3R4p3p4l5l5l4l5
$$ 8267 8195 8279 8362 8470 8579 8520 8461 8357 8254 8385 8516 8452 8389 8225 8061 8155 8248 8342 8436 8376 8316 8306 8297 8390 8484 8411 8337 8302 8267 8233 8198
759H198m1m0m1m1R5R4ooPQn6J46p3p3M0M0R8R7j36j36NMN5N5j04j05J21q0j52M9P8P8R3j09
$$ 8198 8157 8117 8076 8035 8130 8224 8218 8212 8219 8227 8171 8317 8244 8171 8211 8251 8349 8446 8310 8174 8179 8183 8238 8293 8189 8084 8205 8125 7973 8022 8100 8178 8271 8162
742H162NMO2O2l8l9o0o0j0j0O2O2J2J3N4N4R2R2J20q2j90j91J7K18N0j50j6j5K2K2J9J9J9
$$ 8162 8167 8171 8233 8295 8257 8218 8158 8098 8088 8078 8140 8202 8214 8227 8281 8335 8427 8519 8639 8557 8367 8176 8193 8411 8461 8311 8295 8280 8302 8324 8343 8362 8381
725H381J9llllj2j2j2j2j07j07j07j07N8N9QQK3K4p6p7M3M3J44J43o1o2K6K7Q6j14j4J87o7
$$ 8381 8400 8397 8394 8391 8388 8376 8364 8352 8340 8233 8126 8019 7912 7970 8029 8037 8045 8068 8092 8016 7939 7982 8025 8169 8312 8251 8189 8215 8242 8328 8214 8200 8387 8320
708H320o8n4n5K6K6k5k4J38J38K3j78k02j02n6J46J57N8Q2j8JJonM5M5n6n6K1K1j05R6R6j05
$$ 8320 8252 8198 8143 8169 8195 8170 8146 8284 8422 8445 8267 8065 7963 7907 8053 8210 8268 8350 8332 8333 8334 8328 8323 8368 8413 8357 8301 8322 8343 8238 8334 8430 8325
692H325K1K1rrR2R2j13j13j14j13O0O0m1m0R9J00jjRRk26k26L6L6J36J37K4K4K4K5O4O4j03
$$ 8325 8346 8367 8358 8349 8441 8533 8420 8307 8193 8080 8140 8200 8159 8119 8218 8318 8317 8316 8325 8334 8108 7882 7918 7954 8090 8227 8251 8275 8299 8324 8388 8452 8349
675H349j04r2r3J41J42r9r9r9r9R4R5K49K49J64l8j58j59q3q3J8J8N6N6OOj45j46j22k3J33
$$ 8349 8245 8153 8060 8201 8343 8244 8145 8046 7947 8041 8136 8385 8634 8798 8760 8602 8443 8360 8277 8295 8313 8369 8425 8431 8437 8292 8146 8024 8001 8134
660H134k02j46J89K53K53R1j09q4J6m0j41p4K7l6l6qql3J68J74k6qpq9j90j67J69J67l4%j
$$ 8134 7932 7786 7975 8228 8481 8572 8463 8379 8395 8355 8214 8140 8167 8131 8095 8087 8079 8046 8214 8388 8362 8354 8347 8258 8068 7901 8070 8237 8203 8203 8202
644H202L6L5o5o5N5N4N5N5L6L6o5o5p6p6K5K4k3k2P8P7L5L4j6j6j6j7j7j7p7p6K4K4J35J34
$$ 8202 8238 8273 8208 8143 8198 8252 8307 8362 8398 8434 8369 8304 8228 8152 8177 8201 8178 8156 8234 8311 8346 8380 8364 8348 8332 8315 8298 8281 8204 8128 8152 8176 8311 8445
627H445l2l3j75j76N9N8N3N2N2N3N1N1m9m9P0P0k8j28p7J24J24p7j73p3l2J67l0k32onm2m1
$$ 8445 8413 8380 8205 8029 8088 8146 8199 8251 8303 8356 8407 8458 8409 8360 8430 8500 8472 8344 8267 8391 8515 8438 8265 8192 8160 8327 8297 8065 8059 8054 8012 7971
611G971j0R1J79k2J0J0k54n3nnK47J47j56M4O6j35j15j6m7m7J26J26L8L7o3o3n4n3JK01q7
$$ 7971 7961 8052 8231 8209 8219 8229 7975 7922 7917 7912 8159 8306 8150 8194 8260 8125 8010 7994 7947 7900 8026 8152 8190 8227 8164 8101 8047 7994 7995 8196 8109
596H109q7K18J8p3J28K29K8j78K4K3j77o5J35O7l4k9k9J5J5r3r3PPlkM8M8K9K9k1k0o2o2L9
$$ 8109 8022 8240 8258 8185 8313 8542 8570 8392 8416 8439 8262 8197 8332 8399 8365 8336 8307 8322 8337 8244 8151 8158 8165 8162 8160 8208 8256 8285 8314 8293 8273 8211 8149 8188
579H188L9L7L7j38O3N5j46j75j74L4K35Q0j21k25k5J51J51R3R2pqJ61J62M0j61n1n2o5o4l2
$$ 8188 8227 8264 8301 8163 8226 8281 8135 7960 7786 7820 8055 8135 8014 7789 7764 7915 8066 8159 8251 8244 8236 8397 8559 8599 8438 8387 8335 8270 8206 8174
564H174l2q2q2J07J08PQk9k8k8k8L1L1l1J70M9M9j06j05R6R7j38j38j8j8J49J48k6k7k7k7
$$ 8174 8142 8060 7978 8085 8193 8200 8208 8179 8151 8123 8095 8126 8157 8126 8296 8345 8394 8288 8183 8279 8376 8238 8100 8082 8064 8213 8361 8335 8308 8281 8254
548H254j06j06J28J28lkklk9l0k9l0O3O2O3O2j01j00O6O7r5r5j07R3J42J41K67O6j72j72j44
$$ 8254 8148 8042 8170 8298 8295 8293 8291 8288 8259 8229 8200 8170 8233 8295 8358 8420 8319 8219 8285 8352 8257 8162 8055 8148 8290 8431 8698 8764 8592 8420 8276
533H276N8J38o4J2J2l9l9J1J2j1j1o0o1l9l9O2O1K3K3J23J24L8L7j96j97J7J7J7J7LMLMk0
$$ 8276 8334 8472 8408 8420 8432 8393 8354 8365 8377 8366 8355 8295 8234 8195 8156 8218 8279 8302 8325 8448 8572 8610 8647 8451 8254 8271 8288 8305 8322 8325 8329 8332 8336 8316
515H316j9k0j9J26J26m2m1p3p2r8J03J19q1j70L2J40J41N2N3j33j33l3l2R6R6j2k14m1J59
$$ 8316 8297 8277 8258 8384 8510 8468 8427 8354 8282 8184 8287 8406 8325 8155 8187 8327 8468 8520 8573 8440 8307 8274 8242 8338 8434 8422 8208 8167 8326
501H326j6j6O9P0l1l1k8k8K3K2l7l7j37j38N7N6m4m4J11J11J0J1J35J34m5m5Q4j16j67L4j2
$$ 8326 8310 8294 8363 8433 8402 8371 8343 8315 8338 8360 8323 8286 8149 8011 8068 8124 8080 8036 8147 8258 8268 8279 8414 8548 8503 8458 8542 8426 8259 8293 8281
485H281j2o3o2O5j36j61J74J19J18K02Kjjj26j26J14q6j40j41kkJ52J53K74P4j15j14J8J9
$$ 8281 8269 8206 8144 8209 8073 7912 8086 8205 8323 8525 8527 8526 8525 8399 8273 8387 8301 8161 8020 8018 8016 8168 8321 8595 8669 8554 8440 8458 8477
471H477j50j49M4M3pom0l9oJ96J48j86k66o5J45J44K20J9J3J3n0n0j21j20J26J26n3J47O0
$$ 8477 8327 8178 8222 8265 8258 8252 8212 8173 8167 8363 8511 8325 8059 7994 8139 8283 8503 8522 8535 8548 8498 8448 8327 8207 8333 8459 8406 8553 8613
456H613j41j32O8J56m5OOj07j06n3n3M8M8OOK20J8o7o7K0K1lmlmP9P8j0j0m1J60N9j42p4p5
$$ 8613 8472 8340 8408 8564 8519 8525 8531 8424 8318 8265 8212 8260 8308 8314 8320 8540 8558 8491 8424 8444 8465 8462 8458 8455 8451 8530 8608 8598 8588 8547 8707 8766 8624 8550 8475
439H475Q0Q0j42j41q8J14n0m9MK06P3j27j57j57j53M8J02J03K0J9o8o8k27k6J62J62m9m9N9
$$ 8475 8555 8635 8493 8352 8264 8378 8328 8279 8283 8489 8562 8435 8278 8121 7968 8016 8118 8221 8241 8260 8192 8124 7897 7871 8033 8195 8146 8097 8156
424H156K60J06r5J30J31N0N0mk05j60j59n0J50P0O9J07r4j52M8R0R0o7o8L3L2P7P7j58j58
$$ 8156 8416 8522 8427 8557 8688 8738 8788 8784 8579 8419 8260 8210 8360 8430 8499 8606 8512 8360 8408 8498 8588 8521 8453 8486 8518 8595 8672 8514 8356
410H356O6O7O6O6k50k50N2N1O6O6l4l5L5L4L5L4l7l6O3O4j1j1M0L9j23j24M4M4K9K8J6J5O1
$$ 8356 8422 8489 8555 8621 8371 8121 8173 8224 8290 8356 8322 8287 8322 8356 8391 8425 8388 8352 8415 8479 8468 8457 8497 8536 8413 8289 8333 8377 8406 8434 8450 8465 8526
393H526j41k7k8KKKKN1N1N1N1n8n8n1n2m2N8J15q7k5k6l8l8j7j7o1L9l6J65K52q2o7L4N7N6
$$ 8526 8385 8358 8330 8332 8334 8336 8338 8389 8440 8491 8542 8484 8426 8375 8323 8281 8339 8454 8367 8342 8316 8278 8240 8223 8206 8145 8184 8148 8313 8565 8483 8416 8450 8507 8563
375H563k5k5P5P6j2j1j2j1J4J3j53j54O8O8N6N6K8j72j79K2N6m5Q1k0m5m5N0M9m9n0J65l7
$$ 8563 8538 8513 8588 8664 8652 8641 8629 8618 8632 8645 8492 8338 8406 8474 8530 8586 8614 8442 8263 8285 8341 8296 8377 8357 8312 8267 8317 8366 8317 8267 8432 8395
359H395j37j37Q4Q5P2P1R0j10J16K16L6o5j46j46J5J6J21J22J3j87j11R0K1q0J11J11o3o3
$$ 8395 8258 8121 8205 8290 8362 8433 8523 8413 8529 8745 8781 8716 8570 8424 8439 8455 8576 8698 8711 8524 8413 8503 8524 8444 8555 8666 8603 8540
345H540m8m9m9m8j1j1j1j1J42J41k5k6J15J14J4J4j56j57m8J53J40o1O5O5q2q2L8j64n9M2
$$ 8540 8492 8443 8394 8346 8335 8324 8313 8302 8444 8585 8560 8534 8649 8763 8777 8791 8635 8478 8430 8583 8723 8662 8727 8792 8710 8628 8666 8502 8443 8485
330H485k8k8R0Q9p8p9k5k6P4P5l8l8J27K28Oj95p5p6M7M7j21j20J6J5J6J5mnj7j7O0j40j5
$$ 8485 8457 8429 8519 8608 8530 8451 8426 8400 8474 8549 8511 8473 8600 8828 8834 8639 8564 8488 8535 8582 8461 8341 8357 8372 8388 8403 8399 8394 8377 8360 8420 8280 8265
314H265j5r0J12R9R9j27j27J74J74llLLj39l9J24p6J9J20m8j48j67L4K62O2K5K6J3J3m3m4
$$ 8265 8250 8160 8272 8371 8470 8343 8216 8390 8564 8561 8558 8561 8564 8425 8386 8510 8434 8453 8573 8525 8377 8210 8244 8506 8568 8593 8619 8632 8645 8602 8558
298H558N7N7j24j24N7N6p0J32P5k6j55j55Qr3j88J2J27J27J31J32l7l6j7j7j8j7M6M5j89j89
$$ 8558 8615 8672 8548 8424 8481 8537 8467 8599 8674 8648 8493 8338 8346 8253 8065 8077 8204 8331 8462 8594 8557 8521 8504 8487 8469 8452 8498 8543 8354 8165
283H165L5L5M8M7k1J80J80k1j42j42P9Q0QRr2r2R4R4opL8L7L8L7m4m4m5m4P1P1KJ02J0j90
$$ 8165 8200 8235 8283 8330 8309 8489 8669 8648 8506 8364 8443 8523 8531 8540 8448 8356 8450 8544 8538 8531 8569 8606 8644 8681 8637 8593 8548 8504 8575 8646 8648 8750 8760 8570
266H570K9K9k7k7k0k1n8M2J06r6k3P8RRM0M0M0M1r6r5j01j02J69O8k23k2P8P7j0j1n0n0N0
$$ 8570 8599 8628 8601 8574 8554 8533 8475 8517 8623 8527 8504 8582 8591 8600 8640 8680 8720 8761 8665 8570 8469 8367 8536 8604 8381 8359 8437 8514 8504 8493 8443 8393 8443
249H443N1RRn9M1J81k0nj06k09j09PJ06J01J00J13q8Rr2r2Qn4J46Q4j7P6j25o9L2r3OK0q1
$$ 8443 8494 8503 8512 8453 8494 8675 8655 8650 8544 8335 8226 8233 8339 8440 8540 8653 8565 8574 8482 8390 8398 8344 8490 8574 8557 8633 8508 8439 8471 8378 8384 8404 8323
233H323qR2K56N5m5J55j48k48O1O2N5N6LLr5j96m7J53J47n3o7o6R1j0q6J14j05j05R0Q9J03
$$ 8323 8315 8407 8663 8718 8673 8828 8680 8432 8493 8555 8610 8666 8669 8672 8577 8381 8334 8487 8634 8581 8514 8448 8539 8529 8443 8557 8452 8347 8437 8526 8629
217H629J02j95OJ74k8n2n3o5o5O4O3j64j65lR7J75k7j56J78J84j6K1p9j60M0R1j09l4O6M7
$$ 8629 8731 8536 8542 8716 8688 8636 8583 8518 8453 8517 8580 8416 8251 8248 8345 8520 8493 8337 8515 8699 8683 8704 8625 8465 8505 8596 8487 8453 8519 8566
202H566J48N0j51j8Q3J4J3L1L0J31J31L8L8j28k28j34O7n3n2ppppj42j43K4K5L8L7L8L8O1
$$ 8566 8714 8764 8613 8595 8678 8692 8705 8736 8766 8897 9028 9066 9104 8976 8748 8614 8681 8628 8576 8569 8562 8555 8548 8406 8263 8287 8312 8350 8387 8425 8463 8524
186H524O1m0l9j32j31J02J03l5l6l5l5j%%jqrJ46J46K48M7k07k08J1J2J2J1N2N1j16j16L1
$$ 8524 8585 8545 8506 8374 8243 8345 8448 8413 8377 8342 8307 8306 8306 8306 8305 8297 8288 8434 8580 8828 8875 8668 8460 8471 8483 8495 8506 8558 8609 8493 8377 8408
170H408L0L1L1N4N4n8n9J57m4j53j53j54M7L5L4J4J3j1J89J62m0j94PP3P4P4P3K6j76j75K5
$$ 8408 8438 8469 8500 8554 8608 8550 8491 8648 8604 8451 8298 8144 8191 8226 8260 8274 8287 8276 8465 8627 8587 8393 8400 8473 8547 8621 8694 8720 8544 8369 8394
155H394P0O9R5R4k19j9K23j11j7j6nJ97R9k37jJ99J7l18j29P2ooPOM1M0M0M0k40k41J95J94
$$ 8394 8464 8533 8628 8722 8503 8484 8707 8596 8579 8563 8558 8755 8854 8617 8616 8815 8832 8514 8385 8457 8451 8445 8452 8458 8499 8539 8579 8619 8379 8138 8333 8527
139H527O9O9r8r9M2M2M2M1j06j07O9K70Q4j16r1r1m7m7j61M1J41J40N2N3j9j8j9j9j27j27
$$ 8527 8596 8665 8567 8468 8510 8552 8594 8635 8529 8422 8491 8761 8845 8729 8638 8547 8500 8453 8292 8333 8474 8614 8666 8719 8700 8682 8663 8644 8517 8390
123H390J07J07j08j08n4J47J30J31L5j67k4J77N1N1jj%jj02j01N4N3J08r4k06oJ77k5k4J76
$$ 8390 8497 8604 8496 8388 8334 8481 8611 8742 8777 8610 8586 8763 8814 8865 8864 8863 8863 8862 8760 8659 8713 8766 8874 8780 8574 8568 8745 8720 8696 8872
108H872J46n6r8r7l1l1P0P0k7k6j4j4j27P4Q6j14r0J11Q6Q6q9r0J1J0k7k8k7k7J4J5J4J4L6
$$ 8872 9018 8962 8864 8767 8736 8705 8775 8845 8818 8792 8778 8764 8637 8711 8797 8683 8593 8704 8790 8876 8787 8697 8708 8718 8691 8663 8636 8609 8623 8638 8652 8666 8702
92H702L5O1j41J28L28Q1j19m6m6n9n8L6L5L6L5j12j13j13j13Q6Q6j5j5oopoM6M6M6M6l3l4
$$ 8702 8737 8798 8657 8785 9113 9194 9075 9029 8983 8924 8866 8902 8937 8973 9008 8896 8783 8670 8557 8643 8729 8714 8699 8693 8687 8680 8674 8720 8766 8812 8858 8825 8791
75H791k1k1M4K45J0j90j1j1k4k3o8o7J54J54P0j32j06j06j73K8J38J39O3j03j10j10j08j08
$$ 8791 8770 8749 8793 9038 9048 8858 8847 8836 8812 8789 8721 8654 8808 8962 9032 8900 8794 8688 8515 8543 8681 8820 8883 8780 8670 8560 8452 8344
61H344m1J27N1n0J8J7J60J60qj08q0Q7Q0q6PQR7R8Q6Q5n4k22j53j53k9J38P6k5k0Q0J44M5
$$ 8344 8303 8430 8481 8431 8449 8466 8626 8786 8778 8670 8590 8677 8757 8671 8678 8686 8783 8881 8967 9052 8998 8776 8623 8470 8441 8579 8655 8630 8610 8690 8834 8879
45H879OPr1r1r8r7J39L9j00O8P0P1Q1q7j14j3K0K0mlR6p0r0J1N1N1J9J19N7j11N3N2k5P6k4
$$ 8879 8885 8892 8801 8710 8612 8515 8654 8693 8593 8661 8731 8802 8883 8796 8682 8669 8689 8709 8705 8702 8798 8728 8638 8649 8700 8751 8770 8889 8946 8835 8888 8940 8915 8991 8967
28H967j92K0K0LJ70K71J04k68k68K3K2J9J9J9J8qqqqj75j75N9N9q0p9K1K1k7k7k7k7J33J32
$$ 8967 8775 8795 8815 8818 8988 9259 9363 9095 8827 8850 8872 8891 8910 8929 8947 8939 8931 8923 8915 8740 8565 8624 8683 8603 8524 8545 8566 8539 8512 8485 8458 8591 8723
11H723K2K2J80J3r7P0K2j44r7Mj1j1mnJ05J04J04J04N0N0n0n1k01k01L4L3Q0Q1k0k0o1o1j7
$$ 8723 8745 8767 8947 8960 8863 8933 8955 8811 8714 8718 8707 8696 8692 8687 8792 8896 9000 9104 9154 9204 9154 9103 8902 8701 8735 8768 8848 8929 8909 8889 8828 8767 8750
-6H750j7M5n5o2J39Q2Q3M5M5j67j68O7O7M3M2NMj03R8J48n3o8o8l0l0J7J6M9J48J18q4j5j4
$$ 8750 8733 8778 8723 8661 8800 8882 8965 9010 9055 8888 8720 8787 8854 8897 8939 8944 8948 8845 8943 9091 9038 8970 8902 8872 8842 8859 8875 8924 9072 9190 9106 9091 9077
-22I077j1j0M0M0j74j74ppr3r3J3J3J51K51J55j80j44m3J13J13J1J0n8M2J16q5p2K9q3q2R1
$$ 9077 9066 9056 9096 9136 8962 8788 8781 8774 8681 8588 8601 8614 8765 9016 9171 8991 8847 8804 8917 9030 9041 9051 8993 9035 9151 9066 8994 9023 8940 8858 8949
-38H949R1j62j62NOR3R4M3M4PPOPooooj20j19N5N4r4PJ76k5k24k3J59J60j56n5J81k0j76K4
$$ 8949 9040 8878 8716 8721 8727 8820 8914 8957 9001 9008 9015 9021 9028 9022 9016 9010 9004 8884 8765 8820 8874 8780 8787 8963 8938 8714 8691 8850 9010 8854 8799 8980 8960 8784 8808
-55H808O6O6L0L0MK06J22p9n4n4j11j11kJ99O9j32j07j06K3K2p7p8n6n7J65J65J32p0j70L1
$$ 8808 8874 8940 8970 9000 9004 9210 9332 9253 9199 9145 9034 8923 8921 9120 9189 9057 8950 8844 8867 8889 8812 8734 8678 8621 8786 8951 9083 9013 8843 8874
-70H874n9n8J18q4L5L4J35J35j40O0K36r8j09j08N1N0j59M1R1j09J2J2J00J00r9r8JKJ5J5
$$ 8874 8815 8757 8875 8791 8826 8860 8995 9130 8990 9050 9286 9188 9079 8971 9022 9072 8913 8954 9045 8936 8948 8960 9060 9160 9061 8963 8964 8966 8981 8996
-85H996O5O5M6M6mmk3k3k2k3L7L7n1n1j99KR6j05P8k4j92QO5O5M6n4j30P1J72k9l4O7LMj4
$$ 8996 9061 9126 9172 9218 9214 9210 9187 9164 9142 9119 9156 9193 9142 9091 8892 8894 8990 8885 8963 8939 8747 8755 8820 8885 8931 8877 8747 8818 8990 8961 8927 8994 8997 9001 8987
-103H987Q7R9j02r4OJ04J05j2j1j06j06j9Q2N0j51j72K8J26K6M1M0j5j6K9K9j05R6K03j32
$$ 8987 9074 9173 9071 8977 8983 9087 9192 9180 9169 9063 8957 8938 9020 9070 8919 8747 8775 8901 8927 8968 9008 8993 8977 9006 9035 8930 9026 9229 9097
-117I097j56M4P1j29r2r2j37O3J18J17Q1Q2J56m5k05nJ50n0r2r1O3O3K4K4m5N6j4k14j08R4
$$ 9097 8941 8985 9056 8927 8835 8743 8606 8669 8787 8904 8985 9067 9223 9178 8973 8968 9118 9068 8976 8885 8948 9011 9035 9059 9014 9070 9056 8842 8734 8828
-133H828M5M5N7N8j2j1l5j34j07K28J40o1Q3j7j80K1j2Q9J64l7j41m1O7J69P5P5q6q6%%j25
$$ 8828 8873 8918 8975 9033 9021 9010 8975 8841 8734 8962 9102 9041 9124 9107 8927 8948 8936 9025 9189 9152 9011 8970 9037 9206 9281 9356 9270 9184 9184 9184 9059
-148I059P5J31p0j63o1N3J54J16q5R1R1l5l4P8j23k35l5K32L0p5K7j23k23j05R5Q6Q5R9R8
$$ 9059 9134 9265 9195 9032 8971 9024 9178 9294 9209 9300 9391 9356 9322 9400 9277 9042 9007 9239 9269 9194 9221 9098 8875 8770 8865 8951 9036 9135 9233
-163I233r8r8n0J51M6n4KKJ51n0k24k3pj07l9l8J71J71MLJ9J9j41j42k5P6J44n6j80K0J18
$$ 9233 9135 9037 8987 9138 9184 9130 9132 9134 9285 9235 9011 8988 8981 8874 8835 8797 8968 9139 9143 9146 9165 9184 9043 8901 8876 8952 9096 9040 8860 8880 8998
-178H998J9N7N8N2N1o5o6L5L5k8k8M1n9n2J49K3K4J0q9J5K16p2j72l3j34j47N4J49n3N2N1
$$ 8998 9017 9074 9132 9184 9235 9170 9104 9139 9174 9146 9118 9159 9100 9048 9197 9220 9244 9254 9165 9180 9396 9324 9152 9119 8985 8838 8892 9041 8988 9040 9091
-194I091L9L9q7q6J47J48O2O3O9O8k09j09J88j3j13j2o9o8QK10p1p1J2J2Q1j9j52N0j3j14
$$ 9091 9130 9169 9082 8996 9143 9291 9353 9416 9485 9553 9344 9235 9423 9410 9297 9285 9216 9148 9156 9366 9295 9224 9236 9248 9329 9310 9158 9208 9195 9081
-209I081J4J4PQk9k8j28j29K0K0K0K0J52J52N1N2n9o0M2M1R1R2j43j43m9m9N1N1k0k0k0k0
$$ 9081 9095 9109 9116 9124 9095 9067 8939 8810 8830 8850 8870 8890 9042 9194 9245 9297 9238 9178 9220 9261 9352 9444 9301 9158 9109 9060 9111 9162 9142 9122 9102 9082
-225I082k5k4k5k5J95J95K7K8l2l1l2l1M3M4M4M4j92j92j2j2n0J51J58m4k4P5r7j99q9J1J72
$$ 9082 9057 9033 9008 8983 9178 9373 9400 9428 9396 9365 9333 9302 9345 9389 9433 9477 9285 9093 9081 9069 9019 9170 9328 9284 9260 9335 9238 9039 8950 8961 9133
-240I133P2l5l5m1m2P4P4k6k7J9J9N0J51k9k30o9J32Q1j20j14Q7K8p2J0Rk7J73J74k8j80j80
$$ 9133 9205 9170 9135 9094 9052 9126 9200 9174 9147 9166 9185 9235 9386 9357 9127 9058 9190 9271 9151 9037 9124 9152 9080 9090 9099 9072 9245 9419 9391 9211 9031
-256I031R5R6J50n1o3J37M7j54q4J6OPJ13J13o2o3J05J05k2k3k2k2K7K6j00J02M9j52q3J8
$$ 9031 9126 9222 9372 9321 9258 9395 9442 9288 9204 9220 9226 9233 9346 9459 9397 9334 9439 9544 9522 9499 9477 9455 9482 9508 9408 9510 9559 9407 9324 9342
-271I342Q7Q6p4p4j83j82J19J19MMMMO9O8k9j30O7K67J09k27j12j2m6N5n1n2j46j46N2N2N1
$$ 9342 9429 9515 9441 9367 9184 9002 9121 9240 9244 9248 9252 9256 9325 9393 9364 9234 9301 9568 9677 9450 9338 9326 9280 9335 9284 9232 9086 8940 8992 9044 9095
-287I095N2J73J73j28j28L5L5l4O6J32p0p6J25J37o3j74p4R6j06j05R6O4l6Kr9n9J42J48n3
$$ 9095 9147 9320 9493 9365 9237 9272 9307 9273 9339 9471 9401 9325 9450 9587 9524 9350 9276 9372 9266 9161 9257 9321 9285 9287 9188 9129 9271 9419 9366
-301I366j32O9P7j24k06J29K13J13r2j92L2L2m1N9J28p3j48N2J52m8j93QJ04J05Nj95j82J52
$$ 9366 9234 9303 9380 9256 9050 9179 9392 9505 9413 9221 9253 9285 9244 9303 9431 9358 9210 9262 9414 9366 9173 9181 9285 9390 9395 9200 9018 9170
-315I170K17J6k65o3M6M6N8N9Q3Q4Q3Q4J07J07j27j27j25j25J09J10j37j36R8R8k7k8J28J27
$$ 9170 9387 9403 9138 9075 9121 9167 9225 9284 9367 9451 9534 9618 9725 9832 9705 9578 9453 9328 9437 9547 9410 9274 9372 9470 9443 9415 9543 9670
-329I670J18q3p1p1m3m3j69L2J75k6j13j14j34K00J79J80m2m2m3m2p8p7Q9R0j04j04lmM9M9
$$ 9670 9788 9705 9634 9563 9520 9477 9308 9340 9515 9489 9376 9262 9128 9328 9507 9687 9645 9603 9560 9518 9440 9363 9452 9542 9438 9334 9331 9327 9376 9425
-344I425n2n1N7N8N8N7k4k4j1j2q5J15J16q6k9k9N9N9J8J8J8J7J23J22k45k46M6M7L4L4J43
$$ 9425 9373 9322 9379 9437 9495 9552 9528 9504 9493 9481 9396 9511 9627 9541 9512 9483 9542 9601 9619 9637 9655 9672 9795 9917 9672 9426 9472 9519 9553 9587 9730
-360I730n8j12j13K8K8K8K8qpJ18q3j17Q5m1m1N4N3m7m7N1N2N1N2m0m1m0m1j%m3k43k4J77
$$ 9730 9672 9560 9447 9475 9503 9531 9559 9551 9544 9662 9579 9462 9547 9506 9465 9519 9572 9525 9478 9529 9581 9632 9684 9644 9603 9563 9522 9521 9521 9478 9235 9211 9388
-376I388N2N1K0K0J9K0JJj00r9M8M9M9M9Q1Q0k0k0L7L7J37J37K4K5j44j43j72j71O2O2k3k3
$$ 9388 9440 9491 9511 9531 9550 9570 9571 9572 9472 9373 9421 9470 9519 9568 9649 9729 9709 9689 9726 9763 9900 10037 10061 10086 9942 9799 9627 9456 9518 9580 9557 9534
-393I534P5J75J73k8k06j05N9m2j41N8P9P8J03r7j07j07p8J24K46M5n3j54j57J77Q3k52m1
$$ 9534 9609 9784 9957 9929 9723 9618 9677 9635 9494 9552 9631 9709 9812 9715 9608 9501 9423 9547 9793 9838 9785 9631 9474 9651 9734 9482 9441
-406I441J61K6K6J8J9L0j70r1r0j04j03J84J83J6J6J41J41k7k7j46j46J9J20o0k61l3J69J98
$$ 9441 9602 9628 9654 9672 9691 9721 9551 9460 9370 9266 9163 9347 9530 9546 9562 9703 9844 9817 9790 9644 9498 9517 9637 9577 9316 9283 9452 9650
-420I650kr9r8o7J35J91rJ08K09L1j69k35l4O2O2J46n5r9JPOJ3J3J1J1L0j71k50j50K0J21
$$ 9650 9648 9549 9451 9384 9519 9710 9701 9809 10018 10049 9880 9645 9611 9673 9735 9881 9826 9727 9728 9735 9741 9754 9767 9778 9789 9819 9648 9398 9248 9268 9389
-436I389J22K1M6M6q0J20K02j32MJ05j40j40J0J0k1j22r9J02J50J50M9M9j86j85J5J5J03J03
$$ 9389 9511 9532 9578 9624 9544 9664 9866 9734 9738 9843 9703 9563 9573 9583 9562 9440 9341 9443 9593 9743 9792 9841 9655 9470 9485 9500 9603 9706
-450I706J44n6j12j11N2N2M0L9Q3j19PPp4J26J3J4K5K5q4k85J7K18J04r6j9j9l1l1L7L8L8
$$ 9706 9850 9794 9682 9571 9623 9675 9715 9754 9837 9718 9725 9732 9658 9784 9797 9811 9836 9861 9777 9492 9509 9727 9831 9735 9716 9697 9666 9635 9672 9710 9748
-465I748L7o4o5o4o4Q3Q3j43N8Q2j19N7N7O9O8O8O9r8r9r8r9rj0rj0O4O4J4J4J3J2J14J13
$$ 9748 9785 9721 9656 9592 9528 9611 9694 9551 9609 9691 9572 9629 9686 9755 9823 9891 9960 9862 9763 9665 9566 9557 9547 9538 9528 9592 9656 9670 9684 9697 9709 9823 9936
-482I936j47j46Q8Q8J00J01j34j34o6o5j53J81J90J90k4k3L2L3o8o8j7j7o7o7M8M7m1m0r5
$$ 9936 9789 9643 9731 9819 9919 10020 9886 9752 9686 9621 9468 9649 9839 10029 10005 9982 10014 10047 9979 9911 9894 9877 9810 9743 9791 9838 9797 9757 9662
-496I662J06R3R4j11j11o1o1m9m9J85J85J28J27j53M8m8m8O5O5m3m3N7N8j25j24J55m5m5m5
$$ 9662 9768 9861 9955 9844 9733 9672 9611 9562 9513 9698 9883 10011 10138 9985 10033 9985 9937 10002 10067 10024 9981 10038 10096 9971 9847 10002 9957 9912 9867
-511I867n7n8L4L5o6o6LLJ29p3r3J08P0P0N9j41k9k8J79J78o4k64J1K13j4j3k35k36O6O6N9
$$ 9867 9810 9752 9786 9821 9755 9689 9692 9695 9824 9751 9658 9766 9836 9906 9965 9824 9795 9767 9946 10124 10060 9796 9807 10020 10006 9993 9758 9522 9588 9654 9713
-527I713N9m2m2K8K7K7K8j23j23J65J66O9j31j32P0l5l5P8P9R3R2pqK3K4l2k32J01J00j46
$$ 9713 9772 9730 9688 9716 9743 9770 9798 9675 9552 9717 9883 9952 9821 9689 9759 9724 9689 9767 9846 9939 10031 10024 10016 10039 10063 10031 9799 9900 10000 9854
-542I854j47l3l2l3l3R0R1j0j0o5o4M8M8r0J11J99j36p2J29j7j7J98kj24j24J3J4J3J4M4M5
$$ 9854 9707 9674 9642 9609 9576 9666 9757 9747 9737 9672 9608 9656 9704 9614 9725 9924 9788 9716 9845 9828 9811 10009 10007 9883 9759 9772 9786 9799 9813 9857 9902
-557I902n5n6J27J27m1m0o4o3j77K5J67J66P1j30j95OJ14J15N5N4m5m6l0l1O9P0l6l6l6l5
$$ 9902 9847 9791 9918 10045 10004 9964 9900 9837 9660 9685 9852 10018 10089 9959 9764 9770 9884 9999 10054 10108 10063 10017 9987 9956 10025 10095 10059 10023 9987 9952
-572I952O4O5j03j03K8K8J6J5l7k38j58J77K08Pk15k15N1K52K58N8o5L6j34j34J49J49j8j9
$$ 9952 10016 10081 9978 9875 9903 9931 9947 9962 9925 9687 9529 9706 9914 9921 9706 9491 9542 9794 10052 10110 10045 10081 9947 9813 9962 10111 10093 10074
-586A0074l9l8l8l9n5n5n5n6Q5Q4j6j6J08J07noJ27p4l09j07J18J18J31J31l7l6l7l6j10j10
$$ 10074 10035 9997 9959 9920 9865 9810 9755 9699 9784 9868 9852 9836 9944 10051 10046 10040 10167 10093 9784 9677 9795 9913 10044 10175 10138 10102 10065 10029 9919 9809
-601I809j1Q9K29K8k0k1J8J8j56j56J73P3r6J04N2j49q6J5m1j41j12K23J22p8N6N5p2p2p9
$$ 9809 9798 9887 10116 10144 10124 10103 10121 10139 9983 9827 10000 10073 9977 10081 10133 9984 9898 9913 9872 9731 9619 9842 9964 9886 9942 9997 9925 9853 9774
-616I774p8Lr7JK02K19J9j58j57l6l6J31J32l9l9O2O2n3n4J02J01O7j34q3J6J5q6p9K1Q6Q6
$$ 9774 9696 9699 9602 9603 9805 10024 10043 9885 9728 9692 9656 9787 9919 9880 9841 9903 9965 9912 9858 9960 10061 10128 9994 9911 9927 9942 9856 9777 9798 9884 9970
-631I970O2m0j71L0K04Kj26P4P4j26N9K61J47n3p8p7j21k22r4J06P6P5k9k29MK06j7j6J09
$$ 9970 10032 9992 9821 9851 10055 10057 9931 10005 10079 9953 10012 10273 10420 10367 10289 10212 10091 9869 9775 9881 9957 10032 10003 9774 9778 9984 9967 9951 10060
-646A0060r1K9K8J6J7J06J06j22j22p1K9R2j09m0O1J59J59j66j65n2n3j38O3J63l8N9N8M6
$$ 10060 9969 9998 10026 10042 10059 10165 10271 10149 10027 9956 9985 10077 9968 9928 9989 10148 10307 10141 9976 9924 9871 9733 9796 9959 9921 9980 10038 10084
-660A0084M6j14j13j2j3L9M0L9M0rqj09j09k0k0K20K21j02jN5j45l8l7j50j51M5M4q1J19J30
$$ 10084 10130 10016 9903 9891 9878 9917 9957 9996 10036 10027 10019 9910 9801 9781 9761 9981 10202 10100 10099 10154 10009 9971 9934 9784 9633 9678 9722 9641 9760 9890
-675I890p1kR9J34J34R3j09k63j62p3K63M71J37j46m5j8j9J4j88j92RM0J41J04k31j49N2k2
$$ 9890 9819 9817 9916 10050 10184 10277 10168 9905 9743 9670 9933 10404 10541 10395 10350 10332 10313 10327 10139 9947 9956 9996 10137 10241 10010 9861 9913 9891
-689I891k1R1R2K4K5J91J92j12j12j11j12J42J43M2M2j32j31r9J03J50j84j91RL1J31K07O
$$ 9891 9870 9961 10053 10077 10102 10293 10485 10373 10261 10150 10038 10180 10323 10365 10407 10275 10144 10045 10148 10298 10114 9923 9932 9963 10094 10301 10307
-703A0307j43m3J23J23j05j05j05j06NNJ05J06%J%JJ19J19k50k49P9P9m6J54Q2j19OOL5L6
$$ 10307 10164 10121 10244 10367 10262 10157 10052 9946 9951 9956 10061 10167 10167 10168 10168 10169 10288 10407 10157 9908 9987 10066 10020 10174 10256 10137 10143 10149 10184 10220
-718A0220L5L6J4J4j11Q9J21q0q0J20R7j05q0p9q0p9j05R6J27p4N2N2j%j68j68o1o2K41K40
$$ 10220 10255 10291 10305 10319 10208 10297 10418 10338 10258 10378 10475 10370 10290 10211 10131 10052 9947 10043 10170 10096 10148 10200 10199 10199 10031 9863 9802 9740 9981 10221
-733A0221l8l8l8l8J04J04J17q4j62j61O0O0J35J35L4L4j21j20J22p9l51J17K56N4RQR7R6
$$ 10221 10183 10145 10107 10069 10173 10277 10394 10310 10148 9987 10047 10107 10242 10377 10411 10445 10324 10204 10326 10247 9896 10013 10269 10323 10332 10340 10437 10533
-747A0533J8J8k4k24k57n5O6O6o3J38J38o3l8l8O2j38m5m5M3M2K4K4j01R9J65l5R0Q9LKr9
$$ 10533 10551 10569 10545 10321 10064 10009 10075 10141 10078 10216 10354 10291 10253 10215 10277 10139 10094 10049 10092 10134 10158 10182 10081 10180 10345 10310 10400 10489 10492 10494 10395
-762A0395r8ooj07j06l6l5k49m8J14J14K5K6J70J71KLl6l7l7l6k17k16K6K27J45n6O9P0r2
$$ 10395 10297 10291 10285 10178 10072 10036 10001 9752 9704 9818 9932 9957 9983 10153 10324 10326 10329 10293 10256 10219 10183 9966 9750 9776 10003 10148 10092 10161 10231 10139
-777A0139r1J43J42R4R4j28j28j62L9J48J48k6k28j27P4L0L0J55m5o9o9Q6Q6O1O1j06j07l0
$$ 10139 10048 10191 10333 10427 10521 10393 10265 10103 10142 10290 10438 10412 10184 10057 10131 10161 10191 10346 10301 10232 10163 10249 10335 10396 10457 10351 10244 10214
-792A0214l0l0l0N6N6J56J56k8k8j29j28K6K7K6K7j03j02q1q1k01J34K26K6k3k3l6l6M4M4
$$ 10214 10184 10154 10124 10180 10236 10392 10548 10520 10492 10363 10235 10261 10288 10314 10341 10238 10136 10055 9974 9773 9907 10133 10159 10136 10113 10077 10041 10085 10129
-806A0129M4M4M4M3n6n7Q2Q1j8j9poJ19q2l8J63p1k72j14Q8O2O2O0O0m0m1L4L3L3L4M2M2n9
$$ 10129 10173 10217 10261 10304 10248 10191 10273 10354 10336 10317 10310 10304 10423 10341 10303 10466 10395 10123 10009 10097 10159 10221 10281 10341 10301 10260 10294 10327 10360 10394 10436 10478 10419
-823A0419n9O3O2n1J50m7m6P9j22j22j23L3L2P7P6k4k4q6q7J4J3P1P0r7r8O7O6O6O6j01j01
$$ 10419 10360 10423 10485 10434 10584 10537 10491 10570 10448 10326 10203 10236 10268 10345 10421 10397 10373 10287 10200 10214 10227 10298 10368 10271 10173 10240 10306 10372 10438 10337 10236
-838A0236J33J33m0m1P3j28l7l6j62L9J6J5J83J83P3j29j41N9R1j10J6J5J2J1q9q9q6q5Q1
$$ 10236 10369 10502 10462 10421 10494 10366 10329 10293 10131 10170 10186 10201 10384 10567 10640 10511 10370 10429 10520 10410 10426 10441 10453 10464 10375 10286 10200 10115 10196
-853A0196Q2J00J01Q7Q8Pj95k95r4O0O1J9j82R1R2l4J68n1n0k6k5j06R5L29J28j8j8l1l0j02
$$ 10196 10278 10378 10479 10566 10654 10661 10466 10171 10077 10137 10198 10217 10035 10126 10218 10184 10352 10301 10251 10225 10200 10094 10189 10518 10646 10628 10610 10579 10549 10447
-868A0447j02O6K66R1k45k44R1J26p5j08j08Q2Q3O9P0L2j69n6n6M0M0o0o1M4M3J98J98M1j59
$$ 10447 10345 10411 10677 10768 10523 10279 10370 10496 10421 10313 10205 10287 10370 10439 10509 10541 10372 10316 10260 10300 10340 10280 10219 10263 10306 10504 10702 10743 10584
-882A0584j47j48k3k4j37O4m5m5l2l2J89J90m5m5n5n5n5n6J38J37J38J37k1k2j22j22l3l3
$$ 10584 10437 10289 10266 10242 10105 10169 10124 10079 10047 10015 10204 10394 10349 10304 10249 10194 10139 10083 10221 10358 10496 10633 10612 10590 10468 10346 10313 10280
-896A0280J22J22j30l31n1K84J45n5r7J04K34L4k68o6J94pj15j16qrn9n9L6L6Q6Q6N1N2N1
$$ 10280 10402 10524 10394 10063 10012 10296 10441 10386 10289 10393 10627 10661 10393 10327 10521 10514 10399 10283 10275 10266 10207 10148 10184 10220 10306 10392 10443 10495 10546
-911A0546N2p4p4j23j24J27J27m0m0n2n3lkJ15J14n2n3l3l4J7J7O3O3K9j71j27K09J70l0j20
$$ 10546 10598 10524 10450 10327 10203 10330 10457 10417 10377 10325 10272 10269 10267 10382 10496 10444 10391 10358 10324 10341 10358 10421 10484 10513 10342 10215 10424 10594 10564 10444
-926A0444j20l3l2K4K3k6k7J0J0J11J10J%%Jo6o5R7j03j15j14M0M0J4J4J3J4K3K3J23J23K1
$$ 10444 10324 10291 10259 10283 10306 10280 10253 10263 10273 10384 10494 10495 10495 10495 10496 10430 10365 10462 10359 10244 10130 10170 10210 10224 10238 10251 10265 10288 10311 10434 10557 10578
-942A0578K1q0q0n4n3q7J13K82n4j33O8J24J25l0l0j38j39k6k6KK02L5j66j23j23L2L2M9M9
$$ 10578 10599 10519 10439 10385 10332 10245 10358 10640 10586 10453 10521 10645 10770 10740 10710 10572 10433 10407 10381 10383 10585 10620 10454 10331 10208 10240 10272 10321 10370
-957A0370R9R9l7l8l8l7q1q0K1K0j%j%m9m9J18J18k6k6P4P5r8r7LMJ8J9j94OP2P2L4L5n9n9
$$ 10370 10469 10568 10531 10493 10455 10418 10337 10257 10278 10298 10297 10297 10296 10296 10247 10198 10316 10434 10408 10382 10456 10531 10433 10336 10339 10343 10361 10380 10186 10192 10264 10336 10370 10405 10346 10287
-975A0287M2M2r1r1r1r0O1O1O1O1M4M5R5R5o6o6J01J01j7j7L3L4n0m9n0m9Q9Q9k4k4J16q5
$$ 10287 10329 10371 10280 10189 10098 10008 10069 10130 10191 10252 10296 10341 10436 10531 10465 10399 10500 10601 10584 10567 10600 10634 10584 10535 10485 10436 10525 10614 10590 10566 10682 10597
-991A0597nk06k58P8R8R8J38o2N0N0o4o4L6L6llK1j79j94PLK04J07J07L3L2j88J3N5N6J39
$$ 10597 10592 10386 10128 10206 10304 10402 10540 10478 10528 10578 10514 10450 10486 10522 10519 10516 10537 10358 10164 10171 10174 10378 10485 10592 10625 10657 10469 10482 10537 10593 10732
-1006A0732o1j82j82l3l3J8J7k1k1P9P9J51J51q3q3l2l1q3q2M9M9n2n2K00J99q9r0m1J59R7
$$ 10732 10671 10489 10307 10274 10241 10259 10276 10255 10234 10313 10392 10543 10694 10611 10528 10496 10465 10382 10300 10349 10398 10346 10294 10494 10693 10604 10514 10473 10632 10729
-1021A0729R6q4q5n0J49J77j59j71K9k2k3j11j10OPOPM2M2M2M2k9l0Q4j18QQj17Q3O9O9O9
$$ 10729 10825 10741 10656 10606 10755 10932 10773 10602 10631 10609 10586 10475 10365 10371 10378 10384 10391 10433 10475 10517 10559 10530 10500 10584 10466 10474 10482 10365 10448 10517 10586 10655
-1037A0655O9P9j22j09j09m0m1m1m0N6N5N6N6n2n2J15J16k1k0k1k0m0l9l9m0j33j34L4L4P6
$$ 10655 10724 10803 10681 10572 10463 10423 10382 10341 10301 10357 10412 10468 10524 10472 10420 10535 10651 10630 10610 10589 10569 10529 10490 10451 10411 10278 10144 10178 10212 10288
-1053A0288P6P6P6O8O7N5N5K00kj90j89O1O1r3r4o0J41K8K8J9K0J9K0j3j3j80j81R2R2K04
$$ 10288 10364 10440 10516 10584 10651 10706 10761 10961 10959 10769 10580 10641 10702 10609 10515 10455 10596 10624 10652 10671 10691 10710 10730 10717 10704 10524 10343 10435 10527 10731
-1068A0731Mj11j11J11J11o8o7Q8Q8J17q4j38j38L9M0O5j37j16Q5m1m0P0P0m3J58rqMMq7q8
$$ 10731 10735 10624 10513 10624 10735 10667 10600 10688 10776 10893 10809 10671 10533 10572 10612 10677 10540 10424 10509 10468 10428 10498 10568 10525 10683 10674 10666 10670 10674 10587 10499
-1083A0499p6p5l9J61M8M9j40j40R4R5N2N2kk03L4L3J47n5k54n4J68l3K8K7J16J16j07j07
$$ 10499 10423 10348 10309 10470 10518 10567 10427 10287 10381 10476 10528 10580 10578 10375 10409 10442 10589 10534 10280 10226 10394 10361 10389 10416 10532 10648 10541 10434
-1097A0434J27J28j1j1j11j11j9j8Q1Q2O0O1O0O1noJ21q1l09j07O7O8k4k4k4k4Q1Q1R3j08
$$ 10434 10561 10689 10678 10667 10556 10445 10426 10408 10489 10571 10631 10692 10752 10813 10808 10802 10923 10842 10533 10426 10493 10561 10537 10513 10489 10465 10546 10627 10720 10612
-1112A0612l3l4m6m6L4L3J34J34o1o2j74K6JKJ3J4R6R5M1j60j74j75JK03P6P6j1j1P8P9k2
$$ 10612 10579 10545 10499 10453 10487 10520 10654 10788 10727 10665 10491 10517 10518 10520 10533 10547 10643 10738 10779 10619 10445 10270 10271 10474 10550 10626 10615 10604 10682 10761 10739
-1128A0739k2k4k4k3k4q0q1r2J08K4K4J38J37J8J8q2q2J3J4J4J3r5r5j20Q1L4j66m0m1J73
$$ 10739 10717 10693 10669 10646 10622 10542 10461 10369 10477 10501 10525 10663 10800 10818 10836 10754 10672 10685 10699 10713 10726 10631 10536 10416 10497 10531 10365 10325 10284 10457
-1143A0457J73J60J60rk10j98j97K2K2K2K2J9J8J8J8J0J0r1r1K56K56j13j12k1k0k1k1opp
$$ 10457 10630 10790 10950 10941 10731 10533 10336 10358 10380 10402 10424 10443 10461 10479 10497 10507 10517 10426 10335 10591 10847 10734 10622 10601 10581 10560 10539 10533 10526 10519
-1158A0519pp6p6R2R1M9M8k0Q0P3j27j65o4J0J0J17J17k1k1k1k1J7J8J7J8j4j4N5m5n2J50
$$ 10519 10512 10436 10360 10452 10543 10592 10640 10620 10700 10773 10646 10481 10417 10427 10437 10554 10671 10650 10629 10608 10587 10604 10622 10639 10657 10643 10629 10684 10639 10587 10737
-1174A0737J8J7J48n4j54j54k65P0K29K9j04j04N1N1O9O9O9O9j03j02j03j03P5P4k7k6p8p9
$$ 10737 10755 10772 10920 10866 10712 10558 10293 10363 10592 10621 10517 10413 10464 10515 10584 10653 10722 10791 10688 10586 10483 10380 10455 10529 10502 10476 10398 10319
-1188A0319p9p8J22J22J21J22m7m8m8m7qqK4J24ok07j87J47K78P7r0r0L6L5J36J36k3k3j23
$$ 10319 10240 10162 10284 10406 10527 10649 10602 10554 10506 10459 10451 10443 10467 10591 10585 10378 10191 10338 10616 10693 10603 10513 10549 10584 10720 10856 10833 10810 10687
-1202A0687j23O3O3O3O3j27j27J07J07jjkjo8o8J00J00p6p6K4K5QRRQq5q6J5J5j29j28J06
$$ 10687 10564 10627 10690 10753 10816 10689 10562 10669 10776 10775 10774 10772 10771 10703 10635 10735 10835 10759 10683 10707 10732 10740 10749 10758 10766 10681 10595 10610 10625 10496 10368 10474
-1218A0474J05J31J31j59j60j07O0N7N6K1j47j46K1RRK0K0j8j8M9n2Q4K51J45k3m4m4M6M6
$$ 10474 10579 10710 10841 10682 10522 10415 10475 10532 10588 10609 10462 10316 10337 10346 10355 10375 10395 10377 10359 10408 10356 10440 10691 10836 10813 10769 10725 10771 10817
-1233A0817onook6k7k6k7j19j19PJ74K46J1j99r7J05K06M5n5r7r8O4O4j26j26k6k5l0l0m0
$$ 10817 10811 10806 10800 10794 10768 10741 10715 10688 10569 10450 10457 10631 10877 10888 10689 10592 10697 10903 10948 10893 10796 10698 10762 10826 10700 10574 10548 10523 10493 10463 10423
-1248A0423m0J25m3m2J25nmONO3O3O3O2j19j19j9j9J3J3J4J3J9J9K0J9kkkknmj15j15R4p4
$$ 10423 10383 10508 10465 10423 10548 10543 10539 10545 10550 10613 10676 10739 10801 10682 10563 10544 10525 10538 10551 10565 10578 10597 10616 10636 10655 10653 10651 10649 10647 10642 10638 10523 10408 10502 10428
-1266A0428p4R4J69J69J2J2r5r5q4q4j3J54K2p8j8Q2K0J9%Jj00j00P5P5P6P5M0L9o7o7Mr6
$$ 10428 10354 10448 10617 10786 10798 10810 10715 10620 10536 10452 10439 10593 10615 10537 10519 10601 10621 10640 10640 10641 10541 10441 10516 10591 10667 10742 10782 10821 10754 10687 10691 10595
-1282A0595m4J24J06o0j80q0O8O9k6k6K7K6k07k08J35J35J36J35J4J4r9J02q5q6K8K7N3N3
$$ 10595 10551 10675 10781 10721 10541 10461 10529 10598 10572 10546 10573 10599 10392 10184 10319 10454 10590 10725 10739 10753 10654 10756 10671 10585 10613 10640 10693 10746
-1296A0746m8m8k5k5j3j3j06R4Q1Q2O9O9r8r8k3k3K8K7m6m7J17q4n3n2L5L5j7j7j8j7j1j1
$$ 10746 10698 10650 10625 10600 10587 10574 10468 10562 10643 10725 10794 10863 10765 10667 10644 10621 10649 10676 10630 10583 10700 10616 10563 10511 10546 10581 10564 10547 10529 10512 10501 10490
-1312A0490j1j1J3J3%JJ58m2P0P1p3p3k3k3m9m9O4O4n5J47L4L3l4l5q4q5q8q7P9Q0K6K7P6
$$ 10490 10479 10468 10481 10494 10494 10495 10653 10611 10681 10752 10679 10606 10583 10560 10511 10462 10526 10590 10535 10682 10716 10749 10715 10680 10596 10511 10423 10336 10415 10495 10521 10548 10624
-1329A0624P7k6k6p7p6m7m7k6k6k82N3L45J45O3O3n0n0J03J03KLj2j3j88J3Q1j21N5N6P2P2
$$ 10624 10701 10675 10649 10572 10496 10449 10402 10376 10350 10068 10121 10466 10611 10674 10737 10687 10637 10740 10843 10845 10848 10836 10823 10635 10648 10729 10608 10663 10719 10791 10863
-1344A0863n0k50%%j3j3opJ61J61j67j66o7o6K8K8K7K8j14j15J20J20l5l5R1j10o8J33J08
$$ 10863 10813 10563 10563 10563 10550 10537 10531 10524 10685 10846 10679 10513 10446 10380 10408 10436 10463 10491 10377 10262 10382 10502 10467 10432 10523 10413 10345 10478 10586
-1359A0586L09J56j79K2K2n1n1n1n1o8o8L2L3R6R5k05k06J29J29l8l8k39k39LK05K88Q7k2
$$ 10586 10895 11051 10872 10894 10916 10865 10814 10763 10712 10644 10576 10608 10641 10737 10832 10627 10421 10550 10679 10641 10603 10364 10125 10128 10333 10621 10708 10686
-1373A0686k1j11j11n7J44J44J44KJk98r7R2R1P0P0r7r7P1P1k9k9j2j2L9L9J7J7J7J7l8l8
$$ 10686 10665 10554 10443 10386 10530 10674 10818 10820 10821 10523 10426 10518 10609 10679 10749 10652 10555 10626 10697 10668 10639 10627 10615 10654 10693 10710 10727 10744 10761 10723 10685
-1388A0685l8l9j9j9j9j9NNN5N5J7J7q4q3J39J39Q5j16p8p9RRn2n1j65L7J23J24L6L5r6r6
$$ 10685 10647 10608 10589 10570 10551 10532 10537 10542 10597 10652 10669 10686 10602 10519 10658 10797 10882 10766 10688 10609 10618 10627 10575 10524 10359 10396 10519 10643 10679 10714 10618 10522
-1404A0522NMj14j14O6O6j7J83J6j85J33J33K0K0q3q2J8J7opopK0K0O9P0l6l5O4O5q4q4J6
$$ 10522 10527 10531 10417 10303 10369 10435 10418 10601 10617 10432 10565 10698 10718 10738 10655 10573 10591 10608 10602 10595 10589 10582 10602 10622 10691 10761 10725 10690 10754 10819 10735 10651 10667
-1421A0667J7nnM5M6j4j3N0j52L2L2j49j48nnnmL2L3j81K1R3R4K18J9qrk0k1k0k1k0k1LLj0
$$ 10667 10684 10679 10674 10719 10765 10751 10738 10788 10636 10668 10700 10551 10403 10398 10393 10388 10384 10416 10449 10268 10289 10382 10476 10694 10713 10705 10696 10676 10655 10635 10614 10594 10573 10576 10579 10569
-1439A0569rJ49n1l9l9%%j55j55j6J85J35o6M3M3J30J31n9n9k13k14K1K22%k01m8J54O6O6
$$ 10569 10560 10709 10658 10619 10580 10580 10580 10425 10270 10254 10439 10574 10508 10551 10594 10724 10855 10796 10737 10524 10310 10331 10553 10553 10352 10304 10458 10524 10590
$$ [...]
-32894e2
##END=		$$ NMR SPECTRUM
##END=		$$ LINK
