##TITLE=	XbX35K9gS6anp875E9GSiQ.10.fid
##JCAMP-DX=	6.0	$$ MestReNova 14.3.3-33362
##DATA TYPE=	LINK
##BLOCKS=	1    
##ORIGIN=	Mestrelab Research S.L.
##OWNER=	hrzepa
##$MNOVA/METADATA=	(DOCUMENT,BASE64)
eyJuYW1lIjoiL1VzZXJzL2hyemVwYS9MaWJyYXJ5L01vYmlsZSBEb2N1bWVudHMvY29tfmFwcGxlfkN
sb3VkRG9jcy9TaGVwcGFyZC9OTVIgZmlsZXMgemlwcy0yL0Jvcm94aW5lIC0gYW1pbmUgYWRkdWN0cy
9UcmlwaGVueWxib3JveGluZSArIGFtaW5vIHB5cmlkaW5lL3RyaXBoZW55bGJvcm94aW5lICsgYW1pb
m8gcHlyaWRpbmUtSC90cmlwaGVueWxib3JveGluZSArIGFtaW5vIHB5cmlkaW5lLUgubW5vdmEiLCJw
YWdlcyI6W3siaXRlbXMiOlsiMSIgICAgIF19XX0=
##TITLE=	XbX35K9gS6anp875E9GSiQ.10.fid
##JCAMP-DX=	6.0	$$ MestReNova 14.3.3-33362
##DATA TYPE=	NMR SPECTRUM
##DATA CLASS=	XYDATA
##BLOCK_ID=	1
##ORIGIN=	Bruker BioSpin GmbH
##OWNER=	root
##NUMDIM=	1
##$MNOVA/METADATA=	(ITEM,BASE64)
eyJhbmdsZSI6MCwiYXhlcyI6eyJ4Ijp7Im1heCI6MTYuMTQ1NjEwMDAwMDY5MjYsIm1pbiI6LTMuODQ
4ODg1NzE5NDk1NzAxfSwieSI6eyJtYXgiOjExNDMzMjM5LjQzNzUsIm1pbiI6LTEwMzk5ODIuMjIyND
EyMTA5NH19LCJwb2ludHMiOlt7IngiOjUzMjEsInkiOjU4MzV9LHsieCI6ODcyMiwieSI6NTgzNX0se
yJ4Ijo4NzIyLCJ5Ijo4MjA4fSx7IngiOjUzMjEsInkiOjgyMDh9LHsieCI6NTMyMSwieSI6NTgzNX1d
LCJ6IjowfQ==
##.OBSERVE FREQUENCY=	500.13308830199997601
##.OBSERVE NUCLEUS=	^1H
##.SOLVENT NAME=	CDCl3
##.PULSE SEQUENCE=	zg30
##LONGDATE=	2022/12/01 16:51:37.000
##.ACQUISITIONMODE=	SIMULTANEOUS (DQD)
##$ORIGINAL FORMAT=	Bruker XWIN-NMR
##$MNOVA/SCALES_VERSION=	9
##$PARAMETER FILE=	(acqus, ASCII, /private/var/folders/f6/rjf_tdyn2v98c5c0wvkgn4s80000gq/T/XbX35K9gS6anp875E9GSiQ/10/acqus, 0)
$$ ##TITLE= Parameter file, TopSpin 4.1.3
$$ ##JCAMPDX= 5.0
$$ ##DATATYPE= Parameter Values
$$ ##NPOINTS= 1	$$ modification sequence number
$$ ##ORIGIN= Bruker BioSpin GmbH
$$ ##OWNER= root
$$ $$ 2022-12-01 16:51:40.532 +0000  root@CZC036BXXF
$$ $$ Z:/500/data/tds/nmr/RP278 Ph3B3O3 + NH2Py/10/acqus
$$ $$ process C:\Bruker\TopSpin4.1.3\prog\mod\dirdata.exe
$$ ##$ACQT0= -2.55872630837368
$$ ##$AMP= (0..31)
$$ 100 100 100 100 100 100 100 100 100 100 100 100 100 100 100 100 100 100
$$ 100 100 100 100 100 100 100 100 100 100 100 100 100 100
$$ ##$AMPCOIL= (0..32)
$$ -1 0 0 0 0 0 0 0 0 0 0 0 0 0 0 0 0 0 0 0 0 0 0 0 0 0 0 0 0 0 0 0 0
$$ ##$AQSEQ= 0
$$ ##$AQ_mod= 3
$$ ##$AUNM= <au_zg>
$$ ##$AUTOPOS= <26 >
$$ ##$BF1= 500.13
$$ ##$BF2= 500.13
$$ ##$BF3= 500.13
$$ ##$BF4= 500.13
$$ ##$BF5= 500.13
$$ ##$BF6= 500.13
$$ ##$BF7= 500.13
$$ ##$BF8= 500.13
$$ ##$BWFAC= (0..63)
$$ 0 0 0 0 0 0 0 0 0 0 0 0 0 0 0 0 0 0 0 0 0 0 0 0 0 0 0 0 0 0 0 0 0 0 0 0
$$ 0 0 0 0 0 0 0 0 0 0 0 0 0 0 0 0 0 0 0 0 0 0 0 0 0 0 0 0
$$ ##$BYTORDA= 0
$$ ##$CHANFCU= (0..24)
$$ 0 1 0 0 0 0 0 0 0 0 0 0 0 0 0 0 0 0 0 0 0 0 0 0 0
$$ ##$CHANREC= (0..24)
$$ 0 1 0 0 0 0 0 0 0 0 0 0 0 0 0 0 0 0 0 0 0 0 0 0 0
$$ ##$CHEMSTR= <none>
$$ ##$CNST= (0..63)
$$ 1 1 1 1 1 1 1 1 1 1 1 1 1 1 1 1 1 1 1 1 1 1 1 1 1 1 1 1 1 1 1 1 1 1 1 1
$$ 1 1 1 1 1 1 1 1 1 1 1 1 1 1 1 1 1 1 1 1 1 1 1 1 1 1 1 1
$$ ##$CPDPRG= (0..8)
$$ <> <> <> <> <> <> <> <> <>
$$ ##$D= (0..63)
$$ [...]
$$ 1 1 1 1 0 0 0 0 0 0 0 0 0 0 0 0 0 0 0 0 0 0 0 0 0 0 0 0
$$ ##$ShimPowRng3= (0..63)
$$ 1 1 1 1 1 1 1 1 1 1 1 1 1 1 1 1 1 1 1 1 1 1 1 1 1 1 1 1 1 1 1 1 1 1 1 1
$$ 1 1 1 1 0 0 0 0 0 0 0 0 0 0 0 0 0 0 0 0 0 0 0 0 0 0 0 0
$$ ##$ShimPowType1= 8
$$ ##$ShimPowType2= 8
$$ ##$ShimPowType3= 0
$$ ##$ShimPowType4= 0
$$ ##$ShimPowType5= 0
$$ ##$ShimPowType6= 0
$$ ##$ShimPowType7= 0
$$ ##$ShimPowType8= 0
$$ ##$ShimSysActGrad= (0..63)
$$ 1 2 3 4 13 5 7 11 10 9 6 8 12 18 19 20 21 15 22 23 24 14 25 16 26 17 27
$$ 28 31 32 33 34 35 36 37 38 0 0 0 0 0 0 0 0 0 0 0 0 0 0 0 0 0 0 0 0 0 0
$$ 0 0 0 0 0 0
$$ ##$ShimSysAngle= <>
$$ ##$ShimSysFunc= (0..63)
$$ 1 2 3 4 5 6 7 8 9 10 0 37 38 35 16 15 14 13 12 11 28 27 26 25 24 23 36
$$ 22 30 29 20 21 34 33 32 31 17 18 19 0 0 0 0 0 0 0 0 0 0 0 0 0 0 0 0 0 0
$$ 0 0 0 0 0 0 0
$$ ##$ShimSysMatId= <292722ba.dat>
$$ ##$ShimSysMatrix= 1
$$ ##$ShimSysMinMaxUG= 130000
$$ ##$ShimSysOffset= <58 mm>
$$ ##$ShimSysType= 4
$$ ##$ShimUnit= 3
$$ ##$SpectrOsVersion= <4.1.156.20210628>
$$ ##$TCubeEth= <192.168.180.18>
$$ ##$TCubeSeqDevice= <>
$$ ##$TOSITY= <no>
$$ ##$TRIPLO2= 0
$$ ##$TopSpinVersion= <TopSpin 4.1.3>
$$ ##$TrxFreqFormula= (0..23)
$$ <TrxFreqFormula(2.0,500130000.000000,'TRX',Trx(1.0,'TRX 1200.1',2,5.000000,1290.000000))>
$$ <TrxFreqFormula(2.0,500130000.000000,'TRX',Trx(1.0,'TRX 1200.2',2,5.000000,1290.000000))>
$$ <> <> <> <> <> <> <> <> <> <> <> <> <> <> <> <> <> <> <> <> <> <>
$$ ##$TrxPN= (0..23)
$$ <Z148391> <Z148391> <> <> <> <> <> <> <> <> <> <> <> <> <> <> <> <> <>
$$ <> <> <> <> <>
$$ ##$TrxSN= (0..23)
$$ <05365> <05364> <> <> <> <> <> <> <> <> <> <> <> <> <> <> <> <> <> <> <>
$$ <> <> <>
$$ ##$VCubeEth= (0..23)
$$ <no> <no> <no> <no> <no> <no> <no> <no> <no> <no> <no> <no> <no> <no> <no>
$$ <no> <no> <no> <no> <no> <no> <no> <no> <no>
$$ ##$VTU= 2
$$ ##$VTUETH= <192.168.99.10>
$$ ##$VTUTY= <no>
$$ ##$ValueLine= no
$$ ##$VpuPN= (0..23)
$$ <no> <no> <no> <no> <no> <no> <no> <no> <no> <no> <no> <no> <no> <no> <no>
$$ <no> <no> <no> <no> <no> <no> <no> <no> <no>
$$ ##$VpuSN= (0..23)
$$ <no> <no> <no> <no> <no> <no> <no> <no> <no> <no> <no> <no> <no> <no> <no>
$$ <no> <no> <no> <no> <no> <no> <no> <no> <no>
$$ ##$WBREFAM= (0..31)
$$ 99.9 100 100 100 100 100 100 100 100 100 100 100 100 100 100 100 100 100
$$ 100 100 100 100 100 100 100 100 100 100 100 100 100 100
$$ ##$WBREFLM= (0..31)
$$ 2 0 0 0 0 0 0 0 0 0 0 0 0 0 0 0 0 0 0 0 0 0 0 0 0 0 0 0 0 0 0 0
$$ ##$WBREFPH= (0..31)
$$ 0.91 0 0 0 0 0 0 0 0 0 0 0 0 0 0 0 0 0 0 0 0 0 0 0 0 0 0 0 0 0 0 0
$$ ##$WBSGU= (0..31)
$$ 1 1 2 0 0 0 0 0 0 0 0 0 0 0 0 0 0 0 0 0 0 0 0 0 0 0 0 0 0 0 0 0
$$ ##END=
$$ 
##$DECIM=	2000
##$DSPFVS=	21
##XUNITS=	HZ
##YUNITS=	ARBITRARY UNITS
##FIRSTX=	8074.9041456511713477
##LASTX=	-1924.9432664581950121
##DELTAX=	-0.15258789062499986122
##XFACTOR=	1
##YFACTOR=	317.2051454206976473
##FIRSTY=	503.54931640625
##MINY=	-620.63787841796875
##MAXY=	10393861
##NPOINTS=	65536
##XYDATA=	(X++(Y..Y))
$$ [...]
7100A%%J%j%%%%%J%j%%%JJj%%%%%%%%%%%%%%j%%JJ%jj%%%JJ%jJk%j%J%%%%%jJJJ%J%j%%%%
$$ 1 1 1 2 2 1 1 1 1 1 1 2 2 1 1 1 1 2 3 2 2 2 2 2 2 2 2 2 2 2 2 2 2 2 1 1 1 2 3 3 2 1 1 1 1 2 3 3 2 3 1 1 0 0 1 1 1 1 1 1 0 1 2 3 3 4 4 3 3 3 3 3
7089C%%%%%j%%jJ%%%%%%%Jj%J%k%%Jj%%JJj%%%%Jj%%%%%%%%Jj%%jJ%%J%Jjj%j%%jJJ%%%j%
$$ 3 3 3 3 3 3 2 2 2 1 2 2 2 2 2 2 2 2 3 2 2 3 3 1 1 1 2 1 1 1 2 3 2 2 2 2 2 3 2 2 2 2 2 2 2 2 2 3 2 2 2 1 2 2 2 3 3 4 3 2 2 1 1 1 0 1 2 2 2 2 1 1
7078A%%%%%J%%%%%%%J%%jj%%jJJ%j%%%%%%jJ%J%%jJ%%jJ%%%%%%%%%jK%%j%%%J%%j%%Jk%%%
$$ 1 1 1 1 1 1 2 2 2 2 2 2 2 2 3 3 3 2 1 1 1 0 1 2 2 1 1 1 1 1 1 1 0 1 1 2 2 2 1 2 2 2 1 2 2 2 2 2 2 2 2 2 2 1 3 3 3 2 2 2 2 3 3 3 2 2 2 3 1 1 1 1
7067AjJJ%%%%j%J%%J%%%jjjJ%%%J%%JjjJ%JjjJ%%%%%%%%%J%j%%%%Jj%%%%%j%%%%JJj%%%%%
$$ 1 0 1 2 2 2 2 2 1 1 2 2 2 3 3 3 3 2 1 0 1 1 1 1 2 2 2 3 2 1 2 2 3 2 1 2 2 2 2 2 2 2 2 2 2 3 3 2 2 2 2 2 3 2 2 2 2 2 2 1 1 1 1 1 2 3 2 2 2 2 2 2
7057B%%%%JJ%j%j%J%%%jjJ%%%jj%K%jjJ%%%%%J%%jJ%%%jjJJ%%%%%%j%%j%JjJ%%%%%J%Jj%%
$$ 2 2 2 2 2 3 4 4 3 3 2 2 3 3 3 3 2 1 2 2 2 2 1 0 0 2 2 1 0 1 1 1 1 1 1 2 2 2 1 2 2 2 2 1 0 1 2 2 2 2 2 2 2 1 1 1 0 0 1 0 1 1 1 1 1 1 2 2 3 2 2 2
7046B%JJ%j%J%j%j%Jj%%J%j%%JJj%%j%%J%%%%%j%j%jJJ%%Jj%%%%j%%%%JJj%%%J%%Jjjj%J%
$$ 2 2 3 4 4 3 3 4 4 3 3 2 2 3 2 2 2 3 3 2 2 2 3 4 3 3 3 2 2 2 3 3 3 3 3 3 2 2 1 1 0 1 2 2 2 3 2 2 2 2 2 1 1 1 1 1 2 3 2 2 2 2 3 3 3 4 3 2 1 1 2 2
7035Bj%%J%%%j%J%%%%%%J%jj%%Jj%J%%%%%j%%%J%J%j%%%%JJ%jj%J%j%j%%J%%%jJ%%%jJJk%
$$ 2 1 1 1 2 2 2 2 1 1 2 2 2 2 2 2 2 3 3 2 1 1 1 2 1 1 2 2 2 2 2 2 1 1 1 1 2 2 3 3 2 2 2 2 2 3 4 4 3 2 2 3 3 2 2 1 1 1 2 2 2 2 1 2 2 2 2 1 2 3 1 1
7024AjJ%%%%%J%%j%%J%%%j%%%%j%%JJ%%%j%JJ%J%j%%j%%%%%j%%%J%j%J%%%%j%%%%J%%%%%%
$$ 1 0 1 1 1 1 1 1 2 2 2 1 1 1 2 2 2 2 1 1 1 1 1 0 0 0 1 2 2 2 2 1 1 2 3 3 4 4 3 3 3 2 2 2 2 2 2 1 1 1 1 2 2 1 1 2 2 2 2 2 1 1 1 1 1 2 2 2 2 2 2 2
7013B%%%%J%jj%%%%%j%J%%J%%%kJ%J%%%Jj%%J%%j%%%%j%J%%%%%j%J%%j%%%jJJ%%%J%%jj%J
$$ 2 2 2 2 2 3 3 2 1 1 1 1 1 1 0 0 1 1 1 2 2 2 2 0 1 1 2 2 2 2 3 2 2 2 3 3 3 2 2 2 2 2 1 1 2 2 2 2 2 2 1 1 2 2 2 1 1 1 1 0 1 2 2 2 2 3 3 3 2 1 1 2
7002B%jJJjjjJJ%%%%Jj%%%%j%%Jj%J%%j%%jJJ%%%JjjjjKJ%jJ%j%%%%%J%%J%Jj%%%j%%JJ%j
$$ 2 2 1 2 3 2 1 0 1 2 2 2 2 2 3 2 2 2 2 2 1 1 1 2 1 1 2 2 2 1 1 1 0 1 2 2 2 2 3 2 1 0 -1 1 2 2 1 2 2 1 1 1 1 1 1 2 2 2 3 3 4 3 3 3 3 2 2 2 3 4 4 3
6992C%%%%jjjJ%%%%J%J%j%%j%J%%%%%j%Jj%%%J%%%%jJJ%jj%%jJ%%J%j%J%%%Jj%jJ%%%%%j%
$$ 3 3 3 3 3 2 1 0 1 1 1 1 1 2 2 3 3 2 2 2 1 1 2 2 2 2 2 2 1 1 2 1 1 1 1 2 2 2 2 2 1 2 3 3 2 1 1 1 0 1 1 1 2 2 1 1 2 2 2 2 3 2 2 1 2 2 2 2 2 2 1 1
6981A%%%jJ%J%Jj%%%%%j%%%%%%%JJ%jj%jjJ%J%%%jJJ%%%jj%J%%%%J%%j%%%Jj%J%%%jjJ%J%
$$ 1 1 1 1 0 1 1 2 2 3 2 2 2 2 2 2 1 1 1 1 1 1 1 1 2 3 3 2 1 1 0 -1 0 0 1 1 1 1 0 1 2 2 2 2 1 0 0 1 1 1 1 1 2 2 2 1 1 1 1 2 1 1 2 2 2 2 1 0 1 1 2 2
6970BjJ%%%JjjJ%j%%%%JJjJ%%%%%jj%jJ%%%j%%J%jJj%%K%%j%%JJ%jjJ%%%%%%%jj%%jJJJ%%
$$ 2 1 2 2 2 2 3 2 1 2 2 1 1 1 1 1 2 3 2 3 3 3 3 3 3 2 1 1 0 1 1 1 1 0 0 0 1 1 0 1 0 0 0 2 2 2 1 1 1 2 3 3 2 1 2 2 2 2 2 2 2 2 1 0 0 0 -1 0 1 2 2 2
6959B%%Jkj%%J%j%%J%Jj%%%%K%%jj%%%%j%%J%j%J%%%%%%%K%j%%jKj%%%%%J%j%JJk%%j%%%%
$$ 2 2 2 3 1 0 0 0 1 1 0 0 0 1 1 2 1 1 1 1 1 3 3 3 2 1 1 1 1 1 0 0 0 1 1 0 0 1 1 1 1 1 1 1 1 3 3 2 2 2 1 3 2 2 2 2 2 2 3 3 2 2 3 4 2 2 2 1 1 1 1 1
6948A%%J%%j%%%%J%jJ%%%%%%J%j%%%%%%k%JJ%%JjkJ%J%J%%J%j%j%J%jj%%J%%%%%%%Jj%j%%
$$ 1 1 1 2 2 2 1 1 1 1 1 2 2 1 2 2 2 2 2 2 2 3 3 2 2 2 2 2 2 2 0 0 1 2 2 2 3 2 0 1 1 2 2 3 3 3 4 4 3 3 2 2 3 3 2 1 1 1 2 2 2 2 2 2 2 2 3 2 2 1 1 1
6937A%Jj%%J%%%%%%j%%JJ%k%%%%J%%J%%%%%%jjJJ%%%%%J%%%%j%%j%%%%%jJ%j%JJ%%jj%%Kj
$$ 1 1 2 1 1 1 2 2 2 2 2 2 2 1 1 1 2 3 3 1 1 1 1 1 2 2 2 3 3 3 3 3 3 3 2 1 2 3 3 3 3 3 3 4 4 4 4 4 3 3 3 2 2 2 2 2 2 1 2 2 1 1 2 3 3 3 2 1 1 1 3 2
6927BJ%%%j%%%%Jj%%%%%%%%%%%%jJ%%jJ%%Jj%%j%JJjJJk%%%%%jJ%k%jJ%%Jj%%J%%%%%%J%J
$$ 2 3 3 3 3 2 2 2 2 2 3 2 2 2 2 2 2 2 2 2 2 2 2 2 1 2 2 2 1 2 2 2 3 2 2 2 1 1 2 3 2 3 4 2 2 2 2 2 2 1 2 2 0 0 -1 0 0 0 1 0 0 0 1 1 1 1 1 1 1 2 2 3
6916C%%%j%J%%%%jJj%%J%%Jjj%%J%%%%jk%J%J%%%j%%J%%J%%%%%jj%Jj%%%%%%%Jj%jJJ%jJ%
$$ 3 3 3 3 2 2 3 3 3 3 3 2 3 2 2 2 3 3 3 4 3 2 2 2 3 3 3 3 3 2 0 0 1 1 2 2 2 2 1 1 1 2 2 2 3 3 3 3 3 3 2 1 1 2 1 1 1 1 1 1 1 1 2 1 1 0 1 2 2 1 2 2
6905B%%%j%%%%%jJj%%J%J%Jj%%%%%%%j%J%%%%%%jJJ%%%j%%%%j%%%j%%JJ%%%%%J%%j%%Jj%%
$$ 2 2 2 2 1 1 1 1 1 1 0 1 0 0 0 1 1 2 2 3 2 2 2 2 2 2 2 2 1 1 2 2 2 2 2 2 2 1 2 3 3 3 3 2 2 2 2 2 1 1 1 1 0 0 0 1 2 2 2 2 2 2 3 3 3 2 2 2 3 2 2 2
6894B%%%%%jjj%J%JJ%%%j%%%J%%j%%JJjj%%%%J%%%%%jJ%%j%%%jJ%%%%%%Jj%J%%%%%%%%%j%
$$ 2 2 2 2 2 2 1 0 -1 -1 0 0 1 2 2 2 2 1 1 1 1 2 2 2 1 1 1 2 3 2 1 1 1 1 1 2 2 2 2 2 2 1 2 2 2 1 1 1 1 0 1 1 1 1 1 1 1 2 1 1 2 2 2 2 2 2 2 2 2 2 1 1
6883AjJJJj%j%%%%%%%%%J%%%%%%%jjJJ%%%j%%%Jk%J%Kjj%k%J%Jj%%%JJ%%jJKjj%%%%%%%%%
$$ 1 0 1 2 3 2 2 1 1 1 1 1 1 1 1 1 1 2 2 2 2 2 2 2 2 1 0 1 2 2 2 2 1 1 1 1 2 0 0 1 1 3 2 1 1 -1 -1 0 0 1 0 0 0 0 1 2 2 2 1 2 4 3 2 2 2 2 2 2 2 2 2 2
6872B%JJjj%%%%%%%%%j%%J%Jjj%%J%%%Jjj%%%%J%%jJ%J%%jJ%jj%%JJj%jJ%%%%%%j%J%J%j%
$$ 2 2 3 4 3 2 2 2 2 2 2 2 2 2 2 1 1 1 2 2 3 2 1 1 1 2 2 2 2 3 2 1 1 1 1 1 2 2 2 1 2 2 3 3 3 2 3 3 2 1 1 1 2 3 2 2 1 2 2 2 2 2 2 2 1 1 2 2 3 3 2 2
6862B%%%%jJ%%J%j%jJj%jJJj%%%JJ%j%%%%%%%j%%%%J%Jj%%%%%%%%j%%J%J%%j%jJ%%%J%%jj
$$ 2 2 2 2 2 1 2 2 2 3 3 2 2 1 2 1 1 0 1 2 1 1 1 1 2 3 3 2 2 2 2 2 2 2 2 1 1 1 1 1 2 2 3 2 2 2 2 2 2 2 2 2 1 1 1 2 2 3 3 3 2 2 1 2 2 2 2 3 3 3 2 1
6851Aj%J%J%jJ%%%%%%J%%%%j%%%j%%%J%%%j%%JJk%J%%j%%%J%jJ%%J%jj%%%J%%j%%%%%%%%J
$$ 1 0 0 1 1 2 2 1 2 2 2 2 2 2 2 3 3 3 3 3 2 2 2 2 1 1 1 1 2 2 2 2 1 1 1 2 3 1 1 2 2 2 1 1 1 1 2 2 1 2 2 2 3 3 2 1 1 1 1 2 2 2 1 1 1 1 1 1 1 1 1 2
6840Bj%%J%%j%%%%%J%%%%%%Jj%j%%J%%%%%%J%%%%j%%%%jJjJ%%%jJJkJ%jJ%%K%jk%J%%%j%%
$$ 2 1 1 1 2 2 2 1 1 1 1 1 1 2 2 2 2 2 2 2 3 2 2 1 1 1 2 2 2 2 2 2 2 3 3 3 3 3 2 2 2 2 2 1 2 1 2 2 2 2 1 2 3 1 2 2 1 2 2 2 4 4 3 1 1 2 2 2 2 1 1 1
6829AjJ%J%JJkj%%%J%j%%J%%%%%%%%%Jj%%j%%jJ%%%%%%%%J%JjjJJ%%%%%%j%jjJ%%%%J%%%%
$$ 1 0 1 1 2 2 3 4 2 1 1 1 1 2 2 1 1 1 2 2 2 2 2 2 2 2 2 2 3 2 2 2 1 1 1 0 1 1 1 1 1 1 1 1 1 2 2 3 2 1 2 3 3 3 3 3 3 3 2 2 1 0 1 1 1 1 1 2 2 2 2 2
6818B%j%%%J%jJ%j%%%%J%%%%jj%%JJ%jJ%J%%%jJ%%%%%jj%JJjjJ%%jJJ%%%%%jJ%%%j%%%%%%
$$ 2 2 1 1 1 1 2 2 1 2 2 1 1 1 1 1 2 2 2 2 2 1 0 0 0 1 2 2 1 2 2 3 3 3 3 2 3 3 3 3 3 3 2 1 1 2 3 2 1 2 2 2 1 2 3 3 3 3 3 3 2 3 3 3 3 2 2 2 2 2 2 2
6807B%J%j%%%%%%jJJ%j%%%JkjJ%%%J%%%%Jj%%%%%%%%%%j%%%%%%%%%J%%%%%Jj%%%%%j%J%JJ
$$ 2 2 3 3 2 2 2 2 2 2 2 1 2 3 3 2 2 2 2 3 1 0 1 1 1 1 2 2 2 2 2 3 2 2 2 2 2 2 2 2 2 2 2 1 1 1 1 1 1 1 1 1 1 2 2 2 2 2 2 3 2 2 2 2 2 2 1 1 2 2 3 4
6797Djj%j%%%%j%J%%%JjJ%%%%%%%%%%jJ%%Jj%%j%%J%%JjjJ%%J%jJ%%kj%J%%%%%%%J%%%%%%
$$ 4 3 2 2 1 1 1 1 1 0 0 1 1 1 1 2 1 2 2 2 2 2 2 2 2 2 2 2 1 2 2 2 3 2 2 2 1 1 1 2 2 2 3 2 1 2 2 2 3 3 2 3 3 3 1 0 0 1 1 1 1 1 1 1 1 2 2 2 2 2 2 2
6786B%%%JJ%j%%j%%Jj%jjJJ%Jj%%%%%%J%kj%JJj%%%%jJJ%%%%%%%J%%%j%%J%%j%j%%J%%Jj%
$$ 2 2 2 2 3 4 4 3 3 3 2 2 2 3 2 2 1 0 1 2 2 3 2 2 2 2 2 2 2 3 3 1 0 0 1 2 1 1 1 1 1 0 1 2 2 2 2 2 2 2 2 3 3 3 3 2 2 2 3 3 3 2 2 1 1 1 2 2 2 3 2 2
6775Bj%%%%Jj%JJ%j%%%%j%%%j%%J%J%%%%%jK%%jj%%%%%J%%%%%%%%jJkJ%JJ%%jjJ%J%%%j%%
$$ 2 1 1 1 1 1 2 1 1 2 3 3 2 2 2 2 2 1 1 1 1 0 0 0 1 1 2 2 2 2 2 2 1 3 3 3 2 1 1 1 1 1 1 2 2 2 2 2 2 2 2 2 1 2 0 1 1 2 3 3 3 2 1 2 2 3 3 3 3 2 2 2
6764B%%%%%%Jj%%%%%j%%j%jKJ%%j%%%%%%%%%%%J%%%%jJ%%%%%%jJJ%j%%%%%%%Jj%J%%%j%%j
$$ 2 2 2 2 2 2 2 3 2 2 2 2 2 2 1 1 1 0 0 -1 1 2 2 2 1 1 1 1 1 1 1 1 1 1 1 1 2 2 2 2 2 1 2 2 2 2 2 2 2 1 2 3 3 2 2 2 2 2 2 2 2 3 2 2 3 3 3 3 2 2 2 1
6753A%%%%%%%%JJJ%%%j%%%j%J%%%%Jjj%%%%%%%J%%%%%%j%%%J%%%JjjjJ%kjJJJJ%%%%%%%%j
$$ 1 1 1 1 1 1 1 1 1 2 3 4 4 4 4 3 3 3 3 2 2 3 3 3 3 3 4 3 2 2 2 2 2 2 2 2 3 3 3 3 3 3 3 2 2 2 2 3 3 3 3 4 3 2 1 2 2 0 -1 0 1 2 3 3 3 3 3 3 3 3 3 2
6742B%jJJ%%j%jJJ%%jJ%%%Jjj%%%jJ%j%J%%K%jjJ%%j%j%%J%Jj%J%%jjJJj%Jj%J%%%%%%jjJ
$$ 2 2 1 2 3 3 3 2 2 1 2 3 3 3 2 3 3 3 3 4 3 2 2 2 2 1 2 2 1 1 2 2 2 4 4 3 2 3 3 3 2 2 1 1 1 2 2 3 2 2 3 3 3 2 1 2 3 2 2 3 2 2 3 3 3 3 3 3 3 2 1 2
6732B%%%%%%%jJ%%%%jJ%%%jJJ%%Jjj%j%%%J%jJ%%%%%jJ%%%%%%J%j%%%J%%%kJ%Jj%%J%%jjJ
$$ 2 2 2 2 2 2 2 2 1 2 2 2 2 2 1 2 2 2 2 1 2 3 3 3 4 3 2 2 1 1 1 1 2 2 1 2 2 2 2 2 2 1 2 2 2 2 2 2 2 3 3 2 2 2 2 3 3 3 3 1 2 2 3 2 2 2 3 3 3 2 1 2
6721B%J%%%j%j%%%jJ%j%JJ%j%%%%%%J%%J%jJJ%j%kJJ%jJ%j%j%%%%J%%%j%JjJ%%%J%%%j%%J
$$ 2 2 3 3 3 3 2 2 1 1 1 1 0 1 1 0 0 1 2 2 1 1 1 1 1 1 1 2 2 2 3 3 2 3 4 4 3 3 1 2 3 3 2 3 3 2 2 1 1 1 1 1 2 2 2 2 1 1 2 1 2 2 2 2 3 3 3 3 2 2 2 3
6710Cj%JJ%%%%jj%jJ%%%%J%%%j%%%j%J%%%%J%j%JjjJ%%%%%%J%j%j%%J%J%jJ%j%j%j%J%jJ%
$$ 3 2 2 3 4 4 4 4 4 3 2 2 1 2 2 2 2 2 3 3 3 3 2 2 2 2 1 1 2 2 2 2 2 3 3 2 2 3 2 1 2 2 2 2 2 2 2 3 3 2 2 1 1 1 2 2 3 3 2 3 3 2 2 1 1 0 0 1 1 0 1 1
6699A%J%%%jjJJ%%%%%%%%%jJ%%%%%%%j%%J%%%jJ%%%%%j%%%JJJ%%%j%%%j%%%jJJjjJ%J%%%%
$$ 1 1 2 2 2 2 1 0 1 2 2 2 2 2 2 2 2 2 2 1 2 2 2 2 2 2 2 2 1 1 1 2 2 2 2 1 2 2 2 2 2 2 1 1 1 1 2 3 4 4 4 4 3 3 3 3 2 2 2 2 1 2 3 2 1 2 2 3 3 3 3 3
6688CJ%j%%Jjj%%%%J%j%%J%%%%j%J%j%%%%%jJJ%%j%%Jj%%Jj%%jJ%jKj%%j%%%%%%Jj%%jJJ%
$$ 3 4 4 3 3 3 4 3 2 2 2 2 2 3 3 2 2 2 3 3 3 3 3 2 2 3 3 2 2 2 2 2 2 1 2 3 3 3 2 2 2 3 2 2 2 3 2 2 2 1 2 2 1 3 2 2 2 1 1 1 1 1 1 1 2 1 1 1 0 1 2 2
6677B%%%J%k%%%J%J%k%%%%%JJJj%%j%%%%%J%%jjj%J%%%%J%%%j%%j%JJkJJ%%%%%%%%JJjjj%
$$ 2 2 2 2 3 3 1 1 1 1 2 2 3 3 1 1 1 1 1 1 2 3 4 3 3 3 2 2 2 2 2 2 3 3 3 2 1 0 0 1 1 1 1 1 2 2 2 2 1 1 1 0 0 1 2 0 1 2 2 2 2 2 2 2 2 2 3 4 3 2 1 1
6667A%J%%JjjJ%%jJ%%%%%%%%j%J%%jjjJJ%%%%%%JJ%Jjj%%%J%j%%%%%%J%%%j%%%%%%%j%%J%
$$ 1 1 2 2 2 3 2 1 2 2 2 1 2 2 2 2 2 2 2 2 2 1 1 2 2 2 1 0 -1 0 1 1 1 1 1 1 1 2 3 3 4 3 2 2 2 2 3 3 2 2 2 2 2 2 2 3 3 3 3 2 2 2 2 2 2 2 2 1 1 1 2 2
6656Bj%%%J%Jj%jjJ%%%%J%%%%%J%%%j%%%j%Jjj%J%JJ%%%j%j%%K%jj%%JjJ%%JJ%jJj%%j%%%
$$ 2 1 1 1 1 2 2 3 2 2 1 0 1 1 1 1 1 2 2 2 2 2 2 3 3 3 3 2 2 2 2 1 1 2 1 0 0 1 1 2 3 3 3 3 2 2 1 1 1 3 3 2 1 1 1 2 1 2 2 2 3 4 4 3 4 3 3 3 2 2 2 2
6645B%%j%%J%%%%%%%%%Jj%jJ%%%%%JJjj%J%%%j%%j%%KJ%%%%k%%Jj%%%j%J%%%j%%J%%Kjjj%
$$ 2 2 2 1 1 1 2 2 2 2 2 2 2 2 2 2 3 2 2 1 2 2 2 2 2 2 3 4 3 2 2 3 3 3 3 2 2 2 1 1 1 3 4 4 4 4 4 2 2 2 3 2 2 2 2 1 1 2 2 2 2 1 1 1 2 2 2 4 3 2 1 1
6634A%%J%%JJ%%j%j%jJ%j%%J%%%%%jJJJ%%jj%%J%%%%j%%j%%%J%j%%%%%J%jJJ%j%%%%J%%%%
$$ 1 1 1 2 2 2 3 4 4 4 3 3 2 2 1 2 2 1 1 1 2 2 2 2 2 2 1 2 3 4 4 4 3 2 2 2 3 3 3 3 3 2 2 2 1 1 1 1 2 2 1 1 1 1 1 1 2 2 1 2 3 3 2 2 2 2 2 3 3 3 3 3
6623Cj%%%%jJ%%%%%%%%j%JJ%jj%%%%%%JJjj%J%%%jjJ%jJ%J%%%j%%%%Jj%%%J%%j%%JJ%%%j%
$$ 3 2 2 2 2 2 1 2 2 2 2 2 2 2 2 2 1 1 2 3 3 2 1 1 1 1 1 1 1 2 3 2 1 1 2 2 2 2 1 0 1 1 0 1 1 2 2 2 2 1 1 1 1 1 2 1 1 1 1 2 2 2 1 1 1 2 3 3 3 3 2 2
6612BJJj%j%%%%%%%%%%%j%%jjJJ%J%J%%%%jJ%%%j%J%kj%%J%jJ%JJJJjjj%%%j%%%J%%%J%%j
$$ 2 3 4 3 3 2 2 2 2 2 2 2 2 2 2 2 2 1 1 1 0 -1 0 1 1 2 2 3 3 3 3 3 2 3 3 3 3 2 2 3 3 1 0 0 0 1 1 0 1 1 2 3 4 5 4 3 2 2 2 2 1 1 1 1 2 2 2 2 3 3 3 2
6602BJ%%%j%%J%J%j%j%%%JjJjJ%j%jj%jJJJ%%%%%%%%J%%%%jJ%%%jj%J%%%jJJjj%J%J%%%j%
$$ 2 3 3 3 3 2 2 2 3 3 4 4 3 3 2 2 2 2 3 2 3 2 3 3 2 2 1 0 0 -1 0 1 2 2 2 2 2 2 2 2 2 3 3 3 3 3 2 3 3 3 3 2 1 1 2 2 2 2 1 2 3 2 1 1 2 2 3 3 3 3 2 2
6591B%%%%J%jjJ%%%%%%J%%%j%%jJ%%%%%%%J%%jj%JJ%%k%%J%%%Jjj%%%%JJJj%%j%%j%J%J%%
$$ 2 2 2 2 2 3 3 2 1 2 2 2 2 2 2 2 3 3 3 3 2 2 2 1 2 2 2 2 2 2 2 2 3 3 3 2 1 1 2 3 3 3 1 1 1 2 2 2 2 3 2 1 1 1 1 1 2 3 4 3 3 3 2 2 2 1 1 2 2 3 3 3
6580C%j%%%%%J%%%j%%%%%%J%j%%%j%JJj%J%%j%%%%%J%jJ%J%jj%%j%J%jJ%%%%%J%j%%%%%%j
$$ 3 3 2 2 2 2 2 2 3 3 3 3 2 2 2 2 2 2 2 3 3 2 2 2 2 1 1 2 3 2 2 3 3 3 2 2 2 2 2 2 3 3 2 3 3 4 4 3 2 2 2 1 1 2 2 1 2 2 2 2 2 2 3 3 2 2 2 2 2 2 2 1
6569A%%%%j%%%J%J%j%j%%%%JJ%%%jJ%%%%J%%jj%%J%%jJKj%%Jj%j%%j%jJJJ%%%%jj%%%%%%J
$$ 1 1 1 1 1 0 0 0 0 1 1 2 2 1 1 0 0 0 0 0 1 2 2 2 2 1 2 2 2 2 2 3 3 3 2 1 1 1 2 2 2 1 2 4 3 3 3 4 3 3 2 2 2 1 1 0 1 2 3 3 3 3 3 2 1 1 1 1 1 1 1 2
6558B%J%j%%%%%j%%%%%J%J%Jj%j%%J%%%%jj%J%%J%J%jj%%%JjjjJ%%j%J%%j%K%%%%%%%jJ%%
$$ 2 2 3 3 2 2 2 2 2 2 1 1 1 1 1 1 2 2 3 3 4 3 3 2 2 2 3 3 3 3 3 2 1 1 2 2 2 3 3 4 4 3 2 2 2 2 3 2 1 0 1 1 1 0 0 1 1 1 0 0 2 2 2 2 2 2 2 2 1 2 2 2
6547B%%%J%jjj%J%J%jJj%%%%Jj%%%%%J%%%%%J%%%jj%%%%%%jJJ%%%J%%jj%%%J%%jJ%%%%%%%
$$ 2 2 2 2 3 3 2 1 0 0 1 1 2 2 1 2 1 1 1 1 1 2 1 1 1 1 1 1 2 2 2 2 2 2 3 3 3 3 2 1 1 1 1 1 1 1 0 1 2 2 2 2 3 3 3 2 1 1 1 1 2 2 2 1 2 2 2 2 2 2 2 2
6537B%J%JkjJ%%Jjj%%J%%j%%%Jjj%%JJjj%JJ%%J%%jJ%%%%%J%jJ%J%j%jjJ%%j%%%j%%%%JJj
$$ 2 2 3 3 4 2 1 2 2 2 3 2 1 1 1 2 2 2 1 1 1 1 2 1 0 0 0 1 2 1 0 0 1 2 2 2 3 3 3 2 3 3 3 3 3 3 4 4 3 4 4 5 5 4 4 3 2 3 3 3 2 2 2 2 1 1 1 1 1 2 3 2
6526B%%JjjJJ%J%%jk%J%%%%K%jj%%%Jj%jjJJ%Jj%%%J%%%j%%%J%j%%%%%%j%JjJ%%Jj%%%j%%
$$ 2 2 2 3 2 1 2 3 3 4 4 4 3 1 1 2 2 2 2 2 4 4 3 2 2 2 2 3 2 2 1 0 1 2 2 3 2 2 2 2 3 3 3 3 2 2 2 2 3 3 2 2 2 2 2 2 2 1 1 2 1 2 2 2 3 2 2 2 2 1 1 1
6515A%J%%%%%%%jKJ%j%jjJ%%%%%j%%%Jj%J%Jj%%%%%%%Jj%J%j%j%%J%J%%%%jj%J%%jjJ%%J%
$$ 1 1 2 2 2 2 2 2 2 2 1 3 4 4 3 3 2 1 2 2 2 2 2 2 1 1 1 1 2 1 1 2 2 3 2 2 2 2 2 2 2 2 3 2 2 3 3 2 2 1 1 1 2 2 3 3 3 3 3 2 1 1 2 2 2 1 0 1 1 1 2 2
6504B%%%J%%%%Jjj%%%J%%jj%%%jJJ%Jj%%%%%%%%j%%J%%%J%%jj%%JJj%%%%%jJ%%%jJJ%%%%%
$$ 2 2 2 2 3 3 3 3 3 4 3 2 2 2 2 3 3 3 2 1 1 1 1 0 1 2 2 3 2 2 2 2 2 2 2 2 2 1 1 1 2 2 2 2 3 3 3 2 1 1 1 2 3 2 2 2 2 2 2 1 2 2 2 2 1 2 3 3 3 3 3 3
6493Cjj%%%%%J%J%%jj%%J%%jJJ%jJ%%j%%%%%%%Jj%%%%%J%%Jj%jj%J%%%%%%J%j%%%%Jj%%%%
$$ 3 2 1 1 1 1 1 1 2 2 3 3 3 2 1 1 1 2 2 2 1 2 3 3 2 3 3 3 2 2 2 2 2 2 2 2 3 2 2 2 2 2 2 3 3 3 4 3 3 2 1 1 2 2 2 2 2 2 2 3 3 2 2 2 2 2 3 2 2 2 2 2
6482BJ%%%j%%%%%%%%%%%%%%%%%%j%%%%J%%JJk%%j%%%jJ%%%%%j%JJ%J%%%%J%%%jj%jJ%%%%%
$$ 2 3 3 3 3 2 2 2 2 2 2 2 2 2 2 2 2 2 2 2 2 2 2 2 1 1 1 1 1 2 2 2 3 4 2 2 2 1 1 1 1 0 1 1 1 1 1 1 0 0 1 2 2 3 3 3 3 3 4 4 4 4 3 2 2 1 2 2 2 2 2 2
6472B%%%%%%%%%%J%%%%%%j%%%%%%%j%Jj%%%%%J%%j%%%%%%%%JJ%j%%%%%Jj%jj%%JJ%%%%%J%
$$ 2 2 2 2 2 2 2 2 2 2 2 3 3 3 3 3 3 3 2 2 2 2 2 2 2 2 1 1 2 1 1 1 1 1 1 2 2 2 1 1 1 1 1 1 1 1 1 2 3 3 2 2 2 2 2 2 3 2 2 1 0 0 0 1 2 2 2 2 2 2 3 3
6461C%%JjjJ%%%%%j%%%j%%Jj%%%J%%jj%%J%%%%%J%%%%%%J%%%kj%%J%%Jj%%J%%%j%j%%J%%J
$$ 3 3 3 4 3 2 3 3 3 3 3 3 2 2 2 2 1 1 1 2 1 1 1 1 2 2 2 1 0 0 0 1 1 1 1 1 1 2 2 2 2 2 2 2 3 3 3 3 1 0 0 0 1 1 1 2 1 1 1 2 2 2 2 1 1 0 0 0 1 1 1 2
6450BjJ%%%J%%Kj%%%jjj%%J%%Jj%J%jj%%J%J%%j%%%%%%J%jjJJ%J%jj%J%jJ%Jj%%%%j%%%j%
$$ 2 1 2 2 2 2 3 3 3 5 4 4 4 4 3 2 1 1 1 2 2 2 3 2 2 3 3 2 1 1 1 2 2 3 3 3 2 2 2 2 2 2 2 3 3 2 1 2 3 3 4 4 3 2 2 3 3 2 3 3 4 3 3 3 3 3 2 2 2 2 1 1
6439A%%Jj%%%%%%J%%%%%%%%%%%%%%%%%%%%%j%%%%J%j%%J%J%%%%%%j%%%%%%%%j%%%%%%J%%%
$$ 1 1 1 2 1 1 1 1 1 1 1 2 2 2 2 2 2 2 2 2 2 2 2 2 2 2 2 2 2 2 2 2 2 1 1 1 1 1 2 2 1 1 1 2 2 3 3 3 3 3 3 3 2 2 2 2 2 2 2 2 2 1 1 1 1 1 1 1 2 2 2 2
6428BJJj%j%%jJ%%%%jjJJ%JjjJ%J%%j%j%%J%J%%kJ%J%j%j%%%%JJ%%%j%%%J%%%%%%%j%j%%%
$$ 2 3 4 3 3 2 2 2 1 2 2 2 2 2 1 0 1 2 2 3 2 1 2 2 3 3 3 2 2 1 1 1 2 2 3 3 3 1 2 2 3 3 2 2 1 1 1 1 1 2 3 3 3 3 2 2 2 2 3 3 3 3 3 3 3 3 2 2 1 1 1 1
6417Aj%%J%JJj%%%%%%%J%%j%%j%J%%jJ%%%%J%jjj%JJ%%%%%%%j%%J%J%%j%J%j%%%jJJ%%%j%
$$ 1 0 0 0 1 1 2 3 2 2 2 2 2 2 2 2 3 3 3 2 2 2 1 1 2 2 2 1 2 2 2 2 2 3 3 2 1 0 0 1 2 2 2 2 2 2 2 2 1 1 1 2 2 3 3 3 2 2 3 3 2 2 2 2 1 2 3 3 3 3 2 2
6407BJj%%Jjj%%%%%%%JJ%%%JjjJ%j%j%%J%%%%%%J%%%%jjJjj%%KJ%j%%%%j%J%%%%%%JJ%j%j
$$ 2 3 2 2 2 3 2 1 1 1 1 1 1 1 1 2 3 3 3 3 4 3 2 3 3 2 2 1 1 1 2 2 2 2 2 2 2 3 3 3 3 3 2 1 2 1 0 0 0 2 3 3 2 2 2 2 2 1 1 2 2 2 2 2 2 2 3 4 4 3 3 2
6396B%%%Jj%%J%%j%%%J%%%%%%j%jJJ%%%jJ%Jj%%%%Jjjj%%%%%%%%J%%%%%%%%%%j%%jJJ%J%%
$$ 2 2 2 2 3 2 2 2 3 3 3 2 2 2 2 3 3 3 3 3 3 3 2 2 1 2 3 3 3 3 2 3 3 4 3 3 3 3 3 4 3 2 1 1 1 1 1 1 1 1 1 2 2 2 2 2 2 2 2 2 2 2 1 1 1 0 1 2 2 3 3 3
6385C%kJ%%%%%%Jj%%Jj%%j%%%J%%jK%%%j%jJ%j%%J%%JJ%%%jj%%J%%j%J%j%%%%%%jJ%%%%Jj
$$ 3 3 1 2 2 2 2 2 2 2 3 2 2 2 3 2 2 2 1 1 1 1 2 2 2 1 3 3 3 3 2 2 1 2 2 1 1 1 2 2 2 3 4 4 4 4 3 2 2 2 3 3 3 2 2 3 3 2 2 2 2 2 2 2 1 2 2 2 2 2 3 2
6374B%%jKj%%J%jj%%%%JJ%j%%%%%j%%%%%%J%%jJ%%Jj%%%JJ%%j%jj%%%JJjj%Kj%jJJ%%j%%%
$$ 2 2 2 1 3 2 2 2 3 3 2 1 1 1 1 1 2 3 3 2 2 2 2 2 2 1 1 1 1 1 1 1 2 2 2 1 2 2 2 3 2 2 2 2 3 4 4 4 3 3 2 1 1 1 1 2 3 2 1 1 3 2 2 1 2 3 3 3 2 2 2 2
6363B%%J%j%%%Jj%jJ%%%%j%%%JJ%jj%%J%j%J%%%j%%jJ%J%%J%Jjj%jJ%%Jjj%%%%%%JJ%Jjj%
$$ 2 2 2 3 3 2 2 2 2 3 2 2 1 2 2 2 2 2 1 1 1 1 2 3 3 2 1 1 1 2 2 1 1 2 2 2 2 1 1 1 0 1 1 2 2 2 3 3 4 3 2 2 1 2 2 2 3 2 1 1 1 1 1 1 1 2 3 3 4 3 2 2
6352BjJ%%J%J%j%%j%%KJjk%%%%%%J%%%%%j%%%Jj%j%J%%%%%%%%J%%j%JJkjJJ%J%%jj%jJ%J%
$$ 2 1 2 2 2 3 3 4 4 3 3 3 2 2 2 4 5 4 2 2 2 2 2 2 2 3 3 3 3 3 3 2 2 2 2 3 2 2 1 1 2 2 2 2 2 2 2 2 2 3 3 3 2 2 3 4 2 1 2 3 3 4 4 4 3 2 2 1 2 2 3 3
6342C%%j%%%%%%jJJJ%j%j%%J%%j%%%%%J%%jj%%%J%%j%%JJJ%jjj%%J%%%J%j%J%%%j%%%jJj%
$$ 3 3 3 2 2 2 2 2 2 2 1 2 3 4 4 3 3 2 2 2 3 3 3 2 2 2 2 2 2 3 3 3 2 1 1 1 1 2 2 2 1 1 1 2 3 4 4 3 2 1 1 1 2 2 2 2 3 3 2 2 3 3 3 3 2 2 2 2 1 2 1 1
6331A%%J%%%%%%%%J%%j%%%J%%j%%%%jJJ%j%Jj%%%jjJJ%%%%j%%%JJ%j%%%%%%%%%Jjj%J%%%%
$$ 1 1 1 2 2 2 2 2 2 2 2 2 3 3 3 2 2 2 2 3 3 3 2 2 2 2 2 1 2 3 3 2 2 3 2 2 2 2 1 0 1 2 2 2 2 2 1 1 1 1 2 3 3 2 2 2 2 2 2 2 2 2 2 3 2 1 1 2 2 2 2 2
6320Bj%J%%%J%%%%%J%j%%%Jj%%%%%%%%j%J%%jJ%%jJ%%%%j%%%%%j%%JKjj%J%j%jJ%J%J%j%%
$$ 2 1 1 2 2 2 2 3 3 3 3 3 3 4 4 3 3 3 3 4 3 3 3 3 3 3 3 3 3 2 2 3 3 3 2 3 3 3 2 3 3 3 3 3 2 2 2 2 2 2 1 1 1 2 4 3 2 2 3 3 2 2 1 2 2 3 3 4 4 3 3 3
6309Ck%%%%J%%%Jj%%%%%J%%%%%%%jJ%JjJk%%J%jj%%%JjJj%jJKj%Jj%j%J%%%%%j%%%%%J%%J
$$ 3 1 1 1 1 1 2 2 2 2 3 2 2 2 2 2 2 3 3 3 3 3 3 3 3 2 3 3 4 3 4 2 2 2 3 3 2 1 1 1 1 2 1 2 1 1 0 1 3 2 2 3 2 2 1 1 2 2 2 2 2 2 1 1 1 1 1 1 2 2 2 3
6298CjjJ%%%%%%%%%j%J%%%%j%JJ%%j%%%%Jj%%%J%%JjjjJ%J%j%%Jjj%J%%J%%%%%%%%%%%j%%
$$ 3 2 1 2 2 2 2 2 2 2 2 2 2 1 1 2 2 2 2 2 1 1 2 3 3 3 2 2 2 2 2 3 2 2 2 2 3 3 3 4 3 2 1 2 2 3 3 2 2 2 3 2 1 1 2 2 2 3 3 3 3 3 3 3 3 3 3 3 3 2 2 2
6287Bj%%J%%J%j%%j%J%%Jjj%Jj%%%%J%%%%%Jj%%%%%jJ%J%Jj%%%%%%%%jj%j%JJJJ%k%j%jJK
$$ 2 1 1 1 2 2 2 3 3 2 2 2 1 1 2 2 2 3 2 1 1 2 1 1 1 1 1 2 2 2 2 2 2 3 2 2 2 2 2 2 1 2 2 3 3 4 3 3 3 3 3 3 3 3 3 2 1 1 0 0 1 2 3 4 4 2 2 1 1 0 1 3
6277Cj%%%%%%%%%%j%jJJJ%%%jJ%%j%%%%%%%%%%Jjj%%%%JJ%%%%j%%J%Jjj%%%j%%%JjjJ%%%J
$$ 3 2 2 2 2 2 2 2 2 2 2 2 1 1 0 1 2 3 3 3 3 2 3 3 3 2 2 2 2 2 2 2 2 2 2 2 3 2 1 1 1 1 1 2 3 3 3 3 3 2 2 2 3 3 4 3 2 2 2 2 1 1 1 1 2 1 0 1 1 1 1 2
6266B%%%%J%JjjJ%j%%%jJ%jjJJ%J%%j%%%%%%%%%%%J%j%J%%%%%%%%j%%%J%%%%j%%%%%%J%%%
$$ 2 2 2 2 2 3 3 4 3 2 3 3 2 2 2 2 1 2 2 1 0 1 2 2 3 3 3 2 2 2 2 2 2 2 2 2 2 2 2 3 3 2 2 3 3 3 3 3 3 3 3 3 2 2 2 2 3 3 3 3 3 2 2 2 2 2 2 2 3 3 3 3
6255Cj%JJ%%jj%JJj%%%j%%%%Jjj%jJKjJ%J%%%jj%%%%%jK%%%%Jj%j%j%%%%J%Jj%%j%%J%%%J
$$ 3 2 2 3 4 4 4 3 2 2 3 4 3 3 3 3 2 2 2 2 2 3 2 1 1 0 1 3 2 3 3 4 4 4 4 3 2 2 2 2 2 2 1 3 3 3 3 3 4 3 3 2 2 1 1 1 1 1 2 2 3 2 2 2 1 1 1 2 2 2 2 3
6244C%%JjjjJJj%%%%%jjJjJJ%%j%%%%%J%%%%%%%%%%%j%J%Jj%%%%%%Jjj%J%Jjj%%%J%%%j%J
$$ 3 3 3 4 3 2 1 2 3 2 2 2 2 2 2 1 0 1 0 1 2 2 2 1 1 1 1 1 1 2 2 2 2 2 2 2 2 2 2 2 2 1 1 2 2 3 2 2 2 2 2 2 2 3 2 1 1 2 2 3 2 1 1 1 1 2 2 2 2 1 1 2
6233Bj%%%%%%%jJ%%J%j%%J%%%jJ%%JjjJ%%%%j%J%%jjJJ%%%%%jJJJjjKj%k%J%%%j%JJ%k%%J
$$ 2 1 1 1 1 1 1 1 1 0 1 1 1 2 2 1 1 1 2 2 2 2 1 2 2 2 3 2 1 2 2 2 2 2 1 1 2 2 2 1 0 1 2 2 2 2 2 2 1 2 3 4 3 2 4 3 3 1 1 2 2 2 2 1 1 2 3 3 1 1 1 2
6222B%JjJ%%%jj%J%%%%%%JJ%%jjjJj%JJ%Jj%j%jj%KJj%%%J%jJ%j%%%Jj%jJ%JjJ%j%%Jj%%j
$$ 2 2 3 2 3 3 3 3 2 1 1 2 2 2 2 2 2 2 3 4 4 4 3 2 1 2 1 1 2 3 3 4 3 3 2 2 1 0 0 2 3 2 2 2 2 3 3 2 3 3 2 2 2 2 3 2 2 1 2 2 3 2 3 3 2 2 2 3 2 2 2 1
6212AJ%%%J%%%%%%J%%jk%%%%JJ%Jjjj%%%%%J%%%%Jj%%%%jJ%%J%jj%J%%j%J%J%%%j%%%j%Jj
$$ 1 2 2 2 2 3 3 3 3 3 3 3 4 4 4 3 1 1 1 1 1 2 3 3 4 3 2 1 1 1 1 1 1 2 2 2 2 2 3 2 2 2 2 2 1 2 2 2 3 3 2 1 1 2 2 2 1 1 2 2 3 3 3 3 2 2 2 2 1 1 2 1
6201A%%%J%%%J%Jj%jJJjj%%%jjJJ%%J%%%%J%jJ%%j%k%J%J%%jJ%%%%%%%Jj%%Jjj%%%Jj%%%k
$$ 1 1 1 1 2 2 2 2 3 3 4 3 3 2 3 4 3 2 2 2 2 1 0 1 2 2 2 3 3 3 3 3 4 4 3 4 4 4 3 3 1 1 2 2 3 3 3 2 3 3 3 3 3 3 3 3 4 3 3 3 4 3 2 2 2 2 3 2 2 2 2 0
6190@J%J%J%%%%%%%%%%%%%j%%%j%%K%j%J%%%%%JJjj%%%J%j%%%%%JJjjjj%%J%%%%%J%%%%%%
$$ 0 1 1 2 2 3 3 3 3 3 3 3 3 3 3 3 3 3 3 2 2 2 2 1 1 1 3 3 2 2 3 3 3 3 3 3 4 5 4 3 3 3 3 4 4 3 3 3 3 3 3 4 5 4 3 2 1 1 1 2 2 2 2 2 2 3 3 3 3 3 3 3
6179C%%%%%%jJJJjj%%J%jj%jj%K%Jj%J%%Jjj%%JJj%k%%KJJ%j%j%%%%jJJ%%%%%j%j%%j%Jj%
$$ 3 3 3 3 3 3 3 2 3 4 5 4 3 3 3 4 4 3 2 2 1 0 0 2 2 3 2 2 3 3 3 4 3 2 2 2 3 4 3 3 1 1 1 3 4 5 5 4 4 3 3 3 3 3 2 3 4 4 4 4 4 4 3 3 2 2 2 1 1 2 1 1
6168AJK%%%%j%J%J%k%%%%j%%J%JJJjj%j%%j%J%%j%jJJ%%%j%%%J%%%%Jj%%%j%%%%%j%%J%j%
$$ 1 2 4 4 4 4 4 3 3 4 4 5 5 3 3 3 3 3 2 2 2 3 3 4 5 6 5 4 4 3 3 3 2 2 3 3 3 2 2 1 2 3 3 3 3 2 2 2 2 3 3 3 3 3 4 3 3 3 3 2 2 2 2 2 2 1 1 1 2 2 1 1
6157AK%%%J%%%%j%%j%%%J%jJ%%j%Jj%%%%%%%%jJ%%%%JJj%%%j%%J%J%jj%%%%%%%%JJ%j%%%J
$$ 1 3 3 3 3 4 4 4 4 4 3 3 3 2 2 2 2 3 3 2 3 3 3 2 2 3 2 2 2 2 2 2 2 2 2 1 2 2 2 2 2 3 4 3 3 3 3 2 2 2 3 3 4 4 3 2 2 2 2 2 2 2 2 2 3 4 4 3 3 3 3 4
6146Dj%j%jJ%%JJ%j%%%%jJ%%%%%j%%Jj%%J%%k%J%%%%%%j%J%%J%%jJ%%%%%%%j%%%jJ%%%%%%
$$ 4 3 3 2 2 1 2 2 2 3 4 4 3 3 3 3 3 2 3 3 3 3 3 3 2 2 2 3 2 2 2 3 3 3 1 1 2 2 2 2 2 2 2 1 1 2 2 2 3 3 3 2 3 3 3 3 3 3 3 3 2 2 2 2 1 2 2 2 2 2 2 2
6136B%%JkJ%%%%%%%%%%%%%%%J%%jKjj%%Jj%jJ%%%%j%Jj%J%Jj%%%%%%%%jjJ%%Jj%%%JK%ljJ
$$ 2 2 2 3 1 2 2 2 2 2 2 2 2 2 2 2 2 2 2 2 2 3 3 3 2 4 3 2 2 2 3 2 2 1 2 2 2 2 2 1 1 2 1 1 2 2 3 2 2 2 2 2 2 2 2 2 1 0 1 1 1 2 1 1 1 1 2 4 4 1 0 1
6125A%%JJ%%%jJ%jj%%%%J%%J%%j%%%j%%JJJj%j%j%J%%J%%%j%%%%J%%j%jJ%%%%%j%%%%%J%j
$$ 1 1 1 2 3 3 3 3 2 3 3 2 1 1 1 1 1 2 2 2 3 3 3 2 2 2 2 1 1 1 2 3 4 3 3 2 2 1 1 2 2 2 3 3 3 3 2 2 2 2 2 3 3 3 2 2 1 2 2 2 2 2 2 1 1 1 1 1 1 2 2 1
6114A%j%%JJjJj%JJjjJ%%jJ%%JJJ%jkJ%%j%%%%%jJ%%jJ%JJ%%k%%%%%%J%%%%%%j%%j%JJjj%
$$ 1 1 0 0 0 1 2 1 2 1 1 2 3 2 1 2 2 2 1 2 2 2 3 4 5 5 4 2 3 3 3 2 2 2 2 2 2 1 2 2 2 1 2 2 3 4 4 4 2 2 2 2 2 2 2 3 3 3 3 3 3 3 2 2 2 1 1 2 3 2 1 1
6103A%%%J%%J%%Jj%jj%JK%j%%%j%%%%j%%%J%%%jJ%%j%%%%%%J%%%%%%%%%J%%%jj%%%%%%%%%
$$ 1 1 1 1 2 2 2 3 3 3 4 3 3 2 1 1 2 4 4 3 3 3 3 2 2 2 2 2 1 1 1 1 2 2 2 2 1 2 2 2 1 1 1 1 1 1 1 2 2 2 2 2 2 2 2 2 2 3 3 3 3 2 1 1 1 1 1 1 1 1 1 1
6092A%%J%%Jjj%%J%%%%%%Jjj%%%J%J%j%j%%jJJ%%KjJ%%%jj%%%%%%%%%%%J%j%%%%JJ%j%jjJ
$$ 1 1 1 2 2 2 3 2 1 1 1 2 2 2 2 2 2 2 3 2 1 1 1 1 2 2 3 3 2 2 1 1 1 0 1 2 2 2 4 3 4 4 4 4 3 2 2 2 2 2 2 2 2 2 2 2 2 3 3 2 2 2 2 2 3 4 4 3 3 2 1 2
6081B%%%%j%%%%%%J%%%%J%%jj%%J%%J%%j%%%JJjj%%%%%%%%J%%j%J%JJ%%j%%j%j%%%%%%%%%
$$ 2 2 2 2 2 1 1 1 1 1 1 1 2 2 2 2 2 3 3 3 2 1 1 1 2 2 2 3 3 3 2 2 2 2 3 4 3 2 2 2 2 2 2 2 2 2 3 3 3 2 2 3 3 4 5 5 5 4 4 4 3 3 2 2 2 2 2 2 2 2 2 2
6071B%%%%Jj%%%%%J%%%%%j%%Jj%%J%%%%j%%%%%J%%Jjj%%%J%j%J%j%%JJ%j%%%JjjjJ%%%%%j
$$ 2 2 2 2 2 3 2 2 2 2 2 2 3 3 3 3 3 3 2 2 2 3 2 2 2 3 3 3 3 3 2 2 2 2 2 2 3 3 3 4 3 2 2 2 2 3 3 2 2 3 3 2 2 2 3 4 4 3 3 3 3 4 3 2 1 2 2 2 2 2 2 1
6060AJ%%%%%%%%j%K%%%j%%%Jjj%%JJ%%%%%%j%%jJ%JjjJJjjJ%J%%JjkJ%Jj%jjJJ%%%%%Jj%%
$$ 1 2 2 2 2 2 2 2 2 2 1 1 3 3 3 3 2 2 2 2 3 2 1 1 1 2 3 3 3 3 3 3 3 2 2 2 1 2 2 3 2 1 2 3 2 1 2 2 3 3 3 4 3 1 2 2 3 2 2 1 0 1 2 2 2 2 2 2 3 2 2 2
6049B%%%%J%j%%%%J%%jjJ%%%%%JJjjjJ%%%%%J%%%j%%%%j%J%jJ%%%%%%%%%%Jj%%%%%%%%jJ%
$$ 2 2 2 2 2 3 3 2 2 2 2 2 3 3 3 2 1 2 2 2 2 2 2 3 4 3 2 1 2 2 2 2 2 2 3 3 3 3 2 2 2 2 2 1 1 2 2 1 2 2 2 2 2 2 2 2 2 2 2 3 2 2 2 2 2 2 2 2 2 1 2 2
6038B%%%%%%j%%K%%%%%%J%%j%j%%JkJ%%%%%%%%Jj%%%%%j%J%J%j%j%%J%%j%JJ%kJJj%%%%%%
$$ 2 2 2 2 2 2 2 1 1 1 3 3 3 3 3 3 3 4 4 4 3 3 2 2 2 3 1 2 2 2 2 2 2 2 2 2 3 2 2 2 2 2 2 1 1 2 2 3 3 2 2 1 1 1 2 2 2 1 1 2 3 3 1 2 3 2 2 2 2 2 2 2
6027B%J%j%JK%kjj%%JjjJJ%%KJjjj%%%%%Jj%j%%JJkJ%J%%%%%JJ%%jk%%jj%%JJJ%%%%%%jjJ
$$ 2 2 3 3 2 2 3 5 5 3 2 1 1 1 2 1 0 1 2 2 2 4 5 4 3 2 2 2 2 2 2 3 2 2 1 1 1 2 3 1 2 2 3 3 3 3 3 3 4 5 5 5 4 2 2 2 1 0 0 0 1 2 3 3 3 3 3 3 3 2 1 2
6016B%%%J%%%j%%%jJjJ%jJJj%J%%%%%%j%%J%%%%%%%%j%j%J%%J%JjjjJ%J%%%%%%%%%%jJ%j%
$$ 2 2 2 2 3 3 3 3 2 2 2 2 1 2 1 2 2 1 2 3 2 2 3 3 3 3 3 3 3 2 2 2 3 3 3 3 3 3 3 3 3 2 2 1 1 2 2 2 3 3 4 3 2 1 2 2 3 3 3 3 3 3 3 3 3 3 3 2 3 3 2 2
6006B%%%%%%jJ%%%%J%j%%%jJ%JJ%%jjJ%%%%%%%%j%%%%J%%j%%%Jjj%J%j%JJ%%%jj%%JJ%j%%
$$ 2 2 2 2 2 2 2 1 2 2 2 2 2 3 3 2 2 2 2 1 2 2 3 4 4 4 3 2 3 3 3 3 3 3 3 3 3 2 2 2 2 2 3 3 3 2 2 2 2 3 2 1 1 2 2 1 1 2 3 3 3 3 2 1 1 1 2 3 3 2 2 2
5995B%%%%%J%%%%j%%Jj%%%%J%j%%j%J%%%JJ%j%%%j%%%jJ%%%j%J%J%%j%%%j%J%%jJJ%%%j%j
$$ 2 2 2 2 2 2 3 3 3 3 3 2 2 2 3 2 2 2 2 2 3 3 2 2 2 1 1 2 2 2 2 3 4 4 3 3 3 3 2 2 2 2 1 2 2 2 2 1 1 2 2 3 3 3 2 2 2 2 1 1 2 2 2 1 2 3 3 3 3 2 2 1
5984AjJ%JJj%%J%%j%%%%Jj%%%%%%%%%J%%%J%jj%%J%%j%%%%%%jJJ%Jjj%%J%jJ%%jJ%J%k%%%
$$ 1 0 1 1 2 3 2 2 2 3 3 3 2 2 2 2 2 3 2 2 2 2 2 2 2 2 2 2 3 3 3 3 4 4 3 2 2 2 3 3 3 2 2 2 2 2 2 2 1 2 3 3 4 3 2 2 2 3 3 2 3 3 3 2 3 3 4 4 2 2 2 2
5973B%%Jjj%%JJ%%%%%%%J%jj%%%%J%j%%JJ%%%%%j%j%j%J%%j%%%JJ%%j%JJ%j%J%%jj%%%%j%
$$ 2 2 2 3 2 1 1 1 2 3 3 3 3 3 3 3 3 4 4 3 2 2 2 2 2 3 3 2 2 2 3 4 4 4 4 4 4 3 3 2 2 1 1 2 2 2 1 1 1 1 2 3 3 3 2 2 3 4 4 3 3 4 4 4 3 2 2 2 2 2 1 1
5962AjJJ%J%%%%j%%%JjJ%%j%%jjKJjj%J%%%%J%%JjJ%j%Jj%%%%%%%j%J%jJ%%%%%j%%%%%Jjj
$$ 1 0 1 2 2 3 3 3 3 3 2 2 2 2 3 2 3 3 3 2 2 2 1 0 2 3 2 1 1 2 2 2 2 2 3 3 3 4 3 4 4 3 3 4 3 3 3 3 3 3 3 3 2 2 3 3 2 3 3 3 3 3 3 2 2 2 2 2 2 3 2 1
5951A%j%JJ%%%J%Jjj%%j%J%%%jJJ%%Jj%%%j%Jj%j%J%j%%JJ%%%j%J%%%%Jj%%%j%%%%%JJ%j%
$$ 1 1 0 0 1 2 2 2 2 3 3 4 3 2 2 2 1 1 2 2 2 2 1 2 3 3 3 4 3 3 3 3 2 2 3 2 2 1 1 2 2 1 1 1 2 3 3 3 3 2 2 3 3 3 3 3 4 3 3 3 3 2 2 2 2 2 2 3 4 4 3 3
5941C%%jj%%KJ%%%jj%JJjjjJJ%%%%%%%%%jJ%jjJJ%%%j%%%%J%j%%%Jj%%%jJ%%Jj%j%J%J%jJ
$$ 3 3 3 2 1 1 1 3 4 4 4 4 3 2 2 3 4 3 2 1 2 3 3 3 3 3 3 3 3 3 3 2 3 3 2 1 2 3 3 3 3 2 2 2 2 2 3 3 2 2 2 2 3 2 2 2 2 1 2 2 2 3 2 2 1 1 2 2 3 3 2 3
5930C%%%j%%%J%%%%%%%%%j%J%%%Jj%j%%%j%%J%%%j%%J%%%%J%%j%J%j%%Jj%%%%J%%%%%%j%%
$$ 3 3 3 3 2 2 2 2 3 3 3 3 3 3 3 3 3 3 2 2 3 3 3 3 4 3 3 2 2 2 2 1 1 1 2 2 2 2 1 1 1 2 2 2 2 2 3 3 3 2 2 3 3 2 2 2 3 2 2 2 2 2 3 3 3 3 3 3 3 2 2 2
5919B%%%j%%JjJ%jJJ%%J%%jj%%%%%%j%jJJ%j%jJ%%J%%%J%j%%j%jJJJ%Jj%%jJ%j%j%%jJJ%%
$$ 2 2 2 2 1 1 1 2 1 2 2 1 2 3 3 3 4 4 4 3 2 2 2 2 2 2 2 1 1 0 1 2 2 1 1 0 1 1 1 2 2 2 2 3 3 2 2 2 1 1 0 1 2 3 3 4 3 3 3 2 3 3 2 2 1 1 1 0 1 2 2 2
5908BJ%jj%J%%%%%jJ%J%%j%%%%%%j%J%%%%Jjj%%J%%%%J%%j%%%J%%%%Jjj%%J%%%%%j%%%%%J
$$ 2 3 3 2 1 1 2 2 2 2 2 2 1 2 2 3 3 3 2 2 2 2 2 2 2 1 1 2 2 2 2 2 3 2 1 1 1 2 2 2 2 2 3 3 3 2 2 2 2 3 3 3 3 3 4 3 2 2 2 3 3 3 3 3 3 2 2 2 2 2 2 3
5897C%%%%jJ%%Jjj%%%j%%J%%JjjJ%%%%%%%%%%%JJjj%%%jJ%%%%%%%%%%%%%%jJ%%Jj%J%%%%%
$$ 3 3 3 3 3 2 3 3 3 4 3 2 2 2 2 1 1 1 2 2 2 3 2 1 2 2 2 2 2 2 2 2 2 2 2 2 3 4 3 2 2 2 2 1 2 2 2 2 2 2 2 2 2 2 2 2 2 2 2 1 2 2 2 3 2 2 3 3 3 3 3 3
5886C%%%%jJj%%%%KJjkjJJ%%%%%%%jJJ%%j%j%Jjj%%%J%J%%j%Jj%%%%%%jJJJjj%%Jj%%%%%%
$$ 3 3 3 3 3 2 3 2 2 2 2 2 4 5 4 2 1 2 3 3 3 3 3 3 3 3 2 3 4 4 4 3 3 2 2 3 2 1 1 1 1 2 2 3 3 3 2 2 3 2 2 2 2 2 2 2 1 2 3 4 3 2 2 2 3 2 2 2 2 2 2 2
5876Bj%%%JJ%%jj%J%%jJJ%%%jJ%%%j%j%%JJJjj%jJ%%%%%%J%J%%jjJj%JJJjjjj%jJJ%%J%J%
$$ 2 1 1 1 1 2 3 3 3 2 1 1 2 2 2 1 2 3 3 3 3 2 3 3 3 3 2 2 1 1 1 2 3 4 3 2 2 1 2 2 2 2 2 2 2 3 3 4 4 4 3 2 3 2 2 3 4 5 4 3 2 1 1 0 1 2 2 2 3 3 4 4
5865Djj%J%%jjJ%%%J%%Jj%%%%J%%jj%%%%J%%%%%%j%%%%%%%%j%%%JJj%%jJ%%%%%J%%j%%J%J
$$ 4 3 2 2 3 3 3 2 1 2 2 2 2 3 3 3 4 3 3 3 3 3 4 4 4 3 2 2 2 2 2 3 3 3 3 3 3 3 2 2 2 2 2 2 2 2 2 1 1 1 1 2 3 2 2 2 1 2 2 2 2 2 2 3 3 3 2 2 2 3 3 4
5854D%j%%%j%jj%%J%JJ%%%jJ%JjjJ%%%%%%j%%J%j%%%j%%%%J%%%%J%Jj%%%%%J%j%j%%%%%%%
$$ 4 4 3 3 3 3 2 2 1 0 0 0 1 1 2 3 3 3 3 2 3 3 4 3 2 3 3 3 3 3 3 3 2 2 2 3 3 2 2 2 2 1 1 1 1 1 2 2 2 2 2 3 3 4 3 3 3 3 3 3 4 4 3 3 2 2 2 2 2 2 2 2
5843B%%%J%%%%%%%j%%j%%%%%J%%%Jjj%J%%j%%J%%%%%%J%%J%%jj%%Jj%%j%J%%J%jjJJ%%%%%
$$ 2 2 2 2 3 3 3 3 3 3 3 3 2 2 2 1 1 1 1 1 1 2 2 2 2 3 2 1 1 2 2 2 1 1 1 2 2 2 2 2 2 2 3 3 3 4 4 4 3 2 2 2 3 2 2 2 1 1 2 2 2 3 3 2 1 2 3 3 3 3 3 3
5832C%%jJ%J%%kkJJ%J%jj%%%%%%%%%J%J%j%%%%%J%%%j%%J%j%%%JJjj%jJJj%Jj%jJ%JJ%%j%
$$ 3 3 3 2 3 3 4 4 4 2 0 1 2 2 3 3 2 1 1 1 1 1 1 1 1 1 1 2 2 3 3 2 2 2 2 2 2 3 3 3 3 2 2 2 3 3 2 2 2 2 3 4 3 2 2 1 2 3 2 2 3 2 2 1 2 2 3 4 4 4 3 3
5821C%%j%%%%%%%j%J%%J%%%%jjJJj%%%%%J%%Jj%j%jJJ%jj%%%J%%%J%%j%%%%%Jj%%%%J%%j%
$$ 3 3 3 2 2 2 2 2 2 2 2 1 1 2 2 2 3 3 3 3 3 2 1 2 3 2 2 2 2 2 2 3 3 3 4 3 3 2 2 1 2 3 3 2 1 1 1 1 2 2 2 2 3 3 3 2 2 2 2 2 2 3 2 2 2 2 2 3 3 3 2 2
5811B%%%Jj%%%%%%%%J%%j%%J%Jj%%%%%%Jj%j%j%J%%%jJ%J%j%%%%%%jJ%%%%%J%%%%j%%%%%%
$$ 2 2 2 2 3 2 2 2 2 2 2 2 2 2 3 3 3 2 2 2 3 3 4 3 3 3 3 3 3 3 4 3 3 2 2 1 1 2 2 2 2 1 2 2 3 3 2 2 2 2 2 2 2 1 2 2 2 2 2 2 3 3 3 3 3 2 2 2 2 2 2 2
5800BJ%J%%j%%j%JJ%%jj%j%%J%J%jjJ%%J%%jj%KJ%j%jJ%%%j%%%%%%JjkJKj%jJJJ%%j%j%%%
$$ 2 3 3 4 4 4 3 3 3 2 2 3 4 4 4 3 2 2 1 1 1 2 2 3 3 2 1 2 2 2 3 3 3 2 1 1 3 4 4 3 3 2 3 3 3 3 2 2 2 2 2 2 2 3 2 0 1 3 2 2 1 2 3 4 4 4 3 3 2 2 2 2
5789BJjjJK%%%jJ%%j%%%JjJ%j%%j%j%%%%Jj%%%J%J%%%JJjj%%%j%J%J%%%jj%J%%%%JJj%j%%
$$ 2 3 2 1 2 4 4 4 4 3 4 4 4 3 3 3 3 4 3 4 4 3 3 3 2 2 1 1 1 1 1 2 1 1 1 1 2 2 3 3 3 3 4 5 4 3 3 3 3 2 2 3 3 4 4 4 4 3 2 2 3 3 3 3 3 4 5 4 4 3 3 3
5778C%%%%jJ%%j%%j%JJ%jJj%j%j%J%%%J%Jj%%%j%%%%%J%J%%%j%jjJ%J%%j%JJ%%%%%%%%j%%
$$ 3 3 3 3 3 2 3 3 3 2 2 2 1 1 2 3 3 2 3 2 2 1 1 0 0 1 1 1 1 2 2 3 2 2 2 2 1 1 1 1 1 1 2 2 3 3 3 3 2 2 1 0 1 1 2 2 2 1 1 2 3 3 3 3 3 3 3 3 3 2 2 2
5767B%%J%%%%%%%%%%%j%Jj%%jJJ%%j%%%J%%Jjj%J%JjjJ%%Jjj%J%j%jJ%%Jjj%%J%JJj%j%j%
$$ 2 2 2 3 3 3 3 3 3 3 3 3 3 3 3 2 2 3 2 2 2 1 2 3 3 3 2 2 2 2 3 3 3 4 3 2 2 3 3 4 3 2 3 3 3 4 3 2 2 3 3 2 2 1 2 2 2 3 2 1 1 1 2 2 3 4 3 3 2 2 1 1
5756A%%%J%%j%J%%J%Jj%%%j%j%%%%jJJj%%JJ%jj%%JJj%j%%%J%%%%%%%%J%%j%j%%%JJ%%jj%
$$ 1 1 1 1 2 2 2 1 1 2 2 2 3 3 4 3 3 3 3 2 2 1 1 1 1 1 0 1 2 1 1 1 2 3 3 2 1 1 1 2 3 2 2 1 1 1 1 2 2 2 2 2 2 2 2 2 3 3 3 2 2 1 1 1 1 2 3 3 3 2 1 1
5746AJJ%%J%jj%%%%Jj%%Jjj%J%%%j%%JJ%%%%k%JJ%%%%%%jJ%k%%%J%%jJ%%%%%%%%j%%%%%%J
$$ 1 2 3 3 3 4 4 3 2 2 2 2 2 3 2 2 2 3 2 1 1 2 2 2 2 1 1 1 2 3 3 3 3 3 1 1 2 3 3 3 3 3 3 3 2 3 3 1 1 1 1 2 2 2 1 2 2 2 2 2 2 2 2 2 1 1 1 1 1 1 1 2
5735B%Jjj%J%J%%j%J%%j%jJjJ%%jJ%%%%%J%%jJ%%j%%J%%%%%%%Jjj%%%%%%Jj%%J%j%%J%%%j
$$ 2 2 3 2 1 1 2 2 3 3 3 2 2 3 3 3 2 2 1 2 1 2 2 2 1 2 2 2 2 2 2 3 3 3 2 3 3 3 2 2 2 3 3 3 3 3 3 3 3 4 3 2 2 2 2 2 2 2 3 2 2 2 3 3 2 2 2 3 3 3 3 2
5724B%Jj%jJ%%%%%%%J%%jJ%%jJ%%%%%%%%%Jj%j%jJJJ%%j%%%JjjjJJ%%j%J%%%j%jJ%%%%jJJ
$$ 2 2 3 2 2 1 2 2 2 2 2 2 2 2 3 3 3 2 3 3 3 2 3 3 3 3 3 3 3 3 3 3 4 3 3 2 2 1 2 3 4 4 4 3 3 3 3 4 3 2 1 2 3 3 3 2 2 3 3 3 3 2 2 1 2 2 2 2 2 1 2 3
5713C%%j%%Jj%%%kJJ%%%jjJJ%%%%%%Jjj%JKj%j%Jj%%%j%%J%%J%jjJJ%%%j%J%%JJ%jj%%%jJ
$$ 3 3 3 2 2 2 3 2 2 2 2 0 1 2 2 2 2 1 0 1 2 2 2 2 2 2 2 3 2 1 1 2 4 3 3 2 2 3 2 2 2 2 1 1 1 2 2 2 3 3 2 1 2 3 3 3 3 2 2 3 3 3 4 5 5 4 3 3 3 3 2 3
5702CJjj%%%%J%JkjjJJ%%%%JJj%j%Jjj%Jj%%jJJ%JjJ%j%Jj%%j%J%%%%jJ%%%j%JJ%%%%%%%%
$$ 3 4 3 2 2 2 2 2 3 3 4 2 1 0 1 2 2 2 2 2 3 4 3 3 2 2 3 2 1 1 2 1 1 1 0 1 2 2 3 2 3 3 2 2 3 2 2 2 1 1 2 2 2 2 2 1 2 2 2 2 1 1 2 3 3 3 3 3 3 3 3 3
5691C%j%jJJj%%J%jJJ%%%%%%jj%%%%J%%%j%%%%Jj%%J%%%jJJjj%%%%J%%%%J%%J%jj%%%%j%J
$$ 3 3 2 2 1 2 3 2 2 2 3 3 2 3 4 4 4 4 4 4 4 3 2 2 2 2 2 3 3 3 3 2 2 2 2 2 3 2 2 2 3 3 3 3 2 3 4 3 2 2 2 2 2 3 3 3 3 3 4 4 4 5 5 4 3 3 3 3 3 2 2 3
5681Cj%Jjj%J%%%%%%%Jj%Jj%%J%%j%jJK%%j%j%%Jj%%J%%%J%jj%K%%%jj%%%%%%%%%%jKjjJ%
$$ 3 2 2 3 2 1 1 2 2 2 2 2 2 2 2 3 2 2 3 2 2 2 3 3 3 2 2 1 2 4 4 4 3 3 2 2 2 3 2 2 2 3 3 3 3 4 4 3 2 2 4 4 4 4 3 2 2 2 2 2 2 2 2 2 2 2 1 3 2 1 2 2
5670BJ%%jJ%%Jjj%%%%J%%%%Jj%%%%%%%J%j%%%j%J%%%%Jjj%%%%%%j%%J%JJj%%%%j%%%%%%%%
$$ 2 3 3 3 2 3 3 3 4 3 2 2 2 2 2 3 3 3 3 3 4 3 3 3 3 3 3 3 3 4 4 3 3 3 3 2 2 3 3 3 3 3 4 3 2 2 2 2 2 2 2 1 1 1 2 2 3 4 3 3 3 3 3 2 2 2 2 2 2 2 2 2
5659BJJjjjJ%%%j%J%%%%%%Jjj%%Jj%J%%J%J%%j%%J%J%j%%%%%%%%%j%%%j%%J%%JkJ%j%%Jj%
$$ 2 3 4 3 2 1 2 2 2 2 1 1 2 2 2 2 2 2 2 3 2 1 1 1 2 1 1 2 2 2 3 3 4 4 4 3 3 3 4 4 5 5 4 4 4 4 4 4 4 4 4 4 3 3 3 3 2 2 2 3 3 3 4 2 3 3 2 2 2 3 2 2
5648Bj%K%j%%J%%%%%jJ%jJ%%%%%j%jJ%%%%%j%%%J%%%jJJ%%%%j%%%%JJj%%%%%%k%J%J%Jjj%
$$ 2 1 1 3 3 2 2 2 3 3 3 3 3 3 2 3 3 2 3 3 3 3 3 3 2 2 1 2 2 2 2 2 2 1 1 1 1 2 2 2 2 1 2 3 3 3 3 3 2 2 2 2 2 3 4 3 3 3 3 3 3 3 1 1 2 2 3 3 4 3 2 2
5637B%%%%%jJ%%j%%%J%%%J%%%%jjJ%%J%j%%jJ%%J%%%%jj%%%%%J%J%%J%%%j%%%%J%%j%%%%%
$$ 2 2 2 2 2 2 1 2 2 2 1 1 1 1 2 2 2 2 3 3 3 3 3 2 1 2 2 2 3 3 2 2 2 1 2 2 2 3 3 3 3 3 2 1 1 1 1 1 1 2 2 3 3 3 4 4 4 4 3 3 3 3 3 4 4 4 3 3 3 3 3 3
5626C%Jj%%jJ%%j%%J%j%%%J%%%%j%jJJ%%jkJJJ%%%%%%%%jJ%%%j%%%%%JJj%J%j%j%%%%jJ%J
$$ 3 3 4 3 3 3 2 3 3 3 2 2 2 3 3 2 2 2 2 3 3 3 3 3 2 2 1 2 3 3 3 2 0 1 2 3 3 3 3 3 3 3 3 3 2 3 3 3 3 2 2 2 2 2 2 3 4 3 3 4 4 3 3 2 2 2 2 2 1 2 2 3
5616C%j%%Jj%%%%%%%j%%Jj%J%%%J%%J%j%%J%j%j%J%%j%%j%J%J%%j%%%J%J%j%%%j%J%%JjjJ
$$ 3 3 2 2 2 3 2 2 2 2 2 2 2 2 1 1 1 2 1 1 2 2 2 2 3 3 3 4 4 3 3 3 4 4 3 3 2 2 3 3 3 2 2 2 1 1 2 2 3 3 3 2 2 2 2 3 3 4 4 3 3 3 3 2 2 3 3 3 4 3 2 3
5605C%%%j%%%%%%J%%%%%%%%%j%J%%%jj%J%%%J%%%%%%j%%jJ%J%%%%%%%jJ%J%%jj%%%J%%%%J
$$ 3 3 3 3 2 2 2 2 2 2 2 3 3 3 3 3 3 3 3 3 3 2 2 3 3 3 3 2 1 1 2 2 2 2 3 3 3 3 3 3 3 2 2 2 1 2 2 3 3 3 3 3 3 3 3 2 3 3 4 4 4 3 2 2 2 2 3 3 3 3 3 4
5594D%jjjJ%%%%J%%jj%JJ%%%%J%jj%J%%%jJ%%%%%%%%%%%J%%%%jj%%%j%J%%%J%%j%%%%J%%%
$$ 4 4 3 2 1 2 2 2 2 2 3 3 3 2 1 1 2 3 3 3 3 3 4 4 3 2 2 3 3 3 3 2 3 3 3 3 3 3 3 3 3 3 3 3 4 4 4 4 4 3 2 2 2 2 1 1 2 2 2 2 3 3 3 2 2 2 2 2 3 3 3 3
5583C%j%%%%%J%%jJ%%J%%%%%%%%jjJ%%J%jj%%J%%%%%%%%j%%%%%%J%%Jj%J%jjJ%%%jj%J%jJ
$$ 3 3 2 2 2 2 2 2 3 3 3 2 3 3 3 4 4 4 4 4 4 4 4 4 3 2 3 3 3 4 4 3 2 2 2 3 3 3 3 3 3 3 3 3 2 2 2 2 2 2 2 3 3 3 4 3 3 4 4 3 2 3 3 3 3 2 1 1 2 2 1 2
5572B%%%%J%J%%jj%%%%%J%%%%jJ%%%%%j%Jjj%%J%J%%j%%J%j%%J%%%%%j%%J%%jJJ%%j%j%%%
$$ 2 2 2 2 2 3 3 4 4 4 3 2 2 2 2 2 2 3 3 3 3 3 2 3 3 3 3 3 3 2 2 3 2 1 1 1 2 2 3 3 3 2 2 2 3 3 2 2 2 3 3 3 3 3 3 2 2 2 3 3 3 2 3 4 4 4 3 3 2 2 2 2
5561B%%J%%%%%%%%%%j%J%J%%j%JjjJJ%jj%%%J%K%Jjjj%%%%jJJ%Jj%%%j%%%%J%j%%%J%%%jj
$$ 2 2 2 3 3 3 3 3 3 3 3 3 3 3 2 2 3 3 4 4 4 3 3 4 3 2 3 4 4 3 2 2 2 2 3 3 5 5 6 5 4 3 3 3 3 3 2 3 4 4 5 4 4 4 4 3 3 3 3 3 4 4 3 3 3 3 4 4 4 4 3 2
5551BJ%%J%j%%%%%JJj%%%%%kjJJj%jJ%%jJ%J%%%J%j%%%%%%%%%%%%%j%J%%%%%j%%Kj%%%Jjj
$$ 2 3 3 3 4 4 3 3 3 3 3 3 4 5 4 4 4 4 4 4 2 1 2 3 2 2 1 2 2 2 1 2 2 3 3 3 3 4 4 3 3 3 3 3 3 3 3 3 3 3 3 3 3 2 2 3 3 3 3 3 3 2 2 2 4 3 3 3 3 4 3 2
5540Bj%JJ%%J%%j%%%j%%jJ%j%%%J%%J%JjjjJJ%j%%%%%%%J%%j%Jj%J%J%%j%j%j%J%j%JJ%%%
$$ 2 1 1 2 3 3 3 4 4 4 3 3 3 3 2 2 2 1 2 2 1 1 1 1 2 2 2 3 3 4 3 2 1 2 3 3 2 2 2 2 2 2 2 2 3 3 3 2 2 3 2 2 3 3 4 4 4 3 3 2 2 1 1 2 2 1 1 2 3 3 3 3
5529C%j%%%JKj%%j%%%%j%J%Jj%jJj%j%%%J%JJj%%j%%%%%%jJ%%%J%%J%%j%j%j%%JJj%%j%%%
$$ 3 3 2 2 2 2 3 5 4 4 4 3 3 3 3 3 2 2 3 3 4 3 3 2 3 2 2 1 1 1 1 2 2 3 4 3 3 3 2 2 2 2 2 2 2 1 2 2 2 2 3 3 3 4 4 4 3 3 2 2 1 1 1 2 3 2 2 2 1 1 1 1
5518A%%J%J%%J%j%%%%%%jJJj%JjjJ%J%j%J%%j%%jJJ%%%%%j%%j%%%j%%%%%J%JjJ%%j%%Kj%%
$$ 1 1 1 2 2 3 3 3 4 4 3 3 3 3 3 3 3 2 3 4 3 3 4 3 2 3 3 4 4 3 3 4 4 4 3 3 3 2 3 4 4 4 4 4 4 3 3 3 2 2 2 2 1 1 1 1 1 1 2 2 3 2 3 3 3 2 2 2 4 3 3 3
5507CJjjj%%%%%%J%%J%%%%%%J%jJ%jj%%JJJjj%%%%%%%j%%%%%%%%%j%%%JJ%%JJ%%j%%j%J%%
$$ 3 4 3 2 1 1 1 1 1 1 1 2 2 2 3 3 3 3 3 3 3 4 4 3 4 4 3 2 2 2 3 4 5 4 3 3 3 3 3 3 3 3 2 2 2 2 2 2 2 2 2 2 1 1 1 1 2 3 3 3 4 5 5 5 4 4 4 3 3 4 4 4
5496Dj%%%J%%j%Jj%jJJ%%%%%%%jj%jjJJ%%%%%%%j%%J%JjJ%%Jj%kJ%%%J%%j%j%%J%J%j%%%J
$$ 4 3 3 3 3 4 4 4 3 3 4 3 3 2 3 4 4 4 4 4 4 4 4 3 2 2 1 0 1 2 2 2 2 2 2 2 2 1 1 1 2 2 3 2 3 3 3 4 3 3 1 2 2 2 2 3 3 3 2 2 1 1 1 2 2 3 3 2 2 2 2 3
5486C%JJj%J%%jj%jJj%Jjj%%J%%j%Jj%%J%JJkj%JJjj%J%%%J%%j%J%jJJj%%%J%jj%%J%Jjj%
$$ 3 3 4 5 4 4 5 5 5 4 3 3 2 3 2 2 3 2 1 1 1 2 2 2 1 1 2 1 1 1 2 2 3 4 2 1 1 2 3 2 1 1 2 2 2 2 3 3 3 2 2 3 3 2 3 4 3 3 3 3 4 4 3 2 2 2 3 3 4 3 2 2
5475B%J%%%jJ%%%JJkj%%%%%J%%%%%%j%JJk%JJ%%j%%%%j%%%%%J%%%%%%%Jjj%%%%J%J%jj%%%
$$ 2 2 3 3 3 3 2 3 3 3 3 4 5 3 2 2 2 2 2 2 3 3 3 3 3 3 3 2 2 3 4 2 2 3 4 4 4 3 3 3 3 3 2 2 2 2 2 2 3 3 3 3 3 3 3 3 4 3 2 2 2 2 2 3 3 4 4 3 2 2 2 2
5464B%J%%%%%%%%%%%jjjJK%%%J%%j%%%%%%%Jj%%%J%%J%k%%jJ%%%j%%%%J%%%JjJ%j%J%%%%j
$$ 2 2 3 3 3 3 3 3 3 3 3 3 3 3 2 1 0 1 3 3 3 3 4 4 4 3 3 3 3 3 3 3 3 4 3 3 3 3 4 4 4 5 5 3 3 3 2 3 3 3 3 2 2 2 2 2 3 3 3 3 4 3 4 4 3 3 4 4 4 4 4 3
5453C%J%%%j%Jjj%%j%J%J%%%%%%J%jj%Jj%%%%%%J%%%%%%jJ%%%j%%J%%JjjjJ%JjjJ%j%JJJk
$$ 3 3 4 4 4 4 3 3 4 3 2 2 2 1 1 2 2 3 3 3 3 3 3 3 4 4 3 2 2 3 2 2 2 2 2 2 2 3 3 3 3 3 3 3 2 3 3 3 3 2 2 2 3 3 3 4 3 2 1 2 2 3 2 1 2 2 1 1 2 3 4 2
5442BJ%%jJ%%%%j%J%J%j%%%%%%%%%Jj%%J%jj%J%%j%J%j%%%jJ%%J%%%%%J%%%%jj%%j%J%J%%
$$ 2 3 3 3 2 3 3 3 3 3 2 2 3 3 4 4 3 3 3 3 3 3 3 3 3 3 4 3 3 3 4 4 3 2 2 3 3 3 2 2 3 3 2 2 2 2 1 2 2 2 3 3 3 3 3 3 4 4 4 4 4 3 2 2 2 1 1 2 2 3 3 3
5431C%%%%%j%%%%%%%%%J%%%j%%J%%%J%%Jkj%%%%%%%%%%%%%%j%%J%%%J%jK%jJ%j%jJ%%jJ%%
$$ 3 3 3 3 3 3 2 2 2 2 2 2 2 2 2 2 3 3 3 3 2 2 2 3 3 3 3 4 4 4 5 3 2 2 2 2 2 2 2 2 2 2 2 2 2 2 2 1 1 1 2 2 2 2 3 3 2 4 4 3 4 4 3 3 2 3 3 3 2 3 3 3
5421CJ%%J%%kj%%%%j%J%%%J%Jjj%Jj%JJ%Jj%%%%j%JkJ%%%%%J%%%%j%%J%%%%jJ%Jjj%%%%%%
$$ 3 4 4 4 5 5 5 3 2 2 2 2 2 1 1 2 2 2 2 3 3 4 3 2 2 3 2 2 3 4 4 5 4 4 4 4 4 3 3 4 2 3 3 3 3 3 3 4 4 4 4 4 3 3 3 4 4 4 4 4 3 4 4 5 4 3 3 3 3 3 3 3
5410C%%jjJ%%%J%%%%%%J%%%kJ%%j%j%Jj%%JJ%%%j%%Jjj%%J%%J%%j%%%%%Jj%%%%%J%jJ%%%%
$$ 3 3 3 2 1 2 2 2 2 3 3 3 3 3 3 3 4 4 4 4 2 3 3 3 2 2 1 1 2 1 1 1 2 3 3 3 3 2 2 2 3 2 1 1 1 2 2 2 3 3 3 2 2 2 2 2 2 3 2 2 2 2 2 2 3 3 2 3 3 3 3 3
5399Cj%%J%j%jK%%%%%%j%j%%%%J%%%%%%J%kJ%JJj%%%%%jJ%%%%%%%jjJJj%%J%JjjJ%%%%%%%
$$ 3 2 2 2 3 3 2 2 1 3 3 3 3 3 3 3 2 2 1 1 1 1 1 2 2 2 2 2 2 2 3 3 1 2 2 3 4 3 3 3 3 3 3 2 3 3 3 3 3 3 3 3 2 1 2 3 2 2 2 3 3 4 3 2 3 3 3 3 3 3 3 3
5388C%%J%%%%jjJ%Jj%%%%%jJ%j%Jj%%jJ%%%%j%%JJ%%JjjjJJ%Jjj%%J%%Jj%%jj%J%%%%%%J%
$$ 3 3 3 4 4 4 4 4 3 2 3 3 4 3 3 3 3 3 3 2 3 3 2 2 3 2 2 2 1 2 2 2 2 2 1 1 1 2 3 3 3 4 3 2 1 2 3 3 4 3 2 2 2 3 3 3 4 3 3 3 2 1 1 2 2 2 2 2 2 2 3 3
5377CJjj%j%J%JJj%Jjj%J%%%%%JjjjJ%%J%%JJj%j%j%JJJ%jj%j%jK%%j%%%J%%%%Jj%%%j%%%
$$ 3 4 3 2 2 1 1 2 2 3 4 3 3 4 3 2 2 3 3 3 3 3 3 4 3 2 1 2 2 2 3 3 3 4 5 4 4 3 3 2 2 3 4 5 5 4 3 3 2 2 1 3 3 3 2 2 2 2 3 3 3 3 3 4 3 3 3 3 2 2 2 2
5366B%Jj%%%%J%%%%%%j%%J%%%%%%J%%j%%%J%%%jj%JKj%%%j%%j%%%%%jJ%%J%%%%%%%j%%%%%
$$ 2 2 3 2 2 2 2 2 3 3 3 3 3 3 3 2 2 2 3 3 3 3 3 3 3 4 4 4 3 3 3 3 4 4 4 4 3 2 2 3 5 4 4 4 4 3 3 3 2 2 2 2 2 2 1 2 2 2 3 3 3 3 3 3 3 3 2 2 2 2 2 2
5356BJ%%JjjJ%%%%%J%%%j%%j%K%j%%%j%%%%J%Jj%j%%J%%%%%%%Jj%%%%j%%Jj%%%J%j%J%jJ%
$$ 2 3 3 3 4 3 2 3 3 3 3 3 3 4 4 4 4 3 3 3 2 2 4 4 3 3 3 3 2 2 2 2 2 3 3 4 3 3 2 2 2 3 3 3 3 3 3 3 3 4 3 3 3 3 3 2 2 2 3 2 2 2 2 3 3 2 2 3 3 2 3 3
5345C%Jj%jjJJ%JjjJ%%%%%%%%J%%%j%%%%%%%%%%j%%J%%%Jj%%%jj%jJJ%jJJ%%%%J%jjj%J%%
$$ 3 3 4 3 3 2 1 2 3 3 4 3 2 3 3 3 3 3 3 3 3 3 4 4 4 4 3 3 3 3 3 3 3 3 3 3 3 2 2 2 3 3 3 3 4 3 3 3 3 2 1 1 0 1 2 2 1 2 3 3 3 3 3 4 4 3 2 1 1 2 2 2
5334B%j%%%J%J%%%%%%%%%Jjj%%%j%J%J%%%Jj%Jj%%%j%J%JJjj%%j%%%J%%%%JJjk%%Jj%%%%%
$$ 2 2 1 1 1 1 2 2 3 3 3 3 3 3 3 3 3 3 4 3 2 2 2 2 1 1 2 2 3 3 3 3 4 3 3 4 3 3 3 3 2 2 3 3 4 5 4 3 3 3 2 2 2 2 3 3 3 3 3 4 5 4 2 2 2 3 2 2 2 2 2 2
5323B%j%%%J%Jj%%%%JJjjJj%J%J%%%%jJ%j%%%%%jJ%%jJj%J%%jJJ%j%j%%JJjj%j%%JJjJ%%J
$$ 2 2 1 1 1 1 2 2 3 2 2 2 2 2 3 4 3 2 3 2 2 3 3 4 4 4 4 4 3 4 4 3 3 3 3 3 3 2 3 3 3 2 3 2 2 3 3 3 2 3 4 4 3 3 2 2 2 3 4 3 2 2 1 1 1 2 3 2 3 3 3 4
5312D%jjJJj%%%%%Jj%%%j%%%%JJj%%jj%JJ%J%j%%%%j%%j%J%%J%%%%%%%%j%%%J%%J%%%%%%j
$$ 4 4 3 2 3 4 3 3 3 3 3 3 4 3 3 3 3 2 2 2 2 2 3 4 3 3 3 2 1 1 2 3 3 4 4 3 3 3 3 3 2 2 2 1 1 2 2 2 3 3 3 3 3 3 3 3 3 2 2 2 2 3 3 3 4 4 4 4 4 4 4 3
5301C%%J%jj%%j%J%%Jj%%%%J%%j%%%JJ%%%%%j%jJJ%%kjJ%J%%j%%%J%%%%%%%%J%jjj%jJJ%%
$$ 3 3 3 4 4 3 2 2 2 1 1 2 2 2 3 2 2 2 2 2 3 3 3 2 2 2 2 3 4 4 4 4 4 4 3 3 2 3 4 4 4 2 1 2 2 3 3 3 2 2 2 2 3 3 3 3 3 3 3 3 3 4 4 3 2 1 1 0 1 2 2 2
5291BjJ%JJ%jJ%Jjj%j%%J%%jJ%%%JjjJJ%%%%%%%%%jkJ%%%J%%%jJ%%jJJ%%j%JJjj%Jj%j%%J
$$ 2 1 2 2 3 4 4 3 4 4 5 4 3 3 2 2 2 3 3 3 2 3 3 3 3 4 3 2 3 4 4 4 4 4 4 4 4 4 4 3 1 2 2 2 2 3 3 3 3 2 3 3 3 2 3 4 4 4 3 3 4 5 4 3 3 4 3 3 2 2 2 3
5280C%%%%%jjJJ%J%jj%%J%%%%%%%%%%j%%%%J%%%%Jj%%jJ%%J%%%%%%%%j%%%%%jj%J%j%%JJJ
$$ 3 3 3 3 3 3 2 1 2 3 3 4 4 3 2 2 2 3 3 3 3 3 3 3 3 3 3 3 2 2 2 2 2 3 3 3 3 3 4 3 3 3 2 3 3 3 4 4 4 4 4 4 4 4 4 3 3 3 3 3 3 2 1 1 2 2 1 1 1 2 3 4
5269Dj%j%%JJj%%%J%%%%j%%%Jj%%jJ%j%JJ%%jj%%J%J%%j%%j%%%%jJJ%%%%%j%%%%%%%%JJ%j
$$ 4 3 3 2 2 2 3 4 3 3 3 3 4 4 4 4 4 3 3 3 3 4 3 3 3 2 3 3 2 2 3 4 4 4 3 2 2 2 3 3 4 4 4 3 3 3 2 2 2 2 2 1 2 3 3 3 3 3 3 2 2 2 2 2 2 2 2 2 3 4 4 3
5258CjJ%%j%J%%%%J%j%%J%%%%%j%%j%jJJ%J%%%%%Jj%%jJ%%%%%%%j%j%JJ%%%Jjj%%%%j%J%j
$$ 3 2 3 3 3 2 2 3 3 3 3 3 4 4 3 3 3 4 4 4 4 4 4 3 3 3 2 2 1 2 3 3 4 4 4 4 4 4 5 4 4 4 3 4 4 4 4 4 4 4 4 3 3 2 2 3 4 4 4 4 5 4 3 3 3 3 3 2 2 3 3 2
5247B%%%%J%%JJj%j%%JJ%kJ%%%j%%%%J%%%jj%%JJ%%j%%%%%J%j%%%j%jjJ%JJ%jJ%%%j%%Jjj
$$ 2 2 2 2 2 3 3 3 4 5 4 4 3 3 3 4 5 5 3 4 4 4 4 3 3 3 3 3 4 4 4 4 3 2 2 2 3 4 4 4 3 3 3 3 3 3 4 4 3 3 3 3 2 2 1 0 1 1 2 3 3 2 3 3 3 3 2 2 2 3 2 1
5236AJ%J%jjJJ%%%%%%J%%%jj%%J%j%%%J%%jJ%%%%%%%%j%%%j%%KJj%j%J%%%%%J%%%j%%%%%%
$$ 1 2 2 3 3 2 1 2 3 3 3 3 3 3 3 4 4 4 4 3 2 2 2 3 3 2 2 2 2 3 3 3 2 3 3 3 3 3 3 3 3 3 2 2 2 2 1 1 1 3 4 3 3 2 2 3 3 3 3 3 3 4 4 4 4 3 3 3 3 3 3 3
5226CjJ%jjJ%J%J%%%%j%%%%%%%j%jJJjj%J%%%%J%J%%j%%%%j%%J%%JjJJ%%jj%jJJ%%j%j%J%
$$ 3 2 3 3 2 1 2 2 3 3 4 4 4 4 4 3 3 3 3 3 3 3 3 2 2 1 2 3 2 1 1 2 2 2 2 2 3 3 4 4 4 3 3 3 3 3 2 2 2 3 3 3 4 3 4 5 5 5 4 3 3 2 3 4 4 4 3 3 2 2 3 3
5215Cj%%%%%K%%jjj%JJjjJJ%%%j%%Jj%jJJ%JJjj%%Jjj%Jj%JJ%%jjJ%J%j%Jj%%J%j%%J%j%J
$$ 3 2 2 2 2 2 2 4 4 4 3 2 1 1 2 3 2 1 2 3 3 3 3 2 2 2 3 2 2 1 2 3 3 4 5 4 3 3 3 4 3 2 2 3 2 2 3 4 4 4 3 2 3 3 4 4 3 3 4 3 3 3 4 4 3 3 3 4 4 3 3 4
5204Dj%jjJ%J%%%%%%J%%%%jJ%%%%Jj%%j%%%jJJJjk%%%%JkJ%J%%%%%%JJj%%%j%J%j%%JJ%jj
$$ 4 3 3 2 1 2 2 3 3 3 3 3 3 3 4 4 4 4 4 3 4 4 4 4 4 5 4 4 4 3 3 3 3 2 3 4 5 4 2 2 2 2 2 3 1 2 2 3 3 3 3 3 3 3 4 5 4 4 4 4 3 3 4 4 3 3 3 4 5 5 4 3
5193C%j%J%JJj%%j%Jjj%%J%%%%%jJ%J%%jJ%%%j%%%%J%j%jJ%%Jj%%J%%%j%Jj%%%%%%%%J%%%
$$ 3 3 2 2 3 3 4 5 4 4 4 3 3 4 3 2 2 2 3 3 3 3 3 3 2 3 3 4 4 4 3 4 4 4 4 3 3 3 3 3 4 4 3 3 2 3 3 3 4 3 3 3 4 4 4 4 3 3 4 3 3 3 3 3 3 3 3 3 4 4 4 4
5182D%jjJJ%Jjj%%%%%%%jJ%JjjJ%%J%J%jjj%%%%J%JjJ%%%jJj%J%%j%%%%%%%%%%%%%%j%J%%
$$ 4 4 3 2 3 4 4 5 4 3 3 3 3 3 3 3 3 2 3 3 4 3 2 3 3 3 4 4 5 5 4 3 2 2 2 2 2 3 3 4 3 4 4 4 4 3 4 3 3 4 4 4 3 3 3 3 3 3 3 3 3 3 3 3 3 3 3 2 2 3 3 3
5171CjjJjJ%%%%%%%%%%%%J%%%j%%%%%jJJ%J%J%%j%%j%jJJ%%j%%%Jj%%J%%j%%%%%%%%%%%%%
$$ 3 2 1 2 1 2 2 2 2 2 2 2 2 2 2 2 2 2 3 3 3 3 2 2 2 2 2 2 1 2 3 3 4 4 5 5 5 4 4 4 3 3 2 3 4 4 4 3 3 3 3 4 3 3 3 4 4 4 3 3 3 3 3 3 3 3 3 3 3 3 3 3
5161CjJ%%%%%j%J%%%%%%%%j%J%%%%%JJ%j%j%%Jj%jJ%%%j%%J%%%%%%%J%j%%J%Jj%%%%j%%%%
$$ 3 2 3 3 3 3 3 3 2 2 3 3 3 3 3 3 3 3 3 2 2 3 3 3 3 3 3 4 5 5 4 4 3 3 3 4 3 3 2 3 3 3 3 2 2 2 3 3 3 3 3 3 3 3 4 4 3 3 3 4 4 5 4 4 4 4 4 3 3 3 3 3
5150CJ%j%J%%jJ%jj%jJ%J%%%%%%%%jJ%j%%J%%%%%%j%%J%%%jj%%JJ%%%%Jj%%%J%%J%%j%%j%
$$ 3 4 4 3 3 4 4 4 3 4 4 3 2 2 1 2 2 3 3 3 3 3 3 3 3 3 2 3 3 2 2 2 3 3 3 3 3 3 3 2 2 2 3 3 3 3 2 1 1 1 2 3 3 3 3 3 4 3 3 3 3 4 4 4 5 5 5 4 4 4 3 3
5139C%%J%%%%%%j%%%j%J%%%j%J%j%J%j%%%%J%j%J%%%J%%j%%Jj%%%J%j%jJJ%j%%%J%jjjJ%%
$$ 3 3 3 4 4 4 4 4 4 4 3 3 3 3 2 2 3 3 3 3 2 2 3 3 2 2 3 3 2 2 2 2 2 3 3 2 2 3 3 3 3 4 4 4 3 3 3 4 3 3 3 3 4 4 3 3 2 3 4 4 3 3 3 3 4 4 3 2 1 2 2 2
5128BJJ%%%%%Jkj%J%J%%%jJ%%%%j%%%%%%%%%%%jJ%Jj%%%j%%J%%%jJjJ%J%%%%j%%%j%%%J%%
$$ 2 3 4 4 4 4 4 4 5 3 2 2 3 3 4 4 4 4 3 4 4 4 4 4 3 3 3 3 3 3 3 3 3 3 3 3 2 3 3 4 3 3 3 3 2 2 2 3 3 3 3 2 3 2 3 3 4 4 4 4 4 3 3 3 3 2 2 2 2 3 3 3
5117C%%j%J%%%JJjjj%%%%J%%j%%J%%%jjJ%%%%J%%Jjj%J%%j%jJJ%j%j%%%KJ%%%j%%%%%%%%j
$$ 3 3 3 2 2 3 3 3 3 4 5 4 3 2 2 2 2 2 3 3 3 2 2 2 3 3 3 3 2 1 2 2 2 2 2 3 3 3 4 3 2 2 3 3 3 2 2 1 2 3 3 2 2 1 1 1 1 3 4 4 4 4 3 3 3 3 3 3 3 3 3 2
5106B%%jJ%J%%%jJ%J%%jJj%%%%%%%J%%%%%%j%%%%%%%%%%JjjJ%J%%j%%%j%%%%%J%j%J%%%%%
$$ 2 2 2 1 2 2 3 3 3 3 2 3 3 4 4 4 3 4 3 3 3 3 3 3 3 3 4 4 4 4 4 4 4 3 3 3 3 3 3 3 3 3 3 3 4 3 2 3 3 4 4 4 3 3 3 3 2 2 2 2 2 2 3 3 2 2 3 3 3 3 3 3
5096CjJ%%J%%j%%%jJ%%J%j%%%%%%%%%J%jj%jJ%%%JJ%%j%%%%jJ%%%%%%%%j%%%jJ%%%%Jj%%%
$$ 3 2 3 3 3 4 4 4 3 3 3 3 2 3 3 3 4 4 3 3 3 3 3 3 3 3 3 3 4 4 3 2 2 1 2 2 2 2 3 4 4 4 3 3 3 3 3 2 3 3 3 3 3 3 3 3 3 2 2 2 2 1 2 2 2 2 2 3 2 2 2 2
5085B%jJ%%%%JJj%%%%%%JJjj%%%j%%%%J%%%jJ%%%%%%%%%%%%%%Jj%J%j%J%%j%%j%%%%J%%%%
$$ 2 2 1 2 2 2 2 2 3 4 3 3 3 3 3 3 3 4 5 4 3 3 3 3 2 2 2 2 2 3 3 3 3 2 3 3 3 3 3 3 3 3 3 3 3 3 3 3 3 4 3 3 4 4 3 3 4 4 4 3 3 3 2 2 2 2 2 3 3 3 3 3
5074Cj%%%%%%%J%j%%J%%%%%%j%%%J%%%Jj%J%jk%JJj%%%%%J%%J%%%%j%jJ%%%%%%%%%%%%%Jj
$$ 3 2 2 2 2 2 2 2 2 3 3 2 2 2 3 3 3 3 3 3 3 2 2 2 2 3 3 3 3 4 3 3 4 4 3 1 1 2 3 2 2 2 2 2 2 3 3 3 4 4 4 4 4 3 3 2 3 3 3 3 3 3 3 3 3 3 3 3 3 3 4 3
5063Cj%%%J%%%%%%%J%%jj%%%%J%%%%j%J%%%%%JJj%%j%J%%J%j%%%j%%j%%KJ%%%j%jj%J%%%%
$$ 3 2 2 2 2 3 3 3 3 3 3 3 3 4 4 4 3 2 2 2 2 2 3 3 3 3 3 2 2 3 3 3 3 3 3 4 5 4 4 4 3 3 4 4 4 5 5 4 4 4 4 3 3 3 2 2 2 4 5 5 5 5 4 4 3 2 2 3 3 3 3 3
5052Cj%j%%JJj%%%JJ%%j%j%J%%J%k%%%Kj%%%%Kj%%%%%jj%%JJ%%%%Jk%j%%%J%%%%%j%J%%%j
$$ 3 2 2 1 1 1 2 3 2 2 2 2 3 4 4 4 3 3 2 2 3 3 3 4 4 2 2 2 2 4 3 3 3 3 3 5 4 4 4 4 4 4 3 2 2 2 3 4 4 4 4 4 5 3 3 2 2 2 2 3 3 3 3 3 3 2 2 3 3 3 3 2
5041B%%%J%kJJ%J%k%%%%%J%%%%%%JJ%%%%%j%jJ%%%%j%j%J%Jj%%J%%jjJ%%%%%%J%%%%%j%Jj
$$ 2 2 2 2 3 3 1 2 3 3 4 4 2 2 2 2 2 2 3 3 3 3 3 3 3 4 5 5 5 5 5 5 4 4 3 4 4 4 4 4 3 3 2 2 3 3 4 3 3 3 4 4 4 3 2 3 3 3 3 3 3 3 4 4 4 4 4 4 3 3 4 3
5031C%%%j%%J%%%j%%%%J%J%%%%jJ%jj%J%J%%j%%%%jJjj%KJjjJ%%%j%J%J%Jjj%%%%%j%J%%%
$$ 3 3 3 3 2 2 2 3 3 3 3 2 2 2 2 2 3 3 4 4 4 4 4 3 4 4 3 2 2 3 3 4 4 4 3 3 3 3 3 2 3 2 1 1 3 4 3 2 3 3 3 3 2 2 3 3 4 4 5 4 3 3 3 3 3 3 2 2 3 3 3 3
5020CjJJ%%j%%%JJjjj%J%%%jJ%%%j%J%%J%%j%j%J%%Jj%%%%J%%%%%%k%%%%J%%%%%%J%%%%%%
$$ 3 2 3 4 4 4 3 3 3 3 4 5 4 3 2 2 3 3 3 3 2 3 3 3 3 2 2 3 3 3 4 4 4 3 3 2 2 3 3 3 4 3 3 3 3 3 4 4 4 4 4 4 4 2 2 2 2 2 3 3 3 3 3 3 3 4 4 4 4 4 4 4
5009DJ%j%%j%jjJJJ%%%JjjjJJj%%%%j%%%jJJJ%jj%%%%JJ%%%JkjJj%%%%%%%%%%%%j%JJ%%%J
$$ 4 5 5 4 4 4 3 3 2 1 2 3 4 4 4 4 5 4 3 2 3 4 3 3 3 3 3 2 2 2 2 1 2 3 4 4 3 2 2 2 2 2 3 4 4 4 4 5 3 2 3 2 2 2 2 2 2 2 2 2 2 2 2 2 1 1 2 3 3 3 3 4
4998D%%J%kJjj%J%%%J%Jj%j%%%%%J%%Jjj%jjJJ%%%JJ%%%%jjJ%%j%%J%%%%%j%%JJjJJj%%j%
$$ 4 4 4 5 5 3 4 3 2 2 3 3 3 3 4 4 5 4 4 3 3 3 3 3 3 4 4 4 5 4 3 3 2 1 2 3 3 3 3 4 5 5 5 5 5 4 3 4 4 4 3 3 3 4 4 4 4 4 4 3 3 3 4 5 4 5 6 5 5 5 4 4
4987Dj%%%%%j%%%%%%%%%%JJ%%%jJ%%%J%jj%Jj%%j%%J%J%%%%%j%%J%jKj%j%%%%j%%%%J%%%%
$$ 4 3 3 3 3 3 3 2 2 2 2 2 2 2 2 2 2 2 3 4 4 4 4 3 4 4 4 4 5 5 4 3 3 4 3 3 3 2 2 2 3 3 4 4 4 4 4 4 3 3 3 4 4 3 5 4 4 3 3 3 3 3 2 2 2 2 2 3 3 3 3 3
4976C%%%%%jJJj%%%J%j%J%%j%%%J%%%j%%%%%%%%%j%%J%%J%j%%%%%%%%Jj%%J%%j%j%%J%JJ%
$$ 3 3 3 3 3 3 2 3 4 3 3 3 3 4 4 3 3 4 4 4 3 3 3 3 4 4 4 4 3 3 3 3 3 3 3 3 3 3 2 2 2 3 3 3 4 4 3 3 3 3 3 3 3 3 3 4 3 3 3 4 4 4 3 3 2 2 2 3 3 4 5 5
4966EjJj%%j%%%Jj%%%J%%%%%%%%j%%%%Jj%%%%jJ%%%%j%J%%%J%jJ%%%%%%j%jJJjjJ%%j%%%J
$$ 5 4 5 4 4 4 3 3 3 3 4 3 3 3 3 4 4 4 4 4 4 4 4 4 3 3 3 3 3 4 3 3 3 3 3 2 3 3 3 3 3 2 2 3 3 3 3 4 4 3 4 4 4 4 4 4 4 3 3 2 3 4 3 2 3 3 3 2 2 2 2 3
4955CJjJ%j%jJ%%%Jj%%J%%%%%%%j%%Jj%%%%jJJj%%j%JJ%%j%J%j%j%%%j%%JJ%%%%J%Jjj%%%
$$ 3 4 3 4 4 3 3 2 3 3 3 3 4 3 3 3 4 4 4 4 4 4 4 4 3 3 3 4 3 3 3 3 3 2 3 4 3 3 3 2 2 3 4 4 4 3 3 4 4 3 3 2 2 2 2 1 1 1 2 3 3 3 3 3 4 4 5 4 3 3 3 3
4944CJjj%jJ%J%JJj%%j%%%jJJ%%%%J%Jj%j%j%K%%jjjj%%JJ%%%%%j%%J%J%J%j%k%JJ%%%%j%
$$ 3 4 3 2 2 1 2 2 3 3 4 5 4 4 4 3 3 3 3 2 3 4 4 4 4 4 5 5 6 5 5 4 4 3 3 5 5 5 4 3 2 1 1 1 2 3 3 3 3 3 3 2 2 2 3 3 4 4 5 5 4 4 2 2 3 4 4 4 4 4 3 3
4933Cj%J%%%JJjj%%%%%%%Jj%%J%jJ%jLJj%%%%jjJJ%%j%%kJ%j%j%%%%%%jJJ%%J%J%%%j%%%%
$$ 3 2 2 3 3 3 3 4 5 4 3 3 3 3 3 3 3 3 4 3 3 3 4 4 3 4 4 3 6 7 6 6 6 6 6 5 4 5 6 6 6 5 5 5 3 4 4 3 3 2 2 2 2 2 2 2 1 2 3 3 3 4 4 5 5 5 5 4 4 4 4 4
4922DJj%%j%%JJ%j%j%%%%%%K%j%%%jJ%%%%J%%%j%%jjjJ%%J%%J%jj%J%%%%%%%J%jjJJ%j%JJ
$$ 4 5 4 4 4 3 3 3 4 5 5 4 4 3 3 3 3 3 3 3 5 5 4 4 4 4 3 4 4 4 4 4 5 5 5 5 4 4 4 3 2 1 2 2 2 3 3 3 4 4 3 2 2 3 3 3 3 3 3 3 3 4 4 3 2 3 4 4 3 3 4 5
4911Ej%%%%%J%j%%jJ%%%j%%%%j%%%%%J%%%jJJ%%j%%%j%%JJ%j%%%JJj%j%%%%%%jJ%J%%J%%%
$$ 5 4 4 4 4 4 4 5 5 4 4 4 3 4 4 4 4 3 3 3 3 3 2 2 2 2 2 2 3 3 3 3 2 3 4 4 4 3 3 3 3 2 2 2 3 4 4 3 3 3 3 4 5 4 4 3 3 3 3 3 3 3 2 3 3 4 4 4 5 5 5 5
4901Ej%j%%%%JJ%%%Jjj%J%%j%j%J%%j%%%%%%J%%%%%%Jj%jjJJ%j%Jj%J%jJ%%jjJJkJ%Jj%%J
$$ 5 4 4 3 3 3 3 3 4 5 5 5 5 6 5 4 4 5 5 5 4 4 3 3 4 4 4 3 3 3 3 3 3 3 4 4 4 4 4 4 4 5 4 4 3 2 3 4 4 3 3 4 3 3 4 4 3 4 4 4 3 2 3 4 2 3 3 4 3 3 3 4
4890Dj%%%J%jJ%%%j%j%%%%J%%%%J%%jj%%K%%%j%%J%J%%jjJ%%%J%j%j%%%J%%%%%%j%%%%%%J
$$ 4 3 3 3 3 4 4 3 4 4 4 4 3 3 2 2 2 2 2 3 3 3 3 3 4 4 4 3 2 2 2 4 4 4 4 3 3 3 4 4 5 5 5 4 3 4 4 4 4 5 5 4 4 3 3 3 3 4 4 4 4 4 4 4 3 3 3 3 3 3 3 4
4879D%JkJ%%%j%%%%Jjj%%JJj%%%%%%%%%%%JjjjJJ%j%%%Jj%JJ%%%j%j%%%%J%%j%J%Jj%%%K%
$$ 4 4 5 3 4 4 4 4 3 3 3 3 3 4 3 2 2 2 3 4 3 3 3 3 3 3 3 3 3 3 3 3 4 3 2 1 2 3 3 2 2 2 2 3 2 2 3 4 4 4 4 3 3 2 2 2 2 2 3 3 3 2 2 3 3 4 3 3 3 3 5 5
4868E%Kj%k%J%jj%%%j%J%JjjJ%%%jJ%J%jJ%%%j%J%jK%j%%%%%%%%%jJ%%%%%%Jj%%%j%%%jjJ
$$ 5 5 7 6 6 4 4 5 5 4 3 3 3 3 2 2 3 3 4 3 2 3 3 3 3 2 3 3 4 4 3 4 4 4 4 3 3 4 4 3 5 5 4 4 4 4 4 4 4 4 4 4 3 4 4 4 4 4 4 4 5 4 4 4 4 3 3 3 3 2 1 2
4857B%%J%%jJ%%j%J%%%%%%jJJ%%J%j%%%J%j%%j%j%%%%%%%%%JJj%J%%jjJ%%JjJ%Jj%%jJ%j%
$$ 2 2 2 3 3 3 2 3 3 3 2 2 3 3 3 3 3 3 3 2 3 4 4 4 5 5 4 4 4 4 5 5 4 4 4 3 3 2 2 2 2 2 2 2 2 2 2 3 4 3 3 4 4 4 3 2 3 3 3 4 3 4 4 5 4 4 4 3 4 4 3 3
4846C%j%Jj%%%j%JJ%jJ%JJj%%Jjj%%J%%%%%JJjjjJjj%%JJ%%j%k%J%J%%%%%J%jj%%J%%%%%%
$$ 3 3 2 2 3 2 2 2 2 1 1 2 3 3 2 3 3 4 5 4 4 4 5 4 3 3 3 4 4 4 4 4 4 5 6 5 4 3 4 3 2 2 2 3 4 4 4 3 3 1 1 2 2 3 3 3 3 3 3 4 4 3 2 2 2 3 3 3 3 3 3 3
4836C%%jJ%J%%j%%jJ%%%JJ%%j%%jJJ%k%%J%%j%%%J%%J%%j%%jJ%%J%jjJ%%%%%j%%%%%J%%jj
$$ 3 3 3 2 3 3 4 4 4 3 3 3 2 3 3 3 3 4 5 5 5 4 4 4 3 4 5 5 3 3 3 4 4 4 3 3 3 3 4 4 4 5 5 5 4 4 4 3 4 4 4 5 5 4 3 4 4 4 4 4 4 3 3 3 3 3 3 4 4 4 3 2
4825BJ%%J%%jjJ%J%%j%%%JJjj%%JJj%%%%%%%%%%%jj%JJ%%J%j%k%JJ%%j%%%%%%%JJj%%%j%%
$$ 2 3 3 3 4 4 4 3 2 3 3 4 4 4 3 3 3 3 4 5 4 3 3 3 4 5 4 4 4 4 4 4 4 4 4 4 4 4 3 2 2 3 4 4 4 5 5 4 4 2 2 3 4 4 4 3 3 3 3 3 3 3 3 4 5 4 4 4 4 3 3 3
4814C%%%J%j%%j%%%%JJj%J%%jj%J%%%j%J%%%%%%%j%%%%JJjj%JJjj%%%%K%j%%%%%%%%%%J%%
$$ 3 3 3 3 4 4 3 3 3 2 2 2 2 2 3 4 3 3 4 4 4 3 2 2 3 3 3 3 2 2 3 3 3 3 3 3 3 3 2 2 2 2 2 3 4 3 2 2 3 4 3 2 2 2 2 2 4 4 3 3 3 3 3 3 3 3 3 3 3 4 4 4
4803D%j%J%%JjJ%j%j%jj%J%J%J%%%j%%JJ%%%%%j%j%%%%%%%%%jJ%%j%%%jJ%J%%%%%%%%j%%%
$$ 4 4 3 3 4 4 4 5 4 5 5 4 4 3 3 2 1 1 2 2 3 3 4 4 4 4 3 3 3 4 5 5 5 5 5 5 4 4 3 3 3 3 3 3 3 3 3 3 2 3 3 3 2 2 2 2 1 2 2 3 3 3 3 3 3 3 3 3 2 2 2 2
4792BjJK%%j%%%JJ%%jj%%%%%JJ%%jjJ%Jjj%%%%%%%%%%J%%j%%%J%%J%jj%%%%%J%%%J%j%%%J
$$ 2 1 2 4 4 4 3 3 3 3 4 5 5 5 4 3 3 3 3 3 3 4 5 5 5 4 3 4 4 5 4 3 3 3 3 3 3 3 3 3 3 3 4 4 4 3 3 3 3 4 4 4 5 5 4 3 3 3 3 3 3 4 4 4 4 5 5 4 4 4 4 5
4781EjkJJ%%%%Jk%%%j%J%%J%j%JJ%%%kjJ%%%jJ%J%%%j%%%J%J%%jj%JJjjJJ%%jj%J%%jj%%J
$$ 5 4 2 3 4 4 4 4 4 5 3 3 3 3 2 2 3 3 3 4 4 3 3 4 5 5 5 5 3 2 3 3 3 3 2 3 3 4 4 4 4 3 3 3 3 4 4 5 5 5 4 3 3 4 5 4 3 4 5 5 5 4 3 3 4 4 4 3 2 2 2 3
4771CJJ%%jj%%%%%%Jj%%%J%%J%%j%%%J%%%jj%j%J%J%%J%j%%%%JJj%k%JJj%jJ%%%j%J%j%%j
$$ 3 4 5 5 5 4 3 3 3 3 3 3 3 4 3 3 3 3 4 4 4 5 5 5 4 4 4 4 5 5 5 5 4 3 3 2 2 3 3 4 4 4 5 5 4 4 4 4 4 5 6 5 5 3 3 4 5 4 4 3 4 4 4 4 3 3 4 4 3 3 3 2
4760BJJ%%%%%J%%jj%%Jj%%%%%%%%%jJ%%%J%%j%J%%%%%%%%%j%JJ%%j%%J%jjj%%%JJ%j%%%J%
$$ 2 3 4 4 4 4 4 4 5 5 5 4 3 3 3 4 3 3 3 3 3 3 3 3 3 3 2 3 3 3 3 4 4 4 3 3 4 4 4 4 4 4 4 4 4 4 3 3 4 5 5 5 4 4 4 5 5 4 3 2 2 2 2 3 4 4 3 3 3 3 4 4
4749DjjJ%%%%%J%%j%j%J%%J%jjJJjj%JJj%J%%%%%%j%Jj%%J%%J%jj%%%%%%%Jj%JkJ%%%J%%%
$$ 4 3 2 3 3 3 3 3 3 4 4 4 3 3 2 2 3 3 3 4 4 3 2 3 4 3 2 2 3 4 3 3 4 4 4 4 4 4 4 3 3 4 3 3 3 4 4 4 5 5 4 3 3 3 3 3 3 3 3 4 3 3 4 2 3 3 3 3 4 4 4 4
4738D%jJ%%%%%%%%%%%J%%Jjj%%j%J%%%%%%J%j%%jJjK%j%%%%j%%%JJ%%j%%%%j%J%%j%j%J%%
$$ 4 4 3 4 4 4 4 4 4 4 4 4 4 4 4 5 5 5 6 5 4 4 4 3 3 4 4 4 4 4 4 4 5 5 4 4 4 3 4 3 5 5 4 4 4 4 4 3 3 3 3 4 5 5 5 4 4 4 4 4 3 3 4 4 4 3 3 2 2 3 3 3
4727Cj%%%%JJJJjj%%%j%%%%%%%J%j%%J%J%%%%%%%j%j%JJj%j%%%%KJj%j%J%j%%%%%%%j%%%J
$$ 3 2 2 2 2 2 3 4 5 6 5 4 4 4 4 3 3 3 3 3 3 3 3 4 4 3 3 3 4 4 5 5 5 5 5 5 5 5 4 4 3 3 4 5 4 4 3 3 3 3 3 5 6 5 5 4 4 5 5 4 4 4 4 4 4 4 4 3 3 3 3 4
4716D%%J%%j%%%J%%%kJ%%Jjj%%J%%%Jjj%%%%Kjj%%%%%JjJJj%j%JJ%%%%j%j%j%J%%J%%jj%%
$$ 4 4 4 5 5 5 4 4 4 4 5 5 5 5 3 4 4 4 5 4 3 3 3 4 4 4 4 5 4 3 3 3 3 3 5 4 3 3 3 3 3 3 4 3 4 5 4 4 3 3 4 5 5 5 5 5 4 4 3 3 2 2 3 3 3 4 4 4 3 2 2 2
4706B%%%%%JJ%%%%%%%jj%%%J%%Jj%%%%Jjj%J%%%JJjj%J%%jj%%jJJ%%%%%J%jJ%%%%J%%jJ%J
$$ 2 2 2 2 2 2 3 4 4 4 4 4 4 4 4 3 2 2 2 2 3 3 3 4 3 3 3 3 3 4 3 2 2 3 3 3 3 4 5 4 3 3 4 4 4 3 2 2 2 1 2 3 3 3 3 3 3 4 4 3 4 4 4 4 4 5 5 5 4 5 5 6
4695FjjJ%%jJ%%Jj%j%%J%%%%%Jjj%%%%%%%%%Jj%%Jj%%%%%J%%%j%%%jJ%%%jJJ%%Jj%%%%%%j
$$ 6 5 4 5 5 5 4 5 5 5 6 5 5 4 4 4 5 5 5 5 5 5 6 5 4 4 4 4 4 4 4 4 4 4 5 4 4 4 5 4 4 4 4 4 4 5 5 5 5 4 4 4 4 3 4 4 4 4 3 4 5 5 5 6 5 5 5 5 5 5 5 4
4684D%J%%j%%%j%%%%%%%JJjJ%Jjj%j%%J%%%j%J%%%Jj%%%%%%%%j%%J%%%J%jjj%J%%J%J%%jj
$$ 4 4 5 5 5 4 4 4 4 3 3 3 3 3 3 3 3 4 5 4 5 5 6 5 4 4 3 3 3 4 4 4 4 3 3 4 4 4 4 5 4 4 4 4 4 4 4 4 4 3 3 3 4 4 4 4 5 5 4 3 2 2 3 3 3 4 4 5 5 5 4 3
4673C%%%%%%%%%J%%%%%j%%%%%J%Jj%%%%jJJj%%%%j%%J%JkJ%%%%j%%%%%%%%JJjJJ%%%%jjjJ
$$ 3 3 3 3 3 3 3 3 3 3 4 4 4 4 4 4 3 3 3 3 3 3 4 4 5 4 4 4 4 4 3 4 5 4 4 4 4 4 3 3 3 4 4 5 3 4 4 4 4 4 3 3 3 3 3 3 3 3 3 4 5 4 5 6 6 6 6 6 5 4 3 4
4662D%%%%J%%jj%J%J%%%%j%%%j%J%%jJ%jjj%JJJ%J%%%%%%%j%jj%%JJ%%%%%%%j%%%%J%%j%%
$$ 4 4 4 4 4 5 5 5 4 3 3 4 4 5 5 5 5 5 4 4 4 4 3 3 4 4 4 3 4 4 3 2 1 1 2 3 4 4 5 5 5 5 5 5 5 5 4 4 3 2 2 2 3 4 4 4 4 4 4 4 4 3 3 3 3 3 4 4 4 3 3 3
4651C%%J%%%J%j%j%%JjjJ%%jJ%JJ%%j%%%%%%Jjj%J%%%%%%j%JJ%Jj%%%jj%%%J%%%j%%%%J%%
$$ 3 3 3 4 4 4 4 5 5 4 4 3 3 3 4 3 2 3 3 3 2 3 3 4 5 5 5 4 4 4 4 4 4 4 5 4 3 3 4 4 4 4 4 4 4 3 3 4 5 5 6 5 5 5 5 4 3 3 3 3 4 4 4 4 3 3 3 3 3 4 4 4
4641DJ%%%j%%%jJ%%JJjj%%j%J%%%%%%%%%%%%%%%J%%%j%jJ%%%jj%K%j%jJ%Kj%%Jj%%%%%%jJ
$$ 4 5 5 5 5 4 4 4 4 3 4 4 4 5 6 5 4 4 4 3 3 4 4 4 4 4 4 4 4 4 4 4 4 4 4 4 4 5 5 5 5 4 4 3 4 4 4 4 3 2 2 4 4 3 3 2 3 3 5 4 4 4 5 4 4 4 4 4 4 4 3 4
4630D%%%%%%j%J%J%jjJ%%jJJ%Jj%%j%%%%j%%%J%%J%%%j%JJ%jjJ%%%%j%%%jjjJJ%J%%%Jj%%
$$ 4 4 4 4 4 4 4 3 3 4 4 5 5 4 3 4 4 4 3 4 5 5 6 5 5 5 4 4 4 4 4 3 3 3 3 4 4 4 5 5 5 5 4 4 5 6 6 5 4 5 5 5 5 5 4 4 4 4 3 2 1 2 3 3 4 4 4 4 5 4 4 4
4619D%J%%%%j%J%j%%%jJ%%jJ%%%%jJ%j%%J%%jJ%%%%%%%%%Jj%%%%%J%%%j%%%%%%Jk%J%%%%J
$$ 4 4 5 5 5 5 5 4 4 5 5 4 4 4 4 3 4 4 4 3 4 4 4 4 4 3 4 4 3 3 3 4 4 4 3 4 4 4 4 4 4 4 4 4 4 5 4 4 4 4 4 4 5 5 5 5 4 4 4 4 4 4 4 5 3 3 4 4 4 4 4 5
4608E%%%j%J%%%jJk%%J%%%%%%Jj%jJJ%%Jj%%%jjJ%%%%%%%%%J%%j%%%J%%jjJ%Jj%j%J%%%Jj
$$ 5 5 5 5 4 4 5 5 5 5 4 5 3 3 3 4 4 4 4 4 4 4 5 4 4 3 4 5 5 5 6 5 5 5 5 4 3 4 4 4 4 4 4 4 4 4 4 5 5 5 4 4 4 4 5 5 5 4 3 4 4 5 4 4 3 3 4 4 4 4 5 4
4597D%%j%JJj%%Jjj%%J%JjjJ%%%%j%J%%%%j%JJj%j%%J%J%j%%%J%%%j%%%j%J%J%%j%%jJ%%j
$$ 4 4 4 3 3 4 5 4 4 4 5 4 3 3 3 4 4 5 4 3 4 4 4 4 4 3 3 4 4 4 4 4 3 3 4 5 4 4 3 3 3 4 4 5 5 4 4 4 4 5 5 5 5 4 4 4 4 3 3 4 4 5 5 5 4 4 4 3 4 4 4 3
4586CJJj%%%%Jj%%%%J%j%j%%%%%%J%%jJ%%%%%%%J%%jjJJ%%j%%%%J%jJ%%%%j%JjjJJj%Jj%%
$$ 3 4 5 4 4 4 4 4 5 4 4 4 4 4 5 5 4 4 3 3 3 3 3 3 3 4 4 4 3 4 4 4 4 4 4 4 4 5 5 5 4 3 4 5 5 5 4 4 4 4 4 5 5 4 5 5 5 5 5 4 4 5 4 3 4 5 4 4 5 4 4 4
4576D%%%%%%%J%%J%jj%J%JJ%jjJ%%jj%%%%jJ%%%jJ%%%%J%%j%%%j%JJ%%%%%j%%jjJ%JJ%%j%
$$ 4 4 4 4 4 4 4 4 5 5 5 6 6 5 4 4 5 5 6 7 7 6 5 6 6 6 5 4 4 4 4 4 3 4 4 4 4 3 4 4 4 4 4 5 5 5 4 4 4 4 3 3 4 5 5 5 5 5 5 4 4 4 3 2 3 3 4 5 5 5 4 4
4565D%%j%%%%%%%%%J%J%%%%%jj%JJ%%j%jJ%%%%J%%%j%%%%%J%j%%jJJJ%%jJ%j%%J%%%%%Jj%
$$ 4 4 4 3 3 3 3 3 3 3 3 3 3 4 4 5 5 5 5 5 5 4 3 3 4 5 5 5 4 4 3 4 4 4 4 4 5 5 5 5 4 4 4 4 4 4 5 5 4 4 4 3 4 5 6 6 6 5 6 6 5 5 5 6 6 6 6 6 6 7 6 6
4554Fjjj%%%%%%%J%%%J%j%%J%J%jj%jJJ%%%%j%%%%%Jjj%%%KJ%Jj%%%jJJkJ%j%%%%%%j%%%J
$$ 6 5 4 3 3 3 3 3 3 3 3 4 4 4 4 5 5 4 4 4 5 5 6 6 5 4 4 3 4 5 5 5 5 5 4 4 4 4 4 4 5 4 3 3 3 3 5 6 6 7 6 6 6 6 5 6 7 5 6 6 5 5 5 5 5 5 5 4 4 4 4 5
4543EJ%j%%%%%%jJ%jJ%jJ%%%%%%j%%J%%%%%J%j%%%%J%j%%%jJ%%%%%%%%%jjJ%%J%j%%%%%%J
$$ 5 6 6 5 5 5 5 5 5 5 4 5 5 4 5 5 4 5 5 5 5 5 5 5 4 4 4 5 5 5 5 5 5 6 6 5 5 5 5 5 6 6 5 5 5 5 4 5 5 5 5 5 5 5 5 5 5 4 3 4 4 4 5 5 4 4 4 4 4 4 4 5
4532E%%j%j%%%J%J%J%J%j%j%%%jJ%%J%%%%%j%%j%%J%%%%j%%J%%%%%%%%%%%%%%kJ%J%%%j%%
$$ 5 5 5 4 4 3 3 3 3 4 4 5 5 6 6 7 7 6 6 5 5 5 5 4 5 5 5 6 6 6 6 6 6 5 5 5 4 4 4 5 5 5 5 5 4 4 4 5 5 5 5 5 5 5 5 5 5 5 5 5 5 5 3 4 4 5 5 5 5 4 4 4
4521D%%%J%%J%%j%j%Jj%jJj%%%%J%j%%%%J%%%%J%%J%k%J%%%%%%%%%k%JJ%%%%j%J%Jk%J%j%
$$ 4 4 4 4 5 5 5 6 6 6 5 5 4 4 5 4 4 3 4 3 3 3 3 3 4 4 3 3 3 3 3 4 4 4 4 4 5 5 5 6 6 4 4 5 5 5 5 5 5 5 5 5 5 3 3 4 5 5 5 5 5 4 4 5 5 6 4 4 5 5 4 4
4511D%JJ%j%%j%%J%%%%j%%%%%%%%jJ%%%%%JJ%j%%%%%%%%%%%jJ%j%%%%%%%%%%J%%%%jJ%%%%
$$ 4 4 5 6 6 5 5 5 4 4 4 5 5 5 5 5 4 4 4 4 4 4 4 4 4 3 4 4 4 4 4 4 5 6 6 5 5 5 5 5 5 5 5 5 5 5 5 4 5 5 4 4 4 4 4 4 4 4 4 4 4 5 5 5 5 5 4 5 5 5 5 5
4500E%%%Jj%%Jj%%%%j%JJj%%%Jj%%%%Jj%%%%%jJ%%jJ%%j%J%%JJ%j%%%%%J%%j%%%%%%%%%j%
$$ 5 5 5 5 6 5 5 5 6 5 5 5 5 5 4 4 5 6 5 5 5 5 6 5 5 5 5 5 6 5 5 5 5 5 5 4 5 5 5 4 5 5 5 4 4 5 5 5 6 7 7 6 6 6 6 6 6 7 7 7 6 6 6 6 6 6 6 6 6 6 5 5
4489E%%jJ%%%%%j%%j%J%J%%%%%%%%%%%jJ%%%%%%%%%%%%%%%%%%%%%j%%JJ%j%j%%%%J%%J%j%
$$ 5 5 5 4 5 5 5 5 5 5 4 4 4 3 3 4 4 5 5 5 5 5 5 5 5 5 5 5 5 4 5 5 5 5 5 5 5 5 5 5 5 5 5 5 5 5 5 5 5 5 5 5 4 4 4 5 6 6 5 5 4 4 4 4 4 5 5 5 6 6 5 5
4478E%%J%%%j%j%%J%%%Jj%JJj%%jJj%%%%%jJ%JjjJ%J%j%%%%%%J%jjJ%%%%%j%K%%j%j%%JJj
$$ 5 5 5 6 6 6 6 5 5 4 4 4 5 5 5 5 6 5 5 6 7 6 6 6 5 6 5 5 5 5 5 5 4 5 5 6 5 4 5 5 6 6 5 5 5 5 5 5 5 6 6 5 4 5 5 5 5 5 5 4 4 6 6 6 5 5 4 4 4 5 6 5
4467E%J%%%%j%%jJ%%%J%%%Jj%j%J%J%%%%j%%%%J%%J%%j%%%jJJj%%%%%%%j%%%j%%JJ%J%%%j
$$ 5 5 6 6 6 6 6 5 5 5 4 5 5 5 5 6 6 6 6 7 6 6 5 5 6 6 7 7 7 7 7 6 6 6 6 6 7 7 7 8 8 8 7 7 7 7 6 7 8 7 7 7 7 7 7 7 7 6 6 6 6 5 5 5 6 7 7 8 8 8 8 7
4456GJj%%%jJ%%j%jJJ%%%%%%%%%%Jjj%%%%J%%j%%JjjJ%%jJ%%jJ%%%J%%%%%%j%jJ%%jJ%%%%
$$ 7 8 7 7 7 7 6 7 7 7 6 6 5 6 7 7 7 7 7 7 7 7 7 7 7 8 7 6 6 6 6 6 7 7 7 6 6 6 7 6 5 6 6 6 5 6 6 6 5 6 6 6 6 7 7 7 7 7 7 7 6 6 5 6 6 6 5 6 6 6 6 6
4446FJ%%%%%Jj%JJJ%%%%%%J%%J%JJJJKJJJ%KKJj%%%%JjjJ%j%j%kk%jjjkj%jJJ%%%JKJJ%JJ
$$ 6 7 7 7 7 7 7 8 7 7 8 9 10 10 10 10 10 10 10 11 11 11 12 12 13 14 15 16 18 19 20 21 21 23 25 26 25 25 25 25 25 26 25 24 25 25 24 24 23 23 21 19 19 18 17 16 14 13 13 12 13 14 14 14 14 15 17 18 19 19 20 21
4435B1%JJJ%J%j%%%%%%j%jj%jjjjkjjj%%k%%%%jjj%%J%Jjj%%%%%%j%j%JJ%%%J%Jk%jJ%%jj
$$ 21 21 22 23 24 24 25 25 24 24 24 24 24 24 24 23 23 22 21 21 20 19 18 17 15 14 13 12 12 12 10 10 10 10 10 9 8 7 7 7 8 8 9 8 7 7 7 7 7 7 7 6 6 5 5 6 7 7 7 7 8 8 9 7 7 6 7 7 7 6 5
4424EJ%%%JJ%%%%jjJJj%jjJJ%J%%j%%j%jJ%J%j%%J%jj%J%J%%%%jjJ%%%%J%%%JJ%%j%j%jJ%
$$ 5 6 6 6 6 7 8 8 8 8 8 7 6 7 8 7 7 6 5 6 7 7 8 8 8 7 7 7 6 6 5 6 6 7 7 6 6 6 7 7 6 5 5 6 6 7 7 7 7 7 6 5 6 6 6 6 6 7 7 7 7 8 9 9 9 8 8 7 7 6 7 7
4413G%%jJJ%j%%JJjj%%J%%J%jj%jJJ%%%%Jjj%j%%Kj%%J%%j%j%%J%%%J%%jJ%Jk%j%%J%%J%%
$$ 7 7 7 6 7 8 8 7 7 7 8 9 8 7 7 7 8 8 8 9 9 8 7 7 6 7 8 8 8 8 8 9 8 7 7 6 6 6 8 7 7 7 8 8 8 7 7 6 6 6 7 7 7 7 8 8 8 7 8 8 9 7 7 6 6 6 7 7 7 8 8 8
4402H%jJJ%%%%%%%%%%jj%%%%J%%%%%%%%J%J%%%%j%%%jJ%%jJ%j%%%%%%J%%%%%%j%jJJJj%J%
$$ 8 8 7 8 9 9 9 9 9 9 9 9 9 9 9 8 7 7 7 7 7 8 8 8 8 8 8 8 8 8 9 9 10 10 10 10 10 9 9 9 9 8 9 9 9 8 9 9 8 8 8 8 8 8 8 9 9 9 9 9 9 9 8 8 7 8 9 10 9 9 10 10
4392A0%%%%%J%%%%jJ%jj%j%%%%JJjJJj%%J%%%j%%J%%jj%%J%%%J%%jj%JjJ%%%J%J%j%j%%%%
$$ 10 10 10 10 10 10 11 11 11 11 11 10 11 11 10 9 9 8 8 8 8 8 9 10 9 10 11 10 10 10 11 11 11 11 10 10 10 11 11 11 10 9 9 9 10 10 10 10 11 11 11 10 9 9 10 9 10 10 10 10 11 11 12 12 11 11 10 10 10 10 10
4381A0KJjJ%j%Jjj%J%%J%Jj%%j%j%jJ%%%JJ%j%%j%%%J%%%jJJ%JJ%%%%%%%%%%JJ%%%%J%%%J
$$ 10 12 13 12 13 13 12 12 13 12 11 11 12 12 12 13 13 14 13 13 13 12 12 11 11 10 11 11 11 11 12 13 13 12 12 12 11 11 11 11 12 12 12 12 11 12 13 13 14 15 15 15 15 15 15 15 15 15 15 15 16 17 17 17 17 17 18 18 18 18 19
4370A9Jj%JJ%j%jJ%jJJ%Jj%%%J%%JJ%%Jj%J%%JJ%JJ%%%%%JJ%J%%%J%JJK%%J%J%LJJ%JLJ%J
$$ 19 20 19 19 20 21 21 20 20 19 20 20 19 20 21 21 22 21 21 21 21 22 22 22 23 24 24 24 25 24 24 25 25 25 26 27 27 28 29 29 29 29 29 29 30 31 31 32 32 32 32 33 33 34 35 37 37 37 38 38 39 39 42 43 44 44 45 48 49 49 50
4360E0KJJKKJJJKKLKJLMMKMMMMMPPPQRJ1J1J2J2J3J5J6J8K0K0K2K5K7L2L4L9M5N0N9O8Q0R3
$$ 50 52 53 54 56 58 59 60 61 63 65 68 70 71 74 78 82 84 88 92 96 100 104 111 118 125 133 142 153 164 176 188 201 216 232 250 270 290 312 337 364 396 430 469 514 564 623 691 771 864
4352H64J06J20J34J48J64J76J92K08K24K42K58K65K53K16J56R0M3J6j2n0q5r1o5l1j3l1q3
$$ 864 970 1090 1224 1372 1536 1712 1904 2112 2336 2578 2836 3101 3354 3570 3726 3816 3859 3875 3863 3813 3728 3637 3572 3541 3528 3497 3414
4348C414j38j69j88k13k50k81k77k41j88j33q1l8nK5N1P4R4J15J32J50J67J85K03K22K42K58
$$ 3414 3276 3107 2919 2706 2456 2175 1898 1657 1469 1336 1255 1217 1212 1237 1288 1362 1456 1571 1703 1853 2020 2205 2408 2630 2872 3130
4344C130K58K33J78J05M4J0j4n0r6j25j13p4m3l8p5j30j76k02k22k57k98l19l01k57k07j57
$$ 3130 3388 3621 3799 3904 3948 3958 3944 3894 3798 3673 3560 3486 3443 3405 3330 3200 3024 2822 2600 2343 2045 1726 1425 1168 961 804
4340H04j19q9p1n6m4l9l2k8k4k0j9j8j5j2j2j1j1j0j0rqqqppoomnllmllnmklkklkljk%jjk
$$ 804 685 596 525 469 425 386 354 326 302 282 263 245 230 218 206 195 184 174 164 155 147 139 131 124 117 111 105 101 96 93 90 86 83 80 75 71 69 66 64 62 59 57 54 53 51 51 50 49 47
4333D7kk%jkjjjjjjJ%%jjjk%jjjJ%%k%jj%j%j%%Jjj%j%%J%%%jj%%jj%jJj%jJ%%%%%%kjJj%
$$ 47 45 43 43 42 40 39 38 37 36 35 34 35 35 35 34 33 32 30 30 29 28 27 28 28 28 26 26 25 24 24 23 23 22 22 22 23 22 21 21 20 20 20 21 21 21 21 20 19 19 19 18 17 17 16 17 16 16 15 16 16 16 16 16 16 16 14 13 14 13 13
4322A3J%%%%jJ%%%%jJ%j%%%%jKj%%J%%%j%jj%%%%j%%J%%Jj%J%%%%%%j%%Jj%%%%%%%%jjj%J
$$ 13 14 14 14 14 14 13 14 14 14 14 14 13 14 14 13 13 13 13 13 12 14 13 13 13 14 14 14 14 13 13 12 11 11 11 11 11 10 10 10 11 11 11 12 11 11 12 12 12 12 12 12 12 11 11 11 12 11 11 11 11 11 11 11 11 11 10 9 8 8 9
4311I%%%%%J%%%Jj%%%%%%%%%JJ%%j%%%jj%%%jJ%J%%%%%%j%%JJj%%%%%%%%%%%%%%%Jj%jJ%%
$$ 9 9 9 9 9 9 10 10 10 10 11 10 10 10 10 10 10 10 10 10 10 11 12 12 12 11 11 11 11 10 9 9 9 9 8 9 9 10 10 10 10 10 10 10 9 9 9 10 11 10 10 10 10 10 10 10 10 10 10 10 10 10 10 10 10 11 10 10 9 10 10 10
4300A0J%j%%%%%%%%%%%%%%Jj%J%%%%%%%%%jJ%%%J%%%%%%J%%J%%j%JJ%%J%%%%J%%J%%j%%%J
$$ 10 11 11 10 10 10 10 10 10 10 10 10 10 10 10 10 10 10 11 10 10 11 11 11 11 11 11 11 11 11 11 10 11 11 11 11 12 12 12 12 12 12 12 13 13 13 14 14 14 13 13 14 15 15 15 16 16 16 16 16 17 17 17 18 18 18 17 17 17 17 18
4290A8%%%J%J%%%j%%%J%J%jj%Kj%%%jj%J%J%jJ%%%j%%j%%%j%J%J%jj%%j%%J%%j%jJJjjj%%
$$ 18 18 18 18 19 19 20 20 20 20 19 19 19 19 20 20 21 21 20 19 19 21 20 20 20 20 19 18 18 19 19 20 20 19 20 20 20 20 19 19 19 18 18 18 18 17 17 18 18 19 19 18 17 17 17 16 16 16 17 17 17 16 16 15 16 17 16 15 14 14 14
4279A4%j%%J%Jjj%%%jj%%j%%j%%%%%%jJ%%%%%j%J%%Jjj%%j%%J%%%%%%%%%Jjj%%J%j%J%j%%
$$ 14 14 13 13 13 14 14 15 14 13 13 13 13 12 11 11 11 10 10 10 9 9 9 9 9 9 9 8 9 9 9 9 9 9 8 8 9 9 9 10 9 8 8 8 7 7 7 8 8 8 8 8 8 8 8 8 8 9 8 7 7 7 8 8 7 7 8 8 7 7 7
4268G%Jjj%%K%%%jJ%%%%%%Jj%j%j%%J%%J%%%%%%%jJ%j%K%%J%%%%%%%%%J%KJJ%JJ%JKJ%J%J
$$ 7 7 8 7 6 6 6 8 8 8 8 7 8 8 8 8 8 8 8 9 8 8 7 7 6 6 6 7 7 7 8 8 8 8 8 8 8 8 7 8 8 7 7 9 9 9 10 10 10 10 10 10 10 10 10 10 11 11 13 14 15 15 16 17 17 18 20 21 21 22 22 23
4257B3JK%%%j%J%jjJjjj%jjjjjjj%%%%J%%JK%J%%KJJKJ%%%%%%%%jjj%jjjjjj%kkj%jj%j%%
$$ 23 24 26 26 26 26 25 25 26 26 25 24 25 24 23 22 22 21 20 19 18 17 16 15 15 15 15 15 16 16 16 17 19 19 20 20 20 22 23 24 26 27 27 27 27 27 27 27 27 27 26 25 24 24 23 22 21 20 19 18 18 16 14 13 13 12 11 11 10 10 10
4247A0%j%%%%%%%j%%%%%%%j%J%%J%%%jj%Jj%%J%%%jJ%jjJJjjKj%%%%J%%Jjj%%J%%%%jJ%jj
$$ 10 10 9 9 9 9 9 9 9 9 8 8 8 8 8 8 8 8 7 7 8 8 8 9 9 9 9 8 7 7 8 7 7 7 8 8 8 8 7 8 8 7 6 7 8 7 6 8 7 7 7 7 7 8 8 8 9 8 7 7 7 8 8 8 8 8 7 8 8 7 6
4236F%JJJj%%%%%j%J%%%Jjj%%jJ%%j%jJJ%%%%J%%%%%%%J%jJ%%%%%J%%j%j%%%%J%JjjjJJJj
$$ 6 6 7 8 9 8 8 8 8 8 8 7 7 8 8 8 8 9 8 7 7 7 6 7 7 7 6 6 5 6 7 7 7 7 7 8 8 8 8 8 8 8 8 9 9 8 9 9 9 9 9 9 10 10 10 9 9 8 8 8 8 8 9 9 10 9 8 7 8 9 10 9
4225Ij%jJ%%j%J%%JJ%%j%J%%%%%%%%J%kj%%jjJ%k%JJ%j%%%%%J%%%%%%%%%%%%%J%%jJJ%Jj%
$$ 9 8 8 7 8 8 8 7 7 8 8 8 9 10 10 10 9 9 10 10 10 10 10 10 10 10 10 11 11 9 8 8 8 7 6 7 7 5 5 6 7 7 6 6 6 6 6 6 7 7 7 7 7 7 7 7 7 7 7 7 7 7 8 8 8 7 8 9 9 10 9 9
4214I%j%jj%K%%%%%%%j%%%%j%J%%%J%%%jJ%%%%%j%J%%%Jj%%%%%%%J%%j%%j%jJ%%%j%J%%%%
$$ 9 9 8 8 7 6 6 8 8 8 8 8 8 8 8 7 7 7 7 7 6 6 7 7 7 7 8 8 8 8 7 8 8 8 8 8 8 7 7 8 8 8 8 9 8 8 8 8 8 8 8 8 9 9 9 8 8 8 7 7 6 7 7 7 7 6 6 7 7 7 7 7
4204G%%jJ%%%%Jjj%jJ%%%J%Jj%J%%j%%j%jJ%JJJj%%j%Jjj%%%JJ%%%Jj%%%%jJ%j%%%%%%%%j
$$ 7 7 7 6 7 7 7 7 7 8 7 6 6 5 6 6 6 6 7 7 8 7 7 8 8 8 7 7 7 6 6 5 6 6 7 8 9 8 8 8 7 7 8 7 6 6 6 6 7 8 8 8 8 9 8 8 8 8 8 7 8 8 7 7 7 7 7 7 7 7 7 6
4193F%%JJj%%%%%%J%%j%j%J%J%%%j%%%%Jj%%j%%JJjJ%%Jj%%jjJ%%%%J%%j%%%%%jJ%%%jJ%%
$$ 6 6 6 7 8 7 7 7 7 7 7 7 8 8 8 7 7 6 6 7 7 8 8 8 8 7 7 7 7 7 8 7 7 7 6 6 6 7 8 7 8 8 8 9 8 8 8 7 6 7 7 7 7 7 8 8 8 7 7 7 7 7 7 6 7 7 7 7 6 7 7 7
4182GJ%%%j%J%%%%j%%J%%%%j%%J%J%%%%%jj%%Jj%J%%%%J%%k%JJJ%j%%jJ%%j%J%%J%jjj%JJ
$$ 7 8 8 8 8 7 7 8 8 8 8 8 7 7 7 8 8 8 8 8 7 7 7 8 8 9 9 9 9 9 9 8 7 7 7 8 7 7 8 8 8 8 8 9 9 9 7 7 8 9 10 10 9 9 9 8 9 9 9 8 8 9 9 9 10 10 9 8 7 7 8 9
4171I%%%%jjjJJJJj%%%%j%%%jJ%%JJj%%Jj%%%%J%j%%jJ%Jj%%%%j%jJ%J%J%%%%%%%%%%j%J%
$$ 9 9 9 9 9 8 7 6 7 8 9 10 9 9 9 9 9 8 8 8 8 7 8 8 8 9 10 9 9 9 10 9 9 9 9 9 10 10 9 9 9 8 9 9 10 9 9 9 9 9 8 8 7 8 8 9 9 10 10 10 10 10 10 10 10 10 10 10 9 9 10 10
4160A0%%jJ%%%%j%%J%%%jJ%k%%%%%J%J%%%%%%jjJ%%%Jj%%%%%%%%jjJ%%%J%%%%%%JkJ%Jjjj
$$ 10 10 10 9 10 10 10 10 10 9 9 9 10 10 10 10 9 10 10 8 8 8 8 8 8 9 9 10 10 10 10 10 10 10 9 8 9 9 9 9 10 9 9 9 9 9 9 9 9 9 8 7 8 8 8 8 9 9 9 9 9 9 9 10 8 9 9 10 9 8 7
4150GjJJ%jJ%JJJj%%j%%%%%J%%j%Jjj%%J%%Jj%JJ%Jj%%j%j%%%J%Jj%jKj%%%%%%J%%J%%j%j
$$ 7 6 7 8 8 7 8 8 9 10 11 10 10 10 9 9 9 9 9 9 10 10 10 9 9 10 9 8 8 8 9 9 9 10 9 9 10 11 11 12 11 11 11 10 10 9 9 9 9 10 10 11 10 10 9 11 10 10 10 10 10 10 10 11 11 11 12 12 12 11 11 10
4139A0j%KJj%%j%%%%%%%%J%j%%%%J%jkJ%J%J%%%jJJ%k%jJJJj%%j%%%%%%%j%JjJ%J%%j%J%%
$$ 10 9 9 11 12 11 11 11 10 10 10 10 10 10 10 10 10 11 11 10 10 10 10 10 11 11 10 8 9 9 10 10 11 11 11 11 10 11 12 12 10 10 9 10 11 12 11 11 11 10 10 10 10 10 10 10 10 9 9 10 9 10 10 11 11 11 10 10 11 11 11
4128A1%%%%kjJJ%%%J%J%jjJJ%%j%J%%%J%%%%%j%%%jJ%%%%j%%%%%J%jJ%%j%J%%%%%%j%J%%j
$$ 11 11 11 11 11 9 8 9 10 10 10 10 11 11 12 12 11 10 11 12 12 12 11 11 12 12 12 12 13 13 13 13 13 13 12 12 12 12 11 12 12 12 12 12 11 11 11 11 11 11 12 12 11 12 12 12 11 11 12 12 12 12 12 12 12 11 11 12 12 12 11
4117A1%JJ%%jJ%%j%%%%%%%J%j%%jJJJjkJJ%%%%%%%j%%%%%jJ%%%Jj%%J%J%%%%%J%%%%%%%%%
$$ 11 11 12 13 13 13 12 13 13 13 12 12 12 12 12 12 12 12 13 13 12 12 12 11 12 13 14 13 11 12 13 13 13 13 13 13 13 13 12 12 12 12 12 12 11 12 12 12 12 13 12 12 12 13 13 14 14 14 14 14 14 15 15 15 15 15 15 15 15 15 15
4107A5%%%J%jJ%%Jj%kj%J%%J%%Jj%%%JJ%jJ%J%%jj%%%%jJJj%%%%%%%J%%J%JjjJ%%%%%Jj%J
$$ 15 15 15 15 16 16 15 16 16 16 17 16 16 14 13 13 14 14 14 15 15 15 16 15 15 15 15 16 17 17 16 17 17 18 18 18 17 16 16 16 16 16 15 16 17 16 16 16 16 16 16 16 16 17 17 17 18 18 19 18 17 18 18 18 18 18 18 19 18 18 19
4096A9%%%%%%%JKj%J%Jj%%J%J%%J%%J%J%j%%KK%JJK%JJKJJKJJ%JJKKKKJJKKKJKKLLLLKKMM
$$ 19 19 19 19 19 19 19 19 20 22 21 21 22 22 23 22 22 22 23 23 24 24 24 25 25 25 26 26 27 27 26 26 26 28 30 30 31 32 34 34 35 36 38 39 40 42 43 44 44 45 46 48 50 52 54 55 56 58 60 62 63 65 67 70 73 76 79 81 83 87 91
4085I1NMMMMONMONNMNMMJlprj0pomlkjjjklkkjjk%j%%%%%JJJKJKJJJJJJ%%jj%jjkjkllnml
$$ 91 96 100 104 108 112 118 123 127 133 138 143 147 152 156 160 161 158 151 142 132 125 119 115 112 110 109 108 107 105 102 100 98 97 96 94 94 93 93 93 93 93 93 94 95 96 98 99 101 102 103 104 105 106 107 107 107 106 105 105 104 103 101 100 98 95 92 87 83 80
4075H0mkmllmlllkklkkkjk%%j%jjj%%%j%%Jjj%%%%%%%%%%%%%%%j%j%J%J%%J%%%%Jjj%%JJ%
$$ 80 76 74 70 67 64 60 57 54 51 49 47 44 42 40 38 37 35 35 35 34 34 33 32 31 31 31 31 30 30 30 31 30 29 29 29 29 29 29 29 29 29 29 29 29 29 29 29 29 28 28 27 27 28 28 29 29 29 30 30 30 30 30 31 30 29 29 29 30 31 31
4064C1%jj%%%%%JJjj%J%%%%jJJ%%%%%%%%%j%KJJj%%J%%%J%Jj%JJJJJ%%jJ%J%%J%%JJ%J%jJ
$$ 31 31 30 29 29 29 29 29 29 30 31 30 29 29 30 30 30 30 30 29 30 31 31 31 31 31 31 31 31 31 31 30 30 32 33 34 33 33 33 34 34 34 34 35 35 36 35 35 36 37 38 39 40 40 40 39 40 40 41 41 41 42 42 42 43 44 44 45 45 44 45
4053D5%JJJJ%%JJ%J%%JKj%JJ%jJJJJ%J%%J%J%%%%%%%%%J%%%%JJJj%J%JJ%J%j%J%%%JJj%%%
$$ 45 45 46 47 48 49 49 49 50 51 51 52 52 52 53 55 54 54 55 56 56 55 56 57 58 59 59 60 60 60 61 61 62 62 62 62 62 62 62 62 62 62 63 63 63 63 63 64 65 66 65 65 66 66 67 68 68 69 69 68 68 69 69 69 69 70 71 70 70 70 70
4043G0%%%j%jJJ%%jjjJ%%jJj%%%J%%J%%%%jJ%j%%%Jjj%JJ%%%%%J%%%%j%J%KJ%J%JjJ%j%%%
$$ 70 70 70 70 69 69 68 69 70 70 70 69 68 67 68 68 68 67 68 67 67 67 67 68 68 68 69 69 69 69 69 68 69 69 68 68 68 68 69 68 67 67 68 69 69 69 69 69 69 70 70 70 70 70 69 69 70 70 72 73 73 74 74 75 74 75 75 74 74 74 74
4032G4%%JKK%%%J%J%JJKJKJJ%%%KJ%JJKJLJ%JJKJKJJJKJJJJJKJJLKKJJLKJKKLLKKLLLLKLL
$$ 74 74 74 75 77 79 79 79 79 80 80 81 81 82 83 85 86 88 89 90 90 90 90 92 93 93 94 95 97 98 101 102 102 103 104 106 107 109 110 111 112 114 115 116 117 118 119 121 122 123 126 128 130 131 132 135 137 138 140 142 145 148 150 152 155 158 161 164 166 169 172
4021A72LLLLMLLLNLNNNMNOOOPQPPPQRRJ0RJ1J2J3J3J5J6J5J8J7K1K0K1K2K6K7K8K8L1L3L6
$$ 172 175 178 181 184 188 191 194 197 202 205 210 215 220 224 229 235 241 247 254 262 269 276 283 291 300 309 319 328 339 351 364 377 392 408 423 441 458 479 499 520 542 568 595 623 651 682 715 751
4014G51L7M0M1M3M4M5M7M8M9N2N4N9O7P6Q5R4J03J14J24J36J50J65J79J97K15K33K53K75K99
$$ 751 788 828 869 912 956 1001 1048 1096 1145 1197 1251 1310 1377 1453 1538 1632 1735 1849 1973 2109 2259 2424 2603 2800 3015 3248 3501 3776 4075
4010D075L23L50L81M18M57M97N35N64N89O05O16O16O02N72N26M75M16L38K46J56J05J11J59
$$ 4075 4398 4748 5129 5547 6004 6501 7036 7600 8189 8794 9410 10026 10628 11200 11726 12201 12617 12955 13201 13357 13462 13573 13732
4006A3732K17K58K63K26J52N1p1k00l32m43n01m85m02k79j48l1N5J09J43J67J90K21K53K81
$$ 13732 13949 14207 14470 14696 14848 14899 14828 14628 14296 13853 13352 12867 12465 12186 12038 12007 12062 12171 12314 12481 12671 12892 13145 13426
4002A3426K95K86K50J87J14N4K4K3L6M7L2j9q6j48j91k16k16j87j38r5o9o5o3n1l4k3l7q0
$$ 13426 13721 14007 14257 14444 14558 14612 14636 14659 14695 14742 14774 14755 14669 14521 14330 14114 13898 13711 13573 13478 13409 13344 13281 13230 13196 13173 13136 13056
3998A3056j39k06k69l22l85m68n79o89p63p83p49o78n93n11m48m10l98l98l91l68l30k87k44
$$ 13056 12917 12711 12442 12120 11735 11267 10688 9999 9236 8453 7704 7026 6433 5922 5474 5064 4666 4268 3877 3509 3179 2892 2648
3995B648k05j76j56j40j30j19j07r5q3p1o2n5n1n0m9m5m5m5m6m5m4m2l7l2l0k9k6k7k6k4k2
$$ 2648 2443 2267 2111 1971 1841 1722 1615 1520 1437 1366 1304 1249 1198 1148 1099 1054 1009 964 918 873 829 787 750 718 688 659 633 606 580 556 534
3990E34k1j8j9j7j8j6j7j9j8j9j7j5j5j4j2j1j1j0j0rrqoooonnnmmlnnklmllllkllklljjj
$$ 534 513 495 476 459 441 425 408 389 371 352 335 320 305 291 279 268 257 247 237 228 219 211 205 199 193 187 182 177 172 168 164 161 156 151 149 146 142 139 136 133 130 128 125 122 120 117 114 113 112 111
3982A11klkjkkkjjjjkkjkjjj%%jjkjj%%jkj%jk%%jjjj%%jjjkjJ%j%%%%j%Jj%j%%%%j%%j%%
$$ 111 109 106 104 103 101 99 97 96 95 94 93 91 89 88 86 85 84 83 83 83 82 81 79 78 77 77 77 76 74 73 73 72 70 70 70 69 68 67 66 66 66 65 64 63 61 60 61 61 60 60 60 60 60 59 59 60 59 59 58 58 58 58 58 57 57 57 56 56 56
3972E6%%J%%%%j%j%%%j%j%j%j%%jjj%%%%Jj%jjJ%%j%jKJ%%%JJ%%J%%%J%%%J%%jjJJj%j%jj
$$ 56 56 56 57 57 57 57 57 56 56 55 55 55 55 54 54 53 53 52 52 51 51 51 50 49 48 48 48 48 48 49 48 48 47 46 47 47 47 46 46 45 47 48 48 48 48 49 50 50 50 51 51 51 51 52 52 52 52 53 53 53 52 51 52 53 52 52 51 51 50 49
3961D9%jJ%%%%%j%%%jj%%%J%j%j%%%%%%%%j%J%j%%%j%%Jkj%j%J%j%j%j%Jj%%%j%jjj%%%%j
$$ 49 49 48 49 49 49 49 49 49 48 48 48 48 47 46 46 46 46 47 47 46 46 45 45 45 45 45 45 45 45 45 44 44 45 45 44 44 44 44 43 43 43 44 42 41 41 40 40 41 41 40 40 39 39 38 38 39 38 38 38 38 37 37 36 35 34 34 34 34 34 33
3950C3jj%j%%j%%%%jJ%j%%%jj%%%kjJ%%j%%J%%%%j%%j%%JJj%j%j%jjJJjj%J%%%%%%%%%%%%
$$ 33 32 31 31 30 30 30 29 29 29 29 29 28 29 29 28 28 28 28 27 26 26 26 26 24 23 24 24 24 23 23 23 24 24 24 24 24 23 23 23 22 22 22 23 24 23 23 22 22 21 21 20 19 20 21 20 19 19 20 20 20 20 20 20 20 20 20 20 20 20 20
3940B0%jJJ%%JJ%J%%%%%%JJJ%%%%%jjJJ%%%%%j%jJ%%%%jJJJJ%Jj%%J%J%JLKJ%KKKJKLKKKL
$$ 20 20 19 20 21 21 21 22 23 23 24 24 24 24 24 24 24 25 26 27 27 27 27 27 27 26 25 26 27 27 27 27 27 27 26 26 25 26 26 26 26 26 25 26 27 28 29 29 30 29 29 29 30 30 31 31 32 35 37 38 38 40 42 44 45 47 50 52 54 56 59
3929E9LMKLJJKJKJK%J%J%J%J%%j%J%J%K%%%JJ%JKJJ%JK%j%%j%jjjjj%%%j%%jkjjjjkkjjjl
$$ 59 62 66 68 71 72 73 75 76 78 79 81 81 82 82 83 83 84 84 85 85 85 84 84 85 85 86 86 88 88 88 88 89 90 90 91 93 94 95 95 96 98 98 97 97 97 96 96 95 94 93 92 91 91 91 91 90 90 90 89 87 86 85 84 83 81 79 78 77 76 73
3918G3jkjkkljkkjkklmjjkkjkkk%%jjjjjkjkjj%%%j%%%j%j%%%%%%j%%j%Jjj%Jj%jJJJj%%J
$$ 73 72 70 69 67 65 62 61 59 57 56 54 52 49 45 44 43 41 39 38 36 34 32 32 32 31 30 29 28 27 25 24 22 21 20 20 20 20 19 19 19 19 18 18 17 17 17 17 17 17 17 16 16 16 15 15 16 15 14 14 15 14 14 13 14 15 16 15 15 15 16
3908A6j%jJj%%J%%j%%%%%%%Jj%J%%jjJJ%J%Jkj%%%Jj%%%J%%j%%%%%%%%%%JJ%%%Jj%jj%JJ%
$$ 16 15 15 14 15 14 14 14 15 15 15 14 14 14 14 14 14 14 14 15 14 14 15 15 15 14 13 14 15 15 16 16 17 15 14 14 14 14 15 14 14 14 14 15 15 15 14 14 14 14 14 14 14 14 14 14 14 15 16 16 16 16 17 16 16 15 14 14 15 16 16
3897A6j%%J%%j%J%%j%%%Jj%J%j%%J%jKj%j%%%%%Jj%J%Jjj%J%%%j%%J%J%%j%%J%%%Jj%%%%%
$$ 16 15 15 15 16 16 16 15 15 16 16 16 15 15 15 15 16 15 15 16 16 15 15 15 16 16 15 17 16 16 15 15 15 15 15 15 16 15 15 16 16 17 16 15 15 16 16 16 16 15 15 15 16 16 17 17 17 16 16 16 17 17 17 17 18 17 17 17 17 17 17
3886A7%%%%%J%%%J%jJ%jJ%kJJ%j%j%j%%JJ%%%JJjjjJ%%jjJ%%Kj%j%%JjJ%j%%J%jj%%%%%%J
$$ 17 17 17 17 17 17 18 18 18 18 19 19 18 19 19 18 19 19 17 18 19 19 18 18 17 17 16 16 16 17 18 18 18 18 19 20 19 18 17 18 18 18 17 16 17 17 17 19 18 18 17 17 17 18 17 18 18 17 17 17 18 18 17 16 16 16 16 16 16 16 17
3876A7Jjj%jj%jJK%%%%j%%J%JkJ%%%jJ%j%%Jjj%%J%J%%j%%%j%%%%%%%%JjJ%%Jj%%%j%%%%%
$$ 17 18 17 16 16 15 14 14 13 14 16 16 16 16 16 15 15 15 16 16 17 15 16 16 16 16 15 16 16 15 15 15 16 15 14 14 14 15 15 16 16 16 15 15 15 15 14 14 14 14 14 14 14 14 14 15 14 15 15 15 16 15 15 15 15 14 14 14 14 14 14
3865A4J%%%jjJJ%%%jJJ%%%%jj%%JjJJ%%jj%%J%%J%%J%%%%%j%%J%k%%JJJj%j%%%jJ%jj%J%%
$$ 14 15 15 15 15 14 13 14 15 15 15 15 14 15 16 16 16 16 16 15 14 14 14 15 14 15 16 16 16 15 14 14 14 15 15 15 16 16 16 17 17 17 17 17 17 16 16 16 17 17 15 15 15 16 17 18 17 17 16 16 16 16 15 16 16 15 14 14 15 15 15
3854A5%%jj%J%J%%%%J%%J%%%J%%%%%j%JJj%J%JjjjJJ%%%%jJ%%%j%J%JJ%Jjk%%%%%J%J%J%%
$$ 15 15 15 14 13 13 14 14 15 15 15 15 15 16 16 16 17 17 17 17 18 18 18 18 18 18 17 17 18 19 18 18 19 19 20 19 18 17 18 19 19 19 19 19 18 19 19 19 19 18 18 19 19 20 21 21 22 21 19 19 19 19 19 19 20 20 21 21 22 22 22
3844B2%J%%JJ%J%J%j%%%j%%J%%%J%jjj%%%%KJ%%%%%%%%%J%J%j%JJJ%JjJJJ%JJ%%JJ%J%jJ%
$$ 22 22 23 23 23 24 25 25 26 26 27 27 26 26 26 26 25 25 25 26 26 26 26 27 27 26 25 24 24 24 24 24 26 27 27 27 27 27 27 27 27 27 27 28 28 29 29 28 28 29 30 31 31 32 31 32 33 34 34 35 36 36 36 37 38 38 39 39 38 39 39
3833C9jJKj%%j%jj%j%%j%j%%j%%J%j%%JJ%%JJJJJJJJJJ%%J%%JKJ%%J%%j%kjj%j%%Jkjkjjj
$$ 39 38 39 41 40 40 40 39 39 38 37 37 36 36 36 35 35 34 34 34 33 33 33 34 34 33 33 33 34 35 35 35 36 37 38 39 40 41 42 43 44 45 45 45 46 46 46 47 49 50 50 50 51 51 51 50 50 48 47 46 46 45 45 45 46 44 43 41 40 39 38
3822C8J%%%jJJj%jJ%%%JJJJ%JLJJJJJKJJJKKJKJKKK%%%%%%JKjk%j%jJ%%%jjjJ%%%%JJLKLK
$$ 38 39 39 39 39 38 39 40 39 39 38 39 39 39 39 40 41 42 43 43 44 47 48 49 50 51 52 54 55 56 57 59 61 62 64 65 67 69 71 71 71 71 71 71 71 72 74 73 71 71 70 70 69 70 70 70 70 69 68 67 68 68 68 68 68 69 70 73 75 78 80
3812H0LKMMNMMMMMMLKJJ%J%KKKJKKKJ%%j%jjkjj%kjlmmmllkj%JJKKJLLJKLLNNNMKL%%%jkl
$$ 80 83 85 89 93 98 102 106 110 114 118 122 125 127 128 129 129 130 130 132 134 136 137 139 141 143 144 144 144 143 143 142 141 139 138 137 137 135 134 131 127 123 119 116 113 111 110 110 111 112 114 116 117 120 123 124 126 129 132 137 142 147 151 153 156 156 156 156 155 153 150
3801A50klklmmmlljlllklkkkkljlklkjjjjjJJjj%j%%J%J%JJj%j%kjlllmlljkkkj%j%%%jjJ
$$ 150 148 145 143 140 136 132 128 125 122 121 118 115 112 110 107 105 103 101 99 96 95 92 90 87 85 84 83 82 81 80 81 82 81 80 80 79 79 79 80 80 81 81 82 83 82 82 81 81 79 78 75 72 69 65 62 59 58 56 54 52 51 51 50 50 50 50 49 48 49
3790D9J%%%%j%j%%J%jjj%J%%%j%%j%JJj%%%J%%%JJ%%J%JJJ%%%%%JJ%JJ%%%JJ%J%%J%%%%%%
$$ 49 50 50 50 50 50 49 49 48 48 48 49 49 48 47 46 46 47 47 47 47 46 46 46 45 45 46 47 46 46 46 46 47 47 47 47 48 49 49 49 50 50 51 52 53 53 53 53 53 53 54 55 55 56 57 57 57 57 58 59 59 60 60 60 61 61 61 61 61 61 61
3780F1j%%%%J%J%j%%KJ%JJj%%JJKJJ%%JJ%jJJ%JjjJ%%J%%J%%jJ%%%J%%Jj%%%%j%J%J%JJj%
$$ 61 60 60 60 60 60 61 61 62 62 61 61 61 63 64 64 65 66 65 65 65 66 67 69 70 71 71 71 72 73 73 72 73 74 74 75 74 73 74 74 74 75 75 75 76 76 76 75 76 76 76 76 77 77 77 78 77 77 77 77 77 76 76 77 77 78 78 79 80 79 79
3769G9KJj%JJ%%JJ%%jJJJJ%J%%JJ%J%%JKJK%%JLJJJ%KKJJKJKKJKJKJJJJKKKJKLMLLMONNQP
$$ 79 81 82 81 81 82 83 83 83 84 85 85 85 84 85 86 87 88 88 89 89 89 90 91 91 92 92 92 93 95 96 98 98 98 99 102 103 104 105 105 107 109 110 111 113 114 116 118 119 121 122 124 125 126 127 128 130 132 134 135 137 140 144 147 150 154 160 165 170 178 185
3758A85PQQJ0RJ0J1J2J2J5J5J8K0K1K4K7L1L6M5N4O2P1Q0Q7R2R7J02J11J19J30J45J59J66
$$ 185 192 200 208 218 227 237 248 260 272 287 302 320 340 361 385 412 443 479 524 578 640 711 791 878 970 1067 1169 1280 1399 1529 1674 1833 1999
3753A999J53J11L2o0j22j31j04o1j6K3N0O0M6lq8j78k25k20j84j40r7o4m3k5j2lOJ4K1K9L7
$$ 1999 2152 2263 2295 2235 2113 1982 1878 1817 1801 1824 1874 1934 1980 1977 1889 1711 1486 1266 1082 942 845 781 738 713 701 698 704 718 739 768 805
3749H05M7N7O9Q3R5J06J14J24J34J47J62J82K07K32K52K54K23J53N8j5k9NO5J27J74J87J52
$$ 805 852 909 978 1061 1156 1262 1376 1500 1634 1781 1943 2125 2332 2564 2816 3070 3293 3446 3504 3489 3460 3465 3530 3657 3831 4018 4170
3744D170N9p0j99k93l22k85k13j33o4k3k0o1j41k21k51k29j82j28q5n0k8qLJ3J9L0M0N1O4
$$ 4170 4229 4159 3960 3667 3345 3060 2847 2714 2650 2627 2607 2546 2405 2184 1933 1704 1522 1394 1309 1259 1231 1223 1226 1239 1258 1288 1328 1379 1443
3740A443P4Q5R2R4R0Q5Q2Q7R6J10J28J49J72J95K07J95J43M4p5j56j70j32p3j0M4Q6J14J14
$$ 1443 1517 1602 1694 1788 1878 1963 2045 2132 2228 2338 2466 2615 2787 2982 3189 3384 3527 3571 3496 3340 3170 3038 2965 2955 2999 3085 3199 3313
3736C313P7Np8j18j00m6J9Q2J36J82K26K66L01L29L47L46L30L05K85K86L14L59M11M56M93
$$ 3313 3390 3395 3317 3199 3099 3053 3072 3154 3290 3472 3698 3964 4265 4594 4941 5287 5617 5922 6207 6493 6807 7166 7577 8033 8526
3732H526N19N41N66O04O45O76P05P44Q10R10J047J204J367J533J699J850J953J960J823J517
$$ 8526 9045 9586 10152 10756 11401 12077 12782 13526 14336 15246 16293 17497 18864 20397 22096 23946 25899 27859 29682 31199
3729C1199J060N08n0n04p53p66n88k97N0L61N34M70J31m36j106j718k149k362k373k191j844
$$ 31199 32259 32767 32717 32213 31460 30694 30106 29809 29859 30220 30754 31224 31355 30919 29813 28095 25946 23584 21211 19020 17176
3726A7176j413r75n64k05R9L51N54P08Q06Q38P96O85N22L47J81K7j12k29l30m12m42l94k92
$$ 17176 15763 14788 14224 14019 14118 14469 15023 15731 16537 17375 18171 18856 19378 19725 19906 19933 19821 19592 19262 18850 18408 18014 17722
3722A7722k03j93k99n13p76j017j209j322j315j203j047q89p45o21n06l94k85j86r5j6M7Q8
$$ 17722 17519 17326 17027 16514 15738 14721 13512 12190 10875 9672 8625 7736 6991 6370 5864 5470 5185 4999 4904 4888 4935 5023
3719E023R6O9J3n6j04j13r0o0m4o7j40k47l39l83l86l59l07k45j85j33r0n4k7kJ7L4M7N1M7
$$ 5023 5119 5188 5201 5145 5041 4928 4838 4778 4734 4667 4527 4280 3941 3558 3172 2813 2506 2261 2076 1943 1853 1799 1772 1770 1787 1821 1868 1919 1966
3714A966L2J1qk2l3m3n6o5o6n8n2n4o9r5j18j29j27j15j00q2o4m9l6k9k4k0k1k3k5k9k9k7
$$ 1966 1998 2009 2001 1979 1946 1903 1847 1782 1716 1658 1606 1552 1483 1388 1270 1141 1014 899 799 717 653 604 568 539 515 495 474 451 426 397 368 341
3710C41k3j8j6j4j1j1rqrqqnnnllkjlkjjkkjlnoponllmlkllklkkkkkkjjj%jjj%j%jlk%jjJ
$$ 341 318 300 284 270 259 248 239 231 222 214 206 201 196 191 188 185 183 182 179 177 176 175 173 171 170 167 162 156 149 143 138 135 132 128 125 123 120 117 115 112 110 108 106 104 102 100 99 98 97 97 96 95 94 94 93 93 92 89 87 87 86 85 86
3700H6kj%jj%jjj%%%%j%jj%jj%%Jj%Jj%%%%k%j%jjjj%%%%jjk%j%%j%%%j%%jjJ%Jj%j%%%j%
$$ 86 84 83 83 82 81 81 80 79 78 78 78 78 78 77 77 76 75 75 74 73 73 73 74 73 73 74 73 73 73 73 73 71 71 70 70 69 68 67 66 66 66 66 66 65 64 62 62 61 61 61 60 60 60 60 59 59 59 58 57 58 58 59 58 58 57 57 57 57 56 56
3689E6kkjjkkjkj%j%jjj%%j%%%%%%jk%%%jJJj%JJ%J%%j%%%jjj%jj%%jJj%j%%Jjj%jJ%%jjK
$$ 56 54 52 51 50 48 46 45 43 42 42 41 41 40 39 38 38 38 37 37 37 37 37 37 37 36 34 34 34 34 33 34 35 34 34 35 36 36 37 37 37 36 36 36 36 35 34 33 33 32 31 31 31 30 31 30 30 29 29 29 30 29 28 28 27 28 28 28 27 26 28
3679B8J%%j%Jjj%%%%%j%%j%%%%%%%%%%%%%%%JJ%Jj%JJ%%%K%%%%J%%%J%%%%j%j%%%J%%%j%%
$$ 28 29 29 29 28 28 29 28 27 27 27 27 27 27 26 26 26 25 25 25 25 25 25 25 25 25 25 25 25 25 25 25 25 26 27 27 28 27 27 28 29 29 29 29 31 31 31 31 31 32 32 32 32 33 33 33 33 33 32 32 31 31 31 31 32 32 32 32 31 31 31
3668C1jj%%j%jJ%%jJJJ%J%J%KKJ%j%JJJKJKJJJ%%%KJ%%%jj%jjj%%%%J%J%J%JKJJKJLKKKKK
$$ 31 30 29 29 29 28 28 27 28 28 28 27 28 29 30 30 31 31 32 32 34 36 37 37 36 36 37 38 39 41 42 44 45 46 47 47 47 47 49 50 50 50 50 49 48 48 47 46 45 45 45 45 45 46 46 47 47 48 48 49 51 52 53 55 56 59 61 63 65 67 69
3657F9%%%JJJ%%Jj%%J%%J%%%%jKJJLLLLMLLLMMLMKJKKKKL%KKKJJ%jkllonnllmkl%%JJJKKK
$$ 69 69 69 69 70 71 72 72 72 73 72 72 72 73 73 73 74 74 74 74 74 73 75 76 77 80 83 86 89 93 96 99 102 106 110 113 117 119 120 122 124 126 128 131 131 133 135 137 138 139 139 138 136 133 130 124 119 114 111 108 104 102 99 99 99 100 101 102 104 106 108
3646A08LLLMLKLLLLLLLKJK%j%kjkkllkllklllnmonlmkklj%%%jjJJ%JJ%%%j%j%JJ%%Jjj%%J
$$ 108 111 114 117 121 124 126 129 132 135 138 141 144 147 149 150 152 152 151 151 149 148 146 144 141 138 136 133 130 128 125 122 119 114 110 104 99 96 92 90 88 85 84 84 84 84 83 82 83 84 84 85 86 86 86 86 85 85 84 84 85 86 86 86 87 86 85 85 85 86
3636H6%JJJ%kjkj%%K%JLLOOPQRJ1J0J2J4J7K1K7L6M4N2N9O4O6O7O6P0P7Q4R8J17J31J25P9
$$ 86 86 87 88 89 89 87 86 84 83 83 83 85 85 86 89 92 98 104 111 119 128 139 149 161 175 192 213 240 276 320 372 431 495 561 628 694 764 841 925 1023 1140 1271 1396 1475
3629A475l2j84k68k55k04j43r4o3m1k9k1j7j3j1rpnnnmlmllkjkkkkjk%j%%J%JjjjkKk%jk%
$$ 1475 1443 1259 991 736 532 389 295 232 191 162 141 124 111 100 91 84 79 74 69 65 62 58 55 52 50 49 47 45 43 41 40 38 38 37 37 37 38 38 39 38 37 36 34 36 34 34 33 31 31
3622C1j%%%%%j%jj%jjjjj%%jj%%%j%j%%%jJJj%%%j%j%%%%%j%%%jJ%Jj%kJ%j%%%j%Jj%%%%%
$$ 31 30 30 30 30 30 30 29 29 28 27 27 26 25 24 23 22 22 22 21 20 20 20 20 19 19 18 18 18 18 17 18 19 18 18 18 18 17 17 16 16 16 16 16 16 15 15 15 15 14 15 15 16 15 15 13 14 14 13 13 13 13 12 12 13 12 12 12 12 12 12
3611A2%j%j%J%%%%j%jjj%%%K%%j%%JjJ%Jj%%%Jj%j%%J%%%%Jjj%J%%jjj%%J%%Jj%%j%jJ%J%
$$ 12 12 11 11 10 10 11 11 11 11 11 10 10 9 8 7 7 7 7 9 9 9 8 8 8 9 8 9 9 10 9 9 9 9 10 9 9 8 8 8 9 9 9 9 9 10 9 8 8 9 9 9 8 7 6 6 6 7 7 7 8 7 7 7 6 6 5 6 6 7 7
3600GJj%%j%%Jjj%Jj%%%%J%%jJ%j%%JJ%%k%%%JJ%%%j%j%%%%%%%%j%%%J%%%%JjjJ%%%%jjJ%
$$ 7 8 7 7 7 6 6 6 7 6 5 5 6 5 5 5 5 5 6 6 6 5 6 6 5 5 5 6 7 7 7 5 5 5 5 6 7 7 7 7 6 6 5 5 5 5 5 5 5 5 5 4 4 4 4 5 5 5 5 5 6 5 4 5 5 5 5 5 4 3 4 4
3590D%J%%jJJJ%%j%%jJ%j%%%J%%%%jjJ%%%%%J%%%j%%j%JJj%%j%j%%%%%JJ%%%J%%jjJ%%%%%
$$ 4 4 5 5 5 4 5 6 7 7 7 6 6 6 5 6 6 5 5 5 5 6 6 6 6 6 5 4 5 5 5 5 5 5 6 6 6 6 5 5 5 4 4 5 6 5 5 5 4 4 3 3 3 3 3 3 4 5 5 5 5 6 6 6 5 4 5 5 5 5 5 5
3579E%Jj%jJ%J%j%%%j%%%%%j%Jj%J%%jJ%%Jjj%%J%%%%j%J%%%%JJj%%%jjjJ%%%J%j%J%%%jJ
$$ 5 5 6 5 5 4 5 5 6 6 5 5 5 5 4 4 4 4 4 4 3 3 4 3 3 4 4 4 3 4 4 4 5 4 3 3 3 4 4 4 4 4 3 3 4 4 4 4 4 5 6 5 5 5 5 4 3 2 3 3 3 3 4 4 3 3 4 4 4 4 3 4
3568D%%%%%%%j%%Jj%%Jj%J%jJJ%%j%j%%J%%J%%jj%jJJj%%%%%%%%%%JJ%%%%j%%j%%Jj%j%%J
$$ 4 4 4 4 4 4 4 4 3 3 3 4 3 3 3 4 3 3 4 4 3 4 5 5 5 4 4 3 3 3 4 4 4 5 5 5 4 3 3 2 3 4 3 3 3 3 3 3 3 3 3 3 3 4 5 5 5 5 5 4 4 4 3 3 3 4 3 3 2 2 2 3
3557C%%%Jj%j%%%%J%J%%j%%%%%J%%j%%%J%j%%J%%j%%JJ%jJ%%%j%%%%%%%%%%%%J%%%%%%%%%
$$ 3 3 3 3 4 3 3 2 2 2 2 2 3 3 4 4 4 3 3 3 3 3 3 4 4 4 3 3 3 3 4 4 3 3 3 4 4 4 3 3 3 4 5 5 4 5 5 5 5 4 4 4 4 4 4 4 4 4 4 4 4 4 5 5 5 5 5 5 5 5 5 5
3546Ej%%J%%%%Jj%j%J%%%%%%%J%jj%Jj%jJ%%J%%J%%%jj%J%%%%j%j%J%%%%%%%%%%%jJ%Jjj%
$$ 5 4 4 4 5 5 5 5 5 6 5 5 4 4 5 5 5 5 5 5 5 5 6 6 5 4 4 5 4 4 3 4 4 4 5 5 5 6 6 6 6 5 4 4 5 5 5 5 5 4 4 3 3 4 4 4 4 4 4 4 4 4 4 4 4 3 4 4 5 4 3 3
3535CKj%%%JJjj%J%J%J%jj%%j%%%%%%%%%%JJ%j%jj%%J%%%%Jjj%%JJ%%jJjJjJJJ%jJ%J%%JJ
$$ 3 5 4 4 4 4 5 6 5 4 4 5 5 6 6 7 7 6 5 5 5 4 4 4 4 4 4 4 4 4 4 4 5 6 6 5 5 4 3 3 3 4 4 4 4 4 5 4 3 3 3 4 5 5 5 4 5 4 5 4 5 6 7 7 6 7 7 8 8 8 9 10
3525A0JJ%JJJJJ%klkkj%jj%%jJ%%%J%%JjkJ%%%%%%%%%%%jj%%%%%%%J%%%%%%%%j%%%jJ%%jJ
$$ 10 11 12 12 13 14 15 16 17 17 15 12 10 8 7 7 6 5 5 5 4 5 5 5 5 6 6 6 7 6 4 5 5 5 5 5 5 5 5 5 5 5 5 4 3 3 3 3 3 3 3 3 4 4 4 4 4 4 4 4 4 3 3 3 3 2 3 3 3 2 3
3514C%%%J%%Jj%J%%Jj%%j%%JJj%J%JKjk%%jj%JJjj%%KJ%%j%%%%%%%%%%J%%Jjj%%J%%%%%%%
$$ 3 3 3 3 4 4 4 5 4 4 5 5 5 6 5 5 5 4 4 4 5 6 5 5 6 6 7 9 8 6 6 6 5 4 4 5 6 5 4 4 4 6 7 7 7 6 6 6 6 6 6 6 6 6 6 6 7 7 7 8 7 6 6 6 7 7 7 7 7 7 7 7
3503G%%%J%%%jJ%%J%J%%%%%j%jJJ%%j%J%J%j%J%J%%%%%%%j%JJj%%%%%J%%%%%%%%J%%JJj%%
$$ 7 7 7 7 8 8 8 8 7 8 8 8 9 9 10 10 10 10 10 10 9 9 8 9 10 10 10 9 9 10 10 11 11 10 10 11 11 12 12 12 12 12 12 12 12 11 11 12 13 12 12 12 12 12 12 13 13 13 13 13 13 13 13 13 14 14 14 15 16 15 15 15
3492A5%%%JJ%%%%JJj%j%%j%%%%%%%%%J%j%%%j%%%%j%%%%%%jJ%%%J%j%%j%jj%%%JJj%%%%%J
$$ 15 15 15 15 16 17 17 17 17 17 18 19 18 18 17 17 17 16 16 16 16 16 16 16 16 16 16 17 17 16 16 16 16 15 15 15 15 15 14 14 14 14 14 14 14 13 14 14 14 14 15 15 14 14 14 13 13 12 11 11 11 11 12 13 12 12 12 12 12 12 13
3482A3%%%%jj%%%j%%jJj%J%%J%jkJ%%%%%%%%j%%%jJ%jj%%JJ%kJ%%%J%%j%%%J%%%%%Jj%j%%
$$ 13 13 13 13 13 12 11 11 11 11 10 10 10 9 10 9 9 10 10 10 11 11 10 8 9 9 9 9 9 9 9 9 9 8 8 8 8 7 8 8 7 6 6 6 7 8 8 6 7 7 7 7 8 8 8 7 7 7 7 8 8 8 8 8 8 9 8 8 7 7 7
3471GJ%J%j%JjjJ%J%J%%jJ%JJJ%JJ%JKJJ%%%j%%%j%kjjjJ%jjJ%%%J%J%%j%%JJJK%JJJKJJK
$$ 7 8 8 9 9 8 8 9 8 7 8 8 9 9 10 10 10 9 10 10 11 12 13 13 14 15 15 16 18 19 20 20 20 20 19 19 19 19 18 18 16 15 14 13 14 14 13 12 13 13 13 13 14 14 15 15 15 14 14 14 15 16 17 19 19 20 21 22 24 25 26 28
3460B8JJKJ%J%jk%%kkjkjkkjk%j%%JjJ%%%J%j%%%%J%%K%%JJJ%J%%j%jjJ%jjjjjk%jj%j%%J
$$ 28 29 30 32 33 33 34 34 33 31 31 31 29 27 26 24 23 21 19 18 16 16 15 15 15 16 15 16 16 16 16 17 17 16 16 16 16 16 17 17 17 19 19 19 20 21 22 22 23 23 23 22 22 21 20 21 21 20 19 18 17 16 14 14 13 12 12 11 11 11 12
3449A2j%%jJJjj%j%J%%%%%%%%j%%%j%J%%JjjJ%j%%%%JJjjj%%%%J%%Jjj%%J%j%%Jj%J%%%%%
$$ 12 11 11 11 10 11 12 11 10 10 9 9 10 10 10 10 10 10 10 10 10 9 9 9 9 8 8 9 9 9 10 9 8 9 9 8 8 8 8 8 9 10 9 8 7 7 7 7 7 8 8 8 9 8 7 7 7 8 8 7 7 7 8 7 7 8 8 8 8 8 8
3439HJj%j%%%%%%%%%J%j%J%Jj%jjJ%J%jJ%J%%%%j%Jj%%%%J%jj%%J%jJ%J%j%%%J%%j%%j%%%
$$ 8 9 8 8 7 7 7 7 7 7 7 7 7 7 8 8 7 7 8 8 9 8 8 7 6 7 7 8 8 7 8 8 9 9 9 9 9 8 8 9 8 8 8 8 8 9 9 8 7 7 7 8 8 7 8 8 9 9 8 8 8 8 9 9 9 8 8 8 7 7 7 7
3428GJ%jJ%%j%%%J%j%%J%%%%%j%JJ%J%%%%%%J%%jjJ%%j%j%Kj%%J%%jjJj%%jJJ%%%%%%J%%%
$$ 7 8 8 7 8 8 8 7 7 7 7 8 8 7 7 7 8 8 8 8 8 8 7 7 8 9 9 10 10 10 10 10 10 10 11 11 11 10 9 10 10 10 9 9 8 8 10 9 9 9 10 10 10 9 8 9 8 8 8 7 8 9 9 9 9 9 9 9 10 10 10 10
3417A0j%J%%%%J%jjJ%%%%%%%%%jJJj%J%J%%jj%J%%%%JJj%Jjj%%%%%J%%%%%Jj%%%%J%%j%%%
$$ 10 9 9 10 10 10 10 10 11 11 10 9 10 10 10 10 10 10 10 10 10 10 9 10 11 10 10 11 11 12 12 12 11 10 10 11 11 11 11 11 12 13 12 12 13 12 11 11 11 11 11 11 12 12 12 12 12 12 13 12 12 12 12 12 13 13 13 12 12 12 12
3406A2%%J%%%J%%%J%%%%%%J%%J%j%%%%J%j%%J%%%%JJj%%J%%jJJ%%%%JJ%%J%%J%%%%JJ%%J%
$$ 12 12 12 13 13 13 13 14 14 14 14 15 15 15 15 15 15 15 16 16 16 17 17 16 16 16 16 16 17 17 16 16 16 17 17 17 17 17 18 19 18 18 18 19 19 19 18 19 20 20 20 20 20 21 22 22 22 23 23 23 24 24 24 24 24 25 26 26 26 27 27
3396B7J%jJ%%JJ%J%%J%%KK%JJ%%JKKJJJJKJJJJJKJJJ%KKJKLKKLMNNNNOPPQJ0J1J1J3J3J5J7
$$ 27 28 28 27 28 28 28 29 30 30 31 31 31 32 32 32 34 36 36 37 38 38 38 39 41 43 44 45 46 47 49 50 51 52 53 54 56 57 58 59 59 61 63 64 66 69 71 73 76 80 85 90 95 100 106 113 120 128 138 149 160 173 186 201 218
3386B18K0J9K0K4K8L3M0M7N6O6P7Q8R6J06J15J23J35J49J65J80J97K07K04J73J07Oq6j25j10
$$ 218 238 257 277 301 329 362 402 449 505 571 648 736 832 938 1053 1176 1311 1460 1625 1805 2002 2209 2413 2586 2693 2699 2613 2488 2378
3381B378o8l5l7q8j81k59k79k47j92j38r3o0l5j7nQJ6K5L6M6N9P3Q7J04J22J39J59J78J98
$$ 2378 2310 2275 2238 2150 1969 1710 1431 1184 992 854 761 701 666 649 644 652 668 693 729 775 834 907 994 1098 1220 1359 1518 1696 1894
3377A894K21K46K70K93L15L33L32K99K33J47Q3N3L0k4j13j96k68l24l39l20l08l30l62l61
$$ 1894 2115 2361 2631 2924 3239 3572 3904 4203 4436 4583 4666 4719 4749 4725 4612 4416 4148 3824 3485 3165 2857 2527 2165 1804
3373A804l19k55j92j38r8o9m9l4k3j3nMJ5K4L4M6N8P0Q0Q8R8J07J20J36J51J67J82J92J83
$$ 1804 1485 1230 1038 900 802 733 684 650 627 614 609 613 628 652 686 732 790 860 940 1028 1126 1233 1353 1489 1640 1807 1989 2181 2364
3369B364J48P5l4j19j41j13p1m4n4j15k06k69k75k40j89j39j00p3n5m1l3k7k2j8j5j4j3j1
$$ 2364 2512 2587 2553 2434 2293 2180 2109 2065 2011 1896 1690 1421 1146 906 717 578 478 405 350 309 276 249 227 209 194 180 167 156
3365A56j1j0rrpoonnlllmllklkkkkkjkkkklkkjjk%j%j%%kjjj%%JkjkJ%%jk%Jjjk%j%%JJ%%
$$ 156 145 135 126 117 110 104 98 93 88 85 82 79 75 72 69 67 64 62 60 58 56 54 53 51 49 47 45 42 40 38 37 36 34 34 33 33 32 32 32 30 29 28 27 27 27 28 26 25 23 24 24 24 23 21 21 22 21 20 18 18 17 17 17 18 19 19 19
3354A9jjj%%%%%%%J%jj%%%%%%j%j%%j%%J%%%J%%j%JjjJ%%%%j%%j%%%jj%JKj%j%%JJ%%%%%J
$$ 19 18 17 16 16 16 16 16 16 16 16 17 17 16 15 15 15 15 15 15 15 14 14 13 13 13 12 12 12 13 13 13 13 14 14 14 13 13 14 13 12 13 13 13 13 13 12 12 12 11 11 11 11 10 9 9 10 12 11 11 10 10 10 11 12 12 12 12 12 12 13
3344A3jjJJ%Jjj%%J%%%%jJJ%%j%j%jj%%%j%%%Jj%jjJ%%%%%J%jJ%jj%%JJ%JJj%j%J%%%j%%J
$$ 13 12 11 12 13 13 14 13 12 12 12 13 13 13 13 13 12 13 14 14 14 13 13 12 12 11 10 10 10 10 9 9 9 9 10 9 9 8 7 8 8 8 8 8 8 9 9 8 9 9 8 7 7 7 8 9 9 10 11 10 10 9 9 10 10 10 10 9 9 9 10
3333A0j%J%%%j%%jjJ%Jjj%%Jjj%J%%jJ%j%%%%%%%%%%%J%%%%%%J%jjJ%J%jjJ%%J%%Jjj%%%%
$$ 10 9 9 10 10 10 10 9 9 9 8 7 8 8 9 8 7 7 7 8 7 6 6 7 7 7 6 7 7 6 6 6 6 6 6 6 6 6 6 6 6 7 7 7 7 7 7 7 8 8 7 6 7 7 8 8 7 6 7 7 7 8 8 8 9 8 7 7 7 7 7
3322GjjJJ%%%j%%J%JjjJ%%%J%jJ%j%%JJjj%j%%%JJ%%%j%J%j%Jjj%%JJJj%J%%j%%%J%%%%jj
$$ 7 6 5 6 7 7 7 7 6 6 6 7 7 8 7 6 7 7 7 7 8 8 7 8 8 7 7 7 8 9 8 7 7 6 6 6 6 7 8 8 8 8 7 7 8 8 7 7 8 7 6 6 6 7 8 9 8 8 9 9 9 8 8 8 8 9 9 9 9 9 8 7
3312GJJj%%JjJj%%J%%%%Jj%%%%%%%J%%%J%J%%JJjj%%%%JJJ%%JJKJJKJKKKJJJ%JJkjjjkjjk
$$ 7 8 9 8 8 8 9 8 9 8 8 8 9 9 9 9 9 10 9 9 9 9 9 9 9 9 10 10 10 10 11 11 12 12 12 13 14 13 12 12 12 12 12 13 14 15 15 15 16 17 19 20 21 23 24 26 28 30 31 32 33 33 34 35 33 32 31 30 28 27 26 24
3301B4jkjjk%%%j%%%%JJ%jJJ%JJJJJJJJJJJJKJJ%%%K%JJJ%%%%jj%jjk%j%jl%j%%%%%JJKJJ
$$ 24 23 21 20 19 17 17 17 17 16 16 16 16 16 17 18 18 17 18 19 19 20 21 22 23 24 25 26 27 28 29 30 31 33 34 35 35 35 35 37 37 38 39 40 40 40 40 40 39 38 38 37 36 34 34 33 33 32 29 29 28 28 28 28 28 28 29 30 32 33 34
3290C4JJKj%j%kk%jkjkkljj%jjjJ%jjj%J%%%%%J%J%JJJJ%JJJ%%j%jj%j%%kj%%jjkK%k%j%J
$$ 34 35 36 38 37 37 36 36 34 32 32 31 29 28 26 24 21 20 19 19 18 17 16 17 17 16 15 14 14 15 15 15 15 15 15 16 16 17 17 18 19 20 21 21 22 23 24 24 24 23 23 22 21 21 20 20 20 18 17 17 17 16 15 13 15 15 13 13 12 12 13
3279A3jjJ%%%%jJ%Jj%%j%JJjj%%J%%%j%%Kj%JJ%%j%%%%%%%%%%%%%%jjJJJ%%%j%%JJj%JJ%j
$$ 13 12 11 12 12 12 12 12 11 12 12 13 12 12 12 11 11 12 13 12 11 11 11 12 12 12 12 11 11 11 13 12 12 13 14 14 14 13 13 13 13 13 13 13 13 13 13 13 13 13 13 13 12 11 12 13 14 14 14 14 13 13 13 14 15 14 14 15 16 16 15
3269A5%j%j%%J%%%%%J%jJ%%jjJJ%%%%%%%jJJ%%J%%J%%%J%j%%%%%J%%%%%%%%J%J%%J%%%%%%
$$ 15 15 14 14 13 13 13 14 14 14 14 14 14 15 15 14 15 15 15 14 13 14 15 15 15 15 15 15 15 15 14 15 16 16 16 17 17 17 18 18 18 18 19 19 18 18 18 18 18 18 19 19 19 19 19 19 19 19 19 20 20 21 21 21 22 22 22 22 22 22 22
3258B2%J%J%%%J%%%jKJ%jjJ%%%%%J%J%%j%JJJ%J%%j%JJJjj%%%J%%jJJJ%j%jJj%%%jjJ%%j%
$$ 22 22 23 23 24 24 24 24 25 25 25 25 24 26 27 27 26 25 26 26 26 26 26 26 27 27 28 28 28 27 27 28 29 30 30 31 31 31 30 30 31 32 33 32 31 31 31 31 32 32 32 31 32 33 34 34 33 33 32 33 32 32 32 32 31 30 31 31 31 30 30
3247C0J%jJjj%%jJj%J%Jj%%%%%j%%%%%%%%%%%%%%JJ%%%%%%%j%%J%%%%J%%%%%%%J%J%J%%JJ
$$ 30 31 31 30 31 30 29 29 29 28 29 28 28 29 29 30 29 29 29 29 29 29 28 28 28 28 28 28 28 28 28 28 28 28 28 28 28 29 30 30 30 30 30 30 30 30 29 29 29 30 30 30 30 30 31 31 31 31 31 31 31 31 32 32 33 33 34 34 34 35 36
3237C6%%%J%%JJ%JjJK%%%%%%JJJ%%J%KJJJ%JKJJJ%KJK%JJJJJLKKKKKJKKMMMLMNNOOPQQJ0J1
$$ 36 36 36 36 37 37 37 38 39 39 40 39 40 42 42 42 42 42 42 42 43 44 45 45 45 46 46 48 49 50 51 51 52 54 55 56 57 57 59 60 62 62 63 64 65 66 67 70 72 74 76 78 80 81 83 85 89 93 97 100 104 109 114 120 126 133 141 149 159 170
3226A70J3J4J5J6J7K0K2K4K7K8L3L6L9M6N2O2P2Q6J01J15J33J52J69J92K12K33K57K80L02
$$ 170 183 197 212 228 245 265 287 311 338 366 399 435 474 520 572 634 706 792 893 1008 1141 1293 1462 1654 1866 2099 2356 2636 2938
3222B938L26L40L39L08K39J51Q8N6L3j4j00j91k73l31l46l24l05l24l61l73l40k80k15j58
$$ 2938 3264 3604 3943 4251 4490 4641 4729 4785 4818 4804 4704 4513 4240 3909 3563 3239 2934 2610 2249 1876 1536 1256 1041 883
3218H83j15q4o1m6l4k3j7j0m%NRJ2J7K2L0L7M3N3O4P8R4J10J28J47J64J84K04K27K50K72K95
$$ 883 768 684 623 577 543 520 503 493 489 489 494 503 515 532 554 584 621 664 717 781 859 953 1063 1191 1338 1502 1686 1890 2117 2367 2639 2934
3213B934L17L31L25K88K14J25O7M4K2l5j29k20k91l34l34l07k95l20l55l60l23k64k04j53
$$ 2934 3251 3582 3907 4195 4409 4534 4601 4645 4667 4632 4503 4283 3992 3658 3324 3017 2722 2402 2047 1687 1364 1100 896 743
3209G43j15q7o6n3m4l6l1k6k1k0j8j5j3j3j2j0rrppmnnmmmmlllmlllkllkjkkkkjjkk%j%jj
$$ 743 628 541 475 422 378 342 311 285 264 244 226 211 198 185 173 163 154 145 138 131 127 122 117 113 109 105 101 98 95 92 88 85 82 79 77 74 71 69 68 66 64 62 60 59 58 56 54 54 53 53 52 51
3202E1kjj%jj%Jjjj%j%%%jjj%j%k%%%%j%jjj%%jJJjj%J%j%j%%%%j%%%J%Jj%%%%%j%%j%%%%
$$ 51 49 48 47 47 46 45 45 46 45 44 43 43 42 42 42 42 41 40 39 39 38 38 36 36 36 36 36 35 35 34 33 32 32 32 31 32 33 32 31 31 32 32 31 31 30 30 30 30 30 29 29 29 29 30 30 31 30 30 30 30 30 30 29 29 29 28 28 28 28 28
3191B8%%JJj%J%%jj%%%%%%%j%JJ%%%%%jJ%%%%%%%%%%%%%%%%j%%JJ%%%%J%J%jJ%jj%%j%%J%
$$ 28 28 28 29 30 29 29 30 30 30 29 28 28 28 28 28 28 28 28 27 27 28 29 29 29 29 29 29 28 29 29 29 29 29 29 29 29 29 29 29 29 29 29 29 29 29 28 28 28 29 30 30 30 30 30 31 31 32 32 31 32 32 31 30 30 30 29 29 29 30 30
3180C0JJj%j%%%%%J%%%%j%J%%%j%J%%%J%%J%%jj%%JJ%%%%j%%%J%jjJJJ%J%jJ%%%%%%J%%%%
$$ 30 31 32 31 31 30 30 30 30 30 30 31 31 31 31 31 30 30 31 31 31 31 30 30 31 31 31 31 32 32 32 33 33 33 32 31 31 31 32 33 33 33 33 33 32 32 32 32 33 33 32 31 32 33 34 34 35 35 34 35 35 35 35 35 35 35 36 36 36 36 36
3170C6J%%J%%jJ%jJ%%%J%%%%%J%%jJ%JJ%%j%%%jKJ%%%j%%J%%%%JJJjjJJ%JJjjJKjj%K%%%j
$$ 36 37 37 37 38 38 38 37 38 38 37 38 38 38 38 39 39 39 39 39 39 40 40 40 39 40 40 41 42 42 42 41 41 41 41 40 42 43 43 43 43 42 42 42 43 43 43 43 43 44 45 46 45 44 45 46 46 47 48 47 46 47 49 48 47 47 49 49 49 49 48
3159D8%%J%%%%JJJ%J%%%J%J%%%K%jjK%J%%%Jj%KJ%%%J%%%%JJ%jJ%JJJ%J%%%J%J%K%%%%%J%
$$ 48 48 48 49 49 49 49 49 50 51 52 52 53 53 53 53 54 54 55 55 55 55 57 57 56 55 57 57 58 58 58 58 59 58 58 60 61 61 61 61 62 62 62 62 62 63 64 64 63 64 64 65 66 67 67 68 68 68 68 69 69 70 70 72 72 72 72 72 72 73 73
3148G3JJ%%KJ%jJJK%J%%%JJJJJj%K%%JK%%J%%JJ%J%JJ%J%J%J%J%JJKK%%%LJJKJJLKL%KLKJ
$$ 73 74 75 75 75 77 78 78 77 78 79 81 81 82 82 82 82 83 84 85 86 87 86 86 88 88 88 89 91 91 91 92 92 92 93 94 94 95 95 96 97 97 98 98 99 99 100 100 101 101 102 103 105 107 107 107 107 110 111 112 114 115 116 119 121 124 124 126 129 131 132
3137A32KKKK%Jj%jj%j%%jkJ%%%%%%JJ%JJJJKKKJJ%JJKJJKLLKKJLLKKNLLKLMKKJLK%J%%JJJ
$$ 132 134 136 138 140 140 141 140 140 139 138 138 137 137 137 136 134 135 135 135 135 135 135 135 136 137 137 138 139 140 141 143 145 147 148 149 149 150 151 153 154 155 157 160 163 165 167 168 171 174 176 178 183 186 189 191 194 198 200 202 203 206 208 208 209 209 209 210 211 212
3127B12%J%J%JJJKKLJKLKKKKLLLLKKKMLLLLLMLMMMLLLLMNMNKMMNMNMNNMNONOONNOOOOOPPO
$$ 212 212 213 213 214 214 215 216 217 219 221 224 225 227 230 232 234 236 238 241 244 247 250 252 254 256 260 263 266 269 272 275 279 282 286 290 294 297 300 303 306 310 315 319 324 326 330 334 339 343 348 352 357 362 366 371 377 382 388 394 399 404 410 416 422 428 434 441 448 454
3116D54POPPQQQRRRQRRQRRJ0J0J1J1J1J2J1J1J2J2J3J3J3J4J3J3J4J5J4J7J6J8J7J7J8J8J9
$$ 454 461 467 474 481 489 497 505 514 523 532 540 549 558 566 575 584 594 604 615 626 637 649 660 671 683 695 708 721 734 748 761 774 788 803 817 834 850 868 885 902 920 938 957
3110I57J9J9K0K2K1K2K2K4K4K3K6K7K7K8K7K8K9L0L1L1L2L3L3L4L7L7L8L8L9L8M0M1M2M2M3
$$ 957 976 995 1015 1037 1058 1080 1102 1126 1150 1173 1199 1226 1253 1281 1308 1336 1365 1395 1426 1457 1489 1522 1555 1589 1626 1663 1701 1739 1778 1816 1856 1897 1939 1981 2024
3105B024M3M4M5M6M5M7M8M7M7M7M7M7M7M7M7M7M6M4M4M2M1L9L9L6L5L2L1K8K6K4K1J7J5J3
$$ 2024 2067 2111 2156 2202 2247 2294 2342 2389 2436 2483 2530 2577 2624 2671 2718 2765 2811 2855 2899 2941 2982 3021 3060 3096 3131 3163 3194 3222 3248 3272 3293 3310 3325 3338
3099C338ROL%mprj2j6j9k1k4k6l0l2l4l5l9m0m2m3m3m4m6m6m6m8m8m9m8n0m7m7m7m7m7m6m7
$$ 3338 3347 3353 3356 3356 3352 3345 3336 3324 3308 3289 3268 3244 3218 3188 3156 3122 3087 3048 3008 2966 2923 2880 2836 2790 2744 2698 2650 2602 2553 2505 2455 2408 2361 2314 2267 2220 2174 2127
3094B127m5m6m3m3m2m2m1m0l8l8l7l7l7l5l4l4l4l3l2l0k9k9k8k8k7k6k5k5k4k3k3k2k2k1
$$ 2127 2082 2036 1993 1950 1908 1866 1825 1785 1747 1709 1672 1635 1598 1563 1529 1495 1461 1428 1396 1366 1337 1308 1280 1252 1225 1199 1174 1149 1125 1102 1079 1057 1035 1014
3088A014k1k0j9j9k0j9j7j8j6j7j5j4j6j4j4j3j6j3j3j2j2j2j2j2j2j0j0j1j2j0rrrqrrqq
$$ 1014 993 973 954 935 915 896 879 861 845 828 813 799 783 769 755 742 726 713 700 688 676 664 652 640 628 618 608 597 585 575 566 557 548 540 531 522 514 506
3083E06qqqrooqppopoooooonononnonnmmmmmmnnlmlnmmlklmmlmmllmkklmklkkllljkklljl
$$ 506 498 490 482 473 467 461 453 446 439 433 426 420 414 408 402 396 390 385 379 374 368 363 358 352 347 342 338 334 330 326 322 318 313 308 305 301 298 293 289 285 282 280 277 273 269 266 262 258 255 252 248 246 244 241 237 235 232 230 228 225 222 219 218 216 214 211 208 207 204
3072B04kkkkklkjjkjklkljkjkkkjjkkkjjjkjjk%kkkjjkjjk%%%kk%%kjkjj%kk%jjjj%jkjj%
$$ 204 202 200 198 196 194 191 189 188 187 185 184 182 179 177 174 173 171 170 168 166 164 163 162 160 158 156 155 154 153 151 150 149 147 147 145 143 141 140 139 137 136 135 133 133 133 133 131 129 129 129 127 126 124 123 122 122 120 118 118 117 116 115 114 114 113 111 110 109 109
3061A09%jkj%j%%j%jj%jj%%%jj%%jjj%jjjj%%%%jj%j%%%jjjjj%%%j%jj%j%j%jjjj%%%%%jj
$$ 109 109 108 106 105 105 104 104 104 103 103 102 101 101 100 99 99 99 99 98 97 97 97 96 95 94 94 93 92 91 90 90 90 90 90 89 88 88 87 87 87 87 86 85 84 83 82 82 82 82 81 81 80 79 79 78 78 77 77 76 75 74 73 73 73 73 73 73 72 71
3051G1jjj%jj%%Jj%%j%%jjj%j%jj%%%j%%%j%j%%Jjj%j%j%%Jj%j%%%%%j%jjj%%j%%%%%%jJ%
$$ 71 70 69 68 68 67 66 66 66 67 66 66 66 65 65 65 64 63 62 62 61 61 60 59 59 59 59 58 58 58 58 57 57 56 56 56 57 56 55 55 54 54 53 53 53 54 53 53 52 52 52 52 52 52 51 51 50 49 48 48 48 47 47 47 47 47 47 47 46 47 47
3040D7%%kj%j%%J%jj%%j%%Jjj%Jj%%%jj%J%%j%%%%%%%jJ%%%jj%%%%j%J%jjJ%%%%j%%%jJJj
$$ 47 47 47 45 44 44 43 43 43 44 44 43 42 42 42 41 41 41 42 41 40 40 41 40 40 40 40 39 38 38 39 39 39 38 38 38 38 38 38 38 38 37 38 38 38 38 37 36 36 36 36 36 35 35 36 36 35 34 35 35 35 35 35 34 34 34 34 33 34 35 34
3030C4%j%%%%%%%%%jj%j%j%Jj%%%%J%%jj%%%%%%%%%%%%%%%Jj%%j%%%Jj%jj%%%%J%%%jj%j%
$$ 34 34 33 33 33 33 33 33 33 33 33 33 32 31 31 30 30 29 29 30 29 29 29 29 29 30 30 30 29 28 28 28 28 28 28 28 28 28 28 28 28 28 28 28 28 29 28 28 28 27 27 27 27 28 27 27 26 25 25 25 25 25 26 26 26 26 25 24 24 23 23
3019B3J%%%%%%J%%%j%%%j%%%%Jj%%%%Jj%%%%jjjJ%J%%%%%j%%%%%j%JJ%%j%%jj%%%JJj%%%j
$$ 23 24 24 24 24 24 24 24 25 25 25 25 24 24 24 24 23 23 23 23 23 24 23 23 23 23 23 24 23 23 23 23 23 22 21 20 21 21 22 22 22 22 22 22 21 21 21 21 21 21 20 20 21 22 22 22 21 21 21 20 19 19 19 19 20 21 20 20 20 20 19
3008A9j%%%%%%%j%Jj%%%JJ%%%%jj%%J%%jJ%JJjj%%%j%j%%%%%%%%%jJ%%J%j%j%J%Jj%%jJ%%
$$ 19 18 18 18 18 18 18 18 18 17 17 18 17 17 17 17 18 19 19 19 19 19 18 17 17 17 18 18 18 17 18 18 19 20 19 18 18 18 18 17 17 16 16 16 16 16 16 16 16 16 16 15 16 16 16 17 17 16 16 15 15 16 16 17 16 16 16 15 16 16 16
2998A6j%%%%%%j%JJ%%%%%j%%%%%%%%j%%J%%%Jjj%%J%J%%%jj%%%%%%J%%%%jjj%%%%J%%%%Jj
$$ 16 15 15 15 15 15 15 15 14 14 15 16 16 16 16 16 16 15 15 15 15 15 15 15 15 15 14 14 14 15 15 15 15 16 15 14 14 14 15 15 16 16 16 16 15 14 14 14 14 14 14 14 15 15 15 15 15 14 13 12 12 12 12 12 13 13 13 13 13 14 13
2987A3%%%%%%%%%j%%%JJjj%%%j%J%J%%%jj%J%jJJjjJ%%%%jj%KJ%j%%%j%J%%j%%%%%%%jJ%J
$$ 13 13 13 13 13 13 13 13 13 13 12 12 12 12 13 14 13 12 12 12 12 11 11 12 12 13 13 13 13 12 11 11 12 12 11 12 13 12 11 12 12 12 12 12 11 10 10 12 13 13 12 12 12 12 11 11 12 12 12 11 11 11 11 11 11 11 11 10 11 11 12
2976A2j%%j%J%kJJJ%j%%%J%%%%%%%%%j%jJJj%%%%%%%%J%j%%%j%%j%J%Jj%%%%j%%JJjj%%JJ
$$ 12 11 11 11 10 10 11 11 9 10 11 12 12 11 11 11 11 12 12 12 12 12 12 12 12 12 12 11 11 10 11 12 11 11 11 11 11 11 11 11 11 12 12 11 11 11 11 10 10 10 9 9 10 10 11 10 10 10 10 10 9 9 9 10 11 10 9 9 9 10 11
2965A1j%%k%Jj%%%%%JJ%%%%%%%jj%jJ%JJj%J%j%%%%%J%%j%%J%%j%%%j%%%J%J%%%%%jj%J%%
$$ 11 10 10 10 8 8 9 8 8 8 8 8 8 9 10 10 10 10 10 10 10 10 9 8 8 7 8 8 9 10 9 9 10 10 9 9 9 9 9 9 10 10 10 9 9 9 10 10 10 9 9 9 9 8 8 8 8 9 9 10 10 10 10 10 10 9 8 8 9 9 9
2955Ijj%%%%%JJ%%%%%%j%%%%jJ%%%jjJJ%jJJ%%JjjJ%%j%%%%%JJj%j%%J%K%j%jj%%J%%%%%%
$$ 9 8 7 7 7 7 7 7 8 9 9 9 9 9 9 9 8 8 8 8 8 7 8 8 8 8 7 6 7 8 8 7 8 9 9 9 10 9 8 9 9 9 8 8 8 8 8 8 9 10 9 9 8 8 8 9 9 11 11 10 10 9 8 8 8 9 9 9 9 9 9 9
2944I%%%%JJ%j%%%J%Jj%%%%%%%jj%jJJ%j%%%%jjJJ%%%jj%J%j%%%%%%%J%%%%%%%j%%J%%%%%
$$ 9 9 9 9 9 10 11 11 10 10 10 10 11 11 12 11 11 11 11 11 11 11 11 10 9 9 8 9 10 10 9 9 9 9 9 8 7 8 9 9 9 9 8 7 7 8 8 7 7 7 7 7 7 7 7 8 8 8 8 8 8 8 8 7 7 7 8 8 8 8 8 8
2933H%%%j%%j%JjJ%j%%JjjJ%JJ%%J%j%j%Jj%%jJ%j%jJ%Jj%j%%%%J%JJ%jj%J%j%j%JJ%%jJ%
$$ 8 8 8 8 7 7 7 6 6 7 6 7 7 6 6 6 7 6 5 6 6 7 8 8 8 9 9 8 8 7 7 8 7 7 7 6 7 7 6 6 5 6 6 7 6 6 5 5 5 5 5 6 6 7 8 8 7 6 6 7 7 6 6 5 5 6 7 7 7 6 7 7
2922G%%%%%j%J%%%Jj%%J%%JJj%jjjjJ%%%%%%%%%J%%j%%%%j%%%%jJ%%%%J%%%%jJJJ%%j%j%%
$$ 7 7 7 7 7 7 6 6 7 7 7 7 8 7 7 7 8 8 8 9 10 9 9 8 7 6 5 6 6 6 6 6 6 6 6 6 6 7 7 7 6 6 6 6 6 5 5 5 5 5 4 5 5 5 5 5 6 6 6 6 6 5 6 7 8 8 8 7 7 6 6 6
2911FJj%%%%%j%JJjj%%J%%%%%%jJ%%Jjj%J%%%%j%J%J%j%%J%%j%jJ%j%jJ%%J%%%%%j%j%%J%
$$ 6 7 6 6 6 6 6 6 5 5 6 7 6 5 5 5 6 6 6 6 6 6 6 5 6 6 6 7 6 5 5 6 6 6 6 6 5 5 6 6 7 7 6 6 6 7 7 7 6 6 5 6 6 5 5 4 5 5 5 6 6 6 6 6 6 5 5 4 4 4 5 5
2901EJJ%j%%jj%%%%J%JJ%%j%%j%%%%%%%j%J%Jj%%%%jJ%K%jj%%%%j%JJjjJ%%%J%jj%%%%%%%
$$ 5 6 7 7 6 6 6 5 4 4 4 4 4 5 5 6 7 7 7 6 6 6 5 5 5 5 5 5 5 5 4 4 5 5 6 5 5 5 5 5 4 5 5 7 7 6 5 5 5 5 5 4 4 5 6 5 4 5 5 5 5 6 6 5 4 4 4 4 4 4 4 4
2890DJjjJ%%JJ%J%jjj%%%J%%jJJ%j%%%%%%%%J%%jj%%J%%J%jj%J%Jjj%%J%%Jj%%%%j%J%%%%
$$ 4 5 4 3 4 4 4 5 6 6 7 7 6 5 4 4 4 4 5 5 5 4 5 6 6 5 5 5 5 5 5 5 5 5 6 6 6 5 4 4 4 5 5 5 6 6 5 4 4 5 5 6 5 4 4 4 5 5 5 6 5 5 5 5 5 4 4 5 5 5 5 5
2879E%jJ%j%%J%jj%J%%Jj%%%%%jjJ%J%%jJK%j%%%Jjj%j%J%%%%%J%%jjJ%%%%%%Jj%%J%Jj%%
$$ 5 5 4 5 5 4 4 4 5 5 4 3 3 4 4 4 5 4 4 4 4 4 4 3 2 3 3 4 4 4 3 4 6 6 5 5 5 5 6 5 4 4 3 3 4 4 4 4 4 4 5 5 5 4 3 4 4 4 4 4 4 4 5 4 4 4 5 5 6 5 5 5
2868E%KjjjJ%%%%%%j%%%jjJJ%%J%J%j%%j%%%J%j%%JjjJ%JJjkJJj%J%%Jj%j%%J%%%%%%j%%%
$$ 5 5 7 6 5 4 5 5 5 5 5 5 5 4 4 4 4 3 2 3 4 4 4 5 5 6 6 5 5 5 4 4 4 4 5 5 4 4 4 5 4 3 4 4 5 6 5 3 4 5 4 4 5 5 5 6 5 5 4 4 4 5 5 5 5 5 5 5 4 4 4 4
2857D%%%j%%%%%%%%%%%%%J%J%%%j%j%%%%%J%JJj%%%j%%%%%%JJj%%%%jJ%%%jjJ%%jJ%%J%%%
$$ 4 4 4 4 3 3 3 3 3 3 3 3 3 3 3 3 3 3 4 4 5 5 5 5 4 4 3 3 3 3 3 3 4 4 5 6 5 5 5 5 4 4 4 4 4 4 4 5 6 5 5 5 5 5 4 5 5 5 5 4 3 4 4 4 3 4 4 4 5 5 5 5
2846E%j%%%%%%%%%%J%%%%j%%%jJ%%%J%jJj%%j%%%J%%%JjjJJ%%%j%Jj%%%%jJJ%%J%%j%jjJ%
$$ 5 5 4 4 4 4 4 4 4 4 4 4 4 5 5 5 5 5 4 4 4 4 3 4 4 4 4 5 5 4 5 4 4 4 3 3 3 3 4 4 4 4 5 4 3 4 5 5 5 5 4 4 5 4 4 4 4 4 3 4 5 5 5 6 6 6 5 5 4 3 4 4
2836D%j%%%J%Jj%%%%%%%%%%J%%%jJ%%j%%jJ%%%Jj%%%%%j%%Jj%JJ%%%j%%%%%%%%%Jjj%%JJj
$$ 4 4 3 3 3 3 4 4 5 4 4 4 4 4 4 4 4 4 4 4 5 5 5 5 4 5 5 5 4 4 4 3 4 4 4 4 5 4 4 4 4 4 4 3 3 3 4 3 3 4 5 5 5 5 4 4 4 4 4 4 4 4 4 4 5 4 3 3 3 4 5 4
2825D%%%%J%j%Jj%j%%%%%%K%%j%%%%%%%j%%%JJJjjJ%%%jJ%%jJ%J%%%%%%%%%j%%jJ%%j%%%j
$$ 4 4 4 4 4 5 5 4 4 5 4 4 3 3 3 3 3 3 3 5 5 5 4 4 4 4 4 4 4 4 3 3 3 3 4 5 6 5 4 5 5 5 5 4 5 5 5 4 5 5 6 6 6 6 6 6 6 6 6 6 5 5 5 4 5 5 5 4 4 4 4 3
2814CJJ%%%jJJj%%%jj%J%J%%%%%%j%J%j%JJj%%%%jjjJJJ%k%%%J%%%%Jj%%%%J%Jj%%%%%j%%
$$ 3 4 5 5 5 5 4 5 6 5 5 5 5 4 3 3 4 4 5 5 5 5 5 5 5 4 4 5 5 4 4 5 6 5 5 5 5 5 4 3 2 3 4 5 5 3 3 3 3 4 4 4 4 4 5 4 4 4 4 4 5 5 6 5 5 5 5 5 5 4 4 4
2803DjJJj%jjJJ%%%%jJJ%%%j%%J%%j%%J%jjJJ%j%%%%Jj%j%%%JjjKj%%j%%J%%%%%J%J%j%%%
$$ 4 3 4 5 4 4 3 2 3 4 4 4 4 4 3 4 5 5 5 5 4 4 4 5 5 5 4 4 4 5 5 4 3 4 5 5 4 4 4 4 4 5 4 4 3 3 3 3 4 3 2 4 3 3 3 2 2 2 3 3 3 3 3 3 4 4 5 5 4 4 4 4
2792Dj%%%%J%j%%%%%j%%%%%%%J%%%%j%J%J%%%%%%jJ%%Jj%j%%%%%%%j%%Jj%JJ%j%Jj%%Jjj%
$$ 4 3 3 3 3 3 4 4 3 3 3 3 3 3 2 2 2 2 2 2 2 2 3 3 3 3 3 2 2 3 3 4 4 4 4 4 4 4 3 4 4 4 5 4 4 3 3 3 3 3 3 3 3 2 2 2 3 2 2 3 4 4 3 3 4 3 3 3 4 3 2 2
2781B%%%JjJ%j%%%j%%J%J%%%%J%%%j%%JJjjJ%%jJ%jj%J%%J%j%J%j%J%%%j%J%%%j%%%jjK%%
$$ 2 2 2 2 3 2 3 3 2 2 2 2 1 1 1 2 2 3 3 3 3 3 4 4 4 4 3 3 3 4 5 4 3 4 4 4 3 4 4 3 2 2 3 3 3 4 4 3 3 4 4 3 3 4 4 4 4 3 3 4 4 4 4 3 3 3 3 2 1 3 3 3
2771C%%%j%%J%%%%%%J%%%%%%%j%%JJ%j%%J%%%j%Jj%j%JJ%jj%%JjJ%%%j%%%%J%%J%%jjJ%%%
$$ 3 3 3 3 2 2 2 3 3 3 3 3 3 3 4 4 4 4 4 4 4 4 3 3 3 4 5 5 4 4 4 5 5 5 5 4 4 5 4 4 3 3 4 5 5 4 3 3 3 4 3 4 4 4 4 3 3 3 3 3 4 4 4 5 5 5 4 3 4 4 4 4
2760Dj%J%j%jJ%%J%jJJjj%j%%J%%%J%%%jjJ%j%%%J%%J%%%%%%%%jj%jJJ%%%Jjj%%JJJjjJ%j
$$ 4 3 3 4 4 3 3 2 3 3 3 4 4 3 4 5 4 3 3 2 2 2 3 3 3 3 4 4 4 4 3 2 3 3 2 2 2 2 3 3 3 4 4 4 4 4 4 4 4 4 3 2 2 1 2 3 3 3 3 4 3 2 2 2 3 4 5 4 3 4 4 3
2749Cj%JJjjJ%J%%jJ%%%%%%%%%j%%%J%J%j%%jjJ%%Jj%j%%%J%JJj%jj%%jJ%JJj%%Jj%%%%%J
$$ 3 2 2 3 4 3 2 3 3 4 4 4 3 4 4 4 4 4 4 4 4 4 4 3 3 3 3 4 4 5 5 4 4 4 3 2 3 3 3 4 3 3 2 2 2 2 3 3 4 5 4 4 3 2 2 2 1 2 2 3 4 3 3 3 4 3 3 3 3 3 3 4
2738D%J%j%%%%%%j%%%JJ%jj%%%%%%JJj%j%%%Jj%%%%%J%%%j%%%%%%J%J%%j%%%J%j%%%%jjJJ
$$ 4 4 5 5 4 4 4 4 4 4 4 3 3 3 3 4 5 5 4 3 3 3 3 3 3 3 4 5 4 4 3 3 3 3 4 3 3 3 3 3 3 4 4 4 4 3 3 3 3 3 3 3 4 4 5 5 5 4 4 4 4 5 5 4 4 4 4 4 3 2 3 4
2727D%%j%%%J%%j%J%j%jJ%%%%j%jJJ%%%%%%J%%%%%jjJ%%%JJ%%%%j%%j%%J%%%%%j%KJj%%J%
$$ 4 4 4 3 3 3 3 4 4 4 3 3 4 4 3 3 2 3 3 3 3 3 2 2 1 2 3 3 3 3 3 3 3 4 4 4 4 4 4 3 2 3 3 3 3 4 5 5 5 5 5 4 4 4 3 3 3 4 4 4 4 4 4 3 3 5 6 5 5 5 6 6
2716F%jjjJJJ%j%%%%%%j%jJ%j%J%%%j%%J%J%j%%%%%%J%%J%%%%%j%%%%J%%j%%%%J%%%%j%%J
$$ 6 6 5 4 3 4 5 6 6 5 5 5 5 5 5 5 4 4 3 4 4 3 3 4 4 4 4 3 3 3 4 4 5 5 4 4 4 4 4 4 4 5 5 5 6 6 6 6 6 6 5 5 5 5 5 6 6 6 5 5 5 5 5 6 6 6 6 6 5 5 5 6
2706F%%j%J%%%jj%%jjJ%jK%j%%%%%%%%%%%%J%%%j%J%%%%%%%j%%Jj%J%%j%%J%J%%%%j%%%%%
$$ 6 6 6 5 5 6 6 6 6 5 4 4 4 3 2 3 3 2 4 4 3 3 3 3 3 3 3 3 3 3 3 3 3 4 4 4 4 3 3 4 4 4 4 4 4 4 4 3 3 3 4 3 3 4 4 4 3 3 3 4 4 5 5 5 5 5 4 4 4 4 4 4
2695D%%%%JJj%%%%%%%%J%%%jjj%JJ%%%%j%j%J%%%Jjj%%%JJ%J%jjkjJ%JJ%j%%%%%%%j%%JJj
$$ 4 4 4 4 4 5 6 5 5 5 5 5 5 5 5 5 6 6 6 6 5 4 3 3 4 5 5 5 5 5 4 4 3 3 4 4 4 4 5 4 3 3 3 3 4 5 5 6 6 5 4 2 1 2 2 3 4 4 3 3 3 3 3 3 3 3 2 2 2 3 4 3
2684CjJJj%J%%%%%Jj%%%%jJ%j%%%%KJjkjJ%%jJ%%%%J%%%%%%j%%J%%j%%%%%%J%J%jj%jJ%j%
$$ 3 2 3 4 3 3 4 4 4 4 4 4 5 4 4 4 4 4 3 4 4 3 3 3 3 3 5 6 5 3 2 3 3 3 2 3 3 3 3 3 4 4 4 4 4 4 4 3 3 3 4 4 4 3 3 3 3 3 3 3 4 4 5 5 4 3 3 2 3 3 2 2
2673BJ%%%%%%%%%%%%j%jJKj%jJ%J%j%jj%JJJj%JJj%jjjjJJJJ%j%jJ%%%%J%j%Jj%%%%%%%%j
$$ 2 3 3 3 3 3 3 3 3 3 3 3 3 3 2 2 1 2 4 3 3 2 3 3 4 4 3 3 2 1 1 2 3 4 3 3 4 5 4 4 3 2 1 0 1 2 3 4 4 3 3 2 3 3 3 3 3 4 4 3 3 4 3 3 3 3 3 3 3 3 3 2
2662BJJj%%%J%Jj%j%%%%%jJ%J%%jJ%%jJ%%%%j%%%%%J%%j%jJJJ%%%%%J%J%JJK%J%JJLLMLLL
$$ 2 3 4 3 3 3 3 4 4 5 4 4 3 3 3 3 3 3 2 3 3 4 4 4 3 4 4 4 3 4 4 4 4 4 3 3 3 3 3 3 4 4 4 3 3 2 3 4 5 5 5 5 5 5 6 6 7 7 8 9 11 11 12 12 13 14 17 20 24 27 30 33
2651C3MMMLMOQOOKnj3j4j2j1onkkjj%%jj%%J%%%j%%J%jj%%%j%J%%%%%%%%j%%JJ%jjj%Jj%%
$$ 33 37 41 45 48 52 58 66 72 78 80 75 62 48 36 25 19 14 12 10 9 8 8 8 7 6 6 6 7 7 7 7 6 6 6 7 7 6 5 5 5 5 4 4 5 5 5 5 5 5 5 5 5 4 4 4 5 6 6 5 4 3 3 4 3 3 3
2641CJj%%%%%j%JJ%%jjJ%J%j%%jjJ%%%J%%%jJ%%J%%J%jJ%%j%%%%%j%%jJ%JjjJ%%%%%%J%jj
$$ 3 4 3 3 3 3 3 3 2 2 3 4 4 4 3 2 3 3 4 4 3 3 3 2 1 2 2 2 2 3 3 3 3 2 3 3 3 4 4 4 5 5 4 5 5 5 4 4 4 4 4 4 3 3 3 2 3 3 4 3 2 3 3 3 3 3 3 3 4 4 3 2
2631BJ%J%%%%%%JjjJ%%jJkJJ%%%%JjjJ%%%%%j%jJJ%%%%j%%j%j%J%K%j%jJ%J%%j%J%j%j%%%
$$ 2 3 3 4 4 4 4 4 4 4 5 4 3 4 4 4 3 4 2 3 4 4 4 4 4 5 4 3 4 4 4 4 4 4 3 3 2 3 4 4 4 4 4 3 3 3 2 2 1 1 2 2 4 4 3 3 2 3 3 4 4 4 3 3 4 4 3 3 2 2 2 2
2620B%%J%%%%j%J%%%%JjjJJ%j%%j%J%J%%jjjJ%%%J%%%%%%jJ%J%%%%j%%%J%%%jj%JjJ%j%Jj
$$ 2 2 2 3 3 3 3 3 2 2 3 3 3 3 3 4 3 2 3 4 4 3 3 3 2 2 3 3 4 4 4 3 2 1 2 2 2 2 3 3 3 3 3 3 3 2 3 3 4 4 4 4 4 3 3 3 3 4 4 4 4 3 2 2 3 2 3 3 2 2 3 2
2609B%%%%%Jj%K%%%j%J%j%%%%j%jjJ%jJJ%%%%J%%j%%%%JJ%%j%%JJjj%%%%%%%jJ%%%jJ%j%J
$$ 2 2 2 2 2 2 3 2 2 4 4 4 4 3 3 4 4 3 3 3 3 3 2 2 1 0 1 1 0 1 2 2 2 2 2 3 3 3 2 2 2 2 2 3 4 4 4 3 3 3 4 5 4 3 3 3 3 3 3 3 3 2 3 3 3 3 2 3 3 2 2 3
2598CJ%jJ%%%%%%j%Jjj%j%%%J%%%%%%J%%%%%%%jJ%k%%JJ%j%%JjJ%%%%Jj%%%J%%j%j%%J%%%
$$ 3 4 4 3 4 4 4 4 4 4 4 3 3 4 3 2 2 1 1 1 1 2 2 2 2 2 2 2 3 3 3 3 3 3 3 3 2 3 3 1 1 1 2 3 3 2 2 2 3 2 3 3 3 3 3 4 3 3 3 3 4 4 4 3 3 2 2 2 3 3 3 3
2587CJ%k%%%jJJ%%j%%J%jJ%%J%%%jJJjj%j%%%JJ%jJ%%Jj%%%%J%k%%%%j%%%J%j%%JJ%%%Jjj
$$ 3 4 4 2 2 2 2 1 2 3 3 3 2 2 2 3 3 2 3 3 3 4 4 4 4 3 4 5 4 3 3 2 2 2 2 3 4 4 3 4 4 4 5 4 4 4 4 4 5 5 3 3 3 3 3 2 2 2 2 3 3 2 2 2 3 4 4 4 4 5 4 3
2576Cj%J%%%jJ%j%j%J%%%%%%%%%%Jj%%%J%j%%j%JK%jJJjj%jJ%j%%J%%%jjJ%K%jJ%%j%%%%j
$$ 3 2 2 3 3 3 3 2 3 3 2 2 1 1 2 2 2 2 2 2 2 2 2 2 2 3 2 2 2 2 3 3 2 2 2 1 1 2 4 4 3 4 5 4 3 3 2 3 3 2 2 2 3 3 3 3 2 1 2 2 4 4 3 4 4 4 3 3 3 3 3 2
2566BJJjj%jJ%j%J%%jKj%%J%J%%j%j%%%J%%%Jj%%j%%%%jJJj%jJJ%%%%%%%%%j%J%%j%j%J%%
$$ 2 3 4 3 2 2 1 2 2 1 1 2 2 2 1 3 2 2 2 3 3 4 4 4 3 3 2 2 2 2 3 3 3 3 4 3 3 3 2 2 2 2 2 1 2 3 2 2 1 2 3 3 3 3 3 3 3 3 3 3 2 2 3 3 3 2 2 1 1 2 2 2
2555B%%%%%%%J%j%%jjJJ%%Jj%%%%%%%j%JJj%%Jj%%%%Jj%%%%%JJ%J%k%J%%%j%%jj%%JjJ%%%
$$ 2 2 2 2 2 2 2 2 3 3 2 2 2 1 0 1 2 2 2 3 2 2 2 2 2 2 2 2 1 1 2 3 2 2 2 3 2 2 2 2 2 3 2 2 2 2 2 2 3 4 4 5 5 3 3 4 4 4 4 3 3 3 2 1 1 1 2 1 2 2 2 2
2544B%J%J%%%%j%%%Jjj%%jJ%%%J%%%J%%%%%%%%%j%%%%J%Jj%j%%jJ%Jj%%%j%J%%%%j%%%J%%
$$ 2 2 3 3 4 4 4 4 4 3 3 3 3 4 3 2 2 2 1 2 2 2 2 3 3 3 3 4 4 4 4 4 4 4 4 4 4 3 3 3 3 3 4 4 5 4 4 3 3 3 2 3 3 4 3 3 3 3 2 2 3 3 3 3 3 2 2 2 2 3 3 3
2533C%J%%jjJj%%%%J%JJkj%%%%Jj%%%%%j%%J%%%%j%JJJj%jJ%%j%%%%%%%j%J%JjjjJ%J%%%j
$$ 3 3 4 4 4 3 2 3 2 2 2 2 2 3 3 4 5 3 2 2 2 2 2 3 2 2 2 2 2 2 1 1 1 2 2 2 2 2 1 1 2 3 4 3 3 2 3 3 3 2 2 2 2 2 2 2 2 1 1 2 2 3 2 1 0 1 1 2 2 2 2 1
2522AJJj%%JJ%%jJ%%%jjJ%J%j%%j%J%%%j%%J%JjjJ%%J%jj%%Jj%%JJ%%j%%%%j%%%j%%%J%%%
$$ 1 2 3 2 2 2 3 4 4 4 3 4 4 4 4 3 2 3 3 4 4 3 3 3 2 2 3 3 3 3 2 2 2 3 3 4 3 2 3 3 3 4 4 3 2 2 2 3 2 2 2 3 4 4 4 3 3 3 3 3 2 2 2 2 1 1 1 1 2 2 2 2
2511B%%jJ%%J%%%Jj%j%%%%%%Jj%jJJJj%%%j%j%%Jj%%%JJj%%%%%JJj%%j%%%%J%%%%%%%%jJ%
$$ 2 2 2 1 2 2 2 3 3 3 3 4 3 3 2 2 2 2 2 2 2 3 2 2 1 2 3 4 3 3 3 3 2 2 1 1 1 2 1 1 1 1 2 3 2 2 2 2 2 2 3 4 3 3 3 2 2 2 2 2 3 3 3 3 3 3 3 3 3 2 3 3
2501C%%%%%%%J%%%%j%%%%Jj%j%%%%%JjJj%%%%%%%J%%%J%%kjJJ%%jj%%JJ%%j%J%%jJ%%Jj%j
$$ 3 3 3 3 3 3 3 3 4 4 4 4 4 3 3 3 3 3 4 3 3 2 2 2 2 2 2 3 2 3 2 2 2 2 2 2 2 2 3 3 3 3 4 4 4 2 1 2 3 3 3 2 1 1 1 2 3 3 3 2 2 3 3 3 2 3 3 3 4 3 3 2
2490Bj%JjjJ%%%J%%%%jJ%%J%jJ%%%j%J%j%%j%%%J%J%%%Jj%jj%JJJ%%j%%Jj%%%%%%%%Jjk%J
$$ 2 1 1 2 1 0 1 1 1 1 2 2 2 2 2 1 2 2 2 3 3 2 3 3 3 3 2 2 3 3 2 2 2 1 1 1 1 2 2 3 3 3 3 4 3 3 2 1 1 2 3 4 4 4 3 3 3 4 3 3 3 3 3 3 3 3 3 4 3 1 1 2
2479B%j%%J%J%%J%%%%%j%%%%jj%%JJj%%%%J%Jj%%j%J%%%%%j%J%%jj%%J%%J%jjJJ%%J%jj%J
$$ 2 2 1 1 1 2 2 3 3 3 4 4 4 4 4 4 3 3 3 3 3 2 1 1 1 2 3 2 2 2 2 2 3 3 4 3 3 3 2 2 3 3 3 3 3 3 2 2 3 3 3 2 1 1 1 2 2 2 3 3 2 1 2 3 3 3 4 4 3 2 2 3
2468C%%%%%%j%%%%%%K%jJj%%%%%JjjJjjJ%%%JJj%j%%Jj%%Jj%J%%kJ%%J%J%j%%%%j%JJjj%%
$$ 3 3 3 3 3 3 3 2 2 2 2 2 2 2 4 4 3 4 3 3 3 3 3 3 4 3 2 3 2 1 2 2 2 2 3 4 3 3 2 2 2 3 2 2 2 3 2 2 3 3 3 1 2 2 2 3 3 4 4 3 3 3 3 3 2 2 3 4 3 2 2 2
2457BJ%j%%JjK%%%jj%%J%%j%%Jjj%J%J%%J%j%%%%%%%%jJ%%%%JJ%jj%j%J%%%J%%%%%j%%%%J
$$ 2 3 3 2 2 2 3 2 4 4 4 4 3 2 2 2 3 3 3 2 2 2 3 2 1 1 2 2 3 3 3 4 4 3 3 3 3 3 3 3 3 3 2 3 3 3 3 3 4 5 5 4 3 3 2 2 3 3 3 3 4 4 4 4 4 4 3 3 3 3 3 4
2446D%%%j%%%%%jJ%%%J%jJ%%jj%%J%J%%k%%J%Jj%%%JjjjJJ%Jjj%%%%%J%jJ%%jj%JJj%%%jJ
$$ 4 4 4 4 3 3 3 3 3 3 2 3 3 3 3 4 4 3 4 4 4 3 2 2 2 3 3 4 4 4 2 2 2 3 3 4 3 3 3 3 4 3 2 1 2 3 3 4 3 2 2 2 2 2 2 3 3 2 3 3 3 2 1 1 2 3 2 2 2 2 1 2
2436B%%%%JJ%jKjjj%%JJ%%j%%Jj%%%%%JjkJ%J%%%%%%kJ%JkJ%J%%%jJ%j%%%J%j%%J%jJj%jJ
$$ 2 2 2 2 2 3 4 4 3 5 4 3 2 2 2 3 4 4 4 3 3 3 4 3 3 3 3 3 3 4 3 1 2 2 3 3 3 3 3 3 3 1 2 2 3 1 2 2 3 3 3 3 2 3 3 2 2 2 2 3 3 2 2 2 3 3 2 3 2 2 1 2
2425BJ%%%%%%%J%j%%%%j%%%%jJ%JjJ%%%%J%jJ%jj%%%%%%%JjjJJ%%J%%%j%%%%j%%%%%jj%%J
$$ 2 3 3 3 3 3 3 3 3 4 4 3 3 3 3 3 2 2 2 2 2 1 2 2 3 2 3 3 3 3 3 4 4 3 4 4 3 2 2 2 2 2 2 2 2 3 2 1 2 3 3 3 4 4 4 4 3 3 3 3 3 2 2 2 2 2 2 1 0 0 0 1
2414AKJj%%Jj%%%%%%j%Jj%%J%%jj%%%JJ%jjJ%%%%%%JjJ%%%jJ%%%%%jJJJ%j%%%%%%%j%%jJ%
$$ 1 3 4 3 3 3 4 3 3 3 3 3 3 3 2 2 3 2 2 2 3 3 3 2 1 1 1 1 2 3 3 2 1 2 2 2 2 2 2 2 3 2 3 3 3 3 2 3 3 3 3 3 3 2 3 4 5 5 4 4 4 4 4 4 4 4 3 3 3 2 3 3
2403CJj%j%%JJk%J%%%%j%%Jj%%J%j%%%J%%%%%%jJ%Jj%Jj%j%J%%Jj%Jj%%%%%%j%%%%Jj%%j%
$$ 3 4 3 3 2 2 2 3 4 2 2 3 3 3 3 3 2 2 2 3 2 2 2 3 3 2 2 2 2 3 3 3 3 3 3 3 2 3 3 4 3 3 4 3 3 2 2 3 3 3 4 3 3 4 3 3 3 3 3 3 3 2 2 2 2 2 3 2 2 2 1 1
2392A%KJJjkJ%jjJ%%jJJ%%%%%%%%j%JJj%j%%J%%%J%%j%%j%%%%JjJ%j%%Jj%%Jj%%%%jJJJj%
$$ 1 1 3 4 5 4 2 3 3 2 1 2 2 2 1 2 3 3 3 3 3 3 3 3 3 2 2 3 4 3 3 2 2 2 3 3 3 3 4 4 4 3 3 3 2 2 2 2 2 3 2 3 3 2 2 2 3 2 2 2 3 2 2 2 2 2 1 2 3 4 3 3
2381CJ%%jjJ%%J%%%%j%%%%%j%%%%JJ%%%j%%%%%J%J%%jj%%%%JJ%jj%%%%%j%%%%%%%%%%%%%%
$$ 3 4 4 4 3 2 3 3 3 4 4 4 4 4 3 3 3 3 3 3 2 2 2 2 2 3 4 4 4 4 3 3 3 3 3 3 4 4 5 5 5 4 3 3 3 3 3 4 5 5 4 3 3 3 3 3 3 2 2 2 2 2 2 2 2 2 2 2 2 2 2 2
2371B%J%%%J%%%jJ%jj%%J%%J%%jkJJ%%%%%JJjjJ%%%%%j%%%%%%%jJ%%%j%j%J%%%Jj%%J%j%%
$$ 2 2 3 3 3 3 4 4 4 4 3 4 4 3 2 2 2 3 3 3 4 4 4 3 1 2 3 3 3 3 3 3 4 5 4 3 4 4 4 4 4 4 3 3 3 3 3 3 3 3 2 3 3 3 3 2 2 1 1 2 2 2 2 3 2 2 2 3 3 2 2 2
2360B%%Jj%%J%%%%%j%%JJj%j%%%JJj%%%%%%%%jJ%%j%%JJ%jj%%%%J%%j%K%%j%J%j%jJJj%j%
$$ 2 2 2 3 2 2 2 3 3 3 3 3 3 2 2 2 3 4 3 3 2 2 2 2 3 4 3 3 3 3 3 3 3 3 3 2 3 3 3 2 2 2 3 4 4 3 2 2 2 2 2 3 3 3 2 2 4 4 4 3 3 4 4 3 3 2 3 4 3 3 2 2
2349B%%%%%%%%%J%j%%%Jj%J%%Jjj%%%Jj%J%%%Jj%%j%JJ%j%%%%%%%%%%j%JJj%%j%%%%%J%j%
$$ 2 2 2 2 2 2 2 2 2 2 3 3 2 2 2 2 3 2 2 3 3 3 4 3 2 2 2 2 3 2 2 3 3 3 3 4 3 3 3 2 2 3 4 4 3 3 3 3 3 3 3 3 3 3 3 2 2 3 4 3 3 3 2 2 2 2 2 2 3 3 2 2
2338B%%%jJJ%j%%%%%%%%j%J%%%%j%%%JJjj%%%%J%J%jj%J%%%J%%%%%%%j%%J%%%J%%J%%%%jj
$$ 2 2 2 2 1 2 3 3 2 2 2 2 2 2 2 2 2 1 1 2 2 2 2 2 1 1 1 1 2 3 2 1 1 1 1 1 2 2 3 3 2 1 1 2 2 2 2 3 3 3 3 3 3 3 3 2 2 2 3 3 3 3 4 4 4 5 5 5 5 5 4 3
2327C%%%%%%%jJj%%J%%%JjkJ%%J%%%jj%%J%%%%%%%%jJ%J%Jj%j%J%%%%J%jjjJ%%%%J%J%jJj
$$ 3 3 3 3 3 3 3 3 2 3 2 2 2 3 3 3 3 4 3 1 2 2 2 3 3 3 3 2 1 1 1 2 2 2 2 2 2 2 2 2 1 2 2 3 3 4 3 3 2 2 3 3 3 3 3 4 4 3 2 1 2 2 2 2 2 3 3 4 4 3 4 3
2316C%%%j%%%J%jj%%J%J%%%%Jj%%%%j%jJ%%%J%Jj%jJ%jJ%%%JjjJKj%j%%%%%j%JJjj%%%J%%
$$ 3 3 3 3 2 2 2 2 3 3 2 1 1 1 2 2 3 3 3 3 3 4 3 3 3 3 3 2 2 1 2 2 2 2 3 3 4 3 3 2 3 3 2 3 3 3 3 4 3 2 3 5 4 4 3 3 3 3 3 3 2 2 3 4 3 2 2 2 2 3 3 3
2306Cjj%%%%%%JjJ%JJj%%%jJJj%jj%JKj%j%%jJJ%j%%%Jj%%%%%%%%j%%%%%%%jJ%%Jj%%jJ%J
$$ 3 2 1 1 1 1 1 1 1 2 1 2 2 3 4 3 3 3 3 2 3 4 3 3 2 1 1 2 4 3 3 2 2 2 1 2 3 3 2 2 2 2 3 2 2 2 2 2 2 2 2 2 1 1 1 1 1 1 1 1 0 1 1 1 2 1 1 1 0 1 1 2
2295BJ%%%j%jJJj%%J%J%%j%%jjjJJJ%%jj%%J%%%%%JJj%j%J%%J%k%%%%%jJ%%j%%%%J%J%j%%
$$ 2 3 3 3 3 2 2 1 2 3 2 2 2 3 3 4 4 4 3 3 3 2 1 0 1 2 3 3 3 2 1 1 1 2 2 2 2 2 2 3 4 3 3 2 2 3 3 3 4 4 2 2 2 2 2 2 1 2 2 2 1 1 1 1 1 2 2 3 3 2 2 2
2284B%%J%%%jj%J%J%JjjJ%%%%k%K%j%%%J%%j%J%%%%%j%J%j%%%JJ%j%j%%j%%%J%J%%Jjj%%%
$$ 2 2 2 3 3 3 3 2 1 1 2 2 3 3 4 3 2 3 3 3 3 3 1 1 3 3 2 2 2 2 3 3 3 2 2 3 3 3 3 3 3 2 2 3 3 2 2 2 2 3 4 4 3 3 2 2 2 1 1 1 1 2 2 3 3 3 4 3 2 2 2 2
2273B%JJ%%j%%J%%j%J%%%jj%%%%%J%jJ%%j%J%%%%%j%%%%%%%%J%%%%%j%%J%J%%%%%j%%%%%%
$$ 2 2 3 4 4 4 3 3 3 4 4 4 3 3 4 4 4 4 3 2 2 2 2 2 2 3 3 2 3 3 3 2 2 3 3 3 3 3 3 2 2 2 2 2 2 2 2 2 3 3 3 3 3 3 2 2 2 3 3 4 4 4 4 4 4 3 3 3 3 3 3 3
2262C%%%jJ%j%%%JJj%%%jjJ%%jJJ%%%jJ%%Jj%%%%%%Jj%jj%jKJ%Jj%%%jJJ%JjkJ%jJJ%%j%J
$$ 3 3 3 3 2 3 3 2 2 2 2 3 4 3 3 3 3 2 1 2 2 2 1 2 3 3 3 3 2 3 3 3 4 3 3 3 3 3 3 3 4 3 3 2 1 1 0 2 3 3 4 3 3 3 3 2 3 4 4 5 4 2 3 3 2 3 4 4 4 3 3 4
2251D%%%%%j%JJj%jj%%JJj%j%%%%J%%%j%j%%%J%jJ%j%J%%%J%J%j%%j%%%KJ%k%j%%K%j%%%%
$$ 4 4 4 4 4 4 3 3 4 5 4 4 3 2 2 2 3 4 3 3 2 2 2 2 2 3 3 3 3 2 2 1 1 1 1 2 2 1 2 2 1 1 2 2 2 2 3 3 4 4 3 3 3 2 2 2 2 4 5 5 3 3 2 2 2 4 4 3 3 3 3 3
2241C%%%%j%jJJ%j%%J%%%j%J%%%Jj%%%j%%J%%%%%%%%%jJ%%%%j%%%%j%K%j%j%JJJJjk%%%%%
$$ 3 3 3 3 3 2 2 1 2 3 3 2 2 2 3 3 3 3 2 2 3 3 3 3 4 3 3 3 3 2 2 2 3 3 3 3 3 3 3 3 3 3 2 3 3 3 3 3 2 2 2 2 2 1 1 3 3 2 2 1 1 2 3 4 5 4 2 2 2 2 2 2
2230B%%%%J%%j%%%%Jj%%Jj%%J%jJ%%jjJJ%%%%jJJj%%j%%JJ%%%%%jJ%%%jj%J%Jj%%%%%%%%J
$$ 2 2 2 2 2 3 3 3 2 2 2 2 2 3 2 2 2 3 2 2 2 3 3 2 3 3 3 2 1 2 3 3 3 3 3 2 3 4 3 3 3 2 2 2 3 4 4 4 4 4 4 3 4 4 4 4 3 2 2 3 3 4 3 3 3 3 3 3 3 3 3 4
2219D%%%%%j%%j%%J%%j%%J%J%%jjJ%%%J%j%%jJJ%%j%%%Jj%%j%J%%%%%%jJ%J%J%%%jk%%%J%
$$ 4 4 4 4 4 4 3 3 3 2 2 2 3 3 3 2 2 2 3 3 4 4 4 3 2 3 3 3 3 4 4 3 3 3 2 3 4 4 4 3 3 3 3 4 3 3 3 2 2 3 3 3 3 3 3 3 2 3 3 4 4 5 5 5 5 4 2 2 2 2 3 3
2208C%j%J%JjJ%%%%%jJ%%%j%%%j%J%%%%%%%jJ%J%%j%%%%%J%%j%%%j%%%J%%%J%j%%%%j%J%j
$$ 3 3 2 2 3 3 4 3 4 4 4 4 4 4 3 4 4 4 4 3 3 3 3 2 2 3 3 3 3 3 3 3 3 2 3 3 4 4 4 3 3 3 3 3 3 4 4 4 3 3 3 3 2 2 2 2 3 3 3 3 4 4 3 3 3 3 3 2 2 3 3 2
2197B%%J%jjJ%%%J%%%%%%%%j%J%%%%%Jj%%Jj%jJ%j%%j%%JJJ%j%%JJ%j%%%%%%jj%%JJ%%%%%
$$ 2 2 2 3 3 2 1 2 2 2 2 3 3 3 3 3 3 3 3 3 2 2 3 3 3 3 3 3 4 3 3 3 4 3 3 2 3 3 2 2 2 1 1 1 2 3 4 4 3 3 3 4 5 5 4 4 4 4 4 4 4 3 2 2 2 3 4 4 4 4 4 4
2186DjJ%j%%%%%%%J%%%jJ%%%%%j%%JJ%jJJ%j%j%%%%%%%%%%%%%jJ%%%j%%j%jJJ%%%JJ%%%%%
$$ 4 3 4 4 3 3 3 3 3 3 3 3 4 4 4 4 3 4 4 4 4 4 4 3 3 3 4 5 5 4 5 6 6 5 5 4 4 4 4 4 4 4 4 4 4 4 4 4 4 3 4 4 4 4 3 3 3 2 2 1 2 3 3 3 3 4 5 5 5 5 5 5
2176E%J%%jj%%%%%%%jJ%%%J%J%%%KJJ%%JJK%j%%jj%jkkj%J%%Jj%%%J%J%%JJJJKJJJJJK%J%
$$ 5 5 6 6 6 5 4 4 4 4 4 4 4 4 3 4 4 4 4 5 5 6 6 6 6 8 9 10 10 10 11 12 14 14 13 13 13 12 11 11 10 8 6 5 5 6 6 6 7 6 6 6 6 7 7 8 8 8 9 10 11 12 14 15 16 17 18 19 21 21 22 22
2165B2jkllkkk%%j%%%j%j%J%%%JJ%jJJ%%JK%J%%j%%jjj%%k%j%j%%%J%%jjJ%Jj%%%%%JJj%%
$$ 22 21 19 16 13 11 9 7 7 7 6 6 6 6 5 5 4 4 5 5 5 5 6 7 7 6 7 8 8 8 9 11 11 12 12 12 11 11 11 10 9 8 8 8 6 6 5 5 4 4 4 4 5 5 5 4 3 4 4 5 4 4 4 4 4 4 5 6 5 5 5
2154Ej%%%%%%%j%%JJ%j%j%%jJJ%J%%%%%j%j%%%%J%%%%jJ%%%jJj%%%%%%%j%%%J%%%%Jjj%%J
$$ 5 4 4 4 4 4 4 4 4 3 3 3 4 5 5 4 4 3 3 3 2 3 4 4 5 5 5 5 5 5 4 4 3 3 3 3 3 4 4 4 4 4 3 4 4 4 4 3 4 3 3 3 3 3 3 3 3 2 2 2 2 3 3 3 3 3 4 3 2 2 2 3
2143C%jJ%%%%jJ%%%%j%%%%%j%%J%J%%j%J%Jj%%jJ%%J%%%%%%%%%Jj%j%j%jJJJjkJ%JjjK%%j
$$ 3 3 2 3 3 3 3 3 2 3 3 3 3 3 2 2 2 2 2 2 1 1 1 2 2 3 3 3 2 2 3 3 4 3 3 3 2 3 3 3 4 4 4 4 4 4 4 4 4 4 5 4 4 3 3 2 2 1 2 3 4 3 1 2 2 3 2 1 3 3 3 2
2132Bj%%%%JJ%%%%j%Kjj%%%%%%%%J%J%%j%j%%J%%%%%%%%j%%%%%j%JJjjJ%JJ%j%%j%%J%%k%
$$ 2 1 1 1 1 1 2 3 3 3 3 3 2 2 4 3 2 2 2 2 2 2 2 2 2 3 3 4 4 4 3 3 2 2 2 3 3 3 3 3 3 3 3 3 2 2 2 2 2 2 1 1 2 3 2 1 2 2 3 4 4 3 3 3 2 2 2 3 3 3 1 1
2122AJ%%%%J%J%%%%j%J%jj%%%%%%%jJJ%j%%jjJ%J%J%%%%%j%J%%%%%Jk%j%J%J%Jj%jj%J%%%
$$ 1 2 2 2 2 2 3 3 4 4 4 4 4 3 3 4 4 3 2 2 2 2 2 2 2 2 1 2 3 3 2 2 2 1 0 1 1 2 2 3 3 3 3 3 3 2 2 3 3 3 3 3 3 4 2 2 1 1 2 2 3 3 4 3 3 2 1 1 2 2 2 2
2111BJj%jJ%%J%J%j%J%%%j%%%%%%%%%%JjJ%jj%%%%J%%j%%%JJ%k%%J%J%%j%J%%j%%j%J%%Jj
$$ 2 3 2 2 1 2 2 2 3 3 4 4 3 3 4 4 4 4 3 3 3 3 3 3 3 3 3 3 3 4 3 4 4 3 2 2 2 2 2 3 3 3 2 2 2 2 3 4 4 2 2 2 3 3 4 4 4 3 3 4 4 4 3 3 3 2 2 3 3 3 4 3
2100Cj%J%jJ%%j%%%J%%%%%%%%%J%%%%%j%j%%J%J%%jjJ%%%j%%%J%%%%%%jJ%%%JJjj%%%%JJj
$$ 3 2 2 3 3 2 3 3 3 2 2 2 2 3 3 3 3 3 3 3 3 3 3 4 4 4 4 4 4 3 3 2 2 2 3 3 4 4 4 3 2 3 3 3 3 2 2 2 2 3 3 3 3 3 3 3 2 3 3 3 3 4 5 4 3 3 3 3 3 4 5 4
2089D%%jJ%%%%%%j%jJJj%%%%%%J%%j%%%%%%J%%%j%%%%J%%%%j%%%%%%%%%J%%j%%J%%%j%J%J
$$ 4 4 4 3 4 4 4 4 4 4 4 3 3 2 3 4 3 3 3 3 3 3 3 4 4 4 3 3 3 3 3 3 3 4 4 4 4 3 3 3 3 3 4 4 4 4 4 3 3 3 3 3 3 3 3 3 3 4 4 4 3 3 3 4 4 4 4 3 3 4 4 5
2078E%%Jjj%%Jj%%%%%Jj%jJ%%j%%JJ%%j%%%%J%j%%%JkJ%Jj%%jJJ%%%%%%j%%jJJjj%%%%jj%
$$ 5 5 5 6 5 4 4 4 5 4 4 4 4 4 4 5 4 4 3 4 4 4 3 3 3 4 5 5 5 4 4 4 4 4 5 5 4 4 4 4 5 3 4 4 5 4 4 4 3 4 5 5 5 5 5 5 5 4 4 4 3 4 5 4 3 3 3 3 3 2 1 1
2067AJ%JJ%J%%%j%%%%Jj%%j%%Jj%%J%%j%%%Jjj%K%j%%%J%%jjJ%%%%%%%Jjj%JJ%j%%%%%%J%
$$ 1 2 2 3 4 4 5 5 5 5 4 4 4 4 4 5 4 4 4 3 3 3 4 3 3 3 4 4 4 3 3 3 3 4 3 2 2 4 4 3 3 3 3 4 4 4 3 2 3 3 3 3 3 3 3 3 4 3 2 2 3 4 4 3 3 3 3 3 3 3 4 4
2057D%J%%j%%%%j%j%JJJ%j%%kJj%%JJ%%Jj%%%%%%j%Jj%Jj%J%%jJ%kjJJJj%%%j%%J%J%%%%%
$$ 4 4 5 5 5 4 4 4 4 4 3 3 2 2 3 4 5 5 4 4 4 2 3 2 2 2 3 4 4 4 5 4 4 4 4 4 4 4 3 3 4 3 3 4 3 3 4 4 4 3 4 4 2 1 2 3 4 3 3 3 3 2 2 2 3 3 4 4 4 4 4 4
2046Dj%J%Jj%%%j%%%%%%jJ%%%%%%j%%J%%%%%jJ%jJJ%%%%%Jj%%%jjjK%JKJjk%jJJj%j%%%%J
$$ 4 3 3 4 4 5 4 4 4 4 3 3 3 3 3 3 3 2 3 3 3 3 3 3 3 2 2 2 3 3 3 3 3 3 2 3 3 2 3 4 4 4 4 4 4 5 4 4 4 4 3 2 1 3 3 4 6 7 6 4 4 3 4 5 4 4 3 3 3 3 3 4
2035DjJ%%%%%%j%%JJ%jj%j%%J%%j%JJj%jJJ%%%%%%j%%J%jj%%jJK%%j%%j%JJ%%%%jJJJ%%%j
$$ 4 3 4 4 4 4 4 4 4 3 3 3 4 5 5 4 3 3 2 2 2 3 3 3 2 2 3 4 3 3 2 3 4 4 4 4 4 4 4 3 3 3 4 4 3 2 2 2 1 2 4 4 4 3 3 3 2 2 3 4 4 4 4 4 3 4 5 6 6 6 6 5
2024EjJ%%jjJ%j%%%%%%%%%%%JJjjJjj%J%%%%%%%%%%%%%%%jJ%%%%j%jJ%%%%J%%%%%%%j%j%%
$$ 5 4 5 5 5 4 3 4 4 3 3 3 3 3 3 3 3 3 3 3 3 4 5 4 3 4 3 2 2 3 3 3 3 3 3 3 3 3 3 3 3 3 3 3 3 2 3 3 3 3 3 2 2 1 2 2 2 2 2 3 3 3 3 3 3 3 3 2 2 1 1 1
2013AJ%K%j%%%JJjjJ%%J%j%%k%jJJj%%JJ%j%j%%%%J%%J%j%Jj%%%%%%%%%%%%jJ%%J%%j%%%%
$$ 1 2 2 4 4 3 3 3 3 4 5 4 3 4 4 4 5 5 4 4 4 2 2 1 2 3 2 2 2 3 4 4 3 3 2 2 2 2 2 3 3 3 4 4 3 3 4 3 3 3 3 3 3 3 3 3 3 3 3 3 2 3 3 3 4 4 4 3 3 3 3 3
2002C%%J%%j%j%J%%%jJJ%jj%J%%%j%J%%%J%%%%%%jj%JJ%j%%%%%j%J%JJj%Jk%jJJjj%%%J%%
$$ 3 3 3 4 4 4 3 3 2 2 3 3 3 3 2 3 4 4 3 2 2 3 3 3 3 2 2 3 3 3 3 4 4 4 4 4 4 4 3 2 2 3 4 4 3 3 3 3 3 3 2 2 3 3 4 5 4 4 5 3 3 2 3 4 3 2 2 2 2 3 3 3
1992C%jJ%j%%%JJ%jjJJ%j%%jJ%%J%jj%%Jj%%J%jJJjjJ%%%%j%%%%JJjj%J%%j%%%%%J%%J%J%
$$ 3 3 2 3 3 2 2 2 2 3 4 4 3 2 3 4 4 3 3 3 2 3 3 3 4 4 3 2 2 2 3 2 2 2 3 3 2 3 4 3 2 3 3 3 3 3 2 2 2 2 2 3 4 3 2 2 3 3 3 2 2 2 2 2 2 3 3 3 4 4 5 5
1981E%jj%%%%%%%j%%%%J%%Jj%%j%%J%%%%%%%jjJ%%J%j%JJjj%%%j%JJ%%j%J%j%%%%j%%J%%%
$$ 5 5 4 3 3 3 3 3 3 3 3 2 2 2 2 2 3 3 3 4 3 3 3 2 2 2 3 3 3 3 3 3 3 3 2 1 2 2 2 3 3 2 2 3 4 3 2 2 2 2 1 1 2 3 3 3 2 2 3 3 2 2 2 2 2 1 1 1 2 2 2 2
1970B%%%j%J%%%J%%%%%jJ%%Jj%j%%%%J%jJ%%j%%Jj%%%%J%%%J%%j%%%%%%%%%J%%j%%%J%%J%
$$ 2 2 2 2 1 1 2 2 2 2 3 3 3 3 3 3 2 3 3 3 4 3 3 2 2 2 2 2 3 3 2 3 3 3 2 2 2 3 2 2 2 2 2 3 3 3 3 4 4 4 3 3 3 3 3 3 3 3 3 3 4 4 4 3 3 3 3 4 4 4 5 5
1959Ej%j%J%Jjj%%%J%Jjj%%%jjJ%J%j%j%%J%J%j%%jJ%J%%%%%%%J%%%%jJ%%%%jJ%%Jjjj%J%
$$ 5 4 4 3 3 4 4 5 4 3 3 3 3 4 4 5 4 3 3 3 3 2 1 2 2 3 3 2 2 1 1 1 2 2 3 3 2 2 2 1 2 2 3 3 3 3 3 3 3 3 4 4 4 4 4 3 4 4 4 4 4 3 4 4 4 5 4 3 2 2 3 3
1948CJ%Jj%jJ%%%%j%%%%%jjJJ%%%%%%%%%%%%%j%%j%JJJ%%%j%%%%%%J%%j%%J%j%j%%%%jJ%%
$$ 3 4 4 5 4 4 3 4 4 4 4 4 3 3 3 3 3 3 2 1 2 3 3 3 3 3 3 3 3 3 3 3 3 3 3 2 2 2 1 1 2 3 4 4 4 4 3 3 3 3 3 3 3 4 4 4 3 3 3 4 4 3 3 2 2 2 2 2 1 2 2 2
1937BjJKj%j%%%%J%j%%JJj%j%J%J%%Jj%%j%%%J%Jj%%j%%%%J%%j%%J%%%Jjj%%%%j%%%J%%%J
$$ 2 1 2 4 3 3 2 2 2 2 2 3 3 2 2 2 3 4 3 3 2 2 3 3 4 4 4 5 4 4 4 3 3 3 3 4 4 5 4 4 4 3 3 3 3 3 4 4 4 3 3 3 4 4 4 4 5 4 3 3 3 3 3 2 2 2 2 3 3 3 3 4
1927Djj%%%%JJ%j%jJJj%%jJ%%%j%%Jj%%%j%%JJ%J%j%%%%%jjJJ%%%J%%%%jj%J%%j%J%j%%%J
$$ 4 3 2 2 2 2 2 3 4 4 3 3 2 3 4 3 3 3 2 3 3 3 3 2 2 2 3 2 2 2 2 1 1 1 2 3 3 4 4 3 3 3 3 3 3 2 1 2 3 3 3 3 4 4 4 4 4 3 2 2 3 3 3 2 2 3 3 2 2 2 2 3
1916C%J%Jjjj%%%%%%JJj%jjJ%%jJ%JJ%%%j%%%j%%%%%%j%%J%%%Jj%%%jJ%%%%J%J%%%%%%j%J
$$ 3 3 4 4 5 4 3 2 2 2 2 2 2 2 3 4 3 3 2 1 2 2 2 1 2 2 3 4 4 4 4 3 3 3 3 2 2 2 2 2 2 2 1 1 1 2 2 2 2 3 2 2 2 2 1 2 2 2 2 2 3 3 4 4 4 4 4 4 4 3 3 4
1905Djj%%%%%%J%j%%%JJjJJjjj%%%%%%%%Jj%J%%%%Jj%%%Jj%%jJJ%%%%jj%j%JJ%%j%J%%%j%
$$ 4 3 2 2 2 2 2 2 2 3 3 2 2 2 2 3 4 3 4 5 4 3 2 2 2 2 2 2 2 2 2 3 2 2 3 3 3 3 3 4 3 3 3 3 4 3 3 3 2 3 4 4 4 4 4 3 2 2 1 1 2 3 3 3 2 2 3 3 3 3 2 2
1894BjJJ%j%%%j%JJ%j%%Jj%%%J%%%%%%%j%%%%%%%%%J%%JJ%j%jjJJ%Jj%%%J%%jjJ%jk%JJ%%
$$ 2 1 2 3 3 2 2 2 2 1 1 2 3 3 2 2 2 3 2 2 2 2 3 3 3 3 3 3 3 3 2 2 2 2 2 2 2 2 2 2 3 3 3 4 5 5 4 4 3 2 3 4 4 5 4 4 4 4 5 5 5 4 3 4 4 3 1 1 2 3 3 3
1883CJ%j%j%Jj%%%%%jJ%%Jj%J%%%%%%%%%jJ%j%%J%%%%J%Jjj%%J%%J%%%j%j%%%%%Jj%J%%%%
$$ 3 4 4 3 3 2 2 3 2 2 2 2 2 2 1 2 2 2 3 2 2 3 3 3 3 3 3 3 3 3 3 2 3 3 2 2 2 3 3 3 3 3 4 4 5 4 3 3 3 4 4 4 5 5 5 5 4 4 3 3 3 3 3 3 4 3 3 4 4 4 4 4
1872DjjJJ%%%%%%%%k%jJJ%J%J%%j%%j%J%%%%%%j%%%%J%jJ%%j%%%j%J%%%%%%%%%j%%JJ%%%J
$$ 4 3 2 3 4 4 4 4 4 4 4 4 4 2 2 1 2 3 3 4 4 5 5 5 4 4 4 3 3 4 4 4 4 4 4 4 3 3 3 3 3 4 4 3 4 4 4 3 3 3 3 2 2 3 3 3 3 3 3 3 3 3 3 2 2 2 3 4 4 4 4 5
1862Ej%%%J%jj%J%%%J%%%%jjJ%%JJ%%%JK%%j%j%lj%%%%J%%%%j%%j%%%%%J%j%%JJ%%j%%J%%
$$ 5 4 4 4 4 5 5 4 3 3 4 4 4 4 5 5 5 5 5 4 3 4 4 4 5 6 6 6 6 7 9 9 9 8 8 7 7 4 3 3 3 3 3 4 4 4 4 4 3 3 3 2 2 2 2 2 2 3 3 2 2 2 3 4 4 4 3 3 3 4 4 4
1851D%%%%%%%%%j%%%%%%Jj%J%%%J%j%%k%JJJ%kj%Jj%J%%%%j%%J%%%%J%%%%jJjJ%j%%J%%j%
$$ 4 4 4 4 4 4 4 4 4 4 3 3 3 3 3 3 3 4 3 3 4 4 4 4 5 5 4 4 4 2 2 3 4 5 5 3 2 2 3 2 2 3 3 3 3 3 2 2 2 3 3 3 3 3 4 4 4 4 4 3 4 3 4 4 3 3 3 4 4 4 3 3
1840C%jjJJ%J%%%j%%jJJj%j%%J%%%%%%%%%%%%%%J%%%j%jj%%JJ%%%%%Jjj%%%%%J%%%j%%J%%
$$ 3 3 2 1 2 3 3 4 4 4 4 3 3 3 2 3 4 3 3 2 2 2 3 3 3 3 3 3 3 3 3 3 3 3 3 3 3 4 4 4 4 3 3 2 1 1 1 2 3 3 3 3 3 3 4 3 2 2 2 2 2 2 3 3 3 3 2 2 2 3 3 3
1829C%%J%jjJ%j%%J%%j%JJjj%j%JJJJ%kk%%J%%%J%%%jJ%jJ%%%j%%J%J%%j%%%j%JJJJjj%j%
$$ 3 3 3 4 4 3 2 3 3 2 2 2 3 3 3 2 2 3 4 3 2 2 1 1 2 3 4 5 5 3 1 1 1 2 2 2 2 3 3 3 3 2 3 3 2 3 3 3 3 2 2 2 3 3 4 4 4 3 3 3 3 2 2 3 4 5 6 5 4 4 3 3
1818C%%%jJ%%jJ%%jJ%%J%jJ%jj%JJ%%jjJJ%jj%J%%j%J%%Jj%%%Jj%Jj%%%%%%%j%%%JJJ%kj%
$$ 3 3 3 3 2 3 3 3 2 3 3 3 2 3 3 3 4 4 3 4 4 3 2 2 3 4 4 4 3 2 3 4 4 3 2 2 3 3 3 2 2 3 3 3 4 3 3 3 3 4 3 3 4 3 3 3 3 3 3 3 3 2 2 2 2 3 4 5 5 3 2 2
1807BjJJj%%Jj%J%J%Jjj%%%%%%%%%K%%j%jJ%%%%J%%j%%%j%JjkJ%J%%j%%%%%JJ%%j%j%J%%%
$$ 2 1 2 3 2 2 2 3 2 2 3 3 4 4 5 4 3 3 3 3 3 3 3 3 3 3 5 5 5 4 4 3 4 4 4 4 4 5 5 5 4 4 4 4 3 3 4 3 1 2 2 3 3 3 2 2 2 2 2 2 3 4 4 4 3 3 2 2 3 3 3 3
1797C%%%%%%%jJK%jj%%%%J%j%%%%J%j%Jj%J%J%jjJ%jj%J%%%%%%Jj%J%J%%%j%%J%%j%j%j%%
$$ 3 3 3 3 3 3 3 3 2 3 5 5 4 3 3 3 3 3 4 4 3 3 3 3 3 4 4 3 3 4 3 3 4 4 5 5 4 3 4 4 3 2 2 3 3 3 3 3 3 3 4 3 3 4 4 5 5 5 5 4 4 4 5 5 5 4 4 3 3 2 2 2
1786B%JkJ%%%JJ%%%j%%%%%%jJ%Jj%%J%%%j%J%%%%%%%%%%J%%%J%%j%j%%%%%J%j%%%j%jJ%J%
$$ 2 2 3 1 2 2 2 2 3 4 4 4 4 3 3 3 3 3 3 3 2 3 3 4 3 3 3 4 4 4 4 3 3 4 4 4 4 4 4 4 4 4 4 4 5 5 5 5 6 6 6 5 5 4 4 4 4 4 4 5 5 4 4 4 4 3 3 2 3 3 4 4
1775D%%%%J%%j%J%J%JjJ%%j%J%%j%%%%k%j%jJ%JJ%%%jj%%%%J%JjjJJ%%%j%j%%%JJjj%J%%J
$$ 4 4 4 4 4 5 5 5 4 4 5 5 6 6 7 6 7 7 7 6 6 7 7 7 6 6 6 6 6 4 4 3 3 2 3 3 4 5 5 5 5 4 3 3 3 3 3 4 4 5 4 3 4 5 5 5 5 4 4 3 3 3 3 4 5 4 3 3 4 4 4 5
1764EJjjj%jjJJj%jJ%%%%%%%J%%%%%%%jJJj%%%%%%%%%J%%%%%%j%j%%J%%%%j%%J%%%j%J%j%
$$ 5 6 5 4 3 3 2 1 2 3 2 2 1 2 2 2 2 2 2 2 2 3 3 3 3 3 3 3 3 2 3 4 3 3 3 3 3 3 3 3 3 3 4 4 4 4 4 4 4 3 3 2 2 2 3 3 3 3 3 2 2 2 3 3 3 3 2 2 3 3 2 2
1753B%J%%%%j%%jKJj%j%%%%%%%%J%Jj%%%%%Jj%j%jJJ%j%%%Jj%J%%%%%%%%jJ%%jJJ%%Jjk%j
$$ 2 2 3 3 3 3 3 2 2 2 1 3 4 3 3 2 2 2 2 2 2 2 2 2 3 3 4 3 3 3 3 3 3 4 3 3 2 2 1 2 3 3 2 2 2 2 3 2 2 3 3 3 3 3 3 3 3 3 2 3 3 3 2 3 4 4 4 5 4 2 2 1
1742A%%J%J%%%%%JJ%%%j%jj%J%JJ%jj%%%%%Jjjj%J%%%%%J%j%%J%%J%%%%%jj%%jjJ%%%JJj%
$$ 1 1 1 2 2 3 3 3 3 3 3 4 5 5 5 5 4 4 3 2 2 3 3 4 5 5 4 3 3 3 3 3 3 4 3 2 1 1 2 2 2 2 2 2 3 3 2 2 2 3 3 3 4 4 4 4 4 4 3 2 2 2 1 0 1 1 1 1 2 3 2 2
1732B%%%%jJJJjj%%%%j%%%%%JJ%%%%%%%%%jjJ%%%J%%%%%j%%%J%%j%JJjj%%%jJ%%%%J%j%%%
$$ 2 2 2 2 2 1 2 3 4 3 2 2 2 2 2 1 1 1 1 1 1 2 3 3 3 3 3 3 3 3 3 3 2 1 2 2 2 2 3 3 3 3 3 3 2 2 2 2 3 3 3 2 2 3 4 3 2 2 2 2 1 2 2 2 2 2 3 3 2 2 2 2
1721BJ%%%%%j%%J%%%%%%%j%%jJ%%JJj%%%%%%j%%%%%JJj%j%%J%%%jJ%%%%J%%jj%J%Jjj%%%j
$$ 2 3 3 3 3 3 3 2 2 2 3 3 3 3 3 3 3 3 2 2 2 1 2 2 2 3 4 3 3 3 3 3 3 3 2 2 2 2 2 2 3 4 3 3 2 2 2 3 3 3 3 2 3 3 3 3 3 4 4 4 3 2 2 3 3 4 3 2 2 2 2 1
1710AJJ%kJJ%j%J%%%Jj%j%%JJ%%%j%%%%%%%Jj%%%%%JJjj%j%J%jJ%%%Jj%j%j%%J%%%%%%%%j
$$ 1 2 3 3 1 2 3 3 2 2 3 3 3 3 4 3 3 2 2 2 3 4 4 4 4 3 3 3 3 3 3 3 3 4 3 3 3 3 3 3 4 5 4 3 3 2 2 3 3 2 3 3 3 3 4 3 3 2 2 1 1 1 2 2 2 2 2 2 2 2 2 1
1699AJJ%%%%%%jJJ%Jj%%%J%%j%%%%jjJJj%%j%j%%%%%%%%J%%%%Jj%%%%%%%j%K%j%%%%j%%%K
$$ 1 2 3 3 3 3 3 3 3 2 3 4 4 5 4 4 4 4 5 5 5 4 4 4 4 4 3 2 3 4 3 3 3 2 2 1 1 1 1 1 1 1 1 1 2 2 2 2 2 3 2 2 2 2 2 2 2 2 1 1 3 3 2 2 2 2 2 1 1 1 1 3
1688C%%JjJ%j%j%jJJjJ%J%jj%J%%%%jj%%J%%%%%%%JJjj%%%JJj%%%%jjJ%JJj%jJJ%jj%J%%j
$$ 3 3 3 4 3 4 4 3 3 2 2 1 2 3 2 3 3 4 4 3 2 2 3 3 3 3 3 2 1 1 1 2 2 2 2 2 2 2 2 3 4 3 2 2 2 2 3 4 3 3 3 3 3 2 1 2 2 3 4 3 3 2 3 4 4 3 2 2 3 3 3 2
1677B%JJ%j%%jjJ%%JJ%j%%%j%JJ%%j%%%%J%%Jjj%%j%J%jJjjJ%%jJJjJ%%jJ%%%%jJ%%J%j%%
$$ 2 2 3 4 4 3 3 3 2 1 2 2 2 3 4 4 3 3 3 3 2 2 3 4 4 4 3 3 3 3 3 4 4 4 5 4 3 3 3 2 2 3 3 2 3 2 1 2 2 2 1 2 3 2 3 3 3 2 3 3 3 3 3 2 3 3 3 4 4 3 3 3
1667CjjJ%%J%%j%%%j%jJ%%jKJJkjJ%%%%%%%%%%%%%%Jjj%%K%jJ%%%j%%%%%J%%%%%j%%%jJ%%
$$ 3 2 1 2 2 2 3 3 3 2 2 2 2 1 1 0 1 1 1 0 2 3 4 2 1 2 2 2 2 2 2 2 2 2 2 2 2 2 2 2 3 2 1 1 1 3 3 2 3 3 3 3 2 2 2 2 2 2 3 3 3 3 3 3 2 2 2 2 1 2 2 2
1656B%jJ%%J%Jj%%%%%J%j%%%j%%%%%%JJ%%%%%%kjJ%JJj%j%%j%%KJjjj%JJ%kjJJJj%J%%jJ%
$$ 2 2 1 2 2 2 3 3 4 3 3 3 3 3 3 4 4 3 3 3 3 2 2 2 2 2 2 2 3 4 4 4 4 4 4 4 2 1 2 2 3 4 3 3 2 2 2 1 1 1 3 4 3 2 1 1 2 3 3 1 0 1 2 3 2 2 3 3 3 2 3 3
1645C%%%%%jjJ%jJ%j%J%JJ%%j%%J%jJjjJJJj%j%%%J%%j%%%J%%%%j%%%%%%jJJj%%%%%j%J%%
$$ 3 3 3 3 3 3 2 1 2 2 1 2 2 1 1 2 2 3 4 4 4 3 3 3 4 4 3 4 3 2 3 4 5 4 4 3 3 3 3 4 4 4 3 3 3 3 4 4 4 4 4 3 3 3 3 3 3 3 2 3 4 3 3 3 3 3 3 2 2 3 3 3
1634Cj%%J%JJ%%j%%j%jJJJk%%%%%Jjj%%J%%j%%Jj%%%J%%j%J%%%%J%j%%%J%j%%%%%%%%j%J%
$$ 3 2 2 2 3 3 4 5 5 5 4 4 4 3 3 2 3 4 5 3 3 3 3 3 3 4 3 2 2 2 3 3 3 2 2 2 3 2 2 2 2 3 3 3 2 2 3 3 3 3 3 4 4 3 3 3 3 4 4 3 3 3 3 3 3 3 3 3 2 2 3 3
1623C%%Jj%%jj%%J%%J%%j%%jJ%%JJj%j%JjJJ%%%%j%%%%%%j%%%%%%%%%%Jj%%JJjJ%%j%%%j%
$$ 3 3 3 4 3 3 3 2 1 1 1 2 2 2 3 3 3 2 2 2 1 2 2 2 3 4 3 3 2 2 3 2 3 4 4 4 4 4 3 3 3 3 3 3 3 2 2 2 2 2 2 2 2 2 2 2 3 2 2 2 3 4 3 4 4 4 3 3 3 3 2 2
1612B%%j%%%%K%j%%%%%%%%%j%JJJJj%%J%jj%%%%Jj%%jJ%%%j%J%%%j%j%%J%J%%%%j%%%%%%j
$$ 2 2 2 1 1 1 1 1 3 3 2 2 2 2 2 2 2 2 2 2 1 1 2 3 4 5 4 4 4 5 5 4 3 3 3 3 3 4 3 3 3 2 3 3 3 3 2 2 3 3 3 3 2 2 1 1 1 2 2 3 3 3 3 3 2 2 2 2 2 2 2 1
1602AJJ%%%%%%%j%j%JJ%j%JjJ%%%J%jj%Jj%J%%Jj%jJ%%jj%KJjj%%J%%kJJJ%%%%%%%%j%j%%
$$ 1 2 3 3 3 3 3 3 3 3 2 2 1 1 2 3 3 2 2 3 2 3 3 3 3 4 4 3 2 2 3 2 2 3 3 3 4 3 3 2 3 3 3 2 1 1 3 4 3 2 2 2 3 3 3 1 2 3 4 4 4 4 4 4 4 4 4 3 3 2 2 2
1591B%J%%%%J%%j%jJj%Jj%%JJ%j%%%%j%%JJ%%%Jjj%%%%%%%%jJ%JjJ%%%jj%JJjJjjJ%%j%%%
$$ 2 2 3 3 3 3 3 4 4 4 3 3 2 3 2 2 3 2 2 2 3 4 4 3 3 3 3 3 2 2 2 3 4 4 4 4 5 4 3 3 3 3 3 3 3 3 3 2 3 3 4 3 4 4 4 4 3 2 2 3 4 3 4 3 2 3 3 3 2 2 2 2
1580B%%%J%j%%%%%%%%j%JJJk%%%%%Jj%%%%%j%J%JJ%%jj%%%J%j%%J%j%j%JJ%%%jJ%%%%J%%%
$$ 2 2 2 2 3 3 2 2 2 2 2 2 2 2 2 1 1 2 3 4 2 2 2 2 2 2 3 2 2 2 2 2 2 1 1 2 2 3 4 4 4 3 2 2 2 2 3 3 2 2 2 3 3 2 2 1 1 2 3 3 3 3 2 3 3 3 3 3 4 4 4 4
1569D%j%%%%Jj%%%%J%%j%%%%%j%%%JJj%j%%jJ%%%%%j%%J%j%J%%J%%Jj%%j%%%%%J%jJJjjJ%
$$ 4 4 3 3 3 3 3 4 3 3 3 3 3 4 4 4 3 3 3 3 3 3 2 2 2 2 3 4 3 3 2 2 2 1 2 2 2 2 2 2 1 1 1 2 2 1 1 2 2 2 3 3 3 4 3 3 3 2 2 2 2 2 2 3 3 2 3 4 3 2 3 3
1558C%%%%%jJJj%%%%%%%%%J%j%%Jj%j%%%%%%J%%%j%%%J%%%%%%%%%j%%%%%J%%%jJ%%%%%%j%
$$ 3 3 3 3 3 3 2 3 4 3 3 3 3 3 3 3 3 3 3 4 4 3 3 3 4 3 3 2 2 2 2 2 2 2 3 3 3 3 2 2 2 2 3 3 3 3 3 3 3 3 3 3 2 2 2 2 2 2 3 3 3 3 2 3 3 3 3 3 3 3 2 2
1547BJj%%%%%%%JJ%j%%%%j%%%J%jj%J%%j%JJJj%j%J%%j%j%%%JJ%j%jJJJJj%jjJJj%%%%%%%
$$ 2 3 2 2 2 2 2 2 2 2 3 4 4 3 3 3 3 3 2 2 2 2 3 3 2 1 1 2 2 2 1 1 2 3 4 3 3 2 2 3 3 3 2 2 1 1 1 1 2 3 3 2 2 1 2 3 4 5 4 4 3 2 3 4 3 3 3 3 3 3 3 3
1537C%j%%%%JJjj%j%Jj%%K%j%%%%jJK%%%%%jj%%%%jj%JK%%%%jJJ%%%%%j%j%%Jj%J%%jjJ%%
$$ 3 3 2 2 2 2 2 3 4 3 2 2 1 1 2 1 1 1 3 3 2 2 2 2 2 1 2 4 4 4 4 4 4 3 2 2 2 2 2 1 0 0 1 3 3 3 3 3 2 3 4 4 4 4 4 4 3 3 2 2 2 3 2 2 3 3 3 2 1 2 2 2
1526B%%%jjJ%%K%%%jJ%%jJ%%J%j%j%j%J%%%%%J%%%%%%%j%%%J%Jjj%J%J%%%jjJ%jj%%%J%%%
$$ 2 2 2 2 1 0 1 1 1 3 3 3 3 2 3 3 3 2 3 3 3 4 4 3 3 2 2 1 1 2 2 2 2 2 2 3 3 3 3 3 3 3 3 2 2 2 2 3 3 4 3 2 2 3 3 4 4 4 4 3 2 3 3 2 1 1 1 1 2 2 2 2
1515B%J%Jj%%%%%Jj%%%%%%%%%%Jjj%%J%%%j%%%%%%jjJ%%K%%j%Jj%%j%%%%%%%J%%J%%j%J%%
$$ 2 2 3 3 4 3 3 3 3 3 3 4 3 3 3 3 3 3 3 3 3 3 3 4 3 2 2 2 3 3 3 3 2 2 2 2 2 2 2 1 0 1 1 1 3 3 3 2 2 3 2 2 2 1 1 1 1 1 1 1 1 2 2 2 3 3 3 2 2 3 3 3
1504CjjJ%Jj%%%%%%%KJjj%jJjj%J%%%%JJjJjj%JJjj%J%%%j%%%%%%%JJjjJj%j%J%%%%jJ%J%
$$ 3 2 1 2 2 3 2 2 2 2 2 2 2 2 4 5 4 3 3 2 3 2 1 1 2 2 2 2 2 3 4 3 4 3 2 2 3 4 3 2 2 3 3 3 3 2 2 2 2 2 2 2 2 3 4 3 2 3 2 2 1 1 2 2 2 2 2 1 2 2 3 3
1493Cj%%%%J%JjjJ%J%%%%%jj%Jj%%%JJJjk%%j%jJJ%%%jJ%%jJJ%%%%j%%%%%%J%Jjj%%J%%Jj
$$ 3 2 2 2 2 2 3 3 4 3 2 3 3 4 4 4 4 4 4 3 2 2 3 2 2 2 2 3 4 5 4 2 2 2 1 1 0 1 2 2 2 2 1 2 2 2 1 2 3 3 3 3 3 2 2 2 2 2 2 2 3 3 4 3 2 2 2 3 3 3 4 3
1482C%%%%j%%%%%%%jJJ%j%%%%%%j%%%J%%%%%j%J%J%%%j%%%%%%%%%J%%%%jJ%j%%Jj%%%%J%%
$$ 3 3 3 3 3 2 2 2 2 2 2 2 2 1 2 3 3 2 2 2 2 2 2 2 1 1 1 1 2 2 2 2 2 2 1 1 2 2 3 3 3 3 2 2 2 2 2 2 2 2 2 2 3 3 3 3 3 2 3 3 2 2 2 3 2 2 2 2 2 3 3 3
1472C%%%jJ%%%%j%%%j%%KJj%%%%%Kj%%%%%j%%%%%jJ%jJ%%%%%%%%%%%%%%j%%%%Jj%%Jj%j%%
$$ 3 3 3 3 2 3 3 3 3 3 2 2 2 2 1 1 1 3 4 3 3 3 3 3 3 5 4 4 4 4 4 4 3 3 3 3 3 3 2 3 3 2 3 3 3 3 3 3 3 3 3 3 3 3 3 3 3 2 2 2 2 2 3 2 2 2 3 2 2 1 1 1
1461AJ%%J%%%j%J%%j%J%%%%%jjJ%%%jJ%%%%%Jj%%%J%%j%%jJ%JJ%j%%kJ%J%%jjJ%%Jj%J%%j
$$ 1 2 2 2 3 3 3 3 2 2 3 3 3 2 2 3 3 3 3 3 3 2 1 2 2 2 2 1 2 2 2 2 2 2 3 2 2 2 2 3 3 3 2 2 2 1 2 2 3 4 4 3 3 3 1 2 2 3 3 3 2 1 2 2 2 3 2 2 3 3 3 2
1450B%J%%%%j%%%j%JJj%%j%%%JJ%%Jj%%%%j%%J%%%%%Jj%%%j%%%Jj%%%%J%%%%%%jjJ%%%J%%
$$ 2 2 3 3 3 3 3 2 2 2 2 1 1 2 3 2 2 2 1 1 1 1 2 3 3 3 4 3 3 3 3 3 2 2 2 3 3 3 3 3 3 4 3 3 3 3 2 2 2 2 3 2 2 2 2 2 3 3 3 3 3 3 3 2 1 2 2 2 2 3 3 3
1439CjJ%j%%%JJj%%%%%%%Jj%jj%%J%%%%%jJ%%%%%JJ%j%%%Jjj%Jj%jKJjJj%%jJ%%%%%%%%%%
$$ 3 2 3 3 2 2 2 2 3 4 3 3 3 3 3 3 3 3 4 3 3 2 1 1 1 2 2 2 2 2 2 1 2 2 2 2 2 2 3 4 4 3 3 3 3 4 3 2 2 3 2 2 1 3 4 3 4 3 3 3 2 3 3 3 3 3 3 3 3 3 3 3
1428Cj%J%%jj%Jjj%JJ%JjjJ%%J%kj%JJJJjj%JjjJ%%Jj%%%%Jj%%J%j%%%J%%%%jK%jj%j%%J%
$$ 3 2 2 3 3 3 2 1 1 2 1 0 0 1 2 2 3 2 1 2 2 2 3 3 1 0 0 1 2 3 4 3 2 2 3 2 1 2 2 2 3 2 2 2 2 2 3 2 2 2 3 3 2 2 2 2 3 3 3 3 3 2 4 4 3 2 2 1 1 1 2 2
1417B%J%j%%%%%%J%%jj%%J%%JKjj%%%%%%jJ%%%%J%jjJJjjjJJ%%%kjJ%J%J%%%j%%JjjjJJj%
$$ 2 2 3 3 2 2 2 2 2 2 2 3 3 3 2 1 1 1 2 2 2 3 5 4 3 3 3 3 3 3 3 2 3 3 3 3 3 4 4 3 2 3 4 3 2 1 2 3 3 3 3 1 0 1 1 2 2 3 3 3 3 2 2 2 3 2 1 0 1 2 1 1
1407A%J%%%J%j%J%%jj%J%%%j%J%%J%Jj%%%Jjj%%J%%%%%j%%%%J%jJ%%Jj%%%%%%%%%jJ%jJJj
$$ 1 1 2 2 2 2 3 3 2 2 3 3 3 2 1 1 2 2 2 2 1 1 2 2 2 3 3 4 3 3 3 3 4 3 2 2 2 3 3 3 3 3 3 2 2 2 2 2 3 3 2 3 3 3 4 3 3 3 3 3 3 3 3 3 3 2 3 3 2 3 4 3
1396C%%%%j%%%%J%%j%J%%j%%JJ%jk%%JJ%jJ%JJj%j%%Jj%%%%%j%%JjJJ%j%%%%%%%%%%%%%%%
$$ 3 3 3 3 3 2 2 2 2 2 3 3 3 2 2 3 3 3 2 2 2 3 4 4 3 1 1 1 2 3 3 2 3 3 4 5 4 4 3 3 3 4 3 3 3 3 3 3 2 2 2 3 2 3 4 4 3 3 3 3 3 3 3 3 3 3 3 3 3 3 3 3
1385C%%J%jj%J%%j%%J%%%%%%J%%%jj%J%jJJ%%%%%j%%%jJ%%jJ%j%%JJjj%%j%J%J%j%J%%j%%
$$ 3 3 3 4 4 3 2 2 3 3 3 2 2 2 3 3 3 3 3 3 3 4 4 4 4 3 2 2 3 3 2 3 4 4 4 4 4 4 3 3 3 3 2 3 3 3 2 3 3 2 2 2 3 4 3 2 2 2 1 1 2 2 3 3 2 2 3 3 3 2 2 2
1374BJ%%%%%%jJ%%%%%J%%%%jjJJ%%%%%%j%%j%%%J%J%%j%J%%%j%j%%%%%%Jj%Jj%%K%%%%k%j
$$ 2 3 3 3 3 3 3 3 2 3 3 3 3 3 3 4 4 4 4 4 3 2 3 4 4 4 4 4 4 4 3 3 3 2 2 2 2 3 3 4 4 4 3 3 4 4 4 4 3 3 2 2 2 2 2 2 2 3 2 2 3 2 2 2 4 4 4 4 4 2 2 1
1363A%J%%%%%%jjJJ%J%%jj%JJJjJ%jjj%JJ%%j%%%J%Jjj%%J%%%jj%KJj%%J%%j%%%jJ%J%j%%
$$ 1 1 2 2 2 2 2 2 2 1 0 1 2 2 3 3 3 2 1 1 2 3 4 3 4 4 3 2 1 1 2 3 3 3 2 2 2 2 3 3 4 3 2 2 2 3 3 3 3 2 1 1 3 4 3 3 3 4 4 4 3 3 3 3 2 3 3 4 4 3 3 3
1352C%%%%JJ%j%%%jj%%%%J%j%K%jJ%J%j%%jJ%Jj%%%%%jjJJ%%jjjJJJ%j%J%%%%J%j%jJJ%jj
$$ 3 3 3 3 3 4 5 5 4 4 4 4 3 2 2 2 2 2 3 3 2 2 4 4 3 4 4 5 5 4 4 4 3 4 4 5 4 4 4 4 4 4 3 2 3 4 4 4 3 2 1 2 3 4 4 3 3 4 4 4 4 4 5 5 4 4 3 4 5 5 4 3
1342CJ%%j%JjjJ%%%j%%J%%%%J%j%%%%%%%j%JJ%%jj%%%%%J%jJ%J%%%jJJ%jj%%j%%Jj%j%%J%
$$ 3 4 4 4 3 3 4 3 2 3 3 3 3 2 2 2 3 3 3 3 3 4 4 3 3 3 3 3 3 3 3 2 2 3 4 4 4 3 2 2 2 2 2 2 3 3 2 3 3 4 4 4 4 3 4 5 5 4 3 3 3 2 2 2 3 2 2 1 1 1 2 2
1331BJ%j%J%%%%%J%%%j%%%j%JJ%J%%jj%%J%jjJ%j%%jJ%jJ%%%J%%%%%%j%%%%J%jjj%JJJ%%J
$$ 2 3 3 2 2 3 3 3 3 3 3 4 4 4 4 3 3 3 3 2 2 3 4 4 5 5 5 4 3 3 3 4 4 3 2 3 3 2 2 2 1 2 2 1 2 2 2 2 3 3 3 3 3 3 3 2 2 2 2 2 3 3 2 1 0 0 1 2 3 3 3 4
1320Dj%j%%%J%%jJ%Jjj%%jJJ%j%%J%j%%%%JJjj%%%JJj%%%%j%%J%jj%K%%%j%J%%j%%%J%J%j
$$ 4 3 3 2 2 2 2 3 3 3 2 3 3 4 3 2 2 2 1 2 3 3 2 2 2 3 3 2 2 2 2 2 3 4 3 2 2 2 2 3 4 3 3 3 3 3 2 2 2 3 3 2 1 1 3 3 3 3 2 2 3 3 3 2 2 2 2 3 3 4 4 3
1309C%%j%J%%jJ%%%j%%j%J%JJ%%%j%J%%%j%%%%j%j%%JJ%%%%j%jJJ%%%%j%J%jjjKJJ%j%j%%
$$ 3 3 3 2 2 3 3 3 2 3 3 3 3 2 2 2 1 1 2 2 3 4 4 4 4 3 3 4 4 4 4 3 3 3 3 3 2 2 1 1 1 2 3 3 3 3 3 2 2 1 2 3 3 3 3 3 2 2 3 3 2 1 0 2 3 4 4 3 3 2 2 2
1298Bj%J%K%%%%jjj%J%Jj%%J%Jjj%%j%%J%J%%j%J%%%jJ%Jj%%%%j%Jj%%J%%%j%j%%J%%%%jJ
$$ 2 1 1 2 2 4 4 4 4 4 3 2 1 1 2 2 3 2 2 2 3 3 4 3 2 2 2 1 1 1 2 2 3 3 3 2 2 3 3 3 3 2 3 3 4 3 3 3 3 3 2 2 3 2 2 2 3 3 3 3 2 2 1 1 1 2 2 2 2 2 1 2
1287B%J%jJj%%%%jJ%JJ%%%j%%%jJj%%K%j%%%%%%J%j%%%%%j%jJ%J%%j%%j%J%JJj%%%%J%jJ%
$$ 2 2 3 3 2 3 2 2 2 2 2 1 2 2 3 4 4 4 4 3 3 3 3 2 3 2 2 2 4 4 3 3 3 3 3 3 3 4 4 3 3 3 3 3 3 2 2 1 2 2 3 3 3 2 2 2 1 1 2 2 3 4 3 3 3 3 3 4 4 3 4 4
1277Dj%j%%%j%%%%%J%%%%%j%%%%%%J%%J%%%%%%j%%%%J%%%jkJ%%J%Jj%%%%J%Jj%%%%%%j%%%
$$ 4 3 3 2 2 2 2 1 1 1 1 1 1 2 2 2 2 2 2 1 1 1 1 1 1 1 2 2 2 3 3 3 3 3 3 3 2 2 2 2 2 3 3 3 3 2 0 1 1 1 2 2 3 2 2 2 2 2 3 3 4 3 3 3 3 3 3 3 2 2 2 2
1266BJ%%jk%%JJ%%%J%J%%jj%%J%%%%%%jJ%%J%%jj%%%%%%%%%%J%j%j%%J%%%%jJ%%J%JjjjJJ
$$ 2 3 3 3 2 0 0 0 1 2 2 2 2 3 3 4 4 4 3 2 2 2 3 3 3 3 3 3 3 2 3 3 3 4 4 4 3 2 2 2 2 2 2 2 2 2 2 2 3 3 2 2 1 1 1 2 2 2 2 2 1 2 2 2 3 3 4 3 2 1 2 3
1255CJ%%%%%j%J%%j%j%%%%%%JJJ%%%J%kjj%j%J%%J%%%%%%%%%%%%j%j%J%JJ%%kjJJ%Jj%%%%
$$ 3 4 4 4 4 4 4 3 3 4 4 4 3 3 2 2 2 2 2 2 2 3 4 5 5 5 5 6 6 4 3 2 2 1 1 2 2 2 3 3 3 3 3 3 3 3 3 3 3 3 3 2 2 1 1 2 2 3 4 4 4 2 1 2 3 3 4 3 3 3 3 3
1244C%%%%%%%%jJ%%%%j%j%Jj%JJJ%jjj%%K%%%%%%%%%J%%%%jj%%%%JjJj%Jjj%%%%%%J%%j%%
$$ 3 3 3 3 3 3 3 3 3 2 3 3 3 3 3 2 2 1 1 2 1 1 2 3 4 4 3 2 1 1 1 3 3 3 3 3 3 3 3 3 3 4 4 4 4 4 3 2 2 2 2 2 3 2 3 2 2 3 2 1 1 1 1 1 1 1 2 2 2 1 1 1
1233AJJ%Jk%%j%%J%%%%%%j%J%K%%j%J%%%jj%J%%%%%jj%%J%%J%%%j%%J%jJJ%k%%%Jj%%jJJ%
$$ 1 2 3 3 4 2 2 2 1 1 1 2 2 2 2 2 2 2 1 1 2 2 4 4 4 3 3 4 4 4 4 3 2 2 3 3 3 3 3 3 2 1 1 1 2 2 2 3 3 3 3 2 2 2 3 3 2 3 4 4 2 2 2 2 3 2 2 2 1 2 3 3
1222CJ%jj%J%J%%%%%%%%jJ%%%jjJJJj%jjJJ%%jjJJ%%%jj%%JJj%%%jJ%%K%jj%%%%j%%Jj%JJ
$$ 3 4 4 3 2 2 3 3 4 4 4 4 4 4 4 4 4 3 4 4 4 4 3 2 3 4 5 4 4 3 2 3 4 4 4 3 2 3 4 4 4 4 3 2 2 2 3 4 3 3 3 3 2 3 3 3 5 5 4 3 3 3 3 3 2 2 2 3 2 2 3 4
1212D%%%%%%%J%%%%%%jK%%%jj%%J%%%%jJj%%%%jJJ%%%%%j%K%%jj%jJ%%jjJj%%%JJjj%J%%%
$$ 4 4 4 4 4 4 4 4 5 5 5 5 5 5 5 4 6 6 6 6 5 4 4 4 5 5 5 5 5 4 5 4 4 4 4 4 3 4 5 5 5 5 5 5 4 4 6 6 6 5 4 4 3 4 4 4 3 2 3 2 2 2 2 3 4 3 2 2 3 3 3 3
1201C%j%%%%%J%J%%k%JjJj%%%%%j%%JJjjJJ%%j%%%%%%%J%%jj%%J%J%%%Jj%j%%jJJJ%%j%%%
$$ 3 3 2 2 2 2 2 2 3 3 4 4 4 2 2 3 2 3 2 2 2 2 2 2 1 1 1 2 3 2 1 2 3 3 3 2 2 2 2 2 2 2 2 3 3 3 2 1 1 1 2 2 3 3 3 3 4 3 3 2 2 2 1 2 3 4 4 4 3 3 3 3
1190C%jjK%j%%%%%%%%%J%%j%jJjjJ%J%%Jj%Jj%jJJ%Jj%Jj%%jJ%%jj%J%%%j%%JJJjJJjjj%%
$$ 3 3 2 1 3 3 2 2 2 2 2 2 2 2 2 2 3 3 3 2 2 1 2 1 0 1 1 2 2 2 3 2 2 3 2 2 1 2 3 3 4 3 3 4 3 3 3 2 3 3 3 2 1 1 2 2 2 2 1 1 1 2 3 4 3 4 5 4 3 2 2 2
1179B%%%JJJ%k%%%%%J%j%jjJ%%%jjJJJJJj%%jjJ%%j%%%J%jJK%k%J%jj%j%JJJ%%%jj%%%%JJ
$$ 2 2 2 2 3 4 5 5 3 3 3 3 3 3 4 4 3 3 2 1 2 2 2 2 1 0 1 2 3 4 5 4 4 4 3 2 3 3 3 2 2 2 2 3 3 2 3 5 5 3 3 4 4 3 2 2 1 1 2 3 4 4 4 4 3 2 2 2 2 2 3 4
1168DkJ%%%j%Jjj%%J%%%jKJj%%j%J%%j%%%JJ%%j%%Jj%jJ%%%%j%%J%%Jjj%JJ%j%%%%%%%%%J
$$ 4 2 3 3 3 3 2 2 3 2 1 1 1 2 2 2 2 1 3 4 3 3 3 2 2 3 3 3 2 2 2 2 3 4 4 4 3 3 3 4 3 3 2 3 3 3 3 3 2 2 2 3 3 3 4 3 2 2 3 4 4 3 3 3 3 3 3 3 3 3 3 4
1157DJ%jjjJ%%J%%%%J%%%j%%%j%J%j%j%jjKJJ%j%J%j%%%%J%%j%%%%%%%j%J%%%%%%%%J%%%j
$$ 4 5 5 4 3 2 3 3 3 4 4 4 4 4 5 5 5 5 4 4 4 4 3 3 4 4 3 3 2 2 1 0 2 3 4 4 3 3 4 4 3 3 3 3 3 4 4 4 3 3 3 3 3 3 3 3 2 2 3 3 3 3 3 3 3 3 3 4 4 4 4 3
1146C%%%%%%JJjk%JJ%JJ%j%j%j%%kK%%%%%JJkJ%%jJ%%%%%%JjjjjJ%%%%J%J%%%%%Jjj%%J%%
$$ 3 3 3 3 3 3 3 4 5 4 2 2 3 4 4 5 6 6 5 5 4 4 3 3 3 1 3 3 3 3 3 3 4 5 3 4 4 4 3 4 4 4 4 4 4 4 5 4 3 2 1 2 2 2 2 2 3 3 4 4 4 4 4 4 5 4 3 3 3 4 4 4
1136D%%j%J%j%%J%%%%jJ%J%%j%KJj%%JJ%%%Jj%j%jkkJ%J%J%%%%j%%%%%%J%%j%j%%j%%JJKJ
$$ 4 4 4 3 3 4 4 3 3 3 4 4 4 4 4 3 4 4 5 5 5 4 4 6 7 6 6 6 7 8 8 8 8 9 8 8 7 7 6 4 2 3 3 4 4 5 5 5 5 5 4 4 4 4 4 4 4 5 5 5 4 4 3 3 3 2 2 2 3 4 6 7
1125Gj%%%%%j%%%%%%JJJ%j%%%jj%%j%%J%jj%%%Jj%%J%J%%%%j%%j%%%%%%%%%%%%%JjJ%%%Jj
$$ 7 6 6 6 6 6 6 5 5 5 5 5 5 5 6 7 8 8 7 7 7 7 6 5 5 5 4 4 4 5 5 4 3 3 3 3 4 3 3 3 4 4 5 5 5 5 5 4 4 4 3 3 3 3 3 3 3 3 3 3 3 3 3 3 4 3 4 4 4 4 5 4
1114Dj%%J%Jj%%%J%%JJjj%%J%J%jj%%j%%j%jJ%%j%%J%j%JJJ%%%%%%%%%%%%%J%%%jJJ%%J%%
$$ 4 3 3 3 4 4 5 4 4 4 4 5 5 5 6 7 6 5 5 5 6 6 7 7 6 5 5 5 4 4 4 3 3 2 3 3 3 2 2 2 3 3 2 2 3 4 5 5 5 5 5 5 5 5 5 5 5 5 5 5 6 6 6 6 5 6 7 7 7 8 8 8
1103Hj%j%%j%%j%%%%%%jJJj%%%JJ%%%jjj%%%%JJ%%%%%%%J%%j%%%jj%%J%%%%%%%%%%J%jjJ%
$$ 8 7 7 6 6 6 5 5 5 4 4 4 4 4 4 4 3 4 5 4 4 4 4 5 6 6 6 6 5 4 3 3 3 3 3 4 5 5 5 5 5 5 5 5 6 6 6 5 5 5 5 4 3 3 3 4 4 4 4 4 4 4 4 4 4 4 5 5 4 3 4 4
1092D%Jj%jJ%%%J%j%%%j%K%kJj%%%%J%jJ%%%%%%%%Jjj%JJ%%%%%%%%%%j%%%%%%j%%%%jJ%J%
$$ 4 4 5 4 4 3 4 4 4 4 5 5 4 4 4 4 3 3 5 5 3 4 3 3 3 3 3 4 4 3 4 4 4 4 4 4 4 4 4 5 4 3 3 4 5 5 5 5 5 5 5 5 5 5 5 4 4 4 4 4 4 4 3 3 3 3 3 2 3 3 4 4
1081D%%%%%j%JjjJ%%%%JjJJ%%j%%%%J%%jjJJJ%jjjj%JJ%%j%%J%%%j%j%%%J%J%%%%%j%%%%%
$$ 4 4 4 4 4 4 3 3 4 3 2 3 3 3 3 3 4 3 4 5 5 5 4 4 4 4 4 5 5 5 4 3 4 5 6 6 5 4 3 2 2 3 4 4 4 3 3 3 4 4 4 4 3 3 2 2 2 2 3 3 4 4 4 4 4 4 3 3 3 3 3 3
1071C%%%JJ%Jj%%JJJjjkj%%%jJjJJ%%%j%%J%%kJ%jJ%Jj%%J%%j%JJjjJ%%%%Jj%j%JJJjj%%%
$$ 3 3 3 3 4 5 5 6 5 5 5 6 7 8 7 6 4 3 3 3 3 2 3 2 3 4 4 4 4 3 3 3 4 4 4 2 3 3 2 3 3 4 3 3 3 4 4 4 3 3 4 5 4 3 4 4 4 4 4 5 4 4 3 3 4 5 6 5 4 4 4 4
1060DJ%%%j%%%%jJJ%%%j%j%%%%J%%%J%%j%%%%Jjjj%JJ%%Jj%%%j%%%J%J%%%%%%%%%%%%Jj%%
$$ 4 5 5 5 5 4 4 4 4 4 3 4 5 5 5 5 4 4 3 3 3 3 3 4 4 4 4 5 5 5 4 4 4 4 4 5 4 3 2 2 3 4 4 4 5 4 4 4 4 3 3 3 3 4 4 5 5 5 5 5 5 5 5 5 5 5 5 5 6 5 5 5
1049E%%%%%%%%%%jJ%J%%jjJ%J%Jj%%Jj%j%J%J%J%%%%j%JJj%%%%j%J%%%JJJjj%j%j%%%%%Jj
$$ 5 5 5 5 5 5 5 5 5 5 5 4 5 5 6 6 6 5 4 5 5 6 6 7 6 6 6 7 6 6 5 5 6 6 7 7 8 8 8 8 8 7 7 8 9 8 8 8 8 8 7 7 8 8 8 8 9 10 11 10 9 9 8 8 7 7 7 7 7 7 8 7
1038G%jJ%%%J%jj%%J%jJJJj%%j%%%%%%%%%jJ%%Jjj%%JJ%j%jj%%%%JJ%%j%%%jJ%J%%%j%%%%
$$ 7 7 6 7 7 7 7 8 8 7 6 6 6 7 7 6 7 8 9 8 8 8 7 7 7 7 7 7 7 7 7 7 6 7 7 7 8 7 6 6 6 7 8 8 7 7 6 5 5 5 5 5 6 7 7 7 6 6 6 6 5 6 6 7 7 7 7 6 6 6 6 6
1027Fj%j%%%J%j%%%%%J%%%%JJ%%jjjJ%%j%K%k%J%JJjj%%%%j%%%%J%%%%j%j%%J%%%jJ%%%%%
$$ 6 5 5 4 4 4 4 5 5 4 4 4 4 4 4 5 5 5 5 5 6 7 7 7 6 5 4 5 5 5 4 4 6 6 4 4 5 5 6 7 6 5 5 5 5 5 4 4 4 4 4 5 5 5 5 5 4 4 3 3 3 4 4 4 4 3 4 4 4 4 4 4
1016D%%j%%%%%J%J%%%JjjJ%%%j%Jj%%%j%J%JJ%%jjJ%j%jJJ%%%%%j%J%%j%%%Jjj%J%%jJ%j%
$$ 4 4 4 3 3 3 3 3 3 4 4 5 5 5 5 6 5 4 5 5 5 5 4 4 5 4 4 4 4 3 3 4 4 5 6 6 6 5 4 5 5 4 4 3 4 5 5 5 5 5 5 4 4 5 5 5 4 4 4 4 5 4 3 3 4 4 4 3 4 4 3 3
1006C%%%J%%%%%%%j%%J%%%%J%j%%%j%%%%J%%%%J%%%%%j%%%%%%jJJj%%jJJ%%%j%%j%j%J%JJ
$$ 3 3 3 3 4 4 4 4 4 4 4 4 3 3 3 4 4 4 4 4 5 5 4 4 4 4 3 3 3 3 3 4 4 4 4 4 5 5 5 5 5 5 4 4 4 4 4 4 4 3 4 5 4 4 4 3 4 5 5 5 5 4 4 4 3 3 2 2 3 3 4 5
995EjjjjJJ%%J%%%%%%%%j%%JjjJ%J%j%J%%%jjjJ%%J%j%%J%%J%Jjj%%%jJ%%J%%j%j%%%j%J%
$$ 5 4 3 2 1 2 3 3 3 4 4 4 4 4 4 4 4 4 3 3 3 4 3 2 3 3 4 4 3 3 4 4 4 4 3 2 1 2 2 2 3 3 2 2 2 3 3 3 4 4 5 4 3 3 3 3 2 3 3 3 4 4 4 3 3 2 2 2 2 1 1 2 2
984B%%%JJJj%j%j%%%%jJ%J%%%%%%Jj%J%%j%J%%%j%%J%j%%K%j%%%%j%J%%%%%J%%j%%%%%%J%
$$ 2 2 2 2 3 4 5 4 4 3 3 2 2 2 2 2 1 2 2 3 3 3 3 3 3 3 4 3 3 4 4 4 3 3 4 4 4 4 3 3 3 4 4 3 3 3 5 5 4 4 4 4 4 3 3 4 4 4 4 4 4 5 5 5 4 4 4 4 4 4 4 5 5
973E%%%jJ%jK%%%%jjjJ%j%%%J%Jjj%%J%%Jjj%%jJJJjJ%%%j%J%jJ%%%%%%%%%%%j%%%%j%Jj%
$$ 5 5 5 5 4 5 5 4 6 6 6 6 6 5 4 3 4 4 3 3 3 3 4 4 5 4 3 3 3 4 4 4 5 4 3 3 3 2 3 4 5 4 5 5 5 5 4 4 5 5 4 5 5 5 5 5 5 5 5 5 5 5 5 4 4 4 4 4 3 3 4 3 3
962CkjJJJ%%%%Jj%%%%J%J%Jj%%J%jj%%j%jKj%%%%%%%J%J%Jjjj%%%%jJ%%%%%%%J%%%%%%jJ%
$$ 3 1 0 1 2 3 3 3 3 3 4 3 3 3 3 3 4 4 5 5 6 5 5 5 6 6 5 4 4 4 3 3 2 4 3 3 3 3 3 3 3 3 4 4 5 5 6 5 4 3 3 3 3 3 2 3 3 3 3 3 3 3 3 4 4 4 4 4 4 4 3 4 4
951D%jJ%%%%j%%j%L%j%jJ%J%k%%%J%%%%jjJJ%%%%%%%%%Jjj%%%%J%%Jj%jJJj%%%J%JjjJjjj
$$ 4 4 3 4 4 4 4 4 3 3 3 2 2 5 5 4 4 3 4 4 5 5 3 3 3 3 4 4 4 4 4 3 2 3 4 4 4 4 4 4 4 4 4 4 5 4 3 3 3 3 3 4 4 4 5 4 4 3 4 5 4 4 4 4 5 5 6 5 4 5 4 3 2
940BJJ%%j%JJj%%%%jj%JJ%%j%J%%%%%%%%%%%%JJjjj%%JJj%%Jj%j%%%J%jjJ%%%%%J%J%jj%%
$$ 2 3 4 4 4 3 3 4 5 4 4 4 4 4 3 2 2 3 4 4 4 3 3 4 4 4 4 4 4 4 4 4 4 4 4 4 5 6 5 4 3 3 3 4 5 4 4 4 5 4 4 3 3 3 3 4 4 3 2 3 3 3 3 3 3 4 4 5 5 4 3 3 3
929C%%%J%%JJ%%j%%%%%%j%J%j%jJ%%J%Jj%%jjjJ%%J%jJJ%%%%jj%%%%J%J%j%Jjj%%%%Jj%%%
$$ 3 3 3 3 4 4 4 5 6 6 6 5 5 5 5 5 5 5 4 4 5 5 4 4 3 4 4 4 5 5 6 5 5 5 4 3 2 3 3 3 4 4 3 4 5 5 5 5 5 4 3 3 3 3 3 4 4 5 5 4 4 5 4 3 3 3 3 3 4 3 3 3 3
918CKJj%%j%%J%%J%j%J%%j%%%J%%j%%%%%%%j%%J%%%%Jj%JjjJj%%J%%J%%%%Jj%%jj%jJ%J%J
$$ 3 5 6 5 5 5 4 4 4 5 5 5 6 6 5 5 6 6 6 5 5 5 5 6 6 6 5 5 5 5 5 5 5 5 4 4 4 5 5 5 5 5 6 5 5 6 5 4 5 4 4 4 5 5 5 6 6 6 6 6 7 6 6 6 5 4 4 3 4 4 5 5 6
907F%%jJ%jjJ%%j%K%j%%Jj%%%%JJJJ%jjJ%jJ%%j%%jJjj%%Jj%jJJ%%%%jJ%j%JJ%JJ%%%%J%J
$$ 6 6 6 5 6 6 5 4 5 5 5 4 4 6 6 5 5 5 6 5 5 5 5 5 6 7 8 9 9 8 7 8 8 7 8 8 8 7 7 7 6 7 6 5 5 5 6 5 5 4 5 6 6 6 6 6 5 6 6 5 5 6 7 7 8 9 9 9 9 9 10 10 11
896A1%%jk%JJjkJjJ%jj%%%%%%j%%%%%%JJ%%j%%J%Jjj%J%Jj%%%k%JjJ%jj%Jj%%%%jJJ%%J%J
$$ 11 11 11 10 8 8 9 10 9 7 8 7 8 8 7 6 6 6 6 6 6 6 5 5 5 5 5 5 5 6 7 7 7 6 6 6 7 7 8 7 6 6 7 7 8 7 7 7 7 5 5 6 5 6 6 5 4 4 5 4 4 4 4 4 3 4 5 5 5 6 6 7
885G%%j%%%%%%j%%Jjj%%%j%%J%%J%j%%%%%J%J%k%Jj%J%%%%jjJ%%J%%%%j%%%%%jJ%%j%%%%J
$$ 7 7 7 6 6 6 6 6 6 6 5 5 5 6 5 4 4 4 4 3 3 3 4 4 4 5 5 4 4 4 4 4 4 5 5 6 6 4 4 5 4 4 5 5 5 5 5 4 3 4 4 4 5 5 5 5 5 4 4 4 4 4 4 3 4 4 4 3 3 3 3 3 4
874D%%%%j%J%%JJ%j%JjjJ%%%%jJ%%Jj%%JJ%kjJ%%j%jJJJj%%%%%j%%j%JJ%%jj%%J%Jj%%%j%
$$ 4 4 4 4 4 3 3 4 4 4 5 6 6 5 5 6 5 4 5 5 5 5 5 4 5 5 5 6 5 5 5 6 7 7 5 4 5 5 5 4 4 3 4 5 6 5 5 5 5 5 5 4 4 4 3 3 4 5 5 5 4 3 3 3 4 4 5 4 4 4 4 3 3
863C%%%%%JJjjk%JJ%%j%%Jj%JJ%%%%%j%J%%%%%%%jJ%%%%%J%%%%%%%%%jJ%j%%JJ%j%j%%%%J
$$ 3 3 3 3 3 3 4 5 4 3 1 1 2 3 3 3 2 2 2 3 2 2 3 4 4 4 4 4 4 3 3 4 4 4 4 4 4 4 4 3 4 4 4 4 4 4 5 5 5 5 5 5 5 5 5 5 4 5 5 4 4 4 5 6 6 5 5 4 4 4 4 4 5
852E%%%jj%%%J%%%%j%%J%Jj%%%%%jJJjjJjjJ%%%JJJj%%%%%%JJjj%%Jjj%%J%Jj%%Jjj%%J%%
$$ 5 5 5 5 4 3 3 3 3 4 4 4 4 4 3 3 3 4 4 5 4 4 4 4 4 4 3 4 5 4 3 4 3 2 3 3 3 3 4 5 6 5 5 5 5 5 5 5 6 7 6 5 5 5 6 5 4 4 4 5 5 6 5 5 5 6 5 4 4 4 5 5 5
841Ej%J%j%%K%jj%J%%jJ%%jJjJ%%%j%%%%%J%%JJjjJ%%%%%Jj%%jJ%%%JJ%%j%j%%%%J%%%%%%
$$ 5 4 4 5 5 4 4 4 6 6 5 4 4 5 5 5 4 5 5 5 4 5 4 5 5 5 5 4 4 4 4 4 4 5 5 5 6 7 6 5 6 6 6 6 6 6 7 6 6 6 5 6 6 6 6 7 8 8 8 7 7 6 6 6 6 6 7 7 7 7 7 7 7
830G%j%%%%J%%%%j%%%%%%%J%jj%%J%%%JJ%Jjj%%%%j%%%%%%%%%j%JJj%jJ%%j%j%JJ%jKJj%%
$$ 7 7 6 6 6 6 6 7 7 7 7 7 6 6 6 6 6 6 6 6 7 7 6 5 5 5 6 6 6 6 7 8 8 9 8 7 7 7 7 7 6 6 6 6 6 6 6 6 6 6 5 5 6 7 6 6 5 6 6 6 5 5 4 4 5 6 6 5 7 8 7 7 7
819GJjj%%%%%%%%jK%j%j%%%%%%%J%j%%%%%j%%JJj%%%J%%%jj%JJJJ%jj%%%%%J%jJ%%jj%j%j
$$ 7 8 7 6 6 6 6 6 6 6 6 6 5 7 7 6 6 5 5 5 5 5 5 5 5 6 6 5 5 5 5 5 5 4 4 4 5 6 5 5 5 5 6 6 6 6 5 4 4 5 6 7 8 8 7 6 6 6 6 6 6 7 7 6 7 7 7 6 5 5 4 4 3
808CJJ%j%jjJ%J%%%%j%%%%JJJjj%j%%%%%%%%%%%J%%%jJ%%%%%%j%%J%%j%%%%%%%%%J%%J%%%
$$ 3 4 5 5 4 4 3 2 3 3 4 4 4 4 4 3 3 3 3 3 4 5 6 5 4 4 3 3 3 3 3 3 3 3 3 3 3 3 4 4 4 4 3 4 4 4 4 4 4 4 3 3 3 4 4 4 3 3 3 3 3 3 3 3 3 3 4 4 4 5 5 5 5
797E%jj%%J%%J%jkJ%%%J%%%%%%%%j%%J%%%%%%j%j%J%%%jJ%%%%J%%j%%%Jj%%Jj%%K%Jj%Jjj
$$ 5 5 4 3 3 3 4 4 4 5 5 4 2 3 3 3 3 4 4 4 4 4 4 4 4 4 3 3 3 4 4 4 4 4 4 4 3 3 2 2 3 3 3 3 2 3 3 3 3 3 4 4 4 3 3 3 3 4 3 3 3 4 3 3 3 5 5 6 5 5 6 5 4
786DJ%%j%J%%%jj%%%J%%j%J%J%j%%jJ%%%%%J%%j%%JJ%Jj%%j%jJ%J%Jj%%j%%J%j%%%Jj%%%J
$$ 4 5 5 5 4 4 5 5 5 5 4 3 3 3 3 4 4 4 3 3 4 4 5 5 4 4 4 3 4 4 4 4 4 4 5 5 5 4 4 4 5 6 6 7 6 6 6 5 5 4 5 5 6 6 7 6 6 6 5 5 5 6 6 5 5 5 5 6 5 5 5 5 6
775F%%k%J%%j%%J%j%K%Jj%%%%J%%J%JJ%%%jK%jj%%Jj%%%j%%%%J%j%j%j%J%jjJJ%%%%%%JJ%
$$ 6 6 6 4 4 5 5 5 4 4 4 5 5 4 4 6 6 7 6 6 6 6 6 7 7 7 8 8 9 10 10 10 10 9 11 11 10 9 9 9 10 9 9 9 9 8 8 8 8 8 9 9 8 8 7 7 6 6 7 7 6 5 6 7 7 7 7 7 7 7 8 9 9
764IJJ%%%J%jj%J%JJj%%%jJ%%%%j%Jj%jjjj%%j%J%%%J%kJ%JJ%%%J%%J%%%%jj%J%%%%%%%j%
$$ 9 10 11 11 11 11 12 12 11 10 10 11 11 12 13 12 12 12 12 11 12 12 12 12 12 11 11 12 11 11 10 9 8 7 7 7 6 6 7 7 7 7 8 8 6 7 7 8 9 9 9 9 10 10 10 11 11 11 11 11 10 9 9 10 10 10 10 10 10 10 10 9 9
753I%%jj%%%%J%jjj%%%%%J%%%%J%%%%J%jjJ%JkJ%%%Jj%%jJJ%j%%%%%j%%JJjj%J%%j%%%%%%
$$ 9 9 9 8 7 7 7 7 7 8 8 7 6 5 5 5 5 5 5 6 6 6 6 6 7 7 7 7 7 8 8 7 6 7 7 8 6 7 7 7 7 8 7 7 7 6 7 8 8 7 7 7 7 7 7 6 6 6 7 8 7 6 6 7 7 7 6 6 6 6 6 6 6
742F%%%%jkKJ%J%%Jj%J%J%%%%J%J%jj%J%%%jj%KJ%%j%%%J%%j%kJ%%J%%j%%%J%j%J%JJ%%%%
$$ 6 6 6 6 6 5 3 5 6 6 7 7 7 8 7 7 8 8 9 9 9 9 9 10 10 11 11 10 9 9 10 10 10 10 9 8 8 10 11 11 11 10 10 10 10 11 11 11 10 10 8 9 9 9 10 10 10 9 9 9 9 10 10 9 9 10 10 11 12 12 12 12 12
731A2%jj%%JJ%%%j%JJ%j%%%jJ%j%j%%%j%Jj%%%jJJ%%%%%%%j%%jJ%J%j%%%%J%%%jj%j%%j%j
$$ 12 12 11 10 10 10 11 12 12 12 12 11 11 12 13 13 12 12 12 12 11 12 12 11 11 10 10 10 10 9 9 10 9 9 9 9 8 9 10 10 10 10 10 10 10 10 9 9 9 8 9 9 10 10 9 9 9 9 9 10 10 10 10 9 8 8 7 7 7 6 6 5
720EJ%J%%jJ%jJJ%%jJ%%j%Jjj%JJ%%j%%%%J%j%j%JJ%j%%%%%%%J%%%%%J%%%%%%jK%Jj%%%jJ
$$ 5 6 6 7 7 7 6 7 7 6 7 8 8 8 7 8 8 8 7 7 8 7 6 6 7 8 8 8 7 7 7 7 7 8 8 7 7 6 6 7 8 8 7 7 7 7 7 7 7 7 8 8 8 8 8 8 9 9 9 9 9 9 9 8 10 10 11 10 10 10 10 9 10
709A0J%%%%%%%%%%%JJ%JJ%j%JjJ%J%%Jj%J%%J%J%%J%K%JJLJJJJKJJJKJJKJJ%Jjlmlkkjjj%
$$ 10 11 11 11 11 11 11 11 11 11 11 11 11 12 13 13 14 15 15 14 14 15 14 15 15 16 16 16 17 16 16 17 17 17 18 18 19 19 19 20 20 22 22 23 24 27 28 29 30 31 33 34 35 36 38 39 40 42 43 44 44 45 44 41 37 34 32 30 29 28 27 27
699B7%J%%%%j%j%%j%j%J%j%%Jj%%J%%J%%jJjj%jj%%j%%jJJ%%%%%J%%%%jJ%jjJ%%%%jjjJ%J
$$ 27 27 28 28 28 28 28 27 27 26 26 26 25 25 24 24 25 25 24 24 24 25 24 24 24 25 25 25 26 26 26 25 26 25 24 24 23 22 22 22 21 21 21 20 21 22 22 22 22 22 22 23 23 23 23 23 22 23 23 22 21 22 22 22 22 22 21 20 19 20 20 21
688B1%j%%%%%%jkjJ%j%%J%%%%%%%JJj%jJJJJJ%J%%%Jj%%jJ%%j%JkJJJj%Jj%j%%%Jj%%JJ%%
$$ 21 21 20 20 20 20 20 20 20 19 17 16 17 17 16 16 16 17 17 17 17 17 17 17 17 18 19 18 18 17 18 19 20 21 22 22 23 23 23 23 24 23 23 23 22 23 23 23 22 22 23 21 22 23 24 23 23 24 23 23 22 22 22 22 23 22 22 22 23 24 24 24
677B4%J%%%%%%Jj%J%%%JJ%j%jJ%%J%Jjjj%%%J%JJ%jJJJ%%%J%%%%JJK%%JJ%J%JJ%J%JJJJ%J
$$ 24 24 25 25 25 25 25 25 25 26 25 25 26 26 26 26 27 28 28 27 27 26 27 27 27 28 28 29 28 27 26 26 26 26 27 27 28 29 29 28 29 30 31 31 31 31 32 32 32 32 32 33 34 36 36 36 37 38 38 39 39 40 41 41 42 42 43 44 45 46 46 47
666D7JJJK%%KKKJKJKJKJJ%JJ%%j%jmmmllllkk%j%jjj%jjkJ%j%jjJ%%%%j%j%jkJj%%jjjj%j
$$ 47 48 49 50 52 52 52 54 56 58 59 61 62 64 65 67 68 69 69 70 71 71 71 70 70 69 65 61 57 54 51 48 45 43 41 41 40 40 39 38 37 37 36 35 33 34 34 33 33 32 31 32 32 32 32 32 31 31 30 30 29 27 28 27 27 27 26 25 24 23 23 22
655B2%j%%jjk%j%j%j%j%jJJj%%%jj%%j%%%j%j%%%j%J%J%%jj%%j%J%Jj%%J%%%%%j%%%%%j%%
$$ 22 22 21 21 21 20 19 17 17 16 16 15 15 14 14 13 13 12 13 14 13 13 13 13 12 11 11 11 10 10 10 10 9 9 8 8 8 8 7 7 8 8 9 9 9 8 7 7 7 6 6 7 7 8 7 7 7 8 8 8 8 8 8 7 7 7 7 7 7 6 6 6
644F%%%%%jJJj%Jj%%%Jj%j%%%J%%%%%j%J%%%Jk%j%%%%%%JJj%j%%%%J%%%%jj%%%J%Jj%JJ%%
$$ 6 6 6 6 6 6 5 6 7 6 6 7 6 6 6 6 7 6 6 5 5 5 5 6 6 6 6 6 6 5 5 6 6 6 6 7 5 5 4 4 4 4 4 4 4 5 6 5 5 4 4 4 4 4 5 5 5 5 5 4 3 3 3 3 4 4 5 4 4 5 6 6 6
633FJ%%%J%%%%%j%jj%Jjj%j%Jj%%%%%%JJjj%J%%jJ%JJ%%jjj%J%JKj%%jjJ%%j%%%%%%J%%j%
$$ 6 7 7 7 7 8 8 8 8 8 8 7 7 6 5 5 6 5 4 4 3 3 4 3 3 3 3 3 3 3 4 5 4 3 3 4 4 4 3 4 4 5 6 6 6 5 4 3 3 4 4 5 7 6 6 6 5 4 5 5 5 4 4 4 4 4 4 4 5 5 5 4 4
623D%%j%%jJJ%%J%k%jJJ%jJj%%jJJj%%J%%%j%J%%%j%%jJ%j%%%%%%JJj%%J%%%%jj%%%J%%%%
$$ 4 4 4 3 3 3 2 3 4 4 4 5 5 3 3 2 3 4 4 3 4 3 3 3 2 3 4 3 3 3 4 4 4 4 3 3 4 4 4 4 3 3 3 2 3 3 2 2 2 2 2 2 2 3 4 3 3 3 4 4 4 4 4 3 2 2 2 2 3 3 3 3 3
612C%%jjJ%%J%jJ%%%%Jj%jJJj%%%%%%J%%%Jj%%J%j%%%%%%%j%%jJJ%j%%J%%j%J%%j%%%%%%k
$$ 3 3 3 2 1 2 2 2 3 3 2 3 3 3 3 3 4 3 3 2 3 4 3 3 3 3 3 3 3 4 4 4 4 5 4 4 4 5 5 4 4 4 4 4 4 4 4 3 3 3 2 3 4 4 3 3 3 4 4 4 3 3 4 4 4 3 3 3 3 3 3 3 1
601A%jJ%%%JJ%%J%%j%%J%%j%%J%%%%%%j%jJ%%%%J%%J%%j%j%%jJ%%J%J%jj%j%%j%JJ%Jj%%%
$$ 1 1 0 1 1 1 1 2 3 3 3 4 4 4 3 3 3 4 4 4 3 3 3 4 4 4 4 4 4 4 3 3 2 3 3 3 3 3 4 4 4 5 5 5 4 4 3 3 3 2 3 3 3 4 4 5 5 4 3 3 2 2 2 1 1 2 3 3 4 3 3 3 3
590C%%%%%%%j%%JJ%j%J%%%%%jj%%%J%%%%JJj%%%%jjJ%%%J%%%%%%jJ%%jjJ%jJ%j%%%JJjJ%j
$$ 3 3 3 3 3 3 3 3 2 2 2 3 4 4 3 3 4 4 4 4 4 4 3 2 2 2 2 3 3 3 3 3 4 5 4 4 4 4 4 3 2 3 3 3 3 4 4 4 4 4 4 4 3 4 4 4 3 2 3 3 2 3 3 2 2 2 2 3 4 3 4 4 3
579C%%%j%j%%JJ%%Jj%%%%%%%%%J%j%%J%%%%%%%%%%%%J%j%%%j%%%%%J%J%jjJ%j%JJj%%%%%j
$$ 3 3 3 3 2 2 1 1 1 2 3 3 3 4 3 3 3 3 3 3 3 3 3 3 4 4 3 3 3 4 4 4 4 4 4 4 4 4 4 4 4 4 5 5 4 4 4 4 3 3 3 3 3 3 4 4 5 5 4 3 4 4 3 3 4 5 4 4 4 4 4 4 3
568C%J%%%%J%%%%J%%jj%JjjJ%%%j%%J%%%jJ%jj%%J%%%J%%Jjjj%J%%%%%%%J%Jj%%%%J%%j%%
$$ 3 3 4 4 4 4 4 5 5 5 5 5 6 6 6 5 4 4 5 4 3 4 4 4 4 3 3 3 4 4 4 4 3 4 4 3 2 2 2 3 3 3 3 4 4 4 5 4 3 2 2 3 3 3 3 3 3 3 3 4 4 5 4 4 4 4 4 5 5 5 4 4 4
557D%%%jjJJ%%j%%%jJ%J%%%j%%j%%%%%J%J%%j%%%J%kJ%%J%%j%j%J%%%%%%J%%J%%jjj%jJJ%
$$ 4 4 4 4 3 2 3 4 4 4 3 3 3 3 2 3 3 4 4 4 4 3 3 3 2 2 2 2 2 2 3 3 4 4 4 3 3 3 3 4 4 2 3 3 3 4 4 4 3 3 2 2 3 3 3 3 3 3 3 4 4 4 5 5 5 4 3 2 2 1 2 3 3
546C%%j%%%J%JJj%%%j%%jJJ%%%j%%%J%%jj%%%%%%%%JJ%%%%jj%%J%%jJKj%%j%J%%kJ%%%%%%
$$ 3 3 3 2 2 2 2 3 3 4 5 4 4 4 4 3 3 3 2 3 4 4 4 4 3 3 3 3 4 4 4 3 2 2 2 2 2 2 2 2 2 3 4 4 4 4 4 3 2 2 2 3 3 3 2 3 5 4 4 4 3 3 4 4 4 2 3 3 3 3 3 3 3
535C%%JJj%jj%J%%%%J%jj%%%j%%J%%%JJ%Jj%%%j%%%Jj%%JjkJ%%%J%%%%%%j%JJ%%%Jjj%J%%
$$ 3 3 3 4 5 4 4 3 2 2 3 3 3 3 3 4 4 3 2 2 2 2 1 1 1 2 2 2 2 3 4 4 5 4 4 4 4 3 3 3 3 4 3 3 3 4 3 1 2 2 2 2 3 3 3 3 3 3 3 2 2 3 4 4 4 4 5 4 3 3 4 4 4
524D%%%%J%%%j%j%%%J%%%jjJ%J%J%%%%%%j%%%J%%j%%%%%%J%JJJJJ%%JJ%KKKJJJJj%kjkkkk
$$ 4 4 4 4 4 5 5 5 5 4 4 3 3 3 3 4 4 4 4 3 2 3 3 4 4 5 5 5 5 5 5 5 4 4 4 4 5 5 5 4 4 4 4 4 4 4 5 5 6 7 8 9 10 10 10 11 12 12 14 16 18 19 20 21 22 21 21 19 18 16 14 12 10
513A0jj%j%Jjj%j%%%JJ%j%J%%%J%JKJJJKJKKKKKKLLJLJjlmmnnmljj%%%j%%jj%%J%j%j%J%J
$$ 10 9 8 8 7 7 8 7 6 6 5 5 5 5 6 7 7 6 6 7 7 7 7 8 8 9 11 12 13 14 16 17 19 21 23 25 27 29 32 35 36 39 40 39 36 32 28 23 18 14 11 10 9 9 9 9 8 8 8 7 6 6 6 7 7 6 6 5 5 6 6 7
502G%%%JJ%%%%JJJ%LJ%JJJJ%kjkjlkk%J%%%%jjJ%j%%%%%%Jj%%J%JJ%%j%J%KK%%%%JJ%%J%%
$$ 7 7 7 7 8 9 9 9 9 9 10 11 12 12 15 16 16 17 18 19 20 20 18 17 15 14 11 9 7 7 8 8 8 8 8 7 6 7 7 6 6 6 6 6 6 6 7 6 6 6 7 7 8 9 9 9 8 8 9 9 11 13 13 13 13 13 14 15 15 15 16 16 16
491A6j%j%j%Jj%%%j%JJ%%J%%j%%%JJK%%%%KJJK%JJJJKJ%jjj%j%%%jJJ%%%JJJKj%%jjjjj%k
$$ 16 15 15 14 14 13 13 14 13 13 13 13 12 12 13 14 14 14 15 15 15 14 14 14 14 15 16 18 18 18 18 18 20 21 22 24 24 25 26 27 28 30 31 31 30 29 28 28 27 27 27 27 26 27 28 28 28 28 29 30 31 33 32 32 32 31 30 29 28 27 27 25
480B5jk%Jj%J%%%%%%%%%%%%%%%JJ%JJKKKJJ%KLKKJkjllmnllljj%%jj%%j%%jjJ%%%%%%%J%%
$$ 25 24 22 22 23 22 22 23 23 23 23 23 23 23 23 23 23 23 23 23 23 23 23 24 25 25 26 27 29 31 33 34 35 35 37 40 42 44 45 43 42 39 36 32 27 24 21 18 17 16 16 16 15 14 14 14 13 13 13 12 11 12 12 12 12 12 12 12 12 13 13 13
469A3JLJ%%JJJJJJJ%%%j%kkklj%Jkj%j%j%%J%Jj%%j%%%%%Jj%j%%J%%jj%%%%%JJj%%jJJKj%
$$ 13 14 17 18 18 18 19 20 21 22 23 24 25 25 25 25 24 24 22 20 18 15 14 14 15 13 12 12 11 11 10 10 10 11 11 12 11 11 11 10 10 10 10 10 10 11 10 10 9 9 9 10 10 10 9 8 8 8 8 8 8 9 10 9 9 9 8 9 10 12 11 11
458A1jJJ%jJ%%%%%%%%jj%jjj%%%%%%jJJjj%jJJJ%j%%J%j%%JJ%j%j%%%%Jj%%j%JJj%%j%%j%
$$ 11 10 11 12 12 11 12 12 12 12 12 12 12 12 12 11 10 10 9 8 7 7 7 7 7 7 7 6 7 8 7 6 6 5 6 7 8 8 7 7 7 8 8 7 7 7 8 9 9 8 8 7 7 7 7 7 8 7 7 7 6 6 7 8 7 7 7 6 6 6 5 5
447E%j%j%J%J%%%%k%JJ%%%j%%%%%JJj%%%Jjj%JJ%%%%j%%J%j%jjJ%%K%jkJ%%%%%%%%J%%%%j
$$ 5 5 4 4 3 3 4 4 5 5 5 5 5 3 3 4 5 5 5 5 4 4 4 4 4 4 5 6 5 5 5 5 6 5 4 4 5 6 6 6 6 6 5 5 5 6 6 5 5 4 3 4 4 4 6 6 5 3 4 4 4 4 4 4 4 4 4 5 5 5 5 5 4
437Dj%%%J%%jj%%%%%J%%%J%%jkjJJ%%jJ%%%%%%%%%J%j%%jJ%j%J%j%%J%%JJ%%kJ%%%%%%j%J
$$ 4 3 3 3 3 4 4 4 3 2 2 2 2 2 2 3 3 3 3 4 4 4 3 1 0 1 2 2 2 1 2 2 2 2 2 2 2 2 2 2 3 3 2 2 2 1 2 2 1 1 2 2 1 1 1 2 2 2 3 4 4 4 2 3 3 3 3 3 3 3 2 2 3
426CjJ%j%%%%%%j%JJJj%jJ%j%jJ%%%%Jj%%%%%%%%j%%JjjK%J%%%j%%%jJ%%j%JJj%%%%JJjj%
$$ 3 2 3 3 2 2 2 2 2 2 2 1 1 2 3 4 3 3 2 3 3 2 2 1 2 2 2 2 2 3 2 2 2 2 2 2 2 2 2 1 1 1 2 1 0 2 2 3 3 3 3 2 2 2 2 1 2 2 2 1 1 2 3 2 2 2 2 2 3 4 3 2 2
415B%J%jJ%%%%%%%%jj%%%%J%%%J%%jJ%j%%%j%%%%%J%%%J%%j%jJ%J%%%%%%%%%j%%j%%%%%%%
$$ 2 2 3 3 2 3 3 3 3 3 3 3 3 3 2 1 1 1 1 1 2 2 2 2 3 3 3 2 3 3 2 2 2 2 1 1 1 1 1 1 2 2 2 2 3 3 3 2 2 1 2 2 3 3 3 3 3 3 3 3 3 3 2 2 2 1 1 1 1 1 1 1 1
404A%%%%%%%%Jj%JJ%jj%jJJ%%%%%%j%%%%J%%Jj%jK%%%%kJJ%%%%jjJ%j%%%%K%%jj%J%%%%%j
$$ 1 1 1 1 1 1 1 1 1 2 1 1 2 3 3 2 1 1 0 1 2 2 2 2 2 2 2 1 1 1 1 1 2 2 2 3 2 2 1 3 3 3 3 3 1 2 3 3 3 3 3 2 1 2 2 1 1 1 1 1 3 3 3 2 1 1 2 2 2 2 2 2 1
393AJ%j%J%Jkj%J%%%%J%j%%%J%%%%jJ%J%j%%jJ%%%%j%%%j%JJ%j%%J%%%%%%%%%%%j%J%Jj%%
$$ 1 2 2 1 1 2 2 3 1 0 0 1 1 1 1 1 2 2 1 1 1 1 2 2 2 2 2 1 2 2 3 3 2 2 2 1 2 2 2 2 2 1 1 1 1 0 0 1 2 2 1 1 1 2 2 2 2 2 2 2 2 2 2 2 2 1 1 2 2 3 2 2 2
382B%%j%%%%%%J%%%%%%J%%jjj%J%%%%%J%%j%J%%jJ%j%j%%J%%%jJ%j%J%J%j%jJ%J%%%%%%JJ
$$ 2 2 2 1 1 1 1 1 1 1 2 2 2 2 2 2 2 3 3 3 2 1 0 0 1 1 1 1 1 1 2 2 2 1 1 2 2 2 1 2 2 1 1 0 0 0 1 1 1 1 0 1 1 0 0 1 1 2 2 1 1 0 1 1 2 2 2 2 2 2 2 3 4
371D%%%jJ%j%j%JJ%j%k%jJJJ%%%%%j%jKj%%%%%%%%Jj%%J%j%%JJj%%%jj%j%J%J%%j%%%%J%J
$$ 4 4 4 4 3 4 4 3 3 2 2 3 4 4 3 3 1 1 0 1 2 3 3 3 3 3 3 2 2 1 3 2 2 2 2 2 2 2 2 2 3 2 2 2 3 3 2 2 2 3 4 3 3 3 3 2 1 1 0 0 1 1 2 2 2 1 1 1 1 1 2 2 3
$$ [...]
-1925A
##END=		$$ NMR SPECTRUM
##END=		$$ LINK
