##TITLE=	RP462 sieves 700 MHz.10.fid
##JCAMP-DX=	6.0	$$ MestReNova 14.3.3-33362
##DATA TYPE=	LINK
##BLOCKS=	1    
##ORIGIN=	Mestrelab Research S.L.
##OWNER=	hrzepa
##$MNOVA/METADATA=	(DOCUMENT,BASE64)
eyJuYW1lIjoiL1VzZXJzL2hyemVwYS9MaWJyYXJ5L01vYmlsZSBEb2N1bWVudHMvY29tfmFwcGxlfkN
sb3VkRG9jcy9TaGVwcGFyZC9OTVIgZmlsZXMgemlwcy0yL0Jvcm94aW5lIC0gYW1pbmUgYWRkdWN0cy
9UcmljaGxvcm9waGVueWxib3JveGluZS90cmljaGxvcm9waGVueWxib3JveGluZS1IL3RyaWNobG9yb
3BoZW55bGJvcm94aW5lLUgubW5vdmEiLCJwYWdlcyI6W3siaXRlbXMiOlsiMSIgICAgIF19XX0=
##TITLE=	RP462 sieves 700 MHz.10.fid
##JCAMP-DX=	6.0	$$ MestReNova 14.3.3-33362
##DATA TYPE=	NMR SPECTRUM
##DATA CLASS=	XYDATA
##BLOCK_ID=	1
##ORIGIN=	Bruker BioSpin GmbH
##OWNER=	nmrsu
##NUMDIM=	1
##$MNOVA/METADATA=	(ITEM,BASE64)
eyJhbmdsZSI6MCwiYXhlcyI6eyJ4Ijp7Im1heCI6MTYuMDY0MjU5OTk5OTM5MTI1LCJtaW4iOi0zLjc
2Njk0MjMzOTE1NjYyMjZ9LCJ5Ijp7Im1heCI6NTUyMDQuMjEzMzc4OTA2MjUsIm1pbiI6LTQ5OTMuNj
k5NTE2Mjk2Mzg3fX0sInBvaW50cyI6W3sieCI6NTMyMSwieSI6NTgzNX0seyJ4Ijo4NzIyLCJ5Ijo1O
DM1fSx7IngiOjg3MjIsInkiOjgyMDh9LHsieCI6NTMyMSwieSI6ODIwOH0seyJ4Ijo1MzIxLCJ5Ijo1
ODM1fV0sInoiOjB9
##.OBSERVE FREQUENCY=	700.35432466099996418
##.OBSERVE NUCLEUS=	^1H
##.SOLVENT NAME=	CDCl3
##.PULSE SEQUENCE=	zg30
##LONGDATE=	2024/09/13 11:28:40.000
##.ACQUISITIONMODE=	SIMULTANEOUS (DQD)
##$ORIGINAL FORMAT=	Bruker XWIN-NMR
##$MNOVA/SCALES_VERSION=	9
##$PARAMETER FILE=	(acqus, ASCII, /private/var/folders/f6/rjf_tdyn2v98c5c0wvkgn4s80000gq/T/QlZ$pMpFRQ+IQByiEYTdGg/10/acqus, 0)
$$ ##TITLE= Parameter file, TopSpin 4.1.3
$$ ##JCAMPDX= 5.0
$$ ##DATATYPE= Parameter Values
$$ ##NPOINTS= 1	$$ modification sequence number
$$ ##ORIGIN= Bruker BioSpin GmbH
$$ ##OWNER= nmrsu
$$ $$ 2024-09-13 11:26:06.387 +0100  nmrsu@CZC7167VR1
$$ $$ Z:/700/data/tds/nmr/RP462 sieves 700 MHz/10/acqus
$$ $$ process C:\Bruker\TopSpin4.1.3\prog\mod\dirdata.exe
$$ ##$ACQT0= -2.0981556054023
$$ ##$AMP= (0..31)
$$ 100 100 100 100 100 100 100 100 100 100 100 100 100 100 100 100 100 100
$$ 100 100 100 100 100 100 100 100 100 100 100 100 100 100
$$ ##$AMPCOIL= (0..32)
$$ -1 0 0 0 0 0 0 0 0 0 0 0 0 0 0 0 0 0 0 0 0 0 0 0 0 0 0 0 0 0 0 0 0
$$ ##$AQSEQ= 0
$$ ##$AQ_mod= 3
$$ ##$AUNM= <au_zg>
$$ ##$AUTOPOS= <34 >
$$ ##$BF1= 700.349999998
$$ ##$BF2= 700.349999998
$$ ##$BF3= 700.349999998
$$ ##$BF4= 700.349999998
$$ ##$BF5= 700.349999998
$$ ##$BF6= 700.349999998
$$ ##$BF7= 700.349999998
$$ ##$BF8= 700.349999998
$$ ##$BWFAC= (0..63)
$$ 0 0 0 0 0 0 0 0 0 0 0 0 0 0 0 0 0 0 0 0 0 0 0 0 0 0 0 0 0 0 0 0 0 0 0 0
$$ 0 0 0 0 0 0 0 0 0 0 0 0 0 0 0 0 0 0 0 0 0 0 0 0 0 0 0 0
$$ ##$BYTORDA= 0
$$ ##$CHANFCU= (0..24)
$$ 0 1 0 0 0 0 0 0 0 0 0 0 0 0 0 0 0 0 0 0 0 0 0 0 0
$$ ##$CHANREC= (0..24)
$$ 0 0 0 0 0 0 0 0 0 0 0 0 0 0 0 0 0 0 0 0 0 0 0 0 0
$$ ##$CHEMSTR= <none>
$$ ##$CNST= (0..63)
$$ 1 1 1 1 1 1 1 1 1 1 1 1 1 1 1 1 1 1 1 1 1 1 1 1 1 1 1 1 1 1 1 1 1 1 1 1
$$ 1 1 1 1 1 1 1 1 1 1 1 1 1 1 1 1 1 1 1 1 1 1 1 1 1 1 1 1
$$ ##$CPDPRG= (0..8)
$$ <> <> <> <> <> <> <> <> <>
$$ ##$D= (0..63)
$$ [...]
$$ ##$ShimPowRng3= (0..63)
$$ 1 1 1 1 1 1 1 1 1 1 1 1 1 1 1 1 1 1 1 1 1 1 1 1 1 1 1 1 1 1 1 1 1 1 1 1
$$ 1 1 1 1 0 0 0 0 0 0 0 0 0 0 0 0 0 0 0 0 0 0 0 0 0 0 0 0
$$ ##$ShimPowType1= 8
$$ ##$ShimPowType2= 8
$$ ##$ShimPowType3= 0
$$ ##$ShimPowType4= 0
$$ ##$ShimPowType5= 0
$$ ##$ShimPowType6= 0
$$ ##$ShimPowType7= 0
$$ ##$ShimPowType8= 0
$$ ##$ShimSysActGrad= (0..63)
$$ 1 2 3 4 13 5 7 11 10 9 6 8 12 18 19 20 21 15 22 23 24 14 25 16 26 17 27
$$ 28 31 32 33 34 35 36 37 38 0 0 0 0 0 0 0 0 0 0 0 0 0 0 0 0 0 0 0 0 0 0
$$ 0 0 0 0 0 0
$$ ##$ShimSysAngle= <>
$$ ##$ShimSysFunc= (0..63)
$$ 1 2 3 4 5 6 7 8 9 10 0 37 38 35 16 15 14 13 12 11 28 27 26 25 24 23 36
$$ 22 30 29 20 21 34 33 32 31 17 18 19 0 0 0 0 0 0 0 0 0 0 0 0 0 0 0 0 0 0
$$ 0 0 0 0 0 0 0
$$ ##$ShimSysMatId= <292722da.dat>
$$ ##$ShimSysMatrix= 1
$$ ##$ShimSysMinMaxUG= 130000
$$ ##$ShimSysOffset= <29 mm>
$$ ##$ShimSysType= 4
$$ ##$ShimUnit= 3
$$ ##$SpectrOsVersion= <4.1.156.20210628>
$$ ##$TCubeEth= <192.168.180.38>
$$ ##$TCubeSeqDevice= <>
$$ ##$TOSITY= <no>
$$ ##$TRIPLO2= 0
$$ ##$TopSpinVersion= <TopSpin 4.1.3>
$$ ##$TrxFreqFormula= (0..23)
$$ <TrxFreqFormula(2.0,700350000.000000,'TRX',Trx(1.0,'TRX 1200.1',1,5.000000,1290.000000))>
$$ <TrxFreqFormula(2.0,700350000.000000,'TRX',Trx(1.0,'TRX 1200.2',1,5.000000,1290.000000))>
$$ <TrxFreqFormula(2.0,700350000.000000,'TRX',Trx(1.0,'TRX 1200.3',1,5.000000,1290.000000))>
$$ <> <> <> <> <> <> <> <> <> <> <> <> <> <> <> <> <> <> <> <> <>
$$ ##$TrxPN= (0..23)
$$ <Z148391> <Z148391> <Z148391> <> <> <> <> <> <> <> <> <> <> <> <> <> <>
$$ <> <> <> <> <> <> <>
$$ ##$TrxSN= (0..23)
$$ <00336> <00337> <00342> <> <> <> <> <> <> <> <> <> <> <> <> <> <> <> <>
$$ <> <> <> <> <>
$$ ##$VCubeEth= (0..23)
$$ <no> <no> <no> <no> <no> <no> <no> <no> <no> <no> <no> <no> <no> <no> <no>
$$ <no> <no> <no> <no> <no> <no> <no> <no> <no>
$$ ##$VTU= 2
$$ ##$VTUETH= <192.168.99.11>
$$ ##$VTUTY= <no>
$$ ##$ValueLine= no
$$ ##$VpuPN= (0..23)
$$ <no> <no> <no> <no> <no> <no> <no> <no> <no> <no> <no> <no> <no> <no> <no>
$$ <no> <no> <no> <no> <no> <no> <no> <no> <no>
$$ ##$VpuSN= (0..23)
$$ <no> <no> <no> <no> <no> <no> <no> <no> <no> <no> <no> <no> <no> <no> <no>
$$ <no> <no> <no> <no> <no> <no> <no> <no> <no>
$$ ##$WBREFAM= (0..31)
$$ 99.8 100 100 100 100 100 100 100 100 100 100 100 100 100 100 100 100 100
$$ 100 100 100 100 100 100 100 100 100 100 100 100 100 100
$$ ##$WBREFLM= (0..31)
$$ 1 0 1 0 0 0 0 0 0 0 0 0 0 0 0 0 0 0 0 0 0 0 0 0 0 0 0 0 0 0 0 0
$$ ##$WBREFPH= (0..31)
$$ 0.05 0 0 0 0 0 0 0 0 0 0 0 0 0 0 0 0 0 0 0 0 0 0 0 0 0 0 0 0 0 0 0
$$ ##$WBSGU= (0..31)
$$ 1 2 4 0 0 0 0 0 0 0 0 0 0 0 0 0 0 0 0 0 0 0 0 0 0 0 0 0 0 0 0 0
$$ ##END=
$$ 
##$DECIM=	1440
##$DSPFVS=	21
##XUNITS=	HZ
##YUNITS=	ARBITRARY UNITS
##FIRSTX=	11250.604788156719223
##LASTX=	-2638.1781369192458442
##DELTAX=	-0.10596381293402784562
##XFACTOR=	1
##YFACTOR=	1.5315921411023285525
##FIRSTY=	101.56017303466796875
##MINY=	24.86692047119140625
##MAXY=	50185.6796875
##NPOINTS=	131072
##XYDATA=	(X++(Y..Y))
$$ [...]
6888A11%j%jj%J%%%Jj%%%%%%%%%%%%%%%J%%%%%%%%%%%%%%%jJ%%%%J%%%%%%Jj%%%jj%%%J%%
$$ 111 111 110 110 109 108 108 109 109 109 109 110 109 109 109 109 109 109 109 109 109 109 109 109 109 109 109 109 110 110 110 110 110 110 110 110 110 110 110 110 110 110 110 110 109 110 110 110 110 110 111 111 111 111 111 111 111 112 111 111 111 111 110 109 109 109 109 110 110 110
6881A10%j%%%J%%%%%%%%%%%%%%%%%%%%%j%%%%%%%j%%%jJJ%%j%J%%%%%jJ%%J%%%%%j%%%%J%
$$ 110 110 109 109 109 109 110 110 110 110 110 110 110 110 110 110 110 110 110 110 110 110 110 110 110 110 110 110 109 109 109 109 109 109 109 109 108 108 108 108 107 108 109 109 109 108 108 109 109 109 109 109 109 108 109 109 109 110 110 110 110 110 110 109 109 109 109 109 110 110
6874A10j%%J%%%%j%%J%%j%%%%%Jj%%%%j%JJ%%%%j%%%JjJ%%%%%%j%j%J%%J%%J%%j%%%Jj%%%
$$ 110 109 109 109 110 110 110 110 110 109 109 109 110 110 110 109 109 109 109 109 109 110 109 109 109 109 109 108 108 109 110 110 110 110 110 109 109 109 109 110 109 110 110 110 110 110 110 110 109 109 108 108 109 109 109 110 110 110 111 111 111 110 110 110 110 111 110 110 110 110
6866A10j%%%%J%%j%J%%%%j%%jJJ%%%jj%jJ%%%%JJ%jjJ%%j%%J%J%%j%j%J%%%%%%%%%J%Jjj%
$$ 110 109 109 109 109 109 110 110 110 109 109 110 110 110 110 110 109 109 109 108 109 110 110 110 110 109 108 108 107 108 108 108 108 108 109 110 110 109 108 109 109 109 108 108 108 109 109 110 110 110 109 109 108 108 109 109 109 109 109 109 109 109 109 109 110 110 111 110 109 109
6859A09%J%%%%j%j%J%%%j%JJ%%j%%%%j%%%%%%%%%J%%%%%%J%%%%%Jj%%%j%%%%%%%%%%%%%%%
$$ 109 109 110 110 110 110 110 109 109 108 108 109 109 109 109 108 108 109 110 110 110 109 109 109 109 109 108 108 108 108 108 108 108 108 108 108 109 109 109 109 109 109 109 110 110 110 110 110 110 111 110 110 110 110 109 109 109 109 109 109 109 109 109 109 109 109 109 109 109 109
6852A09%%%%%%jJJ%%%Jj%j%%%%%%%J%%jjJ%%Jj%%%JJ%j%%j%%J%j%%%%%%%JJ%%%%%%j%%%%j
$$ 109 109 109 109 109 109 109 108 109 110 110 110 110 111 110 110 109 109 109 109 109 109 109 109 110 110 110 109 108 109 109 109 110 109 109 109 109 110 111 111 110 110 110 109 109 109 110 110 109 109 109 109 109 109 109 109 110 111 111 111 111 111 111 111 110 110 110 110 110 109
6844A09%%%j%%%%%%j%J%%%J%J%%%%%%%%Jj%jJ%%%%%j%j%%J%%%J%%j%%j%J%%%%J%%j%%%%Jj
$$ 109 109 109 109 108 108 108 108 108 108 108 107 107 108 108 108 108 109 109 110 110 110 110 110 110 110 110 110 111 110 110 109 110 110 110 110 110 110 109 109 108 108 108 109 109 109 109 110 110 110 109 109 109 108 108 109 109 109 109 109 110 110 110 109 109 109 109 109 110 109
6837A09%J%%%%%%%%%%%%%%%%J%jj%%%%%%%%%%%%%%%%jJ%%J%jJ%j%%%%%%%JJj%%%%%%%%%%j
$$ 109 109 110 110 110 110 110 110 110 110 110 110 110 110 110 110 110 110 110 111 111 110 109 109 109 109 109 109 109 109 109 109 109 109 109 109 109 109 109 108 109 109 109 110 110 109 110 110 109 109 109 109 109 109 109 109 110 111 110 110 110 110 110 110 110 110 110 110 110 109
6830A09%%%j%%j%J%%%J%%%%J%%%J%%%j%%jJJ%%%%j%%j%%%J%J%%j%j%%%%%%%%JJ%jj%%J%jJ
$$ 109 109 109 109 108 108 108 107 107 108 108 108 108 109 109 109 109 109 110 110 110 110 111 111 111 111 110 110 110 109 110 111 111 111 111 111 110 110 110 109 109 109 109 110 110 111 111 111 110 110 109 109 109 109 109 109 109 109 109 110 111 111 110 109 109 109 110 110 109 110
6822A10%%j%J%%Jj%%%%%%%%%J%%jjJ%%%%%j%%%%%%%%J%%%%j%jJ%J%%%%%j%%%J%%%%%%%jj%
$$ 110 110 110 109 109 110 110 110 111 110 110 110 110 110 110 110 110 110 110 111 111 111 110 109 110 110 110 110 110 110 109 109 109 109 109 109 109 109 109 110 110 110 110 110 109 109 108 109 109 110 110 110 110 110 110 109 109 109 109 110 110 110 110 110 110 110 110 109 108 108
6815A08%j%J%%J%%%%%JJ%%j%j%%%J%%jJ%%%%%%%J%%j%%jJ%%jjJ%J%Jj%%%%%%J%j%%%%%%%j
$$ 108 108 107 107 108 108 108 109 109 109 109 109 109 110 111 111 111 110 110 109 109 109 109 110 110 110 109 110 110 110 110 110 110 110 110 111 111 111 110 110 110 109 110 110 110 109 108 109 109 110 110 111 110 110 110 110 110 110 110 111 111 110 110 110 110 110 110 110 110 109
6808A09j%J%%%%%%%%%%%%%%J%jj%J%%j%J%%%%%%%jj%J%J%%j%%J%J%%%j%j%JJ%j%%%%%%%%%
$$ 109 108 108 109 109 109 109 109 109 109 109 109 109 109 109 109 109 109 110 110 109 108 108 109 109 109 108 108 109 109 109 109 109 109 109 109 108 107 107 108 108 109 109 109 108 108 108 109 109 110 110 110 110 109 109 108 108 109 110 110 109 109 109 109 109 109 109 109 109 109
6800A09j%%J%%%%%J%%j%j%%%J%%%%%%%%j%jJJ%j%JJ%%%%J%%%%%j%%j%%%%%j%%%%%%J%J%%%
$$ 109 108 108 108 109 109 109 109 109 109 110 110 110 109 109 108 108 108 108 109 109 109 109 109 109 109 109 109 108 108 107 108 109 109 108 108 109 110 110 110 110 110 111 111 111 111 111 111 110 110 110 109 109 109 109 109 109 108 108 108 108 108 108 108 109 109 110 110 110 110
6793A10j%%J%%%jj%%%%j%JJJ%%jj%j%J%J%J%%jjJ%%%%%j%Jj%%%j%%%%%%JJ%%%%%J%jjj%JJ
$$ 110 109 109 109 110 110 110 110 109 108 108 108 108 108 107 107 108 109 110 110 110 109 108 108 107 107 108 108 109 109 110 110 110 109 108 109 109 109 109 109 109 108 108 109 108 108 108 108 107 107 107 107 107 107 107 108 109 109 109 109 109 109 110 110 109 108 107 107 108 109
6786A09%%%%%%%j%%%%%%%j%J%%J%%%%jJJj%%j%%%%%%%%J%%%%%%%%jJj%%%%%%%J%%%j%j%%J
$$ 109 109 109 109 109 109 109 109 108 108 108 108 108 108 108 108 107 107 108 108 108 109 109 109 109 109 108 109 110 109 109 109 108 108 108 108 108 108 108 108 108 109 109 109 109 109 109 109 109 109 108 109 108 108 108 108 108 108 108 108 109 109 109 109 108 108 107 107 107 108
6779A08%%%J%%%%%%%j%%%%%%%%%%j%%J%%%%%%%%%%J%j%%%%%%%%%J%%%%%%j%J%%%%J%%%%j%
$$ 108 108 108 108 109 109 109 109 109 109 109 109 108 108 108 108 108 108 108 108 108 108 108 107 107 107 108 108 108 108 108 108 108 108 108 108 108 109 109 108 108 108 108 108 108 108 108 108 108 109 109 109 109 109 109 109 108 108 109 109 109 109 109 110 110 110 110 110 109 109
6771A09%%%j%%%J%%%%jJj%J%J%j%%%%%j%%%JjjJJ%%j%%%J%%jJ%%j%j%%J%%%%%%%J%%j%%%%
$$ 109 109 109 109 108 108 108 108 109 109 109 109 109 108 109 108 108 109 109 110 110 109 109 109 109 109 109 108 108 108 108 109 108 107 108 109 109 109 108 108 108 108 109 109 109 108 109 109 109 108 108 107 107 107 108 108 108 108 108 108 108 108 109 109 109 108 108 108 108 108
6764A08J%%J%%%%j%%j%J%%%j%%%J%%%%%j%%%%%J%Jjj%%%%%%%%%%J%%%%Jj%j%%%J%%%J%%%%
$$ 108 109 109 109 110 110 110 110 110 109 109 109 108 108 109 109 109 109 108 108 108 108 109 109 109 109 109 109 108 108 108 108 108 108 109 109 110 109 108 108 108 108 108 108 108 108 108 108 108 109 109 109 109 109 110 109 109 108 108 108 108 109 109 109 109 110 110 110 110 110
6757A10%%%%j%%j%%%%%%J%%%%%j%%J%%%%jjJ%%J%%%%%%%%%J%%j%%%%%%j%j%%J%J%%%%j%%J
$$ 110 110 110 110 110 109 109 109 108 108 108 108 108 108 108 109 109 109 109 109 109 108 108 108 109 109 109 109 109 108 107 108 108 108 109 109 109 109 109 109 109 109 109 109 110 110 110 109 109 109 109 109 109 109 108 108 107 107 107 108 108 109 109 109 109 109 108 108 108 109
6749A09%%%Jj%%j%%%J%%jjJJ%j%%%%%%%JJj%%%%%Jj%%%%%%%%%%%%%j%JJJj%%j%J%%%J%%%%
$$ 109 109 109 109 110 109 109 109 108 108 108 108 109 109 109 108 107 108 109 109 108 108 108 108 108 108 108 108 109 110 109 109 109 109 109 109 110 109 109 109 109 109 109 109 109 109 109 109 109 109 109 108 108 109 110 111 110 110 110 109 109 110 110 110 110 111 111 111 111 111
6742A11j%%%%%j%%j%%%%%%%%%J%%%%%%%%j%J%%%%%j%%%%J%Jjjj%%%J%%%jJJ%%%%%%jJ%j%%
$$ 111 110 110 110 110 110 110 109 109 109 108 108 108 108 108 108 108 108 108 108 109 109 109 109 109 109 109 109 109 108 108 109 109 109 109 109 109 108 108 108 108 108 109 109 110 109 108 107 107 107 107 108 108 108 108 107 108 109 109 109 109 109 109 109 108 109 109 108 108 108
6735A08%%%j%%%%%%%J%Jj%%%J%%jJ%jjJ%%%%j%jJ%J%J%%%%%j%%%J%%j%jJ%J%%%%%%j%Jj%J
$$ 108 108 108 108 107 107 107 107 107 107 107 107 108 108 109 108 108 108 108 109 109 109 108 109 109 108 107 108 108 108 108 108 107 107 106 107 107 108 108 109 109 109 109 109 109 108 108 108 108 109 109 109 108 108 107 108 108 109 109 109 109 109 109 109 108 108 109 108 108 109
6727A09%J%jj%j%%%%%J%%%%%jJ%%%%%Jj%%J%%%%jj%%J%%%%%%%%%%%J%J%%%%%%j%%%%%j%%%
$$ 109 109 110 110 109 108 108 107 107 107 107 107 107 108 108 108 108 108 108 107 108 108 108 108 108 108 109 108 108 108 109 109 109 109 109 108 107 107 107 108 108 108 108 108 108 108 108 108 108 108 108 109 109 110 110 110 110 110 110 110 109 109 109 109 109 109 108 108 108 108
6720A08%%%%%%%%%J%%%j%%%%%%%J%Jj%%%%%j%%%%%%J%%%j%Jj%%J%%%%%%%%j%%%%j%J%%%%%
$$ 108 108 108 108 108 108 108 108 108 108 109 109 109 109 108 108 108 108 108 108 108 108 109 109 110 109 109 109 109 109 109 108 108 108 108 108 108 108 109 109 109 109 108 108 109 108 108 108 109 109 109 109 109 109 109 109 109 108 108 108 108 108 107 107 108 108 108 108 108 108
6713A08%%%%%%%%%%%%%%%%%%%J%%J%%%%%%j%%%J%%%j%%%%%%%%%%%%J%%%%%%%%%%%%%J%%%%
$$ 108 108 108 108 108 108 108 108 108 108 108 108 108 108 108 108 108 108 108 108 109 109 109 110 110 110 110 110 110 110 109 109 109 109 110 110 110 110 109 109 109 109 109 109 109 109 109 109 109 109 109 110 110 110 110 110 110 110 110 110 110 110 110 110 110 111 111 111 111 111
6705A11%%%j%%%j%%%%%%%J%%%%%%j%j%%%%%%%%%Jj%J%%%jj%J%Jj%%%%%J%%%%%%%%%j%jj%J
$$ 111 111 111 111 110 110 110 110 109 109 109 109 109 109 109 109 110 110 110 110 110 110 110 109 109 108 108 108 108 108 108 108 108 108 108 109 108 108 109 109 109 109 108 107 107 108 108 109 108 108 108 108 108 108 109 109 109 109 109 109 109 109 109 109 108 108 107 106 106 107
6698A07%J%%%J%%%%j%%%%%%%%j%J%J%%jj%J%%%%%%%%J%%%%j%%%%J%jJJ%%jj%%j%%%%%%J%%
$$ 107 107 108 108 108 108 109 109 109 109 109 108 108 108 108 108 108 108 108 108 107 107 108 108 109 109 109 108 107 107 108 108 108 108 108 108 108 108 108 109 109 109 109 109 108 108 108 108 108 109 109 108 109 110 110 110 109 108 108 108 107 107 107 107 107 107 107 108 108 108
6691A08%%%%J%%%j%%%%%%%J%j%%Jj%%j%%%J%%%%%%%j%%%%%%J%jJ%J%%Jjj%j%jJJJ%j%%%JJ
$$ 108 108 108 108 108 109 109 109 109 108 108 108 108 108 108 108 108 109 109 108 108 108 109 108 108 108 107 107 107 107 108 108 108 108 108 108 108 108 107 107 107 107 107 107 107 108 108 107 108 108 109 109 109 110 109 108 108 107 107 106 107 108 109 109 108 108 108 108 109 110
6683A10%jj%jJ%%j%%%%J%%%%jJ%J%%%%%%%%%%%j%%%%%%JJ%jj%%%%j%%%%%J%Jj%J%jjjjJ%J
$$ 110 110 109 108 108 107 108 108 108 107 107 107 107 107 108 108 108 108 108 107 108 108 109 109 109 109 109 109 109 109 109 109 109 109 108 108 108 108 108 108 108 109 110 110 109 108 108 108 108 108 107 107 107 107 107 107 108 108 109 108 108 109 109 108 107 106 105 106 106 107
6676A07J%j%J%j%%JJ%jj%%%J%%%J%%%Jj%j%%%%%%%%J%%j%%%j%J%%%jJ%%%%%jJ%%%%JJ%%j%
$$ 107 108 108 107 107 108 108 107 107 107 108 109 109 108 107 107 107 107 108 108 108 108 109 109 109 109 110 109 109 108 108 108 108 108 108 108 108 108 109 109 109 108 108 108 108 107 107 108 108 108 108 107 108 108 108 108 108 108 107 108 108 108 108 108 109 110 110 110 109 109
6669A09%jJ%%%%%%%jj%%%%%J%j%%%%%%J%%%%%jJ%%%%%%%%%J%%%%%%%%%%%J%%%jj%%%%%%%%
$$ 109 109 108 109 109 109 109 109 109 109 109 108 107 107 107 107 107 107 108 108 107 107 107 107 107 107 107 108 108 108 108 108 108 107 108 108 108 108 108 108 108 108 108 108 109 109 109 109 109 109 109 109 109 109 109 109 110 110 110 110 109 108 108 108 108 108 108 108 108 108
6662A08%%J%%j%%%%jJJ%%%j%%j%%J%j%J%%%%j%%%%%%%Jj%%%%%J%%%%%%%%%%%%%JJj%%%j%%
$$ 108 108 108 109 109 109 108 108 108 108 108 107 108 109 109 109 109 108 108 108 107 107 107 108 108 107 107 108 108 108 108 108 107 107 107 107 107 107 107 107 108 107 107 107 107 107 107 108 108 108 108 108 108 108 108 108 108 108 108 108 108 109 110 109 109 109 109 108 108 108
6654A08%%%J%%Jj%%%%j%%%JJ%j%%%%%%%%%%%%J%%j%%%%%%%%j%%%%%%%%%%J%j%j%%%%%J%%%
$$ 108 108 108 108 109 109 109 110 109 109 109 109 109 108 108 108 108 109 110 110 109 109 109 109 109 109 109 109 109 109 109 109 109 110 110 110 109 109 109 109 109 109 109 109 109 108 108 108 108 108 108 108 108 108 108 108 109 109 108 108 107 107 107 107 107 107 108 108 108 108
6647A08%%J%%%%%jJ%j%%%%%%%j%%jJ%J%%Jj%Jj%jjJ%%%J%J%j%%%%%%%%%j%%%%J%%%%%%%%%
$$ 108 108 108 109 109 109 109 109 109 108 109 109 108 108 108 108 108 108 108 108 107 107 107 106 107 107 108 108 108 109 108 108 109 108 108 107 106 107 107 107 107 108 108 109 109 108 108 108 108 108 108 108 108 108 108 107 107 107 107 107 108 108 108 108 108 108 108 108 108 108
6640A08%j%%J%jJ%J%%%j%%j%%%%JJJ%%j%j%%%%%%%%%jJ%%%%J%%%%J%j%%%j%%%%%%%%%J%%%
$$ 108 108 107 107 107 108 108 107 108 108 109 109 109 109 108 108 108 107 107 107 107 107 108 109 110 110 110 109 109 108 108 108 108 108 108 108 108 108 108 107 108 108 108 108 108 109 109 109 109 109 110 110 109 109 109 109 108 108 108 108 108 108 108 108 108 108 109 109 109 109
6632A09%%j%%%%%%j%%%J%J%%j%J%%jJ%%j%%j%%%%%%JJ%%J%jj%j%%%%%JJ%jj%%%j%JJ%%%j%
$$ 109 109 109 108 108 108 108 108 108 108 107 107 107 107 108 108 109 109 109 108 108 109 109 109 108 109 109 109 108 108 108 107 107 107 107 107 107 107 108 109 109 109 110 110 109 108 108 107 107 107 107 107 107 108 109 109 108 107 107 107 107 106 106 107 108 108 108 108 107 107
6625A07%Jj%%%J%%%%%j%%J%J%%%%%%j%%%%%%%%J%%j%%%%%%%%%%%%%%%%J%%Jj%%j%%jJJ%%%
$$ 107 107 108 107 107 107 107 108 108 108 108 108 108 107 107 107 108 108 109 109 109 109 109 109 109 108 108 108 108 108 108 108 108 108 109 109 109 108 108 108 108 108 108 108 108 108 108 108 108 108 108 108 108 108 109 109 109 110 109 109 109 108 108 108 107 108 109 109 109 109
6618A09%%%Jj%%%%Jj%j%%%%%%%%Jj%%%J%%jj%%J%%%%%j%%%J%%%%%%%%J%%%jjJ%%j%%JJj%j
$$ 109 109 109 109 110 109 109 109 109 109 110 109 109 108 108 108 108 108 108 108 108 108 109 108 108 108 108 109 109 109 108 107 107 107 108 108 108 108 108 108 107 107 107 107 108 108 108 108 108 108 108 108 108 109 109 109 109 108 107 108 108 108 107 107 107 108 109 108 108 107
6610A07J%%j%%%%%j%J%%j%JJ%%%%J%%jj%J%jJj%%jJ%%%%%%%%J%j%%%%J%%%jJ%%%%%%j%%%%
$$ 107 108 108 108 107 107 107 107 107 107 106 106 107 107 107 106 106 107 108 108 108 108 108 109 109 109 108 107 107 108 108 107 108 107 107 107 106 107 107 107 107 107 107 107 107 107 108 108 107 107 107 107 107 108 108 108 108 107 108 108 108 108 108 108 108 107 107 107 107 107
6603A07%J%%%%%%J%%j%%%%%%j%%%J%jj%%%%J%%J%jj%J%%J%%%%%%%j%%%J%J%%J%%j%%j%j%%
$$ 107 107 108 108 108 108 108 108 108 109 109 109 108 108 108 108 108 108 108 107 107 107 107 108 108 107 106 106 106 106 106 107 107 107 108 108 107 106 106 107 107 107 108 108 108 108 108 108 108 108 107 107 107 107 108 108 109 109 109 110 110 110 109 109 109 108 108 107 107 107
6596A07%%%J%J%%%%%jj%%%J%%%%%%%%%%%%%%%%%%%%j%%%%J%%%j%%jJ%J%%j%J%%J%%%j%%%j
$$ 107 107 107 107 108 108 109 109 109 109 109 109 108 107 107 107 107 108 108 108 108 108 108 108 108 108 108 108 108 108 108 108 108 108 108 108 108 108 107 107 107 107 107 108 108 108 108 107 107 107 106 107 107 108 108 108 107 107 108 108 108 109 109 109 109 108 108 108 108 107
6588A07%%J%%%%j%%%J%J%%j%jJ%%%%%%%%j%%%%%%%%%%jJ%%Jj%%%j%%jJ%J%%%J%%%%jJj%%J
$$ 107 107 107 108 108 108 108 108 107 107 107 107 108 108 109 109 109 108 108 107 108 108 108 108 108 108 108 108 108 107 107 107 107 107 107 107 107 107 107 107 106 107 107 107 108 107 107 107 107 106 106 106 105 106 106 107 107 107 107 108 108 108 108 108 107 108 107 107 107 108
6581A08%j%j%%jJ%%J%%%J%%%jJ%%%%j%%%%J%%j%%%%%%%%%J%%%%%%%%%%%%j%%J%%%%%j%%%J
$$ 108 108 107 107 106 106 106 105 106 106 106 107 107 107 107 108 108 108 108 107 108 108 108 108 108 107 107 107 107 107 108 108 108 107 107 107 107 107 107 107 107 107 107 108 108 108 108 108 108 108 108 108 108 108 108 108 107 107 107 108 108 108 108 108 108 107 107 107 107 108
6574A08%%%%%%%%%%%%j%%%%%JJ%%%j%%%j%%J%j%%%%%%%%%%%%%%%%%J%%%j%%%%%%J%%%%%%%
$$ 108 108 108 108 108 108 108 108 108 108 108 108 108 107 107 107 107 107 107 108 109 109 109 109 108 108 108 108 107 107 107 108 108 107 107 107 107 107 107 107 107 107 107 107 107 107 107 107 107 107 107 108 108 108 108 107 107 107 107 107 107 107 108 108 108 108 108 108 108 108
6566A08%%jJj%%%%%J%%%jJ%J%%%j%%Jjj%%Jj%J%%%%j%%%%%J%%%%%j%%%JJ%j%%%%%%%j%%%j
$$ 108 108 108 107 108 107 107 107 107 107 107 108 108 108 108 107 108 108 109 109 109 109 108 108 108 109 108 107 107 107 108 107 107 108 108 108 108 108 107 107 107 107 107 107 108 108 108 108 108 108 107 107 107 107 108 109 109 108 108 108 108 108 108 108 108 107 107 107 107 106
6559A06%%jJ%%J%j%%JJ%%%jJJ%j%J%%%%jj%%J%%%%%%%%%j%%%%%%%%%%%Jj%J%%%%j%%%%%J%
$$ 106 106 106 105 106 106 106 107 107 106 106 106 107 108 108 108 108 107 108 109 109 108 108 109 109 109 109 109 108 107 107 107 108 108 108 108 108 108 108 108 108 108 107 107 107 107 107 107 107 107 107 107 107 107 108 107 107 108 108 108 108 108 107 107 107 107 107 107 108 108
6552A08%%%%%%j%%j%J%J%%%%j%%jJJjJ%J%j%J%%jj%%%j%JJ%jj%J%%%%j%%j%J%%%%%%%%J%%
$$ 108 108 108 108 108 108 108 107 107 107 106 106 107 107 108 108 108 108 108 107 107 107 106 107 108 107 108 108 109 109 108 108 109 109 109 108 107 107 107 107 106 106 107 108 108 107 106 106 107 107 107 107 107 106 106 106 105 105 106 106 106 106 106 106 106 106 106 107 107 107
6545A07%%%%%%JJ%j%%%%%%%%%%%%j%%%%%%%%%%%J%%%%j%%%j%J%%%%%%j%J%J%%jj%%jJ%JJ%
$$ 107 107 107 107 107 107 107 108 109 109 108 108 108 108 108 108 108 108 108 108 108 108 108 107 107 107 107 107 107 107 107 107 107 107 107 108 108 108 108 108 107 107 107 107 106 106 107 107 107 107 107 107 107 106 106 107 107 108 108 108 107 106 106 106 105 106 106 107 108 108
6537A08%%%j%%j%Jj%jJ%%%%%%%J%j%%J%%%%%%%j%%%j%J%%%%JjJ%%%%%j%jJ%J%%%%%%%%%%%
$$ 108 108 108 108 107 107 107 106 106 107 106 106 105 106 106 106 106 106 106 106 106 107 107 106 106 106 107 107 107 107 107 107 107 107 106 106 106 106 105 105 106 106 106 106 106 107 106 107 107 107 107 107 107 106 106 105 106 106 107 107 107 107 107 107 107 107 107 107 107 107
6530A07%%j%%%%j%%JJ%%%%j%%j%JJ%JJ%%j%j%%Jj%J%%%j%j%%%JJ%j%JJ%j%j%%J%%j%%%%%%
$$ 107 107 107 106 106 106 106 106 105 105 105 106 107 107 107 107 107 106 106 106 105 105 106 107 107 108 109 109 109 108 108 107 107 107 108 107 107 108 108 108 108 107 107 106 106 106 106 107 108 108 107 107 108 109 109 108 108 107 107 107 108 108 108 107 107 107 107 107 107 107
6523A07%%%j%%%J%%%%J%%%j%%JJ%j%%%%%%%%%%j%%J%%%j%%J%%%%%j%%jJJ%J%j%%jjJ%%jJ%
$$ 107 107 107 107 106 106 106 106 107 107 107 107 107 108 108 108 108 107 107 107 108 109 109 108 108 108 108 108 108 108 108 108 108 108 107 107 107 108 108 108 108 107 107 107 108 108 108 108 108 108 107 107 107 106 107 108 108 109 109 108 108 108 107 106 107 107 107 106 107 107
6515A07J%%%%%%%%%%%%j%jJ%%%%%%J%%%j%%Jj%%%%%%j%%j%%%KJ%J%j%%%%%j%%%%%%J%%Jj%
$$ 107 108 108 108 108 108 108 108 108 108 108 108 108 108 107 107 106 107 107 107 107 107 107 107 108 108 108 108 107 107 107 108 107 107 107 107 107 107 107 106 106 106 105 105 105 105 107 108 108 109 109 108 108 108 108 108 108 107 107 107 107 107 107 107 108 108 108 109 108 108
6508A08j%%%j%%J%J%%%J%j%%%j%%%J%%%%%%%%%j%%%%%%%%J%j%%%%%%%jJ%J%j%%%%%%%%%%%
$$ 108 107 107 107 107 106 106 106 107 107 108 108 108 108 109 109 108 108 108 108 107 107 107 107 108 108 108 108 108 108 108 108 108 108 107 107 107 107 107 107 107 107 107 108 108 107 107 107 107 107 107 107 107 106 107 107 108 108 107 107 107 107 107 107 107 107 107 107 107 107
6501A07%%j%%%%J%%J%%j%%%j%%%%%%%%j%%J%%j%JJ%%jJJ%j%%jJj%%J%%J%%%%%j%jJ%%j%J%
$$ 107 107 107 106 106 106 106 106 107 107 107 108 108 108 107 107 107 107 106 106 106 106 106 106 106 106 106 105 105 105 106 106 106 105 105 106 107 107 107 106 107 108 108 107 107 107 106 107 106 106 106 107 107 107 108 108 108 108 108 108 107 107 106 107 107 107 106 106 107 107
6493A07%J%jjJ%J%j%%j%%J%%%%%%J%%%%j%%%J%%%J%jj%%%%J%j%%%%%%J%%%%%%jj%%J%Jj%%
$$ 107 107 108 108 107 106 107 107 108 108 107 107 107 106 106 106 107 107 107 107 107 107 107 108 108 108 108 108 107 107 107 107 108 108 108 108 109 109 108 107 107 107 107 107 108 108 107 107 107 107 107 107 107 108 108 108 108 108 108 108 107 106 106 106 107 107 108 107 107 107
6486A07J%%%jJ%%%j%j%%J%%%J%j%%%%J%%%j%%%J%j%%%J%j%jJ%%%J%%Jj%%j%%%%%%%%%%J%%
$$ 107 108 108 108 108 107 108 108 108 108 107 107 106 106 106 107 107 107 107 108 108 107 107 107 107 107 108 108 108 108 107 107 107 107 108 108 107 107 107 107 108 108 107 107 106 107 107 107 107 108 108 108 109 108 108 108 107 107 107 107 107 107 107 107 107 107 107 108 108 108
6479A08%%Jj%%%j%%%%jJ%%%j%%%%%%%%J%%j%%%%%%J%%j%%J%%%%%Jj%%Jj%%j%%j%%%J%j%%J
$$ 108 108 108 109 108 108 108 108 107 107 107 107 107 106 107 107 107 107 106 106 106 106 106 106 106 106 106 107 107 107 106 106 106 106 106 106 106 107 107 107 106 106 106 107 107 107 107 107 107 108 107 107 107 108 107 107 107 106 106 106 105 105 105 105 106 106 105 105 105 106
6471A06%%%%%J%jj%j%JJ%JJ%kj%%J%%Jj%%Jj%%%J%%%%%%%Jj%jj%%%%%J%%j%%%%%%%J%%%%%
$$ 106 106 106 106 106 106 107 107 106 105 105 104 104 105 106 106 107 108 108 106 105 105 105 106 106 106 107 106 106 106 107 106 106 106 106 107 107 107 107 107 107 107 107 108 107 107 106 105 105 105 105 105 105 106 106 106 105 105 105 105 105 105 105 105 106 106 106 106 106 106
6464A06jJ%%%%%%%%%j%J%%%%Jj%%Jj%%j%%J%%%%%%J%j%%%%%%%J%%%%%jJ%%%j%J%%%%%%J%j
$$ 106 105 106 106 106 106 106 106 106 106 106 106 105 105 106 106 106 106 106 107 106 106 106 107 106 106 106 105 105 105 106 106 106 106 106 106 106 107 107 106 106 106 106 106 106 106 106 107 107 107 107 107 107 106 107 107 107 107 106 106 107 107 107 107 107 107 107 108 108 107
6457A07%%j%%%J%j%J%%jJ%J%j%J%%jJ%j%%%%%j%j%%J%%%J%%%jJ%%Jj%j%%%%%%%%%%%%%%Jj
$$ 107 107 107 106 106 106 106 107 107 106 106 107 107 107 106 107 107 108 108 107 107 108 108 108 107 108 108 107 107 107 107 107 107 106 106 105 105 105 106 106 106 106 107 107 107 107 106 107 107 107 108 107 107 106 106 106 106 106 106 106 106 106 106 106 106 106 106 106 107 106
6449A06%j%J%%%%%J%%%%%j%J%%j%%jJ%%%%j%jJ%%j%JJJ%%J%%%j%%%J%%%%j%%%j%jJ%JjJ%%
$$ 106 106 105 105 106 106 106 106 106 106 107 107 107 107 107 107 106 106 107 107 107 106 106 106 105 106 106 106 106 106 105 105 104 105 105 105 104 104 105 106 107 107 107 108 108 108 108 107 107 107 107 108 108 108 108 108 107 107 107 107 106 106 105 106 106 107 106 107 107 107
6442A07%%%%%%%%%%%%%J%%%j%%%j%%%%%%%%%J%%J%j%%j%%%%J%%Jj%j%%%%J%%%j%%%%J%%%%
$$ 107 107 107 107 107 107 107 107 107 107 107 107 107 107 108 108 108 108 107 107 107 107 106 106 106 106 106 106 106 106 106 106 107 107 107 108 108 107 107 107 106 106 106 106 106 107 107 107 108 107 107 106 106 106 106 106 107 107 107 107 106 106 106 106 106 107 107 107 107 107
6435A07jj%JJj%%%JJ%jj%J%%j%%%J%j%%J%%%%j%%%%%%%J%%%Jj%%%%%%%j%Jj%%%%%%Jj%%j%
$$ 107 106 105 105 106 107 106 106 106 106 107 108 108 107 106 106 107 107 107 106 106 106 106 107 107 106 106 106 107 107 107 107 107 106 106 106 106 106 106 106 106 107 107 107 107 108 107 107 107 107 107 107 107 107 106 106 107 106 106 106 106 106 106 106 107 106 106 106 105 105
6428A05J%%J%%%%%%j%J%Jjj%j%J%%%%%J%%j%%%%%%%%%%j%J%%%%%%%%J%%%%jj%%%Jj%%%%%%
$$ 105 106 106 106 107 107 107 107 107 107 107 106 106 107 107 108 107 106 106 105 105 106 106 106 106 106 106 107 107 107 106 106 106 106 106 106 106 106 106 106 106 105 105 106 106 106 106 106 106 106 106 106 107 107 107 107 107 106 105 105 105 105 106 105 105 105 105 105 105 105
6420A05%J%%J%j%%%J%%%%%jj%%%J%%%%%%%jJ%J%%%%%%%%%%%%Jjj%%%j%%J%%J%%%%%j%%j%%
$$ 105 105 106 106 106 107 107 106 106 106 106 107 107 107 107 107 107 106 105 105 105 105 106 106 106 106 106 106 106 106 105 106 106 107 107 107 107 107 107 107 107 107 107 107 107 107 108 107 106 106 106 106 105 105 105 106 106 106 107 107 107 107 107 107 106 106 106 105 105 105
6413A05%%Jj%%%%%%%J%J%%%%Jj%%%j%%%j%J%%j%%%%j%J%Jj%%%%%J%j%j%J%J%%jJ%%%J%j%%
$$ 105 105 105 106 105 105 105 105 105 105 105 105 106 106 107 107 107 107 107 108 107 107 107 107 106 106 106 106 105 105 106 106 106 105 105 105 105 105 104 104 105 105 106 105 105 105 105 105 105 106 106 105 105 104 104 105 105 106 106 106 105 106 106 106 106 107 107 106 106 106
6406A06%%jJ%%jJ%%%jj%J%%J%%%%%%%%%J%%%%%%%%%%j%%%J%%j%j%%%%%%%%%%%J%%%J%j%J%
$$ 106 106 106 105 106 106 106 105 106 106 106 106 105 104 104 105 105 105 106 106 106 106 106 106 106 106 106 106 107 107 107 107 107 107 107 107 107 107 107 106 106 106 106 107 107 107 106 106 105 105 105 105 105 105 105 105 105 105 105 105 106 106 106 106 107 107 106 106 107 107
6398A07%%%j%jjJJ%%%%%%jJJj%%%%j%%jJ%JJ%%j%%%J%%%%%%%j%J%%%j%jJ%%%%j%%J%jJ%j%
$$ 107 107 107 107 106 106 105 104 105 106 106 106 106 106 106 106 105 106 107 106 106 106 106 106 105 105 105 104 105 105 106 107 107 107 106 106 106 106 107 107 107 107 107 107 107 107 106 106 107 107 107 107 106 106 105 106 106 106 106 106 105 105 105 106 106 105 106 106 105 105
6391A05J%%%%%Jj%%J%J%j%j%j%%%J%%%%j%J%%%J%%%%%%%%%%%J%j%j%j%Jjj%JK%%%%%J%%jj
$$ 105 106 106 106 106 106 106 107 106 106 106 107 107 108 108 107 107 106 106 105 105 105 105 106 106 106 106 106 105 105 106 106 106 106 107 107 107 107 107 107 107 107 107 107 107 107 108 108 107 107 106 106 105 105 106 105 104 104 105 107 107 107 107 107 107 108 108 108 107 106
6384A06%j%%J%%Jj%%%%Jj%j%%%%%%%%Jj%%%%%%%%j%j%%JJJ%J%%%j%%%%j%JJ%j%%%J%%j%%%
$$ 106 106 105 105 105 106 106 106 107 106 106 106 106 106 107 106 106 105 105 105 105 105 105 105 105 105 106 105 105 105 105 105 105 105 105 105 104 104 103 103 103 104 105 106 106 107 107 107 107 106 106 106 106 106 105 105 106 107 107 106 106 106 106 107 107 107 106 106 106 106
6376A06%%%j%J%%%J%%%j%j%%%%jJ%%%%%J%j%%j%%J%%J%Jj%%j%%%J%%j%%%JJ%%%%%%%j%%%%
$$ 106 106 106 106 105 105 106 106 106 106 107 107 107 107 106 106 105 105 105 105 105 104 105 105 105 105 105 105 106 106 105 105 105 104 104 104 105 105 105 106 106 107 106 106 106 105 105 105 105 106 106 106 105 105 105 105 106 107 107 107 107 107 107 107 107 106 106 106 106 106
6369A06J%%%%%j%%jJJj%%J%jJ%%%j%Jjj%%%%%J%%J%%%J%jj%%%%JjJ%%j%%%%%%%%%%%%%%j%
$$ 106 107 107 107 107 107 107 106 106 106 105 106 107 106 106 106 107 107 106 107 107 107 107 106 106 107 106 105 105 105 105 105 105 106 106 106 107 107 107 107 108 108 107 106 106 106 106 106 107 106 107 107 107 106 106 106 106 106 106 106 106 106 106 106 106 106 106 106 105 105
6362A05%%%%%%%%J%%%%%%%%%j%%%jJ%%%%J%%%%%%%j%%%%%jJ%%Jjj%%%%%%%j%%J%%%jj%%%%
$$ 105 105 105 105 105 105 105 105 105 106 106 106 106 106 106 106 106 106 106 105 105 105 105 104 105 105 105 105 105 106 106 106 106 106 106 106 106 105 105 105 105 105 105 104 105 105 105 106 105 104 104 104 104 104 104 104 104 103 103 103 104 104 104 104 103 102 102 102 102 102
6354A02%J%J%J%j%j%%%J%%%J%jJ%%J%J%j%%j%j%%%J%%j%%%%J%%%%%%%%%%j%%%J%%j%%J%%%
$$ 102 102 103 103 104 104 105 105 104 104 103 103 103 103 104 104 104 104 105 105 104 105 105 105 106 106 107 107 106 106 106 105 105 104 104 104 104 105 105 105 104 104 104 104 104 105 105 105 105 105 105 105 105 105 105 105 104 104 104 104 105 105 105 104 104 104 105 105 105 105
6347A05%%%%%%%%%%%%%%jj%JJ%%%jj%%J%%%%%%%%J%j%%%J%J%%jJ%J%%%%%j%%j%%%j%%J%%j
$$ 105 105 105 105 105 105 105 105 105 105 105 105 105 105 105 104 103 103 104 105 105 105 105 104 103 103 103 104 104 104 104 104 104 104 104 104 105 105 104 104 104 104 105 105 106 106 106 105 106 106 107 107 107 107 107 107 106 106 106 105 105 105 105 104 104 104 105 105 105 104
6340A04%J%%%%%%%J%%%j%%%%%%%%%%%%J%J%kj%J%%%%J%%j%J%Jjj%%%%j%%%%J%%%%%%j%J%J
$$ 104 104 105 105 105 105 105 105 105 105 106 106 106 106 105 105 105 105 105 105 105 105 105 105 105 105 105 106 106 107 107 105 104 104 105 105 105 105 105 106 106 106 105 105 106 106 107 106 105 105 105 105 105 104 104 104 104 104 105 105 105 105 105 105 105 104 104 105 105 106
6333A06%%%j%%%%Jj%%%%%%%%%%%j%J%%%%%J%%%Jj%%%%%J%%%%%%%%j%%J%%%jjJJ%j%%%%%%%
$$ 106 106 106 106 105 105 105 105 105 106 105 105 105 105 105 105 105 105 105 105 105 105 104 104 105 105 105 105 105 105 106 106 106 106 107 106 106 106 106 106 106 107 107 107 107 107 107 107 107 107 106 106 106 107 107 107 107 106 105 106 107 107 106 106 106 106 106 106 106 106
6325A06%%J%%%j%jjJ%%%j%%%J%%%%%%%%%J%j%%j%JJJj%%j%%%%%%j%J%jJ%%%%%%%%j%%%J%J
$$ 106 106 106 107 107 107 107 106 106 105 104 105 105 105 105 104 104 104 104 105 105 105 105 105 105 105 105 105 105 106 106 105 105 105 104 104 105 106 107 106 106 106 105 105 105 105 105 105 105 104 104 105 105 104 105 105 105 105 105 105 105 105 105 104 104 104 104 105 105 106
6318A06%JJ%jj%J%%%%j%%%%Jj%%j%%%%%%%%J%Jj%%%%%%%%%%Jj%%%j%J%%%%j%J%%jJ%J%%%%
$$ 106 106 107 108 108 107 106 106 107 107 107 107 107 106 106 106 106 106 107 106 106 106 105 105 105 105 105 105 105 105 105 106 106 107 106 106 106 106 106 106 106 106 106 106 106 107 106 106 106 106 105 105 106 106 106 106 106 105 105 106 106 106 105 106 106 107 107 107 107 107
6311A07j%%%%j%j%%%%%J%J%%%%%j%jJ%%%%JJ%%%%%%%j%%jJ%%%%%%%%%%%j%J%%%j%j%%J%J%
$$ 107 106 106 106 106 106 105 105 104 104 104 104 104 104 105 105 106 106 106 106 106 106 105 105 104 105 105 105 105 105 106 107 107 107 107 107 107 107 107 106 106 106 105 106 106 106 106 106 106 106 106 106 106 106 106 105 105 106 106 106 106 105 105 104 104 104 105 105 106 106
6303A06%%%JJj%%%j%%j%J%%%%J%j%%%%%%%%Jj%%%%Jj%%%%jJ%%%%JJ%j%j%%jj%%JJ%%%%%%%
$$ 106 106 106 106 107 108 107 107 107 107 106 106 106 105 105 106 106 106 106 106 107 107 106 106 106 106 106 106 106 106 106 107 106 106 106 106 106 107 106 106 106 106 106 105 106 106 106 106 106 107 108 108 107 107 106 106 106 105 104 104 104 105 106 106 106 106 106 106 106 106
6296A06%j%%%%%%%%%%%%%jJ%J%JJ%jj%%J%%%%j%%j%%%j%%J%%%%JJ%%%%%%%j%%%%%%jj%J%J
$$ 106 106 105 105 105 105 105 105 105 105 105 105 105 105 105 105 104 105 105 106 106 107 108 108 107 106 106 106 107 107 107 107 107 106 106 106 105 105 105 105 104 104 104 105 105 105 105 105 106 107 107 107 107 107 107 107 107 106 106 106 106 106 106 106 105 104 104 105 105 106
6289A06%%%j%%J%%%%j%%%J%jJ%%%%J%jj%J%%%k%JJJj%%%%j%%%JJj%%j%%JJ%%j%%j%%j%%J%
$$ 106 106 106 106 105 105 105 106 106 106 106 106 105 105 105 105 106 106 105 106 106 106 106 106 107 107 106 105 105 106 106 106 106 104 104 105 106 107 106 106 106 106 106 105 105 105 105 106 107 106 106 106 105 105 105 106 107 107 107 106 106 106 105 105 105 104 104 104 105 105
6281A05%%%jJ%J%%%j%%%%%%J%%%%j%J%%%%%j%%%j%%J%J%%J%%%J%j%j%%%%J%%%j%%jJ%jJ%%
$$ 105 105 105 105 104 105 105 106 106 106 106 105 105 105 105 105 105 105 106 106 106 106 106 105 105 106 106 106 106 106 106 105 105 105 105 104 104 104 105 105 106 106 106 107 107 107 107 108 108 107 107 106 106 106 106 106 107 107 107 107 106 106 106 105 106 106 105 106 106 106
6274A06%jJ%%%%%%%%j%%J%j%%J%j%%%jJ%%%%%J%%J%%%%%%%%jJ%jjJ%%%%%%%%j%%%%J%%J%%
$$ 106 106 105 106 106 106 106 106 106 106 106 106 105 105 105 106 106 105 105 105 106 106 105 105 105 105 104 105 105 105 105 105 105 106 106 106 107 107 107 107 107 107 107 107 107 106 107 107 106 105 106 106 106 106 106 106 106 106 106 105 105 105 105 105 106 106 106 107 107 107
6267A07j%j%%%jJ%JJ%j%%j%%J%%%%%j%J%%%%%j%%J%%j%%%%%%%%J%%j%jJ%J%jj%%%J%%%J%%
$$ 107 106 106 105 105 105 105 104 105 105 106 107 107 106 106 106 105 105 105 106 106 106 106 106 106 105 105 106 106 106 106 106 106 105 105 105 106 106 106 105 105 105 105 105 105 105 105 105 106 106 106 105 105 104 105 105 106 106 105 104 104 104 104 105 105 105 105 106 106 106
6259A06%J%%jjjJJJ%j%%%%%%J%%%%jj%jJ%%%%%JJ%%%j%j%%J%%%J%%%j%%j%%%J%j%%%%j%J%
$$ 106 106 107 107 107 106 105 104 105 106 107 107 106 106 106 106 106 106 106 107 107 107 107 107 106 105 105 104 105 105 105 105 105 105 106 107 107 107 107 106 106 105 105 105 106 106 106 106 107 107 107 107 106 106 106 105 105 105 105 106 106 105 105 105 105 105 104 104 105 105
6252A05%%%%%%%%j%%J%%J%%%%%%%%%%%%j%%%%%%J%%%j%%jJ%j%JJ%jJ%%%%%j%%%%%%Jj%%%%
$$ 105 105 105 105 105 105 105 105 105 104 104 104 105 105 105 106 106 106 106 106 106 106 106 106 106 106 106 106 105 105 105 105 105 105 105 106 106 106 106 105 105 105 104 105 105 104 104 105 106 106 105 106 106 106 106 106 106 105 105 105 105 105 105 105 106 105 105 105 105 105
6245A05%%j%J%%%j%jJ%J%%%j%%%J%%%%%jjJ%%jJ%JJ%%%%Jj%%j%%%%%%%%%%%%%%%%%j%%J%%
$$ 105 105 105 104 104 105 105 105 105 104 104 103 104 104 105 105 105 105 104 104 104 104 105 105 105 105 105 105 104 103 104 104 104 103 104 104 105 106 106 106 106 106 107 106 106 106 105 105 105 105 105 105 105 105 105 105 105 105 105 105 105 105 105 105 104 104 104 105 105 105
6237A05%J%j%%%%%%%%%%J%%j%%%%%Jj%%%J%%%jj%%%%%%J%%Jj%%j%%J%J%j%%%j%%%%%%%j%j
$$ 105 105 106 106 105 105 105 105 105 105 105 105 105 105 105 106 106 106 105 105 105 105 105 105 106 105 105 105 105 106 106 106 106 105 104 104 104 104 104 104 104 105 105 105 106 105 105 105 104 104 104 105 105 106 106 105 105 105 105 104 104 104 104 104 104 104 104 103 103 102
6230A02jJ%jJJ%%%%%J%J%%J%%%Jjj%%%%%%%%%j%J%%%%%%%j%%%%J%%j%%J%%J%%jJ%%%%%%j%
$$ 102 101 102 102 101 102 103 103 103 103 103 103 104 104 105 105 105 106 106 106 106 107 106 105 105 105 105 105 105 105 105 105 105 104 104 105 105 105 105 105 105 105 105 104 104 104 104 104 105 105 105 104 104 104 105 105 105 106 106 106 105 106 106 106 106 106 106 106 105 105
6223A05%%%j%J%jJ%%%%j%%%%%%%%%%J%%j%%JJ%%%j%jj%%J%j%%%%J%J%%%%j%%Jj%%%%%%%jJ
$$ 105 105 105 105 104 104 105 105 104 105 105 105 105 105 104 104 104 104 104 104 104 104 104 104 104 105 105 105 104 104 104 105 106 106 106 106 105 105 104 103 103 103 104 104 103 103 103 103 103 104 104 105 105 105 105 105 104 104 104 105 104 104 104 104 104 104 104 104 103 104
6216A04%JJ%%jj%JJ%j%%J%jj%%%%%%J%%J%%j%%jJ%%%%%Jjj%%J%%%%J%%%%j%%%%%J%j%%%j%
$$ 104 104 105 106 106 106 105 104 104 105 106 106 105 105 105 106 106 105 104 104 104 104 104 104 104 105 105 105 106 106 106 105 105 105 104 105 105 105 105 105 105 106 105 104 104 104 105 105 105 105 105 106 106 106 106 106 105 105 105 105 105 105 106 106 105 105 105 105 104 104
6208A04%%jJ%%%J%%J%%%j%jJ%J%jJ%%%j%Jj%%%%%%%%%J%%%%%%%%%j%%%J%j%%%J%%%%%%%%%
$$ 104 104 104 103 104 104 104 104 105 105 105 106 106 106 106 105 105 104 105 105 106 106 105 106 106 106 106 105 105 106 105 105 105 105 105 105 105 105 105 105 106 106 106 106 106 106 106 106 106 106 105 105 105 105 106 106 105 105 105 105 106 106 106 106 106 106 106 106 106 106
6201A06J%jj%%J%%j%%jJ%J%%%%%%%jj%Jj%%%%%%%%%%J%J%%Jjjj%J%%%%%%%%%%%Jj%%%%%%%
$$ 106 107 107 106 105 105 105 106 106 106 105 105 105 104 105 105 106 106 106 106 106 106 106 106 105 104 104 105 104 104 104 104 104 104 104 104 104 104 104 105 105 106 106 106 107 106 105 104 104 105 105 105 105 105 105 105 105 105 105 105 105 106 105 105 105 105 105 105 105 105
6194A05%%j%J%%j%%%%%%%%%%%%%%J%%%j%J%%jj%%%J%jJJJ%%j%%%%%%%JJ%%j%j%jj%%J%%jJ
$$ 105 105 105 104 104 105 105 105 104 104 104 104 104 104 104 104 104 104 104 104 104 104 104 105 105 105 105 104 104 105 105 105 104 103 103 103 103 104 104 103 104 105 106 106 106 105 105 105 105 105 105 105 105 106 107 107 107 106 106 105 105 104 103 103 103 104 104 104 103 104
6186A04%%J%Jj%%%%%%j%%%J%%%%J%%%%Jj%%j%%%%j%%Jj%%%%%%%%Jj%%J%%%%%Jj%%%%%%%j%
$$ 104 104 104 105 105 106 105 105 105 105 105 105 105 104 104 104 104 105 105 105 105 105 106 106 106 106 106 107 106 106 106 105 105 105 105 105 104 104 104 105 104 104 104 104 104 104 104 104 104 105 104 104 104 105 105 105 105 105 105 106 105 105 105 105 105 105 105 105 104 104
6179A04J%%%J%%j%%%%%Jj%Jj%%%j%%JJ%%%%j%j%%%J%J%%j%%%j%jJ%%JJ%jj%J%%%%%%%%%jj
$$ 104 105 105 105 105 106 106 106 105 105 105 105 105 105 106 105 105 106 105 105 105 105 104 104 104 105 106 106 106 106 106 105 105 104 104 104 104 105 105 106 106 106 105 105 105 105 104 104 103 104 104 104 105 106 106 105 104 104 105 105 105 105 105 105 105 105 105 105 104 103
6172A03J%J%%J%%j%j%Jj%%%%Jj%%%j%%jJ%J%%%%jJ%%J%%%j%%JJ%%%%j%jJ%%%%j%%%%j%%%%
$$ 103 104 104 105 105 105 106 106 106 105 105 104 104 105 104 104 104 104 104 105 104 104 104 104 103 103 103 102 103 103 104 104 104 104 104 103 104 104 104 105 105 105 105 104 104 104 105 106 106 106 106 106 105 105 104 105 105 105 105 105 104 104 104 104 104 103 103 103 103 103
6164A03%%J%%%JJ%Jj%j%%%j%%J%%%j%j%%J%%%%J%%%%%%%%J%j%j%j%%%%J%%%%%%J%%%jjJ%%
$$ 103 103 103 104 104 104 104 105 106 106 107 106 106 105 105 105 105 104 104 104 105 105 105 105 104 104 103 103 103 104 104 104 104 104 105 105 105 105 105 105 105 105 105 106 106 105 105 104 104 103 103 103 103 103 104 104 104 104 104 104 104 105 105 105 105 104 103 104 104 104
6157A04%Jj%jjJJ%j%%J%%%%%J%J%j%j%%%%%J%%%J%jj%%%%J%%%%%%j%%Jjj%%J%J%%%j%Jj%j
$$ 104 104 105 104 104 103 102 103 104 104 103 103 103 104 104 104 104 104 104 105 105 106 106 105 105 104 104 104 104 104 104 105 105 105 105 106 106 105 104 104 104 104 104 105 105 105 105 105 105 105 104 104 104 105 104 103 103 103 104 104 105 105 105 105 104 104 105 104 104 103
6150A03J%%%%%j%%%j%%J%%%%%%jJJ%%J%%%%%%%%jj%%%%%%%%%%J%%%%%%Jj%%jJ%%J%%%%%%%
$$ 103 104 104 104 104 104 104 103 103 103 103 102 102 102 103 103 103 103 103 103 103 102 103 104 104 104 105 105 105 105 105 105 105 105 105 104 103 103 103 103 103 103 103 103 103 103 103 104 104 104 104 104 104 104 105 104 104 104 103 104 104 104 105 105 105 105 105 105 105 105
6142A05%%%%%%%%%%%J%j%Jj%%jj%J%%J%%j%%%%%J%%%%%%%%%%%j%J%j%%%%JJ%%%%%%%jj%%J
$$ 105 105 105 105 105 105 105 105 105 105 105 105 106 106 105 105 106 105 105 105 104 103 103 104 104 104 105 105 105 104 104 104 104 104 104 105 105 105 105 105 105 105 105 105 105 105 105 104 104 105 105 104 104 104 104 104 105 106 106 106 106 106 106 106 106 105 104 104 104 105
6135A05%j%%%%%J%%%%%%j%%J%%%%%%%%%%%%%%%%%Jj%Jjj%%%j%%J%%%%Jj%%%%j%%%J%%%j%%
$$ 105 105 104 104 104 104 104 104 105 105 105 105 105 105 105 104 104 104 105 105 105 105 105 105 105 105 105 105 105 105 105 105 105 105 105 105 106 105 105 106 105 104 104 104 104 103 103 103 104 104 104 104 104 105 104 104 104 104 104 103 103 103 103 104 104 104 104 103 103 103
6128A03%J%J%%jj%%%%J%%%%%%%j%%%J%JJj%j%%%%%%%jJ%J%%%%%jjJJ%j%%%%%%J%%J%%k%%%
$$ 103 103 104 104 105 105 105 104 103 103 103 103 103 104 104 104 104 104 104 104 104 103 103 103 103 104 104 105 106 105 105 104 104 104 104 104 104 104 104 103 104 104 105 105 105 105 105 105 104 103 104 105 105 104 104 104 104 104 104 104 105 105 105 106 106 106 104 104 104 104
6120A04%%Jj%%%%%%%j%%%J%J%Jj%%%%%%j%%Jj%%%%%j%%%%JJ%j%%J%%j%%%%J%%j%%%j%J%%%
$$ 104 104 104 105 104 104 104 104 104 104 104 104 103 103 103 103 104 104 105 105 106 105 105 105 105 105 105 105 104 104 104 105 104 104 104 104 104 104 103 103 103 103 103 104 105 105 104 104 104 105 105 105 104 104 104 104 104 105 105 105 104 104 104 104 103 103 104 104 104 104
6113A04j%J%%%%%%%%%%%%%%%%%%%%%%%%%%j%J%%%%j%%JJ%%J%j%jj%%%%%j%%J%JJj%j%%%J%
$$ 104 103 103 104 104 104 104 104 104 104 104 104 104 104 104 104 104 104 104 104 104 104 104 104 104 104 104 104 104 104 103 103 104 104 104 104 104 103 103 103 104 105 105 105 106 106 105 105 104 103 103 103 103 103 103 102 102 102 103 103 104 105 104 104 103 103 103 103 104 104
6106A04%%%%%%%j%jJ%%J%J%%%%%%j%%%%%J%%Jjjj%J%%%%%%%%%JJ%%%%%%j%%%Jj%%j%%%%%%
$$ 104 104 104 104 104 104 104 104 103 103 102 103 103 103 104 104 105 105 105 105 105 105 105 104 104 104 104 104 104 105 105 105 106 105 104 103 103 104 104 104 104 104 104 104 104 104 104 105 106 106 106 106 106 106 106 105 105 105 105 106 105 105 105 104 104 104 104 104 104 104
6099A04%%%%j%%%%%%%j%J%J%J%Jj%%%%%%%j%%%%%JjjJ%%j%%%%J%%%J%j%j%J%J%%j%J%%j%%
$$ 104 104 104 104 104 103 103 103 103 103 103 103 103 102 102 103 103 104 104 105 105 106 105 105 105 105 105 105 105 105 104 104 104 104 104 104 105 104 103 104 104 104 103 103 103 103 103 104 104 104 104 105 105 104 104 103 103 104 104 105 105 105 104 104 105 105 105 104 104 104
6091A04JJ%%%%%j%%%Jjj%%%%J%%%%j%%%jJ%%%%j%%%%%J%%j%%%Jj%%J%%%%j%%%j%%J%%J%%%
$$ 104 105 106 106 106 106 106 106 105 105 105 105 106 105 104 104 104 104 104 105 105 105 105 105 104 104 104 104 103 104 104 104 104 104 103 103 103 103 103 103 104 104 104 103 103 103 103 104 103 103 103 104 104 104 104 104 103 103 103 103 102 102 102 103 103 103 104 104 104 104
6084A04%%%%%%%%%%%%jJ%J%%%j%j%%j%%%JJJ%%j%%%J%%JjjJ%%%j%j%%%%J%j%%%jJ%%J%%J%
$$ 104 104 104 104 104 104 104 104 104 104 104 104 104 103 104 104 105 105 105 105 104 104 103 103 103 102 102 102 102 103 104 105 105 105 104 104 104 104 105 105 105 106 105 104 105 105 105 105 104 104 103 103 103 103 103 104 104 103 103 103 103 102 103 103 103 104 104 104 105 105
6077A05%J%j%j%j%%J%J%%%%j%%%%%J%%%jj%%J%%%%%%j%%%j%%%%JJ%J%%%j%jJ%Jj%jj%%J%%
$$ 105 105 106 106 105 105 104 104 103 103 103 104 104 105 105 105 105 105 104 104 104 104 104 104 105 105 105 105 104 103 103 103 104 104 104 104 104 104 104 103 103 103 103 102 102 102 102 102 103 104 104 105 105 105 105 104 104 103 104 104 105 104 104 103 102 102 102 103 103 103
6069A03J%%%%%%%%%j%J%%%%J%j%j%%J%J%%%j%%j%%J%j%%J%%%j%j%jJ%J%J%%%Jjj%%J%%Jj%
$$ 103 104 104 104 104 104 104 104 104 104 104 103 103 104 104 104 104 104 105 105 104 104 103 103 103 104 104 105 105 105 105 104 104 104 103 103 103 104 104 103 103 103 104 104 104 104 103 103 102 102 101 102 102 103 103 104 104 104 104 105 104 103 103 103 104 104 104 105 104 104
6062A04J%%%%%%j%j%JJ%j%%%%%%%j%%%%%J%%%%%j%%%%Jj%%%j%JJ%J%%j%jJ%j%%JJ%%j%%J%
$$ 104 105 105 105 105 105 105 105 104 104 103 103 104 105 105 104 104 104 104 104 104 104 104 103 103 103 103 103 103 104 104 104 104 104 104 103 103 103 103 103 104 103 103 103 103 102 102 103 104 104 105 105 105 104 104 103 104 104 103 103 103 104 105 105 105 104 104 104 105 105
6055A05%%%j%%J%%j%Jj%%%%%Jj%j%%J%%%%%%%jj%J%k%JJ%%%j%%J%%J%%j%%%%%jJJ%%%%j%%
$$ 105 105 105 105 104 104 104 105 105 105 104 104 105 104 104 104 104 104 104 105 104 104 103 103 103 104 104 104 104 104 104 104 104 103 102 102 103 103 101 101 102 103 103 103 103 102 102 102 103 103 103 104 104 104 103 103 103 103 103 103 102 103 104 104 104 104 104 103 103 103
6047A03KJj%jjJ%%%%j%j%J%%j%%JJJj%%%%%%%%%%%%%%%%%%j%%%Jj%%%J%%%%%%%%%Jj%%j%J
$$ 103 105 106 105 105 104 103 104 104 104 104 104 103 103 102 102 103 103 103 102 102 102 103 104 105 104 104 104 104 104 104 104 104 104 104 104 104 104 104 104 104 104 104 104 103 103 103 103 104 103 103 103 103 104 104 104 104 104 104 104 104 104 104 105 104 104 104 103 103 104
6040A04%%J%%%%%%%%jj%j%J%%%J%%%%%j%j%J%%%J%J%Jj%%%%%j%%%%%J%%j%%%j%%%J%%%j%%
$$ 104 104 104 105 105 105 105 105 105 105 105 105 104 103 103 102 102 103 103 103 103 104 104 104 104 104 104 103 103 102 102 103 103 103 103 104 104 105 105 106 105 105 105 105 105 105 104 104 104 104 104 104 105 105 105 104 104 104 104 103 103 103 103 104 104 104 104 103 103 103
6033A03JJ%j%j%%%J%%%j%%J%J%j%%%%j%%%%JJ%%%%%%%%jj%%%Jj%J%J%%%%%jj%%%%%%%%%%J
$$ 103 104 105 105 104 104 103 103 103 103 104 104 104 104 103 103 103 104 104 105 105 104 104 104 104 104 103 103 103 103 103 104 105 105 105 105 105 105 105 105 105 104 103 103 103 103 104 103 103 104 104 105 105 105 105 105 105 104 103 103 103 103 103 103 103 103 103 103 103 104
6025A04%j%%%J%j%J%%J%%j%%jJ%J%%%jJ%%jJ%%j%%%%%%%%%%%%%%J%%jj%%J%%jj%%J%%J%%%
$$ 104 104 103 103 103 103 104 104 103 103 104 104 104 105 105 105 104 104 104 103 104 104 105 105 105 105 104 105 105 105 104 105 105 105 104 104 104 104 104 104 104 104 104 104 104 104 104 104 104 105 105 105 104 103 103 103 104 104 104 103 102 102 102 103 103 103 104 104 104 104
6018A04%%j%%JJ%jj%%%%J%%j%%%%J%j%%%%%%Jj%%%%%%%%j%J%J%%%%%%j%%%%j%%J%%%%J%%%
$$ 104 104 104 103 103 103 104 105 105 104 103 103 103 103 103 104 104 104 103 103 103 103 103 104 104 103 103 103 103 103 103 103 104 103 103 103 103 103 103 103 103 103 102 102 103 103 104 104 104 104 104 104 104 103 103 103 103 103 102 102 102 103 103 103 103 103 104 104 104 104
6011A04Jj%%%%%j%%%%jJ%%Jj%%%%%%JJj%%%%%%%%j%%%%%%%%Jj%%%%JJ%j%%%%j%j%J%%%Jj%
$$ 104 105 104 104 104 104 104 104 103 103 103 103 103 102 103 103 103 104 103 103 103 103 103 103 103 104 105 104 104 104 104 104 104 104 104 104 103 103 103 103 103 103 103 103 103 104 103 103 103 103 103 104 105 105 104 104 104 104 104 103 103 102 102 103 103 103 103 104 103 103
6003A03%%%Jj%j%%J%J%%%jJJ%%jj%j%%%%JJ%j%%J%j%%J%%J%%%%j%%%%%%%%%%%j%%%%%%%J%
$$ 103 103 103 103 104 103 103 102 102 102 103 103 104 104 104 104 103 104 105 105 105 104 103 103 102 102 102 102 102 103 104 104 103 103 103 104 104 103 103 103 104 104 104 105 105 105 105 105 104 104 104 104 104 104 104 104 104 104 104 104 103 103 103 103 103 103 103 103 104 104
5996A04j%j%J%%%%%J%%%%jjJ%%%%%%%%J%%%J%%k%j%%jJ%%J%%j%%%%%JJ%%j%%%%%%j%%JJ%%
$$ 104 103 103 102 102 103 103 103 103 103 103 104 104 104 104 104 103 102 103 103 103 103 103 103 103 103 103 104 104 104 104 105 105 105 103 103 102 102 102 101 102 102 102 103 103 103 102 102 102 102 102 102 103 104 104 104 103 103 103 103 103 103 103 102 102 102 103 104 104 104
5989A04%%%%%%%%%J%%j%j%%j%J%%j%J%%%%%Jj%j%J%%%%%J%%j%jJ%%%%%J%%jJ%%j%J%%jj%%
$$ 104 104 104 104 104 104 104 104 104 104 105 105 105 104 104 103 103 103 102 102 103 103 103 102 102 103 103 103 103 103 103 104 103 103 102 102 103 103 103 103 103 103 104 104 104 103 103 102 103 103 103 103 103 103 104 104 104 103 104 104 104 103 103 104 104 104 103 102 102 102
5982A02JJ%%jJJ%%%%%j%j%jJ%%J%%%%%%%%%j%%%jJJ%jJ%%j%%%%%%jJ%J%J%%j%%%j%%%%%%%
$$ 102 103 104 104 104 103 104 105 105 105 105 105 105 104 104 103 103 102 103 103 103 104 104 104 104 104 104 104 104 104 104 103 103 103 103 102 103 104 104 103 104 104 104 103 103 103 103 103 103 103 102 103 103 104 104 105 105 105 104 104 104 104 103 103 103 103 103 103 103 103
5974A03j%J%%%%%J%jJ%j%%j%%JJ%%j%%%%j%%%%%%%%%J%%j%%JJj%j%%%%%%J%%J%%j%J%%%%%
$$ 103 102 102 103 103 103 103 103 103 104 104 103 104 104 103 103 103 102 102 102 103 104 104 104 103 103 103 103 103 102 102 102 102 102 102 102 102 102 102 103 103 103 102 102 102 103 104 103 103 102 102 102 102 102 102 102 103 103 103 104 104 104 103 103 104 104 104 104 104 104
5967A04%%%%%%%%j%j%J%j%%%J%j%%J%j%%%J%jj%J%%%J%%%%J%%%%j%%%%J%%j%%J%j%%%%J%J
$$ 104 104 104 104 104 104 104 104 104 103 103 102 102 103 103 102 102 102 102 103 103 102 102 102 103 103 102 102 102 102 103 103 102 101 101 102 102 102 102 103 103 103 103 103 104 104 104 104 104 103 103 103 103 103 104 104 104 103 103 103 104 104 103 103 103 103 103 104 104 105
5960A05j%%%%%%%%%%%j%%j%J%%%j%%%%J%%%%%%J%%%%%%%%%%%%%Jj%%j%%Jj%%%%%%%%J%%J%
$$ 105 104 104 104 104 104 104 104 104 104 104 104 104 103 103 103 102 102 103 103 103 103 102 102 102 102 102 103 103 103 103 103 103 103 104 104 104 104 104 104 104 104 104 104 104 104 104 104 105 104 104 104 103 103 103 104 103 103 103 103 103 103 103 103 103 104 104 104 105 105
5952A05jjjJ%%%J%%j%%%%%%%%%%%%%%j%J%%%%%JJ%%%j%j%%%%%%%%%%%%%j%%%Jj%%j%%j%JJ
$$ 105 104 103 102 103 103 103 103 104 104 104 103 103 103 103 103 103 103 103 103 103 103 103 103 103 103 102 102 103 103 103 103 103 103 104 105 105 105 105 104 104 103 103 103 103 103 103 103 103 103 103 103 103 103 103 102 102 102 102 103 102 102 102 101 101 101 100 100 101 102
5945A02%J%%%%%j%%%j%%JJ%%%%%%j%%%%%%%%%%%J%%%%%j%j%j%%Jj%%J%%%%%%j%%JJJj%%JJ
$$ 102 102 103 103 103 103 103 103 102 102 102 102 101 101 101 102 103 103 103 103 103 103 103 102 102 102 102 102 102 102 102 102 102 102 102 103 103 103 103 103 103 102 102 101 101 100 100 100 101 100 100 100 101 101 101 101 101 101 101 100 100 100 101 102 103 102 102 102 103 104
5938A04%%jj%%%%%%%%%%%J%%j%%%J%%%j%j%J%%%%J%%%j%J%J%%jj%%%J%%%j%%jJ%%%j%J%%j
$$ 104 104 104 103 102 102 102 102 102 102 102 102 102 102 102 102 103 103 103 102 102 102 102 103 103 103 103 102 102 101 101 102 102 102 102 102 103 103 103 103 102 102 103 103 104 104 104 103 102 102 102 102 103 103 103 103 102 102 102 101 102 102 102 102 101 101 102 102 102 101
5930A01%%%J%%%%%j%JJ%JJj%%%%%%%%%%%%j%%%%%%%%j%%%%%J%%%J%jJ%j%%%%%jj%%j%%%JJ
$$ 101 101 101 101 102 102 102 102 102 102 101 101 102 103 103 104 105 104 104 104 104 104 104 104 104 104 104 104 104 104 103 103 103 103 103 103 103 103 103 102 102 102 102 102 102 103 103 103 103 104 104 103 104 104 103 103 103 103 103 103 102 101 101 101 100 100 100 100 101 102
5923A02%J%%%%%%%%%%%J%%j%%%%%J%%%%Jj%%%J%jjj%%%%%%%Jj%%%%jJ%%%%%%%%%%JjJJ%j%
$$ 102 102 103 103 103 103 103 103 103 103 103 103 103 103 104 104 104 103 103 103 103 103 103 104 104 104 104 104 105 104 104 104 104 105 105 104 103 102 102 102 102 102 102 102 102 103 102 102 102 102 102 101 102 102 102 102 102 102 102 102 102 102 102 103 102 103 104 104 103 103
5916A03jJ%J%%%j%%%%%%%j%jJ%%j%JJ%%J%j%%j%%J%%%Jj%%%%%%j%%J%%%JJjjj%JJjjJ%%%J
$$ 103 102 103 103 104 104 104 104 103 103 103 103 103 103 103 103 102 102 101 102 102 102 101 101 102 103 103 103 104 104 103 103 103 102 102 102 103 103 103 103 104 103 103 103 103 103 103 103 102 102 102 103 103 103 103 104 105 104 103 102 102 103 104 103 102 103 103 103 103 104
5908A04%%%%%%j%%%%%Jjj%%J%J%%j%j%%%%%%J%%%%J%j%J%%j%j%%J%%%%%%%%%%%%j%J%J%%%
$$ 104 104 104 104 104 104 104 103 103 103 103 103 103 104 103 102 102 102 103 103 104 104 104 103 103 102 102 102 102 102 102 102 103 103 103 103 103 104 104 103 103 104 104 104 103 103 102 102 102 103 103 103 103 103 103 103 103 103 103 103 103 103 102 102 103 103 104 104 104 104
5901A04%%%Jj%%jjJ%%%%%%jJJ%%%%jJ%%Jj%%%j%%%%%%JJ%%%%j%%%%%%J%jjJ%j%J%%J%%j%%
$$ 104 104 104 104 105 104 104 104 103 102 103 103 103 103 103 103 103 102 103 104 104 104 104 104 103 104 104 104 105 104 104 104 104 103 103 103 103 103 103 103 104 105 105 105 105 105 104 104 104 104 104 104 104 105 105 104 103 104 104 103 103 104 104 104 105 105 105 104 104 104
5894A04Jj%%%J%%%%%%jj%%%%%%%JJ%J%Jj%jj%j%%JJj%%%J%%%J%%jjJj%%%%jJ%%%J%%J%jjJ
$$ 104 105 104 104 104 104 105 105 105 105 105 105 105 104 103 103 103 103 103 103 103 103 104 105 105 106 106 107 106 106 105 104 104 103 103 103 104 105 104 104 104 104 105 105 105 105 106 106 106 105 104 105 104 104 104 104 104 103 104 104 104 104 105 105 105 106 106 105 104 105
5887A05J%%%%j%%Jj%%%%%%%%JJ%%jjJj%%j%Jj%%%%J%j%J%%%%%j%JJJ%%%jj%%%%%JJjJ%%%%
$$ 105 106 106 106 106 106 105 105 105 106 105 105 105 105 105 105 105 105 105 106 107 107 107 106 105 106 105 105 105 104 104 105 104 104 104 104 104 105 105 104 104 105 105 105 105 105 105 104 104 105 106 107 107 107 107 106 105 105 105 105 105 105 106 107 106 107 107 107 107 107
5879A07%%J%Jj%j%%%J%%%%%%%%%%%J%%%%JJ%J%%J%%J%%JJ%JJJ%KJKKLKLLKLLKLLKLKKJJJK
$$ 107 107 107 108 108 109 108 108 107 107 107 107 108 108 108 108 108 108 108 108 108 108 108 108 109 109 109 109 109 110 111 111 112 112 112 113 113 113 114 114 114 115 116 116 117 118 119 119 121 122 124 126 129 131 134 137 139 142 145 147 150 153 155 158 160 162 163 164 165 167
5872A67j%%JJ%%J%j%jjkkkkkllllklkljjjjjjkjj%%j%j%%%%J%JJ%KKKKKLJLLLKLLKLKKKJJ
$$ 167 166 166 166 167 168 168 168 169 169 168 168 167 166 164 162 160 158 156 153 150 147 144 142 139 137 134 133 132 131 130 129 128 126 125 124 124 124 123 123 122 122 122 122 122 123 123 124 125 125 127 129 131 133 135 138 139 142 145 148 150 153 156 158 161 163 165 167 168 169
5865A69JJJ%j%JJjjjjkjkkllmkkmllmljkjkjjjjjjkjj%jj%j%%%%%j%%%jj%j%%j%%JJ%%j%j
$$ 169 170 171 172 172 171 171 172 173 172 171 170 169 167 166 164 162 159 156 152 150 148 144 141 138 134 131 130 128 127 125 124 123 122 121 120 119 117 116 115 115 114 113 113 112 112 112 112 112 112 111 111 111 111 110 109 109 108 108 108 107 107 107 108 109 109 109 108 108 107
5857A07%%%%j%J%J%J%j%%%%J%j%%%%%j%%%J%%%j%jJ%j%J%%%J%%%%%%j%%J%%j%%J%%jJ%J%%
$$ 107 107 107 107 107 106 106 107 107 108 108 109 109 108 108 108 108 108 109 109 108 108 108 108 108 108 107 107 107 107 108 108 108 108 107 107 106 107 107 106 106 107 107 107 107 108 108 108 108 108 108 108 107 107 107 108 108 108 107 107 107 108 108 108 107 108 108 109 109 109
5850A09j%%%%%%%%%%%%J%%%%%jJ%%%J%%%%%%%%%%JJ%j%jJ%J%J%%%%%%J%%j%j%%J%%j%%J%%
$$ 109 108 108 108 108 108 108 108 108 108 108 108 108 108 109 109 109 109 109 109 108 109 109 109 109 110 110 110 110 110 110 110 110 110 110 110 111 112 112 111 111 110 111 111 112 112 113 113 113 113 113 113 113 114 114 114 113 113 112 112 112 113 113 113 112 112 112 113 113 113
5843A13%J%%%%%Jj%%%%%%%%j%j%%%%%%JJ%j%jj%%%j%%J%%%%J%%%%%J%%%%%%%%%j%JJJJ%%%
$$ 113 113 114 114 114 114 114 114 115 114 114 114 114 114 114 114 114 114 113 113 112 112 112 112 112 112 112 113 114 114 113 113 112 111 111 111 111 110 110 110 111 111 111 111 111 112 112 112 112 112 112 113 113 113 113 113 113 113 113 113 113 112 112 113 114 115 116 116 116 116
5835A16%j%%J%%%JJ%%%%%%%%%%%j%jj%J%JJj%j%%jj%%%Jj%%%%%J%%%J%j%%%%J%KJJ%%j%%%
$$ 116 116 115 115 115 116 116 116 116 117 118 118 118 118 118 118 118 118 118 118 118 118 117 117 116 115 115 116 116 117 118 117 117 116 116 116 115 114 114 114 114 115 114 114 114 114 114 114 115 115 115 115 116 116 115 115 115 115 115 116 116 118 119 120 120 120 119 119 119 119
5828A19J%J%%%%%jJ%%J%J%J%J%%%J%%%JJJ%%%%jJ%%%%J%%%%J%jJ%%%%%%%J%%%%J%J%J%%%%
$$ 119 120 120 121 121 121 121 121 121 120 121 121 121 122 122 123 123 124 124 125 125 125 125 126 126 126 126 127 128 129 129 129 129 129 128 129 129 129 129 129 130 130 130 130 130 131 131 130 131 131 131 131 131 131 131 131 132 132 132 132 132 133 133 134 134 135 135 135 135 135
5821A35%J%%JJJJj%%J%%J%%%%%%J%J%%%JJJ%%jJJJJJKJ%JJJ%%%JJJ%JJ%JJJJK%J%%J%J%%J
$$ 135 135 136 136 136 137 138 139 140 139 139 139 140 140 140 141 141 141 141 141 141 141 142 142 143 143 143 143 144 145 146 146 146 145 146 147 148 149 150 152 153 153 154 155 156 156 156 156 157 158 159 159 160 161 161 162 163 164 165 167 167 168 168 168 169 169 170 170 170 171
5813A71%%JJJJJJKK%%j%jjJ%%%%%%JJJJJJ%%%%J%%%%%JJKKJKLKKKLJKKKJJ%%KJ%%jj%%%j%
$$ 171 171 171 172 173 174 175 176 177 179 181 181 181 180 180 179 178 179 179 179 179 179 179 179 180 181 182 183 184 185 185 185 185 185 186 186 186 186 186 186 187 188 190 192 193 195 198 200 202 204 207 208 210 212 214 215 216 216 216 218 219 219 219 218 217 217 217 217 216 216
5806B16%%JJJK%JJ%JKJKJKLMLMMMNONOONNNNMNNNONMMOOOONOOOPPPPQQQQQRRQQRJ0J0J0J0
$$ 216 216 216 217 218 219 221 221 222 223 223 224 226 227 229 230 232 235 239 242 246 250 254 259 265 270 276 282 287 292 297 302 306 311 316 321 327 332 336 340 346 352 358 364 369 375 381 387 394 401 408 415 423 431 439 447 455 464 473 481 489 498 508 518 528 538
5799E38J2J1J1J2J3J4J4J5J5J6J7J7J8J8K0K1K3K3K6K8L1L2L4L5L7L9M0M2M5M8N2N5O1O4P0
$$ 538 550 561 572 584 597 611 625 640 655 671 688 705 723 741 761 782 805 828 854 882 913 945 979 1014 1051 1090 1130 1172 1217 1265 1317 1372 1433 1497 1567
5795A567P7Q4R1J00J08J19J31J44J60J76J97K18K44K72L02L39L77M18M61N05N44N76N99O06
$$ 1567 1644 1728 1819 1919 2027 2146 2277 2421 2581 2757 2954 3172 3416 3688 3990 4329 4706 5124 5585 6090 6634 7210 7809 8415
5793H415N97N69N23M64L97L25K52J85J25P7M6K7K3K7L6M0L0Pl3q4j47k18k90l62m31m90n37
$$ 8415 9012 9581 10104 10568 10965 11290 11542 11727 11852 11929 11975 12002 12025 12052 12088 12128 12158 12165 12132 12048 11901 11683 11393 11031 10600 10110 9573
5790I573n66n76n71n52n19m82m39l96l54l13k74k41k08j78j52j27j05q6o6m9l2j5JJ8L6N2
$$ 9573 9007 8431 7860 7308 6789 6307 5868 5472 5118 4805 4531 4290 4082 3904 3752 3625 3520 3434 3368 3319 3287 3272 3273 3291 3327 3379
5787C379O9Q8J10J32J56J83K14K46K83L21L63M05M47M86N21N47N58N57N39N09M76M43M12L87
$$ 3379 3448 3536 3646 3778 3934 4117 4331 4577 4860 5181 5544 5949 6396 6882 7403 7950 8508 9065 9604 10113 10589 11032 11444 11831
5785A1831L68L47L19K77K20J45N9l3j23k05k72l21l55l79l99m21m49m83n20n51n74n83n79
$$ 11831 12199 12546 12865 13142 13362 13507 13566 13533 13410 13205 12933 12612 12257 11878 11479 11058 10609 10126 9606 9055 8481 7898 7319
5782G319n61n34n00m60m21l81l44l09k78k49k24k01j81j63j46j32j21j09r9r0q3p5o8o3n6
$$ 7319 6758 6224 5724 5264 4843 4462 4118 3809 3531 3282 3058 2857 2676 2513 2367 2235 2114 2005 1906 1816 1733 1658 1590 1527 1471
5780A471n2m7m4m2l9l7l5l3l3l2l1l0l0k9k7k8k6k5k4k4k2k2k0k1j9j9j8j7j7j7j6j4j3j3
$$ 1471 1419 1372 1328 1286 1247 1210 1175 1142 1109 1077 1046 1016 986 957 930 902 876 851 827 803 781 759 739 718 699 680 662 645 628 611 595 581 568 555
5776E55j3j2j2j0j1j1j1j0j0j0rj0pqpqpooonnonnmmnmmkkjk%j%jjjjjjj%jjkkllkllkkkl
$$ 555 542 530 518 508 497 486 475 465 455 445 436 426 419 411 404 396 389 383 377 371 366 361 355 350 345 341 337 332 328 324 322 320 319 317 317 316 316 315 314 313 312 311 310 309 309 308 307 305 303 300 297 295 292 289 287 285 283 280
5770B80lmllmmlmmlmlmkkjkkkkjjjjj%jjjjjkjjkkjkkkjkjkj%kjkjjjjkjjj%jj%j%jjjkjj
$$ 280 277 273 270 267 263 259 256 252 248 245 241 238 234 232 230 229 227 225 223 221 220 219 218 217 216 216 215 214 213 212 211 209 208 207 205 203 202 200 198 196 195 193 192 190 189 189 187 186 184 183 182 181 180 178 177 176 175 175 174 173 173 172 172 171 170 169 167 166 165
5763A65%jjjjjjjjjjjjj%j%jj%%%Jj%j%%%%J%%%%J%%%%%%%j%%%%j%j%%%%%Jjj%j%%%jjj%%
$$ 165 165 164 163 162 161 160 159 158 157 156 155 154 153 152 152 151 151 150 149 149 149 149 150 149 149 148 148 148 148 148 149 149 149 149 149 150 150 150 150 150 150 150 150 149 149 149 149 149 148 148 147 147 147 147 147 147 148 147 146 146 145 145 145 145 144 143 142 142 142
5755A42%%jjjj%%%%%%kjj%J%j%j%%%%%j%%%%%%%%j%%%%%%%J%j%%%%%JJ%j%%Jj%%%%%%%J%j
$$ 142 142 142 141 140 139 138 138 138 138 138 138 138 136 135 134 134 135 135 134 134 133 133 133 133 133 133 132 132 132 132 132 132 132 132 132 131 131 131 131 131 131 131 131 132 132 131 131 131 131 131 131 132 133 133 132 132 132 133 132 132 132 132 132 132 132 132 133 133 132
5748A32%%%j%%j%%%%%%j%%J%%%%J%jJ%J%%j%j%%%%j%jj%%%%%j%%%%%jjjj%%%%%%j%%%%j%%
$$ 132 132 132 132 131 131 131 130 130 130 130 130 130 130 129 129 129 130 130 130 130 130 131 131 130 131 131 132 132 132 131 131 130 130 130 130 130 129 129 128 127 127 127 127 127 127 126 126 126 126 126 126 125 124 123 122 122 122 122 122 122 122 121 121 121 121 121 120 120 120
5741A20%J%%%%%%%%%j%%%%J%J%%%%jJJ%j%%%%j%%j%JJJ%jkj%j%%j%%j%j%%j%%%%%%%jk%%%
$$ 120 120 121 121 121 121 121 121 121 121 121 121 120 120 120 120 120 121 121 122 122 122 122 122 121 122 123 123 122 122 122 122 122 121 121 121 120 120 121 122 123 123 122 120 119 119 118 118 118 117 117 117 116 116 115 115 115 114 114 114 114 114 114 114 114 113 111 111 111 111
5733A11jJ%%j%%%%%%%%J%J%%%j%%%%%%%j%%%%%j%%%%%%j%J%JJ%%jjJ%%%J%%j%%%%%j%Jj%%
$$ 111 110 111 111 111 110 110 110 110 110 110 110 110 110 111 111 112 112 112 112 111 111 111 111 111 111 111 111 110 110 110 110 110 110 109 109 109 109 109 109 109 108 108 109 109 110 111 111 111 110 109 110 110 110 110 111 111 111 110 110 110 110 110 110 109 109 110 109 109 109
5726A09%%%%J%%J%%%jj%%%%%j%%%%%%%%JJj%%J%%%%%%%j%%%%%%Jj%%%%%%Jj%%jjJ%J%%%%%
$$ 109 109 109 109 109 110 110 110 111 111 111 111 110 109 109 109 109 109 109 108 108 108 108 108 108 108 108 108 109 110 109 109 109 110 110 110 110 110 110 110 110 109 109 109 109 109 109 109 110 109 109 109 109 109 109 109 110 109 109 109 108 107 108 108 109 109 109 109 109 109
5719A09%J%%J%%%J%%%j%%%%%%%J%J%%j%J%%J%j%%%%%J%%%J%%%%%j%%JJ%%%JJ%J%J%JJJ%JK
$$ 109 109 110 110 110 111 111 111 111 112 112 112 112 111 111 111 111 111 111 111 111 112 112 113 113 113 112 112 113 113 113 114 114 113 113 113 113 113 113 114 114 114 114 115 115 115 115 115 115 114 114 114 115 116 116 116 116 117 118 118 119 119 120 120 121 122 123 123 124 126
5711A26JJKJKKLKLMLLLKLKKLJKJKJJJjJ%jjjkjkkkkkkkmkkklklkkjjkjj%%J%j%j%%jJJJJJ
$$ 126 127 128 130 131 133 135 138 140 143 147 150 153 156 158 161 163 165 168 169 171 172 174 175 176 177 176 177 177 176 175 174 172 171 169 167 165 163 161 159 157 153 151 149 147 144 142 139 137 135 134 133 131 130 129 129 129 130 130 129 129 128 128 128 127 128 129 130 131 132
5704A32%JJ%JLKLKKKKMLLLKKJKLKJJ%%J%jjkjkjkklkllllkllmkkjkkkjjjjkjjj%%%j%Jj%%
$$ 132 132 133 134 134 135 138 140 143 145 147 149 151 155 158 161 164 166 168 169 171 174 176 177 178 178 178 179 179 178 177 175 174 172 171 169 167 164 162 159 156 153 150 148 145 142 138 136 134 133 131 129 127 126 125 124 123 121 120 119 118 118 118 118 117 117 118 117 117 117
5697A17jj%j%jJ%%%j%%j%j%%j%J%%j%J%j%j%Jj%j%%J%%%%%%%j%J%%%J%%%%%%j%%%%%%j%%%
$$ 117 116 115 115 114 114 113 114 114 114 114 113 113 113 112 112 111 111 111 110 110 111 111 111 110 110 111 111 110 110 109 109 110 109 109 108 108 108 109 109 109 109 109 109 109 109 108 108 109 109 109 109 110 110 110 110 110 110 110 109 109 109 109 109 109 109 108 108 108 108
5690A08%%%J%%%j%%%%%%%%%%%%J%%jj%jJ%%Jj%%%%%%%%j%jJJ%%J%J%j%J%%j%%%%%%%%%Jj%
$$ 108 108 108 108 109 109 109 109 108 108 108 108 108 108 108 108 108 108 108 108 108 109 109 109 108 107 107 106 107 107 107 108 107 107 107 107 107 107 107 107 107 106 106 105 106 107 107 107 108 108 109 109 108 108 109 109 109 108 108 108 108 108 108 108 108 108 108 109 108 108
5682A08%%%%%%j%%%%%%%%%J%j%%j%Jj%%%J%%%%%%J%%j%%%%%%%%%%%%%%%%Jj%%j%J%%j%K%%
$$ 108 108 108 108 108 108 108 107 107 107 107 107 107 107 107 107 107 108 108 107 107 107 106 106 107 106 106 106 106 107 107 107 107 107 107 107 108 108 108 107 107 107 107 107 107 107 107 107 107 107 107 107 107 107 107 107 108 107 107 107 106 106 107 107 107 106 106 108 108 108
5675A08%%jJ%%%%JjjJ%%%%%%%%J%%%%%%J%%%%%%%j%J%%%%%%%%%%J%j%%j%jj%%%%%%Jj%%Jj
$$ 108 108 108 107 108 108 108 108 108 109 108 107 108 108 108 108 108 108 108 108 108 109 109 109 109 109 109 109 110 110 110 110 110 110 110 110 109 109 110 110 110 110 110 110 110 110 110 110 110 111 111 110 110 110 109 109 108 107 107 107 107 107 107 107 108 107 107 107 108 107
5668A07%%%%%J%%%%j%%%%%j%J%J%%%%J%%%J%%%jj%%%%%%%%%%%jJ%%%%%j%%%jJ%%%%J%%j%j
$$ 107 107 107 107 107 107 108 108 108 108 108 107 107 107 107 107 107 106 106 107 107 108 108 108 108 108 109 109 109 109 110 110 110 110 109 108 108 108 108 108 108 108 108 108 108 108 108 107 108 108 108 108 108 108 107 107 107 107 106 107 107 107 107 107 108 108 108 107 107 106
5660A06%jJ%Jj%%%%%%j%J%J%%%%%%j%%%J%%%J%%jj%JJ%J%%j%%Jj%%jj%J%%%%%J%j%%JJ%%j
$$ 106 106 105 106 106 107 106 106 106 106 106 106 106 105 105 106 106 107 107 107 107 107 107 107 106 106 106 106 107 107 107 107 108 108 108 107 106 106 107 108 108 109 109 109 108 108 108 109 108 108 108 107 106 106 107 107 107 107 107 107 108 108 107 107 107 108 109 109 109 108
5653A08J%%%%%J%jJ%Jj%%%JJ%jJ%%%%JJJJJKJKJKJJK%JLKKLLLMLMMLKKLK%%%%%j%J%J%J%%
$$ 108 109 109 109 109 109 109 110 110 109 110 110 111 110 110 110 110 111 112 112 111 112 112 112 112 112 113 114 115 116 117 119 120 122 123 125 126 127 129 129 130 133 135 137 140 143 146 150 153 157 161 164 166 168 171 173 173 173 173 173 173 172 172 173 173 174 174 175 175 175
5646A75%jjkllllklllllkjkkjkk%jjj%Jj%j%JJ%J%%JKKJKKLKLLLKMLLLLJKJJ%%%%%j%%%J%
$$ 175 175 174 173 171 168 165 162 159 157 154 151 148 145 142 140 139 137 135 134 132 130 130 129 128 127 127 128 127 127 126 126 127 128 128 129 129 129 130 132 134 135 137 139 142 144 147 150 153 155 159 162 165 168 171 172 174 175 176 176 176 176 176 176 175 175 175 175 176 176
5638A76%jjkljkllllmlklllllkkkk%jj%j%%j%kk%j%j%%%%%jj%j%j%%%%J%%%%%j%%j%%%%%%
$$ 176 176 175 174 172 169 168 166 163 160 157 154 150 147 145 142 139 136 133 130 128 126 124 122 122 121 120 120 119 119 119 118 118 116 114 114 113 113 112 112 112 112 112 112 111 110 110 109 109 108 108 108 108 108 109 109 109 109 109 109 108 108 108 107 107 107 107 107 107 107
5631A07%%%%%%j%%%J%%%%%j%j%%%jJ%%%j%%J%J%j%%%%%%%%%%j%%%JJjjj%%J%J%%%%%Jj%j%
$$ 107 107 107 107 107 107 107 106 106 106 106 107 107 107 107 107 107 106 106 105 105 105 105 104 105 105 105 105 104 104 104 105 105 106 106 105 105 105 105 105 105 105 105 105 105 105 104 104 104 104 105 106 105 104 103 103 103 104 104 105 105 105 105 105 105 106 105 105 104 104
5624A04%%JJ%jk%%%J%J%%%%j%%%%%%%Jj%%%%%J%J%j%%jj%%%J%%%%Jj%%%j%%%%%%%%%%J%%%
$$ 104 104 104 105 106 106 105 103 103 103 103 104 104 105 105 105 105 105 104 104 104 104 104 104 104 104 105 104 104 104 104 104 104 105 105 106 106 105 105 105 104 103 103 103 103 104 104 104 104 104 105 104 104 104 104 103 103 103 103 103 103 103 103 103 103 103 104 104 104 104
5616A04Jj%%jJ%J%%%%%%%J%%jj%%%J%%%%%J%%%%J%%%jJJjjjj%%%%%%%%%%j%Jj%jJ%%%j%J%
$$ 104 105 104 104 104 103 104 104 105 105 105 105 105 105 105 105 106 106 106 105 104 104 104 104 105 105 105 105 105 105 106 106 106 106 106 107 107 107 107 106 107 108 107 106 105 104 104 104 104 104 104 104 104 104 104 104 103 103 104 103 103 102 103 103 103 103 102 102 103 103
5609A03%J%%%j%jJK%%%%%j%%%%%%%%%%J%%%%%J%%J%jJ%%%%j%jJ%%%j%%j%%%%j%j%%%%J%%J
$$ 103 103 104 104 104 104 103 103 102 103 105 105 105 105 105 105 104 104 104 104 104 104 104 104 104 104 104 105 105 105 105 105 105 106 106 106 107 107 106 107 107 107 107 107 106 106 105 106 106 106 106 105 105 105 104 104 104 104 104 103 103 102 102 102 102 102 103 103 103 104
5602A04%%j%J%%%%j%%J%%%%J%j%%j%%j%J%J%%%j%%J%%%%j%%J%%%%%%%%%%%%%%%%%%%%%%%J
$$ 104 104 104 103 103 104 104 104 104 104 103 103 103 104 104 104 104 104 105 105 104 104 104 103 103 103 102 102 103 103 104 104 104 104 103 103 103 104 104 104 104 104 103 103 103 104 104 104 104 104 104 104 104 104 104 104 104 104 104 104 104 104 104 104 104 104 104 104 104 105
5594A05%jj%J%%%%%%%jJJ%%jj%%J%J%%j%j%J%%j%J%%Jj%%J%%%%j%%J%%Jj%%J%%%%%%J%j%%
$$ 105 105 104 103 103 104 104 104 104 104 104 104 104 103 104 105 105 105 104 103 103 103 104 104 105 105 105 104 104 103 103 104 104 104 103 103 104 104 104 105 104 104 104 105 105 105 105 105 104 104 104 105 105 105 106 105 105 105 106 106 106 106 106 106 106 107 107 106 106 106
5587A06%%%%%j%J%Jjj%%%%J%Jj%%%%%%%%%%J%%%%j%%%j%J%%jJ%J%%jJ%JJ%%j%j%%%%%%%JJ
$$ 106 106 106 106 106 106 105 105 106 106 107 106 105 105 105 105 105 106 106 107 106 106 106 106 106 106 106 106 106 106 106 107 107 107 107 107 106 106 106 106 105 105 106 106 106 105 106 106 107 107 107 106 107 107 108 109 109 109 108 108 107 107 107 107 107 107 107 107 108 109
5580A09%%%%%%%J%%%%%%J%JJ%j%%JJ%Jj%%%%J%%J%%%%%%%JJJJJ%%J%%J%%%JJJJJJJJ%JJJJ
$$ 109 109 109 109 109 109 109 109 110 110 110 110 110 110 110 111 111 112 113 113 112 112 112 113 114 114 115 114 114 114 114 114 115 115 115 116 116 116 116 116 116 116 116 117 118 119 120 121 121 121 122 122 122 123 123 123 123 124 125 126 127 128 129 130 131 131 132 133 134 135
5573A35JJJKKKKKKKKLLLLLLLLNNNNOOPOPPPQQRQPQOOOOMMKKKKK%J%J%Jjjllmmnopoopooop
$$ 135 136 137 138 140 142 144 146 148 150 152 154 157 160 163 166 169 172 175 178 183 188 193 198 204 210 217 223 230 237 244 252 260 269 277 284 292 298 304 310 316 320 324 326 328 330 332 334 334 335 335 336 336 337 336 335 332 329 325 321 316 310 303 297 291 284 278 272 266 259
5565B59oonmmmmlklkjkJ%JJJJJKLLMMMMMOOPPPPPPPOONNMKLK%JJ%j%%jjjklmnmooppqqqrq
$$ 259 253 247 242 238 234 230 226 223 221 218 216 215 213 214 214 215 216 217 218 219 221 224 227 231 235 239 243 247 253 259 266 273 280 287 294 301 308 314 320 325 330 334 336 339 341 341 342 343 343 342 342 342 341 340 339 337 334 330 325 321 315 309 302 295 287 279 271 262 254
5558B54rpqpoponomnmmllmlklklkjkkkkjkjkjk%jjjjjj%jj%jj%j%j%kj%%%jj%%jJ%j%j%j%
$$ 254 245 238 230 223 217 210 204 199 193 189 184 180 176 173 170 166 163 161 158 156 153 151 150 148 146 144 142 141 139 138 136 135 133 133 132 131 130 129 128 127 127 126 125 125 124 123 123 122 122 121 121 119 118 118 118 118 117 116 116 116 115 116 116 115 115 114 114 113 113
5551A13%J%jj%%j%%%%%j%%%jJ%Jjjj%%JJ%jjj%%%%%%J%%%%%%%%j%%%J%%j%%%%Jj%j%%%%%%
$$ 113 113 114 114 113 112 112 112 111 111 111 111 111 111 110 110 110 110 109 110 110 111 110 109 108 108 108 109 110 110 109 108 107 107 107 107 107 107 107 108 108 108 108 108 108 108 108 108 107 107 107 107 108 108 108 107 107 107 107 107 108 107 107 106 106 106 106 106 106 106
5543A06%%%jJ%%j%%jJ%%%%j%J%%j%J%%%%%j%J%%%j%%%j%%J%%jj%%%J%%jJ%%%j%J%%%%%%%%
$$ 106 106 106 106 105 106 106 106 105 105 105 104 105 105 105 105 105 104 104 105 105 105 104 104 105 105 105 105 105 105 104 104 105 105 105 105 104 104 104 104 103 103 103 104 104 104 103 102 102 102 102 103 103 103 102 103 103 103 103 102 102 103 103 103 103 103 103 103 103 103
5536A03%JJ%jj%%%%%j%%%%%%%%%%JJ%j%%%%%%j%%%%%%%%%%J%j%%%%%%%%%%%%%J%jj%%%J%%
$$ 103 103 104 105 105 104 103 103 103 103 103 103 102 102 102 102 102 102 102 102 102 102 102 103 104 104 103 103 103 103 103 103 103 102 102 102 102 102 102 102 102 102 102 102 103 103 102 102 102 102 102 102 102 102 102 102 102 102 102 102 103 103 102 101 101 101 101 102 102 102
5529A02%%%%%%%%%%%%%J%Jj%j%J%%%%%%j%%J%%Jjj%%%%%%%%%%%%J%%j%%%j%%J%%%%%%jJ%j
$$ 102 102 102 102 102 102 102 102 102 102 102 102 102 102 103 103 104 103 103 102 102 103 103 103 103 103 103 103 102 102 102 103 103 103 104 103 102 102 102 102 102 102 102 102 102 102 102 102 102 103 103 103 102 102 102 102 101 101 101 102 102 102 102 102 102 102 101 102 102 101
5521A01J%%%Jj%%%J%%J%%%jj%%%%%%j%J%%%J%j%%%%%%%jj%J%%j%J%J%%%%%j%jJJ%%j%%J%%
$$ 101 102 102 102 102 103 102 102 102 102 103 103 103 104 104 104 104 103 102 102 102 102 102 102 102 101 101 102 102 102 102 103 103 102 102 102 102 102 102 102 102 101 100 100 101 101 101 100 100 101 101 102 102 102 102 102 102 101 101 100 101 102 102 102 101 101 101 102 102 102
5514A02%j%%j%jJJ%%J%%%J%j%%j%J%%%%%j%%J%%jJ%%j%jJ%%%J%%%%%j%%%%%%J%j%%%J%%J%
$$ 102 102 101 101 101 100 100 99 100 101 101 101 102 102 102 102 103 103 102 102 102 101 101 102 102 102 102 102 102 101 101 101 102 102 102 101 102 102 102 101 101 100 101 101 101 101 102 102 102 102 102 102 101 101 101 101 101 101 101 102 102 101 101 101 101 102 102 102 103 103
5507A03%jjj%%%%%%%%J%%J%%%%%%%%j%%%%%J%jj%J%J%%j%jJ%%%%%%%%j%%J%j%%J%%%J%%%%
$$ 103 103 102 101 100 100 100 100 100 100 100 100 100 101 101 101 102 102 102 102 102 102 102 102 102 101 101 101 101 101 101 102 102 101 100 100 101 101 102 102 102 101 101 100 101 101 101 101 101 101 101 101 101 100 100 100 101 101 100 100 100 101 101 101 101 102 102 102 102 102
5499A02Jj%%%j%%%%Jj%%%j%%%%%%%J%j%%Jj%%%%j%%JJJj%j%%%%JJ%%%%j%j%%%%%%%J%%j%%
$$ 102 103 102 102 102 102 101 101 101 101 101 102 101 101 101 101 100 100 100 100 100 100 100 100 101 101 100 100 100 101 100 100 100 100 100 99 99 99 100 101 102 101 101 100 100 100 100 100 101 102 102 102 102 102 101 101 100 100 100 100 100 100 100 100 101 101 101 100 100 100
5492A00%%%%%%J%%%J%%%%%%j%%%%%%%%%%%%JJ%j%%%%jj%%JJ%%%%%j%%%%%%%%%%%J%%%%%j%
$$ 100 100 100 100 100 100 100 101 101 101 101 102 102 102 102 102 102 102 101 101 101 101 101 101 101 101 101 101 101 101 101 102 103 103 102 102 102 102 102 101 100 100 100 101 102 102 102 102 102 102 101 101 101 101 101 101 101 101 101 101 101 101 102 102 102 102 102 102 101 101
5485A01J%%J%%%j%%%%%%%J%%%%j%%%%%%%%%%jjJ%%%%%%J%%%%%%%%%%jJJ%j%%jJ%%j%jJ%%%
$$ 101 102 102 102 103 103 103 103 102 102 102 102 102 102 102 102 103 103 103 103 103 102 102 102 102 102 102 102 102 102 102 102 101 100 101 101 101 101 101 101 101 102 102 102 102 102 102 102 102 102 102 102 101 102 103 103 102 102 102 101 102 102 102 101 101 100 101 101 101 101
5477A01j%%%%Jj%JJJ%%Jj%%j%j%J%%%Jj%%%%j%%Jj%j%J%%%jJ%%%Jj%%JJJ%jjj%%%%%%Jj%j
$$ 101 100 100 100 100 100 101 100 100 101 102 103 103 103 104 103 103 103 102 102 101 101 102 102 102 102 103 102 102 102 102 102 101 101 101 102 101 101 100 100 101 101 101 101 100 101 101 101 101 102 101 101 101 102 103 104 104 103 102 101 101 101 101 101 101 101 102 101 101 100
5470A00%%%J%%%J%jj%%J%%J%j%%%%%%%%J%%%%jjJ%%%%%%j%J%j%J%%J%%%%jjjJKjjj%%%%JJ
$$ 100 100 100 100 101 101 101 101 102 102 101 100 100 100 101 101 101 102 102 101 101 101 101 101 101 101 101 101 102 102 102 102 102 101 100 101 101 101 101 101 101 101 100 100 101 101 100 100 101 101 101 102 102 102 102 102 101 100 99 100 102 101 100 99 99 99 99 99 100 101
5463A01%%%%%jJj%%KJ%%j%%j%%%%%%%%J%J%%j%%jjj%JJ%j%%%%J%%J%%Jjj%J%%j%j%jJ%J%%
$$ 101 101 101 101 101 101 100 101 100 100 100 102 103 103 103 102 102 102 101 101 101 101 101 101 101 101 101 102 102 103 103 103 102 102 102 101 100 99 99 100 101 101 100 100 100 100 100 101 101 101 102 102 102 103 102 101 101 102 102 102 101 101 100 100 99 100 100 101 101 101
5456A01%%%%%%%%%%%%%%Jj%%%%%%%%%%%%j%%%%J%%%%%%%%J%%j%%%J%j%%%j%%%%J%%%%%j%%
$$ 101 101 101 101 101 101 101 101 101 101 101 101 101 101 101 102 101 101 101 101 101 101 101 101 101 101 101 101 101 100 100 100 100 100 101 101 101 101 101 101 101 101 101 102 102 102 101 101 101 101 102 102 101 101 101 101 100 100 100 100 100 101 101 101 101 101 101 100 100 100
5448A00%%J%%%%j%Jj%j%%%JJJj%%%%j%J%J%j%%j%jJ%J%%%j%%%J%%%%%%j%%%%%%Jj%%%J%%%
$$ 100 100 100 101 101 101 101 101 100 100 101 100 100 99 99 99 99 100 101 102 101 101 101 101 101 100 100 101 101 102 102 101 101 101 100 100 99 100 100 101 101 101 101 100 100 100 100 101 101 101 101 101 101 101 100 100 100 100 100 100 100 101 100 100 100 100 101 101 101 101
5441A01%%jJ%%%%J%%%%Jj%%j%%J%j%%%j%%%j%JJ%%%%jj%%%%%%%JJJ%%%%Jj%jj%jJ%%J%%%%
$$ 101 101 101 100 101 101 101 101 101 102 102 102 102 102 103 102 102 102 101 101 101 102 102 101 101 101 101 100 100 100 100 99 99 100 101 101 101 101 101 100 99 99 99 99 99 99 99 99 100 101 102 102 102 102 102 103 102 102 101 100 100 99 100 100 100 101 101 101 101 101
5434A01jJ%%j%%%J%%%%%Jj%%%j%%JJ%%jj%%%%%%j%J%J%%J%%j%%%%%%%J%%jj%%%%%%%J%Jj%
$$ 101 100 101 101 101 100 100 100 100 101 101 101 101 101 101 102 101 101 101 101 100 100 100 101 102 102 102 101 100 100 100 100 100 100 100 99 99 100 100 101 101 101 102 102 102 101 101 101 101 101 101 101 101 102 102 102 101 100 100 100 100 100 100 100 100 101 101 102 101 101
5426A01J%%%Jjj%%j%%%J%J%Jjj%%%%%%%%%%Jj%%%%J%%j%J%%%%j%j%Jj%%%%%J%%j%J%%j%%J
$$ 101 102 102 102 102 103 102 101 101 101 100 100 100 100 101 101 102 102 103 102 101 101 101 101 101 101 101 101 101 101 101 102 101 101 101 101 101 102 102 102 101 101 102 102 102 102 102 101 101 100 100 101 100 100 100 100 100 100 101 101 101 100 100 101 101 101 100 100 100 101
5419A01%%jJ%J%j%j%%j%%JJ%%%%j%%%%j%%Jj%%%%J%%%%%%%jJJ%%j%%J%%j%J%%%%%j%%%J%%
$$ 101 101 101 100 101 101 102 102 101 101 100 100 100 99 99 99 100 101 101 101 101 101 100 100 100 100 100 99 99 99 100 99 99 99 99 99 100 100 100 100 100 100 100 100 99 100 101 101 101 100 100 100 101 101 101 100 100 101 101 101 101 101 101 100 100 100 100 101 101 101
5412A01%%%%%j%Jj%%%%%%%%%%%J%%%%%j%%%j%%%J%J%j%%%%J%%J%jj%%%%%J%%%%%%j%%%%J%
$$ 101 101 101 101 101 101 100 100 101 100 100 100 100 100 100 100 100 100 100 100 100 101 101 101 101 101 101 100 100 100 100 99 99 99 99 100 100 101 101 100 100 100 100 100 101 101 101 102 102 101 100 100 100 100 100 100 101 101 101 101 101 101 101 100 100 100 100 100 101 101
5404A01%%jJ%%%jj%%%JJ%%%%%%%%J%%j%%J%%J%j%jjJ%J%%%%%%j%J%%%%%%%%%j%%j%%%%%%%
$$ 101 101 101 100 101 101 101 101 100 99 99 99 99 100 101 101 101 101 101 101 101 101 101 102 102 102 101 101 101 102 102 102 103 103 102 102 101 100 101 101 102 102 102 102 102 102 102 101 101 102 102 102 102 102 102 102 102 102 102 101 101 101 100 100 100 100 100 100 100 100
5397A00%%%%%J%%JJ%jjj%%%%%J%j%%%%%%%%J%%%%%%%%%%%%%j%%%%jJJ%j%%%%j%%%J%%J%%%
$$ 100 100 100 100 100 100 101 101 101 102 103 103 102 101 100 100 100 100 100 100 101 101 100 100 100 100 100 100 100 100 100 101 101 101 101 101 101 101 101 101 101 101 101 101 101 100 100 100 100 100 99 100 101 101 100 100 100 100 100 99 99 99 99 100 100 100 101 101 101 101
5390A01j%J%%jJ%%%j%%jJ%%%%%%%%%%%%J%j%j%%%%%J%%%%%%%%%J%%jj%%J%%%J%%j%%Jjj%j
$$ 101 100 100 101 101 101 100 101 101 101 101 100 100 100 99 100 100 100 100 100 100 100 100 100 100 100 100 100 101 101 100 100 99 99 99 99 99 99 100 100 100 100 100 100 100 100 100 100 101 101 101 100 99 99 99 100 100 100 100 101 101 101 100 100 100 101 100 99 99 98
5382I8j%JJ%%%%%%%%j%%%%%%%%%%%%J%J%jJ%%%jJ%Jj%j%J%%%%%j%JJ%%%%%%%%%%%%%%%%%%
$$ 98 97 97 98 99 99 99 99 99 99 99 99 99 98 98 98 98 98 98 98 98 98 98 98 98 98 99 99 100 100 99 100 100 100 100 99 100 100 101 100 100 99 99 100 100 100 100 100 100 99 99 100 101 101 101 101 101 101 101 101 101 101 101 101 101 101 101 101 101 101 101
5375A01%%JJ%%Jj%%%%j%j%%j%%JJ%JjjJ%j%%J%jj%%%J%%Jj%jJJ%j%%%%%J%J%%%%jj%%%%J%
$$ 101 101 101 102 103 103 103 104 103 103 103 103 103 102 102 101 101 101 100 100 100 101 102 102 103 102 101 102 102 101 101 101 102 102 101 100 100 100 100 101 101 101 102 101 101 100 101 102 102 101 101 101 101 101 101 102 102 103 103 103 103 103 102 101 101 101 101 101 102 102
5368A02%%%Jj%%J%jj%%j%J%%j%J%%J%%%%%J%%j%%%%jJ%%%%%%%%J%%%%%%%%%%%J%%%%Jjj%%
$$ 102 102 102 102 103 102 102 102 103 103 102 101 101 101 100 100 101 101 101 100 100 101 101 101 102 102 102 102 102 102 103 103 103 102 102 102 102 102 101 102 102 102 102 102 102 102 102 102 103 103 103 103 103 103 103 103 103 103 103 103 104 104 104 104 104 105 104 103 103 103
5360A03%%%j%%J%%%%%%%%J%jj%j%%J%J%JJjj%J%j%jJ%%%%%%%%%j%J%%%%jJJj%%jJ%J%%%%j
$$ 103 103 103 103 102 102 102 103 103 103 103 103 103 103 103 103 104 104 103 102 102 101 101 101 102 102 103 103 104 105 104 103 103 104 104 103 103 102 103 103 103 103 103 103 103 103 103 103 102 102 103 103 103 103 103 102 103 104 103 103 103 102 103 103 104 104 104 104 104 103
5353A03%%%%%j%JJ%jj%%%%%%J%Jj%j%%%%%%%%%%j%%%%J%%%%%%J%%%j%%%J%j%%%%%jJ%%%%%
$$ 103 103 103 103 103 103 102 102 103 104 104 103 102 102 102 102 102 102 102 103 103 104 103 103 102 102 102 102 102 102 102 102 102 102 102 101 101 101 101 101 102 102 102 102 102 102 102 103 103 103 103 102 102 102 102 103 103 102 102 102 102 102 102 101 102 102 102 102 102 102
5346A02%%JJ%%%%%j%%%%%%%%%jJ%%Jj%%%%j%%%%J%%J%%j%%%%%%%%%%%JJ%j%jj%%%jJ%%%%J
$$ 102 102 102 103 104 104 104 104 104 104 103 103 103 103 103 103 103 103 103 103 102 103 103 103 104 103 103 103 103 103 102 102 102 102 102 103 103 103 104 104 104 103 103 103 103 103 103 103 103 103 103 103 103 104 105 105 104 104 103 102 102 102 102 101 102 102 102 102 102 103
5338A03%%JJ%j%%%%j%%%%J%%%jJJ%%%%%%%%%%%%%%%Jjj%jJJJ%%%%%%%%%%%%%%%%%%j%%%%J
$$ 103 103 103 104 105 105 104 104 104 104 104 103 103 103 103 103 104 104 104 104 103 104 105 105 105 105 105 105 105 105 105 105 105 105 105 105 105 105 106 105 104 104 103 104 105 106 106 106 106 106 106 106 106 106 106 106 106 106 106 106 106 106 106 106 105 105 105 105 105 106
5331A06%%%jJ%%J%J%%%%%jj%%J%%%J%j%JJj%%%%Jj%%%%%J%%J%%%J%J%%j%%J%J%%J%%J%J%J
$$ 106 106 106 106 105 106 106 106 107 107 108 108 108 108 108 108 107 106 106 106 107 107 107 107 108 108 107 107 108 109 108 108 108 108 108 109 108 108 108 108 108 108 109 109 109 110 110 110 110 111 111 112 112 112 111 111 111 112 112 113 113 113 114 114 114 115 115 116 116 117
5324A17%JJ%KJJKJJKKJKK%%J%%%%j%%%JJJ%%Jj%jjjkjjjjjj%j%%%jJ%%JJJ%%%JJJJKKLKLK
$$ 117 117 118 119 119 121 122 123 125 126 127 129 131 132 134 136 136 136 137 137 137 137 137 136 136 136 136 137 138 139 139 139 140 139 139 138 137 136 134 133 132 131 130 129 128 128 127 127 127 127 126 127 127 127 128 129 130 130 130 130 131 132 133 134 136 138 141 143 146 148
5317A48LMMNNNNNOPPOONMMLLKJJ%jjlklklmmmlllllmmmmmnmlmllllkkjjjjjj%%jJ%%%%JJJ
$$ 148 151 155 159 164 169 174 179 184 190 197 204 210 216 221 225 229 232 235 237 238 239 239 238 237 234 232 229 227 224 220 216 212 209 206 203 200 197 193 189 185 181 177 172 168 165 161 158 155 152 149 147 145 144 143 142 141 140 139 139 139 138 139 139 139 139 139 140 141 142
5309A42J%KKLLKLLNNNOPOOOONMMKKJ%j%kklkkmlmnmnnmnmmmnmmnllkljkjkkkjkjjj%%%%Jj
$$ 142 143 143 145 147 150 153 155 158 161 166 171 176 182 189 195 201 207 213 218 222 226 228 230 231 231 230 230 228 226 223 221 219 215 212 208 203 199 194 189 185 180 176 172 168 163 159 155 150 147 144 142 139 138 136 135 133 131 129 128 126 125 124 123 123 123 123 123 124 123
5302A23j%%j%j%%%jjj%%J%%j%J%%j%%%%%j%%%JJJj%j%%j%Jj%%%%J%j%%j%%%%%%%%%J%%%J%
$$ 123 122 122 122 121 121 120 120 120 120 119 118 117 117 117 118 118 118 117 117 118 118 118 117 117 117 117 117 117 116 116 116 116 117 118 119 118 118 117 117 117 116 116 117 116 116 116 116 116 117 117 116 116 116 115 115 115 115 115 115 115 115 115 115 116 116 116 116 117 117
5295A17%%%%%%j%%J%JJ%j%%j%%%%%%J%JJj%%%%%%J%%%%%%j%%J%J%%J%%%%%%%%%%J%J%%J%%
$$ 117 117 117 117 117 117 117 116 116 116 117 117 118 119 119 118 118 118 117 117 117 117 117 117 117 118 118 119 120 119 119 119 119 119 119 119 120 120 120 120 120 120 120 119 119 119 120 120 121 121 121 122 122 122 122 122 122 122 122 122 122 122 123 123 124 124 124 125 125 125
5287A25J%%%%%%J%%j%%%%%J%%%%%%%J%%%jj%%%%J%%%%%J%jJ%%%%J%%J%%%%%j%%%j%%J%%%%
$$ 125 126 126 126 126 126 126 126 127 127 127 126 126 126 126 126 126 127 127 127 127 127 127 127 127 128 128 128 128 127 126 126 126 126 126 127 127 127 127 127 127 128 128 127 128 128 128 128 128 129 129 129 130 130 130 130 130 130 129 129 129 129 128 128 128 129 129 129 129 129
5280A29j%j%%%J%%J%j%jjjj%%j%%%j%J%%j%%%J%%J%%JJJJ%%%%%%JJJJ%%%J%JJKJ%J%J%JJj
$$ 129 128 128 127 127 127 127 128 128 128 129 129 128 128 127 126 125 124 124 124 123 123 123 123 122 122 123 123 123 122 122 122 122 123 123 123 124 124 124 125 126 127 128 128 128 128 128 128 128 129 130 131 132 132 132 132 133 133 134 135 137 138 138 139 139 140 140 141 142 141
5273A41%%%JJ%J%%J%%JJJ%%%%%%%%JJJ%JJ%%J%J%J%J%%J%JJJ%%J%%%JJ%%j%%%JK%%%%%%KJ
$$ 141 141 141 141 142 143 143 144 144 144 145 145 145 146 147 148 148 148 148 148 148 148 148 148 149 150 151 151 152 153 153 153 154 154 155 155 156 156 157 157 157 158 158 159 160 161 161 161 162 162 162 162 163 164 164 164 163 163 163 163 164 166 166 166 166 166 166 166 168 169
5265A69KJ%JJ%J%KJJJ%J%%J%JJJJJJKJ%KJ%%Jj%%%%JJJJKJKJKJKJLKJJJJJJJJKJKJJJJJ%J
$$ 169 171 172 172 173 174 174 175 175 177 178 179 180 180 181 181 181 182 182 183 184 185 186 187 188 190 191 191 193 194 194 194 195 194 194 194 194 194 195 196 197 198 200 201 203 204 206 207 209 210 213 215 216 217 218 219 220 221 222 223 225 226 228 229 230 231 232 233 233 234
5258B34%KJJKJJKKKJJ%%KJJJJJJKJLLLLMLLLMMMLLKLKKJLKKKLKLLMNMMNMMMLLKKKKJJKJKL
$$ 234 234 236 237 238 240 241 242 244 246 248 249 250 250 250 252 253 254 255 256 257 258 260 261 264 267 270 273 277 280 283 286 290 294 298 301 304 306 309 311 313 314 317 319 321 323 326 328 331 334 338 343 347 351 356 360 364 368 371 374 376 378 380 382 383 384 386 387 389 392
5251C92LLMMOOOOPPPPOPPOOONOPPPRJ0J3J3J4J6J7J7J8K1K0K1K2K3K6K9L0L5L8M3M8N5O2P0
$$ 392 395 398 402 406 412 418 424 430 437 444 451 458 464 471 478 484 490 496 501 507 514 521 528 537 547 560 573 587 603 620 637 655 676 696 717 739 762 788 817 847 882 920 963 1011 1066 1128 1198
5246A198Q0R0J00J11J18J26J27J23J12R4P0M4J7nk1l0l1k5j6mJ0K0K7K8K2J1ok5m3n9o8p3
$$ 1198 1278 1368 1468 1579 1697 1823 1950 2073 2185 2279 2349 2393 2410 2405 2384 2354 2323 2298 2282 2278 2288 2308 2335 2363 2385 2396 2390 2365 2322 2263 2195 2122
5242B122p3o9o2n4m4l5k8k0j3qjLQJ4J9K4K9L4M0M4M9N5O1O8P4Q1R0R9J10J19J28J38J47J54
$$ 2122 2049 1980 1918 1864 1820 1785 1757 1737 1724 1716 1715 1718 1726 1740 1759 1783 1812 1846 1886 1930 1979 2034 2095 2163 2237 2318 2408 2507 2617 2736 2864 3002 3149 3303
5239C303J62J70J79J91K06K28K55K89L26L71M18M69N17N62N94O09O01N62M93L96K83J68P1
$$ 3303 3465 3635 3814 4005 4211 4439 4694 4983 5309 5680 6098 6567 7084 7646 8240 8849 9450 10012 10505 10901 11184 11352 11423
5236A1423km0m2j2M2J09J78K38K78K86K57J90R1k5j42k42l12l50l51l22k70k00j18k9O5J62
$$ 11423 11421 11381 11339 11327 11369 11478 11656 11894 12172 12458 12715 12905 12996 12971 12829 12587 12275 11925 11574 11252 10982 10782 10664 10635 10700 10862
5234A0862K62L67M75N84O94Q00Q96R75J030J056J046J002R28Q34P29O22N18M28L58L19L14
$$ 10862 11124 11491 11966 12550 13244 14044 14940 15915 16945 18001 19047 20049 20977 21811 22540 23162 23680 24108 24466 24785 25099
5231B5099L48M08M84N58O15O46O47O21N84N41M99M55M04L44K68J79O7p1k43m54o93r49j201
$$ 25099 25447 25855 26339 26897 27512 28158 28805 29426 30010 30551 31050 31505 31909 32253 32521 32700 32767 32696 32453 31999 31306 30357 29156
5229B9156j427j605j722j773j765j706j612j494j367j238j114r97q90p94p06o28n58m97m42
$$ 29156 27729 26124 24402 22629 20864 19158 17546 16052 14685 13447 12333 11336 10446 9652 8946 8318 7760 7263 6821
5227F821l94l52l14k79k48k20j95j69j47j24j02q0n8l5j1J3L7N9Q1R8J08J11J05Q8O1L0om5
$$ 6821 6427 6075 5761 5482 5234 5014 4819 4650 4503 4379 4277 4197 4139 4104 4093 4106 4143 4202 4283 4381 4489 4600 4705 4793 4854 4884 4878 4833
5224D833q2j19j54j82k03k17k21k18k09j95j77j61j43j26j11j00q9q1p7p4p2o9o7o5o2o0n8
$$ 4833 4751 4632 4478 4296 4093 3876 3655 3437 3228 3033 2856 2695 2552 2426 2315 2215 2126 2045 1968 1894 1822 1753 1686 1621 1559 1499 1441
5221A441n5n2n1m8m5m3m2l9l6l3l1k7k5k3k1j8j5j3j3j1j1j1j0j0j0j0j1j0j1j0j0j1rj0j0
$$ 1441 1386 1334 1283 1235 1190 1147 1105 1066 1030 997 966 939 914 891 870 852 837 824 811 800 789 778 768 758 748 738 727 717 706 696 686 675 666 656 646
5217F46pqponmmllllmmoorrj1j2j2j4j3j3j1j1j0rqpponmnnmmmllmmmmmomnmmlllkljjkjj
$$ 646 639 631 624 618 613 609 605 602 599 596 593 589 585 579 573 564 555 544 532 520 506 493 480 469 458 448 439 431 424 417 411 406 402 397 392 388 384 380 377 374 370 366 362 358 354 348 344 339 335 331 328 325 322 320 317 316 315 313 312 311
5211C11kklllllmmlnmmlllklk%jk%%%kjjjkkllkkkjjj%jj%%JJJ%KKKKKKJKJ%%j%jj%jj%%J
$$ 311 309 307 304 301 298 295 292 288 284 281 276 272 268 265 262 259 257 254 252 252 251 249 249 249 249 247 246 245 244 242 240 237 234 232 230 228 227 226 225 225 224 223 223 223 224 225 226 226 228 230 232 234 236 238 239 241 242 242 242 241 241 240 239 239 238 237 237 237 238
5204B38JJJJj%jjjkkllklkkk%jjjjkj%%Jj%%jk%j%%%%J%JJKKJLKLLLLMLLLLLLLLLLKKK%J%
$$ 238 239 240 241 242 241 241 240 239 238 236 234 231 228 226 223 221 219 217 217 216 215 214 213 211 210 210 210 211 210 210 210 209 207 207 206 206 206 206 206 207 207 208 209 211 213 214 217 219 222 225 228 231 235 238 241 244 247 250 253 256 259 262 265 267 269 271 271 272 272
5196B72%J%jJ%%JJJj%%j%kllmmlmlkljkkj%j%%JK%J%%%%JJ%JJJKJKLMMMPOOPPPPOMLLKLKL
$$ 272 272 273 273 272 273 273 273 274 275 276 275 275 275 274 274 272 269 266 262 258 255 251 248 246 243 242 240 238 237 237 236 236 236 237 239 239 240 240 240 240 240 241 242 242 243 244 245 247 248 250 253 257 261 265 272 278 284 291 298 305 312 318 322 325 328 330 333 335 338
5189C38LMPOQPPQQOMK%jlllllkj%KLMMONLLJ%knonpooonmlkljjjJKMMNOQRJ1J1J3J3J4J5J6
$$ 338 341 345 352 358 366 373 380 388 396 402 406 408 408 407 404 401 398 395 392 390 389 389 391 394 398 402 408 413 416 419 420 420 418 413 407 402 395 389 383 377 372 368 365 363 360 359 358 357 358 360 364 368 373 379 387 396 407 418 431 444 458 473 489
5182D89J6J6J6J5J5J5J5J6J6J6J7J8J9K0J9J9J9J9J9J9J9K0K1K3K4K5K6K8K8K7K1J6J0Joj5
$$ 489 505 521 537 552 567 582 597 613 629 645 662 680 699 719 738 757 776 795 814 833 852 872 893 916 940 965 991 1019 1047 1074 1095 1111 1121 1122 1116 1101
5179A101j8k2k4k5k3k2k0j8j5j2qolKNPJ0J2J5J7K0K0K3K5K8L0L3L7M2M5N1N6O1O9P7Q6R5
$$ 1101 1083 1061 1037 1012 989 967 947 929 914 902 894 888 885 887 892 899 909 921 936 953 973 993 1016 1041 1069 1099 1132 1169 1211 1256 1307 1363 1424 1493 1570 1656 1751
5175A751J08J21J36J52J71J92K17K44K73L06L42L75M04M26M34M21L85L22K35J32K5p4j53k05
$$ 1751 1859 1980 2116 2268 2439 2631 2848 3092 3365 3671 4013 4388 4792 5218 5652 6073 6458 6780 7015 7147 7172 7098 6945 6740
5172F740k32k34k14j80j36q4l2K2P4J21J63J93K10K11J93J53R4J8o5j47k20k75l09l24l22
$$ 6740 6508 6274 6060 5880 5744 5660 5628 5650 5724 5845 6008 6201 6411 6622 6815 6968 7062 7080 7015 6868 6648 6373 6064 5740 5418
5169E418l05k79k49k18j84j51j19q7n8k7LL3O3R4J27J61J96K34K74L11L48L76L93L92L74L33
$$ 5418 5113 4834 4585 4367 4183 4032 3913 3826 3768 3741 3744 3777 3840 3934 4061 4222 4418 4652 4926 5237 5585 5961 6354 6746 7120 7453
5167G453K78K16J56J10Q5Q5J05J43J86K27K59K69K57K22J68J08M8lm2p4r9j28j63k05k48k86
$$ 7453 7731 7947 8103 8213 8298 8383 8488 8631 8817 9044 9303 9572 9829 10051 10219 10327 10375 10372 10330 10256 10157 10029 9866 9661 9413 9127
5164I127l10l17l04k73k29j73j14n8rK5M2L5Om4j08j77k36k85l16l27l23l06k78k45k08j71
$$ 9127 8817 8500 8196 7923 7694 7521 7407 7349 7340 7365 7407 7442 7448 7404 7296 7119 6883 6598 6282 5955 5632 5326 5048 4803 4595 4424
5161D424j33r5n4j6K4O2J01J41J79K12K38K50K46K19J71J02K0o4j38j97k34k51k49k31k04
$$ 4424 4291 4196 4142 4126 4150 4212 4313 4454 4633 4845 5083 5333 5579 5798 5969 6071 6091 6027 5889 5692 5458 5207 4958 4727 4523
5159D523j69j33r4n7j8J8N7R2J28J60J87K04K09J96J60J03L0n3j34k04k57k91l06l04k92k72
$$ 4523 4354 4221 4127 4070 4052 4070 4127 4219 4347 4507 4694 4898 5107 5303 5463 5566 5596 5543 5409 5205 4948 4657 4351 4047 3755 3483
5156C483k48k24k00j77j59j39j24j09r8q8p8p0o4n8n2n0m8m7m4m4m5m3m1m0l9l7l4l2k8k5
$$ 3483 3235 3011 2811 2634 2475 2336 2212 2103 2005 1917 1839 1769 1705 1647 1595 1545 1497 1450 1406 1362 1317 1274 1233 1193 1154 1117 1083 1051 1023 998
5153I98k1j6j2qol%KLMK%mrj3j8k2k4k4k3k2k2j9j6j4j2rqonlljj%%JKLNPQJ0J1J2J3J2J1
$$ 998 977 961 949 941 935 932 932 934 937 941 943 943 939 930 917 899 877 853 829 806 784 762 743 727 713 701 692 684 678 673 670 667 666 665 665 665 666 668 671 676 683 691 701 712 724 737 749 760
5148G60J0POOOOQQQPNLjoj1j6j9k2k6k7k7k9k8k6k3k2k0j8j6j3j2j1j1j1rrqppopnmmmkjj
$$ 760 770 777 783 789 795 801 809 817 825 832 837 840 839 833 822 806 787 765 739 712 685 656 628 602 579 557 537 519 503 490 478 467 456 445 436 427 419 412 405 399 392 387 383 379 375 373 372 371
5142C71%KLMNOOQQQJ0J0J0J1J0J1J0J0RJ1J0J1J0RJ0J0J0J2J2J2J2J1RONLJJjkmoj0j5k0k4
$$ 371 371 373 376 380 385 391 397 405 413 421 431 441 451 462 472 483 493 503 512 523 533 544 554 563 573 583 593 605 617 629 641 652 661 667 672 675 676 677 676 674 670 664 654 639 619 595
5138E95k8l0l0l0k7k6k3k1j7j6j3j1rqonmmlllmnmnmllkkjjjj%%JJKLKMMNOOQPQQQRRQRRQ
$$ 595 567 537 507 477 450 424 401 380 363 347 334 323 314 306 300 295 291 287 284 281 278 274 269 265 260 256 253 250 248 246 245 244 243 242 242 242 243 244 246 249 251 255 259 264 270 276 284 291 299 307 315 324 333 341 350 359 367
5132C67PONMKJ%jklkmnpprrj0j1j0j1j0rrqppnnmlklkjjjjjj%%J%JKKKKLLLNOPPPPQJ0J1J2
$$ 367 374 380 385 389 391 392 392 391 389 386 384 380 375 368 361 352 343 333 322 312 301 291 282 273 265 258 251 246 241 237 234 232 229 227 226 225 224 223 222 221 221 221 222 222 223 225 227 229 231 234 237 240 245 251 258 265 272 279 287 297 308 320
5125C20J3J4J6J6J7J5J6J4J2J0PNML%%jjkmoqj0j2j3j5j4j5j5j5j3j3j1j0rqonmkkj%%KJK
$$ 320 333 347 363 379 396 411 427 441 453 463 470 475 479 482 482 482 481 480 478 474 468 460 450 438 425 410 396 381 366 351 338 325 314 304 295 287 281 276 272 270 268 267 267 267 269 270 272
5120B72KLLNMPPPRJ1J1J1J0J0RRPPNJ%lmnnnmljj%%J%Jjkllmnnpprrrrj0rqpponmkjj%%JJ
$$ 272 274 277 280 285 289 296 303 310 319 330 341 352 362 372 381 390 397 404 409 410 410 407 403 398 393 388 384 381 380 379 379 379 380 380 381 380 378 375 372 368 363 358 351 344 335 326 317 308 298 289 281 274 267 261 256 252 250 249 248 248 248 249 250
5113B50LLLLLMNNPRJ0J1J3J3J5J6J5J7J7J6J5J3J2ROKlqj1j4j6j7j6j4j3j0j0qprrj1j0j1
$$ 250 253 256 259 262 265 269 274 279 286 295 305 316 329 342 357 373 388 405 422 438 453 466 478 487 493 495 492 484 473 459 443 426 410 396 383 373 363 355 348 339 330 319 309 298
5109B98j1j1j1j0rpooonommlmkjjj%%%%%JKJKKLLLLMMNNNMMLKLKLMNOQRJ0J0J0QOMKknpj0
$$ 298 287 276 265 255 246 239 233 227 221 216 210 206 202 199 195 193 192 191 190 190 190 190 190 190 191 193 194 196 198 201 204 207 210 214 218 223 228 233 237 241 244 246 249 251 254 258 263 269 277 286 296 306 316 324 330 334 336 334 329 322 312
5102C12j2j3j4j3j2j1rqponmlklklkkllkkkkjk%%JJKJKJKJ%jjkkkmmmmnommlk%%JKLMNNNM
$$ 312 300 287 273 260 248 237 228 220 213 207 202 198 195 193 190 188 185 183 181 178 175 173 171 169 167 166 164 164 164 165 166 168 169 171 172 174 175 175 174 173 171 169 167 163 159 155 151 146 140 136 132 129 127 127 127 128 130 133 137 142 147 152 156
5095A56MLKJK%JKKLKLLKKKLLLKLKLLLKLLKLMKKLKLLKKKLMMNONOOONNNOMNNNNNNOPPPPPPQP
$$ 156 160 163 165 166 168 168 169 171 173 176 178 181 184 186 188 190 193 196 199 201 204 206 209 212 215 217 220 223 225 228 232 234 236 239 241 244 247 249 251 253 256 260 264 269 275 280 286 292 298 303 308 313 319 323 328 333 338 343 348 353 359 366 373 380 387 394 401 409 416
5088D16QQJ0J2J3J5J8J8K1K4K4K6K8L0L1L5L7L9M4M8N3N8O3P0P9Q9R9J11J26J43J62J85K13
$$ 416 424 432 442 454 467 482 500 518 539 563 587 613 641 671 702 737 774 813 857 905 958 1016 1079 1149 1228 1317 1416 1527 1653 1796 1958 2143 2356
5085B356K45K82L28L81M45N19O04O98P96Q87R59R88R52Q35O27L39Nl25o03q04r16r50r25q62
$$ 2356 2601 2883 3211 3592 4037 4556 5160 5858 6654 7541 8500 9488 10440 11275 11902 12241 12246 11921 11318 10514 9598 8648 7723 6861
5082F861p82o96o10n31m60l95l40k92k51k16j87j64j45j27j13j00q8p9p0o2n7n3m9m6m4m3
$$ 6861 6079 5383 4773 4242 3782 3387 3047 2755 2504 2288 2101 1937 1792 1665 1552 1452 1364 1285 1215 1153 1096 1043 994 948 904 861
5079H61l9l6l3l1k7k5k2k0k1j9k0k0j9j9j7j7j6j4j3j3j1j0rrqqqppoonmmlkkj%%JKKJ%j%
$$ 861 822 786 753 722 695 670 648 628 607 588 568 548 529 510 493 476 460 446 433 420 409 399 390 381 373 365 357 350 343 337 331 326 322 318 315 313 311 310 310 310 311 313 315 316 316 315 315
5074C15kjkkj%JKMNOPPONNLJjknoprrj0j0j0j0qppommkk%j%%%j%jkklnmononpommmlkkjj%
$$ 315 313 312 310 308 307 307 308 310 314 319 325 332 339 345 350 355 358 359 358 356 351 345 338 329 320 310 300 290 280 272 265 258 252 248 244 242 240 240 239 239 239 239 238 238 237 235 233 230 225 221 215 210 204 199 192 186 182 178 174 171 169 167 166 165 165
5068A65JLKMMMLLKKJJJkjj%JJKJK%jjjkjklllmmlnnmmmkkk%j%%%%%%jjkkjkkkkjjjkj%j%j
$$ 165 166 169 171 175 179 183 186 189 191 193 194 195 196 194 193 192 192 193 194 196 197 199 199 198 197 196 194 193 191 188 185 182 178 174 171 166 161 157 153 149 147 145 143 143 142 142 142 142 142 142 142 141 140 138 136 135 133 131 129 127 126 125 124 122 121 121 120 120 119
5060A19%j%j%%JJJ%%K%%%%j%%%%Jj%%%jj%%J%J%%%j%%%Jjj%%%%j%JJ%%%%j%%j%j%jJ%%j%j
$$ 119 119 118 118 117 117 117 118 119 120 120 120 122 122 122 122 122 121 121 121 121 121 122 121 121 121 121 120 119 119 119 120 120 121 121 121 121 120 120 120 120 121 120 119 119 119 119 119 118 118 119 120 120 120 120 120 119 119 119 118 118 117 117 116 117 117 117 116 116 115
5053A15%j%%%%%%%%%%%J%%Jj%jjjJj%%%JJ%J%J%J%%JJ%J%J%JJJJJ%jjjjjjjj%j%%j%%j%%J
$$ 115 115 114 114 114 114 114 114 114 114 114 114 114 114 115 115 115 116 115 115 114 113 112 113 112 112 112 112 113 114 114 115 115 116 116 117 117 117 118 119 119 120 120 121 121 122 123 124 125 126 126 125 124 123 122 121 120 119 118 118 117 117 117 116 116 116 115 115 115 116
5046A16%%%J%%J%%J%JJ%%%%%jjjjjJ%J%Jj%%%%J%J%%%j%jjj%%%jj%%%%%%%%%%jJ%JJ%J%J%
$$ 116 116 116 116 117 117 117 118 118 118 119 119 120 121 121 121 121 121 121 120 119 118 117 116 117 117 118 118 119 118 118 118 118 118 119 119 120 120 120 120 119 119 118 117 116 116 116 116 115 114 114 114 114 114 114 114 114 114 114 114 113 114 114 115 116 116 117 117 118 118
5038A18J%JJ%jjjjj%j%%jj%%J%%J%%%%J%%%%%jj%%jJJjj%%jj%%%%%Jj%%J%%JJJ%%JJ%JJJ%
$$ 118 119 119 120 121 121 120 119 118 117 116 116 115 115 115 114 113 113 113 114 114 114 115 115 115 115 115 116 116 116 116 116 116 115 114 114 114 113 114 115 114 113 113 113 112 111 111 111 111 111 111 112 111 111 111 112 112 112 113 114 115 115 115 116 117 117 118 119 120 120
5031A20Jj%%KJJJ%%%KJ%%%%J%%%jj%j%%jjjj%jjjjkjJ%jj%jj%%j%%%j%J%%%%%%J%JJ%%JJJ
$$ 120 121 120 120 120 122 123 124 125 125 125 125 127 128 128 128 128 128 129 129 129 129 128 127 127 126 126 126 125 124 123 122 122 121 120 119 118 116 115 116 116 115 114 114 113 112 112 112 111 111 111 111 110 110 111 111 111 111 111 111 111 112 112 113 114 114 114 115 116 117
5024A17JJ%J%%%JJJK%%%JJ%jJJ%%%j%j%j%j%jkjj%jjj%%%jjjkjJ%%j%%%j%%%%jj%%%%J%%%
$$ 117 118 119 119 120 120 120 120 121 122 123 125 125 125 125 126 127 127 126 127 128 128 128 128 127 127 126 126 125 125 124 124 123 121 120 119 119 118 117 116 116 116 116 115 114 113 111 110 111 111 111 110 110 110 110 109 109 109 109 109 108 107 107 107 107 107 108 108 108 108
5016A08%%%%j%%%%JJJ%JJ%J%J%%%%%j%J%%%jjjjj%J%%j%%j%%j%%j%%j%%J%J%j%jj%J%%%%%
$$ 108 108 108 108 108 107 107 107 107 107 108 109 110 110 111 112 112 113 113 114 114 114 114 114 114 113 113 114 114 114 114 113 112 111 110 109 109 110 110 110 109 109 109 108 108 108 107 107 107 106 106 106 105 105 105 106 106 107 107 106 106 105 104 104 105 105 105 105 105 105
5009A05J%%J%%%j%%%%%J%%J%Jj%j%%%%%%%%j%JJj%%j%%%%%%%jj%jJ%%%J%%j%j%J%%%%%%%%
$$ 105 106 106 106 107 107 107 107 106 106 106 106 106 106 107 107 107 108 108 109 108 108 107 107 107 107 107 107 107 107 107 106 106 107 108 107 107 107 106 106 106 106 106 106 106 106 105 104 104 103 104 104 104 104 105 105 105 104 104 103 103 104 104 104 104 104 104 104 104 104
5002A04%jj%%J%J%j%%%%%J%%J%%j%j%J%%j%%j%J%%%%j%J%J%%%%%%%%%jj%%%j%J%J%%J%jj%
$$ 104 104 103 102 102 102 103 103 104 104 103 103 103 103 103 103 104 104 104 105 105 105 104 104 103 103 104 104 104 103 103 103 102 102 103 103 103 103 103 102 102 103 103 104 104 104 104 104 104 104 104 104 104 103 102 102 102 102 101 101 102 102 103 103 103 104 104 103 102 102
4994A02JJ%%j%J%%%j%%%%%%%%%%%%%j%%JJ%%%%j%%%%Jj%%%%%j%%%%%%%%%%%%%J%%J%%%j%%
$$ 102 103 104 104 104 103 103 104 104 104 104 103 103 103 103 103 103 103 103 103 103 103 103 103 103 102 102 102 103 104 104 104 104 104 103 103 103 103 103 104 103 103 103 103 103 103 102 102 102 102 102 102 102 102 102 102 102 102 102 102 103 103 103 104 104 104 104 103 103 103
4987A03%J%Jj%%%J%j%%JjjJ%%%%%j%j%%%J%%%J%%jj%%%J%JJ%jJ%j%%%%%%%%%%%%%%J%%J%j
$$ 103 103 104 104 105 104 104 104 104 105 105 104 104 104 105 104 103 104 104 104 104 104 104 103 103 102 102 102 102 103 103 103 103 104 104 104 103 102 102 102 102 103 103 104 105 105 104 105 105 104 104 104 104 104 104 104 104 104 104 104 104 104 104 104 105 105 105 106 106 105
4980A05%%%JJJ%J%%JJJKKKKJKLLMMNNOOMMJ%kmnnonnnlmkljkkjjjjjjj%j%%%j%j%j%Jj%%%
$$ 105 105 105 105 106 107 108 108 109 109 109 110 111 112 114 116 118 120 121 123 126 129 133 137 142 147 153 159 163 167 168 168 166 162 157 152 146 141 136 131 128 124 122 119 118 116 114 113 112 111 110 109 108 107 107 106 106 106 106 105 105 104 104 103 103 104 103 103 103 103
4972A03j%%%%J%%%%j%%%%%%%%%%%%%%%%J%%%jj%%%J%jJ%Jj%%%%%%J%%%jJj%%j%%%JJ%%j%%
$$ 103 102 102 102 102 102 103 103 103 103 103 102 102 102 102 102 102 102 102 102 102 102 102 102 102 102 102 102 103 103 103 103 102 101 101 101 101 102 102 101 102 102 103 102 102 102 102 102 102 102 103 103 103 103 102 103 102 102 102 101 101 101 101 102 103 103 103 102 102 102
4965A02j%j%J%%Jj%%J%%%%%%%%j%j%JJJ%%%j%j%jJ%%jJ%%%%%%j%J%J%j%j%j%J%%%%J%%%%j
$$ 102 101 101 100 100 101 101 101 102 101 101 101 102 102 102 102 102 102 102 102 102 101 101 100 100 101 102 103 103 103 103 102 102 101 101 100 101 101 101 100 101 101 101 101 101 101 101 100 100 101 101 102 102 101 101 100 100 99 99 100 100 100 100 100 101 101 101 101 101 100
4958A00%j%J%%%%j%%%J%%J%J%%jjJ%%j%%J%%%%j%%%%%%%%%jJ%%J%j%%J%%%%%%%%%%%%%%%j
$$ 100 100 99 99 100 100 100 100 100 99 99 99 99 100 100 100 101 101 102 102 102 101 100 101 101 101 100 100 100 101 101 101 101 101 100 100 100 100 100 100 100 100 100 100 99 100 100 100 101 101 100 100 100 101 101 101 101 101 101 101 101 101 101 101 101 101 101 101 101 100
4951A00j%%JJ%%%%%jJ%%Jj%%jJ%%j%%%%%J%jj%%%%%J%JjJ%%J%%%%%j%%j%jJJ%j%%%%Jj%J%
$$ 100 99 99 99 100 101 101 101 101 101 101 100 101 101 101 102 101 101 101 100 101 101 101 100 100 100 100 100 100 101 101 100 99 99 99 99 99 99 100 100 101 100 101 101 101 102 102 102 102 102 102 101 101 101 100 100 99 100 101 101 100 100 100 100 100 101 100 100 101 101
4943A01j%%J%J%%%%%j%j%%J%J%%%%%%%j%%%j%%J%%%j%jJ%%Jj%%%%%jJ%%%%%%%J%%jj%jJJ%
$$ 101 100 100 100 101 101 102 102 102 102 102 102 101 101 100 100 100 101 101 102 102 102 102 102 102 102 102 101 101 101 101 100 100 100 101 101 101 101 100 100 99 100 100 100 101 100 100 100 100 100 100 99 100 100 100 100 100 100 100 100 101 101 101 100 99 99 98 99 100 100
4936A00%%%%J%%%%%%j%j%%J%%%%J%%j%%j%%J%%%Jj%j%J%J%j%%%%J%J%j%%j%%j%%%%%%jJJ%
$$ 100 100 100 100 100 101 101 101 101 101 101 101 100 100 99 99 99 100 100 100 100 100 101 101 101 100 100 100 99 99 99 100 100 100 100 101 100 100 99 99 100 100 101 101 100 100 100 100 100 101 101 102 102 101 101 101 100 100 100 99 99 99 99 99 99 99 98 99 100 100
4929A00j%jJJ%%j%J%%j%%J%%j%%%%%%J%%%%%%%%%%%%%jJ%j%%%J%%%%%%%%%%%J%%%%%j%J%J
$$ 100 99 99 98 99 100 100 100 99 99 100 100 100 99 99 99 100 100 100 99 99 99 99 99 99 99 100 100 100 100 100 100 100 100 100 100 100 100 100 100 99 100 100 99 99 99 99 100 100 100 100 100 100 100 100 100 100 100 100 101 101 101 101 101 101 100 100 101 101 102
4921A02%%j%%%%%%%%%%%j%J%Jj%%%J%%j%j%J%%%%%j%%%%J%%%%%j%J%%%%%%%%%j%J%%Jj%%j
$$ 102 102 102 101 101 101 101 101 101 101 101 101 101 101 101 100 100 101 101 102 101 101 101 101 102 102 102 101 101 100 100 101 101 101 101 101 101 100 100 100 100 100 101 101 101 101 101 101 100 100 101 101 101 101 101 101 101 101 101 101 100 100 101 101 101 102 101 101 101 100
4914A00%j%jJ%%%%J%J%J%jj%%J%%%%%j%%%%j%j%%J%J%%Jj%%J%j%%%%%%%%%%J%j%jj%J%%%%
$$ 100 100 99 99 98 99 99 99 99 99 100 100 101 101 102 102 101 100 100 100 101 101 101 101 101 101 100 100 100 100 100 99 99 98 98 98 99 99 100 100 100 101 100 100 100 101 101 100 100 100 100 100 100 100 100 100 100 100 101 101 100 100 99 98 98 99 99 99 99 99
4907I9%%%%%%%j%JJj%%%J%%%j%%j%JJ%%j%j%Jj%%%%%J%%%%j%%%%%J%%%%%%%%%%%%j%%%%J%
$$ 99 99 99 99 99 99 99 99 98 98 99 100 99 99 99 99 100 100 100 100 99 99 99 98 98 99 100 100 100 99 99 98 98 99 98 98 98 98 98 98 99 99 99 99 99 98 98 98 98 98 98 99 99 99 99 99 99 99 99 99 99 99 99 99 98 98 98 98 98 99 99
4899I9%j%j%J%%J%%%JJ%jj%j%%%j%%J%%%%J%J%%j%%%%%%%%%%jj%%J%%%j%J%J%J%%jj%%J%%
$$ 99 99 98 98 97 97 98 98 98 99 99 99 99 100 101 101 100 99 99 98 98 98 98 97 97 97 98 98 98 98 98 99 99 100 100 100 99 99 99 99 99 99 99 99 99 99 99 98 97 97 97 98 98 98 98 97 97 98 98 99 99 100 100 100 99 98 98 98 99 99 99
4892I9%j%%%%%%J%Jj%%%%%%j%%%%J%%%%%J%jJ%%%Jj%%%%j%%%%%%%%J%jJ%%jJj%%Jj%%j%J%
$$ 99 99 98 98 98 98 98 98 98 99 99 100 99 99 99 99 99 99 99 98 98 98 98 98 99 99 99 99 99 99 100 100 99 100 100 100 100 101 100 100 100 100 100 99 99 99 99 99 99 99 99 99 100 100 99 100 100 100 99 100 99 99 99 100 99 99 99 98 98 99 99
4884I9%%%%jjjJ%j%J%%%%%%J%%%%%%%%%jJ%J%J%jJ%%%j%%%%%%J%%%j%%%%JJjjj%%JJj%%j%
$$ 99 99 99 99 99 98 97 96 97 97 96 96 97 97 97 97 97 97 97 98 98 98 98 98 98 98 98 98 98 97 98 98 99 99 100 100 99 100 100 100 100 99 99 99 99 99 99 99 100 100 100 100 99 99 99 99 99 100 101 100 99 98 98 98 99 100 99 99 99 98 98
4877I8%Jj%%%%%J%%%J%%%%j%%%%%J%%j%jJJ%%%%%j%%%%%%%%%J%%%%%jj%%J%%j%J%%%%%%%%
$$ 98 98 99 98 98 98 98 98 98 99 99 99 99 100 100 100 100 100 99 99 99 99 99 99 100 100 100 99 99 98 99 100 100 100 100 100 100 99 99 99 99 99 99 99 99 99 99 100 100 100 100 100 100 99 98 98 98 99 99 99 98 98 99 99 99 99 99 99 99 99 99
4870I9%%%%%%%j%%J%%j%%%%J%%%j%%%%%J%%%%%%%%jjJ%%%J%%j%%JJj%%%J%%%j%%jJ%j%j%%
$$ 99 99 99 99 99 99 99 99 98 98 98 99 99 99 98 98 98 98 98 99 99 99 99 98 98 98 98 98 98 99 99 99 99 99 99 99 99 99 98 97 98 98 98 98 99 99 99 98 98 98 99 100 99 99 99 99 100 100 100 100 99 99 99 98 99 99 98 98 97 97 97
4862I7J%%%J%%%%%j%%%J%%j%%%J%%%%Jj%%%j%%%%%%%%%%%j%%JJj%J%%%%j%%j%J%%%%%%%J%
$$ 97 98 98 98 98 99 99 99 99 99 99 98 98 98 98 99 99 99 98 98 98 98 99 99 99 99 99 100 99 99 99 99 98 98 98 98 98 98 98 98 98 98 98 98 97 97 97 98 99 98 98 99 99 99 99 99 98 98 98 97 97 98 98 98 98 98 98 98 98 99 99
4855I9%J%%j%j%j%J%%%%%%%j%jJ%%J%%jJ%%J%%%%j%%%%%%%%%%%%%%j%%%JjJ%%%%%%%%%%%%
$$ 99 99 100 100 100 99 99 98 98 97 97 98 98 98 98 98 98 98 98 97 97 96 97 97 97 98 98 98 97 98 98 98 99 99 99 99 99 98 98 98 98 98 98 98 98 98 98 98 98 98 98 98 97 97 97 97 98 97 98 98 98 98 98 98 98 98 98 98 98 98 98
4847I8%%jJ%%%j%%J%%%jJ%%J%%%%%%%%%%%%jj%%%J%%J%%%%j%%%J%j%j%%%%J%%J%j%%Jj%%j
$$ 98 98 98 97 98 98 98 98 97 97 97 98 98 98 98 97 98 98 98 99 99 99 99 99 99 99 99 99 99 99 99 99 98 97 97 97 97 98 98 98 99 99 99 99 99 98 98 98 98 99 99 98 98 97 97 97 97 97 98 98 98 99 99 98 98 98 99 98 98 98 97
4840I7%%%J%%%j%%%%J%%j%J%J%%%%%j%jj%%%%J%%%%J%J%%%%j%%j%%%j%%%JJJ%jjj%%J%J%%
$$ 97 97 97 97 98 98 98 98 97 97 97 97 97 98 98 98 97 97 98 98 99 99 99 99 99 99 98 98 97 96 96 96 96 96 97 97 97 97 97 98 98 99 99 99 99 99 98 98 98 97 97 97 97 96 96 96 96 97 98 99 99 98 97 96 96 96 97 97 98 98 98
4832I8%%%%%j%%%%%%J%%%j%J%%%%%%j%J%%j%J%%%%%%jj%J%J%%%j%%j%J%J%J%%jJ%j%j%%%%
$$ 98 98 98 98 98 98 97 97 97 97 97 97 97 98 98 98 98 97 97 98 98 98 98 98 98 98 97 97 98 98 98 97 97 98 98 98 98 98 98 98 97 96 96 97 97 98 98 98 98 97 97 97 96 96 97 97 98 98 99 99 99 98 99 99 98 98 97 97 97 97 97
4825I7%Jj%%JJjj%%%%%J%%%jJ%%%%Jj%%%%%%%%%%%Jj%%%%%J%%%%j%%%%J%%%%%%%%%%%%%%%
$$ 97 97 98 97 97 97 98 99 98 97 97 97 97 97 97 98 98 98 98 97 98 98 98 98 98 99 98 98 98 98 98 98 98 98 98 98 98 98 99 98 98 98 98 98 98 99 99 99 99 99 98 98 98 98 98 99 99 99 99 99 99 99 99 99 99 99 99 99 99 99 99
4818I9j%%%%J%j%%%jjJ%%J%%%%%j%%j%%%J%JJ%J%j%%j%%%%jJ%Jj%%j%%%J%%%%%%%%J%j%%%
$$ 99 98 98 98 98 98 99 99 98 98 98 98 97 96 97 97 97 98 98 98 98 98 98 97 97 97 96 96 96 96 97 97 98 99 99 100 100 99 99 99 98 98 98 98 98 97 98 98 99 98 98 98 97 97 97 97 98 98 98 98 98 98 98 98 98 99 99 98 98 98 98
4810I8%%%%Jj%jJ%J%j%jJ%%%j%j%J%%%%%%j%%J%%J%j%%%%%%J%%%%%j%%%%%%%J%%j%jJ%J%%
$$ 98 98 98 98 98 99 98 98 97 98 98 99 99 98 98 97 98 98 98 98 97 97 96 96 97 97 97 97 97 97 97 96 96 96 97 97 97 98 98 97 97 97 97 97 97 97 98 98 98 98 98 98 97 97 97 97 97 97 97 97 98 98 98 97 97 96 97 97 98 98 98
4803I8Jj%j%%JJ%j%%%%%%%%%%%J%%j%%%%J%%jJJ%j%%%%%%%%%j%%%j%J%%%j%J%%%%%J%%%%%
$$ 98 99 98 98 97 97 97 98 99 99 98 98 98 98 98 98 98 98 98 98 98 98 99 99 99 98 98 98 98 98 99 99 99 98 99 100 100 99 99 99 99 99 99 99 99 99 99 98 98 98 98 97 97 98 98 98 98 97 97 98 98 98 98 98 98 99 99 99 99 99 99
4795I9j%%%%j%%%%%%J%%%%%j%%%JJ%%Jj%jj%%%J%%%J%%J%%%j%%%%jj%%%%%%jJ%%%%Jj%%J%
$$ 99 98 98 98 98 98 97 97 97 97 97 97 97 98 98 98 98 98 98 97 97 97 97 98 99 99 99 100 99 99 98 97 97 97 97 98 98 98 98 99 99 99 100 100 100 100 99 99 99 99 99 98 97 97 97 97 97 97 97 96 97 97 97 97 97 98 97 97 97 98 98
4788I8%%%j%%J%j%%%J%j%jJ%%%%%%%%J%j%%J%%%%%jJJj%%Jj%JJ%%jjj%j%%%%%%%%%%%%J%J
$$ 98 98 98 98 97 97 97 98 98 97 97 97 97 98 98 97 97 96 97 97 97 97 97 97 97 97 97 98 98 97 97 97 98 98 98 98 98 98 97 98 99 98 98 98 99 98 98 99 100 100 100 99 98 97 97 96 96 96 96 96 96 96 96 96 96 96 96 96 97 97 98
4781I8%%%%%%%%%%jJ%%%%j%%%%J%%%J%J%%jJjjj%J%%j%%J%J%%%j%%J%%%%%%jJ%%j%%%%J%%
$$ 98 98 98 98 98 98 98 98 98 98 98 97 98 98 98 98 98 97 97 97 97 97 98 98 98 98 99 99 100 100 100 99 100 99 98 97 97 98 98 98 97 97 97 98 98 99 99 99 99 98 98 98 99 99 99 99 99 99 99 98 99 99 99 98 98 98 98 98 99 99 99
4773I9J%%j%%%%%%jJ%%Jj%%%%J%%%jJ%%J%%j%%jJJ%%%%%J%j%%%jJ%J%J%%%%%%%%%J%J%J%%
$$ 99 100 100 100 99 99 99 99 99 99 99 98 99 99 99 100 99 99 99 99 99 100 100 100 100 99 100 100 100 101 101 101 100 100 100 99 100 101 101 101 101 101 101 102 102 101 101 101 101 100 101 101 102 102 103 103 103 103 103 103 103 103 103 103 104 104 105 105 106 106 106
4766A06%JJ%%%JJJ%JJ%JJJJKJJJKJLKLLLLNMMNOPQQRJ0J1J1J2J3J3J1J1J0QNJkmqj0j1j2j3
$$ 106 106 107 108 108 108 108 109 110 111 111 112 113 113 114 115 116 117 119 120 121 122 124 125 128 130 133 136 139 142 147 151 155 160 166 173 181 189 198 208 219 230 242 255 268 279 290 300 308 313 314 312 308 300 290 279 267 254
4760B54j2j1j1j1rj0qqoomnmmlmllljkjkkjjkjkjj%jj%%j%%j%jj%%%%j%j%Jjj%j%%j%%%%%
$$ 254 242 231 220 209 200 190 182 174 168 162 158 153 149 145 142 138 135 132 129 128 126 125 123 121 120 119 117 116 114 113 112 112 111 110 110 110 109 109 109 108 108 107 106 106 106 106 106 105 105 104 104 105 104 103 103 102 102 102 101 101 101 101 101 101
4753A01%Jjj%%j%%%%%%%%%%J%%%%j%JjJ%Jjjj%%%%%j%%J%%j%%J%%jJJ%%%j%jJ%%%%%%%J%j
$$ 101 101 102 101 100 100 100 99 99 99 99 99 99 99 99 99 99 99 100 100 100 100 100 99 99 100 99 100 100 101 100 99 98 98 98 98 98 98 97 97 97 98 98 98 97 97 97 98 98 98 97 98 99 99 99 99 98 98 97 98 98 98 98 98 98 98 98 99 99 98
4746I8%%%%%%jJ%%J%%%%j%j%%%%%%%J%J%jJ%%jj%jJJ%%j%%%%%jjJJ%j%%J%jJ%%j%J%%jJ%%
$$ 98 98 98 98 98 98 98 97 98 98 98 99 99 99 99 99 98 98 97 97 97 97 97 97 97 97 98 98 99 99 98 99 99 99 98 97 97 96 97 98 98 98 97 97 97 97 97 97 96 95 96 97 97 96 96 96 97 97 96 97 97 97 96 96 97 97 97 96 97 97 97
4738I7%%%%%%%%j%%%%%J%%j%J%%%%%%%%J%%%%%%%%%j%%%%J%%%%%j%j%%%%%%%%%j%%J%%%j%
$$ 97 97 97 97 97 97 97 97 97 96 96 96 96 96 96 97 97 97 96 96 97 97 97 97 97 97 97 97 97 98 98 98 98 98 98 98 98 98 98 97 97 97 97 97 98 98 98 98 98 98 97 97 96 96 96 96 96 96 96 96 96 96 95 95 95 96 96 96 96 95 95
4731I5J%%%%j%%JJ%j%%%j%%%J%%j%%%J%%%J%%j%%%j%%%J%j%%%%%%%%%%%%j%%%%%J%J%jj%%
$$ 95 96 96 96 96 96 95 95 95 96 97 97 96 96 96 96 95 95 95 95 96 96 96 95 95 95 95 96 96 96 96 97 97 97 96 96 96 96 95 95 95 95 96 96 95 95 95 95 95 95 95 95 95 95 95 95 95 94 94 94 94 94 94 95 95 96 96 95 94 94 94
4723I4J%j%JJJjj%%J%%Jj%%j%JJ%Jj%j%jJ%%j%%J%%%%%%%%j%%Jj%%%J%%%j%%J%%%%%%%J%%
$$ 94 95 95 94 94 95 96 97 96 95 95 95 96 96 96 97 96 96 96 95 95 96 97 97 98 97 97 96 96 95 96 96 96 95 95 95 96 96 96 96 96 96 96 96 96 95 95 95 96 95 95 95 95 96 96 96 96 95 95 95 96 96 96 96 96 96 96 96 97 97 97
4716I7%%%%jJjj%J%Jj%%J%%%j%%%J%%%%%%%%%%%j%j%%%%Jj%%j%JJ%%j%%%%J%j%%%%%%%J%j
$$ 97 97 97 97 97 96 97 96 95 95 96 96 97 96 96 96 97 97 97 97 96 96 96 96 97 97 97 97 97 97 97 97 97 97 97 97 96 96 95 95 95 95 95 96 95 95 95 94 94 95 96 96 96 95 95 95 95 95 96 96 95 95 95 95 95 95 95 95 96 96 95
4709I5j%J%%%%%%%%%%J%%%J%j%%j%J%%j%j%%%%%%J%%%%%J%%%%%%%J%%j%%%%%jjj%J%J%%%%
$$ 95 94 94 95 95 95 95 95 95 95 95 95 95 95 96 96 96 96 97 97 96 96 96 95 95 96 96 96 95 95 94 94 94 94 94 94 94 95 95 95 95 95 95 96 96 96 96 96 96 96 96 97 97 97 96 96 96 96 96 96 95 94 93 93 94 94 95 95 95 95 95
4701I5%%j%%%%jJ%J%J%Jjj%%J%%%j%j%JJ%Jjj%%Jjj%%%%%JJ%%%%j%j%J%j%%%J%%jJ%%J%J%
$$ 95 95 95 94 94 94 94 94 93 94 94 95 95 96 96 97 96 95 95 95 96 96 96 96 95 95 94 94 95 96 96 97 96 95 95 95 96 95 94 94 94 94 94 94 95 96 96 96 96 96 95 95 94 94 95 95 94 94 94 94 95 95 95 94 95 95 95 96 96 97 97
4694I7j%%j%j%%%JJj%%%%%jJ%j%jJ%j%%%J%J%%j%%%%%J%%j%j%J%%%%%%j%%%%%%%J%%%%%j%
$$ 97 96 96 96 95 95 94 94 94 94 95 96 95 95 95 95 95 95 94 95 95 94 94 93 94 94 93 93 93 93 94 94 95 95 95 94 94 94 94 94 94 95 95 95 94 94 93 93 94 94 94 94 94 94 94 93 93 93 93 93 93 93 93 94 94 94 94 94 94 93 93
4686I3%%%jj%%%J%%%%%%%%j%%J%%jjJ%%%%%%%J%%%J%%%%j%%%j%JJ%%j%%%%%%%%j%%%%%%%%
$$ 93 93 93 93 92 91 91 91 91 92 92 92 92 92 92 92 92 92 91 91 91 92 92 92 91 90 91 91 91 91 91 91 91 91 92 92 92 92 93 93 93 93 93 92 92 92 92 91 91 92 93 93 93 92 92 92 92 92 92 92 92 92 91 91 91 91 91 91 91 91 91
4679I1%%J%%%j%%j%%J%J%%j%%J%%%%j%%J%%%J%%%%J%%j%%%%%%JJj%%%%%%%J%%j%%J%%jj%%
$$ 91 91 91 92 92 92 92 91 91 91 90 90 90 91 91 92 92 92 91 91 91 92 92 92 92 92 91 91 91 92 92 92 92 93 93 93 93 93 94 94 94 93 93 93 93 93 93 93 94 95 94 94 94 94 94 94 94 94 95 95 95 94 94 94 95 95 95 94 93 93 93
4671I3%%%%%%%%%J%%%%j%%JJ%%j%j%JJ%JJjj%J%%j%%%%%%J%J%jJ%%%j%%%%%%Jj%%%%J%%%j
$$ 93 93 93 93 93 93 93 93 93 93 94 94 94 94 94 93 93 93 94 95 95 95 94 94 93 93 94 95 95 96 97 96 95 95 96 96 96 95 95 95 95 95 95 95 96 96 97 97 96 97 97 97 97 96 96 96 96 96 96 96 97 96 96 96 96 96 97 97 97 97 96
4664I6%%%%%%%%%%%J%%%%%j%j%%%%%%%%%JJj%%%j%j%%JK%%jj%%%J%Jj%%Jj%%%%%%%jJ%%%%
$$ 96 96 96 96 96 96 96 96 96 96 96 96 97 97 97 97 97 97 96 96 95 95 95 95 95 95 95 95 95 95 96 97 96 96 96 96 95 95 94 94 94 95 97 97 97 96 95 95 95 95 96 96 97 96 96 96 97 96 96 96 96 96 96 96 96 95 96 96 96 96 96
4657I6%%%Jjj%jJ%%%j%J%%%%%%%J%%%j%%J%%Jj%j%%%%%%%%%%%%%j%jj%%JJ%J%%J%jj%%J%%
$$ 96 96 96 96 97 96 95 95 94 95 95 95 95 94 94 95 95 95 95 95 95 95 95 96 96 96 96 95 95 95 96 96 96 97 96 96 95 95 95 95 95 95 95 95 95 95 95 95 95 95 94 94 93 92 92 92 93 94 94 95 95 95 96 96 95 94 94 94 95 95 95
4649I5j%%%J%Jj%%%%%%%%%%%Jj%%%%%%%%%%%%%JJ%j%j%%%%%j%JJjj%JJ%Jj%%J%%jj%%%%%J
$$ 95 94 94 94 94 95 95 96 95 95 95 95 95 95 95 95 95 95 95 95 96 95 95 95 95 95 95 95 95 95 95 95 95 95 95 96 97 97 96 96 95 95 95 95 95 95 94 94 95 96 95 94 94 95 96 96 97 96 96 96 97 97 97 96 95 95 95 95 95 95 96
4642I6%J%%%%%%j%%J%j%j%J%%%%j%%J%j%%%%%J%j%%%%%%%JJ%j%j%j%%%jJ%%Jj%jJ%J%%%%j
$$ 96 96 97 97 97 97 97 97 97 96 96 96 97 97 96 96 95 95 96 96 96 96 96 95 95 95 96 96 95 95 95 95 95 95 96 96 95 95 95 95 95 95 95 95 96 97 97 96 96 95 95 94 94 94 94 93 94 94 94 95 94 94 93 94 94 95 95 95 95 95 94
4634I4%%%%%J%%%%%j%%jJ%JJ%j%%%%%%%j%%%jJJ%%%%%j%%%%%%%%%%%%%JjJ%j%%%%%J%%%j%
$$ 94 94 94 94 94 94 95 95 95 95 95 95 94 94 94 93 94 94 95 96 96 95 95 95 95 95 95 95 95 94 94 94 94 93 94 95 95 95 95 95 95 94 94 94 94 94 94 94 94 94 94 94 94 94 94 95 94 95 95 94 94 94 94 94 94 95 95 95 95 94 94
4627I4%Jj%%%%j%J%%%%j%J%%%%%jJ%%j%%J%J%%%%%%%%j%j%%%j%%%%%%%%j%%J%%%%%%%%%%J
$$ 94 94 95 94 94 94 94 94 93 93 94 94 94 94 94 93 93 94 94 94 94 94 94 93 94 94 94 93 93 93 94 94 95 95 95 95 95 95 95 95 95 94 94 93 93 93 93 92 92 92 92 92 92 92 92 92 91 91 91 92 92 92 92 92 92 92 92 92 92 92 93
4619I3%%%%%%%J%%j%%%j%%%%j%%%%%%%%%Jj%J%J%j%%%%%%%j%%%j%%%J%%%%%%%j%%JJ%%%%%
$$ 93 93 93 93 93 93 93 93 94 94 94 93 93 93 93 92 92 92 92 92 91 91 91 91 91 91 91 91 91 91 92 91 91 92 92 93 93 92 92 92 92 92 92 92 92 91 91 91 91 90 90 90 90 91 91 91 91 91 91 91 91 90 90 90 91 92 92 92 92 92 92
4612I2Jj%%j%%Jj%%%%J%%%j%%J%%%jj%%JJJJ%j%%Jj%j%J%%jJJ%%%J%j%%j%j%%J%jj%%%%%J
$$ 92 93 92 92 92 91 91 91 92 91 91 91 91 91 92 92 92 92 91 91 91 92 92 92 92 91 90 90 90 91 92 93 94 94 93 93 93 94 93 93 92 92 93 93 93 92 93 94 94 94 94 95 95 94 94 94 93 93 92 92 92 93 93 92 91 91 91 91 91 91 92
4605I2Jj%%J%%%%%%%%j%%%J%%%%%%%J%jj%%JJJ%%%%%%%%%%%j%%%J%Jj%%JjJ%jj%%%%%J%%%
$$ 92 93 92 92 92 93 93 93 93 93 93 93 93 93 92 92 92 92 93 93 93 93 93 93 93 93 94 94 93 92 92 92 93 94 95 95 95 95 95 95 95 95 95 95 95 95 94 94 94 94 95 95 96 95 95 95 96 95 96 96 95 94 94 94 94 94 94 95 95 95 95
4597I5%%j%J%%j%%j%%J%%JJ%j%%j%%%%%%%J%%jJ%J%%%j%%%J%%%%j%%%%%j%%%%%%%%%J%J%j
$$ 95 95 95 94 94 95 95 95 94 94 94 93 93 93 94 94 94 95 96 96 95 95 95 94 94 94 94 94 94 94 94 95 95 95 94 95 95 96 96 96 96 95 95 95 95 96 96 96 96 96 95 95 95 95 95 95 94 94 94 94 94 94 94 94 94 94 95 95 96 96 95
4590I5%%%%J%%%jjJJ%%j%%%%j%%%J%%J%%j%%j%%%%%%%%%%J%%%%%%%%%%%%%%%%%jJ%%j%%j%
$$ 95 95 95 95 95 96 96 96 96 95 94 95 96 96 96 95 95 95 95 95 94 94 94 94 95 95 95 96 96 96 95 95 95 94 94 94 94 94 94 94 94 94 94 94 95 95 95 95 95 95 95 95 95 95 95 95 95 95 95 95 95 95 94 95 95 95 94 94 94 93 93
4582I3%%J%J%j%%%%%J%j%%%%%j%%JJ%%%%%j%%J%%j%%%J%J%%j%%%JJjj%%%%%%jjJ%J%%%%%%
$$ 93 93 93 94 94 95 95 94 94 94 94 94 94 95 95 94 94 94 94 94 94 93 93 93 94 95 95 95 95 95 95 94 94 94 95 95 95 94 94 94 94 95 95 96 96 96 95 95 95 95 96 97 96 95 95 95 95 95 95 95 94 93 94 94 95 95 95 95 95 95 95
4575I5%%jJ%%%%j%%J%%%%%%%%%%%%%%%J%j%%%j%%%%JJ%%j%%jJ%j%%%%%%%%%%j%J%J%jJ%%%
$$ 95 95 95 94 95 95 95 95 95 94 94 94 95 95 95 95 95 95 95 95 95 95 95 95 95 95 95 95 96 96 95 95 95 95 94 94 94 94 94 95 96 96 96 95 95 95 94 95 95 94 94 94 94 94 94 94 94 94 94 94 93 93 94 94 95 95 94 95 95 95 95
4568I5j%%%%%J%%%J%%J%jJ%%%jjjJ%%j%JJ%%jjjJJ%%%j%%Jj%%%%%%%Jj%j%%%J%%%%%%jJ%%
$$ 95 94 94 94 94 94 94 95 95 95 95 96 96 96 97 97 96 97 97 97 97 96 95 94 95 95 95 94 94 95 96 96 96 95 94 93 94 95 95 95 95 94 94 94 95 94 94 94 94 94 94 94 94 95 94 94 93 93 93 93 94 94 94 94 94 94 94 93 94 94 94
4560I4j%%%%J%%%J%jJ%%j%%jJ%%J%%%j%%J%%%j%%%%J%%%%%%%%j%%j%%J%%%j%%%J%%%%%%%%
$$ 94 93 93 93 93 93 94 94 94 94 95 95 94 95 95 95 94 94 94 93 94 94 94 95 95 95 95 94 94 94 95 95 95 95 94 94 94 94 94 95 95 95 95 95 95 95 95 95 94 94 94 93 93 93 94 94 94 94 93 93 93 93 94 94 94 94 94 94 94 94 94
4553I4jJJj%%%j%%%J%%%%%j%Jj%%J%%%jJ%%%jJJj%%%%%J%jjJ%%%%j%%%%J%%J%%%%%%j%jjJ
$$ 94 93 94 95 94 94 94 94 93 93 93 93 94 94 94 94 94 94 93 93 94 93 93 93 94 94 94 94 93 94 94 94 94 93 94 95 94 94 94 94 94 94 95 95 94 93 94 94 94 94 94 93 93 93 93 93 94 94 94 95 95 95 95 95 95 95 94 94 93 92 93
4545I3J%%%%%j%%%Jj%j%JJ%%%%%%%%%%%%%j%%J%j%%%%%%%%j%j%JjJ%%%%%Jj%%JJ%j%%%%%%
$$ 93 94 94 94 94 94 94 93 93 93 93 94 93 93 92 92 93 94 94 94 94 94 94 94 94 94 94 94 94 94 94 93 93 93 94 94 93 93 93 93 93 93 93 93 93 92 92 91 91 92 91 92 92 92 92 92 92 93 92 92 92 93 94 94 93 93 93 93 93 93 93
4538I3J%j%%%%%%j%J%JJ%%j%%%%j%%%Jj%%jJJ%%%%j%%j%%%%J%J%jJ%%J%%jjj%%%%%J%J%%%
$$ 93 94 94 93 93 93 93 93 93 93 92 92 93 93 94 95 95 95 94 94 94 94 94 93 93 93 93 94 93 93 93 92 93 94 94 94 94 94 93 93 93 92 92 92 92 92 93 93 94 94 93 94 94 94 95 95 95 94 93 92 92 92 92 92 92 93 93 94 94 94 94
4530I4%%%jjj%JJ%%%%%j%%%%%J%J%%j%%%%%%%%%%%%%%%%%%%%%%%%%%%J%%j%j%%j%%Jj%JJ%
$$ 94 94 94 94 93 92 91 91 92 93 93 93 93 93 93 92 92 92 92 92 92 93 93 94 94 94 93 93 93 93 93 93 93 93 93 93 93 93 93 93 93 93 93 93 93 93 93 93 93 93 93 93 93 93 94 94 94 93 93 92 92 92 91 91 91 92 91 91 92 93 93
4523I3%%%%jJ%%%%J%%j%JJ%%%%%%%%%%%Jj%%j%j%%%J%%%%J%Jj%%%j%%%j%%J%J%%%j%%%%%%
$$ 93 93 93 93 93 92 93 93 93 93 93 94 94 94 93 93 94 95 95 95 95 95 95 95 95 95 95 95 95 96 95 95 95 94 94 93 93 93 93 94 94 94 94 94 95 95 96 95 95 95 95 94 94 94 94 93 93 93 94 94 95 95 95 95 94 94 94 94 94 94 94
4516I4Jj%%j%JJ%jjJ%%J%%%JjJ%j%jj%%%%J%%%JJ%%%%j%%%j%%J%kJ%J%%jJ%Jj%%%kJ%%jJ%
$$ 94 95 94 94 94 93 93 94 95 95 94 93 94 94 94 95 95 95 95 96 95 96 96 95 95 94 93 93 93 93 93 94 94 94 94 95 96 96 96 96 96 95 95 95 95 94 94 94 95 95 93 94 94 95 95 95 94 95 95 96 95 95 95 95 93 94 94 94 93 94 94
4508I4%J%%%j%%%%%J%j%%%%Jj%%%J%J%%%j%j%%J%%%%%j%%%%%%%J%%%jj%%%%%J%J%jj%%%J%
$$ 94 94 95 95 95 95 94 94 94 94 94 94 95 95 94 94 94 94 94 95 94 94 94 94 95 95 96 96 96 96 95 95 94 94 94 95 95 95 95 95 95 94 94 94 94 94 94 94 94 95 95 95 95 94 93 93 93 93 93 93 94 94 95 95 94 93 93 93 93 94 94
4501I4%%%%J%%%%%%%j%%%jJ%%%%%%%%%J%%Jj%%%%%%%j%%%j%%%%J%%%%%%%%j%%%%%jJ%%%JJ
$$ 94 94 94 94 94 95 95 95 95 95 95 95 95 94 94 94 94 93 94 94 94 94 94 94 94 94 94 94 95 95 95 96 95 95 95 95 95 95 95 95 94 94 94 94 93 93 93 93 93 94 94 94 94 94 94 94 94 94 93 93 93 93 93 93 92 93 93 93 93 94 95
4493I5%%%%%j%%%%%%%%%%%%%%Jj%%%%jJ%%%%j%J%%j%JJ%%j%J%%%jj%%JJ%%%j%%%%jJ%%j%J
$$ 95 95 95 95 95 95 94 94 94 94 94 94 94 94 94 94 94 94 94 94 94 95 94 94 94 94 94 93 94 94 94 94 94 93 93 94 94 94 93 93 94 95 95 95 94 94 95 95 95 95 94 93 93 93 94 95 95 95 95 94 94 94 94 94 93 94 94 94 93 93 94
4486I4%J%%%j%%j%J%%%%Jjj%%%%J%%%%%%%%j%%%J%%%%j%%%%%%j%JJ%%j%%%%%%JJ%jk%JJJ%
$$ 94 94 95 95 95 95 94 94 94 93 93 94 94 94 94 94 95 94 93 93 93 93 93 94 94 94 94 94 94 94 94 94 93 93 93 93 94 94 94 94 94 93 93 93 93 93 93 93 92 92 93 94 94 94 93 93 93 93 93 93 93 94 95 95 94 92 92 93 94 95 95
4479I5%j%%%%%%j%J%%%%%J%%j%%Jj%%%%%%%%%jJ%j%%J%%jJ%%j%jJ%j%JJj%%%%%j%%J%J%jj
$$ 95 95 94 94 94 94 94 94 94 93 93 94 94 94 94 94 94 95 95 95 94 94 94 95 94 94 94 94 94 94 94 94 94 94 93 94 94 93 93 93 94 94 94 93 94 94 94 93 93 92 93 93 92 92 93 94 93 93 93 93 93 93 92 92 92 93 93 94 94 93 92
4471I2%J%jJ%%%%%%%J%%Jj%%%%j%%%%J%%J%j%%%%%J%%j%J%%jj%%%jJ%jj%%%%%J%%J%%%Jj%
$$ 92 92 93 93 92 93 93 93 93 93 93 93 93 94 94 94 95 94 94 94 94 94 93 93 93 93 93 94 94 94 95 95 94 94 94 94 94 94 95 95 95 94 94 95 95 95 94 93 93 93 93 92 93 93 92 91 91 91 91 91 91 92 92 92 93 93 93 93 94 93 93
4464I3%%%%%%%%J%%%j%%j%JJ%%j%%%%%%%%%%J%%%%%J%j%%%%%%j%%j%%%%J%%jj%%%%JJ%%%J
$$ 93 93 93 93 93 93 93 93 93 94 94 94 94 93 93 93 92 92 93 94 94 94 93 93 93 93 93 93 93 93 93 93 93 94 94 94 94 94 94 95 95 94 94 94 94 94 94 94 93 93 93 92 92 92 92 92 93 93 93 92 91 91 91 91 91 92 93 93 93 93 94
4456I4%j%%%%%%%%%j%J%%%jJ%Jj%%%%j%J%J%J%%%jj%%J%%%%%Jj%j%j%%%%%J%J%%%%%%%J%%
$$ 94 94 93 93 93 93 93 93 93 93 93 93 92 92 93 93 93 93 92 93 93 94 93 93 93 93 93 92 92 93 93 94 94 95 95 95 95 94 93 93 93 94 94 94 94 94 94 95 94 94 93 93 92 92 92 92 92 92 93 93 94 94 94 94 94 94 94 94 95 95 95
4449I5%jj%%%%jjJJ%%%JJj%%%%jj%%J%%j%%JJ%J%%j%%j%%j%%%%J%%%%%Jj%%%%%j%J%J%J%%
$$ 95 95 94 93 93 93 93 93 92 91 92 93 93 93 93 94 95 94 94 94 94 94 93 92 92 92 93 93 93 92 92 92 93 94 94 95 95 95 94 94 94 93 93 93 92 92 92 92 92 93 93 93 93 93 93 94 93 93 93 93 93 93 92 92 93 93 94 94 95 95 95
4441I5%%%%j%J%%%j%%%%%j%j%%%%%%J%%%%%J%%%j%%%%%%%%J%%%k%%%JJJ%%j%%%%j%%J%j%J
$$ 95 95 95 95 95 94 94 95 95 95 95 94 94 94 94 94 94 93 93 92 92 92 92 92 92 92 93 93 93 93 93 93 94 94 94 94 93 93 93 93 93 93 93 93 93 94 94 94 94 92 92 92 92 93 94 95 95 95 94 94 94 94 94 93 93 93 94 94 93 93 94
4434I4J%j%%Jjj%%%%%%jJ%%%J%%%%%j%j%%J%%%%%%JjJ%%%%%j%%%%%J%%j%%%%%jJ%%J%%%%j
$$ 94 95 95 94 94 94 95 94 93 93 93 93 93 93 93 92 93 93 93 93 94 94 94 94 94 94 93 93 92 92 92 93 93 93 93 93 93 93 94 93 94 94 94 94 94 94 93 93 93 93 93 93 94 94 94 93 93 93 93 93 93 92 93 93 93 94 94 94 94 94 93
4427I3%%jJ%%j%J%%%J%jj%%J%JJj%j%j%%%J%J%%%%%j%%j%%%j%K%J%%j%%%%%%%jJ%J%%%%jj
$$ 93 93 93 92 93 93 93 92 92 93 93 93 93 94 94 93 92 92 92 93 93 94 95 94 94 93 93 92 92 92 92 93 93 94 94 94 94 94 94 93 93 93 92 92 92 92 91 91 93 93 94 94 94 93 93 93 93 93 93 93 93 92 93 93 94 94 94 94 94 93 92
4419I2%%%%%J%J%j%%%J%%j%%%%%j%J%%%%%%J%%%j%%%%j%%%%%%%%J%%%%%%J%%%%%%%%j%Jjj
$$ 92 92 92 92 92 92 93 93 94 94 93 93 93 93 94 94 94 93 93 93 93 93 93 92 92 93 93 93 93 93 93 93 94 94 94 94 93 93 93 93 93 92 92 92 92 92 92 92 92 92 93 93 93 93 93 93 93 94 94 94 94 94 94 94 94 94 93 93 94 93 92
4412I2%%%j%JJ%J%%%%Jjj%J%%%%J%%%%j%%J%jj%J%%j%j%J%%JjJ%%j%J%%%j%%j%%J%%j%%%J
$$ 92 92 92 92 91 91 92 93 93 94 94 94 94 94 95 94 93 93 94 94 94 94 94 95 95 95 95 95 94 94 94 95 95 94 93 93 94 94 94 93 93 92 92 93 93 93 94 93 94 94 94 93 93 94 94 94 94 93 93 93 92 92 92 93 93 93 92 92 92 92 93
4404I3%%jJ%%%%%%%%%JJ%j%%%j%%%%%%J%%%%j%%%%%Jj%%%j%jJ%J%Jj%j%%J%%%%%%j%Jj%%%
$$ 93 93 93 92 93 93 93 93 93 93 93 93 93 93 94 95 95 94 94 94 94 93 93 93 93 93 93 93 94 94 94 94 94 93 93 93 93 93 93 94 93 93 93 93 92 92 91 92 92 93 93 94 93 93 92 92 92 93 93 93 93 93 93 93 92 92 93 92 92 92 92
4397I2%jJJ%%%%J%j%%%j%j%J%%JJ%%%Jj%%j%%%%%j%J%jj%%Jj%J%%%%%%JJ%%j%J%%jj%%%J%
$$ 92 92 91 92 93 93 93 93 93 94 94 93 93 93 93 92 92 91 91 92 92 92 93 94 94 94 94 95 94 94 94 93 93 93 93 93 93 92 92 93 93 92 91 91 91 92 91 91 92 92 92 92 92 92 92 93 94 94 94 93 93 94 94 94 93 92 92 92 92 93 93
4390I3J%%jj%%j%%J%%%%%j%J%%%j%J%%%%%J%%%jJ%j%%%%%%%J%%%%%%%jJJ%jj%%%%%j%%%%J
$$ 93 94 94 94 93 92 92 92 91 91 91 92 92 92 92 92 92 91 91 92 92 92 92 91 91 92 92 92 92 92 92 93 93 93 93 92 93 93 92 92 92 92 92 92 92 92 93 93 93 93 93 93 93 93 92 93 94 94 93 92 92 92 92 92 92 91 91 91 91 91 92
4382I2%%J%%%%%JJ%jj%%%%Jjj%%%%JJ%%%%%j%%j%%%Jj%%%%%%%%%%jj%%%%%%%jJ%JJ%j%J%J
$$ 92 92 92 93 93 93 93 93 93 94 95 95 94 93 93 93 93 93 94 93 92 92 92 92 92 93 94 94 94 94 94 94 93 93 93 92 92 92 92 93 92 92 92 92 92 92 92 92 92 92 92 91 90 90 90 90 90 90 90 90 89 90 90 91 92 92 91 91 92 92 93
4375I3%%j%%%%%%J%Jj%%%%jJ%j%%J%%%%jJJ%%j%%J%jj%%%%J%J%%%jjJ%J%%%%j%j%J%%J%%%
$$ 93 93 93 92 92 92 92 92 92 92 93 93 94 93 93 93 93 93 92 93 93 92 92 92 93 93 93 93 93 92 93 94 94 94 93 93 93 94 94 93 92 92 92 92 92 93 93 94 94 94 94 93 92 93 93 94 94 94 94 94 93 93 92 92 93 93 93 94 94 94 94
4367I4jjjJ%%J%%%%j%%%jJ%%jJ%%%JJj%%jJ%%j%%%Jj%%J%%%%J%%%%j%%%%%Jj%j%%%%j%JJ%
$$ 94 93 92 91 92 92 92 93 93 93 93 93 92 92 92 92 91 92 92 92 91 92 92 92 92 93 94 93 93 93 92 93 93 93 92 92 92 92 93 92 92 92 93 93 93 93 93 94 94 94 94 94 93 93 93 93 93 93 94 93 93 92 92 92 92 92 91 91 92 93 93
4360I3%j%%J%j%%%%%%%%%JJJjj%jJ%J%%%Jjj%jj%J%%%%%%%%J%%%%j%%J%%Jj%%%J%%%%%jjj
$$ 93 93 92 92 92 93 93 92 92 92 92 92 92 92 92 92 92 93 94 95 94 93 93 92 93 93 94 94 94 94 95 94 93 93 92 91 91 92 92 92 92 92 92 92 92 92 93 93 93 93 93 92 92 92 93 93 93 94 93 93 93 93 94 94 94 94 94 94 93 92 91
4352I1%J%J%%%%%%%%%%%%Jj%%j%%%%%%%%%%%Jj%%%%%jjJJJ%%j%jJ%%Jj%%%%%%%%%%%Jj%%%
$$ 91 91 92 92 93 93 93 93 93 93 93 93 93 93 93 93 93 94 93 93 93 92 92 92 92 92 92 92 92 92 92 92 92 93 92 92 92 92 92 92 91 90 91 92 93 93 93 92 92 91 92 92 92 93 92 92 92 92 92 92 92 92 92 92 92 92 93 92 92 92 92
4345I2J%jJ%%%j%%%%%jJ%%%%%%%j%%%jJ%%%J%%%%%j%J%J%%jj%J%%%%%%%%%%%%%%J%%j%Jjj
$$ 92 93 93 92 93 93 93 93 92 92 92 92 92 92 91 92 92 92 92 92 92 92 92 91 91 91 91 90 91 91 91 91 92 92 92 92 92 92 91 91 92 92 93 93 93 92 91 91 92 92 92 92 92 92 92 92 92 92 92 92 92 92 92 93 93 93 92 92 93 92 91
4338I1%J%%jJ%%%%%%%%%%%J%%jJ%j%%%%%%%%%%jJjj%%%JJJ%%%j%j%%%%%%%%%%%%J%%%%%%%
$$ 91 91 92 92 92 91 92 92 92 92 92 92 92 92 92 92 92 92 93 93 93 92 93 93 92 92 92 92 92 92 92 92 92 92 92 91 92 91 90 90 90 90 91 92 93 93 93 93 92 92 91 91 91 91 91 91 91 91 91 91 91 91 91 92 92 92 92 92 92 92 92
4330I2J%j%jJ%%J%%%%%%%%%%%%j%%j%JJ%%%j%%%j%%%%%%J%%%%J%J%%%j%%%%Jj%J%j%%J%%%
$$ 92 93 93 92 92 91 92 92 92 93 93 93 93 93 93 93 93 93 93 93 93 93 92 92 92 91 91 92 93 93 93 93 92 92 92 92 91 91 91 91 91 91 91 92 92 92 92 92 93 93 94 94 94 94 93 93 93 93 93 94 93 93 94 94 93 93 93 94 94 94 94
4323I4J%jj%k%J%%%%%%%%%%%%%%%j%%%JJ%%j%%%J%%j%J%%j%%%%%%%J%%%j%%%%j%J%%%J%%j
$$ 94 95 95 94 93 93 91 91 92 92 92 92 92 92 92 92 92 92 92 92 92 92 92 92 91 91 91 91 92 93 93 93 92 92 92 92 93 93 93 92 92 93 93 93 92 92 92 92 92 92 92 92 93 93 93 93 92 92 92 92 92 91 91 92 92 92 92 93 93 93 92
4315I2%%%%j%%%J%%j%%J%%%J%j%%%%%%j%%jJ%%%J%%%%%%%%%j%%JJ%j%%%%%Jjjj%JJ%%%%%%
$$ 92 92 92 92 92 91 91 91 91 92 92 92 91 91 91 92 92 92 92 93 93 92 92 92 92 92 92 92 91 91 91 90 91 91 91 91 92 92 92 92 92 92 92 92 92 92 91 91 91 92 93 93 92 92 92 92 92 92 93 92 91 90 90 91 92 92 92 92 92 92 92
4308I2%%%%J%J%%j%j%%%J%%%%%%%j%%jJJ%%%%%j%jJ%J%J%%%%%%%%%JJj%%%%%Jjj%%%%%J%%
$$ 92 92 92 92 92 93 93 94 94 94 93 93 92 92 92 92 93 93 93 93 93 93 93 93 92 92 92 91 92 93 93 93 93 93 93 92 92 91 92 92 93 93 94 94 94 94 94 94 94 94 94 94 95 96 95 95 95 95 95 95 96 95 94 94 94 94 94 94 95 95 95
4301I5J%j%%Jj%%j%j%%%%%%%j%%%%%%%%%%%%%j%jJJj%%%%J%%%%%%%j%J%%%%j%J%%%%J%%J%
$$ 95 96 96 95 95 95 96 95 95 95 94 94 93 93 93 93 93 93 93 93 92 92 92 92 92 92 92 92 92 92 92 92 92 92 91 91 90 91 92 91 91 91 91 91 92 92 92 92 92 92 92 92 91 91 92 92 92 92 92 91 91 92 92 92 92 92 93 93 93 94 94
4293I4j%%j%%%%%%%%J%%%%%jj%%J%%%%%Jj%%%%%%j%%J%J%%jJJJ%%j%j%j%KJJ%%%%%%%j%%%
$$ 94 93 93 93 92 92 92 92 92 92 92 92 92 93 93 93 93 93 93 92 91 91 91 92 92 92 92 92 92 93 92 92 92 92 92 92 92 91 91 91 92 92 93 93 93 92 93 94 95 95 95 94 94 93 93 92 92 94 95 96 96 96 96 96 96 96 96 95 95 95 95
4286I5%J%%j%%%%%%%jj%%JJ%%%j%%%%%j%%j%J%%%%%%%%jj%%%%J%j%%%%%%%%%%%j%%J%J%%%
$$ 95 95 96 96 96 95 95 95 95 95 95 95 95 94 93 93 93 94 95 95 95 95 94 94 94 94 94 94 93 93 93 92 92 93 93 93 93 93 93 93 93 93 92 91 91 91 91 91 92 92 91 91 91 91 91 91 91 91 91 91 91 91 90 90 90 91 91 92 92 92 92
4278I2j%%%%%%%%J%%%%J%%j%jJ%%%%%%j%%%J%%j%JJ%%%%%%j%%%%%J%%jj%%J%%%j%%j%%JJ%
$$ 92 91 91 91 91 91 91 91 91 91 92 92 92 92 92 93 93 93 92 92 91 92 92 92 92 92 92 92 91 91 91 91 92 92 92 91 91 92 93 93 93 93 93 93 93 92 92 92 92 92 92 93 93 93 92 91 91 91 92 92 92 92 91 91 91 90 90 90 91 92 92
4271I2j%J%%%%%%%%J%jj%%JJ%jjJ%%%Jj%j%%%J%%jJ%%%jJJ%jj%%%j%J%%%%%%j%jJ%%%%%%J
$$ 92 91 91 92 92 92 92 92 92 92 92 92 93 93 92 91 91 91 92 93 93 92 91 92 92 92 92 93 92 92 91 91 91 91 92 92 92 91 92 92 92 92 91 92 93 93 92 91 91 91 91 90 90 91 91 91 91 91 91 91 90 90 89 90 90 90 90 90 90 90 91
4263I1%J%j%%%%J%%%%j%%%J%j%%%%Jj%%%%%j%%%%%%%J%%%%%%jJ%%J%%%%%jJ%J%%%%%j%%%%
$$ 91 91 92 92 91 91 91 91 91 92 92 92 92 92 91 91 91 91 92 92 91 91 91 91 91 92 91 91 91 91 91 91 90 90 90 90 90 90 90 90 91 91 91 91 91 91 91 90 91 91 91 92 92 92 92 92 92 91 92 92 93 93 93 93 93 93 92 92 92 92 92
4256I2%%%%%%%%%%%%j%%j%%%JJj%jJ%%%%%J%%%%%%%%J%%jjj%%JJ%%%%%%%%%%%%%%JJ%%j%j
$$ 92 92 92 92 92 92 92 92 92 92 92 92 92 91 91 91 90 90 90 90 91 92 91 91 90 91 91 91 91 91 91 92 92 92 92 92 92 92 92 92 93 93 93 92 91 90 90 90 91 92 92 92 92 92 92 92 92 92 92 92 92 92 92 92 93 94 94 94 93 93 92
4249I2%%jJ%%Jjj%%%Jj%%J%%%%%%j%j%%%%JJ%JjJ%j%%%j%%jJ%%J%j%%%j%J%%JJj%j%jJJ%%
$$ 92 92 92 91 92 92 92 93 92 91 91 91 91 92 91 91 91 92 92 92 92 92 92 92 91 91 90 90 90 90 90 91 92 92 93 92 93 93 92 92 92 92 91 91 91 90 91 91 91 92 92 91 91 91 91 90 90 91 91 91 92 93 92 92 91 91 90 91 92 92 92
4241I2%jJ%%j%%J%%%j%%%%%J%Jj%%%%%Jj%j%jJJJj%%%%%Jj%jj%%JJ%%jj%%%J%Jjjj%%KJJj
$$ 92 92 91 92 92 92 91 91 91 92 92 92 92 91 91 91 91 91 91 92 92 93 92 92 92 92 92 92 93 92 92 91 91 90 91 92 93 92 92 92 92 92 92 93 92 92 91 90 90 90 91 92 92 92 91 90 90 90 90 91 91 92 91 90 89 89 89 91 92 93 92
4234I2j%%%%J%%%j%j%%%%%%jJ%JJ%%%%%j%%%%%%%%%%j%%j%%J%%Jjj%%%%%J%Jj%%Jj%%%%%%
$$ 92 91 91 91 91 91 92 92 92 92 91 91 90 90 90 90 90 90 90 89 90 90 91 92 92 92 92 92 92 91 91 91 91 91 91 91 91 91 91 91 90 90 90 89 89 89 90 90 90 91 90 89 89 89 89 89 89 90 90 91 90 90 90 91 90 90 90 90 90 90 90
4226I0%%%%%%%JJjj%%%%%J%%%%%Jj%J%%jJ%%%jJ%j%%%jJ%%%%j%%J%%%%jJ%%%J%jJJ%jj%%%
$$ 90 90 90 90 90 90 90 90 91 92 91 90 90 90 90 90 90 91 91 91 91 91 91 92 91 91 92 92 92 91 92 92 92 92 91 92 92 91 91 91 91 90 91 91 91 91 91 90 90 90 91 91 91 91 91 90 91 91 91 91 92 92 91 92 93 93 92 91 91 91 91
4219I1%J%%%j%%%%%%%%%J%j%Jj%%J%J%j%%J%%jj%%J%%%%j%%%%%J%%%j%j%%%%%%J%J%%j%%%
$$ 91 91 92 92 92 92 91 91 91 91 91 91 91 91 91 91 92 92 91 91 92 91 91 91 92 92 93 93 92 92 92 93 93 93 92 91 91 91 92 92 92 92 92 91 91 91 91 91 91 92 92 92 92 91 91 90 90 90 90 90 90 90 91 91 92 92 92 91 91 91 91
4212I1%%J%%%jjj%%%J%J%%%%%%J%%jj%%%%%J%%%%j%%%J%%%jJ%%%j%%Jj%J%j%%%JJ%Jj%%%j
$$ 91 91 91 92 92 92 92 91 90 89 89 89 89 90 90 91 91 91 91 91 91 91 92 92 92 91 90 90 90 90 90 90 91 91 91 91 91 90 90 90 90 91 91 91 91 90 91 91 91 91 90 90 90 91 90 90 91 91 90 90 90 90 91 92 92 93 92 92 92 92 91
4204I1%%j%jJ%%J%%%j%J%Jj%J%%k%%J%%%%%j%%J%%%J%%%%%j%%%J%%%%%%%%j%%jJ%%j%%%%%
$$ 91 91 91 90 90 89 90 90 90 91 91 91 91 90 90 91 91 92 91 91 92 92 92 90 90 90 91 91 91 91 91 91 90 90 90 91 91 91 91 92 92 92 92 92 92 91 91 91 91 92 92 92 92 92 92 92 92 92 91 91 91 90 91 91 91 90 90 90 90 90 90
4197I0%%J%%jJ%%%jJ%%J%k%jJ%%K%%%%j%%%j%J%%%j%J%%Jjj%%J%%%%%%%j%%jJ%JJj%jJ%%%
$$ 90 90 90 91 91 91 90 91 91 91 91 90 91 91 91 92 92 90 90 89 90 90 90 92 92 92 92 92 91 91 91 91 90 90 91 91 91 91 90 90 91 91 91 92 91 90 90 90 91 91 91 91 91 91 91 91 90 90 90 89 90 90 91 92 91 91 90 91 91 91 91
4189I1Jj%%%%%%%%Jj%%%%%%j%%%J%%%%J%%%j%Jjj%%J%%%%J%%j%%%%%%%%%%%%%%%jj%j%JJJ
$$ 91 92 91 91 91 91 91 91 91 91 91 92 91 91 91 91 91 91 91 90 90 90 90 91 91 91 91 91 92 92 92 92 91 91 92 91 90 90 90 91 91 91 91 91 92 92 92 91 91 91 91 91 91 91 91 91 91 91 91 91 91 91 91 90 89 89 88 88 89 90 91
4182I1J%jJ%j%%%%j%%%%J%%%%%%j%j%J%%%%%%%%JJ%%%j%%%%%jJ%j%%Jj%%%j%%%%J%%%%%%J
$$ 91 92 92 91 92 92 91 91 91 91 91 90 90 90 90 90 91 91 91 91 91 91 91 90 90 89 89 90 90 90 90 90 90 90 90 90 91 92 92 92 92 91 91 91 91 91 91 90 91 91 90 90 90 91 90 90 90 90 89 89 89 89 89 90 90 90 90 90 90 90 91
4174I1%%%j%J%%%j%J%%%%j%Jj%%%%%%%%J%%%%%%%j%%%%%%%%JjJJ%%j%%j%j%J%%%J%%%Jj%j
$$ 91 91 91 91 90 90 91 91 91 91 90 90 91 91 91 91 91 90 90 91 90 90 90 90 90 90 90 90 90 91 91 91 91 91 91 91 91 90 90 90 90 90 90 90 90 90 91 90 91 92 92 92 91 91 91 90 90 89 89 90 90 90 90 91 91 91 91 92 91 91 90
4167I0%%%%%%%%%J%%%J%j%Jj%%%%%%j%%%%J%%%j%jjJ%J%JjjJ%%J%jJ%%%j%J%j%J%%j%JJ%%
$$ 90 90 90 90 90 90 90 90 90 90 91 91 91 91 92 92 91 91 92 91 91 91 91 91 91 91 90 90 90 90 90 91 91 91 91 90 90 89 88 89 89 90 90 91 90 89 90 90 90 91 91 90 91 91 91 91 90 90 91 91 90 90 91 91 91 90 90 91 92 92 92
4160I2j%%%j%%J%%%J%%j%%jj%J%J%j%J%%%%%j%jJ%%%%%%%%j%%%%%J%jJ%%%%%%%J%%j%%%%%
$$ 92 91 91 91 91 90 90 90 91 91 91 91 92 92 92 91 91 91 90 89 89 90 90 91 91 90 90 91 91 91 91 91 91 90 90 89 90 90 90 90 90 90 90 90 90 89 89 89 89 89 89 90 90 89 90 90 90 90 90 90 90 90 91 91 91 90 90 90 90 90 90
4152I0j%JJ%%%j%%%%%J%%%%%%j%%%j%%JJ%%%%%%j%j%%%J%%%%%%%%Jj%j%JJj%%%%J%%jJ%%%
$$ 90 89 89 90 91 91 91 91 90 90 90 90 90 90 91 91 91 91 91 91 91 90 90 90 90 89 89 89 90 91 91 91 91 91 91 91 90 90 89 89 89 89 90 90 90 90 90 90 90 90 90 91 90 90 89 89 90 91 90 90 90 90 90 91 91 91 90 91 91 91 91
4145I1%%%J%%j%%%%j%%%%%%J%Jj%j%%%%%%%%%%%%J%%%%J%jjJ%%%j%%J%%jj%%J%%%%%%j%J%
$$ 91 91 91 91 92 92 92 91 91 91 91 91 90 90 90 90 90 90 90 91 91 92 91 91 90 90 90 90 90 90 90 90 90 90 90 90 90 91 91 91 91 91 92 92 91 90 91 91 91 91 90 90 90 91 91 91 90 89 89 89 90 90 90 90 90 90 90 89 89 90 90
4137I0%%%%%%%%%%j%%JJ%jjJ%%%%%j%%%JJ%%%j%%%Jj%j%%%%%j%%JJJ%%%%%%j%%%Jj%%%%j%
$$ 90 90 90 90 90 90 90 90 90 90 90 89 89 89 90 91 91 90 89 90 90 90 90 90 90 89 89 89 89 90 91 91 91 91 90 90 90 90 91 90 90 89 89 89 89 89 89 88 88 88 89 90 91 91 91 91 91 91 91 90 90 90 90 91 90 90 90 90 90 89 89
4130H9%J%%%%J%%%%%%Jj%jJ%%%jj%%jJ%J%%%%%%%%j%%%%%%%%%J%%J%%J%%%%%jjJ%%%j%%J%
$$ 89 89 90 90 90 90 90 91 91 91 91 91 91 91 92 91 91 90 91 91 91 91 90 89 89 89 88 89 89 90 90 90 90 90 90 90 90 90 89 89 89 89 89 89 89 89 89 89 90 90 90 91 91 91 92 92 92 92 92 92 91 90 91 91 91 91 90 90 90 91 91
4123I1%%%%%%%%%%%j%%JJjj%J%j%%%j%%%J%%%j%j%%%JJ%Jj%%j%%J%%j%%J%%%%%%%%%%%%%%
$$ 91 91 91 91 91 91 91 91 91 91 91 91 90 90 90 91 92 91 90 90 91 91 90 90 90 90 89 89 89 89 90 90 90 90 89 89 88 88 88 88 89 90 90 91 90 90 90 89 89 89 90 90 90 89 89 89 90 90 90 90 90 90 90 90 90 90 90 90 90 90 90
4115I0%J%%jj%JJj%%j%%J%%%%j%%JJj%j%%J%%JJjj%j%%%%%%%%%J%%%%%Jj%%%%%J%%%%%j%j
$$ 90 90 91 91 91 90 89 89 90 91 90 90 90 89 89 89 90 90 90 90 90 89 89 89 90 91 90 90 89 89 89 90 90 90 91 92 91 90 90 89 89 89 89 89 89 89 89 89 89 90 90 90 90 90 90 91 90 90 90 90 90 90 91 91 91 91 91 91 90 90 89
4108H9j%%%Jj%%%%J%%J%%%%%%k%J%J%%%j%%JJ%jJ%%%%j%%Jj%%%j%j%%%%J%%%%%j%%%%J%jj
$$ 89 88 88 88 88 89 88 88 88 88 88 89 89 89 90 90 90 90 90 90 90 88 88 89 89 90 90 90 90 89 89 89 90 91 91 90 91 91 91 91 91 90 90 90 91 90 90 90 90 89 89 88 88 88 88 88 89 89 89 89 89 89 88 88 88 88 88 89 89 88 87
4100H7%J%%%%JJ%jJ%%jJ%%%%%Jj%%J%j%%J%%%j%%jJ%%%j%%%jJ%jJj%J%J%%j%%Jj%%%%%jjJ
$$ 87 87 88 88 88 88 88 89 90 90 89 90 90 90 89 90 90 90 90 90 90 91 90 90 90 91 91 90 90 90 91 91 91 91 90 90 90 89 90 90 90 90 89 89 89 89 88 89 89 88 89 88 88 89 89 90 90 90 89 89 89 90 89 89 89 89 89 89 88 87 88
4093H8J%%%J%j%J%%j%%%%Jj%%j%%%J%Jjj%%%J%JJ%%%j%%%%%%%%J%J%j%%%%Jjjj%%%%J%%%j
$$ 88 89 89 89 89 90 90 89 89 90 90 90 89 89 89 89 89 90 89 89 89 88 88 88 88 89 89 90 89 88 88 88 88 89 89 90 91 91 91 91 90 90 90 90 90 90 90 90 90 91 91 92 92 91 91 91 91 91 92 91 90 89 89 89 89 89 90 90 90 90 89
4085H9JJJjj%%%%%%%jJ%%%J%Jj%%%%j%%%%%j%%%J%%j%%%%%%J%J%k%j%%%%%%JJ%%%%%j%%%%
$$ 89 90 91 92 91 90 90 90 90 90 90 90 90 89 90 90 90 90 91 91 92 91 91 91 91 91 90 90 90 90 90 90 89 89 89 89 90 90 90 89 89 89 89 89 89 89 90 90 91 91 89 89 88 88 88 88 88 88 88 89 90 90 90 90 90 90 89 89 89 89 89
4078H9%%%J%J%%%%%j%%%%J%%%%%j%%%%%%%%%%%jJ%%%%%%%%J%%jjJJ%%%j%JJ%%%%j%%%%J%%
$$ 89 89 89 89 90 90 91 91 91 91 91 91 90 90 90 90 90 91 91 91 91 91 91 90 90 90 90 90 90 90 90 90 90 90 90 89 90 90 90 90 90 90 90 90 90 91 91 91 90 89 90 91 91 91 91 90 90 91 92 92 92 92 92 91 91 91 91 91 92 92 92
4071I2J%j%jj%%Jj%j%J%%%%%%Jj%jJJJ%%%%j%%%%j%j%Jj%j%%J%J%%%%%%%J%%%%j%%%J%%%j
$$ 92 93 93 92 92 91 90 90 90 91 90 90 89 89 90 90 90 90 90 90 90 91 90 90 89 90 91 92 92 92 92 92 91 91 91 91 91 90 90 89 89 90 89 89 88 88 88 89 89 90 90 90 90 90 90 90 90 91 91 91 91 91 90 90 90 90 91 91 91 91 90
4063I0%%%%%%%Jj%%%Jj%%jJ%%%%%%%%%%J%%j%%%%%%%Jjj%%%%%%%%%%%%%%J%%j%%%%j%%%%J
$$ 90 90 90 90 90 90 90 90 91 90 90 90 90 91 90 90 90 89 90 90 90 90 90 90 90 90 90 90 90 91 91 91 90 90 90 90 90 90 90 90 91 90 89 89 89 89 89 89 89 89 89 89 89 89 89 89 89 90 90 90 89 89 89 89 89 88 88 88 88 88 89
4056H9%j%%%J%JJj%%%%%%Jj%%%%j%%j%J%%J%%%%%%%%j%%%%%%%J%j%%%j%JJ%%%%j%Jjj%%jJ
$$ 89 89 88 88 88 88 89 89 90 91 90 90 90 90 90 90 90 91 90 90 90 90 90 89 89 89 88 88 89 89 89 90 90 90 90 90 90 90 90 90 89 89 89 89 89 89 89 89 90 90 89 89 89 89 88 88 89 90 90 90 90 90 89 89 90 89 88 88 88 87 88
4048H8JJ%%%%%%%%%%%jjJ%%Jj%%j%%%%%%%J%%Jj%j%%jj%JJjJ%%J%j%J%JJj%%j%%%%%J%j%%
$$ 88 89 90 90 90 90 90 90 90 90 90 90 90 90 89 88 89 89 89 90 89 89 89 88 88 88 88 88 88 88 88 89 89 89 90 89 89 88 88 88 87 86 86 87 88 87 88 88 88 89 89 88 88 89 89 90 91 90 90 90 89 89 89 89 89 89 90 90 89 89 89
4041H9j%%j%j%JJJ%Jj%%J%%%%%j%%%%%j%%J%Jj%%j%%%%%%%%%%%Jj%%%jJJJ%%%%%%j%%%%%%
$$ 89 88 88 88 87 87 86 86 87 88 89 89 90 89 89 89 90 90 90 90 90 90 89 89 89 89 89 89 88 88 88 89 89 90 89 89 89 88 88 88 88 88 88 88 88 88 88 88 88 89 88 88 88 88 87 88 89 90 90 90 90 90 90 90 89 89 89 89 89 89 89
4034H9J%%%%j%%J%%%%%%j%j%JJj%%JJj%j%%%%J%%j%j%%JJJj%%j%%%%%%J%%%%j%%%J%%%j%%
$$ 89 90 90 90 90 90 89 89 89 90 90 90 90 90 90 90 89 89 88 88 89 90 89 89 89 90 91 90 90 89 89 89 89 89 90 90 90 89 89 88 88 88 89 90 91 90 90 90 89 89 89 89 89 89 89 90 90 90 90 90 89 89 89 89 90 90 90 90 89 89 89
4026H9%j%j%%J%%%J%%%%%%%%%%%%%%jJ%%%%%%j%%%JJ%%%j%%%Jj%j%%%%%j%JJJ%%jj%%%%%%
$$ 89 89 88 88 87 87 87 88 88 88 88 89 89 89 89 89 89 89 89 89 89 89 89 89 89 89 88 89 89 89 89 89 89 89 88 88 88 88 89 90 90 90 90 89 89 89 89 90 89 89 88 88 88 88 88 88 87 87 88 89 90 90 90 89 88 88 88 88 88 88 88
4019H8%%%J%%j%%j%%J%J%%%%%%%Jj%%%J%J%j%jjJ%%%%JJj%J%j%jj%%%%JJj%Jkj%J%%J%%%%
$$ 88 88 88 88 89 89 89 88 88 88 87 87 87 88 88 89 89 89 89 89 89 89 89 90 89 89 89 89 90 90 91 91 90 90 89 88 89 89 89 89 89 90 91 90 90 91 91 90 90 89 88 88 88 88 88 89 90 89 89 90 88 87 87 88 88 88 89 89 89 89 89
4011H9%%Jj%jj%JJ%%%%j%%J%%jJ%%%JJj%jj%J%%J%%%%jJ%j%%jJJ%j%%%%%j%%JJ%%%%%j%%J
$$ 89 89 89 90 89 89 88 87 87 88 89 89 89 89 89 88 88 88 89 89 89 88 89 89 89 89 90 91 90 90 89 88 88 89 89 89 90 90 90 90 90 89 90 90 89 89 89 88 89 90 90 89 89 89 89 89 89 88 88 88 89 90 90 90 90 90 90 89 89 89 90
4004I0j%%%%%%%%%Jj%%j%jJ%%J%%j%%%%%j%Jj%J%J%%%j%%J%%j%J%%%%%%j%J%%J%j%%%J%j%
$$ 90 89 89 89 89 89 89 89 89 89 89 90 89 89 89 88 88 87 88 88 88 89 89 89 88 88 88 88 88 88 87 87 88 87 87 88 88 89 89 89 89 88 88 88 89 89 89 88 88 89 89 89 89 89 89 89 88 88 89 89 89 90 90 89 89 89 89 90 90 89 89
3996H9%%%J%%j%%j%%%%%%%%%%Jj%J%%j%%jjJJJ%%j%J%%%%%%%%J%%jj%%J%J%j%J%%j%j%jJ%
$$ 89 89 89 89 90 90 90 89 89 89 88 88 88 88 88 88 88 88 88 88 88 89 88 88 89 89 89 88 88 88 87 86 87 88 89 89 89 88 88 89 89 89 89 89 89 89 89 89 90 90 90 89 88 88 88 89 89 90 90 89 89 90 90 90 89 89 88 88 87 88 88
3989H8%%J%%%j%%%j%%%J%%%%J%%%%%j%%%%%Jj%J%j%%JJ%%j%%%%j%jJ%J%Jjj%%J%%%%%%j%j
$$ 88 88 88 89 89 89 89 88 88 88 88 87 87 87 87 88 88 88 88 88 89 89 89 89 89 89 88 88 88 88 88 88 89 88 88 89 89 88 88 88 89 90 90 90 89 89 89 89 89 88 88 87 88 88 89 89 90 89 88 88 88 89 89 89 89 89 89 89 88 88 87
3982H7%%J%%%%J%%%%%%%%%%%%J%%j%jJ%%j%jj%%%%J%J%%%%%%j%J%%J%j%%%%%%%%%%%J%%%%
$$ 87 87 87 88 88 88 88 88 89 89 89 89 89 89 89 89 89 89 89 89 89 90 90 90 89 89 88 89 89 89 88 88 87 86 86 86 86 86 87 87 88 88 88 88 88 88 88 87 87 88 88 88 89 89 88 88 88 88 88 88 88 88 88 88 88 88 89 89 89 89 89
3974H9j%J%J%Jj%j%%%%j%%%%%%%J%%j%%%%%JJ%%%%j%j%%jJ%%JJj%%%%%%%j%%%%%%%%%%j%%
$$ 89 88 88 89 89 90 90 91 90 90 89 89 89 89 89 88 88 88 88 88 88 88 88 89 89 89 88 88 88 88 88 88 89 90 90 90 90 90 89 89 88 88 88 87 88 88 88 89 90 89 89 89 89 89 89 89 89 88 88 88 88 88 88 88 88 88 88 88 87 87 87
3967H7J%%%%%%%%%%%%%%%J%Jj%%Jj%%%J%%j%j%%%J%%%%%%%%J%%j%%%%j%%%%j%J%%%J%%%%%
$$ 87 88 88 88 88 88 88 88 88 88 88 88 88 88 88 88 88 89 89 90 89 89 89 90 89 89 89 89 90 90 90 89 89 88 88 88 88 89 89 89 89 89 89 89 89 89 90 90 90 89 89 89 89 89 88 88 88 88 88 87 87 88 88 88 88 89 89 89 89 89 89
3959H9%%j%%%%J%jJ%%j%%j%%%J%JjjJ%%J%jj%%J%%jJ%%%%%%%%J%j%%J%%%j%%%J%%jjjJ%JJ
$$ 89 89 89 88 88 88 88 88 89 89 88 89 89 89 88 88 88 87 87 87 87 88 88 89 88 87 88 88 88 89 89 88 87 87 87 88 88 88 87 88 88 88 88 88 88 88 88 88 89 89 88 88 88 89 89 89 89 88 88 88 88 89 89 89 88 87 86 87 87 88 89
3952H9%%%j%%%Jj%%%Jj%%%jJJj%%%%%%%%%%j%J%%%%%%%%J%jj%%J%%%%%%%J%%%%%j%%%j%%%
$$ 89 89 89 89 88 88 88 88 89 88 88 88 88 89 88 88 88 88 87 88 89 88 88 88 88 88 88 88 88 88 88 88 87 87 88 88 88 88 88 88 88 88 88 89 89 88 87 87 87 88 88 88 88 88 88 88 88 89 89 89 89 89 89 88 88 88 88 87 87 87 87
3945H7JjJJ%%%%%%j%%%Jj%%%J%%%j%%%%%%%jJ%Jjj%%J%%%%%%%%%%%%%%%%%%%%%%%%J%%%%%
$$ 87 88 87 88 89 89 89 89 89 89 89 88 88 88 88 89 88 88 88 88 89 89 89 89 88 88 88 88 88 88 88 88 87 88 88 89 88 87 87 87 88 88 88 88 88 88 88 88 88 88 88 88 88 88 88 88 88 88 88 88 88 88 88 88 88 89 89 89 89 89 89
3937H9%%%%%%%%%j%%%%%Jj%%%%%%%%%%%Jjj%J%%%J%j%%%%J%jj%J%%j%%%J%k%%J%%J%%%%%%
$$ 89 89 89 89 89 89 89 89 89 89 88 88 88 88 88 88 89 88 88 88 88 88 88 88 88 88 88 88 88 89 88 87 87 88 88 88 88 89 89 88 88 88 88 88 89 89 88 87 87 88 88 88 87 87 87 87 88 88 86 86 86 87 87 87 88 88 88 88 88 88 88
3930H8%%J%%%%%j%%%%%j%%%%J%%%j%J%J%%%%%%%%%%%%%jjJ%%%%%%jJ%%%%%%%J%%j%%j%%%J
$$ 88 88 88 89 89 89 89 89 89 88 88 88 88 88 88 87 87 87 87 87 88 88 88 88 87 87 88 88 89 89 89 89 89 89 89 89 89 89 89 89 89 89 88 87 88 88 88 88 88 88 88 87 88 88 88 88 88 88 88 88 89 89 89 88 88 88 87 87 87 87 88
3922H8J%Jjj%%%J%%jj%%%%%%%%JJj%%J%%j%%%%j%jJ%J%%%j%%JJ%%Jjjj%%Jj%JJ%%%%%jJ%%
$$ 88 89 89 90 89 88 88 88 88 89 89 89 88 87 87 87 87 87 87 87 87 87 88 89 88 88 88 89 89 89 88 88 88 88 88 87 87 86 87 87 88 88 88 88 87 87 87 88 89 89 89 90 89 88 87 87 87 88 87 87 88 89 89 89 89 89 89 88 89 89 89
3915H9J%j%%%%%%%%%%%%j%%%j%%%%%%J%%%%%%j%%JJ%%j%%jJ%%%jJ%%Jj%%%%%j%%%%%j%J%%
$$ 89 90 90 89 89 89 89 89 89 89 89 89 89 89 89 89 88 88 88 88 87 87 87 87 87 87 87 88 88 88 88 88 88 88 87 87 87 88 89 89 89 88 88 88 87 88 88 88 88 87 88 88 88 89 88 88 88 88 88 88 87 87 87 87 87 87 86 86 87 87 87
3907H7%%%J%J%%j%%%%%%%%j%%J%%%%%%%%Jj%%%j%J%%%J%j%%%j%%%%J%%j%%J%%j%%%%%%J%%
$$ 87 87 87 87 88 88 89 89 89 88 88 88 88 88 88 88 88 88 87 87 87 88 88 88 88 88 88 88 88 88 89 88 88 88 88 87 87 88 88 88 88 89 89 88 88 88 88 87 87 87 87 87 88 88 88 87 87 87 88 88 88 87 87 87 87 87 87 87 88 88 88
3900H8%%%%Jj%%%%%J%%%%%%j%j%%%J%%%Jj%%%J%%%j%%j%jJJ%%%%j%%J%%J%%%j%%%J%%jjJ%
$$ 88 88 88 88 88 89 88 88 88 88 88 88 89 89 89 89 89 89 89 88 88 87 87 87 87 88 88 88 88 89 88 88 88 88 89 89 89 89 88 88 88 87 87 86 87 88 88 88 88 88 87 87 87 88 88 88 89 89 89 89 88 88 88 88 89 89 89 88 87 88 88
3893H8%%J%%%%%%%%%%j%%%%%j%%%J%%%j%%%%J%%j%J%Jjj%%J%%%%J%j%j%%jJ%%%%%%%%%%%%
$$ 88 88 88 89 89 89 89 89 89 89 89 89 89 89 88 88 88 88 88 88 87 87 87 87 88 88 88 88 87 87 87 87 87 88 88 88 87 87 88 88 89 88 87 87 87 88 88 88 88 88 89 89 88 88 87 87 87 86 87 87 87 87 87 87 87 87 87 87 87 87 87
3885H7%j%J%J%%%%%%%J%%%j%j%J%%jJ%%%%%j%%jJ%%%%%%%%%J%%j%j%JJ%%%J%%%%jjJ%j%%%
$$ 87 87 86 86 87 87 88 88 88 88 88 88 88 88 89 89 89 89 88 88 87 87 88 88 88 87 88 88 88 88 88 88 87 87 87 86 87 87 87 87 87 87 87 87 87 87 88 88 88 87 87 86 86 87 88 88 88 88 89 89 89 89 89 88 87 88 88 87 87 87 87
3878H7%%%%%%%J%%%%%j%%%JJj%%%%j%%J%J%%%%jj%J%J%Jj%jj%%J%%JJj%%j%%j%%%%J%%%%%
$$ 87 87 87 87 87 87 87 87 88 88 88 88 88 88 87 87 87 87 88 89 88 88 88 88 88 87 87 87 88 88 89 89 89 89 89 88 87 87 88 88 89 89 90 89 89 88 87 87 87 88 88 88 89 90 89 89 89 88 88 88 87 87 87 87 87 88 88 88 88 88 88
3870H8%jJ%%%%%%%%j%J%%%%%%%%%%%%%%%j%%jJ%%J%%%%j%%%j%J%%%%%%%jJ%j%%%%%%J%%%%
$$ 88 88 87 88 88 88 88 88 88 88 88 88 87 87 88 88 88 88 88 88 88 88 88 88 88 88 88 88 88 88 87 87 87 86 87 87 87 88 88 88 88 88 87 87 87 87 86 86 87 87 87 87 87 87 87 87 86 87 87 86 86 86 86 86 86 86 87 87 87 87 87
3863H7jJ%%%%%%%%%Jj%Jj%%J%%J%j%j%J%%j%%%jJ%J%%%%J%%%%%Jj%jj%J%%%j%%%J%Jj%%%%
$$ 87 86 87 87 87 87 87 87 87 87 87 87 88 87 87 88 87 87 87 88 88 88 89 89 88 88 87 87 88 88 88 87 87 87 87 86 87 87 88 88 88 88 88 89 89 89 89 89 89 90 89 89 88 87 87 88 88 88 88 87 87 87 87 88 88 89 88 88 88 88 88
3855H8%j%%J%%%J%%j%%J%%%%%%%j%%%JjJJ%%j%J%%%%j%%%%%%Jj%j%%J%jj%%%%%%%%J%%%%%
$$ 88 88 87 87 87 88 88 88 88 89 89 89 88 88 88 89 89 89 89 89 89 89 89 88 88 88 88 89 88 89 90 90 90 89 89 90 90 90 90 90 89 89 89 89 89 89 89 90 89 89 88 88 88 89 89 88 87 87 87 87 87 87 87 87 87 88 88 88 88 88 88
3848H8%j%%%J%J%%%%%%%%%j%%j%%%%%%%%%J%%J%%%Jj%%%%j%%%J%jj%%%jj%J%J%%%%%%%JJj
$$ 88 88 87 87 87 87 88 88 89 89 89 89 89 89 89 89 89 89 88 88 88 87 87 87 87 87 87 87 87 87 87 88 88 88 89 89 89 89 90 89 89 89 89 89 88 88 88 88 89 89 88 87 87 87 87 86 85 85 86 86 87 87 87 87 87 87 87 87 88 89 88
3841H8%J%%%jj%%%%%j%Jj%%%%J%j%%%%JJ%%%%j%%%J%%%%%j%%j%%j%%JK%%j%%%jJ%%%J%%%%
$$ 88 88 89 89 89 89 88 87 87 87 87 87 87 86 86 87 86 86 86 86 86 87 87 86 86 86 86 86 87 88 88 88 88 88 87 87 87 87 88 88 88 88 88 88 87 87 87 86 86 86 85 85 85 86 88 88 88 87 87 87 87 86 87 87 87 87 88 88 88 88 88
3833H8%%%%%%%%%%%%%%%%%jjJ%%%J%%jJ%%j%%%%%%%%%j%%J%%%%Jj%jJ%%Jj%%%J%%j%j%J%J
$$ 88 88 88 88 88 88 88 88 88 88 88 88 88 88 88 88 88 88 87 86 87 87 87 87 88 88 88 87 88 88 88 87 87 87 87 87 87 87 87 87 87 86 86 86 87 87 87 87 87 88 87 87 86 87 87 87 88 87 87 87 87 88 88 88 87 87 86 86 87 87 88
3826H8%j%%j%%%%J%%%%%%j%%%%%%%JJ%%%%%j%%Jj%jj%%J%J%Jj%%j%J%%%%%%J%J%jjj%K%j%
$$ 88 88 87 87 87 86 86 86 86 86 87 87 87 87 87 87 87 86 86 86 86 86 86 86 86 87 88 88 88 88 88 88 87 87 87 88 87 87 86 85 85 85 86 86 87 87 88 87 87 87 86 86 87 87 87 87 87 87 87 88 88 89 89 88 87 86 86 88 88 87 87
3818H7%j%%%%%%%%J%%%%JjjjJJJ%j%%%%%%J%%%%k%%J%%jJ%%%%%%%Jjj%J%%%%%%%J%j%J%%j
$$ 87 87 86 86 86 86 86 86 86 86 86 87 87 87 87 87 88 87 86 85 86 87 88 88 87 87 87 87 87 87 87 88 88 88 88 88 86 86 86 87 87 87 86 87 87 87 87 87 87 87 87 88 87 86 86 87 87 87 87 87 87 87 87 88 88 87 87 88 88 88 87
3811H7%%J%Jkj%J%%%%%%%%%%%%%J%%%j%j%%%%%%%%J%%%%%%Jj%%%%%J%J%j%J%%JjjjJ%jj%%
$$ 87 87 87 88 88 89 87 86 86 87 87 87 87 87 87 87 87 87 87 87 87 87 87 88 88 88 88 87 87 86 86 86 86 86 86 86 86 86 87 87 87 87 87 87 87 88 87 87 87 87 87 87 88 88 89 89 88 88 89 89 89 90 89 88 87 88 88 87 86 86 86
3804H6%%J%%%%%%jJ%%%%%Jjj%J%%%%%%j%Jj%J%%%%jJ%%%J%jj%%JJ%j%%jJ%J%%%%%j%%%J%%
$$ 86 86 86 87 87 87 87 87 87 87 86 87 87 87 87 87 87 88 87 86 86 87 87 87 87 87 87 87 86 86 87 86 86 87 87 87 87 87 86 87 87 87 87 88 88 87 86 86 86 87 88 88 87 87 87 86 87 87 88 88 88 88 88 88 87 87 87 87 88 88 88
3796H8%jjJ%%%%j%j%J%%J%%j%%%%%%%J%%%%j%%%%%%%%%%%%%%%%%J%%%%%%%%J%%%%%%%%%%%
$$ 88 88 87 86 87 87 87 87 87 86 86 85 85 86 86 86 87 87 87 86 86 86 86 86 86 86 86 87 87 87 87 87 86 86 86 86 86 86 86 86 86 86 86 86 86 86 86 86 86 86 87 87 87 87 87 87 87 87 87 88 88 88 88 88 88 88 88 88 88 88 88
3789H8jjjJ%j%%%%%JJ%J%%j%%%jjJJ%%%%J%%%j%%%J%%J%j%%%%%%%%%%%j%%%%%%%%%J%%jjj
$$ 88 87 86 85 86 86 85 85 85 85 85 85 86 87 87 88 88 88 87 87 87 87 86 85 86 87 87 87 87 87 88 88 88 88 87 87 87 87 88 88 88 89 89 88 88 88 88 88 88 88 88 88 88 88 88 87 87 87 87 87 87 87 87 87 87 88 88 88 87 86 85
3781H5J%%%%%J%%jJ%%%j%J%%%Jj%j%%J%j%%J%%%%%%%%%%%%%j%%%j%%%%%%%%J%%%%%%J%%%j
$$ 85 86 86 86 86 86 86 87 87 87 86 87 87 87 87 86 86 87 87 87 87 88 87 87 86 86 86 87 87 86 86 86 87 87 87 87 87 87 87 87 87 87 87 87 87 87 86 86 86 86 85 85 85 85 85 85 85 85 85 86 86 86 86 86 86 86 87 87 87 87 86
3774H6%%j%%J%%%%%%%%%j%%%%%JJ%jJJ%j%%j%%j%%%%J%J%%%j%J%%%j%%%%%%%%j%%JJ%%%%j
$$ 86 86 86 85 85 85 86 86 86 86 86 86 86 86 86 86 85 85 85 85 85 85 86 87 87 86 87 88 88 87 87 87 86 86 86 85 85 85 85 85 86 86 87 87 87 87 86 86 87 87 87 87 86 86 86 86 86 86 86 86 86 85 85 85 86 87 87 87 87 87 86
3766H6%%jJ%%%J%Jj%%%J%%%%%j%%%%%J%%%%%j%%j%jjJJ%Jjj%%%%J%%%%%%J%Jj%%%%%%%%%j
$$ 86 86 86 85 86 86 86 86 87 87 88 87 87 87 87 88 88 88 88 88 88 87 87 87 87 87 87 88 88 88 88 88 88 87 87 87 86 86 85 84 85 86 86 87 86 85 85 85 85 85 86 86 86 86 86 86 86 87 87 88 87 87 87 87 87 87 87 87 87 87 86
3759H6%J%j%%jJ%JJj%%%jj%%J%jJ%J%%%J%%%%j%j%%%%%%%%%%%%%J%%%%%%%%j%J%J%%Jj%%%
$$ 86 86 87 87 86 86 86 85 86 86 87 88 87 87 87 87 86 85 85 85 86 86 85 86 86 87 87 87 87 88 88 88 88 88 87 87 86 86 86 86 86 86 86 86 86 86 86 86 86 86 87 87 87 87 87 87 87 87 87 86 86 87 87 88 88 88 89 88 88 88 88
3752H8%%%%%j%j%%jJ%%%%%J%%%%%%j%%%%J%%j%%J%%%%jJ%%J%%jj%%J%jJ%j%j%%J%%%%%%%%
$$ 88 88 88 88 88 88 87 87 86 86 86 85 86 86 86 86 86 86 87 87 87 87 87 87 87 86 86 86 86 86 87 87 87 86 86 86 87 87 87 87 87 86 87 87 87 88 88 88 87 86 86 86 87 87 86 87 87 86 86 85 85 85 86 86 86 86 86 86 86 86 86
3744H6j%JJj%J%%j%%%%%%%%JjJJ%%%jJ%%J%jj%%%%%j%%%%%%%%%%%%jJ%J%J%%jj%%%%J%%%%
$$ 86 85 85 86 87 86 86 87 87 87 86 86 86 86 86 86 86 86 86 87 86 87 88 88 88 88 87 88 88 88 89 89 88 87 87 87 87 87 87 86 86 86 86 86 86 86 86 86 86 86 86 86 85 86 86 87 87 88 88 88 87 86 86 86 86 86 87 87 87 87 87
3737H7%%j%%%%J%J%%j%%J%%Jjj%j%J%%%%J%%j%J%%%j%J%%%j%%J%%%J%%j%jjJ%%j%%jJ%J%j
$$ 87 87 87 86 86 86 86 86 87 87 88 88 88 87 87 87 88 88 88 89 88 87 87 86 86 87 87 87 87 87 88 88 88 87 87 88 88 88 88 87 87 88 88 88 88 87 87 87 88 88 88 88 89 89 89 88 88 87 86 87 87 87 86 86 86 85 86 86 87 87 86
3729H6%%%%%J%%%%J%%%jj%%%%%JJ%j%%jJ%%%j%%%J%J%J%%%j%j%%%%%%J%%j%%%%%J%Jjjj%%
$$ 86 86 86 86 86 86 87 87 87 87 87 88 88 88 88 87 86 86 86 86 86 86 87 88 88 87 87 87 86 87 87 87 87 86 86 86 86 87 87 88 88 89 89 89 89 88 88 87 87 87 87 87 87 87 88 88 88 87 87 87 87 87 87 88 88 89 88 87 86 86 86
3722H6jJ%%J%%%J%%%%%j%%%%%Jj%%%%%%%%jjJ%J%J%%%%j%jjJ%%%J%JJ%%j%J%J%%j%j%%j%%
$$ 86 85 86 86 86 87 87 87 87 88 88 88 88 88 88 87 87 87 87 87 87 88 87 87 87 87 87 87 87 87 87 86 85 86 86 87 87 88 88 88 88 88 87 87 86 85 86 86 86 86 87 87 88 89 89 89 88 88 89 89 90 90 90 89 89 88 88 88 87 87 87
3715H7%%J%j%%J%j%%J%%%Jj%%%%J%%jJJ%j%%%%%J%J%%J%%%%%jj%j%%%%J%%j%%j%%JJj%jJ%
$$ 87 87 87 88 88 87 87 87 88 88 87 87 87 88 88 88 88 89 88 88 88 88 88 89 89 89 88 89 90 90 89 89 89 89 89 89 90 90 91 91 91 92 92 92 92 92 92 91 90 90 89 89 89 89 89 90 90 90 89 89 89 88 88 88 89 90 89 89 88 89 89
3707H9%%J%j%%%%%%%J%%j%j%%%%%%J%%%JJ%j%j%J%%%%%%JJj%%%j%%%J%j%%J%%j%%%j%%%%%
$$ 89 89 89 90 90 89 89 89 89 89 89 89 89 90 90 90 89 89 88 88 88 88 88 88 88 89 89 89 89 90 91 91 90 90 89 89 90 90 90 90 90 90 90 91 92 91 91 91 91 90 90 90 90 91 91 90 90 90 91 91 91 90 90 90 90 89 89 89 89 89 89
3700H9%%%JJ%%%%%Jj%%J%%J%%J%j%j%%%%%%%J%%%%%J%%%%%%%Jj%%%%%%%Jjj%%%%j%JJJ%%%
$$ 89 89 89 89 90 91 91 91 91 91 91 92 91 91 91 92 92 92 93 93 93 94 94 93 93 92 92 92 92 92 92 92 92 93 93 93 93 93 93 94 94 94 94 94 94 94 94 95 94 94 94 94 94 94 94 94 95 94 93 93 93 93 93 92 92 93 94 95 95 95 95
3692I5%j%JJ%%%%%%%%J%%%%%%%%jJ%%%J%%%%%J%J%j%%%%%%J%%JJJ%J%j%%JJ%%J%%%%JJJJ%
$$ 95 95 94 94 95 96 96 96 96 96 96 96 96 96 97 97 97 97 97 97 97 97 97 96 97 97 97 97 98 98 98 98 98 98 99 99 100 100 99 99 99 99 99 99 99 100 100 100 101 102 103 103 104 104 103 103 103 104 105 105 105 106 106 106 106 106 107 108 109 110 110
3685A10%%JJJJ%JJ%JJJJ%JJJJJKJJ%JJJKJJJKJJKJJLKKLLKKLLLKMLMNMNMNOPOPQQQJ0J0J0
$$ 110 110 110 111 112 113 114 114 115 116 116 117 118 119 120 120 121 122 123 124 125 127 128 129 129 130 131 132 134 135 136 137 139 140 141 143 144 145 148 150 152 155 158 160 162 165 168 171 173 177 180 184 189 193 198 202 207 213 220 226 233 241 249 257 267 277 287
3678B87J2J2J4J5J5J6J7J8J8J9K0K0K0K1K1K0K0J9J8J8J6J4J4J2J1J1RQQPNONMLLLKKK%Jj
$$ 287 299 311 325 340 355 371 388 406 424 443 463 483 503 524 545 565 585 604 622 640 656 670 684 696 707 718 727 735 743 750 755 761 766 770 773 776 779 781 783 785 785 786 785
3673G85%jkkllmonqqqj0j1j2j3j4j6j6j7j6j7j8j7j9j9j9j9j7j7j6j7j6j5j5j4j3j2j2j2j2
$$ 785 785 784 782 780 777 774 770 764 759 751 743 735 725 714 702 689 675 659 643 626 610 593 575 558 539 520 501 482 465 448 432 415 399 384 369 355 342 330 318 306 294
3669B94j0j0rrqqppnonnnnmnmmmlkmljklklkklkjkkkkjjjjjkj%%kj%jjk%jjj%j%j%j%j%%j
$$ 294 284 274 265 256 248 240 233 226 221 215 210 205 200 195 191 186 182 178 174 171 169 165 162 161 159 156 154 151 149 147 144 142 141 139 137 135 133 132 131 130 129 128 126 125 125 125 123 122 122 121 120 118 118 117 116 115 115 114 114 113 113 112 112 111 111 111 110
3662A10%%%j%%j%%j%%jj%j%%%%%%%%%j%j%%j%%j%%j%%%%%%%j%%j%%%jj%%j%J%%%%%%jJ%%j
$$ 110 110 110 110 109 109 109 108 108 108 107 107 107 106 105 105 104 104 104 104 104 104 104 104 104 104 103 103 102 102 102 101 101 101 100 100 100 99 99 99 99 99 99 99 99 98 98 98 97 97 97 97 96 95 95 95 94 94 95 95 95 95 95 95 95 94 95 95 95 94
3655I4%j%%%%%%%%jjJ%%%%%j%j%%%%%j%J%%%%%%j%%%%%J%%jj%J%jJ%J%%jjJJj%%%Jj%%%%%
$$ 94 94 93 93 93 93 93 93 93 93 93 92 91 92 92 92 92 92 92 91 91 90 90 90 90 90 90 89 89 90 90 90 90 90 90 90 89 89 89 89 89 89 90 90 90 89 88 88 89 89 88 89 89 90 90 90 89 88 89 90 89 89 89 89 90 89 89 89 89 89 89
3647H9%%%%j%j%J%%%j%%K%%%%%j%%J%j%%%jJ%Jj%%%J%j%%%%J%jj%%J%%J%jJ%%%%j%%%j%%%
$$ 89 89 89 89 89 88 88 87 87 88 88 88 88 87 87 87 89 89 89 89 89 89 88 88 88 89 89 88 88 88 88 87 88 88 89 88 88 88 88 89 89 88 88 88 88 88 89 89 88 87 87 87 88 88 88 89 89 88 89 89 89 89 89 88 88 88 88 87 87 87 87
3640H7J%%j%%J%%jJ%%j%%%%%Jj%j%%%%%%jj%%%J%J%%%%j%J%J%%%%%J%%%j%%%%%%j%j%%Jj%
$$ 87 88 88 88 87 87 87 88 88 88 87 88 88 88 87 87 87 87 87 87 88 87 87 86 86 86 86 86 86 86 85 84 84 84 84 85 85 86 86 86 86 86 85 85 86 86 87 87 87 87 87 87 88 88 88 88 87 87 87 87 87 87 87 86 86 85 85 85 86 85 85
3632H5%JJ%%%%j%%JJ%%j%j%JJ%j%%Jj%j%%%%%j%J%%Jjj%J%%%%%%%%%%%%%%%J%%%j%J%jj%J
$$ 85 85 86 87 87 87 87 87 86 86 86 87 88 88 88 87 87 86 86 87 88 88 87 87 87 88 87 87 86 86 86 86 86 86 85 85 86 86 86 87 86 85 85 86 86 86 86 86 86 86 86 86 86 86 86 86 86 86 86 87 87 87 87 86 86 87 87 86 85 85 86
3625H6%%j%%%%J%%%%J%%%j%%j%%%%%%%%%%%%%%%%%%%%%%JjjJ%J%%%%j%%%%%jJ%%JjjJ%j%%
$$ 86 86 86 85 85 85 85 85 86 86 86 86 86 87 87 87 87 86 86 86 85 85 85 85 85 85 85 85 85 85 85 85 85 85 85 85 85 85 85 85 85 85 85 86 85 84 85 85 86 86 86 86 86 85 85 85 85 85 85 84 85 85 85 86 85 84 85 85 84 84 84
3618H4J%%%JjJ%%j%J%j%%j%%%%J%%%%%J%%j%jJ%J%%%J%j%j%%%%%%%%%%%%%%%%j%%%j%JJ%J
$$ 84 85 85 85 85 86 85 86 86 86 85 85 86 86 85 85 85 84 84 84 84 84 85 85 85 85 85 85 86 86 86 85 85 84 85 85 86 86 86 86 87 87 86 86 85 85 85 85 85 85 85 85 85 85 85 85 85 85 85 85 85 84 84 84 84 83 83 84 85 85 86
3610H6%%%%%%%%%%%j%%%%%j%%%J%%%%%jjJJ%%%%%%%Jj%%%j%%%%%%jJ%%K%%%j%%J%j%%j%%%
$$ 86 86 86 86 86 86 86 86 86 86 86 86 85 85 85 85 85 85 84 84 84 84 85 85 85 85 85 85 84 83 84 85 85 85 85 85 85 85 85 86 85 85 85 85 84 84 84 84 84 84 84 83 84 84 84 86 86 86 86 85 85 85 86 86 85 85 85 84 84 84 84
3603H4%%%%%J%%J%j%%J%j%%%%JjjJ%%j%j%%%J%%j%JJJJjj%%%%%%%%J%%j%J%%%%j%%%j%%%%
$$ 84 84 84 84 84 84 85 85 85 86 86 85 85 85 86 86 85 85 85 85 85 86 85 84 85 85 85 84 84 83 83 83 83 84 84 84 83 83 84 85 86 87 86 85 85 85 85 85 85 85 85 85 86 86 86 85 85 86 86 86 86 86 85 85 85 85 84 84 84 84 84
3595H4%J%%%%%%j%%%%j%%J%JJj%%%%j%%%J%%j%%%%%J%%jJ%%%Jj%%j%%J%%%Jjk%%%J%%%J%%
$$ 84 84 85 85 85 85 85 85 85 84 84 84 84 84 83 83 83 84 84 85 86 85 85 85 85 85 84 84 84 84 85 85 85 84 84 84 84 84 84 85 85 85 84 85 85 85 85 86 85 85 85 84 84 84 85 85 85 85 86 85 83 83 83 83 84 84 84 84 85 85 85
3588H5%%%%%J%j%%%%%%j%%%%%%%j%%%%%J%%J%%%%%j%%%%J%Jj%%jJ%%%%%j%%%%J%jJj%%%%%
$$ 85 85 85 85 85 85 86 86 85 85 85 85 85 85 85 84 84 84 84 84 84 84 84 83 83 83 83 83 83 84 84 84 85 85 85 85 85 85 84 84 84 84 84 85 85 86 85 85 85 84 85 85 85 85 85 85 84 84 84 84 84 85 85 84 85 84 84 84 84 84 84
$$ [...]
-2638F9
##END=		$$ NMR SPECTRUM
##END=		$$ LINK
