##TITLE=	nHAvKRiiTVOGhmUZzVzf0Q.21.fid
##JCAMP-DX=	6.0	$$ MestReNova 14.3.3-33362
##DATA TYPE=	LINK
##BLOCKS=	1    
##ORIGIN=	Mestrelab Research S.L.
##OWNER=	hrzepa
##$MNOVA/METADATA=	(DOCUMENT,BASE64)
eyJuYW1lIjoiL1VzZXJzL2hyemVwYS9MaWJyYXJ5L01vYmlsZSBEb2N1bWVudHMvY29tfmFwcGxlfkN
sb3VkRG9jcy9TaGVwcGFyZC9OTVIgZmlsZXMgemlwcy0yL0Jvcm94aW5lIC0gYW1pbmUgYWRkdWN0cy
8zNi8zNi1CLzM2LUIubW5vdmEiLCJwYWdlcyI6W3siaXRlbXMiOlsiMSIgICAgIF19XX0=
##TITLE=	nHAvKRiiTVOGhmUZzVzf0Q.21.fid
##JCAMP-DX=	6.0	$$ MestReNova 14.3.3-33362
##DATA TYPE=	NMR SPECTRUM
##DATA CLASS=	XYDATA
##BLOCK_ID=	1
##ORIGIN=	Bruker BioSpin GmbH
##OWNER=	root
##NUMDIM=	1
##$MNOVA/METADATA=	(ITEM,BASE64)
eyJhbmdsZSI6MCwiYXhlcyI6eyJ4Ijp7Im1heCI6MjA1LjAwMDY5OTk5ODk5MDY4LCJtaW4iOi0yMDQ
uOTk3NTgxNzgyNjk0NjJ9LCJ5Ijp7Im1heCI6MTIyMDA2Ljk4MTQ0NTMxMjUsIm1pbiI6LTE3NzYwLj
Q2ODI2MTcxODc1fX0sInBvaW50cyI6W3sieCI6NTMyMSwieSI6NTgzNX0seyJ4Ijo4NzIyLCJ5Ijo1O
DM1fSx7IngiOjg3MjIsInkiOjgyMDh9LHsieCI6NTMyMSwieSI6ODIwOH0seyJ4Ijo1MzIxLCJ5Ijo1
ODM1fV0sInoiOjB9
##.OBSERVE FREQUENCY=	160.46157916600000704
##.OBSERVE NUCLEUS=	^11B
##.SOLVENT NAME=	CDCl3
##.PULSE SEQUENCE=	zgbs
##LONGDATE=	2024/03/20 16:55:21.000
##.ACQUISITIONMODE=	SIMULTANEOUS (DQD)
##$ORIGINAL FORMAT=	Bruker XWIN-NMR
##$MNOVA/SCALES_VERSION=	9
##$PARAMETER FILE=	(acqus, ASCII, /private/var/folders/f6/rjf_tdyn2v98c5c0wvkgn4s80000gq/T/nHAvKRiiTVOGhmUZzVzf0Q/21/acqus, 0)
$$ ##TITLE= Parameter file, TopSpin 4.1.3
$$ ##JCAMPDX= 5.0
$$ ##DATATYPE= Parameter Values
$$ ##NPOINTS= 1	$$ modification sequence number
$$ ##ORIGIN= Bruker BioSpin GmbH
$$ ##OWNER= root
$$ $$ 2024-03-20 16:55:23.999 +0000  root@CZC036BXXF
$$ $$ Z:/500/data/tds/nmr/RP476/21/acqus
$$ $$ process C:\Bruker\TopSpin4.1.3\prog\mod\dirdata.exe
$$ ##$ACQT0= 0
$$ ##$AMP= (0..31)
$$ 100 100 100 100 100 100 100 100 100 100 100 100 100 100 100 100 100 100
$$ 100 100 100 100 100 100 100 100 100 100 100 100 100 100
$$ ##$AMPCOIL= (0..32)
$$ -1 0 0 0 0 0 0 0 0 0 0 0 0 0 0 0 0 0 0 0 0 0 0 0 0 0 0 0 0 0 0 0 0
$$ ##$AQSEQ= 0
$$ ##$AQ_mod= 3
$$ ##$AUNM= <au_zg>
$$ ##$AUTOPOS= <47 >
$$ ##$BF1= 160.461579166
$$ ##$BF2= 160.461579166
$$ ##$BF3= 160.461579166
$$ ##$BF4= 160.461579166
$$ ##$BF5= 160.461579166
$$ ##$BF6= 160.461579166
$$ ##$BF7= 160.461579166
$$ ##$BF8= 160.461579166
$$ ##$BWFAC= (0..63)
$$ 0 0 0 0 0 0 0 0 0 0 0 0 0 0 0 0 0 0 0 0 0 0 0 0 0 0 0 0 0 0 0 0 0 0 0 0
$$ 0 0 0 0 0 0 0 0 0 0 0 0 0 0 0 0 0 0 0 0 0 0 0 0 0 0 0 0
$$ ##$BYTORDA= 0
$$ ##$CHANFCU= (0..24)
$$ 0 0 1 0 0 0 0 0 0 0 0 0 0 0 0 0 0 0 0 0 0 0 0 0 0
$$ ##$CHANREC= (0..24)
$$ 0 0 1 0 0 0 0 0 0 0 0 0 0 0 0 0 0 0 0 0 0 0 0 0 0
$$ ##$CHEMSTR= <none>
$$ ##$CNST= (0..63)
$$ 1 1 1 1 1 1 1 1 1 1 1 1 1 1 1 1 1 1 1 1 1 1 1 1 1 1 1 1 1 1 1 1 1 1 1 1
$$ 1 1 1 1 1 1 1 1 1 1 1 1 1 1 1 1 1 1 1 1 1 1 1 1 1 1 1 1
$$ ##$CPDPRG= (0..8)
$$ <> <> <> <> <> <> <> <> <>
$$ ##$D= (0..63)
$$ 0 0.3 0 0 0 0 0 0 0 0 0 0 0 0 0 0 0.0002 0 0 0 0 0 0 0 0 0 0 0 0 0 0 0
$$ 0 0 0 0 0 0 0 0 0 0 0 0 0 0 0 0 0 0 0 0 0 0 0 0 0 0 0 0 0 0 0 0
$$ ##$DATE= 1710953721
$$ [...]
$$ 1 1 1 1 0 0 0 0 0 0 0 0 0 0 0 0 0 0 0 0 0 0 0 0 0 0 0 0
$$ ##$ShimPowRng3= (0..63)
$$ 1 1 1 1 1 1 1 1 1 1 1 1 1 1 1 1 1 1 1 1 1 1 1 1 1 1 1 1 1 1 1 1 1 1 1 1
$$ 1 1 1 1 0 0 0 0 0 0 0 0 0 0 0 0 0 0 0 0 0 0 0 0 0 0 0 0
$$ ##$ShimPowType1= 8
$$ ##$ShimPowType2= 8
$$ ##$ShimPowType3= 0
$$ ##$ShimPowType4= 0
$$ ##$ShimPowType5= 0
$$ ##$ShimPowType6= 0
$$ ##$ShimPowType7= 0
$$ ##$ShimPowType8= 0
$$ ##$ShimSysActGrad= (0..63)
$$ 1 2 3 4 13 5 7 11 10 9 6 8 12 18 19 20 21 15 22 23 24 14 25 16 26 17 27
$$ 28 31 32 33 34 35 36 37 38 0 0 0 0 0 0 0 0 0 0 0 0 0 0 0 0 0 0 0 0 0 0
$$ 0 0 0 0 0 0
$$ ##$ShimSysAngle= <>
$$ ##$ShimSysFunc= (0..63)
$$ 1 2 3 4 5 6 7 8 9 10 0 37 38 35 16 15 14 13 12 11 28 27 26 25 24 23 36
$$ 22 30 29 20 21 34 33 32 31 17 18 19 0 0 0 0 0 0 0 0 0 0 0 0 0 0 0 0 0 0
$$ 0 0 0 0 0 0 0
$$ ##$ShimSysMatId= <292722ba.dat>
$$ ##$ShimSysMatrix= 1
$$ ##$ShimSysMinMaxUG= 130000
$$ ##$ShimSysOffset= <58 mm>
$$ ##$ShimSysType= 4
$$ ##$ShimUnit= 3
$$ ##$SpectrOsVersion= <4.1.156.20210628>
$$ ##$TCubeEth= <192.168.180.18>
$$ ##$TCubeSeqDevice= <>
$$ ##$TOSITY= <no>
$$ ##$TRIPLO2= 0
$$ ##$TopSpinVersion= <TopSpin 4.1.3>
$$ ##$TrxFreqFormula= (0..23)
$$ <TrxFreqFormula(2.0,500130000.000000,'TRX',Trx(1.0,'TRX 1200.1',2,5.000000,1290.000000))>
$$ <TrxFreqFormula(2.0,500130000.000000,'TRX',Trx(1.0,'TRX 1200.2',2,5.000000,1290.000000))>
$$ <> <> <> <> <> <> <> <> <> <> <> <> <> <> <> <> <> <> <> <> <> <>
$$ ##$TrxPN= (0..23)
$$ <Z148391> <Z148391> <> <> <> <> <> <> <> <> <> <> <> <> <> <> <> <> <>
$$ <> <> <> <> <>
$$ ##$TrxSN= (0..23)
$$ <05365> <05364> <> <> <> <> <> <> <> <> <> <> <> <> <> <> <> <> <> <> <>
$$ <> <> <>
$$ ##$VCubeEth= (0..23)
$$ <no> <no> <no> <no> <no> <no> <no> <no> <no> <no> <no> <no> <no> <no> <no>
$$ <no> <no> <no> <no> <no> <no> <no> <no> <no>
$$ ##$VTU= 2
$$ ##$VTUETH= <192.168.99.10>
$$ ##$VTUTY= <no>
$$ ##$ValueLine= no
$$ ##$VpuPN= (0..23)
$$ <no> <no> <no> <no> <no> <no> <no> <no> <no> <no> <no> <no> <no> <no> <no>
$$ <no> <no> <no> <no> <no> <no> <no> <no> <no>
$$ ##$VpuSN= (0..23)
$$ <no> <no> <no> <no> <no> <no> <no> <no> <no> <no> <no> <no> <no> <no> <no>
$$ <no> <no> <no> <no> <no> <no> <no> <no> <no>
$$ ##$WBREFAM= (0..31)
$$ 99.9 100 100 100 100 100 100 100 100 100 100 100 100 100 100 100 100 100
$$ 100 100 100 100 100 100 100 100 100 100 100 100 100 100
$$ ##$WBREFLM= (0..31)
$$ 2 0 0 0 0 0 0 0 0 0 0 0 0 0 0 0 0 0 0 0 0 0 0 0 0 0 0 0 0 0 0 0
$$ ##$WBREFPH= (0..31)
$$ 0.91 0 0 0 0 0 0 0 0 0 0 0 0 0 0 0 0 0 0 0 0 0 0 0 0 0 0 0 0 0 0 0
$$ ##$WBSGU= (0..31)
$$ 1 1 2 0 0 0 0 0 0 0 0 0 0 0 0 0 0 0 0 0 0 0 0 0 0 0 0 0 0 0 0 0
$$ ##END=
$$ 
##$DECIM=	304
##$DSPFVS=	20
##XUNITS=	HZ
##YUNITS=	ARBITRARY UNITS
##FIRSTX=	32894.736052135405771
##LASTX=	-32894.235698224358202
##DELTAX=	-0.50193385074013141534
##XFACTOR=	1
##YFACTOR=	3.3817569887386698113
##FIRSTY=	952.81591796875
##MINY=	-7027.31494140625
##MAXY=	110810.03125
##NPOINTS=	131072
##XYDATA=	(X++(Y..Y))
$$ [...]
7715i7M54k25j22j22l42L36J20J20J37J37j55n62j04N75J08J09n3n3k3k2o5o4J13n66l87K0
7702g33j24K84O22K16M57N0l32L47L34L34k34k35k55k56p8p7o2m70o22N6J93J92M39M38J50
7689F34J50J50J50K78K77m70m69j15j16j15j15L60L60l87l87O3O3O3O3j7j8K96K97J5l93p74
7676a57r6L97j0p8p9K72K72k04k03Q0Q1Q1Q1m96m95J16J15j26j26j26j26K83K84K83K84J13
7663D20J14J14J13j57j58j57j57N17N17n01n01N9N9N9N9J7J6J7J6k20k21J19J19j57j57M7
7650dM7m48m47K7K8J89J89j08j08j32N47J91k17J49J48J23J23j77j76j51j51j72K35Q72M65
7637A042k96J12j42j42J92J93j46j47Q9Q9k51k51k08k08nmR0Q9j14j14j05j05L69L70L66L66
7624A129K6K6n34n34j52K55K18K18J59k49m44l6O85K78l49l48k89J18J19k89J69J69K0J9L33
$$ y = [-97, 357, 132, 10, -112, -454, -118, 2, 122, 259, 396, 241, -321, -425, 150, 258, 367, 314, 261, 238, 216, 151, 87, 200, -366, -753, -733, -857, -573, 49, 265, 722, 772, 440, 787, 1121, 1455, 1221, 986, 731, 475, 397, 320, 258, -212, -834, -778, -585, -393, 46, 484, 634, 784, 934, 1084, 1362, 1639, 1169, 700, 585, 469, 354, 239, 599, 959, 572, 185, 248, 311, 374, 437, 420, 402, 698, 995, 1010, 617, -157, -253, 144, 134, 56, -23, 249, 521, 317, 114, 194, 275, 356, 437, -59, -554, -438, -323, -449, -575, -701, -827, -544, -260, 23, 307, 420, 534, 648, 761, 604, 446, 289, 132, 649, 1166, 665, 164, 223, 282, 341, 400, 417, 433, 450, 466, 246, 25, 144, 263, 106, -51, -4, 43, -405, -852, -825, -797, -608, -419, -527, -635, -767, -220, -29, -246, -97, 51, 174, 297, 120, -56, -207, -358, -530, -295, 577, 1042, 746, 858, 716, 574, 766, 959, 813, 666, 755, 844, 593, 342, 134, -74, -79, -83, 7, 96, -18, -132, -237, -342, 27, 397, 763, 1129, 1155, 1181, 647, 113, -39, 216, 434, 652, 811, 562, 118, 82, 767, 1045, 696, 348, 59, 177, 296, 7, 176, 345, 365, 384, 717]
7612G17L33K99j08m90m90M6M7K50K51j95j96j95j95o8o7J36J36j69j70J71J70J06J07J06J07
7599F39j57j56M7M7j46j47j46j46J72J72J73J72J76J76J77J76n53n54N8N7K16K15L8L7j58
7587E85K49M6l62k73k74n3L55l2l2J72J72K05k04K6K6l7l8l8l7k4k4KJp0L37Q2Q2k80o88J6
7572a10O96K84j23K16O24J61n18l15l14k25k25nM03K9l79j24j24M92M91k30k30o17k08J56
7560a95k52j66K41L00L01K10j97n12j03j30K78O44K35K82K81m66m66l08R9J24k83l48O0J45
7548b26J45M12M12l09l09r2L16K90K90k02k02M4M51J79J78%%R3R4J44k63o84k76n5n5J32J31
7534F38J32J31j24j25l53N3k09k10J56J56P9P9r9r9k05K02J51J52K73j33R6R5m0m0m0m1l50
7520C25l50J26N33K61m18p32n3K26K25M98R0l90l90L32L32L53L53j48j47K25j81n22j13J69
$$ y = [717, 1050, 1349, 1241, 751, 261, 307, 354, 604, 855, 660, 464, 269, 74, 6, -61, 75, 211, 42, -128, 43, 213, 319, 426, 532, 639, 482, 326, 373, 420, 274, 127, -19, -165, 7, 179, 352, 524, 700, 876, 1053, 1229, 676, 122, 180, 237, 453, 668, 706, 743, 585, 834, 880, 518, 245, -29, -82, 273, 241, 209, 381, 553, 758, 554, 580, 606, 569, 531, 493, 456, 432, 408, 410, 411, 341, 678, 760, 842, 562, -126, -110, 586, 870, 747, 963, 1587, 1748, 1230, 915, 601, 376, 151, 146, 549, 578, 199, 75, -49, 443, 934, 704, 474, -143, -351, -195, -447, -613, -372, -72, 229, 439, 242, -270, -373, -503, -225, 419, 654, 936, 1217, 751, 285, -23, 76, 200, -83, -431, -371, -226, -81, 331, 743, 434, 125, 33, 349, 639, 929, 727, 525, 569, 1020, 1199, 1377, 1377, 1377, 1470, 1564, 1708, 1445, 761, 485, 430, 375, 507, 638, 770, 901, 777, 652, 299, 352, 143, -67, 89, 245, 324, 403, 304, 205, 0, 202, 353, 505, 778, 645, 741, 836, 796, 756, 716, 675, 325, -25, 101, 634, 895, 477, -255, -308, -82, 143, 641, 731, 341, -49, 283, 615, 968, 1321, 1173, 1026, 1251, 1070, 548, 435, 604]
7508F04J70l5l4Ql99l99Ql2l2poJ46J46k19k19N46J39k18k17q2L25O65K58o7o7m07m07k49
7494h1J57M04M04J5J4J4J4j98j99M13M13O5O5R1R0o01j94J0l98j85j86k36J71J24J24J50J50
7481F10J67J68j46j46n24j17Q7Q7M14k65o30M9J63k44K8K8K60K60j73K35K22K22K47K47l64
7468H85l65l65l65j44j44L31L31O4O4k34k33m20K59M46L8k2k2K0M28L34l45n06r8j85j84K74
7455a58j34J51J51J51J50l27Q0N72j07N9N9J6J6l6l5l6l6r9j00K40O48P9n99o00P9K96j11
7442C69l16l15j3j3L52L52k55J53N35j45k56J51J08k98n37n36J85J85J56J56J57J56r4r4L81
7429E24L82k72k72O8O8N9N9O0N9M9M8M9M9m14m14J97J97J03J03J03J04J28J29l47O1K05m74
7416F11m49K30K7K7j35j34K46K45K46K46m20m21k17k17K93K92Q9Q9J23J23q1q1k89k88q4q5
$$ y = [604, 774, 739, 705, 713, 314, -85, -77, -109, -141, -148, -154, -8, 138, -81, -300, 246, 385, 167, -50, -132, 193, 858, 1116, 1049, 982, 575, 168, -81, 76, 480, 884, 899, 913, 927, 941, 743, 544, 957, 1370, 1435, 1500, 1591, 1681, 1080, 886, 896, 498, 313, 127, -109, 62, 186, 310, 460, 610, 777, 945, 799, 653, 129, 12, 99, 186, 600, 335, -295, -246, -83, -327, -299, -271, -11, 249, 76, 311, 533, 755, 1002, 1249, 885, 520, 155, -210, -354, -498, -167, 164, 228, 292, 58, -175, -595, -336, 110, 148, 126, 104, 124, 552, 886, 541, 35, -63, -248, -432, -158, -292, -141, 10, 161, 311, -16, 64, 636, 529, 588, 647, 663, 679, 643, 608, 572, 536, 437, 337, 577, 1225, 1304, 705, 105, 184, 480, 369, 53, -262, -275, -288, 64, 416, 161, 314, 849, 704, 448, 599, 707, 409, -128, -664, -479, -294, -138, 18, 175, 331, 237, 143, 524, 906, 634, 362, 430, 498, 557, 616, 676, 735, 784, 832, 881, 930, 516, 102, 299, 496, 599, 702, 805, 909, 1037, 1166, 819, 880, 1085, 611, 162, 392, 419, 446, 311, 177, 423, 668, 914, 1160, 740, 319, 102, -115, 178, 470, 559, 648, 771, 894, 813, 732, 443, 155, 71, -14]
7403a4q0q0j48K59K89l90J7J8J61J62J62J61R8R7j06j06R3R3R4R3j48j47j74j73L66m1k37
7389C19M42L73l07j97j96m04LK32j75l82K5K29j78l91J7l4L73N56j22Q1Q1k20k21j6j7Q9Q8
7375D8Q9Q8J01J01J27J27k24J83J84k24j39j39L11L11o0n9j70n77j78j79J36J36Q4Q4j20j20
7362g9O10O10R3l16j64j65J4J4j64j65L9M0M5M5K48K49j21j20j21j20K05K05k4k4J12k96m1
7349F09m1r3L15k5m33L5L4RRo3o2K52K52j6m23k19J88M50M50k6k6k5m34j19K89K68j39k25
7335G91k24j65j64L9L9o8o9k72k71J65J65J65J66j28j28J87J86p6m84k6O53k9k9J3J3r2r3
7321B64J11J10k80k81N9N9J01J02k39k38L50L49J1J0J8J9j85j86k78k79p4p5J07J08J50J50
7308c7qO71O20l31j06j06J74J74k46k46m2m3NMMNQ2Q2j22j22J41J41N49j30m06LL41L42k86
$$ y = [-14, -94, -174, -322, -63, 226, -164, -147, -129, 32, 194, 356, 517, 615, 712, 606, 500, 593, 686, 780, 873, 725, 578, 404, 231, 597, 556, 319, 761, 1134, 827, 630, 434, 30, 33, 265, 90, -292, -267, -38, -216, -607, -590, -624, -251, 305, 183, 264, 345, 125, -96, -112, -129, -40, 48, 137, 225, 326, 427, 554, 681, 457, 640, 824, 600, 461, 322, 633, 944, 884, 825, 655, 78, -100, -279, -143, -7, 77, 161, 41, -79, 531, 1141, 1234, 918, 754, 589, 603, 617, 453, 288, 327, 367, 412, 457, 705, 954, 833, 713, 592, 472, 677, 882, 858, 834, 946, 650, 609, 568, 475, 790, 765, 332, 367, 401, 410, 419, 356, 294, 546, 798, 782, 359, 140, 328, 778, 1228, 1202, 1176, 1151, 717, 598, 887, 1155, 1016, 791, 567, 402, 238, 277, 316, 248, 179, -93, -364, -199, -34, 131, 297, 169, 41, 228, 414, 338, -146, -172, 481, 452, 423, 436, 449, 357, 264, 375, 485, 205, -76, -17, 42, 143, 245, 6, -232, 118, 467, 478, 488, 506, 525, 340, 154, -124, -403, -477, -552, -445, -337, -187, -37, -45, 626, 1246, 915, 809, 703, 877, 1051, 805, 559, 517, 474, 479, 483, 487, 492, 574, 656, 534, 412, 553, 694, 1243, 1113, 707, 710, 1051, 1393, 1107]
7294A107k86k87k86J83J84j56j57j43j43J96J96k14k15j1j0J25J25L29L28J7J6j87j88k6k6
7281D71J77J78k17k17K16K15K9o50o4o4q3q4K57K56Q3Q2k57k57JKKJK02K01lkJ60J61K28j79
7266H45m60K20J94m84j13j12j55j55O6O6j38j37J31J30p2p3J99J98K1K1n20j12N41N42p8p8
7253D87J25J26J05J05k35k34K15K15J64n14m64K15J05J05j16n23M5M6M07M07m3m3k21J86j28
7240E37n35j90K18k40k40L20L19J17J16j34j35M77M77l6l7l08R9L07l72o69k61K52K52j98
7228A36j98L56L55k55k55M36M36R7R7k45k45k19k20k61J45J20J21r6r5p0p0j47K61N7l50o
7215a15ol2l2OPOOj8j9k73J35L76l1K23K24l20l20L34P41k2k3K32j75l9l8k93k93p7m84k5
7200c45k6J06N14L09r7m46m46J82N90N45N44n85n84N01N02k45k45j77j77K6K7j2j2J92J93
$$ y = [1107, 821, 534, 248, 431, 615, 459, 302, 159, 16, 212, 408, 194, -21, -32, -42, 83, 208, 537, 865, 882, 898, 711, 523, 497, 471, 648, 826, 609, 392, 608, 823, 852, 202, 138, 74, -9, -93, 164, 420, 503, 585, 328, 71, 72, 74, 76, 77, 279, 480, 477, 475, 635, 796, 1024, 845, 385, 605, 799, 315, 202, 90, -65, -220, -154, -88, -226, -363, -232, -102, -174, -247, -48, 150, 171, 192, -328, -440, 101, 643, 565, 487, 612, 738, 843, 948, 713, 479, 694, 909, 1073, 559, 95, 310, 415, 520, 404, -119, -74, -28, 379, 786, 743, 700, 479, 665, 537, 2, -188, 30, -210, -450, -130, 189, 306, 422, 288, 153, 630, 1107, 1071, 1034, 726, 825, 1132, 760, 91, -170, 82, 334, 136, -62, 294, 649, 394, 139, 575, 1011, 1108, 1205, 960, 715, 496, 276, 15, 160, 280, 401, 305, 210, 140, 70, -77, 184, 241, -109, -115, -121, -153, -185, -179, -172, -166, -160, -178, -197, -470, -335, 41, 10, 233, 457, 137, -183, 151, 892, 870, 847, 1079, 904, 865, 827, 534, 241, 164, -320, -345, -371, -265, 249, 558, 461, 15, -431, -249, 341, 886, 1430, 845, 261, 762, 1264, 1019, 774, 597, 420, 446, 473, 461, 449, 641, 834]
7188H34P6P7P7P7l26l26J3J3p1p2r7L10K43K42j14n21k66k66R1M98J03J04Q6Q7L68l10m97
7174D33r0j66j66l95J2M25J7k98J11j49j48l44L35N17j62l07J01M5M6P1P1K3K3K01K01L12
7161G19r6m61M90N27m24k62J45j01j02j60n68p7L31L3L4J94m84n10J70P04K97O7O8j3m21k42
7148a42J65K50j57L0l78n73J05L10L10N60N60M2l65l65l65J27N35q6q6J43J43j41j42j41j41
7135A98j15j15j99M79N77j02l82K6j81j80O17O17l41O5K19m61j14j13j56j56Q1Q2Q1Q2j76
7123C33j77j76j76P4P4M14M13p0p0p0p0J88J89J89J89k20k21o27N1O08K00mmj7j8j7j8J65
7109A132J65l9l8n58n59J89J89O2O1M01M02k71k71m15m14l01O51K94l86N2N2N2N2m70K09O08
7096H49l42o27N2L57L58j77j78J63J62l11l12K8K8J52J51J51J51j70j70l74l74L17L18K50
$$ y = [834, 910, 987, 1064, 1141, 815, 489, 502, 515, 444, 372, 275, 585, 828, 1070, 956, 435, 169, -97, -6, 492, 595, 699, 785, 872, 1240, 930, 433, 343, 177, 11, -384, -372, 53, 70, -228, -117, -266, -414, -758, -423, 94, -68, -375, -274, -229, -183, -112, -41, -18, 5, 206, 407, 719, 623, 162, 652, 1179, 755, 493, 638, 537, 435, 275, -293, -370, -39, -6, 28, 222, -262, -772, -602, 102, 399, 466, 534, 521, 100, -142, 23, 273, 116, 146, -232, -805, -700, -390, -80, 480, 1040, 1082, 717, 352, -13, 114, 649, 563, 477, 620, 763, 622, 480, 339, 198, 83, -32, -231, 248, 825, 723, 341, 367, 186, 6, 623, 1240, 899, 964, 1183, 722, 608, 495, 339, 183, 264, 346, 427, 509, 333, 156, -20, -196, -122, -48, 366, 779, 709, 639, 569, 499, 687, 876, 1065, 1254, 1034, 813, 186, 237, 845, 1045, 1041, 1037, 1020, 1002, 985, 967, 1132, 1297, 1258, 1220, 662, 103, 292, 481, 543, 604, 1005, 1407, 1136, 865, 450, 36, -265, 386, 680, 294, 346, 398, 450, 502, 32, 241, 849, 507, -120, -68, 289, 647, 470, 292, 455, 617, 306, -6, 22, 50, 202, 353, 504, 655, 485, 315, -59, -433, -116, 202, 452]
7084D52j58j09N69O8o10L0L0j2j2Q6Q7M26M26j68j69j68j68L33L33j42j42k86k87k86k87j85
7071c49j84K91K90p8p9p8p9K78K77K78K78R9R9n11n12J63J63m1m1J76J76J50J50K15j92r23
7058A6j07M48M1j54j54L38L38j37j38r5r4J85k22k74N41K86j21j26j25N2N3O0O1O0O0j05j05
7044E82K34K34N8N8n02n02k73N42N93k22n17K98K97n17m74L40N44k71l21M94J0l98O1O1O0
7032D69O1j58K50N04l11r4L14L3L3q0q0J24J24J24J24q0q0l44l44l44l44J99J99J49J48N42
7019A138k73l84K4L25L26l96l97L88L88q7q7o14o14J67R83M09m07m65n8k4k4k02k02k00j99
7006d85K77K76j31j31L44L44K1K0m55m55M71M70nmQ7Q7j16j16L2L2L2L3K24K25j32n40o88
6992b83k80K12K11L24L23m2m2L45o3J66J66k80k80O0N9K2K1M54M7K5K4N0l57p31l24M15M15
$$ y = [452, 294, 185, 754, 822, 212, 242, 272, 260, 248, 334, 421, 847, 1273, 1105, 936, 768, 600, 933, 1266, 1124, 982, 696, 409, 123, -164, -349, -533, -242, 48, -30, -109, -187, -266, 12, 289, 567, 845, 944, 1043, 532, 20, 183, 346, 305, 264, 440, 616, 766, 916, 1131, 939, 16, -91, 357, 398, 244, 90, 428, 766, 629, 491, 396, 302, 487, 265, -9, 532, 818, 697, 571, 446, 498, 551, 611, 672, 732, 792, 687, 582, 816, 1050, 1108, 1166, 664, 162, -111, 431, 1024, 802, 285, 583, 880, 363, -111, 229, 773, 502, 181, 675, 685, 287, 348, 409, 469, 530, 372, 622, 1126, 815, 721, 1035, 1068, 1101, 1021, 941, 1065, 1189, 1313, 1437, 1357, 1277, 933, 589, 245, -99, 100, 299, 448, 596, 1138, 865, 481, 505, 830, 1156, 760, 363, 751, 1139, 1052, 965, 351, -263, -96, 887, 1296, 889, 424, 366, 342, 318, 116, -86, -286, -485, -208, 68, -63, -194, 150, 494, 515, 535, 80, -375, 96, 566, 561, 557, 644, 731, 615, 499, 531, 563, 595, 628, 852, 1077, 945, 405, -283, -563, -351, -140, 184, 507, 465, 423, 768, 705, 871, 1037, 757, 477, 537, 596, 618, 639, 1093, 1140, 1165, 1189, 1239, 882, 151, -173, 242, 657]
6979F57M38L0m46l8K55K55j96j95o2o3o2o3k4k4K90K90O1l46K22K23r6r6r6r5K65K65p5p4
6965A200m31m32k10J97K50j58P1P2J14k94l19Q8N44J36l57l56J79J78j61j61J7J7K71j36j57
6952A62K50J57J56J43n36P5P5k81J26J00J01k73k72K03K03j62j62L13L13K80K79j96K11K59
6940A524m21k18J90pM00J29o87p62N95N78k36j52j51p12J03P35p9lM04n51n52M33l82n68j61
6928e51N1M58K61j46J93O01N7l50J09J08J41J40j99j99k08k07J32J32L29L29j0j0k65k65L46
6915I77L47J94J94j46j45m30m30J81J82j8j9j8j8K0K0j84j83O5O6j38j38j72j71p0P44M54
6902A164l62n7n6k94k94r0r0n4n3J50J50K78K77o2o2J45J45n9n9p6p6K64K63l51l50J24J24
6889F39j85j86J9J8J54J54J54J55j94j94J45J46R8R9R8R9L32L31n51n51m02m02o3o3K68K68
$$ y = [657, 1095, 1125, 679, 641, 896, 1151, 955, 760, 698, 635, 573, 510, 486, 462, 752, 1042, 1103, 757, 979, 1202, 1106, 1010, 914, 819, 1084, 1349, 1274, 1200, 769, 337, 127, 324, 574, 416, 487, 559, 673, 379, 60, 148, 692, 828, 471, 115, 294, 472, 311, 150, 167, 184, 455, 319, 162, 412, 569, 725, 868, 332, 407, 482, 201, 327, 427, 528, 255, -17, 186, 389, 227, 65, 378, 691, 971, 1250, 1054, 1265, 1524, 1103, 885, 1075, 1068, 1468, 1597, 910, 148, 743, 1321, 1085, 933, 782, 70, 173, 908, 829, 826, 1230, 679, 127, 560, 178, -390, -551, -500, -42, 219, 73, 266, 867, 924, 574, 683, 791, 932, 1072, 873, 674, 466, 259, 391, 523, 852, 1181, 1171, 1161, 896, 631, 977, 1324, 1518, 1712, 1566, 1421, 991, 561, 742, 924, 906, 887, 869, 851, 871, 891, 707, 524, 589, 655, 517, 379, 207, 36, -34, 710, 1164, 802, 745, 689, 395, 101, 11, -79, -133, -186, -36, 114, 392, 669, 607, 545, 690, 835, 776, 717, 641, 565, 829, 1092, 741, 391, 515, 639, 454, 268, 287, 305, 459, 613, 767, 922, 728, 534, 679, 825, 923, 1022, 1120, 1219, 1551, 1882, 1331, 780, 378, -24, -87, -150, 118, 386]
6875C86K68K69J18J19j10K97j92j91j65j66L09L08n6n6J04l02k52k51j94K15j5j5P4P4j04
6863D72j04j12K96K45K45J60k47k73J35J80k28K7K7k91k91M9M8K18K18K19K18J16J16q7q7
6850A269k44k43k44k43J05J04J05J05L1L1Q3l25n04r5L96j1l13L67m1m1N7N7L28p9j75N03
6837I83R6R6L3L2m43m43M1M1K95j12l58M9jkJ22J21L76l1l11R6j59j59J90J89L68L68M05j
6823A881k48k48l07l07J68J68m34m35o9p0R4N00K98j11j87j86K63K63m24m25K12K13l06J02
6811D05P6P7n11n10J01J01J09J10k30k30K15K16J47k60j36N42L64m3j17j17L32L33J76J76
6799A326l00l00r6r5j64K43P41O1n50J29M8l60q7q8J33J33p1p1J29J28J29J29J71J71J03n76
6786A016k75J33j38j39j43j43J97J96j69j70J70J70k80k80L32L31j30j29P4P4k31k32k7k8
$$ y = [386, 654, 923, 1041, 1160, 1050, 1347, 1155, 964, 799, 633, 942, 1250, 1194, 1138, 1242, 940, 688, 437, 243, 458, 443, 428, 502, 576, 472, 368, 256, 552, 797, 1042, 1202, 955, 682, 817, 997, 769, 796, 823, 532, 241, 290, 338, 556, 774, 993, 1211, 1327, 1443, 1356, 1269, 1025, 782, 538, 295, 400, 504, 609, 714, 745, 776, 859, 534, 30, -65, 331, 320, 7, 374, 333, 292, 349, 406, 734, 655, 480, 983, 1079, 1175, 1208, 1240, 797, 354, 395, 436, 731, 619, 261, 310, 309, 307, 429, 550, 926, 895, 584, 680, 521, 362, 552, 741, 1109, 1477, 1882, 1881, 1633, 1385, 1078, 771, 939, 1107, 673, 238, 169, 99, 193, 693, 991, 880, 693, 507, 770, 1033, 609, 184, 396, 609, 303, 405, 481, 558, 47, -463, -362, -261, -152, -42, -272, -502, -287, -71, 76, -184, -320, 222, 586, 543, 426, 309, 641, 974, 1150, 1326, 1026, 726, 630, 535, 371, 614, 1355, 1416, 866, 995, 1043, 683, 596, 508, 641, 774, 703, 632, 761, 889, 1018, 1147, 1318, 1489, 1592, 1016, 741, 874, 736, 597, 454, 311, 508, 704, 535, 365, 535, 705, 425, 145, 477, 808, 678, 549, 623, 697, 466, 234, 207, 179]
6774A79k35k34O48O48j41j42j41j41J07J08J08J07m65m66J0J0J67J67J67J67j21j22j22j21
6762A42L80L81J77J76k26k26k3k3K62K62k14k14k26k27J14J13J19J20J19J20l18l18K2K2j01
6750D13j01N10N10j10j10R4R4j7j7k21k21M2M2K46K46k48k49p0p1j97o05k83L97L25L25j08
6736F16j08j51j50N3N4L0L0K08K08p2m79j57N22N0M9j12j12kjK02K02N4N3k86k86j03j04K36
6722D44K36j2j2j3j2O4O5K67K68O5O4O4O4m66m67J45J45K28K29k47k47j79j79k05k04L68l9
6709D34l87N64M70k09k42k43L83L83J80J80l90l89Q7Q6O0O1j43j43J80J79k95k96k48k47m4
6696b9m4K32K32K8K8Q8Q7Q8Q8j38j37K02K02Q7Q7k53k53J63J63j77j77q8q9J16J15L53L53
6683A327k59k58j95j96K80K80L4L4l06l05l8l7L02L03j27j26m2L66J47k61k60J47R1l16o1
$$ y = [179, -56, -290, 358, 1006, 865, 723, 582, 441, 548, 656, 764, 871, 406, -60, -50, -40, 127, 294, 461, 628, 507, 385, 263, 142, 522, 903, 1080, 1256, 1030, 804, 781, 758, 1020, 1282, 1068, 854, 628, 401, 515, 628, 747, 867, 986, 1106, 788, 470, 492, 514, 413, 312, 822, 1332, 1222, 1112, 1206, 1300, 1283, 1266, 1045, 824, 866, 908, 1154, 1400, 1152, 903, 833, 762, 565, -40, -323, 74, 399, 724, 616, 508, 357, 207, 260, 314, 344, 374, 582, 790, 718, 239, 82, 604, 654, 703, 591, 479, 477, 476, 678, 880, 934, 987, 701, 415, 312, 208, 444, 680, 668, 656, 643, 631, 695, 760, 1027, 1295, 1360, 1424, 1488, 1552, 1086, 619, 764, 909, 1137, 1366, 1119, 872, 693, 514, 309, 105, 473, 434, 47, 611, 1081, 872, 630, 387, 770, 1153, 1333, 1513, 1123, 734, 821, 907, 967, 1028, 885, 742, 922, 1101, 806, 510, 262, 15, -29, -73, 159, 391, 419, 447, 535, 622, 710, 798, 660, 523, 725, 927, 1014, 1101, 848, 595, 758, 921, 744, 567, 479, 390, 506, 621, 974, 1327, 1068, 810, 615, 419, 699, 979, 1013, 1047, 741, 436, 398, 361, 663, 966, 839, 713, 671, 1037, 1184, 923, 663, 810, 901, 585, 524]
6670E24o1N5N4K9K9M71O3m8m7l80l80k95J12O60K52L2L1J64J63J89J88q76m70J42k65K41K41
6657H18J2J2j02j03L47L48J29k77k78J30n7n7J72J72m6m6m7m6k63k63J02J02k90J17R1R2j29
6643F40j30j29j29K78K77K77K78j60j59M4M4Q8Q9Q8Q9l0l0K24j83k75J32N6N6j2m20p68J84
6630D19O05p3k44M36l6m42l75l75j09j09K30K31M8M8J16N24J08n72l68M0L41P48M52k28l62
6617A053l62P1P0l5l5j0j0m64n6N54J48q6q7j79n87k30M50M75O8QQk46J61OOK61j47J67J68
6602A140l17R1j71n79n3L55P5M82L21l59l43l44j82j82L53L53j3j2r8n05J99Q79J10k97k6
6590H77k5k0j9J85J84k8k7K27j81m35k8M38M39O6l42k92k91j69K38j6j6K51j57j82K26J74
6577A077k34K1K0L27L26j49j49j54j54j80K27R2R2q6q6l00l00N6M64J97k11j85K22j57j58
$$ y = [524, 463, 518, 572, 601, 630, 1101, 1164, 1116, 1069, 689, 309, 14, 126, 786, 1038, 1070, 1101, 1265, 1428, 1617, 1805, 929, 459, 601, 336, 577, 818, 830, 842, 740, 637, 984, 1332, 1461, 1184, 906, 1036, 979, 922, 1094, 1266, 1220, 1174, 1127, 1081, 818, 555, 657, 759, 469, 586, 677, 769, 640, 510, 381, 252, 530, 807, 1084, 1362, 1202, 1043, 1087, 1131, 1219, 1308, 1396, 1485, 1455, 1425, 1649, 1466, 1191, 1323, 1379, 1435, 1423, 1003, 235, 419, 1024, 951, 707, 1143, 1107, 665, 290, -85, -194, -303, -73, 158, 206, 254, 370, 894, 1002, 430, 62, 102, 443, 1191, 1643, 1415, 1053, 691, 762, 832, 797, 762, 752, 742, 278, 222, 776, 924, 838, 751, 572, -15, -245, 205, 680, 748, 756, 764, 518, 679, 685, 691, 952, 805, 972, 1140, 823, 914, 743, 164, 111, 466, 541, 1023, 1344, 985, 642, 298, 116, -66, 287, 640, 627, 615, 517, 12, 211, 1090, 1200, 903, 877, 852, 832, 813, 998, 1182, 1154, 1127, 1354, 1173, 738, 710, 1148, 1587, 1653, 1311, 1019, 728, 559, 797, 781, 765, 1016, 859, 677, 903, 1077, 843, 864, 884, 1211, 1537, 1388, 1239, 1085, 931, 751, 978, 1070, 1162, 1076, 990, 690, 390, 446, 910, 1107, 896, 711, 933, 776, 618]
6564F18L01j07j11j11L39L39l96l96P9Q0O6O7O7O6N9N8m17m17J60J60J60J60J27J28p6p6k2
6551I05k1k24k25K63K63p6p6J15J15J14J15k07k06llL02L03m45m44M6M5M6M6J99J98nnJ9J9
6536A173K0J9p9p8p8p9j8j8j7j8j8j8j8j8J32J31J32J32k33k34k9l0K42K42L9l70n85R3K98
6522G15K97m8m8m7m8L64L64l83l83k21k21L91L90k76k76O07O07k46k47k47k47K12K12QQj07
6509A130j07j06j07J23J22J23J22j90j91J48J49j87j86J7J7k60k60Q0Q0J22J22J22J22jjk
6496A001jk06k05J35J34J45J45n9n9j90j90K85K85N6N6N6N6l68l68J07J07j6j7j6j6J16J15
6482A088q8q8K24K24K0K0j0j0l49l49J50J51J50J51kll41l42n8n9n8n8K52K51q8q8J29J28
6468I47p5p5J71J71J71J71k54k53k54k53Q2Q2j22j22J3J3J2J3j2j3l8l8K13j95n51J28K68
$$ y = [618, 919, 812, 701, 590, 929, 1268, 872, 476, 555, 635, 701, 768, 835, 901, 960, 1018, 601, 184, 344, 504, 664, 824, 951, 1079, 1003, 927, 905, 884, 660, 435, 698, 961, 885, 809, 924, 1039, 1153, 1268, 1061, 855, 852, 849, 1151, 1454, 1009, 565, 611, 656, 702, 748, 947, 1145, 1140, 1135, 1154, 1173, 1193, 1212, 1133, 1055, 977, 898, 880, 862, 845, 827, 809, 791, 773, 755, 887, 1018, 1150, 1282, 1049, 815, 786, 756, 998, 1240, 1279, 909, 324, 417, 715, 1012, 964, 916, 869, 821, 1185, 1549, 1166, 783, 562, 341, 732, 1122, 846, 570, 1177, 1784, 1538, 1291, 1044, 797, 1009, 1221, 1229, 1237, 1130, 1023, 917, 810, 933, 1055, 1178, 1300, 1110, 919, 1067, 1216, 1029, 843, 860, 877, 617, 357, 437, 517, 639, 761, 883, 1005, 1004, 1003, 1001, 1000, 794, 589, 724, 858, 1003, 1148, 1089, 1030, 840, 650, 935, 1220, 1276, 1332, 1388, 1444, 1076, 708, 815, 922, 906, 889, 873, 857, 973, 1088, 1000, 912, 1136, 1360, 1380, 1400, 1390, 1380, 1031, 682, 832, 983, 1133, 1284, 1282, 1279, 938, 596, 538, 479, 421, 363, 615, 866, 778, 690, 819, 947, 872, 797, 968, 1139, 1310, 1481, 1227, 974, 720, 467, 549, 631, 509, 387, 400, 413, 425, 438, 426, 413, 375, 337, 550, 355, -196, -68, 200]
6454B00K67L79k9l68L11K01K01J97m82m82J97j31j30K51K52K89K90J03n76n13J67K00k07k83
6442C04J24L45L45k25k25k1k1p6p6K63K63o1o2o1o2J85J85J85J85N0N1m25m25r8r8K41K42
6429A032l06l06J69J70j07j06J22J23l6L72N50j29n41j33P1P0j18j19K21K21m75m75K6K6j67
6416A55K41N80J73P5P6l6m42j21K86L2L2J50J51n4n3j84j84j84j84j54j54L21L21K29K29K5
6403A326K5K37K37J27k80k28k27j43K65K69K69n88n88l0l0l0l1qrJ95J94k96k96L15L15J83
6390A173J84p1L36K11j96j46j45k35k35m38K41K06k01k44k44P1M78M78P0P5P4K4K4M35K8o25
6377A328k19R3n86n36J44N04R12L60l19j00j00m83m82j01j00K39K39P7P7l99l98L4L4L74L74
6365I66J06J05k60k59O57K50j32j33j62j62M1M1j41j41K67m13k27J80j17K91J97J98O05p5
$$ y = [200, 467, 846, 817, 449, 760, 961, 1162, 1359, 877, 395, 592, 461, 331, 582, 834, 1123, 1413, 1516, 940, 427, 594, 794, 587, 304, 428, 773, 1118, 893, 668, 647, 626, 550, 474, 737, 1000, 939, 877, 816, 754, 939, 1124, 1309, 1494, 1544, 1595, 1170, 745, 647, 549, 790, 1032, 726, 420, 589, 759, 652, 546, 668, 791, 755, 1127, 1677, 1548, 1007, 874, 945, 1015, 897, 778, 999, 1220, 745, 270, 296, 322, 155, 396, 976, 1149, 1224, 1300, 1264, 822, 701, 987, 1019, 1051, 1201, 1352, 1298, 1245, 1061, 877, 693, 509, 355, 201, 522, 843, 1072, 1301, 1326, 1351, 1588, 1825, 1952, 1672, 1444, 1217, 1074, 1339, 1608, 1877, 1289, 701, 671, 641, 611, 580, 572, 563, 758, 952, 656, 360, 675, 990, 1173, 1357, 1286, 1622, 1833, 1637, 1491, 1346, 1111, 876, 438, 679, 885, 684, 440, 196, 267, 745, 1223, 1293, 1368, 1442, 1466, 1490, 1925, 1953, 1328, 1109, 1202, 616, 80, 224, 728, 1640, 2000, 1681, 1581, 1481, 998, 516, 415, 315, 554, 793, 870, 947, 548, 150, 184, 218, 592, 966, 1072, 1177, 917, 658, 1315, 1565, 1433, 1300, 1138, 976, 1017, 1058, 917, 776, 1043, 630, 403, 583, 466, 757, 954, 1152, 1757, 1682]
6352A682j18j18n01n00L91L91j95j94j2L95N73j05o79k71K04K05k13k12K63K62J11J10l66
6341A103l65K20K21N9N9k42M37O15l35j64K45r6p74p28m8N63R70M81P3J42n38q35j56j05j04
6328F98M04M04k07k07J4J3J92J92K52j55r19k40L2L2K52K53j01n09m57K21L41L40L41L40L42
6316A868l38j84K22l16l16J42J42M23k56j03L05l02l03J99J98j00r9K39K40kkkkJ30J30l46
6303A567l45P5P5P4P5o6o7o6o6o6o7o6o6K5K6K97j11j27N52N77J70n00n00j86j85M42M43m41
6289A473m40p5p6K65K64K55K56l55l56k00k01LMPPk64J43L78l02m38l0J2M20J05l02P2P2M6
6275G43M6j62j62l65l66M46M47K42K43m7m6m6m6L7L6L7L6O7O6j37j38j6j6j6j6M55M55j56
6261A621j56k24k24J15J16K77K77K76K77k11k10k11k11J42J41J42J41P8P8m91m91n50J29L58
$$ y = [1682, 1564, 1446, 945, 445, 836, 1227, 1032, 838, 826, 1221, 1794, 1689, 1010, 739, 943, 1148, 935, 723, 986, 1248, 1359, 1469, 1103, 738, 958, 1179, 1238, 1297, 1055, 1492, 2107, 1772, 1608, 1853, 1757, 983, 255, 207, 770, 1740, 2221, 2294, 2436, 1898, 1063, 907, 802, 698, 1102, 1506, 1299, 1092, 1106, 1119, 1311, 1503, 1755, 1600, 681, 441, 473, 505, 757, 1010, 909, 400, -57, 164, 505, 845, 1186, 1526, 1868, 1530, 1346, 1568, 1252, 936, 1078, 1220, 1643, 1387, 1284, 1589, 1287, 984, 1183, 1381, 1281, 1182, 1421, 1661, 1659, 1657, 1655, 1653, 1783, 1913, 1567, 1222, 1297, 1372, 1446, 1521, 1455, 1388, 1322, 1256, 1190, 1123, 1057, 991, 1016, 1042, 1339, 1228, 1101, 1653, 2230, 2400, 1900, 1400, 1214, 1029, 1471, 1914, 1473, 1033, 958, 882, 1147, 1411, 1666, 1922, 1567, 1211, 1011, 810, 813, 817, 824, 831, 567, 710, 1088, 786, 348, 318, 330, 750, 855, 553, 625, 697, 743, 789, 627, 465, 100, -266, 180, 627, 869, 1112, 1065, 1019, 973, 927, 964, 1000, 1037, 1073, 1140, 1206, 1069, 931, 915, 899, 883, 867, 1322, 1777, 1621, 1465, 1241, 1017, 1132, 1248, 1525, 1802, 2078, 2355, 2144, 1934, 1723, 1512, 1654, 1795, 1937, 2078, 2156, 2234, 1743, 1252, 702, 831, 1189]
6249A189L58k10k09k10k09L12L13O7O6P9o00J22Q01o1m69k39k39N49j29q77j98L92L92m0m1
6236I09L40L40j35j35J28J28l47l48M50M50m33m33k33k34K42K42p8p7J94k13l96K83K16K15
6224A075j58j59M70k09m30K49J64J64K53K54q7q6J18J17k22k22J24J25q0p9N2N3N2N2j82j82
6211A226l86l86K55K55K54K55k8k8k8k8j64j64M0M0J06J07j91j90o40L8M97R0N6N6K34K34
6198A510k42k41R8R8K17K17j65j65K6o53j94P56O6O5J26J25j68j67l29l29l65L14L65m2k34
6185F89k33M88M88P2P3P2P3m41m42L06L06P9P9K82K83j97j98m00m01J16J17J16J17J08J08
6173A660k32k32n5n5n6n5J22J23l8l9l17L61K09j99J33J32n21J58J26n53q7q6K9P07P33N4
6160B022m22j4n6m64O56O57j16j16j51j51l54l55L80L79J76k32m40K39O1l47k20k19m1m2J20
$$ y = [1189, 1547, 1337, 1128, 918, 709, 1021, 1334, 1401, 1467, 1546, 946, 1068, 1869, 1808, 1339, 1100, 861, 1410, 1281, 404, 206, 598, 990, 950, 909, 1249, 1589, 1454, 1319, 1447, 1575, 1228, 880, 1330, 1780, 1347, 914, 681, 447, 689, 931, 853, 776, 970, 757, 361, 644, 860, 1075, 917, 758, 1228, 1019, 589, 838, 1002, 1166, 1419, 1673, 1586, 1500, 1618, 1735, 1513, 1291, 1415, 1540, 1460, 1381, 1433, 1486, 1538, 1590, 1408, 1226, 840, 454, 709, 964, 1218, 1473, 1445, 1417, 1389, 1361, 1197, 1033, 1073, 1113, 1219, 1326, 1135, 945, 305, 343, 840, 930, 986, 1042, 1276, 1510, 1268, 1027, 1125, 1223, 1440, 1657, 1492, 1327, 1353, 700, 506, 1262, 1328, 1393, 1519, 1644, 1476, 1309, 980, 651, 286, 600, 965, 923, 689, 456, 944, 1432, 1504, 1577, 1649, 1722, 1281, 839, 1145, 1451, 1530, 1609, 1891, 2174, 1977, 1779, 1379, 978, 1094, 1211, 1327, 1444, 1552, 1660, 1428, 1196, 1141, 1086, 1030, 975, 1097, 1220, 1182, 1143, 826, 1187, 1396, 1197, 1330, 1462, 941, 1099, 1225, 672, 585, 499, 528, 1235, 1968, 2022, 1600, 1586, 1530, 1066, 1722, 2379, 2263, 2147, 1996, 1845, 1491, 1136, 1516, 1895, 2071, 1839, 1399, 1638, 1699, 1352, 1132, 913, 872, 830, 950]
6147I50J20j51K56J20n59N2P31K28j80R2R2k56k56K02k05n4L54J00R9j43j42j68K39k74k73
6135I74K27K27j25j25r9j00k40J68N07J00r9j00j5L93j79j78l57l57J61J61o9L39K4K4L05
6122A567j04n44j38L55L55J33J33O5l42l09L71l7l7kkK53j54j04L04j55j55j35j36J79J78
6110A539M3l65l65M3l7l7l7l6K94j14q7q8P9P9r9r9P1M78K74j33l89l90l05J02J96J96j18
6096F95j18RJ0K14K13P8P7P8P7kkkkk99k99J25n53k88L92J96k11k49k49N66N65K33m47k94
6082E13J14O7O7k47k47n8n7M17M18q8q7l17R1rqJ94J95M96Q9n65J14Om01L45L45Q7Q6j17j17
6067A326j29j29l84K4K79j29J26J25J54J53j61j60k1L87M7l60k2k2J99J99m29K50O32l19k00
6055A436K08m21m20nmQ0M88L83k5l81l81M3M3j60j61r8r9K41K42K83K84k17k18L32p7l90J7
$$ y = [950, 1070, 919, 1175, 1295, 736, 788, 1519, 1747, 1567, 1659, 1751, 1495, 1239, 1441, 1236, 1182, 1536, 1636, 1735, 1592, 1450, 1282, 1521, 1247, 974, 1201, 1428, 1303, 1178, 1079, 979, 739, 907, 1414, 1514, 1415, 1315, 1300, 1693, 1514, 1336, 979, 622, 783, 944, 875, 1214, 1238, 1262, 1567, 1463, 919, 781, 1136, 1491, 1624, 1757, 1822, 1480, 1171, 1542, 1505, 1468, 1466, 1464, 1717, 1563, 1459, 1763, 1608, 1453, 1318, 1182, 1361, 1539, 1582, 1217, 852, 895, 858, 821, 784, 748, 1042, 928, 841, 753, 832, 911, 812, 713, 784, 1262, 1536, 1403, 1014, 624, 319, 421, 617, 813, 695, 577, 586, 596, 810, 1023, 1101, 1178, 1256, 1333, 1331, 1329, 1327, 1325, 1026, 727, 852, 299, 11, 403, 599, 388, 139, -110, 456, 1021, 1254, 807, 513, 627, 694, 761, 514, 267, 209, 152, 569, 987, 899, 812, 495, 586, 577, 569, 763, 958, 1454, 1543, 978, 1092, 1098, 697, 1042, 1387, 1474, 1560, 1443, 1326, 1197, 1068, 684, 708, 987, 858, 984, 1109, 1263, 1416, 1255, 1095, 1074, 1461, 1508, 1148, 1126, 1104, 1303, 1502, 1073, 1323, 1955, 1636, 1436, 1644, 1223, 803, 798, 794, 874, 1362, 1745, 1720, 1339, 958, 1001, 1044, 884, 723, 625, 526, 767, 1009, 1292, 1576, 1359, 1141, 1473, 1396, 1006, 1023]
6041A023JM07K04k03j10n17l47M68M72l43o3L44k00k01P84l1o85k77o5L42Q8l20o5o5j11j12
6028D18L64L63J60J60j79j80K28K28K4K4k31k30J08J09J34J35p0o9l46l45J30J30J38J39J38
6016A480J39j56j56j56j56R8R9R9R9N6N6N6N6K86K85J84o31o31J84K70j39j63K44J4J5j09
6003A423K99N28k86l13l12J12J13J30J30k09k10j45j46j45j46L78L79k33k32NNj99j99J52
5991H79J52J01J00O66j50m38m38J94J94rj0j07j07j08j07k0k0L19L20m2m1k45k45N65N66R0
5978B059R0JJk02k03j30j31j30j31J88J88j6j6M93M94k37r16j09N70j94j95l76l77R9R8R9
5964A017R9R8R9J44J45J44J44j52j53K97K97O42K34m36K43N2o27j60j60l57L23M16M16j87
5952B578j87j87j86n48n47J99K00K1K1K25K25j3j2j3j3P6P7n35n35n3n3K87K86j34j33L58
$$ y = [1023, 1024, 1431, 1635, 1432, 1322, 805, 458, 926, 1398, 1055, 992, 1336, 1136, 935, 1719, 1688, 1003, 726, 661, 1003, 1091, 771, 706, 641, 530, 418, 782, 1145, 1305, 1465, 1286, 1106, 1334, 1562, 1586, 1610, 1379, 1149, 1257, 1366, 1500, 1635, 1565, 1496, 1150, 805, 935, 1065, 1203, 1342, 1480, 1619, 1463, 1307, 1151, 995, 1093, 1192, 1291, 1390, 1446, 1502, 1558, 1614, 1900, 2185, 2369, 1738, 1107, 1291, 1561, 1422, 1259, 1503, 1517, 1532, 1423, 1722, 2250, 1964, 1651, 1339, 1451, 1564, 1694, 1824, 1615, 1405, 1260, 1114, 969, 823, 1201, 1580, 1347, 1115, 1120, 1125, 926, 727, 879, 1031, 1132, 1232, 1898, 1748, 1310, 872, 1066, 1260, 1251, 1241, 1134, 1027, 919, 812, 792, 772, 1091, 1411, 1369, 1328, 1083, 838, 1403, 1969, 2059, 2149, 2150, 2151, 1949, 1746, 1616, 1485, 1355, 1224, 1412, 1600, 1584, 1568, 2061, 2555, 2318, 1402, 1293, 1863, 1669, 1474, 1098, 721, 820, 918, 1017, 1116, 1214, 1313, 1457, 1602, 1746, 1890, 1738, 1585, 1882, 2179, 2821, 3055, 2619, 2862, 2914, 2287, 2127, 1967, 1610, 1933, 2349, 2765, 2578, 2391, 2204, 2018, 1470, 923, 1122, 1322, 1343, 1364, 1589, 1814, 1801, 1789, 1776, 1763, 1839, 1916, 1381, 846, 793, 740, 1027, 1313, 1179, 1046, 1404]
5939A404m8l02O50M71k08m08m07k46k46J59J59m5m4K35K36K35K36j25j25j26j25n3n3n3n3
5927A118J60J60m4m4k65k64L46o1k86L94K15j93J52J51J26J26NMNNj43j44L32L31j39j39j40
5913A768j39L44L45j31j31l38l38l38l37L5L6L6L5J61J61L65L64k1k2J82J82k73k73K02K03
5901B078l6l5k39k39nnk08k08l9l9L8l70K7Q41K47j60k0k1m5m6L41L42j34j34n3n3n3n4M5
5886A763M5M5M5ooooj61j62j62j62o9o8K70K71J60J60j71n78l79M35K58n57j62O54L73l4J05
5872A895J06N56N56n72n72k32k32K18K18l94l93P3P4k66k66J28J29J29J28J12J11r3r2J87
5860A508J88J87J88k47k46m3m3J53J53j87j88o0o0o0o0K15K16K0l87n51K63O63O62j52j53
5848A979k97k97l23O28J78p73j92K16J82k26n60j54J78J78K50j58l53L27N52j26q4N96k24
$$ y = [1404, 1356, 1054, 1704, 2175, 1967, 1559, 1152, 906, 660, 819, 978, 933, 889, 1124, 1360, 1595, 1831, 1706, 1581, 1455, 1330, 1277, 1224, 1171, 1118, 1278, 1438, 1394, 1350, 1085, 821, 1167, 1106, 820, 1214, 1429, 1236, 1388, 1539, 1665, 1791, 1796, 1800, 1805, 1810, 1667, 1523, 1855, 2186, 2047, 1908, 1768, 1629, 1973, 2318, 2187, 2056, 1718, 1380, 1042, 705, 740, 776, 812, 847, 1008, 1169, 1534, 1898, 1877, 1855, 2037, 2219, 1946, 1673, 1875, 2078, 2042, 2007, 1768, 1529, 1524, 1519, 1311, 1103, 1064, 1025, 1063, 693, 720, 1561, 1808, 1648, 1628, 1607, 1562, 1516, 1857, 2199, 2065, 1931, 1878, 1825, 1772, 1718, 1763, 1808, 1853, 1898, 1892, 1886, 1880, 1874, 1713, 1551, 1389, 1227, 1158, 1090, 1360, 1631, 1791, 1951, 1780, 1202, 823, 1258, 1516, 959, 797, 1451, 1824, 1790, 1895, 2001, 2557, 3113, 2541, 1969, 1737, 1505, 1723, 1941, 1547, 1154, 1227, 1301, 1035, 769, 897, 1026, 1155, 1283, 1395, 1506, 1413, 1321, 1508, 1696, 1883, 2071, 1824, 1578, 1535, 1492, 1645, 1798, 1611, 1423, 1363, 1303, 1243, 1183, 1398, 1614, 1634, 1247, 696, 959, 1622, 2284, 2132, 1979, 1682, 1385, 1062, 1690, 1868, 1095, 903, 1119, 1301, 1075, 515, 361, 539, 717, 967, 809, 456, 783, 1335, 1209, 1125, 1721, 1497]
5836A497k24M30M29p8p9p8p9k06k05lkJ05J06J05J05J18J18J18J18l21l20l20l21J17J17J17
5823A364J17m5m4J59J60L6L6l03l04k00k01J40J39m4m3m3m4K82K81P57P57n12n12l7l6k82
5810A578k82p8L29O6o13j54N24O75mj91j91L77L78r8r8k27k27Q7Q7Om01n97Q3N34j45j53K55
5796A520j8j7QQj64j64M48M47j00j00L75L75l82l81j79j78K64K63M67M67q9q9m29m28k89k88
5783A347n9o0J37N44O97J8l13l13j6j6r7r7r6r7k45k46K31K30j50j50N4N4J94J94m17m17P7
5770I88P8J02J03k49J58N14j64n5n5N14J07l69L11J32k76n3n4p9p9o6o6o7o6R8R8L02L02m07
5756A702m07O9O8L98L99k13k13j57j58j57j58j35j36M76M75k33k33K17K16P3l35j49N31J15
5744B055J15J57J58j58j58j58j58P6P5L4L3O21n8j6j6n88n89j13j13L19L20j56j56J37J37
$$ y = [1497, 1273, 1703, 2132, 2054, 1975, 1897, 1818, 1612, 1407, 1404, 1402, 1507, 1613, 1718, 1823, 1941, 2059, 2177, 2295, 1974, 1654, 1334, 1013, 1130, 1247, 1364, 1481, 1436, 1392, 1551, 1711, 1747, 1783, 1480, 1176, 976, 775, 915, 1054, 1010, 967, 924, 880, 1162, 1443, 2200, 2957, 2445, 1933, 1896, 1860, 1578, 1296, 1218, 1547, 1613, 1000, 846, 1370, 2045, 2041, 1850, 1659, 2036, 2414, 2316, 2218, 1991, 1764, 1851, 1938, 1944, 1543, 946, 1029, 1563, 1418, 1265, 1520, 1502, 1485, 1493, 1501, 1337, 1173, 1621, 2068, 1968, 1868, 2243, 2618, 2236, 1855, 1676, 1498, 1762, 2025, 2492, 2959, 2870, 2781, 2352, 1924, 1635, 1347, 1288, 1228, 1365, 1909, 2606, 2624, 2311, 1998, 1982, 1966, 1869, 1772, 1676, 1579, 1334, 1088, 1319, 1549, 1399, 1249, 1303, 1357, 1551, 1745, 1328, 911, 988, 1066, 1168, 1271, 1022, 1180, 1694, 1530, 1475, 1420, 1934, 2041, 1672, 1983, 2115, 1839, 1786, 1732, 1653, 1574, 1508, 1442, 1375, 1309, 1407, 1505, 1807, 2109, 1702, 1295, 1364, 1432, 1830, 2229, 2016, 1803, 1646, 1488, 1331, 1173, 1038, 902, 1378, 1853, 1620, 1387, 1604, 1820, 1893, 1558, 1409, 1940, 2055, 2170, 2327, 2485, 2327, 2169, 2011, 1853, 1929, 2004, 2038, 2071, 2692, 2634, 2618, 2602, 2014, 1425, 1312, 1199, 1518, 1838, 1682, 1526, 1663, 1800]
5731A800M76M77j13j14l85K3R0n89n55L96L64l15J27J26o0o1o0o0k14k15K61K62K14K15J0
5719B100J1j64j65J75J75l93l94J75J75M12k68m54m6MML27L27M26k53p12l04M0M0O5O5L16
5705A684L16k96k95j01j00L75L75j14j15J57k50n18J61K29K30M20M20n5n5k00j99MML12L11
5693B700l00l00l76l76R9J00j30j30K09K10p1p0p1p1K39K39K39K38j64j64L9L9O5O5O4O5p5
5679B312p6k79k79j5j5L25L25n07n08J04J04K04K04k72k71l9l8l8l8j12j12R2R2J73J72l1
5666A477l1m0m0M36M36r9r9r9r9J25J26J26J26n28n27K19K19r3r2K46K47l22l22j18j18L73
5653A529L74k38J70K46m33n1L56l31l31P13P12o45o45l4l4M66M67qrJ27J27p6p56j97K10k66
5640A443k65L12L12k8k8j08j08L67L67J1J1l29l29LKM77M78j21j21j20j21R4R5k45k45K2K3
$$ y = [1800, 2276, 2753, 2640, 2526, 2141, 2164, 2254, 1665, 1110, 1506, 1870, 1555, 1682, 1808, 1748, 1687, 1627, 1567, 1353, 1138, 1399, 1661, 1875, 2090, 2100, 2111, 1947, 1782, 1957, 2132, 1739, 1345, 1520, 1695, 2107, 1839, 1385, 1339, 1343, 1347, 1674, 2001, 2427, 2174, 1462, 1158, 1198, 1238, 1303, 1368, 1684, 2000, 1704, 1409, 1308, 1208, 1583, 1958, 1844, 1729, 1886, 1636, 1118, 1279, 1508, 1738, 2158, 2578, 2523, 2468, 2268, 2069, 2073, 2077, 2389, 2700, 2400, 2100, 1724, 1348, 1447, 1547, 1417, 1287, 1496, 1706, 1635, 1565, 1494, 1423, 1662, 1901, 2140, 2378, 2214, 2050, 2089, 2128, 2193, 2258, 2322, 2387, 2312, 2236, 1957, 1678, 1663, 1648, 1973, 2298, 1791, 1283, 1387, 1491, 1695, 1899, 1627, 1356, 1317, 1279, 1241, 1203, 1091, 979, 1071, 1163, 1336, 1508, 1477, 1446, 1406, 1366, 1802, 2238, 2139, 2040, 1941, 1842, 1967, 2093, 2219, 2345, 1817, 1290, 1509, 1728, 1635, 1543, 1789, 2036, 1714, 1392, 1274, 1156, 1529, 1903, 1665, 1835, 2081, 1648, 1597, 1953, 1622, 1291, 2004, 2716, 2071, 1426, 1392, 1358, 1824, 2291, 2283, 2274, 2401, 2528, 2452, 1696, 1499, 1709, 1443, 1178, 1490, 1802, 1774, 1746, 1638, 1530, 1897, 2264, 2275, 2286, 1957, 1628, 1631, 1633, 2110, 2588, 2467, 2346, 2226, 2105, 2199, 2294, 2049, 1804, 1826, 1849]
5627A849L62L62j99j98l7l7K18m62m87p9P9M86n7n7J64J63m0m0L4L5j70j69K97K97l14l13
5614A687R3R4l82l82K30K29j10j10j34j35M77M77n0n0K90K90l19l19J56J57J69J69m43m42
5602A642J83J83J82J83R4R3R4R4k29k28k28k29K26K26K25K26k75k75K00K01k54k54k29k28
5590A623PM15M15Qj97j96J18J18O0O1j44j43K2K3j56j56j80K27L81k99j84j84L51J029N19
5577C538m33m41m40k38J71K55K55Q8l19k95k94R3R2k48k47J03J03j69K38N19j60j86j86k74
5565A525M05K78j29j00L07K57K57j70j70L4L4l66l65J27N35M59N2l4l3k5k5n01n00j29j29
5552A594K11K11R6R6R6R6j48j48l26l26R4N02N02R4j93j92k18k17Q3Q4Q3Q4K2K3K27K26o2
5539B594o2o3o2j24j23Q0Q0O3O3O3O3K34K35J67k41p71r3L41o7k70k70L32P40L83k5n16n17
$$ y = [1849, 2211, 2573, 2374, 2176, 2139, 2102, 2320, 1858, 1371, 1292, 1371, 1857, 1800, 1743, 1907, 2070, 2030, 1990, 2024, 2059, 1889, 1720, 2017, 2314, 2000, 1687, 1780, 1874, 1492, 1110, 1340, 1569, 1459, 1349, 1215, 1080, 1557, 2034, 1984, 1934, 2224, 2514, 2195, 1876, 2032, 2189, 2358, 2527, 2084, 1642, 1825, 2008, 2190, 2373, 2467, 2560, 2654, 2748, 2519, 2291, 2063, 1834, 2060, 2286, 2511, 2737, 2462, 2187, 2387, 2588, 2334, 2080, 1851, 1623, 1630, 2045, 2460, 2468, 2271, 2075, 2193, 2311, 2371, 2432, 2288, 2145, 2167, 2190, 2034, 1878, 1698, 1925, 2306, 2007, 1823, 1639, 1990, 3019, 3538, 3105, 2664, 2224, 1986, 2157, 2412, 2667, 2755, 2436, 2141, 1847, 1940, 2032, 1784, 1537, 1640, 1743, 1574, 1812, 2331, 2171, 1985, 1799, 1525, 1930, 2208, 2079, 1979, 2286, 2543, 2800, 2630, 2460, 2494, 2528, 2162, 1797, 1924, 2459, 2918, 2970, 2936, 2903, 2878, 2853, 2352, 1852, 1723, 1594, 1805, 2016, 2112, 2208, 2304, 2400, 2252, 2104, 1778, 1452, 1546, 2048, 2550, 2644, 2451, 2259, 2041, 1824, 1907, 1991, 2074, 2158, 2180, 2203, 2430, 2656, 2594, 2532, 2469, 2407, 2283, 2160, 2240, 2320, 2383, 2446, 2509, 2572, 2806, 3041, 3208, 2967, 2196, 2103, 2444, 2377, 2107, 1837, 2169, 2909, 3292, 3267, 2751, 2234]
5525B234K19K19k57k56j97j97m27j8K61K61K87K87p0p0M06M05l05l05L99qk25k25m79p2O2
5513A929O2j17j16M99M99K3K4N1N2k89k88J62J62j53j52j55K53l15l16L80L81m61n2J8J9K22
5500B322K22L41o6l13l12l38l39J38J37J9J8l2L75L58m9o51o52J26N32N33J25m4m5k48k49
5487A908j84K23M43M44K54j53j03j02n19j11K29j79k40k40K09K10J58J59L37L37N67J60j03
5476C704n11m81p3L7L6l29P8P9l30J72J72q3L24N0N1k64k64J31J31O3l44p33n3J50J50K99
5463B162K98m48m48K18K19K19K18l1l2K82K83L3l75n78j70K49K50K74K75j64j65L10r7p08
5450B074k9K68j39J69J69J19J18M80P1j74j75J04J03j25j26K09j97L1L1k71k71O8O9mmk9k9
5437B510J89k18k18J89k06k05J59J59J06J05J05J06K62K62n78j70J37J38m1m1k44k44K30K31
$$ y = [2234, 2453, 2672, 2415, 2159, 1962, 1765, 1338, 1320, 1581, 1842, 2129, 2416, 2346, 2276, 2682, 3087, 2782, 2477, 2876, 2868, 2643, 2418, 1939, 1867, 1929, 1991, 1874, 1758, 2257, 2756, 2779, 2803, 2854, 2906, 2617, 2329, 2491, 2653, 2500, 2348, 2193, 2446, 2131, 1815, 2195, 2576, 2115, 2063, 2081, 2100, 2322, 2544, 2885, 2819, 2506, 2194, 1856, 1517, 1655, 1792, 1811, 1829, 1797, 2172, 2530, 2481, 1830, 1178, 1304, 1836, 2369, 2494, 2450, 2405, 2157, 1908, 1724, 1947, 2390, 2834, 3088, 2935, 2832, 2730, 2211, 2100, 2329, 2150, 1910, 1670, 1879, 2089, 2247, 2406, 2743, 3080, 3647, 3807, 3704, 3193, 2712, 2639, 2676, 2712, 2383, 2461, 2540, 2210, 2382, 2554, 2471, 2795, 2845, 2896, 2632, 2368, 2499, 2630, 2693, 2349, 1616, 1563, 1713, 1863, 2162, 2460, 2012, 1564, 1782, 2001, 2220, 2438, 2407, 2375, 2657, 2940, 2973, 2598, 2020, 1850, 2099, 2349, 2623, 2898, 2734, 2569, 2879, 2782, 2074, 2045, 2313, 2174, 2343, 2512, 2631, 2749, 3229, 3300, 3126, 2951, 3055, 3158, 3033, 2907, 3116, 2919, 2950, 2981, 2710, 2439, 2507, 2576, 2572, 2568, 2539, 2510, 2699, 2481, 2263, 2452, 2246, 2041, 2200, 2359, 2465, 2570, 2675, 2781, 3043, 3305, 2727, 2557, 2694, 2832, 2791, 2750, 2506, 2262, 2492, 2723]
5425B723P8P9J03l04R5R6j86K23J34k73m43K37L21l58l67l66m93J86N09J02QQN0M58M35k45
5412B810p54J96N02j77p5p5n5n5k58M20K09k00j31j31L23L22k63k62l44O4K85K84J50k57l
5399B525ll3L75J71k36p9p9l08l08j21j21r6r6J93O00P53P4J13J12k70k70j48j48j49j48J19
5386B422J19J19J20j23j23j23j23L0L0NMJ79k28l81K98P7P7J20J19j26j27j26j27R9R8R8R9
5373B506K93K93J99m80k46k46n09J70N60j19k63J44L31L31n26n26j51j50N3N3M95M95K91K91
5361C289J65J64l10l11j92j91J1J2k03k03K72K72j09j10R4R4O5O5j38j39J21J20J20J21l67
5348B712l67L79L80M5M4M5M5n4n3n3n3POl33l33j53j52M59N2n39J41L44L44J26J26j46K61
5335C280J94m85k99L80R6n84l89J9L20L20OOj7j7q5m93k29M49L82L82l3l3J70J71j18j18Q5
$$ y = [2723, 2801, 2880, 2983, 2679, 2774, 2870, 2684, 2907, 3041, 2768, 2325, 2562, 2883, 2525, 2158, 1792, 1299, 1485, 1994, 2096, 2104, 2112, 2162, 2620, 3055, 2810, 2056, 2252, 2754, 2577, 2502, 2427, 2372, 2317, 2059, 2479, 2688, 2488, 2357, 2226, 2549, 2871, 2608, 2346, 2002, 2066, 2351, 2635, 2785, 2528, 2525, 2522, 2489, 2864, 3035, 2799, 2720, 2641, 2333, 2025, 1904, 1783, 1687, 1591, 1784, 2384, 3137, 3211, 3324, 3436, 3166, 2896, 2748, 2600, 2451, 2303, 2422, 2541, 2660, 2780, 2657, 2534, 2411, 2288, 2318, 2348, 2353, 2357, 2536, 2308, 1927, 2225, 2302, 2379, 2499, 2618, 2492, 2365, 2239, 2112, 2211, 2309, 2407, 2506, 2799, 3092, 3291, 2811, 2565, 2319, 1810, 1980, 2540, 2421, 2158, 2302, 2633, 2964, 2438, 1912, 1761, 1611, 1664, 1717, 2212, 2707, 2998, 3289, 3454, 3618, 3308, 2997, 2805, 2614, 2625, 2637, 2434, 2231, 2503, 2775, 2666, 2556, 2650, 2744, 2809, 2874, 2736, 2597, 2718, 2838, 2958, 3079, 2712, 2345, 2724, 3104, 3149, 3193, 3238, 3283, 3229, 3176, 3123, 3070, 3077, 3083, 2750, 2417, 2264, 2112, 2571, 2623, 2084, 2225, 2569, 2913, 3039, 3165, 3019, 3280, 3474, 2989, 2690, 3070, 3166, 2582, 2193, 2212, 2532, 2852, 2858, 2864, 2847, 2830, 2745, 2252, 2023, 2472, 2854, 3236, 3203, 3170, 3340, 3511, 3393, 3275, 3360]
5321C360Q6K63K63N9l48l61L18O15K07j59j60j85j85p9p9l08l08O33K26n81R8K77m03j81j82
5308B886L05L06l4l3r8r7r8r7k66k65o1o2N50N50P4P5m1m0m1m1l16l16J58J59J69J68l07l07
5294B880J2J1J2J1j62j61J78J78K9L0j74j75J73J73j67j67K32K32K32K32q7q7q7q7l21l20
5281B620j17j17L37L38L37L37l46l46M01M01k86k86q3q2k95k94L16L17r3r3J11J11J19J19
5269C426k20k21m09m09L37L38L12L12j63j64p36p36j76O39poP07j08K19K18l6l6J09J08m4
5257C254m5n07L08O48j68Q3Q3m44m43J34J33J34J34o6o6J38J38j79j80K46K45N50k64rj0j07
5244C740j06l11l10P2P1j32j32J00J01k40k39J5J6j89j88L8L8K42K41J06J06l44l44o8L39
5231B622P98j8k97J10l74l73J86J86j8j8O3O3O3O2k89k89J86J86O2O3K67K67N49N49m70m69
$$ y = [3360, 3446, 3709, 3972, 4031, 3683, 3322, 3640, 4255, 4462, 4303, 4143, 3958, 3773, 3694, 3615, 3307, 2999, 3632, 3858, 3277, 3375, 3652, 3249, 3068, 2886, 3191, 3497, 3463, 3430, 3332, 3235, 3137, 3040, 2774, 2509, 2448, 2386, 2936, 3486, 3560, 3635, 3594, 3554, 3513, 3472, 3156, 2840, 2998, 3157, 3326, 3494, 3187, 2880, 2892, 2903, 2915, 2926, 2764, 2603, 2781, 2959, 2988, 3018, 2844, 2669, 2842, 3015, 2848, 2681, 2913, 3145, 3377, 3609, 3522, 3435, 3348, 3261, 2940, 2620, 2503, 2386, 2723, 3061, 3398, 3735, 3389, 3043, 3444, 3845, 3559, 3273, 3190, 3108, 2813, 2519, 2835, 3152, 3059, 2966, 3077, 3188, 3307, 3426, 3206, 2985, 2576, 2167, 2504, 2842, 3154, 3466, 3303, 3139, 2403, 1667, 1491, 2130, 2123, 2117, 2824, 2716, 2935, 3153, 3117, 3081, 3190, 3298, 3254, 3209, 2702, 3010, 3658, 3490, 3573, 3656, 3212, 2769, 2903, 3036, 3170, 3304, 3238, 3172, 3310, 3448, 3269, 3089, 3335, 3580, 4130, 3866, 3857, 3847, 3740, 3634, 3323, 3013, 3085, 3156, 3024, 2892, 2992, 3093, 2853, 2614, 2629, 2645, 2456, 2268, 2306, 2344, 2586, 2827, 2933, 3039, 2695, 2351, 2283, 2622, 3420, 3402, 3105, 3215, 2841, 2468, 2654, 2840, 2822, 2804, 2867, 2930, 2993, 3055, 2766, 2477, 2663, 2849, 2911, 2974, 3241, 3508, 4057, 4606, 4136, 3667]
5218C667j1j2k14k15j40j39O4O4k41k42R8R8J28J28K81K81M33l81l56N1l27l28L10L09k17
5206C089k17K58K59M7M7k92k92K26K25j14j14K32K32K9K8L7L6L7L7j24j23j24j23J65J65l9
5193C587l8j2j2L27L28l22l22J8J7J%JJK2K2K1K2J6J5J6J5K07K06m04m05M4M3M4M4l3l3l3
5176C403l2M60M61j51j50l12l12j08j08J35J36J35J36k2k2m97m97M10M09K05K06K99K98R5
5164D577R6k60k60n6n6l11l11K9K9N2N2k87k88L24L24j6j6K04K04%%P7P7k63k63L0K9K34K34
5150D185j23j23l27l26n9n9K81K81o3o3k66k67QQQQK08K08MMK13K14j25j26p5p4j01L08K29
5135C990K30l56l56k07k07m37k9M15M15l07l06Q8Q8M28M27M02M03k26o34j03L05QPK27m53
5123C812r6L11M4M5J20k87m21j3K07K08l0l1k34k34J56J55m8m8o6o5m0l9k7L80J51J51K45
$$ y = [3667, 3656, 3644, 3430, 3215, 3075, 2936, 3000, 3064, 2823, 2581, 2679, 2777, 2905, 3033, 3314, 3595, 4028, 3647, 3291, 3342, 3015, 2687, 2997, 3306, 3089, 2872, 3130, 3389, 3436, 3483, 3191, 2899, 3125, 3350, 3236, 3122, 3354, 3586, 3615, 3643, 3680, 3716, 3753, 3790, 3666, 3543, 3419, 3296, 3461, 3626, 3587, 3549, 3537, 3525, 3852, 4180, 3858, 3536, 3554, 3571, 3572, 3572, 3573, 3574, 3596, 3618, 3639, 3661, 3677, 3692, 3708, 3723, 3930, 4136, 3732, 3327, 3371, 3414, 3458, 3502, 3469, 3436, 3403, 3371, 3831, 4292, 4141, 3991, 3679, 3367, 3259, 3151, 3286, 3422, 3557, 3693, 3671, 3649, 3152, 2655, 3065, 3474, 3679, 3885, 4184, 4482, 4577, 4673, 4413, 4153, 4097, 4041, 3730, 3419, 3448, 3477, 3529, 3581, 3294, 3006, 3330, 3654, 3638, 3622, 3826, 4030, 4030, 4030, 4107, 4184, 3921, 3658, 3688, 3717, 3951, 4185, 4062, 3939, 3612, 3286, 3227, 3168, 3449, 3730, 3667, 3604, 3338, 3071, 3079, 3087, 3095, 3103, 3311, 3519, 3523, 3527, 3740, 3954, 3829, 3703, 3628, 3554, 3453, 3761, 3990, 4220, 3864, 3508, 3301, 3094, 2657, 2628, 3043, 3458, 3151, 2845, 2933, 3021, 3449, 3876, 4278, 4681, 4455, 3821, 3718, 4023, 4031, 4038, 4265, 3812, 3716, 4027, 4071, 4116, 4236, 3949, 3528, 3515, 3722, 3930, 3900, 3869, 3635, 3401, 3557, 3712, 3664, 3616, 3550, 3485, 3445, 3406, 3379, 3759, 3910, 4061, 4306]
5109D306K45J34k73j47j46k40M39M18J1L33p4m71o4n90j82M6o32j32N48n5n5K17j90k41k42
5097B963R8R8p9L29L54n4n42j34O30O30l01l01N65J58l35P3mmP17L09k08k09l44l44Q8Q9L35
5083D577l44n30j23J82J83j32j31m8m8J56J56J22J22q2q1K9L0j75j74K42K41L8L8j24j25J05
5070D104J05m17j0L30p8J71J71J71J71l30P8P8l30N6N5m03Nk80k80l56L22O81k71m40K38M17
5057C958J0l30l30J32J31M29M29R7n81n82R8K25K25M96Q9l60l61Q9Q9K39K39J54k54k88J20
5044D163L41L40p4p4J29J30m56m57K66K65L34p3k94k94l83K4K71K71k59k58k33k33K98P05
5032D449R4l14qqk12k11l18R0K93j14J53J53J28J27J32J32k08k07Q5Q5J36k71k29J78p6p6
5019C983L17L18N47J39j07j07m46m47l38O9N70J63l60M8L80L79r0m96k68k67N05N04L0L0J6
$$ y = [4306, 4551, 4685, 4412, 4265, 4119, 3879, 4318, 4736, 4747, 5080, 5006, 4535, 4471, 3881, 3699, 3745, 3113, 2981, 3529, 3474, 3419, 3636, 3446, 3205, 2963, 3061, 3159, 3080, 3409, 3763, 3709, 3167, 3033, 3663, 4293, 3992, 3691, 4256, 4414, 4079, 4152, 4148, 4144, 4861, 5170, 4962, 4753, 4409, 4065, 4153, 4242, 4577, 4233, 3703, 3580, 3762, 3945, 3813, 3682, 3634, 3586, 3742, 3898, 4020, 4142, 4060, 3979, 4008, 4038, 3863, 3689, 3931, 4172, 4210, 4248, 4124, 3999, 4104, 4209, 3792, 3782, 4112, 4034, 4205, 4376, 4547, 4718, 4388, 4466, 4544, 4214, 4270, 4325, 3922, 3927, 3647, 3367, 3011, 3333, 4014, 3743, 3303, 3541, 3958, 3968, 3638, 3308, 3440, 3571, 4000, 4429, 4526, 3945, 3363, 3461, 3686, 3911, 4407, 4496, 4136, 3775, 3864, 3953, 4192, 4431, 4585, 4331, 4043, 4163, 4504, 4844, 4770, 4696, 4825, 4955, 4499, 4042, 4308, 4573, 4907, 4834, 4540, 4246, 3863, 3887, 4158, 4429, 4170, 3912, 3679, 3446, 3744, 4449, 4543, 4229, 4221, 4213, 4001, 3790, 3472, 3562, 3855, 3741, 3894, 4047, 4175, 4302, 4434, 4566, 4358, 4151, 4236, 4321, 4457, 4186, 3957, 4135, 4059, 3983, 4300, 4618, 5165, 5304, 5197, 5090, 4644, 4197, 3859, 3928, 4498, 4661, 4301, 4349, 4729, 5108, 5018, 4522, 4254, 3987, 4492, 4996, 5026, 5056, 5072]
5007E072J7J7J7K29K29K04K03L58n0n43n42m54m6M47M46J91k17m46l8P6l31p7p7J44J44j95
4994D778j96N5N4n5m63p2p1J07J06JJk5k5M29K2k93J15q5L23K97K98M00pO1O0m61K18j90j89
4979E193N96J89m05m05q25J25M31K4j13j14R1R0K35O42J67k40l91l90p6p6O0N9L74L74K02
4967E817k06j21j20o73K79M65k15j8j8N0M58onK0K0M6M6j59j58k55k56J6l92j31N48L70l8
4953E364J03J02L32p6m32k5J78k28J23N31J67k42k96k97J8J8L9L9L9L9J68J69j71j71K74K75
4940F040P1P0lmk08k08m45m46L0L0J58J57L61L61j3j2j91j90k35J73J48n32j12K97K4K4j1
4926E334j2L28L28l56l55J20J20K35K36l76l76k35k36l1l2J55J55J54J55m0m0m1m0R6R6L00
4913E642L00N8N7j46j45L31L32qqj99j99NMp9q0q0q0n9n8L91L91K7l82k19M59J62k46j77j78
$$ y = [5072, 5089, 5106, 5123, 5352, 5581, 5785, 5988, 6346, 6296, 5753, 5211, 4757, 4711, 5158, 5604, 5795, 5578, 5132, 5094, 5170, 4839, 4762, 4685, 4829, 4973, 4778, 4582, 4637, 4691, 4636, 4173, 4101, 4030, 4137, 4243, 4244, 4245, 4220, 4195, 4624, 4646, 4353, 4468, 4383, 4706, 5003, 5301, 5701, 5694, 5755, 5815, 5354, 5572, 5382, 5193, 5789, 5978, 5573, 5168, 4343, 4468, 4899, 4923, 4810, 4696, 4787, 4877, 5112, 5754, 5921, 5681, 5290, 4900, 4824, 4748, 4808, 4867, 5241, 5615, 5817, 5611, 5490, 5370, 4697, 4976, 5441, 5226, 5208, 5190, 5240, 5698, 5692, 5687, 5707, 5727, 5773, 5819, 5660, 5502, 5247, 4991, 5007, 4615, 4484, 5032, 5402, 5364, 5467, 5569, 5901, 5825, 5393, 5368, 5546, 5318, 5441, 5972, 6139, 5897, 5601, 5304, 5322, 5340, 5379, 5418, 5457, 5496, 5664, 5833, 5662, 5491, 5765, 6040, 6111, 6181, 6178, 6174, 5966, 5758, 5313, 4867, 4897, 4927, 5085, 5242, 5603, 5964, 5951, 5939, 5748, 5558, 5323, 5496, 5644, 5112, 5000, 5297, 5321, 5345, 5334, 5322, 5650, 5978, 5622, 5267, 5387, 5507, 5742, 5978, 5602, 5226, 4991, 4755, 4724, 4692, 4847, 5002, 5156, 5311, 5271, 5231, 5190, 5150, 5246, 5342, 5642, 5942, 6000, 6057, 5911, 5766, 6097, 6429, 6421, 6413, 6214, 6015, 6020, 6024, 5945, 5865, 5785, 5705, 5646, 5588, 5979, 6370, 6397, 6015, 5796, 6255, 6417, 6171, 5994, 5816]
4899E816o8o8J35J35K33K33l78l79J95J95J95J94j11j11j10j11q3q2K31K32J81k27m22K57
4887F082M69k10L7L6l12R6K91l88j43N37j08n16q8L20O6O6k6k6k6k5L52L52L8L8l02J06L01
4873G017l78j79N01J01l05j13j13l67l68L97j1k23M56N55l96k00M78J6J6N8N9j48j47P3M81
4861G260L5l73Q6Q6r1r1k53k53K8P07R5n83J12J13K48K48L6l71O1O2k83k83m86J92O09K01
4848G112lM05M26k53k95k96j72K35M13k66m35k7J76J76L42L41j59j59L35p2l01J06J57k51
4836G535l09l10qL99L74l05o57k50m6m6O8O9L23q5j73K34k25k24K25K26N40N39K51j56l52
4823G637L27J49n30l35P3L61L62l61l60o6o7K73K73K22K22M4M4k46J61J53n26m37K43j83j82
4811G251L93L93k19k18k56k57L55L54N3N2K56K56P3P4j30j31k11k12k12k11M25M25M25M25
$$ y = [5816, 5748, 5680, 5815, 5950, 6183, 6416, 6038, 5659, 5854, 6049, 6244, 6438, 6327, 6216, 6106, 5995, 5912, 5830, 6061, 6293, 6474, 6247, 5825, 6082, 6551, 6341, 6378, 6414, 6102, 6198, 6489, 6101, 5958, 6495, 6387, 5871, 5783, 6103, 6169, 6235, 6209, 6183, 6157, 6132, 6484, 6836, 6874, 6912, 6610, 6716, 7017, 6639, 6460, 6961, 7062, 6757, 6644, 6531, 6164, 5796, 6193, 6182, 5959, 6415, 6970, 6574, 6374, 6852, 6868, 6884, 6942, 7001, 6853, 6706, 6779, 7260, 7295, 6922, 7008, 7094, 7003, 6912, 6659, 6406, 6434, 7141, 7236, 6653, 6765, 6878, 7126, 7374, 7410, 7039, 7100, 7162, 6879, 6596, 6110, 6302, 6911, 7112, 7109, 7514, 7940, 7687, 7392, 7096, 6924, 7159, 7572, 7306, 6871, 6844, 7020, 7196, 7538, 7879, 7720, 7561, 7896, 7824, 7523, 7629, 7786, 7535, 7226, 6916, 6908, 7307, 7681, 7376, 6719, 6469, 6423, 6377, 6445, 6514, 6837, 6752, 6579, 6813, 6588, 6364, 6589, 6815, 7355, 7894, 8145, 7989, 7637, 7964, 8113, 7583, 7248, 7321, 7682, 8044, 7683, 7323, 7257, 7190, 7463, 7736, 7958, 8180, 8224, 8268, 8022, 8183, 8336, 7810, 7373, 7616, 7433, 7251, 7644, 8037, 7818, 7600, 7344, 7087, 7442, 7796, 7849, 7901, 8157, 8413, 8486, 8560, 8430, 8299, 8088, 7876, 7664, 7453, 7878, 8303, 8728, 9153]
4798I153k33k33m37m37M34M33m2m1L36L37k74k74ppk79J29K59m21k17M62N34J27N9N9o5o5
4785I290n40n41J43J43J43J43K87K88n2n3j62j63j63j62J92J91K60j48m66K13J0RO05O06j41
4773I932j42j0rl50l49k3k3k3k3J21J21q2q3M1M0M1M0J68J68J68J68L1L1j73j72Q6Q6K90K90
4758A0360l18l18K93K93j6j7j7j7p3p4K66K67q2q2J89k17k61M19N80J73m05m04M5M6p3p2p3
4745A0412p2l0l0l0l0Q6Q5j35N44J41n38j14j14J47J46J47J46m4m5m5m4R3R4N68N69p6p7k80
4731A1474k80j13j12j13j13K31K31K31K31j06j06l78K9M79j99k26J83L35L35j15j14N5N5J23
4719A2017n57m6L60j14j15M28M29K25K25m57m56j17j16L07L08L08L07K9K9K8K9k85k86L26
4707A2806L26k19k18K57K57J0J1j93j93LML43L43k18k17J22J22r6r7l00l00o2o2N49N48k6
$$ y = [9153, 8920, 8687, 8250, 7813, 8247, 8680, 8638, 8597, 8933, 9270, 8996, 8722, 8715, 8708, 8429, 8558, 8817, 8396, 8179, 8641, 9175, 9302, 9361, 9420, 9355, 9290, 8750, 8209, 8352, 8495, 8638, 8781, 9068, 9356, 9304, 9251, 9089, 8926, 8763, 8601, 8793, 8984, 9244, 9096, 8630, 8843, 8853, 8862, 9467, 10073, 9932, 9790, 9780, 9771, 9421, 9072, 9049, 9026, 9003, 8980, 9101, 9222, 9140, 9057, 9098, 9138, 9179, 9219, 9387, 9555, 9723, 9891, 9922, 9953, 9780, 9608, 9694, 9780, 10070, 10360, 10042, 9724, 10017, 10310, 10294, 10277, 10260, 10243, 10170, 10096, 10362, 10629, 10547, 10465, 10654, 10437, 10176, 10595, 11175, 11348, 10943, 10539, 10584, 10630, 10557, 10485, 10412, 10340, 10310, 10280, 10250, 10220, 10306, 10391, 10256, 10800, 10941, 10403, 10289, 10175, 10322, 10468, 10615, 10761, 10717, 10672, 10627, 10583, 10676, 10770, 11338, 11907, 11831, 11754, 11474, 11194, 11081, 10969, 10856, 10743, 10974, 11205, 11436, 11667, 11561, 11455, 11077, 11106, 11585, 11386, 11160, 11343, 11678, 12013, 11898, 11784, 11839, 11894, 12017, 11460, 11414, 11774, 11660, 11545, 11973, 12402, 12627, 12852, 12395, 11939, 11822, 11706, 12013, 12321, 12629, 12936, 12965, 12994, 13022, 13051, 12766, 12480, 12806, 13132, 12913, 12695, 12952, 13209, 13219, 13230, 13037, 12844, 12847, 12851, 13194, 13537, 13319, 13102, 13224, 13346, 13250, 13153, 12853, 12553, 12491, 12429, 12978, 13526, 13500]
4694A3500k6k05k04l5L73J86m93o2o1j29K78O6O6K96K95R3R4K55K55q5p63n60J19K34K34J66
4681A3887k41K56K55J62N70K09m71m70K09M93Q6k54k54M18M18J72k36k31k31m86p9P9P8j93
4668A4146j93K40R19L07l71J7J7k5k6J32J31l18l18k82J27L30p8K0K1onR2R3j12j11M87M87
4655A5721j24j25p4p4K65K65m0m0J89k19o7o8l47O0N14J07j15j14q0q0n4n5j01L06O45K39
4642A6534J86J86l15l15J48J47L77l0L1L1l34l34j81j82P4l34j33K75M5l62J77J77j88j88
4630A5492L14L15K05k03l7l8o3o3J98J97opj46j46K61K61k32k31N58j21m18m18K19K18k50
4617A5859k50J57J57O4O4M72M71l56l56l57l56n9n9K12j95j29N50k65k65J30J29p4p4l03l03
4605A4864O47O48J59J60n20n19o8o8o8o8L73L74L73L74k21k20k21M58M12Mj31j32L6L5j68
$$ y = [13500, 13474, 13269, 13065, 13030, 13403, 13589, 13096, 13034, 12973, 12844, 13122, 13188, 13254, 13550, 13845, 13938, 14032, 14287, 14542, 14457, 13694, 13134, 13253, 13487, 13721, 13887, 13646, 13902, 14157, 14319, 14889, 15098, 14627, 14157, 14366, 14859, 14945, 14691, 14437, 14855, 15273, 15445, 15209, 14978, 14747, 14261, 14182, 14261, 14339, 14146, 13953, 14193, 15112, 15419, 15048, 15065, 15082, 15057, 15031, 15163, 15294, 14976, 14658, 14376, 14503, 14833, 14755, 14775, 14796, 14790, 14785, 14877, 14970, 14858, 14747, 15234, 15721, 15597, 15472, 15398, 15324, 15589, 15854, 15814, 15774, 15963, 15744, 15677, 15609, 15262, 15322, 15836, 15943, 15828, 15714, 15634, 15554, 15500, 15445, 15344, 15650, 16295, 16534, 16720, 16906, 16591, 16276, 16424, 16571, 16948, 16918, 16949, 16980, 16646, 16312, 16131, 15949, 16023, 15689, 15556, 15831, 15876, 15514, 15691, 15868, 15680, 15492, 15806, 16121, 16326, 16123, 16086, 16048, 15985, 15922, 16120, 16317, 16311, 16304, 16158, 16012, 16273, 16534, 16302, 16071, 16629, 16508, 16090, 15672, 15891, 16109, 15859, 15609, 15766, 15923, 15987, 16051, 16523, 16994, 16638, 16282, 15925, 15569, 15510, 15451, 15663, 15468, 15339, 15889, 15624, 15359, 15489, 15618, 15544, 15470, 15167, 14864, 15511, 16159, 16318, 16478, 15958, 15439, 15371, 15303, 15235, 15167, 15540, 15914, 16287, 16661, 16440, 16220, 15999, 16457, 16869, 16873, 16742, 16610, 16646, 16681, 16513]
4592A6513j68m70m69m70m69P5P6P6P6l99m00N51N52L45L45o2o2K01K01k06k06l17l17l17l16
4580A4363k15k15J92J93L69L68L69L69k81k80J26J27k87k87q3q3l7l7m69m70J25k82n3O26
4568A4148N50J42k65k65o24o24L26L27l35l35L43L44NMj74n82R4R3K21O28N5l52k76k76j49
4555A3023K59K59j48j7j7J36J35q0m88q1L27j15j14L18L18k54k55J36N43M28n23n74J06K79
4543A3601j28k64k64llk8k9lm10n89R1M43L6j17N62M05k74n03n03k30J78J53J52M88M88M88
4530A3737j91m19j0J00R9J76k31m09m10K9K8k26J82p4m80K07K07m22j3J81m98k04M74M83P5
4517A2391J17J16n87n88J08J08J08J09k6k6J53J52P2l35p43l36P00P00Mm03j24j23j49j49
4505A1249j3j3j3j3K76K76j07j06j51K56j25n33j98K10K10j98r0L18k51k51l07J01J86J86
$$ y = [16513, 16345, 15875, 15406, 14936, 14467, 14542, 14618, 14694, 14770, 14371, 13971, 14522, 15074, 15419, 15764, 15702, 15640, 15841, 16042, 15836, 15630, 15313, 14996, 14679, 14363, 14148, 13933, 14125, 14318, 14687, 15055, 15424, 15793, 15512, 15232, 15358, 15485, 15198, 14911, 14828, 14745, 14708, 14671, 14202, 13732, 13857, 13575, 13522, 14148, 14698, 14840, 14575, 14310, 13686, 13062, 13388, 13715, 13380, 13045, 13388, 13732, 13737, 13741, 13567, 12985, 13079, 13172, 13393, 14021, 14076, 13724, 13448, 13172, 13023, 13282, 13541, 13393, 13376, 13359, 13495, 13630, 13550, 13062, 12981, 13308, 13193, 13079, 13397, 13715, 13461, 13206, 13342, 13885, 14313, 13790, 13216, 13322, 13601, 13473, 13209, 12945, 12942, 12939, 12911, 12882, 12879, 12469, 11880, 11971, 12414, 12450, 12333, 12895, 13300, 13026, 12523, 12020, 11790, 11968, 12121, 12273, 12761, 13249, 13737, 13546, 13127, 13117, 13217, 13316, 13492, 13261, 12852, 12442, 12471, 12499, 12273, 12455, 12381, 11901, 12108, 12315, 11893, 11880, 12061, 11563, 11359, 11833, 12316, 12391, 12508, 12624, 12037, 11449, 11557, 11665, 11773, 11882, 11856, 11830, 11983, 12135, 12207, 11872, 11129, 10793, 11493, 12193, 12197, 11794, 11670, 11547, 11398, 11249, 11236, 11223, 11210, 11197, 11473, 11749, 11642, 11536, 11385, 11641, 11516, 10983, 10785, 10995, 11205, 11007, 10917, 11235, 10984, 10733, 10426, 10527, 10713, 10899]
4493A0899L35p3o59k51N4M62N4N5K98K98R4R4m32m32J79J79l54l53K57K58r5r5l24Q4p3p4
4480A0385M10Lj54K54O6l41o04P5K37j71L04L04q33m26M23M24k7k6j4j4K9K9n00J79L66m1
4467A0337n9n8q4q4k89k89l58L22N55J48J99k09m06Jn0m9M8M8M8M8M54M54j57j57k55k54N9
4454I963O0K48j59l80l80l71L6L75l1J51J51l24l24J51N58j0j0K74K73m57m9K09j98j98K10
4441I768J63k45m23j5J67J67j1j1Q8Q7l71L7M69O2Q8Q8k50o57l34L45L11L11J07l00k0k1m78
4428I122p1j6j6L5L5l75L3K62j45o9L38Q4Q4k45k45k71J37l3l3J97J96j07j07j08j07M24M23
4414I422J77J77M72k08l95J3J31J32j83j82l28l27J2J2J65J65l10l10k18k18j5j4K11K10J85
4401H776J86K8l80k01K06M48M1j80j80L93L93k44k43P4l32l33P5L38L38l83K4L34l45n48J30
$$ y = [10899, 11234, 11161, 10502, 10251, 10305, 10767, 10821, 10876, 11174, 11472, 11566, 11660, 11228, 10796, 10975, 11154, 10800, 10447, 10704, 10962, 10867, 10772, 10448, 10532, 10459, 10385, 10795, 10798, 10644, 10898, 10964, 10623, 10019, 10094, 10331, 10160, 10464, 10768, 9935, 9509, 9932, 10356, 10329, 10303, 10289, 10275, 10304, 10333, 9833, 10012, 10378, 10337, 10278, 10220, 10136, 10052, 9763, 9474, 9116, 9438, 9993, 10141, 10340, 10131, 9725, 9726, 9676, 9627, 9675, 9723, 9771, 9819, 10273, 10727, 10570, 10413, 10158, 9904, 9963, 10023, 10271, 10112, 9732, 9352, 8981, 9017, 9392, 9361, 9512, 9663, 9339, 9015, 9166, 9724, 9714, 9704, 9978, 10251, 9794, 9745, 9954, 9756, 9558, 9768, 9931, 9686, 9263, 9248, 9415, 9582, 9571, 9560, 9648, 9735, 9364, 9401, 9870, 9932, 10020, 10108, 9858, 9201, 8867, 9212, 9523, 9834, 9941, 9641, 9621, 9600, 9122, 9051, 9035, 9019, 9054, 9089, 8714, 8747, 9009, 8864, 8795, 9133, 9217, 9301, 9056, 8811, 8540, 8677, 8644, 8611, 8808, 9004, 8897, 8790, 8682, 8575, 8999, 9422, 9599, 9776, 10248, 10040, 9645, 9658, 9789, 9921, 9738, 9556, 9228, 8901, 8913, 8925, 9090, 9255, 8945, 8635, 8417, 8199, 8184, 8170, 8381, 8591, 8776, 8962, 8990, 8610, 8409, 8615, 9063, 9104, 8924, 8744, 9137, 9530, 9286, 9043, 9117, 8785, 8452, 8527, 8865, 9203, 8820, 8844, 9178, 8833, 8285, 8415]
4389H415N53J45n59j52J15J16L70l7q6q6k90k90m4L64J09J10M31K5m52m3K4K4K5K4M59N2j69
4375I153j69k70J36J37k71m45m46L18P26K9L0K33K33M5l62l63M5k05k05J59J60k03k02KJQ2
4362H348Q2L37p1l61M6K24K24O3o16o16O3L52L52k43k43L05j02p73J77N69J61R3l14r4L14
4350H277L99L99l09l09J50k58qM00l30p38k87L92L92k87j98K09K78K77J07J06m79m79L18P27
4338H749L86k1J46J46q3q3l43l42j13j13k42J65o5o4L14L13m3m50k24J84K43K43n4m62m36
4325G751K43K49j58r0r0K83K83L7L8J38n41p69r1Q22M14j71j72p8L30L29p8l79l79K06K06
4313H333q9r0J14J14m3m3m3m3j40j41l0L77J69J70K20j88k57k58N6N6q4q3q4q4M08M09k03
4299H523k02m2m1m1m2j8j8k22k21J98J98L77L77J60k47l83l83J68k38m17K62M64N6L28L28
$$ y = [8415, 8968, 9113, 8554, 8402, 8517, 8633, 9003, 8966, 8880, 8794, 8504, 8214, 8170, 8534, 8643, 8753, 9184, 9209, 8757, 8714, 8738, 8762, 8787, 8811, 9270, 9322, 9153, 8984, 8714, 8850, 8987, 8716, 8271, 7825, 8143, 8869, 8898, 8928, 9161, 9394, 9439, 9077, 8714, 8759, 8554, 8349, 8508, 8668, 8465, 8263, 8265, 8266, 8348, 8430, 8767, 8696, 8335, 8381, 8605, 8829, 8892, 8276, 7660, 7723, 8075, 8427, 8184, 7941, 8246, 8144, 7371, 7548, 8117, 8278, 8371, 8057, 7963, 8277, 8676, 9075, 8766, 8457, 8607, 8349, 8341, 8741, 8411, 7673, 7386, 7778, 8170, 7883, 7685, 7894, 8172, 8449, 8556, 8662, 8183, 7704, 8022, 8749, 9135, 9114, 9260, 9406, 9323, 9240, 8897, 8555, 8442, 8329, 8087, 8252, 8187, 8123, 8437, 8750, 8707, 8257, 8033, 8217, 8460, 8703, 8649, 8187, 7751, 7994, 8243, 8085, 7995, 7905, 8188, 8471, 8508, 8546, 8684, 8143, 7374, 7283, 8105, 8519, 8348, 8176, 8098, 8428, 8757, 8679, 8300, 7921, 8127, 8333, 8244, 8154, 8268, 8382, 8339, 8296, 8253, 8210, 8070, 7929, 7899, 8276, 8445, 8615, 8835, 8647, 8390, 8132, 8188, 8244, 8160, 8077, 7993, 7909, 8317, 8726, 8523, 8321, 8279, 8238, 8197, 8155, 8137, 8119, 7897, 7676, 7874, 8072, 8449, 8826, 8986, 8739, 8356, 7973, 8141, 7903, 7486, 7748, 8212, 8268, 8596, 8924]
4287H924N3N2k87k88J25J24j30K77L41o7m06KK26j81m02m02J37J37j17K90K27j80j29j29J04
4274H301J04r9j00K00K00j39j40J41J40o3o3n6n5m89q1P6P5J02J01K89K89k79J28J91J92K17
4261I182K17l14l13k88k89l68L8N15J06q9r0j15j15J26J27l31P5M41L4m17rL39L39j11j10
4248H580K97K97m2m2q5q4l99l99j27K81R3n85j95j95J44N52q9q9M12M12J57J57j83j82l65
4236H321l65k6k5J44J44l31l31K99K98N02N02j5j6j6j5l68l68l17l17n29K85M39M38m0m1J63
4223H415J62j04j05l08l08J03J04L83k3o31J84N83N83J61J60m50m50j33j32o16J99M29K0j74
4211H052j75J86J87k81o88n24K92K83K83K36K37L2L3K4K4K4K5p0o9o9o9j62j61J78J78L60
4198H366L61L60L61l45l44l44l44P6P7P6P6J19J20k21k20m2m2J62J62M3M3M3M3j27j27j26
$$ y = [8924, 8977, 9029, 8742, 8454, 8579, 8703, 8573, 8850, 9191, 9124, 8718, 8720, 8946, 8765, 8363, 7961, 8098, 8235, 8118, 8408, 8635, 8455, 8326, 8197, 8301, 8405, 8306, 8206, 8406, 8606, 8467, 8327, 8468, 8608, 8545, 8482, 8426, 8371, 7882, 7801, 7877, 7952, 8054, 8155, 8444, 8733, 8454, 8582, 8773, 8965, 9182, 9399, 9085, 8772, 8484, 8195, 7827, 7865, 8380, 8486, 8397, 8307, 8192, 8077, 8203, 8330, 7999, 8074, 8515, 8549, 8132, 8123, 8462, 8801, 8690, 8580, 8877, 9174, 9132, 9090, 9005, 8921, 8522, 8123, 7996, 8277, 8370, 7785, 7590, 7395, 7539, 8091, 8002, 7913, 8325, 8737, 8894, 9051, 8868, 8686, 8321, 7956, 7930, 7905, 8049, 8193, 7862, 7531, 7830, 8128, 8630, 9132, 9117, 9101, 9085, 9070, 8702, 8334, 8017, 7700, 7171, 7456, 7895, 8333, 8293, 8252, 8415, 8577, 8473, 8368, 8060, 7752, 7855, 7959, 8342, 8319, 7688, 7872, 8455, 9038, 9199, 9359, 8909, 8459, 8326, 8194, 7578, 7777, 8206, 8226, 8052, 7877, 8063, 8250, 7969, 7281, 6757, 7049, 7332, 7615, 7851, 8088, 8120, 8153, 8177, 8201, 8225, 8250, 8180, 8111, 8042, 7973, 7811, 7650, 7828, 8006, 8366, 8727, 9087, 9448, 9103, 8759, 8415, 8071, 8147, 8224, 8300, 8376, 8495, 8615, 8394, 8174, 8132, 8090, 8252, 8414, 8457, 8500, 8543, 8586, 8459, 8332, 8206]
4185H206j27RRj95j95m6m6K93K94R4R4j10j10k5k5J79J79M88M87j23j23k51k51Q9Q9l82l82
4171H119j79j79l4l4L05L06J06J06r7r7J82J83k92k93K91K91m8m9K8K8K31K32j39j38L37L37
4158I503q8q7k92k91K46K45n01n01j88j87J7J6j41j40J99J99N17N17l65l66j23j24j24j23
4146G818J86J86k89J18N42j38n11M39K32m48ooR2R1j12j12M5M5K48K49r5r5k98k99Q0P9M19
4132H460M19r2r1r2r1j34j34P0O9j71j72j72j71L24L25n7n7M41k39k89J18J39J39J65J64l73
4119H498l74J01J02j49j49L26L27Q8Q7k51k52K0J9K0K0j55j56j55j55K77K78P4P3P9Q0K82
4106H955K83m34m35L13L12j04j04j05j04k53k53n0m9p9p9K35K35K27j81l59L20L70l7K35K35
4094I094j99j98ONk62k62n8n8J45J46J45J46N6N6N7N6JJk02k03p6p6p6p7j31j32P3P2m1m0
$$ y = [8206, 8079, 8088, 8097, 7902, 7707, 7661, 7615, 7908, 8202, 8296, 8390, 8280, 8170, 8145, 8120, 8299, 8478, 8966, 9453, 9330, 9207, 8956, 8705, 8794, 8883, 8501, 8119, 7940, 7761, 7727, 7693, 7998, 8304, 8410, 8516, 8419, 8322, 8504, 8687, 8395, 8102, 8393, 8684, 8636, 8587, 8615, 8643, 8874, 9106, 8967, 8829, 9166, 9503, 9415, 9328, 9036, 8745, 8991, 9236, 8735, 8234, 8046, 7859, 7876, 7892, 7751, 7611, 7810, 8009, 8526, 9043, 8678, 8312, 8189, 8065, 7941, 7818, 8004, 8190, 7901, 8019, 8561, 8423, 7912, 8351, 8583, 8135, 8129, 8123, 8215, 8306, 8194, 8082, 8127, 8172, 8420, 8669, 8574, 8479, 8181, 7882, 7962, 8041, 8460, 8879, 8787, 8696, 8604, 8513, 8379, 8245, 8315, 8384, 8213, 8041, 7869, 7698, 8022, 8347, 8290, 8233, 8674, 8435, 8146, 8264, 8403, 8542, 8707, 8871, 8498, 8124, 8225, 8327, 8178, 8029, 8355, 8682, 8770, 8857, 8606, 8354, 8374, 8393, 8413, 8433, 8278, 8122, 7967, 7812, 8089, 8367, 8441, 8514, 8593, 8673, 8955, 9238, 8804, 8369, 8682, 8994, 8890, 8786, 8681, 8577, 8324, 8071, 8021, 7972, 7893, 7814, 8049, 8284, 8511, 8330, 7971, 8291, 8661, 8624, 8859, 9094, 8895, 8697, 8703, 8708, 8446, 8184, 8126, 8068, 8213, 8359, 8504, 8650, 8706, 8762, 8819, 8875, 8876, 8877, 8675, 8472, 8396, 8320, 8244, 8167, 8036, 7904, 7977, 8049, 8008, 7968]
4079G968K99K99M26M26l20l21K04K05K6K7o8L41M3o36k70J37O9O9k8k8k9k8j66j67J73J74
4066H825J39J39J39J40o7o6k71k70L88L87k24k23J67J67m45m44L1L1L1L1J44J44J44J44J65
4053I346J66j75j74klkkm5m5m5m5L43L42LLk26k26k3k3L5L5k37J71K42m36q44m36J99O07M45
4038H948k34k08k08K25K24K59K59k17k17j57j58M7M6K45K45r5r5K36K36l74l75q7q6K53K53
4026H965M06M06O7O6n39n40k00j99K33K33K33K33pppoM4M4j60j59M47M48n72n71L37L37kl
4011I527m96m96L87L87o7o7k71k71MMNMK42K42K42K42j14j15R0Q9o4o3o4o3N8N9K62K63l36
3997I620l36M6M5l08L70M22J4j60j60j85j86j23j22K16K17k5k5k6k5R4R4R3R4K97K98j7j7
3983A0205j68K39l72p79j47j47N7N7kM06M06km8m8m9m55j89j88J26N33N80j00m13m13mM04
$$ y = [7968, 8267, 8566, 8992, 9418, 9098, 8777, 8981, 9186, 9212, 9239, 9171, 9512, 9555, 8919, 8649, 8786, 8855, 8924, 8896, 8868, 8839, 8811, 8645, 8478, 8651, 8825, 8964, 9103, 9242, 9382, 9315, 9249, 8978, 8708, 9096, 9483, 9259, 9036, 9203, 9370, 8925, 8481, 8512, 8543, 8574, 8605, 8749, 8893, 9037, 9181, 9346, 9512, 9337, 9163, 9161, 9158, 9156, 9154, 9109, 9064, 9019, 8974, 9317, 9659, 9662, 9665, 9439, 9213, 9190, 9167, 9202, 9237, 9000, 9171, 9413, 8977, 8133, 7697, 7896, 8503, 8948, 8714, 8506, 8298, 8523, 8747, 9006, 9265, 9048, 8831, 8674, 8516, 8563, 8609, 8854, 9099, 9004, 8909, 9145, 9381, 9007, 8632, 8545, 8459, 8712, 8965, 9371, 9777, 9844, 9910, 9371, 8831, 8631, 8432, 8665, 8898, 9131, 9364, 9357, 9350, 9343, 9337, 9381, 9425, 9265, 9106, 9553, 10001, 9429, 8858, 9195, 9532, 9530, 9527, 9031, 8535, 8922, 9309, 9242, 9175, 8904, 8633, 8637, 8641, 8646, 8650, 8892, 9134, 9376, 9618, 9504, 9389, 9479, 9568, 9504, 9441, 9377, 9314, 9372, 9431, 9693, 9956, 9620, 9284, 9330, 9375, 9067, 9437, 9859, 9873, 9713, 9553, 9368, 9182, 9059, 8937, 9153, 9370, 9345, 9320, 9294, 9269, 9363, 9457, 9550, 9644, 9941, 10239, 10222, 10205, 10037, 10276, 9904, 9125, 8978, 8831, 8888, 8945, 8943, 9349, 9755, 9753, 9705, 9657, 9608, 9153, 8964, 8776, 8902, 9435, 10015, 9915, 9502, 9089, 9085, 9489]
3970I489J74J75k54k54K38O46K84j24m7m8m29k2L18q9l85l85j89K18L37p1OOk56J51J26J26
3957I741K03K02K54j54j60K48M4l63l63M4L59m9m49m48J37J37K65K65O0O1k04k04K96K96k68
3945I950J40J39k68rj0L05L05P9Q0r8r9m35k7M64k14p8p9l24l25L46L45J42J41J04J03pm14
3931A0256O5O6J4J4L80k8J75J76J90k18m21j4J90J90K15K16m87m87R8R9J11k96m48m2L1Q46
3918A0891O68j47k49k49r6r6m56m56K91K91L51L51j17n24o76J38K23j84M87M86m22m22l08
3907I775l09J67J67K3K3l17l17M09M08K05K05R9R9R9R8k25k26L85L85j66j67j66j67j46j47
3894A0194L28L29j38j39j38j39L6L6j60n67n29K87L71l7M52M52Q7Q7K44K44M0M0N1N1N1N1
3881A1584k29k30K46K47r2r2r2r2r6r6m36m35K07K07L61L60K50n66q9P25J84J85k8q43j89
$$ y = [9489, 9663, 9838, 9584, 9330, 9568, 10214, 10498, 10374, 10327, 10279, 9850, 9828, 10146, 10057, 9672, 9287, 9098, 9316, 9653, 9582, 9588, 9594, 9338, 9489, 9615, 9741, 9944, 10146, 10400, 10246, 10086, 10334, 10378, 10015, 9652, 9696, 10055, 10006, 9557, 9109, 9246, 9383, 9648, 9913, 9973, 10034, 9830, 9626, 9922, 10218, 9950, 10090, 10229, 9961, 9952, 9942, 10247, 10552, 10631, 10711, 10613, 10514, 10079, 10052, 10516, 10302, 10224, 10145, 9821, 9496, 9842, 10187, 10329, 10470, 10574, 10677, 10670, 10256, 10321, 10387, 10401, 10415, 10795, 10767, 10942, 11118, 11308, 11090, 10669, 10655, 10845, 11035, 11250, 11466, 10979, 10492, 10590, 10689, 10800, 10504, 10056, 10014, 10045, 10891, 11559, 11412, 11163, 10914, 10818, 10722, 10266, 9810, 10101, 10392, 10743, 11094, 10977, 10453, 9777, 9915, 10138, 9954, 10441, 10927, 10505, 10083, 9775, 9466, 9633, 9800, 9823, 9846, 9529, 9212, 9621, 10029, 10234, 10439, 10538, 10637, 10736, 10834, 10609, 10383, 10768, 11153, 10987, 10820, 10654, 10487, 10341, 10194, 10522, 10851, 10713, 10574, 10436, 10297, 10333, 10369, 10209, 9642, 9113, 9400, 9771, 9734, 10186, 10638, 10725, 10812, 11056, 11300, 11340, 11380, 11431, 11482, 11533, 11584, 11355, 11125, 11371, 11618, 11526, 11434, 11342, 11250, 11154, 11058, 10622, 10187, 10394, 10601, 10962, 11322, 11572, 11006, 10917, 11642, 11826, 12011, 11983, 11140, 10951]
3868A0951K18j13K95M22J5l42l42K95K94m4m5j51j50N3N4j34j33K06K06J02J02l73l73k6k5
3856A0962M50M51k04k03N43j35m41l4J70J70L3L2m43m44J30J30J30J30l1l1k35k35L55L56
3844A1606p8L30J80J80j34j34k18k19l2L75M82m69o30M9J38J38N88r1l98J0K13K14k0k0M13
3831A2473M13P6o04m75M75J69p81r4N85J98J98k35k35O3O2O2O2o1o2l16R2L54n3l84l84J06
3818A1704N12O3l45p7L30L05j03p2p1l01l00K46K47M3M3l38l39J36J37K63K64k11k12j8j8
3806A1888O7M75K49j58j07j07R5R4O9P0J11k96k96J12K20K20M3M2K5K5j%L33p5k78J29J50
3792A3099J50k74k74k17J90Mo76J82J82J39J40J26J27J27J26l65l66j79N00O19o1m76p0j11
3780A2642j12J18J18r0q9J15J14J48J49n5n6j93j93J46J47o6o6J38J38J99J98nop3p3J05J05
$$ y = [10951, 11169, 11056, 11351, 11773, 11788, 11446, 11104, 11399, 11693, 11649, 11604, 11453, 11303, 11356, 11410, 11276, 11143, 11349, 11555, 11657, 11759, 11386, 11013, 10987, 10962, 11412, 11863, 11659, 11456, 11999, 11864, 11423, 11389, 11559, 11729, 11762, 11794, 11351, 10907, 11037, 11167, 11297, 11427, 11396, 11365, 11130, 10895, 11250, 11606, 11528, 11858, 12038, 12218, 12084, 11950, 11732, 11513, 11481, 11856, 12338, 11869, 11239, 11288, 11426, 11564, 12152, 12061, 11663, 11673, 11886, 12100, 12080, 12060, 12473, 12886, 12962, 12358, 11883, 12358, 12527, 11746, 11652, 12237, 12435, 12633, 12398, 12163, 12226, 12288, 12350, 12412, 12351, 12289, 11973, 12065, 12419, 12366, 11982, 11598, 11704, 12216, 12279, 11934, 11857, 12187, 12492, 12389, 12317, 12246, 11945, 11645, 11891, 12138, 12181, 12224, 11886, 11547, 11683, 11820, 12083, 12347, 12136, 11924, 11906, 11888, 11955, 12430, 12679, 12521, 12414, 12307, 12402, 12496, 12565, 12635, 12746, 12450, 12154, 12266, 12486, 12706, 12749, 12791, 12816, 12841, 12840, 12840, 13173, 13098, 12820, 12949, 13099, 13249, 12975, 12701, 12484, 12674, 12678, 12002, 12184, 12366, 12505, 12645, 12771, 12898, 13025, 13151, 12786, 12420, 12241, 12741, 13360, 13299, 12823, 12753, 12642, 12530, 12648, 12766, 12676, 12587, 12702, 12816, 12964, 13113, 13058, 13002, 12809, 12616, 12762, 12909, 12843, 12777, 12915, 13053, 13252, 13450, 13445, 13439, 13366, 13293, 13398, 13503]
3767A3503K62j46q00j20P28L21J17J18n22n21L61L61J41J40l34l35J83J84K51j56m91J87k20
3755A3212k19K31K31K8K7K7K8K7K8M87M86j07p87m34K45J60J60J35J36l40l40j91j91J48J48
3742A3335J35J34J34J34k26k27J13J13j10j09L65L66q0q1q0q0J15J15q9q9L05L06J02J02l37
3730A4366l37j34j34k77k78J12J13p49O6P19L12O6O6L79L80j27j27l06l06J45N52M92l23o53
3718A4017J61L65m50j91O24J40k67N9N9O0N9M3M50O79j36k51k51L8L8MMLMn43n44O7O8K84
3704A4593K84n6n5k53k53m9n0M48M47j64j63o0o0o0o0l8l9L01L01j98j98K77K78o2o3J42J41
3690A5331O7O6j29n37p4P41q2q2QQRQ%%%jl5l5J69J68M70M70n48n49k39k39K36K36P29P29
3675A6895m26m26K36K35L2L1m52m52M30M31K22K22k54k53l00l00r6r7L87L86L87L86m07m07
$$ y = [13503, 13765, 13619, 12819, 12699, 13427, 13748, 13865, 13983, 13461, 12940, 13301, 13662, 13803, 13943, 13609, 13274, 13457, 13641, 13892, 13736, 13245, 13432, 13212, 12993, 13224, 13455, 13483, 13510, 13537, 13565, 13592, 13620, 14107, 14593, 14486, 13699, 13265, 13510, 13670, 13830, 13965, 14101, 13761, 13421, 13230, 13039, 13187, 13335, 13470, 13604, 13738, 13872, 13646, 13419, 13532, 13645, 13535, 13426, 13791, 14157, 14077, 13996, 13916, 13836, 13951, 14066, 13977, 13888, 14193, 14499, 14601, 14703, 14366, 14029, 13895, 13761, 13484, 13206, 13318, 13431, 12682, 12748, 13467, 13779, 13845, 13911, 14290, 14670, 14543, 14416, 14110, 13804, 13949, 14501, 14993, 14670, 14017, 14178, 14543, 14093, 13902, 14526, 14666, 14399, 14458, 14517, 14577, 14636, 14679, 15129, 15808, 15672, 15421, 15170, 15208, 15246, 15250, 15254, 15257, 15261, 14718, 14174, 14241, 14309, 14593, 14877, 14821, 14766, 14513, 14260, 14211, 14161, 14609, 15056, 14892, 14729, 14669, 14609, 14549, 14489, 14451, 14412, 14713, 15014, 14816, 14618, 14895, 15173, 15111, 15048, 15190, 15331, 15398, 15464, 15335, 14798, 14724, 15465, 15383, 15301, 15309, 15317, 15326, 15334, 15334, 15334, 15334, 15333, 15298, 15263, 15432, 15600, 16070, 16540, 15992, 15443, 15204, 14965, 15201, 15437, 16166, 16895, 16469, 16043, 16279, 16514, 16546, 16577, 16125, 15673, 16103, 16534, 16756, 16978, 16724, 16471, 16171, 15871, 15775, 15678, 16065, 16451, 16838, 17224, 16817, 16410]
3663A6410o8o7J91J92j48j48j01j01J02J03L7L6L7L7K11K10k64k65J28J27k12k12K38K38j02
3651A6609j02L2L2K36K35j54j55j55j55j20j20j20j20M48M49k7k7j0rJ93J94K7K6p6p5l58
3638A6698l58j70N08J47n31K32K33n9n8j60j61J2J2K15K16J94J94rrK32K33k43k42K0K1K0
3624A7187K0k0j9L19L20P7P6o7o8M37k41m71K08N6l52k34J75j17n24J13N20K59K58K17m63
3612A7666k93J14M6M7K70K70o9o9j12j11L63L64m15m15p6p5J02J03L06L07k82k81J51J52J21
3599A8184n57m04KL72L73p8p8K40K41r9r9j03j02L73L73M2M2j61j62j63j63M1M0j71j72K79
3586A8090K78J19k88k79L99N05j73l18Q9K0K0M6M5J26J26J26J26RRJ0Rl60l60J15J16J98J98
3573A9001J98J99j93j92J1J2Q7Q8Q8Q8k52k52m8m8K05K05K05K05M68M68k79k79j34j35j35
$$ y = [16410, 16342, 16275, 16466, 16658, 16510, 16362, 16261, 16160, 16262, 16365, 16402, 16438, 16475, 16512, 16723, 16933, 16669, 16404, 16532, 16659, 16447, 16235, 16473, 16711, 16609, 16507, 16539, 16571, 16807, 17042, 16888, 16733, 16578, 16423, 16303, 16183, 16063, 15943, 16391, 16840, 16813, 16786, 16776, 16767, 16960, 17154, 17181, 17207, 17131, 17056, 16698, 16340, 16170, 16678, 16825, 16294, 16526, 16759, 16700, 16642, 16482, 16321, 16333, 16345, 16560, 16776, 16970, 17164, 17155, 17146, 17378, 17611, 17368, 17126, 17146, 17167, 17187, 17207, 17187, 17168, 17487, 17807, 17884, 17960, 17893, 17825, 18262, 18021, 17550, 17758, 17814, 17462, 17228, 17403, 17286, 16762, 16875, 17395, 17654, 17912, 18129, 17666, 17373, 17487, 17533, 17580, 17850, 18120, 18051, 17982, 17870, 17759, 18122, 18486, 18071, 17656, 17580, 17505, 17607, 17710, 18016, 18323, 18041, 17760, 17911, 18063, 18184, 17627, 17223, 17225, 17597, 17970, 17892, 17814, 18054, 18295, 18196, 18097, 17994, 17892, 18265, 18638, 18680, 18722, 18561, 18399, 18236, 18073, 18114, 18154, 17983, 17811, 18090, 18368, 18487, 18199, 17920, 18319, 18824, 18651, 18333, 18422, 18442, 18462, 18508, 18553, 18679, 18805, 18931, 19057, 19066, 19075, 19085, 19094, 18734, 18374, 18489, 18605, 18803, 19001, 19199, 19398, 19205, 19013, 19024, 19036, 19123, 19211, 19299, 19387, 19135, 18883, 18835, 18787, 18992, 19197, 19402, 19607, 20075, 20543, 20264, 19985, 19851, 19716, 19581]
3560A9581j34l3l3l2l3R5R5k44k45K06K05K05K06M90M90k58k57M0M0j64j64J32J31J31J31
3548B0581j19j19j20j19J3J2J2J3K0K1j83j83N93N92k91k90K44K44M0M1n7n7k61k61j76j76
3535B0014M09M10K5l82m3L65M15M16J01J02l25l26j21K86J21n59n84j76J19J19J19J20P77
3523B1402L69j48j48k18k18l03L76N75j03j29j29j16K92L17r0q1L26k86o92k15J94o2o1K7
3511B0879K8K8K8R8R8R8R8j99j99K76K76m1m1M4M51J42k66j1j2k15k16R8R8M21J3L9L8J37
3497B2188J36J11J11Q1l26n05r7o9L37J60k48l66l67L72P80M22J6k06k05J81J81p4L34K77
3485B3224j30n97n97m15pL75L75N04N05N30J22j41j41j66j66j7j7j6j7r3r3J11J10k12k13
3472B2818L98L98k13k13J27J26q7q8J16J17K64K65p5p4n2n1k81J27r4r4L73l06l73N77P47
$$ y = [19581, 19447, 19414, 19381, 19349, 19316, 19411, 19506, 19262, 19017, 19223, 19428, 19633, 19839, 20329, 20819, 20561, 20304, 20344, 20384, 20220, 20056, 20188, 20319, 20450, 20581, 20462, 20343, 20223, 20104, 20117, 20129, 20141, 20154, 20174, 20195, 20012, 19829, 20422, 21014, 20723, 20433, 20677, 20921, 20961, 21002, 20945, 20888, 20627, 20366, 20190, 20014, 20423, 20833, 20858, 20476, 20433, 20798, 21213, 21629, 21730, 21832, 21507, 21181, 21060, 21346, 21467, 20908, 20324, 20148, 20267, 20386, 20505, 20625, 21402, 21771, 21623, 21475, 21257, 21039, 20736, 21112, 21687, 21584, 21455, 21326, 21210, 21502, 21819, 21729, 21648, 21974, 21688, 20996, 20781, 20975, 20913, 20852, 20879, 20907, 20935, 20963, 21061, 21159, 21257, 21355, 21156, 20957, 21233, 21509, 21468, 21427, 21471, 21922, 22064, 21798, 21787, 21775, 21560, 21344, 21442, 21540, 21961, 21974, 22013, 22051, 22188, 22324, 22435, 22546, 22627, 22301, 21796, 21699, 21630, 21967, 22127, 21879, 21513, 21146, 21518, 22298, 22720, 22736, 22530, 22325, 22506, 22687, 22613, 22947, 23224, 23094, 22497, 21900, 21485, 21478, 21853, 22228, 22732, 23237, 23767, 23889, 23748, 23607, 23441, 23275, 23258, 23241, 23225, 23208, 23115, 23022, 23133, 23243, 23031, 22818, 23216, 23614, 23401, 23188, 23315, 23441, 23354, 23266, 23382, 23499, 23763, 24028, 23953, 23879, 23827, 23776, 23495, 23622, 23528, 23434, 23807, 23501, 23128, 23705, 24452]
3460B4452O9n35j27j95j95J82J81m7L60k05k04J35J35J48k59J74J73k00j99K50K50J16k91
3448B4168J67J68k96J13k96k95J23N30N31J23K21K20k80k80m14m14L6L6J89k19m22j5L17L17
3436B4328K9K8Q8M96M44k35l85l85J83J84M42M42J03n76j68K39n8n8L11r6n72j64K64K63Q6
3424B5233l23j39N39K17m62k34M46M03k76M2M3k04M75L12r6k82J25M73O6l85K4L00L01j4o92
3411B5892q6L22j53j54j4j4K40j68o5L42Q8Q7j82j83K2K1k21k20J19J19L84L84k27k27J5J5
3398B6136J5J5J67J67J07l00q48l3L67L66K03K02%jK58K58q2q2m5m6m5m6J93J92J92J92j22
3385B7380j22K18K18m07m06K05K05k2k2J81J82k13k13k14k13K24K24K1K0k34k35K41K41j19
3372B7140j20r4r4q6L22N51k64l4l4K55K55K68K68k08k08o3o4k67k67J11J10J11J11o5o4k69
$$ y = [24452, 24521, 23986, 23859, 23664, 23469, 23651, 23832, 23785, 24145, 23940, 23736, 23871, 24006, 24154, 23895, 24069, 24242, 24042, 23843, 24093, 24343, 24459, 24168, 24335, 24503, 24207, 24320, 24024, 23729, 23852, 24382, 24913, 25036, 25257, 25477, 25197, 24917, 24503, 24089, 24125, 24161, 24350, 24131, 23709, 23694, 24011, 24328, 24357, 24385, 24473, 24969, 25413, 25178, 24793, 24408, 24591, 24775, 25217, 25659, 25762, 25186, 25018, 25257, 25199, 25141, 25452, 25356, 24784, 24620, 24884, 25147, 25233, 24910, 24771, 25310, 25527, 25065, 24831, 25277, 25680, 25404, 25446, 25489, 25285, 25760, 26072, 25976, 25694, 25819, 26292, 26358, 25973, 25997, 26297, 26598, 26584, 25892, 25806, 26128, 25975, 25821, 25807, 25793, 26033, 25865, 25800, 26142, 26230, 26317, 26135, 25952, 25974, 25995, 25774, 25554, 25673, 25792, 26176, 26560, 26333, 26106, 26121, 26136, 26151, 26166, 26333, 26500, 26607, 26307, 25459, 25426, 25793, 26159, 26362, 26564, 26564, 26563, 26821, 27079, 26997, 26915, 26870, 26824, 26779, 26733, 26926, 27118, 27310, 27502, 27380, 27258, 27476, 27694, 27287, 26881, 27086, 27291, 27269, 27247, 27428, 27610, 27397, 27184, 26970, 26757, 26981, 27205, 27226, 27246, 27012, 26777, 27018, 27259, 27140, 27020, 26926, 26832, 26746, 27068, 27619, 27355, 27321, 27287, 27542, 27797, 28065, 28333, 28125, 27917, 27854, 27790, 27523, 27256, 27367, 27477, 27588, 27699, 27634, 27570, 27301]
3359B7301k68K37K37L3L3M83M83QPk94k93r0r0l5l5l5l5L09L09J05J05k7k8l67l67P0P1P0
3345B7897P0O53O52o8o9L3M40J95o21j57j57k09k08N5N5N5N6j4j4m90m89J26J26M66M66J34
3332B8983J35k05k05J41J41j98j99J60J60N8N9J05J04k34k35RRJ53J53k81L97O01p8m88m88
3320B8757n5n4N31N31L78l0M40k39q00J51M57k23j20j21J56J55k3k3p0L38M91j89J%J62J62
3307C0763p2p1m11m12N2N1k88k88J70J71l4l3K88K88Q4Q5o9o8m08m08L34L33noM9M9K53K53
3293C0650j88j89j88j89j76j76L00K99J12J12K73K73L40l38l89J8L47L46l76l75J15J15K16
3281C0932K17k17k17J47J48l36P1J23n57J04J03O1O1J91J91j4j3j56j56k42M38M21k58l8l7
3269C0967m8m9k51k52J04J05P9P9N8l49n28J51L89j8M9N0K12K12j28j27J10J10k30k29K12
$$ y = [27301, 27033, 27270, 27507, 27540, 27573, 28056, 28539, 28547, 28554, 28260, 27967, 27877, 27787, 27752, 27717, 27682, 27647, 27956, 28265, 28370, 28475, 28448, 28420, 28053, 27686, 27756, 27827, 27897, 27967, 28620, 29272, 29204, 29135, 29168, 29608, 29803, 29182, 29025, 28868, 28659, 28451, 28506, 28561, 28616, 28672, 28658, 28644, 28154, 27665, 27791, 27917, 28383, 28849, 28983, 29118, 28913, 28708, 28849, 28990, 28792, 28593, 28753, 28913, 28971, 29030, 29135, 29239, 29005, 28770, 28779, 28788, 28941, 29094, 28813, 29210, 29811, 29733, 29245, 28757, 28702, 28648, 29179, 29710, 30088, 30058, 30498, 30259, 29459, 29610, 30067, 29844, 29724, 29603, 29759, 29914, 29891, 29868, 29798, 30136, 30627, 30438, 30439, 30439, 30601, 30763, 30691, 30620, 30209, 29797, 29849, 29900, 29612, 29324, 29494, 29665, 29631, 29598, 29886, 30174, 30258, 30343, 30274, 30206, 29798, 29390, 29724, 30057, 30052, 30046, 30095, 30144, 30397, 30650, 30462, 30273, 30085, 29896, 29720, 29544, 29844, 30143, 30255, 30367, 30640, 30913, 31253, 30915, 30526, 30544, 30891, 31237, 30861, 30486, 30601, 30716, 30932, 31149, 30932, 30715, 30862, 31010, 30674, 30745, 30868, 30311, 30415, 30518, 30579, 30640, 30831, 31022, 31008, 30995, 30839, 30683, 30441, 30879, 31300, 31042, 31004, 30967, 30919, 30870, 30619, 30367, 30471, 30576, 30655, 30734, 30792, 30443, 29915, 30066, 30455, 30437, 30486, 30536, 30748, 30960, 30832, 30705, 30815, 30925, 30695, 30466, 30678]
3256C0678K12QQj40j40m63K16N36j42J79J80j17j17j18j17L36L36j40j39J9K0K23K24k25k25
3243C1092j23j23K23K22K0J9J45J45n8n8r3r2J0Rk38k39j36j37j96j96J26Q06M95j85r9j00
3230C1239Q3Q3Q4Q3J70J70l4l4l75l75K35K36r6r6L1L1k03K05O98J8k42k41l86l86J23J23
3217C1144J24J23j10j10qqj13j12L63L63k34k35j84j84r4P20M65M66n14n14R8R7QQRQj67j67
3203C1242J73J72l1l1l1l1M0M0j63j64K69K70K18K18N76k39q50l6k7k7K4K4J25J25p9p9N3
3190C1781N2K57K56j40j41O3O4Q8Q9j15j15j49j49N5N5rrrrj30j30P4P4L16L15k95k96k80
3176C1563k81p7p7k38k38N08N09n12n12R1M98lq17q8L20K00K00l85l86J66J66O41O42M5M4
3163C1979j59j59J56J55m56m56L4L4K38K38J95J96m16m16j54j53J86J85j83j83j58j58J09
$$ y = [30678, 30890, 30898, 30906, 30766, 30626, 30163, 30379, 30915, 30773, 30952, 31132, 31015, 30898, 30780, 30663, 30999, 31335, 31195, 31056, 31075, 31095, 31318, 31542, 31317, 31092, 30969, 30846, 31069, 31291, 31311, 31330, 31475, 31620, 31562, 31504, 31411, 31319, 31329, 31338, 31100, 30861, 30725, 30588, 30392, 30196, 30322, 31128, 31623, 31438, 31339, 31239, 31322, 31405, 31489, 31572, 31742, 31912, 31878, 31844, 31469, 31094, 31329, 31565, 31469, 31373, 31404, 31435, 31232, 31437, 32135, 32153, 31911, 31670, 31284, 30898, 31021, 31144, 31268, 31391, 31281, 31171, 31163, 31155, 31042, 30930, 31293, 31656, 31422, 31187, 31003, 30819, 30725, 31445, 31910, 32376, 31862, 31348, 31446, 31543, 31551, 31559, 31568, 31576, 31409, 31242, 31415, 31587, 31556, 31525, 31494, 31463, 31503, 31543, 31380, 31216, 31485, 31755, 31973, 32191, 32767, 32528, 31678, 31642, 31615, 31588, 31612, 31636, 31761, 31886, 31807, 31728, 31781, 31833, 32090, 32346, 32206, 32065, 32128, 32192, 32280, 32369, 32254, 32139, 31990, 31841, 31896, 31951, 31942, 31933, 31924, 31915, 31785, 31655, 31729, 31803, 32119, 32434, 32139, 31843, 31563, 31282, 31205, 31128, 30890, 30652, 31160, 31669, 31157, 30645, 30736, 31234, 31231, 30414, 30326, 30646, 30846, 31046, 30661, 30275, 30441, 30607, 31248, 31890, 31935, 31979, 31820, 31661, 31817, 31972, 31516, 31060, 31094, 31128, 31366, 31604, 31799, 31995, 31579, 31163, 31009, 30856, 31042, 31227, 31044, 30861, 30703, 30545, 30654]
3152C0654N17M32l82j71K37m4m3k1k1L18L19l86l86m7m6L5L5L5L5P8P7N2N3l7m45k58M22K34
3138C1246K35K35K34K11m69m95q7n7L51j93j93K23K24k09k09j50N30L76l0r9r9j24j24M53
3126C1780M53k3k2p10p10J73J73J39J39J39J39j92j93k34k35K71m09Q4M91q6q5o1o0j92j92
3113C0577j92j92k28k28k28k28M34M34K31K30K83K83m64m64j84j84K91K92K02K02n45n44J1
3101B9789J1K15K15J52J52J51J52k18k18j4j3M2M2j61j62k46k46m3m2Q3Q3j21j20J68J68j72
3088B9647j71M07M06o8o9k25k26o4o5M06k73J51J51j16N62m8p28k27k28K05K05j72j73J67
3076B9454J67M1M1M0M1m0m0J64J64k48k48m4m4J98J97m13m14J01J01J00J01j92j92J1J2L84
3063B9442L84M4M5k45k44R6R5j40j40J99J99m12m11l44O3Q02J23k16M62M2l65J11J10n4n4
$$ y = [30654, 31171, 31603, 31221, 31050, 31287, 31243, 31200, 31179, 31158, 31476, 31795, 31409, 31023, 30976, 30930, 30965, 31000, 31035, 31070, 31148, 31225, 31277, 31330, 31293, 30848, 30590, 31012, 31246, 31481, 31716, 31950, 32161, 31692, 31197, 31110, 31053, 31404, 31211, 31018, 31241, 31465, 31256, 31047, 30897, 31427, 31803, 31773, 31674, 31575, 31451, 31327, 31780, 32233, 32210, 32188, 31478, 30768, 30941, 31114, 31253, 31392, 31531, 31670, 31478, 31285, 31051, 30816, 31087, 30678, 30762, 31253, 31167, 31082, 31021, 30961, 30769, 30577, 30385, 30193, 29965, 29737, 29509, 29281, 29715, 30149, 30380, 30610, 30893, 31176, 30712, 30248, 30064, 29880, 30171, 30463, 30665, 30867, 30322, 29778, 29789, 29800, 30015, 30230, 30382, 30534, 30685, 30837, 30619, 30401, 30387, 30374, 30416, 30458, 30297, 30135, 29889, 29643, 29600, 29558, 29641, 29724, 29603, 29483, 29651, 29819, 29647, 29476, 29883, 30289, 30221, 30152, 29927, 29701, 29637, 29572, 29978, 29705, 29856, 30007, 29891, 30453, 30405, 29677, 29450, 29222, 29427, 29632, 29460, 29287, 29454, 29621, 29662, 29703, 29743, 29784, 29744, 29704, 29868, 30032, 29784, 29536, 29492, 29448, 29646, 29843, 29430, 29016, 29117, 29218, 29318, 29419, 29227, 29035, 29046, 29058, 29442, 29826, 29870, 29915, 29670, 29426, 29522, 29617, 29477, 29337, 29536, 29735, 29323, 28912, 28568, 28631, 29433, 29556, 29340, 29802, 29844, 29479, 29590, 29700, 29646, 29592]
3051B9592m78K01J97m83k61k62J92J93j1j2OONOk0j9k0k0J0J0j94j94K4K4K4K3l58l58L89
3036B8212L88N2N2N2N2Q6Q6Q5Q6l33l33n38n37P0P0P0P0N3N3N3N3j68j68j08j09k84O66N14
3022B8245j66m46m46L95L95K92K92l19l19l27l27J48J48L86L85M6M7m04m04L43L44k7k8n02
3010B7751n02q7q6L89j9r4N85J78k30J2l95q1L26p9p9n4n4j68j69L5L6l6l6l75l76M40M39
2997B7271j71j72R9R9k41k40J0RJ0J0J61J60j79j79m21m21N4N5K51K52M8M8k9k8r7n04n46
2983B5309J33N91J84m6L62L11r6k2m29m54m8M88M88j41j40K69m10p92J59M60N3J37J38k56
2971B6248k56k55k56j58j58M53M53J90J90m22m21k30k30L81L80j62j63j63j63r9r9P9P9J38
2959B5356k69j08N72K83j25j93j92k81k80p7L31Q82K03n26j20om15M5M4j39j38j38j39j37
$$ y = [29592, 29114, 29315, 29512, 29029, 28768, 28506, 28698, 28891, 28880, 28868, 28874, 28880, 28885, 28891, 28871, 28852, 28832, 28812, 28822, 28832, 28638, 28444, 28468, 28492, 28516, 28539, 28181, 27823, 28212, 28600, 28652, 28704, 28756, 28808, 28894, 28980, 29065, 29151, 28818, 28485, 27947, 27410, 27480, 27550, 27620, 27690, 27743, 27796, 27849, 27902, 27734, 27566, 27458, 27349, 27065, 27731, 28245, 28079, 27633, 27187, 27582, 27977, 28269, 28561, 28242, 27923, 27596, 27269, 27417, 27565, 27951, 28336, 28382, 28429, 28025, 27621, 27964, 28308, 28281, 28253, 27751, 27249, 27162, 27076, 27465, 27446, 27352, 27937, 28115, 27885, 27897, 27502, 27421, 27747, 27668, 27589, 27535, 27481, 27313, 27144, 27179, 27215, 27179, 27143, 26768, 26392, 26832, 27271, 27100, 26928, 27027, 27126, 26885, 26645, 26655, 26664, 26674, 26684, 26845, 27005, 26826, 26647, 26226, 25805, 25859, 25914, 26165, 26417, 26465, 26513, 26484, 26456, 26359, 25855, 25309, 25442, 26033, 26217, 26171, 26533, 26844, 26748, 26726, 26297, 25843, 25795, 26283, 26771, 26630, 26490, 26759, 26349, 25557, 25716, 26176, 26229, 26366, 26504, 26248, 25992, 25737, 25481, 25323, 25165, 25618, 26071, 26261, 26451, 26029, 25608, 25378, 25148, 25529, 25909, 25747, 25584, 25421, 25258, 25159, 25060, 25139, 25218, 25356, 25087, 24979, 25551, 25834, 25709, 25516, 25324, 25043, 24763, 24686, 25017, 25899, 26102, 25576, 25456, 25450, 25035, 25080, 25124, 24985, 24847, 24709, 24570, 24433]
2947B4433j37O6O7Q7Q8j16j16N2N1L91L91k45k46m49m49R0R0K94K94pqpqj21j20Q2Q3M0M1
2932B4611l00k99J9J9K0J9J25J25p8p9j92j92J2J1K92K92m55m56K26K26K3K2j14j13K26K26
2919B4216O2O1j42j42J84J85j55j55j63j64j63j64K57K57N3N3r6r7n72n72j30j31P3P4L19
2907B2948L19k1k0j18j18j18j18j01j01l05l05n0n0J11J11N54j26KM09P9l30p4p5KKk02k02
2893B2103Q7Q7Q7Q6J89J89j4j5J59J59j54j55n48j39M28l86k50k50m7m6o42J73O48j66K20
2881B1803K19J69J69l30l30j26j26L45L45J41J42j02j02m41m41O4O4O4O4K50K51K59n55l31
2869B1465P6m07m07llO09O08q4q3q4q3j78j78J61J62m3m2m2m2P2P2j32j32J78J78k97k98o7
2854B0976o7J37J36l05l04J70J71j99j99J41J40K60K59N6N5m66m66k63k63k4k5J78J79j21
$$ y = [24433, 24296, 24362, 24429, 24516, 24604, 24488, 24372, 24424, 24475, 24866, 25257, 25012, 24766, 24317, 23868, 23958, 24048, 24342, 24636, 24629, 24621, 24614, 24606, 24485, 24365, 24447, 24530, 24570, 24611, 24311, 24012, 24031, 24050, 24070, 24089, 24214, 24339, 24261, 24182, 23990, 23798, 23810, 23821, 24113, 24405, 23950, 23494, 23720, 23946, 23969, 23991, 23877, 23764, 23990, 24216, 24278, 24339, 24197, 24055, 24239, 24424, 24269, 24114, 23951, 23787, 23624, 23460, 23717, 23974, 24027, 24080, 23984, 23887, 23315, 22743, 22613, 22482, 22555, 22629, 22948, 23267, 23246, 23226, 23108, 22990, 22872, 22754, 22653, 22552, 22247, 21942, 21892, 21842, 21953, 22064, 22618, 22492, 22494, 22903, 22982, 22652, 22578, 22503, 22505, 22507, 22305, 22103, 22190, 22277, 22364, 22450, 22639, 22828, 22814, 22799, 22958, 23117, 22963, 22808, 22260, 22121, 22549, 22163, 21913, 21663, 21616, 21570, 20928, 21101, 21749, 21583, 21803, 22022, 22191, 22360, 22030, 21700, 21574, 21448, 21793, 22138, 22279, 22421, 22319, 22217, 21776, 21335, 21399, 21463, 21527, 21591, 21841, 22092, 22351, 21796, 21465, 21541, 21134, 20727, 20724, 20721, 21330, 21938, 21854, 21771, 21687, 21604, 21426, 21248, 21409, 21571, 21528, 21486, 21444, 21402, 21474, 21546, 21414, 21282, 21460, 21638, 21341, 21043, 20976, 20909, 21046, 21182, 20877, 20573, 20743, 20914, 20715, 20516, 20657, 20797, 21057, 21316, 21372, 21427, 20961, 20495, 20232, 19969, 19945, 19920, 20098, 20277, 20156]
2842B0156j21l25l25L62L63K3K3j97j98OOM4M5M4M4Q8Q8j15j16N0N0N0N0j04j04j04j04j34
2828A9545j34j33j34J95J94k80k81l9l8J65J65k84k84L27L28mmJ75J74j49n56q2L27l1l0n
2815A9127mj47j47j47j47L75L75j00j01k32k33k32k33P3P3P3P3L59L60K49j59j50j49J38J39
2803A9233l7m45m45l8R9R8q0p9RRRJ0J02J03J28J28j38K69K44m35k02K06l81l80R8N04j74
2789A8415j74k85J23M62N5m0m1m05m06J29J29J30J29k53k53k27k28k10J97M18M18K93j14o4
2777A8198o3m07%k29k29M23M22r5n03L00K99k27k26L84k3m99r1L17L16j58j59K44j63o39k31
2765A6961J1J1J1J1N96J89k86J21j63j64K02K02k59k59n5n5J06J07r8r7k42k41J23J24l18
2752A6538Q9M29K2Q0Q0j49j50J3J2k43J65K65j42J55J55m94J85L2l76J52J52l49l49k22k21
$$ y = [20156, 20035, 19710, 19385, 19747, 20110, 20133, 20156, 19959, 19761, 19767, 19773, 19817, 19862, 19906, 19950, 20038, 20126, 20011, 19895, 19945, 19995, 20045, 20095, 19991, 19887, 19783, 19679, 19545, 19411, 19278, 19144, 19339, 19533, 19253, 18972, 18933, 18895, 19060, 19225, 18941, 18657, 18984, 19312, 19308, 19304, 19479, 19653, 19504, 18948, 18866, 19193, 19162, 19132, 19127, 19123, 18976, 18829, 18682, 18535, 18910, 19285, 19185, 19084, 18852, 18619, 18387, 18154, 18227, 18300, 18373, 18446, 18805, 19165, 19414, 19255, 19105, 18956, 19094, 19233, 19196, 18751, 18306, 18268, 18367, 18465, 18385, 18306, 18315, 18324, 18333, 18343, 18445, 18548, 18676, 18804, 18666, 18935, 19179, 18744, 18542, 18748, 18367, 17987, 18085, 18589, 18415, 18241, 17956, 18079, 18541, 18596, 18556, 18515, 18110, 17704, 17833, 17962, 18092, 18221, 17968, 17715, 17488, 17260, 17050, 17247, 17665, 18083, 18376, 18262, 18198, 18135, 17728, 17728, 17499, 17270, 17693, 18115, 18020, 17517, 17817, 18116, 17889, 17663, 18047, 18024, 17525, 17434, 17751, 18067, 17909, 17750, 17994, 17831, 17192, 16961, 16972, 16983, 16994, 17005, 17601, 17790, 17504, 17625, 17462, 17298, 17500, 17702, 17443, 17184, 17129, 17074, 17180, 17287, 17189, 17092, 16850, 16609, 16732, 16856, 16538, 16627, 17056, 17078, 17158, 17238, 17089, 16939, 16952, 16964, 16721, 16886, 17151, 17009, 17164, 17319, 16825, 17010, 17042, 16666, 16818, 16970, 16621, 16272, 16050, 15829]
2740A5829k22k22L30L30K45j62p8L30N0M9L54n5j64j65K69K68L9L9k16o24l95l95k08k08K68
2727A5286K67J25J26R9J00J80k27n66j59M87M87J56k52q2L26R7l11k06k06k7k8j17j16M52
2715A5891M4r3r4j19j19L0K9Q1l27m85p8K54K53jm09J77N85j20n28m3m4m00PR33K53l25Q3
2701A5435k91J17P95m26n54j47k6k5K03K04L8L8L7L8R7R6j07j08k05k05jkj87j87J53J52j53
2688A4779j53J87J86j27j28P6P6q9q9K50K50j69j70j69j69j7j6j6j7K45K44r5r5K36K36j03
2675A5143j03m7m6m6m6P3P2k67k66j85j84j58j59k7L80P63Q3k94J13M5M5j03j03l07l07L6
2662A4105L7L7L7k82k82p7p8K54K54l57l57N35N34k12k13r7r7J07N14L87k92m54m53k92L88
2649A3646O17o3k0L88J16J16j66j65j65j65J49J48l26l27K05K05m06m06J63J62m1m1j25j25
$$ y = [15829, 15607, 15385, 15715, 16045, 16290, 16128, 16050, 16380, 16430, 16479, 16833, 16778, 16614, 16449, 16718, 16986, 17025, 17064, 16848, 16224, 15829, 15434, 15226, 15018, 15286, 15553, 15678, 15804, 15903, 16003, 16183, 15956, 15390, 15231, 15718, 16205, 16361, 16109, 16027, 16353, 16450, 16139, 15933, 15727, 15700, 15672, 15555, 15439, 15891, 15935, 15842, 15748, 15629, 15510, 15540, 15569, 15650, 15323, 14838, 14760, 15014, 15267, 15266, 14857, 15034, 15619, 15499, 14971, 14928, 14884, 14484, 14491, 15424, 15677, 15352, 15435, 15144, 15261, 16056, 15630, 15076, 14929, 14903, 14878, 15081, 15285, 15323, 15361, 15398, 15436, 15533, 15629, 15522, 15414, 15209, 15004, 15003, 15001, 14814, 14627, 14780, 14932, 14779, 14626, 14813, 14999, 14872, 14744, 14820, 14896, 14807, 14718, 14968, 15218, 15049, 14879, 14710, 14541, 14524, 14508, 14492, 14475, 14720, 14964, 14869, 14774, 15010, 15246, 15143, 15040, 14993, 14947, 14901, 14855, 14928, 15000, 14733, 14467, 14282, 14098, 13940, 13781, 13754, 14134, 14897, 14980, 14686, 14799, 14844, 14889, 14786, 14683, 14376, 14069, 14105, 14142, 14179, 14216, 13934, 13652, 13575, 13497, 13751, 14005, 13648, 13291, 13826, 14360, 14148, 13935, 13838, 13741, 13848, 14362, 14749, 14457, 14003, 13550, 13258, 13646, 14263, 14200, 14180, 14568, 14684, 14800, 14634, 14469, 14304, 14139, 14288, 14436, 14110, 13783, 13988, 14193, 13787, 13381, 13544, 13706, 13665, 13624, 13499, 13374]
2637A3374K15K14k43k44o6o5L51n6n74J06K58j49n6n6j44K63K38K38j3j2k33o41j2L95J65
2625A3253J66k24J82J83k25q0q0n5m63j35K72j61j61Q6M94J28k79K35j72m02Nk62k61j94j94
2612A1656J4O93L37p1N3N3j76j76p0p1J60J59j19K89K88j19L9L8j91j91j96j95K79K80j45
2600A2618j44l66L14J24n56R9R8j14K93m11m11O0N9K63K63QRo0L48N53j27n8n9j05j05j05
2586A2488j05j89j88J5J6L6L7K23O31K46p05r09M2N64J56j23K83o5o5m0m0K19K20k57k56n7
2573A2177n7J73J72j37K70M1M1j58j57k09K00J22k85l0l0l17l18K2M29M68k12l73L5q9q8J41
2560A1831J40l94l94n4n5j8j9K03O09J81k26l11l12K4K4K4K3K4K4k74k73j84M95L42o6P1P0
2547A1505M5M5J98J98l2l1L2l75l75L2o2o3j1j1J20N28o6o7J77k31jjj76j75k43J64J67n11
$$ y = [13374, 13589, 13803, 13560, 13316, 13250, 13185, 13536, 13480, 12906, 13012, 13270, 13121, 13065, 13009, 12865, 13128, 13366, 13604, 13591, 13579, 13346, 12705, 12693, 13088, 13253, 13419, 13195, 13377, 13560, 13335, 13255, 13175, 13120, 12657, 12522, 12794, 12633, 12472, 12558, 13052, 13180, 12901, 13136, 12964, 12562, 12567, 12305, 12044, 11850, 11656, 11670, 12363, 12700, 12629, 12682, 12735, 12559, 12383, 12313, 12242, 12402, 12561, 12442, 12731, 13019, 12900, 12939, 12977, 12786, 12595, 12399, 12204, 12483, 12763, 12618, 12474, 12108, 12422, 12546, 11990, 12089, 12187, 12073, 12366, 11955, 11544, 11604, 11663, 11926, 12189, 12197, 12206, 12146, 12494, 13047, 12920, 12862, 12803, 12698, 12593, 12488, 12383, 12194, 12006, 12021, 12037, 12073, 12110, 12333, 12964, 13210, 12505, 11596, 11638, 12202, 12358, 12235, 12518, 12453, 12388, 12348, 12308, 12527, 12747, 12490, 12234, 12177, 12120, 12293, 12465, 12328, 12598, 12639, 12680, 12522, 12365, 12156, 12356, 12478, 12193, 12163, 12133, 11816, 11498, 11520, 11949, 12417, 12205, 11832, 11867, 11778, 11690, 11831, 11971, 11577, 11183, 11129, 11074, 11056, 11037, 11240, 11849, 12030, 11804, 11493, 11181, 11205, 11229, 11253, 11276, 11300, 11324, 11050, 10777, 10593, 11088, 11430, 11364, 11435, 11505, 11550, 11595, 11793, 11991, 11959, 11928, 11960, 11585, 11210, 11242, 11180, 11117, 11106, 11095, 11215, 11743, 11677, 11610, 11787, 11556, 11555, 11554, 11378, 11203, 10960, 11124, 11291, 10780]
2533A0780k83L97N96N96k61o69j61K47pqj56j56M7M7J6J6K19K20KLLLo5o6k69k70O6O6R1l16
2518A0728k61k60J89J89J0J1n7L50K22m57j35N45q0p58j05N74L1L1P3P3J71J71j68j69L06
2505A1224L05j70j70m38m37J74J73r7r8p3p2l4L73L22l57J88J89n9n8j85j86J9J8n0m9k53
2492A0199k54K48K47L33l47l99K80l48l49L27L27L26L27k63k63K12K12j15j15m54m54K08K08
2481A0093NNJ11J10r3r3j61j60j87j86J74k33k07M71N43J34O7O7J01J01j03j02m1m0l54l54
2468I668j21K87M81j97n20J60L29p9n92j84M27J9o27k20M09M09J83J84J84J83m05m06K06K06
2455I984o2o1k66k65L48L48k64k63K33K34K33K33m93m94N25N25m63m64k60k60N31N31m87m87
2443I136P7P8P7P7J61J60j79j79N5N4m21m21J57J58L61L61k72k71o8o7N2N2N3N2L87L88k24
$$ y = [10780, 10497, 10894, 11490, 12086, 11825, 11156, 10995, 11242, 11235, 11227, 11071, 10915, 10962, 11009, 11025, 11041, 11260, 11480, 11482, 11485, 11488, 11491, 11426, 11360, 11091, 10821, 10887, 10953, 11044, 10728, 10467, 10207, 10396, 10585, 10595, 10606, 10549, 10899, 11121, 10664, 10529, 11074, 10994, 10236, 10131, 10705, 10736, 10767, 10840, 10913, 11084, 11255, 11087, 10918, 11224, 11529, 11359, 11189, 10751, 10314, 10488, 10661, 10564, 10466, 10393, 10321, 10287, 10660, 10982, 10625, 10813, 11002, 10943, 10885, 10700, 10514, 10533, 10551, 10501, 10452, 10199, 9945, 10193, 10440, 10773, 10426, 10027, 10307, 9959, 9610, 9937, 10264, 10590, 10917, 10654, 10391, 10603, 10815, 10700, 10585, 10131, 9677, 9885, 10093, 10098, 10103, 10214, 10324, 10231, 10138, 9977, 9817, 9630, 9444, 9618, 9385, 9178, 9649, 10192, 10326, 10393, 10460, 10561, 10662, 10559, 10457, 10416, 10376, 10022, 9668, 9547, 9834, 10315, 10118, 9598, 9758, 10087, 10008, 9416, 9232, 9659, 9678, 9051, 8831, 9240, 9649, 9832, 10016, 10200, 10383, 9978, 9572, 9778, 9984, 9922, 9861, 9595, 9330, 9678, 10026, 9762, 9499, 9732, 9966, 10199, 10432, 9939, 9445, 9970, 10495, 10032, 9568, 9308, 9048, 9579, 10110, 9623, 9136, 9213, 9291, 9368, 9445, 9606, 9766, 9587, 9408, 9463, 9517, 9096, 8675, 8832, 8990, 9351, 9712, 9440, 9169, 9101, 9034, 9086, 9138, 9191, 9243, 9630, 10018, 9794]
2430I794k23l01l02J75J74O0N9k79k80j5j5j4j5K87K87R1l16k07O07K42n73l09l10k1k1L61
2417H936L61l86l86L95L95J92J91l8l8k42k41P6P7j27j27K49K48K49K49m9m8m8m9m09m09p0
2404H951p0j50j50m9P67O55j60k61k62j01j00j00j01O0O0O0O0j78j78K46K47L93m21p61N4
2391H511L00L00j25j24j87j87K88K88j02j02m2L64K31n85k70N45M38l76l77M39J31o85k00
2380H473K07L39L39j37j36O1l47pM00J29J29j85j86q1q1J22J23j84j83j83j83N6N7N6N6o6
2367H588o7o7o6l18l17M05M04K43j64O5O5J19J20k20k20RJ0RRl16l17m95m94M26Q34K65m14
2353H096j47K60J67J67N58J50r6r6L9L9l01l01J24J23N48j31n78J01l49l49L72l5k39k39l95
2341G488K83L34p3m8m7p4p3Q6Q6L15r2k96k96j44j43M15Qj97K11J56J56M20k60n66L84O3l46
$$ y = [9794, 9571, 9270, 8968, 9143, 9317, 9377, 9436, 9157, 8877, 8862, 8847, 8833, 8818, 9105, 9392, 9483, 9167, 8960, 9567, 9809, 9236, 8927, 8617, 8596, 8575, 8936, 9297, 8911, 8525, 8920, 9315, 9507, 9698, 9660, 9622, 9380, 9139, 9215, 9292, 9165, 9038, 9287, 9535, 9784, 10033, 9984, 9936, 9888, 9839, 9430, 9021, 8951, 8881, 8731, 8581, 8532, 9299, 9954, 9794, 9533, 9271, 9170, 9070, 8970, 8869, 8929, 8989, 9049, 9109, 8931, 8753, 8999, 9246, 9639, 9218, 8457, 8511, 8811, 9111, 8986, 8862, 8675, 8488, 8776, 9064, 8962, 8860, 8818, 9182, 9413, 8828, 8558, 9103, 9541, 9165, 8788, 9227, 9358, 8673, 8473, 8680, 9019, 9358, 9221, 9085, 9146, 8799, 8792, 9192, 9321, 9450, 9265, 9079, 8998, 8917, 9039, 9162, 8978, 8795, 8612, 8429, 8485, 8542, 8598, 8654, 8588, 8521, 8454, 8388, 8070, 7753, 8158, 8562, 8805, 8641, 8706, 8771, 8890, 9010, 8790, 8570, 8579, 8589, 8598, 8607, 8291, 7974, 7479, 6985, 7411, 8245, 8510, 8096, 7949, 8209, 8376, 8543, 9101, 9251, 9155, 9059, 9098, 9137, 8836, 8535, 8659, 8782, 9330, 9199, 8621, 8722, 8373, 8024, 8396, 8361, 8122, 7883, 7488, 7771, 8105, 8032, 7984, 7937, 7863, 7790, 7876, 7962, 8277, 8185, 7889, 7593, 7449, 7306, 7721, 7729, 7532, 7743, 7899, 8055, 8475, 8215, 7649, 8033, 8096, 7750]
2327G750J6M23Q3l24l85K2M71M72K00m79p1p2j44K62K63j45l90l91o0L47M57N0J26J26k40
2314H367J69J68k39O8O8M2M3l74l73j70j70k03k02J37J37j06j05O42O42j80j80j80j80J00
2302G921J00J00J00k60k59n6n6m4m3J61J60J11J11r3r3r3r3J11J11K7K7j76j77j1j1J50J50
2289G875J10n70n70J10M24M23rrM8M8M8M8j26j26l30l30L78L78k33k34mmL36L35l99l99K13
2275G431K12k5k6J%l39O9K65m15l98K82L5L5Q8l19j75N04Q35J56m38m38l04l05M43M42L03
2262G919L02NOo19O0O1o19O1O0J8J8n28n29j88j89J04J04M43M44L20L21j9k0l41l42K70K69
2249G391k10k11K65K65j13j13j13j13L21L21j54j55J35J34Q3Q4j9q33n20K96j42n49L77J191
2237G618O02k13m08%j15j15r0q9j82j82K2K2n1n0K89K90l22l22j18j19M26M25Q5Q6l91l90
$$ y = [7750, 7766, 8189, 8272, 7948, 7563, 7585, 8056, 8528, 8728, 8249, 8178, 8106, 7962, 8224, 8487, 8342, 7952, 7561, 7501, 7848, 8305, 8355, 8481, 8607, 8367, 8536, 8704, 8465, 8533, 8601, 8643, 8686, 8312, 7939, 7769, 7599, 7396, 7194, 7331, 7468, 7362, 7257, 7899, 8541, 8361, 8181, 8001, 7821, 7921, 8021, 8121, 8221, 7961, 7702, 7646, 7590, 7546, 7503, 7664, 7824, 7935, 8046, 7953, 7860, 7767, 7674, 7785, 7896, 7923, 7950, 7774, 7597, 7586, 7575, 7725, 7875, 7985, 7415, 6845, 6955, 7379, 7802, 7793, 7784, 7832, 7880, 7928, 7976, 7850, 7724, 7394, 7064, 7442, 7820, 7587, 7353, 7349, 7345, 7681, 8016, 7617, 7218, 7431, 7643, 7618, 7592, 7593, 7593, 7254, 7323, 7588, 7173, 6775, 7057, 7092, 7127, 7215, 6896, 6721, 7225, 8060, 8216, 7778, 7340, 7036, 6731, 7174, 7616, 7919, 8221, 8226, 8232, 7613, 7673, 7734, 7115, 7176, 7236, 7254, 7272, 6744, 6215, 6027, 5838, 5942, 6046, 6489, 6933, 7253, 7574, 7555, 7535, 7194, 6852, 7122, 7391, 7181, 6970, 7235, 7500, 7387, 7274, 7161, 7048, 7369, 7690, 7536, 7381, 7516, 7650, 7733, 7817, 7798, 6965, 6445, 6741, 6599, 6050, 6427, 7618, 8220, 8007, 7599, 7599, 7484, 7369, 7279, 7190, 7008, 6826, 6848, 6870, 6819, 6769, 7058, 7348, 7026, 6704, 6586, 6467, 6893, 7318, 7403, 7489, 7098, 6708]
2224F708K29j78k03O11k12k12L93L92o26o26M19M18N3N3J69k39q58m4M91l23J60N67J94J95
2212G531J5J6K5K4l15l16k25k26k1k2L68L69J65J65l32l31QPj32j32K07K08j91j90j91j90
2198F294J28J28k12k12q8q9K51K51J%L40L40j34j34j34j35K18K18j21j22k29k30J10J10Q8
2186F637Q9Q8Q9l88l88K23K24l6l6J68J68l66l67L80L80l83l84L63L64nnJ99J98k04k04k30
2173F574k30M6l62j74N04J40J39N89r0l75L1J00J00P0O9k69k70k93k93J83J82L22L23k89k89
2160F438J65J65J65J65l23l24j19j20j55j56J84J84k83k83N7N6J62J62m1m2J53J54n1n0k69
2148E994k69K07K07J55J56m8m9k97k98J78J78J69J70j70j70L75L75k36k36M0M0M0M0l10l10
2135E931L01L01J70J70l06l06k25k25K50K50J11J10J10J10m64m64J46J47m0m0l9m0k16k17
$$ y = [6708, 6937, 6759, 6556, 7167, 6955, 6743, 7136, 7528, 6902, 6276, 6695, 7113, 7166, 7219, 7388, 7149, 6291, 6247, 6738, 6415, 6575, 7142, 7336, 7531, 7546, 7562, 7587, 7611, 7296, 6980, 6755, 6529, 6508, 6486, 6854, 7223, 7388, 7553, 7221, 6890, 6898, 6905, 6773, 6641, 6848, 7056, 6865, 6675, 6484, 6294, 6422, 6550, 6338, 6126, 6038, 5949, 6200, 6451, 6452, 6452, 6792, 7132, 6998, 6864, 6730, 6595, 6813, 7031, 6910, 6788, 6559, 6329, 6439, 6549, 6637, 6726, 6814, 6903, 6515, 6127, 6350, 6574, 6538, 6502, 6670, 6838, 6472, 6105, 6485, 6865, 6482, 6098, 6461, 6825, 6820, 6815, 7014, 7212, 7008, 6804, 6574, 6344, 6390, 6028, 5854, 6358, 6498, 6637, 7226, 7136, 6761, 6792, 6892, 6992, 7062, 7131, 6862, 6592, 6299, 6006, 6189, 6371, 6693, 7016, 6727, 6438, 6603, 6768, 6933, 7098, 6775, 6451, 6332, 6212, 6057, 5901, 6085, 6269, 5986, 5703, 5760, 5816, 5978, 6140, 6099, 6057, 6210, 6364, 6313, 6263, 5994, 5725, 5932, 6139, 6294, 6450, 6402, 6353, 6056, 5758, 5936, 6114, 6283, 6453, 6283, 6113, 6488, 6863, 6627, 6391, 6431, 6471, 6511, 6551, 6241, 5931, 6232, 6533, 6703, 6873, 6567, 6261, 6036, 5811, 6061, 6311, 6422, 6532, 6642, 6752, 6288, 5824, 5970, 6117, 6077, 6037, 5998, 5958, 5742, 5525]
2123E525J24N31N10j70j95K13J86J86j28j28k2k2k1k2q6q5O61O61l14l15k55J52K44n71q7
2111F572q8J5J5J5J4l09l09j05j05L5L5L5L5M2M3M3M2K81K80j95j95p0p1n47n46N79N78K39
2097F358K39Q6Q6Q5Q6l47l47qqk38k38k38k38K76K76P2P2J36J36o7o8q0q0J24J23J5J4J4J5
2082F256j13j13l17l17P4P4P4P3K95K94R1R1j58j58j57j58J06J05J06J06q8q7k92k91l7l6
2069E423l7l6J68J68l6l5P9P9P9P9R6R7R6R6jjkjk51k50Q8Q9j53j53J87J86j27j27K12K12
2054F224j35j36O8O8J33J33r7r6j2m19J4O93j71n78J68J69L3L3L2L3r8r7r8r8k67k68K08K08
2040E647J8J7K22K22l35l34M13M12k79k79n09j00J70J71M51M3q6L21J18k90o25k17N46N46
2028F263l21l22j18j18j09j10J11N19L27q2j66j66p7p7K63K63l6l5l6l6jkjkk81k80n2n1j66
$$ y = [5525, 5649, 6180, 6690, 6520, 6325, 6538, 6724, 6910, 6782, 6654, 6632, 6610, 6589, 6567, 6481, 6396, 7057, 7718, 7404, 7089, 6834, 6986, 7230, 6659, 6572, 6484, 6499, 6514, 6529, 6543, 6234, 5925, 5820, 5715, 5750, 5785, 5820, 5855, 5897, 5940, 5983, 6025, 6306, 6586, 6391, 6196, 6126, 6055, 5508, 4962, 5541, 6119, 6358, 6597, 6683, 6769, 6854, 6940, 6593, 6246, 6238, 6230, 5992, 5754, 5516, 5278, 5554, 5830, 5902, 5974, 6110, 6246, 6179, 6111, 6031, 5951, 6075, 6198, 6213, 6227, 6241, 6256, 6143, 6030, 5713, 5396, 5470, 5544, 5618, 5691, 5986, 6280, 6371, 6462, 6304, 6146, 5989, 5831, 5937, 6042, 6148, 6254, 6166, 6079, 5787, 5496, 5459, 5423, 5386, 5350, 5518, 5686, 5650, 5615, 5694, 5773, 5852, 5931, 6027, 6124, 6220, 6316, 6315, 6314, 6312, 6311, 6060, 5810, 5898, 5987, 5834, 5681, 5868, 6054, 5927, 5800, 6012, 6224, 6089, 5953, 6021, 6089, 6222, 6355, 6258, 6162, 6150, 5731, 5745, 6438, 6267, 5689, 5857, 6026, 6059, 6092, 6124, 6157, 6059, 5962, 5864, 5766, 5499, 5231, 5439, 5647, 5665, 5682, 5904, 6126, 5791, 5457, 5870, 6282, 6003, 5724, 5215, 5115, 5285, 5456, 5907, 5950, 5864, 6185, 6303, 6013, 5388, 5171, 5717, 6263, 5942, 5620, 5502, 5384, 5275, 5165, 5276, 5795, 6122, 6040, 5874, 5708, 5631, 5554, 5817, 6080, 6044, 6009, 5973, 5937, 5936, 5934, 5933, 5931, 5650, 5370, 5318, 5267, 5101]
2013E101K41M45L8j02j03P6P6J2J2J3J2m14m14k44M35P11k40l67M0k85k86j49K58L17L17l9
2000E461m47L17L17j84j84j51j50M36M35m1m50K6M34o4o3J92k16J04J03n33n33K61K61N7N7
1988E445j09j10R4R4N2N2N1N2r0r0r0r1J14J14k26k27L0L0K33K34q1q0J23J23l17l17K3K3
1974E059K44K44k07k06k27J80N36j42l47l46Q7Q6N9N9j44j45J35J36L39L39l61l61J14J14
1962E245l9l8n14n14M00M01l21l21j35K73O30n0l91l91M2M2L56L55J7J6q4q4K55K55P3P3j31
1948E420j31j22j23j22j23lmlmR2R3K96K96M1M2j63j62j86j86j85j86o3o2J41N49K02m77k73
1934D594k74J52J51J51J51o7o8o7o7J87J87J62J62K36j70j97K11J65k43L7L7l96J2K58K58
1921E562O7O6k72k73J31J31k08k09O3O3K67K67k74k74k9L80K60K61K35m44o10P0K57j51k57
$$ y = [5101, 5342, 5787, 5825, 5723, 5620, 5696, 5772, 5784, 5796, 5809, 5821, 5407, 4993, 4749, 5184, 5895, 5655, 5288, 5328, 5043, 4757, 4608, 4866, 5183, 5500, 5461, 5014, 5331, 5648, 5464, 5280, 5129, 4979, 5415, 5850, 5809, 5359, 5385, 5819, 5755, 5692, 5884, 5668, 5772, 5875, 5342, 4809, 5070, 5331, 5388, 5445, 5336, 5226, 5320, 5414, 5466, 5518, 5569, 5621, 5531, 5441, 5351, 5260, 5374, 5488, 5262, 5035, 5065, 5095, 5328, 5562, 5481, 5401, 5524, 5647, 5330, 5013, 5036, 5059, 5303, 5547, 5340, 5134, 4907, 5087, 5623, 5481, 5134, 4788, 4875, 4961, 5020, 5079, 4935, 4790, 4925, 5061, 5400, 5739, 5378, 5017, 5131, 5245, 5206, 5168, 4654, 4140, 4540, 4941, 4620, 4299, 4164, 4437, 5067, 5017, 4626, 4235, 4277, 4319, 4675, 5030, 5047, 5063, 4979, 4895, 5150, 5405, 5478, 5551, 5420, 5289, 5167, 5044, 4922, 4799, 4796, 4792, 4789, 4785, 4877, 4970, 5266, 5562, 5603, 5645, 5482, 5320, 5134, 4948, 4763, 4577, 4514, 4452, 4593, 5142, 5344, 4867, 4594, 4320, 4472, 4623, 4774, 4925, 4858, 4790, 4723, 4656, 4843, 5030, 5192, 5354, 5590, 5420, 5223, 5434, 5599, 5356, 5393, 5430, 5034, 5046, 5304, 5562, 5629, 5695, 5423, 5150, 5281, 5412, 5204, 4995, 5058, 5121, 5388, 5655, 5381, 5107, 5078, 5458, 5718, 5979, 6214, 5770, 5160, 5230, 5487, 5336, 5079]
1909E079M22M22k57m22j4q2q2Q4Q3l91l92J47J47l11R6L68l9l54l53k83L97P19L11J9J9po
1895E320k80k80J95J96K5K6K5K6J98J97j42j42j42j42j42j42K27K28l83l84O7O6O7O6r8r8
1882D554K42K41o8o9m07m08o6o6j17K91L41o6m05KL42o4k86k86L85L85J31N38k5m32j77j77
1869D333L87L87m53m6j77j78j26j27K3M29K51j56l88K0L16L17N62l88p53J98N67J59Q3Q3J64
1857E487k44m65m64J27N35N34J27k46k47k72k72q5q5J36N43j07n14J91J91N11J04l97J0m0
1845E058m49m14K65O22n8j08j09m4m5m5m5j17j18J12J11m44l7L45L45n14n14K32K33K24K24
1832D710r0r0m08jK19K20K45j62M1M49K13K14l73l72qpJ96J97Q5Q5l90l90L5L4K39K38o3o3
1818E003n13n13J40N48N23J15L4l74j70j70n6n5q1q1K81j27l72L4N70j10m06JN0N1L05j02
$$ y = [5079, 5501, 5923, 5666, 5244, 5230, 5148, 5066, 5150, 5233, 4842, 4450, 4597, 4744, 4433, 4529, 4897, 4858, 4504, 4151, 3868, 4265, 4984, 5295, 5314, 5333, 5326, 5320, 5040, 4760, 4955, 5151, 5176, 5202, 5227, 5253, 5451, 5648, 5506, 5364, 5222, 5080, 4938, 4796, 5023, 5251, 4868, 4484, 4551, 4617, 4684, 4750, 4652, 4554, 4796, 5037, 4969, 4900, 4493, 4085, 4019, 3953, 3836, 4127, 4468, 4402, 3997, 3999, 4341, 4277, 3991, 3705, 4090, 4475, 4606, 5144, 5119, 4687, 4510, 4333, 4720, 5107, 4654, 4608, 4431, 4253, 4127, 4000, 4023, 4452, 4703, 4547, 4159, 4179, 4495, 4812, 5374, 4986, 4233, 4431, 4998, 5157, 5240, 5323, 5487, 5243, 4778, 4314, 4441, 4976, 5510, 5637, 5391, 5144, 4872, 4600, 4515, 4430, 4566, 5109, 5002, 4488, 4679, 4870, 5381, 5485, 5088, 5098, 5058, 4609, 4195, 4460, 5082, 5024, 4916, 4807, 4763, 4718, 4673, 4628, 4511, 4393, 4505, 4616, 4172, 4135, 4480, 4825, 4311, 3797, 4029, 4262, 4486, 4710, 4620, 4530, 4122, 4121, 4340, 4560, 4805, 4643, 4684, 5133, 5346, 5560, 5187, 4815, 4807, 4800, 4996, 5193, 5278, 5363, 4973, 4583, 4618, 4652, 4891, 5129, 5066, 5003, 4490, 3977, 4117, 4665, 5188, 5303, 5337, 4963, 4793, 4623, 4567, 4512, 4431, 4350, 4631, 4504, 4132, 4166, 4736, 4626, 4220, 4221, 4271, 4322, 4627, 4525]
1805D525k42k42q1N98J33n45Q2Q3L96L97l50l51O0O1K64K64j73j73j73j73l2l2J71J72m0m1
1792D558m0m1o6o7K74K73J50J50m62m61K29K28j11j11k46k47k47k47K49K49K49K49L77L76
1780E265r9r9J71J70j69j68qqJ96J96l70l71J05J05l1l1J72J73j41j42O2O3P9P9Q0P9l91l90
1766D577l91l91J14J15J14J14K46K46L65m50k04k04k55k55M10M11K06K07k52k51k01k01l71
1754C699M45L25L26J64J64l11l11O6O6O6O6O6O6O7O6J75J75j64j64O5O5O5O5n02n03J09J08
1741D524o51o51m0m0K39K39M43M43L58L58l90l89k59k60K16K16M62M62m47m46R6l12k86L93
1729D278P1l37l20Q7M06jj71N08N42j37l23l24m90m91J21J21J29J30J29J29l2l2l2l3j04j04
1716C720j04j05J08J08L12L11K06K05k70k69K81K82l30l29L1L1L03j04l53L26K33K33k64o71
$$ y = [4525, 4283, 4041, 3960, 4558, 4691, 4146, 4228, 4311, 4707, 5104, 4754, 4403, 4463, 4524, 4788, 5052, 4879, 4706, 4533, 4360, 4328, 4296, 4467, 4639, 4599, 4558, 4518, 4477, 4411, 4344, 4618, 4891, 5041, 5191, 4729, 4268, 4497, 4725, 4614, 4503, 4257, 4010, 3763, 3516, 3765, 4014, 4263, 4512, 4889, 5265, 5166, 5067, 5238, 5408, 5239, 5071, 5063, 5055, 5251, 5447, 5077, 4706, 4811, 4916, 4885, 4854, 5026, 5199, 5058, 4916, 4978, 5041, 5120, 5199, 5279, 5358, 4967, 4577, 4186, 3795, 3909, 4024, 4138, 4252, 4498, 4744, 5109, 4659, 4455, 4251, 3996, 3741, 4151, 4562, 4768, 4975, 4723, 4472, 4271, 4070, 3699, 4144, 4469, 4795, 4959, 5123, 4812, 4501, 4567, 4633, 4699, 4765, 4831, 4897, 4964, 5030, 5205, 5380, 5216, 5052, 5117, 5182, 5247, 5312, 4810, 4307, 4416, 4524, 3873, 3222, 3182, 3142, 3381, 3620, 4063, 4506, 4864, 5222, 4832, 4443, 4184, 3924, 4140, 4356, 4818, 5280, 4833, 4387, 4483, 4171, 3885, 4278, 4349, 4012, 3692, 3779, 4185, 4184, 4013, 4521, 5063, 4926, 4603, 4279, 3789, 3298, 3419, 3540, 3669, 3799, 3928, 4057, 4025, 3993, 3961, 3928, 3824, 3720, 3616, 3511, 3619, 3727, 4039, 4350, 4556, 4761, 4491, 4222, 4503, 4785, 4455, 4126, 4157, 4188, 4491, 4387, 4034, 4360, 4593, 4826, 4562, 3891]
1704C891k39M41L28p9j47j47J63J62j77j77J70J69J69J69L60L60n23n23K35K35k40k40k8k8
1692D304K01K01J16N24O5o13j47j47J50J50k51k52K24j84l83K96P71R2m28k0k92k92J88J88
1679D461J87J88j36j37j36j37j8j7j8j7JJKJppJ97J97l9l8k42k42J52J53J52J53l12l12j09
1665C921j08N7N7j47j46K69K69K02O09K73m05m74m73K12K12K12K12l78l78R7R8k08k08K67
1653D042K68j15j15R0Q9k84k83N6N7J62J62J63J62k38k38l5L73L14l66l65L13M1l67j20K87
1640D053M19M18L76l03l98RP8P7J36J37o7o7m09m09o9o9J64J64l9m0Q8Q9O3O3K24j84l61L17
1626D460N15J08r7n03n93Q6L83k4j57j56K1K2%%%JJ74J74j65j65k08k08mmJ69J68J69J68j29
1612D205j28j29j29M6M5K49K49K41K41j25j24n7m63o17O2Q4Q4p8p7L32L32j27q05k84L96J49
$$ y = [3891, 3652, 4093, 4421, 4342, 4195, 4048, 4211, 4373, 4196, 4019, 4189, 4358, 4527, 4696, 5056, 5416, 4893, 4370, 4605, 4840, 4600, 4360, 4332, 4304, 4505, 4706, 4822, 5346, 5411, 4798, 4651, 4504, 4654, 4804, 4553, 4301, 4525, 4341, 3958, 4254, 5025, 5117, 4689, 4669, 4377, 4085, 4273, 4461, 4648, 4836, 4700, 4563, 4427, 4290, 4272, 4255, 4237, 4220, 4221, 4222, 4224, 4225, 4218, 4211, 4408, 4605, 4566, 4528, 4286, 4044, 4196, 4349, 4501, 4654, 4342, 4030, 3921, 3813, 3870, 3927, 3780, 3634, 3903, 4172, 4374, 4983, 5256, 4851, 4377, 3904, 4116, 4328, 4540, 4752, 4374, 3996, 4093, 4191, 3983, 3775, 4042, 4310, 4195, 4080, 4170, 4259, 3975, 3692, 3748, 3805, 3967, 4129, 4292, 4454, 4216, 3978, 3943, 4316, 4630, 4264, 3899, 4212, 4253, 3886, 3766, 4053, 4472, 4890, 5266, 4963, 4565, 4574, 4652, 4729, 4865, 5002, 4935, 4868, 4459, 4050, 3981, 3912, 4076, 4240, 4201, 4161, 4249, 4338, 4401, 4464, 4688, 4504, 4143, 4460, 4975, 5083, 4986, 4483, 3890, 3976, 4359, 4335, 4178, 4022, 4043, 4065, 4065, 4065, 4065, 4066, 4240, 4414, 4249, 4084, 3876, 3668, 3664, 3660, 3829, 3997, 4166, 4334, 4205, 4077, 3948, 3819, 3865, 3910, 4159, 4408, 4649, 4890, 4765, 4641, 4584, 4121, 3504, 3566, 3650, 3734, 3656, 3579, 3911, 4243, 4116, 3311, 3027, 3423, 3572]
1599C572J50L82k6k04M75l4m41J69J70m1m2m1m2JJJJk48k48R1R2J46J47n7n7j03j02J01J01
1584C914Q0Q0K83K84k00k00k00k00r0r0q9r0o4o4J39J40k6k6k6k6M1M1M1M1J18J17q6q6o0
1570C696o0J44J45K07K08j32j32j55j56j55j56M4M5K47K48r7r7m37m36J70J70l3l4J8J8k54
1556C026J54Q15J37k96J11j10j09q4q5J20J20l05L74M38k42j57j57L45L44j32j31m03m03m03
1544B967m03M12M12M12M12k48k48m5m4L76L75l28l29o90j0O60k91j9O60j0j1Q6l22K47K47
1532D268j95j94K38j69j44j43O0O0k33J75n5n4L44L45J41J41k24k24J16J15j09j10l64M3L32
1519D160p5p5L32K63j45r3r4k04k04%%J49J48J48J49O3O4K93j15l54l54L42L41m4m52m26m26
1506C391R1R2O6M73O6O6R2R2j87j87M2l66j95j96J36N43L81k7k48k47J73J72k85J21J21k86
$$ y = [3572, 3722, 4104, 4078, 3874, 4349, 4315, 3874, 4043, 4213, 4172, 4130, 4089, 4047, 4048, 4049, 4050, 4051, 3803, 3555, 3646, 3738, 3884, 4031, 3974, 3917, 3814, 3712, 3813, 3914, 3994, 4074, 4357, 4641, 4441, 4241, 4041, 3841, 3751, 3661, 3572, 3482, 3418, 3354, 3493, 3633, 3607, 3581, 3555, 3529, 3570, 3611, 3652, 3693, 3811, 3928, 3842, 3756, 3696, 3636, 3780, 3925, 4132, 4340, 4208, 4076, 3921, 3765, 3610, 3454, 3498, 3543, 3790, 4038, 3941, 3844, 3407, 2971, 3141, 3311, 3278, 3244, 3262, 3280, 3026, 3180, 3995, 4132, 3836, 3947, 3837, 3728, 3644, 3559, 3679, 3799, 3494, 3868, 4306, 4064, 3907, 3750, 4095, 4439, 4307, 4176, 3773, 3370, 2967, 2564, 2976, 3388, 3800, 4212, 3964, 3716, 3671, 3627, 4003, 4378, 4050, 3721, 3031, 3021, 3681, 3390, 3371, 4031, 4021, 4010, 4096, 3774, 4021, 4268, 4073, 3879, 4117, 3948, 3804, 3661, 3721, 3781, 3548, 3723, 3668, 3614, 3958, 4303, 4444, 4585, 4361, 4137, 4253, 4368, 4259, 4149, 3785, 3828, 4160, 4085, 4010, 4342, 4605, 4460, 4367, 4273, 4069, 3865, 3865, 3865, 4014, 4162, 4310, 4459, 4522, 4586, 4879, 4764, 4410, 4056, 4398, 4739, 4695, 4243, 3817, 3391, 3482, 3574, 3640, 4113, 4179, 4245, 4337, 4429, 4242, 4055, 4097, 3731, 3536, 3340, 3476, 4019, 4400, 4373, 4125, 3878, 4051, 4223, 3938, 4059, 4180, 3894]
1493C894l2l2j42j42j17j17k22J86J60J61J09J09L13L13k10k11m40l2L88L87j04j05J97m82
1481C829k79M01M01M00L50l30l98l98j01j02L74L75k37k37k08k07M97R0l01l00k59M21N61
1469D342J53j87j87k5k5%%O2M69O22n7j93j93o86o85K14O21J63J63L29p9k8k8k89J18j10j11
1456D373l0l0j15n23p7L31j02j03k80J27M66N9J15J14p52l44L31L30J53J52J32J33L86k0m11
1443D415mk58k58o1o1J43J43J04J05q2m90j89P61N57l94n16j10j94j94Q2Q2Q2Q2n9n8n8n8
1430C512o4o4o4o5J87J86J87J86l35l34J66J66k37J70k62k63L93L92K8K7o6m73j34K74N50
1417D063N51k13k14M1o37j63N17K53K54m4m3j0rj0rk01k00k01k01L09L09J05J05K07K06k68
1404D497k69p8p7p8p8J90J89j4j4PQj97j97n2n3M22J5m86J93M91Q3m52m52j38j38J5J5L55
$$ y = [3894, 3862, 3830, 3688, 3546, 3429, 3312, 3090, 3276, 3436, 3597, 3706, 3815, 4128, 4441, 4231, 4020, 3580, 3548, 3936, 4323, 4219, 4114, 4311, 3829, 3550, 3951, 4352, 4752, 5102, 4772, 4374, 3976, 3875, 3773, 4147, 4522, 4285, 4048, 3840, 3633, 4130, 4220, 3919, 3619, 3360, 3781, 4342, 4495, 4308, 4121, 4096, 4071, 4071, 4071, 4133, 4602, 5224, 5167, 4974, 4781, 4095, 3410, 3624, 4245, 4408, 4571, 4900, 4821, 4793, 4765, 4476, 4594, 4484, 4373, 4343, 4313, 4198, 3675, 3598, 3929, 3827, 3724, 3444, 3571, 4037, 4096, 4211, 4325, 3573, 3229, 3560, 3890, 4043, 4195, 4327, 4460, 4846, 4826, 4415, 4411, 4153, 3895, 3834, 3773, 3916, 4059, 4163, 4268, 4186, 3696, 3507, 4268, 4825, 4431, 3915, 3805, 3611, 3417, 3499, 3581, 3663, 3745, 3686, 3628, 3570, 3512, 3448, 3384, 3320, 3255, 3442, 3628, 3815, 4001, 3666, 3332, 3498, 3664, 3427, 3597, 3335, 3072, 3465, 3857, 3885, 3912, 3846, 3373, 3239, 3513, 4063, 4614, 4401, 4187, 4228, 3591, 3428, 3945, 4198, 4452, 4408, 4365, 4355, 4346, 4336, 4327, 4126, 3926, 3725, 3524, 3833, 4142, 4247, 4352, 4559, 4765, 4497, 4228, 4150, 4073, 3995, 3917, 4107, 4296, 4282, 4268, 4275, 4283, 4086, 3889, 3837, 3784, 4206, 4221, 3735, 3928, 4419, 4502, 4050, 3598, 3460, 3322, 3337, 3352, 3707]
1390C707L54k62k62n9n9L58L57k54k54n8n9J45J45R4R5K6M34K84l94m63m62J96J95J96J95
1377D195m42m42N76N77m09m08o9o8M4M4M4M4Q7Q7J12J12l71L7P07k43n03r4k99J09M08%N1
1364C886N2mmmmj86j86J53J53j91j90J3J3j26j27J03J03q4L23M77k03j82j81k24k24j82j81
1350B793J58J58N9O0K64K63O4O4j39j40K6K6K6K6K1K2j82j82J41J42j73j73K99P06K73m06
1337D196l34P4m27k0J08J07p1p0l2l2l2l2M0M0M0M1K05K06K06K05l46l46opk7k8M48M47l12
1323D241l12k70k69R1P70M31k49Q7Q7n67J13J85k21j54j54l4l5L04L05k00k01LMk22k22k21
1310C290k22K99K98j77K30K90l89J8J8k58k57n4n4L62L62L36L37k25o32j74N05mmL9L8M1M0
1296D053j63j63L6L7k61k61l75L05Q98M91L3L3l33l32l09l09j06j05qpL31L32j14j15j15j15
$$ y = [3707, 4061, 3799, 3537, 3478, 3419, 3777, 4134, 3880, 3626, 3568, 3509, 3654, 3799, 3893, 3988, 4014, 4448, 4732, 4338, 3875, 3413, 3609, 3804, 4000, 4195, 3753, 3311, 3887, 4464, 4055, 3647, 3578, 3510, 3554, 3598, 3642, 3686, 3773, 3860, 3972, 4084, 3713, 3750, 4457, 4214, 3711, 3617, 3318, 3427, 3835, 3835, 3886, 3938, 3934, 3930, 3926, 3922, 3736, 3550, 3703, 3856, 3665, 3475, 3488, 3501, 3375, 3248, 3351, 3454, 3370, 3693, 4170, 3967, 3785, 3604, 3380, 3156, 2974, 2793, 2951, 3109, 3168, 3228, 3492, 3755, 3819, 3883, 3744, 3604, 3630, 3656, 3682, 3708, 3729, 3751, 3569, 3387, 3528, 3670, 3497, 3324, 3623, 4329, 4602, 4196, 3862, 3936, 3509, 3489, 3597, 3704, 3633, 3563, 3531, 3499, 3467, 3435, 3475, 3515, 3555, 3596, 3801, 4007, 4213, 4418, 4072, 3726, 3720, 3713, 3686, 3658, 4106, 4553, 4241, 3929, 3659, 3390, 3481, 4251, 4682, 4433, 4520, 4607, 4040, 4153, 4338, 4117, 3963, 3809, 3775, 3740, 4044, 4349, 4149, 3948, 3951, 3955, 3733, 3511, 3290, 3068, 3367, 3665, 3488, 3718, 4008, 3619, 3637, 3655, 3397, 3140, 3086, 3032, 3394, 3756, 4092, 4429, 4204, 3572, 3398, 3903, 3899, 3895, 3934, 3972, 4013, 4053, 3890, 3727, 3763, 3800, 3539, 3278, 2903, 3208, 4106, 4597, 4630, 4663, 4330, 3998, 3689, 3380, 3274, 3169, 3161, 3154, 3485, 3817, 3703, 3588, 3473, 3358]
1283C358k42k42K34K33K91K90J9M27K43m35k57J51k52k51k26k27j37j37L39L38K54K53K53
1271D277K54l54l53m21K57M85P7j26j27n0n0n0n0P8P8P8P9k79k78m82m82n2n3K88K87J85J86
1258C402j8j9M8M7j56j56L02L02l7l8j14j15M97j83j53K55j7j7j91j91J3J3R7R8j06j06P1
1244C528P2P1P2j32j32K07K08J7J8J7J8m96m96K51K51J37J38l37l38P8P9M18Q25l0p09q0L26
1231C981K17j92l69L8L06L06j44j44j15j14j14j15M15M14j97j98o1o1j04j04M55k25m11mJ75
1218C635J74m11m11J51J51J51J51k06k05k06k05M23M23n3n2K48K49k26k27onk10k10K79K78
1206C680K79K79l7l7l76l76J71J72J71J71j60j61j61j61K98K98L40l39j10j10J87J88m75m75
1194C256K72K72o2o2m95m95j21N57K18m61L73L73j45j45QQK11K12J59J60l16l16P1P0K74K75
$$ y = [3358, 3116, 2874, 3108, 3341, 3632, 3922, 3941, 4368, 4611, 4176, 3919, 4070, 3818, 3567, 3341, 3114, 2977, 2840, 3179, 3517, 3771, 4024, 4277, 4531, 4177, 3824, 3403, 3660, 4145, 4222, 4096, 3969, 3919, 3869, 3819, 3769, 3847, 3925, 4003, 4082, 3803, 3525, 3043, 2561, 2509, 2456, 2744, 3031, 3216, 3402, 3384, 3365, 3413, 3460, 3304, 3148, 3450, 3752, 3715, 3677, 3563, 3448, 3945, 3762, 3609, 3864, 3847, 3830, 3639, 3448, 3461, 3474, 3571, 3669, 3563, 3457, 3528, 3600, 3671, 3743, 3611, 3479, 3686, 3894, 3911, 3929, 3946, 3964, 3468, 2972, 3223, 3474, 3611, 3749, 3412, 3074, 3152, 3231, 3649, 4474, 4444, 3735, 3655, 3981, 4198, 4006, 3637, 3675, 3981, 4287, 4143, 3999, 3884, 3770, 3656, 3541, 3956, 4370, 4173, 3975, 3914, 3853, 3749, 3645, 4100, 3875, 3464, 3460, 3635, 3809, 3398, 2987, 3138, 3289, 3440, 3591, 3385, 3180, 2974, 2769, 3192, 3615, 3562, 3510, 3758, 4007, 3781, 3554, 3548, 3543, 3333, 3123, 3402, 3680, 3959, 4238, 4201, 4164, 3788, 3412, 3583, 3755, 3926, 4097, 3937, 3776, 3615, 3454, 3752, 4050, 4390, 4051, 3941, 3831, 4018, 4206, 3731, 3256, 3528, 3800, 3738, 3676, 3181, 2686, 2565, 3122, 3340, 2879, 3252, 3625, 3480, 3335, 3343, 3351, 3562, 3774, 3933, 4093, 3777, 3461, 3532, 3602, 3876, 4151]
1181D151r3r2r2r2j01j01j00j01K03K03j37j37K16K15j24j24J26J26l49l49K78K79o1o0M37
1168D121M36l8l8j28j28j27j28k5k5L15L15J7J8J7J8l23l22j18j18J32J32p2p1j76j76K99
1155C807K99m90m90j4j5K26K26j13j14Q6Q7Q6Q6K38K38j01j01J%JJk72k72K03K03MMk00k00
1140C414k55k56L56L55J77J78k7k6j21j21Q3Q3k3k3k3k4k05k05J34J35M9N0M9N0J3J3j90j90
1126C450p6p6p6p5r0r0q9r0K03K03M75O8m84J96M68O0j7m24m49m2J91J91J3J2J36J36o8o8
1112C588k95k95J81N87L93k86J20J21pqpqj47j48j48j47K74K75o5o5K0K0L60L60k28k27k27
1099C991k27KKKKj36j36K03K04M12M11o4o3k94k95r0r0M02M02p4p3K24K24j42j41n6m64o68
1085C468k60K07K06j08j08R6R6M10M10j27n34n9L48O0O0%M08M51n00o62J8J71J70k62k63Q6
$$ y = [4151, 4058, 3966, 3874, 3782, 3681, 3580, 3480, 3379, 3582, 3785, 3648, 3511, 3727, 3942, 3818, 3694, 3820, 3946, 3597, 3248, 3526, 3805, 3744, 3684, 4121, 4557, 4519, 4481, 4353, 4225, 4098, 3970, 3945, 3920, 4235, 4550, 4567, 4585, 4602, 4620, 4297, 3975, 3857, 3739, 3871, 4003, 3931, 3860, 3684, 3508, 3807, 4106, 3616, 3126, 3112, 3097, 3323, 3549, 3436, 3322, 3408, 3495, 3581, 3667, 3905, 4143, 4042, 3941, 3942, 3942, 3943, 3944, 3672, 3400, 3603, 3806, 3810, 3814, 3614, 3414, 3159, 2903, 3259, 3614, 3791, 3969, 3942, 3916, 3795, 3674, 3757, 3840, 3817, 3794, 3771, 3747, 3542, 3337, 3471, 3606, 3655, 3705, 3754, 3804, 3817, 3830, 3640, 3450, 3374, 3298, 3222, 3147, 3057, 2967, 2878, 2788, 2991, 3194, 3669, 3737, 3253, 3449, 3917, 3977, 3960, 3536, 3087, 3045, 3236, 3427, 3440, 3452, 3588, 3724, 3656, 3588, 3293, 2998, 3179, 3766, 4159, 3873, 3993, 4114, 4107, 4099, 4092, 4084, 3937, 3789, 3641, 3494, 3768, 4043, 3978, 3913, 3933, 3953, 4313, 4673, 4445, 4218, 3991, 3764, 3766, 3768, 3770, 3772, 3636, 3500, 3703, 3907, 4319, 4730, 4666, 4603, 4309, 4014, 3924, 3834, 4236, 4638, 4564, 4491, 4715, 4939, 4797, 4656, 4600, 4136, 3468, 3208, 3415, 3621, 3513, 3405, 3501, 3597, 4007, 4417, 4290, 3756, 3697, 4045, 4105, 4165, 4165, 4573, 5024, 4524, 3862, 3880, 4051, 4221, 3959, 3696, 3782]
1072C782Q6l64l65j18K90N10N10J90k18n58j49M31M32J43J43k97J12K89l90m19j2L0L1L39
1060D428o8n61n60k98J10K20K21QQK12K11K25K25J99J99K4l84l58l58J98J98k77k77N5N6K60
1047C916K59m6m6L87L87J34n45p49p0q2q3j4j5O8M76J62k46l48O0N52j27j05L03L1L2k9k8
1033D234k8k8Q6Q5k54k54j23j22K17K17J94J94j46j45k7k7J77J77j97j98J43J42K01K02k74
1020D446k74k98k98M1M2K58K58N4N4j94j94j94j94k9k8M47M47J54J54n0m9j73j73j72j73L25
1007D187L25m22m22K14K15K15K14l47l46J28J29j00j01n59K56J29J28k4k4P4P3K77K77J26
995D622J25k15k14K7K8K7K8l45l45j92O23L55L56o9o9n32n32K16K15o1o0o1o0K54K55m08M08
982D376K08K08l53l52k8k9k32k32R1R1l85l85J85J85j54j55K95K96M99M99q4q4J20J20q9q8
$$ y = [3782, 3868, 3504, 3139, 3021, 3311, 3821, 4331, 4521, 4303, 3745, 3596, 4027, 4459, 4602, 4745, 4448, 4560, 4849, 4459, 4040, 4028, 4058, 4089, 4428, 4360, 3799, 3239, 2941, 3051, 3271, 3492, 3500, 3508, 3720, 3931, 4156, 4381, 4580, 4779, 4803, 4419, 4061, 3703, 3901, 4099, 3822, 3545, 3600, 3656, 3916, 4175, 4129, 4083, 4470, 4857, 4991, 4446, 3697, 3627, 3545, 3462, 3448, 3433, 3501, 3977, 4139, 3893, 3545, 3605, 4157, 4030, 3925, 4228, 4259, 4291, 4262, 4234, 4206, 4178, 4264, 4349, 4095, 3841, 3718, 3596, 3813, 4030, 4224, 4418, 4272, 4127, 4100, 4073, 4250, 4427, 4230, 4032, 4175, 4317, 4518, 4720, 4446, 4172, 3874, 3576, 3617, 3659, 3917, 4175, 4229, 4283, 4089, 3895, 3701, 3507, 3478, 3450, 3897, 4344, 4498, 4652, 4602, 4553, 4380, 4207, 4035, 3862, 4187, 4512, 4090, 3668, 3882, 4097, 4312, 4526, 4179, 3833, 3961, 4090, 3990, 3889, 3330, 3586, 3715, 3843, 3819, 3795, 3869, 3942, 4219, 4496, 4622, 4747, 4532, 4318, 4345, 4373, 4400, 4428, 4083, 3738, 3546, 4169, 4524, 4880, 4811, 4742, 4210, 3678, 3894, 4109, 4048, 3988, 3927, 3867, 4121, 4376, 3968, 4376, 4584, 4792, 4439, 4087, 4059, 4030, 3798, 3566, 3657, 3748, 3363, 2978, 3163, 3348, 3194, 3039, 3334, 3630, 4129, 4628, 4544, 4460, 4580, 4700, 4611, 4523]
969D523q8q8J77J77j63j62k94k94L17L17J3J2m63m63Q5Q4K88K89O3O3O4O3j45j44j45j45J49
955D090J48J48J48l4l4l4l5M17M17o02o02j01j02l04L74K44j64j64K44K52m27m01K78M25M25
943D606J28J29j06j05l09l09P5P5j29j28J5J6K19K20J3J4m62m62J75J75J75J74P0P0P0O9l6
929D442l6l7l6j25j26P8P9k40k41K36K35J27J26M2M49M83m68l66M2k74o82k07K01Q6l21M3
916C510M52L27L27L52L52p6p6k80k80n62n63M57M56m9m8m9m9l28l29J46J47K57K57K57K57
903D865j72j72l75l76K95K95j80j80L16L17L16L17m22m22k19k18r4r4r5r4N13N13J73J73n7
891D923n7J47J47m48m47K99L00K09K09m02m02q7q8N23N24r9r8m37m38k43k42K33K33j28j28
878D003P6P6J78J77J78J78j54j53j53j54L90L90J87J86l93l94K19K18K01K01k75k74P4P4j30
$$ y = [4523, 4435, 4347, 4524, 4701, 4538, 4376, 4082, 3788, 4105, 4422, 4435, 4447, 3984, 3521, 3606, 3690, 3978, 4267, 4330, 4393, 4457, 4520, 4375, 4231, 4086, 3941, 4090, 4238, 4386, 4534, 4500, 4466, 4432, 4397, 4814, 5231, 4629, 4027, 3926, 3824, 3520, 3894, 4138, 3974, 3810, 4054, 4306, 3879, 3478, 3756, 4181, 4606, 4734, 4863, 4757, 4652, 4343, 4034, 4109, 4184, 4055, 3927, 3942, 3958, 4177, 4397, 4410, 4424, 3962, 3500, 3675, 3850, 4025, 4199, 4269, 4339, 4409, 4478, 4442, 4406, 4369, 4333, 4208, 4082, 4160, 4239, 3999, 3758, 3994, 4229, 4356, 4482, 4524, 4973, 5456, 4988, 4622, 4664, 4390, 3708, 3501, 3702, 3788, 3467, 3510, 3962, 4289, 4616, 4968, 5320, 5244, 5168, 4888, 4608, 4046, 3483, 3940, 4396, 4347, 4299, 4250, 4201, 3873, 3544, 3690, 3837, 4094, 4351, 4608, 4865, 4693, 4521, 4146, 3770, 4065, 4360, 4180, 4000, 4316, 4633, 4949, 5266, 4844, 4422, 4203, 3985, 3891, 3797, 3702, 3608, 4121, 4634, 4807, 4980, 4923, 4866, 5013, 5160, 4712, 4265, 4564, 4864, 5073, 5282, 4880, 4478, 4391, 4303, 4826, 5350, 5251, 5153, 4716, 4278, 4035, 3793, 4026, 4259, 4131, 4003, 4079, 4155, 4333, 4510, 4688, 4866, 4712, 4559, 4406, 4252, 4642, 5032, 5219, 5405, 5012, 4618, 4837, 5055, 5256, 5457, 5182, 4908, 4982, 5056, 4926]
866D926j29K86K86Q3Q2m73m74KKR9J00R9J00j77j76J63J63j29j30K10K10l60l60K51K51k84
853D621k83q0q0K10K09ONM0M0K43K43j20j21K19K19l24l24J51J51N7N7j47j47J93J92m18m18
839D394M60M60j5j6K40K39o43o44j54j55J85J85P9P9P9P9J53J53n0n1n0n1J53J54L4L5L4L5
825E401r7r7l18L62J159M81k50k50k92k92J83J83l92l93Q3Q3J04J04n07n07J25J26J25J25
813E249K91K91m9m8K89K89l22l22L75L74j01j02rqk13k13J61J61J61J61k6k6k5k6r8r8l01
800E815L77J49k58J4J3j05j05K34K34q1q1q0q1o0o0J44J44p8p9L96L97k02k02k02k02K33K34
786F508j07j07K55K54k21k21J81J81k3k2M5M5j58j59j11j11K29K29O3O4O3O3l34l35K76K77
773F824M00L99l47l48l46l46O30K23j60j59J55J54N09N09j44n52l0l0n6n5J6J5J94J94N63
$$ y = [4926, 4797, 5083, 5369, 5452, 5534, 5061, 4587, 4589, 4591, 4690, 4790, 4889, 4989, 4812, 4636, 4799, 4962, 4833, 4703, 4913, 5123, 4763, 4403, 4654, 4905, 4621, 4338, 4258, 4178, 4388, 4597, 4603, 4608, 4648, 4688, 4931, 5174, 5054, 4933, 5152, 5371, 5047, 4723, 4874, 5025, 5082, 5139, 4992, 4845, 5038, 5230, 4812, 4394, 4854, 5314, 5299, 5283, 5523, 5762, 5119, 4475, 4321, 4166, 4351, 4536, 4615, 4694, 4773, 4852, 5005, 5158, 5108, 5057, 5007, 4956, 5109, 5263, 5297, 5332, 5366, 5401, 5304, 5207, 4889, 5251, 6410, 6891, 6641, 6391, 6099, 5807, 5990, 6173, 5781, 5388, 5471, 5554, 5658, 5762, 5255, 4748, 4873, 4999, 5124, 5249, 5540, 5831, 5782, 5734, 6023, 6312, 5990, 5668, 6043, 6417, 6316, 6214, 6205, 6197, 5984, 5771, 5932, 6093, 6254, 6415, 6389, 6363, 6338, 6312, 6214, 6116, 5815, 6192, 6341, 6083, 6097, 6110, 6005, 5900, 6134, 6368, 6287, 6206, 6126, 6045, 5985, 5925, 6069, 6213, 6135, 6056, 6452, 6849, 6647, 6445, 6243, 6041, 6274, 6508, 6401, 6294, 6549, 6803, 6582, 6361, 6542, 6723, 6700, 6678, 6723, 6768, 6610, 6451, 6340, 6229, 6458, 6687, 6750, 6814, 6877, 6940, 6606, 6271, 6547, 6824, 7224, 7623, 7276, 6928, 6582, 6236, 6866, 7089, 6929, 6770, 6925, 7079, 7588, 8097, 7953, 7401, 7371, 7341, 7285, 7230, 7246, 7261, 7455, 7649, 8212]
760H212J56m81p4L32p5k54J53J79J80j78j77o0p38n34J44N18N18O0O0J07l00M0M47o3o2J67
747H277J67k30k30N00R2n78j70N0N0j10j10K55K55k59J49q0q1M32M32O6O7J69k39k39J68j49
734H654j50L26L25j28n36n11j03L30P37P21L13j9o97n61L89N58J51m44m44J21J21J21J20q9
722I305r0K49K50m8m7k77J31j78j78M59M58NML44L44j10j10j95o02l39O8K63K64J02l06J28
709I894J28O8O8k71k72O29O29J8J8l21l22J8J8L32L32j44j43j31j30j31j31j55j55L21L20
697A0487m61m60J50J51k4k3k4k3J84J85J59J59L34p3k52M28L7l70l03l02L19L20k0k1j56j55
684A0246L19L19M43M42l04l05K2K3j82j81j24j24j25j24l5l5l5l5O9P0O9O9ppL32L33k80k80
670A0573p6p6K12K13k63k63k02k01Q17Q18j12j13j12j12N0N0k89k90K58K59l54l53l5l4J68
$$ y = [8212, 8368, 7887, 7813, 8145, 8070, 7816, 7969, 8148, 8328, 8150, 7973, 7913, 7175, 6641, 6785, 7303, 7821, 7881, 7941, 8048, 7748, 7788, 8235, 8172, 8110, 8277, 8444, 8214, 7984, 8484, 8576, 7998, 7828, 7878, 7928, 7818, 7708, 7963, 8218, 7959, 8108, 8028, 7947, 8379, 8811, 8877, 8944, 9113, 8874, 8635, 8803, 8654, 8504, 8830, 9155, 9027, 8491, 7980, 7877, 8207, 8944, 9665, 9978, 9959, 9262, 8701, 9090, 9648, 9799, 9355, 8911, 9032, 9153, 9274, 9394, 9305, 9215, 9464, 9714, 9666, 9619, 9342, 9473, 9295, 9117, 9576, 10034, 10039, 10043, 10387, 10731, 10621, 10511, 10316, 9714, 9375, 9443, 9706, 9970, 10072, 9766, 9894, 10022, 10090, 10158, 9887, 9615, 10244, 10873, 10891, 10909, 10588, 10266, 10284, 10302, 10634, 10966, 10822, 10679, 10548, 10418, 10287, 10156, 10001, 9846, 10167, 10487, 10026, 9566, 9716, 9867, 9843, 9820, 9796, 9773, 9957, 10142, 10301, 10460, 10794, 10721, 10469, 10897, 10934, 10564, 10261, 9959, 10278, 10598, 10578, 10557, 10401, 10246, 10565, 10884, 11327, 11769, 11465, 11160, 11182, 11205, 11023, 10842, 10718, 10594, 10469, 10345, 10310, 10275, 10240, 10205, 10274, 10344, 10413, 10482, 10475, 10468, 10800, 11133, 10853, 10573, 10497, 10421, 10633, 10846, 10583, 10320, 10118, 9917, 10734, 11552, 11440, 11327, 11215, 11103, 11153, 11203, 10914, 10624, 10882, 11141, 10787, 10434, 10399, 10365, 10533]
657A0533J69L8L7L7L7k38k39J44J43p73r5N00R3R8R9P4P3O5O5j39j39m04m04m05m04J05J06
643I176J05J05J2J1K15K16K28K28K4K4k45k45m2m1Q1Q2Q1Q2k85k84q1q1J57J57m7m6k2k1k2
629I522k1J23J23J23J23Q7Q8j42j42J08k99o55K3J05J04n7n7N7N8L2L2O0l48l39L40M54k25
615I277n05r7L70L69k16k16mmL35L36j52j52l55l56RJ0j95j94l5l5j03L04K20m60j03L04M35
602H787K8l12R5J08k99K44j64o98K52N75j04j97K10L71l6j12j11j37j37j45j46j45j45L32
590H114L32qpj98j99NOJ26J26l49l49J69J69l5l5j94j93J04J04N54j25n07J72M34k46k96J12
576G786M30k50m10mP8P7J03J03k49k50L62L62J27J27m85m84O7O8O7O7j56j57J16k93n17J62
563F847O12o8k75k75l18l18N57N57Q1Q1JJ%JK47K47K46K47o56o57m5m5O1O1K22K22N40j40
$$ y = [10533, 10702, 10740, 10777, 10814, 10851, 10613, 10374, 10518, 10661, 9888, 9793, 10293, 10386, 10484, 10583, 10657, 10730, 10795, 10860, 10721, 10582, 10178, 9774, 9369, 8965, 9070, 9176, 9281, 9386, 9398, 9409, 9624, 9840, 10068, 10296, 10320, 10344, 10099, 9854, 9812, 9771, 9852, 9934, 10015, 10097, 9812, 9528, 9447, 9366, 9523, 9680, 9633, 9587, 9565, 9544, 9522, 9501, 9624, 9747, 9870, 9993, 10080, 10168, 10026, 9884, 9992, 9693, 9038, 9061, 9166, 9270, 9213, 9156, 9213, 9271, 9303, 9335, 9395, 9047, 8708, 9048, 9502, 9277, 8772, 8675, 9045, 9414, 9198, 8982, 8978, 8974, 9309, 9645, 9493, 9341, 8986, 8630, 8639, 8649, 8454, 8260, 8225, 8190, 8087, 8391, 8611, 8151, 8048, 8352, 8787, 8815, 8503, 8598, 8706, 8407, 8651, 8487, 7789, 8041, 8616, 8512, 8315, 8525, 8896, 8860, 8748, 8637, 8500, 8363, 8218, 8072, 7927, 7782, 8114, 8446, 8438, 8431, 8233, 8034, 8039, 8045, 8171, 8297, 7948, 7599, 7768, 7937, 7902, 7867, 7673, 7480, 7584, 7688, 8242, 8117, 7610, 7782, 8216, 7970, 7674, 7786, 8216, 7966, 7556, 7552, 7630, 7707, 7810, 7913, 7664, 7414, 7776, 8138, 8265, 8392, 7907, 7423, 7490, 7558, 7625, 7692, 7536, 7379, 7495, 7202, 6685, 6847, 7459, 7391, 7116, 6841, 6523, 6205, 6762, 7319, 7400, 7481, 7482, 7483, 7483, 7484, 7731, 7978, 8224, 8471, 7815, 7158, 7113, 7068, 7129, 7190, 7412, 7634, 8174, 8034]
549H034j91K17j86j87l64l65O7O7O7O7j8j8j9j8j7j7l56l57k9l0L10L10l50l49j0j0K49K50
535F747r1r0K02K02K03K02K03K02j37j37j46j45j46j45J47J47n6n6l54l53J22J22J00J01J01
523F945J00k78k78O1O2J76J76J76J76J1J2J1J2j75j75K8K9L05L06K20j86m37l0n5m63q2q1
509F566R6R7K0K0noK15j93j26j25k57M23O6l42j60j61J29J28K18j90l43L36L35L35J74k34
496G016l27L52j41n48j35K72J8J8j48j48M38M38N02R5o69o68j13K94K95j13K14K14j5j6k14
483F911k15OM13J12k96J0O89M51k28k36J71M7M7j31j32j14j14l18l19j50j51M34M35K69j38
471G453j38K69L2L1j46j47m99m99K91O97n48n48k3k2k51J56K66K67K17K16n05n05j27K80K81
458F498j28r4r5l6L72L04j03J51J52p4p3oM02L25l54l96l96l7L70J41J41M29M30m6m53m62
$$ y = [8034, 7843, 8060, 7874, 7687, 7323, 6958, 7025, 7092, 7159, 7226, 7208, 7190, 7171, 7153, 7136, 7119, 6763, 6406, 6377, 6347, 6657, 6967, 6617, 6268, 6258, 6248, 6497, 6747, 6656, 6566, 6768, 6970, 7173, 7375, 7578, 7780, 7643, 7506, 7360, 7215, 7069, 6924, 7071, 7218, 7162, 7106, 6752, 6399, 6521, 6643, 6743, 6844, 6945, 7045, 6767, 6489, 6550, 6612, 6788, 6964, 7140, 7316, 7327, 7339, 7350, 7362, 7187, 7012, 7040, 7069, 7374, 7680, 7900, 7714, 7277, 7247, 7192, 6729, 6647, 6566, 6662, 6759, 6779, 6799, 6794, 6788, 7003, 6810, 6684, 6559, 6302, 6725, 6791, 6449, 6289, 6128, 6257, 6385, 6603, 6413, 6070, 6406, 6741, 7076, 7250, 7016, 6689, 7041, 6900, 6352, 6217, 6489, 6507, 6525, 6377, 6229, 6667, 7105, 7607, 7702, 7033, 6365, 6252, 6546, 6841, 6728, 6942, 7156, 7141, 7125, 6911, 6696, 6702, 7115, 7227, 6931, 6941, 7630, 8081, 7853, 7617, 7788, 7835, 7882, 7751, 7619, 7505, 7391, 7073, 6754, 6604, 6453, 6887, 7322, 7591, 7453, 7315, 7584, 7616, 7647, 7501, 7354, 6855, 6356, 6647, 7344, 6796, 6248, 6225, 6203, 5952, 6108, 6374, 6641, 6858, 7074, 6569, 6064, 5937, 6217, 6498, 6370, 6276, 6181, 6145, 6517, 6821, 6718, 6869, 7021, 6947, 6874, 6868, 7270, 7595, 7241, 6845, 6449, 6412, 6782, 6923, 7064, 7493, 7923, 7877, 7424, 6962]
445F962K18K34m45l93K85K85l94n82R6M19M19P1P1j84K24M66N8o89k81K53j54J01J01K36K35
433G612k65k65o1m69m68o2P5P4j03j04L38L37L64m5q5q6l83K5P33N5k86L94K67j41m80m81
420F490K1K0J82J82q5p64n59J19K17K17L0L0L57n1k46M34O33m7l43l44J48N55L51n7j28j29
407G233l57l58O2O3O2O3K36K37l75l75K3K2K00K01Q1l25n05J75K20j88Q4Q4K79K79o1o0n14
393F486n13l7l8J87J87o7L40L84k2j08j08J43J42K28m52o75LJ91J90rrJ94J95j55j54j55j54
379F214k10k10K66K66K77K77l33l34K43K44k32k32K06K06LKj12j12j12j12l38l38K73K73J08
367F183J07l67l68k9l0J75J74m6m6K93K94j50j49N5N4k59k60Q0Q1Q1Q1M20M21j35j36j35j35
353F254j49j49l52l53J36J36L39L40K49K49r0r1j54j54j54j54K56K56k20k20j65j64J75J75
$$ y = [6962, 7180, 7414, 6969, 6576, 6861, 7146, 6752, 6170, 6266, 6685, 7104, 7175, 7246, 7062, 7286, 7752, 7810, 7121, 6840, 7093, 6939, 7040, 7141, 7377, 7612, 7347, 7082, 7021, 6552, 6084, 6022, 6097, 6171, 6068, 5964, 6302, 6639, 7003, 6958, 6873, 6787, 6404, 6429, 7162, 7217, 6931, 7325, 7592, 7451, 6971, 6490, 6511, 6531, 6713, 6895, 6810, 6046, 5487, 5606, 5823, 6040, 6070, 6100, 6457, 6406, 6160, 6594, 7227, 7180, 6837, 6493, 6641, 7196, 7547, 7490, 7362, 7233, 6876, 6518, 6580, 6643, 6705, 6768, 7004, 7241, 6866, 6491, 6514, 6536, 6736, 6937, 7018, 6693, 6188, 6363, 6583, 6395, 6479, 6563, 6842, 7121, 7060, 7000, 6486, 5973, 5936, 5898, 6085, 6272, 6205, 6545, 6929, 6907, 6799, 6691, 6834, 6976, 7204, 6752, 6077, 6080, 6271, 6461, 6452, 6443, 6637, 6832, 6677, 6523, 6368, 6214, 6004, 5794, 6060, 6326, 6603, 6880, 6547, 6213, 6456, 6700, 6468, 6236, 6442, 6648, 6651, 6653, 6541, 6429, 6317, 6205, 5867, 5529, 5802, 6075, 6183, 6290, 5923, 5555, 5526, 5496, 5671, 5845, 5799, 5753, 6046, 6340, 6190, 6041, 6096, 6150, 5891, 5631, 5711, 5792, 5873, 5954, 6374, 6795, 6660, 6524, 6389, 6254, 6105, 5956, 5604, 5251, 5387, 5523, 5862, 6202, 6451, 6700, 6610, 6519, 6365, 6211, 6057, 5903, 6159, 6415, 6195, 5975, 5810, 5646, 5821, 5996]
341E996m57m56J9J9K82K82n7n8J36J35o8O11K21j87Q4Q5k64k63o45L3L99L99j70j70j55j54
328E597L21L21J51J51l24l24k61k60L51L50P9P9N4N4n1m58o37M3M42L4L06L06k17k16k16k16
315E459j99k00K77K76K15K14n32J47K36j71k14k14l1L76J47J47p4p3o43k35J89J89m0L68O94
303F308K87m77m78k82k82j03j04P37L29m18j0J06J06p2m79m07K72P05K97q9q9l43O4P2P3R7
290E820R8k96k96J79J79j69j70J88N95j52n60k79k80k83J24R8R8k4k5K89K90L10r7k49M29
277E817k88k88K05K04q0m87j48K60j12j12K54K53j33j32P0P1P5P6P5P5m39m38J98J98j39K69
264E304R0l18l17R0L10L11l0l0mm12J2J3J91J91n49n49M28M28L77l03k60k60R8R8j06j06N9
250D756O0K63K63Q5Q5Q5Q5M2M3K72j36n79n80j04N76J08J08J51J51l24l24M1M1j4L93J90k18
$$ y = [5996, 5539, 5083, 5102, 5121, 5403, 5685, 5628, 5570, 5706, 5841, 5773, 6384, 6605, 6418, 6502, 6587, 6323, 6060, 5415, 5448, 5847, 6246, 6076, 5906, 5751, 5597, 5918, 6239, 6390, 6541, 6217, 5893, 5632, 5372, 5723, 6073, 6152, 6231, 6285, 6339, 6288, 5830, 5193, 5236, 5678, 5712, 6018, 6324, 6107, 5891, 5675, 5459, 5260, 5060, 5337, 5613, 5828, 6042, 5510, 5657, 5893, 5722, 5508, 5294, 5263, 5639, 5786, 5933, 5859, 5786, 5143, 4908, 5097, 5286, 5246, 5614, 6308, 6595, 6118, 5640, 5358, 5076, 4973, 4869, 5606, 5935, 5517, 5507, 5613, 5719, 5647, 5168, 4761, 5033, 5738, 6035, 5946, 5857, 5514, 5578, 5650, 5723, 5820, 5918, 5622, 5326, 5505, 5684, 5515, 5345, 5533, 6128, 5976, 5416, 5137, 4857, 4574, 4698, 4796, 4894, 4870, 4845, 5134, 5424, 5734, 5637, 5388, 5817, 5529, 5241, 5446, 5650, 5570, 5083, 4935, 5195, 5083, 4971, 5225, 5478, 5345, 5213, 5283, 5354, 5429, 5505, 5580, 5655, 5216, 4778, 4976, 5174, 5035, 5304, 5394, 5076, 4759, 4849, 5159, 5470, 5440, 5410, 5406, 4994, 5006, 5019, 5210, 5401, 4852, 4303, 4731, 5159, 5536, 5233, 4973, 4713, 4811, 4909, 4803, 4697, 4756, 4816, 5079, 5342, 5427, 5512, 5597, 5682, 5724, 5767, 6039, 5903, 5324, 4744, 4640, 5216, 5324, 5432, 5583, 5734, 5410, 5086, 5127, 5168, 5154, 5547, 5737, 5519]
237E519J06J05j23j23l5l4l4l5K10K10OOk83k82p9p9j2j2j2j2NNK60j48k12J95l74l74K80
222D644O88J19n61j72K36j1j1l33P4j55j55J66J67L70L70k75k75k49k50r2L15N61N61l60l60
210E012J16J15J52J51j62j63r0L17L17r1k28k29O1O0k9m36m37k9o6o7k70J37L11L11J33J33
197E029K10K11M39L3l50l50N7l50J9J9J9J9l7L71K61n54k37k37N2N2R4R4R4R4j31j31j31j32
183D527M50M51m33m33k9l0n5n4J53k55l05N09K59j49k08k09K59K58K59K58m3m2m3m3J7J6l23
169D762l23J57J56m7m7L0K9j75j74O3O4M02M03L18L18j57j58l30l31JM08M93l22n17j10k94
156D619J13P33q2k60J47R6l11k08k07k33k33L9L9L79L78l17l16K94K95J33J34k07k06M72M71
144E762lm%JJ%k62k61n8n8k02k02KJn2n3n2n3Q8Q7L93m22m62L53N06l09k93k92mmK95K94m5
$$ y = [5519, 5625, 5730, 5607, 5484, 5449, 5415, 5381, 5346, 5556, 5766, 5772, 5778, 5495, 5213, 5134, 5055, 5043, 5031, 5019, 5007, 5012, 5017, 5277, 5129, 4917, 5112, 4738, 4364, 4644, 5332, 5451, 4890, 4718, 4954, 4943, 4932, 4599, 4673, 4518, 4363, 4529, 4696, 5066, 5436, 5161, 4886, 4637, 4387, 4295, 4610, 5171, 5732, 5372, 5012, 5128, 5243, 5395, 5546, 5384, 5221, 5131, 5448, 5765, 5674, 5446, 5217, 5278, 5338, 5309, 4873, 4436, 4407, 4341, 4274, 4004, 4141, 4452, 4763, 4896, 5029, 5239, 5450, 5889, 5922, 5572, 5222, 5279, 4929, 4948, 4967, 4986, 5005, 4968, 5339, 5600, 5046, 4809, 4572, 4624, 4676, 4770, 4864, 4958, 5052, 4921, 4790, 4659, 4527, 4977, 5428, 4995, 4562, 4533, 4503, 4448, 4394, 4547, 4292, 3987, 4496, 4755, 4606, 4398, 4189, 4448, 4706, 4965, 5223, 5180, 5138, 5095, 5052, 5069, 5085, 4762, 4439, 4596, 4752, 4705, 4658, 4688, 4717, 4542, 4368, 4431, 4495, 4897, 5300, 5618, 5936, 5779, 5621, 5291, 4960, 4961, 5369, 5862, 5540, 5023, 4913, 4619, 4732, 5465, 5383, 5123, 5270, 5366, 5055, 4847, 4640, 4407, 4174, 4213, 4252, 4631, 5009, 4692, 4376, 4670, 4965, 5098, 5232, 5025, 4819, 5291, 5762, 5759, 5755, 5755, 5756, 5757, 5757, 5495, 5234, 5176, 5118, 4916, 4714, 4716, 4717, 4665, 4612, 4560, 4507, 4595, 4682, 5075, 4653, 4191, 4544, 5050, 4741, 4448, 4156, 4152, 4148, 4443, 4737, 4692]
127D692m5P3P4j30j30j12j13m85M65N42j38m01Pj37j38R2R1K79K78l33l32J60J61m3m3m4m3
113D247J61J61K21K21J7J8j44j44J95J96o5o6K74K75k65k65k65k65m65m66M18M17O5O5j38
101D403j39M01M00L5L6J63k45l98K82M3M3Q5Q5j35j36O9O8l60l61j57j56M12M12P3P2M1M1
87E077j63j63J38J38j33K74r1p70j16K91m0m0J47J47K95l85k31J76l3l2opM0M0M0M0p4p5p4
73D410p5L65L65j11j11J06J06l69l70K53K54k22k22j21j20Q4Q3J89J89j51j50J80J80m31m31
60C880N38N38m80m81J60J60J60J60m01m01M82M81L6L6l03l04j52j53N1N0J06J07J06J06J05
48D587J05l69l70j71j70L05L05o8o7M16Rl44M72M46l69j94j93m1m1J67J67l7l7j12j12K27
35D511K28J85J85k90k91j2j1q9L19P23r3m74o7L41o6J89J89l93l93Q3Q2l88l89K23K22K3K4
$$ y = [4692, 4647, 4720, 4794, 4664, 4534, 4422, 4309, 3824, 4289, 4831, 4693, 4292, 4299, 4162, 4024, 4116, 4207, 4486, 4764, 4431, 4099, 4259, 4420, 4377, 4334, 4290, 4247, 4408, 4569, 4790, 5011, 5028, 5046, 4902, 4758, 4953, 5149, 5084, 5018, 5292, 5567, 5302, 5037, 4772, 4507, 4042, 3576, 3994, 4411, 4476, 4541, 4403, 4264, 4665, 5065, 5100, 5136, 5299, 5054, 4656, 4938, 4981, 5024, 5109, 5194, 5059, 4923, 4992, 5060, 4700, 4339, 4182, 4026, 4438, 4850, 4923, 4995, 5036, 5077, 4914, 4751, 4889, 5027, 4894, 5168, 5077, 4307, 4191, 4482, 4442, 4402, 4549, 4696, 4991, 4606, 4375, 4551, 4518, 4486, 4480, 4473, 4513, 4553, 4593, 4633, 4559, 4484, 4410, 4335, 4700, 5065, 4954, 4843, 4949, 5055, 4686, 4316, 4569, 4823, 4601, 4379, 4258, 4138, 4222, 4305, 4494, 4683, 4532, 4382, 4562, 4742, 4311, 3880, 4418, 4956, 4476, 3995, 4155, 4315, 4475, 4635, 4234, 3833, 4315, 4796, 4832, 4868, 4565, 4261, 4109, 3956, 4007, 4057, 4163, 4270, 4376, 4482, 4587, 4692, 4323, 3953, 3782, 3612, 3917, 4222, 4154, 4087, 4503, 4512, 4168, 4640, 5086, 4717, 4523, 4330, 4289, 4248, 4415, 4582, 4545, 4508, 4396, 4284, 4511, 4739, 4924, 5109, 4819, 4528, 4516, 4505, 4416, 4735, 5458, 5365, 4891, 4824, 5165, 5099, 5288, 5477, 5084, 4691, 4774, 4856, 4468, 4079, 4302, 4524, 4547, 4571]
21D571j81j81K6K5K5K5J83J82j57j57J64J64j76j75M5M5L85L85r8r8l02l02R3R3R3R3K52K52
7E274k24k23J63J62j76j77ppl47l46K13K14M17M18l59l58j55j55K4K3j38j37j40N39P43O3
-6E304m11m12j14j15J80J79j61j60J37J37J36J37n2n2n2n2N4N4k86k86L8L9L8L8K03K04K03
-20D928K04r6r5r6r5k8k8J76J76J12J11m99n00q8q8L87L88P4P5M56k23l11l12j5j5j20j21
-33D357Q3Q3K44K45k31k31J09J10r5r4M71M70J31J31k92k91k91k92J5J4J4J5l13l12pM00P70
-47E213m52p50K01L15L14L5L4k41k42l7l8J53J54J53J53q4q4q5q4K46K45k29k30K24K25K0
-60E129K1k25k26J14J14l57l57L90L90J86J86J86J86l19l19j16j15l47l47ppL5L6K39K39j04
-73D605j04J00J00L12L13J08k99j78N01J19k88j99j99k1k1j20j21j20j20K83K83P9Q0j39j40
$$ y = [4571, 4390, 4209, 4235, 4260, 4285, 4310, 4493, 4675, 4518, 4361, 4525, 4689, 4513, 4338, 4383, 4428, 4813, 5198, 5100, 5002, 4700, 4398, 4491, 4584, 4677, 4770, 5022, 5274, 5050, 4827, 4990, 5152, 4976, 4799, 4792, 4785, 4438, 4092, 4305, 4519, 4936, 5354, 4995, 4637, 4482, 4327, 4351, 4374, 4236, 4099, 3959, 4498, 5241, 5304, 4893, 4481, 4367, 4252, 4432, 4611, 4450, 4290, 4427, 4564, 4700, 4837, 4785, 4733, 4681, 4629, 4683, 4737, 4451, 4165, 4203, 4242, 4280, 4318, 4521, 4725, 4928, 5132, 5036, 4941, 4845, 4750, 4722, 4694, 4870, 5046, 5158, 5269, 4770, 4270, 4182, 4094, 4481, 4869, 4943, 5018, 5474, 5251, 4940, 4628, 4613, 4598, 4478, 4357, 4440, 4523, 4767, 5012, 4781, 4550, 4659, 4769, 4674, 4580, 5051, 5521, 5652, 5783, 5491, 5200, 4909, 4617, 4632, 4646, 4660, 4675, 4362, 4050, 4043, 4443, 5213, 4761, 4011, 4212, 4527, 4841, 4876, 4910, 4669, 4427, 4390, 4352, 4505, 4659, 4812, 4965, 4881, 4797, 4712, 4628, 4874, 5119, 4890, 4660, 4884, 5109, 5129, 5150, 4925, 4699, 4813, 4927, 4570, 4213, 4603, 4993, 5179, 5365, 5551, 5737, 5418, 5099, 4983, 4868, 4521, 4174, 4167, 4160, 4195, 4231, 4470, 4709, 4605, 4501, 4601, 4701, 5013, 5326, 5434, 5135, 4957, 5458, 5577, 5289, 5090, 4891, 4870, 4849, 4729, 4608, 4488, 4368, 4651, 4934, 5013, 5093, 4954, 4814]
-85D814J41J41M12n38p42K09K41K40R7R6l03l03L7L7j54j54N0M9K15K15K16K15L0L0j73n81
-98D537n01J79K47K47J88J88j51j51j00j01K40K39j89j90J08J08K2o56k74J33j10K98O79J
-110D991p38p38J02J03L92L93N3N3j34j33K06K05L72L71L2L2l67l67k8k8K09K09k66k66p6
-123D582p5p5p6O3O3j42j41K75K75P1P1j37j37j37j37J05J05L26l54q63j83M10M11N16N17
-136E333l66l67j08j09q3q3k15J93L03L03q3q3k62k61l13R6N70J63K6K7n93j86L91j6J71N78
-149E026P9n99q2L26K70K70N26J17l51l51P3P4L9l68l68L9k72k73K28K29k86k85J90J90J89
-161D630J88l2m39j34K73M44k36k74M05K10j98OOJ59J59M37K9n82j75M6M7k43k42k5L82M3
-174D884l64Q9R0O4O5l20l20p3L34J56J56K07K06M9M56j12n20m65K14O47K40n0n0pm15n67
$$ y = [4814, 4955, 5096, 5508, 4970, 4228, 4437, 4678, 4918, 5015, 5111, 4808, 4505, 4542, 4579, 4425, 4271, 4321, 4370, 4585, 4800, 5016, 5231, 5261, 5291, 5118, 4537, 4036, 4215, 4462, 4709, 4897, 5085, 4934, 4783, 4683, 4582, 4822, 5061, 4872, 4682, 4790, 4898, 4920, 4264, 3990, 4123, 4013, 4311, 4990, 4991, 4253, 3515, 3617, 3720, 4112, 4505, 4558, 4611, 4477, 4344, 4550, 4755, 5127, 5498, 5530, 5562, 5195, 4828, 4800, 4772, 4981, 5190, 4924, 4658, 4582, 4507, 4432, 4356, 4419, 4482, 4340, 4199, 4474, 4749, 4820, 4891, 4754, 4617, 4480, 4343, 4448, 4553, 4879, 4525, 3662, 3479, 3889, 4300, 4816, 5333, 4967, 4600, 4492, 4383, 4300, 4217, 4002, 4195, 4498, 4801, 4718, 4635, 4373, 4112, 3799, 3895, 4465, 4628, 4654, 4681, 4088, 3902, 4293, 4277, 4448, 5026, 5105, 4506, 4424, 4750, 5020, 5290, 5816, 5933, 5582, 5231, 5304, 5378, 5417, 5049, 4681, 4720, 4448, 4175, 4403, 4632, 4346, 4061, 4251, 4441, 4630, 4818, 4786, 4347, 4213, 4486, 4930, 4694, 4420, 4825, 5035, 4837, 4843, 4849, 5008, 5167, 5604, 5633, 5051, 4876, 4922, 4969, 4726, 4484, 4459, 4841, 4884, 4520, 4609, 4699, 4763, 4828, 4508, 4188, 4115, 4449, 4605, 4761, 4968, 5174, 5223, 5679, 5567, 5047, 4582, 4796, 5443, 5683, 5633, 5583, 5576, 5161, 4594]
-187D594J11M09Jo7o6k96k96k0k0k0k0Q4Q4K87K88K5K4k30J77l49p56K71K70n14j07N46N47
-201D957K93K93o4m71k88J19j10j11L06P13K38j69q5q5m50m49o2o2m44K35K39K40P8P8k69
-213D670k69L43L42PPPPk75k74O4O5j5j6n59j52L6M44J021P0n11J68M73k06l86K1Mm03l99
-227D284RK29j78j04N75K35m43k91J17M9M8j53j54o9L38P6l33l5l5k04M74L21q6K33K32k26
-240D909k26l03L76K49j59r9L08M61k18n39j31J83J83L61m7k0k1j37j37j37j37m22m21J90
-252D066J90N67N68K28m51j33K75LLk80k80k29M50K25m54j73j74m45N05N31j49J07l01k93
-265D356k92J18N25K96j11K97j12k98O53O87k64k55k56k47J61m3m51K2K2m36m37k07M72N23
-277D723J15J4J3m62m62j13K93J33N40O32m7l44O4Q9Q9k25k24L10L11j64j65j77j77M08M09
$$ y = [4594, 4705, 5114, 5115, 5048, 4982, 4686, 4390, 4370, 4350, 4330, 4310, 4394, 4478, 4765, 5053, 5078, 5102, 4872, 5049, 4700, 3944, 4215, 4485, 3971, 3864, 4410, 4957, 5250, 5543, 5479, 5008, 4720, 4839, 4729, 4618, 4924, 5637, 5875, 5706, 5621, 5536, 5086, 4637, 4575, 4513, 4069, 4304, 4543, 4783, 4861, 4939, 4670, 4401, 4744, 5086, 5093, 5100, 5107, 5114, 4839, 4565, 4629, 4694, 4679, 4663, 4104, 3952, 3988, 4432, 5453, 5523, 5012, 5180, 5653, 5447, 5061, 5082, 5086, 4683, 4284, 4293, 4522, 4344, 4240, 4815, 5050, 4607, 4316, 4433, 4482, 4530, 4377, 4223, 4154, 4492, 4568, 4235, 4200, 4165, 3961, 4435, 4756, 4670, 4903, 5135, 4909, 4683, 4380, 4756, 5005, 4846, 4747, 5055, 5516, 5298, 4759, 4628, 4811, 4994, 5355, 5308, 5288, 5267, 5130, 4993, 4856, 4719, 4297, 3876, 4066, 4256, 4823, 5391, 5619, 5168, 5035, 5310, 5313, 5316, 5036, 4756, 4527, 4977, 5202, 4748, 4575, 4401, 3956, 4461, 4992, 4843, 4950, 4649, 4356, 4064, 4182, 4707, 5003, 4892, 5189, 5077, 4779, 5432, 6119, 5855, 5600, 5344, 5097, 5258, 5215, 4764, 4786, 4808, 4372, 3935, 3728, 4200, 4723, 4838, 4852, 4865, 4403, 3941, 3828, 4121, 4254, 4794, 5426, 5379, 5035, 5099, 5188, 5277, 5052, 4828, 5138, 5449, 5285, 5120, 4943, 4766, 5174, 5583]
-289E583J26k81k81J27q6q6J94k13l73L4j7L91M58k20o96j7L23q5m2L66L8L9l01l01j93o00
-302C887J30Q09J00J00L72l6j01j01K12K13k46k45k46k45KLQ7M95J86k23j71j71l16l16K4
-315D203K4K53K53q6q7p7p7K63K63r4r4J10J09L9M0m37m36J16J15N91N91J02J01k37k38j28
-328E182j27O8M75L34m80k2L85k68k69k43k43m7m7m7m7j87j87O7O8k37N77O04k12m96q9K43
-341D755K42L4L4j70j69L4L4K37K38K39K40j00j00l89l88j85j85N49N50K10K09n20n20l16
-353D563l17r1r0O56O56p4p3p4p4K0K1K0K0p8p7p8p7j38j39K01K01K3K3K3K2j28j28n2m60
-367D301j62O52L98rm4m3m08m09J14J14L17L17K70K70m78m77k31k31K44K44K87K88l24l24
-379D676N0N0K4K4J94k13m94L22L17m98m47L68R2R1l33l34O44O43j04j04q2q2q2q1M40M40
$$ y = [5583, 5709, 5428, 5147, 5274, 5188, 5102, 5296, 5083, 4710, 4744, 4727, 5118, 5576, 5356, 4660, 4643, 4966, 4881, 4839, 5205, 5243, 5282, 4981, 4680, 4487, 3887, 4017, 4826, 4926, 5026, 5398, 5362, 5261, 5160, 5372, 5585, 5339, 5094, 4848, 4603, 4605, 4608, 4695, 5190, 5376, 5153, 4982, 4811, 4495, 4179, 4203, 4227, 4480, 4733, 4647, 4560, 4483, 4406, 4669, 4932, 4838, 4744, 4854, 4963, 5002, 5042, 4605, 4169, 4285, 4400, 4991, 5582, 5684, 5785, 5548, 5310, 5182, 5055, 5123, 5598, 5932, 5452, 5430, 5815, 5547, 5278, 5035, 4792, 4745, 4698, 4651, 4604, 4417, 4230, 4297, 4365, 4128, 4705, 5309, 5097, 4601, 4512, 4755, 4997, 5031, 5065, 4895, 4726, 4760, 4794, 5031, 5269, 5508, 5748, 5648, 5548, 5159, 4771, 4586, 4401, 4950, 5500, 5710, 5919, 5399, 4879, 4563, 4246, 4155, 4065, 4721, 5377, 5303, 5230, 5156, 5082, 5102, 5123, 5143, 5163, 5085, 5008, 4930, 4853, 4715, 4576, 4777, 4978, 5001, 5024, 5047, 5069, 4941, 4813, 4761, 4301, 4139, 4791, 5189, 5180, 5136, 5093, 4685, 4276, 4390, 4504, 4821, 5138, 5408, 5678, 5200, 4723, 4492, 4261, 4505, 4749, 5036, 5324, 5000, 4676, 4726, 4776, 4800, 4824, 5018, 4805, 4311, 4633, 4950, 4452, 4005, 4373, 4465, 4556, 4223, 3889, 4533, 5176, 5072, 4968, 4886, 4804, 4722, 4641, 5081, 5521]
-393E521J01J01j48j48l27l27L02P09N22j56o75o75J66J66o3o4o3o4l53l54l54l54l1l1l1
-405C370l1L46L47L47L46L55L55k56k56J12J11r2r2k92k92M8M8J33J33J32J33j05j05J67k41
-418D721m54K24L85k1R2R3J35k72l81K99N96J88k79k79L6L5J41J41o2o3m2m1l13R4L38l41
-431D970n02r4J35J34J60J60n0n0k12k11k03M76L23q4j9j8J60J59K4K4K4K4n29n30n5n4J23
-444D285J24L28L27L8L9L8L8J87J87M08k72p24m5J41J42k11k11J29J29o0n9o0n9K03K04j36
-457E110j36n5n6n5n5nml44l44K89K88K89K88k72k72o8o8K28K27K27K28l03l04r9j00r8r8
-471D438L77L76m76m76J35J35M2M1M2M2Q0P9N5N4K04k03l56L22L15L14J7J8K30K30n16n17
-484E002n4n4n4n4r6r7J08J07L49L49J0J0Q5Q5k55k54K12K12j52j53K06k01n58J21OPM9M9
$$ y = [5521, 5622, 5723, 5575, 5427, 5100, 4773, 5075, 5784, 6306, 6150, 5475, 4800, 4966, 5132, 5069, 5005, 4942, 4878, 4525, 4171, 3817, 3463, 3432, 3401, 3370, 3339, 3685, 4032, 4379, 4725, 5080, 5435, 5179, 4923, 5035, 5146, 5054, 4962, 4670, 4378, 4426, 4474, 4607, 4740, 4872, 5005, 4900, 4795, 4962, 4721, 4267, 4491, 4876, 4855, 4947, 5040, 5175, 4903, 4522, 4821, 5417, 5605, 5326, 5047, 5083, 5118, 5259, 5400, 5338, 5275, 5233, 5192, 4879, 4973, 5311, 4970, 4468, 4374, 4509, 4643, 4803, 4963, 4913, 4863, 4651, 4440, 4237, 4713, 5036, 4952, 4933, 4915, 5075, 5234, 5258, 5282, 5306, 5330, 4801, 4271, 4216, 4162, 4285, 4409, 4737, 5064, 5102, 5141, 5179, 5217, 5404, 5591, 5999, 5727, 5003, 4958, 5099, 5241, 5030, 4819, 4948, 5077, 5017, 4958, 4898, 4839, 5042, 5246, 5110, 4974, 4919, 4863, 4808, 4753, 4748, 4744, 4400, 4056, 4345, 4633, 4922, 5210, 4938, 4666, 4598, 4530, 4758, 4985, 5212, 5440, 5137, 4833, 4734, 4634, 4536, 4438, 4815, 5191, 4715, 4239, 4374, 4509, 4551, 4592, 4634, 4676, 4756, 4835, 4890, 4944, 5148, 4945, 4589, 4911, 5226, 5540, 5557, 5575, 5805, 6035, 5519, 5002, 4948, 4894, 4840, 4786, 4690, 4593, 4701, 4808, 5157, 5506, 5516, 5526, 5611, 5696, 5441, 5187, 5399, 5611, 5459, 5306, 5512, 5311, 4753, 4874, 4880, 4887, 4936, 4985]
-498D985J23J24k16k16j77j78J62J62J07J08r7r6K22K22k54k53J7J7J7J7j14j15J15J15p0
-510D727L38K88l92j80j80l75l75l17M97Q63M7n72j65N74N74J19J20k20k20J4J3J4J3k23k24
-523D758K26K27n9m65m91L24K42K42R0Q9j23j23K17K17l01l01L8L9k1k1r8L10O69j46k74k73
-536D992m43m44L04L04M48M48m34m35l1l2n41K75O22j93k3k3L2L3K36K35k05k06K70K69j9
-549E439j9l58l59M19M18oq22L85L84k78k78j22j23L53L53j36j35j61j60M11Lm54L60R3l15
-561D892N1M58M3l65n42j36L1L0N6N6K22K23j17j17p5p5p4p5O86O86o1o1k39k39l15R1L26
-575E360m90m64L51M1M1N93k22m9O31J98J98j54j54j80K28k31k30k06k05J94J94l75L2J17
-587E218J17J42J43m90m91J22J21l04l03K82K83L71l6o1L46J86k22m43m42K92K92L17r0J31
$$ y = [4985, 5108, 5232, 5016, 4800, 4623, 4445, 4607, 4769, 4876, 4984, 4887, 4791, 5013, 5235, 4981, 4728, 4745, 4762, 4779, 4796, 4682, 4567, 4682, 4797, 4727, 5065, 5353, 4961, 4781, 4601, 4226, 3851, 3534, 4031, 4894, 4941, 4369, 4204, 4778, 5352, 5471, 5591, 5371, 5151, 5165, 5178, 5192, 5205, 4982, 4758, 4984, 5211, 5152, 4687, 4196, 4520, 4762, 5004, 5094, 5183, 5060, 4937, 5154, 5371, 5070, 4769, 4807, 4846, 4825, 4804, 4706, 5016, 5685, 5539, 5265, 4992, 4549, 4105, 4409, 4713, 5161, 5609, 5175, 4740, 4709, 4677, 4136, 4411, 5033, 4840, 4817, 4794, 4826, 4859, 5095, 5330, 5125, 4919, 5189, 5458, 5439, 5420, 5062, 4703, 5122, 5540, 5534, 4712, 5097, 5481, 5203, 4925, 4803, 4680, 5033, 5386, 5250, 5115, 4954, 4794, 5205, 5208, 4754, 5114, 5207, 4892, 4943, 5401, 5444, 5079, 4537, 4401, 4432, 4462, 4518, 4574, 4796, 5019, 4902, 4785, 4710, 4635, 4561, 4486, 5172, 5858, 5797, 5736, 5497, 5258, 4943, 5034, 5360, 4870, 4406, 4757, 4798, 4839, 5432, 5210, 5161, 5792, 5990, 6188, 6034, 5880, 5700, 5928, 5697, 5467, 5261, 5056, 5250, 5444, 5069, 5101, 5218, 5335, 5477, 5620, 5130, 4639, 4761, 4882, 4578, 4275, 4557, 4840, 5211, 5175, 5114, 5460, 5646, 5424, 4981, 4539, 4831, 5123, 5440, 5350, 5481]
-599E481J32m80m80m37k9K16K17L08L08m22j4K06k01K8M36J41J40k16o23j78j78J11J11J67
-611D744k41m20K60M76O9L15L15lm11j81j82J45J46q4q4J87k20k19J87k45k45j6j6J44J44
-623D565J44J45J22J23j06j06M6l62k00M78L18r0j33j32n34j26J45J46j94K13P06K7j24j23
-635D948j92K16J99K00nnj44n53l65L14K79K80L22L22j33j33j33j34j67j67n07n07j8j7J86
-648D086J86K37K37L3L4J82J81k93k94k42k43K33K33j33j32P2P1j11j11j11j11M94M95k28
-660D765k27j81K27M22k57r7N82L87k0k92k92j14j14k77k78p4p4L42L42J38J38k54k55K21
-672D758K21J07J06L8l69j92M86M86j93k44J64j08j08l8l8J66J66k63k63P7P6K81K80n9n9
-685E478j27j27K12K13j87j86J7J7l69l69k9l0l3l3K39j69k32M46N83J75l52p59j90M89N6
$$ y = [5481, 5613, 5133, 4653, 4216, 4187, 4403, 4620, 4928, 5236, 4814, 4800, 5006, 4805, 4833, 5269, 5410, 5550, 5334, 4711, 4533, 4355, 4466, 4577, 4744, 4503, 4083, 4343, 4819, 4888, 5203, 5518, 5515, 5104, 4923, 4741, 4886, 5032, 4948, 4864, 5051, 4831, 4612, 4799, 4554, 4309, 4293, 4277, 4421, 4565, 4709, 4854, 4976, 5099, 4993, 4887, 4933, 4571, 4371, 4849, 5167, 5077, 4944, 4812, 4278, 4152, 4297, 4443, 4249, 4462, 5168, 5195, 5071, 4948, 4756, 4972, 5171, 5371, 5366, 5361, 5217, 4664, 4299, 4613, 4892, 5172, 5494, 5816, 5683, 5550, 5417, 5283, 5116, 4949, 4442, 3935, 3917, 3900, 4086, 4272, 4509, 4746, 4779, 4813, 4995, 5176, 4883, 4589, 4347, 4104, 4337, 4570, 4437, 4305, 4377, 4448, 4337, 4226, 4115, 4004, 4498, 4993, 4765, 4538, 4357, 4584, 5006, 4749, 4652, 5234, 5621, 5601, 5309, 5017, 4903, 4789, 4512, 4234, 4160, 4086, 4428, 4770, 4908, 5046, 4792, 4537, 4758, 4979, 5086, 5192, 5230, 4861, 4669, 5155, 5641, 5448, 5204, 5368, 5260, 5152, 5114, 5076, 5242, 5408, 5145, 4882, 4959, 5035, 5316, 5596, 5537, 5478, 5351, 5224, 5436, 5649, 5462, 5276, 5293, 5310, 4941, 4572, 4543, 4513, 4480, 4447, 4686, 4517, 4285, 4731, 5314, 5489, 5137, 4378, 4188, 4677, 4733]
-697D733N7R8R9j28j27j28j27K46K46K46K46j07j08j07j07J05J05l45l45J95O03j02p81l82
-709D085K5K29K30L9L9m36m36L62L62J58J58j36j35O9O8J11J11J11J11J13J13J13J13k74k73
-722E030k73k73P5P4q6q7k98L80L72n79j35N44J02J02O5O4j14j14j8L89m3m4r9r8p3p4Q8M96
-736E373K92j16l02l03l28l28q1q0K84K84rL98n1m59OM14j9k0l6L71L20l59l02l03J31J31
-749D908K03K03K4K5k37J71L50l30m78p1llm73m73M5M52o9p0M06M06J84k24k23J84r2r2r2
-762D631r2L12r5m43N08M90j88q7q6R1R2l58l59j03L04P4P5R8R8R8R8RRRRK71K70l41l40r5
-777D959r4r5r4j15j16K25K24k59k60K16K16P2P2P2P2l56l57j7j7J74J74l0l0r4r3J10J10
-791D669mmnmN05N05j32j32M5l62o17J97J1l96j16j17J60J61m4m4o9o9J35J34J83J83r7L10
$$ y = [4733, 4790, 4888, 4987, 4859, 4732, 4604, 4477, 4723, 4969, 5215, 5461, 5354, 5246, 5139, 5032, 5137, 5242, 4897, 4552, 4747, 5350, 5248, 4467, 4085, 4110, 4339, 4569, 4608, 4647, 4211, 3775, 4137, 4499, 4657, 4815, 4679, 4544, 4613, 4681, 4792, 4903, 5014, 5125, 5238, 5351, 5464, 5577, 5303, 5030, 4757, 4484, 4559, 4633, 4547, 4460, 4162, 4542, 4914, 4335, 4200, 4744, 4846, 4948, 5013, 5077, 4963, 4849, 4831, 5220, 5177, 5133, 5034, 4936, 4863, 4789, 4877, 5373, 5665, 5549, 5247, 4944, 4616, 4288, 4207, 4127, 4411, 4695, 4686, 5084, 5033, 4574, 4580, 4994, 4975, 4955, 4919, 5290, 5610, 5251, 4949, 4646, 4777, 4908, 5111, 5314, 5338, 5363, 5126, 5297, 5647, 5317, 4839, 4768, 4765, 4762, 4289, 3816, 3861, 4313, 4244, 4174, 4580, 4986, 5170, 4946, 4723, 4907, 4815, 4723, 4631, 4539, 4851, 4756, 4313, 4821, 5311, 5123, 5036, 4950, 5041, 5133, 4775, 4416, 4313, 4617, 4691, 4766, 4864, 4962, 5060, 5158, 5167, 5176, 5185, 5194, 5465, 5735, 5394, 5054, 4959, 4865, 4770, 4676, 4561, 4445, 4670, 4894, 4635, 4375, 4591, 4807, 4879, 4951, 5023, 5095, 4739, 4382, 4365, 4348, 4522, 4696, 4666, 4636, 4542, 4449, 4559, 4669, 4665, 4661, 4656, 4652, 5157, 5662, 5530, 5398, 5443, 5081, 4464, 4661, 4672, 4276, 4160, 4043, 4203, 4364, 4320, 4276, 4207, 4138, 4273, 4407, 4590, 4773, 4676, 4986]
-805D986K08o07j48K59J31J32J56J57j74j74j75j74P0P0K73K74j1j1k06o14n12L04K86O94
-817E194K94n20o05j98k7k8K02K02M0M1K44K44m05m05K06K06k06k06K70K70J38J39J38J39
-829E367jkk05k05N6N5m19m20K13K13j27j26j6j6K56j51p93j13M97M98n2n2J7l92o04P6N08
-843D062J01k14k15l6l6L6L6O47O47n7n8n7n8J1J0j93j93M3M3M4M3M7M8j57j56M9M8L88L89
-857E262O9P0m99m99k93L86K34j74k12k13l4O46J6l92L55L56K9K8K9K9J09J10k30k30K79K79
-870E510j96j96j45j46j46j45P5P5P5P5j42j42L34L33p4p4J30J29k28k28k29k28L0L1j48j48
-883D182k42J65N48j32l02J06j66j66J7J7J7J6j10j11L65L65p7p6k80k79j95j95QRL61L61
-896D206j14j14M79M80K76K77m91m91L07L06n03L11Q2l26r6r6K18K17n20n21L62L62r8r8r8
$$ y = [4986, 5194, 4587, 4439, 4698, 4829, 4961, 5117, 5274, 5100, 4926, 4751, 4577, 4647, 4717, 4990, 5264, 5253, 5242, 5036, 4422, 3910, 4214, 4500, 5194, 5488, 4968, 4363, 4165, 4138, 4110, 4312, 4514, 4554, 4595, 4839, 5083, 4678, 4273, 4479, 4685, 4479, 4273, 4543, 4813, 4951, 5090, 5228, 5367, 5366, 5364, 5159, 4954, 5010, 5065, 4646, 4226, 4439, 4652, 4525, 4399, 4383, 4367, 4623, 4472, 3679, 3566, 4063, 4561, 4509, 4457, 4474, 4082, 3478, 3554, 4062, 4163, 3949, 3734, 3698, 3662, 3698, 3734, 4381, 5028, 4971, 4913, 4856, 4798, 4809, 4819, 4626, 4433, 4476, 4519, 4563, 4606, 4653, 4701, 4544, 4388, 4437, 4485, 4873, 5262, 5331, 5401, 4902, 4403, 4110, 4496, 4730, 4556, 4344, 4131, 4097, 4743, 4759, 4367, 4722, 5078, 5107, 5135, 5164, 5193, 5302, 5412, 5182, 4952, 5231, 5510, 5314, 5118, 4973, 4827, 4681, 4536, 4611, 4686, 4761, 4836, 4694, 4552, 4886, 5219, 5145, 5071, 5201, 5330, 5102, 4874, 4645, 4417, 4447, 4478, 4330, 4182, 3940, 4105, 4653, 4521, 4219, 4325, 4159, 3993, 4010, 4027, 4044, 4060, 3950, 3839, 4204, 4569, 4492, 4416, 4136, 3857, 3662, 3467, 3475, 3484, 3845, 4206, 4092, 3978, 4457, 4937, 5213, 5490, 4999, 4508, 4815, 5121, 4618, 4929, 5011, 4685, 4589, 4493, 4711, 4928, 4408, 3887, 4249, 4611, 4513, 4415, 4317]
-909D317r7L05L05J02J01K23K22o60o60j76j77J63J63L87L86q9q9L61L61n22n22p4p4K65K66
-922D787j30j29j29j30J95J95k80k81k08k09K42K41K89j20n77K37L01j07J74J74R4R4j10j09
-934D504n0n0n1n0k01k01K74K74L2L2L2L2r5r4r5r5J05J05J05J04K7K7K31K30k83k83J92J93
-948D951j07j07K32K33m68m68j37K71K62n53k98J10L43L43K8K9l63l63J12J12J63J63k28k27
-960D033P29q5p22R3K67j40M79M79l4l3l4l4k58k59m62m63j66j66k69O83R29K49O3l44l79
-972D156K8J13J14j93j92J1J2m7m6M29M29k5k6k5k5j54j54J86J86r5r4J09J09j37j38j37j37
-986D257j00r9K41K40p1p0M05M04j55j56M9M8j85j85l89l89J84J84L88L88k63k62k62k63L9
-998C978L9j64j65M15M14K37K36j92K15L93k86m25j8J86J86j41j40J98J99l00l00n04n04O5
$$ y = [4317, 4220, 4525, 4830, 4932, 5033, 5256, 5478, 4818, 4158, 3982, 3805, 3968, 4131, 4518, 4904, 4815, 4726, 5087, 5448, 4926, 4404, 4330, 4256, 4521, 4787, 4657, 4528, 4399, 4269, 4464, 4659, 4379, 4098, 3890, 3681, 3923, 4164, 4453, 4333, 3756, 3993, 4294, 4187, 4361, 4535, 4629, 4723, 4613, 4504, 4454, 4404, 4353, 4303, 4102, 3901, 4175, 4449, 4481, 4513, 4545, 4577, 4482, 4388, 4293, 4198, 4303, 4408, 4513, 4617, 4644, 4671, 4902, 5132, 4849, 4566, 4758, 4951, 4844, 4737, 4969, 5202, 4734, 4266, 4129, 4400, 4662, 4109, 3811, 3921, 4264, 4607, 4635, 4664, 4301, 3938, 4050, 4162, 4325, 4488, 4260, 4033, 4762, 4677, 3955, 4048, 4315, 4175, 4654, 5133, 5099, 5066, 5032, 4998, 4740, 4481, 4019, 3556, 3390, 3224, 2955, 3638, 4567, 4816, 4879, 4535, 4156, 4184, 4297, 4411, 4218, 4026, 4037, 4049, 4002, 3956, 4385, 4814, 4789, 4763, 4738, 4713, 4559, 4405, 4591, 4777, 4682, 4588, 4697, 4806, 4669, 4531, 4394, 4257, 4157, 4058, 4299, 4539, 4468, 4398, 4803, 5207, 5052, 4896, 4945, 4993, 4808, 4623, 4234, 3845, 4029, 4213, 4601, 4989, 4726, 4464, 4202, 3939, 3978, 4017, 3853, 3688, 4103, 4517, 4754, 4990, 4798, 5013, 5406, 5120, 4695, 4677, 4863, 5049, 4908, 4768, 4966, 5165, 4865, 4565, 4061, 3557, 3622]
-1010C622O5lM05P59Q1l78K9r8n05Q9Q9k28k27L84L84k15k14J25J24L6L6L6L6P8P8P8P9P8
-1024D823P8K8o52k87L92l2l2M6M6K24K24o1m67k64J43k0k0k0L87K77K77K52m27p95j16J82
-1037D186J82K62j45l75L3K62j45j20K88j66j67r0m97k7L81N85J77l27P9j75j75K27K26K77
-1050D756j31k23J83p1p1k44k43K14j93j42K65k18J89M64M64J49n29m49m1O9M77j57j57R8
-1062D459R8k62J44q4q5M11M12l1p09n91L60O40l8j13j12j54j55j29j29K36K36l18R0J15k93
-1074C998j27K81K6K6l7l7K17j90j64K43K18j90K42K42J91J91j06n13q0q1l13l13M34M33l04
-1087D287l05L07L06j81j82K2K2L1L1L0L1r1r2r1r1J29J30p5m81j49N31J2l94J52J53j02j01
-1100C839L83k3k02M77K31j76N53J47l26Q1j73j73l39l39J37J36J21J20k19k19l6l6L03L03
$$ y = [3622, 3687, 3684, 4089, 4848, 4929, 4551, 4580, 4482, 3977, 4066, 4155, 3927, 3700, 4084, 4468, 4253, 4039, 4164, 4288, 4324, 4360, 4396, 4432, 4510, 4588, 4666, 4745, 4823, 4901, 4929, 4277, 3990, 4382, 4350, 4318, 4364, 4410, 4634, 4858, 4797, 4330, 4066, 4209, 4189, 4169, 4149, 4536, 4813, 5090, 5342, 4915, 4120, 4004, 4186, 4368, 4630, 4485, 4110, 4143, 4405, 4260, 4140, 4428, 4262, 4095, 4005, 3508, 3481, 3862, 4447, 4624, 4297, 4376, 4201, 4026, 4253, 4479, 4756, 4625, 4402, 4585, 4514, 4443, 4199, 3956, 4170, 3977, 3835, 4100, 3882, 4071, 4535, 4999, 5148, 4619, 4170, 4129, 4198, 4675, 4518, 4361, 4459, 4557, 4295, 4439, 4355, 4270, 4681, 5093, 5062, 4353, 3762, 4122, 4762, 4724, 4611, 4499, 4345, 4190, 4061, 3932, 4168, 4404, 4086, 4176, 4291, 3998, 3871, 4152, 4178, 4204, 4167, 4130, 4347, 4157, 3993, 4236, 4454, 4264, 4506, 4748, 4939, 5130, 5024, 4511, 4431, 4350, 4037, 3724, 4158, 4591, 4287, 3982, 4289, 4595, 4414, 4232, 4254, 4276, 4307, 4338, 4368, 4399, 4308, 4216, 4125, 4034, 4163, 4293, 4218, 3737, 3588, 4119, 4131, 3737, 3889, 4042, 3940, 3839, 4222, 4199, 3997, 4474, 4705, 4529, 5082, 5229, 4903, 4984, 4811, 4638, 4299, 3960, 4097, 4233, 4354, 4474, 4255, 4036, 4000, 3964, 4267, 4570]
-1112D570j60j59j60j60Q3Q2K86K86J65J65j75j75o5o5k68k68J11J12k28k28J03J03J03J03
-1124D161p8p7p8p8PQL46L47r9r9K41K40m42m43j03j04qrrrL8L8l01l02J30J31p4p3p0o9N42
-1140C704N42k1k1k0k1k50k50K25K25K23K22K22K22j85j86j85j85k60k60Q0Q0K11K11K12K11
-1152D746k55k54k55k54K08K08K08K08J00J01l75l76j07j08j08j07J75J76J75J76Q7Q6l89
-1164D066l89J18J17J18J17k34k35N12N12k48k49m5m4j47j47N7N7j87j87K89K88K12K12q5
-1176D478q6k89L89N50o72m98M53L17L17j22j22j23j22k12k11N36N35k21k21j7j7q5q5q6q5
-1189D301J37J37J11J12j18n25k28M51J18k88k21k21%%K04K04l59l59J16J16Q2Q2Q3Q2R7R7
-1202D211R7R7QQQQJ92J93m19m19J59J58J59J58k16k16j2j2k55k54n0n1J68J67l6l6K35K36
$$ y = [4570, 4410, 4251, 4091, 3931, 4014, 4096, 4382, 4668, 4833, 4998, 4823, 4648, 4583, 4518, 4250, 3982, 4093, 4205, 3977, 3749, 3852, 3955, 4058, 4161, 4083, 4006, 3928, 3850, 3857, 3865, 4211, 4558, 4459, 4360, 4601, 4841, 4399, 3956, 3853, 3749, 3741, 3732, 3723, 3714, 3752, 3790, 3489, 3187, 3317, 3448, 3374, 3301, 3231, 3162, 3704, 4246, 4225, 4204, 4184, 4163, 3913, 3663, 3888, 4113, 4336, 4558, 4780, 5002, 4817, 4631, 4446, 4261, 4001, 3741, 3821, 3901, 4112, 4323, 4535, 4746, 4491, 4237, 3982, 3728, 3936, 4144, 4352, 4560, 4660, 4761, 4386, 4010, 3903, 3795, 3687, 3580, 3755, 3931, 4106, 4282, 4369, 4455, 4066, 3677, 3795, 3912, 4030, 4147, 3913, 3678, 4190, 4702, 4454, 4205, 4160, 4116, 3969, 3822, 3879, 3936, 3749, 3562, 3851, 4139, 4351, 4563, 4478, 4392, 4103, 4492, 5042, 4370, 3872, 4325, 4642, 4959, 4837, 4715, 4592, 4470, 4258, 4047, 4583, 5118, 4897, 4676, 4659, 4642, 4557, 4472, 4386, 4301, 4438, 4575, 4686, 4798, 4680, 4155, 3927, 4378, 4496, 4208, 3987, 3766, 3766, 3766, 3970, 4174, 3815, 3456, 3572, 3688, 3770, 3852, 3935, 4017, 4114, 4211, 4308, 4405, 4413, 4421, 4429, 4437, 4629, 4822, 4403, 3984, 4143, 4301, 4460, 4618, 4402, 4186, 4174, 4162, 3907, 3653, 3603, 3552, 3720, 3887, 3851, 3815, 4050, 4286]
-1216D286k40k40l24l24J52J51L39L38J35J34M1M2K44K45j03j03m43m43K77K77o3o3P3P3j31
-1228D330j31P0O9m06m06J58J58j81j81K02K02K02K01k65k65P5P4l2l3l3l3J50J50j90j90
-1241C695K00K00k76k76k5k6J79J78J89J89J88J89j42j42l47l46k25k25k25k25L10L09L10
-1252C656L10m27m27q7q7M30M31K27K26j78j79j78j79O4O3O3O4j11j11j12j11K12K11j28j28
-1265C514N04N04J65J65l53l53j4j3k95k94J30J30L17m98k94N20K28K28P5P5j71j72L04L05
-1277D707l03l03r8r9k94k94J81J81L36L35j41j40L0K9K34K33m9m9k52k53j59j60M5M4L03
-1289D064L04k83k82k27J80L59l21QM16l31l31O83O83m29m28n05J75J33J32j81j82K94K94
-1301D225k01k01J39J38Q8Q7K0l87q22j43M69M68O2O1K65K65l35l35K77K76k4k5k5k5m09m09
$$ y = [4286, 4046, 3806, 3482, 3158, 3310, 3461, 3800, 4138, 4273, 4407, 4448, 4490, 4734, 4979, 4876, 4773, 4330, 3887, 4164, 4441, 4378, 4315, 4388, 4461, 4330, 4199, 4269, 4338, 3932, 3526, 3684, 3842, 3661, 3480, 3682, 3884, 4086, 4287, 4022, 3757, 3832, 3906, 3874, 3841, 3808, 3775, 3925, 4075, 3885, 3695, 3895, 4095, 3819, 3543, 3518, 3492, 3671, 3849, 4038, 4227, 4415, 4604, 4462, 4320, 3973, 3627, 3402, 3177, 2952, 2727, 3037, 3346, 3656, 3966, 3539, 3112, 3025, 2938, 3368, 3799, 4026, 4252, 4074, 3895, 3717, 3538, 3602, 3665, 3728, 3792, 3681, 3570, 3458, 3347, 3559, 3770, 3642, 3514, 4018, 4522, 4687, 4852, 4499, 4146, 4132, 4119, 3824, 3530, 3660, 3790, 4107, 3609, 3315, 3835, 4063, 4291, 4366, 4441, 4270, 4098, 4402, 4707, 4404, 4101, 4003, 3904, 3610, 3316, 3497, 3678, 4014, 4349, 4208, 4068, 4098, 4127, 4361, 4594, 4545, 4496, 4244, 3991, 3832, 3672, 3717, 3761, 4064, 4368, 4085, 3803, 3576, 3756, 4115, 3794, 3802, 4218, 3887, 3556, 4239, 4922, 4493, 4065, 3560, 3735, 3868, 4000, 3819, 3637, 3931, 4225, 4024, 3823, 3962, 4100, 4188, 4275, 4295, 3908, 3086, 2943, 3412, 3880, 3942, 4003, 4268, 4533, 4198, 3863, 4140, 4416, 4392, 4367, 4342, 4317, 3908, 3499]
-1314C499O7O6J56J55m8m8J2J2j91j92r0r0r0q9K65K66K66K65n7n6n7n7k14k13k13k14J73
-1328C283J73J73J72l62l62J14J13l5l5l5l5n4n4n4n4N62N61l21l21K4K3K4K3m4m4m4m5K83
-1342C629K83Q0P9L34L34l1l1k2m29o07P2L0l78LM12O3O2L43o5p56l50M41M40J9M27j85j84
-1355D013K14m65k86L92N44J35k03k04j15j14J06N13M0l69j13j14n16n17L40L41N20J13j59
-1367D096j59K3l84j12j12o50L0O24K17j3j2J91k17l20l21J29J29K94K95m5m5L6L5j68j68
-1379C373k3k4M51M5n26J54L57L57J03J03n09n08K2K2K25K26j94j95J0RP1P2R6R7q1L26L26
-1393D385q2m61m61k83k83q4q4K82K81j68K40N96q3k49k49M9M8J08J08Q2Q2J08k99l00J08
-1405C391L05L05j70j70M41L3o03j95K52j56J25J25j42K64K65j42j3j2k67J41J53J54j61j61
$$ y = [3499, 3566, 3632, 3788, 3943, 3895, 3847, 3859, 3871, 3680, 3488, 3398, 3308, 3218, 3129, 3394, 3660, 3926, 4191, 4134, 4078, 4021, 3964, 3750, 3537, 3324, 3110, 3283, 3456, 3629, 3801, 3439, 3077, 3191, 3304, 3269, 3234, 3199, 3164, 3110, 3056, 3002, 2948, 3510, 4071, 3750, 3429, 3453, 3476, 3500, 3523, 3479, 3435, 3391, 3346, 3629, 3912, 3992, 4071, 4405, 4739, 4708, 4677, 4655, 4226, 3619, 3691, 3721, 3343, 3346, 3758, 3821, 3883, 4226, 4161, 3405, 3055, 3496, 3936, 3955, 4382, 4197, 4013, 4227, 3762, 3476, 3868, 4412, 4547, 4344, 4140, 4025, 3911, 4017, 4530, 4570, 4201, 4088, 3974, 3458, 2941, 3281, 3622, 4142, 4255, 4096, 3937, 3960, 3576, 3464, 3352, 2702, 2732, 3356, 3573, 3560, 3548, 3739, 3522, 3202, 2881, 3010, 3139, 3433, 3728, 3683, 3638, 3674, 3709, 3541, 3373, 3350, 3326, 3777, 3822, 3296, 3450, 3807, 4164, 4267, 4370, 3861, 3353, 3375, 3397, 3622, 3848, 3654, 3459, 3469, 3478, 3549, 3621, 3717, 3814, 3733, 4059, 4385, 4303, 3842, 3381, 3098, 2815, 2731, 2647, 2929, 3210, 3042, 3282, 3878, 3795, 3546, 3297, 3346, 3394, 3502, 3610, 3692, 3774, 3882, 3583, 3283, 3391, 3696, 4001, 3831, 3661, 4102, 4135, 3532, 3337, 3589, 3433, 3558, 3683, 3541, 3805, 4070, 3928, 3915, 3903, 3636, 3777, 3930, 4084, 3923, 3762]
$$ [...]
-32894a1
##END=		$$ NMR SPECTRUM
##END=		$$ LINK
