##TITLE=	Po8rnJY9SMi$iRnrKcrpbA.11.fid
##JCAMP-DX=	6.0	$$ MestReNova 14.3.3-33362
##DATA TYPE=	LINK
##BLOCKS=	1    
##ORIGIN=	Mestrelab Research S.L.
##OWNER=	hrzepa
##$MNOVA/METADATA=	(DOCUMENT,BASE64)
eyJuYW1lIjoiL1VzZXJzL2hyemVwYS9MaWJyYXJ5L01vYmlsZSBEb2N1bWVudHMvY29tfmFwcGxlfkN
sb3VkRG9jcy9TaGVwcGFyZC9OTVIgZmlsZXMgemlwcy0yL0RBVEIyL0RBVEIyLUIvREFUQjItQi5tbm
92YSIsInBhZ2VzIjpbeyJpdGVtcyI6WyIxIiAgICAgXX1dfQ==
##TITLE=	Po8rnJY9SMi$iRnrKcrpbA.11.fid
##JCAMP-DX=	6.0	$$ MestReNova 14.3.3-33362
##DATA TYPE=	NMR SPECTRUM
##DATA CLASS=	XYDATA
##BLOCK_ID=	1
##ORIGIN=	Bruker BioSpin GmbH
##OWNER=	root
##NUMDIM=	1
##$MNOVA/METADATA=	(ITEM,BASE64)
eyJhbmdsZSI6MCwiYXhlcyI6eyJ4Ijp7Im1heCI6MjA1LjAwMDY5OTk5ODk5MDY4LCJtaW4iOi0yMDQ
uOTk3NTgxNzgyNjk0NjJ9LCJ5Ijp7Im1heCI6MjEzNjQxLjc5NDkyMTg3NSwibWluIjotMzQxMjYuND
IyODUxNTYyNX19LCJwb2ludHMiOlt7IngiOjUzMjEsInkiOjU4MzV9LHsieCI6ODcyMiwieSI6NTgzN
X0seyJ4Ijo4NzIyLCJ5Ijo4MjA4fSx7IngiOjUzMjEsInkiOjgyMDh9LHsieCI6NTMyMSwieSI6NTgz
NX1dLCJ6IjowfQ==
##.OBSERVE FREQUENCY=	160.46157916600000704
##.OBSERVE NUCLEUS=	^11B
##.SOLVENT NAME=	DMSO
##.PULSE SEQUENCE=	zg
##LONGDATE=	2023/09/28 15:23:35.000
##.ACQUISITIONMODE=	SIMULTANEOUS (DQD)
##$ORIGINAL FORMAT=	Bruker XWIN-NMR
##$MNOVA/SCALES_VERSION=	9
##$PARAMETER FILE=	(acqus, ASCII, /private/var/folders/f6/rjf_tdyn2v98c5c0wvkgn4s80000gq/T/Po8rnJY9SMi$iRnrKcrpbA/11/acqus, 0)
$$ ##TITLE= Parameter file, TopSpin 4.1.3
$$ ##JCAMPDX= 5.0
$$ ##DATATYPE= Parameter Values
$$ ##NPOINTS= 1	$$ modification sequence number
$$ ##ORIGIN= Bruker BioSpin GmbH
$$ ##OWNER= root
$$ $$ 2023-09-28 15:22:25.553 +0100  root@CZC036BXXF
$$ $$ Z:/500/data/tds/nmr/RP384 with 11B/11/acqus
$$ $$ process C:\Bruker\TopSpin4.1.3\prog\mod\dirdata.exe
$$ ##$ACQT0= -9.23096511331805
$$ ##$AMP= (0..31)
$$ 100 100 100 100 100 100 100 100 100 100 100 100 100 100 100 100 100 100
$$ 100 100 100 100 100 100 100 100 100 100 100 100 100 100
$$ ##$AMPCOIL= (0..32)
$$ -1 0 0 0 0 0 0 0 0 0 0 0 0 0 0 0 0 0 0 0 0 0 0 0 0 0 0 0 0 0 0 0 0
$$ ##$AQSEQ= 0
$$ ##$AQ_mod= 3
$$ ##$AUNM= <au_zg>
$$ ##$AUTOPOS= <33 >
$$ ##$BF1= 160.461579166
$$ ##$BF2= 160.461579166
$$ ##$BF3= 160.461579166
$$ ##$BF4= 160.461579166
$$ ##$BF5= 160.461579166
$$ ##$BF6= 160.461579166
$$ ##$BF7= 160.461579166
$$ ##$BF8= 160.461579166
$$ ##$BWFAC= (0..63)
$$ 0 0 0 0 0 0 0 0 0 0 0 0 0 0 0 0 0 0 0 0 0 0 0 0 0 0 0 0 0 0 0 0 0 0 0 0
$$ 0 0 0 0 0 0 0 0 0 0 0 0 0 0 0 0 0 0 0 0 0 0 0 0 0 0 0 0
$$ ##$BYTORDA= 0
$$ ##$CHANFCU= (0..24)
$$ 0 0 1 0 0 0 0 0 0 0 0 0 0 0 0 0 0 0 0 0 0 0 0 0 0
$$ ##$CHANREC= (0..24)
$$ 0 0 1 0 0 0 0 0 0 0 0 0 0 0 0 0 0 0 0 0 0 0 0 0 0
$$ ##$CHEMSTR= <none>
$$ ##$CNST= (0..63)
$$ 1 1 1 1 1 1 1 1 1 1 1 1 1 1 1 1 1 1 1 1 1 1 1 1 1 1 1 1 1 1 1 1 1 1 1 1
$$ 1 1 1 1 1 1 1 1 1 1 1 1 1 1 1 1 1 1 1 1 1 1 1 1 1 1 1 1
$$ ##$CPDPRG= (0..8)
$$ <> <> <> <> <> <> <> <> <>
$$ ##$D= (0..63)
$$ 0 2 0 0 0 0 0 0 0 0 0 0 0 0 0 0 0.0002 0 0 0 0 0 0 0 0 0 0 0 0 0 0 0 0
$$ 0 0 0 0 0 0 0 0 0 0 0 0 0 0 0 0 0 0 0 0 0 0 0 0 0 0 0 0 0 0 0
$$ ##$DATE= 1695911015
$$ [...]
$$ 1 1 1 1 0 0 0 0 0 0 0 0 0 0 0 0 0 0 0 0 0 0 0 0 0 0 0 0
$$ ##$ShimPowRng3= (0..63)
$$ 1 1 1 1 1 1 1 1 1 1 1 1 1 1 1 1 1 1 1 1 1 1 1 1 1 1 1 1 1 1 1 1 1 1 1 1
$$ 1 1 1 1 0 0 0 0 0 0 0 0 0 0 0 0 0 0 0 0 0 0 0 0 0 0 0 0
$$ ##$ShimPowType1= 8
$$ ##$ShimPowType2= 8
$$ ##$ShimPowType3= 0
$$ ##$ShimPowType4= 0
$$ ##$ShimPowType5= 0
$$ ##$ShimPowType6= 0
$$ ##$ShimPowType7= 0
$$ ##$ShimPowType8= 0
$$ ##$ShimSysActGrad= (0..63)
$$ 1 2 3 4 13 5 7 11 10 9 6 8 12 18 19 20 21 15 22 23 24 14 25 16 26 17 27
$$ 28 31 32 33 34 35 36 37 38 0 0 0 0 0 0 0 0 0 0 0 0 0 0 0 0 0 0 0 0 0 0
$$ 0 0 0 0 0 0
$$ ##$ShimSysAngle= <>
$$ ##$ShimSysFunc= (0..63)
$$ 1 2 3 4 5 6 7 8 9 10 0 37 38 35 16 15 14 13 12 11 28 27 26 25 24 23 36
$$ 22 30 29 20 21 34 33 32 31 17 18 19 0 0 0 0 0 0 0 0 0 0 0 0 0 0 0 0 0 0
$$ 0 0 0 0 0 0 0
$$ ##$ShimSysMatId= <292722ba.dat>
$$ ##$ShimSysMatrix= 1
$$ ##$ShimSysMinMaxUG= 130000
$$ ##$ShimSysOffset= <58 mm>
$$ ##$ShimSysType= 4
$$ ##$ShimUnit= 3
$$ ##$SpectrOsVersion= <4.1.156.20210628>
$$ ##$TCubeEth= <192.168.180.18>
$$ ##$TCubeSeqDevice= <>
$$ ##$TOSITY= <no>
$$ ##$TRIPLO2= 0
$$ ##$TopSpinVersion= <TopSpin 4.1.3>
$$ ##$TrxFreqFormula= (0..23)
$$ <TrxFreqFormula(2.0,500130000.000000,'TRX',Trx(1.0,'TRX 1200.1',2,5.000000,1290.000000))>
$$ <TrxFreqFormula(2.0,500130000.000000,'TRX',Trx(1.0,'TRX 1200.2',2,5.000000,1290.000000))>
$$ <> <> <> <> <> <> <> <> <> <> <> <> <> <> <> <> <> <> <> <> <> <>
$$ ##$TrxPN= (0..23)
$$ <Z148391> <Z148391> <> <> <> <> <> <> <> <> <> <> <> <> <> <> <> <> <>
$$ <> <> <> <> <>
$$ ##$TrxSN= (0..23)
$$ <05365> <05364> <> <> <> <> <> <> <> <> <> <> <> <> <> <> <> <> <> <> <>
$$ <> <> <>
$$ ##$VCubeEth= (0..23)
$$ <no> <no> <no> <no> <no> <no> <no> <no> <no> <no> <no> <no> <no> <no> <no>
$$ <no> <no> <no> <no> <no> <no> <no> <no> <no>
$$ ##$VTU= 2
$$ ##$VTUETH= <192.168.99.10>
$$ ##$VTUTY= <no>
$$ ##$ValueLine= no
$$ ##$VpuPN= (0..23)
$$ <no> <no> <no> <no> <no> <no> <no> <no> <no> <no> <no> <no> <no> <no> <no>
$$ <no> <no> <no> <no> <no> <no> <no> <no> <no>
$$ ##$VpuSN= (0..23)
$$ <no> <no> <no> <no> <no> <no> <no> <no> <no> <no> <no> <no> <no> <no> <no>
$$ <no> <no> <no> <no> <no> <no> <no> <no> <no>
$$ ##$WBREFAM= (0..31)
$$ 99.9 100 100 100 100 100 100 100 100 100 100 100 100 100 100 100 100 100
$$ 100 100 100 100 100 100 100 100 100 100 100 100 100 100
$$ ##$WBREFLM= (0..31)
$$ 2 0 0 0 0 0 0 0 0 0 0 0 0 0 0 0 0 0 0 0 0 0 0 0 0 0 0 0 0 0 0 0
$$ ##$WBREFPH= (0..31)
$$ 0.91 0 0 0 0 0 0 0 0 0 0 0 0 0 0 0 0 0 0 0 0 0 0 0 0 0 0 0 0 0 0 0
$$ ##$WBSGU= (0..31)
$$ 1 1 2 0 0 0 0 0 0 0 0 0 0 0 0 0 0 0 0 0 0 0 0 0 0 0 0 0 0 0 0 0
$$ ##END=
$$ 
##$DECIM=	304
##$DSPFVS=	20
##XUNITS=	HZ
##YUNITS=	ARBITRARY UNITS
##FIRSTX=	32894.736052135405771
##LASTX=	-32894.235698224358202
##DELTAX=	-0.50193385074013141534
##XFACTOR=	1
##YFACTOR=	5.9282843638416702348
##FIRSTY=	1528.5048828125
##MINY=	-14831.9580078125
##MAXY=	194252.09375
##NPOINTS=	131072
##XYDATA=	(X++(Y..Y))
$$ [...]
7057 5679 5901 6122 6034 5946 5951 5955 5959 5964 5863 5762 5661 5560 5719 5878 6016 6153 6347 6196 6157 6118 5912 6049 6006 5756 5862 5967 6059 6152
7043 6152 6083 6015 6119 6223 6252 6280 6206 6131 5923 5715 5748 5781 5842 5903 5964 6025 6011 5996 6223 6450 6287 6125 6066 6006 6020 6034 5945 5855 5996 6137
7028 6137 6278 6418 6232 6045 6017 5990 6052 5909 5976 6387 6353 5975 5812 5649 5707 5766 5824 5883 5968 6054 6140 6226 6191 6156 6121 6086 6035 5983 5931 5879
7013 5879 6126 6373 6241 6110 6060 6011 6108 5999 5640 5762 6036 5965 5911 5858 5783 5708 5704 5699 5799 5898 6002 6105 6106 6106 6045 5983 5921 5859 5921 5983 5941
6997 5941 5900 5936 5972 6008 6044 5936 5827 5891 6161 6393 6280 6245 6416 6447 6270 6120 5970 5942 5914 5990 6066 5908 5750 5833 5916 5990 6065 6139 6213
6983 6213 6107 6001 5895 5788 5841 5894 5844 5793 5665 5536 5649 5761 6015 6269 6214 6159 6217 6276 6162 6049 6109 6170 6231 6291 6019 5747 5647
6969 5647 5547 5957 6366 6122 5878 5754 5630 5748 5865 5857 5849 5842 5834 5868 5901 5935 5968 5748 5528 5617 5707 5712 5717 5825 5934 5788 5642 5807 5971
6955 5971 6090 6210 6089 5967 5893 5819 5917 6016 6086 6157 6270 6040 5870 6044 6312 6581 6350 6119 5992 5864 5958 6052 5837 5621 5807 5993
6942 5993 6179 6365 6331 6298 6161 6025 5954 5884 5814 5743 5751 5758 5765 5772 5761 5751 5637 5867 5981 5889 5934 5979 6060 6141 6118 6095 6309 6523 6427 6125 5990
6926 5990 6200 6181 6163 6295 6083 5948 6020 5967 5914 6046 6178 6102 6025 5949 5872 6013 6153 6294 6434 6310 6187 6303 6420 6493 6566 6638 6711
6913 6711 6476 6241 6109 5977 6137 6297 6216 6134 6159 6183 6207 6231 6088 5944 5904 5864 5942 6020 5995 5970 5993 6015 5865 5715 5707 5699 5726 5959 5953 5602
6898 5602 5837 6072 5977 5883 5788 5694 5905 6116 6017 6125 6329 6190 5956 5928 5906 5678 5812 6289 6538 6444 6323 6203 6346 6489 6459 6430
6885 6430 6208 5985 5934 5884 5989 6095 5960 5824 5693 5562 5741 5920 5867 5815 5866 5916 5907 5897 6129 6360 6409 6459 6267 6075 6241 6406 6262
6871 6262 6118 6210 6302 6498 6693 6689 6684 6577 6469 6396 6323 6250 6177 6170 6164 6054 5945 6058 6171 6111 6052 5877 5702 5836 5971 6118 6264 6308 6351
6856 6351 6285 6219 6152 6086 6051 6017 5879 5741 5769 5797 5997 6197 6155 6113 6174 6235 6249 6263 6276 6290 6254 6218 6182 6146 6084 6022 6201 6380 6403 6427 6386
6841 6386 5932 5902 6078 6009 5940 5986 6033 6079 6125 6173 6222 6167 6112 6149 6187 6121 6056 5968 5881 6035 6189 6299 6409 6278 6148 6152 6157 6162 6167 6335 6503
6825 6503 6430 6357 6172 5987 5802 5618 5805 5992 5939 5885 5967 6049 6131 6213 6229 6245 6119 6200 6564 6516 6403 6290 6138 5986 6144 6302 6396
6812 6396 6489 6583 6676 6647 6618 6589 6560 6479 6399 6421 6444 6396 6348 6403 6458 6494 6530 6463 6396 6288 6180 6072 5964 5910 5856 5974 6092 6131 6171 6107 6043
6796 6043 6081 6118 6155 6192 6138 6083 6132 6181 6296 6412 6217 6023 6102 6181 6363 6201 6019 6044 5919 5793 5831 5661 5556 5796 5990 5702 5694 5893
6782 5893 5930 5967 6121 6274 6165 6056 6050 6044 6176 6307 6336 6364 6261 6159 6069 5979 6085 6397 6559 6377 6199 6227 6221 6215 6211 6207 6203 6199 6233 6268 6302 6337
6766 6337 6489 6641 6621 6600 6642 6685 6576 6468 6185 6247 6472 6490 6406 6321 6224 6126 6165 6203 6241 6280 6207 6133 6232 6331 6414 6497 6339 6181 6150 6120
6751 6120 5985 5851 5945 6038 6131 6225 6316 6407 6382 6357 6471 6379 6114 6056 6041 6027 6136 6453 6596 6534 6428 6322 6130 5938 6056 6174 6353
6737 6353 6533 6669 6599 6365 6338 6414 6283 6305 6533 6460 6387 6302 6216 6220 6225 6302 6173 6147 6328 6439 6551 6482 6207 6069 5931 6090 6456 6636
6723 6636 6473 6227 6189 6213 6238 6564 6683 6509 6336 6266 6196 6190 6391 6511 6286 6222 6365 6211 6057 6091 6332 6457 6582 6399 6216 6296
6710 6296 6582 6741 6901 6558 6214 6227 6241 6358 6474 6449 6424 6213 6003 6002 5793 5723 5653 5626 5943 6101 5915 5763 5818 5963 6109 6277
6697 6277 6239 6101 6308 6388 6124 6075 6026 6138 6249 6360 6471 6548 6625 6392 6159 6145 6131 6220 6309 6362 6415 6226 6038 6134 6229 6196 6369 6441
6683 6441 6307 6082 6063 6055 6046 6154 6262 6358 6455 6380 6305 6295 6286 6276 6266 6265 6264 6263 6262 6345 6429 6409 6388 6130 5871 5990 6110 6138 6167 6092 6017 6159 6301
6667 6301 6341 6380 6422 6463 6492 6522 6536 6343 6073 6147 6218 6289 6382 6474 6601 6728 6545 6362 6251 6139 6131 6123 6235 6347 6459 6571 6495 6419 6343
6652 6343 6267 6274 6282 6290 6298 6201 6105 6111 6118 6196 6273 6248 6222 6360 6498 6257 6016 6206 6395 6413 6430 6358 6286 6468 6650 6387 6330 6364 6053 5938 6030 6165
6636 6165 6506 6692 6672 6540 6408 6474 6541 6608 6675 6410 6146 6122 6098 6205 6311 6418 6524 6582 6639 6592 6546 6518 6490 6544 6597 6870 6799 6474
6622 6474 6493 6598 6497 6314 6337 6329 6320 6324 6328 6261 6194 6428 6456 6350 6451 6320 6188 6218 6248 6407 6359 6213 6273 6320 6160 6034 5907 6009 6111
6607 6111 6440 6770 6652 6534 6606 6677 6749 6821 6853 6886 6700 6513 6343 6517 6614 6504 6448 6391 6434 6684 6734 6578 6448 6317 6234 6151 6253
6594 6253 6355 6417 6685 6781 6671 6610 6549 6475 6401 6293 6185 6249 6312 6458 6604 6508 6413 6321 6229 6150 6070 5961 6058 6039 6020 6121 6221 6425 6629
6579 6629 6471 6313 6603 6548 6427 6512 6459 6406 6441 6477 6512 6547 6505 6463 6421 6379 6425 6471 6388 6512 6728 6738 6567 6397 6516 6636 6652 6669 6570
6565 6570 6472 6546 6620 6410 6200 6184 6374 6524 6675 6645 6408 6305 6201 6188 6175 6353 6531 6477 6629 6622 6409 6174 5939 5806 6018 6278
6552 6278 6537 6491 6445 6398 6352 6365 6378 6253 6335 6537 6396 6013 5974 6270 6359 6277 6194 6186 6179 6171 6164 6282 6400 6345 6291 6407 6522 6535 6547 6430 6312
6536 6312 6435 6558 6475 6391 6411 6431 6467 6502 6826 7150 7247 7001 6570 6483 6566 6442 6457 6471 6492 6512 6314 6115 5987 6204 6446 6482 6528 6575
6522 6575 6505 6435 6369 6303 6375 6240 6045 6194 6632 6862 6792 6721 6637 6553 6500 6446 6392 6339 6333 6328 6426 6524 6532 6540 6375 6211 6275 6339 6403 6467 6624 6780
6506 6780 6627 6474 6604 6734 6692 6650 6546 6442 6509 6577 6479 6381 6283 6185 6279 6372 6466 6559 6672 6785 6886 6986 6834 6477 6338 6544 6642
6493 6642 6533 6562 6592 6546 6500 6350 6201 6365 6528 6520 6511 6632 6752 6632 6511 6658 6805 6642 6479 6572 6666 6587 6508 6509 6510 6512 6513 6448 6383 6627
6477 6627 6872 6599 6327 6420 6514 6599 6477 6299 6534 6938 6654 6378 6515 6613 6711 6732 6753 6567 6380 6434 6488 6560 6631 6600 6568 6735 6903
6464 6903 6624 6344 6410 6477 6544 6610 6607 6604 6704 6804 6876 6948 6968 6575 6334 6506 6592 6678 6650 6622 6594 6566 6402 6238 6385 6531 6597 6664 6627 6590
6449 6590 6702 6814 6823 6832 6722 6613 6606 6600 6577 6553 6529 6506 6607 6708 7042 6962 6865 6767 6885 7002 6932 6863 6677 6491 6503 6308 6308 6720 6807 6894
6434 6894 6904 6914 6802 6690 6578 6465 6613 6762 6738 6714 6653 6593 6637 6680 6723 6766 6706 6646 6552 6457 6534 6611 6618 6624 6630 6637 6652 6668 6786 6905 6852 6798
6418 6798 6766 6734 6527 6664 6904 6800 6753 6707 6433 6503 6517 6325 6141 6164 6447 6523 6303 6289 6397 6506 6743 6774 6703 6633 6438 6587 6822
6404 6822 6712 6736 6760 6642 6868 6913 6752 6655 6559 6561 6771 6870 6763 6681 6600 6565 6531 6625 6513 6488 6668 6836 6797 6647 6498 6516 6740 6913
6390 6913 6880 6864 6641 6486 6537 6460 6382 6485 6588 6679 6769 6803 6632 6356 6288 6395 6503 6624 6744 6743 6742 6569 6396 6451 6506 6548 6590 6601 6405
6376 6405 6369 6538 6670 6594 6429 6469 6455 6441 6427 6413 6726 6832 6883 6933 6893 6852 7017 6839 6664 6696 6591 6486 6594 6703 6639 6576 6531 6487
6362 6487 6546 6605 6818 7030 6933 6836 6863 6891 6815 6739 6875 7012 6945 6466 6441 6622 6662 6701 6695 6689 6773 6857 6793 6522 6239 6368 6377 6386 6662 6937 6891
6346 6891 6844 7037 7231 7218 7204 7087 6969 6977 6985 6992 7000 6984 6968 6952 6936 6869 6801 6733 6666 6595 6524 6454 6383 6330 6277 6326 6376 6618 6859 6928 6997 6918 6839
6329 6839 6760 6681 6629 6577 6628 6679 6558 6437 6316 6195 6263 6332 6503 6675 6601 6528 6669 6811 6893 6562 6231 6313 6365 6417 6495 6573 6655 6737 6647
6315 6647 6557 6658 6760 6758 6756 6870 6985 6858 6732 6825 6918 6770 6622 6592 6562 6636 6709 6802 6895 6609 6324 6442 6561 6680 6798 6859 6920 6998
6301 6998 6662 6351 6452 6468 6483 6576 6669 6603 6537 6572 6813 6844 6531 6345 6502 6664 6826 7019 6868 6695 6866 7037 6864 6803 6742 6727 6712
6287 6712 6697 6682 6860 7038 6907 6776 6786 6796 6806 6816 6790 6764 6840 6917 7017 7116 7043 6971 6823 6675 6630 6585 6537 6489 6441 6393 6592 6792 6888 6984
6272 6984 6747 6509 6720 6930 7006 7083 6932 6781 6813 7053 7210 7023 6864 6912 6822 6732 6651 6571 6868 6822 6601 6587 6538 6490 6405 6319 6398 6820
6258 6820 7004 6844 6782 6927 6859 6790 6838 6886 6834 6783 6732 6681 6610 6540 6641 6743 6719 6696 6570 6443 6504 6565 6626 6687 6705 6722 6740 6758 6653 6549
6243 6549 6685 6821 6908 6994 6909 6824 6899 6974 6877 6780 6632 6483 6507 6530 6477 6424 6544 6663 6586 6510 6563 6615 6471 6740 6893 6839 6917 6994 6887
6228 6887 6779 6765 6751 6841 6930 6899 6868 7009 7150 7152 7154 6912 6875 7347 7405 7201 7203 7124 6838 6854 6869 6923 6977 6928 6879 6669 6460 6698 6937 6865
6213 6865 6794 6722 6651 6639 6628 6617 6605 6796 6987 7075 7163 7139 7115 6919 6723 6864 7006 7044 7083 7015 6948 6880 6813 6984 7156 6948 6741 6810 6879
6199 6879 7051 7224 7136 7048 6960 6872 6755 6637 6692 6746 6549 6352 6465 6577 6878 7178 6962 6746 6677 6607 6709 6812 6628 6445 6571 6697
6186 6697 6801 6906 7183 7459 7227 6994 7002 7011 6834 6657 6721 6786 6927 7069 7038 7008 6934 6861 6788 6714 6804 6895 6985 7075 6980 6886 6645 6404 6271
6171 6271 6551 6887 7017 7054 7091 7115 7139 7068 6998 6824 6650 6659 6668 6780 6893 6996 7100 6963 6825 6695 6564 6674 6784 6725 6666 6629 6591 6651
6157 6651 7054 7079 6760 6712 6663 6696 6729 6799 6868 6938 7008 6884 6761 6740 6720 6801 6882 6860 6837 6912 6987 6890 6793 6732 6672 6611 6551 6704 6858 6840 6822
6142 6822 6726 6631 6832 7033 7124 7008 6802 6941 6931 6714 6807 6900 6779 6657 6845 7034 6917 6799 6923 7047 7093 7140 7083 7026 7053 7080 7107
6128 7107 7133 6978 6822 6839 6855 6956 7056 6847 6637 6647 6656 6769 6882 7020 7159 7125 7092 6993 6894 6899 6903 6779 6654 6702 6750 6683 6616 6721 6826
6114 6826 6830 6834 6941 7049 6994 6940 6886 6831 6988 7144 7322 7156 7043 6929 6794 6659 6711 6764 6644 6524 6714 6904 6922 6940 6807 6674 6645
6100 6645 6616 6793 6971 6908 6844 6820 6795 6943 7090 7191 7291 7289 7286 7077 6867 6968 7068 7173 7277 7510 7331 7125 6920 6688 6457 6589
6087 6589 6721 6853 6985 6954 6922 6994 7066 7006 6947 6715 6484 6584 6683 6680 6676 6727 6779 6933 7087 7143 7198 7339 7068 6819 6983 6992 7001 6873 6744
6072 6744 6857 6969 6858 6747 6877 7006 6951 6896 6738 6579 6574 6570 6436 6715 6833 6951 7095 7239 7235 7231 7055 6879 6992 7104 7216 7329
6059 7329 7182 7035 7060 7085 7031 6977 7008 6627 6533 6852 7016 7180 7168 7155 7040 6924 6991 7057 6951 6845 6808 6771 6837 6903 6942 6981 6916 6852 6826
6045 6826 6800 6775 6749 6830 6910 6965 7020 7181 6928 6675 6836 7066 7296 7449 7602 7223 6845 6707 6569 6827 7084 7100 7116 7121 7127 7107 7086 7410
6031 7410 7320 7093 7072 7121 6962 6714 6672 6681 6691 6713 6735 6777 6819 6861 6902 6895 6888 6893 6899 6876 7060 7361 7248 7070 6891 6855 7025 7258 7077 6841 6811
6015 6811 7150 7283 7188 7300 7302 7304 7215 7127 7135 7144 7153 7162 7179 7197 7214 7231 7138 7044 7049 7261 7333 6991 6951 7118 7098 7078 7174 7270 7430 7591 7399 7207 6851
5999 6851 6908 6905 6901 7152 7403 7275 7147 7008 6870 6834 6799 6828 6857 6989 7122 7042 6963 6987 7011 6708 6405 6619 6832 7059 7286 7342 7397 7390 7382
5984 7382 7272 7161 7212 7263 7313 7364 7324 7284 7348 7412 7262 7113 6963 6814 6888 6962 7097 6818 6863 6908 6926 6945 6921 6897 6873 6848 6772 6695 6790 6885
5969 6885 7073 7260 7207 7154 7157 7160 7060 6960 6957 6954 6779 6603 6690 6778 6843 6909 7022 6790 6559 6672 6795 6917 7104 6947 6727 6852 6980 6903
5955 6903 7020 7137 7069 7001 6946 6891 6973 6850 6721 6937 7075 7007 7005 7210 7402 7388 7604 7819 7712 7605 7468 7331 7194 7057 6836 6616
5942 6616 6567 6518 6631 6744 6753 6762 6637 6512 6697 6882 6561 6240 6573 6907 6916 6926 6936 6945 7183 7421 7280 7139 7066 6993 6919 6846 7072 7298
5928 7298 7421 7199 6932 6871 7051 7231 7217 7204 7190 7177 7072 6967 6862 6757 6733 6710 6790 6870 6785 6699 6786 6873 6895 6917 6939 6961 6925 6889 6839 6790
5913 6790 6784 6571 6375 6661 6937 7213 7415 7618 7347 7077 7047 7017 7190 7363 7227 7090 6981 6872 7005 7137 7048 6959 7007 6850 6763 7020
5900 7020 7015 6803 6768 6733 6788 6843 6946 7048 7047 7046 7012 6978 7185 7392 7185 6979 7014 7049 6879 6709 6965 7222 7564 7562 7190 6818 6594 6714
5886 6714 6985 7049 7100 6945 6674 6609 6597 6586 6622 7003 7164 7118 7197 7277 7364 7245 7049 7196 7206 7217 7145 7073 7091 7108 7298 7488 7301 7114
5872 7114 7306 7498 7511 7525 7538 7551 7352 7152 7262 7372 7169 6965 7003 7040 7048 7055 6891 6726 6862 6998 6962 6926 6968 7009 7154 7299 7306 7314 7149
5857 7149 6985 7130 7275 7249 7222 6975 6729 6723 6718 6944 7171 7294 7418 7461 7504 7327 7150 7013 7219 7666 7769 7683 7597 7386 7175 7061
5844 7061 6947 6957 7174 7132 7090 7061 7032 7056 7081 7002 6924 6911 6898 6851 7010 7415 7475 7166 7063 7237 7206 7213 7220 7152 7290 7429 7360 7042 6723 6848
5829 6848 7179 7323 7261 7039 7024 7156 7289 7478 7322 7124 7269 7200 7130 7213 7296 7379 7462 7356 7249 7130 7217 7268 7319 7141 6964 6922 6880
5815 6880 6852 6823 6632 6648 6857 7066 7187 7308 7257 7000 6771 6887 7200 7032 6718 6885 7198 7168 7139 7316 7459 7602 7450 7298 7374
5803 7374 7450 7456 7256 7056 7062 7038 7015 7163 7311 7387 7256 7255 7253 6914 6781 6950 7118 7383 7166 6868 6914 6998 7289 7223 6951 7123 7296 7090
5789 7090 6884 6815 6953 7079 7204 7105 7007 7081 7154 7187 7220 7239 7259 7300 7135 7202 7268 7028 6993 7191 7389 7478 7084 6932 7261 7255 7248 7272 7296 7295
5774 7295 7293 7305 7317 7062 7013 7296 7372 7246 7464 7489 7307 7244 7180 7276 7371 7376 7381 7399 7416 7268 7327 7476 7419 7353 7082 6892 7046 7201 7355 7406
5759 7406 7251 7461 7670 7618 7359 7179 7206 7186 7166 7311 7112 6991 7076 7206 7336 7308 7279 7091 6903 7026 7148 7291 7435 7269 7309 7543
5746 7543 7433 7172 7118 7326 7535 7644 7546 7305 7270 7601 7726 7616 7506 7396 7286 7201 7324 7227 7129 7071 7013 6920 7171 7383 7389 7533 7676
5732 7676 7602 7528 7743 7751 7621 7490 7450 7410 7190 6969 6873 6984 7135 7287 7292 7297 7145 7200 7241 7283 7350 7418 7498 7579 7461 7550 7523 7496 7586 7676 7593
5717 7593 7511 7423 7334 7417 7501 7456 7411 7262 7114 6933 6753 6951 7149 7119 7088 7058 7028 7155 7282 7237 7192 7095 6999 7074 7149 7109 7068 7130 7193 7300
5701 7300 7408 7343 7279 7249 7219 7292 7365 7248 7131 7255 7378 7188 6998 6980 6961 7083 7204 7153 7103 7306 7509 7333 7158 7021 6884 6919 6955
5688 6955 7113 7270 7230 7190 7356 7108 6976 7050 7093 7135 7018 6902 7187 7472 7447 7422 7397 7372 7348 7323 7352 7381 7411 7440 7566 7692 7646 7600 7475
5673 7475 7350 7224 7099 7155 7211 7266 7322 7397 7473 7445 7417 7342 7267 7191 7116 7357 7598 7392 7186 7117 7048 7122 6988 6833 7092 7277 7462 7343
5659 7343 7225 7416 7608 7652 7697 7501 7304 7248 7192 7225 7259 7387 7308 7216 7330 7496 7456 7442 7427 7404 7381 7358 7335 7378 7422 7362 7302 7359 7416 7301
5644 7301 7186 7335 7484 7522 7353 7218 7289 7348 7200 7159 7119 7052 6986 7230 7268 7318 7368 7240 7112 7148 7389 7755 7639 7333 7509 7615 7238
5631 7238 7047 7061 7042 7024 7327 7631 7517 7404 7419 7228 7301 7581 7628 7675 7546 7417 7391 7365 7386 7407 7311 7423 7379 7336 7434 7326 7201 7283
5617 7283 7348 7068 6917 7111 7249 7386 7402 7211 7136 7061 6982 6903 6935 7174 7322 7263 7334 7404 7436 7467 7477 7487 7554 7277 7366 7455 7367 7279 7282 7284 7382
5601 7382 7274 7166 7264 7182 7099 7030 6960 7159 7357 7452 7548 7524 7501 7637 7773 7714 7448 7401 7354 7299 7243 7188 7132 7253 7374 7494 7615 7574 7534
5587 7534 7321 7108 7190 7272 7354 7436 7451 7466 7585 7704 7818 7932 7668 7404 7385 7366 7348 7329 7345 7362 7379 7395 7455 7514 7471 7427 7500 7573 7404 7236
5571 7236 7352 7468 7549 7424 7517 7954 8060 7960 7847 7733 7710 7687 7540 7393 7350 7306 7331 7356 7382 7407 7402 7398 7380 7363 7522 7475 7234 7337 7462
5557 7462 7381 7540 7700 7786 7873 7649 7426 7493 7559 7406 7253 7081 7253 7404 7554 7557 7559 7768 7633 7436 7445 7419 7394 7455 7517 7476 7434 7354 7274
5542 7274 7365 7457 7531 7605 7576 7546 7466 7385 7304 7223 7199 7175 7151 7127 7155 7182 7210 7238 7273 7308 7343 7379 7590 7802 7751 7700 7865 7685 7526 7368 7266
5527 7266 7163 7276 7388 7680 7559 7317 7075 6956 7250 7544 7424 7481 7537 7395 7253 7126 7000 7045 7090 7103 7115 7367 7620 7622 7623 7452
5514 7452 7281 7307 7332 7358 7383 7424 7464 7505 7545 7549 7553 7557 7561 7486 7410 7334 7259 7298 7337 7479 7621 7653 7686 7718 7751 7739 7728 7717 7705 7505 7304 7276 7247 7339
5497 7339 7431 7419 7408 7321 7235 7264 7294 7251 7416 7722 7615 7310 7418 7384 7144 7106 7068 7327 7586 7481 7376 7272 7167 7118 7070 7021 6973 7083
5483 7083 7194 7201 7209 7457 7705 7644 7583 7452 7322 7295 7268 7252 7236 7392 7548 7511 7473 7539 7605 7526 7447 7471 7495 7558 7622 7525 7429 7299 7375 7476 7165
5467 7165 7076 7192 7167 7142 7087 7033 7275 7517 7621 7519 7301 7496 7568 7639 7427 7215 7263 7311 7359 7407 7435 7464 7493 7521 7460 7398 7452 7507 7247
5453 7247 7193 7548 7559 7131 7047 7243 7232 7308 7383 7343 7302 7237 7173 7109 7044 6954 6864 7015 7166 7336 7506 7504 7502 7488 7473 7540 7607 7719 7487 7177
5437 7177 7350 7336 7323 7512 7701 7742 7783 7720 7657 7470 7282 7267 7252 7323 7393 7464 7535 7467 7400 7332 7264 7485 7706 7617 7528 7290 7052 7261 7470
5423 7470 7538 7605 7569 7534 7641 7749 7603 7457 7455 7247 7120 7337 7459 7374 7427 7480 7486 7491 7497 7502 7693 7883 7910 7730 7394 7539 7594 7304 7445
5408 7445 7585 7704 7823 7903 7983 7685 7386 7330 7273 7320 7367 7362 7357 7180 7003 7086 7169 7149 6922 6903 7229 7370 7167 7164 7161 7137 7112 7182 7253 7323 7393
5393 7393 7484 7576 7564 7552 7514 7476 7438 7400 7423 7446 7366 7285 7332 7379 7528 7678 7558 7438 7559 7680 7656 7633 7610 7586 7508 7430 7524 7618 7525 7431 7390
5377 7390 7761 7918 7663 7252 7048 7236 7630 7787 7531 7407 7490 7740 7990 7886 7781 7780 7778 7797 7815 7834 7852 7875 7898 7779 7866 8069 7859
5364 7859 7653 7448 7500 7552 7605 7657 7742 7827 7670 7514 7429 7344 7362 7380 7394 7409 7320 7231 7374 7518 7489 7460 7381 7302 7395 7488 7344 7200 7298 7395
5349 7395 7403 7412 7523 7635 7656 7678 7940 8202 8023 7843 7836 7829 7772 7716 7659 7602 7547 7492 7541 7589 7514 7440 7538 7635 7630 7624 7722 7819 7696 7572 7448 7324
5333 7324 7280 7237 7296 7356 7534 7712 7649 7586 7716 7845 7665 7485 7531 7577 7622 7668 7716 7763 7639 7515 7595 7675 7651 7628 7807 7986 7993 8000 7903 7807
5317 7807 7814 7821 7817 7814 7707 7601 7511 7422 7422 7423 7718 7806 7563 7663 7984 8098 7970 7843 7946 8049 7842 7635 7635 7635 7807 7978 7877 7777 7779 7781 7775
5302 7775 7769 7659 7550 7728 7907 7982 7713 7522 7537 7402 7473 7513 7554 7710 7867 8006 8145 8044 7942 7771 7600 7601 7602 7663 7724 7544 7571 7739
5288 7739 7564 7492 7763 7941 7911 7710 7509 7485 7461 7541 7620 7695 7770 7742 7714 7780 7846 7740 7634 7603 7573 7748 7580 7452 7530 7445 7566 7720
5274 7720 7667 7640 7613 7674 7734 7692 7649 7604 7560 7412 7264 7363 7462 7561 7660 7565 7471 7479 7488 7557 7627 7696 7766 7863 7960 7886 7811 7936 8062 7946 7831 7883
5258 7883 7935 7884 7833 7946 8059 7931 7803 7867 7930 7994 8057 8093 8128 7923 7718 7588 7458 7500 7542 7671 7801 7840 7880 7824 7975 8045 7770 7631
5244 7631 7699 7615 7739 7729 7719 7756 7587 7535 7828 8026 7880 7747 7958 7967 7769 7692 7614 7640 7665 7611 7764 7994 7880 7841 7802 7914 8026 7929
5230 7929 7832 7907 7982 7854 7727 7771 7815 7673 7530 7490 7451 7550 7649 7748 7848 7861 7874 7866 7857 7983 7765 7292 7164 7460 7549 7673 7797 7789 7781 7658
5215 7658 7534 7660 7579 7408 7581 7736 7684 7770 7856 7796 7736 7564 7736 7896 7712 7454 7197 7262 7671 7900 7922 7868 7814 7920 8025 8028 8030 8032
5201 8032 8034 7942 7849 7757 7665 7813 7961 8007 8052 8132 8212 8051 7890 7807 7724 7743 7763 7670 7576 7586 7595 7489 7382 7585 7788 7848 7908 7658 7407 7542
5185 7542 7677 7812 7947 7841 7735 7801 7867 7819 7771 7896 8020 7794 7568 7652 7737 7741 7746 7750 7755 7785 7815 7949 8082 8044 8005 7726 7446 7638 7830
5171 7830 8021 8213 7957 7701 7618 7534 7491 7448 7543 7432 7167 7247 7568 7888 8135 8381 8386 8392 8210 8028 8074 8120 8208 8090 7881 8017 8103 7982
5157 7982 7896 7810 7876 7942 7905 7868 7671 7475 7519 7564 7669 7775 7640 7505 7561 7618 7674 7730 7695 7660 7866 8072 7842 7611 7759 7907 7790 7672
5143 7672 7658 7644 7534 7423 7622 7821 7820 7820 7820 7819 7826 7832 7666 7500 7478 7457 7608 7759 7712 7664 7789 7914 7801 7689 7679 7669 7825 7981 8034 8087
5128 8087 7977 7868 7758 7648 7694 7739 7784 7829 7696 7562 7532 7502 7465 7428 7563 7699 7699 7699 7571 7442 7608 7361 7114 7280 7463 7646 7752
5114 7752 7858 7832 7807 7781 7756 7802 7848 7894 7940 8121 8303 8317 8124 7873 8036 7927 7818 7935 7639 7434 7641 7858 7869 7918 7968 7890 7812 7838
5100 7838 7864 7822 7780 7738 7695 7830 7964 8068 7966 7760 7968 8188 7996 7581 7580 7820 7647 7466 7699 7846 7992 7980 7967 7783 7598 7704
5087 7704 7811 7745 7679 7674 7668 7663 7657 7579 7501 7422 7344 7523 7703 7883 8063 7952 7840 7729 7618 7881 8144 8029 7913 7881 7848 7918 7989 7877 7764
5073 7764 7652 7540 7714 7888 7820 7753 7740 7727 7610 7494 7602 7711 7510 7309 7426 7544 7558 7572 7610 7647 7788 7929 7857 7786 7714 7642 7630
5059 7630 7619 7710 7802 7784 7766 7748 7730 7744 7757 7770 7783 7803 7823 7830 7836 7911 7780 7653 7870 8089 7964 7697 7637 7707 7776 7816 8200 8263 7982 7916 7850
5043 7850 7954 8058 7874 7689 7628 7910 8033 7812 7887 8168 8131 7888 7769 7857 7816 7774 7764 7753 7743 7733 7935 8138 7962 7786 7647 7509
5030 7509 7370 7232 7229 7226 7327 7427 7520 7612 7602 7591 7835 8078 8149 8220 8084 7948 7914 7881 7878 7875 7954 8033 8369 8361 7914 7674 7705 7736 7608 7479
5015 7479 7460 7440 7648 7856 7800 7537 7438 7683 7699 7715 7753 7790 7937 8085 7991 7897 7783 7669 7727 7785 7658 7531 7713 7552 7374 7403 7268
5002 7268 7339 7570 7595 7645 7695 7905 8116 8072 8029 7968 7701 7597 7838 7898 7957 8141 8326 8271 8217 7990 7764 7711 7659 7607 7555 7750 7945 8140
4988 8140 8335 8154 7973 7792 7610 7535 7459 7383 7308 7548 7789 7788 7788 7721 7654 7621 7795 8231 8323 8105 7887 7785 7684 7685 7687 7888 8090 7995 7900
4973 7900 7948 8204 8537 8525 8451 8377 7992 7608 7536 7808 8175 8335 8146 7958 7916 7874 8038 7996 7864 8076 8131 7980 7967 7954 7969 7983 7998 8013
4959 8013 8116 8219 8149 8080 8207 8333 8357 8174 7793 7756 7938 8121 8368 8271 8195 8120 7871 7622 7683 7744 7752 7759 7869 7980 8021 8062 8103 8143 7945
4945 7945 7748 7722 7696 7685 7673 7765 7857 7825 7792 7862 7933 7927 7921 8019 8117 8147 8178 8209 8240 8257 8273 8048 7824 7959 8093 8228 8363 8253 8142 8032
4929 8032 7922 7874 7826 7882 7937 7917 7897 7877 7857 7954 8050 8043 8036 8058 8080 8103 8125 8104 8084 8063 8042 7938 7834 7971 8108 8036 7964 7996 8027 8144 8261 8136
4913 8136 8012 7868 7725 7822 7919 7883 7846 7809 7773 7700 7626 7553 7480 7521 7563 7604 7646 7863 8081 8127 8172 8187 8201 8112 8024 8010 7997 8086 8176 8150 8125 8099
4897 8099 8073 8054 8035 8015 7996 8006 8016 8025 8035 8051 8067 8084 8100 8034 7968 8006 8043 8003 7964 7924 7884 8067 8250 8124 7997 7791 7585 7757 7930 7960 7991
4882 7991 8052 8319 8380 8027 7985 8355 8221 7880 7607 7748 7857 7759 7906 8053 8059 8064 8070 8075 7924 7772 7741 8123 8447 8358 8217 8076 7976 7876
4868 7876 7777 7677 7906 8135 8054 7973 7965 7958 7950 7942 7957 7972 7884 7795 7810 7825 7840 7855 7918 7981 7829 7677 7299 7334 7447 7559 7844 8129 8146 8164 8518
4852 8518 8458 8136 8021 8089 8157 8066 7975 7992 8008 7784 7559 7682 7805 7825 7845 7770 7695 7724 7752 7879 8005 7964 7717 7489 7674 7923 8172 8186
4838 8186 8200 8240 8279 7986 8105 8280 8249 8041 7834 7854 7874 7875 7876 7877 7878 8022 8166 8207 8248 8231 8213 8437 8661 8730 8800 8491 8182 8162 8141 8224 8306
4823 8306 8441 8575 8537 8499 8238 7976 7908 7840 7618 7740 8081 8216 8355 8288 7898 7714 7802 7889 7886 7884 7887 7891 7895 7898 7907 7916 7890 8209 8297 8179 8027
4807 8027 7875 7851 7828 7847 8073 8143 8005 7997 7989 8072 8155 8123 8090 8236 8175 7921 7873 8186 8156 7945 8078 8180 7939 7926 7912 7891 8077 8262 8242
4792 8242 8307 8372 8265 8158 8005 8058 8086 8113 8227 8134 8045 8300 8494 8343 8180 8016 7887 7964 8042 7913 7987 8061 8122 8183 8275 8366 8217 8067
4778 8067 8123 8179 8192 7998 7727 7662 7847 8032 8113 8193 8171 8148 8175 8202 8112 8229 8307 8384 8465 8065 7734 7884 8103 8116 8020 8131 8112 8094 8015
4764 8015 7936 7845 7959 8062 8164 8266 8368 8421 8267 8333 8399 8242 8085 8156 8227 8223 8012 7801 7797 7917 8038 7930 7822 7981 8140 8299 8459
4750 8459 8223 7987 8061 8135 8027 7918 7912 7907 7950 7994 8003 8218 8502 8443 8348 8254 8012 7769 7836 7903 8030 8158 8113 8068 8032 7996 8063 8130 8026 7921
4735 7921 8057 8193 8349 8506 8353 7993 7902 8155 8318 8275 8120 7965 8039 8112 8190 8268 8173 8079 8107 8134 8162 8190 8314 8439 8391 8343 8165 7986
4721 7986 7980 7973 7930 7887 7844 7801 7860 7920 8152 8383 8269 8154 8040 7925 8097 8268 8439 8611 8615 8618 8519 8419 8422 8424 8530 8636 8510 8383 8360 8337
4706 8337 8152 7966 8091 8215 8313 8412 8407 8403 8286 8169 8156 8143 8018 7893 8008 8124 8130 8136 8039 7942 7978 8014 8050 8086 8140 8193 8247 8300 8261 8222 8183
4691 8183 8143 8226 8309 8151 7993 8065 8137 7899 8006 8234 8255 8242 8229 8410 8591 8531 8264 8267 8613 8569 8180 8176 8172 8113 8260 8368 8132 7908 8029
4676 8029 8077 8125 8194 8264 8356 8448 8368 8288 8255 8222 8017 7812 7932 8052 8172 8292 8233 8175 8219 8264 8316 8368 8179 7991 8062 8134 8205 8277 8389 8502
4661 8502 8442 8382 8421 8461 8315 8169 8225 8074 7833 7937 8150 8156 8059 7962 8150 8338 8217 8095 8060 8024 8092 8160 8036 7913 7961 8010 8153 8296
4647 8296 8199 8101 8051 8000 8053 8106 8170 8233 8297 8361 8321 8282 8071 7860 7851 7842 7833 7823 7810 7797 7955 8114 8178 8242 8410 8577 8477 8378 8300 8222 8030 8183
4631 8183 8382 8582 8442 8303 8336 8369 8200 8030 8033 8036 8210 8384 8180 7976 8014 8053 8333 8612 8536 8460 8383 8307 8355 8404 8452 8500 8554 8609 8491
4616 8491 8372 8321 8270 8322 8374 8621 8869 8738 8607 8420 8233 8356 8479 8635 8791 8706 8622 8603 8585 8326 8067 8119 8171 8223 8274 8143 8012
4603 8012 8178 8344 8336 8121 7881 8053 8318 8377 8267 8158 8215 8272 8342 8412 8346 8487 8757 8613 8465 8523 8439 8356 8336 8317 8311 8304 8216 8333 8580
4588 8580 8414 8364 8521 8406 8498 8613 8521 8442 8570 8594 8618 8655 8692 8617 8541 8465 8389 8387 8384 8485 8585 8458 8330 8129 8341 8449 8352 8499 8646
4574 8646 8469 8292 8218 8144 8095 8047 8102 8157 8300 8444 8277 8111 8274 8437 8453 8470 8284 8511 8751 8579 8163 7953 7843 7939 8246 8208
4561 8208 8068 7927 7900 7874 7847 7820 7922 8023 7952 7881 7894 7907 8024 8140 8245 8350 8352 8354 8330 8306 8454 8602 8507 8412 8420 8429 8342 8256 8273 8290 8217
4545 8217 8145 8245 8345 8393 8441 8179 8124 8526 8584 8538 8493 8585 8677 8460 8242 8119 7995 8065 8135 7999 8206 8427 8441 8291 7935 7876 8024
4531 8024 8210 8396 8285 8175 8154 8133 8216 8299 8304 8309 8315 8320 8193 8066 7939 7812 7943 8074 8033 7992 8286 8580 8427 8274 8183 8092 8105 8117 8173
4517 8173 8229 8285 8341 8281 8221 8333 8445 8333 8221 8109 7997 8051 8105 8158 8212 8258 8304 8349 8395 8434 8474 8513 8552 8561 8570 8497 8424 8151 8222 8535 8503
4501 8503 8345 8187 8111 8035 8122 8210 8400 8591 8459 8328 8299 8271 8430 8589 8735 8881 8751 8415 8299 8389 8356 7980 7917 8336 8412 8487 8430
4488 8430 8028 7960 8235 8296 8357 8623 8889 8777 8664 8610 8555 8411 8266 8150 8240 8257 8481 8550 8412 8507 8602 8564 8526 8398 8270 8035 8006
4474 8006 8295 8584 8642 8494 8449 8610 8634 8658 8522 8387 8306 8225 8316 8407 8439 8472 8492 8512 8384 8049 7985 8265 8416 8085 7948 8293 8297 8300 8463
4460 8463 8420 8187 8161 8453 8745 8671 8597 8523 8450 8419 8388 8370 8353 8354 8561 8597 8425 8377 8329 8370 8412 8389 8367 8447 8527 8397 8267 8239 8212 8296 8379
4444 8379 8222 8065 8200 8335 8299 8262 8497 8732 8580 8221 8127 8239 8222 8206 8356 8506 8415 8324 8339 8353 8540 8726 8499 8271 8285 8298 8279
4431 8279 8260 8104 8154 8397 8297 8299 8302 8240 8178 8116 8054 8283 8511 8705 8555 8381 8414 8447 8273 8131 8334 8446 8352 8435 8517 8345 8174 8290
4417 8290 8406 8350 8294 8182 8070 8268 8466 8571 8676 8541 8405 8353 8302 8250 8198 8077 7956 8076 8196 8363 8530 8525 8520 8423 8326 8228 8131 8227
4402 8227 8323 8419 8516 8341 8166 8233 8299 8436 8574 8470 8367 8590 8813 8796 8778 8606 8433 8571 8708 8642 8577 8270 7964 8128 8292 8457
4389 8457 8621 8612 8602 8420 8238 8304 8369 8332 8294 8330 8367 8507 8646 8588 8530 8575 8620 8495 8370 8416 8463 8394 8324 8371 8418 8276 8341 8586 8487 8281
4374 8281 8075 8032 7989 8022 8260 8405 8205 8330 8455 8386 8318 8357 8396 8413 8431 8786 8798 8658 8519 8368 8217 8411 8604 8512 8419 8430 8440 8431
4360 8431 8422 8620 8817 8625 8434 8242 8050 8264 8478 8210 7943 8056 8169 8075 7982 8215 8448 8557 8665 8670 8331 8005 8161 8454 8542
4348 8542 8569 8596 8535 8474 8516 8559 8477 8395 8417 8438 8266 8094 8128 8163 8215 8268 8334 8399 8345 8496 8725 8610 8320 8030 8200 8370 8467 8564 8743
4333 8743 8922 9035 8804 8754 8910 8742 8573 8624 8675 8653 8631 8712 8793 8635 8478 8527 8576 8590 8605 8619 8634 8642 8650 8761 8873 8667 8461 8461 8461 8378
4318 8378 8295 8314 8334 8347 8360 8463 8566 8506 8239 8089 8282 8546 8604 8455 8306 8305 8304 8407 8510 8433 8357 8487 8617 8659 8701 8536 8371 8391
4304 8391 8411 8431 8451 8310 8169 8234 8299 8388 8476 8462 8447 8547 8647 8746 8846 8856 8867 8877 8888 8776 8664 8552 8440 8363 8285 8312 8338 8422 8506 8384
4289 8384 8262 8350 8438 8514 8589 8649 8503 8370 8581 8569 8351 8614 8671 8406 8484 8679 8667 8476 8286 8185 8085 8081 8078 8143 8415 8716 8673 8493
4275 8493 8313 8382 8451 8520 8589 8520 8452 8727 9003 8853 8703 8656 8609 8515 8421 8430 8440 8439 8437 8539 8641 8727 8813 8692 8571 8551 8532 8512 8492 8675 8858
4259 8858 8697 8536 8336 8137 8281 8425 8598 8770 8723 8676 8659 8436 8135 8179 8486 8793 8915 9037 8995 8954 8912 8870 8649 8428 8327 8570
4246 8570 8983 8914 8815 8923 8902 8880 8769 8657 8623 8588 8554 8520 8799 9079 9104 8786 8715 8644 8723 8803 8837 8871 8802 8733 8763 8793 8651 8509 8502 8495 8660
4231 8660 8825 8884 8944 8831 8719 8698 8677 8655 8634 8766 8898 8788 8679 8739 8800 8620 8439 8556 8672 8685 8698 8600 8501 8643 8579 8420 8605
4217 8605 9019 9088 8877 8667 8539 8410 8660 8910 8919 8929 9000 9072 8902 8733 8834 8936 8866 8795 8691 8587 8401 8215 8120 8369 8643 8711
4204 8711 8645 8578 8602 8626 8687 8747 8808 8868 8835 8802 8941 9080 9286 9492 9250 9008 8831 8654 8842 9031 8862 8487 8254 8365 8620 8531 8450
4191 8450 8576 8323 8277 8562 8503 8366 8229 8380 8531 8571 8610 8546 8482 8608 8733 8686 8639 8616 8593 8570 8547 8545 8543 8438 8332 8399 8466 8774 9081
4176 9081 8905 8729 8552 8376 8396 8415 8435 8454 8491 8529 8437 8552 8795 8833 8758 8683 8723 8764 8701 8638 8635 8632 8397 8368 8462 8349 8352 8561 8685 8808
4161 8808 8842 8875 8844 8813 8610 8407 8643 8879 8749 8619 8506 8598 8816 8827 8640 8798 9192 9104 8849 8594 8610 8970 8990 8666 8798 8930
4148 8930 8808 8687 8793 8899 8902 8699 8599 8705 8672 8639 8723 8806 8761 8715 8566 8418 8379 8339 8589 8631 8667 8703 8623 8543 8556 8568 8580 8592 8579 8565
4133 8565 8573 8581 8421 8605 8814 8817 8822 8828 8717 8606 8549 8493 8609 8724 8737 8749 8774 8800 8730 8866 9016 8959 8814 8875 8924 8766 8617 8468 8422 8376
4118 8376 8374 8578 8781 8779 8862 8944 8705 8465 8524 8583 8526 8676 8648 8620 8735 8643 8550 8665 8663 8661 8589 8723 8947 8828 8756 8890 8886 8883 8778 8674 8698
4102 8698 8516 8334 8359 8495 8631 8595 8558 8611 8665 8856 8841 8438 8036 8304 8779 8944 9109 8957 8462 8208 8297 8461 8625 8797 8970
4090 8970 8934 8691 8448 8412 8541 8669 8810 8952 8796 8641 8739 8837 8861 9092 9159 8882 8618 8353 8322 8290 8290 8497 8691 8885 8708 8532
4077 8532 8541 8550 8644 8944 8957 8969 8972 8976 8876 8776 8727 8679 8539 8400 8332 8470 8492 8514 8800 9085 9053 8813 8555 8503 8493 8691 8954 8872 8757 8641
4062 8641 8536 8431 8313 8402 8554 8706 8987 9061 8811 8561 8423 8491 8637 8784 8840 8897 8794 8691 8691 8692 8564 8437 8296 8362 8504 8645
4049 8645 8627 8609 8631 8653 8688 8723 8752 8987 9119 9044 8876 8708 8639 8776 8984 8986 8876 8766 8698 8630 8679 8521 8485 8450 8367 8491 8711 8586 8379
4034 8379 8380 8556 8733 8750 8767 8630 8493 8537 8788 8965 8935 9022 9109 9175 9033 8879 8932 8924 8710 8680 8858 8819 8780 8779 8573 8559 8753 8976 9200
4019 9200 9240 9074 8852 8631 8837 9043 8746 8449 8434 8626 8702 8777 8707 8636 8566 8495 8751 9008 9023 9039 9031 9022 8911 8799 8441 8083 8242 8400
4005 8400 8306 8213 8361 8508 8524 8541 8557 8573 8441 8309 8190 8070 8213 8563 8925 9081 9007 9139 9259 9172 9240 9309 9137 8965 8952 9146 9236
3992 9236 9120 9021 8922 8693 8671 8746 8821 9026 9023 8977 8931 8859 8788 8785 8575 8529 8827 8841 8854 8717 8580 8696 8813 8688 8564 8513 8463 8515 8568 8711
3977 8711 8853 8867 8881 9252 9210 8906 8808 8864 8921 9077 8820 8744 9082 9291 9086 8972 8858 8718 8578 8680 8782 8884 8986 8993 9001 9008 9016 8997
3963 8997 8979 8960 8942 8820 8699 8818 8937 9068 9198 9157 9115 9125 9135 8861 8588 8417 8659 8885 9110 9262 9001 8731 8462 8411 8361 8414
3950 8414 8467 8632 8797 8789 8782 8880 8979 8698 8418 8339 8261 8424 8586 8684 8782 8841 9107 9153 8787 8721 8862 8938 9015 8932 8849 8923 8997 9072 9146 9046
3935 9046 8946 8949 8952 8958 8963 8968 8974 8966 8958 8949 8941 8927 8912 8898 8883 8960 9036 9009 8982 8884 8787 8689 8591 8499 8408 8317 8225 8641 9058 9013 8969 9102 9029 8899 8770 8662
3917 8662 8554 8433 8519 8520 8521 8707 8894 8845 8797 8749 8700 8873 9045 8976 8908 8822 8736 8753 8770 8835 8899 8825 8958 9181 9061 9043 9232 9124 9222 9406
3902 9406 9109 8779 8793 8756 8719 8797 8876 8851 8826 8956 9086 9104 8916 8750 8790 8934 8871 8757 8849 9100 9145 9017 8890 8853 8816 8717 8617 8699
3887 8699 8987 9111 9028 9204 9173 8774 8582 8626 8670 8981 9086 8950 9020 9122 9225 9099 8767 8621 8819 8811 8803 8904 9005 8810 8614 8461
3874 8461 8514 8692 8869 8830 8790 8751 8711 8851 8990 8901 8813 8810 9014 9309 9259 9046 9041 9198 9150 8939 8936 8975 9015 9044 9074 9000 8927 8976 9025 9087 9149
3859 9149 9028 9114 9371 9423 9282 9142 9045 9154 9062 8969 8992 9016 8966 8916 8866 8817 8820 8823 8826 8828 8853 8877 8799 8720 8634 8548 8841 9133 9112 9091 8966 8841
3843 8841 8797 8752 8880 9008 9038 9069 9100 9131 9076 9022 9070 9119 8991 8863 8839 8815 8807 8799 8791 8783 8750 8716 8682 8649 8568 8488 8579 8671 8771 8871 9075 9278
3827 9278 9229 9179 9130 9081 9033 8986 8767 8548 8574 8599 8797 8995 8901 8806 8883 8961 8858 8754 8754 8754 8806 8858 8944 8823 8665 8852 9120 9181 9000 8818
3812 8818 8796 8774 8894 9015 9136 9257 9160 9063 9277 9490 9493 9495 9326 9157 9073 8990 8872 8961 9239 9173 9025 9083 8905 8727 8872 9017 9001 8986
3798 8986 9074 9368 9450 9187 8843 8705 8777 8848 8933 9018 8842 8667 8663 8660 8870 9081 8913 8745 8691 8637 8845 9053 8803 8898 8915 8725 8802 8880
3784 8880 8750 8965 8823 8681 8802 8922 8967 9012 9208 9404 9465 9182 8796 8754 8910 9066 9140 9215 9319 9424 9287 9151 9107 9063 9192 9320
3771 9320 9274 9228 9182 9136 8860 8584 8617 8651 8814 8977 9037 9097 9033 8968 9006 9045 9053 9061 8966 8665 8415 8510 8776 9043 9121 9200 9038 8876 8927 8977
3755 8977 9028 9079 8987 8895 8974 9054 9171 9287 9094 8901 8686 8471 8566 8661 8715 8769 8823 8877 9006 9136 9093 9050 8930 8810 8862 8913 8875 8837 8799
3741 8799 8761 8915 9068 9221 9375 9338 9301 9264 9227 9250 9273 9297 9320 9308 9297 9285 9273 9208 9142 9098 9054 8758 8805 9231 9313 9098 8883 8887 8892 8926 8960
3725 8960 8994 9027 9169 9310 9211 9111 9028 8945 8861 8778 9084 9390 9248 9107 8941 8774 8853 8725 8684 9055 9078 9101 8978 8856 8974 9093 9237
3712 9237 9382 9285 9189 9163 9138 9215 9293 9285 9276 9096 8916 8824 8733 8810 9093 9482 9457 9230 9004 9020 9037 9054 9070 9175 9280 9424 9361 9137 9325
3697 9325 9557 9582 9530 9478 9310 9141 9271 9401 9359 9317 9376 9435 9567 9286 9105 9130 9014 8897 9039 9181 9219 9258 9200 9143 9085 9027 9000 8973
3683 8973 8945 8918 9116 9315 9410 9505 9546 9588 9526 9464 9452 9439 9298 9157 9187 8805 8681 8556 8442 8740 8781 8821 9304 9375 9437 9499 9210 8921
3669 8921 9011 9101 9195 9289 9211 9133 9151 9168 9289 9410 9364 9317 9373 9430 9563 9696 9588 9480 9230 8980 9109 9237 9150 9062 9078 9094 9191 9289 9283 9070
3654 9070 8802 8878 9174 9262 9192 9122 9348 9575 9543 9512 9308 9104 9124 9144 9061 8978 8790 8603 8794 8985 9081 9178 8964 8751 8853 8956 8955 8954
3640 8954 9250 9546 9532 9518 9390 9262 9238 9213 9096 8979 8862 8745 8947 9149 9110 9071 8976 8881 8786 8691 8635 8579 8639 8699 8607 8721 8934 8803
3626 8803 8782 9106 9318 9323 9264 8998 8823 8854 9091 9328 9199 9070 9227 9385 9150 8916 8920 8716 8436 8500 8914 9328 9248 9167 9038 8909
3613 8909 8884 8858 8802 8746 9069 9392 9356 9319 9386 9453 9367 9281 9195 9109 9210 9311 9309 9307 9273 9238 9307 9376 9337 9298 9157 9015 9038 9062 8982 8903 8840 8777
3597 8777 8739 8702 8753 9217 9384 9138 8915 8898 8980 9062 9114 9166 9391 9615 9424 9234 9216 9197 9250 9303 9355 9408 9401 9393 9282 9172 9024 8877 8945
3582 8945 9012 9214 9003 8599 8401 8381 8362 8596 8830 8949 9067 9185 9303 9131 8958 9027 9096 9238 9379 9405 9431 9377 9116 8899 9094 9220
3569 9220 9139 9084 9236 9099 8962 8980 8792 8745 9111 9059 9008 9204 9400 9286 9173 9086 8999 9084 9169 9233 9297 9257 9218 9059 8901 8915 8929 8899 8870
3555 8870 8841 8811 8839 8867 8894 8922 9066 9210 9182 9153 9262 9371 9377 9383 9342 9300 9086 8873 8917 8962 9110 9257 9220 9183 9043 8902 9009 9115 9049
3540 9049 8983 8793 8603 8580 8764 9086 8996 8862 8935 9097 9258 9122 8987 9045 9104 9162 9221 9329 9437 9304 9172 9152 9133 9010 8888 9002
3527 9002 9116 9126 9137 9222 9306 9218 9131 9082 9033 9087 9141 9150 9159 9271 9382 9363 9344 9453 9357 9150 9151 9194 9237 9250 9264 9380 9496 9482 9467 9452 9437 9351
3511 9351 9266 9283 9301 9201 9101 9105 9108 9221 9335 9207 9079 9188 9297 9406 9515 9301 9087 9252 9417 9373 9329 9284 9240 9237 9234 9334 9434 9214
3497 9214 8993 9026 9060 9091 9329 9463 9391 9324 9257 9176 9096 9324 9551 9598 9438 9263 9294 9300 9305 9177 9049 9093 9137 8860 8583 8637 8898 9062 9226
3482 9226 9519 9605 9591 9577 9249 9127 9134 8935 8736 8744 9035 9119 9015 9254 9352 9105 8880 8999 9211 9423 9484 9545 9539 9533 9528 9522 9425 9327 9230 9132 9259
3467 9259 9385 9270 9155 9212 9269 9365 9254 9074 9307 9515 9516 9317 9118 9147 9176 9134 9092 8947 8802 8941 9080 9219 9359 9341 9323 9478 9632
3453 9632 9481 9330 9282 9234 9309 9384 9463 9130 9070 9217 9222 9227 9225 9224 9326 9428 9279 9131 9154 9178 9309 9440 9124 8808 9138 9468 9351 9234
3439 9234 9284 9335 9145 8954 8874 8793 8816 8838 8927 9017 9209 9402 9366 9330 9294 9258 9265 9272 9279 9286 9218 9150 9113 9282 9431 9168 8995 9235 9491 9333 9098
3424 9098 9276 9356 9435 9437 9438 9355 9272 9361 9450 9399 9348 9194 9040 9147 9253 9359 9465 9535 9604 9502 9400 9564 9729 9653 9577 9434 9291 9321 9350
3409 9350 9502 9654 9806 9958 9789 9621 9555 9490 9631 9773 9811 9850 9714 9578 9442 9306 9175 9045 9086 9128 8993 8858 9007 9157 9310
3397 9310 9050 8790 8943 8952 8961 8996 9031 9141 9251 9361 9471 9394 9317 9240 9163 9039 8916 8964 9012 8945 8877 9046 9421 9525 9217 9037 9064 9226
3383 9226 9389 9461 9533 9434 9335 9476 9618 9529 9441 9353 9264 9252 9240 9331 9422 9442 9462 9379 9296 9294 9292 9393 9495 9482 9469 9456 9443 9391 9338 9458 9577 9471
3366 9471 9364 9310 9668 9934 9787 9796 9804 9552 9300 9220 9140 9181 9223 9264 9306 9306 9307 9480 9652 9462 9272 9392 9511 9558 9604 9655 9293 9155 9223
3352 9223 9252 9281 9351 9422 9492 9562 9562 9563 9391 9219 9260 9301 9170 9039 9090 9140 9087 9034 9147 9259 9372 9485 9446 9407 9472 9536 9549 9562 9575 9588 9463
3336 9463 9338 9316 9294 9411 9529 9363 9197 8948 9113 9527 9735 9463 8984 9013 9042 8907 9184 9346 9300 9395 9490 9473 9249 9060 9284 9366
3323 9366 9448 9280 9113 9049 8984 9090 9196 9474 9751 9487 9223 9268 9314 9452 9591 9420 9250 9188 9127 9307 9487 9444 9401 9358 9315 9386 9457
3310 9457 9425 9393 9475 9557 9466 9376 9333 9290 9350 9410 9283 9155 9269 9382 9405 9429 9280 9131 9200 9269 9234 9200 9342 9484 9454 9424 9365 9305 9349 9393
3295 9393 9497 9600 9532 9464 9220 8975 9105 9442 9632 9409 9328 9247 8987 8727 8725 9136 9351 9154 8969 9197 9356 9308 9229 9151 9251 9352
3282 9352 9349 9346 9194 9043 9064 9084 9125 9165 9033 8901 8954 9006 9059 9112 9155 9197 9239 9281 9305 9329 9353 9377 9263 9150 9324 9499 9489 9136 9031 9134
3267 9134 9172 9210 9170 9131 9072 9221 9562 9560 9351 9348 9380 9412 9359 9305 9561 9817 9681 9546 9582 9619 9582 9546 9337 9129 9193 9258 9322 9387 9185 8984
3252 8984 8955 8925 9178 9430 9511 9591 9519 9446 9202 8958 9137 9316 9496 9675 9509 9343 9348 9354 9302 9250 9336 9215 9108 9345 9492 9432 9510 9588
3237 9588 9296 9004 8831 9002 9152 9302 9503 9704 9596 9488 9638 9787 9558 9330 9342 9354 9263 9172 9313 9454 9424 9393 9575 9758 9630
3225 9630 9503 9568 9633 9698 9763 9542 9321 9410 9499 9516 9534 9449 9363 9316 9269 9085 9107 9325 9198 9162 9333 9211 9089 9221 9352 9502 9652 9491
3211 9491 9331 9302 9273 9348 9422 9462 9502 9542 9582 9486 9391 9261 9475 9748 9816 9779 9743 9694 9645 9355 9065 9010 8954 9071 9187 9375 9562 9578 9593
3196 9593 9500 9407 9314 9221 9257 9293 9329 9365 9517 9668 9579 9490 9315 9139 9205 9271 9273 9276 9279 9281 9318 9355 9427 9292 9173 9397 9532 9460 9461 9462 9450 9438 9446 9455
3179 9455 9360 9265 9324 9384 9547 9710 9574 9439 9303 9167 9119 9071 9264 9458 9523 9588 9549 9511 9636 9761 9645 9530 9446 9363 9382 9402 9558 9713
3165 9713 9847 9980 9997 9669 9638 9952 9900 9641 9520 9398 9456 9513 9467 9422 9397 9373 9349 9324 9289 9255 9461 9667 9477 9287 9408 9528 9613 9699
3151 9699 9784 9870 9844 9818 9791 9765 9601 9436 9650 9864 9745 9625 9506 9387 9448 9509 9571 9632 9635 9638 9642 9645 9537 9429 9205 8981 8901 8615 8716
3137 8716 9230 9286 9137 9159 9388 9862 9923 9795 9666 9678 9896 9921 9533 9388 9243 9381 9520 9525 9531 9536 9542 9525 9509 9493 9477 9431 9385 9510 9636
3122 9636 9530 9423 9558 9692 9580 9468 9357 9245 9206 9167 9301 9434 9489 9544 9599 9654 9674 9695 9716 9736 9612 9487 9466 9444 9481 9518 9382 9247
3108 9247 9044 8842 8949 9056 9139 9223 9306 9390 9383 9376 9473 9569 9614 9658 9600 9542 9538 9535 9532 9529 9526 9523 9519 9516 9409 9301 9297 9293 9355 9418 9377 9336 9233 9131 9269 9407
3090 9407 9505 9602 9687 9771 9650 9322 9119 9328 9312 9296 9319 9341 9263 9391 9403 9415 9573 9732 9774 9816 9687 9353 9246 9345 9382 9213 9044 9081
3076 9081 9305 9323 9113 9109 9303 9497 9510 9523 9705 9543 9459 9581 9460 9339 9243 9148 9103 9264 9438 9405 9420 9642 9554 9259 8955 8858 8942 9026
3062 9026 9172 9318 9292 9266 9339 9411 9484 9556 9579 9602 9522 9442 9609 9776 9633 9490 9494 9498 9536 9367 9337 9651 9772 9686 9658 9630 9602 9574 9281 9195
3047 9195 9247 9298 9337 9582 9539 9496 9440 9384 9328 9272 9097 8923 8920 8918 8905 8892 9121 9349 9453 9556 9647 9737 9836 9728 9607 9693 9787 9675 9472 9476
3032 9476 9536 9597 9580 9563 9552 9748 9840 9727 9773 9820 9854 9888 9815 9741 9668 9594 9531 9469 9462 9661 9640 9618 9699 9780 9909 9832 9711 9591 9400 9415 9546
3016 9546 9471 9374 9483 9464 9445 9423 9402 9415 9634 9850 9721 9558 9395 9563 9731 9787 9637 9451 9470 9464 9458 9515 9571 9627 9684 9574 9465 9528 9590
3002 9590 9565 9540 9424 9308 9153 9204 9427 9443 9309 9175 9153 9337 9497 9656 9773 9682 9657 9631 9580 9529 9617 9498 9496 9493 9394 9295 9239 9389 9474
2987 9474 9352 9360 9367 9347 9327 9306 9286 9326 9367 9613 9516 9412 9515 9480 9445 9233 9021 8981 8941 9172 9403 9393 9383 9403 9422 9442 9462 9473 9484 9495 9506
2971 9506 9483 9460 9540 9620 9661 9703 9757 9605 9633 9661 9689 9717 9431 9351 9525 9493 9371 9456 9541 9419 9362 9511 9531 9551 9440 9329 9403 9477 9336 9401
2956 9401 9522 9644 9549 9455 9360 9266 9361 9456 9551 9646 9701 9756 9501 9246 9323 9400 9476 9553 9337 9121 9077 9034 9246 9458 9430 9401 9343 9286 9538 9790
2941 9790 9672 9554 9436 9318 9409 9499 9612 9724 9365 9350 9667 9502 9369 9442 9253 9271 9349 9427 9517 9608 9739 9870 9759 9649 9528 9407
2928 9407 9458 9509 9488 9467 9343 9219 9435 9650 9625 9600 9535 9471 9510 9549 9359 9170 9360 9549 9667 9785 9593 9401 9433 9465 9394 9322 9268 9215
2914 9215 9320 9426 9643 9654 9403 9495 9864 10026 10016 10006 9890 9775 9793 9810 9557 9786 10105 9804 9455 9311 9206 9308 9479 9649 9661
2902 9661 9672 9574 9476 9549 9623 9611 9600 9588 9576 9639 9703 9594 9486 9388 9290 9364 9438 9521 9604 9515 9425 9633 9840 10151 10117 9765 9620 9577 9535 9637
2887 9637 9739 9854 9762 9533 9303 9508 9714 9800 9885 9730 9575 9666 9756 9614 9678 9857 9830 9690 9551 9461 9371 9638 9905 10039 9830 9620
2874 9620 9754 9762 9770 9708 9647 9473 9506 9664 9615 9542 9814 9879 9944 9968 9992 10042 9886 9615 9551 9483 9621 9606 9591 9709 9483 9243 9483 9419 9354 9626
2859 9626 9691 9700 9709 9703 9697 9580 9255 9245 9440 9666 9892 9995 9892 9905 9918 9891 9864 9941 10017 9904 9791 9700 9608 9346 9428 9750 9729 9705 9681 9610 9746
2843 9746 9753 9553 9586 9618 9698 9778 9893 10214 10355 10152 9868 9583 9348 9457 9811 9959 9768 9784 9786 9582 9493 9403 9343 9490 9779 9862 9902 9942
2829 9942 9953 9965 9839 9920 10063 9862 9648 9640 9697 9754 9721 9688 9631 9575 9734 9548 9459 9715 9583 9451 9391 9330 9373 9416 9569 9721 9771 9820 9739
2814 9739 9658 9578 9497 9502 9507 9513 9518 9493 9469 9548 9627 9697 9767 9597 9426 9478 9530 9582 9634 9585 9535 9486 9437 9455 9472 9490 9507 9409 9310 9384 9457 9556 9656 9445
2797 9445 9235 9519 9803 9915 10028 10053 10077 9930 9783 9657 9532 9509 9487 9602 9718 9731 9743 9782 9820 9720 9828 9988 9803 9619 9779 9989
2784 9989 9992 9823 9653 9622 9592 9561 9530 9606 9683 9760 9836 9733 9629 9628 9628 9694 9760 9723 9686 9542 9397 9493 9590 9731 9873 9773 9674 9552 9430 9307
2769 9307 9185 9416 9647 9877 10108 9995 9883 9874 9864 9832 9799 9663 9526 9706 9887 9701 9515 9459 9608 9758 9702 9731 9760 9892 9817 9657
2756 9657 9497 9427 9357 9330 9303 9577 9645 9571 9704 9810 9917 10013 10110 9918 9726 9635 9889 10232 10094 10109 10331 10105 10086 10079 9866 9955 10043 9900
2742 9900 9757 9614 9471 9605 9739 9818 9690 9766 9842 9931 9813 9691 9776 9731 9687 9619 9551 9497 9442 9488 9741 9706 9671 9670 9668 9680 9692 9596 9707 9818
2727 9818 9722 9772 9822 9963 10103 10050 9996 9943 9890 9595 9301 9316 9331 9377 9422 9424 9220 9201 9388 9446 9504 9692 9879 10053 10228 10133 9832 9764 9695
2712 9695 9777 10066 10225 10385 10359 10126 10066 10212 10177 10142 10237 10124 10068 10012 10046 10080 9902 9723 9785 9847 9782 9716 9741 9766 9884 9795 9706 9823 9770
2698 9770 9716 9894 9866 9866 9866 9634 9608 9695 9782 9758 9526 9663 9800 9794 9995 10112 10022 9902 9782 9542 9508 9668 9828 9839 9851 9863 9875 9895 9916 10151
2683 10151 10043 9514 9329 9501 9673 9783 9686 9693 9906 10037 10168 10058 9948 9896 9637 9482 9533 9654 9774 10024 10067 10003 9938 9861 9784 9868
2670 9868 9952 9709 9810 10219 10146 9746 9552 9635 9924 9924 9925 9915 9698 9482 9472 9522 9572 9738 9905 10000 10095 9962 9830 9651 9678 9822 9759 9727
2656 9727 9900 9958 9809 9792 9774 9524 9481 9579 9678 9901 9780 9477 9518 9597 9677 9793 10115 10265 10209 10177 10145 10121 10097 9852 9950 10036 9640 9569 9705
2641 9705 9797 9889 9937 9984 9859 9528 9459 9734 9802 9871 9832 9793 9858 9922 9806 9690 9711 9526 9528 9874 9842 9809 9704 9598 9596 9594 9514 9434 9664 9894
2626 9894 9840 9786 9916 10047 9808 9775 9798 9821 9791 9760 9845 9931 9799 9874 9962 9843 9651 9665 9839 9806 9811 9817 9707 9596 9619 9642 9665 9688 9819 9949
2611 9949 9830 9505 9541 9783 9896 10009 9923 9836 9852 9868 10018 10168 10146 10123 9890 9657 9665 9673 9704 9735 9809 10089 10152 10009 9995 9980 10125 10270 10381
2597 10381 10147 9812 9684 9797 9909 9697 9484 9594 9704 9678 9859 9924 9989 9973 9957 10101 10244 10224 9997 9899 9802 9712 9829 9932 10036 9882
2583 9882 9728 9952 10176 10115 10055 9994 9933 9855 9777 9699 9621 9552 9483 9599 9715 9760 10011 10090 9963 9868 9773 9769 9764 9742 9721 9699 9677 9670 9663 9656 9649 9646 9644 9813
2566 9813 9982 9963 9944 10152 10361 10417 10266 10232 10198 10090 9983 10048 10113 9960 9808 9767 9933 10247 10354 10212 10070 9957 9845 9707 9776 10058
2553 10058 10134 10042 9950 9754 9766 10039 10313 10197 10082 10083 10084 9902 9927 10042 9813 9674 9742 9784 10033 10232 10224 10428 10631 10481 9987 9665 9687
2540 9687 9669 9650 9812 9974 10061 9941 9744 9892 9946 10001 10103 9999 9874 9956 10150 10138 9906 10018 10212 10200 10186 10172 10042 9912 9793 9674
2527 9674 9920 10166 10317 10260 10320 10380 10407 10435 10480 10869 10998 10646 10230 10020 10046 10073 9940 9807 9791 9774 9998 10223 10045 9867 9930 9993 9844
2513 9844 9695 9559 9423 9338 9460 9685 9704 9716 9727 9610 9699 9698 9697 9837 9772 9679 9792 9880 9967 9952 9936 10209 10275 10215 10155 10081 10008 10195 10383 10522
2498 10522 10318 10156 9995 9924 10059 10241 10217 10082 9946 9810 9674 9711 9747 9738 9729 9733 9737 9830 10129 10118 9900 9838 9775 9872 9969 9976 9983 9989 9996 10195 10393
2483 10393 10535 10471 10335 10200 10107 10220 10106 9992 9980 9969 9928 9680 9790 10243 10355 10260 10302 10345 10082 9818 9878 9937 9932 10134 9909 9685 9782
2469 9782 9880 9977 10075 10091 10107 10019 9932 9936 9939 9943 9947 9996 10045 9930 9609 9400 9673 10126 10098 9858 9963 9935 9906 9864 9616 9450 9627 9919 10004 9917 9831
2453 9831 9875 9920 10094 10062 9857 9859 9861 9656 9735 10020 9983 9739 9749 9759 9721 10028 10162 10090 10155 10220 10081 9942 10044 10146 10184 10223 10020 9817 10000
2439 10000 10182 10352 10521 10366 10004 9724 9788 9992 9990 10022 10053 9919 9785 9823 9861 9979 10097 10042 9988 9976 9964 9952 9940 10079 10217 10115 10013
2425 10013 9985 9957 10067 9971 9878 10130 10189 10041 9968 9896 9948 9794 9763 10076 10078 10081 10092 10103 10011 9919 10154 10388 10361 10333 10201 9725 9636 9753 9860
2411 9860 9967 10065 10163 10358 10208 10101 9995 9813 9975 10056 9792 9657 9866 9963 10060 9876 9691 9885 10079 10086 10092 10099 10106 10190 10274 10048 9822 9837
2397 9837 9852 9866 9881 9833 9785 9841 9896 9824 9751 9920 10088 10142 10197 10251 10305 10171 10037 9938 10183 10311 10233 10121 10008 9982 9956 9951 9946 9917 10233 10467
2382 10467 10219 9798 9583 9670 9757 9817 9878 9939 10000 9881 9763 9644 9525 9712 9899 9914 9929 9917 9905 10202 10500 10331 10162 10096 10030 10063 10097
2368 10097 10131 10164 10097 10029 10134 10238 10297 10356 10243 10130 9918 9706 9803 9901 9985 10070 10051 10033 10050 10068 10086 10104 9974 9844 9886 9928 9990 10051 10009 9967
2353 9967 9950 9932 10005 10078 10208 10133 9967 10145 10356 10360 10261 10163 10036 9909 9886 9862 9906 9950 9891 9831 9961 10091 9980 9870 9748 9626 9745 9865
2339 9865 9745 9626 9532 9782 9952 9778 9819 9859 9855 9850 9743 9635 9532 9429 9705 9981 10093 10205 10077 9948 10156 10363 10123 9883 9897 9911
2326 9911 9821 9732 9617 9501 9365 9572 9754 9935 9966 9998 9940 9882 9997 10318 10393 10125 10037 10156 10209 10056 9929 9802 10069 10336 10086 9836
2313 9836 9780 9723 9666 9610 9594 9578 9735 9891 10004 10117 10057 9998 10021 10043 9893 9744 9627 9510 9496 9482 9470 9458 9447 9435 9477 9518 9732 9945 10170
2298 10170 10394 10309 10223 10106 9989 10045 10100 9981 9861 9846 9830 9888 9945 10003 10061 10007 9953 9899 9845 10088 10331 10196 10061 10096 10130 10268 10406 10360
2284 10360 10314 10096 9878 9938 9997 10056 10116 10214 10312 10306 10301 10248 10196 10143 10090 10202 10314 10254 10194 9867 9540 9660 9781 9849 9918 9986 10055 9906 9757 9849
2269 9849 9941 10118 10296 10232 10168 10040 9911 9955 9999 9989 9979 9866 9752 9813 9874 9935 9996 9944 9891 10010 10129 9992 9855 9890 9925 9863 9800 9979 10157
2255 10157 10086 10015 10047 10079 10048 10017 10157 10298 9905 9513 9636 9760 9914 10067 10118 10168 10146 10123 10101 10078 10048 10018 9987 9957 10166 10375 10205 10035
2241 10035 10016 9997 9978 9959 9983 10008 10032 10056 10026 9997 10070 10144 10116 10089 9958 9828 9898 9969 9937 9904 9874 9843 9813 9782 9785 9787 9962 10136 10188 10240 10189 10137 10206
2224 10206 10274 10239 10204 10148 10091 10138 10185 10307 10430 10312 10193 10254 10314 10374 10434 10433 10432 10328 10223 10141 10058 9975 9892 9949 10006 10166 10327 10345 10363 10149
2209 10149 10348 10424 10499 10360 10220 10070 9920 9941 9963 10024 10084 10041 9999 10115 10231 10176 10120 9956 9792 9938 10084 10105 10126 10147 10168 10193 10218 10244
2195 10244 10269 10180 10092 10003 9914 9928 9942 10196 10451 10452 10453 10454 10454 10446 10437 10325 10213 10238 10264 10044 10237 10484 10525 10329 10133 10007 9882 9942 10002 9913 10031
2179 10031 9930 9828 9989 10150 10311 10472 10445 10418 10391 10364 10539 10714 10648 10583 10346 10109 10135 10367 10401 10436 10379 10323 10279 10235 10234 10439 10505 10364
2165 10364 10352 10340 10240 10140 10281 10215 9829 9787 10171 10349 10257 10165 10163 10161 10171 10180 10189 10198 10046 9893 9913 9933 10080 10227 10180 9927 10178 10429 10414 10398
2150 10398 10273 9941 9919 10104 10151 10198 10387 10369 10222 10282 10213 10144 9906 9669 9556 9650 9569 9489 9787 10085 10273 10255 10194 10133 10086 10247 10407
2137 10407 10361 10219 10077 10232 10180 9987 10137 10439 10533 10435 10337 10110 10090 9977 9864 10018 10172 9995 10025 10296 10360 10433 10506 10407 10307 10098
2124 10098 10096 10218 10341 10297 10254 10211 10167 10181 10194 10380 10565 10476 10386 10425 10258 10165 10278 10491 10703 10625 10341 10276 10210 10382 10554 10416 10485 10549
2110 10549 10269 10080 10096 10164 10231 10441 10444 10294 10351 10395 10232 10390 10548 10391 10029 9746 9944 10225 10161 10083 10006 10010 10014 9867 9721 9815 9909 10052
2096 10052 10194 10280 10160 10246 10333 10432 10325 10151 10184 10260 10336 10172 10007 10104 10202 10093 10329 10323 9973 9785 9597 9580 9771 9955 10139 10336 10534
2082 10534 10477 10420 10467 10514 10417 10320 10223 10126 10036 9945 10096 10246 10171 10096 10125 10153 10067 9982 10128 10069 9958 10055 10022 9989 10013 10036 10059 10082 10180 10278 10273 10268 10282
2065 10282 10296 10353 10616 10832 10840 10737 10634 10559 10484 10409 10333 10166 9999 9935 9871 9936 10002 10067 10132 10169 10205 10345 10485 10444 10403 10607 10605 10310 10427
2051 10427 10416 10198 10230 10262 10280 10299 10373 10447 10210 9974 10175 10375 10335 10295 10234 10173 10203 10232 10389 10339 10056 10187 10284 10175 10207 10240 10352 10465
2037 10465 10474 10483 10509 10536 10391 10245 10214 10183 10324 10464 10438 10411 10384 10358 10452 10546 10398 10251 10166 10080 9994 9908 10059 10210 10189 10167 10217 10266 10315 10364 10293
2021 10293 10221 10391 10561 10436 10311 10187 10062 10177 10291 10392 10493 10590 10480 10228 10389 10687 10573 10476 10379 10216 10053 10132 10210 10230 10250
2009 10250 10270 10290 10331 10371 10515 10659 10674 10689 10703 10718 10590 10462 10316 10584 10883 10770 10605 10441 10437 10434 10327 10221 10101 9982 9862 9743 9904
1995 9904 10065 10226 10387 10383 10379 10374 10370 10083 9796 9759 9928 10248 10362 10294 10227 10156 10084 10025 9967 9985 10211 10320 10429 10176 9924 10050 10176 10220 10264
1981 10264 10322 10379 10207 10243 10321 10399 10574 10542 10193 10187 10278 10369 10378 10387 10414 10440 10466 10493 10468 10443 10419 10394 10350 10306 10262 10218 10393 10567 10432 10297 10336 10375
1965 10375 10401 10427 10537 10441 10344 10454 10573 10692 10458 10223 10105 10193 10337 10481 10308 10136 10076 10222 10400 10371 10484 10597 10390 10389 10492 10388
1952 10388 10501 10614 10473 10332 10249 10166 10186 10207 10284 10361 10426 10490 10557 10417 10015 9957 10195 10227 10039 10058 10227 10397 10454 10305 10192 10079 9941
1938 9941 10008 10059 10109 10276 10443 10430 10417 10494 10572 10658 10537 10430 10322 10279 10236 10284 10331 10548 10559 10320 10426 10467 10509 10572 10636 10699 10762 10825 10889 10622
1923 10622 10356 10262 10167 10131 10095 10059 10022 10090 10158 10226 10294 10504 10714 10614 10514 10510 10505 10397 10289 10272 10254 10409 10563 10633 10703 10670 10637 10535 10433
1908 10433 10435 10436 10431 10425 10524 10622 10627 10633 10638 10644 10578 10513 10825 10794 10789 10990 10881 10772 10826 10880 10934 10987 10946 10905 10968 11030 10945 10860 10775 10689 10507 10325 10247 10375 10545
1891 10545 10372 10186 10206 10104 10001 10015 10029 10025 10021 10017 10013 10368 10723 10700 10677 10503 10329 10465 10601 10403 10206 10249 10292 10284 10277 10269 10261 10307 10353 10571 10789
1875 10789 10765 10741 10957 11174 10978 10782 10677 10571 10675 10573 10290 10352 10422 10492 10467 10442 10510 10371 10246 10464 10605 10539 10487 10228 10138 10047 10061
1862 10061 10074 10104 10341 10603 10453 10287 10327 10534 10742 10776 10809 10843 10876 10742 10607 10369 10131 10113 10094 10076 10057 10076 10094 9971 10261 10434 10401
1848 10401 10510 10619 10465 10311 10415 10932 11154 10963 10790 10616 10490 10365 10480 10595 10603 10610 10721 10832 10636 10440 10498 10555 10507 10666 10941
1836 10941 10803 10560 10316 10219 10122 10173 10224 10516 10808 10842 10875 10654 10433 10559 10478 10281 10497 10721 10946 10912 10465 10356 10248 10177 10520 10572
1823 10572 10416 10644 10872 10891 10910 10929 10948 10720 10492 10367 10242 10179 10116 10157 10198 10385 10573 10589 10604 10489 10373 10284 10194 10242 10703 10992 10867
1809 10867 10681 10494 10359 10637 10744 10850 10810 10769 10656 10543 10533 10523 10544 10565 10414 10263 10323 10383 10443 10503 10389 10275 10505 10735 10701 10666 10735
1795 10735 10804 10859 10915 10765 10614 10543 10472 10427 10382 10260 10551 10610 10669 10728 10787 10613 10440 10723 10594 10490 10386 10482 10578 10467 10357 10431 10505 10682
1781 10682 10859 10971 11084 10852 10621 10640 10660 10576 10493 10579 10665 10751 10838 10727 10617 10575 10121 9925 10417 10392 10368 10423 10479 10637 10796 10658 10519
1768 10519 10588 10656 10563 10470 10584 10698 10549 10400 10252 10103 10089 10074 10379 10683 10862 10628 10309 9989 9736 9896 10262 10216 10199 10183 10244 10305
1755 10305 10390 10475 10456 10437 10539 10641 10537 10432 10519 10607 10668 10729 10907 10672 10436 10614 10569 10524 10505 10485 10522 10559 10595 10632 10460 10288 10322 10356 10352
1740 10352 10347 10240 10132 10228 10323 10341 10359 10345 10744 10808 10871 10622 10373 10331 10288 10218 10147 10189 10643 10859 11075 11204 10921 10900 10879 10729 10579 10444
1726 10444 10309 10277 10245 10304 10362 10162 10376 10563 10338 10370 10403 10399 10395 10597 10800 10847 10894 10824 10755 10838 10715 10450 10598 10861 10711 10703 10902 10881 10860
1712 10860 10852 10844 10761 10678 10596 10513 10404 10296 10394 10492 10420 10348 10482 10617 10622 10628 10633 10639 10520 10401 10283 10164 10267 10370 10576 10783 10736 10690 10850 11010
1697 11010 11023 11037 10947 10858 10817 10776 10735 10693 10764 10835 10906 10976 10843 10709 10679 10648 10805 10962 10912 10862 10859 10856 10852 10849 10652 10455 10603 10750 10873 10997 10914
1681 10914 10831 10843 10855 10867 10878 10846 10814 10782 10750 10847 10944 10697 10450 10403 10356 10515 10674 10935 11195 11249 11303 11235 11167 10996 10824 10881 10938 10994 11051 10865
1666 10865 10678 10802 10925 10969 11012 11056 11100 10993 10887 10780 10674 10748 10822 10793 10764 10815 10867 10815 10764 10708 10652 10768 10884 10760 10637 10755 10872
1652 10872 10799 10725 10505 10285 10185 10497 10810 10710 10733 10755 10855 10955 10803 10652 10672 10693 10612 10532 10451 10371 10508 10645 10610 10576 10599 10622 10817
1639 10817 11013 10838 10663 10729 10795 10636 10476 10419 10363 10459 10556 10653 10750 10864 10977 11091 11205 11024 10843 10834 10825 10762 10699 10834 10969 10700 10845
1625 10845 11161 11064 10918 10772 10703 10634 10596 10557 10519 10480 10629 10778 10927 11075 11016 10957 10899 10840 10626 10412 10439 10466 10518 10569 10697 10826 10969 10700
1611 10700 10663 10626 10661 10696 10834 10972 11065 11158 11010 10862 10885 10907 11032 11158 11066 10975 10883 10791 10954 11118 11040 10962 10811 10661 10682 10703 10740 10776 10675
1597 10675 10780 10829 10534 10330 10332 10390 10448 10635 10822 10837 11058 11129 10856 10720 10791 10724 10657 10708 10759 10707 10655 10805 10956 10865 10774 10894 11015 10687
1583 10687 10360 10423 10486 10231 10320 10824 10984 10843 10701 10700 10699 10697 10696 10727 10758 10892 11026 10810 10595 10552 10509 10663 10818 10801 10783 10751 10718 10583 10447
1568 10447 10447 10446 10446 10446 10635 10825 10911 10997 10801 10606 10651 10696 10833 10969 11209 11105 10953 11008 11098 11187 10969 10752 10706 10660 10817 10973 10958 10942 10957
1553 10957 10973 10884 10796 10898 10999 10859 10719 10711 10704 10799 10895 10844 10793 10983 11174 11274 11374 11234 11093 11092 11092 11091 11090 11156 11223 11117 11011 10770 10528 10597
1538 10597 10665 10792 10920 10944 10968 11027 11086 10972 10859 10957 11054 10842 10630 10838 11045 11011 10978 10930 10883 10835 10788 10736 10684 10632 10580 10603 10626 10820 11015
1524 11015 10880 10746 10852 10959 10947 10936 10752 10569 10601 10632 10561 10489 10596 10703 10707 10711 10877 11042 10988 10934 10792 10994 11210 11081 10956 11038 10983
1510 10983 10927 10848 10770 10795 10820 10927 11033 11140 11247 11018 10789 10870 10951 11253 11556 11617 11472 11204 11280 11369 11251 11289 11326 11247 11168 11252 11335 11247
1496 11247 11158 11231 11304 11136 11174 11264 11009 10845 10887 10813 10739 10781 10824 10807 10790 10773 10756 10896 11036 11073 11110 11226 11342 11011 10679 10895 11110 11153
1482 11153 11196 11002 10808 10856 10903 10972 11041 10938 10834 10879 10924 10727 10531 10761 10991 11048 11106 10978 10851 10965 11078 11052 11026 10918 10810 10757 11048
1469 11048 11340 11287 11290 11293 10965 10637 10684 10730 10777 10824 10810 10797 10783 10770 10883 10997 10870 10743 11057 11370 11306 11241 11087 10934 10883 10833 10794 10754 10715
1454 10715 10675 10705 10735 10730 10932 11032 10789 10752 10715 10681 10647 10614 10580 10639 10697 10928 11159 11152 11145 11138 11131 11298 11465 11323 11180 11239 11297 11184 11070 11096 11123
1439 11123 11149 11175 11110 11045 11152 11259 11286 11314 11238 11162 11011 10859 10880 10901 10952 11003 10951 10899 10976 11053 10958 10863 10813 10763 10885 11007 10977 10946 10916 10885 10623
1423 10623 10360 10682 11004 11023 11042 11061 11080 11136 11191 11143 11096 11121 11145 11067 10989 11054 11120 11186 11252 11152 11053 11250 11104 10916 10729 10760 10792 10889 10986 10842
1408 10842 10698 10767 10836 10699 10905 11118 11123 11095 11066 11128 11189 11148 11106 11045 10985 10924 10863 10800 10737 10777 11024 11473 11578 11442 11306 11033 10759 10727 10694
1393 10694 10634 10574 10686 10798 10873 10949 11024 11100 10972 10845 10821 11141 11198 11049 11038 11026 11124 11222 11148 11073 10993 10912 11072 11232 11370 11507 11335 11163
1379 11163 11242 11321 11504 11687 11560 11432 11305 11178 11105 11032 11130 11229 11415 11601 11614 11628 11358 11088 10921 10754 10894 11033 11070 11106 11203 11299 11155
1366 11155 11011 11220 11429 11329 11228 11229 11229 11333 11437 11400 11362 11324 11287 11281 11276 11271 11266 11279 11293 11285 11278 11399 11176 10953 11075 11154 11232 11333 11433 11548 11664
1350 11664 11538 11413 11375 11338 11171 11211 11231 11045 10963 11086 11325 11357 11345 11334 11121 10907 10866 10825 10909 10993 10986 10980 10939 11105 11270 11230 11172 11115 11057 11000
1335 11000 10940 11087 11131 11174 11122 11276 11418 11215 11002 10995 10945 11239 11517 11451 11509 11568 11347 11332 11305 11277 11291 11304 11351 11192 10821 10793 11006 11219
1321 11219 11205 11190 11175 11160 11109 11057 11122 10981 11041 11102 11150 11198 11255 11311 11325 11132 10928 10932 10991 11050 10869 10893 11099 11304 11444 11377 11267 11157 11071 11191
1306 11191 11174 11156 11235 10970 10954 11145 11295 11444 11435 11426 11307 11189 11242 11296 11358 11420 11379 11337 11275 11212 11253 11293 11282 11271 11157 11043 10981 10919 10960 11002 11075
1290 11075 11149 11326 11503 11410 11318 11238 11159 11124 11296 11249 11202 11375 11549 11357 11165 11138 11318 11511 11498 11331 11371 11570 11562 11468 11375 11268 11162 11079
1276 11079 10995 11084 11173 11185 11196 11208 11219 11274 11328 11409 11283 11272 11469 11283 11096 11143 10984 10648 10794 11347 11555 11471 11387 11315 11244 11276 11308 11327 11346
1262 11346 11353 11359 11430 11294 11274 11255 11177 11099 11331 11563 11465 11367 11269 11171 11243 11314 11214 11114 11282 11449 11630 11604 11419 11234 10916 11080 11221 11019
1248 11019 10950 10882 10890 11105 11204 11303 11321 11339 11473 11401 11374 11347 11191 11241 11166 11092 11202 11313 11241 11168 11212 11256 11157 11265 11497 11730 11760 11791 11718 11301
1233 11301 11076 11058 11061 11065 11356 11442 11346 11251 11162 11280 11502 11517 11323 11130 11108 11086 11085 11291 11496 11495 11485 11475 11453 11430 11221 11012 11043 11075 11049 11022 11099
1217 11099 11176 11432 11688 11772 11856 11690 11525 11359 11194 11216 11239 11262 11285 11239 11193 11250 11308 11342 11376 11238 11100 11244 11388 11531 11675 11884 12092
1204 12092 11991 11889 11764 11639 11514 11389 11398 11407 11429 11451 11354 11464 11651 11495 11354 11213 11361 11509 11439 11369 11300 11230 11189 11148 11107 11066 11207 11349
1190 11349 11491 11632 11639 11646 11412 11178 11198 11217 11134 11050 11086 11121 11157 11192 11163 11134 11208 11282 11375 11468 11561 11654 11775 11897 11914 11932 11841 11750 11486 11223 11282
1174 11282 11342 11504 11667 11734 11802 11698 11593 11463 11333 11374 11416 11522 11629 11632 11635 11748 11861 11732 11604 11552 11499 11446 11393 11478 11563 11544 11526 11541 11556
1159 11556 11571 11586 11611 11637 11490 11344 11521 11698 11565 11433 11571 11709 11667 11418 11279 11347 11402 11457 11434 11618 11630 11435 11244 11053 11159 11265
1146 11265 11254 11244 11324 11404 11646 11682 11524 11366 11501 11636 11543 11449 11451 11658 11694 11523 11491 11460 11610 11759 11582 11750 11917 11740 11757 11773 11768 11764 11660
1132 11660 11556 11478 11194 11176 11365 11252 11140 11249 11358 11596 11628 11483 11545 11478 11411 11564 11718 11678 11432 11192 10952 10961 11177 11261 11345 11454
1119 11454 11358 11370 11383 11383 11383 11439 11494 11641 11787 11711 11429 11375 11528 11681 11627 11530 11433 11581 11729 11865 12000 12097 11987 11878 11975 11779 11583 11641
1105 11641 11700 11615 11530 11686 11842 11830 11818 11634 11451 11394 11338 11605 11871 11729 11793 11871 11741 11667 11799 11996 11848 11688 11527 11332 11344 11385 11425
1091 11425 11582 11739 11573 11407 11413 11419 11410 11401 11220 11039 10987 10935 11262 11588 11650 11712 11533 11355 11406 11457 11508 11560 11523 11486 11621 11756 11762 11768 11775 11781 11752 11724
1075 11724 11868 12011 11912 11813 11817 11821 11719 11618 11619 11621 11590 11560 11529 11499 11588 11676 11455 11578 11686 11587 11523 11459 11408 11358 11410 11463 11457 11452 11446 11441 11406 11371 11439 11508
1058 11508 11746 11984 11913 11841 11903 11964 11922 11880 11897 11913 11929 11945 11994 12043 11988 11934 11808 11683 11557 11432 11369 11305 11242 11179 11204 11229 11358 11486 11578 11669
1043 11669 11760 11852 11698 11545 11679 11814 11959 11760 11548 11680 11793 11700 11744 11788 11737 11686 11635 11584 11602 11620 11719 11819 12075 11988 11578 11512 11639
1029 11639 11560 11632 11703 11605 11713 11898 11739 11563 11387 11293 11199 11568 11937 11997 12057 12013 11969 11926 11882 11848 11815 11781 11748 11536 11324 11353 11382 11564 11747
1015 11747 11930 12113 12065 12018 11798 11579 11866 12153 12062 11971 11992 12012 11930 11847 11918 11989 11750 11511 11751 11992 12061 12129 12072 12015 11957 11900 11839 11777 11715
1000 11715 11654 11736 11818 12003 12188 11890 11591 11533 11475 11475 11475 11646 11818 11753 11688 11727 11765 11695 11625 11795 11966 11803 11641 11603 11565 11426 11632 11837
986 11837 11699 11476 11254 11389 11523 11726 11928 11902 11877 11658 11645 11895 11800 11678 11763 11607 11451 11678 11904 11959 12014 12064 12115 11994 11873 11795
973 11795 11717 11742 11767 11638 11510 11622 11735 11710 11684 11831 11978 12037 12097 12052 12008 11881 11753 11728 11703 11788 11872 11956 12041 11968 11895 11651 11406 11373 11340
959 11340 11411 11481 11564 11647 11490 11332 11498 11663 11656 11649 11574 11498 11465 11639 11806 11766 11751 11737 11763 11790 11817 11843 11950 12058 11924 11791 11728 11666 11719 11773
944 11773 11764 11963 12071 11972 11901 12037 12044 12051 12072 12093 12011 11928 11749 11570 11563 11763 11863 11618 11683 11748 11667 11586 11664 11742 11802 11655 11667 11886 12028 11963 11726
928 11726 11695 11946 11990 11991 11992 11978 11965 11951 11937 11985 12033 12025 11811 11659 11507 11386 11470 11772 11868 11860 12059 12189 12112 11855 11598 11717 11836 11726 11617
914 11617 11635 11859 11937 12015 12391 12285 12024 11970 11972 11973 11859 11951 12171 12185 12156 12127 12261 12396 12406 12209 12211 12213 12189 12166 12417 12463 12452 12441 12344 12247 12150
898 12150 12053 12190 12328 12224 12121 11982 11843 11944 12046 11817 11588 11406 11568 11686 11803 11839 11875 11866 11857 11951 12045 12003 11960 11918 11875 11992 12109
884 12109 12225 12342 12283 12224 12255 12286 12212 11932 11746 11904 11975 12046 11966 11887 11764 11642 11760 11879 11773 11668 11735 11801 11903 12004 12002 12000 11935 11871 12047
870 12047 12224 12174 12125 12179 12232 12282 12332 12382 12431 12120 11808 11737 11667 11848 12029 12210 12391 12118 11845 11882 11918 11701 11484 11646 11808 11875 11942 11974
856 11974 11800 11782 12107 12170 12027 12000 11973 12105 12237 12318 12399 12307 12216 12254 12292 12089 11886 12000 12114 11918 11722 11797 11872 12188 12503 12302 12100
842 12100 12139 12179 12067 11956 12017 12078 12124 12170 12031 11893 11980 11860 11814 12112 12213 11971 11943 11915 11877 11838 11800 11761 11898 12035 12172 12309 12299 12290 12281
828 12281 12271 12269 12267 12059 12195 12255 12109 11972 12041 12286 12324 12191 12264 12231 11992 11925 12065 12248 12226 12031 12043 12291 12333 12125 11917 11935 11954 11800
814 11800 11646 11823 12000 12006 12011 11810 11609 11648 11688 11831 11974 12117 12260 12274 12287 12301 12314 12336 12358 12277 12196 12109 12023 12109 12194 12177 12159 12141 12124 12225
799 12225 12326 12428 12529 12408 12288 12168 12047 12183 12319 12352 12385 12323 12261 12199 12137 12147 12157 12064 11971 12037 12103 12169 12235 12192 12150 12211 12272 12146 12020
784 12020 12066 12113 12142 12171 12097 12024 12008 11992 11976 11960 12088 12216 12378 12196 12201 12412 12314 12216 12225 12234 12141 12047 12047 12048 11959 11869 11963 12264 12522 12367 12183 12207
768 12207 12329 12451 12535 12619 12704 12788 12672 12556 12479 12195 12184 12586 12687 12582 12610 12637 12412 12186 12292 12398 12195 11992 12229 12467 12464 12460 12434
754 12434 12407 12380 12353 12449 12544 12468 12392 12284 12177 12336 12495 12308 12534 12656 12366 12382 12398 12388 12379 12259 12140 12193 12245 12355 12465 12458 12452 12394 12129
740 12129 11976 12237 12364 12284 12222 11953 11966 11979 11979 11979 12186 12392 12358 12324 12451 12578 12601 12625 12575 12525 12371 12218 12176 12134 12093 12051 12173 12295 12417
725 12417 12539 12575 12610 12543 12475 12500 12525 12308 12092 12299 12507 12542 12577 12512 12448 12383 12318 12275 12232 12189 12145 12270 12394 12347 12299 12250 12200 12047 11894 11988
710 11988 12081 12278 12474 12535 12596 12554 12512 12570 12628 12685 12743 12459 12174 12200 12225 12405 12584 12522 12461 12498 12535 12413 12292 12177 12268 12385 12090 11981
696 11981 12079 12035 11991 12101 12211 12079 11948 11974 12000 12129 12258 12375 12492 12368 12245 12308 12371 12189 12420 12637 12648 12564 12273 12064 12268 12584
683 12584 12694 12657 12621 12571 12521 12483 12444 12508 12573 12546 12519 12664 12809 12694 12579 12567 12555 12622 12689 12755 12822 12794 12766 12738 12710 12728 12745 12659 12573 12586 12599 12612
667 12612 12625 12604 12584 12804 13024 13088 13151 13042 12933 12752 12571 12563 12554 12498 12441 12489 12536 12542 12548 12657 12766 12869 12972 12765 12558 12590 12621 12652 12684 12696
652 12696 12708 12720 12731 12722 12712 12703 12693 12559 12425 12600 12776 12550 12325 12479 12632 12624 12616 12608 12600 12510 12420 12455 12489 12326 12507 12611 12508 12598 12689 12595 12500
636 12500 12752 13004 13015 13026 13129 13231 12946 12455 12310 12372 12407 12443 12478 12514 12549 12584 12675 12766 12845 12923 13072 13014 12887 12760 12758 12550 12423 12641
622 12641 12653 12459 12416 12373 12542 12918 12868 12819 12721 12623 12710 12797 12695 12799 12877 12956 13084 13005 12741 12684 12875 12859 12812 12766 12729 12898 12939 12979 12850
608 12850 12514 12603 13037 12919 12593 12784 12975 12910 12845 12780 12715 12849 12982 12806 12630 12782 12935 12778 12415 12361 12651 12839 12682 12589 12703
595 12703 12783 12863 12892 12920 12846 12772 12820 12868 12813 12758 12719 12681 12759 12630 12607 12583 12732 12881 12621 12567 12754 12735 12752 12770 12658 12752 12543 12333 12446 12559
580 12559 12605 12652 12595 12538 12636 12734 12672 12611 12530 12656 12653 12650 12685 12513 12445 12583 12657 12730 12804 12878 12876 12669 12542 12761 13004 13042 12976 12910 12758 12606 12467
565 12467 12328 12335 12549 12737 12925 12957 12783 12738 12693 12500 12513 12698 12883 13112 12997 12835 12673 12814 12955 12993 13030 13023 13016 13233 13105 12717 12811
551 12811 12940 12724 12473 12703 12998 13087 13029 12972 12914 12856 12752 12854 12827 12800 12891 12776 12790 12804 12591 12585 12690 12795 12913 12825 12694 12563 12654 12952
537 12952 13250 13341 13250 13158 13054 12949 12860 12771 12681 12592 12769 12947 12746 12544 12599 12653 12879 13106 13057 13008 13131 13254 13147 13040 13243 13446 13332
524 13332 13219 13234 13043 12756 12675 12706 12943 13258 13228 13095 12963 12953 12944 12934 12925 12962 13000 13038 13076 12953 12830 12810 12790 12730 12669 12712 12755 12830 12904 12807 12710
508 12710 12736 12761 12787 12812 12787 12762 12634 12506 12612 12718 12928 13137 12988 12839 12862 12885 12962 13038 13115 13192 12851 12510 12548 12585 12707 12829 12709 12590
494 12590 12609 12629 12752 12874 13021 13167 13141 13115 13207 13298 13390 13481 13463 13445 13392 13133 12858 12927 12905 12884 12723 12768 13282 13452 13267 13289 13289 13083 12933
479 12933 12782 13067 13351 13342 13333 13324 13315 13113 12910 12948 12987 12985 12984 12982 12980 12974 12968 12962 12957 13076 13195 13418 13640 13502 13363 13121 12879 12985 13090 13175 13259 13589
463 13589 13574 13465 13562 13444 13326 13221 13116 13013 12910 13048 13186 13306 13427 13443 13460 13488 13515 13440 13364 13352 13339 13327 13315 13369 13424 13375 13326 13228 13130
449 13130 13272 13415 13409 13403 13501 13598 13545 13492 13439 13386 13352 13318 13388 13457 13567 13678 13547 13416 13442 13468 13494 13520 13371 13222 13314 13406 13396 13387 13550 13712 13566
433 13566 13420 13447 13473 13436 13400 13536 13672 13641 13610 13579 13548 13356 13164 13419 13674 13720 13766 13709 13652 13717 13783 13848 13914 13988 14062 13895 13728 13658 13588 13690
418 13690 13792 13692 13592 13595 13598 13663 13729 13794 13859 13579 13298 13395 13493 13543 13594 13747 13901 13841 13781 13721 13661 13755 13850 13945 14040 14108 14177 14143 14109 13954 13799
403 13799 13748 13696 13687 13677 13667 13658 13590 13522 13764 14006 14033 14060 13915 13770 13792 13815 13838 13860 13821 13782 13743 13703 14004 14305 14227 14149 14118 14087 14160 14233 14249 14266
386 14266 14111 13955 13733 13511 13529 13548 13581 13615 13820 14026 14006 13985 13965 13945 13920 13896 13871 13847 13959 14071 13943 13814 13911 14009 13934 13859 14031 14202
372 14202 14270 14339 14323 14307 14188 14069 14163 14257 14350 14444 14307 14170 14412 14654 14875 15095 15144 15192 14995 14799 14705 14611 14564 14516 14803 15091 15095 15512
358 15512 15687 15450 15320 15189 14903 15031 15395 15759 15633 15506 15479 15451 15321 15190 15339 15488 15714 15940 16229 16105 15972 15839 15955 16072
346 16072 16085 16099 16293 16487 16509 16531 16581 16631 16681 16731 16929 17127 17154 17180 17316 17452 17829 18206 18326 18446 18463 18481 18556 18631 18947 19263 19364 19465
332 19465 19566 19667 19931 20196 20460 20725 20985 21245 21402 21559 21918 22277 22636 22995 23546 24097 24476 24855 25305 25755 26205 26655 27039
321 27039 27424 27809 28193 28692 29190 29689 30187 30613 31038 31360 31683 31942 32202 32449 32696 32767 32632 32406 32524 32662 32593 32593 32387 31982
309 31982 31371 30875 30380 29857 29540 29473 29062 28365 27669 27054 26440 26064 25688 25140 24592 24248 23905 23561 23218 22829 22440 21948 21456
297 21456 21307 21157 20905 20653 20424 20195 19863 19531 19250 18970 18689 18409 18339 18270 18200 18130 18004 17877 17648 17418 17238 17057 17118 17179 17130
285 17130 17081 17135 17189 16948 16708 16639 16571 16415 16259 16104 15948 15824 15701 15680 15660 15718 15776 15731 15686 15411 15136 15171 15205 15189 15173 15157 15141 15067 14993
270 14993 15023 15052 15200 15349 15188 15027 14982 14937 15030 14916 14753 14935 15027 14912 14876 14841 14792 14744 14804 14865 14823 14780 14807 14833 14687 14542 14636 14730 14824
255 14824 14918 14791 14663 14639 14615 14638 14661 14580 14499 14337 14175 14322 14263 14153 14387 14633 14674 14630 14587 14530 14474 14354 14234 14217 14201 14384 14567 14510
241 14510 14452 14258 14064 14043 14021 14094 14166 14080 13994 14078 14369 14450 14186 14019 14196 14274 14146 14266 14386 14115 13843 13856 13868 13881 13894 14190 14487 14404
227 14404 14322 14187 14051 14087 14123 14228 14334 14336 14338 14495 14652 14636 14415 14120 14169 14322 14474 14468 14461 14351 14241 14156 14071 14227 14383 14332 14282 14196 14318
213 14318 14314 13967 13800 13840 14077 14108 13890 14016 14160 14098 14117 13930 13900 13871 13828 13785 13666 13547 13599 13652 13748 13844 13940 14036 14031 14025 14192 14358 14377 14395
198 14395 14103 13812 13738 13663 13692 13721 13929 14136 14322 14508 14721 14590 14480 14371 14151 13932 13954 13975 13925 13874 13996 14118 14024 13931 14078 14225
185 14225 14309 14392 14097 13802 13963 14124 14181 14239 14046 13853 13763 13673 13678 13683 13791 13899 13866 13832 13971 14315 14576 14493 14376 14258 14314 14369 14425 14480 14413
170 14413 14346 14383 14419 14459 14499 14436 14372 14404 14435 14295 14154 14070 13985 14073 14161 14178 14195 14212 14229 14155 14081 14179 14277 14255 14233 14211 14189 14466 14743 14642 14541
155 14541 14321 14102 13986 13869 14142 14414 14307 14201 14280 14358 14196 14034 14135 14236 14234 14232 14063 13893 14033 14173 14125 14078 14134 14190 14192 14194 14024 13854
141 13854 13962 14070 14179 14287 14031 13776 13761 14091 14205 14113 13986 13860 13838 13817 13934 13844 13675 13852 13924 13997 14152 14307 14358 14409 14377 14344 14325
127 14325 14305 14305 14511 14795 14734 14662 14589 14496 14402 14349 14296 14243 14190 14088 13987 14126 14265 14428 14591 14590 14246 14117 14333 14359 14179 14205 14438 14555
113 14555 14465 14323 14182 14199 14216 14514 14811 14867 14923 14626 14330 14274 14218 14311 14403 14496 14589 14479 14369 14500 14631 14633 14635 14396 14157 14179 14202 14225 14248
98 14248 14256 14264 14271 14279 14287 14296 14304 14312 14436 14561 14513 14465 14510 14556 14498 14440 14556 14672 14789 14905 14647 14388 14233 14285 14323 14018 14022 14370 14534 14492 14588 14683 14639
82 14639 14595 14654 14713 14744 14775 14621 14467 14582 14491 14542 14936 14942 14603 14363 14330 14251 14173 14107 14041 14183 14324 14466 14607 14533 14460 14489 14519 14446 14374 14404
67 14404 14435 14446 14458 14456 14454 14527 14394 14217 14040 14074 14315 14452 14383 14321 14260 14198 14136 14236 14542 14702 14862 15024 14703 14538 14579 14575 14571 14476 14382 14421 14460
51 14460 14628 14589 14454 14525 14583 14642 14624 14812 14988 14820 14537 14462 14558 14654 14776 14898 15020 15142 14827 14513 14370 14227 14281 14335 14560 14786 14788
38 14788 14790 14844 14553 14193 14314 14582 14643 14470 14503 14717 14931 14824 14718 14612 14505 14588 14671 14638 14811 14946 15081 15242 15196 15179 15161 14842 14730
24 14730 14790 14851 14950 14843 14633 14629 14806 14982 14698 14414 14371 14535 14812 14745 14644 14543 14605 14668 14731 14794 14554 14313 14520 14727 14661 14595 14645 14695
10 14695 14439 14390 14522 14653 14766 14672 14405 14346 14596 14845 14730 14614 14827 15040 14943 14846 14670 14493 14558 14622 14647 14671 14709 14746 14671 14803 15026
-4 15026 14904 14728 14759 14825 14890 14886 14883 14880 14876 14887 14898 14737 14576 14608 14641 14777 14913 14834 14755 14676 14597 14736 14874 14703 14532 14800 15069 15096 15123 15142 15161
-19 15161 14960 14760 14417 14419 14743 15067 15091 15114 14965 14816 14808 14801 14896 14992 14989 14986 15223 15461 15518 15575 15391 15207 15075 14943 15189 15435 15330 15225
-33 15225 15038 14850 14663 14820 15218 15272 15145 15019 15042 15066 14916 14765 14993 15221 15163 15104 15046 14987 14980 14973 15048 15123 15200 14933 14743 14760 14789 14819 14724
-48 14724 14835 15238 15296 15182 15068 15191 15314 15265 15215 15220 15225 15230 15235 15139 15043 15051 15058 15184 15310 15312 15313 15317 14977 14731 14967 15075 15184 15323 15461 15398 15334
-63 15334 15374 15414 15379 15343 15308 15273 15429 15586 15295 15003 14740 14477 14524 14570 14580 14590 14704 14817 14870 14922 14975 15028 14986 14944 14902 14860 15018 15176 15092
-78 15092 15009 14932 14855 15088 15321 15077 14832 14897 14962 14855 14748 14745 14741 14927 15113 15127 15141 15119 15096 15095 15094 14909 15067 15367 15461 15532 15258 14803 14968
-92 14968 15141 15108 15230 15352 15160 14968 14948 14928 14786 14645 14813 14981 15038 15094 15151 15207 15191 15174 15157 15141 15152 15163 15174 15186 15227 15267 15067 14661 14786
-107 14786 15255 15539 15478 15463 15448 15308 15169 15201 15233 15369 15504 15524 15544 15461 15378 15346 15315 15387 15458 15438 15417 15293 15169 15185 15200 15216 15232 14962 14691
-121 14691 14800 14908 14969 15030 15194 15358 15307 15257 15219 15181 15121 15268 15493 15373 15506 15640 15580 15519 15335 15150 15206 15262 15223 15184 15146 15107 15137 15167
-136 15167 15056 15357 15490 15417 15486 15555 15570 15585 15497 15409 15382 15354 15542 15730 15855 15567 15370 15586 15611 15430 15133 15248 15583 15506 15449 15186 15038
-149 15038 15304 15440 15369 15385 15401 15507 15613 15621 15628 15636 15644 15446 15247 15152 15056 15183 15310 15436 15563 15561 15558 15556 15554 15366 15178 15300 15422 15353 15283 15317 15351
-165 15351 15408 15466 15351 15237 15339 15442 15545 15647 15545 15442 15249 15056 15077 15303 15556 15395 15181 15173 15264 15355 15396 15438 15480 15521 15500 15478 15353
-178 15353 15228 15200 15172 15247 15322 15312 15302 15464 15626 15651 15676 15545 15828 16038 15835 15650 15465 15481 15498 15687 15876 15885 15894 15800 15706 15791 15875 15856 15838
-193 15838 15836 15835 15833 15832 15729 15626 15627 15628 15490 15352 15454 15557 15617 15677 15565 15452 15697 15942 16015 16088 15967 15846 15759 15879 15973 15722 15471 15426 15285
-207 15285 15350 15553 15756 15773 15790 15807 15824 15712 15600 15591 15583 15607 15632 15656 15681 15602 15524 15548 15573 15561 15550 15538 15527 15522 15516 15511 15506 15489 15471 15454 15436 15473 15509 15545 15582
-225 15582 15361 15140 15229 15525 15676 15483 15256 15029 15313 15597 15572 15546 15282 15017 15063 15108 15207 15305 15403 15501 15619 15737 15854 15972 15798 15624
-238 15624 15438 15251 15367 15277 15110 15287 15389 15491 15787 16082 16051 16020 15803 15587 15698 15602 15428 15599 15495 15390 15398 15405 15587 15561 15446 15675
-251 15675 15645 15409 15621 15832 15827 15822 15816 15811 15810 15809 15808 15807 15812 15817 15581 15345 15320 15294 15579 15863 15762 15660 15558 15457 15555 15654 15752 15850 15825 15799 15794 15790 15751 16057
-268 16057 16066 15730 15647 15770 15858 15947 16057 16168 15968 15769 15680 15591 15605 15619 15603 15587 15675 15762 15858 15954 15947 15940 16001 16063 16000 15936 16158 16035 15817 15806 15757
-284 15757 15707 15786 15865 15664 15668 15866 15720 15527 15540 15575 15610 15698 15579 15534 15833 15999 15820 15478 15136 15506 15875 15982 16089 16183 15933 15877 15820
-297 15820 15779 15739 15698 15657 15788 15919 15810 15700 15571 15442 15485 15528 15523 15519 15618 15717 15774 15830 15783 15737 15877 16018 15986 15954 15886 15818 15750 15681 15777 15872 15795
-313 15795 15718 15774 15830 15886 15942 15789 15637 15587 15538 15717 15895 15902 15908 15966 16025 15979 15934 16050 16166 16041 15916 15882 15847 15739 16045 16184 16117 16020 15923
-327 15923 15775 15626 15649 15673 15755 15837 15816 15795 15786 15778 15912 15839 15631 15837 16029 15808 15833 15857 15753 15648 15637 15625 15717 15809 15686 15563 15681 15798
-341 15798 15987 16177 16370 16151 15802 15660 15755 15849 15952 16054 15847 15640 15680 15720 15760 15800 15909 16018 15955 15892 16025 16157 16049 15941 15957 15973
-354 15973 15817 15661 15649 15637 15867 16096 15941 15786 15773 15554 15302 15463 15620 15777 15926 16075 16052 16028 16197 16365 16223 16082 15979 15876
-366 15876 15799 15722 15557 15804 16039 16068 16226 16385 16289 16194 16034 15874 15887 15899 15888 15878 16177 16477 16303 16129 16059 15988 15822 15656 15730 15805 15951
-380 15951 16097 16328 16147 15950 16167 16370 16160 16092 16231 16228 16225 16177 16128 16252 16376 16279 16181 15980 15779 15726 15673 15861 16049 16145 16240 16349 16457
-394 16457 16296 16341 16589 16492 16283 16419 16456 16286 16112 15938 15854 15770 15826 15882 15938 15995 15961 15928 15895 15861 15946 16031 16013 15995 15973 15952 15930 15908 15906 15904 15915
-409 15915 15926 15945 16171 16475 16434 16205 15975 16033 16091 16000 15909 15990 16071 16122 16173 16464 16756 16515 16273 16342 16410 16283 16156 16200 16245 16243 16241 16239 16237 16431
-424 16431 16625 16508 16392 16202 16012 15994 15976 15833 15690 15788 15886 15849 15812 16016 16220 16219 16219 16047 15874 15912 15950 15987 16025 16130 16234 16339 16443
-438 16443 16475 16508 16540 16573 16429 16285 16244 16203 16215 16227 16135 16044 16131 16218 16305 16392 16310 16227 16432 16638 16697 16412 16230 16392 16311 16229 16169 16109 16304 16500
-453 16500 16304 16109 16298 16281 16070 16203 16358 16306 16220 16134 16062 15990 16021 16052 16076 16100 16331 16218 16024 16037 16028 16019 16047 16281 16373 16121 15969 16160
-467 16160 16446 16388 16312 16443 16450 16456 16288 16327 16456 16240 16234 16434 16393 16352 16414 16476 16538 16600 16527 16453 16380 16306 16311 16316 16028 16221 16478 16390 16353 16317 16290 16264
-483 16264 16237 16210 16230 16251 16168 16085 16124 16162 16200 16238 16298 16358 16418 16477 16521 16564 16366 16168 16159 16151 16142 16134 16249 16364 16101 15837 15899 15960 16021 16083 16228 16374
-499 16374 16519 16665 16750 16835 16679 16524 16632 16740 16608 16475 16386 16296 16241 16392 16436 16135 16028 16128 16199 16271 16355 16440 16451 16462 16646 16829 16752
-512 16752 16675 16771 16866 16949 17033 17013 16993 16795 16597 16501 16406 16369 16331 16294 16256 16268 16280 16396 16511 16337 16164 16231 16298 16370 16442 16341 16241 16383 16525
-527 16525 16426 16327 16336 16345 16182 16018 15989 15961 16035 16110 16148 16185 16120 16055 16103 16152 16201 16249 16104 15960 16180 16401 16451 16294 16047 16144 16381 16411 16476 16541
-542 16541 16600 16659 16614 16570 16646 16722 16488 16461 16552 16298 16320 16548 16726 17111 17208 16961 16870 16778 16665 16552 16526 16499 16472 16445 16507 16568 16458 16348 16319
-557 16319 16290 16261 16233 16316 16400 16243 16086 16122 16158 16195 16231 16187 16143 16203 16262 16289 16316 16240 16164 16270 16375 16377 16380 16393 16406 16419 16432 16534 16636 16497 16358
-572 16358 16399 16441 16483 16524 16553 16582 16507 16433 16719 17006 16708 16410 16411 16412 16414 16415 16433 16452 16690 16928 17090 16909 16804 16907 16861 16815 16782 16748 16733 16718 16703
-588 16703 16688 16638 16589 16367 16146 16239 16332 16252 16173 16180 16187 16194 16201 16362 16523 16684 16845 16612 16379 16387 16396 16439 16482 16525 16568 16540 16513 16635 16758 16933 16764
-603 16764 16431 16305 16342 16379 16429 16480 16412 16344 16277 16209 16255 16302 16348 16395 16469 16544 16722 16556 16493 16637 16505 16580 16637 16351 16257 16371 16461 16551 16481 16412
-618 16412 16219 16025 16210 16396 16486 16577 16564 16552 16556 16561 16324 16088 16273 16459 16644 16829 16865 16900 16936 16971 16994 17016 16936 16855 16677 16500 16563 16627 16624
-633 16624 16620 16639 16657 16676 17040 17218 17053 17111 16962 16793 16829 16770 16711 16768 16825 16781 16737 16796 16855 16665 16475 16319 16507 16760 16807 16888 16968 16998 17027
-647 17027 16884 16741 16592 16443 16465 16488 16475 16463 16450 16437 16530 16623 16612 16602 16659 16716 16532 16349 16430 16510 16591 16672 16571 16470 16597 16723 16784 16637
-662 16637 16375 16319 16616 16706 16293 16086 16290 16495 16471 16447 16490 16533 16692 16644 16480 16316 16325 16333 16358 16590 16822 16848 16841 16834 16840 16640 16449 16464 16454 16444
-677 16444 16554 16664 16955 16764 16370 16184 16113 16249 16432 16615 16687 16552 16636 16720 16620 16519 16463 16408 16352 16297 16321 16345 16623 16901 16806 16919
-690 16919 16859 16593 16386 16179 16139 16307 16599 16684 16464 16245 16202 16365 16632 16692 16606 16520 16477 16641 16746 16850 16671 16492 16213 16142 16393 16437
-703 16437 16506 16781 16940 16892 16815 16737 16763 16582 16593 16605 16488 16577 16556 16536 16528 16520 16497 16474 16567 16660 16623 16794 16848 16902 16865 16827 16988 16667 16223 16261 16377
-718 16377 16492 16497 16503 16598 16694 16806 16713 16438 16508 16445 16382 16499 16617 16605 16387 16341 16502 16583 16663 16770 16670 16523 16376 16397 16624 16862 16893 16743
-732 16743 16593 16551 16509 16247 16192 16249 16305 16534 16763 16790 16610 16533 16663 16802 16942 17154 16885 16670 16936 17017 16892 16795 16698 16644 16796 16828 16860
-746 16860 16905 16949 16771 16593 16517 16442 16412 16382 16722 16856 16371 16093 16133 16172 16178 16184 16189 16195 16191 16187 16053 16127 16437 16540 16278 16223 16172 16121 16255 16389 16416
-761 16416 16442 16585 16522 16555 16589 16597 16605 16684 16557 16430 16509 16469 16429 16299 16169 16303 16438 16469 16500 16569 16639 16605 16571 16578 16585 16592 16599 16690 16781 16816 16645 16519
-777 16519 16392 16425 16458 16601 16745 16716 16687 16635 16583 16646 16504 16482 16459 16205 16157 16220 16284 16258 16231 16306 16381 16456 16531 16651 16771 16663 16555 16594 16840
-792 16840 17073 16962 16767 16778 16652 16526 16700 16875 16739 16604 16567 16531 16507 16484 16481 16684 16660 16428 16387 16551 16819 16881 16839 17004 17156 17102 17086
-806 17086 17070 16999 16720 16560 16605 16659 16507 16088 16013 16364 16509 16479 16450 16407 16365 16336 16306 16449 16591 16575 16558 16542 16525 16504 16484 16553 16623 16673 16517
-820 16517 16348 16385 16534 16477 16549 16621 16525 16428 16422 16416 16552 16481 16527 16572 16562 16552 16517 16687 16789 16685 16722 16760 16646 16738 16542 16346 16389 16432 16474 16517
-835 16517 16554 16591 16628 16666 16819 16972 16884 16797 16869 16941 16703 16465 16283 16102 16230 16358 16391 16424 16353 16283 16247 16212 16176 16140 16226 16311 16397 16483 16422 16362
-850 16362 16405 16447 16535 16622 16537 16453 16484 16516 16375 16234 16445 16655 16763 16870 16586 16302 16258 16215 16390 16565 16430 16295 16491 16687 16643 16598 16490
-864 16490 16383 16378 16374 16327 16280 16335 16391 16444 16497 16446 16395 16407 16419 16603 16786 16673 16560 16662 16420 16329 16581 16722 16863 16753 16643 16533 16423 16293
-878 16293 16164 16413 16662 16754 16846 16745 16643 16800 16613 16515 16418 16206 15995 16024 16053 16114 16175 16237 16298 16351 16403 16353 16302 16282 16261 16103 16152 16446
-892 16446 16397 16197 16203 16395 16586 16412 16238 16196 16154 15905 16001 16286 16365 16215 16066 16050 16242 16433 16418 16437 16457 16347 16444 16481 16519 16690 16516
-905 16516 16287 16540 16857 16968 16828 16689 16536 16384 16285 16186 16074 16169 16147 16125 16218 16312 16245 16177 16109 16042 16221 16400 16338 16276 16313 16350 16271 16398
-920 16398 16559 16719 16789 16858 16696 16533 16487 16441 16321 16408 16379 16350 16386 16421 16482 16337 16311 16491 16529 16567 16678 16583 16234 16091 16331 16364 16409 16662
-934 16662 16705 16749 16625 16294 16210 16332 16429 16525 16482 16438 16511 16377 16226 16075 16151 16228 16298 16369 16336 16303 16364 16425 16512 16393 16254 16321 16492 16456 16443
-948 16443 16635 16815 16789 16676 16563 16541 16518 16562 16606 16650 16693 16462 16230 16252 16275 16236 16404 16749 16611 16474 16680 16663 16646 16701 16756 16915 17073
-962 17073 16831 16589 16451 16312 16199 16085 15971 15858 16052 16246 16336 16427 16397 16366 16233 16099 16164 16228 16189 16150 16224 16298 16269 16240 16273 16306 16339 16372
-976 16372 16215 16057 16071 16086 16149 16213 16174 16134 16459 16784 16731 16677 16524 16372 16391 16411 16351 16291 16566 16428 16171 15913 15913 15913 16322 16319 16238 16157 15913
-990 15913 15669 15734 15800 15810 15820 15933 16047 16229 16411 16421 16431 16186 15941 15636 15744 15890 16037 16037 16038 15986 15934 16123 16312 16471 16630 16616 16603
-1004 16603 16649 16695 16637 16580 16481 16383 16284 16186 16150 16114 16181 16248 16174 16099 16024 15949 16119 16288 16354 16421 16218 16015 16054 16092 16019 15947 15719 15905 16323 16328
-1019 16328 16281 16234 16208 16183 16260 16337 16294 16251 16311 16371 16459 16547 16694 16429 16364 16299 16449 16599 16576 16553 16393 16439 16629 16475 16101 15934 15925 15915 16091
-1033 16091 16267 16401 16536 16430 16324 16377 16430 16483 16536 16451 16366 16281 16197 16166 16135 16207 16280 16311 16342 16202 16061 15931 15801 15913 16024 16077 16130 16182
-1048 16182 16235 16473 16711 16571 16430 16369 16308 16075 15842 15705 15569 15742 15915 16016 16116 16113 16110 16203 16296 16286 16276 16354 16432 16338 16244 16231 16218 15982
-1062 15982 16089 16236 15900 15668 15918 16149 16037 16032 16234 16195 16156 16129 16103 16220 16338 16201 16065 16042 15813 15872 16276 16516 16550 16619 16687 16618
-1075 16618 16548 16445 16134 15896 16001 16050 16100 16278 16112 15934 16099 16312 16318 16461 16605 16572 16539 16334 16129 16078 16027 16100 16174 16086 16343 16427 16167
-1088 16167 16173 16179 16163 16148 16136 16125 16126 16128 15943 15965 16111 16258 16213 16168 16088 16216 16470 16379 16001 15829 15868 15907 15868 15830 15638 15653 15724 15794 15867 15940 16150
-1104 16150 16154 15847 15885 16081 15933 15872 15810 15684 15902 15992 15738 15700 15661 15715 15768 15719 15669 15622 15574 15953 16125 15918 15712 15673 15841 15989 15931 15899
-1118 15899 15867 15943 16018 16094 16169 16130 16091 16181 16065 16077 16296 16274 16046 15984 16129 16247 16366 16354 16341 16238 16135 15989 16049 16109 15963 16141 16320
-1131 16320 16115 16117 16253 16183 16151 16120 16050 16186 16163 15933 15813 15900 16077 16048 16186 16324 16338 16145 15912 15885 15902 15918 15827 15736 15761 15786 15733 15888
-1145 15888 16145 16196 16320 16444 16305 15960 15829 15904 15746 15589 15608 15627 15659 15485 15560 15635 15800 15965 15883 15801 15836 15663 15672 15681 15849 16017 16146
-1159 16146 16276 16164 16053 15915 15777 15639 15501 15537 15573 15507 15440 15644 15849 15813 15776 15804 15833 15964 16096 16095 16094 15990 15886 15853 15820 15787 15754 15817
-1173 15817 15880 15788 16109 16317 16111 15991 15872 15899 15926 16125 16324 16115 15905 15868 15831 15980 16129 16174 16220 16064 15907 15992 16077 15933 15790 15818
-1186 15818 15847 15882 15917 15965 16013 16013 16220 16452 16271 15867 15669 15708 15747 15719 15692 15664 15636 15685 15735 15888 16041 16023 16005 15987 15969 16004 16040 15904 15768
-1201 15768 15749 15729 15607 15485 15479 15472 15569 15667 15894 16122 16039 15957 16019 16081 16027 15973 16031 15884 15607 15743 15903 15856 15642 15427 15489 15551 15798 16045
-1215 16045 15823 15807 16024 15828 15796 15971 15901 15831 15818 15806 15794 15782 15664 15546 15337 15473 15645 15818 15839 15861 15808 15754 15873 15991 16002 16013 16024
-1228 16024 16035 15981 15927 15873 15819 15776 15733 15689 15646 15582 15518 15625 15733 15723 15712 15917 15777 15571 15709 15760 15606 15533 15666 15843 16019 16114 16209 15925
-1242 15925 15641 15611 15581 15655 15728 15444 15160 15324 15487 15664 15840 15432 15230 15495 15416 15247 15422 15633 15845 15953 16061 16011 15617 15300
-1254 15300 15190 15299 15408 15633 15858 15858 15858 15858 15858 15781 15703 15729 15755 15714 15674 15634 15594 15618 15642 15563 15484 15397 15310 15223 15136 15221 15306 15370 15433 15659 15541 15307
-1270 15307 15073 15228 15383 15366 15349 15320 15292 15435 15578 15513 15448 15382 15317 15213 15110 15178 15247 15367 15487 15297 15107 15190 15272 15354 15437 15534 15632 15488
-1284 15488 15345 15327 15308 15324 15547 15703 15515 15623 15732 15736 15534 15332 15336 15511 15685 15691 15491 15266 15248 15402 15349 15051 14960 14993 15027 15091 15362
-1298 15362 15620 15534 15384 15440 15530 15620 15708 15795 15698 15600 15769 15732 15639 15546 15248 14951 15042 15338 15379 15213 15176 15140 15257 15375 15260 15352 15304 15049
-1312 15049 15289 15529 15621 15505 15334 15163 15248 15332 15417 15502 15522 15541 15342 15348 15428 15508 15601 15694 15526 15359 15377 15394 15272 15356 15440 15318 15341 15364 15503
-1327 15503 15436 15239 15249 15362 15269 15223 15384 15312 15240 15431 15622 15769 15711 15346 15188 15141 15095 15057 15020 14892 15108 15238 15368 15347 15327 15300 15273
-1340 15273 15349 15426 15347 15268 15177 15085 15175 15057 15069 15081 14908 14942 15079 15010 14972 14935 15023 14904 14891 15222 15334 15446 15626 15600 15450 15299 15061 14824
-1354 14824 14896 14968 14951 14935 14919 14903 15110 15318 15229 15139 15173 15412 15480 15341 15231 15121 14894 15012 15308 15398 15371 15345 15359 15166 15102 15039 14973 15114
-1368 15114 15229 14999 14868 14738 14688 14983 15141 15092 15146 14994 14815 14980 15240 15293 15069 15051 15137 15016 14959 15109 15130 15152 14927 14703 14982
-1381 14982 15262 15276 15084 14892 14906 15110 15314 15346 15377 15396 15209 15138 15067 15183 15299 15114 15136 15456 15570 15374 15385 15501 15411 15333 15462 15503
-1394 15503 15545 15612 15473 15471 15469 15455 15440 15483 15527 15398 15269 15207 15144 15254 15364 15159 14955 14862 14976 15158 15134 14998 14862 14852 14842 14806 14977 15126
-1408 15126 15069 15141 15212 15209 15205 15318 15224 15100 14976 14873 14977 15334 15346 15264 15388 15486 15378 15227 15076 14989 14902 15056 15211 15167 15124 15252 15380
-1421 15380 15341 15302 15159 15017 14977 14938 15140 15341 15224 15108 15232 15356 15183 15011 15010 15009 14867 14725 14686 14647 14733 14818 14986 15153 15267 15037
-1435 15037 14910 15127 15034 14941 15180 15418 15219 15020 14993 14966 14962 14959 14956 14952 15100 15247 15084 14922 14826 14730 14944 15158 15037 14917 15038 15158 15053
-1448 15053 14948 14959 14970 14848 14933 15109 14940 14722 14710 14802 14893 14949 15004 14887 14771 14766 14761 14571 14381 14658 14728 14548 14713 14819 14925 15053 15181
-1462 15181 15071 14961 15022 15084 15178 15272 15193 15115 14994 14872 14853 14835 14819 14802 14786 14770 14932 15094 15015 14937 14884 14831 14881 14931 14933 14935 14937 14939 14788 14638 14590
-1477 14590 14543 14703 14862 14781 14700 14693 14685 14780 14875 14877 14879 14709 14539 14480 14422 14535 14649 14840 15031 15119 15001 14809 14961 15113 14922 14771 14826 14744
-1491 14744 14662 14686 14709 14595 14687 14921 14812 14702 14799 14688 14783 15071 15015 14810 14605 14413 14564 14723 14674 14764 14853 14650 14447 14623 14798 14623
-1504 14623 14448 14445 14442 14768 15093 14765 14436 14469 14502 14432 14362 14330 14299 14302 14511 14740 14625 14716 14807 14636 14465 14590 14716 14790 14657 14434 14556
-1518 14556 14774 14786 14695 14604 14661 14718 14672 14626 14731 14835 14835 14836 14816 14795 14671 14547 14666 14785 14732 14680 14721 14763 14633 14502 14626 14749 14770 14790 14771
-1532 14771 14753 14734 14716 14801 14887 14972 15057 14891 14725 14730 14736 14722 14709 14695 14682 14627 14573 14518 14464 14468 14473 14477 14482 14592 14702 14812 14922 14757 14592 14724 14856
-1548 14856 14917 14772 14626 14687 14692 14696 14700 14704 14571 14231 14055 14223 14424 14626 14526 14427 14805 14977 14701 14631 14817 15002 15085 15167 15189 15004 15026 15048
-1562 15048 14849 14443 14153 14070 14113 14363 14497 14631 14717 14597 14511 14425 14242 14403 14659 14708 14592 14476 14450 14424 14454 14485 14489 14700 14870 14833 14823
-1576 14823 14812 14804 14795 14490 14185 14138 14297 14340 14384 14244 14104 14214 14531 14874 15010 14841 14672 14418 14369 14432 14496 14712 14722 14546 14577 14733 14683
-1589 14683 14520 14358 14610 14861 14851 14634 14714 14794 14689 14583 14487 14391 14399 14406 14390 14373 14137 14108 14219 14330 14453 14577 14494 14411 14212 14220 14465 14709
-1603 14709 14588 14467 14516 14565 14558 14345 14355 14364 14258 14152 14325 14499 14293 14088 14016 13943 14181 14418 14593 14768 14702 14636 14566 14496 14426 14356 14082
-1617 14082 13808 13843 13878 13806 13733 13833 13932 14092 14251 14308 14364 14453 14541 14526 14512 14540 14568 14425 14281 14152 14023 14135 14248 14168 14089 14182 14275 14187
-1631 14187 14099 14010 13922 13946 13970 13993 14017 14024 14030 14140 14456 14745 14689 14276 14069 14261 14453 14486 14519 14549 14580 14610 14641 14702 14762 14728 14350 14097 14188 14304
-1646 14304 14421 14332 14242 14153 14064 14076 14087 14099 14111 14137 14163 14203 14242 14163 14290 14495 14355 14482 14609 14473 14544 14623 14358 14184 14216 14092 13969 14099
-1660 14099 14230 14117 14004 13840 14020 14572 14643 14361 14286 14279 14066 13775 13828 13885 13735 13745 13754 13531 13653 14006 14153 14284 14414 14613 14812
-1672 14812 14715 14273 14080 14095 14122 14149 14086 14022 13985 13947 14082 14217 14468 14719 14454 14190 14004 13819 13875 13930 13974 14018 14061 14105 14158 14210 14262 14315
-1686 14315 14308 14302 14192 14082 14140 14198 14153 14108 14149 14191 14233 14275 14360 14445 14289 14133 14114 14095 14076 14057 13877 13697 14033 14369 14358 14346 14163 13979 14011
-1701 14011 14043 14074 14106 14035 13964 13893 13822 13887 13951 13775 13598 13684 13769 13855 13941 13983 14026 13930 14042 14282 14178 14062 13945 13628 13656 13937 14218 13983
-1715 13983 13747 13684 13620 13735 13850 13862 13874 13881 13888 13895 13902 13827 13753 13678 13603 13617 13630 13678 13932 14019 13761 13594 13633 13669 13705 13650 13596 13418 13241 13443 13644
-1731 13644 13880 14116 14029 13942 13887 13626 13288 13293 13476 13658 13676 13695 13955 14008 13807 13813 13898 13776 13654 13739 13858 13771 13813 13855 13766 13677 13747 13817 13984
-1745 13984 13945 13850 13754 13739 13724 13812 13900 13771 13642 13512 13383 13415 13446 13452 13664 13857 13843 13731 13618 13686 13961 14154 14002 13782 13769 13721 13673 13639
-1759 13639 13605 13688 13771 13819 14074 13902 13731 13680 13630 13880 13924 13766 13814 13746 13678 13645 13819 13877 13934 13979 14024 13780 13744 13868 13992 13889 13785 13600
-1773 13600 13414 13332 13250 13256 13262 13371 13481 13480 13480 13479 13479 13531 13584 13748 13568 13347 13470 13598 13519 13725 13932 13807 13476 13489 13709 13799 13890 13784 13678
-1788 13678 13572 13467 13501 13535 13569 13603 13731 13859 13759 13659 13340 13227 13562 13690 13695 13700 13692 13684 13570 13457 13641 13824 13971 13912 13693 13681 13473
-1801 13473 13471 13792 13907 13819 13731 13630 13529 13594 13658 13551 13443 13365 13286 13585 13885 13903 13921 13779 13638 13536 13641 13822 13660 13621 13581 13416
-1814 13416 13252 13394 13536 13506 13476 13654 13833 13650 13123 12893 13146 13234 13116 13207 13505 13617 13523 13428 13333 13259 13392 13645 13554 13429 13304
-1827 13304 13345 13385 13254 13123 13166 13209 13411 13613 13723 13626 13516 13612 13571 13324 13446 13568 13525 13483 13324 13371 13393 13415 13424 13639 13704 13562 13421
-1841 13421 13485 13621 13550 13321 13297 13350 13402 13364 13326 13374 13422 13587 13545 13481 13418 13341 13265 13425 13585 13513 13647 13597 13340 13384 13428 13422 13417 13411 13406 13365 13325 13526
-1857 13526 13726 13636 13546 13616 13685 13798 13705 13419 13476 13585 13488 13425 13362 13232 13102 13213 13325 13369 13414 13290 12961 12916 13284 13652 13607 13509 13617
-1870 13617 13480 13342 13430 13517 13433 13348 13225 13102 13095 13087 13172 13463 13586 13296 13051 13219 13301 13383 13333 13283 13233 13183 13150 13118 13085 13052 13115 13178 13344
-1885 13344 13510 13478 13447 13415 13383 13286 13189 13332 13476 13439 13402 13364 13327 13284 13241 13301 13362 13332 13301 13271 13241 13366 13491 13512 13534 13447 13361 13275 13189 13232 13274
-1900 13274 13170 13066 12924 13194 13348 13296 13315 13335 13182 13029 13020 13218 13455 13278 12919 12973 13057 12934 13052 13170 13104 13037 12978 12920 13158 13396
-1913 13396 13378 13154 12801 12861 12931 12795 12857 13125 13153 13180 12937 12693 12639 12997 13240 13276 13443 13611 13386 13162 12903 12645 12696 12747 12673 12600
-1926 12600 12905 13210 13251 13293 13219 13144 13227 13103 12798 12838 12885 12932 13001 13069 13162 13254 13174 13094 12895 12696 12806 12916 12842 12767 12692 12617 12679 12741 12666
-1941 12666 12796 13017 12894 12874 12855 12923 12992 13164 13336 13313 13289 13162 13035 12981 12928 12874 12820 13093 13366 13261 13155 13044 12933 12821 12710 12730
-1954 12730 12750 12770 12790 12868 12946 13024 13102 13186 13270 13251 13233 13067 12901 12735 12570 12666 12763 12860 12956 12830 12703 12542 12726 13083 13234 13213 13192 13333
-1968 13333 13473 13373 13273 13212 13150 13261 13371 13324 13278 13127 12977 12870 12763 12828 12893 12948 13003 12818 12632 12748 12863 12979 13094 13154 13214 13273
-1981 13273 13333 13180 13026 12894 12763 12603 12788 13132 13132 13298 13257 13022 12994 12998 13001 13167 13334 13393 13108 12720 12676 12835 12994 13063 12926 12924 13128
-1995 13128 13320 13305 13084 12864 12941 13017 13096 13174 13012 12850 12966 13082 13027 12971 12855 12739 12795 12851 12864 12877 13109 13135 12847 12559 12706 12852
-2008 12852 12945 13039 12961 12882 12799 12716 12737 12757 12619 12480 12720 12753 12765 13121 13146 12964 12862 12759 12804 12848 12733 12411 12438 12809 13171 13190 12976
-2021 12976 12968 13240 13168 13062 12955 12829 12704 12681 12658 12511 12364 12259 12361 12700 12833 12784 12736 12623 12510 12500 12491 12480 12469 12630 12792 12845 12899
-2035 12899 12850 12800 12743 12686 12801 12916 12821 12725 12801 12878 12856 12833 12777 12514 12328 12486 12795 12898 12782 12666 12525 12590 12508 12427 12268 12109 12154
-2048 12154 12405 12630 12855 12889 12716 12530 12551 12875 12992 12937 13088 13186 13077 12856 12636 12727 12819 12670 12521 12492 12463 12744 13025 12715 12404
-2061 12404 12541 12678 12514 12350 12289 12228 12354 12481 12436 12390 12556 12721 12749 12983 13009 12691 12463 12442 12397 12352 12342 12331 12058 12129 12432 12529 12518
-2074 12518 12507 12483 12459 12471 12483 12598 12713 12630 12547 12464 12381 12589 12797 12833 12869 12924 12979 12931 12883 12663 12442 12393 12345 12400 12454 12406 12357 12504 12650
-2089 12650 12555 12461 12399 12336 12446 12556 12588 12620 12652 12684 12722 12760 12626 12493 12469 12445 12593 12741 12583 12426 12440 12455 12344 12233 12294 12355 12387 12420
-2103 12420 12453 12486 12567 12648 12420 12191 12057 11923 12099 12274 12489 12703 12918 13132 13260 13389 13263 12794 12735 12675 12616 12557 12405 12597 12699
-2116 12699 12801 12824 12846 12697 12547 12451 12355 12087 11819 11933 12046 12159 12272 12441 12610 12586 12355 12283 12211 12127 12042 12209 12376 12633 12891
-2128 12891 12717 12336 12244 12152 12255 12359 12221 12084 12141 12199 12256 12313 12329 12346 12259 12172 12389 12605 12834 12857 12740 12623 12596 12569 12484 12399 12444 12281
-2142 12281 12246 12417 12356 12295 12161 12028 12191 12355 12552 12544 12410 12277 12138 11999 12238 12478 12389 12299 12313 12327 12292 12257 12223 12188 12170 12153 12006
-2156 12006 12066 12101 11929 12137 12550 12661 12564 12494 12424 12380 12336 12581 12619 12532 12446 12389 12539 12666 12587 12452 12317 12326 12128 11853 11923 12097 12271
-2169 12271 12274 12276 12571 12521 12033 11752 11859 11967 12088 12208 12221 12234 12376 12312 12015 11924 11945 11966 12009 12051 12223 12188 12006 12031 12085 12139 12258 12171
-2183 12171 12096 12022 12105 12189 12273 12357 12316 12275 12234 12193 12052 11911 11942 11973 12111 12250 12285 12321 12329 12336 12344 12352 12444 12536 12525 12513 12433 12353 12376 12399 12396 12393 12252 12318
-2200 12318 12414 12165 12123 12081 12060 12039 11915 11791 11810 11829 12019 12210 12323 12436 12377 12318 12380 12441 12329 12218 12181 12143 12242 12136 11954 12117 12189
-2214 12189 12055 11981 11907 11820 11733 11669 11604 11539 11474 11590 11706 11719 11732 11896 12060 12121 12182 12149 12115 12082 12048 11964 11880 11796 11711 11911 12111 12311 12511
-2229 12511 12391 12271 12152 12032 12076 12120 12164 12208 12206 12204 12202 12200 11987 11774 11871 11968 11869 11769 11773 11777 11839 11901 11963 12025 12142 12259 12156 12053 11886 12063
-2244 12063 12253 12099 11838 11783 11832 11880 11853 11827 11903 11980 11969 11959 11846 11732 11698 11664 11803 11941 12047 12153 12237 12321 12421 12176 12112 12254 12247 12239
-2258 12239 12004 11768 11769 11770 11875 11979 11900 11821 11845 11869 11996 12124 12010 11897 11690 11484 11587 11690 11587 11484 11622 11759 11603 11446 11668
-2270 11668 11890 11912 11935 11853 11772 11789 11805 11822 11839 11939 12040 11900 11759 11673 11586 11740 11895 11765 11636 11678 11720 11693 11665 11741 11817 11961 12106 12057
-2284 12057 12008 12176 12001 11813 11831 11578 11531 11692 11852 11748 11644 11781 11918 11945 11972 12000 12027 11933 11840 11849 11859 11862 11865 11773 11475 11337 11681 12038
-2298 12038 12050 11992 11933 11853 11773 11780 11786 11690 11593 11666 11740 11641 11542 11567 11592 11857 12123 12062 12001 12250 12498 12276 12054 12142 12230 12100 11971 11841 11712
-2313 11712 11628 11545 11702 11860 11753 11645 11710 11775 11857 11940 11919 11897 11719 11541 11535 11529 11556 11583 11609 11636 11461 11285 11351 11416 11436 11456 11475 11495 11610 11724
-2328 11724 11838 11953 12022 12092 11920 11748 11697 11646 11595 11544 11633 11723 11571 11419 11395 11370 11448 11527 11516 11504 11622 11740 11365 11403 11381 11359 11412 11466 11519
-2343 11519 11572 11395 11218 11420 11622 11475 11328 11423 11517 11751 11986 11910 11835 11812 11789 11766 11743 11524 11306 11466 11626 11676 11725 11904 11670 11563
-2356 11563 11455 11426 11396 11412 11427 11443 11459 11340 11220 11341 11462 11594 11725 11754 11782 11771 11761 11647 11533 11613 11692 11668 11644 11657 11669 11785 11901 11826
-2370 11826 11750 11675 11599 11513 11426 11237 11047 11293 11539 11544 11549 11537 11525 11616 11708 11519 11330 11244 11159 11034 10910 10889 10868 11004 11139 11447 11755 11797
-2384 11797 11838 12008 11766 11575 11384 11296 11208 11131 11467 11803 11726 11496 11266 11252 11237 11272 11307 11445 11583 11376 11170 11135 11100 11249 11397 11442
-2397 11442 11487 11477 11466 11482 11497 11347 11610 11537 11465 11407 11349 11532 11716 11776 11837 11898 11958 11839 11719 11496 11274 11229 11185 11382 11579 11499 11420 11445
-2411 11445 11469 11392 11315 11238 11161 10990 10818 11232 11645 11697 11750 11630 11510 11443 11376 11310 11243 11368 11492 11445 11398 11332 11267 11098 10929 11012 11095 11177
-2425 11177 11260 11309 11358 11235 11111 11326 11540 11514 11487 11282 11077 11044 11011 11213 11414 11590 11766 11743 11308 11045 11195 11059 10923 10916 10908 11101
-2438 11101 11294 11178 11061 11023 10986 11052 11118 11150 11181 11213 11244 11250 11255 11536 11611 11653 11489 11221 11298 11331 11159 11123 11088 11179 11270 11374 11272 11066 10861
-2452 10861 10814 10768 10815 10862 10922 10982 10794 10813 11211 11402 11381 11360 11301 11447 11405 11156 11079 11209 11421 11427 11390 11353 11303 11253 11431 11609 11604 11392 10940
-2467 10940 10694 10690 10685 10934 11183 11057 10931 11115 11299 11130 10961 10896 10830 10794 10759 10895 11032 10987 10943 10955 11173 11246 11318 11507 11351 11221 11298
-2481 11298 11353 11409 11198 11194 11302 11410 11462 11308 11166 11025 10988 10952 11019 11293 11448 11259 11187 11114 10988 11070 11172 11068 10913 11101 11187 11272 11369
-2494 11369 11465 11433 11607 11618 11422 11321 11563 11587 11404 11359 11313 11285 11257 11113 11175 11124 11073 11254 11228 11192 11156 11094 11239 11413 11588 11397 11206
-2508 11206 11138 11070 11174 11277 11297 11317 11337 11357 11370 11384 11225 11067 10928 10790 10893 10996 10883 10771 10899 11028 11040 11053 10893 10733 10743 10754
-2521 10754 10764 10774 10974 11173 11270 11022 10677 10539 10573 10607 10752 10897 10870 10842 10940 11037 11032 11026 11103 11180 11154 11127 10983 10838 10694 10549 10698 10847
-2535 10847 10893 10939 10815 10691 10670 10649 10830 11011 11089 11167 11099 11030 11065 11100 11039 10978 11089 11200 11144 11087 11031 10974 11056 11138 11221 11303 11180 11058 10936
-2549 10936 10814 10887 10961 10931 10902 10829 10756 10787 10817 10961 11104 11248 11391 11180 10969 11067 11166 11076 10986 11068 11150 11157 11164 10999 10834 10861 10887 10913 10940 10869
-2564 10869 10799 10625 10796 10935 10868 11226 11378 11266 11154 11028 10903 10879 10856 10660 10464 10520 10576 10735 10895 11050 11205 11051 10897 11005
-2576 11005 11113 11049 10985 11206 11427 11407 11387 11106 10826 10787 10747 10775 10803 10831 10858 10768 10678 10759 10841 10815 10789 10867 10945 11005 11065 10954 10842 10709 10576
-2591 10576 10616 10655 10604 10553 10674 10796 10936 11077 10977 10876 10875 10874 10975 11077 10833 10590 10518 10446 10465 10483 10605 10727 10848 10970 10919 10868 10809
-2605 10809 10750 10794 10838 10950 11063 11004 10945 10831 10718 10777 10836 10847 10858 10868 10879 10958 11038 10876 10715 10752 10790 10827 10865 10724 10583 10545 10507 10402 10297
-2619 10297 10295 10293 10429 10565 10460 10355 10177 10000 10270 10540 10653 10765 10719 10673 10632 10797 11061 10982 10710 10783 10813 10843 10888 10933 10669 10404 10303
-2633 10303 10202 10411 10619 10636 10654 10774 10895 10849 10804 10759 10714 10533 10352 10482 10611 10768 10925 10841 10757 10535 10313 10211 10522 10943 10952 10908
-2646 10908 10864 10868 10872 10876 10879 10789 10698 10749 10593 10222 10263 10417 10364 10425 10486 10637 10788 10919 11051 11186 10909 10640 10578 10477 10376 10221 10066 10289
-2660 10289 10512 10615 10718 10717 10717 10509 10300 10539 10778 10849 10920 10888 10856 10905 10954 11107 11259 11087 10914 10914 10914 10794 10675 10697 10513 10391 10682
-2673 10682 10844 10800 10858 10915 10960 11005 10760 10514 10398 10281 10192 10515 10852 10775 10440 10312 10352 10391 10480 10570 10659 10748 10642 10535 10429 10322 10293
-2687 10293 10264 10235 10206 10409 10613 10575 10537 10690 10843 10755 10667 10639 10611 10755 10899 10737 10576 10587 10598 10548 10499 10346 10193 10224 10256 10459 10662
-2700 10662 10853 11043 10855 10667 10605 10544 10448 10559 10792 10682 10648 10821 10937 10846 10527 10415 10558 10702 10858 11015 10935 10855 10775 10694 10436
-2713 10436 10177 10159 10142 10339 10536 10596 10862 11070 10934 10695 10456 10309 10162 10187 10213 10182 10151 10224 10297 10437 10578 10547 10516 10573 10630 10687 10744
-2727 10744 10658 10572 10451 10675 10783 10684 10710 10735 10904 10866 10428 10335 10432 10324 10249 10175 10122 10069 10120 10170 10363 10555 10506 10458 10339 10221 10275 10328
-2741 10328 10300 10272 10347 10422 10517 10611 10581 10551 10671 10447 10224 10344 10343 10342 10362 10383 10304 10226 10237 10249 10488 10520 10234 10292 10294 10297 10423 10550 10495 10440 10489
-2756 10489 10537 10428 10319 10211 10102 10342 10581 10649 10717 10556 10396 10339 10281 10244 10207 10170 10133 10231 10329 10268 10207 10079 10156 10221 10286 10291 10296 10128 9961
-2771 9961 10042 10123 10230 10544 10995 10964 10792 10826 10834 10842 10682 10316 10079 10048 10082 10116 9923 10074 10320 10360 10361 10362 10453 10544 10388 10231 10247 10263 10608
-2785 10608 10953 10713 10266 10054 10185 10110 10035 10113 10191 10152 10320 10353 10385 10547 10502 10255 10008 10187 10159 10004 10055 10219 10382 10532 10683 10653
-2798 10653 10416 10323 10437 10525 10613 10525 10437 10507 10578 10520 10256 10164 10278 10265 10252 10356 10459 10445 10431 10417 10404 10222 10040 10044 10047 9897 9953 9880 9808 10086
-2813 10086 10157 9957 10102 10418 10391 10153 10121 10317 10513 10528 10337 10232 10127 10133 10347 10267 10188 10224 10261 10214 10168 9889 9816 9937 9852 9793 9733 9823
-2827 9823 9912 9899 9885 10059 10232 10165 10098 10022 9946 9870 9794 9931 10068 9895 9722 9731 9739 9920 10100 10036 9971 10147 10323 10288 10253 10334 10415 10385 10560
-2842 10560 10624 10275 10061 10054 10145 10237 10072 9908 9847 9786 9820 9855 9889 9924 9915 9907 9898 9890 10097 10304 10408 10512 10270 10027 10095 10162 10303 10443 10343
-2857 10343 10242 10264 10287 10347 10202 10003 10216 10301 10179 10068 9956 10073 10190 10333 10475 10377 10279 10391 10504 10444 10385 10249 10114 10082 10050 10054
-2870 10054 10059 10166 10274 10226 10179 10273 10160 9835 9923 10239 10142 10014 9886 9973 10060 10085 10109 10031 9952 9860 9768 9677 9585 9774 9964 9982 10000 9980 9960
-2884 9960 10112 10264 10294 10323 10181 10038 10019 9999 9979 9959 9980 10001 9918 9836 9734 9631 9623 9959 10095 9887 9778 9875 9888 9902 10100 10299 10334 10369
-2898 10369 10231 10094 9912 9730 9535 9339 9430 9315 9212 9453 9859 10059 10155 10251 9967 9682 9708 9733 9706 9679 9652 9625 9708 9790 9770 9749 9888
-2912 9888 10027 9994 9962 9883 9805 9968 10131 10079 10027 9975 9923 9874 9824 9946 10069 10048 10028 10111 10194 10222 10249 10173 10096 9909 9722 9706 9691 9693 9695 9800 9905
-2927 9905 9951 9997 9733 9469 9601 9734 9762 9791 9709 9627 9717 9807 9953 10098 10141 10184 10062 9940 9921 9902 9976 10050 9952 9853 9821 9788 9755 9723 9787 9851
-2942 9851 9812 9773 9832 9890 9777 9664 9677 9691 9704 9718 9841 9965 9985 10006 9847 9689 9772 10061 10134 9863 9695 9871 9916 9755 9537 9664 9830
-2956 9830 9996 9900 9803 9694 9998 10069 9934 10015 9889 9750 9817 9582 9346 9433 9520 9513 9506 9602 9698 9644 9589 9776 9962 10078 10193 10012 9830 9774
-2970 9774 9924 10099 9862 9557 9459 9528 9597 9615 9633 9547 9462 9724 9987 9939 9892 9856 9819 9782 9746 9886 10026 9994 9963 9922 9882 9828 9775 9865 9748
-2984 9748 9605 9875 10036 9990 9927 9864 9611 9564 9762 9548 9301 9467 9594 9515 9573 9632 9678 9723 9859 9995 9752 9510 9656 9802 9949 10095
-2998 10095 9955 9815 9848 9880 9634 9388 9382 9377 9483 9590 9455 9321 9296 9271 9349 9428 9517 9606 9591 9577 9511 9445 9379 9314 9430 9547 9492 9437 9281
-3012 9281 9125 9209 9294 9379 9464 9376 9289 9301 9314 9430 9546 9417 9287 9399 9510 9322 9134 9255 9376 9496 9615 9562 9509 9606 9702 9799 9896
-3026 9896 9732 9568 9508 9447 9330 9213 9474 9735 9695 9655 9512 9369 9470 9571 9568 9566 9568 9570 9374 9178 9466 9340 9116 9098 9094 9502 10013 10112
-3040 10112 10024 9730 9724 9718 9503 9702 9887 9866 9852 9839 9812 9785 9588 9392 9574 9756 9645 9534 9596 9657 9723 9789 9570 9352 9147 9355 9687
-3053 9687 9813 9584 9355 9217 9078 9181 9284 9387 9489 9618 9747 9703 9660 9677 9693 9710 9727 9597 9467 9579 9690 9700 9709 9719 9729 9594
-3066 9594 9460 9485 9509 9537 9359 9279 9613 9873 9720 9653 9587 9604 9622 9812 10002 9979 9956 9932 9909 9805 9700 9699 9698 9729 9760 9688 9616 9218 8820
-3081 8820 8938 9056 9127 9198 9268 9339 9370 9400 9430 9461 9595 9728 9690 9651 9519 9386 9357 9328 9496 9665 9661 9658 9558 9458 9440 9422 9591 9415 9318
-3095 9318 9426 9477 9527 9418 9309 9329 9349 9369 9389 9469 9549 9458 9366 9439 9513 9484 9454 9359 9264 9341 9418 9418 9418 9520 9623 9695 9768 9668 9568 9591 9613
-3111 9613 9636 9659 9427 9195 9274 9352 9152 8953 8995 9036 9253 9469 9492 9515 9725 9591 9294 9203 9236 9269 9315 9361 9457 9553 9545 9537 9430 9322 9317 9313
-3126 9313 9440 9567 9693 9820 9487 9154 9337 9521 9540 9560 9580 9600 9735 9870 9696 9522 9401 9280 9538 9796 9582 9367 9393 9419 9388
-3139 9388 9356 9324 9292 9386 9481 9471 9462 9628 9793 9717 9642 9679 9717 9445 9173 9172 9171 9342 9514 9415 9317 9365 9414 9576 9325 9074 9236 9148 9059 9306
-3154 9306 9553 9198 8843 8866 8890 9017 9144 9271 9398 9328 9257 9290 9322 9326 9329 9333 9336 9365 9395 9252 9109 9165 9220 9275 9331 9474 9618 9495 9372
-3168 9372 9579 9374 9272 9582 9472 9361 9448 9535 9383 9230 9181 9132 9235 9339 9133 8926 9011 9096 9180 9265 9259 9254 9145 9036 9045 9053 9062 9070 9215
-3183 9215 9359 9124 8890 9056 9223 9218 9212 9478 9744 10014 9871 9782 9900 9772 9645 9668 9691 9473 9255 9435 9614 9552 9490 9432 9375 9214
-3196 9214 9053 9267 9482 9524 9566 9466 9366 9369 9373 9442 9512 9409 9307 9307 9308 9309 9309 9194 9078 8963 8847 8844 8840 8682 8936 9362 9375 9362 9350 9165
-3211 9165 9393 9402 9204 9186 9168 9240 9312 9387 9461 9536 9610 9577 9544 9339 9134 9056 8977 9002 9027 8995 8963 9104 9244 9160 9076 9165 9253 9099 8944 8893
-3226 8893 8841 8941 9040 9036 9032 9047 9062 8974 8885 8868 8851 8834 8817 8868 8920 8868 8817 8984 9152 9079 9006 8885 8763 8642 8521 8544 8567 8830 9094 9369
-3241 9369 9643 9539 9435 9363 9291 9461 9630 9618 9607 9596 9585 9442 9300 9157 9015 9104 9194 9284 9374 9386 9398 9308 9217 9217 9218 9115 9012 9110 9207
-3256 9207 9304 9402 9166 8931 9005 9079 9125 9172 9218 9264 9265 9266 9267 9268 9450 9632 9504 9376 9282 9188 9197 9206 9234 9263 9291 9320 9191 9062 9242 9423 9455 9487
-3272 9487 9519 9551 9493 9435 9377 9318 9368 9417 9363 9309 9210 9111 8998 9093 9101 9109 9130 9151 9092 9032 8843 8861 9129 9190 9001 8812 8935 9058 9078 9097 9027
-3287 9027 8956 8920 9090 9317 9200 8933 8872 8862 8853 8843 8834 8949 8858 8767 8882 9008 9134 9261 9387 9271 8948 8914 8880 8992 9104 9100 9096 9145 8988
-3302 8988 8969 8949 8841 9077 9223 9369 9065 8760 8765 8770 8851 8931 9012 9092 9069 9046 8932 8819 8798 8983 9272 9354 9069 8783 8734 8892 9123 9147
-3316 9147 9003 8860 8816 8979 8923 8866 8928 8990 9052 9113 8968 8822 8780 8737 8806 8876 8945 9015 9087 9160 9060 8961 8859 8757 8759 8761 8648 8536 8733
-3330 8733 8931 8952 8973 9097 9221 9216 9211 9034 8856 9118 9380 9202 9232 9402 9366 9101 9044 9003 8962 9077 8984 8744 8916 8842 8769 8778 8787 8898 9010
-3345 9010 9008 9006 8789 8571 8492 8825 9068 8898 8748 8803 8958 9112 8959 8806 8894 8982 8894 8805 8717 8628 8592 8555 8518 8481 8616 8750 8782 8813 8883
-3359 8883 8953 8920 8887 8976 9065 9155 9244 9417 9591 9385 9180 9089 8999 9011 9024 9025 9027 9029 9031 8887 8744 8540 8749 8894 9039 8969 8898 8860 8821 8782 8743
-3375 8743 8732 8721 8951 9181 9209 9237 8955 8673 8699 8724 8647 8569 8657 8744 8831 8918 8747 8577 8715 8854 8826 8799 8771 8743 8932 9122 9139 9157 9135
-3390 9135 9113 8920 8726 8771 8817 8759 8700 8631 8561 8491 8421 8327 8234 8450 8666 8725 8784 8740 8696 8592 8488 8693 8898 8623 8348 8244 8141 8343
-3404 8343 8546 8507 8468 8733 8998 9091 8977 8781 8930 9169 9064 8960 8857 8904 8951 8772 8593 8656 8718 8768 8819 8870 8920 8717 8514 8621
-3417 8621 8727 8771 8815 8858 8902 8944 8985 8855 8724 8785 8846 8804 8762 8742 8721 8873 9024 9168 9311 9076 8841 8720 8599 8718 8838 8809 8780
-3430 8780 8750 8721 8548 8374 8442 8509 8844 9179 9113 9048 9185 8977 8835 8898 8886 8667 8461 8462 8553 8643 8575 8507 8592 8678 8660 8642 8857 9072 9045
-3445 9045 9019 8947 8876 8907 8939 8906 8873 8737 8600 8879 9158 9059 8959 8834 8708 8686 8664 8553 8442 8434 8426 8580 8733 8887 9040 8849 8658
-3458 8658 8708 8757 8504 8250 8513 8776 8657 8538 8591 8644 8643 8643 8642 8641 8524 8407 8461 8516 8597 8677 8745 8812 8847 8675 8598 8865 8841 8817 8932 8839
-3473 8839 8803 8767 8590 8618 8653 8482 8440 8397 8447 8496 8765 8827 8726 8624 8510 8396 8499 8601 8614 8626 8339 8259 8303 8348 8549 8750 8779 8809
-3487 8809 8805 8802 8580 8564 8538 8513 8513 8513 8487 8668 8573 8479 8445 8617 8802 8780 8610 8647 8782 8918 9050 8976 8790 8604 8514 8632 8852 8866 8794 8722
-3502 8722 8650 8578 8484 8597 8710 8617 8638 8660 8642 8832 8791 8543 8597 8651 8431 8211 8313 8416 8476 8742 8982 8878 8548 8218 8190 8161 8350
-3516 8350 8745 8830 8709 8628 8546 8336 8332 8289 8246 8216 8186 8103 8019 8116 8420 8614 8601 8545 8490 8411 8332 8541 8543 8432 8321 8197 8072 8225 8378
-3531 8378 8371 8365 8158 8158 8468 8571 8467 8363 8232 8308 8518 8728 8709 8691 8811 8930 8878 8826 8545 8265 8303 8548 8770 8785 8771 8756 8356 8163
-3545 8163 8301 8439 8333 8226 8016 8013 8012 8217 8629 8696 8424 8358 8464 8570 8506 8442 8357 8271 8601 8586 8407 8435 8326 8216 8223 8229 8334 8438
-3559 8438 8543 8647 8349 8052 8257 8463 8634 8599 8576 8554 8443 8332 8359 8180 8183 8531 8698 8658 8431 8411 8550 8482 8526 8570 8222 8218 8473
-3572 8473 8521 8465 8410 8539 8667 8486 8304 8405 8505 8502 8293 8210 8471 8642 8606 8635 8664 8448 8438 8533 8421 8451 8481 8481 8688 8791 8688 8603
-3586 8603 8517 8303 8295 8356 8416 8606 8590 8604 8619 8449 8279 8102 7925 8058 7985 7901 8162 8319 8476 8448 8420 8496 8571 8499 8427 8527 8627 8600
-3600 8600 8573 8546 8519 8348 8176 8109 8041 8093 8146 8198 8251 8425 8599 8464 8328 8343 8358 8361 8363 8231 7892 7747 8014 8067 8120 8095 8070 8164 8258 8352
-3615 8352 8446 8388 8329 8270 8212 8268 8324 8626 8515 8483 8658 8587 8517 8473 8429 8372 8315 8334 8146 8014 8294 8397 8499 8524 8549 8376 8203 8146 8090
-3630 8090 8124 8366 8577 8375 8294 8625 8596 8566 8426 8285 8248 8211 8397 8584 8585 8586 8495 8198 7956 8128 8325 8522 8436 8349 8353 8357 8465 8572
-3644 8572 8537 8503 8572 8640 8580 8520 8356 8192 8381 8571 8519 8467 8429 8390 8193 7996 8091 8392 8810 8815 8682 8550 8391 8233 8251 8269 8438 8813
-3658 8813 9146 8789 8360 8344 8388 8432 8330 8227 8187 8146 8209 8271 8205 8139 8244 8350 8409 8468 8423 8379 8507 8634 8590 8546 8472 8398 8427 8456 8460 8463
-3673 8463 8467 8470 8494 8517 8541 8564 8658 8753 8675 8597 8611 8624 8638 8651 8873 9095 8801 8507 8406 8306 8334 8363 8084 8218 8291 8365 8310 8256 8201 8147 8109
-3689 8109 8072 8034 7997 8172 8346 8211 8076 7968 7861 7995 8128 8201 8273 8174 8074 8086 8098 8111 8123 8125 8127 8129 8131 8172 8212 8124 8036 8311 8173 7957
-3704 7957 7742 7737 7732 7831 7929 7866 7803 7980 8158 8331 8504 8437 8369 8258 8147 8276 8406 8353 8299 8246 8193 8246 8299 8249 8199 8362 8525 8378 8232
-3718 8232 8196 8160 7994 8242 8172 8101 7979 7857 7584 7723 7802 7881 7926 7970 8015 8059 7973 7886 7799 7713 7936 8159 7934 7710 7845 7980 7805
-3732 7805 7630 7696 7762 8000 8238 8068 7898 7900 7902 8338 8775 8558 8340 8224 8108 8095 8082 8062 8043 8023 8004 7917 7831 7986 8141 8203 8265 8327
-3746 8327 8390 8358 8327 8296 8264 8082 7901 7891 7881 8016 8151 8320 8145 7936 7933 7964 7996 8014 8032 8154 8275 8560 8845 8820 8589 8254 8264 8309
-3760 8309 8353 8262 8171 8080 7989 8012 8035 8175 8314 8155 8202 8443 8339 8145 8158 8274 8390 8381 8372 8260 8148 8109 8070 8203 8336 8303 8271 8238 8206
-3775 8206 8380 8554 8419 8283 8324 8365 8234 8103 8110 8117 8123 8130 8062 7994 8029 8064 8158 8252 8243 8234 8158 8082 8006 7930 7900 7870 7866 8206 8272 7995 8036 8077 7982
-3791 7982 7887 8032 8178 8346 8513 8508 8504 8385 8266 8320 8373 8291 8209 8139 8070 8210 8556 8596 8224 8103 8395 8545 8489 8338 8188 8024 7861
-3805 7861 7872 7883 7920 7956 7639 7735 7771 7806 7984 8161 7960 7759 7812 7865 7918 7971 8000 8029 8058 8087 8106 8125 8144 8163 8070 7977 8044 8110 8153 7990 7857
-3820 7857 8136 8309 8068 7724 7793 8073 7940 7825 7709 7535 7362 7442 7522 7513 7710 8036 7950 7878 8013 8045 7870 7697 7937 7759 7582
-3833 7582 7719 7855 8164 8472 8248 8023 7970 7918 7852 7786 7893 7999 8093 8187 8109 8031 8129 8228 8085 7942 7887 7831 7685 7539 7699 8065 8182
-3846 8182 7885 7761 7843 8071 8093 7900 7706 7668 7836 8143 8037 7751 7671 7772 7873 7883 7894 7931 7968 7902 7836 7871 7906 8173 8234 8113 8199
-3860 8199 8143 8087 8214 8135 7862 7588 7719 7849 7747 7852 8079 8100 8009 7918 7996 8075 8167 8258 8161 8270 8460 8169 7916 8144 8265 8041
-3873 8041 7981 7921 7724 7733 7898 8064 8118 7966 8033 8100 8154 8208 7878 7547 7411 7480 7653 7826 7771 7716 7755 7794 7832 7871 7726 7582 7619 7862
-3887 7862 8059 8050 8079 8109 7911 7919 7970 8021 8083 7939 7898 8064 8176 8288 8240 8193 8099 8005 8048 7885 7815 8089 8259 8085 7736 7593 7807 7814 7749
-3902 7749 7683 7716 7956 8195 8227 8010 7999 8148 7952 7743 7741 7897 8052 8117 8182 8178 8175 8115 7849 7742 7636 7534 7914 8131 8003 8009 8014 7729
-3916 7729 7650 7696 7742 7848 7955 8035 7771 7365 7304 7522 7533 7755 7977 8084 8190 8188 8187 7944 7702 7786 7871 7783 7696 7855 8015 7864 7714
-3929 7714 7778 7843 7908 7972 7861 7749 7650 7551 7339 7332 7575 7474 7527 7580 7405 7574 7493 7206 7229 7252 7335 7418 7501 7584 7611 7638 7665 7692 7717 7741
-3944 7741 7525 7309 7399 7488 7578 7667 7765 7863 7789 7508 7471 7777 7903 7823 7607 7598 7700 7803 7869 7935 7988 8041 8000 7752 7508 7608 7836 7719
-3958 7719 7645 7571 7487 7402 7558 7715 7725 7735 7848 7962 7774 7586 7501 7417 7567 7717 7695 7672 7684 7696 7708 7720 7670 7619 7569 7519 7513 7508 7503 7498 7568 7638
-3974 7638 7708 7778 7874 7971 7895 7819 7625 7431 7547 7663 7548 7433 7344 7461 7645 7347 7243 7483 7582 7681 7802 7923 7809 7695 7754 7812
-3987 7812 7667 7521 7548 7574 7670 7765 7848 7930 7966 7795 7328 7549 7924 7887 7815 7743 7832 7920 7905 7891 7779 7667 7797 7926 7891 7855 7819 7784 7830
-4002 7830 7876 7922 7968 7753 7538 7563 7589 7621 7653 7926 8199 8200 8200 7959 7719 7749 7779 7706 7634 7761 7888 7637 7385 7398 7412 7425 7438 7401 7364 7431
-4017 7431 7498 7622 7747 7562 7377 7417 7458 7396 7333 7344 7354 7193 7031 7271 7511 7579 7647 7628 7610 7695 7780 7678 7576 7577 7578 7613 7649 7684 7720 7628
-4032 7628 7537 7445 7353 7445 7536 7455 7374 7345 7315 7285 7256 7331 7407 7311 7214 7415 7615 7712 7809 7840 7870 7888 7906 7927 7742 7531 7733 7877 7815 7662
-4047 7662 7715 7716 7511 7538 7565 7637 7709 7656 7397 7478 7558 7613 7668 7736 7597 7458 7526 7638 7750 7763 7569 7414 7466 7539 7612 7810 7664 7419 7655
-4062 7655 7834 7668 7438 7414 7642 7870 7780 7483 7545 7608 7541 7681 7837 7993 7977 7961 7957 7748 7641 7741 7576 7411 7259 7107 7176 7245
-4075 7245 7487 7728 7871 8013 8044 7868 7677 7693 7566 7440 7657 7668 7476 7629 7895 7818 7646 7473 7680 7887 7797 7707 7443 7385 7650
-4087 7650 7709 7507 7511 7502 7287 7340 7394 7435 7476 7417 7359 7507 7311 7081 7057 7068 7079 7090 7102 7285 7469 7583 7698 7710 7721 7652 7584 7571 7765 7675
-4102 7675 7584 7739 7688 7446 7410 7477 7339 7159 7185 7186 6981 6998 6809 6702 6939 7113 7288 7230 7172 7229 7079 7140 7545 7724 7559 7377 7402
-4116 7402 7540 7472 7533 7594 7620 7647 7708 7562 7392 7566 7727 7544 7492 7440 7341 7448 7806 7957 7707 7458 7420 7175 7171 7373 7299 7226 7048
-4129 7048 6871 7118 7158 7198 7445 7525 7605 7788 7971 7739 7301 7103 7112 7181 7250 7104 6958 7017 7282 7431 7579 7598 7617 7609 7809 7887 7760
-4143 7760 7761 7763 7593 7423 7494 7565 7531 7497 7359 7222 7228 7235 7461 7687 7764 7498 7218 7283 7553 7617 7586 7761 7799 7631 7462 7500 7450 7195 7249
-4158 7249 7509 7664 7613 7518 7424 7514 7605 7441 7278 7425 7364 7025 7167 7541 7571 7516 7460 7510 7559 7609 7658 7691 7725 7517 7309 7433 7556 7680
-4172 7680 7803 7582 7362 7369 7376 7500 7417 7312 7414 7516 7273 6940 6951 7143 7335 7239 7143 7210 7277 7331 7385 7536 7481 7309 7344 7447 7343
-4185 7343 7355 7573 7660 7748 7551 7355 7235 7323 7307 7291 7223 7362 7501 7434 7330 7226 7226 7225 7050 7082 7239 7395 7440 7485 7357 7230 7120 7010
-4199 7010 6900 6789 6829 6869 6909 6949 6952 6955 6959 6962 7079 7197 7142 7087 7127 7167 7207 7246 7017 6787 6923 7060 7228 7190 7048 7114 7322 7530 7441 7353
-4214 7353 7513 7674 7710 7540 7345 7151 7124 7304 7470 7431 7370 7308 7355 7745 7908 7726 7510 7500 7650 7799 7657 7309 7133 7163 7241 7319
-4227 7319 7185 7396 7539 7199 6958 7062 7139 7217 7144 7071 7252 7432 7196 6959 6759 7041 7348 7311 7318 7324 7193 7268 7305 7341 7391 7440 7425 7409
-4241 7409 7553 7697 7794 7684 7518 7352 7328 7304 7395 7281 7181 7081 7154 7226 7151 7283 7401 7520 7451 7383 7418 7452 7500 7548 7466 7591 7809
-4255 7809 7820 7719 7619 7591 7563 7445 7327 7123 7125 7149 6967 6935 7248 7548 7503 7179 6855 6734 7094 7495 7551 7247 6942 6762 6582 6587
-4268 6587 6593 6629 6872 7011 6944 6912 6879 7006 7132 7244 7356 7365 7373 7311 7248 7173 7097 7374 7444 7458 7471 7485 7499 7629 7553 7439 7325 7314 7303 7177
-4283 7177 7256 7336 7209 7231 7254 7160 7067 7240 7413 7401 7389 7513 7431 7349 7473 7521 7570 7460 7349 7401 7453 7402 7350 7390 7429 7468 7507 7427 7348 7289
-4298 7289 7231 7244 7601 7649 7352 7336 7320 7166 7218 7224 7229 7247 7266 7239 7212 7082 6952 6919 6885 7093 7301 7338 7376 7169 7168 7390 7200 6919 7052
-4313 7052 7189 7327 7388 7448 7379 7310 7414 7517 7373 7229 7257 7285 7343 7401 7429 7251 7045 7252 7318 7383 7214 7045 7048 7051 7064 7078 7092 7106 7242
-4327 7242 7378 7411 7444 7437 7430 7320 7210 7147 7084 6892 7113 7262 7411 7345 7279 7264 7250 7132 7014 7192 7370 7238 7106 7106 7105 7105 7104 7187 7269 7180
-4342 7180 7091 6922 6753 6825 6897 7342 7788 7579 7371 7283 7195 7279 7363 7314 7266 6907 6549 6780 7010 7241 7472 7317 7162 7007 6852 6970
-4355 6970 7088 7193 7298 7246 6988 6704 6832 6993 6948 6941 6935 6901 6867 7075 7282 7438 7593 7370 7147 7075 7003 6789 6987 7031 6868 6848 6827
-4369 6827 6927 7026 7126 7226 7306 7386 7329 7478 7673 7524 7362 7406 7371 7335 7210 7084 6948 6811 6856 7106 7235 7156 7104 7051 7067 7083 7099
-4382 7099 7114 7087 7060 7033 7006 6746 6486 6604 6723 6861 6999 6883 6767 7003 7032 6820 6815 6958 7102 7086 7070 7101 7133 7143 7153 7184 6872 6649
-4396 6649 6633 6671 6916 7169 6940 6825 6917 7021 7126 7082 6832 6814 6796 6649 6708 7146 7378 7177 6976 6865 6755 6915 7076 6996 6915 6821
-4409 6821 6727 6736 6745 6800 6854 7067 7281 7320 7153 6986 7025 7182 7340 7188 7036 7024 6806 6897 7195 7099 7004 6792 6787 6888 6782 6703 6623 6899
-4424 6899 7174 7209 7243 7246 7250 7150 7050 6868 6686 6548 6616 6880 6938 6756 6779 6997 7008 6988 6969 6759 6756 6869 6775 6731 6893 6927 6960 7045 7130
-4438 7130 7111 7093 7072 7052 7031 7011 7083 7154 7213 7272 7273 7067 7149 7232 7229 7226 7210 7194 7221 7042 7021 7208 7240 7066 6892 6924 7054 6976 6787 6598 6584
-4454 6584 6569 6529 6695 6866 6830 6936 7042 6965 7095 7108 7121 7289 7457 7445 7226 7049 7078 7082 7086 7137 7188 7226 7264 7338 7206 7189 7173 6931 6689
-4468 6689 6766 7049 7117 6980 6765 6894 7122 7143 7061 6980 6947 6914 6881 6848 6801 6753 6933 7113 7118 6916 6805 6900 7068 7030 6811 6593 6802 7011
-4482 7011 7048 6879 6918 7302 7530 7277 7010 7087 6940 6793 6982 7171 7188 7204 7138 7071 6991 6911 6932 6747 6803 7065 7118 7170 7064 6957 6908
-4496 6908 6860 6811 6762 6786 6809 6936 7063 7054 7045 6864 6683 6684 6684 6788 6891 6840 6789 6909 7030 6970 6909 7020 7132 7234 7337 7199 7061 7016 6971
-4510 6971 7235 7500 7180 6859 6780 6700 6765 6830 6724 6617 6682 6747 6709 6671 6879 7088 6917 6747 6654 6561 6468 6375 6442 6508 6574 6640 6715 6790 6762
-4525 6762 6733 6771 6808 6742 6676 6700 6725 6508 6291 6323 6354 6489 6830 6952 6730 6714 6698 6776 6854 6932 7010 6743 6477 6520 6563 6563 6562 6746 6930 6882
-4540 6882 7041 7118 6850 6593 6543 6596 6649 6657 6665 6673 6681 6977 7274 7192 7110 6944 6778 6853 6928 7037 7147 7016 6885 6787 6688 6589 6490 6708 6925
-4555 6925 6764 6603 6573 6543 6617 6690 6942 7195 7068 6942 7012 7081 6863 6644 6488 6676 6863 6707 6792 6876 6823 6976 7025 7074 7079 6878 6890
-4568 6890 6902 6901 6900 6797 6693 6590 6487 6588 6689 6789 6890 6926 6962 6839 6716 6592 6676 6772 6661 6627 6798 6944 7090 7034 6977 6783 6796
-4582 6796 6844 6549 6515 6689 6638 6588 6667 6539 6443 6348 6618 6889 6951 7012 6902 6791 6931 7071 7099 6920 6582 6451 6431 6412 6655 6898 6845
-4595 6845 6791 6710 6835 6843 6852 6935 7018 6869 6926 6988 6843 6711 6785 6792 6799 6716 6633 6750 6867 6881 6894 6987 7080 7138 6990 6818 6990 7072 6947 6806
-4610 6806 6664 6820 6975 6782 6588 6692 6796 6794 6585 6376 6374 6683 6993 7212 7431 7182 6933 7119 7304 7240 6969 6802 6841 6768 6694
-4623 6694 6875 7056 6954 6853 6868 6676 6562 6448 6424 6400 6572 6744 6813 6881 6871 6860 6953 7046 7158 7270 7142 7013 6892 6770 6649 6527
-4636 6527 6494 6461 6509 6558 6735 6567 6581 6801 6870 6940 6919 6554 6460 6572 6651 6729 6706 6683 6660 6637 6692 6747 6630 6513 6487 6460 6536 6613 6661 6709
-4651 6709 6756 6804 6697 6590 6483 6376 6387 6398 6113 6171 6335 6499 6512 6526 6733 6939 6974 7009 6972 6936 7106 6932 6702 6679 6699 6925 7052
-4664 7052 6973 7022 7072 6901 6731 6732 6733 6786 6839 6892 6945 7003 7060 6876 6899 7072 6902 6697 6491 6391 6291 6204 6117 6238 6566 6881 6852 6597
-4679 6597 6548 6512 6476 6659 6498 6311 6331 6264 6198 6316 6641 6854 6722 6694 6666 6742 6818 6653 6487 6464 6441 6590 6739 6706 6673 6469 6264
-4692 6264 6399 6534 6566 6597 6818 7040 7020 7000 7040 7081 7018 6955 6934 6912 6787 6663 6603 6542 6654 6766 6551 6335 6498 6661 6527 6393 6414
-4706 6414 6780 7160 7059 6872 6685 6588 6491 6566 6641 6603 6565 6630 6695 6596 6498 6503 6508 6599 6691 6680 6669 6584 6500 6518 6537 6453 6368 6387 6406 6493 6581 6668
-4722 6668 6756 6741 6726 6712 6697 6630 6564 6670 6775 6724 6673 6518 6363 6263 6162 6302 6442 6530 6618 6707 6795 6784 6773 6956 6795 6773 6752 6605
-4736 6605 6459 6481 6502 6420 6339 6495 6652 6809 6966 6755 6544 6505 6466 6577 6689 6697 6705 6632 6559 6588 6618 6779 6939 6996 7053 6855 6656 6629
-4750 6629 6602 6657 6712 6767 6822 6608 6394 6421 6448 6739 7030 6942 6854 6820 6786 6752 6718 6516 6314 6353 6392 6440 6488 6535 6583 6354 6125 6274 6424
-4764 6424 6563 6702 6668 6635 6682 6730 6536 6343 6330 6317 6407 6498 6265 6033 6248 6462 6621 6780 6629 6479 6364 6250 6377 6503 6546 6589
-4777 6589 6632 6674 6571 6469 6675 6882 6812 6741 6843 6944 6851 6758 6561 6365 6358 6351 6344 6337 6496 6655 6814 6973 6708 6444 6351 6259 6360 6462
-4791 6462 6563 6665 6646 6627 6608 6589 6647 6706 6592 6478 6497 6517 6536 6555 6490 6425 6532 6640 6598 6557 6516 6474 6432 6389 6347 6304 6369 6434 6603 6771
-4807 6771 6608 6445 6454 6463 6610 6757 6801 6844 6604 6363 6364 6364 6394 6425 6352 6280 6351 6422 6390 6359 6357 6355 6457 6558 6202 5845 6073 6302 6227 6152 6077
-4822 6077 6003 5944 5885 6136 6387 6458 6528 6599 6669 6656 6644 6515 6387 6579 6564 6356 6492 6547 6396 6494 6799 6863 6721 6406 6298 6548 6593
-4836 6593 6534 6681 6734 6580 6336 6092 6060 6372 6593 6471 6439 6613 6649 6686 6626 6566 6506 6445 6379 6312 6246 6179 6391 6603 6574 6751 7034 6973
-4850 6973 6946 6919 6947 6975 6878 6781 6886 6647 6580 6857 6921 6986 7037 6744 6546 6554 6528 6502 6737 6972 6897 6822 6665 6508 6270 6031 5960 6234
-4864 6234 6533 6626 6602 6579 6543 6506 6452 6397 6343 6288 6474 6660 6675 6689 6395 6102 5981 6203 6241 6073 6145 6217 6077 5937 6106 6276 6388
-4877 6388 6499 6507 6516 6586 6656 6726 6796 6726 6657 6690 6724 6478 6232 6159 6085 6244 6403 6535 6324 6338 6696 6736 6776 6592 6408 6328 6247 6308 6369 6189
-4892 6189 6009 5960 5911 5862 5813 5798 5783 5803 6166 6468 6562 6554 6545 6408 6272 6376 6480 6401 6323 6072 5821 5996 6171 6324 6477 6667 6512
-4906 6512 6263 6220 6305 6389 6396 6403 6364 6533 6778 6680 6712 6745 6515 6285 6228 6170 6216 6261 6266 6270 6275 6280 6323 6366 6581 6797 6744 6692 6640 6587 6477 6366
-4922 6366 6406 6446 6653 6516 6332 6147 6174 6200 6330 6459 6403 6346 6531 6715 6676 6637 6494 6352 6180 6009 6009 6010 6006 6002 6136 6063 5962 6204
-4936 6204 6434 6319 6364 6409 6191 5973 5864 5755 6025 6295 6341 6387 6329 6272 6261 6250 6342 6434 6320 6206 6333 6459 6505 6551 6494 6437 6464 6491
-4950 6491 6517 6544 6467 6389 6483 6578 6481 6384 6390 6397 6436 6475 6342 6209 6377 6545 6610 6675 6486 6298 6281 6264 6148 6032 6158 6283 6278 6274 6166 6058
-4965 6058 6303 6548 6484 6625 6686 6403 6327 6457 6425 6600 6616 6426 6483 6539 6583 6627 6650 6672 6694 6717 6516 6316 6357 6398 6404 6410 6416 6423 6270 6118
-4980 6118 5862 5950 6264 6372 6308 6244 6177 6111 6147 6184 6202 6219 6374 6323 6081 6184 6369 6347 6321 6295 6256 6217 6094 5971 6089 6207 6325 6443
-4994 6443 6457 6472 6490 6507 6525 6543 6315 6088 5985 5882 5793 6048 6225 6196 6246 6297 6438 6579 6620 6662 6601 6540 6364 6189 6254 6320 6313 6306 6299 6292 6175
-5010 6175 6058 6045 6031 6156 6282 6304 6326 6081 5837 5971 6105 6090 6076 6234 6391 6439 6487 6535 6583 6412 6242 6175 6108 6152 6197 6242 6287 6247
-5024 6247 6208 6272 6336 6527 6718 6599 6137 6095 6260 6197 6134 6043 6158 6351 6200 6140 6080 6171 6262 6230 6198 6338 6479 6393 6308 6120 5932 5969
-5038 5969 6007 5885 5763 5850 6143 6513 6539 6477 6415 6332 6248 6297 6345 6393 6441 6479 6516 6553 6591 6544 6497 6278 6059 6048 6038 6028 6017 6042 6066 6091 6115
-5053 6115 6252 6388 6524 6661 6615 6570 6525 6479 6468 6457 6412 6160 5983 6149 6398 6440 6486 6532 6669 6805 6555 6304 6157 6010 6239 6468
-5067 6468 6318 6169 6094 6019 5738 5801 6042 6077 6147 6216 6220 6224 6055 5887 5904 5920 5937 5954 5961 5969 5976 5984 6023 6063 6103 6142 6136 6129 6226 6323 6155 5987 6129
-5083 6129 6271 6196 6122 5944 5766 5829 5892 5851 5811 6094 6376 6525 6261 6077 6099 6151 6203 6248 6292 6337 6381 6366 6350 6231 6112 6152 6192 6089
-5097 6089 6194 6420 6234 6087 6146 6129 6319 6422 6113 5810 5920 6013 6105 6071 6037 6003 5969 6053 6137 6050 5962 5980 5999 6120 6242 6127 6012
-5111 6012 6138 6264 6249 6234 6115 5996 5987 5979 5970 5961 6124 6287 6214 5935 5644 5767 5928 6089 6418 6334 6311 6287 6181 6076 6074 6071 5914 5757 5840
-5125 5840 5924 6100 6276 6348 6421 6384 6347 6310 6273 6363 6453 6307 5953 5688 5835 5883 5931 6304 6264 6168 6278 6177 6076 5987 5899 5929 5958 5898 5838
-5140 5838 5787 5942 5878 5815 5794 5773 5795 6024 5944 5658 5681 5911 6212 6306 6104 6107 6086 6064 6270 6132 5812 5835 6022 5865 5647 5637 5716 5795
-5154 5795 6002 6001 5945 5889 5918 5947 5975 6004 6039 6075 6007 5939 6127 6316 6392 6262 6061 6067 6176 6078 5967 6063 6029 5996 5930 5864 5888 5913 5934 5748 5781
-5169 5781 5815 5849 5882 5688 5493 5508 5730 6055 6173 6196 6220 6256 6086 5868 5856 5887 6125 6326 6183 6117 6258 6226 5987 5981 6181 6526 6526 6169
-5183 6169 6019 5914 5808 5888 5968 6037 6106 6162 6218 6344 6263 6071 5878 5703 5734 5890 6046 6098 6149 6201 6253 6167 6081 6098 6115 6115 6115 6115 6115 6089 6063
-5199 6063 6038 6012 6066 6119 5954 5995 5947 5900 5969 6038 6119 6201 6041 5882 5916 5950 5786 5622 5993 5951 5599 5660 5728 5795 5888 5982 5889 5797 5807 5818
-5214 5818 5814 5810 5805 5801 5799 5797 5794 5792 5943 6093 6244 6395 6330 6265 6304 6342 6256 6170 6084 5998 5843 5688 5705 5722 5872 6023 6173 6324 6505 6687 6559
-5230 6559 6431 6098 5766 5950 6133 6169 6205 6069 5933 5833 5733 5875 6016 6012 6008 6146 6077 5811 5957 6030 6104 6127 6150 6174 6197 6321 6446
-5243 6446 6261 6075 5846 5616 5700 5578 5381 5596 5855 5907 5831 5755 5666 5578 5618 5658 5870 6083 6083 6083 6083 6084 6211 6338 6224 6110 6102 6093 6188 6283
-5258 6283 6307 6331 6183 6034 5981 5927 5874 5820 5913 6005 6098 6191 6306 6421 6184 5946 5859 6186 6284 5969 5814 5865 5787 5710 5667 5830 6036 6242
-5272 6242 6263 6076 6006 5936 5939 5942 5945 5948 6058 6167 6082 5792 5757 5722 5571 5420 5636 5853 5829 5805 5962 6118 5827 5536 5499 5462 5537 5818 6214
-5287 6214 6403 6273 6143 6158 6173 6316 6253 6023 5999 5846 5692 5728 5765 5904 6043 5929 5814 5743 5878 5930 5776 5751 5725 5803 5881 6041 6201
-5300 6201 6224 5903 5660 5623 5704 5785 5509 5440 5741 5836 5888 5939 5967 5995 5783 5776 5959 5798 5741 5889 5763 5843 6026 5865 5680 5701 5688 5675
-5314 5675 5879 6083 6046 6010 6096 6183 5973 5763 5699 5842 5696 5550 5776 6002 5919 5835 5899 5964 6029 6093 6283 6473 6422 6372 6224 6076 5928
-5328 5928 5781 5757 5733 5710 5686 5790 5893 5941 5782 5875 5969 6050 6131 6048 5966 5986 6007 5982 5958 5933 5909 5807 5705 5706 5707 5798 5888 5979 6070 6158 6246 6094
-5344 6094 5941 5818 5694 5881 6067 5946 5824 5841 5650 5553 5799 5920 6042 6155 5924 5667 5409 5294 5522 5674 5618 5700 5783 5852 5921
-5357 5921 6008 6094 6009 5923 6031 6139 6075 6011 5974 5937 5901 5864 5935 6006 6076 6147 6193 6240 6114 5988 6000 6011 6023 6035 5898 5760 5864 5968 6026 6085
-5372 6085 5971 5858 5779 5700 5733 5421 5433 5788 6040 5948 5687 5770 5857 5737 5876 6015 5900 5785 5782 5780 5881 5981 5955 5929 5903 5877 5739 5602
-5386 5602 5628 5998 6140 5938 5951 5964 6022 6079 5895 5712 5866 6020 6071 6121 5916 5710 5745 5781 5695 5610 5766 5921 5982 6043 6001 5959 6052 6146
-5400 6146 6239 6332 6427 6521 6374 6228 5907 5586 5507 5427 5629 5832 5863 5893 5866 5839 5811 5784 5850 5916 5879 5842 5826 5811 5795 5779 5868 5956 5872 5789 5920
-5415 5920 6051 6183 6314 6264 6213 6223 5820 5756 5693 5604 5515 5759 6002 6005 6008 5931 5854 5778 5701 5735 5769 5803 5837 5798 5759 5616 5474 5469 5465 5701 5937
-5431 5937 5868 5799 5730 5661 5657 5654 5650 5647 5613 5579 5787 5994 5904 5813 5895 5977 5968 5959 5848 5736 5685 5634 5756 5877 5982 6086 5949 5813 5972 6132 5913
-5446 5913 5694 5791 5888 5882 5875 5857 5839 5821 5804 5751 5699 5956 6213 6057 5901 5745 5589 5598 5608 5789 5971 6006 6042 5975 5907 6005 6104 6043 5982 5816
-5462 5816 5857 5897 5731 5740 5748 5654 5559 5383 5413 5693 5973 6116 6051 6000 5949 5910 5872 5936 6001 5999 5997 5891 5786 5835 5883 5932 5980 5859 5737 5904 6071
-5477 6071 6224 6034 5602 5515 5507 5499 5513 5526 5519 5511 5559 5813 5788 5763 5751 5739 5569 5398 5400 5401 5420 5439 5458 5476 5754 6032 6069 6107 5999 5892 5889 6091
-5493 6091 6221 6006 5710 5620 5599 5578 5674 5769 5706 5643 5696 5749 5717 5890 6064 6031 6003 5975 5934 5893 5917 5941 5736 5532 5511 5696 5838 5979 5964
-5508 5964 5468 5143 5300 5387 5474 5785 5751 5522 5293 5236 5385 5504 5622 5650 5678 5843 6009 5994 5772 5733 5901 5953 5799 5644 5489 5563
-5521 5563 5636 5556 5476 5568 5660 5593 5526 5575 5625 5752 6086 6188 5946 5880 5814 5830 5846 5681 5516 5523 5530 5654 5777 5590 5404 5688 5973 5831
-5535 5831 5689 5376 5406 5738 5863 5614 5366 5358 5350 5411 5679 5865 5706 5600 5700 5766 5832 5627 5421 5388 5355 5401 5446 5388 5330 5395 5460 5524
-5549 5524 5589 5655 5721 5684 5646 5699 5752 5805 5858 5855 5852 5951 6051 5854 5657 5839 6020 5920 5819 5719 5618 5653 5688 5551 5414 5428 5442 5559 5883
-5563 5883 5940 5653 5559 5672 5567 5463 5543 5623 5781 5939 5925 5911 5949 5988 5923 5858 5793 5728 5836 5943 5773 5603 5536 5469 5348 5228 5348
-5577 5348 5468 5558 5647 5737 5826 5781 5735 5586 5436 5384 5331 5382 5433 5570 5706 5671 5429 5270 5455 5467 5135 5036 5143 5354 5564 5451 5339
-5591 5339 5398 5457 5379 5300 5463 5625 5460 5294 5438 5582 5608 5634 5660 5686 5905 6124 6033 5943 5755 5568 5552 5537 5758 5979 5753 5527 5580
-5604 5580 5634 5791 5947 5806 5664 5777 5889 5683 5683 5662 5985 6120 5911 5676 5441 5636 5831 5717 5602 5585 5568 5448 5327 5504 5681
-5617 5681 5685 5690 5529 5368 5449 5529 5528 5526 5422 5317 5375 5433 5595 5756 5724 5692 5556 5421 5519 5618 5751 5677 5479 5624 5977 6123 6197 6065 5804
-5631 5804 5750 5803 5649 5522 5394 5487 5580 5823 6066 6172 5934 5738 5543 5486 5773 5879 5779 5741 5703 5549 5395 5442 5488 5534 5580 5559 5539
-5645 5539 5518 5498 5584 5670 5756 5842 5844 5846 5848 5850 5908 5966 5644 5323 5443 5563 5511 5459 5343 5227 5420 5614 5480 5347 5455 5562 5611 5660 5606 5551
-5660 5551 5527 5503 5582 5661 5634 5607 5429 5251 5243 5579 5735 5684 5720 5756 5779 5803 5742 5681 5621 5560 5567 5573 5567 5560 5618 5470 5141 5156 5175 5193 5474 5754
-5676 5754 5581 5408 5683 5957 5968 5979 5989 6000 5873 5747 5620 5493 5358 5224 5331 5437 5636 5835 5725 5614 5491 5368 5693 6017
-5688 6017 5843 5669 5666 5664 5504 5344 5425 5506 5451 5397 5342 5288 5429 5570 5540 5509 5532 5555 5681 5807 5820 5832 5673 5514 5414 5315 5388 5461 5586
-5702 5586 5710 5594 5684 5984 5941 5863 5786 5647 5508 5472 5436 5542 5648 5754 5861 5820 5779 5876 5767 5326 5230 5443 5656 5443 5231 5190
-5716 5190 5149 5201 5253 5305 5357 5433 5509 5482 5454 5522 5589 5657 5724 5712 5700 5584 5469 5543 5617 5381 5145 5118 5092 5065 5038 5130 5221 5395 5568 5576 5239
-5731 5239 5221 5410 5351 5292 5349 5406 5329 5252 5174 5097 5157 5218 5278 5338 5732 6126 6003 5881 5735 5588 5614 5640 5874 6107 6031 5955 5706 5458
-5745 5458 5451 5443 5486 5529 5469 5409 5454 5500 5545 5590 5472 5353 5338 5322 5550 5778 5902 6027 5900 5772 5817 5862 5772 5681 5694 5706 5720 5734 5747 5761 5616
-5761 5616 5470 5325 5179 5332 5484 5327 5170 5133 5096 5231 5366 5329 5291 5275 5259 5207 5498 5686 5530 5435 5339 5463 5587 5710 5834 5786
-5774 5786 5737 5822 5907 5751 5595 5641 5687 5733 5779 5794 5809 5836 5864 5642 5627 5814 5657 5401 5489 5582 5468 5431 5394 5311 5571 5722 5667 5706 5539
-5788 5539 5401 5471 5514 5558 5515 5471 5325 5178 5415 5651 5784 5917 5774 5632 5661 5690 5494 5297 5273 5248 5209 5170 5153 5136 5187 5583 5828
-5802 5828 5591 5504 5623 5596 5569 5514 5459 5507 5555 5598 5641 5787 5933 5714 5494 5653 5812 5727 5642 5475 5308 5141 5318 5474 5630 5518
-5815 5518 5407 5214 5021 4939 5202 5400 5392 5301 5417 5519 5415 5432 5448 5555 5662 5612 5562 5615 5668 5704 5740 5604 5468 5281 5094 5148 5202
-5828 5202 5532 5861 5812 5763 5710 5656 5499 5342 5378 5415 5348 5281 5500 5718 5764 5810 5663 5515 5471 5427 5335 5243 5267 5292 5290 5495 5777 5715 5597
-5843 5597 5480 5340 5201 5318 5434 5448 5461 5430 5398 5573 5404 5246 5294 5376 5459 5436 5413 5287 5161 5071 4982 4996 5009 5027 5045 5063 5081 5177 5272
-5858 5272 5230 5394 5695 5651 5504 5357 5188 5020 5161 5302 5177 5052 4928 4803 4928 5052 4936 4820 5026 5232 5438 5644 5609 5574
-5870 5574 5539 5504 5237 4970 4866 5106 5323 5195 5180 5164 5291 5417 5302 5188 5327 5466 5296 5126 5034 4943 4809 5019 5169 4974 5098
-5882 5098 5222 5359 5496 5392 5288 5195 5101 5318 5534 5511 5487 5464 5441 5544 5648 5441 5235 5456 5677 5519 5361 5545 5729 5604 5478
-5895 5478 5454 5430 5406 5382 5300 5218 5377 5535 5260 4984 5018 5052 5165 5279 5393 5506 5446 5386 5429 5472 5382 5292 5421 5550 5574 5254 4946 4983
-5909 4983 5013 5250 5405 5354 5260 5167 5301 5436 5620 5804 5553 5302 5165 5235 5304 5167 5136 5104 5034 5170 5225 5073 5154 5234 5199 5164 5115 5273
-5923 5273 5384 5494 5514 5534 5472 5410 5349 5287 5305 5322 5327 5332 5464 5389 5134 4879 4915 5158 5273 5387 5471 5348 5342 5335 5307 5279 5355 5430 5471 5512 5553
-5938 5553 5594 5401 5208 5277 5553 5636 5718 5813 5909 5818 5728 5327 5134 5245 5013 4875 5219 5283 5140 5144 5148 4996 4845 5072 5300 5275 5250 5225
-5952 5225 5200 5289 5379 5309 5238 5130 5229 5107 4986 5115 5243 5475 5706 5367 5027 5088 5355 5418 5481 5315 5150 5161 5173 5313 5247 5071 5101
-5966 5101 5093 5085 5249 5206 5120 5035 4904 4980 5296 5406 5391 5376 5210 5251 5565 5534 5414 5637 5557 5476 5520 5564 5331 5098 5243 5388 5486 5585 5683
-5981 5683 5782 5516 5251 5227 5203 5507 5811 5529 5248 5066 4884 5011 5138 5193 5248 5131 5014 5137 5261 5213 5164 4948 4732 4963 5194
-5993 5194 5130 5066 5106 5145 5331 5516 5701 5887 5627 5367 5404 5441 5515 5383 5277 5515 5489 5462 5457 5452 5368 5285 5305 5324 5254 5183 5194 5205 5388 5227
-6008 5227 5066 5249 5221 5193 5359 5525 5481 5437 5393 5349 5255 5162 5240 5319 5479 5639 5558 5683 5626 5224 5016 5015 5013 5011 5022 5033 4977 4921 4968 5016 5252
-6024 5252 5489 5497 5506 5443 5587 5822 5712 5387 5269 5324 5378 5400 5422 5547 5672 5381 5090 5177 5265 5395 5526 5656 5787 5627 5467 5307
-6037 5307 5148 5233 5318 5300 5283 5206 5129 5156 5183 5272 5361 5303 5452 5533 5133 5041 5432 5597 5555 5363 5171 5177 5390 5460 5187 4956 5070 5141 5212
-6051 5212 5067 4922 4970 5019 5012 5349 5367 5179 5415 5651 5703 5754 5729 5705 5578 5450 5387 5325 5145 5173 5243 5314 5513 5506 5279 5051 5052 5052 5188
-6066 5188 5325 5366 5063 4779 4838 4915 4786 4826 5073 5204 5128 5188 5248 5295 5343 5317 5291 5394 5291 5131 5177 5198 5218 5378 5539 5445 5351 5283
-6080 5283 5007 5033 5403 5459 5515 5489 5119 5049 5185 5080 4975 5014 5053 5230 5201 5078 5300 5496 5209 5089 5175 5205 5235 5369 5297 5181 5065
-6093 5065 4842 4825 4934 5042 4928 4814 4932 5394 5521 5304 5220 5136 5024 5257 5338 5076 4822 4913 5098 5283 5145 5007 5041 5075 5266
-6106 5266 5457 5338 5220 5206 5193 5180 5167 5091 5015 5043 5071 4998 4925 5093 5261 5289 5317 5345 5373 5485 5596 5536 5475 5527 5578 5629 5680 5539 5398
-6121 5398 5498 5598 5519 5441 5465 5490 5542 5594 5473 5353 5448 5543 5466 5389 5515 5641 5595 5548 5459 5370 5281 5192 5222 5252 5282 5312 5293 5274 5255 5235 5458
-6136 5458 5681 5525 5369 5429 5488 5375 5263 5234 5205 5176 5147 5095 5042 5162 5281 5317 5352 5215 5078 4932 4787 4882 4978 5084 5190 5193 5196 5177
-6150 5177 5158 5140 5121 5187 5252 5317 5383 5420 5457 5254 5050 5212 5375 5537 5699 5459 5219 5219 5220 5355 5489 5314 5139 5024 4909 4966 5023 5108
-6164 5108 5194 5175 5157 5206 5254 4924 4594 4767 4939 5112 5284 5356 5427 5326 5226 5144 5063 5085 5107 5139 5172 5205 5237 5123 5009 5205 5401 5268
-6178 5268 5134 5104 5074 4962 4850 4979 5108 5113 5117 5018 4919 4823 4727 5009 5291 5040 4789 4917 5044 5343 5641 5561 5481 5504 5528 5379 5230
-6192 5230 5068 4906 5053 5201 5138 5075 5012 4949 5009 5069 5129 5189 5077 4965 4956 4947 5163 5379 5286 5192 5340 5487 5394 5507 5701 5551 5229 5251
-6206 5251 5533 5609 5513 5417 5463 5509 5556 5602 5596 5591 5413 5236 5223 5211 5198 5186 5298 5411 5282 5154 5124 5095 5079 5062 5078 5301 5428 5212 5044
-6220 5044 4875 4857 4839 4957 5074 5192 5309 5367 5424 5378 5332 5327 5321 5419 5518 5322 5126 5172 5217 5297 5377 5285 5192 5224 5255 5115 4974 4991 5008 5024
-6236 5024 5041 5050 5059 4964 4870 4909 4948 4987 5027 4963 4900 5078 5255 5261 5266 5272 5277 5179 5082 4838 4594 4305 4428 4767 5106 5071 5035 5103 5170 5230 5289 5244 5200
-6252 5200 5268 5336 5231 5127 5276 5426 5403 5380 5358 5335 5416 5496 5441 5386 5332 5277 5251 5225 5109 4992 5050 5315 5412 5095 4875 5068 5235 5196
-6266 5196 5105 5220 5232 5038 4866 4900 5046 5192 5267 5342 5314 5286 5193 5100 5007 4914 4989 5064 5138 5213 5189 5164 5036 4908 4984 5061 5241 5420 5347
-6281 5347 5274 5028 4783 4705 4628 4860 5092 4930 4767 4983 5199 5318 5438 5247 5057 5013 4970 4927 4884 4976 5068 4989 4909 4929 4949 5210 5472
-6294 5472 5303 5133 4964 4795 4790 4785 4780 4775 4847 4920 4992 5064 5124 5183 5126 5276 5181 5085 5381 5677 5734 5790 5804 5611 5386 5367 5219 5071 4935 4799
-6309 4799 4848 4897 4740 4789 4941 4887 4836 4785 4721 4657 4535 4412 4531 4650 4841 5032 5236 5233 5207 5180 5154 5128 4863 4805 5057 5102 5012 4921 4956
-6324 4956 4784 4752 5065 5301 5330 5176 5229 5359 5145 4992 5045 5189 5333 5341 5143 5061 4979 4946 4912 4762 4819 4981 5143 5318 5493 5455 5416
-6337 5416 5335 5047 4983 5125 5138 5151 5044 4936 5056 5176 5232 5081 5033 5192 5182 5172 5163 5153 5205 5051 4910 4769 4674 4579 4657 4734 4684 4634 4585
$$ [...]
-32894a57
##END=		$$ NMR SPECTRUM
##END=		$$ LINK
