##TITLE=	mg8k4070TTGFXtEaHFD$dg.10.fid
##JCAMP-DX=	6.0	$$ MestReNova 14.3.3-33362
##DATA TYPE=	LINK
##BLOCKS=	1    
##ORIGIN=	Mestrelab Research S.L.
##OWNER=	hrzepa
##$MNOVA/METADATA=	(DOCUMENT,BASE64)
eyJuYW1lIjoiL1VzZXJzL2hyemVwYS9MaWJyYXJ5L01vYmlsZSBEb2N1bWVudHMvY29tfmFwcGxlfkN
sb3VkRG9jcy9TaGVwcGFyZC9OTVIgZmlsZXMgemlwcy0yL0IoT0hGaVApMy9CKE9IRklQKTMtSC9CKE
9IRklQKTMtSC5tbm92YSIsInBhZ2VzIjpbeyJpdGVtcyI6WyIxIiAgICAgXX1dfQ==
##TITLE=	mg8k4070TTGFXtEaHFD$dg.10.fid
##JCAMP-DX=	6.0	$$ MestReNova 14.3.3-33362
##DATA TYPE=	NMR SPECTRUM
##DATA CLASS=	XYDATA
##BLOCK_ID=	1
##ORIGIN=	Bruker BioSpin GmbH
##OWNER=	root
##NUMDIM=	1
##$MNOVA/METADATA=	(ITEM,BASE64)
eyJhbmdsZSI6MCwiYXhlcyI6eyJ4Ijp7Im1heCI6MTYuMTcyNDAwMDAwMDEzMzI2LCJtaW4iOi0zLjg
yMjA5NjI1NTE5NTUyODR9LCJ5Ijp7Im1heCI6MTEyNTE4NzMuNjI1LCJtaW4iOi0xMDIzNjIyLjIwOD
E5MDkxOH19LCJwb2ludHMiOlt7IngiOjUzMjEsInkiOjU4MzV9LHsieCI6ODcyMiwieSI6NTgzNX0se
yJ4Ijo4NzIyLCJ5Ijo4MjA4fSx7IngiOjUzMjEsInkiOjgyMDh9LHsieCI6NTMyMSwieSI6NTgzNX1d
LCJ6IjowfQ==
##.OBSERVE FREQUENCY=	500.13308830199997601
##.OBSERVE NUCLEUS=	^1H
##.SOLVENT NAME=	CD3CN
##.PULSE SEQUENCE=	zg30
##LONGDATE=	2022/05/06 16:26:01.000
##.ACQUISITIONMODE=	SIMULTANEOUS (DQD)
##$ORIGINAL FORMAT=	Bruker XWIN-NMR
##$MNOVA/SCALES_VERSION=	9
##$PARAMETER FILE=	(acqus, ASCII, /private/var/folders/f6/rjf_tdyn2v98c5c0wvkgn4s80000gq/T/mg8k4070TTGFXtEaHFD$dg/10/acqus, 0)
$$ ##TITLE= Parameter file, TopSpin 4.1.3
$$ ##JCAMPDX= 5.0
$$ ##DATATYPE= Parameter Values
$$ ##NPOINTS= 1	$$ modification sequence number
$$ ##ORIGIN= Bruker BioSpin GmbH
$$ ##OWNER= root
$$ $$ 2022-05-06 16:25:55.665 +0100  root@CZC036BXXF
$$ $$ Z:/500/data/tds/nmr/RP183/10/acqus
$$ $$ process C:\Bruker\TopSpin4.1.3\prog\mod\dirdata.exe
$$ ##$ACQT0= -2.55872630837368
$$ ##$AMP= (0..31)
$$ 100 100 100 100 100 100 100 100 100 100 100 100 100 100 100 100 100 100
$$ 100 100 100 100 100 100 100 100 100 100 100 100 100 100
$$ ##$AMPCOIL= (0..32)
$$ -1 0 0 0 0 0 0 0 0 0 0 0 0 0 0 0 0 0 0 0 0 0 0 0 0 0 0 0 0 0 0 0 0
$$ ##$AQSEQ= 0
$$ ##$AQ_mod= 3
$$ ##$AUNM= <au_zg>
$$ ##$AUTOPOS= <13 >
$$ ##$BF1= 500.13
$$ ##$BF2= 500.13
$$ ##$BF3= 500.13
$$ ##$BF4= 500.13
$$ ##$BF5= 500.13
$$ ##$BF6= 500.13
$$ ##$BF7= 500.13
$$ ##$BF8= 500.13
$$ ##$BWFAC= (0..63)
$$ 0 0 0 0 0 0 0 0 0 0 0 0 0 0 0 0 0 0 0 0 0 0 0 0 0 0 0 0 0 0 0 0 0 0 0 0
$$ 0 0 0 0 0 0 0 0 0 0 0 0 0 0 0 0 0 0 0 0 0 0 0 0 0 0 0 0
$$ ##$BYTORDA= 0
$$ ##$CHANFCU= (0..24)
$$ 0 1 0 0 0 0 0 0 0 0 0 0 0 0 0 0 0 0 0 0 0 0 0 0 0
$$ ##$CHANREC= (0..24)
$$ 0 1 0 0 0 0 0 0 0 0 0 0 0 0 0 0 0 0 0 0 0 0 0 0 0
$$ ##$CHEMSTR= <none>
$$ ##$CNST= (0..63)
$$ 1 1 1 1 1 1 1 1 1 1 1 1 1 1 1 1 1 1 1 1 1 1 1 1 1 1 1 1 1 1 1 1 1 1 1 1
$$ 1 1 1 1 1 1 1 1 1 1 1 1 1 1 1 1 1 1 1 1 1 1 1 1 1 1 1 1
$$ ##$CPDPRG= (0..8)
$$ <> <> <> <> <> <> <> <> <>
$$ ##$D= (0..63)
$$ 0 1 0 0 0 0 0 0 0 0 0 0 0 0 0 0 0.0002 0 0 0 0 0 0 0 0 0 0 0 0 0 0 0 0
$$ 0 0 0 0 0 0 0 0 0 0 0 0 0 0 0 0 0 0 0 0 0 0 0 0 0 0 0 0 0 0 0
$$ ##$DATE= 1651850761
$$ ##$DATE_START= 1651850719
$$ ##$DE= 9.941274
$$ [...]
$$ 1 1 1 1 0 0 0 0 0 0 0 0 0 0 0 0 0 0 0 0 0 0 0 0 0 0 0 0
$$ ##$ShimPowRng3= (0..63)
$$ 1 1 1 1 1 1 1 1 1 1 1 1 1 1 1 1 1 1 1 1 1 1 1 1 1 1 1 1 1 1 1 1 1 1 1 1
$$ 1 1 1 1 0 0 0 0 0 0 0 0 0 0 0 0 0 0 0 0 0 0 0 0 0 0 0 0
$$ ##$ShimPowType1= 8
$$ ##$ShimPowType2= 8
$$ ##$ShimPowType3= 0
$$ ##$ShimPowType4= 0
$$ ##$ShimPowType5= 0
$$ ##$ShimPowType6= 0
$$ ##$ShimPowType7= 0
$$ ##$ShimPowType8= 0
$$ ##$ShimSysActGrad= (0..63)
$$ 1 2 3 4 13 5 7 11 10 9 6 8 12 18 19 20 21 15 22 23 24 14 25 16 26 17 27
$$ 28 31 32 33 34 35 36 37 38 0 0 0 0 0 0 0 0 0 0 0 0 0 0 0 0 0 0 0 0 0 0
$$ 0 0 0 0 0 0
$$ ##$ShimSysAngle= <>
$$ ##$ShimSysFunc= (0..63)
$$ 1 2 3 4 5 6 7 8 9 10 0 37 38 35 16 15 14 13 12 11 28 27 26 25 24 23 36
$$ 22 30 29 20 21 34 33 32 31 17 18 19 0 0 0 0 0 0 0 0 0 0 0 0 0 0 0 0 0 0
$$ 0 0 0 0 0 0 0
$$ ##$ShimSysMatId= <292722ba.dat>
$$ ##$ShimSysMatrix= 1
$$ ##$ShimSysMinMaxUG= 130000
$$ ##$ShimSysOffset= <58 mm>
$$ ##$ShimSysType= 4
$$ ##$ShimUnit= 3
$$ ##$SpectrOsVersion= <4.1.156.20210628>
$$ ##$TCubeEth= <192.168.180.18>
$$ ##$TCubeSeqDevice= <>
$$ ##$TOSITY= <no>
$$ ##$TRIPLO2= 0
$$ ##$TopSpinVersion= <TopSpin 4.1.3>
$$ ##$TrxFreqFormula= (0..23)
$$ <TrxFreqFormula(2.0,500130000.000000,'TRX',Trx(1.0,'TRX 1200.1',2,5.000000,1290.000000))>
$$ <TrxFreqFormula(2.0,500130000.000000,'TRX',Trx(1.0,'TRX 1200.2',2,5.000000,1290.000000))>
$$ <> <> <> <> <> <> <> <> <> <> <> <> <> <> <> <> <> <> <> <> <> <>
$$ ##$TrxPN= (0..23)
$$ <Z148391> <Z148391> <> <> <> <> <> <> <> <> <> <> <> <> <> <> <> <> <>
$$ <> <> <> <> <>
$$ ##$TrxSN= (0..23)
$$ <05365> <05364> <> <> <> <> <> <> <> <> <> <> <> <> <> <> <> <> <> <> <>
$$ <> <> <>
$$ ##$VCubeEth= (0..23)
$$ <no> <no> <no> <no> <no> <no> <no> <no> <no> <no> <no> <no> <no> <no> <no>
$$ <no> <no> <no> <no> <no> <no> <no> <no> <no>
$$ ##$VTU= 2
$$ ##$VTUETH= <192.168.99.10>
$$ ##$VTUTY= <no>
$$ ##$ValueLine= no
$$ ##$VpuPN= (0..23)
$$ <no> <no> <no> <no> <no> <no> <no> <no> <no> <no> <no> <no> <no> <no> <no>
$$ <no> <no> <no> <no> <no> <no> <no> <no> <no>
$$ ##$VpuSN= (0..23)
$$ <no> <no> <no> <no> <no> <no> <no> <no> <no> <no> <no> <no> <no> <no> <no>
$$ <no> <no> <no> <no> <no> <no> <no> <no> <no>
$$ ##$WBREFAM= (0..31)
$$ 99.9 100 100 100 100 100 100 100 100 100 100 100 100 100 100 100 100 100
$$ 100 100 100 100 100 100 100 100 100 100 100 100 100 100
$$ ##$WBREFLM= (0..31)
$$ 2 0 0 0 0 0 0 0 0 0 0 0 0 0 0 0 0 0 0 0 0 0 0 0 0 0 0 0 0 0 0 0
$$ ##$WBREFPH= (0..31)
$$ 0.91 0 0 0 0 0 0 0 0 0 0 0 0 0 0 0 0 0 0 0 0 0 0 0 0 0 0 0 0 0 0 0
$$ ##$WBSGU= (0..31)
$$ 1 1 2 0 0 0 0 0 0 0 0 0 0 0 0 0 0 0 0 0 0 0 0 0 0 0 0 0 0 0 0 0
$$ ##END=
$$ 
##$DECIM=	2000
##$DSPFVS=	21
##XUNITS=	HZ
##YUNITS=	ARBITRARY UNITS
##FIRSTX=	8088.3024120000009134
##LASTX=	-1911.5450001093649917
##DELTAX=	-0.15258789062499986122
##XFACTOR=	1
##YFACTOR=	312.17316202276680315
##FIRSTY=	358.31097412109375
##MINY=	-797.1419677734375
##MAXY=	10228978
##NPOINTS=	65536
##XYDATA=	(X++(Y..Y))
$$ [...]
6301B%%jJ%JJ%j%j%j%%j%J%%%Jj%%%Jj%%%%%%jKJj%%%%J%k%%j%%%%%JJj%%%jJKj%%%%j%jJ
6290A%JjJ%%%%j%%%%jJ%%%%jJ%%Jj%%Jj%j%%Jj%%%Kj%%%%%Jj%j%jJJ%J%%%%j%%%JjjJJ%%%
6279B%Jjj%jJj%JJJjj%%jjjJJ%J%J%j%%JJ%j%j%%%j%%%%%%%J%%%J%j%%%%J%%%%%%k%%K%j%
6268A%jJJj%%J%%%%%%%%j%%%J%%%%%jjJ%%%K%jjJk%%Jjj%%%%JjKJj%j%%J%%j%J%j%JJ%J%j
6257Bj%%%J%%%jJ%j%%%%jJ%%%%J%%%%Jj%Jj%%%%%%j%%%%%J%%J%j%%Jj%%j%%%%%%%%jjJ%J%
6247AjJ%%%%%JJj%%%%%j%%Jjjj%J%%JJj%J%%j%%j%%%%J%%j%%%%%%J%J%%j%j%JJj%j%%J%%%
6236Ak%KjjJ%J%%%JJj%j%Jk%JKk%J%jJ%%%%J%%%jj%JJjjJ%%%%j%jJJJj%jJ%%%%jjJ%%J%%J
6225CjjJ%%%%%J%%%jj%%%%%J%J%%j%j%%%%%J%%%%jj%J%%J%j%%%%%jJ%%%j%%JJ%%j%%K%jjJ
$$ plain form
6301 2 2 2 1 2 2 3 4 4 3 3 2 2 1 1 1 0 0 1 1 1 1 2 1 1 1 1 2 1 1 1 1 1 1 1 0 2 3 2 2 2 2 2 3 3 1 1 1 0 0 0 0 0 0 1 2 1 1 1 1 0 1 3 2 2 2 2 2 1 1 0 1
6290 1 1 2 1 2 2 2 2 2 1 1 1 1 1 0 1 1 1 1 1 0 1 1 1 2 1 1 1 2 1 1 0 0 0 1 0 0 0 0 2 1 1 1 1 1 1 2 1 1 0 0 -1 0 1 1 2 2 2 2 2 1 1 1 1 2 1 0 1 2 2 2 2
6279 2 2 3 2 1 1 0 1 0 0 1 2 3 2 1 1 1 0 -1 -2 -1 0 0 1 1 2 2 1 1 1 2 3 3 2 2 1 1 1 1 0 0 0 0 0 0 0 0 1 1 1 1 2 2 1 1 1 1 1 2 2 2 2 2 2 2 0 0 0 2 2 1 1
6268 1 1 0 1 2 1 1 1 2 2 2 2 2 2 2 2 2 1 1 1 1 2 2 2 2 2 2 1 0 1 1 1 1 3 3 2 1 2 0 0 0 1 0 -1 -1 -1 -1 -1 0 -1 1 2 1 1 0 0 0 1 1 1 0 0 1 1 0 0 1 2 2 3 3 2
6257 2 1 1 1 1 2 2 2 2 1 2 2 1 1 1 1 1 0 1 1 1 1 1 2 2 2 2 2 3 2 2 3 2 2 2 2 2 2 2 1 1 1 1 1 1 2 2 2 3 3 2 2 2 3 2 2 2 1 1 1 1 1 1 1 1 1 0 -1 0 0 1 1
6247 1 0 1 1 1 1 1 1 2 3 2 2 2 2 2 2 1 1 1 2 1 0 -1 -1 0 0 0 1 2 1 1 2 2 2 1 1 1 0 0 0 0 0 1 1 1 0 0 0 0 0 0 0 1 1 2 2 2 1 1 0 0 1 2 1 1 0 0 0 1 1 1 1
6236 1 -1 -1 1 0 -1 0 0 1 1 1 1 2 3 2 2 1 1 2 0 0 1 3 1 1 2 2 1 2 2 2 2 2 3 3 3 3 2 1 1 2 3 2 1 2 2 2 2 2 1 1 0 1 2 3 2 2 1 2 2 2 2 2 1 0 1 1 1 2 2 2 3
6225 3 2 1 2 2 2 2 2 2 3 3 3 3 2 1 1 1 1 1 1 2 2 3 3 3 2 2 1 1 1 1 1 1 2 2 2 2 2 1 0 0 1 1 1 2 2 1 1 1 1 1 1 0 1 1 1 1 0 0 0 1 2 2 2 1 1 1 3 3 2 1 2
6214B%%J%%%%%%jjJ%%%%j%%jJ%Jj%j%J%JJjj%%%%%%%%%%j%%%%jJj%JK%jj%%J%%%JJj%%Jjj
6203A%%Jj%J%j%jJJ%%jjJJ%jkJJ%%%%%j%JJ%jJJ%jj%%%%Jj%%J%%%%J%%j%%%%j%%%%%%%%jJ
6192AJ%jJ%%%jj%J%%J%jj%j%%%j%%KJ%%%j%%%J%%%jJ%%jJ%%j%%J%%%%J%J%j%%k%%%J%%J%j
6182A%%%%%j%%%%JJj%JjjJJ%%%jj%%J%J%%%%j%%%%%%JjjJJ%jK%j%j%%%J%j%Jjj%%J%%%%Jj
6171A%%%%%JJjjJ%%%%%%%%%J%j%%%%%%J%%jjj%%J%J%j%%%j%%JJ%%%j%%J%Jjk%%JJ%%%jj%%
6160@KJj%j%%%jJ%J%%jj%J%J%%%j%j%%JJ%J%%%%j%%jjJ%%JJj%jjJ%J%j%%%%%J%%%j%%jJJj
6149A%J%%%%j%J%jJ%%j%J%%%%%%%%%j%%%%J%j%%Jj%%jJJ%%%%%j%%J%%j%%%%%JjjJ%J%%Jj%
6138Bj%%%j%%%%jJJ%%%%%%%%%J%%%%%k%J%%%J%%%%%%%kjJ%%JKj%j%%%%J%%j%%jJ%%%J%jj%
$$ plain form
6214 2 2 2 3 3 3 3 3 3 3 2 1 2 2 2 2 2 1 1 1 0 1 1 2 1 1 0 0 1 1 2 3 2 1 1 1 1 1 1 1 1 1 1 1 0 0 0 0 0 -1 0 -1 -1 0 2 2 1 0 0 0 1 1 1 1 2 3 2 2 2 3 2 1
6203 1 1 1 2 1 1 2 2 1 1 0 1 2 2 2 1 0 1 2 2 1 -1 0 1 1 1 1 1 1 0 0 1 2 2 1 2 3 3 2 1 1 1 1 1 2 1 1 1 2 2 2 2 2 3 3 3 2 2 2 2 2 1 1 1 1 1 1 1 1 1 0 1
6192 1 2 2 1 2 2 2 2 1 0 0 1 1 1 2 2 1 0 0 -1 -1 -1 -1 -2 -2 -2 0 1 1 1 1 0 0 0 0 1 1 1 1 0 1 1 1 0 1 1 1 0 0 0 1 1 1 1 1 2 2 3 3 2 2 2 0 0 0 0 1 1 1 2 2 1
6182 1 1 1 1 1 1 0 0 0 0 0 1 2 1 1 2 1 0 1 2 2 2 2 1 0 0 0 1 1 2 2 2 2 2 1 1 1 1 1 1 1 2 1 0 1 2 2 1 3 3 2 2 1 1 1 1 2 2 1 1 2 1 0 0 0 1 1 1 1 1 2 1
6171 1 1 1 1 1 1 2 3 2 1 2 2 2 2 2 2 2 2 2 2 3 3 2 2 2 2 2 2 2 3 3 3 2 1 0 0 0 1 1 2 2 1 1 1 1 0 0 0 1 2 2 2 2 1 1 1 2 2 3 2 0 0 0 1 2 2 2 2 1 0 0 0
6160 0 2 3 2 2 1 1 1 1 0 1 1 2 2 2 1 0 0 1 1 2 2 2 2 1 1 0 0 0 1 2 2 3 3 3 3 3 2 2 2 1 0 1 1 1 2 3 2 2 1 0 1 1 2 2 1 1 1 1 1 1 2 2 2 2 1 1 1 0 1 2 1
6149 1 1 2 2 2 2 2 1 1 2 2 1 2 2 2 1 1 2 2 2 2 2 2 2 2 2 2 1 1 1 1 1 2 2 1 1 1 2 1 1 1 0 1 2 2 2 2 2 2 1 1 1 2 2 2 1 1 1 1 1 1 2 1 0 1 1 2 2 2 3 2 2
6138 2 1 1 1 1 0 0 0 0 0 -1 0 1 1 1 1 1 1 1 1 1 1 2 2 2 2 2 2 0 0 1 1 1 1 2 2 2 2 2 2 2 2 0 -1 0 0 0 1 3 2 2 1 1 1 1 1 2 2 2 1 1 1 0 1 1 1 1 2 2 1 0 0
6127@J%jJ%%Jjj%%%Jjj%JJKj%%j%%%%%Jj%%Jj%j%%J%%%%%J%%%jJJjj%%j%%%J%%%%JjjJ%%j
6117@%%%%%%Jj%%J%J%%%jjJ%%%J%j%%J%Jjj%Jj%%%%%%%%J%j%%%%%j%%J%%%JJJ%%jkj%jJ%J
6106A%j%%%%J%jJ%J%j%%%%%%%%JJ%jJ%%j%%%%j%%%K%%j%%%%jJ%j%%%%%%j%JJJj%jJJ%%j%%
6095B%%%%J%k%J%%jJ%%Jj%%%%%%jj%J%J%%%j%%%%J%%j%%Jj%j%%Jj%%%J%%%%J%%%jjJJ%jj%
6084@J%%J%jkJJ%%j%J%%%%Jj%%%Jj%j%%%%J%JJj%%jJ%%jjJ%%Jj%%%%%%%j%J%%jJ%%J%Jj%%
6073Bj%%%%%j%%J%%%%%%%%%%%%%%%%%J%%%j%j%J%%%%J%%%%jJ%kJK%jjj%JJ%%%%j%%%J%J%%
6062Cj%%j%%%J%%%j%JJj%%%%%%%J%%%j%%%J%jj%J%j%%J%%j%%j%%J%%J%%%%j%%%%%Jj%%%%%
6052A%%%%%%%j%J%%%jJ%%%%jJJ%%jjJ%JJ%jj%%%%%%j%%JJ%%%%%Jjj%%%J%J%j%jJ%j%%%%%%
$$ plain form
6127 0 1 1 0 1 1 1 2 1 0 0 0 0 1 0 -1 -1 0 1 3 2 2 2 1 1 1 1 1 1 2 1 1 1 2 1 1 0 0 0 1 1 1 1 1 1 2 2 2 2 1 2 3 2 1 1 1 0 0 0 0 1 1 1 1 1 2 1 0 1 1 1 0
6117 0 0 0 0 0 0 0 1 0 0 0 1 1 2 2 2 2 1 0 1 1 1 1 2 2 1 1 1 2 2 3 2 1 1 2 1 1 1 1 1 1 1 1 1 2 2 1 1 1 1 1 1 0 0 0 1 1 1 1 2 3 4 4 4 3 1 0 0 -1 0 0 1
6106 1 1 0 0 0 0 0 1 1 0 1 1 2 2 1 1 1 1 1 1 1 1 1 2 3 3 2 3 3 3 2 2 2 2 2 1 1 1 1 3 3 3 2 2 2 2 2 1 2 2 1 1 1 1 1 1 1 0 0 1 2 3 2 2 1 2 3 3 3 2 2 2
6095 2 2 2 2 2 3 3 1 1 2 2 2 1 2 2 2 3 2 2 2 2 2 2 2 1 0 0 1 1 2 2 2 2 1 1 1 1 1 2 2 2 1 1 1 2 1 1 0 0 0 1 0 0 0 0 1 1 1 1 1 2 2 2 2 1 0 1 2 2 1 0 0
6084 0 1 1 1 2 2 1 -1 0 1 1 1 0 0 1 1 1 1 1 2 1 1 1 1 2 1 1 0 0 0 0 0 1 1 2 3 2 2 2 1 2 2 2 1 0 1 1 1 2 1 1 1 1 1 1 1 1 0 0 1 1 1 0 1 1 1 2 2 3 2 2 2
6073 2 1 1 1 1 1 1 0 0 0 1 1 1 1 1 1 1 1 1 1 1 1 1 1 1 1 1 1 2 2 2 2 1 1 0 0 1 1 1 1 1 2 2 2 2 2 1 2 2 0 1 3 3 2 1 0 0 1 2 2 2 2 2 1 1 1 1 2 2 3 3 3
6062 3 2 2 2 1 1 1 1 2 2 2 2 1 1 2 3 2 2 2 2 2 2 2 2 3 3 3 3 2 2 2 2 3 3 2 1 1 2 2 1 1 1 2 2 2 1 1 1 0 0 0 1 1 1 2 2 2 2 2 1 1 1 1 1 1 2 1 1 1 1 1 1
6052 1 1 1 1 1 1 1 1 0 0 1 1 1 1 0 1 1 1 1 1 0 1 2 2 2 1 0 1 1 2 3 3 2 1 1 1 1 1 1 1 0 0 0 1 2 2 2 2 2 2 3 2 1 1 1 1 2 2 3 3 2 2 1 2 2 1 1 1 1 1 1 1
6041Aj%%%%J%jjJJ%jJ%%%%%%%%%j%%%%J%%%%J%%%j%%%%J%%j%%%%%%%%j%J%%j%JJ%%%j%%%%
6030A%%J%%j%J%%%Jj%%j%jJJj%%J%%%j%jJJJj%%Jj%%%%J%%%jk%%%J%%%j%%JJ%j%%%Jjj%J%
6019AJJ%%%j%j%%%%%%j%%JJj%j%%%%K%jjJJ%%%%%j%%j%J%Jj%J%%%%Jjj%%%J%J%%j%%%%jJ%
6008B%Jjj%%%%%%J%%%%%j%%J%%%jjJ%J%j%%%%%%j%%%%KJj%Jj%%%%j%%%%%%%%%%%%%%%jJ%%
5997A%%%%J%%kJ%Jj%%Jj%Jj%Kj%%j%J%%%jJ%%j%jJJ%Jj%%%j%%Jj%%%%%%%%%K%kj%Jj%%J%J
5987B%%jjJJ%%%j%%j%KJjjJ%%jJ%%%%%jjJ%JJjj%%%%%J%j%%%J%%%%%%%j%%J%%%%jJJ%j%j%
5976A%%%JJj%%%J%j%%%%j%J%%%%%%%%j%%J%%jJj%j%JJ%jJ%%%jj%j%JJ%j%J%J%j%%%%%%%%%
5965A%%%J%%%%j%%%%jJJj%jJ%%j%JJ%%%%%jJ%%j%%%j%%J%Jj%J%jj%J%%%%J%%%%jjJJj%%%%
$$ plain form
6041 1 0 0 0 0 0 1 1 0 -1 0 1 1 0 1 1 1 1 1 1 1 1 1 1 0 0 0 0 0 1 1 1 1 1 2 2 2 2 1 1 1 1 1 2 2 2 1 1 1 1 1 1 1 1 1 0 0 1 1 1 0 0 1 2 2 2 2 1 1 1 1 1
6030 1 1 1 2 2 2 1 1 2 2 2 2 3 2 2 2 1 1 0 1 2 1 1 1 2 2 2 2 1 1 0 1 2 3 2 2 2 3 2 2 2 2 2 3 3 3 3 2 0 0 0 0 1 1 1 1 0 0 0 1 2 2 1 1 1 1 2 1 0 0 1 1
6019 1 2 3 3 3 3 2 2 1 1 1 1 1 1 1 0 0 0 1 2 1 1 0 0 0 0 0 2 2 1 0 1 2 2 2 2 2 2 1 1 1 0 0 1 1 2 1 1 2 2 2 2 2 3 2 1 1 1 1 2 2 3 3 3 2 2 2 2 2 1 2 2
6008 2 2 3 2 1 1 1 1 1 1 1 2 2 2 2 2 2 1 1 1 2 2 2 2 1 0 1 1 2 2 1 1 1 1 1 1 1 0 0 0 0 0 2 3 2 2 3 2 2 2 2 2 1 1 1 1 1 1 1 1 1 1 1 1 1 1 1 1 0 1 1 1
5997 1 1 1 1 1 2 2 2 0 1 1 2 1 1 1 2 1 1 2 1 1 3 2 2 2 1 1 2 2 2 2 1 2 2 2 1 1 0 1 2 2 3 2 2 2 2 1 1 1 2 1 1 1 1 1 1 1 1 1 1 3 3 1 0 0 1 0 0 0 1 1 2
5987 2 2 2 1 0 1 2 2 2 2 1 1 1 0 0 2 3 2 1 2 2 2 1 2 2 2 2 2 2 1 0 1 1 2 3 2 1 1 1 1 1 1 2 2 1 1 1 1 2 2 2 2 2 2 2 2 1 1 1 2 2 2 2 2 1 2 3 3 2 2 1 1
5976 1 1 1 1 2 3 2 2 2 2 3 3 2 2 2 2 2 1 1 2 2 2 2 2 2 2 2 2 1 1 1 2 2 2 1 2 1 1 0 0 1 2 2 1 2 2 2 2 1 0 0 -1 -1 0 1 1 0 0 1 1 2 2 1 1 1 1 1 1 1 1 1 1
5965 1 1 1 1 2 2 2 2 2 1 1 1 1 1 0 1 2 1 1 0 1 1 1 0 0 1 2 2 2 2 2 2 1 2 2 2 1 1 1 1 0 0 0 1 1 2 1 1 2 2 1 0 0 1 1 1 1 1 2 2 2 2 2 1 0 1 2 1 1 1 1 1
5954AJ%Jjj%%j%%jJJJ%%%%jjJj%J%%%jJ%%%jJJkjJ%%%JJ%%j%j%%%J%%%J%%j%%%%%JjJ%k%%
5943@%J%J%%%%%%%%%%%j%%Jj%%J%%%%%%jJ%jj%j%J%%JJ%%%%%JjjjjJJ%%J%%%j%%Jj%%jJJ%
5932B%%%%j%%%%JJ%%%%jj%J%%%%Jj%jJJ%%%Jj%%jJJj%%%jj%%j%%JJ%%J%%jJj%Jj%%j%%Jj%
5922A%jJJ%%%j%%%%%%%%%%J%%j%J%%%J%j%%%j%J%%%j%%%J%k%J%%%j%%%%%JJjJ%%jJ%%J%%%
5911CJ%%jjj%%%%%%j%J%J%J%%%j%%j%%%%%%%%J%J%%j%%%j%%jJ%%jjJ%%%J%%J%%j%%%%%%%%
5900AJ%%jJJjj%%%JjjJ%%j%j%%%J%J%%%JJj%%j%%%J%%j%%%jJj%J%%jj%%J%JJjjjKJ%%Jj%j
5889A%%%%%%J%%%%jj%%%%%%J%%%%jJJ%j%%%%%%%%J%%%%%%%%jj%JJ%j%%J%Jj%%%%%%%j%%%%
5878A%%%%%Jj%jJ%%jJ%%J%%%%J%Jkj%%%J%%j%%J%j%%%%Jj%Jj%jJ%%%%%%%%%%%%J%%j%jj%K
$$ plain form
5954 1 2 2 3 2 1 1 1 0 0 0 -1 0 1 2 2 2 2 2 1 0 1 0 0 1 1 1 1 0 1 1 1 1 0 1 2 0 -1 0 0 0 0 1 2 2 2 1 1 0 0 0 0 1 1 1 1 2 2 2 1 1 1 1 1 1 2 1 2 2 0 0 0
5943 0 0 1 1 2 2 2 2 2 2 2 2 2 2 2 2 1 1 1 2 1 1 1 2 2 2 2 2 2 2 1 2 2 1 0 0 -1 -1 0 0 0 1 2 2 2 2 2 2 3 2 1 0 -1 0 1 1 1 2 2 2 2 1 1 1 2 1 1 1 0 1 2 2
5932 2 2 2 2 2 1 1 1 1 1 2 3 3 3 3 3 2 1 1 2 2 2 2 2 3 2 2 1 2 3 3 3 3 4 3 3 3 2 3 4 3 3 3 3 2 1 1 1 0 0 0 1 2 2 2 3 3 3 2 3 2 2 3 2 2 2 1 1 1 2 1 1
5922 1 1 0 1 2 2 2 2 1 1 1 1 1 1 1 1 1 1 1 2 2 2 1 1 2 2 2 2 3 3 2 2 2 2 1 1 2 2 2 2 1 1 1 1 2 2 0 0 1 1 1 1 0 0 0 0 0 0 1 2 1 2 2 2 1 2 2 2 3 3 3 3
5911 3 4 4 4 3 2 1 1 1 1 1 1 1 0 0 1 1 2 2 3 3 3 3 2 2 2 1 1 1 1 1 1 1 1 1 2 2 3 3 3 2 2 2 2 1 1 1 0 1 1 1 0 -1 0 0 0 0 1 1 1 2 2 2 1 1 1 1 1 1 1 1 1
5900 1 2 2 2 1 2 3 2 1 1 1 1 2 1 0 1 1 1 0 0 -1 -1 -1 -1 0 0 1 1 1 1 2 3 2 2 2 1 1 1 1 2 2 2 1 1 1 1 0 1 0 0 1 1 1 0 -1 -1 -1 0 0 1 2 1 0 -1 1 2 2 2 3 2 2 1
5889 1 1 1 1 1 1 1 2 2 2 2 2 1 0 0 0 0 0 0 0 1 1 1 1 1 0 1 2 2 1 1 1 1 1 1 1 1 1 2 2 2 2 2 2 2 2 2 1 0 0 1 2 2 1 1 1 2 2 3 2 2 2 2 2 2 2 2 1 1 1 1 1
5878 1 1 1 1 1 1 2 1 1 0 1 1 1 0 1 1 1 2 2 2 2 2 3 3 4 2 1 1 1 1 2 2 2 1 1 1 2 2 1 1 1 1 1 2 1 1 2 1 1 0 1 1 1 1 1 1 1 1 1 1 1 1 1 2 2 2 1 1 0 -1 -1 1
5867A%%%%%J%%J%jj%%J%%j%%%%%%J%jJ%%j%%%jJ%%%%%Jj%jJ%J%%%%jJ%jjJ%%j%K%%j%%j%%
5857@J%Kj%j%%J%%j%%J%%%%Jj%j%%%%%%%j%%J%%JJ%j%jJ%%%%%%j%%%j%J%%%%%%%%%%JJ%%%
5846CjJ%%%j%%j%%%J%%%j%J%%jj%J%jJ%%%%J%%j%%%%%%%J%j%%J%%j%%%%j%%J%%Jj%%%%J%%
5835Bj%j%J%%%%JJ%%%%%%j%%%%%%j%%%%%%%J%j%%%J%%%%%%%%jJ%%%j%%JjJ%j%%%%%%%J%%%
5824B%j%%Jj%%J%%j%%%j%%J%%%%%%%j%J%J%%%J%%j%%%%j%Jj%%%%jJ%%JjjJJ%%%j%j%%JJ%%
5813BK%jjjJ%j%%JJ%j%j%%%j%%JJ%%Jjj%j%JJ%j%%J%%j%%J%%%j%%jJ%jjJJjj%JjJJJjJ%%%
5802B%%%j%J%%%%%jjJ%%%j%%J%%%J%j%jJ%%%J%%jJjjJ%%%%Jj%J%j%%%%J%%%j%%%J%j%J%%%
5792B%j%j%K%j%%%%%%%%j%J%%J%Jj%%%j%%%J%%%j%%%JJ%%%jjJjj%KJ%jj%J%%%%j%%%J%j%J
$$ plain form
5867 1 1 1 1 1 1 2 2 2 3 3 2 1 1 1 2 2 2 1 1 1 1 1 1 1 2 2 1 2 2 2 1 1 1 1 0 1 1 1 1 1 1 2 1 1 0 1 1 2 2 2 2 2 1 2 2 1 0 1 1 1 0 0 2 2 2 1 1 1 0 0 0
5857 0 1 1 3 2 2 1 1 1 2 2 2 1 1 1 2 2 2 2 2 3 2 2 1 1 1 1 1 1 1 1 0 0 0 1 1 1 2 3 3 2 2 1 2 2 2 2 2 2 2 1 1 1 1 0 0 1 1 1 1 1 1 1 1 1 1 1 2 3 3 3 3
5846 3 2 3 3 3 3 2 2 2 1 1 1 1 2 2 2 2 1 1 2 2 2 1 0 0 1 1 0 1 1 1 1 1 2 2 2 1 1 1 1 1 1 1 1 2 2 1 1 1 2 2 2 1 1 1 1 1 0 0 0 1 1 1 2 1 1 1 1 1 2 2 2
5835 2 1 1 0 0 1 1 1 1 1 2 3 3 3 3 3 3 3 2 2 2 2 2 2 2 1 1 1 1 1 1 1 1 2 2 1 1 1 1 2 2 2 2 2 2 2 2 2 1 2 2 2 2 1 1 1 2 1 2 2 1 1 1 1 1 1 1 1 2 2 2 2
5824 2 2 1 1 1 2 1 1 1 2 2 2 1 1 1 1 0 0 0 1 1 1 1 1 1 1 1 0 0 1 1 2 2 2 2 3 3 3 2 2 2 2 2 1 1 2 1 1 1 1 1 0 1 1 1 2 1 0 1 2 2 2 2 1 1 0 0 0 1 2 2 2
5813 2 4 4 3 2 1 2 2 1 1 1 2 3 3 2 2 1 1 1 1 0 0 0 1 2 2 2 3 2 1 1 0 0 1 2 2 1 1 1 2 2 2 1 1 1 2 2 2 2 1 1 1 0 1 1 0 -1 0 1 0 -1 -1 0 -1 0 1 2 1 2 2 2 2
5802 2 2 2 2 1 1 2 2 2 2 2 2 1 0 1 1 1 1 0 0 0 1 1 1 1 2 2 1 1 0 1 1 1 1 2 2 2 1 2 1 0 1 1 1 1 1 2 1 1 2 2 1 1 1 1 1 2 2 2 2 1 1 1 1 2 2 1 1 2 2 2 2
5792 2 2 1 1 0 0 2 2 1 1 1 1 1 1 1 1 1 0 0 1 1 1 2 2 3 2 2 2 2 1 1 1 1 2 2 2 2 1 1 1 1 2 3 3 3 3 2 1 2 1 0 0 2 3 3 2 1 1 2 2 2 2 2 1 1 1 1 2 2 1 1 2
5781BJ%%%%j%J%j%j%%Jj%%J%%%%%j%%%%%J%%%jJ%%%%jjJ%%JJ%%k%%%%%%%jK%%%Jjj%jJ%%J
5770Bjj%K%%j%%jJ%%%%%%Jjj%%%%J%%J%Jj%%%JJ%%%j%%jj%%%%%%%J%j%%%%J%j%%%J%J%%jj
5759A%j%J%J%%j%%%J%%jJJ%%jj%J%j%%%%JJJj%j%j%Jjj%%%%%J%%%%%%JJ%%%%%jkjJ%%%%J%
5748AjjJJJJ%j%%%j%J%J%Jj%j%jj%%J%%J%%%j%j%%%%%%KJj%j%jJK%j%%%%Jj%%%jj%J%J%%j
5737Aj%JjJ%jJjjJJ%%jJJj%%%%%j%J%%j%%JJjjJj%%J%%%%%%%%JJjj%%%Jj%j%%J%JjJ%%%%%
5727BJ%j%jjJJ%Jj%%%%j%J%%jJ%%%J%%%%j%%%%jJ%%Jj%%%%jjJ%%j%%JJ%%J%J%%jj%%%%%%j
5716A%%%%%J%j%%%%jJ%JJ%%j%%Jj%j%%%%J%Jj%%%j%%J%J%j%j%%%%JJj%%%j%jJ%%j%%%%J%J
5705Bj%%j%%%J%%JJj%%j%%%J%%%%%%%Jj%%%%%%J%j%j%J%%%%%Jjj%JjjJ%%%%%%%%%%%j%J%%
$$ plain form
5781 2 3 3 3 3 3 2 2 3 3 2 2 1 1 1 2 1 1 1 2 2 2 2 2 2 1 1 1 1 1 1 2 2 2 2 1 2 2 2 2 2 1 0 1 1 1 2 3 3 3 1 1 1 1 1 1 1 1 0 2 2 2 2 3 2 1 1 0 1 1 1 2
5770 2 1 0 0 2 2 2 1 1 1 0 1 1 1 1 1 1 1 2 1 0 0 0 0 0 1 1 1 2 2 3 2 2 2 2 3 4 4 4 4 3 3 3 2 1 1 1 1 1 1 1 1 2 2 1 1 1 1 1 2 2 1 1 1 1 2 2 3 3 3 2 1
5759 1 1 0 0 1 1 2 2 2 1 1 1 1 2 2 2 1 2 3 3 3 2 1 1 2 2 1 1 1 1 1 2 3 4 3 3 2 2 1 1 2 1 0 0 0 0 0 0 1 1 1 1 1 1 1 2 3 3 3 3 3 3 2 0 -1 0 0 0 0 0 1 1
5748 1 0 -1 0 1 2 3 3 2 2 2 2 1 1 2 2 3 3 4 3 3 2 2 1 0 0 0 1 1 1 2 2 2 2 1 1 0 0 0 0 0 0 0 2 3 2 2 1 1 0 1 3 3 2 2 2 2 2 3 2 2 2 2 1 0 0 1 1 2 2 2 1
5737 1 0 0 1 0 1 1 0 1 0 -1 0 1 1 1 0 1 2 1 1 1 1 1 1 0 0 1 1 1 0 0 0 1 2 1 0 1 0 0 0 1 1 1 1 1 1 1 1 1 2 3 2 1 1 1 1 2 1 1 0 0 0 1 1 2 1 2 2 2 2 2 2
5727 2 3 3 2 2 1 0 1 2 2 3 2 2 2 2 2 1 1 2 2 2 1 2 2 2 2 3 3 3 3 3 2 2 2 2 2 1 2 2 2 3 2 2 2 2 2 1 0 1 1 1 0 0 0 1 2 2 2 3 3 4 4 4 3 2 2 2 2 2 2 2 1
5716 1 1 1 1 1 1 2 2 1 1 1 1 1 0 1 1 2 3 3 3 2 2 2 3 2 2 1 1 1 1 1 2 2 3 2 2 2 2 1 1 1 2 2 3 3 2 2 1 1 1 1 1 2 3 2 2 2 2 1 1 0 1 1 1 0 0 0 0 0 1 1 2
5705 2 1 1 1 0 0 0 0 1 1 1 2 3 2 2 2 1 1 1 1 2 2 2 2 2 2 2 2 3 2 2 2 2 2 2 2 3 3 2 2 1 1 2 2 2 2 2 2 3 2 1 1 2 1 0 1 1 1 1 1 1 1 1 1 1 1 1 0 0 1 1 1
5694A%JJj%%j%J%%%%%J%%%%j%%Jjj%%%%%%j%%Jj%JJ%%%%%Jj%jj%%%%%J%%%%%%j%JJjj%J%%
5683AJj%%%J%%%%%%%%j%%%JJ%%jj%j%J%J%%j%j%J%J%%%%j%J%%%Jjjj%%Jj%%%J%%%j%JJ%k%
5672@%J%%%jJ%%j%Kj%%jjJJ%%%%%%J%%%j%J%j%%%%%J%%%%%J%j%j%%j%%J%%J%%%%%j%%%jJ%
5662A%%%%%%%%%J%%%%%%%%%jJ%%j%J%%%j%%%J%%%j%%%%%%jJj%%%J%%J%J%j%%%%%j%jjJJJ%
5651B%%%jj%J%%JJ%%j%J%j%%%%%%%%J%J%%%%jj%%%jJ%%%j%%%%%JJ%%jjj%%J%jJ%%Jj%j%JJ
5640Bj%%Jj%%%%%%%JJkj%JJ%%j%%%%%%j%%JjJ%%%%%jJ%%J%J%%%j%j%%%%JJ%jj%%%%%%%jJ%
5629AJ%%%jJ%JkJ%J%%%j%%%%j%%%j%J%%%J%%%jJ%J%%%%%j%%%%%%%%%%%%J%jj%J%%JjjJ%%j
5618A%%%%%%%%%%%%%J%%%%%J%J%%j%%%%jK%j%jj%%%J%jJJjj%%%%J%%%j%%J%%%jJj%%%%J%J
$$ plain form
5694 1 1 2 3 2 2 2 1 1 2 2 2 2 2 2 3 3 3 3 3 2 2 2 3 2 1 1 1 1 1 1 1 0 0 0 1 0 0 1 2 2 2 2 2 2 3 2 2 1 0 0 0 0 0 0 1 1 1 1 1 1 1 0 0 1 2 1 0 0 1 1 1
5683 1 2 1 1 1 1 2 2 2 2 2 2 2 2 2 1 1 1 1 2 3 3 3 2 1 1 0 0 1 1 2 2 2 1 1 0 0 1 1 2 2 2 2 2 1 1 2 2 2 2 3 2 1 0 0 0 1 0 0 0 0 1 1 1 1 0 0 1 2 2 0 0
5672 0 0 1 1 1 1 0 1 1 1 0 0 2 1 1 1 0 -1 0 1 1 1 1 1 1 1 2 2 2 2 1 1 2 2 1 1 1 1 1 1 2 2 2 2 2 2 3 3 2 2 1 1 1 0 0 0 1 1 1 2 2 2 2 2 2 1 1 1 1 0 1 1
5662 1 1 1 1 1 1 1 1 1 1 2 2 2 2 2 2 2 2 2 2 1 2 2 2 1 1 2 2 2 2 1 1 1 1 2 2 2 2 1 1 1 1 1 1 1 0 1 0 0 0 0 1 1 1 2 2 3 3 2 2 2 2 2 2 1 1 0 -1 0 1 2 2
5651 2 2 2 2 1 0 0 1 1 1 2 3 3 3 2 2 3 3 2 2 2 2 2 2 2 2 2 3 3 4 4 4 4 4 3 2 2 2 2 1 2 2 2 2 1 1 1 1 1 1 2 3 3 3 2 1 0 0 0 1 1 0 1 1 1 2 1 1 0 0 1 2
5640 2 1 1 1 2 1 1 1 1 1 1 1 1 2 3 1 0 0 1 2 2 2 1 1 1 1 1 1 1 0 0 0 1 0 1 1 1 1 1 1 0 1 1 1 2 2 3 3 3 3 2 2 1 1 1 1 1 2 3 3 2 1 1 1 1 1 1 1 1 0 1 1
5629 1 2 2 2 2 1 2 2 3 1 2 2 3 3 3 3 2 2 2 2 2 1 1 1 1 0 0 1 1 1 1 2 2 2 2 1 2 2 3 3 3 3 3 3 2 2 2 2 2 2 2 2 2 2 2 2 2 3 3 2 1 1 2 2 2 3 2 1 2 2 2 1
5618 1 1 1 1 1 1 1 1 1 1 1 1 1 1 2 2 2 2 2 2 3 3 4 4 4 3 3 3 3 3 2 4 4 3 3 2 1 1 1 1 2 2 1 2 3 2 1 1 1 1 1 2 2 2 2 1 1 1 2 2 2 2 1 2 1 1 1 1 1 2 2 3
5607CjJ%%jJ%jj%%%J%j%%J%j%j%%JJj%%j%%%J%%%%KjjjJ%%J%%jjJ%J%%%%%JJjjj%J%%%%jj
5597@Kj%%J%%%%%Jj%%j%%J%%%%j%%%%Jjj%JJj%%%%%jJ%%Jj%%j%JjJ%jJJ%%j%%Jj%JjJJ%j%
5586BjJ%J%%j%j%J%j%%%%K%%j%jJ%%jJ%j%%%j%%J%%Jj%%%jjJJ%j%Jj%%J%JJ%jjJjJ%%%%%j
5575A%%%jJ%Jj%Jj%%J%%%j%jJJ%%%%J%%jj%j%%%J%%%%%%%%%%%J%%%%J%%%%%%J%k%jJJ%j%j
5564A%%jJJJ%jj%%%%j%%jJJ%Jj%jJJ%j%J%%j%%J%j%%%J%%Jjk%J%%JJj%%%j%%%%%%j%%J%%j
5553@J%jJJ%%%%j%%%J%%%%jjJ%j%%J%%%%%%kJJ%%%%%j%%JJ%%%jk%J%JJJ%jJ%%%j%%%%j%%J
5542BJ%jJ%j%jJ%%%J%%j%j%%%%J%%%%%%kj%%%J%JJ%%J%%j%%%jjJ%%%%%%%%J%%%%j%%%%%%J
5532B%%%J%%jj%%Jj%JJj%j%%%%JJj%Jkj%JK%%j%j%%%%%%%%%%J%%jjJJ%j%%%j%%%jJ%Jj%J%
$$ plain form
5607 3 2 3 3 3 2 3 3 2 1 1 1 1 2 2 1 1 1 2 2 1 1 0 0 0 1 2 1 1 1 0 0 0 0 1 1 1 1 1 3 2 1 0 1 1 1 2 2 2 1 0 1 1 2 2 2 2 2 2 3 4 3 2 1 1 2 2 2 2 2 1 0
5597 0 2 1 1 1 2 2 2 2 2 2 3 2 2 2 1 1 1 2 2 2 2 2 1 1 1 1 1 2 1 0 0 1 2 1 1 1 1 1 1 0 1 1 1 2 1 1 1 0 0 1 0 1 1 0 1 2 2 2 1 1 1 2 1 1 2 1 2 3 3 2 2
5586 2 1 2 2 3 3 3 2 2 1 1 2 2 1 1 1 1 1 3 3 3 2 2 1 2 2 2 1 2 2 1 1 1 1 0 0 0 1 1 1 2 1 1 1 1 0 -1 0 1 1 0 0 1 0 0 0 1 1 2 3 3 2 1 2 1 2 2 2 2 2 2 1
5575 1 1 1 1 0 1 1 2 1 1 2 1 1 1 2 2 2 2 1 1 0 1 2 2 2 2 2 3 3 3 2 1 1 0 0 0 0 1 1 1 1 1 1 1 1 1 1 1 1 2 2 2 2 2 3 3 3 3 3 3 3 4 4 2 2 1 2 3 3 2 2 1
5564 1 1 1 0 1 2 3 3 2 1 1 1 1 1 0 0 0 -1 0 1 1 2 1 1 0 1 2 2 1 1 2 2 2 1 1 1 2 2 1 1 1 1 2 2 2 3 2 0 0 1 1 1 2 3 2 2 2 2 1 1 1 1 1 1 1 0 0 0 1 1 1 0
5553 0 1 1 0 1 2 2 2 2 2 1 1 1 1 2 2 2 2 2 1 0 1 1 0 0 0 1 1 1 1 1 1 1 -1 0 1 1 1 1 1 1 0 0 0 1 2 2 2 2 1 -1 -1 0 0 1 2 3 3 2 3 3 3 3 2 2 2 2 2 1 1 1 2
5542 2 3 3 2 3 3 2 2 1 2 2 2 2 3 3 3 2 2 1 1 1 1 1 2 2 2 2 2 2 2 0 -1 -1 -1 -1 0 0 1 2 2 2 3 3 3 2 2 2 2 1 0 1 1 1 1 1 1 1 1 1 2 2 2 2 2 1 1 1 1 1 1 1 2
5532 2 2 2 2 3 3 3 2 1 1 1 2 1 1 2 3 2 2 1 1 1 1 1 2 3 2 2 3 1 0 0 1 3 3 3 2 2 1 1 1 1 1 1 1 1 1 1 1 2 2 2 1 0 1 2 2 1 1 1 1 0 0 0 0 -1 0 0 1 0 0 1 1
5521A%%jJ%J%%j%%%j%%%%JJ%%j%%J%Jjj%%J%%j%%J%J%%j%%j%%jK%%%%J%j%%%%j%%%Jjj%J%
5510A%j%J%j%%%%%Jj%%%%%%JJJj%%%%%%Jjjj%J%%J%%%%%%jjJ%%J%J%%%jj%%%%%%Jj%jJJ%j
5499A%%J%j%%%%j%%JK%%k%%J%jjJ%%%%J%%%%j%%%%%%%JJj%%%jj%J%J%%%%j%%J%%j%%%jj%K
5488AJ%%%jj%%Jj%J%%Jjj%J%J%%j%jJ%%%%%Jj%JJjjJ%j%%J%%%%%%%%j%jJ%%JJjJ%%%j%jJ%
5477Bjj%JJ%j%%Jj%%%%%%%%%%%%j%%J%JjjJ%J%%%j%%%%%%JjjJ%J%%J%j%J%%%%jk%J%j%J%%
5467AJJj%j%%%%%%%%%%%%J%j%J%%%%J%jj%J%%%%J%%%j%j%%%%%%%%%%%jJJ%%%j%%jJ%JJ%j%
5456Bj%%%%J%%%%%%JjjJ%j%%Jjj%%%%%%%%J%%Jj%%%j%JJ%Jjj%J%JJ%k%jj%J%%%%%%J%%%j%
5445A%Jj%JJ%%j%%%%%%j%jJ%%%%J%%%%jJ%J%j%%jj%%%J%%%%%j%JjJ%%j%%J%%%%%%%j%%%%%
$$ plain form
5521 1 1 1 0 1 1 2 2 2 1 1 1 1 0 0 0 0 0 1 2 2 2 1 1 1 2 2 3 2 1 1 1 2 2 2 1 1 1 2 2 3 3 3 2 2 2 1 1 1 0 2 2 2 2 2 3 3 2 2 2 2 2 1 1 1 1 2 1 0 0 1 1
5510 1 1 0 0 1 1 0 0 0 0 0 0 1 0 0 0 0 0 0 0 1 2 3 2 2 2 2 2 2 2 3 2 1 0 0 1 1 1 2 2 2 2 2 2 2 1 0 1 1 1 2 2 3 3 3 3 2 1 1 1 1 1 1 1 2 1 1 0 1 2 2 1
5499 1 1 1 2 2 1 1 1 1 1 0 0 0 1 3 3 3 1 1 1 2 2 1 0 1 1 1 1 1 2 2 2 2 2 1 1 1 1 1 1 1 1 2 3 2 2 2 2 1 0 0 1 1 2 2 2 2 2 1 1 1 2 2 2 1 1 1 1 0 -1 -1 1
5488 1 2 2 2 2 1 0 0 0 1 0 0 1 1 1 2 1 0 0 1 1 2 2 2 1 1 0 1 1 1 1 1 1 2 1 1 2 3 2 1 2 2 1 1 1 2 2 2 2 2 2 2 2 2 1 1 0 1 1 1 2 3 2 3 3 3 3 2 2 1 2 2
5477 2 1 0 0 1 2 2 1 1 1 2 1 1 1 1 1 1 1 1 1 1 1 1 1 0 0 0 1 1 2 1 0 1 1 2 2 2 2 1 1 1 1 1 1 1 2 1 0 1 1 2 2 2 3 3 2 2 3 3 3 3 3 2 0 0 1 1 0 0 1 1 1
5467 1 2 3 2 2 1 1 1 1 1 1 1 1 1 1 1 1 1 2 2 1 1 2 2 2 2 2 3 3 2 1 1 2 2 2 2 2 3 3 3 3 2 2 1 1 1 1 1 1 1 1 1 1 1 1 0 1 2 2 2 2 1 1 1 0 1 1 2 3 3 2 2
5456 2 1 1 1 1 1 2 2 2 2 2 2 2 3 2 1 2 2 1 1 1 2 1 0 0 0 0 0 0 0 0 0 1 1 1 2 1 1 1 1 0 0 1 2 2 3 2 1 1 2 2 3 4 4 2 2 1 0 0 1 1 1 1 1 1 1 2 2 2 2 1 1
5445 1 1 2 1 1 2 3 3 3 2 2 2 2 2 2 2 1 1 0 1 1 1 1 1 2 2 2 2 2 1 2 2 3 3 2 2 2 1 0 0 0 0 1 1 1 1 1 1 0 0 1 0 1 1 1 0 0 0 1 1 1 1 1 1 1 1 0 0 0 0 0 0
5434@%J%jJ%Jj%j%%J%%K%%%jj%jK%j%%%%%%%%J%jJ%%%jj%Jj%jjJJK%%j%j%%J%%%j%%K%%%%
5423B%jJJj%%jJ%%%%%%jJ%%%%jjJJ%%jJJ%k%j%%JJ%%%%j%J%%j%%%J%%jjJ%%%%%%%j%J%JJj
5412B%%%%%%j%%%J%%%%%%%%J%jjJ%%%j%%%J%JJjj%%%jJjJJ%jJ%%j%%%%j%%j%%J%%%j%%%JJ
5402B%%%%%%%%jJ%%%%%Jj%j%jJJJ%jjjJ%Jj%%J%Jjj%Jj%%%J%j%%%%%%J%%%%%j%%%Jj%jJ%%
5391A%%%%%%%J%jJj%%Jj%%j%Jj%J%%j%%JJj%%%%%%%J%%%%%j%%j%J%%%%%J%J%jk%J%J%%%%%
5380B%%%%%%%%%j%%J%%%%%%jj%J%j%%%%J%%J%%j%%j%%J%Jj%%J%%j%%%Kj%j%%%%%%J%jJJjj
5369A%%%J%%J%j%%j%JjjJJJ%%j%%JjjJJ%jj%%j%J%JK%j%%%%j%%%j%%JJ%%j%%j%%Jjj%J%%%
5358A%%%JJj%j%%%J%J%Jj%%j%%%%%jJ%j%%%%J%%%j%%J%jJ%%%%J%%%J%jj%%JJ%j%jJ%J%%%j
$$ plain form
5434 0 0 1 1 0 1 1 2 1 1 0 0 0 1 1 1 3 3 3 3 2 1 1 0 2 2 1 1 1 1 1 1 1 1 1 2 2 1 2 2 2 2 1 0 0 1 0 0 -1 -2 -1 0 2 2 2 1 1 0 0 0 1 1 1 1 0 0 0 2 2 2 2 2
5423 2 2 1 2 3 2 2 2 1 2 2 2 2 2 2 2 1 2 2 2 2 2 1 0 1 2 2 2 1 2 3 3 1 1 0 0 0 1 2 2 2 2 2 1 1 2 2 2 1 1 1 1 2 2 2 1 0 1 1 1 1 1 1 1 1 0 0 1 1 2 3 2
5412 2 2 2 2 2 2 2 1 1 1 1 2 2 2 2 2 2 2 2 2 3 3 2 1 2 2 2 2 1 1 1 1 2 2 3 4 3 2 2 2 2 1 2 1 2 3 3 2 3 3 3 2 2 2 2 2 1 1 1 0 0 0 1 1 1 1 0 0 0 0 1 2
5402 2 2 2 2 2 2 2 2 2 1 2 2 2 2 2 2 3 2 2 1 1 0 1 2 3 3 2 1 0 1 1 2 1 1 1 2 2 3 2 1 1 2 1 1 1 1 2 2 1 1 1 1 1 1 1 2 2 2 2 2 2 1 1 1 1 2 1 1 0 1 1 1
5391 1 1 1 1 1 1 1 1 2 2 1 2 1 1 1 2 1 1 1 0 0 1 0 0 1 1 1 0 0 0 1 2 1 1 1 1 1 1 1 1 2 2 2 2 2 2 1 1 1 0 0 1 1 1 1 1 1 2 2 3 3 2 0 0 1 1 2 2 2 2 2 2
5380 2 2 2 2 2 2 2 2 2 2 1 1 1 2 2 2 2 2 2 2 1 0 0 1 1 0 0 0 0 0 1 1 1 2 2 2 1 1 1 0 0 0 1 1 2 1 1 1 2 2 2 1 1 1 1 3 2 2 1 1 1 1 1 1 1 2 2 1 2 3 2 1
5369 1 1 1 1 2 2 2 3 3 2 2 2 1 1 2 1 0 1 2 3 3 3 2 2 2 3 2 1 2 3 3 2 1 1 1 0 0 1 1 2 4 4 3 3 3 3 3 2 2 2 2 1 1 1 2 3 3 3 2 2 2 1 1 1 2 1 0 0 1 1 1 1
5358 1 1 1 1 2 3 2 2 1 1 1 1 2 2 3 3 4 3 3 3 2 2 2 2 2 2 1 2 2 1 1 1 1 1 2 2 2 2 1 1 1 2 2 1 2 2 2 2 2 3 3 3 3 4 4 3 2 2 2 3 4 4 3 3 2 3 3 4 4 4 4 3
5347Cj%J%j%%J%%%%j%j%j%J%%%%%%%%J%j%%j%%JJ%Jj%%J%%%%%%%j%%%j%%%%%%J%%jJJ%Jjj
5337BJ%j%%%%%%J%%j%%jK%jj%%%%%J%%%%%%%%jKj%%%%j%%%%%j%%%JJ%%%%%%jJJj%%j%%J%%
5326Bj%%%jJ%%J%%%%%%jJJ%J%j%jjj%%%%%%%%Jj%%%J%%J%%%%%%%%%jjJ%Jj%%J%%%j%j%J%%
5315A%%%%%jJJj%%%%Jj%%%%%Jj%%%J%%jj%%JJ%%%%%%%%Jjj%%J%%j%%j%JJJj%jj%%J%%%J%%
5304BjJ%%Jjj%j%%JJ%%jJ%jJ%%J%%%jjjJ%%jJJ%%%j%J%%%J%%%j%%jj%J%%j%%J%J%%%%%%J%
5293C%%%%%jJ%%j%j%%%%%%%J%%jJjJJ%%%%%Jjj%%jJ%%%%%j%%%J%j%JJjj%%%%%J%%%%%%%j%
5282A%J%%%%%%%%%%%%%%j%%%%%%%%%%%%%%%J%%j%jJ%%%%JJj%%j%J%j%%%%%%%j%%J%J%%%%%
5272Bjj%%JJjj%J%%jJJ%kjJJJ%%%%jj%%%KjJ%j%jJ%%JJ%%j%%J%%j%%%j%%%%%JJ%j%J%j%%%
$$ plain form
5347 3 2 2 3 3 2 2 2 3 3 3 3 3 2 2 1 1 0 0 1 1 1 1 1 1 1 1 1 2 2 1 1 1 0 0 0 1 2 2 3 2 2 2 3 3 3 3 3 3 3 3 2 2 2 2 1 1 1 1 1 1 1 2 2 2 1 2 3 3 4 3 2
5337 2 3 3 2 2 2 2 2 2 2 3 3 3 2 2 2 1 3 3 2 1 1 1 1 1 1 2 2 2 2 2 2 2 2 2 1 3 2 2 2 2 2 1 1 1 1 1 1 0 0 0 0 1 2 2 2 2 2 2 2 1 2 3 2 2 2 1 1 1 2 2 2
5326 2 1 1 1 1 0 1 1 1 2 2 2 2 2 2 2 1 2 3 3 4 4 3 3 2 1 0 0 0 0 0 0 0 0 0 1 0 0 0 0 1 1 1 2 2 2 2 2 2 2 2 2 2 1 0 1 1 2 1 1 1 2 2 2 2 1 1 0 0 1 1 1
5315 1 1 1 1 1 1 0 1 2 1 1 1 1 1 2 1 1 1 1 1 1 2 1 1 1 1 2 2 2 1 0 0 0 1 2 2 2 2 2 2 2 2 2 3 2 1 1 1 2 2 2 1 1 1 0 0 1 2 3 2 2 1 0 0 0 1 1 1 1 2 2 2
5304 2 1 2 2 2 3 2 1 1 0 0 0 1 2 2 2 1 2 2 1 2 2 2 3 3 3 3 2 1 0 1 1 1 0 1 2 2 2 2 1 1 2 2 2 2 3 3 3 3 2 2 2 1 0 0 1 1 1 0 0 0 1 1 2 2 2 2 2 2 2 3 3
5293 3 3 3 3 3 3 2 3 3 3 2 2 1 1 1 1 1 1 1 1 2 2 2 1 2 1 2 3 3 3 3 3 3 4 3 2 2 2 1 2 2 2 2 2 2 1 1 1 1 2 2 1 1 2 3 2 1 1 1 1 1 1 2 2 2 2 2 2 2 2 1 1
5282 1 1 2 2 2 2 2 2 2 2 2 2 2 2 2 2 2 1 1 1 1 1 1 1 1 1 1 1 1 1 1 1 1 2 2 2 1 1 0 1 1 1 1 1 2 3 2 2 2 1 1 2 2 1 1 1 1 1 1 1 1 0 0 0 1 1 2 2 2 2 2 2
5272 2 1 0 0 0 1 2 1 0 0 1 1 1 0 1 2 2 0 -1 0 1 2 2 2 2 2 1 0 0 0 0 2 1 2 2 1 1 0 1 1 1 2 3 3 3 2 2 2 3 3 3 2 2 2 2 1 1 1 1 1 1 2 3 3 2 2 3 3 2 2 2 2
5261B%%J%j%%%j%%%J%jKJjj%%J%jJ%%jJj%%%%%%%%%%%%%%J%%%j%%J%jjJj%%%%K%%j%%%JJ%
5250D%j%jj%%%%J%%j%J%jJJ%jJ%%jj%%%J%%Jjj%%%%J%%%%j%%%%Jj%%%%K%%j%j%JJ%j%%%%%
5239B%j%J%%j%%Jj%%J%%%%%jjJ%%Jj%Jj%%%%Jj%%%%%JJ%%%%j%jJJ%%j%j%%%J%jj%J%j%%JJ
5228B%J%%jJ%%%%j%%%jJ%J%Jj%%j%%%jJ%%j%j%%JJ%%%j%%%%J%%%Jj%J%%%%j%%%%%%Jjj%JJ
5217Cjj%%J%Jj%%Jj%jj%%Jj%JJ%Jjj%%J%%%%%%J%%%%j%%jj%%%J%%%%%%%J%%j%%%%JjjJJ%%
5207B%j%%%J%%j%%%%%JJjj%%%%JJ%jjJ%%%j%%JJ%j%%%%%%Jjj%%%J%J%%jjjJ%%j%JJ%jJ%Jj
5196B%j%J%jJ%j%%%%%J%%%%%Jj%%%J%%%jj%jj%J%JJk%%%J%%%%%%J%%%%JjkJ%%%J%%%%%jJ%
5185B%jJ%%j%jJ%JJ%jjj%KJjJ%j%j%%%%j%%%J%%%Jj%%%%%%j%J%J%%%%%%%j%%%%%%%J%j%jJ
$$ plain form
5261 2 2 2 3 3 2 2 2 2 1 1 1 1 2 2 1 3 4 3 2 2 2 3 3 2 3 3 3 2 3 2 2 2 2 2 2 2 2 2 2 2 2 2 2 2 3 3 3 3 2 2 2 3 3 2 1 2 1 1 1 1 1 3 3 3 2 2 2 2 3 4 4
5250 4 4 3 3 2 1 1 1 1 1 2 2 2 1 1 2 2 1 2 3 3 2 3 3 3 2 1 1 1 1 2 2 2 3 2 1 1 1 1 1 2 2 2 2 2 1 1 1 1 1 2 1 1 1 1 1 3 3 3 2 2 1 1 2 3 3 2 2 2 2 2 2
5239 2 2 1 1 2 2 2 1 1 1 2 1 1 1 2 2 2 2 2 2 1 0 1 1 1 2 1 1 2 1 1 1 1 1 2 1 1 1 1 1 1 2 3 3 3 3 3 2 2 1 2 3 3 3 2 2 1 1 1 1 2 2 1 0 0 1 1 0 0 0 1 2
5228 2 2 3 3 3 2 3 3 3 3 3 2 2 2 2 1 2 2 3 3 4 3 3 3 2 2 2 2 1 2 2 2 1 1 0 0 0 1 2 2 2 2 1 1 1 1 1 2 2 2 2 3 2 2 3 3 3 3 3 2 2 2 2 2 2 2 3 2 1 1 2 3
5217 3 2 1 1 1 2 2 3 2 2 2 3 2 2 1 0 0 0 1 0 0 1 2 2 3 2 1 1 1 2 2 2 2 2 2 2 3 3 3 3 3 2 2 2 1 0 0 0 0 1 1 1 1 1 1 1 1 2 2 2 1 1 1 1 1 2 1 0 1 2 2 2
5207 2 2 1 1 1 1 2 2 2 1 1 1 1 1 1 2 3 2 1 1 1 1 1 2 3 3 2 1 2 2 2 2 1 1 1 2 3 3 2 2 2 2 2 2 2 3 2 1 1 1 1 2 2 3 3 3 2 1 0 1 1 1 0 0 1 2 2 1 2 2 3 2
5196 2 2 1 1 2 2 1 2 2 1 1 1 1 1 1 2 2 2 2 2 2 3 2 2 2 2 3 3 3 3 2 1 1 0 -1 -1 0 0 1 2 0 0 0 0 1 1 1 1 1 1 1 2 2 2 2 2 3 2 0 1 1 1 1 2 2 2 2 2 2 1 2 2
5185 2 2 1 2 2 2 1 1 0 1 1 2 3 3 2 1 0 0 2 3 2 3 3 2 2 1 1 1 1 1 0 0 0 0 1 1 1 1 2 1 1 1 1 1 1 1 0 0 1 1 2 2 2 2 2 2 2 2 1 1 1 1 1 1 1 1 2 2 1 1 0 1
5174AK%%j%jjJ%%Jj%JJjj%J%J%j%%%%%%%%%jjJJ%jJ%K%jj%%j%Jj%%Jj%%%%J%%%%%%j%%J%%
5163B%JjjjJJ%J%%%jj%%%J%%%%j%%%Jj%%%Jj%%%%J%%J%%jjjjJ%%%%J%J%%%%%%%%%%%%%%%%
5152B%%%%jJJ%%%%%%jJ%%k%%Jj%%%%%JJJ%jj%%j%jJJ%j%%%J%%%JJj%j%%J%JkkJ%%J%%%%J%
5142C%jj%%%%%%j%%J%%%%%%KJ%%jj%jj%%%%%J%%J%%%J%j%j%%%J%J%j%j%%JjjJ%%%%J%j%%J
5131B%%%%%%%%%%Jj%j%%%%J%%J%%j%%j%J%jj%%J%%%%%%%%jJ%J%%%%%%%j%%%%J%%%%%j%Jj%
5120A%j%%JJ%J%j%%j%%%%%%j%%J%J%j%%%%%J%jjJJ%%%J%%Jjj%%%%%%jJ%%%%%%jJ%%%J%jJj
5109B%Jjj%%JJ%jj%J%j%JJj%%%%j%%j%%%J%%%jJ%J%%jJ%%%%j%JJjJj%%jjJ%%J%%%%J%j%%%
5098B%%%jJ%%JJj%%j%%J%%%k%%J%%%%jJk%%%J%%%j%%JJ%JjjJ%%%J%%%%j%%%j%%JJj%%%%%j
$$ plain form
5174 1 3 3 3 2 2 1 0 1 1 1 2 1 1 2 3 2 1 1 2 2 3 3 2 2 2 2 2 2 2 2 2 2 1 0 1 2 2 1 2 2 4 4 3 2 2 2 1 1 2 1 1 1 2 1 1 1 1 1 2 2 2 2 2 2 2 1 1 1 2 2 2
5163 2 2 3 2 1 0 1 2 2 3 3 3 3 2 1 1 1 1 2 2 2 2 2 1 1 1 1 2 1 1 1 1 2 1 1 1 1 1 2 2 2 3 3 3 2 1 0 -1 0 0 0 0 0 1 1 2 2 2 2 2 2 2 2 2 2 2 2 2 2 2 2 2
5152 2 2 2 2 2 1 2 3 3 3 3 3 3 3 2 3 3 3 1 1 1 2 1 1 1 1 1 1 2 3 4 4 3 2 2 2 1 1 0 1 2 2 1 1 1 1 2 2 2 2 3 4 3 3 2 2 2 3 3 4 2 0 1 1 1 2 2 2 2 2 3 3
5142 3 3 2 1 1 1 1 1 1 1 0 0 0 1 1 1 1 1 1 1 3 4 4 4 3 2 2 1 0 0 0 0 0 0 1 1 1 2 2 2 2 3 3 2 2 1 1 1 1 2 2 3 3 2 2 1 1 1 2 1 0 1 1 1 1 1 2 2 1 1 1 2
5131 2 2 2 2 2 2 2 2 2 2 2 3 2 2 1 1 1 1 1 2 2 2 3 3 3 2 2 2 1 1 2 2 1 0 0 0 1 1 1 1 1 1 1 1 1 0 1 1 2 2 2 2 2 2 2 2 1 1 1 1 1 2 2 2 2 2 2 1 1 2 1 1
5120 1 1 0 0 0 1 2 2 3 3 2 2 2 1 1 1 1 1 1 1 0 0 0 1 1 2 2 1 1 1 1 1 1 2 2 1 0 1 2 2 2 2 3 3 3 4 3 2 2 2 2 2 2 2 1 2 2 2 2 2 2 2 1 2 2 2 2 3 3 2 3 2
5109 2 2 3 2 1 1 1 2 3 3 2 1 1 2 2 1 1 2 3 2 2 2 2 2 1 1 1 0 0 0 0 1 1 1 1 0 1 1 2 2 2 1 2 2 2 2 2 1 1 2 3 2 3 2 2 2 1 0 1 1 1 2 2 2 2 2 3 3 2 2 2 2
5098 2 2 2 2 1 2 2 2 3 4 3 3 3 2 2 2 3 3 3 3 1 1 1 2 2 2 2 2 1 2 0 0 0 0 1 1 1 1 0 0 0 1 2 2 3 2 1 2 2 2 2 3 3 3 3 3 2 2 2 2 1 1 1 2 3 2 2 2 2 2 2 1
5087A%%%J%%%%%%%j%%%%%J%%%j%%%j%JJ%%J%jj%J%%%%Jj%j%%%%%%J%J%JjjjJ%j%J%%Jj%J%
5077C%j%%%%%%jj%JJ%%j%%JJjj%Jj%%%%jJJ%Jjj%Jj%%%%J%%%jJ%%jjJ%J%%%%%%%%%jjJ%%%
5066Aj%JJj%%%JjJ%%%Jj%%j%%JJ%jj%J%j%%J%%%%%%%%%%kJJJjj%%%J%j%%J%%%%JjjjJ%%JJ
5055Cj%j%%%%jkJKJ%%%Jj%%%Jjj%%J%%%%%%j%%K%Jjj%%%Jjj%%%%%Jj%%%%%%JJ%j%kJ%%%%%
5044A%%jJ%Jj%%%%J%Jj%%j%%J%%%%%J%%jj%%j%J%%Jj%%%%%%%%%%J%J%%%%%jjJjJJ%%%%j%%
5033BJ%%j%%%%J%%j%%%%%J%%%j%j%%Jj%%%%J%%%%%j%%%%%%%%J%Jj%%%%jJ%%%%%j%%%J%%%%
5022BJj%Jj%j%Jj%J%%%jJ%%%%%%jj%%J%J%j%%JJ%%jJ%jJ%%J%jj%%j%%j%%JJ%%%Jj%j%%J%%
5012B%%%%%%%%%j%%%%%%J%%j%%%%J%JJj%%j%j%%jJ%j%JK%j%%%%Jj%%%%%%%%j%%%%JJj%j%%
$$ plain form
5087 1 1 1 1 2 2 2 2 2 2 2 2 1 1 1 1 1 1 2 2 2 2 1 1 1 1 0 0 1 2 2 2 3 3 2 1 1 2 2 2 2 2 3 2 2 1 1 1 1 1 1 1 2 2 3 3 4 3 2 1 2 2 1 1 2 2 2 3 2 2 3 3
5077 3 3 2 2 2 2 2 2 2 1 0 0 1 2 2 2 1 1 1 2 3 2 1 1 2 1 1 1 1 1 0 1 2 2 3 2 1 1 2 1 1 1 1 1 2 2 2 2 1 2 2 2 1 0 1 1 2 2 2 2 2 2 2 2 2 2 1 0 1 1 1 1
5066 1 0 0 1 2 1 1 1 1 2 1 2 2 2 2 3 2 2 2 1 1 1 2 3 3 2 1 1 2 2 1 1 1 2 2 2 2 2 2 2 2 2 2 2 0 1 2 3 2 1 1 1 1 2 2 1 1 1 2 2 2 2 2 3 2 1 0 1 1 1 2 3
5055 3 2 2 1 1 1 1 1 0 -2 -1 1 2 2 2 2 3 2 2 2 2 3 2 1 1 1 2 2 2 2 2 2 2 1 1 1 3 3 4 3 2 2 2 2 3 2 1 1 1 1 1 1 2 1 1 1 1 1 1 1 2 3 3 2 2 0 1 1 1 1 1 1
5044 1 1 1 0 1 1 2 1 1 1 1 1 2 2 3 2 2 2 1 1 1 2 2 2 2 2 2 3 3 3 2 1 1 1 0 0 1 1 1 2 1 1 1 1 1 1 1 1 1 1 1 2 2 3 3 3 3 3 3 2 1 2 1 2 3 3 3 3 3 2 2 2
5033 2 3 3 3 2 2 2 2 2 3 3 3 2 2 2 2 2 2 3 3 3 3 2 2 1 1 1 2 1 1 1 1 1 2 2 2 2 2 2 1 1 1 1 1 1 1 1 1 2 2 3 2 2 2 2 2 1 2 2 2 2 2 2 1 1 1 1 2 2 2 2 2
5022 2 3 2 2 3 2 2 1 1 2 1 1 2 2 2 2 1 2 2 2 2 2 2 2 1 0 0 0 1 1 2 2 1 1 1 2 3 3 3 2 3 3 2 3 3 3 4 4 3 2 2 2 1 1 1 0 0 0 1 2 2 2 2 3 2 2 1 1 1 2 2 2
5012 2 2 2 2 2 2 2 2 2 2 1 1 1 1 1 1 1 2 2 2 1 1 1 1 1 2 2 3 4 3 3 3 2 2 1 1 1 0 1 1 0 0 1 3 3 2 2 2 2 2 3 2 2 2 2 2 2 2 2 2 1 1 1 1 1 2 3 2 2 1 1 1
5001AJ%%%Jj%%%%%%%%%j%%%j%%JJ%%%j%%JJj%jjJ%J%%%%%%%%%J%%%%j%%%%%%J%%%Jjj%jJJ
4990Cj%%jJ%JJj%%j%%J%%%jj%J%%%j%%%Jj%J%%%%j%%%J%%%k%J%%%jjKJ%%%%j%jJ%%J%%%%%
4979B%%%%%%%%%%%jJ%j%JJ%k%J%jjJJ%%%%%j%%%%%jJ%%%%%%%J%JjjJ%%%%%%%jj%%Jjj%KJK
4968D%%j%%Jkj%%%%J%%%%%%jJ%j%%%J%%Jjj%jJ%%%%%%jJ%%JJ%j%%%%%%%%%%%%J%jjjJ%%%%
4957AJj%%jJ%%J%%j%%JJj%%jJ%j%JJ%j%%j%%%j%J%J%j%%jJ%%%%%%J%%jJJkjJ%J%Jj%JJ%kj
4947Aj%%J%%%%JJ%%j%J%%%%%j%%%JJ%%jj%%%%%j%j%JJjj%J%%%J%j%%J%j%%%%%%%%%JJ%j%%
4936B%j%J%J%%%%j%Jj%j%j%J%%%%%%KJ%jj%j%%%%J%JJj%j%jjJJJj%%%JjjJ%%%j%%%j%%J%%
4925AJ%%%j%%%J%%%J%%k%J%%%%JJ%%%%%jJ%%kj%%J%%J%%%%%j%%%J%%Jjj%%%j%%%%%%J%%%%
$$ plain form
5001 1 2 2 2 2 3 2 2 2 2 2 2 2 2 2 2 1 1 1 1 0 0 0 1 2 2 2 2 1 1 1 2 3 2 2 1 0 1 1 2 2 2 2 2 2 2 2 2 2 3 3 3 3 3 2 2 2 2 2 2 2 3 3 3 3 4 3 2 2 1 2 3
4990 3 2 2 2 1 2 2 3 4 3 3 3 2 2 2 3 3 3 3 2 1 1 2 2 2 2 1 1 1 1 2 1 1 2 2 2 2 2 1 1 1 1 2 2 2 2 0 0 1 1 1 1 0 -1 1 2 2 2 2 2 1 1 0 1 1 1 2 2 2 2 2 2
4979 2 2 2 2 2 2 2 2 2 2 2 2 1 2 2 1 1 2 3 3 1 1 2 2 1 0 1 2 2 2 2 2 2 1 1 1 1 1 1 0 1 1 1 1 1 1 1 1 2 2 3 2 1 2 2 2 2 2 2 2 2 1 0 0 0 1 0 -1 -1 1 2 4
4968 4 4 4 3 3 3 4 2 1 1 1 1 1 2 2 2 2 2 2 2 1 2 2 1 1 1 1 2 2 2 3 2 1 1 0 1 1 1 1 1 1 1 0 1 1 1 2 3 3 2 2 2 2 2 2 2 2 2 2 2 2 2 3 3 2 1 0 1 1 1 1 1
4957 1 2 1 1 1 0 1 1 1 2 2 2 1 1 1 2 3 2 2 2 1 2 2 1 1 2 3 3 2 2 2 1 1 1 1 0 0 1 1 2 2 1 1 1 0 1 1 1 1 1 1 1 2 2 2 1 2 3 1 0 1 1 2 2 3 2 2 3 4 4 2 1
4947 1 0 0 0 1 1 1 1 1 2 3 3 3 2 2 3 3 3 3 3 3 2 2 2 2 3 4 4 4 3 2 2 2 2 2 2 1 1 0 0 1 2 1 0 0 1 1 1 1 2 2 1 1 1 2 2 1 1 1 1 1 1 1 1 1 1 2 3 3 2 2 2
4936 2 2 1 1 2 2 3 3 3 3 3 2 2 3 2 2 1 1 0 0 1 1 1 1 1 1 1 3 4 4 3 2 2 1 1 1 1 1 2 2 3 4 3 3 2 2 1 0 1 2 3 2 2 2 2 3 2 1 2 2 2 2 1 1 1 1 0 0 0 1 1 1
4925 1 2 2 2 2 1 1 1 1 2 2 2 2 3 3 3 1 1 2 2 2 2 2 3 4 4 4 4 4 4 3 4 4 4 2 1 1 1 2 2 2 3 3 3 3 3 3 2 2 2 2 3 3 3 4 3 2 2 2 2 1 1 1 1 1 1 1 2 2 2 2 2
4914B%J%J%jj%%%%%%%%%%%%%%%%%J%%%jJ%%j%%%%%%%%%j%J%%j%%%j%%J%%%%%J%%%%%%J%%j
4903B%j%j%%J%J%j%J%%%J%%j%%j%%J%J%j%%j%%JJ%%%%%%%%j%%%jJ%jJJ%%%%jj%J%%jJ%%%%
4892BJ%%%%j%%jJ%%%%%%jj%J%%%%J%%%%%j%%%J%%%%%%%%%k%%J%J%%%%%%%%j%%%%JJjjJJjj
4882AJ%%%%jjJ%%jJ%j%%%J%%jJJ%%%%%%%%%j%J%%jjK%jJ%j%%jJJJjj%%Jjj%jJ%%Jj%J%%J%
4871B%%%%jJ%%j%%%%%%J%%j%%JjjJ%%%%J%%%%Jjj%%%%%J%%%%jjJ%%%J%jJ%%%%%%%%%j%jJ%
4860AJ%%%%%%%J%%%j%%J%%j%%%%j%%%JJ%%j%jJ%%%J%j%j%J%j%j%%%%J%%%J%j%%%J%%Jj%j%
4849AjJ%J%%j%%%%j%%%%JJ%%%%JjjJJj%j%jJ%%%%JJj%%J%%%%%%jj%%%%%J%%j%j%%J%%JJk%
4838AJ%%%J%%%%j%j%%JJj%%J%jj%%J%%%%%%J%%Jj%Jjj%%J%%%%jj%%%J%J%%%%j%%Jj%%%%j%
$$ plain form
4914 2 2 3 3 4 4 3 2 2 2 2 2 2 2 2 2 2 2 2 2 2 2 2 2 2 3 3 3 3 2 3 3 3 2 2 2 2 2 2 2 2 2 2 1 1 2 2 2 1 1 1 1 0 0 0 1 1 1 1 1 1 2 2 2 2 2 2 2 3 3 3 2
4903 2 2 1 1 0 0 0 1 1 2 2 1 1 2 2 2 2 3 3 3 2 2 2 1 1 1 2 2 3 3 2 2 2 1 1 1 2 3 3 3 3 3 3 3 3 3 2 2 2 2 1 2 2 1 2 3 3 3 3 3 2 1 1 2 2 2 1 2 2 2 2 2
4892 2 3 3 3 3 3 2 2 2 1 2 2 2 2 2 2 2 1 0 0 1 1 1 1 1 2 2 2 2 2 2 1 1 1 1 2 2 2 2 2 2 2 2 2 2 0 0 0 1 1 2 2 2 2 2 2 2 2 2 1 1 1 1 1 2 3 2 1 2 3 2 1
4882 1 2 2 2 2 2 1 0 1 1 1 0 1 1 0 0 0 0 1 1 1 0 1 2 2 2 2 2 2 2 2 2 2 1 1 2 2 2 1 0 2 2 1 2 2 1 1 1 0 1 2 3 2 1 1 1 2 1 0 0 -1 0 0 0 1 0 0 1 1 1 2 2
4871 2 2 2 2 2 1 2 2 2 1 1 1 1 1 1 1 2 2 2 1 1 1 2 1 0 1 1 1 1 1 2 2 2 2 2 3 2 1 1 1 1 1 1 2 2 2 2 2 1 0 1 1 1 1 2 2 1 2 2 2 2 2 2 2 2 2 2 1 1 0 1 1
4860 1 2 2 2 2 2 2 2 2 3 3 3 3 2 2 2 3 3 3 2 2 2 2 2 1 1 1 1 2 3 3 3 2 2 1 2 2 2 2 3 3 2 2 1 1 2 2 1 1 0 0 0 0 0 1 1 1 1 2 2 1 1 1 1 2 2 2 3 2 2 1 1
4849 1 0 1 1 2 2 2 1 1 1 1 1 0 0 0 0 0 1 2 2 2 2 2 3 2 1 2 3 2 2 1 1 0 1 1 1 1 1 2 3 2 2 2 3 3 3 3 3 3 3 2 1 1 1 1 1 1 2 2 2 1 1 0 0 0 1 1 1 2 3 1 1
4838 1 2 2 2 2 3 3 3 3 3 2 2 1 1 1 2 3 2 2 2 3 3 2 1 1 1 2 2 2 2 2 2 2 3 3 3 4 3 3 4 3 2 2 2 3 3 3 3 3 2 1 1 1 1 2 2 3 3 3 3 3 2 2 2 3 2 2 2 2 2 1 1
4827A%%%J%j%%j%%J%%J%%j%%JJ%jj%jL%k%%%%%jJ%Jj%%%J%%%J%%%j%%jJ%%%%JjjJ%%Jj%%%
4817B%%%%j%%%%J%%%%%%%%%%%%%%%J%jj%%%%J%%%%%%j%%%J%%%j%%%%J%%%%%Jj%%%%j%j%J%
4806A%%J%%%jJJJ%j%j%%%%%%%J%j%%jJ%%%%%J%%%%%%j%%jjjJJJ%%J%%%jj%J%%%%%%%JjjJ%
4795B%jjJj%%%%Kj%%%%%%%%Jj%%%%%%J%j%%j%j%JjJJJ%j%J%j%%J%%%%J%%%jj%Jj%%%%J%%%
4784BJ%%j%%j%Jj%%%%%J%kJj%%JjjJJJ%%JjjJ%%%%%j%%J%j%%%J%%%%j%%%%J%%jJ%%j%j%JJ
4773Bj%J%%jJJj%%%%%jJ%%%%j%%%%Jj%%%%%J%jK%%j%jjJJ%%%j%J%%j%%Jj%%Jj%%%%%%%j%J
4762AJ%jJKjjJ%%jJ%J%jj%%%%%J%%%%%%%j%J%%J%jj%jJ%J%JJj%j%j%jj%%JJ%%%jJ%j%%J%J
4752Cj%Jj%J%Jj%j%jjJ%JJ%j%jj%%%%JJ%%%%%%j%JJj%%jj%J%J%%j%%%%%%%%%J%%%%Jkj%j%
$$ plain form
4827 1 1 1 1 2 2 1 1 1 0 0 0 1 1 1 2 2 2 1 1 1 2 3 3 2 1 1 0 3 3 1 1 1 1 1 1 0 1 1 2 1 1 1 1 2 2 2 2 3 3 3 3 2 2 2 1 2 2 2 2 2 3 2 1 2 2 2 3 2 2 2 2
4817 2 2 2 2 2 1 1 1 1 1 2 2 2 2 2 2 2 2 2 2 2 2 2 2 2 2 3 3 2 1 1 1 1 1 2 2 2 2 2 2 2 1 1 1 1 2 2 2 2 1 1 1 1 1 2 2 2 2 2 2 3 2 2 2 2 2 1 1 0 0 1 1
4806 1 1 1 2 2 2 2 1 2 3 4 4 3 3 2 2 2 2 2 2 2 2 3 3 2 2 2 1 2 2 2 2 2 2 3 3 3 3 3 3 3 2 2 2 1 0 -1 0 1 2 2 2 3 3 3 3 2 1 1 2 2 2 2 2 2 2 2 3 2 1 2 2
4795 2 2 1 0 1 0 0 0 0 0 2 1 1 1 1 1 1 1 1 1 2 1 1 1 1 1 1 1 2 2 1 1 1 0 0 -1 -1 0 -1 0 1 2 2 1 1 2 2 1 1 1 2 2 2 2 2 3 3 3 3 2 1 1 2 1 1 1 1 1 2 2 2 2
4784 2 3 3 3 2 2 2 1 1 2 1 1 1 1 1 1 2 2 0 1 0 0 0 1 0 -1 0 1 2 2 2 3 2 1 2 2 2 2 2 2 1 1 1 2 2 1 1 1 1 2 2 2 2 2 1 1 1 1 1 2 2 2 1 2 2 2 1 1 0 0 1 2
4773 2 1 1 2 2 2 1 2 3 2 2 2 2 2 2 1 2 2 2 2 2 1 1 1 1 1 2 1 1 1 1 1 1 2 2 1 3 3 3 2 2 1 0 1 2 2 2 2 1 1 2 2 2 1 1 1 2 1 1 1 2 1 1 1 1 1 1 1 1 0 0 1
4762 1 2 2 1 2 4 3 2 3 3 3 2 3 3 4 4 3 2 2 2 2 2 2 3 3 3 3 3 3 3 3 2 2 3 3 3 4 4 3 2 2 1 2 2 3 3 4 5 4 4 3 3 2 2 1 0 0 0 1 2 2 2 2 1 2 2 1 1 1 2 2 3
4752 3 2 2 3 2 2 3 3 4 3 3 2 2 1 0 1 1 2 3 3 2 2 1 0 0 0 0 0 1 2 2 2 2 2 2 2 1 1 2 3 2 2 2 1 0 0 1 1 2 2 2 1 1 1 1 1 1 1 1 1 1 2 2 2 2 2 3 1 0 0 -1 -1
4741aK%J%jj%JJ%jJ%%j%%J%J%j%%Jj%%%%%%j%Jj%J%%j%J%%J%%%j%%%%j%%%j%%J%%%J%%%%J
4730Cj%%%J%jj%jKJj%%jJ%%%J%j%jj%J%J%Jjj%J%JkjJ%%%%%JJj%%%%%%%Jjj%JJj%%%j%%%%
4719AJ%J%%j%%%j%%%%J%%%%%%%%%%%j%JJjj%%%JJJjJjj%%%%%%%%j%j%JJ%%%%%%%%%%%%Jj%
4708B%j%J%J%j%%%Jj%%%%%j%JJ%%JJj%%%jj%%j%%%%%J%%%%%%j%jJJj%JJjj%%J%%j%%%%J%j
4697A%%%%JJj%k%J%%%J%%%%%%j%%%J%J%%%jJJ%jJjj%%%%%%%%j%%%%jJ%J%%%%Jj%JJj%jj%%
4687A%Jj%%JjJ%JJjj%jjJKj%%%%%%%j%%jJJ%%jj%J%jJJ%%j%j%%%JJ%j%J%%%%%%j%%%jjJK%
4676BJj%%%%%j%%J%%%%%%%J%JkjJ%%%%%%%jK%%k%J%%%%%%Jj%%%%j%%%%%%JJ%J%%jk%%J%j%
4665AJ%JJj%j%%%%%%%%%%%%Jj%jjJ%%Jj%%%J%%Jj%%%%%%j%J%%%%%%J%j%j%%J%J%kJ%j%%%%
$$ plain form
4741 -1 1 1 2 2 1 0 0 1 2 2 1 2 2 2 1 1 1 2 2 3 3 2 2 2 3 2 2 2 2 2 2 2 1 1 2 1 1 2 2 2 1 1 2 2 2 3 3 3 3 2 2 2 2 2 1 1 1 1 0 0 0 1 1 1 1 2 2 2 2 2 3
4730 3 2 2 2 2 3 3 2 1 1 0 2 3 2 2 2 1 2 2 2 2 3 3 2 2 1 0 0 1 1 2 2 3 2 1 1 2 2 3 1 0 1 1 1 1 1 1 2 3 2 2 2 2 2 2 2 2 3 2 1 1 2 3 2 2 2 2 1 1 1 1 1
4719 1 2 2 3 3 3 2 2 2 2 1 1 1 1 1 2 2 2 2 2 2 2 2 2 2 2 2 1 1 2 3 2 1 1 1 1 2 3 4 3 4 3 2 2 2 2 2 2 2 2 2 1 1 0 0 1 2 2 2 2 2 2 2 2 2 2 2 2 2 3 2 2
4708 2 2 1 1 2 2 3 3 2 2 2 2 3 2 2 2 2 2 2 1 1 2 3 3 3 4 5 4 4 4 4 3 2 2 2 1 1 1 1 1 1 2 2 2 2 2 2 2 1 1 0 1 2 1 1 2 3 2 1 1 1 2 2 2 1 1 1 1 1 2 2 1
4697 1 1 1 1 1 2 3 2 2 0 0 1 1 1 1 2 2 2 2 2 2 2 1 1 1 1 2 2 3 3 3 3 2 3 4 4 3 4 3 2 2 2 2 2 2 2 2 2 1 1 1 1 1 0 1 1 2 2 2 2 2 3 2 2 3 4 3 3 2 1 1 1
4687 1 1 2 1 1 1 2 1 2 2 3 4 3 2 2 1 0 1 3 2 2 2 2 2 2 2 2 1 1 1 0 1 2 2 2 1 0 0 1 1 0 1 2 2 2 1 1 0 0 0 0 1 2 2 1 1 2 2 2 2 2 2 2 1 1 1 1 0 -1 0 2 2
4676 2 3 2 2 2 2 2 2 1 1 1 2 2 2 2 2 2 2 2 3 3 4 2 1 2 2 2 2 2 2 2 2 1 3 3 3 1 1 2 2 2 2 2 2 2 3 2 2 2 2 2 1 1 1 1 1 1 1 2 3 3 4 4 4 3 1 1 1 2 2 1 1
4665 1 2 2 3 4 3 3 2 2 2 2 2 2 2 2 2 2 2 2 2 3 2 2 1 0 1 1 1 2 1 1 1 1 2 2 2 3 2 2 2 2 2 2 2 1 1 2 2 2 2 2 2 2 3 3 2 2 1 1 1 2 2 3 3 1 2 2 1 1 1 1 1
4654A%%J%%kj%JJ%jJJ%%%j%%j%JJ%%%jJ%%J%j%%%%%j%j%jJ%J%J%%Jj%Jjj%J%%%%J%%%j%J%
4643C%jJ%j%j%J%J%%Jjk%%%%%%%jJ%%%%%Jj%jJJ%J%%%jJ%jjJJj%%jjjJ%J%J%jJj%%%%j%%J
4632A%%%J%%%%j%%J%%%%j%%%%%%JJj%%%%%%Jj%%j%jJJJ%jj%%JkJ%%%%jJJ%%%%%%%j%%%%JJ
4622C%j%%%%%%%%J%%%%%%%j%%%%j%%%%%%%%%%%%J%%j%%%J%JjjJ%%%%%%%j%%Jj%%jJJ%Jjj%
4611AJ%%%%%%%%%jKJj%%j%%%Jjj%%%Jj%J%%%JJjk%%J%%JkJj%jJJ%%j%jJ%%Jjj%%JJ%%%%%j
4600A%J%%%%%J%%%%%%jj%J%%%%%%j%%JJJjjj%JJ%%jk%%JJjjjJ%J%%%%%%%Jj%%Jj%%%%%%J%
4589BJjjJ%%%%%%%%J%%j%%kjJJ%%J%j%%%%J%%jJ%%J%%%j%%j%JJ%j%%%J%%%%j%j%K%jj%J%j
4578AJ%%%J%%%k%%%%%%%%%%%%Jj%%%%J%k%J%J%jJ%J%%jJ%%jJ%j%%%%%%jJ%%%%J%%JjjjJ%K
$$ plain form
4654 1 1 1 2 2 2 0 -1 -1 0 1 1 0 1 2 2 2 2 1 1 1 0 0 1 2 2 2 2 1 2 2 2 3 3 2 2 2 2 2 2 1 1 0 0 -1 0 0 1 1 2 2 2 3 2 2 3 2 1 1 2 2 2 2 2 3 3 3 3 2 2 3 3
4643 3 3 2 3 3 2 2 1 1 2 2 3 3 3 4 3 1 1 1 1 1 1 1 1 0 1 1 1 1 1 1 2 1 1 0 1 2 2 3 3 3 3 2 3 3 2 1 2 3 2 2 2 1 0 -1 0 0 1 1 2 2 1 2 1 1 1 1 1 0 0 0 1
4632 1 1 1 1 2 2 2 2 2 1 1 1 2 2 2 2 2 1 1 1 1 1 1 1 2 3 2 2 2 2 2 2 2 3 2 2 2 1 1 0 1 2 3 3 2 1 1 1 2 0 1 1 1 1 1 0 1 2 2 2 2 2 2 2 2 1 1 1 1 1 2 3
4622 3 3 2 2 2 2 2 2 2 2 2 3 3 3 3 3 3 3 3 2 2 2 2 2 1 1 1 1 1 1 1 1 1 1 1 1 1 2 2 2 1 1 1 1 2 2 3 2 1 2 2 2 2 2 2 2 2 1 1 1 2 1 1 1 0 1 2 2 3 2 1 1
4611 1 2 2 2 2 2 2 2 2 2 2 1 3 4 3 3 3 2 2 2 2 3 2 1 1 1 1 2 1 1 2 2 2 2 3 4 3 1 1 1 2 2 2 3 1 2 1 1 0 1 2 2 2 1 1 0 1 1 1 2 1 0 0 0 1 2 2 2 2 2 2 1
4600 1 1 2 2 2 2 2 2 3 3 3 3 3 3 3 2 1 1 2 2 2 2 2 2 2 1 1 1 2 3 4 3 2 1 1 2 3 3 3 2 0 0 0 1 2 1 0 -1 0 0 1 1 1 1 1 1 1 1 2 1 1 1 2 1 1 1 1 1 1 1 2 2
4589 2 3 2 1 2 2 2 2 2 2 2 2 2 3 3 3 2 2 2 0 -1 0 1 1 1 2 2 1 1 1 1 1 2 2 2 1 2 2 2 3 3 3 3 2 2 2 1 1 2 3 3 2 2 2 2 3 3 3 3 3 2 2 1 1 3 3 2 1 1 2 2 1
4578 1 2 2 2 2 3 3 3 3 1 1 1 1 1 1 1 1 1 1 1 1 1 2 1 1 1 1 1 2 2 0 0 1 1 2 2 1 2 2 3 3 3 2 3 3 3 2 3 3 2 2 2 2 2 2 2 1 2 2 2 2 2 3 3 3 4 3 2 1 2 2 4
4567D%j%j%%%%%j%%%j%%%J%JjjJJ%%%J%J%%jjJJjj%%jJ%%%%%%%J%%Jjjj%%%%%%%%J%jJ%%j
4557AJ%%%%%j%%jK%j%J%j%%%JjjKJ%j%%%j%%%%J%%%%%%%JjjjLJ%%%kjJJj%J%%j%%%%%%J%k
4546A%%%%%JJj%%j%%%%J%%Jj%%j%jJ%%%%%J%%%Jjj%J%jJ%%%JjjJ%%Jj%j%%%%jJJ%%%Jj%%j
4535AJ%%%%%jj%JjjJKj%%Jj%%J%%%%J%kj%%%JJ%%jJ%%%J%%Jkj%%%JJ%%%k%JJjJj%%%%%%%J
4524CJj%%%j%%%jJ%j%J%%%%%%%%%j%%jJJ%%jj%K%%%%%%%%jJJ%j%%%%%J%Jj%%%%%%%jj%%J%
4513B%%%%%%j%J%J%%jj%%Jj%%J%J%jjJ%%jJJ%j%jjJ%%J%%%j%J%%%%%%%%%j%%%%JJ%%j%%j%
4502AJ%%%%j%%K%%j%%%%%%J%%j%%%j%jJK%kJjJ%%j%%j%%JJ%%j%%jJ%J%j%%Jj%%%%%%%j%%%
4492@J%%%%%JJj%Jjj%%J%%j%J%%%j%%%J%Jj%J%j%%%%%%J%%%%%j%%%jKJ%jjjJ%%jJJ%%jJjk
$$ plain form
4567 4 4 3 3 2 2 2 2 2 2 1 1 1 1 0 0 0 0 1 1 2 1 0 1 2 2 2 2 3 3 4 4 4 3 2 3 4 3 2 2 2 1 2 2 2 2 2 2 2 2 3 3 3 4 3 2 1 1 1 1 1 1 1 1 1 2 2 1 2 2 2 1
4557 1 2 2 2 2 2 2 1 1 1 0 2 2 1 1 2 2 1 1 1 1 2 1 0 2 3 3 2 2 2 2 1 1 1 1 1 2 2 2 2 2 2 2 2 3 2 1 0 3 4 4 4 4 2 1 2 3 2 2 3 3 3 2 2 2 2 2 2 2 3 3 1
4546 1 1 1 1 1 1 2 3 2 2 2 1 1 1 1 1 2 2 2 3 2 2 2 1 1 0 1 1 1 1 1 1 2 2 2 2 3 2 1 1 2 2 1 2 2 2 2 3 2 1 2 2 2 3 2 2 1 1 1 1 1 0 1 2 2 2 2 3 2 2 2 1
4535 1 2 2 2 2 2 2 1 0 0 1 0 -1 0 2 1 1 1 2 1 1 1 2 2 2 2 2 3 3 1 0 0 0 0 1 2 2 2 1 2 2 2 2 3 3 3 4 2 1 1 1 1 2 3 3 3 3 1 1 2 3 2 3 2 2 2 2 2 2 2 2 3
4524 3 4 3 3 3 3 2 2 2 2 1 2 2 1 1 2 2 2 2 2 2 2 2 2 2 1 1 1 0 1 2 2 2 1 0 0 2 2 2 2 2 2 2 2 2 1 2 3 3 2 2 2 2 2 2 3 3 4 3 3 3 3 3 3 3 3 2 1 1 1 2 2
4513 2 2 2 2 2 2 2 1 1 2 2 3 3 3 2 1 1 1 2 1 1 1 2 2 3 3 2 1 2 2 2 1 2 3 3 2 2 1 0 1 1 1 2 2 2 2 1 1 2 2 2 2 2 2 2 2 2 2 1 1 1 1 1 2 3 3 3 2 2 2 1 1
4502 1 2 2 2 2 2 1 1 1 3 3 3 2 2 2 2 2 2 2 3 3 3 2 2 2 2 1 1 0 1 3 3 1 2 1 2 2 2 1 1 1 0 0 0 1 2 2 2 1 1 1 0 1 1 2 2 1 1 1 2 1 1 1 1 1 1 1 1 0 0 0 0
4492 0 1 1 1 1 1 1 2 3 2 2 3 2 1 1 1 2 2 2 1 1 2 2 2 2 1 1 1 1 2 2 3 2 2 3 3 2 2 2 2 2 2 2 3 3 3 3 3 3 2 2 2 2 1 3 4 4 3 2 1 2 2 2 1 2 3 3 3 2 3 2 0
4481@%JK%j%j%%%%%Jj%%%%%%J%%j%J%%%j%%%%J%Jj%jJ%j%%%%%J%%JJjj%jJJ%%%%jjjJJJ%j
4470BJ%j%jjJJ%Jjj%%%%jJJ%%%%j%J%j%%%J%%j%%%%%JJj%%%%%j%%J%%%J%%%%j%%%%%%%Jj%
4459B%%%%%%%%%%%%%%%jKj%J%%j%%%Jjjj%%jJJJ%JJ%jj%%j%%J%%j%%%J%J%%%%j%%%%J%%%%
4448Cj%%%%jJJ%j%%%%%Jjj%%JJjjJJj%%%%j%%%J%%%%%j%Jj%jJJ%JjJ%J%jjj%%J%%%j%%%J%
4437BJj%J%%%%jj%Jj%J%Jj%%J%jj%JJj%%J%%j%j%%JjJ%Jj%j%%%%%%%J%jJ%%j%%%JJ%j%jJ%
4426B%jj%J%%%%%J%%%%%%jJ%%%%j%J%%%%%j%%J%%%%jJ%%%%%%j%%%%%%%J%Jj%%%j%%Jj%%Jj
4416A%J%jJJj%%J%%%jj%%%J%%%Jj%%JJjj%%%jj%%J%JJjj%%%%jJJj%J%%%Jjj%%%%%J%%%%%%
4405B%%jj%J%%JJ%%jj%%%j%J%%%%%%J%%J%J%j%jj%%%%%%%%%%%%J%%JjjJJJjkJJ%%%Jjj%J%
$$ plain form
4481 0 0 1 3 3 2 2 1 1 1 1 1 1 2 1 1 1 1 1 1 1 2 2 2 1 1 2 2 2 2 1 1 1 1 1 2 2 3 2 2 1 2 2 1 1 1 1 1 1 2 2 2 3 4 3 2 2 1 2 3 3 3 3 3 2 1 0 1 2 3 3 2
4470 2 3 3 2 2 1 0 1 2 2 3 2 1 1 1 1 1 0 1 2 2 2 2 2 1 1 2 2 1 1 1 1 2 2 2 1 1 1 1 1 1 2 3 2 2 2 2 2 2 1 1 1 2 2 2 2 3 3 3 3 3 2 2 2 2 2 2 2 2 3 2 2
4459 2 2 2 2 2 2 2 2 2 2 2 2 2 2 2 2 1 3 2 2 3 3 3 2 2 2 2 3 2 1 0 0 0 -1 0 1 2 2 3 4 4 3 2 2 2 1 1 1 2 2 2 1 1 1 1 2 2 3 3 3 3 3 2 2 2 2 2 3 3 3 3 3
4448 3 2 2 2 2 2 1 2 3 3 2 2 2 2 2 2 3 2 1 1 1 2 3 2 1 2 3 2 2 2 2 2 1 1 1 1 2 2 2 2 2 2 1 1 2 1 1 0 1 2 2 3 2 3 3 4 4 3 2 1 1 1 2 2 2 2 1 1 1 1 2 2
4437 2 3 2 2 3 3 3 3 3 2 1 1 2 1 1 2 2 3 2 2 2 3 3 2 1 1 2 3 2 2 2 3 3 3 2 2 1 1 1 2 1 2 2 3 2 2 1 1 1 1 1 1 1 1 2 2 1 2 2 2 1 1 1 1 2 3 3 2 2 1 2 2
4426 2 2 1 0 0 1 1 1 1 1 1 2 2 2 2 2 2 2 1 2 2 2 2 2 1 1 2 2 2 2 2 2 1 1 1 2 2 2 2 2 1 2 2 2 2 2 2 2 1 1 1 1 1 1 1 1 2 2 3 2 2 2 2 1 1 1 2 1 1 1 2 1
4416 1 1 2 2 1 2 3 2 2 2 3 3 3 3 2 1 1 1 1 2 2 2 2 3 2 2 2 3 4 3 2 2 2 2 1 0 0 0 1 1 2 3 2 1 1 1 1 1 0 1 2 1 1 2 2 2 2 3 2 1 1 1 1 1 1 2 2 2 2 2 2 2
4405 2 2 2 1 0 0 1 1 1 2 3 3 3 2 1 1 1 1 0 0 1 1 1 1 1 1 1 2 2 2 3 3 4 4 3 3 2 1 1 1 1 1 1 1 1 1 1 1 1 1 2 2 2 3 2 1 2 3 4 3 1 2 3 3 3 3 4 3 2 2 3 3
4394Cj%%%JjjJj%J%%%%%%%%JJj%kjJJ%%%%%%jjKJj%%%%jJJ%%%jj%%%%J%%%%j%%%j%%%%%j%
4383aJJ%%%jJJ%%j%%jJ%%%j%%J%J%J%%j%%%%j%j%%JJ%%%jJ%j%%JJ%Jj%j%j%j%%%J%j%JJ%J
4372CJ%jj%%%%jJ%J%%%%jJ%%k%J%j%%J%%Jj%%%%%%%J%%%jj%%%jJJ%Jj%%%%jJJjj%%%J%%J%
4361Cjj%Jj%J%%%%Jjj%J%j%%J%%J%%%%j%%%%%%%%%j%J%%%%%%%j%%%%%J%%%%%%%%%%%%%%J%
4351C%%%j%%J%jjJ%j%J%Jj%%%%%%j%%%%%J%j%%JJj%%j%%K%%j%%%%%%%%%Jj%%jJ%%j%J%J%%
4340C%%jj%J%%%%%jJ%%%%%%%J%JkjJJj%Jjjj%J%%J%%%%J%j%jJJjj%J%J%%j%jJJ%%j%J%%j%
4329B%%jJ%j%%%%JJJ%j%Jjjj%JJj%jJ%J%jjJ%jKJkj%%%J%%%j%%%%%%JJj%%jJJ%%%j%%%j%J
4318B%%J%j%J%j%%JJJjj%J%jj%jJ%j%%%%J%JJjjj%%%%J%%j%%JJ%jjJ%J%%%j%j%j%%%%%JJ%
$$ plain form
4394 3 2 2 2 2 3 2 1 2 1 1 2 2 2 2 2 2 2 2 2 3 4 3 3 1 0 1 2 2 2 2 2 2 2 1 0 2 3 2 2 2 2 2 1 2 3 3 3 3 2 1 1 1 1 1 2 2 2 2 2 1 1 1 1 0 0 0 0 0 0 -1 -1
4383 -1 0 1 1 1 1 0 1 2 2 2 1 1 1 0 1 1 1 1 0 0 0 1 1 2 2 3 3 3 2 2 2 2 2 1 1 0 0 0 1 2 2 2 2 1 2 2 1 1 1 2 3 3 4 3 3 2 2 1 1 0 0 0 0 1 1 0 0 1 2 2 3
4372 3 4 4 3 2 2 2 2 2 1 2 2 3 3 3 3 3 2 3 3 3 1 1 2 2 1 1 1 2 2 2 3 2 2 2 2 2 2 2 2 3 3 3 3 2 1 1 1 1 0 1 2 2 3 2 2 2 2 2 1 2 3 2 1 1 1 1 2 2 2 3 3
4361 3 2 1 1 2 1 1 2 2 2 2 2 3 2 1 1 2 2 1 1 1 2 2 2 3 3 3 3 3 2 2 2 2 2 2 2 2 2 2 1 1 2 2 2 2 2 2 2 2 1 1 1 1 1 1 2 2 2 2 2 2 2 2 2 2 2 2 2 2 2 3 3
4351 3 3 3 3 2 2 2 3 3 2 1 2 2 1 1 2 2 3 2 2 2 2 2 2 2 1 1 1 1 1 1 2 2 1 1 1 2 3 2 2 2 1 1 1 3 3 3 2 2 2 2 2 2 2 2 2 2 3 2 2 2 1 2 2 2 1 1 2 2 3 3 3
4340 3 3 3 2 1 1 2 2 2 2 2 2 1 2 2 2 2 2 2 2 2 3 3 4 2 1 2 3 2 2 3 2 1 0 0 1 1 1 2 2 2 2 2 3 3 2 2 1 2 3 2 1 1 2 2 3 3 3 2 2 1 2 3 3 3 2 2 3 3 3 2 2
4329 2 2 2 1 2 2 1 1 1 1 1 2 3 4 4 3 3 4 3 2 1 1 2 3 2 2 1 2 2 3 3 2 1 2 2 1 3 4 2 1 1 1 1 2 2 2 2 1 1 1 1 1 1 1 2 3 2 2 2 1 2 3 3 3 3 2 2 2 2 1 1 2
4318 2 2 2 3 3 2 2 3 3 2 2 2 3 4 5 4 3 3 4 4 3 2 2 1 2 2 1 1 1 1 1 2 2 3 4 3 2 1 1 1 1 1 2 2 2 1 1 1 2 3 3 2 1 2 2 3 3 3 3 2 2 1 1 0 0 0 0 0 0 1 2 2
4307BJ%%%%%%j%%%j%%jJ%J%%JJj%j%JJ%j%jjJ%j%%j%%%%K%Jj%%j%%%J%%%%%%J%%%%jj%%JJ
4296Cjj%%%%J%%%%Jj%%%J%%%j%%%jJ%j%%J%%jj%JJJ%jj%%%%%J%j%J%j%J%%%%%%J%%%%%J%%
4286D%j%%%%%%%%%%%%j%%%J%%%%j%%jJj%J%J%Jj%j%%J%%%%%%%%J%%%%%j%Jj%%j%%%j%J%%%
4275B%%%%%%JJ%jJj%JjjjJ%%%%%%%%%%%%%Jj%%%%JJjj%J%%%%%%j%%%%%%%jJ%%%%%kJJJ%%j
4264B%jjJJ%JJ%jj%%J%%%%j%j%%JJ%%j%%%%%%%%%J%%j%%%%%%%jKj%%jJj%J%J%jJ%%j%%%%%
4253B%jJ%%Jjj%%J%J%%%%j%%J%j%j%J%j%JJ%%%Jj%j%j%%%jJ%%JKjj%J%j%j%%%JjjJJj%%%J
4242BJ%%%jj%JJ%%%%j%j%J%%%%%%%Jj%jJJj%%%%%%J%jJ%%%%j%%%%J%%%jj%%JJ%%%j%%%Jj%
4231Bj%%jJJ%%%J%%%%%%J%j%jj%%%J%%Jjj%j%J%%jJJ%%%%%%%%%Jj%%Jj%%%%%%%j%%%%%j%%
$$ plain form
4307 2 3 3 3 3 3 3 3 2 2 2 2 1 1 1 0 1 1 2 2 2 3 4 3 3 2 2 3 4 4 3 3 2 1 2 2 1 1 1 0 0 0 0 0 2 2 3 2 2 2 1 1 1 1 2 2 2 2 2 2 2 3 3 3 3 3 2 1 1 1 2 3
4296 3 2 1 1 1 1 1 2 2 2 2 2 3 2 2 2 2 3 3 3 3 2 2 2 2 1 2 2 1 1 1 2 2 2 1 0 0 1 2 3 3 2 1 1 1 1 1 1 2 2 1 1 2 2 1 1 2 2 2 2 2 2 2 3 3 3 3 3 3 4 4 4
4286 4 4 3 3 3 3 3 3 3 3 3 3 3 3 3 2 2 2 2 3 3 3 3 3 2 2 2 1 2 1 1 2 2 3 3 4 3 3 2 2 2 3 3 3 3 3 3 3 3 3 4 4 4 4 4 4 3 3 4 3 3 3 2 2 2 2 1 1 2 2 2 2
4275 2 2 2 2 2 2 2 3 4 4 3 4 3 3 4 3 2 1 2 2 2 2 2 2 2 2 2 2 2 2 2 2 3 2 2 2 2 2 3 4 3 2 2 3 3 3 3 3 3 3 2 2 2 2 2 2 2 2 1 2 2 2 2 2 2 0 1 2 3 3 3 2
4264 2 2 1 0 1 2 2 3 4 4 3 2 2 2 3 3 3 3 3 2 2 1 1 1 2 3 3 3 2 2 2 2 2 2 2 2 2 2 3 3 3 2 2 2 2 2 2 2 2 1 3 2 2 2 1 2 1 1 2 2 3 3 2 3 3 3 2 2 2 2 2 2
4253 2 2 1 2 2 2 3 2 1 1 1 2 2 3 3 3 3 3 2 2 2 3 3 2 2 1 1 2 2 1 1 2 3 3 3 3 4 3 3 2 2 1 1 1 1 0 1 1 1 2 4 3 2 2 3 3 2 2 1 1 1 1 2 1 0 1 2 1 1 1 1 2
4242 2 3 3 3 3 2 1 1 2 3 3 3 3 3 2 2 1 1 2 2 2 2 2 2 2 2 3 2 2 1 2 3 2 2 2 2 2 2 2 3 3 2 3 3 3 3 3 2 2 2 2 2 3 3 3 3 2 1 1 1 2 3 3 3 3 2 2 2 2 3 2 2
4231 2 1 1 1 0 1 2 2 2 2 3 3 3 3 3 3 3 4 4 3 3 2 1 1 1 1 2 2 2 3 2 1 1 0 0 1 1 1 0 1 2 2 2 2 2 2 2 2 2 2 3 2 2 2 3 2 2 2 2 2 2 2 2 1 1 1 1 1 1 0 0 0
4221@JJ%%Jj%jjJ%J%%jJ%%%%j%J%%%%%J%%%j%j%%j%%J%JJ%%%%%j%jjKJ%%%%j%j%Jj%%%%%%
4210A%%%%J%J%J%jj%%J%%%j%%j%%%jJ%%J%%%J%%%Jj%%%%%%%JkJ%j%%Jj%j%%%%%%%%%%%%%%
4199A%J%%Jj%%jJJ%%jj%%KjjJ%%%%%j%%%%JJjjj%J%K%%jj%%%%%%%%JjJJJj%%%%%%jJ%%%j%
4188Bj%J%%Jj%%%%%j%%J%%j%jJJJjjJ%%%%Jj%%%j%%%%%K%j%%%%%%%%%%J%%%%j%JJ%%jj%%%
4177B%jJ%%jJJ%%jjJ%j%%JJ%jJJj%%%%%%%%%j%%%%Jj%%%J%J%jjjJJ%j%j%%JJ%%%%j%%%jj%
4166@JJ%j%%%J%%%j%%J%%%%JJj%j%JJJ%j%%%%jj%%%%jJjj%JJ%J%%j%j%J%%%%%Jj%%%%%j%J
4156BJ%%%j%JJjjj%%%Jj%JKj%jj%J%%%Jj%jJJ%%%%%j%%%%Jj%%J%j%%%j%%K%%%%%j%J%%%%%
4145CJkjJJ%%%jj%J%JJj%%%%%J%jj%J%%jjJJj%%%%%%%%j%J%%%%%J%j%%jjJ%%%JJ%%J%jjj%
$$ plain form
4221 0 1 2 2 2 3 2 2 1 0 1 1 2 2 2 1 2 2 2 2 2 1 1 2 2 2 2 2 2 3 3 3 3 2 2 1 1 1 0 0 0 1 1 2 3 3 3 3 3 3 2 2 1 0 2 3 3 3 3 3 2 2 1 1 2 1 1 1 1 1 1 1
4210 1 1 1 1 1 2 2 3 3 4 4 3 2 2 2 3 3 3 3 2 2 2 1 1 1 1 0 1 1 1 2 2 2 2 3 3 3 3 4 3 3 3 3 3 3 3 3 4 2 3 3 2 2 2 3 2 2 1 1 1 1 1 1 1 1 1 1 1 1 1 1 1
4199 1 1 2 2 2 3 2 2 2 1 2 3 3 3 2 1 1 1 3 2 1 2 2 2 2 2 2 1 1 1 1 1 2 3 2 1 0 0 1 1 3 3 3 2 1 1 1 1 1 1 1 1 1 2 1 2 3 4 3 3 3 3 3 3 3 2 3 3 3 3 2 2
4188 2 1 1 2 2 2 3 2 2 2 2 2 2 1 1 1 2 2 2 1 1 0 1 2 3 2 1 2 2 2 2 2 3 2 2 2 2 1 1 1 1 1 1 3 3 2 2 2 2 2 2 2 2 2 2 2 3 3 3 3 3 2 2 3 4 4 4 3 2 2 2 2
4177 2 2 1 2 2 2 1 2 3 3 3 2 1 2 2 1 1 1 2 3 3 2 3 4 3 3 3 3 3 3 3 3 3 3 2 2 2 2 2 3 2 2 2 2 3 3 4 4 3 2 1 2 3 3 2 2 1 1 1 2 3 3 3 3 3 2 2 2 2 1 0 0
4166 0 1 2 2 1 1 1 1 2 2 2 2 1 1 1 2 2 2 2 2 3 4 3 3 2 2 3 4 5 5 4 4 4 4 4 3 2 2 2 2 2 1 2 1 0 0 1 2 2 3 3 3 2 2 1 1 2 2 2 2 2 2 3 2 2 2 2 2 2 1 1 2
4156 2 3 3 3 3 2 2 3 4 3 2 1 1 1 1 2 1 1 2 4 3 3 2 1 1 2 2 2 2 3 2 2 1 2 3 3 3 3 3 3 2 2 2 2 2 3 2 2 2 3 3 2 2 2 2 1 1 1 3 3 3 3 3 3 2 2 3 3 3 3 3 3
4145 3 4 2 1 2 3 3 3 3 2 1 1 2 2 3 4 3 3 3 3 3 3 4 4 3 2 2 3 3 3 2 1 2 3 2 2 2 2 2 2 2 2 2 1 1 2 2 2 2 2 2 3 3 2 2 2 1 0 1 1 1 1 2 3 3 3 4 4 3 2 1 1
4134AJ%%%%j%%%%%J%%%%%%J%%%%j%%%%J%j%%%%%%%%j%%J%%%%%j%%%%%jJ%%J%%%J%jJJj%j%
4123B%%JJjj%j%%%%%J%J%%%j%Jjj%J%j%%%J%%%%%%jjJJ%%jj%%J%%%%%%JJ%%j%j%%J%%j%%J
4112BJj%%j%%JjJ%%J%%%Jj%%%jj%J%jJ%%%j%%%j%%JJ%%jJ%%J%%jjJJj%%%%%%%j%%J%%%%j%
4101A%%J%%%%j%%Jj%JJj%%%%%Jj%jjJ%%%JJj%%jJ%J%k%%J%%%Jj%%%%jJj%J%Jjj%J%%%%%%%
4091BJ%%%%%j%%%J%%j%%%%%%%%%jjK%JJj%j%j%JJ%jjJ%j%jJ%%%%%%%%%JJ%%%%%%j%%%%%J%
4080C%%%j%jJ%%%%J%%jJ%%%%%j%%j%jJJJj%%j%%J%%%%%%%%%%%%%J%J%j%%%%%j%%%J%%jJ%%
4069C%%j%jJJjj%Jj%%%J%J%%%%%j%%%%J%j%%%%jjJ%J%%%%%%%J%J%%%j%%%jjjK%jJ%%%%%J%
4058C%kjJJjJ%%%%%%%j%%J%%J%jJJjj%%%j%%%JJ%jJ%jjJJ%%%Jj%jj%%JJ%%j%%%%%%%%j%%J
$$ plain form
4134 1 2 2 2 2 2 1 1 1 1 1 1 2 2 2 2 2 2 2 3 3 3 3 3 2 2 2 2 2 3 3 2 2 2 2 2 2 2 2 2 1 1 1 2 2 2 2 2 2 1 1 1 1 1 1 0 1 1 1 2 2 2 2 3 3 2 3 4 3 3 2 2
4123 2 2 2 3 4 3 2 2 1 1 1 1 1 1 2 2 3 3 3 3 2 2 3 2 1 1 2 2 1 1 1 1 2 2 2 2 2 2 2 1 0 1 2 2 2 1 0 0 0 1 1 1 1 1 1 1 2 3 3 3 2 2 1 1 1 2 2 2 1 1 1 2
4112 2 3 2 2 2 1 1 1 2 1 2 2 2 3 3 3 3 4 3 3 3 3 2 1 1 2 2 1 2 2 2 2 1 1 1 1 0 0 0 1 2 2 2 1 2 2 2 3 3 3 2 1 2 3 2 2 2 2 2 2 2 2 1 1 1 2 2 2 2 2 1 1
4101 1 1 1 2 2 2 2 2 1 1 1 2 1 1 2 3 2 2 2 2 2 2 3 2 2 1 0 1 1 1 1 2 3 2 2 2 1 2 2 3 3 1 1 1 2 2 2 2 3 2 2 2 2 2 1 2 1 1 2 2 3 2 1 1 2 2 2 2 2 2 2 2
4091 2 3 3 3 3 3 3 2 2 2 2 3 3 3 2 2 2 2 2 2 2 2 2 2 1 0 2 2 3 4 3 3 2 2 1 1 2 3 3 2 1 2 2 1 1 0 1 1 1 1 1 1 1 1 1 1 2 3 3 3 3 3 3 3 2 2 2 2 2 2 3 3
4080 3 3 3 3 2 2 1 2 2 2 2 2 3 3 3 2 3 3 3 3 3 3 2 2 2 1 1 0 1 2 3 2 2 2 1 1 1 2 2 2 2 2 2 2 2 2 2 2 2 2 2 3 3 4 4 3 3 3 3 3 3 2 2 2 2 3 3 3 2 3 3 3
4069 3 3 3 2 2 1 2 3 2 1 1 2 1 1 1 1 2 2 3 3 3 3 3 3 2 2 2 2 2 3 3 2 2 2 2 2 1 0 1 1 2 2 2 2 2 2 2 2 3 3 4 4 4 4 3 3 3 3 2 1 0 2 2 1 2 2 2 2 2 2 3 3
4058 3 3 1 0 1 2 1 2 2 2 2 2 2 2 2 1 1 1 2 2 2 3 3 2 3 4 3 2 2 2 2 1 1 1 1 2 3 3 2 3 3 2 1 2 3 3 3 3 4 3 3 2 1 1 1 2 3 3 3 2 2 2 2 2 2 2 2 2 1 1 1 2
4047B%%%%jJ%%j%J%%%j%%Kj%%Jj%jJ%%%%%%%j%j%JJ%%%%%%%%%Jj%%%%%j%%J%%%j%%K%j%%%
4036Bj%JJjj%%%%J%%%%%J%j%%j%%J%%%j%%J%J%j%%%%%%%%%j%%%%%J%%%%%Jjj%%%JJj%%%%j
4026AjJJ%%J%%%%%%%%%j%J%j%%j%%%J%%jjJ%%Jjj%JJ%%jJJ%%%%jJ%%%%j%j%Jj%%%J%%jJJ%
4015CJ%jj%%j%J%J%%%j%%%%%J%%%jj%%JJ%%j%J%%%%%%jjJ%%jJj%%JJ%%%%%j%%%%%j%JKj%%
4004C%%%%j%%%%%j%J%J%%jJ%Jj%J%jjJJ%%j%jj%J%JJjjJ%%j%%j%%JKkj%J%%%%Jj%J%%Jj%j
3993B%J%%%%j%%J%%%%j%%Jj%%%%%%%%%%%%Jj%j%%j%%JJ%%%%%%%Jjj%%%%JJJj%%j%J%jJ%j%
3982B%%%%%%%j%j%J%JJjjjJJJj%J%%%j%%J%%j%%%%%%%%%J%j%%%Jjjj%%JJ%%%JjJjj%%%%JJ
3971C%Jk%JJk%JJjjj%%%J%%%%%%JJ%%j%%%%%%%%jj%%J%%%%%%%%%%%%%%%%J%%%%%j%j%jJJ%
$$ plain form
4047 2 2 2 2 2 1 2 2 2 1 1 2 2 2 2 1 1 1 3 2 2 2 3 2 2 1 2 2 2 2 2 2 2 2 1 1 0 0 1 2 2 2 2 2 2 2 2 2 2 3 2 2 2 2 2 2 1 1 1 2 2 2 2 1 1 1 3 3 2 2 2 2
4036 2 1 1 2 3 2 1 1 1 1 1 2 2 2 2 2 2 3 3 2 2 2 1 1 1 2 2 2 2 1 1 1 2 2 3 3 2 2 2 2 2 2 2 2 2 2 1 1 1 1 1 1 2 2 2 2 2 2 3 2 1 1 1 1 2 3 2 2 2 2 2 1
4026 1 0 1 2 2 2 3 3 3 3 3 3 3 3 3 3 2 2 3 3 2 2 2 1 1 1 1 2 2 2 1 0 1 1 1 2 1 0 0 1 2 2 2 1 2 3 3 3 3 3 2 3 3 3 3 3 2 2 1 1 2 1 1 1 1 2 2 2 1 2 3 3
4015 3 4 4 3 2 2 2 1 1 2 2 3 3 3 3 2 2 2 2 2 2 3 3 3 3 2 1 1 1 2 3 3 3 2 2 3 3 3 3 3 3 3 2 1 2 2 2 1 2 1 1 1 2 3 3 3 3 3 3 2 2 2 2 2 2 1 1 2 4 3 3 3
4004 3 3 3 3 3 2 2 2 2 2 2 1 1 2 2 3 3 3 2 3 3 4 3 3 4 4 3 2 3 4 4 4 3 3 2 1 1 2 2 3 4 3 2 3 3 3 2 2 2 1 1 1 2 4 2 1 1 2 2 2 2 2 3 2 2 3 3 3 4 3 3 2
3993 2 2 3 3 3 3 3 2 2 2 3 3 3 3 3 2 2 2 3 2 2 2 2 2 2 2 2 2 2 2 2 2 3 2 2 1 1 1 0 0 0 1 2 2 2 2 2 2 2 2 3 2 1 1 1 1 1 2 3 4 3 3 3 2 2 3 3 2 3 3 2 2
3982 2 2 2 2 2 2 2 2 1 1 0 0 1 1 2 3 2 1 0 1 2 3 2 2 3 3 3 3 2 2 2 3 3 3 2 2 2 2 2 2 2 2 2 2 3 3 2 2 2 2 3 2 1 0 0 0 1 2 2 2 2 3 2 3 2 1 1 1 1 1 2 3
3971 3 3 4 2 2 3 4 2 2 3 4 3 2 1 1 1 1 2 2 2 2 2 2 2 3 4 4 4 3 3 3 3 3 3 3 3 3 2 1 1 1 2 2 2 2 2 2 2 2 2 2 2 2 2 2 2 2 2 3 3 3 3 3 3 2 2 1 1 0 1 2 2
3961B%%%%%%%%%%%%%%%J%J%Kjjj%%%j%J%%%%J%jjjJ%%%%J%%j%%%Jj%JjjK%%j%%%j%%J%%%%
3950B%%%%%jJ%Jj%%jJ%%%%%%K%j%%%%Jj%j%J%%%%%%%%J%j%%%j%jJ%%%%%%j%J%JjjJ%%%%%%
3939B%%%%jJJkjJJ%%%J%%%%%j%%%%jj%%J%J%%%%jJJ%j%%%%J%%jJ%Jj%%Jk%%J%%jJjjj%K%J
3928CjjJJj%%%J%%%%Jjj%%%%%J%%%%%jj%JJk%j%jJK%%Jj%%j%%%Jj%J%%JjJ%j%%JJ%j%jjj%
3917@%JJ%%%J%%%jj%%%J%%%j%JJjJ%%%%K%jj%Jj%Jjj%%J%j%%J%%%%j%%%jJJ%%j%J%j%j%%J
3906B%%j%%%j%%J%%%%%jJ%%%%%J%j%jJ%j%%%%%J%J%%%%%JJjj%J%%%j%%%%Jj%%%Jjj%J%%%%
3896B%%%J%j%%J%JjjJ%%%j%%%%%%%JJj%j%j%%J%JJ%jj%%%%%jJJj%%Jj%%%%%%%%%%%J%%jJ%
3885C%J%j%jjjJJJ%jJJj%%j%%J%%%j%%%Jj%jjJ%J%%jJ%%Jjj%%%J%j%%%%J%j%J%j%%J%j%%%
$$ plain form
3961 2 2 2 2 2 2 2 2 2 2 2 2 2 2 2 2 3 3 4 4 6 5 4 3 3 3 3 2 2 3 3 3 3 3 4 4 3 2 1 2 2 2 2 2 3 3 3 2 2 2 2 3 2 2 3 2 1 3 3 3 2 2 2 2 1 1 1 2 2 2 2 2
3950 2 2 2 2 2 2 1 2 2 3 2 2 2 1 2 2 2 2 2 2 2 4 4 3 3 3 3 3 4 3 3 2 2 3 3 3 3 3 3 3 3 3 4 4 3 3 3 3 2 2 1 2 2 2 2 2 2 2 1 1 2 2 3 2 1 2 2 2 2 2 2 2
3939 2 2 2 2 2 1 2 3 1 0 1 2 2 2 2 3 3 3 3 3 3 2 2 2 2 2 1 0 0 0 1 1 2 2 2 2 2 1 2 3 3 2 2 2 2 2 3 3 3 2 3 3 4 3 3 3 4 2 2 2 3 3 3 2 3 2 1 0 0 2 2 3
3928 3 2 1 2 3 2 2 2 2 3 3 3 3 3 4 3 2 2 2 2 2 2 3 3 3 3 3 3 2 1 1 2 3 1 1 0 0 -1 0 2 2 2 3 2 2 2 1 1 1 1 2 1 1 2 2 2 3 2 3 3 2 2 2 3 4 4 3 3 2 1 0 0
3917 0 0 1 2 2 2 2 3 3 3 3 2 1 1 1 1 2 2 2 2 1 1 2 3 2 3 3 3 3 3 5 5 4 3 3 4 3 3 4 3 2 2 2 3 3 2 2 2 3 3 3 3 3 2 2 2 2 1 2 3 3 3 2 2 3 3 2 2 1 1 1 2
3906 2 2 2 1 1 1 1 0 0 0 1 1 1 1 1 1 0 1 1 1 1 1 1 2 2 1 1 0 1 1 0 0 0 0 0 0 1 1 2 2 2 2 2 2 3 4 3 2 2 3 3 3 3 2 2 2 2 2 3 2 2 2 2 3 2 1 1 2 2 2 2 2
3896 2 2 2 2 3 3 2 2 2 3 3 4 3 2 3 3 3 3 2 2 2 2 2 2 2 2 3 4 3 3 2 2 1 1 1 2 2 3 4 4 3 2 2 2 2 2 2 1 2 3 2 2 2 3 2 2 2 2 2 2 2 2 2 2 2 2 3 3 3 2 3 3
3885 3 3 4 4 3 3 2 1 0 1 2 3 3 2 3 4 3 3 3 2 2 2 3 3 3 3 2 2 2 2 3 2 2 1 0 1 1 2 2 2 1 2 2 2 3 2 1 1 1 1 2 2 1 1 1 1 1 2 2 1 1 2 2 1 1 1 2 2 1 1 1 1
3874A%%J%%%JjJJjj%%%%%%Jjj%%j%J%K%%%%%%%jj%J%%J%%%j%%%j%%Jj%J%%j%Jj%jJJjJ%%%
3863B%%%%%%%j%JJj%%j%J%%%%%%%%%Jj%%j%%%JJ%j%JJjkJ%%%%%%%%J%j%Jj%j%JJ%jj%%%%%
3852AJK%jj%j%JJ%jJj%J%%jjJ%%j%%%%JJk%J%JjJj%%JJJjj%Jjj%J%Jjj%%J%%j%%jJ%j%JJj
3841BJ%%jJ%%j%j%%%%%J%%%%%jJ%J%jj%%%J%J%kjK%Jj%J%jJ%jjJ%%%%J%%j%%%j%%%%JJ%%j
3831B%%%%%%%J%jJ%Jj%jjJ%%J%jJ%%%j%%%%jJ%%%%j%jJJ%%%%%%j%J%%%%%%j%%%Jj%%%%J%%
3820B%%JJ%%jjJ%jjJ%jjJJ%%%%jj%%%%JJ%%J%%%j%%j%jJ%%%J%j%JJ%%%%j%%Jj%j%JJ%%%%%
3809Cj%%%%%Jj%%j%J%%%jJ%%K%%%j%jJJjj%%J%j%%j%JJj%j%J%%%jjJJ%%%j%%%%J%%%%kJ%%
3798AJ%%Jjj%jJJ%Jj%%%%jJ%%%%%%J%%j%j%JJj%%jK%j%jjJJ%%J%jj%J%%%%%j%jJJ%%%%%J%
$$ plain form
3874 1 1 1 2 2 2 2 3 2 3 4 3 2 2 2 2 2 2 2 3 2 1 1 1 0 0 1 1 3 3 3 3 3 3 3 3 2 1 1 2 2 2 3 3 3 3 2 2 2 2 1 1 1 2 1 1 2 2 2 1 1 2 1 1 0 1 2 1 2 2 2 2
3863 2 2 2 2 2 2 2 2 1 1 2 3 2 2 2 1 1 2 2 2 2 2 2 2 2 2 2 3 2 2 2 1 1 1 1 2 3 3 2 2 3 4 3 1 2 2 2 2 2 2 2 2 2 3 3 2 2 3 2 2 1 1 2 3 3 2 1 1 1 1 1 1
3852 1 2 4 4 3 2 2 1 1 2 3 3 2 3 2 2 3 3 3 2 1 2 2 2 1 1 1 1 1 2 3 1 1 2 2 3 2 3 2 2 2 3 4 5 4 3 3 4 3 2 2 3 3 4 3 2 2 2 3 3 3 2 2 2 1 2 2 1 1 2 3 2
3841 2 3 3 3 2 3 3 3 2 2 1 1 1 1 1 1 2 2 2 2 2 2 1 2 2 3 3 2 1 1 1 1 2 2 3 3 1 0 2 2 3 2 2 3 3 2 3 3 2 1 2 2 2 2 2 3 3 3 2 2 2 2 1 1 1 1 1 2 3 3 3 2
3831 2 2 2 2 2 2 2 2 3 3 2 3 3 4 3 3 2 1 2 2 2 3 3 2 3 3 3 3 2 2 2 2 2 1 2 2 2 2 2 1 1 0 1 2 2 2 2 2 2 2 1 1 2 2 2 2 2 2 2 1 1 1 1 2 1 1 1 1 1 2 2 2
3820 2 2 2 3 4 4 4 3 2 3 3 2 1 2 2 1 0 1 2 2 2 2 2 1 0 0 0 0 0 1 2 2 2 3 3 3 3 2 2 2 1 1 0 1 1 1 1 2 2 1 1 2 3 3 3 3 3 2 2 2 3 2 2 1 1 2 3 3 3 3 3 3
3809 3 2 2 2 2 2 2 3 2 2 2 1 1 2 2 2 2 1 2 2 2 4 4 4 4 3 3 2 3 4 3 2 2 2 3 3 2 2 2 1 1 2 3 2 2 1 1 2 2 2 2 1 0 1 2 2 2 2 1 1 1 1 1 2 2 2 2 2 0 1 1 1
3798 1 2 2 2 3 2 1 1 0 1 2 2 3 2 2 2 2 2 1 2 2 2 2 2 2 2 3 3 3 2 2 1 1 2 3 2 2 2 1 3 3 2 2 1 0 1 2 2 2 3 3 2 1 1 2 2 2 2 2 2 1 1 0 1 2 2 2 2 2 2 3 3
3787Cj%%j%%%%%J%J%j%j%%%%J%%%%%j%%J%%%%%%%j%%%Jj%%%%J%j%JJj%%%j%Jj%KJ%jj%%%j
3776AJ%%j%%J%J%%%%%%Jj%%%%%%%j%%%j%J%%%J%%%j%j%%%%j%%J%%J%j%%%%J%%Jj%%J%%%j%
3766B%j%%KJjjjJ%%%jjJ%J%JJj%%%j%j%%%%%%%%J%Jj%%%%Jj%%JJj%jj%%%j%J%%JJjjJJjJj
3755BjJKj%j%%JjjJ%%%Jj%J%jJJ%jj%%%%%%%%%jJ%%j%%%%%Jj%%%%%%Jj%JjJ%%jJ%%%%%j%J
3744BK%%jj%%J%%jj%%%JJ%%j%%Jj%%j%J%%%J%j%%%jJJj%%j%%J%%%%%%%%%%%%J%%%J%%j%j%
3733Bj%JJ%%%%Jj%%%%%%%Jj%j%%J%%%J%%%%jj%%%JJj%j%%J%%%%jj%JJ%%%j%%%J%%j%%j%jJ
3722A%%%%%JJj%J%jj%j%JJ%%%%%%%j%JJ%j%%%J%j%jJJj%j%jJJj%%J%%%%%Jj%%%%%%%%%jJJ
3711C%%jj%%J%%%%%%%%J%%j%jJ%%%J%%%%%%%J%%%j%%%%%J%%jj%jJJj%%%%%j%J%%JJJjjj%%
$$ plain form
3787 3 2 2 2 1 1 1 1 1 1 2 2 3 3 2 2 1 1 1 1 1 2 2 2 2 2 2 1 1 1 2 2 2 2 2 2 2 2 1 1 1 1 2 1 1 1 1 1 2 2 1 1 2 3 2 2 2 2 1 1 2 1 1 3 4 4 3 2 2 2 2 1
3776 1 2 2 2 1 1 1 2 2 3 3 3 3 3 3 3 4 3 3 3 3 3 3 3 3 2 2 2 2 1 1 2 2 2 2 3 3 3 3 2 2 1 1 1 1 1 0 0 0 1 1 1 2 2 1 1 1 1 1 2 2 2 3 2 2 2 3 3 3 3 2 2
3766 2 2 1 1 1 3 4 3 2 1 2 2 2 2 1 0 1 1 2 2 3 4 3 3 3 3 2 2 1 1 1 1 1 1 1 1 1 2 2 3 2 2 2 2 2 3 2 2 2 3 4 3 3 2 1 1 1 1 0 0 1 1 1 2 3 2 1 2 3 2 3 2
3755 2 1 2 4 3 3 2 2 2 3 2 1 2 2 2 2 3 2 2 3 3 2 3 4 4 3 2 2 2 2 2 2 2 2 2 2 1 2 2 2 1 1 1 1 1 1 2 1 1 1 1 1 1 1 2 1 1 2 1 2 2 2 1 2 2 2 2 2 2 1 1 2
3744 2 4 4 4 3 2 2 2 3 3 3 2 1 1 1 1 2 3 3 3 2 2 2 3 2 2 2 1 1 2 2 2 2 3 3 2 2 2 2 1 2 3 2 2 2 1 1 1 2 2 2 2 2 2 2 2 2 2 2 2 2 3 3 3 3 4 4 4 3 3 2 2
3733 2 1 1 2 3 3 3 3 3 4 3 3 3 3 3 3 3 3 4 3 3 2 2 2 3 3 3 3 4 4 4 4 4 3 2 2 2 2 3 4 3 3 2 2 2 3 3 3 3 3 2 1 1 2 3 3 3 3 2 2 2 2 3 3 3 2 2 2 1 1 0 1
3722 1 1 1 1 1 1 2 3 2 2 3 3 2 1 1 0 0 1 2 2 2 2 2 2 2 2 1 1 2 3 3 2 2 2 2 3 3 2 2 1 2 3 2 2 1 1 0 1 2 1 1 1 2 2 2 2 2 2 3 2 2 2 2 2 2 2 2 2 2 1 2 3
3711 3 3 3 2 1 1 1 2 2 2 2 2 2 2 2 2 3 3 3 2 2 1 2 2 2 2 3 3 3 3 3 3 3 3 4 4 4 4 3 3 3 3 3 3 4 4 4 3 2 2 1 2 3 2 2 2 2 2 2 1 1 2 2 2 3 4 5 4 3 2 2 2
3701B%%%%%%Jj%J%%%j%%%j%%Jj%JJj%j%%J%%j%jJK%jJ%%%%j%j%%%%%JJj%j%%%K%jj%%jJJ%
3690BjJ%j%JJ%%%%j%%J%%j%%%%%Jj%%%j%%%J%j%%Jj%%%%%J%%%%%%J%%%%jj%%%%J%Jj%%%%%
3679B%%Jj%%%%J%%%jjj%J%J%%%%K%jj%jJ%%%%jJ%J%%%%%%j%jJJ%%%%%J%jjj%J%%J%%%%j%%
3668BJ%%%%%jjJ%J%jj%%K%%j%%%%%%%%%%%%%%%J%j%%%%%%J%%%%jJJj%%%%%%Jjj%K%j%%%jJ
3657C%j%%%%%%%%jJJj%%JJj%j%%j%jJJ%%%%%%%%J%%jj%%JJ%%jjJ%J%jj%%JJ%%%%jJ%%jjJ%
3646B%%%%%%%%%J%%j%JjjjJ%%J%J%j%%jJj%%%J%J%%%%%%j%J%%%%%%J%%j%j%%%%%J%%j%%JJ
3636Dj%%jjJJJj%j%jJ%%jJ%%J%j%Jj%%%%%%%J%JL%JJJ%kjjjj%j%%%jJ%%%%%kJ%J%%%%%jJ%
3625CJ%%%%%%j%Jjj%%%JjJj%j%JJ%j%%%%J%%%%jJ%%%jJ%J%jJ%j%%j%%j%%%J%%%JjjJ%j%%%
$$ plain form
3701 2 2 2 2 2 2 2 3 2 2 3 3 3 3 2 2 2 2 1 1 1 2 1 1 2 3 2 2 1 1 1 2 2 2 1 1 0 1 3 3 2 3 3 3 3 3 2 2 1 1 1 1 1 1 2 3 2 2 1 1 1 1 3 3 2 1 1 1 0 1 2 2
3690 2 1 2 2 1 1 2 3 3 3 3 3 2 2 2 3 3 3 2 2 2 2 2 2 3 2 2 2 2 1 1 1 1 2 2 1 1 1 2 1 1 1 1 1 1 2 2 2 2 2 2 2 3 3 3 3 3 2 1 1 1 1 1 2 2 3 2 2 2 2 2 2
3679 2 2 2 3 2 2 2 2 2 3 3 3 3 2 1 0 0 1 1 2 2 2 2 2 4 4 3 2 2 1 2 2 2 2 2 1 2 2 3 3 3 3 3 3 3 2 2 1 2 3 3 3 3 3 3 4 4 3 2 1 1 2 2 2 3 3 3 3 3 2 2 2
3668 2 3 3 3 3 3 3 2 1 2 2 3 3 2 1 1 1 3 3 3 2 2 2 2 2 2 2 2 2 2 2 2 2 2 2 2 3 3 2 2 2 2 2 2 2 3 3 3 3 3 2 3 4 3 3 3 3 3 3 3 4 3 2 2 4 4 3 3 3 3 2 3
3657 3 3 2 2 2 2 2 2 2 2 2 1 2 3 2 2 2 3 4 3 3 2 2 2 1 1 0 1 2 2 2 2 2 2 2 2 2 3 3 3 2 1 1 1 2 3 3 3 2 1 2 2 3 3 2 1 1 1 2 3 3 3 3 3 2 3 3 3 2 1 2 2
3646 2 2 2 2 2 2 2 2 2 2 3 3 3 2 2 3 2 1 0 1 1 1 2 2 3 3 2 2 2 1 2 1 1 1 1 2 2 3 3 3 3 3 3 3 2 2 3 3 3 3 3 3 3 4 4 4 3 3 2 2 2 2 2 2 3 3 3 2 2 2 3 4
3636 4 3 3 3 2 1 2 3 4 3 3 2 2 1 2 2 2 1 2 2 2 3 3 2 2 3 2 2 2 2 2 2 2 2 3 3 4 7 7 8 9 10 10 8 7 6 5 4 4 3 3 3 3 2 3 3 3 3 3 3 1 2 2 3 3 3 3 3 3 2 3 3
3625 3 4 4 4 4 4 4 4 3 3 4 3 2 2 2 2 3 2 3 2 2 1 1 2 3 3 2 2 2 2 2 3 3 3 3 3 2 3 3 3 3 2 3 3 4 4 3 4 4 3 3 3 2 2 2 1 1 1 1 2 2 2 2 3 2 1 2 2 1 1 1 1
3614AJ%%%%%%%JjjJ%%%%%%%%%j%%%J%J%j%%j%%J%%%%%Jj%%%%%%%Jj%%%%%J%J%jj%%%%%%j%
3603AJ%j%%%%JJjjJJJjj%%J%j%%J%j%J%Jjj%%%J%%jJ%%%%Jjj%%%%%%%%%%J%jj%JJ%%%j%%%
3592B%%%%Jj%%J%%%%J%jj%%%%%%%Jj%%J%%j%%%j%%j%JJJ%j%jJJ%%%J%%j%jj%J%%%%%%%j%J
3581BJ%jj%%%%J%j%%%JJ%%%%%%jj%%%%%%%J%%j%%J%%%%%%%%J%%Jjj%%%Jj%%jJ%%J%%%%%j%
3571B%%jJ%Jjk%%JJJ%J%J%k%j%%%jJ%JJj%%%j%%jJ%%jKJj%%%%J%jJj%jJ%%j%%%%jJJ%%JJj
3560Dj%j%JJ%kj%JJjj%%%jJ%JJjJ%%%%%J%jj%%%%%%J%%%%%j%JjjJ%%j%%%%%JJ%j%%%%jJJ%
3549C%jj%%%%jJJ%jJJjj%%%J%J%%j%%J%%Jj%j%%%%jJ%%%%jj%J%%J%J%%j%%%j%%J%Jj%J%%j
3538B%%%%%%J%J%%jJjj%%%jJ%J%j%j%J%%J%J%j%%%%%%jJ%%%%J%j%%%j%%%%%%%%%%J%%%%j%
$$ plain form
3614 1 2 2 2 2 2 2 2 2 3 2 1 2 2 2 2 2 2 2 2 2 2 1 1 1 1 2 2 3 3 2 2 2 1 1 1 2 2 2 2 2 2 3 2 2 2 2 2 2 2 2 3 2 2 2 2 2 2 3 3 4 4 3 2 2 2 2 2 2 2 1 1
3603 1 2 2 1 1 1 1 1 2 3 2 1 2 3 4 3 2 2 2 3 3 2 2 2 3 3 2 2 3 3 4 3 2 2 2 2 3 3 3 2 3 3 3 3 3 4 3 2 2 2 2 2 2 2 2 2 2 2 3 3 2 1 1 2 3 3 3 3 2 2 2 2
3592 2 2 2 2 2 3 2 2 2 3 3 3 3 3 4 4 3 2 2 2 2 2 2 2 2 3 2 2 2 3 3 3 2 2 2 2 1 1 1 0 0 1 2 3 3 2 2 1 2 3 3 3 3 4 4 4 3 3 2 1 1 2 2 2 2 2 2 2 2 1 1 2
3581 2 3 3 2 1 1 1 1 1 2 2 1 1 1 1 2 3 3 3 3 3 3 3 2 1 1 1 1 1 1 1 1 2 2 2 1 1 1 2 2 2 2 2 2 2 2 2 3 3 3 4 3 2 2 2 2 3 2 2 2 1 2 2 2 3 3 3 3 3 3 2 2
3571 2 2 2 1 2 2 3 2 0 0 0 1 2 3 3 4 4 5 5 3 3 2 2 2 2 1 2 2 3 4 3 3 3 3 2 2 2 1 2 2 2 1 3 4 3 3 3 3 3 4 4 3 4 3 3 2 3 3 3 2 2 2 2 2 1 2 3 3 3 4 5 4
3560 4 3 3 2 2 3 4 4 2 1 1 2 3 2 1 1 1 1 0 1 1 2 3 2 3 3 3 3 3 3 4 4 3 2 2 2 2 2 2 2 3 3 3 3 3 3 2 2 3 2 1 2 2 2 1 1 1 1 1 1 2 3 3 2 2 2 2 2 1 2 3 3
3549 3 3 2 1 1 1 1 1 0 1 2 2 1 2 3 2 1 1 1 1 2 2 3 3 3 2 2 2 3 3 3 4 3 3 2 2 2 2 2 1 2 2 2 2 2 1 0 0 1 1 1 2 2 3 3 3 2 2 2 2 1 1 1 2 2 3 2 2 3 3 3 2
3538 2 2 2 2 2 2 2 3 3 4 4 4 3 4 3 2 2 2 2 1 2 2 3 3 2 2 1 1 2 2 2 3 3 4 4 3 3 3 3 3 3 3 2 3 3 3 3 3 4 4 3 3 3 3 2 2 2 2 2 2 2 2 2 2 2 3 3 3 3 3 2 2
3527BJj%%%%%J%%%j%%J%%%%j%%%JjJ%Jjj%JJ%j%j%%%%%%%%%J%%j%jjJ%J%%%J%%%%%%%%j%%
3516BjjJJ%%%Jj%%%J%%%%%%%%%kjJJJJ%%j%%j%%%J%%%%j%%Jj%JJjj%%%%%j%%JJ%%jj%Jj%J
3506B%%%Jk%K%J%%j%%%%%j%jjJ%JK%%%%%%%j%j%%%%%jJ%%JJj%j%j%%jJJj%%J%%%jJ%%%%J%
3495C%jJ%jj%%%%%%JJj%%JjjJ%jjJ%%%J%%%%%%%%jJJ%%%%%%%Jj%j%jJ%%Jj%%%%%%%%%j%J%
3484BJ%%%jJ%j%%jJ%Kj%j%%j%J%jJJ%%%%%j%%%J%%Jjj%jJJ%j%%%%%%J%jjJ%j%%%%%%JJ%jJ
3473C%%%%%%%%%J%jJ%%%j%%j%J%j%%%%%%jJJJj%j%%JJ%j%%jJ%%%%j%%JJ%%%%j%%%j%%%J%%
3462C%%%%j%jJJj%J%J%%%jj%%%JjJ%%%j%%%J%%%%JjjJ%%%%%%%%%j%%j%J%jjJ%JJjj%J%Jj%
3451B%j%%%%%%J%%j%%%%JJ%%%Jjj%%J%j%J%%%%Jj%%j%%%%%%J%j%j%%J%%J%jjJJj%%%%%%jJ
$$ plain form
3527 2 3 2 2 2 2 2 2 3 3 3 3 2 2 2 3 3 3 3 3 2 2 2 2 3 2 3 3 4 3 2 2 3 4 4 3 3 2 2 2 2 2 2 2 2 2 2 3 3 3 2 2 1 0 1 1 2 2 2 2 3 3 3 3 3 3 3 3 3 2 2 2
3516 2 1 0 1 2 2 2 2 3 2 2 2 2 3 3 3 3 3 3 3 3 3 3 1 0 1 2 3 4 4 4 3 3 3 2 2 2 2 3 3 3 3 3 2 2 2 3 2 2 3 4 3 2 2 2 2 2 2 1 1 1 2 3 3 3 2 1 1 2 1 1 2
3506 2 2 2 2 3 1 1 3 3 4 4 4 3 3 3 3 3 3 2 2 1 0 1 1 2 4 4 4 4 4 4 4 4 3 3 2 2 2 2 2 2 1 2 2 2 3 4 3 3 2 2 1 1 1 0 1 2 1 1 1 2 2 2 2 1 2 2 2 2 2 3 3
3495 3 3 2 3 3 2 1 1 1 1 1 1 1 2 3 2 2 2 3 2 1 2 2 1 0 1 1 1 1 2 2 2 2 2 2 2 2 2 1 2 3 3 3 3 3 3 3 3 4 3 3 2 2 1 2 2 2 3 2 2 2 2 2 2 2 2 2 2 1 1 2 2
3484 2 3 3 3 3 2 3 3 2 2 2 1 2 2 4 3 3 2 2 2 1 1 2 2 1 2 3 3 3 3 3 3 2 2 2 2 3 3 3 4 3 2 2 1 2 3 3 2 2 2 2 2 2 2 3 3 2 1 2 2 1 1 1 1 1 1 1 2 3 3 2 3
3473 3 3 3 3 3 3 3 3 3 3 4 4 3 4 4 4 4 3 3 3 2 2 3 3 2 2 2 2 2 2 2 1 2 3 4 3 3 2 2 2 3 4 4 3 3 3 2 3 3 3 3 3 2 2 2 3 4 4 4 4 4 3 3 3 3 2 2 2 2 3 3 3
3462 3 3 3 3 3 2 2 1 2 3 2 2 3 3 4 4 4 4 3 2 2 2 2 3 2 3 3 3 3 2 2 2 2 3 3 3 3 3 4 3 2 3 3 3 3 3 3 3 3 3 3 2 2 2 1 1 2 2 1 0 1 1 2 3 2 1 1 2 2 3 2 2
3451 2 2 1 1 1 1 1 1 1 2 2 2 1 1 1 1 1 2 3 3 3 3 4 3 2 2 2 3 3 2 2 3 3 3 3 3 4 3 3 3 2 2 2 2 2 2 2 3 3 2 2 1 1 1 2 2 2 3 3 2 1 2 3 2 2 2 2 2 2 2 1 2
3441B%%J%%%%%%%%%j%jJ%%%%%%j%%JJj%%%%J%%%%%Jj%%%%j%J%%j%%j%%JJJk%j%JJjj%%%%%
3430A%J%j%%J%%Jj%J%j%j%%%JJ%%%jJj%%%%J%%Jj%%%%%J%%jj%J%j%Jj%J%%j%%j%JJ%%%%%j
3419B%%%%%%J%%j%%jJ%%jJ%%%JJ%jjJj%%%%%%%J%%%j%%jJ%%jJ%%jJ%%JJkj%J%j%JJ%J%jjJ
3408C%j%%J%j%%%%%Jj%%%%j%%JjJJ%%%%J%j%j%j%%J%%J%%jj%%%JJ%%j%J%JjkJJ%j%%j%%JJ
3397C%j%%JJk%%%j%%%JJjj%%%%%JJ%%jj%jJ%JJ%jjJJ%j%J%%%%%%Jj%kjJ%%J%jJ%%%%%%%J%
3386C%%%JjjJ%%Jjj%j%%j%JJ%%%J%jJ%%j%%%%J%%%j%%j%JKjJ%j%%jJ%%j%%Jjj%J%J%j%%%%
3376B%J%%j%%j%J%%%%%%%%%%%%%%J%j%%%%%%%%%J%%jj%%%J%%%%%JJjJ%%j%%jj%%%%J%J%%J
3365D%%%jj%%%J%jJ%J%%%jJJjj%Jj%%%%%%jj%J%jJ%%j%%%J%%J%%%%jj%%JJj%%%J%%jJ%%j%
$$ plain form
3441 2 2 2 3 3 3 3 3 3 3 3 3 3 2 2 1 2 2 2 2 2 2 2 1 1 1 2 3 2 2 2 2 2 3 3 3 3 3 3 4 3 3 3 3 3 2 2 3 3 3 2 2 2 1 1 1 2 3 4 2 2 1 1 2 3 2 1 1 1 1 1 1
3430 1 1 2 2 1 1 1 2 2 2 3 2 2 3 3 2 2 1 1 1 1 2 3 3 3 3 2 3 2 2 2 2 2 3 3 3 4 3 3 3 3 3 3 4 4 4 3 2 2 3 3 2 2 3 2 2 3 3 3 2 2 2 1 1 2 3 3 3 3 3 3 2
3419 2 2 2 2 2 2 2 3 3 3 2 2 2 1 2 2 2 1 2 2 2 2 3 4 4 3 2 3 2 2 2 2 2 2 2 2 3 3 3 3 2 2 2 1 2 2 2 1 2 2 2 1 2 2 2 3 4 2 1 1 2 2 1 1 2 3 3 4 4 3 2 3
3408 3 3 2 2 2 3 3 2 2 2 2 2 2 3 2 2 2 2 2 1 1 1 2 1 2 3 3 3 3 3 4 4 3 3 2 2 1 1 1 2 2 2 3 3 3 2 1 1 1 1 2 3 3 3 2 2 3 3 4 3 1 2 3 3 2 2 2 1 1 1 2 3
3397 3 3 2 2 2 3 4 2 2 2 2 1 1 1 1 2 3 2 1 1 1 1 1 1 2 3 3 3 2 1 1 0 1 1 2 3 3 2 1 2 3 3 2 2 3 3 3 3 3 3 3 4 3 3 1 0 1 1 1 2 2 1 2 2 2 2 2 2 2 2 3 3
3386 3 3 3 3 4 3 2 3 3 3 4 3 2 2 1 1 1 0 0 1 2 2 2 2 3 3 2 3 3 3 2 2 2 2 2 3 3 3 3 2 2 2 1 1 2 4 3 4 4 3 3 3 2 3 3 3 2 2 2 3 2 1 1 2 2 3 3 2 2 2 2 2
3376 2 2 3 3 3 2 2 2 1 1 2 2 2 2 2 2 2 2 2 2 2 2 2 2 2 3 3 2 2 2 2 2 2 2 2 2 2 3 3 3 2 1 1 1 1 2 2 2 2 2 2 3 4 3 4 4 4 3 3 3 2 1 1 1 1 1 2 2 3 3 3 4
3365 4 4 4 4 3 2 2 2 2 3 3 2 3 3 4 4 4 4 3 4 5 4 3 3 4 3 3 3 3 3 3 3 2 1 1 2 2 1 2 2 2 1 1 1 1 2 2 2 3 3 3 3 3 2 1 1 1 2 3 2 2 2 2 3 3 3 2 3 3 3 2 2
3354B%%%%%%%JJjj%%%JjjJjj%%JJ%%%J%%%%jJJj%%%%%%j%J%%%%jj%%%%J%j%%JJ%%j%%K%%k
3343BjjJJ%kJ%%%JJ%j%%%%%jJ%%%Jj%j%J%%J%%%%j%Kj%%%jJ%Jj%jj%%JJ%%J%%%j%jj%JJ%%
3332C%%Jj%%%j%%j%%%%%%J%J%%j%%%%%j%J%%%%JJ%%j%k%K%j%%J%%%%%%%%%%%%%J%%j%%j%%
3321B%Jj%J%jjJ%%%%%%jJ%J%%%%Jjj%%JjjJJjjJ%%%%%J%jJJj%%%%%j%J%%j%%J%%J%j%%J%j
3311C%j%%J%%j%%Jj%%%%Jj%j%%%J%Jj%%Jj%J%J%jjJjj%%J%J%%%%%%%j%%jJ%%j%JJ%Jj%%j%
3300B%Jj%J%%j%J%%%%%j%%%J%%%jjJJ%Jj%%jjJ%%%%%J%%%j%j%%%JJj%%%%J%%JjjJ%%%%j%J
3289C%jj%%J%%Jj%J%%j%%J%%%%j%%j%JJ%J%%%j%%%J%%%%j%jj%%JJ%%%%jjJ%%J%%j%%J%%%%
3278C%Jjj%%%%%J%%J%%j%j%%%%jJJ%%%%%%%%%%%%jJ%%%%j%%%%%%j%KJ%j%j%Jj%%%%j%%%%K
$$ plain form
3354 2 2 2 2 2 2 2 2 3 4 3 2 2 2 2 3 2 1 2 1 0 0 0 1 2 2 2 2 3 3 3 3 3 2 3 4 3 3 3 3 3 3 3 2 2 3 3 3 3 3 2 1 1 1 1 1 2 2 1 1 1 2 3 3 3 2 2 2 4 4 4 2
3343 2 1 0 1 2 2 0 1 1 1 1 2 3 3 2 2 2 2 2 2 1 2 2 2 2 3 2 2 1 1 2 2 2 3 3 3 3 3 2 2 4 3 3 3 3 2 3 3 4 3 3 2 1 1 1 2 3 3 3 4 4 4 4 3 3 2 1 1 2 3 3 3
3332 3 3 3 4 3 3 3 3 2 2 2 1 1 1 1 1 1 1 2 2 3 3 3 2 2 2 2 2 2 1 1 2 2 2 2 2 3 4 4 4 3 3 1 1 3 3 2 2 2 3 3 3 3 3 3 3 3 3 3 3 3 3 3 4 4 4 3 3 3 2 2 2
3321 2 2 3 2 2 3 3 2 1 2 2 2 2 2 2 2 1 2 2 3 3 3 3 3 4 3 2 2 2 3 2 1 2 3 2 1 2 2 2 2 2 2 3 3 2 3 4 3 3 3 3 3 3 2 2 3 3 3 2 2 2 3 3 3 4 4 3 3 3 4 4 3
3311 3 3 2 2 2 3 3 3 2 2 2 3 2 2 2 2 2 3 2 2 1 1 1 1 2 2 3 2 2 2 3 2 2 3 3 4 4 3 2 3 2 1 1 1 2 2 3 3 3 3 3 3 3 3 2 2 2 1 2 2 2 1 1 2 3 3 4 3 3 3 2 2
3300 2 2 3 2 2 3 3 3 2 2 3 3 3 3 3 3 2 2 2 2 3 3 3 3 2 1 2 3 3 4 3 3 3 2 1 2 2 2 2 2 2 3 3 3 3 2 2 1 1 1 1 2 3 2 2 2 2 2 3 3 3 4 3 2 3 3 3 3 3 2 2 3
3289 3 3 2 1 1 1 2 2 2 3 2 2 3 3 3 2 2 2 3 3 3 3 3 2 2 2 1 1 2 3 3 4 4 4 4 3 3 3 3 4 4 4 4 4 3 3 2 1 1 1 2 3 3 3 3 3 2 1 2 2 2 3 3 3 2 2 2 3 3 3 3 3
3278 3 3 4 3 2 2 2 2 2 2 3 3 3 4 4 4 3 3 2 2 2 2 2 1 2 3 3 3 3 3 3 3 3 3 3 3 3 3 2 3 3 3 3 3 2 2 2 2 2 2 2 1 1 3 4 4 3 3 2 2 3 2 2 2 2 2 1 1 1 1 1 3
3267C%%jJ%%%jJJ%%%jjJ%j%%%%%%%J%%%%j%%J%jJ%j%%%J%J%j%%%jJ%Jj%%%%%Jj%%%J%jj%%
3256B%%%%%J%%%%%J%%%%%jJ%j%%J%%%j%jj%%JJJj%%jJ%%Jj%%%%jJ%%j%%%JJ%%%%j%JJjj%j
3246B%%%%%%J%%%J%jJ%j%%J%j%%%%j%%J%%%%%j%Jjj%%J%J%%%jjJJ%%%%%%%%%%j%J%%%%%j%
3235B%J%%jJ%%jj%%%JJ%jjJ%J%%%%%jJ%j%%%%%j%%J%J%%%j%%J%%jJj%%%j%K%%%j%%jJ%J%%
3224C%j%%jJ%%%%Jj%%%J%%j%%%%J%%%%%%%j%%%%%%%%J%%Jjj%%%%Jj%jJJ%%j%%J%j%%J%%%%
3213Cj%%%%%%J%J%%j%%j%J%J%%%jjj%J%%%J%j%%%J%j%j%JJj%%%%%jkJJJJ%%j%%%%%%Jj%%%
3202B%%%J%jj%%JJjJ%%%%j%%Jj%%%%%%J%%jjJJ%%Jjk%%J%%%%%%%J%%%%%%%%%%jJ%JJjjjj%
3191AJ%%J%%j%Jjj%%%%J%JJ%%%%Jjj%J%%j%%J%jjJj%Jj%%JjJ%jJ%Jjj%%%%J%%%%%J%%%j%J
$$ plain form
3267 3 3 3 2 3 3 3 3 2 3 4 4 4 4 3 2 3 3 2 2 2 2 2 2 2 2 3 3 3 3 3 2 2 2 3 3 2 3 3 2 2 2 2 3 3 4 4 3 3 3 3 2 3 3 4 3 3 3 3 3 3 4 3 3 3 3 4 4 3 2 2 2
3256 2 2 2 2 2 2 3 3 3 3 3 3 4 4 4 4 4 4 3 4 4 3 3 3 4 4 4 4 3 3 2 1 1 1 2 3 4 3 3 3 2 3 3 3 4 3 3 3 3 3 2 3 3 3 2 2 2 2 3 4 4 4 4 4 3 3 4 5 4 3 3 2
3246 2 2 2 2 2 2 2 3 3 3 3 4 4 3 4 4 3 3 3 4 4 3 3 3 3 3 2 2 2 3 3 3 3 3 3 2 2 3 2 1 1 1 2 2 3 3 3 3 2 1 2 3 3 3 3 3 3 3 3 3 3 3 2 2 3 3 3 3 3 3 2 2
3235 2 2 3 3 3 2 3 3 3 2 1 1 1 1 2 3 3 2 1 2 2 3 3 3 3 3 3 2 3 3 2 2 2 2 2 2 1 1 1 2 2 3 3 3 3 2 2 2 3 3 3 2 3 2 2 2 2 1 1 3 3 3 3 2 2 2 1 2 2 3 3 3
3224 3 3 2 2 2 1 2 2 2 2 2 3 2 2 2 2 3 3 3 2 2 2 2 2 3 3 3 3 3 3 3 3 2 2 2 2 2 2 2 2 2 3 3 3 4 3 2 2 2 2 2 3 2 2 1 2 3 3 3 2 2 2 3 3 2 2 2 3 3 3 3 3
3213 3 2 2 2 2 2 2 2 3 3 4 4 4 3 3 3 2 2 3 3 4 4 4 4 3 2 1 1 2 2 2 2 3 3 2 2 2 2 3 3 2 2 1 1 2 3 2 2 2 2 2 2 1 -1 0 1 2 3 3 3 2 2 2 2 2 2 2 3 2 2 2 2
3202 2 2 2 2 3 3 2 1 1 1 2 3 2 3 3 3 3 3 2 2 2 3 2 2 2 2 2 2 2 3 3 3 2 1 2 3 3 3 4 3 1 1 1 2 2 2 2 2 2 2 2 3 3 3 3 3 3 3 3 3 3 3 2 3 3 4 5 4 3 2 1 1
3191 1 2 2 2 3 3 3 2 2 3 2 1 1 1 1 1 2 2 3 4 4 4 4 4 5 4 3 3 4 4 4 3 3 3 4 4 3 2 3 2 2 3 2 2 2 3 2 3 3 2 3 3 4 3 2 2 2 2 2 3 3 3 3 3 3 4 4 4 4 3 3 4
3181D%jjJJ%j%%j%J%J%j%%%J%%j%%JJjj%J%JjkJ%%%J%jj%JJjj%%%%%%%%%jJJ%%j%%%%%jJ%
3170B%%jjJJJ%jJ%j%%J%%%%jJj%%j%%%JJ%j%%Kj%%%%%%%%jj%%J%J%J%%%jj%%%J%jJJ%%%jj
3159BJ%%%J%%%%j%%%%%%jJj%j%JJ%%jJ%%j%%JJ%J%j%j%%%%%Jj%%jjJ%%%%%J%J%jJ%j%j%JJ
3148D%j%Jj%J%%%J%j%j%%%j%%J%%%%%j%%J%%J%%%%%%j%%%%%%%%jJJjjJ%%J%%%%j%%jJ%%%j
3137B%J%J%j%%J%%%%j%%%%%%J%j%%J%%%%%%%%%j%%j%%%%%%%%J%%j%JJjj%%J%%%j%J%%%j%%
3126BjjJJJJj%%%Jjj%%JJj%%Jj%jJ%%%j%JJ%%jj%jJ%J%%%%j%%%%%%%%%%JJjjJ%%%%%%%J%j
3116C%%%%J%jj%%%%J%%%%%%%%%jJ%%%%%%%jJ%j%%J%%%%Jj%%Jj%JJ%Jj%%%j%%Jj%%Jj%%%JJ
3105Fj%j%%%%%%jJ%%%j%%%%%%%%%%%%j%%%Jj%JJJjj%%%%Jj%%%%j%J%J%%%j%jJJ%Jjjj%J%J
$$ plain form
3181 4 4 3 2 3 4 4 3 3 3 2 2 3 3 4 4 3 3 3 3 4 4 4 3 3 3 4 5 4 3 3 4 4 5 4 2 3 3 3 3 4 4 3 2 2 3 4 3 2 2 2 2 2 2 2 2 2 2 1 2 3 3 3 2 2 2 2 2 2 1 2 2
3170 2 2 2 1 0 1 2 3 3 2 3 3 2 2 2 3 3 3 3 3 2 3 2 2 2 1 1 1 1 2 3 3 2 2 2 4 3 3 3 3 3 3 3 3 3 2 1 1 1 2 2 3 3 4 4 4 4 3 2 2 2 2 3 3 2 3 4 4 4 4 3 2
3159 2 3 3 3 3 4 4 4 4 4 3 3 3 3 3 3 3 2 3 2 2 1 1 2 3 3 3 2 3 3 3 2 2 2 3 4 4 5 5 4 4 3 3 3 3 3 3 4 3 3 3 2 1 2 2 2 2 2 2 3 3 4 4 3 4 4 3 3 2 2 3 4
3148 4 4 3 3 4 3 3 4 4 4 4 5 5 4 4 3 3 3 3 2 2 2 3 3 3 3 3 3 2 2 2 3 3 3 4 4 4 4 4 4 4 3 3 3 3 3 3 3 3 3 2 3 4 3 2 3 3 3 4 4 4 4 4 3 3 3 2 3 3 3 3 2
3137 2 2 3 3 4 4 3 3 3 4 4 4 4 4 3 3 3 3 3 3 3 4 4 3 3 3 4 4 4 4 4 4 4 4 4 4 3 3 3 2 2 2 2 2 2 2 2 2 3 3 3 2 2 3 4 3 2 2 2 3 3 3 3 2 2 3 3 3 3 2 2 2
3126 2 1 0 1 2 3 4 3 3 3 3 4 3 2 2 2 3 4 3 3 3 4 3 3 2 3 3 3 3 2 2 3 4 4 4 3 2 2 1 2 2 3 3 3 3 3 2 2 2 2 2 2 2 2 2 2 2 3 4 3 2 3 3 3 3 3 3 3 3 4 4 3
3116 3 3 3 3 3 4 4 3 2 2 2 2 2 3 3 3 3 3 3 3 3 3 3 2 3 3 3 3 3 3 3 3 2 3 3 2 2 2 3 3 3 3 3 4 3 3 3 4 3 3 4 5 5 6 5 5 5 5 4 4 4 5 4 4 4 5 4 4 4 4 5 6
3105 6 5 5 4 4 4 4 4 4 4 3 4 4 4 4 3 3 3 3 3 3 3 3 3 3 3 3 3 2 2 2 2 3 2 2 3 4 5 4 3 3 3 3 3 4 3 3 3 3 3 2 2 3 3 4 4 4 4 3 3 2 3 4 4 5 4 3 2 2 3 3 4
3094DJj%jj%Jj%Jj%J%J%Jj%%j%%%jJJjj%%%%%j%%J%%J%j%jJ%%J%j%%j%J%%%%%%%%JJ%j%%%
3083C%%j%J%%%%%J%%%%j%jJj%%%J%J%j%%%%%%%%%%%Jj%%j%%J%J%%%j%%J%%j%%jJ%%%%%Jjj
3072BJ%%j%%%J%%%%%%jJJ%%%jj%K%%j%jJ%%J%%j%%J%%%j%%%%%%%jjJ%%%%J%%%%K%Jjj%%jj
3061B%j%J%%%%Kj%%%%%%JjjJ%%j%%J%J%jj%%J%%%j%Jj%JJ%%%j%%%Jj%%%%J%%%%j%JJjjJJj
3051Dj%%JJjj%%J%jjJJ%%j%%%%%j%%J%%%%%%%%j%J%%%%%J%%%j%%%%%%%%%%%%%%%J%jj%%%%
3040B%J%%JJ%j%%j%%%j%J%j%J%%KJjj%%%%%J%jjJ%%%%%%j%%%J%%%%%%jj%%KJJ%%J%jJ%JJ%
3029IJ%KK%%kjkjkjJj%%j%j%JJjkJJJj%J%%%j%j%%J%j%jJ%j%%j%J%J%Jjj%%JJ%%jJj%%%%%
3018C%%jJJ%%J%j%jjJJ%Jj%%%%%%%%%%%j%%jJJjJ%%Jj%%%%jj%J%%%j%J%JjjJK%j%jj%K%%%
$$ plain form
3094 4 5 4 4 3 2 2 3 2 2 3 2 2 3 3 4 4 5 4 4 4 3 3 3 3 2 3 4 3 2 2 2 2 2 2 1 1 1 2 2 2 3 3 2 2 1 2 2 2 3 3 2 2 2 1 1 2 2 2 2 2 2 2 2 2 3 4 4 3 3 3 3
3083 3 3 3 2 2 3 3 3 3 3 3 4 4 4 4 4 3 3 2 3 2 2 2 2 3 3 4 4 3 3 3 3 3 3 3 3 3 3 3 3 4 3 3 3 2 2 2 3 3 4 4 4 4 3 3 3 4 4 4 3 3 3 2 3 3 3 3 3 3 4 3 2
3072 2 3 3 3 2 2 2 2 3 3 3 3 3 3 3 2 3 4 4 4 4 3 2 2 4 4 4 3 3 2 3 3 3 4 4 4 3 3 3 4 4 4 4 3 3 3 3 3 3 3 3 2 1 2 2 2 2 2 3 3 3 3 3 5 5 6 5 4 4 4 3 2
3061 2 2 1 1 2 2 2 2 2 4 3 3 3 3 3 3 3 4 3 2 3 3 3 2 2 2 3 3 4 4 3 2 2 2 3 3 3 3 2 2 3 2 2 3 4 4 4 4 3 3 3 3 4 3 3 3 3 3 4 4 4 4 4 3 3 4 5 4 3 4 5 4
3051 4 3 3 3 4 5 4 3 3 3 4 4 3 2 3 4 4 4 3 3 3 3 3 3 2 2 2 3 3 3 3 3 3 3 3 3 2 2 3 3 3 3 3 3 4 4 4 4 3 3 3 3 3 3 3 3 3 3 3 3 3 3 3 3 4 4 3 2 2 2 2 2
3040 2 2 3 3 3 4 5 5 4 4 4 3 3 3 3 2 2 3 3 2 2 3 3 3 5 6 5 4 4 4 4 4 4 5 5 4 3 4 4 4 4 4 4 4 3 3 3 3 4 4 4 4 4 4 4 3 2 2 2 4 5 6 6 6 7 7 6 7 7 8 9 9
3029 9 10 10 12 14 14 14 12 11 9 8 6 5 6 5 5 5 4 4 3 3 4 5 4 2 3 4 5 4 4 5 5 5 5 4 4 3 3 3 4 4 3 3 2 3 3 2 2 2 1 1 2 2 3 3 4 3 2 2 2 3 4 4 4 3 4 3 3 3 3 3 3
3018 3 3 3 2 3 4 4 4 5 5 4 4 3 2 3 4 4 5 4 4 4 4 4 4 4 4 4 4 4 4 3 3 3 2 3 4 3 4 4 4 5 4 4 4 4 4 3 2 2 3 3 3 3 2 2 3 3 4 3 2 3 5 5 4 4 3 2 2 4 4 4 4
3007D%%j%J%%%%%%%jJ%%%%%j%%jJJ%%j%%%%%%%%%%%%jJJ%j%%%J%%Jj%%%%%%%j%j%JJj%%%%
2996CJj%%%j%%J%%%kJJK%%%jj%j%%%J%j%J%%jJJ%%%%%%%jKj%%%%%%jjJ%%%%%%%%%%%jJJ%j
2986Cj%JjjJJJ%%%j%%%JjJ%%j%J%Jjj%%%J%J%%%%jj%jJJ%J%j%j%%J%%j%jJJJ%J%JJJK%KKk
2975A3kk%jjjj%%j%j%%%%%%JJ%j%%%%%%%%%j%%%%%%%%%%Jj%jJ%J%%Jjj%%%J%%%%j%Jj%%%J
2964D%j%JJ%%jJ%j%%Jj%%%%j%%J%j%jJ%%%%%%%j%J%%J%%%%j%%%j%%%%%%%%J%%%Jj%%J%%%%
2953Dj%J%J%%%%jjjJ%jJJ%jJ%J%%%j%%%k%%j%%J%JKj%%%%jJ%jJ%%%%%%%j%%%%JJj%%j%J%%
2942D%%j%J%%%j%%J%%%jJ%%%%j%%%%J%%%%j%J%jJJ%J%%%j%%%jjJ%%%JjjJ%j%%J%%j%%%KjJ
2932Ej%%%%%%%%%%J%j%%jJJ%j%Jjj%%KJ%JjjjjJ%%jJJ%%%%j%%%%%JJ%j%JJJJJJKJJ%jkkjj
$$ plain form
3007 4 4 4 3 3 4 4 4 4 4 4 4 4 3 4 4 4 4 4 4 3 3 3 2 3 4 4 4 3 3 3 3 3 3 3 3 3 3 3 3 3 2 3 4 4 3 3 3 3 4 4 4 5 4 4 4 4 4 4 4 4 3 3 2 2 3 4 3 3 3 3 3
2996 3 4 3 3 3 3 2 2 2 3 3 3 3 1 2 3 5 5 5 5 4 3 3 2 2 2 2 3 3 2 2 3 3 3 2 3 4 4 4 4 4 4 4 4 3 5 4 4 4 4 4 4 4 3 2 3 3 3 3 3 3 3 3 3 3 3 3 2 3 4 4 3
2986 3 2 2 3 2 1 2 3 4 4 4 4 3 3 3 3 4 3 4 4 4 3 3 4 4 5 4 3 3 3 3 4 4 5 5 5 5 5 4 3 3 2 3 4 4 5 5 4 4 3 3 3 4 4 4 3 3 2 3 4 5 5 6 6 7 8 9 11 11 13 15 13
2975 13 11 9 9 8 7 6 5 5 5 4 4 3 3 3 3 3 3 3 4 5 5 4 4 4 4 4 4 4 4 4 4 3 3 3 3 3 3 3 3 3 3 3 4 3 3 2 3 3 4 4 4 5 4 3 3 3 3 4 4 4 4 4 3 3 4 3 3 3 3 4
2964 4 4 3 3 4 5 5 5 4 5 5 4 4 4 5 4 4 4 4 4 3 3 3 4 4 3 3 2 3 3 3 3 3 3 3 3 2 2 3 3 3 4 4 4 4 4 3 3 3 3 2 2 2 2 2 2 2 2 2 3 3 3 3 4 3 3 3 4 4 4 4 4
2953 4 3 3 4 4 5 5 5 5 5 4 3 2 3 3 2 3 4 4 3 4 4 5 5 5 5 4 4 4 4 2 2 2 1 1 1 2 2 3 5 4 4 4 4 4 3 4 4 3 4 4 4 4 4 4 4 4 3 3 3 3 3 4 5 4 4 4 3 3 4 4 4
2942 4 4 4 3 3 4 4 4 4 3 3 3 4 4 4 4 3 4 4 4 4 4 3 3 3 3 3 4 4 4 4 4 3 3 4 4 3 4 5 5 6 6 6 6 5 5 5 5 4 3 4 4 4 4 5 4 3 4 4 3 3 3 4 4 4 3 3 3 3 5 4 5
2932 5 4 4 4 4 4 4 4 4 4 4 4 5 5 4 4 4 3 4 5 5 4 4 5 4 3 3 3 5 6 6 7 6 5 4 3 4 4 4 3 4 5 5 5 5 5 4 4 4 4 4 4 5 6 6 5 5 6 7 8 9 10 11 13 14 15 15 14 12 10 9 8
2921H%jj%j%%%%j%%J%%%%%%%%%%%%%%Jjj%jJ%%J%%%j%%%%J%j%%%%%J%%j%%%%JJ%%jjjJ%J%
2910E%%%j%%%%J%j%%%JJ%j%%J%j%j%%%Jj%JJjj%%%%J%%%j%%%%J%j%%%%%J%%j%J%%J%%jj%J
2899E%%j%J%%%%j%Kjk%J%%J%j%%J%%%%Jjj%J%%J%%j%%%%%%%jJJ%%%%%jjJ%%%%%j%J%%%Jjj
2888DjJ%%jJ%J%j%%%J%%j%jJJJ%%%jjJ%J%%%%%jj%J%%%%%%J%%%%%j%%%%%jjJ%J%%Jj%JJjj
2877E%%%%J%%%%j%%jj%%JJ%%J%%jJ%%J%%%j%%jJ%j%J%%%J%%%jj%JJJ%%%j%%%%%jkKJ%%Jjj
2867F%jjJ%jK%%J%%j%%%%%%%JJjjj%K%j%%%%%%J%%j%%%JJj%%k%K%%jjJ%%Jj%%%%%J%%%%%j
2856F%%%jJ%%JJ%%j%jJJ%jJJjj%%%j%%JJj%%%%%%%%%%%%%%%%J%%j%%Jj%j%J%%%J%j%%%J%%
2845Hj%j%%JJJjJ%%%%Jjj%J%%j%%JJj%j%%%%Jj%%JJ%%%jj%%J%%j%%%Jj%%%JjjJ%%%%%%%%J
$$ plain form
2921 8 8 7 6 6 5 5 5 5 5 4 4 4 5 5 5 5 5 5 5 5 5 5 5 5 5 5 5 6 5 4 4 3 4 4 4 5 5 5 5 4 4 4 4 4 5 5 4 4 4 4 4 4 5 5 5 4 4 4 4 4 5 6 6 6 5 4 3 4 4 5 5
2910 5 5 5 5 4 4 4 4 4 5 5 4 4 4 4 5 6 6 5 5 5 6 6 5 5 4 4 4 4 5 4 4 5 6 5 4 4 4 4 4 5 5 5 5 4 4 4 4 4 5 5 4 4 4 4 4 4 5 5 5 4 4 5 5 5 6 6 6 5 4 4 5
2899 5 5 5 4 4 5 5 5 5 5 4 4 6 5 3 3 4 4 4 5 5 4 4 4 5 5 5 5 5 6 5 4 4 5 5 5 6 6 6 5 5 5 5 5 5 5 5 4 5 6 6 6 6 6 6 5 4 5 5 5 5 5 5 4 4 5 5 5 5 6 5 4
2888 4 3 4 4 4 3 4 4 5 5 4 4 4 4 5 5 5 4 4 3 4 5 6 6 6 6 5 4 5 5 6 6 6 6 6 6 5 4 4 5 5 5 5 5 5 5 6 6 6 6 6 6 5 5 5 5 5 5 4 3 4 4 5 5 5 6 5 5 6 7 6 5
2877 5 5 5 5 5 6 6 6 6 6 5 5 5 4 3 3 3 4 5 5 5 6 6 6 5 6 6 6 7 7 7 7 6 6 6 5 6 6 5 5 6 6 6 6 7 7 7 7 6 5 5 6 7 8 8 8 8 7 7 7 7 7 7 6 4 6 7 7 7 8 7 6
2867 6 6 5 4 5 5 4 6 6 6 7 7 7 6 6 6 6 6 6 6 6 7 8 7 6 5 5 7 7 6 6 6 6 6 6 6 7 7 7 6 6 6 6 7 8 7 7 7 5 5 7 7 7 6 5 6 6 6 7 6 6 6 6 6 6 7 7 7 7 7 7 6
2856 6 6 6 6 5 6 6 6 7 8 8 8 7 7 6 7 8 8 7 8 9 8 7 7 7 7 6 6 6 7 8 7 7 7 7 7 7 7 7 7 7 7 7 7 7 7 7 7 8 8 8 7 7 7 8 7 7 6 6 7 7 7 7 8 8 7 7 7 7 8 8 8
2845 8 7 7 6 6 6 7 8 9 8 9 9 9 9 9 10 9 8 8 9 9 9 8 8 8 9 10 9 9 8 8 8 8 8 9 8 8 8 9 10 10 10 10 9 8 8 8 9 9 9 8 8 8 8 9 8 8 8 8 9 8 7 8 8 8 8 8 8 8 8 8 9
2834I%jJ%%%%%%j%KJ%%%jk%J%%J%%%%%%%%J%j%%JJj%JjJ%j%%%%jJ%%%%J%%%%%J%Jjj%J%%j
2823A2JJ%j%%jJ%%Jjj%%J%%%%J%%%%JJ%%%J%%JJ%J%K%KJJJJ%J%%k%jjj%%j%%J%%jJJJKjKJ
2813C0JLKLLMNOPPPOPK%mnpooommkljjj%J%%%KKKLLMMOPRJ1J3J6J8J8J8J5J1Jpj1j5j6j5j5
2804A28j3j2rpppnlkjJ%KJKKNNNOQJ1J3J6J8K1K4K3K2J5Plj2k0k2k2k1j8j6j4j3j1rpnnmk
2796F5j%jJ%KMLNOOQJ0J3J4J6J8J9J4Pjpj3j7j8j6j5j3j3j0qqpnllkkjjj%%J%JKKLMMNOQP
2788H8PMLknoqqponnmmkkkkjj%%kj%%J%J%%jJJKKJJJJJjj%jjk%jjJj%%jj%j%j%%%%JJ%%%%
2777C1%J%J%%KJJJ%KLKKKJKKKJJjlkjkkjj%jjjJ%%J%JJJ%JJKL%LKNMNOOONNK%lmmonmmmkl
2767F4kk%j%jJK%JJJJKKLKLMNOQPPQONM%lpoppppnmlkjk%jJ%J%JJJJJKJKLKNNMOPQPMKkkm
$$ plain form
2834 9 9 8 9 9 9 9 9 9 9 8 8 10 11 11 11 11 10 8 8 9 9 9 10 10 10 10 10 10 10 10 10 11 11 10 10 10 11 12 11 11 12 11 12 12 11 11 11 11 11 10 11 11 11 11 11 12 12 12 12 12 12 13 13 14 13 12 12 13 13 13 12
2823 12 13 14 14 13 13 13 12 13 13 13 14 13 12 12 12 13 13 13 13 13 14 14 14 14 14 15 16 16 16 16 17 17 17 18 19 19 20 20 22 22 24 25 26 27 28 28 29 29 29 27 27 26 25 24 24 24 23 23 23 24 24 24 23 24 25 26 28 27 29 30
2813 30 31 34 36 39 42 46 51 57 64 71 78 84 91 93 93 89 84 77 71 65 59 55 51 49 46 45 44 43 43 44 44 44 44 46 48 50 53 56 60 64 70 77 86 97 110 126 144 162 180 195 206 207 200 189 174 158 143 128
2804 128 115 103 94 87 80 73 68 65 63 62 63 63 65 66 68 70 75 80 85 91 99 110 123 139 157 178 202 225 247 262 269 266 254 234 212 190 169 151 135 121 108 97 88 81 76 71 67 65
2796 65 64 64 63 64 64 66 70 73 78 84 90 98 108 121 135 151 169 188 202 209 208 201 188 171 153 137 122 109 96 86 78 70 63 58 55 52 50 48 47 46 45 45 45 46 46 47 49 51 54 58 62 67 73 81 88
2788 88 95 99 102 100 95 89 81 73 66 60 55 50 46 42 40 38 36 34 33 32 32 32 30 29 29 29 30 30 31 31 31 30 31 32 34 36 37 38 39 40 41 40 39 39 38 37 35 35 34 33 34 33 33 33 32 31 31 30 30 29 29 29 29 29 30 31 31 31 31 31
2777 31 31 32 32 33 33 33 35 36 37 38 38 40 43 45 47 49 50 52 54 56 57 58 57 54 52 51 49 47 46 45 45 44 43 42 43 43 43 44 44 45 46 47 47 48 49 51 54 54 57 59 64 68 73 79 85 91 96 101 103 103 100 96 92 86 81 77 73 69 67 64
2767 64 62 60 60 59 59 58 59 61 61 62 63 64 65 67 69 72 74 77 81 86 92 100 107 114 122 128 133 137 137 134 127 121 114 107 100 93 88 84 81 79 78 76 76 75 76 76 77 77 78 79 80 81 82 84 85 87 90 92 97 102 106 112 119 127 134 138 140 138 136 132
2756A32nnmmnnl%kj%%JJJ%KJJJJK%JKMKLMMMNNNNKJJ%j%%%JJJJKJJLKLLKLLMMNMNNOQQRJ0
2746B51J0J2J2J3J5J5J4J7J9K1K2K5K8L1L4L8M2M5M9N5O1O9P5Q3R0R7J05J09J13J12J07R7
2741A886P9N9L5J4ok1k8l2l2k9k1j1KJ7L2N1P1R1J13J35J59J81K03K27K56K89L29L73M17M64
2736E303N06N45N71N86N82N54N01M18L10J79L9r4k11k99l59l90l96l82l51l09k58j96j31o1
2732F657J1Q4J56K28K94L57M19M87N64O57P60Q73R91J111J224J324J400J433J408J307J118
2729B2863Q40M86R0l01o44r06j085j184j217j198j139j049r41q20o87n52m14k74j38oJ21K35
2726A2080L41M41N43O60P92R36J088J248J409J566J714J833J901J884J738J419R14K60m39
2723C2328j050j485j731j831j838j784j698j587j459j315j162j001q40o81n25l79k39j13m
$$ plain form
2756 132 127 122 118 114 109 104 101 101 99 98 98 98 99 100 101 101 103 104 105 106 107 109 109 110 112 116 118 121 125 129 133 138 143 148 153 155 156 157 157 156 156 156 156 157 158 159 160 162 163 164 167 169 172 175 177 180 183 187 191 196 200 205 210 216 224 232 241 251
2746 251 261 273 285 298 313 328 342 359 378 399 421 446 474 505 539 577 619 664 713 768 829 898 973 1056 1146 1243 1348 1457 1570 1682 1789 1886
2741 1886 1965 2024 2059 2073 2067 2046 2018 1986 1954 1925 1904 1893 1895 1912 1944 1995 2066 2157 2270 2405 2564 2745 2948 3175 3431 3720 4049 4422 4839 5303
2736 5303 5809 6354 6925 7511 8093 8647 9148 9566 9876 10055 10094 10000 9789 9490 9131 8741 8345 7963 7612 7303 7045 6849 6718 6657
2732 6657 6668 6752 6908 7136 7430 7787 8206 8693 9257 9914 10674 11547 12538 13649 14873 16197 17597 19030 20438 21745 22863
2729 22863 23703 24189 24279 23978 23334 22428 21343 20159 18942 17744 16605 15556 14615 13795 13108 12556 12142 11868 11730 11724 11845 12080
2726 12080 12421 12862 13405 14065 14857 15793 16881 18129 19538 21104 22818 24651 26552 28436 30174 31593 32507 32767 32328
2723 32328 31278 29793 28062 26231 24393 22609 20911 19324 17865 16550 15388 14387 13547 12866 12341 11962 11723 11610 11606
2720A1606R3J86K85L98N27O65Q06R42J073J183J262J292J262J147R39O35K49j76n90r41j199
2717B1644j366j448j464j430j361j269j163j048r27q09o93n82m76l79k93k17j52j00n0MO5
2714F486J32K01K71L33L86M29M51M47M15L44K43J08m4j99l41m54n36n87o13o19o04n78n40
2710E131m95m47l98l49l03k59k19j82j52j24j03q7o9n2l1pJ7M3P1J04J35J69J94J98J34Jj29
2706B791j82j83j74j69j66j63j55j46j35j22j11j02r0q0p1o1n2m5l8l1k7k4k0j8j6j2j1qn
2702C74kj%JJJKMMOQJ5J9K9M5O5R1J20J45J46Q6m1j44j60j26r0o5n0l8l0k1j3ojJMNPQRQO
2695D22MJknqrj1j3j3j3j3j2rqqpnlk%JLNNORJ0J3J3J6J6J7J7J8J7J5J3J0Okoj2j5j8j7k0
2688D06j9j8j7j6j5j4j3j0rpnkjj%JMNOQJ0J1J1J2J0J1J0QNKjlqj0j3j4j6j6j6j5j5j4j3j2
$$ plain form
2720 11606 11699 11885 12170 12568 13095 13760 14566 15508 16581 17764 19026 20318 21580 22727 23666 24301 24550 24374 23784 22843 21644
2717 21644 20278 18830 17366 15936 14575 13306 12143 11095 10168 9359 8666 8084 7608 7229 6936 6719 6567 6467 6417 6421 6486
2714 6486 6618 6819 7090 7423 7809 8238 8689 9136 9551 9895 10138 10246 10202 10003 9662 9208 8672 8085 7472 6853 6249 5671 5131
2710 5131 4636 4189 3791 3442 3139 2880 2661 2479 2327 2203 2100 2013 1944 1892 1861 1854 1871 1914 1985 2089 2224 2393 2587 2785 2919 2920 2791
2706 2791 2609 2426 2252 2083 1917 1754 1599 1453 1318 1196 1085 983 893 813 742 681 629 584 546 515 488 464 444 426 410 398 387 379 374
2702 374 372 371 371 372 373 374 376 380 384 390 398 413 432 461 506 571 662 782 927 1073 1159 1118 974 814 688 598 533 483 445 415 394 381 375 374 375 379 384 391 399 408 416 422
2695 422 426 427 425 420 412 403 392 379 366 353 340 328 319 311 303 296 291 288 286 286 287 290 295 300 306 315 325 338 351 367 383 400 417 435 452 467 480 490 496 494 488 476 461 443 426 406
2688 406 387 369 352 336 321 307 294 284 275 268 263 261 260 259 259 260 264 269 275 283 293 304 315 327 337 348 358 366 371 373 372 369 361 351 338 324 308 292 276 261 246 232 219 207
2682B07j1rqonnllkjj%%KKLLMLLJJ%%klmnnpqqpponoonmmmmllkJkj%jk%j%j%%%%%jj%kkkk
2671E0kjkjkjkk%j%jjj%%%%j%j%%%jJ%%%j%%%%jj%%%j%%%%%%%JJJK%JJKJJJkj%j%jj%j%jj
2660C0%J%%%KJJ%%KJKJKMMNOOQPOMKjmnnonnmnllkl%%%JKJKKKLLMNOQRJ1J3J6J9J9J7J4Q%
2651B09qj4j7j8j6j3j2j0rqpomlj%%JJKKKMMMPQJ0J2J7J9K2K5K5K5K0Rnj7k3k4k5k2k0j8j6
2644A12j2j1j0oonkkk%%JJJJLMNPQJ1J3J6J8J9K1J8J4Moj6k0k1k0j8j6j4j1rrponljjjj%j
2636C5jJ%%KKKKMOOQRRQN%mpqj0qqpnmnllkljjjjj%%%jj%J%%J%KJKJJ%Jjjjjjkkj%%%jjj%
2626A1%jjj%K%%%jjjJ%J%jJ%%j%%%j%%J%Jj%%%%J%%jj%Jj%%%JJ%JJJjj%%j%%%%jjj%%%%%J
2615Gj%%%%%Jj%%J%JJ%j%%%J%%%jj%J%Jj%%kjJ%JJ%%%j%J%jj%JJ%%%%%j%K%%%%Jj%j%%j%%
$$ plain form
2682 207 196 187 179 173 168 163 160 157 155 154 153 153 153 155 157 160 163 167 170 173 174 175 175 175 173 170 166 161 156 149 141 133 126 119 113 108 102 96 91 87 83 79 75 72 69 67 68 66 65 65 64 62 62 61 61 60 60 60 60 60 60 59 58 58 56 54 52 50
2671 50 48 47 45 44 42 41 39 37 37 36 36 35 34 33 33 33 33 33 32 32 31 31 31 31 30 31 31 31 31 30 30 30 30 30 29 28 28 28 28 27 27 27 27 27 27 27 27 28 29 30 32 32 33 34 36 37 38 39 37 36 36 35 35 34 33 33 32 32 31 30
2660 30 30 31 31 31 31 33 34 35 35 35 37 38 40 41 43 47 51 56 62 68 76 83 89 93 95 94 90 85 80 74 69 64 60 55 52 49 47 44 44 44 44 45 47 48 50 52 54 57 60 64 69 75 83 92 103 116 132 151 170 187 201 209 209
2651 209 201 187 170 152 136 123 111 101 92 84 77 71 67 64 63 63 63 64 65 67 69 71 75 79 83 90 98 108 120 137 156 178 203 228 253 273 282 277 260 237 213 188 166 146 128 112
2644 112 100 89 79 73 67 62 60 58 56 56 56 57 58 59 60 63 67 72 79 87 98 111 127 145 164 185 203 217 221 215 199 179 158 138 120 104 90 79 70 61 54 48 43 40 39 38 37 36 36 35
2636 35 34 35 35 35 37 39 41 43 47 53 59 67 76 85 93 98 98 94 87 79 69 61 53 46 41 37 32 29 26 24 21 20 19 18 17 16 16 16 16 15 14 14 15 15 15 16 16 18 19 21 22 23 23 24 23 22 21 20 19 17 15 14 14 14 14 13 12 11 11
2626 11 11 10 9 8 8 10 10 10 10 9 8 7 8 8 9 9 8 9 9 9 8 8 8 8 7 7 7 8 8 9 8 8 8 8 8 9 9 9 8 7 7 8 7 7 7 7 8 9 9 10 11 12 11 10 10 10 9 9 9 9 9 8 7 6 6 6 6 6 6 7
2615 7 6 6 6 6 6 6 7 6 6 6 7 7 8 9 9 8 8 8 8 9 9 9 9 8 7 7 8 8 9 8 8 8 6 5 6 6 7 8 8 8 8 7 7 8 8 7 6 6 7 8 8 8 8 8 8 7 7 9 9 9 9 9 10 9 9 8 8 8 7 7 7
2604G%j%%%%jJ%J%jj%%%Jj%%J%%%j%%%%%%%%K%j%%j%J%%jJ%j%%%%jkJ%J%%J%%%%%J%j%%%J
2593F%%%j%%J%%j%j%%%%%%%%%%Jj%%%%%j%J%%%%%%JjjJK%j%j%%%%%jJ%%%%j%%%%%J%jJJ%j
2582D%%%jJ%%%%%%%%%j%%%%%%J%%Jj%%%%%j%J%J%%%%%%%%%%%%jJj%%%j%%%J%%%Jj%%j%JJJ
2572F%jjj%jJJ%%%%%%%j%%J%%%%j%%%j%%J%jJ%J%%jjJ%Jj%%%%%Jj%%%JJ%%%%%%%j%%%%jj%
2561B%%J%JJ%%%%%%j%%%%%j%%%%%%%%j%J%JJ%k%%%j%JJkj%J%%%J%%Jj%%%%Kj%%Jjj%J%%j%
2550C%J%%j%%J%%%%J%%%jjJ%%%%jjJ%%%%%JjjJ%%JjJJ%%%%%Jk%JJ%j%%jj%JJj%j%%J%%j%%
2539CJ%J%jJ%%jj%J%J%%%%%%%%j%j%%%%J%%%%J%%j%K%%jk%J%Jjj%%%JJj%%%%Jj%%j%%J%%j
2528CJ%%%j%J%%%%Jj%%j%%%%JjjJJ%%%%j%%%%%%J%j%%JJjj%%%%%%%%%J%%jj%%J%J%%%jJJj
$$ plain form
2604 7 7 6 6 6 6 6 5 6 6 7 7 6 5 5 5 5 6 5 5 5 6 6 6 6 5 5 5 5 5 5 5 5 5 7 7 6 6 6 5 5 6 6 6 5 6 6 5 5 5 5 5 4 2 3 3 4 4 4 5 5 5 5 5 5 6 6 5 5 5 5 6
2593 6 6 6 6 5 5 5 6 6 6 5 5 4 4 4 4 4 4 4 4 4 4 4 5 4 4 4 4 4 4 3 3 4 4 4 4 4 4 4 5 4 3 4 6 6 5 5 4 4 4 4 4 4 3 4 4 4 4 4 3 3 3 3 3 3 4 4 3 4 5 5 4
2582 4 4 4 4 3 4 4 4 4 4 4 4 4 4 4 3 3 3 3 3 3 3 4 4 4 5 4 4 4 4 4 4 3 3 4 4 5 5 5 5 5 5 5 5 5 5 5 5 5 4 5 4 4 4 4 3 3 3 3 4 4 4 4 5 4 4 4 3 3 4 5 6
2572 6 6 5 4 3 3 2 3 4 4 4 4 4 4 4 4 3 3 3 4 4 4 4 4 3 3 3 3 2 2 2 3 3 2 3 3 4 4 4 3 2 3 3 4 3 3 3 3 3 3 4 3 3 3 3 4 5 5 5 5 5 5 5 5 4 4 4 4 4 3 2 2
2561 2 2 2 3 3 4 5 5 5 5 5 5 5 4 4 4 4 4 4 3 3 3 3 3 3 3 3 3 2 2 3 3 4 5 5 3 3 3 3 2 2 3 4 2 1 1 2 2 2 2 3 3 3 4 3 3 3 3 3 5 4 4 4 5 4 3 3 4 4 4 3 3
2550 3 3 4 4 4 3 3 3 4 4 4 4 4 5 5 5 5 4 3 4 4 4 4 4 3 2 3 3 3 3 3 3 4 3 2 3 3 3 4 3 4 5 5 5 5 5 5 6 4 4 5 6 6 5 5 5 4 3 3 4 5 4 4 3 3 3 4 4 4 3 3 3
2539 3 4 4 5 5 4 5 5 5 4 3 3 4 4 5 5 5 5 5 5 5 5 5 4 4 3 3 3 3 3 4 4 4 4 4 5 5 5 4 4 6 6 6 5 3 3 4 4 5 4 3 3 3 3 4 5 4 4 4 4 4 5 4 4 4 3 3 3 4 4 4 3
2528 3 4 4 4 4 3 3 4 4 4 4 4 5 4 4 4 3 3 3 3 3 4 3 2 3 4 4 4 4 4 3 3 3 3 3 3 3 4 4 3 3 3 4 5 4 3 3 3 3 3 3 3 3 3 3 4 4 4 3 2 2 2 3 3 4 4 4 4 3 4 5 4
2517D%j%J%%%%%%J%jjJ%%j%%jJJ%Jj%jjJJ%j%%%%%%%J%j%%JjjjjJK%%%Kj%%%J%%kJ%jjJJ%
2507Dk%j%J%%J%%%%%jJJJj%j%%%%%%J%J%j%jj%J%%%%j%%K%%%%%%j%%j%%%%%%%%%J%%j%%%J
2496C%j%%%J%j%%%J%%%%%j%J%%%%JJj%jJJj%j%%J%%jj%J%j%JJ%j%%%%J%%%%%jJjj%%%%%J%
2485C%j%%J%%jJJ%%jj%j%%%JJJj%jjJ%%%j%JJ%j%K%%jj%%%J%%%%%J%%%j%Jj%j%%%%%%Jj%J
2474CjJJj%j%%J%j%%%%%%JJ%J%j%j%%%%%JjjJ%%%%%%%%%J%jj%%%%%%%J%J%%%jJ%%JjjJJj%
2463D%%%jjJ%%%%%%%%j%%%JJj%%%%%%%%%%J%%%jJ%j%%%%%j%J%JjjJj%J%%%%Jjj%K%%j%j%%
2452BJj%J%%%jjJ%%%%%J%%jJ%%jJ%%jJ%%jJJ%j%%%%j%%%J%%%%%%%%%%jJ%%%%j%%J%%%%Jjj
2442BJ%%%%%%%%%%%%jJ%j%%%J%%j%J%%%%%j%%J%%%%%JJj%%Jjj%j%%J%%%%%%J%%jj%%%%J%%
$$ plain form
2517 4 4 3 3 4 4 4 4 4 4 4 5 5 4 3 4 4 4 3 3 3 2 3 4 4 5 4 4 3 2 3 4 4 3 3 3 3 3 3 3 3 4 4 3 3 3 4 3 2 1 0 1 3 3 3 3 5 4 4 4 4 5 5 5 3 4 4 3 2 3 4 4
2507 4 2 2 1 1 2 2 2 3 3 3 3 3 3 2 3 4 5 4 4 3 3 3 3 3 3 3 4 4 5 5 4 4 3 2 2 3 3 3 3 3 2 2 2 4 4 4 4 4 4 4 3 3 3 2 2 2 2 2 2 2 2 2 2 3 3 3 2 2 2 2 3
2496 3 3 2 2 2 2 3 3 2 2 2 2 3 3 3 3 3 3 2 2 3 3 3 3 3 4 5 4 4 3 4 5 4 4 3 3 3 4 4 4 3 2 2 3 3 2 2 3 4 4 3 3 3 3 3 4 4 4 4 4 4 3 4 3 2 2 2 2 2 2 3 3
2485 3 3 2 2 2 3 3 3 2 3 4 4 4 3 2 2 1 1 1 1 2 3 4 3 3 2 1 2 2 2 2 1 1 2 3 3 2 2 4 4 4 3 2 2 2 2 3 3 3 3 3 3 4 4 4 4 3 3 4 3 3 2 2 2 2 2 2 2 3 2 2 3
2474 3 2 3 4 3 3 2 2 2 3 3 2 2 2 2 2 2 2 3 4 4 5 5 4 4 3 3 3 3 3 3 4 3 2 3 3 3 3 3 3 3 3 3 3 4 4 3 2 2 2 2 2 2 2 2 3 3 4 4 4 4 3 4 4 4 5 4 3 4 5 4 4
2463 4 4 4 4 3 2 3 3 3 3 3 3 3 3 3 2 2 2 2 3 4 3 3 3 3 3 3 3 3 3 3 3 4 4 4 4 3 4 4 3 3 3 3 3 3 2 2 3 3 4 3 2 3 2 2 3 3 3 3 3 4 3 2 2 4 4 4 3 3 2 2 2
2452 2 3 2 2 3 3 3 3 2 1 2 2 2 2 2 2 3 3 3 2 3 3 3 2 3 3 3 2 3 3 3 2 3 4 4 3 3 3 3 3 2 2 2 2 3 3 3 3 3 3 3 3 3 3 3 2 3 3 3 3 3 2 2 2 3 3 3 3 3 4 3 2
2442 2 3 3 3 3 3 3 3 3 3 3 3 3 3 2 3 3 2 2 2 2 3 3 3 2 2 3 3 3 3 3 3 2 2 2 3 3 3 3 3 3 4 5 4 4 4 5 4 3 3 2 2 2 3 3 3 3 3 3 3 4 4 4 3 2 2 2 2 2 3 3 3
2431C%JJjj%%j%%Jj%%JJ%%%%%%j%Jj%%j%JJJj%%j%%J%j%%j%J%%%%J%J%%j%%jJJj%%%J%%J%
2420F%%jjJ%j%%j%%%%%Jj%%Jj%%%%%%J%JJ%%%j%J%%JK%%%%jj%%%%kjJ%%j%%%%Jjj%J%%J%%
2409EJJjj%J%J%%%JJJ%%j%%jjJ%kjj%Jj%%jKJ%j%%j%J%J%j%JJ%%%J%J%JJj%%%jjjj%Jj%%%
2398Fj%%%jJJ%%J%%jj%%jJJJ%jj%JJJJ%j%j%j%%JJj%%j%%%%J%%%J%kj%J%%j%J%J%%k%J%%J
2387G%J%Jj%%%j%%%%J%%%j%%j%%j%J%%%%%jJJ%j%jjJ%K%j%%jJ%%%%%J%j%%%%%%%%%%jJ%%j
2377E%%J%j%%%%%%%%%%%%%jJJ%jj%%jJJJj%%%%jJ%J%%j%%%%JJJ%LKKJKKklkljjJ%jj%%%j%
2366F%j%%%%K%%JJJjJJJK%KLMPJ0J1J4J4J1Jj1j3j2rnmkjkmllmjkjjj%%%%JKKJJKKKMNOQJ1
2356E9J4J9K6L2L6L5J4k0l4k9j9j1m%LJqj8j9j4j0qnmmlj%%j%JJKJLKNNQJ1J3J8K4L2M0M6
$$ plain form
2431 3 3 4 5 4 3 3 3 2 2 2 3 2 2 2 3 4 4 4 4 4 4 4 3 3 4 3 3 3 2 2 3 4 5 4 4 4 3 3 3 4 4 3 3 3 2 2 3 3 3 3 3 4 4 5 5 5 4 4 4 3 4 5 4 4 4 4 5 5 5 6 6
2420 6 6 6 5 4 5 5 4 4 4 3 3 3 3 3 3 4 3 3 3 4 3 3 3 3 3 3 3 4 4 5 6 6 6 6 5 5 6 6 6 7 9 9 9 9 9 8 7 7 7 7 7 5 4 5 5 5 4 4 4 4 4 5 4 3 3 4 4 4 5 5 5
2409 5 6 7 6 5 5 6 6 7 7 7 7 8 9 10 10 10 9 9 9 8 7 8 8 6 5 4 4 5 4 4 4 3 5 6 6 5 5 5 4 4 5 5 6 6 5 5 6 7 7 7 7 8 8 9 9 10 11 10 10 10 10 9 8 7 6 6 7 6 6 6 6
2398 6 5 5 5 5 4 5 6 6 6 7 7 7 6 5 5 5 4 5 6 7 7 6 5 5 6 7 8 9 9 8 8 7 7 6 6 6 7 8 7 7 7 6 6 6 6 6 7 7 7 7 8 8 6 5 5 6 6 6 5 5 6 6 7 7 7 5 5 6 6 6 7
2387 7 7 8 8 9 8 8 8 8 7 7 7 7 7 8 8 8 8 7 7 7 6 6 6 5 5 6 6 6 6 6 6 5 6 7 7 6 6 5 4 5 5 7 7 6 6 6 5 6 6 6 6 6 6 7 7 6 6 6 6 6 6 6 6 6 6 6 5 6 6 6 5
2377 5 5 5 6 6 5 5 5 5 5 5 5 5 5 5 5 5 5 5 4 5 6 6 5 4 4 4 3 4 5 6 5 5 5 5 5 4 5 5 6 6 6 5 5 5 5 5 6 7 8 8 11 13 15 16 18 20 18 15 13 10 9 8 9 9 8 7 7 7 7 6 6
2366 6 6 5 5 5 5 5 7 7 7 8 9 10 9 10 11 12 14 14 16 19 23 30 40 51 65 79 90 91 80 67 55 46 41 37 35 34 32 28 25 22 18 17 15 14 13 12 12 12 12 12 13 15 17 18 19 21 23 25 29 34 40 48 59
2356 59 73 92 118 150 186 221 235 215 181 152 133 122 118 118 121 122 114 96 77 63 53 45 40 36 32 29 28 28 28 27 27 28 29 31 32 35 37 42 47 55 66 79 97 121 153 193 239
2349B39N2L6rm1l9k5rLJ3J9J9kl3m3l6k7k0j7j3j0qonmk%j%JJKKLMNQJ1J2J7K1K9L5L9L6R
2342B66k2k7j5kJ1K2L3L5J9k6n4n0l8k9k2j8j4j2j0qnnkk%%J%JKJJLLNPPJ0J5J6J7J1kqmM
2335A15J3J9K5L0K5ll5l9l1k2j7j4j2j1ponnlkjjj%JjJJ%%JJJKKLMKJJKLOPJ2J3J2Nj0j6j4
2327E2j0ppomklkjkkj%%J%%J%j%%%%%%%%%%%JJJJJLKJ%llkj%jjj%%Jj%j%%%%j%jjJJ%%%J%
2317D%j%%%Jjj%Jjj%%%JJ%%jJJj%%J%Jjj%%%%%%%j%j%%J%%%%jJ%J%J%%j%%%%j%J%%jJ%%%%
2306C%J%%%k%%%JJ%%%jjj%%%%JJ%%J%%j%%%%J%j%%%JJ%jj%jJ%%%%%%%%J%%%%%%Jj%j%%Jjj
2295B%J%%kJJj%J%%%%jJJ%jj%J%J%Jj%j%%%%%%%%%jJ%j%%J%%%%%jJJjJJ%%%%%%%%%J%J%jj
2284E%%%%jJjjjjJ%Jj%%%%%%%%%J%%JJ%%%%%j%%%J%j%j%%J%%%j%%%%JJj%%%jj%%JJJ%J%%j
$$ plain form
2349 239 291 327 318 277 238 213 204 207 220 239 258 256 223 180 144 117 97 80 67 57 49 43 38 34 32 32 31 31 32 33 35 37 40 44 49 57 68 80 97 118 147 182 221 257 266
2342 266 244 217 202 200 211 233 266 301 320 294 240 190 152 123 101 83 69 57 47 39 34 29 27 25 25 25 26 26 27 29 30 31 34 37 42 49 56 66 81 97 114 125 123 115 111 115
2335 115 128 147 172 202 227 224 189 150 119 97 80 66 54 43 36 30 25 20 17 15 14 13 12 12 13 12 13 14 14 14 15 16 17 19 21 24 28 30 31 32 34 37 43 50 62 75 87 92 82 66 52
2327 52 42 35 28 22 18 16 13 11 10 8 6 5 5 5 6 6 6 7 7 6 6 6 6 6 6 6 6 6 6 6 6 7 8 9 10 11 14 16 17 17 14 11 9 8 8 7 6 5 5 5 6 5 5 4 4 4 4 4 3 3 2 1 2 3 3 3 3 4 4
2317 4 4 3 3 3 3 4 3 2 2 3 2 1 1 1 1 2 3 3 3 2 3 4 3 3 3 4 4 5 4 3 3 3 3 3 3 3 3 2 2 1 1 1 2 2 2 2 2 1 2 2 3 3 4 4 4 3 3 3 3 3 2 2 3 3 3 2 3 3 3 3 3
2306 3 3 4 4 4 4 2 2 2 2 3 4 4 4 4 3 2 1 1 1 1 1 2 3 3 3 4 4 4 3 3 3 3 3 4 4 3 3 3 3 4 5 5 4 3 3 2 3 3 3 3 3 3 3 3 3 4 4 4 4 4 4 4 5 4 4 3 3 3 4 3 2
2295 2 2 3 3 3 1 2 3 2 2 3 3 3 3 3 2 3 4 4 3 2 2 3 3 4 4 5 4 4 3 3 3 3 3 3 3 3 3 3 2 3 3 2 2 2 3 3 3 3 3 3 2 3 4 3 4 5 5 5 5 5 5 5 5 5 5 6 6 7 7 6 5
2284 5 5 5 5 5 4 5 4 3 2 1 2 2 3 2 2 2 2 2 2 2 2 2 2 3 3 3 4 5 5 5 5 5 5 4 4 4 4 5 5 4 4 3 3 3 4 4 4 4 3 3 3 3 3 4 5 4 4 4 4 3 2 2 2 3 4 5 5 6 6 6 5
2273E%%%%%J%Jjj%%%kj%J%J%%j%%%%J%j%%%%%%%%J%%%%%%%%%%%%JJ%j%j%Jj%j%%%%j%%%%%
2263Bj%%%%JJ%%%%%%J%Jj%%%J%%J%kj%%%J%%%jjJJ%%%%j%%%jJ%%%%%j%jJ%%%J%%%%%%%j%%
2252B%JJJ%kj%%%%%%%%%%%%%%%J%%%%%%%j%J%%%jj%JjJJJ%jj%%%JKjj%%%%%%Jjj%J%J%jj%
2241BjJ%%JJ%%%jjJJ%j%jjJ%%%%%%%%%jJJ%%%J%%%%j%%%%%%j%Jj%JJ%%%j%%%j%%J%j%%J%j
2230BJ%J%%j%%jjJ%%J%%J%%j%%%%%J%%%jJ%%%%%j%%Jjj%Jj%%%%%%%%%%%J%%%J%%%%j%%JJj
2219D%j%JJ%J%%jj%%j%%%%%%j%%%%%%j%J%J%j%%%J%%%jj%J%J%%j%Jj%J%%%%JKj%j%J%Jj%j
2208D%%%%jJJ%jj%%%%%%%%j%%jJ%J%%%JJjjJ%%%j%j%%J%%%%J%j%J%%%j%%%jjJJ%%%%jjJ%%
2198B%J%J%%jJKj%j%%j%%%%%%%%%%%%%jJ%%Jj%%J%j%%jj%jKJjJ%J%jJk%%%%%%%%%%%%J%%%
$$ plain form
2273 5 5 5 5 5 5 6 6 7 6 5 5 5 5 3 2 2 3 3 4 4 4 3 3 3 3 3 4 4 3 3 3 3 3 3 3 3 3 4 4 4 4 4 4 4 4 4 4 4 4 4 5 6 6 5 5 4 4 5 4 4 3 3 3 3 3 2 2 2 2 2 2
2263 2 1 1 1 1 1 2 3 3 3 3 3 3 3 4 4 5 4 4 4 4 5 5 5 6 6 4 3 3 3 3 4 4 4 4 3 2 3 4 4 4 4 4 3 3 3 3 2 3 3 3 3 3 3 2 2 1 2 2 2 2 3 3 3 3 3 3 3 3 2 2 2
2252 2 2 3 4 5 5 3 2 2 2 2 2 2 2 2 2 2 2 2 2 2 2 2 3 3 3 3 3 3 3 3 2 2 3 3 3 3 2 1 1 2 1 2 3 4 4 3 2 2 2 2 3 5 4 3 3 3 3 3 3 3 4 3 2 2 3 3 4 4 3 2 2
2241 2 1 2 2 2 3 4 4 4 4 3 2 3 4 4 3 3 2 1 2 2 2 2 2 2 2 2 2 2 1 2 3 3 3 3 4 4 4 4 4 3 3 3 3 3 3 3 2 2 3 2 2 3 4 4 4 4 3 3 3 3 2 2 2 3 3 2 2 2 3 3 2
2230 2 3 3 4 4 4 3 3 3 2 1 2 2 2 3 3 3 4 4 4 3 3 3 3 3 3 4 4 4 4 3 4 4 4 4 4 4 3 3 3 4 3 2 2 3 2 2 2 2 2 2 2 2 2 2 2 2 3 3 3 3 4 4 4 4 4 3 3 3 4 5 4
2219 4 4 3 3 4 5 5 6 6 6 5 4 4 4 3 3 3 3 3 3 3 2 2 2 2 2 2 2 1 1 2 2 3 3 2 2 2 2 3 3 3 3 2 1 1 2 2 3 3 3 2 2 3 2 2 3 3 3 3 3 4 6 5 5 4 4 5 5 6 5 5 4
2208 4 4 4 4 4 3 4 5 5 4 3 3 3 3 3 3 3 3 3 2 2 2 1 2 2 3 3 3 3 4 5 4 3 4 4 4 4 3 3 2 2 2 3 3 3 3 3 4 4 3 3 4 4 4 4 3 3 3 3 2 1 2 3 3 3 3 3 2 1 2 2 2
2198 2 2 3 3 4 4 4 3 4 6 5 5 4 4 4 3 3 3 3 3 3 3 3 3 3 3 3 3 3 2 3 3 3 4 3 3 3 4 4 3 3 3 2 1 1 0 2 3 2 3 3 4 4 3 4 2 2 2 2 2 2 2 2 2 2 2 2 2 3 3 3 3
2187C%J%%%%%%%jjJ%J%%l%%%JJJJ%jj%%%j%J%j%j%%J%J%%%%%jjJ%jJJ%jj%J%J%%jJ%%j%%%
2176B%%JjJj%JJ%%jj%J%%%J%j%%j%%%J%%J%%%j%j%%%J%%%%j%%%JJ%%Jjj%j%%%%J%Jjj%%%%
2165B%J%%jjJ%%J%%%%%jJJj%%%%Jj%%%%%%Jj%j%J%%%j%%%%jJJ%J%%%%j%%%%%%%j%%%%%Jj%
2154BKjjJJ%j%%%%%%%%%%Jjjj%J%%%jJ%%jJJ%Jjj%%%JjJJ%jj%%%%%%JJ%j%%%j%Jj%KJj%jj
2143B%J%%%%%jJJJk%j%%J%%j%%%%J%%Jj%%%%%%j%%J%J%%jj%%%%%%%%%J%j%%%%J%%%%%%%%%
2133Cj%%%%%%J%j%jJ%J%j%j%%%Jj%JJ%jJ%%%%%%%%%%%%jJ%%j%%%%%%%%J%%%%j%%JJ%%%j%%
2122C%%J%jk%%%J%%%j%%J%%J%%%Jj%%J%%j%%jJJj%%%%%j%%%%%J%j%jJ%J%J%j%%jK%jj%j%J
2111B%J%Jjj%Jj%J%j%%%%JKj%%%j%%%j%%%%J%Jj%j%%%JJ%%J%kjj%J%J%%%%JJjj%%Jj%%%%J
$$ plain form
2187 3 3 4 4 4 4 4 4 4 4 3 2 3 3 4 4 4 1 1 1 1 2 3 4 5 5 4 3 3 3 3 2 2 3 3 2 2 1 1 1 2 2 3 3 3 3 3 3 2 1 2 2 1 2 3 3 2 1 1 2 2 3 3 3 2 3 3 3 2 2 2 2
2176 2 2 2 3 2 3 2 2 3 4 4 4 3 2 2 3 3 3 3 4 4 3 3 3 2 2 2 2 3 3 3 4 4 4 4 3 3 2 2 2 2 3 3 3 3 3 2 2 2 2 3 4 4 4 5 4 3 3 2 2 2 2 2 3 3 4 3 2 2 2 2 2
2165 2 2 3 3 3 2 1 2 2 2 3 3 3 3 3 3 2 3 4 3 3 3 3 3 4 3 3 3 3 3 3 3 4 3 3 2 2 3 3 3 3 2 2 2 2 2 1 2 3 3 4 4 4 4 4 3 3 3 3 3 3 3 3 2 2 2 2 2 2 3 2 2
2154 2 4 3 2 3 4 4 3 3 3 3 3 3 3 3 3 3 3 4 3 2 1 1 2 2 2 2 1 2 2 2 1 2 3 3 4 3 2 2 2 2 3 2 3 4 4 3 2 2 2 2 2 2 2 3 4 4 3 3 3 3 2 2 3 2 2 4 5 4 4 3 2
2143 2 2 3 3 3 3 3 3 2 3 4 5 3 3 2 2 2 3 3 3 2 2 2 2 2 3 3 3 4 3 3 3 3 3 3 3 2 2 2 3 3 4 4 4 3 2 2 2 2 2 2 2 2 2 2 3 3 2 2 2 2 2 3 3 3 3 3 3 3 3 3 3
2133 3 2 2 2 2 2 2 2 3 3 2 2 1 2 2 3 3 2 2 1 1 1 1 2 1 1 2 3 3 2 3 3 3 3 3 3 3 3 3 3 3 3 3 2 3 3 3 2 2 2 2 2 2 2 2 2 3 3 3 3 3 2 2 2 3 4 4 4 4 3 3 3
2122 3 3 3 4 4 3 1 1 1 1 2 2 2 2 1 1 1 2 2 2 3 3 3 3 4 3 3 3 4 4 4 3 3 3 2 3 4 3 3 3 3 3 3 2 2 2 2 2 2 3 3 2 2 1 2 2 3 3 4 4 3 3 3 2 4 4 3 2 2 1 1 2
2111 2 2 3 3 4 3 2 2 3 2 2 3 3 2 2 2 2 2 3 5 4 4 4 4 3 3 3 3 2 2 2 2 2 3 3 4 3 3 2 2 2 2 3 4 4 4 5 5 3 2 1 1 2 2 3 3 3 3 3 4 5 4 3 3 3 4 3 3 3 3 3 4
2100DjJJjjJ%j%JjjJJjj%Jj%%jJJ%Jj%%j%%%jJJ%J%%%%%%%Jj%j%j%%JjJ%%%Jkj%%%%K%jJ%
2089C%j%%%j%%%JJ%%%%%%j%%jJ%%%JJ%j%j%J%%%j%%jJ%%%%%%%%%J%%%j%J%jJ%J%%j%%%%%J
2078D%jj%JJjj%%J%J%j%jj%jJJ%%%J%j%J%Jj%j%%%Jj%Jj%J%%%jjJK%k%%j%%J%%Jj%jJ%JJj
2068Cj%jJJ%J%j%%%%J%%j%j%%Jj%%%%%J%%%%%j%%JJj%%jJ%%jJJ%%j%%%%%%Jj%%J%j%%%J%%
2057Dj%j%%%J%%%%Jj%J%j%j%%J%%%j%%JJ%%%%jj%j%jJJJJjjJ%j%Jj%J%JJ%j%jj%%%Jj%J%%
2046CJ%j%%jJJ%J%%%j%%%%jJ%%%jJ%jJ%%%j%%%%%Jj%%%%%%%J%%j%%%K%jJJJ%%jj%jjJ%J%j
2035DjJ%%j%JJjj%JjjJ%%Jj%%%%J%%JJjjjJ%%%%%%%%jj%jJ%%%J%%j%%J%%%%%j%J%%%J%jj%
2024BJ%%jJj%JJj%%%%%%J%j%%%%%%%%%%j%%jJ%%%%J%%jjJJ%%%%%%J%%%kj%J%%%%%%j%J%%J
$$ plain form
2100 4 3 4 5 4 3 4 4 3 3 4 3 2 3 4 3 2 2 3 2 2 2 1 2 3 3 4 3 3 3 2 2 2 2 1 2 3 3 4 4 4 4 4 4 4 4 5 4 4 3 3 2 2 2 3 2 3 3 3 3 4 2 1 1 1 1 1 3 3 2 3 3
2089 3 3 2 2 2 2 1 1 1 1 2 3 3 3 3 3 3 3 2 2 2 1 2 2 2 2 3 4 4 3 3 2 2 3 3 3 3 2 2 2 1 2 2 2 2 2 2 2 2 2 2 3 3 3 3 2 2 3 3 2 3 3 4 4 4 3 3 3 3 3 3 4
2078 4 4 3 2 2 3 4 3 2 2 2 3 3 4 4 3 3 2 1 1 0 1 2 2 2 2 3 3 2 2 3 3 4 3 3 2 2 2 2 3 2 2 3 2 2 3 3 3 3 2 1 2 4 4 2 2 2 1 1 1 2 2 2 3 2 2 1 2 2 3 4 3
2068 3 2 2 1 2 3 3 4 4 3 3 3 3 3 4 4 4 3 3 2 2 2 3 2 2 2 2 2 2 3 3 3 3 3 3 2 2 2 3 4 3 3 3 2 3 3 3 2 3 4 4 4 3 3 3 3 3 3 3 4 3 3 3 4 4 3 3 3 3 4 4 4
2057 4 3 3 2 2 2 2 3 3 3 3 3 4 3 3 4 4 3 3 2 2 2 3 3 3 3 2 2 2 3 4 4 4 4 4 3 2 2 1 1 0 1 2 3 4 3 2 3 3 2 2 3 2 2 3 3 4 5 5 4 4 3 2 2 2 2 3 2 2 3 3 3
2046 3 4 4 3 3 3 2 3 4 4 5 5 5 5 4 4 4 4 4 3 4 4 4 4 3 4 4 3 4 4 4 4 3 3 3 3 3 3 4 3 3 3 3 3 3 3 3 4 4 4 3 3 3 3 5 5 4 5 6 7 7 7 6 5 5 4 3 4 4 5 5 4
2035 4 3 4 4 4 3 3 4 5 4 3 3 4 3 2 3 3 3 4 3 3 3 3 3 4 4 4 5 6 5 4 3 4 4 4 4 4 4 4 4 4 3 2 2 1 2 2 2 2 3 3 3 2 2 2 3 3 3 3 3 3 2 2 3 3 3 3 4 4 3 2 2
2024 2 3 3 3 2 3 2 2 3 4 3 3 3 3 3 3 3 4 4 3 3 3 3 3 3 3 3 3 3 3 2 2 2 1 2 2 2 2 2 3 3 3 2 1 2 3 3 3 3 3 3 3 4 4 4 4 2 1 1 2 2 2 2 2 2 2 1 1 2 2 2 3
2013CJjj%%%%%J%Jjj%%jJJ%%j%%J%%%%%%%%%j%%J%%%%%jj%%%JJJj%j%%J%j%K%%jj%J%j%%%
2003BJ%Jj%%j%%jJJj%Jj%%J%%%j%%J%%%j%j%%Jj%%J%%%%%j%JJjjJ%JjjJ%JjjJJ%j%%%J%%%
1992C%%%J%Jjj%jJ%J%JJJ%JJJJ%%jjjjjjjj%%%jJ%%%%J%%%%%jJJKJKJJKJjjkjkjjj%%%%j%
1981Dj%J%%j%%%%j%JJj%%%%%J%j%%%%%%%j%%JJ%%%j%jJJ%%%%%j%%%%%%j%JjJ%j%J%%j%%J%
1970CJ%%jj%%%%jJ%J%%j%jJJ%%%%jjjJ%J%%%%%%J%%J%%%j%jJJJ%jk%%%jjJJ%j%J%J%Jjj%%
1959BJ%j%%J%j%%jJJ%J%jj%J%%j%%%Jj%%Jj%%%J%J%%J%jJ%jjjK%Jkjj%%%JJ%%Jj%%%%%%%%
1948Cj%J%J%jjJ%j%j%%J%Jj%%%J%%JjjJ%J%%%%%%j%j%%%%%jJJj%J%%k%%%J%jJJJ%%%jkJJ%
1938C%%Jj%%%jj%%jJ%%jK%%j%J%%J%%%jJ%%j%%J%j%%%%Jj%%J%%JJj%j%j%%%J%%j%%J%%%j%
$$ plain form
2013 3 4 3 2 2 2 2 2 2 3 3 4 3 2 2 2 1 2 3 3 3 2 2 2 3 3 3 3 3 3 3 3 3 3 2 2 2 3 3 3 3 3 3 2 1 1 1 1 2 3 4 3 3 2 2 2 3 3 2 2 4 4 4 3 2 2 3 3 2 2 2 2
2003 2 3 3 4 3 3 3 2 2 2 1 2 3 2 2 3 2 2 2 3 3 3 3 2 2 2 3 3 3 3 2 2 1 1 1 2 1 1 1 2 2 2 2 2 2 1 1 2 3 2 1 2 2 3 2 1 2 2 3 2 1 2 3 3 2 2 2 2 3 3 3 3
1992 3 3 3 3 4 4 5 4 3 3 2 3 3 4 4 5 6 7 7 8 9 10 11 11 11 10 9 8 7 6 5 4 3 3 3 3 2 3 3 3 3 3 4 4 4 4 4 4 3 4 5 7 8 10 11 12 14 15 14 13 11 10 8 7 6 5 5 5 5 5 4 4
1981 4 3 3 4 4 4 3 3 3 3 3 2 2 3 4 3 3 3 3 3 3 4 4 3 3 3 3 3 3 3 3 2 2 2 3 4 4 4 4 3 3 2 3 4 4 4 4 4 4 3 3 3 3 3 3 3 2 2 3 2 3 3 2 2 3 3 3 2 2 2 3 3
1970 3 4 4 4 3 2 2 2 2 2 1 2 2 3 3 3 2 2 1 2 3 3 3 3 3 2 1 0 1 1 2 2 2 2 2 2 2 3 3 3 4 4 4 4 3 3 2 3 4 5 5 4 2 2 2 2 1 0 1 2 2 1 1 2 2 3 3 4 3 2 2 2
1959 2 3 3 2 2 2 3 3 2 2 2 1 2 3 3 4 4 3 2 2 3 3 3 2 2 2 2 3 2 2 2 3 2 2 2 2 3 3 4 4 4 5 5 4 5 5 4 3 2 4 4 5 3 2 1 1 1 1 2 3 3 3 4 3 3 3 3 3 3 3 3 3
1948 3 2 2 3 3 4 4 3 2 3 3 2 2 1 1 1 2 2 3 2 2 2 2 3 3 3 4 3 2 3 3 4 4 4 4 4 4 4 3 3 2 2 2 2 2 2 1 2 3 2 2 3 3 3 1 1 1 1 2 2 1 2 3 4 4 4 4 3 1 2 3 3
1938 3 3 3 4 3 3 3 3 2 1 1 1 0 1 1 1 0 2 2 2 1 1 2 2 2 3 3 3 3 2 3 3 3 2 2 2 3 3 2 2 2 2 2 3 2 2 2 3 3 3 4 5 4 4 3 3 2 2 2 2 3 3 3 2 2 2 3 3 3 3 2 2
1927BJ%%%%%%%j%%%J%%%%j%%jJ%%%%%J%j%%%J%%%Jjj%%JJjj%%J%%%%j%%%J%j%%%%%%%%%%j
1916A%%%J%%Jjj%J%J%jJJ%%jj%%J%%%%%%%%%%%%%%%%%%J%j%%%%jjJ%%J%%%%J%%%%%Jjk%Jj
1905B%JJj%%Jj%%J%%j%%J%J%Jj%%%kJ%%%%%%%%%j%%%%JJkJ%%jJ%%%%j%%%%%j%%%%%JJ%j%J
1894D%jj%jJ%J%j%J%%%%j%%%%J%%%%JjJJjj%%%%%%%j%%%%J%Jjj%%%%%J%j%%%JJj%JjJ%Jj%
1883Djj%j%%%J%J%j%j%J%%J%J%j%%%%J%%j%%%%j%%%%%%%%%%%%%j%KJ%jj%jJJJ%jj%%%%%%J
1873CJj%jJJ%j%%k%KJkj%%J%J%%%%%%%%%%j%%%JJj%%j%%%%J%%%%j%J%%%%%%%%J%JJ%%%%JJ
1862HJjj%%jjj%J%J%jjj%j%%%%%%J%%%%%%%%%%j%%%J%%%%%%J%%%%j%%%%%%%%%j%%JJjjJ%J
1851Dk%%J%JJ%jjj%%%jJ%j%%JJ%jjjJ%Jj%J%%jJ%%J%%jj%%%J%K%%j%%%%j%%Jj%%j%%%%J%%
$$ plain form
1927 2 3 3 3 3 3 3 3 3 2 2 2 2 3 3 3 3 3 2 2 2 1 2 2 2 2 2 2 3 3 2 2 2 2 3 3 3 3 4 3 2 2 2 3 4 3 2 2 2 3 3 3 3 3 2 2 2 2 3 3 2 2 2 2 2 2 2 2 2 2 2 1
1916 1 1 1 1 2 2 2 3 2 1 1 2 2 3 3 2 3 4 4 4 3 2 2 2 3 3 3 3 3 3 3 3 3 3 3 3 3 3 3 3 3 3 3 4 4 3 3 3 3 3 2 1 2 2 2 3 3 3 3 3 4 4 4 4 4 4 5 4 2 2 3 2
1905 2 2 3 4 3 3 3 4 3 3 3 4 4 4 3 3 3 4 4 5 5 6 5 5 5 5 3 4 4 4 4 4 4 4 4 4 4 3 3 3 3 3 4 5 3 4 4 4 3 4 4 4 4 4 3 3 3 3 3 3 2 2 2 2 2 2 3 4 4 3 3 4
1894 4 4 3 2 2 1 2 2 3 3 2 2 3 3 3 3 3 2 2 2 2 2 3 3 3 3 3 4 3 4 5 4 3 3 3 3 3 3 3 3 2 2 2 2 2 3 3 4 3 2 2 2 2 2 2 3 3 2 2 2 2 3 4 3 3 4 3 4 4 5 4 4
1883 4 3 2 2 1 1 1 1 2 2 3 3 2 2 1 1 2 2 2 3 3 4 4 3 3 3 3 3 4 4 4 3 3 3 3 3 2 2 2 2 2 2 2 2 2 2 2 2 2 2 1 1 3 4 4 3 2 2 1 2 3 4 4 3 2 2 2 2 2 2 2 3
1873 3 4 3 3 2 3 4 4 3 3 3 1 1 3 4 2 1 1 1 2 2 3 3 3 3 3 3 3 3 3 3 3 2 2 2 2 3 4 3 3 3 2 2 2 2 2 3 3 3 3 3 2 2 3 3 3 3 3 3 3 3 3 4 4 5 6 6 6 6 6 7 8
1862 8 9 8 7 7 7 6 5 4 4 5 5 6 6 5 4 3 3 2 2 2 2 2 2 2 3 3 3 3 3 3 3 3 3 3 3 2 2 2 2 3 3 3 3 3 3 3 4 4 4 4 4 3 3 3 3 3 3 3 3 3 3 2 2 2 3 4 3 2 3 3 4
1851 4 2 2 2 3 3 4 5 5 4 3 2 2 2 2 1 2 2 1 1 1 2 3 3 2 1 0 1 1 2 1 1 2 2 2 1 2 2 2 3 3 3 2 1 1 1 1 2 2 4 4 4 3 3 3 3 3 2 2 2 3 2 2 2 1 1 1 1 1 2 2 2
1840B%Jj%%%%%%%J%%Jj%J%%%j%%%%j%j%J%J%J%%%jjj%%j%JJJ%j%%%J%jj%JJ%%j%jJ%J%jjJ
1829B%%%%%%%%%Jj%%%j%JJ%%jJ%%%%%%%%%jj%jJ%jJK%%%%%j%jJJ%j%JJ%%j%j%%%%J%Jj%jj
1818A%JJ%%%jj%J%J%j%%%%%%J%%%%%%%%jjJ%%%%J%%%%%%%%jjJ%%J%J%%j%%%%%%j%%%%Jj%%
1808B%%J%j%J%J%j%%J%J%%%jjjJ%%%%%%%jJ%%%%J%%jjJ%%%%%%Jj%j%%%%%%jJ%%J%%%j%J%J
1797Djj%jJ%%Jj%%%%%%J%%j%%jJ%JJ%jj%%%%%%%%J%%%jJ%J%j%j%j%%%JJ%%%j%j%%%JJJjk%
1786AJ%J%jJ%%j%jJ%%%J%%%%%%%%jJ%%%j%jJ%%%J%jj%%J%%%%Jj%J%%%J%j%j%%J%%%%%%j%J
1775CJ%jJj%Jj%jj%%JJ%%%%j%%J%%%j%%%jJ%%%%J%%%%jJ%j%%%JJ%%%j%jJ%%%%jJ%%%%j%Jj
1764BjJ%%%%%%J%jJ%j%%jKJjj%J%%%%j%j%JJj%%J%%%%%%%%%%jjKjJ%%%j%J%Jjj%J%j%%%J%
$$ plain form
1840 2 2 3 2 2 2 2 2 2 2 2 3 3 3 4 3 3 4 4 4 4 3 3 3 3 3 2 2 1 1 2 2 3 3 4 4 4 4 3 2 1 1 1 0 0 1 2 3 3 2 2 2 2 3 3 2 1 1 2 3 3 3 2 2 1 2 2 3 3 2 1 2
1829 2 2 2 2 2 2 2 2 2 2 3 2 2 2 2 1 1 2 3 3 3 2 3 3 3 3 3 3 3 3 3 3 2 1 1 0 1 1 0 1 3 3 3 3 3 3 2 2 1 2 3 3 2 2 3 4 4 4 3 3 2 2 2 2 2 3 3 4 3 3 2 1
1818 1 1 2 3 3 3 3 2 1 1 2 2 3 3 2 2 2 2 2 2 2 3 3 3 3 3 3 3 3 3 2 1 2 2 2 2 2 3 3 3 3 3 3 3 3 3 2 1 2 2 2 3 3 4 4 4 3 3 3 3 3 3 3 2 2 2 2 2 3 2 2 2
1808 2 2 2 3 3 2 2 3 3 4 4 3 3 3 4 4 5 5 5 5 4 3 2 3 3 3 3 3 3 3 3 2 3 3 3 3 3 4 4 4 3 2 3 3 3 3 3 3 3 4 3 3 2 2 2 2 2 2 2 1 2 2 2 3 3 3 3 2 2 3 3 4
1797 4 3 2 2 1 2 2 2 3 2 2 2 2 2 2 2 3 3 3 2 2 2 1 2 2 3 4 4 3 2 2 2 2 2 2 2 2 2 3 3 3 3 2 3 3 4 4 3 3 2 2 1 1 1 1 2 3 3 3 3 2 2 1 1 1 1 2 3 4 3 1 1
1786 1 2 2 3 3 2 3 3 3 2 2 1 2 2 2 2 3 3 3 3 3 3 3 3 3 2 3 3 3 3 2 2 1 2 2 2 2 3 3 2 1 1 1 2 2 2 2 2 3 2 2 3 3 3 3 4 4 3 3 2 2 2 3 3 3 3 3 3 3 2 2 3
1775 3 4 4 3 4 3 3 4 3 3 2 1 1 1 2 3 3 3 3 3 2 2 2 3 3 3 3 2 2 2 2 1 2 2 2 2 2 3 3 3 3 3 2 3 3 2 2 2 2 3 4 4 4 4 3 3 2 3 3 3 3 3 2 3 3 3 3 3 2 2 3 2
1764 2 1 2 2 2 2 2 2 2 3 3 2 3 3 2 2 2 1 3 4 3 2 2 3 3 3 3 3 2 2 1 1 2 3 2 2 2 3 3 3 3 3 3 3 3 3 3 3 2 1 3 2 3 3 3 3 2 2 3 3 4 3 2 2 3 3 2 2 2 2 3 3
1753C%%jJJjj%%%%%%%%%%%%%j%%%%%J%%J%j%%J%%%J%j%j%%jJJ%%jJ%j%%%%%%%J%%%Jj%%j%
1743B%%J%%j%%%%%J%j%%%%%%jJ%J%%%%%%%%%j%JJj%%%%%%Jj%%%%J%%j%j%JJ%%%%%j%j%JJ%
1732DjjJ%%%jjJ%%J%%%%j%%Jj%%jjJ%J%%%%%%%J%jj%%%JJ%%J%%%j%%%jjjJJJ%%%%%%%%%%%
1721C%%%%%jjJ%j%J%JJ%%%%%%%%%J%j%j%j%%%%J%J%%j%%%%j%%%%%JJj%%%jJ%%j%%J%%j%JJ
1710D%%%%%j%%%%%%%J%%j%%%%%%%%jJ%j%%J%%%%%%%j%%%JJ%%jJ%%jJ%Jk%j%%%%%jJJj%%%%
1699BjJ%j%Jj%KJ%%%%%%%jjJ%%%%j%%%J%%%%%J%J%kjJ%j%j%J%J%J%jj%%%%J%j%%J%%%%%%%
1688C%%j%JJ%j%%J%%j%%%%%%%%%%%%%%%JJ%jJ%%jj%j%%%%JKjk%Jj%%%%Jj%%%J%J%kJj%%%%
1678B%%%%J%%%%%jJ%j%J%%Jjj%%J%JJj%j%%jJ%%j%%%J%%%%jJ%%%%%%%Jj%jjJJJjj%%%%%%%
$$ plain form
1753 3 3 3 2 3 4 3 2 2 2 2 2 2 2 2 2 2 2 2 2 2 1 1 1 1 1 1 2 2 2 3 3 2 2 2 3 3 3 3 4 4 3 3 2 2 2 1 2 3 3 3 2 3 3 2 2 2 2 2 2 2 2 3 3 3 3 4 3 3 3 2 2
1743 2 2 2 3 3 3 2 2 2 2 2 2 3 3 2 2 2 2 2 2 2 1 2 2 3 3 3 3 3 3 3 3 3 3 2 2 3 4 3 3 3 3 3 3 3 4 3 3 3 3 3 4 4 4 3 3 2 2 3 4 4 4 4 4 4 3 3 2 2 3 4 4
1732 4 3 2 3 3 3 3 2 1 2 2 2 3 3 3 3 3 2 2 2 3 2 2 2 1 0 1 1 2 2 2 2 2 2 2 2 3 3 2 1 1 1 1 2 3 3 3 4 4 4 4 3 3 3 3 2 1 0 1 2 3 3 3 3 3 3 3 3 3 3 3 3
1721 3 3 3 3 3 3 2 1 2 2 1 1 2 2 3 4 4 4 4 4 4 4 4 4 4 5 5 4 4 3 3 2 2 2 2 2 3 3 4 4 4 3 3 3 3 3 2 2 2 2 2 2 3 4 3 3 3 3 2 3 3 3 2 2 2 3 3 3 2 2 3 4
1710 4 4 4 4 4 4 3 3 3 3 3 3 3 3 4 4 4 3 3 3 3 3 3 3 3 3 2 3 3 2 2 2 3 3 3 3 3 3 3 3 2 2 2 2 3 4 4 4 3 4 4 4 3 4 4 5 3 3 2 2 2 2 2 2 1 2 3 2 2 2 2 2
1699 2 1 2 2 1 1 2 1 1 3 4 4 4 4 4 4 4 4 3 2 3 3 3 3 3 2 2 2 2 3 3 3 3 3 3 4 4 5 5 3 2 3 3 2 2 1 1 2 2 3 3 4 4 3 2 2 2 2 2 3 3 2 2 2 3 3 3 3 3 3 3 3
1688 3 3 3 2 2 3 4 4 3 3 3 4 4 4 3 3 3 3 3 3 3 3 3 3 3 3 3 3 3 3 4 5 5 4 5 5 5 4 3 3 2 2 2 2 2 3 5 4 2 2 3 2 2 2 2 2 3 2 2 2 2 3 3 4 4 2 3 2 2 2 2 2
1678 2 2 2 2 2 3 3 3 3 3 3 2 3 3 2 2 3 3 3 4 3 2 2 2 3 3 4 5 4 4 3 3 3 2 3 3 3 2 2 2 2 3 3 3 3 3 2 3 3 3 3 3 3 3 3 4 3 3 2 1 2 3 4 3 2 2 2 2 2 2 2 2
1667B%%J%j%%%J%%j%%jJ%Jj%j%%J%%%jJ%%%J%%Jj%%%%J%%%%jjJ%j%%j%J%jJJ%%Jj%%%%Jj%
1656CJ%%jJj%J%k%%%J%%j%%j%JJj%%%%%%%Jj%%%JJj%j%Jj%%%%%%%%j%%J%%%%%%%jJ%%%K%%
1645D%j%%%%%%J%%j%%jjJJ%%%j%%J%%%j%%%J%%j%%%%J%J%jj%J%%%j%%%J%%%J%%j%%jJJ%jj
1634BJ%%%%%%%%%%%J%%%%Jj%j%%%%%%%%j%%%%%%%%%%%%%%%J%%jJ%jJJjJ%%%%%%%%j%%%J%%
1623D%J%%%%%%%jj%%%j%%%%J%%%J%jjJ%J%j%%j%%%%%JJ%%Jj%%%jj%%%J%kJ%%J%%%%%%%%j%
1613B%%%Jj%%J%%%%%j%JjJJ%jj%J%%%j%%%%%J%%jj%%%%J%%%%J%j%%%%%jjJ%%%%%J%J%%J%j
1602C%J%jjJ%j%%%%%%%%%%%%%%J%%%j%%%jJ%jjK%%J%J%jj%jJ%%JJj%%j%%jJ%%J%j%JJJj%j
1591Cj%J%%J%jJjj%%%J%Jj%j%Kj%%%%Jj%jJ%%Jjj%%%%%Jj%%Jj%JJj%%%Jj%j%jJJjjJ%J%%%
$$ plain form
1667 2 2 2 3 3 2 2 2 2 3 3 3 2 2 2 1 2 2 3 2 2 1 1 1 2 2 2 2 1 2 2 2 2 3 3 3 4 3 3 3 3 3 4 4 4 4 4 3 2 3 3 2 2 2 1 1 2 2 1 2 3 3 3 4 3 3 3 3 3 4 3 3
1656 3 4 4 4 3 4 3 3 4 4 2 2 2 2 3 3 3 2 2 2 1 1 2 3 2 2 2 2 2 2 2 2 3 2 2 2 2 3 4 3 3 2 2 3 2 2 2 2 2 2 2 2 2 1 1 1 2 2 2 2 2 2 2 2 1 2 2 2 2 4 4 4
1645 4 4 3 3 3 3 3 3 3 4 4 4 3 3 3 2 1 2 3 3 3 3 2 2 2 3 3 3 3 2 2 2 2 3 3 3 2 2 2 2 2 3 3 4 4 3 2 2 3 3 3 3 2 2 2 2 3 3 3 3 4 4 4 3 3 3 2 3 4 4 3 2
1634 2 3 3 3 3 3 3 3 3 3 3 3 3 4 4 4 4 4 5 4 4 3 3 3 3 3 3 3 3 3 2 2 2 2 2 2 2 2 2 2 2 2 2 2 2 2 3 3 3 2 3 3 2 3 4 3 4 4 4 4 4 4 4 4 4 3 3 3 3 4 4 4
1623 4 4 5 5 5 5 5 5 5 5 4 3 3 3 3 2 2 2 2 2 3 3 3 3 4 4 3 2 3 3 4 4 3 3 3 2 2 2 2 2 2 3 4 4 4 5 4 4 4 4 3 2 2 2 2 3 3 1 2 2 2 3 3 3 3 3 3 3 3 3 2 2
1613 2 2 2 2 3 2 2 2 3 3 3 3 3 3 2 2 3 2 3 4 4 3 2 2 3 3 3 3 2 2 2 2 2 2 3 3 3 2 1 1 1 1 1 2 2 2 2 2 3 3 2 2 2 2 2 2 1 0 1 1 1 1 1 1 2 2 3 3 3 4 4 3
1602 3 3 4 4 3 2 3 3 2 2 2 2 2 2 2 2 2 2 2 2 2 2 2 3 3 3 3 2 2 2 2 1 2 2 1 0 2 2 2 3 3 4 4 3 2 2 1 2 2 2 3 4 3 3 3 2 2 2 1 2 2 2 3 3 2 2 3 4 5 4 4 3
1591 3 2 2 3 3 3 4 4 3 4 3 2 2 2 2 3 3 4 3 3 2 2 4 3 3 3 3 3 4 3 3 2 3 3 3 4 3 2 2 2 2 2 2 3 2 2 2 3 2 2 3 4 3 3 3 3 4 3 3 2 2 1 2 3 2 1 2 2 3 3 3 3
1580C%%%j%J%%%%%j%%%J%%%%jjJ%%%%%%%%%%%%%J%%j%JJ%jJ%j%j%jJ%J%%Jj%jjJJ%jjjJ%%
1569A%JJ%%%j%%j%%%%JJj%J%%jjJ%Jk%JJj%J%%%%%%JjjjJK%%%%j%%%%%%%%%j%j%%%%J%j%%
1558A%%JJ%Jj%%j%J%j%%%%%JJj%%jJJ%j%%jJ%%%j%J%%%%%%%%Jj%j%%%J%%%%%J%%%j%%J%%J
1548Ej%%j%jj%J%J%J%%%%jj%%%%%Jj%%J%jJ%%%%%%J%j%%%jJ%%%%J%%%j%j%%%%%K%j%%%%jj
1537A%%JJ%Jj%jJJ%j%%%%%j%%%J%%j%%%%Jj%JJj%J%%jj%%jj%%JJ%jJ%%%%J%%%%%Jj%j%%%%
1526B%%J%%%%%%%j%%%%J%jJj%%%%J%jJ%J%jj%%J%%%j%JjJ%jJ%%%%%%%%%jjjJ%J%jJJ%j%%%
1515B%J%J%jkJ%jJJJ%%%j%%%%%%%jjJ%%%J%%%%%%Jjj%j%%JJjjJ%J%%%%j%%%%%%%%%%J%%%J
1504D%%Jjjj%%%%J%JjJjjJ%%%%%j%%JjJJj%Jj%%%%jJ%j%%Jj%%%%%%%%%%JJ%%%%j%j%%j%JJ
$$ plain form
1580 3 3 3 3 2 2 3 3 3 3 3 3 2 2 2 2 3 3 3 3 3 2 1 2 2 2 2 2 2 2 2 2 2 2 2 2 2 3 3 3 2 2 3 4 4 3 4 4 3 3 2 2 1 2 2 3 3 3 4 3 3 2 1 2 3 3 2 1 0 1 1 1
1569 1 1 2 3 3 3 3 2 2 2 1 1 1 1 1 2 3 2 2 3 3 3 2 1 2 2 3 1 1 2 3 2 2 3 3 3 3 3 3 3 4 3 2 1 2 4 4 4 4 4 3 3 3 3 3 3 3 3 3 3 2 2 1 1 1 1 1 2 2 1 1 1
1558 1 1 1 2 3 3 4 3 3 3 2 2 3 3 2 2 2 2 2 2 3 4 3 3 3 2 3 4 4 3 3 3 2 3 3 3 3 2 2 3 3 3 3 3 3 3 3 3 4 3 3 2 2 2 2 3 3 3 3 3 3 4 4 4 4 3 3 3 4 4 4 5
1548 5 4 4 4 3 3 2 1 1 2 2 3 3 4 4 4 4 4 3 2 2 2 2 2 2 3 2 2 2 3 3 2 3 3 3 3 3 3 3 4 4 3 3 3 3 2 3 3 3 3 3 4 4 4 4 3 3 2 2 2 2 2 2 4 4 3 3 3 3 3 2 1
1537 1 1 1 2 3 3 4 3 3 2 3 4 4 3 3 3 3 3 3 2 2 2 2 3 3 3 2 2 2 2 2 3 2 2 3 4 3 3 4 4 4 3 2 2 2 1 0 0 0 1 2 2 1 2 2 2 2 2 3 3 3 3 3 3 4 3 3 2 2 2 2 2
1526 2 2 2 3 3 3 3 3 3 3 3 2 2 2 2 2 3 3 2 3 2 2 2 2 2 3 3 2 3 3 4 4 3 2 2 2 3 3 3 3 2 2 3 2 3 3 2 3 3 3 3 3 3 3 3 3 3 2 1 0 1 1 2 2 1 2 3 3 2 2 2 2
1515 2 2 3 3 4 4 3 1 2 2 1 2 3 4 4 4 4 3 3 3 3 3 3 3 3 2 1 2 2 2 2 3 3 3 3 3 3 3 4 3 2 2 1 1 1 2 3 2 1 2 2 3 3 3 3 3 2 2 2 2 2 2 2 2 2 2 2 3 3 3 3 4
1504 4 4 4 5 4 3 2 2 2 2 2 3 3 4 3 4 3 2 3 3 3 3 3 3 2 2 2 3 2 3 4 3 3 4 3 3 3 3 3 2 3 3 2 2 2 3 2 2 2 2 2 2 2 2 2 2 2 3 4 4 4 4 4 3 3 2 2 2 1 1 2 3
1493CJ%%%%%j%%%%Jj%%j%%%JJjj%%%%%JJj%jj%%JjJ%%%J%%jjJj%JJ%%%%%%%Jj%%%%%JJ%J%
1483F%%%JkjJjj%%%J%%%jj%%%%%%%%J%j%%%%%jJ%%%%J%%%%%j%jJ%JkJ%KJ%jJ%j%j%j%J%%j
1472B%jJ%%J%%%%%j%%%J%j%Jj%%J%j%jJ%%%%%%%%J%%%%j%%%J%%J%j%%%%%j%%JJ%j%jjJJ%%
1461CjJ%%jJJjj%jJJ%%%%J%j%%%%%%jJ%%%%%%%%j%%%J%k%J%%%%%%J%j%%%K%jj%J%%j%j%JJ
1450C%%%%J%j%%j%Jj%jJ%%%%%%%%%%J%J%%%jj%J%%jj%%J%%%%%J%%%%%%%j%%%%J%%%J%%%jJ
1439D%%%j%J%%%%%kJ%%j%%J%%%jJ%%%%%%%%jJ%%J%j%%%%%jJ%%j%%J%%jjJ%%J%jj%jJJJJ%%
1428D%%%j%j%J%%%jJ%%%j%%J%J%%J%%JKK%kkj%jjJJ%%j%%%J%%%%%%%J%KKLLLLLjmnlkk%j%
1418Gjj%%%j%%%%j%%j%%J%%%%j%%%%%%%%%%%%%%JJjj%%J%%%j%%j%%%J%J%%j%%J%jJ%j%J%%
$$ plain form
1493 3 4 4 4 4 4 4 3 3 3 3 3 4 3 3 3 2 2 2 2 3 4 3 2 2 2 2 2 2 3 4 3 3 2 1 1 1 2 1 2 2 2 2 3 3 3 2 1 2 1 1 2 3 3 3 3 3 3 3 3 4 3 3 3 3 3 3 4 5 5 6 6
1483 6 6 6 6 7 5 4 5 4 3 3 3 3 4 4 4 4 3 2 2 2 2 2 2 2 2 2 3 3 2 2 2 2 2 2 1 2 2 2 2 2 3 3 3 3 3 3 2 2 1 2 2 3 1 2 2 4 5 5 4 5 5 4 4 3 3 2 2 3 3 3 2
1472 2 2 1 2 2 2 3 3 3 3 3 3 2 2 2 2 3 3 2 2 3 2 2 2 3 3 2 2 1 2 2 2 2 2 2 2 2 2 3 3 3 3 3 2 2 2 2 3 3 3 4 4 3 3 3 3 3 3 2 2 2 3 4 4 3 3 2 1 2 3 3 3
1461 3 2 3 3 3 2 3 4 3 2 2 1 2 3 3 3 3 3 4 4 3 3 3 3 3 3 3 2 3 3 3 3 3 3 3 3 3 2 2 2 2 3 3 1 1 2 2 2 2 2 2 2 3 3 2 2 2 2 4 4 3 2 2 3 3 3 2 2 1 1 2 3
1450 3 3 3 3 3 4 4 3 3 3 2 2 3 2 2 1 2 2 2 2 2 2 2 2 2 2 2 3 3 4 4 4 4 3 2 2 3 3 3 2 1 1 1 2 2 2 2 2 2 3 3 3 3 3 3 3 3 2 2 2 2 2 3 3 3 3 4 4 4 4 3 4
1439 4 4 4 4 3 3 4 4 4 4 4 4 2 3 3 3 2 2 2 3 3 3 3 2 3 3 3 3 3 3 3 3 3 2 3 3 3 4 4 3 3 3 3 3 3 2 3 3 3 2 2 2 3 3 3 2 1 2 2 2 3 3 2 1 1 0 1 2 3 4 4 4
1428 4 4 4 4 3 3 2 2 3 3 3 3 2 3 3 3 3 2 2 2 3 3 4 4 4 5 5 5 6 8 10 10 8 6 5 5 4 3 4 5 5 5 4 4 4 4 5 5 5 5 5 5 5 5 6 6 8 10 13 16 19 22 25 24 20 15 12 10 8 8 7 7
1418 7 6 5 5 5 5 4 4 4 4 4 3 3 3 2 2 2 3 3 3 3 3 2 2 2 2 2 2 2 2 2 2 2 2 2 2 2 3 4 3 2 2 2 3 3 3 3 2 2 2 1 1 1 1 2 2 3 3 3 2 2 2 3 3 2 3 3 2 2 3 3 3
1407CJ%JJj%%%%jkJJjjJ%%%j%%%%%j%%%%jJJ%%%%J%Jj%%%%%%j%%JJ%%%jj%%%%%%jJ%%J%Jj
1396C%%Jj%%%%%%%%%j%J%%jj%%%%J%J%%%%Jjj%%J%jJ%J%%%%%j%%Jj%%%j%J%%Jj%%%%%%Jj%
1385C%j%%J%%%j%%%%J%J%%%%%j%%J%%%%%jj%%%%JJ%J%j%%j%%J%%j%%%J%%j%J%%J%%j%%%j%
1374CjJ%%%%J%%JJjJ%J%Jjjj%jj%J%j%%%j%%J%j%J%%%j%J%%%%%%JjjJK%%jjJjk%J%j%J%JJ
1363D%%%J%J%j%jj%J%j%%Jjj%%%%%%%J%%jj%%JJ%%%Jj%j%%%%J%J%%%j%%%%%%%jJ%%%%j%%K
1353D%k%jJJ%%%%Jj%%%J%j%%%%J%%k%JJ%j%%j%%%%%%%%J%%j%%%Jj%JJjj%%J%J%%jj%%J%%%
1342C%%%j%jJJ%j%JJj%%%%%Jj%j%J%J%jJ%%j%%%jJj%J%%J%%%j%%%%%%%%%%Jjj%%%%%j%JJJ
1331DJj%%%%%%%jjJ%%%%%j%%%JJjjJ%%%J%j%%Jj%%%j%%%J%j%%J%%%%j%%%J%%%%%J%j%%J%%
$$ plain form
1407 3 4 4 5 6 5 5 5 5 5 4 2 3 4 3 2 3 3 3 3 2 2 2 2 2 2 1 1 1 1 1 0 1 2 2 2 2 2 3 3 4 3 3 3 3 3 3 3 2 2 2 3 4 4 4 4 3 2 2 2 2 2 2 2 1 2 2 2 3 3 4 3
1396 3 3 3 4 3 3 3 3 3 3 3 3 3 3 2 2 3 3 3 2 1 1 1 1 1 2 2 3 3 3 3 3 4 3 2 2 2 3 3 2 3 3 4 4 4 4 4 4 3 3 3 4 3 3 3 3 2 2 3 3 3 4 3 3 3 3 3 3 3 4 3 3
1385 3 3 2 2 2 3 3 3 3 2 2 2 2 2 3 3 4 4 4 4 4 4 3 3 3 4 4 4 4 4 4 3 2 2 2 2 2 3 4 4 5 5 4 4 4 3 3 3 4 4 4 3 3 3 3 4 4 4 3 3 4 4 4 5 5 5 4 4 4 4 3 3
1374 3 2 3 3 3 3 3 4 4 4 5 6 5 6 6 7 7 8 7 6 5 5 4 3 3 4 4 3 3 3 3 2 2 2 3 3 2 2 3 3 3 3 2 2 3 3 3 3 3 3 3 4 3 2 3 5 5 5 4 3 4 3 1 1 2 2 1 1 2 2 3 4
1363 4 4 4 4 5 5 6 6 5 5 4 3 3 4 4 3 3 3 4 3 2 2 2 2 2 2 2 2 3 3 3 2 1 1 1 2 3 3 3 3 4 3 3 2 2 2 2 2 3 3 4 4 4 4 3 3 3 3 3 3 3 3 2 3 3 3 3 3 2 2 2 4
1353 4 4 2 2 1 2 3 3 3 3 3 4 3 3 3 3 4 4 3 3 3 3 3 4 4 4 2 2 3 4 4 3 3 3 2 2 2 2 2 2 2 2 2 3 3 3 2 2 2 2 3 2 2 3 4 3 2 2 2 3 3 4 4 4 3 2 2 2 3 3 3 3
1342 3 3 3 3 2 2 1 2 3 3 2 2 3 4 3 3 3 3 3 3 4 3 3 2 2 3 3 4 4 3 4 4 4 3 3 3 3 2 3 2 2 3 3 3 4 4 4 4 3 3 3 3 3 3 3 3 3 3 3 4 3 2 2 2 2 2 2 1 1 2 3 4
1331 4 5 4 4 4 4 4 4 4 4 3 2 3 3 3 3 3 3 2 2 2 2 3 4 3 2 3 3 3 3 4 4 3 3 3 4 3 3 3 3 2 2 2 2 3 3 2 2 2 3 3 3 3 3 2 2 2 2 3 3 3 3 3 3 4 4 3 3 3 4 4 4
1320Dj%%j%%%J%J%%%j%%j%%%%%JJ%jj%%J%Jj%%%j%%%%%%jJJ%j%%%%j%%J%%%%%%JJ%j%jJj%
1309B%%%Jj%%J%%j%%%J%%jjJJJ%%%%%j%%%j%%%%j%J%J%%j%%%J%%%j%J%%%%j%%%%%%%jJ%%%
1298B%%j%%%%%J%%j%%%%J%%%JJj%%%%jJ%%JjjJ%%J%%%jj%%%j%%J%J%%%%%j%J%%jJ%%%JjJ%
1288D%%%jj%%%%%%J%%%%jJ%J%jjJ%J%%j%%jJ%%J%jj%%%%%J%j%%%J%%%%%jJ%jJ%%Jj%%%jJJ
1277Dj%j%%%J%%%%%%%%%%%jj%JJ%%%%%J%%j%j%%%Jk%JJ%j%JJj%%%%%j%jJJ%J%j%j%j%%%J%
1266B%J%%%%%jJJj%%Jjj%%%Jj%%%%%J%Jj%%%%%%j%%%%%KJjj%%%%J%%j%%%%jJ%%J%%j%%%J%
1255D%j%%%%J%%%%%j%j%%%%J%%j%%jJ%%J%%%%J%%%JJjjJ%%j%%J%J%J%%jk%JjjJjj%%%JJ%j
1244CJ%jJJ%jjJ%%j%%Jj%%j%J%%%JJ%j%jj%JJ%j%Jj%jJ%j%%Jj%%%%Jj%%%J%%jJJ%%jJj%j%
$$ plain form
1320 4 3 3 3 2 2 2 2 3 3 4 4 4 4 3 3 3 2 2 2 2 2 2 3 4 4 3 2 2 2 3 3 4 3 3 3 3 2 2 2 2 2 2 2 1 2 3 3 2 2 2 2 2 1 1 1 2 2 2 2 2 2 2 3 4 4 3 3 2 3 2 2
1309 2 2 2 2 3 2 2 2 3 3 3 2 2 2 2 3 3 3 2 1 2 3 4 4 4 4 4 4 3 3 3 3 2 2 2 2 2 1 1 2 2 3 3 3 2 2 2 2 3 3 3 3 2 2 3 3 3 3 3 2 2 2 2 2 2 2 2 1 2 2 2 2
1298 2 2 2 1 1 1 1 1 1 2 2 2 1 1 1 1 1 2 2 2 2 3 4 3 3 3 3 3 2 3 3 3 4 3 2 3 3 3 4 4 4 4 3 2 2 2 2 1 1 1 2 2 3 3 3 3 3 3 2 2 3 3 3 2 3 3 3 3 4 3 4 4
1288 4 4 4 4 3 2 2 2 2 2 2 2 3 3 3 3 3 2 3 3 4 4 3 2 3 3 4 4 4 3 3 3 2 3 3 3 4 4 3 2 2 2 2 2 2 3 3 2 2 2 2 3 3 3 3 3 3 2 3 3 2 3 3 3 4 3 3 3 3 2 3 4
1277 4 3 3 2 2 2 2 3 3 3 3 3 3 3 3 3 3 3 3 2 1 1 2 3 3 3 3 3 3 4 4 4 3 3 2 2 2 2 3 1 1 2 3 3 2 2 3 4 3 3 3 3 3 3 2 2 1 2 3 3 4 4 3 3 2 2 1 1 1 1 2 2
1266 2 2 3 3 3 3 3 3 2 3 4 3 3 3 4 3 2 2 2 2 3 2 2 2 2 2 2 3 3 4 3 3 3 3 3 3 3 2 2 2 2 2 2 4 5 4 3 3 3 3 3 4 4 4 3 3 3 3 3 2 3 3 3 4 4 4 3 3 3 3 4 4
1255 4 4 3 3 3 3 3 4 4 4 4 4 4 3 3 2 2 2 2 2 3 3 3 2 2 2 1 2 2 2 3 3 3 3 3 4 4 4 4 5 6 5 4 5 5 5 4 4 4 5 5 6 6 7 7 7 6 4 4 5 4 3 4 3 2 2 2 2 3 4 4 3
1244 3 4 4 3 4 5 5 4 3 4 4 4 3 3 3 4 3 3 3 2 2 3 3 3 3 4 5 5 4 4 3 2 2 3 4 4 3 3 4 3 3 2 3 3 2 2 2 3 2 2 2 2 2 3 2 2 2 2 3 3 3 2 3 4 4 4 3 4 3 3 2 2
1233B%%%%%J%%%%j%%j%%J%%JJ%%%jj%%%JJ%JJj%%j%%%%%%%j%%J%jJ%j%%%%%%%J%%jj%%%J%
1223Cj%J%j%jj%%J%%J%%jJ%%%jJ%%%%jJJ%jJj%%%JJJ%j%%%%%%%j%%%%%%J%jj%J%%%j%%JJ%
1212D%%%j%j%%%J%j%%%J%j%J%%%%%%j%%%%jJ%JJ%jj%%%J%%%%%Jj%%%jJ%%%%%j%%%%%%J%Jj
1201C%%j%%%j%j%JJJ%%%%JJjjjjJ%Jjk%J%J%%J%%%%%J%j%%k%KjJJ%j%%%J%%j%%jj%JK%%j%
1190CJ%%JjjjJ%%%%jJJjjJ%%%%%J%jjjJ%%%%%%%%jJ%%J%%%%j%%%j%JJ%%J%%%jj%J%%%%%J%
1179Dj%%%%%J%%jj%%%%%%%%%J%jJ%%j%%JJ%jj%JJ%%%%j%%Jj%%J%%jjJ%%%%%j%%%%%%%%J%J
1168Dj%J%%j%%%%%%%%JJjj%%%%j%%J%%%%%j%%%%jJKj%%%j%%J%j%%%%%jJJ%%j%%%%JJj%%%%
1158C%JJj%%%j%%j%J%jJJj%%%%%%%jj%%J%%jJ%J%j%jJ%Jj%J%j%J%J%%%jj%%%J%J%%j%J%j%
$$ plain form
1233 2 2 2 2 2 2 3 3 3 3 3 2 2 2 1 1 1 2 2 2 3 4 4 4 4 3 2 2 2 2 3 4 4 5 6 5 5 5 4 4 4 4 4 4 4 4 3 3 3 4 4 3 4 4 3 3 3 3 3 3 3 3 4 4 4 3 2 2 2 2 3 3
1223 3 2 2 3 3 2 2 1 0 0 0 1 1 1 2 2 2 1 2 2 2 2 1 2 2 2 2 2 1 2 3 3 2 3 2 2 2 2 3 4 5 5 4 4 4 4 4 4 4 4 3 3 3 3 3 3 3 4 4 3 2 2 3 3 3 3 2 2 2 3 4 4
1212 4 4 4 4 3 3 2 2 2 2 3 3 2 2 2 2 3 3 2 2 3 3 3 3 3 3 3 2 2 2 2 2 1 2 2 3 4 4 3 2 2 2 2 3 3 3 3 3 3 4 3 3 3 3 2 3 3 3 3 3 3 2 2 2 2 2 2 2 3 3 4 3
1201 3 3 3 2 2 2 2 1 1 0 0 1 2 3 3 3 3 3 4 5 4 3 2 1 2 2 3 2 0 0 1 1 2 2 2 3 3 3 3 3 3 4 4 3 3 3 1 1 3 2 3 4 4 3 3 3 3 4 4 4 3 3 3 2 1 1 2 4 4 4 3 3
1190 3 4 4 4 5 4 3 2 3 3 3 3 3 2 3 4 3 2 3 3 3 3 3 3 4 4 3 2 1 2 2 2 2 2 2 2 2 2 1 2 2 2 3 3 3 3 3 2 2 2 2 1 1 2 3 3 3 4 4 4 4 3 2 2 3 3 3 3 3 3 4 4
1179 4 3 3 3 3 3 3 4 4 4 3 2 2 2 2 2 2 2 2 2 2 3 3 2 3 3 3 2 2 2 3 4 4 3 2 2 3 4 4 4 4 4 3 3 3 4 3 3 3 4 4 4 3 2 3 3 3 3 3 3 2 2 2 2 2 2 2 2 2 3 3 4
1168 4 3 3 4 4 4 3 3 3 3 3 3 3 3 3 4 5 4 3 3 3 3 3 2 2 2 3 3 3 3 3 3 2 2 2 2 2 1 2 4 3 3 3 3 2 2 2 3 3 2 2 2 2 2 2 1 2 3 3 3 2 2 2 2 2 3 4 3 3 3 3 3
1158 3 3 4 5 4 4 4 4 3 3 3 2 2 3 3 2 3 4 3 3 3 3 3 3 3 3 2 1 1 1 2 2 2 1 2 2 3 3 2 2 1 2 2 3 2 2 3 3 2 2 3 3 4 4 4 4 3 2 2 2 2 3 3 4 4 4 3 3 4 4 3 3
1147Cj%%%%%%%J%%%%%%%%%J%j%j%JK%j%j%%%%%%%%%j%jJJ%%%%%j%%JJj%j%%J%%jj%%%J%Jj
1136B%%j%%J%%J%J%%%J%j%%j%j%J%%j%jJJJ%j%%j%Jj%j%%%JJ%Jj%j%%jKJj%%%JJ%JJ%kj%%
1125D%Jjj%jj%JJ%%%%j%%%%%%J%j%%jJ%jJ%%%%%jJ%%%Jj%%JJj%%%%%%%%%J%%j%%%J%%%%%%
1114D%%%jJ%j%%%j%J%%%J%j%J%%%%%j%%jj%%%JJJjj%%%%%%%%Kj%%jJJJj%j%%%j%%jJ%%J%%
1103CJjjJ%%%%jjJ%%%%%J%j%jJ%JJj%%%%%jJJ%%J%Jk%%%%%%jj%jJJ%%%%j%J%%%%%%jJ%%%%
1093C%%j%%%%JJjj%%%%J%%%J%%%%Jjj%%%Jj%%%%%J%%jJ%%j%%j%JJ%%jjJ%%j%%%%%%%%%%J%
1082C%%jj%%J%J%%J%%%%%%jj%%%%%J%Jj%%%%%%Jj%%%%jJJ%%J%Jjj%%%%%%j%%%jJJ%%%%%%j
1071Cj%%%jJJJ%Jj%%J%%j%J%%%%%%J%%%%%jJ%%J%%%%%%%%JJJKJKLMOQRPlqqnmjk%%jJKLLL
$$ plain form
1147 3 2 2 2 2 2 2 2 2 3 3 3 3 3 3 3 3 3 3 4 4 3 3 2 2 3 5 5 4 4 3 3 3 3 3 3 3 3 3 3 2 2 1 2 3 3 3 3 3 3 2 2 2 3 4 3 3 2 2 2 3 3 3 2 1 1 1 1 2 2 3 2
1136 2 2 2 1 1 1 2 2 2 3 3 4 4 4 4 5 5 4 4 4 3 3 2 2 3 3 3 2 2 1 2 3 4 4 3 3 3 2 2 3 2 2 1 1 1 1 2 3 3 4 3 3 2 2 2 1 3 4 3 3 3 3 4 5 5 6 7 7 5 4 4 4
1125 4 4 5 4 3 3 2 1 1 2 3 3 3 3 3 2 2 2 2 2 2 2 3 3 2 2 2 1 2 2 1 2 2 2 2 2 2 1 2 2 2 2 3 2 2 2 3 4 3 3 3 3 3 3 3 3 3 3 4 4 4 3 3 3 3 4 4 4 4 4 4 4
1114 4 4 4 4 3 4 4 3 3 3 3 2 2 3 3 3 3 4 4 3 3 4 4 4 4 4 4 3 3 3 2 1 1 1 1 2 3 4 3 2 2 2 2 2 2 2 2 2 4 3 3 3 2 3 4 5 4 4 3 3 3 3 2 2 2 1 2 2 2 3 3 3
1103 3 4 3 2 3 3 3 3 3 2 1 2 2 2 2 2 2 3 3 2 2 1 2 2 3 4 3 3 3 3 3 3 2 3 4 4 4 5 5 6 4 4 4 4 4 4 4 3 2 2 1 2 3 3 3 3 3 2 2 3 3 3 3 3 3 3 2 3 3 3 3 3
1093 3 3 3 2 2 2 2 2 3 4 3 2 2 2 2 2 3 3 3 3 4 4 4 4 4 5 4 3 3 3 3 4 3 3 3 3 3 3 4 4 4 3 4 4 4 3 3 3 2 2 3 4 4 4 3 2 3 3 3 2 2 2 2 2 2 2 2 2 2 2 3 3
1082 3 3 3 2 1 1 1 2 2 3 3 3 4 4 4 4 4 4 4 3 2 2 2 2 2 2 3 3 4 3 3 3 3 3 3 3 4 3 3 3 3 3 2 3 4 4 4 5 5 6 5 4 4 4 4 4 4 4 3 3 3 3 2 3 4 4 4 4 4 4 4 3
1071 3 2 2 2 2 1 2 3 4 4 5 4 4 4 5 5 5 4 4 5 5 5 5 5 5 5 6 6 6 6 6 6 5 6 6 6 7 7 7 7 7 7 7 7 7 8 9 10 12 13 15 18 22 28 36 45 52 49 41 33 28 24 23 21 21 21 20 21 23 26 29 32
1060C2MMNRJ1J6K4L4M6O4Q5J04J18O0q5j28r9o8m7l7k9k5k1j6j3rqmmlkljk%jj%j%J%%%jj
1053H%j%%j%J%K%JJJjjj%jjj%%jJJJjK%Jjj%%jj%%%J%j%%%J%j%%%j%%Jj%%%%%jJ%J%%J%%j
1042F%%j%%%%%%%j%%J%%%%j%J%%j%j%%%%%JJ%%%%J%j%JJjJj%%j%%%%%Jj%%%%j%J%%%j%%%%
1031D%%JJJj%j%J%%jjJ%%J%%%jjJjj%j%%J%J%%%j%%jJ%J%%%jJ%%%%%%%%%%Jjj%%%%%%jJ%J
1021D%%%%%%%%%JjjJ%%J%j%%J%jj%%J%%J%j%jJ%%%J%%jj%%%%Jj%%%%jJJ%%%Jj%%%%%j%Jj%
1010C%J%J%j%j%JJj%Jj%%%J%J%J%J%j%j%jKJ%%%jjJ%%%%JjjJ%j%%%%%%Jjj%%J%jJ%JJj%jJ
999G%J%%%%J%J%J%%%%jjJ%%JJJ%JJ%%J%J%J%%KK%JJJKJKKMLMMMLQJ0J4J7K3L0M3N6P0Q2Q0
989D87K4n6p6o1m0k4j0jJ1K4M4O8R6J27J54J59P7r7j64j39r6o4l8j9JK3N0Q8J28J74K16K32
$$ plain form
1060 32 36 40 45 54 65 81 105 139 185 249 334 438 556 616 531 403 304 236 189 152 123 98 77 61 48 39 31 27 23 20 18 15 14 12 12 11 10 10 9 9 10 10 10 10 9 8
1053 8 8 7 7 7 6 6 7 7 9 9 10 11 12 11 10 9 9 8 7 6 6 6 5 6 7 8 7 9 9 10 9 8 8 8 7 6 6 6 6 7 7 6 6 6 6 7 7 6 6 6 6 5 5 5 6 5 5 5 5 5 5 4 5 5 6 6 6 7 7 7 6
1042 6 6 6 5 5 5 5 5 5 5 5 4 4 4 5 5 5 5 5 4 4 5 5 5 4 4 3 3 3 3 3 3 4 5 5 5 5 5 6 6 5 5 6 7 6 7 6 6 6 5 5 5 5 5 5 6 5 5 5 5 5 4 4 5 5 5 5 4 4 4 4 4
1031 4 4 4 5 6 7 6 6 5 5 6 6 6 5 4 5 5 5 6 6 6 6 5 4 5 4 3 3 2 2 2 3 3 4 4 4 4 3 3 3 2 3 3 4 4 4 4 3 4 4 4 4 4 4 4 4 4 4 4 5 4 3 3 3 3 3 3 3 2 3 3 4
1021 4 4 4 4 4 4 4 4 4 4 5 4 3 4 4 4 5 5 4 4 4 5 5 4 3 3 3 4 4 4 5 5 4 4 3 4 4 4 4 5 5 5 4 3 3 3 3 3 4 3 3 3 3 3 2 3 4 4 4 4 5 4 4 4 4 4 4 3 3 4 3 3
1010 3 3 4 4 5 5 4 4 3 3 4 5 4 4 5 4 4 4 4 5 5 6 6 7 7 8 8 7 7 6 6 5 7 8 8 8 8 7 6 7 7 7 7 7 8 7 6 7 7 6 6 6 6 6 6 6 7 6 5 5 5 6 6 5 6 6 7 8 7 7 6 7
999 7 7 8 8 8 8 8 9 9 10 10 11 11 11 11 11 10 9 10 10 10 11 12 13 13 14 15 15 15 16 16 17 17 18 18 18 20 22 22 23 24 25 27 28 30 32 36 39 43 47 51 54 62 72 86 103 126 156 199 255 325 407 487
989 487 511 455 379 318 278 254 244 243 254 278 322 390 486 613 767 926 1003 906 742 603 507 443 405 386 387 410 460 548 676 850 1066 1298
985A298J51j00k53k30j67j15q2n8l9k0ML2O3R7J29J49J17l6j65j65j23q7o2m6l4k3j1OK3L9
980B92N8P0O3jp5q7o9n1l7k9k6k2j7j4j0pomkkkkkjkkljj%%jJ%J%%%%%jjj%j%jJ%%%jj%Jj
971C%%%%jJJJjj%jJJ%j%%jJkJ%JKjj%%%J%%j%%%%jJ%%j%%K%j%%J%J%jjj%J%%j%J%%%%Jj%%
960C%jjJK%J%jj%%%j%%Jj%%%Jjj%%%%jJ%J%JjjJJ%%%%jjJJ%%%%%%%%%%J%%j%jJ%j%j%%%jJ
949AJj%J%%%%%%%J%%%JjJj%J%%%%%%%%%%%J%Jjj%j%%%%J%jj%jJ%J%%%%%jjJ%%%J%%%%%%J%
938D%%%%j%%JJj%%jJJj%J%%jj%%%%J%k%%%jJ%J%k%J%J%j%JJ%%jj%%%%J%J%Jjj%J%%%%%%%j
928C%%jjKJ%j%%%%%j%%jJJ%j%%J%kJ%%%%JJ%%j%%%%%%JJJj%j%%%%%%%%JJJJJjjjj%%%%%J%
917F%%KKJjjkjj%%%%%%%JJ%J%j%%jj%j%%%%J%JJ%jkj%%%%%%%%%j%j%JKjjJJ%%%%j%jJ%J%J
$$ plain form
985 1298 1449 1349 1096 866 699 584 502 444 405 385 389 421 484 581 710 859 976 940 775 610 487 400 338 292 258 235 224 230 253 292
980 292 350 420 483 482 407 320 251 200 163 134 108 86 69 55 45 38 32 28 26 24 22 20 18 17 15 13 10 9 8 8 8 7 8 8 9 9 9 9 9 9 8 7 6 6 5 5 4 5 5 5 5 4 3 3 4 3
971 3 3 3 3 3 2 3 4 5 4 3 3 2 3 4 4 3 3 3 2 3 1 2 2 3 5 4 3 3 3 3 4 4 4 3 3 3 3 3 2 3 3 3 2 2 2 4 4 3 3 3 4 4 5 5 4 3 2 2 3 3 3 2 2 3 3 3 3 3 4 3 3 3
960 3 3 2 1 2 4 4 5 5 4 3 3 3 3 2 2 2 3 2 2 2 2 3 2 1 1 1 1 1 0 1 1 2 2 3 2 1 2 3 3 3 3 3 2 1 2 3 3 3 3 3 3 3 3 3 3 3 4 4 4 3 3 2 3 3 2 2 1 1 1 1 0 1
949 1 2 1 1 2 2 2 2 2 2 2 2 3 3 3 3 4 3 4 3 3 4 4 4 4 4 4 4 4 4 4 4 4 5 5 6 5 4 4 3 3 3 3 3 4 4 3 2 2 1 2 2 3 3 3 3 3 3 2 1 2 2 2 2 3 3 3 3 3 3 3 4 4
938 4 4 4 4 4 3 3 3 4 5 4 4 4 3 4 5 4 4 5 5 5 4 3 3 3 3 3 4 4 2 2 2 2 1 2 2 3 3 1 1 2 2 3 3 2 2 3 4 4 4 3 2 2 2 2 2 3 3 4 4 5 4 3 3 4 4 4 4 4 4 4 4 3
928 3 3 3 2 1 3 4 4 3 3 3 3 3 3 2 2 2 1 2 3 3 2 2 2 3 3 1 2 2 2 2 2 3 4 4 4 3 3 3 3 3 3 3 4 5 6 5 5 4 4 4 4 4 4 4 4 4 5 6 7 8 9 8 7 6 5 5 5 5 5 5 6 6
917 6 6 6 8 10 11 10 9 7 6 5 5 5 5 5 5 5 5 6 7 7 8 8 7 7 7 6 5 5 4 4 4 4 4 5 5 6 7 7 6 4 3 3 3 3 3 3 3 3 3 3 2 2 1 1 2 4 3 2 3 4 4 4 4 4 3 3 2 3 3 4 4 5
906E%%%%j%%%jj%%%J%%%Kjj%%%J%jjjJ%%J%%%%%%jjJJj%%%%J%%%%%%%%%J%%j%%J%%j%%J%%
895Dj%%%%%Jj%%JJj%%J%j%%%j%%%%%j%%JJ%j%%j%%%J%j%%j%%jKJ%%J%j%%%J%%%jj%%JJ%%j
884C%%%%%%J%j%j%Jj%J%j%jJJj%%JJ%%jjJ%%%%jJJj%j%jjKJ%J%%%j%%%%%%Jj%%%%%J%%jjJ
873C%%j%J%%%jJ%%j%%%j%%%J%%%%J%%J%%%jJ%%%j%%%%jjJJ%%%j%%K%k%jJ%JJ%j%jJ%%jJ%J
862Dj%JJ%k%%Jj%%%%Jj%j%%%JJ%%%%j%%%%jJ%%J%%%j%j%%JJj%jJJ%%%%%j%j%%J%%%JJj%%%
851D%%j%%jJJ%J%%j%%%%%%%J%j%j%%%jJ%%J%%%%%%%%%%%%%%%%%%%%%j%Jj%%J%%%%%%%%%jJ
840D%%%%%jJ%jJ%j%%JKjJj%J%j%%jj%%%%%JJ%jJ%%%%%%%jjj%%%KKj%jJ%%%j%j%jJJJJ%%jj
829Dj%J%%J%%j%%jJJJj%j%%%%%jj%%j%%J%%%J%JJjj%jKJ%%%%jjJ%%%jJ%k%JJ%%Jjj%Jjj%J
$$ plain form
906 5 5 5 5 5 4 4 4 4 3 2 2 2 2 3 3 3 3 5 4 3 3 3 3 4 4 3 2 1 2 2 2 3 3 3 3 3 3 3 2 1 2 3 2 2 2 2 2 3 3 3 3 3 3 3 3 3 3 4 4 4 3 3 3 4 4 4 3 3 3 4 4 4
895 4 3 3 3 3 3 3 4 3 3 3 4 5 4 4 4 5 5 4 4 4 4 3 3 3 3 3 3 2 2 2 3 4 4 3 3 3 2 2 2 2 3 3 2 2 2 1 1 1 0 2 3 3 3 4 4 3 3 3 3 4 4 4 4 3 2 2 2 3 4 4 4 3
884 3 3 3 3 3 3 3 4 4 3 3 2 2 3 2 2 3 3 2 2 1 2 3 2 2 2 3 4 4 4 3 2 3 3 3 3 3 2 3 4 3 3 2 2 1 0 2 3 3 4 4 4 4 3 3 3 3 3 3 3 4 3 3 3 3 3 3 4 4 4 3 2 3
873 3 3 3 2 2 3 3 3 3 2 3 3 3 2 2 2 2 1 1 1 1 2 2 2 2 2 3 3 3 4 4 4 4 3 4 4 4 4 3 3 3 3 3 2 1 2 3 3 3 3 2 2 2 4 4 2 2 1 2 2 3 4 4 3 3 2 3 3 3 2 3 3 4
862 4 3 3 4 5 5 3 3 3 4 3 3 3 3 3 4 3 3 2 2 2 2 3 4 4 4 4 4 3 3 3 3 3 2 3 3 3 4 4 4 4 3 3 2 2 2 3 4 3 3 2 3 4 4 4 4 4 4 3 3 2 2 2 3 3 3 3 4 5 4 4 4 4
851 4 4 4 3 3 3 2 3 4 4 5 5 5 4 4 4 4 4 4 4 4 5 5 4 4 3 3 3 3 2 3 3 3 4 4 4 4 4 4 4 4 4 4 4 4 4 4 4 4 4 4 4 4 4 4 3 3 4 3 3 3 4 4 4 4 4 4 4 4 4 4 3 4
840 4 4 4 4 4 4 3 4 4 3 4 4 3 3 3 4 6 5 6 5 5 6 6 5 5 5 4 3 3 3 3 3 3 4 5 5 4 5 5 5 5 5 5 5 5 4 3 2 2 2 2 4 6 5 5 4 5 5 5 5 4 4 3 3 2 3 4 5 6 6 6 5 4
829 4 3 3 4 4 4 5 5 5 4 4 4 3 4 5 6 5 5 4 4 4 4 4 4 3 2 2 2 1 1 1 2 2 2 2 3 3 4 5 4 3 3 2 4 5 5 5 5 5 4 3 4 4 4 4 3 4 4 2 2 3 4 4 4 5 4 3 3 4 3 2 2 3
818C%%%%JjjJ%jjjJJj%%%J%Jj%%%J%%%%%%%%%%%%%%%j%%%JJj%jj%%%%J%%%J%jJ%%j%J%%%j
807B%J%%%%%JJ%%j%j%%j%%JJ%j%%%%%%%JJj%%j%%J%%%%%jj%%J%%%%%%%JJj%j%%%JJ%jjJ%%
796D%j%%%%J%%%%%j%J%j%%%%%JjJJj%j%%%j%%JJjj%j%%JJ%j%J%%jJ%jJ%%%J%%%%%jJjj%JJ
785D%J%%%j%j%%%k%%%JJ%%%%%%%%%%J%%%J%J%kkKJ%%%jKKJJ%%jjjjjj%%%%jj%%%%%%%%J%j
774B%%%JJ%%%%%%%%%%jjJ%%%%%%%j%%J%J%%j%%%J%%jJ%J%jj%Jjj%%%jK%%J%jj%%JJJ%%j%%
763D%%Jjjj%J%%%j%%K%%%%%%%JJ%jj%jJ%J%j%%%J%%jk%JJ%%jJJjjJ%Jj%%Jj%%j%j%%JJ%%J
752E%%J%kjJ%%%%j%%J%J%%jjJ%j%%%%jJ%J%%%%%%%j%%%%%%%%jJ%JJkjJJj%%%%%J%J%jjJ%J
741E%%%jjJ%%%%%%%%%%%%Jj%%%j%%%%%J%JJ%%j%%%%%%%J%J%jj%%%J%%jJ%jj%KJ%Jj%%J%JJ
$$ plain form
818 3 3 3 3 3 4 3 2 3 3 2 1 0 1 2 1 1 1 1 2 2 3 2 2 2 2 3 3 3 3 3 3 3 3 3 3 3 3 3 3 3 3 2 2 2 2 3 4 3 3 2 1 1 1 1 1 2 2 2 2 3 3 2 3 3 3 2 2 3 3 3 3 2
807 2 2 3 3 3 3 3 3 4 5 5 5 4 4 3 3 3 2 2 2 3 4 4 3 3 3 3 3 3 3 3 4 5 4 4 4 3 3 3 4 4 4 4 4 4 3 2 2 2 3 3 3 3 3 3 3 3 4 5 4 4 3 3 3 3 4 5 5 4 3 4 4 4
796 4 4 3 3 3 3 3 4 4 4 4 4 4 3 3 4 4 3 3 3 3 3 3 4 3 4 5 4 4 3 3 3 3 2 2 2 3 4 3 2 2 1 1 1 2 3 3 2 2 3 3 3 2 3 3 2 3 3 3 3 4 4 4 4 4 4 3 4 3 2 2 3 4
785 4 4 5 5 5 5 4 4 3 3 3 3 1 1 1 1 2 3 3 3 3 3 3 3 3 3 3 3 4 4 4 4 5 5 6 6 4 2 4 5 5 5 5 4 6 8 9 10 10 10 9 8 7 6 5 4 4 4 4 4 3 2 2 2 2 2 2 2 2 2 3 3 2
774 2 2 2 2 3 4 4 4 4 4 4 4 4 4 4 4 3 2 3 3 3 3 3 3 3 3 2 2 2 3 3 4 4 4 3 3 3 3 4 4 4 3 4 4 5 5 4 3 3 4 3 2 2 2 2 1 3 3 3 4 4 3 2 2 2 3 4 5 5 5 4 4 4
763 4 4 4 5 4 3 2 2 3 3 3 3 2 2 2 4 4 4 4 4 4 4 4 5 6 6 5 4 4 3 4 4 5 5 4 4 4 4 5 5 5 4 2 2 3 4 4 4 3 4 5 4 3 4 4 5 4 4 4 5 4 4 4 3 3 2 2 2 3 4 4 4 5
752 5 5 5 6 6 4 3 4 4 4 4 4 3 3 3 4 4 5 5 5 4 3 4 4 3 3 3 3 3 2 3 3 4 4 4 4 4 4 4 4 3 3 3 3 3 3 3 3 3 2 3 3 4 5 3 2 3 4 3 3 3 3 3 3 4 4 5 5 4 3 4 4 5
741 5 5 5 5 4 3 4 4 4 4 4 4 4 4 4 4 4 4 4 5 4 4 4 4 3 3 3 3 3 3 4 4 5 6 6 6 5 5 5 5 5 5 5 5 6 6 7 7 6 5 5 5 5 6 6 6 5 6 6 5 4 4 6 7 7 8 7 7 7 8 8 9 10
730A0KLKJJLLL%%%%%kkljkjlkjk%%j%%j%J%jj%%J%JJJJJKLJKKKKL%jjJ%klkkkkkkkj%j%%J
719HjjJ%j%%%%%jJ%j%jJ%%%%%J%%%%%%%%%j%%%J%JkJ%j%%Jj%%%%J%%%%jjJ%%jk%J%%%JJ%%
708E%%%%J%%%%jJ%%%%%%%%%%%%JJ%J%%%%%%%%j%J%j%%%%%J%%J%%jjJJJ%%Jj%jJ%%%J%J%%%
697A3%%J%J%J%%jKKK%%%KjJ%Jj%%J%Kj%j%jKJJJ%%%%JJJJKKJKJKKKJJLKLJ%%%%KKJJJJKjj
686F5%jkjjjj%Jkj%JKJKJK%JLMLOMNONMKKLLMOLKK%jjkj%klmkklkmlk%%JJ%JJLLLKLLMNMN
675A40LMKKKLLKMONMJJLKJKJJjmmmmkjJKMNOOQJ0J0RJ0J2J3J0J0QNLLORJ0J0RPOLJKNPOOQ
666D02J3J5J7J6J2QOMJoj1j5j5j7j3j0j2j6j9k1k0j6j2j1j0j1j5j7j8j7j6j4j1rqonpoomm
660I6jjkjlkjkmkjkklkjj%j%%kkkkjkjkjjklllll%J%Jj%j%jjjjjjjjkjj%jjjjjjj%j%jjj%
$$ plain form
730 10 12 15 17 18 19 22 25 28 28 28 28 28 28 26 24 21 20 18 17 14 12 11 9 9 9 8 8 8 7 7 8 8 7 6 6 6 7 7 8 9 10 11 12 14 17 18 20 22 24 26 29 29 28 27 28 28 26 23 21 19 17 15 13 11 9 8 8 7 7 7 8
719 8 7 6 7 7 6 6 6 6 6 6 5 6 6 5 5 4 5 5 5 5 5 5 6 6 6 6 6 6 6 6 6 6 5 5 5 5 6 6 7 5 6 6 5 5 5 6 5 5 5 5 5 6 6 6 6 6 5 4 5 5 5 4 2 2 3 3 3 3 4 5 5 5
708 5 5 5 5 5 6 6 6 6 6 5 6 6 6 6 6 6 6 6 6 6 6 6 6 7 8 8 9 9 9 9 9 9 9 9 9 8 8 9 9 8 8 8 8 8 8 9 9 9 10 10 10 9 8 9 10 11 11 11 12 11 11 10 11 11 11 11 12 12 13 13 13 13
697 13 13 13 14 14 15 15 16 16 16 15 17 19 21 21 21 21 23 22 23 23 24 23 23 23 24 24 26 25 25 24 24 23 25 26 27 28 28 28 28 28 29 30 31 32 34 36 37 39 40 42 44 46 47 48 51 53 56 57 57 57 57 57 59 61 62 63 64 65 67 66 65
686 65 65 64 62 61 60 59 58 58 59 57 56 56 57 59 60 62 63 65 65 66 69 73 76 82 86 91 97 102 106 108 110 113 116 120 126 129 131 133 133 132 131 129 128 128 126 123 119 117 115 112 110 106 103 101 101 101 102 103 103 104 105 108 111 114 116 119 122 126 131 135 140
675 140 143 147 149 151 153 156 159 161 165 171 176 180 181 182 185 187 188 190 191 192 191 187 183 179 175 173 172 173 175 179 184 190 196 204 214 224 233 243 255 268 278 288 296 301 304 307 313 322 332 342 351 358 364 367 368 370 375 382 388 394 402
666 402 415 430 447 463 475 483 489 493 494 488 477 462 447 430 417 407 395 379 360 339 319 303 291 280 270 259 244 227 209 192 176 162 151 142 134 128 123 116 110 104 100 96
660 96 95 94 92 91 88 86 85 83 79 77 76 74 72 69 67 66 65 65 64 64 64 62 60 58 56 55 53 52 50 49 48 46 43 40 37 34 31 31 32 32 33 32 32 31 31 30 29 28 27 26 25 24 23 21 20 19 19 18 17 16 15 14 13 12 12 11 11 10 9 8 8
649H%%j%jJ%jJ%jj%%%%%%Jjj%%J%jjJ%%%j%%J%%%%%%J%jjjJ%%%J%%%%j%J%%%j%K%j%%%%%J
638E%%j%Jj%J%%j%J%Jj%%%J%KJKLLKMJkmljjkkjjjkJ%%%%%%Jjj%%J%jj%JKjJ%JKKJMMKJll
627A7ljkjjjjj%%%%jj%jJ%Jj%%%Jj%%%%%%J%%J%%%J%%%J%%%%%%%%%%%%j%%%j%%kjjJJ%j%j
616B%JJ%J%%%j%J%j%%%Jj%%%jjJ%%%%%J%jJ%jJJ%Jjj%%%%%%j%%j%%%%JJJ%j%%%%%%J%%jjj
605BJJjJ%j%%%%%%jJ%%jJJ%j%Jj%%Jjj%J%%%%%%%J%j%%%%jJJ%%JJjj%J%%j%%%%%%%jj%%%%
594B%%jJ%%%%%Jj%%%Jj%%Jj%%%J%J%%J%jk%%%%%%%%%%%%j%J%%%%JJj%%J%%J%%%jjJ%j%j%%
583B%J%%%j%%%%%jJKjjj%J%Jj%%jJ%J%%%%%%j%%%J%%%jJ%%J%%j%%%JJ%%%%jj%j%%%%%%J%%
572Cj%%%%%Jj%J%%%J%%%%j%%%jJ%J%%%%jJ%j%%jJ%J%j%j%%%%JJj%JJ%jj%%%%%J%%%%%j%J%
$$ plain form
649 8 8 8 7 7 6 7 7 6 7 7 6 5 5 5 5 5 5 5 6 5 4 4 4 5 5 4 3 4 4 4 4 3 3 3 4 4 4 4 4 4 4 5 5 4 3 2 3 3 3 3 4 4 4 4 4 3 3 4 4 4 4 3 3 5 5 4 4 4 4 4 4 5
638 5 5 5 4 4 5 4 4 5 5 5 4 4 5 5 6 5 5 5 5 6 6 8 9 11 14 17 19 23 24 22 18 15 14 13 11 9 8 7 6 4 5 5 5 5 5 5 5 6 5 4 4 4 5 5 4 3 3 4 6 5 6 6 7 9 11 12 16 20 22 23 20 17
627 17 14 13 11 10 9 8 7 6 6 6 6 6 5 4 4 3 4 4 5 4 4 4 4 5 4 4 4 4 4 4 4 5 5 5 6 6 6 6 7 7 7 7 8 8 8 8 8 8 8 8 8 8 8 8 8 7 7 7 7 6 6 6 4 3 2 3 4 4 3 3 2
616 2 2 3 4 4 5 5 5 5 4 4 5 5 4 4 4 4 5 4 4 4 4 3 2 3 3 3 3 3 3 4 4 3 4 4 3 4 5 5 6 5 4 4 4 4 4 4 4 3 3 3 2 2 2 2 2 3 4 5 5 4 4 4 4 4 4 4 5 5 5 4 3 2
605 2 3 4 3 4 4 3 3 3 3 3 3 3 2 3 3 3 2 3 4 4 3 3 4 3 3 3 4 3 2 2 3 3 3 3 3 3 3 3 4 4 3 3 3 3 3 2 3 4 4 4 5 6 5 4 4 5 5 5 4 4 4 4 4 4 4 4 3 2 2 2 2 2
594 2 2 2 1 2 2 2 2 2 2 3 2 2 2 2 3 2 2 2 3 2 2 2 2 3 3 4 4 4 5 5 4 2 2 2 2 2 2 2 2 2 2 2 2 2 1 1 2 2 2 2 2 3 4 3 3 3 4 4 4 5 5 5 5 4 3 4 4 3 3 2 2 2
583 2 2 3 3 3 3 2 2 2 2 2 2 1 2 4 3 2 1 1 2 2 3 2 2 2 1 2 2 3 3 3 3 3 3 3 2 2 2 2 3 3 3 3 2 3 3 3 4 4 4 3 3 3 3 4 5 5 5 5 5 4 3 3 2 2 2 2 2 2 2 3 3 3
572 3 2 2 2 2 2 2 3 2 2 3 3 3 3 4 4 4 4 4 3 3 3 3 2 3 3 4 4 4 4 4 3 4 4 3 3 3 2 3 3 4 4 3 3 2 2 2 2 2 3 4 3 3 4 5 5 4 3 3 3 3 3 3 4 4 4 4 4 4 3 3 4 4
561D%%j%%%%%%%jjJJ%jJ%%%j%%%%%%%jJ%%%jJJ%%Jj%%%%%%%%%%%%%%j%%%jJJJj%%%%%jJ%j
550B%%%J%%%%%Jj%%JjjJjJ%%%%%%%J%jJ%%Jj%%k%%%%JJjj%j%%%J%%%jJ%j%%%JJ%Jj%j%JJ%
539Dj%jJJj%%%JJj%j%jJ%J%%Jj%Jjj%%JJj%%%Jkj%J%j%J%%%%J%jJJ%J%%%jjJ%jJ%%j%%JK%
528GJ%%jj%j%j%J%%j%j%%%%jJ%%%%jJJj%JJJ%jj%%J%%%%%%%j%%%J%%j%%%j%JJ%%J%k%j%jJ
517C%%%%%%%J%j%%JJ%j%%jJJ%%%%%%%KJ%JJ%Jj%jjjJJJj%%jjjj%%%%j%%%Jj%%%j%%%%J%%%
506D%%JJJJ%J%J%%%jj%J%kj%%%%%jkJJ%Jj%%jJ%JJ%%%%jj%%jJJjJ%JJ%%JJJjJ%j%kj%%jjJ
495F%%j%%JJ%%J%%%%j%j%jJ%%%JJJ%J%%%JJ%%Jkjk%%%j%%%%%j%%JJ%%J%%%%%%%%%J%J%%%%
484A1Jj%%%%%%%%Jj%%J%J%j%j%JJJ%%JJJ%JJ%%%J%%KKJJJJKKLLLKLKLLKLNNOQRJ1J4J9K5L1
$$ plain form
561 4 4 4 3 3 3 3 3 3 3 3 2 1 2 3 3 2 3 3 3 3 2 2 2 2 2 2 2 2 1 2 2 2 2 1 2 3 3 3 4 3 3 3 3 3 3 3 3 3 3 3 3 3 3 3 2 2 2 2 1 2 3 4 3 3 3 3 3 3 2 3 3 2
550 2 2 2 2 3 3 3 3 3 3 4 3 3 3 4 3 2 3 2 3 3 3 3 3 3 3 3 4 4 3 4 4 4 5 4 4 4 2 2 2 2 2 3 4 3 2 2 1 1 1 1 2 2 2 2 1 2 2 1 1 1 1 2 3 3 4 3 3 2 2 3 4 4
539 4 3 3 2 3 4 3 3 3 3 4 5 4 4 3 3 2 3 3 4 4 4 5 4 4 5 4 3 3 3 4 5 4 4 4 4 5 3 2 2 3 3 2 2 3 3 3 3 3 4 4 3 4 5 5 6 6 6 6 5 4 5 5 4 5 5 5 4 4 4 5 7 7
528 7 8 8 8 7 6 6 5 5 4 4 5 5 5 4 4 3 3 3 3 3 2 3 3 3 3 3 2 3 4 3 3 4 5 6 6 5 4 4 4 5 5 5 5 5 5 5 5 4 4 4 4 5 5 5 4 4 4 4 3 3 4 5 5 5 6 6 4 4 3 3 2 3
517 3 3 3 3 3 3 3 3 4 4 3 3 3 4 5 5 4 4 4 3 4 5 5 5 5 5 5 5 5 7 8 8 9 10 10 11 10 10 9 8 7 8 9 10 9 9 9 8 7 6 5 5 5 5 5 4 4 4 4 5 4 4 4 4 3 3 3 3 3 4 4 4 4
506 4 4 4 5 6 7 8 8 9 9 10 10 10 10 9 8 8 9 9 7 6 6 6 6 6 6 5 3 4 5 5 6 5 5 5 4 5 5 6 7 7 7 7 7 6 5 5 5 4 5 6 5 6 6 7 8 8 8 9 10 11 10 11 11 10 10 8 7 7 7 6 5 6
495 6 6 6 5 5 5 6 7 7 7 8 8 8 8 8 7 7 6 6 5 6 6 6 6 7 8 9 9 10 10 10 10 11 12 12 12 13 11 10 8 8 8 8 7 7 7 7 7 7 6 6 6 7 8 8 8 9 9 9 9 9 9 9 9 9 9 10 10 11 11 11 11 11
484 11 12 11 11 11 11 11 11 11 11 11 12 11 11 11 12 12 13 13 12 12 11 11 12 13 14 14 14 15 16 17 17 18 19 19 19 19 20 20 20 22 24 25 26 27 28 30 32 35 38 41 43 46 48 51 54 56 59 64 69 75 83 92 103 117 136 161 192
474A92L5L6L0J5%j0j6j6j3j1qrrrpomlnmmlkljj%LLLMLLMMOPRJ4K1K7L7N0O4Q1R6J06J02N1
466H62l8r9j05r0p3o1n2m5l8l2k5k0j6j2j0qpopommmmkjJjJLMNNPQRJ2J4J8K4K6K8L0L3K7
460C47J5nk5l7m2m1l4k6k2j9j5j3j1ronmkkjjkjjjkklkllkjjj%%JJjjkjj%jjjjjj%jj%%%%
451Ej%J%%%%%JJ%J%%JJjJ%%jjJ%J%jjjj%%jjjJ%J%jJ%k%%%J%Jj%%%%Jj%%jjJ%j%%%%jJ%%%
440BJ%%jJ%%j%%%%%%%%Jj%jJK%%j%j%%%%%%%J%%%%%%%%j%%%%%J%j%%%%j%J%j%%J%J%j%j%j
429@%J%%%JJ%j%%j%jJK%J%jJjj%J%j%%J%%%%%%j%j%%%%%J%%j%J%Jj%%%%J%%jjJ%%%%Jj%%J
418C%%%%jK%%j%j%%%%JJkj%J%%j%%JJ%%%%%jj%J%%%JJjj%JJJ%j%%%j%%%%%%j%%%J%%Jk%%J
407C%%%%%j%JjjJJ%J%%JJ%%J%%%jj%%kJJj%j%j%%%%%%%jJ%J%%%%%%%%%%%j%%J%J%%%%%jj%
$$ plain form
474 192 227 263 293 308 308 298 282 266 253 242 234 225 216 207 200 194 190 187 182 178 174 171 169 166 165 164 164 167 170 173 177 180 183 187 191 197 204 213 227 248 275 312 362 426 507 603 709 811 862
466 862 824 725 620 530 457 396 344 299 261 229 204 184 168 156 146 138 131 125 118 112 108 104 100 96 94 93 94 93 94 97 101 106 111 118 126 135 147 161 179 203 229 257 287 320 347
460 347 362 357 332 295 253 212 178 152 130 111 96 83 72 63 57 52 48 46 44 43 42 40 39 38 37 35 33 30 28 25 22 20 19 18 17 17 17 18 19 18 17 15 14 13 13 12 11 10 9 8 7 7 6 5 5 5 5 5
451 5 4 4 5 5 5 5 5 5 6 7 7 8 8 8 9 10 9 10 10 10 9 8 9 9 10 10 9 8 7 6 6 6 5 4 3 4 4 5 5 4 5 5 3 3 3 3 4 4 5 4 4 4 4 4 5 4 4 4 3 2 3 3 2 2 2 2 2 1 2 2 2 2
440 2 3 3 3 2 3 3 3 2 2 2 2 2 2 2 2 2 3 2 2 1 2 4 4 4 3 3 2 2 2 2 2 2 2 2 3 3 3 3 3 3 3 3 3 2 2 2 2 2 2 3 3 2 2 2 2 2 1 1 2 2 1 1 1 2 2 3 3 2 2 1 1 0
429 0 0 1 1 1 1 2 3 3 2 2 2 1 1 0 1 3 3 4 4 3 4 3 2 2 3 3 2 2 2 3 3 3 3 3 3 3 2 2 1 1 1 1 1 1 2 2 2 1 1 2 2 3 2 2 2 2 2 3 3 3 2 1 2 2 2 2 2 3 2 2 2 3
418 3 3 3 3 3 2 4 4 4 3 3 2 2 2 2 2 3 4 2 1 1 2 2 2 1 1 1 2 3 3 3 3 3 3 2 1 1 2 2 2 2 3 4 3 2 2 3 4 5 5 4 4 4 4 3 3 3 3 3 3 3 2 2 2 2 3 3 3 4 2 2 2 3
407 3 3 3 3 3 3 2 2 3 2 1 2 3 3 4 4 4 5 6 6 6 7 7 7 7 6 5 5 5 3 4 5 4 4 3 3 2 2 2 2 2 2 2 2 1 2 2 3 3 3 3 3 3 3 3 3 3 3 3 2 2 2 3 3 4 4 4 4 4 4 3 2 2
396B%%J%J%%kJ%j%%J%%j%j%J%%%%%%%%%Jjj%Jj%%%%%%JJ%j%%%%j%J%%%%JJjjjJJj%%%j%J%
385BJJjj%j%j%K%%J%%%jJ%%%%%%j%j%J%%%%%%j%%JJj%jjJ%%%JJJ%j%%%%jJ%j%%%%%J%%j%%
374B%%%j%j%J%%%%%KjjJ%%%J%%Jjj%%%J%%%%%%j%j%K%jjJ%%Jjj%%J%j%%jJJ%j%j%%JJ%J%%
363Cj%%%jJ%jjJ%%%%J%j%%%%J%J%%j%jj%%J%JJjj%%JJ%j%%jj%%J%%%%%j%%K%%j%J%J%j%%%
352B%%j%JJj%%jJ%%%%%%J%%JJkj%%%%%%%%%%%%%jJ%%jJ%%jJ%%J%%%%%j%j%%%JjJJ%Jk%j%%
341AJ%%%%Jjj%%j%%jJJJJ%j%%KJjj%j%j%jJ%%J%%%j%%%%%jJ%%%%%%%J%%%%%%%%j%JJjJ%%%
330C%j%%%J%j%j%JJ%JkjJJ%%%%%j%j%%%%J%J%%%%j%%%%j%%%%%%JJj%%%JjJ%%%jj%Jj%%%%J
319BJjj%J%%%jJJj%J%j%%%%%%jj%K%%jJ%%%%%%%%J%%%kjJJJJj%jj%jJJ%%j%%%%j%%%J%%%%
$$ plain form
396 2 2 2 3 3 4 4 4 2 3 3 2 2 2 3 3 3 2 2 1 1 2 2 2 2 2 2 2 2 2 2 3 2 1 1 2 1 1 1 1 1 1 1 2 3 3 2 2 2 2 2 1 1 2 2 2 2 2 3 4 3 2 1 2 3 2 2 2 2 1 1 2 2
385 2 3 4 3 2 2 1 1 0 0 2 2 2 3 3 3 3 2 3 3 3 3 3 3 3 2 2 1 1 2 2 2 2 2 2 2 1 1 1 2 3 2 2 1 0 1 1 1 1 2 3 4 4 3 3 3 3 3 2 3 3 2 2 2 2 2 2 3 3 3 2 2 2
374 2 2 2 2 1 1 0 0 1 1 1 1 1 1 3 2 1 2 2 2 2 3 3 3 4 3 2 2 2 2 3 3 3 3 3 3 3 2 2 1 1 3 3 2 1 2 2 2 3 2 1 1 1 2 2 1 1 1 0 1 2 2 1 1 0 0 0 1 2 2 3 3 3
363 3 2 2 2 2 1 2 2 1 0 1 1 1 1 1 2 2 1 1 1 1 1 2 2 3 3 3 2 2 1 0 0 0 1 1 2 3 2 1 1 1 2 3 3 2 2 2 1 0 0 0 1 1 1 1 1 1 0 0 0 2 2 2 1 1 2 2 3 3 2 2 2 2
352 2 2 2 1 1 2 3 2 2 2 1 2 2 2 2 2 2 2 3 3 3 4 5 3 2 2 2 2 2 2 2 2 2 2 2 2 2 2 1 2 2 2 1 2 2 2 1 2 2 2 3 3 3 3 3 3 2 2 1 1 1 1 2 1 2 3 3 4 2 2 1 1 1
341 1 2 2 2 2 2 3 2 1 1 1 0 0 0 -1 0 1 2 3 3 2 2 2 4 5 4 3 3 2 2 1 1 0 1 1 1 2 2 2 2 1 1 1 1 1 1 0 1 1 1 1 1 1 1 1 2 2 2 2 2 2 2 2 2 1 1 2 3 2 3 3 3 3
330 3 3 2 2 2 2 3 3 2 2 1 1 2 3 3 4 2 1 2 3 3 3 3 3 3 2 2 1 1 1 1 1 2 2 3 3 3 3 3 2 2 2 2 2 1 1 1 1 1 1 1 2 3 2 2 2 2 3 2 3 3 3 3 2 1 1 2 1 1 1 1 1 2
319 2 3 2 1 1 2 2 2 2 1 2 3 2 2 3 3 2 2 2 2 2 2 2 1 0 0 2 2 2 1 2 2 2 2 2 2 2 2 2 3 3 3 3 1 0 1 2 3 4 3 3 2 1 1 0 1 2 2 2 1 1 1 1 1 0 0 0 0 1 1 1 1 1
308A%%J%J%jJ%jjjJ%%%J%%%%j%%%%JJk%J%%%%%%%%Jjj%%%Jj%%jJ%%%%J%j%%%J%%%%%%jjJJ
297BJj%%%%%jJJj%%%%%%%%jJ%%j%jJ%%J%%%jJ%%Jj%%Jjj%%%J%Jj%%%%%%%%Jj%Jj%J%Jjj%j
286A%%%J%%%%%%%jjJJ%j%%J%%%J%%%%j%%J%%%j%j%%%%J%j%%%JJj%%jJ%%%%%%%%JjJJj%Jj%
275C%%%%%j%%%%JJjj%J%%%%%%jj%JJjjJ%%%jJ%%%%J%%kj%%JJKjj%JjJjJ%%%j%%j%J%%%jJ%
264B%%%%%%%jJ%J%jj%%%%%%%%J%J%%%%jjJ%j%J%k%%J%J%Jj%Jjj%%%J%%%Jj%%%%%%jJjjJ%J
253B%%%%j%%J%j%j%JJJ%J%jj%jKJ%jjjjJJ%j%%%%%Jj%Jj%j%%%%jJJJJj%j%%%J%%Jjj%%%%J
242B%%j%%%%%%KJj%j%%%j%J%%%J%j%%j%%%%%JJ%J%j%k%J%%J%%%%%j%jjJJ%Jj%%%%%j%%jK%
231B%%%jJ%%j%JjjJ%%j%Jj%J%%%%%jJ%JjJ%J%%%%%j%%%%%jJ%%%%%%%%Jj%%J%j%%j%j%%%JJ
$$ plain form
308 1 1 1 2 2 3 3 2 3 3 2 1 0 1 1 1 1 2 2 2 2 2 1 1 1 1 1 2 3 1 1 2 2 2 2 2 2 2 2 2 3 2 1 1 1 1 2 1 1 1 0 1 1 1 1 1 2 2 1 1 1 1 2 2 2 2 2 2 2 1 0 1 2
297 2 3 2 2 2 2 2 2 1 2 3 2 2 2 2 2 2 2 2 2 1 2 2 2 1 1 0 1 1 1 2 2 2 2 1 2 2 2 3 2 2 2 3 2 1 1 1 1 2 2 3 2 2 2 2 2 2 2 2 2 3 2 2 3 2 2 3 3 4 3 2 2 1
286 1 1 1 1 2 2 2 2 2 2 2 2 1 0 1 2 2 1 1 1 2 2 2 2 3 3 3 3 3 2 2 2 3 3 3 3 2 2 1 1 1 1 1 2 2 1 1 1 1 2 3 2 2 2 1 2 2 2 2 2 2 2 2 2 3 2 3 4 3 3 4 3 3
275 3 3 3 3 3 3 2 2 2 2 2 3 4 3 2 2 3 3 3 3 3 3 3 2 1 1 2 3 2 1 2 2 2 2 1 2 2 2 2 2 3 3 3 1 0 0 0 1 2 4 3 2 2 3 2 3 2 3 3 3 3 2 2 2 1 1 2 2 2 2 1 2 2
264 2 2 2 2 2 2 2 2 1 2 2 3 3 2 1 1 1 1 1 1 1 1 1 2 2 3 3 3 3 3 2 1 2 2 1 1 2 2 0 0 0 1 1 2 2 3 2 2 3 2 1 1 1 1 2 2 2 2 3 2 2 2 2 2 2 2 1 2 1 0 1 1 2
253 2 2 2 2 2 1 1 1 2 2 1 1 0 0 1 2 3 3 4 4 3 2 2 1 3 4 4 3 2 1 0 1 2 2 1 1 1 1 1 1 2 1 1 2 1 1 0 0 0 0 0 -1 0 1 2 3 2 2 1 1 1 1 2 2 2 3 2 1 1 1 1 1 2
242 2 2 2 1 1 1 1 1 1 1 3 4 3 3 2 2 2 2 1 1 2 2 2 2 3 3 2 2 2 1 1 1 1 1 1 2 3 3 4 4 3 3 1 1 2 2 2 3 3 3 3 3 3 2 2 1 0 1 2 2 3 2 2 2 2 2 2 1 1 1 0 2 2
231 2 2 2 2 1 2 2 2 1 1 2 1 0 1 1 1 0 0 1 0 0 1 1 1 1 1 1 0 1 1 2 1 2 2 3 3 3 3 3 3 2 2 2 2 2 2 1 2 2 2 2 2 2 2 2 2 3 2 2 2 3 3 2 2 2 1 1 0 0 0 0 1 2
220B%%%%J%%%%%j%%%kJ%J%%%%%%%j%j%K%%%%%%%%%%%%%j%J%Jj%%Jj%j%J%%J%%j%K%j%%J%j
209C%%%%%j%%j%J%%Jj%%%%J%%%%%Jj%%%j%j%%%JJ%%%%%%%%%%%%%%%jj%%%J%J%%%j%JJ%%jJ
198D%j%%%j%JJ%jjJj%%jJ%J%jJ%%j%%%j%JjJ%Jjj%J%%%j%%kJ%%%%J%J%%%%%J%%j%%%%%JJ%
187D%jj%j%J%J%Jj%jjJ%JJ%j%%j%%%%%%j%JJ%%%j%jJ%%j%%J%%%%%%%%jJ%%%jjjJ%J%%%%%%
176A%J%%%Jj%j%%%JJ%%%j%J%%jj%%J%%%J%%%%j%J%jj%%%%%%%%Jj%JJj%%%%%j%%J%jJ%%%%j
165A%%%%%%jJ%J%jJ%%%jJJ%jjJ%J%jj%%JJj%%jJ%%jJ%jJ%jJ%j%%%JJj%%%%JjJj%%%%%%%%J
154C%%%jjJ%%Jj%J%k%%j%JJj%%%J%j%jJ%%%%%JjJJj%%%j%%J%J%j%%%%%%%%j%J%%%%%j%%%J
143B%%j%JJj%j%%J%%%%%%%%J%%%j%j%%jKJj%%%%J%%%%%%%%%%%%j%%%%jJ%%%%%%%jjJjJKJ%
$$ plain form
220 2 2 2 2 2 3 3 3 3 3 3 2 2 2 2 0 1 1 2 2 2 2 2 2 2 2 1 1 0 0 2 2 2 2 2 2 2 2 2 2 2 2 2 2 1 1 2 2 3 2 2 2 3 2 2 1 1 2 2 2 3 3 3 2 2 4 4 3 3 3 4 4 3
209 3 3 3 3 3 3 2 2 2 1 1 2 2 2 3 2 2 2 2 2 3 3 3 3 3 3 4 3 3 3 3 2 2 1 1 1 1 2 3 3 3 3 3 3 3 3 3 3 3 3 3 3 3 3 2 1 1 1 1 2 2 3 3 3 3 2 2 3 4 4 4 3 4
198 4 4 3 3 3 3 2 2 3 4 4 3 2 3 2 2 2 1 2 2 3 3 2 3 3 3 2 2 2 2 1 1 2 1 2 2 3 2 1 1 2 2 2 2 1 1 1 -1 0 0 0 0 0 1 1 2 2 2 2 2 2 3 3 3 2 2 2 2 2 2 3 4 4
187 4 4 3 2 2 1 1 2 2 3 3 4 3 3 2 1 2 2 3 4 4 3 3 3 2 2 2 2 2 2 2 1 1 2 3 3 3 3 2 2 1 2 2 2 1 1 1 2 2 2 2 2 2 2 2 2 1 2 2 2 2 1 0 -1 0 0 1 1 1 1 1 1 1
176 1 1 2 2 2 2 3 2 2 1 1 1 1 2 3 3 3 3 2 2 3 3 3 2 1 1 1 2 2 2 2 3 3 3 3 3 2 2 3 3 2 1 1 1 1 1 1 1 1 1 2 1 1 2 3 2 2 2 2 2 2 1 1 1 2 2 1 2 2 2 2 2 1
165 1 1 1 1 1 1 1 0 1 1 2 2 1 2 2 2 2 1 2 3 3 2 1 2 2 3 3 2 1 1 1 2 3 2 2 2 1 2 2 2 1 2 2 1 2 2 1 2 2 1 1 1 1 2 3 2 2 2 2 2 3 2 3 2 2 2 2 2 2 2 2 2 3
154 3 3 3 3 2 1 2 2 2 3 2 2 3 3 1 1 1 0 0 1 2 1 1 1 1 2 2 1 1 0 1 1 1 1 1 1 2 1 2 3 2 2 2 2 1 1 1 2 2 3 3 2 2 2 2 2 2 2 2 2 1 1 2 2 2 2 2 2 1 1 1 1 2
143 2 2 2 1 1 2 3 2 2 1 1 1 2 2 2 2 2 2 2 2 2 3 3 3 3 2 2 1 1 1 0 2 3 2 2 2 2 2 3 3 3 3 3 3 3 3 3 3 3 3 3 2 2 2 2 2 1 2 2 2 2 2 2 2 2 1 0 1 0 1 3 4 4
132D%%%jj%J%j%%%%J%J%J%jKJJJ%%jjjjj%%%%j%%jj%%%%%%%Jjj%%KJ%jjj%%JJ%%%%J%%jJ%
121Cjj%%%%%%%%JJ%%j%%%%J%%j%Jjj%%%J%J%%%j%%J%%%jJ%jJjj%J%%%%J%%%%%%%jjjJ%J%%
110B%jJ%jJJ%j%%%%%%J%%%j%j%%%%J%%j%J%%%%%%%%%%%Jjj%%JJ%j%%%%%%%Jj%%J%Jjj%%%%
99B%%%%%%j%%%%%JJ%jJ%j%J%j%%J%%%jJ%%%jjJ%jj%JJ%J%%%%j%%%%j%%J%%%J%%%%%%%%j%%
88BJ%j%j%%j%%JJJ%Jjj%%%%%%%%%%%%%jJ%%jjKJj%%%%%%%%%%%j%J%%%Jj%j%J%J%%%%JjjjJ
77B%%j%J%j%%JJJj%%%j%%Jj%%jJJjj%Jj%JJJjj%j%%%%%J%%%%%%%%jJ%%%%%jj%JJ%J%%Jj%%
66CJjjJ%J%%J%%%j%jJJJ%j%j%Jjj%j%%%%jJ%%Jj%j%%JK%%j%%%%j%%JJ%%j%j%%jJJ%%%j%Jj
55B%%%%%j%jJJ%%%J%Jjj%%%J%jj%%%%%%%%J%%%%kJ%%%%%%J%%%%%%Jj%%%%J%%%%j%%%JJjj%
$$ plain form
132 4 4 4 4 3 2 2 3 3 2 2 2 2 2 3 3 4 4 5 5 4 6 7 8 9 9 9 8 7 6 5 4 4 4 4 4 3 3 3 2 1 1 1 1 1 1 1 1 2 1 0 0 0 2 3 3 2 1 0 0 0 1 2 2 2 2 2 3 3 3 2 3 3
121 3 2 1 1 1 1 1 1 1 1 1 2 3 3 3 2 2 2 2 2 3 3 3 2 2 3 2 1 1 1 1 2 2 3 3 3 3 2 2 2 3 3 3 3 2 3 3 2 3 2 1 1 2 2 2 2 2 3 3 3 3 3 3 3 3 2 1 0 1 1 2 2 2
110 2 2 1 2 2 1 2 3 3 2 2 2 2 2 2 2 3 3 3 3 2 2 1 1 1 1 1 2 2 2 1 1 2 2 2 2 2 2 2 2 2 2 2 2 3 2 1 1 1 2 3 3 2 2 2 2 2 2 2 2 3 2 2 2 3 3 4 3 2 2 2 2 2
99 2 2 2 2 2 2 2 1 1 1 1 1 1 2 3 3 2 3 3 2 2 3 3 2 2 2 3 3 3 3 2 3 3 3 3 2 1 2 2 1 0 0 1 2 2 3 3 3 3 3 2 2 2 2 2 1 1 1 2 2 2 2 3 3 3 3 3 3 3 3 3 2 2 2
88 2 3 3 2 2 1 1 1 0 0 0 1 2 3 3 4 3 2 2 2 2 2 2 2 2 2 2 2 2 2 2 1 2 2 2 1 0 2 3 2 2 2 2 2 2 2 2 2 2 2 2 1 1 2 2 2 2 3 2 2 1 1 2 2 3 3 3 3 3 4 3 2 1 2
77 2 2 2 1 1 2 2 1 1 1 2 3 4 3 3 3 3 2 2 2 3 2 2 2 1 2 3 2 1 1 2 1 1 2 3 4 3 2 2 1 1 1 1 1 1 2 2 2 2 2 2 2 2 2 1 2 2 2 2 2 2 1 0 0 1 2 2 3 3 3 4 3 3 3
66 3 4 3 2 3 3 4 4 4 5 5 5 5 4 4 3 4 5 6 6 5 5 4 4 5 4 3 3 2 2 2 2 2 1 2 2 2 3 2 2 1 1 1 2 4 4 4 3 3 3 3 3 2 2 2 3 4 4 4 3 3 2 2 2 1 2 3 3 3 3 2 2 3 2
55 2 2 2 2 2 2 1 1 0 1 2 2 2 2 3 3 4 3 2 2 2 2 3 3 2 1 1 1 1 1 1 1 1 1 2 2 2 2 2 0 1 1 1 1 1 1 1 2 2 2 2 2 2 2 3 2 2 2 2 2 3 3 3 3 3 2 2 2 2 3 4 3 2 2
43B%JjJ%Jjj%%%j%J%%%j%J%JJj%jjjJ%%J%%%%%%j%%%JKj%j%jJ%%%%j%%%%%%J%%j%J%%%jJJ
32C%%%jJ%%jj%Jj%%J%%%J%%j%%j%%JKj%%Jj%%%j%%%j%JJjj%%%j%JJ%%%j%%J%%KJk%Jj%%j%
21B%%%%%j%%%J%%%%J%%%%j%%%j%J%j%%J%%%%j%%%J%J%J%j%j%jjJJj%%Jj%%J%%%J%%j%%%J%
10C%jj%%Jj%%J%%%%%j%%JJ%jJ%j%%%jjKJ%%j%%%%%%jJ%%%jj%JJJ%j%jJKj%J%j%%%%j%%%JJ
-1D%%j%%%jJ%%%j%%JJj%j%%%Jj%Jj%%%%%J%%jJ%%j%Jj%j%j%J%Jj%%%J%%%%%%%%Jj%%jJJj%
-12B%j%J%JJjjj%%%%%jJJ%J%Jjj%%j%JJj%%%%%J%%jJj%%j%%%J%%J%%%%jjJ%JJ%%jj%%%j%%
-23A%%JJJ%%j%%j%%J%%%%%j%J%%j%j%J%%J%%j%jJ%%%j%%%%%%%%J%%%%j%%%JJ%%%j%%%J%%J
-34D%%%jkJ%J%J%%%Jjjj%%%%%J%%%%%%%%j%%%jJJj%%%%j%J%%jJJ%%%%%%%%%%%j%j%jJJjJJ
$$ plain form
43 2 2 3 2 3 3 4 3 2 2 2 2 1 1 2 2 2 2 1 1 2 2 3 4 3 3 2 1 0 1 1 1 2 2 2 2 2 2 2 1 1 1 1 2 4 3 3 2 2 1 2 2 2 2 2 1 1 1 1 1 1 1 2 2 2 1 1 2 2 2 2 1 2 3
32 3 3 3 3 2 3 3 3 2 1 1 2 1 1 1 2 2 2 2 3 3 3 2 2 2 1 1 1 2 4 3 3 3 4 3 3 3 3 2 2 2 2 1 1 2 3 2 1 1 1 1 0 0 1 2 2 2 2 1 1 1 2 2 2 4 5 3 3 4 3 3 3 2 2
21 2 2 2 2 2 2 1 1 1 1 2 2 2 2 2 3 3 3 3 3 2 2 2 2 1 1 2 2 1 1 1 2 2 2 2 2 1 1 1 1 2 2 3 3 4 4 3 3 2 2 1 0 1 2 1 1 1 2 1 1 1 2 2 2 2 3 3 3 2 2 2 2 3 3
10 3 3 2 1 1 1 2 1 1 1 2 2 2 2 2 2 1 1 1 2 3 3 2 3 3 2 2 2 2 1 0 2 3 3 3 2 2 2 2 2 2 2 1 2 2 2 2 1 0 0 1 2 3 3 2 2 1 2 4 3 3 4 4 3 3 3 3 3 2 2 2 2 3 4
-1 4 4 4 3 3 3 3 2 3 3 3 3 2 2 2 3 4 3 3 2 2 2 2 3 2 2 3 2 2 2 2 2 2 3 3 3 2 3 3 3 2 2 3 2 2 1 1 0 0 1 1 2 1 1 1 1 2 2 2 2 2 2 2 2 2 3 2 2 2 1 2 3 2 2
-12 2 2 1 1 2 2 3 4 3 2 1 1 1 1 1 1 0 1 2 2 3 3 4 3 2 2 2 1 1 2 3 2 2 2 2 2 2 3 3 3 2 3 2 2 2 1 1 1 1 2 2 2 3 3 3 3 3 2 1 2 2 3 4 4 4 3 2 2 2 2 1 1 1
-23 1 1 1 2 3 4 4 4 3 3 3 2 2 2 3 3 3 3 3 3 2 2 3 3 3 2 2 1 1 2 2 2 3 3 3 2 2 1 2 2 2 2 1 1 1 1 1 1 1 1 1 2 2 2 2 2 1 1 1 1 2 3 3 3 3 2 2 2 2 3 3 3 4
-34 4 4 4 4 3 1 2 2 3 3 4 4 4 4 5 4 3 2 2 2 2 2 2 3 3 3 3 3 3 3 3 3 2 2 2 2 1 2 3 2 2 2 2 2 1 1 2 2 2 1 2 3 3 3 3 3 3 3 3 3 3 3 3 2 2 1 1 0 1 2 1 2 3
-45CJj%%j%JJjj%%KJjj%Jj%j%%%%%j%%%%%%%%J%J%j%%%%%%%%jjJJ%%%jJJ%%%j%%J%Jjj%j%
-56A%J%%j%jKJ%%%%%%JjjJ%%j%j%%JJ%%%jJ%%J%%%j%%%Jj%%jJ%j%%%%%J%%J%%j%%%%%%%Jj
-67Cj%J%j%%%%j%%JjJ%%%%%%%jj%%J%J%%%%%%%%%%J%jJ%%%%J%%%%%Jjk%%%J%%%J%%%%%%%j
-78Cj%%JJJjjk%J%%%J%%Jjj%%%%%%%j%%J%%%%%%%%%%JJjj%%%%%%%J%%%%%%Jjj%%JJ%j%%%j
-89BJ%%j%JjjJ%%Jjj%%%J%j%%%J%JJjJ%%j%j%%%Jj%%%%%jjJ%%J%Jj%jJJJj%%%%%J%j%j%%J
-100Cj%%%%J%J%k%%J%%%%j%j%Jj%%JJ%j%Jj%JJj%%%%%%jJJjj%%jJJ%j%%%jJ%J%j%K%jj%%%
-111B%%J%%jj%K%j%%jj%%J%J%j%J%%%JJj%k%K%j%%%%%%j%%J%%%%J%%%%%%%%%j%J%%j%%%J%
-122C%j%j%j%J%%%%%%jJ%%%J%%JJ%j%jJ%Jj%j%%j%%%%%%%%%%jJJ%%%%%j%%JJjjJJ%jJJjjj
$$ plain form
-45 3 4 3 3 3 2 2 3 4 3 2 2 2 4 5 4 3 3 4 3 3 2 2 2 2 2 2 1 1 1 1 1 1 1 1 1 2 2 3 3 2 2 2 2 2 2 2 2 2 1 0 1 2 2 2 2 1 2 3 3 3 3 2 2 2 3 3 4 3 2 2 1 1
-56 1 1 2 2 2 1 1 0 2 3 3 3 3 3 3 3 4 3 2 3 3 3 2 2 1 1 1 2 3 3 3 3 2 3 3 3 4 4 4 4 3 3 3 3 4 3 3 3 2 3 3 2 2 2 2 2 2 3 3 3 4 4 4 3 3 3 3 3 3 3 3 4 3
-67 3 2 2 3 3 2 2 2 2 2 1 1 1 2 1 2 2 2 2 2 2 2 2 1 0 0 0 1 1 2 2 2 2 2 2 2 2 2 2 2 3 3 2 3 3 3 3 3 4 4 4 4 4 4 5 4 2 2 2 2 3 3 3 3 4 4 4 4 4 4 4 4 3
-78 3 2 2 2 3 4 5 4 3 1 1 2 2 2 2 3 3 3 4 3 2 2 2 2 2 2 2 2 1 1 1 2 2 2 2 2 2 2 2 2 2 2 3 4 3 2 2 2 2 2 2 2 2 3 3 3 3 3 3 3 4 3 2 2 2 3 4 4 3 3 3 3 2
-89 2 3 3 3 2 2 3 2 1 2 2 2 3 2 1 1 1 1 2 2 1 1 1 1 2 2 3 4 3 4 4 4 3 3 2 2 2 2 3 2 2 2 2 2 2 1 0 1 1 1 2 2 3 2 2 1 2 3 4 3 3 3 3 3 3 4 4 3 3 2 2 2 3
-100 3 2 2 2 2 2 3 3 4 4 2 2 2 3 3 3 3 3 2 2 1 1 2 1 1 1 2 3 3 2 2 3 2 2 3 4 3 3 3 3 3 3 3 2 3 4 3 2 2 2 1 2 3 3 2 2 2 2 1 2 2 3 3 2 2 4 4 3 2 2 2 2
-111 2 2 2 3 3 3 2 1 1 3 3 2 2 2 1 0 0 0 1 1 2 2 1 1 2 2 2 2 3 4 3 3 1 1 3 3 2 2 2 2 2 2 2 1 1 1 2 2 2 2 2 3 3 3 3 3 3 3 3 3 3 2 2 3 3 3 2 2 2 2 3 3
-122 3 3 2 2 1 1 0 0 1 1 1 1 1 1 1 0 1 1 1 1 2 2 2 3 4 4 3 3 2 3 3 4 3 3 2 2 2 1 1 1 1 1 1 1 1 1 1 1 0 1 2 2 2 2 2 2 1 1 1 2 3 2 1 2 3 3 2 3 4 3 2 1
-133AjJJ%%%Jj%%j%%%%%J%j%J%%JK%k%jj%%%%J%%%%%J%j%%%%j%J%%j%%J%%%j%J%Jj%%%j%j
-144@%Jj%JJ%%jJ%j%%%%%%%%%%JJj%%%%%%%%jJ%%%%jJ%%%J%%jj%%J%%j%%J%%%j%%JJj%%%j
-154AJ%j%K%Jj%jj%%%Jj%%%JJjj%%%%%%JJj%%jJ%%j%Jj%%J%%%%%%%%J%j%J%jj%%J%%%%Jjj
-165A%%J%jjjK%J%%%%%%%%%%%JJ%jj%%jJ%K%%jjjJ%%j%J%%J%%jjJJj%J%%%%%%%%%j%jjJ%%
-176AJj%J%%%jJ%%J%j%%%%%j%%%j%J%%%J%%J%%j%%%%%%%%%%%%%%%J%j%%%%J%%%%jjJ%J%%%
-187CJ%%%j%%j%%j%j%JJ%j%%JJj%%jJ%%J%%%%%%%%j%%%%%j%%J%%J%%%j%%%%%%%%j%%%J%J%
-198C%%%j%JJ%Jjj%%%%jjJ%j%J%%%%%%%%%%%%%%%%%%jJJ%%%j%%%%%Jj%%%%%%%%j%%J%J%%j
-209B%jJ%%%%%%%%%%%%%%j%%%%%%%%Jj%%%JJJj%%j%%%%%%J%jjjJ%%jJ%%%j%jJ%JJ%%%%j%J
$$ plain form
-133 1 0 1 2 2 2 2 3 2 2 2 1 1 1 1 1 1 2 2 1 1 2 2 2 3 5 5 3 3 2 1 1 1 1 1 2 2 2 2 2 2 3 3 2 2 2 2 2 1 1 2 2 2 1 1 1 2 2 2 2 1 1 2 2 3 2 2 2 2 1 1 0
-144 0 0 1 0 0 1 2 2 2 1 2 2 1 1 1 1 1 1 1 1 1 1 1 2 3 2 2 2 2 2 2 2 2 2 1 2 2 2 2 2 1 2 2 2 2 3 3 3 2 1 1 1 2 2 2 1 1 1 2 2 2 2 1 1 1 2 3 2 2 2 2 1
-154 1 2 2 1 1 3 3 4 3 3 2 1 1 1 1 2 1 1 1 1 2 3 2 1 1 1 1 1 1 1 2 3 2 2 2 1 2 2 2 1 1 2 1 1 1 2 2 2 2 2 2 2 2 2 3 3 2 2 3 3 2 1 1 1 2 2 2 2 2 3 2 1
-165 1 1 1 2 2 1 0 -1 1 1 2 2 2 2 2 2 2 2 2 2 2 2 3 4 4 3 2 2 2 1 2 2 4 4 4 3 2 1 2 2 2 1 1 2 2 2 3 3 3 2 1 2 3 2 2 3 3 3 3 3 3 3 3 3 3 2 2 1 0 1 1 1
-176 1 2 1 1 2 2 2 2 1 2 2 2 3 3 2 2 2 2 2 2 1 1 1 1 0 0 1 1 1 1 2 2 2 3 3 3 2 2 2 2 2 2 2 2 2 2 2 2 2 2 2 2 3 3 2 2 2 2 2 3 3 3 3 3 2 1 2 2 3 3 3 3
-187 3 4 4 4 4 3 3 3 2 2 2 1 1 0 0 1 2 2 1 1 1 2 3 2 2 2 1 2 2 2 3 3 3 3 3 3 3 3 3 2 2 2 2 2 2 1 1 1 2 2 2 3 3 3 3 2 2 2 2 2 2 2 2 2 1 1 1 1 2 2 3 3
-198 3 3 3 3 2 2 3 4 4 5 4 3 3 3 3 3 2 1 2 2 1 1 2 2 2 2 2 2 2 2 2 2 2 2 2 2 2 2 2 2 2 1 2 3 3 3 3 2 2 2 2 2 2 3 2 2 2 2 2 2 2 2 2 1 1 1 2 2 3 3 3 2
-209 2 2 1 2 2 2 2 2 2 2 2 2 2 2 2 2 2 2 1 1 1 1 1 1 1 1 1 2 1 1 1 1 2 3 4 3 3 3 2 2 2 2 2 2 2 3 3 2 1 0 1 1 1 0 1 1 1 1 0 0 -1 0 0 1 2 2 2 2 2 1 1 2
-219B%%Jj%J%%j%%J%jkJJ%j%J%%%J%%jJ%%%%j%j%%%J%JJj%k%%%%J%%%%%J%jjJ%J%%j%j%%J
-230B%%J%%%j%%jJj%%JJ%%jk%%%J%%%j%%%JJJ%%j%%%%%%%%%%%%j%J%%j%J%%j%JK%jjj%%%J
-241B%j%%JJJ%j%%j%Jj%%%J%%%%%%%%%jjJ%%%J%jj%JJ%j%%%%%Jj%%jJ%%%%J%%j%%Jj%%j%%
-252Aj%J%J%%j%%JJ%%%j%%%%j%%Jj%J%%j%%%jJJ%j%%%%%J%%j%%%J%%j%%JJj%%j%jJ%%Jk%J
-263A%%%%%%%%%%Jj%J%%%%%%%%j%%%Jj%%J%%%%j%%j%JK%jk%J%%jjJ%J%%%%%%j%%J%%J%%j%
-274A%%Jj%%%jJJJjjJ%%%%%%%%Jjj%%%%%J%jjJ%%%%%J%%%Jjjj%%J%jJ%jJ%%%Kj%J%j%%%%%
-284B%j%J%%%%%%%%%%%%%Jj%%%J%%j%%%j%jjK%j%JJ%%%j%%%%%jJ%%%%J%J%jJ%%%%%j%%%%%
-295Bj%%%J%%Jj%%j%%%j%%J%j%JJ%%%%%%%J%%jjJ%jjJJ%jjjJJ%J%%JjjjJ%%jJJ%j%%%%%%%
$$ plain form
-219 2 2 2 3 2 2 3 3 3 2 2 2 3 3 2 0 1 2 2 1 1 2 2 2 2 3 3 3 2 3 3 3 3 3 2 2 1 1 1 1 2 2 3 4 3 3 1 1 1 1 1 2 2 2 2 2 2 3 3 2 1 2 2 3 3 3 2 2 1 1 1 2
-230 2 2 2 3 3 3 3 2 2 2 1 2 1 1 1 2 3 3 3 2 0 0 0 0 1 1 1 1 0 0 0 0 1 2 3 3 3 2 2 2 2 2 2 2 2 2 2 2 2 2 1 1 2 2 2 1 1 2 2 2 1 1 2 4 4 3 2 1 1 1 1 2
-241 2 2 1 1 1 2 3 4 4 3 3 3 2 2 3 2 2 2 2 3 3 3 3 3 3 3 3 3 3 2 1 2 2 2 2 3 3 2 1 1 2 3 3 2 2 2 2 2 2 3 2 2 2 1 2 2 2 2 2 3 3 3 2 2 2 3 2 2 2 1 1 1
-252 1 0 0 1 1 2 2 2 1 1 1 2 3 3 3 3 2 2 2 2 2 1 1 1 2 1 1 2 2 2 1 1 1 1 0 1 2 2 1 1 1 1 1 1 2 2 2 1 1 1 1 2 2 2 1 1 1 2 3 2 2 2 1 1 0 1 1 1 2 0 0 1
-263 1 1 1 1 1 1 1 1 1 1 1 2 1 1 2 2 2 2 2 2 2 2 2 1 1 1 1 2 1 1 1 2 2 2 2 2 1 1 1 0 0 1 3 3 2 0 0 1 1 1 0 -1 0 0 1 1 1 1 1 1 1 0 0 0 1 1 1 2 2 2 1 1
-274 1 1 1 2 1 1 1 1 0 1 2 3 2 1 2 2 2 2 2 2 2 2 2 3 2 1 1 1 1 1 1 2 2 1 0 1 1 1 1 1 1 2 2 2 2 3 2 1 0 0 0 1 1 0 1 1 0 1 1 1 1 3 2 2 3 3 2 2 2 2 2 2
-284 2 2 1 1 2 2 2 2 2 2 2 2 2 2 2 2 2 2 3 2 2 2 2 3 3 3 2 2 2 2 1 1 0 -1 1 1 0 0 1 2 2 2 2 1 1 1 1 1 1 0 1 1 1 1 1 2 2 3 3 2 3 3 3 3 3 3 2 2 2 2 2 2
-295 2 1 1 1 1 2 2 2 3 2 2 2 1 1 1 1 0 0 0 1 1 0 0 1 2 2 2 2 2 2 2 2 3 3 3 2 1 2 2 1 0 1 2 2 1 0 -1 0 1 1 2 2 2 3 2 1 0 1 1 1 0 1 2 2 1 1 1 1 1 1 1 1
-306A%%%%%%J%%%%j%jJ%JJj%%%j%%%%%%%%j%%J%%jK%%%J%%j%j%%J%%Jk%J%%%j%%%J%%%j%%
-317A%%%%JJ%%jj%%j%%%J%J%jjJj%JJ%%jj%%%%J%%%J%Jj%%J%%j%j%%%J%jJJj%%JjjJJj%%%
-328B%j%J%J%JJj%j%jJjj%Jj%%j%%JJj%J%%j%jJ%%Jj%%%%J%j%Jj%%%%j%%J%JJjj%%JJj%%%
-339B%j%%J%J%jjJ%%%%%%%%%%j%%JJj%%J%%%jJ%%%j%%%%%J%j%%%j%%Jj%jJ%JJj%%%%jJ%%j
-349A%%%%%%%%Jj%%%%%jJJ%%%%%%%%%j%%%%J%%%jjJJj%j%JJjjJ%%%%%Jj%%%%%%%J%j%%%%j
-360@%J%%%%%%%J%%%%%Jj%%jjjJ%%%K%j%%%%%%%%%jJ%J%%%J%j%j%%%%%jJ%%J%jjJ%jjKJ%j
-371AJ%%%jJ%%%%%%jJJj%%%%%%J%%j%J%%%j%%%%%j%%%J%%%j%j%JJj%%%%J%%%J%Jjk%%%%%%
-382AjJJj%%%%%%%%%%%%%Jj%JJj%%jJ%%jJ%%%j%jJ%Jj%%%%J%%j%%%J%jJ%%j%%%%Jj%%%J%%
$$ plain form
-306 1 1 1 1 1 1 1 2 2 2 2 2 1 1 0 1 1 2 3 2 2 2 2 1 1 1 1 1 1 1 1 1 0 0 0 1 1 1 0 2 2 2 2 3 3 3 2 2 1 1 1 2 2 2 3 1 1 2 2 2 2 1 1 1 1 2 2 2 2 1 1 1
-317 1 1 1 1 1 2 3 3 3 2 1 1 1 0 0 0 0 1 1 2 2 1 0 1 0 0 1 2 2 2 1 0 0 0 0 0 1 1 1 1 2 2 3 2 2 2 3 3 3 2 2 1 1 1 1 2 2 1 2 3 2 2 2 3 2 1 2 3 2 2 2 2
-328 2 2 1 1 2 2 3 3 4 5 4 4 3 3 2 3 2 1 1 2 1 1 1 0 0 0 1 2 1 1 2 2 2 1 1 0 1 1 1 2 1 1 1 1 1 2 2 1 1 2 1 1 1 1 1 0 0 0 1 1 2 3 2 1 1 1 2 3 2 2 2 2
-339 2 2 1 1 1 2 2 3 3 2 1 2 2 2 2 2 2 2 2 2 2 2 1 1 1 2 3 2 2 2 3 3 3 3 2 3 3 3 3 2 2 2 2 2 2 3 3 2 2 2 2 1 1 1 2 1 1 0 1 1 2 3 2 2 2 2 2 1 2 2 2 1
-349 1 1 1 1 1 1 1 1 1 2 1 1 1 1 1 1 0 1 2 2 2 2 2 2 2 2 2 2 1 1 1 1 1 2 2 2 2 1 0 1 2 1 1 0 0 1 2 1 0 1 1 1 1 1 1 2 1 1 1 1 1 1 1 1 2 2 1 1 1 1 1 0
-360 0 0 1 1 1 1 1 1 1 1 2 2 2 2 2 2 3 2 2 2 1 0 -1 0 0 0 0 2 2 1 1 1 1 1 1 1 1 1 1 0 1 1 2 2 2 2 3 3 2 2 1 1 1 1 1 1 0 1 1 1 2 2 1 0 1 1 0 -1 1 2 2 1
-371 1 2 2 2 2 1 2 2 2 2 2 2 2 1 2 3 2 2 2 2 2 2 2 3 3 3 2 2 3 3 3 3 2 2 2 2 2 2 1 1 1 1 2 2 2 2 1 1 0 0 1 2 1 1 1 1 1 2 2 2 2 3 3 4 3 1 1 1 1 1 1 1
-382 1 0 1 2 1 1 1 1 1 1 1 1 1 1 1 1 1 1 2 1 1 2 3 2 2 2 1 2 2 2 1 2 2 2 2 1 1 0 1 1 2 1 1 1 1 1 2 2 2 1 1 1 1 2 2 1 2 2 2 1 1 1 1 1 2 1 1 1 1 2 2 2
-393BJjJj%%%%Jj%j%%J%%j%%J%j%%J%%%jjJJJkj%J%j%%J%%J%%%%jJJj%j%%%%%%%%J%%j%%J
-404B%%%%%%jJ%jj%JJ%%j%JKj%%j%%%%%%%J%%%%%%k%%%J%jjjJ%%J%%Jj%%%%jJ%%%JJj%jjJ
-414A%%%jJJ%%%%%%%%%%%j%%J%%%jjJJjJ%%%%j%%j%%Jj%JJ%%%J%%kjJJ%%J%jjJ%%JjjJ%%%
-425B%Jj%%jJ%%%%jJ%j%J%%%%%j%%%Jj%%%%%j%Jj%%%%%J%%%%%%%%jJ%Jj%j%%%%%JJJJj%jj
-436AK%jjjJ%%%J%%%%%J%%%j%%j%jJ%%Jj%%%%J%%%j%J%%%jjJ%J%%%%%%J%%j%%%Jj%%j%%JJ
-447Cj%j%%%%%j%%jJ%J%Kj%j%j%J%%%Jjj%j%JJJj%J%J%j%%%%%JJ%%j%%%jj%j%%%J%Jj%%J%
-458B%j%%%%%%J%j%jJ%%%jJ%J%jJ%%%%JjjJ%%J%j%j%Kj%%j%%%jJ%%j%%%J%%j%J%%%%%J%%%
-469B%%%%%%%j%%%%%jJ%J%%j%%%j%%J%J%jj%K%jjJ%%J%%%%j%%jJj%J%K%k%%%%%%%J%%%%%%
$$ plain form
-393 2 3 2 3 2 2 2 2 2 3 2 2 1 1 1 2 2 2 1 1 1 2 2 1 1 1 2 2 2 2 1 0 1 2 3 1 0 0 1 1 0 0 0 1 1 1 2 2 2 2 2 1 2 3 2 2 1 1 1 1 1 1 1 1 1 2 2 2 1 1 1 2
-404 2 2 2 2 2 2 2 1 2 2 1 0 0 1 2 2 2 1 1 2 4 3 3 3 2 2 2 2 2 2 2 2 3 3 3 3 3 3 3 1 1 1 1 2 2 1 0 -1 0 0 0 1 1 1 2 1 1 1 1 1 0 1 1 1 1 2 3 2 2 1 0 1
-414 1 1 1 1 0 1 2 2 2 2 2 2 2 2 2 2 2 2 1 1 1 2 2 2 2 1 0 1 2 1 2 2 2 2 2 1 1 1 0 0 0 1 0 0 1 2 2 2 2 3 3 3 1 0 1 2 2 2 3 3 2 1 2 2 2 3 2 1 2 2 2 2
-425 2 2 3 2 2 2 1 2 2 2 2 2 1 2 2 1 1 2 2 2 2 2 2 1 1 1 1 2 1 1 1 1 1 1 0 0 1 0 0 0 0 0 0 1 1 1 1 1 1 1 1 1 0 1 1 2 1 1 0 0 0 0 0 0 1 2 3 4 3 3 2 1
-436 1 3 3 2 1 0 1 1 1 1 2 2 2 2 2 2 3 3 3 3 2 2 2 1 1 0 1 1 1 2 1 1 1 1 1 2 2 2 2 1 1 2 2 2 2 1 0 1 1 2 2 2 2 2 2 2 3 3 3 2 2 2 2 3 2 2 2 1 1 1 2 3
-447 3 2 2 1 1 1 1 1 1 0 0 0 -1 0 0 1 1 3 2 2 1 1 0 0 1 1 1 1 2 1 0 0 -1 -1 0 1 2 1 1 2 2 3 3 2 2 2 2 2 2 3 4 4 4 3 3 3 3 2 1 1 0 0 0 0 1 1 2 1 1 1 2 2
-458 2 2 1 1 1 1 1 1 1 2 2 1 1 0 1 1 1 1 0 1 1 2 2 1 2 2 2 2 2 3 2 1 2 2 2 3 3 2 2 1 1 3 2 2 2 1 1 1 1 0 1 1 1 0 0 0 0 1 1 1 0 0 1 1 1 1 1 1 2 2 2 2
-469 2 2 2 2 2 2 2 2 1 1 1 1 1 1 0 1 1 2 2 2 1 1 1 1 0 0 0 1 1 2 2 1 0 0 2 2 1 0 1 1 1 2 2 2 2 2 1 1 1 0 1 0 0 1 1 3 3 1 1 1 1 1 1 1 1 2 2 2 2 2 2 2
-479B%%%%j%%%jJ%%%jJJ%j%%%J%%kkJJJj%%J%J%J%%%jj%%Jj%%jJ%%%%%%%%jjjJ%J%%J%%%%
-490AJ%%%%%j%%%%%%J%%%%%%j%j%J%%%J%J%jj%%%J%Jjj%%%%%%%%%J%j%%%JJj%j%j%jJJ%J%
-501B%j%jjJJJ%%jJ%%j%J%%%Jj%%j%%%jJ%%%%%Jj%%%j%%JJ%J%%j%%%jJ%%jJJj%%%%jj%J%%
-512A%J%%%%%%%%j%%%j%%J%%%%%J%%%jj%%J%%%Jj%JKj%jj%jJ%%%%J%%%%J%j%%jJ%%J%%j%j
-523A%jjJ%%%J%%J%%j%%%%%%%%J%jjJ%%%Jj%%j%%%J%j%J%%%%%%%J%%%%%J%%j%%jJ%J%%jJ%
-534Ck%jJJJ%J%kj%%%%%%%%%JJj%%%j%%J%Jjj%%%%%%%%%J%%%%%kJJJjj%%%%%%%J%%%%%%%%
-544B%%%j%%J%%%J%j%j%Jj%%j%KJj%%j%%%%%j%%%J%JJ%jj%JJjj%J%%%%%%%%j%%%%%%JjjJ%
-555AJ%k%JJK%j%j%%j%%j%%J%%%jJ%j%Jj%%%%%J%%%%%%%%%J%%J%j%jj%%%%%J%%%%%jJ%%%%
$$ plain form
-479 2 2 2 2 2 1 1 1 1 0 1 1 1 1 0 1 2 2 1 1 1 1 2 2 2 0 -2 -1 0 1 0 0 0 1 1 2 2 3 3 3 3 2 1 1 1 2 1 1 1 0 1 1 1 1 1 1 1 1 1 0 -1 -2 -1 -1 0 0 0 1 1 1 1 1
-490 1 2 2 2 2 2 2 1 1 1 1 1 1 1 2 2 2 2 2 2 2 1 1 0 0 1 1 1 1 2 2 3 3 2 1 1 1 1 2 2 3 2 1 1 1 1 1 1 1 1 1 1 2 2 1 1 1 1 2 3 2 2 1 1 0 0 -1 0 1 1 2 2
-501 2 2 1 1 0 -1 0 1 2 2 2 1 2 2 2 1 1 2 2 2 2 3 2 2 2 1 1 1 1 0 1 1 1 1 1 1 2 1 1 1 1 0 0 0 1 2 2 3 3 3 2 2 2 2 1 2 2 2 1 2 3 2 2 2 2 2 1 0 0 1 1 1
-512 1 1 2 2 2 2 2 2 2 2 2 1 1 1 1 0 0 0 1 1 1 1 1 1 2 2 2 2 1 0 0 0 1 1 1 1 2 1 1 2 4 3 3 2 1 1 0 1 1 1 1 1 2 2 2 2 2 3 3 2 2 2 1 2 2 2 3 3 3 2 2 1
-523 1 1 0 -1 0 0 0 0 1 1 1 2 2 2 1 1 1 1 1 1 1 1 1 2 2 1 0 1 1 1 1 2 1 1 1 0 0 0 0 1 1 0 0 1 1 1 1 1 1 1 1 2 2 2 2 2 2 3 3 3 2 2 2 1 2 2 3 3 3 2 3 3
-534 3 1 1 0 1 2 3 3 4 4 2 1 1 1 1 1 1 1 1 1 1 2 3 2 2 2 2 1 1 1 2 2 3 2 1 1 1 1 1 1 1 1 1 1 2 2 2 2 2 2 0 1 2 3 2 1 1 1 1 1 1 1 1 2 2 2 2 2 2 2 2 2
-544 2 2 2 2 1 1 1 2 2 2 2 3 3 2 2 1 1 2 1 1 1 0 0 2 3 2 2 2 1 1 1 1 1 1 0 0 0 0 1 1 2 3 3 2 1 1 2 3 2 1 1 2 2 2 2 2 2 2 2 2 1 1 1 1 1 1 1 2 1 0 1 1
-555 1 2 2 0 0 1 2 4 4 3 3 2 2 2 1 1 1 0 0 0 1 1 1 1 0 1 1 0 0 1 0 0 0 0 0 0 1 1 1 1 1 1 1 1 1 1 2 2 2 3 3 2 2 1 0 0 0 0 0 0 1 1 1 1 1 1 0 1 1 1 1 1
-566AJ%j%j%%J%%J%%j%%%%%J%j%%%%%%kJ%j%%%JJ%%j%J%%jj%J%%%J%%%%j%J%%j%%%JJj%%J
-577BJjj%%J%%%%%Jj%j%%%%%%j%K%Jj%%%%j%J%jJ%%jJ%j%%%%Jj%J%j%%%%%%Jj%%%%j%JjjJ
-588@J%%%jJJ%%%j%%%%%J%Jj%jjJJj%%J%Jj%%JJj%%%%j%%%j%%J%%%%%%j%%%%J%%%Jj%%j%%
-599A%%%%J%j%jJJjJ%j%%%J%%k%J%J%%%j%%j%%%J%%%%%J%%%jj%J%%%%%J%%%%j%%%%%%Jj%J
-609Bj%J%Jj%%j%j%J%%%%%jJ%%J%Jj%%j%jJ%%%%%j%J%JJ%%%%jk%%%%JJjj%%J%JJj%%jJjJ%
-620B%%%%%%%j%jJ%%%J%%%j%%%j%j%%KJk%J%J%j%%j%%JJj%%%%%%%J%%%%%%%%%Jj%%jJ%%%J
-631C%%j%%%j%%J%%%%JjJj%%j%jJ%%%J%%jJ%%%%jJJj%%%%Jj%%J%%jj%jJJ%%j%J%J%jj%%jJ
-642AJ%j%%%%jJJ%jJ%%Jjj%jj%J%JJjj%%J%JJ%Jjj%Jj%j%%Jj%%%%%%%%%j%JJ%%%%%%%%J%%
$$ plain form
-566 1 2 2 1 1 0 0 0 1 1 1 2 2 2 1 1 1 1 1 1 2 2 1 1 1 1 1 1 1 -1 0 0 -1 -1 -1 -1 0 1 1 1 0 0 1 1 1 0 -1 -1 0 0 0 0 1 1 1 1 1 0 0 1 1 1 0 0 0 0 1 2 1 1 1 2
-577 2 3 2 1 1 1 2 2 2 2 2 2 3 2 2 1 1 1 1 1 1 1 0 0 2 2 3 2 2 2 2 2 1 1 2 2 1 2 2 2 1 2 2 1 1 1 1 1 2 1 1 2 2 1 1 1 1 1 1 1 2 1 1 1 1 1 0 0 1 0 -1 0
-588 0 1 1 1 1 0 1 2 2 2 2 1 1 1 1 1 1 2 2 3 2 2 1 0 1 2 1 1 1 2 2 3 2 2 2 3 4 3 3 3 3 3 2 2 2 2 1 1 1 2 2 2 2 2 2 2 1 1 1 1 1 2 2 2 2 3 2 2 2 1 1 1
-599 1 1 1 1 1 2 2 1 1 0 1 2 1 2 2 1 1 1 1 2 2 2 0 0 1 1 2 2 2 2 1 1 1 0 0 0 0 1 1 1 1 1 1 2 2 2 2 1 0 0 1 1 1 1 1 1 2 2 2 2 2 1 1 1 1 1 1 1 2 1 1 2
-609 2 1 1 2 2 3 2 2 2 1 1 0 0 1 1 1 1 1 1 0 1 1 1 2 2 3 2 2 2 1 1 0 1 1 1 1 1 1 0 0 1 1 2 3 3 3 3 3 2 0 0 0 0 0 1 2 1 0 0 0 1 1 2 3 2 2 2 1 2 1 2 2
-620 2 2 2 2 2 2 2 2 1 1 0 1 1 1 1 2 2 2 2 1 1 1 1 0 0 -1 -1 -1 1 2 0 0 1 1 2 2 1 1 1 0 0 0 1 2 1 1 1 1 1 1 1 1 2 2 2 2 2 2 2 2 2 2 3 2 2 2 1 2 2 2 2 3
-631 3 3 3 2 2 2 2 1 1 1 2 2 2 2 2 3 2 3 2 2 2 1 1 0 1 1 1 1 2 2 2 1 2 2 2 2 2 1 2 3 2 2 2 2 2 3 2 2 2 3 3 3 2 1 1 0 1 2 2 2 1 1 2 2 3 3 2 1 1 1 0 1
-642 1 2 2 1 1 1 1 1 0 1 2 2 1 2 2 2 3 2 1 1 0 -1 -1 0 0 1 2 1 0 0 0 1 1 2 3 3 4 3 2 2 3 2 2 1 1 1 2 1 1 1 1 1 1 1 1 1 1 0 0 1 2 2 2 2 2 2 2 2 2 3 3 3
-653C%%j%Jjj%%jjJKJ%jj%%%%J%%%%j%%j%J%J%%%J%k%%%J%jjJ%%%%%J%%%j%%%%%J%j%%%j%
-664@J%%j%J%%%%%jJJjj%%%KJ%kjJ%%%%%%%%%%%%Jjj%JJ%jjJJ%%j%%%j%%%Jj%%JJ%j%%%%%
-674A%%j%%JJj%%%%%%J%%%%%%jJJ%jjJ%J%j%%%%jJ%%%%%%%%jJ%%%j%j%Jj%%JJ%%j%%%%%%%
-685A%%%Jj%%j%%J%%%%%j%J%%j%K%Jj%jk%JJ%%j%J%%%Jj%%J%%j%%J%Jj%%%j%%JJjjJj%J%%
-696B%jj%J%%%Jjj%JJ%jjJ%JjJ%JJkj%%%j%K%j%J%%%%j%%J%JjjKJj%jj%%J%%%%%%Jj%JjjJ
-707BJ%j%j%j%JJ%j%K%jJ%%%j%%%%jjJ%jJ%%%%%jJJ%%%j%%%%J%jJ%J%%jkJ%%%%%J%%k%JJ%
-718BJJjj%j%%%%j%%JJ%%%%%%%%jJjJJjjj%K%%j%J%%%kJ%%%%%%jjKJ%%j%%%JjjJ%%%%%%%J
-729B%%%%%%J%jj%%JJjj%Jj%%%%%%%%j%%jJJJ%Jj%%%%%%%%%%j%jJ%%%J%j%%%%J%%%%%%J%j
$$ plain form
-653 3 3 3 2 2 3 2 1 1 1 0 -1 0 2 3 3 2 1 1 1 1 1 2 2 2 2 2 1 1 1 0 0 1 1 2 2 2 2 3 3 1 1 1 1 2 2 1 0 1 1 1 1 1 1 2 2 2 2 1 1 1 1 1 1 2 2 1 1 1 1 0 0
-664 0 1 1 1 0 0 1 1 1 1 1 1 0 1 2 1 0 0 0 0 2 3 3 1 0 1 1 1 1 1 1 1 1 1 1 1 1 1 2 1 0 0 1 2 2 1 0 1 2 2 2 1 1 1 1 0 0 0 0 1 0 0 0 1 2 2 1 1 1 1 1 1
-674 1 1 1 0 0 0 1 2 1 1 1 1 1 1 1 2 2 2 2 2 2 2 1 2 3 3 2 1 2 2 3 3 2 2 2 2 2 1 2 2 2 2 2 2 2 2 2 1 2 2 2 2 1 1 0 0 1 0 0 0 1 2 2 2 1 1 1 1 1 1 1 1
-685 1 1 1 1 2 1 1 1 0 0 0 1 1 1 1 1 1 0 0 1 1 1 0 0 2 2 3 2 2 1 -1 -1 0 1 1 1 0 0 1 1 1 1 2 1 1 1 2 2 2 1 1 1 2 2 3 2 2 2 2 1 1 1 2 3 2 1 2 1 1 2 2 2
-696 2 2 1 0 0 1 1 1 1 2 1 0 0 1 2 2 1 0 1 1 2 1 2 2 3 4 2 1 1 1 1 0 0 2 2 1 1 2 2 2 2 2 1 1 1 2 2 3 2 1 3 4 3 3 2 1 1 1 2 2 2 2 2 2 2 3 2 2 3 2 1 2
-707 2 3 3 2 2 1 1 0 0 1 2 2 1 1 3 3 2 3 3 3 3 2 2 2 2 2 1 0 1 1 0 1 1 1 1 1 1 0 1 2 2 2 2 1 1 1 1 1 2 2 1 2 2 3 3 3 2 0 1 1 1 1 1 1 2 2 2 0 0 1 2 2
-718 2 3 4 3 2 2 1 1 1 1 1 0 0 0 1 2 2 2 2 2 2 2 2 2 1 2 1 2 3 2 1 0 0 2 2 2 1 1 2 2 2 2 0 1 1 1 1 1 1 1 0 -1 1 2 2 2 1 1 1 1 2 1 0 1 1 1 1 1 1 1 1 2
-729 2 2 2 2 2 2 2 3 3 2 1 1 1 2 3 2 1 1 2 1 1 1 1 1 1 1 1 1 0 0 0 -1 0 1 2 2 3 2 2 2 2 2 2 2 2 2 2 2 1 1 0 1 1 1 1 2 2 1 1 1 1 1 2 2 2 2 2 2 2 3 3 2
-739B%%Jj%%%%%%%%%%J%%%j%%j%%J%%%%j%%J%jJ%%%j%J%%%%j%j%JJj%jJ%j%j%J%JJ%%%%j%
-750A%%%%%%%%%j%%%%J%%%J%j%%%J%%%%%j%%j%%%%%%%J%%%%%J%%j%%%%Jjj%%J%J%%%%j%j%
-761@J%jJ%%J%%%Jj%%%j%%Jj%%%%%%%jJJ%j%%J%%j%%%%%J%%%%%j%%%%J%%j%%%%j%Kj%J%jJ
-772B%%j%%%%Jj%%%%j%%%%%%%J%JJjjJ%%JjjJ%%%%%%%%j%%%%%%%%%%%%J%%%%j%%%%%J%%%j
-783A%%%%j%%J%%%%Jj%J%J%j%jjJ%j%%%%%%%%J%%%J%%j%j%J%%%J%%J%j%%J%j%%j%j%%%%J%
-794A%%%%%%%%%J%%jj%jJJJ%%%%%j%%%%Jj%%J%%%%jjJ%%%%%%%j%%J%Jj%%J%j%%%%%%%%%%%
-804A%J%%j%J%%%%%j%%%%j%%J%Jj%J%j%J%%%%Jj%%%J%%%jjJ%j%%j%JJ%%%j%%Jj%%jjJJJjj
-815@%jJJ%%%%J%%%%%j%%%%JJj%%%%%%jj%J%%%JJ%%%j%kj%J%J%J%%%%j%j%%J%%%%%%%%%KJ
$$ plain form
-739 2 2 2 3 2 2 2 2 2 2 2 2 2 2 2 3 3 3 3 2 2 2 1 1 1 2 2 2 2 2 1 1 1 2 2 1 2 2 2 2 1 1 2 2 2 2 2 1 1 0 0 1 2 1 1 0 1 1 0 0 -1 -1 0 0 1 2 2 2 2 2 1 1
-750 1 1 1 1 1 1 1 1 1 1 0 0 0 0 0 1 1 1 1 2 2 1 1 1 1 2 2 2 2 2 2 1 1 1 0 0 0 0 0 0 0 0 1 1 1 1 1 1 2 2 2 1 1 1 1 1 2 1 0 0 0 1 1 2 2 2 2 2 1 1 0 0
-761 0 1 1 0 1 1 1 2 2 2 2 3 2 2 2 2 1 1 1 2 1 1 1 1 1 1 1 1 0 1 2 2 1 1 1 2 2 2 1 1 1 1 1 1 2 2 2 2 2 2 1 1 1 1 1 2 2 2 1 1 1 1 1 0 0 2 1 1 2 2 1 2
-772 2 2 2 1 1 1 1 1 2 1 1 1 1 1 0 0 0 0 0 0 0 0 1 1 2 3 2 1 2 2 2 3 2 1 2 2 2 2 2 2 2 2 2 1 1 1 1 1 1 1 1 1 1 1 1 1 2 2 2 2 2 1 1 1 1 1 1 2 2 2 2 1
-783 1 1 1 1 1 0 0 0 1 1 1 1 1 2 1 1 2 2 3 3 2 2 1 0 1 1 0 0 0 0 0 0 0 0 0 1 1 1 1 2 2 2 1 1 0 0 1 1 1 1 2 2 2 3 3 2 2 2 3 3 2 2 2 1 1 0 0 0 0 0 1 1
-794 1 1 1 1 1 1 1 1 1 1 2 2 2 1 0 0 -1 0 1 2 2 2 2 2 2 1 1 1 1 1 2 1 1 1 2 2 2 2 2 1 0 1 1 1 1 1 1 1 1 0 0 0 1 1 2 1 1 1 2 2 1 1 1 1 1 1 1 1 1 1 1 1
-804 1 1 2 2 2 1 1 2 2 2 2 2 2 1 1 1 1 1 0 0 0 1 1 2 1 1 2 2 1 1 2 2 2 2 2 3 2 2 2 2 3 3 3 3 2 1 2 2 1 1 1 0 0 1 2 2 2 2 1 1 1 2 1 1 1 0 -1 0 1 2 1 0
-815 0 0 -1 0 1 1 1 1 1 2 2 2 2 2 2 1 1 1 1 1 2 3 2 2 2 2 2 2 2 1 0 0 1 1 1 1 2 3 3 3 3 2 2 0 -1 -1 0 0 1 1 2 2 2 2 2 1 1 0 0 0 1 1 1 1 1 1 1 1 1 1 3 4
$$ [...]
-1912@
##END=		$$ NMR SPECTRUM
##END=		$$ LINK
