##TITLE=	RP135 vac frac.10.fid
##JCAMP-DX=	6.0	$$ MestReNova 14.3.3-33362
##DATA TYPE=	LINK
##BLOCKS=	1    
##ORIGIN=	Mestrelab Research S.L.
##OWNER=	hrzepa
##$MNOVA/METADATA=	(DOCUMENT,BASE64)
eyJuYW1lIjoiL1VzZXJzL2hyemVwYS9MaWJyYXJ5L01vYmlsZSBEb2N1bWVudHMvY29tfmFwcGxlfkN
sb3VkRG9jcy9TaGVwcGFyZC9OTVIgZmlsZXMgemlwcy0yL0IoT0MoQ0YzKTMpMy9CKE9DKENGMykzKT
MtQi9CKE9DKENGMykzKTMgLUIubW5vdmEiLCJwYWdlcyI6W3siaXRlbXMiOlsiMSIgICAgIF19XX0=
##TITLE=	RP135 vac frac.10.fid
##JCAMP-DX=	6.0	$$ MestReNova 14.3.3-33362
##DATA TYPE=	NMR SPECTRUM
##DATA CLASS=	XYDATA
##BLOCK_ID=	1
##ORIGIN=	Bruker BioSpin GmbH
##OWNER=	aea
##NUMDIM=	1
##$MNOVA/METADATA=	(ITEM,BASE64)
eyJhbmdsZSI6MCwiYXhlcyI6eyJ4Ijp7Im1heCI6MTguNTgyNzI5OTk5OTY0NjU2LCJtaW4iOi0yMTg
uNTgwOTIyNzcwMjc0NDR9LCJ5Ijp7Im1heCI6MTQ5MTY5LjI2NDY0ODQzNzUsIm1pbiI6LTEzNTg4Lj
A5NzAxNTM4MDg2fX0sInBvaW50cyI6W3sieCI6NTMyMSwieSI6NTgzNX0seyJ4Ijo4NzIyLCJ5Ijo1O
DM1fSx7IngiOjg3MjIsInkiOjgyMDh9LHsieCI6NTMyMSwieSI6ODIwOH0seyJ4Ijo1MzIxLCJ5Ijo1
ODM1fV0sInoiOjB9
##.OBSERVE FREQUENCY=	376.43249099749800735
##.OBSERVE NUCLEUS=	^19F
##.SOLVENT NAME=	None
##.PULSE SEQUENCE=	zgflqn
##LONGDATE=	2021/10/07 16:18:00.000
##.ACQUISITIONMODE=	SIMULTANEOUS (DQD)
##$ORIGINAL FORMAT=	Bruker XWIN-NMR
##$MNOVA/SCALES_VERSION=	9
##$PARAMETER FILE=	(acqus, ASCII, /private/var/folders/f6/rjf_tdyn2v98c5c0wvkgn4s80000gq/T/oLs9+IoMTcC+amoDmC8GjA/10/acqus, 0)
$$ ##TITLE= Parameter file, TOPSPIN		Version 3.2
$$ ##JCAMPDX= 5.0
$$ ##DATATYPE= Parameter Values
$$ ##NPOINTS= 1	$$ modification sequence number
$$ ##ORIGIN= Bruker BioSpin GmbH
$$ ##OWNER= aea
$$ $$ 2021-10-07 16:18:37.614 +0100  aea@chemb147
$$ $$ z:/400/data/tds/nmr/RP135 vac frac/10/acqus
$$ $$ process C:\Bruker\TopSpin\prog\mod\dirdata.exe
$$ ##$ACQT0= -9.32645761301902
$$ ##$AMP= (0..31)
$$ 100 100 100 100 100 100 100 100 100 100 100 100 100 100 100 100 100 100
$$ 100 100 100 100 100 100 100 100 100 100 100 100 100 100
$$ ##$AMPCOIL= (0..19)
$$ 0 0 0 0 0 0 0 0 0 0 0 0 0 0 0 0 0 0 0 0
$$ ##$ANAVPT= -1
$$ ##$AQSEQ= 0
$$ ##$AQ_mod= 3
$$ ##$AUNM= <au_zg>
$$ ##$AUTOPOS= <13 >
$$ ##$BF1= 376.470138011
$$ ##$BF2= 376.470138011
$$ ##$BF3= 376.470138011
$$ ##$BF4= 376.470138011
$$ ##$BF5= 376.470138011
$$ ##$BF6= 376.470138011
$$ ##$BF7= 376.470138011
$$ ##$BF8= 376.470138011
$$ ##$BYTORDA= 0
$$ ##$CAGPARS= (0..11)
$$ 0 0 0 0 0 0 0 0 0 0 0 0
$$ ##$CFDGTYP= 0
$$ ##$CFRGTYP= 9
$$ ##$CHEMSTR= <none>
$$ ##$CNST= (0..63)
$$ 1 1 1 1 1 1 1 1 1 1 1 1 1 1 1 1 1 1 1 1 1 1 1 1 1 1 1 1 1 1 1 1 1 1 1 1
$$ 1 1 1 1 1 1 1 1 1 1 1 1 1 1 1 1 1 1 1 1 1 1 1 1 1 1 1 1
$$ ##$CPDPRG= (0..8)
$$ <> <> <> <> <> <> <> <> <>
$$ ##$D= (0..63)
$$ 0 1 0 0 0 0 0 0 0 0 0 0 0 0 0 0 0.0002 0 0 0 0 0 0 0 0 0 0 0 0 0 0 0 0
$$ 0 0 0 0 0 0 0 0 0 0 0 0 0 0 0 0 0 0 0 0 0 0 0 0 0 0 0 0 0 0 0
$$ ##$DATE= 1633619914
$$ ##$DE= 6.5
$$ ##$DECBNUC= <off>
$$ ##$DECIM= 224
$$ ##$DECNUC= <off>
$$ ##$DECSTAT= 4
$$ ##$DIGMOD= 1
$$ ##$DIGTYP= 12
$$ ##$DQDMODE= 0
$$ ##$DR= 21
$$ ##$DS= 4
$$ ##$DSPFIRM= 0
$$ ##$DSPFVS= 20
$$ ##$DTYPA= 0
$$ [...]
$$ ##$Sgu3PowerLevels= (0..7)
$$ 0 0 0 0 0 0 0 0
$$ ##$Sgu4PowerLevels= (0..7)
$$ 0 0 0 0 0 0 0 0
$$ ##$Sgu5PowerLevels= (0..7)
$$ 0 0 0 0 0 0 0 0
$$ ##$Sgu6PowerLevels= (0..7)
$$ 0 0 0 0 0 0 0 0
$$ ##$Sgu7PowerLevels= (0..7)
$$ 0 0 0 0 0 0 0 0
$$ ##$Sgu8PowerLevels= (0..7)
$$ 0 0 0 0 0 0 0 0
$$ ##$SguType= 2
$$ ##$ShimPowMaxUA= (0..63)
$$ 130000 130000 130000 130000 130000 130000 130000 130000 130000 130000 130000
$$ 130000 130000 130000 130000 130000 130000 130000 130000 130000 0 0 0 0
$$ 0 0 0 0 0 0 0 0 0 0 0 0 0 0 0 0 0 0 0 0 0 0 0 0 0 0 0 0 0 0 0 0 0 0 0 0
$$ 0 0 0 0
$$ ##$ShimPowMaxUC= (0..63)
$$ 130000 130000 130000 130000 130000 130000 130000 130000 130000 130000 130000
$$ 130000 130000 130000 130000 130000 130000 130000 130000 130000 0 0 0 0
$$ 0 0 0 0 0 0 0 0 0 0 0 0 0 0 0 0 0 0 0 0 0 0 0 0 0 0 0 0 0 0 0 0 0 0 0 0
$$ 0 0 0 0
$$ ##$ShimPowMaxUG= (0..63)
$$ 524287 524287 524287 524287 524287 524287 524287 524287 524287 524287 524287
$$ 524287 524287 524287 524287 524287 524287 524287 524287 524287 0 0 0 0
$$ 0 0 0 0 0 0 0 0 0 0 0 0 0 0 0 0 0 0 0 0 0 0 0 0 0 0 0 0 0 0 0 0 0 0 0 0
$$ 0 0 0 0
$$ ##$ShimPowRcbType= 3
$$ ##$ShimPowRes= (0..63)
$$ 1e-020 1e-020 1e-020 1e-020 1e-020 1e-020 1e-020 1e-020 1e-020 1e-020 1e-020
$$ 1e-020 1e-020 1e-020 1e-020 1e-020 1e-020 1e-020 1e-020 1e-020 0 0 0 0
$$ 0 0 0 0 0 0 0 0 0 0 0 0 0 0 0 0 0 0 0 0 0 0 0 0 0 0 0 0 0 0 0 0 0 0 0 0
$$ 0 0 0 0
$$ ##$ShimPowRng0= (0..63)
$$ 1 1 1 1 1 1 1 1 1 1 1 1 1 1 1 1 1 1 1 1 0 0 0 0 0 0 0 0 0 0 0 0 0 0 0 0
$$ 0 0 0 0 0 0 0 0 0 0 0 0 0 0 0 0 0 0 0 0 0 0 0 0 0 0 0 0
$$ ##$ShimPowRng1= (0..63)
$$ 1 1 1 1 1 1 1 1 1 1 1 1 1 1 1 1 1 1 1 1 0 0 0 0 0 0 0 0 0 0 0 0 0 0 0 0
$$ 0 0 0 0 0 0 0 0 0 0 0 0 0 0 0 0 0 0 0 0 0 0 0 0 0 0 0 0
$$ ##$ShimPowRng2= (0..63)
$$ 1 1 1 1 1 1 1 1 1 1 1 1 1 1 1 1 1 1 1 1 0 0 0 0 0 0 0 0 0 0 0 0 0 0 0 0
$$ 0 0 0 0 0 0 0 0 0 0 0 0 0 0 0 0 0 0 0 0 0 0 0 0 0 0 0 0
$$ ##$ShimPowRng3= (0..63)
$$ 1 1 1 1 1 1 1 1 1 1 1 1 1 1 1 1 1 1 1 1 0 0 0 0 0 0 0 0 0 0 0 0 0 0 0 0
$$ 0 0 0 0 0 0 0 0 0 0 0 0 0 0 0 0 0 0 0 0 0 0 0 0 0 0 0 0
$$ ##$ShimSysFunc= (0..63)
$$ 1 2 3 4 5 7 9 11 15 16 8 10 12 14 6 17 13 18 19 20 0 0 0 0 0 0 0 0 0 0
$$ 0 0 0 0 0 0 0 0 0 0 0 0 0 0 0 0 0 0 0 0 0 0 0 0 0 0 0 0 0 0 0 0 0 0
$$ ##$ShimSysMatrix= 0
$$ ##$ShimSysType= 1
$$ ##$TFXNUM= 0
$$ ##$TRIPLO2= 0
$$ ##$VTU= 1
$$ ##$VTUETH= <no>
$$ ##$VTUTY= <tty05>
$$ ##$WBREFAM= (0..15)
$$ 268.6 116.5 100 100 100 100 100 100 100 100 100 100 100 100 100 100
$$ ##$WBREFLM= (0..15)
$$ 0 0 0 0 0 0 0 0 0 0 0 0 0 0 0 0
$$ ##$WBREFPH= (0..15)
$$ 86.23 -73.34 0 0 0 0 0 0 0 0 0 0 0 0 0 0
$$ ##$WBSGU= (0..15)
$$ 0 0 0 0 0 0 0 0 0 0 0 0 0 0 0 0
$$ ##$XFAC= 2
$$ ##END=
$$ 
##$DECIM=	224
##$DSPFVS=	20
##XUNITS=	HZ
##YUNITS=	ARBITRARY UNITS
##FIRSTX=	6995.8429277210962027
##LASTX=	-82289.190162052822416
##DELTAX=	-0.68119594029017793702
##XFACTOR=	1
##YFACTOR=	4.1385549867244479927
##FIRSTY=	2.496776580810546875
##MINY=	-27.4886932373046875
##MAXY=	135608.03125
##NPOINTS=	131072
##XYDATA=	(X++(Y..Y))
$$ [...]
$$ plain form
-14197 0 -2 -2 0 0 0 1 0 0 0 0 0 -1 -1 -2 -1 0 0 0 0 -1 -1 0 0 -1 -1 -1 -1 0 -1 0 0 -1 -2 0 -1 0 -1 0 -1 -1 0 0 -1 -1 -1 -1 0 -1 -2 -2 -1 -1 -1 -1 -1 -1 -1 -1 -1 -1 -1 -1 -1 0 -1 -1 -2 -1 0
-14244 0 0 0 -1 1 -1 0 0 0 0 0 0 0 0 0 0 0 0 0 -1 -1 -1 0 0 -1 0 0 -1 -1 -1 -1 -2 -1 0 0 0 -1 -1 1 0 0 -1 -1 -1 -1 -2 -1 -1 -1 -1 0 0 0 1 0 0 -2 -2 -1 -2 -1 0 -1 -1 -1 -1 0 0 0 0
-14291 0 0 0 0 -1 0 -1 -2 -2 -2 -1 -1 -1 -1 0 -1 -1 -2 -1 0 0 -1 -1 -1 0 0 -1 -2 -2 -1 -1 -1 -1 -1 -1 -1 -1 0 -1 0 0 0 0 0 0 0 -1 0 -1 -1 -1 -1 -2 -1 -1 -1 -1 0 0 0 -1 -1 0 -1 -1 0 0 0 -1 0
-14338 0 -1 -2 -1 -1 -1 -1 0 0 0 -1 -1 0 -2 -1 -1 -2 0 -1 0 -1 -1 -1 -1 -1 -1 0 -2 -1 -1 0 0 -2 -1 0 0 -1 -1 -1 -1 -1 -1 -1 -1 -1 -1 -1 -1 -1 -1 -1 -1 -1 -1 -1 -1 0 -2 -1 -1 -1 -1 0 0 -1 0 0 -1 -2 -1
-14385 -1 0 -1 -1 -1 -1 -1 -1 -1 -1 -1 -1 -2 -1 -2 -1 -2 -1 -2 -2 -2 -1 -1 0 -1 0 0 -1 -2 -1 0 0 -1 -1 -1 0 -1 -1 0 -1 -1 0 0 -1 -2 -2 -1 -1 -1 -1 -1 0 0 -1 -1 0 -1 0 0 -1 -1 -1 -2 -2 -2 -1 0 -1 -2 -1
-14432 -1 -1 -2 -1 -2 -2 1 1 0 0 -1 -2 0 -1 -1 0 -1 -1 -1 -1 -1 -2 -1 -1 1 0 -1 -1 -1 -1 -1 -1 -1 -1 -1 0 -1 -1 -2 -1 -1 0 -1 0 -2 -1 0 0 -1 -1 -1 -1 -1 -1 0 -2 -2 -1 -1 -1 -2 -1 -1 0 0 -1 -1 -1 -1 0
-14479 0 -1 0 -1 -1 0 0 -1 0 0 -1 -1 -1 -1 -1 -1 -1 -1 0 0 -1 -2 -3 -2 -2 0 0 -1 -1 -1 0 0 -1 -1 -1 0 -1 0 -1 -1 0 -1 0 0 0 0 0 0 -2 0 -1 -1 0 0 -2 -1 -1 -1 -1 0 0 -1 -2 -1 -1 -2 0 -1 -1 0
-14526 0 1 0 0 -1 -1 -1 -1 -1 0 0 -1 -1 -1 -1 -1 0 0 -1 -1 -1 0 0 0 -1 0 0 0 -1 -2 1 0 -2 0 -1 0 0 0 0 -1 -2 0 -1 -1 0 -1 -1 -1 0 -1 -1 0 -1 0 0 -1 0 -1 -2 -2 -1 -1 0 0 -1 -1 -1 0 -1 -1
$$ packed form
-14197@k%K%%Jj%%%%j%jJJ%%%j%J%j%%%JjJ%jjKjJjJj%J%j%%%Jjj%J%%%%%%%%%%%%Jj%jJJ
-14244@%%jKkJ%%%%%%%%%%%%j%%J%jJ%j%%%jJJ%%j%Kj%j%%%jJ%%%J%%Jj%k%JjJJj%%%J%%%
-14291@%%%jJjj%%J%%%Jj%jJJ%j%%J%jj%J%%%%%%%JjJ%%%%%%jJj%%%jJ%%%J%%j%Jj%J%%jJ
-14338@jjJ%%%J%%j%JkJ%jKjJj%%%%%JkJ%J%kJJ%j%%%%%%%%%%%%%%%%%%%JkJ%%%J%jJ%jjJ
-14385aJj%%%%%%%%%jJjJjJj%%J%JjJ%jjJJ%j%%Jj%Jj%J%jj%J%%%%J%j%JjJ%j%%j%%JJjjJ
-14432a%jJj%L%j%jjKj%Jj%%%%jJ%Kjj%%%%%%%%Jj%jJ%JjJkJJ%j%%%%%Jk%J%%jJ%J%j%%%J
-14479@jJj%J%jJ%j%%%%%%%J%jjjJ%K%j%%J%j%%JjJj%JjJ%%%%%kKj%J%kJ%%%J%jjJ%jKj%J
-14526@Jj%j%%%%J%j%%%%J%j%%J%%jJ%%jjLjkKjJ%%%jjKj%Jj%%Jj%JjJ%jJjj%J%J%j%%Jj%
$$ plain form
-14573 -1 -1 -2 -1 -1 0 -1 0 -1 0 -1 -1 -1 0 -1 -1 -1 -1 0 -1 -1 -1 -1 -1 -2 -1 -2 0 -2 -2 -1 0 -1 0 0 -1 -1 -1 -1 -1 -2 -1 0 -2 -2 -1 -1 -1 -1 -1 -1 -1 -1 -1 -1 -1 -1 0 0 -1 -1 0 0 -1 0 0 -1 -1 -1 -1
-14620 -1 -1 -1 -1 -1 -1 -1 -1 -1 -1 -1 -1 0 -1 -1 -1 0 0 -2 -2 0 -1 0 -1 -1 -1 -1 -1 -1 -2 -1 -1 -1 0 -1 0 -1 -1 -1 -3 -2 -1 0 -1 0 -2 -2 0 0 -1 0 -1 0 0 -1 0 0 0 -2 -1 0 -1 -2 -1 0 0 -1 0 -1 -1
-14667 -1 0 -1 -1 -3 -2 -1 -1 -1 0 0 0 0 0 0 0 0 -1 -1 -1 -1 0 0 -1 -1 -1 -1 -1 1 0 1 0 1 0 0 -1 -1 -1 -1 -1 0 -1 -1 -1 -1 -1 -1 -1 -1 -1 -1 -2 -2 0 -1 -1 1 -1 -2 0 0 0 0 -2 -1 -1 -1 -1 -1 -1
-14714 -1 0 -1 -2 -1 -1 0 -1 -1 0 0 0 0 -1 -1 -1 0 -1 -2 -1 0 -1 -1 -2 -2 0 -1 -1 -2 -1 -1 -1 0 0 -1 -1 -1 0 0 -1 -1 0 -1 -1 -1 -1 -1 -1 -1 0 -1 -1 -1 1 -1 -1 -1 -1 -1 0 0 0 -2 -1 -1 -1 -1 0 -1 -1
-14761 -1 0 0 0 0 1 -1 -1 -2 0 0 -1 0 0 0 0 0 0 -2 -2 0 0 -1 -2 0 -1 0 0 0 -1 0 0 -1 -2 -1 -1 -2 -1 0 0 -1 -1 0 -2 -1 -1 -1 -2 -1 -1 -1 -2 -1 0 -1 -2 -1 -1 -1 -2 -1 -1 -2 -1 -1 0 -1 -1 0 -1
-14808 -1 0 -1 -2 0 0 0 -1 -1 -1 0 0 0 -2 0 -1 -2 -1 0 -2 0 -1 -1 -1 -1 0 -2 0 0 -1 -2 -1 0 0 -1 -1 0 0 -1 -1 -1 -1 -2 -1 0 -1 -1 -1 -2 0 0 -1 0 -1 1 -1 -1 -1 -1 -1 0 -1 -1 -1 -1 -1 0 -1 -2 0
-14855 0 -1 -1 -1 0 -1 -2 -1 -1 -2 -1 -1 0 -1 -1 -1 -1 -2 -2 -2 -1 -1 -1 -1 -1 -1 0 -1 -2 -1 -2 -2 -1 -1 -1 -1 -1 0 0 -1 -1 -1 -1 -1 -1 -1 -1 -1 -1 -1 -1 -1 -1 -1 -1 0 0 0 0 -1 -1 -1 -1 -1 -1 0 0 -1 -1 -1
-14902 -1 -1 -1 -1 0 -2 0 0 0 0 0 -1 -1 -1 0 -1 -1 -1 0 -1 -1 -1 0 -2 0 -1 -1 0 -1 -1 0 -1 -1 -1 0 0 1 -1 0 1 0 -1 -1 -1 0 1 -1 -1 -1 -1 -1 0 0 -2 -2 -2 -1 -1 -1 -1 0 0 0 0 -1 -1 -1 -1 0 0
$$ packed form
-14573a%jJ%JjJjJj%%Jj%%%Jj%%%%jJjKk%JJjJ%j%%%%jJJk%J%%%%%%%%%%%J%j%J%jJ%j%%%
-14620a%%%%%%%%%%%Jj%%J%k%KjJj%%%%%jJ%%JjJj%%kJJJjJk%K%jJjJ%jJ%%kJJjjJJ%jJj%
-14667aJj%kJJ%%J%%%%%%%j%%%J%j%%%%KjJjJj%j%%%%Jj%%%%%%%%%j%Kj%KkjK%%%kJ%%%%%
-14714aJjjJ%Jj%J%%%j%%JjjJJj%j%Kj%jJ%%J%j%%J%j%Jj%%%%%%Jj%%Kk%%%%J%%kJ%%%Jj%
-14761aJ%%%Jk%jK%jJ%%%%%k%K%jjKjJ%%jJ%jjJ%jJJ%j%JkJ%%jJ%%jJJjjJ%%jJ%jJ%Jj%Jj
-14808aJjjK%%j%%J%%kKjjJJkKj%%%JkK%jjJJ%j%J%j%%%jJJj%%jK%jJjKk%%%%Jj%%%%JjjK
-14855@j%%JjjJ%jJ%Jj%%%j%%J%%%%%JjjJj%J%%%%J%j%%%%%%%%%%%%%%%J%%%j%%%%%J%j%%
-14902a%%%JkK%%%%j%%Jj%%Jj%%JkKj%Jj%Jj%%J%JkJJjj%%JJk%%%%J%k%%J%%%J%%%j%%%J%
$$ plain form
-14949 0 0 -1 0 -1 -1 -1 -1 -1 -1 0 0 -1 -2 -1 0 -1 -2 0 0 0 -1 -1 0 1 -1 0 -2 0 0 0 0 -1 -1 0 -1 -1 -1 -2 -1 -1 -1 -1 -1 -1 0 0 0 -1 -2 -1 -1 -1 -1 0 -1 -1 0 -1 -2 -2 -1 -1 0 -1 -2 -2 -2 -1 -1
-14996 -1 -1 -2 -1 0 0 0 0 -2 -2 0 -2 0 -1 0 -1 -1 0 -1 -1 -1 -2 -2 0 0 -1 -1 -1 -1 0 0 0 -1 -1 -1 -1 -1 0 -1 0 -1 -2 -1 1 0 -1 -1 -1 0 -1 -1 -1 -1 -1 -2 -1 -1 -1 -1 -1 -1 1 0 -1 -1 -1 -1 -1 -2 0
-15043 0 0 0 0 1 -1 -1 -1 -1 -2 -1 -1 -1 -1 -2 0 -1 0 0 0 -1 -2 -1 0 -1 -2 -2 -2 -1 0 0 0 -1 -1 -2 -1 -2 -1 -1 -1 -1 0 -1 -1 -1 -1 -1 -1 -1 0 0 -1 -1 0 -1 -1 -1 -1 -1 -1 -1 -1 -1 -1 0 0 0 0 0 -1
-15090 -1 0 -2 0 -1 -1 -2 -1 -1 0 -1 -1 -1 0 0 1 -1 -1 0 0 1 0 0 0 0 0 -1 0 0 -1 -1 0 -1 -2 -2 -1 -1 -1 -1 -1 -1 0 -1 -1 -1 -1 0 0 -3 -2 -2 -1 -1 -2 -1 0 0 -1 -2 -1 0 0 -1 -1 -1 0 0 -1 -2 0
-15137 0 -2 -1 -1 -1 0 0 -1 0 -1 0 -1 0 0 -1 -2 -1 -1 0 0 0 0 0 1 0 -1 -2 -1 -1 -1 -1 -1 -1 0 0 -1 -1 -1 0 -1 0 0 -2 -1 -1 -1 0 0 0 0 -1 -1 -1 -2 -2 0 -1 -1 -2 -2 -1 -1 0 0 -1 -1 0 1 -1 0
-15184 0 -2 -1 -1 -1 -1 0 0 0 -1 -2 0 -1 -2 0 -1 0 -1 -1 -1 -1 0 0 -1 -2 -2 -2 -1 0 -1 -1 -1 -1 0 0 0 0 -2 -1 -1 -1 0 0 0 0 0 -1 0 -1 -1 -1 0 0 -1 -1 -1 0 0 -1 0 -1 -1 -1 0 -1 -1 -1 -2 -1 -1
-15231 -1 -2 -1 -1 -1 0 -1 -2 -1 -1 -1 -1 -2 0 1 -1 0 -1 -2 -1 -2 -2 -1 -1 -1 -1 -1 -1 -1 -1 0 0 -1 -1 -1 -1 -1 -1 -2 -1 -1 -1 0 0 -2 -1 -1 -1 -1 0 0 0 -1 -1 0 -1 -1 0 -1 0 0 0 -1 0 0 -1 -1 0 0 -1
-15278 -1 -1 -2 0 1 0 -1 0 0 -1 -1 0 -1 -1 0 1 -1 -2 -1 -1 0 -1 0 -1 -1 -1 -1 -2 -1 0 0 -1 -1 -1 0 1 0 -1 -2 -2 0 0 0 -1 -1 -1 0 -1 -1 -1 -1 -1 -1 -1 0 -1 0 0 -1 -1 -1 -1 -1 -1 -1 0 0 0 0 0
$$ packed form
-14949@%jJj%%%%%J%jjJJjjK%%j%JJkJkK%%%j%Jj%%jJ%%%%%J%%jjJ%%%Jj%Jjj%J%Jjj%%J%
-14996a%jJJ%%%k%KkKjJj%Jj%%j%K%j%%%J%%j%%%%JjJjjJKjj%%Jj%%%%jJ%%%%%Kjj%%%%jK
-15043@%%%Jk%%%jJ%%%jKjJ%%jjJJjj%%JJ%%j%jJjJ%%%Jj%%%%%%J%j%Jj%%%%%%%%%J%%%%j
-15090aJkKj%jJ%Jj%%J%Jk%J%Jj%%%%jJ%j%Jjj%J%%%%%Jj%%%J%lJ%J%jJJ%jjJJ%j%%J%jjK
-15137@kJ%%J%jJjJjJ%jjJ%J%%%%JjjjJ%%%%%J%j%%JjJ%kJ%%J%%%j%%j%Kj%j%J%J%j%JJkJ
-15184@kJ%%%J%%jjKjjKjJj%%%J%jj%%JJj%%%J%%%kJ%%J%%%%jJj%%J%j%%J%jJj%%Jj%%jJ%
-15231ajJ%%JjjJ%%%jKJkJjjJj%J%%%%%%%J%j%%%%%jJ%%J%kJ%%%J%%j%Jj%JjJ%%jJ%j%J%j
-15278a%jKJjjJ%j%Jj%JJkjJ%JjJj%%%jJJ%j%%JJjjj%K%%j%%Jj%%%%%%JjJ%j%%%%%%J%%%%
$$ plain form
-15325 0 -1 -1 -1 -1 -1 -1 -1 -1 -1 -1 -1 -1 -2 -1 -1 -1 -1 -1 -1 0 -1 -1 0 -1 -1 -2 -1 -1 -1 0 -1 0 0 -1 -1 -1 -2 -2 -2 0 -1 -2 -3 -1 1 0 -1 -1 -1 -2 0 0 -1 -1 -2 -1 -1 0 -1 -1 0 -1 -2 -1 0 -3 0 -1 0
-15372 0 -1 -1 0 -2 -2 -1 -1 -1 -1 -1 -1 -1 -2 -1 -1 -1 -1 -2 -1 -1 -2 -1 -1 0 0 -1 0 0 -1 -2 -1 -1 -1 -2 -1 -1 -2 -1 0 -1 0 0 0 -1 -1 -1 -1 -1 0 -1 0 -1 0 -1 -1 -1 0 -1 0 0 -1 -1 -1 0 -1 0 0 -1 -1
-15419 -1 -1 -1 -1 -1 -2 -1 0 -1 -1 0 -1 -2 -1 -1 -1 1 0 -1 -1 -1 -1 -1 -2 -1 -2 0 0 -1 -1 0 0 -1 -1 -1 0 -2 -1 0 -1 -1 -1 -1 0 -1 -2 -1 0 -1 1 -1 0 1 -1 -1 -1 -1 -1 -1 0 -1 -1 -1 0 -1 -1 -1 -2 -1 -1
-15466 -1 -1 0 -1 -1 0 -2 -2 0 -1 -2 -1 -2 -2 -2 -1 -2 -1 -1 -2 0 -1 0 0 0 0 0 0 -1 0 -1 -1 -1 0 0 0 0 -1 -1 0 -1 -1 -2 -2 -1 -1 -1 -1 -1 -1 -1 -1 1 0 0 0 -1 1 -1 -1 1 -1 -2 -2 -1 -1 -1 -1 0 1
-15513 1 0 -1 -1 0 0 1 0 0 -1 -1 -1 0 0 0 -1 0 -1 -2 0 0 -1 -1 -2 -1 -1 -2 -1 0 -2 -1 -1 0 0 -1 -1 0 -1 -1 0 0 -2 0 -1 -1 -1 0 -1 -1 -1 -2 -1 -1 -1 -1 -1 -1 -1 0 0 -1 -1 -2 0 0 -1 0 -1 -1 -1
-15560 -1 -1 -1 -1 -1 -1 0 -1 -1 -1 -1 -1 -1 -1 -1 -1 0 0 -1 -1 -1 -1 -1 0 -2 -1 -2 -2 -2 -1 0 -1 -2 -2 -3 -2 0 -1 -1 -1 -1 -1 -1 -1 -1 -1 -1 0 -1 -1 0 -1 0 0 -1 -1 -1 0 0 0 -1 -1 -1 -2 -1 -1 -1 0 -1 -1
-15607 -1 -1 -1 -1 -1 -1 -1 -1 0 -1 -1 -1 -1 0 0 -1 -1 0 0 0 0 0 -1 -1 -1 -1 -2 -1 -1 -1 -1 -1 -1 0 0 0 0 -1 0 -1 -1 -1 -1 0 -1 -1 0 0 0 -1 0 -1 0 0 -1 -1 -1 -1 0 0 0 -1 0 -1 -1 0 0 -1 0 -1
-15654 -1 -2 -2 -2 -1 -1 0 -2 -2 -1 0 -1 -1 -1 -1 0 -1 -1 -1 1 0 0 -1 -1 -1 -1 -1 -1 -1 -1 0 0 -1 -2 -1 -1 -2 -1 -1 -1 0 0 0 -1 -2 -1 0 -1 -1 -1 -1 -2 -1 -2 -1 0 -1 0 0 0 0 0 -1 0 0 1 -1 -1 0 -1
$$ packed form
-15325@j%%%%%%%%%%%jJ%%%%%Jj%Jj%jJ%%JjJ%j%%j%%KjjjKKjj%%jK%j%jJ%Jj%JjjJJlLjJ
-15372@j%Jk%J%%%%%%jJ%%%jJ%jJ%J%jJ%jjJ%%jJ%jJJjJ%%j%%%%JjJjJj%%JjJ%j%%JjJ%j%
-15419a%%%%jJJj%JjjJ%%Kjj%%%%jJjK%j%J%j%%JkJJj%%%JjjJJjKkJJk%%%%%Jj%%Jj%%jJ%
-15466a%Jj%Jk%KjjJj%%JjJ%jKjJ%%%%%jJj%%J%%%j%Jj%j%J%%%%%%%Kj%%jKk%Kkj%J%%%JJ
-15513Ajj%J%Jj%j%%J%%jJjjK%j%jJ%jJJkJ%J%j%Jj%J%kKj%%Jj%%jJ%%%%%%J%j%jK%jJj%%
-15560a%%%%%Jj%%%%%%%%J%j%%%%JkJj%%JJjj%jJKj%%%%%%%%%Jj%JjJ%j%%J%%j%%jJ%%Jj%
-15607a%%%%%%%Jj%%%J%j%J%%%%j%%%jJ%%%%%J%%%jJj%%%Jj%J%%jJjJ%j%%%J%%jJj%J%jJj
-15654aj%%J%Jk%JJj%%%Jj%%Kj%j%%%%%%%J%jjJ%jJ%%J%%jjJJj%%%jJjJJjJ%%%%jJ%Jk%Jj
$$ plain form
-15701 -1 -1 0 -1 -1 0 0 0 -2 -2 -1 0 0 -1 -1 0 -1 -1 -1 -1 -1 -1 -2 -1 -1 0 -1 -1 0 0 -2 0 -1 -1 -1 -1 -1 -1 -1 0 -1 -1 -1 0 -1 0 -1 -1 -1 0 0 0 -2 -1 -1 -1 -1 -1 -1 -1 -1 -1 -1 -1 -1 -1 -1 -1 -1 0
-15748 0 0 -1 -1 -1 0 0 -1 -1 -1 -1 -2 0 -1 -1 -1 0 0 1 -1 -1 0 -1 -2 -1 -1 -1 -2 -2 -2 -2 -1 0 -1 0 -1 -1 -1 -1 -1 0 -2 -1 0 -2 -2 -1 -1 -1 0 0 0 -2 -1 -1 0 0 -1 -1 0 -1 -1 -1 -1 0 0 0 -2 -1 0
-15795 0 0 -1 0 1 0 1 0 -1 0 0 0 -2 -1 -2 -1 -1 0 0 -1 0 0 0 -1 -1 -1 -1 0 -1 0 0 0 -1 -1 -1 -1 -1 -2 -1 -1 -1 -1 -1 -1 -1 0 -1 0 -1 -1 -1 -1 -1 0 1 0 0 0 0 0 -1 -1 -2 -1 -1 -1 -1 -1 0 -1
-15842 -1 -2 -1 0 0 -1 -1 0 -1 -1 -1 -1 -1 -2 -1 -1 -1 1 0 -1 0 -1 0 0 -1 -1 -1 -1 -1 -1 -1 -1 -1 -1 -1 -1 -1 -1 -1 -1 -1 0 0 0 1 0 -1 0 -1 -1 -1 -1 -1 -1 -1 -1 -1 -1 -1 0 -1 -1 -1 -1 -1 -1 0 -1 -2 -2
-15889 -2 -1 -1 0 -1 0 -1 0 -1 -1 -1 0 -1 0 -2 0 0 0 -1 -1 -2 -1 -1 -1 -1 -1 0 -1 -1 0 -1 -1 -1 -1 -1 0 0 -2 -1 -1 0 -1 -1 0 -1 -1 -1 0 -1 -1 0 1 0 -1 -1 0 -1 -1 -2 -1 -1 -1 -1 -2 -1 -1 -1 0 -1 -1
-15936 -1 -2 -1 -2 -1 -1 0 -1 -1 -1 0 0 1 0 0 -1 1 0 0 0 -2 -1 -1 1 0 1 0 0 0 -2 -1 0 1 -1 -1 -1 0 -1 -1 0 0 0 0 -1 -1 0 0 -1 -1 -1 0 0 -1 -1 -1 -1 0 -1 0 -1 0 -1 -1 -1 -2 -1 1 1 -1 -1
-15983 -1 0 -1 -1 -1 -1 -1 -1 -1 -1 0 0 -1 -1 0 -2 -2 -1 1 -1 -2 -3 -2 -1 0 -1 -1 -1 -1 0 0 0 0 0 0 -2 -1 -2 -2 -2 0 0 -1 -1 -1 -1 -2 -2 -2 -1 -1 -1 -1 1 1 -1 0 -1 -1 -1 -2 -2 -2 -1 -1 0 0 -1 -2 -4
-16030 -4 -1 -1 -1 0 0 -1 -2 0 0 0 0 -1 -1 -1 -1 -1 -1 -1 -1 0 -1 0 -1 -1 -1 -1 -1 -1 0 -1 -2 -2 -1 -1 -1 -2 -1 -1 0 -2 -2 -1 -1 -1 -1 -1 -2 -1 -1 -1 -1 -1 -1 -1 -1 -1 -1 -1 -1 -1 0 0 -1 1 0 -1 -1 -2 -1
$$ packed form
-15701a%Jj%J%%k%JJ%j%Jj%%%%%jJ%Jj%J%kKj%%%%%%Jj%%JjJj%%J%%kJ%%%%%%%%%%%%%%%J
-15748@%j%%J%j%%%jKj%%J%Jk%JjjJ%%j%%%JJjJj%%%%JkJJk%J%%J%%kJ%J%j%Jj%%%J%%kJJ
-15795@%jJJjJjjJ%%kJjJ%J%jJ%%j%%%JjJ%%j%%%%jJ%%%%%%JjJj%%%%JJj%%%%j%jJ%%%%Jj
-15842ajJJ%j%Jj%%%%jJ%%KjjJjJ%j%%%%%%%%%%%%%%%%J%%JjjJj%%%%%%%%%%Jj%%%%%Jjj%
-15889bJ%JjJjJj%%JjJkK%%j%jJ%%%%Jj%Jj%%%%J%kJ%Jj%Jj%%Jj%JJjj%Jj%jJ%%%jJ%%Jj%
-15936ajJjJ%Jj%%J%Jj%jKj%%kJ%KjJj%%kJJJk%%Jj%J%%%j%J%j%%J%j%%%JjJjJj%%jJK%k%
-15983aJj%%%%%%%J%j%Jk%JKkjjJJJj%%%J%%%%%kJj%%K%j%%%j%%J%%%K%kJj%%j%%J%J%jjk
-16030dL%%J%jjK%%%j%%%%%%%JjJj%%%%%Jjj%J%%jJ%Jk%J%%%%jJ%%%%%%%%%%%%J%jKjj%jJ
$$ plain form
-16077 -1 0 -1 -2 -1 -1 -1 0 0 -1 -1 0 -1 -1 -1 0 -1 -1 -2 -2 -1 -1 0 0 -1 -1 0 -1 -1 -1 -1 0 0 0 -1 0 0 -1 -1 0 0 0 0 -1 0 0 -1 -1 -1 -1 -2 -1 -1 1 -2 -2 -2 -1 -1 -1 -1 -1 -1 -1 -1 -1 -1 -2 -1 -2
-16124 -2 -1 -1 -1 0 0 0 0 1 1 0 0 0 -1 -1 0 -1 -1 0 0 -2 0 -1 -2 0 0 -1 -1 -1 -1 -1 0 -1 0 0 -1 0 -1 -1 -1 -1 0 0 -1 -1 -1 -1 -1 0 0 -1 0 0 0 -1 -2 -1 -1 0 -1 -1 -1 0 -1 0 0 -1 0 -1 -1
-16171 -1 -1 -1 0 -1 -1 1 0 -2 -1 -1 -1 -2 -1 -1 -1 0 -1 0 -1 -1 -1 -1 -1 0 -1 0 0 -1 -1 -1 -1 0 -1 -1 0 -1 -1 -1 0 0 -2 -1 0 0 0 -1 0 -1 0 0 -1 0 0 0 0 -1 -1 -1 0 0 -1 0 -1 -2 -1 -1 -2 0 -2
-16218 -2 -2 -2 -1 0 -1 -1 -1 -1 -2 0 0 0 -1 -1 -1 -2 -1 0 -1 -1 -1 -1 0 -1 -2 0 0 0 -1 -1 -1 0 -1 -2 -1 0 0 -1 -1 -1 -1 -1 -1 -2 -2 -1 -1 -1 -1 -2 -1 0 0 0 -1 0 -1 -2 -2 -2 0 -1 1 0 -1 0 -1 0 -1
-16265 -1 -1 -1 -1 0 -1 -2 -1 -1 -1 -1 -2 -1 -1 -2 -1 -1 0 -1 -1 -1 -1 0 -1 -1 -1 0 -2 0 0 -1 -1 0 0 -1 -1 0 1 0 -1 -1 -2 -1 -1 0 -1 -1 -1 -1 -1 0 0 0 -1 -1 -1 -1 -2 -1 -1 0 -1 -1 -2 -1 1 -1 -1 -1 -1
-16312 -1 0 -2 -1 -1 1 1 0 -1 0 0 0 0 -1 -2 -2 -2 -1 -1 -1 -1 0 0 -1 0 -1 -2 0 0 -1 -1 -1 -1 0 -1 -2 -2 -2 -1 0 0 -1 -1 -1 -1 -1 -1 -1 -1 -1 -1 0 -2 0 -1 0 -2 -1 -1 -1 -1 -1 -1 0 -1 0 0 0 -2 -2
-16359 -2 -1 -1 -2 0 0 -2 -1 0 0 0 -1 0 -1 0 0 -1 -1 -1 -1 -1 -1 -1 -1 -1 0 0 1 -2 -2 -1 -1 -1 -1 0 -1 -1 -1 -1 0 -1 -1 -1 0 -1 -1 -1 -1 -1 -1 0 0 -1 -1 -1 -1 -1 -1 0 -1 -1 -1 -1 -1 -1 -1 -1 -1 -2 -2
-16406 -2 -1 -1 0 0 0 0 0 -1 -2 0 -1 -1 0 -1 -1 0 -1 0 -1 -1 -1 -2 -1 -1 -1 -2 -1 -1 -1 -1 -1 -1 -1 -1 -1 -2 -1 -1 -1 -1 -1 -1 -1 -1 -1 -1 -1 0 -1 0 -2 1 -1 -1 -1 -2 -2 -2 -1 0 0 0 -1 -2 -1 -1 -2 -2 -2
$$ packed form
-16077aJjjJ%%J%j%Jj%%Jj%j%J%J%j%Jj%%%J%%jJ%j%J%%%jJ%j%%%jJ%Kl%%J%%%%%%%%%jJj
-16124bJ%%J%%%J%j%%j%Jj%J%kKjjK%j%%%%JjJ%jJj%%%J%j%%%%J%jJ%%jjJ%Jj%%JjJ%jJj%
-16171a%%Jj%KjkJ%%jJ%%JjJj%%%%JjJ%j%%%Jj%Jj%%J%kJJ%%jJjJ%jJ%%%j%%J%jJjjJ%jKk
-16218b%%JJj%%%jK%%j%%jJJj%%%JjjK%%j%%JjjJJ%j%%%%%j%J%%%jJJ%%jJjj%%KjKjjJjJj
-16265a%%%JjjJ%%%jJ%jJ%Jj%%%Jj%%JkK%j%J%j%JJjj%jJ%Jj%%%%J%%j%%%jJ%Jj%jJKk%%%
-16312aJkJ%K%jjJ%%%jj%%J%%%J%jJjjK%j%%%Jjj%%JJ%j%%%%%%%%%JkKjJkJ%%%%%JjJ%%k%
-16359bJ%jK%kJJ%%jJjJ%j%%%%%%%%J%Jl%J%%%Jj%%%Jj%%Jj%%%%%J%j%%%%%Jj%%%%%%%%j%
-16406bJ%J%%%%jjKj%Jj%JjJj%%jJ%%jJ%%%%%%%%jJ%%%%%%%%%%JjJkLk%%j%%JJ%%jjJ%j%%
$$ plain form
-16453 -2 -1 -1 -1 -1 -1 -1 0 -1 -1 -2 -2 0 0 -1 -1 -2 0 0 0 -2 -1 0 0 -1 -1 0 0 0 0 -1 -2 0 0 0 0 -1 -1 -1 -2 -1 -1 -1 0 -1 -2 -1 -1 -1 -1 -1 -1 0 -1 0 -1 0 -1 -1 0 0 0 0 -1 0 -1 -2 0 0 0
-16500 0 -1 0 1 0 -1 0 -2 -1 0 -2 -2 -1 -1 0 0 -1 -1 -1 0 -1 -1 -1 -1 0 -1 0 -1 0 0 0 1 0 1 0 -1 -1 -1 -2 0 0 0 0 -1 -1 0 -1 -2 -1 0 0 -1 -1 -1 -1 -1 -1 0 -1 0 -2 0 0 -1 0 0 0 0 0 -1
-16547 -1 -2 -2 -2 -1 -1 -1 0 -1 -1 -1 -2 -1 -2 -2 -2 -1 -1 0 -1 -1 -1 -1 -1 -1 -2 -1 -2 -1 0 -1 -1 0 0 -2 -1 -2 -2 -1 -1 1 0 -1 0 0 -1 -1 -2 -1 0 -1 1 -1 -1 0 0 -1 -1 -1 0 0 -1 -1 -1 0 -1 0 -1 0 -1
-16594 -1 -1 -1 -1 0 -1 -1 -1 -1 -1 -1 -1 0 -1 -2 -1 0 -1 0 0 -1 0 -1 -1 0 -1 -1 0 0 -1 0 0 0 -1 -1 -1 -1 -1 0 0 0 -2 -1 -1 -1 -2 0 0 0 0 0 -1 -1 -1 -1 -1 -1 -1 -2 -1 0 -1 -1 -1 -1 -2 0 -1 -2 -1
-16641 -1 -1 -2 -2 -1 -2 -2 -1 -1 -1 0 -1 -1 -1 -1 -1 0 -1 -1 -1 -1 -1 -1 -1 -1 0 -1 0 -1 -1 0 -1 -2 -2 -1 0 -1 -2 -1 -1 -2 -1 -1 -1 -1 -1 -1 -1 -2 -1 1 0 0 -1 0 0 -1 -1 -1 -2 -1 -1 -2 0 0 1 0 -1 -1 -1
-16688 -1 -1 -1 0 -1 -2 -1 -1 -2 -1 0 -1 -1 -2 -1 -2 0 -1 -1 -1 0 0 -1 0 0 0 -2 -1 0 -2 -1 -1 -1 -1 -1 -2 -1 -1 -2 -1 -1 -1 -1 -2 -2 -1 -1 -2 -1 -1 0 -1 -2 -2 -2 -1 -1 -1 -2 -1 0 1 0 -1 -2 -1 -2 0 -1 1
-16735 1 -1 -1 0 -1 -1 -1 -2 -2 -1 -1 -1 -1 0 0 0 0 -1 0 -2 -1 -1 -1 -1 -2 -1 0 0 0 -1 0 0 0 -1 -1 -1 -1 -1 -2 -1 -1 -1 -1 -1 -1 0 -1 -2 -1 0 0 0 0 -2 -1 0 -1 -1 -1 0 1 -1 -1 -1 -1 -1 -1 0 -1 0
-16782 0 -2 0 0 0 0 -1 -2 -1 0 -1 -2 -2 0 -1 -1 -1 0 -2 -2 0 0 0 -1 -1 -1 -1 -2 -2 -2 -2 0 -1 -1 -1 -1 -2 -1 -1 -2 -2 -1 -1 -2 -1 0 -1 -1 -1 -1 -1 -2 -1 -1 -1 0 -1 -1 -1 -1 -1 -1 0 1 -1 -1 0 -1 0 -1
$$ packed form
-16453bJ%%%%%Jj%j%K%j%jK%%kJJ%j%J%%%jjK%%%j%%jJ%%JjjJ%%%%%JjJjJj%J%%%jJjjK%%
-16500@jJJjjJkJJk%J%J%j%%Jj%%%JjJjJ%%JjJjj%%jK%%%j%JjjJJ%j%%%%%JjJkK%jJ%%%%j
-16547aj%%J%%Jj%%jJj%%J%Jj%%%%%jJjJJj%J%kJj%J%KjjJ%j%jJJjKk%J%j%%J%j%%JjJjJj
-16594a%%%Jj%%%%%%JjjJJjJ%jJj%Jj%J%jJ%%j%%%%J%%kJ%%jK%%%%j%%%%%%jJJj%%%jKjjJ
-16641a%j%Jj%J%%Jj%%%%Jj%%%%%%%JjJj%Jjj%JJjjJ%jJ%%%%%%jJKj%jJ%j%%jJ%jK%Jjj%%
-16688a%%JjjJ%jJJj%jJjKj%%J%jJ%%kJJkJ%%%%jJ%jJ%%%j%J%jJ%Jjj%%J%%jJJJjjjJjKjK
-16735Ak%Jj%%j%J%%%J%%%jJkJ%%%jJJ%%jJ%%j%%%%jJ%%%%%JjjJJ%%%kJJj%%JJk%%%%%JjJ
-16782@kK%%%jjJJjj%Kj%%Jk%K%%j%%%j%%%Kj%%%jJ%j%J%jJJj%%%%jJ%%Jj%%%%%JJk%JjJj
$$ plain form
-16829 -1 -1 0 -1 -1 -1 -1 0 -1 -1 1 -1 0 0 0 0 1 0 0 0 -2 -1 -1 -1 -1 -1 -1 -1 -1 -1 -2 -1 -1 0 -1 -2 -1 -1 -2 -1 0 0 -1 -2 0 0 0 -1 -1 -1 -1 -1 0 0 0 0 -2 -1 -1 -1 -1 -1 -1 -1 -1 0 0 0 0 0
-16876 0 1 -1 -2 -1 -3 -1 -1 0 -1 0 0 0 0 0 0 0 -1 -2 -1 -1 -1 -1 -1 0 0 -1 0 0 -1 -2 -1 0 0 -2 0 -1 -1 0 -1 0 0 -1 0 -1 -1 -1 0 0 0 -1 1 1 0 -1 0 0 0 0 -1 -1 -1 0 -1 -1 -1 0 -1 -1 -1
-16923 -1 0 -1 -1 0 -1 -1 -1 -1 -1 0 0 -2 -2 -1 -1 -1 -2 -1 0 -2 -1 -1 0 0 0 -1 -1 -1 -2 -1 -1 -1 -1 0 0 -1 0 0 -1 -2 -1 -2 -1 -1 0 -1 -1 0 0 0 -1 0 -1 -2 -1 -1 -1 -1 0 0 -1 -1 -1 -2 0 -1 -1 -2 -1
-16970 -1 -1 -2 -2 0 -1 0 -1 -1 -1 -1 -2 -1 0 -1 -1 -1 1 0 0 -1 -1 0 0 0 0 0 0 0 -1 -1 -1 -1 -1 -1 0 -1 -1 -1 -1 0 -1 -1 -1 -1 -1 -1 0 -1 -1 -1 -1 -2 -2 -2 -1 -1 -2 -1 -1 0 0 -1 -2 0 0 0 0 0 -1
-17017 -1 -2 -1 1 -2 -1 0 -1 0 0 0 0 0 0 -1 0 0 0 0 0 -1 -2 -2 -1 -1 -2 -1 0 -1 -2 -1 -1 -1 -1 0 1 0 -1 -1 -1 -1 -1 -1 -1 -1 0 -1 1 -1 -1 -2 -1 -1 -1 -1 -1 -1 -1 -1 -1 0 -1 0 -1 -1 0 0 -1 -1 -1
-17064 -1 -1 -2 -1 -1 -1 0 0 0 0 -1 -1 -1 -1 -1 -1 -1 -1 -1 -1 -1 -1 -1 -1 -1 -1 -1 -1 0 -1 -1 -2 -2 -2 -2 -2 -1 -1 -1 -1 -1 -1 -1 -1 -1 0 -1 -1 -1 -2 -1 -1 -1 -1 0 -1 0 -1 -1 0 -1 0 -2 -1 0 -1 -1 -1 0 -1
-17111 -1 -2 -1 -1 -1 -1 -1 -2 -1 -1 0 -1 -1 1 1 -1 0 0 0 0 -1 0 0 0 -1 -1 -1 -1 -1 -1 -1 -1 -1 0 -1 0 -1 -1 0 -1 -1 0 -1 -1 1 -1 0 -2 -2 0 -1 -1 0 -1 -1 -1 -1 -1 -1 -1 -1 -1 -2 -1 -1 -2 -1 -1 -1 -1
-17158 -1 -1 -2 -2 -1 0 0 0 0 -1 -1 -1 0 -1 -1 -1 -1 0 -1 -1 0 0 -1 0 0 -1 -1 0 1 -1 0 1 -2 -1 -1 -1 -1 0 0 -1 1 0 -1 -1 0 0 0 -1 -1 -1 -1 0 0 -1 -1 -1 -1 0 0 0 0 0 0 0 -1 -1 0 1 -1 0
$$ packed form
-16829a%Jj%%%Jj%KkJ%%%Jj%%kJ%%%%%%%%jJ%JjjJ%jJJ%jjK%%j%%%%J%%%kJ%%%%%%%J%%%%
-16876@JkjJkK%JjJ%%%%%%jjJ%%%%J%jJ%jjJJ%kKj%JjJ%jJj%%J%%jK%jjJ%%%j%%Jj%%Jj%%
-16923aJj%Jj%%%%J%k%J%%jJJkJ%J%%j%%jJ%%%J%jJ%jjJjJ%Jj%J%%jJjjJ%%%J%j%%jKj%jJ
-16970a%j%KjJj%%%jJJj%%Kj%j%J%%%%%%j%%%%%Jj%%%Jj%%%%%Jj%%%j%%J%jJ%J%jjK%%%%j
-17017ajJKlJJjJ%%%%%jJ%%%%jj%J%jJJjjJ%%%JJjj%%%%%%%JjKk%jJ%%%%%%%%JjJj%J%j%%
-17064a%jJ%%J%%%j%%%%%%%%%%%%%%%%%Jj%j%%%%J%%%%%%%%Jj%%jJ%%%JjJj%JjJkJJj%%Jj
-17111ajJ%%%%jJ%Jj%K%kJ%%%jJ%%j%%%%%%%%JjJj%Jj%Jj%KkJk%Kj%Jj%%%%%%%%jJ%jJ%%%
-17158a%j%JJ%%%j%%Jj%%%Jj%J%jJ%j%JJkJJlJ%%%J%jKjj%J%%j%%%J%j%%%J%%%%%%j%JJkJ
$$ plain form
-17205 0 0 -1 0 -2 -1 -1 -1 -1 -2 0 0 0 -1 0 -2 -1 -1 -1 0 -1 -1 -1 0 0 -1 -2 -1 -1 -1 -1 -2 0 -1 -1 -1 -2 -1 0 -1 0 0 0 -1 -2 0 0 0 0 -1 -2 -1 -1 -2 -2 -2 0 -1 0 -1 -1 0 -1 -1 -1 -1 -1 0 -1 -2
-17252 -2 -1 -1 -1 0 -2 -1 -1 0 -1 -2 -2 -2 -1 -2 -1 -1 -1 0 -2 -2 -2 -1 -1 0 -2 -2 -1 -1 -1 -1 -1 -1 -1 -1 -2 0 -1 -1 -2 -2 0 -1 -1 -1 -1 0 0 -1 -1 -1 -1 -2 0 -1 -1 -1 -1 -1 -1 -1 -1 -1 -2 -2 0 -1 -1 -1 -1
-17299 -1 -1 -1 0 0 0 0 -1 -1 -1 -1 -1 0 -1 -1 -1 -1 -1 -1 -1 -1 -1 -1 0 -1 -1 -1 -1 0 0 0 -1 -1 -2 -2 0 0 -2 -1 -1 -1 -1 -2 0 0 -1 -1 -1 -1 -1 -1 0 -1 -2 -1 -2 0 0 0 0 -1 -1 -1 -1 -2 0 -2 -1 -2 -1
-17346 -1 -1 0 -1 -1 0 0 -1 -1 -1 0 0 0 0 -1 -1 -1 -1 0 -1 -2 -1 -1 -1 -1 -1 -1 0 -1 -1 -1 -1 -1 -1 -2 -1 -1 -1 -2 -1 0 0 -1 -1 -1 -1 -1 -1 0 -1 -1 0 0 0 -1 -1 -1 -1 -2 -1 -1 -1 -1 -1 -1 -2 -2 -1 0 -1
-17393 -1 0 0 -1 0 -1 -1 -1 -1 0 0 -1 0 -1 -1 -1 -1 1 0 -1 0 -2 -2 -1 -1 -1 -1 -1 -1 -2 -1 -2 -1 0 -1 -1 -1 0 -1 -1 -2 -1 -1 -1 -1 0 -1 -1 -1 -1 -1 -1 -1 -1 -1 0 0 -1 -2 0 0 -1 -1 -1 -1 0 -1 -1 -1 0
-17440 0 1 0 -2 -1 -1 -2 0 0 1 1 0 -1 1 0 0 -1 -1 0 0 0 -2 -1 -1 0 -1 -2 -2 -1 -1 -1 1 0 -1 0 -1 -1 -1 -1 -1 -1 -2 -1 0 -1 0 1 -1 -1 -1 -1 -1 -1 0 -1 0 0 0 0 -2 -1 1 0 0 0 0 -1 0 0 0
-17487 0 -2 -2 -2 0 -1 -1 0 0 0 0 -1 -1 -1 -1 0 -1 -1 -1 0 -1 -1 0 0 -2 -1 -1 0 -1 0 -1 0 -1 0 0 -1 0 -1 -1 0 0 -1 -1 -1 -1 -1 0 0 -1 -1 0 -2 -1 -1 -2 -1 -1 -1 -1 -2 -2 -1 -1 0 0 -1 -1 -1 -1 0
-17534 0 -1 0 -1 -1 -1 -1 -1 -1 -1 -1 -1 -1 0 -1 0 -1 -1 0 -1 -1 0 0 -1 0 -1 0 -1 -2 -1 0 -1 -1 -1 -1 -1 -2 -1 -1 0 0 0 -1 1 -1 0 0 -1 -1 0 -1 -1 0 -1 0 -1 -1 -1 0 -1 -1 0 -1 0 0 0 -1 -2 0 0
$$ packed form
-17205@%jJkJ%%%jK%%jJkJ%%Jj%%J%jjJ%%%jKj%%jJJjJ%%jjK%%%jjJ%j%%KjJj%Jj%%%%Jjj
-17252bJ%%JkJ%Jjj%%JjJ%%Jk%%J%Jk%J%%%%%%%jKj%j%Kj%%%J%j%%%jKj%%%%%%%%j%Kj%%%
-17299a%%J%%%j%%%%Jj%%%%%%%%%Jj%%%J%%j%j%K%kJ%%%jK%j%%%%%JjjJjK%%%j%%%jKkJjJ
-17346a%Jj%J%j%%J%%%j%%%JjjJ%%%%%Jj%%%%%jJ%%jJJ%j%%%%%Jj%J%%j%%%jJ%%%%%j%JJj
-17393aJ%jJj%%%J%jJj%%%KjjJk%J%%%%%jJjJJj%%Jj%jJ%%%Jj%%%%%%%%J%jjK%j%%%Jj%%J
-17440@JjkJ%jK%J%jjKj%j%J%%kJ%Jjj%J%%KjjJj%%%%%jJJjJJk%%%%%JjJ%%%kJKj%%%jJ%%
-17487@k%%Kj%J%%%j%%%Jj%%Jj%J%kJ%JjJjJjJ%jJj%J%j%%%%J%j%JkJ%jJ%%%j%J%J%j%%%J
-17534@jJj%%%%%%%%%JjJj%Jj%J%jJjJjjJJj%%%%jJ%J%%jKkJ%j%Jj%JjJj%%Jj%JjJ%%jjK%
$$ plain form
-17581 0 0 -1 -1 -2 -1 -1 -1 -1 0 -1 -1 -1 -1 -1 -2 -1 -2 -1 -2 -1 -1 -2 -1 -1 -1 -2 -1 -1 -1 0 -1 0 0 0 -1 -1 0 -2 0 0 0 -1 -1 -1 -2 -2 -1 -1 -2 -1 -2 -2 -2 -2 -1 -2 0 -1 -1 0 0 0 -1 0 0 0 0 0 0
-17628 0 -1 -1 -2 -1 -1 -1 -1 -1 -1 -2 -1 -1 0 -2 -1 -1 -1 -1 -2 0 -1 -1 0 -1 -1 -2 -1 -1 -1 -1 -1 -1 0 0 -1 -2 -1 -1 -2 -2 -2 -2 -2 0 0 0 -2 -1 -1 -2 -1 -2 -1 -1 -1 0 0 -1 0 -1 0 -2 -1 0 -2 -2 -1 -1 -1
-17675 -1 -1 -1 -1 -1 -1 -3 -1 0 -2 -1 -1 -1 -2 0 -1 -1 -1 -1 -1 -2 -1 0 -1 -1 -1 -1 -1 0 0 -1 0 -2 -2 -2 -2 -1 0 0 0 0 -1 0 0 0 -1 -1 -1 -1 0 -1 -1 -2 -1 -1 -1 0 0 -1 -1 -1 -1 -1 -1 -1 -2 -1 -1 -1 -1
-17722 -1 -2 -1 -1 -1 -1 0 0 0 -1 -1 -2 -1 0 0 0 -1 -1 -1 -1 0 0 -1 -1 0 -1 -1 -1 -1 -1 0 -1 0 -1 -1 -1 -1 -1 -1 0 -1 -1 0 -1 -1 0 0 0 -1 -1 0 -1 0 -1 -2 -1 -1 0 0 0 0 0 0 -1 -2 -1 0 -1 -2 -2
-17769 -2 -1 -1 -1 0 -2 -1 0 -1 0 -1 -1 -1 -1 0 0 -1 -1 -1 -1 -1 -1 -1 -1 -2 -2 0 0 -2 -3 0 -1 0 -2 -1 0 0 0 0 -1 0 0 0 -1 0 -2 -2 -2 -1 -1 1 -1 -1 -1 -1 0 0 -1 0 -1 -1 0 -1 -1 0 -1 -1 0 -1 -1
-17816 -1 -1 -1 0 0 -1 0 0 -1 -1 -1 -1 -1 0 0 -1 0 0 0 0 -1 0 -1 -1 0 0 -2 -1 -1 0 -1 -1 -1 -1 -1 -1 -1 -1 -1 -1 -1 -1 -1 0 -1 -1 0 0 -1 -1 -2 -2 -2 -1 -1 0 0 0 0 0 -1 -1 1 0 -1 0 -1 -1 -1 -1
-17863 -1 0 -1 -2 -1 0 0 -1 -1 -1 -1 -1 -1 -1 -1 -1 0 0 0 -1 0 0 -1 -1 -1 -1 -2 0 0 -1 0 0 0 0 -1 0 -2 -1 -2 -1 -1 0 -1 -1 -1 -1 -1 -2 0 -1 -1 0 -1 0 0 -1 0 0 0 -1 0 1 0 -1 0 0 -1 0 -1 0
-17910 0 -1 -1 -1 -1 -1 -2 -1 -1 -1 0 0 -1 -2 -1 0 0 -1 -1 -1 0 -2 0 0 -1 -1 -2 -1 -1 0 -1 0 -1 -2 -2 -1 -1 -1 -1 -1 -1 0 -1 -1 -1 -1 0 -1 -1 -1 -1 -1 -2 -1 0 -1 -1 0 -1 -1 -1 -1 -1 -1 -2 0 -1 -2 -1 -1
$$ packed form
-17581@%j%jJ%%%Jj%%%%jJjJjJ%jJ%%jJ%%JjJ%%j%JkK%%j%%j%J%jJj%%%JjKj%J%%jJ%%%%%
-17628@j%jJ%%%%%jJ%JkJ%%%jKj%Jj%jJ%%%%%J%jjJ%j%%%%K%%kJ%jJjJ%%J%jJjJkJJk%J%%
-17675a%%%%%kKJkJ%%jKj%%%%jJJj%%%%J%jJk%%%JJ%%%jJ%%j%%%Jj%jJ%%J%j%%%%%%jJ%%%
-17722ajJ%%%J%%j%jJJ%%j%%%J%j%Jj%%%%JjJj%%%%%Jj%Jj%J%%j%JjJjjJ%J%%%%%jjJJjj%
-17769bJ%%JkJJjJj%%%J%j%%%%%%%j%K%kjLjJkJJ%%%jJ%%jJk%%J%Kk%%%J%jJj%Jj%Jj%Jj%
-17816a%%J%jJ%j%%%%J%jJ%%%jJj%J%kJ%Jj%%%%%%%%%%%%Jj%J%j%j%%J%J%%%%j%KjjJj%%%
-17863aJjjJJ%j%%%%%%%%J%%jJ%j%%%jK%jJ%%%jJkJjJ%Jj%%%%jKj%JjJ%jJ%%jJJjjJ%jJjJ
-17910@j%%%%jJ%%J%jjJJ%j%%JkK%j%jJ%JjJjj%J%%%%%Jj%%%Jj%%%%jJJj%Jj%%%%%jKjjJ%
$$ plain form
-17957 -1 -1 -1 -1 -1 -1 -1 -1 -1 -2 0 -1 0 -1 -1 -1 0 0 -2 -1 -1 -2 -1 0 -1 -1 -1 -1 -1 -1 -1 -2 -2 -1 -2 -1 -1 -2 -2 -1 -1 0 -1 -1 -1 -2 0 -1 -1 -1 -1 -1 -1 -2 0 -1 0 0 0 0 -1 -1 -2 -2 -1 -2 0 0 0 -1
-18004 -1 -1 -1 -1 0 0 -1 -1 -2 -1 0 -1 -1 -1 -1 -1 -1 -1 -1 -1 0 -1 0 -1 -1 -2 0 -1 -1 -1 -2 -3 -2 -1 -1 -1 -1 -1 0 0 0 -2 -1 -1 0 0 0 0 -2 -2 0 0 -1 -1 -1 -1 -1 -2 -1 0 0 0 0 -2 -1 -1 -1 -1 -1 -1
-18051 -1 -1 -1 -1 -2 -1 -1 0 0 -1 -1 -1 -1 -1 0 0 -2 0 -1 -2 -1 -1 0 -1 -2 -1 -1 -1 -1 -1 -1 -1 -2 -3 -2 -1 0 -1 -1 -2 -2 -1 -1 -1 0 0 0 -1 -1 -1 0 0 -2 -2 -1 0 -1 -1 -3 -1 -1 0 -1 -1 -1 0 -1 -1 0 -1
-18098 -1 -1 -1 0 -1 -2 -1 -2 1 0 -1 -2 -1 -1 -1 0 -1 0 0 0 -1 -1 -1 -1 -2 0 -1 -2 0 -1 0 -1 -1 -3 -1 -1 -1 -1 -2 -1 -1 -1 0 0 -1 -1 -1 -1 -1 -1 0 0 0 -1 1 -2 -1 -1 -1 -2 -1 -1 0 0 -1 -1 -1 -1 -2 -2
-18145 -2 0 -2 -1 -1 -1 -1 -1 -1 -1 0 0 -1 -1 -1 0 0 -1 0 0 -1 -1 -2 -2 -1 -1 0 0 0 0 0 -1 -1 0 1 -1 -1 -1 -1 -1 -1 -1 -2 -1 -2 -1 -1 -1 -1 0 -1 -1 -1 -1 -2 -2 -1 -1 -1 -2 -1 -1 -1 -1 -1 -2 -1 -2 -1 -1
-18192 -1 0 -1 -1 0 1 -1 0 0 0 0 -1 -2 -1 -1 -1 -1 -2 -1 -1 -1 -1 0 0 -2 -1 0 -1 -2 0 -1 -1 -1 -1 0 0 0 -1 -1 -1 -1 -1 0 0 -1 0 -1 -1 -1 -1 0 -1 -1 0 -1 -1 -1 -1 0 -1 0 0 0 0 -1 0 -1 -1 0 -1
-18239 -1 -2 -2 -1 -1 0 -1 -1 -1 -1 -1 -1 1 -1 -1 0 -1 -1 -1 0 -1 -1 -1 -1 -1 0 -1 0 0 0 0 0 -1 -1 0 0 0 -1 -1 -2 0 0 -1 -1 -1 0 -2 -1 -1 -1 -1 -1 -1 -2 -2 -1 -2 -2 -1 -1 -1 -1 -1 -1 -1 -1 0 1 0 -1
-18286 -1 -1 -1 0 -1 0 -1 -1 -1 -1 0 0 -1 0 0 0 0 -1 -1 -1 -1 -1 -1 -1 -2 -1 -1 -1 0 -1 -1 -1 -1 -2 -2 -1 -1 -1 0 0 0 -1 1 0 -1 -1 -2 -1 -1 -1 0 -1 -1 0 -1 -1 0 -1 -1 0 0 -1 -2 -1 -1 -1 -1 -1 -1 -1
$$ packed form
-17957a%%%%%%%%jKjJj%%J%kJ%jJJj%%%%%%j%JjJ%j%J%Jj%%jKj%%%%%jKjJ%%%j%j%JjK%%j
-18004a%%%J%j%jJJj%%%%%%%%JjJj%jKj%%jjJJ%%%%J%%kJ%J%%%k%K%j%%%%jJJ%%%kJ%%%%%
-18051a%%%jJ%J%j%%%%J%kKjjJ%JjjJ%%%%%%jjJJJj%j%J%%J%%j%%J%k%JJj%kK%Jj%%Jj%Jj
-18098a%%JjjJjLjjjJ%%JjJ%%j%%%jKjjKjJj%kK%%%jJ%%J%j%%%%%J%%jKlJ%%jJ%J%j%%%j%
-18145bKkJ%%%%%%J%j%%J%jJ%j%j%J%J%%%%j%JJk%%%%%%jJjJ%%%Jj%%%j%J%%jJ%%%%jJjJ%
-18192aJj%JJkJ%%%jjJ%%%jJ%%%J%kJJjjKj%%%J%%j%%%%J%jJj%%%Jj%Jj%%%JjJ%%%jJj%Jj
-18239aj%J%Jj%%%%%Kk%Jj%%Jj%%%%JjJ%%%%j%J%%j%jK%j%%JkJ%%%%%j%Jj%J%%%%%%%JJjj
-18286a%%JjJj%%%J%jJ%%%j%%%%%%jJ%%Jj%%%j%J%%J%%jKjj%jJ%%Jj%Jj%Jj%J%jjJ%%%%%%
$$ plain form
-18333 -1 -1 -1 1 0 -2 -1 -1 0 1 -1 0 -1 -1 -2 -2 -1 -1 -1 -2 0 -1 -1 0 -1 -1 -1 -1 -1 -1 0 1 0 -1 -1 0 -1 -2 0 -1 0 -1 -1 -1 -1 -1 -1 -1 -2 -1 -1 -1 -1 -1 -1 0 0 0 0 -1 -1 -1 -2 -1 -2 -1 -2 -1 0 -1
-18380 -1 -2 -2 -1 0 0 0 -1 -1 0 0 -1 0 1 -1 -1 -2 -2 -2 -1 -2 -1 0 -1 0 0 0 -1 -1 -1 -1 -1 0 0 0 -1 -1 -2 -2 -1 -1 -1 -1 -1 -1 0 0 -1 -1 -2 -2 -1 -2 -1 -1 -1 -2 -1 -1 -1 -1 0 0 -2 -1 0 -2 -1 0 -1
-18427 -1 -2 0 -1 -1 -1 -1 -1 -2 -1 -1 0 0 -1 -1 -1 0 -1 -2 -1 -1 0 -1 0 0 -1 -1 0 0 -1 -1 -1 -1 0 0 0 0 0 -1 0 0 -2 0 -1 -1 1 0 -1 0 -1 0 -1 -1 0 0 0 -1 -1 -1 -1 -1 0 -1 -1 0 -2 -1 0 -1 -3
-18474 -3 -1 -1 0 -1 -1 -2 -1 -1 -1 0 -1 -1 -2 -1 -1 -1 -1 0 -1 -1 -1 -1 -2 0 0 -1 -1 0 -2 -2 -1 -1 -1 0 1 0 -2 0 -2 -1 -1 -1 -1 -1 0 0 0 -1 -1 -2 -2 -1 -1 1 0 -2 -1 0 0 0 -2 0 -1 -1 -1 -1 -2 0 -1
-18521 -1 -1 -1 -1 0 0 -1 -2 -1 -1 -1 -1 -1 -1 -1 -1 -2 -1 -1 -2 -1 -1 -1 -1 -1 -1 0 -2 -1 -1 0 0 -1 0 -1 0 -1 -1 -1 -2 -1 -1 -1 0 0 0 -1 -1 -1 0 -1 -1 0 1 -1 0 0 0 -1 -1 0 -1 -1 -1 -2 -1 -1 -1 -1 -1
-18568 -1 -2 -1 -1 -1 -1 0 -1 -1 -1 0 1 -1 -1 0 -1 0 -1 -3 -1 0 -1 -1 -2 0 0 -2 -2 -1 -3 -1 0 0 0 0 -1 0 0 0 -1 -1 0 -1 0 -1 -1 -1 -1 1 0 0 -1 -2 -2 -1 0 0 -1 -2 -1 0 -1 -1 -1 0 0 0 -1 -1 -1
-18615 -1 -1 -1 -1 0 -1 -1 -1 -2 0 0 -1 0 0 -1 0 -1 -1 -1 -2 -1 0 -1 -1 0 -1 -1 -1 -1 -1 -1 -1 0 -1 -2 -1 -1 -2 -2 -2 -1 -1 -1 -1 -1 -1 0 -1 -2 -2 -2 -2 -1 1 1 -1 -2 -2 -1 0 -2 -1 0 -1 0 -1 0 -1 -1 -1
-18662 -1 -1 -1 -2 -1 -1 -1 0 -1 0 0 1 -1 -1 -2 -1 -1 -1 0 -1 -1 -1 -2 -1 -1 -1 -1 -1 0 0 0 -1 -1 -2 -1 0 0 -1 0 -1 -2 -1 -1 -1 0 0 0 0 -1 -1 0 0 0 -1 -1 -1 -1 -1 -1 -1 -1 -1 -1 -1 -1 -2 0 -1 0 -1
$$ packed form
-18333a%%KjkJ%JJkJj%j%J%%jKj%Jj%%%%%JJjj%JjjKjJj%%%%%%jJ%%%%%J%%%j%%jJjJjJJj
-18380aj%JJ%%j%J%jJJk%j%%JjJJjJ%%j%%%%J%%j%j%J%%%%%J%j%j%JjJ%%jJ%%%J%kJJkJJj
-18427ajKj%%%%jJ%J%j%%JjjJ%JjJ%j%J%j%%%J%%%%jJ%kKj%KjjJjJj%J%%j%%%%Jj%JkJJjk
-18474cK%Jj%jJ%%Jj%jJ%%%Jj%%%jK%j%Jk%J%%JJjkKkJ%%%%J%%j%j%J%KjkJJ%%kKj%%%jKj
-18521a%%%J%jjJ%%%%%%%jJ%jJ%%%%%JkJ%J%jJjJj%%jJ%%J%%j%%Jj%JJkJ%%j%Jj%%jJ%%%%
-18568ajJ%%%Jj%%JJk%JjJjkKJj%jK%k%JkKJ%%%jJ%%j%JjJj%%%Kj%jj%JJ%jjJJj%%J%%j%%
-18615a%%%Jj%%jK%jJ%jJj%%jJJj%Jj%%%%%%JjjJ%j%%J%%%%%Jjj%%%JK%kj%JJkJJjJjJj%%
-18662a%%jJ%%JjJ%Jk%jJ%%Jj%%jJ%%%%J%%j%jJJ%jJjjJ%%J%%%j%J%%j%%%%%%%%%%%jKjJj
$$ plain form
-18709 -1 -1 -2 -1 -1 -2 -1 -1 -1 -1 -2 -1 0 0 -1 -1 1 0 0 -1 -1 -1 0 0 -1 -1 -1 -1 -1 -1 -1 -1 -1 -2 -1 -1 -2 -1 -2 0 -1 -1 -2 0 0 -1 0 -2 0 -2 -1 -1 -1 -1 -1 -1 0 0 -1 -1 0 -1 -1 -1 -1 -1 -1 0 -1 -2
-18756 -2 -1 -1 -1 -1 -2 0 0 -2 -1 0 -1 -1 0 -2 -2 -2 0 0 -1 -2 -1 -1 -1 -1 -1 -1 0 0 -1 -1 -1 -2 -2 -2 -1 -2 0 -1 -1 -2 0 0 -1 -1 -2 -2 -1 0 0 0 -2 -1 -1 -1 -2 -1 -1 0 0 0 -1 -2 0 0 0 -1 -1 -1 -2
-18803 -2 0 -1 -2 -1 -1 -1 0 -1 -1 0 0 0 1 0 1 -1 -1 0 0 0 0 -2 -1 -1 0 0 -1 -2 0 0 0 -1 -1 0 -1 -1 0 0 0 -1 -1 -2 -1 -1 -1 0 0 -1 -1 -1 -1 0 0 -1 -2 -2 -2 -1 -1 -1 0 0 0 -1 -1 -1 -2 0 -1
-18850 -1 0 -1 -2 0 -1 -1 -2 0 -1 -1 -1 0 -1 -1 -2 -1 0 -1 -1 0 -2 -2 0 0 0 -1 -1 -2 -1 -1 0 -1 0 -1 -1 0 0 -2 -1 -1 -1 -1 -1 -1 -1 -1 -1 -2 -1 0 0 -1 -1 -1 -1 -1 0 -1 -1 -1 0 -1 -1 -1 -1 -1 -1 -1 -1
-18897 -1 -1 -1 -2 0 -2 -1 -1 -1 -1 0 -1 -1 -1 0 0 -2 0 -1 -1 -1 -1 -1 -1 -2 -1 -1 0 0 0 -1 -1 -1 -1 -2 -3 -1 0 0 0 0 -1 -1 -1 -2 -3 -1 -2 0 -1 -1 -1 -1 -1 -1 -1 0 0 0 0 0 0 0 0 0 0 -1 -1 -1 -2
-18944 -2 -1 -1 -1 0 0 -1 -1 -2 0 0 0 0 0 -1 -2 -1 0 0 -2 -2 -1 0 0 0 -2 0 -1 -1 -1 -1 0 0 1 -1 -2 -1 -1 -2 0 0 0 -1 0 -1 -1 0 0 0 0 -1 -1 -1 -1 0 0 0 0 0 0 0 -1 0 -1 -1 -1 -2 -2 -1 -2
-18991 -2 -1 0 -1 -1 -1 -1 -1 -1 -1 0 0 -1 0 -1 -1 0 -1 -1 -1 0 -1 -1 -1 -1 -2 -2 -1 0 -1 -1 -2 -2 -1 0 -1 -1 -1 -1 -1 0 -1 -1 0 -1 -1 0 -1 0 -1 0 -1 -1 -2 -1 -1 0 0 0 -1 1 0 -1 -1 0 -1 -1 -1 -1 -1
-19038 -1 0 0 -1 0 0 -2 -1 -1 0 0 0 0 -1 -2 0 0 -1 -1 -1 -1 -1 -1 -1 -1 -1 0 -2 -2 -1 -2 -1 -1 0 -1 -1 -2 0 0 -1 -1 -1 0 -2 0 -1 -1 0 -1 -2 -2 -1 -1 -1 -1 -1 -1 -1 -1 -1 -1 -1 -1 -1 -1 -1 0 0 1 0
$$ packed form
-18709a%jJ%jJ%%%jJJ%j%Kj%j%%J%j%%%%%%%%jJ%jJjKj%jK%jJkKkJ%%%%%J%j%Jj%%%%%Jjj
-18756bJ%%%jK%kJJj%Jk%%K%jjJ%%%%%J%j%%j%%JjKj%jK%j%j%JJ%%kJ%%jJ%J%%jjK%%j%%j
-18803bKjjJ%%Jj%J%%JjJk%J%%%kJ%J%jjK%%j%Jj%J%%j%jJ%%J%j%%%J%jj%%J%%J%%j%%jKj
-18850aJjjKj%jKj%%Jj%jJJj%Jk%K%%j%jJ%JjJj%J%kJ%%%%%%%%jJJ%j%%%%Jj%%Jj%%%%%%%
-18897a%%jKkJ%%%Jj%%J%kKj%%%%%jJ%J%%j%%%jjKJ%%%j%%jjKjKj%%%%%%J%%%%%%%%%j%%j
-18944bJ%%J%j%jK%%%%jjJJ%k%JJ%%kKj%%%J%JkjJ%jK%%jJj%J%%%j%%%J%%%%%%jJj%%j%Jj
-18991bJJj%%%%%%J%jJj%Jj%%Jj%%%j%JJj%j%JJj%%%%Jj%Jj%JjJjJj%jJ%J%%jKjj%Jj%%%%
-19038aJ%jJ%kJ%J%%%jjK%j%%%%%%%%Jk%JjJ%Jj%jK%j%%JkKj%Jjj%J%%%%%%%%%%%%%%J%Jj
$$ plain form
-19085 0 -1 0 0 0 -1 -2 -2 0 0 0 0 0 -1 0 -1 -1 -1 -1 -1 1 0 0 -1 -1 -1 0 0 -1 0 -1 0 -1 0 0 -1 -1 -1 -1 -2 -1 -1 -1 -1 0 0 -1 -1 -1 0 0 0 -1 0 0 -1 -1 0 -2 -1 -1 -1 0 0 0 -2 -2 -1 -1 -1
-19132 -1 -1 -1 -2 -1 0 1 0 0 0 -1 -1 -1 -1 -1 -1 -1 -1 0 0 -2 -1 -1 -1 -1 -1 -1 -1 0 -1 -2 -2 -1 -2 -1 0 0 -1 -1 -1 -1 -2 -2 -1 -1 -1 -2 -2 -2 -1 -1 0 -1 -1 -1 -1 0 -1 0 -2 -1 -1 0 -1 -1 -2 -1 -2 -2 -1
-19179 -1 -1 -1 0 -2 -2 0 0 -1 -1 1 -1 -1 -1 -2 -1 -1 -1 0 -1 -1 -1 -1 -1 -2 -1 -1 -1 -1 -1 -2 -1 -1 -1 0 0 -1 -2 -1 -1 -1 -2 -2 -1 -1 -2 -2 0 -1 -2 -1 0 -1 0 -1 -1 -1 0 -1 -1 0 -1 -1 -1 -1 -1 -2 0 -1 -2
-19226 -2 -1 0 -1 0 -1 -1 0 -1 -1 -1 -2 0 0 0 -1 -1 -1 -1 -1 0 -1 0 -1 -1 0 -1 0 0 0 -1 -1 -1 -1 0 0 -1 -1 0 -1 -2 -2 -1 0 1 1 0 0 -1 -1 -1 -1 0 -2 -1 -1 -1 0 0 -2 -1 -1 -1 -2 -1 -2 -1 -1 -1 -1
-19273 -1 0 -1 0 1 -2 0 0 -1 -1 -1 -1 -1 -1 -1 -1 0 -1 -1 -1 0 -1 -1 -1 0 -1 -1 -1 -1 -1 -2 -1 -1 -2 -1 0 0 -1 -1 0 0 -1 -1 0 0 -1 -1 -1 0 -1 -1 -1 -1 -1 -1 -2 -1 -1 -1 0 -1 -1 -2 0 0 0 -1 -2 -1 -1
-19320 -1 -1 -1 1 -1 -1 -1 -1 0 0 -2 -1 -1 -1 -1 -1 -2 -1 0 -1 -1 0 -1 -1 0 -1 -2 -1 -1 -1 -1 -1 -1 -1 -1 -1 -1 -1 -1 -1 -1 0 -1 -1 -1 1 0 0 -1 0 -1 -1 -1 -1 1 0 0 0 0 -1 -1 -2 0 0 0 0 0 0 0 -1
-19367 -1 -1 -1 -1 -1 -1 -1 -1 0 -1 -2 0 -1 -1 -1 0 -1 -1 -1 -1 -2 -2 -1 -1 -1 -1 -1 -1 -1 -2 0 -1 -2 -1 -1 -2 0 -1 0 0 0 -1 -1 -1 -1 0 0 0 -1 -1 -1 0 0 -1 0 0 0 -1 -1 -1 -1 -1 -2 -1 -2 -1 0 -1 -1 0
-19414 0 -1 -1 -1 -1 -1 0 0 0 -2 -1 -2 -2 -1 0 0 -1 -2 -2 -1 -1 -1 0 -1 -2 -1 0 -2 -2 0 -1 -1 -1 -1 0 -1 -1 -1 -2 -1 -1 -1 0 -1 -1 0 -1 -1 0 -1 -2 -1 -1 -1 -2 -1 -1 -1 -1 -2 -1 -2 -3 -2 -2 -1 -1 -2 -2 -2
$$ packed form
-19085@jJ%%jj%K%%%%jJj%%%%Kj%j%%J%jJjJjJ%j%%%jJ%%%J%j%%J%%jJ%j%JkJ%%J%%k%J%%
-19132a%%jJJJj%%j%%%%%%%J%kJ%%%%%%Jjj%JjJJ%j%%%j%J%%j%%J%Jj%%%JjJkJ%Jj%jJj%J
-19179a%%Jk%K%j%Kk%%jJ%%Jj%%%%jJ%%%%jJ%%J%jjJ%%j%J%j%KjjJJjJj%%Jj%Jj%%%%jKjj
-19226bJJjJj%Jj%%jK%%j%%%%JjJj%JjJ%%j%%%J%j%Jjj%JJJ%j%j%%%JkJ%%J%kJ%%jJjJ%%%
-19273aJjJJlK%j%%%%%%%Jj%%Jj%%Jj%%%%jJ%jJJ%j%J%j%J%j%%Jj%%%%%jJ%%Jj%jK%%jjJ%
-19320a%%Kk%%%J%kJ%%%%jJJj%Jj%JjjJ%%%%%%%%%%%%%Jj%%Kj%jJj%%%Kj%%%j%jK%%%%%%j
-19367a%%%%%%%JjjKj%%Jj%%%j%J%%%%%%jKjjJ%jKjJ%%j%%%J%%j%%J%jJ%%j%%%%jJjJJj%J
-19414@j%%%%J%%kJj%JJ%jj%J%%JjjJJk%Kj%%%Jj%%jJ%%Jj%Jj%JjjJ%%jJ%%%jJjjJ%J%j%%
$$ plain form
-19461 -2 -1 0 -1 0 0 0 -1 -1 0 -1 -1 -2 0 -1 -2 -1 0 0 -2 -3 -1 -1 0 -1 -1 0 -1 -1 -1 -3 -2 -1 0 -1 -1 -1 -2 -2 0 0 -2 -1 0 -1 -2 -1 -1 1 -1 0 0 0 -1 -1 -2 -1 -1 -1 -1 -1 0 0 -1 0 0 -1 -1 -1 -1
-19508 -1 -1 -2 0 -1 -1 -1 -1 -1 0 -1 -2 0 0 -1 -1 -1 -1 -1 0 -1 -1 -2 -2 0 -1 -1 -1 0 -1 -1 -2 -1 -1 0 -1 -1 -1 0 -1 -1 -1 0 -1 -2 -1 0 0 0 -1 0 -2 -1 -1 -2 -2 -1 0 -1 0 -1 -2 -2 0 -1 -1 -1 -1 0 0
-19555 0 -1 0 0 -1 -1 -1 -1 -1 -1 -1 0 -1 -2 -1 -1 -1 -1 -1 -1 -1 -2 -1 -2 -1 0 -1 0 -1 -1 -1 -1 -1 0 -1 -1 -1 0 -1 -1 0 -1 0 -1 -1 -1 -1 -2 -1 -1 -1 -1 -1 -1 -1 -1 -1 -2 -1 -1 -1 -1 -1 -1 0 0 -1 -2 0 0
-19602 0 -2 0 0 0 0 1 0 0 -1 -1 -1 0 -1 -1 -1 -1 -1 0 -1 -1 -1 -1 0 0 -2 -1 -2 0 -1 -1 -1 -1 0 0 -1 -1 -1 0 -1 -1 -1 -1 -1 -1 -2 -1 0 1 0 -1 -1 0 -1 -1 -1 -1 -2 -1 -1 -1 -1 -1 -3 -1 -1 -1 -1 -1 -1
-19649 -1 0 -1 -1 -3 0 0 0 0 0 0 -1 -1 -1 0 -1 -1 -1 -1 -2 -1 -1 0 -1 0 -1 0 0 -2 -1 -2 -1 -1 -1 -1 0 0 -1 -1 0 -1 -2 0 0 -2 -1 -1 0 0 0 -1 -1 0 -1 -1 0 -1 -1 -1 -1 -1 -1 -1 -1 -1 0 -1 -2 0 -1
-19696 -1 -2 -2 0 -1 -1 -1 -1 -1 -1 -1 -2 -1 -1 -1 -1 -1 -2 -1 -1 -1 -1 -1 0 -1 -1 0 -1 -1 -1 0 -2 0 0 -1 -1 0 -1 -1 -2 -1 -2 -2 -1 0 0 -1 0 0 0 0 -1 -1 0 0 -1 0 1 0 -1 -1 -1 -1 -1 -2 -1 -2 -1 -1 -1
-19743 -1 -1 -1 -1 0 -1 -1 0 -1 -2 -1 0 0 -1 -1 0 0 0 -1 0 -1 -1 0 -1 -1 -2 -2 -2 -3 -1 -2 -1 -1 -2 0 -1 0 -1 -1 0 0 1 -1 -1 -1 -1 -1 -2 -1 0 0 0 -1 -2 -1 -2 -2 -2 -1 -1 -1 -1 -2 -2 -1 -1 -1 -2 -1 -1
-19790 -1 -1 0 -1 -1 -2 -1 -1 0 0 0 0 0 -1 -1 -2 0 0 -1 -1 -1 -1 -1 0 -1 -1 0 -1 -1 1 -1 -1 -1 -1 -2 0 -1 0 0 -1 0 0 -2 -1 0 0 -1 0 -1 0 0 -1 -1 -2 0 0 -1 -2 -1 0 0 0 -2 -1 0 -1 -2 -2 -1 -1
$$ packed form
-19461bJJjJ%%j%Jj%jKjjJJ%kjK%Jj%Jj%%kJJJj%%j%K%kJJjjJ%KkJ%%j%jJ%%%%J%jJ%j%%%
-19508a%jKj%%%%JjjK%j%%%%Jj%j%Kj%%Jj%jJ%Jj%%Jj%%JjjJJ%%jJkJ%j%JJjJjj%Kj%%%J%
-19555@jJ%j%%%%%%JjjJ%%%%%%jJjJJjJj%%%%Jj%%Jj%JjJj%%%jJ%%%%%%%%jJ%%%%%J%jjK%
-19602@kK%%%Jj%j%%Jj%%%%Jj%%%J%kJjKj%%%J%j%%Jj%%%%%jJJJjj%Jj%%%jJ%%%%kK%%%%%
-19649aJj%kL%%%%%j%%Jj%%%jJ%JjJjJ%kJjJ%%%J%j%JjjK%kJ%J%%j%Jj%Jj%%%%%%%%JjjKj
-19696aj%Kj%%%%%%jJ%%%%jJ%%%%Jj%Jj%%JkK%j%Jj%jJj%JJ%jJ%%%j%J%jJJjj%%%%jJjJ%%
-19743a%%%Jj%JjjJJ%j%J%%jJj%Jj%j%%jKjJ%jKjJj%J%Jk%%%%jJJ%%jjJj%%J%%%j%J%%jJ%
-19790a%Jj%jJ%J%%%%j%jK%j%%%%Jj%Jj%Kk%%%jKjJ%jJ%kJJ%jJjJ%j%jK%jjJJ%%kJJjj%J%
$$ plain form
-19837 -1 -1 -2 -1 -1 0 0 -1 0 0 0 -1 0 0 -1 0 -1 -1 0 0 -1 -1 0 -1 0 1 1 1 0 0 -1 0 0 -2 -1 0 0 -1 -1 -1 -1 0 -2 -1 0 -1 0 -1 -1 -1 -2 0 0 0 -1 -1 -1 -1 -1 -2 -1 -2 -2 -1 -1 -1 0 0 -1 -1
-19884 -1 0 -1 0 -1 -1 -1 -1 -2 -1 -1 -1 -1 -1 -1 -1 0 0 0 0 0 -1 -2 -1 0 1 0 -2 -1 -1 -1 -1 -1 0 -1 -1 0 -1 0 0 -1 0 -1 -2 -2 -1 0 -1 0 0 -1 -2 -1 -1 -2 -1 0 -1 -1 -1 -1 -2 -1 -1 -1 -1 -1 -1 -1 -1
-19931 -1 -2 -2 -1 -1 0 0 -1 -1 0 -1 -1 -1 0 -1 0 0 -1 -1 0 -1 -2 -2 0 -1 -1 -2 1 -1 0 -1 -1 -1 -1 -1 -1 0 0 1 -1 -1 -1 -1 -2 -1 -1 -1 -1 0 -1 -1 -1 -1 -1 -1 0 -1 -1 -1 -1 -1 -1 -1 -1 0 0 -1 -2 0 0
-19978 0 0 -1 -1 1 -1 -1 -1 -2 -1 0 -1 -1 0 -1 -1 -1 -1 -1 -1 -1 0 -1 -1 0 -1 -2 0 -1 -1 0 -1 -2 -1 -1 0 -1 -1 -1 -1 -1 -1 -1 -1 -1 -2 -1 -1 -1 -1 -1 -2 -1 -1 -1 0 -1 -1 -2 -1 0 0 1 -1 -1 -2 -1 -1 -2 -1
-20025 -1 -1 -1 -1 -1 -1 -1 -1 -1 0 0 0 0 0 -1 0 0 -1 0 -1 -1 0 -1 -1 -1 -2 -1 -2 -1 0 0 0 -1 -2 -1 -1 -1 -1 -1 -1 -1 -1 -1 0 -1 -1 -1 -2 -1 -1 0 0 0 -1 -1 -1 -2 -1 0 0 -1 -1 -1 -1 -1 -1 -1 -1 -2 -1
-20072 -1 -1 0 0 -1 0 -1 -2 -1 -1 -1 -1 -1 -1 -2 -1 -1 0 -1 0 0 -2 -2 0 0 -2 0 -1 0 0 -1 -1 0 -1 0 0 1 -1 -2 -2 0 0 -2 -1 0 0 -1 0 -1 0 -1 -1 0 0 1 0 0 -1 -1 -1 -2 -1 -1 0 0 0 0 -1 0 1
-20119 1 0 -1 -1 -1 -1 -1 -1 0 -1 -1 -1 -1 0 0 -1 0 -1 -1 -1 0 0 -1 -1 -1 -1 -2 -1 -1 -1 -1 -1 -1 -1 -1 -1 0 -1 0 -1 -1 0 -1 -1 0 0 0 0 -1 -1 -1 0 1 -1 -2 -1 -1 -1 0 -1 -1 -1 -1 -1 -1 -1 -1 -1 -1 0
-20166 0 0 0 -1 -1 -1 1 0 0 -1 -2 0 0 -1 0 -2 -1 -1 -1 0 0 -1 -1 -1 0 -2 0 -1 -1 -2 -2 -1 -2 -2 -1 -1 -1 0 0 0 -1 -1 -1 -1 -2 -1 -2 -2 -1 -1 0 -1 -1 -1 -2 -1 -1 -1 -2 0 -1 -1 -2 -2 -1 0 -1 -2 -2 -1
$$ packed form
-19837a%jJ%J%jJ%%jJ%jJj%J%j%JjJJ%%j%jJ%kJJ%j%%%JkJJjJj%%jK%%j%%%%jJj%J%%J%j%
-19884aJjJj%%%jJ%%%%%%J%%%%jjJJJjkJ%%%%Jj%JjJ%jJjj%JJjJ%jjJ%jJJj%%%jJ%%%%%%%
-19931aj%J%J%j%Jj%%JjJ%j%Jjj%Kj%jLkJj%%%%%J%Jk%%%jJ%%%Jj%%%%%Jj%%%%%%%J%jjK%
-19978@%j%Kk%%jJJj%Jj%%%%%%Jj%JjjKj%JjjJ%Jj%%%%%%%%jJ%%%%jJ%%Jj%jJJ%Jk%jJ%jJ
-20025a%%%%%%%%J%%%%jJ%jJj%Jj%%jJjJJ%%jjJ%%%%%%%%Jj%%jJ%J%%j%%jJJ%j%%%%%%%jJ
-20072a%J%jJjjJ%%%%%jJ%JjJ%k%K%kKjJ%j%JjJ%Jkj%K%kJJ%jJjJj%J%Jj%j%%jJ%J%%%jJJ
-20119Ajj%%%%%Jj%%%J%jJj%%J%j%%%jJ%%%%%%%%JjJj%Jj%J%%%j%%JJkjJ%%Jj%%%%%%%%%J
-20166@%%j%%Kj%jjK%jJkJ%%J%j%%JkKj%j%Jj%J%%J%%j%%%jJj%J%Jj%%jJ%%jKj%j%JJjj%J
$$ plain form
-20213 -1 0 0 0 -1 -1 -1 0 -1 -1 -1 -2 -1 0 0 -1 -1 -1 0 -1 -1 -1 -1 -1 0 0 0 0 -1 -2 -1 -1 -1 -1 -1 0 -1 -2 -1 -1 -1 -1 -2 -1 -1 -1 -1 -1 -1 0 0 -1 -1 -2 -1 0 0 0 -1 -2 -1 -1 -1 -1 -1 -1 -1 -1 0 -1
-20260 -1 -2 -1 -1 -1 -1 -2 -2 -2 1 0 1 -1 -1 -1 -2 0 -1 -1 0 -1 -1 -1 -1 -1 -1 -1 -1 -1 -1 0 -1 -1 -1 0 0 0 -1 -1 -1 -2 0 -1 0 1 -1 -1 0 -1 -2 0 -1 -1 -1 0 0 -1 -1 -1 -2 -1 0 -2 -1 -1 -1 0 0 -1 -1
-20307 -1 0 -1 -1 0 -1 -1 0 0 0 0 0 -1 -1 -1 -1 -1 -2 -1 0 -1 -1 -1 0 -1 -2 -1 -2 0 -1 -1 -2 -2 -1 -1 -1 -1 0 -1 -1 1 0 -1 -2 0 0 -1 0 -1 -1 0 -1 -1 -1 0 0 -1 -1 -1 -2 -1 -1 -1 -1 -2 -1 0 -1 0 0
-20354 0 -1 0 0 0 -1 -1 -1 0 -3 -2 0 -1 -1 -1 -1 0 0 0 -1 -2 -1 -1 -1 -1 -1 0 -1 0 0 -1 -1 0 0 0 0 -1 -1 -1 -1 -1 0 -1 -1 0 0 0 -1 0 -1 -1 0 -1 -3 -2 0 -1 -1 -1 -1 -1 -1 -1 -1 -1 0 -1 -1 -1 -2
-20401 -2 -1 -1 -2 -1 -1 -1 -1 0 -1 -1 -1 0 0 -1 -1 -1 0 -1 -1 -2 -1 -2 -1 -1 -2 -2 -2 -1 0 -1 0 0 -1 -1 -1 -1 -1 0 0 -1 0 0 -1 -1 -1 -1 -2 -1 -1 0 -2 -1 -1 -1 -1 -1 -1 -1 -1 0 0 -1 -1 -1 -1 -1 0 0 -1
-20448 -1 -1 0 0 0 0 -1 0 -1 0 -1 -1 -1 -1 -1 0 -1 -1 -1 -1 -1 -1 0 0 -2 -1 0 0 -2 0 -1 0 0 -1 0 -1 -1 -1 -1 0 -1 0 -1 -2 -1 0 -1 -2 -1 -1 0 -1 0 -1 -1 -1 -1 -1 1 0 -1 -1 -1 0 -1 -1 -2 0 -1 0
-20495 0 -1 -2 0 -1 -1 -1 -1 -1 -1 0 -1 -1 0 0 0 0 -2 -1 0 -1 -2 -2 -2 -2 -1 0 -1 -1 -1 -1 -1 -1 -1 0 -1 -1 0 0 0 -1 -2 -1 -2 -1 0 0 0 0 0 -1 -1 -1 0 0 -1 -1 -1 -2 -1 0 0 -1 0 -1 -2 -2 -1 0 -1
-20542 -1 -1 -2 -1 -1 -1 -2 0 -1 0 -2 -2 -1 -1 -2 -2 -2 -1 -2 -1 -2 -2 0 -1 -2 -1 0 -1 0 -1 -1 0 -1 -2 0 -1 -1 -1 0 -1 -1 -2 -1 0 -1 -1 -1 -1 -1 -1 0 -1 -1 -1 0 -1 -1 -1 -2 -1 -1 -1 -1 -1 -1 -1 -1 -1 -1 -1
$$ packed form
-20213aJ%%j%%Jj%%jJJ%j%%Jj%%%%J%%%jjJ%%%%JjjJ%%%jJ%%%%%J%j%jJJ%%jjJ%%%%%%%Jj
-20260ajJ%%%j%%LjJk%%jKj%Jj%%%%%%%%%Jj%%J%%j%%jKjJJk%JjjKj%%J%j%%jJJkJ%%J%j%
-20307aJj%Jj%J%%%%j%%%%jJJj%%JjjJjKj%j%J%%%Jj%KjjjK%jJj%Jj%%J%j%%jJ%%%jJJjJ%
-20354@jJ%%j%%JlJKj%%%J%%jjJ%%%%JjJ%j%J%%%j%%%%Jj%J%%jJj%JjkJKj%%%%%%%%Jj%%j
-20401bJ%jJ%%%Jj%%J%j%%Jj%jJjJ%j%%JJjJ%j%%%%J%jJ%j%%%jJ%JkJ%%%%%%%J%j%%%%J%j
-20448a%J%%%jJjJj%%%%Jj%%%%%J%kJJ%kKjJ%jJj%%%JjJjjJJjjJ%JjJj%%%%Kjj%%Jj%jKjJ
-20495@jjKj%%%%%Jj%J%%%kJJjj%%%JJj%%%%%%Jj%J%%jjJjJJ%%%%j%%J%j%%jJJ%jJjj%JJj
-20542a%jJ%%jKjJk%J%j%%JjJj%KjjJJjJj%JjjKj%%Jj%jJJj%%%%%Jj%%Jj%%jJ%%%%%%%%%%
$$ plain form
-20589 -1 -1 0 0 0 0 -1 0 -1 -1 -1 -1 0 -1 -1 0 -1 0 0 0 -2 -2 -2 -1 -2 -1 -1 -1 0 -1 -1 -1 -1 -1 -1 0 -1 -1 -1 -2 -1 -2 -1 -2 0 -1 -1 0 0 -1 0 -1 -1 0 -1 0 0 -1 -1 -1 -1 -1 -1 -2 -2 -1 0 0 -1 0
-20636 0 0 -1 -1 -1 -1 0 -3 -3 -2 -1 0 -1 -1 0 0 -1 -2 -1 0 -1 -1 -1 -2 0 -1 -1 -1 -1 -1 -1 -1 0 -1 -2 -1 -2 -2 -1 -1 -1 0 0 0 -2 -1 -1 -1 -1 -1 -2 -1 -1 -1 -1 -1 -1 -1 -1 -1 0 -1 -1 -1 -1 -1 -1 -1 -1 -1
-20683 -1 -1 -1 -1 -1 -1 -1 0 0 0 -1 -1 -1 -2 -1 -1 -2 0 0 -1 0 -1 -1 -1 -2 -1 -1 -2 -1 -1 -1 -1 -2 -1 0 0 -1 -2 -2 -1 -1 -1 0 0 0 0 -1 -1 -1 -1 0 -1 -1 -1 0 1 -1 -1 0 -1 -1 0 0 1 -1 -1 -1 -1 -1 -2
-20730 -2 -2 0 -1 -2 -1 -1 -1 0 -1 -1 -1 -1 0 -1 0 -1 -1 -1 -1 0 -1 0 0 0 0 -2 -1 -1 0 0 -1 0 -1 -1 -1 0 0 -1 -1 -1 -1 -2 -1 0 -1 -2 -1 -1 -1 0 -2 -1 0 -1 -1 -1 -1 -1 -1 -1 0 -2 0 0 0 -1 0 -1 -1
-20777 -1 0 -1 -2 -2 -2 -1 -1 -1 0 -1 -1 -1 -1 -1 -1 0 -1 0 0 0 -1 -1 0 -1 -1 -1 -1 -1 -1 -1 -1 0 0 -1 -1 0 -1 -1 -1 -1 0 -2 -2 -1 0 -1 -2 -1 -1 0 -1 -1 -1 -1 -1 -1 -1 -2 -1 -2 -1 -1 0 -1 -2 0 -1 -1 -1
-20824 -1 0 -1 -1 -2 -1 -2 -1 -1 -2 -1 -1 -1 -1 -1 -1 -1 -1 0 -1 -1 -2 -2 -2 -1 -1 -1 -1 -1 -1 -1 -2 -1 -1 -1 0 0 0 -1 -2 0 -2 -1 0 -2 -1 -1 -2 -1 0 0 0 -1 -1 -1 -1 -1 0 1 -1 0 -1 -1 -1 -1 0 -1 -1 -1 -1
-20871 -1 -1 -1 -1 -1 -1 -1 0 0 0 -1 -1 -1 0 -1 -1 -2 0 -1 -1 -1 -1 -1 -1 -1 -1 -1 0 -1 0 -1 0 -1 0 -1 -1 -1 -1 -1 -1 -1 -1 0 0 0 -2 0 -1 -1 -1 -2 -1 -1 -1 -1 -1 -1 -1 -1 -1 -2 -1 -1 -2 -1 -1 -1 -1 -1 0
-20918 0 -2 -2 -2 -2 0 -2 -1 0 -1 -2 -1 0 0 0 0 -1 -1 -1 0 -1 -1 -1 -2 0 0 -1 -1 -1 -1 -1 0 0 -1 -2 -2 0 -1 -2 -1 -1 0 0 -1 0 -1 -1 -2 -2 -3 -1 -1 -1 -1 0 -1 -1 -1 0 -1 -1 0 -1 -1 0 0 0 0 0 1
$$ packed form
-20589a%J%%%jJj%%%Jj%JjJ%%k%%JjJ%%Jj%%%%%Jj%%jJjJjKj%J%jJj%JjJ%j%%%%%j%JJ%jJ
-20636@%j%%%Jl%JJJj%J%jjJJj%%jKj%%%%%%JjjJj%J%%J%%kJ%%%%jJ%%%%%%%%Jj%%%%%%%%
-20683a%%%%%%J%%j%%jJ%jK%jJj%%jJ%jJ%%%jJJ%jj%J%%J%%%j%%%Jj%%JJk%Jj%J%Jk%%%%j
-20730b%KjjJ%%Jj%%%JjJj%%%JjJ%%%kJ%J%jJj%%J%j%%%jJJjjJ%%JkJJj%%%%%%JkK%%jJj%
-20777aJjj%%J%%Jj%%%%%JjJ%%j%Jj%%%%%%%J%j%Jj%%%Jk%JJjjJ%Jj%%%%%%jJjJ%JjjKj%%
-20824aJj%jJjJ%jJ%%%%%%%Jj%j%%J%%%%%%jJ%%J%%jjKkJJkJ%jJJ%%j%%%%JJkJj%%%Jj%%%
-20871a%%%%%%J%%j%%Jj%jKj%%%%%%%%JjJjJjJj%%%%%%%J%%kKj%%jJ%%%%%%%%jJ%jJ%%%%J
-20918@k%%%KkJJjjJJ%%%j%%Jj%%jK%j%%%%J%jj%KjjJ%J%jJj%j%jK%%%Jj%%Jj%Jj%J%%%%J
$$ plain form
-20965 1 0 -1 0 -1 -1 -1 -1 -1 -1 -1 0 -1 -1 0 1 0 -1 -1 -2 -2 1 0 0 -2 -2 -1 -1 0 0 -1 -2 -1 0 -2 0 -1 -1 -1 -1 0 0 -1 -2 -1 -1 0 -1 -2 -2 -1 -1 -1 -1 -2 -2 -2 -2 -1 0 -2 0 -1 -1 -2 -2 -2 1 0 -1
-21012 -1 -1 -1 -1 -1 -1 0 -1 -2 -1 -1 -2 -1 -1 0 0 0 0 0 -1 -1 -2 0 -1 0 -1 -1 -1 -1 0 0 0 -1 -1 0 0 -1 0 0 -1 -1 -1 -2 -2 0 0 1 -1 -2 -1 0 -1 0 -1 -2 -2 -2 -1 -1 -1 -1 -1 -1 -1 -1 -1 -2 -1 -1 -1
-21059 -1 -1 0 -1 -2 -1 -1 -1 -1 0 -2 0 0 0 -1 -1 -2 0 -1 -1 -1 -1 -1 -1 -1 -1 -2 -2 -1 -1 -2 -1 -1 -2 -1 -1 -2 -1 -1 0 -1 0 -2 -1 -1 0 -1 -2 -2 0 -1 -1 -1 -1 -1 0 -1 0 -1 -1 -1 0 0 -1 -1 0 -1 -1 -1 0
-21106 0 -2 -1 -2 -1 0 0 -2 -1 -1 -1 -1 -2 -1 -1 -1 -1 0 -1 -2 -3 -1 0 1 0 0 -1 -1 -1 -1 -1 -2 0 0 -1 -2 0 -1 -1 -1 -1 -2 -1 -1 0 0 -1 -2 -1 -1 -2 -1 -1 -1 -2 -2 -2 0 0 -1 -2 -2 -2 -1 -1 -1 -1 -1 -1 -1
-21153 -1 -1 0 -1 0 -1 -1 -1 -1 0 0 0 -1 -1 -1 -1 1 0 -1 -1 0 0 -2 -1 0 0 -1 -1 -1 -2 0 1 0 -1 -1 -2 -1 0 -1 -1 0 -1 -1 -1 0 0 -2 0 0 0 -1 -1 0 1 0 -2 -2 -2 -1 -2 -1 -1 -2 -2 -2 -2 -1 -1 -2 -1
-21200 -1 -1 -1 -1 -1 -1 0 -1 -1 -1 -1 -1 -1 -1 -2 -1 0 -1 -1 -1 -2 -2 -2 0 0 0 0 -1 -2 -1 -1 0 0 0 -1 -1 -1 -1 -3 -1 0 -1 -1 -1 -1 -2 -2 -2 -1 0 -1 0 -1 -1 -1 -1 -1 -1 -1 -1 -1 -1 -1 -1 -1 -2 -1 -1 -1 -1
-21247 -1 -2 -1 -1 -1 -1 1 0 -2 -1 -1 -1 -1 0 -2 -1 0 -1 -1 -1 -1 -1 -1 0 1 0 0 0 0 -1 -1 -2 -2 0 -1 0 -1 -2 -1 -1 -2 -2 -1 -1 -1 -2 -1 0 -1 -1 -1 0 -1 -1 -1 0 0 0 -1 -1 -1 -2 -2 -2 -2 -2 -2 -1 -1 -1
-21294 -1 0 0 -1 -1 -3 -1 -1 -1 0 -2 -2 0 -1 -1 -1 -1 -1 0 0 1 -1 -2 -2 -2 -2 -1 0 -1 0 0 -1 0 -1 -1 0 -1 -2 -2 -1 0 -1 -1 -1 0 0 -1 0 -1 -1 -1 -1 -1 -1 -1 -1 -1 -2 -2 -1 -1 0 -1 1 0 -1 -1 -1 -1 -1
$$ packed form
-20965AjjJj%%%%%%Jj%JJjj%j%Lj%k%J%J%jjJJkKj%%%J%jjJ%Jjj%J%%%j%%%JJkKj%j%%Ljj
-21012a%%%%%JjjJ%jJ%J%%%%j%jKjJj%%%J%%j%J%jJ%j%%j%K%JkjJJjJjj%%J%%%%%%%%jJ%%
-21059a%JjjJ%%%JkK%%j%jKj%%%%%%%j%J%jJ%jJ%jJ%JjJkJ%Jjj%Kj%%%%JjJj%%J%j%Jj%%J
-21106@kJjJJ%kJ%%%jJ%%%JjjjKJJj%j%%%%jK%jjKj%%%jJ%J%jjJ%jJ%%j%%K%jj%%J%%%%%%
-21153a%JjJj%%%J%%j%%%Kjj%J%kJJ%j%%jKJjj%jJJj%Jj%%J%kK%%j%JJjk%%JjJ%j%%%J%jJ
-21200a%%%%%Jj%%%%%%jJJj%%j%%K%%%jjJ%J%%j%%%kKJj%%%j%%JJjJj%%%%%%%%%%%%jJ%%%
-21247ajJ%%%KjkJ%%%JkJJj%%%%%JJj%%%j%j%KjJjjJ%j%J%%jJJj%%Jj%%J%%j%%j%%%%%J%%
-21294aJ%j%kK%%Jk%Kj%%%%J%Jkj%%%JJjJ%jJj%Jjj%JJj%%J%jJj%%%%%%%%j%J%JjKjj%%%%
$$ plain form
-21341 -1 -1 -1 -1 0 -1 -2 -1 -1 0 0 0 0 -1 1 1 -1 -1 -1 -1 0 -2 0 -2 -1 -1 -1 -1 -1 -2 0 -1 -1 -1 0 0 -1 -2 0 -1 -1 -1 -1 0 0 -1 -1 0 0 -1 -1 0 -1 0 1 -1 -1 -2 -1 -1 -1 -1 -1 -1 -2 -2 -2 -1 -1 -1
-21388 -1 1 0 -1 -1 -1 -2 -1 -1 -2 -2 -1 -1 -2 -1 -1 -1 0 0 0 -1 -1 -1 0 -2 0 -1 0 0 0 -1 -1 -1 -2 -2 -1 -2 -1 -1 -1 -1 -1 -1 0 -2 0 -1 -1 -1 -1 -2 0 0 -1 -1 -2 -1 -2 -2 -2 0 -1 0 -1 -1 -2 -1 -1 -1 -2
-21435 -2 -2 -1 -1 0 -2 -2 -1 0 -1 0 0 0 -1 -2 -1 -1 -2 -1 -1 -1 -1 -1 -1 -1 -1 -1 -1 -1 -1 -1 -1 0 -1 -1 -1 0 -2 0 0 0 0 -1 -2 -1 -1 -2 -1 -2 -2 -1 -2 -1 -1 -2 -2 -1 -1 -1 -1 -1 -1 0 -1 -1 -1 -1 -1 0 -1
-21482 -1 -1 -1 -1 -1 -2 -1 0 0 0 0 -1 -1 0 0 0 -2 -1 -1 0 -1 -1 -2 -3 -1 -1 0 0 0 0 -1 -1 0 0 0 -1 -2 -1 -2 -1 -1 -1 -2 -1 -1 0 0 0 0 -1 -1 -1 -1 0 0 -1 0 0 -1 -1 -2 -2 -1 -2 -1 -1 -1 -1 -1 -1
-21529 -1 -1 0 -1 0 -1 -2 -2 -1 -1 0 -1 -1 0 -1 -1 -1 -2 -1 -1 -1 -1 -1 -1 -1 -1 -1 -1 -1 -1 -1 0 0 0 0 -1 0 -1 -1 -1 -1 -1 -1 -1 -1 -1 0 0 0 0 -1 -1 -1 0 0 0 0 0 0 -1 1 -1 -1 -1 -1 -1 -1 0 0 0
-21576 0 -1 -1 -1 0 -1 -1 0 1 -2 -1 -1 -1 -1 0 0 -1 0 -1 0 -1 -1 -1 0 -1 -1 0 -1 -1 -2 -1 -1 -2 0 -1 -1 -1 0 0 -1 -2 -2 -2 -2 -1 0 -1 0 -1 -1 -1 0 0 0 0 0 0 0 0 -1 -1 -2 0 0 -1 -1 -1 0 0 -2
-21623 -2 0 -1 -1 -2 -1 -1 -1 -1 -1 -1 -1 -1 -1 -1 -1 -1 -2 -1 -2 -1 0 0 -1 0 -1 0 -1 -1 0 -1 -2 -2 -2 -2 0 -1 -1 -1 0 -1 -1 0 -1 -1 -2 -1 -1 -1 -1 -1 0 0 -2 -1 -1 -1 -1 -1 -2 -1 -1 -1 -1 -1 -1 -1 0 0 -1
-21670 -1 -1 -1 -1 -2 -1 -1 0 -1 -1 0 -2 -2 -1 -1 -2 0 -1 -2 -1 -1 -2 -2 -1 -1 -1 0 -1 -1 -1 -1 -1 -1 0 -1 -2 -2 -1 -1 0 0 -1 0 0 -1 -2 -2 -1 -1 -1 0 0 -2 0 -1 0 -1 -1 -1 0 0 0 0 -1 -1 -1 -1 -1 -1 -1
$$ packed form
-21341a%%%JjjJ%J%%%jK%k%%%JkKkJ%%%%jKj%%J%jjKj%%%J%j%J%j%JjJJk%jJ%%%%%j%%J%%
-21388aKjj%%jJ%j%J%jJ%%J%%j%%JkKjJ%%j%%j%JjJ%%%%%JkKj%%%jK%j%jJj%%KjJj%jJ%%j
-21435b%J%Jk%JJjJ%%jjJ%jJ%%%%%%%%%%%%%Jj%%JkK%%%jjJ%jJj%JjJ%j%J%%%%%Jj%%%%Jj
-21482a%%%%jJJ%%%j%J%%kJ%Jj%jjK%J%%%j%J%%jjJjJ%%jJ%J%%%j%%%J%jJ%j%j%JjJ%%%%%
-21529a%JjJjj%J%Jj%Jj%%jJ%%%%%%%%%%%%J%%%jJj%%%%%%%%J%%%j%%J%%%%%jKk%%%%%J%%
-21576@j%%Jj%JJlJ%%%J%jJjJj%%Jj%Jj%jJ%jKj%%J%jj%%%JJjJj%%J%%%%%%%j%jK%j%%J%k
-21623bKj%jJ%%%%%%%%%%%jJjJJ%jJjJj%Jjj%%%Kj%%Jj%Jj%jJ%%%%J%kJ%%%%jJ%%%%%%J%j
-21670a%%%jJ%Jj%Jk%J%jKjjJ%j%J%%Jj%%%%%Jjj%J%J%jJ%jj%J%%J%kKjJj%%J%%%j%%%%%%
$$ plain form
-21717 -1 0 -1 -1 0 -1 -1 0 0 -1 -1 0 0 -1 0 -1 0 0 0 -1 -1 -1 0 0 1 -1 0 0 -1 -2 -1 -1 -1 -2 -2 -1 0 -1 -1 0 -1 0 0 0 -1 -1 -1 -1 -1 -2 -1 -1 -2 -1 -1 -1 -1 -1 -1 -1 0 -1 -1 -1 -1 0 -1 -2 -1 0
-21764 0 -1 -2 -1 0 -1 -1 -1 -2 1 -2 -2 -1 0 -1 -2 -2 -2 -2 -1 -1 -1 0 0 -1 -1 -1 0 -1 -1 -1 -1 -1 0 -1 -1 0 -3 -2 0 -1 -1 -1 0 0 -1 -1 -1 -1 -2 -1 -2 -2 0 -1 0 -1 0 0 -1 -1 -1 -1 -1 -2 -1 1 -1 -1 -1
-21811 -1 -1 -1 0 -1 -1 0 0 -1 1 0 -1 -1 -2 -1 -1 -1 -1 -1 -1 -1 -2 -1 -1 -1 -1 -1 -1 -1 -1 0 -1 -1 0 -1 -1 -1 -1 -2 -1 0 -1 -1 -1 -1 -1 -2 -2 -1 0 -1 -2 -1 -1 -2 -1 -1 -1 0 1 0 -2 -2 -1 -1 -1 -1 -2 -2 -1
-21858 -1 -1 -2 -1 0 0 0 -1 0 -1 0 0 0 -1 -1 -1 -2 -2 0 -1 -1 -1 -2 -1 -2 -1 -1 -1 0 0 1 -1 -1 -1 -1 -1 -1 -2 -1 -2 -1 0 -1 -2 0 0 0 -1 -1 0 0 0 0 -2 -1 -2 -1 -1 -1 -1 -1 0 -1 -1 -1 0 0 -1 -2 -1
-21905 -1 0 -2 0 -1 -1 -2 0 0 -1 -2 -1 -1 0 -1 0 0 -1 -1 -2 -2 -1 0 0 -1 -2 -1 -1 -1 -2 -1 -1 -1 -2 -1 -1 0 -2 -2 -1 -1 -1 -1 0 0 0 -1 -1 -1 -1 -2 -2 -1 -1 -2 -1 -1 -2 -1 0 0 0 0 0 0 0 0 -2 -1 0
-21952 0 -1 -1 0 -1 -2 -1 -2 -1 -1 -1 -1 0 -1 -1 -1 -2 -1 -1 0 1 -1 0 -1 1 0 -1 0 -1 -2 -1 -2 -1 -2 0 -1 0 -1 -2 -1 -3 -1 0 -1 0 -1 -1 -2 -1 -1 0 0 -1 0 -2 -2 -1 -1 -1 -1 -2 -2 0 0 -1 -1 -1 0 -2 -1
-21999 -1 -1 -1 -1 0 0 0 1 0 -1 -1 -1 -2 0 -1 -1 0 0 0 0 0 -1 -1 -1 -1 0 0 -1 -1 -1 0 -1 -2 -1 0 -1 -1 -1 -1 0 0 -2 -1 -1 -1 0 0 0 -1 -1 -1 0 -1 -1 -1 0 0 -1 0 -1 -1 -2 -1 -2 -1 -1 -2 -1 -1 0
-22046 0 -1 -2 -1 -1 -1 -1 -1 0 -1 0 0 -2 0 -1 -1 -1 -1 0 0 -1 -1 0 0 0 -1 -1 -1 -1 0 0 -1 0 -1 0 0 -1 -2 0 -1 -2 -1 -1 -2 -1 0 -1 -2 0 -1 -1 -1 -1 -1 -1 -2 -1 0 -1 -1 -1 -1 0 -1 -2 0 -1 0 -2 -2
$$ packed form
-21717aJj%Jj%J%j%J%jJjJ%%j%%J%JkJ%jjJ%%j%JJj%JjJ%%j%%%%jJ%jJ%%%%%%Jj%%%JjjJJ
-21764@jjJJj%%jLl%JJjj%%%J%%J%j%%Jj%%%%Jj%JlJKj%%J%j%%%jJj%KjJjJ%j%%%%jJKk%%
-21811a%%Jj%J%jKjj%jJ%%%%%%jJ%%%%%%%Jj%Jj%%%jJJj%%%%j%JJjjJ%jJ%%JJjk%J%%%j%J
-21858a%jJJ%%jJjJ%%j%%j%Kj%%jJjJ%%J%Jk%%%%%jJjJJjjK%%j%J%%%kJjJ%%%%Jj%%J%jjJ
-21905aJkKj%jK%jjJ%JjJ%j%j%JJ%jjJ%%jJ%%jJ%Jk%J%%%J%%j%%%j%J%jJ%jJJ%%%%%%%kJJ
-21952@j%JjjJjJ%%%Jj%%jJ%JJkJjKjjJjjJjJjKjJjjJkKJjJj%jJ%J%jJk%J%%%j%K%j%%JkJ
-21999a%%%J%%Jjj%%jKj%J%%%%j%%%J%j%%JjjJJj%%%J%kJ%%J%%j%%Jj%%J%jJj%jJjJ%jJ%J
-22046@jjJ%%%%JjJ%kKj%%%J%j%J%%j%%%J%jJjJ%jjKjjJ%jJJjjKj%%%%%jJJj%%%JjjKjJk%
$$ plain form
-22093 -2 -1 0 -1 -1 -1 -1 -2 -2 -1 -1 -1 -1 0 0 0 -2 -2 -1 -1 -2 -1 -1 -1 -1 -2 -1 -1 -1 -2 -1 0 -1 0 -1 0 -1 -1 1 -1 -1 -1 0 -1 -2 0 1 -1 -1 -1 -2 -2 -1 0 -1 -2 -2 -1 -1 -2 -2 -1 -1 0 0 0 -1 0 -1 -1
-22140 -1 -1 0 -1 -1 -2 -2 -1 0 -2 -1 -1 -1 1 1 -1 -1 -1 -1 0 -1 -1 -1 -1 0 0 0 0 1 1 -1 -1 -2 -1 -1 -1 0 0 0 -1 0 -1 -1 -1 -1 -1 0 0 0 -2 -1 -1 -1 -1 0 0 0 -1 0 -1 -1 -1 -1 -1 -1 -1 0 -1 -2 -1
-22187 -1 -1 -1 -2 0 0 0 0 0 0 0 0 -1 -2 -2 -2 -1 -1 -1 -1 -1 -1 -1 -1 -2 0 0 0 -2 0 -1 -1 -2 -2 -1 -1 -1 -1 0 0 -1 0 0 0 -1 -1 -2 -2 -1 -2 -1 -1 -1 -1 -1 -1 -1 0 0 0 -1 -1 -2 -2 -2 -1 -1 0 -1 -1
-22234 -1 -1 -1 -1 -1 0 -1 -1 -2 0 0 1 0 -2 -1 -1 0 0 0 -1 -2 -1 -1 -1 -1 -2 -2 -2 -2 -2 -1 -1 -2 -2 -2 -1 -1 -1 0 -1 -1 -1 -1 -2 -1 -1 -2 0 -1 -1 -1 -3 -1 -2 -3 -2 -1 -2 -1 0 0 0 0 -1 -1 -1 0 1 1 -1
-22281 -1 -1 0 -1 -1 0 -1 -1 -1 0 0 -1 0 -2 -1 -1 -1 -2 -2 -1 -1 -1 0 -1 -1 -1 0 0 -1 -2 -1 -2 -2 -1 -1 -1 -1 0 -2 0 -1 -1 -1 -1 -1 -1 -2 -1 -2 -1 -1 -1 -2 -2 -2 -2 -1 -1 -1 0 -1 0 0 -1 -1 -2 -1 -1 -1 0
-22328 0 -2 -1 0 1 -1 -2 -1 -1 -1 -1 -1 -1 -1 -1 -2 0 0 -1 -1 0 -1 -1 -1 -1 -1 -1 -1 -1 -1 -2 0 0 -1 -1 0 -1 -1 -1 0 0 -1 -1 -2 -1 0 -1 0 -1 -2 -1 -2 -1 -2 -2 0 -1 -1 -1 0 0 -1 0 0 -1 -1 -1 -1 -1 -1
-22375 -1 -2 -1 -1 -1 -1 -2 -2 -1 -1 -1 0 0 -1 0 -1 -1 -1 -2 0 -1 -1 -3 -1 0 -1 -1 -1 -2 -1 0 0 0 0 -1 -1 -1 -1 -1 0 -1 -1 -1 -1 -1 -1 -1 -3 -1 0 0 -1 -2 -1 -1 0 -1 -1 -1 -1 -2 0 0 0 -1 0 -2 -2 -1 -1
-22422 -1 0 -1 0 -1 -1 -1 0 0 0 -1 0 0 -1 -2 -2 -1 0 -1 -1 0 -2 -2 -1 -1 -1 -1 -1 -1 -1 -2 -1 -1 -2 -1 0 -1 0 -1 -1 -1 0 0 -1 -1 -1 -2 -1 -1 -2 -1 -1 -1 0 -1 -2 -2 -2 -1 0 -1 -1 -1 -2 0 -1 -2 -2 -1 -2
$$ packed form
-22093bJJj%%%j%J%%%J%%k%J%jJ%%%jJ%%jJJjJjJj%Kk%%JjjKJk%%j%JJjj%J%j%J%J%%jJj%
-22140a%Jj%j%JJkJ%%K%k%%%Jj%%%J%%%J%k%jJ%%J%%jJj%%%%J%%kJ%%%J%%jJj%%%%%%JjjJ
-22187a%%jK%%%%%%%jj%%J%%%%%%%jK%%kKj%j%J%%%J%jJ%%j%j%JjJ%%%%%%J%%j%j%%J%Jj%
-22234a%%%%Jj%jK%JjkJ%J%%jjJ%%%j%%%%J%j%%J%%Jj%%%jJ%jKj%%kKjjJJjJJ%%%j%%JJ%k
-22281a%Jj%Jj%%J%jJkJ%%j%J%%Jj%%J%jjJj%J%%%JkKj%%%%%jJjJ%%j%%%J%%JjJ%j%jJ%%J
-22328@kJJJkjJ%%%%%%%jK%j%Jj%%%%%%%%jK%j%Jj%%J%j%jJJjJjjJjJj%Kj%%J%jJ%j%%%%%
-22375ajJ%%%j%J%%J%jJj%%jKj%kKJj%%jJJ%%%j%%%%Jj%%%%%%kKJ%jjJ%Jj%%%jK%%jJk%J%
-22422aJjJj%%J%%jJ%jj%JJj%Jk%J%%%%%%jJ%jJJjJj%%J%j%%jJ%jJ%%Jjj%%JJj%%jKjj%Jj
$$ plain form
-22469 -2 -2 -1 -1 -1 -1 -1 -1 -1 -2 -1 -2 -1 -2 -1 0 0 -1 0 -1 0 0 0 0 -1 -1 -1 -2 -2 -1 -1 -2 -1 -2 -2 -2 -1 -2 -2 -2 -1 0 -1 -1 0 -2 -2 0 0 0 0 0 -2 -1 -1 -2 -2 0 -1 0 -1 -1 -2 0 -1 -1 -2 -1 -2 -2
-22516 -2 -1 0 1 -1 -1 -2 -1 -1 -2 -1 -2 0 -1 -2 -2 -2 -1 -1 -1 -2 -2 -1 0 -1 0 0 0 -1 -2 -1 -2 -2 -1 -1 -1 -1 -1 -1 -1 -1 -1 -1 0 -1 0 -1 -2 0 -2 -1 -1 -1 0 -1 -1 -1 -1 -1 0 0 1 0 -1 -1 -2 -1 -1 0 -1
-22563 -1 -1 -2 -1 -1 0 -1 -1 -1 -1 -2 -1 0 -1 -2 -1 -1 0 -1 -1 -2 -1 -1 -2 -2 -2 -1 0 -2 -2 -1 -1 -1 -1 -1 -1 -1 -2 -1 -2 -1 -1 -1 -1 -1 -1 -1 0 1 0 -1 -1 0 -2 -1 -1 -1 -1 -1 -1 -1 -1 -1 -2 -1 0 -1 -1 0 -1
-22610 -1 -2 -2 -2 -1 0 0 -1 -1 0 -1 -1 -1 0 1 -1 -1 0 -1 -1 -1 -1 0 -2 -1 -1 -1 -2 -1 0 -1 -1 -1 -1 -2 -2 -1 -1 -1 0 -1 -1 0 -2 0 -2 -1 -1 -1 -1 -2 -2 0 0 -1 0 -1 -1 0 -1 0 -1 -1 -1 -1 -1 -1 -1 -1 -1
-22657 -1 -1 -2 -2 -2 -1 0 -2 -1 0 0 -1 -1 -1 -1 0 -1 -1 -2 -1 0 -1 -1 -3 -2 -1 0 -1 0 -1 -1 -1 -1 -2 -2 -1 0 0 -1 0 -1 -1 -1 -1 -1 0 -1 -1 -1 -1 0 0 -1 -1 0 -1 -1 -1 0 0 0 -1 -2 -1 -1 -1 -1 -2 -1 -1
-22704 -1 0 1 -1 0 0 -1 -1 -2 -2 0 -1 -1 -1 0 -1 -2 -2 -2 -2 -2 -1 -1 -1 0 -2 -1 1 0 0 0 -1 -1 0 -2 -1 0 -1 0 1 -1 -1 -1 -1 0 -1 -1 -1 -1 0 -1 -1 -1 -1 -1 0 -1 -1 -1 0 -2 0 -2 -2 -2 -1 -3 -1 0 -1
-22751 -1 -1 -1 0 -1 -2 -1 -1 -1 -2 -1 -1 -1 -2 -1 -1 0 0 -1 -1 0 0 0 0 -1 -1 0 -1 0 -1 0 0 -1 -2 -1 -2 -2 -2 -2 -2 -2 -2 -1 -1 0 -1 -1 -1 -1 -1 -2 -1 -1 -2 0 -1 -1 -1 0 -1 -1 -1 -1 0 -1 -2 -2 -2 -1 -1
-22798 -1 -1 -2 -1 -1 -2 -2 -1 -2 -1 -1 -1 0 -1 -1 -1 -2 -1 0 -1 -1 -2 -2 -1 -1 -1 -2 0 -1 0 -1 -1 -2 -1 0 -1 -1 0 0 -1 1 0 0 -1 -1 -1 0 0 -2 -1 -1 -1 -2 0 1 1 -2 -1 -1 -1 -1 0 0 -1 -1 0 -2 -3 -1 -1
$$ packed form
-22469b%J%%%%%%jJjJjJJ%jJjJ%%%j%%j%J%jJj%%Jj%%JJj%Jk%K%%%%kJ%j%KjJj%jKj%jJj%
-22516bJJJk%jJ%jJjKjj%%J%%j%JJjJ%%jjJj%J%%%%%%%%%JjJjjKkJ%%Jj%%%%J%Jjj%jJ%Jj
-22563a%jJ%Jj%%%jJJjjJ%Jj%jJ%j%%JJk%J%%%%%%jJjJ%%%%%%JJjj%JkJ%%%%%%%%jJJj%Jj
-22610aj%%JJ%j%Jj%%JJk%Jj%%%JkJ%%jJJj%%%j%J%%Jj%JkKkJ%%%j%K%jJj%JjJj%%%%%%%%
-22657a%j%%JJkJJ%j%%%Jj%jJJj%kJJJjJj%%%j%JJ%jJj%%%%Jj%%%J%j%Jj%%J%%jjJ%%%jJ%
-22704aJJkJ%j%j%Kj%%Jjj%%%%J%%JkJKj%%j%JkJJjJJk%%%Jj%%%Jj%%%%Jj%%JkKk%%JkKJj
-22751a%%JjjJ%%jJ%%jJ%J%j%J%%%j%JjJjJ%jjJj%%%%%%J%Jj%%%%jJ%jKj%%Jj%%%Jjj%%J%
-22798a%jJ%j%JjJ%%Jj%%jJJj%j%J%%jKjJj%jJJj%J%jKj%j%%J%kJ%%jKJ%lJ%%%J%j%JkjK%
$$ plain form
-22845 -1 -1 -1 -2 -1 -1 -1 0 -1 -2 -1 -2 -1 -1 -1 -1 -1 -1 -2 -1 -1 -1 0 -1 -1 -1 0 -1 -1 -1 -1 -1 -1 -1 -1 -1 -1 -1 1 -1 0 0 0 -1 0 -1 -1 -1 -2 -1 -1 -1 -1 0 -1 -2 -1 -1 -1 -2 -1 -1 0 0 0 -1 -1 -1 -2 -1
-22892 -1 -1 -2 -1 -1 -1 -2 0 0 0 -1 -1 -1 -1 -2 -2 -1 -2 -2 -1 -2 -1 -1 -2 0 0 -1 -1 -1 -1 0 -1 -1 -2 -1 -2 -1 0 -1 0 -1 -1 0 0 -1 -1 -1 0 -1 -1 -1 0 0 0 0 -1 -1 -2 -1 -1 -1 -2 -1 0 -1 -1 -1 -1 0 0
-22939 0 0 -2 -1 0 0 0 0 0 0 -1 -1 -1 0 -2 -1 0 -1 -1 -1 0 -1 0 -1 -2 -2 -2 -1 0 -1 -1 0 1 0 -1 0 0 -1 0 0 0 0 -1 -1 0 0 -1 0 -1 0 -1 -2 -1 -1 -1 -1 -2 0 0 -1 -1 0 0 0 -1 -1 -1 -1 -1 -2
-22986 -2 -1 -2 -2 -2 -1 -1 -1 -1 -1 -1 0 -1 -1 0 0 -1 -1 -2 -1 -1 -1 -1 0 -1 0 -1 -1 -1 -1 -1 0 -1 -1 -2 -1 -1 0 0 0 -2 -1 -1 -2 -2 -1 -1 -2 -2 -1 -1 -1 -2 -1 -1 0 -1 -2 -1 -1 -1 -1 -2 -2 -2 -1 -1 0 -1 -2
-23033 -2 -1 -1 0 -1 -1 0 0 -2 0 0 0 -1 -1 -1 0 0 -1 -1 0 -1 -1 -2 -1 0 0 -2 -1 -1 -1 -1 -1 -1 -2 -2 -1 -1 -2 0 1 -1 -2 0 0 -1 -1 -1 -1 -1 -2 -1 0 -1 -1 -1 -1 -1 -1 0 -1 -1 0 0 -1 -1 0 0 -2 -1 -1
-23080 -1 -1 -2 -1 -1 -2 -1 -1 -1 -1 -1 -1 -1 -2 -1 -2 -2 -1 0 -1 -1 -1 -2 -2 -1 0 -1 -1 -1 -1 0 -1 -2 -1 -1 -1 -1 0 0 -2 -2 -1 -1 -1 -2 -1 0 1 0 0 -1 -1 -1 -1 -1 -1 0 0 -2 -2 -1 -1 -1 -2 -2 0 -1 -2 -1 0
-23127 0 -2 0 -1 -1 -1 0 0 -2 -1 -1 -1 -1 -1 1 -1 -1 0 -1 -1 -1 -1 -1 0 -1 -1 -1 -1 -1 -2 -1 -1 -1 0 -1 -2 -1 0 1 0 -2 -3 -2 -1 -1 -2 -1 -1 0 0 1 -1 -2 -1 -1 0 -1 -2 -1 -1 -1 0 -1 -1 -1 0 0 0 -1 -1
-23174 -1 -2 -1 -1 0 0 0 0 -1 0 -1 0 0 0 -1 0 -1 -1 0 0 -1 0 0 -1 -1 -1 -1 -1 -2 -2 -1 -2 0 -2 -1 0 -1 -2 -1 -1 0 -1 -2 -1 0 0 0 1 -2 -1 -1 -1 -1 0 0 0 -1 -1 -1 0 0 0 -1 0 0 -1 -1 -1 0 0
$$ packed form
-22845a%%jJ%%JjjJjJ%%%%%jJ%%Jj%%Jj%%%%%%%%%%KkJ%%jJj%%jJ%%%JjjJ%%jJ%J%%j%%jJ
-22892a%jJ%%jK%%j%%%j%Jj%JjJ%jK%j%%%Jj%jJjJJjJj%J%j%%Jj%%J%%%j%jJ%%jJJj%%%J%
-22939@%kJJ%%%%%j%%JkJJj%%JjJjj%%JJj%JJjjJ%jJ%%%j%J%jJjJjjJ%%%jK%j%J%%j%%%%j
-22986bJj%%J%%%%%Jj%J%j%jJ%%%JjJj%%%%Jj%jJ%J%%kJ%j%J%j%J%%jJ%JjjJ%%%j%%J%Jjj
-23033bJ%Jj%J%kK%%j%%J%j%Jj%jJJ%kJ%%%%%j%J%jKJkjK%j%%%%jJJj%%%%%Jj%J%j%J%kJ%
-23080a%jJ%jJ%%%%%%jJj%JJj%%j%JJj%%%JjjJ%%%J%k%J%%jJJJj%j%%%%%J%k%J%%j%KjjJJ
-23127@kKj%%J%kJ%%%%Kk%Jj%%%%Jj%%%%jJ%%JjjJJJjkjJJ%jJ%J%JkjJ%JjjJ%%Jj%%J%%j%
-23174ajJ%J%%%jJjJ%%jJj%J%jJ%j%%%%j%JjKkJJjjJ%JjjJJ%%JlJ%%%J%%j%%J%%jJ%j%%J%
$$ plain form
-23221 0 -1 -1 -1 0 -1 -1 0 0 -1 0 0 -1 -1 0 -1 1 -1 -2 -1 -1 -1 -1 -1 -2 0 -1 -2 -1 -1 -2 -1 -2 -1 -1 -2 -1 -1 0 0 -1 -1 -1 0 -1 -1 -2 0 -1 -1 0 0 -1 -1 -1 -1 0 1 0 0 0 -1 -1 0 -1 -1 -1 -1 -1 0
-23268 0 0 0 -1 -1 0 -2 -1 0 -1 -1 -1 0 0 -1 -1 0 -1 -1 0 1 -1 0 -1 -2 -2 -2 -1 -1 0 0 -1 -1 -1 -1 0 0 -1 1 -1 0 -1 -2 0 -1 -1 -1 -1 -1 -1 -1 0 0 0 0 -1 -1 -1 0 0 0 -1 -1 -1 -1 -1 -1 -1 -1 -1
-23315 -1 0 0 0 -1 -1 -1 0 -1 -1 1 -1 -1 0 -1 0 -2 -1 -1 -2 0 -2 -1 -1 -3 -2 -2 -1 -1 0 -1 -1 -1 0 -1 -1 -1 -1 -1 -1 -1 -2 -2 -2 -1 -1 -1 -1 -1 -1 -2 0 0 -1 0 0 -1 -1 -2 -2 -1 -1 0 -2 -1 0 -1 -1 -1 -1
-23362 -1 -2 -1 1 0 0 -1 -1 -2 -1 -1 -1 -2 -1 0 0 0 -1 -1 0 -1 0 0 -2 -2 -1 -1 0 0 0 0 -2 0 -1 -1 -1 -1 -1 0 -1 -1 0 -1 -1 0 -2 -2 -1 -1 -2 -1 -1 0 -1 -1 0 -1 0 0 -2 -1 0 -1 -1 -1 -1 0 -1 0 0
-23409 0 -1 -2 -1 -1 -1 -1 -1 1 -2 -1 0 -1 -1 -2 -1 -2 -2 -1 -1 0 -1 -1 -1 -1 -2 -2 -1 -1 -1 -1 -1 -2 -2 -2 -1 -1 -2 -2 0 0 -1 -2 -1 -1 -2 -1 0 -1 -2 -2 -2 -2 -2 -1 -1 -1 -1 -1 -1 0 0 -1 -1 0 -1 -1 -1 -2 -1
-23456 -1 -1 -2 -1 -1 0 -2 -1 -1 -1 1 0 -1 -1 -1 -1 -1 -2 -2 -2 -1 -1 -1 0 0 -2 -2 -2 -1 -1 -1 -1 -1 0 -1 0 0 -1 -1 -1 0 -2 -1 -1 -1 0 0 -2 -1 -1 -1 -1 -1 -2 -1 -1 -1 -1 0 0 1 -1 0 -1 -1 -1 -1 -1 -1 -2
-23503 -2 -1 -2 -1 -2 -1 -1 -1 -1 -2 -1 -1 -1 -1 -1 -1 -1 0 -1 -1 -1 0 -1 -2 -2 -2 0 0 -1 -1 -1 -1 -4 -1 0 0 0 -1 -1 -1 -1 0 -1 -1 -1 -1 -2 0 -1 -1 -1 -2 -1 -1 -1 -1 -1 -1 -1 -1 -2 -2 -1 -1 -1 -1 0 0 -1 -1
-23550 -1 -1 0 0 0 -1 -2 -1 -2 -1 -2 -2 -1 -1 0 0 -1 -1 -1 0 -1 -1 -1 -1 0 -1 -1 -1 0 -1 -1 -1 -1 -2 0 -1 -1 -2 -1 -1 0 -1 0 0 0 -1 0 -2 -2 -2 -1 -1 -1 -1 0 -1 -1 -2 -3 -2 -1 -1 -1 -1 -1 -2 -1 -1 -1 -1
$$ packed form
-23221@j%%Jj%J%jJ%j%JjKkjJ%%%%jKjjJ%jJjJ%jJ%J%j%%Jj%jKj%J%j%%%JJj%%j%Jj%%%%J
-23268@%%j%JkJJj%%J%j%Jj%JJkJjj%%J%J%j%%%J%jKkJjjKj%%%%%%J%%%j%%J%%j%%%%%%%%
-23315aJ%%j%%Jj%Kk%JjJkJ%jKkJ%kJ%J%Jj%%Jj%%%%%%j%%J%%%%%jK%jJ%j%j%J%JkJJj%%%
-23362ajJKj%j%jJ%%jJJ%%j%JjJ%k%J%J%%%kKj%%%%Jj%Jj%Jk%J%jJ%Jj%JjJ%kJJj%%%JjJ%
-23409@jjJ%%%%KlJJj%jJj%J%Jj%%%j%J%%%%j%%J%j%K%jjJ%jJJjj%%%%J%%%%%J%j%Jj%%jJ
-23456a%jJ%JkJ%%Kjj%%%%j%%J%%J%k%%J%%%%JjJ%j%%JkJ%%J%kJ%%%%jJ%%%J%JkJj%%%%%j
-23503bJjJjJ%%%jJ%%%%%%Jj%%Jjj%%K%j%%%lLJ%%j%%%Jj%%%jKj%%jJ%%%%%%%j%J%%%J%j%
-23550a%J%%jjJjJj%J%J%j%%Jj%%%Jj%%Jj%%%jKj%jJ%JjJ%%jJk%%J%%%Jj%jjJJ%%%%jJ%%%
$$ plain form
-23597 -1 -1 -2 0 -1 -1 -1 -1 -1 -1 -1 -1 0 -1 -1 -2 -1 0 -1 -1 0 0 -1 -2 0 -1 -1 0 -1 -2 -2 -1 0 -1 -1 -2 -1 -1 0 0 -2 -2 -1 -1 -1 -1 -2 -1 -1 -1 -1 0 -2 -1 -2 -2 -1 -1 -2 0 -1 -1 0 -1 -1 0 -1 -1 -2 -1
-23644 -1 -1 -1 -1 -1 -1 -1 -2 -2 -2 0 -1 -1 -1 -1 -1 0 -1 -1 -2 -2 -1 -2 -1 0 -1 -1 -2 -1 -1 -1 0 0 0 -1 -2 -1 -1 -1 -1 -1 -1 -1 0 -2 -1 -1 -1 -1 0 -2 -2 0 1 -2 -1 -1 -1 -1 -2 -1 -1 -1 -1 -1 -1 -1 -1 0 -1
-23691 -1 -1 0 -1 -2 -2 -1 0 -1 -1 -1 0 0 -1 0 -1 -1 -1 -1 -2 -1 -1 -1 0 -2 -1 -1 -1 0 0 -1 -1 -1 -2 0 -1 0 -1 0 0 -1 -2 0 -1 -1 -1 -2 0 -1 -1 -1 -1 0 -2 -1 0 -2 -1 0 -1 -1 0 -1 -2 -2 -2 0 0 0 0
-23738 0 -1 -2 -1 -1 -1 -1 -1 -1 -1 -1 -1 -1 -1 -1 -1 -1 0 -1 0 -1 -1 -1 -1 -1 -1 0 -1 -1 0 0 0 -1 -1 -1 -2 -2 -1 0 0 0 0 0 -1 -1 -1 0 -2 -1 0 0 0 0 0 0 0 -1 -1 -1 0 -1 -1 -1 0 -1 -1 -1 -1 0 -1
-23785 -1 -1 -1 -2 0 -1 0 0 0 0 -1 -1 0 -1 -1 -1 -2 -2 -2 -1 -1 0 -1 -1 0 -1 -2 0 0 -1 -1 -1 -1 0 -1 -1 -2 0 0 -2 -1 -1 -2 -1 -1 0 -1 -1 -2 -2 -2 -3 -1 -2 -1 0 0 -3 0 0 -1 0 0 -1 -1 -1 -1 -1 -1 0
-23832 0 -1 0 0 0 -1 -1 -1 -1 -1 -1 -1 -1 -1 0 -1 -2 -1 -2 -1 -1 0 -1 -1 -1 -1 0 -1 -1 -1 0 -1 -1 -1 0 -1 0 -1 -1 -1 -2 0 -2 0 -1 -1 -1 -1 -2 -2 -1 0 -1 0 -1 -1 -1 -1 -1 -1 -1 -1 -1 0 -1 -1 -1 -1 -1 0
-23879 0 -1 0 0 0 0 -1 -1 -1 -1 -1 -1 -1 -1 0 -2 -2 0 -1 -1 0 0 0 -1 -1 -1 -2 -1 -1 -1 0 -2 -1 -1 -1 -1 -2 -1 -2 0 0 0 -1 -1 -1 -2 0 -1 -2 -1 -1 -1 -1 -1 -1 0 -1 -1 -3 -1 0 0 -1 -1 -1 -1 -1 1 0 0
-23926 0 1 0 0 -1 -1 -1 -1 -1 -1 -1 -1 -2 0 0 -2 -1 -1 -1 -2 -2 -1 -2 -1 -1 1 0 0 0 0 -1 -1 -1 -1 -1 -1 -1 -1 -2 -1 -2 -1 -2 -2 -2 -1 -2 -1 -1 -1 -1 -1 -1 0 -1 -1 0 -1 -1 0 -1 -2 -2 -1 0 -1 0 -1 -1 -1
$$ packed form
-23597a%jKj%%%%%%%Jj%jJJj%J%jjKj%Jjj%JJj%jJ%J%k%J%%%jJ%%%JkJj%J%jKj%Jj%Jj%jJ
-23644a%%%%%%j%%Kj%%%%Jj%j%JjJJj%jJ%%J%%jjJ%%%%%%JkJ%%%Jk%KJlJ%%%jJ%%%%%%%Jj
-23691a%Jjj%JJj%%J%jJj%%%jJ%%JkJ%%J%j%%jKjJjJ%jjKj%%jKj%%%JkJJkJJj%Jjj%%K%%%
-23738@jjJ%%%%%%%%%%%%%JjJj%%%%%Jj%J%%j%%j%JJ%%%%j%%JkJJ%%%%%%j%%Jj%%Jj%%%Jj
-23785a%%jKjJ%%%j%Jj%%j%%J%Jj%JjjK%j%%%Jj%jK%kJ%jJ%Jj%j%%jKjJJ%lL%jJ%j%%%%%J
-23832@jJ%%j%%%%%%%%JjjJjJ%Jj%%%Jj%%Jj%%JjJj%%jKkKj%%%j%JJjJj%%%%%%%%Jj%%%%J
-23879@jJ%%%j%%%%%%%Jk%Kj%J%%j%%jJ%%JkJ%%%jJjK%%j%%jKjjJ%%%%%Jj%kKJ%j%%%%Kj%
-23926@Jj%j%%%%%%%jK%kJ%%j%JjJ%Kj%%%j%%%%%%%jJjJj%%JjJ%%%%%Jj%Jj%Jjj%JJjJj%%
$$ plain form
-23973 -1 0 -1 -1 -1 0 0 -1 -1 -1 -1 -2 -1 -1 -1 -1 -2 -1 0 -1 -3 -1 -1 -1 -1 0 0 -1 -1 0 0 -1 0 -1 0 0 0 0 0 0 -1 -1 -1 0 -1 -2 -1 -1 0 0 0 -1 -1 -1 -1 -1 -1 -1 0 -1 -2 -1 -1 -2 -2 -1 -1 0 0 0
-24020 0 0 -1 0 -1 -1 -1 1 0 0 0 -1 -1 0 0 -1 0 -1 -1 -1 -2 -1 -1 -1 -1 -1 -1 0 0 -1 -1 -1 -1 -1 -1 -1 -1 -1 0 0 -1 -1 -1 -1 -2 -1 -1 0 -1 -2 -2 -2 -1 -1 -1 -1 0 -1 -1 -1 0 -1 0 0 -2 -1 -1 0 0 -1
-24067 -1 -1 0 -1 -1 -1 -1 -1 -1 -1 -1 -2 -2 -1 -1 -2 -3 -1 -1 0 -1 -1 0 0 -1 0 1 0 0 -2 -1 -1 0 -2 -2 -1 -1 -2 -1 -1 -1 -2 0 -1 -2 0 -2 -1 -1 -1 0 0 -1 -2 -1 -1 -1 -2 -2 -2 -1 0 0 0 -1 -1 -1 0 -1 -1
-24114 -1 0 0 -1 -1 -1 -1 -1 -1 -1 -1 0 -1 0 -1 -2 -1 0 -1 -1 -1 -1 -1 -1 -2 0 -1 -1 -2 -1 -1 -1 0 0 -1 -1 -1 -1 0 -1 -1 0 -2 -1 0 -1 -1 -1 0 -1 -2 -2 -1 0 -1 -2 -1 -1 -1 0 -1 0 -1 -1 -2 -1 -1 -2 -1 -1
-24161 -1 -1 -1 -1 -3 0 -1 0 0 -1 -1 -2 -1 -1 -1 -2 -1 0 -1 -2 -1 -3 -2 -1 -1 -2 -1 -1 -2 -1 0 -1 -1 -1 0 -1 -1 0 0 0 -2 -1 -1 0 0 -2 -1 -1 -2 -2 -1 -1 -1 -2 -2 -1 -2 0 0 -1 -1 -1 -1 0 -1 -1 -1 -1 0 -1
-24208 -1 -2 -2 -1 -2 -2 -2 0 0 0 0 -1 -1 -1 -2 -1 -1 0 -2 -1 -1 -1 -1 -1 -2 -1 -1 -1 -1 -1 0 -1 -2 0 -2 -1 -1 -1 -1 -1 0 0 0 -1 -2 -2 -1 0 -1 -1 -1 -1 -1 -1 -2 -1 -1 -1 0 -1 -1 -1 -1 -1 -1 0 -1 -1 0 0
-24255 0 -1 -1 0 0 -1 -1 -1 -2 -2 -1 -1 -1 -2 0 -1 -1 -1 -1 -1 1 -1 -1 0 -1 -2 -1 0 -1 0 0 -1 -1 -2 -1 -1 -2 -1 0 -1 -1 -1 -1 -1 0 -2 -1 -1 0 -1 -2 -2 -1 0 0 -1 -1 -1 -1 -2 -1 -2 -1 -1 -1 0 0 0 -1 -1
-24302 -1 -1 -2 -2 -1 -1 -1 0 -2 -1 -1 -1 -1 0 -1 -1 -1 -1 -3 -2 -2 0 -1 -1 -2 -2 -1 -1 -1 -1 -1 1 1 0 -1 0 0 -1 -1 -1 -1 -1 -1 0 -1 -2 -1 -1 -1 -1 -1 0 -1 -2 -1 -1 -2 -1 -1 -1 -1 0 -1 -1 -1 0 -1 -1 -1 -1
$$ packed form
-23973aJj%%J%j%%%jJ%%%jJJjkK%%%J%j%J%jJjJ%%%%%j%%JjjJ%J%%j%%%%%%JjjJ%j%J%J%%
-24020@%jJj%%Kj%%j%J%jJj%%jJ%%%%%J%j%%%%%%%%J%j%%%jJ%Jjj%%J%%%Jj%%JjJ%kJ%J%j
-24067a%Jj%%%%%%%j%J%jjK%Jj%J%jJJj%kJ%Jk%J%jJ%%jKjjKkJ%%J%jjJ%%j%%JJ%%j%%Jj%
-24114aJ%j%%%%%%%JjJjjJJj%%%%%jKj%jJ%%J%j%%%Jj%JkJJj%%Jjj%JJjjJ%%JjJj%jJ%jJ%
-24161a%%%kLjJ%j%jJ%%jJJjjJkJJ%jJ%jJJj%%Jj%J%%kJ%J%kJ%j%J%%j%JjK%j%%%Jj%%%Jj
-24208aj%Jj%%K%%%j%%jJ%JkJ%%%%jJ%%%%JjjKkJ%%%%J%%jj%JJj%%%%%jJ%%Jj%%%%%Jj%J%
-24255@j%J%j%%j%J%%jKj%%%%Kk%JjjJJjJ%j%jJ%jJJj%%%%JkJ%Jjj%JJ%j%%%jJjJ%%J%%j%
-24302a%j%J%%JkJ%%%Jj%%%kJ%Kj%j%J%%%%K%jjJ%j%%%%%JjjJ%%%%JjjJ%jJ%%%Jj%%Jj%%%
$$ plain form
-24349 -1 -1 -1 -1 0 0 -1 -2 -2 -2 -1 -2 -2 -2 -1 -2 -2 -2 -1 -1 0 -1 -1 -1 -1 -2 -1 -1 0 -2 -2 -1 0 0 -2 -1 -2 -1 0 -1 -1 0 0 -2 -1 -1 -1 -3 -2 -2 -1 -1 -1 -1 -1 0 -2 -1 -2 -1 -1 -1 -1 -1 -1 0 -1 -2 -1 -2
-24396 -2 -1 0 -1 -2 -1 -1 -1 -2 0 1 -1 -1 -1 -2 -1 -2 -1 -1 -1 -2 -2 -1 -1 -1 -1 -1 0 -1 0 -1 -2 0 -1 -1 -2 0 0 0 -1 -2 -1 0 -1 -2 -1 -1 -1 -1 -1 -1 -1 -2 -1 -1 -1 0 0 -1 -1 0 -1 -1 -1 -1 -1 -1 -2 -2 -1
-24443 -1 0 -1 -1 -1 -1 -1 -1 -2 -1 -2 -2 -2 -2 -2 -1 -2 -1 0 0 0 -1 -1 -1 -1 -1 -1 -1 -1 -1 -1 -2 -1 -1 -1 -1 0 -1 -1 0 0 -2 -2 -2 -2 -1 -2 -2 -2 -1 -1 -1 0 -1 -1 0 0 1 -1 -2 -1 -1 -1 -2 -2 0 0 -1 -1 0
-24490 0 -1 -1 -2 -1 0 -1 -1 -1 -2 0 0 -2 0 0 -1 -2 -2 -2 -1 -1 0 -1 -1 -1 -1 0 -1 0 -1 -1 -2 -1 -1 -1 0 -1 -1 -1 -1 -1 -2 -1 -2 -1 -1 -2 -2 -2 -1 -1 -1 0 -2 -2 -2 -2 -1 -1 -1 -2 0 0 -1 -1 -1 0 0 0 -1
-24537 -1 -1 -1 -1 -1 -1 -1 -1 0 -1 -1 -1 -1 -1 -2 0 -2 -1 -1 -1 -1 -1 -1 -1 -1 -2 -1 -1 -1 -1 -2 -1 -1 -1 -2 -1 -1 -1 0 -1 -1 -2 -2 -1 0 -1 -1 -2 -1 -1 -2 -2 -2 -2 -1 -2 -1 -2 -2 -2 -2 -2 -1 -1 -1 -1 -2 0 0 0
-24584 0 -2 -1 -1 -1 -2 -2 -1 -1 0 0 0 -2 -1 -1 -1 0 -1 -1 -1 0 -1 -1 -2 0 -1 -1 -2 -2 -1 -2 -2 -1 0 -1 -2 -1 -1 0 -1 -1 0 -1 -1 -1 -1 0 -1 0 0 0 0 0 -1 -1 -1 -1 0 0 -3 -2 0 0 -2 -1 -1 -1 -1 -1 -1
-24631 -1 -1 -1 -1 0 -1 -2 -2 1 -1 -1 -1 0 -1 0 -1 -1 0 -1 -1 -1 0 -1 -2 -2 -1 -1 -1 -2 -1 -1 -2 -1 -1 -1 -1 -1 -1 -1 -1 -1 -2 -1 0 -1 -1 -1 0 -2 -1 0 0 -1 -1 0 -1 -2 0 -2 0 -1 0 -2 -2 -1 -1 -2 -1 -1 -1
-24678 -1 -1 0 0 -1 -1 -1 -1 0 -1 -1 -1 0 -2 -1 -1 -1 -2 -2 -1 0 0 -1 -2 -1 0 -2 -1 -1 0 -2 -2 -1 -1 -1 -1 -1 -1 -2 -2 -2 0 -1 -2 -2 -2 -1 -1 -1 -1 -1 -1 -1 -2 -2 -2 -1 -1 0 -1 -1 -2 -2 -2 -1 -1 -1 0 -2 -2
$$ packed form
-24349a%%%J%jj%%Jj%%Jj%%J%Jj%%%jJ%Jk%JJ%kJjJJj%J%kJ%%kJ%J%%%%JkJjJ%%%%%JjjJj
-24396bJJjjJ%%jKJk%%jJjJ%%j%J%%%%JjJjjKj%jK%%jjJJjjJ%%%%%%jJ%%J%j%Jj%%%%%j%J
-24443aJj%%%%%jJj%%%%JjJJ%%j%%%%%%%%%jJ%%%Jj%J%k%%%Jj%%J%%Jj%J%JkjJ%%j%K%j%J
-24490@j%jJJj%%jK%kK%jj%%J%Jj%%%JjJj%jJ%%Jj%%%%jJjJ%j%%J%%Jk%%%J%%jK%j%%J%%j
-24537a%%%%%%%Jj%%%%jKkJ%%%%%%%jJ%%%jJ%%jJ%%Jj%j%JJj%jJ%j%%%JjJj%%%%J%%%jK%%
-24584@kJ%%j%J%J%%kJ%%Jj%%Jj%jKj%j%Jj%JJjjJ%Jj%Jj%%%JjJ%%%%j%%%J%lJK%kJ%%%%%
-24631a%%%Jjj%Lk%%JjJj%Jj%%Jjj%J%%jJ%jJ%%%%%%%%jJJj%%JkJJ%j%JjjKkKjJk%J%jJ%%
-24678a%J%j%%%Jj%%JkJ%%j%JJ%jjJJkJ%Jk%J%%%%%j%%Kjj%%J%%%%%%j%%J%Jj%j%%J%%Jk%
$$ plain form
-24725 -2 0 -1 -2 0 0 -1 -2 0 0 -2 1 0 -1 0 0 1 -1 -1 -1 -1 -1 -2 -2 -1 0 0 0 -1 -1 0 -1 -2 -2 -1 -1 -1 -1 -1 -1 -1 -2 0 0 0 -1 -1 -1 1 -2 -1 -1 0 0 -1 -1 -1 0 -1 -1 -1 -2 -1 0 -1 -1 -2 -2 -1 -2
-24772 -2 -3 -2 -2 0 -1 0 0 -1 -1 -3 -2 -1 -1 0 0 0 -1 -1 -1 -1 -1 -1 -1 0 -1 -1 0 -1 -1 -1 -1 -1 -2 -1 -1 -1 -1 -1 -2 -1 -1 0 0 0 0 -1 -1 -1 -1 -1 0 -1 -1 -2 -2 0 -2 -2 -2 -2 -1 -1 -1 0 -2 -1 -1 0 -1
-24819 -1 -1 -3 -1 -1 0 0 0 0 0 -1 -2 -2 -1 -1 -1 -1 0 0 -1 -2 -1 -2 -1 0 -1 -1 -1 -1 0 0 0 -1 -2 -1 -1 -1 0 -1 -1 0 0 0 -1 -1 -1 -1 -2 -2 -1 -1 -1 -1 -1 -1 -2 -3 -2 -1 -1 -1 -1 0 -2 -1 -1 -2 -1 0 -2
-24866 -2 -1 0 -1 0 -2 -1 0 0 -1 0 -1 -1 -2 0 -1 -1 -1 0 -2 -2 0 -2 -2 -1 -1 -1 -2 -1 -1 0 -1 -1 0 -1 -1 0 0 0 0 -1 -1 -1 -2 0 -2 -1 -1 -1 -1 -1 0 -1 0 0 -1 -1 -2 -1 -1 -1 -1 0 1 0 -1 -1 -1 0 -1
-24913 -1 0 -1 -1 0 -2 -2 -2 -1 0 -1 0 -1 -1 -2 0 0 0 -2 0 0 -1 -2 0 -1 -2 -2 -2 -1 -1 -1 -1 -1 -1 0 -2 0 -1 -1 -2 -1 -1 0 -1 -1 -2 -1 -1 -1 -1 -1 -1 -1 -1 -1 -1 -1 -1 -2 -2 0 -1 -1 0 0 0 0 -1 -1 -1
-24960 -1 0 -1 -1 -1 -2 0 0 -1 0 0 0 -1 -2 -1 -1 -1 -1 -1 -2 -1 -1 -1 -2 -2 0 -1 -1 -1 -1 -1 -1 -1 -1 -1 -2 -1 -1 -1 -1 -1 -2 -1 -2 0 0 -1 0 -1 -2 -2 -1 0 -1 -1 0 -1 -2 -1 -1 -1 -1 -1 -1 -1 -1 -1 0 0 -2
-25007 -2 -1 0 0 -1 -2 -2 -1 -2 -1 -1 -2 -2 -1 -1 -2 -2 -1 0 -1 -2 -1 -1 -1 -1 0 -1 0 0 0 -1 0 0 -1 0 -1 -2 0 -2 -1 -1 -1 0 0 0 0 -1 -1 0 0 0 -1 -1 0 -1 -1 0 0 -1 -1 -1 0 -1 -1 -1 -2 -1 -1 -1 -1
-25054 -1 -2 -1 0 0 -1 -1 -1 0 0 0 1 0 -1 -1 0 -2 -2 0 -1 -1 -1 -2 -2 -1 -1 -2 -2 0 -1 0 -1 -1 -1 -2 -1 -1 -2 -2 0 0 -1 -1 -1 0 -1 -1 0 -2 0 -2 -2 0 -1 -1 -1 -1 -1 0 -2 -1 0 -1 -1 -2 -1 -1 -1 0 -1
$$ packed form
-24725bKjjK%jjK%kLjjJ%Jk%%%%j%JJ%%j%Jjj%J%%%%%%jK%%j%%KlJ%J%j%%Jj%%jJJj%j%Jj
-24772bjJ%KjJ%j%kJJ%J%%j%%%%%%Jj%Jj%%%%jJ%%%%jJ%J%%%j%%%%Jj%j%Kk%%%J%%JkJ%Jj
-24819a%kK%J%%%%jj%J%%%J%jjJjJJj%%%J%%jjJ%%Jj%J%%j%%%j%J%%%%%jjJJ%%%JkJ%jJJk
-24866bJJjJkJJ%jJj%jKj%%Jk%Kk%J%%jJ%Jj%Jj%J%%%j%%jKkJ%%%%JjJ%j%jJ%%%JJjj%%Jj
-24913aJj%Jk%%JJjJj%jK%%kK%jjKjj%%J%%%%%JkKj%jJ%Jj%jJ%%%%%%%%%%%j%Kj%J%%%j%%
-24960aJj%%jK%jJ%%jjJ%%%%jJ%%j%Kj%%%%%%%%jJ%%%%jJjK%jJjj%JJj%JjjJ%%%%%%%%J%k
-25007bJJ%jj%JjJ%j%J%j%JJjjJ%%%JjJ%%jJ%jJjjKkJ%%J%%%j%J%%j%Jj%J%j%%Jj%%jJ%%%
-25054ajJJ%j%%J%%Jjj%Jk%Kj%%j%J%j%KjJj%%jJ%j%K%j%%Jj%JkKk%Kj%%%%JkJJj%jJ%%Jj
$$ plain form
-25101 -1 -1 -2 -1 -1 -2 -1 -1 -1 -1 -1 -2 -1 1 -1 0 -1 -2 -2 -1 0 -1 -1 -1 -1 -2 -1 -2 -1 -2 -1 0 -1 -1 -1 -1 0 1 0 -1 -1 0 0 -1 -1 -1 -2 -1 -1 0 -1 -2 -2 -1 -1 -1 -1 -1 -1 -1 0 -1 -1 0 -1 -1 0 -1 -1 -1
-25148 -1 -1 -1 -1 -1 -1 -2 -2 -2 0 0 0 -1 1 0 0 0 -1 -1 -1 -1 -2 -1 -2 -2 -2 -1 -1 -1 0 -1 -1 -2 -1 0 -1 -1 -1 -2 -1 0 -1 -2 -2 0 -1 -1 -1 -2 -1 -2 -1 0 -1 -1 -3 -2 -1 -2 -2 -1 1 0 -1 -2 -3 -2 -2 -1 -1
-25195 -1 -1 0 0 -1 -1 -1 -2 -1 -1 -1 -2 -1 -1 -1 -1 -2 -2 -2 -2 -1 -1 -1 -1 -1 -1 -1 -1 -1 -1 -1 -1 -1 -2 -1 -2 -2 -1 -2 -2 -2 -1 -2 -1 -2 0 -1 -1 -1 0 0 -1 -1 0 -1 -1 -1 -2 -1 -1 -1 -1 0 -1 -2 -1 -2 -1 -1 -1
-25242 -1 -1 -1 1 -1 -1 -1 -1 -1 -2 0 0 -2 -1 -1 -1 -1 -1 0 -1 -1 0 -1 -1 -2 0 -2 -2 -1 -1 -1 -1 -1 -1 -2 -1 -1 -1 -2 -2 -1 -2 -2 -1 -1 -1 0 -1 -3 -2 -1 -2 -1 -1 -1 1 -1 -1 -1 -1 0 -1 -2 -1 -2 -2 -2 -1 -1 -1
-25289 -1 -2 -2 -2 -1 0 -1 -1 -1 -1 -1 -1 -1 -1 -1 -1 0 -1 -1 -1 0 -1 -1 -1 -1 0 0 -1 -1 -1 0 -1 -1 -1 -1 -1 -1 -1 -2 -1 -1 0 -1 0 0 0 -2 -1 -1 -1 0 -1 0 -1 0 -2 -1 0 0 -2 -1 -1 -1 -2 -1 -2 -2 -2 -1 -1
-25336 -1 -1 -2 -2 -2 -1 -1 -1 -2 0 -1 -1 -2 -1 0 0 -1 -1 -1 -1 0 0 -1 0 -1 0 -1 -1 -1 -1 -2 -1 0 -1 -3 -1 -1 -2 -3 -2 -1 0 -3 0 -1 -1 -1 -1 -3 -1 -1 -1 -1 -1 -1 0 -1 -1 -2 -2 -2 -2 -2 -1 -1 0 -1 -1 -2 -1
-25383 -1 -1 -1 -1 -1 -1 -1 -1 0 0 -1 -1 -1 0 -1 -1 -1 -1 -1 0 -1 -1 -1 -1 -1 -2 -1 -1 0 -2 -1 0 1 0 0 0 -1 -1 -1 -2 -1 -2 -1 -2 0 -2 -1 -1 -1 -2 0 -1 -1 -1 -1 0 -1 -1 -1 0 0 -1 -1 -1 -1 -1 -2 -2 0 -1
-25430 -1 -2 -1 0 -2 -1 -1 -1 0 -1 -1 -2 -1 -1 -2 -1 0 -1 -1 -1 -2 -2 -1 -1 -1 -1 -2 0 -1 -1 0 -2 0 0 0 0 0 -2 -1 -1 -1 -1 1 0 0 -1 -2 -2 0 -1 -1 -1 -1 0 -1 -1 -2 -1 -1 -1 -1 -1 -2 0 -1 -2 -1 -1 -2 -1
$$ packed form
-25101a%jJ%jJ%%%%jJKkJjj%JJj%%%jJjJjJJj%%%JJjj%J%j%%jJ%Jjj%J%%%%%%Jj%Jj%Jj%%
-25148a%%%%%j%%K%%jKj%%j%%%jJj%%J%%Jj%jJJj%%jJJjj%Kj%%jJjJJj%kJJj%JKjjjjJ%J%
-25195a%J%j%%jJ%%jJ%%%j%%%J%%%%%%%%%%%%jJj%Jj%%JjJjKj%%J%j%Jj%%jJ%%%JjjJjJ%%
-25242a%%Kk%%%%jK%kJ%%%%Jj%Jj%jKk%J%%%%%jJ%%j%Jj%J%%JjkJJjJ%%Kk%%%JjjJj%%J%%
-25289aj%%JJj%%%%%%%%%Jj%%Jj%%%J%j%%Jj%%%%%%jJ%JjJ%%kJ%%JjJjJkJJ%kJ%%jJj%%J%
-25336a%j%%J%%jKj%jJJ%j%%%J%jJjJj%%%jJJjkK%jjJJJlLj%%%kK%%%%%Jj%j%%%%J%Jj%jJ
-25383a%%%%%%%J%j%%Jj%%%%Jj%%%%jJ%JkJJJj%%j%%jJjJjKkJ%%jKj%%%Jj%%J%j%%%%j%Kj
-25430ajJJkJ%%Jj%jJ%jJJj%%j%J%%%jKj%JkK%%%%kJ%%%Kj%jj%Kj%%%Jj%jJ%%%%jKjjJ%jJ
$$ plain form
-25477 -1 0 -1 -1 -1 -2 -2 -1 -1 -1 -1 0 0 -1 0 0 0 -1 -1 -1 1 -1 -1 0 -1 -2 -1 -1 -2 -1 -1 -1 -1 -2 -1 0 -1 -1 -1 -1 -1 -2 -1 -1 -1 -1 0 -1 1 0 0 0 -2 -2 0 -2 -1 -1 -1 -2 -1 0 0 -1 -1 -1 -1 -1 -1 -1
-25524 -1 -1 -2 -1 -1 -1 -2 -1 -2 -1 0 -1 0 -1 -1 -1 -1 0 -1 -1 0 -1 -1 -1 -2 -1 -1 1 0 -1 0 0 -1 1 0 -1 0 -1 -1 -1 -1 -2 0 -1 -1 -1 -2 -2 -1 -1 0 -1 -2 0 -1 -1 0 -2 -1 -2 -2 -1 0 0 -2 -1 -2 -1 -1 -1
-25571 -1 -1 0 0 0 -2 -1 -1 -1 -1 -2 -2 -1 -2 0 -1 -1 -2 -1 0 -1 -2 -1 -1 -1 -1 0 -1 0 -2 -1 -1 0 -2 -1 -1 0 -1 0 -1 0 -1 -1 -1 -1 0 -1 -1 -1 -1 -2 0 0 -1 0 -2 -2 -1 -1 -1 -1 -1 -1 -1 0 0 -1 0 0 -1
-25618 -1 -1 -1 -2 -2 0 -1 -2 -2 0 0 0 -1 -1 -2 0 -1 -1 0 0 -1 -1 -1 -1 0 -1 0 -1 -2 -1 -3 -2 -1 -2 -2 0 0 -1 -1 0 -2 -2 -2 -1 -1 0 -1 -2 -2 -1 -1 -1 -2 -2 -1 0 -3 -1 -1 -1 -1 -3 -2 -1 -1 -1 -1 -1 -1 0
-25665 0 0 0 -1 -1 -1 0 0 -1 -2 -1 -1 0 0 0 0 0 -1 0 -2 -1 0 -1 -1 -1 -1 -2 -2 -1 -1 -1 -1 -2 -2 -2 -2 -2 0 -1 -1 0 0 -1 -1 -1 -1 -2 -2 -2 -1 -1 -2 -1 -1 0 -1 -1 -1 0 -2 -1 -1 -1 -1 -1 -1 -1 -2 -1 -1
-25712 -1 0 -1 -1 -1 0 0 -1 -1 -1 -2 -1 -1 -1 -1 -1 0 0 -1 -1 -1 -1 0 1 0 -1 -2 -2 -2 -2 -2 -2 -2 -1 -1 -1 -1 -1 -1 1 0 -1 -2 -2 -1 -1 0 -1 -1 -1 0 -1 0 -1 0 -1 -2 -1 -1 -1 -1 -2 -1 0 0 0 -1 -2 -1 -1
-25759 -1 -2 -1 -1 -1 -3 -2 -1 -1 -1 -1 0 1 -1 -1 0 -1 -1 0 -1 -2 0 -1 -1 -1 -2 -1 0 -2 -1 -1 -1 -1 0 0 0 -1 -1 -2 -1 1 -1 -1 -2 0 -1 -2 -2 -2 -2 -2 0 -2 -1 -1 -2 -2 -2 -2 -1 0 0 0 0 0 0 -1 -1 0 -2
-25806 -2 -1 -2 -1 -1 -1 -1 -2 -2 -2 -2 -1 -2 0 -1 -2 -1 -2 -1 -1 0 0 0 -2 -2 -1 -1 0 -1 -1 0 0 -2 -1 -2 0 0 -1 -2 -3 -2 -1 -1 -1 -1 -1 -1 -1 0 -1 -2 -2 -1 -2 -1 -1 -1 -2 -2 -1 -1 -1 -1 -1 0 -1 -1 -1 -1 -1
$$ packed form
-25477aJj%%j%J%%%J%jJ%%j%%Kk%JjjJ%jJ%%%jJJj%%%%jJ%%%JjKj%%k%KkJ%%jJJ%j%%%%%%
-25524a%jJ%%jJjJJjJj%%%Jj%Jj%%jJ%KjjJ%jKjjJj%%%jKj%%j%J%JjjKj%JkJj%JJ%kJjJ%%
-25571a%J%%kJ%%%j%JjKj%jJJjjJ%%%JjJkJ%JkJ%JjJjJj%%%Jj%%%jK%jJk%J%%%%%%J%jJ%j
-25618a%%j%Kjj%K%%j%jKj%J%j%%%JjJjjJkJJj%K%j%Jk%%J%Jjj%J%%j%JJlK%%%kJJ%%%%%J
-25665@%%j%%J%jjJ%J%%%%jJkJJj%%%j%J%%%j%%%%Kj%J%j%%%j%%J%jJ%Jj%%JkJ%%%%%%jJ%
-25712aJj%%J%j%%jJ%%%%J%j%%%JJjjj%%%%%%J%%%%%Kjjj%J%Jj%%JjJjJjjJ%%%jJJ%%jjJ%
-25759ajJ%%kJJ%%%JJk%Jj%JjjKj%%jJJkJ%%%J%%j%jJKk%jKjj%%%%KkJ%j%%%JJ%%%%%j%Jk
-25806bJjJ%%%j%%%JjKjjJjJ%J%%k%J%Jj%J%kJjK%jjjJJ%%%%%%Jjj%JjJ%%j%J%%%%Jj%%%%
$$ plain form
-25853 -1 -1 -1 -1 0 -2 -2 -2 -1 -1 -1 -1 0 0 -1 0 -1 -1 -1 0 -1 -1 -2 -1 -2 -1 0 0 -1 -2 -1 -1 -1 0 -1 -1 -1 -1 -1 -1 -1 -1 -1 -1 -1 -1 -1 -1 0 0 -1 -1 -1 0 0 0 0 -1 -1 0 -1 -1 -2 -2 0 -2 -1 -1 -2 -1
-25900 -1 -1 0 0 -1 -1 -1 -1 -2 -2 -1 -1 -1 -1 -2 -1 -1 -1 -2 -1 -1 -1 -2 0 -1 -1 -1 0 -1 -1 0 -2 -1 -1 -1 -1 -1 -1 -1 -1 -1 -2 -1 0 -2 -2 -2 -2 -1 -2 -1 -1 -1 -1 -1 -2 -1 -1 -1 -1 -2 -2 -1 -1 -1 -1 0 -1 -2 -2
-25947 -2 -1 -1 -2 -2 -2 -1 -1 0 0 -1 -1 -1 0 -1 -1 -1 -1 -3 -1 -2 -2 0 -1 -1 0 -1 -1 -1 0 0 -1 -2 -1 0 0 0 0 -1 -1 -2 -1 -2 -1 -1 -1 -2 -1 -2 -1 -1 -2 -1 -1 -2 -1 -1 -1 -1 0 -2 0 -1 -1 -2 -1 -1 -2 -1 0
-25994 0 -1 0 -1 -1 -2 -2 -2 -2 -1 -1 -1 1 0 0 -1 0 0 -1 0 -1 -3 -1 -1 -1 -1 -2 -2 1 0 -1 -2 -2 -1 -1 -2 0 -2 -1 -1 -1 -1 0 -1 -1 -3 -1 -1 -1 -1 -2 -2 0 -1 -1 -1 -1 -1 -2 -2 -1 -1 -1 -1 -1 -2 -1 -2 -1 -1
-26041 -1 -1 -1 -1 -1 0 -1 -1 -1 -1 -2 -1 -1 -1 -1 0 -1 -1 -1 0 -2 -1 -2 1 0 0 -1 0 -1 -1 -1 -1 0 0 -1 0 -2 -1 -2 -2 -1 0 -1 0 -1 -2 -2 -1 0 0 -1 -1 -2 -1 -2 -1 -2 -1 -1 0 -2 0 0 1 -1 -1 -2 -2 -3 -2
-26088 -2 -2 -1 -3 -1 -2 -1 -1 -1 0 0 0 0 -1 1 0 0 0 -1 -3 -2 -1 -1 -2 -2 -1 -1 -1 0 0 -1 0 -1 -1 -1 -1 -1 0 -1 -1 -1 0 0 -1 -1 -1 0 -1 -2 -2 0 -1 -1 -2 0 -1 -2 -2 -1 -2 -1 -1 -1 -1 -1 -1 -1 -1 0 -1
-26135 -1 0 -1 -1 -1 -1 -1 -2 -1 -1 -1 -1 -1 -1 -1 -1 -1 -1 -2 -1 -2 -1 -1 -2 -2 0 -1 -1 0 0 -2 0 0 0 0 -1 -2 -1 -1 0 -1 1 -2 0 -2 -2 -2 -1 -1 -1 -2 -1 -1 -2 -2 -2 -1 0 -1 0 -1 0 -1 -1 -1 -2 -1 -1 -1 -1
-26182 -1 -1 -1 -2 0 0 -1 -2 -1 -2 -3 -2 -2 -2 0 -1 -1 -1 -1 -1 0 -1 -1 -1 0 -1 -1 -1 0 -2 -1 -2 -2 0 -1 -1 0 0 -1 -2 0 -1 -1 0 0 -1 0 -1 0 -1 -1 -2 -1 -2 -1 -1 -1 0 0 0 0 -1 -1 -1 -1 -1 0 0 -1 -2
$$ packed form
-25853a%%%Jk%%J%%%J%jJj%%Jj%jJjJJ%jjJ%%Jj%%%%%%%%%%%%%J%j%%J%%%j%Jj%j%KkJ%jJ
-25900a%J%j%%%j%J%%%jJ%%jJ%%jKj%%Jj%JkJ%%%%%%%%jJJk%%%JjJ%%%%jJ%%%j%J%%%Jjj%
-25947bJ%j%%J%J%j%%Jj%%%kKj%Kj%Jj%%J%jjJJ%%%j%jJjJ%%jJjJ%jJ%jJ%%%JkKj%jJ%jJJ
-25994@jJj%j%%%J%%Kj%jJ%jJjkK%%%j%Ljjj%J%jKkJ%%%Jj%kK%%%j%Kj%%%%j%J%%%%jJjJ%
-26041a%%%%Jj%%%jJ%%%Jj%%JkJjLj%jJj%%%J%jJkJj%JJjJjj%JJ%j%jJjJjJ%JkK%Jk%j%jJ
-26088b%JkKjJ%%J%%%jKj%%jkJJ%j%J%%J%jJj%%%%Jj%%J%j%%Jjj%Kj%jKjj%JjJ%%%%%%%Jj
-26135aJj%%%%jJ%%%%%%%%%jJjJ%j%Kj%J%kK%%%jjJ%JjKlKk%%J%%jJ%j%%JJjJjJj%%jJ%%%
-26182a%%jK%jjJjjJ%%Kj%%%%Jj%%Jj%%JkJj%Kj%J%jjKj%J%jJjJj%jJjJ%%J%%%j%%%%J%jj
$$ plain form
-26229 -2 -2 -1 0 -1 -1 -1 -1 -2 -1 -1 0 -1 -2 -1 0 -1 -1 -1 -1 -1 0 -1 -1 -1 -1 -2 0 0 0 -1 0 -1 -1 -1 0 -1 0 -1 -1 -2 0 -1 -1 -2 -1 -2 0 -2 -1 -1 -1 -1 -1 -1 -1 -1 1 -2 -1 -1 -1 -1 -1 -1 0 0 -1 -2 -1
-26276 -1 -2 -1 -1 0 -2 0 0 -1 -1 -1 -2 -1 -1 -1 -1 -1 -2 -1 1 -1 0 0 -1 -1 -1 -2 -1 -1 0 0 -1 0 -2 -2 -1 -2 -1 -1 -2 -1 0 0 -1 -1 -1 0 -1 -1 -2 -2 -2 -1 0 -1 -1 -1 -1 -1 -2 0 -1 0 -1 0 -1 0 0 -1 -1
-26323 -1 -1 -1 -1 -2 -1 -1 0 -2 0 0 0 -1 -2 -2 0 -3 -1 -1 0 -2 -2 -2 -2 -2 -1 -3 -1 -1 -1 0 0 0 -1 -1 0 0 -1 -1 -1 0 -2 -2 0 0 -1 -1 0 -2 -1 -2 0 -1 -1 0 0 -1 0 -1 0 -1 -1 -1 -1 -1 -2 -1 -1 -1 0
-26370 0 1 1 -1 -1 -1 0 -1 -1 -1 0 -1 0 -1 -1 -2 -1 -1 -1 -1 0 -2 -1 0 0 -1 -1 -1 0 0 0 0 -1 -1 0 -1 0 -1 0 0 -2 -1 -1 0 0 -2 -3 -1 -1 0 0 -1 0 -1 0 -2 -1 0 -1 0 0 0 0 0 0 0 -1 -1 0 0
-26417 0 0 0 0 -2 -1 -1 -1 -1 -1 -1 -1 -1 0 0 -1 0 0 -1 -1 -2 -2 -1 -1 -1 -1 -1 -1 -1 -1 1 0 -1 -1 0 0 -1 -1 -2 -2 -1 0 0 0 1 0 0 -1 -1 0 -1 -1 1 0 0 1 0 0 0 1 0 1 2 1 0 0 0 0 0 0
-26465 0 1 1 0 0 0 1 1 -1 0 0 0 0 0 -2 0 -1 -1 -1 0 0 0 -2 -1 -1 0 -1 -1 -1 -2 -1 0 -1 0 -1 1 0 -1 0 -2 -1 0 0 -1 -2 -1 -2 -1 -1 -1 -1 0 -2 -1 -1 -2 -1 -2 -1 -1 -1 0 -1 -2 -1 -1 -2 -1 -1 -2
-26512 -2 -1 -1 0 0 0 -1 -1 -1 -1 0 -1 -2 -2 0 -1 -1 -1 0 -1 -2 -1 -1 -2 -1 -1 0 0 1 0 -1 -2 -2 -2 0 -2 0 -2 -1 -1 -1 -1 -1 -1 -1 -1 -1 -2 0 -1 -2 -2 -1 0 -1 -2 -1 -2 -1 -2 -1 -2 -1 0 -1 0 -1 -1 -1 -1
-26559 -1 -1 -1 0 -2 -2 -2 -1 -1 0 0 -1 -1 -1 -1 -2 -1 1 -1 0 -1 -2 -1 0 0 0 -2 -1 -1 -1 -2 0 -1 0 -1 -2 -1 0 -1 -1 -1 0 -2 -2 -2 -1 -1 0 0 0 -1 0 -1 0 -1 -1 -1 -1 -1 -1 -1 -1 -1 -1 -1 -1 -1 -1 -1 0
$$ packed form
-26229b%JJj%%%jJ%JjjJJj%%%%Jj%%%jK%%jJj%%JjJj%jKj%jJjKkJ%%%%%%%KlJ%%%%%J%jjJ
-26276ajJ%JkK%j%%jJ%%%%jJKkJ%j%%jJ%J%jJk%JjJ%jJJ%j%%Jj%j%%JJj%%%%jKjJjJjJ%j%
-26323a%%%jJ%JkK%%jj%KlK%Jk%%%%JkK%%J%%j%J%j%%Jk%K%j%JkJjKj%J%jJjJj%%%%jJ%%J
-26370@J%k%%Jj%%JjJj%jJ%%%JkJJ%j%%J%%%j%JjJjJ%kJ%J%kjK%J%jJjJkJJjJ%%%%%%j%J%
-26417@%%%kJ%%%%%%%J%jJ%j%j%J%%%%%%%Kjj%J%j%j%JJ%%Jj%j%Jj%Kj%Jj%%JjJJjj%%%%%
-26465@J%j%%J%kJ%%%%kKj%%J%%kJ%Jj%%jJJjJjKjjJkJJ%jjJjJ%%%JkJ%jJjJ%%JjjJ%jJ%j
-26512bJ%J%%j%%%Jjj%Kj%%JjjJ%jJ%J%Jjjj%%KkKkJ%%%%%%%%jKjj%JJjjJjJjJjJJjJj%%%
-26559a%%Jk%%J%J%j%%%jJKkJjjJJ%%kJ%%jKjJjjJJj%%Jk%%J%J%%jJjJj%%%%%%%%%%%%%%J
$$ plain form
-26606 0 -1 0 -2 -1 -1 -1 -1 -1 -1 -1 0 -1 -1 -1 -1 0 -2 -2 -1 0 -1 -1 -1 -1 -1 -1 -2 0 -2 -1 -1 0 -1 -1 -2 -1 -1 -1 -2 -1 -1 -1 -1 0 -1 -1 -1 0 -1 -1 -1 -1 -1 0 -2 -1 -3 -1 -2 0 -1 0 -1 -1 -2 0 -1 1 0
-26653 0 0 0 0 0 -1 -1 -1 -2 -1 -1 -1 -2 0 -2 -1 -1 -1 -1 -1 0 0 0 -1 -1 1 -1 -1 -1 0 -1 0 -2 -1 -1 -1 -1 -2 -2 0 -2 -1 -1 0 -1 -1 -1 0 -1 0 0 -1 -1 -1 -1 -1 -1 2 -2 -1 0 0 0 1 0 -1 -2 0 -2 -1
-26700 -1 -2 -2 -1 0 -2 0 -1 0 -1 0 0 0 -1 0 1 -1 -2 -1 -1 0 -1 1 -1 0 -1 1 -1 0 0 1 -1 0 -2 -1 -1 -1 -2 -1 -1 1 -1 -1 -2 -1 0 1 -2 -1 -2 0 -1 0 -1 -1 0 1 -2 0 -1 0 -3 -1 -3 0 -2 0 -2 0 -1
-26747 -1 -1 -1 -1 -1 0 -2 -1 -1 0 -1 1 -2 -1 -2 -1 -3 0 -1 0 -1 0 -2 0 -2 0 -1 -1 -1 -1 -2 0 0 0 0 -1 -2 0 -1 0 -1 -1 -2 0 -1 1 -1 0 -3 -1 -2 0 -1 0 -2 1 -1 -1 -2 -2 -2 -1 -1 0 -1 0 -1 0 -1 0
-26794 0 -2 0 -1 0 -1 0 -1 -1 -2 0 -1 -2 -3 0 -1 0 -2 0 -2 0 -2 0 -1 -1 -1 0 -2 -1 -1 1 -1 -1 -1 -1 -2 -1 -2 1 -1 1 0 1 -1 1 0 1 -1 -1 0 1 0 2 0 2 -1 2 0 1 -1 0 0 1 -2 1 0 2 -1 0 -1
-26841 -1 1 -1 1 -1 0 0 1 0 1 -1 0 -2 0 -2 0 -2 0 -1 1 0 0 -1 0 -3 0 -1 1 -1 0 -2 0 -1 0 -1 1 -2 0 -2 0 -2 0 -2 2 -1 1 -1 1 -2 0 -2 1 -1 -1 -1 0 -1 1 -2 0 -1 1 -2 0 -1 0 0 1 -1 0
-26888 0 -2 1 -1 1 -1 -1 -2 0 -1 0 -1 1 -1 0 0 0 -1 1 -2 0 -1 0 -1 1 -1 -1 -1 0 -2 1 -2 1 0 0 -2 0 -2 0 0 2 -1 0 0 1 1 1 -1 0 0 0 0 1 0 1 -1 1 -1 0 0 0 1 2 0 1 -1 1 -1 -1 -2
-26935 -2 1 0 1 -1 0 -1 1 0 1 0 1 -1 1 0 1 -1 -1 -1 1 0 1 1 2 0 1 -1 1 0 1 0 2 0 1 0 0 0 2 0 3 1 2 -1 1 0 3 0 1 -1 1 0 1 0 1 0 2 1 2 0 1 1 1 0 1 -1 1 -1 0 0 1
$$ packed form
-26606@jJkJ%%%%%%Jj%%%Jk%JJj%%%%%jKkJ%Jj%jJ%%jJ%%%Jj%%Jj%%%%JkJkKjKjJj%jKjKj
-26653@%%%%j%%jJ%%jKkJ%%%%J%%j%Kk%%JjJkJ%%%j%KkJ%Jj%%JjJ%j%%%%%LmJJ%%JjjjKkJ
-26700aj%JJkKjJjJ%%jJJkjJ%JjKkJjKkJ%JkJkJ%%jJ%Kk%jJJJlJjKjJj%JJlKjJlKkLkKkKj
-26747a%%%%JkJ%JjKlJjJkLjJjJkKkKj%%%jK%%%jjKjJj%jKjKkJlKjKjJkLk%j%%J%JjJjJjJ
-26794@kKjJjJj%jKjjjLjJkKkKkKj%%JkJ%Kk%%%jJjLkKjJkKjJk%JJjKkKlLkJkJ%JlLjKlJj
-26841aKkKkJ%JjJkJkKkKkKjKj%jJlLjKkJkKjJjKlKkKkKkMlKkKlKkLk%%JjKlKjKlKjJ%JkJ
-26888@kLkKk%jKjJjKkJ%%jKlKjJjKk%%JkLlLj%kKkK%KlJ%J%%kJ%%%JjJkKkJ%%JJkJkKk%j
-26935bLjJkJjKjJjJkKjJk%%KjJ%JkJkKjJjKkJj%%KkLkJlKjLlJkKjJjJjKjJkJ%%jJkKkJ%J
$$ plain form
-26982 1 0 1 -1 1 0 1 0 1 1 2 0 1 -1 1 -1 1 -2 0 0 0 1 1 -1 1 0 2 0 1 -1 1 0 2 0 1 0 1 0 1 -1 0 0 0 -1 0 -1 0 0 1 0 2 1 1 0 2 0 1 0 1 0 1 -2 -1 -1 1 0 1 -1 1 0
-27029 0 1 0 1 0 2 0 1 0 2 1 0 0 1 0 0 -2 1 0 0 0 2 1 0 0 1 0 1 0 0 0 0 -1 2 0 0 1 0 0 1 0 0 -1 -1 0 2 0 1 -2 2 0 1 0 0 1 1 1 2 1 2 0 1 0 3 1 1 2 1 1 1
-27076 1 0 1 1 3 1 0 0 1 0 1 1 1 1 1 0 1 1 1 1 2 2 2 1 1 0 1 1 1 2 3 2 2 1 3 3 2 3 4 3 3 4 6 5 4 6 6 6 7 8 9 9 11 12 13 13 16 16 17 19 19 20 22 23 24 26 27 28 29 29
-27123 29 30 30 32 33 34 36 36 36 38 39 39 40 40 40 40 41 40 39 40 42 41 40 37 38 38 38 35 35 34 33 31 30 29 27 24 25 24 24 22 22 20 19 18 18 16 16 14 14 13 12 11 12 11 11 9 10 7 10 9 11 9 13 10 12 9 12 9 11
-27169 11 7 11 9 12 9 11 9 11 9 12 10 14 11 14 12 14 11 15 11 15 12 15 11 16 13 18 14 18 15 21 17 22 18 24 19 26 22 28 24 32 27 35 29 37 30 40 35 46 42 55 51 65 62 79 80 104 108 133 137 166
-27210 166 175 212 225 269 284 332 350 406 432 503 539 637 739 951 1222 1728 2628 4499 9648 19664 24802 28375 32767 32395 28013
-27227 28013 27776 28710 29911 28471 19952 11307 6022 3452 2154 1520 1092 878 670 573 450 412 339 331 279 281 243 252 226 241
-27243 241 221 233 212 225 205 218 197 206 184 187 159 159 132 132 110 109 87 90 73 85 85 124 202 348 449 575 695 779 818 914 896 733 579 532
$$ packed form
-26982AjJkKjJjJ%JkJkKkKlK%%J%kKjKkJkKjKkJjJjJkJ%%jJjJ%JjKj%jKkJjJjJlJ%KjJkKj
-27029@JjJjKkJjKjj%Jj%kLj%%Kjj%JjJj%%%jLk%Jj%Jj%j%JKkJlMkJj%J%%JjJkJjLk%Jj%%
-27076AjJ%Kkj%JjJ%%%%jJ%%%J%%j%jJ%%JJj%jK%jJJj%JKjjK%%JJJ%KJJ%L%JK%JKJJKJJJ%
-27123B9J%KJJK%%KJ%J%%%JjjJKjjlJ%%l%jjkjjklJj%k%kjj%k%k%jjjJj%kJlLjKkMlKlLlK
-27169A1mMkLlKkKkLkMlLkKlMmMlLmNlNmMlOmNmOnPmOmQnQoQpJ0nJ1mJ3mJ4lJ7JK4MK5MK9
-27210A66RL7J3M4J5M8J8N6K6P1L6R8J02K12K71N06R00J871N149J0016N138L573M392l72m382
-27227B8013k37R34J201j440q519q645n285k570j298o34m28k14k08r7j23l8p3qn2Kl8Rk6J5
-27243B41k0J2k1J3k0J3k1Rk2Lk8%k7%k2jk2Lj7J2%L9P8J46J01J26J20Q4L9R6j8j63j54m7
$$ plain form
-27266 532 444 305 171 113 66 56 37 38 24 28 18 24 14 19 10 18 11 19 11 19 11 17 9 16 9 16 7 13 5 10 3 10 4 9 3 8 1 9 1 9 1 7 2 8 2 7 2 8 1 7 1 7 0 6 2
-27304 2 8 3 12 11 23 24 33 29 35 29 33 26 29 18 17 8 12 4 9 3 7 1 6 1 4 -1 5 0 5 -1 3 0 6 2 6 2 7 3 7 3 7 2 6 1 5 0 3 -1 3 0 4 0 6 2 6 1 7 3 9 6 14 14 23 20 24 21 25
-27349 25 20 23 16 18 10 12 7 10 6 8 4 7 2 5 2 5 1 5 0 4 0 3 1 5 2 6 3 5 2 5 1 6 1 4 0 4 1 5 2 6 3 7 4 8 3 7 3 5 3 6 2 6 3 5 3 7 3 8 8 14 16 23 23 29 27 32 29 34
-27396 34 29 27 23 24 19 22 19 22 20 25 23 27 26 31 30 35 33 38 36 40 38 42 39 42 38 42 39 43 42 48 46 50 47 50 47 49 44 46 42 45 42 43 39 41 37 38 34 36 32 34 29 30 28 29 24 27 24 29 27 30 27 28 24 27 24 27 24 25
-27442 25 20 23 18 20 17 20 15 15 11 13 10 13 9 11 9 14 16 22 22 27 23 25 26 32 27 29 25 28 27 29 27 29 25 28 26 28 27 34 37 49 62 102 200 418 543 629 734 746 652 644 668 692 683
-27478 683 510 297 162 90 58 39 30 23 20 15 15 11 11 9 10 8 8 6 8 7 8 5 6 5 6 5 7 7 7 5 6 5 8 10 15 17 26 28 32 31 33 30 32 27 27 19 16 10 11 10 15 17 29 53 145
-27516 145 251 312 369 398 352 325 337 359 314 199 108 59 35 24 17 16 12 11 7 8 6 7 5 6 4 6 5 4 3 5 4 5 2 6 2 4 4 4 3 3 2 3 2 2 1 1 1 2 -1 0 0
-27550 0 2 0 1 0 1 0 0 -1 1 0 2 1 0 -1 0 0 1 0 1 -1 1 -1 0 -1 -1 -1 1 0 0 0 0 -1 1 -1 -1 -1 1 0 1 0 0 -1 1 -1 2 -1 1 -1 0 0 0 -2 0 -1 0 -2 -1 -1 0 -1 2 0 0 -1 0 -1 -2 -2 -1
$$ packed form
-27266E32q8j39j34n8m7j0j9Jj4Mj0Oj0NrQpQqQqOqPpPrOqNpPoNoNpQqQqOnOoNnOpOoOpOm
-27304BOnRjJ2JRmOoMpLj1jrMqNoMoNnLnOnNoMlOmMmNmMmMnMnMnLmMlMmOmMnOmOlQ%RlMlM
-27349B5nLpKqKnLmKmLnLlLmMnMmLkMlMlKlLmNnLmMlMlMlMlMnMmKkLmMlKkMmN%OKP%OkNlN
-27396C4nkmJnLlLkNkMjNjNkNkMkMlLmMlMjOkMlLlKnKmLlJmKmJmKmKnJkJnLlNkLlJmLlLlJ
-27442B5nLnKlLn%mKlLmKkNKO%NmKJOnKmLjKkKmLkKjPLJ2J3M0R8K18J25Q6J05J2r4qK4K4r
-27478F83j73k13j35p2l2j9rpln%m%kJk%kKjJlJjJjK%%kJjLKNKRKMjKlKn%qloJjNKJ2K4R2
-27516A45J06O1N7K9m6k7J2K2m5j15r1m9k4j1pjmjmJkJkJkKjjjKjJlMmK%%j%jJj%j%%JlJ%
-27550@KkJjJj%jKjKjjjJ%JjJkKkJj%%Kj%%%jKk%%KjJj%jKkLlKkJ%%kKjJkJ%JjLk%jJjj%J
$$ plain form
-27597 -1 0 0 0 1 -1 0 -1 -2 -1 0 -1 0 -1 0 -1 1 0 0 1 0 0 1 1 1 0 2 1 3 1 1 1 1 1 0 -1 -1 -1 0 -1 -1 -1 -1 -2 -1 -1 0 -1 -1 -1 -1 -1 0 -1 0 -1 -1 -3 -1 -1 -1 -1 1 -1 0 0 0 -1 1 1
-27644 1 0 -2 -1 -1 0 -2 -1 -1 0 -1 0 0 0 -1 0 -2 -1 -1 0 -1 0 0 0 -1 0 0 0 -1 2 0 0 -1 0 0 1 -1 1 0 0 -1 0 0 0 -1 0 0 0 -1 -1 -2 -2 -2 0 0 0 -1 -1 -1 0 0 0 -1 1 -1 -1 -1 -1 -2 -1
-27691 -1 0 -1 -1 -1 -2 0 0 0 -1 0 -1 0 0 -1 -1 -1 -2 -2 -2 -1 0 -1 -1 -1 -1 -2 -2 -1 -1 -1 -1 0 -1 -1 -2 -1 -1 -1 0 -1 -1 -1 -1 -2 -2 -1 -1 0 -1 0 0 -1 -1 0 -1 0 -1 0 -1 -1 -2 -2 -1 -2 -3 -2 0 -1 -1
-27738 -1 -1 -2 -2 -2 -2 -1 -1 -1 -1 0 -1 -2 -2 -2 -1 -1 -1 -2 -1 0 -2 -1 -1 -1 -1 -1 -1 -1 -2 0 -2 -2 -2 -2 -2 -1 -1 -1 -2 -2 -2 -2 -1 -1 0 0 -1 -1 -1 -1 -2 0 -2 -3 -1 -2 -1 -1 -1 0 -1 -1 -1 -1 -1 -1 0 -1 -2
-27785 -2 -2 -1 1 0 -1 -2 -1 -2 0 -2 0 -1 -1 -1 -2 -1 -2 -2 -1 -1 -1 -1 -2 -2 0 0 -1 -1 -2 -2 -1 -1 -2 -3 -2 -2 -2 -2 -1 -1 -2 -2 -1 0 0 -1 -1 -2 -2 -2 -1 -1 -1 -1 0 -2 -1 -2 -2 -2 -2 -2 -2 -1 -1 0 0 -1 -1
-27832 -1 -2 -1 -2 -2 -1 -1 -1 -1 -2 -1 -1 -1 -1 0 -2 -1 -1 -2 -1 -1 -1 0 0 0 -1 -2 -1 0 -2 -2 -2 -1 -1 0 -1 -1 -2 -2 -2 -1 -1 0 -1 -2 -1 -1 -2 -1 -1 -1 -2 -1 -2 -1 -2 0 0 0 -1 -1 -1 -1 -2 0 -1 -1 -2 -1 -3
-27879 -3 -2 -1 -2 -2 -1 -2 0 -2 -1 -2 0 -1 0 -1 -3 -3 -1 -1 -1 -1 -2 -2 -2 -1 -1 -1 -1 -2 -2 -2 -1 -1 -1 -1 -1 -2 -2 -1 0 -1 -2 -2 -1 -1 -2 -2 -1 -2 -1 -1 0 -2 0 -1 -3 -2 -1 -1 -1 -1 -1 -1 -1 -1 0 -1 -1 -2 -2
-27926 -2 -2 0 -1 -1 -3 -2 -2 -2 -3 -1 -2 -2 -2 -2 -2 -1 -2 -1 -2 -1 -2 0 -1 -1 -1 -1 -2 -1 -2 -1 -2 -2 -3 -2 -1 -1 -1 -2 -3 -3 -3 -1 -2 -2 -2 -1 -2 -1 -2 -1 -2 -1 -1 -1 -2 -3 -3 -3 -2 -1 -2 -1 -2 0 -2 -1 -1 0 -1
$$ packed form
-27597aJ%%JkJjjJJjJjJjKj%Jj%J%%jKjKk%%%%jj%%Jj%%%jJ%Jj%%%%JjJj%kK%%%KkJ%%jK%
-27644AjkJ%JkJ%JjJ%%jJkJ%JjJ%%jJ%%jLk%jJ%JkKj%jJ%%jJ%%j%j%%K%%j%%J%%jKk%%%jJ
-27691aJj%%jK%%jJjJ%j%%j%%JJj%%%j%J%%%Jj%jJ%%Jj%%%j%J%JjJ%j%JjJjJj%j%JjjJKj%
-27738a%j%%%J%%%Jjj%%J%%jJJkJ%%%%%%jKk%%%%J%%j%%%J%J%j%%%jKkjKjJ%%Jj%%%%%Jjj
-27785b%JKjjjJjKkKj%%jJj%J%%%j%K%j%j%J%jjJ%%%J%j%JJ%j%j%%J%%%JkJj%%%%%J%J%j%
-27832ajJj%J%%%jJ%%%JkJ%jJ%%J%%jjJJk%%J%Jj%j%%J%JjjJ%jJ%%jJjJjK%%j%%%jKj%jJk
-27879cJJj%JjKkJjKjJjk%K%%%j%%J%%%j%%J%%%%j%JJjj%J%j%JjJ%JkKjkJJ%%%%%%%Jj%j%
-27926b%Kj%kJ%%jKj%%%%JjJjJjKj%%%jJjJj%jJJ%%jj%%Kj%%JjJjJjJ%%jj%%JJjJjKkJ%Jj
$$ plain form
-27973 -1 -1 -1 -1 -1 -1 -1 -1 -1 -1 -3 -2 -2 -2 -2 -1 -1 -1 -2 -1 -1 -1 -3 -1 -2 -2 -2 -2 -1 -1 -2 -1 -2 0 -2 0 -1 -3 -1 -1 -2 -2 -2 -2 -3 -2 -2 -2 -2 -1 -2 -1 -3 -3 -3 -2 -3 -2 -1 0 -2 0 -3 -2 -2 -2 -3 -2 -3 -2
-28020 -2 -2 -1 -2 -1 -2 -1 -2 -2 -2 -1 -2 -2 -2 -1 -3 -1 -1 -1 -1 -2 -2 -1 -3 -2 -2 -1 -3 -1 -1 -1 -2 -1 -1 -1 -2 -2 -2 -2 -3 -2 -2 0 -2 -1 -1 -1 -2 -1 -2 -1 -2 -1 -2 -1 -2 -3 -3 -1 -2 -2 -3 -1 -2 -1 -3 -1 -3 -2 -2
-28067 -2 -3 -2 -1 -3 -2 -3 -2 -3 -3 -3 -2 -2 -2 -4 -3 -2 -2 -3 -2 -2 -3 -2 -2 -3 -3 -2 -2 -2 -2 -2 -1 -3 -2 -3 -2 -4 -4 -3 -2 -3 -2 -4 -2 -4 -4 -4 -3 -3 -3 -4 -4 -4 -3 -4 -3 -5 -4 -5 -3 -4 -4 -6 -3 -5 -3 -5 -3 -3 -4
-28114 -4 -5 -3 -5 -5 -6 -4 -6 -3 -6 -5 -7 -5 -6 -4 -6 -5 -5 -4 -6 -4 -3 -2 -4 -2 -5 -4 -6 -2 -5 -1 -2 13 35 163 360 459 553 606 515 454 487 529 436 249 136 74 49 35
-28147 35 29 23 20 17 15 12 13 10 11 11 10 9 8 7 7 8 8 8 7 7 9 6 7 6 6 4 4 3 2 1 2 3 2 2 2 3 3 4 1 2 2 1 2 2 2 1 2 2 2 2 2 1 0 1 1 2 0 2 2 0 1 2 2 1 0 0 1 1
-28193 1 1 1 0 0 0 1 0 1 -1 0 0 1 0 1 -1 0 0 0 0 0 0 0 0 1 0 0 0 0 0 0 1 1 0 -1 0 0 0 0 -1 0 -1 0 0 1 1 1 0 0 -1 0 0 -1 0 0 0 0 0 0 0 0 0 0 -1 0 -1 1 0 1 1
-28240 1 1 1 1 0 -1 0 0 -1 0 0 0 0 -1 -1 0 0 0 0 -1 0 0 0 -1 -1 -1 0 0 1 1 0 0 0 -1 0 -1 -1 0 -1 -1 0 0 -1 -1 -1 0 -2 0 0 0 0 0 0 -1 -1 -1 -1 -1 -1 0 1 0 -1 0 1 0 0 0 -1 0
-28287 0 1 -1 -1 0 0 0 -1 -1 -1 0 -1 -1 -1 -1 -1 0 0 0 -1 0 -1 1 -1 -1 -1 0 0 0 -1 -1 -1 -1 -1 -1 -1 1 -1 1 0 1 1 1 0 -1 -1 -1 -1 -1 0 1 -1 0 0 1 0 -1 -1 -1 -2 -1 -1 -1 -1 1 1 1 0 0 1
$$ packed form
-27973a%%%%%%%%%kJ%%%J%%jJ%%kKj%%%J%jJjKkKjkK%j%%%jJ%%%JjJk%%JjJJJkKlJ%%jJjJ
-28020b%JjJjJj%%Jj%%JkK%%%j%JkJ%JkK%%jJ%%j%%%jJ%KkJ%%jJjJjJjJjj%Kj%jKjJkKkJ%
-28067bjJJkJjJj%%J%%kJJ%jJ%jJ%j%J%%%%JkJjJk%JJjJkKk%%J%%j%%JjJkJjKj%kLkKkK%j
-28114djKk%jKkLlJkKjKkJ%JkKJJkKlJkMlMjJ5K2J28J97R9R4N3r1o1L3M2r3j87j13o2k5j4
-28147C5oollklJlJ%jjjj%J%%j%KlJj%k%jjjJJj%%J%JlJ%jJ%%jJ%%%%jjJ%JkK%kJJ%jj%J%
-28193A%%j%%JjJkJ%JjJkJ%%%%%%%Jj%%%%%J%jjJ%%%jJjJ%J%%j%jJ%jJ%%%%%%%%%jJjKjJ%
-28240A%%%jjJ%jJ%%%j%J%%%jJ%%j%%J%J%j%%jJj%Jj%J%j%%JkK%%%%%j%%%%%JJjjJJj%%jJ
-28287@Jk%J%%j%%Jj%%%%J%%jJjKk%%J%%j%%%%%%KkKjJ%%jj%%%%JJkJ%Jjj%%jJ%%%K%%j%J
$$ plain form
-28334 1 1 0 0 1 0 0 -1 0 0 0 0 0 -1 0 0 0 1 1 0 0 0 0 0 0 1 0 -1 1 1 -1 0 0 -1 -1 -1 -1 0 -1 -1 -1 0 0 0 -1 0 -1 0 -1 -2 -1 -1 -1 -1 -1 0 1 0 0 0 -1 -1 -1 -1 -1 -1 -1 -1 -1 0
-28381 0 0 0 -1 0 -1 -2 0 0 -1 -2 -1 -1 -1 -2 -2 -1 -1 -1 0 0 0 -1 0 0 -1 -1 -2 -1 0 -1 -1 -1 -1 -1 -1 -2 -1 0 -1 0 0 -2 -2 -1 0 -1 0 -1 -1 0 -1 -2 0 -1 -1 0 -2 -1 -1 -1 0 0 0 -1 0 -1 -1 -1 0
-28428 0 -1 -1 -1 -1 -1 -1 -1 -1 -1 0 0 -1 0 -2 -1 1 -1 0 0 -1 -1 0 0 -1 0 -1 -1 0 0 -1 -1 -1 0 -1 0 1 0 0 0 -1 -1 -1 -1 -1 -2 -1 0 -1 1 -1 -1 0 0 0 0 -2 -1 -1 -1 0 0 0 0 -1 -1 -2 -1 0 -2
-28475 -2 -2 -1 -1 -1 -1 -1 -1 -1 -1 0 -1 0 1 0 0 -1 -1 -1 -2 -1 -1 -1 -1 -1 -2 -1 -1 -1 -1 -1 0 -1 -1 -1 -1 -1 0 -2 0 -1 0 -1 -2 -1 -1 -1 -1 0 0 0 -1 -1 -1 -1 -2 -1 -1 -2 -2 -1 -1 -2 -1 -1 -1 0 -1 -1 -1
-28522 -1 -2 -1 -1 -1 -1 -1 -1 0 -2 0 -1 -1 -1 0 0 -1 -1 -1 0 -1 -2 -1 -1 -1 0 -1 -1 -2 -1 -2 -1 -1 -1 -1 -2 -1 -2 -1 -1 -1 -1 -1 -1 -1 -1 -1 -1 0 -1 -1 -2 -2 -2 0 -1 -1 0 0 -2 -1 0 -1 -1 0 -2 -1 -2 -1 -2
-28569 -2 -1 -1 -1 -1 -1 0 -1 -1 0 -1 -2 0 -1 -1 -1 -1 -1 -1 -1 -2 -1 -2 -2 -1 -1 -1 -1 -2 -1 -1 -2 -1 -1 0 -1 -1 -1 -1 -1 0 -2 -3 -1 -1 -2 -1 -1 0 -1 -1 -1 -1 -1 -1 -1 -1 -2 -2 -1 -2 -1 -2 -2 -2 -2 -1 0 -1 -1
-28616 -1 -2 -1 -1 -1 0 0 -1 -1 -2 -2 -1 -2 -1 -1 0 -1 -2 -1 -1 -1 -1 0 1 0 -1 -2 -2 -1 -2 -1 -1 -2 -1 -2 0 0 0 0 -2 -1 -1 -1 -1 0 -1 -1 -2 -1 -1 -1 -2 1 0 -2 -1 -1 0 0 -1 0 -1 -1 -2 -1 -1 -1 -1 -1 -1
-28663 -1 0 -1 -1 -1 -1 -1 -1 0 -1 -1 -1 -1 -1 -1 0 -2 -1 -1 0 -1 0 -1 -1 -2 -1 -2 -1 -1 -1 -1 0 -1 -1 -1 -1 -1 1 -1 0 0 -2 -2 0 -2 -1 -2 -1 -1 -1 0 0 0 0 0 0 -1 -1 0 0 -1 0 -1 0 -2 -2 -2 -2 -1 -1
$$ packed form
-28334A%j%Jj%jJ%%%%jJ%%J%j%%%%%JjjK%kJ%j%%%Jj%%J%%jJjJjjJ%%%%JJj%%j%%%%%%%%J
-28381@%%jJjjK%jjJ%%j%J%%J%%jJ%j%jJJj%%%%%jJJjJ%k%JJjJj%JjjKj%JkJ%%J%%jJj%%J
-28428@j%%%%%%%%J%jJkJKkJ%j%J%jJj%J%j%%JjJJj%%j%%%%jJJjKk%J%%%kJ%%J%%%j%jJJk
-28475b%J%%%%%%%JjJJj%j%%jJ%%%%jJ%%%%Jj%%%%JkKjJjjJ%%%J%%j%%%jJ%j%J%jJ%%Jj%%
-28522ajJ%%%%%JkKj%%J%j%%JjjJ%%Jj%jJjJ%%%jJjJ%%%%%%%%%Jj%j%%Kj%J%kJJj%JkJjJj
-28569bJ%%%%Jj%JjjKj%%%%%%jJj%J%%%jJ%jJ%Jj%%%%JkjK%jJ%Jj%%%%%%%j%JjJj%%%JJj%
-28616ajJ%%J%j%j%JjJ%JjjJ%%%JJjjj%JjJ%jJjK%%%kJ%%%Jj%jJ%%jLjkJ%J%jJj%jJ%%%%%
-28663aJj%%%%%Jj%%%%%JkJ%JjJj%jJjJ%%%Jj%%%%KkJ%k%KkJjJ%%J%%%%%j%J%jJjJk%%%J%
$$ plain form
-28710 -1 -2 0 -1 -1 0 -1 0 -1 -1 -2 -2 -1 -1 -1 -1 -1 -1 -1 -1 -1 0 -1 -2 0 0 -1 -1 0 -1 -1 0 0 -1 -1 -1 -1 -1 -1 0 -1 -1 -2 -2 -1 -1 -1 0 -1 -1 0 -1 -1 -1 -1 -1 -1 0 0 -1 -2 -1 0 -1 -1 -1 -1 0 0 -1
-28757 -1 -1 -2 -2 0 -2 0 -1 -2 0 -2 0 -1 0 -1 -1 0 -1 0 -1 -1 0 -1 0 -2 -1 -1 -1 -1 0 -1 -2 -2 -1 -1 -1 -1 -1 0 -1 -1 -1 -2 -2 -2 -1 -1 -1 -1 0 -2 -2 -1 -1 0 0 -1 -1 -2 -1 -1 -1 -2 -1 -1 1 -1 -1 -1 1
-28804 1 -1 -2 -1 -2 -3 -2 -2 -1 -1 0 -1 -1 -1 -1 -1 -1 -2 -1 -1 -2 -1 -1 0 -1 -1 -1 -1 -1 -1 -1 -1 0 -1 0 -2 -1 -1 -1 -1 -2 -2 0 0 -1 0 0 -2 -1 -1 0 -2 -1 -2 0 -2 -1 0 0 -1 -2 -2 -1 -1 0 -1 0 -1 -1 -2
-28851 -2 -1 0 0 0 0 0 -1 -2 -1 -1 -1 -2 0 -1 0 -2 0 -1 -1 -1 0 -1 -1 -2 -1 -1 0 -1 -2 -1 0 -2 -1 0 -1 -1 -1 0 0 -1 0 -1 -1 -2 0 -1 -1 -1 -1 -1 -1 -1 -1 -1 0 -2 -1 -1 -2 -2 0 0 1 -2 -2 -1 -1 0 -1
-28898 -1 -1 -1 0 -1 -1 -1 -1 -1 -1 -1 -1 0 -2 0 -2 -2 -2 -1 0 -1 -1 -2 -2 -1 0 -1 -1 -1 -1 1 0 -1 -1 -1 0 -2 -2 -1 -1 -2 -2 -2 -1 -2 -1 -1 -2 -1 -1 -2 -2 -1 -1 0 0 -1 -1 -1 0 -1 0 0 -1 0 0 -2 -2 0 -1
-28945 -1 -1 -2 -1 0 0 -1 0 0 -1 -1 0 0 0 -1 -1 -2 -1 -2 0 0 -1 -1 -2 -1 -1 -1 -1 -2 -1 -1 -1 -1 -2 -1 -1 -1 -2 -2 -1 -1 -1 -1 -1 -1 -1 -1 -1 -1 -2 -2 -1 -1 -1 -2 -1 -2 0 -2 -1 -1 -1 -1 -1 -2 -1 -1 0 -1 0
-28992 0 -1 -1 -2 -1 -1 -2 -1 1 -2 0 -1 0 0 -1 -2 -2 -2 -1 -1 -1 -1 -2 -1 -1 -1 0 -2 -1 -1 -1 -1 -2 -2 -1 -1 -1 0 -1 -1 -1 -1 -2 -1 -2 -1 -1 -1 0 0 -1 0 -1 -1 -1 -1 -1 -2 -1 -1 -1 -1 0 -2 -1 -1 0 -1 -1 0
-29039 0 0 0 -1 -1 -1 -2 -1 -1 -1 -1 -2 -1 -2 -2 -2 0 0 0 -1 0 -1 -2 -2 -1 0 -1 -1 0 -1 -1 0 -1 -1 -1 -2 -1 -1 0 -1 -4 -1 0 -1 -1 -1 -1 -1 -1 0 0 -1 -2 -2 -2 -1 0 -1 -1 -1 -1 -1 0 -1 -1 -1 -1 -1 -1 -1
$$ packed form
-28710ajKj%JjJj%j%J%%%%%%%%JjjK%j%Jj%J%j%%%%%Jj%j%J%%Jj%Jj%%%%%J%jjJJj%%%J%j
-28757a%j%KkKjjKkKjJj%JjJj%JjJkJ%%%Jjj%J%%%%Jj%%j%%J%%%Jk%J%J%j%jJ%%jJ%Kk%%K
-28804AkjJjjJ%J%Jj%%%%%jJ%jJ%Jj%%%%%%%JjJkJ%%%j%K%jJ%kJ%JkJjKkJJ%jj%J%JjJj%j
-28851bJJ%%%%jjJ%%jKjJkKj%%Jj%jJ%JjjJJkJJj%%J%jJj%jKj%%%%%%%%JkJ%j%K%Jl%J%Jj
-28898a%%Jj%%%%%%%JkKk%%JJj%j%JJj%%%Kjj%%Jk%J%j%%JjJ%jJ%j%J%J%j%%JjJ%jJ%k%Kj
-28945a%jJJ%jJ%j%J%%j%jJjK%j%jJ%%%jJ%%%jJ%%j%J%%%%%%%%%j%J%%jJjKkJ%%%%jJ%JjJ
-28992@j%jJ%jJKlKjJ%jj%%J%%%jJ%%JkJ%%%j%J%%Jj%%%jJjJ%%J%jJj%%%%jJ%%%JkJ%Jj%J
-29039@%%j%%jJ%%%jJj%%K%%jJjj%JJj%Jj%Jj%%jJ%JjlLJj%%%%%J%jj%%JJj%%%%Jj%%%%%%
$$ plain form
-29086 -1 -2 -1 -1 -1 -1 -1 -1 -2 -2 -2 -1 -1 0 -2 -1 -1 0 0 -1 -2 -1 -2 -1 0 -1 -1 -1 -2 -2 -1 -1 0 -1 -2 -1 -1 0 0 0 -1 -1 -1 -1 -3 -2 -1 -1 -1 0 -1 -2 -1 -2 -2 -2 -1 0 -1 -2 -2 -2 0 -1 -1 -1 -1 -1 -2 -1
-29133 -1 -1 -1 -1 -1 -1 0 -1 -2 -2 -1 -1 0 0 0 0 0 -1 -1 -1 -1 -1 -1 -1 -2 -1 -2 -1 -1 -1 -1 -1 -1 0 -1 -1 -1 0 -1 -2 -1 -1 -1 -1 -1 -1 -1 -1 -1 -1 -1 1 0 -1 0 0 -1 -1 0 0 0 0 0 -1 -1 -1 0 -1 -1 -1
-29180 -1 -1 -1 -1 -2 -2 -2 -1 -1 -1 -1 -1 -1 -1 -1 0 -1 0 -1 -1 -2 0 0 0 -1 -1 -1 -1 -1 -1 -1 0 0 -1 -1 -1 -2 0 0 -1 -1 -1 -1 -2 -2 -3 -1 -1 0 -2 -3 -1 -2 0 -1 -2 -2 -1 -1 -1 0 -1 -2 -1 -2 0 0 -1 -1 -1
-29227 -1 -1 -1 -1 -1 -2 -1 -1 -1 -1 1 0 -1 -1 0 -2 0 -1 0 0 0 -1 -1 -2 0 -2 -1 -1 -1 0 -1 -1 -1 -3 -1 -1 -1 -1 -1 -2 -2 -1 -1 -1 -2 -2 -1 -1 0 0 0 0 0 -2 0 0 0 -1 -1 -1 -1 -2 -1 -1 -1 -1 -1 -2 0 -1
-29274 -1 -2 0 -1 0 -1 -1 -1 0 0 0 -1 -1 0 -1 -1 -1 -1 -1 -1 -1 -1 -1 -1 -2 -1 0 0 -1 -1 -1 -1 -1 -1 -2 -2 -1 -1 -1 -1 -2 -2 -2 -1 -2 0 -1 -1 -1 -1 -1 0 -1 -1 -1 0 -1 0 -1 -1 -1 0 -1 0 -1 -2 -1 -2 -2 -1
-29321 -1 -1 0 -1 -1 0 0 0 -1 -1 -2 -1 -1 -2 -1 0 0 -2 -1 -1 -1 -1 0 -1 -1 -1 0 -1 -2 -2 -2 -1 -1 -1 -2 -1 -1 0 -1 -1 -2 -2 -1 -1 -1 -1 0 -1 -2 -1 -1 -2 0 -3 -2 -1 -1 -1 -1 0 0 -2 0 0 -1 0 -2 -1 0 0
-29368 0 0 0 0 -2 -1 -1 -2 -1 -1 -1 0 -1 0 -1 0 -1 -1 -2 -2 -2 -1 -1 -1 -2 -1 -1 -2 -1 0 -1 0 -1 0 -1 -1 -1 -1 -2 -1 -1 -2 -2 -2 -2 -2 -1 -2 -2 -1 -1 0 -2 -1 -2 -1 0 0 -1 -1 -1 -1 -1 -1 -2 -1 -1 -1 -2 -2
-29415 -2 -3 0 1 0 -1 -1 -2 -1 -1 -1 -2 -1 -1 -2 -2 -1 -2 -2 -1 -1 -2 -1 -2 -2 -1 0 -2 0 0 -2 -1 -1 -1 -1 -1 -1 -1 -1 -1 -2 -1 -1 -2 0 0 -1 -2 -2 -1 -1 -1 -2 -1 0 -1 -1 -1 0 -1 0 -1 -2 -1 -1 -1 -1 -1 -1 -1
$$ packed form
-29086ajJ%%%%%j%%J%JkJ%J%jjJjJJj%%j%J%JjjJ%J%%j%%%kJJ%%JjjJj%%JJjj%%Kj%%%%jJ
-29133a%%%%%Jjj%J%J%%%%j%%%%%%jJjJ%%%%%Jj%%JjjJ%%%%%%%%%%KjjJ%j%J%%%%j%%Jj%%
-29180a%%%j%%J%%%%%%%JjJj%jK%%j%%%%%%J%j%%jK%j%%%j%jK%JkjKjKjj%J%%JjjJjK%j%%
-29227a%%%%jJ%%%Kjj%JkKjJ%%j%jKkJ%%Jj%%kK%%%%j%J%%j%J%J%%%%kK%%j%%%jJ%%%%jKj
-29274ajKjJj%%J%%j%Jj%%%%%%%%%jJJ%j%%%%%j%J%%%j%%JjKj%%%%Jj%%JjJj%%JjJjjJj%J
-29321a%Jj%J%%j%jJ%jJJ%kJ%%%Jj%%Jjj%%J%%jJ%Jj%j%J%%%JjjJ%jKlJJ%%%J%kK%jJkJJ%
-29368@%%%kJ%jJ%%JjJjJj%j%%J%%jJ%jJJjJjJj%%%jJ%j%%%%Jj%J%JkJjJJ%j%%%%%jJ%%j%
-29415bjLJjj%jJ%%jJ%j%Jj%J%jJj%JJkK%kJ%%%%%%%%jJ%jK%jj%J%%jJJj%%JjJjjJ%%%%%%
$$ plain form
-29462 -1 0 -1 -1 -2 -1 -1 -2 -1 0 -1 -1 -1 -1 -2 0 -1 -1 -1 -1 -1 -1 -2 0 -2 0 0 0 -1 -1 -2 -1 -1 -1 -1 -1 -1 0 -1 -1 0 -1 -2 -1 -1 -1 -1 0 -1 -1 -1 -1 -2 -1 -2 -1 -1 -1 -1 -1 -1 -1 -1 -1 -1 0 -1 -2 -1 0
-29509 0 0 0 -1 0 -2 -2 -1 -1 0 -1 -2 -2 -1 0 -1 -1 -1 -2 -1 -1 0 -1 -1 -1 -1 -1 -1 -2 -2 0 -1 -1 -1 -2 -1 0 -2 -2 -1 -1 -2 0 -1 -1 -1 -1 -2 -1 -1 -1 -1 -1 -1 -1 -1 0 -1 -2 -1 -1 0 0 -1 -2 -2 0 -1 -2 0
-29556 0 0 -1 -1 -1 -1 -1 0 -1 0 -2 -2 0 -1 -1 -1 -1 -2 -1 -1 -2 -2 -2 -2 -1 -1 -1 -2 -2 -2 -2 -1 -2 -1 -2 -1 -1 -2 -1 -1 -1 -1 -1 -1 -2 -1 -1 -2 -1 -1 -1 -1 -1 -1 -1 -2 -1 0 -1 -1 -1 -2 -2 -2 -2 -2 -2 -2 -2 -1
-29603 -1 -1 -1 0 -1 -1 -1 -1 -1 -1 -1 -1 0 -2 -1 -1 -2 -2 0 -1 -1 -2 0 -1 -1 -2 -2 -1 -1 -1 -1 -1 -1 -2 -2 0 -1 -1 -1 -1 -1 -1 -1 -1 -1 -1 -1 -2 -2 -1 -1 -1 -1 -1 -1 -1 -1 -1 -1 -1 -1 -1 -2 0 0 -1 -1 -1 -1 -1
-29650 -1 -1 -3 -2 -2 -1 0 -2 -2 -1 -1 -1 0 -1 -1 0 -1 -1 -2 -2 -2 -1 -1 0 -1 -2 -1 -1 -2 -1 0 -1 -1 0 -1 -1 0 -2 -1 -1 -1 -2 -1 -1 -1 -1 -1 -1 -1 -1 -1 -2 -2 -1 -1 -1 -1 -1 -2 -2 -2 -1 0 0 0 -2 -1 -1 -1 -1
-29697 -1 0 0 -1 -2 -2 -1 -1 0 -1 -1 -1 -1 -2 -1 -1 -1 -2 0 -1 0 -1 -1 -1 -2 -1 0 -1 -1 -1 -2 -1 -2 -1 0 -1 0 -1 -1 -1 -1 0 -1 -1 -2 0 -1 -1 0 0 0 -1 -1 1 0 0 -1 -1 -1 -1 -1 -1 -1 -1 -1 -2 0 -1 -1 -1
-29744 -1 -1 -1 -1 -1 -1 -1 -1 -1 -1 0 -1 -1 -2 -1 0 0 0 -1 -1 -1 0 -2 -2 -1 0 -1 -1 0 -2 -1 0 -1 -1 -1 -1 -2 0 -2 -1 -1 -1 -1 -1 0 -1 -1 -1 -1 -1 0 -1 0 -1 -1 -2 -1 -1 -1 -1 -3 -2 -1 -2 -1 -1 -1 -1 -1 -1
-29791 -1 0 -1 -1 -1 -1 -2 -1 -2 0 -2 0 -1 -1 0 -1 0 -2 -2 -1 -2 -1 -1 -1 0 0 -1 -2 0 0 -1 -1 -2 -2 -1 -2 -1 -1 -1 -2 -2 0 -1 -2 -1 -1 -1 0 0 -2 -1 -2 -1 -1 -1 -2 -1 -1 -1 -1 -1 -1 -2 -1 -1 -2 0 0 -1 -2
$$ packed form
-29462aJj%jJ%jJJj%%%jKj%%%%%jKkK%%j%jJ%%%%%Jj%JjjJ%%%Jj%%%jJjJ%%%%%%%%%JjjJJ
-29509@%%jJk%J%Jjj%JJj%%jJ%Jj%%%%%j%Kj%%jJJk%J%jKj%%%jJ%%%%%%%JjjJ%J%jj%KjjK
-29556@%j%%%%JjJk%Kj%%%jJ%j%%%J%%j%%%JjJjJ%jJ%%%%%jJ%jJ%%%%%%jJJj%%j%%%%%%%J
-29603a%%Jj%%%%%%%JkJ%j%Kj%jKj%j%J%%%%%j%Kj%%%%%%%%%%j%J%%%%%%%%%%%%jK%j%%%%
-29650a%kJ%JJk%J%%Jj%Jj%j%%J%JjjJ%jJJj%Jj%JkJ%%jJ%%%%%%%%j%J%%%%j%%JJ%%kJ%%%
-29697aJ%jj%J%Jj%%%jJ%%jKjJj%%jJJj%%jJjJJjJj%%%Jj%jKj%J%%j%Kj%j%%%%%%%%jKj%%
-29744a%%%%%%%%%Jj%jJJ%%j%%Jk%JJj%JkJJj%%%jKkJ%%%%Jj%%%%JjJj%jJ%%%kJJjJ%%%%%
-29791aJj%%%jJjKkKj%JjJk%JjJ%%J%jjK%j%j%JjJ%%j%KjjJ%%J%kJjJ%%jJ%%%%%jJ%jK%jj
$$ plain form
-29838 -2 -1 -2 -1 0 -1 -1 -1 -1 -1 -1 0 -1 -2 -2 -1 -1 -1 -1 -1 -1 -1 -1 -2 -2 0 -1 -1 0 -1 -1 -1 -2 -2 -1 -1 0 -1 0 0 -1 -2 -2 -2 -1 -1 -3 -2 -2 -2 -1 -1 -1 -1 -1 -1 -1 -2 -2 -2 -1 -1 -2 -1 -2 -1 -1 -1 -1 -2
-29885 -2 -1 -1 -2 -1 0 -1 -1 -2 -2 0 -1 -2 -1 0 -1 -1 0 0 -2 -1 -1 0 0 -2 -2 -1 -1 0 -2 -3 -1 -2 -1 -3 -1 0 -1 -3 -2 -3 -1 -1 -2 0 -1 0 -1 -1 0 -1 -1 -1 -1 -1 -1 -1 -1 -2 -1 -1 -1 -1 0 0 -2 -1 -1 -1 -1
-29932 -1 -1 0 -1 -1 -1 -1 -2 -2 0 -1 -1 -1 -2 -1 -1 -1 -2 -2 -1 -1 -1 -2 -2 -2 -1 -2 -2 0 -1 -1 -2 -1 -1 -1 -2 -1 -1 -1 -1 -1 -1 -1 -1 -1 0 0 -2 -2 -1 -1 -1 -1 -1 -1 -1 0 -1 -2 -1 -1 -2 -2 -1 -1 0 0 -1 -1 -1
-29979 -1 -1 -1 0 -1 -1 -1 -1 -2 -2 -2 -1 -1 -3 -2 -2 -2 0 -1 0 -1 -1 0 -1 -1 -1 -1 -2 -2 -1 -1 -1 -2 0 0 -2 -2 -2 -2 0 0 -2 -1 -1 -2 0 -1 -3 -2 0 0 -1 -1 0 -2 0 -1 -1 0 0 -1 -1 -2 -2 -1 -1 -1 0 -1 -1
-30026 -1 -1 -1 -1 -1 -1 -1 -2 0 -1 -1 -1 -2 -2 -1 -2 0 -1 -1 -2 -1 -1 -1 -1 -1 -1 -2 -3 -1 -1 -1 -2 -1 -1 -1 -2 -2 0 -1 -1 0 -2 -1 -1 -1 -2 -2 0 0 -1 -1 -1 -2 -2 -2 0 0 0 -1 0 0 -1 0 -2 -1 -2 -1 -2 -2 0
-30073 0 0 -1 -1 -1 -1 0 -1 -1 -1 -1 0 -1 0 -1 -1 0 -1 -1 0 -1 -1 -1 -1 -1 -1 -2 -1 -2 -2 -1 -1 -1 -1 -2 -1 -1 -1 -1 -2 -2 -1 -2 -2 -1 -1 -1 0 -1 -1 -2 -1 -2 -2 -1 0 0 0 0 0 -1 -1 -1 -2 -1 -2 -2 -2 -1 0
-30120 0 -1 -1 -1 -1 -1 -2 -1 -1 -2 -1 -1 -1 -1 -1 -1 -1 -1 0 -1 -2 -2 -1 -1 -1 0 -1 -1 -2 -2 -2 -1 0 -1 -1 -1 -2 -1 -1 0 -1 -1 -1 -2 -2 -2 -2 -1 -1 -1 -2 -1 -1 -1 -1 -3 -2 -2 0 -1 -1 0 0 -1 -1 0 0 0 0 -1
-30167 -1 0 -2 -1 -1 -2 -2 0 -1 -2 -2 -1 -2 0 -2 -1 0 -1 -1 -1 -1 -1 -1 0 -1 -1 -2 0 -2 -1 -1 -1 -2 -1 -2 -2 -2 0 0 -1 0 -1 -2 -2 -2 -2 -2 -2 -2 -2 -2 -1 -1 -2 -2 -1 -1 -1 -1 -1 -1 -1 -2 -1 -2 -2 -1 -1 -2 -1
$$ packed form
-29838bJjJJj%%%%%Jjj%J%%%%%%%j%Kj%Jj%%j%J%JjJ%jj%%J%kJ%%J%%%%%%j%%J%jJjJ%%%j
-29885bJ%jJJj%j%KjjJJj%J%kJ%J%k%J%JkjKjJkKJjkJjK%jKjJj%Jj%%%%%%%jJ%%%J%kJ%%%
-29932a%Jj%%%j%Kj%%jJ%%j%J%%j%%Jj%Kj%jJ%%jJ%%%%%%%%J%k%J%%%%%%JjjJ%j%J%J%j%%
-29979a%%Jj%%%j%%J%kJ%%KjJj%Jj%%%j%J%%jK%k%%%K%kJ%jKjkJK%j%JkKj%J%j%j%J%%Jj%
-30026a%%%%%%jKj%%j%JjKj%jJ%%%%%jjK%%jJ%%j%Kj%JkJ%%j%K%j%%j%%K%%jJ%jJkJjJj%K
-30073@%j%%%Jj%%%JjJj%Jj%Jj%%%%%jJj%J%%%jJ%%%j%Jj%J%%Jj%jJj%JJ%%%%j%%jJj%%JJ
-30120@j%%%%jJ%jJ%%%%%%%Jjj%J%%Jj%j%%JJj%%jJ%Jj%%j%%%J%%jJ%%%kJ%Kj%J%j%J%%%j
-30167aJkJ%j%Kjj%JjKkJJj%%%%%Jj%jKkJ%%jJj%%K%jJjj%%%%%%%%J%j%J%%%%%%jJj%J%jJ
$$ plain form
-30214 -1 -1 0 0 -1 -1 -1 -1 -1 0 0 1 0 0 0 0 -2 -2 -2 -2 -2 -1 -2 -2 -1 -1 -1 -1 -1 -1 -1 -1 0 -1 -2 -1 -2 -2 -1 -1 -1 -2 -1 -2 -2 -2 -1 -1 -1 -1 -1 -1 0 0 -1 -1 0 -1 -2 -1 -1 -2 0 -1 -1 -1 -1 -2 -1 -1
-30261 -1 -1 -2 -1 0 0 -1 -1 -1 -1 -1 -1 -1 -1 -2 -1 0 -1 -1 -1 -1 -1 -1 -1 -1 -2 -2 -2 -1 -1 -2 -1 -1 -1 -1 0 -1 0 -1 -1 1 0 -1 0 0 0 -1 0 -1 -1 -1 -2 -1 0 -1 -1 -2 -1 -1 0 0 -1 -2 -2 -1 -2 -1 -1 -2 0
-30308 0 0 -1 -2 -1 -1 -1 -2 -2 -1 0 0 -1 0 0 -2 -1 -1 -1 -1 -1 0 0 0 -2 -2 0 -1 -1 -1 -1 -1 -1 -1 0 -1 -1 -1 0 -1 -1 -1 0 0 -1 -1 -1 -1 -1 -1 -1 -1 -1 -1 0 0 -1 -1 -1 -2 -1 -1 -1 -1 -1 -1 0 0 -1 -2
-30355 -2 -1 0 0 0 1 0 -1 -2 -1 -1 -1 0 -1 -1 -1 0 0 -1 0 -1 -1 -1 0 -1 -2 -1 -1 -2 -2 -1 0 0 0 0 -1 0 -2 -1 -2 -1 -1 0 0 2 0 0 -1 -1 0 0 -2 -2 -1 -1 0 -2 -1 -2 -1 0 -1 -1 -1 -1 -2 0 0 -1 -1
-30402 -1 -1 -2 -2 -1 0 0 0 0 -2 -1 -1 -1 -1 0 -1 -2 -2 -1 -2 -2 -2 -1 -2 -2 0 -1 0 -1 -3 -1 -1 -1 -1 -1 -1 -3 -1 -2 -2 -1 -1 -1 -1 -2 -2 -2 -2 -1 -2 -1 0 -1 -1 -1 -1 -1 -1 -2 -1 -1 0 -2 -1 -1 -1 -2 -1 -1 -1
-30449 -1 -1 -1 -2 0 -2 0 -1 -2 -1 0 0 -1 0 0 -2 -1 -1 -2 -3 -1 -1 0 -2 -3 -3 -2 -1 0 -1 -1 -2 -3 -3 -2 -1 -2 -1 -1 -2 -2 -1 -1 -1 -1 -3 -2 -1 0 -1 -1 -1 -2 -2 0 -1 -1 -1 -2 -1 -2 -1 -1 -1 0 -2 0 0 -1 -1
-30497 -1 -1 -2 -1 -1 -1 -1 -2 -1 -1 -1 -2 -2 -1 -1 -1 0 0 0 0 -2 0 0 0 -1 -1 -1 -1 0 -2 -1 -1 0 0 0 -1 -1 -2 -2 -2 -2 -2 -2 -1 -1 -2 -2 -1 -1 0 -2 -2 -2 -1 -1 -1 -2 0 -1 -2 -1 -1 -1 -1 -1 -1 -1 -1 -1 -1
-30544 -1 -1 -1 -1 0 -1 -1 -1 -1 -1 -3 -2 0 -1 -1 -1 0 -2 -1 -1 -1 -1 -1 -2 -1 0 -1 -1 0 -2 -1 -1 -1 -1 -2 -2 -1 -1 0 -1 -3 -2 -2 -2 0 -1 -2 -2 -1 0 -2 -2 -1 0 0 -1 0 0 0 0 -1 -1 -1 -1 -1 -1 -1 0 0 -2
$$ packed form
-30214a%J%j%%%%J%Jj%%%k%%%%Jj%J%%%%%%%JjjJj%J%%jJj%%J%%%%%J%j%JjjJ%jKj%%%jJ%
-30261a%jJJ%j%%%%%%%jJJj%%%%%%%j%%J%jJ%%%JjJj%KjjJ%%jJj%%jJJj%jJ%J%jj%JjJ%jK
-30308@%jjJ%%j%JJ%jJ%kJ%%%%J%%k%Kj%%%%%%Jj%%Jj%%J%j%%%%%%%%%J%j%%jJ%%%%%J%jj
-30355bJJ%%JjjjJ%%Jj%%J%jJj%%JjjJ%j%JJ%%%jJkJjJ%J%Kk%j%J%k%J%JkJjJJj%%%jK%j%
-30402a%j%JJ%%%kJ%%%Jjj%Jj%%Jj%KjJjkK%%%%%kKj%J%%%j%%%JjJJj%%%%%jJ%JkJ%%jJ%%
-30449a%%jKkKjjJJ%jJ%kJ%jjK%Jkj%JJJj%jj%JJjJ%j%J%%%kJJJj%%j%Kj%%jJjJ%%JkK%j%
-30497a%jJ%%%jJ%%j%J%%J%%%kK%%j%%%JkJ%J%%j%j%%%%%J%j%J%Jk%%J%%jKjjJ%%%%%%%%%
-30544a%%%Jj%%%%kJKj%%JkJ%%%%jJJj%JkJ%%%j%J%JjkJ%%Kjj%JJk%JJ%jJ%%%j%%%%%%J%k
$$ plain form
-30591 -2 0 -1 -1 0 0 0 -1 -1 -1 -1 -1 0 0 -2 -1 -1 0 0 -1 -2 -1 -2 -2 -1 -1 -1 -1 -1 -1 -2 0 0 -1 -1 -1 0 -2 -2 -1 -1 -1 -1 -1 -2 -1 -1 -1 -1 -1 -1 -1 -1 0 -2 0 -2 -1 0 -1 -1 0 -1 0 0 0 -1 0 0 0
-30638 0 -1 -1 -2 -1 -1 -1 -1 0 -1 0 -1 -2 -1 -1 -2 -2 -1 -1 -1 -1 0 -1 -1 -1 -2 0 -2 -1 -1 -1 -1 -2 -2 -1 -2 0 -2 -1 -2 -1 0 0 -1 0 -1 -1 -1 -1 -1 -1 -1 -1 -1 -2 -1 0 -1 -1 -1 -1 -1 -1 -2 -1 -2 0 -2 -1 0
-30685 0 -1 0 0 0 0 -2 -1 -1 -1 0 -1 -1 -2 -2 -2 -1 -1 -1 -1 -2 -2 -2 1 -1 0 0 0 0 -2 -1 -1 0 0 0 -1 -1 -1 -1 -1 -1 -1 -1 -1 -1 -1 -1 -1 -1 -1 -2 -2 -2 -1 -2 -1 -1 -1 -2 -3 -2 -1 -2 -2 -2 -1 -1 -1 -1 -1
-30732 -1 -2 -1 0 1 -2 -2 0 -1 -1 -1 -1 0 -1 -1 0 0 -1 -1 -1 -1 -1 0 -1 0 -1 -2 -1 0 -1 -2 -2 -2 -1 0 -2 -1 -1 -2 -1 -1 -1 -1 -1 -1 -1 -2 -2 -3 -2 -2 -2 0 -2 -2 0 -1 -2 -2 -1 -1 -1 -2 0 -1 -1 -2 -2 -1 -1
-30779 -1 -1 -2 -1 -1 -2 -3 -1 0 -1 -1 -2 -1 -1 -1 -1 0 -1 -2 -1 -1 -1 -1 -1 -2 0 -1 -1 -1 0 -1 0 -1 0 0 0 -2 -1 -1 -1 -2 0 -1 -1 -1 -1 -1 -2 -2 -2 0 0 -1 -1 -1 -1 -1 -1 0 -2 -1 -1 -2 -1 -1 -1 -1 -1 -1 -1
-30826 -1 -1 -2 -1 -1 -1 -1 0 0 0 -2 -2 -1 -1 -1 -2 -1 -1 -1 0 -1 -1 -1 -2 -1 -1 -1 -1 -1 -1 0 -1 -1 0 -1 -2 -1 -1 -1 -2 -1 -1 -1 -2 -1 -1 -1 -1 -1 -1 -1 -1 0 -1 0 -2 -2 -2 -1 -2 -2 -1 0 -1 -1 -2 0 0 -1 -1
-30873 -1 -1 -1 -1 -1 -1 -2 -1 -1 -2 -1 -1 -2 -1 -2 -2 -2 -2 -2 -1 -2 -2 -2 -1 -1 -2 -2 0 -1 0 -1 -2 -1 -1 -1 -1 -1 -2 -1 -1 -1 0 -1 -1 -1 -1 -2 -1 0 -1 -2 -1 -1 -1 -1 -1 -1 -1 0 0 0 -1 -1 -2 -2 -1 -1 -1 -2 -1
-30920 -1 -1 -1 0 0 -1 -2 -2 -1 -1 -1 -1 0 0 -1 -2 -1 -1 -2 -1 -3 -1 -1 -1 0 -1 -1 -1 -1 0 -1 -1 -1 -2 -1 -3 -1 -1 -1 -2 -2 -1 0 0 0 -1 -1 -2 -2 -2 -1 -1 -1 -1 -1 -1 -2 -2 -1 -1 -2 -1 -1 -1 -1 -1 0 0 0 -1
$$ packed form
-30591bKj%J%%j%%%%J%kJ%J%jjJj%J%%%%%jK%j%%Jk%J%%%%jJ%%%%%%%JkKkJJj%JjJ%%jJ%%
-30638@j%jJ%%%JjJjjJ%j%J%%%Jj%%jKkJ%%%j%JjKkJjJJ%jJj%%%%%%%%jJJj%%%%%jJjKkJJ
-30685@jJ%%%kJ%%Jj%j%%J%%%j%%LkJ%%%kJ%J%%j%%%%%%%%%%%%%%j%%JjJ%%jjJJj%%J%%%%
-30732ajJJJl%Kj%%%Jj%J%j%%%%JjJjjJJjj%%JJkJ%jJ%%%%%%j%jJ%%Kk%Kjj%J%%jKj%j%J%
-30779a%jJ%jjKJj%jJ%%%JjjJ%%%%jKj%%JjJjJ%%kJ%%jKj%%%%j%%K%j%%%%%JkJ%jJ%%%%%%
-30826a%jJ%%%J%%k%J%%jJ%%Jj%%jJ%%%%%Jj%JjjJ%%jJ%%jJ%%%%%%%JjJk%%Jj%JJj%jK%j%
-30873a%%%%%jJ%jJ%jJj%%%%Jj%%J%j%KjJjjJ%%%%jJ%%Jj%%%jJJjjJ%%%%%%J%%j%j%J%%jJ
-30920a%%J%jj%J%%%J%jjJ%jJkK%%Jj%%%Jj%%jJkK%%j%JJ%%j%j%%J%%%%%j%J%jJ%%%%J%%j
$$ plain form
-30967 -1 -1 -1 -2 -1 -1 -1 -1 0 0 0 0 -1 -1 -1 -1 -1 -1 0 -2 -1 0 -1 -1 -1 -2 -1 -1 0 -2 -1 -1 -1 -1 0 -1 -2 -1 -2 -1 -1 0 -1 0 -1 -2 -2 -1 -1 -2 -1 -2 -2 -1 -2 -2 -1 -1 -2 -1 -1 -1 -1 0 -2 -1 -1 0 -1 -1
-31014 -1 -2 -2 -1 -1 1 -1 -1 -1 0 0 0 0 -1 -1 0 -1 -1 0 -1 -1 -2 -1 -1 -2 -1 -1 -1 -1 -2 -2 0 0 -2 0 -1 -1 -1 -1 -2 -1 0 -1 -1 -1 -1 -1 -1 -1 -2 -1 0 -2 0 -1 -1 0 -1 -2 -1 -1 -1 -1 -1 -1 -2 -1 0 -1 -2
-31061 -2 -2 -2 -1 -1 -2 -2 -1 -1 -1 -1 -2 -1 -1 0 0 -2 -1 0 -1 0 -1 -1 -1 -1 -2 -1 -2 -1 -1 0 1 0 0 0 -2 -1 0 -1 -2 -2 -2 -2 -2 -1 -1 0 0 -1 -1 -2 -1 -2 -1 -1 -2 -1 0 -1 -2 -1 -2 -2 -2 -2 -2 -1 -1 -2 -1
-31108 -1 -1 -1 -2 -1 -1 -1 -1 -1 -1 -1 -1 -1 -1 0 -1 -1 0 -1 -1 -1 -1 -1 -1 -2 -1 -1 -1 -1 -2 -2 -3 -2 -1 0 -2 -1 -1 -1 -1 -1 -1 -1 -3 -2 0 -1 -1 -1 -1 -2 -1 0 -1 -2 -2 -3 -2 -2 -2 -2 -1 -1 0 -1 -1 -2 -2 -1 -1
-31155 -1 -1 0 -1 -2 -1 -1 -1 -1 -1 -2 -1 0 -1 -1 -2 -1 -1 0 -1 -2 -1 -2 -1 -1 -1 -2 0 -1 -2 -1 -1 -1 -1 -2 -1 0 -1 0 -1 -1 -1 -1 0 0 -1 -2 -1 -1 -1 -1 -1 -1 -2 -2 -2 -1 0 -1 -2 0 -1 -1 -1 0 -1 -1 0 -1 -1
-31202 -1 -1 -1 -1 -1 -2 -1 -1 -2 -1 -2 -1 0 -1 -1 0 -2 -2 -2 -1 -2 -2 -1 -2 -2 -2 -1 -1 -1 -1 -1 -1 -1 -1 -1 -1 -1 -1 -1 -1 0 0 0 -1 -1 -1 -2 -1 -1 -1 -2 -2 -2 0 0 -2 -1 -1 -2 -2 -2 -2 -2 0 -2 -2 -3 -1 -2 -2
-31249 -2 -2 -1 -1 -1 -1 -2 -1 -1 -1 0 -1 -1 0 0 -1 -1 -2 -2 -1 -1 -3 -1 -2 0 -2 -1 -1 -2 -1 -1 -1 -1 -1 -1 -1 -1 -2 -1 -2 -2 -1 -1 -1 0 -1 -1 -1 -1 -1 -1 -1 -1 -1 -1 -1 -1 -2 -1 -1 -1 -1 -1 -1 -1 -1 -2 -2 -2 -1
-31296 -1 -1 0 0 -1 1 -1 -2 -1 -1 0 -1 -1 -1 -2 -2 -2 -1 0 -1 -1 -1 -1 -1 -1 0 -1 -1 -1 0 -1 -1 -1 0 -2 -1 -2 -1 -1 -1 0 -1 -2 -2 -2 -1 -1 -1 -1 -2 -1 -1 -1 -1 -1 -2 -2 -2 -1 -1 -1 -2 0 -1 -1 0 -1 -1 -1 -1
$$ packed form
-30967a%%jJ%%%J%%%j%%%%%JkJJj%%jJ%JkJ%%%JjjJjJ%JjJjj%J%jJj%Jj%J%jJ%%%JkJ%Jj%
-31014aj%J%Kk%%J%%%j%Jj%Jj%jJ%jJ%%%j%K%kKj%%%jJJj%%%%%%jJJkKj%JjjJ%%%%%jJJjj
-31061b%%J%j%J%%%jJ%J%kJJjJj%%%jJjJ%JJj%%kJJjj%%%%J%J%j%jJjJ%jJJjjJj%%%%J%jJ
-31108a%%jJ%%%%%%%%%Jj%Jj%%%%%jJ%%%j%jJJJkJ%%%%%%kJKj%%%jJJjj%jJ%%%J%Jj%j%J%
-31155a%JjjJ%%%%jJJj%jJ%JjjJjJ%%jKjjJ%%%jJJjJj%%%J%jjJ%%%%%j%%JJjjKj%%Jj%Jj%
-31202a%%%%jJ%jJjJJj%Jk%%Jj%Jj%%J%%%%%%%%%%%%%J%%j%%jJ%%j%%K%kJ%j%%%%Kk%jKj%
-31249b%J%%%jJ%%Jj%J%j%j%J%kKjKkJ%jJ%%%%%%%jJj%J%%Jj%%%%%%%%%%%jJ%%%%%%%j%%J
-31296a%J%jKkjJ%Jj%%j%%JJj%%%%%Jj%%Jj%%JkJjJ%%Jjj%%J%%%jJ%%%%j%%J%%jKj%Jj%%%
$$ plain form
-31343 -1 0 0 -1 -1 0 0 -1 -2 -1 -2 -1 -1 -1 -1 -1 -1 -2 -1 -1 -1 0 -1 0 0 1 0 -1 0 -1 0 -1 -1 0 -1 -2 0 -2 -1 -1 -1 -1 -1 -2 -1 -2 -1 -1 -1 -1 0 0 -2 -1 -1 -1 -1 -1 0 -1 -2 -2 -2 -2 -1 -1 -2 -1 -2 -1
-31390 -1 -1 -1 -1 -1 -1 -1 -2 -2 0 -1 -1 -1 0 -1 -1 -1 -1 -2 -1 -1 -2 -1 -1 -1 -1 -1 -2 -1 -1 0 0 -1 -2 -2 -1 -2 -1 -1 0 -1 -1 0 -1 -1 -1 0 -1 -1 -1 -2 -1 -1 -2 -2 0 -1 -2 0 -1 -1 -1 -1 -1 -1 -1 0 -1 -2 -2
-31437 -2 -1 0 -1 -1 -1 -1 -1 -1 -1 -1 -1 -1 -1 -1 -1 -1 -1 -2 -1 0 -1 -2 -3 -2 -2 -1 0 -1 -1 -2 -1 -2 -2 -1 -1 -1 -1 -1 -2 -1 -2 -1 -2 -2 -2 -2 -1 -1 -1 -1 -3 -2 -2 -1 -2 -1 -2 -2 -2 -1 -1 0 -2 -1 -2 -1 -1 -1 0
-31484 0 -1 -1 -2 -2 -1 -1 -1 -1 -1 -1 -1 -1 -2 -1 -2 -2 -2 -2 -2 -1 -1 0 0 -1 -1 -1 -2 -1 -1 -1 -1 -1 -1 -1 -1 -2 -4 -1 0 -2 -2 -1 -1 0 0 -1 -1 -1 -1 0 -1 -2 -1 -1 -1 -1 -1 -1 -1 -1 -1 -1 -1 -1 -2 -2 -1 -2 -2
-31531 -2 0 -1 -1 -1 -1 -1 -2 -2 -3 -2 -1 -1 -1 -1 -1 -1 -1 -1 -2 -1 -1 -1 -2 0 -1 0 -2 -1 0 -2 -1 0 -1 -1 -1 0 0 0 -1 1 -1 -1 -1 -1 -1 -1 -2 -1 -1 0 -1 -1 -1 0 0 -2 -2 -1 0 -1 -1 0 -1 0 0 0 -1 0 -1
-31578 -1 -1 0 -1 -1 -2 -1 -1 -1 -1 -2 -2 -2 -1 -1 -1 -2 -2 -1 -1 0 0 -1 -2 -2 -1 -2 -1 -1 -1 -1 0 -1 -1 -1 -1 -1 -1 -2 -1 -2 -1 0 -1 -2 -2 -1 -1 -2 -1 -1 -2 0 0 -1 -2 0 -1 -1 -1 -1 -2 -2 -2 -2 -2 -1 -2 -1 0
-31625 0 -1 -1 -1 -2 -1 -1 -1 -1 -1 -1 -1 -1 -1 -1 -1 -1 0 -1 -1 -1 -2 -2 -2 -2 -2 -1 -1 -1 0 -1 -1 -1 -1 -1 -2 -2 -1 -1 -1 -1 -1 0 -1 -1 -1 -1 -1 0 -1 -2 -1 -1 -1 -2 -2 -1 -2 -2 -1 -1 -1 -1 -2 -1 -1 -1 -1 -1 -1
-31672 -1 -1 -1 -1 0 0 -1 -1 -1 -1 -1 0 -1 -2 0 0 -1 -1 0 0 -1 -1 -1 -1 -2 -2 -2 -2 -1 -1 -1 -1 -1 -1 -2 -2 -2 -1 0 -1 -2 -2 -2 -2 -1 -1 -2 -1 -1 -1 -1 -1 -1 -1 -1 -1 -1 -1 -2 -1 -1 0 -1 -1 -1 -1 -1 -2 -2 0
$$ packed form
-31343aJ%j%J%jjJjJ%%%%%jJ%%JjJ%JjjJjJj%JjjKkJ%%%%jJjJ%%%J%kJ%%%%Jjj%%%J%jJjJ
-31390a%%%%%%j%Kj%%Jj%%%jJ%jJ%%%%jJ%J%jj%JjJ%Jj%Jj%%Jj%%jJ%j%KjjKj%%%%%%Jjj%
-31437bJJj%%%%%%%%%%%%%%jJJjjjJ%JJj%jJj%J%%%%jJjJj%%%J%%%kJ%JjJj%%J%JkJjJ%%J
-31484@j%j%J%%%%%%%jJj%%%%J%J%j%%jJ%%%%%%%jkLJk%J%J%j%%%JjjJ%%%%%%%%%%%j%Jj%
-31531bKj%%%%j%jJJ%%%%%%%jJ%%jKjJkJJkJJj%%J%%jKk%%%%%jJ%Jj%%J%k%JJj%JjJ%%jJj
-31578a%Jj%jJ%%%j%%J%%j%J%J%jj%JjJ%%%Jj%%%%%jJjJJjj%J%jJ%jK%jjKj%%%j%%%%JjJJ
-31625@j%%jJ%%%%%%%%%%%Jj%%j%%%%J%%Jj%%%%j%J%%%%Jj%%%%JjjJ%%j%Jj%J%%%jJ%%%%%
-31672a%%%J%j%%%%JjjK%j%J%j%%%j%%%J%%%%%j%%JJjj%%%J%jJ%%%%%%%%%%jJ%Jj%%%%j%K
$$ plain form
-31719 0 -1 -1 -2 -1 -1 -2 -1 -1 -1 0 0 0 -2 -1 0 -2 -1 -1 -1 -1 -1 -2 -1 -1 -1 -1 0 -1 -2 -2 -2 -1 -1 -1 -1 1 -2 -3 -2 -1 -2 -2 -2 -1 -1 -2 0 -1 0 -1 -1 -2 -3 -2 -2 -2 -1 -1 -1 -1 0 -1 -1 -1 -2 -1 -1 0 -1
-31766 -1 -1 -2 -1 -1 -2 -1 -2 -2 -1 -1 -1 -2 -1 0 -1 -1 0 -1 0 -2 -2 -2 -1 -1 -1 0 -1 -3 -2 -1 -1 -1 -1 -1 -2 -1 -2 -2 0 -1 -2 -2 -1 -1 -1 0 -1 -1 -2 -1 0 -2 -2 -1 -1 0 -1 0 -1 0 0 -1 -1 0 -1 -1 -2 -1 -1
-31813 -1 -2 -1 -1 -2 0 0 -1 -1 -1 -1 -1 -1 -1 -2 0 -1 -2 -2 -1 -1 -1 -1 -1 -3 -1 0 0 0 0 -1 -1 -2 -1 -1 -3 -2 -1 -1 0 -1 -2 -1 -1 -1 0 -2 -2 0 -2 -2 -1 -1 -2 -3 -2 -1 -1 0 -1 -2 -2 -1 -1 -1 0 -1 -1 -1 -1
-31860 -1 -1 -1 -1 -1 -1 -2 -2 -1 -1 0 -1 -1 -1 0 -1 0 -1 -1 -2 -2 -2 -2 0 0 -1 -1 -1 -1 -2 0 -2 -1 0 0 -1 0 -1 0 0 0 -1 -1 -1 0 -2 -2 -1 -2 -2 -1 -1 -1 -1 -1 -1 0 -1 -1 -2 -1 0 -1 -1 -1 -1 -1 0 -1 -1
-31907 -1 -2 -1 -2 -2 -2 -1 -2 -1 0 -2 -2 -1 0 -2 -1 0 0 0 1 -1 1 0 -1 -1 -1 -2 -2 -1 -1 -2 -1 -1 -2 -2 -1 -1 -1 -2 -1 -1 0 -1 1 0 -1 -2 -1 -1 -1 -1 -1 -1 -1 -1 -1 -1 0 0 -1 0 -2 -1 -1 -1 -1 -1 0 -1 -1
-31954 -1 -1 0 -1 0 -1 0 0 0 -1 -1 0 -1 -1 -1 -1 0 -1 0 -1 -2 -1 0 -1 -2 -2 -2 -2 -1 0 -2 -2 0 -2 -1 -1 -2 -1 0 -2 -1 -1 -1 -1 -2 -3 -1 -1 -1 -1 -2 0 -1 -1 -1 -1 -1 -1 -1 -1 -3 -1 0 -1 -1 -1 -1 -2 -1 -1
-32001 -1 -2 -2 0 -1 -2 -2 -2 -1 -1 -2 -1 -2 0 -1 -1 -2 -1 -1 -1 -1 -2 -1 -2 0 -1 -1 -1 -1 -1 -1 -1 0 0 0 -1 -2 -2 -2 -2 -2 -2 -2 -2 -2 -2 -1 0 -1 -2 -1 -1 -1 -2 -2 -1 -1 -1 -2 -1 0 -2 -3 -1 -2 -1 -1 -1 -1 -1
-32048 -1 -1 0 0 -1 -1 0 -1 -1 -2 -2 0 0 -2 0 -1 -1 -2 -3 -2 0 -1 0 -1 -1 0 -1 -3 -1 -1 -2 0 0 -1 -1 -1 -2 -1 -1 -1 -2 -2 -1 -1 -2 -1 -1 -1 -1 0 -1 -1 -1 -1 -1 -2 -1 -1 -1 -1 0 -1 -1 -1 -2 -1 0 0 -1 -1
$$ packed form
-31719@j%jJ%jJ%%J%%kJJkJ%%%%jJ%%%Jjj%%J%%%KljJJj%%J%jKjJj%jjJ%%J%%%Jj%%jJ%Jj
-31766a%jJ%jJj%J%%jJJj%JjJk%%J%%JjkJJ%%%%jJj%Kjj%J%%Jj%jJJk%J%JjJjJ%j%Jj%jJ%
-31813ajJ%jK%j%%%%%%jKjj%J%%%%kKJ%%%j%jJ%kJJ%JjjJ%%Jk%Kk%J%jjJJ%Jjj%J%%Jj%%%
-31860a%%%%%j%J%Jj%%JjJj%j%%%K%j%%%jKkJJ%jJjJ%%j%%Jk%Jj%J%%%%%Jj%jJJj%%%%Jj%
-31907ajJj%%JjJJk%JJkJJ%%JkKjj%%j%J%jJ%j%J%%jJ%JjKjjjJ%%%%%%%%%J%jJkJ%%%%Jj%
-31954a%JjJjJ%%j%Jj%%%JjJjjJJjj%%%JJk%KkJ%jJJkJ%%%jjK%%%jKj%%%%%%%kKJj%%%jJ%
-32001aj%Kjj%%J%jJjKj%jJ%%%jJjKj%%%%%%J%%jj%%%%%%%%%JJjjJ%%j%J%%jJJkjKjJ%%%%
-32048a%J%j%Jj%j%K%kKj%jjJKjJj%JjkK%jK%j%%jJ%%j%J%jJ%%%Jj%%%%jJ%%%Jj%%jJJ%j%
$$ plain form
-32095 -1 -1 -1 -1 -2 -1 -2 -1 -1 -2 -2 -2 -1 -1 -1 -1 -2 -1 -1 0 -2 0 -1 -1 -2 -1 0 -1 -2 0 -1 -2 -1 -1 -1 -2 -1 -1 -1 -1 -2 -2 0 -1 -1 -2 -2 -2 -1 -2 -2 -2 -1 -1 -1 -1 -2 -3 -1 -3 -1 -3 -2 -1 -1 -2 -1 0 0 -1
-32142 -1 -1 -1 -1 -1 -1 -1 -2 -2 -2 -1 -2 -2 -2 0 -1 -1 -1 -1 -1 -1 -1 0 -2 -2 -1 -1 -1 -1 -2 -2 -2 -1 -1 0 -1 -1 -1 -1 -1 -2 -2 -2 -1 -1 -1 -2 -2 -1 -2 -1 0 -1 -1 -1 0 -1 -1 -1 -1 -1 -2 -1 -1 -2 0 0 -1 -1 -1
-32189 -1 0 -1 -2 -2 -1 0 -1 -1 -2 -1 -1 0 -2 -2 -1 -2 -2 -1 -1 -2 -1 -2 1 -1 -2 -1 -1 -1 -2 -1 0 -1 -1 0 -2 -1 0 -1 -1 -1 -1 -2 -1 -1 -1 -1 -1 -1 -1 -1 -1 -1 -1 0 -2 -1 -2 -1 -1 -1 1 -1 -1 -2 -2 -1 -1 -1 -2
-32236 -2 -2 -2 -2 -2 -2 -1 -2 -2 -3 -2 -2 0 -1 -1 -1 -1 -2 -2 -2 -2 -1 -1 -1 0 -1 -1 -1 -1 -1 -1 -1 0 -1 0 -1 -1 -1 -1 -1 -1 -2 -1 -1 -2 0 -1 -1 0 -1 -2 -2 -1 -1 -2 -1 -2 -1 -1 0 -1 -1 -1 -1 -1 -1 -1 -1 -1 -1
-32283 -1 -1 -1 -1 -1 -2 -3 -2 -1 -1 -1 -2 -1 -2 -2 -2 -3 -1 -1 0 -1 -1 -1 -1 -1 -2 -2 -1 -2 -1 0 -1 0 -1 -1 -1 -2 -2 -2 -1 -1 -1 -1 -1 -2 -2 -1 -1 0 -1 -1 -1 -1 -2 -1 -2 -2 -1 -2 -2 -1 -1 -2 -3 -1 -1 -2 -1 0 0
-32330 0 -1 0 -1 -2 -1 0 -1 -1 -2 -1 -1 -1 -1 -1 -2 -1 0 0 -1 0 -1 -1 0 -1 -2 -3 -2 -1 -1 -1 -2 -1 0 -2 -1 -1 -1 -1 -1 -2 -2 -1 -2 -1 -1 -1 -1 0 -1 -1 -1 -1 -1 -2 -2 -2 -2 -2 -2 -2 -1 -2 -1 -2 -2 -2 -1 -1 -2
-32377 -2 -2 -1 0 -1 0 0 -1 -1 -1 -2 0 -1 -2 -2 -2 -1 -2 -1 -1 -2 -1 -1 -1 -1 -1 0 -1 0 -1 -1 -1 0 -1 -1 -1 0 0 -1 -2 -1 -1 -1 0 -1 -2 -1 -1 -1 -1 -1 -1 -1 -1 -1 0 -1 -2 -1 -1 -1 -1 -1 -1 -1 -1 0 -2 0 0
-32424 0 -1 -1 0 -1 -1 -2 -2 -1 -1 -1 -2 -1 -1 -1 -1 0 -2 -1 -1 -1 -1 -1 -1 -1 -1 -1 0 -1 0 -1 -1 -2 -2 -1 -2 -3 -2 -1 -2 -2 -1 -2 -1 -1 -1 -2 -2 -1 -2 -3 -2 -1 -1 -2 -1 -1 0 -1 0 -1 -1 0 -1 -1 -1 -1 -1 -1 -1
$$ packed form
-32095a%%%jJjJ%j%%J%%%jJ%JkKj%jJJjjKjjJ%%jJ%%%j%Kj%j%%Jj%%J%%%jjKkKkJJ%jJJ%j
-32142a%%%%%%j%%Jj%%Kj%%%%%%Jk%J%%%j%%J%Jj%%%%j%%J%%j%JjJJj%%Jj%%%%jJ%jK%j%%
-32189aJjj%JJj%jJ%Jk%Jj%J%jJjLkjJ%%jJJj%JkJJj%%%jJ%%%%%%%%%%JkJjJ%%Kk%j%J%%j
-32236b%%%%%Jj%jJ%Kj%%%j%%%J%%Jj%%%%%%JjJj%%%%%jJ%jKj%Jjj%J%jJjJ%Jj%%%%%%%%%
-32283a%%%%jjJJ%%jJj%%jK%Jj%%%%j%JjJJjJj%%j%%J%%%%j%J%Jj%%%jJj%Jj%J%jjK%jJJ%
-32330@jJjjJJj%jJ%%%%jJJ%jJj%JjjjJJ%%jJJkJ%%%%j%JjJ%%%Jj%%%%j%%%%%%JjJj%%J%j
-32377b%JJjJ%j%%jKjj%%JjJ%jJ%%%%JjJj%%Jj%%J%jjJ%%JjjJ%%%%%%%%JjjJ%%%%%%%JkK%
-32424@j%Jj%j%J%%jJ%%%JkJ%%%%%%%%JjJj%j%JjjJJj%JjJ%%j%JjjJJ%jJ%JjJj%Jj%%%%%%
$$ plain form
-32471 -1 -1 -1 -1 -1 -1 0 -1 -1 -1 1 -1 -1 -1 -1 -2 -1 -2 -1 -2 -2 -1 -2 0 -1 -2 -2 -2 -3 -2 -1 -1 -1 -1 -1 -1 -1 0 -1 -1 0 -2 0 -2 0 0 -1 -2 -1 -1 -2 -1 -1 -2 -2 0 0 -1 -2 -1 -1 -1 -2 -1 0 0 -1 -2 -1 -2
-32518 -2 -1 -1 -1 0 -1 -1 -2 -2 -1 -1 -1 0 0 -1 -1 -1 0 -1 -1 0 0 0 -1 -2 -1 0 0 0 0 -1 0 1 -1 -1 -1 -1 -1 -2 -1 -1 0 0 -1 0 -1 0 -1 -2 -1 -1 -1 -2 -1 -1 -1 -2 -2 -1 -2 -1 -1 -1 -2 -1 -1 0 -2 -2 -1
-32565 -1 -1 -1 -1 0 -1 -1 -1 -1 -1 0 -1 -1 -1 0 -2 -1 -1 -1 -2 0 -1 0 -1 -1 -2 0 0 -1 -1 0 -1 0 -1 -1 -1 -1 0 -1 -1 -2 -2 -1 -2 -1 -1 -1 -1 -1 -2 -2 -3 -1 -2 -1 -1 -2 0 -1 -1 0 -1 -2 -1 -2 -1 -1 0 -1 -1
-32612 -1 -1 0 -1 -1 -1 -1 -2 -2 -1 -2 -1 -2 -1 -1 -1 -2 -2 -2 -1 0 -1 -1 -1 0 -1 -1 -1 -1 0 -2 -2 -2 -1 -1 -1 0 -1 -2 0 -1 -2 0 -2 -1 -2 0 1 -1 -1 1 -1 -2 -2 -1 -1 0 -1 -2 -2 -1 -1 -1 -1 -2 -1 -1 -1 -1 -1
-32659 -1 -1 -1 -1 -1 -1 0 -2 -2 -2 -2 -1 -2 -2 -1 -2 -1 -1 -1 -1 -1 -1 -1 0 0 0 -1 -1 -1 -1 -1 -1 -1 -2 -1 -3 0 -1 -1 -1 -1 -1 0 -1 -2 -1 0 -1 -1 -1 -1 -1 -2 -2 0 -3 -2 -1 -1 -2 -1 -1 -1 -1 -1 0 -1 -2 -2 -2
-32706 -2 -1 -1 -1 0 -2 -1 -1 -1 -1 -1 1 0 -1 -1 0 -1 -1 -1 -1 -1 -1 -2 0 -1 -2 -1 -1 -1 -1 -2 -1 0 -2 0 -1 0 -1 -2 -1 -1 0 -1 -1 -1 -2 -1 -1 -3 -1 -2 -1 -1 0 -1 0 -1 -1 -1 -2 -1 -1 -2 -1 -1 0 -1 0 -1 -1
-32753 -1 -1 -1 -1 -1 -1 -1 -2 -1 -2 -1 -2 -2 -1 -1 -1 0 -1 -1 -1 0 0 0 -2 -1 -1 -1 -1 -2 -1 -1 -1 -1 -1 -1 -1 -1 -1 0 0 -1 -2 -2 -1 -2 -2 -2 0 -1 -3 0 -1 -2 -2 -2 -3 -2 -1 -3 -2 -1 -1 -1 -1 -1 -1 -1 0 0 0
-32800 0 0 -1 -1 -1 -1 -1 -2 -1 -1 -1 -1 -2 0 -1 -1 -2 -2 -1 -1 -2 -1 -1 -1 -1 0 -1 0 -1 -2 0 0 -1 0 -1 -3 -2 -2 -1 0 -1 -2 1 0 -1 0 -1 -1 0 -2 -2 -1 -1 -1 -1 -1 -2 -1 0 -1 -1 -2 -1 -1 -1 -2 -2 -1 0 0
$$ packed form
-32471a%%%%%Jj%%Kk%%%jJjJj%JjKjj%%jJJ%%%%%%Jj%JkKkK%jjJ%jJ%j%K%jjJ%%jJJ%jjJj
-32518bJ%%Jj%j%J%%J%j%%Jj%J%%jjJJ%%%jJJk%%%%jJ%J%jJjJjjJ%%jJ%%j%JjJ%%jJ%Jk%J
-32565a%%%Jj%%%%Jj%%JkJ%%jKjJj%jK%j%JjJj%%%Jj%j%JjJ%%%%j%jKjJ%jKj%JjjJjJ%Jj%
-32612a%Jj%%%j%JjJjJ%%j%%JJj%%Jj%%%Jk%%J%%JjjKjjKkJjKJk%Kkj%J%Jjj%J%%%jJ%%%%
-32659a%%%%%Jk%%%Jj%JjJ%%%%%%J%%j%%%%%%jJkLj%%%%JjjJJj%%%%j%KlJJ%jJ%%%%Jjj%%
-32706bJ%%JkJ%%%%Kjj%Jj%%%%%jKjjJ%%%jJJkKjJjjJ%Jj%%jJ%kKjJ%JjJj%%jJ%jJ%JjJj%
-32753a%%%%%%jJjJj%J%%Jj%%J%%kJ%%%jJ%%%%%%%%J%jj%Jj%%KjkLjj%%jJJkJJ%%%%%%J%%
-32800@%j%%%%jJ%%%jKj%j%J%jJ%%%JjJjjK%jJjkJ%JJjjLjjJj%Jk%J%%%%jJJj%jJ%%j%JJ%
$$ plain form
-32847 0 0 -1 -1 -1 -2 -2 -2 -1 0 -1 -2 -1 -1 -1 -1 -1 -1 -1 -1 -2 -1 -1 -1 -1 -1 -1 0 -1 -1 -2 -2 -1 0 -2 -1 -2 -2 -1 -2 0 0 -2 -1 0 -2 -3 -1 -1 0 -1 -1 -1 -1 0 -2 0 0 0 -1 -2 0 -1 0 -1 -2 -1 -2 -1 -1
-32894 -1 0 -1 -1 -2 -2 -1 -2 -2 -1 -1 -2 -2 -1 0 -1 -2 -1 -1 -1 -1 -1 -2 -1 0 -1 0 0 -1 -2 -1 -1 -2 0 -1 -1 -3 -1 -2 -2 0 -2 -2 0 -1 -1 -1 -2 -1 0 -1 -1 -2 -2 -1 0 -1 -2 0 -1 0 -1 -1 -1 0 0 -1 -1 -1 -1
-32941 -1 -2 -1 0 -1 0 -2 -2 -1 -1 -1 -1 0 -1 -1 -1 -1 -1 -2 -3 -1 -2 -2 -1 -1 -1 -2 -2 -2 -1 -1 -2 0 -1 -1 -1 -2 -2 -2 -2 -1 -2 -2 -1 -1 -1 -2 -2 -2 -1 -1 -1 -1 -1 -1 -1 -1 -1 -2 -2 -1 0 -1 -2 -2 -1 -1 -1 0 1
-32988 1 0 -2 -1 -1 -1 -1 0 -1 -1 -1 0 0 0 0 0 -1 -1 -1 0 -1 -2 -1 -1 -1 -1 -2 -1 -1 -1 -2 -2 -2 -2 -2 -1 -2 -2 -1 -1 -1 0 -1 -2 -1 -2 -1 -1 -1 -1 -1 -2 -2 -1 -1 -2 -1 0 -2 -2 0 -1 -1 -1 -2 -1 -2 -1 -1 -2
-33035 -2 -1 -1 0 -1 -1 -1 -1 -1 -1 -1 -1 0 -1 -1 -2 -2 -1 -1 -1 -2 -2 -1 -1 -1 -1 -1 -2 -2 -2 -1 -1 -1 -1 -1 -1 -1 -1 -1 -1 -3 -1 0 -1 -1 -1 -1 0 -1 -1 -1 -1 0 1 0 -1 -1 -1 -1 0 -1 -1 -2 0 -1 -2 -1 0 -1 -1
-33082 -1 -1 -1 -2 0 0 -1 -1 -1 -2 -1 0 -2 -2 -1 -1 -1 -2 -2 -1 -3 -2 -1 -1 -1 -3 -1 -1 -1 -1 -2 -1 -2 -2 -1 -2 -1 -1 0 -1 -1 -1 -2 -2 -1 -1 -1 -2 -2 -1 0 -2 -1 -1 -1 -2 -1 -2 -1 -2 -1 -1 -1 0 -2 -2 -1 -2 -1 0
-33129 0 -1 -2 -3 0 -1 -2 -2 -1 -1 -1 -1 -2 -1 -1 -2 -1 -1 0 -1 0 -1 -1 -2 -3 0 0 0 -1 -1 -1 -1 -2 -2 -1 -1 0 -1 -1 -1 -1 -1 -1 -1 -1 -1 -1 -2 0 -1 -2 0 -1 -1 -1 0 -1 0 0 -2 -1 -1 -2 -2 -2 -1 0 -2 -1 -1
-33176 -1 -1 0 -2 -2 -1 0 -1 -1 -1 0 -2 -1 -1 -1 -1 -1 -2 -1 -1 -2 -1 -1 -1 -1 -1 -2 -1 -1 -1 -1 0 -2 -1 -1 -1 -1 -1 -2 -1 0 -2 -1 -2 -2 -1 -1 -2 -2 -1 0 -2 -1 -1 -1 -2 -3 -1 -2 -1 -1 -1 0 0 0 -1 -1 -1 -2 -2
$$ packed form
-32847@%j%%j%%JJjjJ%%%%%%%jJ%%%%%Jj%j%JJkJj%JjK%kJJkjK%Jj%%%JkK%%jjKjJjjJjJ%
-32894aJj%j%Jj%J%j%JJjjJ%%%%jJJjJ%jjJ%jKj%kKj%Kk%Kj%%jJJj%j%JJjjKjJj%%J%j%%%
-32941ajJJjJk%J%%%Jj%%%%jjKj%J%%j%%J%jKj%%j%%%Jj%J%%j%%J%%%%%%%%j%JJjj%J%%JJ
-32988AjkJ%%%Jj%%J%%%%j%%JjjJ%%%jJ%%j%%%%Jj%J%%JjjJjJ%%%%j%J%jJJk%Kj%%jJjJ%j
-33035bJ%Jj%%%%%%%Jj%j%J%%j%J%%%%j%%J%%%%%%%%%kKJj%%%Jj%%%JJjj%%%Jj%jKjjJJj%
-33082a%%jK%j%%jJJk%J%%j%JkJJ%%kK%%%jJj%JjJ%Jj%%j%J%%j%JJkJ%%jJjJjJ%%Jk%JjJJ
-33129@jjjLjj%J%%%jJ%jJ%JjJj%jjL%%j%%%j%J%Jj%%%%%%%%%jKjjKj%%JjJ%kJ%j%%JJkJ%
-33176a%Jk%JJj%%JkJ%%%%jJ%jJ%%%%jJ%%%JkJ%%%%jJJkJj%J%j%JJkJ%%jjKjJ%%J%%j%%j%
$$ plain form
-33223 -2 -1 -1 0 0 0 0 0 -1 0 -1 0 0 -2 -2 0 -1 -2 -1 0 -1 0 -1 -1 -1 -1 -2 -2 -2 -1 -1 -1 -1 -2 1 -1 -1 -1 -1 0 -1 0 0 -1 -1 -1 -1 -1 -2 -1 -1 -1 -2 -2 -2 -2 -2 -1 -1 -1 0 -1 -1 -2 -1 0 -1 -2 -2 -1
-33270 -1 -2 -1 -1 -1 -1 -1 -2 -2 -1 -1 -1 -1 0 -1 -1 -1 -2 -1 -1 -1 -1 -1 -2 -3 -1 -2 -2 -2 -1 -1 -2 0 -1 -1 -1 -2 0 -1 -1 0 -2 -3 -2 -2 -1 -1 -1 0 0 0 -1 -1 -1 -1 -1 0 -1 -1 0 0 -1 -1 -1 -1 -1 0 -2 -2 -1
-33317 -1 -1 -1 -2 -2 -2 -1 -1 -2 -1 -1 -1 -1 -1 0 -1 -2 -1 -1 -1 -1 -1 -2 -1 -1 -1 -1 -1 -1 -1 -1 -1 -1 -1 -2 -1 -2 -1 -1 -1 -1 -1 -2 -2 0 -1 -1 -2 -2 -2 -1 -2 -2 -2 -2 -2 -2 -1 -1 -2 -3 -1 -1 -1 -3 0 -1 -1 -2 0
-33364 0 -1 -1 -2 -1 -1 -1 -1 -1 -2 -1 -1 0 0 0 0 -2 -2 -1 -1 -1 -1 -1 -1 0 -1 -1 -1 -1 -2 -1 -1 -2 -1 0 0 -1 -2 -2 -1 -1 -1 -1 -2 -2 -1 -1 -2 -1 -2 -1 -1 -2 -1 0 0 -1 0 0 -1 -1 -1 -1 -1 -1 -2 -1 0 -1 -1
-33411 -1 -1 -1 -2 -1 -1 0 -1 -3 -1 -1 -2 -2 -1 -1 -1 -1 -1 -1 -1 0 -1 -1 -1 -2 -1 -1 -1 -3 -1 -1 -1 -2 -2 0 -1 -1 -1 -1 -1 0 -1 -2 -2 -1 -1 -2 -1 -1 -2 -1 -1 -1 -1 -1 0 0 -2 -2 -2 -2 -2 -2 0 -1 -1 -2 -1 0 -2
-33458 -2 -1 -1 -1 -2 0 0 -2 -1 0 -1 0 -1 -2 -1 -1 -1 -1 0 0 -2 -2 -1 -2 -2 -1 -1 -1 -2 -2 -1 -2 0 -1 -1 -1 -2 -2 -2 -1 -1 -1 -1 -1 -1 0 1 -2 -2 -2 -2 -2 -1 -2 -2 0 -2 -3 -2 0 -2 -1 0 -1 -1 -2 -2 -1 -1 0
-33505 0 -1 -2 -2 -2 -2 -1 -1 -1 -2 -2 0 -1 -1 -1 -1 -1 -1 -1 -1 -1 0 -1 -1 -1 0 0 0 -2 -2 -2 -2 0 -1 -2 -1 0 -1 -1 0 0 -1 -1 -2 -1 -1 -1 -3 -3 -2 -1 -1 0 0 -1 -2 -2 -1 -2 -2 -1 -1 -2 -2 -2 -1 -1 -2 -2 -2
-33552 -2 -2 -2 -1 -1 -2 -2 -2 -3 -1 -1 -3 -2 -2 0 -1 -1 -1 0 -1 -1 -1 -2 -1 -1 -2 -2 -1 -2 -1 -1 -1 -2 -1 0 -1 -1 -1 -2 0 -2 -1 -1 -1 -1 -2 -2 -1 -1 -2 0 -1 -2 -1 -1 -1 -1 -1 -2 -1 -1 -2 -1 -2 -1 -1 -2 -3 -1 -1
$$ packed form
-33223bJ%J%%%%jJjJ%k%KjjJJjJj%%%j%%J%%%jLk%%%JjJ%j%%%%jJ%%j%%%%J%%Jj%jJJjj%J
-33270ajJ%%%%j%J%%%Jj%%jJ%%%%jjKj%%J%jKj%%jKj%JkjJ%J%%J%%j%%%%Jj%J%j%%%%Jk%J
-33317a%%j%%J%jJ%%%%JjjJ%%%%jJ%%%%%%%%%%jJjJ%%%%j%Kj%j%%Jj%%%%%J%jjK%%kLj%jK
-33364@j%jJ%%%%jJ%J%%%k%J%%%%%Jj%%%jJ%jJJ%jj%J%%%j%J%jJjJ%jJJ%jJ%j%%%%%jJJj%
-33411a%%jJ%JjkK%j%J%%%%%%Jj%%jJ%%kK%%j%Kj%%%%Jjj%J%jJ%jJ%%%%J%k%%%%%Kj%jJJk
-33458bJ%%jK%kJJjJjjJ%%%J%k%Jj%J%%j%JjKj%%j%%J%%%%%JJl%%%%Jj%KkjJKkJJj%j%J%J
-33505@jj%%%J%%j%Kj%%%%%%%%Jj%%J%%k%%%KjjJJj%J%j%jJ%%k%JJ%J%jj%Jj%J%j%%J%j%%
-33552b%%J%j%%jK%kJ%Kj%%Jj%%jJ%j%JjJ%%jJJj%%jKkJ%%%j%J%jKjjJ%%%%jJ%jJjJ%jjK%
$$ plain form
-33599 -1 -1 0 -1 -2 -3 -1 -1 -2 -2 0 -1 -2 -2 -1 -1 -1 0 -2 -3 -2 -2 0 0 -1 -1 -1 -1 -1 -1 -1 -1 -1 -1 -1 -1 -1 -2 -2 -2 0 0 -1 -1 0 -1 -1 -1 -1 -2 -1 -1 -1 -1 -1 -1 -1 -1 -1 -1 -1 -1 -1 -1 -1 -2 -3 -1 -1 -1
-33646 -1 -1 0 0 -2 -2 -1 -2 -1 -1 -1 -1 0 -1 -1 0 -1 -1 -2 -2 -1 -1 -1 -1 0 -1 -1 -1 -1 -1 -1 0 -2 -2 -2 -1 0 -1 -1 -2 -2 -1 -2 -2 -2 -1 -1 -1 -1 -1 0 0 -1 0 -2 -2 -1 -2 -2 -2 -2 -1 -1 0 0 0 1 0 -2 -2
-33693 -2 -2 0 0 -1 -1 -2 -1 -2 -2 -2 -1 -2 -2 -2 -3 -1 -2 -2 -1 -1 -1 0 -1 1 0 -1 0 -1 -2 -2 -1 -1 0 0 -1 -1 -2 -2 -2 -1 -2 -2 -1 -1 -1 -1 -1 0 -2 -1 -1 -1 0 0 0 -1 -1 0 -1 -1 -1 0 0 -2 -1 -1 -2 -1 -1
-33740 -1 -1 -1 -1 -1 -1 -1 -1 -2 -2 -1 -1 -2 0 -1 -2 -2 -1 -1 -1 -2 -1 -2 -2 -1 -1 -1 -1 -2 -2 -1 -1 -1 -1 0 0 -2 -1 -1 -1 0 -1 -1 -2 -2 -1 -1 -2 0 -1 -1 -1 -1 -1 -1 -1 -1 -1 -1 -2 -3 -1 -1 -2 -1 -1 -1 -2 -2 -1
-33787 -1 -2 -1 0 -2 -2 -2 -1 -3 -3 -1 -1 -1 -1 -1 -1 0 -1 -2 -1 -1 -2 -1 -1 -1 -1 -1 -1 -1 -1 -1 -1 -1 -2 -2 -2 -1 -1 -1 -1 -2 -2 -1 -1 -1 -1 -1 -1 -1 -1 -1 0 -2 -1 -1 -1 -1 -1 -1 -1 0 -2 -2 -2 -2 -2 -1 -1 -1 -1
-33834 -1 -2 -2 -2 -2 -1 -1 -2 -2 -1 -1 -2 -3 -2 0 -1 -1 -2 -1 -1 -2 -1 -2 -2 -2 -2 -1 -2 -1 0 -1 0 -1 -1 -1 -1 -1 -1 -1 -1 -1 -1 -2 -1 -1 -1 -2 0 0 -1 -1 -1 -1 -1 0 0 0 0 0 0 -2 -1 0 -1 -2 -1 -1 -1 -1 -1
-33881 -1 -1 -2 -2 -1 -1 0 -1 -1 0 -1 -1 -2 -2 0 -1 -1 -2 0 -2 -2 -2 0 0 -2 -2 -2 -2 1 -1 -2 -1 -1 -1 0 -1 0 -1 -1 -1 -1 -2 -2 -2 -1 -1 -1 -1 -1 0 -2 -1 0 -1 -2 -1 -1 -1 -1 -1 -2 -1 -1 -1 -1 -1 -1 -2 -1 -1
-33928 -1 -1 -1 -1 -1 -2 -1 -1 0 0 0 0 -2 -2 -2 -1 -2 -1 -2 -2 -1 0 -1 0 -1 -1 -1 -2 -1 -1 -1 -1 -1 -1 -1 -1 -2 -1 0 -2 -1 -1 0 -1 -1 -1 -2 -1 0 -1 -2 -1 -1 -1 -2 -1 0 0 0 -2 -1 0 -2 -2 -2 -1 0 -1 -2 -1
$$ packed form
-33599a%JjjjK%j%Kjj%J%%JkjJ%K%j%%%%%%%%%%%%j%%K%j%Jj%%%jJ%%%%%%%%%%%%%%jjK%%
-33646a%J%k%JjJ%%%Jj%Jj%j%J%%%Jj%%%%%Jk%%JJj%j%Jj%%J%%%%J%jJk%Jj%%%J%J%%Jjk%
-33693b%K%j%jJj%%Jj%%jKj%J%%JjKjjJjj%J%J%j%j%%Jj%J%%%%JkJ%%J%%j%Jj%%J%kJ%jJ%
-33740a%%%%%%%j%J%jKjj%J%%jJj%J%%%j%J%%%J%kJ%%Jj%j%J%jKj%%%%%%%%%jjK%jJ%%j%J
-33787ajJJk%%Jk%K%%%%%JjjJ%jJ%%%%%%%%%%j%%J%%%j%J%%%%%%%%JkJ%%%%%%Jk%%%%J%%%
-33834aj%%%J%j%J%jjJKj%jJ%jJj%%%JjJJjJj%%%%%%%%%jJ%%jK%j%%%%J%%%%%kJJjjJ%%%%
-33881a%j%J%Jj%Jj%j%Kj%jKk%%K%k%%%LkjJ%%JjJj%%%j%%J%%%%JkJJjjJ%%%%jJ%%%%%jJ%
-33928a%%%%jJ%J%%%k%%JjJj%JJjJj%%jJ%%%%%%%jJJkJ%Jj%%jJJjjJ%%jJJ%%kJJk%%JJjjJ
$$ plain form
-33975 -1 -1 -1 -2 -1 -2 -1 -2 -1 -2 -2 -2 -1 -2 -2 -1 -1 0 -3 -1 -2 -2 -2 -1 -1 -2 -1 -1 -1 0 -2 -1 -1 -1 -1 -2 -1 0 -1 -2 -1 -2 -2 -2 -1 -1 -1 -1 -1 -1 -2 -2 -1 -2 0 0 -1 -2 -1 -1 -2 -1 -1 -1 -1 -1 -1 -2 -1 0
-34022 0 0 0 -1 -1 0 -1 -2 -2 -1 -3 -1 -1 -2 -2 -1 -1 0 -1 0 -1 -2 -2 -1 -1 -1 -1 -2 -1 -1 -2 -2 -1 -1 -1 -1 -2 -1 -1 -2 -1 -1 -1 -1 -1 -3 0 -2 -2 -2 -1 -1 -2 -1 0 -1 -1 -1 -1 -1 0 0 -1 -1 -1 -2 -2 -2 0 -1
-34069 -1 -3 -1 -1 -1 -2 -1 0 -1 -1 -1 -1 -1 -1 -1 -2 -1 -1 0 -1 -1 0 -1 -1 -1 -2 -1 0 -1 -2 -1 -1 -1 -2 -2 0 0 -1 0 -1 -3 -1 -2 -1 -1 -1 -1 -1 -2 -2 -2 -2 -1 0 -1 -1 -2 -2 -1 -1 0 0 -1 0 -1 -1 -2 -2 -2 -1
-34116 -1 0 -1 -1 0 -1 -2 -2 -1 -2 -1 -1 -2 -2 -2 -1 -2 -2 -1 -1 -1 -2 -2 -2 -2 0 -1 -1 -1 0 -1 -1 -1 -1 -1 -1 -2 0 -1 -1 -1 0 -1 -1 -1 -1 -1 -1 -1 -2 -1 -1 -1 -1 -1 -2 -1 -2 -1 0 -1 -1 0 -1 -1 0 -1 -1 -1 -2
-34163 -2 -2 -2 -1 -1 -1 -1 -1 0 0 -1 -2 -2 -2 -2 -1 -2 -1 -2 -2 -2 -1 0 -1 -1 0 -1 -2 -2 -2 -2 -1 0 -1 -2 -1 -1 -2 -1 -1 -1 -2 0 -1 -1 0 -1 -1 -2 -2 0 -1 -1 -1 -1 -2 -1 0 -1 -1 -1 -1 -1 -2 -1 -2 -1 -1 -2 -1
-34210 -1 -1 -1 -1 -2 -2 -2 -2 -1 -1 -1 -1 -2 0 -2 -1 0 -1 -2 -1 -1 -1 -1 -1 -1 -1 -1 -1 -1 -1 -1 -1 -1 -2 -2 0 -2 -1 -1 -1 0 -1 -2 -1 0 -1 -2 -2 -2 -1 0 0 -2 -2 -1 0 -1 -1 -1 -1 -1 -2 -1 -1 -2 0 -2 -1 -1 -1
-34257 -1 -1 0 0 -1 -1 -1 -2 -2 -1 -1 -1 -1 -2 -1 -1 -1 -1 -1 -1 -1 -1 0 -1 -2 -1 -1 0 -1 -2 -1 0 -2 -1 -1 0 0 -1 -1 -1 0 -1 -2 0 -1 -1 -1 -1 -1 -1 -1 0 0 -1 -1 -2 -1 -1 -1 -1 0 -1 -2 -1 -1 -1 -1 -1 -1 -2
-34304 -2 -2 -1 -1 -1 -2 -2 0 -1 -1 -1 -2 0 -1 -2 -1 -1 -2 -2 -2 -1 -1 -1 -1 -1 0 -1 -2 -2 -1 -2 -1 -1 -1 -1 -1 -1 -2 -2 -1 -1 0 -2 -1 -1 -2 -1 -2 0 0 0 -1 -1 0 -1 0 0 -1 -1 0 -1 -1 -1 -1 -2 -2 -2 -1 -1 -1
$$ packed form
-33975a%%jJjJjJj%%Jj%J%JlKj%%J%jJ%%JkJ%%%jJJjjJj%%J%%%%%j%JjK%jjJ%jJ%%%%%jJJ
-34022@%%j%Jjj%JkK%j%J%JjJjj%J%%%jJ%j%J%%%jJ%jJ%%%%kLk%%J%jJJj%%%%J%j%%j%%Kj
-34069akK%%jJJj%%%%%%jJ%Jj%Jj%%jJJjjJ%%j%K%jJjkKjJ%%%%j%%%JJj%j%J%J%jJj%j%%J
-34116aJj%Jjj%JjJ%j%%Jj%J%%j%%%Kj%%Jj%%%%%jKj%%Jj%%%%%%jJ%%%%jJjJJj%Jj%Jj%%j
-34163b%%J%%%%J%jj%%%JjJj%%JJj%Jjj%%%JJjjJ%jJ%%jKj%Jj%j%Kj%%%jJJj%%%%jJjJ%jJ
-34210a%%%j%%%J%%%jKkJJjjJ%%%%%%%%%%%%%j%KkJ%%JjjJJjj%%JJ%k%JJj%%%%jJ%jKkJ%%
-34257a%J%j%%j%J%%%jJ%%%%%%%JjjJ%JjjJJkJ%J%j%%JjjKj%%%%%%J%j%jJ%%%JjjJ%%%%%j
-34304b%J%%j%Kj%%jKjjJ%j%%J%%%%Jjj%JjJ%%%%%j%J%JkJ%jJjK%%j%JjJ%j%Jj%%%j%%J%%
$$ plain form
-34351 -1 -1 -1 -1 -1 -1 -1 0 -1 -1 -1 -1 -1 -1 -2 -1 -1 -2 -1 -3 -2 -1 -1 -1 -1 -1 -1 -1 -1 -1 -1 0 -1 -1 -2 -2 -1 0 -1 -2 -1 0 -1 -2 -2 -2 -3 -1 -1 -2 -2 -1 -2 -1 -1 -1 -2 -2 -1 -1 -1 -1 -2 -2 0 -2 -1 -1 -1 -1
-34398 -1 -2 -1 -1 -1 0 0 -1 -1 -2 -1 0 -1 0 1 -1 -1 -2 -2 0 0 0 0 -1 -1 -1 -1 -1 0 -1 -1 -2 -2 0 -1 0 -1 -2 -1 -1 -2 -2 -1 -1 0 0 0 -1 -2 -1 0 -1 -2 -2 -1 -1 -1 -1 -1 -1 0 -1 0 0 -1 -2 -1 -1 -2 -1
-34445 -1 0 -1 -1 -1 -1 -1 -1 -1 -1 -2 0 -1 0 -1 -2 -2 -1 -1 -1 -1 0 0 -1 -1 -1 0 0 -2 -1 -1 -1 -1 0 -2 -2 -2 -1 -1 -1 -1 -1 -1 0 0 1 0 0 0 -1 -1 -1 -1 0 0 -1 -1 -1 -1 0 -2 -1 -2 -1 -1 -1 -1 -1 -1 -1
-34492 -1 0 -1 -1 -1 -1 -1 -2 -2 -2 -2 -2 -1 -1 -1 -3 -2 -1 -1 -1 -1 -1 -1 -2 -1 -1 0 0 0 -2 -1 -1 0 -1 -1 -2 0 -1 -1 -1 -2 -1 -1 0 -1 -1 -1 -1 0 -1 -1 -2 -1 -1 -1 -1 -1 -1 -1 -2 -2 -2 -1 -1 -1 -1 -2 -1 0 -2
-34539 -2 -1 -1 -1 -1 -2 -2 -2 -1 -1 -2 -2 -1 -2 -1 0 -2 -1 -1 -1 0 0 -1 -2 -2 -2 -1 -1 0 0 -1 -1 0 -2 -2 -2 -1 -1 -2 -1 -2 -1 -1 -1 0 -1 -1 -1 -1 -1 -2 -1 -2 -1 -1 -1 0 -1 -1 -1 -1 -1 0 -1 -1 -1 0 0 0 0
-34586 0 -1 -2 -1 -1 -1 -1 -1 -1 0 -1 0 0 0 -1 -1 -1 -1 -1 -1 -1 -1 -2 -2 -2 -2 -1 -1 -1 0 -1 -2 -2 -2 -1 -2 -1 -1 0 0 -1 -1 -1 -1 -2 -2 -2 0 -1 -2 -1 -1 -1 -1 -2 -2 -2 -3 -3 -2 0 -1 -2 -2 -2 -1 -2 -1 -1 -1
-34633 -1 -2 -2 -1 -1 -1 -1 -1 -1 -2 -2 -1 -1 -1 -1 -2 -2 -3 -1 -1 -1 0 -1 -2 -2 -1 -1 -2 -1 -1 -1 -1 -1 -1 0 -1 -2 -1 -1 -1 -1 -1 -1 -2 -2 -2 -2 -2 -1 -1 -2 -1 -2 -2 0 -2 -1 -1 -1 -1 -1 0 0 -1 0 0 -1 0 -1 -2
-34680 -2 -3 -2 -1 -1 -1 -1 -1 -2 -2 -2 -3 0 -1 -1 0 -1 -1 0 0 -2 -1 -1 -1 -1 -1 -1 0 -1 -2 -1 -1 -1 -2 -1 -1 -1 -1 -1 -2 -2 -2 -2 -2 -1 -1 -1 -2 -3 0 -1 -1 -1 -1 0 -1 0 0 -1 -1 -1 -1 -1 -1 -1 -1 -1 -1 -1 -1
$$ packed form
-34351a%%%%%%Jj%%%%%jJ%jJkJJ%%%%%%%%%Jj%j%JJjjJJjj%%jK%j%JjJ%%j%J%%%j%KkJ%%%
-34398ajJ%%J%j%jJJjJJk%j%K%%%j%%%%Jj%j%KjJjjJ%j%J%J%%jjJJjj%J%%%%%JjJ%jjJ%jJ
-34445aJj%%%%%%%jKjJjj%J%%%J%j%%J%kJ%%%Jk%%J%%%%%J%Jj%%j%%%J%j%%%JkJjJ%%%%%%
-34492aJj%%%%j%%%%J%%kJJ%%%%%jJ%J%%kJ%Jj%jKj%%jJ%Jj%%%Jj%jJ%%%%%%j%%J%%%jJJk
-34539bJ%%%j%%J%j%JjJJkJ%%J%jj%%J%J%j%Jk%%J%jJjJ%%Jj%%%%jJjJ%%Jj%%%%Jj%%J%%%
-34586@jjJ%%%%%JjJ%%j%%%%%%%j%%%J%%Jjj%%JjJ%J%j%%%j%%KjjJ%%%j%%j%JKjj%%JjJ%%
-34633aj%J%%%%%j%J%%%j%jK%%Jjj%J%jJ%%%%%JjjJ%%%%%j%%%%J%jJj%KkJ%%%%J%jJ%jJjj
-34680bjJJ%%%%j%%jLj%Jj%J%kJ%%%%%JjjJ%%jJ%%%%j%%%%J%%jjLj%%%JjJ%j%%%%%%%%%%%
$$ plain form
-34727 -1 -1 -1 -1 -1 -1 -1 -1 -1 -2 0 -3 0 -1 -1 -1 -2 -2 -1 -1 -2 0 -3 -2 -2 -1 -1 -1 -1 -1 -1 -1 0 -1 -1 -1 -1 -1 -1 -1 -1 -2 0 -1 -1 -1 -2 -2 -1 -1 -1 -1 -1 0 -2 -1 0 -1 -1 -2 -2 -1 0 -2 -1 0 -1 -1 -1 -1
-34774 -1 -2 0 -2 -1 -2 -1 -1 -1 -1 0 -1 -1 0 -1 -1 0 -1 -1 -1 -1 -1 -2 -2 -2 -1 0 1 0 -1 -1 0 0 0 -1 -1 -1 -2 -1 -1 -1 0 -1 -1 -1 -2 -2 0 -1 -1 -2 -1 -1 -1 -2 0 -2 -2 -2 -1 -1 0 -1 -1 -2 -1 -1 -2 0 -1
-34821 -1 -1 -1 -1 -2 -2 -1 -1 0 0 -1 -1 -1 -1 -1 -2 -2 -1 -1 -1 -1 -1 -1 -1 -2 -2 -1 -1 -2 -2 -1 -1 -1 -1 -1 -2 -1 0 -1 -2 -1 0 -2 -2 -3 -2 -1 -1 0 -1 -1 -2 -2 -1 0 -2 -1 -1 0 -1 -1 0 -1 -1 -1 -2 -2 -1 -2 -1
-34868 -1 -2 0 -1 -1 -1 -1 -1 -2 -2 -1 -1 -1 -1 -1 -1 -2 -1 -1 -1 0 -1 -1 -1 -1 -2 -1 -1 -1 -2 -1 -2 -1 -1 0 -1 -1 -1 -1 0 0 0 -2 0 -1 -1 -1 -2 -1 -1 -2 -1 -1 -1 -1 -1 -2 -1 0 -1 -2 -2 -2 -2 -1 -1 0 -1 -1 0
-34915 0 0 -1 -1 -2 -2 -1 -1 -1 -1 -1 -1 -2 -2 -2 -1 -1 -1 -2 -2 -2 -2 -1 -1 -1 -2 -2 -2 -1 0 -1 0 -2 -2 -1 -1 -1 -2 -2 -1 -1 -1 -2 -2 -1 0 0 0 -2 -1 0 -1 0 -2 -1 -1 -1 -1 -1 0 0 -2 -1 -1 -1 -1 -1 -1 -1 -1
-34962 -1 -1 -1 -1 0 -1 -1 1 0 0 -1 -1 -1 -1 -1 0 0 0 -1 -1 -2 -2 0 -2 -1 -2 0 -1 -2 -2 -1 -1 -1 -2 -2 -2 0 0 0 0 0 -2 -2 -2 -1 -1 -2 -1 -1 -2 -2 -1 -1 -1 -1 -1 -1 -2 -2 -2 -1 -1 0 -1 -1 -1 -2 -2 -2 -1
-35009 -1 -2 -2 -1 -1 -2 -2 -2 -1 0 -1 -2 -1 -1 -1 -1 -1 -2 -2 -1 -2 -3 -1 -1 -1 -1 -1 -2 -1 -2 -2 -2 -2 -3 -3 -3 -1 -1 -1 0 -1 -1 -1 -2 -3 -2 -1 -2 -1 0 -1 -1 -1 -1 -1 0 0 -1 -1 -2 -2 -1 0 -2 -2 -2 -1 0 -1 -2
-35056 -2 -1 -3 -2 -1 -1 -1 -1 -2 -1 -1 -3 -1 -2 -1 -2 -1 -2 -1 -3 -2 0 0 -1 0 0 0 0 -2 -1 -1 -1 -1 -1 -2 -1 -1 -1 -1 -1 -1 -1 -2 -2 -1 -1 -1 -1 -1 0 -3 -3 -2 -1 -1 -1 -2 -1 -3 -2 -2 -2 -1 -2 -2 -1 -1 0 -2 -2
$$ packed form
-34727a%%%%%%%%jKlLj%%j%J%jKlJ%J%%%%%%Jj%%%%%%%jKj%%j%J%%%%JkJJj%j%JJkJJj%%%
-34774ajKkJjJ%%%Jj%Jj%Jj%%%%j%%JJJjj%J%%j%%jJ%%Jj%%j%Kj%jJ%%jKk%%J%Jj%jJ%jKj
-34821a%%%j%J%J%j%%%%j%J%%%%%%j%J%j%J%%%%jJJjjJJk%jJJ%Jj%j%JJkJ%Jj%Jj%%j%JjJ
-34868ajKj%%%%j%J%%%%%jJ%%Jj%%%jJ%%jJjJ%Jj%%%J%%kKj%%jJ%jJ%%%%jJJjj%%%J%Jj%J
-34915@%j%j%J%%%%%j%%J%%j%%%J%%j%%JJjJk%J%%j%J%%j%JJ%%kJJjJkJ%%%%J%kJ%%%%%%%
-34962a%%%Jj%Kj%j%%%%J%%j%j%KkJjKjj%J%%j%%K%%%%k%%J%jJ%j%J%%%%%j%%J%Jj%%j%%J
-35009aj%J%j%%JJjjJ%%%%j%JjjK%%%%jJj%%%j%%K%%Jj%%jjJJjJJj%%%%J%j%j%JJk%%JJjj
-35056bJkJJ%%%jJ%kKjJjJjJkJK%jJ%%%kJ%%%%jJ%%%%%%j%J%%%%Jl%JJ%%jJkJ%%Jj%J%Jk%
$$ plain form
-35103 -2 -2 -1 -1 -1 -1 -2 -2 -1 -1 0 0 -2 -1 -1 -2 -2 -1 -1 0 -1 -2 -2 -2 -2 0 0 -1 -2 -3 0 -1 -1 -1 0 -1 -1 -1 -1 -2 -2 -1 -1 -1 -1 -1 -1 -1 -1 -2 -1 0 -1 -1 -2 0 -1 -1 -2 -2 -2 -2 -2 0 0 0 0 -1 -1 -1
-35150 -1 -1 -2 -1 -1 -1 -1 0 0 -1 -2 -1 -1 -1 0 -1 -1 -1 -1 -1 -2 -2 -2 -1 0 -1 -1 -1 -1 0 -1 -1 -1 -1 -1 -1 -1 -1 0 -1 -1 -1 -1 -1 -1 0 0 -1 -1 -1 -1 -1 -2 -1 -2 -1 -2 -1 -1 1 -1 -1 -2 -1 -2 -1 -1 0 0 -1
-35197 -1 -1 -1 -2 -1 1 -1 -2 -1 -1 -1 -1 0 0 0 0 -1 -1 -1 -1 -1 -1 -1 -2 -1 -2 -1 -1 -1 -1 0 -1 -2 -1 -1 -1 -1 -1 -2 -1 -1 -1 0 -1 -1 0 -1 -2 -2 -1 -1 -1 -2 0 -1 -2 -2 -1 -1 -1 0 -1 -2 -1 -1 -1 -1 -1 -1 -1
-35244 -1 -1 -1 -1 -1 0 0 0 -2 -1 -2 -1 -2 -2 0 -1 -2 -1 -1 -1 -2 -2 -2 -1 -1 -1 0 -1 0 -2 -2 -1 -1 -1 -1 0 -1 -1 -2 -1 0 -1 -1 -1 -1 -1 -2 -1 -1 -1 -2 -2 -1 0 -3 -1 0 -1 -1 -2 -1 -1 -1 -1 -1 -2 -1 -1 -1 0
-35291 0 -1 -1 -1 -1 -1 -1 -1 -1 -2 -2 0 -1 -2 -2 -1 -1 -2 -1 -1 -3 -2 -1 -1 -2 -2 -1 -1 -1 -1 -1 -1 -1 -1 -1 0 -1 -1 -2 -2 -1 -2 -1 -3 -1 0 0 0 0 -2 -2 -1 -1 -1 -1 0 -1 -2 -2 -1 -1 -1 -1 -1 -1 0 0 -1 -1 -1
-35338 -1 -1 -2 -1 -1 -1 -2 -1 -1 -2 -1 -2 -1 -2 -2 0 -2 -2 -1 -1 -1 -2 -2 -2 -2 -2 -1 -1 -2 -1 0 -1 -1 -1 -2 -1 -1 -1 -1 0 0 -2 -1 -2 -2 -1 0 0 0 -1 -1 -2 0 -2 -1 -1 -2 -1 -1 0 -1 -2 -2 -2 -1 -1 -1 -1 -1 -1
-35385 -1 -2 -2 -2 -1 -1 -2 -2 -1 -1 -1 -1 -1 -2 -1 -1 -1 -2 -1 -1 -1 -2 -1 -2 -1 -2 -1 -2 -2 -2 -3 -1 -1 -2 -2 -1 -2 0 0 -2 0 0 -1 0 -2 -2 -2 -2 -1 -1 0 -1 -1 -1 0 -1 -1 -1 -2 -1 -1 -1 -1 -2 0 -1 -1 0 -2 -1
-35432 -1 -2 -1 -1 -1 -2 -1 -1 -1 -1 -1 -1 -1 -1 -1 -1 -1 -1 0 -1 -2 -2 -2 -1 0 -1 0 -1 -2 -1 -2 -1 -1 -1 -2 -1 -1 -1 -1 -1 -2 -2 -1 -1 -1 0 -1 0 0 -1 -1 -1 -1 0 -2 0 -1 -1 1 0 0 -1 -1 -3 -1 -1 0 0 -1 -2
$$ packed form
-35103b%J%%%j%J%J%kJ%j%J%Jjj%%%K%jjjLj%%Jj%%%j%J%%%%%%%jJJj%jKj%j%%%%K%%%j%%
-35150a%jJ%%%J%jjJ%%Jj%%%%j%%JJj%%%Jj%%%%%%%Jj%%%%%J%j%%%%jJjJjJ%Kk%jJjJ%J%j
-35197a%%jJKkjJ%%%J%%%j%%%%%%jJjJ%%%JjjJ%%%%jJ%%Jj%Jjj%J%%jKjj%J%%JjjJ%%%%%%
-35244a%%%%J%%kJjJj%KjjJ%%j%%J%%JjJk%J%%%Jj%jJJj%%%%jJ%%j%JJlKJj%jJ%%%%jJ%%J
-35291@j%%%%%%%j%Kjj%J%jJ%kJJ%j%J%%%%%%%%Jj%j%JjJkKJ%%%k%J%%%Jjj%J%%%%%J%j%%
-35338a%jJ%%jJ%jJjJj%Kk%J%%j%%%%J%jJJj%%jJ%%%J%kJj%JJ%%j%jKkJ%jJ%Jjj%%J%%%%%
-35385aj%%J%j%J%%%%jJ%%jJ%%jJjJjJj%%jK%j%JjK%kK%jJk%%%J%Jj%%Jj%%jJ%%%jKj%JkJ
-35432ajJ%%jJ%%%%%%%%%%%Jjj%%JJjJjjJjJ%%jJ%%%%j%J%%JjJ%j%%%JkKj%Kj%j%kK%J%jj
$$ plain form
-35479 -2 -2 -1 -1 -1 0 -1 -2 -1 -1 -2 -1 -1 -2 0 -1 -1 -2 -2 -2 -1 -1 -1 -1 -1 -2 -2 -2 -1 -1 -2 -2 -2 -2 -1 -1 -2 -1 -1 -1 -1 -1 -2 -2 -1 -1 -1 -2 -2 -1 -1 -1 -1 -1 -2 -1 -1 -1 -1 -2 -1 -2 -1 0 -1 -1 -1 -2 -1 -1
-35526 -1 -1 -1 0 -1 0 -1 -1 -1 -2 -2 -1 -1 -2 -3 -2 -1 -1 -1 -1 -1 -1 -1 -1 -2 -2 0 -2 -1 -1 -1 -1 -1 0 -1 0 -1 -1 -2 -1 -2 -2 -1 1 0 -2 -1 -2 -1 -1 -1 -1 -2 -2 0 -1 -2 -1 -1 -1 -1 -1 0 0 -1 -2 -2 -2 -3 -2
-35573 -2 -1 -1 -1 -1 -1 -2 -3 -1 -2 -1 -2 -1 -1 -1 -1 -1 -2 -1 0 0 -1 -2 -1 -3 -2 -1 -1 -2 0 -2 -1 -1 -2 -2 -2 -1 -1 -1 -1 -1 -2 -1 -1 -1 -1 -1 0 0 -1 -2 -2 -1 -1 -1 -2 -1 -2 -1 -2 -1 -1 -2 -1 -1 -1 -1 -2 0 -1
-35620 -1 -1 -2 -1 -1 -1 -1 -1 -1 -1 -1 -1 -1 -1 -1 0 -1 -1 -1 -1 -2 0 -2 -2 0 -1 -1 -1 -1 0 0 0 -1 0 -1 -1 -2 -1 -1 -1 -2 -2 -2 -2 -1 -1 0 -1 0 -2 -1 -1 -1 -1 -1 0 -1 -2 -1 -1 -2 -3 -4 -2 -2 -2 -1 -2 0 -1
-35667 -1 -2 -1 -1 -2 -1 -2 0 -1 0 0 0 0 0 0 0 -2 0 -1 -1 -1 -1 -2 -1 -1 0 -2 -1 -2 -2 -1 -1 -1 0 0 0 0 -1 -1 -2 -1 0 -2 0 -1 -1 -1 -1 -1 -1 -1 -1 -1 -1 -1 -2 -1 0 0 0 -1 -1 -1 -2 -2 -2 0 0 -1 -1
-35714 -1 -1 -1 -2 -1 0 -1 -1 -1 -1 -1 -1 -2 -2 -1 -1 -2 -1 -1 -2 -2 -2 -1 -1 -1 -2 -2 -2 -1 -1 -2 -1 0 -2 -1 -2 -1 -1 -1 -1 -1 -2 -1 -1 -2 -1 -1 -1 -1 -1 -1 -1 0 -1 -1 -1 -2 -2 -1 -2 -2 -2 -2 0 -1 -1 -1 -1 -2 -1
-35761 -1 0 -1 -2 -1 -1 -1 -2 -1 -3 -1 0 -1 -1 0 -1 -2 -2 -1 -1 0 0 -1 -2 -2 -1 -1 -1 -2 -1 -2 -2 -1 -2 -1 -1 -2 -2 -2 -1 -1 0 -2 -1 -2 -2 -1 -1 -1 -1 -2 -1 -2 -1 -1 -2 -1 -1 -1 -1 0 -1 0 -1 -1 -1 -1 -1 -2 -2
-35808 -2 -1 -1 -1 -1 -2 -2 -2 -1 -1 -2 -1 -1 -1 -2 -2 -1 -1 0 -1 -1 -1 -1 -1 -2 -2 -1 -1 -1 -1 -2 -1 -1 -1 -1 -2 -3 -2 -2 -2 -1 -1 0 0 -1 -1 -1 -1 -1 0 -2 -1 -1 -2 -1 -1 -2 -2 -1 -2 -2 -1 -1 -1 -2 -1 -1 1 1 -1
$$ packed form
-35479b%J%%JjjJ%jJ%jKj%j%%J%%%%j%%J%j%%%J%jJ%%%%j%J%%j%J%%%%jJ%%%jJjJJj%%jJ%
-35526a%%JjJj%%j%J%jjJJ%%%%%%%j%KkJ%%%%JjJj%jJj%JKjkJjJ%%%j%KjjJ%%%%J%jj%%jJ
-35573bJ%%%%jjKjJjJ%%%%jJJ%jjJkJJ%jKkJ%j%%J%%%%jJ%%%%J%jj%J%%jJjJjJ%jJ%%%jKj
-35620a%jJ%%%%%%%%%%%Jj%%%jKk%Kj%%%J%%jJj%jJ%%j%%%J%JjJkJ%%%%JjjJ%jjjK%%JjKj
-35667ajJ%jJjKjJ%%%%%%kKj%%%jJ%JkJj%J%%J%%%j%jJJkKj%%%%%%%%%%jJJ%%j%%j%%K%j%
-35714a%%jJJj%%%%%j%J%jJ%j%%J%%j%%J%jJJkJjJ%%%%jJ%jJ%%%%%%Jj%%j%Jj%%%Kj%%%jJ
-35761aJjjJ%%jJkKJj%Jjj%J%J%jj%J%%jJj%JjJ%j%%J%JkJj%J%%%jJjJ%jJ%%%JjJj%%%%j%
-35808bJ%%%j%%J%jJ%%j%J%Jj%%%%j%J%%%jJ%%%jjJ%%J%J%j%%%%JkJ%jJ%j%Jj%J%%jJ%K%k
$$ plain form
-35855 -1 -1 -1 0 0 -1 -1 -1 -1 -1 0 -1 -1 -1 -1 -1 -1 0 -1 -1 -1 0 -1 0 -1 0 -1 -1 -2 -3 -1 -1 -2 -2 -3 -2 -2 -1 -2 -1 -1 -2 -1 -2 -1 -1 -1 -1 -1 -2 -1 -1 -2 -2 -1 -2 -1 -1 -1 -1 -1 -1 -1 -2 -1 -1 -1 -1 -2 -2
-35902 -2 -2 -1 -2 -1 -2 -2 -1 -1 -2 -1 -1 -2 -1 -1 0 0 -1 -1 -2 -2 -2 -1 -1 -1 -1 -2 -2 -2 -2 -2 -1 -2 -1 -1 -2 -1 -1 -1 -1 -1 0 0 -1 1 -1 0 -2 -1 -1 -2 -1 -1 -1 -2 -2 -2 -2 -2 -1 -1 -1 -1 -2 -2 -2 -1 -2 -2 -2
-35949 -2 -1 -2 -2 -1 0 -2 -2 -2 -2 -1 -1 -2 -1 -1 -2 -2 -1 -1 -2 -2 -1 -1 -1 -1 -1 -1 -2 -2 -2 -2 -1 -2 -1 0 -1 -1 0 -1 -2 -2 -2 -1 -1 -2 -2 -1 -1 -1 -1 -3 -2 -1 0 -2 -2 0 -1 -3 -2 -2 -1 -2 -2 -1 -2 -1 -1 -2 -1
-35996 -1 -2 -2 -2 -2 -1 -2 -1 -2 -2 -2 -1 -1 -1 -1 -1 -1 -1 -1 -2 -2 -2 -1 -2 -2 -2 -2 -1 -1 -1 -1 -1 -1 -1 0 -1 -1 0 0 -1 -2 -2 -1 -1 -2 -2 -1 -1 0 0 -2 -2 -2 -1 -1 -1 -1 -1 1 -1 -2 -1 -2 -1 0 -1 -1 0 -1 -1
-36043 -1 0 0 -2 -1 -1 -2 -2 -3 -1 -1 -1 -1 -1 0 -2 -1 -1 -1 -2 -1 0 -1 -1 -1 -1 -1 0 -1 -1 -2 0 -1 -1 -1 -2 -1 -1 -1 0 -1 -1 -1 -1 -2 -2 -2 -1 -2 -1 -1 -1 -2 -2 -1 0 0 -1 -2 -1 -2 0 -1 -1 -1 -1 -1 -2 -1 0
-36090 0 0 -3 -1 -1 -1 -1 -2 -1 -1 -1 -3 -1 -1 -1 -1 -1 -1 0 -1 -1 -1 -2 -1 -2 -1 -1 -2 -1 -1 -1 -2 -1 -1 -1 -2 -1 -2 -1 0 -1 -1 -1 -2 -2 -1 -1 -1 -1 -1 -1 -1 -1 -1 -2 -2 -2 -2 -1 -1 -1 -1 -1 0 -1 -2 -1 -1 -1 -1
-36137 -1 0 -1 1 -1 -1 0 -2 -1 -1 -1 -1 -1 -1 -1 -2 -2 0 -1 -1 -1 -1 -1 -2 -2 -2 -1 -1 -1 -1 -2 -1 -1 -2 -1 -1 -1 -1 -2 -1 0 -1 -1 -1 -1 0 -1 -1 -1 -1 -1 -2 -2 -2 -1 -1 -1 0 -1 -1 -2 -2 -2 -1 -2 -1 -2 -2 -1 0
-36184 0 -1 -1 -1 -1 -1 -1 -1 -2 0 -1 -2 -1 -1 -1 0 -1 -1 -1 -2 -2 -1 -1 -2 -1 -2 -2 -2 -2 -2 -1 0 -1 -1 -1 0 0 -1 -1 0 -1 0 -2 -2 -1 0 -1 -1 -1 -3 -1 -1 -1 0 -2 0 -1 -1 -1 -1 -1 -1 -2 -1 0 -1 -1 0 0 -1
$$ packed form
-35855a%%J%j%%%%Jj%%%%%Jj%%JjJjJj%jjK%j%jJ%JjJ%jJjJ%%%%jJ%j%JjJ%%%%%%jJ%%%j%
-35902b%JjJj%J%jJ%jJ%J%j%j%%J%%%j%%%%JjJ%jJ%%%%J%jKkJkJ%jJ%%j%%%%J%%%j%%Jj%%
-35949bJj%JJk%%%J%jJ%j%J%j%J%%%%%j%%%JjJJj%Jjj%%J%j%J%%%kJJJk%KjkJ%Jj%JjJ%jJ
-35996aj%%%JjJj%%J%%%%%%%j%%Jj%%%J%%%%%%Jj%J%jj%J%j%J%J%k%%J%%%%KkjJjJJj%Jj%
-36043aJ%kJ%j%jK%%%%JkJ%%jJJj%%%%Jj%jKj%%jJ%%Jj%%%j%%JjJ%%j%JJ%jjJjKj%%%%jJJ
-36090@%lK%%%jJ%%kK%%%%%Jj%%jJjJ%jJ%%jJ%%jJjJJj%%j%J%%%%%%%%j%%%J%%%%JjjJ%%%
-36137aJjKk%JkJ%%%%%%j%Kj%%%%j%%J%%%jJ%jJ%%%jJJj%%%Jj%%%%j%%J%%Jj%j%%JjJj%JJ
-36184@j%%%%%%jKjjJ%%Jj%%j%J%jJj%%%%JJj%%J%j%JjJk%JJj%%kK%%JkKj%%%%%jJJj%J%j
$$ plain form
-36231 -1 -1 -1 -1 -1 -1 -1 -1 -2 -1 0 -3 -2 -1 -2 0 -1 -1 0 1 0 -2 -2 -1 -1 0 -1 -1 0 -1 -1 -1 -1 0 -1 -1 -1 -2 -2 -2 -2 -1 0 -1 -1 -1 -1 0 -1 -1 -2 -1 -1 -2 0 -1 -1 -1 -1 -1 -3 -1 -1 -1 -1 -1 0 -1 -1 -1
-36278 -1 -1 -1 -1 -1 -1 -1 -1 -1 -2 -1 -1 -1 -1 -1 -1 -1 -2 -2 -1 -1 -1 -1 -2 -2 -1 -1 -2 -3 -2 -1 -2 -1 -1 -2 -1 -1 -1 -1 -1 -2 -2 -1 -1 -1 -2 -2 0 -1 -2 -1 -2 0 -1 -1 -1 -1 -1 0 -1 -2 -2 -2 -2 -2 -2 -1 -1 -2 0
-36325 0 -1 -1 -2 -2 -1 -1 0 -1 -1 -2 -2 -2 0 -2 -1 0 -1 0 -1 -2 -1 0 -1 -1 -1 -1 -2 -2 -1 -1 -1 -1 -2 -1 -2 -1 -1 -1 -1 -2 -2 -2 -1 -2 -2 -2 -1 -2 -1 -1 -1 -2 0 -2 0 0 -1 0 -3 0 -2 -1 -2 -2 -2 -1 -1 -1 -1
-36372 -1 -1 -1 -2 0 0 0 0 -1 -1 0 -1 -2 -1 -1 -2 -2 -1 -2 -2 -1 -1 -1 -1 -1 -1 -1 -1 -1 -2 -1 -1 -2 -1 0 -1 0 0 0 0 -1 -1 -1 -1 -2 -2 -2 0 -1 -2 -1 -1 -2 -2 -1 -1 -1 -2 -2 -2 -1 -1 -1 0 -1 -1 0 0 0 -1
-36419 -1 -1 -1 -1 -1 -1 -1 -2 -2 -2 -1 -1 -1 -2 -2 -2 -1 -1 -2 -2 -2 -1 -1 -1 0 0 -1 0 -1 -2 0 -1 0 0 -1 -2 -2 -2 -1 -2 0 -1 -1 -2 -1 -1 -1 -1 -1 -1 -1 -2 -2 -1 0 -1 -2 0 -1 1 -1 -2 -3 -1 0 -1 -1 -1 -1 0
-36466 0 0 -1 -1 -1 -1 -2 -2 -1 -2 -1 -1 -2 -1 -1 -2 -1 0 -1 -2 -1 -2 -1 -2 -2 -1 -1 -1 -2 0 -1 -1 -1 -1 -1 -2 -3 -2 0 -1 -2 -1 -1 1 -2 -2 -3 -2 -2 -2 -1 -2 -2 0 0 -1 -2 -2 -1 -2 -1 0 -1 -2 -1 0 -1 -2 -1 -1
-36513 -1 -1 -1 -1 -1 -2 -2 -1 -1 -1 0 -1 0 -1 -1 -1 -1 0 -1 -2 -2 -2 -2 -2 -1 -2 -2 -3 -2 0 0 0 -1 -2 -1 -1 0 -1 -3 -2 -1 -1 -1 -2 -1 -1 -1 -1 -1 0 0 -1 -1 0 -1 -1 -1 -1 -1 -1 -1 -1 -2 -2 -1 -1 -1 -1 -1 -1
-36560 -1 0 0 -1 -1 0 0 -1 -1 0 0 -1 -2 0 1 0 0 -1 -2 -1 -2 -1 -2 0 -1 -1 -1 -1 -2 -2 -1 -1 -1 -1 -1 0 -1 -2 -1 -1 -1 -1 0 -2 -1 -1 -2 -2 -2 -1 -3 -2 -1 -1 -1 0 -1 -1 -1 -1 0 -1 -1 -1 0 0 0 0 -1 0
$$ packed form
-36231a%%%%%%%jJJlJJjKj%JJjk%J%Jj%Jj%%%Jj%%j%%%JJj%%%Jj%jJ%jKj%%%%kK%%%%Jj%%
-36278a%%%%%%%%jJ%%%%%%j%J%%%j%J%jjJJjJ%jJ%%%%j%J%%j%KjjJjKj%%%%Jjj%%%%%J%jK
-36325@j%j%J%Jj%j%%KkJJjJjjJJj%%%j%J%%%jJjJ%%%j%%Jj%%JjJ%%jKkK%jJlLkJj%%J%%%
-36372a%%jK%%%j%JjjJ%j%Jj%J%%%%%%%%jJ%jJJjJ%%%j%%%j%%KjjJ%j%J%%j%%J%%Jj%J%%j
-36419a%%%%%%j%%J%%j%%J%j%%J%%J%jJjjKjJ%jj%%JjKj%jJ%%%%%%j%JJjjKjKkjjKJj%%%J
-36466@%j%%%j%JjJ%jJ%jJJjjJjJj%J%%jKj%%%%jjJKjjJ%Kl%jJ%%Jj%K%jj%JjJJjjJJjjJ%
-36513a%%%%j%J%%JjJj%%%Jjj%%%%Jj%jJK%%jjJ%JjkJJ%%jJ%%%%J%j%Jj%%%%%%%j%J%%%%%
-36560aJ%j%J%j%J%jjKJj%jjJjJjKj%%%j%J%%%%JjjJ%%%JkJ%j%%JkJJ%%Jj%%%Jj%%J%%%jJ
$$ plain form
-36607 0 -1 -2 -1 -1 -1 -1 -1 -1 -1 -1 -1 -1 -1 -1 -1 -1 -1 -1 0 -1 -2 -1 -1 -1 -2 -1 -1 0 0 -1 -2 -1 -1 -1 0 -1 -2 -1 0 0 -1 -2 0 0 -1 -1 -2 -3 -2 -1 -2 -4 -1 0 -1 -1 -1 -1 0 0 0 -1 -2 -2 -1 -1 -1 -1 -1
-36654 -1 0 -1 -1 0 -2 -1 0 0 0 -1 -1 0 0 0 -1 -2 -1 0 0 -1 -1 -1 -1 -1 -1 -1 1 0 -2 -1 -2 -2 -2 -1 -1 -1 -2 -2 -1 -1 0 0 -1 -2 0 -1 -1 -1 -1 -1 -1 0 -1 -1 -1 -1 -1 -1 0 -1 -1 -1 -2 -1 0 -1 -1 -1 -1
-36701 -1 0 -1 -1 -1 -1 -1 -1 -2 -2 -1 -1 -1 -1 -2 -1 -2 -2 -2 -2 -1 -2 -1 -1 -1 0 -2 -1 -1 -1 -1 -1 -1 -1 -2 -1 -1 -2 -1 -1 -2 -1 0 0 -1 -2 -2 0 -1 -1 -1 -2 -2 -1 -1 -1 -2 -1 -1 -1 -1 -1 0 -2 0 0 0 0 -1 -1
-36748 -1 -1 -2 -1 -1 0 0 -1 -1 -1 -1 -2 -2 -1 -2 -1 -1 -1 -2 -1 -1 -1 -1 -1 -1 -1 -2 -3 -2 -1 -1 -1 0 -1 -2 1 -1 -2 -1 -1 -2 -1 -2 -1 -1 -1 -1 -1 0 0 0 -1 -1 -1 -1 -2 -2 -2 -2 0 -1 -1 -1 -1 -1 -1 0 -2 -1 -2
-36795 -2 -1 0 -3 -2 -2 0 -1 0 -1 -1 0 -1 -3 -2 -2 -2 -3 -2 -1 -1 -2 -1 -1 -1 -1 -1 -1 -1 -1 -1 0 -2 -2 -1 0 0 0 -1 -1 -1 -1 -1 -1 0 -1 -1 -1 -1 -1 -2 -2 0 0 -2 -1 -1 -1 -1 -1 -1 -1 -2 -2 -1 0 -1 -1 -2 -2
-36842 -2 -2 0 0 0 0 -1 -2 -1 0 0 0 0 0 1 -1 -1 -1 -1 -1 -1 -1 -1 -1 -1 -1 -2 -2 -1 -1 -1 -1 -1 -2 -2 -2 -1 -2 -1 -1 0 0 -1 -1 -2 0 -1 0 -1 -1 0 -1 -1 0 -1 -2 -1 -1 -2 -2 -1 0 -1 -1 -1 -1 -1 -1 -2 -2
-36889 -2 -1 -1 -2 -3 -1 0 0 0 -1 -1 0 -1 0 0 -2 -2 -2 -1 -1 -2 -1 -2 -2 -1 -1 -2 -1 -1 -2 -1 -1 0 0 -1 -1 -1 -1 0 0 -2 0 0 -2 -1 -1 -1 -1 -2 -2 -1 0 0 -1 -2 -2 0 -1 -2 0 -1 -2 -2 -1 -1 -1 -2 -2 0 -1
-36936 -1 -1 -1 -2 -1 -2 -1 -1 0 -1 -2 -1 0 -1 -1 -1 0 0 -1 -2 -1 0 -2 -3 -2 -1 -1 -1 -2 -1 -1 -1 -2 -1 -1 -1 0 -1 0 -1 -1 -1 -1 -1 0 0 -1 -2 -1 -1 0 0 -3 -2 -2 -2 -2 0 -1 -2 -3 -2 -2 -1 -1 -1 0 0 -1 -1
$$ packed form
-36607@jjJ%%%%%%%%%%%%%%%JjjJ%%jJ%J%jjJ%%JjjJJ%jjK%j%jjJJjkLJj%%%J%%jj%J%%%%
-36654aJj%JkJJ%%j%J%%jjJJ%j%%%%%%KjkJj%%J%%j%J%J%jjKj%%%%%Jj%%%%%Jj%%jJJj%%%
-36701aJj%%%%%j%J%%%jJj%%%JjJ%%JkJ%%%%%%jJ%jJ%jJJ%jj%Kj%%j%J%%jJ%%%%JkK%%%j%
-36748a%jJ%J%j%%%j%JjJ%%jJ%%%%%%jjJJ%%JjjLkjJ%jJjJ%%%%J%%j%%%j%%%Kj%%%%%JkJj
-36795bJJlJ%KjJj%JjkJ%%jJJ%jJ%%%%%%%%Jk%JJ%%j%%%%%Jj%%%%j%K%kJ%%%%%%j%JJj%j%
-36842b%K%%%jjJJ%%%%Jk%%%%%%%%%%j%J%%%%j%%JjJ%J%j%jKjJj%Jj%JjjJ%j%JJj%%%%%j%
-36889bJ%jjKJ%%j%JjJ%k%%J%jJj%J%jJ%jJ%J%j%%%J%kK%kJ%%%j%JJ%jj%KjjKjj%J%%j%Kj
-36936a%%jJjJ%JjjJJj%%J%jjJJkjJJ%%jJ%%jJ%%JjJj%%%%J%jjJ%J%lJ%%%KjjjJ%J%%J%j%
$$ plain form
-36983 -1 -2 -2 -1 -1 -1 -2 -1 -2 -1 -1 -1 -1 -1 0 -3 -1 0 -1 0 0 -1 -2 -1 -1 -2 -2 -2 -2 0 -1 -2 -2 -1 -2 -2 -1 0 0 -1 -1 -1 -2 -2 -1 -1 0 0 -1 -1 -2 -2 -2 -2 -2 -2 -2 -2 -1 -1 -1 -1 -1 0 0 0 -1 -1 0 0
-37030 0 -1 -2 -2 -1 -1 -1 -1 0 -1 -1 -1 -1 -1 -1 -1 -1 -1 -1 -2 -2 -1 -2 0 0 -1 -1 -2 -2 -2 -2 -1 -1 -1 -1 -1 -2 -2 -2 -1 -2 0 -1 -1 0 -1 -1 -2 0 0 -1 -2 -2 -2 -1 -1 -1 -1 -1 -2 -1 -1 -1 -1 -1 -2 -2 -2 -2 -1
-37077 -1 -1 -1 -2 -3 -3 -2 -2 -2 -2 -2 -1 -2 -2 -2 -2 -2 -2 -2 -1 -1 -1 -1 -1 -1 -1 -1 -1 -1 -2 -2 -2 -1 -1 0 0 -1 0 -2 -2 -2 -2 -1 -1 -1 -1 -1 -1 0 0 0 -1 0 -1 -1 0 -1 -1 -1 -2 -1 -2 -1 -1 -1 -1 0 -1 -1 -1
-37124 -1 -1 -2 -2 -1 -1 -1 -1 -1 -1 -3 -2 -1 -1 -1 -2 -1 -1 -1 -2 -1 -1 -1 0 -2 -2 0 -1 -1 0 -1 -1 -2 -1 -1 -1 -1 -1 0 -2 0 -1 -1 0 0 -2 0 -2 -1 -1 -1 -1 -1 -1 -1 -1 -1 -2 -2 -2 -2 -2 -2 -2 -1 -1 -1 -2 -2 -2
-37171 -2 -2 -1 -1 -1 0 -1 -1 0 0 -1 0 -1 -2 -1 -1 -1 -1 -2 -2 -1 -1 -1 -1 -1 -1 -1 0 -1 -1 -1 -2 -1 -2 -1 0 -2 -2 -1 -1 -1 -2 0 -1 -2 -1 0 -1 -2 0 -1 -2 -1 -2 -1 -1 -1 -2 -2 0 -1 0 0 -2 -2 -2 -1 -1 0 -1
-37218 -1 -1 0 -1 0 -1 -1 -1 -1 -1 -1 -1 -1 -1 -2 0 -1 -1 0 -1 -2 -3 -1 0 1 0 -1 -1 -1 -1 -1 0 -1 -1 -1 0 -1 -1 -1 0 -1 -2 -2 -2 -2 -1 -1 0 -2 -2 -1 -1 -1 0 -1 0 0 -1 -1 -1 0 -1 -1 -1 -1 -1 -1 -1 -1 -2
-37265 -2 -2 0 -1 -1 -1 -1 -2 -1 -1 -1 -1 -2 -1 -1 -1 -2 -1 -1 -1 -1 -1 0 -1 -1 -1 -1 -1 -2 -1 -1 -2 0 -1 0 -1 -1 -1 -1 -2 0 -1 -1 -1 -2 0 -1 -2 0 -1 -2 -1 -2 -1 -1 -1 -1 -1 -1 0 0 -1 -1 0 -1 -1 -2 -1 -2 -2
-37312 -2 -2 -1 -1 -1 -1 -1 0 -1 -1 -1 -2 -2 -1 -1 -2 -2 -2 -1 -2 -1 -1 0 1 -1 -1 0 -1 -1 -1 0 0 -1 -2 -1 -1 -1 -2 0 -1 -1 0 -1 0 -1 -3 -2 -1 -1 0 -1 -1 -1 -2 -2 -1 -1 -1 0 -2 -1 -1 -1 -1 -1 -2 -2 -1 -1 -2
$$ packed form
-36983aj%J%%jJjJ%%%%JlKJjJ%jjJ%j%%%Kjj%Jj%JJ%j%%j%J%J%j%j%%%%%%%J%%%%J%%j%J%
-37030@jj%J%%%Jj%%%%%%%%%j%JjK%j%j%%%J%%%%j%%JjKj%Jj%jK%jj%%J%%%%jJ%%%%j%%%J
-37077a%%jj%J%%%%Jj%%%%%%J%%%%%%%%%j%%J%J%jJk%%%J%%%%%J%%jJj%Jj%%jJjJ%%%Jj%%
-37124a%j%J%%%%%kJJ%%jJ%%jJ%%Jk%Kj%Jj%jJ%%%%JkKj%J%kKkJ%%%%%%%%j%%%%%%J%%j%%
-37171b%J%%Jj%J%jJjjJ%%%j%J%%%%%%Jj%%jJjJJk%J%%jKjjJJjjKjjJjJ%%j%KjJ%k%%J%Jj
-37218a%JjJj%%%%%%%%jKj%JjjjKJJjj%%%%Jj%%Jj%%Jjj%%%J%Jk%J%%JjJ%j%%Jj%%%%%%%j
-37265b%Kj%%%jJ%%%jJ%%jJ%%%%Jj%%%%jJ%jKjJj%%%jKj%%jKjjKjjJjJ%%%%%J%j%Jj%jJj%
-37312b%J%%%%Jj%%j%J%j%%JjJ%JJk%Jj%%J%jjJ%%jKj%JjJjkJJ%Jj%%j%J%%JkJ%%%%j%J%j
$$ plain form
-37359 -2 -1 -1 -2 -1 -1 -1 -2 -2 0 -2 -1 -1 -1 -1 -1 -2 -1 -3 -1 -1 0 -1 -1 -1 -1 -2 -2 -2 -2 -1 -2 -1 0 -2 -2 -1 -1 -1 -2 -1 -2 -1 0 -2 -2 -2 -2 -1 -1 -1 -2 -2 -2 -2 -1 -1 -2 -1 0 0 -2 -1 -1 0 -1 0 -1 -2 -1
-37406 -1 -1 -1 -1 -1 -1 0 -1 -1 0 0 -1 -2 -3 -3 -1 -1 -2 -2 -1 -1 -2 -1 -2 -1 -1 -1 -2 -2 -1 0 0 0 -1 -3 -2 -1 -1 0 0 -1 -1 -2 -1 0 0 -1 -1 0 -1 -2 -1 -1 0 0 -1 -2 -3 -2 0 -1 -1 -1 -2 -1 0 -1 0 -2 -2
-37453 -2 -1 -1 -1 -2 -1 -1 -2 0 -1 0 -1 -1 -1 -2 -2 0 -1 -1 -1 0 0 0 -1 -1 -3 -2 -1 -1 -1 -1 -1 -2 -2 -3 -1 -2 -2 -1 -1 -1 -1 -1 -1 0 -2 -2 0 -1 -2 -1 -1 -2 -1 0 -2 -1 -1 -1 -1 -1 0 -1 -1 -1 -1 -1 -2 -2 -2
-37500 -2 -1 -2 0 -1 -1 -1 0 0 -2 -1 -1 -1 -1 -2 -1 -1 -1 0 -1 -1 0 -1 0 0 -1 -1 -1 -1 -1 0 -1 -1 -1 -1 -1 -1 -2 -1 -1 -1 -1 0 -1 -1 0 -1 -1 -2 -2 0 -1 -1 -1 -1 0 -1 -2 -1 -1 0 0 -1 -1 -1 -1 -1 -2 -1 -1
-37547 -1 -1 -1 -2 -2 -2 -2 -2 -1 -1 -1 -1 -1 -2 -1 -1 -2 -1 -1 -1 -1 -1 -2 -2 -1 -1 -1 -2 -3 -1 -1 0 -1 -1 -1 -1 -2 -1 -1 0 -1 -2 -1 0 0 -1 -1 -1 -1 -1 -2 -2 -1 -1 1 -1 0 -1 -1 0 -1 -2 -2 -2 -1 -1 0 -2 -1 0
-37594 0 -1 -1 -1 -2 -1 0 -1 -1 0 0 0 0 0 0 -1 -2 -2 0 -1 0 -2 -1 -2 -2 -2 -3 -2 0 -1 -2 -2 -1 -1 -1 0 -3 -1 0 -1 -1 -1 -1 -1 -1 -1 0 -1 -2 -1 -1 0 -1 -1 -2 -1 0 0 -1 -1 0 -1 -1 -1 -1 -1 -2 -2 -1 0
-37641 0 0 -2 -2 0 -1 -1 -1 -1 0 -2 -1 -2 -2 0 -1 -1 -1 0 -1 -2 -1 -1 -1 -2 -1 -1 -1 -1 -2 -2 -1 0 -1 -2 0 0 -1 -1 -1 -2 -1 -1 -1 -2 -2 -2 -1 -1 -1 0 0 -1 -1 -1 -1 -2 -2 -2 -1 0 -1 -1 -1 -1 -1 -1 -1 -1 -1
-37688 -1 0 -1 -2 -2 0 0 -1 -1 -1 -2 0 -1 0 -2 -1 -1 -1 -1 -1 -1 -1 -1 -2 -1 -1 -1 -1 0 -1 -1 1 -1 -2 -2 -2 -1 -2 -1 0 0 0 -2 -1 -1 -1 -1 0 -1 -2 -2 -2 -2 -2 -2 -2 -1 -1 -2 -3 -2 -2 -2 -1 -1 -1 -1 -1 -1 -1
$$ packed form
-37359bJ%jJ%%j%KkJ%%%%jJkK%Jj%%%j%%%JjJJk%J%%jJjJJk%%%J%%j%%%J%jJJ%kJ%JjJjjJ
-37406a%%%%%Jj%J%jjj%K%j%J%jJjJ%%j%JJ%%jkJJ%J%j%jJJ%j%JjjJ%J%jjjJKj%%jJJjJk%
-37453bJ%%jJ%jKjJj%%j%Kj%%J%%j%kJJ%%%%j%jKj%J%%%%%Jk%KjjJ%jJJkJ%%%%Jj%%%%j%%
-37500bJjKj%%J%kJ%%%jJ%%Jj%JjJ%j%%%%Jj%%%%%jJ%%%Jj%Jj%j%Kj%%%JjjJ%J%j%%%%jJ%
-37547a%%j%%%%J%%%%jJ%jJ%%%%j%J%%jjK%Jj%%%jJ%JjjJJ%j%%%%j%J%KkJj%Jjj%%J%JkJJ
-37594@j%%jJJj%J%%%%%jj%KjJkJj%%jJKjj%J%%JlKJj%%%%%%JjjJ%Jj%jJJ%j%Jj%%%%j%JJ
-37641@%k%Kj%%%JkJj%Kj%%JjjJ%%jJ%%%j%JJjjK%j%%jJ%%j%%J%%J%j%%%j%%JJj%%%%%%%%
-37688aJjj%K%j%%jKjJkJ%%%%%%%jJ%%%Jj%Kkj%%JjJJ%%kJ%%%Jjj%%%%%%J%jjJ%%J%%%%%%
$$ plain form
-37735 -1 0 -1 0 -1 -2 -1 -1 0 -1 0 -2 -1 -1 0 0 0 -1 -1 -1 -1 0 -1 -1 -1 -1 -1 -1 -1 -1 -2 -1 -1 -1 -1 -1 -1 0 -1 -1 -1 -2 -2 -2 -1 -2 0 0 -1 -1 -1 -1 -1 -2 -1 -1 -1 -1 -1 -1 -1 -1 -2 -1 -1 -1 -2 -1 1 -1
-37782 -1 -1 -3 -2 -2 -1 -2 -1 -1 -1 -1 -1 -1 -2 -1 -1 -1 0 -1 -1 -1 -1 -2 -3 -2 -1 -1 -1 -1 -1 -1 -1 -1 -1 0 -1 -2 -1 -2 -2 -1 0 -1 -2 -1 -1 -1 -2 -2 -2 -2 -1 -1 0 -1 -1 -1 -2 -2 -3 -2 0 -1 -2 -1 -1 -2 -2 -1 -1
-37829 -1 -1 -1 -1 -1 -1 -1 -1 -1 -2 0 -1 -1 -1 -1 -1 -2 -2 -1 -2 0 -1 0 -1 -2 -2 -1 -1 -2 -2 -2 -1 -1 -1 -1 -1 -1 -1 -1 -1 -2 -1 -1 -1 0 -1 -1 -1 -1 -1 -1 -1 -1 -1 -1 0 0 -1 -1 -2 -1 -1 -1 -1 -2 -1 -1 -1 -1 -2
-37876 -2 -2 -2 -2 0 -1 -1 -1 -2 -2 -1 -1 -2 -2 -2 -1 -1 -2 -2 -2 -1 -1 -1 -1 0 -1 -1 -1 -2 -1 -1 -1 -2 -1 -1 0 0 -1 -2 -2 -2 -2 -2 -1 -1 0 -1 -1 -1 -2 -1 -1 -1 -1 -1 -2 -1 -2 -1 -2 -1 -1 -1 -1 -1 -2 -1 -1 -1 -1
-37923 -1 -2 -1 0 -1 -2 -2 -2 -1 0 -1 -2 -2 -1 -1 -1 -2 -1 -3 -2 -1 -1 0 -1 -1 -2 -1 -1 1 -1 -2 -1 -1 -2 -2 -2 -2 -1 -2 -1 -1 -1 -1 -1 -1 -2 -1 -1 -2 -1 -1 -1 -1 -1 -1 -1 -2 -2 -2 -1 -1 -2 -1 -1 0 -2 -2 -1 0 -1
-37970 -1 -2 -1 -1 -2 -2 -2 -1 -2 -2 -1 -1 -2 -1 0 0 0 0 -1 0 0 -1 -1 -1 -2 -1 -1 -1 -1 -1 -1 -1 -2 -2 -1 -1 -1 -1 -1 -1 -1 0 -1 -2 -1 0 -2 0 0 -1 -1 -1 -1 0 -1 -2 -2 -1 0 0 0 -1 -1 0 0 1 -1 -3 -1 -2
-38017 -2 -1 -2 -2 -2 -1 -2 -2 -1 -1 0 0 -1 -1 -1 -1 0 -1 -1 0 0 -1 -1 -1 -1 -1 -1 -1 -1 -2 -2 -1 -2 -1 -2 -2 -1 -1 -1 -1 -1 0 0 0 -1 -1 -1 -1 -1 -2 0 -1 -1 -1 -1 -1 -2 -2 -1 0 -1 -1 -1 -1 -2 -3 -2 -2 -1 -1
-38064 -1 -1 -1 -2 -1 -3 -2 -1 -1 -1 -2 -2 0 -1 -1 -1 -1 -1 -1 -1 -1 -1 -1 -2 -1 -1 -1 -2 -2 -1 -2 -1 -1 -1 -1 -2 -1 0 -2 -2 -2 -2 -1 -1 -1 -1 -1 0 0 0 -1 -1 -1 -1 -1 -1 -1 -1 0 -2 -1 -1 -1 -1 -2 -1 -1 -1 -1 -1
$$ packed form
-37735aJjJjjJ%JjJkJ%J%%j%%%Jj%%%%%%%jJ%%%%%Jj%%j%%JjK%j%%%%jJ%%%%%%%jJ%%jJKk
-37782a%kJ%JjJ%%%%%jJ%%Jj%%%jjJJ%%%%%%%%JjjJj%JJjjJ%%j%%%J%Jj%%j%jJKjjJ%j%J%
-37829a%%%%%%%%jKj%%%%j%JjKjJjj%J%j%%J%%%%%%%%jJ%%Jj%%%%%%%%%J%j%jJ%%%jJ%%%j
-37876b%%%Kj%%j%J%j%%J%j%%J%%%Jj%%jJ%%jJ%J%jj%%%%J%Jj%%jJ%%%%jJjJjJ%%%%jJ%%%
-37923ajJJjj%%JJjj%J%%jJkJJ%Jj%jJ%KkjJ%j%%%JjJ%%%%%jJ%jJ%%%%%%j%%J%jJ%Jk%JJj
-37970ajJ%j%%Jj%J%jJJ%%%jJ%j%%jJ%%%%%%j%J%%%%%%JjjJJkK%j%%%Jjj%JJ%%j%J%JkkKj
-38017bJj%%Jj%J%J%j%%%Jj%J%j%%%%%%%j%JjJj%J%%%%J%%j%%%%jKj%%%%j%JJj%%%jjJ%J%
-38064a%%jJkJJ%%j%Kj%%%%%%%%%jJ%%j%JjJ%%%jJJk%%%J%%%%J%%j%%%%%%%JkJ%%%jJ%%%%
$$ plain form
-38111 -1 -1 0 -1 -1 -1 0 -2 0 -1 0 0 -2 0 -1 -1 -2 -1 -1 -1 -1 -2 -2 -2 -1 -1 -1 -1 -1 -1 -1 -1 -1 -2 -2 -2 -1 -1 -1 -1 -1 -1 -1 -1 -2 0 -1 -1 -1 -2 -1 -1 1 -1 -1 -2 0 -2 -1 -1 0 -1 -1 0 -1 -1 -1 -2 -2 0
-38158 0 -1 -2 -3 -2 -1 0 -1 -1 -1 -1 -1 -1 -1 -1 0 -1 -1 -1 -1 -1 -2 -1 -1 -1 0 0 -1 -1 -1 -1 0 -1 -1 -1 -1 0 0 -2 -1 -2 -2 -2 -1 -2 -1 -1 -2 -1 -1 -1 -2 -2 -1 0 -2 -1 -1 -1 0 0 -1 0 -1 -1 -2 0 0 -3 -1
-38205 -1 -2 -3 -1 -1 -1 -1 -1 -2 -2 -2 -2 0 0 -1 0 0 0 0 0 -1 -1 -1 -1 -1 -2 -1 -1 -1 -2 -2 -2 -1 -1 -1 -1 0 0 0 -2 -2 -2 0 -1 -1 -1 -1 -2 -1 0 -1 -1 -1 -1 -1 -1 -1 -1 -1 0 0 -2 -1 -1 -1 0 -1 -1 -1 -1
-38252 -1 -2 -2 -1 -1 -1 0 0 0 -1 -2 -1 -1 -1 -1 -1 -1 -1 -1 -2 -2 0 -2 -1 -2 -2 -1 -1 -1 -1 -1 -1 -1 -2 0 -1 -1 -2 -1 -1 -1 -2 -3 -2 -2 -1 -1 -1 -1 -2 -1 -1 0 -1 -2 0 1 -1 -1 -1 -1 -1 -1 0 -1 -1 -1 -2 0 -1
-38299 -1 -2 -2 -1 -2 -1 -1 -1 -2 -1 -1 -2 -2 -2 -1 -1 -1 0 -1 -1 0 -1 -2 0 0 -1 -1 0 -1 -1 -1 -2 0 -1 -1 -2 -2 -2 -2 -1 -2 -3 -2 -1 -1 -1 -1 -2 -2 0 -2 -1 -1 -1 0 -2 0 -2 -2 0 0 -1 -1 -1 -2 -1 -3 0 -1 -1
-38346 -1 -1 -2 -1 -2 -2 1 0 -1 -2 -1 -1 -1 -2 -2 -1 -1 -1 -1 -2 -2 -2 -1 -2 -1 -1 0 -1 -2 -1 -1 -1 0 -1 -1 -2 -1 -1 -2 -1 -1 -1 -1 -1 -2 -1 -2 -3 -3 -1 -2 -1 0 -1 -2 -2 -2 -1 0 0 -1 -1 -1 -1 -2 -1 -1 -1 -1 -1
-38393 -1 -1 -1 -1 -1 0 -1 -1 -2 -1 -2 -2 -2 -1 -2 -1 -1 -1 -1 -1 0 0 0 0 0 0 -1 -2 -1 0 -1 -2 -1 0 -1 -2 -1 -1 -2 -1 -1 -1 -1 -2 -1 -1 -1 0 -1 -1 0 -2 -1 -1 0 0 -1 -1 -1 0 -2 -1 -2 -1 -1 -1 -2 -1 -2 -1
-38440 -1 -1 -2 -1 -1 0 -2 -1 -1 -1 -1 -1 -1 -1 -2 -1 -2 -2 -1 -1 -1 -1 -1 -1 -1 -1 -1 -1 -1 -1 -1 0 -1 -1 -1 -1 -1 -2 -1 -3 -2 -1 -1 0 -1 -1 1 -1 -1 0 0 -1 -1 -2 -1 -1 0 -1 -1 -1 -1 -1 -1 -1 -2 -1 -1 -2 0 -1
$$ packed form
-38111a%Jj%%JkKjJ%kKj%jJ%%%j%%J%%%%%%%%j%%J%%%%%%%jKj%%jJ%Kk%jKkJ%Jj%Jj%%j%K
-38158@jjjJJJj%%%%%%%Jj%%%%jJ%%J%j%%%Jj%%%J%kJj%%JjJ%jJ%%j%JJkJ%%J%jJj%jK%lK
-38205ajjK%%%%j%%%K%jJ%%%%j%%%%jJ%%j%%J%%%J%%k%%Kj%%%jJJj%%%%%%%%J%kJ%%Jj%%%
-38252aj%J%%J%%jjJ%%%%%%%j%KkJj%J%%%%%%jKj%jJ%%jjJ%J%%%jJ%JjjKJk%%%%%Jj%%jKj
-38299aj%JjJ%%jJ%j%%J%%Jj%JjjK%j%Jj%%jKj%j%%%JjjJJ%%%j%KkJ%%JkKk%K%j%%jJkLj%
-38346a%jJj%LjjjJ%%j%J%%%j%%JjJ%JjjJ%%Jj%jJ%jJ%%%%jJjj%KjJJjj%%JJ%j%%%jJ%%%%
-38393a%%%%Jj%jJj%%JjJ%%%%J%%%%%jjJJjjJJjjJ%jJ%%%jJ%%Jj%JkJ%J%j%%JkJjJ%%jJjJ
-38440a%jJ%JkJ%%%%%%jJj%J%%%%%%%%%%%%Jj%%%%jJkJJ%Jj%Kk%J%j%jJ%Jj%%%%%%jJ%jKj
$$ plain form
-38487 -1 -2 -2 -2 -2 -2 -1 -2 -2 -1 -2 -1 -1 -3 -2 -1 0 -2 -1 -1 -2 0 -1 -1 -1 0 0 -2 -1 -1 0 0 -1 -1 -1 -1 -1 0 -1 -1 0 -1 -1 -2 -2 -1 -1 -1 -1 -1 -2 -2 -2 -2 -1 -1 0 1 -1 -2 -1 -1 -1 -2 -1 -1 -2 -1 -1 -1
-38534 -1 -1 -1 0 0 -1 -1 -3 -1 -1 0 -2 -1 0 -1 -2 -1 0 -1 -1 -2 -1 -1 -1 -2 -1 -1 -2 -1 -1 -1 -2 -1 -1 -2 -2 -1 -1 -1 -1 -1 -1 -1 -1 -1 -1 -1 -1 -2 0 0 -1 -1 -2 -1 -2 -1 -1 -1 -1 -2 -1 -2 -2 0 -1 -2 -2 -1 -1
-38581 -1 -1 -1 -2 -1 0 -1 -2 -2 -2 -2 -3 -1 -2 -2 -1 -1 -1 -2 -1 -1 0 -1 -1 -2 0 -1 -1 0 0 0 0 0 0 -1 -1 -2 -1 -1 -1 -1 -1 -1 -1 -1 -1 -1 -1 -1 -2 0 -2 -1 0 -2 0 -1 -1 -1 0 0 -1 -1 0 0 -1 -3 -2 -1 -2
-38628 -2 -1 1 0 0 -1 0 -2 -1 0 0 0 -2 -2 -2 -1 0 0 0 -1 -1 -1 -2 -2 -1 -2 -1 -1 -1 -2 -1 -1 -1 -1 -1 -1 -1 -2 -1 -1 -1 -1 -1 -2 -2 -2 -1 -2 -2 0 0 -2 -2 -2 -1 -2 -1 -1 -1 -1 0 0 0 0 1 0 -1 -2 0 -1
-38675 -1 -1 -2 -2 -1 -1 -1 -1 -1 -2 -1 0 0 -2 -2 -1 -1 -2 -1 0 0 -2 -2 -1 -1 -1 -1 -2 0 -1 -1 -1 -1 -1 -1 0 -2 -1 -1 -1 -1 0 -1 -1 0 -1 -1 -1 -1 -1 -2 -1 -1 -2 -2 -1 -3 -1 -1 -1 -1 0 -1 0 -1 -1 -1 -2 -2 -2
-38722 -2 -1 -2 -2 -2 -2 -1 -2 -2 -2 0 0 -1 -1 -2 -1 -1 0 -2 -1 -1 0 -2 0 0 0 -1 -1 -1 -2 -2 -2 -1 -1 -1 1 -1 -1 -2 -1 -1 -1 0 -1 -1 -1 -1 -1 -1 0 0 0 -2 -2 -1 -1 -2 -1 0 -1 -2 -1 0 1 0 -1 0 0 -1 -1
-38769 -1 0 -1 -2 -3 -1 -1 -1 -2 0 -1 0 0 -1 -1 -1 -1 -1 0 -1 0 0 -1 -2 -2 -1 -1 -1 -1 -1 0 -2 -1 -2 -1 -1 -2 0 -1 -1 0 -1 -2 -1 0 -1 -1 -1 -2 -2 -1 -1 -1 -1 -1 0 -1 -1 -1 -1 -1 -2 -2 -1 -2 -2 -1 -1 -2 -2
-38816 -2 -2 -1 -1 -1 -2 -2 -1 -1 -1 0 1 -2 -1 -1 -1 -2 -1 0 -1 -1 -1 -2 0 0 -1 -1 -2 -1 0 -1 -1 -1 -1 -1 -2 0 0 -1 -2 -2 0 -1 -1 -1 -2 -2 -1 -1 -1 -1 -2 -1 -1 0 -1 -1 -1 -2 -1 -1 -1 0 -1 -1 -1 -1 -1 -1 -1
$$ packed form
-38487aj%%%%Jj%JjJ%kJJJkJ%jKj%%J%kJ%J%j%%%%Jj%Jj%j%J%%%%j%%%J%JJkjJ%%jJ%jJ%%
-38534a%%J%j%kK%JkJJjjJJj%jJ%%jJ%jJ%%jJ%j%J%%%%%%%%%%%jK%j%jJjJ%%%jJj%Kjj%J%
-38581a%%jJJjj%%%jKj%J%%jJ%Jj%jKj%J%%%%%j%jJ%%%%%%%%%%%jKkJJkKj%%J%j%J%jkJJj
-38628bJKj%jJkJJ%%k%%JJ%%j%%j%JjJ%%jJ%%%%%%jJ%%%%j%%Jj%K%k%%JjJ%%%J%%%JjjjKj
-38675a%j%J%%%%jJJ%k%J%jJJ%k%J%%%jKj%%%%%JkJ%%%Jj%Jj%%%%jJ%j%JkK%%%JjJj%%j%%
-38722bJj%%%Jj%%K%j%jJ%JkJ%JkK%%j%%j%%J%%Kk%jJ%%Jj%%%%%J%%k%J%jJJjjJJJjjJ%j%
-38769aJjjjK%%jKjJ%j%%%%JjJ%jj%J%%%%JkJjJ%jKj%JjjJJj%%j%J%%%%Jj%%%%j%Jj%J%j%
-38816b%J%%j%J%%JJlJ%%jJJj%%jK%j%jJJj%%%%jK%jj%Kj%%j%J%%%jJ%Jj%%jJ%%Jj%%%%%%
$$ plain form
-38863 -1 -1 -1 -1 -1 -1 -1 -1 -2 -2 -1 -1 -2 0 -1 -1 -2 -2 -2 -2 -1 -2 -1 0 -2 -1 0 -1 -1 0 -2 -1 0 -1 -1 0 0 0 0 -1 -1 -1 -1 -2 -1 -1 -2 -1 -1 -2 -2 -2 -2 -2 -1 -1 -1 -1 0 -1 0 0 -1 -1 -1 -1 -1 -1 0 -2
-38910 -2 -2 -1 -2 0 -2 -1 -1 0 0 -1 -2 -1 -1 -1 0 0 -1 -2 0 -1 -2 -1 0 -1 -1 -2 -1 -1 -2 0 -1 -1 -1 0 -1 -3 -2 0 -2 -1 -2 -1 -2 -2 -2 -2 -1 -2 -2 -2 -2 -1 -1 -2 0 -2 -2 -1 -1 -1 -2 -1 -2 -2 -1 -2 -2 -2 0
-38957 0 -2 -1 -1 -1 -1 -1 -2 -2 -1 -1 -1 -1 -1 -1 -2 -2 -1 -1 -1 -1 -1 0 0 -1 -1 -1 -1 -1 0 -2 0 -2 -2 -1 -1 0 0 0 -1 -1 -2 -1 -1 -1 -1 -1 0 -1 -2 -1 0 -2 -1 0 -2 0 -2 -1 -1 -1 -2 -2 -2 -1 -1 -2 -1 -2 -2
-39004 -2 -2 -1 -1 0 0 0 -1 -1 -1 -1 -1 -1 -2 -2 -1 0 -1 -2 -2 -2 -1 0 -1 -2 -2 -2 -1 1 0 0 0 -1 -1 -1 -1 0 -1 -1 -1 -1 -1 -1 0 -1 0 -1 -1 -1 -1 -1 -1 -2 -1 -1 -1 -1 -1 -2 -1 -1 -1 0 -1 -1 -2 -2 0 -1 -2
-39051 -2 -1 -1 -1 -1 -1 -1 0 0 -3 -1 -1 -1 -2 -1 0 -1 0 0 0 -1 -1 -1 -2 -1 -2 -1 -1 -1 -1 -1 -1 0 -1 -1 0 0 -1 -1 -1 -2 -1 -1 -1 -1 -2 -1 -1 -1 -1 0 -1 -1 0 0 -1 -2 -1 -1 -2 -1 -1 -1 -2 -1 -2 -1 -1 -2 -3
-39098 -3 -2 -1 -2 -1 0 -2 -1 -1 -2 -1 -1 -1 -1 -1 -2 -2 -2 -2 0 -1 -2 -1 -1 -1 -1 -1 -1 -2 -1 0 -1 -1 -2 -1 -1 0 -1 -1 -1 0 -1 -1 -2 -1 -1 0 0 -1 -1 -1 -2 -1 -2 -1 -1 -3 -1 0 -1 -2 -2 -1 -1 -2 -1 -1 -1 -1 -1
-39145 -1 -1 -1 -1 -1 -1 -1 -1 -1 -1 -1 -1 -1 -1 -1 -1 -1 -2 -1 -1 -1 -1 -2 -1 -1 -1 -1 -1 -1 -1 -1 -1 -1 -1 -1 -1 -1 -1 -1 0 0 0 0 0 -1 -1 -2 -1 -1 -1 -2 -1 -1 -1 -1 -2 -2 -2 -1 -1 0 -1 0 0 -1 -2 -1 -1 -1 -1
-39192 -1 -1 -1 -1 -1 -2 -2 -1 -1 -2 -1 -1 0 0 -1 -2 -2 -1 -1 0 0 -1 -1 -2 -2 -2 -1 -1 0 0 -1 -1 -1 -1 -2 -1 0 -1 -2 -1 -1 -2 -1 -2 -1 -2 -1 -1 -1 0 -1 -1 -1 -1 -1 -1 -2 -1 -1 0 -1 -1 -1 -2 0 -1 -2 -2 -2 0
$$ packed form
-38863a%%%%%%%j%J%jKj%j%%%JjJJkJJj%JkJJj%J%%%j%%%jJ%jJ%j%%%%J%%%JjJ%j%%%%%Jk
-38910b%JjKkJ%J%jjJ%%J%jjKjjJJj%jJ%jKj%%JjkJKkJjJj%%%Jj%%%J%jKk%J%%jJj%Jj%%K
-38957@kJ%%%%j%J%%%%%j%J%%%%J%j%%%%JkKk%J%J%%j%jJ%%%%JjjJJkJJkKkJ%%j%%J%jJj%
-39004b%J%J%%j%%%%%j%JJjj%%JJjj%%JKj%%j%%%Jj%%%%%JjJj%%%%%jJ%%%%jJ%%Jj%j%Kjj
-39051bJ%%%%%J%lK%%jJJjJ%%j%%jJjJ%%%%%Jj%J%j%%jJ%%%jJ%%%Jj%J%jjJ%jJ%%jJjJ%jj
-39098cJJjJJkJ%jJ%%%%j%%%KjjJ%%%%%jJJj%jJ%Jj%%Jj%jJ%J%j%%jJjJ%kKJjj%J%jJ%%%%
-39145a%%%%%%%%%%%%%%%%jJ%%%jJ%%%%%%%%%%%%%%%J%%%%j%jJ%%jJ%%%j%%J%JjJ%jjJ%%%
-39192a%%%%j%J%jJ%J%jj%J%J%j%j%%J%J%j%%%jJJjjJ%jJjJjJ%%Jj%%%%%jJ%Jj%%jKjj%%K
$$ plain form
-39239 0 0 -1 -1 -2 -1 -1 -1 -2 -1 0 -1 -1 -1 -1 0 -2 -1 -1 0 0 -1 -1 0 0 -1 -1 -1 0 0 0 -1 -2 -2 -1 -1 -1 -2 -2 -1 -1 -1 -1 -1 -1 -2 -2 -2 -2 -2 -2 -1 0 -1 -1 -1 -1 0 0 -1 -1 0 0 -1 0 0 -1 -2 -1 -1
-39286 -1 -1 -1 0 -1 -1 -1 0 0 0 -1 -1 -1 -2 -1 -2 -1 -1 -1 -1 0 0 -1 -1 -1 -2 -1 -1 -2 -2 -1 -1 -1 0 -2 -2 0 -1 -1 -1 -1 -2 -2 -1 -2 -2 -2 -2 -2 -1 -1 -1 -1 0 -1 0 -2 -2 -2 -2 -2 -1 -1 -2 -1 -2 -1 0 -1 -1
-39333 -1 -1 0 -2 -3 -3 -1 -1 -2 -2 0 -1 -1 -2 0 0 0 0 -1 -2 -1 0 -1 -1 -3 -2 -1 -1 -1 -1 0 -1 -1 -1 -2 0 -1 -1 -1 0 -1 -1 -1 -1 -2 0 0 -2 -1 0 0 0 -2 -1 -1 -1 -1 -1 -1 -1 -2 -2 -1 -1 0 -1 -1 -1 -1 0
-39380 0 -2 -1 -1 -3 -2 0 -2 -1 -2 -2 -2 -1 -1 0 0 -1 -1 -2 -2 -2 -1 -1 0 -1 -1 -1 -1 0 -1 -1 0 -1 -2 -2 -1 -1 -1 -2 -2 -2 -2 -1 -1 -1 -1 -1 -1 -1 0 -2 -1 0 -1 -2 -1 0 -1 0 -1 -1 0 -1 -2 -2 -2 -2 -1 0 0
-39427 0 -1 0 -2 -1 -1 -1 -2 -2 -2 -2 -2 -1 -1 -1 -1 -1 0 -2 -2 -2 -2 -1 -2 -2 -1 -1 -1 -2 -2 -1 -1 -1 -1 -1 -1 -2 -2 -2 0 -1 -1 -1 -1 -1 -1 0 0 -1 -2 -1 -2 -3 -1 0 -1 -1 -1 0 -1 0 -1 -1 -2 -1 -1 -1 -1 -2 -1
-39474 -1 0 -1 -1 -1 -1 -1 -1 -2 -1 -1 -1 -1 -2 -2 -1 -1 -2 -1 -1 -1 0 -1 -1 -1 -1 -1 -2 -1 -2 -2 -1 -1 -2 -1 -1 -1 -1 -1 -1 -1 -1 -1 -1 0 0 -1 -2 0 0 -1 -1 -1 -2 0 -1 -1 -1 -2 -1 -1 -1 -1 -2 -2 -1 -1 -1 -1 0
-39521 0 -1 0 -2 -1 -1 -1 -2 -2 -2 -2 -2 -2 -1 -1 -2 0 0 -1 -1 0 -1 0 0 -1 -1 -1 -2 -1 -2 -1 -1 0 -2 -2 -2 -2 -2 -2 -2 -2 -2 -1 0 -2 -1 -1 -1 -1 -2 -2 -1 -1 -1 -1 -1 -1 0 -2 -1 -1 -2 -1 -1 -1 -1 -1 -1 -1 0
-39568 0 0 0 -1 -2 -1 -1 0 0 -1 -1 -1 -1 0 -1 -1 -2 -1 0 -1 -1 -1 -1 -1 -1 -2 -2 -2 -1 -1 -1 -1 -1 -1 0 0 0 0 0 -1 -2 -2 -2 0 0 -1 -1 0 -1 -1 -1 -1 0 -1 -1 0 -1 -2 -1 -2 -1 -2 -1 -1 -1 -1 -2 -1 -1 -1
$$ packed form
-39239@%j%jJ%%jJJj%%%JkJ%J%j%J%j%%J%%jj%J%%j%J%%%%%j%%%%%JJj%%%J%j%J%jJ%jjJ%
-39286a%%Jj%%J%%j%%jJjJ%%%J%j%%jJ%j%J%%Jk%Kj%%%j%Jj%%%%J%%%JjJk%%%%J%jJjJJj%
-39333a%Jkj%K%j%Kj%jK%%%jjJJj%kJJ%%%Jj%%jKj%%Jj%%%jK%kJJ%%kJ%%%%%%j%J%Jj%%%J
-39380@kJ%kJKkJj%%J%J%j%j%%J%Jj%%%Jj%Jjj%J%%j%%%J%%%%%%JkJJjjJJjJj%Jjj%%%JJ%
-39427@jJkJ%%j%%%%J%%%%Jk%%%Jj%J%%j%J%%%%%j%%Kj%%%%%J%jjJjjKJj%%JjJj%jJ%%%jJ
-39474aJj%%%%%jJ%%%j%J%jJ%%Jj%%%%jJj%J%jJ%%%%%%%%%J%jjK%j%%jKj%%jJ%%%j%J%%%J
-39521@jJkJ%%j%%%%%J%jK%j%JjJ%j%%jJjJ%Jk%%%%%%%%JJkJ%%%j%J%%%%%JkJ%jJ%%%%%%J
-39568@%%jjJ%J%j%%%Jj%jJJj%%%%%j%%J%%%%%J%%%%jj%%K%j%Jj%%%Jj%JjjJjJjJ%%%jJ%%
$$ plain form
-39615 -1 -1 -1 0 0 -2 -1 -1 -2 -1 -1 -1 -1 -2 -1 0 -2 -1 -1 0 -1 -1 -1 -2 -1 -1 -1 0 -1 -2 -2 -1 -1 0 -1 -1 -1 0 -1 -1 -1 -2 -2 -2 -1 -1 -1 -2 -1 0 -1 -2 -1 -1 -1 -1 -1 -1 0 -1 -1 -1 -1 -2 -1 -2 -1 0 -1 -1
-39662 -1 -1 -1 -1 -1 0 -1 -1 -2 -2 -2 -1 0 -1 -1 -1 -1 -1 -2 -1 -1 -1 -2 -1 -1 0 -1 -1 0 -1 -2 -2 -2 -2 -2 -2 -1 -2 -2 -1 -1 -1 -1 -1 -1 -2 -1 -1 -1 -1 0 0 -1 -1 0 -1 -1 -1 0 -1 -1 -1 -1 -2 -1 -2 -1 -2 -1 0
-39709 0 -2 -2 -1 -1 -2 -1 -2 -1 -1 -1 -1 -2 -1 0 -1 -1 -1 -2 -1 -2 0 -1 -1 -1 -1 -2 -1 -1 -1 -2 -2 -1 0 -1 0 0 0 -1 -1 -1 -1 -2 -2 -1 -1 -1 -3 -1 0 -2 -1 0 -1 -1 0 -1 -1 -1 -1 -2 -2 -2 -2 -1 0 -1 -2 -2 -3
-39756 -3 -1 -1 -2 -2 0 -1 -2 -1 -1 -1 -2 -1 -2 -1 -1 -2 -1 1 0 -1 -1 -1 -1 -1 0 -1 -1 -1 -1 0 -1 -2 -2 -2 -2 0 -2 -1 -2 -2 -1 0 0 0 -1 -1 -2 -2 -3 -2 -1 0 0 0 -1 -2 -2 0 -2 -2 -1 -1 0 0 -1 -1 -1 -1 -1
-39803 -1 -1 0 0 -2 -1 0 -1 -1 -1 -1 0 -1 -2 -1 0 -1 -1 -2 -2 -2 -1 -2 -1 -1 -1 -2 0 0 -1 -1 -1 0 -1 -1 -1 -1 -1 -1 -2 -2 0 0 -1 -1 -1 -2 0 0 -1 -1 -1 -1 -2 -1 -1 -1 -1 -1 -1 -1 -2 -1 -1 0 0 -1 -1 -1 -2
-39850 -2 -1 -1 -2 -1 -1 -1 -1 -1 -1 0 -1 -2 -1 -2 -1 -1 1 -1 -1 0 -1 -1 -1 -1 0 -1 0 0 -1 -1 -1 -2 -2 0 1 -1 -2 -1 -1 -2 -1 0 -2 -2 -2 -1 -1 0 -1 -1 -1 -1 -1 -2 0 -2 -2 -1 -1 -1 -2 -1 -1 -1 -1 -1 -2 -1 -1
-39897 -1 -2 -1 -1 0 -1 -2 -2 -2 -1 -2 -2 -1 0 -1 -2 -1 0 0 -1 -1 -1 -1 -1 -1 -2 -2 -2 -1 -1 -1 0 -1 -1 -1 0 -1 -1 -1 0 -2 -1 -1 -1 -1 -2 -1 1 -1 -1 -3 -2 -1 -1 -2 -1 -1 -2 -1 -2 -1 -1 -2 -1 0 0 -1 -2 -1 -2
-39944 -2 -1 0 -1 0 0 -1 -1 0 0 -1 -2 -1 0 -1 -1 0 0 -1 -1 -1 -1 -1 -1 -1 -1 0 -1 -1 -1 -1 -2 -1 -2 -2 0 -2 0 0 -1 -1 -1 -2 -1 -1 -2 -2 -1 -1 -1 -1 -2 -1 0 0 -1 -1 0 -1 -1 -1 -2 -2 -1 -2 -2 -1 0 0 0
$$ packed form
-39615a%%J%kJ%jJ%%%jJJkJ%Jj%%jJ%%Jjj%J%Jj%%Jj%%j%%J%%jJJjjJ%%%%%Jj%%%jJjJJj%
-39662a%%%%Jj%j%%JJj%%%%jJ%%jJ%Jj%Jjj%%%%%Jj%J%%%%%jJ%%%J%j%Jj%%Jj%%%jJjJjJJ
-39709@k%J%jJjJ%%%jJJj%%jJjKj%%%jJ%%j%JJjJ%%j%%%j%J%%kKJkJJj%Jj%%%j%%%JJjj%j
-39756cK%j%KjjJ%%jJjJ%jJKjj%%%%Jj%%%Jjj%%%KkJj%JJ%%j%j%jJJJ%%jj%Kk%J%J%j%%%%
-39803a%J%kJJj%%%JjjJJj%j%%JjJ%%jK%j%%Jj%%%%%j%K%j%%jK%j%%%jJ%%%%%%jJ%J%j%%j
-39850bJ%jJ%%%%%JjjJjJ%Kk%Jj%%%JjJ%j%%j%KJkjJ%jJJk%%J%Jj%%%%jKk%J%%jJ%%%%jJ%
-39897ajJ%Jjj%%Jj%JJjjJJ%j%%%%%j%%J%%Jj%%Jj%%JkJ%%%jJKk%kJJ%jJ%jJjJ%jJJ%jjJj
-39944bJJjJ%j%J%jjJJj%J%j%%%%%%%Jj%%%jJj%KkK%j%%jJ%j%J%%%jJJ%j%Jj%%j%Jj%JJ%%
$$ plain form
-39991 0 0 -1 -1 -1 -2 -1 -1 -1 -1 0 -1 -1 0 -1 -1 -1 -1 -1 -2 0 -1 0 -2 -2 -1 -1 -2 -1 -1 -2 -1 -1 -2 0 -1 -2 -1 -1 0 -1 -2 -2 -2 -2 -2 -1 0 -1 -1 -1 -1 -1 -2 -2 -1 -1 0 -1 0 0 -1 -1 -1 0 -1 -1 0 -2 -2
-40038 -2 -1 0 0 -1 0 -1 -2 -1 -1 -1 -2 0 -1 -1 0 -2 -1 0 -1 -1 -1 -1 -1 -1 0 -1 -1 1 0 -1 -1 -1 -1 -1 -1 -1 -2 -2 -1 0 -1 -1 -2 -2 -1 -1 -1 0 -1 0 -1 -1 -2 -1 -2 -1 -1 -1 -2 -1 -2 -1 -1 0 -1 -1 1 -1 -2
-40085 -2 -1 -1 -1 0 -1 -1 -2 -1 -2 -2 0 -1 -2 -2 -2 -1 -1 -2 -1 -1 -1 0 -2 -1 0 -1 -1 -3 -1 -1 -1 -1 -1 -1 -1 -1 -2 -2 -1 1 -1 -1 -1 -1 -2 -1 -1 -1 -1 -1 0 0 -1 0 -2 -1 -2 -2 -1 -1 0 0 0 0 -1 -1 0 -1 -2
-40132 -2 0 0 -1 0 -1 -1 -1 -1 1 0 -1 -1 -1 -1 0 -1 -2 0 0 0 0 0 0 -1 -1 -2 -1 -2 -2 -2 -1 0 -1 -2 -2 -1 -1 -2 -1 -1 -1 -1 0 -1 -2 -1 -1 -1 -1 -1 -1 -1 -1 -1 -1 -1 0 0 -2 -1 -2 -2 -1 -1 -1 0 -1 -1 -1
-40179 -1 -1 -1 -1 0 -1 0 -1 -1 -1 -1 0 -1 -2 -1 -2 -2 -1 -2 -2 -2 0 -1 -2 -1 -1 -1 -1 -3 -1 -1 -1 -1 -2 -2 -1 -1 -1 -1 -1 0 0 0 -1 -1 -1 -3 -2 0 -2 0 0 -2 -1 -1 -1 -1 -1 -1 0 -1 -1 -1 -1 -2 -1 -2 -1 -1 -2
$$ packed form
-39991@%j%%jJ%%%Jj%Jj%%%%jKjJk%J%jJ%jJ%jKjjJ%Jjj%%%%JJj%%%%j%J%JjJ%j%%Jj%Jk%
-40038bJJ%jJjjJ%%jKj%JkJJj%%%%%Jj%Kjj%%%%%%j%JJj%j%J%%JjJj%jJjJ%%jJjJ%Jj%Kkj
-40085bJ%%Jj%jJj%Kjj%%J%jJ%%JkJJj%kK%%%%%%%j%JKk%%%jJ%%%%J%jJkJj%J%J%%%j%Jjj
-40132bK%jJj%%%Kjj%%%JjjK%%%%%j%jJj%%JJjj%J%jJ%%%JjjJ%%%%%%%%%%J%kJj%J%%Jj%%
-40179a%%%JjJj%%%JjjJj%Jj%%KjjJ%%%kK%%%j%J%%%%J%%j%%kJKkK%kJ%%%%%Jj%%%jJjJ%j
$$ [...]
-82289@
##END=		$$ NMR SPECTRUM
##END=		$$ LINK
