##TITLE=	RP135 vac frac 13C 500.10.fid
##JCAMP-DX=	6.0	$$ MestReNova 14.3.3-33362
##DATA TYPE=	LINK
##BLOCKS=	1    
##ORIGIN=	Mestrelab Research S.L.
##OWNER=	hrzepa
##$MNOVA/METADATA=	(DOCUMENT,BASE64)
eyJuYW1lIjoiL1VzZXJzL2hyemVwYS9MaWJyYXJ5L01vYmlsZSBEb2N1bWVudHMvY29tfmFwcGxlfkN
sb3VkRG9jcy9TaGVwcGFyZC9OTVIgZmlsZXMgemlwcy0yL0IoT0MoQ0YzKTMpMy9CKE9DKENGMykzKT
MtQy9CKE9DKENGMykzKTMgY2QubW5vdmEiLCJwYWdlcyI6W3siaXRlbXMiOlsiMSIgICAgIF19XX0=
##TITLE=	RP135 vac frac 13C 500.10.fid
##JCAMP-DX=	6.0	$$ MestReNova 14.3.3-33362
##DATA TYPE=	NMR SPECTRUM
##DATA CLASS=	XYDATA
##BLOCK_ID=	1
##ORIGIN=	Bruker BioSpin GmbH
##OWNER=	nmrsu
##NUMDIM=	1
##$MNOVA/METADATA=	(ITEM,BASE64)
eyJhbmdsZSI6MCwiYXhlcyI6eyJ4Ijp7Im1heCI6MjYxLjk5NjI5OTk5NTQzNjksIm1pbiI6LTIxLjk
5NDE2ODE0MDg4NzMxOH0sInkiOnsibWF4Ijo2MzQ2OTIxMi41LCJtaW4iOi01ODE2NzA4Ljc1fX0sIn
BvaW50cyI6W3sieCI6NTMyMSwieSI6NTgzNX0seyJ4Ijo4NzIyLCJ5Ijo1ODM1fSx7IngiOjg3MjIsI
nkiOjgyMDh9LHsieCI6NTMyMSwieSI6ODIwOH0seyJ4Ijo1MzIxLCJ5Ijo1ODM1fV0sInoiOjB9
##.OBSERVE FREQUENCY=	125.7728794606230025
##.OBSERVE NUCLEUS=	^13C
##.SOLVENT NAME=	None
##.PULSE SEQUENCE=	zgpg30
##LONGDATE=	2021/10/08 22:12:01.000
##.ACQUISITIONMODE=	SIMULTANEOUS (DQD)
##$ORIGINAL FORMAT=	Bruker XWIN-NMR
##$MNOVA/SCALES_VERSION=	9
##$PARAMETER FILE=	(acqus, ASCII, /private/var/folders/f6/rjf_tdyn2v98c5c0wvkgn4s80000gq/T/KjDXHJ7iQmyniAU4lthvxA/10/acqus, 0)
$$ ##TITLE= Parameter file, TopSpin 4.1.1
$$ ##JCAMPDX= 5.0
$$ ##DATATYPE= Parameter Values
$$ ##NPOINTS= 1	$$ modification sequence number
$$ ##ORIGIN= Bruker BioSpin GmbH
$$ ##OWNER= nmrsu
$$ $$ 2021-10-08 22:11:41.941 +0100  nmrsu@CZC036BXXF
$$ $$ Z:/500/data/tds/nmr/RP135 vac frac 13C 500/10/acqus
$$ $$ process C:\Bruker\TopSpin4.1.1\prog\mod\dirdata.exe
$$ ##$ACQT0= -1.70581753891579
$$ ##$AMP= (0..31)
$$ 100 100 100 100 100 100 100 100 100 100 100 100 100 100 100 100 100 100
$$ 100 100 100 100 100 100 100 100 100 100 100 100 100 100
$$ ##$AMPCOIL= (0..32)
$$ -1 0 0 0 0 0 0 0 0 0 0 0 0 0 0 0 0 0 0 0 0 0 0 0 0 0 0 0 0 0 0 0 0
$$ ##$AQSEQ= 0
$$ ##$AQ_mod= 3
$$ ##$AUNM= <au_zg>
$$ ##$AUTOPOS= <11 >
$$ ##$BF1= 125.757788526
$$ ##$BF2= 500.13
$$ ##$BF3= 125.757788526
$$ ##$BF4= 125.757788526
$$ ##$BF5= 125.757788526
$$ ##$BF6= 125.757788526
$$ ##$BF7= 125.757788526
$$ ##$BF8= 125.757788526
$$ ##$BWFAC= (0..63)
$$ 0 0 0 0 0 0 0 0 0 0 0 0 0 0 0 0 0 0 0 0 0 0 0 0 0 0 0 0 0 0 0 0 0 0 0 0
$$ 0 0 0 0 0 0 0 0 0 0 0 0 0 0 0 0 0 0 0 0 0 0 0 0 0 0 0 0
$$ ##$BYTORDA= 0
$$ ##$CHANFCU= (0..24)
$$ 0 2 1 0 0 0 0 0 0 0 0 0 0 0 0 0 0 0 0 0 0 0 0 0 0
$$ ##$CHANREC= (0..24)
$$ 0 2 1 0 0 0 0 0 0 0 0 0 0 0 0 0 0 0 0 0 0 0 0 0 0
$$ ##$CHEMSTR= <none>
$$ ##$CNST= (0..63)
$$ 1 1 1 1 1 1 1 1 1 1 1 1 1 1 1 1 1 1 1 1 1 1 1 1 1 1 1 1 1 1 1 1 1 1 1 1
$$ 1 1 1 1 1 1 1 1 1 1 1 1 1 1 1 1 1 1 1 1 1 1 1 1 1 1 1 1
$$ ##$CPDPRG= (0..8)
$$ <> <> <waltz65> <> <> <> <> <> <>
$$ ##$D= (0..63)
$$ 0 2 0 0 0 0 0 0 0 0 0 0.03 0 0 0 0 0.0002 0 0 0 0 0 0 0 0 0 0 0 0 0 0 0
$$ 0 0 0 0 0 0 0 0 0 0 0 0 0 0 0 0 0 0 0 0 0 0 0 0 0 0 0 0 0 0 0 0
$$ [...]
$$ 1 1 1 1 1 1 1 1 1 1 1 1 1 1 1 1 1 1 1 1 1 1 1 1 1 1 1 1 1 1 1 1 1 1 1 1
$$ 1 1 1 1 0 0 0 0 0 0 0 0 0 0 0 0 0 0 0 0 0 0 0 0 0 0 0 0
$$ ##$ShimPowRng3= (0..63)
$$ 1 1 1 1 1 1 1 1 1 1 1 1 1 1 1 1 1 1 1 1 1 1 1 1 1 1 1 1 1 1 1 1 1 1 1 1
$$ 1 1 1 1 0 0 0 0 0 0 0 0 0 0 0 0 0 0 0 0 0 0 0 0 0 0 0 0
$$ ##$ShimPowType1= 8
$$ ##$ShimPowType2= 8
$$ ##$ShimPowType3= 0
$$ ##$ShimPowType4= 0
$$ ##$ShimPowType5= 0
$$ ##$ShimPowType6= 0
$$ ##$ShimPowType7= 0
$$ ##$ShimPowType8= 0
$$ ##$ShimSysActGrad= (0..63)
$$ 1 2 3 4 13 5 7 11 10 9 6 8 12 18 19 20 21 15 22 23 24 14 25 16 26 17 27
$$ 28 31 32 33 34 35 36 37 38 0 0 0 0 0 0 0 0 0 0 0 0 0 0 0 0 0 0 0 0 0 0
$$ 0 0 0 0 0 0
$$ ##$ShimSysAngle= <>
$$ ##$ShimSysFunc= (0..63)
$$ 1 2 3 4 5 6 7 8 9 10 0 37 38 35 16 15 14 13 12 11 28 27 26 25 24 23 36
$$ 22 30 29 20 21 34 33 32 31 17 18 19 0 0 0 0 0 0 0 0 0 0 0 0 0 0 0 0 0 0
$$ 0 0 0 0 0 0 0
$$ ##$ShimSysMatId= <292722ba.dat>
$$ ##$ShimSysMatrix= 1
$$ ##$ShimSysMinMaxUG= 130000
$$ ##$ShimSysOffset= <58 mm>
$$ ##$ShimSysType= 4
$$ ##$ShimUnit= 3
$$ ##$SpectrOsVersion= <4.1.148.20201202>
$$ ##$TCubeEth= <192.168.180.18>
$$ ##$TCubeSeqDevice= <>
$$ ##$TOSITY= <no>
$$ ##$TRIPLO2= 0
$$ ##$TopSpinVersion= <TopSpin 4.1.1>
$$ ##$TrxFreqFormula= (0..23)
$$ <TrxFreqFormula(2.0,500130000.000000,'TRX',Trx(1.0,'TRX 1200.1',2,5.000000,1290.000000))>
$$ <TrxFreqFormula(2.0,500130000.000000,'TRX',Trx(1.0,'TRX 1200.2',2,5.000000,1290.000000))>
$$ <> <> <> <> <> <> <> <> <> <> <> <> <> <> <> <> <> <> <> <> <> <>
$$ ##$TrxPN= (0..23)
$$ <Z148391> <Z148391> <> <> <> <> <> <> <> <> <> <> <> <> <> <> <> <> <>
$$ <> <> <> <> <>
$$ ##$TrxSN= (0..23)
$$ <05365> <05364> <> <> <> <> <> <> <> <> <> <> <> <> <> <> <> <> <> <> <>
$$ <> <> <>
$$ ##$VCubeEth= (0..23)
$$ <no> <no> <no> <no> <no> <no> <no> <no> <no> <no> <no> <no> <no> <no> <no>
$$ <no> <no> <no> <no> <no> <no> <no> <no> <no>
$$ ##$VTU= 2
$$ ##$VTUETH= <192.168.99.10>
$$ ##$VTUTY= <no>
$$ ##$ValueLine= no
$$ ##$VpuPN= (0..23)
$$ <no> <no> <no> <no> <no> <no> <no> <no> <no> <no> <no> <no> <no> <no> <no>
$$ <no> <no> <no> <no> <no> <no> <no> <no> <no>
$$ ##$VpuSN= (0..23)
$$ <no> <no> <no> <no> <no> <no> <no> <no> <no> <no> <no> <no> <no> <no> <no>
$$ <no> <no> <no> <no> <no> <no> <no> <no> <no>
$$ ##$WBREFAM= (0..31)
$$ 99.9 100 100 100 100 100 100 100 100 100 100 100 100 100 100 100 100 100
$$ 100 100 100 100 100 100 100 100 100 100 100 100 100 100
$$ ##$WBREFLM= (0..31)
$$ 2 0 0 0 0 0 0 0 0 0 0 0 0 0 0 0 0 0 0 0 0 0 0 0 0 0 0 0 0 0 0 0
$$ ##$WBREFPH= (0..31)
$$ 0.91 0 0 0 0 0 0 0 0 0 0 0 0 0 0 0 0 0 0 0 0 0 0 0 0 0 0 0 0 0 0 0
$$ ##$WBSGU= (0..31)
$$ 1 1 2 0 0 0 0 0 0 0 0 0 0 0 0 0 0 0 0 0 0 0 0 0 0 0 0 0 0 0 0 0
$$ ##END=
$$ 
##$DECIM=	560
##$DSPFVS=	20
##XUNITS=	HZ
##YUNITS=	ARBITRARY UNITS
##FIRSTX=	32948.075289994420018
##LASTX=	-2765.937945915164164
##DELTAX=	-0.27247837611607134134
##XFACTOR=	1
##YFACTOR=	1760.8951689199500379
##FIRSTY=	5523.375
##MINY=	-46542.109375
##MAXY=	57699252
##NPOINTS=	131072
##XYDATA=	(X++(Y..Y))
$$ [...]
7374c%%jjjjj%%%J%J%%%%%%%jJ%J%%%%JJkjj%J%JJ%J%J%jjjk%JJJKJ%j%%j%kkjJJJJJ%Jj%
7354cJ%J%j%j%%%%j%%%%j%jjJK%%%Jjjjj%%%%%JJ%kjj%j%JJKJKJJ%jjj%%jJ%%JJJJJklj%J
7335dJ%%jjj%%%%%%J%%%J%J%%J%%%%%J%%%%%J%jjjjjjjjJJ%J%%%%%%j%%jJ%JJj%kj%%KJ%J
7315dj%%%JJKJJj%%%jj%%%jJ%%J%j%%J%J%jjj%j%j%%%%J%j%J%J%%jj%J%%j%JJJ%%jjjJJ%j
7296d%%%%jj%%%j%JJJJ%jjj%jJJJJjj%j%j%j%%%KKK%jj%%%%%%%%j%j%JJJ%%JJJ%%jkjJ%%%
7277c%j%j%j%%%jJKKJjkjj%%%%%%%Jj%JJJJJJ%k%j%%%%%jj%%%J%jj%%J%%%%%%jJ%%J%%%%%
7257dj%%j%j%%%%J%%%%j%%JJJ%j%%%%%%J%%%j%JJJ%j%%%%j%J%%jj%%%JJJ%%J%%%%j%%%%%%
7238b%%%%%%j%%%KKLLJJJJLNLJjlmmmljkjkj%j%%jJJ%J%Jj%%JJjjk%%%j%j%j%%j%%J%%%j%
$$ y = [-3, -3, -3, -4, -5, -6, -7, -8, -8, -8, -8, -7, -7, -6, -6, -6, -6, -6, -6, -6, -6, -7, -6, -6, -5, -5, -5, -5, -5, -4, -3, -5, -6, -7, -7, -6, -6, -5, -4, -4, -3, -3, -2, -2, -3, -4, -5, -7, -7, -6, -5, -4, -2, -1, -1, -2, -2, -2, -3, -3, -5, -7, -8, -7, -6, -5, -4, -3, -3, -2, -3, -3, -2, -2, -1, -1, -2, -2, -3, -3, -3, -3, -3, -4, -4, -4, -4, -4, -5, -5, -6, -7, -6, -4, -4, -4, -4, -3, -4, -5, -6, -7, -7, -7, -7, -7, -7, -6, -5, -5, -7, -8, -9, -9, -10, -10, -9, -8, -6, -5, -3, -2, -1, -1, -2, -3, -4, -4, -4, -5, -4, -4, -4, -3, -2, -1, 0, 1, -1, -4, -5, -5, -4, -3, -3, -3, -4, -5, -6, -6, -6, -6, -6, -6, -6, -5, -5, -5, -5, -4, -4, -3, -3, -3, -2, -2, -2, -2, -2, -2, -1, -1, -1, -1, -1, -1, 0, 0, -1, -2, -3, -4, -5, -6, -7, -8, -7, -6, -6, -5, -5, -5, -5, -5, -5, -5, -6, -6, -6, -7, -6, -6, -5, -4, -5, -5, -7, -8, -8, -8, -6, -5, -5, -4, -5, -5, -5, -5, -4, -3, -1, 0, 1, 0, 0, 0, 0, -1, -2, -2, -2, -2, -3, -2, -2, -2, -1, -1, -2, -2, -2, -1, -1, 0, 0, -1, -2, -3, -3, -4, -4, -5, -5, -5, -5, -5, -4, -4, -5, -5, -4, -4, -3, -3, -3, -4, -5, -5, -4, -4, -4, -5, -5, -4, -3, -2, -2, -2, -3, -4, -5, -4, -3, -3, -4, -4, -4, -4, -4, -5, -6, -6, -6, -6, -7, -7, -6, -5, -4, -3, -3, -4, -5, -6, -6, -7, -6, -5, -4, -3, -4, -5, -5, -6, -6, -7, -7, -8, -8, -8, -8, -6, -4, -2, -2, -3, -4, -4, -4, -4, -4, -4, -4, -4, -4, -5, -5, -6, -6, -5, -4, -3, -3, -3, -2, -1, 0, 0, 0, -1, -3, -4, -3, -3, -3, -3, -3, -4, -4, -5, -5, -6, -6, -6, -6, -7, -6, -4, -2, -1, -2, -4, -5, -6, -6, -6, -6, -6, -6, -6, -6, -5, -6, -6, -5, -4, -3, -2, -1, 0, 0, -2, -2, -3, -3, -3, -3, -3, -3, -4, -5, -5, -5, -5, -4, -4, -5, -6, -6, -6, -5, -5, -5, -5, -5, -5, -5, -6, -5, -5, -5, -4, -4, -4, -4, -4, -4, -5, -5, -5, -6, -6, -7, -7, -7, -7, -7, -6, -6, -6, -6, -6, -7, -7, -7, -6, -5, -4, -4, -5, -5, -5, -5, -5, -5, -5, -4, -4, -4, -4, -5, -5, -4, -3, -2, -2, -3, -3, -3, -3, -3, -4, -4, -3, -3, -3, -4, -5, -5, -5, -5, -4, -3, -2, -2, -2, -1, -1, -1, -1, -1, -2, -2, -2, -2, -2, -2, -2, -2, -2, -2, -2, -2, -2, -3, -3, -3, -3, -1, 1, 4, 7, 8, 9, 10, 11, 14, 19, 22, 23, 22, 19, 15, 11, 7, 4, 3, 1, 0, -2, -3, -3, -4, -4, -4, -5, -4, -3, -3, -2, -2, -1, -2, -2, -2, -1, 0, -1, -2, -4, -4, -4, -4, -5, -5, -6, -6, -7, -7, -7, -8, -8, -8, -7, -7, -7, -7, -8, -8]
7219hj%%JJKJ%%%%J%%j%%j%jjjj%JJ%KJKKj%%%%%kjjJ%jj%J%%%%%J%%%%%%j%%%J%%jk%%%%
7199gjJL%%j%%jJJKJJ%kjjJ%J%%j%j%J%%%%j%%J%%J%%%j%%%j%jjJ%JJj%j%%%%J%%%Jj%%j%
7180eJ%%%%J%%%%%%%%j%jj%%J%JJJJJJkkj%%%j%%J%JJj%%%jj%j%%%J%%J%%Jj%jjJJJ%%J%%
7161b%%%%%JJkk%j%j%%%j%JJ%j%J%J%%%%j%j%J%%j%%%JJjjj%%J%%%%%%%%%jJ%J%Jj%%%%%%
7141ejJ%Kj%jjjjjJJKKJJ%%J%%jjj%%%%%%%jJ%%%jj%%%jjj%jJK%%J%%j%%JJJ%%j%j%%%j%J
7122eJ%jjJ%%%%Jj%%j%J%%JJ%kjJJJ%%%jjjjjJJJJ%%%%%jJJJJJJ%j%j%jjj%%%%%%%%JJ%jj
7103dj%%J%%%%%%%%j%j%J%%%JJ%%%%%%jj%%J%%%%JJJ%%k%%j%%%JJ%J%Jjj%j%%%%jjj%%%%%
7083fJ%jk%%%%%%J%%%%%JJJJ%%J%kk%%%J%JJjJ%jjjjJ%J%%%%%%%%j%J%%j%%J%%%JJjjj%JJ
$$ y = [-8, -9, -9, -9, -8, -7, -5, -4, -4, -4, -4, -4, -3, -3, -3, -4, -4, -4, -5, -5, -6, -7, -8, -9, -9, -8, -7, -7, -5, -4, -2, 0, -1, -1, -1, -1, -1, -1, -3, -4, -5, -4, -4, -5, -6, -6, -5, -5, -5, -5, -5, -5, -4, -4, -4, -4, -4, -4, -4, -5, -5, -5, -5, -4, -4, -4, -5, -7, -7, -7, -7, -7, -8, -7, -4, -4, -4, -5, -5, -5, -6, -5, -4, -2, -1, 0, 0, -2, -3, -4, -3, -3, -2, -2, -2, -3, -3, -4, -4, -3, -3, -3, -3, -3, -4, -4, -4, -3, -3, -3, -2, -2, -2, -2, -3, -3, -3, -3, -4, -4, -5, -6, -5, -5, -4, -3, -4, -4, -5, -5, -5, -5, -5, -4, -4, -4, -4, -3, -4, -4, -4, -5, -5, -4, -4, -4, -4, -4, -3, -3, -3, -3, -3, -3, -3, -3, -3, -4, -4, -5, -6, -6, -6, -5, -5, -4, -3, -2, -1, 0, 1, -1, -3, -4, -4, -4, -4, -5, -5, -5, -4, -4, -3, -2, -3, -3, -3, -3, -4, -5, -5, -6, -6, -6, -6, -5, -5, -5, -4, -4, -4, -3, -4, -4, -5, -6, -5, -4, -3, -3, -3, -2, -2, -2, -2, -2, -2, -2, -2, -1, 0, -2, -4, -4, -5, -5, -6, -6, -6, -6, -7, -7, -6, -5, -5, -6, -6, -5, -5, -4, -4, -4, -4, -4, -5, -5, -6, -6, -5, -5, -5, -6, -6, -6, -6, -5, -4, -5, -6, -7, -7, -7, -6, -6, -6, -6, -6, -6, -6, -6, -6, -6, -7, -6, -6, -5, -5, -4, -5, -5, -5, -5, -5, -5, -5, -6, -5, -5, -3, -4, -4, -5, -6, -7, -8, -9, -8, -7, -5, -3, -2, -1, -1, -1, 0, 0, 0, -1, -2, -3, -3, -3, -3, -3, -3, -3, -3, -4, -3, -3, -3, -3, -4, -5, -5, -5, -5, -6, -7, -8, -8, -9, -8, -6, -6, -6, -5, -5, -5, -6, -6, -6, -5, -4, -3, -3, -3, -4, -4, -5, -5, -5, -5, -6, -6, -5, -4, -4, -5, -6, -5, -5, -5, -5, -5, -4, -5, -5, -5, -6, -6, -5, -5, -5, -4, -3, -3, -5, -6, -5, -4, -3, -3, -3, -3, -4, -5, -6, -7, -8, -7, -6, -5, -4, -4, -4, -4, -4, -4, -5, -4, -3, -2, -1, 0, 1, 1, 0, 0, -1, -1, -2, -3, -4, -4, -4, -4, -4, -4, -4, -4, -4, -3, -2, -2, -3, -4, -5, -5, -5, -4, -4, -4, -4, -4, -4, -4, -4, -4, -5, -5, -6, -6, -5, -5, -5, -5, -4, -3, -3, -3, -3, -3, -3, -3, -4, -5, -5, -5, -4, -4, -4, -4, -4, -3, -2, -1, -1, -1, -3, -3, -3, -4, -4, -4, -4, -3, -2, -2, -1, -1, 0, -1, -2, -2, -3, -3, -3, -3, -3, -4, -5, -6, -6, -6, -6, -6, -6, -5, -5, -6, -8, -8, -8, -8, -8, -8, -8, -7, -7, -7, -7, -7, -7, -6, -5, -4, -3, -3, -3, -2, -2, -4, -6, -6, -6, -6, -5, -5, -4, -3, -4, -3, -3, -4, -5, -6, -7, -6, -6, -5, -5, -5, -5, -5, -5, -5, -5, -5, -6, -6, -5, -5, -5, -6, -6, -6, -5, -5, -5, -5, -4, -3, -4, -5, -6, -6, -5, -4]
7064dJ%J%%%jj%%%%jJJ%J%J%J%%jjk%JJJ%%%j%j%j%%%j%%j%%%%%J%%%%%%%jj%J%%JJ%%%%j
7045e%j%%%JJJjjJJJj%%%%%j%j%%j%%j%jJJ%%jj%J%J%%JJJJ%%J%J%%jjjjj%%%%%%JjJ%J%%
7025cj%jJ%%%%J%%%jk%Jj%JJJ%%%%J%jjjjj%%jJJ%J%%%J%J%%J%J%%jjjkj%JJJ%%j%%%k%%J
7006f%J%Jjj%j%%%%%%%%%JJ%%%%jj%%%j%%JJJ%J%Jj%j%%%%jJJJJj%%j%%%%k%jjjJK%%j%jJ
6987gJ%%KJJJjj%%%j%%j%j%%%%%J%%%JJJ%%%%jj%J%%J%j%j%%%%%j%jJJ%J%%%%j%%%%%%%%j
6967e%%%%%%%JJ%%J%%%K%J%%%j%kkj%%%%J%J%%%%%%J%%J%J%J%%%%jjj%%Jj%jj%j%%JJJ%j%
6948cjJ%%%JJ%%%jjj%JJJ%%jj%j%JJ%j%%%%%%%k%k%%JK%%J%%%jJJ%%%%Jjjj%JJj%%%%%j%j
6929e%%j%J%%%j%KKJ%%%jjjj%jJ%%J%J%%J%%%%%%jj%%%J%J%J%J%%%jjjj%J%%%J%Jj%%jJJJ
$$ y = [-4, -3, -3, -2, -2, -2, -2, -3, -4, -4, -4, -4, -4, -5, -4, -3, -3, -2, -2, -1, -1, 0, 0, 0, -1, -2, -4, -4, -3, -2, -1, -1, -1, -1, -2, -2, -3, -3, -4, -4, -4, -4, -5, -5, -5, -6, -6, -6, -6, -6, -6, -5, -5, -5, -5, -5, -5, -5, -5, -6, -7, -7, -6, -6, -6, -5, -4, -4, -4, -4, -4, -5, -5, -6, -6, -6, -6, -5, -4, -3, -4, -5, -4, -3, -2, -3, -3, -3, -3, -3, -3, -4, -4, -5, -5, -5, -6, -6, -6, -7, -7, -8, -7, -6, -6, -6, -7, -8, -8, -7, -7, -6, -6, -6, -5, -4, -3, -2, -2, -2, -1, -1, 0, 0, 0, -1, -2, -3, -4, -5, -5, -5, -5, -5, -5, -5, -4, -5, -4, -4, -3, -3, -3, -4, -4, -5, -4, -4, -4, -4, -4, -3, -3, -3, -3, -4, -6, -6, -5, -6, -6, -5, -4, -3, -3, -3, -3, -3, -2, -2, -3, -4, -5, -6, -7, -7, -7, -8, -7, -6, -6, -5, -5, -5, -5, -4, -4, -3, -3, -3, -2, -2, -1, -1, -1, -2, -3, -4, -6, -7, -7, -6, -5, -4, -4, -4, -5, -5, -5, -5, -7, -7, -7, -6, -6, -5, -5, -4, -5, -6, -6, -7, -7, -7, -7, -7, -7, -7, -7, -7, -7, -6, -5, -5, -5, -5, -5, -6, -7, -7, -7, -7, -8, -8, -8, -7, -6, -5, -5, -4, -4, -3, -4, -4, -5, -5, -5, -5, -5, -6, -5, -4, -3, -2, -3, -3, -3, -4, -4, -4, -4, -4, -6, -6, -7, -8, -9, -8, -6, -6, -6, -7, -7, -8, -7, -6, -6, -6, -4, -3, -2, -1, -2, -3, -3, -3, -3, -4, -4, -4, -5, -5, -6, -6, -6, -6, -6, -6, -5, -5, -5, -5, -4, -3, -2, -2, -2, -2, -2, -3, -4, -4, -3, -3, -3, -2, -2, -3, -3, -4, -4, -4, -4, -4, -4, -5, -5, -6, -5, -4, -4, -3, -3, -3, -3, -3, -4, -4, -4, -4, -4, -4, -4, -4, -4, -5, -5, -5, -5, -5, -5, -5, -5, -4, -3, -3, -3, -2, -2, -2, -2, 0, 0, 1, 1, 1, 1, 0, 0, -2, -4, -5, -5, -5, -5, -5, -4, -4, -3, -3, -3, -3, -3, -3, -3, -2, -2, -2, -1, -1, 0, 0, 1, 1, 1, 1, 1, 0, -1, -2, -2, -2, -1, -2, -2, -3, -4, -4, -5, -5, -5, -4, -3, -2, -2, -3, -3, -4, -3, -3, -3, -3, -2, -1, -1, -1, -1, -2, -3, -4, -4, -3, -2, -1, -1, -1, -2, -3, -3, -4, -4, -3, -2, -2, -3, -3, -3, -3, -3, -3, -3, -3, -5, -5, -7, -7, -7, -6, -4, -4, -4, -3, -3, -3, -3, -4, -3, -2, -2, -2, -2, -2, -1, -2, -3, -4, -4, -3, -2, -3, -3, -3, -3, -3, -3, -4, -4, -5, -5, -5, -6, -6, -5, -5, -5, -5, -6, -6, -4, -2, -1, -1, -1, -1, -2, -3, -4, -5, -5, -6, -5, -5, -5, -4, -4, -3, -3, -3, -2, -2, -2, -2, -2, -2, -2, -3, -4, -4, -4, -4, -3, -3, -2, -2, -1, -1, 0, 0, 0, 0, -1, -2, -3, -4, -4, -3, -3, -3, -3, -2, -2, -1, -2, -2, -2, -3, -2, -1, 0]
6909@%J%jjjjj%%%JJ%%%%%%j%%j%%%JJ%%jj%JJ%jkk%JKJ%j%JJ%%%%%jj%j%%%j%%%JK%%j%%
6890d%%%JJ%%jj%%%%%J%%%%%Jjjj%JJ%%J%%%%J%J%%%j%j%%%jjjk%j%JJ%%K%J%J%%%jJ%%%%
6871b%jjjj%%J%%%%j%%%J%%%jjjJJ%J%jj%%J%%JJJJ%j%%%%j%%%J%j%j%%JJ%jjkj%%%J%%%%
6851gKJJKj%j%%j%j%%%%KJJJj%jj%j%jJJj%jj%JJJ%KJ%jjjj%jj%J%%%JKJ%%%Jjjj%%%%J%%
6832b%%J%J%%j%jjjjJ%JJ%j%%%%%%%J%%%j%j%%%%J%%J%j%%%jj%J%J%j%jj%JJJJ%jkjjj%%J
6812g%%J%JJJ%JJj%j%j%%%%%%%%%%%%%%J%%%%%%%%%%%jJJ%jj%%jJ%%%kk%JJ%%%%KKKJ%%kj
6793b%JJ%%%%jJ%%%j%%%%%%jjj%%JJ%%%%jjjJ%%%%j%%%J%J%J%%%%%J%%%%%%%%j%%j%jJJj%
6774cjjJ%Jj%%J%jjjJK%J%J%J%%kjJ%%J%%Jj%j%Jjj%%j%%JJj%%%%%%%%%JJ%kjjJ%%%J%JJ%
$$ y = [0, 0, 1, 1, 0, -1, -2, -3, -4, -4, -4, -4, -3, -2, -2, -2, -2, -2, -2, -2, -3, -3, -3, -4, -4, -4, -4, -3, -2, -2, -2, -3, -4, -4, -3, -2, -2, -3, -5, -7, -7, -6, -4, -3, -3, -4, -4, -3, -2, -2, -2, -2, -2, -2, -3, -4, -4, -5, -5, -5, -5, -6, -6, -6, -6, -5, -3, -3, -3, -4, -4, -4, -4, -4, -4, -3, -2, -2, -2, -3, -4, -4, -4, -4, -4, -4, -3, -3, -3, -3, -3, -3, -2, -3, -4, -5, -5, -4, -3, -3, -3, -2, -2, -2, -2, -2, -1, -1, 0, 0, 0, 0, -1, -1, -2, -2, -2, -2, -3, -4, -5, -7, -7, -8, -8, -7, -6, -6, -6, -4, -4, -3, -3, -2, -2, -2, -2, -3, -2, -2, -2, -2, -2, -2, -3, -4, -5, -6, -6, -6, -5, -5, -5, -5, -5, -6, -6, -6, -6, -5, -5, -5, -5, -6, -7, -8, -7, -6, -6, -5, -5, -6, -7, -7, -7, -6, -6, -6, -5, -4, -3, -2, -2, -3, -3, -3, -3, -3, -4, -4, -4, -4, -3, -3, -4, -4, -5, -5, -5, -4, -3, -3, -4, -5, -7, -8, -8, -8, -8, -7, -7, -7, -7, -7, -5, -4, -3, -1, -2, -2, -3, -3, -3, -4, -4, -5, -5, -5, -5, -5, -3, -2, -1, 0, -1, -1, -2, -3, -3, -4, -4, -5, -4, -3, -4, -4, -5, -6, -6, -5, -4, -3, -3, -1, 0, 0, -1, -2, -3, -4, -4, -5, -6, -6, -5, -5, -5, -5, -4, -2, -1, -1, -1, -1, 0, -1, -2, -3, -3, -3, -3, -3, -2, -2, -2, -2, -2, -1, -1, 0, 0, 0, -1, -1, -2, -3, -4, -5, -4, -4, -3, -2, -2, -3, -3, -3, -3, -3, -3, -3, -3, -2, -2, -2, -2, -3, -3, -4, -4, -4, -4, -4, -3, -3, -3, -2, -2, -3, -3, -3, -3, -4, -5, -5, -4, -4, -3, -3, -4, -4, -5, -6, -6, -5, -4, -3, -2, -2, -3, -5, -6, -7, -8, -8, -8, -7, -7, -7, -6, -6, -5, -4, -3, -3, -2, -1, -2, -2, -3, -3, -4, -4, -4, -4, -4, -4, -4, -4, -4, -4, -4, -4, -4, -4, -4, -3, -3, -3, -3, -3, -3, -3, -3, -3, -3, -3, -3, -4, -3, -2, -2, -3, -4, -4, -4, -5, -4, -4, -4, -4, -6, -8, -8, -7, -6, -6, -6, -6, -6, -4, -2, 0, 1, 1, 1, -1, -2, -2, -1, 0, 0, 0, 0, 0, -1, 0, 0, 0, 0, -1, -1, -1, -1, -1, -1, -1, -2, -3, -4, -4, -4, -3, -2, -2, -2, -2, -2, -3, -4, -5, -4, -4, -4, -4, -4, -5, -5, -5, -5, -4, -4, -3, -3, -2, -2, -2, -2, -2, -2, -1, -1, -1, -1, -1, -1, -1, -1, -1, -2, -2, -2, -3, -3, -4, -3, -2, -3, -3, -4, -5, -4, -4, -3, -4, -4, -4, -3, -3, -4, -5, -6, -5, -3, -3, -2, -2, -1, -1, 0, 0, 0, -2, -3, -2, -2, -2, -1, -1, -1, 0, -1, -1, -2, -2, -1, -2, -3, -3, -3, -4, -4, -4, -3, -2, -3, -3, -3, -3, -3, -3, -3, -3, -3, -3, -2, -1, -1, -3, -4, -5, -4, -4, -4, -4, -3, -3, -2, -1, -1]
6754aJj%jk%j%jJJJ%%j%j%%JKK%jkk%j%J%JJ%Jjj%%%%%j%jJ%%%%%%%JJ%Jj%j%jj%j%%%%%%
6735g%%J%J%J%J%%j%%%j%%%%j%%%JJJJ%%%%%%%J%Jj%%jJJ%jjJ%%j%j%j%%%JJJjkj%%JJJ%%
6716b%%%j%%%%%%%jjkj%JJ%%JK%%%K%%j%%j%%j%%%j%%%J%%%j%%J%j%%JJJJ%%%J%%%%jj%jj
6696dJ%%%%%%%%j%%j%j%%%%%%KJJ%%%%%jj%%%%%%%j%%%%%%J%%JJJjj%%%%j%%%j%JJ%%%j%j
6677e%%%%%%%%%J%%%%%%%%%%%%%%j%%%%j%JJJJJ%jjjk%jJJ%%jjJKJJ%J%%%%%j%%j%jj%j%%
6658fKKJj%j%%%%jj%KK%%jj%JJ%jjj%j%jJ%KK%%%%%%%%jj%j%%%J%JJJjj%j%jJ%JJ%%%%%%%
6638aj%%j%kj%JJ%%j%%j%j%J%JJ%JjjjjJJJJJJ%%%%%J%Jj%%%%%j%kkj%JKKJJjkj%%%%%%J%
6619b%%%Jj%%%%%%%%%%%%%%Jj%jjjj%J%Jj%J%J%%%%%%%j%JJJJJ%j%j%JJ%%j%%%%%%jjJJ%j
$$ y = [-1, 0, -1, -1, -2, -4, -4, -5, -5, -6, -5, -4, -3, -3, -3, -4, -4, -5, -5, -5, -4, -2, 0, 0, -1, -3, -5, -5, -6, -6, -5, -5, -4, -3, -3, -2, -3, -4, -4, -4, -4, -4, -4, -5, -5, -6, -5, -5, -5, -5, -5, -5, -5, -5, -4, -3, -3, -2, -3, -3, -4, -4, -5, -6, -6, -7, -7, -7, -7, -7, -7, -7, -7, -7, -6, -6, -5, -5, -4, -4, -3, -3, -3, -4, -4, -4, -4, -5, -5, -5, -5, -5, -6, -6, -6, -6, -5, -4, -3, -2, -2, -2, -2, -2, -2, -2, -2, -1, -1, 0, -1, -1, -1, -2, -1, 0, 0, -1, -2, -1, -1, -1, -2, -2, -3, -3, -4, -4, -4, -4, -3, -2, -1, -2, -4, -5, -5, -5, -4, -3, -2, -2, -2, -2, -2, -2, -3, -3, -3, -3, -3, -3, -3, -3, -4, -5, -7, -8, -8, -7, -6, -6, -6, -5, -3, -3, -3, -3, -1, -1, -1, -2, -2, -2, -3, -3, -3, -4, -4, -4, -4, -5, -5, -5, -5, -4, -4, -4, -4, -5, -5, -5, -4, -4, -5, -5, -5, -4, -3, -2, -1, -1, -1, -1, 0, 0, 0, 0, 0, -1, -2, -2, -3, -4, -3, -3, -3, -3, -3, -3, -3, -3, -3, -4, -4, -4, -5, -5, -6, -6, -6, -6, -6, -6, -6, -4, -3, -2, -2, -2, -2, -2, -2, -3, -4, -4, -4, -4, -4, -4, -4, -4, -5, -5, -5, -5, -5, -5, -5, -4, -4, -4, -3, -2, -1, -2, -3, -3, -3, -3, -3, -4, -4, -4, -4, -5, -5, -4, -3, -3, -3, -3, -4, -4, -5, -5, -5, -5, -5, -5, -5, -5, -5, -5, -4, -4, -4, -4, -4, -4, -4, -4, -4, -4, -4, -4, -4, -4, -4, -5, -5, -5, -5, -5, -6, -6, -5, -4, -3, -2, -1, -1, -2, -3, -4, -6, -6, -7, -6, -5, -5, -5, -6, -7, -6, -4, -3, -2, -2, -1, -1, -1, -1, -1, -1, -2, -2, -2, -3, -3, -4, -5, -5, -6, -6, -6, -4, -2, -1, -2, -2, -3, -3, -3, -3, -3, -4, -5, -5, -3, -1, -1, -1, -2, -3, -3, -2, -1, -1, -2, -3, -4, -4, -5, -5, -6, -5, -5, -3, -1, -1, -1, -1, -1, -1, -1, -1, -1, -2, -3, -3, -4, -4, -4, -4, -3, -3, -2, -1, 0, -1, -2, -2, -3, -3, -4, -3, -3, -2, -1, -1, -1, -1, -1, -1, -1, -1, -2, -2, -2, -3, -3, -5, -6, -6, -5, -4, -4, -4, -5, -5, -5, -6, -6, -7, -7, -6, -6, -5, -4, -4, -3, -4, -5, -6, -7, -6, -5, -4, -3, -2, -1, -1, -1, -1, -1, -1, 0, 0, 1, 0, 0, 0, 0, 0, 0, -1, -1, -3, -5, -6, -6, -5, -3, -1, 0, 1, 0, -2, -3, -3, -3, -3, -3, -3, -3, -2, -2, -2, -2, -2, -1, -2, -2, -2, -2, -2, -2, -2, -2, -2, -2, -2, -2, -2, -2, -2, -1, -2, -2, -3, -4, -5, -6, -6, -5, -5, -4, -5, -5, -4, -4, -3, -3, -3, -3, -3, -3, -3, -3, -4, -4, -3, -2, -1, 0, 1, 1, 0, 0, -1, -1, 0, 1, 1, 1, 0, 0, 0, 0, 0, 0, 0, -1, -2, -1, 0, 0, -1]
6600ajjj%J%%%kk%JKKJ%jjj%j%%%%%%%%%JJJj%%%%J%JjjjjJKJj%%%%%%j%%%JJ%Jjj%J%%%j
6580b%%jj%j%J%JJJ%jkk%KJKJK%%jj%jj%%J%%%jj%%j%%%%J%%J%J%jj%%%J%j%JJ%jjj%%%%%
6561d%%J%jjj%J%J%%%%J%JJ%%%%%%J%jj%j%JJ%j%%jJJjj%j%%%jj%%%%%%%%JKJ%%%Jj%%%j%
6542cJJ%%jj%J%%j%%%%jj%%%JJJJj%%jJ%%%jj%JJJJJj%%jjkjJ%%%%%%J%%%%%%%%J%K%jjk%
6522d%%J%j%j%%%%j%JJ%J%J%jjj%JJ%jj%JJ%j%%%%jjjJ%J%J%%%%jj%jkJ%%jJJJJ%j%%JKJJ
6503a%%j%jkjjJJj%%%%J%J%%%%jkJ%%j%%%JK%jjjJKJ%%%j%%%Jj%j%JJ%j%jjj%%J%J%jj%JJ
6484eJ%J%%jj%%%jjJJJJJjjJ%JJ%%%jj%%J%j%%%JJ%J%%%jj%jj%k%%%J%%J%%%%%%jj%J%J%J
6464cj%%JjjJJ%%%Jj%%%jj%%JJ%j%%%%%%%%%%%%%%%%jj%j%%%%j%JJKKj%j%Jj%%j%JJJJj%j
$$ y = [-1, -2, -3, -4, -4, -3, -3, -3, -3, -5, -7, -7, -6, -4, -2, -1, -1, -2, -3, -4, -4, -5, -5, -5, -5, -5, -5, -5, -5, -5, -5, -4, -3, -2, -3, -3, -3, -3, -3, -2, -2, -1, -2, -3, -4, -5, -4, -2, -1, -2, -2, -2, -2, -2, -2, -2, -3, -3, -3, -3, -2, -1, -1, 0, -1, -2, -2, -1, -1, -1, -1, -2, -2, -2, -3, -4, -4, -5, -5, -4, -4, -3, -2, -1, -1, -2, -4, -6, -6, -4, -3, -1, 0, 2, 2, 2, 1, 0, 0, -1, -2, -2, -2, -1, -1, -1, -1, -2, -3, -3, -3, -4, -4, -4, -4, -4, -3, -3, -3, -2, -2, -1, -1, -2, -3, -3, -3, -3, -2, -2, -3, -3, -2, -1, -1, -2, -3, -4, -4, -4, -4, -4, -4, -4, -4, -3, -3, -4, -5, -6, -6, -5, -5, -4, -4, -4, -4, -4, -3, -3, -2, -1, -1, -1, -1, -1, -1, -1, 0, 0, -1, -2, -2, -3, -3, -2, -1, -1, -2, -2, -2, -3, -2, -1, -2, -3, -3, -4, -4, -4, -4, -5, -6, -6, -6, -6, -6, -6, -6, -6, -6, -5, -3, -2, -2, -2, -2, -1, -2, -2, -2, -2, -3, -3, -2, -1, -1, -1, -2, -3, -3, -2, -2, -2, -3, -3, -3, -3, -3, -4, -5, -5, -5, -5, -4, -3, -2, -1, -2, -2, -2, -3, -2, -2, -2, -2, -3, -4, -4, -3, -2, -1, 0, 1, 0, 0, 0, -1, -2, -4, -5, -4, -4, -4, -4, -4, -4, -4, -3, -3, -3, -3, -3, -3, -3, -3, -3, -2, -2, 0, 0, -1, -2, -4, -4, -4, -4, -3, -3, -4, -4, -5, -5, -5, -5, -5, -6, -6, -5, -4, -4, -3, -3, -2, -2, -3, -4, -5, -5, -4, -3, -3, -4, -5, -5, -4, -3, -3, -4, -4, -4, -4, -4, -5, -6, -7, -6, -6, -5, -5, -4, -4, -4, -4, -4, -5, -6, -6, -7, -9, -8, -8, -8, -9, -8, -7, -6, -5, -5, -6, -6, -6, -5, -3, -2, -1, -1, -1, -2, -2, -3, -5, -6, -7, -6, -5, -6, -6, -6, -6, -6, -5, -5, -4, -4, -4, -4, -4, -5, -7, -6, -6, -6, -7, -7, -7, -7, -6, -4, -4, -5, -6, -7, -6, -4, -3, -3, -3, -3, -4, -4, -4, -4, -3, -4, -4, -5, -5, -4, -3, -3, -4, -4, -5, -6, -7, -7, -7, -6, -6, -5, -5, -6, -7, -7, -6, -5, -4, -4, -3, -3, -3, -4, -5, -5, -5, -5, -6, -7, -6, -5, -4, -3, -2, -3, -4, -3, -3, -2, -1, -1, -1, -1, -2, -3, -3, -3, -2, -2, -3, -3, -3, -3, -2, -1, -1, 0, 0, 0, 0, -1, -2, -2, -3, -4, -4, -6, -6, -6, -6, -5, -5, -5, -4, -4, -4, -4, -4, -4, -4, -5, -6, -6, -5, -5, -4, -4, -3, -4, -4, -4, -3, -4, -5, -4, -3, -3, -3, -3, -2, -3, -3, -3, -3, -4, -5, -5, -5, -4, -3, -3, -4, -4, -4, -4, -4, -4, -4, -4, -4, -4, -4, -4, -4, -4, -4, -4, -4, -5, -6, -6, -7, -7, -7, -7, -7, -8, -8, -7, -6, -4, -2, -3, -3, -4, -4, -3, -4, -4, -4, -5, -5, -4, -3, -2, -1, -2, -2, -3]
6445c%%JJJj%%jj%jj%J%%%%j%%%%%%%%jJJ%jjjJK%%jk%JJK%%%%j%%j%%j%JJ%%J%JJjj%jj%
6426eJJ%%J%%%%%%j%%J%%%%jjj%%%%K%%j%j%jJ%%J%J%jk%J%J%J%K%%jj%j%%%%%%%%%J%J%%
6406bj%j%%j%JJj%%%%jJJjj%%%%%JJJkjjj%J%%JJJ%%%%jJ%J%J%%Jj%%j%%%%jj%%j%j%j%JJ
6387e%JJ%Jj%J%%%Jjjj%%J%J%%%J%%j%%%%%%jj%jjj%J%J%JJ%%Jjlj%%%%%JJ%%%%J%J%Jjj%
6368dj%jjJKJ%%%Jj%%%%j%J%%%J%%%JJ%%%%%%%%%%jj%%jJJjj%%%J%%kj%J%Jkjjj%JJJ%%%%
6348e%J%%%%%%%%%%J%%j%%jjJ%KJJJ%%%%%j%%%%%%%j%jJ%%J%jk%J%%JJ%J%%j%j%%%%%j%j%
6329dJ%%%%J%%jJjjj%j%JJJJ%%%%j%%%%j%%jJJ%%%%j%%%%%J%J%j%%%j%J%%j%J%J%j%%J%jj
6309dj%%jj%KJ%%%JJ%%%K%%jjjkj%%JJJJjjjj%%j%J%JK%j%%%%j%%j%j%JK%%%jj%jjJKJ%kk
$$ y = [-3, -3, -3, -2, -1, 0, -1, -1, -1, -2, -3, -3, -4, -5, -5, -4, -4, -4, -4, -4, -5, -5, -5, -5, -5, -5, -5, -5, -5, -6, -5, -4, -4, -5, -6, -7, -6, -4, -4, -4, -5, -7, -7, -6, -5, -3, -3, -3, -3, -3, -4, -4, -4, -5, -5, -5, -6, -6, -5, -4, -4, -4, -3, -3, -2, -1, -2, -3, -3, -4, -5, -5, -4, -3, -3, -3, -2, -2, -2, -2, -2, -2, -2, -3, -3, -3, -2, -2, -2, -2, -2, -3, -4, -5, -5, -5, -5, -5, -3, -3, -3, -4, -4, -5, -5, -6, -5, -5, -5, -4, -4, -3, -3, -4, -6, -6, -5, -5, -4, -4, -3, -3, -1, -1, -1, -2, -3, -3, -4, -4, -4, -4, -4, -4, -4, -4, -4, -4, -3, -3, -2, -2, -2, -3, -3, -4, -4, -4, -5, -5, -4, -3, -4, -4, -4, -4, -4, -5, -4, -3, -4, -5, -5, -5, -5, -5, -5, -4, -3, -2, -4, -5, -6, -7, -7, -6, -6, -6, -5, -4, -3, -3, -3, -3, -3, -4, -3, -3, -2, -2, -1, -1, -1, 0, -1, -1, -1, -2, -2, -2, -2, -2, -3, -4, -4, -4, -5, -5, -6, -6, -7, -7, -6, -5, -5, -4, -3, -3, -2, -3, -3, -2, -2, -2, -2, -1, -2, -3, -4, -4, -4, -3, -3, -2, -2, -2, -2, -1, -1, -1, -2, -2, -2, -2, -2, -2, -2, -3, -4, -4, -5, -6, -7, -7, -6, -6, -5, -5, -4, -3, -3, -3, -2, -3, -6, -7, -7, -7, -7, -7, -7, -6, -5, -5, -5, -5, -5, -4, -4, -3, -3, -2, -3, -4, -4, -5, -5, -6, -7, -6, -4, -3, -3, -3, -3, -2, -3, -3, -3, -3, -3, -4, -4, -3, -3, -3, -3, -2, -2, -2, -2, -1, 0, 0, 0, 0, 0, 0, 0, 0, 0, 0, 0, -1, -2, -2, -2, -3, -2, -1, -2, -3, -3, -3, -3, -2, -2, -2, -4, -5, -5, -4, -4, -3, -5, -6, -7, -8, -8, -7, -6, -5, -5, -5, -5, -5, -5, -4, -4, -4, -4, -4, -4, -4, -4, -4, -4, -4, -3, -3, -3, -4, -4, -4, -5, -6, -5, -5, -3, -2, -1, 0, 0, 0, 0, 0, 0, -1, -1, -1, -1, -1, -1, -1, -1, -2, -2, -3, -2, -2, -2, -1, -1, -2, -4, -4, -3, -3, -3, -2, -1, -1, 0, 0, 0, -1, -1, -2, -2, -2, -2, -2, -2, -3, -3, -4, -4, -3, -3, -3, -3, -3, -2, -2, -2, -3, -2, -3, -4, -5, -5, -6, -6, -5, -4, -3, -2, -2, -2, -2, -2, -3, -3, -3, -3, -3, -4, -4, -4, -5, -4, -3, -3, -3, -3, -3, -4, -4, -4, -4, -4, -4, -3, -3, -2, -2, -3, -3, -3, -3, -4, -4, -3, -3, -3, -4, -4, -3, -3, -2, -2, -3, -3, -3, -2, -2, -3, -4, -5, -5, -5, -6, -7, -7, -5, -4, -4, -4, -4, -3, -2, -2, -2, -2, 0, 0, 0, -1, -2, -3, -5, -6, -6, -6, -5, -4, -3, -2, -3, -4, -5, -6, -6, -6, -7, -7, -6, -6, -5, -3, -3, -4, -4, -4, -4, -4, -5, -5, -5, -6, -6, -7, -7, -6, -4, -4, -4, -4, -5, -6, -6, -7, -8, -7, -5, -4, -4, -6, -8]
6290h%JJKJJ%J%J%jj%%%%%J%%jjjk%%%%jjjJJJJjjkj%KK%J%%J%J%J%%j%j%j%jKJKJ%jk%j%
6271dj%%%J%%%%%J%J%Jj%%%%%%%j%%j%%jj%JKJJ%%%%%j%J%%%%%%%%%%%%JJjk%%Jkjjj%JJJ
6251c%%%%%j%%%jjjJJ%%JJj%j%%%JJ%J%%Jj%%j%j%jJ%J%Jjj%JJjj%jJ%j%JJJ%J%j%%jj%%%
6232djjj%%J%%%JK%jk%%J%j%%J%J%j%%JJj%J%%j%%%%%%j%%%j%J%JJ%%JK%%jjjjj%%j%J%J%
6213dJ%%%%%j%%j%j%%%%%%J%%%%%jJ%%J%%j%%%j%%%J%%jJjjj%j%%JKJ%j%j%j%klkkjjjkkk
6193b6%JLLLMJJJJ%J%%J%JJ%%jj%%J%%%J%%jKKJjj%%jJJJJjjjj%%%%%%JJ%jjjj%KJ%j%J%%
6174bJ%%jjjjj%%j%JJJ%%j%j%KJJ%%%%j%Jjjj%j%%JJJJjj%jJJ%j%%%%j%J%%%%%%%J%%JJJj
6155ajjk%j%%JJ%Jjjj%J%%J%%%J%J%%j%jjJ%J%%JKJjjjj%%%%%%%%%%jjjjJJJ%%%%jj%J%KJ
$$ y = [-8, -8, -7, -6, -4, -3, -2, -2, -1, -1, 0, 0, -1, -2, -2, -2, -2, -2, -2, -1, -1, -1, -2, -3, -4, -6, -6, -6, -6, -6, -7, -8, -9, -8, -7, -6, -5, -6, -7, -9, -10, -10, -8, -6, -6, -5, -5, -5, -4, -4, -3, -3, -2, -2, -2, -3, -3, -4, -4, -5, -5, -6, -4, -3, -1, 0, 0, -1, -3, -3, -4, -4, -5, -5, -5, -5, -4, -4, -4, -4, -4, -4, -3, -3, -2, -2, -1, -2, -2, -2, -2, -2, -2, -2, -2, -3, -3, -3, -4, -4, -4, -5, -6, -6, -5, -3, -2, -1, -1, -1, -1, -1, -1, -2, -2, -1, -1, -1, -1, -1, -1, -1, -1, -1, -1, -1, -1, -1, 0, 1, 0, -2, -2, -2, -1, -3, -4, -5, -6, -6, -5, -4, -3, -3, -3, -3, -3, -3, -4, -4, -4, -4, -5, -6, -7, -6, -5, -5, -5, -4, -3, -4, -4, -5, -5, -5, -5, -4, -3, -3, -2, -2, -2, -1, -2, -2, -2, -3, -3, -4, -4, -5, -4, -4, -3, -3, -2, -3, -4, -4, -3, -2, -3, -4, -4, -5, -4, -4, -5, -5, -4, -3, -2, -2, -1, -1, -2, -2, -2, -3, -4, -4, -4, -4, -5, -6, -7, -7, -7, -6, -6, -6, -6, -5, -3, -3, -4, -6, -6, -6, -5, -5, -6, -6, -6, -5, -5, -4, -4, -5, -5, -5, -4, -3, -4, -4, -3, -3, -3, -4, -4, -4, -4, -4, -4, -4, -5, -5, -5, -5, -6, -6, -5, -5, -4, -3, -3, -3, -2, 0, 0, 0, -1, -2, -3, -4, -5, -5, -5, -6, -6, -5, -5, -4, -4, -3, -3, -3, -3, -3, -3, -4, -4, -4, -5, -5, -6, -6, -6, -6, -6, -6, -6, -5, -5, -5, -5, -5, -5, -6, -5, -5, -5, -4, -4, -4, -5, -5, -5, -5, -6, -6, -6, -6, -5, -5, -5, -6, -5, -6, -7, -8, -8, -9, -9, -9, -8, -6, -5, -5, -6, -6, -7, -7, -8, -8, -10, -13, -15, -17, -18, -19, -20, -22, -24, -26, -26, -25, -22, -19, -16, -12, -11, -10, -9, -8, -8, -7, -7, -7, -6, -6, -5, -4, -4, -4, -5, -6, -6, -6, -5, -5, -5, -5, -4, -4, -4, -5, -3, -1, 0, -1, -2, -2, -2, -3, -2, -1, 0, 1, 0, -1, -2, -3, -3, -3, -3, -3, -3, -3, -2, -1, -1, -2, -3, -4, -5, -5, -3, -2, -2, -3, -3, -2, -2, -2, -1, -1, -1, -2, -3, -4, -5, -6, -6, -6, -7, -7, -6, -5, -4, -4, -4, -5, -5, -6, -6, -4, -3, -2, -2, -2, -2, -2, -3, -3, -2, -3, -4, -5, -5, -6, -6, -6, -5, -4, -3, -2, -3, -4, -4, -5, -4, -3, -3, -4, -4, -4, -4, -4, -5, -5, -4, -4, -4, -4, -4, -4, -4, -4, -3, -3, -3, -2, -1, 0, -1, -2, -3, -5, -5, -6, -6, -6, -5, -4, -4, -3, -4, -5, -6, -6, -5, -5, -5, -4, -4, -4, -4, -3, -3, -2, -2, -2, -3, -3, -4, -5, -4, -4, -3, -3, -3, -2, 0, 1, 0, -1, -2, -3, -3, -3, -3, -3, -3, -3, -3, -3, -3, -3, -4, -5, -6, -7, -6, -5, -4, -4, -4, -4, -4, -5, -6, -6, -5, -5, -3, -2]
6136b%J%jjjj%%JJ%J%%%j%kj%%%%JJ%%j%%j%j%jJJJJ%JJ%%j%jJJJ%jj%J%%J%%%%jj%%j%%%
6116dj%%%%%%%%%%JJj%%J%%%jj%%j%JJJ%j%%Jj%Jj%J%%%%jj%%%%%%%%%%J%JK%%jj%jKJJj%
6097ajjjjJ%jjJJJJJ%kj%%JJK%kjjj%%j%J%%%jjJJJ%J%J%%j%j%%%%Jj%J%%%%%j%jk%JJJ%%
6078dj%%%j%%%jJJ%J%j%%%%%j%%JJ%jj%%%%%JJJJ%j%j%%%j%%J%jJ%%jj%JJJ%%%%KJJkjj%j
6058dJ%%jj%J%j%J%JJJJjjkj%J%jj%%%jjjjjkjj%%KJJJ%KJ%%%JJJ%%J%%%%%j%%%JJJj%%j%
6039cJjjjJJ%%%%%%%J%JJ%jkjjJ%%%%%%%Jj%j%%%%J%%%jjJ%JJJjjjJj%%%j%J%%%J%%J%%%%
6020c%%j%j%jj%J%%KJ%%jk%%%%%j%%K%%jJ%%%%%JJJJjjj%jkJ%JKJJj%jj%%%%jj%j%%J%JJ%
6000dJ%%%jjjj%JJ%j%%%J%%%JJJ%j%%j%%%%%%%%%JJJ%%jj%%jjJ%jj%Jj%%JJj%%JJ%%JJJjk
$$ y = [-2, -2, -1, -1, -2, -3, -4, -5, -5, -5, -4, -3, -3, -2, -2, -2, -2, -3, -3, -5, -6, -6, -6, -6, -6, -5, -4, -4, -4, -5, -5, -5, -6, -6, -7, -7, -8, -7, -6, -5, -4, -4, -3, -2, -2, -2, -3, -3, -4, -3, -2, -1, -1, -2, -3, -3, -2, -2, -2, -1, -1, -1, -1, -1, -2, -3, -3, -3, -4, -4, -4, -4, -5, -5, -5, -5, -5, -5, -5, -5, -5, -5, -5, -4, -3, -4, -4, -4, -3, -3, -3, -3, -4, -5, -5, -5, -6, -6, -5, -4, -3, -3, -4, -4, -4, -3, -4, -4, -3, -4, -4, -3, -3, -3, -3, -3, -4, -5, -5, -5, -5, -5, -5, -5, -5, -5, -5, -5, -4, -4, -3, -1, -1, -1, -2, -3, -3, -4, -2, -1, 0, -1, -1, -2, -3, -4, -5, -4, -4, -5, -6, -5, -4, -3, -2, -1, -1, -3, -4, -4, -4, -3, -2, 0, 0, -2, -3, -4, -5, -5, -5, -6, -6, -5, -5, -5, -5, -6, -7, -6, -5, -4, -4, -3, -3, -2, -2, -2, -3, -3, -4, -4, -4, -4, -4, -3, -4, -4, -3, -3, -3, -3, -3, -3, -4, -4, -5, -7, -7, -6, -5, -4, -4, -4, -5, -5, -5, -5, -6, -6, -6, -6, -7, -6, -5, -5, -4, -4, -5, -5, -5, -5, -5, -5, -6, -6, -6, -5, -4, -4, -5, -6, -6, -6, -6, -6, -6, -5, -4, -3, -2, -2, -3, -3, -4, -4, -4, -4, -5, -5, -5, -4, -4, -5, -4, -4, -4, -5, -6, -6, -5, -4, -3, -3, -3, -3, -3, -1, 0, 1, -1, -2, -3, -3, -4, -3, -3, -3, -4, -5, -5, -4, -4, -5, -5, -4, -4, -3, -2, -1, 0, -1, -2, -4, -5, -5, -4, -4, -5, -6, -6, -6, -6, -7, -8, -9, -10, -11, -13, -14, -15, -15, -15, -13, -12, -11, -10, -10, -8, -7, -7, -7, -7, -6, -5, -4, -4, -4, -3, -3, -3, -3, -3, -3, -4, -4, -4, -4, -3, -2, -1, -2, -2, -2, -3, -3, -2, -3, -4, -5, -4, -3, -3, -3, -3, -3, -3, -3, -3, -2, -2, -1, 0, 0, -1, -3, -4, -5, -4, -4, -4, -4, -4, -4, -4, -4, -3, -4, -4, -5, -5, -5, -5, -5, -4, -4, -4, -4, -5, -6, -5, -5, -4, -3, -2, -3, -4, -5, -4, -5, -5, -5, -5, -6, -6, -5, -5, -5, -5, -4, -4, -4, -3, -3, -3, -3, -3, -3, -3, -4, -4, -5, -5, -6, -7, -7, -6, -6, -6, -4, -3, -3, -3, -4, -6, -6, -6, -6, -6, -6, -7, -7, -7, -5, -5, -5, -6, -5, -5, -5, -5, -5, -5, -4, -3, -2, -1, -2, -3, -4, -4, -5, -7, -6, -6, -5, -3, -2, -1, -2, -2, -3, -4, -4, -4, -4, -4, -5, -6, -6, -7, -7, -7, -6, -6, -5, -4, -4, -3, -3, -3, -3, -4, -5, -6, -7, -7, -6, -5, -5, -6, -6, -6, -6, -5, -5, -5, -5, -4, -3, -2, -2, -3, -3, -3, -4, -4, -4, -4, -4, -4, -4, -4, -4, -4, -3, -2, -1, -1, -1, -2, -3, -3, -3, -4, -5, -4, -4, -5, -6, -6, -5, -6, -6, -6, -5, -4, -5, -5, -5, -4, -3, -3, -3, -2, -1, 0, -1, -3]
5981cjjj%%%%%%%%J%%%%%%%jj%JJ%%j%%J%%%%J%jJJK%jjjjj%J%%%J%%%%j%%J%%J%%JJ%%kj
5962djjJ%j%%J%J%%%%JJ%%jJ%%%%%%%%%%J%%%Jj%%JJ%%jjjj%%J%Jj%%jjjJ%%%%j%%%J%J%j
5942dj%JK%kj%%%%%%%%%%%%JJJJjjj%%Jj%Jjjjj%J%%J%%%JK%%%%JJ%j%jjj%%Jj%%K%J%%%j
5923bjj%j%K%%%%%%%%j%%%J%Jj%%%%%%%jJ%%%%JJ%J%%J%%jjj%%%jj%%JJJj%%JJ%J%jjjJ%j
5904bkjk%%JJ%%J%JJ%%%%Jj%j%j%%jJ%J%%%%J%%%%%%%j%%jk%%%jJ%J%%%j%%j%%j%KKJ%%J%
5884bJjjj%%jJ%J%%%j%%%%j%j%J%JJJJJ%J%jkk%jjj%J%%J%%%%%JJJjj%%JJJJ%%%%j%jJ%%%
5865a%%%%%jjjjJJJ%%%%j%%%%%%%Jjjjj%JKJ%j%%%J%j%%%%%%%j%%jKJ%%j%j%%JJJj%jj%%%
5845d%j%%%J%jjJJJJjjjj%jj%JJJJJ%%Jj%%jJJJJ%%j%jkJJ%%jk%J%jjjJK%%%JJ%%kj%j%JJ
$$ y = [-3, -4, -5, -6, -6, -6, -6, -6, -6, -6, -6, -6, -5, -5, -5, -5, -5, -5, -5, -5, -6, -7, -7, -6, -5, -5, -5, -6, -6, -6, -5, -5, -5, -5, -5, -4, -4, -5, -4, -3, -1, -1, -2, -3, -4, -5, -6, -6, -5, -5, -5, -5, -4, -4, -4, -4, -4, -5, -5, -5, -4, -4, -4, -3, -3, -3, -2, -1, -1, -1, -3, -4, -5, -6, -5, -5, -6, -6, -6, -5, -5, -4, -4, -4, -4, -4, -3, -2, -2, -2, -3, -2, -2, -2, -2, -2, -2, -2, -2, -2, -2, -2, -1, -1, -1, -1, 0, -1, -1, -1, 0, 1, 1, 1, 0, -1, -2, -3, -3, -3, -2, -2, -1, -2, -2, -2, -3, -4, -5, -4, -4, -4, -4, -4, -5, -5, -5, -5, -4, -4, -3, -3, -4, -5, -5, -4, -2, -2, -4, -5, -5, -5, -5, -5, -5, -5, -5, -5, -5, -5, -5, -5, -4, -3, -2, -1, -2, -3, -4, -4, -4, -3, -4, -4, -3, -4, -5, -6, -7, -7, -6, -6, -6, -5, -5, -5, -5, -4, -2, -2, -2, -2, -2, -1, 0, 0, -1, -1, -2, -3, -4, -4, -4, -3, -4, -4, -4, -2, -2, -1, -1, -1, -1, -2, -3, -4, -4, -5, -5, -3, -3, -3, -3, -3, -3, -3, -3, -3, -4, -4, -4, -4, -3, -3, -2, -3, -3, -3, -3, -3, -3, -3, -3, -4, -3, -3, -3, -3, -3, -2, -1, -1, 0, 0, 0, 1, 1, 1, 0, -1, -2, -2, -2, -2, -3, -4, -4, -4, -3, -2, -1, -2, -2, -2, -1, 0, 0, 1, 1, 0, -1, -2, -1, -1, -2, -4, -5, -7, -7, -7, -6, -5, -5, -5, -4, -4, -3, -2, -2, -2, -2, -2, -1, -2, -2, -3, -3, -4, -4, -4, -5, -4, -4, -3, -3, -3, -3, -3, -2, -2, -2, -2, -2, -2, -2, -2, -3, -3, -3, -4, -6, -6, -6, -6, -7, -6, -6, -5, -5, -5, -5, -6, -6, -6, -7, -7, -7, -8, -8, -6, -4, -3, -3, -3, -2, -2, -1, -2, -3, -4, -4, -4, -5, -4, -4, -3, -3, -3, -3, -4, -4, -4, -4, -4, -5, -5, -6, -6, -5, -5, -4, -3, -2, -1, 0, 0, 1, 1, 0, -2, -4, -4, -5, -6, -7, -7, -6, -6, -6, -5, -5, -5, -5, -5, -5, -4, -3, -2, -3, -4, -4, -4, -3, -2, -1, 0, 0, 0, 0, 0, -1, -1, -2, -1, -1, -1, -1, -1, -1, -1, -1, -1, -2, -3, -4, -5, -4, -3, -2, -2, -2, -2, -2, -3, -3, -3, -3, -3, -3, -3, -3, -2, -3, -4, -5, -6, -6, -5, -3, -2, -2, -3, -3, -3, -3, -2, -2, -3, -3, -3, -3, -3, -3, -3, -3, -4, -4, -4, -5, -3, -2, -2, -2, -3, -3, -4, -4, -4, -3, -2, -1, -2, -2, -3, -4, -4, -4, -4, -4, -5, -5, -5, -5, -4, -4, -5, -6, -5, -4, -3, -2, -3, -4, -5, -6, -6, -7, -8, -8, -7, -6, -5, -4, -3, -3, -3, -2, -3, -3, -3, -4, -3, -2, -1, 0, 0, 0, -1, -1, -2, -4, -3, -2, -2, -2, -3, -5, -5, -4, -4, -5, -6, -7, -6, -4, -4, -4, -4, -3, -2, -2, -2, -4, -5, -5, -6, -6, -5, -4]
5826dJ%jjj%%JJ%%%%jJJJ%Jj%Jjj%%%J%jjjJJK%jjJ%JJ%Jj%%%kjjj%%%JKJjj%%J%jj%j%jJ
5807e%%%j%j%%J%%%%%%JJJJJ%J%%%j%%j%j%JJ%%%%%%%%%%%%%%%%%j%%J%jkjk%%%%%J%J%%j
5787f%JJJ%j%%%%J%%J%J%j%%j%jj%JJ%%%J%%%j%%%j%%JjJJj%JJjjjJ%%%j%j%j%JJJ%%%K%j
5768bjjj%%jj%JJJ%jj%%%%J%J%%%%%%%%Jj%j%%JK%k%jj%J%j%%J%J%%JJJJjj%jj%jj%%%%%J
5749e%%%J%%%j%%%%J%%%J%%j%j%%j%%%%%%jj%%%%%%J%%%%%J%%%J%%j%JJkkj%JJ%jj%J%JJ%
5729f%%J%J%J%%J%J%%jj%%JjjJJ%jj%%%%%%%%%jjjj%%KKKKj%jj%j%j%%%%J%jjjKKJ%%%%%k
5710djj%%%%J%J%%%J%%%%%j%%%%JJJ%jjJJ%j%j%%JJ%%j%j%JJJj%j%kjjj%JJ%%JJ%%%%%%%%
5691cJ%j%%jk%%JJJjJ%J%%%%%j%j%jJ%JJJj%%%J%j%j%%%%%%%%%%%j%%%%%J%jjj%JJ%%J%J%
$$ y = [-4, -3, -3, -4, -5, -6, -6, -6, -5, -4, -4, -4, -4, -4, -5, -4, -3, -2, -2, -1, -2, -2, -1, -2, -3, -3, -3, -3, -2, -2, -3, -4, -5, -4, -3, -1, -1, -2, -3, -2, -2, -1, 0, 0, 1, 0, 0, 0, 0, -2, -3, -4, -5, -5, -5, -5, -4, -2, -1, -2, -3, -3, -3, -2, -2, -3, -4, -4, -5, -5, -6, -5, -5, -5, -5, -6, -6, -7, -7, -7, -6, -6, -6, -6, -6, -6, -6, -5, -4, -3, -2, -1, -1, 0, 0, 0, 0, -1, -1, -1, -2, -2, -3, -3, -2, -1, -1, -1, -1, -1, -1, -1, -1, -1, -1, -1, -1, -1, -1, -1, -1, -1, -1, -2, -2, -2, -1, -1, -2, -4, -5, -7, -7, -7, -7, -7, -7, -6, -6, -5, -5, -5, -6, -6, -5, -4, -3, -3, -4, -4, -4, -4, -4, -3, -3, -3, -2, -2, -1, -1, -2, -2, -2, -3, -3, -4, -5, -5, -4, -3, -3, -3, -3, -2, -2, -2, -2, -3, -3, -3, -3, -4, -4, -4, -3, -4, -3, -2, -3, -3, -2, -1, -2, -3, -4, -3, -3, -3, -3, -4, -4, -5, -5, -6, -6, -5, -4, -3, -3, -3, -3, -1, -1, -2, -3, -4, -5, -5, -5, -6, -7, -7, -6, -5, -4, -4, -5, -6, -6, -6, -6, -6, -5, -5, -4, -4, -4, -4, -4, -4, -4, -4, -4, -3, -4, -4, -5, -5, -5, -4, -2, -2, -4, -4, -5, -6, -6, -5, -5, -6, -6, -6, -5, -5, -4, -4, -4, -3, -2, -1, 0, -1, -2, -2, -3, -4, -4, -5, -6, -6, -6, -6, -6, -6, -5, -5, -5, -5, -4, -4, -4, -4, -5, -5, -5, -5, -5, -4, -4, -4, -4, -3, -3, -3, -4, -4, -5, -5, -5, -6, -6, -6, -6, -6, -6, -6, -7, -8, -8, -8, -8, -8, -8, -8, -7, -7, -7, -7, -7, -7, -6, -6, -6, -6, -5, -5, -5, -6, -6, -5, -4, -6, -8, -9, -9, -8, -7, -7, -8, -9, -9, -8, -8, -7, -6, -6, -6, -6, -5, -5, -4, -4, -3, -3, -3, -2, -2, -1, -1, -1, -2, -3, -3, -3, -2, -3, -4, -3, -2, -2, -3, -4, -4, -4, -4, -4, -4, -4, -4, -4, -4, -5, -6, -7, -8, -8, -8, -6, -4, -2, 0, -1, -1, -2, -3, -3, -4, -4, -5, -5, -5, -5, -5, -4, -4, -5, -6, -7, -5, -3, -2, -2, -2, -2, -2, -2, -4, -5, -6, -6, -6, -6, -6, -5, -5, -4, -4, -4, -4, -3, -3, -3, -3, -3, -3, -4, -4, -4, -4, -4, -3, -2, -1, -1, -2, -3, -2, -1, -1, -2, -2, -3, -3, -3, -2, -1, -1, -1, -2, -2, -3, -3, -2, -1, 0, -1, -1, -2, -2, -4, -5, -6, -7, -7, -6, -5, -5, -5, -4, -3, -3, -3, -3, -3, -3, -3, -3, -3, -2, -2, -3, -3, -3, -4, -6, -6, -6, -5, -4, -3, -4, -3, -3, -2, -2, -2, -2, -2, -2, -3, -3, -4, -4, -5, -4, -4, -3, -2, -1, -2, -2, -2, -2, -1, -1, -2, -2, -3, -3, -3, -3, -3, -3, -3, -3, -3, -3, -3, -3, -4, -4, -4, -4, -4, -4, -3, -3, -4, -5, -6, -6, -5, -4, -4, -4, -3, -3, -2, -2]
5671b%%%j%jjjJJj%%%JJJJ%%j%%jkj%%%KKK%J%jj%Jj%%%j%%%JjjjjJ%%%%J%%%%%%%%%j%j%
5652ejjKJKJ%j%%kkJJK%J%%%%%%jj%j%JkjJJ%Jj%j%j%JJ%%%%%kj%%%JJKJJj%j%J%%%%%Jjj
5633c%%%JJ%kkjjJ%%%JJJ%k%%JJ%%%j%J%%k%%%%%jj%%J%J%JK%%%j%%J%%%%jJJ%jk%jj%%J%
5613eJ%%%%%J%%jjJJJ%%j%%%%JJ%J%%%%jk%J%%%%J%%%jjjj%KKJjkkJ%j%%%%%%J%%%%%%%%%
5594dJ%jjk%%J%JJ%JJ%j%%J%%%%jjkkkJKKJ%J%%jj%%J%%jJJ%Jjjj%%j%j%jJJJJj%%%J%%J%
5575c%j%%%%j%%j%%JJ%%j%%jJJ%%%%%JJj%%%jjjJ%%JKJJjkjj%JJ%J%J%J%JJjj%j%j%%%%J%
5555a%j%%%%%%%j%%KJJjjj%%%%J%%%jj%j%%K%%jjj%JJ%%%jk%%%J%%j%%J%JJ%jj%JKJj%jj%
5536djJ%J%JJ%J%jj%jjk%J%JJj%%%%%%%%%j%%%%%%j%%%%J%%J%%%%%J%J%Jjjjj%jjJJJ%j%j
$$ y = [-2, -2, -2, -2, -3, -3, -4, -5, -6, -5, -4, -5, -5, -5, -5, -4, -3, -2, -1, -1, -1, -2, -2, -2, -3, -5, -6, -6, -6, -6, -4, -2, 0, 0, 1, 1, 0, -1, -1, 0, -1, -1, -1, -1, -2, -2, -2, -2, -1, -2, -3, -4, -5, -4, -4, -4, -4, -4, -3, -3, -3, -3, -3, -3, -3, -3, -3, -3, -4, -4, -5, -5, -6, -7, -5, -4, -2, -1, -1, -2, -2, -2, -4, -6, -5, -4, -2, -2, -1, -1, -1, -1, -1, -1, -1, -2, -3, -3, -4, -4, -3, -5, -6, -5, -4, -4, -3, -4, -4, -5, -5, -6, -6, -5, -4, -4, -4, -4, -4, -4, -6, -7, -7, -7, -7, -6, -5, -3, -2, -1, -2, -2, -3, -3, -2, -2, -2, -2, -2, -2, -1, -2, -3, -3, -3, -3, -2, -1, -1, -3, -5, -6, -7, -6, -6, -6, -6, -5, -4, -3, -3, -5, -5, -5, -4, -3, -3, -3, -3, -4, -4, -3, -3, -3, -5, -5, -5, -5, -5, -5, -6, -7, -7, -7, -6, -6, -5, -5, -4, -2, -2, -2, -2, -3, -3, -3, -2, -2, -2, -2, -2, -3, -2, -1, -1, -2, -4, -4, -5, -6, -6, -6, -5, -5, -4, -4, -4, -4, -4, -4, -3, -3, -3, -4, -5, -4, -3, -2, -2, -2, -3, -3, -3, -3, -3, -2, -1, -1, 0, 0, 0, 0, 0, -1, -3, -3, -2, -2, -2, -2, -2, -1, -1, -1, -1, -2, -3, -4, -5, -5, -3, -1, 0, -1, -3, -5, -4, -4, -5, -5, -5, -5, -5, -5, -5, -4, -4, -4, -4, -4, -4, -4, -4, -4, -4, -3, -3, -4, -5, -7, -7, -7, -6, -6, -5, -4, -4, -3, -2, -2, -3, -3, -3, -2, -2, -2, -2, -2, -3, -4, -6, -8, -10, -9, -7, -5, -4, -4, -3, -3, -3, -4, -5, -5, -5, -4, -4, -4, -5, -4, -3, -3, -2, -3, -4, -5, -5, -5, -6, -6, -7, -7, -8, -7, -6, -5, -4, -5, -5, -5, -5, -4, -4, -4, -3, -3, -3, -4, -4, -4, -4, -4, -5, -5, -5, -6, -6, -6, -5, -4, -4, -4, -5, -5, -5, -6, -5, -4, -4, -4, -4, -4, -4, -3, -2, -3, -3, -3, -3, -4, -5, -6, -5, -5, -5, -4, -2, -1, 0, -1, -3, -4, -5, -5, -4, -3, -3, -2, -2, -1, -1, 0, 0, 1, 2, 1, 0, 0, -1, -1, -2, -2, -2, -2, -2, -1, -1, -1, -2, -2, -2, -2, -2, -2, -2, -2, -3, -3, -3, -1, 0, 1, 0, -1, -2, -2, -2, -2, -2, -1, -1, -1, -1, -2, -3, -3, -4, -4, -4, -2, -2, -2, -3, -4, -5, -5, -4, -3, -3, -3, -3, -4, -6, -6, -6, -6, -5, -5, -5, -6, -6, -6, -5, -5, -4, -3, -3, -4, -5, -5, -4, -2, -1, -2, -2, -3, -4, -4, -5, -4, -4, -3, -3, -2, -1, -1, 0, 0, -1, -2, -2, -3, -4, -6, -6, -5, -5, -4, -3, -4, -4, -4, -4, -4, -4, -4, -4, -4, -4, -5, -5, -5, -5, -5, -5, -5, -6, -6, -6, -6, -6, -5, -5, -5, -4, -4, -4, -4, -4, -4, -3, -3, -2, -2, -1, -2, -3, -4, -5, -5, -6, -7, -6, -5, -4, -4, -5, -5, -6]
5517fJ%%%J%%%%J%J%%%kjj%%jJ%JJ%KJj%jjJJ%%%%%j%%j%j%JJJ%j%%j%%j%%%%J%%%J%%j%J
5497cJjjJ%j%%JJ%JJ%jjjjJJJ%J%Jkj%jJ%%Jj%%%jj%%%J%J%%Jj%%%jj%%J%%J%%%%JK%jjk%
5478c%JJ%%%j%JJKJj%kjkkJ%%%%%%%%J%J%jj%%%%JJK%jjjjj%jj%KK%jjjjJJK%J%%%%%Jjjj
5459dj%j%jJ%J%%%jjjjJKJ%JJ%%%%kj%%J%J%%%%%J%J%%j%%jj%%J%%%%j%%%jjjJ%J%%j%%%j
5439hJJJ%%%%%J%j%%jJ%J%J%J%%jjjJ%JJ%%%%%jJJJJjkjk%%%J%Jj%%%%%%JJjjj%%JJ%j%%%
5420d%%%%%JK%%jk%J%%%j%%%JJ%J%jjkjj%JJ%%JJJ%%%%%%%j%J%J%%j%%j%j%%%%jJJJ%kkj%
5401gKJJ%jj%J%%%%%%%%j%%j%JJ%%jJ%J%%JjjJ%%%%jjJKjj%%jJK%jk%%%%%j%J%J%J%jj%j%
5381f%%%%%JJ%J%j%%%%J%%%J%jjkj%JJ%%%J%j%JKJ%%%J%%%%jkjjj%JJJj%%jjj%%%%%J%%%%
$$ y = [-6, -5, -5, -5, -5, -4, -4, -4, -4, -4, -3, -3, -2, -2, -2, -2, -4, -5, -6, -6, -6, -7, -6, -6, -5, -4, -4, -2, -1, -2, -2, -3, -4, -3, -2, -2, -2, -2, -2, -2, -3, -3, -3, -4, -4, -5, -5, -4, -3, -2, -2, -3, -3, -3, -4, -4, -4, -5, -5, -5, -5, -5, -4, -4, -4, -4, -3, -3, -3, -4, -4, -3, -2, -3, -4, -3, -3, -4, -4, -4, -3, -2, -2, -1, 0, 0, -1, -2, -3, -4, -3, -2, -1, -1, 0, 0, 1, -1, -2, -2, -3, -2, -2, -2, -1, -2, -2, -2, -2, -3, -4, -4, -4, -4, -3, -3, -2, -2, -2, -1, -2, -2, -2, -2, -3, -4, -4, -4, -3, -3, -3, -2, -2, -2, -2, -2, -1, 1, 1, 0, -1, -3, -3, -3, -2, -1, -1, -1, -1, -2, -2, -1, 0, 2, 3, 2, 2, 0, -1, -3, -5, -4, -4, -4, -4, -4, -4, -4, -4, -4, -3, -3, -2, -2, -3, -4, -4, -4, -4, -4, -3, -2, 0, 0, -1, -2, -3, -4, -5, -5, -6, -7, -7, -5, -3, -3, -4, -5, -6, -7, -6, -5, -3, -3, -2, -2, -2, -2, -2, -2, -1, -2, -3, -4, -5, -5, -6, -6, -7, -6, -6, -5, -5, -5, -5, -6, -7, -8, -9, -8, -6, -5, -5, -4, -3, -3, -3, -3, -3, -5, -6, -6, -6, -5, -5, -4, -4, -4, -4, -4, -4, -3, -3, -2, -2, -2, -3, -3, -3, -4, -5, -5, -5, -4, -4, -4, -4, -4, -5, -5, -5, -5, -6, -7, -8, -7, -7, -6, -6, -6, -7, -7, -7, -7, -8, -7, -6, -5, -5, -5, -5, -5, -5, -4, -4, -5, -5, -5, -6, -5, -5, -4, -4, -3, -3, -2, -2, -2, -3, -4, -5, -4, -4, -3, -2, -2, -2, -2, -2, -2, -3, -2, -1, 0, 1, 0, -2, -3, -5, -5, -5, -5, -4, -4, -3, -4, -4, -4, -4, -4, -4, -4, -3, -2, -3, -4, -5, -5, -5, -4, -3, -3, -4, -4, -4, -4, -4, -4, -4, -4, -4, -3, -1, -1, -1, -2, -4, -4, -3, -3, -3, -3, -4, -4, -4, -4, -3, -2, -2, -1, -1, -2, -3, -5, -6, -7, -7, -6, -5, -5, -5, -4, -3, -2, -2, -2, -2, -2, -2, -2, -2, -3, -3, -2, -2, -1, -1, -1, -2, -2, -2, -3, -3, -4, -4, -4, -4, -4, -5, -4, -3, -2, -2, -4, -6, -7, -7, -5, -4, -3, -3, -4, -5, -5, -4, -4, -4, -4, -4, -4, -4, -4, -4, -5, -5, -5, -6, -6, -5, -4, -4, -4, -5, -4, -4, -3, -3, -3, -2, -3, -4, -3, -3, -3, -3, -3, -4, -5, -4, -2, -3, -4, -4, -4, -5, -4, -2, -2, -3, -5, -5, -5, -5, -5, -5, -6, -6, -5, -5, -4, -4, -3, -3, -4, -5, -5, -6, -6, -6, -6, -6, -6, -6, -5, -4, -4, -3, -3, -4, -4, -4, -4, -4, -3, -3, -3, -3, -2, -2, -3, -4, -6, -7, -7, -6, -5, -5, -5, -5, -4, -4, -5, -5, -4, -2, -1, -1, -1, -1, 0, 0, 0, 0, 0, -1, -3, -4, -5, -6, -6, -5, -4, -3, -4, -4, -4, -5, -6, -7, -7, -7, -7, -7, -7, -6, -6, -6, -6, -6]
5362f%%%%J%%%%%j%%J%jjKJJ%%%%j%%J%%%jjj%%%%%JJJJKj%kkjj%%KJ%Jjj%jJ%%%%%jjj%%
5342h%%J%%KK%jj%JJj%%%%%%%%%%J%%%%%%%J%JJJ%%jj%jkk%jJJj%j%%%JJ%J%%%%%j%%j%%J
5323e%%%%%%%%J%J%j%%JKJjkjj%%jjJ%j%J%J%%%%%%jJ%%%J%%%%%%%%J%J%%J%%jjkk%%K%JJ
5304cJ%JJJjj%j%%%%%j%jJJ%Jjjk%j%JJ%Jj%%J%%J%%%jjj%%%%%J%J%jkjJJ%J%%%%%j%%jJ%
5284e%J%%%JJ%%jjj%%JJJJJ%%%%j%%j%j%j%j%%J%%%j%JJJ%Jj%JJJ%%j%jj%j%%%%%j%%%j%J
5265dJ%J%%%j%%%%J%JJ%jjJ%%%%%%%%%%%%%j%%%%j%%j%%j%%J%JJ%%%%%j%j%jj%j%%J%%JJ%
5246d%%J%%j%%%%j%j%%JJ%J%%%%J%j%%jjjj%JJjj%%K%%%j%j%jJJJJ%%J%%%j%JJJJjj%JJjj
5226b%jj%JJ%JJ%%jjjj%%%%%J%%jJJJJjj%jjj%J%J%%%jj%j%%JJJJj%jjj%%%%%%%JJJjjj%%
$$ y = [-6, -6, -6, -6, -6, -5, -5, -5, -5, -5, -5, -6, -6, -6, -5, -5, -6, -7, -5, -4, -3, -3, -3, -3, -3, -4, -4, -4, -3, -3, -3, -3, -4, -5, -6, -6, -6, -6, -6, -6, -5, -4, -3, -2, 0, -1, -1, -3, -5, -6, -7, -7, -7, -5, -4, -4, -3, -4, -5, -5, -6, -5, -5, -5, -5, -5, -5, -6, -7, -8, -8, -8, -8, -8, -7, -7, -7, -5, -3, -3, -4, -5, -5, -4, -3, -4, -4, -4, -4, -4, -4, -4, -4, -4, -4, -4, -3, -3, -3, -3, -3, -3, -3, -3, -2, -2, -1, 0, 1, 1, 1, 0, -1, -1, -2, -4, -6, -6, -7, -6, -5, -6, -6, -7, -7, -7, -7, -6, -5, -5, -4, -4, -4, -4, -4, -4, -5, -5, -5, -6, -6, -6, -5, -5, -5, -5, -5, -5, -5, -5, -5, -4, -4, -3, -3, -4, -4, -4, -3, -1, 0, -1, -3, -4, -5, -5, -5, -6, -7, -6, -6, -7, -7, -6, -6, -5, -5, -5, -5, -5, -5, -5, -6, -5, -5, -5, -5, -4, -4, -4, -4, -4, -4, -4, -4, -4, -3, -3, -2, -2, -2, -1, -1, -1, -2, -3, -5, -7, -7, -7, -5, -5, -4, -3, -2, -2, -1, 0, 1, 0, -1, -1, -2, -2, -2, -2, -2, -2, -3, -3, -4, -3, -2, -2, -1, -2, -3, -5, -5, -6, -6, -5, -4, -4, -3, -4, -4, -4, -3, -3, -3, -2, -2, -2, -2, -3, -4, -5, -5, -5, -5, -5, -5, -4, -4, -3, -3, -4, -6, -7, -6, -5, -5, -4, -4, -4, -4, -4, -4, -5, -5, -5, -6, -5, -5, -5, -4, -4, -4, -4, -3, -2, -2, -2, -3, -4, -5, -5, -5, -4, -3, -2, -1, 0, 0, 0, 0, 0, -1, -1, -1, -2, -2, -3, -3, -4, -4, -5, -5, -5, -4, -4, -4, -4, -5, -5, -4, -3, -2, -2, -1, -2, -2, -1, 0, 1, 1, 1, 0, 0, -1, -2, -2, -3, -3, -3, -3, -3, -3, -4, -4, -4, -4, -5, -5, -4, -3, -3, -2, -2, -2, -2, -3, -3, -3, -3, -3, -2, -2, -1, 0, 0, -1, -2, -1, -1, -1, -1, -1, -1, -1, -1, -1, -1, -1, -1, -1, -1, -2, -2, -2, -2, -2, -3, -3, -3, -4, -4, -4, -5, -5, -5, -4, -4, -3, -2, -2, -2, -2, -2, -2, -3, -3, -4, -4, -5, -6, -6, -7, -7, -7, -6, -6, -6, -5, -4, -4, -4, -4, -3, -3, -3, -4, -4, -4, -4, -4, -5, -5, -6, -6, -6, -5, -4, -4, -3, -3, -3, -3, -3, -2, -2, -3, -3, -3, -4, -5, -6, -7, -7, -6, -5, -6, -7, -7, -7, -5, -5, -5, -5, -6, -6, -7, -7, -8, -7, -6, -5, -4, -4, -4, -3, -3, -3, -3, -4, -4, -3, -2, -1, 0, -1, -2, -2, -1, 0, -1, -2, -2, -3, -4, -4, -3, -2, -2, -1, 0, 0, 0, -1, -2, -3, -4, -4, -4, -4, -4, -4, -3, -3, -3, -4, -3, -2, -1, 0, -1, -2, -2, -3, -4, -5, -5, -4, -4, -3, -3, -3, -3, -4, -5, -5, -6, -6, -6, -5, -4, -3, -2, -3, -3, -4, -5, -6, -6, -6, -6, -6, -6, -6, -6, -5, -4, -3, -4, -5, -6, -6, -6]
5207f%jJ%J%J%J%JJJJjkj%JJJjjj%jJ%JJj%%j%jjJJ%j%jj%J%%%%JJJJ%%%J%%J%jjjjj%%%J
5188c%jj%%JJJjj%%%JKJ%j%jj%Jjj%%%J%Jj%%%%%%%%J%J%j%KK%kj%j%%%%%jJ%%JkjjJ%%J%
5168c%%%%%jJJJJjjkJ%J%%J%%%%%%%%j%%%%j%KJ%Jj%%jJJ%%%%Jkllkkk%J%JKL%%j%Jjj%j%
5149hJJJ%%%JJjj%%%JJ%j%%KJjjjJ%%%kj%%%J%%%%%J%j%%%%Jj%jJ%%%%%%Jj%%JJjjk%%J%J
5130e%J%%%%%%%%%%%%%JJJj%jj%J%%%j%jJJJJ%%jjjj%j%J%%%Jj%Jj%JJJj%k%JJ%%%jjj%JJ
5110dJ%%%%j%%%j%Jj%J%%%jjj%JJKJ%J%J%J%jjkj%j%j%%%%%%%%J%%%%%%%JJJJ%Jj%j%%jjk
5091f%%KJJ%%%%J%%j%j%jj%%%JJ%%j%jj%JJ%J%JJ%%%%%%%%%J%%j%%j%%jJ%%%%%%%J%jkjJj
5072ejjJ%%%%%%%%%%%J%%K%%%%%%%j%jjJJK%%%%%%JJ%jkkj%KJ%%j%j%%j%J%JJj%%jJJJ%%j
$$ y = [-6, -6, -7, -6, -6, -5, -5, -4, -4, -3, -3, -2, -1, 0, 1, 0, -2, -3, -3, -2, -1, 0, -1, -2, -3, -3, -4, -3, -3, -2, -1, -2, -2, -2, -3, -3, -4, -5, -4, -3, -3, -4, -4, -5, -6, -6, -5, -5, -5, -5, -5, -4, -3, -2, -1, -1, -1, -1, 0, 0, 0, 1, 1, 0, -1, -2, -3, -4, -4, -4, -4, -3, -3, -4, -5, -5, -5, -4, -3, -2, -3, -4, -4, -4, -4, -3, -1, 0, 0, -1, -1, -2, -3, -3, -2, -3, -4, -4, -4, -4, -3, -3, -2, -3, -3, -3, -3, -3, -3, -3, -3, -3, -2, -2, -1, -1, -2, -2, 0, 2, 2, 0, -1, -1, -2, -2, -2, -2, -2, -2, -3, -2, -2, -2, -1, -3, -4, -5, -4, -4, -4, -3, -3, -3, -3, -3, -3, -3, -4, -3, -2, -1, 0, -1, -2, -4, -3, -3, -2, -2, -2, -1, -1, -1, -1, -1, -1, -1, -1, -1, -2, -2, -2, -2, -2, -3, -3, -1, 0, 0, 1, 0, 0, 0, -1, 0, 1, 1, 1, 1, 1, 2, 0, -3, -6, -8, -10, -12, -12, -11, -11, -10, -8, -5, -5, -5, -6, -6, -5, -6, -7, -7, -8, -8, -7, -6, -5, -5, -5, -5, -4, -3, -4, -5, -5, -5, -5, -4, -3, -3, -4, -4, -4, -2, -1, -2, -3, -4, -3, -3, -3, -3, -5, -6, -6, -6, -6, -5, -5, -5, -5, -5, -5, -4, -4, -5, -5, -5, -5, -5, -4, -5, -5, -6, -5, -5, -5, -5, -5, -5, -5, -4, -5, -5, -5, -4, -3, -4, -5, -7, -7, -7, -6, -6, -5, -5, -4, -4, -4, -4, -4, -4, -4, -4, -4, -4, -4, -4, -4, -4, -3, -2, -1, -2, -2, -3, -4, -4, -3, -3, -3, -3, -4, -4, -5, -4, -3, -2, -1, -1, -1, -2, -3, -4, -5, -5, -6, -6, -5, -5, -5, -5, -4, -5, -5, -4, -5, -5, -4, -3, -2, -3, -3, -5, -5, -4, -3, -3, -3, -3, -4, -5, -6, -6, -5, -4, -3, -3, -3, -3, -3, -4, -4, -4, -4, -5, -5, -4, -5, -5, -4, -4, -4, -4, -5, -6, -7, -7, -6, -5, -3, -2, -2, -1, -1, 0, 0, 1, 1, 0, -1, -3, -4, -4, -5, -5, -6, -6, -6, -6, -6, -6, -6, -6, -6, -5, -5, -5, -5, -5, -5, -5, -5, -4, -3, -2, -1, -1, 0, -1, -1, -2, -2, -2, -3, -4, -6, -6, -6, -4, -3, -2, -2, -2, -2, -2, -1, -1, -1, -2, -2, -3, -3, -4, -5, -5, -5, -5, -4, -3, -3, -3, -4, -4, -5, -6, -6, -5, -4, -4, -3, -3, -2, -1, -1, -1, -1, -1, -1, -1, -1, -1, -1, 0, 0, 0, -1, -1, -1, -2, -2, -2, -3, -2, -2, -2, -2, -2, -2, -2, -2, -1, -1, -2, -4, -5, -4, -5, -6, -7, -6, -6, -6, -6, -6, -6, -6, -6, -6, -6, -6, -6, -5, -5, -5, -3, -3, -3, -3, -3, -3, -3, -3, -4, -4, -5, -6, -5, -4, -2, -2, -2, -2, -2, -2, -2, -1, 0, 0, -1, -3, -5, -6, -6, -4, -3, -3, -3, -4, -4, -5, -5, -5, -6, -6, -5, -5, -4, -3, -4, -4, -4, -5, -4, -3, -2, -2, -2, -3]
5052c%j%jj%%KJ%%j%%%j%JJJ%%j%J%Jjjj%j%JJ%%%J%%J%%%%jJ%j%%J%j%j%J%%%%jjj%j%J%
5033eJj%j%%%jJ%%%%j%%JJ%%j%j%%%%%%%%%%J%JJjj%j%J%%KK%jjkj%%%JJJJ%%%%%%%%%%j%
5014djj%JJ%%%%j%JJJJ%jjkj%%JJJjj%j%J%JJJ%%%J%jj%%JJJjjjjjj%%JKK%j%jj%JKJj%j%
4994bjJjkjjJJJJ%%J%J%%jj%%J%%%%%%%%%%j%%%%%%%Jjjj%j%%j%jj%JKJJ%j%jJJ%J%%%%%j
4975d%%j%%%%%%j%%%j%J%%%%JJ%%%J%JJJ%j%%%%J%j%%j%%%%jJ%jjk%%%%%%J%%J%K%JJ%J%j
4956@jjjj%%%%%J%J%%j%%j%%jJJJJjjj%j%KJJjj%jj%J%%%%jJjjJJ%%J%KJJ%%j%j%J%jjjJ%
4936b%%j%%j%%KJJj%%%jjjJJ%Jj%j%%Jj%j%%J%%J%%jkj%J%J%%J%j%jjjj%%JKJ%%J%%%%%J%
4917b%J%j%jj%%%%%%%%j%J%%J%JJ%%J%kkjjJ%J%Jj%%j%%J%j%%jJ%JJ%%%%%%%%%%%jJJJJ%%
$$ y = [-3, -3, -4, -4, -5, -6, -6, -6, -4, -3, -3, -3, -4, -4, -4, -4, -5, -5, -4, -3, -2, -2, -2, -3, -3, -2, -2, -1, -2, -3, -4, -4, -5, -5, -4, -3, -3, -3, -3, -2, -2, -2, -1, -1, -1, -1, -1, -2, -1, -1, -2, -2, -2, -1, -1, -2, -2, -3, -3, -2, -2, -2, -2, -2, -3, -4, -5, -5, -6, -6, -5, -5, -4, -5, -5, -6, -6, -6, -6, -7, -6, -6, -6, -6, -6, -7, -7, -7, -6, -5, -5, -5, -6, -6, -7, -7, -7, -7, -7, -7, -7, -7, -7, -7, -7, -6, -6, -5, -4, -5, -6, -6, -7, -7, -6, -6, -6, -4, -2, -2, -3, -4, -6, -7, -7, -7, -7, -6, -5, -4, -3, -3, -3, -3, -3, -3, -3, -3, -3, -3, -3, -4, -4, -5, -6, -6, -5, -4, -4, -4, -4, -4, -5, -5, -4, -3, -2, -1, -1, -2, -3, -5, -6, -6, -6, -5, -4, -3, -4, -5, -5, -6, -6, -5, -5, -4, -3, -2, -2, -2, -2, -1, -1, -2, -3, -3, -3, -2, -1, 0, -1, -2, -3, -4, -5, -6, -6, -6, -5, -3, -1, -1, -2, -2, -3, -4, -4, -3, -1, 0, -1, -1, -2, -2, -3, -2, -3, -5, -6, -7, -6, -5, -4, -3, -3, -3, -2, -2, -1, -1, -1, -2, -3, -3, -3, -2, -2, -2, -2, -2, -2, -2, -2, -2, -2, -2, -3, -3, -3, -3, -3, -3, -3, -3, -2, -3, -4, -5, -5, -6, -6, -6, -7, -7, -8, -9, -9, -8, -6, -5, -4, -4, -5, -5, -6, -5, -4, -4, -3, -3, -3, -3, -3, -3, -4, -4, -4, -5, -5, -5, -5, -5, -5, -5, -6, -6, -6, -6, -7, -7, -6, -6, -6, -6, -6, -5, -4, -4, -4, -4, -3, -3, -2, -1, 0, 0, -1, -1, -1, -1, -1, 0, 0, -1, -1, -1, -2, -2, -2, -2, -2, -3, -2, -2, -3, -4, -6, -6, -6, -6, -6, -6, -6, -5, -5, -5, -4, -4, -2, -2, -1, 0, 0, 1, 1, 0, -1, -2, -3, -4, -4, -4, -4, -4, -4, -3, -3, -2, -2, -2, -3, -3, -3, -4, -4, -4, -5, -4, -3, -2, -1, -2, -3, -4, -4, -5, -5, -3, -2, -1, -2, -3, -3, -4, -5, -5, -4, -4, -4, -4, -4, -5, -4, -5, -6, -5, -4, -4, -4, -3, -3, -1, 0, 1, 1, 1, 0, 0, -1, -1, 0, 0, -1, -2, -3, -2, -2, -2, -2, -3, -3, -3, -4, -4, -4, -2, -1, 0, -1, -1, -1, -1, -2, -3, -4, -3, -2, -2, -1, -2, -2, -3, -3, -3, -2, -3, -3, -4, -4, -4, -3, -3, -3, -2, -2, -2, -3, -5, -6, -6, -5, -5, -4, -4, -4, -3, -3, -4, -4, -5, -6, -7, -8, -8, -8, -7, -5, -4, -4, -4, -3, -3, -3, -3, -3, -3, -2, -2, -2, -1, -1, -2, -2, -3, -4, -4, -4, -4, -4, -4, -4, -4, -4, -5, -5, -4, -4, -4, -3, -3, -2, -1, -1, -1, 0, 0, -2, -4, -5, -6, -5, -5, -4, -4, -3, -4, -4, -4, -5, -5, -5, -4, -4, -5, -5, -5, -6, -5, -5, -4, -3, -3, -3, -3, -3, -3, -3, -3, -3, -3, -3, -3, -4, -3, -2, -1, 0, 0, 0]
4898@kjj%J%kkj%%JJJj%%%%JJ%%%j%J%%Jkj%J%%J%JJ%J%j%%%%%%%j%j%%j%j%%K%%j%j%%%J
4878eJJJ%J%JkjjjjjJ%%%%%JJJJjj%%%J%Jjj%jj%%JJJJJ%j%%j%%%jjj%%%Jj%JJJJjkk%JJ%
4859ej%j%J%%J%%%%j%%%%%%%%%%%%%%%%%jj%%KKJ%%j%j%j%%%j%%%%%JJJ%J%%%%j%j%%%j%%
4839fJ%%%J%J%%%Jj%JJ%j%%j%%%j%%J%%KJJjkj%jJ%Jj%%%%%%%j%%%%%%%%JJJJjjkjJ%%JJ%
4820bjj%%JJ%jJ%%%j%JJ%%k%%jkj%%JJ%j%JJ%%%%j%JJ%jj%jJ%J%j%%JJ%%JJJ%%j%jjj%%%K
4801bJ%%%j%j%%JJj%%%%J%%j%j%%%%%J%%%j%J%J%jj%%KJ%jjj%%%JJ%%jj%%j%j%jJ%%JJJjj
4781djj%%%J%jJ%%%%J%%%j%%%J%J%J%Jjj%j%%%%%%%%%jj%%J%Jkjj%Jj%J%JJjj%%K%%%%J%%
4762dJ%%%%%JJJ%j%%j%%jJJ%jjj%jj%%J%J%%%j%%jJJJJjJJ%%%%j%j%%%%%%J%%%%%%jj%j%%
$$ y = [0, -2, -3, -4, -4, -3, -3, -5, -7, -8, -8, -8, -7, -6, -5, -6, -6, -6, -6, -6, -5, -4, -4, -4, -4, -5, -5, -4, -4, -4, -3, -5, -6, -6, -5, -5, -5, -4, -4, -3, -2, -2, -1, -1, -2, -2, -2, -2, -2, -2, -2, -2, -3, -3, -4, -4, -4, -5, -5, -6, -6, -6, -4, -4, -4, -5, -5, -6, -6, -6, -6, -5, -4, -3, -2, -2, -1, -1, 0, -2, -3, -4, -5, -6, -7, -6, -6, -6, -6, -6, -6, -5, -4, -3, -2, -3, -4, -4, -4, -4, -3, -3, -2, -3, -4, -4, -5, -6, -6, -6, -5, -4, -3, -2, -1, -1, -2, -2, -2, -3, -3, -3, -3, -4, -5, -6, -6, -6, -6, -5, -6, -6, -5, -4, -3, -2, -3, -5, -7, -7, -6, -5, -5, -6, -6, -7, -7, -6, -6, -6, -5, -5, -5, -5, -5, -6, -6, -6, -6, -6, -6, -6, -6, -6, -6, -6, -6, -6, -6, -6, -6, -6, -6, -7, -8, -8, -8, -6, -4, -3, -3, -3, -4, -4, -5, -5, -6, -6, -6, -6, -7, -7, -7, -7, -7, -7, -6, -5, -4, -4, -3, -3, -3, -3, -3, -4, -4, -5, -5, -5, -5, -6, -6, -6, -5, -5, -5, -5, -4, -4, -3, -3, -3, -3, -2, -3, -3, -2, -1, -1, -2, -2, -2, -3, -3, -3, -3, -4, -4, -4, -3, -3, -3, -1, 0, 1, 0, -2, -3, -3, -4, -3, -3, -2, -3, -3, -3, -3, -3, -3, -3, -3, -4, -4, -4, -4, -4, -4, -4, -4, -4, -3, -2, -1, 0, -1, -2, -4, -5, -4, -4, -4, -3, -2, -2, -3, -4, -4, -4, -3, -2, -2, -3, -2, -2, -2, -2, -3, -3, -2, -1, -1, -1, -3, -3, -3, -4, -6, -7, -7, -7, -6, -5, -5, -6, -6, -5, -4, -4, -4, -4, -4, -5, -5, -4, -3, -3, -4, -5, -5, -6, -5, -5, -4, -4, -5, -5, -5, -4, -3, -3, -3, -2, -1, 0, 0, 0, -1, -1, -2, -3, -4, -4, -4, -4, -2, -1, -1, -1, -1, -2, -2, -3, -3, -3, -2, -1, -2, -2, -2, -2, -2, -1, -1, -1, -2, -2, -3, -3, -3, -3, -3, -3, -2, -2, -2, -2, -3, -3, -2, -2, -1, -1, -2, -3, -3, -3, -1, 0, 0, -1, -2, -3, -3, -3, -3, -2, -1, -1, -1, -2, -3, -3, -3, -4, -4, -5, -5, -6, -5, -5, -5, -4, -3, -2, -3, -4, -5, -6, -6, -6, -6, -5, -5, -6, -5, -5, -5, -5, -5, -4, -4, -4, -4, -5, -5, -5, -5, -4, -4, -3, -3, -2, -2, -1, -2, -3, -3, -4, -4, -4, -4, -4, -4, -4, -4, -4, -4, -5, -6, -6, -6, -5, -5, -4, -6, -7, -8, -8, -7, -8, -8, -7, -7, -6, -5, -6, -7, -7, -7, -5, -5, -5, -5, -5, -4, -4, -4, -3, -3, -3, -3, -3, -3, -2, -1, 0, 0, -1, -1, -1, -2, -2, -2, -3, -2, -1, -1, -2, -3, -4, -4, -5, -6, -6, -6, -5, -5, -4, -4, -4, -4, -5, -5, -5, -6, -5, -4, -3, -2, -3, -2, -1, -1, -1, -1, -1, -2, -2, -3, -3, -3, -3, -3, -3, -3, -2, -2, -2, -2, -2, -2, -2, -3, -4, -4, -5, -5, -5]
4743eJ%%j%%%JJ%%%%%%%%%%J%%%%%%%j%%%%%%%%%%jjjjj%JJ%JJJJ%%Jjj%jJ%%%%JJjj%%jj
4723e%JJ%%j%JJJ%J%kk%jJJ%J%J%%%%j%%jJ%%J%j%%j%j%jjjj%J%JJJJJ%%%%%j%%J%j%jj%%
4704eJJj%%j%jJ%J%%%%jJ%%%%JKj%j%j%%%%jjjjJ%J%J%%jJ%J%%JJJJ%kjjj%jjjJJK%j%J%J
4685c%J%%j%%J%%%%%%%J%%jkj%%JJJjj%%j%%%JJJ%%%%%%%%j%%%kjJ%KJJJ%%%%jjjj%%%%%%
4665d%%%%J%JJ%j%J%jkj%JJJJj%%%J%%jj%j%J%J%%%%%%%%J%jjkj%%%%J%J%%J%Jj%%%%%%%J
4646b%%j%%%%%%%%%%j%jjJJ%j%j%J%%J%%%%jj%JJ%%%%jkjjJ%%J%%JJJJJ%J%JkkjKJ%%%%%%
4627bJ%jkjj%Jj%%%%%%%%%j%J%J%%%jJ%j%%%%%%%%%j%%%jJ%J%J%J%%%j%%%%j%%%JJJjkjjJ
4607g%%JJ%Jj%%J%JJj%%%%j%%J%jj%%jj%J%Jj%j%J%J%KJ%j%J%%jkkJJJ%%%%j%%J%Jj%j%%%
$$ y = [-5, -4, -4, -4, -5, -5, -5, -5, -4, -3, -3, -3, -3, -3, -3, -3, -3, -3, -3, -3, -2, -2, -2, -2, -2, -2, -2, -2, -3, -3, -3, -3, -3, -3, -3, -3, -3, -3, -3, -4, -5, -6, -7, -8, -8, -7, -6, -6, -5, -4, -3, -2, -2, -2, -1, -2, -3, -3, -4, -3, -3, -3, -3, -3, -2, -1, -2, -3, -3, -3, -4, -5, -5, -4, -3, -3, -3, -4, -4, -3, -2, -1, -1, 0, 0, -2, -4, -4, -5, -4, -3, -3, -2, -2, -1, -1, -1, -1, -1, -2, -2, -2, -3, -2, -2, -2, -1, -1, -2, -2, -2, -3, -3, -4, -4, -5, -6, -7, -8, -8, -7, -7, -6, -5, -4, -3, -2, -2, -2, -2, -2, -2, -3, -3, -3, -2, -2, -3, -3, -4, -5, -5, -5, -4, -3, -4, -4, -4, -5, -5, -6, -5, -5, -4, -4, -4, -4, -4, -5, -4, -4, -4, -4, -4, -3, -1, -2, -2, -3, -3, -4, -4, -4, -4, -4, -5, -6, -7, -8, -7, -7, -6, -6, -5, -5, -5, -6, -5, -5, -4, -4, -4, -3, -2, -1, 0, 0, -2, -3, -4, -5, -5, -6, -7, -8, -7, -6, -4, -4, -5, -5, -4, -4, -3, -3, -2, -2, -2, -3, -3, -3, -2, -2, -2, -2, -2, -2, -2, -2, -1, -1, -1, -2, -4, -5, -5, -5, -4, -3, -2, -3, -4, -4, -4, -5, -5, -5, -5, -4, -3, -2, -2, -2, -2, -2, -2, -2, -2, -2, -3, -3, -3, -3, -5, -6, -5, -5, -3, -2, -1, 0, 0, 0, 0, 0, -1, -2, -3, -4, -4, -4, -4, -4, -4, -4, -4, -4, -4, -4, -3, -3, -2, -1, -1, -2, -2, -1, -1, -2, -4, -5, -5, -4, -3, -2, -1, -2, -2, -2, -2, -1, -1, -1, -2, -3, -3, -4, -4, -3, -3, -2, -2, -2, -2, -2, -2, -2, -2, -2, -1, -1, -2, -3, -5, -6, -6, -6, -6, -6, -5, -5, -4, -4, -4, -3, -3, -2, -3, -3, -3, -3, -3, -3, -3, -3, -2, -2, -2, -3, -3, -3, -3, -3, -3, -3, -3, -3, -3, -3, -4, -4, -5, -6, -5, -4, -4, -5, -5, -6, -6, -5, -5, -5, -4, -4, -4, -4, -4, -5, -6, -6, -5, -4, -4, -4, -4, -4, -5, -7, -8, -9, -8, -8, -8, -7, -7, -7, -6, -5, -4, -3, -2, -2, -1, -1, 0, -2, -4, -5, -3, -2, -2, -2, -2, -2, -2, -2, -1, -1, -2, -4, -5, -6, -6, -5, -6, -6, -6, -6, -6, -6, -6, -6, -6, -6, -7, -7, -6, -6, -5, -5, -5, -5, -6, -5, -5, -6, -6, -6, -6, -6, -6, -6, -6, -6, -6, -7, -7, -7, -7, -8, -7, -7, -6, -6, -5, -5, -4, -4, -4, -4, -5, -5, -5, -5, -5, -6, -6, -6, -6, -5, -4, -3, -4, -6, -7, -8, -7, -7, -7, -6, -5, -5, -4, -5, -5, -5, -4, -4, -3, -2, -3, -3, -3, -3, -3, -4, -4, -4, -3, -3, -4, -5, -5, -5, -6, -7, -7, -6, -6, -5, -6, -6, -7, -7, -6, -6, -5, -5, -3, -2, -2, -3, -3, -2, -2, -2, -3, -5, -7, -6, -5, -4, -4, -4, -4, -4, -5, -5, -5, -4, -4, -3, -4, -4, -5, -5, -5, -5]
4588e%%%JJ%j%jj%%%jJ%J%JJK%%%j%%%%%jjj%j%%jJJJJ%%%jJ%%JK%jjjJj%%jj%J%J%%J%%j
4569cjj%kj%%K%j%%KJ%%j%JK%%%j%%JJJjjjjj%%J%jjjJJ%%%j%jJJJJjjjj%%%jJJJKj%JJ%%
4549bjjJJJJj%J%jjjj%%%%%%j%%jJJ%J%j%%%%%Jj%%jJJJJj%%%%%%%jjjj%%%%JJ%%jj%jJK%
4530d%j%%J%%%%%%j%K%jjj%%%%JJ%J%J%%j%%%%%Jj%%j%%%j%J%%j%%%JJ%jJJ%j%%j%JKJJ%%
4511AjjjJjjk%j%%%%J%%j%%jJJJ%%J%%Kjj%J%%%%j%j%%jj%j%%JJ%j%KJ%%j%j%j%%JJJKj%%
4491b%J%%j%jJJJJJ%kjjjj%%J%%J%jj%%J%j%jjJ%%%%J%J%%j%%%Jj%%%j%%%%j%%%%%J%%%j%
4472f%J%J%JK%%jjjJJ%J%Jjjj%%%jjj%JJJj%jjj%%J%%%%%j%%%%JJ%J%%%%k%j%%J%%J%%J%%
4453dJ%Jj%jj%j%%KJ%%kj%%%J%Jj%J%JJ%%jj%jJJJJjj%%%%%J%J%%%%%%%%jjjk%%%J%%%%jj
$$ y = [-5, -5, -5, -5, -4, -3, -3, -4, -4, -5, -6, -6, -6, -6, -7, -6, -6, -5, -5, -4, -3, -1, -1, -1, -1, -2, -2, -2, -2, -2, -2, -3, -4, -5, -5, -6, -6, -6, -7, -6, -5, -4, -3, -3, -3, -3, -4, -3, -3, -3, -2, 0, 0, -1, -2, -3, -2, -3, -3, -3, -4, -5, -5, -4, -4, -3, -3, -3, -2, -2, -2, -3, -4, -5, -5, -7, -8, -8, -8, -6, -6, -7, -7, -7, -5, -4, -4, -4, -5, -5, -4, -2, -2, -2, -2, -3, -3, -3, -2, -1, 0, -1, -2, -3, -4, -5, -5, -5, -4, -4, -5, -6, -7, -6, -5, -5, -5, -5, -6, -6, -7, -6, -5, -4, -3, -4, -5, -6, -7, -7, -7, -7, -8, -7, -6, -5, -3, -4, -4, -3, -2, -2, -2, -3, -4, -3, -2, -1, 0, -1, -1, 0, 0, -1, -2, -3, -4, -4, -4, -4, -4, -4, -4, -5, -5, -5, -6, -5, -4, -4, -3, -3, -4, -4, -4, -4, -4, -4, -3, -4, -4, -4, -5, -4, -3, -2, -1, -2, -2, -2, -2, -2, -2, -2, -2, -3, -4, -5, -6, -6, -6, -6, -6, -5, -4, -4, -4, -5, -6, -6, -7, -6, -4, -4, -4, -5, -5, -5, -4, -4, -4, -4, -4, -4, -4, -5, -5, -3, -3, -4, -5, -6, -6, -6, -6, -6, -5, -4, -4, -3, -3, -2, -2, -2, -3, -3, -3, -3, -3, -3, -2, -3, -3, -3, -4, -4, -4, -4, -5, -5, -4, -4, -4, -5, -5, -5, -5, -4, -3, -3, -4, -3, -2, -2, -3, -3, -3, -4, -4, -3, -1, 0, 1, 1, 1, 0, -1, -2, -1, -2, -3, -5, -5, -6, -6, -6, -6, -6, -5, -5, -5, -6, -6, -6, -7, -6, -5, -4, -4, -4, -3, -3, -3, -1, -2, -3, -3, -2, -2, -2, -2, -2, -3, -3, -4, -4, -4, -5, -6, -6, -7, -7, -7, -6, -5, -5, -6, -6, -4, -3, -3, -3, -4, -4, -5, -5, -6, -6, -6, -5, -4, -3, -1, -2, -2, -2, -2, -1, -1, -1, -2, -2, -3, -2, -1, 0, 1, 2, 2, 0, -1, -2, -3, -4, -4, -4, -3, -3, -3, -2, -2, -3, -4, -4, -4, -3, -3, -4, -4, -5, -6, -5, -5, -5, -5, -5, -4, -4, -3, -3, -3, -4, -4, -4, -4, -3, -4, -4, -4, -4, -5, -5, -5, -5, -5, -6, -6, -6, -6, -6, -6, -5, -5, -5, -5, -6, -6, -6, -5, -5, -4, -4, -3, -1, -1, -1, -2, -3, -4, -3, -2, -2, -1, -1, 0, -1, -2, -3, -3, -3, -3, -4, -5, -6, -6, -5, -4, -3, -4, -4, -5, -6, -7, -7, -7, -6, -6, -6, -6, -6, -6, -7, -7, -7, -7, -7, -6, -5, -5, -4, -4, -4, -4, -4, -6, -6, -7, -7, -7, -6, -6, -6, -5, -5, -5, -4, -4, -4, -3, -3, -2, -3, -3, -4, -5, -5, -6, -6, -6, -4, -3, -3, -3, -5, -6, -6, -6, -6, -5, -5, -4, -5, -5, -4, -4, -3, -2, -2, -2, -3, -4, -4, -5, -4, -3, -2, -1, -2, -3, -3, -3, -3, -3, -3, -2, -2, -1, -1, -1, -1, -1, -1, -1, -1, -1, -2, -3, -4, -6, -6, -6, -6, -5, -5, -5, -5, -5, -6, -7]
4433g%%%%KJ%%J%j%k%J%%J%jj%J%%Jj%%%%J%J%J%%jkJJ%Jjjjj%%JJJ%jjJJJKjj%%JJjjjj%
4414dj%jJ%JJj%j%%KJ%%jj%j%%%J%JJ%%%J%jkj%%%J%jJ%jkjJ%%%j%%%%JJJJ%J%%%%%%%J%%
4395bKJj%j%kjjJ%%JJJJ%J%J%j%jjjkj%j%%%%JK%J%%kjj%JJ%%J%%J%%%JJ%jjj%%J%j%jJ%J
4375b%jj%%jj%JJJJJ%jjjjjJ%%J%%%%J%%Jj%%jJJJJjjljjJ%J%J%%%%%%%%%j%%j%JJ%%J%%j
4356d%%%%J%j%j%j%%jJJJ%J%%jJK%%kj%j%J%%%j%%%JJ%%%%%%j%%j%%%%JJ%kj%jJJ%JJ%jj%
4336ejjj%jJJ%%%%%%%JJJJJ%%%%%jjjj%%Jj%%%%KJj%%j%kjjjJKJK%%J%%%j%%jj%JK%%J%%%
4317bJJj%jj%%%%%j%%%%%J%jkj%JJJ%j%%J%jj%%%%J%%%J%%%%%Jj%%%J%%JJJjjkj%j%JJ%%%
4298d%%%k%JJJ%J%%%%J%%jj%j%jjjj%%%JJ%J%J%Jj%%J%%%%j%j%Jj%%%JJ%%j%j%%J%JJJJJ%
$$ y = [-7, -7, -7, -7, -7, -5, -4, -4, -4, -3, -3, -4, -4, -6, -6, -5, -5, -5, -4, -4, -5, -6, -6, -5, -5, -5, -4, -5, -5, -5, -5, -5, -4, -4, -3, -3, -2, -2, -2, -3, -5, -4, -3, -3, -2, -3, -4, -5, -6, -6, -6, -5, -4, -3, -3, -4, -5, -4, -3, -2, 0, -1, -2, -2, -2, -1, 0, -1, -2, -3, -4, -4, -5, -5, -6, -5, -5, -4, -3, -4, -4, -5, -5, -5, -3, -2, -2, -2, -3, -4, -4, -5, -5, -5, -5, -4, -4, -3, -2, -2, -2, -2, -1, -1, -2, -4, -5, -5, -5, -5, -4, -4, -5, -4, -4, -5, -7, -8, -7, -7, -7, -7, -8, -8, -8, -8, -8, -7, -6, -5, -4, -4, -3, -3, -3, -3, -3, -3, -3, -3, -2, -2, -2, 0, 1, 0, 0, -1, -1, -3, -4, -5, -4, -4, -4, -3, -2, -1, 0, 0, 1, 1, 2, 2, 1, 1, 0, -1, -2, -4, -5, -5, -6, -6, -6, -6, -6, -5, -3, -3, -2, -2, -2, -4, -5, -6, -6, -5, -4, -4, -4, -3, -3, -3, -2, -2, -2, -2, -1, 0, 0, -1, -2, -3, -3, -3, -2, -2, -3, -3, -4, -3, -3, -2, -2, -3, -4, -4, -4, -5, -6, -6, -5, -4, -3, -2, -1, -1, -2, -3, -4, -5, -6, -5, -5, -5, -4, -4, -4, -4, -4, -3, -3, -3, -2, -3, -3, -3, -4, -3, -2, -1, 0, -1, -2, -5, -6, -7, -6, -6, -5, -5, -4, -4, -4, -4, -4, -4, -4, -4, -4, -4, -5, -5, -5, -6, -6, -5, -4, -4, -4, -3, -3, -3, -4, -4, -4, -4, -4, -3, -3, -4, -4, -5, -5, -6, -6, -6, -7, -6, -5, -4, -4, -3, -3, -3, -4, -3, -1, -1, -1, -3, -4, -4, -5, -5, -4, -4, -4, -4, -5, -5, -5, -5, -4, -3, -3, -3, -3, -3, -3, -3, -4, -4, -4, -5, -5, -5, -5, -5, -4, -3, -3, -5, -6, -6, -7, -6, -5, -5, -4, -3, -3, -4, -5, -5, -6, -7, -8, -8, -9, -8, -7, -7, -7, -7, -7, -7, -7, -7, -6, -5, -4, -3, -2, -2, -2, -2, -2, -2, -3, -4, -5, -6, -6, -6, -5, -6, -6, -6, -6, -6, -4, -3, -4, -4, -4, -5, -5, -7, -8, -9, -10, -9, -7, -6, -4, -4, -4, -3, -3, -3, -3, -4, -4, -4, -5, -6, -6, -5, -3, -3, -3, -2, -2, -2, -2, -1, 0, -1, -1, -2, -3, -3, -3, -3, -3, -3, -4, -4, -4, -4, -4, -4, -3, -3, -4, -6, -7, -7, -6, -5, -4, -4, -5, -5, -5, -4, -4, -5, -6, -6, -6, -6, -6, -5, -5, -5, -5, -4, -4, -4, -4, -4, -4, -3, -4, -4, -4, -4, -3, -3, -3, -2, -1, 0, -1, -2, -4, -5, -5, -6, -6, -5, -4, -4, -4, -4, -4, -4, -4, -6, -6, -5, -4, -3, -3, -2, -2, -2, -2, -2, -1, -1, -1, -2, -3, -3, -4, -4, -5, -6, -7, -8, -8, -8, -8, -7, -6, -6, -5, -5, -4, -4, -3, -4, -4, -4, -3, -3, -3, -3, -3, -4, -4, -5, -5, -4, -5, -5, -5, -5, -4, -3, -3, -3, -4, -4, -5, -5, -5, -4, -4, -3, -2, -1, 0, 1, 1]
4278A%jj%%jj%J%%jjj%%J%%%%jjjJ%JJJ%J%%Jj%%j%jj%J%JJJJjjkj%%JJJJ%%jk%%%%jjJ%J
4259dK%j%jjj%%J%J%JJjj%%J%%%%%j%j%JJ%kj%%JjjjjjJKK%J%jj%%J%%%j%j%JjJ%%J%JJJ%
4240bj%jj%j%jjjJKJ%jjJJj%j%%jJ%%J%%%%%%Jj%%%%J%J%JJ%%jj%jj%JJ%J%%%%%j%j%j%jj
4220h%%JJJj%j%%j%%JJKJ%%%%jjk%JJ%j%%%%J%J%JKj%%%J%jjjj%J%Jjjj%J%J%%J%Jj%%%%%
4201c%jJJ%Jjj%jj%JJ%jj%J%%%%JJJ%j%jjk%%J%J%%%%%%%%%J%%JJJ%jjkjJ%%j%j%J%%J%%J
4182cJ%J%j%jjjjjJ%%JJ%JJj%j%%J%J%j%%%JJ%%%%jkj%J%jJ%JJJJj%%%%Jjjj%jj%%JJJJ%%
4162a%%%kj%jj%JJ%%J%Jj%Jj%J%%j%%jJ%j%j%%%%Jj%jj%%%JJ%%%%%%%Jj%jJJ%j%%%j%JJ%J
4143c%%%j%%%%%%J%%%J%Jkjjk%j%j%KKK%%j%jjJJKJ%jJJ%JJJjk%jjj%%%%%%%K%k%jJ%J%J%
$$ y = [1, 1, 0, -1, -1, -1, -2, -3, -3, -2, -2, -2, -3, -4, -5, -5, -5, -4, -4, -4, -4, -4, -5, -6, -7, -6, -6, -5, -4, -3, -3, -2, -2, -2, -1, -2, -2, -2, -3, -3, -4, -5, -5, -4, -4, -3, -2, -1, 0, -1, -2, -4, -5, -5, -5, -4, -3, -2, -1, -1, -1, -2, -4, -4, -4, -4, -4, -5, -6, -5, -5, -4, -2, -2, -3, -3, -4, -5, -6, -6, -6, -5, -5, -4, -4, -3, -2, -3, -4, -4, -4, -3, -3, -3, -3, -3, -3, -4, -4, -5, -5, -4, -3, -3, -5, -6, -6, -6, -5, -6, -7, -8, -9, -10, -9, -7, -5, -5, -4, -4, -5, -6, -6, -6, -5, -5, -5, -5, -6, -6, -7, -7, -6, -7, -6, -6, -6, -5, -5, -4, -3, -2, -2, -3, -3, -4, -5, -5, -6, -6, -7, -8, -9, -8, -6, -5, -5, -6, -7, -6, -5, -6, -6, -7, -7, -7, -8, -7, -7, -7, -6, -6, -6, -6, -6, -6, -6, -5, -6, -6, -6, -6, -6, -5, -5, -4, -4, -3, -2, -2, -2, -3, -4, -4, -5, -6, -6, -5, -4, -4, -3, -3, -3, -3, -3, -3, -4, -4, -5, -5, -6, -6, -7, -8, -8, -8, -7, -6, -5, -6, -6, -7, -7, -7, -8, -8, -8, -7, -6, -4, -3, -3, -3, -3, -3, -4, -5, -7, -7, -6, -5, -5, -6, -6, -6, -6, -6, -5, -5, -4, -4, -3, -1, -2, -2, -2, -2, -1, -1, -2, -3, -4, -5, -5, -4, -4, -3, -4, -5, -6, -6, -5, -5, -4, -4, -4, -3, -3, -2, -3, -3, -3, -3, -3, -3, -3, -4, -3, -2, -2, -1, -2, -3, -3, -4, -5, -5, -4, -3, -3, -4, -5, -5, -4, -4, -4, -4, -4, -3, -2, -1, -1, -2, -2, -3, -4, -6, -6, -6, -5, -5, -4, -4, -4, -4, -4, -4, -4, -4, -4, -4, -3, -3, -3, -2, -1, 0, 0, -1, -2, -4, -5, -4, -4, -4, -5, -5, -6, -6, -5, -5, -5, -4, -4, -4, -3, -2, -2, -1, -1, -2, -2, -3, -4, -5, -6, -7, -6, -6, -6, -5, -4, -4, -3, -2, -3, -3, -4, -4, -4, -3, -3, -2, -2, -3, -3, -3, -3, -2, -1, -1, -1, -1, -1, -2, -4, -5, -5, -4, -4, -5, -4, -4, -3, -2, -1, 0, -1, -1, -1, -1, -1, 0, -1, -2, -3, -3, -4, -5, -5, -5, -4, -3, -2, -1, -1, -1, -1, -1, -1, -3, -4, -4, -5, -6, -6, -5, -4, -4, -4, -3, -3, -2, -3, -3, -2, -3, -3, -2, -2, -2, -3, -3, -3, -4, -3, -3, -4, -4, -5, -5, -5, -5, -5, -4, -5, -5, -6, -7, -7, -7, -7, -6, -5, -5, -5, -5, -5, -5, -5, -5, -4, -5, -5, -6, -5, -4, -4, -5, -5, -5, -5, -6, -6, -5, -4, -4, -3, -3, -3, -3, -4, -4, -4, -4, -4, -4, -4, -3, -3, -3, -3, -2, -2, -1, -3, -4, -5, -7, -7, -8, -8, -9, -9, -7, -5, -3, -3, -3, -4, -4, -5, -6, -5, -4, -2, -1, -1, -2, -1, 0, 0, 1, 2, 3, 2, 0, 0, -1, -2, -3, -3, -3, -3, -3, -3, -3, -3, -1, -1, -3, -3, -4, -3, -3, -2, -2, -1, -1]
4124aJ%j%j%%j%%jjjj%Jj%j%%%%%%%%j%%%jKJJJ%J%%j%%%j%%J%Jj%%jJJJ%J%%J%j%%%j%j%
4104d%j%%%%%J%JJ%j%j%j%j%%j%%J%JJJJJ%%%%jjjj%%%%%J%JJJ%jkjkj%%j%LKJJ%%%%%%%j
4085c%jjjJ%J%%J%%%%%%j%j%%%%%%JKJJjkjJ%%%%JjJJJkjj%j%j%%JJ%jjJJJ%%j%j%j%%%J%
4066e%j%j%%%%%KJ%JjjjJJJj%J%%j%J%%J%%J%Jjkjk%%%J%%J%KJJ%jjjk%%%%J%%J%Jj%j%%J
4046cJ%jj%%%JJjkk%%%%%%%JJ%j%J%%jj%%%%%J%J%JJjj%%jjj%JJKJJJjkj%J%%j%J%%J%%%%
4027cj%jKJJjjjjjj%%J%JJJ%%j%JJj%J%%j%%%jJJJ%%jj%%%%%%%%Jj%%%%%%%%j%%J%%JjjJJ
4008bj%jjj%%KJjjj%J%J%JJ%%j%%%%%Jj%%%jj%j%J%JJ%JJjkk%JJJj%%J%jj%Jj%j%%%%%%J%
3988eJ%%%%%%%Jj%j%%%%%%Jj%jjJ%jj%JJKj%jk%%%j%%%%%%%J%%jjjjjjjjj%jjjjkJLLLLKK
$$ y = [-1, 0, 0, -1, -1, -2, -2, -2, -3, -3, -3, -4, -5, -6, -7, -7, -6, -7, -7, -8, -8, -8, -8, -8, -8, -8, -8, -8, -9, -9, -9, -9, -10, -8, -7, -6, -5, -5, -4, -4, -4, -5, -5, -5, -5, -6, -6, -6, -5, -5, -4, -5, -5, -5, -6, -5, -4, -3, -3, -2, -2, -2, -1, -1, -2, -2, -2, -2, -3, -3, -4, -4, -4, -5, -5, -5, -5, -5, -5, -4, -4, -3, -2, -2, -3, -3, -4, -4, -5, -5, -6, -6, -6, -7, -7, -7, -6, -6, -5, -4, -3, -2, -1, -1, -1, -1, -1, -2, -3, -4, -5, -5, -5, -5, -5, -5, -4, -4, -3, -2, -1, -1, -2, -4, -5, -7, -8, -8, -8, -9, -9, -6, -4, -3, -2, -2, -2, -2, -2, -2, -2, -2, -3, -3, -4, -5, -6, -5, -5, -4, -4, -4, -3, -3, -3, -3, -3, -3, -3, -4, -4, -5, -5, -5, -5, -5, -5, -5, -4, -2, -1, 0, -1, -3, -4, -3, -3, -3, -3, -3, -2, -3, -2, -1, 0, -2, -3, -4, -4, -5, -5, -6, -6, -6, -5, -4, -4, -5, -6, -5, -4, -3, -3, -3, -4, -4, -5, -5, -6, -6, -6, -6, -5, -5, -5, -6, -6, -7, -7, -7, -7, -7, -7, -5, -4, -4, -3, -4, -5, -6, -5, -4, -3, -4, -4, -3, -3, -3, -4, -4, -3, -3, -3, -2, -2, -2, -1, -1, 0, -1, -3, -4, -6, -6, -6, -6, -5, -5, -5, -4, -4, -2, -1, 0, 0, -1, -2, -3, -5, -5, -5, -5, -5, -4, -4, -4, -3, -3, -2, -3, -3, -4, -4, -4, -3, -2, -2, -3, -4, -4, -4, -4, -3, -2, -3, -5, -7, -7, -7, -7, -7, -7, -7, -7, -6, -5, -5, -6, -6, -5, -5, -5, -6, -7, -7, -7, -7, -7, -7, -6, -6, -5, -5, -4, -3, -4, -5, -5, -5, -6, -7, -8, -8, -7, -6, -4, -3, -2, -1, -2, -4, -5, -5, -4, -4, -4, -5, -5, -4, -4, -4, -3, -3, -3, -3, -3, -4, -4, -5, -3, -2, -1, -2, -3, -4, -5, -6, -7, -7, -7, -6, -6, -5, -4, -3, -3, -3, -4, -4, -3, -2, -3, -3, -2, -2, -2, -3, -3, -3, -3, -4, -3, -2, -1, -1, -1, -2, -3, -3, -3, -3, -3, -3, -3, -3, -3, -2, -3, -3, -3, -3, -3, -3, -3, -3, -3, -4, -4, -4, -3, -3, -3, -2, -3, -4, -3, -2, -3, -3, -4, -5, -6, -6, -6, -4, -3, -4, -5, -6, -6, -5, -5, -4, -4, -3, -2, -2, -2, -3, -3, -3, -3, -3, -3, -2, -3, -3, -3, -3, -4, -5, -5, -6, -6, -5, -5, -4, -3, -3, -2, -1, -2, -4, -6, -6, -5, -4, -3, -4, -4, -4, -3, -3, -4, -5, -5, -4, -5, -5, -6, -6, -6, -6, -6, -6, -6, -5, -5, -4, -4, -4, -4, -4, -4, -4, -4, -3, -4, -4, -5, -5, -5, -5, -5, -5, -5, -4, -5, -5, -6, -7, -6, -6, -7, -8, -8, -7, -6, -4, -5, -5, -6, -8, -8, -8, -8, -9, -9, -9, -9, -9, -9, -9, -9, -8, -8, -8, -9, -10, -11, -12, -13, -14, -15, -16, -17, -17, -18, -19, -20, -21, -23, -22, -19, -16, -13, -10, -8, -6]
3969fLKJJ%j%%%%jjjjJ%J%%j%%%%%j%%%%j%%%JJJK%kj%%%%%KJJkkj%%JJ%%%%%%%%J%%%j%%
3950b%%j%%%%jj%JJ%jj%%J%j%%JJ%%%j%%%%%%%%j%%%%%jk%JK%JJJ%J%%%%%%jj%jj%%%jJ%%
3930e%J%%%%j%%%j%%KJ%%%j%%%j%JKJ%%jk%%jJj%JJ%%jJjj%%JJJ%%j%J%%jjj%K%J%%jJ%J%
3911aJ%jjj%j%j%%%jJ%J%%%%%%JJJ%%%jk%JJ%%%j%j%%j%%%%%J%k%%JJ%%%%jj%%j%%%%KJ%j
3892ejk%JJJ%J%%%%j%j%%jjJJJJ%%J%%J%%j%%j%j%j%jj%%%%JJ%J%J%%%%%%%JJJj%%%%%%%%
3872bjj%Jj%%%j%%J%JJJ%jjj%%%%JJJKJjjjJ%jjj%%%J%j%%%jk%JK%J%jjjjjJJJ%J%%%J%%J
3853a%Jjjkj%%JJJJ%j%j%J%%%j%%%j%JKj%jjjjjJJJJJ%kjJ%%J%%%J%%%%J%jjj%JJj%j%%j%
3833eJJJ%%jj%%%JJJj%jj%j%%%%J%%%J%%%%Jjjjj%%JKJ%%%%%%J%%J%jjjkJ%%%J%J%J%%Jj%
$$ y = [-6, -3, -1, 0, 1, 1, 0, 0, 0, 0, 0, -1, -2, -3, -4, -3, -3, -2, -2, -2, -3, -3, -3, -3, -3, -3, -4, -4, -4, -4, -4, -5, -5, -5, -5, -4, -3, -2, 0, 0, -2, -3, -3, -3, -3, -3, -3, -1, 0, 1, -1, -3, -4, -4, -4, -3, -2, -2, -2, -2, -2, -2, -2, -2, -2, -1, -1, -1, -1, -2, -2, -2, -2, -2, -3, -3, -3, -3, -3, -4, -5, -5, -4, -3, -3, -4, -5, -5, -5, -4, -4, -5, -5, -5, -4, -3, -3, -3, -3, -4, -4, -4, -4, -4, -4, -4, -4, -4, -5, -5, -5, -5, -5, -5, -6, -8, -8, -7, -5, -5, -4, -3, -2, -2, -1, -1, -1, -1, -1, -1, -1, -2, -3, -3, -4, -5, -5, -5, -5, -6, -5, -5, -5, -5, -4, -4, -4, -4, -4, -5, -5, -5, -5, -6, -6, -6, -4, -3, -3, -3, -3, -4, -4, -4, -4, -5, -5, -4, -2, -1, -1, -1, -2, -4, -4, -4, -5, -4, -5, -5, -4, -3, -3, -3, -4, -3, -4, -5, -5, -5, -4, -3, -2, -2, -2, -3, -3, -2, -2, -2, -3, -4, -5, -5, -3, -3, -2, -2, -2, -3, -2, -2, -1, -1, 0, 0, -1, -2, -3, -3, -4, -4, -5, -5, -5, -5, -6, -5, -5, -4, -4, -4, -4, -4, -4, -4, -3, -2, -1, -1, -1, -1, -2, -4, -4, -3, -2, -2, -2, -2, -3, -3, -4, -4, -4, -5, -5, -5, -5, -5, -5, -4, -4, -6, -6, -6, -5, -4, -4, -4, -4, -4, -5, -6, -6, -6, -7, -7, -7, -7, -7, -5, -4, -4, -5, -6, -8, -8, -7, -6, -5, -5, -4, -4, -4, -4, -4, -5, -5, -6, -6, -6, -7, -8, -7, -6, -5, -4, -4, -4, -3, -3, -3, -2, -2, -2, -3, -3, -3, -4, -4, -5, -5, -6, -6, -7, -8, -8, -8, -8, -8, -7, -6, -6, -5, -5, -4, -4, -4, -4, -4, -4, -4, -4, -3, -2, -1, -2, -2, -2, -2, -2, -2, -2, -2, -2, -3, -4, -4, -3, -4, -4, -4, -4, -5, -5, -5, -4, -4, -3, -2, -1, -1, -2, -3, -4, -4, -4, -4, -4, -3, -2, -1, 1, 2, 1, 0, -1, 0, 0, -1, -2, -3, -3, -3, -3, -2, -2, -3, -3, -3, -3, -4, -6, -6, -5, -3, -3, -2, -2, -3, -4, -5, -6, -7, -6, -5, -4, -4, -3, -3, -3, -3, -2, -2, -2, -1, -1, 0, -1, -2, -4, -5, -5, -5, -4, -3, -2, -1, -1, -2, -2, -3, -3, -2, -2, -2, -2, -3, -3, -3, -3, -4, -4, -3, -1, -2, -2, -3, -4, -5, -6, -7, -6, -5, -4, -3, -2, -2, -4, -5, -4, -4, -4, -3, -3, -3, -3, -2, -2, -2, -2, -2, -1, -1, -2, -3, -4, -4, -3, -2, -3, -3, -4, -4, -4, -5, -5, -4, -3, -2, -2, -2, -3, -4, -4, -4, -4, -3, -2, -1, -2, -2, -3, -4, -4, -5, -5, -5, -5, -5, -4, -4, -4, -4, -3, -3, -3, -3, -3, -2, -3, -4, -5, -6, -6, -6, -5, -3, -2, -2, -2, -2, -2, -2, -2, -1, -1, -1, 0, 0, -1, -2, -3, -5, -4, -4, -4, -4, -3, -3, -2, -2, -1, -1, -1, 0, -1, -1]
3814a%jj%jj%%%%%%j%%J%J%%%%JJJ%%jj%%JJJj%jjj%JJj%j%%%%jjjJJ%%J%J%%J%%%j%%JJ%
3795ajjjJJj%jjj%J%jjJJJ%J%%J%J%%jjj%j%Jj%%J%%j%%J%%%%%JJJJjjkkkjJ%JJ%J%JJJj%
3775c%jJJ%jj%JjkjJ%JJ%JjjJ%%%%%%JJJj%j%%J%%%%%%%jJJJ%%%j%%JJjk%J%j%%J%%kj%j%
3756eJJ%%%%jj%J%J%J%jj%%%jJ%%%J%j%j%%jj%%J%%%JJKKJjj%j%J%%j%%%%J%Jjjj%%%J%%%
3737b%%%%j%%J%%%J%%%j%j%J%%%%%j%%j%J%J%jj%JJJj%j%JJ%%kkj%%%J%%jJKKJJj%%%jj%j
3717cj%j%%J%j%%jJ%%J%%j%JJKKJ%jj%jkjJ%Jj%%jJJj%%%%%%j%j%J%JJ%J%J%j%%%jkj%%JJ
3698c%J%Jj%%%%J%%%kkjJJ%J%JJ%%j%j%%%%JjjjJ%JJJJ%jj%jjj%J%%Jj%%J%%%%j%%J%%J%j
3679c%jjJ%jk%KKJ%j%jjj%%%%JKJK%%jjjj%%%j%%JJKJjj%jj%%j%%%%J%JJJK%%j%j%jk%jjj
$$ y = [-1, -1, -2, -3, -3, -4, -5, -5, -5, -5, -5, -5, -5, -6, -6, -6, -5, -5, -4, -4, -4, -4, -4, -3, -2, -1, -1, -1, -2, -3, -3, -3, -2, -1, 0, -1, -1, -2, -3, -4, -4, -3, -2, -3, -3, -4, -4, -4, -4, -4, -5, -6, -7, -6, -5, -5, -5, -4, -4, -3, -3, -3, -2, -2, -2, -2, -3, -3, -3, -2, -1, -1, -2, -3, -4, -3, -2, -3, -3, -4, -5, -6, -6, -5, -5, -6, -7, -6, -5, -4, -4, -3, -3, -3, -2, -2, -1, -1, -1, -2, -3, -4, -4, -5, -5, -4, -5, -5, -5, -4, -4, -4, -5, -5, -5, -4, -4, -4, -4, -4, -4, -3, -2, -1, 0, -1, -2, -4, -6, -8, -9, -8, -8, -7, -6, -6, -5, -5, -4, -3, -2, -3, -3, -3, -4, -3, -2, -2, -3, -4, -4, -3, -4, -6, -7, -6, -6, -5, -4, -4, -3, -4, -5, -4, -4, -4, -4, -4, -4, -4, -3, -2, -1, -2, -2, -3, -3, -3, -2, -2, -2, -2, -2, -2, -2, -2, -3, -2, -1, 0, 0, 0, 0, -1, -1, -1, 0, 1, 0, -2, -2, -1, -1, -2, -2, -2, -1, -1, -1, -3, -4, -4, -5, -5, -4, -3, -3, -3, -3, -3, -4, -5, -5, -4, -4, -3, -3, -2, -2, -3, -4, -4, -4, -4, -5, -4, -4, -4, -4, -3, -3, -4, -4, -5, -5, -5, -6, -7, -7, -7, -6, -6, -6, -6, -5, -4, -2, 0, 1, 0, -1, -1, -2, -2, -1, -1, -1, -2, -2, -2, -2, -2, -1, -1, 0, -1, -2, -3, -3, -3, -3, -2, -2, -2, -2, -2, -2, -2, -2, -3, -3, -3, -2, -2, -2, -2, -1, -1, -1, -1, -2, -2, -3, -3, -2, -2, -2, -2, -2, -2, -3, -3, -3, -4, -4, -3, -3, -2, -2, -3, -4, -4, -3, -2, -1, -2, -2, -3, -3, -2, -1, -1, -1, -3, -5, -6, -6, -6, -6, -5, -5, -5, -6, -5, -3, -1, 0, 1, 0, 0, 0, 0, -1, -2, -2, -3, -4, -4, -5, -5, -5, -4, -4, -5, -5, -5, -6, -5, -5, -5, -4, -4, -4, -5, -5, -4, -3, -1, 1, 2, 2, 1, 0, 0, -1, -3, -4, -3, -3, -2, -3, -3, -3, -4, -3, -2, -3, -3, -3, -3, -3, -3, -3, -4, -4, -5, -5, -4, -4, -3, -2, -2, -1, -1, 0, 0, -1, -1, -1, -1, -2, -4, -5, -5, -5, -4, -3, -3, -2, -2, -1, -2, -2, -2, -2, -2, -1, -1, -1, -1, -3, -5, -6, -5, -4, -4, -3, -3, -2, -1, -1, -1, -2, -2, -3, -3, -3, -3, -3, -2, -3, -4, -5, -4, -4, -3, -2, -1, 0, 0, -1, -2, -2, -3, -4, -5, -5, -4, -4, -4, -3, -4, -4, -4, -3, -3, -3, -3, -3, -4, -4, -4, -3, -3, -3, -2, -2, -3, -3, -4, -5, -4, -4, -5, -7, -7, -5, -3, -2, -2, -3, -3, -4, -5, -6, -6, -6, -6, -6, -5, -3, -2, 0, 0, 0, -1, -2, -3, -4, -4, -4, -4, -5, -5, -5, -4, -3, -1, 0, -1, -2, -2, -3, -4, -4, -4, -5, -5, -5, -5, -5, -4, -4, -3, -2, -1, 1, 1, 1, 0, 0, -1, -1, -2, -4, -4, -5, -6, -7]
3659g%Jjj%%j%JJJJ%JJ%%jjjjJJKJJ%jj%%%%J%k%jJJJ%KJKJJj%kj%%%%Jj%%%%%j%%%jj%jJ
3640b%JJ%%j%%%JJ%J%%%jjj%%%%%j%%%%j%%%J%J%%jj%KJ%j%%%jj%%%j%jjJJ%JJJ%%%%%J%J
3621Ajjjj%%%J%%%%J%%%%%%%jj%jj%%%%j%%Jj%Jj%J%JJ%j%%%%J%%J%%J%%%%%jjjj%jjJJJ%
3601dj%jJJ%%jJ%%%%J%%%%JjjjJKJkjjjjj%JJ%JJ%%%%%j%jj%jj%JKJJJ%%%%%%%%%%j%jjJ%
3582e%%JjjJJ%%J%j%%%%jJ%%%%j%j%%J%%%J%%J%jjjj%JKJJ%jjj%%KJJ%jj%J%%jj%%%j%%jJ
3563e%%J%JJ%J%%jj%j%%J%%%%%j%%JJ%JJJj%%j%%j%%%jJj%%KK%jjjjjjJ%%%%jj%%%J%JJj%
3543d%%KJJj%%JjkjJ%J%%%%j%%%%j%j%jjj%J%K%%%%%%%j%%%%%%JJJ%Jj%%J%Jj%j%JJj%kj%
3524e%%%%jJ%J%%%%Jj%%j%%jJKKJ%jj%jjjjjjJJJJ%%%%%%%%j%%j%%JJ%%%jjj%%%%J%jjJKJ
$$ y = [-7, -7, -6, -7, -8, -8, -8, -9, -9, -8, -7, -6, -5, -5, -4, -3, -3, -3, -4, -5, -6, -7, -6, -5, -3, -2, -1, -1, -2, -3, -3, -3, -3, -3, -2, -2, -4, -4, -5, -4, -3, -2, -2, 0, 1, 3, 4, 5, 4, 4, 2, 1, 1, 1, 1, 1, 2, 1, 1, 1, 1, 1, 1, 0, 0, 0, 0, -1, -2, -2, -3, -2, -2, -1, 0, 0, 0, -1, -1, -1, -1, 0, 1, 1, 2, 2, 2, 2, 1, 0, -1, -1, -1, -1, -1, -1, -2, -2, -2, -2, -2, -3, -3, -3, -3, -2, -2, -1, -1, -1, -2, -3, -3, -1, 0, 0, -1, -1, -1, -1, -2, -3, -3, -3, -3, -4, -4, -5, -6, -5, -4, -4, -3, -2, -1, -1, -1, -1, -1, -1, 0, 0, 1, 0, -1, -2, -3, -3, -3, -3, -2, -2, -2, -2, -2, -1, -1, -1, -1, -1, -1, -1, -1, -2, -3, -3, -4, -5, -5, -5, -5, -5, -6, -6, -6, -5, -6, -6, -5, -6, -6, -5, -5, -4, -3, -3, -4, -4, -4, -4, -4, -3, -3, -3, -2, -2, -2, -1, -1, -1, -1, -1, -1, -2, -3, -4, -5, -5, -6, -7, -6, -5, -4, -4, -5, -5, -6, -5, -4, -4, -4, -5, -4, -4, -4, -4, -4, -3, -3, -3, -3, -3, -2, -3, -4, -5, -4, -2, -1, -3, -4, -5, -6, -7, -8, -8, -7, -6, -6, -5, -4, -4, -4, -4, -4, -4, -5, -5, -6, -7, -7, -8, -9, -9, -8, -6, -5, -4, -3, -3, -3, -3, -3, -3, -3, -3, -3, -3, -3, -4, -4, -5, -6, -5, -5, -5, -5, -4, -5, -6, -5, -4, -4, -4, -3, -3, -4, -4, -4, -4, -4, -5, -4, -4, -4, -4, -4, -5, -5, -6, -6, -6, -5, -5, -5, -5, -4, -4, -4, -3, -3, -4, -5, -6, -7, -7, -6, -4, -3, -2, -2, -3, -4, -5, -5, -5, -3, -2, -1, -1, -2, -3, -3, -2, -2, -2, -3, -4, -4, -4, -4, -5, -5, -5, -6, -5, -5, -5, -4, -4, -3, -2, -2, -1, -1, -1, -2, -3, -3, -4, -4, -4, -3, -3, -3, -3, -3, -3, -4, -4, -4, -3, -2, -2, -1, 0, 1, 0, 0, 0, -1, -1, -1, -2, -2, -2, -2, -3, -2, -3, -3, -3, -1, 1, 1, 0, -1, -2, -3, -4, -5, -4, -4, -4, -4, -4, -5, -6, -6, -6, -6, -5, -5, -4, -3, -4, -4, -4, -4, -2, -1, 0, -1, -1, -1, 0, -1, -3, -4, -3, -3, -2, -2, -2, -2, -2, -3, -3, -3, -3, -3, -4, -4, -5, -5, -6, -7, -8, -8, -7, -7, -5, -5, -5, -5, -5, -5, -5, -5, -6, -6, -6, -6, -6, -6, -6, -5, -4, -3, -3, -2, -3, -3, -3, -2, -2, -1, -2, -2, -3, -3, -2, -1, -2, -2, -4, -5, -5, -5, -5, -5, -5, -6, -5, -5, -4, -4, -4, -4, -4, -3, -4, -4, -4, -5, -5, -5, -6, -5, -3, -1, 0, 0, -1, -2, -2, -3, -4, -5, -6, -7, -8, -7, -6, -5, -4, -4, -4, -4, -4, -4, -4, -4, -4, -5, -5, -5, -6, -6, -6, -5, -4, -4, -4, -4, -5, -6, -7, -7, -7, -7, -7, -6, -6, -7, -8, -7, -5, -4]
3505d%%jjj%%%%%%J%%%J%J%%j%%%%jJJJjj%j%%%%%JJ%jj%%j%%%j%%%%%%j%JJ%JJJjjj%J%J
3485e%%%%J%%%jj%%%J%%%J%%%%J%%%%%%J%%JJ%%%%j%j%jj%%J%%%JJ%jjj%%JJJJ%%J%%%jjj
3466b%jj%%J%%J%%J%%%%J%%%jjjj%j%%jj%jJJ%JJ%J%%%j%jjJ%%jJ%%j%%%Jj%%%J%%j%%%J%
3447eJj%%j%%jjjJKJJjjk%%%jj%LLJ%%j%%%J%%%J%%%%%jk%%%J%J%JJjjjj%%j%%%%%%%%J%J
3427dJJj%%j%%j%J%%%JJ%jjj%j%jJJJJjj%%%%%%J%%J%Jjjj%jj%jJ%%%%%JKJ%j%jj%jJJJJJ
3408b%jjjj%%%JJ%J%jjjjJ%%J%%%%%%%%%%JJK%%j%%j%jj%%%%%%%JJJ%%J%jj%J%%%j%%jjjj
3389gJ%JJ%%j%%J%%KKJJ%%kj%JJ%%%j%%j%j%%j%%J%%%j%jKJJjjk%%JJJ%jj%%%%%%%%%%J%%
3369bJJ%jjjjj%KJ%%%%J%%%%%%%%jjj%Jj%%%%%%%j%%jJJJJKJ%jJJJjj%Jjj%j%%%%J%%J%jj
$$ y = [-4, -4, -4, -5, -6, -7, -7, -7, -7, -7, -7, -7, -6, -6, -6, -6, -5, -5, -4, -4, -4, -5, -5, -5, -5, -5, -6, -5, -4, -3, -4, -5, -5, -6, -6, -6, -6, -6, -6, -5, -4, -4, -5, -6, -6, -6, -7, -7, -7, -7, -8, -8, -8, -8, -8, -8, -8, -9, -9, -8, -7, -7, -6, -5, -4, -5, -6, -7, -7, -6, -6, -5, -5, -5, -5, -5, -4, -4, -4, -4, -5, -6, -6, -6, -6, -5, -5, -5, -5, -4, -4, -4, -4, -4, -3, -3, -3, -3, -3, -3, -3, -2, -2, -2, -1, 0, 0, 0, 0, 0, -1, -1, -2, -2, -3, -4, -4, -4, -3, -3, -3, -3, -2, -1, -1, -2, -3, -4, -4, -4, -3, -2, -1, 0, 0, 0, 1, 1, 1, 1, 0, -1, -2, -2, -3, -4, -4, -4, -3, -3, -3, -2, -2, -2, -1, -1, -1, -1, -1, 0, 0, 0, 0, -1, -2, -3, -4, -4, -5, -5, -5, -6, -7, -7, -8, -7, -6, -6, -5, -4, -4, -3, -3, -3, -3, -4, -4, -5, -6, -5, -5, -5, -6, -5, -5, -5, -6, -6, -6, -6, -5, -6, -6, -6, -6, -5, -5, -5, -6, -6, -6, -6, -5, -5, -4, -5, -5, -5, -6, -6, -6, -7, -8, -9, -8, -6, -5, -4, -5, -6, -8, -8, -8, -8, -9, -10, -10, -7, -4, -3, -3, -3, -4, -4, -4, -4, -3, -3, -3, -3, -2, -2, -2, -2, -2, -2, -3, -5, -5, -5, -5, -4, -4, -3, -3, -2, -1, -2, -3, -4, -5, -5, -5, -6, -6, -6, -6, -6, -6, -6, -6, -6, -5, -5, -4, -3, -2, -3, -3, -3, -4, -4, -4, -5, -5, -4, -4, -4, -4, -3, -2, -2, -3, -4, -5, -5, -6, -6, -7, -6, -5, -4, -3, -4, -5, -5, -5, -5, -5, -5, -5, -4, -4, -4, -3, -3, -2, -3, -4, -5, -5, -6, -7, -7, -8, -7, -7, -7, -7, -7, -7, -6, -4, -3, -3, -4, -4, -5, -6, -6, -7, -6, -5, -4, -3, -2, -2, -3, -4, -5, -6, -6, -6, -6, -5, -4, -4, -3, -3, -4, -5, -6, -7, -6, -6, -6, -5, -5, -5, -5, -5, -5, -5, -5, -5, -5, -5, -4, -3, -1, -1, -1, -2, -2, -2, -3, -3, -4, -5, -5, -5, -5, -5, -5, -5, -5, -4, -3, -2, -2, -2, -1, -1, -2, -3, -3, -2, -2, -2, -2, -3, -3, -3, -4, -5, -6, -7, -6, -6, -5, -4, -4, -4, -5, -5, -5, -4, -4, -4, -2, 0, 1, 2, 2, 2, 0, -1, -1, 0, 1, 1, 1, 1, 0, 0, 0, -1, -1, -2, -2, -2, -3, -3, -3, -2, -2, -2, -2, -3, -3, -4, -2, -1, 0, -1, -2, -4, -4, -4, -3, -2, -1, -1, -2, -3, -3, -3, -3, -3, -3, -3, -3, -3, -3, -3, -2, -2, -2, -1, 0, 0, -1, -2, -3, -4, -5, -5, -3, -2, -2, -2, -2, -2, -1, -1, -1, -1, -1, -1, -1, -1, -1, -2, -3, -4, -4, -3, -4, -4, -4, -4, -4, -4, -4, -4, -5, -5, -5, -6, -5, -4, -3, -2, 0, 1, 1, 0, 1, 2, 3, 2, 1, 1, 2, 1, 0, 0, -1, -1, -1, -1, -1, 0, 0, 0, 1, 1, 0, -1]
3350ajj%%%%%%j%%J%%JJ%J%%j%%k%j%j%%j%%JKJ%%%%%%jjjjj%%%JJ%JJK%jk%%%KJ%%%j%j%
3330c%J%%%J%%%j%jj%J%%%%%%%%%J%J%J%%jk%%J%j%JJ%j%jJ%%j%%%j%%j%%%%%%%JJ%J%J%%
3311a%%jjkkjJJK%%%%JJjjj%%J%jj%%%j%J%JJjj%%%%%j%%%%%%%%%J%%J%KJ%jjjjj%JJ%%jj
3292gk%%JJJ%%j%JJJ%jJ%%Jj%%%%Jjj%jJ%%J%JJ%%jj%%J%JJ%JJ%jjjjjjJJ%jjj%%Jjj%JKK
3272b%%%Jj%j%%%J%%%kj%jJJ%J%j%%%J%J%%%Jj%j%%%jjjJJJ%J%%%%jjj%JJKJ%%kj%jJ%kjj
3253g%%%KJJjjjjjJJKJJ%jj%j%j%%%%JJJ%j%jjj%j%%JJJJjj%JKJjjj%KKKJJjjjj%jj%jjjJ
3234eKJ%%%%%%J%%jJJJjkjj%K%%j%j%JK%jj%%%%%J%%%%%J%%j%%%%j%%%%%J%J%%j%%%%jJ%J
3214a%j%%J%J%%j%%jjj%%JKj%%j%%%J%%JJ%JJJ%Jj%kk%j%JJJ%%jkjkj%%Jjjj%%%j%jjKJJJ
$$ y = [-1, -2, -3, -3, -3, -3, -3, -3, -3, -4, -4, -4, -3, -3, -3, -2, -1, -1, 0, 0, 0, -1, -1, -1, -3, -3, -4, -4, -5, -5, -5, -6, -6, -6, -5, -3, -2, -2, -2, -2, -2, -2, -2, -3, -4, -5, -6, -7, -7, -7, -7, -6, -5, -5, -4, -3, -1, -1, -2, -4, -4, -4, -4, -2, -1, -1, -1, -1, -2, -2, -3, -3, -3, -2, -2, -2, -2, -1, -1, -1, -1, -2, -2, -3, -4, -4, -3, -3, -3, -3, -3, -3, -3, -3, -3, -3, -2, -2, -1, -1, 0, 0, 0, -1, -3, -3, -3, -2, -2, -3, -3, -2, -1, -1, -2, -2, -3, -2, -2, -2, -3, -3, -3, -3, -4, -4, -4, -5, -5, -5, -5, -5, -5, -5, -5, -4, -3, -3, -2, -2, -1, -1, -1, -1, -1, -2, -3, -5, -7, -8, -7, -6, -4, -4, -4, -4, -4, -3, -2, -3, -4, -5, -5, -5, -4, -4, -5, -6, -6, -6, -6, -7, -7, -6, -6, -5, -4, -5, -6, -6, -6, -6, -6, -6, -7, -7, -7, -7, -7, -7, -7, -7, -7, -7, -6, -6, -6, -5, -5, -3, -2, -2, -3, -4, -5, -6, -7, -7, -6, -5, -5, -5, -6, -7, -9, -9, -9, -8, -7, -6, -6, -6, -7, -7, -6, -5, -4, -4, -5, -4, -4, -4, -3, -4, -4, -4, -4, -4, -3, -4, -5, -5, -6, -5, -5, -5, -4, -4, -3, -2, -2, -2, -3, -4, -4, -4, -3, -3, -2, -1, -1, 0, 1, 1, 0, -1, -2, -3, -4, -5, -4, -3, -3, -4, -5, -6, -6, -6, -5, -6, -7, -7, -6, -4, -2, -2, -2, -2, -1, -2, -2, -3, -3, -3, -3, -2, -2, -2, -2, -4, -5, -5, -6, -5, -4, -4, -3, -3, -4, -4, -4, -4, -3, -3, -2, -2, -2, -2, -1, -2, -2, -3, -3, -3, -3, -4, -5, -6, -5, -4, -3, -3, -2, -2, -2, -2, -2, -3, -4, -5, -5, -4, -3, -1, 0, 0, 0, -2, -3, -3, -4, -3, -3, -5, -6, -7, -7, -7, -7, -5, -4, -3, -4, -5, -6, -7, -8, -7, -6, -4, -3, -2, -2, -3, -4, -4, -5, -5, -6, -6, -6, -6, -6, -5, -4, -3, -3, -4, -4, -5, -6, -7, -7, -8, -8, -8, -7, -6, -5, -4, -5, -6, -6, -5, -3, -2, -3, -4, -5, -5, -3, -1, 1, 2, 3, 2, 1, 0, -1, -1, -2, -3, -3, -4, -5, -6, -5, -3, -2, -2, -2, -2, -2, -2, -2, -1, -1, -1, -2, -1, 0, 1, 0, -2, -3, -4, -4, -2, -2, -2, -3, -3, -4, -4, -3, -1, -1, -2, -3, -3, -3, -3, -3, -3, -2, -2, -2, -2, -2, -2, -1, -1, -1, -2, -2, -2, -2, -2, -3, -3, -3, -3, -3, -3, -2, -2, -1, -1, -1, -2, -2, -2, -2, -2, -3, -2, -2, -1, -1, -2, -2, -2, -1, -1, 0, 0, 0, -1, -1, -1, -2, -3, -4, -4, -4, -3, -1, -2, -2, -2, -3, -3, -3, -3, -2, -2, -2, -1, 0, 0, 1, 2, 3, 3, 4, 3, 3, 1, -1, -1, -2, -2, -1, 0, 1, 1, 1, 0, -2, -3, -5, -6, -6, -6, -5, -6, -7, -8, -8, -8, -8, -9, -9, -10, -11, -9, -8, -7, -6]
3195f%JJ%J%%%%%%j%j%%%%JJ%jj%jjJ%J%%j%JJKJK%%%%jkjj%j%j%%jjj%JJ%J%%J%%%%JJ%J
3176b%jkjk%%JJJkjjJ%JKJ%j%%%%%%JjjjjJ%JJj%%j%%%%j%j%%J%%J%%%J%%%%%%%%%%%JJJJ
3156b%jj%%%J%%%%j%jj%%%JJJJJJ%jk%j%j%%j%%%%J%%%%J%j%j%%JJJ%jjjJj%JJJ%%j%%j%J
3137dJ%Jj%%%%j%jjjJ%jj%JKJJj%j%%jjjjjJKJJJJJ%%j%%%%%%jjj%JJjjjJ%%J%JJ%%j%j%J
3118d%%%j%jJJ%j%%J%%%JJ%jkkkJJJj%j%%%%%%J%J%%%%%%%%J%%%%jj%%J%J%%J%JJ%%%%%%j
3098c%jjJ%%%%%%%%%%%%%%%JJJjj%%J%J%%%%%%%%j%%%j%jjk%%J%%JJJJj%%j%J%%j%jj%%%j
3079g%%%%J%%J%%J%%%j%J%%J%J%%JJj%%j%%%%J%jj%%%k%%J%j%JK%Jjjj%%j%%%J%%%j%%%%%
3060e%j%%jJJ%JJJJ%%j%%j%%%%%%j%%jjkj%JJ%JJ%%%J%%%%%%j%%J%%%%j%%%%%J%JJjjjj%%
$$ y = [-6, -6, -5, -4, -4, -3, -3, -3, -3, -3, -3, -3, -4, -4, -5, -5, -5, -5, -5, -4, -3, -3, -4, -5, -5, -6, -7, -6, -6, -5, -5, -5, -6, -6, -5, -4, -2, -1, 1, 1, 1, 1, 1, 0, -2, -3, -4, -4, -5, -5, -6, -6, -6, -7, -8, -9, -9, -8, -7, -7, -6, -6, -6, -5, -5, -5, -5, -5, -4, -3, -3, -2, -2, -3, -5, -6, -8, -8, -8, -7, -6, -5, -7, -8, -9, -8, -8, -7, -5, -4, -4, -5, -5, -5, -5, -5, -5, -5, -4, -5, -6, -7, -8, -7, -7, -6, -5, -6, -6, -6, -7, -7, -7, -7, -7, -8, -8, -9, -9, -9, -8, -8, -8, -7, -7, -7, -7, -6, -6, -6, -6, -6, -6, -6, -6, -6, -6, -6, -6, -5, -4, -3, -2, -2, -3, -4, -4, -4, -4, -3, -3, -3, -3, -3, -4, -4, -5, -6, -6, -6, -6, -5, -4, -3, -2, -1, 0, 0, -1, -3, -3, -4, -4, -5, -5, -5, -6, -6, -6, -6, -6, -5, -5, -5, -5, -5, -4, -4, -5, -5, -6, -6, -6, -5, -4, -3, -3, -4, -5, -6, -5, -6, -6, -5, -4, -3, -3, -3, -4, -4, -4, -5, -5, -4, -3, -3, -2, -3, -3, -3, -3, -3, -4, -4, -5, -6, -7, -6, -6, -7, -8, -8, -7, -5, -4, -3, -4, -4, -5, -5, -5, -6, -7, -8, -9, -10, -9, -7, -6, -5, -4, -3, -2, -2, -2, -3, -3, -3, -3, -3, -3, -3, -4, -5, -6, -6, -5, -4, -5, -6, -7, -6, -6, -6, -5, -5, -4, -3, -3, -3, -4, -4, -5, -5, -4, -4, -4, -4, -5, -5, -6, -5, -4, -4, -5, -5, -5, -4, -4, -4, -4, -3, -2, -2, -3, -5, -7, -9, -8, -7, -6, -7, -7, -8, -8, -8, -8, -8, -8, -8, -7, -7, -6, -6, -6, -6, -6, -6, -6, -6, -6, -5, -5, -5, -5, -5, -6, -7, -7, -7, -6, -6, -5, -5, -5, -4, -4, -3, -2, -2, -2, -2, -2, -2, -2, -3, -3, -4, -5, -4, -4, -4, -4, -4, -4, -4, -4, -4, -4, -4, -4, -4, -4, -4, -4, -3, -2, -1, -2, -3, -3, -3, -2, -2, -1, -1, -1, -1, -1, -1, -1, -1, -1, -2, -2, -2, -2, -3, -3, -4, -5, -7, -7, -7, -6, -6, -6, -5, -4, -3, -2, -3, -3, -3, -4, -4, -3, -3, -3, -4, -4, -5, -6, -6, -6, -6, -7, -7, -7, -7, -7, -6, -6, -6, -5, -5, -5, -4, -4, -4, -4, -5, -5, -4, -4, -4, -3, -3, -2, -2, -2, -1, 0, -1, -1, -1, -2, -2, -2, -2, -2, -1, -1, -2, -3, -3, -3, -3, -5, -5, -5, -4, -4, -5, -5, -4, -2, -2, -1, -2, -3, -4, -4, -4, -5, -5, -5, -5, -4, -4, -4, -4, -5, -5, -5, -5, -5, -5, -5, -6, -6, -6, -7, -6, -5, -5, -4, -3, -2, -1, -1, -1, -2, -2, -2, -3, -3, -3, -3, -3, -3, -3, -4, -4, -4, -5, -6, -8, -9, -9, -8, -7, -7, -6, -5, -5, -5, -5, -4, -4, -4, -4, -4, -4, -4, -5, -5, -5, -4, -4, -4, -4, -4, -5, -5, -5, -5, -5, -5, -4, -4, -3, -2, -3, -4, -5, -6, -6, -6]
3040fj%%%KJ%%J%jjjjJK%%j%j%%%%J%J%JjjJ%%%kjj%%%J%%%%%%J%%%J%J%Jj%%%%%%Jj%%%%
3021dKJJ%j%j%jjkj%KJJ%J%%%j%%J%%%%%jj%%jjk%JJ%J%K%%jj%%%Jj%%JJ%%%%%K%%%jjj%%
3002dJ%Jjj%jJ%JJJ%%%%%jjjj%%jJ%%%%Jj%%J%j%%%%J%J%J%JJj%%%j%j%j%j%J%%j%%j%%J%
2982eJ%%%j%%%%%J%%%%J%%%%J%%%%jj%j%JJjkj%JJ%%jjJJJ%%j%%JJ%jjjjJJKJj%J%JJ%%kj
2963cj%J%%%%%J%j%%%%j%%J%%Jjj%j%%%%JJ%J%%J%j%j%%j%%%J%Jj%%j%j%J%%jjJJKK%%%j%
2944akj%JJj%%%%Jkk%jJ%JJJ%JJJJj%jKJJ%k%%%JJKLLLLLJ%lllkkjk%%jj%%%jjj%%jjj%%%
2924c%jjj%j%j%%JJJ%%%%Jj%%jJJJ%%j%%%%%JJ%%j%%j%%j%j%j%%%J%J%%KJJjjjjj%j%%%%%
2905g%%%JJJ%jjJ%%J%%%%%%%%%J%Jj%%jj%Jjj%j%%KK%%j%J%%jk%%%jKK%kj%%j%%J%%J%%JK
$$ y = [-6, -7, -7, -7, -7, -5, -4, -4, -4, -3, -3, -4, -5, -6, -7, -6, -4, -4, -4, -5, -5, -6, -6, -6, -6, -6, -5, -5, -4, -4, -3, -4, -5, -4, -4, -4, -4, -6, -7, -8, -8, -8, -8, -7, -7, -7, -7, -7, -7, -7, -6, -6, -6, -6, -5, -5, -4, -4, -3, -4, -4, -4, -4, -4, -4, -4, -3, -4, -4, -4, -4, -4, -2, -1, 0, 0, -1, -1, -2, -2, -3, -4, -6, -7, -7, -5, -4, -3, -3, -2, -2, -2, -2, -3, -3, -3, -2, -2, -2, -2, -2, -2, -3, -4, -4, -4, -5, -6, -8, -8, -7, -6, -6, -5, -5, -3, -3, -3, -4, -5, -5, -5, -5, -4, -5, -5, -5, -4, -3, -3, -3, -3, -3, -3, -1, -1, -1, -1, -2, -3, -4, -4, -4, -3, -3, -2, -3, -4, -4, -5, -4, -4, -3, -2, -1, -1, -1, -1, -1, -1, -2, -3, -4, -5, -5, -5, -6, -5, -5, -5, -5, -5, -4, -5, -5, -5, -4, -4, -5, -5, -5, -5, -5, -4, -4, -3, -3, -2, -2, -1, 0, -1, -1, -1, -1, -2, -2, -3, -3, -4, -4, -5, -5, -4, -4, -4, -5, -5, -5, -6, -6, -6, -5, -5, -4, -4, -4, -4, -5, -5, -5, -5, -5, -5, -4, -4, -4, -4, -4, -3, -3, -3, -3, -3, -2, -2, -2, -2, -2, -3, -4, -4, -5, -5, -4, -3, -4, -6, -7, -7, -6, -5, -5, -5, -6, -7, -6, -5, -4, -4, -4, -5, -5, -5, -4, -3, -3, -4, -5, -6, -7, -6, -5, -3, -2, -3, -3, -2, -2, -1, 0, 0, 0, -2, -3, -4, -4, -3, -3, -3, -3, -3, -3, -2, -2, -3, -3, -3, -3, -3, -4, -4, -4, -3, -3, -3, -2, -3, -4, -4, -5, -5, -5, -5, -5, -4, -3, -3, -2, -2, -2, -1, -1, -2, -2, -3, -3, -3, -4, -4, -4, -4, -3, -3, -2, -3, -3, -3, -4, -4, -5, -5, -4, -4, -4, -5, -6, -5, -4, -2, 0, 0, 0, 0, -1, -1, -3, -4, -4, -3, -2, -3, -3, -3, -3, -3, -2, -4, -6, -6, -7, -6, -6, -5, -4, -3, -3, -2, -1, 0, 1, 0, 0, -1, 1, 2, 3, 3, 1, 1, 1, 1, 2, 3, 5, 8, 11, 14, 17, 20, 21, 21, 18, 15, 12, 10, 8, 7, 5, 5, 5, 4, 3, 3, 3, 3, 2, 1, 0, 0, 0, -1, -2, -3, -3, -3, -3, -3, -4, -5, -6, -6, -7, -7, -8, -8, -8, -7, -6, -5, -5, -5, -5, -5, -4, -5, -5, -5, -6, -5, -4, -3, -3, -3, -4, -4, -4, -4, -4, -4, -3, -2, -2, -2, -3, -3, -3, -4, -4, -4, -5, -5, -6, -6, -7, -7, -7, -7, -6, -6, -5, -5, -5, -3, -2, -1, -2, -3, -4, -5, -6, -6, -7, -7, -7, -7, -7, -7, -7, -7, -7, -6, -5, -4, -4, -5, -6, -5, -5, -5, -4, -4, -4, -4, -4, -4, -4, -4, -4, -4, -3, -3, -2, -3, -3, -3, -4, -5, -5, -4, -5, -6, -6, -7, -7, -7, -5, -3, -3, -3, -4, -4, -3, -3, -3, -4, -6, -6, -6, -6, -7, -5, -3, -3, -5, -6, -6, -6, -7, -7, -7, -6, -6, -6, -5, -5, -5, -4, -2]
2886bKJ%%jk%jjjJ%%%jj%%J%JJ%%%%%j%%%%J%j%j%%%%%JJ%jkk%%K%%j%%%%J%J%%%j%JJJJj
2866c%%%jj%jj%%jJ%JJjjKJj%%%%%%J%KK%jkj%J%%%J%%j%%%%%%j%j%%%%%JJ%J%%j%jj%j%j
2847g%%%%JJJJ%%j%%J%%%jj%%%%%jjJJ%jJ%J%jjJJj%%j%j%J%%J%%J%J%%kkjj%j%%j%%JKJJ
2827fJj%%%%%JJJJJkjk%JK%%%j%j%%j%%%%J%%%%j%%j%%JJ%%%j%%J%J%%%Jj%%%j%jjJ%%%%%
2808f%j%%%%%%J%%%JK%J%J%j%%kk%j%%%%jj%Jjj%j%JKK%%%%%%J%JKJJ%jkk%%%%%%%J%%J%%
2789cjj%j%%%%%j%JJJJ%Jjjj%J%J%%%J%J%jkkjJ%%%%K%J%j%%j%JJjj%j%%%%JJKJ%jJj%%%%
2769bj%j%%%%%%j%%%%%%j%J%J%%JJJJJ%jj%j%j%%%J%kj%JJjJ%%Jkj%%%%%%%%KJ%%j%jj%%j
2750f%KK%kk%JJ%%j%%%%%J%%%JJJJj%j%jj%j%%Jj%%j%%J%%%%j%JJ%J%%jk%JJJ%jjj%JJ%j%
$$ y = [-2, 0, 1, 1, 1, 0, -2, -2, -3, -4, -5, -4, -4, -4, -4, -5, -6, -6, -6, -5, -5, -4, -3, -3, -3, -3, -3, -3, -4, -4, -4, -4, -4, -3, -3, -4, -4, -5, -5, -5, -5, -5, -5, -4, -3, -3, -4, -6, -8, -8, -8, -6, -6, -6, -7, -7, -7, -7, -7, -6, -6, -5, -5, -5, -5, -6, -6, -5, -4, -3, -2, -3, -3, -3, -3, -4, -5, -5, -6, -7, -7, -7, -8, -7, -7, -6, -5, -6, -7, -5, -4, -5, -5, -5, -5, -5, -5, -5, -4, -4, -2, 0, 0, -1, -3, -4, -4, -3, -3, -3, -3, -2, -2, -2, -3, -3, -3, -3, -3, -3, -3, -4, -4, -5, -5, -5, -5, -5, -5, -4, -3, -3, -2, -2, -2, -3, -3, -4, -5, -5, -6, -6, -7, -7, -7, -7, -7, -6, -5, -4, -3, -3, -3, -4, -4, -4, -3, -3, -3, -3, -4, -5, -5, -5, -5, -5, -5, -6, -7, -6, -5, -5, -6, -5, -5, -4, -4, -5, -6, -5, -4, -5, -5, -5, -6, -6, -7, -7, -6, -6, -6, -5, -5, -5, -4, -4, -3, -3, -3, -5, -7, -8, -9, -9, -10, -10, -10, -11, -11, -11, -10, -8, -7, -6, -5, -6, -6, -6, -6, -6, -6, -5, -4, -3, -2, -1, -3, -4, -6, -6, -5, -3, -3, -3, -3, -4, -4, -5, -5, -5, -6, -6, -6, -6, -6, -5, -5, -5, -5, -5, -6, -6, -6, -7, -7, -7, -6, -5, -5, -5, -5, -6, -6, -6, -5, -5, -4, -4, -4, -4, -3, -4, -4, -4, -4, -5, -5, -6, -7, -6, -6, -6, -6, -6, -6, -6, -7, -7, -7, -7, -7, -7, -7, -6, -6, -6, -6, -5, -3, -3, -2, -2, -1, -1, -2, -2, -2, -4, -6, -6, -7, -7, -7, -7, -7, -8, -9, -9, -8, -9, -10, -10, -11, -11, -10, -8, -6, -6, -6, -6, -6, -6, -6, -5, -5, -4, -2, -1, 0, 0, -1, -3, -5, -5, -5, -5, -5, -5, -5, -5, -4, -4, -4, -3, -3, -3, -4, -5, -5, -6, -6, -6, -6, -6, -6, -7, -7, -6, -5, -4, -3, -3, -2, -3, -4, -5, -5, -4, -4, -3, -3, -3, -3, -2, -2, -1, -1, -2, -4, -6, -7, -6, -6, -6, -6, -6, -4, -4, -3, -3, -4, -4, -4, -5, -5, -4, -3, -4, -5, -5, -6, -6, -6, -6, -6, -5, -4, -2, -1, -1, -2, -1, -2, -2, -2, -2, -2, -3, -3, -4, -4, -4, -4, -4, -4, -4, -5, -5, -5, -5, -5, -5, -5, -6, -6, -5, -5, -4, -4, -4, -3, -2, -1, 0, 1, 1, 0, -1, -1, -2, -2, -3, -3, -3, -3, -2, -2, -4, -5, -5, -4, -3, -4, -3, -3, -3, -2, -4, -5, -5, -5, -5, -5, -5, -5, -5, -5, -3, -2, -2, -2, -3, -3, -4, -5, -5, -5, -6, -6, -4, -2, -2, -4, -6, -6, -5, -4, -4, -4, -5, -5, -5, -5, -5, -5, -4, -4, -4, -4, -3, -2, -1, 0, -1, -1, -2, -2, -3, -4, -4, -5, -5, -5, -4, -5, -5, -5, -6, -6, -6, -5, -5, -5, -5, -5, -6, -6, -5, -4, -4, -3, -3, -3, -4, -6, -6, -5, -4, -3, -3, -4, -5, -6, -6, -5, -4, -4, -5, -5]
2731e%j%%%%%JJ%jj%%J%jj%%J%%jJJ%%J%%%%%%jjjj%JJJJJ%j%jj%J%%%j%j%%J%%%%%%%%%J
2711e%jj%%%%%%j%%J%J%JJJ%%jkJJJjj%j%J%%%%J%%%j%%%%jj%%%J%%%J%%%%%%J%J%jjj%%%
2692fj%J%%%JJJJJJjkjjj%j%%%J%jjk%JJJJ%%%%JJ%j%jJJJK%Jjjjj%%%J%%J%%%%%jjJJj%%
2673c%JJJJ%J%Jkjjk%jjj%KK%%%%j%%%%jj%J%JKKJJJ%Jjkj%JJ%j%%%j%%%jj%j%%Jj%j%j%%
2653d%%%%%jJ%%%%jj%%%%%JJJjjJ%%%JJJ%Jj%j%JK%%jjjj%J%jjJJ%J%%Jjj%%KJJ%j%jkkk%
2634f%%J%%JJJJ%%kj%%JK%J%j%%jjjjj%%%JJJJ%J%%%j%jJJ%kj%%%%%%%%%j%JJ%J%j%j%%j%
2615e%J%%%%%%%J%%%jJKJJ%%kkjJ%Jjjj%JJ%%j%%%JJ%jjj%jJJ%J%%j%%KJJjjjjJ%%%%%jjj
2595fJ%J%Jj%JJJ%%%%jJ%jj%j%%KJJjj%%J%%j%%%JJj%%j%k%%J%%%%%%%jjJJjjjj%%J%J%J%
$$ y = [-5, -5, -6, -6, -6, -6, -6, -6, -5, -4, -4, -5, -6, -6, -6, -5, -5, -6, -7, -7, -7, -6, -6, -6, -7, -6, -5, -5, -5, -4, -4, -4, -4, -4, -4, -4, -5, -6, -7, -8, -8, -7, -6, -5, -4, -3, -3, -4, -4, -5, -6, -6, -5, -5, -5, -5, -6, -6, -7, -7, -7, -6, -6, -6, -6, -6, -6, -6, -6, -6, -6, -5, -5, -6, -7, -7, -7, -7, -7, -7, -7, -8, -8, -8, -7, -7, -6, -6, -5, -4, -3, -3, -3, -4, -6, -5, -4, -3, -4, -5, -5, -6, -6, -5, -5, -5, -5, -5, -4, -4, -4, -4, -5, -5, -5, -5, -5, -6, -7, -7, -7, -7, -6, -6, -6, -6, -5, -5, -5, -5, -5, -5, -5, -4, -4, -3, -3, -4, -5, -6, -6, -6, -6, -7, -7, -6, -6, -6, -6, -5, -4, -3, -2, -1, 0, -1, -3, -4, -5, -6, -6, -7, -7, -7, -7, -6, -6, -7, -8, -10, -10, -9, -8, -7, -6, -6, -6, -6, -6, -5, -4, -4, -5, -5, -6, -5, -4, -3, -1, -1, 0, -1, -2, -3, -4, -4, -4, -4, -3, -3, -3, -2, -2, -2, -2, -2, -2, -3, -4, -3, -2, -3, -3, -3, -3, -2, -1, 0, 1, 1, 2, 2, 3, 1, 0, -1, -3, -3, -4, -5, -6, -6, -4, -2, -2, -2, -2, -2, -3, -3, -3, -3, -3, -4, -5, -5, -4, -4, -3, -1, 1, 2, 3, 4, 4, 5, 4, 2, 1, 1, 2, 3, 3, 2, 2, 2, 2, 1, 1, 1, 1, 0, -1, -1, -2, -2, -2, -1, -2, -2, -3, -3, -4, -4, -4, -4, -4, -4, -4, -4, -5, -4, -4, -4, -4, -4, -5, -6, -6, -6, -6, -6, -6, -5, -4, -3, -4, -5, -4, -4, -4, -4, -3, -2, -1, -1, 0, -1, -1, -2, -2, -1, 1, 1, 1, 0, -1, -2, -3, -3, -2, -2, -3, -4, -3, -2, -2, -1, -1, -1, 0, -1, -2, -2, -2, 0, 1, 2, 2, 1, 1, 0, -2, -4, -6, -6, -6, -6, -5, -5, -5, -4, -3, -2, -1, -1, -1, -3, -4, -4, -4, -3, -1, -1, 0, 0, -1, -1, -1, -2, -3, -4, -5, -6, -6, -6, -6, -5, -4, -3, -2, -2, -1, -1, -1, -1, -2, -2, -3, -2, -1, -1, -3, -4, -4, -4, -4, -4, -4, -4, -4, -4, -4, -5, -5, -4, -3, -3, -2, -2, -3, -3, -4, -4, -4, -5, -5, -5, -4, -4, -4, -4, -4, -4, -4, -4, -3, -3, -3, -3, -4, -3, -1, 0, 1, 1, 1, -1, -3, -4, -3, -3, -2, -3, -4, -5, -5, -4, -3, -3, -3, -4, -4, -4, -4, -3, -2, -2, -3, -4, -5, -5, -6, -5, -4, -4, -3, -3, -3, -4, -4, -4, -2, -1, 0, -1, -2, -3, -4, -3, -3, -3, -3, -3, -3, -4, -5, -6, -5, -5, -4, -4, -3, -4, -4, -3, -2, -1, -1, -1, -1, -1, -2, -1, -1, -2, -3, -3, -4, -4, -4, -2, -1, 0, -1, -2, -2, -2, -1, -1, -1, -2, -2, -2, -2, -1, 0, -1, -1, -1, -2, -2, -4, -4, -4, -3, -3, -3, -3, -3, -3, -3, -3, -4, -5, -4, -3, -4, -5, -6, -7, -7, -7, -6, -6, -5, -5, -4, -4]
2576dJJj%j%j%j%J%j%%%JK%%%%J%%%%%%kkj%%%jJJJJJJj%j%j%%J%%kjJKLJ%%j%jj%j%j%%%
2557e%%%JJJ%%%J%jjjjj%%JJjJ%j%%%%JJJ%j%%%%%%%%J%j%j%%J%%%j%JJJ%%kjjJJJj%j%j%
2537eJJj%%j%JJ%jj%JJ%j%JJ%kJ%J%jj%j%%%J%KJ%%%J%jjj%%Jj%jJ%%j%%%J%%%%%%%%%%jk
2518fj%JJJJJ%jj%%%%jj%JK%j%%KJ%%jkjjkjjj%KJ%%%%j%JJJ%%%J%%%j%%%J%%JJJ%jkjk%%
2499hJ%%%%%JJJJ%%%jj%k%%KKJ%jj%%JJ%%j%%j%j%%%%%%J%%%%j%%%%%J%J%%j%jJ%J%%%%%%
2479c%jjj%JJJJ%%jjj%%%JJ%%jj%JJK%%%jjk%%JJJ%%j%jJJ%J%j%%j%%J%%%jk%%J%%%%%%%%
2460d%%%%%%KJ%%jjjjjj%J%JJ%J%%%%%%%j%J%JJ%jj%J%%%JJ%%j%J%%jjj%%JjJ%%Jjj%jJ%J
2441b%%jjj%%%j%KJ%%%J%%%j%j%j%%%J%%%%%%%%%j%%%%%%Jj%jJKJ%%%%%%%j%j%%%jJJJ%j%
$$ y = [-4, -3, -2, -3, -3, -4, -4, -5, -5, -6, -6, -5, -5, -6, -6, -6, -6, -5, -3, -3, -3, -3, -3, -2, -2, -2, -2, -2, -2, -2, -4, -6, -7, -7, -7, -7, -8, -7, -6, -5, -4, -3, -2, -3, -3, -4, -4, -5, -5, -5, -4, -4, -4, -6, -7, -6, -4, -1, 0, 0, 0, -1, -1, -2, -3, -3, -4, -4, -5, -5, -5, -5, -5, -5, -5, -4, -3, -2, -2, -2, -2, -1, -1, -2, -3, -4, -5, -6, -6, -6, -5, -4, -5, -4, -4, -5, -5, -5, -5, -5, -4, -3, -2, -2, -3, -3, -3, -3, -3, -3, -3, -3, -3, -2, -2, -3, -3, -4, -4, -4, -3, -3, -3, -3, -4, -4, -3, -2, -1, -1, -1, -3, -4, -5, -4, -3, -2, -3, -3, -4, -4, -5, -5, -4, -3, -4, -4, -4, -5, -5, -4, -3, -3, -4, -5, -5, -4, -3, -3, -4, -4, -3, -2, -2, -4, -3, -3, -2, -2, -3, -4, -4, -5, -5, -5, -5, -4, -4, -2, -1, -1, -1, -1, 0, 0, -1, -2, -3, -3, -3, -2, -3, -3, -4, -3, -3, -3, -4, -4, -4, -4, -3, -3, -3, -3, -3, -3, -3, -3, -3, -3, -3, -4, -6, -7, -7, -6, -5, -4, -3, -2, -2, -3, -4, -4, -4, -4, -4, -5, -6, -6, -5, -3, -3, -4, -4, -4, -2, -1, -1, -1, -2, -4, -5, -6, -8, -9, -10, -11, -11, -9, -8, -8, -8, -8, -8, -9, -9, -8, -7, -6, -6, -6, -6, -5, -5, -5, -5, -6, -6, -6, -6, -5, -5, -5, -4, -3, -2, -2, -3, -5, -6, -8, -8, -8, -7, -7, -7, -7, -7, -7, -6, -5, -4, -3, -3, -3, -3, -4, -5, -5, -7, -7, -7, -5, -3, -2, -2, -3, -4, -4, -4, -3, -2, -2, -2, -3, -3, -3, -4, -4, -5, -5, -5, -5, -5, -5, -5, -4, -4, -4, -4, -4, -5, -5, -5, -5, -5, -5, -4, -4, -3, -3, -3, -4, -4, -5, -4, -4, -3, -3, -3, -3, -3, -3, -3, -3, -4, -5, -6, -6, -5, -4, -3, -2, -2, -2, -3, -4, -5, -5, -5, -5, -4, -3, -3, -3, -4, -5, -5, -4, -3, -1, -1, -1, -1, -2, -3, -5, -5, -5, -4, -3, -2, -2, -2, -3, -3, -4, -3, -2, -2, -1, -1, -2, -2, -2, -3, -3, -3, -2, -2, -2, -2, -3, -5, -5, -5, -4, -4, -4, -4, -4, -4, -4, -4, -4, -4, -4, -4, -4, -4, -4, -2, -1, -1, -1, -2, -3, -4, -5, -6, -7, -7, -6, -6, -5, -4, -4, -3, -3, -3, -3, -3, -3, -3, -3, -4, -4, -3, -3, -2, -1, -1, -2, -3, -3, -2, -2, -2, -2, -1, 0, 0, 0, -1, -1, 0, 0, 0, -1, -2, -3, -3, -3, -2, -3, -2, -2, -2, -1, -2, -3, -3, -4, -3, -3, -2, -2, -2, -3, -4, -5, -5, -5, -5, -6, -6, -4, -3, -3, -3, -3, -2, -2, -2, -2, -3, -3, -4, -4, -5, -5, -5, -5, -4, -4, -4, -4, -4, -4, -4, -4, -4, -4, -5, -5, -5, -5, -5, -5, -5, -4, -5, -5, -6, -5, -3, -2, -2, -2, -2, -2, -2, -2, -2, -3, -3, -4, -4, -4, -4, -5, -4, -3, -2, -2, -3, -3]
2421cjj%J%J%%%Jj%%%%%%%%%Jjjk%%%j%j%%JLNKKJJ%%%jj%j%j%%jj%j%%J%%J%jJ%J%%%%J%
2402D%%%jjj%jj%%J%J%%j%j%j%%jjJ%%%KJJ%%%JJ%Jkjjk%j%%%J%J%%J%%Jkj%%J%JJ%Jj%j%
2383@jj%j%jKJ%kj%%%%J%Jj%JJ%jkjJK%%%jJJJJ%%j%jk%j%JKKK%%Jj%%jj%jj%%JJ%%jk%%K
2363@JJ%j%%Jjjjjj%JJKJj%jj%%%%j%%JJjj%%J%J%j%%%%j%J%%jkjJ%KJ%%%%%j%JK%j%%j%%
2344aJ%%%%%%J%%jj%jj%%j%%%%%JJ%JJJjj%J%%j%j%J%%kj%JJJJJ%JJ%%%J%j%%%%J%J%%j%%
2325D%%j%jjj%KJ%%%%%%%%%J%J%%%%%%%%JJJJJjjjjkjkk%%j%JJJ%J%%%%%%%JJjj%%%%jjjj
2305b%J%J%%jjjj%KK%%jJJ%jjj%J%%%J%j%jJJJ%J%%%j%%JJ%jjjjJ%KJJ%kjjJJ%%%J%%%%%%
2286C%jj%j%%J%%jJJ%%%j%%%J%JjjJJ%J%%%%jJ%%%%j%j%jj%J%%%%J%%J%J%%%%%%%j%jjkjJ
$$ y = [-3, -4, -5, -5, -4, -4, -3, -3, -3, -3, -2, -3, -3, -3, -3, -3, -3, -3, -3, -3, -3, -2, -3, -4, -6, -6, -6, -6, -7, -7, -8, -8, -8, -7, -4, 1, 3, 5, 6, 7, 7, 7, 7, 6, 5, 5, 4, 4, 3, 3, 3, 2, 1, 1, 0, 0, 0, 1, 1, 1, 2, 2, 1, 2, 2, 3, 3, 3, 3, 3, 4, 4, 4, 4, 4, 3, 2, 1, 1, 0, -1, -1, -1, 0, 0, 1, 1, 1, 0, 0, -1, -1, -2, -2, -2, -3, -4, -3, -3, -3, -3, -1, 0, 1, 1, 1, 1, 2, 3, 3, 4, 2, 1, 0, -2, -2, -3, -3, -3, -3, -2, -2, -1, -1, -1, 0, 0, 0, 1, -1, -2, -2, -2, -1, -1, 0, 1, 1, 2, 1, 1, 0, 0, -1, -2, -2, -3, -3, -4, -2, -1, -1, -3, -4, -4, -4, -4, -4, -3, -3, -2, -3, -3, -2, -1, -1, -2, -4, -5, -4, -2, -2, -2, -2, -3, -2, -1, 0, 1, 1, 1, 0, 0, -1, -3, -3, -4, -4, -3, -1, 1, 3, 3, 3, 4, 3, 3, 3, 2, 1, 1, 0, -1, -1, -1, 0, 1, 1, 1, 0, -2, -2, -2, 0, 1, 2, 2, 1, 1, 1, 2, 1, 0, -1, -2, -3, -3, -2, -1, 1, 2, 1, 1, 0, -1, -1, -1, -1, -1, -2, -2, -2, -1, 0, -1, -2, -2, -2, -1, -1, 0, 0, -1, -1, -1, -1, -1, -2, -2, -1, -1, -1, -2, -4, -5, -4, -4, -2, -1, -1, -1, -1, -1, -1, -2, -2, -1, 1, 1, 0, 0, 0, -1, -1, -1, 0, 0, 0, 0, 0, 0, 0, 1, 1, 1, 0, -1, -1, -2, -3, -3, -3, -4, -4, -4, -4, -4, -4, -3, -2, -2, -1, 0, 1, 0, -1, -1, 0, 0, 0, -1, -1, -2, -2, -1, -1, -1, -3, -4, -4, -3, -2, -1, 0, 1, 1, 2, 3, 3, 3, 3, 4, 4, 3, 3, 3, 3, 3, 4, 4, 5, 5, 5, 4, 4, 4, 4, 4, 3, 3, 2, 1, 0, 0, 2, 3, 3, 3, 3, 3, 3, 3, 3, 3, 3, 4, 4, 5, 5, 5, 5, 5, 5, 5, 5, 5, 6, 7, 8, 9, 10, 9, 8, 7, 6, 4, 3, 1, -1, -1, -1, -2, -2, -1, 0, 1, 1, 2, 2, 2, 2, 2, 2, 2, 2, 3, 4, 3, 2, 2, 2, 2, 2, 1, 0, -1, -2, -2, -1, -1, 0, 0, 0, -1, -2, -3, -4, -4, -2, 0, 0, 0, -1, 0, 1, 1, 0, -1, -2, -2, -1, -1, -1, -1, 0, 0, -1, -1, -2, -1, 0, 1, 1, 2, 2, 2, 2, 1, 1, 1, 2, 3, 3, 2, 1, 0, -1, 0, 0, 2, 3, 4, 4, 2, 1, 0, 1, 2, 2, 2, 2, 3, 3, 3, 3, 3, 3, 3, 3, 2, 1, 1, 0, 0, 0, 1, 1, 1, 0, 1, 2, 2, 2, 2, 1, 1, 1, 1, 2, 2, 3, 2, 1, 2, 3, 3, 4, 4, 4, 4, 4, 3, 4, 4, 4, 4, 4, 3, 3, 2, 2, 1, 0, 0, 1, 1, 1, 1, 1, 2, 2, 2, 3, 3, 4, 4, 4, 4, 4, 4, 4, 4, 3, 3, 2, 1, -1, -2, -1]
2266aK%J%jjjJKKj%J%%%j%j%%J%%%%j%jj%jJJJjj%JJKJ%jjj%%%j%%j%%J%%J%J%j%%j%J%%%
2247B%%%%%%%%%J%J%J%%%%%%jjk%%Jj%j%J%J%%JJJ%J%%%jjj%j%JJj%%%jj%JJ%jk%JJ%%%%%
2228BJJJJ%%%J%%jkjJ%J%%j%j%%jJ%J%JJ%jj%%J%j%%%kj%J%%J%JjjjJ%%JK%jjk%%JJJJJJj
2208Fj%jj%%%%%jjjjj%%J%%JJ%%%%%%j%%%%%%J%%%%%Jj%%j%%%jJJJ%JJjj%%%J%%%%kj%KJ%
2189Cjj%%%JJJJJjjjj%%JJKJj%j%%%JJ%j%jjjjJJJ%Jj%jkk%JKJJ%%J%%%%jJ%%kkjJKLJj%j
2170Fj%jJ%%Jjj%jjj%JJ%%%%J%%JJJ%JJ%JJJ%kjjkj%%j%%%%JJJ%%%jjj%%%jJJ%J%j%jJ%JJ
2150Gj%jjj%KJ%Jjj%j%%j%JJJ%%J%J%%J%%%%j%jJ%%%j%%%%jJJ%%j%j%%JJJ%%%%j%J%j%%%K
2131A0J%%kj%j%%JJ%%%kk%JJ%jj%J%%J%%J%%%jkjkjjKJJ%J%J%%jJJ%kj%KJJJj%j%jjk%JKJ
$$ y = [-1, 1, 1, 2, 2, 1, 0, -1, 0, 2, 4, 3, 3, 4, 4, 4, 4, 3, 3, 2, 2, 2, 3, 3, 3, 3, 3, 2, 2, 1, 0, 0, -1, 0, 1, 2, 1, 0, 0, 1, 2, 4, 5, 5, 4, 3, 2, 2, 2, 2, 1, 1, 1, 0, 0, 0, 1, 1, 1, 2, 2, 3, 3, 2, 2, 2, 1, 1, 2, 2, 2, 2, 2, 2, 2, 2, 2, 2, 2, 2, 2, 3, 3, 4, 4, 5, 5, 5, 5, 5, 5, 5, 4, 3, 1, 1, 1, 2, 1, 1, 0, 0, 1, 1, 2, 2, 2, 3, 4, 5, 5, 6, 6, 6, 6, 5, 4, 3, 3, 2, 2, 3, 4, 3, 3, 3, 3, 2, 1, 1, 2, 3, 3, 2, 0, 0, 1, 2, 2, 2, 2, 2, 2, 3, 4, 5, 6, 6, 6, 6, 7, 7, 7, 6, 4, 3, 4, 4, 5, 5, 5, 4, 4, 3, 3, 3, 2, 3, 3, 4, 4, 5, 6, 6, 5, 4, 4, 4, 5, 5, 4, 4, 4, 4, 2, 1, 1, 2, 2, 2, 3, 3, 4, 3, 2, 1, 2, 2, 2, 3, 5, 5, 4, 3, 1, 1, 1, 2, 3, 4, 5, 6, 7, 6, 5, 5, 4, 3, 3, 3, 3, 3, 3, 2, 1, 0, -1, -2, -2, -2, -1, -1, -1, 0, 1, 1, 1, 1, 1, 1, 1, 0, 0, 0, 0, 0, 0, 0, 1, 1, 1, 1, 1, 1, 2, 1, 1, 1, 0, 0, 0, 0, -1, 0, 1, 2, 2, 3, 4, 3, 2, 2, 2, 2, 3, 3, 3, 3, 3, 1, 0, 0, 2, 3, 3, 2, 1, 1, 1, 1, 2, 3, 4, 5, 6, 5, 4, 3, 2, 2, 2, 3, 4, 6, 7, 6, 6, 5, 5, 5, 5, 6, 7, 7, 6, 6, 5, 4, 3, 2, 3, 4, 5, 5, 6, 5, 5, 4, 2, 0, 0, 1, 3, 4, 5, 5, 5, 6, 6, 6, 6, 6, 5, 6, 6, 6, 4, 2, 1, 2, 4, 7, 8, 7, 7, 6, 5, 5, 4, 5, 5, 5, 6, 5, 4, 4, 3, 2, 1, 1, 2, 3, 3, 3, 3, 3, 4, 4, 4, 5, 6, 7, 7, 8, 9, 9, 10, 11, 12, 12, 10, 9, 8, 6, 5, 5, 5, 4, 4, 4, 4, 4, 5, 6, 7, 7, 7, 7, 6, 5, 4, 4, 4, 4, 3, 4, 5, 5, 6, 6, 5, 5, 4, 5, 5, 6, 7, 6, 6, 5, 4, 3, 3, 5, 6, 6, 7, 6, 5, 5, 4, 4, 4, 3, 3, 4, 5, 6, 6, 6, 7, 7, 8, 8, 8, 9, 9, 9, 9, 9, 8, 8, 7, 8, 8, 8, 8, 7, 7, 7, 7, 7, 6, 7, 8, 8, 8, 7, 7, 6, 6, 6, 7, 8, 9, 9, 9, 9, 9, 8, 8, 9, 9, 8, 8, 8, 8, 10, 11, 11, 11, 9, 8, 8, 7, 7, 7, 8, 9, 9, 9, 9, 7, 5, 5, 6, 7, 7, 6, 5, 5, 6, 6, 6, 7, 7, 7, 8, 8, 8, 8, 7, 5, 4, 2, 1, 0, 2, 3, 4, 4, 5, 5, 6, 6, 6, 5, 6, 7, 7, 5, 4, 4, 6, 7, 8, 9, 8, 8, 7, 7, 6, 5, 3, 3, 4, 6, 7]
2112Gjj%%JJ%J%jj%%jj%jJJJ%%%JKJ%jkJ%J%%j%j%%%Jj%jj%J%j%JJJJ%j%J%J%J%%j%j%%%%
2093I%%J%%%%%JJjj%J%%J%JJjjjjJ%JJ%%jjjjkj%%%%J%jjj%JLJJjkj%J%jjjjJJj%jjKKKJj
2073H%j%JJ%%jj%jJ%J%J%%%%%%j%j%jJ%KJj%j%JJKJ%%j%%%j%jjJ%J%KJ%jkj%J%J%J%%%j%%
2054A2j%jj%jJJ%JJ%%Jjjj%%%J%J%JJjj%%%%j%%%%%jk%%%J%J%%%%jjj%%JJ%Jjjk%%%%J%JJ
2035IJ%jjj%JJJ%j%jjJ%JJ%J%j%%j%%JJJ%j%%jjj%%%%jj%J%KJJj%%JJ%%j%j%%%%%%J%J%%J
2016A3%j%%J%JJ%%j%j%j%j%jJJJj%J%%%j%j%jJ%KJJJjj%%J%kj%j%%%%JJJJJ%%JJJjj%%%%j
1996A6jjjjj%%JJ%jJ%%JJK%JjjJK%%%%j%%%j%%%kkk%JJ%JJJj%%J%j%JJj%%%%JJ%Jj%%%jjj
1977A5jjJJ%J%K%j%j%%%j%JJJ%J%%J%jjJj%%jJ%%J%JJ%%%j%J%%j%%%%J%J%J%J%J%JJKJjk%
$$ y = [7, 6, 5, 5, 5, 6, 7, 7, 8, 8, 7, 6, 6, 6, 5, 4, 4, 3, 4, 5, 6, 6, 6, 6, 7, 9, 10, 10, 9, 7, 8, 8, 9, 9, 9, 8, 8, 7, 7, 7, 7, 8, 7, 7, 6, 5, 5, 6, 6, 5, 5, 6, 7, 8, 9, 9, 8, 8, 9, 9, 10, 10, 11, 11, 11, 10, 10, 9, 9, 9, 9, 9, 9, 9, 10, 10, 10, 10, 10, 10, 11, 12, 11, 10, 10, 11, 11, 11, 12, 12, 13, 14, 13, 12, 11, 10, 11, 11, 12, 13, 13, 13, 12, 11, 10, 9, 7, 6, 6, 6, 6, 6, 7, 7, 6, 5, 4, 4, 5, 8, 9, 10, 9, 7, 6, 6, 7, 7, 6, 5, 4, 3, 4, 5, 4, 4, 3, 2, 4, 6, 8, 9, 8, 8, 7, 7, 8, 9, 9, 9, 8, 7, 7, 6, 7, 7, 8, 8, 9, 9, 9, 9, 9, 9, 9, 8, 8, 7, 7, 6, 7, 7, 9, 10, 9, 9, 8, 8, 9, 10, 12, 13, 13, 13, 12, 12, 12, 12, 11, 11, 10, 9, 10, 10, 11, 11, 13, 14, 14, 13, 11, 10, 10, 11, 11, 12, 12, 13, 13, 13, 13, 12, 12, 12, 11, 11, 10, 9, 9, 8, 9, 10, 10, 11, 12, 12, 12, 13, 12, 11, 10, 10, 10, 10, 11, 11, 12, 12, 13, 14, 13, 12, 12, 12, 12, 12, 11, 11, 11, 11, 11, 11, 10, 8, 8, 8, 8, 9, 9, 10, 10, 10, 10, 10, 9, 8, 7, 7, 7, 8, 9, 9, 10, 9, 8, 6, 6, 6, 6, 6, 7, 7, 8, 9, 10, 10, 9, 8, 7, 7, 8, 9, 10, 10, 9, 9, 8, 7, 8, 8, 9, 10, 10, 11, 11, 10, 10, 10, 9, 9, 9, 10, 11, 12, 12, 11, 11, 11, 10, 9, 8, 8, 8, 8, 8, 7, 6, 6, 7, 7, 9, 10, 11, 10, 10, 10, 11, 12, 12, 12, 11, 11, 10, 10, 10, 10, 10, 10, 10, 11, 11, 12, 12, 12, 13, 13, 12, 12, 12, 13, 13, 14, 15, 15, 15, 14, 14, 13, 13, 12, 12, 11, 11, 10, 11, 12, 13, 12, 12, 13, 13, 13, 13, 12, 12, 11, 11, 10, 11, 11, 13, 14, 15, 16, 15, 14, 14, 14, 15, 15, 13, 12, 12, 11, 11, 11, 11, 11, 12, 13, 14, 15, 16, 16, 16, 17, 18, 19, 18, 17, 17, 17, 17, 17, 16, 15, 14, 13, 12, 11, 11, 11, 12, 13, 13, 12, 13, 13, 13, 14, 15, 17, 17, 18, 17, 16, 17, 19, 19, 19, 19, 19, 18, 18, 18, 18, 17, 17, 17, 17, 15, 13, 11, 11, 12, 13, 13, 14, 15, 16, 15, 15, 15, 16, 16, 15, 15, 16, 17, 16, 16, 16, 16, 16, 17, 18, 18, 19, 18, 18, 18, 18, 17, 16, 15, 14, 13, 14, 15, 15, 16, 16, 18, 18, 17, 17, 16, 16, 16, 16, 15, 15, 16, 17, 18, 18, 19, 19, 19, 20, 20, 19, 18, 19, 18, 18, 18, 17, 18, 18, 18, 19, 19, 20, 21, 21, 21, 21, 20, 20, 21, 21, 21, 20, 20, 20, 20, 20, 21, 21, 22, 22, 23, 23, 24, 24, 25, 25, 26, 27, 29, 30, 29, 27, 27]
1958B7%j%%jJKJjjjj%KJ%Jjj%%%jJ%%%%%J%J%%jkk%JJKj%%%%%%j%%J%J%J%J%jkjk%%J%LK%
1939C0j%%%%JJ%J%%J%%%%%%%%%%%%%J%J%%%JJ%%j%KKJK%%j%%jKLJJJ%J%%%JLKJLK%JJJ%JL
1920F9KKKKKLJKMLLLMKLLLLNOMNQPJ0J3J3J4J8K3K7K8K5J1qj9k3k1j3oljLMMOQPRJ0J0J2J3
1906C25J2J2J5J7J6J8K2K1K2K6K8K6L0L4L4L8M2M5M6N3N8O2P0Q1Q8R7J14J28J42J68J97K26
1897B313K71L34M11N28P11R58J239J497J670J811K077K565L268M070M480L583R81k330m661
1892B5776n239m597l591k646j892j363j013p63n93m80l90l18k70k32j96j73j58j39j24j18
1886A481j07r5r0q5p4o8o6o0n5n3n0m4m3m1l5l3l3l0k6k5k4k0j9k0j6j4j4j2rj1j1ppqonn
1876A60nmmnjJKLONPJ3J8K0K0Rrk4k9k8k4j7j2romlnnlljjlkkkkjk%J%jj%%jJjlk%%%%jk%
$$ y = [27, 27, 26, 26, 26, 25, 26, 28, 29, 28, 27, 26, 25, 25, 27, 28, 28, 29, 28, 27, 27, 27, 27, 26, 27, 27, 27, 27, 27, 27, 28, 28, 29, 29, 29, 28, 26, 24, 24, 25, 26, 28, 27, 27, 27, 27, 27, 27, 27, 26, 26, 26, 27, 27, 28, 28, 29, 29, 30, 30, 29, 27, 26, 24, 24, 24, 25, 25, 28, 30, 30, 29, 29, 29, 29, 29, 30, 31, 31, 32, 32, 32, 33, 33, 33, 33, 33, 33, 33, 33, 33, 33, 33, 33, 33, 33, 34, 34, 35, 35, 35, 35, 36, 37, 37, 37, 36, 36, 38, 40, 41, 43, 43, 43, 42, 42, 42, 41, 43, 46, 47, 48, 49, 49, 50, 50, 50, 50, 51, 54, 56, 57, 60, 62, 62, 63, 64, 65, 65, 66, 69, 71, 73, 75, 77, 79, 82, 83, 85, 89, 92, 95, 98, 102, 104, 107, 110, 113, 116, 121, 127, 131, 136, 144, 151, 161, 174, 187, 201, 219, 242, 269, 297, 322, 333, 325, 306, 283, 262, 249, 243, 240, 239, 242, 246, 250, 256, 264, 271, 280, 290, 300, 312, 325, 337, 349, 364, 381, 397, 415, 437, 458, 480, 506, 534, 560, 590, 624, 658, 696, 738, 783, 829, 882, 940, 1002, 1072, 1153, 1241, 1338, 1452, 1580, 1722, 1890, 2087, 2313, 2584, 2918, 3329, 3857, 4568, 5526, 6765, 8262, 9932, 11743, 13820, 16385, 19653, 23723, 28203, 31786, 32767, 30437, 25776, 20537, 15940, 12349, 9703, 7811, 6448, 5435, 4672, 4079, 3599, 3209, 2891, 2621, 2389, 2193, 2020, 1862, 1723, 1599, 1481, 1374, 1279, 1189, 1104, 1030, 962, 896, 836, 781, 728, 678, 634, 591, 550, 515, 482, 449, 419, 393, 368, 344, 324, 305, 285, 269, 255, 241, 229, 220, 209, 198, 191, 184, 176, 170, 165, 160, 155, 151, 147, 142, 141, 142, 144, 147, 153, 158, 165, 178, 196, 216, 236, 245, 236, 212, 183, 155, 131, 114, 102, 93, 87, 83, 80, 75, 70, 67, 64, 63, 62, 59, 57, 55, 53, 51, 50, 48, 48, 49, 49, 48, 47, 47, 47, 46, 47, 46, 43, 41, 41, 41, 41, 41, 40, 38, 38]
1860C8%j%j%%%jljkkl%jjjjjj%%%Jjjjjjkkjk%%JJJ%%Jkj%jj%JJJJj%j%j%J%KJKJ%%J%%%%
1841A5%jj%JJKJJJ%%%Jj%%Jjj%K%kkj%%J%%KJJJjjjj%j%kjj%J%%%%%%%j%kjJj%JJ%j%j%jj
1822Hj%j%J%jjjJ%%%%%j%%jJJJJ%j%%%j%%jJ%%jjjj%%j%JJJK%%%Jj%%%%%%J%%%%%%jkj%%%
1803Bjj%jJJj%jj%JK%J%J%%%%%%JJJ%%jjjj%J%%%j%jjk%%%J%%j%jj%%%%%J%J%%%%%JJ%%J%
1783A%%kk%%J%J%%J%%%Jjk%J%%%j%J%%%jjJJ%%j%%%%J%%kjjjJ%%%%%JJJJ%%J%j%Jj%%%jJ%
1764a%JJ%jjjj%%%%j%jJJJJ%J%%jj%J%jjjjJ%%J%%J%jJJJj%%%%%%j%%%%%Jjjj%JJJ%jj%J%
1745bJK%J%%%%J%%%%%Jjjj%%%JJ%jjk%J%%jjjjJ%%J%%%J%%j%k%%%%%J%%JJ%%jj%kj%%JJKJ
1725aj%%J%%%J%jj%%%%%%j%%%KJjj%%%%JJJJ%jj%%jj%jJ%%J%J%%jj%J%%%%%jj%JJ%J%%%%j
$$ y = [38, 38, 37, 37, 36, 36, 36, 36, 35, 32, 31, 29, 27, 24, 24, 23, 22, 21, 20, 19, 18, 18, 18, 18, 19, 18, 17, 16, 15, 14, 12, 10, 9, 7, 7, 7, 8, 9, 10, 10, 10, 11, 9, 8, 8, 7, 6, 6, 7, 8, 9, 10, 9, 9, 8, 8, 7, 7, 8, 8, 10, 11, 13, 14, 14, 14, 15, 15, 15, 15, 15, 15, 14, 13, 13, 14, 15, 17, 18, 19, 20, 20, 20, 20, 21, 20, 20, 20, 21, 20, 19, 19, 21, 21, 19, 17, 16, 16, 16, 17, 17, 17, 19, 20, 21, 22, 21, 20, 19, 18, 18, 17, 17, 15, 14, 13, 13, 14, 14, 14, 14, 14, 14, 14, 14, 13, 13, 11, 10, 11, 10, 10, 11, 12, 12, 11, 11, 10, 10, 9, 8, 7, 7, 6, 6, 7, 7, 6, 5, 4, 5, 5, 5, 5, 5, 5, 4, 4, 4, 3, 4, 5, 6, 7, 7, 6, 6, 6, 6, 5, 5, 5, 4, 5, 5, 5, 4, 3, 2, 1, 1, 1, 0, 0, 1, 2, 3, 5, 5, 5, 5, 6, 5, 5, 5, 5, 5, 5, 5, 6, 6, 6, 6, 6, 6, 6, 5, 3, 2, 2, 2, 2, 1, 0, 0, -1, 0, 1, 0, 0, -1, -2, -2, -1, 1, 1, 2, 2, 3, 3, 3, 3, 3, 3, 3, 4, 5, 6, 6, 6, 5, 4, 3, 2, 2, 3, 3, 3, 3, 2, 2, 1, 0, -2, -2, -2, -2, -1, -1, -1, -2, -2, -3, -4, -4, -4, -4, -4, -4, -3, -3, -2, -2, -2, -2, -2, -2, -1, 0, 0, 0, 1, 1, 1, 1, -1, -3, -3, -3, -2, -2, -1, -1, -1, 0, 0, 0, 0, 1, 0, -2, -2, -1, -1, -1, -1, -2, -2, -1, -1, -1, -1, -2, -3, -2, -1, -1, -1, -2, -2, -2, -2, -2, -1, -1, -1, -3, -4, -5, -6, -5, -5, -5, -5, -5, -5, -4, -3, -2, -1, -1, -1, 0, 0, -1, -1, 0, -1, -1, -1, -1, -2, -1, -1, -1, 0, 1, 1, 0, -1, -2, -3, -3, -3, -3, -3, -4, -4, -5, -4, -3, -2, -1, -1, 0, 0, 0, -1, -2, -2, -1, -1, -2, -3, -4, -5, -4, -4, -4, -3, -3, -3, -2, -2, -3, -2, -1, 0, -1, -1, -1, -1, -1, -1, -1, -2, -2, -2, -2, -2, -2, -1, -2, -3, -4, -4, -3, -2, -1, -1, -2, -3, -3, -2, -2, -1, 1, 1, 2, 2, 2, 2, 2, 3, 3, 3, 3, 3, 3, 4, 3, 2, 1, 1, 1, 1, 2, 3, 3, 2, 1, -1, -1, 0, 0, 0, -1, -2, -3, -4, -3, -3, -3, -2, -2, -2, -2, -1, -1, -1, -2, -2, -4, -4, -4, -4, -4, -4, -3, -3, -3, -2, -1, -1, -1, -2, -3, -3, -5, -6, -6, -6, -5, -4, -2, -1, -2, -2, -2, -1, -1, -1, -1, 0, 0, -1, -2, -2, -2, -2, -2, -2, -2, -3, -3, -3, -3, -1, 0, -1, -2, -2, -2, -2, -2, -1, 0, 1, 2, 2, 1, 0, 0, 0, -1, -2, -2, -3, -2, -2, -2, -1, -1, 0, 0, 0, -1, -2, -2, -1, -1, -1, -1, -1, -1, -2, -3, -3, -2, -1, -1, 0, 0, 0, 0, 0, -1]
1706a%%kj%%%%%K%%%%%J%%j%j%%%j%%KJ%%j%J%%kk%J%%%%j%%JJjj%KJJj%j%j%%Jjjj%j%%J
1687f%JJ%J%J%%kj%K%jj%jj%%jJJ%J%%%%%jj%j%%JJJ%%%%J%j%%j%%%%%%%J%JJ%%jJJ%%%%%
1667bj%%%%J%%%%%j%j%%%%%%J%J%%%%%j%j%%%%j%%%J%J%J%%%%Jkjjj%%%%%%JJ%J%%%%%j%j
1648eJ%j%%%JJJJ%%%J%jk%%J%%%j%%%%%%jk%%J%jjJ%J%%J%%J%%%%%%%%%%%JJjkjJ%%%j%j%
1629f%%JJJ%%%%%J%Jj%%j%%%%%jk%%J%J%%%%jj%J%jJKJ%j%jjkj%%j%JJ%J%J%%%%%%%%J%%%
1609d%J%%%JjkjkjjJKJJKJjjk%%%%J%%%%%%%%%J%%%J%%jjjj%J%%j%j%%KJ%%%%%%%J%j%%JJ
1590c%%jjJj%%J%J%%J%%jj%%%J%%j%%jj%jj%JjjJJJJJj%jJ%JJ%%%jj%JJJj%JJjjjjjkJ%%J
1571fJ%jjJ%JJJ%%j%JJ%%jjj%%%%J%J%%%%j%j%%jjJJ%jJJ%%%%j%%%%J%J%%%%%j%%%%%%j%%
$$ y = [-1, -1, -1, -3, -4, -4, -4, -4, -4, -4, -2, -2, -2, -2, -2, -2, -1, -1, -1, -2, -2, -3, -3, -3, -3, -4, -4, -4, -2, -1, -1, -1, -2, -2, -1, -1, -1, -3, -5, -5, -4, -4, -4, -4, -4, -5, -5, -5, -4, -3, -4, -5, -5, -3, -2, -1, -2, -2, -3, -3, -4, -4, -4, -3, -4, -5, -6, -6, -7, -7, -7, -6, -6, -5, -4, -4, -3, -3, -2, -2, -2, -4, -5, -5, -3, -3, -4, -5, -5, -6, -7, -7, -7, -8, -7, -6, -6, -5, -5, -5, -5, -5, -5, -6, -7, -7, -8, -8, -8, -7, -6, -5, -5, -5, -5, -5, -4, -4, -5, -5, -5, -6, -6, -6, -6, -6, -6, -6, -6, -5, -5, -4, -3, -3, -3, -4, -3, -2, -2, -2, -2, -2, -2, -3, -3, -3, -3, -3, -2, -2, -2, -2, -2, -2, -3, -3, -4, -4, -4, -4, -4, -4, -4, -3, -3, -2, -2, -2, -2, -2, -2, -3, -3, -4, -4, -4, -4, -4, -5, -5, -5, -5, -4, -4, -3, -3, -2, -2, -2, -2, -2, -1, -3, -4, -5, -6, -6, -6, -6, -6, -6, -6, -5, -4, -4, -3, -3, -3, -3, -3, -3, -4, -4, -5, -4, -4, -5, -5, -5, -5, -4, -3, -2, -1, -1, -1, -1, 0, 0, -1, -3, -3, -3, -2, -2, -2, -2, -3, -3, -3, -3, -3, -3, -3, -4, -6, -6, -6, -5, -5, -6, -7, -6, -6, -5, -5, -5, -4, -4, -4, -3, -3, -3, -3, -3, -3, -3, -3, -3, -3, -3, -3, -2, -1, -2, -4, -5, -4, -4, -4, -4, -5, -5, -6, -6, -6, -6, -5, -4, -3, -3, -3, -3, -3, -3, -2, -2, -1, -2, -2, -2, -3, -3, -3, -3, -3, -3, -4, -6, -6, -6, -5, -5, -4, -4, -4, -4, -4, -5, -6, -6, -5, -5, -6, -5, -3, -2, -2, -3, -3, -4, -5, -7, -8, -8, -8, -9, -9, -8, -7, -7, -6, -6, -5, -5, -5, -5, -5, -5, -5, -5, -5, -4, -4, -4, -4, -4, -3, -3, -3, -3, -2, -3, -5, -6, -8, -9, -10, -9, -7, -6, -5, -3, -2, -3, -4, -6, -6, -6, -6, -6, -5, -5, -5, -5, -5, -5, -5, -5, -5, -5, -4, -4, -4, -4, -3, -3, -3, -4, -5, -6, -7, -7, -6, -6, -6, -7, -7, -8, -8, -8, -6, -5, -5, -5, -5, -5, -5, -5, -5, -4, -4, -5, -5, -5, -4, -3, -3, -3, -4, -5, -4, -5, -5, -5, -4, -4, -3, -3, -3, -2, -2, -2, -3, -4, -4, -4, -4, -3, -3, -3, -4, -4, -4, -5, -6, -6, -7, -8, -8, -7, -8, -9, -8, -7, -6, -5, -4, -5, -5, -6, -5, -5, -4, -3, -3, -3, -3, -4, -5, -5, -4, -3, -2, -3, -3, -2, -1, -2, -3, -4, -5, -6, -8, -7, -7, -7, -6, -5, -5, -6, -7, -6, -6, -5, -4, -3, -3, -3, -4, -4, -3, -2, -2, -2, -3, -4, -5, -5, -5, -5, -5, -4, -4, -3, -3, -3, -3, -3, -4, -4, -5, -5, -5, -6, -7, -6, -5, -5, -6, -5, -4, -4, -4, -4, -4, -5, -5, -5, -5, -5, -4, -4, -3, -3, -3, -3, -3, -3, -4, -4, -4, -4, -4, -4, -4, -5, -5, -5]
1551e%J%%Jjjk%%JJ%%%j%%J%%%%j%KKJ%J%%%kkj%JJ%jjj%%j%%jKJ%%J%JJ%%%j%j%JJ%j%%j
1532d%%%%%jj%%%%J%%%%%%%JJ%j%%%JJ%jj%%j%%%jJ%jJ%%%%%%%%%%%%j%%%%J%%%jjj%%KJJ
1513d%%%%JJj%%%j%%%j%J%%%J%%%%jjJ%jk%%%jJJj%jkJ%JJJJ%j%%JJJ%kjJ%%%J%J%J%%%jj
1493dj%JJK%jjkk%JJJJJ%%%%%jkjjJKKJj%j%J%Jjjj%J%jj%%%%jjJJ%%k%%JJJ%j%%%jj%jJJ
1474fKJ%%JJK%%%%JJJjjkk%jJ%j%%JJJJjjjjjjJj%%j%%%J%%%%%JJjj%J%%jJ%%j%j%JJJJ%%
1454b%%J%%kj%JJj%%j%J%%%%J%j%j%j%%jjj%%JJjjJJ%j%%%KJJ%jj%JJJ%jj%%%%%j%%%jjJJ
1435e%%JJ%%%J%%j%j%%J%%%jjJJ%j%%j%%%%j%%%%J%%%%%%j%kk%KKJ%j%%%%%%%%J%%%%%%J%
1416d%%%j%%%j%%j%J%%Jj%j%%J%%KJJJ%JJj%j%jjjJ%j%jjJ%JJj%j%%j%%%%%j%J%jjJJ%%%%
$$ y = [-5, -5, -4, -4, -4, -3, -4, -5, -7, -7, -7, -6, -5, -5, -5, -5, -6, -6, -6, -5, -5, -5, -5, -5, -6, -6, -4, -2, -1, -1, 0, 0, 0, 0, -2, -4, -5, -5, -4, -3, -3, -4, -5, -6, -6, -6, -7, -7, -7, -8, -6, -5, -5, -5, -4, -4, -3, -2, -2, -2, -2, -3, -3, -4, -4, -3, -2, -2, -3, -3, -3, -4, -4, -4, -4, -4, -4, -5, -6, -6, -6, -6, -6, -5, -5, -5, -5, -5, -5, -5, -5, -4, -3, -3, -4, -4, -4, -4, -3, -2, -2, -3, -4, -4, -4, -5, -5, -5, -5, -6, -5, -5, -6, -5, -5, -5, -5, -5, -5, -5, -5, -5, -5, -5, -5, -5, -6, -6, -6, -6, -6, -5, -5, -5, -5, -6, -7, -8, -8, -8, -6, -5, -4, -4, -4, -4, -4, -3, -2, -3, -3, -3, -3, -4, -4, -4, -4, -5, -5, -4, -4, -4, -4, -3, -3, -3, -3, -3, -4, -5, -4, -4, -5, -7, -7, -7, -7, -8, -7, -6, -7, -7, -8, -10, -9, -9, -8, -7, -6, -5, -5, -6, -6, -6, -5, -4, -3, -3, -5, -6, -5, -5, -5, -5, -4, -4, -3, -3, -2, -2, -2, -2, -3, -4, -5, -5, -4, -3, -1, -1, -2, -3, -5, -7, -7, -6, -5, -4, -3, -2, -2, -2, -2, -2, -2, -3, -5, -6, -7, -6, -4, -2, -1, -2, -2, -3, -3, -2, -2, -1, -2, -3, -4, -4, -3, -3, -4, -5, -5, -5, -5, -5, -6, -7, -6, -5, -5, -5, -7, -7, -7, -6, -5, -4, -4, -5, -5, -5, -5, -6, -7, -7, -8, -7, -6, -4, -3, -3, -3, -2, -1, 1, 1, 1, 1, 1, 2, 3, 4, 3, 2, 0, -2, -2, -3, -2, -2, -3, -3, -3, -2, -1, 0, 1, 0, -1, -2, -3, -4, -5, -4, -5, -5, -5, -6, -6, -6, -6, -5, -5, -5, -5, -5, -5, -4, -3, -4, -5, -5, -4, -4, -4, -5, -4, -4, -4, -5, -5, -6, -6, -5, -4, -3, -2, -2, -2, -2, -2, -1, -1, -1, -3, -4, -4, -3, -2, -3, -3, -3, -4, -4, -3, -3, -3, -3, -3, -2, -2, -3, -3, -4, -4, -5, -5, -5, -6, -7, -8, -8, -8, -7, -6, -7, -8, -7, -6, -6, -7, -7, -7, -7, -5, -4, -3, -3, -4, -5, -5, -4, -3, -2, -2, -3, -4, -4, -4, -4, -4, -4, -5, -5, -5, -5, -6, -7, -6, -5, -5, -5, -4, -3, -3, -3, -3, -2, -2, -2, -3, -3, -4, -4, -4, -3, -3, -3, -3, -4, -5, -4, -3, -3, -4, -4, -4, -5, -5, -5, -5, -5, -6, -6, -6, -6, -6, -5, -5, -5, -5, -5, -5, -5, -6, -6, -8, -10, -10, -8, -6, -5, -5, -6, -6, -6, -6, -6, -6, -6, -6, -6, -5, -5, -5, -5, -5, -5, -5, -4, -4, -4, -4, -4, -5, -5, -5, -5, -6, -6, -6, -7, -7, -6, -6, -6, -5, -6, -6, -7, -7, -7, -6, -6, -6, -4, -3, -2, -1, -1, 0, 1, 0, 0, -1, -1, -2, -3, -4, -3, -3, -4, -4, -5, -6, -5, -5, -4, -3, -4, -4, -5, -5, -5, -6, -6, -6, -6, -6, -6, -7, -7, -6, -6, -7, -8, -7, -6, -6, -6, -6, -6]
1396f%%%JJ%j%jJ%KKJJj%j%kj%JJJ%J%jjj%JJ%J%%%jjjj%%JJKJj%%j%JJ%%%%%%%%jJ%%%%%
1377A%%%%%%%%%%jJ%%kkjkjj%k%%%j%JKJj%%J%Jj%%%jj%%J%%%J%%%%%J%%%%j%jJ%J%%j%%%
1358gjJ%K%%%%%J%%%%%%%%jj%jj%%j%J%JJ%%j%%jj%%%%J%JJJ%%%%j%j%%%%%JKJJ%%J%jjk%
1338ej%j%J%%%%%%%j%j%%%KJJ%%Jj%%J%Jkjjjjj%J%J%J%%J%jjj%JJJ%Jj%%%%%%JKJJjjjj%
1319dJJj%jj%J%%%%Jjjj%%%%%%%%%%J%%%jj%K%j%jjj%%KJJ%jj%j%JJ%%%jjJJJ%%%%%jj%%j
1300h%%JJ%j%%%%%JJK%%j%j%%J%jjjJ%%%%jj%%J%Jj%JJ%j%%%%%%J%%%j%J%%jj%%%j%%%%%%
1280hJJ%jjjj%%%j%%JJJJKKJJ%jjj%%j%%%JJ%%jjjj%%%jJ%JKJK%j%%%%%Jj%j%jjJ%%%jjjJ
1261fJ%%%JK%j%j%%%%JJJkk%Jj%J%JJ%%J%%jjjj%%JJ%Jjj%%%%J%JJjjjjj%JJJ%%j%JJ%jj%
$$ y = [-6, -6, -6, -6, -5, -4, -4, -5, -5, -6, -5, -5, -3, -1, 0, 1, 0, 0, -1, -1, -3, -4, -4, -3, -2, -1, -1, 0, 0, -1, -2, -3, -3, -2, -1, -1, 0, 0, 0, 0, -1, -2, -3, -4, -4, -4, -3, -2, 0, 1, 0, 0, 0, -1, -1, 0, 1, 1, 1, 1, 1, 1, 1, 1, 1, 0, 1, 1, 1, 1, 1, 1, 1, 1, 1, 1, 1, 1, 1, 1, 1, 1, 0, 1, 1, 1, -1, -3, -4, -6, -7, -8, -8, -10, -10, -10, -10, -11, -11, -10, -8, -7, -8, -8, -8, -7, -7, -6, -7, -7, -7, -7, -8, -9, -9, -9, -8, -8, -8, -8, -7, -7, -7, -7, -7, -7, -6, -6, -6, -6, -6, -7, -7, -8, -7, -7, -6, -6, -6, -7, -7, -7, -7, -8, -7, -7, -5, -5, -5, -5, -5, -5, -4, -4, -4, -4, -4, -4, -4, -4, -4, -5, -6, -6, -7, -8, -8, -8, -9, -9, -8, -8, -7, -6, -6, -6, -7, -7, -7, -8, -9, -9, -9, -9, -9, -8, -8, -7, -6, -5, -5, -5, -5, -5, -6, -6, -7, -7, -7, -7, -7, -7, -6, -4, -3, -2, -2, -2, -1, -1, -2, -3, -5, -5, -6, -6, -7, -7, -6, -6, -6, -6, -6, -6, -6, -6, -7, -7, -8, -8, -8, -8, -6, -5, -4, -4, -4, -3, -4, -4, -4, -3, -3, -2, -4, -5, -6, -7, -8, -9, -9, -8, -8, -7, -7, -6, -6, -6, -5, -5, -6, -7, -8, -8, -7, -6, -5, -5, -4, -5, -5, -5, -5, -5, -5, -5, -4, -2, -1, 0, -1, -2, -3, -4, -4, -3, -2, -3, -3, -4, -5, -5, -4, -4, -4, -4, -4, -3, -4, -5, -6, -6, -6, -6, -6, -6, -6, -6, -6, -6, -6, -5, -5, -5, -5, -6, -7, -7, -5, -5, -6, -6, -7, -8, -9, -9, -9, -7, -6, -5, -5, -6, -7, -7, -8, -8, -7, -6, -6, -6, -6, -7, -8, -7, -6, -5, -5, -5, -5, -5, -5, -6, -7, -7, -7, -8, -8, -8, -7, -6, -6, -7, -7, -7, -7, -7, -7, -6, -5, -3, -3, -3, -4, -4, -5, -5, -5, -4, -4, -5, -6, -7, -6, -6, -6, -6, -6, -7, -8, -8, -8, -7, -7, -6, -7, -7, -6, -5, -5, -6, -6, -6, -6, -6, -6, -6, -5, -5, -5, -5, -6, -6, -5, -5, -5, -6, -7, -7, -7, -7, -8, -8, -8, -8, -8, -8, -8, -7, -6, -6, -7, -8, -9, -10, -10, -10, -10, -11, -11, -11, -10, -9, -8, -7, -5, -3, -2, -1, -1, -2, -3, -4, -4, -4, -5, -5, -5, -5, -4, -3, -3, -3, -4, -5, -6, -7, -7, -7, -7, -8, -7, -7, -6, -4, -3, -1, -1, -2, -2, -2, -2, -2, -2, -1, -2, -2, -3, -3, -4, -5, -4, -4, -4, -4, -5, -6, -7, -6, -5, -5, -5, -5, -4, -2, -2, -3, -3, -4, -4, -4, -4, -4, -3, -2, -1, -3, -5, -5, -4, -5, -5, -4, -4, -3, -2, -2, -2, -1, -1, -1, -2, -3, -4, -5, -5, -5, -4, -3, -3, -2, -3, -4, -4, -4, -4, -4, -3, -3, -2, -1, -2, -3, -4, -5, -6, -6, -5, -4, -3, -3, -3, -4, -4, -3, -2, -2, -3, -4, -4]
1242d%JJJ%jk%Jjj%J%%jjJJJJ%%%%J%%%j%j%%j%jJ%%%JJ%J%%kj%%%%jJ%%jjj%%KJJ%%%J%J
1222a%J%%j%J%kjj%J%%%j%j%jJ%jjj%JKK%%J%j%%%j%%j%%j%%%%%%jJJJKj%%%%%JJj%%%j%j
1203d%jjJ%%Jj%%%%%%jJKJJ%%j%%j%j%Jjj%Jj%jj%jJ%%JJJJJ%%%%%kjj%J%%%%%jk%JKKJ%j
1184ck%%%%%%%%%%%%J%%%%%j%%%jJJJJKjjk%%J%%%j%%%%J%J%Jj%jjJ%%%%%%jJ%JJ%%jkjJJ
1164c%JjjJJJ%kj%JKJJ%jjj%J%jj%%jj%JJJJ%kk%%JJ%J%%jjj%Jj%JJJk%%j%%JJJj%jj%j%J
1145e%%JJj%%%JJJJJ%%kkj%jJ%Jj%%%%j%JKJ%jjj%JJ%J%%j%%%%%%%%j%%%%%%%%%j%JK%JJJ
1126B%%jj%%%%%jjk%jJJ%jjkjJ%%%JJJ%%%J%J%JJj%%%kjjJJ%%%j%%%j%%%KJJ%jjJK%j%JJ%
1106A%j%jjj%jjjjjJ%%%%j%%%%%%%%J%%%JJJJjjJ%%Jj%%%%J%%%%%jjjjJJK%jkj%%%Jjj%jJ
$$ y = [-4, -4, -3, -2, -1, -1, -2, -4, -4, -3, -4, -5, -5, -4, -4, -4, -5, -6, -5, -4, -3, -2, -2, -2, -2, -2, -1, -1, -1, -1, -2, -2, -3, -3, -3, -4, -4, -5, -4, -4, -4, -4, -3, -2, -2, -1, -1, -1, -3, -4, -4, -4, -4, -4, -5, -4, -4, -4, -5, -6, -7, -7, -7, -5, -4, -3, -3, -3, -3, -2, -2, -1, -1, 0, 0, 0, -1, -1, 0, 0, -2, -3, -4, -4, -3, -3, -3, -3, -4, -4, -5, -5, -6, -5, -5, -6, -7, -8, -8, -7, -5, -3, -3, -3, -2, -2, -3, -3, -3, -3, -4, -4, -4, -5, -5, -5, -6, -6, -6, -6, -6, -6, -6, -7, -6, -5, -4, -2, -3, -3, -3, -3, -3, -3, -2, -1, -2, -2, -2, -2, -3, -3, -4, -4, -5, -6, -5, -5, -5, -4, -5, -5, -5, -5, -5, -5, -5, -6, -5, -3, -2, -1, -1, -1, -2, -2, -2, -3, -3, -4, -4, -3, -4, -5, -5, -4, -5, -5, -6, -7, -7, -8, -7, -7, -7, -6, -5, -4, -3, -2, -2, -2, -2, -2, -2, -4, -5, -6, -6, -5, -5, -5, -5, -5, -5, -6, -8, -8, -7, -5, -3, -2, -2, -3, -5, -5, -5, -5, -5, -5, -5, -5, -5, -5, -5, -5, -5, -4, -4, -4, -4, -4, -4, -5, -5, -5, -5, -6, -5, -4, -3, -2, 0, -1, -2, -4, -4, -4, -3, -3, -3, -3, -4, -4, -4, -4, -4, -3, -3, -2, -2, -1, -2, -2, -3, -4, -3, -3, -3, -3, -3, -3, -3, -4, -3, -3, -2, -1, -1, -1, -2, -4, -5, -4, -3, -3, -2, -3, -4, -3, -2, -1, -1, -3, -4, -4, -3, -1, 0, 1, 1, 0, -1, -2, -2, -1, -1, -2, -3, -3, -3, -4, -5, -5, -4, -3, -2, -1, -1, -3, -5, -5, -5, -4, -3, -3, -2, -2, -2, -3, -4, -5, -5, -4, -5, -5, -4, -3, -2, -4, -4, -4, -5, -5, -5, -4, -3, -2, -3, -3, -4, -5, -5, -6, -6, -5, -5, -5, -4, -3, -4, -4, -4, -4, -3, -2, -1, 0, 1, 1, 1, -1, -3, -4, -4, -5, -4, -4, -3, -4, -4, -4, -4, -4, -5, -5, -4, -2, -1, -1, -2, -3, -4, -4, -3, -2, -2, -1, -1, -1, -2, -2, -2, -2, -2, -2, -2, -2, -2, -3, -3, -3, -3, -3, -3, -3, -3, -3, -3, -4, -4, -3, -1, -1, 0, 1, 2, 2, 2, 1, 0, 0, 0, 0, 0, 0, -1, -2, -4, -4, -5, -4, -3, -3, -4, -5, -7, -8, -7, -7, -7, -7, -6, -5, -4, -4, -4, -4, -3, -3, -2, -2, -1, 0, -1, -1, -1, -1, -3, -4, -5, -4, -3, -3, -3, -3, -4, -4, -4, -4, -5, -5, -5, -5, -3, -2, -1, -1, -2, -3, -2, 0, 0, -1, -1, 0, 1, 1, 1, 0, 0, -1, -2, -3, -3, -4, -5, -6, -7, -8, -7, -7, -7, -7, -7, -8, -8, -8, -8, -8, -8, -8, -8, -8, -7, -7, -7, -7, -6, -5, -4, -3, -4, -5, -4, -4, -4, -3, -4, -4, -4, -4, -4, -3, -3, -3, -3, -3, -3, -4, -5, -6, -7, -6, -5, -3, -3, -4, -6, -7, -7, -7, -7, -6, -7, -8, -8, -9, -8]
1087hJKJJjjk%%%%%jj%%J%%%%%J%J%%%%%%%%%%%Jj%%%JJ%%%Jj%%%%%J%%JjjjjJ%%%%%%%%j
1068fjj%%jj%JJ%%JJ%%J%%jk%JJ%%jjjj%j%%%%%%J%%%JJJKJ%j%j%%J%jJ%%jJ%%j%%j%%%j%
1048hJ%%%%%%%%%KJJ%%JJ%j%J%jj%jJjjj%%JJ%%%%J%J%kjj%jJ%%%J%%%%J%JjjjjJ%J%jjJ%
1029f%%%J%Jj%%j%jJ%%J%%%%J%J%j%%JJ%jjj%jj%%JJJJj%jjj%JJJ%%j%J%J%%JJ%kk%%j%JJ
1010dj%%%jjjjjJJJ%JJ%J%j%%%%%%%%J%%%j%jj%j%j%LJJj%jjj%%%JKJ%j%%jj%%%%%%%%Jkj
990i%jJJJJJJJJ%J%kkj%JJ%%J%%%j%%%j%j%%%%jj%%%J%%JJj%JJJ%jkjj%%KJ%%%%%J%j%j%%
971fKJJJjjjj%J%%%j%jJ%J%JJ%j%%K%jjj%jjJ%J%%j%%jJJ%j%%j%JJJJ%%%%j%%%Jjjjj%J%%
951e%%jkjJJJ%%%%JJ%%%J%%%J%%%JJj%Jj%jjj%j%j%%%JJ%%j%%%%jJ%J%J%%%%j%%J%%j%jJ%
$$ y = [-8, -7, -5, -4, -3, -4, -5, -7, -7, -7, -7, -7, -7, -8, -9, -9, -9, -8, -8, -8, -8, -8, -8, -7, -7, -6, -6, -6, -6, -6, -6, -6, -6, -6, -6, -6, -6, -5, -6, -6, -6, -6, -5, -4, -4, -4, -4, -3, -4, -4, -4, -4, -4, -4, -3, -3, -3, -2, -3, -4, -5, -6, -5, -5, -5, -5, -5, -5, -5, -5, -5, -6, -7, -8, -8, -8, -9, -10, -10, -9, -8, -8, -8, -7, -6, -6, -6, -5, -5, -5, -6, -8, -8, -7, -6, -6, -6, -7, -8, -9, -10, -10, -11, -11, -11, -11, -11, -11, -11, -10, -10, -10, -10, -9, -8, -7, -5, -4, -4, -5, -5, -6, -6, -6, -5, -5, -6, -5, -5, -5, -6, -5, -5, -5, -6, -6, -6, -7, -7, -7, -7, -8, -8, -7, -7, -7, -7, -7, -7, -7, -7, -7, -7, -5, -4, -3, -3, -3, -2, -1, -1, -2, -2, -1, -1, -2, -3, -3, -4, -3, -4, -5, -6, -6, -6, -5, -4, -4, -4, -4, -4, -3, -3, -2, -2, -4, -5, -6, -6, -7, -6, -6, -6, -6, -5, -5, -5, -5, -5, -4, -4, -3, -4, -5, -6, -7, -6, -6, -5, -5, -6, -7, -6, -6, -6, -6, -6, -5, -5, -4, -5, -5, -5, -6, -6, -7, -6, -6, -6, -5, -5, -5, -5, -5, -4, -4, -3, -3, -4, -4, -4, -3, -2, -2, -3, -4, -5, -5, -6, -7, -7, -7, -6, -5, -4, -3, -4, -4, -5, -6, -7, -7, -6, -5, -4, -4, -4, -5, -5, -4, -4, -3, -3, -3, -2, -1, -1, -3, -5, -5, -5, -6, -6, -5, -4, -5, -5, -5, -5, -6, -7, -8, -9, -10, -9, -8, -7, -7, -6, -5, -5, -4, -4, -5, -5, -5, -5, -5, -5, -5, -5, -5, -4, -4, -4, -4, -5, -5, -6, -7, -7, -8, -8, -9, -9, -6, -5, -4, -5, -5, -6, -7, -8, -8, -8, -8, -7, -5, -4, -4, -5, -5, -5, -6, -7, -7, -7, -7, -7, -7, -7, -7, -7, -6, -8, -9, -9, -10, -9, -8, -7, -6, -5, -4, -3, -2, -2, -1, -1, -3, -5, -6, -6, -5, -4, -4, -4, -3, -3, -3, -3, -4, -4, -4, -4, -5, -5, -6, -6, -6, -6, -6, -7, -8, -8, -8, -8, -7, -7, -7, -6, -5, -6, -6, -5, -4, -3, -3, -4, -6, -7, -8, -8, -8, -6, -5, -5, -5, -5, -5, -5, -4, -4, -5, -5, -6, -6, -6, -4, -3, -2, -1, -2, -3, -4, -5, -5, -4, -4, -4, -4, -5, -5, -6, -5, -5, -4, -4, -3, -2, -2, -3, -3, -3, -1, -1, -2, -3, -4, -4, -5, -6, -5, -5, -4, -4, -4, -5, -5, -5, -6, -5, -4, -4, -5, -5, -5, -6, -6, -5, -4, -3, -2, -2, -2, -2, -2, -3, -3, -3, -3, -2, -3, -4, -5, -6, -6, -5, -5, -5, -5, -5, -6, -8, -9, -8, -7, -6, -6, -6, -6, -6, -5, -4, -4, -4, -4, -3, -3, -3, -3, -2, -2, -2, -2, -1, 0, -1, -1, 0, -1, -1, -2, -3, -4, -4, -5, -5, -6, -6, -6, -6, -5, -4, -4, -4, -5, -5, -5, -5, -5, -6, -5, -5, -4, -4, -3, -3, -3, -3, -3, -4, -4, -4, -3, -3, -3, -4, -4, -5, -4, -4]
931d%kj%%J%%%%JJ%jj%%%jj%%%%JKJ%%%%%jj%J%%JJjj%KJJjjj%jj%j%J%%JJK%JJ%Jj%jj%%
912b%jJ%kj%%j%JJJJ%%J%jj%j%%J%jjJJ%%%j%%j%J%%%J%%Jj%j%jj%J%%JJJ%JJjkjJ%kj%JJ
892dj%kj%JJK%Jj%%%%Jj%%%%J%%%%j%j%jj%Jjj%KJ%%J%%%%J%j%jkjjj%J%JJ%J%J%%J%%%J%
872cjjjJJJjjjjjjJKJK%%j%%J%%jk%jJ%j%J%%%%%J%%%%%%%j%%%JKJJ%%%%KJJJKJKJLKLJJk
853A8mlljkjkkkjJ%JJJJ%%j%j%%%%jj%jjj%%jJ%%%%%JJ%Jjj%JJ%%j%j%%jjjJJJ%%j%%%%Jj
834e%%%%%JJJJ%j%J%%%j%%JJj%%%j%%%%%j%%j%%%jJ%%%%%%%jj%jJ%%%%JJ%%jj%JJ%%%%%%j
814e%%%j%JJ%%%Jj%j%%JJ%%%%%%J%Jj%jjjjJJjj%%JJj%j%%J%jjj%%JJJJ%j%%JJ%%jj%%%J%
794dJj%JJ%%j%%j%jj%%%J%J%%J%J%Jj%%j%j%J%J%%%j%jj%jj%J%J%%%%%%j%JjJ%%jkJ%%%%%
$$ y = [-4, -4, -6, -7, -7, -7, -6, -6, -6, -6, -6, -5, -4, -4, -5, -6, -6, -6, -6, -7, -8, -8, -8, -8, -8, -7, -5, -4, -4, -4, -4, -4, -4, -5, -6, -6, -5, -5, -5, -4, -3, -4, -5, -5, -3, -2, -1, -2, -3, -4, -4, -5, -6, -6, -7, -7, -6, -6, -6, -5, -4, -2, -2, -1, 0, 0, 1, 0, 0, -1, -2, -2, -2, -2, -3, -2, -2, -4, -5, -5, -5, -6, -6, -5, -4, -3, -2, -2, -2, -1, -1, -2, -3, -3, -4, -4, -4, -3, -3, -4, -5, -4, -3, -3, -3, -3, -4, -4, -4, -5, -5, -4, -4, -4, -4, -3, -3, -3, -2, -3, -3, -4, -4, -5, -6, -6, -5, -5, -5, -4, -3, -2, -2, -1, 0, -1, -3, -4, -3, -3, -5, -6, -6, -5, -4, -5, -5, -7, -8, -8, -7, -6, -4, -4, -3, -4, -4, -4, -4, -4, -3, -4, -4, -4, -4, -4, -3, -3, -3, -3, -3, -4, -4, -5, -5, -6, -7, -7, -6, -7, -8, -8, -6, -5, -5, -5, -4, -4, -4, -4, -4, -3, -3, -4, -4, -5, -7, -8, -9, -10, -10, -9, -9, -8, -7, -7, -6, -6, -5, -5, -5, -4, -4, -4, -4, -3, -3, -4, -5, -6, -5, -4, -3, -4, -5, -6, -7, -8, -9, -8, -6, -5, -3, -3, -3, -4, -4, -4, -3, -3, -3, -4, -6, -6, -7, -6, -6, -7, -7, -6, -6, -6, -6, -6, -6, -5, -5, -5, -5, -5, -5, -5, -5, -6, -6, -6, -6, -5, -3, -2, -1, -1, -1, -1, -1, 1, 2, 3, 4, 6, 7, 9, 10, 13, 15, 18, 19, 20, 18, 14, 11, 8, 7, 5, 4, 2, 0, -2, -3, -2, -2, -1, 0, 1, 2, 2, 2, 1, 1, 0, 0, 0, 0, 0, -1, -2, -2, -3, -4, -5, -5, -5, -6, -5, -5, -5, -5, -5, -5, -4, -3, -3, -2, -3, -4, -4, -3, -2, -2, -2, -3, -3, -4, -4, -4, -5, -6, -7, -6, -5, -4, -4, -4, -5, -5, -5, -5, -5, -4, -5, -5, -5, -5, -5, -5, -4, -3, -2, -1, -1, -2, -2, -1, -1, -1, -1, -2, -2, -2, -1, 0, -1, -1, -1, -1, -2, -2, -2, -2, -2, -2, -3, -3, -3, -4, -4, -4, -4, -5, -4, -4, -4, -4, -4, -4, -4, -4, -5, -6, -6, -7, -6, -6, -6, -6, -6, -5, -4, -4, -4, -5, -6, -6, -5, -4, -4, -4, -4, -4, -4, -4, -5, -5, -5, -5, -6, -6, -5, -4, -4, -4, -4, -3, -4, -4, -5, -5, -5, -4, -3, -3, -3, -3, -3, -3, -3, -2, -2, -1, -2, -2, -3, -4, -5, -6, -5, -4, -5, -6, -6, -6, -5, -4, -5, -5, -6, -6, -6, -5, -5, -6, -7, -8, -8, -8, -7, -6, -5, -4, -4, -5, -5, -5, -4, -3, -3, -3, -4, -5, -5, -5, -5, -4, -4, -3, -4, -4, -3, -2, -2, -2, -3, -3, -3, -4, -4, -5, -6, -6, -6, -6, -5, -5, -4, -4, -4, -3, -3, -2, -2, -1, -2, -2, -2, -3, -3, -4, -4, -3, -3, -2, -2, -2, -2, -3, -3, -4, -5, -5, -6, -7, -7, -6, -6, -5, -5, -5, -5, -5, -5, -5, -6, -6, -5, -6, -5, -5, -5, -6, -8, -7, -7, -7, -7, -7, -7]
775g%%jj%JJJJJ%%%%%%%%kj%J%%%%%J%J%%%%%%%j%%J%%JJ%JJ%j%%%kkjjJ%J%JJ%J%J%jj%%
755c%j%%j%%%%J%j%%JJJJ%J%jkjj%%J%J%j%%J%jJ%%%j%%J%%%%%%%%%%%j%j%%%j%%%%J%JJ%
735c%j%%JJ%%%%jkjKJ%J%jjj%%%%%%%%%J%%%%JjJ%%%%%jjjjj%j%J%JJKK%%%%j%j%%K%jj%%
716dJ%%j%%%%jJ%JJ%%jj%%%JjjjjJ%%%%JJJ%j%j%%%j%J%%%%%J%%%%%%%J%%%j%j%%%%JJJJj
696bjjj%%Jjjj%JJJ%%%J%Jjjjj%%%J%%JKK%kj%%%%%JjjjjJ%JJJJ%kj%JJJ%jkjJ%J%%%j%j%
677e%%%%%J%j%%%j%%JJJKJjj%jjJJj%j%%%%j%%jJJJ%j%jj%J%%JJkj%%%jj%%JJJ%%%%j%j%j
657h%%%%%J%JJ%%j%%J%JJ%%%%j%%%%j%%%%%%%J%%Jkj%%%%KJ%%%%J%%j%%jj%JJ%%%j%JJ%kj
637ejJJ%%%%JJ%%jj%%%Jj%j%%%j%%%%JJ%KK%kjjjj%jJ%JJ%JJJ%jj%%JJ%jjjj%jJ%%%jjj%J
$$ y = [-7, -7, -7, -8, -9, -9, -8, -7, -6, -5, -4, -4, -4, -4, -4, -4, -4, -4, -4, -6, -7, -7, -6, -6, -6, -6, -6, -6, -5, -5, -4, -4, -4, -4, -4, -4, -4, -4, -5, -5, -5, -4, -4, -4, -3, -2, -2, -1, 0, 0, -1, -1, -1, -1, -3, -5, -6, -7, -6, -6, -5, -5, -4, -3, -3, -2, -2, -1, -1, -2, -3, -3, -3, -3, -4, -4, -4, -5, -5, -5, -5, -5, -4, -4, -5, -5, -5, -4, -3, -2, -1, -1, 0, 0, -1, -3, -4, -5, -5, -5, -4, -4, -3, -3, -4, -4, -4, -3, -3, -4, -3, -3, -3, -3, -4, -4, -4, -3, -3, -3, -3, -3, -3, -3, -3, -3, -3, -3, -3, -4, -4, -5, -5, -5, -5, -6, -6, -6, -6, -6, -5, -5, -4, -3, -3, -3, -4, -4, -4, -3, -2, -2, -2, -2, -2, -3, -5, -6, -4, -3, -3, -2, -2, -3, -4, -5, -5, -5, -5, -5, -5, -5, -5, -5, -5, -4, -4, -4, -4, -4, -3, -4, -3, -3, -3, -3, -3, -3, -4, -5, -6, -7, -8, -8, -9, -9, -8, -8, -7, -6, -4, -2, -2, -2, -2, -2, -3, -3, -4, -4, -4, -2, -2, -3, -4, -4, -4, -3, -3, -3, -4, -4, -4, -4, -4, -5, -4, -4, -3, -2, -2, -2, -3, -4, -4, -4, -4, -3, -4, -5, -6, -7, -6, -6, -6, -6, -6, -5, -4, -3, -3, -4, -4, -5, -5, -5, -5, -6, -6, -5, -5, -5, -5, -5, -5, -4, -4, -4, -4, -4, -4, -4, -4, -3, -3, -3, -3, -4, -4, -5, -5, -5, -5, -5, -4, -3, -2, -1, -2, -3, -4, -5, -5, -5, -4, -5, -6, -7, -7, -6, -5, -4, -4, -4, -4, -3, -3, -2, -3, -4, -5, -6, -6, -6, -6, -5, -5, -5, -4, -2, 0, 0, -2, -3, -3, -3, -3, -3, -3, -2, -3, -4, -5, -6, -5, -5, -4, -3, -2, -1, -1, -3, -4, -4, -3, -2, -1, -1, -2, -4, -5, -4, -4, -3, -3, -3, -3, -4, -4, -5, -5, -5, -5, -5, -5, -5, -4, -4, -5, -5, -5, -5, -6, -6, -6, -5, -4, -3, -1, 0, -1, -2, -2, -3, -4, -3, -2, -3, -3, -4, -4, -4, -4, -4, -5, -5, -5, -6, -5, -4, -3, -3, -4, -4, -5, -6, -6, -5, -5, -5, -4, -3, -5, -6, -6, -6, -6, -7, -8, -8, -8, -7, -6, -5, -5, -5, -5, -5, -6, -6, -7, -7, -8, -8, -8, -8, -8, -8, -7, -7, -6, -5, -5, -5, -6, -6, -6, -5, -5, -4, -3, -3, -3, -3, -3, -4, -4, -4, -4, -4, -5, -5, -5, -5, -5, -5, -5, -5, -4, -4, -4, -3, -5, -6, -6, -6, -6, -6, -4, -3, -3, -3, -3, -3, -2, -2, -2, -3, -3, -3, -4, -5, -5, -4, -3, -3, -3, -3, -4, -4, -3, -2, -2, -4, -5, -6, -5, -4, -4, -4, -4, -4, -3, -2, -2, -2, -3, -4, -4, -4, -4, -3, -4, -4, -5, -5, -5, -5, -6, -6, -6, -6, -6, -5, -4, -4, -2, 0, 0, -2, -3, -4, -5, -6, -6, -7, -6, -6, -5, -4, -4, -3, -2, -1, -1, -2, -3, -3, -3, -2, -1, -1, -2, -3, -4, -5, -5, -6, -5, -5, -5, -5, -6, -7, -8, -8, -7]
618gK%%%jJ%%Jj%J%%jjjJK%jjjJ%J%J%jk%jJ%%%%%j%%jJ%%Jkj%j%JKKKKJjj%%J%kj%JJ%%j
598dj%j%JJK%JkjkkJJ%J%JJJJJ%J%%jjjjjj%jJJj%%%J%%%JJJKJJjj%%JJ%%kjjjj%%j%%Jj%
578dJ%%%%j%J%%J%%%%%j%j%%J%%KJJ%%%%%j%j%%%j%%%j%J%%%%%%%%j%J%%J%%JJJjjj%j%j%
559c%%j%%%%%%%%JJJJ%j%J%%%jjj%%%%%JjjkjJ%JJ%%%%%J%%JJ%jj%%%%%%jJ%%jJ%J%%jj%%
539d%%%%%%%%%j%%%%jJJj%%J%J%%JK%Jjj%%%j%%%%j%jjJJK%jkjJJ%%%%%%%J%%%J%%%%%kkj
520f%JJJ%%%%%%%%%%Jjj%J%jjJJjj%JjjJ%Jjj%JKJjj%%%%%%JJ%J%%%%%J%Jjjjj%%%%%j%j%
500e%j%%J%J%%JJJjj%%%%j%%%J%JJJ%J%%jkjjj%%%%%%%%%%j%%%%J%%%J%%Jj%%j%%JjJJJ%%
480b%%%%j%%%j%%j%j%JJJJ%%jJ%%%%%JJ%jj%J%%%%%%%%jj%jj%JJ%%%Jj%j%j%%%%J%J%J%jj
$$ y = [-7, -5, -5, -5, -5, -6, -5, -5, -5, -4, -5, -5, -4, -4, -4, -5, -6, -7, -6, -4, -4, -5, -6, -7, -6, -6, -5, -5, -4, -4, -5, -7, -7, -8, -7, -7, -7, -7, -7, -7, -8, -8, -8, -9, -8, -8, -8, -7, -9, -10, -10, -11, -11, -10, -8, -6, -4, -2, -1, -2, -3, -3, -3, -2, -2, -4, -5, -5, -4, -3, -3, -3, -4, -5, -5, -6, -6, -5, -4, -2, -2, -1, -3, -4, -6, -8, -7, -6, -6, -5, -5, -4, -3, -2, -1, 0, 0, 1, 1, 1, 0, -1, -2, -3, -4, -5, -5, -6, -5, -4, -5, -5, -5, -5, -4, -4, -4, -4, -3, -2, -1, 1, 2, 3, 2, 1, 1, 1, 2, 3, 3, 3, 1, 0, -1, -2, -3, -3, -3, -4, -4, -4, -3, -4, -4, -3, -3, -3, -3, -3, -4, -4, -3, -3, -3, -2, -2, -2, -2, -2, -2, -3, -3, -4, -4, -4, -3, -3, -3, -1, 0, 1, 1, 1, 1, 1, 1, 0, 0, -1, -1, -1, -1, -2, -2, -2, -2, -3, -3, -2, -2, -2, -2, -2, -2, -2, -2, -2, -3, -3, -2, -2, -2, -1, -1, -1, 0, 1, 2, 1, 0, -1, -1, -2, -2, -3, -3, -3, -3, -4, -4, -4, -4, -4, -4, -4, -4, -4, -3, -2, -1, 0, 0, -1, -1, 0, 0, 0, 0, -1, -2, -3, -3, -3, -3, -3, -3, -2, -3, -4, -6, -7, -6, -6, -5, -4, -4, -4, -4, -4, -4, -3, -3, -3, -2, -1, -1, -2, -3, -3, -3, -3, -3, -3, -3, -4, -3, -3, -3, -4, -3, -3, -2, -2, -2, -3, -4, -4, -4, -4, -4, -4, -4, -4, -4, -4, -4, -4, -5, -5, -5, -5, -5, -6, -5, -4, -5, -5, -5, -4, -4, -3, -3, -3, -2, 0, 0, 1, 0, -1, -1, -1, -1, -2, -2, -2, -2, -2, -3, -3, -4, -5, -4, -3, -1, -1, -2, -4, -5, -4, -3, -3, -3, -3, -3, -3, -3, -3, -2, -2, -2, -2, -1, -1, -1, -1, -1, -1, -3, -5, -6, -6, -5, -4, -3, -3, -3, -3, -3, -3, -3, -3, -3, -3, -3, -2, -3, -4, -4, -3, -3, -4, -5, -4, -3, -4, -5, -5, -4, -5, -6, -5, -5, -4, -5, -6, -6, -5, -3, -2, -3, -4, -4, -4, -4, -4, -4, -4, -3, -2, -2, -1, -1, -1, -1, -1, -1, 0, 0, 1, 0, -1, -2, -3, -3, -3, -3, -3, -3, -4, -4, -5, -5, -5, -6, -6, -6, -5, -5, -4, -4, -4, -3, -2, -1, -2, -3, -3, -3, -3, -3, -4, -4, -4, -4, -3, -3, -2, -1, 0, 0, 1, 1, 1, 0, -2, -3, -4, -5, -5, -5, -5, -5, -5, -5, -5, -5, -5, -5, -6, -6, -6, -6, -6, -5, -5, -5, -5, -4, -4, -4, -3, -4, -4, -4, -5, -5, -5, -4, -5, -4, -3, -2, -2, -2, -2, -2, -2, -2, -3, -3, -3, -3, -4, -4, -4, -5, -5, -6, -6, -5, -4, -3, -2, -2, -2, -3, -2, -2, -2, -2, -2, -2, -1, 0, 0, -1, -2, -2, -1, -1, -1, -1, -1, -1, -1, -1, -1, -2, -3, -3, -4, -5, -5, -4, -3, -3, -3, -3, -2, -3, -3, -4, -4, -5, -5, -5, -5, -5, -4, -4, -3, -3, -2, -2, -3, -4]
461dJ%J%J%j%j%J%J%J%Jjj%%%j%J%%j%jjJ%Jj%jJ%J%%J%jjkjjjj%JJ%JKJJ%j%j%%j%%J%JJ
441b%j%%Jj%%j%%J%%jk%%%%%%JJJ%%%%%jJJ%jJ%%%J%%jj%%%j%%j%j%%j%JJJJJ%%j%%%JJ%%
422ajjj%%j%J%JJ%j%%%%%Jj%%%%J%%%jjj%%%%JJJJj%%jkjjj%jjJJ%KKJJ%Jjj%j%jJJjj%J%
402dJ%J%jj%JJ%%j%j%%%JJ%%jj%JJj%jjjj%JJ%%%%%%%jj%%JJKJ%k%j%jjJJj%J%JJ%%j%JJJ
382a%k%%J%%j%jj%j%jJJJJ%%%%jjJ%J%%%%%%%%jJ%%j%jJ%%%j%%%JK%jj%%%%%jj%jJ%JJj%j
363fj%JJJjjjjJJ%J%J%%%j%%j%jjJJJJ%%%J%%JJj%%%%%j%jj%%%%%%JJJjj%%%%%JJJJ%jJ%J
343AJjjkk%%JJKKj%kkkj%K%%%Jj%j%%%J%jj%JKJ%jj%j%%JJK%%j%%kjJ%%JJ%%%%%jJJJ%jjl
323ejJKK%%%kj%J%jj%%%%%%%%KJ%%jjjjjJJKJj%jj%jJ%J%%%%%J%%%%%JJJjjjJ%%%%%j%%%%
$$ y = [-4, -3, -3, -2, -2, -1, -1, -2, -2, -3, -3, -2, -2, -1, -1, 0, 0, 1, 0, -1, -1, -1, -1, -2, -2, -1, -1, -1, -2, -2, -3, -4, -3, -3, -2, -3, -3, -4, -3, -3, -2, -2, -2, -1, -1, -2, -3, -5, -6, -7, -8, -9, -9, -8, -7, -7, -6, -4, -3, -2, -2, -3, -3, -4, -4, -4, -5, -5, -5, -4, -4, -3, -2, -2, -3, -3, -3, -2, -3, -3, -3, -4, -4, -4, -3, -3, -3, -4, -6, -6, -6, -6, -6, -6, -6, -5, -4, -3, -3, -3, -3, -3, -3, -4, -3, -2, -2, -3, -2, -2, -2, -2, -1, -1, -1, -2, -3, -3, -3, -3, -4, -4, -4, -5, -5, -6, -6, -6, -7, -7, -6, -5, -4, -3, -2, -2, -2, -3, -3, -3, -3, -2, -1, -1, -1, -2, -3, -4, -4, -4, -5, -5, -4, -4, -3, -2, -2, -3, -3, -3, -3, -3, -3, -2, -3, -3, -3, -3, -3, -2, -2, -2, -2, -3, -4, -5, -5, -5, -5, -5, -4, -3, -2, -1, -2, -2, -2, -3, -5, -6, -7, -8, -8, -9, -10, -9, -8, -8, -6, -4, -3, -2, -2, -1, -2, -3, -3, -4, -4, -5, -4, -3, -4, -5, -5, -4, -4, -3, -3, -2, -2, -3, -4, -4, -3, -2, -2, -2, -3, -3, -4, -4, -4, -4, -3, -2, -2, -2, -3, -4, -4, -3, -2, -3, -3, -4, -5, -6, -7, -7, -6, -5, -5, -5, -5, -5, -5, -5, -5, -6, -7, -7, -7, -6, -5, -3, -2, -2, -4, -4, -5, -5, -6, -7, -6, -5, -6, -6, -5, -5, -4, -3, -3, -3, -4, -4, -3, -2, -1, -1, -3, -3, -3, -2, -2, -2, -3, -3, -4, -5, -5, -6, -6, -7, -6, -5, -4, -3, -3, -3, -3, -3, -4, -5, -4, -4, -3, -3, -3, -3, -3, -3, -3, -3, -3, -4, -3, -3, -3, -4, -4, -5, -4, -4, -4, -4, -5, -5, -5, -5, -4, -2, -2, -3, -4, -4, -4, -4, -4, -4, -5, -6, -6, -7, -6, -6, -5, -4, -5, -5, -6, -7, -7, -6, -5, -4, -5, -6, -7, -8, -7, -6, -6, -5, -5, -4, -4, -4, -4, -5, -5, -5, -6, -6, -7, -8, -7, -6, -5, -4, -4, -4, -4, -3, -3, -3, -2, -1, -2, -2, -2, -2, -2, -2, -3, -3, -4, -5, -5, -5, -5, -5, -5, -5, -4, -3, -2, -3, -4, -4, -4, -4, -4, -4, -3, -2, -1, 0, 0, -1, 0, 0, 1, 2, 1, 0, -2, -4, -4, -4, -3, -2, 0, 2, 1, 1, -1, -3, -5, -6, -6, -4, -4, -4, -4, -3, -4, -4, -5, -5, -5, -5, -4, -4, -5, -6, -6, -5, -3, -2, -2, -3, -4, -4, -5, -5, -5, -4, -3, -1, -1, -1, -2, -2, -2, -4, -5, -4, -4, -4, -3, -2, -2, -2, -2, -2, -2, -3, -2, -1, 0, 0, -1, -2, -5, -6, -5, -3, -1, -1, -1, -1, -3, -4, -4, -3, -3, -4, -5, -5, -5, -5, -5, -5, -5, -5, -5, -3, -2, -2, -2, -3, -4, -5, -6, -7, -6, -5, -3, -2, -3, -3, -4, -5, -5, -6, -5, -5, -4, -4, -4, -4, -4, -4, -3, -3, -3, -3, -3, -3, -2, -1, 0, -1, -2, -3, -2, -2, -2, -2, -2, -2, -3, -3, -3, -3, -3]
304cJjj%KJ%%%%%jjjJJJj%j%jj%%J%j%%j%KJ%%j%%j%jjJ%%JJ%JJJ%%Jkjkj%%KJJJJJkj%%%
284bjjJ%Jj%jjjj%JJ%%%%%%%%%%%%%%JJJJJJjk%jjjjJJ%%%%%JK%jkkj%%%%j%%jJ%JK%%j%%
265f%J%JKJKj%jjJJj%%%%Jj%%KJ%kk%%%jJ%%%j%%Jj%%jjkJK%J%J%kj%jjj%%%J%%J%Jj%j%%
245gKJJ%%j%j%jjJ%J%%%%jJ%kjJ%JJ%j%%J%%Jj%JJ%%%%Jjkj%JJ%%%j%jJ%JkjJJJ%%%%j%%%
225e%J%%%j%%%%%J%J%J%jj%%%%%%%%%%j%%j%jJKJJ%jJJ%%jj%jJJ%jjJ%JK%jjkjj%J%%%%jj
206gJJJ%%k%JJ%j%J%%%%j%%%%%JJJjjjJ%J%J%%j%j%%j%%J%Jj%JJ%%j%JJ%j%j%%j%%j%Jj%j
186fjJJ%jJJ%%%%%Jjjjjj%JJJJ%J%%K%j%%%%%%%%j%%%j%%kjjjJJ%J%J%JJ%%J%%%%%jjjJ%%
166d%%JJ%%j%J%j%j%J%%%%JJJJ%jj%J%Jjjk%K%%j%j%j%%jj%JJJJj%jj%jjjJ%JJ%%j%JJ%j%
$$ y = [-3, -2, -3, -4, -4, -2, -1, -1, -1, -1, -1, -1, -2, -3, -4, -3, -2, -1, -2, -2, -3, -3, -4, -5, -5, -5, -4, -4, -5, -5, -5, -6, -6, -4, -3, -3, -3, -4, -4, -4, -5, -5, -6, -7, -6, -6, -6, -5, -4, -4, -3, -2, -1, -1, -1, 0, -2, -3, -5, -6, -6, -6, -4, -3, -2, -1, 0, 1, -1, -2, -2, -2, -2, -3, -4, -3, -3, -2, -3, -3, -4, -5, -6, -7, -7, -6, -5, -5, -5, -5, -5, -5, -5, -5, -5, -5, -5, -5, -5, -5, -5, -4, -3, -2, -1, 0, 1, 0, -2, -2, -3, -4, -5, -6, -5, -4, -4, -4, -4, -4, -4, -3, -1, -1, -2, -4, -6, -7, -7, -7, -7, -7, -8, -8, -8, -9, -8, -8, -7, -5, -5, -5, -6, -6, -6, -6, -5, -5, -4, -2, -1, 1, 0, 0, -1, -2, -1, 0, -1, -1, -1, -1, -1, 0, -1, -1, -1, 1, 2, 2, 0, -2, -2, -2, -2, -3, -2, -2, -2, -2, -3, -3, -3, -2, -3, -3, -3, -4, -5, -7, -6, -4, -4, -3, -3, -2, -2, -4, -5, -5, -6, -7, -8, -8, -8, -8, -7, -7, -7, -6, -6, -5, -6, -6, -7, -7, -7, -5, -4, -3, -3, -3, -4, -4, -5, -5, -6, -7, -6, -6, -5, -5, -5, -5, -5, -6, -5, -5, -7, -8, -7, -7, -6, -5, -5, -6, -6, -6, -5, -5, -5, -4, -5, -5, -4, -3, -3, -3, -3, -3, -2, -3, -5, -6, -6, -5, -4, -4, -4, -4, -5, -5, -6, -5, -5, -4, -6, -7, -6, -5, -4, -4, -4, -4, -4, -5, -5, -5, -5, -5, -4, -4, -4, -4, -5, -5, -5, -5, -5, -5, -4, -4, -3, -3, -2, -2, -3, -4, -4, -4, -4, -4, -4, -4, -4, -4, -4, -4, -5, -5, -5, -6, -6, -7, -6, -4, -3, -2, -2, -3, -2, -1, -1, -1, -2, -3, -3, -4, -3, -2, -2, -3, -4, -3, -3, -2, 0, 0, -1, -2, -4, -5, -6, -6, -5, -5, -5, -5, -5, -6, -7, -6, -5, -4, -4, -4, -6, -6, -5, -4, -4, -5, -5, -4, -4, -4, -4, -4, -5, -5, -5, -5, -5, -5, -4, -3, -2, -3, -4, -5, -4, -4, -3, -3, -2, -2, -2, -3, -3, -4, -4, -4, -5, -5, -5, -4, -4, -3, -4, -4, -3, -2, -2, -2, -3, -3, -2, -1, -1, -2, -2, -3, -3, -3, -4, -4, -4, -5, -5, -4, -5, -5, -6, -7, -6, -5, -5, -6, -5, -4, -4, -4, -4, -4, -4, -3, -4, -5, -6, -7, -8, -8, -7, -6, -5, -4, -4, -3, -3, -3, -1, -1, -2, -2, -2, -2, -2, -2, -2, -2, -2, -3, -3, -3, -3, -4, -4, -4, -6, -7, -8, -9, -8, -7, -7, -6, -6, -5, -5, -4, -3, -3, -3, -2, -2, -2, -2, -2, -2, -3, -4, -5, -4, -4, -4, -4, -4, -3, -2, -2, -2, -3, -3, -2, -2, -3, -3, -4, -4, -3, -3, -3, -3, -3, -2, -1, 0, 1, 1, 0, -1, -1, 0, 0, 1, 0, -1, -3, -3, -1, -1, -1, -2, -2, -3, -3, -4, -4, -4, -5, -6, -6, -5, -4, -3, -2, -3, -3, -4, -5, -5, -6, -7, -8, -7, -7, -6, -5, -5, -5, -6, -6, -5, -4, -4, -5, -5]
147e%%%J%%%j%jj%%%%%%%%%%%%%%J%%J%J%j%%%j%j%%%%%%J%%%J%%J%%%%j%J%J%%jj%JJj%j
127e%%%KKj%%%j%%jJJJJJ%j%j%%%%Jj%%j%jjj%%JJJJ%Jj%j%jjjj%%j%%jj%KJKJ%jjJ%%JJ%
108b%jjjj%j%j%jKJJ%jjJ%%Jkj%JJ%J%J%%jj%%j%%%J%%KJ%%kj%jJJJJJJj%%J%j%J%%j%j%k
88ej%JJK%J%%%%j%jjJ%J%%j%%%%%%J%%Jjjjjj%%%KJJj%jJJJj%jj%j%jj%j%%JK%%%%%%%%JJ
68c%J%%%J%%%%J%%jjj%kj%J%%%JJ%J%j%jjjJJJ%J%%%%%jk%JJ%%j%j%%JJ%%jkj%%%J%jj%%J
48gJJK%jjj%J%J%Jj%%%%%j%%J%%J%%J%J%jjk%%%%%jJ%J%JJ%Jjk%%J%%kj%%JJ%JJ%%%J%%%%
28ajjjkJ%%%%%J%%j%jJJK%j%jjJ%%%JJ%jj%JJ%%J%%%j%%j%j%%%%%%jj%jJ%%%jJKJJ%j%jk%
8fJJK%Jj%%J%%%%%%J%%j%%%j%%%%%%%%%J%%%j%jJ%%J%Jkjj%%%Jj%j%Jj%j%%%%J%J%%%%%%j
$$ y = [-5, -5, -5, -5, -4, -4, -4, -4, -5, -5, -6, -7, -7, -7, -7, -7, -7, -7, -7, -7, -7, -7, -7, -7, -7, -7, -6, -6, -6, -5, -5, -4, -4, -5, -5, -5, -5, -6, -6, -7, -7, -7, -7, -7, -7, -7, -6, -6, -6, -6, -5, -5, -5, -4, -4, -4, -4, -4, -5, -5, -4, -4, -3, -3, -3, -4, -5, -5, -4, -3, -4, -4, -5, -5, -5, -5, -3, -1, -2, -2, -2, -2, -3, -3, -3, -4, -3, -2, -1, 0, 1, 1, 0, 0, -1, -1, -1, -1, -1, 0, -1, -1, -1, -2, -2, -3, -4, -5, -5, -5, -4, -3, -2, -1, -1, 0, -1, -1, -2, -2, -3, -4, -5, -6, -6, -6, -7, -7, -7, -8, -9, -9, -7, -6, -4, -3, -3, -4, -5, -4, -4, -4, -3, -2, -2, -2, -3, -4, -5, -6, -6, -7, -7, -8, -8, -9, -7, -6, -5, -5, -6, -7, -6, -6, -6, -5, -7, -8, -8, -7, -6, -6, -5, -5, -4, -4, -4, -5, -6, -6, -6, -7, -7, -7, -7, -6, -6, -6, -4, -3, -3, -3, -5, -6, -6, -7, -6, -5, -4, -3, -2, -1, -2, -2, -2, -1, -1, -2, -2, -1, -1, -1, -2, -2, -3, -3, -5, -6, -6, -5, -4, -2, -2, -1, -1, -1, -1, -1, -2, -2, -3, -4, -3, -3, -2, -2, -2, -3, -3, -3, -3, -3, -3, -3, -2, -2, -2, -1, -2, -3, -4, -5, -6, -6, -6, -6, -4, -3, -2, -3, -3, -4, -3, -2, -1, -2, -2, -3, -4, -4, -5, -5, -6, -7, -7, -8, -8, -8, -7, -5, -5, -5, -5, -5, -5, -5, -5, -5, -4, -3, -3, -2, -2, -2, -2, -1, -1, -1, -1, -1, 0, 0, 0, -1, -2, -3, -3, -5, -6, -6, -5, -5, -5, -5, -4, -3, -3, -2, -2, -3, -3, -4, -5, -6, -5, -4, -3, -3, -2, -2, -2, -2, -2, -2, -3, -5, -5, -4, -3, -3, -3, -4, -4, -5, -5, -5, -4, -3, -3, -3, -4, -6, -7, -7, -7, -7, -6, -6, -7, -8, -8, -8, -7, -6, -5, -3, -3, -4, -5, -6, -6, -5, -5, -4, -4, -3, -4, -4, -4, -4, -4, -4, -5, -5, -5, -4, -4, -4, -3, -3, -3, -2, -2, -1, -1, -2, -3, -5, -5, -5, -5, -5, -5, -6, -5, -5, -4, -4, -3, -2, -2, -1, -2, -4, -4, -4, -3, -3, -3, -5, -6, -6, -6, -5, -4, -4, -3, -2, -2, -2, -2, -1, -1, -1, -1, -1, -2, -3, -4, -6, -5, -5, -5, -5, -5, -5, -4, -4, -4, -5, -5, -6, -5, -4, -2, -2, -3, -3, -4, -5, -4, -4, -4, -4, -3, -2, -2, -3, -4, -4, -3, -2, -2, -2, -1, -1, -1, -1, -2, -2, -2, -3, -3, -4, -4, -4, -4, -4, -4, -4, -5, -6, -6, -7, -6, -6, -6, -6, -7, -6, -4, -3, -2, -2, -3, -3, -4, -6, -6, -5, -4, -2, -2, -1, -2, -2, -2, -1, -1, -1, -1, -1, -1, -1, 0, 0, 0, -1, -1, -1, -1, -2, -2, -2, -2, -2, -2, -2, -2, -2, -2, -1, -1, -1, -1, -2, -2, -3, -2, -2, -2, -1, -1, 0, -2, -3, -4, -4, -4, -4, -3, -4, -4, -5, -5, -4, -5, -5, -6, -6, -6, -6, -6, -5, -5, -4, -4, -4, -4, -4, -4, -4, -5]
-12e%%jJJj%J%%%j%%%J%%%%J%J%%%kjj%%%j%%%%%JKK%Jjjj%%%%%%Jj%%Jjjj%%%%%%J%%%%%
-31eJ%%%kjJJ%J%J%jJ%%%%%%%%j%%%%%%J%%j%j%%J%%%%Jj%%%jJ%%%%%%j%j%%%%J%JJJJ%%%
-51a%j%%j%j%%%%%J%JJJjj%j%jJjj%J%%%J%j%%j%jJJJ%jjJ%J%%j%j%%%J%%%%j%%%JJ%%jjJ
-71d%J%j%j%j%JK%j%%%%J%J%%J%%%JjjkkjkJ%J%%%JKJJjj%%j%%j%j%%%%%JJKKJ%%j%jjJ%%
-90bJ%%%J%%jjkj%%J%%j%%%%%j%%%JJ%JJJJ%%%%%jJjjkj%J%JJ%%%%%%%%%%j%j%j%%%%%JJ%
-110cJ%%j%jj%%KJj%jj%JJ%jjk%JJJJJ%%jjjj%jjkjJJJ%JJJ%%%JJ%%j%jj%%JK%JJJJJkjj%
-129bj%%%J%%%j%%J%%%%%%J%%j%jJ%jjj%JJ%%%%jjlj%JJJ%%jJKJ%%%jj%%J%%%j%%%%%%%%%
-149e%JKJj%j%j%J%jjjjjJJJ%j%J%%jJ%jJKJj%%%jj%j%JKJJ%%j%%jjjjJ%JJ%J%%%jk%%J%%
$$ y = [-5, -5, -5, -6, -5, -4, -5, -5, -4, -4, -4, -4, -5, -5, -5, -5, -4, -4, -4, -4, -4, -3, -3, -2, -2, -2, -2, -4, -5, -6, -6, -6, -6, -7, -7, -7, -7, -7, -7, -6, -4, -2, -2, -1, -2, -3, -4, -4, -4, -4, -4, -4, -4, -3, -4, -4, -4, -3, -4, -5, -6, -6, -6, -6, -6, -6, -6, -5, -5, -5, -5, -5, -5, -4, -4, -4, -4, -6, -7, -6, -5, -5, -4, -4, -3, -3, -4, -3, -3, -3, -3, -3, -3, -3, -3, -3, -4, -4, -4, -4, -4, -4, -4, -3, -3, -3, -4, -4, -5, -5, -5, -4, -4, -4, -4, -4, -3, -4, -4, -4, -4, -5, -4, -4, -4, -4, -4, -4, -4, -5, -5, -6, -6, -6, -6, -6, -5, -5, -4, -3, -2, -1, -1, -1, -1, -1, -2, -2, -2, -3, -3, -4, -4, -4, -4, -4, -4, -3, -3, -2, -1, 0, -1, -2, -2, -3, -3, -4, -3, -4, -5, -5, -4, -4, -4, -4, -3, -3, -4, -4, -4, -5, -5, -6, -5, -4, -3, -3, -4, -5, -4, -4, -3, -3, -3, -4, -4, -5, -5, -5, -5, -4, -4, -4, -4, -4, -5, -5, -5, -5, -4, -3, -3, -3, -4, -5, -4, -4, -3, -3, -4, -4, -5, -5, -6, -6, -5, -3, -3, -4, -4, -4, -4, -4, -3, -3, -2, -2, -2, -1, -1, -1, -1, 0, -1, -2, -4, -6, -7, -9, -8, -8, -7, -7, -7, -7, -6, -4, -3, -2, -3, -4, -4, -4, -5, -5, -5, -6, -6, -7, -7, -7, -7, -7, -7, -6, -5, -3, -1, 0, 0, 0, -1, -1, -2, -3, -2, -2, -2, -1, -1, -1, -1, 0, 0, 0, -1, -2, -4, -5, -5, -5, -4, -4, -4, -5, -5, -5, -5, -5, -5, -6, -6, -6, -6, -5, -4, -4, -3, -2, -1, 0, 0, 0, 0, 0, 0, -1, 0, -1, -2, -4, -5, -5, -4, -4, -3, -2, -2, -2, -2, -2, -2, -2, -2, -2, -2, -2, -3, -3, -4, -4, -5, -5, -5, -5, -5, -5, -4, -3, -3, -2, -2, -2, -3, -3, -4, -5, -5, -5, -3, -2, -3, -3, -4, -5, -5, -4, -3, -3, -4, -5, -7, -7, -6, -5, -4, -3, -2, -2, -2, -3, -4, -5, -6, -6, -7, -8, -10, -11, -10, -9, -8, -8, -7, -6, -5, -5, -5, -5, -4, -3, -3, -3, -4, -4, -5, -6, -6, -6, -5, -3, -3, -2, -1, 0, 1, 2, 0, -1, -2, -2, -3, -3, -3, -3, -2, -2, -2, -2, -3, -3, -3, -2, -2, -2, -2, -2, -2, -2, -1, -1, -1, -2, -2, -3, -2, -2, -3, -4, -5, -5, -4, -3, -3, -3, -3, -3, -4, -5, -8, -9, -9, -8, -7, -6, -6, -6, -7, -6, -4, -3, -3, -3, -3, -4, -5, -5, -5, -4, -4, -4, -4, -5, -5, -5, -5, -5, -5, -5, -5, -5, -5, -5, -4, -2, -1, -2, -2, -3, -3, -4, -4, -3, -3, -4, -5, -6, -7, -8, -7, -6, -5, -5, -6, -6, -5, -5, -5, -6, -5, -5, -6, -5, -3, -2, -3, -3, -3, -3, -4, -5, -5, -6, -6, -5, -3, -2, -1, -1, -1, -2, -2, -2, -3, -4, -5, -6, -5, -5, -4, -3, -3, -2, -2, -2, -2, -3, -5, -5, -5, -4, -4, -4]
-168d%j%%%JJ%k%%%%%%jJ%J%JJJJj%j%j%J%%jk%J%J%%%%%JJJJjj%%J%j%jj%%%lnonk%KJKJ
-187a8KKJKK%j%JKJJ%%%%j%jJ%J%jjJ%%%%%KJjjkjJJ%J%%%J%jj%%j%%J%JJJJ%j%j%jj%jjJ
-206g%JJ%J%J%%%%%J%J%j%j%%jjjJJJ%%%%j%JJJJJjkjJ%%%%%%Jj%J%jjj%%%%jJ%%%JJJJj%
-226a%j%jjj%%%%kj%KJ%JJJjkj%%J%J%%%jj%Jjj%%JK%Jj%%%JJ%%%j%JJ%kjjJJ%jj%Jj%jjJ
-245fKJj%%K%%j%jj%j%JKjkj%%%J%J%%%kj%J%%J%%jJJJ%JJ%%kk%JjJ%j%%%J%%%%%%%j%%J%
-264e%JJJJJ%J%%jkkjj%JJ%jJKj%%%Jj%%%%j%%%%%jjj%%%KK%%j%%Jj%%%%%kjJK%%%%J%j%%
-284dJ%jj%%%%j%J%j%%Jj%%J%jj%%JJJJ%%%j%jj%j%%%%%%%J%%%%%jjj%JKj%JJKJJjjjj%%%
-303eJ%%J%JJ%%%Jj%%j%j%jj%J%J%%J%%%j%j%JJj%jjJJJJ%j%%j%%j%j%jJJJJ%J%%%%j%jjj
$$ y = [-4, -4, -5, -5, -5, -5, -4, -3, -3, -5, -5, -5, -5, -5, -5, -5, -6, -5, -5, -4, -4, -3, -2, -1, 0, -1, -1, -2, -2, -3, -3, -2, -2, -2, -3, -5, -5, -4, -4, -3, -3, -3, -3, -3, -3, -2, -1, 0, 1, 0, -1, -1, -1, 0, 0, -1, -1, -2, -3, -3, -3, -3, -6, -11, -17, -22, -24, -24, -22, -21, -19, -18, -16, -14, -13, -11, -9, -9, -10, -10, -9, -7, -6, -5, -5, -5, -5, -5, -6, -6, -7, -6, -6, -5, -5, -6, -7, -6, -6, -6, -6, -6, -6, -4, -3, -4, -5, -7, -8, -7, -6, -6, -5, -5, -5, -5, -4, -4, -5, -6, -6, -6, -7, -7, -7, -6, -6, -5, -4, -3, -2, -2, -3, -3, -4, -4, -5, -6, -6, -7, -8, -7, -7, -6, -5, -5, -4, -4, -3, -3, -3, -3, -3, -3, -2, -2, -1, -1, -2, -2, -3, -3, -3, -4, -5, -6, -5, -4, -3, -3, -3, -3, -3, -4, -4, -3, -2, -1, 0, 1, 0, -2, -3, -2, -2, -2, -2, -2, -2, -2, -1, -2, -2, -1, -1, -2, -3, -4, -4, -4, -4, -4, -5, -4, -4, -4, -4, -3, -2, -1, 0, -1, -1, -1, -2, -2, -3, -4, -5, -5, -5, -5, -5, -7, -8, -8, -6, -5, -5, -4, -3, -2, -3, -5, -6, -6, -6, -5, -5, -4, -4, -4, -4, -5, -6, -6, -5, -6, -7, -7, -7, -6, -4, -4, -3, -4, -4, -4, -4, -3, -2, -2, -2, -2, -3, -3, -2, -1, -1, -3, -4, -5, -4, -3, -3, -4, -5, -5, -4, -5, -5, -6, -7, -6, -4, -3, -4, -4, -4, -2, -2, -2, -3, -3, -4, -5, -5, -6, -6, -5, -3, -4, -6, -7, -7, -7, -7, -6, -6, -5, -5, -5, -5, -7, -8, -8, -7, -7, -7, -6, -6, -6, -7, -6, -5, -4, -4, -3, -2, -2, -2, -4, -6, -6, -5, -6, -5, -5, -6, -6, -6, -6, -5, -5, -5, -5, -5, -5, -5, -5, -6, -6, -6, -5, -5, -5, -4, -3, -2, -1, 0, 0, 1, 1, 1, 0, -2, -4, -5, -6, -6, -5, -4, -4, -5, -4, -2, -3, -3, -3, -3, -2, -3, -3, -3, -3, -3, -4, -4, -4, -4, -4, -4, -5, -6, -7, -7, -7, -7, -5, -3, -3, -3, -4, -4, -4, -3, -4, -4, -4, -4, -4, -4, -6, -7, -6, -4, -4, -4, -4, -4, -3, -3, -4, -4, -4, -3, -3, -4, -5, -5, -5, -5, -5, -6, -6, -5, -5, -6, -6, -6, -5, -6, -6, -6, -5, -5, -6, -7, -7, -7, -6, -5, -4, -3, -3, -3, -3, -4, -4, -5, -6, -6, -7, -7, -7, -7, -7, -7, -7, -7, -6, -6, -6, -6, -6, -6, -7, -8, -9, -9, -8, -6, -7, -7, -6, -5, -3, -2, -1, -2, -3, -4, -5, -5, -5, -5, -4, -4, -4, -3, -3, -2, -1, -1, -1, -1, 0, -1, -1, -1, -2, -2, -3, -3, -4, -5, -5, -4, -4, -3, -3, -3, -2, -2, -2, -2, -3, -3, -4, -4, -3, -2, -3, -3, -4, -5, -4, -3, -2, -1, -1, -2, -2, -2, -3, -3, -3, -4, -4, -5, -5, -6, -5, -4, -3, -2, -2, -1, -1, -1, -1, -1, -2, -2, -3, -4, -5]
-322ej%J%Jj%j%%J%JjjJ%%Jjj%%j%%%%JJKKJj%jj%j%%%%%%%%%%%J%J%Jjjjj%%%%J%jj%J%j
-342fJJJ%jjjkJ%j%%JKJ%%jjjjJJJKjj%jJJ%J%j%j%%%%jj%J%J%Jj%%%%%%j%jJJJJ%%%%%Jj
-361c%%j%JJjJ%%%j%j%jJKJjjj%%j%j%%JJJJ%%%%%%%%J%%%%%%%%%jjjj%%%%%%%%%J%%%jj%
-380f%JJ%J%%Jj%%j%%Jjj%%J%J%%jjk%%J%%jj%JKJKJ%%%%%%%%j%%%jjjjJ%JJ%%%%%JJJj%%
-400a%jjj%j%%j%J%%%j%jJJ%J%J%J%%%%jj%JJ%jjjkJJJJ%J%%%j%%%j%%j%J%J%%%%k%JJ%j%
-419dj%j%%jJJJJjjjjj%JJJJ%j%%KJJjjJ%kj%J%j%jjjjJKJJJjjJJ%%j%%j%JJ%j%jj%JJJJ%
-438bj%%%%j%%JJ%%j%j%jj%K%JJjj%jjjJ%jjK%%J%%%%j%JK%j%jj%JJJJ%j%%%J%%Jjjjj%%%
-458e%J%J%%J%%%Jj%%%%j%%%%j%jj%JJJJJ%j%%JJJ%%k%%J%jkj%%J%%%JJjjj%%%j%%%jJJj%
$$ y = [-5, -6, -6, -5, -5, -4, -5, -5, -6, -6, -6, -5, -5, -4, -5, -6, -5, -5, -5, -4, -5, -6, -6, -6, -7, -7, -7, -7, -7, -6, -5, -3, -1, 0, -1, -1, -2, -3, -3, -4, -4, -4, -4, -4, -4, -4, -4, -4, -4, -4, -4, -3, -3, -2, -2, -1, -2, -3, -4, -5, -5, -5, -5, -5, -4, -4, -5, -6, -6, -5, -5, -6, -5, -4, -3, -3, -4, -5, -6, -8, -7, -7, -8, -8, -8, -7, -5, -4, -4, -4, -5, -6, -7, -8, -7, -6, -5, -3, -4, -5, -5, -6, -5, -4, -4, -3, -3, -4, -4, -5, -5, -5, -5, -5, -6, -7, -7, -6, -6, -5, -5, -4, -5, -5, -5, -5, -5, -5, -5, -6, -6, -7, -6, -5, -4, -3, -3, -3, -3, -3, -3, -2, -3, -3, -3, -4, -4, -3, -2, -3, -2, -2, -2, -2, -3, -3, -4, -4, -5, -4, -2, -1, -2, -3, -4, -4, -4, -5, -5, -6, -6, -6, -5, -4, -3, -2, -2, -2, -2, -2, -2, -2, -2, -2, -1, -1, -1, -1, -1, -1, -1, -1, -1, -1, -2, -3, -4, -5, -5, -5, -5, -5, -5, -5, -5, -5, -5, -4, -4, -4, -4, -5, -6, -6, -6, -5, -4, -4, -3, -3, -3, -2, -3, -3, -3, -4, -4, -4, -3, -4, -5, -5, -5, -4, -4, -3, -3, -3, -4, -5, -7, -7, -7, -6, -6, -6, -7, -8, -8, -7, -5, -4, -2, -1, -1, -1, -1, -1, -1, -1, -1, -1, -2, -2, -2, -2, -3, -4, -5, -6, -5, -5, -4, -3, -3, -3, -3, -3, -3, -2, -1, 0, -1, -1, -1, -1, -2, -3, -4, -4, -5, -5, -5, -6, -6, -5, -5, -5, -5, -6, -6, -7, -6, -5, -5, -4, -4, -3, -3, -2, -2, -2, -2, -2, -3, -4, -4, -3, -2, -2, -3, -4, -5, -7, -6, -5, -4, -3, -3, -2, -2, -2, -2, -3, -3, -3, -3, -4, -4, -4, -5, -5, -4, -4, -3, -3, -3, -3, -3, -5, -5, -4, -3, -3, -4, -4, -5, -5, -6, -6, -6, -7, -6, -5, -4, -3, -4, -5, -6, -7, -8, -8, -7, -6, -5, -4, -4, -5, -5, -5, -3, -2, -1, -2, -3, -2, -2, -4, -5, -5, -4, -4, -5, -5, -6, -7, -8, -9, -8, -6, -5, -4, -3, -4, -5, -4, -3, -3, -3, -4, -4, -4, -5, -5, -4, -3, -3, -4, -4, -5, -6, -6, -5, -4, -3, -2, -2, -3, -3, -3, -3, -3, -4, -4, -4, -3, -2, -2, -2, -3, -3, -4, -4, -5, -6, -6, -4, -4, -3, -2, -3, -4, -4, -5, -6, -7, -6, -6, -7, -8, -6, -6, -6, -5, -5, -5, -5, -5, -6, -6, -5, -3, -3, -4, -4, -5, -6, -6, -5, -4, -3, -2, -2, -3, -3, -3, -3, -2, -2, -2, -1, -2, -3, -4, -5, -5, -5, -5, -5, -4, -4, -3, -3, -3, -2, -2, -2, -2, -1, -2, -2, -2, -2, -2, -3, -3, -3, -3, -3, -4, -4, -5, -6, -6, -5, -4, -3, -2, -1, -1, -2, -2, -2, -1, 0, 1, 1, 1, -1, -1, -1, 0, 0, -1, -3, -4, -4, -4, -3, -3, -3, -3, -2, -1, -2, -3, -4, -4, -4, -4, -5, -5, -5, -5, -6, -5, -4, -5, -5]
-477ejjj%%%J%%%%J%%JJ%JJJJ%%%jJ%jj%%%jjj%J%JJJ%J%%%%%j%j%jJJ%%jjjj%JJj%%%JJ%
-496bJJjjj%%%%%%%%%%jJ%jjk%J%%J%%j%%J%%%%%%%j%jJ%%%J%%jk%JJKJ%kj%%JJ%j%JJJjj
-516d%%%%J%jjjJJJ%%%%%%%jjjJKJJ%%%%%kj%%%%jj%KKK%%%j%%JJ%%j%kj%%J%%%%%J%kjjJ
-535dJJ%jjjJ%%%J%%%%%jjjj%%%%%JJ%J%J%%%%j%%%jjj%JJJ%J%jj%jj%JJj%J%%%%JJjJ%Jj
-555c%%%%J%%J%%%j%%j%j%%%%j%%KJJJ%%%%%jj%jjjj%%k%%JK%%jk%jJJ%%JJ%J%j%%j%%%%%
-574f%JJJj%j%J%%jj%%J%Jj%JJK%jkjj%jJJ%%%J%J%J%j%JJj%j%j%%j%%%%%J%JJj%j%%j%%%
-593e%%Jj%j%%%J%JKK%jjkljJJK%J%%%%%J%%JJjj%%%JjjlljJJKJKKJ%Jjjjj%J%%%J%%%%%j
-613b%%j%j%jjjjJJ%%%%JJ%j%jj%%KJJjjj%%%%%jjJJJJJJjj%j%j%%JJ%JJjjJJJj%jjj%%%J
$$ y = [-5, -6, -7, -8, -8, -8, -8, -7, -7, -7, -7, -7, -6, -6, -6, -5, -4, -4, -3, -2, -1, 0, 0, 0, 0, -1, 0, 0, -1, -2, -2, -2, -2, -3, -4, -5, -5, -4, -4, -3, -2, -1, -1, 0, 0, 0, 0, 0, 0, -1, -1, -2, -2, -3, -2, -1, -1, -1, -2, -3, -4, -5, -5, -4, -3, -4, -4, -4, -4, -3, -2, -2, -1, 0, -1, -2, -3, -3, -3, -3, -3, -3, -3, -3, -3, -3, -3, -4, -3, -3, -4, -5, -7, -7, -6, -6, -6, -5, -5, -5, -6, -6, -6, -5, -5, -5, -5, -5, -5, -5, -5, -6, -6, -7, -6, -6, -6, -6, -5, -5, -5, -6, -8, -8, -7, -6, -4, -3, -3, -5, -6, -6, -6, -5, -4, -4, -5, -5, -4, -3, -2, -3, -4, -4, -4, -4, -4, -3, -3, -4, -5, -6, -5, -4, -3, -3, -3, -3, -3, -3, -3, -3, -4, -5, -6, -5, -3, -2, -1, -1, -1, -1, -1, -1, -3, -4, -4, -4, -4, -4, -5, -6, -6, -4, -2, 0, 0, 0, 0, -1, -1, -1, 0, 1, 1, 1, 0, 0, -2, -3, -3, -3, -2, -2, -2, -2, -2, -2, -1, -1, -3, -4, -5, -4, -3, -2, -2, -3, -4, -5, -4, -4, -4, -4, -3, -3, -3, -3, -3, -3, -4, -5, -6, -7, -7, -7, -7, -7, -7, -6, -5, -5, -4, -4, -3, -3, -3, -3, -3, -4, -4, -4, -4, -5, -6, -7, -7, -6, -5, -4, -4, -3, -3, -4, -5, -5, -6, -7, -7, -6, -5, -6, -6, -5, -5, -5, -5, -5, -4, -3, -4, -3, -3, -2, -3, -3, -3, -3, -3, -2, -2, -2, -1, -1, -1, -1, -2, -2, -2, -3, -3, -4, -4, -4, -4, -4, -5, -5, -5, -3, -2, -1, 0, 0, 0, 0, 0, 0, -1, -2, -2, -3, -4, -5, -6, -6, -6, -8, -8, -8, -7, -5, -5, -5, -6, -8, -8, -9, -8, -7, -7, -7, -6, -5, -5, -4, -4, -5, -5, -5, -6, -6, -6, -6, -6, -6, -6, -5, -4, -3, -4, -4, -5, -5, -4, -4, -4, -5, -6, -6, -6, -5, -5, -4, -5, -5, -4, -3, -1, -1, -2, -4, -5, -6, -6, -7, -6, -5, -5, -5, -5, -4, -4, -3, -3, -2, -2, -3, -3, -2, -1, -2, -2, -3, -3, -4, -4, -4, -5, -5, -5, -5, -5, -5, -4, -4, -3, -2, -3, -3, -4, -4, -4, -5, -5, -5, -5, -5, -5, -4, -5, -5, -6, -6, -6, -6, -5, -5, -4, -2, 0, 0, -1, -2, -4, -7, -8, -7, -6, -4, -4, -3, -3, -3, -3, -3, -3, -2, -2, -2, -1, 0, -1, -2, -2, -2, -2, -1, -2, -3, -6, -9, -10, -9, -8, -6, -5, -3, -1, 0, 0, 1, 0, -1, -2, -3, -3, -2, -2, -2, -2, -1, -1, -1, -1, -1, -1, -2, -2, -2, -3, -3, -4, -4, -5, -6, -7, -8, -7, -6, -6, -6, -6, -6, -5, -4, -4, -5, -5, -6, -7, -7, -7, -5, -4, -3, -4, -5, -6, -6, -6, -6, -6, -6, -7, -8, -7, -6, -5, -4, -3, -2, -3, -4, -4, -5, -5, -6, -6, -6, -5, -4, -4, -3, -2, -3, -4, -3, -2, -1, -2, -2, -3, -4, -5, -5, -5, -5, -4]
-632d%JJ%J%%%%%%j%%%%J%%%%%jj%%j%jkjj%JJ%JKJ%%%JjjJJ%%%jk%%J%J%j%%%%%%%j%j%J
-651e%%%%%%%JJJj%%%jj%j%%%jJJ%%JJ%J%jj%jJ%J%Jjk%%%%J%J%j%j%j%JJJjjKKJjj%%%%%
-671b%%%j%%%%%j%%j%%%%%%J%%%%%%%%%%%jjJ%JJj%jjJ%%jjjJJK%%JJ%J%%jj%KJJkjj%%%J
-690bj%%%%%JJjjjj%J%%JJJ%%jJ%J%%jkj%jjj%%jjJJKKKJ%Jj%jj%j%J%J%%%%%%%%%j%j%%j
-709d%%JK%j%Jjjj%jj%KJjjj%JJJ%Jjkk%%KJJ%%%JJJJjjjj%%j%%%j%%%%jjjJJ%J%j%%%j%%
-729gJJ%JjjJJ%Jjjj%%JJJ%j%j%j%%J%J%%Jjj%%%jJJ%JJJ%jJ%%J%%j%jjkjjJJJ%%J%%j%%%
-748d%%%jJj%J%J%j%jj%JJ%%j%%j%%%JJJ%JJj%jJJJJ%%%jj%jj%jj%%J%%%%JJjjj%jJJJjjj
-767fj%%%J%JJ%%%%%J%%%%j%%%%%jj%JJ%j%KJ%Jjjj%%%%jj%JJJJJJ%jj%%J%kkjjJ%J%Jjjj
$$ y = [-4, -4, -3, -2, -2, -1, -1, -1, -1, -1, -1, -1, -2, -2, -2, -2, -2, -1, -1, -1, -1, -1, -1, -2, -3, -3, -3, -4, -4, -5, -7, -8, -9, -9, -8, -7, -7, -6, -4, -3, -3, -3, -3, -2, -3, -4, -3, -2, -2, -2, -2, -3, -5, -5, -5, -4, -4, -3, -3, -4, -4, -4, -4, -4, -4, -4, -4, -5, -5, -6, -6, -5, -5, -5, -5, -5, -5, -5, -5, -4, -3, -2, -3, -3, -3, -3, -4, -5, -5, -6, -6, -6, -6, -7, -6, -5, -5, -5, -4, -3, -3, -2, -2, -3, -4, -4, -5, -4, -4, -3, -3, -2, -3, -5, -5, -5, -5, -5, -4, -4, -3, -3, -4, -4, -5, -5, -6, -6, -5, -4, -3, -4, -5, -3, -1, 0, -1, -2, -2, -2, -2, -2, -2, -2, -2, -2, -3, -3, -3, -3, -3, -3, -4, -4, -4, -5, -5, -5, -5, -5, -5, -5, -4, -4, -4, -4, -4, -4, -4, -4, -4, -4, -4, -4, -5, -6, -5, -5, -4, -3, -4, -4, -5, -6, -5, -5, -5, -6, -7, -8, -7, -6, -4, -4, -4, -3, -2, -2, -1, -1, -1, -2, -3, -3, -1, 0, 1, -1, -2, -3, -3, -3, -3, -2, -3, -3, -3, -3, -3, -3, -2, -1, -2, -3, -4, -5, -5, -4, -4, -4, -3, -2, -1, -1, -1, -2, -1, -1, 0, 0, 0, -1, -3, -4, -4, -5, -6, -7, -7, -7, -8, -9, -8, -7, -5, -3, -1, 0, 0, 1, 0, 0, -1, -2, -2, -3, -3, -2, -2, -1, -1, -1, -1, -1, -1, -1, -1, -1, -1, -2, -2, -3, -3, -3, -4, -4, -4, -3, -1, -1, -2, -2, -1, -2, -3, -4, -4, -5, -6, -6, -4, -3, -4, -5, -6, -6, -5, -4, -3, -3, -2, -3, -5, -7, -7, -7, -5, -4, -3, -3, -3, -3, -2, -1, 0, 1, 0, -1, -2, -3, -3, -3, -4, -4, -4, -4, -5, -5, -5, -5, -5, -6, -7, -8, -7, -6, -6, -5, -5, -6, -6, -6, -6, -7, -7, -7, -6, -5, -5, -4, -5, -6, -5, -4, -4, -3, -4, -5, -6, -6, -6, -5, -4, -3, -3, -4, -4, -5, -5, -6, -6, -6, -5, -5, -4, -4, -4, -3, -4, -5, -5, -5, -5, -6, -5, -4, -4, -3, -2, -1, -1, -2, -1, -1, -1, 0, 0, 0, -1, -1, -2, -3, -5, -6, -7, -6, -5, -4, -4, -4, -3, -3, -3, -4, -4, -4, -4, -4, -4, -4, -5, -4, -5, -5, -4, -4, -3, -3, -4, -4, -5, -6, -6, -5, -4, -4, -4, -5, -5, -5, -6, -6, -6, -6, -5, -4, -3, -3, -2, -1, -2, -2, -3, -2, -1, 0, 1, 1, 1, 1, 0, -1, -1, -2, -3, -3, -4, -5, -5, -5, -4, -4, -4, -4, -4, -3, -2, -3, -4, -5, -5, -6, -5, -4, -3, -4, -5, -6, -7, -7, -7, -7, -6, -6, -5, -4, -4, -4, -4, -4, -4, -3, -3, -3, -3, -3, -4, -4, -4, -4, -4, -4, -5, -6, -6, -5, -4, -4, -5, -5, -3, -2, -2, -1, -2, -3, -4, -4, -4, -4, -4, -5, -6, -6, -5, -4, -3, -2, -1, 0, 0, -1, -2, -2, -2, -1, -1, -3, -5, -6, -7, -6, -6, -5, -5, -4, -5, -6, -7]
-787g%%%%J%J%%Jj%%JjJ%j%Jj%%j%%%%%%%%J%K%%j%JJjj%jJ%%%%j%j%J%%%J%J%Jjjj%jj%%
-806g%J%%J%J%J%%%%%%j%jJ%%Jj%%%J%%jjjJJ%J%%%%%%%%%jJJJJj%%j%j%jj%%JJ%%%jj%J%
-825d%%%JJ%%%Jjj%%jjljJKK%%j%%%%%%j%J%%J%%%%%%%J%%%%%jj%%J%J%J%%jj%JJjjk%J%J
-845dJ%%%%%%%j%jjj%JKKJjkj%j%%JJ%%%%%j%%%%JJ%%%%%jJ%j%KK%jjjk%%j%%j%%JJJJ%%%
-864c%%%%%%%%%%JK%%%%j%%%%%%%Jjj%j%jJJ%jj%k%%JjjjJKJjj%%jj%%J%JJ%J%%%%j%%jKJ
-883cJJ%j%%%%jkjjJ%JJ%JJJj%kj%%%%%%%%J%%j%jKJ%jjj%%JJJJ%J%%%%j%%%j%jj%J%j%j%
-903f%j%JJJJjj%jj%j%jJKK%%%%%j%%%%%J%J%Jjkk%JJ%%%%%J%JJj%j%%J%JJ%%jjj%J%jkjJ
-922fJj%jJ%JJj%%j%J%J%jjJJJ%%j%%%%jj%%JJ%%%%j%%%%%J%JJ%%j%j%jj%%KJ%j%%%%%%%%
$$ y = [-7, -7, -7, -7, -7, -6, -6, -5, -5, -5, -4, -5, -5, -5, -4, -5, -4, -4, -5, -5, -4, -5, -5, -5, -6, -6, -6, -6, -6, -6, -6, -6, -6, -5, -5, -3, -3, -3, -4, -4, -3, -2, -3, -4, -4, -5, -4, -4, -4, -4, -4, -5, -5, -6, -6, -5, -5, -5, -5, -4, -4, -3, -3, -2, -3, -4, -5, -5, -6, -7, -7, -7, -7, -6, -6, -6, -5, -5, -4, -4, -3, -3, -3, -3, -3, -3, -3, -4, -4, -5, -4, -4, -4, -3, -4, -4, -4, -4, -3, -3, -3, -4, -5, -6, -5, -4, -4, -3, -3, -3, -3, -3, -3, -3, -3, -3, -3, -4, -3, -2, -1, 0, -1, -1, -1, -2, -2, -3, -3, -4, -5, -5, -5, -4, -3, -3, -3, -3, -4, -5, -5, -4, -4, -4, -4, -4, -3, -2, -2, -2, -2, -1, -2, -3, -3, -3, -4, -5, -8, -9, -8, -6, -4, -4, -4, -5, -5, -5, -5, -5, -5, -5, -6, -6, -5, -5, -5, -4, -4, -4, -4, -4, -4, -4, -4, -3, -3, -3, -3, -3, -3, -4, -5, -5, -5, -4, -4, -3, -3, -2, -2, -2, -3, -4, -4, -3, -2, -3, -4, -6, -6, -5, -5, -4, -3, -3, -3, -3, -3, -3, -3, -3, -4, -4, -5, -6, -7, -7, -6, -4, -2, -1, -2, -4, -5, -5, -6, -6, -6, -5, -4, -4, -4, -4, -4, -4, -5, -5, -5, -5, -5, -4, -3, -3, -3, -3, -3, -3, -4, -3, -3, -4, -4, -2, 0, 0, -1, -2, -3, -5, -5, -5, -6, -6, -6, -7, -7, -7, -6, -5, -4, -3, -3, -3, -3, -3, -3, -3, -3, -3, -3, -3, -3, -3, -3, -2, 0, 0, 0, 0, 0, -1, -1, -1, -1, -1, -1, -1, -1, 0, -1, -2, -2, -3, -3, -4, -3, -2, -2, -3, -4, -4, -6, -6, -6, -5, -6, -7, -8, -7, -5, -4, -5, -6, -6, -6, -7, -8, -8, -8, -7, -7, -6, -5, -5, -4, -4, -4, -4, -4, -5, -5, -5, -6, -4, -3, -2, -1, -1, -2, -2, -2, -2, -2, -3, -5, -6, -7, -6, -6, -5, -4, -4, -3, -2, -1, -2, -2, -4, -5, -5, -5, -5, -5, -5, -5, -5, -5, -4, -4, -4, -5, -5, -6, -4, -3, -3, -4, -5, -6, -6, -6, -5, -4, -3, -2, -2, -1, -1, -1, -1, -1, -2, -2, -2, -2, -3, -3, -4, -5, -5, -4, -4, -5, -5, -6, -6, -6, -7, -7, -6, -5, -4, -3, -4, -5, -5, -6, -7, -7, -8, -8, -9, -8, -6, -4, -4, -4, -4, -4, -4, -5, -5, -5, -5, -5, -5, -4, -4, -3, -3, -2, -3, -5, -7, -7, -6, -5, -5, -5, -5, -5, -5, -4, -4, -3, -2, -3, -3, -4, -4, -4, -3, -3, -2, -1, -1, -1, -2, -3, -4, -4, -3, -3, -4, -6, -7, -6, -5, -6, -6, -7, -6, -6, -5, -4, -5, -5, -5, -6, -6, -5, -5, -4, -4, -5, -6, -5, -4, -3, -3, -3, -4, -4, -4, -4, -4, -5, -6, -6, -6, -5, -4, -4, -4, -4, -4, -5, -5, -5, -5, -5, -5, -4, -4, -3, -2, -2, -2, -3, -3, -4, -4, -5, -6, -6, -6, -4, -3, -3, -4, -4, -4, -4, -4, -4, -4, -4, -4]
-941djJJ%JJ%jj%%%%%%%J%jJj%%Jj%%%jjjJ%%%JJ%%jj%JJK%%jjjk%Jjjj%J%%KJKjj%%%%%%
-961d%%%jj%JJKJJ%%jjjkjjJJKJ%j%%%%%JJjjjj%%%JJ%jj%j%JJ%%j%jJ%%%J%%%%j%%JJJ%J
-980aJ%j%%%jjj%%JjJ%%j%%%J%%%kj%j%j%%%%JKJJ%%%%%%j%%%j%JJJ%jjJJjj%j%j%%%%%J%
-999e%%j%%J%JJJjj%%%%%j%%%j%%JK%%j%%JjjjJ%%%%Jj%%%jj%JJ%J%jj%JJ%%jjJ%%j%J%%%
-1019eJ%Jj%jJ%J%J%%J%j%jj%jj%j%%%%J%%J%%JJ%%J%%J%JJjkjj%J%%j%J%J%%%j%j%%KJ%j
-1038bkj%J%%%%%%%jjJ%J%%%%%J%%j%%%J%J%kj%J%JJ%j%%j%jj%j%%%%%j%J%%KKJKJ%j%j%%
-1057a%%%j%%J%%kjjj%%JJJJ%%%%%%%%%%J%JjkjJ%%%jjJJJ%%%%%%J%Jjj%jjjjjJKJ%kk%j%
-1076hjJJJ%JJ%%%%%%%%%J%%j%jKJ%kjjjJJJ%%%j%JJ%%%J%Jjj%jJ%J%%%%%j%%%%%%j%%%Jk
$$ y = [-4, -5, -4, -3, -3, -2, -1, -1, -2, -3, -3, -3, -3, -3, -3, -3, -3, -2, -2, -3, -2, -3, -3, -3, -2, -3, -3, -3, -3, -4, -5, -6, -5, -5, -5, -5, -4, -3, -3, -3, -4, -5, -5, -4, -3, -1, -1, -1, -2, -3, -4, -6, -6, -5, -6, -7, -8, -8, -7, -7, -7, -5, -4, -2, -3, -4, -4, -4, -4, -4, -4, -4, -4, -4, -4, -5, -6, -6, -5, -4, -2, -1, 0, 0, 0, -1, -2, -3, -5, -6, -7, -6, -5, -3, -2, -2, -3, -3, -3, -3, -3, -3, -2, -1, -2, -3, -4, -5, -5, -5, -5, -4, -3, -3, -4, -5, -5, -6, -6, -5, -4, -4, -4, -5, -5, -6, -5, -5, -5, -5, -4, -4, -4, -4, -4, -5, -5, -5, -4, -3, -2, -2, -1, 0, 0, -1, -1, -1, -1, -2, -3, -4, -4, -4, -3, -4, -3, -3, -3, -4, -4, -4, -4, -3, -3, -3, -3, -5, -6, -6, -7, -7, -8, -8, -8, -8, -8, -7, -5, -4, -3, -3, -3, -3, -3, -3, -3, -4, -4, -4, -4, -5, -5, -4, -3, -2, -2, -3, -4, -3, -2, -3, -4, -4, -5, -5, -6, -6, -6, -6, -6, -6, -5, -5, -5, -5, -6, -6, -6, -5, -5, -4, -3, -2, -3, -4, -4, -4, -4, -4, -4, -5, -5, -5, -5, -6, -6, -6, -5, -3, -3, -3, -4, -4, -4, -3, -4, -5, -6, -5, -5, -5, -5, -5, -4, -5, -5, -5, -5, -6, -7, -7, -6, -5, -5, -4, -4, -5, -6, -6, -5, -4, -4, -4, -5, -6, -5, -5, -5, -6, -6, -5, -5, -5, -5, -4, -4, -3, -4, -4, -5, -4, -4, -3, -3, -2, -2, -2, -1, -1, -2, -2, -3, -4, -4, -5, -6, -6, -7, -7, -7, -7, -7, -6, -6, -6, -5, -5, -5, -4, -3, -3, -3, -2, -2, -2, -1, -1, 0, 1, 0, -2, -3, -4, -4, -3, -3, -3, -4, -4, -3, -3, -2, -2, -2, -2, -3, -3, -4, -4, -4, -2, -1, -1, -2, -4, -5, -5, -4, -4, -4, -4, -4, -4, -4, -4, -5, -6, -5, -5, -4, -4, -4, -4, -4, -4, -3, -3, -3, -4, -4, -4, -4, -3, -3, -2, -2, -4, -5, -5, -4, -4, -3, -2, -2, -3, -3, -3, -4, -4, -5, -6, -6, -7, -7, -7, -7, -7, -7, -8, -8, -7, -7, -7, -5, -3, -2, 0, 1, 1, 0, 0, -1, -1, -1, -1, -1, -1, -2, -2, -2, -1, -1, -1, -3, -4, -5, -6, -6, -6, -5, -4, -3, -2, -2, -2, -2, -2, -2, -2, -2, -2, -2, -2, -1, -1, 0, -1, -3, -4, -3, -3, -3, -3, -4, -5, -4, -3, -2, -2, -2, -2, -2, -2, -2, -1, -1, 0, -1, -2, -2, -3, -4, -5, -6, -7, -6, -4, -3, -3, -5, -7, -7, -8, -8, -9, -8, -7, -6, -6, -5, -4, -4, -4, -4, -4, -4, -4, -4, -4, -4, -3, -3, -3, -4, -4, -5, -3, -2, -2, -4, -5, -6, -7, -6, -5, -4, -4, -4, -4, -5, -5, -4, -3, -3, -3, -3, -2, -2, -1, -2, -3, -3, -4, -3, -3, -2, -2, -2, -2, -2, -2, -3, -3, -3, -3, -3, -3, -3, -4, -4, -4, -4, -3, -5]
-1095ejj%jj%%J%JJJKJK%j%%j%kj%%%j%jJJJJ%j%%JKJjj%%Jj%jj%j%%%JJJ%%jjjj%J%%J%J
-1114cJ%%kkjJJ%%Jj%j%%%%%J%JJj%%jjJJJ%j%j%j%jKJj%%%%%%J%J%%%J%%%Jj%j%jjJJ%kj
-1133f%%J%%%%%%%J%%%%%J%%%%%Jkj%%%%%%j%jk%JJ%JJKJ%%%J%%Jjkl%j%%JK%%%j%%%%%JJ
-1152cJ%%%j%jJ%jjj%JJJJjjjJKJ%%j%jjjj%j%%JJJJ%kj%J%jjj%JJKKJ%%%jj%j%jj%jjJKJ
-1171dJj%%j%%%%%j%jJ%J%jJJ%%KJ%j%j%%j%j%%j%jj%jJJKJJJJ%Jjj%jjjjj%jj%jKKJJ%%%
-1190d%j%j%%jJ%%J%j%jJJJ%%%J%JJ%kj%J%%%j%%j%%%%j%%J%%%jJ%kj%%J%%JJ%J%%jJ%%%%
-1210d%%%%%%%j%Jjjj%J%J%%J%%j%%%jj%KJ%%%j%%%%J%%%J%%jj%%JJJ%%J%jjkj%%%%J%%%J
-1229d%%%JJ%%kkj%J%%J%J%JJ%kj%JJ%%J%J%%%%%j%%%j%%%%%%%%%JK%j%j%JjjJj%%%j%%%J
$$ y = [-5, -6, -7, -7, -8, -9, -9, -9, -8, -8, -7, -6, -5, -3, -2, 0, 0, -1, -1, -1, -2, -2, -4, -5, -5, -5, -5, -6, -6, -7, -6, -5, -4, -3, -3, -4, -4, -4, -3, -1, 0, -1, -2, -2, -2, -1, -2, -2, -3, -4, -4, -5, -5, -5, -5, -4, -3, -2, -2, -2, -3, -4, -5, -6, -6, -5, -5, -5, -4, -4, -3, -2, -2, -2, -4, -6, -7, -6, -5, -5, -5, -4, -5, -5, -6, -6, -6, -6, -6, -6, -5, -5, -4, -3, -4, -4, -4, -5, -6, -5, -4, -3, -3, -4, -4, -5, -5, -6, -6, -7, -5, -4, -5, -5, -5, -5, -5, -5, -5, -4, -4, -3, -3, -3, -3, -2, -2, -2, -2, -1, -2, -2, -3, -3, -4, -5, -4, -3, -3, -5, -6, -6, -6, -5, -5, -5, -5, -5, -5, -5, -5, -4, -4, -4, -4, -4, -4, -3, -3, -3, -3, -3, -3, -2, -4, -5, -5, -5, -5, -5, -5, -5, -6, -6, -7, -9, -9, -8, -7, -7, -6, -5, -3, -2, -2, -2, -2, -1, -1, -1, 0, -1, -3, -6, -6, -7, -7, -7, -6, -4, -4, -4, -4, -5, -5, -5, -5, -5, -5, -4, -3, -2, -2, -2, -2, -3, -3, -4, -3, -3, -4, -5, -6, -6, -5, -4, -3, -2, -3, -4, -5, -4, -2, -1, -1, -1, -2, -2, -3, -4, -5, -6, -6, -7, -7, -7, -6, -5, -4, -3, -3, -5, -6, -6, -5, -5, -6, -7, -8, -8, -7, -6, -4, -2, -1, -1, -1, -1, -2, -3, -3, -4, -4, -5, -6, -6, -7, -8, -7, -5, -4, -3, -4, -4, -4, -5, -5, -5, -5, -5, -5, -6, -6, -7, -6, -6, -5, -5, -6, -5, -4, -4, -4, -2, -1, -1, -2, -2, -3, -3, -3, -4, -4, -5, -5, -5, -6, -6, -7, -8, -8, -9, -8, -7, -5, -4, -3, -2, -1, -1, 0, -1, -2, -2, -3, -4, -5, -6, -7, -7, -8, -9, -9, -10, -8, -6, -5, -4, -4, -4, -4, -4, -5, -5, -6, -6, -6, -7, -6, -6, -6, -5, -5, -6, -6, -7, -6, -5, -4, -4, -4, -4, -3, -3, -2, -1, -1, -3, -4, -4, -3, -3, -3, -3, -4, -4, -4, -5, -5, -5, -5, -5, -6, -6, -6, -5, -5, -5, -5, -6, -5, -5, -7, -8, -8, -8, -7, -7, -7, -6, -5, -5, -4, -4, -4, -5, -4, -4, -4, -4, -4, -4, -4, -4, -4, -4, -4, -4, -5, -5, -4, -5, -6, -7, -7, -6, -6, -5, -5, -5, -4, -4, -4, -5, -5, -5, -5, -6, -7, -7, -5, -4, -4, -4, -4, -5, -5, -5, -5, -5, -4, -4, -4, -4, -3, -3, -3, -4, -5, -5, -5, -4, -3, -2, -2, -2, -1, -1, -2, -3, -5, -6, -6, -6, -6, -6, -5, -5, -5, -5, -4, -4, -4, -4, -3, -2, -2, -2, -4, -6, -7, -7, -6, -6, -6, -5, -5, -4, -4, -3, -2, -2, -4, -5, -5, -4, -3, -3, -3, -2, -2, -1, -1, -1, -1, -1, -1, -2, -2, -2, -2, -3, -3, -3, -3, -3, -3, -3, -3, -3, -3, -2, 0, 0, -1, -1, -2, -2, -1, -2, -3, -2, -3, -3, -3, -3, -4, -4, -4, -4, -3]
-1248c%%%%%%j%jJJJ%%jj%%%%JJJJjj%j%%J%%%jj%%%JKJ%jkjjj%%%%%%jjjJJK%%jJ%J%%j%
-1267e%%JK%%j%j%j%j%JjjJ%JJ%%J%J%%%j%%j%%%%%%J%%%%j%%J%JJjjjjj%%j%jJJJ%KKjjk
-1286e%%%%%%J%Jj%jjJ%%Jkjj%j%JJJK%JJJJ%lkj%J%jJ%%jj%%J%%%%%JJJJ%%jjj%%%J%%J%
-1305c%jJ%%%J%%%Jj%j%jjj%K%jj%J%J%%%%J%J%%%j%%%%%%%%jj%%%%J%Jj%%%J%J%J%%%%j%
-1324bJ%JJ%jjjj%J%%J%%%Jjkj%%j%j%%JJ%%%%%J%jj%J%%jJ%jkj%%JJK%kjjJJ%%%j%%JJJK
-1343b%%kj%%%J%J%J%JJ%%J%%%kjj%%%%J%Jj%JJJjjjj%JJ%%%j%J%%j%%%j%%Jj%jkj%%%J%%
-1362f%J%%%%Jj%jjJJ%%%%J%J%%j%j%%J%%%%%%jJJj%%J%Jkkj%J%%jj%%j%JJKJjk%J%jJK%J
-1381cJJ%%j%j%%j%%J%%JJ%jj%Jj%j%jKK%%%jjk%jJJ%j%%%%%%%J%%J%JJjjjjJ%%J%j%%%%%
$$ y = [-3, -3, -3, -3, -3, -3, -3, -4, -4, -5, -4, -3, -2, -2, -2, -3, -4, -4, -4, -4, -4, -3, -2, -1, 0, -1, -2, -2, -3, -3, -3, -2, -2, -2, -2, -3, -4, -4, -4, -4, -3, -1, 0, 0, -1, -3, -4, -5, -6, -6, -6, -6, -6, -6, -6, -7, -8, -9, -8, -7, -5, -5, -5, -6, -5, -5, -4, -4, -4, -5, -5, -5, -5, -4, -2, -2, -2, -3, -3, -4, -4, -5, -5, -6, -6, -5, -6, -7, -6, -6, -5, -4, -4, -4, -3, -3, -2, -2, -2, -2, -3, -3, -3, -4, -4, -4, -4, -4, -4, -4, -3, -3, -3, -3, -3, -4, -4, -4, -3, -3, -2, -1, -2, -3, -4, -5, -6, -6, -6, -7, -7, -8, -7, -6, -5, -5, -3, -1, -2, -3, -5, -5, -5, -5, -5, -5, -5, -4, -4, -3, -4, -4, -5, -6, -5, -5, -5, -4, -6, -7, -8, -8, -9, -9, -8, -7, -6, -4, -4, -3, -2, -1, 0, 0, -3, -5, -6, -6, -5, -5, -6, -5, -5, -5, -6, -7, -7, -7, -6, -6, -6, -6, -6, -6, -5, -4, -3, -2, -2, -2, -3, -4, -5, -5, -5, -5, -4, -4, -4, -3, -3, -3, -4, -3, -3, -3, -3, -2, -2, -2, -2, -1, -2, -2, -3, -3, -4, -5, -6, -6, -4, -4, -5, -6, -6, -5, -5, -4, -4, -4, -4, -4, -3, -3, -2, -2, -2, -2, -3, -3, -3, -3, -3, -3, -3, -3, -3, -4, -5, -5, -5, -5, -5, -4, -4, -3, -4, -4, -4, -4, -3, -3, -2, -2, -1, -1, -1, -1, -1, -2, -2, -1, -1, 0, 1, 1, 0, -1, -2, -3, -3, -2, -2, -2, -1, -1, -1, -1, 0, -1, -3, -4, -4, -4, -5, -5, -6, -6, -6, -5, -4, -4, -4, -4, -4, -4, -3, -3, -4, -5, -5, -4, -4, -4, -5, -4, -4, -5, -7, -8, -8, -8, -7, -6, -4, -4, -6, -7, -8, -7, -6, -6, -6, -6, -7, -7, -7, -6, -5, -4, -2, -2, -2, -4, -5, -5, -5, -5, -4, -4, -3, -3, -2, -2, -1, 0, 0, 0, 1, 1, 1, 1, -1, -2, -3, -3, -3, -3, -3, -2, -2, -1, -2, -2, -1, 0, 1, 0, -1, -2, -3, -3, -2, -1, -1, -1, -1, -2, -2, -1, -1, -1, -2, -2, -2, -2, -3, -3, -3, -2, -3, -3, -4, -6, -7, -7, -7, -7, -6, -6, -6, -6, -5, -5, -5, -5, -5, -4, -5, -5, -6, -7, -6, -5, -5, -5, -5, -5, -4, -4, -3, -3, -3, -4, -4, -5, -5, -5, -4, -4, -4, -4, -4, -4, -4, -5, -4, -3, -4, -4, -4, -3, -3, -2, -4, -6, -7, -7, -6, -6, -6, -7, -8, -8, -8, -9, -9, -8, -7, -5, -4, -5, -7, -7, -6, -6, -7, -6, -4, -4, -3, -2, -1, -1, -1, -2, -2, -3, -3, -3, -4, -4, -4, -3, -3, -3, -2, -1, -1, -2, -3, -3, -2, -3, -3, -4, -4, -5, -3, -1, -1, -1, -1, -2, -3, -5, -5, -6, -5, -4, -4, -5, -5, -5, -5, -5, -5, -5, -5, -4, -4, -4, -3, -3, -2, -1, -2, -3, -4, -5, -4, -4, -4, -3, -3, -4, -4, -4, -4, -4, -4]
-1400dJ%%kkjJJJJJ%%j%%%j%j%JJJJ%%j%%jj%j%j%JJJJjjk%JJJJ%j%%%%%%j%jj%%J%%j%%J
-1419f%JJ%%%%jj%JJJ%J%j%%jjk%%%J%%J%%%%%%%J%%%jjJ%%J%%J%%j%%%jj%%jKJ%%%Jj%jJ
-1438dJJJ%jj%jj%%J%j%j%%jj%JJJ%J%%%%%%%%%%%J%%J%jj%%%%%%jjJJJjj%%%%j%%Jj%%j%
-1457g%JJJ%%%%JJ%jjjj%J%%%J%%%%J%%J%%%kjj%j%%%KJJ%%jjk%%%%KJKJJkjj%J%%j%%%jj
-1477f%%J%J%%jj%%j%%J%%JJJJ%%jk%J%j%JJJ%J%Jjj%j%%%j%j%%jjJJ%%%%J%JJ%%%%jjjjJ
-1496e%J%%J%%%%%%JJK%kjkjjJ%%%%J%j%%j%%%%KK%%%%%%%%j%kj%%JJJJJ%KJjj%jj%j%%JJ
-1515aJjj%jj%jj%jj%%JJ%JJ%J%j%%%%%%JJJ%jkjJJ%%jj%%%JJJJ%%kjjjjjj%JJJjJ%%%%%J
-1534eJJJ%j%%%j%%%jj%%%J%%Jj%jJJJ%%%%jjJ%J%jj%J%%%%%J%j%%jjj%JJKJ%%%%j%Jj%J%
$$ y = [-4, -3, -3, -3, -5, -7, -8, -7, -6, -5, -4, -3, -3, -3, -4, -4, -4, -4, -5, -5, -6, -6, -5, -4, -3, -2, -2, -2, -3, -3, -3, -4, -5, -5, -6, -6, -7, -7, -6, -5, -4, -3, -4, -5, -7, -7, -6, -5, -4, -3, -3, -4, -4, -4, -4, -4, -4, -4, -5, -5, -6, -7, -7, -7, -6, -6, -6, -7, -7, -7, -6, -6, -5, -4, -4, -4, -4, -4, -5, -6, -6, -5, -4, -3, -3, -2, -2, -3, -3, -3, -4, -5, -7, -7, -7, -7, -6, -6, -6, -5, -5, -5, -5, -5, -5, -5, -5, -4, -4, -4, -4, -5, -6, -5, -5, -5, -4, -4, -4, -3, -3, -3, -4, -4, -4, -4, -5, -6, -6, -6, -7, -5, -4, -4, -4, -4, -3, -4, -4, -5, -4, -3, -2, -1, -1, -2, -3, -3, -4, -5, -5, -5, -4, -4, -5, -5, -6, -6, -6, -7, -8, -8, -7, -6, -5, -5, -4, -4, -4, -4, -4, -4, -4, -4, -4, -4, -4, -4, -3, -3, -3, -2, -2, -3, -4, -4, -4, -4, -4, -4, -4, -5, -6, -5, -4, -3, -4, -5, -5, -5, -5, -5, -6, -6, -6, -5, -6, -6, -6, -7, -7, -7, -6, -5, -4, -4, -4, -4, -4, -3, -2, -2, -3, -4, -5, -6, -6, -5, -5, -5, -5, -4, -4, -4, -4, -4, -3, -3, -3, -2, -2, -2, -2, -4, -5, -6, -6, -7, -7, -7, -7, -5, -4, -3, -3, -3, -4, -5, -7, -7, -7, -7, -7, -5, -4, -2, -1, 0, -2, -3, -4, -4, -3, -3, -3, -4, -4, -4, -4, -5, -6, -6, -6, -5, -5, -4, -4, -4, -5, -6, -6, -6, -7, -7, -7, -6, -6, -6, -5, -4, -3, -2, -2, -2, -3, -5, -5, -4, -4, -5, -5, -4, -3, -2, -2, -1, -1, 0, -1, -2, -2, -3, -3, -3, -3, -4, -4, -5, -5, -5, -6, -7, -6, -5, -5, -5, -5, -5, -4, -4, -3, -2, -2, -2, -2, -2, -3, -4, -5, -6, -5, -5, -4, -4, -4, -3, -3, -3, -3, -3, -3, -3, -2, -1, 1, 1, -1, -2, -4, -5, -6, -5, -5, -5, -5, -5, -4, -4, -5, -5, -5, -6, -6, -6, -6, -6, -4, -2, -2, -2, -2, -2, -2, -2, -2, -2, -3, -3, -5, -6, -6, -6, -5, -4, -3, -2, -1, -1, 1, 2, 1, 0, 0, -1, -2, -2, -3, -3, -3, -2, -1, 0, -1, -2, -2, -3, -4, -4, -5, -6, -6, -7, -8, -8, -8, -7, -6, -6, -5, -4, -4, -3, -3, -4, -4, -4, -4, -4, -4, -4, -3, -2, -1, -1, -2, -4, -5, -4, -3, -3, -3, -4, -5, -5, -5, -5, -4, -3, -2, -1, -1, -1, -3, -4, -5, -6, -7, -8, -9, -9, -8, -7, -6, -7, -6, -6, -6, -6, -6, -6, -5, -4, -3, -2, -2, -3, -3, -3, -3, -4, -4, -4, -4, -5, -6, -6, -6, -6, -5, -5, -5, -4, -5, -5, -6, -5, -4, -3, -3, -3, -3, -3, -4, -5, -4, -4, -3, -3, -4, -5, -5, -4, -4, -4, -4, -4, -4, -3, -3, -4, -4, -4, -5, -6, -7, -7, -6, -5, -3, -2, -2, -2, -2, -2, -3, -3, -2, -3, -3, -2, -2]
-1553b%%%%%K%%kjjj%%%%%%JK%j%jj%%%%jj%%%JJ%j%J%J%%%j%%K%%jj%%J%J%%jkj%KJ%J%%
-1572c%%%%J%%%%j%%%jjjj%%%J%J%%J%%%%%%jJjjjjj%%%JJ%%jJ%J%Jj%J%%%J%J%%J%%J%%J
-1591@%%jj%J%%%%j%%j%%%jjj%%%J%%KJ%%%j%%jj%J%jjj%JK%%%J%%%%%%kj%J%%J%J%%%j%J
-1610c%J%kj%%%%%%%%J%%J%%J%%J%j%%%%%j%%%%%J%%J%%Jjjk%%j%%%%j%JJJK%j%%jjj%%J%
-1629dJJj%J%JJ%J%%%%jj%%j%%%%%%%%%%%%%%%%%%JJ%J%%%%jjjkj%JJJJJJ%j%jj%%j%J%%%
-1648bj%j%jJJ%jj%%%j%%%%%j%%J%%%%JJJ%%jj%JJJJjjjjJJ%%Jjj%%JjjjjJJ%%%J%%%%J%J
-1667bJjjJ%%JjkjjJKKJj%%j%Jjjj%%%%%j%j%JJJJjj%jj%JJ%%%%J%J%%%%%j%j%JJ%jJ%%Jj
-1686bjj%%%J%jj%%%JJ%JJJJjjkjj%%J%JjjjJ%%jJJJ%Jjj%%%%%J%J%%J%%%%%%%jkj%jjJ%J
$$ y = [-2, -2, -2, -2, -2, -2, 0, 0, 0, -2, -3, -4, -5, -5, -5, -5, -5, -5, -5, -4, -2, -2, -3, -3, -4, -5, -5, -5, -5, -5, -6, -7, -7, -7, -7, -6, -5, -5, -6, -6, -5, -5, -4, -4, -4, -4, -5, -5, -5, -3, -3, -3, -4, -5, -5, -5, -4, -4, -3, -3, -3, -4, -6, -7, -7, -5, -4, -4, -3, -3, -3, -3, -3, -3, -3, -2, -2, -2, -2, -2, -3, -3, -3, -3, -4, -5, -6, -7, -7, -7, -7, -6, -6, -5, -5, -5, -4, -4, -4, -4, -4, -4, -4, -5, -4, -5, -6, -7, -8, -9, -9, -9, -9, -8, -7, -7, -7, -8, -7, -7, -6, -6, -5, -6, -6, -5, -5, -5, -5, -4, -4, -3, -3, -3, -2, -2, -2, -1, -1, -1, 0, 0, 0, -1, -2, -2, -1, -1, -1, -1, -1, -2, -2, -2, -3, -3, -3, -3, -4, -5, -6, -6, -6, -6, -5, -5, -5, -3, -2, -2, -2, -2, -3, -3, -3, -4, -5, -5, -4, -4, -5, -6, -7, -7, -6, -4, -4, -4, -4, -3, -3, -3, -3, -3, -3, -3, -5, -6, -6, -5, -5, -5, -4, -4, -3, -3, -3, -3, -4, -4, -3, -3, -2, -2, -4, -5, -5, -5, -5, -5, -5, -5, -5, -5, -4, -4, -4, -3, -3, -3, -2, -2, -2, -1, -1, -2, -2, -2, -2, -2, -2, -3, -3, -3, -3, -3, -3, -2, -2, -2, -1, -1, -1, 0, -1, -2, -4, -4, -4, -5, -5, -5, -5, -5, -6, -6, -5, -4, -3, -1, -1, -2, -2, -2, -3, -4, -5, -5, -5, -4, -4, -3, -2, -3, -3, -2, -2, -1, 0, 0, 1, 1, 1, 1, 1, 0, -1, -1, -1, -2, -2, -2, -2, -2, -2, -2, -2, -2, -2, -2, -2, -2, -2, -2, -2, -2, -2, -2, -1, 0, 0, 1, 1, 1, 1, 1, 0, -1, -2, -4, -5, -5, -4, -3, -2, -1, 0, 1, 1, 0, 0, -1, -2, -2, -2, -3, -3, -2, -2, -2, -2, -3, -3, -4, -4, -5, -4, -3, -3, -4, -5, -5, -5, -5, -6, -6, -6, -6, -6, -6, -7, -7, -7, -6, -6, -6, -6, -6, -5, -4, -3, -3, -3, -4, -5, -5, -4, -3, -2, -1, -2, -3, -4, -5, -4, -3, -3, -3, -2, -3, -4, -4, -4, -3, -4, -5, -6, -7, -6, -5, -5, -5, -5, -4, -4, -4, -4, -4, -3, -3, -2, -1, -2, -3, -2, -2, -2, -1, -2, -4, -5, -6, -5, -3, -1, 0, -1, -1, -1, -2, -2, -1, -2, -3, -4, -4, -4, -4, -4, -4, -5, -5, -6, -6, -5, -4, -3, -2, -3, -4, -4, -5, -6, -6, -5, -4, -4, -4, -4, -4, -3, -3, -2, -2, -2, -2, -2, -2, -3, -3, -4, -4, -3, -2, -2, -3, -2, -2, -2, -1, -2, -3, -4, -4, -4, -4, -3, -3, -4, -5, -5, -5, -5, -4, -3, -3, -2, -1, 0, 1, 0, -1, -3, -4, -5, -5, -5, -4, -4, -3, -4, -5, -6, -5, -5, -5, -6, -5, -4, -3, -3, -2, -3, -4, -4, -4, -4, -4, -4, -3, -3, -2, -2, -2, -1, -1, -1, -1, -1, -1, -1, -1, -2, -4, -5, -5, -6, -7, -6, -6, -5]
-1705e%%%%%JJ%Jj%%j%%%%%%%%%j%jJ%%%JJj%j%JJ%J%%j%%%%%Jj%%j%%j%j%%%%j%%jJJJJJ
-1725c%%%%J%JjjJ%%j%%%%%%%KJ%jjjjjkj%JJ%J%J%J%%%%%J%%J%J%%jjjjj%%J%%%%jjj%%%
-1744g%JJJJKJ%J%j%%j%%j%JKjkkkj%%J%KJK%%j%j%%J%%%%%jj%j%JJjj%k%%JJJ%%JKJJ%jj
-1763ajjjjj%JK%%kj%K%%%JJJ%%J%%j%jj%JJ%%jjj%jj%%JJKJJ%j%%%jj%j%j%j%%%J%J%%J%
-1782cjjjJ%%%%j%%%%%%%%%%J%J%%%J%Jjj%JJjj%j%J%%j%%jKJ%jj%J%%j%%%%%J%jj%%%JK%
-1801cJJJ%%%Jj%j%J%%%%jjjjjjjJ%%J%JJJjj%jJ%j%JJ%JJ%%jkjjJ%%j%J%JKJ%jjjk%jJ%J
-1820eJ%%J%%j%j%%%Jj%%%%%j%%KKL%jkj%JJ%%%%%%%j%JJ%jj%J%%j%j%j%jJJJ%%j%jJ%%%%
-1839c%%%%%%Jj%%%JJ%%jj%jj%%J%Jjj%%%%J%%j%%%%%j%%JJ%%%%%%jj%KJJ%jjj%%%%%Jj%J
$$ y = [-5, -5, -5, -5, -5, -5, -4, -3, -3, -2, -3, -3, -3, -4, -4, -4, -4, -4, -4, -4, -4, -4, -4, -5, -5, -6, -5, -5, -5, -5, -4, -3, -4, -4, -5, -5, -4, -3, -3, -2, -2, -2, -3, -3, -3, -3, -3, -3, -2, -3, -3, -3, -4, -4, -4, -5, -5, -6, -6, -6, -6, -6, -7, -7, -7, -8, -7, -6, -5, -4, -3, -3, -3, -3, -3, -2, -2, -1, -2, -3, -2, -2, -2, -3, -3, -3, -3, -3, -3, -3, -3, -1, 0, 0, -1, -2, -3, -4, -5, -7, -8, -8, -7, -6, -6, -5, -5, -4, -4, -3, -3, -3, -3, -3, -3, -2, -2, -2, -1, -1, 0, 0, 0, -1, -2, -3, -4, -5, -5, -5, -4, -4, -4, -4, -4, -5, -6, -7, -7, -7, -7, -7, -6, -5, -4, -3, -1, 0, 0, 1, 1, 0, 0, 0, -1, -1, -1, -2, -2, -1, 1, 0, -2, -4, -6, -7, -7, -7, -6, -6, -4, -3, -1, -1, -1, -2, -2, -3, -3, -3, -2, -2, -2, -2, -2, -2, -3, -4, -4, -5, -5, -4, -3, -4, -5, -5, -7, -7, -7, -6, -5, -4, -4, -4, -3, -1, 0, 1, 1, 0, -1, -2, -3, -4, -5, -6, -6, -5, -3, -3, -3, -5, -6, -6, -4, -4, -4, -4, -3, -2, -1, -1, -1, 0, 0, 0, -1, -1, -2, -3, -3, -2, -1, -1, -1, -2, -3, -4, -4, -5, -6, -6, -6, -5, -4, -2, -1, 0, 0, -1, -1, -1, -1, -2, -3, -3, -4, -4, -5, -5, -6, -6, -6, -6, -5, -5, -4, -4, -4, -3, -3, -4, -5, -6, -5, -5, -5, -5, -5, -6, -6, -6, -6, -6, -6, -6, -6, -6, -6, -6, -5, -5, -4, -4, -4, -4, -3, -3, -2, -3, -4, -4, -3, -2, -3, -4, -4, -5, -5, -4, -4, -4, -5, -5, -5, -6, -4, -3, -3, -4, -5, -5, -4, -4, -4, -5, -5, -5, -5, -5, -5, -4, -4, -5, -6, -6, -6, -6, -5, -3, -3, -2, -1, 0, 0, 0, 0, 1, 0, 0, -1, -1, 0, 0, 0, 0, 0, -1, -2, -3, -4, -5, -6, -7, -6, -6, -6, -5, -5, -4, -3, -2, -3, -4, -4, -5, -4, -4, -5, -5, -4, -3, -3, -2, -1, -1, -1, -2, -4, -5, -6, -5, -5, -5, -6, -6, -5, -5, -4, -2, -1, -1, -2, -3, -4, -6, -6, -7, -6, -6, -5, -4, -4, -4, -3, -3, -3, -4, -4, -5, -5, -5, -5, -4, -5, -5, -5, -5, -5, -5, -6, -6, -6, -4, -2, 1, 1, 0, -2, -3, -3, -2, -1, -1, -1, -1, -1, -1, -1, -1, -2, -2, -1, 0, 0, -1, -2, -2, -1, -1, -1, -2, -2, -3, -3, -4, -4, -5, -4, -3, -2, -2, -2, -3, -3, -4, -3, -3, -3, -3, -3, -3, -3, -3, -3, -3, -3, -2, -3, -3, -3, -3, -2, -1, -1, -1, -2, -3, -3, -4, -5, -5, -5, -4, -4, -3, -4, -5, -5, -5, -5, -5, -4, -4, -4, -5, -5, -5, -5, -5, -5, -6, -6, -6, -5, -4, -4, -4, -4, -4, -4, -4, -5, -6, -6, -4, -3, -2, -2, -3, -4, -5, -5, -5, -5, -5, -5, -4, -5, -5, -4]
-1858d%%jJ%JJ%jjjjj%jJj%KJ%%%%%%J%J%J%%jjjkJ%%%JJKJ%J%jk%%%%Jkj%JK%jjjj%j%jJ
-1877g%%%%J%%%Jjjj%JJJ%jJJJ%jj%%jKKKJ%kkj%%%%j%j%JJJJJJ%j%j%%jjjj%KKJ%%%j%j%
-1896cj%%j%KJ%jj%JK%j%%jj%%%%%jJjjJ%%%J%J%%%%J%kjjJ%%%%J%%%KK%%j%%j%kj%%%%%J
-1915dK%%jJ%%j%%%jj%J%%jj%%JKjjJJ%J%%%%%%JJ%j%j%%%j%j%jj%%%%%%%JJKK%j%jjjjjK
-1934dJJKj%%%%j%j%j%J%%%%%%J%j%%JjkjJJj%jJJJK%jjj%J%JjkJ%%%%%%%%%J%J%J%%j%jj
-1953d%J%JJj%j%jk%%J%%%J%%J%%J%J%jkjj%%%J%%%J%%%%J%%jjj%%J%%JKK%J%jjjjj%%j%%
-1972eJKJjjj%JJK%Jj%%jjjj%%%J%%j%%J%%j%%%%%%J%Jj%%%%J%Jj%j%jkJ%%j%JK%jjjJJJJ
-1992bJjj%%%%j%%j%J%%JJ%J%kj%%%J%%%%j%%%j%jJ%JK%J%J%Jkj%jJ%%%J%%j%%%%%j%%J%J
$$ y = [-4, -4, -4, -5, -4, -4, -3, -2, -2, -3, -4, -5, -6, -7, -7, -8, -7, -8, -8, -6, -5, -5, -5, -5, -5, -5, -5, -4, -4, -3, -3, -2, -2, -2, -3, -4, -5, -7, -6, -6, -6, -6, -5, -4, -2, -1, -1, 0, 0, -1, -3, -3, -3, -3, -3, -2, -4, -5, -5, -4, -2, -2, -3, -4, -5, -6, -6, -7, -7, -8, -7, -7, -7, -7, -7, -6, -6, -6, -6, -5, -6, -7, -8, -8, -7, -6, -5, -5, -6, -5, -4, -3, -3, -4, -5, -5, -5, -6, -4, -2, 0, 1, 1, -1, -3, -4, -4, -4, -4, -4, -5, -5, -6, -6, -5, -4, -3, -2, -1, 0, 0, -1, -1, -2, -2, -2, -3, -4, -5, -6, -6, -4, -2, -1, -1, -1, -1, -2, -2, -3, -3, -4, -4, -4, -5, -5, -3, -2, -2, -3, -4, -4, -3, -1, -1, -2, -2, -2, -3, -4, -4, -4, -4, -4, -4, -5, -4, -5, -6, -5, -5, -5, -5, -4, -4, -3, -3, -3, -3, -3, -2, -2, -4, -5, -6, -5, -5, -5, -5, -5, -4, -4, -4, -4, -2, 0, 0, 0, -1, -1, -1, -2, -2, -4, -5, -5, -5, -5, -5, -5, -4, -2, -2, -2, -3, -2, -2, -2, -3, -3, -3, -3, -4, -5, -5, -4, -4, -4, -5, -6, -6, -6, -5, -3, -4, -5, -4, -3, -3, -2, -2, -2, -2, -2, -2, -2, -1, 0, 0, -1, -1, -2, -2, -2, -2, -3, -3, -4, -4, -5, -6, -6, -6, -6, -6, -6, -6, -6, -5, -4, -2, 0, 0, -1, -1, -2, -3, -4, -5, -6, -4, -3, -2, 0, -1, -1, -1, -1, -1, -2, -2, -3, -3, -4, -4, -3, -3, -3, -3, -3, -3, -3, -2, -2, -3, -3, -3, -2, -3, -5, -6, -5, -4, -5, -5, -6, -5, -4, -3, -1, -1, -2, -3, -4, -4, -3, -3, -2, -3, -5, -4, -4, -4, -4, -4, -4, -4, -4, -4, -4, -3, -3, -2, -2, -1, -1, -1, -2, -2, -3, -4, -4, -3, -3, -2, -1, -2, -2, -3, -3, -4, -6, -6, -6, -5, -5, -5, -5, -4, -4, -4, -3, -3, -3, -2, -2, -1, -1, -2, -4, -5, -6, -6, -6, -6, -5, -5, -5, -5, -4, -4, -4, -4, -4, -3, -3, -3, -4, -5, -6, -6, -6, -5, -5, -5, -4, -2, 0, 0, 1, 1, 0, -1, -2, -3, -4, -4, -4, -5, -5, -5, -4, -2, -1, -2, -3, -4, -4, -3, -2, 0, 0, 1, 0, 0, 0, -1, -2, -3, -4, -4, -4, -4, -3, -3, -3, -4, -4, -4, -3, -3, -3, -4, -4, -4, -4, -4, -4, -4, -3, -3, -2, -3, -3, -3, -3, -3, -2, -2, -1, -2, -2, -3, -3, -4, -6, -5, -5, -5, -6, -6, -5, -3, -3, -4, -5, -6, -5, -4, -3, -2, -1, -2, -3, -3, -3, -3, -3, -4, -4, -4, -5, -5, -4, -4, -4, -3, -2, -2, -1, -1, -3, -4, -4, -4, -4, -3, -3, -3, -3, -3, -4, -4, -4, -4, -5, -5, -6, -5, -5, -4, -2, -2, -1, -1, 0, 0, 1, -1, -2, -2, -3, -2, -2, -2, -2, -1, -1, -1, -2, -2, -2, -2, -2, -2, -3, -3, -3, -2, -2, -1]
-2011ajkjJ%J%%%%%%%JJ%jkjj%%%J%%%J%J%%J%%J%%j%j%%j%%%j%%%%Jj%j%JK%%jjjJJJJJJ
-2030@Jj%jk%%%jj%J%jj%jJ%%J%%j%jj%JJ%Jj%%JJKJ%%jkjjjJJJjjkj%%%JJK%%%%%JK%%j%
-2049cjJ%%%%%%%%%%%%%j%%%%%j%%%jj%j%jJJJJJ%%jj%%%%j%JJJ%Jjj%j%%JJJ%J%%J%%%%j
-2068b%%%%j%%%J%Jjj%jj%j%JJJ%kj%jJ%JJ%%J%%%%%%%%%jj%JJJJ%%jj%kjj%JJJJjj%jJ%%
-2087eJ%%%%%j%%%j%j%jj%JKKJJ%JJjjjj%%%%jjj%JJ%%%%J%%j%%%%%jJ%%%J%%%%J%Jj%j%%
-2106d%J%%%%J%%%%j%J%%%%%%%j%j%jj%%J%%%%%%j%%%JJ%%%%%%%J%JJJ%%%j%JJ%jkjj%%k%
-2125fjjj%J%JJJJ%%j%%%%%J%%j%%%%%JJ%jjj%JJ%%J%%%%j%%j%j%jJJJ%J%jjJJK%%%%%jj%
-2144c%%%%%j%JJJ%%j%j%%%jJ%%%J%J%%%%%j%j%%j%%%j%j%%%jJ%%%%%J%JKj%jj%%J%%%%%%
$$ y = [-1, -2, -4, -5, -4, -4, -3, -3, -3, -3, -3, -3, -3, -3, -2, -1, -1, -2, -4, -5, -6, -6, -6, -6, -5, -5, -5, -5, -4, -4, -3, -3, -3, -2, -2, -2, -1, -1, -1, -2, -2, -3, -3, -3, -4, -4, -4, -4, -5, -5, -5, -5, -5, -4, -5, -5, -6, -6, -5, -3, -3, -3, -4, -5, -6, -5, -4, -3, -2, -1, 0, 1, 0, 0, -1, -3, -3, -3, -3, -4, -5, -5, -4, -4, -5, -6, -6, -7, -6, -6, -6, -5, -5, -5, -6, -6, -7, -8, -8, -7, -6, -6, -5, -6, -6, -6, -5, -4, -2, -1, -1, -1, -2, -4, -5, -6, -7, -6, -5, -4, -5, -6, -8, -9, -9, -9, -9, -8, -7, -5, -5, -5, -5, -5, -5, -4, -2, -2, -2, -3, -3, -4, -3, -3, -3, -3, -3, -3, -3, -3, -3, -3, -3, -3, -3, -3, -4, -4, -4, -4, -4, -4, -5, -5, -5, -5, -6, -7, -7, -8, -8, -9, -8, -7, -6, -5, -4, -4, -4, -5, -6, -6, -6, -6, -6, -7, -7, -6, -5, -4, -4, -3, -4, -5, -5, -6, -6, -6, -5, -4, -3, -3, -2, -2, -2, -1, -1, -1, -1, -1, -2, -2, -2, -2, -2, -3, -3, -3, -3, -2, -2, -1, -2, -3, -3, -4, -5, -5, -6, -6, -5, -4, -3, -3, -5, -6, -6, -7, -6, -6, -5, -4, -4, -4, -3, -3, -3, -3, -3, -3, -3, -3, -3, -3, -4, -5, -5, -4, -3, -2, -1, -1, -1, -2, -3, -3, -5, -6, -7, -7, -6, -5, -4, -3, -4, -5, -5, -6, -5, -5, -5, -4, -4, -4, -4, -4, -4, -5, -5, -5, -5, -6, -6, -7, -7, -8, -9, -9, -8, -6, -4, -3, -2, -2, -1, 0, -1, -2, -3, -4, -4, -4, -4, -4, -5, -6, -7, -7, -6, -5, -5, -5, -5, -5, -4, -4, -4, -5, -5, -5, -5, -5, -5, -6, -5, -5, -5, -5, -4, -4, -4, -4, -4, -3, -3, -2, -3, -3, -4, -4, -4, -4, -3, -3, -3, -3, -3, -2, -2, -2, -2, -2, -3, -3, -2, -2, -2, -2, -2, -2, -2, -2, -3, -3, -4, -4, -5, -6, -6, -6, -5, -5, -5, -5, -5, -5, -5, -6, -6, -6, -6, -5, -4, -4, -4, -4, -4, -4, -4, -4, -3, -3, -2, -1, 0, 0, 0, 0, -1, -1, 0, 1, 1, 0, -2, -3, -4, -4, -4, -6, -6, -7, -8, -9, -9, -8, -8, -7, -6, -5, -4, -4, -4, -5, -5, -5, -5, -5, -5, -4, -4, -4, -5, -5, -5, -5, -5, -5, -4, -3, -3, -4, -5, -6, -6, -5, -4, -4, -4, -3, -3, -3, -3, -3, -4, -4, -4, -5, -5, -6, -6, -7, -6, -5, -4, -4, -3, -3, -4, -5, -4, -3, -1, -1, -1, -1, -1, -1, -2, -3, -3, -3, -3, -3, -3, -3, -4, -4, -3, -2, -1, -1, -1, -2, -2, -3, -3, -3, -3, -4, -3, -3, -3, -3, -2, -2, -1, -1, -1, -1, -1, -1, -2, -2, -3, -3, -3, -4, -4, -4, -4, -5, -5, -6, -6, -6, -6, -7, -6, -6, -6, -6, -6, -6, -5, -5, -4, -2, -3, -3, -4, -5, -5, -5, -4, -4, -4, -4, -4, -4, -4]
-2163dj%%%jKJJJjjjjJJJJ%JJj%jjj%j%%JK%%jjjjj%%%JJ%%j%%J%J%%jj%J%%J%%%JJj%jjj
-2182eJJJ%%%%j%%jJ%%%%j%%J%JJ%%%j%J%%%%%J%jj%J%j%%%%%jj%Jjj%%JJKjjj%jJJ%J%%j
-2201c%jkJJ%%%Jkj%%JJJ%%jJJ%JjjjjJJJ%j%%%j%J%%Jj%%j%%%%J%%%jk%JJK%J%Jkjj%%kk
-2220h%%J%JJJ%%%%jj%%J%JJ%%J%%j%j%%%%%JKJ%jkjjjJ%jj%J%J%%%%J%%J%J%J%Jj%j%%j%
-2240c%j%J%%%%jJ%J%%j%%%%KJJ%jjj%%j%JJ%%%%%j%j%j%j%j%%K%JJ%%j%%%%J%%%%%%%jjk
-2259fj%%j%J%%%%k%%J%kkj%KLLL%j%%j%%jJ%J%%J%Jjjj%J%J%Jj%%%jJJ%%j%j%%%%%J%j%j
-2278d%%%%J%JJJJJjk%%j%%jj%%%%JKJ%%%j%%kj%KJJ%%j%j%j%%j%%%%%%J%%Jjj%%j%jjJJJ
-2297dK%%%J%Jj%j%j%jj%%%jJ%%J%%KKJ%jjjjjjjjJJKJ%%J%%%j%j%%J%jkj%%j%JJKK%%%j%
$$ y = [-4, -5, -5, -5, -5, -6, -4, -3, -2, -1, -2, -3, -4, -5, -4, -3, -2, -1, -1, 0, 1, 0, 0, -1, -2, -3, -3, -4, -4, -4, -3, -1, -1, -1, -2, -3, -4, -5, -6, -6, -6, -6, -5, -4, -4, -4, -5, -5, -5, -4, -4, -3, -3, -3, -4, -5, -5, -4, -4, -4, -3, -3, -3, -3, -2, -1, -2, -2, -3, -4, -5, -4, -3, -2, -2, -2, -2, -2, -3, -3, -3, -4, -3, -3, -3, -3, -3, -4, -4, -4, -3, -3, -2, -1, -1, -1, -1, -2, -2, -1, -1, -1, -1, -1, -1, 0, 0, -1, -2, -2, -1, -1, -2, -2, -2, -2, -2, -2, -3, -4, -4, -3, -4, -5, -5, -5, -4, -3, -1, -2, -3, -4, -4, -5, -4, -3, -3, -2, -2, -2, -3, -3, -4, -6, -5, -4, -4, -4, -4, -3, -5, -6, -6, -6, -5, -4, -3, -3, -3, -4, -3, -2, -2, -1, -2, -3, -4, -5, -4, -3, -2, -2, -3, -3, -3, -3, -4, -4, -3, -3, -3, -2, -3, -3, -3, -4, -4, -4, -4, -4, -3, -3, -3, -3, -4, -6, -6, -5, -4, -2, -2, -1, -1, 0, -2, -3, -4, -4, -4, -6, -8, -8, -8, -7, -7, -6, -5, -4, -4, -4, -4, -4, -5, -6, -6, -6, -5, -5, -4, -3, -3, -3, -2, -2, -2, -3, -3, -4, -4, -4, -4, -4, -4, -3, -1, 0, 0, -1, -3, -4, -5, -6, -5, -5, -6, -7, -7, -6, -6, -5, -5, -5, -5, -5, -4, -4, -4, -3, -3, -2, -2, -1, -1, 0, -1, -1, -2, -2, -2, -3, -3, -3, -4, -4, -3, -3, -3, -3, -3, -4, -3, -3, -2, -2, -2, -3, -3, -3, -3, -3, -1, 0, 1, 1, 0, -1, -2, -2, -2, -3, -3, -2, -1, -1, -1, -1, -1, -1, -2, -2, -3, -3, -4, -4, -5, -5, -6, -6, -6, -4, -4, -3, -2, -2, -2, -3, -3, -3, -3, -3, -2, -2, -2, -2, -2, -2, -2, -2, -3, -4, -6, -7, -7, -7, -8, -8, -7, -7, -7, -7, -7, -9, -9, -9, -8, -8, -10, -12, -13, -13, -11, -8, -5, -2, -2, -3, -3, -3, -4, -4, -4, -5, -4, -4, -3, -3, -3, -2, -2, -1, -2, -3, -4, -4, -3, -3, -2, -2, -1, -2, -2, -2, -2, -3, -2, -1, -1, -1, -2, -2, -3, -3, -3, -3, -3, -3, -2, -2, -3, -3, -4, -4, -4, -4, -4, -3, -3, -2, -1, 0, 1, 2, 1, -1, -1, -1, -2, -2, -2, -3, -4, -4, -4, -4, -4, -3, -1, 0, 0, 0, 0, -1, -1, -1, -3, -4, -4, -2, -1, 0, 0, 0, -1, -1, -2, -2, -3, -3, -3, -4, -4, -4, -4, -4, -4, -4, -3, -3, -3, -2, -3, -4, -4, -4, -5, -5, -6, -7, -6, -5, -4, -2, -2, -2, -2, -1, -1, 0, -1, -1, -2, -2, -3, -3, -4, -5, -5, -5, -5, -6, -5, -5, -5, -4, -4, -4, -2, 0, 1, 1, 0, -1, -2, -3, -4, -5, -6, -7, -6, -5, -3, -2, -2, -2, -1, -1, -1, -1, -2, -2, -3, -3, -3, -2, -2, -3, -5, -6, -6, -6, -7, -7, -6, -5, -3, -1, -1, -1, -1, -2, -2]
-2316b%jk%JJ%jjjj%%KJ%J%jjjJJ%J%JkjjjJ%%%J%%%J%%%%%%%J%j%j%j%J%%jj%%%JJ%J%j%
-2335e%JJ%%%%%Jjjj%%j%JJKJ%%jj%%J%%jjjj%j%jJKJJ%j%%%Jjj%%jj%%JJ%%%%%%J%%%J%%
-2354c%JJJ%%%jjkjJ%J%%j%jjj%KLJjjj%%J%%%J%%%%j%%jj%%%%%%JJ%%%j%%%%Jjj%JJJJjj
-2373cj%j%jj%%%%JJJ%%%Jj%%%jjJ%JK%%jj%%j%j%j%%JJ%J%%%%j%%%J%%%j%j%%%%%%%%j%J
-2392fJ%%%%%J%%%j%jj%JJJJJ%J%%%j%%j%%j%%%%JJ%JJ%j%jj%j%%%J%%J%%J%jJ%%%J%jjjj
-2411d%%%%%%%JJj%J%%%j%jj%J%%%JJ%%jjj%jj%JJ%JKKJjkk%%%Jjjj%j%J%J%J%%%J%%J%jj
-2430dj%%JJJjJ%j%j%%%J%%%%%jjk%%JJJJ%%%%%%%j%j%%%%%%%j%J%JJ%%JJJJ%%j%jjj%%J%
-2449b%j%j%jjJJJ%J%%Jj%%j%%jj%%J%%j%jJ%%%%%j%%%%%J%%%%JJJJ%jjj%J%J%%%%j%jJ%%
$$ y = [-2, -2, -3, -5, -5, -4, -3, -3, -4, -5, -6, -7, -7, -7, -5, -4, -4, -3, -3, -4, -5, -6, -5, -4, -4, -3, -3, -2, -4, -5, -6, -7, -6, -6, -6, -6, -5, -5, -5, -5, -4, -4, -4, -4, -4, -4, -4, -4, -3, -3, -4, -4, -5, -5, -6, -6, -5, -5, -5, -6, -7, -7, -7, -7, -6, -5, -5, -4, -4, -5, -5, -5, -4, -3, -3, -3, -3, -3, -3, -2, -3, -4, -5, -5, -5, -6, -6, -5, -4, -2, -1, -1, -1, -2, -3, -3, -3, -2, -2, -2, -3, -4, -5, -6, -6, -7, -7, -8, -7, -5, -4, -3, -3, -4, -4, -4, -4, -3, -4, -5, -5, -5, -6, -7, -7, -7, -6, -5, -5, -5, -5, -5, -5, -5, -4, -4, -4, -4, -3, -3, -3, -3, -2, -1, 0, 0, 0, 0, -1, -2, -4, -5, -4, -4, -3, -3, -3, -4, -4, -5, -6, -7, -7, -5, -2, -1, -2, -3, -4, -4, -4, -3, -3, -3, -3, -2, -2, -2, -2, -2, -3, -3, -3, -4, -5, -5, -5, -5, -5, -5, -5, -4, -3, -3, -3, -3, -4, -4, -4, -4, -4, -3, -4, -5, -5, -4, -3, -2, -1, -2, -3, -4, -4, -5, -5, -6, -7, -7, -7, -7, -7, -6, -5, -4, -4, -4, -4, -3, -4, -4, -4, -4, -5, -6, -5, -5, -4, -2, -2, -2, -3, -4, -4, -4, -5, -5, -6, -6, -7, -7, -7, -6, -5, -5, -4, -4, -4, -4, -4, -5, -5, -5, -5, -4, -4, -4, -4, -5, -5, -6, -6, -6, -6, -6, -6, -6, -6, -6, -7, -7, -6, -5, -5, -5, -5, -5, -5, -4, -4, -4, -4, -5, -5, -6, -7, -7, -6, -5, -4, -3, -2, -2, -1, -1, -1, -1, -2, -2, -2, -3, -3, -3, -4, -4, -4, -4, -4, -3, -2, -2, -1, 0, 0, -1, -1, -2, -3, -3, -4, -4, -4, -4, -3, -3, -3, -2, -2, -2, -1, -1, -2, -1, -1, -1, -1, 0, 0, -1, -2, -3, -4, -4, -4, -4, -4, -4, -4, -4, -3, -2, -3, -3, -2, -2, -2, -2, -3, -3, -4, -5, -5, -4, -4, -4, -4, -3, -2, -2, -2, -3, -4, -5, -5, -6, -7, -7, -6, -5, -5, -4, -2, 0, 1, 0, -2, -4, -4, -4, -4, -3, -4, -5, -6, -6, -7, -7, -6, -6, -5, -5, -4, -4, -4, -4, -3, -3, -3, -2, -2, -3, -4, -5, -5, -5, -4, -3, -2, -3, -2, -2, -3, -3, -4, -4, -4, -4, -3, -3, -3, -3, -3, -3, -4, -5, -7, -7, -7, -6, -5, -4, -3, -3, -3, -3, -3, -3, -3, -3, -4, -4, -5, -5, -5, -5, -5, -5, -5, -5, -6, -6, -5, -5, -4, -3, -3, -3, -2, -1, 0, 1, 1, 1, 0, 0, -1, -2, -3, -3, -3, -2, -2, -2, -3, -3, -4, -4, -5, -6, -5, -4, -3, -3, -2, -2, -2, -1, -2, -2, -2, -3, -3, -3, -4, -5, -5, -5, -4, -4, -4, -5, -5, -6, -5, -5, -5, -5, -5, -5, -6, -6, -6, -6, -6, -6, -5, -5, -5, -5, -5, -4, -3, -2, -1, -1, -2, -3, -4, -4, -3, -3, -2, -2, -2, -2, -2, -3, -3, -4, -3, -3, -3]
-2468c%J%%%%%J%jj%J%%%%jj%j%J%%%jj%%J%J%%%%jJJJ%%%%%jj%%JJjj%JJJ%%j%%JJjjj%%
-2487c%%j%%%JKJJj%jJ%%%jj%%%j%%%%%jjj%%%%%J%%J%JJ%%%%%%%%%j%%%%%%%%J%%%j%jjk
-2507g%%KJJj%%jJJJJ%%%%%j%%j%%%J%%J%j%%%J%J%jj%%%%j%%j%J%%JJ%j%j%jjj%%%%%%%J
-2526e%JJ%%%jjjJ%J%%%%%j%%KJ%%j%jJ%J%j%j%jj%jJ%JJJJ%%J%%j%%J%J%%j%%J%j%%j%J%
-2545a%%%J%%%%%jjjj%J%Jj%%jJJ%J%%KJ%j%%jj%j%J%%%%%%j%%J%j%%%%%Jjj%%%j%J%%j%%
-2564d%j%%%J%%%%%J%%jJ%J%%%j%%%%%%Jj%%%%%%%%%%%J%%JJ%kj%%J%%%%%kj%JJJJjj%%%%
-2583c%%%%j%%%%%J%J%j%%j%%K%%j%j%%%J%Jjj%jj%%%%JJJJ%%%j%jj%j%%%%J%%JJ%j%%%%J
-2602c%%%%J%j%j%J%J%%%%%%%%%kjJ%J%%%J%%%%%%%%%%Jj%%JJj%j%%%J%j%%J%j%%J%J%%Jj
$$ y = [-3, -3, -2, -2, -2, -2, -2, -2, -1, -1, -2, -3, -3, -2, -2, -2, -2, -2, -3, -4, -4, -5, -5, -4, -4, -4, -4, -5, -6, -6, -6, -5, -5, -4, -4, -4, -4, -4, -5, -4, -3, -2, -2, -2, -2, -2, -2, -3, -4, -4, -4, -3, -2, -3, -4, -4, -3, -2, -1, -1, -1, -2, -2, -2, -1, 0, -1, -2, -3, -3, -3, -3, -3, -4, -4, -4, -4, -3, -1, 0, 1, 0, 0, -1, 0, 0, 0, 0, -1, -2, -2, -2, -2, -3, -3, -3, -3, -3, -3, -4, -5, -6, -6, -6, -6, -6, -6, -5, -5, -5, -4, -4, -3, -2, -2, -2, -2, -2, -2, -2, -2, -2, -2, -3, -3, -3, -3, -3, -3, -3, -3, -3, -2, -2, -2, -2, -3, -3, -4, -5, -7, -7, -7, -5, -4, -3, -4, -4, -4, -5, -4, -3, -2, -1, -1, -1, -1, -1, -1, -2, -2, -2, -3, -3, -3, -3, -2, -2, -2, -1, -1, -2, -2, -2, -2, -1, -1, 0, 0, -1, -2, -2, -2, -2, -2, -3, -3, -3, -4, -4, -3, -3, -3, -2, -1, -1, -2, -2, -3, -3, -4, -5, -6, -6, -6, -6, -6, -6, -6, -6, -5, -5, -4, -3, -3, -3, -3, -4, -5, -6, -5, -5, -4, -4, -4, -4, -4, -4, -5, -5, -5, -3, -2, -2, -2, -3, -3, -4, -3, -3, -2, -2, -3, -3, -4, -4, -5, -6, -6, -7, -6, -6, -5, -4, -3, -2, -2, -2, -1, -1, -1, -2, -2, -2, -1, -1, 0, 0, 0, -1, -1, -1, 0, 0, -1, -1, -1, -2, -2, -1, -1, -1, -1, -1, 0, 0, 0, 0, 0, 0, -1, -2, -3, -4, -4, -3, -3, -2, -3, -3, -3, -4, -3, -2, -2, -1, -1, -1, 1, 2, 2, 1, 1, 1, 0, -1, -1, -2, -2, -1, -1, -1, -1, -1, -1, -1, -2, -2, -2, -1, -1, -2, -2, -2, -2, -2, -2, -1, -2, -3, -3, -3, -3, -4, -4, -3, -3, -3, -4, -4, -4, -4, -5, -5, -5, -5, -4, -4, -4, -4, -4, -4, -3, -3, -3, -4, -3, -3, -2, -2, -2, -2, -3, -3, -3, -3, -3, -3, -3, -2, -3, -3, -3, -3, -3, -3, -3, -3, -3, -3, -3, -3, -2, -2, -2, -1, 0, 0, -2, -3, -3, -3, -2, -2, -2, -2, -2, -2, -4, -5, -5, -4, -3, -2, -1, -2, -3, -3, -3, -3, -3, -3, -3, -3, -3, -4, -4, -4, -4, -4, -4, -3, -3, -2, -2, -3, -3, -3, -4, -4, -4, -2, -2, -2, -3, -3, -4, -4, -4, -4, -3, -3, -2, -3, -4, -4, -5, -6, -6, -6, -6, -6, -5, -4, -3, -2, -2, -2, -2, -3, -3, -4, -5, -5, -6, -6, -6, -6, -6, -5, -5, -5, -4, -3, -3, -4, -4, -4, -4, -4, -3, -3, -3, -3, -3, -2, -2, -3, -3, -4, -4, -3, -3, -2, -2, -2, -2, -2, -2, -2, -2, -2, -2, -4, -5, -4, -4, -3, -3, -3, -3, -2, -2, -2, -2, -2, -2, -2, -2, -2, -2, -2, -1, -2, -2, -2, -1, 0, -1, -1, -2, -2, -2, -2, -1, -1, -2, -2, -2, -1, -1, -2, -2, -2, -1, -1, 0, 0, 0, 1, 0]
-2621@%jj%j%%%%%J%%%J%%%j%%%jJJJJ%%jj%j%%%%%%J%%%%%j%%%jj%%J%%JJJ%jkjj%J%%J%
-2640cJ%%%%j%%%j%JJj%%%%jJJJ%%j%j%%%%J%JJ%%%%%j%j%j%%j%j%%%%%JJJJ%%%j%J%%jjj
-2659d%%%%%%J%%%%J%%%j%%J%%%%%%%%%J%%jJ%%j%%%j%%%J%%%%%%J%%%%j%%%jJ%j%%J%JJj
-2678aJ%%%%%%%j%%%%j%%%%j%J%%%JJJ%%kjjjJ%%J%J%%j%%%%jj%JJ%%k%%%%%%%%%%%%%%%%
-2697d%J%%%%%%%%J%%%j%%%J%%JJ%Jj%%%j%%j%%%%J%%Jj%%%jj%Jj%%J%%%Jj%%%%%%J%%%%j
-2716bj%J%JK%%jk%%%J%%J%%J%jjJJ%jj%J%%J%j%%%%%%%JJ%j%j%%%j%%jj%%%j%JJJ%%Jj%j
-2735bj%J%%%KJ%%%j%jk%J%%j%j%JJJ%j%%%%%%%%%%%j%%%%jJJJ%%%%%%%%%%%%%%j%%%%%%J
-2754a%J%%%j%jjj%jJjJ%%%%JJ%J%%j%%%%%%%j%%J%%%%%
$$ y = [0, 0, -1, -2, -2, -3, -3, -3, -3, -3, -3, -2, -2, -2, -2, -1, -1, -1, -1, -2, -2, -2, -2, -3, -2, -1, 0, 1, 1, 1, 0, -1, -1, -2, -2, -2, -2, -2, -2, -2, -1, -1, -1, -1, -1, -1, -2, -2, -2, -2, -3, -4, -4, -4, -3, -3, -3, -2, -1, 0, 0, -1, -3, -4, -5, -5, -4, -4, -4, -3, -3, -2, -2, -2, -2, -2, -3, -3, -3, -3, -4, -4, -3, -2, -3, -3, -3, -3, -3, -4, -3, -2, -1, -1, -1, -2, -2, -3, -3, -3, -3, -3, -2, -2, -1, 0, 0, 0, 0, 0, 0, -1, -1, -2, -2, -3, -3, -3, -4, -4, -5, -5, -5, -5, -5, -5, -4, -3, -2, -1, -1, -1, -1, -2, -2, -1, -1, -1, -2, -3, -4, -4, -4, -4, -4, -4, -4, -3, -3, -3, -3, -3, -2, -2, -2, -2, -3, -3, -3, -2, -2, -2, -2, -2, -2, -2, -2, -2, -2, -1, -1, -1, -2, -1, -1, -1, -2, -2, -2, -2, -3, -3, -3, -3, -2, -2, -2, -2, -2, -2, -2, -1, -1, -1, -1, -1, -2, -2, -2, -2, -3, -2, -2, -3, -3, -3, -2, -2, -1, 0, -1, 0, 0, 0, 0, 0, 0, 0, 0, -1, -1, -1, -1, -1, -2, -2, -2, -2, -2, -3, -3, -2, -2, -2, -2, -1, 0, 1, 1, 1, -1, -2, -3, -4, -3, -3, -3, -2, -2, -1, -1, -1, -2, -2, -2, -2, -2, -3, -4, -4, -3, -2, -2, -2, -4, -4, -4, -4, -4, -4, -4, -4, -4, -4, -4, -4, -4, -4, -4, -4, -4, -4, -3, -3, -3, -3, -3, -3, -3, -3, -3, -2, -2, -2, -2, -3, -3, -3, -3, -2, -2, -2, -1, 0, 0, 1, 0, 0, 0, 0, -1, -1, -1, -2, -2, -2, -2, -2, -1, -1, -1, 0, -1, -1, -1, -1, -2, -3, -3, -2, -3, -3, -3, -2, -2, -2, -2, -1, -2, -2, -2, -2, -2, -2, -2, -1, -1, -1, -1, -1, -2, -3, -3, -2, -2, -1, 1, 1, 1, 0, -2, -2, -2, -2, -1, -1, -1, 0, 0, 0, 1, 1, 0, -1, 0, 1, 1, 0, -1, -1, 0, 0, 0, 1, 1, 0, 0, 0, 0, 0, 0, 0, 0, 1, 2, 2, 1, 1, 0, 0, 0, 0, -1, -1, -1, -2, -3, -3, -3, -3, -4, -4, -3, -2, -1, -1, -1, 0, -1, -1, -2, -3, -3, -2, -2, -2, -2, 0, 1, 1, 1, 1, 0, 0, -1, -3, -3, -2, -2, -2, -3, -3, -4, -4, -3, -2, -1, -1, -2, -2, -2, -2, -2, -2, -2, -2, -2, -2, -2, -2, -3, -3, -3, -3, -3, -4, -3, -2, -1, -1, -1, -1, -1, -1, -1, -1, -1, -1, -1, -1, -1, -1, -1, -2, -2, -2, -2, -2, -2, -2, -1, -1, 0, 0, 0, 0, -1, -1, -2, -3, -4, -4, -5, -4, -5, -4, -4, -4, -4, -4, -3, -2, -2, -1, -1, -1, -2, -2, -2, -2, -2, -2, -2, -2, -3, -3, -3, -2, -2, -2, -2, -2, -2]
-2766b
##END=		$$ NMR SPECTRUM
##END=		$$ LINK
