##TITLE=	RP107.10.fid
##JCAMP-DX=	6.0	$$ MestReNova 14.3.3-33362
##DATA TYPE=	LINK
##BLOCKS=	1    
##ORIGIN=	Mestrelab Research S.L.
##OWNER=	hrzepa
##$MNOVA/METADATA=	(DOCUMENT,BASE64)
eyJuYW1lIjoiL1VzZXJzL2hyemVwYS9MaWJyYXJ5L01vYmlsZSBEb2N1bWVudHMvY29tfmFwcGxlfkN
sb3VkRG9jcy9TaGVwcGFyZC9OTVIgZmlsZXMgemlwcy0yL0IoT0NIMihDRjIpM0NGMkgpMy9CKE9DSD
IoQ0YyKTNDRjJIKTMtSC5tbm92YSIsInBhZ2VzIjpbeyJpdGVtcyI6WyIxIiAgICAgXX1dfQ==
##TITLE=	RP107.10.fid
##JCAMP-DX=	6.0	$$ MestReNova 14.3.3-33362
##DATA TYPE=	NMR SPECTRUM
##DATA CLASS=	XYDATA
##BLOCK_ID=	1
##ORIGIN=	Bruker BioSpin GmbH
##OWNER=	aea
##NUMDIM=	1
##$MNOVA/METADATA=	(ITEM,BASE64)
eyJhbmdsZSI6MCwiYXhlcyI6eyJ4Ijp7Im1heCI6MTYuNDI3NDQ5OTk5OTgwNDE4LCJtaW4iOi00LjE
yNjMwNzg2NDM0NDEzNX0sInkiOnsibWF4IjoxMzgwNC44OTc5NDkyMTg3NSwibWluIjotMTI1Ny4xND
kwNDQwMzY4NjUyfX0sInBvaW50cyI6W3sieCI6NTMyMSwieSI6NTgzNX0seyJ4Ijo4NzIyLCJ5Ijo1O
DM1fSx7IngiOjg3MjIsInkiOjgyMDh9LHsieCI6NTMyMSwieSI6ODIwOH0seyJ4Ijo1MzIxLCJ5Ijo1
ODM1fV0sInoiOjB9
##.OBSERVE FREQUENCY=	400.10247078128099929
##.OBSERVE NUCLEUS=	^1H
##.SOLVENT NAME=	CDCl3
##.PULSE SEQUENCE=	zg30
##LONGDATE=	2021/07/29 14:39:00.000
##.ACQUISITIONMODE=	SIMULTANEOUS (DQD)
##$ORIGINAL FORMAT=	Bruker XWIN-NMR
##$MNOVA/SCALES_VERSION=	9
##$PARAMETER FILE=	(acqus, ASCII, /private/var/folders/f6/rjf_tdyn2v98c5c0wvkgn4s80000gq/T/XtuPwAkKSaylGSEauRJeSg/10/acqus, 0)
$$ ##TITLE= Parameter file, TOPSPIN		Version 3.2
$$ ##JCAMPDX= 5.0
$$ ##DATATYPE= Parameter Values
$$ ##NPOINTS= 1	$$ modification sequence number
$$ ##ORIGIN= Bruker BioSpin GmbH
$$ ##OWNER= aea
$$ $$ 2021-07-29 14:39:30.137 +0100  aea@chemb147
$$ $$ z:/400/data/tds/nmr/RP107/10/acqus
$$ $$ process C:\Bruker\TopSpin\prog\mod\dirdata.exe
$$ ##$ACQT0= -2.82563021203049
$$ ##$AMP= (0..31)
$$ 100 100 100 100 100 100 100 100 100 100 100 100 100 100 100 100 100 100
$$ 100 100 100 100 100 100 100 100 100 100 100 100 100 100
$$ ##$AMPCOIL= (0..19)
$$ 0 0 0 0 0 0 0 0 0 0 0 0 0 0 0 0 0 0 0 0
$$ ##$ANAVPT= -1
$$ ##$AQSEQ= 0
$$ ##$AQ_mod= 3
$$ ##$AUNM= <au_zg>
$$ ##$AUTOPOS= <5 >
$$ ##$BF1= 400.1
$$ ##$BF2= 400.1
$$ ##$BF3= 400.1
$$ ##$BF4= 400.1
$$ ##$BF5= 400.1
$$ ##$BF6= 400.1
$$ ##$BF7= 400.1
$$ ##$BF8= 400.1
$$ ##$BYTORDA= 0
$$ ##$CAGPARS= (0..11)
$$ 0 0 0 0 0 0 0 0 0 0 0 0
$$ ##$CFDGTYP= 0
$$ ##$CFRGTYP= 9
$$ ##$CHEMSTR= <none>
$$ ##$CNST= (0..63)
$$ 1 1 145 1 1 1 1 1 1 1 1 1 1 1 1 1 1 1 1 1 1 1 1 1 1 1 1 1 1 1 1 1 1 1 1
$$ 1 1 1 1 1 1 1 1 1 1 1 1 1 1 1 1 1 1 1 1 1 1 1 1 1 1 1 1 1
$$ ##$CPDPRG= (0..8)
$$ <> <> <> <> <mlev> <mlev> <mlev> <mlev> <mlev>
$$ ##$D= (0..63)
$$ 0 1 0 0 0 0 0 0 0 0.06 0 0 0 0 0 0 0.0002 0 0 0 0 0 0 0 0 0 0 0 0 0 0 0
$$ 0 0 0 0 0 0 0 0 0 0 0 0 0 0 0 0 0 0 0 0 0 0 0 0 0 0 0 0 0 0 0 0
$$ ##$DATE= 1627565966
$$ ##$DE= 17.34944
$$ ##$DECBNUC= <off>
$$ ##$DECIM= 2432
$$ ##$DECNUC= <off>
$$ ##$DECSTAT= 4
$$ ##$DIGMOD= 3
$$ ##$DIGTYP= 12
$$ ##$DQDMODE= 0
$$ ##$DR= 22
$$ ##$DS= 0
$$ ##$DSPFIRM= 4
$$ ##$DSPFVS= 21
$$ ##$DTYPA= 0
$$ ##$EXP= <PROTON.ucl>
$$ ##$F1LIST= <111111111111111>
$$ [...]
$$ ##$Sgu3PowerLevels= (0..7)
$$ 0 0 0 0 0 0 0 0
$$ ##$Sgu4PowerLevels= (0..7)
$$ 0 0 0 0 0 0 0 0
$$ ##$Sgu5PowerLevels= (0..7)
$$ 0 0 0 0 0 0 0 0
$$ ##$Sgu6PowerLevels= (0..7)
$$ 0 0 0 0 0 0 0 0
$$ ##$Sgu7PowerLevels= (0..7)
$$ 0 0 0 0 0 0 0 0
$$ ##$Sgu8PowerLevels= (0..7)
$$ 0 0 0 0 0 0 0 0
$$ ##$SguType= 2
$$ ##$ShimPowMaxUA= (0..63)
$$ 130000 130000 130000 130000 130000 130000 130000 130000 130000 130000 130000
$$ 130000 130000 130000 130000 130000 130000 130000 130000 130000 0 0 0 0
$$ 0 0 0 0 0 0 0 0 0 0 0 0 0 0 0 0 0 0 0 0 0 0 0 0 0 0 0 0 0 0 0 0 0 0 0 0
$$ 0 0 0 0
$$ ##$ShimPowMaxUC= (0..63)
$$ 130000 130000 130000 130000 130000 130000 130000 130000 130000 130000 130000
$$ 130000 130000 130000 130000 130000 130000 130000 130000 130000 0 0 0 0
$$ 0 0 0 0 0 0 0 0 0 0 0 0 0 0 0 0 0 0 0 0 0 0 0 0 0 0 0 0 0 0 0 0 0 0 0 0
$$ 0 0 0 0
$$ ##$ShimPowMaxUG= (0..63)
$$ 524287 524287 524287 524287 524287 524287 524287 524287 524287 524287 524287
$$ 524287 524287 524287 524287 524287 524287 524287 524287 524287 0 0 0 0
$$ 0 0 0 0 0 0 0 0 0 0 0 0 0 0 0 0 0 0 0 0 0 0 0 0 0 0 0 0 0 0 0 0 0 0 0 0
$$ 0 0 0 0
$$ ##$ShimPowRcbType= 3
$$ ##$ShimPowRes= (0..63)
$$ 1e-020 1e-020 1e-020 1e-020 1e-020 1e-020 1e-020 1e-020 1e-020 1e-020 1e-020
$$ 1e-020 1e-020 1e-020 1e-020 1e-020 1e-020 1e-020 1e-020 1e-020 0 0 0 0
$$ 0 0 0 0 0 0 0 0 0 0 0 0 0 0 0 0 0 0 0 0 0 0 0 0 0 0 0 0 0 0 0 0 0 0 0 0
$$ 0 0 0 0
$$ ##$ShimPowRng0= (0..63)
$$ 1 1 1 1 1 1 1 1 1 1 1 1 1 1 1 1 1 1 1 1 0 0 0 0 0 0 0 0 0 0 0 0 0 0 0 0
$$ 0 0 0 0 0 0 0 0 0 0 0 0 0 0 0 0 0 0 0 0 0 0 0 0 0 0 0 0
$$ ##$ShimPowRng1= (0..63)
$$ 1 1 1 1 1 1 1 1 1 1 1 1 1 1 1 1 1 1 1 1 0 0 0 0 0 0 0 0 0 0 0 0 0 0 0 0
$$ 0 0 0 0 0 0 0 0 0 0 0 0 0 0 0 0 0 0 0 0 0 0 0 0 0 0 0 0
$$ ##$ShimPowRng2= (0..63)
$$ 1 1 1 1 1 1 1 1 1 1 1 1 1 1 1 1 1 1 1 1 0 0 0 0 0 0 0 0 0 0 0 0 0 0 0 0
$$ 0 0 0 0 0 0 0 0 0 0 0 0 0 0 0 0 0 0 0 0 0 0 0 0 0 0 0 0
$$ ##$ShimPowRng3= (0..63)
$$ 1 1 1 1 1 1 1 1 1 1 1 1 1 1 1 1 1 1 1 1 0 0 0 0 0 0 0 0 0 0 0 0 0 0 0 0
$$ 0 0 0 0 0 0 0 0 0 0 0 0 0 0 0 0 0 0 0 0 0 0 0 0 0 0 0 0
$$ ##$ShimSysFunc= (0..63)
$$ 1 2 3 4 5 7 9 11 15 16 8 10 12 14 6 17 13 18 19 20 0 0 0 0 0 0 0 0 0 0
$$ 0 0 0 0 0 0 0 0 0 0 0 0 0 0 0 0 0 0 0 0 0 0 0 0 0 0 0 0 0 0 0 0 0 0
$$ ##$ShimSysMatrix= 0
$$ ##$ShimSysType= 1
$$ ##$TFXNUM= 0
$$ ##$TRIPLO2= 0
$$ ##$VTU= 1
$$ ##$VTUETH= <no>
$$ ##$VTUTY= <tty05>
$$ ##$WBREFAM= (0..15)
$$ 268.6 116.5 100 100 100 100 100 100 100 100 100 100 100 100 100 100
$$ ##$WBREFLM= (0..15)
$$ 0 0 0 0 0 0 0 0 0 0 0 0 0 0 0 0
$$ ##$WBREFPH= (0..15)
$$ 86.23 -73.34 0 0 0 0 0 0 0 0 0 0 0 0 0 0
$$ ##$WBSGU= (0..15)
$$ 0 0 0 0 0 0 0 0 0 0 0 0 0 0 0 0
$$ ##$XFAC= 2
$$ ##END=
$$ 
##$DECIM=	2432
##$DSPFVS=	21
##XUNITS=	HZ
##YUNITS=	ARBITRARY UNITS
##FIRSTX=	6572.622909274500671
##LASTX=	-1650.9358177891349442
##DELTAX=	-0.12548346268503296486
##XFACTOR=	1
##YFACTOR=	0.38300335989715261764
##FIRSTY=	0.88819193840026855469
##MINY=	-2.1538324356079101563
##MAXY=	12549.87109375
##NPOINTS=	65536
##XYDATA=	(X++(Y..Y))
$$ [...]
4131b%j%jJ%JJ%Jj%%j%j%%%J%%j%%%J%%jjJJ%%%%%%jJ%%%%%%%%%%%%%%%%%%%Jj%%j%J%%J%
4123a%%j%j%%J%%%%%%j%J%%%%%jJ%%%%%%%%%JJj%j%j%J%%%%J%jJ%j%j%jjJJ%Jj%J%J%%Jj%
4114aj%%%%%%%%Jj%jjJ%%Jj%%J%%j%%%%%%%%j%%%%J%J%J%%%%j%%%%%Jj%%%J%J%%%jj%%%jJ
4105b%%%j%J%%%%%J%%%%%j%j%%%%%%%%%J%%%%%%%%%%%%%JKjjkj%%JJj%%J%%%%%%%%%j%%%%
4096cJj%%%%Jj%%J%K%%jJ%%%j%j%%%jJJ%j%%J%%%jjJ%J%%%%%j%j%%JJ%%%%%j%%%%J%%J%%j
4087aj%%J%%%j%jJ%J%j%j%%J%%%J%%%j%%%%J%j%%%%%%jJJjj%J%J%%j%j%%%%%%J%%%%jJ%%%
4078b%j%%%%%J%%%Jjjj%JJJj%%j%J%%%jj%%%J%%%%%%%JJ%J%j%jj%Jjj%jJJKj%%%%%%%j%%J
4069bJj%J%%%%%j%%%j%%%%%%jJJJJ%k%%%j%%%JJ%j%%%J%j%j%%%%jJ%%J%%%%%%%%%jJJ%%%j
$$ plain form
4131 -2 -2 -3 -3 -4 -3 -3 -2 -1 -1 0 -1 -1 -1 -2 -2 -3 -3 -3 -3 -2 -2 -2 -3 -3 -3 -3 -2 -2 -2 -3 -4 -3 -2 -2 -2 -2 -2 -2 -2 -3 -2 -2 -2 -2 -2 -2 -2 -2 -2 -2 -2 -2 -2 -2 -2 -2 -2 -2 -2 -2 -1 -2 -2 -2 -3 -3 -2 -2 -2 -1 -1
4123 -1 -1 -1 -2 -2 -3 -3 -3 -2 -2 -2 -2 -2 -2 -2 -3 -3 -2 -2 -2 -2 -2 -2 -3 -2 -2 -2 -2 -2 -2 -2 -2 -2 -2 -1 0 -1 -1 -2 -2 -3 -3 -2 -2 -2 -2 -2 -1 -1 -2 -1 -1 -2 -2 -3 -3 -4 -5 -4 -3 -3 -2 -3 -3 -2 -2 -1 -1 -1 0 -1 -1
4114 -1 -2 -2 -2 -2 -2 -2 -2 -2 -2 -1 -2 -2 -3 -4 -3 -3 -3 -2 -3 -3 -3 -2 -2 -2 -3 -3 -3 -3 -3 -3 -3 -3 -3 -4 -4 -4 -4 -4 -3 -3 -2 -2 -1 -1 -1 -1 -1 -2 -2 -2 -2 -2 -2 -1 -2 -2 -2 -2 -1 -1 0 0 0 0 -1 -2 -2 -2 -2 -3 -2
4105 -2 -2 -2 -2 -3 -3 -2 -2 -2 -2 -2 -2 -1 -1 -1 -1 -1 -1 -2 -2 -3 -3 -3 -3 -3 -3 -3 -3 -3 -3 -2 -2 -2 -2 -2 -2 -2 -2 -2 -2 -2 -2 -2 -2 -1 1 0 -1 -3 -4 -4 -4 -3 -2 -3 -3 -3 -2 -2 -2 -2 -2 -2 -2 -2 -2 -2 -3 -3 -3 -3 -3
4096 -3 -2 -3 -3 -3 -3 -3 -2 -3 -3 -3 -2 -2 0 0 0 -1 0 0 0 0 -1 -1 -2 -2 -2 -2 -3 -2 -1 -1 -2 -2 -2 -1 -1 -1 -1 -2 -3 -2 -2 -1 -1 -1 -1 -1 -1 -2 -2 -3 -3 -3 -2 -1 -1 -1 -1 -1 -1 -2 -2 -2 -2 -2 -1 -1 -1 0 0 0 -1
4087 -1 -2 -2 -2 -1 -1 -1 -1 -2 -2 -3 -2 -2 -1 -1 -2 -2 -3 -3 -3 -2 -2 -2 -2 -1 -1 -1 -1 -2 -2 -2 -2 -2 -1 -1 -2 -2 -2 -2 -2 -2 -2 -3 -2 -1 -2 -3 -3 -2 -2 -1 -1 -1 -2 -2 -3 -3 -3 -3 -3 -3 -3 -2 -2 -2 -2 -2 -3 -2 -2 -2 -2
4078 -2 -2 -3 -3 -3 -3 -3 -3 -2 -2 -2 -2 -1 -2 -3 -4 -4 -3 -2 -1 -2 -2 -2 -3 -3 -2 -2 -2 -2 -3 -4 -4 -4 -4 -3 -3 -3 -3 -3 -3 -3 -3 -2 -1 -1 0 0 -1 -1 -2 -3 -3 -2 -3 -4 -4 -5 -4 -3 -1 -2 -2 -2 -2 -2 -2 -2 -2 -3 -3 -3 -2
4069 -2 -1 -2 -2 -1 -1 -1 -1 -1 -1 -2 -2 -2 -2 -3 -3 -3 -3 -3 -3 -3 -4 -3 -2 -1 0 0 -2 -2 -2 -2 -3 -3 -3 -3 -2 -1 -1 -2 -2 -2 -2 -1 -1 -2 -2 -3 -3 -3 -3 -3 -4 -3 -3 -3 -2 -2 -2 -2 -2 -2 -2 -2 -2 -2 -3 -2 -1 -1 -1 -1 -2
4060b%%%%%Jj%j%%%J%%%%j%%%%J%%%%%%j%jJ%J%%%%%J%%j%%J%%%%%%jj%%%%%%%%%%%J%J%%
4051a%%%%%%%j%%jJJj%%j%%%%J%%%%J%k%J%%%%%J%J%j%j%%J%%j%jJ%%%%JJjjJ%%jj%%JJ%%
4042a%%%%%%%j%%%%%Jj%%%%%j%%%%jJ%%Jj%%J%%%%%%%J%%%J%j%%j%jj%%%J%J%jJ%%j%%%%%
4033c%J%%J%j%j%%%j%%%J%J%Jj%%%%%j%%%%%%%%%J%%j%%J%J%%%%%%%%%%%j%%Jjj%JJj%jJ%
4025b%%%%%JjjJ%%J%j%%%%%%%%%jJ%J%%%jjJ%%J%Jj%%%%j%%%%%%%J%j%%%j%%%J%J%%%%j%j
4016c%%J%%J%%Jj%%%%%jj%%%J%%%J%%%jJ%%%%%%%%J%%%%kj%J%%%%%Jj%%%%jJ%JjjjJ%%%%%
4007cJ%%%%%j%%J%%%%%jJJ%%%j%Jjj%jJ%%J%%%%%Jj%%Jj%j%%%J%%%%%%j%%%%%j%J%J%J%%%
3998a%j%jJ%j%%K%%j%%%J%%%%j%%jJ%%J%j%%J%%%%%Jjj%J%%jJ%%j%%%jJJj%%%%%%Jj%jJ%%
$$ plain form
4060 -2 -2 -2 -2 -2 -2 -1 -2 -2 -3 -3 -3 -3 -2 -2 -2 -2 -2 -3 -3 -3 -3 -3 -2 -2 -2 -2 -2 -2 -2 -3 -3 -4 -3 -3 -2 -2 -2 -2 -2 -2 -1 -1 -1 -2 -2 -2 -1 -1 -1 -1 -1 -1 -1 -2 -3 -3 -3 -3 -3 -3 -3 -3 -3 -3 -3 -3 -2 -2 -1 -1 -1
4051 -1 -1 -1 -1 -1 -1 -1 -1 -2 -2 -2 -3 -2 -1 -2 -2 -2 -3 -3 -3 -3 -3 -2 -2 -2 -2 -2 -1 -1 -3 -3 -2 -2 -2 -2 -2 -2 -1 -1 0 0 -1 -1 -2 -2 -2 -1 -1 -1 -2 -2 -3 -2 -2 -2 -2 -2 -1 0 -1 -2 -1 -1 -1 -2 -3 -3 -3 -2 -1 -1 -1
4042 -1 -1 -1 -1 -1 -1 -1 -1 -2 -2 -2 -2 -2 -2 -1 -2 -2 -2 -2 -2 -2 -3 -3 -3 -3 -3 -4 -3 -3 -3 -2 -3 -3 -3 -2 -2 -2 -2 -2 -2 -2 -2 -1 -1 -1 -1 0 0 -1 -1 -1 -2 -2 -3 -4 -4 -4 -4 -3 -3 -2 -2 -3 -2 -2 -2 -3 -3 -3 -3 -3 -3
4033 -3 -3 -2 -2 -2 -1 -1 -2 -2 -3 -3 -3 -3 -4 -4 -4 -4 -3 -3 -2 -2 -1 -2 -2 -2 -2 -2 -2 -3 -3 -3 -3 -3 -3 -3 -3 -3 -3 -2 -2 -2 -3 -3 -3 -2 -2 -1 -1 -1 -1 -1 -1 -1 -1 -1 -1 -1 -1 -2 -2 -2 -1 -2 -3 -3 -2 -1 -2 -2 -3 -2 -2
4025 -2 -2 -2 -2 -2 -2 -1 -2 -3 -2 -2 -2 -1 -1 -2 -2 -2 -2 -2 -2 -2 -2 -2 -2 -3 -2 -2 -1 -1 -1 -1 -2 -3 -2 -2 -2 -1 -1 0 -1 -1 -1 -1 -1 -2 -2 -2 -2 -2 -2 -2 -2 -1 -1 -2 -2 -2 -2 -3 -3 -3 -3 -2 -2 -1 -1 -1 -1 -1 -2 -2 -3
4016 -3 -3 -3 -2 -2 -2 -1 -1 -1 0 -1 -1 -1 -1 -1 -1 -2 -3 -3 -3 -3 -2 -2 -2 -2 -1 -1 -1 -1 -2 -1 -1 -1 -1 -1 -1 -1 -1 -1 0 0 0 0 0 -2 -3 -3 -2 -2 -2 -2 -2 -2 -1 -2 -2 -2 -2 -2 -3 -2 -2 -1 -2 -3 -4 -3 -3 -3 -3 -3 -3
4007 -3 -2 -2 -2 -2 -2 -2 -3 -3 -3 -2 -2 -2 -2 -2 -2 -3 -2 -1 -1 -1 -1 -2 -2 -1 -2 -3 -3 -4 -3 -3 -3 -2 -2 -2 -2 -2 -2 -1 -2 -2 -2 -1 -2 -2 -3 -3 -3 -3 -2 -2 -2 -2 -2 -2 -2 -3 -3 -3 -3 -3 -3 -4 -4 -3 -3 -2 -2 -1 -1 -1 -1
3998 -1 -1 -2 -2 -3 -2 -2 -3 -3 -3 -1 -1 -1 -2 -2 -2 -2 -1 -1 -1 -1 -1 -2 -2 -2 -3 -2 -2 -2 -1 -1 -2 -2 -2 -1 -1 -1 -1 -1 -1 0 -1 -2 -2 -1 -1 -1 -2 -1 -1 -1 -2 -2 -2 -2 -3 -2 -1 -2 -2 -2 -2 -2 -2 -2 -1 -2 -2 -3 -2 -2 -2
3989b%%%J%%%%jj%J%j%%J%%J%%jJ%%j%J%%%j%J%j%%JJjj%j%J%%J%%%%%Jj%%jjjJj%J%JJ%%
3980aj%%j%%J%%%%%%%%jJJ%%%j%%%J%%j%%%Jj%%%%%Jj%%%%J%%%%j%J%%J%%%j%jj%%JJ%j%J
3971aj%%Jj%%%%J%%%Jj%%%j%%%j%J%jJ%%%J%%Jj%%%%%j%jJJ%%jj%%J%%J%jjJ%%%%Jj%J%%%
3962a%j%J%%%Jj%%JjjjjJ%%%%J%%%%j%%J%Jj%%J%%%%jJ%jjJ%J%%jJ%%%%jJ%j%%%%%%j%Jj%
3953cj%J%J%%j%%%%J%%%%%j%%jJ%J%%%%%%%%jJ%%%%%%%%J%%J%%j%%%%%j%%%%%%%%%%%%%%%
3944b%%%%Jj%j%%%%J%%J%j%%J%%j%%%%%%%%%%%%%%Jj%%%%%J%%%%%j%%%j%%J%Jj%%%%JJ%j%
3935a%jjj%%JJ%%%%%%%%%%%%%%J%%%j%jJJJ%%%jj%%%%%%%%Jj%j%%%%%%%J%J%jjJ%%%Jj%%J
3927aj%j%%JJ%%%%j%%%%%%%%%%%%%%%%%%%%%j%%JJ%%%%%J%jj%j%JJ%%%%%%j%%%%%%%%J%%%
$$ plain form
3989 -2 -2 -2 -2 -1 -1 -1 -1 -1 -2 -3 -3 -2 -2 -3 -3 -3 -2 -2 -2 -1 -1 -1 -2 -1 -1 -1 -2 -2 -1 -1 -1 -1 -2 -2 -1 -1 -2 -2 -2 -1 0 -1 -2 -2 -3 -3 -2 -2 -2 -1 -1 -1 -1 -1 -1 0 -1 -1 -1 -2 -3 -4 -3 -4 -4 -3 -3 -2 -1 -1 -1
3980 -1 -2 -2 -2 -3 -3 -3 -2 -2 -2 -2 -2 -2 -2 -2 -2 -3 -2 -1 -1 -1 -1 -2 -2 -2 -2 -1 -1 -1 -2 -2 -2 -2 -1 -2 -2 -2 -2 -2 -2 -1 -2 -2 -2 -2 -2 -1 -1 -1 -1 -1 -2 -2 -1 -1 -1 0 0 0 0 -1 -1 -2 -3 -3 -3 -2 -1 -1 -2 -2 -1
3971 -1 -2 -2 -2 -1 -2 -2 -2 -2 -2 -1 -1 -1 -1 0 -1 -1 -1 -1 -2 -2 -2 -2 -3 -3 -2 -2 -3 -2 -2 -2 -2 -1 -1 -1 0 -1 -1 -1 -1 -1 -1 -2 -2 -3 -2 -1 -1 -1 -2 -3 -3 -3 -2 -2 -2 -1 -1 -2 -3 -2 -2 -2 -2 -2 -1 -2 -2 -1 -1 -1 -1
3962 -1 -1 -2 -2 -1 -1 -1 -1 0 -1 -1 -1 0 -1 -2 -3 -4 -3 -3 -3 -3 -3 -2 -2 -2 -2 -2 -3 -3 -3 -2 -2 -1 -2 -2 -2 -1 -1 -1 -1 -1 -2 -1 -1 -2 -3 -2 -2 -1 -1 -1 -2 -1 -1 -1 -1 -1 -2 -1 -1 -2 -2 -2 -2 -2 -2 -2 -3 -3 -2 -3 -3
3953 -3 -4 -4 -3 -3 -2 -2 -2 -3 -3 -3 -3 -3 -2 -2 -2 -2 -2 -2 -3 -3 -3 -4 -3 -3 -2 -2 -2 -2 -2 -2 -2 -2 -2 -3 -2 -2 -2 -2 -2 -2 -2 -2 -2 -1 -1 -1 0 0 0 -1 -1 -1 -1 -1 -1 -2 -2 -2 -2 -2 -2 -2 -2 -2 -2 -2 -2 -2 -2 -2 -2
3944 -2 -2 -2 -2 -2 -1 -2 -2 -3 -3 -3 -3 -3 -2 -2 -2 -1 -1 -2 -2 -2 -1 -1 -1 -2 -2 -2 -2 -2 -2 -2 -2 -2 -2 -2 -2 -2 -2 -2 -1 -2 -2 -2 -2 -2 -2 -1 -1 -1 -1 -1 -1 -2 -2 -2 -2 -3 -3 -3 -2 -2 -1 -2 -2 -2 -2 -2 -1 0 0 -1 -1
3935 -1 -1 -2 -3 -4 -4 -4 -3 -2 -2 -2 -2 -2 -2 -2 -2 -2 -2 -2 -2 -2 -2 -2 -1 -1 -1 -1 -2 -2 -3 -2 -1 0 0 0 0 -1 -2 -2 -2 -2 -2 -2 -2 -2 -2 -1 -2 -2 -3 -3 -3 -3 -3 -3 -3 -3 -2 -2 -1 -1 -2 -3 -2 -2 -2 -2 -1 -2 -2 -2 -1
3927 -1 -2 -2 -3 -3 -3 -2 -1 -1 -1 -1 -1 -2 -2 -2 -2 -2 -2 -2 -2 -2 -2 -2 -2 -2 -2 -2 -2 -2 -2 -2 -2 -2 -2 -3 -3 -3 -2 -1 -1 -1 -1 -1 -1 0 0 -1 -2 -2 -3 -3 -2 -1 -1 -1 -1 -1 -1 -1 -2 -2 -2 -2 -2 -2 -2 -2 -2 -1 -1 -1 -1
3918a%%%j%%%J%%%%%jjJ%%%J%%%%%j%%%%%%j%J%%%%%%%%%%%%%%j%%%%%J%%Jj%J%jJ%j%%%%
3909b%%%j%%%%%%%%%%Jj%%J%J%j%%%jJ%%%%%%%%%%j%J%J%j%jJ%%%%J%%%%%%jj%JjjJ%JJj%
3900b%%%%%%%%%%j%%%J%%%%%%%%%%%%%%%%%%%j%%%JJj%%%%j%J%%%%%%%%%%%J%jJ%J%%j%%%
3891aj%%%%%j%%%%J%%J%j%%%J%Jjj%jJ%%%%%%%%%%%jJ%J%Jjj%%%%%Jj%%%%Jj%%%j%%%%%JJ
3882a%j%J%%%%%%%j%%%%%%j%%%J%%%%%%%%j%J%j%%%%%%J%%%%%%j%%%%%JJ%%%%%%%%J%%j%%
3873aj%j%%%%%J%%%%%%%J%%%%j%%%%%%J%%%%%%j%%%%%%JJ%%%%j%j%%%%J%%%%%%%%%%%jJJj
3864a%%%%jj%J%%%%%%%Jj%%Jj%%%J%%%jj%%%%%J%jjJJ%%j%%%%J%J%%j%%j%j%%J%%J%%J%J%
3855@%%jj%%%J%%%%j%%J%j%%%%%%%%JJj%j%j%J%%%Jj%j%%%J%%%%%%%%J%J%%%j%j%%J%%J%j
$$ plain form
3918 -1 -1 -1 -1 -2 -2 -2 -2 -1 -1 -1 -1 -1 -1 -2 -3 -2 -2 -2 -2 -1 -1 -1 -1 -1 -1 -2 -2 -2 -2 -2 -2 -2 -3 -3 -2 -2 -2 -2 -2 -2 -2 -2 -2 -2 -2 -2 -2 -2 -2 -3 -3 -3 -3 -3 -3 -2 -2 -2 -1 -2 -2 -1 -1 -2 -1 -1 -2 -2 -2 -2 -2
3909 -2 -2 -2 -2 -3 -3 -3 -3 -3 -3 -3 -3 -3 -3 -3 -2 -3 -3 -3 -2 -2 -1 -1 -2 -2 -2 -2 -3 -2 -2 -2 -2 -2 -2 -2 -2 -2 -2 -2 -3 -3 -2 -2 -1 -1 -2 -2 -3 -2 -2 -2 -2 -2 -1 -1 -1 -1 -1 -1 -1 -2 -3 -3 -2 -3 -4 -3 -3 -2 -1 -2 -2
3900 -2 -2 -2 -2 -2 -2 -2 -2 -2 -2 -2 -3 -3 -3 -3 -2 -2 -2 -2 -2 -2 -2 -2 -2 -2 -2 -2 -2 -2 -2 -2 -2 -2 -2 -2 -3 -3 -3 -3 -2 -1 -2 -2 -2 -2 -2 -3 -3 -2 -2 -2 -2 -2 -2 -2 -2 -2 -2 -2 -2 -1 -1 -2 -1 -1 0 0 0 -1 -1 -1 -1
3891 -1 -2 -2 -2 -2 -2 -2 -3 -3 -3 -3 -3 -2 -2 -2 -1 -1 -2 -2 -2 -2 -1 -1 0 -1 -2 -2 -3 -2 -2 -2 -2 -2 -2 -2 -2 -2 -2 -2 -2 -3 -2 -2 -1 -1 0 -1 -2 -2 -2 -2 -2 -2 -1 -2 -2 -2 -2 -2 -1 -2 -2 -2 -2 -3 -3 -3 -3 -3 -3 -2 -1
3882 -1 -1 -2 -2 -1 -1 -1 -1 -1 -1 -1 -1 -2 -2 -2 -2 -2 -2 -2 -3 -3 -3 -3 -2 -2 -2 -2 -2 -2 -2 -2 -2 -3 -3 -2 -2 -3 -3 -3 -3 -3 -3 -3 -2 -2 -2 -2 -2 -2 -2 -3 -3 -3 -3 -3 -3 -2 -1 -1 -1 -1 -1 -1 -1 -1 -1 0 0 0 -1 -1 -1
3873 -1 -2 -2 -3 -3 -3 -3 -3 -3 -2 -2 -2 -2 -2 -2 -2 -2 -1 -1 -1 -1 -1 -2 -2 -2 -2 -2 -2 -2 -1 -1 -1 -1 -1 -1 -1 -2 -2 -2 -2 -2 -2 -2 -1 0 0 0 0 0 -1 -1 -2 -2 -2 -2 -2 -1 -1 -1 -1 -1 -1 -1 -1 -1 -1 -1 -1 -2 -1 0 -1
3864 -1 -1 -1 -1 -1 -2 -3 -3 -2 -2 -2 -2 -2 -2 -2 -2 -1 -2 -2 -2 -1 -2 -2 -2 -2 -1 -1 -1 -1 -2 -3 -3 -3 -3 -3 -3 -2 -2 -3 -4 -3 -2 -2 -2 -3 -3 -3 -3 -3 -2 -2 -1 -1 -1 -2 -2 -2 -3 -3 -4 -4 -4 -3 -3 -3 -2 -2 -2 -1 -1 0 0
3855 0 0 0 -1 -2 -2 -2 -2 -1 -1 -1 -1 -1 -2 -2 -2 -1 -1 -2 -2 -2 -2 -2 -2 -2 -2 -2 -1 0 -1 -1 -2 -2 -3 -3 -2 -2 -2 -2 -1 -2 -2 -3 -3 -3 -3 -2 -2 -2 -2 -2 -2 -2 -2 -2 -1 -1 0 0 0 0 -1 -1 -2 -2 -2 -1 -1 -1 0 0 -1
3846a%Jj%%j%J%%j%%j%j%%JJ%%%%%%%%%%%j%%J%J%%j%jJ%%%%%%%J%%%%j%jJ%j%J%J%%%%%%
3837a%J%%%%j%%%j%%%%j%JJ%%%j%Jj%%%J%%Jj%%j%%%%%j%%%%JJ%%%%%j%%%%%%%%%%%j%%%%
3829c%J%%%%%%%jJ%%%%%%%%%%%%%%%j%J%%%%jJ%J%%%j%%%%%%J%%j%%J%%%%%%%%%%%%%j%%%
3820b%%j%%j%J%jJ%J%%%%%%J%jJj%%%J%%%%%%%%%jj%%%%J%J%j%%Jj%%%J%%%%%%%%jJ%%J%%
3811@%%%j%%%j%%J%J%%%%%j%jj%%%%%%%jJJ%%%%%%%%%%%Jj%j%%J%j%%%J%Jj%%%%%%jJ%JJ%
3802@jj%j%%J%J%%%jj%%%%%%J%%J%%%%%%%%%%Jj%%%%j%%J%%%%%J%j%j%%%%jJ%%%%J%%%%%%
3793a%%j%J%%%J%j%%Jj%%j%%%J%j%jJ%%%JJj%j%j%J%%%%%J%j%%Jj%%%%%%%%%J%%kjJ%J%%%
3784b%J%%%%%%%j%j%%J%Jj%%%%Jj%%%%J%%%jJ%%%%%%%j%%%J%j%%JJ%j%%%%J%j%J%%j%%%%%
$$ plain form
3846 -1 -1 0 -1 -1 -1 -2 -2 -1 -1 -1 -2 -2 -2 -3 -3 -4 -4 -4 -3 -2 -2 -2 -2 -2 -2 -2 -2 -2 -2 -2 -2 -3 -3 -3 -2 -2 -1 -1 -1 -2 -2 -3 -2 -2 -2 -2 -2 -2 -2 -2 -1 -1 -1 -1 -1 -2 -2 -3 -2 -2 -3 -3 -2 -2 -1 -1 -1 -1 -1 -1 -1
3837 -1 -1 0 0 0 0 0 -1 -1 -1 -1 -2 -2 -2 -2 -2 -3 -3 -2 -1 -1 -1 -1 -2 -2 -1 -2 -2 -2 -2 -1 -1 -1 0 -1 -1 -1 -2 -2 -2 -2 -2 -2 -3 -3 -3 -3 -3 -2 -1 -1 -1 -1 -1 -1 -2 -2 -2 -2 -2 -2 -2 -2 -2 -2 -2 -2 -3 -3 -3 -3 -3
3829 -3 -3 -2 -2 -2 -2 -2 -2 -2 -2 -3 -2 -2 -2 -2 -2 -2 -2 -2 -2 -2 -2 -2 -2 -2 -2 -2 -3 -3 -2 -2 -2 -2 -2 -3 -2 -2 -1 -1 -1 -1 -2 -2 -2 -2 -2 -2 -2 -1 -1 -1 -2 -2 -2 -1 -1 -1 -1 -1 -1 -1 -1 -1 -1 -1 -1 -1 -1 -2 -2 -2 -2
3820 -2 -2 -2 -3 -3 -3 -4 -4 -3 -3 -4 -3 -3 -2 -2 -2 -2 -2 -2 -2 -1 -1 -2 -1 -2 -2 -2 -2 -1 -1 -1 -1 -1 -1 -1 -1 -1 -1 -2 -3 -3 -3 -3 -3 -2 -2 -1 -1 -2 -2 -2 -1 -2 -2 -2 -2 -1 -1 -1 -1 -1 -1 -1 -1 -1 -2 -1 -1 -1 0 0 0
3811 0 0 0 0 -1 -1 -1 -1 -2 -2 -2 -1 -1 0 0 0 0 0 0 -1 -1 -2 -3 -3 -3 -3 -3 -3 -3 -3 -4 -3 -2 -2 -2 -2 -2 -2 -2 -2 -2 -2 -2 -2 -1 -2 -2 -3 -3 -3 -2 -2 -3 -3 -3 -3 -2 -2 -1 -2 -2 -2 -2 -2 -2 -2 -3 -2 -2 -1 0 0
3802 0 -1 -2 -2 -3 -3 -3 -2 -2 -1 -1 -1 -1 -2 -3 -3 -3 -3 -3 -3 -3 -2 -2 -2 -1 -1 -1 -1 -1 -1 -1 -1 -1 -1 -1 0 -1 -1 -1 -1 -1 -2 -2 -2 -1 -1 -1 -1 -1 -1 0 0 -1 -1 -2 -2 -2 -2 -2 -3 -2 -2 -2 -2 -2 -1 -1 -1 -1 -1 -1 -1
3793 -1 -1 -1 -2 -2 -1 -1 -1 -1 0 0 -1 -1 -1 0 -1 -1 -1 -2 -2 -2 -2 -1 -1 -2 -2 -3 -2 -2 -2 -2 -1 0 -1 -1 -2 -2 -3 -3 -2 -2 -2 -2 -2 -2 -1 -1 -2 -2 -2 -1 -2 -2 -2 -2 -2 -2 -2 -2 -2 -2 -1 -1 -1 -3 -4 -3 -3 -2 -2 -2 -2
3784 -2 -2 -1 -1 -1 -1 -1 -1 -1 -1 -2 -2 -3 -3 -3 -2 -2 -1 -2 -2 -2 -2 -2 -1 -2 -2 -2 -2 -2 -1 -1 -1 -1 -2 -1 -1 -1 -1 -1 -1 -1 -1 -2 -2 -2 -2 -1 -1 -2 -2 -2 -1 0 0 -1 -1 -1 -1 -1 0 0 -1 -1 0 0 0 -1 -1 -1 -1 -1 -1
3775a%J%j%JJj%%%%jj%J%%%%Jj%j%%%Jj%%%%JjJ%%%%%%%j%%%j%J%%%%%%J%J%Jj%j%j%%J%%
3766a%%j%%%j%%%%%%J%%j%%%J%jJ%%%J%jJ%%%j%%%%%%JJk%J%jj%%J%%%%%%j%%%%%%%Jj%%%
3757c%J%%%%%%j%JJJjjJ%%j%J%J%%%j%j%%%J%%%%j%J%%%%%%%%jjJJ%%%%j%%%%%%%%%%jJ%%
3748bJ%%%%%%%%J%k%%%%%%%%%J%%%%j%jJJ%j%%JJ%j%%%%%%%%%%%%J%%j%jj%J%%J%%%%%%%%
3739a%JjjJ%%%j%%%%Jj%%%%%%%%%%%%J%j%j%J%%%J%%%j%%%j%%%jJJJ%%%%%%%%j%J%%%%j%J
3731a%%%%%j%%%%%J%%%J%%%%j%j%%%%%jJ%%%%%J%%JJjj%%j%%%%%%%%%%%Jj%jJJ%j%%J%%%%
3722aj%%%%%jJJJj%%%%jj%%jJ%%%%J%%%%%%%%%Jj%%jJJ%j%Jj%%%%%%J%jJ%j%jJ%J%%%%%jJ
3713a%jj%%J%%%%%%jJ%J%%%%%%%%%%%%%j%%j%JJJ%jj%%%%J%%%jJj%%j%JJ%%%%j%J%jjjJJJ
$$ plain form
3775 -1 -1 0 0 -1 -1 0 1 0 0 0 0 0 -1 -2 -2 -1 -1 -1 -1 -1 0 -1 -1 -2 -2 -2 -2 -1 -2 -2 -2 -2 -2 -1 -2 -1 -1 -1 -1 -1 -1 -1 -1 -2 -2 -2 -2 -3 -3 -2 -2 -2 -2 -2 -2 -2 -1 -1 0 0 1 0 0 -1 -1 -2 -2 -2 -1 -1 -1
3766 -1 -1 -1 -2 -2 -2 -2 -3 -3 -3 -3 -3 -3 -3 -2 -2 -2 -3 -3 -3 -3 -2 -2 -3 -2 -2 -2 -2 -1 -1 -2 -1 -1 -1 -1 -2 -2 -2 -2 -2 -2 -2 -1 0 -2 -2 -1 -1 -2 -3 -3 -3 -2 -2 -2 -2 -2 -2 -2 -3 -3 -3 -3 -3 -3 -3 -3 -2 -3 -3 -3 -3
3757 -3 -3 -2 -2 -2 -2 -2 -2 -2 -3 -3 -2 -1 0 -1 -2 -1 -1 -1 -2 -2 -1 -1 0 0 0 0 -1 -1 -2 -2 -2 -2 -1 -1 -1 -1 -1 -2 -2 -1 -1 -1 -1 -1 -1 -1 -1 -1 -2 -3 -2 -1 -1 -1 -1 -1 -2 -2 -2 -2 -2 -2 -2 -2 -2 -2 -2 -3 -2 -2 -2
3748 -2 -1 -1 -1 -1 -1 -1 -1 -1 -1 0 0 -2 -2 -2 -2 -2 -2 -2 -2 -2 -2 -1 -1 -1 -1 -1 -2 -2 -3 -2 -1 -1 -2 -2 -2 -1 0 0 -1 -1 -1 -1 -1 -1 -1 -1 -1 -1 -1 -1 -1 0 0 0 -1 -1 -2 -3 -3 -2 -2 -2 -1 -1 -1 -1 -1 -1 -1 -1 -1
3739 -1 -1 0 -1 -2 -1 -1 -1 -1 -2 -2 -2 -2 -2 -1 -2 -2 -2 -2 -2 -2 -2 -2 -2 -2 -2 -2 -2 -1 -1 -2 -2 -3 -3 -2 -2 -2 -2 -1 -1 -1 -1 -2 -2 -2 -2 -3 -3 -3 -3 -4 -3 -2 -1 -1 -1 -1 -1 -1 -1 -1 -1 -2 -2 -1 -1 -1 -1 -1 -2 -2 -1
3731 -1 -1 -1 -1 -1 -1 -2 -2 -2 -2 -2 -2 -1 -1 -1 -1 0 0 0 0 0 -1 -1 -2 -2 -2 -2 -2 -2 -3 -2 -2 -2 -2 -2 -2 -1 -1 -1 0 1 0 -1 -1 -1 -2 -2 -2 -2 -2 -2 -2 -2 -2 -2 -2 -2 -1 -2 -2 -3 -2 -1 -1 -2 -2 -2 -1 -1 -1 -1 -1
3722 -1 -2 -2 -2 -2 -2 -2 -3 -2 -1 0 -1 -1 -1 -1 -1 -2 -3 -3 -3 -4 -3 -3 -3 -3 -3 -2 -2 -2 -2 -2 -2 -2 -2 -2 -2 -1 -2 -2 -2 -3 -2 -1 -1 -2 -2 -1 -2 -2 -2 -2 -2 -2 -2 -1 -1 -2 -1 -1 -2 -2 -3 -2 -2 -1 -1 -1 -1 -1 -1 -2 -1
3713 -1 -1 -2 -3 -3 -3 -2 -2 -2 -2 -2 -2 -2 -3 -2 -2 -1 -1 -1 -1 -1 -1 -1 -1 -1 -1 -1 -1 -1 -1 -2 -2 -2 -3 -3 -2 -1 0 0 -1 -2 -2 -2 -2 -2 -1 -1 -1 -1 -2 -1 -2 -2 -2 -3 -3 -2 -1 -1 -1 -1 -1 -2 -2 -1 -1 -2 -3 -4 -3 -2 -1
3704a%%%%%%%%%%%%j%JJj%%Jj%j%%%%%Jj%j%%%%%jJJJ%%%Jj%%j%%%JJ%%%j%%%%%%jjJ%%%%
3695b%JJj%j%%%%%%%J%%%%J%j%%%%%j%J%%%j%%%%%%jJ%%j%%J%J%j%%JJj%%%%J%%%%%%%%%%
3686@j%%%%j%%J%%%%%%j%J%%%%%j%%%%J%%%J%%%%%%%j%%%j%JjjJ%%%J%%j%%J%%%%j%%%J%%
3677a%j%%%j%J%%jJJj%%j%J%%j%%%%J%J%%%j%%%%%j%%J%%%%%J%%%%j%%%Jj%%j%JJ%j%%%%%
3668b%JJ%j%JJ%j%j%%J%%j%%jJ%%%%%%%%%%%%%%%%j%%%J%%%j%%jJ%%%%%J%%%%%%%%%%%%%%
3659ajj%%%%%%%J%%%j%JJ%%%%j%%j%%%%J%%%%%%jJ%%Jj%%%%Jj%J%%%jj%J%%%J%%j%%%%J%j
3650bJ%%%%%%%%jJJ%%j%J%j%%%%j%%%%%Jj%%%j%JJ%JjjJ%%%j%%%%Jj%J%Jj%%%%j%j%JKj%%
3641a%%%%%%j%%%jJ%%%%%%%%%%j%J%%%jJ%%J%%%%%%%%%%%%%%%%%%%%%%%%%%%%%Jj%%%j%%%
$$ plain form
3704 -1 -1 -1 -1 -1 -1 -1 -1 -1 -1 -1 -1 -1 -2 -2 -1 0 -1 -1 -1 0 -1 -1 -2 -2 -2 -2 -2 -2 -1 -2 -2 -3 -3 -3 -3 -3 -3 -4 -3 -2 -1 -1 -1 -1 0 -1 -1 -1 -2 -2 -2 -2 -1 0 0 0 0 -1 -1 -1 -1 -1 -1 -1 -2 -3 -2 -2 -2 -2 -2
3695 -2 -2 -1 0 -1 -1 -2 -2 -2 -2 -2 -2 -2 -2 -1 -1 -1 -1 -1 0 0 -1 -1 -1 -1 -1 -1 -2 -2 -1 -1 -1 -1 -2 -2 -2 -2 -2 -2 -2 -3 -2 -2 -2 -3 -3 -3 -2 -2 -1 -1 -2 -2 -2 -1 0 -1 -1 -1 -1 -1 0 0 0 0 0 0 0 0 0 0 0
3686 0 -1 -1 -1 -1 -1 -2 -2 -2 -1 -1 -1 -1 -1 -1 -1 -2 -2 -1 -1 -1 -1 -1 -1 -2 -2 -2 -2 -2 -1 -1 -1 -1 0 0 0 0 0 0 0 0 -1 -1 -1 -1 -2 -2 -1 -2 -3 -2 -2 -2 -2 -1 -1 -1 -2 -2 -2 -1 -1 -1 -1 -1 -2 -2 -2 -2 -1 -1 -1
3677 -1 -1 -2 -2 -2 -2 -3 -3 -2 -2 -2 -3 -2 -1 -2 -2 -2 -3 -3 -2 -2 -2 -3 -3 -3 -3 -3 -2 -2 -1 -1 -1 -1 -2 -2 -2 -2 -2 -2 -3 -3 -3 -2 -2 -2 -2 -2 -2 -1 -1 -1 -1 -1 -2 -2 -2 -2 -1 -2 -2 -2 -3 -3 -2 -1 -1 -2 -2 -2 -2 -2 -2
3668 -2 -2 -1 0 0 -1 -1 0 1 1 0 0 -1 -1 -1 0 0 0 -1 -1 -1 -2 -1 -1 -1 -1 -1 -1 -1 -1 -1 -1 -1 -1 -1 -1 -1 -1 -1 -2 -2 -2 -2 -1 -1 -1 -1 -2 -2 -2 -3 -2 -2 -2 -2 -2 -2 -1 -1 -1 -1 -1 -1 -1 -1 -1 -1 -1 -1 -1 -1 -1
3659 -1 -2 -3 -3 -3 -3 -3 -3 -3 -3 -2 -2 -2 -2 -3 -3 -2 -1 -1 -1 -1 -1 -2 -2 -2 -3 -3 -3 -3 -3 -2 -2 -2 -2 -2 -2 -2 -3 -2 -2 -2 -1 -2 -2 -2 -2 -2 -1 -2 -2 -1 -1 -1 -1 -2 -3 -3 -2 -2 -2 -2 -1 -1 -1 -2 -2 -2 -2 -2 -1 -1 -2
3650 -2 -1 -1 -1 -1 -1 -1 -1 -1 -1 -2 -1 0 0 0 -1 -1 0 0 -1 -1 -1 -1 -1 -2 -2 -2 -2 -2 -2 -1 -2 -2 -2 -2 -3 -3 -2 -1 -1 0 -1 -2 -1 -1 -1 -1 -2 -2 -2 -2 -2 -1 -2 -2 -1 -1 0 -1 -1 -1 -1 -1 -2 -2 -3 -3 -2 0 -1 -1 -1
3641 -1 -1 -1 -1 -1 -1 -1 -2 -2 -2 -2 -3 -2 -2 -2 -2 -2 -2 -2 -2 -2 -2 -2 -3 -3 -2 -2 -2 -2 -3 -2 -2 -2 -1 -1 -1 -1 -1 -1 -1 -1 -1 -1 -1 -1 -1 -1 -1 -1 -1 -1 -1 -1 -1 -1 -1 -1 -1 -1 -1 -1 -1 -1 0 -1 -1 -1 -1 -2 -2 -2 -2
3633b%%j%JJj%%J%%%j%%JJ%%jJ%%%jj%J%J%%j%%%j%j%J%%%%%%j%%J%%Jj%%%%j%%J%%%j%Jj
3624cJJ%%J%jj%%%%%%Jj%%J%%%%%%j%%%%%j%%%%%%%J%jJ%%%%%Jj%%%%%%%J%%Jj%%%J%j%%j
3615b%%J%%j%j%%%%JJ%j%%%jJ%%J%%%%%%j%Jj%j%%J%J%%%%jJ%%%%%jJ%%%%%j%J%%%%Jjjj%
3606c%J%%%j%%%JJ%%J%j%j%%J%%jJ%j%%J%%%%%%%%%jJ%jj%J%%Jj%%%%%%%%JJ%j%%%%%%%%%
3597a%%%j%%%%%%%%%JJ%%%%%jj%%%%%%%%J%%J%Jj%%j%Jjj%J%j%%%%%J%%%%%%%%j%Jj%J%%J
3588@%%%%%jJ%%j%%%j%%%%jJ%%J%%%%%j%%J%%%j%%Jjj%%%%JJ%%%%%%J%%%%%%%%j%%j%%%j%
3579cJJj%%%J%%j%%J%%%%%%%%%%j%%%%%Jj%%%%%%%%JjjJ%J%%%%%%j%J%%%j%%%%%%J%%J%%j
3570a%%jj%J%%%%%%%J%%j%%%%%%%%%%%J%%%%%%J%%jkj%%JJ%%%%%%%%%%J%%%%%%%%%%%%Jj%
$$ plain form
3633 -2 -2 -2 -3 -3 -2 -1 -2 -2 -2 -1 -1 -1 -1 -2 -2 -2 -1 0 0 0 -1 0 0 0 0 -1 -2 -2 -1 -1 0 0 0 -1 -1 -1 -1 -2 -2 -3 -3 -2 -2 -2 -2 -2 -2 -2 -3 -3 -3 -2 -2 -2 -1 -2 -2 -2 -2 -2 -3 -3 -3 -2 -2 -2 -2 -3 -3 -2 -3
3624 -3 -2 -1 -1 -1 0 0 -1 -2 -2 -2 -2 -2 -2 -2 -1 -2 -2 -2 -1 -1 -1 -1 -1 -1 -1 -2 -2 -2 -2 -2 -2 -3 -3 -3 -3 -3 -3 -3 -3 -2 -2 -3 -2 -2 -2 -2 -2 -2 -1 -2 -2 -2 -2 -2 -2 -2 -2 -1 -1 -1 0 -1 -1 -1 -1 0 0 -1 -1 -1 -2
3615 -2 -2 -2 -1 -1 -1 -2 -2 -3 -3 -3 -3 -3 -2 -1 -1 -2 -2 -2 -2 -3 -2 -2 -2 -1 -1 -1 -1 -1 -1 -1 -2 -2 -1 -2 -2 -3 -3 -3 -2 -2 -1 -1 -1 -1 -1 -2 -1 -1 -1 -1 -1 -1 -2 -1 -1 -1 -1 -1 -1 -2 -2 -1 -1 -1 -1 -1 0 -1 -2 -3 -3
3606 -3 -3 -2 -2 -2 -2 -3 -3 -3 -3 -2 -1 -1 -1 0 0 -1 -1 -2 -2 -2 -1 -1 -1 -2 -1 -1 -2 -2 -2 -1 -1 -1 -1 -1 -1 -1 -1 -1 -1 -2 -1 -1 -2 -3 -3 -2 -2 -2 -1 -2 -2 -2 -2 -2 -2 -2 -2 -2 -1 0 0 -1 -1 -1 -1 -1 -1 -1 -1 -1 -1
3597 -1 -1 -1 -1 -2 -2 -2 -2 -2 -2 -2 -2 -2 -2 -1 0 0 0 0 0 0 -1 -2 -2 -2 -2 -2 -2 -2 -2 -2 -1 -1 -1 0 0 1 0 0 0 -1 -1 0 -1 -2 -2 -1 -1 -2 -2 -2 -2 -2 -2 -1 -1 -1 -1 -1 -1 -1 -1 -1 -2 -2 -1 -2 -2 -1 -1 -1 0
3588 0 0 0 0 0 0 -1 0 0 0 -1 -1 -1 -1 -2 -2 -2 -2 -2 -3 -2 -2 -2 -1 -1 -1 -1 -1 -1 -2 -2 -2 -1 -1 -1 -1 -2 -2 -2 -1 -2 -3 -3 -3 -3 -3 -2 -1 -1 -1 -1 -1 -1 -1 0 0 0 0 0 0 0 0 0 -1 -1 -1 -2 -2 -2 -2 -3 -3
3579 -3 -2 -1 -2 -2 -2 -2 -1 -1 -1 -2 -2 -2 -1 -1 -1 -1 -1 -1 -1 -1 -1 -1 -1 -2 -2 -2 -2 -2 -2 -1 -2 -2 -2 -2 -2 -2 -2 -2 -2 -1 -2 -3 -2 -2 -1 -1 -1 -1 -1 -1 -1 -2 -2 -1 -1 -1 -1 -2 -2 -2 -2 -2 -2 -2 -1 -1 -1 0 0 0 -1
3570 -1 -1 -1 -2 -3 -3 -2 -2 -2 -2 -2 -2 -2 -2 -1 -1 -1 -2 -2 -2 -2 -2 -2 -2 -2 -2 -2 -2 -2 -1 -1 -1 -1 -1 -1 -1 0 0 0 -1 -3 -4 -4 -4 -3 -2 -2 -2 -2 -2 -2 -2 -2 -2 -2 -2 -1 -1 -1 -1 -1 -1 -1 -1 -1 -1 -1 -1 -1 0 -1 -1
3561a%%%%j%%%jJ%%%%%J%%%j%%%J%Jj%%%%%%Jj%%jJ%%%j%%Jj%%J%%%%j%%%%%%J%%%%%j%%%
3552b%j%%J%%%J%%%j%%j%%J%J%%%%%%%%%%%%%J%%j%%%j%J%J%j%%Jjj%%JJ%jj%%%%%%%%%%%
3543b%%%%J%%%jJj%J%J%j%j%%%J%%%j%j%%J%%j%JJ%%%%%%%%Jj%%j%J%%J%%j%jjJ%%J%J%%%
3535@k%jJ%JJ%%j%%j%J%%j%%%JJjjJ%%%%%%Jj%%jj%J%%%%%JJj%%%j%%J%%%Jj%%jJ%%%%j%%
3526b%%%%%%J%j%%%%j%%%J%J%J%%%Jjj%j%%J%%%j%%J%%%J%%%j%%%%%%j%J%%%jjJ%%%%%%%J
3517a%%J%j%%%%%%%%%%J%%%%%j%%%%%%%%%%%J%j%%J%j%%%j%%%J%%%j%%%J%%%%%%%Jj%%%%J
3508@j%j%J%%%%%j%%J%%%J%%%%j%%Jj%%Jj%%%%j%J%%%%%%%%J%%%%%%%%jJ%%%j%%%j%%Jj%J
3499aJj%%%%jJ%%%%%jj%JJJ%Jj%j%%J%%%j%%J%jj%%%%J%Jj%jJ%%%%%%%%%J%%%jjjJ%J%%%j
$$ plain form
3561 -1 -1 -1 -1 -1 -2 -2 -2 -2 -3 -2 -2 -2 -2 -2 -2 -1 -1 -1 -1 -2 -2 -2 -2 -1 -1 0 -1 -1 -1 -1 -1 -1 -1 0 -1 -1 -1 -2 -1 -1 -1 -1 -2 -2 -2 -1 -2 -2 -2 -1 -1 -1 -1 -1 -2 -2 -2 -2 -2 -2 -2 -1 -1 -1 -1 -1 -1 -2 -2 -2 -2
3552 -2 -2 -3 -3 -3 -2 -2 -2 -2 -1 -1 -1 -1 -2 -2 -2 -3 -3 -3 -2 -2 -1 -1 -1 -1 -1 -1 -1 -1 -1 -1 -1 -1 -1 -1 0 0 0 -1 -1 -1 -1 -2 -2 -1 -1 0 0 -1 -1 -1 0 -1 -2 -2 -2 -1 0 0 -1 -2 -2 -2 -2 -2 -2 -2 -2 -2 -2 -2 -2
3543 -2 -2 -2 -2 -2 -1 -1 -1 -1 -2 -1 -2 -2 -1 -1 0 0 -1 -1 -2 -2 -2 -2 -1 -1 -1 -1 -2 -2 -3 -3 -3 -2 -2 -2 -3 -3 -2 -1 -1 -1 -1 -1 -1 -1 -1 -1 0 -1 -1 -1 -2 -2 -1 -1 -1 0 0 0 -1 -1 -2 -3 -2 -2 -2 -1 -1 0 0 0 0
3535 0 -2 -2 -3 -2 -2 -1 0 0 0 -1 -1 -1 -2 -2 -1 -1 -1 -2 -2 -2 -2 -1 0 -1 -2 -1 -1 -1 -1 -1 -1 -1 0 -1 -1 -1 -2 -3 -3 -2 -2 -2 -2 -2 -2 -1 0 -1 -1 -1 -1 -2 -2 -2 -1 -1 -1 -1 0 -1 -1 -1 -2 -1 -1 -1 -1 -1 -2 -2 -2
3526 -2 -2 -2 -2 -2 -2 -2 -1 -1 -2 -2 -2 -2 -2 -3 -3 -3 -3 -2 -2 -1 -1 0 0 0 0 1 0 -1 -1 -2 -2 -2 -1 -1 -1 -1 -2 -2 -2 -1 -1 -1 -1 0 0 0 0 -1 -1 -1 -1 -1 -1 -1 -2 -2 -1 -1 -1 -1 -2 -3 -2 -2 -2 -2 -2 -2 -2 -2 -1
3517 -1 -1 -1 0 0 -1 -1 -1 -1 -1 -1 -1 -1 -1 -1 -1 0 0 0 0 0 0 -1 -1 -1 -1 -1 -1 -1 -1 -1 -1 -1 -1 0 0 -1 -1 -1 0 0 -1 -1 -1 -1 -2 -2 -2 -2 -1 -1 -1 -1 -2 -2 -2 -2 -1 -1 -1 -1 -1 -1 -1 -1 0 -1 -1 -1 -1 -1 0
3508 0 -1 -1 -2 -2 -1 -1 -1 -1 -1 -1 -2 -2 -2 -1 -1 -1 -1 0 0 0 0 0 -1 -1 -1 0 -1 -1 -1 0 -1 -1 -1 -1 -1 -2 -2 -1 -1 -1 -1 -1 -1 -1 -1 -1 0 0 0 0 0 0 0 0 0 -1 0 0 0 0 -1 -1 -1 -1 -2 -2 -2 -1 -2 -2 -1
3499 -1 0 -1 -1 -1 -1 -1 -2 -1 -1 -1 -1 -1 -1 -2 -3 -3 -2 -1 0 0 1 0 0 -1 -1 -1 0 0 0 0 -1 -1 -1 0 0 -1 -2 -2 -2 -2 -2 -1 -1 0 -1 -1 -2 -1 -1 -1 -1 -1 -1 -1 -1 -1 -1 0 0 0 0 -1 -2 -3 -2 -2 -1 -1 -1 -1 -2
3490bJJ%j%%%%%%jjJJ%%%jJ%%J%Jjj%%j%%%%%%%%%J%j%%j%%%J%%%%%%j%J%JJjjJ%%J%%%Jj
3481@j%%j%%%%%J%%J%j%%%%%%j%j%%%JJJ%J%jj%%%%%j%Jj%%Jj%%%J%%j%%%%%%J%%%%%%J%k
3472b%j%%%%%Jj%J%J%%j%%JJJJj%jj%%%%J%%jJ%%%J%j%jJj%%%%%%%%%%jJ%j%Jjj%J%Jj%%J
3463a%%j%%%%%%%%JjJ%%j%%J%%%%Jj%%%%J%j%%%J%jJ%%%%%%%j%Jj%%%%%%%J%%%%%%%%%%%%
3454@j%%j%J%j%%%%%jJJ%J%%%%%Jj%%j%%%j%j%J%%%%%%jJJJ%%%jj%%Jj%JJj%%jJJ%jj%JJ%
3445@jj%%%J%%%%Jj%%j%Jj%%%%%%J%%%Jj%%J%Jjj%%%%%JjjJ%%%j%J%J%jjJ%%%%%%%%%%%jJ
3437a%j%JJ%j%%%%%%%%j%%J%Jj%%j%%J%%%%%%%%%%%j%jJ%%J%%%%j%J%%j%%J%%%Jj%%%J%jj
3428b%%%%%J%%j%%%%%%J%%jJJ%J%j%j%%%%%J%%%J%j%j%%Jj%J%%%%j%%%%%j%j%J%%%%%%%%j
$$ plain form
3490 -2 -1 0 0 -1 -1 -1 -1 -1 -1 -1 -2 -3 -2 -1 -1 -1 -1 -2 -1 -1 -1 0 0 1 0 -1 -1 -1 -2 -2 -2 -2 -2 -2 -2 -2 -2 -2 -1 -1 -2 -2 -2 -3 -3 -3 -3 -2 -2 -2 -2 -2 -2 -2 -3 -3 -2 -2 -1 0 -1 -2 -1 -1 -1 0 0 0 0 1 0
3481 0 -1 -1 -1 -2 -2 -2 -2 -2 -2 -1 -1 -1 0 0 -1 -1 -1 -1 -1 -1 -1 -2 -2 -3 -3 -3 -3 -2 -1 0 0 1 1 0 -1 -1 -1 -1 -1 -1 -2 -2 -1 -2 -2 -2 -1 -2 -2 -2 -2 -1 -1 -1 -2 -2 -2 -2 -2 -2 -2 -1 -1 -1 -1 -1 -1 -1 0 0 -2
3472 -2 -2 -3 -3 -3 -3 -3 -3 -2 -3 -3 -2 -2 -1 -1 -1 -2 -2 -2 -1 0 1 2 1 1 0 -1 -1 -1 -1 -1 0 0 0 -1 0 0 0 0 1 1 0 0 -1 0 -1 -1 -1 -1 -1 -1 -1 -1 -1 -1 -1 -2 -1 -1 -2 -2 -1 -2 -3 -3 -2 -2 -1 -2 -2 -2 -1
3463 -1 -1 -1 -2 -2 -2 -2 -2 -2 -2 -2 -2 -1 -2 -1 -1 -1 -2 -2 -2 -1 -1 -1 -1 -1 0 -1 -1 -1 -1 -1 0 0 -1 -1 -1 -1 0 0 -1 0 0 0 0 0 0 0 0 -1 -1 0 -1 -1 -1 -1 -1 -1 -1 -1 0 0 0 0 0 0 0 0 0 0 0 0 0
3454 0 -1 -1 -1 -2 -2 -1 -1 -2 -2 -2 -2 -2 -2 -3 -2 -1 -1 0 0 0 0 0 0 1 0 0 0 -1 -1 -1 -1 -2 -2 -3 -3 -2 -2 -2 -2 -2 -2 -2 -3 -2 -1 0 0 0 0 -1 -2 -2 -2 -1 -2 -2 -1 0 -1 -1 -1 -2 -1 0 0 -1 -2 -2 -1 0 0
3445 0 -1 -2 -2 -2 -2 -1 -1 -1 -1 -1 0 -1 -1 -1 -2 -2 -1 -2 -2 -2 -2 -2 -2 -2 -1 -1 -1 -1 0 -1 -1 -1 0 0 1 0 -1 -1 -1 -1 -1 -1 0 -1 -2 -1 -1 -1 -1 -2 -2 -1 -1 0 0 -1 -2 -1 -1 -1 -1 -1 -1 -1 -1 -1 -1 -1 -1 -2 -1
3437 -1 -1 -2 -2 -1 0 0 -1 -1 -1 -1 -1 -1 -1 -1 -1 -2 -2 -2 -1 -1 0 -1 -1 -1 -2 -2 -2 -1 -1 -1 -1 -1 -1 -1 -1 -1 -1 -1 -1 -2 -2 -3 -2 -2 -2 -1 -1 -1 -1 -1 -2 -2 -1 -1 -1 -2 -2 -2 -1 -1 -1 -1 0 -1 -1 -1 -1 0 0 -1 -2
3428 -2 -2 -2 -2 -2 -2 -1 -1 -1 -2 -2 -2 -2 -2 -2 -2 -1 -1 -1 -2 -1 0 0 1 1 0 0 -1 -1 -1 -1 -1 -1 0 0 0 0 1 1 0 0 -1 -1 -1 0 -1 -1 0 0 0 0 0 -1 -1 -1 -1 -1 -1 -2 -2 -3 -3 -2 -2 -2 -2 -2 -2 -2 -2 -2 -3
3419cjJ%J%%%J%%%j%J%%%J%%%Jj%%%%j%%%%%j%%%J%%%j%%%%%J%%%j%%J%j%%%%J%%%%%%jjJ
3410b%%Jj%%%%JJjj%%Jj%%%%J%%j%%%%%%%J%JJj%%Jj%jj%%JJ%Jj%%j%j%%%%J%%J%%%%%%jj
3401b%J%%%%%Jj%j%%%j%%%%J%jJJj%%%%J%%%%%%%j%J%%%Jj%%%%%%%%%%%%%%%%jJ%J%%j%j%
3392b%%%%Jj%j%J%%J%j%%%%J%%%j%%%%%%JJj%%%%%%j%%%J%JjJ%%%%%%%%%%j%%%j%j%J%%%J
3383a%j%%J%%%j%J%J%%%%j%jJ%%%%%%%%%%%%%%%J%%j%%j%JJ%j%Jj%%%%%j%jJJ%%Jj%%%JjJ
3374@%%jj%%%%%J%%%%%%%J%%Jj%jJ%j%%%%%J%%%j%%%%j%%jJJJ%jjjJ%J%%%%%%%%%%%%%%%%
3365a%jJJ%%%%%j%Jj%J%%%jj%%J%Jj%%J%%j%%%%%%%j%%JjJ%%%%%%%%%%%%%%%%j%%%J%jJ%%
3356a%%J%%%Jj%%%%j%%%jJ%J%%%%%%j%%%%%j%J%%%j%%%J%%%j%%%%%J%%%%%%j%%J%%%j%%%j
$$ plain form
3419 -3 -4 -3 -3 -2 -2 -2 -2 -1 -1 -1 -1 -2 -2 -1 -1 -1 -1 0 0 0 0 1 0 0 0 0 0 -1 -1 -1 -1 -1 -1 -2 -2 -2 -2 -1 -1 -1 -1 -2 -2 -2 -2 -2 -2 -1 -1 -1 -1 -2 -2 -2 -1 -1 -2 -2 -2 -2 -2 -1 -1 -1 -1 -1 -1 -1 -2 -3 -2
3410 -2 -2 -2 -1 -2 -2 -2 -2 -2 -1 0 -1 -2 -2 -2 -1 -2 -2 -2 -2 -2 -1 -1 -1 -2 -2 -2 -2 -2 -2 -2 -2 -1 -1 0 1 0 0 0 1 0 0 -1 -2 -2 -2 -1 0 0 1 0 0 0 -1 -1 -2 -2 -2 -2 -2 -1 -1 -1 0 0 0 0 0 0 0 -1 -2
3401 -2 -2 -1 -1 -1 -1 -1 -1 0 -1 -1 -2 -2 -2 -2 -3 -3 -3 -3 -3 -2 -2 -3 -2 -1 -2 -2 -2 -2 -2 -1 -1 -1 -1 -1 -1 -1 -1 -2 -2 -1 -1 -1 -1 0 -1 -1 -1 -1 -1 -1 -1 -1 -1 -1 -1 -1 -1 -1 -1 -1 -1 -2 -1 -1 0 0 0 -1 -1 -2 -2
3392 -2 -2 -2 -2 -2 -1 -2 -2 -3 -3 -2 -2 -2 -1 -1 -2 -2 -2 -2 -2 -1 -1 -1 -1 -2 -2 -2 -2 -2 -2 -2 -1 0 -1 -1 -1 -1 -1 -1 -1 -2 -2 -2 -2 -1 -1 0 -1 0 0 0 0 0 0 0 0 0 0 0 -1 -1 -1 -1 -2 -2 -3 -3 -2 -2 -2 -2 -1
3383 -1 -1 -2 -2 -2 -1 -1 -1 -1 -2 -2 -1 -1 0 0 0 0 0 -1 -1 -2 -1 -1 -1 -1 -1 -1 -1 -1 -1 -1 -1 -1 -1 -1 -1 -1 0 0 0 -1 -1 -1 -2 -2 -1 0 0 -1 -1 0 -1 -1 -1 -1 -1 -1 -2 -2 -3 -2 -1 -1 -1 0 -1 -1 -1 -1 0 -1 0
3374 0 0 0 -1 -2 -2 -2 -2 -2 -2 -1 -1 -1 -1 -1 -1 -1 -1 0 0 0 1 0 0 -1 0 0 -1 -1 -1 -1 -1 -1 0 0 0 0 -1 -1 -1 -1 -1 -2 -2 -2 -3 -2 -1 0 0 -1 -2 -3 -2 -2 -1 -1 -1 -1 -1 -1 -1 -1 -1 -1 -1 -1 -1 -1 -1 -1 -1
3365 -1 -1 -2 -1 0 0 0 0 0 0 -1 -1 0 -1 -1 0 0 0 0 -1 -2 -2 -2 -1 -1 0 -1 -1 -1 0 0 0 -1 -1 -1 -1 -1 -1 -1 -1 -2 -2 -2 -1 -2 -1 -1 -1 -1 -1 -1 -1 -1 -1 -1 -1 -1 -1 -1 -1 -1 -1 -2 -2 -2 -2 -1 -1 -2 -1 -1 -1
3356 -1 -1 -1 0 0 0 0 1 0 0 0 0 0 -1 -1 -1 -1 -2 -1 -1 0 0 0 0 0 0 0 -1 -1 -1 -1 -1 -1 -2 -2 -1 -1 -1 -1 -2 -2 -2 -2 -1 -1 -1 -1 -2 -2 -2 -2 -2 -2 -1 -1 -1 -1 -1 -1 -1 -2 -2 -2 -1 -1 -1 -1 -2 -2 -2 -2 -3
3347cK%%%%%%Jj%J%%%%%%j%%%JJ%j%%jJ%%%j%%%%J%%j%%J%%j%J%%%j%%Jj%%J%%%%%%j%%%J
3339@%%j%%%%%jj%%J%%JJ%j%%%%J%j%Jj%%%%%Jj%%%%J%j%%%Jj%j%%JJjJ%%%%j%J%%%%%%%%
3330@jj%%%Jj%%%%j%JJ%%%%%%J%j%%%%%Jj%JjjJ%%jj%%J%J%%j%J%%%%%%%%j%JjJ%jJ%%J%j
3321aj%%J%%Jj%%%j%%%%J%%%%%%%%J%%j%%%J%%%%%%%j%j%%J%%%%j%%%%J%%%%%j%%%%%J%J%
3312@j%%j%%%J%%%%%%%%%%%%j%J%%%%Jjj%%%%%J%j%%%%%Jj%%%JJ%%%%j%%%%%JJj%%%%%%%j
3303aJJj%%%%%%%%%%%j%%JJjj%%%%%%j%%jJ%J%J%%J%%j%%j%%%J%jJ%jj%J%J%%%%j%J%%%j%
3294a%%j%J%%j%%J%%%J%%%j%%%%J%j%%j%J%%%%Jj%%J%%%j%%%jJ%%%%%%%%%%jJ%%%jJ%J%j%
3285aJ%j%%%jJ%%j%%%%%%J%J%%%%j%%%%%%%%%%J%jj%%%%%%%%%J%%%%%%%%J%%%%j%j%%%jJ%
$$ plain form
3347 -3 -1 -1 -1 -1 -1 -1 -1 0 -1 -1 0 0 0 0 0 0 0 -1 -1 -1 -1 0 1 1 0 0 0 -1 0 0 0 0 -1 -1 -1 -1 -1 0 0 0 -1 -1 -1 0 0 0 -1 -1 0 0 0 0 -1 -1 -1 0 -1 -1 -1 0 0 0 0 0 0 0 -1 -1 -1 -1 0
3339 0 0 0 -1 -1 -1 -1 -1 -1 -2 -3 -3 -3 -2 -2 -2 -1 0 0 -1 -1 -1 -1 -1 0 0 -1 -1 0 -1 -1 -1 -1 -1 -1 0 -1 -1 -1 -1 -1 0 0 -1 -1 -1 -1 0 -1 -1 -2 -2 -2 -1 0 -1 0 0 0 0 0 -1 -1 0 0 0 0 0 0 0 0 0
3330 0 -1 -2 -2 -2 -2 -1 -2 -2 -2 -2 -2 -3 -3 -2 -1 -1 -1 -1 -1 -1 -1 0 0 -1 -1 -1 -1 -1 -1 0 -1 -1 0 -1 -2 -1 -1 -1 -2 -3 -3 -3 -2 -2 -1 -1 -1 -2 -2 -1 -1 -1 -1 -1 -1 -1 -1 -1 -2 -2 -1 -2 -1 -1 -2 -1 -1 -1 0 0 -1
3321 -1 -2 -2 -2 -1 -1 -1 0 -1 -1 -1 -1 -2 -2 -2 -2 -2 -1 -1 -1 -1 -1 -1 -1 -1 -1 0 0 0 -1 -1 -1 -1 0 0 0 0 0 0 0 0 -1 -1 -2 -2 -2 -1 -1 -1 -1 -1 -2 -2 -2 -2 -2 -1 -1 -1 -1 -1 -1 -2 -2 -2 -2 -2 -2 -1 -1 0 0
3312 0 -1 -1 -1 -2 -2 -2 -2 -1 -1 -1 -1 -1 -1 -1 -1 -1 -1 -1 -1 -1 -2 -2 -1 -1 -1 -1 -1 0 -1 -2 -2 -2 -2 -2 -2 -1 -1 -2 -2 -2 -2 -2 -2 -1 -2 -2 -2 -2 -1 0 0 0 0 0 -1 -1 -1 -1 -1 -1 0 1 0 0 0 0 0 0 0 0 -1
3303 -1 0 1 0 0 0 0 0 0 0 0 0 0 0 0 -1 -1 -1 0 1 0 -1 -1 -1 -1 -1 -1 -1 -2 -2 -2 -3 -2 -2 -1 -1 0 0 0 1 1 1 0 0 0 -1 -1 -1 -1 0 0 -1 0 0 -1 -2 -2 -1 -1 0 0 0 0 0 -1 -1 0 0 0 0 -1 -1
3294 -1 -1 -1 -2 -2 -1 -1 -1 -2 -2 -2 -1 -1 -1 -1 0 0 0 0 -1 -1 -1 -1 -1 0 0 -1 -1 -1 -2 -2 -1 -1 -1 -1 -1 0 -1 -1 -1 0 0 0 0 -1 -1 -1 -1 -2 -1 -1 -1 -1 -1 -1 -1 -1 -1 -1 -1 -2 -1 -1 -1 -1 -2 -1 -1 0 0 -1 -1
3285 -1 0 0 -1 -1 -1 -1 -2 -1 -1 -1 -2 -2 -2 -2 -2 -2 -2 -1 -1 0 0 0 0 0 -1 -1 -1 -1 -1 -1 -1 -1 -1 -1 -1 0 0 -1 -2 -2 -2 -2 -2 -2 -2 -2 -2 -2 -1 -1 -1 -1 -1 -1 -1 -1 -1 0 0 0 0 0 -1 -1 -2 -2 -2 -2 -3 -2 -2
3276bJ%%%%jJ%%%J%%%%%%j%%j%%%J%jj%%J%JJj%%%%%%Jj%%%%%j%%%J%%jJ%%%%%%%%%%%%j%
3267b%J%%Jj%%%%%%%j%%J%%%%J%%j%jJJ%%j%%Jj%%%JJ%jjJ%%jjJ%%%%%%%j%Jj%J%%%%Jj%%
3258a%jJ%%jJ%%%%j%J%%%%%%%%%%%%j%%J%%J%%j%%%J%%%%j%%%%%%%%%%%J%%%%%j%%%j%%J%
3249aJ%%J%%%jj%jJ%%%%%%%%J%j%%%%jjJ%J%%%j%%Jj%%%%%%%%jJ%%%%%J%%%%%%jJ%jJJj%%
3241aJj%j%JJ%J%JjjjJ%J%%jj%%j%J%J%%j%%%%%%%J%jj%%%%JJ%%j%%%%%J%Jjk%%%%%J%%%J
3232@%%%%Jjj%%J%j%j%%J%%%%jjJ%%%%%%%%J%%%j%jJJ%j%%%j%J%J%Jj%%J%J%j%%%%j%J%J%
3223AjJj%J%%%jj%%%%%Jj%%j%%JJ%%j%%%J%%%%%%%%%%j%%j%%J%J%%j%%%J%jjJ%%jJ%%%%%%
3214ajJ%j%J%%%%%J%%%j%%j%Jj%J%%%%%%%%%%J%%%%%%J%%j%%%%j%%JJj%%%J%j%%j%j%%%J%
$$ plain form
3276 -2 -1 -1 -1 -1 -1 -2 -1 -1 -1 -1 0 0 0 0 0 0 0 -1 -1 -1 -2 -2 -2 -2 -1 -1 -2 -3 -3 -3 -2 -2 -1 0 -1 -1 -1 -1 -1 -1 -1 0 -1 -1 -1 -1 -1 -1 -2 -2 -2 -2 -1 -1 -1 -2 -1 -1 -1 -1 -1 -1 -1 -1 -1 -1 -1 -1 -1 -2 -2
3267 -2 -2 -1 -1 -1 0 -1 -1 -1 -1 -1 -1 -1 -1 -2 -2 -2 -1 -1 -1 -1 -1 0 0 0 -1 -1 -2 -1 0 0 0 -1 -1 -1 0 -1 -1 -1 -1 0 1 1 0 -1 0 0 0 -1 -2 -1 -1 -1 -1 -1 -1 -1 -1 -2 -2 -1 -2 -2 -1 -1 -1 -1 -1 0 -1 -1 -1
3258 -1 -1 -2 -1 -1 -1 -2 -1 -1 -1 -1 -1 -2 -2 -1 -1 -1 -1 -1 -1 -1 -1 -1 -1 -1 -1 -1 -2 -2 -2 -1 -1 -1 0 0 0 -1 -1 -1 -1 0 0 0 0 0 -1 -1 -1 -1 -1 -1 -1 -1 -1 -1 -1 -1 0 0 0 0 0 0 -1 -1 -1 -1 -2 -2 -2 -1 -1
3249 -1 0 0 0 1 1 1 1 0 -1 -1 -2 -1 -1 -1 -1 -1 -1 -1 -1 -1 0 0 -1 -1 -1 -1 -1 -2 -3 -2 -2 -1 -1 -1 -1 -2 -2 -2 -1 -2 -2 -2 -2 -2 -2 -2 -2 -2 -3 -2 -2 -2 -2 -2 -2 -1 -1 -1 -1 -1 -1 -1 -2 -1 -1 -2 -1 0 -1 -1 -1
3241 -1 0 -1 -1 -2 -2 -1 0 0 1 1 2 1 0 -1 0 0 1 1 1 0 -1 -1 -1 -2 -2 -1 -1 0 0 0 -1 -1 -1 -1 -1 -1 -1 -1 0 0 -1 -2 -2 -2 -2 -2 -1 0 0 0 -1 -1 -1 -1 -1 -1 0 0 1 0 -2 -2 -2 -2 -2 -2 -1 -1 -1 -1 0
3232 0 0 0 0 0 1 0 -1 -1 -1 0 0 -1 -1 -2 -2 -2 -1 -1 -1 -1 -1 -2 -3 -2 -2 -2 -2 -2 -2 -2 -2 -2 -1 -1 -1 -1 -2 -2 -3 -2 -1 -1 -2 -2 -2 -2 -3 -3 -2 -2 -1 -1 0 -1 -1 -1 0 0 1 1 0 0 0 0 0 -1 -1 0 0 1 1
3223 1 0 1 0 0 1 1 1 1 0 -1 -1 -1 -1 -1 -1 0 -1 -1 -1 -2 -2 -2 -1 0 0 0 -1 -1 -1 -1 0 0 0 0 0 0 0 0 0 0 0 -1 -1 -1 -2 -2 -2 -1 -1 0 0 0 -1 -1 -1 -1 0 0 -1 -2 -1 -1 -1 -2 -1 -1 -1 -1 -1 -1 -1
3214 -1 -2 -1 -1 -2 -2 -1 -1 -1 -1 -1 -1 0 0 0 0 -1 -1 -1 -2 -2 -1 -2 -2 -1 -1 -1 -1 -1 -1 -1 -1 -1 -1 -1 0 0 0 0 0 0 0 1 1 1 0 0 0 0 0 -1 -1 -1 0 1 0 0 0 0 1 1 0 0 0 -1 -1 -2 -2 -2 -2 -1 -1
3205a%%%jj%JJ%%%J%jJ%%%%%%%%%%Jj%j%%%%%%J%%%%%%%%%%%j%jJ%%%J%%%%%%%%jJjjJ%J%
3196@%%%j%%%%%%%%%Jjj%%%%J%%%j%J%jJJ%j%%%%%%%%%jJ%%%%%jJ%%j%%%%%%%J%%%%%J%%j
3187a%%%Jj%%%JJj%j%J%Jjj%%%%%%%%%%%%%%%%%%j%%%Jj%%J%%j%%%J%%%%%JJ%%%jj%%%%%%
3178a%%%%Jjjj%%J%%J%%%%%%%%J%%%jJ%%%j%%J%%J%%%j%j%jJ%%%J%j%%%%jj%%JJ%%%j%%%%
3169b%%J%%j%%J%J%%jj%%JJ%%%%%%%%j%%%%%%%jJ%%J%jJ%Jj%j%%%%%Jj%%%%%j%%J%%%%%%J
3160@%%%%Jjjj%J%JJj%%%j%%%%j%%%%JJj%Jj%%jJ%J%%%%jj%%J%J%%%%%j%jJ%%%%%%%%%%j%
3151bJ%%J%%jj%j%%J%%%J%%jJ%%%%J%%j%%j%%J%%%%%%%%%j%%J%%%%%%J%j%%%JJj%%%JjjJJ
3143A%j%%Jjj%J%%%j%%%%%%%%%J%%jJ%%%j%j%J%%jJ%JjjjJJJ%%%%%%j%%jJ%%%J%j%%%%%j%
$$ plain form
3205 -1 -1 -1 -1 -2 -3 -3 -2 -1 -1 -1 -1 0 0 -1 0 0 0 0 0 0 0 0 0 0 0 1 0 0 -1 -1 -1 -1 -1 -1 -1 0 0 0 0 0 0 0 0 0 0 0 0 -1 -1 -2 -1 -1 -1 -1 0 0 0 0 0 0 0 0 0 -1 0 -1 -2 -1 -1 0 0
3196 0 0 0 0 -1 -1 -1 -1 -1 -1 -1 -1 -1 -1 0 -1 -2 -2 -2 -2 -2 -1 -1 -1 -1 -2 -2 -1 -1 -2 -1 0 0 -1 -1 -1 -1 -1 -1 -1 -1 -1 -1 -2 -1 -1 -1 -1 -1 -1 -2 -1 -1 -1 -2 -2 -2 -2 -2 -2 -2 -2 -1 -1 -1 -1 -1 -1 0 0 0 -1
3187 -1 -1 -1 -1 0 -1 -1 -1 -1 0 1 0 0 -1 -1 0 0 1 0 -1 -1 -1 -1 -1 -1 -1 -1 -1 -1 -1 -1 -1 -1 -1 -1 -1 -1 -1 -2 -2 -2 -2 -1 -2 -2 -2 -1 -1 -1 -2 -2 -2 -2 -1 -1 -1 -1 -1 -1 0 1 1 1 1 0 -1 -1 -1 -1 -1 -1 -1
3178 -1 -1 -1 -1 -1 0 -1 -2 -3 -3 -3 -2 -2 -2 -1 -1 -1 -1 -1 -1 -1 -1 -1 0 0 0 0 -1 0 0 0 0 -1 -1 -1 0 0 0 1 1 1 1 0 0 -1 -1 -2 -1 -1 -1 -1 0 0 -1 -1 -1 -1 -1 -2 -3 -3 -3 -2 -1 -1 -1 -1 -2 -2 -2 -2 -2
3169 -2 -2 -2 -1 -1 -1 -2 -2 -2 -1 -1 0 0 0 -1 -2 -2 -2 -1 0 0 0 0 0 0 0 0 0 -1 -1 -1 -1 -1 -1 -1 -1 -2 -1 -1 -1 0 0 -1 0 0 1 0 0 -1 -1 -1 -1 -1 -1 0 -1 -1 -1 -1 -1 -1 -2 -2 -2 -1 -1 -1 -1 -1 -1 -1 0
3160 0 0 0 0 0 1 0 -1 -2 -2 -1 -1 0 1 0 0 0 0 -1 -1 -1 -1 -1 -2 -2 -2 -2 -2 -1 0 -1 -1 0 -1 -1 -1 -2 -1 -1 0 0 0 0 0 -1 -2 -2 -2 -1 -1 0 0 0 0 0 0 -1 -1 -2 -1 -1 -1 -1 -1 -1 -1 -1 -1 -1 -1 -2 -2
3151 -2 -1 -1 -1 0 0 0 -1 -2 -2 -3 -3 -3 -2 -2 -2 -2 -1 -1 -1 -2 -1 -1 -1 -1 -1 0 0 0 -1 -1 -1 -2 -2 -2 -1 -1 -1 -1 -1 -1 -1 -1 -1 -1 -2 -2 -2 -1 -1 -1 -1 -1 -1 -1 0 0 -1 -1 -1 -1 0 1 0 0 0 0 1 0 -1 0 1
3143 1 1 0 0 0 1 0 -1 -1 0 0 0 0 -1 -1 -1 -1 -1 -1 -1 -1 -1 -1 0 0 0 -1 0 0 0 0 -1 -1 -2 -2 -1 -1 -1 -2 -1 -1 0 -1 -2 -3 -2 -1 0 0 0 0 0 0 0 -1 -1 -1 -2 -1 -1 -1 -1 0 0 -1 -1 -1 -1 -1 -1 -2 -2
3134bJ%%%J%%%%%%%%j%%%j%%J%%J%%%%%j%%%J%%%%%%%%%j%j%%%%j%%J%%%%%%J%%%%%JJjj%
3125a%%%%%%%%J%jJ%%%%%j%J%%%%%%%%j%%%%jjJJ%Jj%j%%%%%%JJjjJJ%%%%%%%jj%JJjj%%%
3116bjJ%JJ%%%%%%j%%%%%%J%jj%J%%%J%%j%%%%%j%J%J%%%%j%%Jj%jJJ%j%%J%%j%%%%J%%%%
3107@%%%J%j%j%%%J%%%%%%j%%%%J%J%%j%j%%%%%%jJ%%J%%%%%%%%J%%j%%jJ%%%%j%%%%J%%%
3098@%jj%%J%%%%%j%%%J%%j%%%%%J%%%%%%%%%%%J%j%%%%%J%%%%jJJ%%%%%j%%%%%%%%%%%%%
3089@%%%j%jJJJ%%%%%j%%%%%j%Jj%%%%J%%j%%%%%%%JJj%%%j%%%j%%%J%%%J%%%%%%j%%%%%%
3080a%%%%%%%jJJ%%jjJ%JJ%%jj%%J%%%%Jj%%j%j%%J%%%%%%%J%J%j%%%j%J%jj%%JJ%%j%%%%
3071aJ%%jj%%J%J%%%%%%%%%j%%J%j%%%%%%%%%jJ%%j%%%%%Jj%JJ%Jj%%%%jJ%%%%%j%%%%j%%
$$ plain form
3134 -2 -1 -1 -1 -1 0 0 0 0 0 0 0 0 0 -1 -1 -1 -1 -2 -2 -2 -1 -1 -1 0 0 0 0 0 0 -1 -1 -1 -1 0 0 0 0 0 0 0 0 0 0 -1 -1 -2 -2 -2 -2 -2 -3 -3 -3 -2 -2 -2 -2 -2 -2 -2 -1 -1 -1 -1 -1 -1 0 1 0 -1 -1
3125 -1 -1 -1 -1 -1 -1 -1 -1 -1 0 0 -1 0 0 0 0 0 0 -1 -1 0 0 0 0 0 0 0 0 0 -1 -1 -1 -1 -1 -2 -3 -2 -1 -1 0 -1 -1 -2 -2 -2 -2 -2 -2 -2 -1 0 -1 -2 -1 0 0 0 0 0 0 0 0 -1 -2 -2 -1 0 -1 -2 -2 -2 -2
3116 -2 -3 -2 -2 -1 0 0 0 0 0 0 0 -1 -1 -1 -1 -1 -1 -1 0 0 -1 -2 -2 -1 -1 -1 -1 0 0 0 -1 -1 -1 -1 -1 -1 -2 -2 -1 -1 0 0 0 0 0 -1 -1 -1 0 -1 -1 -2 -1 0 0 -1 -1 -1 0 0 0 -1 -1 -1 -1 -1 0 0 0 0 0
3107 0 0 0 0 1 1 0 0 -1 -1 -1 -1 0 0 0 0 0 0 0 -1 -1 -1 -1 -1 0 0 1 1 1 0 0 -1 -1 -1 -1 -1 -1 -1 -2 -1 -1 -1 0 0 0 0 0 0 0 0 0 1 1 1 0 0 0 -1 0 0 0 0 0 -1 -1 -1 -1 -1 0 0 0 0
3098 0 0 -1 -2 -2 -2 -1 -1 -1 -1 -1 -1 -2 -2 -2 -2 -1 -1 -1 -2 -2 -2 -2 -2 -2 -1 -1 -1 -1 -1 -1 -1 -1 -1 -1 -1 -1 0 0 -1 -1 -1 -1 -1 -1 0 0 0 0 0 -1 0 1 1 1 1 1 1 0 0 0 0 0 0 0 0 0 0 0 0 0 0
3089 0 0 0 0 -1 -1 -2 -1 0 1 1 1 1 1 1 0 0 0 0 0 0 -1 -1 0 -1 -1 -1 -1 -1 0 0 0 -1 -1 -1 -1 -1 -1 -1 -1 0 1 0 0 0 0 -1 -1 -1 -1 -2 -2 -2 -2 -1 -1 -1 -1 0 0 0 0 0 0 0 -1 -1 -1 -1 -1 -1 -1
3080 -1 -1 -1 -1 -1 -1 -1 -1 -2 -1 0 0 0 -1 -2 -1 -1 0 1 1 1 0 -1 -1 -1 0 0 0 0 0 1 0 0 0 -1 -1 -2 -2 -2 -1 -1 -1 -1 -1 -1 -1 -1 0 0 1 1 0 0 0 0 -1 -1 0 0 -1 -2 -2 -2 -1 0 0 0 -1 -1 -1 -1 -1
3071 -1 0 0 0 -1 -2 -2 -2 -1 -1 0 0 0 0 0 0 0 0 0 0 -1 -1 -1 0 0 -1 -1 -1 -1 -1 -1 -1 -1 -1 -1 -2 -1 -1 -1 -2 -2 -2 -2 -2 -2 -1 -2 -2 -1 0 0 1 0 0 0 0 0 -1 0 0 0 0 0 0 -1 -1 -1 -1 -1 -2 -2 -2
3062b%%J%%%%%%%%Jj%%J%%%%%jJ%j%j%%%%jJ%JJ%%J%jj%%j%%Jj%J%%Jj%%J%%jj%%J%%Jj%%
3053a%%j%JJjjJ%J%%j%%%%%J%%%%j%%JJj%jj%JJ%j%%%%%%%%%%%%jJ%%Jj%%J%j%%%%j%%%J%
3045a%%%Jj%%jJ%%%%%%%%%%Jj%%%%%%jJJ%%%%%J%%%%j%%%Jj%%j%J%%%j%%%%%j%J%%%j%JJ%
3036@JJjjj%JJ%%jj%%Jjj%Jj%%J%%%J%j%%%%%J%j%%%%%j%%%jJ%%%%%%%%%%%%%%%%J%%%%J%
3027@%%%j%j%J%%jJ%%jJ%J%Jj%%%J%j%j%%J%J%%j%%%%j%%%%%J%%j%%%%j%%J%%%%%%Jj%%%j
3018b%J%%%j%j%%%JJ%%%%%J%j%%%%%J%%%%%%%%j%J%%%%j%jJ%%%j%%J%%j%J%%%%J%%%%%%J%
3009AKJ%Jj%j%%%jj%%j%%%%%j%%%Jj%%%%%%%%%%%jJ%%%%%%%%J%j%%%%%%j%JJ%%%%%%%jJ%%
3000@%%Jj%%%%J%%j%%j%JJ%J%%jj%%%%%%%%j%J%%%jJ%jJ%%j%jJJ%%%%Jj%j%J%%%jjJ%JJjj
$$ plain form
3062 -2 -2 -2 -1 -1 -1 -1 -1 -1 -1 -1 -1 0 -1 -1 -1 0 0 0 0 0 0 -1 0 0 -1 -1 -2 -2 -2 -2 -2 -3 -2 -2 -1 0 0 0 1 1 0 -1 -1 -1 -2 -2 -2 -1 -2 -2 -1 -1 -1 0 -1 -1 -1 0 0 0 -1 -2 -2 -2 -1 -1 -1 0 -1 -1 -1
3053 -1 -1 -1 -2 -2 -1 0 -1 -2 -1 -1 0 0 0 -1 -1 -1 -1 -1 -1 0 0 0 0 0 -1 -1 -1 0 1 0 0 -1 -2 -2 -1 0 0 -1 -1 -1 -1 -1 -1 -1 -1 -1 -1 -1 -1 -1 -2 -1 -1 -1 0 -1 -1 -1 0 0 -1 -1 -1 -1 -1 -2 -2 -2 -2 -1 -1
3045 -1 -1 -1 -1 0 -1 -1 -1 -2 -1 -1 -1 -1 -1 -1 -1 -1 -1 -1 -1 0 -1 -1 -1 -1 -1 -1 -1 -2 -1 0 0 0 0 0 0 1 1 1 1 1 0 0 0 0 1 0 0 0 -1 -1 0 0 0 0 -1 -1 -1 -1 -1 -1 -2 -2 -1 -1 -1 -1 -2 -2 -1 0 0
3036 0 1 2 1 0 -1 -1 0 1 1 1 0 -1 -1 -1 0 -1 -2 -2 -1 -2 -2 -2 -1 -1 -1 -1 0 0 -1 -1 -1 -1 -1 -1 0 0 -1 -1 -1 -1 -1 -1 -2 -2 -2 -2 -3 -2 -2 -2 -2 -2 -2 -2 -2 -2 -2 -2 -2 -2 -2 -2 -2 -2 -1 -1 -1 -1 -1 0 0
3027 0 0 0 0 -1 -1 -2 -2 -1 -1 -1 -2 -1 -1 -1 -2 -1 -1 0 0 1 0 0 0 0 1 1 0 0 -1 -1 -1 0 0 1 1 1 0 0 0 0 0 -1 -1 -1 -1 -1 -1 0 0 0 -1 -1 -1 -1 -1 -2 -2 -2 -1 -1 -1 -1 -1 -1 -1 0 -1 -1 -1 -1 -2
3018 -2 -2 -1 -1 -1 -1 -2 -2 -3 -3 -3 -3 -2 -1 -1 -1 -1 -1 -1 0 0 -1 -1 -1 -1 -1 -1 0 0 0 0 0 0 0 0 0 -1 -1 0 0 0 0 0 -1 -1 -2 -1 -1 -1 -1 -2 -2 -2 -1 -1 -1 -2 -2 -1 -1 -1 -1 -1 0 0 0 0 0 0 0 1 1
3009 1 3 4 4 5 4 4 3 3 3 3 2 1 1 1 0 0 0 0 0 0 -1 -1 -1 -1 0 -1 -1 -1 -1 -1 -1 -1 -1 -1 -1 -1 -1 -2 -1 -1 -1 -1 -1 -1 -1 -1 -1 0 0 -1 -1 -1 -1 -1 -1 -1 -2 -2 -1 0 0 0 0 0 0 0 0 -1 0 0 0
3000 0 0 0 1 0 0 0 0 0 1 1 1 0 0 0 -1 -1 0 1 1 2 2 2 1 0 0 0 0 0 0 0 0 0 -1 -1 0 0 0 0 -1 0 0 -1 0 0 0 -1 -1 -2 -1 0 0 0 0 0 1 0 0 -1 -1 0 0 0 0 -1 -2 -1 -1 0 1 0 -1
2991aj%JJ%%%%%J%%j%%j%%%%J%%Jj%%%%%%j%%%%%%%%%%%%%%%%%%%%j%J%%%%%J%j%%%%Jj%%
2982aj%J%J%%%%%%j%J%%j%%%%%%J%%%%%j%%J%%jj%J%%%%j%%%%J%%%J%%%%j%J%%%%%JjJ%j%
2973@%%%j%jJ%J%%j%%j%J%%%J%%j%%J%j%%%j%%JJ%%%j%j%%JjJJ%%Jj%%J%%j%%%%%%%j%%%J
2964@%%jjJ%%j%%J%%%%%J%%%jjJJj%%%%%j%%JjJ%JjJ%%%%%%%%j%%%jJ%%%j%%J%%%%%%J%%%
2955@%j%%%%%%j%%%J%%%%%Jj%%j%JJj%%%J%%j%J%%%%%j%%%%%%JJ%jj%%%%%%%J%%j%%%Jj%%
2947ajJ%%J%j%%J%%jjJ%%%J%%Jjj%%%J%j%%%%Jj%J%%%%%j%j%%J%%%%%%%%%Jj%%j%%J%%%J%
2938@%J%j%%%%J%%j%%%%jjj%JJJ%j%%%%J%%j%j%%JJ%J%%%jj%%%%j%Jj%J%J%%%%%%%%%j%%J
2929@J%%j%%jJ%jJj%%%%jJ%%j%JJ%%%%j%%%%jjJ%J%%%%j%%J%J%%%jJ%J%%%%%%%%%%%%%j%%
$$ plain form
2991 -1 -2 -2 -1 0 0 0 0 0 0 1 1 1 0 0 0 -1 -1 -1 -1 -1 0 0 0 1 0 0 0 0 0 0 0 -1 -1 -1 -1 -1 -1 -1 -1 -1 -1 -1 -1 -1 -1 -1 -1 -1 -1 -1 -1 -1 -2 -2 -1 -1 -1 -1 -1 -1 0 0 -1 -1 -1 -1 -1 0 -1 -1 -1
2982 -1 -2 -2 -1 -1 0 0 0 0 0 0 0 -1 -1 0 0 0 -1 -1 -1 -1 -1 -1 -1 0 0 0 0 0 0 -1 -1 -1 0 0 0 -1 -2 -2 -1 -1 -1 -1 -1 -2 -2 -2 -2 -2 -1 -1 -1 -1 0 0 0 0 0 -1 -1 0 0 0 0 0 0 1 0 1 1 0 0
2973 0 0 0 0 -1 -1 -2 -1 -1 0 0 0 -1 -1 -1 -2 -2 -1 -1 -1 -1 0 0 0 -1 -1 -1 0 0 -1 -1 -1 -1 -2 -2 -2 -1 0 0 0 0 -1 -1 -2 -2 -2 -1 -2 -1 0 0 0 1 0 0 0 1 1 1 0 0 0 0 0 0 0 0 -1 -1 -1 -1 0
2964 0 0 0 -1 -2 -1 -1 -1 -2 -2 -2 -1 -1 -1 -1 -1 -1 0 0 0 0 -1 -2 -1 0 -1 -1 -1 -1 -1 -1 -2 -2 -2 -1 -2 -1 -1 0 -1 0 0 0 0 0 0 0 0 0 -1 -1 -1 -1 -2 -1 -1 -1 -1 -2 -2 -2 -1 -1 -1 -1 -1 -1 -1 0 0 0 0
2955 0 0 -1 -1 -1 -1 -1 -1 -1 -2 -2 -2 -2 -1 -1 -1 -1 -1 -1 0 -1 -1 -1 -2 -2 -1 0 -1 -1 -1 -1 0 0 0 -1 -1 0 0 0 0 0 0 -1 -1 -1 -1 -1 -1 -1 0 1 1 0 -1 -1 -1 -1 -1 -1 -1 -1 0 0 0 -1 -1 -1 -1 0 -1 -1 -1
2947 -1 -2 -1 -1 -1 0 0 -1 -1 -1 0 0 0 -1 -2 -1 -1 -1 -1 0 0 0 1 0 -1 -1 -1 -1 0 0 -1 -1 -1 -1 -1 0 -1 -1 0 0 0 0 0 0 -1 -1 -2 -2 -2 -1 -1 -1 -1 -1 -1 -1 -1 -1 -1 0 -1 -1 -1 -2 -2 -2 -1 -1 -1 -1 0 0
2938 0 0 1 1 0 0 0 0 0 1 1 1 0 0 0 0 0 -1 -2 -3 -3 -2 -1 0 0 -1 -1 -1 -1 -1 0 0 0 -1 -1 -2 -2 -2 -1 0 0 1 1 1 1 0 -1 -1 -1 -1 -1 -2 -2 -1 -2 -2 -1 -1 0 0 0 0 0 0 0 0 0 0 -1 -1 -1 0
2929 0 1 1 1 0 0 0 -1 0 0 -1 0 -1 -1 -1 -1 -1 -2 -1 -1 -1 -2 -2 -1 0 0 0 0 0 -1 -1 -1 -1 -1 -2 -3 -2 -2 -1 -1 -1 -1 -1 -2 -2 -2 -1 -1 0 0 0 0 -1 0 0 1 1 1 1 1 1 1 1 1 1 1 1 1 1 0 0 0
2920@J%%%%jjjJ%%J%%jJ%%J%%j%%%%%%%%J%j%%%%%%J%%%%%j%%%%%%%%%JJ%jJ%j%%%j%%%%K
2911B%%j%JJ%JJ%%%%%%JJ%%%%%JKJJKKLLLNPQJ1J3J7K3L0L6M0M8O1Q1R5R2P0L4jk0l5m9n6
2904E35n8o5o7o2n5m5l5k6k0j5j0qqonnlmlklkkkjkkkjjjj%j%%%k%%j%%%jjJ%%%%j%%%%j%
2897Fjj%%%%%%%%J%%%%jjJJJjjk%%%J%%%k%%J%%%%j%%JJ%%%%j%jJ%j%%Jj%J%%%j%%%J%%%%
2888B%%jJ%j%%%J%%jJ%j%%%%%%%%%%%%%j%%%%J%jJ%%%j%%JjJJ%jj%J%%%%%%%J%%j%J%%jj%
2879@%Jj%J%%j%J%%%%%%%%%%%%jjJ%%%%%j%%J%%j%%%%%%%%jJJ%%%%%JJjj%%%J%j%%%Jj%%J
2870A%%%%j%%%%%%J%J%%%%j%j%%%%J%%j%%J%%%%Jj%j%%jJJjjJ%%Jj%%jJ%%%j%JJj%%%%%%%
2861@%j%Jj%%%%%%J%%%%%j%%%%J%%J%%%%%j%%JJj%%j%%%J%%%j%%%j%%%J%%%j%%%J%%%j%%J
$$ plain form
2920 0 1 1 1 1 1 0 -1 -2 -1 -1 -1 0 0 0 -1 0 0 0 1 1 1 0 0 0 0 0 0 0 0 0 1 1 0 0 0 0 0 0 0 1 1 1 1 1 1 0 0 0 0 0 0 0 0 0 0 1 2 2 1 2 2 1 1 1 1 0 0 0 0 0 2
2911 2 2 2 1 1 2 3 3 4 5 5 5 5 5 5 5 6 7 7 7 7 7 7 8 10 11 12 14 16 19 22 25 30 37 45 56 69 86 109 139 175 215 263 324 405 500 592 662 696 695 675 640 591 535
2904 535 477 412 345 283 228 183 148 122 102 87 77 69 61 55 50 45 42 38 35 33 30 28 26 24 23 21 19 17 16 15 14 13 13 12 12 12 12 10 10 10 9 9 9 9 8 7 8 8 8 8 8 7 7 7 7 7 6 6
2897 6 5 4 4 4 4 4 4 4 4 4 5 5 5 5 5 4 3 4 5 6 5 4 2 2 2 2 3 3 3 3 1 1 1 2 2 2 2 2 1 1 1 2 3 3 3 3 3 2 2 1 2 2 1 1 1 2 1 1 2 2 2 2 1 1 1 1 2 2 2 2 2
2888 2 2 2 1 2 2 1 1 1 1 2 2 2 1 2 2 1 1 1 1 1 1 1 1 1 1 1 1 1 1 0 0 0 0 0 1 1 0 1 1 1 1 0 0 0 1 0 1 2 2 1 0 0 1 1 1 1 1 1 1 1 2 2 2 1 1 2 2 2 1 0 0
2879 0 0 1 0 0 1 1 1 0 0 1 1 1 1 1 1 1 1 1 1 1 1 1 0 -1 0 0 0 0 0 0 -1 -1 -1 0 0 0 -1 -1 -1 -1 -1 -1 -1 -1 -1 -2 -1 0 0 0 0 0 0 1 2 1 0 0 0 0 1 1 0 0 0 0 1 0 0 0 1
2870 1 1 1 1 1 0 0 0 0 0 0 0 1 1 2 2 2 2 2 1 1 0 0 0 0 0 1 1 1 0 0 0 1 1 1 1 1 2 1 1 0 0 0 -1 0 1 0 -1 0 0 0 1 0 0 0 -1 0 0 0 0 -1 -1 0 1 0 0 0 0 0 0 0 0
2861 0 0 -1 -1 0 -1 -1 -1 -1 -1 -1 -1 0 0 0 0 0 0 -1 -1 -1 -1 -1 0 0 0 1 1 1 1 1 1 0 0 0 1 2 1 1 1 0 0 0 0 1 1 1 1 0 0 0 0 -1 -1 -1 -1 0 0 0 0 -1 -1 -1 -1 0 0 0 0 -1 -1 -1 0
2852@%%J%%%j%%%%%%%jJ%%%%%j%%jJ%J%%jJJ%k%%%%J%%%%jJJ%jjjJ%%%%J%%%%%%%%%j%J%%
2844@%%%%j%%%J%%%%j%%K%%j%%%J%Jjj%%%j%J%J%%%j%%%%%%J%%%%%j%%%%j%%%%%%%%%%%%%
2835a%%%%%%%%J%%%%%jJ%%jJ%%%J%jjJ%J%jjJ%%%%%%%%%j%%%JJjj%%Jj%%%jJ%%%%JJ%%%%%
2826A%%j%J%%j%%%%j%%J%%%%%Jjj%%JJjj%%%%%%%%%%J%%%%%j%J%%%%%%%j%J%%%%%%%%J%jj
2817ajJ%%%%JjJ%%%%%%%j%%J%j%%%%%jJJ%%%%%%%j%%%%%%%Jj%%%%%%J%%%%j%J%JJ%j%%%%%
2808AjjJ%%%%j%jJ%j%%J%J%%%j%%%J%jj%%J%J%%%%j%%J%jJ%%%%%%%%J%%%%%%%J%J%%%J%%%
2799D%%%%jj%%j%%%%%%jj%%%%%J%Jj%%%%%%J%%%j%j%%%%%%J%%%%%j%%%J%%jJ%J%%%j%%J%%
2790A%%%Jjjj%%J%%%%%%%%%%%%%%%%%%%j%%j%%J%J%%%%J%%%%j%%%%%j%%JJ%Jjj%j%J%j%J%
$$ plain form
2852 0 0 0 1 1 1 1 0 0 0 0 0 0 0 0 -1 0 0 0 0 0 0 -1 -1 -1 -2 -1 -1 0 0 0 -1 0 1 1 -1 -1 -1 -1 -1 0 0 0 0 0 -1 0 1 1 0 -1 -2 -1 -1 -1 -1 -1 0 0 0 0 0 0 0 0 0 0 -1 -1 0 0 0
2844 0 0 0 0 0 -1 -1 -1 -1 0 0 0 0 0 -1 -1 -1 1 1 1 0 0 0 0 1 1 2 1 0 0 0 0 -1 -1 0 0 1 1 1 1 0 0 0 0 0 0 0 1 1 1 1 1 1 0 0 0 0 0 -1 -1 -1 -1 -1 -1 -1 -1 -1 -1 -1 -1 -1 -1
2835 -1 -1 -1 -1 -1 -1 -1 -1 -1 0 0 0 0 0 0 -1 0 0 0 -1 0 0 0 0 1 1 0 -1 0 0 1 1 0 -1 0 0 0 0 0 0 0 0 0 0 -1 -1 -1 -1 0 1 0 -1 -1 -1 0 -1 -1 -1 -1 -2 -1 -1 -1 -1 -1 0 1 1 1 1 1 1
2826 1 1 1 0 0 1 1 1 0 0 0 0 0 -1 -1 -1 0 0 0 0 0 0 1 0 -1 -1 -1 0 1 0 -1 -1 -1 -1 -1 -1 -1 -1 -1 -1 -1 0 0 0 0 0 0 -1 -1 0 0 0 0 0 0 0 0 -1 -1 0 0 0 0 0 0 0 0 0 1 1 0 -1
2817 -1 -2 -1 -1 -1 -1 -1 0 -1 0 0 0 0 0 0 0 0 -1 -1 -1 0 0 -1 -1 -1 -1 -1 -1 -2 -1 0 0 0 0 0 0 0 0 -1 -1 -1 -1 -1 -1 -1 -1 0 -1 -1 -1 -1 -1 -1 -1 0 0 0 0 0 -1 -1 0 0 1 2 2 1 1 1 1 1 1
2808 1 0 -1 0 0 0 0 0 -1 -1 -2 -1 -1 -2 -2 -2 -1 -1 0 0 0 0 -1 -1 -1 -1 0 0 -1 -2 -2 -2 -1 -1 0 0 0 0 0 -1 -1 -1 0 0 -1 0 0 0 0 0 0 0 0 0 1 1 1 1 1 1 1 1 2 2 3 3 3 3 4 4 4 4
2799 4 4 4 4 4 3 2 2 2 1 1 1 1 1 1 1 0 -1 -1 -1 -1 -1 -1 0 0 1 0 0 0 0 0 0 0 1 1 1 1 0 0 -1 -1 -1 -1 -1 -1 -1 0 0 0 0 0 0 -1 -1 -1 -1 0 0 0 -1 0 0 1 1 1 1 0 0 0 1 1 1
2790 1 1 1 1 2 1 0 -1 -1 -1 0 0 0 0 0 0 0 0 0 0 0 0 0 0 0 0 0 0 0 0 -1 -1 -1 -2 -2 -2 -1 -1 0 0 0 0 0 1 1 1 1 1 0 0 0 0 0 0 -1 -1 -1 0 1 1 2 1 0 0 -1 -1 0 0 -1 -1 0 0
2781@%J%%j%%%J%%j%%%%J%jj%%%J%j%%J%J%%%j%%%%%%j%%%%%%%%%%%J%%%%jJ%%j%%%J%j%%
2772a%J%%%%j%%%%%J%%%%%%%%%jjJ%%%%Jj%%J%%%%%%%%%%%J%%%jj%J%%Jjj%J%Jj%%%%%J%%
2763AJj%%%k%%J%%%%%J%Jj%j%JJ%j%%j%%%%j%%%%Jj%J%%%%j%%%J%%J%j%%j%%%%J%Jj%%J%%
2754A%j%%J%jj%J%J%%%%%%jj%%%J%%%%%%%j%%%%%%%%%J%%%%J%%J%%%k%%%%%%%%%j%%J%J%j
2746@%jJ%J%jjJJJ%%jjjjJ%%jJ%%J%%%%%%%%%%%%%j%J%%%%%J%%%%%%j%%%J%%%%%J%j%j%%%
2737@%J%%j%%%j%%%%JJj%%jJ%jJ%%j%j%jJ%J%J%%J%%%j%J%j%%%%%j%%%%JJ%%%j%%%%%J%j%
2728@%J%j%%J%%%J%j%Jj%%%%%%%%%%%%j%%%%%%jJ%%%%j%%%%Jj%%%J%%%%%%%J%%%j%%%JjJ%
2719A%%%j%%%%%jJ%%%%%%%%%%%%%%%%%%%jjJJ%Jj%%%j%%J%%%%%%%jJ%%j%J%%J%%j%%%%j%%
$$ plain form
2781 0 0 1 1 1 0 0 0 0 1 1 1 0 0 0 0 0 1 1 0 -1 -1 -1 -1 0 0 -1 -1 -1 0 0 1 1 1 1 0 0 0 0 0 0 0 -1 -1 -1 -1 -1 -1 -1 -1 -1 -1 -1 -1 0 0 0 0 0 -1 0 0 0 -1 -1 -1 -1 0 0 -1 -1 -1
2772 -1 -1 0 0 0 0 0 -1 -1 -1 -1 -1 -1 0 0 0 0 0 0 0 0 0 0 -1 -2 -1 -1 -1 -1 -1 0 -1 -1 -1 0 0 0 0 0 0 0 0 0 0 0 0 1 1 1 1 0 -1 -1 0 0 0 1 0 -1 -1 0 0 1 0 0 0 0 0 0 1 1 1
2763 1 2 1 1 1 1 -1 -1 -1 0 0 0 0 0 0 1 1 2 1 1 0 0 1 2 2 1 1 1 0 0 0 0 0 -1 -1 -1 -1 -1 0 -1 -1 0 0 0 0 0 -1 -1 -1 -1 0 0 0 1 1 0 0 0 -1 -1 -1 -1 -1 0 0 1 0 0 0 1 1 1
2754 1 1 0 0 0 1 1 0 -1 -1 0 0 1 1 1 1 1 1 1 0 -1 -1 -1 -1 0 0 0 0 0 0 0 0 -1 -1 -1 -1 -1 -1 -1 -1 -1 -1 0 0 0 0 0 1 1 1 2 2 2 2 0 0 0 0 0 0 0 0 0 0 -1 -1 -1 0 0 1 1 0
2746 0 0 -1 0 0 1 1 0 -1 0 1 2 2 2 1 0 -1 -2 -1 -1 -1 -2 -1 -1 -1 0 0 0 0 0 0 0 0 0 0 0 0 0 0 -1 -1 0 0 0 0 0 0 1 1 1 1 1 1 1 0 0 0 0 1 1 1 1 1 1 2 2 1 1 0 0 0 0
2737 0 0 1 1 1 0 0 0 0 -1 -1 -1 -1 -1 0 1 0 0 0 -1 0 0 -1 0 0 0 -1 -1 -2 -2 -3 -2 -2 -1 -1 0 0 0 1 1 1 1 0 0 1 1 0 0 0 0 0 0 -1 -1 -1 -1 -1 0 1 1 1 1 0 0 0 0 0 0 1 1 0 0
2728 0 0 1 1 0 0 0 1 1 1 1 2 2 1 1 2 1 1 1 1 1 1 1 1 1 1 1 1 1 0 0 0 0 0 0 0 -1 0 0 0 0 0 -1 -1 -1 -1 -1 0 -1 -1 -1 -1 0 0 0 0 0 0 0 0 1 1 1 1 0 0 0 0 1 0 1 1
2719 1 1 1 1 0 0 0 0 0 0 -1 0 0 0 0 0 0 0 0 0 0 0 0 0 0 0 0 0 0 0 0 -1 -2 -1 0 0 1 0 0 0 0 -1 -1 -1 0 0 0 0 0 0 0 0 -1 0 0 0 -1 -1 0 0 0 1 1 1 0 0 0 0 0 -1 -1 -1
2710aJ%%%%%%%%%%%%j%%J%%%%j%%%%%%%%%%Jj%%J%%%%%jjJJJj%%%%j%%%%%J%j%JJ%j%%%jJ
2701@Jj%%%%%j%%%Jj%JJj%%%%%%%%jj%J%%%%%%J%j%%%%%%%%%%%%%j%JJj%%%%%jJ%%%%Jj%%
2692a%%%%JJj%%J%j%%J%j%%%%%%%%%%%jJ%%J%k%%%J%%%Jj%%J%j%%%jj%%%%J%J%%%%%j%%Jj
2683a%%%%%J%jJ%J%j%%%%j%%%%%%%%JJ%J%j%%j%%%%%%j%%%%jJ%J%j%%%%%%J%%%%%J%j%jJ%
2674@%%%j%j%%%J%%%%J%%J%%%jj%%%%%j%%JJ%%%jj%%%JJ%J%jjJ%j%%%%%%%%%%%%%%%J%J%%
2665Aj%%%%%j%%%%%%%%J%%j%%Jj%%%Jj%j%%%%%jJ%%J%j%J%%%J%J%jjj%JJ%%%j%jJ%J%%%%J
2656A%%jj%J%%jJ%%%%%j%j%J%J%j%%%%%%%Jjj%J%%%%jJJj%%%J%%%%%J%%%jj%%%%%%%%%%%%
2648aJ%%%%%JJj%%j%Jj%%%%%%%%%%Jj%%%j%%%%Jj%%J%%%%%%%jJ%%%j%%jJ%%%%%%jJ%J%%jJ
$$ plain form
2710 -1 0 0 0 0 0 0 0 0 0 0 0 0 0 -1 -1 -1 0 0 0 0 0 -1 -1 -1 -1 -1 -1 -1 -1 -1 -1 -1 0 -1 -1 -1 0 0 0 0 0 0 -1 -2 -1 0 1 0 0 0 0 0 -1 -1 -1 -1 -1 -1 0 0 -1 -1 0 1 1 0 0 0 0 -1 0
2701 0 1 0 0 0 0 0 0 -1 -1 -1 -1 0 -1 -1 0 1 0 0 0 0 0 0 0 0 0 -1 -2 -2 -1 -1 -1 -1 -1 -1 -1 0 0 -1 -1 -1 -1 -1 -1 -1 -1 -1 -1 -1 -1 -1 -1 -2 -2 -1 0 -1 -1 -1 -1 -1 -1 -2 -1 -1 -1 -1 -1 0 -1 -1 -1
2692 -1 -1 -1 -1 -1 0 1 0 0 0 1 1 0 0 0 1 1 0 0 0 0 0 0 0 0 0 0 0 0 -1 0 0 0 1 1 -1 -1 -1 -1 0 0 0 0 1 0 0 0 1 1 0 0 0 0 -1 -2 -2 -2 -2 -2 -1 -1 0 0 0 0 0 0 -1 -1 -1 0 -1
2683 -1 -1 -1 -1 -1 -1 0 0 -1 0 0 1 1 0 0 0 0 0 -1 -1 -1 -1 -1 -1 -1 -1 -1 0 1 1 2 2 1 1 1 0 0 0 0 0 0 0 -1 -1 -1 -1 -1 -2 -1 -1 0 0 -1 -1 -1 -1 -1 -1 -1 0 0 0 0 0 0 1 1 0 0 -1 0 0
2674 0 0 0 0 -1 -1 -2 -2 -2 -2 -1 -1 -1 -1 -1 0 0 0 1 1 1 1 0 -1 -1 -1 -1 -1 -1 -2 -2 -2 -1 0 0 0 0 -1 -2 -2 -2 -2 -1 0 0 1 1 0 -1 0 0 -1 -1 -1 -1 -1 -1 -1 -1 -1 -1 -1 -1 -1 -1 -1 -1 0 0 1 1 1
2665 1 0 0 0 0 0 0 -1 -1 -1 -1 -1 -1 -1 -1 -1 0 0 0 -1 -1 -1 0 -1 -1 -1 -1 0 -1 -1 -2 -2 -2 -2 -2 -2 -3 -2 -2 -2 -1 -1 -2 -2 -1 -1 -1 -1 0 0 1 1 0 -1 -2 -2 -1 0 0 0 0 -1 -1 -2 -1 -1 0 0 0 0 0 1
2656 1 1 1 0 -1 -1 0 0 0 -1 0 0 0 0 0 0 -1 -1 -2 -2 -1 -1 0 0 -1 -1 -1 -1 -1 -1 -1 -1 0 -1 -2 -2 -1 -1 -1 -1 -1 -2 -1 0 -1 -1 -1 -1 0 0 0 0 0 0 1 1 1 1 0 -1 -1 -1 -1 -1 -1 -1 -1 -1 -1 -1 -1 -1
2648 -1 0 0 0 0 0 0 1 2 1 1 1 0 0 1 0 0 0 0 0 0 0 0 0 0 0 1 0 0 0 0 -1 -1 -1 -1 -1 0 -1 -1 -1 0 0 0 0 0 0 0 0 -1 0 0 0 0 -1 -1 -1 -2 -1 -1 -1 -1 -1 -1 -1 -2 -1 -1 0 0 0 -1 0
2639@%%jJ%jj%%J%%%J%%%%j%j%%%%%%J%%%%JjJ%%j%%%j%%J%%%%%%%%j%J%%%j%%%JJ%jJ%%%
2630@%j%%%%%%%%%JJj%jJ%%%k%%%J%%%J%%%%%j%%%%J%%%j%%Jjj%J%%%J%j%j%%J%%%%%j%J%
2621a%%%%j%%%%%JJ%%%jj%%Jj%J%Jj%J%%%%Jjj%jJ%J%j%J%%j%%jJ%jJJj%%j%J%jJ%%JJ%%j
2612@%%j%J%j%%j%%%%J%%Jj%%Jjj%%K%j%%J%j%j%%%%%J%Jj%Jj%jJ%%%%%%%j%j%J%J%J%j%%
2603a%%Jjj%%%%%%%%%%%%j%%J%J%%JJ%%%jjj%J%J%%j%J%%%%%%j%j%%%%%%JJj%j%%J%%%%%%
2594a%%%j%%%%%%%%%J%%%%%%%%%Jjj%%%%%J%Jj%J%%jj%%j%JJJ%%%j%%%%Jj%%Jjj%%J%%%%J
2585@%j%%J%%j%J%j%%%%%%%%%%J%Jj%%jJJ%jj%JjJJ%jj%J%j%%%J%j%%%J%%%j%%J%j%%%%JJ
2576A%%jj%%%%Jj%%%%%Jj%%J%%j%%%J%j%%%Jj%%%%Jj%%J%%j%j%%%%%jjJjJJ%%%%%%%J%%J%
$$ plain form
2639 0 0 0 -1 0 0 -1 -2 -2 -2 -1 -1 -1 -1 0 0 0 0 0 -1 -1 -2 -2 -2 -2 -2 -2 -2 -1 -1 -1 -1 -1 0 -1 0 0 0 -1 -1 -1 -1 -2 -2 -2 -1 -1 -1 -1 -1 -1 -1 -1 -1 -2 -2 -1 -1 -1 -1 -2 -2 -2 -2 -1 0 0 -1 0 0 0 0
2630 0 0 -1 -1 -1 -1 -1 -1 -1 -1 -1 -1 0 1 0 0 -1 0 0 0 0 -2 -2 -2 -2 -1 -1 -1 -1 0 0 0 0 0 0 -1 -1 -1 -1 -1 0 0 0 0 -1 -1 -1 0 -1 -2 -2 -1 -1 -1 -1 0 0 -1 -1 -2 -2 -2 -1 -1 -1 -1 -1 -1 -2 -2 -1 -1
2621 -1 -1 -1 -1 -1 -2 -2 -2 -2 -2 -2 -1 0 0 0 0 -1 -2 -2 -2 -1 -2 -2 -1 -1 0 -1 -1 0 0 0 0 0 1 0 -1 -1 -2 -1 -1 0 0 -1 -1 0 0 0 -1 -1 -1 -2 -1 -1 -2 -1 0 -1 -1 -1 -2 -2 -1 -1 -2 -1 -1 -1 0 1 1 1 0
2612 0 0 0 -1 -1 0 0 -1 -1 -1 -2 -2 -2 -2 -2 -1 -1 -1 0 -1 -1 -1 0 -1 -2 -2 -2 0 0 -1 -1 -1 0 0 -1 -1 -2 -2 -2 -2 -2 -2 -1 -1 0 -1 -1 0 -1 -1 -2 -1 -1 -1 -1 -1 -1 -1 -1 -2 -2 -3 -3 -2 -2 -1 -1 0 0 -1 -1 -1
2603 -1 -1 -1 0 -1 -2 -2 -2 -2 -2 -2 -2 -2 -2 -2 -2 -2 -2 -3 -3 -3 -2 -2 -1 -1 -1 0 1 1 1 1 0 -1 -2 -2 -1 -1 0 0 0 -1 -1 0 0 0 0 0 0 0 -1 -1 -2 -2 -2 -2 -2 -2 -2 -1 0 -1 -1 -2 -2 -2 -1 -1 -1 -1 -1 -1 -1
2594 -1 -1 -1 -1 -2 -2 -2 -2 -2 -2 -2 -2 -2 -2 -1 -1 -1 -1 -1 -1 -1 -1 -1 -1 0 -1 -2 -2 -2 -2 -2 -2 -1 -1 0 -1 -1 0 0 0 -1 -2 -2 -2 -3 -3 -2 -1 0 0 0 0 -1 -1 -1 -1 -1 0 -1 -1 -1 0 -1 -2 -2 -2 -1 -1 -1 -1 -1 0
2585 0 0 -1 -1 -1 0 0 0 -1 -1 0 0 -1 -1 -1 -1 -1 -1 -1 -1 -1 -1 -1 0 0 1 0 0 0 -1 0 1 1 0 -1 -1 0 -1 0 1 1 0 -1 -1 0 0 -1 -1 -1 -1 0 0 -1 -1 -1 -1 0 0 0 0 -1 -1 -1 0 0 -1 -1 -1 -1 -1 0 1
2576 1 1 1 0 -1 -1 -1 -1 -1 0 -1 -1 -1 -1 -1 -1 0 -1 -1 -1 0 0 0 -1 -1 -1 -1 0 0 -1 -1 -1 -1 0 -1 -1 -1 -1 -1 0 -1 -1 -1 0 0 0 -1 -1 -2 -2 -2 -2 -2 -2 -3 -4 -3 -4 -3 -2 -2 -2 -2 -2 -2 -2 -2 -1 -1 -1 0 0
2567@%j%%%%%%jJ%%%%%J%%%%j%%%%%%%%K%%%%%%%jJ%J%J%%%%%%JJJKJJKKJJ%J%jjjj%jkkj
2558Gjj%%%j%j%%%%%J%J%JJJJJJKKLLKMLJJJ%jjkjlklkkjkjlkjj%%%j%%j%%%J%J%J%JJKJJ
2549A2J%JJ%%%%jjjkjj%jjjk%%Jjjj%%%jJ%%%%%%%jj%%%%%%%%%%%%%%%%%%%%%%%%j%%J%%%
2541a%%j%J%%jj%%%%JJJ%j%%j%%%%J%%%%%%Jj%j%%%J%%%%%%%%%%%J%j%%j%%J%%J%%%%%%%j
2532a%%j%J%%J%j%%j%J%J%%j%%%Jj%%%j%%%%%%Jj%%%%j%%%%%%%%J%%J%%%%%%%%%J%%%%%j%
2523a%j%j%JjJ%%%Jj%%%%%%%%%%%J%%%Jj%J%%%%%%%%%j%%%j%%%%%%J%jj%%JJJ%jJ%j%%%%J
2514@jj%%%%J%%JjjJJ%%%%J%%jj%%%J%J%%J%J%JJKKKKKLKLMKLJJ%J%kkkkklkklljjjjjj%j
2505E%J%%JKJKKKKMMMNOONNNNKK%klmnonmnnnnlkkjkjjjjjj%j%JJJJJJKKKKLLLLLKKJjkkl
$$ plain form
2567 0 0 -1 -1 -1 -1 -1 -1 -1 -2 -1 -1 -1 -1 -1 -1 0 0 0 0 0 -1 -1 -1 -1 -1 -1 -1 -1 -1 1 1 1 1 1 1 1 1 0 1 1 2 2 3 3 3 3 3 3 3 4 5 6 8 9 10 12 14 15 16 16 17 17 16 15 14 13 13 12 10 8 7
2558 7 6 5 5 5 5 4 4 3 3 3 3 3 3 4 4 5 5 6 7 8 9 10 11 13 15 18 21 23 27 30 31 32 33 33 32 31 29 28 25 23 20 18 16 15 13 12 9 7 6 5 5 5 5 4 4 4 3 3 3 3 4 4 5 5 6 6 7 8 10 11 12
2549 12 13 13 14 15 15 15 15 15 14 13 12 10 9 8 8 7 6 5 3 3 3 4 3 2 1 1 1 1 0 1 1 1 1 1 1 1 1 0 -1 -1 -1 -1 -1 -1 -1 -1 -1 -1 -1 -1 -1 -1 -1 -1 -1 -1 -1 -1 -1 -1 -1 -1 -1 -2 -2 -2 -1 -1 -1 -1
2541 -1 -1 -1 -2 -2 -1 -1 -1 -2 -3 -3 -3 -3 -3 -2 -1 0 0 -1 -1 -1 -2 -2 -2 -2 -2 -1 -1 -1 -1 -1 -1 -1 0 -1 -1 -2 -2 -2 -2 -1 -1 -1 -1 -1 -1 -1 -1 -1 -1 -1 -1 0 0 -1 -1 -1 -2 -2 -2 -1 -1 -1 0 0 0 0 0 0 0 0 -1
2532 -1 -1 -1 -2 -2 -1 -1 -1 0 0 -1 -1 -1 -2 -2 -1 -1 0 0 0 -1 -1 -1 -1 0 -1 -1 -1 -1 -2 -2 -2 -2 -2 -2 -2 -1 -2 -2 -2 -2 -2 -3 -3 -3 -3 -3 -3 -3 -3 -3 -2 -2 -2 -1 -1 -1 -1 -1 -1 -1 -1 -1 -1 0 0 0 0 0 0 -1 -1
2523 -1 -1 -2 -2 -3 -3 -2 -3 -2 -2 -2 -2 -1 -2 -2 -2 -2 -2 -2 -2 -2 -2 -2 -2 -2 -1 -1 -1 -1 0 -1 -1 0 0 0 0 0 0 0 0 0 0 -1 -1 -1 -1 -2 -2 -2 -2 -2 -2 -2 -1 -1 -2 -3 -3 -3 -2 -1 0 0 -1 0 0 -1 -1 -1 -1 -1 0
2514 0 -1 -2 -2 -2 -2 -2 -1 -1 -1 0 -1 -2 -1 0 0 0 0 0 1 1 1 0 -1 -1 -1 -1 0 0 1 1 1 2 2 3 3 4 5 7 9 11 13 15 18 20 23 27 29 32 33 34 34 35 35 33 31 29 27 25 22 20 18 15 12 11 10 9 8 7 6 6 5
2505 5 5 6 6 6 7 9 10 12 14 16 18 22 26 30 35 41 47 52 57 62 67 69 71 71 69 66 62 57 51 46 42 37 32 27 22 19 17 15 14 12 11 10 9 8 7 6 6 5 5 6 7 8 9 10 11 13 15 17 19 22 25 28 31 34 36 38 39 38 36 34 31
2496C1llklkkkkjjjjjj%jjj%%%%j%j%%%J%j%%JjJ%J%%j%j%JJ%j%%%J%%jJ%%%%%%j%%%%JJ%
2487DjjK%%%%%j%JJjj%%J%%%%J%%%%j%%%%%%%J%J%%j%%JJ%%%%J%K%j%%jJ%%%%%%%J%%jJ%%
2478A0%J%%%%%%%%%JJJ%JKK%%%JJJ%%Jj%JJKJLKMLKKLLMMLMKKKJ%%%jj%j%jj%j%%J%JJJJL
2470G3LLMNMNNOPPQRJ1J2J2J2J3J3J3J2J3J3J3J3J4J6J8K1K6L2M0M9O1P6R3J13J37J62J90
2465A337K18K44K65K76K73K53K16J64J03L4l0r4j46j86k16k32k37k28k14j91j67j41j16r2
2462A093p2n3l9k5j4lQK0L1M4O1Q1J04J32J65K04K48K97L52M09M63N07N35N36N06M40L40K17
2458F587Q3n4j82k95l84m50m88n05m96m69m28l80l27k76k26j85j49j19r4p5n9m5l3k3j2jJ1
2455I26K4L8N6P5R6J22J48J76K05K29K50K56K48K21J78J21N7j2p8j37j86k22k44k56k55k44
$$ plain form
2496 31 28 25 23 20 18 16 14 12 11 10 9 8 7 6 6 5 4 3 3 3 3 3 2 2 1 1 1 1 2 2 1 1 1 2 1 2 2 3 3 3 2 2 1 1 2 3 3 2 2 2 2 3 3 3 2 3 3 3 3 3 3 3 2 2 2 2 2 3 4 4
2487 4 3 2 4 4 4 4 4 4 3 3 4 5 4 3 3 3 4 4 4 4 4 5 5 5 5 5 4 4 4 4 4 4 4 4 5 5 6 6 6 5 5 5 6 7 7 7 7 7 8 8 10 10 9 9 9 8 9 9 9 9 9 9 9 9 10 10 10 9 10 10 10
2478 10 10 11 11 11 11 11 11 11 11 11 11 12 13 14 14 15 17 19 19 19 19 20 21 22 22 22 23 22 22 23 24 26 27 30 32 36 39 41 43 46 49 53 57 60 64 66 68 70 71 71 71 71 70 69 69 68 68 67 66 66 65 65 65 66 66 67 68 69 70 73
2470 73 76 79 83 88 92 97 102 108 115 122 130 139 150 162 174 186 199 212 225 237 250 263 276 289 303 319 337 358 384 416 456 505 566 642 735 848 985 1147 1337
2465 1337 1555 1799 2064 2340 2613 2866 3082 3246 3349 3383 3353 3259 3113 2927 2711 2479 2242 2014 1800 1609 1442 1301 1185 1093
2462 1093 1021 968 929 904 890 887 895 915 946 990 1051 1132 1236 1368 1533 1737 1985 2282 2634 3043 3506 4013 4548 5084 5590 6030 6370 6587
2458 6587 6670 6616 6434 6139 5755 5305 4817 4312 3816 3347 2919 2539 2212 1936 1710 1525 1376 1257 1163 1088 1029 984 951 928 916 915 926
2455 926 950 988 1044 1119 1215 1337 1485 1661 1866 2095 2345 2601 2849 3070 3248 3369 3426 3414 3336 3199 3013 2791 2547 2291 2036 1792
2452A792k27k03j77j51j26j04q5p0n7m8m2l5l1k9k6k3k2k1j9j8j8j6j6j4j4j3j2j1j0qqpp
2447A24oommlllkkjkkjj%jJ%J%%%kjkjlkllkkkkkjkjkjkjkkjkjkjk%j%j%%%j%%%%%%J%%%%
2439C3j%%%%%%j%%%j%%%%%j%%jj%J%jj%j%%%%%%jJJj%JJ%%jj%JJ%j%%j%j%%%%%J%%J%JJJ%
2430B9J%%j%%%%%%J%%%J%%%%%jJ%%%K%j%JJJ%jJJJKJJJJK%J%LKJKJJ%JKKKKKLKLMNMOOPOP
2421A20PPNOMLKJ%j%%jjkkj%jJ%JKKKLNNNOPPRJ0J0J2J4J5J7J9K0K1K3K3K5K7K6K5K6K5K6
2415E65K6K8L1L5M1M9O0P3R2J14J42J73K12K57L05L59M16M71N17N48N54N27M66L71K49J16
2412F797k0j50k62l52m18m58m74m68m41m02l54l01k48j99j55j18q5n8l3j1RL0N4Q1J10J46
2408B220J91K43L06L79M66N59O66P76Q86R86J057J083J047R39P60N26K59j8k84n21p17q63
$$ plain form
2452 1792 1565 1362 1185 1034 908 804 719 649 592 544 502 467 436 407 381 358 336 315 296 278 260 244 228 214 200 187 175 164 154 146 138 131 124
2447 124 118 112 108 104 101 98 95 93 91 90 88 86 85 84 84 83 84 84 85 85 85 85 83 82 80 79 76 74 71 68 66 64 62 60 58 57 55 54 52 51 49 48 46 44 43 41 40 38 37 35 35 34 34 33 33 33 33 32 32 32 32 32 32 32 33 33 33 33 33
2439 33 32 32 32 32 32 32 32 31 31 31 31 30 30 30 30 30 30 29 29 29 28 27 27 28 28 27 26 26 25 25 25 25 25 25 25 24 25 26 25 25 26 27 27 27 26 25 25 26 27 27 26 26 26 25 25 24 24 24 24 24 24 25 25 25 26 26 27 28 29 29
2430 29 30 30 30 29 29 29 29 29 29 29 30 30 30 30 31 31 31 31 31 31 30 31 31 31 31 33 33 32 32 33 34 35 35 34 35 36 37 39 40 41 42 43 45 45 46 46 49 51 52 54 55 56 56 57 59 61 63 65 67 70 72 75 79 84 88 94 100 107 113 120
2421 120 127 134 139 145 149 152 154 155 155 154 154 154 153 152 150 148 147 147 146 147 147 148 150 152 154 157 162 167 172 178 185 192 201 211 221 233 247 262 279 298 318 339 362 385 410 437 463 488 514 539 565
2415 565 591 619 650 685 726 775 835 908 1000 1114 1256 1429 1641 1898 2203 2562 2978 3449 3966 4514 5068 5595 6061 6432 6681 6797
2412 6797 6777 6627 6365 6013 5595 5137 4663 4195 3754 3352 2998 2697 2449 2250 2095 1977 1892 1834 1801 1790 1799 1829 1883 1964 2074 2220
2408 2220 2411 2654 2960 3339 3805 4364 5030 5806 6692 7678 8735 9818 10865 11804 12564 13090 13349 13331 13047 12526 11809 10946
2406A0946r61j009j010r69q96q02o97n90m90m00l22k59k05j64j29j00p4n1l0pJ5L8O7J00J36
2402B137J79K26K80L37L95M51M96N23N21M83M06K98J66K6j15k41l48m32m89n21n28n13m80
2400C257m34l81l28k75k29j88j55j27j07q8p5o3n5m9m3m0l7l4l1l0k8k7k5k3k2k1j9j8j7j6
2396B72j5j3j2j0qqqpoooonnmmmlmlkkkkkkkkkkllklllkkjkklkjjkkkkkkjkjkjkkjjJ%%%%
2388E8%%%%Jj%j%j%jjjj%%jj%J%%j%%%jjjjjjjjj%j%J%J%%%JJJKJ%%J%j%%jjjkjjjj%j%jj
2379C6%J%JjjJ%j%JJJ%%%%%%jjjjjj%j%%j%%J%%%%%%J%JJ%JJJJJJ%JJJJJ%%J%%JJJJJJJ%J
2370E5KKKMMLLLLLLKKJ%J%%j%jJJJJ%KKKLKLLMLMNMKLMNNONPQRJ0J1J2J2J2J2J2J3J2J3J3
2363C18J5J7K0K3K9L5M4N4O6Q2J00J22J46J73J99K28K52K71K78K71K47K06J49Q4J6n1j11j61
$$ plain form
2406 10946 9985 8976 7966 6997 6101 5299 4602 4012 3522 3122 2800 2541 2336 2172 2043 1943 1869 1818 1788 1781 1796 1834 1901 2001 2137
2402 2137 2316 2542 2822 3159 3554 4005 4501 5024 5545 6028 6434 6732 6898 6924 6809 6568 6220 5788 5299 4778 4250 3737 3257
2400 3257 2823 2442 2114 1839 1610 1422 1267 1140 1033 945 870 807 752 703 660 620 583 549 518 488 460 433 408 385 363 342 323 305 288 272
2396 272 257 244 232 222 214 206 198 191 185 179 173 167 162 157 153 149 145 142 138 135 133 131 129 127 125 123 121 119 117 115 112 109 107 104 101 98 96 94 93 91 89 86 84 83 82 80 78 76 74 72 70 69 67 66 64 63 61 59 58 57 58 58 58 58 58
2388 58 58 58 58 58 59 58 58 57 57 56 56 55 54 53 52 52 52 51 50 50 51 51 51 50 50 50 50 49 48 47 46 45 44 43 42 41 41 40 40 41 41 42 42 42 42 43 44 45 47 48 48 48 49 49 48 48 48 47 46 45 43 42 41 40 39 39 38 38 37 36
2379 36 36 37 37 38 37 36 37 37 36 36 37 38 39 39 39 39 39 39 39 38 37 36 35 34 33 33 32 32 32 31 31 31 32 32 32 32 32 32 32 33 33 34 35 35 36 37 38 39 40 41 41 42 43 44 45 46 46 46 47 47 47 48 49 50 51 52 53 54 54 55
2370 55 57 59 61 65 69 72 75 78 81 84 87 89 91 92 92 93 93 93 92 92 91 92 93 94 95 95 97 99 101 104 106 109 112 116 119 123 128 132 134 137 141 146 151 157 162 169 177 186 196 207 219 231 243 255 267 280 292 305 318
2363 318 333 350 370 393 422 457 501 555 621 703 803 925 1071 1244 1443 1671 1923 2194 2472 2743 2990 3196 3345 3429 3445 3394 3283 3122
2359C122j98k24k37k38k27k10j87j63j36j10q7o6n0l6k3j0JJ1K3L5M9O7Q7J12J42J77K17K64
2356B105L16L71M27M81N22N47N42N03M26L17J84M3r7k26l34m19m78n10n17n02m70m23l71l17
2353B120k64k16j74j40j12q9p0n5m0l0j7qMJ6K9M5O1Q3J07J32J60J88K18K44K60K64K52K21
2349C189J71J08L8l5j02j60k08k41k62k68k65k51k28k02j74j48j23j01q2o7n5m8m0l3l0k6
2346C57k2j9j8j7j5j5j4j3j3j3j1j0j0qqrpoonmmmmllllklllkkkjkkjjk%%jj%kjkk%jkjjj
2339D9j%jjj%jjj%jjjjj%jjj%j%%%%%%%J%%%kj%%%Jj%j%j%%%%%JJj%J%J%KJJ%%%jjjjkjjj
2330B7%%%%J%JJ%JKJKKLKKJJjjjjkkkkljkjjkj%%%%%J%%%%KJKJj%j%jjjjjj%j%j%%%jjjj%
2321A7%J%%%J%%%%%j%%%%%%%j%%%j%%%J%%%Jj%J%%%j%JJJJJJ%%JKKKKKMLLLKLJK%jjkllkl
$$ plain form
2359 3122 2924 2700 2463 2225 1998 1788 1601 1438 1302 1192 1105 1039 989 953 930 920 921 932 955 990 1039 1106 1193 1305 1447 1624 1841 2105
2356 2105 2421 2792 3219 3700 4222 4769 5311 5814 6240 6557 6741 6784 6687 6461 6127 5708 5230 4720 4203 3701 3231 2808 2437 2120
2353 2120 1856 1640 1466 1326 1214 1125 1055 1000 960 930 913 905 909 925 954 999 1060 1143 1250 1382 1542 1730 1948 2192 2452 2716 2968 3189
2349 3189 3360 3468 3506 3471 3369 3209 3001 2760 2498 2230 1965 1714 1486 1284 1110 962 839 738 656 589 534 486 446 413 383 357
2346 357 335 316 298 281 266 251 237 224 211 198 187 177 167 159 151 142 135 129 123 118 114 110 106 102 99 96 93 90 88 85 82 79 77 75 73 72 70 68 67 66 64 64 64 63 62 62 60 59 57 55 55 54 52 51 50 49
2339 49 48 48 47 46 45 45 44 43 42 42 41 40 39 38 37 37 36 35 34 34 33 33 33 33 33 33 33 33 34 34 34 34 32 31 31 31 31 32 31 31 30 30 29 29 29 29 29 29 30 31 30 30 31 31 32 32 34 35 36 36 36 36 35 34 33 32 30 29 28 27
2330 27 27 27 27 27 28 28 29 30 30 31 33 34 36 38 41 43 45 46 47 46 45 44 43 41 39 37 35 32 31 29 28 27 25 24 24 24 24 24 24 25 25 25 25 25 27 28 30 31 30 30 29 29 28 27 26 25 24 23 23 22 22 21 21 21 21 20 19 18 17 17
2321 17 17 18 18 18 18 19 19 19 19 19 19 18 18 18 18 18 18 18 18 17 17 17 17 16 16 16 16 17 17 17 17 18 17 17 18 18 18 18 17 17 18 19 20 21 22 23 23 23 24 26 28 30 32 34 38 41 44 47 49 52 53 55 55 54 53 51 48 45 43 40
2312D0llkkjjk%j%%%%j%JJ%JJLKKLMMNNONOONLLJ%lmmonoonnnmllkkjjjjjkj%%J%JKKKLKK
2304C5LLLLLKKJJ%kjklmllklllkj%%j%%j%jj%%%%%%%%%j%%%j%j%J%%%j%%%%%%%%%%j%j%J%
2295A6j%j%%j%%J%J%jj%j%%j%%J%J%jjJ%J%%%%j%%j%%%j%j%J%%%%%j%%%Jj%J%J%%%%%%%%%
2286A1%%j%%%j%%%JJjj%%J%%%%j%%%%J%%%J%%j%%%%j%%%J%%jJ%%%%%J%%%J%%%JK%%%J%%jj
2277A4%j%j%%j%%%JJJ%J%J%J%JJK%jj%%jjkjjj%%%%j%%%%%%J%JJJJ%%jj%%j%%%%j%%%j%%j
2269A0%j%%J%j%%%%%J%%j%%J%j%J%%%%%%%%Jj%K%%%%%%%JJJJ%JJJKKKJ%J%%j%jjjkkkjjj%
2260A4j%%%%%%%%%%J%%JJJKKKKKKLKLLJJJ%%kkkklkkkkkkkjjjj%%j%%J%%%%%J%%JJJJJJJK
2251B4JJ%%%jjjjkkjjk%%j%j%j%%Jjj%%%%J%j%%j%j%%%J%%%%%%%%%j%%%%%%J%%J%j%jJJ%%
$$ plain form
2312 40 37 34 32 30 29 28 26 26 25 25 25 25 25 24 24 25 26 26 27 28 31 33 35 38 42 46 51 56 62 67 73 79 84 87 90 91 91 88 84 80 74 69 63 57 52 47 42 38 35 32 30 28 27 26 25 24 23 21 20 20 20 21 21 22 24 26 28 31 33 35
2304 35 38 41 44 47 50 52 54 55 56 56 54 53 51 48 44 41 38 36 33 30 27 25 24 24 24 23 23 23 22 22 21 20 20 20 20 20 20 20 20 20 20 19 19 19 19 18 18 17 17 18 18 18 18 17 17 17 17 17 17 17 17 17 17 17 16 16 15 15 16 16
2295 16 15 15 14 14 14 13 13 13 14 14 15 15 14 13 13 12 12 12 11 11 11 12 12 13 13 12 11 12 12 13 13 13 13 13 12 12 12 11 11 11 11 10 10 9 9 10 10 10 10 10 10 9 9 9 9 10 9 9 10 10 11 11 11 11 11 11 11 11 11 11
2286 11 11 11 10 10 10 10 9 9 9 9 10 11 10 9 9 9 10 10 10 10 10 9 9 9 9 9 10 10 10 10 11 11 11 10 10 10 10 10 9 9 9 9 10 10 10 9 10 10 10 10 10 10 11 11 11 11 12 12 12 12 13 15 15 15 15 16 16 16 15 14
2277 14 14 13 13 12 12 12 11 11 11 11 12 13 14 14 15 15 16 16 17 17 18 19 21 21 20 19 19 19 18 17 15 14 13 12 12 12 12 12 11 11 11 11 11 11 11 12 12 13 14 15 16 16 16 15 14 14 14 13 13 13 13 13 12 12 12 12 11 11 11 10
2269 10 10 9 9 9 10 10 9 9 9 9 9 9 10 10 10 9 9 9 10 10 9 9 10 10 10 10 10 10 10 10 10 11 10 10 12 12 12 12 12 12 12 12 13 14 15 16 16 17 18 19 21 23 25 26 26 27 27 27 26 26 25 24 23 21 19 17 16 15 14 14
2260 14 13 13 13 13 13 13 13 13 13 13 13 14 14 14 15 16 17 19 21 23 25 27 29 32 34 37 40 41 42 43 43 43 41 39 37 35 32 30 28 26 24 22 20 18 17 16 15 14 14 14 13 13 13 14 14 14 14 14 14 15 15 15 16 17 18 19 20 21 22 24
2251 24 25 26 26 26 26 25 24 23 22 20 18 17 16 14 14 14 13 13 12 12 11 11 11 12 11 10 10 10 10 10 11 11 10 10 10 9 9 8 8 8 8 9 9 9 9 9 9 9 9 9 9 8 8 8 8 8 8 8 9 9 9 10 10 9 9 8 9 10 10 10
2242A0%%%%jj%j%J%%J%j%%%%jJ%%%J%%j%%%%%Jj%%j%%%j%%J%%%%%%%%%%%JJj%Jjj%J%%jJ%
2233H%j%%%%%Jj%j%%%J%%%%J%%jjJJ%%%%j%%J%Jj%%%%%%%j%%%j%j%%%JjJJJ%%j%%%%%%%%%
2224G%%%j%J%%%%%J%%%j%JjjJ%%%%%%j%%%%%%Jj%%J%jJ%%%%%%%%%j%%JJ%%jjJ%%%%J%%%%%
2216HJ%Jk%%%j%%%%%%%%%JJj%%j%J%%%jj%%%%j%J%%Jj%j%JJ%j%%JJ%%%j%%%%%j%J%j%%J%%
2207G%%%j%%%%J%j%%%%J%%%%%%j%%J%%%%%%%%j%%J%j%jJJJ%%%j%%%%%%%%%Jj%%jJ%%%%%%%
2198G%%j%%%%jJ%JJj%%%%%J%jjJ%%%%j%%%%%%%%%%%%%j%%JJJ%jj%J%%j%%jJ%%%%%%%%%J%%
2189GJ%%jj%j%%jJJ%J%%j%%JjJ%j%%%J%%j%%%j%%%%%J%%%%%J%j%J%%jJ%Jj%%%%%jJ%%%j%%
2180F%%%Jj%%%%%%J%jJ%j%%%J%%%j%%j%%J%%J%%j%%%J%j%J%%j%J%J%%%%jj%%%%%%J%%J%j%
$$ plain form
2242 10 10 10 10 10 9 8 8 7 7 8 8 8 9 9 8 8 8 8 8 7 8 8 8 8 9 9 9 8 8 8 8 8 8 9 8 8 8 7 7 7 7 6 6 6 7 7 7 7 7 7 7 7 7 7 7 7 8 9 8 8 9 8 7 7 8 8 8 7 8 8
2233 8 8 7 7 7 7 7 7 8 7 7 6 6 6 6 7 7 7 7 7 8 8 8 7 6 7 8 8 8 8 8 7 7 7 8 8 9 8 8 8 8 8 8 8 8 7 7 7 7 6 6 5 5 5 5 6 5 6 7 8 8 8 7 7 7 7 7 7 7 7 7 7
2224 7 7 7 7 6 6 7 7 7 7 7 7 8 8 8 8 7 7 8 7 6 7 7 7 7 7 7 7 6 6 6 6 6 6 6 7 6 6 6 7 7 6 7 7 7 7 7 7 7 7 7 7 6 6 6 7 8 8 8 7 6 7 7 7 7 7 8 8 8 8 8 8
2216 8 9 9 10 8 8 8 8 7 7 7 7 7 7 7 7 7 7 8 9 8 8 8 7 7 8 8 8 8 7 6 6 6 6 6 5 5 6 6 6 7 6 6 5 5 6 7 7 6 6 6 7 8 8 8 8 7 7 7 7 7 7 6 6 7 7 6 6 6 7 7 7
2207 7 7 7 7 6 6 6 6 6 7 7 6 6 6 6 6 7 7 7 7 7 7 7 6 6 6 7 7 7 7 7 7 7 7 7 6 6 6 7 7 6 6 5 6 7 8 8 8 8 7 7 7 7 7 7 7 7 7 7 8 7 7 7 6 7 7 7 7 7 7 7 7
2198 7 7 7 6 6 6 6 6 5 6 6 7 8 7 7 7 7 7 7 8 8 7 6 7 7 7 7 7 6 6 6 6 6 6 6 6 6 6 6 6 6 6 5 5 5 6 7 8 8 7 6 6 7 7 7 6 6 6 5 6 6 6 6 6 6 6 6 6 6 7 7 7
2189 7 8 8 8 7 6 6 5 5 5 4 5 6 6 7 7 7 6 6 6 7 6 7 7 6 6 6 6 7 7 7 6 6 6 6 5 5 5 5 5 5 6 6 6 6 6 6 7 7 6 6 7 7 7 6 7 7 8 7 7 7 7 7 7 6 7 7 7 7 6 6 6
2180 6 6 6 6 7 6 6 6 6 6 6 6 7 7 6 7 7 6 6 6 6 7 7 7 7 6 6 6 5 5 5 6 6 6 7 7 7 6 6 6 6 7 7 6 6 7 7 7 6 6 7 7 8 8 8 8 8 7 6 6 6 6 6 6 6 7 7 7 8 8 7 7
2171Gj%%%JJ%%jJ%j%%%%jJ%%Jj%j%J%%%%%%j%J%j%%%%%J%%%%%jJ%%%jj%J%%%J%j%J%%%%%%
2162G%%%J%j%%%%%%%%%%jj%%%%%%%J%%J%%j%%%%%%%%%jJ%%%J%%%%%jj%J%%%%%%%%j%%jJ%J
2153F%%%%%%%%J%j%%JJ%jj%J%%jJ%j%%%%%%%%J%%%J%%%%%jj%J%%%%%J%%J%%%%%%J%%j%j%%
2144H%%%%%jJJ%%J%%%%%j%Jj%%j%%%%j%%%%%j%%J%J%%%%j%%%%%J%%j%j%JJ%%jj%j%J%%%jJ
2135F%J%%Jj%j%%j%%JJ%%%%jj%%JJ%%%j%%J%%%%%j%%J%%%%%%%%%%%%%%%%J%%%%%%j%%%%%%
2126Gj%%J%%%j%%%jJJ%%j%%%J%%%j%%J%%%%%j%%%%%%%jJ%%%%%%%J%%J%Jjj%%%Jj%J%%%%%%
2118H%%%j%jj%%JJ%Jjj%%%J%j%jJ%%Jj%%%%Jj%%%%%%Jj%%J%%%%%%%%%%%%%%%%j%%%%%J%%%
2109G%%%%%%%jJ%J%%%j%%%%jJJ%%%%%j%%%j%%%%%jJ%%%%%%%J%%%%%%%%%J%jjj%K%%%%%%%%
$$ plain form
2171 7 6 6 6 6 7 8 8 8 7 8 8 7 7 7 7 7 6 7 7 7 8 7 7 6 6 7 7 7 7 7 7 7 6 6 7 7 6 6 6 6 6 6 7 7 7 7 7 7 6 7 7 7 7 6 5 5 6 6 6 6 7 7 6 6 7 7 7 7 7 7 7
2162 7 7 7 7 8 8 7 7 7 7 7 7 7 7 7 7 7 6 5 5 5 5 5 5 5 5 6 6 6 7 7 7 6 6 6 6 6 6 6 6 6 6 5 6 6 6 6 7 7 7 7 7 7 6 5 5 6 6 6 6 6 6 6 6 6 5 5 5 4 5 5 6
2153 6 6 6 6 6 6 6 6 6 7 7 6 6 6 7 8 8 7 6 6 7 7 7 6 7 7 6 6 6 6 6 6 6 6 6 7 7 7 7 8 8 8 8 8 8 7 6 6 7 7 7 7 7 7 8 8 8 9 9 9 9 9 9 9 10 10 10 9 9 8 8 8
2144 8 8 8 8 8 8 7 8 9 9 9 10 10 10 10 10 10 9 9 10 9 9 9 8 8 8 8 8 7 7 7 7 7 7 6 6 6 7 7 8 8 8 8 8 7 7 7 7 7 7 8 8 8 7 7 6 6 7 8 8 8 7 6 6 5 5 6 6 6 6 5 6
2135 6 6 7 7 7 8 7 7 6 6 6 5 5 5 6 7 7 7 7 7 6 5 5 5 6 7 7 7 7 6 6 6 7 7 7 7 7 7 6 6 6 7 7 7 7 7 7 7 7 7 7 7 7 7 7 7 7 7 8 8 8 8 8 8 8 7 7 7 7 7 7 7
2126 7 6 6 6 7 7 7 7 6 6 6 6 5 6 7 7 7 6 6 6 6 7 7 7 7 6 6 6 7 7 7 7 7 7 6 6 6 6 6 6 6 6 5 6 6 6 6 6 6 6 6 7 7 7 8 8 9 8 7 7 7 7 8 7 7 8 8 8 8 8 8 8
2118 8 8 8 8 7 7 6 5 5 5 6 7 7 8 7 6 6 6 6 7 7 6 6 5 6 6 6 7 6 6 6 6 6 7 6 6 6 6 6 6 6 7 6 6 6 7 7 7 7 7 7 7 7 7 7 7 7 7 7 7 7 7 6 6 6 6 6 6 7 7 7 7
2109 7 7 7 7 7 7 7 7 6 7 7 8 8 8 8 7 7 7 7 7 6 7 8 8 8 8 8 8 7 7 7 7 6 6 6 6 6 6 5 6 6 6 6 6 6 6 6 7 7 7 7 7 7 7 7 7 7 8 8 7 6 5 5 7 7 7 7 7 7 7 7 7
2100G%%%j%J%%j%%%%J%jjjJ%%J%%jJ%%%%%%%%%%%%%%%%J%%%%%jJ%%%%jj%%%J%J%%%%%%%%J
2091H%%%jJ%%%%%j%%%%%jjJ%J%%%%j%%%%J%%jJ%%%%j%%%J%%Jjj%%J%%jj%%J%%%%%%%%%J%%
2082G%%%%%jjJ%%JjjJJ%%%jJJj%%%%J%j%%%jjJJ%Jj%%%%%%%%%%%%%%%%%%%%%%%Jj%j%%%%%
2073F%%%%J%%%%jJ%%%%j%%%%%%%J%%%j%J%Jj%%%%%j%J%%j%%%%%%%%J%%j%%%%%%%%%j%%J%%
2064F%Jj%JJ%%%j%%j%%%%%j%J%%%%%Jj%%J%j%%%%%J%%%%%jj%J%J%j%%J%j%%J%%J%%jJ%%%%
2055H%j%%%J%j%%%%JjJ%%%%j%J%%%%%%%j%%%%%%j%jJJ%j%J%%%%j%J%J%%%%%%J%%j%%%%%%%
2046HJ%%%%%%J%%%%%%%%j%%%j%j%JJ%%j%j%%%%JJ%%%jJ%JJ%%j%j%%%J%%%%%%J%%J%%%j%%%
2037A1j%%%%jJ%%%%%%%%%j%%%%%%%%%%%%jJ%%%J%JJ%%%%%%J%J%%j%jJ%j%j%J%%%jjjj%J%%
$$ plain form
2100 7 7 7 7 6 6 7 7 7 6 6 6 6 6 7 7 6 5 4 5 5 5 6 6 6 5 6 6 6 6 6 6 6 6 6 6 6 6 6 6 6 6 6 7 7 7 7 7 7 6 7 7 7 7 7 6 5 5 5 5 6 6 7 7 7 7 7 7 7 7 7 8
2091 8 8 8 8 7 8 8 8 8 8 8 7 7 7 7 7 7 6 5 6 6 7 7 7 7 7 6 6 6 6 6 7 7 7 6 7 7 7 7 7 6 6 6 6 7 7 7 8 7 6 6 6 7 7 7 6 5 5 5 6 6 6 6 6 6 6 6 6 6 7 7 7
2082 7 7 7 7 7 7 6 5 6 6 6 7 6 5 6 7 7 7 7 6 7 8 7 7 7 7 7 8 8 7 7 7 7 6 5 6 7 7 8 7 7 7 7 7 7 7 7 7 7 7 7 7 7 7 7 7 7 7 7 7 7 7 7 8 7 7 6 6 6 6 6 6
2073 6 6 6 6 6 7 7 7 7 7 6 7 7 7 7 7 6 6 6 6 6 6 6 6 7 7 7 7 6 6 7 7 8 7 7 7 7 7 7 6 6 7 7 7 6 6 6 6 6 6 6 6 6 7 7 7 6 6 6 6 6 6 6 6 6 6 5 5 5 6 6 6
2064 6 6 7 6 6 7 8 8 8 8 7 7 7 6 6 6 6 6 6 5 5 6 6 6 6 6 6 7 6 6 6 7 7 6 6 6 6 6 6 7 7 7 7 7 7 6 5 5 6 6 7 7 6 6 6 7 7 6 6 6 7 7 7 8 8 8 7 8 8 8 8 8
2055 8 8 7 7 7 7 8 8 7 7 7 7 7 8 7 8 8 8 8 8 7 7 8 8 8 8 8 8 8 8 7 7 7 7 7 7 7 6 6 5 6 7 7 6 6 7 7 7 7 7 6 6 7 7 8 8 8 8 8 8 8 9 9 9 8 8 8 8 8 8 8 8
2046 8 9 9 9 9 9 9 9 10 10 10 10 10 10 10 10 10 9 9 9 9 8 8 7 7 8 9 9 9 8 8 7 7 7 7 7 8 9 9 9 9 8 9 9 10 11 11 11 10 10 9 9 9 9 10 10 10 10 10 10 10 11 11 11 12 12 12 12 11 11 11 11
2037 11 10 10 10 10 10 9 10 10 10 10 10 10 10 10 10 10 9 9 9 9 9 9 9 9 9 9 9 9 9 8 9 9 9 9 10 10 11 12 12 12 12 12 12 12 13 13 14 14 14 13 13 12 13 13 12 12 11 11 12 12 12 12 11 10 9 8 8 9 9 9
2029Ij%%%%%J%j%J%%%%j%%%%J%JJ%%%%%j%%%%%%J%%j%%%%%j%JJ%j%%%%%%jjjJ%%%%J%j%%%
2020H%%Jj%%%%%%J%J%%%%%j%j%%J%J%j%%%jjJ%%%%%jjjJJj%JJ%j%%j%J%%%J%%%j%%J%%%%%
2011H%%j%J%J%%j%%J%%%%%J%%j%%%%%j%j%%%J%%%j%%%%%Jj%%%%%J%%%%%jj%%%%JJj%%jJ%%
2002GJj%%%%%%%%%J%%%%J%%jjJ%J%%jjjJ%%%%J%%%j%%%%%%%j%%JJ%%%%%%%jj%%%J%%%J%%j
1993G%J%%jjJ%%JjjJ%%%%Jj%%Jj%jJ%%%%j%J%%%%%J%%%%%%j%%%%J%%Jjj%J%%Jj%%%Jj%j%J
1984H%j%J%%J%%%%j%%%%J%%%j%%%J%%j%%%%%j%%%%J%j%%%J%%%%%%%%%Jj%%j%%%%%jJJ%jJ%
1975H%%%j%%%Jj%J%%%%%%%%%j%%%%jJ%%%%Jj%%%J%%J%%%j%%%%%%%%%%%%%j%%J%%%%Jj%%%%
1966H%%%%jJ%%%J%%%jjJ%%Jj%%%%J%%%Jjjj%%J%%%j%%%%%%%%%%J%%J%%%%%%j%%%%%J%jjJ%
$$ plain form
2029 9 8 8 8 8 8 8 9 9 8 8 9 9 9 9 9 8 8 8 8 8 9 9 10 11 11 11 11 11 11 10 10 10 10 10 10 10 11 11 11 10 10 10 10 10 10 9 9 10 11 11 10 10 10 10 10 10 10 9 8 7 8 8 8 8 8 9 9 8 8 8 8
2020 8 8 8 9 8 8 8 8 8 8 8 9 9 10 10 10 10 10 10 9 9 8 8 8 9 9 10 10 9 9 9 9 8 7 8 8 8 8 8 8 7 6 5 6 7 6 6 7 8 8 7 7 7 6 6 7 7 7 7 8 8 8 8 7 7 7 8 8 8 8 8 8
2011 8 8 8 7 7 8 8 9 9 9 8 8 8 9 9 9 9 9 9 10 10 10 9 9 9 9 9 9 8 8 7 7 7 7 8 8 8 8 7 7 7 7 7 7 8 7 7 7 7 7 7 8 8 8 8 8 8 7 6 6 6 6 6 7 8 7 7 7 6 7 7 7
2002 7 8 7 7 7 7 7 7 7 7 7 7 8 8 8 8 8 9 9 9 8 7 8 8 9 9 9 8 7 6 7 7 7 7 7 8 8 8 8 7 7 7 7 7 7 7 7 6 6 6 7 8 8 8 8 8 8 8 8 7 6 6 6 6 7 7 7 7 8 8 8 7
1993 7 7 8 8 8 7 6 7 7 7 8 7 6 7 7 7 7 7 8 7 7 7 8 7 7 6 7 7 7 7 7 6 6 7 7 7 7 7 7 8 8 8 8 8 8 8 7 7 7 7 7 8 8 8 9 8 7 7 8 8 8 9 8 8 8 8 9 8 8 7 7 8
1984 8 8 7 7 8 8 8 9 9 9 9 9 8 8 8 8 8 9 9 9 9 8 8 8 8 9 9 9 8 8 8 8 8 8 7 7 7 7 7 8 8 7 7 7 7 8 8 8 8 8 8 8 8 8 8 9 8 8 8 7 7 7 7 7 7 6 7 8 8 7 8 8
1975 8 8 8 8 7 7 7 7 8 7 7 8 8 8 8 8 8 8 8 8 8 7 7 7 7 7 6 7 7 7 7 7 8 7 7 7 7 8 8 8 9 9 9 9 8 8 8 8 8 8 8 8 8 8 8 8 8 8 7 7 7 8 8 8 8 8 9 8 8 8 8 8
1966 8 8 8 8 8 7 8 8 8 8 9 9 9 9 8 7 8 8 8 9 8 8 8 8 8 9 9 9 9 10 9 8 7 7 7 8 8 8 8 7 7 7 7 7 7 7 7 7 7 7 8 8 8 9 9 9 9 9 9 9 8 8 8 8 8 8 9 9 8 7 8 8
1957H%J%%%%%%%jjJ%%%%%%%%J%%%%jJ%%j%%%J%%%%%%%%%%%%%%JJj%J%j%j%%J%J%%J%%Jj%j
1948A1j%%J%%%j%j%%J%jJJ%%j%jj%%%%%J%%JJjj%%%%%%%%J%j%%%%j%%J%J%%%j%%%%%%j%%%
1940H%%j%%J%%%J%%%%%%j%%J%%j%J%Jjj%%%J%J%%jjJ%%j%%%J%%%%%%%j%jJJ%J%j%Jj%%j%%
1931HJ%J%%%j%%%%%%%%%%%%%J%%%%j%%%%jjJJ%j%%%Jj%%J%%%%JJj%%%J%%%%%j%%%%%%%j%%
1922IJ%%%%%%j%%%%%J%Jj%j%%%%JJj%%%j%%%J%%%%%%%j%%J%%%%%%JJ%%j%%%%%%%j%%J%%%%
1913A1j%%%J%%%%%j%j%%%%J%%J%%%%jJ%j%%jJ%%%%%%%%%%jJ%%%%%J%%J%J%%%j%%%Jjj%%%%
1904A1%%%%%J%%%%jj%%%%%%%%%%%%J%%%%%%%%jJ%J%%%%j%J%%%j%%%%%%j%J%J%%%J%%j%%%j
1895A1%%%J%%%%%jJ%%J%%%j%%%%j%%%%%%%%J%%%%%%Jj%%%%j%%j%J%J%%%%j%%%J%%%jj%j%%
$$ plain form
1957 8 8 9 9 9 9 9 9 9 9 8 7 8 8 8 8 8 8 8 8 8 9 9 9 9 9 8 9 9 9 8 8 8 8 9 9 9 9 9 9 9 9 9 9 9 9 9 9 9 10 11 10 10 11 11 10 10 9 9 9 10 10 11 11 11 12 12 12 13 12 12 11
1948 11 10 10 10 11 11 11 11 10 10 9 9 9 10 10 9 10 11 11 11 10 10 9 8 8 8 8 8 8 9 9 9 10 11 10 9 9 9 9 9 9 9 9 9 10 10 9 9 9 9 9 8 8 8 9 9 10 10 10 10 9 9 9 9 9 9 9 8 8 8 8
1940 8 8 8 7 7 7 8 8 8 8 9 9 9 9 9 9 9 8 8 8 9 9 9 8 8 9 9 10 9 8 8 8 8 9 9 10 10 10 9 8 9 9 9 8 8 8 8 9 9 9 9 9 9 9 9 8 8 7 8 9 9 10 10 9 9 10 9 9 9 8 8 8
1931 8 9 9 10 10 10 10 9 9 9 9 9 9 9 9 9 9 9 9 9 9 10 10 10 10 10 9 9 9 9 9 8 7 8 9 9 8 8 8 8 9 8 8 8 9 9 9 9 9 10 11 10 10 10 10 11 11 11 11 11 11 10 10 10 10 10 10 10 10 9 9 9
1922 9 10 10 10 10 10 10 10 9 9 9 9 9 9 10 10 11 10 10 9 9 9 9 9 10 11 10 10 10 10 9 9 9 9 10 10 10 10 10 10 10 10 9 9 9 10 10 10 10 10 10 10 11 12 12 12 11 11 11 11 11 11 11 11 10 10 10 11 11 11 11 11
1913 11 10 10 10 10 11 11 11 11 11 11 10 10 9 9 9 9 9 10 10 10 11 11 11 11 11 10 11 11 10 10 10 9 10 10 10 10 10 10 10 10 10 10 10 9 10 10 10 10 10 10 11 11 11 12 12 13 13 13 13 12 12 12 12 13 12 11 11 11 11 11
1904 11 11 11 11 11 11 12 12 12 12 12 11 10 10 10 10 10 10 10 10 10 10 10 10 10 11 11 11 11 11 11 11 11 11 10 11 11 12 12 12 12 12 11 11 12 12 12 12 11 11 11 11 11 11 11 10 10 11 11 12 12 12 12 13 13 13 12 12 12 12 11
1895 11 11 11 11 12 12 12 12 12 12 11 12 12 12 13 13 13 13 12 12 12 12 12 11 11 11 11 11 11 11 11 11 12 12 12 12 12 12 12 13 12 12 12 12 12 11 11 11 10 10 11 11 12 12 12 12 12 11 11 11 11 12 12 12 12 11 10 10 9 9 9
1887IJJ%%Jj%j%%%%J%j%J%%%%Jj%%%%%j%JJ%%%%%%%j%J%J%Jj%%J%%%j%jJ%%j%%%%%%%%%%%
1878A2jJ%%jJ%J%%j%%%%%%%J%Jj%%%%%%%%%J%%%%%%%%%%%%%J%J%jj%%%j%%%%%%%%J%%%%%%
1869A4j%J%Jj%j%J%%%J%%%j%%%J%j%%j%J%%%J%j%%Jj%%%%J%%%%%%%j%%%%j%JJ%%%%%j%%J%
1860A5%J%%J%%%%JJ%j%%%J%j%jjjJ%%%%%%J%j%%JJ%%%%%%%%%%%%j%j%%%%%%JJ%j%%%%%%J%
1851A8%jj%%%%%Jj%%j%%%%J%%J%Jj%J%j%%%%%%J%%%J%JjJj%%%%%%%J%J%%%%%%%%j%%%%%J%
1843B1jj%J%%jJ%%%J%jj%JJJ%jj%j%JJJJ%%j%J%%%%J%%%%J%%JKJ%JJJ%JJJK%j%%%JJJ%%%%
1834C9%J%j%%%%%%jjj%%jj%%%%%%%j%j%%%J%%%%%j%%%%J%JJJK%JKKKKKMNMMMMMLMMMLMKLL
1825A08LLJJ%%%kkklkkllkklljklkkjjjjjJ%%%jj%%%%j%jjjjjjj%%jjjljjjjjjjj%%%j%%%
$$ plain form
1887 9 10 11 11 11 12 11 11 10 10 10 10 10 11 11 10 10 11 11 11 11 11 12 11 11 11 11 11 11 10 10 11 12 12 12 12 12 12 12 12 11 11 12 12 13 13 14 13 13 13 14 14 14 14 13 13 12 13 13 13 12 12 12 12 12 12 12 12 12 12 12 12
1878 12 11 12 12 12 11 12 12 13 13 13 12 12 12 12 12 12 12 12 13 13 14 13 13 13 13 13 13 13 13 13 13 14 14 14 14 14 14 14 14 14 14 14 14 14 14 15 15 16 16 15 14 14 14 14 13 13 13 13 13 13 13 13 13 14 14 14 14 14 14 14
1869 14 13 13 14 14 15 14 14 13 13 14 14 14 14 15 15 15 15 14 14 14 14 15 15 14 14 14 13 13 14 14 14 14 15 15 14 14 14 15 14 14 14 14 14 15 15 15 15 15 15 15 15 14 14 14 14 14 13 13 14 15 15 15 15 15 15 14 14 14 15 15
1860 15 15 16 16 16 17 17 17 17 17 18 19 19 18 18 18 18 19 19 18 18 17 16 15 16 16 16 16 16 16 16 17 17 16 16 16 17 18 18 18 18 18 18 18 18 18 18 18 18 18 17 17 16 16 16 16 16 16 16 17 18 18 17 17 17 17 17 17 17 18 18
1851 18 18 17 16 16 16 16 16 16 17 16 16 16 15 15 15 15 15 16 16 16 17 17 18 17 17 18 18 17 17 17 17 17 17 17 18 18 18 18 19 19 20 19 20 19 19 19 19 19 19 19 19 20 20 21 21 21 21 21 21 21 21 21 20 20 20 20 20 20 21 21
1843 21 20 19 19 20 20 20 19 20 20 20 20 21 21 20 19 19 20 21 22 22 21 20 20 19 19 20 21 22 23 23 23 22 22 23 23 23 23 23 24 24 24 24 24 25 25 25 26 28 29 29 30 31 32 32 33 34 35 37 37 36 36 36 36 37 38 39 39 39 39 39
1834 39 39 40 40 39 39 39 39 39 39 39 38 37 36 36 36 35 34 34 34 34 34 34 34 34 33 33 32 32 32 32 33 33 33 33 33 33 32 32 32 32 32 33 33 34 35 36 38 38 39 41 43 45 47 49 53 58 62 66 70 74 78 81 85 89 93 96 100 102 105 108
1825 108 111 114 115 116 116 116 116 114 112 110 107 105 103 100 97 95 93 90 87 86 84 81 79 77 76 75 74 73 72 73 73 73 73 72 71 71 71 71 71 70 70 69 68 67 66 65 64 63 63 63 62 61 60 57 56 55 54 53 52 51 50 49 49 49 49 48 48 48 48
1816D8j%J%%%JJ%%JJKKKKKLNONNPOPQRRQQPPPPPPNMMJK%jlmnnnopopoppppqoonnmlmllkjk
1808G1jj%jkjjj%%jjj%kj%jjjjjjj%%jjj%j%%%%%j%%%j%%%J%JJ%%KJKJKLLKMLLMLMMNLLMM
1799A07LLLKJJ%%jkjjjlmmllmlmmmmllkkkjlkjj%jjj%%jj%%%%jj%%kj%%%%%jJ%j%%%%%%%J
1790D4J%Jj%%%%JjJ%%JJ%JJ%J%%J%%%%j%jjJ%%%%j%%j%j%J%j%j%JJJ%jJJJJKJKKJKJJ%JJJ
1781F7%%JJ%J%J%j%%%JjjjjJ%J%%%j%%%%%%%J%JJKJJJJJJJKJKKKJKJ%%KJK%JKJJ%J%J%%JJ
1773A07%jJ%%%%%J%%JJJJJJJJKJ%LKKKKKKKJLKKJKKJKJJ%JKJKKJJKJKKLKKKKLKLLLLMLLLM
1764B16MMLMLLMMLMMLMLLKLLLMLMMLMMNNNNONOOOPPQQRQRQJ0J2J1J1J4J3J4J5J6J6J8J9K1
1757F09K2K3K4K6K7L0L2L5L7M0M4M7N2N8O4P3Q2R2J05J20J38J60J84K13K48K86L28L77M30
$$ plain form
1816 48 47 47 48 48 48 48 49 50 50 50 51 52 54 56 58 60 62 65 70 76 81 86 93 99 106 114 123 132 140 148 155 162 169 176 183 190 195 199 203 204 206 206 205 202 198 193 188 183 177 170 164 157 151 144 137 130 123 115 109 103 98 93 89 86 82 79 76 74 73 71
1808 71 70 69 69 68 66 65 64 63 63 63 62 61 60 60 58 57 57 56 55 54 53 52 51 50 50 50 49 48 47 47 46 46 46 46 46 46 45 45 45 45 44 44 44 44 45 45 46 47 47 47 49 50 52 53 55 58 61 63 67 70 73 77 80 84 88 93 96 99 103 107
1799 107 110 113 116 118 119 120 120 120 119 117 116 115 114 111 107 103 100 97 93 90 86 82 78 74 71 68 66 64 62 61 58 56 55 54 54 53 52 51 51 51 50 49 49 49 49 49 48 47 47 47 45 44 44 44 44 44 44 43 44 44 43 43 43 43 43 43 43 43 44
1790 44 45 45 46 45 45 45 45 45 46 45 46 46 46 47 48 48 49 50 50 51 51 51 52 52 52 52 52 51 51 50 49 50 50 50 50 50 49 49 49 48 48 47 47 48 48 47 47 46 46 47 48 49 49 48 49 50 51 52 54 55 57 59 60 62 63 64 64 65 66 67
1781 67 67 67 68 69 69 70 70 71 71 70 70 70 70 71 70 69 68 67 68 68 69 69 69 69 68 68 68 68 68 68 68 68 69 69 70 71 73 74 75 76 77 78 79 80 82 83 85 87 89 90 92 93 93 93 95 96 98 98 99 101 102 103 103 104 104 105 105 105 106 107
1773 107 107 106 107 107 107 107 107 107 108 108 108 109 110 111 112 113 114 115 116 118 119 119 122 124 126 128 130 132 134 136 137 140 142 144 145 147 149 150 152 153 154 154 155 157 158 160 162 163 164 166 167 169 171 174 176 178 180 182 185 187 190 193 196 199 203 206 209 212 216
1764 216 220 224 227 231 234 237 241 245 248 252 256 259 263 266 269 271 274 277 280 284 287 291 295 298 302 306 311 316 321 326 332 337 343 349 355 362 369 377 385 394 402 411 419 429 441 452 463 477 490 504 519 535 551 569 588 609
1757 609 631 654 678 704 731 761 793 828 865 905 949 996 1048 1106 1170 1243 1325 1417 1522 1642 1780 1940 2124 2337 2585 2871 3199 3576 4006
1753D006M86N44O02O56P02P37P57P64P59P45P28P09O94O77O54O21N69M91L92K72J42Rj16k28
1750A6372l22l97m57n06n47n81o15o43o69o89p03p08p06o93o72o41o02n56n07m55m04l56l12
1747C631k72k38k08j82j61j42j26j12j00r0q0p1o4n6n0m3l7l2k7k1j6j3rl%NQJ2J5J9K3K7
1743A587L1L4L7M3M8N3N9O4P4Q1R1J02J14J29J47J67J90K19K52K93L40L95M58N32O16P10Q14
1740G680R25J044J163J276J380J458J507J523J508J469J418J368J323J287J252J204J125J001
1738C0911Q25O03L47Q1j78m12o08p65q83r75j050j114j176j237j295j343j384j409j420j410
1735A6108j380j329j260j174j074r69q62p58o64n80n07m43l89l43l05k72k46k23k01j82j66
1732B781j52j39j28j16j08r9q9q1p4o7o0n5m7m3l8l3k7k4k1j7j4j0nmJMQJ2J6K0K4L0L6M2
$$ plain form
1753 4006 4492 5036 5638 6294 6996 7733 8490 9254 10013 10758 11486 12195 12889 13566 14220 14841 15410 15901 16293 16565 16707 16716 16600 16372
1750 16372 16050 15653 15196 14690 14143 13562 12947 12304 11635 10946 10243 9535 8829 8136 7464 6823 6221 5665 5158 4703 4299 3943 3631
1747 3631 3359 3121 2913 2731 2570 2428 2302 2190 2090 2000 1920 1849 1785 1729 1679 1636 1599 1567 1540 1519 1503 1490 1481 1478 1478 1483 1491 1503 1518 1537 1560 1587
1743 1587 1618 1652 1689 1732 1780 1833 1892 1956 2030 2111 2202 2304 2418 2547 2694 2861 3051 3270 3522 3815 4155 4550 5008 5540 6156 6866 7680
1740 7680 8605 9649 10812 12088 13468 14926 16433 17956 19464 20933 22351 23719 25042 26329 27581 28785 29910 30911
1738 30911 31736 32339 32686 32767 32589 32177 31569 30804 29921 28946 27896 26782 25606 24369 23074 21731 20347 18938 17518 16108
1735 16108 14728 13399 12139 10965 9891 8922 8060 7302 6638 6058 5551 5108 4719 4376 4071 3799 3553 3330 3129 2947 2781
1732 2781 2629 2490 2362 2246 2138 2039 1950 1869 1795 1728 1668 1613 1566 1523 1485 1452 1425 1401 1380 1363 1349 1339 1334 1330 1331 1335 1343 1355 1371 1391 1415 1445 1481 1523
1728A523N2O1P2Q4J02J19J42J65J97K31K72L15L66M23M82N43O07O64P15P53P75P81P74P57
1725A0975P36P15O98O81O61O29N75M96L89K61J20k4j59k76l74m50n08n54n92o24o53o81p05
1722A1336p25p38p42p38p24o99o63o20n69n15m59m05l54l08k69k35k04j80j59j42j28j16j04
1719A540r5q8q1p4o8o4n9n5n2m8m4m2l8l6l3l1k9k6k5k4k2k1j9j7j7j6j5j4j3j3j3j2j0j1
1715C15j0qrqqppponoomnmlmmlmklkjlmllkllllllllklmmmklklkkmlkkkljjkjkjj%jjj%jj
1707H9%%%%J%%%%%%%j%%%j%jjjjjjjkjk%%jjjjjk%%J%JJLKKKKKLKKLLLLLJK%%jkjjkjkjkj
1698I6kklllklklkkljjkkjk%jjjjkjjj%%%jj%%%%J%JJJJ%JJJJKJK%JKJJJ%J%Jj%%%j%%j%%
1689F5%%JJJK%J%JJJJKJJJJJ%jjjjjjj%j%%%kkkjj%j%j%jj%jjjjJ%JjjJ%%%%%%%%%%j%%J%
$$ plain form
1728 1523 1575 1636 1708 1792 1894 2013 2155 2320 2517 2748 3020 3335 3701 4124 4606 5149 5756 6420 7135 7888 8663 9444 10218 10975
1725 10975 11711 12426 13124 13805 14466 15095 15670 16166 16555 16816 16936 16912 16753 16477 16103 15653 15145 14591 13999 13375 12722 12041 11336
1722 11336 10611 9873 9131 8393 7669 6970 6307 5687 5118 4603 4144 3739 3385 3077 2808 2573 2369 2189 2030 1888 1760 1644 1540
1719 1540 1445 1357 1276 1202 1134 1070 1011 956 904 856 812 770 732 696 663 632 603 577 552 528 506 485 466 449 432 416 401 387 374 361 348 336 326 315
1715 315 305 297 288 280 272 265 258 251 245 240 234 228 224 219 215 212 208 204 201 197 195 192 190 189 186 182 179 176 174 171 168 165 162 159 156 153 150 148 145 141 137 133 131 128 126 123 121 119 115 112 110 108 106 103 102 101 99 98 96 95 94 94 93 92 91 91 90 89
1707 89 89 89 89 89 90 90 90 90 90 90 90 90 89 89 89 89 88 88 87 86 85 84 83 82 81 79 78 76 76 76 75 74 73 72 71 69 69 69 70 70 71 72 75 77 79 81 83 85 88 90 92 95 98 101 104 107 108 110 110 110 109 107 106 105 103 102 100 99 97 96
1698 96 94 92 89 86 83 81 78 76 73 71 69 66 65 64 62 60 59 57 57 56 55 54 53 51 50 49 48 48 48 48 47 46 46 46 46 46 47 47 48 49 50 51 51 52 53 54 55 57 58 60 60 61 63 64 65 66 66 67 67 68 67 67 67 67 66 66 66 65 65 65
1689 65 65 65 66 67 68 70 70 71 71 72 73 74 75 77 78 79 80 81 82 82 81 80 79 78 77 76 75 75 74 74 74 74 72 70 68 67 66 66 65 65 64 64 63 62 62 61 60 59 58 59 59 60 59 58 59 59 59 59 59 59 59 59 59 59 59 58 58 58 59 59
1680E9KJJJJJJ%JJ%JKJKJKKKJJKKJLKLLMLNMLMLMMLMLLMKJJ%%jlkkjllllmklmmmlllllkjk
1671I3jjkjjj%%%%j%j%j%%jJ%%JJ%%%jJJ%%%%%%J%%J%JJ%J%%JK%JJKKJKKKLNNNNNPQQQQQQ
1663A90RPPPQOOONMLJjklmnnppppppqpqpqpponmmnmklkkkkkjkjjk%%%%j%jjjjJ%%%%j%%%%
1654I0%%%%%%%%j%%%%%J%J%%J%JJ%%JJLKLLMMLMMMMMLLMLLKKL%%jjjklkmlmmmmmmmmmmmmm
1645I2lkljjjkjkjkjjj%jj%j%%kjjj%%%%%%kj%%j%%j%%%%%%jj%%%%jj%%%%j%%%jj%j%J%%j
1636D9%j%%j%%jj%%%%%j%j%%j%%jJ%%%jjj%%j%j%%%%%%jjjj%%%j%%%k%J%%%%%jj%%%%Jj%%
1628B9%%j%%%j%%%%J%j%%%%J%jjjJ%%%%j%%j%%%%%j%jJjj%jJ%%J%%jk%%%%%j%%%%jj%%%%%
1619A6j%J%%j%%%%%%j%%j%jJ%J%j%j%J%j%Jj%%J%%jj%%J%%jJ%%j%Jj%%%jJJ%%j%%%j%J%J%
$$ plain form
1680 59 61 62 63 64 65 66 67 67 68 69 69 70 72 73 75 76 78 80 82 83 84 86 88 89 92 94 97 100 104 107 112 116 119 123 126 130 134 137 141 144 147 151 153 154 155 155 155 154 151 149 147 146 143 140 137 134 130 128 125 121 117 113 110 107 104 101 98 96 95 93
1671 93 92 91 89 88 87 86 86 86 86 86 85 85 84 84 83 83 83 82 83 83 83 84 85 85 85 85 84 85 86 86 86 86 86 86 86 87 87 87 88 88 89 90 90 91 91 91 92 94 94 95 96 98 100 101 103 105 107 110 115 120 125 130 135 142 150 158 166 174 182 190
1663 190 199 206 213 220 228 234 240 246 251 255 258 259 258 256 253 249 244 239 232 225 218 211 204 197 189 182 174 167 159 152 145 139 134 130 126 121 117 115 112 110 108 106 104 102 101 99 98 97 95 95 95 95 95 94 94 93 92 91 90 91 91 91 91 91 90 90 90 90 90
1654 90 90 90 90 90 90 90 90 90 89 89 89 89 89 89 90 90 91 91 91 92 92 93 94 94 94 95 96 99 101 104 107 111 115 118 122 126 130 134 138 141 144 148 151 154 156 158 161 161 161 160 159 158 156 153 151 147 144 140 136 132 128 124 120 116 112 108 104 100 96 92
1645 92 89 87 84 83 82 81 79 78 76 75 73 72 71 70 70 69 68 68 67 67 67 65 64 63 62 62 62 62 62 62 62 60 59 59 59 58 58 58 57 57 57 57 57 57 57 56 55 55 55 55 55 54 53 53 53 53 53 52 52 52 52 51 50 50 49 49 50 50 50 49
1636 49 49 48 48 48 47 47 47 46 45 45 45 45 45 45 44 44 43 43 43 42 42 42 41 42 42 42 42 41 40 39 39 39 38 38 37 37 37 37 37 37 37 36 35 34 33 33 33 33 32 32 32 32 30 30 31 31 31 31 31 31 30 29 29 29 29 29 30 29 29 29
1628 29 29 29 28 28 28 28 27 27 27 27 27 28 28 27 27 27 27 27 28 28 27 26 25 26 26 26 26 26 25 25 25 24 24 24 24 24 24 23 23 22 23 22 21 21 20 21 21 21 22 22 22 21 19 19 19 19 19 19 18 18 18 18 18 17 16 16 16 16 16 16
1619 16 15 15 16 16 16 15 15 15 15 15 15 15 14 14 14 13 13 12 13 13 14 14 13 13 12 12 13 13 12 12 13 12 12 12 13 13 13 12 11 11 11 12 12 12 11 12 12 12 11 11 12 11 11 11 11 10 11 12 12 12 11 11 11 11 10 10 11 11 12 12
1610A2J%j%%j%%%%%j%%%j%%%j%jJ%JJ%%Jj%j%%%%%J%j%%%%j%%%%%%%j%%j%J%%%%J%j%%j%%
1601F%%%%Jj%%j%J%%J%jj%%%J%%j%%%JJj%%%%%%%%j%%J%%%j%%%JjjJJ%jj%JJ%%%%Jj%%%%j
1592E%%Jj%%%%%%%%jJ%%%%%%%%j%%J%J%%jj%J%%%%%%J%%j%%%%%%%%%j%J%j%%%%%%%%JjJ%%
1584EjJ%J%%%%%J%J%JJJJJJJ%%j%Jjjj%%jkjjJj%%jJ%%Jj%%%%%%j%%JJ%%%J%%%%J%%%j%J%
1575A0%J%%%%%J%jKJJJ%J%%%%JKJJJJJJ%JJKJJJ%KJ%%J%%%%%%jJ%j%jj%%jjjjkkjj%j%j%j
1566B1j%j%jjjj%j%%%jj%jj%%%Jjjj%%%%%J%%jj%%j%j%j%%%j%%%%%%%%%%%jJ%%j%%j%%%%J
1557B%%J%%%%%%j%%J%%j%%%%%j%Jj%%J%%%j%%J%j%%%%%J%%%j%J%%j%%%%j%%J%%J%%%%%jj%
1548@Jj%%%%%%J%Jjj%j%%j%J%JJj%%%%%%%%%%%%J%%%j%%%%J%%j%%JjJJjj%%%%J%%%%Jj%%%
$$ plain form
1610 12 13 13 12 12 12 11 11 11 11 11 11 10 10 10 10 9 9 9 9 8 8 7 8 8 9 10 10 10 11 10 10 9 9 9 9 9 9 10 10 9 9 9 9 9 8 8 8 8 8 8 8 8 7 7 7 6 6 7 7 7 7 7 8 8 7 7 7 6 6 6
1601 6 6 6 6 6 7 6 6 6 5 5 6 6 6 7 7 6 5 5 5 5 6 6 6 5 5 5 5 6 7 6 6 6 6 6 6 6 6 6 5 5 5 6 6 6 6 5 5 5 5 6 5 4 5 6 6 5 4 4 5 6 6 6 6 6 7 6 6 6 6 6 5
1592 5 5 5 6 5 5 5 5 5 5 5 5 5 4 5 5 5 5 5 5 5 5 5 4 4 4 5 5 6 6 6 5 4 4 5 5 5 5 5 5 5 6 6 6 5 5 5 5 5 5 5 5 5 5 4 4 5 5 4 4 4 4 4 4 4 4 4 5 4 5 5 5
1584 5 4 5 5 6 6 6 6 6 6 7 7 8 8 9 10 11 12 13 14 15 15 15 14 14 15 14 13 12 12 12 11 9 8 7 8 7 7 7 6 7 7 7 8 7 7 7 7 7 7 7 6 6 6 7 8 8 8 8 9 9 9 9 9 10 10 10 10 9 9 10 10
1575 10 10 11 11 11 11 11 11 12 12 11 13 14 15 16 16 17 17 17 17 17 18 20 21 22 23 24 25 26 26 27 28 30 31 32 33 33 35 36 36 36 37 37 37 37 37 37 37 36 37 37 36 36 35 34 34 34 33 32 31 30 28 26 25 24 24 23 23 22 22 21
1566 21 20 20 19 19 18 17 16 15 15 14 14 14 14 13 12 12 11 10 10 10 10 11 10 9 8 8 8 8 8 8 9 9 9 8 7 7 7 6 6 5 5 4 4 4 4 3 3 3 3 3 3 3 3 3 3 3 3 2 3 3 3 2 2 2 1 1 1 1 1 2
1557 2 2 2 3 3 3 3 3 3 3 2 2 2 3 3 3 2 2 2 2 2 2 1 1 2 1 1 1 2 2 2 2 1 1 1 2 2 1 1 1 1 1 1 2 2 2 2 1 1 2 2 2 1 1 1 1 1 0 0 0 1 1 1 2 2 2 2 2 2 1 0 0
1548 0 1 0 0 0 0 0 0 0 1 1 2 1 0 0 -1 -1 -1 -2 -2 -1 -1 0 1 0 0 0 0 0 0 0 0 0 0 0 0 0 1 1 1 1 0 0 0 0 0 1 1 1 0 0 0 1 0 1 2 1 0 0 0 0 0 1 1 1 1 1 2 1 1 1 1
1539Aj%jj%JJJ%j%j%%J%%%%%%j%%%%%%%%%%%%%%%%%%K%%j%%%%%%j%j%%Jj%%%%%JJ%j%JJ%%
1530Aj%%%%%J%j%J%%%%%j%%Jj%%J%%%%j%j%%J%%%%j%%Jjj%J%%%%%j%%%%%J%%J%j%%%J%%j%
1521a%%%%%%J%%JJj%jJ%%%%%jj%%%%%%%J%%%%%%%%%jj%J%%J%%%jJ%JJjj%%j%%JJ%%%jj%%J
1513@J%%j%%%j%%J%%j%%J%J%%%j%%%%J%%%%j%%J%%%%%j%%%%j%%%%%j%%%J%%%J%%%j%Jj%%j
1504bJ%%%%%%JjJJj%jJJj%%%%%%%j%%%%%%J%%j%%%%%J%%jJ%%%%jJ%%%%%%%%%%%%%%%%%jjj
1495c%%%J%J%%J%%j%%jJ%%%%%%%%j%jJJj%%%%J%%%%%%%Jj%%%%%%J%%%j%%%Jj%%%%J%%%j%J
1486@j%%%JJ%%j%%j%%j%JJj%j%J%%jJ%%jJ%%%j%J%%%%J%%%%J%%J%%jj%%J%%%%%jj%%JJjj%
1477a%%%%j%%%%%%j%J%%%%JJj%%%%J%%J%jJ%%j%jj%%%JJ%%%j%J%%%%j%%%%%%%%%%%%%%%%%
$$ plain form
1539 1 0 0 -1 -2 -2 -1 0 1 1 0 0 -1 -1 -1 0 0 0 0 0 0 0 -1 -1 -1 -1 -1 -1 -1 -1 -1 -1 -1 -1 -1 -1 -1 -1 -1 -1 -1 1 1 1 0 0 0 0 0 0 0 -1 -1 -2 -2 -2 -1 -2 -2 -2 -2 -2 -2 -1 0 0 -1 -1 0 1 1 1
1530 1 0 0 0 0 0 0 1 1 0 0 1 1 1 1 1 1 0 0 0 1 0 0 0 1 1 1 1 1 0 0 -1 -1 -1 0 0 0 0 0 -1 -1 -1 0 -1 -2 -2 -1 -1 -1 -1 -1 -1 -2 -2 -2 -2 -2 -2 -1 -1 -1 0 0 -1 -1 -1 -1 0 0 0 -1 -1
1521 -1 -1 -1 -1 -1 -1 -1 0 0 0 1 2 1 1 0 1 1 1 1 1 1 0 -1 -1 -1 -1 -1 -1 -1 -1 0 0 0 0 0 0 0 0 0 0 -1 -2 -2 -1 -1 -1 0 0 0 0 -1 0 0 1 2 1 0 0 0 -1 -1 -1 0 1 1 1 1 0 -1 -1 -1 0
1513 0 1 1 1 0 0 0 0 -1 -1 -1 0 0 0 -1 -1 -1 0 0 1 1 1 1 0 0 0 0 0 1 1 1 1 1 0 0 0 1 1 1 1 1 1 0 0 0 0 0 -1 -1 -1 -1 -1 -1 -2 -2 -2 -2 -1 -1 -1 -1 0 0 0 0 -1 -1 0 -1 -1 -1 -2
1504 -2 -1 -1 -1 -1 -1 -1 -1 0 -1 0 1 0 0 -1 0 1 0 0 0 0 0 0 0 0 -1 -1 -1 -1 -1 -1 -1 0 0 0 -1 -1 -1 -1 -1 -1 0 0 0 -1 0 0 0 0 0 -1 0 0 0 0 0 0 0 0 0 0 0 0 0 0 0 0 0 0 -1 -2 -3
1495 -3 -3 -3 -3 -2 -2 -1 -1 -1 0 0 0 -1 -1 -1 -2 -1 -1 -1 -1 -1 -1 -1 -1 -1 -2 -2 -3 -2 -1 -2 -2 -2 -2 -2 -1 -1 -1 -1 -1 -1 -1 -1 0 -1 -1 -1 -1 -1 -1 -1 0 0 0 0 -1 -1 -1 -1 0 -1 -1 -1 -1 -1 0 0 0 0 -1 -1 0
1486 0 -1 -1 -1 -1 0 1 1 1 0 0 0 -1 -1 -1 -2 -2 -1 0 -1 -1 -2 -2 -1 -1 -1 -2 -1 -1 -1 -2 -1 -1 -1 -1 -2 -2 -1 -1 -1 -1 -1 0 0 0 0 0 1 1 1 2 2 2 1 0 0 0 1 1 1 1 1 1 0 -1 -1 -1 0 1 0 -1 -1
1477 -1 -1 -1 -1 -1 -2 -2 -2 -2 -2 -2 -2 -3 -3 -2 -2 -2 -2 -2 -1 0 -1 -1 -1 -1 -1 0 0 0 1 1 0 1 1 1 0 0 -1 -2 -2 -2 -2 -1 0 0 0 0 -1 -1 0 0 0 0 0 -1 -1 -1 -1 -1 -1 -1 -1 -1 -1 -1 -1 -1 -1 -1 -1 -1 -1
1468a%%%J%%%%%%%%%J%j%jJJ%%j%%%%%%j%J%Jj%%J%%%jJ%%k%%J%%%%J%%j%%%%%%%%%%j%%%
1459a%%jJ%%%%%J%%j%%J%J%%%%%J%j%%jjj%%%%JJ%%%%J%%%%j%%%%%%%Jj%%%j%J%%Jj%%%%%
1450@%j%%%J%%%%%%%%%j%JJj%j%%%%%%J%%%J%%j%%%%%%J%%%%%jJJ%%%%Jj%J%j%%%%%j%%%%
1441AJK%%%%J%%%KJJKJKJLLMNNPPRRPNK%klnnoqpqoonmkjkjj%jjj%jj%j%j%%%j%%%%j%%Jj
1432@JJ%%%%%%%%j%%Jj%%%%j%%%jJ%%jJ%%%%%J%j%j%%Jj%%%%%%%%%J%%j%%%J%%%%%%j%%%%
1423a%%J%j%jJ%%%%%%JJJ%%%J%%%%JKj%J%%%%%jjjj%%Jjjj%%j%%%%%%JJ%j%%%%%%%%%%%%%
1414@%%%%j%%J%Jj%%%%jj%J%Jj%J%%j%%%%%%%%%J%%j%j%%J%JJj%j%%%%J%%J%%%j%%%%J%J%
1406BJJ%%%%j%%%%%j%jjJJ%j%%%jj%%%%%jJ%J%J%%j%%%%%Jj%J%Jj%JKJJJ%KJJ%%jjjjjj%%
$$ plain form
1468 -1 -1 -1 -1 0 0 0 0 0 0 0 0 0 0 1 1 0 0 -1 0 1 1 1 0 0 0 0 0 0 0 -1 -1 0 0 1 0 0 0 1 1 1 1 0 1 1 1 -1 -1 -1 0 0 0 0 0 1 1 1 0 0 0 0 0 0 0 0 0 0 0 -1 -1 -1 -1
1459 -1 -1 -1 -2 -1 -1 -1 -1 -1 -1 0 0 0 -1 -1 -1 0 0 1 1 1 1 1 1 2 2 1 1 1 0 -1 -2 -2 -2 -2 -2 -1 0 0 0 0 0 1 1 1 1 1 0 0 0 0 0 0 0 0 1 0 0 0 0 -1 -1 0 0 0 1 0 0 0 0 0 0
1450 0 0 -1 -1 -1 -1 0 0 0 0 0 0 0 0 0 0 -1 -1 0 1 0 0 -1 -1 -1 -1 -1 -1 -1 0 0 0 0 1 1 1 0 0 0 0 0 0 0 1 1 1 1 1 1 0 1 2 2 2 2 2 3 2 2 3 3 2 2 2 2 2 2 1 1 1 1 1
1441 1 2 4 4 4 4 4 5 5 5 5 7 8 9 11 12 14 15 18 21 25 30 35 42 49 58 67 74 79 81 81 79 76 71 66 60 52 45 37 31 25 20 16 14 13 11 10 9 9 8 7 6 6 5 4 4 3 3 2 2 2 2 1 1 1 1 1 0 0 0 1 0
1432 0 1 2 2 2 2 2 2 2 2 2 1 1 1 2 1 1 1 1 1 0 0 0 0 -1 0 0 0 -1 0 0 0 0 0 0 1 1 0 0 -1 -1 -1 0 -1 -1 -1 -1 -1 -1 -1 -1 -1 -1 0 0 0 -1 -1 -1 -1 0 0 0 0 0 0 0 -1 -1 -1 -1 -1
1423 -1 -1 -1 0 0 -1 -1 -2 -1 -1 -1 -1 -1 -1 -1 0 1 2 2 2 2 3 3 3 3 3 4 6 5 5 6 6 6 6 6 6 5 4 3 2 2 2 3 2 1 0 0 0 -1 -1 -1 -1 -1 -1 -1 0 1 1 0 0 0 0 0 0 0 0 0 0 0 0 0 0
1414 0 0 0 0 0 -1 -1 -1 0 0 1 0 0 0 0 0 -1 -2 -2 -1 -1 0 -1 -1 0 0 0 -1 -1 -1 -1 -1 -1 -1 -1 -1 -1 0 0 0 -1 -1 -2 -2 -2 -1 -1 0 1 0 0 -1 -1 -1 -1 -1 0 0 0 1 1 1 1 0 0 0 0 0 1 1 2 2
1406 2 3 4 4 4 4 4 3 3 3 3 3 3 2 2 1 0 1 2 2 1 1 1 1 0 -1 -1 -1 -1 -1 -1 -2 -1 -1 0 0 1 1 1 0 0 0 0 0 0 1 0 0 1 1 2 1 1 2 4 5 6 7 7 9 10 11 11 11 10 9 8 7 6 5 5 5
1397Ejjj%j%%Jj%jj%%%%%J%%%%jjJ%%%%%%%JJ%%%JJKJJJJJJJ%jjkjjj%j%j%j%j%%%J%j%j%
1388@%%%%j%%J%%%%%jjJJ%%J%JJ%%%%%J%%%%%%j%jjj%j%%%J%%%j%%J%J%%%%%%%j%%J%%Jj%
1379A%j%%%%J%jj%jJ%%%J%%%%%J%%j%%%j%%%%%Jj%J%%%%j%jJJ%%j%%%%%%%%j%%%%%J%Jjj%
1370b%%J%J%%j%%%%J%%j%%%%Jj%j%%%%J%J%%j%jJ%J%%J%%j%%%%%%%jJ%%%jjJ%%J%J%%%Jj%
1361Aj%%%%%%Jj%%j%%J%%%%%%%j%%%j%%JJJ%%jj%%%%%%J%j%%%%%%%%%%%J%%%%%%%%%%jJ%%
1352@j%%JJ%%%%%%jjJ%%Jj%%%%Jj%%%%JjjjJ%J%j%%j%JJjjJJ%%%%%%%%%%j%%%%%%J%%%%%j
1343a%J%%%%J%j%j%%%JJj%%j%%J%%%j%%%%jJJj%J%%j%%J%jJJ%j%j%%%%%%%j%J%%%%%%%%Jj
1334a%J%%J%j%j%%%%%J%%%jJ%j%J%%j%jJJ%%%J%%j%%%%Jj%%%%j%%JJJ%jj%%%%%%J%j%%J%j
$$ plain form
1397 5 4 3 2 2 1 1 1 2 1 1 0 -1 -1 -1 -1 -1 -1 0 0 0 0 0 -1 -2 -1 -1 -1 -1 -1 -1 -1 -1 0 1 1 1 1 2 3 5 6 7 8 9 10 11 12 12 11 10 8 7 6 5 5 4 4 3 3 2 2 1 1 1 1 2 2 1 1 0 0
1388 0 0 0 0 0 -1 -1 -1 0 0 0 0 0 0 -1 -2 -1 0 0 0 1 1 2 3 3 3 3 3 3 4 4 4 4 4 4 4 3 3 2 1 0 0 -1 -1 -1 -1 0 0 0 0 -1 -1 -1 0 0 1 1 1 1 1 1 1 1 0 0 0 1 1 1 2 1 1
1379 1 1 0 0 0 0 0 1 1 0 -1 -1 -2 -1 -1 -1 -1 0 0 0 0 0 0 1 1 1 0 0 0 0 -1 -1 -1 -1 -1 -1 0 -1 -1 0 0 0 0 0 -1 -1 -2 -1 0 0 0 -1 -1 -1 -1 -1 -1 -1 -1 -1 -2 -2 -2 -2 -2 -2 -1 -1 0 -1 -2 -2
1370 -2 -2 -2 -1 -1 0 0 0 -1 -1 -1 -1 -1 0 0 0 -1 -1 -1 -1 -1 0 -1 -1 -2 -2 -2 -2 -2 -1 -1 0 0 0 -1 -1 -2 -1 -1 0 0 0 1 1 1 0 0 0 0 0 0 0 0 -1 0 0 0 0 -1 -2 -1 -1 -1 0 0 1 1 1 1 2 1 1
1361 1 0 0 0 0 0 0 0 1 0 0 0 -1 -1 -1 0 0 0 0 0 0 0 0 -1 -1 -1 -1 -2 -2 -2 -1 0 1 1 1 0 -1 -1 -1 -1 -1 -1 -1 0 0 -1 -1 -1 -1 -1 -1 -1 -1 -1 -1 -1 -1 0 0 0 0 0 0 0 0 0 0 0 -1 0 0 0
1352 0 -1 -1 -1 0 1 1 1 1 1 1 1 0 -1 0 0 0 1 0 0 0 0 0 1 0 0 0 0 0 1 0 -1 -2 -1 -1 0 0 -1 -1 -1 -2 -2 -1 0 -1 -2 -1 0 0 0 0 0 0 0 0 0 0 0 -1 -1 -1 -1 -1 -1 -1 0 0 0 0 0 0 -1
1343 -1 -1 0 0 0 0 0 1 1 0 0 -1 -1 -1 -1 0 1 0 0 0 -1 -1 -1 0 0 0 0 -1 -1 -1 -1 -1 -2 -1 0 -1 -1 0 0 0 -1 -1 -1 0 0 -1 0 1 1 0 0 -1 -1 -1 -1 -1 -1 -1 -1 -2 -2 -1 -1 -1 -1 -1 -1 -1 -1 -1 0 -1
1334 -1 -1 0 0 0 1 1 0 0 -1 -1 -1 -1 -1 -1 0 0 0 0 -1 0 0 -1 -1 0 0 0 -1 -1 -2 -1 0 0 0 0 1 1 1 0 0 0 0 0 1 0 0 0 0 0 -1 -1 -1 0 1 2 2 1 0 0 0 0 0 0 0 1 1 0 0 0 1 1 0
1325@%%j%j%J%%J%J%j%j%%J%%%%%j%%J%j%%J%%%jjJ%%%Jj%J%%%%%jJ%%j%%%J%%jJ%J%j%%J
1316A%%j%%%%%%%%j%%JJ%%%jj%%%%J%%j%j%%J%J%%%%%%J%j%%%%%j%%%J%J%%%%%%%%%j%j%J
1308@%%Jj%%%%%%%j%%%%%%%J%%%%%j%%J%%%j%%%%%J%%jJ%%j%%%%J%%%%%%j%%%%%%%J%%j%%
1299aJ%%%%JJj%%%%%%j%%%J%%%%j%%Jj%%j%J%J%jj%%%J%%%%jJ%%%%jJ%J%%%%%j%%j%J%%%%
1290@%%%%%j%%%%%%%j%JJ%%%%%j%%%j%J%%Jj%%%jJ%%J%%%%%%j%Jj%%%%%j%JJJ%j%%Jj%%J%
1281A%%%%%%j%Jj%%%%%%jj%J%%%%JjJ%%j%%J%Jj%%%%%%Jj%%%%j%JJ%j%%%%J%%%jJ%%jj%%J
1272@%%%%j%J%%%%%%j%%%%%%%J%J%j%%%%%%%j%%%jJJ%Jj%%JJjj%%%%%%%%%%%%%j%%%%%JJ%
1263A%j%%Jj%%%%%%%%%%%%J%%%%j%%Jj%%%%jJ%%%J%j%%%%Jj%j%%%%%%J%%%j%jJ%%%J%%%%%
$$ plain form
1325 0 0 0 -1 -1 -2 -2 -1 -1 -1 0 0 1 1 0 0 -1 -1 -1 0 0 0 0 0 0 -1 -1 -1 0 0 -1 -1 -1 0 0 0 0 -1 -2 -1 -1 -1 -1 0 -1 -1 0 0 0 0 0 0 -1 0 0 0 -1 -1 -1 -1 0 0 0 -1 0 0 1 1 0 0 0 1
1316 1 1 1 0 0 0 0 0 0 0 0 0 -1 -1 -1 0 1 1 1 1 0 -1 -1 -1 -1 -1 0 0 0 -1 -1 -2 -2 -2 -1 -1 0 0 0 0 0 0 0 1 1 0 0 0 0 0 0 -1 -1 -1 -1 0 0 1 1 1 1 1 1 1 1 1 1 0 0 -1 -1 0
1308 0 0 0 1 0 0 0 0 0 0 0 0 -1 -1 -1 -1 -1 -1 -1 -1 0 0 0 0 0 0 -1 -1 -1 0 0 0 0 -1 -1 -1 -1 -1 -1 0 0 0 -1 0 0 0 -1 -1 -1 -1 -1 0 0 0 0 0 0 0 -1 -1 -1 -1 -1 -1 -1 -1 0 0 0 -1 -1 -1
1299 -1 0 0 0 0 0 1 2 1 1 1 1 1 1 1 0 0 0 0 1 1 1 1 1 0 0 0 1 0 0 0 -1 -1 0 0 1 1 0 -1 -1 -1 -1 0 0 0 0 0 -1 0 0 0 0 0 -1 0 0 1 1 1 1 1 1 0 0 0 -1 -1 0 0 0 0 0
1290 0 0 0 0 0 0 -1 -1 -1 -1 -1 -1 -1 -1 -2 -2 -1 0 0 0 0 0 0 -1 -1 -1 -1 -2 -2 -1 -1 -1 0 -1 -1 -1 -1 -2 -1 -1 -1 0 0 0 0 0 0 0 -1 -1 0 -1 -1 -1 -1 -1 -1 -2 -2 -1 0 1 1 0 0 0 1 0 0 0 1 1
1281 1 1 1 1 1 1 1 0 0 1 0 0 0 0 0 0 0 -1 -2 -2 -1 -1 -1 -1 -1 0 -1 0 0 0 -1 -1 -1 0 0 1 0 0 0 0 0 0 0 1 0 0 0 0 0 -1 -1 0 1 1 0 0 0 0 0 1 1 1 1 0 1 1 1 0 -1 -1 -1 0
1272 0 0 0 0 0 -1 -1 0 0 0 0 0 0 0 -1 -1 -1 -1 -1 -1 -1 -1 0 0 1 1 0 0 0 0 0 0 0 0 -1 -1 -1 -1 -2 -1 0 0 1 0 0 0 1 2 1 0 0 0 0 0 0 0 0 0 0 0 0 0 0 -1 -1 -1 -1 -1 -1 0 1 1
1263 1 1 0 0 0 1 0 0 0 0 0 0 0 0 0 0 0 0 0 1 1 1 1 1 0 0 0 1 0 0 0 0 0 -1 0 0 0 0 1 1 0 0 0 0 0 1 0 0 -1 -1 -1 -1 -1 -1 -1 0 0 0 0 -1 -1 -2 -1 -1 -1 -1 0 0 0 0 0 0
1254@%%%%%%%%%J%jjJ%jJ%%J%%%j%j%%%%J%j%J%%%Jj%j%%%%J%%%jjJ%%jJ%%%%J%%%%%%%%%
1245@%%%%%%j%%JJj%jJ%Jjj%jJ%%%%%%%j%%%J%%J%%%j%%Jj%J%%%J%%j%%%J%jjjJJ%%%j%%J
1236@j%Jjj%JJ%%j%%%%%%%%%J%%%j%%J%%j%%%%%j%JJj%J%j%JJ%%j%%%%%%%jjJ%%j%%J%%J%
1227@jj%J%%J%%Jj%%%%%%Jj%%JJ%%%j%jj%J%%%%%%%%%jJ%J%%%%%j%%%%%%j%%%J%%J%Jjj%%
1218@%%J%j%%%%%%%%%J%%j%j%%%J%%%jJ%%%j%%%JJ%j%%%j%J%%%J%%%%JJ%J%J%%%j%%%%jJ%
1210Djjj%%%%j%%%%%%%%%%%%%%%J%j%%%%%%%%%%%%J%j%J%%j%%j%%%J%%%%j%%%%%%J%%%jJ%
1201@%j%jJ%%Jj%%Jj%%J%%J%%jJ%%j%%%%%%%%%Jj%jjJ%%%%J%%%%%%%J%%%Jj%j%%%%%j%%JJ
1192A%j%%%jJ%%Jj%%%%%%jJ%%%%%%%%j%%JJ%%%%jJ%%%%j%jJ%J%%%jjJ%%%%%%J%Jj%j%%%%J
$$ plain form
1254 0 0 0 0 0 0 0 0 0 0 1 1 0 -1 0 0 -1 0 0 0 1 1 1 1 0 0 -1 -1 -1 -1 -1 0 0 -1 -1 0 0 0 0 1 0 0 -1 -1 -1 -1 -1 0 0 0 0 -1 -2 -1 -1 -1 -2 -1 -1 -1 -1 -1 0 0 0 0 0 0 0 0 0 0
1245 0 0 0 0 0 0 0 -1 -1 -1 0 1 0 0 -1 0 0 1 0 -1 -1 -2 -1 -1 -1 -1 -1 -1 -1 -1 -2 -2 -2 -2 -1 -1 -1 0 0 0 0 -1 -1 -1 0 -1 -1 0 0 0 0 1 1 1 0 0 0 0 1 1 0 -1 -2 -1 0 0 0 0 -1 -1 -1 0
1236 0 -1 -1 0 -1 -2 -2 -1 0 0 0 -1 -1 -1 -1 -1 -1 -1 -1 -1 -1 0 0 0 0 -1 -1 -1 0 0 0 -1 -1 -1 -1 -1 -1 -2 -2 -1 0 -1 -1 0 0 -1 -1 0 1 1 1 0 0 0 0 0 0 0 0 -1 -2 -1 -1 -1 -2 -2 -2 -1 -1 -1 0 0
1227 0 -1 -2 -2 -1 -1 -1 0 0 0 1 0 0 0 0 0 0 0 1 0 0 0 1 2 2 2 2 1 1 0 -1 -1 0 0 0 0 0 0 0 0 0 0 -1 0 0 1 1 1 1 1 1 0 0 0 0 0 0 0 -1 -1 -1 -1 0 0 0 1 1 2 1 0 0 0
1218 0 0 0 1 1 0 0 0 0 0 0 0 0 0 0 1 1 1 0 0 -1 -1 -1 -1 0 0 0 0 -1 0 0 0 0 -1 -1 -1 -1 0 1 1 0 0 0 0 -1 -1 0 0 0 0 1 1 1 1 1 2 3 3 4 4 5 5 5 5 4 4 4 4 4 3 4 4
1210 4 3 2 1 1 1 1 1 0 0 0 0 0 0 0 0 0 0 0 0 0 0 0 0 1 1 0 0 0 0 0 0 0 0 0 0 0 0 0 1 1 0 0 1 1 1 0 0 0 -1 -1 -1 -1 0 0 0 0 0 -1 -1 -1 -1 -1 -1 -1 0 0 0 0 -1 0 0
1201 0 0 -1 -1 -2 -1 -1 -1 0 -1 -1 -1 0 -1 -1 -1 0 0 0 1 1 1 0 1 1 1 0 0 0 0 0 0 0 0 0 0 1 0 0 -1 -2 -1 -1 -1 -1 -1 0 0 0 0 0 0 0 0 1 1 1 1 2 1 1 0 0 0 0 0 0 -1 -1 -1 0 1
1192 1 1 0 0 0 0 -1 0 0 0 1 0 0 0 0 0 0 0 -1 0 0 0 0 0 0 0 0 0 -1 -1 -1 0 1 1 1 1 1 0 1 1 1 1 1 0 0 -1 0 0 1 1 1 1 0 -1 0 0 0 0 0 0 0 1 1 2 1 1 0 0 0 0 0 1
1183A%%j%%%%%%j%%%%%J%%J%%j%%j%%%%%J%%%%Jj%JJjkJ%j%J%Jjj%%%J%%%%%%%J%j%j%%J%
1174@%%%%%%%%%%j%J%%%j%J%%%%%%J%j%%%%%%%%%%j%%%J%%%%Jj%jJ%%%j%J%%%%%Jjj%%J%%
1165@%%%j%%J%%J%%%%%j%%%jjJ%%%%%%j%J%%%%%Jj%%%j%J%%%J%j%%J%%j%%%j%J%%%%%%%%%
1156a%%%J%JjjjJ%%%%J%%j%J%%%%%%%%%%%%jJJ%%%%%%%%%Jj%j%%j%jJ%%J%J%j%%%%%%%%%%
1147@j%%%J%%jjJJ%%%%%%%%%%%%Jj%%%%%J%%%%%%jj%%jJJ%%%j%%JJ%%%%j%%%%%J%%Jj%j%%
1138@%%%%%%%%%%%J%%j%%%Jj%%%%j%J%%J%%%J%j%%%%J%%%j%%%j%%%%J%%j%Jj%%J%%%j%Jj%
1129@J%%%%JjjJ%j%%%%%J%%j%jJ%J%j%%%J%%J%%j%j%%%%J%%%%%%%%%jJ%%%%%%%%%%%%%%%j
1120@%%J%%%%%J%jj%%%%%%%%%j%J%%Jj%%j%%JJ%%%j%Jj%%%J%%J%%%%%j%jJ%%%%%%%%%%%%%
$$ plain form
1183 1 1 1 0 0 0 0 0 0 0 -1 -1 -1 -1 -1 -1 0 0 0 1 1 1 0 0 0 -1 -1 -1 -1 -1 -1 0 0 0 0 0 1 0 0 1 2 1 -1 0 0 -1 -1 0 0 1 0 -1 -1 -1 -1 0 0 0 0 0 0 0 0 1 1 0 0 -1 -1 -1 0 0
1174 0 0 0 0 0 0 0 0 0 0 0 -1 -1 0 0 0 0 -1 -1 0 0 0 0 0 0 0 1 1 0 0 0 0 0 0 0 0 0 0 0 -1 -1 -1 -1 0 0 0 0 0 1 0 0 -1 0 0 0 0 -1 -1 0 0 0 0 0 0 1 0 -1 -1 -1 0 0 0
1165 0 0 0 0 -1 -1 -1 0 0 0 1 1 1 1 1 1 0 0 0 0 -1 -2 -1 -1 -1 -1 -1 -1 -1 -2 -2 -1 -1 -1 -1 -1 -1 0 -1 -1 -1 -1 -2 -2 -1 -1 -1 -1 0 0 -1 -1 -1 0 0 0 -1 -1 -1 -1 -2 -2 -1 -1 -1 -1 -1 -1 -1 -1 -1 -1
1156 -1 -1 -1 -1 0 0 1 0 -1 -2 -1 -1 -1 -1 -1 0 0 0 -1 -1 0 0 0 0 0 0 0 0 0 0 0 0 0 -1 0 1 1 1 1 1 1 1 1 1 1 2 1 1 0 0 0 -1 -1 -2 -1 -1 -1 0 0 1 1 0 0 0 0 0 0 0 0 0 0 0
1147 0 -1 -1 -1 -1 0 0 0 -1 -2 -1 0 0 0 0 0 0 0 0 0 0 0 0 0 1 0 0 0 0 0 0 1 1 1 1 1 1 1 0 -1 -1 -1 -2 -1 0 0 0 0 -1 -1 -1 0 1 1 1 1 1 0 0 0 0 0 0 1 1 1 2 1 1 0 0 0
1138 0 0 0 0 0 0 0 0 0 0 0 0 1 1 1 0 0 0 0 1 0 0 0 0 0 -1 -1 0 0 0 1 1 1 1 2 2 1 1 1 1 1 2 2 2 2 1 1 1 1 0 0 0 0 0 1 1 1 0 0 1 0 0 0 1 1 1 1 0 0 1 0 0
1129 0 1 1 1 1 1 2 1 0 1 1 0 0 0 0 0 0 1 1 1 0 0 -1 0 0 1 1 0 0 0 0 1 1 1 2 2 2 1 1 0 0 0 0 0 1 1 1 1 1 1 1 1 1 1 0 1 1 1 1 1 1 1 1 1 1 1 1 1 1 1 1 0
1120 0 0 0 1 1 1 1 1 1 2 2 1 0 0 0 0 0 0 0 0 0 0 -1 -1 0 0 0 1 0 0 0 -1 -1 -1 0 1 1 1 1 0 0 1 0 0 0 0 1 1 1 2 2 2 2 2 2 1 1 0 1 1 1 1 1 1 1 1 1 1 1 1 1 1
1112AJJj%j%%%%%%%J%%Jj%j%%%J%%%%j%%%%%%J%%j%%jj%%J%%%J%J%%%jjJ%J%%%%%j%j%%J%
1103A%%%%%%jJ%J%%%%J%%jj%J%J%j%j%%J%%J%%%%%j%%J%%%%j%%%jJ%%%jJJ%J%j%%%%jJJ%J
1094EjJ%j%%%%%%Jj%%%%%%%%J%%%%J%%%%j%%J%J%J%J%%%%%J%%JJJ%%JJ%JJ%J%%KJJJKJKKJ
1085C1JKKKKJJKLJK%Jj%%%%jjjjkjkkkkkkjjkkjjjkjk%j%kjjj%%%Jj%j%j%j%%%%%jjjj%J%
1076EJj%%%%jjjJ%%%%%%j%%j%%%%Jj%%%%%%Jj%%jJ%%J%%%jJ%%Jj%%%%jJ%%j%%%%%%%jj%%J
1067@%Jjj%%J%%%%%%%%%%%JJk%%%%%%jJJj%%Jj%j%JJ%j%j%%%%%%%%%%%%%jJ%%%J%%%jJJ%j
1058@jJ%%%%J%j%%J%%%%jjjJ%j%%%JJ%j%jJ%%%%%%%J%%%%%J%%j%%%%%%%J%%j%%%%j%%%Jj%
1049a%K%%%%%%j%j%J%%%j%%jJ%%Jj%%jJJ%%%%J%Jj%%%j%jJ%%J%%%j%%j%%%%Jj%%j%%J%J%%
$$ plain form
1112 1 2 3 2 2 1 1 1 1 1 1 1 1 2 2 2 3 2 2 1 1 1 1 2 2 2 2 2 1 1 1 1 1 1 1 2 2 2 1 1 1 0 -1 -1 -1 0 0 0 0 1 1 2 2 2 2 1 0 1 1 2 2 2 2 2 2 1 1 0 0 0 1 1
1103 1 1 1 1 1 1 1 0 1 1 2 2 2 2 2 3 3 3 2 1 1 2 2 3 3 2 2 1 1 1 2 2 2 3 3 3 3 3 3 2 2 2 3 3 3 3 3 2 2 2 2 1 2 2 2 2 1 2 3 3 4 4 3 3 3 3 3 2 3 4 4 5
1094 5 4 5 5 4 4 4 4 4 4 4 5 4 4 4 4 4 4 4 4 4 5 5 5 5 5 6 6 6 6 6 5 5 5 6 6 7 7 8 8 9 9 9 9 9 9 10 10 10 11 12 13 13 13 14 15 15 16 17 17 18 18 18 20 21 22 23 25 26 28 30 31
1085 31 32 34 36 38 40 41 42 44 47 48 50 50 51 50 50 50 50 50 49 48 47 46 44 43 41 39 37 35 33 31 30 29 27 25 24 23 22 20 19 17 17 16 16 14 13 12 11 11 11 11 12 11 11 10 10 9 9 8 8 8 8 8 8 7 6 5 4 4 5 5
1076 5 6 5 5 5 5 5 4 3 2 3 3 3 3 3 3 3 2 2 2 1 1 1 1 1 2 1 1 1 1 1 1 1 2 1 1 1 0 1 1 1 2 2 2 2 1 2 2 2 3 2 2 2 2 2 1 2 2 2 1 1 1 1 1 1 1 1 0 -1 -1 -1 0
1067 0 0 1 0 -1 -1 -1 0 0 0 0 0 0 0 0 0 0 0 0 1 2 0 0 0 0 0 0 0 -1 0 1 0 0 0 1 0 0 -1 -1 0 1 1 0 0 -1 -1 -1 -1 -1 -1 -1 -1 -1 -1 -1 -1 -1 -1 -2 -1 -1 -1 -1 0 0 0 0 -1 0 1 1 0
1058 0 -1 0 0 0 0 0 1 1 0 0 0 1 1 1 1 1 0 -1 -2 -1 -1 -2 -2 -2 -2 -1 0 0 -1 -1 -2 -1 -1 -1 -1 -1 -1 -1 -1 0 0 0 0 0 0 1 1 1 0 0 0 0 0 0 0 0 1 1 1 0 0 0 0 0 -1 -1 -1 -1 0 -1 -1
1049 -1 -1 1 1 1 1 1 1 1 0 0 -1 -1 0 0 0 0 -1 -1 -1 -2 -1 -1 -1 0 -1 -1 -1 -2 -1 0 0 0 0 0 1 1 2 1 1 1 1 0 0 -1 0 0 0 1 1 1 1 0 0 0 -1 -1 -1 -1 -1 0 -1 -1 -1 -2 -2 -2 -1 -1 0 0 0
1040@jJ%J%J%%%%%%j%j%%J%j%%j%%%%%JJj%%%j%%%%%J%%%j%J%%%%%%jJ%%%j%JJ%jJj%%j%%
1032a%%%%J%j%%Jj%%%J%%%%%jj%%%%J%J%%%%%%%%Jj%%%j%%%J%J%j%%%%j%J%%j%%J%%j%%%%
1023a%%J%%%jJ%%%%%%%%jJJ%%%j%%%%%%%%%%%%%%J%%%%%%j%%%J%%%j%Jj%%%%%%%%%j%%J%J
1014A%%j%%%%%j%%Jj%%J%%%%J%jjJ%J%%%%%j%%%%%jjJ%%j%JJ%j%J%j%J%J%%%%%kJ%%%%j%J
1005@J%j%%%%%%%%J%%%j%%%%%%j%%%%J%%%%jjJJ%%%%j%%%J%%jj%%%%J%%%%J%%J%%%j%%J%%
996Ajjj%%J%J%%%Jj%%jJ%%%%j%J%%%%%%j%%J%J%J%%jjjjJ%%J%%%Jj%%%%%j%%%%jJ%J%%%%%
987@%%j%JJ%Jj%j%%%%J%%j%%jJ%%%%%%%%%%%%jJ%%%%%J%%%%jj%%%%Jj%J%%%%jJ%%%j%J%%%
978@%%j%J%J%%%%j%%%J%%%J%%jj%%%J%%%j%%%%%J%J%%%jjj%%%JJj%%%%J%%%%%j%%jJ%%%%%
$$ plain form
1040 0 -1 0 0 1 1 2 2 2 2 2 2 2 1 1 0 0 0 1 1 0 0 0 -1 -1 -1 -1 -1 -1 0 1 0 0 0 0 -1 -1 -1 -1 -1 -1 0 0 0 0 -1 -1 0 0 0 0 0 0 0 -1 0 0 0 0 -1 -1 0 1 1 0 1 0 0 0 -1 -1 -1
1032 -1 -1 -1 -1 -1 0 0 -1 -1 -1 0 -1 -1 -1 -1 0 0 0 0 0 0 -1 -2 -2 -2 -2 -2 -1 -1 0 0 0 0 0 0 0 0 0 1 0 0 0 0 -1 -1 -1 -1 0 0 1 1 0 0 0 0 0 -1 -1 0 0 0 -1 -1 -1 0 0 0 -1 -1 -1 -1 -1
1023 -1 -1 -1 0 0 0 0 -1 0 0 0 0 0 0 0 0 0 -1 0 1 1 1 1 0 0 0 0 0 0 0 0 0 0 0 0 0 0 0 1 1 1 1 1 1 1 0 0 0 0 1 1 1 1 0 0 1 0 0 0 0 0 0 0 0 0 0 -1 -1 -1 0 0 1
1014 1 1 1 0 0 0 0 0 0 -1 -1 -1 0 -1 -1 -1 0 0 0 0 0 1 1 0 -1 0 0 1 1 1 1 1 1 0 0 0 0 0 0 -1 -2 -1 -1 -1 -2 -2 -1 0 0 -1 -1 0 0 -1 -1 0 0 1 1 1 1 1 1 -1 0 0 0 0 0 -1 -1 0
1005 0 1 1 0 0 0 0 0 0 0 0 0 1 1 1 1 0 0 0 0 0 0 0 -1 -1 -1 -1 -1 0 0 0 0 0 -1 -2 -1 0 0 0 0 0 -1 -1 -1 -1 0 0 0 -1 -2 -2 -2 -2 -2 -1 -1 -1 -1 -1 0 0 0 1 1 1 1 0 0 0 1 1 1
996 1 0 -1 -2 -2 -2 -1 -1 0 0 0 0 1 0 0 0 -1 0 0 0 0 0 -1 -1 0 0 0 0 0 0 0 -1 -1 -1 0 0 1 1 2 2 2 1 0 -1 -2 -1 -1 -1 0 0 0 0 1 0 0 0 0 0 0 -1 -1 -1 -1 -1 -2 -1 -1 0 0 0 0 0 0
987 0 0 0 -1 -1 0 1 1 2 1 1 0 0 0 0 0 1 1 1 0 0 0 -1 0 0 0 0 0 0 0 0 0 0 0 0 0 -1 0 0 0 0 0 0 1 1 1 1 1 0 -1 -1 -1 -1 -1 0 -1 -1 0 0 0 0 0 -1 0 0 0 0 -1 -1 0 0 0 0
978 0 0 0 -1 -1 0 0 1 1 1 1 1 0 0 0 0 1 1 1 1 2 2 2 1 0 0 0 0 1 1 1 1 0 0 0 0 0 0 1 1 2 2 2 2 1 0 -1 -1 -1 -1 0 1 0 0 0 0 0 1 1 1 1 1 1 0 0 0 -1 0 0 0 0 0 0
969@%%%%%%%%%%%j%%%J%%%j%%%%JJjj%%%%JJj%%j%Jj%%J%%%%%%%%%jJJ%J%j%J%j%jjj%JJ%
960@%J%%%j%%j%%Jj%%%%j%%J%J%%j%%JJj%j%j%%J%J%%%%jJ%j%J%%%%J%J%%j%%jjJ%%%%%j%
951a%J%%%%JJ%%jJ%%j%%%%j%%%%%%j%jJJJ%j%%%%%%%JJj%%%%%j%%J%%j%%%jJ%%%%J%%%%%%
942A%%%%%jjJ%J%%%%%J%j%j%%%%Jjj%%%J%%%j%J%J%jjJ%%%j%J%%J%jjJj%%%%%%%%%%%J%JJ
933B%jjJ%J%%jj%J%%j%%%%%%%%J%%%%%j%%J%%j%%%%J%%Jjj%j%%J%%JjjJ%%%%%%%%%%%%%J%
924A%jJ%j%%%%%%%%%%%%%J%J%%%%%%%%jjj%%J%%%%%J%%J%jJ%%%%%j%%%j%%%%%%%%%%JJJJj
915Cjj%%J%j%J%%j%%%%J%%Jj%%%%j%%%J%%jjJ%%%%%%j%%J%%J%%j%%%J%%j%%%%%%%%%%%%%%
906A%%%%j%%%%J%%%j%%%%%%%%%Jjj%%J%%J%%%%%%%%%jJjjJ%J%%%%jj%%J%%Jj%%%j%J%%%%%
$$ plain form
969 0 0 0 0 0 0 0 0 0 0 0 0 -1 -1 -1 -1 0 0 0 0 -1 -1 -1 -1 -1 0 1 0 -1 -1 -1 -1 -1 0 1 0 0 0 -1 -1 0 -1 -1 -1 0 0 0 0 0 0 0 0 0 0 -1 0 1 1 2 2 1 1 2 2 1 1 0 -1 -2 -2 -1 0 0
960 0 0 1 1 1 1 0 0 0 -1 -1 -1 0 -1 -1 -1 -1 -1 -2 -2 -2 -1 -1 0 0 0 -1 -1 -1 0 1 0 0 -1 -1 -2 -2 -2 -1 -1 0 0 0 0 0 -1 0 0 -1 -1 0 0 0 0 0 1 1 2 2 2 1 1 1 0 -1 0 0 0 0 0 0 -1 -1
951 -1 -1 0 0 0 0 0 1 2 2 2 1 2 2 2 1 1 1 1 1 0 0 0 0 0 0 0 -1 -1 -2 -1 0 1 1 0 0 0 0 0 0 0 0 1 2 1 1 1 1 1 1 0 0 0 1 1 1 0 0 0 0 -1 0 0 0 0 0 1 1 1 1 1 1 1
942 1 1 1 1 1 1 0 -1 0 0 1 1 1 1 1 1 2 2 1 1 0 0 0 0 0 1 0 -1 -1 -1 -1 0 0 0 0 -1 -1 0 0 1 1 0 -1 0 0 0 0 -1 -1 0 0 0 1 1 0 -1 0 -1 -1 -1 -1 -1 -1 -1 -1 -1 -1 -1 -1 0 0 1 2
933 2 2 1 0 1 1 2 2 2 1 0 0 1 1 1 0 0 0 0 0 0 0 0 0 1 1 1 1 1 1 0 0 0 1 1 1 0 0 0 0 0 1 1 1 2 1 0 0 -1 -1 -1 0 0 0 1 0 -1 0 0 0 0 0 0 0 0 0 0 0 0 0 0 1 1
924 1 1 0 1 1 0 0 0 0 0 0 0 0 0 0 0 0 0 0 1 1 2 2 2 2 2 2 2 2 2 1 0 -1 -1 -1 0 0 0 0 0 0 1 1 1 2 2 1 2 2 2 2 2 2 1 1 1 1 0 0 0 0 0 0 0 0 0 0 0 1 2 3 4 3
915 3 2 1 1 1 2 2 1 1 2 2 2 1 1 1 1 1 2 2 2 3 2 2 2 2 2 1 1 1 1 2 2 2 1 0 1 1 1 1 1 1 1 0 0 0 1 1 1 2 2 2 1 1 1 1 2 2 2 1 1 1 1 1 1 1 1 1 1 1 1 1 1 1
906 1 1 1 1 1 0 0 0 0 0 1 1 1 1 0 0 0 0 0 0 0 0 0 0 1 0 -1 -1 -1 0 0 0 1 1 1 1 1 1 1 1 1 1 0 1 0 -1 0 0 1 1 1 1 1 0 -1 -1 -1 0 0 0 1 0 0 0 0 -1 -1 0 0 0 0 0 0
897@%%%%%%%J%j%J%%%%%Jj%%%j%j%%jJ%J%%%%J%%%%%%j%%%jjJ%%J%%%%%%%%%%%%%J%j%%%%
887@%%%%%%%%%%%%%%%J%%%%%jJ%jj%%%j%%JJj%%%%%%%%J%%%%%%%%%%%%%%%%j%%J%jJ%J%%%
878A%j%%%%%%jJJ%%k%%%J%J%%%%%%j%%%%%%%jJ%%%%%JjJ%%j%%%%%%%%%J%%Jj%%%j%%Jj%%%
869@%%%j%%%J%%%%J%%J%%%%JJjj%%jj%%%%%%%J%%J%JJ%%J%%%j%jjj%j%%%%%%J%%J%%%j%%%
860A%%%j%%J%%j%J%Jj%jj%%%J%%%%%%JJ%jj%j%%%%J%%%%%%%%%%j%%%%%%%%J%%J%%jj%%%%%
851a%%J%j%JJ%%j%%j%JJ%%%J%JJ%j%j%j%%J%%j%%%j%%%j%jJ%j%%J%J%%J%%j%Jj%%%JJ%jj%
842@%j%%J%%%j%%%%%%%%%%%%%jJ%%J%%%%j%J%J%%%jj%%J%%jJj%%%J%%JJ%jj%%jjjJJ%%%J%
833@%J%%%%%%%jJ%%%%j%%J%J%%j%%%%%%%%%%jjJ%%J%%%%%Jj%j%%JJ%jjJ%%%%j%J%%%%%%%%
$$ plain form
897 0 0 0 0 0 0 0 0 1 1 0 0 1 1 1 1 1 1 2 1 1 1 1 0 0 -1 -1 -1 -2 -1 -1 0 0 0 0 0 1 1 1 1 1 1 1 0 0 0 0 -1 -2 -1 -1 -1 0 0 0 0 0 0 0 0 0 0 0 0 0 0 1 1 0 0 0 0 0
887 0 0 0 0 0 0 0 0 0 0 0 0 0 0 0 0 1 1 1 1 1 1 0 1 1 0 -1 -1 -1 -1 -2 -2 -2 -1 0 -1 -1 -1 -1 -1 -1 -1 -1 -1 0 0 0 0 0 0 0 0 0 0 0 0 0 0 0 0 0 -1 -1 -1 0 0 -1 0 0 1 1 1 1
878 1 1 0 0 0 0 0 0 0 -1 0 1 1 1 -1 -1 -1 -1 0 0 1 1 1 1 1 1 1 0 0 0 0 0 0 0 0 -1 0 0 0 0 0 0 1 0 1 1 1 0 0 0 0 0 0 0 0 0 0 1 1 1 2 1 1 1 1 0 0 0 1 0 0 0 0
869 0 0 0 0 -1 -1 -1 -1 0 0 0 0 0 1 1 1 2 2 2 2 2 3 4 3 2 2 2 1 0 0 0 0 0 0 0 0 1 1 1 2 2 3 4 4 4 5 5 5 5 4 4 3 2 1 1 0 0 0 0 0 0 0 1 1 1 2 2 2 2 1 1 1 1
860 1 1 1 1 0 0 0 1 1 1 0 0 1 1 2 1 1 0 -1 -1 -1 -1 0 0 0 0 0 0 0 1 2 2 1 0 0 -1 -1 -1 -1 -1 0 0 0 0 0 0 0 0 0 0 0 -1 -1 -1 -1 -1 -1 -1 -1 -1 0 0 0 1 1 1 0 -1 -1 -1 -1 -1 -1
851 -1 -1 -1 0 0 -1 -1 0 1 1 1 0 0 0 -1 -1 0 1 1 1 1 2 2 3 4 4 3 3 2 2 1 1 1 2 2 2 1 1 1 1 0 0 0 0 -1 -1 -2 -1 -1 -2 -2 -2 -1 -1 0 0 0 1 1 1 0 0 1 0 0 0 0 1 2 2 1 0 0
842 0 0 -1 -1 -1 0 0 0 0 -1 -1 -1 -1 -1 -1 -1 -1 -1 -1 -1 -1 -1 -1 -2 -1 -1 -1 0 0 0 0 0 -1 -1 0 0 1 1 1 1 0 -1 -1 -1 0 0 0 -1 0 -1 -1 -1 -1 0 0 0 1 2 2 1 0 0 0 -1 -2 -3 -2 -1 -1 -1 -1 0 0
833 0 0 1 1 1 1 1 1 1 1 0 1 1 1 1 1 0 0 0 1 1 2 2 2 1 1 1 1 1 1 1 1 1 1 1 0 -1 0 0 0 1 1 1 1 1 1 2 1 1 0 0 0 1 2 2 1 0 1 1 1 1 1 0 0 1 1 1 1 1 1 1 1 1
824A%%%%%%%%%%%%j%J%J%jJ%j%%%%%%%%%%%%%%J%%%%jj%%%%J%%%J%%%%%%J%%JjjJ%%%Jj%J
815Djj%J%J%%j%Jj%%%%%%%%%%%%j%%J%%%jj%%%J%%j%%%%%jJJ%%%%%%%%%%%%%jJ%J%%%%%%J
806D%%j%%j%%%%%Jj%%%j%%%%Jj%%JjjJ%%%%%%%%%%%JJ%%jj%J%J%jJj%j%%J%%%j%%%j%%%%j
797aJJ%jJj%%%%JJ%%j%%%J%%J%j%Jjj%%%%J%Jj%%%%%%Jj%j%JjJJ%j%%%%JJjj%j%jJ%%%%%J
788B%%%Jjj%%%%%%%%J%%%%%jJ%J%JjJJ%jjj%%Jj%%J%j%J%j%J%%%J%%JjJ%jjj%%%J%%Jj%%%
779C%%J%%%J%%%%Jj%j%%%%J%%%%%%%%J%%%jj%J%%%%%%%%%J%%%J%%J%%J%%%J%%%Jj%%J%%%J
770A2%%%%%%JJ%J%%JJ%%%%JJ%JJJ%JJJ%J%J%JJKJJKJJKKKKKJKJKLLLLLMLLMMNONONQQPPPQ
761A58J0RRJ0RRQRPQPNLKJjlkmppqqrrj0rrrrrqqrpppnonnmmmmnlmjlklkkkkljjkjjjjjjj
$$ plain form
824 1 1 1 1 1 1 1 1 1 1 1 1 1 0 0 1 1 2 2 1 2 2 1 1 1 1 1 1 1 1 1 1 1 1 1 1 1 2 2 2 2 2 1 0 0 0 0 0 1 1 1 1 2 2 2 2 2 2 2 3 3 3 4 3 2 3 3 3 3 4 3 3 4
815 4 3 2 2 3 3 4 4 4 3 3 4 3 3 3 3 3 3 3 3 3 3 3 3 3 2 2 2 3 3 3 3 2 1 1 1 1 2 2 2 1 1 1 1 1 1 0 1 2 2 2 2 2 2 2 2 2 2 2 2 2 2 1 2 2 3 3 3 3 3 3 3 4
806 4 4 4 3 3 3 2 2 2 2 2 2 3 2 2 2 2 1 1 1 1 1 2 1 1 1 2 1 0 1 1 1 1 1 1 1 1 1 1 1 1 2 3 3 3 2 1 1 2 2 3 3 2 3 2 2 1 1 1 2 2 2 2 1 1 1 1 0 0 0 0 0 -1
797 -1 0 1 1 0 1 0 0 0 0 0 1 2 2 2 1 1 1 1 2 2 2 3 3 2 2 3 2 1 1 1 1 1 2 2 3 2 2 2 2 2 2 2 3 2 2 1 1 2 1 2 3 3 2 2 2 2 2 3 4 3 2 2 1 1 0 1 1 1 1 1 1 2
788 2 2 2 2 3 2 1 1 1 1 1 1 1 1 1 2 2 2 2 2 2 1 2 2 3 3 4 3 4 5 5 4 3 2 2 2 3 2 2 2 3 3 2 2 3 3 2 2 3 3 3 3 4 4 4 5 4 5 5 4 3 2 2 2 2 3 3 3 4 3 3 3 3
779 3 3 3 4 4 4 4 5 5 5 5 5 6 5 5 4 4 4 4 4 5 5 5 5 5 5 5 5 5 6 6 6 6 5 4 4 5 5 5 5 5 5 5 5 5 5 6 6 6 6 7 7 7 8 8 8 9 9 9 9 10 10 10 10 11 10 10 10 11 11 11 11 12
770 12 12 12 12 12 12 12 13 14 14 15 15 15 16 17 17 17 17 17 18 19 19 20 21 22 22 23 24 25 25 26 26 27 27 28 29 31 32 33 35 36 37 39 41 43 45 47 48 50 51 53 56 59 62 65 68 72 75 78 82 86 91 97 102 108 113 121 129 136 143 150 158
761 158 168 177 186 196 205 214 222 231 238 246 253 258 261 263 264 263 260 258 254 247 240 232 224 215 206 196 187 178 169 160 151 143 135 126 119 112 105 100 94 89 84 80 76 72 68 63 60 56 55 52 50 47 45 43 41 39 36 35 34 32 31 30 29 28 27 26 25
753B5j%jjkkk%J%j%jj%j%Jjj%jj%j%%%%j%%%%%%%%j%j%%j%%%%%j%%%%%Jjj%%%%%%j%%%%%%
744B%%J%J%%jjJ%j%%j%j%J%%%%%%%%k%JJ%%%%J%%%%%%%j%%%%j%j%J%J%jj%%J%%%%%j%%J%J
735Ajj%%J%J%%j%%%%jJ%Jj%Jj%%jJ%J%%j%%%%%%%%%%%Jj%%%j%%%J%J%j%%%j%JJjj%%%J%%%
726@%%%j%J%%J%j%%%%jJ%%%%j%%Jj%%jJJ%j%%%jJ%%%%%Jj%jjJ%JJ%%jJ%%%%%j%%%%%%J%%%
717@%%%%%%%%J%j%%%%Jjj%%%J%J%%j%%%%%%%%%j%%jJJ%%%%%%%jjJ%%%%%%%%j%%JJj%%%%%J
708@%%jJ%%%%j%J%j%%J%j%%J%k%%%J%Jj%%j%%J%j%JJ%%%%%%%%j%%%J%%j%%J%%j%Jj%%%J%%
699@%%%j%%%JJ%%%%j%%%JJjj%%%%j%%J%J%%%%%%j%%j%%%j%%J%%%JJJ%jj%j%%%j%%JJ%%%j%
690a%%jJ%J%%jJ%%Jj%j%J%%%%%%Jj%J%%j%%%%%j%%%%%J%%%%%j%jJ%J%%%%%%j%%%%%%%JJj%
$$ plain form
753 25 24 24 23 22 20 18 16 16 17 17 16 16 15 14 14 13 13 14 13 12 12 11 10 10 9 9 9 9 9 8 8 8 8 8 8 8 8 8 7 7 6 6 6 5 5 5 5 5 5 4 4 4 4 4 4 5 4 3 3 3 3 3 3 3 2 2 2 2 2 2 2
744 2 2 2 3 3 4 4 4 3 2 3 3 2 2 2 1 1 0 0 1 1 1 1 1 1 1 1 1 -1 -1 0 1 1 1 1 1 2 2 2 2 2 2 2 2 1 1 1 1 1 0 0 -1 -1 0 0 1 1 0 -1 -1 -1 0 0 0 0 0 0 -1 -1 -1 0 0 1
735 1 0 -1 -1 -1 0 0 1 1 1 0 0 0 0 0 -1 0 0 1 0 0 1 0 0 0 -1 0 0 1 1 1 0 0 0 0 0 0 0 0 0 0 0 0 1 0 0 0 0 -1 -1 -1 -1 0 0 1 1 0 0 0 0 -1 -1 0 1 0 -1 -1 -1 -1 0 0 0 0
726 0 0 0 0 -1 -1 0 0 0 1 1 0 0 0 0 0 -1 0 0 0 0 0 -1 -1 -1 0 -1 -1 -1 -2 -1 0 0 -1 -1 -1 -1 -2 -1 -1 -1 -1 -1 -1 0 -1 -1 -2 -3 -2 -2 -1 0 0 0 -1 0 0 0 0 0 0 -1 -1 -1 -1 -1 -1 -1 0 0 0 0
717 0 0 0 0 0 0 0 0 0 1 1 0 0 0 0 0 1 0 -1 -1 -1 -1 0 0 1 1 1 0 0 0 0 0 0 0 0 0 0 -1 -1 -1 -2 -1 0 0 0 0 0 0 0 0 -1 -2 -1 -1 -1 -1 -1 -1 -1 -1 -1 -2 -2 -2 -1 0 -1 -1 -1 -1 -1 -1 0
708 0 0 0 -1 0 0 0 0 0 -1 -1 0 0 -1 -1 -1 0 0 -1 -1 -1 0 0 -2 -2 -2 -2 -1 -1 0 -1 -1 -1 -2 -2 -2 -1 -1 -2 -2 -1 0 0 0 0 0 0 0 0 0 -1 -1 -1 -1 0 0 0 -1 -1 -1 0 0 0 -1 -1 0 -1 -1 -1 -1 0 0 0
699 0 0 0 0 -1 -1 -1 -1 0 1 1 1 1 1 0 0 0 0 1 2 1 0 0 0 0 0 -1 -1 -1 0 0 1 1 1 1 1 1 1 0 0 0 -1 -1 -1 -1 -2 -2 -2 -1 -1 -1 -1 0 1 2 2 1 0 0 -1 -1 -1 -1 -2 -2 -2 -1 0 0 0 0 -1 -1
690 -1 -1 -1 -2 -1 -1 0 0 0 -1 0 0 0 1 0 0 -1 -1 0 0 0 0 0 0 0 1 0 0 1 1 1 0 0 0 0 0 0 -1 -1 -1 -1 -1 -1 0 0 0 0 0 0 -1 -1 -2 -1 -1 0 0 0 0 0 0 0 -1 -1 -1 -1 -1 -1 -1 -1 0 1 0 0
681@%%%%%j%%Jj%%J%%%%%Jj%%%j%J%J%%%%j%%%%%jJ%%%%%%J%%%j%%%%%%%%%%J%jjJJ%%%%J
672B%%j%jJ%%%%j%%JJ%j%%%%%%%%%%%j%j%%%%%J%%%%%jJj%JJJj%%j%%%J%%%J%j%%%%%%j%%
662@%j%%%%%J%%jJ%%Jj%%%%%%%%%J%jJJ%%j%%%%%%%j%%J%%j%%J%J%j%%%%%%%jJ%j%J%%%j%
653@%J%%%%%%%%j%J%%%%Jj%jJ%%%%%j%%%j%J%J%%%%j%%%%%jj%%%K%%%Jj%%%Jj%j%%%%%%%%
644aJ%%J%%%%%j%%%%%%%%%%jJJ%j%%%%J%jJ%j%J%%%j%j%%JJ%Jj%%%%%J%%j%%%%j%%j%J%%%
635@Jj%%%%%jjJJ%j%%J%j%%J%%j%%jJ%%J%j%%J%%j%j%%J%J%j%%%%J%j%%%%J%%%%j%J%%%%j
626a%%%%%%Jj%%%J%J%%%%%j%j%%%j%JJJ%j%j%%%J%%%%%j%%%J%j%%J%%J%j%%jj%%%%%%%J%J
617@%%%%%%j%%%%%Jj%%jJ%%%%%%jJ%J%%%jj%JJ%j%%%%j%%%J%%%%Jj%%%%%%%%%%%%%%j%J%%
$$ plain form
681 0 0 0 0 0 0 -1 -1 -1 0 -1 -1 -1 0 0 0 0 0 0 1 0 0 0 0 -1 -1 0 0 1 1 1 1 1 0 0 0 0 0 0 -1 0 0 0 0 0 0 0 1 1 1 1 0 0 0 0 0 0 0 0 0 0 0 1 1 0 -1 0 1 1 1 1 1 2
672 2 2 2 1 1 0 1 1 1 1 1 0 0 0 1 2 2 1 1 1 1 1 1 1 1 1 1 1 1 0 0 -1 -1 -1 -1 -1 -1 0 0 0 0 0 0 -1 0 -1 -1 0 1 2 1 1 1 0 0 0 0 1 1 1 1 2 2 1 1 1 1 1 1 1 0 0 0
662 0 0 -1 -1 -1 -1 -1 -1 0 0 0 -1 0 0 0 1 0 0 0 0 0 0 0 0 0 0 1 1 0 1 2 2 2 1 1 1 1 1 1 1 1 0 0 0 1 1 1 0 0 0 1 1 2 2 1 1 1 1 1 1 1 1 0 1 1 0 0 1 1 1 1 0 0
653 0 0 1 1 1 1 1 1 1 1 1 0 0 1 1 1 1 1 2 1 1 0 1 1 1 1 1 1 0 0 0 0 -1 -1 0 0 1 1 1 1 1 0 0 0 0 0 0 -1 -2 -2 -2 -2 0 0 0 0 1 0 0 0 0 1 0 0 -1 -1 -1 -1 -1 -1 -1 -1 -1
644 -1 0 0 0 1 1 1 1 1 1 0 0 0 0 0 0 0 0 0 0 0 -1 0 1 1 0 0 0 0 0 1 1 0 1 1 0 0 1 1 1 1 0 0 -1 -1 -1 0 1 1 2 1 1 1 1 1 1 2 2 2 1 1 1 1 1 0 0 0 -1 -1 0 0 0 0
635 0 1 0 0 0 0 0 0 -1 -2 -1 0 0 -1 -1 -1 0 0 -1 -1 -1 0 0 0 -1 -1 -1 -2 -1 -1 -1 0 0 -1 -1 -1 0 0 0 -1 -1 -2 -2 -2 -1 -1 0 0 -1 -1 -1 -1 -1 0 0 -1 -1 -1 -1 -1 0 0 0 0 0 -1 -1 0 0 0 0 0 -1
626 -1 -1 -1 -1 -1 -1 -1 0 -1 -1 -1 -1 0 0 1 1 1 1 1 1 0 0 -1 -1 -1 -1 -2 -2 -1 0 1 1 0 0 -1 -1 -1 -1 0 0 0 0 0 0 -1 -1 -1 -1 0 0 -1 -1 -1 0 0 0 1 1 0 0 0 -1 -2 -2 -2 -2 -2 -2 -2 -2 -1 -1 0
617 0 0 0 0 0 0 0 -1 -1 -1 -1 -1 -1 0 -1 -1 -1 -2 -1 -1 -1 -1 -1 -1 -1 -2 -1 -1 0 0 0 0 -1 -2 -2 -1 0 0 -1 -1 -1 -1 -1 -2 -2 -2 -2 -1 -1 -1 -1 -1 0 -1 -1 -1 -1 -1 -1 -1 -1 -1 -1 -1 -1 -1 -1 -1 -2 -2 -1 -1 -1
608a%Jj%%%%%%%%%%%J%%%%%J%%%%%%%%jJ%jJ%%jj%%Jj%J%%%%%J%%Jj%%jjJJ%%j%jJJ%%j%j
599a%%%J%%jJ%%J%%J%Jj%j%%%%%%J%%Jj%%J%%j%%%Jj%%%%%%%%j%%jj%%%%J%%%%%j%JJ%%j%
590@%j%%%%%J%%%%%j%%%%%%J%%%j%%%J%%%%k%%JJ%%J%%%%j%%%j%%%%%Jj%%%%%%%%%%%J%%%
581@%%%%%%%%J%%%%j%%%%%%%%%jjJ%%%%%J%%j%%%%J%J%%%%J%%j%%%j%%%%%%%%%%%%J%%j%%
572@%j%%J%%%%j%J%%%%%%%j%%%%J%%%J%%%%j%%%%Jj%%Jjj%%J%%%%%%%%%J%j%%j%J%%%J%%%
563A%%jJ%JJ%jj%%jJ%jJJ%jjJJj%%%%j%%%%jJ%%%%J%%%%%%j%%%J%%%%%J%Jj%%%%jJ%%j%%%
554A%J%%j%%j%%J%%j%%J%%%j%%%%%%J%%JJ%jjjJJ%%%J%%j%%j%%J%%J%J%jj%%J%%%%%%%%Jj
545C%JJj%j%%%%%%%j%%%%J%%j%J%%%j%J%%%%%%%J%J%%%%%J%%j%j%%%%%%J%%%%J%%%%%%%%%
$$ plain form
608 -1 -1 0 -1 -1 -1 -1 -1 -1 -1 -1 -1 -1 -1 -1 0 0 0 0 0 0 1 1 1 1 1 1 1 1 1 0 1 1 0 1 1 1 0 -1 -1 -1 0 -1 -1 0 0 0 0 0 0 1 1 1 2 1 1 1 0 -1 0 1 1 1 0 0 -1 0 1 1 1 0 0 -1
599 -1 -1 -1 -1 0 0 0 -1 0 0 0 1 1 1 2 2 3 2 2 1 1 1 1 1 1 1 2 2 2 3 2 2 2 3 3 3 2 2 2 2 3 2 2 2 2 2 2 2 2 2 1 1 1 0 -1 -1 -1 -1 -1 0 0 0 0 0 0 -1 -1 0 1 1 1 0 0
590 0 0 -1 -1 -1 -1 -1 -1 0 0 0 0 0 0 -1 -1 -1 -1 -1 -1 -1 0 0 0 0 -1 -1 -1 -1 0 0 0 0 0 -2 -2 -2 -1 0 0 0 1 1 1 1 1 0 0 0 0 -1 -1 -1 -1 -1 -1 0 -1 -1 -1 -1 -1 -1 -1 -1 -1 -1 -1 -1 0 0 0 0
581 0 0 0 0 0 0 0 0 0 1 1 1 1 1 0 0 0 0 0 0 0 0 0 0 -1 -2 -1 -1 -1 -1 -1 -1 0 0 0 -1 -1 -1 -1 -1 0 0 1 1 1 1 1 2 2 2 1 1 1 1 0 0 0 0 0 0 0 0 0 0 0 0 0 1 1 1 0 0 0
572 0 0 -1 -1 -1 0 0 0 0 0 -1 -1 0 0 0 0 0 0 0 0 -1 -1 -1 -1 -1 0 0 0 0 1 1 1 1 1 0 0 0 0 0 1 0 0 0 1 0 -1 -1 -1 0 0 0 0 0 0 0 0 0 0 1 1 0 0 0 -1 -1 0 0 0 0 1 1 1 1
563 1 1 1 0 1 1 2 3 3 2 1 1 1 0 1 1 0 1 2 2 1 0 1 2 1 1 1 1 1 0 0 0 0 0 -1 0 0 0 0 0 1 1 1 1 1 1 1 0 0 0 0 1 1 1 1 1 1 2 2 3 2 2 2 2 2 1 2 2 2 1 1 1 1
554 1 1 2 2 2 1 1 1 0 0 0 1 1 1 0 0 0 1 1 1 1 0 0 0 0 0 0 0 1 1 1 2 3 3 2 1 0 1 2 2 2 2 3 3 3 2 2 2 1 1 1 2 2 2 3 3 4 4 3 2 2 2 3 3 3 3 3 3 3 3 3 4 3
545 3 3 4 5 4 4 3 3 3 3 3 3 3 3 2 2 2 2 2 3 3 3 2 2 3 3 3 3 2 2 3 3 3 3 3 3 3 3 4 4 5 5 5 5 5 5 6 6 6 5 5 4 4 4 4 4 4 4 5 5 5 5 5 6 6 6 6 6 6 6 6 6 6
536F%J%%%%%%%%Jj%%jJ%%%J%%jJ%%J%%J%%jJ%%j%%%%%j%j%J%%J%%jJ%%%%%%%j%%%%%%%%%%
527H%%%%%J%%jJJ%%j%%%%%%j%jJJj%J%%jJ%%%J%%%%%j%%J%%%%%%%jJ%J%J%%j%%%%J%%%j%%
518A1%j%%%%J%%%%J%%%%%%%%%%J%%J%JJjjJ%%%%%%%JJ%%J%%%J%j%JJ%%J%J%J%%JJKJJJ%%J
509C1j%%j%%jjjjjk%jjkjjjjkj%j%jj%j%%j%j%j%j%%J%j%jJ%%%Jj%j%%%J%%%j%%%%jJ%j%%
500AJj%%%%%%J%%%%%%%%%j%j%%%%J%j%%%J%J%j%%%%%%%%jJ%%%%J%%%%%%%jJ%%%%JJ%%J%%K
491GJKKJJ%%jj%jjkjjj%jj%%j%%%%%j%%%%%%J%j%%%%%J%JK%jJ%%%JJJLKLLLLJ%jkkkkkllk
482Gjjj%j%%%j%%j%j%j%J%%%J%j%%J%JjJ%j%%JJJ%JJJKJK%%j%jjjkjjj%jj%%K%%JJ%JJ%%k
473E%j%%%%jj%%%j%%j%%%%%j%%%%J%%J%%%%%%%%%%J%J%%%KJ%j%jjj%%%%j%%j%J%%%j%%%j%
$$ plain form
536 6 6 7 7 7 7 7 7 7 7 7 8 7 7 7 6 7 7 7 7 8 8 8 7 8 8 8 9 9 9 10 10 10 9 10 10 10 9 9 9 9 9 9 8 8 7 7 8 8 8 9 9 9 8 9 9 9 9 9 9 9 9 8 8 8 8 8 8 8 8 8 8 8
527 8 8 8 8 8 8 9 9 9 8 9 10 10 10 9 9 9 9 9 9 9 8 8 7 8 9 8 8 9 9 9 8 9 9 9 9 10 10 10 10 10 10 9 9 9 10 10 10 10 10 10 10 10 9 10 10 11 11 12 12 12 11 11 11 11 11 12 12 12 12 11 11 11
518 11 11 10 10 10 10 10 11 11 11 11 11 12 12 12 12 12 12 12 12 12 12 12 13 13 13 14 14 15 16 15 14 15 15 15 15 15 15 15 15 16 17 17 17 18 18 18 18 19 19 18 18 19 20 20 20 21 21 22 22 23 23 23 24 25 27 28 29 30 30 30 31
509 31 30 30 30 29 29 29 28 27 26 25 24 22 22 21 20 18 17 16 15 14 12 11 11 10 10 9 8 8 7 7 7 6 6 5 5 4 4 3 3 3 4 4 3 3 2 3 3 3 3 4 3 3 2 2 2 2 3 3 3 3 2 2 2 2 2 1 2 2 1 1 1
500 1 2 1 1 1 1 1 1 1 2 2 2 2 2 2 2 2 2 2 1 1 0 0 0 0 0 1 1 0 0 0 0 1 1 2 2 1 1 1 1 1 1 1 1 1 0 1 1 1 1 1 2 2 2 2 2 2 2 2 1 2 2 2 2 2 3 4 4 4 5 5 5 7
491 7 8 10 12 13 14 14 14 13 12 12 11 10 8 7 6 5 5 4 3 3 3 2 2 2 2 2 2 1 1 1 1 1 1 1 2 2 1 1 1 1 1 1 2 2 3 5 5 4 5 5 5 5 6 7 8 11 13 16 19 22 25 26 26 25 23 21 19 17 15 12 9 7
482 7 6 5 4 4 3 3 3 3 2 2 2 1 1 0 0 -1 -1 0 0 0 0 1 1 0 0 0 1 1 2 1 2 2 1 1 1 2 3 4 4 5 6 7 9 10 12 12 12 11 11 10 9 8 6 5 4 3 3 2 1 1 1 3 3 3 4 5 5 6 7 7 7 5
473 5 5 4 4 4 4 4 3 2 2 2 2 1 1 1 0 0 0 0 0 0 -1 -1 -1 -1 -1 0 0 0 1 1 1 1 1 1 1 1 1 1 1 2 2 3 3 3 3 5 6 6 5 5 4 3 2 2 2 2 2 1 1 1 0 0 1 1 1 1 0 0 0 0 -1 -1
464aJ%%%%%%%%J%jJj%%%j%%%%%%%%%J%%%j%%%%%J%%JJj%Jjj%%j%%%JJ%j%%%Jj%%j%%%%J%%
455@j%%%%J%jJJJj%%%%J%J%j%%j%j%%J%%j%%%%%%%%%%j%j%J%%J%%jJ%%%jjJ%J%%%%%%j%%%
446aJ%j%%%%%J%%%Jj%%%%j%j%%JJ%%%%%%%%%%j%%J%%%Jjj%%%%%%%%J%%%%Jj%J%j%jjJ%%J%
437@%%%j%%j%J%%JJj%%j%Jj%%%%%J%%jJ%%%%j%%J%%%%j%%%%J%%jJ%%J%%j%%%j%J%%%%%%%%
428@%jJ%Jjj%%%%J%%J%%%j%%%Jj%%%%%J%jj%%%%%%%%%%%%%%%%%%%%%%J%%%%%%%%%J%%j%%%
419@%%%J%%%%j%%%%%%j%%%%%%%%%j%JJ%%j%%J%%%%%%%%%%%%j%J%%%%%%%%%%%j%%%%%%Jj%%
410a%%%j%J%%%%J%%%%%%j%%%J%%%%%%J%Jjj%%%%%%%j%%%J%J%%jjJ%%%j%%%%%%%%%%%%%%Jj
401a%J%%%%Jj%%j%%J%%%%%%%%j%%j%%%J%%%%%%%%j%J%J%jj%%J%%%%%Jj%%%%Jj%%J%j%j%J%
$$ plain form
464 -1 0 0 0 0 0 0 0 0 0 1 1 0 1 0 0 0 0 -1 -1 -1 -1 -1 -1 -1 -1 -1 -1 0 0 0 0 -1 -1 -1 -1 -1 -1 0 0 0 1 2 1 1 2 1 0 0 0 -1 -1 -1 -1 0 1 1 0 0 0 0 1 0 0 0 -1 -1 -1 -1 -1 0 0 0
455 0 -1 -1 -1 -1 -1 0 0 -1 0 1 2 1 1 1 1 1 2 2 3 3 2 2 2 1 1 0 0 0 1 1 1 0 0 0 0 0 0 0 0 0 0 0 -1 -1 -2 -2 -1 -1 -1 0 0 0 -1 0 0 0 0 -1 -2 -1 -1 0 0 0 0 0 0 0 -1 -1 -1 -1
446 -1 0 0 -1 -1 -1 -1 -1 -1 0 0 0 0 1 0 0 0 0 0 -1 -1 -2 -2 -2 -1 0 0 0 0 0 0 0 0 0 0 0 -1 -1 -1 0 0 0 0 1 0 -1 -1 -1 -1 -1 -1 -1 -1 -1 0 0 0 0 0 1 0 0 1 1 0 0 -1 -2 -1 -1 -1 0 0
437 0 0 0 0 -1 -1 -1 -2 -2 -1 -1 -1 0 1 0 0 0 -1 -1 0 -1 -1 -1 -1 -1 -1 0 0 0 -1 0 0 0 0 0 -1 -1 -1 0 0 0 0 0 -1 -1 -1 -1 -1 0 0 0 -1 0 0 0 1 1 1 0 0 0 0 -1 -1 0 0 0 0 0 0 0 0 0
428 0 0 -1 0 0 1 0 -1 -1 -1 -1 -1 0 0 0 1 1 1 1 0 0 0 0 1 0 0 0 0 0 0 1 1 0 -1 -1 -1 -1 -1 -1 -1 -1 -1 -1 -1 -1 -1 -1 -1 -1 -1 -1 -1 -1 -1 -1 -1 0 0 0 0 0 0 0 0 0 0 1 1 1 0 0 0 0
419 0 0 0 0 1 1 1 1 1 0 0 0 0 0 0 0 -1 -1 -1 -1 -1 -1 -1 -1 -1 -1 -2 -2 -1 0 0 0 -1 -1 -1 0 0 0 0 0 0 0 0 0 0 0 0 0 -1 -1 0 0 0 0 0 0 0 0 0 0 0 0 -1 -1 -1 -1 -1 -1 -1 0 -1 -1 -1
410 -1 -1 -1 -1 -2 -2 -1 -1 -1 -1 -1 0 0 0 0 0 0 0 -1 -1 -1 -1 0 0 0 0 0 0 0 1 1 2 1 0 0 0 0 0 0 0 0 -1 -1 -1 -1 0 0 1 1 1 0 -1 0 0 0 0 -1 -1 -1 -1 -1 -1 -1 -1 -1 -1 -1 -1 -1 -1 -1 0 -1
401 -1 -1 0 0 0 0 0 1 0 0 0 -1 -1 -1 0 0 0 0 0 0 0 0 0 -1 -1 -1 -2 -2 -2 -2 -1 -1 -1 -1 -1 -1 -1 -1 -1 -2 -2 -1 -1 0 0 -1 -2 -2 -2 -1 -1 -1 -1 -1 -1 0 -1 -1 -1 -1 -1 0 -1 -1 -1 0 0 -1 -1 -2 -2 -1 -1
392a%%J%%%%%%%%%J%%%j%jJ%%%%%%%%%%Jj%%jj%J%j%J%%J%%%%%%%j%J%%%j%%%jJJ%j%%%Jj
383a%J%%%J%j%J%%j%jJJ%j%%%Jj%%j%%%J%%%%jjJJ%j%J%J%%%%%%%%j%%%j%%%%%%J%%%jJ%J
374A%%%jj%J%%%%j%%%J%%%%%%J%%j%j%%%%jJ%%%%J%Jj%%jJ%%%%%%J%%%J%%%%j%%J%j%%%j%
365@%J%%%%J%J%%%jJJJ%%%%%%Jj%%%%%J%%%j%%j%%%Jj%%jJJ%J%%%JjjJ%%%%jJJJJ%%%JJJj
356A1J%j%%j%%%j%jj%%%j%%%%%%%%%%%%J%%jjJJ%j%%J%%%j%jJJ%%%JJ%%%J%jj%%%J%%%%j%
347H%j%%%%Jj%%JJ%j%%%jJ%%%j%%Jj%%%Jj%%%%%%%Jj%%%%%j%%%%%j%%%J%j%%j%%%%%%%%%%
338D%%%%%%J%%j%J%%k%%%%jJj%%%J%j%%%%jjJ%j%%J%J%%%%%%%%%%%%%j%%J%%Jj%%%j%J%%%
329B%j%%%%j%%J%%Jj%%j%%%%%%%J%Jjj%%%j%%%J%%%%%%%%J%%%%j%%%jjJ%J%%%%%j%J%jjJ%
$$ plain form
392 -1 -1 -1 0 0 0 0 0 0 0 0 0 0 1 1 1 1 0 0 -1 0 0 0 0 0 0 0 0 0 0 0 1 0 0 0 -1 -2 -2 -1 -1 -2 -2 -1 -1 -1 0 0 0 0 0 0 0 0 -1 -1 0 0 0 0 -1 -1 -1 -1 -2 -1 0 0 -1 -1 -1 -1 0 -1
383 -1 -1 0 0 0 0 1 1 0 0 1 1 1 0 0 -1 0 1 1 0 0 0 0 1 0 0 0 -1 -1 -1 -1 0 0 0 0 0 -1 -2 -1 0 0 -1 -1 0 0 1 1 1 1 1 1 1 1 1 0 0 0 0 -1 -1 -1 -1 -1 -1 -1 0 0 0 0 -1 0 0 1
374 1 1 1 1 0 -1 -1 0 0 0 0 0 -1 -1 -1 -1 0 0 0 0 0 0 0 1 1 1 0 0 -1 -1 -1 -1 -1 -2 -1 -1 -1 -1 -1 0 0 1 0 0 0 -1 0 0 0 0 0 0 0 1 1 1 1 2 2 2 2 2 1 1 1 2 2 1 1 1 1 0 0
365 0 0 1 1 1 1 1 2 2 3 3 3 3 2 3 4 5 5 5 5 5 5 5 6 5 5 5 5 5 5 6 6 6 6 5 5 5 4 4 4 4 5 4 4 4 3 4 5 5 6 6 6 6 7 6 5 6 6 6 6 6 5 6 7 8 9 9 9 9 10 11 12 11
356 11 12 12 11 11 11 10 10 10 10 9 9 8 7 7 7 7 6 6 6 6 6 6 6 6 6 6 6 6 6 7 7 7 6 5 6 7 7 6 6 6 7 7 7 7 6 6 5 6 7 7 7 7 8 9 9 9 9 10 10 9 8 8 8 8 9 9 9 9 9 8 8
347 8 8 7 7 7 7 7 8 7 7 7 8 9 9 8 8 8 8 7 8 8 8 8 7 7 7 8 7 7 7 7 8 7 7 7 7 7 7 7 7 8 7 7 7 7 7 7 6 6 6 6 6 6 5 5 5 5 6 6 5 5 5 4 4 4 4 4 4 4 4 4 4 4
338 4 4 4 4 4 4 4 5 5 5 4 4 5 5 5 3 3 3 3 3 2 3 2 2 2 2 3 3 2 2 2 2 2 1 0 1 1 0 0 0 1 1 2 2 2 2 2 2 2 2 2 2 2 2 2 2 1 1 1 2 2 2 3 2 2 2 2 1 1 2 2 2 2
329 2 2 1 1 1 1 1 0 0 0 1 1 1 2 1 1 1 0 0 0 0 0 0 0 0 1 1 2 1 0 0 0 0 -1 -1 -1 -1 0 0 0 0 0 0 0 0 0 1 1 1 1 1 0 0 0 0 -1 -2 -1 -1 0 0 0 0 0 0 -1 -1 0 0 -1 -2 -1 -1
320a%%%%%jJ%%j%%%Jj%%J%%%%%%%j%%J%Jj%%%%%%%J%j%%%J%jjJ%%%%%jJJ%%%jJ%%%jJJjj%
310ajJJj%j%%%JJJ%%%%%%j%%%%%%%%j%%%j%%J%%%J%%%%%j%%%%%%jJ%%jJ%%%jJ%%%J%%j%%j
301b%%%%%%%%%%J%%%j%J%%%j%%jJ%%J%%%%%J%jj%%J%j%%J%J%j%%%%j%%%%%%%%%J%%J%%j%%
292aj%%%J%%j%%%%%J%%%%%jJ%%%%%%%%%%%%%%%%%%%%%%Jjj%%%%%%%%J%%%%jJ%%%%%%%%jJ%
283a%%%j%%%J%%%%%J%j%%J%%j%jjJ%J%%%%%%%%%%%%%%%jJ%j%%%%%%%%J%%%%jj%%J%%J%%%%
274a%%jjJ%J%%%j%J%%%J%%%%j%%j%%%Jjj%%%J%%%%%%J%%%%%%%%%%%j%%%%%J%%%%j%%%%%%%
265b%%%%%%%J%%%%%%%jJ%%%%%%j%%J%J%%j%%j%j%%%Jj%J%%%J%%%%%j%jJ%%JJ%j%%%%%%%%%
256aj%%%%%%Jj%J%%j%%%%%%%%%j%JJ%%%J%%%%%%%j%%j%Jj%%%%J%%%%%J%%j%%%%j%%%j%jJJ
$$ plain form
320 -1 -1 -1 -1 -1 -1 -2 -1 -1 -1 -2 -2 -2 -2 -1 -2 -2 -2 -1 -1 -1 -1 -1 -1 -1 -1 -2 -2 -2 -1 -1 0 -1 -1 -1 -1 -1 -1 -1 -1 0 0 -1 -1 -1 -1 0 0 -1 -2 -1 -1 -1 -1 -1 -1 -2 -1 0 0 0 0 -1 0 0 0 0 -1 0 1 0 -1 -1
310 -1 -2 -1 0 -1 -1 -2 -2 -2 -2 -1 0 1 1 1 1 1 1 1 0 0 0 0 0 0 0 0 0 -1 -1 -1 -1 -2 -2 -2 -1 -1 -1 -1 0 0 0 0 0 0 -1 -1 -1 -1 -1 -1 -1 -2 -1 -1 -1 -2 -1 -1 -1 -1 -2 -1 -1 -1 -1 0 0 0 -1 -1 -1 -2
301 -2 -2 -2 -2 -2 -2 -2 -2 -2 -2 -2 -1 -1 -1 -1 -2 -2 -1 -1 -1 -1 -2 -2 -2 -3 -2 -2 -2 -1 -1 -1 -1 -1 -1 0 0 -1 -2 -2 -2 -1 -1 -2 -2 -2 -1 -1 0 0 -1 -1 -1 -1 -1 -2 -2 -2 -2 -2 -2 -2 -2 -2 -2 -1 -1 -1 0 0 0 -1 -1 -1
292 -1 -2 -2 -2 -2 -1 -1 -1 -2 -2 -2 -2 -2 -2 -1 -1 -1 -1 -1 -1 -2 -1 -1 -1 -1 -1 -1 -1 -1 -1 -1 -1 -1 -1 -1 -1 -1 -1 -1 -1 -1 -1 -1 -1 0 -1 -2 -2 -2 -2 -2 -2 -2 -2 -2 -1 -1 -1 -1 -1 -2 -1 -1 -1 -1 -1 -1 -1 -1 -1 -2 -1 -1
283 -1 -1 -1 -1 -2 -2 -2 -2 -1 -1 -1 -1 -1 -1 0 0 -1 -1 -1 0 0 0 -1 -1 -2 -3 -2 -2 -1 -1 -1 -1 -1 -1 -1 -1 -1 -1 -1 -1 -1 -1 -1 -1 -2 -1 -1 -2 -2 -2 -2 -2 -2 -2 -2 -2 -1 -1 -1 -1 -1 -2 -3 -3 -3 -2 -2 -2 -1 -1 -1 -1 -1
274 -1 -1 -1 -2 -3 -2 -2 -1 -1 -1 -1 -2 -2 -1 -1 -1 -1 0 0 0 0 0 -1 -1 -1 -2 -2 -2 -2 -1 -2 -3 -3 -3 -3 -2 -2 -2 -2 -2 -2 -2 -1 -1 -1 -1 -1 -1 -1 -1 -1 -1 -1 -1 -2 -2 -2 -2 -2 -2 -1 -1 -1 -1 -1 -2 -2 -2 -2 -2 -2 -2 -2
265 -2 -2 -2 -2 -2 -2 -2 -2 -1 -1 -1 -1 -1 -1 -1 -1 -2 -1 -1 -1 -1 -1 -1 -1 -2 -2 -2 -1 -1 0 0 0 -1 -1 -1 -2 -2 -3 -3 -3 -3 -2 -3 -3 -2 -2 -2 -2 -1 -1 -1 -1 -1 -1 -2 -2 -3 -2 -2 -2 -1 0 0 -1 -1 -1 -1 -1 -1 -1 -1 -1 -1
256 -1 -2 -2 -2 -2 -2 -2 -2 -1 -2 -2 -1 -1 -1 -2 -2 -2 -2 -2 -2 -2 -2 -2 -2 -3 -3 -2 -1 -1 -1 -1 0 0 0 0 0 0 0 0 -1 -1 -1 -2 -2 -1 -2 -2 -2 -2 -2 -1 -1 -1 -1 -1 -1 0 0 0 -1 -1 -1 -1 -1 -2 -2 -2 -2 -3 -3 -4 -3 -2
247bJ%%%%j%JJ%jj%Jj%%%%%%%J%%%j%%%%%J%%%%jJ%%%J%%jJ%jjJ%%%%%%JjjJj%%%Jjj%JJ%
238a%jJJj%%%j%%%%%%%%J%%%%j%%%J%%%Jj%%%j%%%J%Jj%%%%%%%%%J%%%%%%%%j%%%%%%%%%%
229a%%%j%%%%%%%%%%J%%j%j%%J%%%jjJ%%J%%%%%%%%%%%jJ%%Jk%%J%J%%%%%%%%%j%%%%%%%%
220b%%JJ%%j%J%%j%j%jjJJ%%%%JjJ%%%%%%%%%%%%%%Jj%j%J%%%%%%%%%jjJ%%%%%%%%j%JJjJ
211aJ%%j%%%j%%%%%jJJ%%%%%%j%%%%%JK%kj%j%%j%KJj%%%%%J%%%j%J%jJ%%%%%%%jJ%%%%j%
202b%%%%%J%%%j%%%J%%%Jjjj%J%%%%%%%%%J%JjJ%%j%%%%J%%j%j%%j%jJJ%%%%J%%%Jjj%%%j
193c%%%%J%%%J%%%%%J%%J%%%%j%%%j%Jj%%j%%%%jJ%%J%%%%j%%j%J%%%%%jJ%%%%JJ%%jj%%%
184b%%%J%%%jJ%%%J%%jj%%%%%jJJ%%j%%%%%%%%%%%%%%%%%J%%%j%jJJ%%j%j%J%%J%j%%J%%j
$$ plain form
247 -2 -1 -1 -1 -1 -1 -2 -2 -1 0 0 -1 -2 -2 -1 -2 -2 -2 -2 -2 -2 -2 -2 -1 -1 -1 -1 -2 -2 -2 -2 -2 -2 -1 -1 -1 -1 -1 -2 -1 -1 -1 -1 0 0 0 -1 0 0 -1 -2 -1 -1 -1 -1 -1 -1 -1 0 -1 -2 -1 -2 -2 -2 -2 -1 -2 -3 -3 -2 -1 -1
238 -1 -1 -2 -1 0 -1 -1 -1 -1 -2 -2 -2 -2 -2 -2 -2 -2 -2 -1 -1 -1 -1 -1 -2 -2 -2 -2 -1 -1 -1 -1 0 -1 -1 -1 -1 -2 -2 -2 -2 -1 -1 0 -1 -1 -1 -1 -1 -1 -1 -1 -1 -1 0 0 0 0 0 0 0 0 0 -1 -1 -1 -1 -1 -1 -1 -1 -1 -1 -1
229 -1 -1 -1 -1 -2 -2 -2 -2 -2 -2 -2 -2 -2 -2 -2 -1 -1 -1 -2 -2 -3 -3 -3 -2 -2 -2 -2 -3 -4 -3 -3 -3 -2 -2 -2 -2 -2 -2 -2 -2 -2 -2 -2 -2 -3 -2 -2 -2 -1 -3 -3 -3 -2 -2 -1 -1 -1 -1 -1 -1 -1 -1 -1 -1 -2 -2 -2 -2 -2 -2 -2 -2 -2
220 -2 -2 -2 -1 0 0 0 -1 -1 0 0 0 -1 -1 -2 -2 -3 -4 -3 -2 -2 -2 -2 -2 -1 -2 -1 -1 -1 -1 -1 -1 -1 -1 -1 -1 -1 -1 -1 -1 -1 0 -1 -1 -2 -2 -1 -1 -1 -1 -1 -1 -1 -1 -1 -1 -2 -3 -2 -2 -2 -2 -2 -2 -2 -2 -2 -3 -3 -2 -1 -2 -1
211 -1 0 0 0 -1 -1 -1 -1 -2 -2 -2 -2 -2 -2 -3 -2 -1 -1 -1 -1 -1 -1 -1 -2 -2 -2 -2 -2 -2 -1 1 1 -1 -2 -2 -3 -3 -3 -4 -4 -2 -1 -2 -2 -2 -2 -2 -2 -1 -1 -1 -1 -2 -2 -1 -1 -2 -1 -1 -1 -1 -1 -1 -1 -1 -2 -1 -1 -1 -1 -1 -2 -2
202 -2 -2 -2 -2 -2 -2 -1 -1 -1 -1 -2 -2 -2 -2 -1 -1 -1 -1 0 -1 -2 -3 -3 -2 -2 -2 -2 -2 -2 -2 -2 -2 -2 -1 -1 0 -1 0 0 0 -1 -1 -1 -1 -1 0 0 0 -1 -1 -2 -2 -2 -3 -3 -4 -3 -2 -2 -2 -2 -2 -1 -1 -1 -1 0 -1 -2 -2 -2 -2 -3
193 -3 -3 -3 -3 -3 -2 -2 -2 -2 -1 -1 -1 -1 -1 -1 0 0 0 1 1 1 1 1 0 0 0 0 -1 -1 0 -1 -1 -1 -2 -2 -2 -2 -2 -3 -2 -2 -2 -1 -1 -1 -1 -1 -2 -2 -2 -3 -3 -2 -2 -2 -2 -2 -2 -3 -2 -2 -2 -2 -2 -1 0 0 0 -1 -2 -2 -2 -2
184 -2 -2 -2 -2 -1 -1 -1 -1 -2 -1 -1 -1 -1 0 0 0 -1 -2 -2 -2 -2 -2 -2 -3 -2 -1 -1 -1 -2 -2 -2 -2 -2 -2 -2 -2 -2 -2 -2 -2 -2 -2 -2 -2 -2 -2 -1 -1 -1 -1 -2 -2 -3 -2 -1 -1 -1 -2 -2 -3 -3 -2 -2 -2 -1 -1 -2 -2 -2 -1 -1 -1 -2
175b%%%%%Jj%%%%J%%%%%%%%%Jj%%%%j%%%jJ%J%j%%%%%%%%%%%%%%jJ%%j%%%%%Jj%%%J%J%%%
166a%%J%j%%%%%%%%Jj%%%%%%%%%%j%J%J%%j%%%j%%%%jJ%%J%%jj%JJ%%%jj%%J%%%jj%J%%%%
157cJJ%Jj%%%%%%%%%%%jj%%J%%jJJj%%%JJ%J%J%J%%%%%j%J%J%jjj%%%j%%j%J%jj%%%J%%%J
148@%%%j%j%%J%%jJj%%%J%%%j%%%JJ%%%%jj%%%Jj%%%%%Jj%j%j%JJ%%%Jj%%%%%J%%%%%%%%j
139b%%%%%%%j%J%j%%J%%j%j%JJ%J%%j%%%%jJ%%%%j%%%%%%%%%%%%J%%%%J%%%%%%%jjJ%%%%%
130bj%J%%%j%J%%J%j%%%%%jJ%J%%j%%%J%%%jj%%J%%%%%J%jJ%%Jj%jJ%%%jj%J%%%%J%%%jJ%
121a%jjJ%J%%J%%j%%%%jj%%%J%j%%%J%J%%%%%j%%J%%j%%JJ%%j%j%%%%%%%%j%%%J%%%Jj%J%
112a%%%%%%%%j%%%%Jj%%%%%%%%%%%%jJ%%J%jJ%%%%%%j%%J%j%%%%%%J%JjjJ%%%%%%Jj%%%%%
$$ plain form
175 -2 -2 -2 -2 -2 -2 -1 -2 -2 -2 -2 -2 -1 -1 -1 -1 -1 -1 -1 -1 -1 -1 0 -1 -1 -1 -1 -1 -2 -2 -2 -2 -3 -2 -2 -1 -1 -2 -2 -2 -2 -2 -2 -2 -2 -2 -2 -2 -2 -2 -2 -2 -3 -2 -2 -2 -3 -3 -3 -3 -3 -3 -2 -3 -3 -3 -3 -2 -2 -1 -1 -1 -1
166 -1 -1 -1 0 0 -1 -1 -1 -1 -1 -1 -1 -1 -1 0 -1 -1 -1 -1 -1 -1 -1 -1 -1 -1 -1 -2 -2 -1 -1 0 0 0 -1 -1 -1 -1 -2 -2 -2 -2 -2 -3 -2 -2 -2 -1 -1 -1 -2 -3 -3 -2 -1 -1 -1 -1 -2 -3 -3 -3 -2 -2 -2 -2 -3 -4 -4 -3 -3 -3 -3 -3
157 -3 -2 -1 -1 0 -1 -1 -1 -1 -1 -1 -1 -1 -1 -1 -1 -1 -2 -3 -3 -3 -2 -2 -2 -3 -2 -1 -2 -2 -2 -2 -1 0 0 1 1 2 2 3 3 3 3 3 3 2 2 3 3 4 4 3 2 1 1 1 1 0 0 0 -1 -1 0 0 -1 -2 -2 -2 -2 -1 -1 -1 -1 0
148 0 0 0 0 -1 -1 -2 -2 -2 -1 -1 -1 -2 -1 -2 -2 -2 -2 -1 -1 -1 -1 -2 -2 -2 -2 -1 0 0 0 0 0 -1 -2 -2 -2 -2 -1 -2 -2 -2 -2 -2 -2 -1 -2 -2 -3 -3 -4 -4 -3 -2 -2 -2 -2 -1 -2 -2 -2 -2 -2 -2 -1 -1 -1 -1 -1 -1 -1 -1 -1 -2
139 -2 -2 -2 -2 -2 -2 -2 -2 -3 -3 -2 -2 -3 -3 -3 -2 -2 -2 -3 -3 -4 -4 -3 -2 -2 -1 -1 -1 -2 -2 -2 -2 -2 -3 -2 -2 -2 -2 -2 -3 -3 -3 -3 -3 -3 -3 -3 -3 -3 -3 -3 -3 -2 -2 -2 -2 -2 -1 -1 -1 -1 -1 -1 -1 -1 -2 -3 -2 -2 -2 -2 -2 -2
130 -2 -3 -3 -2 -2 -2 -2 -3 -3 -2 -2 -2 -1 -1 -2 -2 -2 -2 -2 -2 -3 -2 -2 -1 -1 -1 -2 -2 -2 -2 -1 -1 -1 -1 -2 -3 -3 -3 -2 -2 -2 -2 -2 -2 -1 -1 -2 -1 -1 -1 0 -1 -1 -2 -1 -1 -1 -1 -2 -3 -3 -2 -2 -2 -2 -2 -1 -1 -1 -1 -2 -1 -1
121 -1 -1 -2 -3 -2 -2 -1 -1 -1 0 0 0 -1 -1 -1 -1 -1 -2 -3 -3 -3 -3 -2 -2 -3 -3 -3 -3 -2 -2 -1 -1 -1 -1 -1 -1 -2 -2 -2 -1 -1 -1 -2 -2 -2 -1 0 0 0 -1 -1 -2 -2 -2 -2 -2 -2 -2 -2 -2 -3 -3 -3 -3 -2 -2 -2 -2 -1 -2 -2 -1 -1
112 -1 -1 -1 -1 -1 -1 -1 -1 -1 -2 -2 -2 -2 -2 -1 -2 -2 -2 -2 -2 -2 -2 -2 -2 -2 -2 -2 -2 -3 -2 -2 -2 -1 -1 -2 -1 -1 -1 -1 -1 -1 -1 -2 -2 -2 -1 -1 -2 -2 -2 -2 -2 -2 -2 -1 -1 0 -1 -2 -1 -1 -1 -1 -1 -1 -1 0 -1 -1 -1 -1 -1 -1
103a%%%%j%%%%J%%%%J%%j%%%%%%%%%jJ%%%%J%%%%%%%jjjJ%%%J%%j%Jj%%%%%%%J%J%j%%%j%
94b%%J%%j%%%%%%J%%%J%%%%%j%jj%J%%%JjJJ%%%%j%%%Jj%%%%%%%%%%%%%jj%J%%%%j%J%J%%
85a%%jJ%J%jj%%%j%%%J%J%%J%%j%%%%%J%j%%%%%%%%%%%j%%%%J%%%%jJ%%%%%j%%J%%j%%%%J
75a%%j%Jjj%J%%Jj%%%%%%j%%J%J%J%%%j%%%j%%%J%%%J%%%j%%Jj%%%J%%%jj%%%%%%%%%jJ%%
66b%%%%%%%%%%jJ%%jJ%%%%j%%J%%%%%%%%%%%j%%JJj%%J%%j%%%%J%%%%%jj%J%%%J%%%%j%j%
57cJ%J%j%%JjjJJ%%j%%%jJJ%jJ%%%%j%%%%j%%J%%Jj%%J%%%%j%%%J%%%%j%jJ%J%JJ%%%j%%j
48a%%jJ%%%%%%JjjJ%%%%%J%%jJ%%%%%%%%j%%%%%jJ%%Jj%%%%j%J%J%jJ%%%%%%%JJ%%j%%%J%
39BJ%%J%%%%j%JJ%J%JJJJKLLMMMNMLJjjlmlmmmmlkkjkjj%k%%%%jJ%%%%j%J%j%j%%%%jJ%%j
$$ plain form
103 -1 -1 -1 -1 -1 -2 -2 -2 -2 -2 -1 -1 -1 -1 -1 0 0 0 -1 -1 -1 -1 -1 -1 -1 -1 -1 -1 -2 -1 -1 -1 -1 -1 0 0 0 0 0 0 0 0 -1 -2 -3 -2 -2 -2 -2 -1 -1 -1 -2 -2 -1 -2 -2 -2 -2 -2 -2 -2 -2 -1 -1 0 0 -1 -1 -1 -1 -2 -2
94 -2 -2 -2 -1 -1 -1 -2 -2 -2 -2 -2 -2 -2 -1 -1 -1 -1 0 0 0 0 0 0 -1 -1 -2 -3 -3 -2 -2 -2 -2 -1 -2 -1 0 0 0 0 0 -1 -1 -1 -1 0 -1 -1 -1 -1 -1 -1 -1 -1 -1 -1 -1 -1 -1 -1 -2 -3 -3 -2 -2 -2 -2 -2 -3 -3 -2 -2 -1 -1 -1
85 -1 -1 -1 -2 -1 -1 0 0 -1 -2 -2 -2 -2 -3 -3 -3 -3 -2 -2 -1 -1 -1 0 0 0 -1 -1 -1 -1 -1 -1 0 0 -1 -1 -1 -1 -1 -1 -1 -1 -1 -1 -1 -1 -2 -2 -2 -2 -2 -1 -1 -1 -1 -1 -2 -1 -1 -1 -1 -1 -1 -2 -2 -2 -1 -1 -1 -2 -2 -2 -2 -2 -1
75 -1 -1 -1 -2 -2 -1 -2 -3 -3 -2 -2 -2 -1 -2 -2 -2 -2 -2 -2 -2 -3 -3 -3 -2 -2 -1 -1 0 0 0 0 -1 -1 -1 -1 -2 -2 -2 -2 -1 -1 -1 -1 0 0 0 0 -1 -1 -1 0 -1 -1 -1 -1 0 0 0 0 -1 -2 -2 -2 -2 -2 -2 -2 -2 -2 -2 -3 -2 -2 -2
66 -2 -2 -2 -2 -2 -2 -2 -2 -2 -2 -2 -3 -2 -2 -2 -3 -2 -2 -2 -2 -2 -3 -3 -3 -2 -2 -2 -2 -2 -2 -2 -2 -2 -2 -2 -2 -3 -3 -3 -2 -1 -2 -2 -2 -1 -1 -1 -2 -2 -2 -2 -2 -1 -1 -1 -1 -1 -1 -2 -3 -3 -2 -2 -2 -2 -1 -1 -1 -1 -1 -2 -2 -3 -3
57 -3 -2 -2 -1 -1 -2 -2 -2 -1 -2 -3 -2 -1 -1 -1 -2 -2 -2 -2 -3 -2 -1 -1 -2 -1 -1 -1 -1 -1 -2 -2 -2 -2 -2 -3 -3 -3 -2 -2 -2 -1 -2 -2 -2 -1 -1 -1 -1 -1 -2 -2 -2 -2 -1 -1 -1 -1 -1 -2 -2 -3 -2 -2 -1 -1 0 1 1 1 1 0 0 0 -1
48 -1 -1 -1 -2 -1 -1 -1 -1 -1 -1 -1 0 -1 -2 -1 -1 -1 -1 -1 -1 0 0 0 -1 0 0 0 0 0 0 0 0 0 -1 -1 -1 -1 -1 -1 -2 -1 -1 -1 0 -1 -1 -1 -1 -1 -2 -2 -1 -1 0 0 -1 0 0 0 0 0 0 0 0 1 2 2 2 1 1 1 1 2 2
39 2 3 3 3 4 4 4 4 4 3 3 4 5 5 6 6 7 8 9 10 12 15 18 22 26 30 35 39 42 43 42 41 38 34 31 27 23 19 15 12 10 8 7 5 4 3 3 1 1 1 1 1 0 1 1 1 1 1 0 0 1 1 0 0 -1 -1 -1 -1 -1 -2 -1 -1 -1 -2
30b%%J%j%%JJj%j%J%%%%jJj%J%%%%%%jJ%%%%%j%%%%j%%%jJJJ%Jj%%%%Jj%j%jJ%j%%%%%%J%
20b%%%j%%%%%%J%%%%%JJ%%%jjjJj%J%%%%%%%%Jj%%%%%%J%%%%%%%%%%%j%%%%J%%%%%%j%%JJ
11@%%%j%j%%%%j%JJj%%%%Jj%j%%JJ%%%j%%%%%%%%Jj%%Jj%JjJ%%%%%%%j%%j%%%J%%%%j%%J%
2bJ%%%%%%%%j%jJJ%%%%%%%%jj%%JJ%%%%%%%Jjj%%%%%%%%%jJ%J%%%%%%%%j%jJ%%j%%JJ%jJ%
-7ajj%%%J%%%J%%%%j%j%J%%%%jJ%%%J%%j%J%jj%%J%%%%j%%%%JJ%%%j%%%%j%Jj%%j%%J%J%%
-16b%%j%%%%%%j%J%J%%%%%%%j%%%JJjj%%%J%jjJ%%JJ%%%j%%%%%%%J%%jj%%J%%%%%%Jj%%%%
-25b%%%%%%%%%%%%%%%jJ%%%jJ%%%%%%%%%%%%JjjJ%JjJ%j%%%jjJ%J%%%%%%%J%%j%%Jj%J%%%
-34ajj%%J%%%%%%%%%%j%JJj%%%%%%%%j%%%%j%%J%%%%J%j%%%J%%%jJ%%%%%j%J%J%%%%j%%%%
$$ plain form
30 -2 -2 -2 -1 -1 -2 -2 -2 -1 0 -1 -1 -2 -2 -1 -1 -1 -1 -1 -2 -1 -2 -2 -1 -1 -1 -1 -1 -1 -1 -2 -1 -1 -1 -1 -1 -1 -2 -2 -2 -2 -2 -3 -3 -3 -3 -4 -3 -2 -1 -1 0 -1 -1 -1 -1 -1 0 -1 -1 -2 -2 -3 -2 -2 -3 -3 -3 -3 -3 -3 -3 -2 -2
20 -2 -2 -2 -2 -3 -3 -3 -3 -3 -3 -3 -2 -2 -2 -2 -2 -2 -1 0 0 0 0 -1 -2 -3 -2 -3 -3 -2 -2 -2 -2 -2 -2 -2 -2 -2 -1 -2 -2 -2 -2 -2 -2 -2 -1 -1 -1 -1 -1 -1 -1 -1 -1 -1 -1 -1 -2 -2 -2 -2 -2 -1 -1 -1 -1 -1 -1 -1 -2 -2 -2 -1 0
11 0 0 0 0 -1 -1 -2 -2 -2 -2 -2 -3 -3 -2 -1 -2 -2 -2 -2 -2 -1 -2 -2 -3 -3 -3 -2 -1 -1 -1 -1 -2 -2 -2 -2 -2 -2 -2 -2 -2 -1 -2 -2 -2 -1 -2 -2 -1 -2 -1 -1 -1 -1 -1 -1 -1 -1 -2 -2 -2 -3 -3 -3 -3 -2 -2 -2 -2 -2 -3 -3 -3 -2 -2
2 -2 -1 -1 -1 -1 -1 -1 -1 -1 -1 -2 -2 -3 -2 -1 -1 -1 -1 -1 -1 -1 -1 -1 -2 -3 -3 -3 -2 -1 -1 -1 -1 -1 -1 -1 -1 0 -1 -2 -2 -2 -2 -2 -2 -2 -2 -2 -2 -3 -2 -2 -1 -1 -1 -1 -1 -1 -1 -1 -1 -2 -2 -3 -2 -2 -2 -3 -3 -3 -2 -1 -1 -2 -1 -1
-7 -1 -2 -3 -3 -3 -3 -2 -2 -2 -2 -1 -1 -1 -1 -1 -2 -2 -3 -3 -2 -2 -2 -2 -2 -3 -2 -2 -2 -2 -1 -1 -1 -2 -2 -1 -1 -2 -3 -3 -3 -2 -2 -2 -2 -2 -3 -3 -3 -3 -3 -2 -1 -1 -1 -1 -2 -2 -2 -2 -2 -3 -3 -2 -3 -3 -3 -4 -4 -4 -3 -3 -2 -2 -2
-16 -2 -2 -2 -3 -3 -3 -3 -3 -3 -3 -4 -4 -3 -3 -2 -2 -2 -2 -2 -2 -2 -2 -3 -3 -3 -3 -2 -1 -2 -3 -3 -3 -3 -2 -2 -3 -4 -3 -3 -3 -2 -1 -1 -1 -1 -2 -2 -2 -2 -2 -2 -2 -2 -1 -1 -1 -2 -3 -3 -3 -2 -2 -2 -2 -2 -2 -2 -1 -2 -2 -2 -2 -2
-25 -2 -2 -2 -2 -2 -2 -2 -2 -2 -2 -2 -2 -2 -2 -2 -2 -3 -2 -2 -2 -2 -3 -2 -2 -2 -2 -2 -2 -2 -2 -2 -2 -2 -2 -2 -1 -2 -3 -2 -2 -1 -2 -1 -1 -2 -2 -2 -2 -3 -4 -3 -3 -2 -2 -2 -2 -2 -2 -2 -2 -1 -1 -1 -2 -2 -2 -1 -2 -2 -1 -1 -1 -1
-34 -1 -2 -3 -3 -3 -2 -2 -2 -2 -2 -2 -2 -2 -2 -2 -2 -3 -3 -2 -1 -2 -2 -2 -2 -2 -2 -2 -2 -2 -3 -3 -3 -3 -3 -4 -4 -4 -3 -3 -3 -3 -3 -2 -2 -3 -3 -3 -3 -2 -2 -2 -2 -3 -2 -2 -2 -2 -2 -2 -3 -3 -2 -2 -1 -1 -1 -1 -1 -2 -2 -2 -2 -2
-43b%j%%%%J%%%%%%%j%%J%j%%%J%%j%%J%%%%JJjj%%%%%%%J%%%%%%j%%%%Jj%%%%%%%%%%%Jj
-53b%j%j%JJJ%J%j%%%%jJjjJ%jJ%JJ%%jj%%%J%%%%jJj%%j%%%J%J%%j%%Jj%%%%J%%%%%%J%%
-62@%%j%%%%%J%j%%%%j%J%%%j%%%%%j%J%%%%%%%%%%%j%%J%%%%%Jj%%%J%%jj%%%%J%%%%%%%
-71b%%jJ%%%%jJ%%%%%%J%%%j%Jjj%%J%J%%%%J%%j%Jj%%j%j%%J%J%%%j%%%%%%Jj%j%J%J%jj
-80cjJ%%J%%%JJ%j%j%%%%j%J%%%%%J%%j%%%%%%%%%%j%%%%%%JJ%Jj%jjJ%%%j%%%%%%%%%%Jj
-89c%JJj%%%%%J%%%j%%J%j%%J%%%%j%%%J%%%j%%%%%Jj%%jJ%%J%%Jjj%j%%JJ%%%%%jj%%JJj
-98bJj%%%J%%jJ%%j%%%%%J%%jJ%%%j%%%%%j%j%%%%JJ%%%%%%j%%J%%J%%%jJ%%%%%%Jjkj%K%
-107b%%%%%%%%Jj%%%%JJj%j%%%%%%%%%%%%%%%%%%%%%j%JJj%j%%J%%%%J%J%%%j%j%%%%%%%j
$$ plain form
-43 -2 -2 -3 -3 -3 -3 -3 -2 -2 -2 -2 -2 -2 -2 -2 -3 -3 -3 -2 -2 -3 -3 -3 -3 -2 -2 -2 -3 -3 -3 -2 -2 -2 -2 -2 -1 0 -1 -2 -2 -2 -2 -2 -2 -2 -2 -1 -1 -1 -1 -1 -1 -1 -2 -2 -2 -2 -2 -1 -2 -2 -2 -2 -2 -2 -2 -2 -2 -2 -2 -2 -1 -2
-53 -2 -2 -3 -3 -4 -4 -3 -2 -1 -1 0 0 -1 -1 -1 -1 -1 -2 -1 -2 -3 -2 -2 -3 -2 -2 -1 0 0 0 -1 -2 -2 -2 -2 -1 -1 -1 -1 -1 -2 -1 -2 -2 -2 -3 -3 -3 -3 -2 -2 -1 -1 -1 -2 -2 -2 -1 -2 -2 -2 -2 -2 -1 -1 -1 -1 -1 -1 -1 0 0 0
-62 0 0 0 -1 -1 -1 -1 -1 -1 0 0 -1 -1 -1 -1 -1 -2 -2 -1 -1 -1 -1 -2 -2 -2 -2 -2 -2 -3 -3 -2 -2 -2 -2 -2 -2 -2 -2 -2 -2 -2 -2 -3 -3 -3 -2 -2 -2 -2 -2 -2 -1 -2 -2 -2 -2 -1 -1 -1 -2 -3 -3 -3 -3 -3 -2 -2 -2 -2 -2 -2 -2 -2
-71 -2 -2 -2 -3 -2 -2 -2 -2 -2 -3 -2 -2 -2 -2 -2 -2 -2 -1 -1 -1 -1 -2 -2 -1 -2 -3 -3 -3 -2 -2 -1 -1 -1 -1 -1 0 0 0 -1 -1 0 -1 -1 -1 -2 -2 -3 -3 -3 -2 -2 -1 -1 -1 -1 -2 -2 -2 -2 -2 -2 -2 -1 -2 -2 -3 -3 -2 -2 -1 -1 -2 -3
-80 -3 -4 -3 -3 -3 -2 -2 -2 -2 -1 0 0 -1 -1 -2 -2 -2 -2 -2 -3 -3 -2 -2 -2 -2 -2 -2 -1 -1 -1 -2 -2 -2 -2 -2 -2 -2 -2 -2 -2 -2 -3 -3 -3 -3 -3 -3 -3 -2 -1 -1 0 -1 -1 -2 -3 -2 -2 -2 -2 -3 -3 -3 -3 -3 -3 -3 -3 -3 -3 -3 -2 -3
-89 -3 -3 -2 -1 -2 -2 -2 -2 -2 -2 -1 -1 -1 -1 -2 -2 -2 -1 -1 -2 -2 -2 -1 -1 -1 -1 -1 -2 -2 -2 -2 -1 -1 -1 -1 -2 -2 -2 -2 -2 -2 -1 -2 -2 -2 -3 -2 -2 -2 -1 -1 -1 0 -1 -2 -2 -3 -3 -3 -2 -1 -1 -1 -1 -1 -1 -2 -3 -3 -3 -2 -1 -2
-98 -2 -1 -2 -2 -2 -2 -1 -1 -1 -2 -1 -1 -1 -2 -2 -2 -2 -2 -2 -1 -1 -1 -2 -1 -1 -1 -1 -2 -2 -2 -2 -2 -2 -3 -3 -4 -4 -4 -4 -4 -3 -2 -2 -2 -2 -2 -2 -2 -3 -3 -3 -2 -2 -2 -1 -1 -1 -1 -2 -1 -1 -1 -1 -1 -1 -1 0 -1 -3 -4 -4 -2 -2
-107 -2 -2 -2 -2 -2 -2 -2 -2 -2 -1 -2 -2 -2 -2 -2 -1 0 -1 -1 -2 -2 -2 -2 -2 -2 -2 -2 -2 -2 -2 -2 -2 -2 -2 -2 -2 -2 -2 -2 -2 -2 -3 -3 -2 -1 -2 -2 -3 -3 -3 -2 -2 -2 -2 -2 -1 -1 0 0 0 0 -1 -1 -2 -2 -2 -2 -2 -2 -2 -2 -3
-116c%%%%J%%%%jJ%%%%%j%%%%%%%J%%%%J%Jjj%jJ%j%%%%%%J%%%j%%%jJJ%%%jJ%%%%J%%%%%
-125aj%%%%%%%%%%%%%%%J%j%%%J%%j%%J%%%j%Jj%%%%J%%jj%%%%%%J%J%%%j%%j%%J%%%%%%%
-133bj%%%%J%%jjJJ%Jjj%%J%%%J%%jJ%jj%J%J%Jj%%%%jJ%%J%%j%k%J%%jj%%%J%%J%%J%jj%
-142c%%%%%%%%%%%%%%Jj%%J%%j%%%%%%J%%%%%Jj%%%%J%j%%%%j%%J%%%%J%%jJ%%%j%%%%j%%
-151c%jJJ%j%J%J%%%j%%J%%jJJ%%jj%%%%%%J%%j%%%%%%%jJ%%j%J%%%%%%%%%j%%%J%%%j%%%
-160c%%J%%%jJ%%jJ%%%%%%J%%%%%%%j%%%%%J%%%%%%%%j%%%%%%%%%%jJ%%%%%%%%%%%%Jj%%%
-169b%j%Jj%J%J%j%%jJJ%j%%%J%%j%j%%%%%%JJ%j%%%J%%%%%j%%%%%%%%%%JJjjjjJJ%%%%j%
-178c%%%%J%Jj%%%%%Jj%j%J%Jj%J%%%%j%%%%%%JJ%%%%jk%%J%%%%%%Jj%%%j%J%%J%jj%J%%j
$$ plain form
-116 -3 -3 -3 -3 -3 -2 -2 -2 -2 -2 -3 -2 -2 -2 -2 -2 -2 -3 -3 -3 -3 -3 -3 -3 -3 -2 -2 -2 -2 -2 -1 -1 0 -1 -2 -2 -3 -2 -2 -3 -3 -3 -3 -3 -3 -3 -2 -2 -2 -2 -3 -3 -3 -3 -4 -3 -2 -2 -2 -2 -3 -2 -2 -2 -2 -2 -1 -1 -1 -1 -1 -1
-125 -1 -2 -2 -2 -2 -2 -2 -2 -2 -2 -2 -2 -2 -2 -2 -2 -2 -1 -1 -2 -2 -2 -2 -1 -1 -1 -2 -2 -2 -1 -1 -1 -1 -2 -2 -1 -2 -2 -2 -2 -2 -1 -1 -1 -2 -3 -3 -3 -3 -3 -3 -3 -2 -2 -1 -1 -1 -1 -2 -2 -2 -3 -3 -3 -2 -2 -2 -2 -2 -2 -2 -2
-133 -2 -3 -3 -3 -3 -3 -2 -2 -2 -3 -4 -3 -2 -2 -1 -2 -3 -3 -3 -2 -2 -2 -2 -1 -1 -1 -2 -1 -1 -2 -3 -3 -2 -2 -1 -1 0 -1 -1 -1 -1 -1 -2 -1 -1 -1 0 0 0 -1 -1 -3 -3 -2 -2 -2 -3 -4 -4 -4 -4 -3 -3 -3 -2 -2 -2 -1 -1 -2 -3 -3
-142 -3 -3 -3 -3 -3 -3 -3 -3 -3 -3 -3 -3 -3 -3 -3 -2 -3 -3 -3 -2 -2 -2 -3 -3 -3 -3 -3 -3 -3 -2 -2 -2 -2 -2 -2 -1 -2 -2 -2 -2 -2 -1 -1 -2 -2 -2 -2 -2 -3 -3 -3 -2 -2 -2 -2 -2 -1 -1 -1 -2 -1 -1 -1 -1 -2 -2 -2 -2 -2 -3 -3 -3
-151 -3 -3 -4 -3 -2 -2 -3 -3 -2 -2 -1 -1 -1 -1 -2 -2 -2 -1 -1 -1 -2 -1 0 0 0 -1 -2 -2 -2 -2 -2 -2 -2 -1 -1 -1 -2 -2 -2 -2 -2 -2 -2 -2 -3 -2 -2 -2 -3 -3 -2 -2 -2 -2 -2 -2 -2 -2 -2 -2 -3 -3 -3 -3 -2 -2 -2 -2 -3 -3 -3 -3
-160 -3 -3 -3 -2 -2 -2 -2 -3 -2 -2 -2 -3 -2 -2 -2 -2 -2 -2 -2 -1 -1 -1 -1 -1 -1 -1 -1 -2 -2 -2 -2 -2 -2 -1 -1 -1 -1 -1 -1 -1 -1 -1 -2 -2 -2 -2 -2 -2 -2 -2 -2 -2 -2 -3 -2 -2 -2 -2 -2 -2 -2 -2 -2 -2 -2 -2 -2 -1 -2 -2 -2 -2
-169 -2 -2 -3 -3 -2 -3 -3 -2 -2 -1 -1 -2 -2 -2 -3 -2 -1 -1 -2 -2 -2 -2 -1 -1 -1 -2 -2 -3 -3 -3 -3 -3 -3 -3 -2 -1 -1 -2 -2 -2 -2 -1 -1 -1 -1 -1 -1 -2 -2 -2 -2 -2 -2 -2 -2 -2 -2 -2 -1 0 -1 -2 -3 -4 -3 -2 -2 -2 -2 -2 -3 -3
-178 -3 -3 -3 -3 -3 -2 -2 -1 -2 -2 -2 -2 -2 -2 -1 -2 -2 -3 -3 -2 -2 -1 -2 -2 -1 -1 -1 -1 -1 -2 -2 -2 -2 -2 -2 -2 -1 0 0 0 0 0 -1 -3 -3 -3 -2 -2 -2 -2 -2 -2 -2 -1 -2 -2 -2 -2 -3 -3 -2 -2 -2 -1 -1 -2 -3 -3 -2 -2 -2 -3
-187c%%J%%%jJJ%j%%%jJ%%%%%%%%JJ%j%j%Jj%%%j%%%%J%%%jJJ%j%%%%%Jj%%%%%%j%J%%J%%
-196aj%%%jJ%%J%%j%%%J%j%jjJ%%%j%%%JJ%%%Jj%J%%j%%%%%%%%%Jj%%%%%%%%%%%%j%%%%%j
-205d%J%%%J%j%%%J%Jj%J%%jj%%%%J%j%%J%%jJ%%J%%j%%j%%JJ%%jjJ%%%%%%%%%%J%%j%%%%
-214b%J%%j%%%%%%%%%J%%j%%%%j%%%%%%%J%%%%%%%J%%%j%%%%%%j%%%J%%Jj%%%%%%%%%%%%%
-223b%jJ%%%%%%%%%%J%Jjj%%%%%%%%%jJ%Jj%%%%%jJJJj%j%Jj%%Jj%%%jJj%%J%%%%%j%%JJ%
-231a%j%j%J%%%%j%%J%jj%J%jJJJjj%%J%Jj%%J%Jj%%%%%jj%%%%%%j%%%JJ%%%Jj%j%%J%%J%
-240a%%j%%Jj%j%J%J%j%j%%J%%%%%%%%%J%%Jjj%%%%%%%%%%%%%j%%%J%%%%%J%%j%%%%%j%%%
-249c%j%%%%%J%%%%%%%%%%J%%%%%%J%%j%j%%%%%Jj%%%%%%Jj%%jJ%%%Jj%J%Jj%j%%%%J%%j%
$$ plain form
-187 -3 -3 -3 -2 -2 -2 -2 -3 -2 -1 -1 -2 -2 -2 -2 -3 -2 -2 -2 -2 -2 -2 -2 -2 -2 -1 0 0 -1 -1 -2 -2 -1 -2 -2 -2 -2 -3 -3 -3 -3 -3 -2 -2 -2 -2 -3 -2 -1 -1 -2 -2 -2 -2 -2 -2 -1 -2 -2 -2 -2 -2 -2 -2 -3 -3 -2 -2 -2 -1 -1 -1
-196 -1 -2 -2 -2 -2 -3 -2 -2 -2 -1 -1 -1 -2 -2 -2 -2 -1 -1 -2 -2 -3 -4 -3 -3 -3 -3 -4 -4 -4 -4 -3 -2 -2 -2 -2 -1 -2 -2 -1 -1 -1 -2 -2 -2 -2 -2 -2 -2 -2 -2 -2 -1 -2 -2 -2 -2 -2 -2 -2 -2 -2 -2 -2 -2 -2 -3 -3 -3 -3 -3 -3 -4
-205 -4 -4 -3 -3 -3 -3 -2 -2 -3 -3 -3 -3 -2 -2 -1 -2 -2 -1 -1 -1 -2 -3 -3 -3 -3 -3 -2 -2 -3 -3 -3 -2 -2 -2 -3 -2 -2 -2 -1 -1 -1 -2 -2 -2 -3 -3 -3 -2 -1 -1 -1 -2 -3 -2 -2 -2 -2 -2 -2 -2 -2 -2 -2 -2 -1 -1 -1 -2 -2 -2 -2 -2
-214 -2 -2 -1 -1 -1 -2 -2 -2 -2 -2 -2 -2 -2 -2 -2 -1 -1 -1 -2 -2 -2 -2 -2 -3 -3 -3 -3 -3 -3 -3 -3 -2 -2 -2 -2 -2 -2 -2 -2 -1 -1 -1 -1 -2 -2 -2 -2 -2 -2 -2 -3 -3 -3 -3 -2 -2 -2 -1 -2 -2 -2 -2 -2 -2 -2 -2 -2 -2 -2 -2 -2 -2
-223 -2 -2 -3 -2 -2 -2 -2 -2 -2 -2 -2 -2 -2 -2 -1 -1 0 -1 -2 -2 -2 -2 -2 -2 -2 -2 -2 -2 -3 -2 -2 -1 -2 -2 -2 -2 -2 -2 -3 -2 -1 0 -1 -1 -2 -2 -1 -2 -2 -2 -1 -2 -2 -2 -2 -3 -2 -3 -3 -3 -2 -2 -2 -2 -2 -2 -3 -3 -3 -2 -1 -1
-231 -1 -1 -2 -2 -3 -3 -2 -2 -2 -2 -2 -3 -3 -3 -2 -2 -3 -4 -4 -3 -3 -4 -3 -2 -1 -2 -3 -3 -3 -2 -2 -1 -2 -2 -2 -1 -1 0 -1 -1 -1 -1 -1 -1 -2 -3 -3 -3 -3 -3 -3 -3 -4 -4 -4 -4 -3 -2 -2 -2 -2 -1 -2 -2 -3 -3 -3 -2 -2 -2 -1 -1
-240 -1 -1 -1 -2 -2 -2 -1 -2 -2 -3 -3 -2 -2 -1 -1 -2 -2 -3 -3 -3 -2 -2 -2 -2 -2 -2 -2 -2 -2 -2 -1 -1 -1 0 -1 -2 -2 -2 -2 -2 -2 -2 -2 -2 -2 -2 -2 -2 -2 -3 -3 -3 -3 -2 -2 -2 -2 -2 -2 -1 -1 -1 -2 -2 -2 -2 -2 -2 -3 -3 -3 -3
-249 -3 -3 -4 -4 -4 -4 -4 -4 -3 -3 -3 -3 -3 -3 -3 -3 -3 -3 -3 -2 -2 -2 -2 -2 -2 -2 -1 -1 -1 -2 -2 -3 -3 -3 -3 -3 -3 -2 -3 -3 -3 -3 -3 -3 -3 -2 -3 -3 -3 -4 -3 -3 -3 -3 -2 -3 -3 -2 -2 -1 -2 -2 -3 -3 -3 -3 -3 -2 -2 -2 -3 -3
-258cjJJ%%jJ%%%%%%jJ%%j%J%%%%%%%%%Jj%%%%j%%%%J%%%J%j%%Jj%j%J%%%%%%%%%%%%jJ%%
-267b%%%%jJ%%%j%%J%jJ%%J%%k%%J%%%%%%%%JjjjJJ%%%%%%J%%%%j%J%%%%%Jj%%%%%j%%J%%
-276aj%%j%%J%%%j%%%%%J%%j%%j%%%J%%%%%JJ%%%%%%j%j%%%J%%j%%%%JJ%%%%%%%%j%%%%%J
-285aj%%%%%j%%%%J%%%%%%%j%%%J%%%jjJ%%%%%%jJ%%%J%%JjJ%jjj%JJj%%J%%j%%J%%j%jJ%
-294cJ%j%%Jj%%J%Jj%%jJ%%Jj%%jJ%%%J%jj%J%J%Jj%kj%%J%J%%%%%%J%j%%jj%%%J%Jj%%jJ
-303cJj%%%%%%%J%%%%%j%%%%%%%J%J%%j%j%jJJ%%%%j%%jJ%%%JJ%Jjj%%%jJ%%%%j%%J%J%%j
-312b%%%%%%%%%Jj%%j%%J%%%%j%%%%%J%J%%j%%%%%%%jj%%J%%%%J%%%%%j%%j%J%%%%%%%%%%
-321cJ%%%%%Jjj%%J%%%JJj%j%%%%%jjJ%%%%j%J%Jj%%%J%J%%j%%%%%J%%%j%j%%J%%jJ%%%j%
$$ plain form
-258 -3 -4 -3 -2 -2 -2 -3 -2 -2 -2 -2 -2 -2 -2 -3 -2 -2 -2 -3 -3 -2 -2 -2 -2 -2 -2 -2 -2 -2 -2 -1 -2 -2 -2 -2 -2 -3 -3 -3 -3 -3 -2 -2 -2 -2 -1 -1 -2 -2 -2 -1 -2 -2 -3 -3 -2 -2 -2 -2 -2 -2 -2 -2 -2 -2 -2 -2 -2 -3 -2 -2 -2
-267 -2 -2 -2 -2 -2 -3 -2 -2 -2 -2 -3 -3 -3 -2 -2 -3 -2 -2 -2 -1 -1 -1 -3 -3 -3 -2 -2 -2 -2 -2 -2 -2 -2 -2 -1 -2 -3 -4 -3 -2 -2 -2 -2 -2 -2 -2 -1 -1 -1 -1 -1 -2 -2 -1 -1 -1 -1 -1 -1 0 -1 -1 -1 -1 -1 -1 -2 -2 -2 -1 -1 -1
-276 -1 -2 -2 -2 -3 -3 -3 -2 -2 -2 -2 -3 -3 -3 -3 -3 -3 -2 -2 -2 -3 -3 -3 -4 -4 -4 -4 -3 -3 -3 -3 -3 -3 -2 -1 -1 -1 -1 -1 -1 -1 -2 -2 -3 -3 -3 -3 -2 -2 -2 -3 -3 -3 -3 -3 -2 -1 -1 -1 -1 -1 -1 -1 -1 -1 -2 -2 -2 -2 -2 -2 -1
-285 -1 -2 -2 -2 -2 -2 -2 -3 -3 -3 -3 -3 -2 -2 -2 -2 -2 -2 -2 -2 -3 -3 -3 -3 -2 -2 -2 -2 -3 -4 -3 -3 -3 -3 -3 -3 -3 -4 -3 -3 -3 -3 -2 -2 -2 -1 -2 -1 -1 -2 -3 -4 -4 -3 -2 -3 -3 -3 -2 -2 -2 -3 -3 -3 -2 -2 -2 -3 -3 -4 -3 -3
-294 -3 -2 -2 -3 -3 -3 -2 -3 -3 -3 -2 -2 -1 -2 -2 -2 -3 -2 -2 -2 -1 -2 -2 -2 -3 -2 -2 -2 -2 -1 -1 -2 -3 -3 -2 -2 -1 -1 0 -1 -1 -3 -4 -4 -4 -3 -3 -2 -2 -2 -2 -2 -2 -2 -1 -1 -2 -2 -2 -3 -4 -4 -4 -4 -3 -3 -2 -3 -3 -3 -4 -3
-303 -3 -2 -3 -3 -3 -3 -3 -3 -3 -3 -2 -2 -2 -2 -2 -2 -3 -3 -3 -3 -3 -3 -3 -3 -2 -2 -1 -1 -1 -2 -2 -3 -3 -4 -3 -2 -2 -2 -2 -2 -3 -3 -3 -4 -3 -3 -3 -3 -2 -1 -1 0 -1 -2 -2 -2 -2 -3 -2 -2 -2 -2 -2 -3 -3 -3 -2 -2 -1 -1 -1 -2
-312 -2 -2 -2 -2 -2 -2 -2 -2 -2 -2 -1 -2 -2 -2 -3 -3 -3 -2 -2 -2 -2 -2 -3 -3 -3 -3 -3 -3 -2 -2 -1 -1 -1 -2 -2 -2 -2 -2 -2 -2 -2 -3 -4 -4 -4 -3 -3 -3 -3 -3 -2 -2 -2 -2 -2 -2 -3 -3 -3 -4 -4 -3 -3 -3 -3 -3 -3 -3 -3 -3 -3 -3
-321 -3 -2 -2 -2 -2 -2 -2 -1 -2 -3 -3 -3 -2 -2 -2 -2 -1 0 -1 -1 -2 -2 -2 -2 -2 -2 -3 -4 -3 -3 -3 -3 -3 -4 -4 -3 -3 -2 -3 -3 -3 -3 -2 -2 -1 -1 -1 -2 -2 -2 -2 -2 -2 -1 -1 -1 -1 -2 -2 -3 -3 -3 -2 -2 -2 -3 -2 -2 -2 -2 -3 -3
-329cJ%%%%J%%j%%J%j%j%%%J%%%J%%%%%%jj%jJ%%K%%j%%%%%J%j%%%%%j%%jJ%%%%J%%%%%%%
-338bJj%jj%%J%%J%Jj%%%%%%%%J%j%%%j%%J%%%J%%j%%%J%%%%j%%%%%j%J%J%%%%%%jj%%jJ%
-347c%j%J%%J%%J%%%%%j%J%jj%J%%j%%%jJ%%%%%%J%%%%%j%%%%%jJ%%%%%%%J%%%%%%%%%%J%
-356a%j%jJJj%j%%%Jj%%j%%J%%%J%j%%%%%%%%%J%j%%%%J%Jj%%Jj%%%%%%%%%%%J%%%jjj%JJ
-365bj%%J%Jj%%%%%%J%%%jj%%%J%%%%%%%j%J%%%%%%%J%jjJ%%%%%%%%j%%%%J%%J%%%j%Jj%%
-374bJ%%%j%%%%jJJj%%%%%%%%%Jj%j%%%J%%%%%%j%%%J%%%%%%%%%%%j%J%%j%%jJ%J%J%%%j%
-383bj%%%%%%%%%J%%Jj%%%%%%j%%%%%%J%%j%%%Jj%%%J%j%j%J%J%j%%%%J%%%%J%%j%%%%%J%
-392aJj%%j%j%%%%J%%%%%%%J%%%j%%%jj%%JJ%%%j%%%%%J%J%%j%%j%J%%%%J%%%j%%%j%%J%%
$$ plain form
-329 -3 -2 -2 -2 -2 -2 -1 -1 -1 -2 -2 -2 -1 -1 -2 -2 -3 -3 -3 -3 -2 -2 -2 -2 -1 -1 -1 -1 -1 -1 -1 -2 -3 -3 -4 -3 -3 -3 -1 -1 -1 -2 -2 -2 -2 -2 -2 -1 -1 -2 -2 -2 -2 -2 -2 -3 -3 -3 -4 -3 -3 -3 -3 -3 -2 -2 -2 -2 -2 -2 -2 -2
-338 -2 -1 -2 -2 -3 -4 -4 -4 -3 -3 -3 -2 -2 -1 -2 -2 -2 -2 -2 -2 -2 -2 -2 -1 -1 -2 -2 -2 -2 -3 -3 -3 -2 -2 -2 -2 -1 -1 -1 -2 -2 -2 -2 -1 -1 -1 -1 -1 -2 -2 -2 -2 -2 -2 -3 -3 -2 -2 -1 -1 -1 -1 -1 -1 -1 -2 -3 -3 -3 -4 -3 -3
-347 -3 -3 -4 -4 -3 -3 -3 -2 -2 -2 -1 -1 -1 -1 -1 -1 -2 -2 -1 -1 -2 -3 -3 -2 -2 -2 -3 -3 -3 -3 -4 -3 -3 -3 -3 -3 -3 -3 -2 -2 -2 -2 -2 -2 -3 -3 -3 -3 -3 -3 -4 -3 -3 -3 -3 -3 -3 -3 -3 -2 -2 -2 -2 -2 -2 -2 -2 -2 -2 -2 -1 -1
-356 -1 -1 -2 -2 -3 -2 -1 -2 -2 -3 -3 -3 -3 -2 -3 -3 -3 -4 -4 -4 -3 -3 -3 -3 -2 -2 -3 -3 -3 -3 -3 -3 -3 -3 -3 -3 -2 -2 -3 -3 -3 -3 -3 -2 -2 -1 -2 -2 -2 -1 -2 -2 -2 -2 -2 -2 -2 -2 -2 -2 -2 -2 -1 -1 -1 -1 -2 -3 -4 -4 -3 -2
-365 -2 -3 -3 -3 -2 -2 -1 -2 -2 -2 -2 -2 -2 -2 -1 -1 -1 -1 -2 -3 -3 -3 -3 -2 -2 -2 -2 -2 -2 -2 -2 -3 -3 -2 -2 -2 -2 -2 -2 -2 -2 -1 -1 -2 -3 -2 -2 -2 -2 -2 -2 -2 -2 -2 -3 -3 -3 -3 -3 -2 -2 -2 -1 -1 -1 -1 -2 -2 -1 -2 -2 -2
-374 -2 -1 -1 -1 -1 -2 -2 -2 -2 -2 -3 -2 -1 -2 -2 -2 -2 -2 -2 -2 -2 -2 -2 -1 -2 -2 -3 -3 -3 -3 -2 -2 -2 -2 -2 -2 -2 -3 -3 -3 -3 -2 -2 -2 -2 -2 -2 -2 -2 -2 -2 -2 -2 -3 -3 -2 -2 -2 -3 -3 -3 -4 -3 -3 -2 -2 -1 -1 -1 -1 -2 -2
-383 -2 -3 -3 -3 -3 -3 -3 -3 -3 -3 -3 -2 -2 -2 -1 -2 -2 -2 -2 -2 -2 -2 -3 -3 -3 -3 -3 -3 -3 -2 -2 -2 -3 -3 -3 -3 -2 -3 -3 -3 -3 -2 -2 -3 -3 -4 -4 -3 -3 -2 -2 -3 -3 -3 -3 -3 -2 -2 -2 -2 -2 -1 -1 -1 -2 -2 -2 -2 -2 -2 -1 -1
-392 -1 0 -1 -1 -1 -2 -2 -3 -3 -3 -3 -3 -2 -2 -2 -2 -2 -2 -2 -2 -1 -1 -1 -1 -2 -2 -2 -2 -3 -4 -4 -4 -3 -2 -2 -2 -2 -3 -3 -3 -3 -3 -3 -2 -2 -1 -1 -1 -2 -2 -2 -3 -3 -2 -2 -2 -2 -2 -1 -1 -1 -1 -2 -2 -2 -2 -3 -3 -3 -2 -2 -2
-401b%%%jJJ%%%%%j%%%%%%J%j%jJ%%%%j%%%%%%%%j%KJ%%j%%%%%%j%%J%j%%%%%jJ%%J%j%%%
-410c%%J%j%%%%Jjj%J%JJ%%%Jjj%jJ%%%%jJ%%%%%%%j%%%%J%%%%%j%%J%%%%J%%%%j%jjJ%%%
-419cJ%%%%%%Jjj%%%J%%%%%j%%%%J%%%%j%%J%%%j%J%%%%%%%%j%Jj%%%%J%%%%%%%Jj%%%%J%
-427aj%jJ%%%%jJ%%%j%%jJ%%%%J%%jJj%%jJ%J%%%jjJ%J%%%%j%j%%JJj%%%%j%%J%%%%%jJ%%
-436c%jJJ%%J%%%j%%j%%J%%%%%j%%%%%%%%%%%%%%j%J%%%%K%j%j%J%%%%jJ%%Jj%%%%%%%%%%
-445b%%jJ%JJj%%j%%%%%%%%%j%JJ%%%%%j%JJ%%%jjjjJJ%%jJJj%%J%%%%%j%%%jJ%%%%%J%jj
-454c%%Jjj%J%%%%J%%%%J%%%j%j%%%%%%J%%%%%%J%j%%%%%%%%%%%%j%%%jJ%J%%j%J%j%jjJJ
-463cJj%j%J%%%%%%%%%%%%%%%%%%Jj%j%J%%%j%JJ%%%%%%%j%%%%%j%jJJ%%%%%jJ%%J%%%%%%
$$ plain form
-401 -2 -2 -2 -2 -3 -2 -1 -1 -1 -1 -1 -1 -2 -2 -2 -2 -2 -2 -2 -1 -1 -2 -2 -3 -2 -2 -2 -2 -2 -3 -3 -3 -3 -3 -3 -3 -3 -3 -4 -4 -2 -1 -1 -1 -2 -2 -2 -2 -2 -2 -2 -3 -3 -3 -2 -2 -3 -3 -3 -3 -3 -3 -4 -3 -3 -3 -2 -2 -3 -3 -3 -3
-410 -3 -3 -3 -2 -2 -3 -3 -3 -3 -3 -2 -3 -4 -4 -3 -3 -2 -1 -1 -1 -1 0 -1 -2 -2 -3 -2 -2 -2 -2 -2 -3 -2 -2 -2 -2 -2 -2 -2 -2 -3 -3 -3 -3 -3 -2 -2 -2 -2 -2 -2 -3 -3 -3 -2 -2 -2 -2 -2 -1 -1 -1 -1 -1 -2 -2 -3 -4 -3 -3 -3 -3
-419 -3 -2 -2 -2 -2 -2 -2 -2 -1 -2 -3 -3 -3 -3 -2 -2 -2 -2 -2 -2 -3 -3 -3 -3 -3 -2 -2 -2 -2 -2 -3 -3 -3 -2 -2 -2 -2 -3 -3 -2 -2 -2 -2 -2 -2 -2 -2 -2 -3 -3 -2 -3 -3 -3 -3 -3 -2 -2 -2 -2 -2 -2 -2 -2 -1 -2 -2 -2 -2 -2 -1 -1
-427 -1 -2 -2 -3 -2 -2 -2 -2 -2 -3 -2 -2 -2 -2 -3 -3 -3 -4 -3 -3 -3 -3 -3 -2 -2 -2 -3 -2 -3 -3 -3 -4 -3 -3 -2 -2 -2 -2 -3 -4 -3 -3 -2 -2 -2 -2 -2 -3 -3 -4 -4 -4 -3 -2 -3 -3 -3 -3 -3 -4 -4 -4 -3 -3 -3 -3 -3 -3 -4 -3 -3 -3
-436 -3 -3 -4 -3 -2 -2 -2 -1 -1 -1 -1 -2 -2 -2 -3 -3 -3 -2 -2 -2 -2 -2 -2 -3 -3 -3 -3 -3 -3 -3 -3 -3 -3 -3 -3 -3 -3 -3 -4 -4 -3 -3 -3 -3 -3 -1 -1 -2 -2 -3 -3 -2 -2 -2 -2 -2 -3 -2 -2 -2 -1 -2 -2 -2 -2 -2 -2 -2 -2 -2 -2 -2
-445 -2 -2 -2 -3 -2 -2 -1 0 -1 -1 -1 -2 -2 -2 -2 -2 -2 -2 -2 -2 -2 -3 -3 -2 -1 -1 -1 -1 -1 -1 -2 -2 -1 0 0 0 0 -1 -2 -3 -4 -3 -2 -2 -2 -3 -2 -1 -2 -2 -2 -1 -1 -1 -1 -1 -1 -2 -2 -2 -2 -3 -2 -2 -2 -2 -2 -2 -1 -1 -2 -3
-454 -3 -3 -3 -2 -3 -4 -4 -3 -3 -3 -3 -3 -2 -2 -2 -2 -2 -1 -1 -1 -1 -2 -2 -3 -3 -3 -3 -3 -3 -3 -2 -2 -2 -2 -2 -2 -2 -1 -1 -2 -2 -2 -2 -2 -2 -2 -2 -2 -2 -2 -2 -2 -3 -3 -3 -3 -4 -3 -3 -2 -2 -2 -3 -3 -2 -2 -3 -3 -4 -5 -4 -3
-463 -3 -2 -3 -3 -4 -4 -3 -3 -3 -3 -3 -3 -3 -3 -3 -3 -3 -3 -3 -3 -3 -3 -3 -3 -3 -2 -3 -3 -4 -4 -3 -3 -3 -3 -4 -4 -3 -2 -2 -2 -2 -2 -2 -2 -2 -3 -3 -3 -3 -3 -3 -4 -4 -5 -4 -3 -3 -3 -3 -3 -3 -4 -3 -3 -3 -2 -2 -2 -2 -2 -2 -2
-472bjJ%%j%%Jj%%J%j%%%JJ%j%J%%jj%%%%%%%%%J%%Jj%%j%J%%%j%%%%%%%J%j%%J%%J%jj%%
-481c%%j%%%J%%J%%%%j%JJj%j%j%J%J%%jJ%%%%j%%j%JK%%%%jJ%%jj%%J%%%%%%%%%%%%%J%j
-490b%jJ%%%%%%jJj%%J%%%%%%J%j%JJj%%j%j%%%J%%J%j%%jj%%J%%J%%%%%%%jJ%%%%%%J%%%
-499aj%j%%%%J%%%%%J%%jj%%%%%j%JJj%%%%j%JK%%j%%J%%j%%%%%%%%%%%%%J%%%k%%%%jJ%%
-508c%J%%j%J%Jj%%%%%j%J%%%jJ%%jJj%%%%J%%%%j%%JJj%%Jj%%%%%j%%%%JJ%%j%%%%%%J%j
-517bj%%j%%JJ%j%J%%J%j%%%%%j%%j%JJJ%%%jJ%%%jJ%%%j%j%%%%%J%J%j%%%%%%j%%J%Jj%J
-525a%jJ%j%%j%%%%jK%%%%j%J%%Jj%jjJ%J%%%j%%%%J%J%%%%j%j%Jj%J%%%jjJ%J%%%%%J%%%
-534a%%%%%%%%j%%%%J%%%%j%%j%%%%%%%%%%J%JjjJ%%%j%%%%Jj%%%%J%Jj%%j%J%%%%j%J%%%
$$ plain form
-472 -2 -3 -2 -2 -2 -3 -3 -3 -2 -3 -3 -3 -2 -2 -3 -3 -3 -3 -2 -1 -1 -2 -2 -1 -1 -1 -2 -3 -3 -3 -3 -3 -3 -3 -3 -3 -3 -2 -2 -2 -1 -2 -2 -2 -3 -3 -2 -2 -2 -2 -3 -3 -3 -3 -3 -3 -3 -3 -2 -2 -3 -3 -3 -2 -2 -2 -1 -1 -2 -3 -3 -3
-481 -3 -3 -3 -4 -4 -4 -4 -3 -3 -3 -2 -2 -2 -2 -2 -3 -3 -2 -1 -2 -2 -3 -3 -4 -4 -3 -3 -2 -2 -2 -3 -2 -2 -2 -2 -2 -3 -3 -3 -4 -4 -3 -1 -1 -1 -1 -1 -2 -1 -1 -1 -2 -3 -3 -3 -2 -2 -2 -2 -2 -2 -2 -2 -2 -2 -2 -2 -2 -2 -1 -1 -2
-490 -2 -2 -3 -2 -2 -2 -2 -2 -2 -2 -3 -2 -3 -3 -3 -2 -2 -2 -2 -2 -2 -2 -1 -1 -2 -2 -1 0 -1 -1 -1 -2 -2 -3 -3 -3 -3 -2 -2 -2 -1 -1 -2 -2 -2 -3 -4 -4 -4 -3 -3 -3 -2 -2 -2 -2 -2 -2 -2 -2 -3 -2 -2 -2 -2 -2 -2 -2 -1 -1 -1 -1
-499 -1 -2 -2 -3 -3 -3 -3 -3 -2 -2 -2 -2 -2 -2 -1 -1 -1 -2 -3 -3 -3 -3 -3 -3 -4 -4 -3 -2 -3 -3 -3 -3 -3 -4 -4 -3 -1 -1 -1 -2 -2 -2 -1 -1 -1 -2 -2 -2 -2 -2 -2 -2 -2 -2 -2 -2 -2 -2 -2 -1 -1 -1 -1 -3 -3 -3 -3 -3 -4 -3 -3 -3
-508 -3 -3 -2 -2 -2 -3 -3 -2 -2 -1 -2 -2 -2 -2 -2 -2 -3 -3 -2 -2 -2 -2 -3 -2 -2 -2 -3 -2 -3 -3 -3 -3 -3 -2 -2 -2 -2 -2 -3 -3 -3 -2 -1 -2 -2 -2 -1 -2 -2 -2 -2 -2 -2 -3 -3 -3 -3 -3 -2 -1 -1 -1 -2 -2 -2 -2 -2 -2 -2 -1 -1 -2
-517 -2 -3 -3 -3 -4 -4 -4 -3 -2 -2 -3 -3 -2 -2 -2 -1 -1 -2 -2 -2 -2 -2 -2 -3 -3 -3 -4 -4 -3 -2 -1 -1 -1 -1 -2 -1 -1 -1 -1 -2 -1 -1 -1 -1 -2 -2 -3 -3 -3 -3 -3 -3 -2 -2 -1 -1 -2 -2 -2 -2 -2 -2 -2 -3 -3 -3 -2 -2 -1 -2 -2 -1
-525 -1 -1 -2 -1 -1 -2 -2 -2 -3 -3 -3 -3 -3 -4 -2 -2 -2 -2 -2 -3 -3 -2 -2 -2 -1 -2 -2 -3 -4 -3 -3 -2 -2 -2 -2 -3 -3 -3 -3 -3 -2 -2 -1 -1 -1 -1 -1 -2 -2 -3 -3 -2 -3 -3 -2 -2 -2 -2 -3 -4 -3 -3 -2 -2 -2 -2 -2 -2 -1 -1 -1 -1
-534 -1 -1 -1 -1 -1 -1 -1 -1 -1 -2 -2 -2 -2 -2 -1 -1 -1 -1 -1 -2 -2 -2 -3 -3 -3 -3 -3 -3 -3 -3 -3 -3 -3 -2 -2 -1 -2 -3 -2 -2 -2 -2 -3 -3 -3 -3 -3 -2 -3 -3 -3 -3 -3 -2 -2 -1 -2 -2 -2 -3 -3 -2 -2 -2 -2 -2 -3 -3 -2 -2 -2 -2
-543bj%J%J%%%%%j%%%%%%%%%%%%%%%%%%%%JjjJ%%%%%%%J%j%%%%%%%%%%%%%%jJ%%%j%%J%J%
-552a%j%%%j%%%%%J%%%%%J%%j%%%%%%%j%jJ%JJ%jjjJ%%%%Jjj%%%J%%JJ%%jj%jJJ%JjjJ%%%
-561b%%%jJ%%jj%%J%J%jJ%%%%%jj%%%%J%%%%Jj%%J%%%%%%%jJJj%%%%%%%%%%%jj%%J%J%%%J
-570a%jj%%J%%Jj%%%j%%%%%J%%%%%J%%%%j%%%Jj%j%%J%Jj%j%%J%%j%%J%J%jj%%%%Jj%%%%j
-579dJ%J%%j%%J%Jj%%%%%%%%%%%%j%%%%%JJ%%%%j%%%%J%%%%j%%j%%JJ%jj%%%%%%%%%%%%j%
-588d%JjJJ%%%j%Jj%%j%%J%J%%%%%%%%Jkj%%%%J%JJ%j%j%J%%%%J%%j%%%%%%%Jj%%%J%%j%%
-597b%%%%%%j%%jJ%%J%%%j%%%%%%%J%%%JjjJ%%%%j%%%%%%%J%%j%%%%%%%%%%%%j%%J%J%%j%
-606c%%%%Jj%%%j%J%%%%%j%J%%%%Jj%%%%%%%%Jj%%%%J%jJ%%%%j%%%%%J%%%%%%%%%%%jJ%j%
$$ plain form
-543 -2 -3 -3 -2 -2 -1 -1 -1 -1 -1 -1 -2 -2 -2 -2 -2 -2 -2 -2 -2 -2 -2 -2 -2 -2 -2 -2 -2 -2 -2 -2 -2 -1 -2 -3 -2 -2 -2 -2 -2 -2 -2 -2 -1 -1 -2 -2 -2 -2 -2 -2 -2 -2 -2 -2 -2 -2 -2 -2 -2 -3 -2 -2 -2 -2 -3 -3 -3 -2 -2 -1 -1
-552 -1 -1 -2 -2 -2 -2 -3 -3 -3 -3 -3 -3 -2 -2 -2 -2 -2 -2 -1 -1 -1 -2 -2 -2 -2 -2 -2 -2 -2 -3 -3 -4 -3 -3 -2 -1 -1 -2 -3 -4 -3 -3 -3 -3 -3 -2 -3 -4 -4 -4 -4 -3 -3 -3 -2 -1 -1 -1 -2 -3 -3 -4 -3 -2 -2 -1 -2 -3 -2 -2 -2 -2
-561 -2 -2 -2 -2 -3 -2 -2 -2 -3 -4 -4 -4 -3 -3 -2 -2 -3 -2 -2 -2 -2 -2 -2 -3 -4 -4 -4 -4 -4 -3 -3 -3 -3 -3 -2 -3 -3 -3 -2 -2 -2 -2 -2 -2 -2 -2 -3 -2 -1 -2 -2 -2 -2 -2 -2 -2 -2 -2 -2 -2 -2 -3 -4 -4 -4 -3 -3 -2 -2 -2 -2 -1
-570 -1 -1 -2 -3 -3 -3 -2 -2 -2 -1 -2 -2 -2 -2 -3 -3 -3 -3 -3 -3 -2 -2 -2 -2 -2 -2 -1 -1 -1 -1 -1 -2 -2 -2 -2 -1 -2 -2 -3 -3 -3 -2 -2 -1 -2 -2 -3 -3 -3 -2 -2 -2 -3 -3 -3 -2 -2 -1 -1 -2 -3 -3 -3 -3 -3 -2 -3 -3 -3 -3 -3 -4
-579 -4 -3 -3 -2 -2 -2 -3 -3 -3 -2 -2 -1 -2 -2 -2 -2 -2 -2 -2 -2 -2 -2 -2 -2 -2 -3 -3 -3 -3 -3 -3 -2 -1 -1 -1 -1 -1 -2 -2 -2 -2 -2 -1 -1 -1 -1 -1 -2 -2 -2 -3 -3 -3 -2 -1 -1 -2 -3 -3 -3 -3 -3 -3 -3 -3 -3 -3 -3 -3 -3 -4 -4
-588 -4 -4 -3 -4 -3 -2 -2 -2 -2 -3 -3 -2 -3 -3 -3 -4 -4 -4 -3 -3 -2 -2 -2 -2 -2 -2 -2 -2 -2 -1 -3 -4 -4 -4 -4 -4 -3 -3 -2 -1 -1 -2 -2 -3 -3 -2 -2 -2 -2 -2 -1 -1 -1 -2 -2 -2 -2 -2 -2 -2 -2 -1 -2 -2 -2 -2 -1 -1 -1 -2 -2 -2
-597 -2 -2 -2 -2 -2 -2 -2 -3 -3 -3 -4 -3 -3 -3 -2 -2 -2 -2 -3 -3 -3 -3 -3 -3 -3 -3 -2 -2 -2 -2 -1 -2 -3 -2 -2 -2 -2 -2 -3 -3 -3 -3 -3 -3 -3 -3 -2 -2 -2 -3 -3 -3 -3 -3 -3 -3 -3 -3 -3 -3 -3 -3 -4 -4 -4 -3 -3 -2 -2 -2 -3 -3
-606 -3 -3 -3 -3 -3 -2 -3 -3 -3 -3 -4 -4 -3 -3 -3 -3 -3 -3 -4 -4 -3 -3 -3 -3 -3 -2 -3 -3 -3 -3 -3 -3 -3 -3 -3 -2 -3 -3 -3 -3 -3 -2 -2 -3 -2 -2 -2 -2 -2 -3 -3 -3 -3 -3 -3 -2 -2 -2 -2 -2 -2 -2 -2 -2 -2 -2 -2 -3 -2 -2 -3 -3
-615c%J%%J%%j%j%%j%%%J%J%%%%%%j%%J%%J%jJ%jj%j%%%J%jJJj%%%%%JJjjjJJj%J%%%j%%%
-623c%%%J%JjjjJ%%%J%j%jjJJJJ%%%%%%%%%j%%%%%%%%Jj%J%%jj%%%J%%%j%%jjJ%%%%%%J%J
-632b%jj%%%J%%%%%%%%%j%%%J%%%JJ%jj%%%%J%%J%k%%%Jj%%J%jj%%JJ%j%%%%jJ%%%J%j%%%
-641cJJ%%j%%Jj%%J%j%%%k%%%J%j%%J%J%%%J%%%j%%%%Jj%jJ%Jjj%J%J%%j%j%%%%%%jJ%%%j
-650d%J%J%%Jj%jjJ%%%J%%%%%Jj%%%%%%J%%%%jjJ%%%%%%j%%j%%%J%J%%%%jJ%%%%Jj%%%j%%
-659cJ%j%%%%%%J%%%%%%%%%%j%j%jJJ%%%J%Jjj%%%%%Jj%J%%%j%j%J%J%%J%%j%%%%%%%%%%%
-668b%%%%%%%j%j%%%J%J%j%%j%J%%Jj%J%%%%%j%%%%Jjj%%JJ%%%%%%J%%j%j%%%%%%J%%%%J%
-677a%%j%%%%Jj%%%%j%j%%%%%%%%%%J%%J%%%%%%%%%Jj%%j%J%j%j%J%%J%j%J%J%%jj%%j%%%
$$ plain form
-615 -3 -3 -2 -2 -2 -1 -1 -1 -2 -2 -3 -3 -3 -4 -4 -4 -4 -3 -3 -2 -2 -2 -2 -2 -2 -2 -3 -3 -3 -2 -2 -2 -1 -1 -2 -1 -1 -2 -3 -3 -4 -4 -4 -4 -3 -3 -4 -3 -2 -3 -3 -3 -3 -3 -3 -2 -1 -2 -3 -4 -3 -2 -3 -3 -2 -2 -2 -2 -3 -3 -3 -3
-623 -3 -3 -3 -3 -2 -2 -1 -2 -3 -4 -3 -3 -3 -3 -2 -2 -3 -3 -4 -5 -4 -3 -2 -1 -1 -1 -1 -1 -1 -1 -1 -1 -1 -2 -2 -2 -2 -2 -2 -2 -2 -2 -1 -2 -2 -1 -1 -1 -2 -3 -3 -3 -3 -2 -2 -2 -2 -3 -3 -3 -4 -5 -4 -4 -4 -4 -4 -4 -4 -3 -3 -2
-632 -2 -2 -3 -4 -4 -4 -4 -3 -3 -3 -3 -3 -3 -3 -3 -3 -3 -4 -4 -4 -4 -3 -3 -3 -3 -2 -1 -1 -2 -3 -3 -3 -3 -3 -2 -2 -2 -1 -1 -3 -3 -3 -3 -2 -3 -3 -3 -2 -2 -3 -4 -4 -4 -3 -2 -2 -3 -3 -3 -3 -3 -4 -3 -3 -3 -3 -2 -2 -3 -3 -3 -3
-641 -3 -2 -1 -1 -1 -2 -2 -2 -1 -2 -2 -2 -1 -1 -2 -2 -2 -2 -4 -4 -4 -4 -3 -3 -4 -4 -4 -3 -3 -2 -2 -2 -2 -1 -1 -1 -1 -2 -2 -2 -2 -2 -1 -2 -2 -3 -2 -2 -1 -2 -3 -3 -2 -2 -1 -1 -1 -2 -2 -3 -3 -3 -3 -3 -3 -3 -4 -3 -3 -3 -3 -4
-650 -4 -4 -3 -3 -2 -2 -2 -1 -2 -2 -3 -4 -3 -3 -3 -3 -2 -2 -2 -2 -2 -2 -1 -2 -2 -2 -2 -2 -2 -2 -1 -1 -1 -1 -1 -2 -3 -2 -2 -2 -2 -2 -2 -2 -3 -3 -3 -4 -4 -4 -4 -3 -3 -2 -2 -2 -2 -2 -3 -2 -2 -2 -2 -2 -1 -2 -2 -2 -2 -3 -3 -3
-659 -3 -2 -2 -3 -3 -3 -3 -3 -3 -3 -2 -2 -2 -2 -2 -2 -2 -2 -2 -2 -2 -3 -3 -4 -4 -5 -4 -3 -3 -3 -3 -2 -2 -1 -2 -3 -3 -3 -3 -3 -3 -2 -3 -3 -2 -2 -2 -2 -3 -3 -4 -4 -3 -3 -2 -2 -2 -1 -1 -1 -2 -2 -2 -2 -2 -2 -2 -2 -2 -2 -2 -2
-668 -2 -2 -2 -2 -2 -2 -2 -2 -3 -3 -4 -4 -4 -4 -3 -3 -2 -2 -3 -3 -3 -4 -4 -3 -3 -3 -2 -3 -3 -2 -2 -2 -2 -2 -2 -3 -3 -3 -3 -3 -2 -3 -4 -4 -4 -3 -2 -2 -2 -2 -2 -2 -2 -1 -1 -1 -2 -2 -3 -3 -3 -3 -3 -3 -3 -2 -2 -2 -2 -2 -1 -1
-677 -1 -1 -1 -2 -2 -2 -2 -2 -1 -2 -2 -2 -2 -2 -3 -3 -4 -4 -4 -4 -4 -4 -4 -4 -4 -4 -4 -3 -3 -3 -2 -2 -2 -2 -2 -2 -2 -2 -2 -2 -1 -2 -2 -2 -3 -3 -2 -2 -3 -3 -4 -4 -3 -3 -3 -2 -2 -3 -3 -2 -2 -1 -1 -1 -2 -3 -3 -3 -4 -4 -4 -4
-686d%JJ%%%%%j%%%%Jj%%%%%j%JJ%%%%%%jj%J%Jjj%%%%%%J%%%%%J%J%%jj%%%J%%%%%%%J%%
-695a%jj%%J%%j%Jj%%%%%JJ%j%j%Jj%%%%%J%%%j%%%%%%J%Jj%j%j%J%%%%%%Jj%j%%%%%%%%J
-704cJ%%%J%jjjJ%%j%J%j%%%JjJ%%%%%%%%j%%%%J%%j%%%J%%J%%%%%%%%%j%%%%%J%j%%%%%j
-713d%J%Jj%jJ%JJ%j%jJ%%%%J%%%j%j%%%J%%%%jj%%%%J%%%%%%%%%%%Jj%%%%J%%%%J%%%%%%
-721aJ%j%j%Jj%Jj%j%%%%%%%%%%%%J%%%j%%j%J%J%%j%%%%%J%%%%J%%%%jj%JJ%%j%%%%%%Jj
-730b%%%%j%%JJj%j%%%%%%%%%%%%J%J%%jj%%%%J%%j%%%%%J%%%%j%%%%jJ%%%%J%%%j%%Jj%%
-739c%%%j%%%J%Jj%Jj%%j%%J%jJ%%%j%%%J%jJJ%%jJ%%%j%JJ%%jj%%%K%j%j%%%%J%j%%%J%%
-748b%%%%%%%%j%%%Jj%%J%%%%%%%%%j%%%%%%%%J%%%%%%j%%%%%%%%%J%j%%%%%j%%%J%J%%%%
$$ plain form
-686 -4 -4 -3 -2 -2 -2 -2 -2 -2 -3 -3 -3 -3 -3 -2 -3 -3 -3 -3 -3 -3 -4 -4 -3 -2 -2 -2 -2 -2 -2 -2 -3 -4 -4 -3 -3 -2 -3 -4 -4 -4 -4 -4 -4 -4 -3 -3 -3 -3 -3 -3 -2 -2 -1 -1 -1 -2 -3 -3 -3 -3 -2 -2 -2 -2 -2 -2 -2 -2 -1 -1 -1
-695 -1 -1 -2 -3 -3 -3 -2 -2 -2 -3 -3 -2 -3 -3 -3 -3 -3 -3 -2 -1 -1 -2 -2 -3 -3 -2 -3 -3 -3 -3 -3 -3 -2 -2 -2 -2 -3 -3 -3 -3 -3 -3 -3 -2 -2 -1 -2 -2 -3 -3 -4 -4 -3 -3 -3 -3 -3 -3 -3 -2 -3 -3 -4 -4 -4 -4 -4 -4 -4 -4 -4 -3
-704 -3 -2 -2 -2 -2 -1 -1 -2 -3 -4 -3 -3 -3 -4 -4 -3 -3 -4 -4 -4 -4 -3 -4 -3 -3 -3 -3 -3 -3 -3 -3 -3 -4 -4 -4 -4 -4 -3 -3 -3 -4 -4 -4 -4 -3 -3 -3 -2 -2 -2 -2 -2 -2 -2 -2 -2 -2 -3 -3 -3 -3 -3 -3 -2 -2 -3 -3 -3 -3 -3 -3 -4
-713 -4 -4 -3 -3 -2 -3 -3 -4 -3 -3 -2 -1 -1 -2 -2 -3 -2 -2 -2 -2 -2 -1 -1 -1 -1 -2 -2 -3 -3 -3 -3 -2 -2 -2 -2 -2 -3 -4 -4 -4 -4 -4 -3 -3 -3 -3 -3 -3 -3 -3 -3 -3 -3 -3 -2 -3 -3 -3 -3 -3 -2 -2 -2 -2 -2 -1 -1 -1 -1 -1 -1 -1
-721 -1 0 0 -1 -1 -2 -2 -1 -2 -2 -1 -2 -2 -3 -3 -3 -3 -3 -3 -3 -3 -3 -3 -3 -3 -3 -2 -2 -2 -2 -3 -3 -3 -4 -4 -3 -3 -2 -2 -2 -3 -3 -3 -3 -3 -3 -2 -2 -2 -2 -2 -1 -1 -1 -1 -1 -2 -3 -3 -2 -1 -1 -1 -2 -2 -2 -2 -2 -2 -2 -1 -2
-730 -2 -2 -2 -2 -2 -3 -3 -3 -2 -1 -2 -2 -3 -3 -3 -3 -3 -3 -3 -3 -3 -3 -3 -3 -3 -2 -2 -1 -1 -1 -2 -3 -3 -3 -3 -3 -2 -2 -2 -3 -3 -3 -3 -3 -3 -2 -2 -2 -2 -2 -3 -3 -3 -3 -3 -4 -3 -3 -3 -3 -3 -2 -2 -2 -2 -3 -3 -3 -2 -3 -3 -3
-739 -3 -3 -3 -3 -4 -4 -4 -4 -3 -3 -2 -3 -3 -2 -3 -3 -3 -4 -4 -4 -3 -3 -4 -3 -3 -3 -3 -4 -4 -4 -4 -3 -3 -4 -3 -2 -2 -2 -3 -2 -2 -2 -2 -3 -3 -2 -1 -1 -1 -2 -3 -3 -3 -3 -1 -1 -2 -2 -3 -3 -3 -3 -3 -2 -2 -3 -3 -3 -3 -2 -2 -2
-748 -2 -2 -2 -2 -2 -2 -2 -2 -2 -3 -3 -3 -3 -2 -3 -3 -3 -2 -2 -2 -2 -2 -2 -2 -2 -2 -2 -3 -3 -3 -3 -3 -3 -3 -3 -3 -2 -2 -2 -2 -2 -2 -2 -3 -3 -3 -3 -3 -3 -3 -3 -3 -3 -2 -2 -3 -3 -3 -3 -3 -3 -4 -4 -4 -4 -3 -3 -2 -2 -2 -2 -2
-757b%jJ%%%%Jj%%%%%%%j%%%%%J%%J%j%j%%%J%%%%%j%%%J%%J%%%%j%%j%%%%%%%%%%%%JJjj
-766c%%J%%%%j%%%%%%%%%%J%Jjj%%%J%%%%%%%j%%%Jj%%%JJ%%jj%%%%%%%%%%jj%J%J%J%%%J
-775a%j%%%j%%%%%%%%%%%%%%%J%%%%j%%%%%%%%J%%%%%%Jj%j%%%J%jJJ%%%j%j%J%%%%%%j%%
$$ plain form
-757 -2 -2 -3 -2 -2 -2 -2 -2 -1 -2 -2 -2 -2 -2 -2 -2 -2 -3 -3 -3 -3 -3 -3 -2 -2 -2 -1 -1 -2 -2 -3 -3 -3 -3 -2 -2 -2 -2 -2 -2 -3 -3 -3 -3 -2 -2 -2 -1 -1 -1 -1 -1 -2 -2 -2 -3 -3 -3 -3 -3 -3 -3 -3 -3 -3 -3 -3 -3 -2 -1 -2 -3
-766 -3 -3 -3 -2 -2 -2 -2 -2 -3 -3 -3 -3 -3 -3 -3 -3 -3 -3 -3 -2 -2 -1 -2 -3 -3 -3 -3 -2 -2 -2 -2 -2 -2 -2 -2 -3 -3 -3 -3 -2 -3 -3 -3 -3 -2 -1 -1 -1 -2 -3 -3 -3 -3 -3 -3 -3 -3 -3 -3 -3 -4 -5 -5 -4 -4 -3 -3 -2 -2 -2 -2 -1
-775 -1 -1 -2 -2 -2 -2 -3 -3 -3 -3 -3 -3 -3 -3 -3 -3 -3 -3 -3 -3 -3 -3 -2 -2 -2 -2 -2 -3 -3 -3 -3 -3 -3 -3 -3 -3 -2 -2 -2 -2 -2 -2 -2 -1 -2 -2 -3 -3 -3 -3 -2 -2 -3 -2 -1 -1 -1 -1 -2 -2 -3 -3 -2 -2 -2 -2 -2 -2 -2 -3 -3 -3
$$ [...]
-1651@
##END=		$$ NMR SPECTRUM
##END=		$$ LINK
