##TITLE=	JgTX$w$1Q2Gaw4sOlFtmQQ.11.fid
##JCAMP-DX=	6.0	$$ MestReNova 14.3.3-33362
##DATA TYPE=	LINK
##BLOCKS=	1    
##ORIGIN=	Mestrelab Research S.L.
##OWNER=	hrzepa
##$MNOVA/METADATA=	(DOCUMENT,BASE64)
eyJuYW1lIjoiL1VzZXJzL2hyemVwYS9MaWJyYXJ5L01vYmlsZSBEb2N1bWVudHMvY29tfmFwcGxlfkN
sb3VkRG9jcy9TaGVwcGFyZC9OTVIgZmlsZXMgemlwcy0yL1RyaWNobG9yb2V0aHlsYm9yYXRlL3RyaW
NobG9yb2V0aHlsYm9yYXRlLUIubW5vdmEiLCJwYWdlcyI6W3siaXRlbXMiOlsiMSIgICAgIF19XX0=
##TITLE=	JgTX$w$1Q2Gaw4sOlFtmQQ.11.fid
##JCAMP-DX=	6.0	$$ MestReNova 14.3.3-33362
##DATA TYPE=	NMR SPECTRUM
##DATA CLASS=	XYDATA
##BLOCK_ID=	1
##ORIGIN=	Bruker BioSpin GmbH
##OWNER=	root
##NUMDIM=	1
##$MNOVA/METADATA=	(ITEM,BASE64)
eyJhbmdsZSI6MCwiYXhlcyI6eyJ4Ijp7Im1heCI6MjA1LjAwMDY5OTk5ODk5MDY4LCJtaW4iOi0yMDQ
uOTk3NTgxNzgyNjk0NjJ9LCJ5Ijp7Im1heCI6NDU2NjgxLjE5MTQwNjI1LCJtaW4iOi0xNTgyMjMuNT
AzOTA2MjV9fSwicG9pbnRzIjpbeyJ4Ijo1MzIxLCJ5Ijo1ODM1fSx7IngiOjg3MjIsInkiOjU4MzV9L
HsieCI6ODcyMiwieSI6ODIwOH0seyJ4Ijo1MzIxLCJ5Ijo4MjA4fSx7IngiOjUzMjEsInkiOjU4MzV9
XSwieiI6MH0=
##.OBSERVE FREQUENCY=	160.46157916600000704
##.OBSERVE NUCLEUS=	^11B
##.SOLVENT NAME=	CDCl3
##.PULSE SEQUENCE=	zg
##LONGDATE=	2022/09/21 10:11:50.000
##.ACQUISITIONMODE=	SIMULTANEOUS (DQD)
##$ORIGINAL FORMAT=	Bruker XWIN-NMR
##$MNOVA/SCALES_VERSION=	9
##$PARAMETER FILE=	(acqus, ASCII, /private/var/folders/f6/rjf_tdyn2v98c5c0wvkgn4s80000gq/T/JgTX$w$1Q2Gaw4sOlFtmQQ/11/acqus, 0)
$$ ##TITLE= Parameter file, TopSpin 4.1.3
$$ ##JCAMPDX= 5.0
$$ ##DATATYPE= Parameter Values
$$ ##NPOINTS= 1	$$ modification sequence number
$$ ##ORIGIN= Bruker BioSpin GmbH
$$ ##OWNER= root
$$ $$ 2022-09-21 10:11:44.493 +0100  root@CZC036BXXF
$$ $$ Z:/500/data/tds/nmr/RP243/11/acqus
$$ $$ process C:\Bruker\TopSpin4.1.3\prog\mod\dirdata.exe
$$ ##$ACQT0= -9.23096511331805
$$ ##$AMP= (0..31)
$$ 100 100 100 100 100 100 100 100 100 100 100 100 100 100 100 100 100 100
$$ 100 100 100 100 100 100 100 100 100 100 100 100 100 100
$$ ##$AMPCOIL= (0..32)
$$ -1 0 0 0 0 0 0 0 0 0 0 0 0 0 0 0 0 0 0 0 0 0 0 0 0 0 0 0 0 0 0 0 0
$$ ##$AQSEQ= 0
$$ ##$AQ_mod= 3
$$ ##$AUNM= <au_zg>
$$ ##$AUTOPOS= <25 >
$$ ##$BF1= 160.461579166
$$ ##$BF2= 160.461579166
$$ ##$BF3= 160.461579166
$$ ##$BF4= 160.461579166
$$ ##$BF5= 160.461579166
$$ ##$BF6= 160.461579166
$$ ##$BF7= 160.461579166
$$ ##$BF8= 160.461579166
$$ ##$BWFAC= (0..63)
$$ 0 0 0 0 0 0 0 0 0 0 0 0 0 0 0 0 0 0 0 0 0 0 0 0 0 0 0 0 0 0 0 0 0 0 0 0
$$ 0 0 0 0 0 0 0 0 0 0 0 0 0 0 0 0 0 0 0 0 0 0 0 0 0 0 0 0
$$ ##$BYTORDA= 0
$$ ##$CHANFCU= (0..24)
$$ 0 0 1 0 0 0 0 0 0 0 0 0 0 0 0 0 0 0 0 0 0 0 0 0 0
$$ ##$CHANREC= (0..24)
$$ 0 0 1 0 0 0 0 0 0 0 0 0 0 0 0 0 0 0 0 0 0 0 0 0 0
$$ ##$CHEMSTR= <none>
$$ ##$CNST= (0..63)
$$ 1 1 1 1 1 1 1 1 1 1 1 1 1 1 1 1 1 1 1 1 1 1 1 1 1 1 1 1 1 1 1 1 1 1 1 1
$$ 1 1 1 1 1 1 1 1 1 1 1 1 1 1 1 1 1 1 1 1 1 1 1 1 1 1 1 1
$$ ##$CPDPRG= (0..8)
$$ <> <> <> <> <> <> <> <> <>
$$ ##$D= (0..63)
$$ 0 2 0 0 0 0 0 0 0 0 0 0 0 0 0 0 0.0002 0 0 0 0 0 0 0 0 0 0 0 0 0 0 0 0
$$ 0 0 0 0 0 0 0 0 0 0 0 0 0 0 0 0 0 0 0 0 0 0 0 0 0 0 0 0 0 0 0
$$ [...]
$$ 1 1 1 1 0 0 0 0 0 0 0 0 0 0 0 0 0 0 0 0 0 0 0 0 0 0 0 0
$$ ##$ShimPowRng3= (0..63)
$$ 1 1 1 1 1 1 1 1 1 1 1 1 1 1 1 1 1 1 1 1 1 1 1 1 1 1 1 1 1 1 1 1 1 1 1 1
$$ 1 1 1 1 0 0 0 0 0 0 0 0 0 0 0 0 0 0 0 0 0 0 0 0 0 0 0 0
$$ ##$ShimPowType1= 8
$$ ##$ShimPowType2= 8
$$ ##$ShimPowType3= 0
$$ ##$ShimPowType4= 0
$$ ##$ShimPowType5= 0
$$ ##$ShimPowType6= 0
$$ ##$ShimPowType7= 0
$$ ##$ShimPowType8= 0
$$ ##$ShimSysActGrad= (0..63)
$$ 1 2 3 4 13 5 7 11 10 9 6 8 12 18 19 20 21 15 22 23 24 14 25 16 26 17 27
$$ 28 31 32 33 34 35 36 37 38 0 0 0 0 0 0 0 0 0 0 0 0 0 0 0 0 0 0 0 0 0 0
$$ 0 0 0 0 0 0
$$ ##$ShimSysAngle= <>
$$ ##$ShimSysFunc= (0..63)
$$ 1 2 3 4 5 6 7 8 9 10 0 37 38 35 16 15 14 13 12 11 28 27 26 25 24 23 36
$$ 22 30 29 20 21 34 33 32 31 17 18 19 0 0 0 0 0 0 0 0 0 0 0 0 0 0 0 0 0 0
$$ 0 0 0 0 0 0 0
$$ ##$ShimSysMatId= <292722ba.dat>
$$ ##$ShimSysMatrix= 1
$$ ##$ShimSysMinMaxUG= 130000
$$ ##$ShimSysOffset= <58 mm>
$$ ##$ShimSysType= 4
$$ ##$ShimUnit= 3
$$ ##$SpectrOsVersion= <4.1.156.20210628>
$$ ##$TCubeEth= <192.168.180.18>
$$ ##$TCubeSeqDevice= <>
$$ ##$TOSITY= <no>
$$ ##$TRIPLO2= 0
$$ ##$TopSpinVersion= <TopSpin 4.1.3>
$$ ##$TrxFreqFormula= (0..23)
$$ <TrxFreqFormula(2.0,500130000.000000,'TRX',Trx(1.0,'TRX 1200.1',2,5.000000,1290.000000))>
$$ <TrxFreqFormula(2.0,500130000.000000,'TRX',Trx(1.0,'TRX 1200.2',2,5.000000,1290.000000))>
$$ <> <> <> <> <> <> <> <> <> <> <> <> <> <> <> <> <> <> <> <> <> <>
$$ ##$TrxPN= (0..23)
$$ <Z148391> <Z148391> <> <> <> <> <> <> <> <> <> <> <> <> <> <> <> <> <>
$$ <> <> <> <> <>
$$ ##$TrxSN= (0..23)
$$ <05365> <05364> <> <> <> <> <> <> <> <> <> <> <> <> <> <> <> <> <> <> <>
$$ <> <> <>
$$ ##$VCubeEth= (0..23)
$$ <no> <no> <no> <no> <no> <no> <no> <no> <no> <no> <no> <no> <no> <no> <no>
$$ <no> <no> <no> <no> <no> <no> <no> <no> <no>
$$ ##$VTU= 2
$$ ##$VTUETH= <192.168.99.10>
$$ ##$VTUTY= <no>
$$ ##$ValueLine= no
$$ ##$VpuPN= (0..23)
$$ <no> <no> <no> <no> <no> <no> <no> <no> <no> <no> <no> <no> <no> <no> <no>
$$ <no> <no> <no> <no> <no> <no> <no> <no> <no>
$$ ##$VpuSN= (0..23)
$$ <no> <no> <no> <no> <no> <no> <no> <no> <no> <no> <no> <no> <no> <no> <no>
$$ <no> <no> <no> <no> <no> <no> <no> <no> <no>
$$ ##$WBREFAM= (0..31)
$$ 99.9 100 100 100 100 100 100 100 100 100 100 100 100 100 100 100 100 100
$$ 100 100 100 100 100 100 100 100 100 100 100 100 100 100
$$ ##$WBREFLM= (0..31)
$$ 2 0 0 0 0 0 0 0 0 0 0 0 0 0 0 0 0 0 0 0 0 0 0 0 0 0 0 0 0 0 0 0
$$ ##$WBREFPH= (0..31)
$$ 0.91 0 0 0 0 0 0 0 0 0 0 0 0 0 0 0 0 0 0 0 0 0 0 0 0 0 0 0 0 0 0 0
$$ ##$WBSGU= (0..31)
$$ 1 1 2 0 0 0 0 0 0 0 0 0 0 0 0 0 0 0 0 0 0 0 0 0 0 0 0 0 0 0 0 0
$$ ##END=
$$ 
##$DECIM=	304
##$DSPFVS=	20
##XUNITS=	HZ
##YUNITS=	ARBITRARY UNITS
##FIRSTX=	32894.736052135405771
##LASTX=	-32894.235698224358202
##DELTAX=	-0.50193385074013141534
##XFACTOR=	1
##YFACTOR=	12.67095229194006123
##FIRSTY=	-1204.1171875
##MINY=	-116701.453125
##MAXY=	415189.09375
##NPOINTS=	131072
##XYDATA=	(X++(Y..Y))
$$ [...]
7928C480m9m9m8l0k9K4K4O0o2j17Q8J20lj05j05j5j4p6p6O5O6MMo2o1Q2Q2JKJKP2P1l0l1o
$$ 3480 3431 3382 3334 3304 3275 3299 3323 3383 3321 3204 3292 3412 3409 3304 3199 3184 3170 3094 3018 3083 3149 3153 3157 3095 3034 3116 3198 3199 3201 3202 3204 3276 3347 3317 3286 3280
7910C280pN5N5O8O8l5l4j7j7p8p8l5l4l5l4N2N3N2N3pqqpl1l0O4O4k9j53j4j4p4M8J58L6j13
$$ 3280 3273 3328 3383 3451 3519 3484 3450 3433 3416 3338 3260 3225 3191 3156 3122 3174 3227 3279 3332 3325 3317 3309 3302 3271 3241 3305 3369 3340 3187 3173 3159 3085 3133 3291 3327 3214
7892C214J0O3n9P5P4ONo1o1Qj15k8k7k3k2k3J83J28p6l1R3m4m4n6O6N9N9L7L6k5k5J0Rj21
$$ 3214 3224 3287 3228 3303 3377 3383 3388 3327 3266 3274 3159 3131 3104 3081 3059 3036 3219 3347 3271 3240 3333 3289 3245 3189 3255 3314 3373 3410 3446 3421 3396 3406 3415 3294
7875C294KJ0RJ7J8k9k9l7l6N2p1r7r7LJ27M9M9J32Rn7n8j15PJ23J23j12j13j0j1L5L4M3M2
$$ 3294 3296 3306 3315 3332 3350 3321 3292 3255 3219 3271 3200 3103 3006 3009 3136 3185 3234 3366 3375 3318 3260 3145 3152 3275 3398 3286 3173 3163 3152 3187 3221 3264 3306
7858C306l4Q9J51K7o6o6K9K9n2n1R2R2j9j8q0p9LMK4r9j22Q3J72N0k9k9K5K5j29j29k7k6L7
$$ 3306 3272 3361 3512 3539 3473 3407 3436 3465 3413 3362 3454 3546 3527 3509 3429 3350 3353 3357 3381 3282 3160 3243 3415 3465 3436 3407 3432 3457 3328 3199 3172 3146 3183
7842C183L8k5k4m2m2J9K0K00K00j13k35j27mJ86J86KKJKr8r8M5M5l5l6l5l6K1K1m9P5N3N4
$$ 3183 3221 3196 3172 3130 3088 3107 3127 3327 3527 3414 3179 3052 3048 3234 3420 3422 3424 3425 3427 3329 3231 3276 3321 3286 3250 3215 3179 3200 3221 3172 3247 3300 3354
7825C354m2m1rj0rrN0N0k7R6N4o9n4n4K3K3m6P6n4n4N6N6J9J9J9J9opo1o0p4M8k0k1J6J5Q
$$ 3354 3312 3271 3262 3252 3243 3234 3284 3334 3307 3403 3457 3388 3334 3280 3303 3326 3280 3356 3302 3248 3304 3360 3379 3398 3417 3436 3430 3423 3362 3302 3228 3276 3256 3235 3251 3266 3274
7807C274QO2o1n3n3J14J15l7l6J2j11m9P4J37J38L5j69n0n0p0N3M3M4l0R2R8j08j56l3K0J9
$$ 3274 3282 3344 3283 3230 3177 3291 3406 3369 3333 3345 3234 3185 3259 3396 3534 3569 3400 3350 3300 3230 3283 3326 3370 3340 3432 3530 3422 3266 3233 3253 3272
7791C272l4l4j%J02J02j7j7N2p1P4P4MMMLLLl1l1k3k3o2O1J3j10j23Q2R0l4m7m7M7M8k2k2
$$ 3272 3238 3204 3203 3203 3305 3407 3390 3373 3425 3354 3428 3502 3506 3510 3514 3517 3520 3523 3492 3461 3438 3415 3353 3414 3427 3317 3194 3276 3366 3332 3285 3238 3285 3333 3311 3289
7773C289k2k3O9O9o2o2q3J21J83k2n6n5ppK8K7N3j52j10R5M4p9r0L2J7J8J13J13p1p2o1o1
$$ 3289 3267 3244 3313 3382 3320 3258 3175 3296 3479 3457 3401 3346 3339 3332 3360 3387 3440 3288 3178 3273 3317 3238 3148 3180 3197 3215 3328 3441 3370 3298 3237 3176
7757C176%%M6M5M5M5K7K7p5p5L2L2m9P3J52n2o0O3q5q4j5j5Q4Q5n9n9P0O9QPqqj10j11OOO8
$$ 3176 3176 3176 3222 3267 3312 3357 3384 3411 3336 3261 3293 3325 3276 3349 3501 3449 3389 3452 3367 3283 3268 3253 3337 3422 3363 3304 3374 3443 3451 3458 3450 3442 3332 3221 3227 3233 3301
7738C301O7jkkjM8M8j3j3p5p5J09J09j5j5J08r7q2M2j03j02OPOPK4K4K4K4P5P5k7k7M1M2o2
$$ 3301 3368 3367 3365 3363 3362 3410 3458 3445 3432 3357 3282 3391 3500 3485 3470 3578 3481 3399 3441 3338 3236 3242 3249 3255 3262 3286 3310 3334 3358 3433 3508 3481 3454 3495 3537 3475
7720C475o1l8l8K3K4n5n5M8M8K7K7p5p5l5l5J50J50l7l7K4K5m1m1n6O7M6p8n5n5oJ17J63m1
$$ 3475 3414 3376 3338 3361 3385 3330 3275 3323 3371 3398 3425 3350 3275 3240 3205 3355 3505 3468 3431 3455 3480 3439 3398 3342 3409 3455 3377 3322 3267 3261 3378 3541 3500
7704C500j38j38qpJ04J05o7N5%jO9O9k0j9Q4Q3q2q2p4p4m9P5J08J08o1o1o1o1P3P3j11j11
$$ 3500 3362 3224 3216 3209 3313 3418 3351 3406 3406 3405 3474 3543 3523 3504 3588 3671 3589 3507 3433 3359 3310 3385 3493 3601 3540 3479 3418 3357 3430 3503 3392 3281
7688C281J08J08p6p7P2P2o6N7J15pp4p4O5O5jj25q6L8R0l2p6p6j7J06Q1m3k7k8R2R2m4m4l1
$$ 3281 3389 3497 3421 3344 3416 3488 3422 3479 3594 3587 3513 3439 3504 3569 3568 3443 3357 3395 3485 3453 3377 3301 3284 3390 3471 3428 3401 3373 3465 3557 3513 3469 3438
7671C438R2L0r3k5k6K9K8mmlmm8m7J24JJ7J8m4m4r5K7J30Pk7k8l5l5k5k4P8P8N6N7M3M4O1
$$ 3438 3530 3560 3467 3442 3416 3445 3473 3469 3465 3462 3458 3410 3363 3487 3488 3505 3523 3479 3435 3340 3367 3497 3504 3477 3449 3414 3379 3354 3330 3408 3486 3542 3599 3642 3686 3747
7653C747j44j44O1k1k1qrj9j9j9j9Q1Q1J9J9p6p6O7O7kko3o4p2p3L0L0m2m1rJ15N1N2L3r0
$$ 3747 3603 3459 3520 3499 3478 3470 3461 3442 3423 3404 3385 3466 3547 3566 3585 3509 3433 3500 3567 3565 3563 3500 3436 3364 3291 3321 3351 3309 3268 3259 3374 3425 3477 3510 3420
7635C420q7L6K9K8j03K1R5R5O5O6j61j60NMp7M5J35p0p7M5L2L2M0M0N1N1j25j26m4P9J46J46
$$ 3420 3333 3369 3398 3426 3323 3344 3439 3534 3599 3665 3504 3344 3349 3353 3276 3321 3456 3386 3309 3354 3386 3418 3458 3498 3549 3600 3475 3349 3305 3384 3530 3676
7619C676Q4l8j49k6J3j09r5r4j4j3oor0L4J89J90m7m8m7m7O4O4O4O4J2J1n0m9pooop9p9j8
$$ 3676 3760 3722 3573 3547 3560 3451 3356 3262 3248 3235 3229 3223 3133 3167 3356 3546 3499 3451 3404 3357 3421 3485 3549 3613 3625 3636 3586 3537 3530 3524 3518 3512 3433 3354 3336
7602C336j8l6l6J40J41Q6l6o2o2l0R2L8q4o7N6Q2Q2n6n7p2N1M2q1p3M9K7K7j9k0r7K6J0J0
$$ 3336 3318 3282 3246 3386 3527 3613 3577 3515 3453 3423 3515 3553 3469 3402 3458 3540 3622 3566 3509 3437 3488 3530 3449 3376 3425 3452 3479 3460 3440 3343 3369 3379 3389
7585C389J58L6l9l9RRQRr5r5PPq8q9J37J36O0O0p6p6m7P5J21q3QRmmq6q7J7J6R2R2n2n1O7
$$ 3389 3547 3583 3544 3505 3514 3523 3531 3540 3445 3350 3357 3364 3276 3187 3324 3460 3520 3580 3504 3428 3381 3456 3577 3494 3502 3511 3507 3503 3417 3330 3347 3363 3455 3547 3495 3444 3511
7567C511O8O7O8l6l5r7r7j7j6M5M5L4L4o8o8K4K4j20j20O2O2%%k9l0J14J14j8j8j9j8lmll
$$ 3511 3579 3646 3714 3678 3643 3546 3449 3432 3416 3461 3506 3540 3574 3506 3438 3462 3486 3366 3246 3308 3370 3370 3370 3341 3311 3425 3539 3521 3503 3484 3466 3463 3459 3456 3453
7549C453Q1Q0o3o3j7j7j7j7p8p7j5J89K6r6p6p6n1n2R3R2J3J2J16J15K3K4l9l8m0m1K1K0Q
$$ 3453 3534 3614 3551 3488 3471 3454 3437 3420 3342 3265 3250 3439 3465 3369 3293 3217 3166 3114 3207 3299 3312 3324 3440 3555 3578 3602 3563 3525 3485 3444 3465 3485 3493
7533C493Pj36j36K2K1Q3Q3j2j2j3j2K6K6l5l6O1O0O1O0l9m0l9m0r4r4R1R1K0K0j65j64Q3Q4
$$ 3493 3500 3364 3228 3250 3271 3354 3437 3425 3413 3400 3388 3414 3440 3405 3369 3430 3490 3551 3611 3572 3532 3493 3453 3359 3265 3356 3447 3467 3487 3322 3158 3241 3325
7516C325K2K2N6N7N6N7j16j16qJ15J14qj16j16M5M4M4M5%JJJN8N9m4m3L7L7k5k4l8l8K4K3
$$ 3325 3347 3369 3425 3482 3538 3595 3479 3363 3355 3470 3584 3576 3460 3344 3389 3433 3477 3522 3522 3523 3524 3525 3583 3642 3598 3555 3592 3629 3604 3580 3542 3504 3528 3551
7499C551L5L6m2Q1K0j03j57l4P6P7j01K2P2j32p9M4N2N3qrM9p5o7o7j0j1J20J21O1j44m2J63
$$ 3551 3586 3622 3580 3661 3681 3578 3421 3387 3463 3540 3439 3461 3533 3401 3322 3366 3418 3471 3463 3454 3503 3428 3361 3294 3284 3273 3393 3514 3575 3431 3389 3552
7483C552P7P6j3j4qqp0o9o6o6m0Q2R7k6N1N0J8J7m4m4NONOl3l3K8K9l7l7m5m5J11j1o5J39
$$ 3552 3629 3705 3692 3678 3670 3662 3592 3523 3457 3391 3351 3433 3530 3504 3555 3605 3623 3640 3596 3552 3557 3563 3568 3574 3541 3508 3536 3565 3528 3491 3446 3401 3512 3501 3436 3575
7465C575j7j39LMJ1J1J1J2m7m6J5J6M1M0M1M1M8M8n5n4o8o7ooM3M4M3M3k0j9k8k7Q2m2m1Q2
$$ 3575 3558 3419 3422 3426 3437 3448 3459 3471 3424 3378 3393 3409 3450 3490 3531 3572 3620 3668 3613 3559 3491 3424 3418 3412 3455 3499 3542 3585 3565 3546 3518 3491 3573 3531 3490 3572
7447C572M0M1n5n4j9j9M2M3MMn8n8k4k5m1Q3R0l2N2N2n1P3J19q6llj06j05o3J43R6k7k8k8
$$ 3572 3612 3653 3598 3544 3525 3506 3548 3591 3595 3599 3541 3483 3459 3434 3393 3476 3566 3534 3586 3638 3587 3660 3779 3693 3690 3687 3581 3476 3413 3556 3652 3625 3597 3569
7430C569l5l6KKKKm5m4N8N8j9j9q1q1Q5Q4J05j8q6J18J19q7j36j3J22J23pj30q1J24P7m6J0
$$ 3569 3534 3498 3500 3502 3504 3506 3461 3417 3475 3533 3514 3495 3414 3333 3418 3502 3607 3589 3503 3621 3740 3653 3517 3504 3626 3749 3742 3612 3531 3655 3732 3686 3696
7413C696j13l2R0J4J4RRj6j40j07J7o0o1R0R0K8K8J3J4m9m8R3R3q4q4p0N2J56L2k7k6l5l4
$$ 3696 3583 3551 3641 3655 3669 3678 3687 3671 3531 3424 3441 3381 3320 3410 3500 3528 3556 3569 3583 3534 3486 3579 3672 3588 3504 3434 3486 3642 3674 3647 3621 3586 3552
7396C552L8L8L9L8k9k8j3j36j5J09p1p0L4L4J30J29m9j71j64M2J04j9O3O3kjR3R3K2j02j09
$$ 3552 3590 3628 3667 3705 3676 3648 3635 3499 3484 3593 3522 3452 3486 3520 3650 3779 3730 3559 3395 3437 3541 3522 3585 3648 3646 3645 3738 3831 3853 3751 3642
7381C642J4Pj15nJ17Q1Q0j4j4p7p7j6j5K6K7o8o8l5Q9J9J9k6k5k6k6K2K1K1K2OOO7O8n4n4
$$ 3642 3656 3663 3548 3543 3660 3741 3821 3807 3793 3716 3639 3623 3608 3634 3661 3593 3525 3490 3579 3598 3617 3591 3566 3540 3514 3536 3557 3578 3600 3606 3612 3679 3747 3693 3639
7363C639p0N4K3j01j5j6kJ20J80k6k07lQ2m1m5m5j9J04KKJ0J1M3M4j00j00j5j5j5j5k6k6L5
$$ 3639 3569 3623 3646 3545 3530 3514 3512 3632 3812 3786 3579 3576 3658 3617 3572 3527 3508 3612 3614 3616 3626 3637 3680 3724 3624 3524 3509 3494 3479 3464 3438 3412 3447
7347C447L6J72J73j2j2L3L3j11j11o1o1RQk3J00K3K3J48K4k42j19K0J9J2J35J07j6j24j24
$$ 3447 3483 3655 3828 3816 3804 3837 3870 3759 3648 3587 3526 3535 3543 3520 3620 3643 3666 3814 3838 3596 3477 3497 3516 3528 3663 3770 3754 3630 3506
7332C506K8K8M4q0n6O6j0j1Q9Q9Q1Q1p2j94m4Q0m6P7Q5l8K2K2m7m7o9p0K5K6Q0m2m3Q0K6K5
$$ 3506 3534 3562 3606 3526 3470 3536 3526 3515 3604 3693 3774 3855 3783 3589 3545 3625 3579 3656 3741 3703 3725 3747 3700 3653 3584 3514 3539 3565 3645 3603 3560 3640 3666 3691
7315C691o1o2q1M2J17J16L2L2l0k9p1p1rrJ1J0n1n1q6q5P1J93J1J1R6k7p1N2N2p1j48k5J28
$$ 3691 3630 3568 3487 3529 3646 3762 3794 3826 3796 3767 3696 3625 3616 3607 3618 3628 3577 3526 3440 3355 3426 3619 3630 3641 3737 3710 3639 3691 3743 3672 3524 3499 3627
7299C627p6q8J17N8o5J1J0LLqrp8p7P5m8m8P6J08J09OOqj30o1o1J00J00klRRRRr0q9p5J31
$$ 3627 3551 3463 3580 3638 3573 3584 3594 3597 3600 3592 3583 3505 3428 3503 3455 3407 3483 3591 3700 3706 3712 3704 3574 3513 3452 3552 3652 3650 3647 3656 3665 3674 3683 3593 3504 3429 3560
7280C560K08Lmnq2M0k9k9P0P0j50k7P2n0k8k7n6O6lkJ6J7J6J7J3J2J3J3l6l5K5K6J20J20j05
$$ 3560 3768 3771 3767 3762 3680 3720 3691 3662 3732 3802 3652 3625 3697 3647 3619 3592 3536 3602 3599 3597 3613 3630 3646 3663 3676 3688 3701 3714 3678 3643 3668 3694 3814 3934 3829
7262C829j06MMLMq2q3k0k1m0m0m0m0R9R8R9R8M2M2o0o1M4M4k23k23J10J11QPJ8J8Q0Q0k5k4
$$ 3829 3723 3727 3731 3734 3738 3656 3573 3553 3532 3492 3452 3412 3372 3471 3569 3668 3766 3808 3850 3790 3729 3773 3817 3594 3371 3481 3592 3600 3607 3625 3643 3723 3803 3778 3754
7245C754k4k4k5k6j27j28N8N8N8N8LKKLo7o7qJ15J69p7k62j6J14rJ4J3j0j0j0j0R2R1L0K9
$$ 3754 3730 3706 3681 3655 3528 3400 3458 3516 3574 3632 3635 3637 3639 3642 3575 3508 3500 3615 3784 3707 3445 3429 3543 3534 3548 3561 3551 3541 3531 3521 3613 3704 3734 3763
7228C763ooN6N5m5m6m6m6P0O9l3l4O8O8POj42j42KJQ6Q6j7j6j7j7j20j19J43J43m1m1N1N0
$$ 3763 3757 3751 3807 3862 3817 3771 3725 3679 3749 3818 3785 3751 3819 3887 3894 3900 3758 3616 3618 3619 3705 3791 3774 3758 3741 3724 3604 3485 3628 3771 3730 3689 3740 3790
7211C790N1N0j68j68J6J6R5R5j71j71L3L3L2L3p6p6K7K6Q1Q0Q1Q0r7r6l6l5L9L9L9L9Q3Q3
$$ 3790 3841 3891 3723 3555 3571 3587 3682 3777 3606 3435 3468 3501 3533 3566 3490 3414 3441 3467 3548 3628 3709 3789 3692 3596 3560 3525 3564 3603 3642 3681 3764 3847
7195C847o0o0j9j8k6R7jjj78j78qpqpJ17J18N6N6k6k6k5k6R4R5m9m9j36j36PQN6N6N6N6KJ
$$ 3847 3787 3727 3708 3690 3664 3761 3760 3759 3581 3403 3395 3388 3380 3373 3490 3608 3664 3720 3694 3668 3643 3617 3711 3806 3757 3708 3572 3436 3443 3451 3507 3563 3619 3675 3677 3678
7177C678P0n3j1j1k7k6O1o3O9O8J4J4m7m7m7m8k1J01J05j9j26P9J49K7J08J08j74j75Nj18
$$ 3678 3748 3695 3684 3673 3646 3620 3681 3618 3687 3755 3769 3783 3736 3689 3642 3594 3573 3674 3779 3760 3634 3713 3862 3889 3997 4105 3931 3756 3761 3643
7162C643K0J44P4m9KJool9l9m0l9M9M9j2j2N7N7q7q6j3j2j2j2L5L5R7R6m0m0R8k4k04q1O7
$$ 3643 3663 3807 3881 3832 3834 3835 3829 3823 3784 3745 3705 3666 3715 3764 3752 3740 3797 3854 3767 3681 3668 3656 3644 3632 3667 3702 3799 3895 3855 3815 3913 3889 3685 3604 3671
7144C671O8L9M0o3o3n6n5k2J01K0J9Kj22l8Q5J6J5r1L2R3l0K0K0J3J2qqpqo6o5L7L7rj0rr
$$ 3671 3739 3778 3818 3755 3692 3636 3581 3559 3660 3680 3699 3701 3579 3541 3626 3642 3657 3566 3598 3691 3661 3681 3701 3714 3726 3718 3710 3703 3695 3629 3564 3601 3638 3629 3619 3610 3601
7125C601j%O1O1K2K1j23j22O0N9kj%JJ03J03k02k02O4O5N0N0n2n2Q6Q6n8n7J02J02m1m1on
$$ 3601 3600 3600 3661 3722 3744 3765 3642 3520 3580 3639 3637 3636 3636 3637 3740 3843 3641 3439 3503 3568 3618 3668 3616 3564 3650 3736 3678 3621 3723 3825 3784 3743 3737 3732
7108C732onj9j8j9j8J32J33J04j00r2r3klK2K2m0m0j6j6j7j6M5M5M5M5n4n4Q9R0j7j7j7j7
$$ 3732 3726 3721 3702 3684 3665 3647 3779 3912 4016 3916 3824 3731 3729 3726 3748 3770 3730 3690 3674 3658 3641 3625 3670 3715 3760 3805 3751 3697 3786 3876 3859 3842 3825 3808
7091C808mmlmn8n9Q5Q5J3J3J3J3n1n1n1n1O7O7m3m3j14k36j11R4K28K4o1O2jjn5n4K2K2K3
$$ 3808 3804 3800 3797 3793 3735 3676 3761 3846 3859 3872 3885 3898 3847 3796 3745 3694 3761 3828 3785 3742 3628 3392 3281 3375 3603 3627 3566 3628 3627 3626 3571 3517 3539 3561 3584
7074C584K2J4J3P5P5m2m3J9K0J4J4J4J4L9M0M0L9opj09j09Q6Q7j6j6p7p6p6p7J07J06M5M5
$$ 3584 3606 3620 3633 3708 3783 3741 3698 3717 3737 3751 3765 3779 3793 3832 3872 3912 3951 3945 3938 3829 3720 3806 3893 3877 3861 3784 3708 3632 3555 3662 3768 3813 3858
7057C858J6J5q6q7O5O4MLJ6J7q7q6j33j33R3R2R2R1L0K9kkkkj3j4j4j3j3j3j3j3J9J9J9J9
$$ 3858 3874 3889 3803 3716 3781 3845 3849 3852 3868 3885 3798 3712 3579 3446 3539 3631 3723 3814 3844 3873 3871 3869 3867 3865 3852 3838 3824 3811 3798 3785 3772 3759 3778 3797 3816 3835
7039C835rj0p0p1M7M7M7M7K7K8l5l4o4o3lkK7K6J29J29k0k1k1k1j09j09P5P5m4m3m4m4M8M9
$$ 3835 3826 3816 3746 3675 3722 3769 3816 3863 3890 3918 3883 3849 3785 3722 3719 3717 3744 3770 3899 4028 4008 3987 3966 3945 3836 3727 3802 3877 3833 3790 3746 3702 3750 3799
7022C799M8M8r0r0k8k9J1J1P2P2m8m9N5N4p3p3j2j1L1L1L0L1M9M9n3n4p7p6O7O6m7m8m7m7
$$ 3799 3847 3895 3805 3715 3687 3658 3669 3680 3752 3824 3776 3727 3782 3836 3763 3690 3678 3667 3698 3729 3759 3790 3839 3888 3835 3781 3704 3628 3695 3761 3714 3666 3619 3572
7005C572k4k3Q0P9MMJ06J06n6n7n6n7l3l3P0O9M4M4J13j0o8o8ppn7O7K2j82j05J01J08J08
$$ 3572 3548 3525 3605 3684 3688 3692 3798 3904 3848 3791 3735 3678 3645 3612 3682 3751 3795 3839 3952 3942 3874 3806 3799 3792 3735 3802 3824 3642 3537 3638 3746 3854
6989C854K6r7j30j30Q0Q0k3k2J4J5PPJ62L9p1N2Lj19m3m3J38J38m7m7L9L9r6r7q7L7J11J11
$$ 3854 3880 3783 3653 3523 3603 3683 3660 3638 3652 3667 3674 3681 3843 3882 3811 3863 3866 3747 3704 3661 3799 3937 3890 3843 3882 3921 3825 3728 3641 3678 3789 3900
6973C900NOq9q9o1O1J64M1m7m7n5n5n4n3N0M9k2k3J14J13J9j04j12J1O0o3n6O8j6j7N3N3K3
$$ 3900 3905 3911 3822 3733 3672 3733 3897 3938 3891 3844 3789 3734 3680 3627 3677 3726 3704 3681 3795 3908 3927 3823 3711 3722 3782 3719 3663 3731 3715 3698 3751 3804 3827
6956C827K4m6m6J16qJ%o1o1l5Q7P6m7j83n9J78J79JKl8l9N7N6K3r9j62l8m0m1J52J52P0P0
$$ 3827 3851 3805 3759 3875 3867 3868 3868 3807 3746 3711 3798 3874 3827 3644 3585 3763 3942 3943 3945 3907 3868 3925 3981 4004 3905 3743 3705 3665 3624 3776 3928 3998 4068
6940D068m5j69n5n6L9L9P0P0l2l3n8n9M4M4o2o2P6m7p8M6l2l1J02J01L3L3O4n9n8O4j04j03
$$ 4068 4023 3854 3799 3743 3782 3821 3891 3961 3929 3896 3838 3779 3823 3867 3805 3743 3819 3772 3694 3740 3708 3677 3779 3880 3913 3946 4010 3951 3893 3957 3853 3750
6924C750PON2N1q7L6J5j09j14RJ90j5q2J23J17q8j32rJ14J14j45j45P0P0o0O2j5j6N3N4j3
$$ 3750 3757 3763 3815 3866 3779 3815 3830 3721 3607 3616 3806 3791 3709 3832 3949 3861 3729 3720 3834 3948 3803 3658 3728 3798 3738 3800 3785 3769 3822 3876 3863
6908C863j3J2J36J2j10O9O9o9o9p7M6L7L7n8n7O2O3J32Rj2j1k0j9P9Q0J8j06j40O5J1j13J6
$$ 3863 3850 3862 3998 4010 3900 3969 4038 3969 3900 3823 3869 3906 3943 3885 3828 3890 3953 4085 4094 4082 4071 4051 4032 4111 4191 4209 4103 3963 4028 4039 3926 3942
6892C942J6QRj15j15K8K8MMlmJ12j0N8N9J1J1J9j05KKnoj25j25J9J8J46J45JKj34j34RRJ7
$$ 3942 3958 3966 3975 3860 3745 3773 3801 3805 3809 3806 3802 3914 3904 3962 4021 4032 4043 4062 3957 3959 3961 3956 3950 3825 3700 3719 3737 3883 4028 4029 4031 3897 3763 3772 3781 3798
6874C798J7j7j40L7L8k5k4q8L5J37J5k1k0kJ21M1q2q2M1L9q3opP5P5P5P5j3j4l9j62j5J08
$$ 3798 3815 3798 3658 3695 3733 3708 3684 3596 3631 3768 3783 3762 3742 3740 3861 3902 3820 3738 3779 3818 3735 3729 3722 3797 3872 3947 4022 4009 3995 3956 3794 3779 3887
6857C887L2L1l9m0J5J5J12j1j19j19o6N7M9N0k6k5l3l3J45K2q8L5Q3m1o6o6J08J08L8L9o3
$$ 3887 3919 3950 3911 3871 3886 3901 4013 4002 3883 3764 3698 3755 3804 3854 3828 3803 3770 3737 3882 3904 3816 3851 3934 3893 3827 3761 3869 3977 4015 4054 3991
6842C991j86m3Q0n2n1n2P1N0M9J27Lq8q7j11J2J72M9j41O4R3l1m3m3K0J44Q2m1p7p6J41o4
$$ 3991 3805 3762 3842 3790 3739 3687 3758 3808 3857 3984 3987 3899 3812 3701 3713 3885 3934 3793 3857 3950 3919 3876 3833 3853 3997 4079 4038 3961 3885 4026 3962
6826C962j69m7j02K0J51K8m6m7Q8l6j50N4Q4m0l4Q9N2p0O8O8J0J0LKN8o6J2J1j01K2m8m7J6
$$ 3962 3793 3746 3644 3664 3815 3843 3797 3750 3838 3802 3652 3706 3790 3750 3716 3805 3857 3787 3855 3923 3933 3943 3946 3948 4006 3940 3952 3963 3862 3884 3836 3789 3805
6810C805J6J6J6QQR8R8J0j94j32P2M4M4nmP6P6Q3l9j9j9q8k11q1J24J14j73r7J09J19J19J5
$$ 3805 3821 3837 3853 3861 3869 3967 4065 4075 3881 3749 3821 3865 3909 3904 3900 3976 4052 4135 4096 4077 4058 3970 3759 3678 3802 3916 3743 3646 3755 3874 3993 4008
6794D008J6J10J10r3k16m0Q4L6q7q0M4L9L8J70l6j02K1j22j23NMJ48J48J7J7K5r8j6j6q5q5
$$ 4008 4024 4134 4244 4151 3935 3895 3979 4015 3928 3848 3892 3931 3969 4139 4103 4001 4022 3900 3777 3782 3786 3934 4082 4099 4116 4141 4043 4027 4011 3926 3841
6778C841j2j3J8J9J8J8j3j2n5n5Q4l9q6L7K2K1l9l9J04J05J2J2n0m9m1m1j6J08J0j13n1P1
$$ 3841 3829 3816 3834 3853 3871 3889 3876 3864 3809 3754 3838 3799 3713 3750 3772 3793 3754 3715 3819 3924 3936 3948 3898 3849 3808 3767 3751 3859 3869 3756 3705 3776
6762C776L8q4K5J48Q7Q7m9m9k4k4L7L8KLj20Q4N0p3m5m5K1J43J00j05j07R9K4j81j22j22R0
$$ 3776 3814 3730 3755 3903 3990 4077 4028 3979 3955 3931 3968 4006 4008 4011 3891 3975 4025 3952 3907 3862 3883 4026 4126 4021 3914 4013 4037 3856 3734 3612 3702
6746C702R1K9L0Mj19l9Q3J37J5O8O7m2m2j3j2J8J9J32J31r3r4r9r8l8l7J8J7j3j3J31J30j2
$$ 3702 3793 3822 3852 3856 3737 3698 3781 3918 3933 4001 4068 4026 3984 3971 3959 3977 3996 4128 4259 4166 4072 3973 3875 3837 3800 3818 3835 3822 3809 3940 4070 4058
6730D058j3p2p3l9Q4M3M3n2n2Q3Q3o8o8P6m8K2K1J8J7J8J7n9o0P6P7K4r9l7Q6p3p3lmJ8J8
$$ 4058 4045 3973 3900 3861 3945 3988 4031 3979 3927 4010 4093 4025 3957 4033 3985 4007 4028 4046 4063 4081 4098 4039 3979 4055 4132 4156 4057 4020 4106 4033 3960 3957 3953 3971 3989
6713C989p7p6o7N7N6N7n0P3J1j11l2l2j01j01L7L7J47J47j41j8J66M4j7j7k5k4n1n2M3M4P6
$$ 3989 3912 3836 3769 3826 3882 3939 3889 3962 3973 3862 3830 3798 3697 3596 3633 3670 3817 3964 3823 3805 3971 4015 3998 3981 3956 3932 3881 3829 3872 3916 3992
6697C992m7J5J38k3k2N4o8j01j02L5L5O9O9J5J6j03K1R0l3q9L5L5q8j16PO6O6M0q4j10j09
$$ 3992 3945 3960 4098 4075 4053 4107 4039 3938 3836 3871 3906 3975 4044 4059 4075 3972 3993 4083 4050 3961 3996 4031 3943 3827 3834 3900 3966 4006 3922 3812 3703
6682C703P3J95O5O5L1L0p2p2l3l4l3l3J07J06m9j73k2k2P8K01J7j06l0k9l4l3j57M9K33J10
$$ 3703 3776 3971 4036 4101 4132 4162 4090 4018 3985 3951 3918 3885 3992 4098 4049 3876 3854 3832 3910 4111 4128 4022 3992 3963 3929 3896 3739 3788 4021 4131
6667D131l3l4NNn6n7KLP1P2j23JK6K6J09j3oon7n6n7n6N1N1M4M3o2j86j4J91L5q7LKn7O6O6
$$ 4131 4098 4064 4069 4074 4018 3961 3963 3966 4037 4109 3986 3987 4013 4039 4148 4135 4129 4123 4066 4010 3953 3897 3948 3999 4043 4086 4024 3838 3824 4015 4050 3963 3966 3968 3911 3977 4043
6648D043n7j27j26j18J68J94P2o7o6k6k6P7P7o7o7j3j3K07Q4j13j13pqN5N4Q7Q8K6K6r1r1
$$ 4043 3986 3859 3733 3615 3783 3977 4049 3982 3916 3890 3864 3941 4018 3951 3884 3871 3858 4065 4149 4036 3923 3916 3908 3963 4017 4104 4192 4218 4244 4153 4062
6633D062k9k9P6P5o7o8n3n3N0M9LKn2n2q4L9L9q4q4q5O5J87ONQ2m0k5k6l3l3l0l0J13J13Q6
$$ 4062 4033 4004 4080 4155 4088 4020 3967 3914 3964 4013 4016 4018 3966 3914 3830 3869 3908 3824 3740 3655 3720 3907 3913 3918 4000 3960 3935 3909 3876 3843 3813 3783 3896 4009 4095
6615D095Q6r8r8m5m4N8N8M3M4M4M4o7o7m7J59P8m6n8n8l1R2l9l8r2r1J6J39R4l0k9R3l7j60
$$ 4095 4181 4083 3985 3940 3896 3954 4012 4055 4099 4143 4187 4120 4053 4006 4165 4243 4197 4139 4081 4050 4142 4103 4065 3973 3882 3898 4037 4131 4101 4072 4165 4128 3968
6598C968q4q3J14J14J2J2L6L6o7o6J7J7l7l7p8M5M5p8K6K5J8J8L4L3K6K5M2q1q2M2P1P1n7
$$ 3968 3884 3801 3915 4029 4041 4053 4089 4125 4058 3992 4009 4026 3989 3952 3874 3919 3964 3886 3912 3937 3955 3973 4007 4040 4066 4091 4133 4052 3970 4012 4083 4154 4097
6582D097n7n9O5O4n9N1N1n9n8K9K9K1K1R7k6j36j3N2p1O8O7MLP3n0q8q7r5r5j1j1Q4Q5L3r0
$$ 4097 4040 3981 4046 4110 4051 4102 4153 4094 4036 4065 4094 4115 4136 4233 4207 4071 4058 4110 4039 4107 4174 4178 4181 4254 4204 4116 4029 3934 3839 3828 3817 3901 3986 4019 3929
6564C929l5Q7R1l2M5M5o3o2%jO8O9l4l4qq%%p7M6P2P1M0q4j29P5O4O4Kj21M6M6k3k3O1O1P7
$$ 3929 3894 3981 4072 4040 4085 4130 4067 4005 4005 4004 4072 4141 4107 4073 4065 4057 4057 4057 3980 4026 4098 4169 4209 4125 3996 4071 4135 4199 4201 4080 4126 4172 4149 4126 4187 4248 4325
6546D325m7j5J08L8q4j21j20J6J5j7j7M4M4l1l2L1L0n3n3m5m5j25lP1P2J45J45l1l2j03J9
$$ 4325 4278 4263 4371 4409 4325 4204 4084 4100 4115 4098 4081 4125 4169 4138 4106 4137 4167 4114 4061 4016 3971 3846 3843 3914 3986 4131 4276 4245 4213 4110 4129
6530D129K0j03%Jqpl3l3P0P0l1l0j61l8M0M0N6N5j20LP6P7R6R6J27j60k19j3lJ19J02j03j18
$$ 4129 4149 4046 4046 4047 4039 4032 3999 3966 4036 4106 4075 4045 3884 3846 3886 3926 3982 4037 3917 3920 3996 4073 4169 4265 4392 4232 4013 4000 3997 4116 4218 4115 3997
6514C997MJ94P1MNp1p1o4o3q7L7J51n3j14Qp4p4J44J44J51K8j6j7k4k4J6J7J6J6rrn8n8p6
$$ 3997 4001 4195 4266 4270 4275 4204 4133 4069 4006 3919 3956 4107 4054 3940 3948 3874 3800 3944 4088 4239 4267 4251 4234 4210 4186 4202 4219 4235 4251 4242 4233 4175 4117 4041
6497D041J29O8j37k1k0qJ15L1r2j5j4J4J5m7m7kkN9O0mllmN6N5q8q8N4N5r0q9J4J4m7m8n2
$$ 4041 4170 4238 4101 4080 4060 4052 4167 4198 4106 4091 4077 4091 4106 4059 4012 4010 4008 4067 4127 4123 4120 4117 4113 4169 4224 4136 4048 4102 4157 4067 3978 3992 4006 3959 3911 3859
6478C859n3R1R1P4P3l0k9N6N7onKJJKm1m1J02J03p2p2L1L1MMMMp8p8K4K5J3J3J3J3l2l2l2
$$ 3859 3806 3897 3988 4062 4135 4105 4076 4132 4189 4183 4178 4180 4181 4182 4184 4143 4102 4204 4307 4235 4163 4194 4225 4229 4233 4237 4241 4163 4085 4109 4134 4147 4160 4173 4186 4154 4122 4090
6459D090l2L1L1L1L1j6j6p8p8J9J8Q5j20q7J18N2N2M4M4j00r9J04J04JKJ8J8m3m3o8o7o8o7
$$ 4090 4058 4089 4120 4151 4182 4166 4150 4072 3994 4013 4031 4116 3996 3909 4027 4079 4131 4175 4219 4119 4020 4124 4228 4229 4231 4249 4267 4224 4181 4113 4046 3978 3911
6443C911Q2Q2m8m8r7J08%j22O3O3N6N5N0N0r4r3Q4Q4J0J1R9j06j21KpqJJJ2J2n0m9L5L5K8
$$ 3911 3993 4075 4027 3979 3882 3990 3990 3868 3931 3994 4050 4105 4155 4205 4111 4018 4102 4186 4196 4207 4306 4200 4079 4081 4074 4066 4067 4068 4080 4092 4042 3993 4028 4063 4091
6425D091K7J12j0m4m4O7O8j17j17k7k6L4L5Q9Q9o0O3J46j40j84o0R6R7P1n1k8k9l5l6q5q4
$$ 4091 4118 4230 4220 4176 4132 4199 4267 4150 4033 4006 3980 4014 4049 4138 4227 4167 4230 4376 4236 4052 3992 4088 4185 4256 4205 4177 4148 4113 4077 3992 3908
6410C908J8J8O4O3O4O4n3n3j14R0K10Q6m9n0j03K0K04Q2o6o6N7o5p4p3mj27n6O8j6j7J16o
$$ 3908 3926 3944 4008 4071 4135 4199 4146 4093 3979 4069 4279 4365 4316 4266 4163 4183 4387 4469 4403 4337 4394 4329 4255 4182 4178 4051 3995 4063 4047 4030 4146 4140
6394D140JKM9N0j2j2o6o7o7o7J36J35p7M6M6M6qqm7m7m7m7O2O2L6q7j14RK6K7J2j10L3J56
$$ 4140 4141 4143 4192 4242 4230 4218 4152 4085 4018 3951 4087 4222 4145 4191 4237 4283 4275 4267 4220 4173 4126 4079 4141 4203 4239 4152 4038 4047 4073 4100 4112 4002 4035 4191
6377D191K6K6L4L4m0m1l3l2q7L6K1K1J01k3k2J00l0l0L2L2l9j62l1l1O1O1p7M6J42J9RRj53
$$ 4191 4217 4243 4277 4311 4271 4230 4197 4165 4078 4114 4135 4156 4257 4234 4212 4312 4282 4252 4284 4316 4277 4115 4084 4053 4114 4175 4098 4144 4286 4305 4314 4323 4170
6360D170R2R3j54O3O3n4n5MLn7n8O0O0J07J06O2j85r2r2j56R0Q2m1O7O8kkj0rj0rl2l3l2l2
$$ 4170 4262 4355 4201 4264 4327 4273 4218 4222 4225 4168 4110 4170 4230 4337 4443 4505 4320 4228 4136 3980 4070 4152 4111 4178 4246 4244 4242 4232 4223 4213 4204 4172 4139 4107 4075
6342D075J21J21k2k2p8p8J88J88r0r1J1J2o1o0ppP8m5j84O3P0n4p1p1O6O6O6O6j4j4M8M7J0
$$ 4075 4196 4317 4295 4273 4195 4117 4305 4493 4403 4312 4323 4335 4274 4214 4207 4200 4278 4233 4049 4112 4182 4128 4057 3986 4052 4118 4184 4250 4236 4222 4270 4317 4327
6326D327J1r2r3J8J7n2n1M3q0r6J51J44K1l8l7J3J4J3J4k5k5k5k5P5P5o8o9P7P7k5k6j4j4
$$ 4327 4338 4246 4153 4171 4188 4136 4085 4128 4048 3952 4103 4247 4268 4230 4193 4206 4220 4233 4247 4222 4197 4172 4147 4222 4297 4229 4160 4237 4314 4289 4263 4249 4235
6309D235j4j4j2j1J32J32m0l9K1K2n2n1n2n2O8O7OOo7o8opJ0Rm5m4L9J62J13r2j14QK1K1M
$$ 4235 4221 4207 4195 4184 4316 4448 4408 4369 4390 4412 4360 4309 4257 4205 4273 4340 4346 4352 4285 4217 4211 4204 4214 4223 4178 4134 4173 4335 4448 4356 4242 4250 4271 4292 4296
6292D296j20n8O5J4J3q8q9J15q%jKLj9j41j19Q6J07J06J37J36m9m8mmj1j2O0o3j37j37L0K9
$$ 4296 4176 4118 4183 4197 4210 4122 4033 4148 4140 4140 4139 4141 4144 4125 3984 3865 3951 4058 4164 4301 4437 4388 4340 4336 4332 4321 4309 4369 4306 4169 4032 4062 4091
6275D091L0K9O9P0k6k6M5J68P9j27j61l9n8n9PQJ5J5l2R1mj27k0J02Q0P9J24%j51k8Rj14j7
$$ 4091 4121 4150 4219 4289 4263 4237 4282 4450 4529 4402 4241 4202 4144 4085 4092 4100 4115 4130 4098 4189 4185 4058 4038 4140 4220 4299 4423 4423 4272 4244 4253 4139 4122
6259D122J07J44o2q2q1j3j3j3j3M0M0r6r6p6M7Q1Q1j7j6J19J19O7n5j17OM9M8J28j59o1J44
$$ 4122 4229 4373 4311 4229 4148 4135 4122 4109 4096 4136 4176 4080 3984 3908 3955 4036 4117 4100 4084 4203 4322 4389 4334 4217 4223 4272 4320 4448 4289 4228 4372
6243D372J1J1J6J6QQJ63M1j57j58M4M5j36j2R2l2j26lJ5J5J5J38J48J49j11j10m6m7j07j08
$$ 4372 4383 4394 4410 4426 4434 4442 4605 4646 4489 4331 4375 4420 4284 4272 4364 4332 4206 4203 4218 4233 4248 4386 4534 4683 4572 4462 4416 4369 4262 4154
6228D154OOO0O0M9p5nom6m6J6J5N4N4O9n3n2P1j3j4J8j06m4P9OPR1l2j0J13j08j07M4M5J8
$$ 4154 4160 4166 4226 4286 4335 4260 4255 4249 4203 4157 4173 4188 4242 4296 4365 4312 4260 4331 4318 4304 4322 4216 4172 4251 4257 4264 4355 4323 4313 4426 4318 4211 4255 4300 4318
6210D318j04p3M9O8O7P6m8p3p3k7R7R6k7j3j3k0k1j5j5L8L9P4m9p5p5o4N9M3M3J72M9J6J5
$$ 4318 4214 4141 4190 4258 4325 4401 4353 4280 4207 4180 4277 4373 4346 4333 4320 4300 4279 4264 4249 4287 4326 4400 4351 4276 4201 4137 4196 4239 4282 4454 4503 4519 4534
6194D534l1l2j01K2l0l1J20J21k5k4q6q6M4M3j33j33j58l4J96J96N0p3p2N0K0J9R7k7j08j08
$$ 4534 4503 4471 4370 4392 4362 4331 4451 4572 4547 4523 4437 4351 4395 4438 4305 4172 4014 3980 4176 4372 4422 4349 4277 4327 4347 4366 4463 4436 4328 4220
6179D220K8K8r5r5J5J5K5J48J48K6ook1k1m3j65N9J83KKn2n1o5o4llJ5J5P7P7m4m3J8J8K5
$$ 4220 4248 4276 4181 4086 4101 4116 4141 4289 4437 4463 4457 4451 4430 4409 4366 4201 4260 4443 4445 4447 4395 4344 4279 4215 4212 4209 4224 4239 4316 4393 4349 4306 4324 4342 4367
6161D367K6l6l6l2l2r8J06J50n5j11j11Q7Q8j5j5q5q6N8N8KJj14R1J64J64L4j72j24jJ9K0
$$ 4367 4393 4357 4321 4289 4257 4159 4265 4415 4360 4249 4138 4225 4313 4298 4283 4198 4112 4170 4228 4230 4231 4117 4208 4372 4536 4570 4398 4274 4273 4292 4312
6146D312N9N9q5q4k4k4k3k4J3J3P5P5mmN8N7K2K1q0q1n8n8MLj5j6j6j5JKJ04J04K5K5l7l7
$$ 4312 4371 4430 4345 4261 4237 4213 4190 4166 4179 4192 4267 4342 4338 4334 4392 4449 4471 4492 4412 4331 4273 4215 4219 4222 4207 4191 4175 4160 4161 4163 4267 4371 4396 4421 4384 4347
6128D347OOONP6P6j00j01k6R6Q1j24n0n0Q1Q1p7p8O6O6j1j0p3p2P6P6J4J5l2l2l1l2L2L2L2
$$ 4347 4353 4359 4365 4370 4446 4522 4422 4321 4295 4391 4472 4348 4298 4248 4329 4410 4333 4255 4321 4387 4376 4366 4293 4221 4297 4373 4387 4402 4370 4338 4307 4275 4307 4339 4371
6110D371L1NNNNr1r2N2N2R2R2o0n9J06j7n1n0rj0rrM1M1M1M0K3K4l9l8ooj09j08J6J5m5m6
$$ 4371 4402 4407 4412 4417 4422 4331 4239 4291 4343 4435 4527 4467 4408 4514 4497 4446 4396 4387 4377 4368 4359 4400 4441 4482 4522 4545 4569 4530 4492 4486 4480 4371 4263 4279 4294 4249 4203
6091D203K3K2n4O8J09j5ppJ30Or5K7K7K7k7k7L8L7o4j88n7J47p7p8J1J2O5O5P5m8j09J4O6
$$ 4203 4226 4248 4194 4262 4371 4356 4349 4342 4472 4478 4383 4410 4437 4464 4437 4410 4448 4485 4421 4233 4176 4323 4246 4168 4179 4191 4256 4321 4396 4348 4239 4253 4319
6075D319O7J3J3J01J01jko5o5o5o5p2p1l8Q5J05J06J1J0L7L6j07j07k8k9J07J07m4j66k4J00
$$ 4319 4386 4399 4412 4513 4614 4613 4611 4546 4481 4416 4351 4279 4208 4170 4255 4360 4466 4477 4487 4524 4560 4453 4346 4318 4289 4396 4503 4459 4293 4269 4369
6059D369k6k6J25J25K8K7p4p5j34j33P9P9J67l9j08R7R8k6q6q7J6J5q6q7r9r8MJ26J48n8m
$$ 4369 4343 4317 4442 4567 4595 4622 4548 4473 4339 4206 4285 4364 4531 4492 4384 4481 4579 4553 4467 4380 4396 4411 4325 4238 4139 4041 4045 4171 4319 4261 4257
6044D257J20N0N1N8N9n2n2j13j14m0m0K2K1J35J34n0n0j39j39p7J28P8m5J39J40l0l1l0l0
$$ 4257 4377 4427 4478 4536 4595 4543 4491 4378 4264 4224 4184 4206 4227 4362 4496 4446 4396 4257 4118 4041 4169 4247 4202 4341 4481 4451 4420 4390 4360
6029D360M1M0k1k1K9K8R1R0nmo6o6r2r3J0J1JJJJJ4J3J16J16n6n6n6n6j0rN1N2lmj06j06k2
$$ 4360 4401 4441 4420 4399 4428 4456 4547 4637 4632 4628 4562 4496 4404 4311 4321 4332 4333 4334 4335 4336 4350 4363 4479 4595 4539 4483 4427 4371 4361 4352 4403 4455 4452 4448 4342 4236 4214
6011D214k3J21J21mllmq0p9O3O4O0N9jkN0N1j2j1K7K7p5p5n3n3N0M9POr7r6K15K14j0k16n7
$$ 4214 4191 4312 4433 4429 4426 4423 4419 4339 4260 4323 4387 4447 4506 4505 4503 4553 4604 4592 4581 4608 4635 4560 4485 4432 4379 4429 4478 4485 4491 4394 4298 4513 4727 4717 4501 4444
5993D444O6M6M5M2M1o0o1j07j07P7P8J8J9m3m3Q7Q6j6j6k1k1k1k1k7k8k7k7j4j4j3j4kkl3
$$ 4444 4510 4556 4601 4643 4684 4624 4563 4456 4349 4426 4504 4522 4541 4498 4455 4542 4628 4612 4596 4575 4554 4533 4512 4485 4457 4430 4403 4389 4375 4362 4348 4346 4344 4311
5976D311J72J14j73o9N5o1o0R0R1k8k7j9k0m4P9J82N8r5r4m1m1P3P3J2J1M5M5N3N2k12r0j5
$$ 4311 4483 4597 4424 4355 4410 4349 4289 4379 4470 4442 4415 4396 4376 4332 4411 4593 4651 4556 4462 4421 4380 4453 4526 4538 4549 4594 4639 4692 4744 4532 4442 4427
5959D427j5L8L8j6j6q8L4l5l5j9j9N6J78n6n6NOJ26Lj53j54ppJ44J44j2J12J03j01j50k7L4
$$ 4427 4412 4450 4488 4472 4456 4368 4402 4367 4332 4313 4294 4350 4528 4472 4416 4421 4427 4553 4556 4403 4249 4242 4235 4379 4523 4511 4623 4726 4625 4475 4448 4482
5943D482L5R1R1n2n2m4m4j47j47J40J40m4m5L2L1L1L1M2M2j38j5L9q4j30pn3P1J24q2q1q1
$$ 4482 4517 4608 4699 4647 4595 4551 4507 4360 4213 4353 4493 4449 4404 4436 4467 4498 4529 4571 4613 4475 4460 4499 4415 4285 4278 4225 4296 4420 4338 4257 4176
5928D176R1R1MMQ1m2j26kR7R8l6j59j5J07P7P7R2l1j14j13oJ17KKP1P1j45j45J1J2j5J91J29
$$ 4176 4267 4358 4362 4366 4447 4405 4279 4277 4374 4472 4436 4277 4262 4369 4446 4523 4615 4584 4470 4357 4351 4468 4470 4472 4543 4614 4469 4324 4335 4347 4332 4523 4652
5911D652p5j80j80P3P4L9L9L9L9O5O5kj25m4P9RJ0o5N8N9o5J2J2NMm4m4m4m5j2j2j2j2K3K3
$$ 4652 4577 4397 4217 4290 4364 4403 4442 4481 4520 4585 4650 4648 4523 4479 4558 4567 4577 4512 4570 4629 4564 4576 4588 4593 4597 4553 4509 4465 4420 4408 4396 4384 4372 4395 4418
5894D418l9l8N1N0M3M3R8k5n6O8K8K8j02K0J28Ok1k0mno6o5j5j4RRK1j02m1Q3J38J38onR4
$$ 4418 4379 4341 4392 4442 4485 4528 4626 4601 4545 4613 4641 4669 4567 4587 4715 4721 4700 4680 4676 4671 4605 4540 4525 4511 4520 4529 4550 4448 4407 4490 4628 4766 4760 4755 4849
5876D849k9k1k0j22j21K2K2O0O1pj29o4N9J20lp5M8K4K5L9q5j15QP2P3n6n6j4J09N3j53j35
$$ 4849 4820 4799 4779 4657 4536 4558 4580 4640 4701 4694 4565 4501 4560 4680 4677 4602 4650 4674 4699 4738 4653 4538 4546 4618 4691 4635 4579 4565 4674 4727 4574 4439
5860D439j34j37J50K67O2J1J1m3m3J8J9QQn4n3l1l0J82N9p1p1j32j32O9J91K84lj68j69L9
$$ 4439 4305 4168 4318 4585 4647 4658 4669 4626 4583 4601 4620 4628 4636 4582 4529 4498 4468 4650 4709 4638 4567 4435 4303 4372 4563 4847 4844 4676 4507 4546
5845D546L9o0n9JKO3O2JKLMn8n8j00j01J65J66k4k4k4k4L5L5L5L5k9k9L3L2r1r1J1J1j1j2
$$ 4546 4585 4525 4466 4467 4469 4532 4594 4595 4597 4600 4604 4546 4488 4388 4287 4452 4618 4594 4570 4546 4522 4557 4592 4627 4662 4633 4604 4637 4669 4578 4487 4498 4509 4498 4486
5827D486N0M9m9n0R3R4q1q0J04J04l7l7O5O6m8m8j7j7l7l8r8r9P3P3M2M2L5L4L5L4qqj11j11
$$ 4486 4536 4585 4536 4486 4579 4673 4592 4512 4616 4720 4683 4646 4711 4777 4729 4681 4664 4647 4610 4572 4474 4375 4448 4521 4563 4605 4640 4674 4709 4743 4735 4727 4616 4505
5810D505J15J16o9o9jjjjp0p1L2L2P8P8j07j06O6O7O7O7m0m1O3O2k2k2n2n3P8P7o5o6k6k6
$$ 4505 4620 4736 4667 4598 4597 4596 4595 4594 4524 4453 4485 4517 4595 4673 4566 4460 4526 4593 4660 4727 4687 4646 4709 4771 4749 4727 4675 4622 4700 4777 4712 4646 4620 4594
5793D594k5k6K0K0K0K0P6P5M5M6n9n8M5M4j04j04m3m3QPPPP9P8o5o4mlN8N8%j%%K4K4l7l8
$$ 4594 4569 4543 4563 4583 4603 4623 4699 4774 4819 4865 4806 4748 4793 4837 4733 4629 4586 4543 4551 4558 4565 4572 4651 4729 4664 4600 4596 4593 4651 4709 4709 4708 4708 4708 4732 4756 4719 4681
5774D681j21j22O3O2O3O3JJrj0p1p1N7N6N7N7nnono7o7L6L5j14j15P0P0NMNMN5N5opK5K4J47
$$ 4681 4560 4438 4501 4563 4626 4689 4690 4691 4682 4672 4601 4530 4587 4643 4700 4757 4752 4747 4741 4736 4669 4602 4638 4673 4559 4444 4514 4584 4589 4593 4598 4602 4657 4712 4706 4699 4724 4748 4895
5755D895n8j70m7J4J4m4m4m3m4M0M1M0M1m4m4R9J00j9j9q0q1k1k1k2k1M0L9M7M8j0J14N8j48
$$ 4895 4837 4667 4620 4634 4648 4604 4560 4517 4473 4513 4554 4594 4635 4591 4547 4646 4746 4727 4708 4628 4547 4526 4505 4483 4462 4502 4541 4588 4636 4626 4740 4798 4650
5738D650K0K1r5r5K4K4K4K4Q5Q5n9n9k4k5j6j7n0P3J27p8J4J38K9r3j69m6o2o1L3L4L3L3o
$$ 4650 4670 4691 4596 4501 4525 4549 4573 4597 4682 4767 4708 4649 4625 4600 4584 4567 4517 4590 4717 4639 4653 4791 4820 4727 4558 4512 4450 4389 4422 4456 4489 4522 4516
5722D516oooJ6J6P7P7j5j6j5j6nonon5n6M7M7l7l6l6l7P5P5P5P5l3l3l3l2M0M0M0M1L7L8o5
$$ 4516 4510 4504 4498 4514 4530 4607 4684 4669 4653 4638 4622 4617 4611 4606 4600 4545 4489 4536 4583 4546 4510 4474 4437 4512 4587 4662 4737 4704 4671 4638 4606 4646 4686 4726 4767 4804 4842 4777
5702D777o4NNn6n6k1k0M1M1k7k7q8q8K08K07n9n8o2o2o2o2M5M6M5M6jjo3o3J73J73lmj51k8
$$ 4777 4713 4718 4723 4667 4611 4590 4570 4611 4652 4625 4598 4510 4422 4630 4837 4778 4720 4658 4596 4534 4472 4517 4563 4608 4654 4653 4652 4589 4526 4699 4872 4869 4865 4714 4686
5685D686K6j78lJ21J00J01m2m2m2m2j8j9j9j9O3O2m0m0k8k9k8k8N2N2M5M4K4r8r7J09J25p9
$$ 4686 4712 4534 4531 4652 4752 4853 4811 4769 4727 4685 4667 4648 4629 4610 4673 4735 4695 4655 4627 4598 4570 4542 4594 4646 4691 4735 4759 4661 4564 4673 4798 4719
5669D719j98p4n9O4J74N1k3k2j0J13R5j09r0q9j8j8Q5Q4K3K3l8l9K9K8R1R0q3q2q3q3k3k3
$$ 4719 4521 4447 4388 4452 4626 4677 4654 4632 4622 4735 4830 4721 4631 4542 4524 4506 4591 4675 4698 4721 4683 4644 4673 4701 4792 4882 4799 4717 4634 4551 4528 4505
5653D505L9L8N0N0J12J11o7o7noQ5Q4j41O4P5m8o8o9N0N0r4r4L8L9o4o4q4q3J01J01RJ0RR
$$ 4505 4544 4582 4632 4682 4794 4905 4838 4771 4766 4760 4845 4929 4788 4852 4927 4879 4811 4742 4792 4842 4748 4654 4692 4731 4667 4603 4519 4436 4537 4638 4647 4657 4666 4675
5636D675j1j1j2j1l1l1J7J8K11Oj74n0P3P4k2k1P1P1p3p2l0k9J14rj87J8J08j6j1j2j9k0Q6
$$ 4675 4664 4653 4641 4630 4599 4568 4585 4603 4814 4820 4646 4596 4669 4743 4721 4700 4771 4842 4769 4697 4667 4638 4752 4743 4556 4574 4682 4666 4655 4643 4624 4604 4690
5619D690Q5n7n8N7N6N7N7K2K2K3K2m2m1j24%n5k59j13J74J54J54n3n4qrp0p0N6N6N5N6m1m2
$$ 4690 4775 4718 4660 4717 4773 4830 4887 4909 4931 4954 4976 4934 4893 4769 4769 4714 4455 4342 4516 4670 4824 4771 4717 4709 4700 4630 4560 4616 4672 4727 4783 4742 4700
5603D700o2O1J14r0l6Q6m1m2l4l4j0j0R2R2M5M5n7n8n8n9Q6Q5J7J8n2n2Q2m1m1Q2K1K0K1K0
$$ 4700 4638 4699 4813 4723 4687 4773 4732 4690 4656 4622 4612 4602 4694 4786 4831 4876 4819 4761 4703 4644 4730 4815 4832 4850 4798 4746 4828 4787 4746 4828 4849 4869 4890 4910
5586D910l7j60r9K5N9N9l6l6r9r9K4J47L6J58L6j69j01K3K3j00o1J45P5j30n5n5M7J70L5L6
$$ 4910 4873 4713 4614 4639 4698 4757 4721 4685 4586 4487 4511 4658 4694 4852 4888 4719 4618 4641 4664 4564 4503 4648 4723 4593 4538 4483 4530 4700 4735 4771
5570D771M3M4j3j4o6o7q1M2J03j9m1m1j6J08R7R8l9l8r7r6J3J4l8Q5J93j2p0o9k1k0k0j9M2
$$ 4771 4814 4858 4845 4831 4765 4698 4617 4659 4762 4743 4702 4661 4645 4753 4850 4948 4909 4871 4774 4678 4691 4705 4667 4752 4945 4933 4863 4794 4773 4753 4733 4714 4756
5554D756M2j6j5j6j6N9N9llk6k5j03K1M2q1N7N8k7k7l5Q9O4O4L8q5m5m6n3n3j1j1J61L7j06
$$ 4756 4798 4782 4767 4751 4735 4794 4853 4850 4847 4821 4796 4693 4714 4756 4675 4732 4790 4763 4736 4701 4790 4854 4918 4956 4871 4826 4780 4727 4674 4663 4652 4813 4850 4744
5537D744j07j2j2k7k8M2M2MJ27K4r8m1m1Q7Q7O5n7n8O5P8P8J6J6k0j44p4p5L2L2l0k9%JK1
$$ 4744 4637 4625 4613 4586 4558 4600 4642 4646 4773 4797 4699 4658 4617 4704 4791 4856 4799 4741 4806 4884 4962 4978 4994 4974 4830 4756 4681 4713 4745 4715 4686 4686 4687 4708
5520D708j02m5J61R1R2M7p5oop4p4L3J57M9p5J9j05j05J8P7P7N7o7j28nM7M6k0k1J61m4j00
$$ 4708 4606 4561 4722 4813 4905 4952 4877 4871 4865 4791 4717 4750 4907 4956 4881 4900 4795 4690 4708 4785 4862 4919 4852 4724 4719 4766 4812 4792 4771 4932 4888 4788
5504D788K2r8r8J3J2J66J66J00k3j59l7L1L0j08j07onK6K7J1J34P0n3n8O4R8j07j96p4Q8Q8
$$ 4788 4810 4712 4614 4627 4639 4805 4971 5071 5048 4889 4852 4883 4913 4805 4698 4692 4687 4713 4740 4751 4885 4955 4902 4844 4908 5006 4899 4703 4629 4717 4805
5488D805Q7Q8k5j48K9J52j3j36n9n9M2M3o1o0M3M3n2n2pJ16L9L9R1l2l3l2L2r1r1L2k6k5J61
$$ 4805 4892 4980 4955 4807 4836 4988 4975 4839 4780 4721 4763 4806 4745 4685 4728 4771 4719 4667 4660 4776 4815 4854 4945 4913 4880 4848 4880 4789 4698 4730 4704 4679 4840
5472D840L9k3J00K3K3rrj39j7O1O0OPL2L2m4P8J09j4JKp8p8j47k3j3j2J23q1j03J03k5k6O6
$$ 4840 4879 4856 4956 4979 5002 4993 4984 4845 4828 4889 4949 4955 4962 4994 5026 4982 5060 5169 5155 5156 5158 5080 5002 4855 4832 4819 4807 4930 4849 4746 4849 4824 4798 4864
5455D864O5j1J11l9j63r3K9J49J49k8k8p8p8j2J12P7m6j00K3K5K5L2L3j18j17j0J13J29Oj42
$$ 4864 4929 4918 5029 4990 4827 4734 4763 4912 5061 5033 5005 4927 4849 4837 4949 5026 4980 4880 4903 4928 4953 4985 5018 4900 4783 4773 4886 5015 5021 4879
5439D879j42m0m0k0J04R5j10l5l6lK01K02mj20j21p2p2K2K1K9L0r1L2L3r1O3O3N5N6j3j4N6
$$ 4879 4737 4697 4657 4637 4741 4836 4726 4691 4655 4652 4853 5055 5051 4931 4810 4738 4666 4688 4709 4738 4768 4677 4709 4742 4651 4714 4777 4832 4888 4875 4861 4917
5423D917o7m2m3n0n0ppJ01K24N4o8RQM7M7r6r6l8l7O4O5LLKLN1N1M4M3J33J1j39j38r9K5J6
$$ 4917 4850 4808 4765 4715 4665 4658 4651 4752 4976 5030 4962 4971 4979 5026 5073 4977 4881 4843 4806 4870 4935 4938 4941 4943 4946 4997 5048 5092 5135 5268 5279 5140 5002 4903 4928 4944
5405D944J7j07j08L7L6j4j4k1k2J27Lj40j6O6O6r8K6J74J74llj20j21O4O4M8M8j4j3J4J5m7
$$ 4944 4961 4854 4746 4783 4819 4805 4791 4770 4748 4875 4878 4738 4722 4788 4854 4756 4782 4956 5130 5127 5124 5004 4883 4947 5011 5059 5107 5093 5080 5094 5109 5062
5389E062m7r1r2k9l0K5K6Q7Q7PPpqJ49r6j30ol7l6N9N8J13j34j41J05J19mQ0Q0qqqqj7j7p8
$$ 5062 5015 4924 4832 4803 4773 4798 4824 4911 4998 5005 5012 5005 4997 5146 5050 4920 4914 4877 4841 4900 4958 5071 4937 4796 4901 5020 5016 5096 5176 5168 5160 5152 5144 5127 5110 5032
5371E032p8qql1R2J15j31j16QN9N8NNq2q1K0K1j7j8Q5Q5m3m3J9J9J05J04LKl6l5l6l6n3n4
$$ 5032 4954 4946 4938 4907 4999 5114 4983 4867 4875 4934 4992 4997 5002 4920 4839 4859 4880 4863 4845 4930 5015 4972 4929 4948 4967 5072 5176 5179 5181 5145 5110 5074 5038 4985 4931
5354D931M9M9j8j8j8j8K7K7l5l4j2j1N0M9n1n1j13j13J12J12J11J12n6n6NNj03j03M0M1O0
$$ 4931 4980 5029 5011 4993 4975 4957 4984 5011 4976 4942 4930 4919 4969 5018 4967 4916 4803 4690 4802 4914 5025 5137 5081 5025 5030 5035 4932 4829 4869 4910 4970
5338D970O1O1O1m5m5m5m5Q2Q2n4n4r2L1Q9j15j52N2K7K7N7N6nnJ18J18o6o7p4p4j2j3J9J8
$$ 4970 5031 5092 5153 5108 5063 5018 4973 5055 5137 5083 5029 4937 4968 5057 4942 4790 4842 4869 4896 4953 5009 5004 4999 5117 5235 5169 5102 5028 4954 4942 4929 4948 4966
5322D966J8J9jjjjj0j0N2N2j6j5j5j6l0l1l1l1M1M0k1k1R4R4j31j32K6K6J08j5m9J55L2L3
$$ 4966 4984 5003 5002 5001 5000 4999 4989 4979 5031 5083 5067 5052 5037 5021 4991 4960 4929 4898 4939 4979 4958 4937 5031 5125 4994 4862 4888 4914 5022 5007 4958 5113 5145 5178
5304E178n8n8n7n8K7K7j17j16P6P5J38J37p5p5j4j4R3R3j74j73L0L0J12j1j80K4Q6Q6j21j20
$$ 5178 5120 5062 5005 4947 4974 5001 4884 4768 4844 4919 5057 5194 5119 5044 5030 5016 5109 5202 5028 4855 4885 4915 5027 5016 4836 4860 4946 5032 4911 4791
5289D791J05J05J18J17N7N6p3p3P1P0q8q9q8q8m8m7m8m7Q2Q2K0K1nnN6N6RRRRj7j7j6j7n8
$$ 4791 4896 5001 5119 5236 5293 5349 5276 5203 5274 5344 5256 5167 5079 4991 4943 4896 4848 4801 4883 4965 4985 5006 5001 4996 5052 5108 5117 5126 5135 5144 5127 5110 5094 5077 5019
5272E019n9M4M4j0j1p3p2R9R9mlMMn7n7m0m0O3O2M0L9o3o3L7L7k5k5J5J5J5J5KKo0n9PQPP
$$ 5019 4960 5004 5048 5038 5027 4954 4882 4981 5080 5076 5073 5077 5081 5024 4967 4927 4887 4950 5012 5052 5091 5028 4965 5002 5039 5014 4989 5004 5019 5034 5049 5051 5053 4993 4934 4941 4949 4956 4963
5252D963MNk2J84J04j00m2Q1k6k5q0p9k0j9M2M2K5K5p8p7P1P1P1P1K8K9n3O9N1j55j62l9L3
$$ 4963 4967 4972 4950 5134 5238 5138 5096 5177 5151 5126 5046 4967 4947 4928 4970 5012 5037 5062 4984 4907 4978 5049 5120 5191 5219 5248 5195 5264 5315 5160 4998 4959 4992
5236D992L4M0M1o6o7o7o7K2K2Q3Q3k8k8k9k8L6L6L6L6Q8Q7n6n6k8k7P5P5Q1Q0j04k27j72L4
$$ 4992 5026 5066 5107 5041 4974 4907 4840 4862 4884 4967 5050 5022 4994 4965 4937 4973 5009 5045 5081 5169 5256 5200 5144 5116 5089 5164 5239 5320 5400 5296 5069 4897 4931
5219D931Q3m1k2k3J54J54LLn9n9j7j8j20j21J4J4P6P5n0n0R3R3O7O7NOp8p8O5O6j1j2N8o4
$$ 4931 5014 4973 4951 4928 5082 5236 5239 5242 5183 5124 5107 5089 4969 4848 4862 4876 4952 5027 4977 4927 5020 5113 5180 5247 5252 5258 5180 5102 5167 5233 5222 5210 5268 5204
5202E204l2l2l9l9N5N5j2j35k1J03J27J28m5m6J6J6j52j53L3L2POp0N3K46J23j00j00r5K9
$$ 5204 5172 5140 5101 5062 5117 5172 5160 5025 5004 5107 5234 5362 5317 5271 5287 5303 5151 4998 5031 5063 5070 5076 5006 5059 5305 5428 5328 5228 5133 5162
5187E162J72M8ooq3q4N7o7J0J0r0L3l6l6M2M2j9k0p2p2K3K3Q3m1j02K1Q1Q1n4n5RQRRj24j23
$$ 5162 5334 5382 5376 5370 5287 5203 5260 5193 5203 5213 5123 5156 5120 5084 5126 5168 5149 5129 5057 4985 5008 5031 5114 5073 4971 4992 5073 5154 5100 5045 5054 5062 5071 5080 4956 4833
5169D833K5J49K01P9j45j44m0Q4J09J09J19nj53j54k6R6l4l4rrqrL4L3K6K6P2n1n1P1L8L7
$$ 4833 4858 5007 5208 5287 5142 4998 4958 5042 5151 5260 5379 5374 5221 5067 5041 5137 5103 5069 5060 5051 5043 5034 5068 5101 5127 5153 5225 5174 5123 5194 5232 5269
5153E269O5n7l4J71J09j3n6j79r6J08J03k1%%m1m1j43j44J3J2lJ20P2n1K7K6P0P1l2l2p1p0
$$ 5269 5334 5277 5243 5414 5523 5510 5454 5275 5179 5287 5390 5369 5369 5369 5328 5287 5144 5000 5013 5025 5022 5142 5214 5163 5190 5216 5286 5357 5325 5293 5222 5152
5137E152p1p0R2R1L0L0q5q5J7J8M0M1M1M0n9n9KKMLj19Q5N6o6P6P7nno6o6K3K3Q5Q5L5L5o7
$$ 5152 5081 5011 5103 5194 5224 5254 5169 5084 5101 5119 5159 5200 5241 5281 5222 5163 5165 5167 5171 5174 5055 5140 5196 5130 5206 5283 5278 5273 5207 5141 5164 5187 5272 5357 5392 5427 5360
5118E360o8n0m9R4R4l8l7O5O5n9o0n9n9K2K1m0m0M5M4r9r9K4K4K4K4q7q7J5J5QRJ11J11no
$$ 5360 5292 5242 5193 5287 5381 5343 5306 5371 5436 5377 5317 5258 5199 5221 5242 5202 5162 5207 5251 5152 5053 5077 5101 5125 5149 5062 4975 4990 5005 5013 5022 5133 5244 5239 5233
5101E233nok1k2Q1Q0M6M6n6n6Q3Q3K2K2o9p0o9o9P1P1l1l1Q3Q2o0o1j06j05mlM3M3M3M3m6
$$ 5233 5228 5222 5201 5179 5260 5340 5386 5432 5376 5320 5403 5486 5508 5530 5461 5391 5322 5253 5324 5395 5364 5333 5416 5498 5438 5377 5271 5166 5162 5159 5202 5245 5288 5331 5285
5083E285m6m7m6L2L1L2L2q4q3J9J9J9J9Q0Q1o8o9o8o8Q9R0J15r0k18j4J26J25R0R1j2j2l2
$$ 5285 5239 5192 5146 5178 5209 5241 5273 5189 5106 5125 5144 5163 5182 5262 5343 5275 5206 5138 5070 5159 5249 5364 5274 5056 5042 5168 5293 5383 5474 5462 5450 5418
5067E418l3l3l2m6m5J03K26M5p7j%k1k2k1k1l3l2K8K9P9P9k4k4j1j0p2p3o8o8o1o0pJ17k7
$$ 5418 5385 5352 5320 5274 5229 5332 5558 5603 5526 5525 5525 5504 5482 5461 5440 5407 5375 5403 5432 5511 5590 5566 5542 5531 5521 5449 5376 5308 5240 5179 5119 5112 5229 5202
5050E202j50O9O9%%L3L4k8k8p8p8O6O5L5L5L5L5l4l4l5l4Q6Q5j7j7l6l6K5K6l4l3J02J02J6
$$ 5202 5052 5121 5190 5190 5190 5223 5257 5229 5201 5123 5045 5111 5176 5211 5246 5281 5316 5282 5248 5213 5179 5265 5350 5333 5316 5280 5244 5269 5295 5261 5228 5330 5432 5448
5033E448j06m5P8M5M6M6M6Oj17n5O7p1p1L1L1j10k33J1K98J42o3p4p3P2P1P2P1p2p3j1j1J2
$$ 5448 5342 5297 5375 5420 5466 5512 5558 5564 5447 5392 5459 5388 5317 5348 5379 5269 5036 5047 5345 5487 5424 5350 5277 5349 5420 5492 5563 5491 5418 5407 5396 5408
5017E408J1r0r1K4K5n8O5P0j35q1M2k0k1J31J31RRJ7j07k3k3m6P7J49K5q2q2l3l4O9O8k8k9
$$ 5408 5419 5329 5238 5262 5287 5229 5294 5364 5229 5148 5190 5170 5149 5280 5411 5420 5429 5446 5339 5316 5293 5247 5324 5473 5498 5416 5334 5301 5267 5336 5404 5376 5347
5000E347L3L3o0o0M2M3J9K0n0n0J06j6q6L7Rj14l7l7P1P1P1P1p5p5O1O1K7r6OJ29k7k7j9k0
$$ 5347 5380 5413 5353 5293 5335 5378 5397 5417 5367 5317 5423 5407 5321 5358 5367 5253 5216 5179 5250 5321 5392 5463 5388 5313 5374 5435 5462 5366 5372 5501 5474 5447 5428 5408
4983E408q1q1p3p3J1J35O5O5K2K1R8k4j17OL1L2J4J3K2j02m9m9N4N3n3P0O9n3R4R4j6j6p1
$$ 5408 5327 5246 5173 5100 5111 5246 5311 5376 5398 5419 5517 5493 5376 5382 5413 5445 5459 5472 5494 5392 5343 5294 5348 5401 5348 5418 5487 5434 5528 5622 5606 5590 5519
4967E519p1L1L2M8M8K7r5j27P8m5m5j7j6j7j7J40J39j1j2L1r3p7p6j05J9K03Q0j02j01m3Q0
$$ 5519 5448 5479 5511 5559 5607 5634 5539 5412 5490 5445 5400 5383 5367 5350 5333 5473 5612 5601 5589 5620 5527 5450 5374 5269 5288 5491 5571 5469 5368 5325 5405
4951E405J14rl4l5k9l0P3P4j13j13n1n1J20J19o0O3Oj17m0m0K1K1J4J4j8j40q0M4M7M6p6M6
$$ 5405 5519 5510 5476 5441 5412 5382 5455 5529 5416 5303 5252 5201 5321 5440 5380 5443 5449 5332 5292 5252 5273 5294 5308 5322 5304 5164 5084 5128 5175 5221 5145 5191
4935E191P6P6Q4Q3Q5Q5J01k3k08q5N1p2q5q5j13R1J85O1L5q7k0J03p6p6l7l7l7l7J31J31K8
$$ 5191 5267 5343 5427 5510 5595 5680 5781 5758 5550 5465 5516 5444 5359 5274 5161 5252 5437 5498 5533 5446 5426 5529 5453 5377 5340 5303 5266 5229 5360 5491 5519
4919E519K9o3o4J73j15j48N8k3k2J35J2K8K7j03K0J2J2J9J9kj25q9J17J16pJ14j0j60l8RR
$$ 5519 5548 5485 5421 5594 5479 5331 5389 5366 5344 5479 5491 5519 5546 5443 5463 5475 5487 5506 5525 5523 5398 5309 5426 5542 5535 5649 5639 5479 5441 5450 5459
4904E459q6q7M7M6qqk9R3R4l0J0J0o0o0M1M0M0M1M3M4j36j3J8j05m4Q0P4m8K8K9j32j32k9
$$ 5459 5373 5286 5333 5379 5371 5363 5334 5427 5521 5491 5501 5511 5451 5391 5432 5472 5512 5553 5596 5640 5504 5491 5509 5404 5360 5440 5514 5466 5494 5523 5391 5259 5230
4887E230k9J19J20K4K5KJ24L5j70p6M7O8O8J5J5J6J5m9m9N4N4l6l6l6l6NNk8j52qpj6j5O4
$$ 5230 5201 5320 5440 5464 5489 5491 5615 5650 5480 5404 5451 5519 5587 5602 5617 5633 5648 5599 5550 5604 5658 5622 5586 5550 5514 5519 5524 5496 5344 5336 5329 5313 5298 5362
4870E362O4lj26L5J57M7p5k1k1L3L3j23j24J03J02N3N2j6j6R1l2o5o5J32J32K9r4n3J52Q3
$$ 5362 5426 5423 5297 5332 5489 5536 5461 5440 5419 5452 5485 5362 5238 5341 5443 5496 5548 5532 5516 5607 5575 5510 5445 5577 5709 5738 5644 5591 5743 5826
4855E826j22p5p5k7k7r5r6Q9Q8N6N6ool3l3P0P0j2j2j2j2r0r0k3R9J37J5r4r3L1L1L1L1k8
$$ 5826 5704 5629 5554 5527 5500 5405 5309 5398 5486 5542 5598 5592 5586 5553 5520 5590 5660 5648 5636 5624 5612 5522 5432 5409 5508 5645 5660 5566 5473 5504 5535 5566 5597 5569
4838E569k8L3L3m7m8m0m0n8O5P2n1P6K00M8p5k0j9k7k7j08j07P6P7l5l4O8O7o6o7o7o6n3n3
$$ 5569 5541 5574 5607 5560 5512 5472 5432 5374 5439 5511 5460 5536 5736 5784 5709 5689 5670 5643 5616 5508 5401 5477 5554 5519 5485 5553 5620 5554 5487 5420 5354 5301 5248
4822E248R1R1J23J23J36p0j51j51K1K0k0k0M1M1l8l8O5O5M7M7n6n6OON5N4J42o3j20Mm8m8
$$ 5248 5339 5430 5553 5676 5812 5742 5591 5440 5461 5481 5461 5441 5482 5523 5485 5447 5512 5577 5624 5671 5615 5559 5565 5571 5626 5680 5822 5759 5639 5643 5595 5547
4806E547K1K1K0K0K0K0m0m0K1K2j29j29J38J38p8p8j7J07J57m7j78n5J1J1P9Q0j9j9j8j9L6
$$ 5547 5568 5589 5609 5629 5649 5669 5629 5589 5610 5632 5503 5374 5512 5650 5572 5494 5477 5584 5741 5694 5516 5461 5472 5483 5562 5642 5623 5604 5586 5567 5603
4790E603L6o6o6m1m1m0m1N9N8J20J20j2j1j2j2j6j5j5j6l5l4l5l4l0k9P4P3J5J6J6J5K5K4
$$ 5603 5639 5573 5507 5466 5425 5385 5344 5403 5461 5581 5701 5689 5678 5666 5654 5638 5623 5608 5592 5557 5523 5488 5454 5424 5395 5469 5542 5557 5573 5589 5604 5629 5653
4773E653K4K5j17j17O8O8J32J31m5m6p4M8J02j03j09J3j4j5k6j49n2J53R7R6p6p5m0l9O3O3
$$ 5653 5677 5702 5585 5468 5536 5604 5736 5867 5822 5776 5702 5750 5852 5749 5640 5653 5639 5624 5598 5449 5397 5550 5647 5743 5667 5592 5552 5513 5576 5639
4758E639L8L9k3k3k4k4j7j6m0Q4O8O8M2q2k8R5qj32p0N3M6p6%%LLn9n8Q5Q5J0j12n4n3o1o2
$$ 5639 5677 5716 5693 5670 5646 5622 5605 5589 5549 5633 5701 5769 5811 5729 5701 5796 5788 5656 5586 5639 5685 5609 5609 5609 5612 5615 5556 5498 5583 5668 5678 5566 5512 5459 5398 5336
4740E336Q5Q5J54L1lmN1N0r5r4QQJ5J4j57l4p0p1J30J30n3P1J6j06r7K7J35J34j3j3M9M8m6
$$ 5336 5421 5506 5660 5691 5688 5684 5735 5785 5690 5596 5604 5612 5627 5641 5484 5450 5380 5309 5439 5569 5516 5587 5603 5497 5400 5427 5562 5696 5683 5670 5719 5767 5721
4724E721m6k1J03J11j1l7l7l8l8J00k3o6N7j9k0l6l7k1j44o5N8R6K19l1l0k3k3N1N1j0j0j07
$$ 5721 5675 5654 5757 5868 5857 5820 5783 5745 5707 5807 5784 5718 5775 5756 5736 5700 5663 5642 5498 5433 5491 5587 5806 5775 5745 5722 5699 5750 5801 5791 5781 5674
4708E674j06mlM0M0J02J02R7R7j21j21n1P2J34J1j7j7k5k5k6k6k6k6P2P1l9l8j8j40p9M4l0
$$ 5674 5568 5564 5561 5601 5641 5743 5845 5942 6039 5918 5797 5746 5818 5952 5963 5946 5929 5904 5879 5853 5827 5801 5775 5847 5918 5879 5841 5823 5683 5604 5648 5618
4692E618k9N6o8j15PL3L3M5M6M6M5l3l4r5r5P6P7M3q0N2N2M5M5l6l7R5k8o9p0klq4J20J29
$$ 5618 5589 5645 5577 5462 5469 5502 5535 5580 5626 5672 5717 5684 5650 5555 5460 5536 5613 5656 5576 5628 5680 5725 5770 5734 5697 5792 5764 5695 5625 5623 5620 5536 5656 5785
4675E785p7l7Q6Q6l7j63M1J31QkkkkJ0J32L0r3k1k1r0r0J18J19o6o6k6k7k7k7n9n8M3M4p1
$$ 5785 5708 5671 5757 5843 5806 5643 5684 5815 5823 5821 5819 5817 5815 5825 5957 5987 5894 5873 5852 5762 5672 5790 5909 5843 5777 5751 5724 5697 5670 5611 5553 5596 5640 5569
4657E569p1J14J13j6j6P9P9M3q1q0M2J8J8o9o9k3R9Q4Q4J02k1j28j29j12J0L6L6L2r1r8K5
$$ 5569 5498 5612 5725 5709 5693 5772 5851 5894 5813 5733 5775 5793 5811 5742 5673 5650 5749 5833 5917 6019 5998 5870 5741 5629 5639 5675 5711 5743 5652 5554 5579
4642E579J11j1o5N8Q7Q7P0n4o9N4j5j38P5P4ONp0o9L3L3j25j24K6K7o6N7O5n9K8J50Q2m2r4
$$ 5579 5690 5679 5614 5672 5759 5846 5916 5862 5793 5847 5832 5694 5769 5843 5849 5854 5784 5715 5748 5781 5656 5532 5558 5585 5519 5576 5641 5582 5610 5760 5842 5800 5706
4625E706r3JJL1L0J00k3k9k9O5O6L4L5M3q1j3j4r8K5K5r8k1k1M5M5J07J07L8L8o5o5l6l7l7
$$ 5706 5613 5614 5615 5646 5676 5776 5753 5724 5695 5760 5826 5860 5895 5938 5857 5844 5830 5732 5757 5782 5684 5663 5642 5687 5732 5839 5946 5984 6022 5957 5892 5856 5819 5782
4608E782l6R5R5m8m8o7o8K8K7J03k0n3n3J9K0n7O5J10j4RRr2L0l1l1m7P5O8O7O1O1q2q2l9
$$ 5782 5746 5841 5936 5888 5840 5773 5705 5733 5760 5863 5843 5790 5737 5756 5776 5719 5784 5894 5880 5889 5898 5806 5836 5805 5774 5727 5802 5870 5937 5998 6059 5977 5895 5856
4591E856l9L0L1K7J51k1k1l5l5l5l5J13J12p3p2O6O6NMm3m4j12J0LKLLJ17oj09J5l7l7M0q3
$$ 5856 5817 5847 5878 5905 6056 6035 6014 5979 5944 5909 5874 5987 6099 6026 5954 6020 6086 6091 6095 6052 6008 5896 5906 5909 5911 5914 5917 6034 6028 5919 5934 5897 5860 5900 5817
4574E817p6p7J9J8n7n7J19J20J51K9nnl5l6rJ13J40J7rj31j37O8PPm5m5J7J6OPO0O0K5r8l6
$$ 5817 5741 5664 5683 5701 5644 5587 5706 5826 5977 6006 6001 5996 5961 5925 5916 6029 6169 6186 6177 6046 5909 5977 5984 5991 5946 5901 5918 5934 5940 5947 6007 6067 6092 5994 5958
4556E958Q7M8M8L0r2j21KO9n4j18Q7R4k8q3q4J2J2N6N6N7N6q5q6o0O4k2j44L5L5L1L2L2L2
$$ 5958 6045 6093 6141 6171 6079 5958 5960 6029 5975 5857 5944 6038 6010 5927 5843 5855 5867 5923 5979 6036 6092 6007 5921 5861 5925 5903 5759 5794 5829 5860 5892 5924 5956
4539E956M4M5M4M5m5m6j9J03nj29n1n2Q0Q0P9Q0JKo0o0J8J7J0J0L0r2j47N9O1o2p5p4p8M6
$$ 5956 6000 6045 6089 6134 6089 6043 6024 6127 6122 5993 5942 5890 5970 6050 6129 6209 6210 6212 6152 6092 6110 6127 6137 6147 6177 6085 5938 5997 6058 5996 5921 5847 5769 5815
4522E815L8L8kjNOm5P8J24q2llp7p7j1j1J33J33J0J1Q0m2l1l0l7l8j7j7J62M0j52k8P4m9q6
$$ 5815 5853 5891 5889 5888 5893 5899 5854 5932 6056 5974 5971 5968 5891 5814 5803 5792 5925 6058 6068 6079 6159 6117 6086 6056 6019 5981 5964 5947 6109 6149 5997 5969 6043 5994 5908
4505E908L8K2K2K5K5n2P1M3q1p2N0L8L8n8n7P2P1p2p2mmnmL9L9n6n6JJ25m7m7J9K0L5q8k3
$$ 5908 5946 5968 5990 6015 6040 5988 6059 6102 6021 5949 5999 6037 6075 6017 5960 6032 6103 6031 5959 5955 5951 5946 5942 5981 6020 5964 5908 5909 6034 5987 5940 5959 5979 6014 5926 5903
4487E903J00Q5Q5M2M1L4L4K8r6j16j16r6J09o8o8mlN7N8jkR4R3N8o5mmM1q1q2M1M7M6P0n4
$$ 5903 6003 6088 6173 6215 6256 6290 6324 6352 6256 6140 6024 5928 6037 5969 5901 5897 5894 5951 6009 6008 6006 6100 6193 6251 6186 6182 6178 6219 6138 6056 6097 6144 6190 6260 6206
4469F206j57l4J9j03m7m7J29J30R2R1L0j75k9R5j4j36m7P7J03J02j00j00M4q0j74L1N1N1K8
$$ 6206 6049 6015 6034 5931 5884 5837 5966 6096 6188 6279 6309 6134 6105 6200 6186 6050 6003 6080 6183 6285 6185 6085 6129 6049 5875 5906 5957 6008 6036
4455F036K8l3l3l6l5O7O8q7q6k5k5J35J35L2L3QQJ6j07rqj7j6O3O3O3O3L3L3j10j10m5m5m5
$$ 6036 6064 6031 5998 5962 5927 5994 6062 5975 5889 5864 5839 5974 6109 6141 6174 6182 6190 6206 6099 6090 6082 6065 6049 6112 6175 6238 6301 6334 6367 6257 6147 6102 6057 6012
4438F012m5L0L0L0L0K8K7l4l4O6O6M1q3l0R3J45o1j84K1J1k77o8K18J00J00RQQQp8p7q6L8
$$ 6012 5967 5997 6027 6057 6087 6115 6142 6108 6074 6140 6206 6247 6164 6134 6227 6372 6311 6127 6148 6159 5882 5814 6032 6132 6232 6241 6249 6257 6265 6187 6110 6024 6062
4421F062Q9Q8M1j65j43O2nnKKRJ0RJ33KJM8M8M8M8j22j23k0k0N2N2J06J06p1j94J9J9M6M7
$$ 6062 6151 6239 6280 6115 5972 6034 6029 6024 6026 6028 6037 6047 6056 6189 6191 6192 6240 6288 6336 6384 6262 6139 6119 6099 6151 6203 6309 6415 6344 6150 6169 6188 6234 6281
4404F281j6j5l3l3O9P0o2o1j10j10q0J26P9m3ooj4j4L3L2l7l7J09j5p7M7R0R0l2R0L5L4j9
$$ 6281 6265 6250 6217 6184 6253 6323 6261 6200 6090 5980 5900 6026 6105 6062 6056 6050 6036 6022 6055 6087 6050 6013 6122 6107 6030 6077 6167 6257 6225 6315 6350 6384 6365
4387F365j9M7M6j5j5p2p1p2p1P3P4Pj17q7L6K0K0j1j0N1N1r1r2N3N2M4M5j7j7m5m6J6J6J1
$$ 6365 6346 6393 6439 6424 6409 6337 6266 6194 6123 6196 6270 6277 6160 6073 6109 6129 6149 6138 6128 6179 6230 6139 6047 6100 6152 6196 6241 6224 6207 6162 6116 6132 6148 6159
4370F159J1LJ27J03J04p3p3m8m8J4J4N0N1j35j34qpR5R5l0k9k9l0j7j8M4M3M8M7J10J09j01
$$ 6159 6170 6173 6300 6403 6507 6434 6361 6313 6265 6279 6293 6343 6394 6259 6125 6117 6110 6205 6300 6270 6241 6212 6182 6165 6147 6191 6234 6282 6329 6439 6548 6447
4354F447j02M3M2j28j28J5J5O7O6l6l6J03J02%j23l7J67J06j6J6j06j2J11j0j1j00l05r9J07
$$ 6447 6345 6388 6430 6302 6174 6189 6204 6271 6337 6301 6265 6368 6470 6470 6347 6310 6477 6583 6567 6583 6477 6465 6576 6566 6555 6455 6150 6051 6158
4340F158Q1Q0j4j4Q9Q8n0n0N2N2j02j03Q1Q2n0n0n0n0n5n5J29J30k0j9k0k0R6R6P5j30j35
$$ 6158 6239 6319 6305 6291 6380 6468 6418 6368 6420 6472 6370 6267 6348 6430 6380 6330 6280 6230 6175 6120 6249 6379 6359 6340 6320 6300 6396 6492 6567 6437 6302
4324F302j2r4r4k3k3J20J20J3J3P5P5p3p2j1j1n2n2n2n2J8J9Q0Q0m2m1K0K0J9J9J8J9m8m7
$$ 6302 6290 6196 6102 6079 6056 6176 6296 6309 6322 6397 6472 6399 6327 6316 6305 6253 6201 6149 6097 6115 6134 6214 6294 6252 6211 6231 6251 6270 6289 6307 6326 6278 6231
4308F231J3J4l3l2P8P7n6O6q4L8J96rj04j04nJ18k1k1P6m8m0l9L7L8m5P9P6j29j37j4QQJ5
$$ 6231 6244 6258 6225 6193 6271 6348 6292 6358 6274 6312 6508 6499 6395 6291 6286 6404 6383 6362 6438 6390 6350 6311 6348 6386 6341 6420 6496 6367 6230 6216 6224 6232 6247
4291F247J5M7M6qqp1N2N2p1ppM0L9O0o2p0N3Q3l9L8L7m3m3K4J46Q4l9N3p0j36j3J2J3L0L0
$$ 6247 6262 6309 6355 6347 6339 6268 6320 6372 6301 6294 6287 6327 6366 6426 6364 6294 6347 6430 6391 6429 6466 6423 6380 6404 6550 6634 6595 6648 6578 6442 6429 6441 6454 6484 6514
4273F514o4o4j25kJ55J54RQK4r9j45k2l2R1J11j1l0k9n6O8j04j04N2N2N2N3mlj1j2J7j06L3
$$ 6514 6450 6386 6261 6259 6414 6568 6577 6585 6609 6510 6365 6343 6311 6402 6513 6502 6472 6443 6387 6455 6351 6247 6299 6351 6403 6456 6452 6449 6438 6426 6443 6337 6370
4257F370L2j00K2R0Q9J20lp0p0j32j0K4K4J0J0RJ0p1p2P2P1J7J7K9j75MNJ8J40mj27R3R3m8
$$ 6370 6402 6302 6324 6414 6503 6623 6620 6550 6480 6348 6338 6362 6386 6396 6406 6415 6425 6354 6282 6354 6425 6442 6459 6488 6313 6317 6322 6340 6480 6476 6349 6442 6535 6487
4240F487m9m9m8R8R9M5M4j23%J03k1jjrrr5r5l3l3j1j1j1j2M8M8M8M8l6l7n2P1J77N3n5n4
$$ 6487 6438 6389 6341 6439 6538 6583 6627 6504 6504 6607 6586 6585 6584 6575 6566 6471 6376 6343 6310 6299 6288 6277 6265 6313 6361 6409 6457 6421 6384 6332 6403 6580 6633 6578 6524
4222F524q1q2O3O2klp1N2rrj%m8m8m7m8Q4Q4K3K3l3l2l3l3R3R3R3R3p9p9J05J05n3n4Q3Q2
$$ 6524 6443 6361 6424 6486 6484 6481 6410 6462 6453 6444 6443 6443 6395 6347 6300 6252 6336 6420 6443 6466 6433 6401 6368 6335 6428 6521 6614 6707 6628 6549 6654 6759 6706 6652 6735 6817
4204F817m4j66j67m3J11J11k4k4j7j7M4M5%JRRl0R4R3k9j17j17rJ14pqJ37J36m8j70r3r3q8
$$ 6817 6773 6607 6440 6397 6508 6619 6595 6571 6554 6537 6581 6626 6626 6627 6636 6645 6615 6709 6802 6773 6656 6539 6530 6644 6637 6629 6766 6902 6854 6684 6591 6498 6410
4188F410L6O1O1Q6l8K4J47n8n7J34J2k01LJ7J7Lj19o5N7J43J9p6M8j8j8R2R3j18j18K6K6p5
$$ 6410 6446 6507 6568 6654 6616 6640 6787 6729 6672 6806 6818 6617 6620 6637 6654 6657 6538 6473 6530 6673 6692 6616 6664 6646 6628 6720 6813 6695 6577 6603 6629 6554
4172F554p4J10J10N4N3m9m8J2J3m9m9p7p7m4Q0J16J16R8k5j13J0o7o7p0p1L3L2J18J19o7o6
$$ 6554 6480 6590 6700 6754 6807 6758 6710 6722 6735 6686 6637 6560 6483 6439 6519 6635 6751 6849 6824 6711 6721 6654 6587 6517 6446 6479 6511 6629 6748 6681 6615
4156F615j5j5M7M6J05J06l8l8o5o5O6O6O0j44q3J22q2q3L3L3ppppm3m3J00K23R6j08J4J5n4
$$ 6615 6600 6585 6632 6678 6783 6889 6851 6813 6748 6683 6749 6815 6875 6731 6648 6770 6688 6605 6638 6671 6664 6657 6650 6643 6600 6557 6657 6880 6976 6868 6882 6897 6843
4139F843n4K3j00j71m9N9N9Q0Q1J9J9m3m4m4m3R7R7q8q7N4N5ppm3m3K6K6o2O1j6j7J18oj08
$$ 6843 6789 6812 6712 6541 6492 6551 6610 6690 6771 6790 6809 6766 6722 6678 6635 6732 6829 6741 6654 6708 6763 6756 6749 6706 6663 6689 6715 6653 6714 6698 6681 6799 6793 6685
4122F685J5j6j6o9p0N6N5M8M9M2q0j1j0J33J33k3j46q7q7n4O9K7J49J57L4p8p9j55l3J50J49
$$ 6685 6700 6684 6668 6599 6529 6585 6640 6688 6737 6779 6699 6688 6678 6811 6944 6921 6775 6688 6601 6547 6616 6643 6792 6949 6983 6905 6826 6671 6638 6788 6937
4107F937Rj15n7O7R1R2j08j08m7m7K0K0m2m1J22J23J2J2O0o4p1N2J8j04l6Q7M4M4N2N1K1K1
$$ 6937 6946 6831 6774 6841 6932 7024 6916 6808 6761 6714 6734 6754 6712 6671 6793 6916 6928 6940 7000 6936 6865 6917 6935 6831 6795 6882 6926 6970 7022 7073 7094 7115
4091G115j23j23m2m2j6J07J24Kk3k4k8k7k8k8j14j15j2j2P1P1J48K5r3L1L0r2r2L0J33J0j34
$$ 7115 6992 6869 6827 6785 6769 6876 7000 7002 6979 6955 6927 6900 6872 6844 6730 6615 6603 6591 6662 6733 6881 6906 6813 6844 6874 6782 6690 6720 6853 6863 6729
4075F729j2R6R6K5K6K5K6p8p9q5L7k5k4L7L7Q0m3K6K6n1n1J6J38k9j52p5p5N8N8j9J04J22
$$ 6729 6717 6813 6909 6934 6960 6985 7011 6933 6854 6769 6806 6781 6757 6794 6831 6911 6868 6894 6920 6869 6818 6834 6972 6943 6791 6716 6641 6699 6757 6738 6842 6964
4059F964jJ4J4j9j9j9j9j5j5Q8Q7k6k6j29j29J01J01jkj19j19J06J07L9M0R4R4jj24k01M5
$$ 6964 6963 6977 6991 6972 6953 6934 6915 6900 6885 6973 7060 7034 7008 6879 6750 6851 6952 6951 6949 6830 6711 6817 6924 6963 7003 7097 7191 7190 7066 6865 6910
4044F910J06j7O8O8L8L8j87j87K5K5K5K5OPPPk5k6q7q6N5N5ooq1q0K2K2J0J1J0J1RJ0P1P1
$$ 6910 7016 6999 7067 7135 7173 7211 7024 6837 6862 6887 6912 6937 6943 6950 6957 6964 6939 6913 6826 6740 6795 6850 6844 6838 6757 6677 6699 6721 6731 6742 6752 6763 6772 6782 6853 6924
4026F924N0N1l4Q9N9j86p6J70oor3r2J00R9kln8n9n9n9K2K1K2K1rrN2N3q3q3k2k2K1K1Q2Q2
$$ 6924 6974 7025 6991 7080 7139 6953 6877 7047 7041 7035 6942 6850 6950 7049 7047 7044 6986 6927 6868 6809 6831 6852 6874 6895 6886 6877 6929 6982 6899 6816 6794 6772 6793 6814 6896 6978
4007F978poppK2K1K2K1p1p2P2P1M9M9n4n4J1J2J1J1o3o3J21J21o9p0j55l1K44kq1q2q4q4J00
$$ 6978 6971 6965 6958 6951 6973 6994 7016 7037 6966 6894 6966 7037 7086 7135 7081 7027 7038 7050 7061 7072 7009 6946 7067 7188 7119 7049 6894 6863 7107 7105 7024 6942 6858 6774 6874
3990F874J00O3O3O3O3mmj07j07rrkkj03J9J2J2M8M7M8M8J58J57O1j44j97Pj7j8P4P4Q1m1J2
$$ 6874 6974 7037 7100 7163 7226 7222 7218 7111 7004 6995 6986 6984 6982 6879 6898 6910 6922 6970 7017 7065 7113 7271 7428 7489 7345 7148 7155 7138 7120 7194 7268 7349 7308 7320
3973G320J2j05j06L4q9l5Q8K4r9k3k2%%%%J03J04JKm0m0m0m0q0q1k5J81J17q7M0M0O6O7j6
$$ 7320 7332 7227 7121 7155 7066 7031 7119 7143 7044 7021 6999 6999 6999 6999 6999 7102 7206 7207 7209 7169 7129 7089 7049 6969 6888 6863 7044 7161 7074 7114 7154 7220 7287 7271
3956G271J07P9j25j7J05m5j69j00K4k6k6N9o5r8K4QRJ6J6m5m5N7N7nmJ30J30K8K7j14j15m
$$ 7271 7378 7457 7332 7315 7420 7375 7206 7106 7130 7104 7078 7137 7072 6974 6998 7006 7015 7031 7047 7002 6957 7014 7071 7066 7062 7192 7322 7350 7377 7263 7148 7144
3940G144nk9R4R5k9qrj6j6mnN7N6O1O1p6p5r5K7K0J9L6L7j77n3K4K5J09j4j01K2Q8l4j32P3
$$ 7144 7139 7110 7204 7299 7270 7262 7253 7237 7221 7217 7212 7269 7325 7386 7447 7371 7296 7201 7228 7248 7267 7303 7340 7163 7110 7134 7159 7268 7254 7153 7175 7263 7229 7097 7170
3922G170J9j03k2k2lJ19J50K7k4J81P7j28j43j44J7J6j15RL3L3M0M1J04J04l9m0k9k9k1k2
$$ 7170 7189 7086 7064 7042 7039 7158 7308 7335 7311 7492 7569 7441 7298 7154 7171 7187 7072 7081 7114 7147 7187 7228 7332 7436 7397 7357 7328 7299 7278 7256
3907G256p3M9Q3Q2r8r8Q7Q6r7r7M6M6j9k0k7k7N0p4N7N7p0p0J51K7p2N1L5L5O5O5j20j19o
$$ 7256 7183 7232 7315 7397 7299 7201 7288 7374 7277 7180 7226 7272 7253 7233 7206 7179 7229 7155 7212 7269 7199 7129 7280 7307 7235 7286 7321 7356 7421 7486 7366 7247 7241
3890G241nnoj6j7l3R1J11j2p9p9N5N4M0J62M8p4n9n9L9L8M6M7q9L4M2q1m7P5rj0N7o6o6N6
$$ 7241 7236 7231 7225 7209 7192 7159 7250 7361 7349 7270 7191 7246 7300 7340 7502 7550 7476 7417 7358 7397 7435 7481 7528 7439 7473 7515 7434 7387 7462 7453 7443 7500 7434 7368 7424
3873G424N4N5J28p6j40O5m7j71q9L3j8J05Q5l8M6M6r4K8K1K1%JJ%N3N4r1L3L3j72j6J07L3
$$ 7424 7478 7533 7661 7585 7445 7510 7463 7292 7203 7236 7218 7323 7408 7370 7416 7462 7368 7396 7417 7438 7438 7439 7440 7440 7493 7547 7456 7489 7522 7350 7334 7441 7474
3856G474L3N6o7j1J13M3q0m0m0m8m8p0p0P3P3l3l3K8K9R9J00lljkkjK7K7l4l4N7N6j27j28
$$ 7474 7507 7563 7496 7485 7598 7641 7561 7521 7481 7433 7385 7315 7245 7318 7391 7358 7325 7353 7382 7481 7581 7578 7575 7574 7572 7570 7569 7596 7623 7589 7555 7612 7668 7541 7413
3839G413o8o9kJ22J17no7N5N1p3MMJ7J7J6J7j17j18J03k0L6J59N0p4J6J7RRjkjjj6j7p7p8
$$ 7413 7345 7276 7274 7396 7513 7508 7441 7496 7547 7474 7478 7482 7499 7516 7532 7549 7432 7314 7417 7397 7433 7592 7642 7568 7584 7601 7610 7619 7618 7616 7615 7614 7598 7581 7504 7426
3821G426N4N4q9r0R3R4P7j27j68L7R3R3n6n7M6M6opopN2N1n8n8K7r6oJ99R6k8q9q9NMNMl9
$$ 7426 7480 7534 7445 7355 7448 7542 7619 7492 7324 7361 7454 7547 7491 7434 7480 7526 7520 7513 7507 7500 7552 7603 7545 7487 7514 7418 7412 7611 7707 7679 7590 7501 7506 7510 7515 7519 7480
3802G480m0J46J45L3L4k8k8K0K1q3q2m0m0O3O2n0n0m3m2J4J37O0O0J06j6r0r0J4J5K2K2q3
$$ 7480 7440 7586 7731 7764 7798 7770 7742 7762 7783 7700 7618 7578 7538 7601 7663 7613 7563 7520 7478 7492 7629 7689 7749 7855 7839 7749 7659 7673 7688 7710 7732 7649
3786G649M0P3P3m1m1K8r5lkj0j0JKJ65M2j2j35j42k0n8n8J9J8p6M6N4o8J5J39P7m5j2J12J04
$$ 7649 7689 7762 7835 7794 7753 7781 7686 7683 7681 7671 7661 7662 7664 7829 7871 7859 7724 7582 7562 7504 7446 7465 7483 7407 7453 7507 7439 7454 7593 7670 7625 7613 7725 7829
3769G829j9n3n3M1M1l0l0J42J9L5L6l4l4p1p1o4o3K6J49K6K6m0Q3R0l2p1N2J06j8p7p8q5q6
$$ 7829 7810 7757 7704 7745 7786 7756 7726 7868 7887 7922 7958 7924 7890 7819 7748 7684 7621 7647 7796 7822 7848 7808 7891 7981 7949 7878 7930 8036 8018 7941 7863 7778 7692
3752G692ONOOj0rkjP1J94J38o7l3l4m6m7o8o8L4L4J%o1o1J13J13p1p1O4O5l0l1K4J46RQK8
$$ 7692 7698 7703 7709 7715 7705 7696 7694 7693 7764 7958 8096 8029 7996 7962 7916 7869 7801 7733 7767 7801 7802 7802 7741 7680 7793 7906 7835 7764 7828 7893 7863 7832 7856 8002 8011 8019 8047
3734H047r4p9p9j41j8QQJ94P0p9p8J6J39mj27n9n8M1J64L1r2J0J33R3k9j25kkjO7O7j15j15
$$ 8047 7953 7874 7795 7654 7636 7644 7652 7846 7916 7837 7759 7775 7914 7910 7783 7724 7666 7707 7871 7902 7810 7820 7953 8046 8017 7892 7890 7888 7887 7954 8021 7906 7791
3717G791%J23J5J4K2K2N6N6L5q8q9J17J23Jn6n6j1j0J16qj10J3K9L0l2l2L1r2j92R4J14rj7
$$ 7791 7791 7914 7929 7943 7965 7987 8043 8099 8134 8046 7957 8074 8197 8198 8142 8086 8075 8065 8181 8173 8063 8076 8105 8135 8103 8071 8102 8010 7818 7912 8026 8017 8000
3701H000j7j7J06L7L7o3o4kkK9L0p2p3O5O5l7l7kjkjP5P6P5P5m6m6J5J5m4m4m4m4r9j00m2
$$ 8000 7983 7966 8072 8109 8146 8083 8019 8017 8015 8044 8074 8002 7929 7994 8059 8022 7985 7983 7982 7980 7979 8054 8130 8205 8280 8234 8188 8203 8218 8174 8130 8086 8042 7943 7843 7801
3683G801J62N0j55m0J66M6M6N9N9j07j07M4M4j4J10J01j03j32rN2p1p3J32J16j70r2L2N2J75
$$ 7801 7963 8013 7858 7818 7984 8030 8076 8135 8194 8087 7980 8024 8068 8054 8164 8265 8162 8030 8021 8073 8002 7929 8061 8177 8007 7915 7947 7999 8174
3668H174J28Oj01j02OPn5n5L1L1J00k3K4K5q6q6J2J1J2J1p1p2j0j0P6P7J6J5n1n2n1n2J32
$$ 8174 8302 8308 8207 8105 8111 8118 8063 8008 8039 8070 8170 8147 8171 8196 8110 8024 8036 8047 8059 8070 7999 7927 7917 7907 7983 8060 8076 8091 8040 7988 7937 7885 8017
3652H017J31P1P0K3K2Q5Q4L5L6o7o7j65j65k2k2P7P7k6k5L3L3L4L3K4K5p9p8J1J1J13J13r9
$$ 8017 8148 8219 8289 8312 8334 8419 8503 8538 8574 8507 8440 8275 8110 8088 8066 8143 8220 8194 8169 8202 8235 8269 8302 8326 8351 8272 8194 8205 8216 8329 8442 8343
3636H343j00l8l8N4N4m9m9L8L9R9J00j84j85M1M2J28J28j5j5N1N1r2r2J6J5J6J5K6K7K6K7
$$ 8343 8243 8205 8167 8221 8275 8226 8177 8215 8254 8353 8453 8269 8084 8125 8167 8295 8423 8408 8393 8444 8495 8403 8311 8327 8342 8358 8373 8399 8426 8452 8479
3620H479o1o1r7J50M5M6P1j75m2K03M9N0j15j14K9K9m0m0K2K1m9n0J04j42n3J92k3k2%%O2
$$ 8479 8418 8357 8260 8410 8455 8501 8572 8397 8355 8558 8607 8657 8542 8428 8457 8486 8446 8406 8428 8449 8400 8350 8454 8312 8259 8451 8428 8406 8406 8406 8468
3604H468O2k9k9l0k9O2O2J23J24j24j24K7K7m9P4o4o4R3l0k9R3l9l9j34j35L2L1J6J38Q0m3
$$ 8468 8530 8501 8472 8442 8413 8475 8537 8660 8784 8660 8536 8563 8590 8541 8615 8551 8487 8580 8550 8521 8614 8575 8536 8402 8267 8299 8330 8346 8484 8564 8521
3589H521k9k8r3r3N7N8k1J03J02k1J9J9J2J1L3L4m4Q0J03k1nnO1O0j23j24o9o9P5P5j0j1j0
$$ 8521 8492 8464 8371 8278 8335 8393 8372 8475 8577 8556 8575 8594 8606 8617 8650 8684 8640 8720 8823 8802 8797 8792 8853 8913 8790 8666 8597 8528 8603 8678 8668 8657 8647
3572H647j0J01J01n0n0P4m8j11J3NNJ44K0r6r7l0R3O8O9P6P7n1n2j53j54nnR7R8k9k9k9k9
$$ 8647 8637 8738 8839 8789 8739 8813 8765 8654 8667 8672 8677 8821 8841 8745 8648 8618 8711 8779 8848 8924 9001 8950 8898 8745 8591 8586 8581 8678 8776 8747 8718 8689 8660
3556H660j5j5M6M7K1K2m0m0p3p4m7P5Q6l7L2J55M8M9nnK8K9K9K9o5o5NMj8J04O6k21j46N8
$$ 8660 8645 8630 8676 8723 8744 8766 8726 8686 8613 8539 8492 8567 8653 8616 8648 8803 8851 8900 8895 8890 8918 8947 8976 9005 8940 8875 8880 8884 8866 8970 9036 8815 8669 8727
3539H727J10J10nnM8M9p3j96J7J7K1K2K1K1J8J7j26j26l6l5K5K6J00J00J00J00K6K5K5K5r
$$ 8727 8837 8947 8942 8937 8985 9034 8961 8765 8782 8799 8820 8842 8863 8884 8902 8919 8793 8667 8631 8596 8621 8647 8747 8847 8947 9047 9073 9098 9123 9148 9139
3523I139j0rj0N8N8q5q5K1K1m1m0P4P4p0o9q2q3K8K8J4J37Q9j17o5N8k5k4O9O8O9O8noj49
$$ 9139 9129 9120 9110 9168 9226 9141 9056 9077 9098 9057 9017 9091 9165 9095 9026 8944 8861 8889 8917 8931 9068 9157 9040 8975 9033 9008 8984 9053 9121 9190 9258 9253 9247 9098
3506I098k7J60m5o6o6l0l0P2P2pqN4N4R4R3r1r1k5k4k5k5m4m4N8N8O1O0m2m3n1n1N1N2J%J
$$ 9098 9071 9231 9186 9120 9054 9024 8994 9066 9138 9131 9123 9177 9231 9325 9418 9327 9236 9211 9187 9162 9137 9093 9049 9107 9165 9226 9286 9244 9201 9150 9099 9150 9202 9203 9203 9204
3488I204Jj9j8j9j8OOOON6N6noK2K1K2K1L9M0o3o3j5j5j5j5J6J6J6J6O6O7p7p6O5O6l7l7N
$$ 9204 9205 9186 9168 9149 9131 9137 9143 9149 9155 9211 9267 9262 9256 9278 9299 9321 9342 9381 9421 9358 9295 9280 9265 9250 9235 9251 9267 9283 9299 9365 9432 9355 9279 9344 9410 9373 9336 9341
3469I341OJ44K0q6L6m1m0rj0jkk8R5Q6Q7m2m2m2m2p3p2j2j1M4M4M4M4L7L6L7L6k8k8L4L3o1
$$ 9341 9347 9491 9511 9425 9461 9420 9380 9371 9361 9360 9358 9330 9425 9511 9598 9556 9514 9472 9430 9357 9285 9273 9262 9306 9350 9394 9438 9475 9511 9548 9584 9556 9528 9562 9595 9534
3451I534o1qpK5r8r8K5J55J55J29Nr5r6m2m2QQQQJ1J1P2P2j5j5j5j5j4j4M8M7J1J1P2P2p6
$$ 9534 9473 9465 9458 9483 9385 9287 9312 9467 9622 9751 9756 9661 9565 9523 9481 9489 9497 9505 9513 9524 9535 9607 9679 9664 9649 9634 9619 9605 9591 9639 9686 9697 9708 9780 9852 9776
3433I776p6K6K7j2j2mmj10J4J4j09onj37O9J89O5L9q3p4M8K6K6O2o0P0P0K6K5L3L4k3J00N
$$ 9776 9700 9726 9753 9741 9729 9725 9721 9611 9625 9639 9530 9524 9519 9382 9451 9640 9705 9744 9661 9587 9635 9661 9687 9749 9689 9759 9829 9855 9880 9913 9947 9924 10024 10029
3416A0029j18p5M7M8p6m1Q1rqO9j35q9L4L7L7R8R8J3j10m9P4m3m4K6K6O8O8l5l4m5m6m5m5
$$ 10029 9911 9836 9883 9931 9855 9814 9895 9886 9878 9947 9812 9723 9757 9794 9831 9929 10027 10040 9930 9881 9955 9912 9868 9894 9920 9988 10056 10021 9987 9942 9896 9851 9806
3399I806L8L8R9J00l0k9P4P3K2K2l9m0N4N5m9m8JKKJp5p6J10J09j09j09ooN6N7N6N7J13J13
$$ 9806 9844 9882 9981 10081 10051 10022 10096 10169 10191 10213 10174 10134 10188 10243 10194 10146 10147 10149 10151 10152 10077 10001 10111 10220 10111 10002 9996 9990 10046 10103 10159 10216 10329 10442
3382A0442j13j12L6L6L6L6n1n1N1N2n1n0n1n0J5J5P6P7P1P1j54j54O3O2O3O2n1n2R2R2p6p5
$$ 10442 10329 10217 10253 10289 10325 10361 10310 10259 10310 10362 10311 10261 10210 10160 10175 10190 10266 10343 10414 10485 10331 10177 10240 10302 10365 10427 10376 10324 10416 10508 10432 10357
3366A0357j5j4l1l1L1L0n6n7J28J28P2P2p1p2M0M0k2k1lmllpppqoopol2l2K9K9P5P5k8k8O8
$$ 10357 10342 10328 10297 10266 10297 10327 10271 10214 10342 10470 10542 10614 10543 10471 10511 10551 10529 10508 10505 10501 10498 10495 10488 10481 10474 10466 10460 10454 10447 10441 10409 10377 10406 10435 10510 10585 10557 10529 10597
3346A0597O8PON1N1N0N1p4p4K9K9j04j04m3m2J34J34rrK6K5l5l6J5J6J5J6j4j4j4j4k1k0k1
$$ 10597 10665 10672 10678 10729 10780 10830 10881 10807 10733 10762 10791 10687 10583 10540 10498 10632 10766 10757 10748 10774 10799 10764 10728 10743 10759 10774 10790 10776 10762 10748 10734 10713 10693 10672
3329A0672k0J26J27K4K4M4M3j8j8M3M3n9n9o4o4klQ3Q4o0o0q0q1j1j2P2J94K8j77l2J73J21
$$ 10672 10652 10778 10905 10929 10953 10997 11040 11022 11004 11047 11090 11031 10972 10908 10844 10842 10839 10922 11006 10946 10886 10806 10725 10714 10702 10774 10968 10996 10819 10787 10960 11081
3313A1081jj56l2J17J16Q4Q5o0n9r6r5j09R6Q0P9R3R2P8P7j35j35j8J88J80k5r4k16m5P9j8
$$ 11081 11080 10924 10892 11009 11125 11209 11294 11234 11175 11079 10984 10875 10971 11051 11130 11223 11315 11393 11470 11335 11200 11182 11370 11550 11525 11431 11215 11170 11249 11231
3298A1231j8N1N1q3q4J00J01N2N2j33j32R9R8mmM4M3n9n8JJJJO2O1J64J64m7m7N5N5j81j82
$$ 11231 11213 11264 11315 11232 11148 11248 11349 11401 11453 11320 11188 11287 11385 11381 11377 11421 11464 11405 11347 11348 11349 11350 11351 11413 11474 11638 11802 11755 11708 11763 11818 11637 11455
3282A1455P7P7M5p7j37O9M3j63K8K7K0J9Q9l4k6k5K8K9O4O4p4M9J45K2lmJ2J2NML8q6j6j6
$$ 11455 11532 11609 11654 11577 11440 11509 11552 11389 11417 11444 11464 11483 11572 11538 11512 11487 11515 11544 11608 11672 11598 11647 11792 11814 11811 11807 11819 11831 11836 11840 11878 11792 11776 11760
3265A1760M8M8k1k1R9k5n1n0q6L8R9k4O6O6j2j1J13j1j13J0M0L9M7M8k0k1o8o9q3J22J79N5
$$ 11760 11808 11856 11835 11814 11913 11888 11837 11787 11701 11739 11838 11814 11880 11946 11934 11923 12036 12025 11912 11922 11962 12001 12048 12096 12076 12055 11987 11918 11835 11957 12136 12191
3249A2191Q4Q4k7k6k7k6j21j22r1L1J35J1Q0Q0P3P2K2K2K2K2%%j15R0Q4Q4L1r3l6Q7J0J0r7
$$ 12191 12275 12359 12332 12306 12279 12253 12132 12010 11919 11950 12085 12096 12176 12256 12329 12401 12423 12445 12467 12489 12489 12489 12374 12464 12548 12632 12663 12570 12534 12621 12631 12641 12544
3232A2544r7Q7Q7M7M6J16pj19j19n8n7J2J35N8N8l2j54j5j6mJ18J81N7q0p9J5J5jkjkm6m6
$$ 12544 12447 12534 12621 12668 12714 12830 12823 12704 12585 12527 12470 12482 12617 12675 12733 12701 12547 12532 12516 12512 12630 12811 12868 12788 12709 12724 12739 12738 12736 12735 12733 12687 12641
3215A2641J39J38nnnnONK1j03j11J2lmJ57J57J3J4k5k5L6L6j07j08m1Q1J77N4K8K8o6o5L7
$$ 12641 12780 12918 12913 12908 12903 12898 12904 12909 12930 12827 12716 12728 12725 12721 12878 13035 13048 13062 13037 13012 13048 13084 12977 12869 12828 12909 13086 13140 13168 13196 13130 13065 13102
3199A3102L6J3J3J2J3JKO3O3K8K8p4p4k6k7L5J58J60m6n3O9j0j0O7n6L2L2k4k4j07R9J14j0
$$ 13102 13138 13151 13164 13176 13189 13190 13192 13255 13318 13346 13374 13300 13226 13200 13173 13208 13366 13526 13480 13427 13496 13486 13476 13543 13487 13519 13551 13527 13503 13396 13495 13609 13599
3182A3599m6m6o7J38N3N3J42J9j61l8J02J03J09j3nol9l9N6N6mj26J7J40O1O0l4l4Q1Q0j04
$$ 13599 13553 13507 13440 13578 13631 13684 13826 13845 13684 13646 13748 13851 13960 13947 13942 13936 13897 13858 13914 13970 13966 13840 13857 13997 14058 14118 14084 14050 14131 14211 14107
3167A4107j04L3L3L3L4j7j6j12j11J4J37O9O8m8m7R6R7M1M1M1M1j9k0j9k0L3L3Q7Q7k2j44
$$ 14107 14003 14036 14069 14102 14136 14119 14103 13991 13880 13894 14031 14100 14168 14120 14073 14169 14266 14307 14348 14389 14430 14411 14391 14372 14352 14385 14418 14505 14592 14570 14426
3151A4426j45k1R5R5pqJ24Jl3l2J1J1P3P2O6O7j18j18NNJ48J49n6n7Q8Q7J2J1o5N8J55L3p5
$$ 14426 14281 14260 14355 14450 14443 14435 14559 14560 14527 14495 14506 14517 14590 14662 14728 14795 14677 14559 14564 14569 14717 14866 14810 14753 14841 14928 14940 14951 14886 14944 15099 15132 15057
3135A5057p5K1K1m1m0k7k7K27J04j2j3k0k0q1q1N5N4J08j6m1m2O3J86M2q1J51J52L5q7o1O3
$$ 15057 14982 15003 15024 14983 14943 14916 14889 15116 15220 15208 15195 15175 15155 15074 14993 15048 15102 15210 15194 15153 15111 15174 15360 15402 15321 15472 15624 15659 15572 15511 15574
3119A5574j5j5k7k8L4L4rrrql2l2M2J66N9N9N9N9J30Oj09j08K0K0n4n4K28K2j15PK5K4M8p5
$$ 15574 15559 15544 15517 15489 15523 15557 15548 15539 15530 15522 15490 15458 15500 15666 15725 15784 15843 15902 16032 16038 15929 15821 15841 15861 15807 15753 15981 16003 15888 15895 15920 15944 15992 15917
3102A5917j7J07R1R2K8K9Q2Q2Q9l4L5L5K9K9p4p3O3O3lj26q2M2J43K1k7R7Q8l4L1L2J5J39
$$ 15917 15900 16007 16098 16190 16218 16247 16329 16411 16500 16466 16501 16536 16565 16594 16520 16447 16510 16573 16570 16444 16362 16404 16547 16568 16541 16638 16726 16692 16723 16755 16770 16909
3086A6909J2J2m1m2m8m7R5R6J8J8K5K5K8J52O6j38K3K28L3q9%J23J61m3m4m3j26kQ0P9K6K6
$$ 16909 16921 16933 16892 16850 16802 16755 16850 16946 16964 16982 17007 17032 17060 17212 17278 17140 17163 17391 17424 17335 17335 17458 17619 17576 17532 17489 17363 17361 17441 17520 17546 17572
3070A7572qrR4R4n1n1J8J9n6O7J28Ok0j9L9J63P4m9K8K8M2M1J04J03l5l6l5l5Q2Q1k1k1P5
$$ 17572 17564 17555 17649 17743 17692 17641 17659 17678 17622 17689 17817 17823 17803 17784 17823 17986 18060 18011 18039 18067 18109 18150 18254 18357 18322 18286 18251 18216 18298 18379 18358 18337 18412
3053A8412P5j38j4J05J06J29Oj5J09J21J21J02j03j26lN1p3lJ20N6N7P9m4l2R1J90J91P2n1
$$ 18412 18487 18349 18335 18440 18546 18675 18681 18666 18775 18896 19017 19119 19016 18890 18887 18938 18865 18862 18982 19038 19095 19174 19130 19098 19189 19379 19570 19642 19591
3039A9591J8J8p6p5J50J50O0O0l5l5l2R1K1K2J6J6J6J6N2N2N2N2N0N0k8R6J39J7K4J47L1L1
$$ 19591 19609 19627 19551 19476 19626 19776 19836 19896 19861 19826 19794 19885 19906 19928 19944 19960 19976 19992 20044 20096 20148 20200 20250 20300 20272 20368 20507 20524 20548 20695 20726 20757
3023B0757L8L9j05j04l1R3R2R2L0L1J02k1q2M1R3R2jkM9N0j2j3J36J36m8m8N5N5M8M8J12j1
$$ 20757 20795 20834 20729 20625 20594 20687 20779 20871 20901 20932 21034 21013 20931 20972 21065 21157 21156 21154 21203 21253 21241 21228 21364 21500 21452 21404 21459 21514 21562 21610 21722 21711
3007B1711N0J74J18J18J34J1j3j3M1M1P4P4r8K6P6P6J7j06L5J58Q2Q1KLLKN6N7j3J10K7K7
$$ 21711 21761 21935 22053 22171 22305 22316 22303 22290 22331 22372 22446 22520 22422 22448 22524 22600 22617 22511 22546 22704 22786 22867 22869 22872 22875 22877 22933 22990 22977 23087 23114 23141
2991B3141J04k0MML0J52J37J37K9r4kjK4J47R6R6q1q1L4L3L3L4P8P9J40J41P0O9P0P0O4O3
$$ 23141 23245 23225 23229 23233 23263 23415 23552 23689 23718 23624 23622 23621 23645 23792 23888 23984 23903 23822 23856 23889 23922 23956 24034 24113 24253 24394 24464 24533 24603 24673 24737 24800
2974B4800O4O4q6q6R8R8L5L4L5L4%%J44J43J68J69N3p0p0p0P1J94J31QP0J92N3p0J5J4Q6K10
$$ 24800 24864 24928 24842 24756 24854 24952 24987 25021 25056 25090 25090 25090 25234 25377 25545 25714 25767 25697 25627 25557 25628 25822 25953 25961 26031 26223 26276 26206 26221 26235 26321 26531
2958B6531P8P9L1L2L2L2J19J20Q8Q9L7L7R8R8J50J49OOj2j2N0N0M8M8J91J91K0K0q3q3O5O6
$$ 26531 26609 26688 26719 26751 26783 26815 26934 27054 27142 27231 27268 27305 27403 27501 27651 27800 27806 27812 27800 27788 27838 27888 27936 27984 28175 28366 28386 28406 28323 28240 28305 28371
2942B8371J9J9j2K35J57J57K0J9J22J22L2L2L3L2M2M2M1M2R8R7J29J28p8p8K5K5O6O6K10K09
$$ 28371 28390 28409 28397 28632 28789 28946 28966 28985 29107 29229 29261 29293 29326 29358 29400 29442 29483 29525 29623 29720 29849 29977 29899 29821 29846 29871 29937 30003 30213 30422
2927C0422J33J33n1n2P3P2P3P3P1P2J0J0ppK4K4J34J34rj0O2O2O1O2L9L9J00J00N5N5Q5Q5
$$ 30422 30555 30688 30637 30585 30658 30730 30803 30876 30947 31019 31029 31039 31032 31025 31049 31073 31207 31341 31332 31322 31384 31446 31507 31569 31608 31647 31747 31847 31902 31957 32042 32127
2911C2127QQJ11J10O3O2j37J08L8L7m9n0l0l0L1L1OOOOJ07J07M5M6r1r1J2J2l7l7K4K4qrj53
$$ 32127 32135 32143 32254 32364 32427 32489 32352 32460 32498 32535 32486 32436 32406 32376 32407 32438 32444 32450 32456 32462 32569 32676 32721 32767 32676 32585 32597 32609 32572 32535 32559 32583 32575 32566 32413
2894C2413j52K7K6M9N0L7q5j12j11q0M2k7k6p7p7n3n4L2r2j24j25j4j4q9k11k06k06p1N3K7
$$ 32413 32261 32288 32314 32363 32413 32450 32365 32253 32142 32062 32104 32077 32051 31974 31897 31844 31790 31822 31730 31606 31481 31467 31453 31364 31153 30947 30741 30670 30723 30750
2879C0750j77j93o9k30l53j0rp4p4p4p3k07k07k07k07n4n3k38k38k39k40j32k55j88o5k11
$$ 30750 30573 30380 30311 30081 29728 29718 29709 29635 29561 29487 29414 29207 29000 28793 28586 28532 28479 28241 28003 27764 27524 27392 27137 26949 26884 26673
2866B6673k12j79l03k00p8l22l23k53k54j48j49k50k51k09k09l86l86k46j23j93j92k77k78
$$ 26673 26461 26282 25979 25779 25701 25379 25056 24803 24549 24401 24252 24002 23751 23542 23333 22947 22561 22315 22192 21999 21807 21530 21252
2854B1252k98m21l25j20j89j89l55m78l06j83k12m17l32k10k43k43l05l05k64l87m02j97l11
$$ 21252 20954 20533 20208 20088 19899 19710 19355 18877 18571 18388 18176 17759 17427 17217 16974 16731 16426 16121 15857 15470 15068 14871 14560
2842A4560l11l51l52k51j28k23l46l89k67j72k94l35l34l42l42k08k08l93n15l26j21j74k98
$$ 14560 14249 13898 13546 13295 13167 12944 12598 12209 11942 11770 11476 11141 10807 10465 10123 9915 9707 9314 8799 8473 8352 8178 7880
2831G880j94j95k64k63l09l08l17j93k30k30l24l25l43l42k86q2j09l13k48k47l11l11k09
$$ 7880 7686 7491 7227 6964 6655 6347 6030 5837 5607 5377 5053 4728 4385 4043 3757 3675 3566 3253 3005 2758 2447 2136 1927
2819A927k09j08j09j78j78j33k56l25k02j11k33k34j11j51k75k05k06j01k24k86j63j63j63
$$ 1927 1718 1610 1501 1323 1145 1012 756 431 229 118 -115 -349 -460 -611 -886 -1091 -1297 -1398 -1622 -1908 -2071 -2234 -2397
2808b397r4r3j65j65j65j65r4r4j56j56j44j43p7k82j97Rn0j73p8p9j47j48j08j07j24%p4
$$ -2397 -2491 -2584 -2749 -2914 -3079 -3244 -3338 -3432 -3588 -3744 -3888 -4031 -4108 -4390 -4587 -4578 -4628 -4801 -4879 -4958 -5105 -5253 -5361 -5468 -5592 -5592 -5666
2794e666j97j40O4l1j55p3p2NOj33j0q9k13j35j36m8m9j51j51j0j1j0j0o1o2j92o9o5o6l2
$$ -5666 -5863 -6003 -5939 -5970 -6125 -6198 -6270 -6265 -6259 -6392 -6402 -6491 -6704 -6839 -6975 -7023 -7072 -7223 -7374 -7384 -7395 -7405 -7415 -7476 -7538 -7730 -7799 -7864 -7930 -7962
2779g962R1L8q4j52j51m2m1o2O1o9k75q2J23k1k1N4N3O1O1q3q2L3L4o0o1r6K8K7r5L5L5k6
$$ -7962 -7871 -7833 -7917 -8069 -8220 -8262 -8303 -8365 -8304 -8373 -8648 -8730 -8607 -8628 -8649 -8595 -8542 -8481 -8420 -8503 -8585 -8552 -8518 -8578 -8639 -8735 -8707 -8680 -8775 -8740 -8705 -8731
2763h731k6r9K3P0j35l1l2J7J8l7l8K5K4J50J50Q0j24j94j94o3o3OOO7O7L4L3k8k8k1k2k2
$$ -8731 -8757 -8856 -8833 -8763 -8898 -8929 -8961 -8944 -8926 -8963 -9001 -8976 -8952 -8802 -8652 -8572 -8696 -8890 -9084 -9147 -9210 -9204 -9198 -9131 -9064 -9030 -8997 -9025 -9053 -9074 -9096 -9118
2747i118k1R3R2rj0MNj19Q6J08j5O6O7r0r0p7p7m2J62J71l5q0M4N1N1Q4j21j21Q3J4J3Q8j18
$$ -9118 -9139 -9046 -8954 -8963 -8973 -8969 -8964 -9083 -8997 -8889 -8904 -8838 -8771 -8861 -8951 -9028 -9105 -9147 -8985 -8814 -8849 -8929 -8885 -8834 -8783 -8699 -8820 -8941 -8858 -8844 -8831 -8743 -8861
2731h861o3O0L9L9J7J7J8J7Q2Q3k1k0P2P2p1p1L3L3L4L3J8J8J8J8j%j03j03J21J20J20J20
$$ -8861 -8924 -8864 -8825 -8786 -8769 -8752 -8734 -8717 -8635 -8552 -8573 -8593 -8521 -8449 -8520 -8591 -8558 -8525 -8491 -8458 -8440 -8422 -8404 -8386 -8387 -8387 -8490 -8593 -8472 -8352 -8232 -8112
2714h112q1q1K2K2OOPOj9k0P6P5M2q0j35P0J84O1m2m2K5K5K5K5lko4o4K4K3Q5Q5J4J5PPJ74
$$ -8112 -8193 -8274 -8252 -8230 -8224 -8218 -8211 -8205 -8224 -8244 -8168 -8093 -8051 -8131 -8266 -8196 -8012 -7951 -7993 -8035 -8010 -7985 -7960 -7935 -7938 -7940 -8004 -8068 -8044 -8021 -7936 -7851 -7837 -7822 -7815 -7808 -7634
2696g634N2l0l0m1j63LK08J07r8r3L0J0J33J41J8o0o0L4L5L3L3o2o2j82n9J38J38l7l7J13
$$ -7634 -7582 -7612 -7642 -7683 -7846 -7843 -7635 -7528 -7626 -7719 -7689 -7679 -7546 -7405 -7387 -7447 -7507 -7473 -7438 -7405 -7372 -7434 -7496 -7678 -7737 -7599 -7461 -7498 -7535 -7422
2681g422J14k4R8R1R1K7K6o8o8j5J07k3k3L5L6K8K8J29Oj04J9R1l2j6j7K0J9l4l4o0O4R7R6
$$ -7422 -7308 -7332 -7234 -7143 -7052 -7025 -6999 -7067 -7135 -7150 -7043 -7066 -7089 -7054 -7018 -6990 -6962 -6833 -6827 -6931 -6912 -6821 -6853 -6869 -6886 -6866 -6847 -6881 -6915 -6975 -6911 -6814 -6718
2664f718J25J25N9o5M7J69rj0p1p1rj0Q6Q6r3L0R0l3j0j0q2M1l6l6J15qp7M5P1n1K5K5J03
$$ -6718 -6593 -6468 -6409 -6474 -6427 -6258 -6267 -6277 -6348 -6419 -6428 -6438 -6352 -6266 -6359 -6329 -6239 -6272 -6282 -6292 -6374 -6333 -6369 -6405 -6290 -6298 -6375 -6330 -6259 -6310 -6285 -6260 -6157
2648f157J03J%k6k6P6P6m6m7J5J5P9P9Mj18o5o4l9Q4J14J13J29On9o0n9n9P9K03L1L1m0m1
$$ -6157 -6054 -6053 -6053 -6079 -6105 -6029 -5953 -5999 -6046 -6031 -6016 -5937 -5858 -5854 -5972 -6037 -6101 -6140 -6056 -5942 -5829 -5700 -5694 -5753 -5813 -5872 -5931 -5852 -5649 -5618 -5587 -5627 -5668
2631e668J10J11o2O1O9n4k3R9K3K3N4N5j22j22k1J02K5K5M7p7J%o5N8N8N9m8P5P5m7k4k3n7
$$ -5668 -5558 -5447 -5509 -5448 -5379 -5433 -5456 -5357 -5334 -5311 -5257 -5202 -5324 -5446 -5467 -5365 -5340 -5315 -5268 -5345 -5344 -5344 -5409 -5351 -5293 -5234 -5282 -5207 -5132 -5179 -5203 -5226 -5283
2615e283J48K19J3m3m3j2j2N7N7J9J42Q5j19J5J5nnM2q1R1R0l5l4J9J9l2j54p7p8J5J38J45
$$ -5283 -5135 -4916 -4903 -4946 -4989 -5001 -5013 -4956 -4899 -4880 -4738 -4653 -4772 -4757 -4742 -4747 -4752 -4710 -4791 -4700 -4610 -4645 -4679 -4660 -4641 -4673 -4827 -4904 -4982 -4967 -4829 -4684
2599d684K3j00K4Q5l7l8Q5J44J44l2j56q6q7RQJ%J69M7j6J08R7R8KLq3q2q3q2J53J53l1l1
$$ -4684 -4661 -4761 -4737 -4652 -4689 -4727 -4642 -4498 -4354 -4386 -4542 -4628 -4715 -4706 -4698 -4697 -4697 -4528 -4481 -4497 -4389 -4292 -4194 -4192 -4189 -4272 -4354 -4437 -4519 -4366 -4213 -4244 -4275
2582d275J0J0J1J0J05J06l9l8jjP6m7j20LO5n9n1P2J26KJ5J4O8O8K8K8K9K8j9j9q1q0q1q0
$$ -4275 -4265 -4255 -4244 -4234 -4129 -4023 -4062 -4100 -4101 -4102 -4026 -4073 -4193 -4190 -4125 -4184 -4235 -4163 -4037 -4035 -4020 -4006 -3938 -3870 -3842 -3814 -3785 -3757 -3776 -3795 -3876 -3956 -4037 -4117
2565d117k5J81K04jr9r8P1P2J33J33o4o5M6M6j33rR2l0L4L3j12J1Q5l9r2L1P6P6K1K2pqqq
$$ -4117 -4142 -3961 -3757 -3758 -3857 -3955 -3884 -3812 -3679 -3546 -3610 -3675 -3629 -3583 -3716 -3725 -3633 -3663 -3629 -3596 -3708 -3697 -3612 -3651 -3743 -3712 -3636 -3560 -3539 -3517 -3524 -3532 -3540 -3548
2548c548M7M8j5j4j0j0J34J34M1M2k8k8O8n5j58l5P6P5j9j9o2o2NJ28J49K5j56j57J8J41l1
$$ -3548 -3501 -3453 -3468 -3482 -3492 -3502 -3368 -3234 -3193 -3151 -3179 -3207 -3139 -3194 -3352 -3387 -3311 -3236 -3255 -3274 -3336 -3398 -3393 -3265 -3116 -3091 -3247 -3404 -3386 -3245 -3276
2532c276l1M7M7M8M7J3J4P5P5o8o7onl3l3L6L6K6J49N1j53O6O7qqQRQRJ01J02m3m2K3K3l8
$$ -3276 -3307 -3260 -3213 -3165 -3118 -3105 -3091 -3016 -2941 -3009 -3076 -3082 -3087 -3120 -3153 -3117 -3081 -3055 -2906 -2855 -3008 -2942 -2875 -2883 -2891 -2883 -2874 -2866 -2857 -2756 -2654 -2697 -2739 -2716 -2693 -2731
2514b731l9k7k8P5P5k3k2l0l1N6o8o8N6M0M0m8m7nJ17J79N6j26j26RJ0N8N8q6q6J59J59Lj21
$$ -2731 -2770 -2797 -2825 -2750 -2675 -2698 -2720 -2750 -2781 -2725 -2793 -2861 -2805 -2765 -2725 -2773 -2820 -2825 -2708 -2529 -2473 -2599 -2725 -2716 -2706 -2648 -2590 -2676 -2762 -2603 -2444 -2441 -2562
2498b562M7M6l8Q5O6n6K9K8l0R3L1r2MNmlp7p8p7p8J35J36L2L3K6K7k8k7n0P4n7n7L7L7M4
$$ -2562 -2515 -2469 -2507 -2422 -2356 -2412 -2383 -2355 -2385 -2292 -2261 -2353 -2349 -2344 -2348 -2351 -2428 -2506 -2583 -2661 -2526 -2390 -2358 -2325 -2299 -2272 -2300 -2327 -2377 -2303 -2360 -2417 -2380 -2343 -2299
2480b299M4o2O1O9n4l2R0R1l3q0M3L6q8j8j8J18J18q1q1j9k0P2P2j87j87N6J78J09J09n3n4
$$ -2299 -2255 -2317 -2256 -2187 -2241 -2273 -2183 -2092 -2125 -2205 -2162 -2126 -2214 -2232 -2250 -2132 -2014 -2095 -2176 -2195 -2215 -2143 -2071 -2258 -2445 -2389 -2211 -2102 -1993 -2046 -2100
2464b100K1J44O1O0l4l4p0p1lJ19O2o1n3O9L8L8j5j6k2k2L9L9N9N9m3m4j00j00QJ30J22%k7
$$ -2100 -2079 -1935 -1874 -1814 -1848 -1882 -1952 -2023 -2026 -1907 -1845 -1906 -1959 -1890 -1852 -1814 -1829 -1845 -1867 -1889 -1850 -1811 -1752 -1693 -1736 -1780 -1880 -1980 -1972 -1842 -1720 -1720 -1747
2448a747k6K2K2q0q0o1o0N0M9p2N1J54L0n6n7J3j10l8Q6RRP4P4J43K1l1l1r3r2p6M6L2L1R1
$$ -1747 -1773 -1751 -1729 -1809 -1889 -1950 -2010 -1960 -1911 -1983 -1932 -1778 -1748 -1804 -1861 -1848 -1958 -1996 -1910 -1901 -1892 -1818 -1744 -1601 -1580 -1611 -1642 -1735 -1827 -1903 -1857 -1825 -1794 -1703
2431a703l1L7L8OOJ01J01J46K3m4m3j63l9L5L5J7J7l7l7j3J10J71M9LMnmq3q3j3j4p2N2M4
$$ -1703 -1734 -1697 -1659 -1653 -1647 -1546 -1445 -1299 -1276 -1320 -1363 -1526 -1565 -1530 -1495 -1478 -1461 -1498 -1535 -1548 -1438 -1267 -1218 -1215 -1211 -1216 -1220 -1303 -1386 -1399 -1413 -1485 -1433 -1389
2414a389M4J1J1q3q4J1J34J27p9j04J8kkk0k0Q2Q3K4K5p1p0j3J11M1M1L7L7k4k4O8O8l5l4
$$ -1389 -1345 -1334 -1323 -1406 -1490 -1479 -1345 -1218 -1297 -1401 -1383 -1385 -1387 -1407 -1427 -1345 -1262 -1238 -1213 -1284 -1354 -1367 -1256 -1215 -1174 -1137 -1100 -1124 -1148 -1080 -1012 -1047 -1081
2397a081k5k4J09r7j61J25NNN8o5j72L2R9R9J81N9o7o8j44k0q4q4O7O8JJRRo2O0J65j22j71
$$ -1081 -1106 -1130 -1021 -1118 -1279 -1154 -1149 -1144 -1086 -1151 -1323 -1291 -1192 -1093 -912 -853 -920 -988 -1132 -1152 -1236 -1320 -1253 -1185 -1184 -1183 -1174 -1165 -1227 -1167 -1002 -1124 -1295
2381a295L4o7N7J77J77P0n4L5L4K7K7K0K1m2m1J3J3j63M1K7K7k1k2L8L8L8L7j5j6MJ28N7j47
$$ -1295 -1261 -1328 -1271 -1094 -917 -847 -901 -866 -832 -805 -778 -758 -737 -779 -820 -807 -794 -957 -916 -889 -862 -883 -905 -867 -829 -791 -754 -769 -785 -781 -653 -596 -743
2364g43k4k4J0J0n1n1n8n7M5M5ONO7O7OPOOj05j05l6J69J20J19J16q8j60M5Q9l5n5n5Q1Q1
$$ -743 -767 -791 -781 -771 -822 -873 -931 -988 -943 -898 -892 -887 -820 -753 -747 -740 -734 -728 -833 -938 -974 -805 -685 -566 -450 -538 -698 -653 -564 -599 -654 -709 -628 -547
2347e47j5j6p6p7K6K5K6K6N7N8N8N7q8q9q9q9n5n4J30J30m8m7m8m8j7j6j7j7P6P6J37J38N9
$$ -547 -562 -578 -654 -731 -705 -680 -654 -628 -571 -513 -455 -398 -486 -575 -664 -753 -808 -862 -732 -602 -650 -697 -745 -793 -810 -826 -843 -860 -784 -708 -571 -433 -374
2330c74N9m3m3mno5o6j6j6M6M6k9l0k9k9J9K0J9K0J65J66j9j9o4o4o4o4J6J6J6J6N5N4m8m8
$$ -374 -315 -358 -401 -405 -410 -475 -541 -557 -573 -527 -481 -510 -540 -569 -598 -579 -559 -540 -520 -355 -189 -208 -227 -291 -355 -419 -483 -467 -451 -435 -419 -364 -310 -358 -406
2313d06l7l6O6O7L7L6k4k5QQQQl1l0K3K4N0p2mlK0K0K0J9j18j19O5O6k2k1J22J22n2n3n2n3
$$ -406 -443 -479 -413 -346 -309 -273 -297 -322 -314 -306 -298 -290 -321 -351 -328 -304 -254 -326 -330 -333 -313 -293 -273 -254 -372 -491 -426 -360 -382 -403 -281 -159 -211 -264 -316 -369
2295c69PPOPq1q2j9k0K17K18rqopRj14r1L2N8N8M9M9n4n3MMMMJ3J3j3j37k4R8m0m0P5P5l5
$$ -369 -362 -355 -349 -342 -423 -505 -524 -544 -327 -109 -118 -126 -132 -139 -130 -244 -335 -303 -245 -187 -138 -89 -143 -196 -192 -188 -184 -180 -167 -154 -167 -304 -328 -230 -270 -310 -235 -160 -195
2275a95l5O6n7K5K5p9J25J33RJ23%p0N3j1j1llK6K6L4q9j19j19k4k4J19J19n7n8j8J04J66
$$ -195 -230 -164 -221 -196 -171 -250 -125 8 17 140 140 70 123 112 101 98 95 121 147 181 92 -27 -146 -170 -194 -75 44 -13 -71 -89 15 181
2259A81M2k4k3l2l2q4q4p1p1l6J70O2o1O3O2opp8p9L7L7MK08P3j33m3Q0n5n6j5J08N4o9qJ15
$$ 181 223 199 176 144 112 28 -56 -127 -198 -234 -64 -2 -63 0 62 56 49 -29 -108 -71 -34 -30 178 251 118 75 155 100 44 29 137 191 122 114 229
2242B29o3o4Q3Q2o0o1M6M6n7n7%%P7m6j79n7J0J1O2O3O3O2J05J05J13j0j48j47n2n2QQJ10
$$ 229 166 102 185 267 207 146 192 238 181 124 124 124 201 155 -24 -81 -71 -60 2 65 128 190 295 400 513 503 355 208 156 104 112 120 230
2225B30J11m9m8m8m9Q5Q5n8n9Q5Q4Q4Q4j05j05P1P2M8p5onq3q2q3q2P1P2J8J8o0O3J65M3j18
$$ 230 341 292 244 196 147 232 317 259 200 285 369 453 537 432 327 398 470 518 443 437 432 349 267 184 102 173 245 263 281 221 284 449 492 374
2208C74j18k3k3J03J02%%j4j4j57j58N2N1K36J13j21Q4P6j29L5L6K2K3m8m8J4J4J0J0m4m4
$$ 374 256 233 210 313 415 415 415 401 387 230 72 124 175 411 524 403 487 563 434 469 505 527 550 502 454 468 482 492 502 458 414
2192D14j6J07N3o9L7J61R2l1o8o7K8K7j07j07l2R0L3L2M1M0o2o3o2o2R3R2n6O7J65j21j24
$$ 414 398 505 558 489 526 687 779 748 680 613 641 668 561 454 422 512 545 577 618 658 596 533 471 409 502 594 538 605 770 649 525
2177E25jj28j27J06J06K7K6l5l5N0M9P5j29j83K3L8L8L2L2L2L3P4P4k8k8j24j25N9O0N7N7
$$ 525 524 396 269 375 481 508 534 499 464 514 563 638 509 326 349 387 425 457 489 521 554 628 702 674 646 522 397 456 516 573 630
2161F30K4r9M0L9j04j04L6J58R8k6p1p0p9p8K3K3l9l9M5M6R9R9Q3l9o5o5j09J5J63J63Mj19
$$ 630 654 555 595 634 530 426 462 620 718 692 621 551 472 394 417 440 401 362 407 453 552 651 734 695 630 565 456 471 634 797 801 682
2145F82j03j03N9J83l0l0RQn3n3n1n1k5R8L3q9J30J31L8L9j82o0Q1m3j9k0OJ28N9N9k6k5l3
$$ 682 579 476 535 718 688 658 667 675 622 569 518 467 442 540 573 484 614 745 783 822 640 580 661 618 599 579 585 713 772 831 805 780 747
2129G47l4pj29J3J37j3j3p5M8J1J1J9J9L6L5r3J13M5j59l9Q4O8O7Q3m0M5M5l1l2K0j03r6r6
$$ 747 713 706 577 590 727 714 701 626 674 685 696 715 734 770 805 712 825 870 711 672 756 824 891 974 934 979 1024 993 961 981 878 782 686
2112F86k1k1M0M0N3N3j6j6J37J4j29oj0j0lkP0P1J7J6q9L3J36J3r3r2k6R7P6P5k5j47p2N0
$$ 686 665 644 684 724 777 830 814 798 935 949 820 814 804 794 791 789 859 930 947 963 874 907 1043 1056 963 871 845 942 1018 1093 1068 921 849 899
2095H99j8j9j13J0J53L0L4L4m3Q0N6N6P9m4j55l1L5L5l8l7l8l8o3o3OOj9J05J66M3m7m8kj
$$ 899 881 862 749 759 912 942 976 1010 967 1047 1103 1159 1238 1194 1039 1008 1043 1078 1040 1003 965 927 864 801 807 813 794 899 1065 1108 1061 1013 1011 1010
2078A010O7n5m8m8M2M2N0p4L8L8L1L0q4q3R3R3K3r9j07J7J43K0noP7P7N6j49j22Kp4p3m1Q2
$$ 1010 1077 1022 974 926 968 1010 1060 986 1024 1062 1093 1123 1039 956 1049 1142 1165 1066 959 976 1119 1139 1134 1128 1205 1282 1338 1189 1067 1069 995 922 881 963
2061I63P4j31r7K5NNLKQ5l9p5J30J22q2k0k0l3l3m6m7J38J38O0O0O0N9j4j5j5j5j0j1j1j1
$$ 963 1037 906 809 834 839 844 847 849 934 895 820 950 1072 990 970 950 917 884 838 791 929 1067 1127 1187 1247 1306 1292 1277 1262 1247 1237 1226 1215 1204
2044A204p0o9qqL0L1L0L1o0n9M4M3N1N1r3r2lmlmJ58J58k6k7r3r3q0q1n2J53J07j7L3L2Q7
$$ 1204 1134 1065 1057 1049 1079 1110 1140 1171 1111 1052 1096 1139 1190 1241 1148 1056 1053 1049 1046 1042 1200 1358 1332 1305 1212 1119 1039 958 906 1059 1166 1149 1182 1214 1301
2026A301Q6j46j46m3m3J24J24o1o0M7M7r7r6O2O2m0m1RQQRj4j3j3j3N3N4M0M1O8j38r1L2M0
$$ 1301 1387 1241 1095 1052 1009 1133 1257 1196 1136 1183 1230 1133 1037 1099 1161 1121 1080 1089 1097 1105 1114 1100 1087 1074 1061 1114 1168 1208 1249 1317 1179 1088 1120 1160
2009A160M1j3j4J%%JL1L1l1l0K8K7K8K8O7O8OOr5r4M8M9j7j6j7j6JKO3O3m4m5l7l6J6J38l2
$$ 1160 1201 1188 1174 1175 1175 1175 1176 1207 1238 1207 1177 1205 1232 1260 1288 1355 1423 1429 1435 1340 1246 1294 1343 1326 1310 1293 1277 1278 1280 1343 1406 1362 1317 1280 1244 1260 1398 1366
1990A366l3m2m1J9K0l8l8O5O5j9j9j8j9L9L9j4j5r1L1N2N2O8j38j37O7J20J20N9o5L8L9p2
$$ 1366 1333 1291 1250 1269 1289 1251 1213 1278 1343 1324 1305 1287 1268 1307 1346 1332 1317 1226 1257 1309 1361 1429 1291 1154 1221 1341 1461 1520 1455 1493 1532 1460
1974A460p2l1l0P1P2l3l2K1K1J52K8rj33j67m3K3K3R8R9q6q6JKRRj23%L4L4qpR5R5j%q3M0
$$ 1460 1388 1357 1327 1398 1470 1437 1405 1426 1447 1599 1627 1618 1485 1318 1275 1298 1321 1419 1518 1432 1346 1347 1349 1358 1367 1244 1244 1278 1312 1304 1297 1392 1487 1486 1486 1403 1443
1956A443J55n0k2k1q6L7M5p8k9R4P1P1N0p2j75n2j%PPL2L1k2k2j0J12N2p2r7r8l5l6l6Q8K31
$$ 1443 1598 1548 1526 1505 1419 1456 1501 1423 1394 1488 1559 1630 1680 1608 1433 1381 1380 1380 1387 1394 1426 1457 1435 1413 1403 1515 1567 1495 1398 1300 1265 1229 1193 1281 1512
1938A512J08m3m3LLm8j70J4J37n5n5POO0o2O8O8R3R4J9j03j01j01poK3K4K3K3r1r1N2N3M6
$$ 1512 1620 1577 1534 1537 1540 1492 1322 1336 1473 1418 1363 1370 1376 1436 1374 1442 1510 1603 1697 1716 1613 1512 1411 1404 1398 1421 1445 1468 1491 1400 1309 1361 1414 1460
1921A460M6r0r0M3J66J17q8q7L7J6J6J6J7J7J7n7n8n7n8R1R1r3r3r3r2J1J0J42J41J14r2n8
$$ 1460 1506 1416 1326 1369 1535 1652 1564 1477 1514 1530 1546 1562 1579 1596 1613 1556 1498 1441 1383 1474 1565 1472 1379 1286 1194 1205 1215 1357 1498 1612 1520 1462
1905A462n8J55J54p7p7j6j5OOOPkjJ01J01q4q3O0O0l5l5l5l5k2k2O0o3p1J35P7j27k3J82N3
$$ 1462 1404 1559 1713 1636 1559 1543 1528 1534 1540 1546 1553 1551 1550 1651 1752 1668 1585 1645 1705 1670 1635 1600 1565 1543 1521 1581 1518 1447 1582 1659 1532 1509 1691 1744
1888A744N4PPQPn5n5n6n5K3K3Q5Q4J4J4l4l5j00J05lj26rrj7j7N7N7J19J19l4l4l4l4J4J4
$$ 1744 1798 1805 1812 1820 1827 1772 1717 1661 1606 1629 1652 1737 1821 1835 1849 1815 1780 1680 1785 1782 1656 1647 1638 1621 1604 1661 1718 1837 1956 1922 1888 1854 1820 1834 1848
1870A848o9N5J11r4j88J6K8K8J07r8j56M8j8j8QQP0P0j7j7j8j7p4p4p5p4J63J63O0O0m7m6
$$ 1848 1779 1834 1945 1851 1663 1679 1707 1735 1842 1744 1588 1636 1618 1600 1608 1616 1686 1756 1739 1722 1704 1687 1613 1539 1464 1390 1553 1716 1776 1836 1789 1743
1854A743m7m6ppM7M6J43J9j4j4q2q2k0k0L2L1L2L2r5r5%%J12j1j13RN1N0J12J12J34J2o3o3
$$ 1743 1696 1650 1643 1636 1683 1729 1872 1891 1877 1863 1781 1699 1679 1659 1691 1722 1754 1786 1691 1596 1596 1596 1708 1697 1584 1593 1644 1694 1806 1918 2052 2064 2001 1938
1837A938K7K7j09j09j26lO4O4P9m3j92J2N8N8l2l2kklkL2L3J1J35J26p9r2r2j30pR5k8L5L6
$$ 1938 1965 1992 1883 1774 1648 1645 1709 1773 1852 1809 1617 1629 1687 1745 1713 1681 1679 1677 1674 1672 1704 1737 1748 1883 2009 1930 1838 1746 1616 1609 1704 1676 1711 1747
1820A747R6k6J7J7r3r3O2O2K75J52j36j35m1m1NMO5O6J3J3n6O7J7J7q6q5K3j01m6P7O1o2o1
$$ 1747 1843 1817 1834 1851 1758 1665 1727 1789 2064 2216 2080 1945 1904 1863 1868 1872 1937 2003 2016 2029 1973 2040 2057 2074 1988 1903 1926 1825 1779 1856 1917 1855 1794
1803A794O1N7o5J1J2j7j7J26J27PPr5r5PPPPK4K4J6J6K0j03j03K0L6L5n9o0o5o6L7J59P4j32
$$ 1794 1855 1912 1847 1858 1870 1853 1836 1962 2089 2096 2103 2008 1913 1920 1927 1934 1941 1965 1989 2005 2021 2041 1938 1835 1855 1891 1926 1867 1807 1742 1676 1713 1872 1946 1814
1786A814K5J48j4j3j08j09P0P1QRo3o3J22J21o9o9pqJ33J34n1n1K9L0o5o5j21Lo6o7J07J07
$$ 1814 1839 1987 1973 1960 1852 1743 1813 1884 1892 1901 1838 1775 1897 2018 1949 1880 1873 1865 1998 2132 2081 2030 2059 2089 2024 1959 1838 1841 1775 1708 1815 1922
1770A922MNJ18J18L7q7J44K0k54j31l1l1L1L0J07j5n0m9j1j0j1j1K3K3J6J5P4n0l5l4n9O4
$$ 1922 1926 1931 2049 2167 2204 2117 2261 2281 2027 1896 1865 1834 1865 1895 2002 1987 1937 1888 1877 1867 1856 1845 1868 1891 1907 1922 1996 1946 1911 1877 1818 1882
1754A882nnM1M1M1M2m4m5N1N1N7o6j68m5k5k4Q5Q6j19j20J48J47n9n9Q4Q4l9m0m0m0KKJ74
$$ 1882 1877 1872 1913 1954 1995 2037 1993 1948 1999 2050 2107 2041 1873 1828 1803 1779 1864 1950 1831 1711 1859 2006 1947 1888 1972 2056 2017 1977 1937 1897 1899 1901 2075
1737B075N1l5l6k14r1J03J04M9N0l1l1J00k3m2m2n0m9J4J5J17J17KLJ0J0j66m2K6r6j3J11
$$ 2075 2126 2091 2055 1841 1750 1853 1957 2006 2056 2025 1994 2094 2071 2029 1987 1937 1888 1902 1917 2034 2151 2153 2156 2166 2176 2010 1968 1994 1898 1885 1996
1722A996k8k9M9M9j3j2J68J69j39j38j2j2J27Lm0Q2OOj6j6O1o2q6L7l9m0n4n3M9M9L9L9L9
$$ 1996 1968 1939 1988 2037 2024 2012 2180 2349 2210 2072 2060 2048 2175 2178 2138 2220 2226 2232 2216 2200 2261 2199 2113 2150 2111 2071 2017 1964 2013 2062 2101 2140 2179
1705B179L9M2M2M2M2j89j88MMnJ18K3r9k7R6m2m2n3n2m5m4k7R6J03j9j12J2J93J94j6j38p7
$$ 2179 2218 2260 2302 2344 2386 2197 2009 2013 2017 2012 2130 2153 2054 2027 2123 2081 2039 1986 1934 1889 1845 1818 1914 2017 1998 1886 1898 2091 2285 2269 2131 2054
1689B054M6k9k8P4P5P7m6k36l1Q2Q3qqO1O0m2m2QPn3n4J7J6J7J6o3o3l7Q6P9m4l6Q7RRP8P8
$$ 2054 2100 2071 2043 2117 2192 2269 2223 1987 1956 2038 2121 2113 2105 2166 2226 2184 2142 2150 2157 2104 2050 2067 2083 2100 2116 2053 1990 1953 2039 2118 2074 2038 2125 2134 2143 2221 2299
1670B299q5q4R9J00j95j95P2P1J11J10Q3j23l8l8n1n1J8J7R4k9j47k3M3M3J00J01j5j38L4
$$ 2299 2214 2130 2229 2329 2134 1939 2011 2082 2193 2303 2386 2263 2225 2187 2136 2085 2103 2120 2214 2185 2038 2015 2058 2101 2201 2302 2287 2149 2183
1656B183L4j53l0J87O3llm0m0m8m8J15qM6J68L4q8p4p3Q1Q1o3o2K4K5M0q3k04q0J43J42M6
$$ 2183 2217 2064 2034 2221 2284 2281 2278 2238 2198 2150 2102 2217 2209 2255 2423 2457 2369 2295 2222 2303 2384 2321 2259 2283 2308 2348 2265 2061 1981 2124 2266 2312
1640B312p6%%k8R5j66j66K38J16J3J36l5l4M2q0k6k5K8K8O7O7M7j59j01K2o0o0M6M6n7n7P0
$$ 2312 2236 2236 2236 2208 2303 2137 1971 2209 2325 2338 2474 2439 2405 2447 2367 2341 2316 2344 2372 2439 2506 2553 2394 2293 2315 2255 2195 2241 2287 2230 2173 2243
1624B243P0l2l2J8J9m3m3m7m7O9O8q0J25J25q0m4m4j26mJ07J06k9l0M7M6K0j02j87o4M4M3
$$ 2243 2313 2281 2249 2267 2286 2243 2200 2153 2106 2175 2243 2163 2288 2413 2333 2289 2245 2119 2115 2222 2328 2299 2269 2316 2362 2382 2280 2093 2029 2073 2116
1608B116J26J26K8j77j37O8QRj8J05R7j07l3R1Q6l7j47k3M4M3O6O5l6l7q6q5k4k4M1M0N6o7
$$ 2116 2242 2368 2396 2219 2082 2150 2158 2167 2149 2254 2351 2244 2211 2302 2388 2351 2204 2181 2225 2268 2334 2399 2363 2326 2240 2155 2131 2107 2148 2188 2244 2177
1592B177mJ19J11j2r7r8P9m4j03J02M8p5llR2R2o2o2P4P4J4j09j08J4RRJ7J7N4N5pqj1j1N1
$$ 2177 2173 2292 2403 2391 2294 2196 2275 2231 2128 2230 2278 2203 2200 2197 2289 2381 2319 2257 2331 2405 2419 2310 2202 2216 2225 2234 2251 2268 2322 2377 2370 2362 2351 2340 2391
1575B391N0J4J3m8m8N3N3N3N3m0l9r3r4j4J09J09j3j03j02n6n6P3n0j11J2N4N4%%NONNllm
$$ 2391 2441 2455 2468 2420 2372 2425 2478 2531 2584 2544 2505 2412 2318 2304 2413 2522 2509 2406 2304 2248 2192 2265 2215 2104 2116 2170 2224 2224 2224 2229 2235 2240 2245 2242 2239 2235
1556B235lJ17J17k6k7n1n0n9O5p7p6J16J16o1o1Q2Q3j9j9j8j9l1l1J08j5r9K4P8m5k5k5J10
$$ 2235 2232 2349 2466 2440 2413 2362 2312 2253 2318 2241 2165 2281 2397 2336 2275 2357 2440 2421 2402 2384 2365 2334 2303 2411 2396 2297 2321 2399 2354 2329 2304 2414
1540B414J11n6n6ONL0L0j13j14R9R9L8L7O8O7l5k40NJ29M7M7n3n2n3n2q1q0K1K2K3K4P7P6
$$ 2414 2525 2469 2413 2419 2424 2454 2484 2371 2257 2356 2455 2493 2530 2598 2665 2630 2390 2395 2524 2571 2618 2565 2513 2460 2408 2327 2247 2268 2290 2313 2337 2414 2490
1524B490n3j77q7J18J04j8m0l9j5j5M7M6M2M3M2M2o6o5mmJJJ%L6L5k6k6J2J1n0m9k0j9j9j9
$$ 2490 2437 2260 2173 2291 2395 2377 2337 2298 2283 2268 2315 2361 2403 2446 2488 2530 2464 2399 2395 2391 2392 2393 2394 2394 2430 2465 2439 2413 2425 2436 2386 2337 2317 2298 2279 2260
1506B260K7K7K7K7k6k5k6k5O1O1m2m1O3O4O4O3r4r4R1R0j3j3j4j3k8k8k8k9j0j0p2p1J24J24
$$ 2260 2287 2314 2341 2368 2342 2317 2291 2266 2327 2388 2346 2305 2368 2432 2496 2559 2465 2371 2462 2552 2539 2526 2512 2499 2471 2443 2415 2386 2376 2366 2294 2223 2347 2471
1489B471o1j83r0J15qqO5O5l8l7PQJ51J51O1O2q2q2l6l6K6K5p2p3l9Q3k8k8M2M1j9j9r6K6
$$ 2471 2410 2227 2137 2252 2244 2236 2301 2366 2328 2291 2298 2306 2457 2608 2669 2731 2649 2567 2531 2495 2521 2546 2474 2401 2362 2445 2417 2389 2431 2472 2453 2434 2338 2364
1472B364M1q2k0J02J17pp3p3LKP2n2k3k2O4O4K6r7lJ21K8r6j8j9N3N3j3j36o4O0k5k5J07j6
$$ 2364 2405 2323 2303 2405 2522 2515 2442 2369 2372 2374 2446 2394 2371 2349 2413 2477 2503 2406 2403 2524 2552 2456 2438 2419 2472 2525 2512 2376 2312 2372 2347 2322 2429 2413
1455B413m9n0N6N5j57l4K2K2J61L7l9l9k1J02J06j8m2m3n2n2K5r8p8M5l1l2J17J16M2q1J8
$$ 2413 2364 2314 2370 2425 2268 2234 2256 2278 2439 2476 2437 2398 2377 2479 2585 2567 2525 2482 2430 2378 2403 2305 2227 2272 2241 2209 2326 2442 2484 2403 2421
1439B421J9n8O5k4k3J14J15J07r8r8J07O1O2%j23m1m1j26kO8n5j91o8J61J60R8R9K2j01j01
$$ 2421 2440 2382 2447 2423 2400 2514 2629 2736 2638 2540 2647 2708 2770 2770 2647 2606 2565 2439 2437 2505 2450 2259 2191 2352 2512 2610 2709 2731 2630 2529
1424B529K2J22J21o2o3lj26m9n0p4M8J50K8m4m4n2n2l0l0J55L1j23Q1R0l4M0M1j03j03NJ27
$$ 2529 2551 2673 2794 2732 2669 2666 2540 2491 2441 2367 2415 2565 2593 2549 2505 2453 2401 2371 2341 2496 2527 2404 2485 2575 2541 2581 2622 2519 2416 2421 2548
1408B548j0j1k6j49j8J86m5j69j2J10j6j6qrL7L7R8R8l4l3l4l4j5j5j5j5N8N8rj32p5M8k9
$$ 2548 2538 2527 2501 2352 2334 2520 2475 2306 2294 2404 2388 2372 2364 2355 2392 2429 2527 2625 2591 2558 2524 2490 2475 2460 2445 2430 2488 2546 2537 2405 2330 2378 2349
1392B349k9Q0Q0j4j5l9Q5J18J18L0L1l1l1j57j58K7K7P7P7P6P7k3k4L8J61K9j75j48j48q3
$$ 2349 2320 2400 2480 2466 2451 2412 2497 2615 2733 2763 2794 2763 2732 2575 2417 2444 2471 2548 2625 2701 2778 2755 2731 2769 2930 2959 2784 2636 2488 2405
1377B405M0K5K4J76N3n5n5j7J05M4p9r6r7J1J33kkq9q9kJ21rj0J8J8l6l6k2J02R3R4k9k9k9
$$ 2405 2445 2470 2494 2670 2723 2668 2613 2596 2701 2745 2666 2570 2473 2484 2617 2615 2613 2524 2435 2433 2554 2545 2535 2553 2571 2535 2499 2477 2579 2672 2766 2737 2708 2679
1360B679k8j0j0rj0mnO5n8l1l2l9l9K8K9Q9R0m0l9K2K1m8m8N4N5k2k1k1k1M6M6n6n6M8M7j
$$ 2679 2651 2641 2631 2622 2612 2608 2603 2668 2610 2579 2547 2508 2469 2497 2526 2615 2705 2665 2626 2648 2669 2621 2573 2627 2682 2660 2639 2618 2597 2643 2689 2633 2577 2625 2672 2671
1342B671jp0J34K8r6M2M3j9j9k4J00J5j89J0K15J8J8l0j53r9K4Oj17K7J49J9j04L4L4l5l5
$$ 2671 2670 2600 2734 2762 2666 2708 2751 2732 2713 2689 2789 2804 2615 2625 2840 2858 2876 2846 2693 2594 2618 2624 2507 2534 2683 2702 2598 2632 2666 2631 2596
1326B596l5l4qqqpP3P3P3P3j64j63O2O2m3m3J9J8M9M9M9M9J4J5m0l9q4M0L1L2ppq3L9O4o0
$$ 2596 2561 2527 2519 2511 2503 2496 2569 2642 2715 2788 2624 2461 2523 2585 2542 2499 2518 2536 2585 2634 2683 2732 2746 2761 2721 2682 2598 2638 2669 2701 2694 2687 2604 2643 2707 2647
1308B647J8J7m4m4R4k9n6O6M3M3R9k3r8r8K4K5j14RL7q5o3o3M9J71O9n5n1n2n2n2k6R6R6k7
$$ 2647 2665 2682 2638 2594 2688 2659 2603 2669 2712 2755 2854 2831 2733 2635 2659 2684 2570 2579 2616 2531 2468 2405 2454 2625 2694 2639 2588 2536 2484 2432 2406 2502 2598 2571
1291B571P2P2l8l8K9K9K9K9j0rp1p1MMMLO2O2q2q2n3n3M9M9L1L0L0L0J17J18k6k7RQn3n3M5
$$ 2571 2643 2715 2677 2639 2668 2697 2726 2755 2745 2736 2665 2594 2598 2602 2606 2609 2671 2733 2651 2569 2516 2463 2512 2561 2592 2622 2652 2682 2799 2917 2891 2864 2873 2881 2828 2775 2820
1272B820M5j7j6p3p3j2j1K3K3Q4Q5j05j06m3m4Q0Q0k3k2n1n1N2N2L3L4p0o9n5n5POL2L2L2
$$ 2820 2865 2848 2832 2759 2686 2674 2663 2686 2709 2793 2878 2773 2667 2624 2580 2660 2740 2717 2695 2644 2593 2645 2697 2730 2764 2694 2625 2570 2515 2522 2528 2560 2592 2624
1255B624L2J1J0J0J1J2J3J3J3p0p0p8p8J50K8j21Q4M4M5N7N7n3n2n3n2Q8Q8n5n5P7P7k6k6
$$ 2624 2656 2667 2677 2687 2698 2710 2723 2736 2749 2679 2609 2531 2453 2603 2631 2510 2594 2638 2683 2740 2797 2744 2692 2639 2587 2675 2763 2708 2653 2730 2807 2781 2755
1239B755K0J9J9J9j0j1p2p1m4m4m3m4N4N5m9m8j6j6Q6Q7R1R2L0L0qqp0p0n3n3QRO9P0l2l3
$$ 2755 2775 2794 2813 2832 2822 2811 2739 2668 2624 2580 2537 2493 2547 2602 2553 2505 2489 2473 2559 2646 2737 2829 2859 2889 2881 2873 2803 2733 2680 2627 2635 2644 2713 2783 2751 2718
1221B718k8k7P5P5k8k8pj30j46N9J13J13N1p3MMj20MP0P0J30Qj9j8j25jJ9J9J02j04k53L5
$$ 2718 2690 2663 2738 2813 2785 2757 2750 2620 2474 2533 2646 2759 2810 2737 2741 2745 2625 2629 2699 2769 2899 2907 2888 2870 2745 2744 2763 2782 2884 2780 2527 2562
1205B562L9M0K42L7p9M5j14QRj14l0k9p7M6P9P9JJJJL9L8r8r7m1Q3n6n6P2n1l5l6p2N0R1R2
$$ 2562 2601 2641 2883 2920 2841 2886 2772 2780 2789 2675 2645 2616 2539 2585 2664 2743 2744 2745 2746 2747 2786 2824 2726 2629 2588 2671 2615 2559 2631 2580 2545 2509 2437 2487 2578 2670
1187B670lJ21J21kj26j26k6R7J29Oj9k0j03j04Q1Q1L5L5m2Q1M1q1mmN2N2L7j69n5J49K9r4
$$ 2670 2667 2788 2909 2907 2781 2655 2629 2726 2855 2861 2842 2822 2719 2615 2696 2777 2812 2847 2805 2886 2927 2846 2842 2838 2890 2942 2979 2810 2755 2904 2933 2839
1171B839n1n0M4M4L1L2p2p1L9L9o4o4J02J01q2q3K3K4K3K4N5N5m7m8J6J5j56l3Q5Q4J9J8O7
$$ 2839 2788 2738 2782 2826 2857 2889 2817 2746 2785 2824 2760 2696 2798 2899 2817 2734 2757 2781 2804 2828 2883 2938 2891 2843 2859 2874 2718 2685 2770 2854 2873 2891 2958
1154B958j38j38O6K4K4L7L7m0m0m0m0m4m4m4m4J42J42L9L9n2n3n3n3j7j7M4M5k2k1k2k1op
$$ 2958 2820 2682 2748 2772 2796 2833 2870 2830 2790 2750 2710 2666 2622 2578 2534 2676 2818 2857 2896 2844 2791 2738 2685 2668 2651 2695 2740 2718 2697 2675 2654 2648 2641
1137B641ooP1P2J0RM4M3j9j8qqrql6l7J07J07o2o3n0n0j04J02J57L5o2o3p0p0L2L3j12j11
$$ 2641 2635 2629 2700 2772 2782 2791 2835 2878 2859 2841 2833 2825 2816 2808 2772 2735 2842 2949 2887 2824 2774 2724 2620 2722 2879 2914 2852 2789 2719 2649 2681 2714 2602 2491
1120B491J08J08J08J08k3k2L8L9k1k2k1k2nmo7o6pqN4N5O6O7p6p7m3m4j05j05J1J0O4O4K5
$$ 2491 2599 2707 2815 2923 2900 2878 2916 2955 2934 2912 2891 2869 2864 2860 2793 2727 2720 2712 2766 2821 2887 2954 2878 2801 2758 2714 2609 2504 2515 2525 2589 2653 2678
1104B678r8n4J50K24J8o5N7n5n4m6m7n4n5QPP6P6P5P6POn5n4N8N8k4R9L4j71m9m8O1O1O0O1
$$ 2678 2580 2526 2676 2900 2918 2853 2910 2855 2801 2755 2708 2654 2599 2607 2614 2690 2766 2841 2917 2924 2930 2875 2821 2879 2937 2913 3012 3046 2875 2826 2778 2839 2900 2960 3021
1086C021o7o8o7o8J4J4J4J4j9k0Q3Q4Q3Q3j02j01l5l4j5J09O5j41QJ32P1n2m5P9PQm6m6o6
$$ 3021 2954 2886 2819 2751 2765 2779 2793 2807 2788 2768 2851 2935 3018 3101 2999 2898 2863 2829 2814 2923 2988 2847 2855 2987 3058 3006 2961 3040 3047 3055 3009 2963 2897
1070B897o5L7L7J15J14o9p0j6j5j6j6p2p1p2p1N3N2M0M0N9j45n1J54K4r8L8L7L8q4l6J69J10
$$ 2897 2832 2869 2906 3021 3135 3066 2996 2980 2965 2949 2933 2861 2790 2718 2647 2700 2752 2792 2832 2891 2746 2695 2849 2873 2775 2813 2850 2888 2804 2768 2937 3047
1054C047j3l3l3L7L8k4j48j04J00M6p6%JQ7Q8k6j50k03KJ04j9O3O3p1p1p2p1J33J33j1j1J3
$$ 3047 3034 3001 2968 3005 3043 3019 2871 2767 2867 2913 2837 2837 2838 2925 3013 2987 2837 2634 2636 2740 2721 2784 2847 2776 2705 2633 2562 2695 2828 2817 2806 2819
1037B819J2J3J2j1j1J32J32m5m6m6m6m1m1m2m1J05J05l9l9j21j20K3K3J10J10p5p4O8O9PQ
$$ 2819 2831 2844 2856 2845 2834 2966 3098 3053 3007 2961 2915 2874 2833 2791 2750 2855 2960 2921 2882 2761 2641 2664 2687 2797 2907 2832 2758 2826 2895 2902 2910
1022B910o1o1JJL3L3L3L3J01J01kjj00j00KKn6n7NNP4P4k8k8m7m8R6R6JJJJL1L0j54j54l0
$$ 2910 2849 2788 2789 2790 2823 2856 2889 2922 3023 3124 3122 3121 3021 2921 2923 2925 2869 2812 2817 2822 2896 2970 2942 2914 2867 2819 2915 3011 3012 3013 3014 3015 3046 3076 2922 2768 2738
1003B738l0L2L1J19J19o6o6K2K2JJ25L4j70j16OL3L3M0M1O5O4p8p9j9j9j9j9k7k7L5L5j2j3
$$ 2738 2708 2740 2771 2890 3009 2943 2877 2899 2921 2922 3047 3081 2911 2795 2801 2834 2867 2907 2948 3013 3077 2999 2920 2901 2882 2863 2844 2817 2790 2825 2860 2848 2835
987B835j2j2J46J45KKo3o4L8L9p8p8p8p8P1P1J0RJ04J03j92j91j3J91R7j08L6J60J1j12r0
$$ 2835 2823 2811 2957 3102 3104 3106 3043 2979 3017 3056 2978 2900 2822 2744 2815 2886 2896 2905 3009 3112 2920 2729 2716 2907 3004 2896 2932 3092 3103 2991 2901
971B901L2K5r7KKooJ00R9L8L8l8l8r9r9L0L0J61L7OOO7n6j62j62J5J5N9O0kkL1L1l0l1o4o5
$$ 2901 2933 2958 2861 2863 2865 2859 2853 2953 3052 3090 3128 3090 3052 2953 2854 2884 2914 3075 3112 3118 3124 3191 3135 2973 2811 2826 2841 2900 2960 2958 2956 2987 3018 2988 2957 2893 2828
953B828P1P0P1n2n3P1K9L0M5p8kjrj0QPj8j41m5P8J7j06N8J80R7R6m2j65q7q8n7O6llm5m4
$$ 2828 2899 2969 3040 2988 2935 3006 3035 3065 3110 3032 3030 3029 3020 3010 3018 3025 3007 2866 2821 2899 2916 2810 2868 3048 3145 3241 3199 3034 2947 2859 2802 2868 2865 2862 2817 2773
935B773m4m4J64J65K1K1m5m4n3n2M7p5j4J08L5L4L4L5P1n1q5k08j16Q9O1O1O2o0p4N0K82P7
$$ 2773 2729 2685 2849 3014 3035 3056 3011 2967 2914 2862 2909 2834 2820 2928 2963 2997 3031 3066 3137 3086 3001 2793 2677 2766 2827 2888 2950 2890 2816 2866 3148 3225
919C225j07j07n7n8o4N8O0O0M2q1j07J7M2M2%%o2o2M6M6M6M6j3j2j2j3m8m8J3J3J30J29j38
$$ 3225 3118 3011 2954 2896 2832 2890 2950 3010 3052 2971 2864 2881 2923 2965 2965 2965 2903 2841 2887 2933 2979 3025 3012 3000 2988 2975 2927 2879 2892 2905 3035 3164 3026
902C026j37k2k2r1L2J8J8K6K6M1M2M1M1n6n6n6n6R1R1R2R1j04j04M0L9RRn3n2JKKKK6K6p6
$$ 3026 2889 2867 2845 2754 2786 2804 2822 2848 2874 2915 2957 2998 3039 2983 2927 2871 2815 2906 2997 3089 3180 3076 2972 3012 3051 3060 3069 3016 2964 2965 2967 2969 2971 2997 3023 2947
884B947p7L4L3k8k9J10J11j%k3j46r0J16J5J5K8K8m6m7m7m6K6K6K7K6L0L0l2l1P6P6k7k6%
$$ 2947 2870 2904 2937 2909 2880 2990 3101 3100 3100 3077 2931 2841 2957 2972 2987 3015 3043 2997 2950 2903 2857 2883 2909 2936 2962 2992 3022 2990 2959 3035 3111 3084 3058 3058
867C058%J%m0m1K1K1PPPPq1q1O2O2n5n4OPR4R4n0n0L4L4j5j5o7J39R2l0p8p8mj27n5J49K7
$$ 3058 3058 3059 3059 3019 2978 2999 3020 3027 3034 3041 3048 2967 2886 2948 3010 2955 2901 2907 2914 3008 3102 3052 3002 3036 3070 3055 3040 2973 3112 3204 3174 3096 3018 3014 2887 2832 2981 3008
848C008K7M9M8M9M8j28j28R7R8J8J8m3m3p1p2o3o4n9O4J22q2p3J32P2n0n5n4Q0Q1L5L5k7k6
$$ 3008 3035 3084 3132 3181 3229 3101 2973 3070 3168 3186 3204 3161 3118 3047 2975 2912 2848 2789 2853 2975 2893 2820 2952 3024 2974 2919 2865 2945 3026 3061 3096 3069 3043
831C043k1k1k1k1rj0p0p1J09J10M8M8p9p9p9p9J7J8K01K02k6k7k6k6O6O6l7l6nmo6o6l0l1
$$ 3043 3022 3001 2980 2959 2950 2940 2870 2799 2908 3018 3066 3114 3035 2956 2877 2798 2815 2833 3034 3236 3210 3183 3157 3131 3197 3263 3226 3190 3185 3181 3115 3049 3019 2988
814B988P3P2j18j17j5j5M3M4j8j8K3K3K3K3j0j0j0j0O3O3m0l9N2N3N3N3o4o4L8L9KKO4O3q5
$$ 2988 3061 3133 3015 2898 2883 2868 2911 2955 2937 2919 2942 2965 2988 3011 3001 2991 2981 2971 3034 3097 3057 3018 3070 3123 3176 3229 3165 3101 3139 3178 3180 3182 3246 3309 3224
797C224q5J8J7q1q1k0j9J4J3J58J57r1r0k9l0j20j20K4K3O3O3O3O3rqrrj1j1p2p3K9K9R0R0
$$ 3224 3139 3157 3174 3093 3012 2992 2973 2987 3000 3158 3315 3224 3134 3105 3075 2955 2835 2859 2882 2945 3008 3071 3134 3125 3117 3108 3099 3088 3077 3005 2932 2961 2990 3080 3170
779C170L3L3p0p0K7K6l5l5m5m4m5m4k0k0M1M1M8M7j4j4J25J25j00j00K4K4K3K4m7m7J5J4j7
$$ 3170 3203 3236 3166 3096 3123 3149 3114 3079 3034 2990 2945 2901 2881 2861 2902 2943 2991 3038 3024 3010 3135 3260 3160 3060 3084 3108 3131 3155 3108 3061 3076 3090 3073
762C073j8M4M4r7r7l6l5R8R9m6m5k8k9J15qo8J36Q3m0J0RKKj8j8j8j8o7o7L6L5j6j5M5J69
$$ 3073 3055 3099 3143 3046 2949 2913 2878 2976 3075 3029 2984 2956 2927 3042 3034 2966 3102 3185 3145 3155 3164 3166 3168 3150 3132 3114 3096 3029 2962 2998 3033 3017 3002 3047 3216
745C216o4k70m4J61R0l2j3j2O1O1J22J22q9q9q9q9J2J2J2J2J3J2J3J2J7J6J31p3j53j54J00
$$ 3216 3152 2882 2838 2999 3089 3057 3044 3032 3093 3154 3276 3398 3309 3220 3131 3042 3054 3066 3078 3090 3103 3115 3128 3140 3157 3173 3304 3231 3078 2924 3024
729C024J01KLLLQ4Q5K3K3m0l9O2O3l2l2j07j06K17J3j26kRQMML6j70n3O9j81n8J34J1OOO0
$$ 3024 3125 3127 3130 3133 3136 3220 3305 3328 3351 3311 3272 3334 3397 3365 3333 3226 3120 3337 3350 3224 3222 3231 3239 3243 3247 3283 3113 3060 3129 2948 2890 3024 3035 3041 3047 3107
711C107O0m4m5r8r8l2R1J99or0r1OP%J23J24%j16j16k1k1L1L0L0L1R2R3n9n8J00k3j25kJ0
$$ 3107 3167 3123 3078 2980 2882 2850 2941 3140 3134 3044 2953 2959 2966 2966 3089 3213 3213 3097 2981 2960 2939 2970 3000 3030 3061 3153 3246 3187 3129 3229 3206 3081 3079 3089
694C089RJ8J7o6o6P8P7k7k8L4L4k1k2k1k1%%n3n4J40K63J20mj10j10j5j6k7k6j04J9J25Ko4
$$ 3089 3098 3116 3133 3067 3001 3079 3156 3129 3101 3135 3169 3148 3126 3105 3084 3084 3084 3031 2977 3117 3380 3500 3496 3386 3276 3261 3245 3218 3192 3088 3107 3232 3234 3170
677C170o5P3P2l0l0m2m3O1O0l8l7m5P8M7M6m8m9n1n1N2N1K7K6o8o8M7J70J09j4j20j20k5k6
$$ 3170 3105 3178 3250 3220 3190 3148 3105 3166 3226 3188 3151 3106 3184 3231 3277 3229 3180 3129 3078 3130 3181 3208 3234 3166 3098 3145 3315 3424 3410 3290 3170 3145 3119
661C119j7j8M4M4K4K4M4p9o0J46L7q5q7L7L6q7j09J5m2j65JK06J04j01o6N8J47K4k7k6K7K7
$$ 3119 3102 3084 3128 3172 3196 3220 3264 3185 3125 3271 3308 3223 3136 3173 3209 3122 3013 3028 2986 2821 2822 3028 3132 3031 2965 3023 3170 3194 3167 3141 3168 3195
644C195q6q5J40J6j41O3J24q0j04K0jjl3l2K9K8o6o6mnR3R2L0L1%%o2o1L8L9R9J00k2k2O1
$$ 3195 3109 3024 3164 3180 3039 3102 3226 3146 3042 3062 3061 3060 3027 2995 3024 3052 2986 2920 2916 2911 3004 3096 3126 3157 3157 3157 3095 3034 3072 3111 3210 3310 3288 3266 3327
627C327o3m1J64K6j79q6J18N9o4M6M5j06j06QQR8R7J00j05r3r3JJO3O2o9o9J3j09j39O7P5
$$ 3327 3264 3223 3387 3413 3234 3148 3266 3325 3261 3307 3352 3246 3140 3148 3156 3254 3351 3451 3346 3253 3160 3161 3162 3225 3287 3218 3149 3162 3053 2914 2981 3056
611C056m8j3j2k1k0M4M4j8j7R4R5R4R5q9q9k7k7ooN6N6k1k1Q1Q2j9k0q0q1K7K7Q9Q8m5m6J6
$$ 3056 3008 2995 2983 2962 2942 2986 3030 3012 2995 3089 3184 3278 3373 3284 3195 3168 3141 3135 3129 3185 3241 3220 3199 3280 3362 3343 3323 3243 3162 3189 3216 3305 3393 3348 3302 3318
593C318J6J1J1J1J1p7p7p7p7n1n1J0J0J28J28K5K5J4J4J4J4o9o9qpq8q8Q9Q8J42J9m7m8j77
$$ 3318 3334 3345 3356 3367 3378 3301 3224 3147 3070 3019 2968 2978 2988 3116 3244 3269 3294 3308 3322 3336 3350 3281 3212 3204 3197 3109 3021 3110 3198 3340 3359 3312 3264 3087
576C087n4k0k1L8L8J21lj94J1J14r1j46k3J62J61j17j18P4P5p6M6P3P2P8m5l8l8j9j9PJ29
$$ 3087 3033 3013 2992 3030 3068 3189 3186 2992 3003 3117 3026 2880 2857 3019 3180 3063 2945 3019 3094 3018 3064 3137 3209 3287 3242 3204 3166 3147 3128 3135 3264
560C264J61L7j11j12N2N2r2r2n9o0KJN4N4N4N4o0o0n2n3RJ31O2O2m6m6R8k5r1J13N2N2K3K2
$$ 3264 3425 3462 3351 3239 3291 3343 3251 3159 3100 3040 3042 3043 3097 3151 3205 3259 3199 3139 3087 3034 3043 3174 3236 3298 3252 3206 3304 3279 3188 3301 3353 3405 3428 3450
543C450l8l9j0rjkj60l7J47K4NNNMK2J44p6p5M1q1j15j14j6j6j7j6M8M8r6r6Q5Q5n8n9O9O9
$$ 3450 3412 3373 3363 3354 3353 3351 3191 3154 3301 3325 3330 3335 3340 3344 3366 3510 3434 3359 3400 3319 3204 3090 3074 3058 3041 3025 3073 3121 3025 2929 3014 3099 3041 2982 3051 3120
525C120N3J77J41J9j29j30j4j4q3M0N3N3K7r5l1l2l1l1j82n9K89J66L2L2K4K4JJj30oK4K4
$$ 3120 3173 3350 3491 3510 3381 3251 3237 3223 3140 3180 3233 3286 3313 3218 3187 3155 3124 3093 2911 2852 3141 3307 3339 3371 3395 3419 3420 3421 3291 3285 3309 3333
509C333J01k2k7k8j29j30l4Q9J2J2J13rm3m3q4q4N9O0j4j3j4j4P8P9r9r9l7Q6Q5l7j12j11
$$ 3333 3434 3412 3385 3357 3228 3098 3064 3153 3165 3177 3290 3281 3238 3195 3111 3027 3086 3146 3132 3119 3105 3091 3169 3248 3149 3050 3013 3099 3184 3147 3035 2924
493B924O5K70%j23K1K0o7o6PJ31K3K3R9k3qpk3k4Pj17j63M2J37J37M7M7r2r2o0O4Q9Q9K2j01
$$ 2924 2989 3259 3259 3136 3157 3177 3110 3044 3051 3182 3205 3228 3327 3304 3296 3289 3266 3242 3249 3132 2969 3011 3148 3285 3332 3379 3287 3195 3135 3199 3288 3377 3399 3298
476C298r8r8mlP7P8Lj20QRJ03J03M1M1J5j08p4M9j3j36r4L0Q8Q9K8r5l3l3N3o9j5J07O2o1
$$ 3298 3200 3102 3098 3095 3172 3250 3253 3133 3141 3150 3253 3356 3397 3438 3453 3345 3271 3320 3307 3171 3077 3107 3195 3284 3312 3217 3184 3151 3204 3135 3120 3227 3289 3228
459C228n4O9j9j9N0N0L9L9k3k3j02j03M6J69L9q5qpllj5j6K03lj41j8l4l5O8O9N4o9p7M6P6
$$ 3228 3174 3243 3224 3205 3255 3305 3344 3383 3360 3337 3235 3132 3178 3347 3386 3301 3293 3286 3283 3280 3265 3249 3452 3449 3308 3290 3256 3221 3289 3358 3412 3343 3266 3312 3388
441C388m7j49k7L6q6j8J05pqO1O2L1L0L1L1q4q4q4q5N3N3O6O6j59M7J44K1j1j1J24Kj94J0
$$ 3388 3341 3192 3165 3201 3115 3097 3202 3195 3187 3248 3310 3341 3371 3402 3433 3349 3265 3181 3096 3149 3202 3268 3334 3175 3222 3366 3387 3376 3365 3489 3491 3297 3307
425C307J00k3l8l9N7N6M0L9j04j04M3M2k0j9j08j08L6L6l1l1L1L0N9N9P4m9q1M3K6K7OPP5
$$ 3307 3407 3384 3346 3307 3364 3420 3460 3499 3395 3291 3334 3376 3356 3337 3229 3121 3157 3193 3162 3131 3162 3192 3251 3310 3384 3335 3254 3297 3323 3350 3356 3363 3438
408C438m7kjrrO0O1m7j70p1N2j0j32M2J66N6o7r6r5jjP8P7RQO6n7MJ28j5j5P0n3j62m0O9O8
$$ 3438 3391 3389 3388 3379 3370 3430 3491 3444 3274 3203 3255 3245 3113 3155 3321 3377 3310 3214 3119 3118 3117 3195 3272 3281 3289 3355 3298 3302 3430 3415 3400 3470 3417 3255 3215 3284 3352
389C352l7l7N8N7R5k8j03j02m0m0L7q5l9Q5O1O1J15qn0m9Q8l6j83K1%JJ4J3R8R9L6L7j31j32
$$ 3352 3315 3278 3336 3393 3488 3460 3357 3255 3215 3175 3212 3127 3088 3173 3234 3295 3410 3402 3352 3303 3391 3355 3172 3193 3193 3194 3208 3221 3319 3418 3454 3491 3360 3228
372C228j23j24lJ20N1N1L0L0J61L7j07j07J11J11K5K5jj24q1M2l6l5OPK2j02j11J1o5o5J21
$$ 3228 3105 2981 2978 3098 3149 3200 3230 3260 3421 3458 3351 3244 3355 3466 3491 3516 3515 3391 3310 3352 3316 3281 3287 3294 3316 3214 3103 3114 3049 2984 3105
357C105J22j4j4p6M7j4j4p1N3J14rM1M0j10j10R8R9mmK3K3m6P6Q3Q3n2j76m9J56Q7j19n7n7
$$ 3105 3227 3213 3199 3123 3170 3156 3142 3071 3124 3238 3229 3270 3310 3200 3090 3188 3287 3283 3279 3302 3325 3279 3355 3438 3521 3469 3293 3244 3400 3487 3368 3311 3254
340C254O6O5O2o1r4r5P5P5O8O7Oj16j17OJ5J4l8l9M2M2M1M2m6m7m6m7k3k4L8L8Q9Q8n5n5K1
$$ 3254 3320 3385 3447 3386 3292 3197 3272 3347 3415 3482 3488 3372 3255 3261 3276 3290 3252 3213 3255 3297 3338 3380 3334 3287 3241 3194 3171 3147 3185 3223 3312 3400 3345 3290 3311
323C311K2J04k0q3J21O8n5j11j10K5K6j4j4j3j4N3N3n0m9k5k5k5k4J9J8J9J9o4o4J61J61l2
$$ 3311 3333 3437 3417 3334 3455 3523 3468 3357 3247 3272 3298 3284 3270 3257 3243 3296 3349 3299 3250 3225 3200 3175 3151 3170 3188 3207 3226 3162 3098 3259 3420 3388
307C388l2l2l2K2K3K3K2M7M7M7M7j9j8k03k03k9k9P4P4J0RJ0Rl8l7K3K4K6K6l6l5Q2Q2k0k0
$$ 3388 3356 3324 3292 3314 3337 3360 3382 3429 3476 3523 3570 3551 3533 3330 3127 3098 3069 3143 3217 3227 3236 3246 3255 3217 3180 3203 3227 3253 3279 3243 3208 3290 3372 3352 3332
289C332NNn6n6L0L0p3p3K7K6K6K6QRJ11J10l1l1l1l1j3j3M9M8p3p4p4p4M8M8M8M7llllJ5J5
$$ 3332 3337 3342 3286 3230 3260 3290 3217 3144 3171 3197 3223 3249 3257 3266 3377 3487 3456 3425 3394 3363 3350 3337 3386 3434 3361 3287 3213 3139 3187 3235 3283 3330 3327 3324 3321 3318 3333 3348
270C348q8q7L0L0l1l1K2K3K3K2J7J7J7J7L0L0l2l1m4m3J0J1J2j10j07R7J25q0j24jQ2Q3j2
$$ 3348 3260 3173 3203 3233 3202 3171 3193 3216 3239 3261 3278 3295 3312 3329 3359 3389 3357 3326 3282 3239 3249 3260 3272 3162 3055 3152 3277 3197 3073 3072 3154 3237 3225
253C225j3j0j0j0j0K5K6K6K6k9l0P4P3J3J4m9m8j15j15m1Q3K4K5L3L2m8m8Q7Q8J28Oj38j5
$$ 3225 3212 3202 3192 3182 3172 3197 3223 3249 3275 3246 3216 3290 3363 3376 3390 3341 3293 3178 3063 3022 3105 3129 3154 3187 3219 3171 3123 3210 3298 3426 3432 3294 3279
237C279lkNNO5O5MLp3p3KJ24M0L9o3o2P7m7j66L8J23q2j38j38M4M4j7j7Q9R0Q9Q9j09j09p
$$ 3279 3276 3274 3279 3284 3349 3414 3418 3421 3348 3275 3277 3401 3441 3480 3417 3355 3432 3385 3219 3257 3380 3298 3160 3022 3066 3110 3093 3076 3165 3255 3344 3433 3324 3215 3208
219C208pj0rrj0J21J20o3o4J9K0m3m2q1q2L3J57O9P0k6k5p6p6J8J9L3r0j4j3MJ27K4r9noM9
$$ 3208 3201 3191 3182 3173 3163 3284 3404 3341 3277 3296 3316 3273 3231 3150 3068 3101 3258 3327 3397 3371 3346 3270 3194 3212 3231 3264 3174 3160 3147 3151 3278 3302 3203 3198 3192 3241
201C241M8K5K5p8p8m4m5R9R9nnn9n9r0L3O7O7P6P7J4J5L3L3j46k4K2j01mK02R4l0n0m9Q4Q5
$$ 3241 3289 3314 3339 3261 3183 3139 3094 3193 3292 3287 3282 3223 3164 3074 3107 3174 3241 3317 3394 3408 3423 3456 3489 3343 3319 3341 3240 3236 3438 3532 3502 3452 3403 3487 3572
184C572n9n9o1o2n4n3n2P2P1n1L3L3n2P2K1j01j02K2J63L9J4J4N0M9n3n3j12j12J47J47M5
$$ 3572 3513 3454 3393 3331 3277 3224 3172 3244 3315 3264 3297 3330 3278 3350 3371 3270 3168 3190 3353 3392 3406 3420 3470 3519 3466 3413 3301 3189 3336 3483 3528
168C528p8k3R9Lj20J8J9l4l3m1m2K7r6K7K6L0r3l2R1LLJ0J1P1P2j08J6J15qo9N4K1j02j7j7
$$ 3528 3450 3427 3526 3529 3409 3427 3446 3412 3379 3338 3296 3323 3227 3254 3280 3310 3217 3185 3276 3279 3282 3292 3303 3374 3446 3338 3354 3469 3461 3392 3446 3467 3365 3348 3331
151C331k4R8R8k5n5n4jjL7L7L8L7kko3o3n2n2o7N6N4o9qJ16J34J2j4j4L4L4J03k0J7J7r3r3
$$ 3331 3307 3405 3503 3478 3423 3369 3368 3367 3404 3441 3479 3516 3514 3512 3449 3386 3334 3282 3215 3271 3325 3256 3248 3364 3498 3510 3496 3482 3516 3550 3653 3633 3650 3667 3574 3481
133C481q2q2j35P0M4M4O4n8K6K7m2m3p3p3K9L0ppo9o8J9J9J8J9j7j6j7j7o8o8J17J16J8J8
$$ 3481 3399 3317 3182 3252 3296 3340 3404 3346 3372 3399 3357 3314 3241 3168 3197 3227 3220 3213 3144 3076 3095 3114 3132 3151 3134 3118 3101 3084 3016 2948 3065 3181 3199 3217
115C217m4m3R7R7L6L6M5M5n7n7M3M2j8j9j8j8p9p9j5j5J28J28K1K0m1m1OPOPp8p7j5j6j1j0
$$ 3217 3173 3130 3227 3324 3360 3396 3441 3486 3429 3372 3415 3457 3439 3420 3402 3384 3305 3226 3211 3196 3324 3452 3473 3493 3452 3411 3417 3424 3430 3437 3359 3282 3267 3251 3240 3230
97C230j1j0L8L8o5o4MNO6O6O0O0O0N9L1L0j13j13QRr3r4N2N2N3N2k6k6k6k6o5o5llL7L8k5
$$ 3230 3219 3209 3247 3285 3220 3156 3160 3165 3231 3297 3357 3417 3477 3536 3567 3597 3484 3371 3379 3388 3295 3201 3253 3305 3358 3410 3384 3358 3332 3306 3241 3176 3173 3170 3207 3245 3220
79C220k4KLn9n9M5M4M5M4k7k7k7k8J50J49l5l5mno6o5K5K6K5K6R5R6m7m8J2J2r0r0n7n8NM
$$ 3220 3196 3198 3201 3142 3083 3128 3172 3217 3261 3234 3207 3180 3152 3302 3451 3416 3381 3377 3372 3306 3241 3266 3292 3317 3343 3438 3534 3487 3439 3451 3463 3373 3283 3226 3168 3173 3177
60C177N1N1J12J13j51j50L4L4M2M2M1M2p4p4P0P0k1k1k0k1kllkK3K3p9p9R6R6ooj33j32R3
$$ 3177 3228 3279 3391 3504 3353 3203 3237 3271 3313 3355 3396 3438 3364 3290 3360 3430 3409 3388 3368 3347 3345 3342 3339 3337 3360 3383 3304 3225 3321 3417 3411 3405 3272 3140 3233
43C233R3PPPQO8O9p5p5ooo7o7J4J4J4J4P7P7o7o6r3r2R2R2KJJJO8O8OOm6m6m6m6J8J9J9J8
$$ 3233 3326 3333 3340 3347 3355 3423 3492 3417 3342 3336 3330 3263 3196 3210 3224 3238 3252 3329 3406 3339 3273 3180 3088 3180 3272 3274 3275 3276 3277 3345 3413 3419 3425 3379 3333 3287 3241 3259 3278 3297 3315
22C315r5r5PPP0P1j4J09Q8j57j42j9RRJ7J7L8L7j06j06M9M8M9M9O5O5l7l7m4m5J7J7J4J5m7
$$ 3315 3220 3125 3132 3139 3209 3280 3266 3375 3463 3306 3164 3145 3154 3163 3180 3197 3235 3272 3166 3060 3109 3157 3206 3255 3320 3385 3348 3311 3267 3222 3239 3256 3270 3285 3238
5C238m7K7K7LJ27J03j44j28nK9K9M4M4j29nK7K8QPP0O9n7n6n6n7K4K4J01k2r5K7N4N3n5n5
$$ 3238 3191 3218 3245 3248 3375 3478 3334 3206 3201 3230 3259 3303 3347 3218 3213 3240 3268 3276 3283 3353 3422 3365 3309 3253 3196 3220 3244 3345 3323 3228 3255 3309 3362 3307 3252
-13C252m2m2j6J88J43J9j07j07m1m1r5J09J25Jl7l7K9J52j7j7O0o3m7m7n5n5O2O3KJM5M5j7
$$ 3252 3210 3168 3152 3340 3483 3502 3395 3288 3247 3206 3111 3220 3345 3346 3309 3272 3301 3453 3436 3419 3479 3416 3369 3322 3267 3212 3274 3337 3339 3340 3385 3430 3413
-30C413j6J4J4J4J4k4k4j02K2Q0m4o9o9n3n2n3n2J11J12J11J11J3J2j31j31RRpJ16j1j34J7
$$ 3413 3397 3411 3425 3439 3453 3429 3405 3303 3325 3405 3361 3292 3223 3170 3118 3065 3013 3124 3236 3347 3458 3471 3483 3352 3221 3230 3239 3232 3348 3337 3203 3220
-46C220J40LLP9m3p4p4O2O2n7n7Q6Q6J2J2m2m3o7N5j4j4j4j4j4j3K4K5jj24j9J03P6P5N0j55
$$ 3220 3360 3363 3366 3445 3402 3328 3254 3316 3378 3321 3264 3350 3436 3448 3460 3418 3375 3308 3363 3349 3335 3321 3307 3293 3280 3304 3329 3328 3204 3185 3288 3364 3439 3489 3334
-63C334o5J39K3j83PPKKKKL0L0K9L0n7n7M5M5o9o9L3L4M0M0o3o3K0K0J9K0M4M4n8n9q8q9N5
$$ 3334 3269 3408 3431 3248 3255 3262 3264 3266 3268 3270 3300 3330 3359 3389 3332 3275 3320 3365 3296 3227 3260 3294 3334 3374 3311 3248 3268 3288 3307 3327 3371 3415 3357 3298 3210 3121 3176
-82C176N4k0k1M0M1J1J2J1J1K4K4K4K4qqj11j11kkJ01J01j30j29N5N5P6P6k7k7P7P7k6k5q7
$$ 3176 3230 3210 3189 3229 3270 3281 3293 3304 3315 3339 3363 3387 3411 3403 3395 3284 3173 3171 3169 3270 3371 3241 3112 3167 3222 3298 3374 3347 3320 3397 3474 3448 3423 3336
-99C336q7M3M4R1j14j63l9N6J79M4q0j7j7k5k5P8P8J6J6j3j3j3j3n8n8MLQ2Q2k9k8K5r8m9
$$ 3336 3249 3292 3336 3427 3313 3150 3111 3167 3346 3390 3310 3293 3276 3251 3226 3304 3382 3398 3414 3401 3388 3375 3362 3304 3246 3250 3253 3335 3417 3388 3360 3385 3287 3238
-116C238J56M6p7r7r8KJJJN8N7mnL6L5o7o7m8m8J4J4M3M3M3M3n2n3RRK1K0K1K0m4m4m4m4L8
$$ 3238 3394 3440 3363 3266 3168 3170 3171 3172 3173 3231 3288 3284 3279 3315 3350 3283 3216 3168 3120 3134 3148 3191 3234 3277 3320 3268 3215 3224 3233 3254 3274 3295 3315 3271 3227 3183 3139 3177
-135C177L7k3k4O2O2q1q2Q6Q7Q6Q7j25j24o3o3O9O9p4M8J07r8j06J7N5N6m0l9qqQ2Q2j8k23
$$ 3177 3214 3191 3167 3229 3291 3210 3128 3214 3301 3387 3474 3349 3225 3162 3099 3168 3237 3163 3211 3318 3220 3114 3131 3186 3242 3202 3163 3155 3147 3229 3311 3293 3070
-152C070l9J66L4L4j5j5p6p5O9O8l2l3l2l2M7M7M7M7r9r9l7l8N9N8J20J20QPn4n5R2R2n2n1
$$ 3070 3031 3197 3231 3265 3250 3235 3159 3084 3153 3221 3189 3156 3124 3092 3139 3186 3233 3280 3181 3082 3045 3007 3066 3124 3244 3364 3372 3379 3325 3270 3362 3454 3402 3351
-169C351j08j08P6P6K0K0m1m1o6o6L7L6N4N3N3N4mmj47j47k2k3Q0Q0N5N6m7m7O9O9Q9j16j18
$$ 3351 3243 3135 3211 3287 3307 3327 3286 3245 3179 3113 3150 3186 3240 3293 3346 3400 3396 3392 3245 3098 3076 3053 3133 3213 3268 3324 3277 3230 3299 3368 3457 3341 3223
-185C223Nn2P2J23jJ6J5j17j16j4j4N0N0J12r3k61j37M8M7J35J36P4P5kjqrO4n9n8O4qrP7
$$ 3223 3228 3176 3248 3371 3370 3386 3401 3284 3168 3154 3140 3190 3240 3352 3259 2998 2861 2909 2956 3091 3227 3301 3376 3374 3373 3365 3356 3420 3361 3303 3367 3359 3350 3427
-202C427m7j47k3KJJ9J8Q0Q0j5j5j5j5p0o9j38j6P8P8L2L2o2O1qqM5M6j6j6J4J4J4J4l7l7
$$ 3427 3380 3233 3210 3212 3213 3232 3250 3330 3410 3395 3380 3365 3350 3280 3211 3073 3057 3135 3213 3245 3277 3215 3276 3268 3260 3305 3351 3335 3319 3333 3347 3361 3375 3338 3301
-220C301J47n8q2M0j23%O8j36M8M8j8j9j00K2J80k5j27j27J00J01L1L2Q5l8L2L1m9n0m9n0
$$ 3301 3448 3390 3308 3348 3225 3225 3293 3157 3205 3253 3235 3216 3116 3138 3318 3293 3166 3039 3139 3240 3271 3303 3388 3350 3382 3413 3364 3314 3265 3215
-235C215o5o4l2R2J15J16Qj14n4n3J%M0M1J01J02l4l4r5r6n8n9P8P7N7o6j2J11J29Oj42j42
$$ 3215 3150 3086 3054 3146 3261 3377 3385 3271 3217 3164 3165 3165 3205 3246 3347 3449 3415 3381 3286 3190 3132 3073 3151 3228 3285 3219 3207 3318 3447 3453 3311 3169
-251C169%%J%J7J7Q7Q6p8M4n8j81K2K2J17J17m9m8m8m9n9n9M3M3J04J03JJk6k6j28j28O5O5
$$ 3169 3169 3169 3170 3170 3187 3204 3291 3377 3299 3343 3285 3104 3126 3148 3265 3382 3333 3285 3237 3188 3129 3070 3113 3156 3260 3363 3364 3365 3339 3313 3185 3057 3122 3187
-268C187MMJ7J7J7J7p4p4p3p4j2j2j2j1J5J5O6j80l8K07N4N3j41j41Q4Q4N9N9q0J67k5k4r
$$ 3187 3191 3195 3212 3229 3246 3263 3189 3115 3042 2968 2956 2944 2932 2921 2936 2951 3017 2837 2799 3006 3060 3113 2972 2831 2915 2999 3058 3117 3037 3204 3179 3155 3146
-285C146rkjkjP0P1j14j15N0M9J11J11J5J5q8q7J5J6J6J5LKLLMLr9r8PQr5r5Q9R0n4n4J1J2
$$ 3146 3137 3135 3134 3132 3131 3201 3272 3158 3043 3093 3142 3253 3364 3379 3394 3306 3219 3234 3250 3266 3281 3284 3286 3289 3292 3296 3299 3200 3102 3109 3117 3022 2927 3016 3106 3052 2998 3009 3021
-304C021P3P2l4l4l3l4M4M4j7j8L7L6o6o6q0q0q0q0J53J54l2l1J6J7J6J6O2O3O2O2K4K4l8
$$ 3021 3094 3166 3132 3098 3065 3031 3075 3119 3102 3084 3121 3157 3091 3025 2945 2865 2785 2705 2858 3012 2980 2949 2965 2982 2998 3014 3076 3139 3201 3263 3287 3311 3273
-321C273l7m1m2m8P4M1M1n4n4P4P3p0p0n4n4M2M1L3r0r0L3J57J58o1j83q9J17J24Kj1j0j8
$$ 3273 3236 3195 3153 3105 3179 3220 3261 3207 3153 3227 3300 3230 3160 3106 3052 3094 3135 3168 3078 2988 3021 3178 3336 3275 3092 3003 3120 3244 3246 3235 3225 3207
-337C207j8l4l3r6r5P3P4k1k1m2Q1Q1m2N4N4n6n6L8L8Nj18m9m9M6M6n7n8k4R8J27J27k1j45
$$ 3207 3189 3155 3122 3026 2931 3004 3078 3057 3036 2994 3075 3156 3114 3168 3222 3166 3110 3148 3186 3191 3073 3024 2975 3021 3067 3010 2952 2928 3026 3153 3280 3259 3114
-353C114LKM9M9k4j48q5L7J9J9K7K6j5j6j5j6QPo9N4O5n7K6K7j34j2J04J04J4J4OOk4j48m5
$$ 3114 3117 3119 3168 3217 3193 3045 2960 2997 3016 3035 3062 3088 3073 3057 3042 3026 3034 3041 2972 3026 3091 3034 3060 3087 2953 2941 3045 3149 3163 3177 3183 3189 3165 3017 2972
-371B972P8L2L1J01k2n9j82r2J13l5l5k1k2Q6Q6Q5Q6m6m6J5J6J2J2J35p0j89o5P7P8p2p3L
$$ 2972 3050 3082 3113 3214 3192 3133 2951 2859 2972 2937 2902 2881 2859 2945 3031 3116 3202 3156 3110 3125 3141 3153 3165 3300 3230 3041 2976 3053 3131 3059 2986 2989
-387B989Kq6J19J78j10j80K4L5L4l8l8O4O4L9L8k2k3K2K2K2K3j02j02l3l2p8M6L8L7L1L1j08
$$ 2989 2991 2905 3024 3202 3092 2912 2936 2971 3005 2967 2929 2993 3057 3096 3134 3112 3089 3111 3133 3155 3178 3076 2974 2941 2909 2831 2877 2915 2952 2983 3014 2906
-403B906J5M9p4j29no2o2Q9Q9J19J20o5o4N2N3qrm8m8m9m8J21J21j37j38%J22K0j03jjJ2J35
$$ 2906 2921 2970 2896 2767 2762 2700 2638 2727 2816 2935 3055 2990 2926 2978 3031 3023 3014 2966 2918 2869 2821 2942 3063 2926 2788 2788 2910 2930 2827 2826 2825 2837 2972
-420B972J71l3j71m8J09j3oJ17p9p9o3o4L1J53J53L0K2K1o1j84RQo8N4K02K02J2j10r0r0J3
$$ 2972 3143 3110 2939 2891 3000 2987 2981 3098 3019 2940 2877 2813 2844 2997 3150 3180 3202 3223 3162 2978 2987 2995 2927 2981 3183 3385 3397 3287 3197 3107 3120
-435C120J2n4O9P2j33k22O6J50n5K4K5n0n0J5J5K2j00n4n3o1o0l0k9J20K42N3p0POOOO7O7
$$ 3120 3132 3078 3147 3219 3086 2864 2930 3080 3025 3049 3074 3024 2974 2989 3004 3026 2926 2872 2819 2758 2698 2668 2639 2759 3001 3054 2984 2991 2997 3003 3009 3076 3143
-452C143ONOON0N1j34j34K2K3K2K2L9L9k3k3j09j08poN6N6m6m7KLKKN5N6N5N5o2o2o3o2N6
$$ 3143 3149 3154 3160 3166 3216 3267 3133 2999 3021 3044 3066 3088 3127 3166 3143 3120 3011 2903 2896 2890 2946 3002 2956 2909 2911 2914 2916 2918 2973 3029 3084 3139 3077 3015 2952 2890 2946
-470B946N7N7N6q9q9k8k8q9q8J4J4L8L8L9L8P6P6o7o8j04j05L9L9J28J29n6n6J2J2J2J2M3
$$ 2946 3003 3060 3116 3027 2938 2910 2882 2793 2705 2719 2733 2771 2809 2848 2886 2962 3038 2971 2903 2799 2694 2733 2772 2900 3029 2973 2917 2929 2941 2953 2965 3008
-486C008M2r3r4m7P6J29p5j29pR6R6rrqrN9O0q3q4j8j8M3M3N5N5m8m7o0n9M4M3j9j9j9j8l0
$$ 3008 3050 2957 2863 2816 2892 3021 2946 2817 2810 2906 3002 2993 2984 2976 2967 3026 3086 3003 2919 2901 2883 2926 2969 3024 3079 3031 2984 2924 2865 2909 2952 2933 2914 2895 2877 2847
-504B847k9k9k9m8m7R5R6Q5Q5j40j40J4J3J4J4l9l9J04J05o5o4L0L0P0n3m5m6N0N0N0N0L9
$$ 2847 2818 2789 2760 2712 2665 2760 2856 2941 3026 2886 2746 2760 2773 2787 2801 2762 2723 2827 2932 2867 2803 2833 2863 2933 2880 2835 2789 2839 2889 2939 2989 3028
-521C028L8j5j5n8O6J27Mj36j37m2m2m7m7k2J02R5k8k8R5n9j83Q6Q6o4O0J20kj13j14q8L5
$$ 3028 3066 3051 3036 2978 3044 3171 3175 3039 2902 2860 2818 2771 2724 2702 2804 2899 2871 2843 2938 2879 2696 2782 2868 2804 2864 2984 2982 2869 2755 2667 2702
-536B702RJ0JJ25Q5l9k3k2k6k5q7q7m8m7Q8Q8J77N4o2o1M8M8M0M0k2j46q4L9J32J33L7L7m5
$$ 2702 2711 2721 2722 2847 2932 2893 2870 2848 2822 2797 2710 2623 2575 2528 2616 2704 2881 2935 2873 2812 2860 2908 2948 2988 2966 2820 2736 2775 2907 3040 3077 3114 3069
-553C069m6l8l9p9M4K8K8L5q8j9k0K0K0J9K0k9k9O6O5L6q7J26J26j40j40p8p8oopok3k3L9
$$ 3069 3023 2985 2946 2867 2911 2939 2967 3002 2914 2895 2875 2895 2915 2934 2954 2925 2896 2962 3027 3063 2976 3102 3228 3088 2948 2870 2792 2786 2780 2773 2767 2744 2721 2760
-570B760L8P5P4J4j92j00K4M4M4%%O2j44p5M7l1l0MO6L9q4p8p9n0P4R5J57J01k3q7k7P7J4
$$ 2760 2798 2873 2947 2961 2769 2669 2693 2737 2781 2781 2781 2843 2699 2624 2671 2640 2610 2614 2680 2719 2635 2557 2478 2428 2502 2597 2754 2855 2832 2745 2718 2795 2809
-586B809j9J04l9j62k2M0M0k1j5J08O9QJ1J0PPp2p1L1L1nnk4q6j10J3M3M2j6j7Q6Q7N9N9l
$$ 2809 2790 2894 2855 2693 2671 2711 2751 2730 2715 2823 2892 2900 2911 2921 2928 2935 2863 2792 2823 2854 2849 2844 2820 2734 2624 2637 2680 2722 2706 2689 2775 2862 2921 2980 2977
-604B977kn3n2RRm9m8m1m1MJ27P3n0r4L0J24Jj59j59j4J09j2p4l1l2NMllN8o4o4N9J22J23
$$ 2977 2975 2922 2870 2879 2888 2839 2791 2750 2709 2713 2840 2913 2863 2769 2799 2923 2924 2765 2606 2592 2701 2689 2615 2584 2552 2557 2561 2558 2555 2613 2549 2485 2544 2666 2789
-621B789n4n4R5R6m9m8J0Rn2n2L3L3L3L3M9M8j3j3p4p5p4p5j3j3R1K9K9J51Q6l6q1q0k7k6
$$ 2789 2735 2681 2776 2872 2823 2775 2785 2794 2742 2690 2723 2756 2789 2822 2871 2919 2906 2893 2819 2744 2670 2595 2582 2569 2660 2689 2718 2869 2955 2919 2838 2758 2731 2705
-638B705j05j04m4m3O1O0qJ14J35J36m2m1K4K4j48k5R8R7P2n1q5q6JKK7r5r6K8M4M4j0j0n7
$$ 2705 2600 2496 2452 2409 2470 2530 2522 2636 2771 2907 2865 2824 2848 2872 2724 2699 2797 2894 2966 2915 2830 2744 2745 2747 2774 2679 2583 2611 2655 2699 2689 2679 2622
-655B622n8M4M5NNr7r8O2O2N4N5N5o7j37j3P7m6l5J70J00j05j07j07p3J33P8P9QQQQL8L8k3
$$ 2622 2564 2608 2653 2658 2663 2566 2468 2530 2592 2646 2701 2756 2689 2552 2539 2616 2570 2535 2705 2805 2700 2593 2486 2413 2546 2624 2703 2711 2719 2727 2735 2773 2811 2788
-672B788k4q0p9j9j8k9k9k1k2l0R3K00nj54j54J00J00L1L2L2L2j39j38N4N4j67m5L0K9R6R6
$$ 2788 2764 2684 2605 2586 2568 2539 2510 2489 2467 2437 2530 2730 2725 2571 2417 2517 2617 2648 2680 2712 2744 2605 2467 2521 2575 2408 2363 2393 2422 2518 2614
-688B614K7K6J9j03j04J9L6L7N2N3j7J06K9K9K0j02k6k6j10J3lkK33J11j27j28jjp0N4J6J7
$$ 2614 2641 2667 2686 2583 2479 2498 2534 2571 2623 2676 2659 2765 2794 2823 2843 2741 2715 2689 2579 2592 2589 2587 2820 2931 2804 2676 2675 2674 2604 2658 2674 2691
-704B691M5p8j99NJ41J41Lj20o6N6L9q4p7M7onKKRRQRk4k4P9P9m6m6J6J6j29j28R7R7l2l1
$$ 2691 2736 2658 2459 2464 2605 2746 2749 2629 2563 2619 2658 2574 2497 2544 2538 2533 2535 2537 2546 2555 2563 2572 2548 2524 2603 2682 2636 2590 2606 2622 2493 2365 2462 2559 2527 2496
-722B496L0L1M3M2n9o0O8O7L4q9l8l8j14QJ3J4K1K1o1o2%%M9M9M9M8m3m4N9N9O3O3q8q8Jj21
$$ 2496 2526 2557 2600 2642 2583 2523 2591 2658 2692 2603 2565 2527 2413 2421 2434 2448 2469 2490 2429 2367 2367 2367 2416 2465 2514 2562 2519 2475 2534 2593 2656 2719 2631 2543 2544 2423
-740B423k7R6R9k4j27lJ15pPQLLLKl3l3M9p4q6J20J27Mm5m5n2n2M2M3j9j9K8K8K7K8n5n5M7
$$ 2423 2396 2492 2591 2567 2440 2437 2552 2545 2552 2560 2563 2566 2569 2571 2538 2505 2554 2480 2394 2514 2641 2645 2600 2555 2503 2451 2493 2536 2517 2498 2526 2554 2581 2609 2554 2499 2546
-758B546M7k5k4L6L7o4o4q0M3Q7l6L3L3J56L3q2q3k9l0j07J7J25Kj26kk4R9K01P9j19k42j11
$$ 2546 2593 2568 2544 2580 2617 2553 2489 2409 2452 2539 2503 2536 2569 2725 2758 2676 2593 2564 2534 2427 2444 2569 2571 2445 2443 2419 2518 2719 2798 2679 2437 2326
-774B326R4K8K8o1o2QQQPL0L0K9L0n4n3M9M9l6l6l5l6K3K3Q5Q5k1k2k1k1ooq3M0J1j12L4L5
$$ 2326 2420 2448 2476 2415 2353 2361 2369 2377 2384 2414 2444 2473 2503 2449 2396 2445 2494 2458 2422 2387 2351 2374 2397 2482 2567 2546 2524 2503 2482 2476 2470 2387 2427 2438 2326 2360 2395
-793B395p9M4P0P0K0j02j57M8R6k7ppk8k9l7Q7k8k7k8k7M6p6j79n5J17J17J94P1J4J3OOl3
$$ 2395 2316 2360 2430 2500 2520 2418 2261 2309 2405 2378 2371 2364 2336 2307 2270 2357 2329 2302 2274 2247 2293 2217 2038 1983 2100 2217 2411 2482 2496 2509 2515 2521 2488
-810B488l4l4l3n3n2N8N8o8N6pj29Q0Q0N9N9M0j65j19Mj0j0kkK7K7n0P4R2l1j6j6K7K6l5l5
$$ 2488 2454 2420 2387 2334 2282 2340 2398 2330 2386 2379 2250 2330 2410 2469 2528 2568 2403 2284 2288 2278 2268 2266 2264 2291 2318 2268 2342 2434 2403 2387 2371 2398 2424 2389 2354
-827B354l4l5O8O8m1m0m1m1j2j2J31J32l7l6l7l6J5J5o2O1O9n4q0p9l1l0q5q4jJ22N3N3r0
$$ 2354 2320 2285 2353 2421 2380 2340 2299 2258 2246 2234 2365 2497 2460 2424 2387 2351 2366 2381 2319 2380 2449 2395 2315 2236 2205 2175 2090 2006 2005 2127 2180 2233 2143
-844B143q9J3J3P2P2P2P2k0k1J22J23q1q1q9L5M4M4r2r1K5K5p8p7N1N2N1N1j1j2j1j2l6l6
$$ 2143 2054 2067 2080 2152 2224 2296 2368 2348 2327 2449 2572 2491 2410 2321 2356 2400 2444 2352 2261 2286 2311 2233 2156 2207 2259 2310 2361 2350 2338 2327 2315 2279 2243
-860B243l6l5M0M1k0k1j3j4Q9Q9O1O1j29k52j03K0J8J40P9P9R4k9o0o0ooj0j0p1p1L8L9J08
$$ 2243 2207 2172 2212 2253 2233 2212 2199 2185 2274 2363 2424 2485 2356 2104 2001 2021 2039 2179 2258 2337 2431 2402 2342 2282 2276 2270 2260 2250 2179 2108 2146 2185 2293
-877B293j5k5k6l3l3o5o4J19J20n7n7n7n7P5P5k7k8l7l8J39J39K7r7r6K6J8J7K5K5K9K8n4
$$ 2293 2278 2253 2227 2194 2161 2096 2032 2151 2271 2214 2157 2100 2043 2118 2193 2166 2138 2101 2063 2202 2341 2368 2271 2175 2201 2219 2236 2261 2286 2315 2343 2289
-893B289P0J33p1j39O7J04j00l4l5j12j12LJ26KLJ0J0J6J7P8P8q0p9j8j8q7q7O5O4k3J00J23
$$ 2289 2359 2492 2421 2282 2349 2453 2353 2319 2284 2172 2060 2063 2189 2191 2194 2204 2214 2230 2247 2325 2403 2323 2244 2226 2208 2121 2034 2099 2163 2140 2240 2363
-909B363j23j43J02Q0m4oop6p5J5J6J5J6N0N1j2j1K9K8l3l3p0p1L2L1P8P8J7J6p7p8K6K5J6
$$ 2363 2240 2097 2199 2279 2235 2229 2223 2147 2072 2087 2103 2118 2134 2184 2235 2223 2212 2241 2269 2236 2203 2133 2062 2094 2125 2203 2281 2298 2314 2237 2159 2185 2210 2226
-926B226J7J6J6m7m7N5N6n6n7ONO0O0jkq9r0N3N4QQRQl3l3l3l3J66J66o0o0r2r2r1r2K3K2
$$ 2226 2243 2259 2275 2228 2181 2236 2292 2236 2179 2185 2190 2250 2310 2309 2307 2218 2128 2181 2235 2243 2251 2260 2268 2235 2202 2169 2136 2302 2468 2408 2348 2256 2164 2073 1981 2004 2026
-945B026K3K3R0Q9r5r5N1N1j33j33K1K2K2K2J9J9m2m3R6R6ook1k1k1k1R3R3j0rj07j06mlm6
$$ 2026 2049 2072 2162 2251 2156 2061 2112 2163 2030 1897 1918 1940 1962 1984 2003 2022 1980 1937 2033 2129 2123 2117 2096 2075 2054 2033 2126 2219 2209 2200 2093 1987 1983 1980 1934
-962A934m6J5J6M5M5M6M5lmllL2L3o9p0j9j8j8j9M3M3o0o0N4N4ppM1M1k1k0MMMMO1O2m1m1
$$ 1934 1888 1903 1919 1964 2009 2055 2100 2097 2093 2090 2087 2119 2152 2083 2013 1994 1976 1958 1939 1982 2025 1965 1905 1959 2013 2006 1999 2040 2081 2060 2040 2044 2048 2052 2056 2117 2179 2138 2097
-982B097Q8Q9n5n5K4K4j20j19L0L1L0L1O9O9p5p4M4M5j7j7r4r4l2l3P0P0l2l3l6l7O7O6j3
$$ 2097 2185 2274 2219 2164 2188 2212 2092 1973 2003 2034 2064 2095 2164 2233 2158 2084 2128 2173 2156 2139 2045 1951 1919 1886 1956 2026 1994 1961 1925 1888 1955 2021 2008
-998B008j4p4p5J23J23j02j02l9m0K2K2K1K0K1K0n9n9M4M3p3p3p4p3O1O1O1O2LLLKM7M7j5
$$ 2008 1994 1920 1845 1968 2091 1989 1887 1848 1808 1830 1852 1873 1893 1914 1934 1875 1816 1860 1903 1830 1757 1683 1610 1671 1732 1793 1855 1858 1861 1864 1866 1913 1960 1945
-1015A945j5n4n4R0R0J3J2q9r0N2N2j0j0P2P3j13J1k4k30j14Rj1j0llJJJ03J03Q2Q1k1k1o7
$$ 1945 1930 1876 1822 1912 2002 2015 2027 1938 1848 1900 1952 1942 1932 2004 2077 1964 1975 1951 1721 1607 1616 1605 1595 1592 1589 1590 1591 1694 1797 1879 1960 1939 1918 1851
-1032A851o6P6m6o2J42J34p0rqq3q3o8o7ooRJ0RRJ%O2O2lko4o4P7P8k6k5j2j1J31J32N0N0
$$ 1851 1785 1861 1815 1753 1895 2029 1959 1950 1942 1859 1776 1708 1641 1635 1629 1638 1648 1657 1666 1667 1667 1729 1791 1788 1786 1722 1658 1735 1813 1787 1762 1750 1739 1870 2002 2052 2102
-1051B102j35j34P3P2j11j12r4r3M9N0k2k2Q0Q1k1k1k0k1O5O5l7l7J1J2J1J2Q5Q6m6m5j32
$$ 2102 1967 1833 1906 1978 1867 1755 1661 1568 1617 1667 1645 1623 1703 1784 1763 1742 1722 1701 1766 1831 1794 1757 1768 1780 1791 1803 1888 1974 1928 1883 1751
-1067A751P2J70M7n2n2o0o0R5R5q9r0n0m9N2N3q9r0q9r0Q6Q5j7j7P8P9k3k4n6n7M7M6l2l2
$$ 1751 1823 1993 2040 1988 1936 1876 1816 1911 2006 1917 1827 1777 1728 1780 1833 1744 1654 1565 1475 1561 1646 1629 1612 1690 1769 1746 1722 1666 1609 1656 1702 1670 1638
-1083A638J12J11%%j%l7l8O5O5m4m4j06j06M8M7j3j4n1n1J25J26K2j01oJ16J6j07l0l1l1l2
$$ 1638 1750 1861 1861 1861 1860 1860 1823 1785 1850 1915 1871 1827 1721 1615 1663 1710 1697 1683 1632 1581 1706 1832 1854 1753 1747 1863 1879 1772 1742 1711 1680 1648
-1099A648l1l2L5L5L5L4m8m8m9m8P8P9k4k4M9M9M8M9j2j2O5n8j39j6M3M3M5p8qrl0l0L1L1
$$ 1648 1617 1585 1620 1655 1690 1724 1676 1628 1579 1531 1609 1688 1664 1640 1689 1738 1786 1835 1823 1811 1876 1818 1679 1663 1706 1749 1794 1716 1708 1699 1669 1639 1670 1701
-1116A701N5N6ool7l7r8r8K6K5J1J33J01k1p6M8j5j5P0n3r2L1RQL5q8j9j9lmq0M2J06j8lk
$$ 1701 1756 1812 1806 1800 1763 1726 1628 1530 1556 1581 1592 1725 1826 1805 1729 1777 1762 1747 1817 1764 1672 1703 1712 1720 1755 1667 1648 1629 1626 1622 1542 1584 1690 1672 1669 1667
-1134A667K7K7J2J34k1j44q3M0O6n7q3q3M8M8J43J42M5p9j90o6P9m5r6J09N3j53k4k4J03J03
$$ 1667 1694 1721 1733 1867 1846 1702 1619 1659 1725 1668 1585 1502 1550 1598 1741 1883 1928 1849 1659 1593 1672 1627 1531 1640 1693 1540 1516 1492 1595 1698
-1149A698P8m6j46k4M3M3p4p5O9P0j2j1j2j2P2P1j49k6N5o8RQk1k2k1k2l6l7J06J07L5L6j42
$$ 1698 1776 1730 1584 1560 1603 1646 1572 1497 1566 1636 1624 1613 1601 1589 1661 1732 1583 1557 1612 1544 1553 1561 1540 1518 1497 1475 1439 1402 1508 1615 1650 1686 1544
-1166A544j41J0J33Pj98K6K32K9r4j9j8k6k6P5P5J4j09j26P9Q7l6ppQ8Q8m9m9M6M6k0j42j43
$$ 1544 1403 1413 1546 1553 1355 1381 1613 1642 1548 1529 1511 1485 1459 1534 1609 1623 1514 1388 1467 1554 1518 1511 1504 1592 1680 1631 1582 1628 1674 1654 1512 1369
-1182A369j9J32J31O5n8J3J2NNp4p3j2j2J29J29j4j5o4o5n7n7o0O3N5N6qpqpl3l2M4p9m9P4
$$ 1369 1350 1482 1613 1678 1620 1633 1645 1650 1655 1581 1508 1496 1484 1613 1742 1728 1713 1649 1584 1527 1470 1410 1473 1528 1584 1576 1569 1561 1554 1521 1489 1533 1454 1405 1479
-1200A479llj9j9M2M3j0j1N2N1M3M2l1j55N1N2M4M4J6J6m5m5l9l9L1L0j03J9M6M5j2j36P7
$$ 1479 1476 1473 1454 1435 1477 1520 1510 1499 1551 1602 1645 1687 1656 1501 1552 1604 1648 1692 1708 1724 1679 1634 1595 1556 1587 1617 1514 1533 1579 1624 1612 1476 1553
-1216A553P8m7m6m7m7K2K1nj27j40j7N0N0JJJ80N7j4J08p6j99j5J08L2L1ppqpl6l7k9k9j6
$$ 1553 1631 1584 1538 1491 1444 1466 1487 1482 1355 1215 1198 1248 1298 1299 1300 1480 1537 1523 1631 1555 1356 1341 1449 1481 1512 1505 1498 1490 1483 1447 1410 1381 1352 1336
-1233A336J07J32J33j4j36p5M8l4l4k6k5n5n4M9M8o5o6o6o5M9N0N0M9J16J15j85j84l5Q8L5
$$ 1336 1443 1575 1708 1694 1558 1483 1531 1497 1463 1437 1412 1357 1303 1352 1400 1335 1269 1203 1138 1187 1237 1287 1336 1452 1567 1382 1198 1163 1251 1286
-1248A286q9JJ24n5n5L8L9L8L8N4N3qqq4q3O7O8j5J09M7p6j6j6k3k4p5p4m9P4N2p1OOl3l2
$$ 1286 1197 1198 1322 1267 1212 1250 1289 1327 1365 1419 1472 1464 1456 1372 1289 1356 1424 1409 1518 1565 1489 1473 1457 1434 1410 1335 1261 1212 1286 1338 1267 1273 1279 1246 1214
-1266A214R6j10o9J35%jK5r9L3L2r0q9R5R5r4r5N0M9Q7Q8n6n6J06J06l7l8k4k3P9P9l9l8m6
$$ 1214 1310 1200 1131 1266 1266 1265 1290 1191 1224 1256 1166 1077 1172 1267 1173 1078 1128 1177 1264 1352 1296 1240 1346 1452 1415 1377 1353 1330 1409 1488 1449 1411 1365
-1282A365m7k7j50j4J09J74N0k3k4l3j55j2J11k6k5j0ro3O1J2j93j03K1Q1Q2K3K3l8l9J77
$$ 1365 1318 1291 1141 1127 1236 1410 1460 1437 1413 1380 1225 1213 1324 1298 1273 1263 1254 1191 1252 1264 1071 968 989 1070 1152 1175 1198 1160 1121 1298
-1297A298J77K1j02m5m4n3n2l3l4K8K8jkM8M7Kk02r5K8K3K2L1L1K8K9J05j7j43k0P5m8m7m7
$$ 1298 1475 1496 1394 1349 1305 1252 1200 1167 1133 1161 1189 1188 1186 1234 1281 1283 1081 986 1014 1037 1059 1090 1121 1149 1178 1283 1266 1123 1103 1178 1130 1083 1036
-1314A036M8M8J13J13l0l1n0n0n0n0N4N4qqL1L1J6j90p0J35P6m7k1k1L4L3K9L0l2l3k4k4r3
$$ 1036 1084 1132 1245 1358 1328 1297 1247 1197 1147 1097 1151 1205 1197 1189 1220 1251 1267 1077 1007 1142 1218 1171 1150 1129 1163 1196 1225 1255 1223 1190 1166 1142 1049
-1331A049r3J55L2PPj08J6PQJ3J3P4P5j17j16j4j4P3P3o2o3n8O6N8N7j9j9M3J65J15q9r7K5
$$ 1049 956 1111 1143 1150 1157 1049 1065 1072 1080 1093 1106 1180 1255 1138 1022 1008 994 1067 1140 1078 1015 957 1023 1081 1138 1119 1100 1143 1308 1423 1334 1237 1262
-1347A262p6p7K6K5j3j36m6J59J07j6NNQ5Q5R3l1j26j27l1l2k9l0k9k9m5m5N8N8L9L9L9L9
$$ 1262 1186 1109 1135 1160 1147 1011 965 1124 1231 1215 1220 1225 1310 1395 1488 1457 1331 1204 1173 1141 1112 1082 1053 1024 979 934 992 1050 1089 1128 1167 1206
-1363A206KKP1n1j9j8j8j8j77n4k1k1K9K8R0R0j1j1j1j2n9o0JKK9K8l3l3J08J08l5l6j7j8
$$ 1206 1208 1210 1281 1230 1211 1193 1175 1157 980 926 905 884 913 941 1031 1121 1110 1099 1088 1076 1017 957 958 960 989 1017 984 951 1059 1167 1132 1096 1079 1061
-1380A061q7L6mnQ0m3r0L3K5r8O9O9%%m2m3O0O1K1K2m0m0mmJ1j12o4N8M2M3kkkkj16j16rJ15
$$ 1061 974 1010 1006 1001 1081 1038 948 981 1006 908 977 1046 1046 1046 1004 961 1021 1082 1103 1125 1085 1045 1041 1037 1048 936 872 930 972 1015 1013 1011 1009 1007 891 775 766 881
-1399H81J05j7m3m3O5O6p1p1K5J47l7l8J40o6j2j3r9r9p9J27R5k7q2q1J4J36J4J3pJ16K6j79
$$ 881 986 969 926 883 948 1014 943 872 897 1044 1007 969 1109 1043 1031 1018 919 820 741 868 963 936 854 773 787 923 937 950 943 1059 1085 906
-1415I06MJ27L8L7M4p9p1p1P6P6o8o7J1J1mJ18N2p0j38j37J2J3P4P5L9M0l0k9K4r9k9l0p1
$$ 906 910 1037 1075 1112 1156 1077 1006 935 1011 1087 1019 952 963 974 970 1088 1140 1070 932 795 807 820 894 969 1008 1048 1018 989 1013 914 885 855 784
-1432G84p2j1j0klo9J36K48M3r4r5O9O9l4l3k0j9N7o5M2J65K0J9m1j64%%R7k6j29oO4O3l1
$$ 784 712 701 691 689 686 617 753 1001 1044 950 855 924 993 959 926 906 887 944 879 921 1086 1106 1125 1084 920 920 920 1017 991 862 856 920 983 952
-1449I52l1RRk45j21P2P1Q0P9N8N7O5n8K8K8j15j16j22JO7O8N6o8j82K3N9o3n0P2J0J0m4m4
$$ 952 921 930 939 694 573 645 716 796 875 933 990 1055 997 1025 1053 938 822 700 701 768 836 892 824 642 665 724 661 611 683 693 703 659 615
-1466F15J50J50j16j16M9M9j2j2nonnj09j09L4L4J01J00l9Q5oj29n3n2P9P9k3k4P8P8N2p0
$$ 615 765 915 799 683 732 781 769 757 752 746 741 736 627 518 552 586 687 787 748 833 827 698 645 593 672 751 728 704 782 860 912 842
-1482H42OJ28n0n1J56J56j52j52l0k9M7p6o3O0k5k5R2l2r3L0Q3Q4O6n8p2N1l3l4J9j04j04
$$ 842 848 976 926 875 1031 1187 1035 883 853 824 871 795 732 792 767 742 834 802 709 739 822 906 972 914 842 893 860 826 845 741 637
-1497F37J9KLQ7l6n5O8rrK7K8l5l4p4p4O9P0NOJ01J00m2j64k7k6n3P0JJm1m2J31J30J23q1
$$ 637 656 658 661 748 712 657 725 716 707 734 762 727 693 619 545 614 684 689 695 796 896 854 690 663 637 584 654 655 656 615 573 704 834 957 876
-1515H76j39j5n6n6N4N4o4o5mlJ9J8m3m3M1M1M1M0L0K9Mj19j08J5Q1Q2O1O1%%O9O9j03j02
$$ 876 737 722 666 610 664 718 654 589 585 582 601 619 576 533 574 615 656 696 726 755 759 640 532 547 628 710 771 832 832 832 901 970 867 765
-1532G65j10R5M8p4qqr2L0O9n4m6m6N0p3j1J11M1M1M2M1J06j6k09q6O4n8n2P2m4m5l7l7K9
$$ 765 655 750 798 724 716 708 616 646 715 661 615 569 619 546 535 646 687 728 770 811 917 901 692 606 670 612 560 632 588 543 506 469 498
-1548D98L0L0K9JJJJo7o7J17J18j3j4j3j3j9k0k7R5qrj04j04O2O1m1m1K0K0J2J3M6p6j79n5
$$ 498 528 558 587 588 589 590 591 524 457 574 692 679 665 652 639 620 600 573 668 660 651 547 443 505 566 525 484 504 524 536 549 595 519 340 285
-1566B85J79J80j0j33rj0q7L6O3O2J39J7mmp4p3j03j03J23J23O6O6lko4j87j17NRJ33J32R
$$ 285 464 644 634 501 492 482 395 431 494 556 695 712 708 704 630 557 454 351 474 597 663 729 726 724 660 473 356 361 370 503 635 644
-1582F44M1q2j51k8N7N8p8p8J20J19k3k4L6L7k5k5j1j2j1j2k3k3Q0Q0NOO8O7q2q3j85j85L6
$$ 644 685 603 452 424 481 539 461 383 503 622 599 575 611 648 623 598 587 575 564 552 529 506 586 666 671 677 745 812 730 647 462 277 313
-1599C13L6L7L6%%J%m9m8N4N4r6r5M7M8J4J3P6P5j1j0j1j0L9M0k2k1k6k6L6L6O9O9QPj31j30
$$ 313 349 386 422 422 422 423 423 374 326 380 434 338 243 290 338 352 365 441 516 505 495 484 474 513 553 531 510 484 458 494 530 599 668 676 683 552 422
-1617D22p0o9O1O1j%l0l0l0l0J06J06p1p0L0J54K2j82j13J0M3J65L4L4N5j51j9j9l2l2MMO5
$$ 422 352 283 344 405 404 404 374 344 314 284 390 496 425 355 385 539 561 379 266 276 319 484 518 552 607 456 437 418 386 354 358 362 427
-1634D27O6k9k8k8k8J06J07j19j19k4k4L8L7rj0N2N2j9j9j8j9j1j1j1j1l4l5K7K7N9N9lkk4
$$ 427 493 464 436 408 380 486 593 474 355 331 307 345 382 373 363 415 467 448 429 411 392 381 370 359 348 314 279 306 333 392 451 448 446 422
-1651D22k4q6q6L0L0N0J74Q9j15n4n4p5p6p5p6L1L1l1l1J9J9K0J9pqppJ27J27K5K5o6o6o6
$$ 422 398 312 226 256 286 336 510 599 484 430 376 301 225 150 74 105 136 105 74 93 112 132 151 144 136 129 122 249 376 401 426 360 294 228
-1668B28o6R4R5M5M6p3J33Q9j98q5J20j4j3j0j0j0j0k2k3L1L1k0j43K9K9k0k0k8R5k4k4M4
$$ 228 162 256 351 396 442 369 502 591 393 308 428 414 401 391 381 371 361 339 316 347 378 358 215 244 273 253 233 205 300 276 252 296
-1684B96M5n8n8k4R9q2q1j9k0J33J0P8P9n2n2KKM0q2q3M0N4N4J%j03j04M5J69R1l1j6j6m0
$$ 296 341 283 225 201 300 218 137 118 98 231 241 319 398 346 294 296 298 338 256 173 213 267 321 322 322 219 115 160 329 420 389 373 357 317
-1701C17m1R6R5K0j04j11J2M6p7o9N4l0l0N4o8j8J06l8j61J8J41L8q4q2M1J43K1j51k8J48
$$ 317 276 372 467 487 383 272 284 330 253 184 238 208 178 232 164 146 252 214 53 71 212 250 166 84 125 268 289 138 110 258
-1716B58K6n1n1n9n9K3K3J00k3r2L1J25LM3M2k6k7M4M4M4M4j4j4j09j09k3J00L0L1l0l0l0
$$ 258 284 233 182 123 64 87 110 210 187 95 126 251 254 297 339 313 286 330 374 418 462 448 434 325 216 193 293 323 354 324 294 264
-1732B64k9MNn7n7l6l7l7l7N7N7N6N7m8m9m9m8O9O9O9O9l0l1l0l1jjjj%%O2O2m0l9n5O8J12
$$ 264 235 239 244 187 130 94 57 20 -17 40 97 153 210 162 113 64 16 85 154 223 292 262 231 201 170 169 168 167 166 166 166 228 290 250 211 156 224 336
-1751C36j1MMm8m8m8m8K1K2Q3Q3m5m5L2r1LJ25k5j49l4l4O8O8OJ28m7j71j21KN6o7K5K4j11
$$ 336 325 329 333 285 237 189 141 162 184 267 350 305 260 292 201 204 329 304 155 121 87 155 223 229 357 310 139 18 20 76 9 34 58 -53
-1768e3R4J48n7KJ24N1N0j1j1k2j44j44k1PQl8l8k0J03K05Q2n5n6o3o3J4J4J3J4j0j0N2N2
$$ -53 41 189 132 134 258 309 359 348 337 315 171 27 6 13 21 -17 -55 -75 28 233 315 260 204 141 78 92 106 119 133 123 113 165 217
-1785B17j2j1J5j91j34P0LMJ1J2J1J1O6O6O5O6n2n2n2n2j8j7j8j8k7k8M1q1m8m7J50J49j6
$$ 217 205 194 209 18 -116 -46 -43 -39 -28 -16 -5 6 72 138 203 269 217 165 113 61 43 26 8 -10 -37 -65 -24 -105 -153 -200 -50 99 83
-1801H3j7j27j27n8J46K24J00J6J6n3n3p6p5j4j4j6j7j6j6K8K8K9K8j7j8j8j7nnnnj7j7M5
$$ 83 66 -61 -188 -246 -100 124 224 240 256 203 150 74 -1 -15 -29 -45 -62 -78 -94 -66 -38 -9 19 2 -16 -34 -51 -56 -61 -66 -71 -88 -105 -60
-1819f0M5J6J7J26J26n9k65k03KJ24J23P4P5R7R7k5k6j50j50N4N5J1J1J1J1j01j01J05J04
$$ -60 -15 1 18 144 270 211 -54 -257 -255 -131 -8 66 141 238 335 310 284 134 -16 38 93 104 115 126 137 36 -65 40 144
-1833A44j46j45N9O0L9M0k2k2l9l8l9l9R7R7k6k7J3J2J7j88n5J50K2K2P9Q0J7J8J8J7j05j06
$$ 144 -2 -147 -88 -28 11 51 29 7 -32 -70 -109 -148 -51 46 20 -7 6 18 35 -153 -208 -58 -36 -14 65 145 162 180 198 215 110 4
-1849DJ17J16J16J16j99j99p6p6l4l4j3j36r6J08J78N5m8m8O0O0m6j69j54N2R5R4L9L8O8n6
$$ 4 121 237 353 469 270 71 -5 -81 -115 -149 -162 -298 -394 -286 -108 -53 -101 -149 -89 -29 -75 -244 -398 -346 -251 -157 -118 -80 -12 -68
-1864f8n5O7N6N6n9n9mlll%J%JM1M1M9p5K0J9j11j12M5M4K36J14j61j61m5P8Q5j19n8O5k1
$$ -68 -123 -56 0 56 -3 -62 -66 -69 -72 -75 -75 -74 -74 -73 -32 9 58 -17 3 22 -89 -201 -156 -112 124 238 77 -84 -129 -51 34 -85 -143 -78 -99
-1882i9J01J54n0r3r4J7J6j3j3M1M1n1j74n1P2P5P6L0r4q2q2L4L3N7N6N7j49j11J1N2N3RQ
$$ -99 2 156 106 13 -81 -64 -48 -61 -74 -33 8 -43 -217 -268 -196 -121 -45 -15 -109 -191 -273 -239 -206 -149 -93 -36 -185 -296 -285 -233 -180 -171 -163
-1898a63RRK9L0K9K9j01j01R5R6n1j74j05j05k0k1J08K31J98P5J6j07j5j4k3k2qqO1o2j11
$$ -163 -154 -145 -116 -86 -57 -28 -129 -230 -135 -39 -90 -264 -369 -474 -494 -515 -407 -176 22 97 113 6 -9 -23 -46 -68 -76 -84 -23 -85 -196
-1914a96j10MNp3p3N0N1KLO4O5J3J3j87o3R6k7N1N0K2K1K2K1M1M1M0M1p2p2j1j1N1N1r3r3
$$ -196 -306 -302 -297 -370 -443 -393 -342 -340 -337 -273 -208 -195 -182 -369 -432 -336 -363 -312 -262 -240 -219 -197 -176 -135 -94 -54 -13 -85 -157 -168 -179 -128 -77 -170 -263
-1931b63J1J1J0J1l0l0l1l0j2j2N0N0PQQ9l3j01J05N0p2O6O6llm1m2j03j03k7k7k8k7J03J04
$$ -263 -252 -241 -231 -220 -250 -280 -311 -341 -353 -365 -315 -265 -258 -250 -161 -194 -295 -190 -140 -212 -146 -80 -83 -86 -127 -169 -272 -375 -402 -429 -457 -484 -381 -277
-1949b77q2q1L8L8k3k4J0J1J05J05l1j53j46N9J33J1n0P2R4j10j26mO7n6K1K1j0j0j0j0L2
$$ -277 -359 -440 -402 -364 -387 -411 -401 -390 -285 -180 -211 -364 -510 -451 -318 -307 -357 -285 -191 -301 -427 -431 -364 -420 -399 -378 -388 -398 -408 -418 -386
-1964c86L2k9k9J0J1P2P2m7m6J5J5k4k4L8L8J7J7j27j26N1N2N1N1M3M2j9j9o2o1o2o1L2L3
$$ -386 -354 -383 -412 -402 -391 -319 -247 -294 -340 -325 -310 -334 -358 -320 -282 -265 -248 -375 -501 -450 -398 -347 -296 -253 -211 -230 -249 -311 -372 -434 -495 -463 -430
-1981d30L3L2P1P2l2l1o5o5L7L8N5N5m7m7o3o3Q1Q0l4l3l4l4J22J22o2o3R6R7m7m8p0p0p0
$$ -430 -397 -365 -294 -222 -254 -285 -350 -415 -378 -340 -285 -230 -277 -324 -387 -450 -369 -289 -323 -356 -390 -424 -302 -180 -242 -305 -209 -112 -159 -207 -277 -347 -417
-1997d17p1N6N5l9m0JJ24N5N4l0k9l0l0o5o4J20J20L4L4j09j09m1m1K1K1j2j1N0N0L5L4L5
$$ -417 -488 -432 -377 -416 -456 -455 -331 -276 -222 -252 -281 -311 -341 -406 -470 -350 -230 -196 -162 -271 -380 -421 -462 -441 -420 -432 -443 -393 -343 -308 -274 -239
-2013b39L4l4l5L4q8p9p9R8R8m0m0K1K1klp1N1J0RL2r0j11J2J20J20p1p1J01k3opr1L2L6q6
$$ -239 -205 -239 -274 -240 -328 -407 -486 -388 -290 -330 -370 -349 -328 -330 -333 -404 -353 -343 -334 -302 -392 -503 -491 -371 -251 -322 -393 -292 -315 -321 -328 -419 -387 -351 -437
-2031d37q6L7J70M7r6K6M0q4N5N4j1j1O5n7j15QL3L4k8k7j2j35j15QpJ16K61N6j15Pj5j6q
$$ -437 -523 -486 -316 -269 -365 -339 -299 -383 -328 -274 -285 -296 -231 -288 -403 -395 -362 -328 -356 -383 -395 -530 -645 -637 -644 -528 -267 -211 -326 -319 -334 -350 -358
-2047c58ql7l7k9k9m5P7QQ%jo2o1K6K7O0J83j8j7p2p1j9j9M3M2k2k2k2k2Q5Q6j7j7k3k3k3
$$ -358 -366 -403 -440 -469 -498 -543 -466 -458 -450 -450 -451 -513 -574 -548 -521 -461 -278 -296 -313 -385 -456 -475 -494 -451 -409 -431 -453 -475 -497 -412 -326 -343 -360 -383 -406 -429
-2065d29k3O7O7p7p7l2l3l2l3Q3Q3Q3Q2k6k6P6P6q9q9q9q9j2j2j1j2K3K3K3K3R9R9q6q6j01
$$ -429 -452 -385 -318 -395 -472 -504 -537 -569 -602 -519 -436 -353 -271 -297 -323 -247 -171 -260 -349 -438 -527 -539 -551 -562 -574 -551 -528 -505 -482 -383 -284 -370 -456 -557
-2083e57j01m2Q0J82o4o4J82M0q3j29pJ28J27m9m9j18j17K6K6QQPQnnnoj5j6j03j03o4J83
$$ -557 -658 -700 -620 -438 -502 -566 -384 -344 -427 -556 -563 -435 -308 -357 -406 -524 -641 -615 -589 -581 -573 -566 -558 -563 -568 -573 -579 -594 -610 -713 -816 -880 -697
-2099f97J75N2K1K1q8q9M9N0M9M9J2J1J1J1j7j6q9l35r4J53J42J41O0O0q3q4k4k4L7L7M4M3
$$ -697 -522 -470 -449 -428 -516 -605 -556 -506 -457 -408 -396 -385 -374 -363 -380 -396 -485 -820 -914 -761 -619 -478 -418 -358 -441 -525 -549 -573 -536 -499 -455 -412
-2115d12M4M3KKj00j01m5m6J6J6j5j5Jj23J4J38O0O1j07j07P8P8j16j16K8K8O8O7p6p5J01
$$ -412 -368 -325 -323 -321 -421 -522 -567 -613 -597 -581 -596 -611 -610 -733 -719 -581 -521 -460 -567 -674 -596 -518 -634 -750 -722 -694 -626 -559 -635 -710 -609
-2131f09J00m2m3m9n0J22jm0m1o4O0Q9l5M3M3j48j48M4M4J40K62N0j55m5P8j48j47RRP0P0
$$ -609 -509 -551 -594 -643 -693 -571 -572 -612 -653 -717 -657 -568 -603 -560 -517 -665 -813 -769 -725 -585 -323 -273 -428 -473 -395 -543 -690 -681 -672 -602 -532
-2146e32j06j07L7L7M1M1Qj16RRo0o1Q9Q8Q9Q8JKJJj01j01m0l9Q7Q7j5j6lmo5o5K7K8J22J21
$$ -532 -638 -745 -708 -671 -630 -589 -581 -697 -688 -679 -739 -800 -711 -623 -534 -446 -445 -443 -442 -441 -542 -643 -683 -722 -635 -548 -563 -579 -582 -586 -651 -716 -689 -661 -539 -418
-2164d18M6p8j04j03j0J13M4M3P4P4J8j87j91J3J06j7j25lJ00k3j32rN8o6q4J20J13r3J13
$$ -418 -372 -450 -554 -657 -667 -554 -510 -467 -393 -319 -301 -488 -679 -666 -560 -577 -702 -705 -605 -628 -760 -769 -711 -777 -861 -741 -628 -721 -608
$$ [...]
-32894b6
##END=		$$ NMR SPECTRUM
##END=		$$ LINK
