##TITLE=	RP264 xtals 1.10.fid
##JCAMP-DX=	6.0	$$ MestReNova 14.3.3-33362
##DATA TYPE=	LINK
##BLOCKS=	1    
##ORIGIN=	Mestrelab Research S.L.
##OWNER=	hrzepa
##$MNOVA/METADATA=	(DOCUMENT,BASE64)
eyJuYW1lIjoiL1VzZXJzL2hyemVwYS9MaWJyYXJ5L01vYmlsZSBEb2N1bWVudHMvY29tfmFwcGxlfkN
sb3VkRG9jcy9TaGVwcGFyZC9OTVIgZmlsZXMgemlwcy0yLzM1LzM1LUgubW5vdmEiLCJwYWdlcyI6W3
siaXRlbXMiOlsiMSIgICAgIF19XX0=
##TITLE=	RP264 xtals 1.10.fid
##JCAMP-DX=	6.0	$$ MestReNova 14.3.3-33362
##DATA TYPE=	NMR SPECTRUM
##DATA CLASS=	XYDATA
##BLOCK_ID=	1
##ORIGIN=	Bruker BioSpin GmbH
##OWNER=	nmrsu
##NUMDIM=	1
##$MNOVA/METADATA=	(ITEM,BASE64)
eyJhbmdsZSI6MCwiYXhlcyI6eyJ4Ijp7Im1heCI6MTYuMDcyNjkwMDAwMDI3NTksIm1pbiI6LTMuNzU
4NTEyNTA2MjQyNTEzfSwieSI6eyJtYXgiOjM4NzYxLjE4MTM5NjQ4NDM3NSwibWluIjotMzQ0Ni4xMj
cxODIwMDY4MzZ9fSwicG9pbnRzIjpbeyJ4Ijo1MzIxLCJ5Ijo1ODM1fSx7IngiOjg3MjIsInkiOjU4M
zV9LHsieCI6ODcyMiwieSI6ODIwOH0seyJ4Ijo1MzIxLCJ5Ijo4MjA4fSx7IngiOjUzMjEsInkiOjU4
MzV9XSwieiI6MH0=
##.OBSERVE FREQUENCY=	700.35432466099996418
##.OBSERVE NUCLEUS=	^1H
##.SOLVENT NAME=	DMSO
##.PULSE SEQUENCE=	zg30
##LONGDATE=	2023/02/09 03:18:47.000
##.ACQUISITIONMODE=	SIMULTANEOUS (DQD)
##$ORIGINAL FORMAT=	Bruker XWIN-NMR
##$MNOVA/SCALES_VERSION=	9
##$PARAMETER FILE=	(acqus, ASCII, /private/var/folders/f6/rjf_tdyn2v98c5c0wvkgn4s80000gq/T/x1pXskfpR06f194eXXybGQ/10/acqus, 0)
$$ ##TITLE= Parameter file, TopSpin 4.1.3
$$ ##JCAMPDX= 5.0
$$ ##DATATYPE= Parameter Values
$$ ##NPOINTS= 1	$$ modification sequence number
$$ ##ORIGIN= Bruker BioSpin GmbH
$$ ##OWNER= nmrsu
$$ $$ 2023-02-09 03:18:39.884 +0000  nmrsu@CZC7167VR1
$$ $$ Z:/700/data/tds/nmr/RP264 xtals 1/10/acqus
$$ $$ process C:\Bruker\TopSpin4.1.3\prog\mod\dirdata.exe
$$ ##$ACQT0= -2.0981556054023
$$ ##$AMP= (0..31)
$$ 100 100 100 100 100 100 100 100 100 100 100 100 100 100 100 100 100 100
$$ 100 100 100 100 100 100 100 100 100 100 100 100 100 100
$$ ##$AMPCOIL= (0..32)
$$ -1 0 0 0 0 0 0 0 0 0 0 0 0 0 0 0 0 0 0 0 0 0 0 0 0 0 0 0 0 0 0 0 0
$$ ##$AQSEQ= 0
$$ ##$AQ_mod= 3
$$ ##$AUNM= <au_zg>
$$ ##$AUTOPOS= <6 >
$$ ##$BF1= 700.349999998
$$ ##$BF2= 700.349999998
$$ ##$BF3= 700.349999998
$$ ##$BF4= 700.349999998
$$ ##$BF5= 700.349999998
$$ ##$BF6= 700.349999998
$$ ##$BF7= 700.349999998
$$ ##$BF8= 700.349999998
$$ ##$BWFAC= (0..63)
$$ 0 0 0 0 0 0 0 0 0 0 0 0 0 0 0 0 0 0 0 0 0 0 0 0 0 0 0 0 0 0 0 0 0 0 0 0
$$ 0 0 0 0 0 0 0 0 0 0 0 0 0 0 0 0 0 0 0 0 0 0 0 0 0 0 0 0
$$ ##$BYTORDA= 0
$$ ##$CHANFCU= (0..24)
$$ 0 1 0 0 0 0 0 0 0 0 0 0 0 0 0 0 0 0 0 0 0 0 0 0 0
$$ ##$CHANREC= (0..24)
$$ 0 0 0 0 0 0 0 0 0 0 0 0 0 0 0 0 0 0 0 0 0 0 0 0 0
$$ ##$CHEMSTR= <none>
$$ ##$CNST= (0..63)
$$ 1 1 1 1 1 1 1 1 1 1 1 1 1 1 1 1 1 1 1 1 1 1 1 1 1 1 1 1 1 1 1 1 1 1 1 1
$$ 1 1 1 1 1 1 1 1 1 1 1 1 1 1 1 1 1 1 1 1 1 1 1 1 1 1 1 1
$$ ##$CPDPRG= (0..8)
$$ <> <> <> <> <> <> <> <> <>
$$ ##$D= (0..63)
$$ 0 1 0 0 0 0 0 0 0 0 0 0 0 0 0 0 0.0002 0 0 0 0 0 0 0 0 0 0 0 0 0 0 0 0
$$ 0 0 0 0 0 0 0 0 0 0 0 0 0 0 0 0 0 0 0 0 0 0 0 0 0 0 0 0 0 0 0
$$ ##$DATE= 1675912727
$$ ##$DATE_START= 1675912684
$$ [...]
$$ ##$ShimPowRng3= (0..63)
$$ 1 1 1 1 1 1 1 1 1 1 1 1 1 1 1 1 1 1 1 1 1 1 1 1 1 1 1 1 1 1 1 1 1 1 1 1
$$ 1 1 1 1 0 0 0 0 0 0 0 0 0 0 0 0 0 0 0 0 0 0 0 0 0 0 0 0
$$ ##$ShimPowType1= 8
$$ ##$ShimPowType2= 8
$$ ##$ShimPowType3= 0
$$ ##$ShimPowType4= 0
$$ ##$ShimPowType5= 0
$$ ##$ShimPowType6= 0
$$ ##$ShimPowType7= 0
$$ ##$ShimPowType8= 0
$$ ##$ShimSysActGrad= (0..63)
$$ 1 2 3 4 13 5 7 11 10 9 6 8 12 18 19 20 21 15 22 23 24 14 25 16 26 17 27
$$ 28 31 32 33 34 35 36 37 38 0 0 0 0 0 0 0 0 0 0 0 0 0 0 0 0 0 0 0 0 0 0
$$ 0 0 0 0 0 0
$$ ##$ShimSysAngle= <>
$$ ##$ShimSysFunc= (0..63)
$$ 1 2 3 4 5 6 7 8 9 10 0 37 38 35 16 15 14 13 12 11 28 27 26 25 24 23 36
$$ 22 30 29 20 21 34 33 32 31 17 18 19 0 0 0 0 0 0 0 0 0 0 0 0 0 0 0 0 0 0
$$ 0 0 0 0 0 0 0
$$ ##$ShimSysMatId= <292722da.dat>
$$ ##$ShimSysMatrix= 1
$$ ##$ShimSysMinMaxUG= 130000
$$ ##$ShimSysOffset= <29 mm>
$$ ##$ShimSysType= 4
$$ ##$ShimUnit= 3
$$ ##$SpectrOsVersion= <4.1.156.20210628>
$$ ##$TCubeEth= <192.168.180.38>
$$ ##$TCubeSeqDevice= <>
$$ ##$TOSITY= <no>
$$ ##$TRIPLO2= 0
$$ ##$TopSpinVersion= <TopSpin 4.1.3>
$$ ##$TrxFreqFormula= (0..23)
$$ <TrxFreqFormula(2.0,700350000.000000,'TRX',Trx(1.0,'TRX 1200.1',1,5.000000,1290.000000))>
$$ <TrxFreqFormula(2.0,700350000.000000,'TRX',Trx(1.0,'TRX 1200.2',1,5.000000,1290.000000))>
$$ <TrxFreqFormula(2.0,700350000.000000,'TRX',Trx(1.0,'TRX 1200.3',1,5.000000,1290.000000))>
$$ <> <> <> <> <> <> <> <> <> <> <> <> <> <> <> <> <> <> <> <> <>
$$ ##$TrxPN= (0..23)
$$ <Z148391> <Z148391> <Z148391> <> <> <> <> <> <> <> <> <> <> <> <> <> <>
$$ <> <> <> <> <> <> <>
$$ ##$TrxSN= (0..23)
$$ <00336> <00337> <00342> <> <> <> <> <> <> <> <> <> <> <> <> <> <> <> <>
$$ <> <> <> <> <>
$$ ##$VCubeEth= (0..23)
$$ <no> <no> <no> <no> <no> <no> <no> <no> <no> <no> <no> <no> <no> <no> <no>
$$ <no> <no> <no> <no> <no> <no> <no> <no> <no>
$$ ##$VTU= 2
$$ ##$VTUETH= <192.168.99.11>
$$ ##$VTUTY= <no>
$$ ##$ValueLine= no
$$ ##$VpuPN= (0..23)
$$ <no> <no> <no> <no> <no> <no> <no> <no> <no> <no> <no> <no> <no> <no> <no>
$$ <no> <no> <no> <no> <no> <no> <no> <no> <no>
$$ ##$VpuSN= (0..23)
$$ <no> <no> <no> <no> <no> <no> <no> <no> <no> <no> <no> <no> <no> <no> <no>
$$ <no> <no> <no> <no> <no> <no> <no> <no> <no>
$$ ##$WBREFAM= (0..31)
$$ 99.8 100 100 100 100 100 100 100 100 100 100 100 100 100 100 100 100 100
$$ 100 100 100 100 100 100 100 100 100 100 100 100 100 100
$$ ##$WBREFLM= (0..31)
$$ 1 0 1 0 0 0 0 0 0 0 0 0 0 0 0 0 0 0 0 0 0 0 0 0 0 0 0 0 0 0 0 0
$$ ##$WBREFPH= (0..31)
$$ 0.05 0 0 0 0 0 0 0 0 0 0 0 0 0 0 0 0 0 0 0 0 0 0 0 0 0 0 0 0 0 0 0
$$ ##$WBSGU= (0..31)
$$ 1 2 4 0 0 0 0 0 0 0 0 0 0 0 0 0 0 0 0 0 0 0 0 0 0 0 0 0 0 0 0 0
$$ ##END=
$$ 
##$DECIM=	1440
##$DSPFVS=	21
##XUNITS=	HZ
##YUNITS=	ARBITRARY UNITS
##FIRSTX=	11256.508643983790535
##LASTX=	-2632.2742810921758974
##DELTAX=	-0.1059638129340278595
##XFACTOR=	1
##YFACTOR=	1.075392639698477204
##FIRSTY=	127.326446533203125
##MINY=	77.5399627685546875
##MAXY=	35237.390625
##NPOINTS=	131072
##XYDATA=	(X++(Y..Y))
$$ [...]
$$ plain form
3254 148 148 148 148 148 148 148 148 148 148 147 146 146 146 147 147 147 147 147 147 147 148 147 147 147 147 147 147 147 147 148 148 148 148 147 147 146 146 147 147 147 147 147 148 148 148 148 148 148 148 148 148 148 148 149 149 149 148 148 148 147 147 147 146 146 147 148 149 149 150
3246 150 149 149 149 149 149 149 149 148 147 146 145 146 147 148 148 149 148 147 146 146 146 147 147 147 147 147 147 147 147 147 147 147 147 147 146 147 147 148 148 148 148 147 147 147 146 146 146 147 147 147 148 148 148 147 147 148 148 147 148 148 148 148 149 148 148 148 148 147 147
3239 147 147 146 146 145 146 146 148 149 149 150 149 148 148 147 147 147 147 147 147 147 147 146 146 147 147 147 147 147 147 147 147 147 147 147 146 146 146 147 148 148 148 147 147 147 147 148 148 148 147 147 147 147 147 147 147 147 147 148 148 147 147 147 148 148 148 149 148 148 147
3232 147 147 147 146 146 146 146 145 145 145 145 145 146 146 146 147 147 147 147 147 147 147 147 147 148 148 147 148 148 148 147 148 148 147 148 148 148 148 148 148 148 147 147 147 146 146 147 148 148 148 148 148 148 147 148 148 149 149 149 148 147 147 147 147 147 148 148 149 149 149
3224 149 148 149 149 149 149 148 149 148 148 147 146 146 146 146 147 147 147 148 147 146 146 146 146 146 146 146 147 147 147 147 147 146 146 147 147 147 147 148 148 149 148 148 147 147 146 147 147 147 146 146 147 147 147 146 146 146 146 146 147 147 147 148 147 147 146 146 145 145 145
3217 145 145 145 145 145 145 146 146 146 146 146 146 146 147 147 147 146 146 146 147 147 147 146 146 148 148 148 148 147 147 147 146 147 147 147 147 147 146 146 146 147 147 148 148 148 148 147 146 146 146 147 147 147 146 145 144 144 145 146 146 145 145 145 145 145 145 145 145 145 145
3210 145 145 145 145 145 145 145 144 144 144 144 144 145 145 145 146 146 146 146 146 145 145 146 146 146 147 147 146 146 146 146 147 148 148 147 147 147 146 146 146 145 145 144 145 145 145 146 146 146 147 146 146 147 147 147 147 147 146 145 146 146 145 146 146 145 145 145 145 145 145
3203 145 145 146 146 146 146 146 145 146 147 147 147 147 147 148 148 148 148 148 148 148 148 148 147 147 147 147 147 147 147 147 147 148 148 148 147 146 146 147 147 146 146 146 147 147 147 147 147 146 146 146 147 147 147 147 147 147 147 147 147 147 147 147 147 146 146 146 147 147 147
$$ packed form
3254A48%%%%%%%%%jj%%J%%%%%%Jj%%%%%%%J%%%j%j%J%%%%J%%%%%%%%%%J%%j%%j%%j%JJJ%J
3246A50j%%%%%%jjjjJJJ%Jjjj%%J%%%%%%%%%%%%jJ%J%%%j%%j%%J%%J%%j%J%jJ%%%Jj%%%j%
3239A47%j%jJ%KJ%Jjj%j%%%%%%%j%J%%%%%%%%%%j%%JJ%%j%%%J%%j%%%%%%%%J%j%%J%%Jj%j
3232A47%%j%%%j%%%%J%%J%%%%%%%%J%jJ%%jJ%jJ%%%%%%j%%j%JJ%%%%%jJ%J%%jj%%%%J%J%%
3224A49jJ%%%jJj%jj%%%J%%Jjj%%%%%%J%%%%j%J%%%J%Jj%j%jJ%%j%J%%j%%%%J%%Jj%j%j%%
3217A45%%%%%J%%%%%%J%%j%%J%%j%K%%%j%%jJ%%%%j%%J%J%%%jj%%J%%jjj%JJ%j%%%%%%%%%
3210A45%%%%%%j%%%%J%%J%%%%j%J%%J%j%%%JJ%j%%j%%j%jJ%%J%%Jj%J%%%%jjJ%jJ%j%%%%%
3203A45%J%%%%jJJ%%%%J%%%%%%%%j%%%%%%%%J%%jj%J%j%%J%%%%j%%J%%%%%%%%%%%%j%%J%%
$$ plain form
3195 147 148 148 149 149 148 147 147 147 147 146 146 145 145 146 147 147 147 147 147 147 147 148 147 147 147 148 148 148 148 148 149 148 148 148 148 147 148 148 148 148 148 149 148 148 148 148 147 147 147 147 147 147 148 148 147 147 147 147 147 147 147 148 148 148 148 147 147 147 148
3188 148 147 146 146 146 146 146 146 146 147 147 147 147 147 147 147 146 146 146 147 147 147 148 148 148 149 149 148 148 147 147 146 146 147 147 147 147 147 147 147 147 148 148 149 149 149 149 149 148 147 147 147 147 147 148 148 147 147 147 147 147 147 147 145 145 145 146 146 146 147
3181 147 147 147 147 147 148 148 148 147 147 147 146 146 146 147 147 147 147 147 146 146 145 145 146 145 145 146 147 147 147 146 145 144 144 145 146 147 147 147 146 147 147 147 147 147 148 147 146 146 145 146 147 147 146 146 146 147 148 149 148 147 146 145 146 146 147 146 146 145 146
3173 146 146 146 146 146 146 146 146 146 146 145 146 146 145 145 144 145 145 146 146 146 146 146 146 146 146 146 146 146 146 147 147 147 147 147 146 146 146 146 147 147 147 147 147 146 146 147 147 147 145 144 145 145 146 147 147 147 147 147 147 147 146 147 147 147 147 147 147 147 147
3166 147 147 147 147 147 147 146 146 147 147 147 147 147 148 148 147 147 147 147 146 147 148 148 147 147 147 147 147 147 147 147 147 146 146 147 148 148 148 148 148 148 149 149 149 148 147 147 147 146 146 146 146 146 147 147 147 147 147 146 147 147 147 147 147 147 147 147 147 146 147
3159 147 147 147 148 148 149 148 148 147 147 147 146 146 145 145 145 146 147 147 147 147 147 147 147 147 146 146 146 146 146 147 148 148 147 146 146 146 146 147 146 146 146 147 147 147 146 146 145 145 145 146 145 146 146 147 147 147 147 148 148 148 147 147 147 147 147 147 147 146 145
3151 145 144 145 146 148 147 147 147 147 146 146 146 146 146 146 146 146 146 146 146 146 146 146 145 146 147 147 147 148 147 147 147 146 147 147 147 147 146 146 146 147 147 148 147 148 148 148 148 148 148 148 148 148 147 147 146 146 146 146 146 146 146 146 147 147 147 147 147 147 147
3144 147 146 146 145 146 146 147 147 148 148 147 147 147 146 147 147 147 147 147 146 146 146 146 146 147 147 146 146 146 146 146 146 146 146 146 146 146 146 145 146 147 148 148 148 148 147 146 147 147 147 146 145 145 145 145 145 146 147 147 146 146 146 146 145 146 146 147 147 147 147
$$ packed form
3195A47J%J%jj%%%j%j%JJ%%%%%%Jj%%J%%%%Jj%%%jJ%%%%Jj%%%j%%%%%J%j%%%%%%J%%%j%%J
3188A48jj%%%%%%J%%%%%%j%%J%%J%%J%j%j%j%J%%%%%%%J%J%%%%jj%%%%J%j%%%%%%k%%J%%J
3181A47%%%%J%%j%%j%%J%%%%j%j%Jj%JJ%%jjj%JJJ%%jJ%%%%Jjj%jJJ%j%%JJJjjjjJ%Jj%jJ
3173A46%%%%%%%%%jJ%j%jJ%J%%%%%%%%%%%J%%%%j%%%J%%%%j%J%%kjJ%JJ%%%%%%jJ%%%%%%%
3166A47%%%%%j%J%%%%J%j%%%jJJ%j%%%%%%%%j%JJ%%%%%J%%jj%%j%%%%J%%%%jJ%%%%%%%%jJ
3159A47%%J%Jj%j%%j%j%%JJ%%%%%%%j%%%%JJ%jj%%%Jj%%J%%j%j%%JjJ%J%%%J%%j%%%%%%jj
3151A45jJJKj%%%j%%%%%%%%%%%%%jJJ%%Jj%%jJ%%%j%%J%JjJ%%%%%%%%j%j%%%%%%%J%%%%%%
3144A47j%jJ%J%J%j%%jJ%%%%j%%%%J%j%%%%%%%%%%%jJJJ%%%jjJ%%jj%%%%JJ%j%%%jJ%J%%%
$$ plain form
3137 147 147 147 148 148 148 147 147 146 146 146 146 147 147 147 147 148 148 148 148 148 148 147 147 147 147 146 146 146 146 146 146 146 146 146 146 146 146 147 148 148 148 147 147 146 146 146 146 146 146 146 147 147 147 146 146 145 146 146 147 148 148 147 146 146 146 146 146 146 147
3129 147 147 147 147 146 146 147 147 147 147 147 147 147 147 147 147 147 147 147 146 145 145 145 145 146 146 147 147 146 146 145 145 145 146 146 146 146 146 146 146 146 146 146 146 147 147 147 147 147 146 147 147 147 147 147 146 146 146 146 146 146 146 147 147 147 147 147 147 147 147
3122 147 146 145 145 145 145 145 145 146 146 146 146 146 146 146 146 147 147 147 146 146 145 145 145 145 144 144 144 144 144 144 145 145 145 145 146 146 146 146 147 147 148 148 148 148 147 147 146 146 146 146 146 146 146 145 146 146 146 147 146 146 146 146 146 146 146 146 146 146 146
3115 146 145 146 146 146 145 145 146 146 147 147 147 147 146 146 146 146 146 147 147 147 147 147 147 147 146 146 146 147 148 147 147 148 147 147 148 148 148 148 148 148 148 148 148 148 149 149 149 148 147 147 147 147 146 146 146 147 147 146 146 146 145 144 145 145 145 146 146 147 146
3107 146 146 147 147 146 146 146 146 145 146 146 147 147 148 148 148 149 148 147 146 145 145 145 145 145 145 146 146 146 145 145 146 146 146 146 146 145 145 144 145 146 146 146 146 146 146 146 146 146 146 146 146 146 146 146 146 146 146 146 146 146 146 146 146 145 145 145 146 146 146
3100 146 146 145 144 145 146 147 147 147 147 147 147 147 147 146 146 146 147 147 147 147 146 146 145 145 145 145 145 145 145 145 144 145 146 147 148 148 148 147 146 145 144 145 146 146 146 146 146 146 146 147 147 146 146 146 146 146 146 146 146 145 145 144 144 144 144 144 144 144 144
3093 144 144 145 145 145 145 145 145 146 146 146 145 146 147 147 146 146 146 146 146 146 147 147 146 146 146 146 146 146 145 145 145 145 145 145 146 146 146 146 146 146 146 146 146 146 146 146 146 145 145 146 146 146 147 147 146 146 145 145 146 146 146 146 147 147 147 147 147 147 145
3086 145 145 145 144 144 144 144 144 145 145 145 145 146 147 146 146 146 145 145 144 144 145 146 146 145 145 144 144 144 144 144 144 144 145 144 144 144 144 145 145 145 146 145 145 146 146 145 145 145 145 146 146 146 145 145 145 146 146 146 146 145 145 145 145 146 146 145 144 143 143
$$ packed form
3137A47%%J%%j%j%%%J%%%J%%%%%j%%%j%%%%%%%%%%%JJ%%j%j%%%%%%J%%j%jJ%JJ%jj%%%%%J
3129A47%%%j%J%%%%%%%%%%%%jj%%%J%J%j%j%%J%%%%%%%%%%J%%%%jJ%%%%j%%%%%%J%%%%%%%
3122A47jj%%%%%J%%%%%%%J%%j%j%%%j%%%%%J%%%J%%%J%J%%%j%j%%%%%%jJ%%Jj%%%%%%%%%%
3115A46jJ%%j%J%J%%%j%%%%J%%%%%%j%%JJj%Jj%J%%%%%%%%%J%%jj%%%j%%J%j%%jjJ%%J%Jj
3107A46%J%j%%%jJ%J%J%%Jjjjj%%%%%J%%j%J%%%%j%jJJ%%%%%%%%%%%%%%%%%%%%%%%j%%J%%
3100A46%jjJJJ%%%%%%%j%%J%%%j%j%%%%%%%jJJJJ%%jjjjJJ%%%%%%J%j%%%%%%%j%j%%%%%%%
3093A44%J%%%%%J%%jJJ%j%%%%%J%j%%%%%j%%%%%J%%%%%%%%%%%%j%J%%J%j%j%J%%%J%%%%%k
3086A45%%j%%%%J%%%JJj%%j%j%JJ%j%j%%%%%%Jj%%%J%%Jj%J%j%%%J%%j%%J%%%j%%%J%jjj%
$$ plain form
3078 143 144 144 145 145 145 145 145 145 145 145 144 144 144 145 145 145 146 146 146 145 145 144 144 144 145 145 146 146 146 146 146 146 146 145 144 144 145 145 145 146 146 146 146 146 145 144 143 143 144 145 146 145 145 145 145 145 144 144 144 144 145 146 146 146 145 145 145 146 146
3071 146 146 146 146 146 147 147 147 146 145 144 144 144 144 144 144 145 145 145 146 146 146 146 145 146 146 145 145 145 144 144 144 144 145 146 146 145 146 146 145 144 144 144 145 145 145 146 146 146 146 146 146 146 146 146 147 147 147 146 146 146 147 147 146 146 146 146 146 146 146
3064 146 146 147 147 146 146 146 146 146 146 146 145 146 146 146 145 145 145 145 145 145 144 144 144 145 145 145 145 145 146 147 147 146 146 145 145 145 146 146 145 146 146 146 145 146 147 148 148 147 147 148 147 147 147 147 146 146 146 146 146 145 144 144 144 144 145 144 144 144 145
3056 145 145 146 146 146 145 145 144 145 146 147 147 147 147 148 147 147 146 146 146 146 146 146 145 144 144 144 145 146 146 146 145 145 145 145 145 145 146 146 146 146 146 146 146 146 146 145 145 145 146 146 147 146 146 146 146 146 146 146 147 147 146 146 147 147 147 147 148 147 146
3049 146 145 145 145 145 146 146 147 147 147 146 145 145 145 146 146 146 146 147 147 147 147 147 148 147 147 148 149 149 149 148 148 148 148 147 147 147 146 146 146 146 146 147 146 146 145 146 147 148 148 148 147 147 146 146 146 147 147 147 147 147 147 146 145 144 144 145 146 147 147
3042 147 147 147 147 148 148 147 148 148 147 147 146 145 144 145 145 145 146 146 147 147 147 147 147 146 145 145 145 145 145 145 144 144 145 145 145 146 146 146 146 147 148 148 147 146 147 147 147 146 146 147 147 146 147 147 147 147 147 146 146 146 147 147 147 147 147 148 148 148 148
3034 148 148 148 147 147 146 146 146 147 147 147 147 147 147 147 147 147 147 147 147 146 146 145 145 145 146 147 148 148 147 147 147 147 147 147 148 148 147 148 148 146 146 145 145 145 146 146 145 145 145 144 144 143 142 142 143 144 145 147 147 147 147 146 145 145 145 145 145 145 146
3027 146 147 147 146 146 146 147 147 147 147 147 147 147 147 146 145 146 146 146 147 147 147 147 146 146 146 145 146 146 146 146 146 145 145 145 146 146 146 146 146 146 146 145 145 145 145 145 145 145 145 145 145 145 145 146 146 146 146 146 146 146 146 145 146 146 146 146 146 146 145
$$ packed form
3078A43J%J%%%%%%%j%%J%%J%%j%j%%J%J%%%%%%jj%J%%J%%%%jjj%JJJj%%%%j%%%JJ%%j%%J%
3071A46%%%%J%%jjj%%%%%J%%J%%%jJ%j%%j%%%JJ%jJ%jj%%J%%J%%%%%%%%J%%j%%J%j%%%%%%
3064A46%J%j%%%%%%jJ%%j%%%%%j%%J%%%%JJ%j%j%%J%jJ%%jJJJ%j%Jj%%%j%%%%jj%%%Jj%%J
3056A45%J%%j%jJJJ%%%Jj%j%%%%%jj%%JJ%%j%%%%%J%%%%%%%%j%%J%Jj%%%%%%J%j%J%%%Jjj
3049A46j%%%J%J%%jj%%J%%%J%%%%Jj%JJ%%j%%%j%%j%%%%Jj%jJJJ%%j%j%%J%%%%%jjj%JJJ%
3042A47%%%J%jJ%j%jjjJ%%J%J%%%%jj%%%%%j%J%%J%%%JJ%jjJ%%j%J%jJ%%%%j%%J%%%%J%%%
3034A48%%j%j%%J%%%%%%%%%%%j%j%%JJJ%j%%%%%J%jJ%k%j%%J%j%%j%jj%JJJK%%%jj%%%%%J
3027A46J%j%%J%%%%%%%jjJ%%J%%%j%%jJ%%%%j%%J%%%%%%j%%%%%%%%%%%J%%%%%%%jJ%%%%%j
$$ plain form
3020 145 146 146 146 146 146 146 145 145 145 145 145 145 145 146 146 146 146 146 146 146 146 146 146 146 146 146 145 146 147 146 146 145 145 145 145 146 146 146 145 145 145 145 145 145 145 145 146 146 146 146 146 146 146 146 146 146 146 146 146 146 146 146 146 146 147 147 147 147 146
3012 146 145 145 146 146 146 146 146 146 146 146 146 146 146 147 147 146 145 146 146 147 147 147 147 147 147 148 147 147 146 147 147 147 146 147 146 146 146 147 147 147 146 145 145 146 146 146 146 145 145 145 146 145 145 145 145 145 145 145 145 145 146 145 146 146 145 144 144 145 145
3005 145 145 144 144 145 145 144 144 144 144 144 145 145 145 145 144 144 145 145 145 146 147 148 148 147 147 147 146 146 146 146 146 146 146 146 147 147 146 145 145 145 145 145 145 145 145 144 144 144 144 145 146 146 146 146 146 145 145 145 145 144 144 144 145 145 146 146 146 146 146
2998 146 146 146 145 145 146 146 146 146 145 145 146 147 147 147 148 148 147 146 145 145 145 145 146 146 146 146 146 146 146 145 144 145 145 144 143 143 144 144 144 145 145 145 145 145 145 145 145 145 145 145 146 146 146 146 145 145 145 146 147 147 148 148 148 147 146 145 145 145 144
2990 144 144 144 145 145 146 146 146 146 146 145 145 145 146 147 147 147 146 146 146 146 145 145 145 146 146 147 148 148 147 147 146 146 146 147 147 147 146 145 145 145 145 146 145 145 145 145 146 146 146 145 145 144 144 145 145 145 145 144 145 145 145 146 146 147 147 146 147 147 147
2983 147 146 147 147 147 147 147 146 145 145 146 146 145 145 145 145 145 145 146 146 146 146 146 146 146 146 147 147 147 147 147 147 147 147 147 147 147 147 147 147 147 147 148 148 147 147 146 145 145 145 145 145 145 145 146 146 146 146 146 146 146 145 145 145 145 145 145 145 144 144
2976 144 144 145 145 145 144 144 145 146 147 147 147 146 145 145 145 145 145 145 146 146 146 146 146 146 146 147 146 146 147 147 147 147 147 147 147 147 146 146 146 147 147 148 148 148 147 147 147 148 147 147 146 145 145 145 145 146 146 146 147 147 148 148 147 147 147 146 146 146 146
2969 146 146 147 147 147 146 146 145 145 146 146 145 145 146 146 146 146 147 147 147 146 145 145 145 146 146 146 147 147 147 147 147 147 147 147 147 147 147 147 148 148 148 148 148 148 147 147 147 146 146 147 146 146 146 145 145 146 147 147 146 145 145 145 146 146 146 146 146 146 146
$$ packed form
3020A45J%%%%%j%%%%%%J%%%%%%%%%%%%jJJj%j%%%J%%j%%%%%%%J%%%%%%%%%%%%%%%%%J%%%j
3012A46j%J%%%%%%%%%%J%jjJ%J%%%%%Jj%jJ%%jJj%%J%%jj%J%%%j%%Jj%%%%%%%%JjJ%jj%J%
3005A45%j%J%j%%%%J%%%j%J%%JJJ%j%%j%%%%%%%J%jj%%%%%%%j%%%JJ%%%%j%%%j%%J%J%%%%
2998A46%%j%J%%%j%JJ%%J%jjj%%%J%%%%%%jjJ%jj%J%%J%%%%%%%%%%J%%%j%%JJ%J%%jjj%%j
2990A44%%J%J%%%%j%%JJ%%j%%%j%%J%JJ%j%j%%J%%jj%%%Jj%%%J%%j%j%J%%%jJ%%J%J%jJ%%
2983A47jJ%%%%jj%J%j%%%%%J%%%%%%%J%%%%%%%%%%%%%%%J%j%jj%%%%%%J%%%%%%j%%%%%%j%
2976A44%J%%j%JJJ%%jj%%%%%J%%%%%%Jj%J%%%%%%%j%%J%J%%j%%Jj%jj%%%J%%J%J%j%%j%%%
2969A46%J%%j%j%J%j%J%%%J%%jj%%J%%J%%%%%%%%%%%J%%%%%j%%j%Jj%%j%JJ%jj%%J%%%%%%
$$ plain form
2961 146 147 147 147 148 147 147 146 147 147 147 147 147 147 146 147 147 147 147 147 147 147 146 145 145 145 145 145 145 146 146 145 145 145 145 145 146 145 145 146 146 146 146 146 146 146 147 147 147 147 148 148 147 147 147 147 145 145 146 147 148 147 147 147 147 146 146 146 146 146
2954 146 146 146 147 147 147 147 146 147 147 146 146 146 147 146 146 147 146 145 146 147 147 147 146 147 147 148 148 148 148 148 148 148 149 149 148 148 147 147 147 147 147 148 148 147 147 147 148 149 149 149 149 149 149 148 148 147 147 147 148 148 148 148 148 148 149 149 149 149 149
2947 149 149 148 148 147 147 147 147 147 147 147 147 148 148 147 147 147 147 147 146 146 147 148 149 149 149 149 149 148 149 149 149 149 149 148 147 146 146 146 146 146 146 146 147 148 147 147 148 148 149 148 148 147 147 147 147 147 147 148 148 149 149 148 149 149 149 148 148 148 148
2939 148 148 148 149 148 148 149 149 150 150 151 151 151 150 150 150 149 149 149 149 149 150 150 149 148 147 148 149 150 149 148 148 148 148 146 146 146 147 148 148 148 148 148 148 149 149 148 148 148 147 148 148 149 149 149 149 148 148 148 148 148 148 148 148 148 148 148 148 149 149
2932 149 149 148 148 148 148 148 148 148 147 147 147 147 147 148 149 149 149 148 148 148 148 148 149 149 150 150 150 150 150 150 150 150 150 149 148 148 148 148 148 148 148 147 147 147 148 148 149 149 149 149 148 148 149 149 148 148 149 150 150 151 150 150 149 149 149 149 149 150 150
2925 150 150 150 150 150 149 149 149 149 148 148 148 149 150 150 150 149 148 147 147 148 148 148 149 149 149 150 150 149 149 148 147 147 147 148 149 149 150 150 150 151 151 151 151 151 150 150 151 151 150 149 149 151 152 153 153 152 151 150 150 149 149 149 149 150 150 150 150 150 150
2917 150 150 150 150 150 151 151 151 150 150 150 150 151 151 151 151 151 151 151 151 151 151 151 151 151 150 150 150 150 149 149 150 150 150 151 151 150 150 150 150 150 150 150 150 151 152 152 152 152 152 153 153 153 153 152 152 151 151 151 151 151 151 150 151 152 153 153 153 153 153
2910 153 152 152 151 152 152 153 153 153 153 153 153 152 153 153 152 152 152 152 152 151 151 151 152 152 152 151 151 151 151 151 151 151 151 152 152 153 153 153 152 152 151 151 150 151 151 152 152 151 151 152 153 152 152 152 152 152 152 153 153 153 153 154 154 155 156 155 155 154 154
$$ packed form
2961A46J%%Jj%jJ%%%%%jJ%%%%%%jj%%%%%J%j%%%%Jj%J%%%%%%J%%%J%j%%%k%JJJj%%%j%%%%
2954A46%%J%%%jJ%j%%Jj%JjjJJ%%jJ%J%%%%%%J%j%j%%%%J%j%%JJ%%%%%j%j%%J%%%%%J%%%%
2947A49%j%j%%%%%%%J%j%%%%j%JJJ%%%%jJ%%%%jjj%%%%%%JJj%J%Jj%j%%%%%J%J%jJ%%j%%%
2939A48%%Jj%J%J%J%%j%%j%%%%J%jjjJJJjj%%%k%%JJ%%%%%J%j%%jJ%J%%%j%%%%%%%%%%%J%
2932A49%j%%%%%%j%%%%JJ%%j%%%%J%J%%%%%%%%jj%%%%%%j%%J%J%%%j%J%j%JJ%Jj%j%%%%J%
2925A50%%%%j%%%j%%JJ%%jjj%J%%J%%J%j%jj%%JJ%J%%J%%%%j%J%jj%KJJ%jjj%j%%%J%%%%%
2917A50%%%%J%%j%%%J%%%%%%%%%%%%j%%%j%J%%J%j%%%%%%%JJ%%%%J%%%j%j%%%%%jJJJ%%%%
2910A53j%jJ%J%%%%%jJ%j%%%%j%%J%%j%%%%%%%J%J%%j%j%jJ%J%j%JJj%%%%%J%%%J%JJj%j%
$$ plain form
2903 154 154 153 153 153 154 155 154 153 154 155 155 155 154 154 154 154 154 155 155 155 155 155 154 155 155 155 154 154 155 155 154 153 153 153 153 154 155 155 154 154 155 156 155 155 155 155 155 155 155 155 155 155 155 155 155 156 156 156 155 154 154 154 155 155 156 157 156 156 155
2895 155 155 156 156 156 156 156 156 156 155 155 154 154 154 154 153 154 155 155 155 155 155 156 156 156 157 157 156 156 156 156 156 156 155 155 156 156 155 154 154 155 156 156 157 157 157 157 158 158 158 157 156 156 156 156 157 157 156 157 158 157 157 157 157 157 157 157 157 157 157
2888 157 157 157 157 158 157 156 157 157 157 158 157 157 157 158 158 158 158 158 157 157 158 158 159 159 160 160 161 160 159 158 158 158 158 158 158 158 158 158 158 158 159 159 159 158 159 159 159 160 160 161 161 160 160 159 159 158 159 159 158 159 159 159 159 159 160 160 160 160 161
2881 161 161 160 160 160 161 160 160 161 160 159 159 159 160 160 160 160 160 161 162 162 162 161 160 160 160 160 160 160 160 161 161 162 162 161 162 161 161 162 162 162 161 161 161 161 161 160 159 160 160 161 161 161 161 161 161 161 160 160 161 160 161 161 161 161 161 160 161 161 162
2873 162 162 162 162 161 161 161 161 161 161 162 162 162 162 162 162 162 161 161 161 161 160 160 160 160 160 161 161 162 163 162 162 162 162 161 161 161 161 161 161 161 161 161 161 161 161 161 161 161 162 162 163 163 162 162 162 161 161 161 161 161 161 160 160 159 159 159 159 160 161
2866 161 162 162 162 162 161 161 161 161 160 161 162 162 161 161 162 161 161 161 162 162 162 162 161 160 160 159 160 160 161 162 162 162 162 162 162 162 162 162 162 162 162 162 161 161 161 160 161 162 162 161 161 161 161 162 163 163 162 162 161 161 160 160 160 159 159 160 160 160 160
2859 160 161 161 160 160 160 160 160 159 159 159 159 159 159 160 160 160 160 159 160 160 160 160 160 160 161 161 160 160 160 160 160 159 159 159 159 159 159 158 157 157 157 157 157 157 157 158 158 157 157 157 157 158 158 159 159 158 158 158 158 158 158 157 158 159 159 159 159 159 158
2852 158 158 157 157 157 157 156 155 156 156 156 156 156 156 156 157 158 158 157 157 157 158 157 157 157 156 157 157 158 157 157 157 157 156 156 156 156 156 156 156 156 156 156 156 155 155 156 156 156 156 155 154 154 154 154 154 154 155 155 155 155 156 156 156 156 156 154 155 156 155
$$ packed form
2903A54%j%%JJjjJJ%%j%%%%J%%%%jJ%%j%J%jj%%%JJ%j%JJj%%%%%%%%%%%%J%%jj%%J%JJj%j
2895A55%J%%%%%%j%j%%%jJJ%%%%J%%J%j%%%%%j%J%jj%JJ%J%%%J%%jj%%%J%jJJj%%%%%%%%%
2888A57%%%JjjJ%%Jj%%J%%%%j%J%J%J%Jjjj%%%%%%%%%%J%%jJ%%J%J%j%j%jJ%jJ%%%%J%%%J
2881A61%j%%Jj%Jjj%%J%%%%JJ%%jj%%%%%%J%J%jJj%J%%j%%%%jjJ%J%%%%%%j%JjJ%%%%jJ%J
2873A62%%%j%%%%%J%%%%%%j%%%j%%%%J%JJj%%%j%%%%%%%%%%%%%%J%J%j%%j%%%%%j%j%%%JJ
2866A61J%%%j%%%jJJ%j%Jj%%J%%%jj%jJ%JJ%%%%%%%%%%%%j%%jJJ%j%%%JJ%j%j%j%%j%J%%%
2859A60J%j%%%%j%%%%%J%%%jJ%%%%%J%j%%%%j%%%%%jj%%%%%%J%j%%%J%J%j%%%%%jJJ%%%%j
2852A58%j%%%jjJ%%%%%%JJ%j%%Jj%%jJ%Jj%%%j%%%%%%%%%%j%J%%%jj%%%%%J%%%J%%%%kJJj
$$ plain form
2844 155 155 154 154 154 155 155 156 155 156 156 156 156 157 157 156 156 156 156 156 156 156 156 156 156 155 155 155 154 154 154 154 154 154 155 155 154 153 152 152 152 153 153 154 155 155 155 154 155 155 155 154 153 153 153 153 153 154 155 155 155 155 155 155 155 155 154 155 155 154
2837 154 154 153 153 153 152 152 153 153 153 152 153 153 153 152 152 153 153 153 153 153 152 152 153 153 153 152 152 152 151 151 151 151 151 151 151 152 152 151 152 152 152 152 151 152 153 153 152 151 151 151 152 152 152 153 153 153 154 154 154 154 153 152 151 151 152 152 152 151 151
2830 151 151 151 151 151 152 152 152 151 151 151 152 152 152 152 151 151 151 150 150 151 150 149 150 151 151 151 151 150 150 150 150 150 149 149 149 149 150 149 149 150 151 152 151 150 150 150 151 151 151 151 150 150 150 151 151 150 151 151 152 151 151 151 151 151 151 151 151 151 151
2822 151 151 151 150 150 150 150 150 150 151 151 151 151 151 150 150 151 151 152 152 152 152 151 151 150 150 150 150 150 150 150 150 151 151 150 150 150 150 150 150 150 150 151 150 149 151 152 152 151 150 150 149 149 148 148 148 148 148 148 149 149 149 149 149 150 150 150 149 150 150
2815 150 150 150 150 150 150 150 150 150 150 150 149 149 149 150 150 150 150 149 148 148 149 149 149 148 148 147 148 148 149 149 149 148 148 148 148 148 148 149 148 148 148 149 149 149 150 150 150 150 149 149 149 149 149 149 150 150 151 152 151 150 150 150 149 148 148 148 147 145 145
2808 145 145 146 146 146 146 147 147 146 146 147 148 148 148 148 148 148 148 147 146 146 147 147 147 147 146 146 146 147 147 147 148 147 146 146 146 147 147 147 147 147 148 148 147 147 146 147 148 148 148 147 146 146 146 146 146 146 146 146 147 148 148 148 148 148 147 148 149 148 147
2800 147 147 146 146 146 146 146 147 147 147 147 147 148 148 147 147 147 147 148 148 148 147 147 147 147 147 147 147 147 147 147 147 147 146 145 145 145 144 144 145 145 146 146 146 147 147 147 147 147 147 147 146 146 147 147 148 148 148 148 148 147 146 147 147 147 148 148 148 148 147
2793 147 147 147 147 147 147 148 148 148 147 147 148 148 148 148 147 147 147 147 147 147 148 148 148 148 148 147 148 149 150 150 149 149 149 148 148 148 148 148 148 147 147 147 147 147 147 147 147 147 147 147 147 148 148 147 147 147 147 148 148 149 150 149 148 148 147 146 146 147 147
$$ packed form
2844A55%j%%J%JjJ%%%J%j%%%%%%%%%j%%j%%%%%J%jjj%%J%JJ%%jJ%%jj%%%%JJ%%%%%%%jJ%j
2837A54%j%%j%J%%jJ%%j%J%%%%j%J%%j%%j%%%%%%J%jJ%%%jJJ%jj%%J%%J%%J%%%jjj%J%%j%
2830A51%%%%J%%j%%J%%%j%%j%JjjJJ%%%j%%%%j%%%Jj%JJJjj%%J%%%j%%J%jJ%Jj%%%%%%%%%
2822A51%%j%%%%%J%%%%j%J%J%%%j%j%%%%%%%J%j%%%%%%%JjjKJ%jj%j%j%%%%%J%%%%J%%jJ%
2815A50%%%%%%%%%%j%%J%%%jj%J%%j%jJ%J%%j%%%%%Jj%%J%%J%%%j%%%%%J%JJjj%%jj%%jk%
2808A45%J%%%J%j%JJ%%%%%%jj%J%%%j%%J%%Jjj%%J%%%%J%j%jJJ%%jj%%%%%%%JJ%%%%jJJjj
2800A47%j%%%%J%%%%J%j%%%J%%j%%%%%%%%%%%jj%%j%J%J%%J%%%%%%j%J%J%%%%jjJ%%J%%%j
2793A47%%%%%J%%j%J%%%j%%%%%J%%%%jJJJ%j%%j%%%%%j%%%%%%%%%%%J%j%%%J%JJjj%jj%J%
$$ plain form
2786 147 147 147 148 148 148 148 148 147 148 148 147 147 147 147 147 147 148 149 148 148 148 147 146 147 148 148 148 148 148 148 147 147 147 148 148 147 147 147 146 146 146 145 146 145 145 146 146 146 147 147 148 148 147 148 148 148 148 148 147 147 146 147 148 147 146 146 146 147 147
2778 147 147 147 147 147 147 147 147 147 147 147 147 147 147 147 147 147 147 147 147 147 147 147 146 147 147 148 148 148 148 148 148 148 147 147 148 149 149 148 148 148 149 149 149 148 148 147 146 146 147 147 147 147 147 147 147 147 146 145 146 146 147 147 148 147 147 146 146 146 146
2771 146 146 147 147 147 147 147 147 147 147 147 146 146 146 148 148 149 148 147 147 146 146 147 146 146 146 145 146 147 146 146 146 146 147 147 147 147 147 148 148 148 147 146 146 146 146 146 146 146 146 146 146 145 146 146 146 147 147 147 146 147 147 147 147 146 146 146 146 147 146
2764 146 146 145 146 146 147 148 149 149 148 147 147 147 147 146 146 146 146 146 146 146 148 148 147 147 147 147 147 147 146 147 146 146 146 146 146 145 144 144 144 145 146 146 147 147 147 146 146 146 146 146 146 146 146 146 146 146 146 146 146 146 146 146 146 147 147 147 147 146 146
2757 146 146 145 146 146 146 146 146 146 146 146 147 147 147 146 147 147 146 146 146 147 147 148 148 147 146 146 146 146 146 146 146 146 146 146 147 147 147 147 146 146 146 146 146 145 145 144 144 144 144 145 145 145 145 145 144 144 145 145 146 146 145 144 144 144 144 144 145 144 144
2749 144 145 145 146 146 146 147 147 146 146 146 145 144 144 144 144 144 144 145 145 145 144 143 143 143 144 145 146 146 145 145 145 144 145 146 147 146 146 145 145 145 145 146 146 145 145 145 146 146 147 147 148 147 146 147 147 147 147 146 146 146 146 146 146 146 145 145 145 145 146
2742 146 146 145 145 145 145 144 145 146 147 147 147 147 146 146 146 147 147 147 147 146 146 146 145 144 145 146 147 147 147 147 146 146 145 144 144 144 144 145 145 146 146 147 146 145 145 145 145 144 144 145 145 145 145 145 146 146 146 146 146 146 146 146 146 145 145 146 146 146 146
2735 146 145 145 145 145 146 145 145 145 145 145 145 145 145 145 145 145 145 145 145 145 145 145 145 145 145 146 147 146 146 146 145 145 146 146 146 145 145 145 144 144 144 145 145 145 144 144 145 145 145 145 145 145 145 145 146 146 146 146 147 147 146 145 145 144 144 144 145 146 146
$$ packed form
2786A47%%J%%%%jJ%j%%%%%JJj%%jjJJ%%%%%j%%J%j%%j%%jJj%J%%J%J%jJ%%%%j%jJJjj%%J%
2778A47%%%%%%%%%%%%%%%%%%%%%%jJ%J%%%%%%j%JJ%j%%J%%j%jj%J%%%%%%%jjJ%J%Jj%j%%%
2771A46%J%%%%%%%%j%%K%Jjj%j%Jj%%jJJj%%%J%%%%J%%jj%%%%%%%%%jJ%%J%%jJ%%%j%%%Jj
2764A46%jJ%JJJ%jj%%%j%%%%%%K%j%%%%%jJj%%%%jj%%JJ%J%%j%%%%%%%%%%%%%%%%%J%%%j%
2757A46%jJ%%%%%%%J%%jJ%j%%J%J%jj%%%%%%%%%J%%%j%%%%j%j%%%J%%%%j%J%J%jj%%%%Jj%
2749A44J%J%%J%j%%jj%%%%%J%%jj%%JJJ%j%%jJJJj%j%%%J%j%%J%J%JjjJ%%%j%%%%%%j%%%J
2742A46%j%%%jJJJ%%%j%%J%%%j%%jjJJJ%%%j%jj%%%J%J%Jjj%%%j%J%%%%J%%%%%%%%j%J%%%
2735A46j%%%Jj%%%%%%%%%%%%%%%%%%%JJj%%j%J%%j%%j%%J%%j%J%%%%%%%J%%%J%jj%j%%JJ%
$$ plain form
2727 146 145 145 145 144 144 145 145 145 144 144 144 144 144 144 144 144 144 145 145 145 145 145 145 145 145 145 145 145 144 144 143 143 143 143 144 144 144 144 144 144 144 144 144 144 144 143 143 143 142 142 142 142 143 144 144 145 145 145 145 145 145 145 144 144 144 144 144 144 144
2720 144 144 144 145 145 145 145 145 145 146 146 146 145 145 146 146 146 146 146 147 146 146 145 144 144 144 144 145 146 146 146 147 148 149 149 148 148 148 148 148 147 147 146 146 146 146 145 144 145 145 145 146 146 146 146 147 147 147 147 147 147 146 146 146 145 145 144 144 144 144
2713 144 143 144 145 145 145 144 144 144 144 145 145 145 145 146 146 147 147 146 146 146 145 145 145 145 146 146 146 146 146 146 145 144 144 144 144 144 145 146 146 146 146 146 147 147 146 146 145 145 145 144 145 145 145 146 145 145 145 146 146 147 146 145 145 145 144 144 143 144 145
2705 145 145 145 145 145 144 144 143 143 143 144 145 145 145 144 144 144 144 144 145 145 145 145 144 144 144 145 145 145 145 145 145 145 145 145 145 145 145 145 146 146 146 146 146 145 144 145 145 145 145 146 145 145 145 144 144 145 145 145 146 146 146 146 146 146 146 147 147 146 145
2698 145 144 144 145 145 145 146 146 146 146 147 147 147 147 147 147 146 147 146 145 144 144 144 145 145 145 146 146 145 145 145 145 144 143 144 144 146 147 147 147 147 147 148 148 147 147 147 146 146 146 146 146 147 148 147 147 146 147 147 147 146 146 146 147 147 147 147 147 148 148
2691 148 147 146 146 146 146 146 147 147 146 146 146 146 147 147 147 147 146 147 147 147 147 147 147 146 146 146 146 146 146 145 145 145 145 145 146 147 147 146 146 146 146 146 147 147 147 147 146 146 146 146 145 146 147 148 148 147 147 147 147 146 146 147 147 148 148 147 146 146 146
2683 146 145 145 145 146 146 147 147 148 147 146 145 145 146 146 146 146 145 145 145 145 145 146 146 146 147 147 147 147 147 147 147 147 146 145 145 145 145 145 145 145 145 145 145 145 145 145 145 145 146 146 146 146 146 146 146 146 145 145 146 146 146 146 146 146 146 146 145 145 145
2676 145 145 146 147 147 146 145 144 144 145 146 147 147 147 147 148 149 149 149 148 148 148 148 147 146 146 145 145 145 146 147 147 147 147 147 147 146 146 147 147 147 147 147 147 147 147 147 147 148 148 148 147 147 147 147 147 147 147 146 146 146 146 146 147 147 147 146 146 146 147
$$ packed form
2727A46j%%j%J%%j%%%%%%%%J%%%%%%%%%%j%j%%%J%%%%%%%%%%j%%j%%%JJ%J%%%%%%j%%%%%%
2720A44%%J%%%%%J%%j%J%%%%Jj%jj%%%JJ%%JJJ%j%%%%j%j%%%jjJ%%J%%%J%%%%%j%%j%j%%%
2713A44jJJ%%j%%%J%%%J%J%j%%j%%%J%%%%%jj%%%%JJ%%%%J%j%j%%jJ%%Jj%%J%Jjj%%j%jJJ
2705A45%%%%j%j%%JJ%%j%%%%J%%%j%%J%%%%%%%%%%%%J%%%%jjJ%%%Jj%%j%J%%J%%%%%%J%jj
2698A45j%J%%J%%%J%%%%%jJjjj%%J%%J%j%%%jjJ%KJ%%%%J%j%%j%%%%JJj%jJ%%j%%J%%%%J%
2691A48jj%%%%J%j%%%J%%%jJ%%%%%j%%%%%j%%%%JJ%j%%%%J%%%j%%%jJJJ%j%%%j%J%J%jj%%
2683A46j%%J%J%Jjjj%J%%%j%%%%J%%J%%%%%%%jj%%%%%%%%%%%%%%J%%%%%%%j%J%%%%%%%j%%
2676A45%JJ%jjj%JJJ%%%JJ%%j%%%jj%j%%JJ%%%%%j%J%%%%%%%%%J%%j%%%%%%j%%%%J%%j%%J
$$ plain form
2669 147 148 149 149 149 148 148 147 146 146 146 146 146 146 146 146 146 147 148 148 147 146 146 146 147 147 147 147 147 147 147 147 146 146 146 145 146 147 147 146 146 146 147 147 147 146 147 147 147 147 147 148 148 147 147 146 146 146 147 147 148 147 147 147 147 148 148 147 148 148
2661 148 147 147 147 147 147 147 147 147 148 148 148 147 148 148 147 147 147 147 147 146 145 146 147 148 148 148 147 146 146 146 146 146 146 147 147 148 148 148 147 148 148 148 148 148 147 147 147 147 147 147 147 147 147 147 146 146 146 145 146 146 146 146 146 147 147 148 147 147 147
2654 147 146 146 147 147 148 149 149 149 148 148 147 148 148 149 149 148 147 148 148 149 148 147 146 146 146 146 146 147 147 147 147 146 147 148 148 147 147 147 147 147 147 146 146 146 147 146 146 146 145 145 146 146 146 147 148 148 148 148 148 148 148 148 148 148 148 148 148 148 148
2647 148 147 148 148 147 148 148 148 148 149 148 147 147 146 146 147 147 147 147 147 147 147 147 147 147 147 147 147 147 147 147 147 147 146 146 146 146 147 146 147 148 149 148 148 147 148 148 147 147 147 147 147 147 146 146 146 147 148 148 148 148 148 149 149 149 148 147 146 146 145
2640 145 144 144 144 145 146 147 147 148 148 148 149 149 149 148 147 147 147 148 148 149 148 147 147 147 148 148 148 148 149 149 149 148 147 147 146 145 146 146 146 146 146 147 147 148 148 147 147 147 147 146 146 147 146 146 147 148 148 148 148 148 148 148 148 147 147 147 147 147 147
2632 147 147 147 147 147 147 147 148 148 147 147 147 146 146 147 148 148 148 148 147 147 149 148 148 148 148 148 149 149 150 150 149 149 148 148 147 147 147 147 147 147 147 146 146 146 147 148 148 148 148 148 148 148 147 147 147 147 147 146 146 146 146 146 147 147 147 148 148 148 149
2625 149 149 149 149 149 150 150 149 149 149 150 149 149 149 148 148 148 148 148 148 147 147 147 147 147 148 148 148 148 147 147 147 147 148 148 147 147 147 146 146 146 146 146 146 146 147 147 147 148 148 149 148 148 149 150 149 148 147 147 148 149 149 149 148 148 148 148 149 148 148
2618 148 147 147 147 147 147 147 147 147 147 148 149 149 150 149 149 148 148 148 148 147 147 148 148 148 148 147 147 148 148 149 149 149 149 149 149 149 149 149 149 149 149 149 148 148 149 149 149 149 149 149 149 149 149 149 149 149 148 148 148 148 148 148 148 148 148 149 149 150 150
$$ packed form
2669A47JJ%%j%jj%%%%%%%%JJ%jj%%J%%%%%%%j%%jJJ%j%%J%%jJ%%%%J%j%j%%J%Jj%%%J%jJ%
2661A48j%%%%%%%J%%jJ%j%%%%jjJJJ%%jj%%%%%J%J%%jJ%%%%j%%%%%%%%%j%%jJ%%%%J%Jj%%
2654A47j%J%JJ%%j%jJ%J%jjJ%Jjjj%%%%J%%%jJJ%j%%%%%j%%Jj%%j%J%%JJ%%%%%%%%%%%%%%
2647A48jJ%jJ%%%Jjj%j%J%%%%%%%%%%%%%%%%%j%%%JjJJJj%jJ%j%%%%%j%%JJ%%%%J%%jjj%j
2640A45j%%JJJ%J%%J%%jj%%J%Jjj%%J%%%J%%jj%jjJ%%%%J%J%j%%%j%Jj%JJ%%%%%%%j%%%%%
2632A47%%%%%%J%j%%j%JJ%%%j%Kj%%%%J%J%j%j%j%%%%%%j%%JJ%%%%%%j%%%%j%%%%J%%J%%J
2625A49%%%%J%j%%Jj%%j%%%%%j%%%%J%%%j%%%J%j%%j%%%%%%J%%J%Jj%JJjjj%JJ%%j%%%Jj%
2618A48j%%%%%%%%JJ%Jj%j%%%j%J%%%j%J%J%%%%%%%%%%%%j%J%%%%%%%%%%%j%%%%%%%%J%J%
$$ plain form
2610 150 150 150 149 148 148 148 148 148 148 148 148 148 148 149 150 150 149 149 149 149 149 149 148 148 148 148 148 148 147 147 147 147 147 148 149 149 149 150 150 150 150 149 148 148 148 148 148 148 148 148 148 148 147 147 147 148 148 147 147 148 148 148 147 147 148 148 148 148 148
2603 148 148 148 148 147 146 146 147 147 147 147 148 148 148 148 148 148 148 148 148 148 148 148 148 148 149 149 150 149 148 147 148 149 150 149 149 149 149 149 149 149 149 149 150 150 151 150 150 150 149 149 149 149 148 148 149 149 149 150 150 150 150 149 149 149 150 150 150 150 150
2596 150 149 149 149 150 150 150 149 149 149 149 148 148 149 149 149 149 148 148 148 149 149 149 149 150 150 149 149 149 149 150 149 149 149 149 149 149 149 149 149 149 149 149 149 150 150 150 150 149 149 149 150 149 149 150 149 149 149 150 150 149 149 149 149 148 149 150 150 149 149
2588 149 148 147 147 147 147 147 146 147 148 148 148 148 148 148 149 150 150 150 150 150 149 149 148 149 149 149 150 151 152 152 153 152 151 151 151 151 150 149 149 150 150 150 150 150 149 150 150 149 149 149 149 150 150 150 150 150 150 149 150 151 151 150 150 150 150 150 150 150 150
2581 150 150 150 150 149 149 149 149 150 150 150 150 149 149 149 150 151 151 150 151 150 150 150 150 151 152 152 151 149 149 150 150 150 150 149 149 149 149 149 149 149 149 149 150 150 150 151 151 150 150 151 151 151 152 152 152 152 152 152 153 153 152 151 151 151 151 152 151 151 150
2574 150 150 151 152 152 152 153 153 153 152 152 152 152 152 152 152 152 152 152 151 151 150 150 150 151 151 152 152 152 152 152 151 151 151 151 150 150 150 150 150 151 151 151 151 152 153 153 153 152 152 152 152 153 153 153 153 153 153 153 153 153 153 153 152 152 151 152 152 152 152
2566 152 153 153 153 152 151 150 150 151 151 151 152 152 152 152 152 152 153 154 154 153 152 151 151 152 151 151 151 151 151 151 151 152 152 153 153 153 153 152 152 153 154 154 153 153 152 153 153 153 153 153 153 152 153 153 153 154 153 152 152 152 153 153 152 152 152 152 152 152 153
2559 153 153 153 153 153 153 154 155 154 154 154 154 154 154 154 153 153 153 153 153 153 153 154 155 155 155 155 155 155 155 155 154 153 153 153 153 153 154 154 155 155 155 154 154 155 155 155 155 155 154 154 154 154 153 153 153 153 153 153 153 153 153 153 152 153 153 153 153 154 155
$$ packed form
2610A50%%jj%%%%%%%%%JJ%j%%%%%j%%%%%j%%%%JJ%%J%%%jj%%%%%%%%%j%%J%j%J%%j%J%%%%
2603A48%%%jj%J%%%J%%%%%%%%%%%%%J%JjjjJJJj%%%%%%%%J%Jj%%j%%%j%J%%J%%%j%%J%%%%
2596A50j%%J%%j%%%j%J%%%j%%J%%%J%j%%%Jj%%%%%%%%%%%%J%%%j%%Jj%Jj%%J%j%%%jJJ%j%
2588A49jj%%%%jJJ%%%%%JJ%%%%j%jJ%%JJJ%Jjj%%%jj%J%%%%jJ%j%%%J%%%%%jJJ%j%%%%%%%
2581A50%%%j%%%J%%%j%%JJ%jJj%%%JJ%jk%J%%%j%%%%%%%%J%%J%j%J%%J%%%%%J%jj%%%Jj%j
2574A50%JJ%%J%%j%%%%%%%%%j%j%%J%J%%%%j%%%j%%%%J%%%JJ%%j%%%J%%%%%%%%%%j%jJ%%%
2566A52J%%jjj%J%%J%%%%%JJ%jjj%Jj%%%%%%J%J%%%j%JJ%j%jJ%%%%%jJ%%Jjj%%J%j%%%%%J
2559A53%%%%%JJj%%%%%%j%%%%%%JJ%%%%%%%jj%%%%J%J%%j%J%%%%j%%%j%%%%%%%%%jJ%%%JJ
$$ plain form
2552 155 156 155 154 154 154 154 154 154 155 155 154 153 154 154 154 155 155 156 155 155 155 156 156 155 155 155 154 154 154 154 154 153 153 153 154 156 156 155 154 154 154 154 154 155 154 155 155 155 154 153 153 153 154 155 154 154 154 155 155 155 156 156 156 156 156 156 156 155 155
2544 155 155 155 155 155 155 153 154 155 155 154 154 155 155 155 154 154 155 155 155 155 155 156 156 156 155 155 156 156 156 156 156 156 155 154 154 155 156 157 158 158 158 157 156 155 155 156 156 156 156 156 157 157 158 157 156 156 156 156 156 156 156 157 157 157 157 158 158 158 157
2537 157 157 157 156 156 156 156 156 157 157 158 158 158 157 157 157 158 158 158 158 157 156 156 156 157 158 157 157 157 156 156 157 157 157 156 156 156 156 156 157 157 157 158 158 158 158 159 159 159 158 158 158 158 157 158 158 158 158 158 158 157 158 158 158 157 156 156 156 156 156
2530 156 156 157 157 158 158 158 158 157 158 158 158 158 157 156 157 157 158 158 158 159 159 158 157 157 157 157 156 157 158 159 159 159 159 159 159 158 157 156 156 157 157 158 159 159 159 159 159 159 158 158 158 159 160 159 159 159 160 160 160 160 160 160 160 159 159 159 159 159 159
2523 159 160 159 159 158 159 159 158 158 158 158 158 158 159 159 159 159 158 158 159 159 159 159 159 159 159 159 159 159 159 159 159 159 159 159 160 160 160 159 159 158 158 159 159 159 159 159 159 160 160 160 159 159 159 159 160 160 160 160 160 160 159 158 159 160 160 160 160 160 160
2515 160 159 160 160 160 160 160 160 160 160 160 160 160 159 159 159 159 160 160 160 160 161 160 160 160 161 162 161 160 159 160 160 160 160 160 160 159 159 161 161 161 162 162 162 161 161 161 161 162 163 162 162 162 163 163 163 162 160 161 161 161 161 161 161 161 161 161 162 163 162
2508 162 162 161 162 162 162 163 162 162 162 162 162 162 162 162 162 162 162 162 162 162 162 161 163 164 164 164 163 162 163 163 163 163 162 162 162 162 162 162 162 162 163 163 164 164 165 166 166 166 165 164 163 163 164 164 165 165 165 165 165 165 165 165 165 165 165 165 165 165 164
2501 164 164 163 163 164 165 165 165 165 166 166 166 166 166 166 167 167 167 166 165 165 165 165 165 165 165 165 165 165 165 165 165 166 166 166 165 165 165 165 164 165 166 167 168 167 166 166 165 165 165 166 167 167 167 166 166 166 166 166 166 165 165 165 165 165 166 166 166 166 167
$$ packed form
2552A55Jjj%%%%%J%jjJ%%J%Jj%%J%j%%j%%%%j%%JK%jj%%%%JjJ%%jj%%JJj%%J%%J%%%%%%j%
2544A55%%%%%kJJ%j%J%%j%J%%%%J%%j%J%%%%%jj%JJJJ%%jjj%J%%%%J%Jjj%%%%%%J%%%J%%j
2537A57%%j%%%%J%J%%j%%J%%%jj%%JJj%%j%J%%j%%%%J%%J%%%J%%j%%%jJ%%%%%jJ%%jj%%%%
2530A56%J%J%%%jJ%%%jjJ%J%%J%jj%%%jJJJ%%%%%jjj%J%JJ%%%%%j%%JJj%%J%%%%%%j%%%%%
2523A59Jj%jJ%j%%%%%J%%%j%J%%%%%%%%%%%%%%%J%%j%j%J%%%%%J%%j%%%J%%%%%jjJJ%%%%%
2515A60jJ%%%%%%%%%%j%%%J%%%Jj%%JJjjjJ%%%%%j%K%%J%%j%%%JJj%%J%%jkJ%%%%%%%%JJj
2508A62%jJ%%Jj%%%%%%%%%%%%%%jKJ%%jjJ%%%j%%%%%%%J%J%JJ%%jjj%J%J%%%%%%%%%%%%%j
2501A64%j%JJ%%%J%%%%%J%%jj%%%%%%%%%%%%J%%j%%%jJJJJjj%j%%JJ%%j%%%%%j%%%%J%%%J
$$ plain form
2493 167 167 166 166 166 166 166 166 166 166 165 166 166 167 167 167 167 167 167 167 168 167 167 167 166 166 166 166 167 167 167 166 166 166 167 168 167 167 167 167 167 167 167 167 167 166 165 164 165 166 166 166 165 165 165 165 166 166 167 167 168 168 167 166 165 166 167 167 167 168
2486 168 168 168 168 168 168 168 168 168 168 169 169 169 169 169 169 169 168 169 169 169 169 169 170 169 168 169 169 169 169 168 168 168 168 169 170 170 170 170 170 170 169 169 170 170 171 171 171 170 169 169 169 170 170 171 170 170 170 170 170 170 170 171 171 171 172 172 172 172 172
2479 172 171 171 171 171 173 173 173 172 173 174 175 175 174 174 173 173 173 174 174 174 174 174 175 175 175 175 174 173 172 172 172 172 173 173 173 173 174 174 174 174 175 175 175 175 175 175 175 175 174 174 174 175 175 175 175 175 175 175 175 175 175 175 176 176 176 176 177 177 178
2471 178 178 178 178 178 178 178 177 177 177 177 176 176 178 178 179 178 177 177 177 177 178 178 177 178 178 177 177 177 178 178 178 178 178 179 179 178 179 179 179 179 179 179 180 180 180 180 180 179 179 180 180 180 180 179 179 180 181 181 181 181 181 181 181 182 182 182 182 182 182
2464 182 183 183 183 183 183 183 182 182 183 183 183 183 182 182 182 181 181 181 181 182 183 184 184 184 184 183 182 182 182 182 183 183 183 183 183 183 183 183 183 182 182 182 182 182 182 182 183 184 184 184 185 185 185 186 186 186 186 185 186 186 186 186 186 185 185 186 187 188 188
2457 188 188 188 188 188 187 187 187 187 187 187 188 188 189 188 188 188 188 189 189 189 189 190 190 189 189 190 189 189 189 189 189 189 189 190 190 190 190 190 190 190 191 191 191 191 192 192 193 192 192 191 191 191 190 191 191 191 192 191 191 191 190 190 190 190 191 192 193 193 193
2449 193 193 193 193 193 193 193 193 194 194 194 194 194 194 194 194 194 195 196 195 195 195 195 196 196 195 196 197 197 198 198 197 197 197 197 197 197 196 195 195 195 196 197 197 196 196 197 198 199 200 201 202 202 201 200 199 199 199 199 199 199 199 200 200 200 200 201 201 201 201
2442 201 201 201 200 200 201 201 201 201 202 203 204 204 203 203 203 203 203 203 204 204 204 205 205 205 205 205 205 205 206 205 205 204 204 204 205 205 205 205 205 205 205 205 206 205 204 204 204 204 206 207 208 208 207 206 206 206 206 207 208 209 209 209 209 209 209 210 210 210 211
$$ packed form
2493A67%j%%%%%%%jJ%J%%%%%%Jj%%j%%%J%%j%%JJj%%%%%%%%jjjJJ%%j%%%J%J%J%jjjJJ%%J
2486A68%%%%%%%%%J%%%%%%jJ%%%%JjjJ%%%j%%%JJ%%%%%j%J%J%%jj%%J%Jj%%%%%%J%%J%%%%
2479A72j%%%K%%jJJJ%j%j%%J%%%%J%%%jjj%%%J%%%J%%%J%%%%%%%j%%J%%%%%%%%%%J%%%J%J
2471A78%%%%%%j%%%j%K%Jjj%%%J%jJ%j%%J%%%%J%jJ%%%%%J%%%%j%J%%%j%JJ%%%%%%J%%%%%
2464A82J%%%%%j%J%%%j%%j%%%JJJ%%%jj%%%J%%%%%%%%j%%%%%%JJ%%J%%J%%%jJ%%%%j%JJJ%
2457A88%%%%j%%%%%J%Jj%%%J%%%J%j%Jj%%%%%%J%%%%%%J%%%J%Jj%j%%jJ%%Jj%%j%%%JJJ%%
2449A93%%%%%%%J%%%%%%%%JJj%%%J%jJJ%J%j%%%%%jj%%JJ%j%JJJJJJ%jjj%%%%%%J%%%J%%%
2442B01%%j%J%%%JJJ%j%%%%%J%%J%%%%%%Jj%j%%J%%%%%%%Jjj%%%KJJ%jj%%%JJJ%%%%%J%%J
$$ plain form
2435 211 211 211 210 210 209 209 210 211 212 212 211 212 213 213 213 214 214 214 214 214 214 214 214 215 216 216 215 214 214 214 214 214 214 214 214 214 214 214 214 214 215 216 216 217 217 217 217 218 218 218 219 219 219 219 219 219 219 221 222 222 222 222 222 222 222 222 222 222 222
2427 222 222 222 222 222 222 223 223 223 223 222 222 223 223 223 224 224 224 225 226 226 227 226 226 226 226 227 227 227 227 227 228 228 229 229 228 229 230 231 231 231 231 231 231 231 231 232 232 232 232 232 232 233 232 232 232 233 234 234 234 235 236 236 236 236 236 236 237 238 238
2420 238 238 238 238 238 238 239 238 239 239 239 239 239 239 240 240 241 241 242 242 242 242 243 243 244 244 245 245 245 245 246 246 245 246 246 245 246 247 247 247 247 247 247 248 248 248 249 249 249 248 248 249 249 250 250 251 251 251 252 252 252 252 252 253 253 254 254 255 256 256
2413 256 256 257 257 257 258 258 258 257 256 257 258 258 259 259 260 260 261 261 261 260 260 261 262 263 264 265 265 266 266 264 264 264 265 266 266 266 267 267 268 269 270 270 271 272 272 271 271 271 272 273 273 273 272 272 273 274 274 275 276 276 277 278 278 277 278 278 278 279 280
2406 280 281 281 282 282 283 284 284 284 284 285 285 285 285 286 287 287 287 288 288 289 290 291 291 292 293 293 294 294 294 294 295 296 296 296 297 298 298 298 297 297 298 299 300 301 301 302 302 303 303 304 304 304 304 305 306 307 307 308 308 307 308 310 310 311 312 313 313 314 314
2398 314 314 315 316 316 317 318 318 319 319 319 320 321 322 323 323 325 326 327 327 328 328 328 329 329 330 330 331 332 333 333 333 333 334 335 337 337 338 339 339 339 340 341 342 343 343 343 343 345 346 347 347 348 349 350 350 351 351 351 352 354 355 356 357 357 357 358 359 360 361
2391 361 362 363 363 365 366 367 367 367 368 368 369 370 372 373 374 376 376 377 377 378 379 380 382 383 384 385 386 386 386 387 388 389 390 390 391 393 394 395 396 397 399 400 400 401 402 404 404 404 406 407 409 410 411 411 412 413 414 415 417 418 420 420 421 421 422 423 425 426 427
2384 427 428 429 431 432 433 435 436 438 439 440 442 443 445 447 448 450 452 453 453 453 454 455 457 459 461 462 463 464 465 466 468 469 471 472 472 474 476 477 479 480 482 483 485 487 488 489 491 493 494 495 497 499 501 503 504 506 507 509 511 512 514 517 519 521 522 523 525 526 529
$$ packed form
2435B11%%j%j%JJJ%jJJ%%J%%%%%%%JJ%jj%%%%%%%%%%%%JJ%J%%%J%%J%%%%%%KJ%%%%%%%%%%
2427B22%%%%%J%%%j%J%%J%%JJ%Jj%%%J%%%%J%J%jJJJ%%%%%%%J%%%%%Jj%%JJ%%JJ%%%%%JJ%
2420B38%%%%%JjJ%%%%%J%J%J%%%J%J%J%%%J%jJ%jJJ%%%%%J%%J%%j%J%J%J%%J%%%%J%J%JJ%
2413B56%J%%J%%jjJJ%J%J%J%%j%JJJJJ%J%k%%JJ%%J%JJJ%JJ%j%%JJ%%j%JJ%JJ%JJ%jJ%%JJ
2406B80J%J%JJ%%%J%%%JJ%%J%JJJ%JJ%J%%%JJ%%JJ%%j%JJJJ%J%J%J%%%JJJ%J%jJK%JJJ%J%
2398C14%JJ%JJ%J%%JJJJ%KJJ%J%%J%J%JJJ%%%JJK%JJ%%JJJJ%%%KJJ%JJJ%J%%JKJJJ%%JJJJ
2391C61JJ%KJJ%%J%JJKJJK%J%JJJKJJJJ%%JJJJ%JKJJJJKJ%JJK%%KJKJJ%JJJJKJK%J%JJKJJ
2384D27JJKJJKJKJJKJKKJKKJ%%JJKKKJJJJJKJKJ%KKJKJKJKKJJKKJJKKKKJKJKKJKLKKJJKJL
$$ plain form
2376 529 531 534 535 537 539 541 544 546 547 547 548 550 552 554 556 558 560 562 564 567 569 571 574 576 578 581 583 585 587 590 592 594 596 598 600 602 604 607 609 612 614 617 620 623 626 628 630 632 634 637 639 641 644 647 649 651 654 657 660 663 665 668 671 674 677 680 684 687 689
2369 689 692 695 698 701 704 706 709 713 716 719 722 725 728 731 734 737 741 744 748 751 755 759 762 766 769 773 776 780 784 788 791 795 799 803 807 811 814 817 821 825 829 834 838 842 847 852 856 860 863 867 870 874 879 884 890 895 900 904 909 913 918 923 928 932 938 943 948 952 957
2362 957 961 966 971 976 981 986 991 997 1002 1007 1013 1019 1025 1031 1036 1042 1048 1054 1060 1065 1071 1077 1083 1090 1096 1102 1108 1113 1120 1128 1136 1143 1150 1156 1163 1170 1176 1183 1191 1197 1204 1210 1217 1224 1231 1238 1246 1254 1262 1270 1277 1285 1292 1300 1308 1316 1325 1333 1341 1350 1358 1366 1375 1383 1392 1401 1411 1420
2354 1420 1429 1438 1447 1457 1466 1474 1483 1492 1503 1513 1524 1535 1544 1553 1563 1573 1583 1593 1604 1614 1625 1636 1647 1657 1668 1679 1690 1701 1712 1724 1735 1747 1759 1770 1782 1794 1806 1817 1829
2350 1829 1841 1854 1867 1880 1893 1906 1918 1931 1944 1957 1970 1983 1997 2011 2025 2038 2050 2065 2079 2094 2109 2122 2136 2149 2162 2176 2191 2206 2221 2236 2251 2266 2282 2297
2347 2297 2311 2326 2341 2357 2372 2387 2402 2418 2433 2448 2463 2479 2495 2511 2527 2542 2557 2573 2588 2604 2620 2636 2652 2668 2683 2699 2715 2730 2746 2761 2777 2793 2809 2824
2343 2824 2839 2855 2870 2886 2902 2918 2933 2948 2963 2977 2992 3006 3021 3036 3050 3066 3080 3094 3108 3122 3134 3147 3160 3174 3187 3200 3213 3225 3237 3250 3262 3273 3284 3295
2340 3295 3306 3317 3328 3338 3348 3357 3367 3376 3384 3393 3401 3410 3419 3426 3433 3438 3444 3450 3457 3462 3467 3472 3477 3482 3486 3489 3492 3494 3496 3498 3500 3500 3501 3503 3504 3503 3503 3504 3503 3501 3499 3496 3494 3491 3489 3485 3481 3477 3473 3468 3462 3457 3452 3447 3441 3435 3428 3420 3413 3405 3397 3388
$$ packed form
2376E29KLJKKKLKJ%JKKKKKKKKLKKLKKLKKKLKKKKKKKLKLKLLLLKKKKLKKLLKKLLLLKLLLLLMLK
2369F89LLLLLKLMLLLLLLLLMLMLMMLMLMLMMMLMMMMMLLMMMNMMNNMMLMLMNNONNMNMNNNMONNMN
2362I57MNNNNNNONNOOOONOOOONOOOPOOONPQQPPOPPOPQOPOPPPPQQQQPQPQQQRQQRQQRQRRJ0R
2354A420RRRJ0RQRRJ1J0J1J1RRJ0J0J0J0J1J0J1J1J1J0J1J1J1J1J1J2J1J2J2J1J2J2J2J1J2
2350A829J2J3J3J3J3J3J2J3J3J3J3J3J4J4J4J3J2J5J4J5J5J3J4J3J3J4J5J5J5J5J5J5J6J5
2347B297J4J5J5J6J5J5J5J6J5J5J5J6J6J6J6J5J5J6J5J6J6J6J6J6J5J6J6J5J6J5J6J6J6J5
2343B824J5J6J5J6J6J6J5J5J5J4J5J4J5J5J4J6J4J4J4J4J2J3J3J4J3J3J3J2J2J3J2J1J1J1
2340C295J1J1J1J0J0RJ0RQRQRRPPNOOPNNNNNMLLKKKK%JKJj%Jjkklklkmmmmnonnnoopqpqqr
$$ plain form
2333 3388 3378 3369 3360 3350 3340 3330 3319 3309 3298 3288 3277 3266 3254 3242 3230 3218 3206 3193 3180 3167 3153 3140 3127 3114 3100 3087 3073 3059 3045 3029 3014 2999 2984 2969 2954
2329 2954 2940 2925 2910 2894 2878 2863 2847 2831 2816 2800 2785 2770 2754 2739 2723 2708 2692 2676 2660 2644 2628 2613 2597 2581 2566 2550 2535 2519 2504 2489 2473 2458 2443 2427
2326 2427 2412 2397 2381 2366 2351 2337 2322 2306 2291 2276 2262 2247 2233 2218 2204 2190 2176 2162 2148 2133 2119 2105 2091 2077 2063 2050 2036 2023 2009 1996 1983 1970 1956 1942
2322 1942 1929 1917 1905 1891 1878 1865 1853 1841 1829 1817 1805 1793 1781 1770 1759 1747 1736 1724 1713 1702 1690 1678 1668 1658 1647 1636 1624 1614 1603 1593 1583 1573 1563 1553
2318 1553 1543 1533 1523 1513 1504 1495 1486 1477 1467 1457 1447 1437 1427 1418 1410 1401 1393 1385 1376 1367 1359 1350 1342 1333 1325 1317 1310 1302 1294 1286 1278 1271 1263 1255 1247 1239 1232 1224 1217 1209 1202 1194 1187 1180 1173 1167 1160 1153 1147 1140 1133 1126 1119 1111 1104 1098 1092 1086 1079
2312 1079 1073 1067 1061 1055 1049 1044 1039 1033 1028 1022 1017 1011 1006 1000 995 989 983 978 974 969 963 957 952 947 942 937 932 927 922 917 912 907 903 898 893 888 884 879 874 870 866 862 857 853 848 844 839 835 831 828 825 821 817 813 808 804 799 795 791 787 783 779 775 772 768 765 761 758
2305 758 755 752 749 745 742 739 735 732 729 726 722 718 715 712 708 705 703 700 696 693 689 686 684 681 678 676 673 670 667 664 661 658 655 652 650 647 643 641 640 637 635 632 630 628 625 621 618 616 614 612 609 606 604 601 598 596 594 592 590 588 586 584 582 579 577 574 572 570 567
2298 567 565 562 560 558 556 553 551 549 547 545 544 542 540 538 536 534 532 530 528 526 525 523 522 521 520 517 515 512 510 509 507 506 504 502 500 498 496 495 493 493 492 491 490 488 487 485 483 481 479 477 475 473 472 470 468 467 466 466 465 464 463 460 458 457 456 455 454 453 451
$$ packed form
2333C388j0rrj0j0j0j1j0j1j0j1j1j2j2j2j2j2j3j3j3j4j3j3j3j4j3j4j4j4j6j5j5j5j5j5
2329B954j4j5j5j6j6j5j6j6j5j6j5j5j6j5j6j5j6j6j6j6j6j5j6j6j5j6j5j6j5j5j6j5j5j6
2326B427j5j5j6j5j5j4j5j6j5j5j4j5j4j5j4j4j4j4j4j5j4j4j4j4j4j3j4j3j4j3j3j3j4j4
2322A942j3j2j2j4j3j3j2j2j2j2j2j2j2j1j1j2j1j2j1j1j2j2j0j0j1j1j2j0j1j0j0j0j0j0
2318A553j0j0j0j0rrrrj0j0j0j0j0rqrqqrrqrqrqqpqqqqpqqqqpqpqpqpppoppoppppqpooop
2312A079ooooonnononononoonmnoonnnnnnnnnnmnnnmnnmmmnmnmnmmllmmmnmnmmmmmmlmlml
2305G58lllmllmlllmmllmlklmlmlkllkllllllllklmkjlklkklmlkkkllkllkkkkkkkklklkkl
2298E67klkkklkkkkjkkkkkkkkkjkjjjlklkjkjkkkkkjk%jjjkjkkkkkkkjkkjj%jjjlkjjjjjk
$$ plain form
2290 451 449 448 446 444 443 442 441 440 439 437 436 435 434 433 432 430 428 427 426 426 424 423 422 421 419 418 416 415 413 413 412 410 410 409 408 406 404 403 401 400 400 400 399 398 397 396 395 395 394 393 393 391 390 388 387 386 385 385 383 382 381 380 379 377 376 375 375 374 374
2283 374 373 372 371 371 370 369 368 368 367 367 366 365 364 363 362 361 360 359 359 358 357 356 356 355 355 356 356 355 356 356 357 357 358 359 359 360 359 358 356 355 353 351 349 347 344 342 339 338 337 336 335 334 332 331 331 330 330 330 329 329 329 328 327 325 324 323 322 322 322
2276 322 322 321 320 319 319 318 318 317 316 315 315 314 313 312 312 311 311 310 310 309 309 309 307 306 306 306 305 305 304 303 303 302 302 302 301 301 301 300 299 299 299 298 298 297 296 295 295 294 293 293 292 291 291 290 289 289 288 288 287 287 287 287 286 285 285 284 284 284 284
2268 284 283 282 282 282 282 282 281 280 279 279 279 279 279 279 278 277 276 275 274 275 275 274 274 273 272 272 272 271 271 270 269 269 270 270 269 270 270 269 269 269 268 268 267 267 266 266 265 264 264 263 263 263 263 263 263 262 262 261 260 260 260 259 258 257 256 257 256 256 256
2261 256 256 257 258 258 257 257 256 256 257 256 256 255 254 254 253 253 252 251 251 251 249 249 248 248 247 246 246 247 247 247 247 246 246 246 246 245 245 246 246 246 247 246 246 246 245 244 244 243 242 242 242 242 242 242 242 242 241 240 239 237 237 237 237 236 236 236 236 235 234
2254 234 234 234 234 234 235 235 235 236 235 233 232 232 232 232 232 232 231 231 232 232 232 231 231 231 230 231 231 231 231 231 231 230 228 227 227 227 227 227 227 226 226 225 225 225 225 225 225 224 225 225 225 226 225 224 224 223 223 222 222 221 221 221 221 220 220 219 219 219 219
2247 219 219 220 220 220 220 219 218 218 218 218 218 218 218 218 218 217 216 216 217 217 217 217 218 217 216 216 216 216 216 215 215 215 214 214 214 213 213 212 211 211 211 211 212 212 213 213 214 213 212 211 210 210 211 210 210 209 209 208 208 208 207 207 207 206 206 206 205 205 205
2239 205 205 205 205 206 207 207 206 206 206 205 205 204 205 205 205 205 205 205 205 205 205 205 205 205 205 204 203 202 201 201 201 201 200 200 201 201 202 202 202 202 201 201 201 201 200 200 200 199 198 198 198 199 199 199 200 200 201 201 201 201 201 199 198 198 198 198 199 199 199
$$ packed form
2290D51kjkkjjjjjkjjjjjkkjj%kjjjkjkjk%jk%jjkkjkj%%jjjjj%jj%kjkjjj%kjjjjkjj%j%
2283C74jjj%jjj%j%jjjjjjjj%jjj%j%J%jJ%J%JJ%Jjjkjkkkklkljjjjjkj%j%%j%%jjkjjj%%
2276C22%jjj%j%jjj%jjj%j%j%j%%kj%%j%jj%j%%j%%jj%%j%jjj%jj%jj%jj%j%j%%%jj%j%%%
2268B84jj%%%%jjj%%%%%jjjjjJ%j%jj%%j%jj%J%jJ%j%%j%j%j%jj%j%%%%%j%jj%%jjjjJj%%
2261B56%JJ%j%j%Jj%jj%j%jj%%k%j%jj%J%%%j%%%j%J%%Jj%%jj%jj%%%%%%%jjjk%%%j%%%jj
2254B34%%%%J%%Jjkj%%%%%j%J%%j%%jJ%%%%%jkj%%%%%j%j%%%%%jJ%%Jjj%j%j%j%%%j%j%%%
2247B19%J%%%jj%%%%%%%%jj%J%%%Jjj%%%%j%%j%%j%jj%%%J%J%Jjjjj%Jj%j%j%%j%%j%%j%%
2239B05%%%JJ%j%%j%jJ%%%%%%%%%%%%jjjj%%%j%J%J%%%j%%%j%%jj%%J%%J%J%%%%kj%%%J%%
$$ plain form
2232 199 198 197 197 198 198 198 199 198 197 196 196 196 195 195 195 195 196 197 198 199 198 198 198 198 199 199 199 199 200 199 198 197 197 196 195 194 193 192 191 190 190 190 189 190 189 189 190 189 189 189 189 189 189 188 187 187 186 185 186 187 187 188 189 188 188 188 188 189 189
2225 189 188 188 189 189 190 190 191 192 192 192 192 193 195 195 196 196 195 193 193 193 193 193 194 194 193 193 193 193 193 194 195 195 195 195 195 195 195 195 196 198 198 199 199 200 201 200 200 200 199 199 199 200 200 201 201 202 201 201 202 203 203 204 204 205 206 207 208 209 210
2217 210 210 210 210 211 212 214 215 216 218 220 221 222 224 225 227 229 231 234 237 240 243 247 251 255 259 265 271 278 285 293 302 313 325 337 352 369 388 412 439 472 512 560 619 691 783 900 1048 1234 1459
2212 1459 1721 2008 2298 2564 2769 2883 2895 2813 2654 2439 2190 1930 1675 1438 1226 1045 894 772 675 599 537 488 449 417 390 367
2209 367 346 329 315 303 293 283 275 268 261 255 250 245 241 237 232 229 227 224 221 218 216 214 212 211 210 208 206 204 202 200 199 198 197 197 196 195 195 194 192 191 190 190 189 189 188 187 187 187 187 187 187 187 187 186 185 184 183 182 182 181 181 181 181
2203 181 181 181 181 180 180 180 180 179 179 178 178 177 177 177 177 176 176 176 176 176 176 176 176 176 176 175 175 175 175 174 175 176 176 176 176 176 176 177 177 178 179 179 178 178 179 179 178 178 177 177 177 178 179 179 179 179 178 178 177 178 178 177 177 176 175 175 175 175 175
2195 175 174 174 173 171 170 170 170 170 169 169 168 168 167 166 166 165 165 166 166 166 166 167 167 167 167 168 168 168 168 168 168 168 169 169 169 168 169 169 169 168 167 166 166 166 166 166 165 165 165 164 164 165 165 167 168 168 169 169 168 168 168 168 167 167 167 166 165 166 166
2188 166 166 167 167 167 166 166 165 166 167 167 166 166 165 164 164 164 163 163 163 163 163 163 162 162 162 162 163 163 163 163 164 164 165 165 165 164 164 164 164 164 164 163 163 163 164 164 165 164 164 164 164 165 164 164 164 164 164 163 163 162 161 162 162 161 161 161 161 162 161
$$ packed form
2232A99jj%J%%Jjjj%%j%%%JJJJj%%%J%%%Jjjj%jjjjjjj%%jJj%Jj%%%%%jj%jjJJ%JJj%%%J%
2225A89j%J%J%JJ%%%JK%J%jk%%%%J%j%%%%JJ%%%%%%%JK%J%JJj%%j%%J%J%Jj%JJ%J%JJJJJJ
2217B10%%%JJKJJKKJJKJKKKLLLLMMMMOOPPQRJ1J2J2J5J7J9K4K7L3M0M8N9P2R2J17J48J86K25
2212A459K62K87K90K66K05J14J2q2j59k15k49k60k55k37k12j81j51j22r7p6o2m9l9l2k7k3
2209C67k1j7j4j2j0j0qpponnmmnlklllkkkjjkkkkkjjj%jj%jkjj%j%jj%%%%%%%jjjjj%j%%%
2203A81%%%j%%%j%j%j%%%j%%%%%%%%%j%%%jJJ%%%%%J%JJ%j%J%j%j%%JJ%%%j%jJ%j%jj%%%%
2195A75j%jkj%%%j%j%jj%j%J%%%J%%%J%%%%%%J%%jJ%%jjj%%%%j%%j%J%KJ%J%j%%%j%%jjJ%
2188A66%J%%j%jJJ%j%jj%%j%%%%%j%%%J%%%J%J%%j%%%%%j%%J%Jj%%%Jj%%%%j%jjJ%j%%%Jj
$$ plain form
2181 161 161 161 161 161 162 163 164 164 163 163 162 162 162 162 161 161 161 161 161 161 161 160 160 159 159 159 159 159 159 159 160 161 161 161 161 161 161 160 160 160 160 160 161 161 161 162 161 161 162 162 162 161 160 160 160 160 160 160 160 160 160 160 161 161 161 161 161 160 159
2173 159 159 159 159 159 159 159 159 159 159 159 159 160 160 160 160 159 159 159 159 160 160 160 159 159 157 157 157 157 157 157 157 156 156 157 157 158 159 159 159 159 159 159 158 158 157 156 157 158 159 159 160 160 159 158 158 157 156 157 158 158 158 158 158 157 157 157 157 157 157
2166 157 157 157 156 156 155 154 155 155 154 154 154 155 155 156 156 157 157 157 157 156 156 156 156 156 155 155 154 154 154 154 154 154 154 154 154 154 154 154 154 154 154 153 153 153 153 153 153 154 154 155 156 156 157 157 156 155 156 155 154 155 155 155 155 155 154 154 154 155 156
2159 156 157 157 157 156 155 155 155 155 155 155 154 154 153 154 154 154 153 152 152 152 152 152 153 154 155 155 154 154 153 153 154 154 153 153 152 153 153 154 154 153 153 153 152 152 152 152 152 152 152 152 153 153 153 153 153 153 152 153 153 153 154 154 154 154 153 152 151 151 150
2151 150 151 151 152 152 152 153 153 153 152 151 151 151 151 151 151 152 153 153 153 153 153 152 152 152 153 152 152 152 152 152 152 153 154 154 153 153 153 154 154 154 155 154 153 152 151 151 151 153 153 152 152 153 154 154 154 154 153 153 153 153 153 153 152 151 151 151 152 151 151
2144 151 152 152 152 152 152 151 151 151 150 150 150 150 151 151 150 150 151 152 152 153 154 154 155 155 156 156 157 157 158 160 163 164 165 165 165 165 165 163 162 161 159 157 157 156 155 154 154 153 153 152 152 151 151 151 153 153 153 153 152 152 151 150 149 148 148 148 148 148 148
2137 148 148 148 148 149 149 149 149 148 148 149 150 149 149 148 148 148 148 148 149 150 150 149 149 149 149 149 150 150 149 149 148 147 147 147 147 147 148 148 149 149 148 148 146 145 145 145 146 146 146 146 146 147 148 149 148 148 147 146 146 146 146 146 147 148 148 148 147 146 146
2130 146 146 146 147 147 147 146 146 146 147 147 147 147 147 147 147 147 146 146 146 146 145 146 147 147 147 147 147 147 147 148 148 148 147 147 147 147 147 147 147 146 146 147 148 148 148 148 147 147 146 146 145 145 146 147 147 146 146 146 146 145 145 145 145 145 146 146 146 146 146
$$ packed form
2181A61%%%%JJJ%j%j%%%j%%%%%%j%j%%%%%%JJ%%%%%j%%%%J%%Jj%J%%jj%%%%%%%%%J%%%%jj
2173A59%%%%%%%%%%%J%%%j%%%J%%j%k%%%%%%j%J%JJ%%%%%j%jjJJJ%J%jj%jjJJ%%%%j%%%%%
2166A57%%j%jjJ%j%%J%J%J%%%j%%%%j%j%%%%%%%%%%%%%%j%%%%%J%JJ%J%jjJjjJ%%%%j%%JJ
2159A56J%%jj%%%%%j%jJ%%jj%%%%JJJ%j%j%J%j%jJ%J%j%%j%%%%%%%J%%%%%jJ%%J%%%jjj%j
2151A50J%J%%J%%jj%%%%%JJ%%%%j%%Jj%%%%%JJ%j%%J%%Jjjjj%%K%j%JJ%%%j%%%%%jj%%Jj%
2144A51J%%%%j%%j%%%J%j%JJ%JJ%J%J%J%JKLJJ%%%%kjjkk%jjj%j%j%j%%K%%%j%jjjj%%%%%
2137A48%%%J%%%j%JJj%j%%%%JJ%j%%%%J%j%jj%%%%J%J%j%kj%%J%%%%JJJj%jj%%%%JJ%%jj%
2130A46%%J%%j%%J%%%%%%%j%%%jJJ%%%%%%J%%j%%%%%%j%JJ%%%j%j%j%JJ%j%%%j%%%%J%%%%
$$ plain form
2122 146 146 146 146 146 146 146 147 147 147 147 146 145 146 146 146 147 147 147 147 147 147 146 146 147 147 147 148 148 148 148 148 147 147 147 147 147 147 148 148 148 147 146 146 146 146 146 146 147 147 147 147 147 147 147 146 146 145 145 145 145 146 146 145 145 146 147 146 146 146
2115 146 146 146 145 145 145 145 146 146 146 147 147 147 147 147 146 146 146 145 146 146 145 145 144 144 144 144 144 143 143 143 144 145 145 145 145 145 146 146 145 145 145 145 145 145 145 145 145 145 145 145 145 145 145 145 145 145 145 144 145 145 145 145 145 146 146 146 146 146 146
2108 146 146 146 146 146 146 146 146 146 146 145 143 143 143 142 141 142 142 142 143 143 144 144 144 144 144 143 143 143 144 144 144 143 143 143 143 143 143 144 144 144 143 143 142 141 142 142 142 142 142 142 142 143 142 142 142 142 143 143 143 144 143 143 142 142 142 142 142 143 143
2100 143 143 143 143 144 144 144 144 144 143 144 145 144 144 143 143 143 142 142 142 142 142 143 142 142 142 142 142 142 142 142 142 142 143 143 144 144 144 144 144 143 142 142 143 144 143 143 143 143 144 144 144 144 144 144 143 143 144 144 144 143 142 143 143 143 144 143 143 143 142
2093 142 142 142 142 142 143 143 143 143 144 144 143 142 141 141 141 141 141 141 141 141 141 141 142 142 142 142 142 143 142 141 142 142 143 144 144 143 143 143 143 143 144 143 143 142 142 142 143 143 143 144 144 144 143 142 142 143 144 144 144 143 142 142 141 141 142 142 143 143 143
2086 143 143 143 143 143 143 142 142 142 142 143 143 143 143 143 143 142 142 142 141 141 141 140 140 140 140 140 140 141 142 142 142 142 142 142 142 142 142 141 141 141 141 141 141 141 141 142 142 143 143 142 142 142 141 141 142 142 142 142 142 141 141 141 142 142 143 143 143 143 144
2078 144 144 144 143 144 143 142 141 141 141 142 142 142 143 143 143 143 143 142 141 142 143 143 142 142 142 142 141 141 142 141 141 141 141 141 141 141 141 141 141 143 144 143 142 142 141 141 141 141 141 141 140 140 141 142 142 142 142 141 141 142 141 140 140 140 139 139 140 140 141
2071 141 141 141 141 141 141 141 141 141 141 141 141 141 141 141 141 141 141 141 141 140 140 140 141 141 141 141 141 141 141 141 141 141 142 143 143 143 143 143 142 142 141 140 140 140 140 140 139 140 140 141 141 142 143 144 143 142 141 141 141 141 141 140 140 141 140 140 139 140 140
$$ packed form
2122A46%%%%%%J%%%jjJ%%J%%%%%j%J%%J%%%%j%%%%%J%%jj%%%%%J%%%%%%j%j%%%J%j%JJj%%
2115A46%%j%%%J%%J%%%%j%%jJ%j%j%%%%j%%JJ%%%%J%j%%%%%%%%%%%%%%%%%%jJ%%%%J%%%%%
2108A46%%%%%%%%%jk%%jjJ%%J%J%%%%j%%J%%j%%%%%J%%j%jjJ%%%%%%Jj%%%J%%Jj%j%%%%J%
2100A43%%%J%%%%jJJj%j%%j%%%%Jj%%%%%%%%%J%J%%%%jj%JJj%%%J%%%%%j%J%%jjJ%%Jj%%j
2093A42%%%%J%%%J%jjj%%%%%%%%%J%%%%JjjJ%JJ%j%%%%Jj%j%%J%%J%%jj%JJ%%jj%j%J%J%%
2086A43%%%%%j%%%J%%%%%j%%j%%j%%%%%JJ%%%%%%%%j%%%%%%%J%J%j%%j%J%%%%j%%J%J%%%J
2078A44%%jJjjj%%J%%J%%%%jjJJ%j%%%j%Jj%%%%%%%%%KJjj%j%%%%%j%JJ%%%j%Jjj%%j%J%J
2071A41%%%%%%%%%%%%%%%%%%%j%%J%%%%%%%%%JJ%%%%j%jj%%%%jJ%J%JJJjjj%%%%j%Jj%jJ%
$$ plain form
2064 140 141 141 140 140 140 140 140 141 141 140 141 141 141 141 141 142 142 142 141 141 141 141 141 142 141 141 140 138 138 139 139 140 140 140 140 141 141 141 141 141 141 141 141 142 143 143 142 141 140 140 140 139 139 140 140 141 142 143 142 141 140 140 140 140 140 140 140 140 141
2056 141 141 140 140 140 140 140 140 141 141 141 140 140 140 140 140 140 139 138 139 139 138 138 138 138 139 139 139 139 138 138 139 139 139 138 139 139 139 139 139 140 140 140 139 138 138 138 138 138 138 139 140 139 139 140 140 140 141 141 141 141 141 140 140 141 142 142 143 142 142
2049 142 142 142 141 140 140 140 140 140 140 139 139 138 138 138 138 139 139 139 139 140 139 139 140 140 140 139 139 140 140 141 142 142 141 140 140 140 140 138 137 137 137 138 138 138 139 139 139 137 137 138 138 138 138 138 138 138 138 138 137 137 137 137 137 138 138 139 138 138 138
2042 138 139 139 139 139 140 140 140 140 139 138 138 138 139 139 139 138 138 138 139 139 140 139 139 139 139 139 138 138 138 138 138 138 137 137 137 136 136 137 138 139 139 139 138 138 137 137 137 138 138 137 137 136 136 137 137 138 139 139 139 139 140 139 139 138 138 138 139 139 139
2034 139 139 138 138 138 137 137 137 137 137 137 138 138 138 138 138 138 138 137 138 138 138 137 138 138 138 137 137 138 138 137 137 136 136 138 138 138 138 138 138 138 138 138 137 137 137 137 137 138 139 139 139 137 137 136 136 136 136 136 136 137 137 137 137 136 136 137 136 135 135
2027 135 135 135 136 136 137 137 138 138 138 138 138 138 138 138 137 137 136 136 136 136 136 136 136 137 137 137 137 138 138 138 138 137 137 137 137 137 136 136 135 135 136 137 137 137 137 136 136 137 137 137 137 137 137 137 136 136 136 137 137 137 137 137 137 138 137 138 138 138 138
2020 138 139 139 138 138 137 138 137 137 137 136 137 138 138 139 138 136 136 135 136 137 137 137 137 136 136 137 137 138 138 138 137 137 138 138 137 137 137 137 137 137 137 137 138 138 138 137 137 137 137 137 137 137 137 137 137 138 137 137 137 137 137 136 136 136 136 137 137 137 138
2013 138 138 139 139 138 137 137 136 136 136 136 136 136 136 137 137 138 138 138 139 138 138 138 138 138 138 137 137 136 136 136 136 136 137 137 136 136 136 136 137 136 137 137 137 136 136 136 137 137 137 137 137 138 137 136 136 135 135 135 135 136 136 137 138 138 138 136 136 136 137
$$ packed form
2064A40J%j%%%%J%jJ%%%%J%%j%%%%Jj%jk%J%J%%%J%%%%%%%JJ%jjj%%j%J%JJJjjj%%%%%%%J
2056A41%j%%%%%J%%j%%%%%jjJ%j%%%J%%%j%J%%jJ%%%%J%%jj%%%%%JJj%J%%J%%%%j%JJ%Jj%
2049A42%%jj%%%%%j%j%%%J%%%Jj%J%%j%J%JJ%jj%%%kj%%J%%J%%k%J%%%%%%%%j%%%%J%Jj%%
2042A38J%%%J%%%jj%%J%%j%%J%Jj%%%%j%%%%%j%%j%JJJ%%j%j%%J%j%j%J%JJ%%%Jj%j%%J%%
2034A39%j%%j%%%%%J%%%%%%jJ%%jJ%%j%J%j%j%K%%%%%%%%j%%%%JJ%%k%j%%%%%J%%%j%Jjj%
2027A35%%J%J%J%%%%%%%j%j%%%%%%J%%%J%%%j%%%%j%j%JJ%%%j%J%%%%%%j%%J%%%%%JjJ%%%
2020A38J%j%jJj%%jJJ%Jjk%jJJ%%%j%J%J%%j%J%j%%%%%%%J%%j%%%%%%%%%Jj%%%%j%%%J%%J
2013A38%J%jj%j%%%%%%J%J%%Jj%%%%%j%j%%%%J%j%%%JjJ%%j%%J%%%%Jjj%j%%%J%JJ%%k%%J
$$ plain form
2005 137 137 138 138 137 137 137 138 138 138 138 137 136 137 137 137 137 137 137 137 137 137 137 138 138 137 137 136 135 135 134 135 135 135 135 135 135 135 135 136 136 136 135 135 136 136 136 136 136 136 135 135 135 135 136 135 136 137 137 135 134 135 135 135 135 136 136 136 137 137
1998 137 136 136 136 136 136 136 136 136 136 135 135 135 136 137 136 136 136 137 137 136 136 135 135 135 135 135 135 135 135 134 134 135 135 135 135 135 135 135 135 135 135 136 136 136 135 135 134 134 134 134 134 134 135 136 136 135 135 135 135 135 134 134 134 134 135 135 135 134 134
1991 134 135 135 135 135 135 136 135 135 135 135 136 135 135 135 136 136 137 138 138 137 137 137 136 135 136 136 137 138 137 137 137 136 136 136 135 134 134 133 134 134 135 135 134 134 133 134 135 136 135 136 136 136 136 136 137 137 137 137 136 136 136 135 135 135 136 136 136 135 134
1983 134 134 134 135 135 135 135 135 134 134 134 133 133 134 135 136 137 136 135 135 136 136 137 137 136 136 136 136 136 137 138 138 137 137 137 138 137 137 137 137 136 136 136 136 135 135 135 134 133 134 135 135 136 137 136 135 135 134 135 135 136 137 137 137 137 136 136 136 136 137
1976 137 136 136 135 135 134 133 134 135 136 137 136 135 135 135 135 135 135 135 135 136 136 136 137 136 136 136 137 138 138 137 137 137 136 136 136 136 135 135 135 135 135 135 135 135 135 136 135 135 135 135 136 136 136 137 137 137 136 136 136 135 135 135 135 135 135 136 136 135 134
1969 134 134 133 133 134 135 135 134 134 134 133 133 133 133 134 135 135 134 134 135 135 135 135 136 136 136 137 137 136 136 135 135 135 135 135 134 133 133 133 133 133 133 133 134 133 133 133 133 133 133 134 135 135 135 136 136 136 135 135 135 135 134 135 135 135 135 136 135 135 135
1961 135 134 134 134 133 134 134 134 134 134 134 134 134 133 133 132 132 131 131 131 132 133 132 132 132 132 132 132 133 134 134 134 134 134 134 135 135 134 134 134 133 134 134 134 134 134 133 134 135 135 136 135 134 134 134 134 134 134 134 134 134 135 135 134 134 133 133 133 133 133
1954 133 133 133 132 132 132 132 132 133 133 134 134 134 134 135 135 135 135 135 135 135 135 135 134 134 135 135 135 136 136 136 135 134 134 134 134 135 135 135 135 134 134 135 135 135 134 134 134 133 132 132 133 135 136 135 134 134 134 133 133 133 133 133 133 133 132 133 133 133 133
$$ packed form
2005A37%J%j%%J%%%jjJ%%%%%%%%%J%j%jj%jJ%%%%%%%J%%j%J%%%%%j%%%JjJJ%kjJ%%%J%%J%
1998A37j%%%%%%%%j%%JJj%%J%j%j%%%%%%%j%J%%%%%%%%%J%%j%j%%%%%JJ%j%%%%j%%%J%%j%
1991A34J%%%%Jj%%%Jj%%J%JJ%j%%jjJ%JJj%%j%%jj%jJ%J%j%jJJJjJ%%%%J%%%j%%j%%J%%jj
1983A34%%J%%%%j%%j%JJJJjj%J%J%j%%%%JJ%j%%Jj%%%j%%%j%%jjJJ%JJjj%jJ%JJ%%%j%%%J
1976A37j%j%jjJJJJjj%%%%%%%J%%Jj%%JJ%j%%j%%%j%%%%%%%%Jj%%%J%%J%%j%%j%%%%%J%jj
1969A34%j%JJ%j%%j%%%JJ%j%J%%%J%%J%j%j%%%%jj%%%%%%Jj%%%%%JJ%%J%%j%%%jJ%%%Jj%%
1961A35j%%jJ%%%%%%%j%j%j%%JJj%%%%%JJ%%%%%J%j%%jJ%%%%jJJ%Jjj%%%%%%%%J%j%j%%%%
1954A33%%j%%%%J%J%%%J%%%%%%%%j%J%%J%%jj%%%J%%%j%J%%j%%jj%JKJjj%%j%%%%%%jJ%%%
$$ plain form
1947 133 134 135 135 135 134 134 134 134 134 134 134 135 134 134 135 135 137 137 136 136 135 135 135 135 134 134 134 135 134 134 134 134 134 134 134 134 134 134 135 135 136 136 136 136 136 135 135 136 136 136 135 135 135 134 134 134 134 134 135 135 135 136 136 135 135 135 135 135 134
1939 134 134 134 134 134 134 134 135 135 135 135 135 136 136 135 135 135 134 134 134 133 133 133 133 133 133 132 132 133 134 133 133 134 134 134 134 134 134 133 133 133 133 133 133 134 135 134 134 134 135 135 134 134 134 134 134 134 133 133 133 134 134 134 134 134 134 135 136 135 135
1932 135 135 134 134 133 133 133 134 134 134 133 133 133 133 133 133 134 134 134 134 133 134 134 134 134 135 135 135 135 135 135 135 135 134 134 134 134 134 133 133 133 133 132 132 132 133 134 135 135 135 135 135 134 134 134 136 136 136 136 136 135 135 135 135 135 135 134 134 134 132
1925 132 132 133 133 132 132 132 133 134 134 134 135 135 135 135 133 133 133 133 133 133 134 134 135 135 134 134 133 133 133 134 134 134 133 133 134 134 134 133 134 134 134 134 134 135 135 135 136 135 134 134 133 133 133 132 133 134 135 135 135 135 135 135 135 134 134 134 134 134 134
1917 134 134 134 134 133 132 132 132 133 134 134 134 135 135 135 135 134 135 136 136 136 135 135 135 135 134 134 134 134 134 134 134 134 134 134 134 135 135 135 135 135 134 133 133 133 134 134 134 134 134 134 134 133 134 134 134 133 133 133 134 134 133 133 133 133 133 134 133 133 133
1910 133 133 133 133 134 135 135 135 134 134 134 133 133 134 134 135 134 134 133 133 133 133 134 135 134 135 135 135 135 134 133 134 133 133 134 134 133 134 134 133 134 134 134 134 135 135 134 134 133 133 133 134 134 134 133 132 132 132 133 134 134 134 134 134 133 133 133 134 133 132
1903 132 132 132 132 133 133 133 133 134 133 133 132 132 132 132 132 132 132 132 132 132 133 133 133 132 133 133 133 133 132 132 132 132 133 133 132 132 132 132 132 133 132 131 131 131 132 132 132 132 133 133 133 133 133 134 133 132 131 131 131 130 131 131 132 132 133 132 132 132 132
1896 132 131 131 131 131 131 131 132 132 132 132 132 132 133 132 132 131 131 131 131 132 133 132 132 132 132 132 132 132 132 132 131 130 130 130 130 131 132 132 132 132 132 131 131 131 131 131 131 131 132 132 132 131 130 130 131 131 132 133 133 133 132 132 132 132 131 132 133 133 133
$$ packed form
1947A33JJ%%j%%%%%%Jj%J%K%j%j%%%j%%Jj%%%%%%%%%J%J%%%%j%J%%j%%j%%%%J%%J%j%%%%j
1939A34%%%%%%J%%%%J%j%%j%%j%%%%%j%JJj%J%%%%%j%%%%%JJj%%J%j%%%%%j%%J%%%%%JJj%
1932A35%j%j%%J%%j%%%%%J%%%jJ%%%J%%%%%%%j%%%%j%%%j%%JJJ%%%%j%%K%%%%j%%%%%j%%k
1925A32%J%j%%JJ%%J%%%k%%%%%J%J%j%j%%J%%j%J%%jJ%%%%J%%Jjj%j%%jJJJ%%%%%%j%%%%%
1917A34%%%jj%%JJ%%J%%%jJJ%%j%%%j%%%%%%%%%%J%%%%jj%%J%%%%%%jJ%%j%%J%j%%%%Jj%%
1910A33%%%JJ%%j%%j%J%Jj%j%%%JJjJ%%%jjJj%J%jJ%jJ%%%J%j%j%%J%%jj%%JJ%%%%j%%Jjj
1903A32%%%J%%%Jj%j%%%%%%%%%J%%jJ%%%j%%%J%j%%%%Jjj%%J%%%J%%%%Jjjj%%jJ%J%Jj%%%
1896A32j%%%%%J%%%%%Jj%j%%%JJj%%%%%%%%jj%%%JJ%%%%j%%%%%%J%%jj%J%JJ%%j%%%jJJ%%
$$ plain form
1888 133 132 132 131 131 131 132 131 131 132 132 132 132 132 133 133 133 133 133 134 134 133 132 131 131 132 131 132 132 132 133 133 133 132 132 132 131 132 132 131 131 131 131 131 132 133 134 133 133 132 132 133 133 133 132 133 132 132 132 132 133 132 131 132 132 132 133 133 133 133
1881 133 133 133 133 133 134 134 135 135 135 135 134 134 133 133 133 133 134 134 134 133 133 132 132 132 132 132 133 133 134 134 134 133 132 132 132 133 133 132 132 132 132 132 132 132 133 133 133 133 134 133 132 131 131 132 132 131 131 131 132 132 132 133 132 132 132 132 132 132 133
1874 133 133 133 134 133 132 132 133 133 133 133 133 133 134 134 133 133 133 133 133 133 132 132 131 130 131 131 132 132 133 133 132 131 131 131 131 131 131 130 131 131 131 131 132 133 133 133 134 134 134 134 134 134 133 133 133 133 132 132 132 132 132 132 132 132 133 132 131 131 131
1866 131 131 131 132 132 132 132 131 132 133 133 134 133 133 133 132 131 131 130 130 131 131 132 132 132 132 132 132 132 132 132 132 132 131 131 131 131 131 131 129 129 130 129 130 131 132 132 132 132 132 131 131 131 130 130 129 130 130 131 131 131 130 130 130 131 131 130 130 130 131
1859 131 131 130 129 129 129 129 130 131 131 131 130 130 130 130 130 130 129 129 129 130 130 130 130 130 130 131 130 130 130 130 130 131 131 131 131 131 131 131 131 131 131 131 129 128 129 130 130 130 130 130 130 130 130 130 130 130 130 130 130 130 131 131 131 131 130 129 128 129 130
1852 130 130 130 129 129 129 129 129 129 130 130 131 131 131 131 131 131 131 131 129 129 129 130 131 131 130 129 130 130 131 131 131 131 131 131 131 131 131 131 130 130 131 132 132 132 132 132 133 133 133 133 133 133 133 133 134 133 133 133 132 131 131 131 131 130 131 132 132 133 133
1844 133 132 132 132 132 132 132 131 131 131 131 131 131 131 131 131 132 132 133 133 132 132 131 131 132 132 132 132 132 132 132 132 133 132 132 131 131 131 131 131 130 130 130 130 130 130 131 130 130 131 131 132 133 133 133 132 132 132 131 131 131 131 131 131 131 132 132 132 132 132
1837 132 131 131 131 130 129 130 131 131 131 131 132 131 131 132 133 133 134 134 134 133 132 131 131 131 131 131 130 132 133 133 134 133 133 133 133 132 132 132 132 132 132 133 133 132 132 131 131 131 130 131 131 132 133 133 133 132 132 132 131 130 131 131 131 132 132 132 132 132 132
$$ packed form
1888A33j%j%%Jj%J%%%%J%%%%J%jjj%JjJ%%J%%j%%jJ%j%%%%JJJj%j%J%%jJj%%%JjjJ%%J%%%
1881A33%%%%J%J%%%j%j%%%J%%j%j%%%%J%J%%jj%%J%j%%%%%%J%%%Jjjj%J%j%%J%%Jj%%%%%J
1874A33%%Jjj%J%%%%%J%j%%%%%j%jjJ%J%J%jj%%%%%jJ%%%JJ%%J%%%%%j%%%j%%%%%%%Jjj%%
1866A31%%J%%%jJJ%Jj%%jj%j%J%J%%%%%%%%%%j%%%%%k%JjJJJ%%%%j%%j%jJ%J%%j%%J%j%%J
1859A31%jj%%%JJ%%j%%%%%j%%J%%%%%Jj%%%%J%%%%%%%%%%kjJJ%%%%%%%%%%%%%%J%%%jjjJJ
1852A30%%j%%%%%J%J%%%%%%%k%%JJ%jjJ%J%%%%%%%%%j%JJ%%%%J%%%%%%%Jj%%jj%%%jJJ%J%
1844A33j%%%%%j%%%%%%%%J%J%j%j%J%%%%%%%Jj%j%%%%j%%%%%Jj%J%JJ%%j%%j%%%%%%J%%%%
1837A32j%%jjJJ%%%Jj%JJ%J%%jjj%%%%jKJ%Jj%%%j%%%%%J%j%j%%jJ%JJ%%j%%jjJ%%J%%%%%
$$ plain form
1830 132 133 134 134 134 134 134 134 134 133 133 134 134 134 133 133 133 132 132 132 133 133 133 134 134 133 132 132 132 132 132 132 132 132 132 132 132 133 133 133 133 133 133 133 133 133 133 134 134 134 133 133 134 134 133 133 133 132 132 133 133 133 133 133 132 132 132 132 133 133
1822 133 132 131 131 132 133 133 133 134 134 134 134 134 134 134 134 134 133 133 132 132 132 132 132 133 134 134 134 135 135 135 135 135 135 135 135 135 135 135 134 134 133 134 134 134 134 135 136 136 137 137 137 136 137 137 138 139 140 141 142 143 144 146 148 151 154 157 161 164 168
1815 168 173 179 184 188 191 193 195 196 197 197 197 198 198 201 206 213 220 229 238 247 256 262 267 268 266 263 260 257 253 251 251 252 254 260 269 281 292 302 311 316 316 314 308 300 291 282 272 264 258 254 252 253 255 258 263 266 268 268 266 261 254 247 240 231 221
1808 221 213 207 202 199 197 197 197 197 197 196 195 192 188 185 181 177 172 167 162 158 154 152 150 148 146 145 144 143 142 141 140 140 140 140 139 139 138 138 137 137 136 137 137 138 138 138 137 137 137 137 136 137 137 137 137 136 136 135 135 136 136 136 136 136 136 136 136 136 135
1801 135 134 134 135 136 136 136 136 136 136 135 135 134 134 133 134 135 135 134 135 135 135 135 134 134 133 134 134 135 136 136 136 135 135 135 134 134 134 135 135 135 136 136 135 135 135 135 134 134 134 135 136 136 137 138 139 138 137 136 135 136 136 136 135 135 135 136 137 138 139
1794 139 140 140 139 139 139 139 139 140 139 138 138 138 139 138 138 138 138 139 140 140 140 140 140 139 139 140 140 140 139 140 141 141 140 140 140 140 140 140 140 141 141 140 140 139 139 139 139 139 138 138 138 138 137 138 140 141 140 140 139 139 138 139 139 139 139 140 140 140 139
1786 139 139 139 139 138 138 137 137 137 137 138 138 137 137 137 138 139 138 138 137 137 138 138 138 138 137 136 136 136 136 137 138 139 139 140 140 141 141 141 140 139 138 137 137 137 137 137 137 138 139 141 143 144 145 145 146 146 146 146 146 146 146 146 146 146 146 146 148 149 151
1779 151 152 153 154 154 155 155 156 156 157 157 156 157 159 160 161 161 161 162 163 163 163 162 162 163 163 163 164 164 165 165 164 164 164 164 163 162 160 159 158 158 158 158 158 159 159 159 159 158 158 158 158 157 156 155 154 152 151 150 150 149 150 150 151 152 152 152 152 151 150
$$ packed form
1830A32JJ%%%%%%j%J%%j%%j%%J%%J%jj%%%%%%%%%%J%%%%%%%%%J%%j%J%j%%j%J%%%%j%%%J%
1822A33jj%JJ%%J%%%%%%%%j%j%%%%JJ%%J%%%%%%%%%%j%jJ%%%JJ%J%%jJ%JJJJJJJKKLLLMLM
1815A68NONMLKKJJ%%J%LNPPRRRRONJklllmk%JKORJ2J1J0RN%koqrrj0qomkJKLNLK%knppprj0
1808B21qonlk%%%%jjlmlmmnnnmmkkkkjjjjjj%%%j%j%j%jJ%J%%j%%%jJ%%%j%j%J%%%%%%%%j
1801A35j%JJ%%%%%j%j%jJJ%jJ%%%j%jJ%JJ%%j%%j%%J%%J%j%%%j%%JJ%JJJjjjjJ%%j%%JJJJ
1794A39J%j%%%%Jjj%%Jj%%%JJ%%%%j%J%%jJJ%j%%%%%%J%j%j%%%%j%%%jJKJj%j%jJ%%%J%%j
1786A39%%%j%j%%%J%j%%JJj%j%J%%%jj%%%JJJ%J%J%%jjjj%%%%%JJKKJJ%J%%%%%%%%%%%KJK
1779A51JJJ%J%J%J%jJKJJ%%JJ%%j%J%%J%J%j%%%jjkjj%%%%J%%%j%%%jjjjkjj%jJ%JJ%%%jj
$$ plain form
1772 150 149 149 149 149 149 149 150 150 151 152 151 151 151 151 150 149 150 150 151 152 153 155 156 158 160 161 160 158 156 154 153 152 151 152 153 154 156 159 162 165 168 169 170 170 170 168 166 164 163 162 161 162 165 169 173 177 181 185 187 189 190 190 189 188 186 184 182 181 182
1764 182 183 184 187 189 191 194 196 198 199 199 197 195 193 190 188 186 184 183 183 183 184 185 186 186 185 184 183 181 179 176 173 168 164 160 156 153 152 152 153 154 155 156 157 159 160 161 162 164 167 172 180 190 202 218 233 247 259 267 271 272 270 266 260
1758 260 254 249 245 244 245 250 260 275 293 311 329 342 350 354 355 353 349 344 340 337 336 336 340 350 362 376 393 411 426 437 445 449 450 448 446 441 436 431 428 426 427 430 435 442 451 461 473 485 498 512 527
1752 527 541 556 570 585 600 615 632 649 668 689 712 739 767 798 832 870 911 956 1004 1057 1116 1180 1252 1331 1421 1522 1637 1769 1923 2102 2313 2565
1749 2565 2868 3235 3680 4218 4861 5614 6471 7407 8381 9336 10205 10929 11469 11820 12004 12063 12050 12027 12059 12216 12559 13147 14019 15187
1746 15187 16620 18247 19949 21562 22912 23860 24349 24400 24091 23528 22833 22135 21556 21218 21222 21646 22525 23844 25525 27421 29329
1744 29329 31003 32203 32767 32655 31932 30721 29171 27442 25692 24068 22695 21674 21070 20903 21140 21695 22439 23200 23792 24050
1742 24050 23876 23263 22271 20992 19534 18007 16512 15137 13952 13005 12315 11878 11660 11603 11633 11666 11621 11433 11070 10532 9846 9049
$$ packed form
1772A50j%%%%%J%JJj%%%jjJ%JJJKJKKJjkkkjjjJJJKLLLLJJ%%kkkjjjJLMMMMMKKJ%jjkkkjJ
1764A82JJLKKLKKJ%kkklkkkj%%JJJ%jjjkkllnmmmlj%JJJJJKJJJKLNQJ0J2J6J5J4J2QMJkmo
1758B60onmjJNJ0J5J8J8J8J3QMJkmnmlj%MJ0J2J4J7J8J5J1QMJkknnnlkJLNPRJ0J2J2J3J4J5
1752E27J4J5J4J5J5J5J7J7J9K1K3K7K8L1L4L8M1M5M8N3N9O4P2P9R0J01J15J32J54J79K11K52
1749B565L03L67M45N38O43P53Q57R36R74R55Q69P24N40L51J84N9j3k3L2J57L43N88Q72J168
1746A5187J433J627J702J613J350R48M89N1l09n63o95o98n79l38MM24Q79J319J681J896J908
1744B9329J674J200N64j12p23j211j550j729j750j624j373j021o04j67K37N55P44P61N92K58
1742B4050j74o13r92j279j458j527j495j375j185r47o90m37k18n7L0L3m5j88l63n38o86p97
$$ plain form
1740 9049 8188 7303 6435 5616 4868 4204 3631 3145 2741 2405 2128 1899 1709 1550 1416 1302 1203 1117 1041 974 913 858 810 766 726 689
1737 689 655 624 595 569 546 526 506 489 473 457 443 430 418 408 399 391 383 377 372 366 361 355 350 344 339 333 329 325 322 320 318 316 315 313 314 314 314 314 315 316 317 317 317 316 315 315 314 314 315 316 317 318 320 322 323
1731 323 325 325 325 324 322 321 322 321 320 319 317 316 315 313 312 310 309 308 306 304 301 299 297 293 290 285 281 278 275 271 268 265 262 259 255 250 246 241 237 231 226 222 217 212 208 203 199 194 192 189 188 186 185 184 182 179 177 174 171 167 163 159 156 154 153 152 152 153 154
1724 154 156 157 159 160 160 159 157 155 153 150 148 146 144 143 144 146 149 151 154 157 159 161 162 163 162 161 159 156 154 152 152 151 153 154 156 157 159 161 162 162 161 159 157 155 154 152 151 151 152 152 154 155 156 156 157 157 156 155 154 153 152 152 151 152 153 154 155 155 154
1716 154 154 153 152 150 148 147 145 145 144 144 143 144 144 145 145 145 145 145 144 144 142 141 139 136 135 134 133 133 134 134 135 135 136 135 134 134 133 132 131 129 128 128 127 127 127 127 127 127 128 127 127 127 127 127 127 127 127 127 128 128 129 129 129 129 129 128 129 130 129
1709 129 129 129 129 129 130 131 133 134 134 135 136 136 137 137 137 137 137 136 136 135 136 137 137 138 139 139 140 141 141 141 140 139 138 137 138 138 139 139 139 139 139 139 139 139 140 140 140 140 139 138 138 138 139 140 141 141 142 142 142 140 139 139 139 139 139 139 139 139 138
1702 138 138 138 138 138 137 136 137 137 138 137 137 136 136 136 136 136 136 136 137 136 136 136 136 135 135 135 135 135 135 135 135 135 134 134 134 134 134 134 135 134 134 134 134 134 133 132 132 132 131 132 132 133 134 133 133 133 132 133 133 133 133 133 133 133 133 133 133 133 133
1695 133 133 133 133 134 135 135 135 135 135 135 134 134 134 134 134 134 134 133 134 134 134 135 135 136 136 137 136 136 134 134 135 135 134 134 134 134 135 134 134 134 134 134 134 134 135 135 135 135 134 133 133 132 132 133 134 134 134 133 133 133 133 134 134 134 134 134 134 134 134
$$ packed form
1740I049q61q85q68q19p48o64n73m86m04l36k77k29j90j59j34j14r9q6p6o7o1n5m8m4m0l7
1737F89l4l1k9k6k3k0k0j7j6j6j4j3j2j0rqqononononommlkkkjkJ%%%JJJ%%jj%j%JJJJKKJ
1731C23K%%jkjJjjjkjjkjkjjkklkkmlnmllmllllmnmnmonmnnmnmnkljkjjklkllmmmlkjj%JJ
1724A54KJKJ%jkkklkkkjJKLKLLKKJJjjklkk%jKJKJKKJ%jkkkjkj%J%KJJ%J%jjjjj%jJJJJ%j
1716A54%jjkkjk%j%jJ%J%%%%j%kjkljjj%J%J%Jjj%jjjkj%j%%%%%Jj%%%%%%%%J%J%%%%jJJj
1709A29%%%%JJKJ%JJ%J%%%%j%jJJ%JJ%JJ%%jjjjJ%J%%%%%%%J%%%jj%%JJJ%J%%kj%%%%%%%j
1702A38%%%%jjJ%Jj%j%%%%%%Jj%%%j%%%%%%%%j%%%%%Jj%%%%jj%%jJ%JJj%%jJ%%%%%%%%%%%
1695A33%%%JJ%%%%%j%%%%%%jJ%%J%J%Jj%k%J%j%%%Jj%%%%%%J%%%jj%j%JJ%%j%%%J%%%%%%%
$$ plain form
1687 134 134 135 135 135 135 135 134 134 134 134 134 134 134 135 136 136 136 135 135 135 135 135 135 134 134 133 134 134 133 134 134 134 134 134 133 133 133 133 133 132 133 133 133 133 134 133 133 133 133 133 133 133 133 133 133 134 135 136 136 135 135 135 135 136 137 137 137 137 136
1680 136 137 137 138 140 140 141 143 144 146 148 150 152 154 158 163 168 172 178 183 187 190 192 194 195 196 196 196 197 197 199 203 208 215 223 232 242 251 258 263 264 263 261 257 254 251 248 246 247 251 257 265 276 287 297 305 310 312 311 306 297 288 278 268
1673 268 259 252 247 244 244 247 251 256 261 264 264 262 258 252 245 235 226 218 211 205 200 196 194 193 192 192 192 191 190 188 184 180 175 172 168 162 157 153 150 147 145 144 142 141 139 138 137 137 136 135 135 135 135 135 135 135 135 134 134 134 134 133 133 132 131 131 131 132
1666 132 132 132 132 132 132 132 132 132 132 132 132 132 132 131 131 131 131 130 130 130 130 130 130 131 131 131 131 132 132 131 130 131 131 132 132 132 132 131 131 131 132 131 131 131 131 131 131 131 131 130 130 130 130 131 132 132 132 132 132 131 132 132 131 131 131 131 131 131 131
1659 131 131 130 130 130 130 130 130 130 130 130 130 130 129 129 129 130 130 130 130 131 131 131 131 131 131 130 130 130 131 131 131 130 130 130 131 131 131 131 131 132 132 132 131 130 130 130 130 130 129 129 129 130 130 130 129 129 128 128 129 129 129 129 129 129 129 129 129 129 129
1651 129 129 129 129 129 129 129 130 129 129 129 129 129 129 129 130 130 130 130 130 130 130 130 129 129 129 129 129 129 130 129 129 129 129 129 129 129 129 129 129 129 129 129 129 128 128 127 127 127 128 128 128 128 128 129 128 128 128 128 128 128 128 128 128 128 128 128 128 127 127
1644 127 127 127 128 128 127 126 126 126 127 126 126 126 126 126 126 127 127 127 127 127 127 126 126 127 127 128 127 127 127 126 126 125 125 125 126 127 127 128 128 128 128 128 128 128 128 129 128 128 127 127 127 126 127 127 127 127 127 127 127 127 128 129 130 130 129 130 130 129 129
1637 129 129 128 128 127 126 126 126 127 127 127 127 127 128 128 128 128 128 128 128 129 129 130 130 130 130 131 131 130 129 129 130 130 129 128 128 128 128 129 128 127 127 128 128 129 129 129 129 128 127 127 127 126 126 127 127 127 127 127 128 129 130 130 129 129 129 129 128 128 128
$$ packed form
1687A34%J%%%%j%%%%%%JJ%%j%%%%%j%jJ%jJ%%%%j%%%%jJ%%%Jj%%%%%%%%%JJJ%j%%%JJ%%%j
1680A36J%JK%JKJKKKKKMNNMONMLKKJJ%%J%KMNPQRJ0RPNJjkmlllkJMOQJ1J1J0QNKjnrrj0j0
1673B68rpnl%LMNNL%kmopj0rqponmkjj%%jjkmmnlmonmllkjkjkjj%jj%%%%%%%j%%%j%jj%%J
1666A32%%%%%%%%%%%%%j%%%j%%%%%J%%%J%jjJ%J%%%j%%Jj%%%%%%%j%%%JJ%%%%jJ%j%%%%%%
1659A31%j%%%%%%%%%%j%%J%%%J%%%%%j%%J%%j%%J%%%%J%%jj%%%%j%%J%%j%j%J%%%%%%%%%%
1651A29%%%%%%Jj%%%%%%J%%%%%%%j%%%%%Jj%%%%%%%%%%%%%j%j%%J%%%%Jj%%%%%%%%%%%%j%
1644A27%%J%jj%%Jj%%%%%J%%%%%j%J%Jj%%j%j%%JJ%J%%%%%%%Jj%j%%jJ%%%%%%%JJJ%jJ%j%
1637A29%j%jj%%J%%%%J%%%%%%J%J%%%J%jj%J%jj%%%Jjj%J%J%%%jj%%j%J%%%%JJJ%j%%%j%%
$$ plain form
1629 128 128 128 128 128 128 129 128 128 129 129 130 129 129 129 130 130 130 130 130 130 130 130 129 129 129 130 130 131 130 130 130 129 129 130 130 130 129 129 129 128 129 129 129 129 129 130 129 129 129 130 130 129 129 128 127 128 128 129 129 129 129 129 128 128 127 127 128 128 128
1622 128 128 129 129 129 128 129 128 128 128 128 129 130 130 129 129 129 129 129 129 128 128 127 127 127 127 127 127 127 127 127 127 127 128 129 129 129 129 129 129 128 128 128 129 129 128 128 128 129 129 128 128 128 128 127 127 128 128 128 129 129 128 129 129 129 129 128 128 128 128
1615 128 127 127 127 127 127 127 127 127 127 127 127 127 127 127 128 128 128 128 128 128 128 129 129 129 128 127 127 128 128 128 128 127 127 127 127 127 127 127 127 127 127 127 127 127 126 126 126 126 127 128 128 127 127 127 127 127 127 126 126 126 126 127 127 127 127 127 126 126 125
1608 125 125 125 127 128 128 127 126 125 126 126 126 127 127 126 126 125 126 126 126 126 125 126 126 126 126 126 125 125 126 127 128 127 127 127 127 127 128 128 128 128 127 127 127 127 128 129 129 129 128 128 128 128 127 126 126 126 126 127 128 128 128 128 128 127 127 128 129 128 127
1600 127 128 128 128 127 127 126 126 126 126 127 128 129 129 128 128 128 129 129 129 128 128 129 129 129 128 128 128 128 128 129 129 129 128 127 127 127 127 128 128 128 128 127 127 128 128 127 127 128 129 129 129 128 128 128 128 128 127 126 127 127 127 127 127 128 128 128 129 130 130
1593 130 131 131 131 131 130 130 130 129 128 129 130 129 129 129 129 129 128 128 129 129 130 130 129 129 130 130 130 130 130 130 129 129 128 128 127 127 127 128 128 129 129 128 128 128 128 128 128 128 127 126 127 128 128 128 127 126 126 126 126 127 127 127 127 128 129 129 128 128 128
1586 128 129 129 129 129 129 128 128 128 129 129 129 129 129 129 129 129 129 128 128 128 128 128 129 129 129 129 129 128 128 128 129 129 129 129 129 129 128 127 128 128 128 128 127 127 127 128 128 128 128 129 129 128 128 128 128 128 128 128 129 129 129 128 128 128 129 129 129 130 130
1578 130 129 129 129 128 128 129 129 129 128 128 128 128 128 129 129 129 128 128 127 127 126 126 126 127 127 128 129 129 129 130 130 130 129 129 129 129 129 129 129 130 130 130 129 129 128 128 128 128 128 128 127 128 128 128 128 128 128 128 127 127 127 127 127 127 127 128 128 128 128
$$ packed form
1629A28%%%%%Jj%J%Jj%%J%%%%%%%j%%J%Jj%%j%J%%j%%jJ%%%%Jj%%J%j%jjJ%J%%%%j%j%J%%
1622A28%J%%jJj%%%JJ%j%%%%%j%j%%%%%%%%%%JJ%%%%%j%%J%j%%J%j%%%j%J%%J%jJ%%%j%%%
1615A28j%%%%%%%%%%%%%J%%%%%%J%%jj%J%%%j%%%%%%%%%%%%j%%%JJ%j%%%%%j%%%J%%%%j%j
1608A25%%KJ%jjjJ%%J%j%jJ%%%jJ%%%%j%JJJj%%%%J%%%j%%%JJ%%j%%%jj%%%JJ%%%%j%JJjj
1600A27J%%j%j%%%JJJ%j%%J%%j%J%%j%%%%J%%jj%%%J%%%j%J%j%JJ%%j%%%%jjJ%%%%J%%JJ%
1593A30J%%%j%%jjJJj%%%%j%J%J%j%J%%%%%j%j%j%%J%J%j%%%%%%jjJJ%%jj%%%J%%%JJ%j%%
1586A28J%%%%j%%J%%%%%%%%j%%%%J%%%%j%%J%%%%%jjJ%%%j%%J%%%J%j%%%%%%J%%j%%J%%J%
1578A30j%%j%J%%j%%%%J%%j%j%j%%J%JJ%%J%%j%%%%%%J%%j%j%%%%%jJ%%%%%%j%%%%%%J%%%
$$ plain form
1571 128 129 129 129 129 129 128 128 127 127 127 127 127 127 127 127 128 128 128 128 128 128 127 127 126 127 127 127 128 128 127 127 127 127 127 126 126 127 128 128 128 128 128 128 128 128 128 129 129 129 129 129 128 127 127 128 128 127 127 127 127 127 127 127 126 126 127 128 128 128
1564 128 129 128 128 128 127 127 127 127 128 127 127 127 127 128 128 129 129 129 129 129 130 129 129 128 128 128 128 127 126 127 128 128 128 128 128 128 127 128 128 128 128 129 129 129 129 129 128 128 127 127 128 129 129 129 129 129 128 128 128 129 128 127 128 128 128 128 129 129 128
1556 128 127 127 127 127 127 127 127 126 126 126 126 125 125 126 127 127 127 127 128 129 129 129 128 129 129 129 129 130 130 130 129 128 128 128 128 128 128 128 128 127 127 127 127 127 127 127 128 129 128 128 128 127 127 127 127 128 128 128 128 128 127 127 127 128 127 127 126 127 127
1549 127 127 127 127 126 125 125 125 125 125 125 126 127 127 128 128 128 128 128 127 126 125 125 125 125 126 126 127 126 126 126 126 126 127 127 127 128 128 128 128 128 129 128 128 127 127 126 126 125 125 126 127 128 127 128 128 128 128 128 128 128 127 126 126 127 127 128 129 129 130
1542 130 130 130 129 129 129 128 128 127 126 127 127 126 126 126 126 126 126 126 126 126 125 125 126 126 126 126 127 128 128 128 128 128 127 126 126 127 128 128 127 126 126 127 127 127 126 125 126 127 127 127 127 127 127 127 126 125 125 125 126 126 125 125 126 127 127 127 128 128 128
1534 128 127 128 128 128 128 128 128 128 127 127 127 126 126 126 126 126 125 125 125 125 126 126 126 126 126 126 126 126 127 128 129 128 127 127 127 126 126 126 126 127 126 127 127 127 126 126 126 127 127 127 128 128 128 127 127 126 126 126 126 127 127 127 126 126 126 126 125 126 127
1527 127 128 129 129 129 129 129 129 129 129 130 129 128 128 128 128 128 128 128 128 128 128 127 126 125 125 125 126 127 127 126 126 127 128 128 127 126 127 127 127 127 127 127 127 127 127 127 127 127 127 127 127 127 128 128 127 126 126 126 127 127 128 129 129 129 129 130 130 129 128
1520 128 127 126 127 127 128 128 128 128 128 128 127 127 127 127 127 127 127 128 128 129 129 129 128 128 127 126 126 126 126 127 128 128 127 126 126 126 126 126 126 127 127 127 127 128 127 127 128 128 128 128 128 128 128 128 127 127 128 128 129 129 129 128 128 127 127 126 126 126 126
$$ packed form
1571A28J%%%%j%j%%%%%%%J%%%%%j%jJ%%J%j%%%%j%JJ%%%%%%%%J%%%%jj%J%j%%%%%%j%JJ%%
1564A28Jj%%j%%%Jj%%%J%J%%%%Jj%j%%%jjJJ%%%%%jJ%%%J%%%%j%j%JJ%%%%j%%JjjJ%%%J%j
1556A28j%%%%%%j%%%j%JJ%%%JJ%%jJ%%%J%%jj%%%%%%%j%%%%%%JJj%%j%%%J%%%%j%%Jj%jJ%
1549A27%%%jj%%%%%JJ%J%%%%jjj%%%J%Jj%%%%J%%J%%%%Jj%j%j%j%JJJjJ%%%%%%jj%J%JJ%J
1542A30%%j%%j%jjJ%j%%%%%%%%j%J%%%JJ%%%%jj%JJ%jj%J%%jjJJ%%%%%%jj%%J%j%JJ%%J%%
1534A28jJ%%%%%%j%%j%%%%j%%%J%%%%%%%JJJjj%%j%%%JjJ%%j%%J%%J%%j%j%%%J%%j%%%jJJ
1527A27JJ%%%%%%%Jjj%%%%%%%%%jjj%%JJ%j%JJ%jjJ%%%%%%%%%%%%%%%J%jj%%J%JJ%%%J%jj
1520A28jjJ%J%%%%%j%%%%%%J%J%%j%jj%%%JJ%jj%%%%%J%%%Jj%J%%%%%%%j%J%J%%j%j%j%%%
$$ plain form
1513 126 127 128 129 128 127 126 127 127 127 126 126 126 126 126 127 126 126 127 127 127 126 126 126 126 126 127 126 125 126 127 128 128 128 127 127 126 127 127 126 126 126 126 126 126 126 125 125 126 126 127 126 126 126 126 126 126 126 125 125 125 126 126 126 126 127 127 127 128 127
1505 127 127 126 126 127 127 128 128 127 126 125 125 125 125 125 126 126 126 126 126 127 127 127 126 125 125 125 125 125 125 125 125 125 125 125 125 125 126 126 127 126 126 126 127 127 126 125 124 124 125 125 125 125 125 124 124 124 125 125 125 125 125 124 124 123 123 124 124 124 124
1498 124 124 124 124 124 125 127 127 126 126 126 126 125 126 126 126 125 125 126 126 127 126 126 126 125 125 124 124 125 125 125 126 126 126 126 126 125 126 126 126 127 127 127 127 126 126 126 126 126 126 126 126 126 127 128 128 127 127 127 127 128 128 127 127 127 126 126 126 126 126
1491 126 126 126 126 126 126 127 127 127 127 127 126 126 126 125 125 125 124 125 125 126 126 127 126 126 126 126 125 126 126 126 125 125 124 125 125 124 124 124 124 124 125 125 125 125 125 125 125 126 126 125 125 125 126 126 126 126 125 125 125 125 125 126 126 126 126 126 126 127 127
1483 127 127 128 128 128 128 128 127 126 126 126 127 127 127 126 126 126 125 125 125 125 125 125 125 125 125 125 126 126 126 126 126 126 126 126 125 125 125 126 125 124 123 124 125 125 125 124 125 126 126 126 126 126 126 125 124 124 125 125 125 126 126 126 127 127 126 125 125 125 125
1476 125 125 125 125 125 125 125 126 126 126 126 125 125 125 125 125 125 125 125 125 125 125 126 126 126 127 126 125 125 126 126 125 124 125 126 126 126 126 126 126 126 125 125 125 125 125 126 126 127 127 126 126 125 125 125 124 125 126 125 125 125 125 125 125 125 125 124 124 123 123
1469 123 123 123 122 123 124 124 125 125 125 125 125 125 126 125 125 126 126 126 126 126 126 125 125 125 124 124 124 125 124 123 124 125 126 126 126 126 126 126 125 125 125 125 126 126 127 128 127 126 126 126 126 127 127 127 128 128 127 127 127 127 126 126 126 126 126 125 124 124 125
1461 125 125 126 126 126 126 126 125 126 126 126 127 126 126 125 125 126 126 126 126 126 127 127 127 127 127 127 127 127 126 126 126 126 127 127 127 128 128 127 126 127 127 127 127 127 126 126 126 126 126 126 126 127 127 127 128 128 129 129 128 127 127 128 128 128 128 128 128 128 129
$$ packed form
1513A26JJJjjjJ%%j%%%%Jj%J%%j%%%%JjjJJJ%%j%jJ%j%%%%%%j%J%Jj%%%%%%j%%J%%%J%%Jj
1505A27%j%J%J%jjj%%%%J%%%%J%%jj%%%%%%%%%%%%J%Jj%%J%jjj%J%%%%j%%J%%%%j%j%J%%%
1498A24%%%%JK%j%%%jJ%%j%J%Jj%%j%j%J%%J%%%%jJ%%J%%%j%%%%%%%%JJ%j%%%J%j%%j%%%%
1491A26%%%%%J%%%%j%%j%%jJ%J%Jj%%%jJ%%j%jJ%j%%%%J%%%%%%J%j%%J%%%j%%%%J%%%%%J%
1483A27%J%%%%jj%%J%%j%%j%%%%%%%%%J%%%%%%%j%%JjjjJJ%%jJJ%%%%%jj%J%%J%%J%jj%%%
1476A25%%%%%%J%%%j%%%%%%%%%%J%%Jjj%J%jjJJ%%%%%%j%%%%J%J%j%j%%jJJj%%%%%%%j%j%
1469A23%%jJJ%J%%%%%Jj%J%%%%%j%%j%%JjjJJJ%%%%%j%%%J%JJjj%%%J%%J%j%%%j%%%%jj%J
1461A25%J%%%%jJ%%Jj%j%J%%%%J%%%%%%%j%%%J%%J%jjJ%%%%j%%%%%%J%%J%J%jj%J%%%%%%J
$$ plain form
1454 129 129 129 130 131 132 133 133 134 135 136 139 141 144 146 148 149 150 150 150 149 147 145 143 141 140 140 138 136 135 134 134 135 136 137 138 138 137 136 135 134 133 132 132 131 131 131 130 129 128 127 127 127 127 127 127 127 127 127 126 126 126 126 126 126 126 127 127 127 128
1447 128 128 127 126 126 126 126 126 126 126 126 125 125 125 126 125 126 126 128 129 129 128 127 126 127 127 127 127 128 128 127 127 126 126 126 127 127 126 126 126 126 126 126 126 126 126 126 126 126 125 126 126 127 128 128 127 127 127 127 127 127 127 127 127 126 126 126 125 125 125
1439 125 126 127 126 125 126 126 127 127 127 127 127 127 126 125 124 124 124 124 125 125 125 125 125 125 125 125 126 127 128 128 128 128 127 126 126 126 127 127 127 126 126 127 127 127 127 126 125 125 125 125 126 126 126 125 125 125 125 126 126 126 126 125 125 125 125 125 125 126 127
1432 127 127 126 125 125 125 126 125 125 125 126 127 127 126 126 125 125 126 127 127 127 127 127 126 126 125 125 124 124 125 124 125 126 125 125 125 125 125 125 125 125 124 125 125 125 125 125 125 125 125 125 124 125 125 125 125 126 127 127 127 126 126 127 127 127 126 125 124 125 125
1425 125 125 125 125 125 125 125 125 125 125 124 124 125 125 125 125 124 123 124 125 125 125 126 126 126 125 125 125 124 125 125 126 126 126 126 125 125 125 126 127 127 127 126 126 126 126 126 127 126 126 126 126 126 125 124 124 123 123 124 124 125 126 125 125 125 125 126 125 124 124
1417 124 125 125 125 125 125 125 125 125 124 124 123 124 124 125 125 125 126 126 126 126 127 127 126 126 125 124 124 125 125 125 125 126 126 125 125 124 124 124 125 125 124 125 126 126 126 125 125 125 125 125 126 126 126 125 124 125 125 126 127 127 127 128 128 127 127 126 126 126 126
1410 126 126 127 127 127 127 127 127 126 126 127 127 128 127 127 127 127 126 125 125 126 126 126 126 126 127 127 127 127 127 126 126 126 126 126 126 126 125 125 125 125 125 124 124 123 122 122 122 122 122 122 122 123 123 124 124 124 125 125 126 126 126 126 125 125 125 125 125 125 125
1403 125 125 125 125 125 125 126 126 127 127 127 128 128 128 127 126 125 125 125 125 125 124 124 124 124 123 122 122 123 124 124 125 126 126 126 125 125 125 125 125 124 123 123 122 122 122 123 122 122 123 123 124 124 124 125 124 123 123 122 122 122 123 123 123 124 124 125 125 125 124
$$ packed form
1454A29%%JJJJ%JJJLKLKKJJ%%jkkkkj%kkjj%JJJJ%jjjjjj%j%%jjjj%%%%%%%%j%%%%%%J%%J
1447A28%jj%%%%%%%j%%JjJ%KJ%jjjJ%%%J%j%j%%J%j%%%%%%%%%%%jJ%JJ%j%%%%%%%%j%%j%%
1439A25JJjjJ%J%%%%%jjj%%%J%%%%%%%JJJ%%%jj%%J%%j%J%%%jj%%%J%%j%%%J%%%j%%%%%JJ
1432A27%jj%%Jj%%JJ%j%j%JJ%%%%j%j%j%JjJJj%%%%%%%jJ%%%%%%%%jJ%%%JJ%%j%J%%jjjJ%
1425A25%%%%%%%%%j%J%%%jjJJ%%J%%j%%jJ%J%%%j%%JJ%%j%%%%Jj%%%%jj%j%J%JJj%%%Jjj%
1417A24J%%%%%%%j%jJ%J%%J%%%J%j%jj%J%%%J%j%j%%J%jJJ%%j%%%%J%%jjJ%JJ%%J%j%j%%%
1410A26%J%%%%%j%J%Jj%%%jj%J%%%%J%%%%j%%%%%%j%%%%j%jj%%%%%%J%J%%J%J%%%j%%%%%%
1403A25%%%%%J%J%%J%%jjj%%%%j%%%jj%JJ%JJ%%j%%%%jj%j%%Jj%J%J%%Jjj%j%%J%%J%J%%j
$$ plain form
1396 124 124 124 125 126 126 126 125 125 125 125 124 124 124 124 125 125 125 125 125 126 126 125 125 125 125 124 124 124 124 125 125 125 125 124 125 125 125 126 125 124 124 123 124 125 126 126 126 126 125 125 124 124 124 124 124 123 122 122 123 123 124 124 124 124 124 123 123 123 124
1388 124 124 124 125 125 125 125 125 125 125 126 125 125 125 124 124 124 125 125 124 124 125 125 125 125 125 124 124 124 124 124 124 124 124 124 124 125 125 125 125 125 125 126 126 126 126 126 126 125 125 125 125 124 125 125 125 125 126 125 125 124 124 124 125 125 124 124 124 124 124
1381 124 125 125 124 123 123 124 124 125 126 126 125 124 123 123 124 125 125 125 124 123 124 124 125 125 125 125 125 124 124 124 124 124 124 124 123 124 125 125 124 124 124 124 123 122 123 124 124 125 127 127 126 126 125 124 125 125 124 124 124 124 125 125 124 124 123 123 123 124 124
1374 124 124 124 124 124 124 123 122 123 123 124 125 125 125 124 123 123 122 123 124 125 125 125 124 124 124 124 123 123 122 122 123 124 123 123 123 123 123 123 123 124 126 126 125 124 123 123 123 123 123 123 123 123 123 123 123 124 124 123 123 122 122 122 122 123 123 122 121 122 122
1366 122 124 125 125 124 124 124 124 125 124 124 123 123 124 123 122 122 122 123 123 123 123 124 125 124 123 123 124 125 124 124 124 123 124 124 124 125 125 126 126 125 125 125 125 124 123 122 122 123 123 122 123 124 124 125 125 125 125 125 125 125 125 124 123 124 124 124 124 124 124
1359 124 125 125 126 126 126 125 124 123 123 124 125 125 125 125 125 125 124 124 125 125 125 125 126 126 126 126 125 125 124 124 123 123 124 124 124 124 124 125 125 125 126 126 125 124 124 125 125 125 125 125 125 126 127 127 126 126 126 126 126 125 125 125 125 124 124 124 123 124 125
1352 125 124 124 125 125 126 126 126 127 126 126 125 125 125 125 126 126 125 126 125 125 125 125 125 125 124 124 124 124 124 124 124 123 123 123 123 124 124 124 124 123 123 124 125 125 125 125 125 125 125 124 124 124 124 124 125 125 124 123 123 123 123 124 125 126 125 125 124 124 123
1344 123 124 123 123 122 122 122 122 123 123 124 125 125 126 126 126 126 126 126 125 125 124 124 124 124 124 125 126 125 125 125 124 124 124 124 124 124 124 124 123 124 124 124 125 124 123 123 123 122 122 122 123 123 123 123 122 123 123 123 123 122 122 123 123 124 124 124 124 123 122
$$ packed form
1396A24%%JJ%%j%%%j%%%J%%%%J%j%%%j%%%J%%%jJ%%Jjj%jJJJ%%%j%j%%%%jj%J%J%%%%j%%J
1388A24%%J%%%%%%Jj%%j%%J%j%J%%%%j%%%%%%%%%J%%%%%J%%%%%j%%%jJ%%%Jj%j%%J%j%%%%
1381A24J%jj%J%JJ%jjj%JJ%%jjJ%J%%%%j%%%%%%jJJ%j%%%jjJJ%JK%j%jjJ%j%%%J%j%j%%J%
1374A24%%%%%jjJ%JJ%%jj%jJJJ%%j%%%j%j%JJj%%%%%%JK%jjj%%%%%%%%%%J%j%j%%%J%jjJ%
1366A22KJ%j%%%Jj%j%Jjj%%J%%%JJjj%JJj%%jJ%%J%J%j%%%jjj%J%jJJ%J%%%%%%%jjJ%%%%%
1359A24J%J%%jjj%JJ%%%%%j%J%%%J%%%j%j%j%J%%%%J%%J%jj%J%%%%%JJ%j%%%%j%%%j%%jJJ
1352A25j%J%J%%Jj%j%%%J%jJj%%%%%j%%%%%%j%%%J%%%j%JJ%%%%%%j%%%%J%jj%%%JJJj%j%j
1344A23Jj%j%%%J%JJ%J%%%%%j%j%%%%JJj%%j%%%%%%%jJ%%Jjj%%j%%J%%%jJ%%%j%J%J%%%jj
$$ plain form
1337 122 123 123 123 124 124 125 125 125 125 125 124 124 124 124 124 124 125 125 125 124 124 123 123 124 125 126 126 126 126 126 126 126 125 124 123 125 125 126 127 127 126 125 125 125 125 125 125 125 125 125 125 125 125 125 125 126 126 127 127 127 126 126 127 127 126 125 126 126 127
1330 127 127 127 127 126 127 129 130 131 132 132 135 139 144 150 156 162 168 172 173 172 170 167 164 161 155 150 145 141 139 136 134 133 132 130 129 129 129 128 128 128 127 126 126 125 125 124 124 125 126 126 126 126 126 126 125 125 125 125 124 124 124 124 124 124 124 124 124 124 123
1322 123 123 123 123 125 126 127 126 126 125 125 125 124 124 124 124 123 123 123 123 122 123 123 124 124 124 124 124 123 123 123 123 123 123 125 126 126 125 124 124 125 125 125 125 124 123 122 123 123 123 123 123 123 124 124 123 123 124 124 125 125 125 125 124 123 123 123 124 125 125
1315 125 124 123 122 122 123 124 123 123 123 123 123 124 124 123 123 123 123 124 125 125 125 125 126 126 125 124 123 123 123 124 124 124 124 124 125 124 124 124 125 125 125 124 123 123 123 123 123 123 123 124 125 126 126 125 124 124 124 124 124 124 124 124 123 124 124 124 125 125 125
1308 125 125 125 125 125 126 125 125 125 124 124 124 124 124 124 124 124 125 125 125 125 124 124 124 124 124 125 125 125 125 125 124 124 123 122 122 123 123 124 124 123 123 123 123 123 123 123 123 125 125 124 123 123 122 122 123 124 124 124 124 124 124 125 125 125 125 125 124 124 124
1300 124 124 124 124 125 125 125 125 125 124 125 125 125 124 124 124 124 125 125 126 126 125 124 123 124 125 125 125 125 124 124 124 123 123 124 125 124 124 124 124 124 124 123 124 123 123 123 123 124 124 123 123 123 124 124 123 123 124 124 124 124 125 125 125 124 123 123 124 124 123
1293 123 122 123 123 123 122 123 122 122 123 123 124 124 124 124 124 125 125 126 125 125 125 125 125 124 124 123 124 123 123 123 123 123 122 122 122 123 123 123 123 123 123 123 123 124 124 123 123 123 123 122 123 123 124 124 124 124 124 124 123 123 123 123 123 122 122 123 123 123 123
1286 123 123 123 123 123 122 123 124 125 126 125 125 125 124 124 123 123 124 124 123 123 123 123 123 123 123 123 123 123 124 125 124 123 123 123 124 124 123 123 124 124 124 124 124 123 123 123 123 123 123 123 124 125 124 124 123 122 121 121 122 122 123 123 123 123 124 124 124 124 125
$$ packed form
1337A22J%%J%J%%%%j%%%%%J%%j%j%JJJ%%%%%%jjjK%JJ%jj%%%%%%%%%%%%%J%J%%j%J%jjJ%J
1330A27%%%jJKJJJ%LMNOOOOMJjklllonnmklkjjkj%%j%%jj%j%j%JJ%%%%%j%%%j%%%%%%%%%j
1322A23%%%KJJj%j%%j%%%j%%%jJ%J%%%%j%%%%%KJ%jj%J%%%jjjJ%%%%%J%j%J%J%%%jj%%JJ%
1315A25jjj%JJj%%%%J%j%%%JJ%%%J%jjj%%J%%%%Jj%%J%%jj%%%%%%JJJ%jj%%%%%%%jJ%%J%%
1308A25%%%%Jj%%j%%%%%%%J%%%j%%%%J%%%%j%jj%J%J%j%%%%%%%K%jj%j%JJ%%%%%J%%%%j%%
1300A24%%%J%%%%jJ%%j%%%J%J%jjjJJ%%%j%%j%JJj%%%%%jJj%%%J%j%%J%j%J%%%J%%jj%J%j
1293A23jJ%%jJj%J%J%%%%J%Jj%%%%j%jJj%%%%j%%J%%%%%%%J%j%%%jJ%J%%%%%j%%%%j%J%%%
1286A23%%%%jJJJJj%%j%j%J%j%%%%%%%%%JJjj%%J%j%J%%%%j%%%%%%JJj%jjj%J%J%%%J%%%J
$$ plain form
1279 125 125 125 124 123 123 123 123 123 123 123 123 124 124 124 124 124 123 123 122 121 121 121 122 122 121 121 122 122 122 122 123 123 122 122 122 122 122 123 122 122 122 122 122 123 123 123 123 123 124 124 124 123 123 123 123 123 123 123 123 123 123 123 123 124 125 125 125 124 123
1271 123 123 122 122 121 121 121 121 122 122 123 123 123 123 123 123 122 122 122 122 121 121 120 121 122 123 123 123 123 123 123 123 123 122 122 123 124 124 123 122 122 123 122 123 123 122 122 122 122 122 122 123 123 123 122 122 121 121 122 123 122 122 122 122 122 122 122 121 122 122
1264 122 123 123 122 122 122 122 123 123 123 122 122 121 121 121 123 123 123 122 122 122 123 123 123 122 121 121 121 120 120 121 121 120 120 120 121 120 120 121 122 122 123 123 122 122 121 121 121 121 122 123 123 122 122 122 122 121 121 121 121 121 122 121 121 121 121 121 122 123 123
1257 123 123 123 122 122 122 122 123 123 123 123 122 122 122 122 123 123 123 123 124 124 124 123 123 124 124 124 123 123 123 123 124 123 122 122 122 123 125 125 123 121 121 121 122 122 122 122 123 123 122 122 122 123 123 123 123 122 122 122 122 122 122 121 121 121 121 122 122 123 124
1249 124 123 123 122 123 123 123 123 123 124 124 124 124 124 124 123 123 123 123 122 123 123 122 123 123 123 123 123 123 122 122 122 123 123 124 123 123 123 123 123 123 123 124 123 123 123 123 122 122 122 122 123 123 123 123 123 123 122 122 122 122 122 122 122 122 122 123 123 123 123
1242 123 123 122 123 123 123 122 121 121 121 123 124 124 123 123 123 123 122 122 122 121 122 123 123 123 123 123 124 124 124 124 124 122 121 121 122 122 122 122 121 120 119 119 120 120 119 120 120 121 122 123 123 122 122 123 124 124 125 125 124 123 124 124 123 123 123 123 123 123 123
1235 123 122 122 122 122 122 123 122 122 121 122 122 122 122 123 123 123 123 122 122 123 123 123 122 121 121 122 122 123 123 123 122 121 122 122 122 123 124 124 123 123 123 124 123 122 123 123 123 123 123 123 122 122 122 122 121 122 123 123 123 123 123 122 122 122 122 122 122 122 122
1227 122 122 122 123 123 123 123 122 122 122 122 122 121 121 122 122 122 122 123 122 121 121 122 122 123 123 123 124 124 125 124 124 123 123 122 122 122 122 123 123 123 123 123 123 124 124 124 124 122 122 122 122 122 123 123 123 123 123 123 123 123 123 123 122 122 123 123 123 122 122
$$ packed form
1279A25%%jj%%%%%%%J%%%%j%jj%%J%j%J%%%J%j%%%%Jj%%%%J%%%%J%%j%%%%%%%%%%%JJ%%jj
1271A23%j%j%%%J%J%%%%%j%%%j%jJJJ%%%%%%%j%JJ%jj%JjJ%j%%%%%J%%j%j%JJj%%%%%%jJ%
1264A22J%j%%%J%%j%j%%K%%j%%J%%jj%%j%J%j%%Jj%JJ%J%j%j%%%JJ%j%%%j%%%%Jj%%%%JJ%
1257A23%%j%%%J%%%j%%%J%%%J%%j%J%%j%%%Jjj%%JK%kk%%J%%%J%j%%J%%%j%%%%%j%%%J%JJ
1249A24j%jJ%%%%J%%%%%j%%%jJ%jJ%%%%%j%%J%Jj%%%%%%Jj%%%j%%%J%%%%%j%%%%%%%%J%%%
1242A23%jJ%%jj%%KJ%j%%%j%%jJJ%%%%J%%%%kj%J%%%jjj%J%jJ%JJJ%j%JJ%J%jjJ%j%%%%%%
1235A23j%%%%Jj%jJ%%%J%%%j%J%%jj%J%J%%jjJ%%JJ%j%%JjjJ%%%%%j%%%jJJ%%%%j%%%%%%%
1227A22%%J%%%j%%%%j%J%%%Jjj%J%J%%J%Jj%j%j%%%J%%%%%J%%%k%%%%J%%%%%%%%%j%J%%j%
$$ plain form
1220 122 123 123 123 123 123 123 123 123 123 123 122 122 122 122 122 122 121 120 121 121 121 121 122 123 123 123 123 123 123 122 122 122 122 121 122 123 123 124 123 123 123 123 123 124 124 124 124 123 123 122 123 124 123 122 121 120 120 119 119 119 119 121 121 122 121 121 121 121 121
1213 121 122 122 122 122 122 123 123 123 122 122 122 123 123 123 122 122 122 122 122 122 122 122 122 122 121 120 120 120 121 122 123 123 123 123 122 121 123 123 122 122 122 122 123 122 122 122 122 122 122 123 123 122 122 122 123 122 122 122 122 122 122 122 121 120 120 121 122 122 122
1205 122 122 121 121 121 121 122 121 120 120 121 121 122 122 122 122 122 122 122 123 123 123 123 123 124 124 124 123 123 123 123 122 123 123 123 123 123 123 122 122 123 122 122 122 122 122 122 123 123 123 123 122 122 122 121 121 121 121 121 121 121 122 122 122 122 122 121 121 122 122
1198 122 122 122 123 123 123 123 123 122 121 122 122 122 122 122 121 122 122 122 122 123 123 123 122 121 121 120 121 121 121 121 122 122 122 122 122 122 122 122 122 122 121 121 121 121 122 121 121 121 121 122 123 123 122 122 121 122 122 122 122 122 122 122 123 123 123 124 123 122 122
1191 122 121 121 121 120 120 120 121 122 122 122 122 122 122 122 122 122 122 122 123 122 122 122 122 123 124 123 123 123 123 122 122 121 121 122 122 122 122 122 123 123 123 124 124 123 122 122 123 123 123 123 123 123 122 122 121 121 122 123 123 123 123 124 123 122 122 122 121 121 121
1183 121 122 123 123 123 123 123 123 123 122 122 122 122 123 123 123 123 123 123 123 123 123 123 123 122 123 123 123 123 123 123 123 123 123 123 122 121 121 121 121 121 121 121 122 122 123 123 122 122 122 122 122 122 122 122 122 122 123 124 124 124 124 123 122 122 122 122 122 122 122
1176 122 121 121 121 121 122 122 123 123 123 122 121 120 120 120 121 121 122 122 122 122 121 121 121 122 122 122 122 122 121 122 122 123 122 122 123 123 124 123 123 123 124 124 123 123 123 123 122 122 123 123 123 122 122 123 123 122 121 121 121 121 121 122 122 122 121 121 121 121 121
1169 121 121 121 122 122 122 121 121 120 120 120 121 121 122 121 121 121 121 121 121 121 121 121 121 121 121 121 121 121 122 121 121 121 121 121 121 121 121 122 122 123 122 122 122 122 122 121 121 121 121 121 121 121 121 120 121 121 120 120 120 120 119 120 120 121 122 122 123 122 122
$$ packed form
1220A22J%%%%%%%%%j%%%%%jjJ%%%JJ%%%%%j%%%jJJ%Jj%%%%J%%%j%jJJjjjj%j%%%K%Jj%%%%
1213A21J%%%%J%%j%%J%%j%%%%%%%%%jj%%JJJ%%%jjK%j%%%Jj%%%%%J%j%%Jj%%%%%%jj%JJ%%
1205A22%j%%%Jjj%J%J%%%%%%J%%%%J%%j%%%jJ%%%%%j%Jj%%%%%J%%%j%%j%%%%%%J%%%%j%J%
1198A22%%J%%%%jjJ%%%%jJ%%%J%%jj%jJ%%%J%%%%%%%%%j%%%Jj%%%JJ%j%jJ%%%%%%J%%Jjj%
1191A22j%%j%%JJ%%%%%%%%%%Jj%%%JJj%%%j%j%J%%%%J%%J%jj%J%%%%%j%j%JJ%%%Jjj%%j%%
1183A21JJ%%%%%%j%%%J%%%%%%%%%%jJ%%%%%%%%%jj%%%%%%J%J%j%%%%%%%%%JJ%%%jj%%%%%%
1176A22j%%%J%J%%jjj%%J%J%%%j%%J%%%%jJ%Jj%J%Jj%%J%j%%%j%J%%j%J%jj%%%%J%%j%%%%
1169A21%%J%%j%j%%J%Jj%%%%%%%%%%%%%%Jj%%%%%%%J%Jj%%%%j%%%%%%%jJ%j%%%jJ%JJ%Jj%
$$ plain form
1162 122 122 122 122 122 123 123 122 122 122 122 121 120 120 120 120 121 121 122 122 122 122 122 122 122 122 122 121 121 121 121 121 121 122 122 122 122 122 122 121 121 121 121 121 121 122 122 121 121 121 121 122 123 122 121 121 122 122 121 121 121 120 120 121 122 123 122 122 121 122
1154 122 122 122 122 122 121 122 122 122 121 121 120 120 120 120 119 119 120 121 122 123 123 123 122 122 123 123 123 122 122 122 123 122 123 123 123 122 122 122 123 123 122 121 120 121 121 121 122 122 121 121 121 121 121 121 122 122 123 123 123 122 122 122 122 121 121 121 121 121 122
1147 122 122 121 120 120 121 121 122 122 122 122 122 122 122 122 122 122 122 122 122 121 121 121 121 122 122 122 122 122 121 121 121 121 122 122 122 122 121 121 121 121 122 122 122 121 121 121 121 122 122 122 123 123 123 123 124 124 123 122 122 123 123 124 124 123 122 122 122 122 122
1140 122 122 122 121 121 121 121 121 121 121 121 121 121 121 121 121 121 121 121 122 122 121 121 120 121 121 121 122 122 122 122 121 122 122 122 122 122 122 122 121 121 121 121 121 122 122 122 123 123 123 123 123 122 122 121 122 121 121 122 122 122 122 121 122 122 122 123 123 123 123
1132 123 123 123 122 122 123 123 123 123 123 123 122 122 123 123 122 122 121 121 122 122 123 122 122 122 122 122 122 121 120 121 121 122 121 120 121 121 123 123 122 120 120 120 120 120 120 120 121 121 121 121 121 121 121 121 121 121 121 121 121 120 121 121 121 121 121 121 121 121 121
1125 121 121 121 121 120 120 120 119 119 119 119 120 119 119 119 119 119 119 120 120 120 119 119 120 120 121 121 121 121 121 121 121 122 123 123 123 122 121 120 120 120 120 120 119 119 120 120 120 120 120 120 120 120 120 120 121 121 121 121 121 121 121 121 120 122 122 120 120 120 119
1118 119 119 119 120 120 120 120 119 119 119 120 120 120 120 120 120 119 119 119 119 120 120 120 120 119 120 121 121 121 121 121 121 121 121 121 121 121 121 122 121 121 121 121 121 120 121 122 121 121 121 120 121 120 119 120 121 122 121 121 121 121 121 121 121 121 121 120 120 120 120
1110 120 120 120 119 119 120 120 120 121 121 120 119 119 120 121 121 121 121 121 121 121 121 121 122 122 122 122 122 122 121 122 122 121 121 121 120 120 120 120 120 120 120 119 119 120 121 122 121 120 120 120 121 121 121 122 123 122 122 121 120 118 118 119 120 121 121 122 122 122 122
$$ packed form
1162A22%%%%J%j%%%jj%%%J%J%%%%%%%%j%%%%%J%%%%%j%%%%%J%j%%%JJjj%J%j%%j%JJJj%jJ
1154A22%%%%jJ%%j%j%%%j%JJJJ%%j%J%%j%%JjJ%%j%%J%jjjJ%%J%j%%%%%J%J%%j%%%j%%%%J
1147A22%jj%J%J%%%%%%%%%%%%j%%%J%%%%j%%%J%%%j%%%J%%j%%%J%%J%%%J%jj%J%J%jj%%%%
1140A22%%j%%%%%%%%%%%%%%%J%j%jJ%%J%%%jJ%%%%%%j%%%%J%%J%%%%j%jJj%J%%%jJ%%J%%%
1132A23%%j%J%%%%%j%J%j%j%J%Jj%%%%%jjJ%JjjJ%K%jk%%%%%%J%%%%%%%%%%%%jJ%%%%%%%%
1125A21%%%j%%j%%%Jj%%%%%J%%j%J%J%%%%%%JJ%%jjj%%%%j%J%%%%%%%%%J%%%%%%%jK%k%%j
1118A19%%J%%%j%%J%%%%%j%%%J%%%jJJ%%%%%%%%%%%Jj%%%%jJJj%%jJjjJJJj%%%%%%%%j%%%
1110A20%%j%J%%J%jj%JJ%%%%%%%%J%%%%%jJ%j%%j%%%%%%j%JJJjj%%J%%JJj%jjk%JJJ%J%%%
$$ plain form
1103 122 122 122 121 121 121 121 121 120 120 120 119 118 119 120 120 121 121 121 121 121 122 121 121 121 121 120 120 120 120 121 120 120 120 120 120 120 120 119 119 119 120 120 121 121 121 121 121 120 121 121 121 121 120 120 120 120 121 122 122 121 121 120 120 120 120 119 119 119 120
1096 120 120 120 120 120 119 119 120 120 121 121 121 122 122 122 121 120 120 121 121 121 121 121 120 120 120 120 120 120 120 120 120 119 120 121 122 122 122 121 121 122 122 121 120 120 121 121 121 120 120 119 119 120 121 122 122 121 121 121 121 121 122 122 121 121 122 122 122 122 122
1088 122 121 120 120 120 121 121 121 121 122 122 122 122 121 121 121 120 119 118 118 119 119 119 120 120 120 120 121 121 122 122 122 122 121 121 121 121 122 122 122 122 122 121 122 122 121 121 121 122 122 122 122 122 122 122 121 121 120 120 119 120 121 122 122 122 122 121 121 122 122
1081 122 122 122 122 122 121 120 121 122 122 122 121 121 122 121 120 120 120 121 122 121 121 121 121 121 121 121 121 121 122 122 122 121 121 120 120 120 120 119 120 121 121 121 120 120 120 121 121 120 120 120 120 121 121 121 120 120 120 119 119 119 119 119 120 119 119 119 120 120 121
1074 121 121 121 122 122 122 121 122 122 122 122 122 123 123 122 121 120 120 120 120 120 121 121 121 120 121 122 122 122 122 122 122 122 122 121 121 121 121 121 121 121 122 122 122 122 122 122 122 122 122 122 121 121 121 121 120 120 120 120 120 120 121 121 121 121 121 121 121 122 122
1066 122 121 120 120 120 122 122 121 120 119 119 119 120 121 121 121 120 120 120 121 122 122 121 121 121 121 122 122 122 123 122 122 121 121 121 120 120 119 120 121 121 121 121 122 122 122 122 122 121 121 121 121 121 120 121 121 120 120 120 120 119 119 120 121 121 121 121 121 122 122
1059 122 122 122 122 122 122 122 121 121 121 121 122 121 121 122 122 122 122 122 121 120 120 120 121 121 121 121 121 121 120 119 120 120 120 120 120 121 121 121 121 122 122 122 122 122 121 120 121 122 122 122 122 122 121 121 121 121 121 122 122 122 122 122 121 120 121 122 122 121 120
1052 120 120 120 120 120 120 120 119 120 120 120 121 121 122 122 122 122 121 120 120 120 121 121 121 121 121 121 121 121 121 121 121 121 121 121 121 121 121 120 120 120 120 121 121 121 121 122 122 122 122 122 122 123 122 121 120 120 120 120 120 120 121 121 121 121 120 120 121 121 121
$$ packed form
1103A22%%j%%%%j%%jjJJ%J%%%%Jj%%%j%%%Jj%%%%%%j%%J%J%%%%jJ%%%j%%%JJ%j%j%%%j%%J
1096A20%%%%j%J%J%%J%%jj%J%%%%j%%%%%%%%jJJJ%%j%J%jj%J%%j%j%JJJ%j%%%%J%j%J%%%%
1088A22jj%%J%%%J%%%j%%jjj%J%%J%%%J%J%%%j%%%J%%%%jJ%j%%J%%%%%%j%j%jJJJ%%%j%J%
1081A22%%%%jjJJ%%j%Jjj%%JJj%%%%%%%%J%%j%j%%%jJJ%%j%%J%j%%%J%%j%%j%%%%Jj%%J%J
1074A21%%J%%jJ%%%%J%jjj%%%%J%%jJJ%%%%%%%j%%%%%%J%%%%%%%%%j%%%j%%%%%J%%%%%%J%
1066A22jj%%K%jjj%%JJ%%j%%JJ%j%%%J%%Jj%j%%j%jJJ%%%J%%%%j%%%%jJ%j%%%j%JJ%%%%J%
1059A22%%%%%%j%%%Jj%J%%%%jj%%J%%%%%jjJ%%%%J%%%J%%%%jjJJ%%%%j%%%%J%%%%jjJJ%jj
1052A20%%%%%%jJ%%J%J%%%jj%%J%%%%%%%%%%%%%%%%j%%%J%%%J%%%%%Jjjj%%%%%J%%%j%J%%
$$ plain form
1045 121 120 120 121 121 121 121 121 121 120 120 120 121 121 120 120 120 121 121 121 121 121 121 120 121 121 121 121 122 122 122 122 122 121 121 121 120 121 121 121 120 121 121 121 121 122 122 122 121 122 122 122 122 121 120 121 121 121 120 120 120 120 120 119 119 120 121 122 122 121
1037 121 121 121 121 120 120 119 118 118 118 119 120 121 122 121 121 121 121 121 122 122 121 121 121 121 121 121 121 121 121 121 122 121 121 120 120 120 120 119 119 119 119 119 120 120 121 120 119 119 119 118 119 120 120 119 119 119 119 120 120 121 121 121 121 122 123 123 122 121 121
1030 121 120 120 120 120 120 120 121 120 119 119 119 119 120 121 121 121 120 120 120 121 121 121 121 121 121 121 121 121 121 120 120 120 120 120 120 120 121 121 121 120 120 119 119 120 120 120 119 119 119 119 120 120 121 121 120 120 120 120 120 119 119 119 119 120 120 120 120 120 120
1023 120 120 119 119 118 119 119 119 119 119 119 119 119 119 119 120 120 120 119 118 118 119 119 119 120 120 120 120 120 119 119 119 119 119 118 119 119 119 119 119 119 119 119 120 119 118 118 118 118 118 118 118 118 118 118 118 119 119 119 120 120 120 121 120 119 119 118 118 117 117
1015 117 117 117 117 118 119 119 119 119 118 117 117 117 118 118 118 118 118 118 117 118 118 119 119 118 119 119 119 118 119 119 119 119 119 119 119 118 118 118 119 120 120 119 119 119 119 120 120 120 119 120 121 121 120 120 119 119 119 119 119 119 120 120 120 119 119 118 118 119 118
1008 118 118 118 117 117 118 118 119 119 119 119 119 119 119 119 118 119 120 120 120 120 120 119 119 119 119 119 119 119 118 118 118 118 118 118 119 120 121 120 120 119 118 117 117 118 118 119 119 119 119 120 120 120 119 119 121 120 120 120 119 119 120 120 120 119 119 119 118 118 119
1001 119 120 120 119 118 117 118 119 120 120 120 119 119 119 119 119 119 119 118 119 119 120 121 122 123 122 122 121 120 120 120 120 120 120 120 119 120 120 120 120 120 120 120 120 120 121 121 120 120 120 120 120 120 121 121 120 120 119 120 120 121 121 120 120 119 118 118 119 120 119
993 119 118 118 119 119 119 119 119 119 119 120 121 121 121 121 120 121 120 120 120 120 120 121 121 120 119 119 119 119 119 119 119 118 118 118 118 117 118 118 119 120 119 119 118 118 118 118 119 119 120 120 119 119 119 119 119 119 119 119 119 119 118 118 119 119 120 120 120 120 119 120
$$ packed form
1045A21j%J%%%%%j%%J%j%%J%%%%%jJ%%%J%%%%j%%jJ%%jJ%%%J%%jJ%%%jjJ%%j%%%%j%JJJ%j
1037A21%%%j%jj%%JJJJj%%%%J%j%%%%%%%%%Jj%j%%%j%%%%J%Jjj%%jJJ%j%%%J%J%%%JJ%jj%
1030A21j%%%%%Jjj%%%JJ%%j%%J%%%%%%%%%j%%%%%%J%%j%j%J%%j%%%J%J%j%%%%j%%%J%%%%%
1023A20%j%jJ%%%%%%%%%J%%jj%J%%J%%%%j%%%%jJ%%%%%%%Jjj%%%%%%%%%%J%%J%%Jjj%j%j%
1015A17%%%JJ%%%jj%%J%%%%%jJ%J%jJ%%jJ%%%%%%j%%JJ%j%%%J%%jJJ%j%j%%%%%J%%j%j%Jj
1008A18%%j%J%J%%%%%%%jJJ%%%%j%%%%%%j%%%%%JJJj%jjj%J%J%%%J%%j%Kj%%j%J%%j%%j%J
1001A19J%jjjJJJ%%j%%%%%%jJ%JJJJj%jj%%%%%%jJ%%%%%%%%J%j%%%%%J%j%jJ%J%j%jj%JJj
993A19j%J%%%%%%JJ%%%jJj%%%%J%jj%%%%%%j%%%jJ%JJj%j%%%J%J%j%%%%%%%%%j%J%J%%%jJ
$$ plain form
986 120 120 119 119 119 120 120 120 120 121 120 119 120 120 120 119 118 118 119 119 118 117 117 118 119 119 119 118 118 119 119 119 119 119 119 118 119 119 120 120 120 120 120 120 121 121 121 121 121 121 120 120 120 119 120 121 121 121 121 121 120 119 119 119 119 119 119 119 118 117 118
979 118 118 119 119 118 117 117 117 118 118 117 117 117 117 118 119 120 121 122 122 121 121 121 121 121 120 120 120 120 120 120 120 121 121 120 120 120 120 120 119 120 120 120 120 119 119 119 119 119 120 120 120 120 120 119 119 120 120 119 120 121 121 121 121 121 121 121 120 120 120 120
971 120 120 120 120 119 119 120 121 121 121 120 120 120 120 120 120 120 119 119 120 120 120 120 121 121 122 122 121 121 120 120 120 120 120 120 120 120 120 120 119 120 119 119 119 120 120 120 121 121 121 121 120 120 119 119 120 121 121 122 121 120 120 119 119 119 120 120 119 119 120 121
964 121 121 121 121 121 120 121 121 121 121 121 121 120 120 120 120 120 120 119 119 119 119 120 120 119 119 118 118 118 119 120 119 120 121 122 122 121 121 120 119 119 120 120 120 120 120 121 121 121 121 121 120 120 120 120 120 120 120 120 119 119 118 119 120 121 120 120 120 119 120 121
956 121 120 119 120 120 120 120 120 119 119 119 119 120 120 119 118 120 121 121 120 120 120 119 119 119 119 119 120 120 120 120 120 121 121 121 120 120 119 118 118 118 118 119 119 119 120 120 121 122 122 123 122 121 122 122 122 121 120 121 121 121 121 121 122 122 122 122 122 121 122 122
949 122 122 122 123 122 121 121 121 121 121 121 121 121 121 120 120 120 120 121 121 121 121 120 120 120 120 120 120 120 120 120 120 120 120 120 120 120 119 120 121 122 121 120 120 120 120 120 121 121 121 120 121 121 121 120 120 120 120 120 120 119 119 120 120 119 118 118 117 118 118 118
941 118 119 119 120 120 120 120 120 119 118 118 118 118 118 119 119 119 119 119 119 120 120 119 118 117 118 119 119 120 120 121 121 121 120 120 120 119 119 119 119 119 120 120 120 120 120 121 122 122 122 121 120 120 120 120 120 119 119 119 119 119 119 119 119 119 118 118 118 118 119 119
934 119 119 118 118 118 118 118 119 119 119 118 118 118 117 117 117 118 119 119 118 118 119 119 119 120 120 120 120 120 120 120 120 120 120 120 120 119 119 120 121 121 120 120 119 119 119 119 119 119 119 119 119 120 120 120 121 121 121 121 120 121 121 121 121 120 120 121 121 121 120 120
$$ packed form
986A20%j%%J%%%JjjJ%%jj%J%jj%JJ%%j%J%%%%%jJ%J%%%%%J%%%%%j%%jJJ%%%%jj%%%%%%jjJ
979A18%J%jj%%J%j%%%JJJJJ%j%%%%j%%%%%%J%j%%%%jJ%%%j%%%%J%%%%j%J%jJJ%%%%%%j%%%
971A20%%%j%JJ%%j%%%%%%j%J%%%J%J%j%j%%%%%%%%%jJj%%J%%J%%%j%j%JJ%Jjj%j%%J%j%JJ
964A21%%%%jJ%%%%%j%%%%%j%%%J%j%j%%JJjJJJ%j%jj%J%%%%J%%%%j%%%%%%%j%jJJJj%%jJJ
956A21jjJ%%%%j%%%J%jjKJ%j%%j%%%%J%%%%J%%j%jj%%%J%%J%JJ%JjjJ%%jjJ%%%%J%%%%jJ%
949A22%%Jjj%%%%%%%%j%%%J%%%j%%%%%%%%%%%%%%jJJJjj%%%%J%%jJ%%j%%%%%j%J%jj%jJ%%
941A18J%J%%%%jj%%%%J%%%%%J%jjjJJ%J%J%%j%%j%%%%J%%%%JJ%%jj%%%%j%%%%%%%%j%%%J%
934A19%j%%%%J%%j%%j%%JJ%j%J%%J%%%%%%%%%%%j%JJ%j%j%%%%%%%%J%%J%%%jJ%%%j%J%%j%
$$ plain form
927 120 120 120 120 119 119 119 118 118 119 119 119 118 118 119 119 119 119 118 119 120 119 120 120 119 119 118 118 118 119 119 119 119 119 119 119 120 120 120 119 120 120 121 121 120 120 120 120 120 119 119 119 119 118 118 118 118 117 117 118 119 120 120 120 120 119 119 119 119 119 120
919 120 120 121 122 122 122 122 122 122 122 122 123 124 125 125 126 125 125 125 126 126 126 125 124 122 122 121 120 119 119 120 121 120 120 120 120 120 120 120 120 120 120 120 120 119 119 120 120 120 120 120 121 121 121 120 120 120 120 119 119 119 119 120 121 120 120 119 119 119 120 120
912 120 120 120 120 120 120 120 119 119 120 120 120 119 119 118 118 118 118 118 118 118 118 118 118 118 119 119 119 119 119 120 120 120 119 119 118 119 119 119 119 118 117 118 118 118 117 117 117 117 117 117 117 117 117 118 118 119 119 119 120 119 118 118 118 118 119 119 118 118 117 118
904 118 119 119 120 120 119 119 119 118 117 116 116 117 117 117 118 118 118 118 117 117 117 117 117 117 118 119 118 117 117 117 118 118 118 118 119 119 118 117 117 117 117 117 117 117 117 118 119 118 118 118 118 118 119 120 120 120 119 119 119 119 120 119 118 119 120 120 120 120 120 120
897 120 119 119 120 120 120 120 120 120 119 119 119 119 118 118 118 119 120 120 120 120 120 119 119 119 119 120 120 120 120 120 120 119 120 120 119 119 120 120 120 120 119 119 119 119 119 120 121 121 120 120 120 120 120 120 119 119 119 119 120 119 119 119 119 119 118 117 117 118 118 118
890 118 119 119 120 120 121 121 120 119 119 119 119 119 119 119 119 119 119 119 119 118 118 118 119 119 119 119 119 118 118 118 118 117 118 118 118 119 119 119 119 119 119 120 120 120 119 119 119 119 118 119 119 119 120 120 120 120 120 120 120 120 120 120 119 118 118 118 118 118 118 119
882 119 120 122 122 121 121 120 121 121 120 119 119 119 119 119 119 119 120 121 121 121 121 120 120 120 119 118 119 119 119 120 120 119 118 118 119 119 119 120 120 119 119 119 119 120 120 120 120 120 120 119 119 119 120 120 121 120 120 120 119 119 119 120 120 120 120 121 121 121 121 121
875 121 121 121 120 120 120 119 118 119 119 119 119 118 118 119 120 120 120 120 119 118 118 118 118 118 118 118 118 118 119 120 120 121 121 121 120 119 118 117 117 117 117 117 117 117 117 118 118 118 119 119 120 120 121 121 120 120 120 120 120 120 121 121 121 120 121 122 122 122 121 121
$$ packed form
927A20%%%j%%j%J%%j%J%%%jJJjJ%j%j%%J%%%%%%J%%jJ%J%j%%%%j%%%j%%%j%JJJ%%%j%%%%J
919A20%JJ%%%%%%%JJJ%Jj%%J%%jjk%jjj%JJj%%%%%%%%%%%j%J%%%%J%%j%%%j%%%JJj%j%%J%
912A20%%%%%%j%J%%j%j%%%%%%%%%%J%%%%J%%j%jJ%%%jjJ%%j%%%%%%%%J%J%%Jjj%%%J%j%jJ
904A18J%J%j%%jjj%J%%J%%%j%%%%%JJjj%%J%%%J%jj%%%%%%%JJj%%%%JJ%%j%%%JjjJJ%%%%%
897A20j%J%%%%%j%%%j%%JJ%%%%j%%%J%%%%%jJ%j%J%%%j%%%%JJ%j%%%%%j%%%Jj%%%%jj%J%%
890A18J%J%J%jj%%%%%%%%%%%j%%J%%%%j%%%jJ%%J%%%%%J%%j%%%jJ%%J%%%%%%%%%jj%%%%%J
882A19JK%j%jJ%jj%%%%%%JJ%%%j%%jjJ%%J%jj%J%%J%j%%%J%%%%%j%%J%Jj%%j%%J%%%J%%%%
875A21%%j%%jjJ%%%j%JJ%%%jj%%%%%%%%JJ%J%%jjjj%%%%%%%J%%J%J%J%j%%%%%J%%jJJ%%j%
$$ plain form
867 121 120 120 119 119 120 120 120 120 119 119 119 119 120 120 121 121 121 120 119 120 120 121 120 120 119 120 120 120 120 120 120 120 121 121 120 119 119 120 120 119 119 119 119 119 120 120 120 120 120 120 120 120 121 121 121 121 120 120 121 121 121 120 120 120 121 120 120 119 119 120
860 120 120 120 120 120 120 120 120 119 119 120 119 119 119 119 119 119 119 120 120 121 122 121 121 121 121 120 120 120 119 119 121 121 122 122 122 122 122 122 121 122 122 121 121 120 119 120 121 121 121 120 120 121 121 121 122 123 122 121 121 121 122 122 122 123 123 123 123 122 122 122
852 122 123 122 122 123 124 123 123 123 122 122 122 121 121 121 121 120 121 121 121 121 121 121 122 122 122 122 123 123 123 123 122 122 121 121 121 122 123 123 123 124 123 123 123 123 123 123 123 123 123 123 122 121 122 122 122 123 123 122 123 123 123 123 123 123 123 123 123 123 122 122
845 122 122 122 121 121 121 121 122 123 123 124 125 125 125 125 125 125 126 126 126 127 128 127 128 128 127 127 127 127 128 128 127 127 127 127 127 127 128 129 129 129 129 129 130 130 131 131 131 132 132 134 136 137 137 137 137 137 137 137 137 137 138 137 137 136 134 134 134 134 134 134
838 134 133 133 132 131 131 130 130 129 129 128 127 127 127 127 127 126 125 125 124 124 124 124 124 124 123 123 122 121 121 122 122 122 122 122 122 122 122 121 121 121 122 122 122 122 121 122 122 121 121 121 120 120 120 120 121 121 121 121 122 121 120 119 119 118 117 118 119 120 121 121
830 121 121 121 122 122 121 121 120 119 118 118 119 120 120 119 119 119 120 119 119 119 118 118 117 117 118 118 118 118 118 118 117 118 119 118 118 118 118 118 119 120 120 120 120 120 120 120 119 119 120 120 120 120 119 119 118 118 119 119 118 118 118 118 119 119 119 119 119 119 119 119
823 119 118 118 118 118 118 118 118 118 118 118 118 118 118 117 117 117 118 118 118 119 119 120 120 120 120 120 120 121 121 120 120 119 119 119 118 118 118 118 119 119 119 120 120 121 121 122 122 122 122 121 121 120 120 119 119 119 118 117 117 117 117 117 117 117 118 118 118 118 118 118
815 118 118 117 117 118 118 119 119 120 120 119 118 117 118 118 119 119 118 119 119 120 120 120 120 119 118 119 119 120 120 120 119 118 117 117 118 118 118 118 117 116 117 118 119 118 118 118 118 118 118 119 119 119 119 118 118 118 119 119 120 119 118 118 118 118 117 117 117 117 117 118
$$ packed form
867A21j%j%J%%%j%%%J%J%%jjJ%Jj%jJ%%%%%%J%jj%J%j%%%%J%%%%%%%J%%%j%J%%j%%Jj%j%J
860A20%%%%%%%j%Jj%%%%%%J%JJj%%%j%%j%K%J%%%%%jJ%j%jjJJ%%j%J%%JJjj%%J%%J%%%j%%
852A22Jj%JJj%%j%%j%%%jJ%%%%%J%%%J%%%j%j%%JJ%%Jj%%%%%%%%%jjJ%%J%jJ%%%%%%%%%j%
845A22%%j%%%JJ%JJ%%%%%J%%JJjJ%j%%%J%j%%%%%JJ%%%%J%J%%J%KKJ%%%%%%%%Jj%jk%%%%%
838A34j%jj%j%j%jj%%%%jj%j%%%%%j%jj%J%%%%%%%j%%J%%%jJ%j%%j%%%J%%%Jjjj%jjJJJJ%
830A21%%J%j%jjj%JJ%j%%Jj%%j%j%J%%%%%jJJj%%%%JJ%%%%%%j%J%%%j%j%J%j%%%J%%%%%%%
823A19j%%%%%%%%%%%%j%%J%%J%J%%%%%J%j%j%%j%%%J%%J%J%J%%%j%j%j%%jj%%%%%%J%%%%%
815A18%j%J%J%J%jjjJ%J%jJ%J%%%jjJ%J%%jjj%J%%%jjJJJj%%%%%J%%%j%%J%Jjj%%%j%%%%J
$$ plain form
808 118 118 118 119 119 119 119 120 120 120 120 120 121 121 121 121 120 120 119 119 119 119 119 119 118 118 118 118 118 118 119 119 120 120 119 119 119 119 119 119 119 119 119 119 118 119 119 119 118 118 118 117 117 117 117 117 118 118 119 119 120 119 119 119 118 118 118 118 118 118 118
801 118 118 119 119 119 119 119 119 119 119 119 119 119 119 119 119 119 120 120 119 119 119 120 120 120 120 120 121 121 121 121 121 120 120 120 121 121 121 122 122 122 122 122 122 122 123 123 124 125 127 128 130 131 133 134 135 136 138 139 141 144 146 149 151 152 153 155 156 157 159 159
793 159 160 161 162 163 162 162 161 160 159 158 157 155 154 153 151 149 147 145 143 141 139 138 136 134 132 131 130 128 127 126 125 124 124 123 122 121 120 120 119 118 118 119 119 119 119 118 118 118 119 118 118 118 118 118 118 118 118 118 118 118 118 118 117 117 117 117 118 119 119 119
786 119 119 119 118 117 117 118 118 117 118 119 119 120 120 119 118 118 119 119 120 120 119 118 118 118 118 118 118 117 118 118 118 118 117 117 117 117 117 119 120 120 119 118 118 118 118 118 119 119 119 120 120 119 120 120 120 120 119 119 119 119 119 120 120 119 119 119 119 119 118 117
778 117 118 118 118 118 118 118 118 118 118 118 118 117 117 117 117 117 116 117 117 118 119 120 120 120 119 118 117 117 117 117 117 116 115 116 116 117 117 117 116 116 115 115 115 115 115 116 117 117 117 117 117 117 117 116 116 117 117 116 116 116 115 116 116 117 118 118 118 116 116 117
771 117 118 118 118 118 118 118 118 118 117 115 116 116 116 116 117 118 117 117 117 118 118 118 118 118 118 117 117 117 117 117 117 116 116 117 117 117 117 117 118 118 118 117 117 117 117 117 117 118 117 117 116 116 117 116 116 116 116 117 117 117 117 117 117 117 117 118 118 117 117 117
763 117 117 117 118 118 118 117 117 117 118 118 118 118 118 118 118 117 118 118 118 119 119 119 119 118 117 117 116 116 116 116 116 116 116 117 117 118 119 120 120 119 118 118 118 118 118 118 117 116 116 116 117 118 118 117 117 117 118 119 119 119 119 120 119 118 118 118 119 119 119 119
756 119 118 118 118 118 119 119 120 119 119 119 118 118 119 119 119 119 119 118 118 118 116 116 116 117 117 117 118 118 117 117 117 117 117 116 116 116 116 116 117 118 119 119 119 119 119 120 119 118 117 117 116 117 118 118 118 118 117 117 117 117 118 118 118 119 119 119 119 119 119 118
$$ packed form
808A18%%J%%%J%%%%J%%%j%j%%%%%j%%%%%J%J%j%%%%%%%%%jJ%%j%%j%%%%J%J%Jj%%j%%%%%%
801A18%J%%%%%%%%%%%%%%J%j%%J%%%%J%%%%j%%J%%J%%%%%%J%JJKJKJKJJJKJKLKLKJJKJJK%
793A59JJJJj%jjjjjkjjkkkkkkkjkkkjjkjjjj%jjjj%jj%J%%%j%%Jj%%%%%%%%%%%%j%%%JJ%%
786A19%%jj%J%jJJ%J%jj%J%J%jj%%%%%jJ%%%j%%%%KJ%jj%%%%J%%J%jJ%%%j%%%%J%j%%%%jj
778A17J%%%%%%%%%%j%%%%jJ%JJJ%%jjj%%%%jjJ%J%%j%j%%%%JJ%%%%%%j%J%j%%jJ%JJ%%k%J
771A17J%%%%%%%jkJ%%%JJj%%J%%%%%j%%%%%j%J%%%%J%%j%%%%%Jj%j%Jj%%%J%%%%%%%J%j%%
763A17%%J%%j%%J%%%%%%jJ%%J%%%jj%j%%%%%%J%JJJ%jj%%%%%jj%%JJ%j%%JJ%%%Jjj%%J%%%
756A19j%%%J%Jj%%j%J%%%%j%%k%%J%%J%j%%%%j%%%%JJJ%%%%Jjjj%jJJ%%%j%%%J%%J%%%%%j
$$ plain form
749 118 118 118 118 119 119 119 119 118 117 117 117 116 116 116 116 116 116 115 114 115 117 117 117 118 118 117 116 116 115 116 116 116 116 116 117 118 118 117 117 117 117 117 118 118 117 117 117 118 118 119 119 119 118 118 119 119 119 118 118 117 117 117 117 117 118 118 118 117 117 116
741 116 115 116 116 117 117 117 117 117 116 116 117 118 118 118 118 118 119 119 118 118 117 117 118 118 117 116 115 116 117 118 118 119 119 118 117 117 117 117 118 119 119 119 118 118 118 118 119 119 118 118 118 118 117 117 118 117 118 118 117 117 117 117 117 116 116 116 116 116 116 116
734 116 116 116 116 116 117 116 116 116 117 117 117 117 117 116 117 116 116 117 117 117 116 116 117 117 116 116 115 115 116 117 118 119 119 119 118 118 118 118 118 117 117 117 117 117 116 117 117 117 117 117 118 117 117 117 117 117 118 117 117 117 117 117 116 116 116 117 117 118 118 118
726 118 118 118 117 117 117 116 115 115 116 117 117 117 117 117 117 117 117 117 116 116 116 116 115 115 115 116 116 117 117 117 117 118 118 118 118 118 119 119 118 118 117 118 118 118 117 117 116 117 118 118 118 118 117 117 117 117 117 117 116 117 117 117 118 118 118 118 117 118 118 118
719 118 119 119 119 119 118 117 118 118 117 117 118 117 117 117 117 117 117 116 116 116 117 116 116 116 116 116 117 117 118 117 117 117 117 117 116 116 115 116 117 117 117 116 116 116 117 117 118 117 117 116 116 116 116 117 118 118 118 117 117 118 118 118 118 118 118 119 119 119 118 118
712 118 118 118 118 118 118 118 117 115 116 116 116 116 116 116 116 116 116 116 115 115 115 116 116 117 116 116 116 116 117 117 118 118 118 118 117 117 116 116 116 116 117 117 117 118 118 117 117 118 118 118 118 117 117 117 117 117 117 116 116 117 117 117 117 116 116 116 116 117 117 117
704 117 118 117 116 116 116 116 116 116 117 117 117 117 117 117 117 117 117 117 117 117 117 117 117 117 116 116 116 116 116 116 117 117 117 117 116 116 115 115 115 115 115 116 116 115 115 115 116 116 116 115 115 116 117 117 117 117 117 117 117 116 116 116 116 116 116 116 117 118 119 120
697 120 120 120 119 118 117 117 117 117 117 117 117 116 116 116 115 115 114 115 115 116 116 116 117 116 114 114 114 115 115 116 115 115 115 116 115 115 115 115 116 115 115 115 115 116 116 116 115 115 116 117 117 117 117 117 118 118 117 117 117 117 117 118 118 118 117 118 119 119 120 120
$$ packed form
749A18%%%J%%%jj%%j%%%%%jjJK%%J%jj%jJ%%%%JJ%j%%%%J%j%%J%J%%j%J%%j%j%%%%J%%j%j
741A16jJ%J%%%%j%JJ%%%%J%j%j%J%jjjJJJ%J%jj%%%JJ%%j%%%J%j%%%j%JjJ%j%%%%j%%%%%%
734A16%%%%Jj%%J%%%%jJj%J%%j%J%j%j%JJJJ%%j%%%%j%%%%jJ%%%%Jj%%%%Jj%%%%j%%J%J%%
726A18%%j%%jj%JJ%%%%%%%%j%%%j%%J%J%%%J%%%%J%j%jJ%%j%jJJ%%%j%%%%%jJ%%J%%%jJ%%
719A18J%%%jjJ%j%Jj%%%%%j%%Jj%%%%J%Jj%%%%j%jJJ%%j%%J%Jj%j%%%JJ%%j%J%%%%%J%%j%
712A18%%%%%%jkJ%%%%%%%%%j%%J%Jj%%%J%J%%%j%j%%%J%%J%j%J%%%j%%%%%j%J%%%j%%%J%%
704A17Jjj%%%%%J%%%%%%%%%%%%%%%j%%%%%J%%%j%j%%%%J%j%%J%%j%JJ%%%%%%j%%%%%%JJJJ
697A20%%jjj%%%%%%j%%j%jJ%J%%Jjk%%J%Jj%%Jj%%%Jj%%%J%%j%JJ%%%%J%j%%%%J%%jJJ%J%
$$ plain form
689 120 120 120 119 119 119 118 118 118 118 117 117 117 116 116 116 116 116 116 116 116 117 117 117 115 115 115 115 116 116 116 117 116 116 115 115 115 115 115 115 116 116 116 116 116 116 116 116 117 116 115 116 116 116 117 117 117 117 117 117 118 118 118 118 119 119 120 120 120 120 121
682 121 121 121 121 121 120 118 118 118 119 119 118 118 118 118 118 119 119 119 119 118 117 117 117 117 116 117 117 117 117 117 117 117 116 116 117 117 116 116 116 115 115 115 115 115 115 116 116 117 118 118 118 118 118 117 116 115 115 116 116 117 117 118 120 120 120 118 117 118 119 119
674 119 120 120 119 118 118 119 119 119 119 119 118 118 117 117 117 117 117 116 115 115 115 116 116 116 116 116 116 116 116 116 115 115 115 115 115 116 116 116 116 115 114 115 116 116 115 115 114 114 114 115 115 115 116 116 116 116 116 116 116 117 117 117 116 116 115 115 115 115 115 115
667 115 115 115 115 115 115 115 115 115 115 115 114 114 114 114 114 114 115 115 115 115 114 114 114 114 114 115 115 115 115 115 115 115 116 116 116 116 116 116 116 116 116 116 117 117 117 117 117 116 116 116 115 115 116 116 116 116 116 116 115 114 115 116 117 116 116 115 115 115 115 115
660 115 116 116 116 116 116 116 116 116 116 117 117 117 117 117 116 116 116 117 117 116 115 114 114 114 114 115 115 115 115 116 116 116 116 116 117 118 117 117 116 116 116 116 116 116 115 116 116 116 116 115 116 116 117 116 116 116 116 117 117 116 116 116 116 116 116 115 115 116 116 117
652 117 117 117 117 116 116 116 115 115 115 115 114 115 115 116 116 116 116 116 116 115 115 116 115 115 115 116 115 115 115 115 115 115 116 116 116 117 117 116 116 115 115 115 116 117 116 116 116 116 116 116 116 117 117 117 117 118 117 116 115 115 115 115 115 116 116 116 116 117 117 117
645 117 116 116 116 115 115 115 115 115 115 116 116 116 116 116 116 116 116 116 117 117 117 117 117 117 116 116 116 116 116 116 116 116 116 116 117 117 116 115 116 116 115 115 115 114 114 114 114 115 116 116 116 116 116 116 117 117 116 117 117 116 116 115 115 115 114 114 115 116 116 116
637 116 115 114 114 114 115 115 116 116 115 115 114 114 115 115 115 116 116 115 115 115 114 114 114 114 114 115 116 116 117 117 116 116 116 116 116 117 117 117 116 116 115 115 115 116 117 117 116 116 115 116 116 116 116 116 115 115 115 114 114 113 113 113 114 114 114 114 114 114 114 114
$$ packed form
689A20%%j%%j%%%j%%j%%%%%%%J%%k%%%J%%Jj%j%%%%%J%%%%%%%JjjJ%%J%%%%%J%%%J%J%%%J
682A21%%%%jk%%J%j%%%%J%%%jj%%%jJ%%%%%%j%J%j%%j%%%%%J%JJ%%%%jjj%J%J%JK%%kjJJ%
674A19J%jj%J%%%%j%j%%%%jj%%J%%%%%%%%j%%%%J%%%jjJJ%j%j%%J%%J%%%%%%J%%j%j%%%%%
667A15%%%%%%%%%%j%%%%%J%%%j%%%%J%%%%%%J%%%%%%%%%J%%%%j%%j%J%%%%%jjJJJj%j%%%%
660A15J%%%%%%%%J%%%%j%%J%jjj%%%J%%%J%%%%JJj%j%%%%%jJ%%%jJ%Jj%%%J%j%%%%%j%J%J
652A17%%%j%%j%%%jJ%J%%%%%j%Jj%%Jj%%%%%J%%J%j%j%%JJj%%%%%%J%%%Jjjj%%%%J%%%J%%
645A17j%%j%%%%%J%%%%%%%%J%%%%%j%%%%%%%%%J%jjJ%j%%j%%%JJ%%%%%J%jJ%j%j%%j%JJ%%
637A16jj%%J%J%j%j%J%%J%j%%j%%%%JJ%J%j%%%%J%%j%j%%JJ%j%jJ%%%%j%%j%j%%J%%%%%%%
$$ plain form
630 114 115 114 114 114 114 114 114 114 114 114 114 114 114 114 114 115 115 115 115 115 115 115 116 117 118 117 117 117 117 117 117 116 116 116 117 116 115 114 114 115 115 116 116 116 117 118 117 117 117 117 116 116 116 115 115 116 116 115 115 114 115 115 115 116 116 116 116 116 115 114
623 114 114 114 114 115 115 115 115 115 114 114 114 114 115 115 114 114 114 114 115 115 116 116 116 117 117 116 116 116 116 116 116 115 115 116 116 116 116 115 115 115 115 115 116 116 116 116 115 115 115 115 115 114 114 114 115 115 115 115 114 115 115 115 115 115 115 115 116 116 116 116
615 116 115 114 115 115 115 116 116 116 115 115 115 115 115 115 115 114 114 114 114 113 113 114 115 116 117 117 117 116 116 116 115 115 115 115 115 116 116 117 117 117 117 116 115 115 115 115 114 114 115 115 115 115 115 115 116 116 116 115 115 115 115 115 115 115 116 116 115 114 114 115
608 115 115 115 115 115 115 115 115 115 115 114 114 114 115 116 116 116 117 116 115 114 114 114 115 115 115 115 114 115 115 115 116 115 114 114 114 114 114 115 116 116 117 117 117 116 117 117 117 116 115 115 115 115 115 115 115 115 115 115 115 115 115 116 116 116 116 116 116 116 116 116
600 116 116 116 116 116 116 115 115 115 115 115 115 115 115 114 114 114 114 115 116 116 115 115 115 115 115 116 116 115 115 114 113 114 115 115 116 117 117 118 118 117 117 117 117 117 117 117 116 115 116 116 116 115 114 115 116 116 117 116 116 116 116 116 116 115 115 115 115 116 116 116
593 116 116 116 117 116 116 116 117 117 117 117 116 116 116 115 115 115 116 117 117 117 118 117 116 116 115 115 115 114 114 115 115 116 116 116 116 117 117 117 116 117 118 117 117 117 117 117 116 116 116 117 118 119 119 119 119 120 119 119 118 118 118 118 118 119 119 118 118 118 117 117
585 117 117 117 118 118 119 119 119 119 118 116 116 116 117 117 118 117 117 117 116 116 116 116 116 116 116 116 115 115 116 116 116 117 117 117 117 116 116 116 117 117 117 118 118 119 119 120 120 120 121 121 121 121 120 120 119 119 118 118 117 117 116 116 116 116 116 116 116 116 116 116
578 116 117 116 116 116 117 117 116 116 116 116 115 115 115 115 115 115 115 115 116 117 117 117 116 116 115 116 116 116 116 116 115 115 116 117 117 117 117 117 116 116 116 117 118 117 116 115 115 115 116 116 116 117 117 116 116 115 115 115 116 116 117 117 116 116 115 114 114 114 114 114
$$ packed form
630A14Jj%%%%%%%%%%%%%J%%%%%%JJJj%%%%%j%%Jjjj%J%J%%JJj%%%j%%j%J%j%jJ%%J%%%%jj
623A14%%%J%%%%j%%%J%j%%%J%J%%J%j%%%%%j%J%%%j%%%%J%%%j%%%%j%%J%%%jJ%%%%%%J%%%
615A16jjJ%%J%%j%%%%%%j%%%j%JJJJ%%j%%j%%%%J%J%%%jj%%%j%J%%%%%J%%j%%%%%%J%jj%J
608A15%%%%%%%%%j%%JJ%%Jjjj%%J%%%jJ%%Jjj%%%%JJ%J%%jJ%%jj%%%%%%%%%%%%J%%%%%%%%
600A16%%%%%j%%%%%%%j%%%JJ%j%%%%J%j%jjJJ%JJ%J%j%%%%%%jjJ%%jjJJ%Jj%%%%%j%%%J%%
593A16%%Jj%%J%%%j%%j%%JJ%%Jjj%j%%j%J%J%%%J%%jJJj%%%%j%%JJJ%%%Jj%j%%%%J%j%%j%
585A17%%J%J%%%jk%%J%Jj%%j%%%%%%%j%J%%J%%%j%%J%%J%J%J%%J%%%j%j%j%j%j%%%%%%%%%
578A16Jj%%J%j%%%j%%%%%%%JJ%%j%jJ%%%%j%JJ%%%%j%%JJjjj%%J%%J%j%j%%J%J%j%jj%%%%
$$ plain form
571 114 114 114 115 115 115 114 115 115 115 115 115 114 113 114 115 115 115 115 114 115 114 114 115 115 115 115 115 115 115 115 116 116 116 115 115 115 114 114 113 114 113 113 113 114 113 113 112 112 113 114 114 113 112 113 114 113 113 114 114 114 114 113 113 113 113 113 113 113 112 113
563 113 113 115 115 115 115 115 114 114 114 114 114 113 113 114 114 114 114 115 116 115 115 115 114 115 114 113 113 114 115 114 114 114 114 114 114 114 114 114 114 113 114 115 115 114 113 113 114 114 114 115 115 114 114 114 114 113 113 113 113 113 113 114 114 115 115 115 116 115 115 114
556 114 113 112 112 111 112 112 113 114 114 115 115 116 116 117 116 116 115 114 114 113 113 113 113 114 115 115 115 114 114 114 114 114 115 115 114 114 113 113 113 113 113 114 114 114 113 113 114 114 113 113 113 113 113 113 113 113 114 114 114 114 114 115 115 115 115 114 115 115 115 116
548 116 116 116 115 114 114 114 115 115 115 115 114 114 113 113 112 113 113 113 114 114 115 114 114 114 114 114 114 114 115 115 116 115 114 113 112 113 113 114 114 114 113 114 114 114 114 114 114 113 113 113 113 113 113 113 114 114 114 114 114 113 113 114 114 114 114 114 114 114 114 115
541 115 114 114 114 115 114 114 114 113 113 113 112 113 113 113 113 114 115 115 115 114 114 113 113 112 113 114 114 114 114 114 114 113 113 114 115 115 116 116 115 115 115 114 114 114 114 114 114 113 113 114 114 114 114 114 114 114 114 114 114 115 116 115 114 114 114 114 114 115 115 116
534 116 116 115 114 113 113 113 114 114 114 114 114 114 114 113 112 112 112 113 113 113 113 113 114 115 115 114 113 112 113 113 113 114 115 115 114 114 113 113 114 113 113 112 112 113 114 114 115 115 115 115 114 114 114 113 112 112 113 114 115 115 114 113 113 114 113 113 113 112 112 112
526 112 113 113 113 113 112 112 112 112 113 113 113 113 113 113 114 114 113 113 113 113 113 113 113 112 112 112 111 112 113 113 114 114 114 114 114 115 115 115 115 114 114 114 114 113 113 113 113 113 113 112 112 112 112 112 112 112 113 113 112 113 113 113 113 113 114 115 115 114 113 113
519 113 113 113 114 114 114 114 115 115 115 114 114 113 112 112 112 112 112 112 112 113 113 112 112 112 113 113 113 113 113 112 112 112 112 112 112 112 112 112 113 113 114 113 113 112 112 112 112 112 112 112 112 112 112 112 112 112 111 111 112 113 113 112 112 113 114 113 113 113 113 113
$$ packed form
571A14%%J%%jJ%%%%jjJJ%%%jJj%J%%%%%%%J%%j%%j%jJj%%Jj%j%JJ%jjJJj%J%%%j%%%%%%jJ
563A13%K%%%%j%%%%j%J%%%JJj%%jJjj%JJj%%%%%%%%%jJJ%jj%J%%J%j%%%j%%%%%J%J%%Jj%j
556A14jj%jJ%JJ%J%J%Jj%jj%j%%%JJ%%j%%%%J%j%j%%%%J%%j%J%j%%%%%%%J%%%%J%%%jJ%%J
548A16%%jj%%J%%%j%j%jJ%%J%Jj%%%%%%J%JjjjjJ%J%%jJ%%%%%j%%%%%%J%%%%j%J%%%%%%%J
541A15j%%Jj%%j%%jJ%%%JJ%%j%j%jJJ%%%%%j%JJ%J%j%%j%%%%%j%J%%%%%%%%%JJjj%%%%J%J
534A16%jjj%%J%%%%%%jj%%J%%%%JJ%jjjJ%%JJ%j%j%Jj%j%JJ%J%%%j%%jj%JJJ%jj%Jj%%j%%
526A12J%%%j%%%J%%%%%J%j%%%%%%j%%jJJ%J%%%%J%%%j%%%j%%%%%j%%%%%%J%jJ%%%%JJ%jj%
519A13%%J%%%J%%j%jj%%%%%%J%j%%J%%%%j%%%%%%%%J%Jj%j%%%%%%%%%%%%j%JJ%j%JJj%%%%
$$ plain form
511 113 113 112 112 112 112 112 112 112 113 113 114 114 115 115 115 114 113 113 114 113 113 113 113 113 114 114 113 113 113 113 113 113 113 113 112 112 112 112 112 112 112 112 112 112 113 114 114 113 112 113 113 113 114 113 113 113 112 112 112 112 113 113 113 113 114 114 114 114 113 113
504 113 112 112 112 112 112 112 112 112 112 112 112 112 113 113 113 112 112 112 113 113 113 113 114 113 112 112 112 113 113 112 112 112 113 112 113 113 114 114 114 114 114 115 115 115 115 114 114 113 112 113 113 113 114 113 113 113 114 114 113 113 113 112 111 111 112 112 112 112 112 113
496 113 113 113 113 113 113 114 114 114 112 112 112 113 113 112 112 112 113 113 113 113 113 113 113 113 113 114 114 113 112 113 113 113 112 112 112 112 113 114 114 114 113 113 113 114 114 114 114 114 114 115 114 113 113 113 112 112 112 112 112 113 113 113 113 113 112 112 113 113 113 113
489 113 114 114 113 112 112 112 112 112 111 112 113 113 113 113 114 114 114 114 113 113 113 113 113 114 114 114 113 113 114 114 113 113 113 113 112 113 113 113 113 113 112 112 112 112 112 112 113 113 113 112 112 112 112 112 112 113 114 114 114 114 114 115 114 114 113 112 112 113 113 112
482 112 112 113 113 113 113 113 113 114 113 112 112 113 114 113 113 112 112 112 113 113 112 113 114 114 113 113 113 114 114 114 114 114 114 114 114 114 114 114 114 114 113 113 113 113 113 114 114 114 114 114 113 112 112 112 112 112 112 112 113 112 112 112 112 113 114 113 113 113 113 113
474 113 111 111 111 111 112 113 113 113 112 112 112 113 112 112 112 111 111 112 113 113 113 112 112 112 112 112 112 112 113 113 113 113 113 113 112 111 111 111 112 112 113 113 113 114 114 114 114 114 114 114 113 113 113 113 112 113 114 114 114 114 114 113 112 112 113 113 113 113 113 114
467 114 114 113 114 115 115 114 114 114 114 114 114 114 115 114 114 113 114 114 113 112 111 111 111 112 112 113 112 112 112 112 112 112 112 112 112 113 112 112 112 112 112 112 112 113 112 112 113 113 113 113 113 113 112 111 112 113 113 112 112 111 111 111 112 112 112 112 112 112 113 113
459 113 113 113 113 113 113 113 113 113 113 113 112 112 112 112 112 112 112 113 113 113 112 112 112 112 112 112 112 112 112 112 113 112 112 112 112 113 113 114 114 113 113 113 113 113 113 113 113 113 113 114 114 114 114 114 113 113 113 113 112 112 111 110 110 110 111 111 112 112 112 112
$$ packed form
511A13%j%%%%%%J%J%J%%jj%Jj%%%%J%j%%%%%%%j%%%%%%%%%JJ%jjJ%%Jj%%j%%%J%%%J%%%j%
504A13j%%%%%%%%%%%J%%j%%J%%%Jjj%%J%j%%JjJ%J%%%%J%%%j%jjJ%%Jj%%J%j%%jj%J%%%%J
496A13%%%%%J%%k%%J%j%%J%%%%%%%%J%jjJ%%j%%%JJ%%j%%J%%%%%Jjj%%j%%%%J%%%%j%J%%%
489A13J%jj%%%%jJJ%%%J%%%j%%%%J%%j%J%j%%%jJ%%%%j%%%%%J%%j%%%%%JJ%%%%Jj%jj%J%j
482A12%J%%%%%Jjj%JJj%j%%J%jJJ%j%%J%%%%%%%%%%%%j%%%%J%%%%jj%%%%%%Jj%%%JJj%%%%
474A13k%%%JJ%%j%%Jj%%j%JJ%%j%%%%%%J%%%%%jj%%J%J%%J%%%%%%j%%%jJJ%%%%jj%J%%%%J
467A14%jJJ%j%%%%%%Jj%jJ%jjj%%J%Jj%%%%%%%%Jj%%%%%%Jj%J%%%%%jjJJ%j%j%%J%%%%%J%
459A13%%%%%%%%%%j%%%%%%J%%j%%%%%%%%%Jj%%%J%J%j%%%%%%%%%J%%%%j%%%j%jj%%J%J%%%
$$ plain form
452 112 112 112 112 112 112 112 112 113 113 114 114 114 114 114 114 113 113 113 112 112 113 112 111 111 111 112 112 113 113 113 114 114 114 114 114 113 114 114 114 114 113 113 112 112 112 111 111 112 112 113 114 113 113 113 113 113 113 114 113 113 113 113 112 112 112 112 112 113 113 112
444 112 112 112 113 113 113 112 113 114 114 114 113 113 113 113 112 113 113 112 111 111 111 110 110 110 111 112 111 111 112 112 112 113 113 113 114 113 112 111 110 111 112 113 113 112 111 111 111 111 111 111 112 112 112 111 112 112 111 111 112 113 113 113 114 114 114 113 113 113 112 112
437 112 113 114 113 113 113 113 113 113 113 113 113 112 112 112 112 112 113 113 112 112 112 112 112 111 111 110 110 112 113 114 114 113 112 112 111 112 112 111 111 111 110 110 110 111 111 112 113 112 112 111 111 111 111 111 111 112 113 113 112 112 112 113 112 112 112 111 111 111 111 111
430 111 111 111 111 111 111 110 111 111 111 111 111 112 112 111 111 111 112 113 114 114 113 112 111 110 110 110 111 112 113 113 112 113 114 114 114 112 111 111 111 112 112 113 112 112 112 112 111 111 110 110 110 109 109 109 110 111 111 111 111 111 111 112 111 111 112 112 112 112 112 112
422 112 112 112 112 112 112 112 112 112 113 113 113 113 113 112 112 112 111 111 111 111 111 111 111 111 111 111 111 111 111 112 112 112 111 111 111 111 111 111 111 110 111 112 111 111 110 110 111 111 112 111 111 110 110 110 111 111 111 111 111 111 112 111 111 112 112 111 111 111 111 112
415 112 112 112 111 112 112 113 113 114 114 114 114 114 113 113 113 113 112 112 111 112 112 112 113 113 113 113 112 112 112 111 112 112 112 112 112 112 113 114 114 113 112 112 112 113 113 113 113 113 113 112 113 113 112 113 113 113 113 113 113 112 112 113 113 113 114 113 113 113 113 113
407 113 112 112 112 111 112 112 112 112 112 112 112 112 112 110 111 111 111 112 112 112 112 112 112 112 112 112 111 111 111 112 113 114 113 113 112 112 113 113 113 113 113 113 112 112 112 112 112 111 111 111 111 112 113 113 112 112 113 113 114 114 114 113 112 111 112 112 112 112 113 113
400 113 113 113 113 112 112 112 113 113 113 112 112 112 111 111 111 111 110 111 111 111 112 111 112 113 113 112 112 113 112 111 111 111 112 113 113 113 112 111 111 111 111 111 111 111 111 112 112 112 112 112 112 112 112 113 113 113 112 112 113 113 113 113 112 112 112 112 112 112 112 111
$$ packed form
452A12%%%%%%%J%J%%%%%j%%j%Jjj%%J%J%%J%%%%jJ%%%j%j%%j%J%JJj%%%%%Jj%%%j%%%%J%j
444A12%%J%%jJJ%%j%%%jJ%jj%%j%%JJj%J%%J%%JjjjjJJJ%jj%%%%%J%%jJ%j%JJ%%J%%j%%j%
437A12JJj%%%%%%%%j%%%%J%j%%%%j%j%KJJ%jj%jJ%j%%j%%J%JJj%j%%%%%JJ%j%%Jj%%j%%%%
430A11%%%%%jJ%%%%J%j%%JJJ%jjjj%%JJJ%jJJ%%kj%%J%Jj%%%j%j%%j%%JJ%%%%%Jj%J%%%%%
422A12%%%%%%%%J%%%%j%%j%%%%%%%%%%%%J%%j%%%%%%jJJj%j%J%Jj%j%%J%%%%%Jj%J%j%%%J
415A12%%jJ%J%J%%%%j%%%j%jJ%%J%%%j%%jJ%%%%%JJ%jj%%J%%%%%jJ%jJ%%%%%j%J%%Jj%%%%
407A13j%%jJ%%%%%%%%kJ%%J%%%%%%%%j%%JJJj%j%J%%%%%j%%%%j%%%JJ%j%J%J%%jjjJ%%%J%
400A13%%%j%%J%%j%%j%%%jJ%%JjJJ%j%Jjj%%JJ%%jj%%%%%%%J%%%%%%%J%%j%J%%%j%%%%%%j
$$ plain form
393 111 110 110 111 111 111 111 111 112 112 113 113 113 112 112 111 111 112 112 112 112 111 112 112 111 110 110 110 110 110 110 111 112 112 111 111 110 109 110 110 110 111 110 110 110 110 111 111 111 111 111 111 112 112 112 112 112 112 111 111 111 112 113 113 112 112 112 111 111 110 110
385 110 111 112 111 111 112 112 112 113 113 113 113 112 112 112 112 112 112 112 112 112 112 111 111 111 110 111 111 112 112 112 112 112 112 112 112 112 112 112 112 112 111 111 110 110 111 112 111 110 110 111 112 112 113 114 114 113 112 110 110 110 110 111 111 111 111 112 112 111 110 110
378 110 111 111 111 111 112 112 112 112 112 111 111 111 111 111 112 112 112 112 112 113 113 112 112 112 111 111 111 111 111 111 112 112 112 112 112 112 111 112 112 113 113 113 112 111 111 111 110 110 110 110 111 110 110 111 111 111 111 111 111 111 111 112 112 112 113 113 113 113 112 112
370 112 111 112 112 112 112 112 113 113 113 113 112 112 111 111 111 112 112 112 112 113 114 113 111 111 112 112 112 112 112 112 111 111 111 111 111 111 112 111 110 110 111 111 111 112 112 112 112 112 111 111 110 111 111 111 112 113 112 111 111 111 112 112 112 112 113 113 113 113 113 113
363 113 113 111 110 110 111 112 112 111 111 111 112 110 109 109 108 109 109 110 110 111 112 112 112 112 111 110 110 110 110 110 110 110 110 110 111 111 111 111 111 111 110 111 111 111 111 111 110 110 110 111 111 111 111 111 112 112 112 113 113 112 111 112 112 112 113 112 112 112 111 110
355 110 110 110 111 111 111 111 112 111 111 111 111 111 111 111 111 111 112 111 111 112 112 113 113 112 112 112 112 112 112 112 111 111 110 111 111 111 111 111 112 112 112 112 111 111 111 111 111 110 110 110 110 111 111 111 111 111 111 111 111 111 111 111 110 111 111 111 111 112 112 112
348 112 112 112 112 112 111 110 110 110 110 110 110 111 111 111 110 110 110 111 111 111 112 111 110 111 111 111 111 111 111 111 111 112 112 112 112 112 112 112 112 112 112 112 113 112 112 111 110 111 111 110 109 109 109 111 112 111 111 111 111 111 111 112 112 112 112 112 111 111 111 112
341 112 113 112 111 110 110 110 110 110 111 111 112 112 112 112 111 111 110 111 111 110 111 112 112 113 113 112 111 110 110 110 111 110 110 110 111 112 112 112 111 110 110 110 110 110 111 111 111 110 109 109 110 111 112 112 111 111 111 111 111 111 112 112 113 113 112 111 111 111 111 110
$$ packed form
393A11j%J%%%%J%J%%j%j%J%%%jJ%jj%%%%%JJ%j%jjJ%%Jj%%%J%%%%%J%%%%%j%%JJ%j%%j%j%
385A10JJj%J%%J%%%j%%%%%%%%%j%%jJ%J%%%%%%%%%%%%j%j%JJjj%JJ%JJ%jjk%%%J%%%J%jj%
378A10J%%%J%%%%j%%%%J%%%%J%j%%j%%%%%J%%%%%jJ%J%%jj%%j%%%Jj%J%%%%%%%J%%J%%%j%
370A12jJ%%%%J%%%j%j%%J%%%JJjk%J%%%%%j%%%%%Jjj%J%%J%%%%j%jJ%%JJjj%%J%%%J%%%%%
363A13%kj%JJ%j%%Jkj%jJ%J%JJ%%%jj%%%%%%%%J%%%%%jJ%%%%j%%J%%%%J%%J%jjJ%%Jj%%jj
355A10%%J%%%Jj%%%%%%%%Jj%J%J%j%%%%%%j%jJ%%%%J%%%j%%%%j%%%J%%%%%%%%%%jJ%%%J%%
348A12%%%%jj%%%%%J%%j%%J%%JjjJ%%%%%%%J%%%%%%%%%%Jj%jjJ%jj%%KJj%%%%%J%%%%j%%J
341A12Jjjj%%%%J%J%%%j%jJ%jJJ%J%jjj%%Jj%%JJ%%jj%%%%J%%jj%JJJ%j%%%%%J%J%jj%%%j
$$ plain form
333 110 110 111 111 111 112 111 111 111 111 112 112 111 111 111 111 111 112 111 111 111 111 111 111 111 111 111 111 111 111 110 109 109 109 110 110 111 112 111 111 111 111 112 112 112 111 110 110 109 110 110 111 111 111 111 112 112 112 112 111 110 109 109 109 109 109 110 110 110 110 110
326 110 110 111 111 111 111 111 110 111 111 112 112 111 111 111 111 111 111 112 112 112 112 112 112 112 112 112 112 111 111 111 111 112 112 111 111 111 111 112 112 112 112 111 111 111 110 110 110 110 110 110 110 109 110 110 110 111 111 110 110 110 110 109 109 110 111 111 112 111 110 110
318 110 110 109 109 110 110 111 112 111 110 110 111 111 110 109 109 109 109 109 110 110 110 109 110 112 112 112 112 112 112 112 112 111 110 108 108 109 110 109 109 110 111 111 111 110 110 110 110 109 109 110 110 110 110 109 109 110 111 111 111 111 111 111 111 112 112 111 110 110 111 111
311 111 111 111 111 111 112 112 112 111 111 111 112 113 113 112 111 111 111 112 112 112 111 111 111 111 110 110 110 110 111 111 112 111 111 110 109 109 109 109 110 110 110 110 110 110 111 111 112 111 111 111 111 111 111 111 111 111 110 110 110 110 110 110 110 110 110 111 111 111 110 110
304 110 110 109 109 109 109 110 112 112 112 111 110 110 111 112 112 112 111 111 111 110 110 110 110 110 111 111 110 110 111 111 111 111 111 111 111 111 111 111 111 111 111 110 110 109 109 109 109 109 110 110 109 109 108 109 109 109 110 111 111 112 112 111 110 110 110 109 109 108 108 108
296 108 108 109 109 109 110 110 109 110 111 112 111 110 110 111 111 110 111 112 112 111 111 111 111 111 111 111 112 112 111 111 112 112 112 112 112 112 111 111 111 110 110 109 108 109 109 109 109 108 108 109 110 109 109 110 110 110 109 109 109 109 109 109 109 109 110 109 110 110 110 110
289 110 110 110 109 109 109 109 109 109 109 110 110 110 109 109 110 110 110 109 109 109 109 109 110 110 110 110 110 110 110 110 111 111 111 111 111 110 111 111 112 113 113 111 110 109 109 110 111 111 111 110 109 109 110 109 108 108 108 109 109 109 110 110 110 109 109 109 109 110 111 111
281 111 111 109 109 110 110 110 110 109 109 110 111 111 111 110 110 109 110 110 110 110 109 109 110 111 111 111 110 110 109 108 108 109 110 110 110 110 111 110 110 109 109 108 109 109 110 110 110 110 110 110 109 109 109 109 109 109 109 110 111 111 111 111 111 111 111 112 112 111 111 110
$$ packed form
333A10%J%%Jj%%%J%j%%%%Jj%%%%%%%%%%%jj%%J%JJj%%%J%%jj%jJ%J%%%J%%%jjj%%%%J%%%%
326A10%J%%%%jJ%J%j%%%%%J%%%%%%%%%j%%%J%j%%%J%%%j%%j%%%%%%jJ%%J%j%%%j%JJ%Jjj%
318A10%j%J%JJjj%J%jj%%%%J%%jJK%%%%%%%jjk%JJj%JJ%%j%%%j%J%%%j%JJ%%%%%%J%jj%J%
311A11%%%%J%%j%%JJ%jj%%J%%j%%%j%%%J%Jj%jj%%%J%%%%%J%Jj%%%%%%%%j%%%%%%%%J%%j%
304A10%j%%%JK%%jj%JJ%%j%%j%%%%J%j%J%%%%%%%%%%%%j%j%%%%J%j%jJ%%JJ%J%jj%%j%j%%
296A08%J%%J%jJJJjj%J%jJJ%j%%%%%%J%j%J%%%%%j%%j%jjJ%%%j%JJj%J%%j%%%%%%%JjJ%%%
289A10%%j%%%%%%J%%j%J%%j%%%%J%%%%%%%J%%%%jJ%JJ%kjj%JJ%%jj%Jjj%%J%%J%%j%%%JJ%
281A11%k%J%%%j%JJ%%j%jJ%%%j%JJ%%j%jj%JJ%%%Jj%j%jJ%J%%%%%j%%%%%%JJ%%%%%%J%j%j
$$ plain form
274 110 110 111 112 111 111 111 111 112 112 112 111 110 109 109 109 109 110 110 110 110 110 110 109 109 109 109 108 108 108 107 107 108 109 109 109 109 109 109 108 109 110 110 111 110 110 110 110 110 110 110 110 111 111 110 110 109 109 108 108 109 109 109 109 109 109 109 110 110 111 110
266 110 110 110 109 109 109 110 111 111 111 111 111 111 111 112 112 111 110 110 110 111 110 110 109 109 110 110 110 110 110 110 111 111 111 111 110 111 111 111 110 109 109 109 110 110 110 110 110 110 109 109 109 109 109 109 110 110 111 110 110 110 110 110 109 109 109 109 109 109 110 110
259 110 110 110 109 110 111 111 110 109 109 109 110 110 111 111 110 108 108 108 109 110 110 110 109 109 109 109 109 109 110 110 111 111 111 111 111 111 112 112 111 110 109 109 110 111 111 111 111 111 111 111 110 110 110 109 109 109 109 109 108 109 109 109 109 108 108 109 110 110 110 110
252 110 110 110 110 111 111 112 112 111 110 110 110 110 110 109 109 109 109 108 108 108 109 110 109 109 110 110 110 111 111 110 109 110 109 109 109 108 108 108 110 111 112 111 111 111 110 110 109 109 109 109 109 108 108 108 109 110 110 110 111 110 110 110 110 109 109 109 110 110 110 110
244 110 110 109 109 109 109 109 109 109 109 109 108 109 109 110 110 111 111 110 110 109 109 109 109 109 109 110 110 109 109 108 108 108 109 109 109 109 109 109 110 110 110 110 110 110 110 110 110 110 109 109 108 109 109 109 109 110 110 110 110 110 110 110 110 109 109 109 108 108 108 109
237 109 109 108 108 108 108 108 108 108 108 109 109 110 110 110 110 110 109 109 109 109 109 110 109 109 109 110 110 110 111 111 111 111 112 112 112 112 112 111 110 110 110 110 111 110 109 109 109 109 109 110 110 110 109 109 109 109 109 109 109 108 109 109 109 110 109 109 109 108 108 108
229 108 108 109 109 109 109 109 109 109 109 110 110 110 110 109 108 108 109 109 109 109 109 109 109 110 110 111 111 111 111 111 110 109 108 108 108 108 108 108 108 108 109 109 109 110 110 111 110 109 108 108 109 109 109 109 108 108 107 107 108 109 110 110 110 110 110 109 109 109 109 110
222 110 109 109 109 109 109 110 110 110 111 111 110 110 109 108 109 109 109 109 109 108 108 108 108 108 108 109 109 110 110 110 110 109 109 109 109 109 109 110 110 110 110 110 109 108 107 107 107 107 107 107 108 109 109 109 109 109 110 109 109 109 109 109 109 109 109 109 109 110 109 108
$$ packed form
274A10%JJj%%%J%%jjj%%%J%%%%%j%%%j%%j%JJ%%%%%jJJ%Jj%%%%%%%J%j%j%j%J%%%%%%J%Jj
266A10%%j%%JJ%%%%%%J%jj%%Jj%j%J%%%%%J%%%jJ%%jj%%J%%%%%j%%%%%J%Jj%%%%j%%%%%J%
259A10%%jJJ%jj%%J%J%jk%%JJ%%j%%%%%J%J%%%%%J%jjj%JJ%%%%%%j%%j%%%%jJ%%%j%JJ%%%
252A10%%%J%J%jj%%%%j%%%j%%JJj%J%%J%jjJj%%j%%KJJj%%j%j%%%%j%%JJ%%Jj%%%j%%J%%%
244A10%j%%%%%%%%jJ%J%J%j%j%%%%%J%j%j%%J%%%%%J%%%%%%%%%j%jJ%%%J%%%%%%%j%%j%%J
237A09%j%%%%%%%J%J%%%%j%%%%Jj%%J%%J%%%J%%%%jj%%%Jjj%%%%J%%j%%%%%%jJ%%Jj%%j%%
229A08%J%%%%%%%J%%%jj%J%%%%%%J%J%%%%jjj%%%%%%%J%%J%Jjjj%J%%%j%j%JJJ%%%%j%%%J
222A10j%%%%J%%J%j%jjJ%%%%j%%%%%J%J%%%j%%%%%J%%%%jjj%%%%%JJ%%%%Jj%%%%%%%%%Jjj
$$ plain form
215 108 108 109 108 108 108 108 108 109 109 109 109 109 109 109 109 109 109 109 109 108 109 110 110 109 109 109 109 109 109 109 110 109 109 109 109 108 108 108 108 109 109 109 110 110 109 108 108 108 108 108 108 108 109 109 109 110 109 108 109 109 109 110 110 110 110 109 109 109 109 109
207 109 110 110 109 109 109 109 108 108 108 107 108 109 110 110 110 110 110 109 108 108 108 108 108 108 108 108 109 109 109 109 109 109 109 109 109 109 109 109 109 109 110 110 109 109 109 109 108 108 108 108 108 108 109 108 108 108 108 108 108 109 109 110 110 110 109 109 109 109 109 108
200 108 107 107 107 107 107 107 107 108 108 108 108 108 109 109 109 109 109 108 108 108 108 108 108 109 109 109 110 109 109 109 109 110 110 110 111 111 111 110 111 111 111 110 109 109 109 110 110 109 109 109 109 109 110 110 109 108 108 108 108 109 109 109 110 110 109 109 108 108 109 110
192 110 110 111 110 110 110 111 112 112 112 111 110 109 108 108 109 109 109 109 109 110 111 111 111 111 111 111 110 109 108 108 107 107 108 109 110 111 111 111 111 111 111 111 110 110 109 108 108 108 109 109 109 108 109 108 108 108 107 108 108 109 110 110 111 110 110 110 109 109 107 106
185 106 106 107 108 108 107 107 107 108 108 109 109 109 108 108 107 108 108 108 109 110 110 109 108 108 108 109 110 109 109 109 109 109 109 110 110 109 109 108 107 108 108 108 108 108 109 110 111 110 110 109 108 108 109 109 109 110 110 110 110 110 110 110 110 110 110 110 109 109 108 109
177 109 110 110 110 110 109 109 109 109 109 109 108 108 108 109 110 110 111 110 110 110 110 109 109 109 109 108 108 108 108 109 109 110 109 108 108 108 108 108 109 109 109 109 109 109 108 108 108 109 109 110 110 109 109 109 108 109 109 109 108 109 109 108 108 108 107 107 107 107 108 109
$$ packed form
215A08%Jj%%%%J%%%%%%%%%%%jJJ%j%%%%%%Jj%%%j%%%J%%J%jj%%%%%%J%%JjjJ%%J%%%j%%%%
207A09J%j%%%j%%jJJJ%%%%jj%%%%%%%J%%%%%%%%%%%%%J%j%%%j%%%%%Jj%%%%%J%J%%j%%%%j
200A08j%%%%%%J%%%%J%%%%j%%%%%J%%Jj%%%J%%J%%jJ%%jj%%J%j%%%%J%jj%%%J%%J%j%j%JJ
192A10%Jj%%JJ%%jjjj%J%%%%JJ%%%%%jjj%j%JJJJ%%%%%%j%jj%%J%%jJj%%jJ%JJ%Jj%%j%kj
185A06%JJ%j%%J%J%%j%jJ%%JJ%jj%%JJj%%%%%J%j%jjJ%%%%JJJj%jj%J%%J%%%%%%%%%%j%jJ
177A09J%%%j%%%%%j%%JJ%Jj%%%j%%%j%%%J%Jjj%%%%J%%%%%j%%J%J%j%%jJ%%jJ%j%%j%%%JJ
$$ [...]
-2632A27
##END=		$$ NMR SPECTRUM
##END=		$$ LINK
