##TITLE=	RP310 char.10.fid
##JCAMP-DX=	6.0	$$ MestReNova 14.3.3-33362
##DATA TYPE=	LINK
##BLOCKS=	1    
##ORIGIN=	Mestrelab Research S.L.
##OWNER=	hrzepa
##$MNOVA/METADATA=	(DOCUMENT,BASE64)
eyJuYW1lIjoiL1VzZXJzL2hyemVwYS9MaWJyYXJ5L01vYmlsZSBEb2N1bWVudHMvY29tfmFwcGxlfkN
sb3VkRG9jcy9TaGVwcGFyZC9OTVIgZmlsZXMgemlwcy0yLzM0LzM0LUgubW5vdmEiLCJwYWdlcyI6W3
siaXRlbXMiOlsiMSIgICAgIF19XX0=
##TITLE=	RP310 char.10.fid
##JCAMP-DX=	6.0	$$ MestReNova 14.3.3-33362
##DATA TYPE=	NMR SPECTRUM
##DATA CLASS=	XYDATA
##BLOCK_ID=	1
##ORIGIN=	Bruker BioSpin GmbH
##OWNER=	nmrsu
##NUMDIM=	1
##$MNOVA/METADATA=	(ITEM,BASE64)
eyJhbmdsZSI6MCwiYXhlcyI6eyJ4Ijp7Im1heCI6MTYuMDY0MjU5OTk5OTM5MTI1LCJtaW4iOi0zLjc
2Njk0MjMzOTE1NjYyMjZ9LCJ5Ijp7Im1heCI6NDA4ODEuNzUzNjYyMTA5Mzc1LCJtaW4iOi0zNjUwLj
A0OTMzOTI5NDQzMzZ9fSwicG9pbnRzIjpbeyJ4Ijo1MzIxLCJ5Ijo1ODM1fSx7IngiOjg3MjIsInkiO
jU4MzV9LHsieCI6ODcyMiwieSI6ODIwOH0seyJ4Ijo1MzIxLCJ5Ijo4MjA4fSx7IngiOjUzMjEsInki
OjU4MzV9XSwieiI6MH0=
##.OBSERVE FREQUENCY=	700.35432466099996418
##.OBSERVE NUCLEUS=	^1H
##.SOLVENT NAME=	CDCl3
##.PULSE SEQUENCE=	zg30
##LONGDATE=	2023/03/10 02:32:49.000
##.ACQUISITIONMODE=	SIMULTANEOUS (DQD)
##$ORIGINAL FORMAT=	Bruker XWIN-NMR
##$MNOVA/SCALES_VERSION=	9
##$PARAMETER FILE=	(acqus, ASCII, /private/var/folders/f6/rjf_tdyn2v98c5c0wvkgn4s80000gq/T/2P+EAMFzTaO$jv1IcILmgw/10/acqus, 0)
$$ ##TITLE= Parameter file, TopSpin 4.1.3
$$ ##JCAMPDX= 5.0
$$ ##DATATYPE= Parameter Values
$$ ##NPOINTS= 1	$$ modification sequence number
$$ ##ORIGIN= Bruker BioSpin GmbH
$$ ##OWNER= nmrsu
$$ $$ 2023-03-10 02:32:44.179 +0000  nmrsu@CZC7167VR1
$$ $$ Z:/700/data/tds/nmr/RP310 char/10/acqus
$$ $$ process C:\Bruker\TopSpin4.1.3\prog\mod\dirdata.exe
$$ ##$ACQT0= -2.0981556054023
$$ ##$AMP= (0..31)
$$ 100 100 100 100 100 100 100 100 100 100 100 100 100 100 100 100 100 100
$$ 100 100 100 100 100 100 100 100 100 100 100 100 100 100
$$ ##$AMPCOIL= (0..32)
$$ -1 0 0 0 0 0 0 0 0 0 0 0 0 0 0 0 0 0 0 0 0 0 0 0 0 0 0 0 0 0 0 0 0
$$ ##$AQSEQ= 0
$$ ##$AQ_mod= 3
$$ ##$AUNM= <au_zg>
$$ ##$AUTOPOS= <5 >
$$ ##$BF1= 700.349999998
$$ ##$BF2= 700.349999998
$$ ##$BF3= 700.349999998
$$ ##$BF4= 700.349999998
$$ ##$BF5= 700.349999998
$$ ##$BF6= 700.349999998
$$ ##$BF7= 700.349999998
$$ ##$BF8= 700.349999998
$$ ##$BWFAC= (0..63)
$$ 0 0 0 0 0 0 0 0 0 0 0 0 0 0 0 0 0 0 0 0 0 0 0 0 0 0 0 0 0 0 0 0 0 0 0 0
$$ 0 0 0 0 0 0 0 0 0 0 0 0 0 0 0 0 0 0 0 0 0 0 0 0 0 0 0 0
$$ ##$BYTORDA= 0
$$ ##$CHANFCU= (0..24)
$$ 0 1 0 0 0 0 0 0 0 0 0 0 0 0 0 0 0 0 0 0 0 0 0 0 0
$$ ##$CHANREC= (0..24)
$$ 0 0 0 0 0 0 0 0 0 0 0 0 0 0 0 0 0 0 0 0 0 0 0 0 0
$$ ##$CHEMSTR= <none>
$$ ##$CNST= (0..63)
$$ 1 1 1 1 1 1 1 1 1 1 1 1 1 1 1 1 1 1 1 1 1 1 1 1 1 1 1 1 1 1 1 1 1 1 1 1
$$ 1 1 1 1 1 1 1 1 1 1 1 1 1 1 1 1 1 1 1 1 1 1 1 1 1 1 1 1
$$ ##$CPDPRG= (0..8)
$$ <> <> <> <> <> <> <> <> <>
$$ ##$D= (0..63)
$$ 0 1 0 0 0 0 0 0 0 0 0 0 0 0 0 0 0.0002 0 0 0 0 0 0 0 0 0 0 0 0 0 0 0 0
$$ 0 0 0 0 0 0 0 0 0 0 0 0 0 0 0 0 0 0 0 0 0 0 0 0 0 0 0 0 0 0 0
$$ ##$DATE= 1678415569
$$ ##$DATE_START= 1678415526
$$ ##$DE= 6.901845
$$ [...]
$$ ##$ShimPowRng3= (0..63)
$$ 1 1 1 1 1 1 1 1 1 1 1 1 1 1 1 1 1 1 1 1 1 1 1 1 1 1 1 1 1 1 1 1 1 1 1 1
$$ 1 1 1 1 0 0 0 0 0 0 0 0 0 0 0 0 0 0 0 0 0 0 0 0 0 0 0 0
$$ ##$ShimPowType1= 8
$$ ##$ShimPowType2= 8
$$ ##$ShimPowType3= 0
$$ ##$ShimPowType4= 0
$$ ##$ShimPowType5= 0
$$ ##$ShimPowType6= 0
$$ ##$ShimPowType7= 0
$$ ##$ShimPowType8= 0
$$ ##$ShimSysActGrad= (0..63)
$$ 1 2 3 4 13 5 7 11 10 9 6 8 12 18 19 20 21 15 22 23 24 14 25 16 26 17 27
$$ 28 31 32 33 34 35 36 37 38 0 0 0 0 0 0 0 0 0 0 0 0 0 0 0 0 0 0 0 0 0 0
$$ 0 0 0 0 0 0
$$ ##$ShimSysAngle= <>
$$ ##$ShimSysFunc= (0..63)
$$ 1 2 3 4 5 6 7 8 9 10 0 37 38 35 16 15 14 13 12 11 28 27 26 25 24 23 36
$$ 22 30 29 20 21 34 33 32 31 17 18 19 0 0 0 0 0 0 0 0 0 0 0 0 0 0 0 0 0 0
$$ 0 0 0 0 0 0 0
$$ ##$ShimSysMatId= <292722da.dat>
$$ ##$ShimSysMatrix= 1
$$ ##$ShimSysMinMaxUG= 130000
$$ ##$ShimSysOffset= <29 mm>
$$ ##$ShimSysType= 4
$$ ##$ShimUnit= 3
$$ ##$SpectrOsVersion= <4.1.156.20210628>
$$ ##$TCubeEth= <192.168.180.38>
$$ ##$TCubeSeqDevice= <>
$$ ##$TOSITY= <no>
$$ ##$TRIPLO2= 0
$$ ##$TopSpinVersion= <TopSpin 4.1.3>
$$ ##$TrxFreqFormula= (0..23)
$$ <TrxFreqFormula(2.0,700350000.000000,'TRX',Trx(1.0,'TRX 1200.1',1,5.000000,1290.000000))>
$$ <TrxFreqFormula(2.0,700350000.000000,'TRX',Trx(1.0,'TRX 1200.2',1,5.000000,1290.000000))>
$$ <TrxFreqFormula(2.0,700350000.000000,'TRX',Trx(1.0,'TRX 1200.3',1,5.000000,1290.000000))>
$$ <> <> <> <> <> <> <> <> <> <> <> <> <> <> <> <> <> <> <> <> <>
$$ ##$TrxPN= (0..23)
$$ <Z148391> <Z148391> <Z148391> <> <> <> <> <> <> <> <> <> <> <> <> <> <>
$$ <> <> <> <> <> <> <>
$$ ##$TrxSN= (0..23)
$$ <00336> <00337> <00342> <> <> <> <> <> <> <> <> <> <> <> <> <> <> <> <>
$$ <> <> <> <> <>
$$ ##$VCubeEth= (0..23)
$$ <no> <no> <no> <no> <no> <no> <no> <no> <no> <no> <no> <no> <no> <no> <no>
$$ <no> <no> <no> <no> <no> <no> <no> <no> <no>
$$ ##$VTU= 2
$$ ##$VTUETH= <192.168.99.11>
$$ ##$VTUTY= <no>
$$ ##$ValueLine= no
$$ ##$VpuPN= (0..23)
$$ <no> <no> <no> <no> <no> <no> <no> <no> <no> <no> <no> <no> <no> <no> <no>
$$ <no> <no> <no> <no> <no> <no> <no> <no> <no>
$$ ##$VpuSN= (0..23)
$$ <no> <no> <no> <no> <no> <no> <no> <no> <no> <no> <no> <no> <no> <no> <no>
$$ <no> <no> <no> <no> <no> <no> <no> <no> <no>
$$ ##$WBREFAM= (0..31)
$$ 99.8 100 100 100 100 100 100 100 100 100 100 100 100 100 100 100 100 100
$$ 100 100 100 100 100 100 100 100 100 100 100 100 100 100
$$ ##$WBREFLM= (0..31)
$$ 1 0 1 0 0 0 0 0 0 0 0 0 0 0 0 0 0 0 0 0 0 0 0 0 0 0 0 0 0 0 0 0
$$ ##$WBREFPH= (0..31)
$$ 0.05 0 0 0 0 0 0 0 0 0 0 0 0 0 0 0 0 0 0 0 0 0 0 0 0 0 0 0 0 0 0 0
$$ ##$WBSGU= (0..31)
$$ 1 2 4 0 0 0 0 0 0 0 0 0 0 0 0 0 0 0 0 0 0 0 0 0 0 0 0 0 0 0 0 0
$$ ##END=
$$ 
##$DECIM=	1440
##$DSPFVS=	21
##XUNITS=	HZ
##YUNITS=	ARBITRARY UNITS
##FIRSTX=	11250.604788156719223
##LASTX=	-2638.1781369192458442
##DELTAX=	-0.10596381293402784562
##XFACTOR=	1
##YFACTOR=	1.1342215968047120178
##FIRSTY=	139.410003662109375
##MINY=	66.08826446533203125
##MAXY=	37165.0390625
##NPOINTS=	131072
##XYDATA=	(X++(Y..Y))
$$ [...]
6520A91Jj%%j%%%%j%%J%JJj%%j%%j%J%%%%%j%%J%jJj%%%%J%%j%%%%%%j%%JJ%J%%j%jjjKJ%
6513A90%JJkjJ%%%%%%j%KKjj%j%j%J%%%%j%%%%J%j%%JJJ%%%%%%jj%%%%Jj%jj%%%%%%JJ%%j
6505A89%Jj%%Jj%J%%%%%%j%j%%J%J%%JJ%%jjjjj%KJ%%%jJ%J%J%jjj%%%%%%J%j%%%jJJ%%%%
6498A90jJ%%%%%j%%%%%jJ%%jJ%%JJj%J%J%j%J%%jJ%jj%j%%%%%%%J%jJJ%jJJ%%J%jj%%%%%%
6491A91%%%j%%%%J%%%%j%%%%JjjJJ%jj%J%%%%%%j%JJ%%%%j%%J%%%%%%%j%%%%%%%j%%J%%j%
6483A89%JJ%%jjj%J%%J%%%%%%jJ%%jjjJJ%JjjjJJ%%Jj%%%j%%%JJ%%%%j%%%%j%JJ%JJ%jjjj
6476A88JJ%jj%J%J%%jj%%%JJJj%%%%k%JJJj%%j%jJJ%%%%jjJ%J%Jjj%j%%J%%%j%%%J%Jj%j%
6469A88%%J%J%J%j%j%%JJJj%%%jJ%%%%%%jj%jJ%J%%%J%jj%j%%J%%JJJ%%jk%%%%%jJKjj%%%
$$ y = [191, 192, 191, 191, 191, 190, 190, 190, 190, 190, 189, 189, 189, 190, 190, 191, 192, 191, 191, 191, 190, 190, 190, 189, 189, 190, 190, 190, 190, 190, 190, 189, 189, 189, 190, 190, 189, 190, 189, 189, 189, 189, 189, 190, 190, 190, 189, 189, 189, 189, 189, 189, 189, 188, 188, 188, 189, 190, 190, 191, 191, 191, 190, 190, 189, 188, 187, 189, 190, 190, 190, 191, 192, 190, 189, 190, 190, 190, 190, 190, 190, 190, 189, 189, 191, 193, 192, 191, 191, 190, 190, 189, 189, 190, 190, 190, 190, 190, 189, 189, 189, 189, 189, 190, 190, 189, 189, 189, 190, 191, 192, 192, 192, 192, 192, 192, 192, 191, 190, 190, 190, 190, 190, 191, 190, 190, 189, 188, 188, 188, 188, 188, 188, 188, 189, 190, 190, 190, 189, 189, 190, 189, 189, 189, 190, 189, 189, 190, 190, 190, 190, 190, 190, 190, 189, 189, 188, 188, 188, 189, 189, 190, 190, 190, 191, 192, 192, 192, 191, 190, 189, 188, 187, 187, 189, 190, 190, 190, 190, 189, 190, 190, 191, 191, 192, 192, 191, 190, 189, 189, 189, 189, 189, 189, 189, 190, 190, 189, 189, 189, 189, 188, 189, 190, 190, 190, 190, 190, 189, 190, 190, 190, 190, 190, 190, 189, 189, 189, 189, 189, 189, 188, 189, 189, 189, 188, 189, 189, 189, 190, 191, 190, 190, 191, 191, 192, 192, 191, 191, 192, 192, 192, 191, 192, 192, 191, 190, 190, 189, 189, 189, 189, 189, 189, 189, 189, 190, 190, 189, 190, 191, 191, 190, 191, 192, 192, 192, 193, 193, 192, 191, 191, 191, 191, 191, 191, 191, 191, 191, 191, 190, 190, 190, 190, 190, 191, 191, 191, 191, 191, 190, 190, 190, 190, 190, 191, 190, 189, 190, 191, 191, 190, 189, 189, 190, 190, 190, 190, 190, 190, 190, 189, 189, 190, 191, 191, 191, 191, 191, 190, 190, 190, 191, 191, 191, 191, 191, 191, 191, 191, 190, 190, 190, 190, 190, 190, 190, 190, 189, 189, 189, 190, 190, 190, 189, 189, 189, 190, 191, 191, 191, 190, 189, 188, 188, 189, 189, 189, 190, 190, 190, 190, 190, 190, 190, 189, 190, 190, 190, 189, 188, 187, 188, 189, 189, 190, 189, 188, 187, 188, 189, 189, 189, 190, 189, 189, 189, 189, 188, 188, 188, 188, 189, 190, 190, 190, 190, 190, 189, 189, 189, 189, 189, 188, 188, 189, 190, 190, 191, 192, 192, 191, 190, 189, 188, 189, 190, 190, 189, 188, 188, 189, 189, 190, 190, 190, 189, 188, 188, 188, 188, 189, 190, 191, 190, 190, 190, 190, 190, 188, 188, 189, 190, 191, 190, 190, 190, 189, 189, 188, 189, 190, 190, 190, 190, 190, 189, 188, 189, 189, 190, 190, 191, 190, 189, 189, 188, 188, 188, 189, 189, 189, 189, 188, 188, 188, 188, 189, 189, 190, 189, 189, 188, 188, 188, 188, 189, 189, 190, 190, 191, 191, 190, 190, 189, 189, 189, 190, 191, 192, 191, 191, 191, 191, 190, 191, 191, 191, 191, 191, 191, 191, 190, 189, 189, 188, 189, 189, 190, 190, 190, 190, 191, 191, 190, 189, 189, 188, 188, 188, 189, 189, 189, 190, 191, 192, 192, 192, 191, 189, 189, 189, 189, 189, 189, 188, 189, 191, 190, 189, 189, 189, 189]
6461A89J%%%%J%%j%%J%j%j%%%JJ%%jjJJ%%%%%%%%%j%%%%%%%jj%%J%%J%%%%%j%%%%%JJJ%%%
6454A92j%j%%%j%jjJJj%%%JJ%%%%j%%%%%%%%J%JJJjj%%j%J%jjjj%J%J%j%%j%JJj%%J%%%%%
6447A89%%J%J%%jJ%Jjj%%%%J%JJ%%%%%jj%j%%%jJJj%%%%%%%%%jJ%%%jj%%%%J%J%%j%j%J%%
6439A89%JjjJJ%%kjKJ%Jj%jjj%%%J%J%J%%J%%%jj%%K%%jjJ%%jJjjJ%J%%JJ%j%%%%%%%%j%%
6432A90%%%jjj%%J%JJj%J%jjJ%%%%J%%JKKjjkk%%J%J%%jjjJJ%J%%%jjj%%J%%J%Jj%JJjj%j
6425A89j%%%J%%J%%%J%%%j%%j%%%%%%J%Jjj%%%%%J%J%%%%%%%%%%%j%%J%J%jjj%%%%j%J%%J
6417A90%%j%jJ%%jJ%JK%%%%j%j%%j%%%%J%%%%%j%j%J%J%%jj%J%%%%%%%%%%%%jJ%%J%jjjJ%
6410A88%JJ%J%J%jj%j%%j%%%J%%%%%j%%%%%J%%%J%%%j%%%%%%j%%J%%JJjj%j%J%J%%%%%%%j
$$ y = [189, 190, 190, 190, 190, 190, 191, 191, 191, 190, 190, 190, 191, 191, 190, 190, 189, 189, 189, 189, 190, 191, 191, 191, 190, 189, 190, 191, 191, 191, 191, 191, 191, 191, 191, 191, 191, 190, 190, 190, 190, 190, 190, 190, 190, 189, 188, 188, 188, 189, 189, 189, 190, 190, 190, 190, 190, 190, 189, 189, 189, 189, 189, 189, 190, 191, 192, 192, 192, 192, 191, 191, 190, 190, 190, 190, 189, 189, 188, 187, 188, 189, 188, 188, 188, 188, 189, 190, 190, 190, 190, 190, 189, 189, 189, 189, 189, 189, 189, 189, 189, 190, 190, 191, 192, 193, 192, 191, 191, 191, 190, 190, 191, 191, 190, 189, 188, 187, 187, 188, 188, 189, 189, 188, 188, 188, 187, 187, 188, 189, 188, 188, 188, 189, 189, 189, 189, 189, 189, 189, 189, 190, 190, 191, 191, 191, 190, 191, 191, 192, 191, 190, 190, 190, 190, 190, 191, 191, 192, 193, 193, 193, 193, 193, 193, 192, 191, 191, 190, 190, 190, 190, 189, 190, 191, 190, 190, 190, 190, 190, 190, 190, 190, 190, 190, 189, 190, 190, 190, 190, 189, 188, 188, 188, 188, 188, 189, 189, 190, 190, 190, 189, 189, 188, 188, 189, 189, 189, 189, 190, 189, 188, 189, 190, 190, 190, 188, 187, 189, 190, 190, 191, 190, 190, 189, 188, 187, 187, 187, 187, 188, 188, 189, 189, 190, 190, 190, 191, 191, 191, 191, 190, 189, 189, 189, 191, 191, 191, 190, 189, 190, 190, 190, 189, 190, 189, 188, 189, 189, 190, 190, 190, 191, 192, 192, 191, 191, 191, 191, 191, 191, 191, 191, 191, 190, 190, 190, 190, 190, 190, 189, 188, 187, 187, 187, 188, 188, 189, 190, 189, 189, 190, 190, 189, 188, 189, 189, 189, 189, 189, 190, 190, 190, 191, 193, 195, 194, 193, 191, 189, 189, 189, 190, 190, 191, 191, 191, 190, 189, 188, 189, 190, 190, 191, 191, 191, 191, 190, 189, 188, 188, 188, 189, 189, 189, 190, 190, 191, 190, 190, 191, 192, 191, 190, 190, 189, 188, 188, 188, 188, 189, 189, 189, 190, 190, 190, 190, 191, 191, 191, 191, 190, 190, 190, 189, 189, 189, 189, 189, 189, 189, 190, 190, 191, 190, 189, 189, 189, 189, 189, 189, 190, 190, 191, 191, 191, 191, 191, 191, 191, 191, 191, 191, 191, 191, 190, 190, 190, 191, 191, 192, 192, 191, 190, 189, 189, 189, 189, 189, 188, 188, 189, 189, 189, 190, 190, 190, 189, 189, 188, 189, 189, 189, 188, 189, 189, 190, 192, 192, 192, 192, 192, 191, 191, 190, 190, 190, 189, 189, 189, 189, 189, 190, 190, 190, 190, 190, 190, 189, 189, 188, 188, 189, 189, 190, 190, 190, 189, 188, 188, 189, 189, 189, 189, 189, 189, 189, 189, 189, 189, 189, 189, 189, 188, 189, 189, 189, 190, 190, 189, 188, 187, 188, 188, 188, 189, 190, 190, 191, 191, 192, 192, 191, 190, 190, 189, 189, 189, 188, 188, 188, 188, 189, 189, 189, 189, 189, 189, 188, 188, 188, 188, 188, 188, 189, 189, 189, 189, 190, 190, 190, 190, 189, 189, 189, 189, 189, 189, 189, 188, 188, 188, 189, 189, 189, 190, 191, 190, 189, 189, 188, 188, 189, 189, 190, 190, 190, 190, 190, 190, 190, 190, 189]
6403A89j%J%%J%jjJ%%%%%jJ%%jJ%%%j%%%%%%J%%%%J%%%j%%%%%%%%%%%%%%%%%%%%Jj%%j%%%
6396A88%%%%J%%%%%%%%J%j%jj%%JJKJ%jk%jJJ%%%jJ%%%j%%jJJjj%%J%JJj%%%J%%%%%%Jjjj
6388A89j%j%%JJJJ%%J%%%%j%jj%%%%%j%J%J%jjJ%%J%JJ%jjjjJJ%%jj%J%%j%%JJ%%j%%J%J%
6381A91j%jJ%J%%%j%%%%kJ%%%%%%%jJ%J%%j%%%J%%j%j%J%J%%%J%%%%j%%j%%j%%%%J%%%%%%
6374A89%%%j%JJ%j%%%%%j%JJJ%j%jjjJ%%J%jJ%J%Jjjj%jJJJ%j%j%j%%%%%%%J%%jJ%%JJJ%%
6366A91jj%%%%%jKJJjjj%JJ%%j%j%%%J%jjj%%J%%%%%%%%%%%%%%%j%J%J%%j%%j%%%%J%J%%J
6359A90%jjjj%J%J%%J%%j%%%%%Jj%%%%%j%J%%J%J%jj%J%J%%j%jJ%%j%J%%%%%%%j%%%%J%jJ
6352A89%JJ%%j%%j%%%J%jjj%%JJJ%%%%j%%%Jj%JJ%j%%%j%%jJJ%Jj%%j%%j%%%J%%%%j%%%%%
$$ y = [189, 188, 188, 189, 189, 189, 190, 190, 189, 188, 189, 189, 189, 189, 189, 189, 188, 189, 189, 189, 188, 189, 189, 189, 189, 188, 188, 188, 188, 188, 188, 188, 189, 189, 189, 189, 189, 190, 190, 190, 190, 189, 189, 189, 189, 189, 189, 189, 189, 189, 189, 189, 189, 189, 189, 189, 189, 189, 189, 189, 189, 189, 190, 189, 189, 189, 188, 188, 188, 188, 188, 188, 188, 188, 189, 189, 189, 189, 189, 189, 189, 189, 189, 190, 190, 189, 189, 188, 187, 187, 187, 188, 189, 191, 192, 192, 191, 189, 189, 188, 189, 190, 190, 190, 190, 189, 190, 190, 190, 190, 189, 189, 189, 188, 189, 190, 189, 188, 188, 188, 189, 189, 190, 191, 190, 190, 190, 190, 191, 191, 191, 191, 191, 191, 191, 192, 191, 190, 189, 188, 188, 187, 187, 187, 188, 189, 190, 191, 191, 191, 192, 192, 192, 192, 192, 191, 191, 190, 189, 189, 189, 189, 189, 189, 188, 188, 189, 189, 190, 190, 189, 188, 189, 189, 189, 190, 190, 191, 192, 192, 191, 190, 189, 188, 189, 190, 190, 190, 189, 188, 188, 189, 189, 189, 188, 188, 188, 189, 190, 190, 190, 189, 189, 189, 190, 190, 191, 191, 190, 190, 189, 190, 190, 191, 191, 191, 191, 190, 190, 190, 190, 190, 188, 189, 189, 189, 189, 189, 189, 189, 189, 188, 189, 189, 190, 190, 190, 189, 189, 189, 189, 190, 190, 190, 189, 189, 188, 188, 189, 189, 190, 190, 190, 190, 191, 191, 191, 191, 191, 190, 190, 190, 189, 189, 189, 188, 188, 188, 188, 188, 189, 189, 189, 189, 189, 189, 189, 189, 189, 189, 188, 188, 189, 190, 190, 189, 189, 189, 189, 189, 189, 188, 188, 189, 190, 191, 191, 190, 190, 189, 188, 187, 188, 188, 188, 189, 189, 188, 189, 189, 190, 190, 191, 190, 189, 188, 188, 187, 188, 189, 190, 190, 189, 189, 188, 188, 187, 187, 187, 187, 187, 187, 187, 187, 188, 188, 188, 187, 188, 188, 188, 189, 190, 191, 191, 191, 190, 189, 189, 189, 189, 189, 189, 188, 190, 191, 192, 191, 190, 189, 189, 190, 191, 191, 191, 190, 190, 189, 189, 189, 189, 190, 190, 189, 188, 187, 187, 187, 188, 188, 188, 188, 188, 188, 188, 188, 188, 188, 188, 188, 188, 188, 188, 188, 187, 187, 188, 188, 189, 189, 189, 188, 188, 188, 187, 187, 187, 187, 187, 188, 188, 189, 189, 189, 190, 190, 189, 188, 187, 186, 186, 187, 187, 188, 188, 188, 189, 189, 189, 188, 188, 188, 188, 188, 188, 189, 188, 188, 188, 188, 188, 188, 187, 187, 188, 188, 188, 189, 189, 190, 190, 189, 188, 188, 189, 189, 190, 190, 190, 189, 189, 188, 189, 189, 189, 188, 188, 189, 189, 189, 189, 189, 189, 189, 189, 188, 188, 188, 188, 188, 189, 189, 188, 189, 189, 190, 191, 191, 191, 190, 190, 190, 189, 189, 189, 189, 190, 190, 189, 188, 187, 187, 187, 188, 189, 190, 190, 190, 190, 190, 189, 189, 189, 189, 190, 189, 189, 190, 191, 191, 190, 190, 190, 190, 189, 189, 189, 188, 189, 190, 190, 191, 190, 190, 190, 189, 189, 189, 188, 188, 188, 188, 189, 189, 189, 189, 189, 188, 188, 188, 188, 188, 188]
6344A88%%J%jj%J%%J%%%%J%%%%J%jkjJJJJ%%%%j%%j%j%%%jJJ%Jj%%j%J%%%%JJj%%%%jj%Jj
6337A88J%%j%j%J%Jj%%JJJj%%%%%j%%%%%%%%%%%%J%%%%%%JJjj%%j%%J%%J%jj%%JJ%%j%%j%
6330A89%%%%j%%%JJjj%%%%jKJjj%J%%KJjj%kj%%Jjj%%JKJjjJ%%%%J%%%%%%%%%j%%jJJjj%j
6322A87%JJ%%%Jj%%%%jJj%%%%%%%%%j%JJJ%%%%%j%JJ%jjjJ%%j%%%%%%%J%%j%jjJ%J%JJ%Jj
6315A90%jjJ%JJj%%%j%%jJ%J%j%jjJ%%J%%J%%%%jJ%%%%j%j%%%%J%%%%j%%JJjjj%J%JJ%%%%
6308A90JJj%%jjJ%j%%%jJ%%%%%%JjjJ%%J%%%j%%%J%%j%j%%%%%%%jjJ%%%%J%%JJJ%%jj%%%%
6301A89%%%j%%%J%JJ%jj%%jjJ%jJ%J%%J%%%%%%%%jj%%JJ%%kj%%JJ%%%%JJ%j%jj%Jj%%%j%j
6293A86%J%%%J%%%J%J%jj%JjjJ%%%%%%KJkk%JJ%%%%%jk%K%J%%%%%%%jjj%%%%J%JJ%J%J%%%
$$ y = [188, 188, 188, 189, 189, 188, 187, 187, 188, 188, 188, 189, 189, 189, 189, 189, 190, 190, 190, 190, 190, 191, 191, 190, 188, 187, 188, 189, 190, 191, 191, 191, 191, 191, 190, 190, 190, 189, 189, 188, 188, 188, 188, 187, 188, 189, 189, 190, 189, 189, 189, 188, 188, 189, 189, 189, 189, 189, 190, 191, 190, 190, 190, 190, 190, 189, 188, 188, 189, 188, 189, 189, 189, 188, 188, 187, 187, 188, 188, 189, 188, 188, 188, 189, 190, 191, 190, 190, 190, 190, 190, 190, 189, 189, 189, 189, 189, 189, 189, 189, 189, 189, 189, 189, 189, 190, 190, 190, 190, 190, 190, 190, 191, 192, 191, 190, 190, 190, 189, 189, 189, 190, 190, 190, 191, 191, 190, 189, 189, 189, 190, 191, 191, 191, 190, 190, 190, 189, 189, 189, 189, 189, 189, 188, 188, 188, 188, 189, 190, 189, 188, 188, 188, 188, 188, 187, 189, 190, 189, 188, 188, 189, 189, 189, 191, 192, 191, 190, 190, 188, 187, 187, 187, 188, 187, 186, 186, 186, 187, 189, 190, 189, 188, 189, 189, 189, 189, 189, 190, 190, 190, 190, 190, 190, 190, 190, 190, 190, 189, 189, 189, 188, 189, 190, 189, 188, 188, 187, 187, 188, 189, 189, 189, 189, 190, 189, 189, 189, 189, 189, 188, 189, 188, 188, 188, 188, 188, 188, 188, 188, 188, 188, 187, 187, 188, 189, 190, 190, 190, 190, 190, 190, 189, 189, 190, 191, 191, 190, 189, 188, 189, 189, 189, 188, 188, 188, 188, 188, 188, 188, 188, 189, 189, 189, 188, 188, 187, 186, 187, 187, 188, 188, 189, 190, 190, 191, 190, 190, 189, 188, 189, 189, 190, 191, 190, 190, 190, 190, 189, 189, 189, 188, 189, 189, 190, 190, 189, 189, 188, 187, 188, 188, 188, 189, 189, 189, 190, 190, 190, 190, 190, 189, 190, 190, 190, 190, 190, 189, 189, 188, 188, 188, 188, 188, 189, 189, 189, 189, 189, 188, 188, 188, 189, 190, 189, 188, 187, 187, 188, 188, 189, 190, 190, 190, 190, 190, 191, 192, 191, 191, 191, 190, 189, 190, 190, 189, 189, 189, 189, 188, 189, 189, 189, 189, 189, 189, 189, 190, 189, 188, 189, 189, 189, 190, 190, 190, 190, 189, 189, 189, 189, 190, 190, 190, 189, 189, 188, 188, 188, 188, 188, 188, 188, 188, 187, 186, 187, 187, 187, 187, 187, 188, 188, 188, 189, 190, 191, 191, 191, 190, 189, 189, 189, 189, 189, 189, 189, 189, 188, 188, 188, 188, 189, 189, 190, 191, 191, 190, 189, 189, 189, 188, 187, 188, 188, 187, 188, 188, 189, 189, 189, 190, 190, 190, 190, 190, 190, 190, 190, 190, 189, 188, 188, 188, 189, 190, 190, 190, 188, 187, 187, 187, 188, 189, 189, 189, 189, 189, 190, 191, 191, 190, 190, 189, 188, 188, 189, 188, 188, 188, 188, 187, 187, 186, 186, 187, 187, 187, 187, 188, 188, 188, 188, 189, 189, 190, 190, 189, 188, 188, 189, 188, 187, 188, 188, 188, 188, 188, 188, 188, 190, 191, 189, 187, 187, 188, 189, 189, 189, 189, 189, 189, 188, 186, 186, 188, 188, 189, 189, 189, 189, 189, 189, 189, 189, 188, 187, 186, 186, 186, 186, 186, 187, 187, 188, 189, 189, 190, 190, 191, 191, 191, 191]
6286A91j%%J%j%kJJj%%Jjj%%%%%j%%%%%%%J%%%J%%%%%%%JJ%J%jj%J%%j%%%%%J%%jjjJJ%j%
6279A89%%J%JK%j%jj%Jjj%JJj%%%j%%%j%jj%%%J%%%J%%%%j%%%j%%%%JJJ%%%%jj%%%J%%%%%
6271A88%Jj%%%%%J%%J%jj%%%%%j%%%%J%%%%%%J%%J%%j%%%j%j%j%J%J%%%%j%%%J%J%J%%%jj
6264A88%%%%Jj%J%j%%J%%%%j%%%J%J%%%Jjj%j%j%J%j%JJJj%%%%Jj%%%j%j%%%jJJ%JJj%%j%
6257A88%%%j%JJ%j%%%Jkj%JJJ%j%j%JJj%J%Jj%%j%%%j%%J%JJjj%%%%%%%%%%JK%j%j%J%j%%
6249A89%%%%%j%%%%%%%%%j%%%J%%%%%Jj%%%%%%%%%Jj%JJ%j%jj%J%%%%%Jj%%%%%J%%j%%%%J
6242A89%%jJ%%%jj%jJJ%%%j%%%jJ%%%JK%jj%J%j%%J%j%%%%%J%%%%%%%Jj%%j%j%JJ%%%jj%J
6235A88%J%J%j%%%J%kjJJ%%%jj%%J%%J%%%j%%%J%JJJjkj%j%J%J%%%j%%%J%j%%%%%J%j%j%%
$$ y = [191, 190, 190, 190, 191, 191, 190, 190, 188, 189, 190, 189, 189, 189, 190, 189, 188, 188, 188, 188, 188, 188, 187, 187, 187, 187, 187, 187, 187, 187, 188, 188, 188, 188, 189, 189, 189, 189, 189, 189, 189, 189, 190, 191, 191, 192, 192, 191, 190, 190, 191, 191, 191, 190, 190, 190, 190, 190, 190, 191, 191, 191, 190, 189, 188, 189, 190, 190, 189, 189, 189, 189, 190, 190, 191, 193, 193, 192, 192, 191, 190, 190, 191, 190, 189, 189, 190, 191, 190, 190, 190, 190, 189, 189, 189, 189, 188, 188, 187, 186, 186, 186, 186, 187, 187, 187, 187, 188, 188, 188, 188, 188, 187, 187, 187, 187, 186, 186, 186, 186, 186, 187, 188, 189, 189, 189, 189, 189, 188, 187, 187, 187, 187, 188, 188, 188, 188, 188, 188, 188, 189, 188, 188, 188, 188, 188, 188, 189, 189, 189, 190, 190, 189, 188, 188, 188, 188, 188, 188, 187, 187, 187, 187, 187, 188, 188, 188, 188, 188, 188, 188, 189, 189, 189, 190, 190, 190, 189, 189, 189, 189, 188, 188, 187, 187, 186, 186, 187, 187, 188, 188, 188, 188, 188, 187, 187, 187, 187, 188, 188, 189, 189, 190, 190, 190, 190, 189, 188, 188, 188, 188, 188, 189, 188, 188, 189, 189, 188, 188, 188, 189, 189, 189, 189, 189, 188, 188, 188, 188, 189, 189, 190, 190, 190, 190, 191, 190, 189, 189, 188, 188, 187, 187, 188, 188, 187, 187, 188, 189, 190, 189, 189, 189, 189, 189, 190, 189, 189, 189, 189, 188, 188, 187, 187, 187, 187, 186, 187, 188, 188, 189, 190, 189, 189, 189, 188, 188, 188, 188, 188, 187, 187, 188, 189, 189, 188, 188, 188, 188, 189, 187, 186, 186, 187, 188, 189, 189, 188, 188, 187, 187, 188, 189, 188, 188, 189, 189, 190, 189, 189, 189, 188, 188, 188, 188, 187, 187, 187, 188, 188, 189, 190, 189, 188, 188, 188, 188, 188, 188, 188, 188, 188, 188, 188, 189, 191, 191, 190, 190, 189, 189, 190, 190, 189, 189, 189, 189, 189, 189, 189, 189, 188, 188, 188, 188, 188, 188, 188, 188, 188, 188, 187, 187, 187, 187, 188, 188, 188, 188, 188, 188, 189, 188, 188, 188, 188, 188, 188, 188, 188, 188, 188, 189, 188, 188, 189, 190, 190, 189, 189, 188, 187, 187, 188, 188, 188, 188, 188, 188, 189, 188, 188, 188, 188, 188, 188, 189, 189, 189, 188, 188, 188, 188, 188, 189, 189, 189, 188, 189, 189, 189, 189, 188, 187, 187, 186, 187, 188, 188, 188, 188, 187, 187, 187, 187, 186, 187, 187, 187, 187, 188, 190, 190, 189, 188, 188, 189, 189, 188, 188, 188, 189, 189, 188, 188, 188, 188, 188, 188, 189, 189, 189, 189, 189, 189, 189, 189, 190, 189, 189, 189, 188, 188, 187, 187, 188, 189, 189, 189, 189, 188, 187, 187, 188, 188, 189, 189, 190, 190, 189, 189, 189, 189, 190, 190, 188, 187, 188, 189, 189, 189, 189, 188, 187, 187, 187, 188, 188, 188, 189, 189, 189, 189, 188, 188, 188, 188, 189, 189, 190, 191, 192, 191, 189, 188, 188, 187, 187, 188, 188, 189, 189, 189, 189, 188, 188, 188, 188, 189, 189, 188, 188, 188, 188, 188, 188, 189, 189, 188, 188, 187, 187, 187]
6227A87JJ%jk%%%J%%%%Jj%JJ%%%%%%%%%j%%%jj%JJJj%%%%%jJJJ%%%Jj%jjJJ%Jj%%j%j%j%%
6220A87JJJ%%j%J%%JJ%jj%%j%%j%%%J%j%%%JKjj%jj%%%J%j%%J%J%J%j%%%%%j%J%%%%%%jj%
6213A87%JJJj%%%jJ%%Jj%%j%%%%%k%J%%%%%%%J%jjjJ%%J%J%Jj%%%%J%%JJ%%j%%%jjj%j%%J
6205A87K%%j%jJJJjjjJ%JJ%jk%J%%Jj%jjJJJjj%J%%%j%JJJ%k%%%J%%j%%%%%%%%J%J%%%%%%
6198A90%j%%J%%jj%%JJ%%j%%%%%%j%%%%j%%%%%J%%J%j%%%%JJJ%kj%%J%%Jkj%jJ%%%J%J%J%
6191A90%%%%%%J%kjj%%J%%JK%%jj%%%k%JK%J%%%%%jjj%%%JJ%j%%%%j%%%%J%Jj%%j%%%Jj%%
6184A88%%%j%j%j%%%J%JJJJ%%%%%%j%%j%%%J%%%%%j%J%%%%%%jJ%%%%j%%Jj%j%%j%%%JJJj%
6176A88%j%j%JJ%%Jj%Jjj%%%JJJ%%%%%%j%jj%%%%Jj%J%%%%%JjJ%j%%%%%%J%Jjj%jJ%%jJ%%
$$ y = [187, 188, 189, 189, 188, 186, 186, 186, 186, 187, 187, 187, 187, 187, 188, 187, 187, 188, 189, 189, 189, 189, 189, 189, 189, 189, 189, 189, 188, 188, 188, 188, 187, 186, 186, 187, 188, 189, 188, 188, 188, 188, 188, 188, 187, 188, 189, 190, 190, 190, 190, 191, 190, 190, 189, 188, 189, 190, 190, 191, 190, 190, 190, 189, 189, 188, 188, 187, 187, 187, 188, 189, 190, 190, 190, 189, 189, 190, 190, 190, 191, 192, 192, 191, 190, 190, 190, 189, 189, 189, 188, 188, 188, 188, 189, 189, 188, 188, 188, 188, 189, 191, 190, 189, 189, 188, 187, 187, 187, 187, 188, 188, 187, 187, 187, 188, 188, 189, 189, 190, 190, 189, 189, 189, 189, 189, 189, 188, 188, 189, 189, 189, 189, 189, 189, 189, 188, 187, 187, 187, 188, 189, 190, 189, 189, 189, 189, 188, 189, 189, 189, 190, 189, 189, 189, 188, 188, 188, 188, 188, 188, 186, 186, 187, 187, 187, 187, 187, 187, 187, 187, 188, 188, 187, 186, 185, 186, 186, 186, 187, 187, 188, 188, 189, 188, 188, 188, 188, 188, 189, 189, 189, 190, 191, 191, 191, 190, 190, 190, 190, 189, 188, 187, 187, 186, 186, 186, 187, 189, 189, 189, 188, 188, 187, 188, 189, 190, 189, 188, 187, 188, 188, 189, 190, 190, 189, 187, 187, 188, 188, 188, 189, 188, 188, 187, 186, 187, 188, 189, 188, 187, 187, 188, 188, 188, 188, 187, 187, 188, 189, 190, 190, 188, 188, 188, 188, 189, 189, 189, 188, 188, 188, 188, 188, 188, 188, 188, 188, 189, 189, 190, 190, 190, 190, 190, 190, 190, 190, 189, 189, 189, 190, 190, 190, 189, 188, 188, 188, 189, 190, 190, 190, 189, 189, 189, 189, 189, 189, 189, 188, 188, 188, 188, 188, 187, 187, 187, 187, 187, 187, 188, 188, 188, 189, 189, 188, 188, 188, 188, 188, 189, 190, 191, 191, 189, 188, 188, 188, 189, 189, 189, 190, 188, 187, 187, 186, 187, 187, 187, 187, 188, 188, 189, 189, 190, 190, 190, 190, 190, 190, 190, 190, 191, 191, 189, 188, 187, 187, 187, 188, 188, 188, 189, 191, 191, 191, 190, 189, 189, 189, 189, 187, 187, 188, 190, 190, 191, 191, 191, 191, 191, 191, 190, 189, 188, 188, 188, 188, 189, 190, 190, 189, 189, 189, 189, 189, 188, 188, 188, 188, 188, 189, 189, 190, 189, 189, 189, 188, 188, 188, 188, 189, 188, 188, 188, 188, 188, 188, 187, 187, 186, 186, 185, 185, 185, 185, 186, 186, 187, 188, 189, 190, 190, 190, 190, 190, 190, 190, 189, 189, 189, 188, 188, 188, 188, 189, 189, 189, 189, 189, 189, 188, 188, 189, 189, 189, 189, 189, 189, 189, 188, 189, 189, 189, 189, 189, 188, 188, 188, 189, 188, 188, 187, 187, 187, 186, 186, 186, 186, 187, 188, 189, 188, 188, 188, 187, 187, 186, 186, 187, 188, 188, 188, 189, 188, 188, 189, 188, 187, 187, 187, 187, 188, 189, 190, 190, 190, 190, 190, 190, 190, 189, 189, 188, 187, 187, 187, 187, 187, 188, 187, 187, 188, 188, 188, 188, 188, 188, 189, 188, 189, 189, 188, 188, 188, 188, 188, 188, 188, 189, 189, 190, 189, 188, 188, 187, 188, 188, 188, 187, 188, 188, 188]
6169A88J%%%%j%%%J%%%%j%%j%%%%J%%%%Jj%%J%%J%%%%J%jjJ%%%%j%j%%%%%%%%%%%%%%J%%%
6162A89%jJJj%%JjkJ%%%%%J%%%J%JjjkJ%%jJJJJ%%%%jjjj%J%J%%j%J%jJ%j%%%J%J%%%%%%j
6154A89%%jjJJJ%j%%j%%%JJ%Jjj%jJ%J%%%%jj%%J%J%%Jj%%j%%%%%%J%%%j%j%%%J%%%%%%j%
6147A88J%J%J%%J%%JJjj%%KKJKLMMLJJ%j%JKKJKj%jjJJ%%jllJJJJjklllljlkJ%J%JKLLLML
6140B18%jj%jKJJKK%j%j%J%kkjk%JJ%%lmllljkkjjj%jJ%%%%jj%%J%J%%%JJ%jj%j%j%%%%%%
6132A91%%%%%%%%%j%%%%%J%J%%%%jjJ%%%j%J%%%%%j%%j%%%%%%%%J%%kk%J%J%J%J%%j%%%J%
6125A90J%Jjj%%%JJ%KJ%jjjjj%%%%%%%%J%%%%%j%%%%%%%%Jkj%%J%%%%J%%J%jjjjJJ%JJ%JJ
6118A93j%%jJ%%Jkjjj%JJJ%%%j%J%%%%%j%%%%kJJJjj%J%%%%Jj%J%jJ%jjJJ%%%%%kj%JJJJ%
$$ y = [188, 189, 189, 189, 189, 189, 188, 188, 188, 188, 189, 189, 189, 189, 189, 188, 188, 188, 187, 187, 187, 187, 187, 188, 188, 188, 188, 188, 189, 188, 188, 188, 189, 189, 189, 190, 190, 190, 190, 190, 191, 191, 190, 189, 190, 190, 190, 190, 190, 189, 189, 188, 188, 188, 188, 188, 188, 188, 188, 188, 188, 188, 188, 188, 188, 188, 189, 189, 189, 189, 189, 188, 189, 190, 189, 189, 189, 190, 189, 187, 188, 188, 188, 188, 188, 188, 189, 189, 189, 189, 190, 190, 191, 190, 189, 187, 188, 188, 188, 187, 188, 189, 190, 191, 191, 191, 191, 191, 190, 189, 188, 187, 187, 188, 188, 189, 189, 189, 188, 188, 189, 189, 188, 189, 189, 188, 188, 188, 188, 189, 189, 190, 190, 190, 190, 190, 190, 190, 189, 189, 189, 188, 187, 188, 189, 190, 190, 189, 189, 189, 188, 188, 188, 188, 189, 190, 190, 191, 190, 189, 189, 188, 189, 189, 190, 190, 190, 190, 190, 189, 188, 188, 188, 189, 189, 190, 190, 190, 191, 190, 190, 190, 189, 189, 189, 189, 189, 189, 189, 190, 190, 190, 190, 189, 189, 188, 188, 188, 188, 189, 189, 189, 189, 189, 189, 189, 188, 188, 189, 189, 190, 190, 191, 191, 191, 192, 192, 192, 193, 194, 193, 192, 192, 192, 194, 196, 197, 199, 202, 206, 210, 213, 214, 215, 215, 214, 214, 215, 217, 219, 220, 222, 221, 221, 220, 219, 220, 221, 221, 221, 220, 217, 214, 215, 216, 217, 218, 217, 215, 212, 209, 206, 203, 202, 199, 197, 198, 198, 199, 199, 200, 202, 205, 208, 211, 215, 218, 218, 217, 216, 216, 215, 217, 218, 219, 221, 223, 223, 222, 222, 221, 221, 222, 222, 220, 218, 217, 215, 215, 216, 217, 217, 217, 214, 210, 207, 204, 201, 200, 198, 196, 195, 194, 193, 193, 192, 193, 193, 193, 193, 193, 192, 191, 191, 191, 192, 192, 193, 193, 193, 193, 194, 195, 195, 194, 193, 193, 192, 192, 191, 191, 191, 191, 191, 191, 191, 191, 191, 191, 191, 191, 191, 191, 191, 191, 190, 190, 190, 190, 190, 190, 191, 191, 192, 192, 192, 192, 192, 191, 190, 191, 191, 191, 191, 190, 190, 191, 191, 191, 191, 191, 191, 190, 190, 190, 189, 189, 189, 189, 189, 189, 189, 189, 189, 190, 190, 190, 188, 186, 186, 187, 187, 188, 188, 189, 189, 190, 190, 190, 189, 189, 189, 189, 190, 190, 191, 191, 192, 191, 190, 190, 190, 190, 191, 192, 192, 194, 195, 195, 194, 193, 192, 191, 190, 190, 190, 190, 190, 190, 190, 190, 190, 191, 191, 191, 191, 191, 191, 190, 190, 190, 190, 190, 190, 190, 190, 190, 191, 189, 188, 188, 188, 189, 189, 189, 189, 189, 190, 190, 190, 191, 191, 190, 189, 188, 187, 188, 189, 189, 190, 191, 191, 192, 193, 192, 192, 192, 191, 192, 192, 192, 193, 191, 190, 189, 188, 188, 189, 190, 191, 191, 191, 191, 190, 190, 191, 191, 191, 191, 191, 191, 190, 190, 190, 190, 190, 188, 189, 190, 191, 190, 189, 189, 190, 190, 190, 190, 190, 191, 190, 190, 191, 191, 190, 191, 191, 190, 189, 190, 191, 191, 191, 191, 191, 191, 189, 188, 188, 189, 190, 191, 192, 192]
6110A92jj%%%j%JJ%%jj%J%J%%%%J%jJJJ%%jjjjj%%%%J%J%Jj%%j%%j%%J%%J%%Jj%%j%jjjJJ
6103A89%%%JJ%kk%JJ%jj%J%%%%J%%J%%j%J%J%%j%J%%%j%j%jJ%JJ%jj%JJj%J%%%J%Jj%JJjj
6096A92%%%%JJJjj%%jj%%%%J%%%jJ%J%J%%%%%%%jj%%jJJjj%J%%%%%J%J%%%j%%%%%K%j%K%j
6088A95%%J%%%J%%Jjkj%%j%J%J%j%j%%%%%%%%J%%J%%%jJ%%J%%j%%j%JJKj%%%%j%%j%j%jj%
6081A92%%Jj%J%%%%%j%%%jj%j%%%%KK%%jjkj%JJ%%j%%j%JJj%j%jjJJKKJJ%%Jjj%Jjjj%%%J
6074A92JK%%k%%%KKKJJJ%%J%%Jkjjk%%JKKLKJjjj%KJ%Jkkj%jjllkl%%JKJKJJJJ%%kkj%JJj
6067A98jlk%JJKJKJJLLJK%%%J%j%%kjJJJK%%%jJJ%%j%KJLKLKKKJKMMQPJ0RQMNNONQQRRRRJ0
6059C69J0J0J0RJ0RRRRJ1J1J4J4J6J6J6J6J9K3K8L6M4N5O8Q4J06J38J80K38L15M13N28O38
$$ y = [192, 191, 190, 190, 190, 190, 189, 189, 190, 191, 191, 191, 190, 189, 189, 190, 190, 191, 191, 191, 191, 191, 192, 192, 191, 192, 193, 194, 194, 194, 193, 192, 191, 190, 189, 189, 189, 189, 189, 190, 190, 191, 191, 192, 191, 191, 191, 190, 190, 190, 189, 189, 189, 190, 190, 190, 191, 191, 191, 192, 191, 191, 191, 190, 190, 189, 188, 187, 188, 189, 189, 189, 189, 190, 191, 191, 189, 187, 187, 188, 189, 189, 188, 187, 187, 188, 188, 188, 188, 188, 189, 189, 189, 190, 190, 190, 189, 189, 190, 190, 191, 191, 191, 190, 190, 191, 191, 191, 191, 190, 190, 189, 189, 188, 189, 189, 190, 191, 191, 190, 189, 189, 190, 191, 190, 190, 191, 191, 191, 191, 192, 192, 193, 192, 192, 193, 194, 193, 192, 192, 192, 192, 192, 193, 194, 195, 194, 193, 193, 193, 192, 191, 191, 191, 191, 191, 192, 192, 192, 192, 191, 192, 192, 193, 193, 194, 194, 194, 194, 194, 194, 194, 194, 193, 192, 192, 192, 191, 192, 193, 192, 191, 191, 192, 192, 192, 192, 192, 192, 193, 193, 194, 194, 194, 194, 193, 193, 193, 193, 193, 193, 195, 195, 194, 194, 196, 196, 195, 195, 195, 196, 196, 196, 196, 197, 197, 197, 198, 197, 195, 194, 194, 194, 193, 193, 194, 194, 195, 195, 194, 194, 193, 193, 193, 193, 193, 193, 193, 193, 193, 194, 194, 194, 195, 195, 195, 195, 194, 195, 195, 195, 196, 196, 196, 195, 195, 195, 194, 194, 195, 196, 198, 197, 197, 197, 197, 197, 196, 196, 196, 195, 195, 194, 194, 193, 192, 192, 192, 192, 193, 192, 192, 193, 193, 193, 193, 193, 193, 192, 192, 192, 192, 191, 190, 190, 189, 189, 189, 189, 189, 191, 193, 193, 193, 192, 191, 189, 188, 188, 189, 190, 190, 190, 189, 189, 189, 188, 188, 189, 190, 189, 189, 188, 188, 187, 186, 187, 188, 190, 192, 193, 194, 194, 194, 195, 194, 193, 193, 194, 193, 192, 191, 191, 191, 191, 192, 193, 195, 195, 195, 193, 193, 193, 193, 195, 197, 199, 200, 201, 202, 202, 202, 203, 203, 203, 204, 202, 201, 200, 198, 198, 198, 199, 201, 203, 206, 208, 209, 208, 207, 206, 206, 208, 209, 209, 210, 208, 206, 205, 205, 204, 203, 200, 197, 195, 192, 192, 192, 193, 195, 196, 198, 199, 200, 201, 202, 202, 202, 200, 198, 197, 197, 198, 199, 198, 197, 194, 192, 192, 193, 194, 196, 197, 199, 200, 201, 204, 207, 208, 210, 210, 210, 210, 211, 211, 210, 210, 210, 208, 207, 208, 209, 210, 212, 212, 212, 212, 211, 212, 213, 213, 213, 212, 212, 214, 215, 218, 220, 223, 225, 227, 229, 230, 232, 236, 240, 248, 255, 265, 274, 282, 286, 291, 296, 302, 307, 315, 323, 332, 341, 350, 359, 369, 379, 389, 399, 408, 418, 427, 436, 445, 454, 465, 476, 490, 504, 520, 536, 552, 568, 587, 610, 638, 674, 718, 773, 841, 925, 1031, 1169, 1349, 1587, 1902, 2315, 2843, 3481]
6056C481P04O51M06M7k12k55j27Q9L09M55M44K21q3k44j92nJ91K73J31j79m29m67l26r9J27
6053D911K75K58J2l62o38p13o43n10l74k55j58p5nO2J31K14L14M32N59O65O90N41K05j39k94
6051E103k33l8K01M01M87L57M2k32k87j48O8K31K08l6l43m87m23k28RK04K78J44j97n55p35
6048C791p30o21m89l71k76k03j50j11q6o8n6m6l8l1k3j9j5j3j3j0roonnnopqonlklmmnlkk
6044C26klkmmmllllmopppnkkjkjllml%jjjjj%%%%%jmmljkjjj%%JJJK%%j%%J%%jjkjjjjkkk
6036B06j%JJJJJKJJlkmmkk%%kjk%%%KJj%jk%KKJKKjklk%%%%%%%JJJJKJKj%j%j%%JJ%%%jjj
6029A97%%%jjJ%KJ%J%%j%jk%%JK%%%jj%Jj%jjjj%JJKJjkk%j%%j%Jjj%%%%%%jj%%j%%j%%%j
6022A85j%J%%%JjjJJ%%JJ%J%%%j%%%J%j%%j%%%%%Jj%%%Jjkjj%%JJ%%%%%JJjj%%J%jjJJJ%k
$$ y = [3481, 4185, 4836, 5242, 5289, 5077, 4822, 4695, 4784, 5093, 5548, 5992, 6213, 6130, 5886, 5694, 5689, 5880, 6153, 6284, 6105, 5676, 5209, 4883, 4784, 4911, 5186, 5444, 5456, 5094, 4456, 3743, 3100, 2590, 2216, 1961, 1803, 1728, 1723, 1785, 1916, 2130, 2444, 2876, 3435, 4100, 4790, 5331, 5536, 5397, 5103, 4870, 4832, 5033, 5434, 5921, 6278, 6320, 6088, 5801, 5653, 5721, 5952, 6160, 6124, 5781, 5294, 4871, 4643, 4652, 4856, 5134, 5278, 5081, 4526, 3791, 3061, 2440, 1951, 1580, 1304, 1101, 951, 840, 754, 686, 630, 584, 546, 515, 492, 473, 458, 445, 432, 422, 413, 407, 401, 396, 391, 386, 380, 373, 365, 359, 354, 351, 349, 346, 342, 338, 333, 330, 328, 326, 324, 321, 319, 315, 311, 307, 304, 301, 298, 295, 291, 285, 278, 271, 264, 259, 257, 255, 254, 252, 251, 248, 245, 241, 238, 238, 237, 236, 235, 234, 233, 233, 233, 233, 233, 233, 232, 228, 224, 221, 220, 218, 217, 216, 215, 215, 215, 216, 217, 218, 220, 220, 220, 219, 219, 219, 220, 220, 220, 219, 218, 216, 215, 214, 213, 212, 210, 208, 206, 205, 205, 206, 207, 208, 209, 210, 212, 213, 214, 211, 209, 205, 201, 199, 197, 197, 197, 195, 194, 192, 192, 192, 192, 194, 195, 194, 194, 193, 191, 191, 193, 195, 196, 198, 200, 199, 197, 194, 192, 192, 192, 192, 192, 192, 192, 192, 193, 194, 195, 196, 198, 199, 201, 200, 200, 199, 199, 198, 198, 198, 199, 200, 200, 200, 200, 199, 198, 197, 197, 197, 197, 196, 195, 196, 196, 198, 199, 199, 200, 200, 200, 199, 199, 198, 196, 196, 196, 197, 199, 199, 199, 199, 198, 197, 197, 198, 197, 197, 196, 195, 194, 193, 193, 194, 195, 197, 198, 197, 195, 193, 193, 192, 192, 192, 191, 191, 192, 191, 190, 190, 190, 190, 190, 190, 190, 189, 188, 188, 188, 187, 187, 187, 186, 186, 186, 186, 185, 184, 184, 185, 185, 185, 185, 186, 185, 184, 185, 186, 186, 186, 187, 188, 188, 189, 189, 189, 189, 188, 188, 188, 188, 189, 189, 188, 188, 188, 187, 187, 187, 187, 187, 187, 188, 187, 187, 187, 187, 188, 187, 185, 184, 183, 183, 183, 184, 185, 185, 185, 185, 185, 185, 186, 187, 186, 185, 185, 185, 186, 186, 185, 184, 185, 186, 187, 187, 185]
6014A85%%Jj%%%%%j%%%%%J%%j%%%JJjjk%%KJJ%%JjJJj%%%%%Jj%jj%%%%J%%%%%%%J%JJ%%jj
6007A87%jJJ%jJK%%%%j%%jj%%%%%J%JJ%%j%%%j%j%%%%%jJK%%j%j%%%J%Jj%jj%jKJJJjj%%%
6000A88%jjJ%J%%J%%j%%%j%%jJJ%JJjj%j%%J%%%%JJj%%%jj%J%%%JJj%%%Jjj%%%%%%%J%J%j
5992A89j%%Jj%%j%%%%JJKJJJ%%KKLLLMLJKJJKLNNLKlmmmmjJjjknnlmljjkjjkJ%%J%j%%j%k
5985A86%KJJ%%jj%Jj%%J%J%%%%%%%%%%%%JJLLNNMMMK%%JKLNNKJlnnml%j%kkmnmmljkk%j%J
5978A91%%jjjjJ%%%%%%%%%j%JJ%J%jJJJJKK%jjj%%%J%%J%%JJ%j%j%J%%%j%j%%kkk%%K%j%J
5971A91KJJJJJJjjjj%JJ%%jJ%KJ%j%%j%%JJjjkjk%%%%jj%jJ%%%%%%J%%%%JKKKKKLLMKJ%kj
5963B13J%JKK%jj%%KK%kkk%%JJ%jkmlkkjjj%J%JJJLMLLKJjkk%JKMJ%jjJ%jjjjjkjJLJklll
$$ y = [185, 185, 185, 186, 185, 185, 185, 185, 185, 185, 184, 184, 184, 184, 184, 184, 185, 185, 185, 184, 184, 184, 184, 185, 186, 185, 184, 182, 182, 182, 184, 185, 186, 186, 186, 187, 186, 187, 188, 187, 187, 187, 187, 187, 187, 188, 187, 187, 186, 185, 185, 185, 185, 185, 186, 186, 186, 186, 186, 186, 186, 186, 187, 187, 188, 189, 189, 189, 188, 187, 187, 186, 187, 188, 188, 187, 188, 190, 190, 190, 190, 190, 189, 189, 189, 188, 187, 187, 187, 187, 187, 187, 188, 188, 189, 190, 190, 190, 189, 189, 189, 189, 188, 188, 187, 187, 187, 187, 187, 187, 186, 187, 189, 189, 189, 188, 188, 187, 187, 187, 187, 188, 188, 189, 188, 188, 187, 186, 186, 185, 187, 188, 189, 190, 189, 188, 188, 188, 188, 188, 187, 186, 187, 187, 188, 188, 188, 189, 189, 189, 188, 188, 188, 188, 187, 187, 187, 186, 187, 188, 188, 189, 190, 189, 188, 188, 187, 187, 187, 188, 188, 188, 188, 188, 189, 190, 189, 189, 189, 189, 188, 187, 187, 188, 188, 188, 188, 189, 190, 189, 189, 189, 189, 190, 189, 188, 188, 188, 188, 188, 188, 188, 188, 189, 189, 190, 190, 189, 188, 188, 188, 189, 188, 188, 188, 187, 187, 187, 187, 187, 188, 189, 191, 192, 193, 194, 194, 194, 196, 198, 201, 204, 207, 211, 214, 215, 217, 218, 219, 221, 224, 229, 234, 237, 239, 236, 232, 228, 224, 220, 219, 220, 219, 218, 216, 211, 206, 203, 199, 196, 195, 194, 192, 191, 190, 188, 189, 189, 189, 190, 190, 189, 189, 189, 188, 188, 186, 186, 188, 189, 190, 190, 190, 189, 188, 188, 189, 188, 188, 188, 189, 189, 190, 190, 190, 190, 190, 190, 190, 190, 190, 190, 190, 190, 190, 191, 192, 195, 198, 203, 208, 212, 216, 220, 222, 222, 222, 223, 225, 228, 233, 238, 240, 241, 238, 233, 228, 224, 221, 221, 220, 220, 218, 216, 212, 207, 203, 199, 196, 195, 193, 191, 191, 190, 190, 191, 191, 191, 190, 189, 188, 187, 188, 188, 188, 188, 188, 188, 188, 188, 188, 188, 187, 187, 188, 189, 189, 190, 190, 189, 190, 191, 192, 193, 195, 197, 197, 196, 195, 194, 194, 194, 194, 195, 195, 195, 196, 196, 196, 197, 198, 198, 197, 197, 196, 196, 197, 197, 197, 197, 196, 196, 195, 195, 195, 193, 191, 189, 189, 189, 191, 191, 190, 190, 191, 193, 194, 195, 196, 197, 198, 199, 198, 197, 196, 195, 195, 196, 197, 197, 197, 196, 197, 197, 199, 200, 200, 199, 199, 199, 198, 198, 198, 199, 200, 199, 198, 196, 195, 193, 193, 193, 193, 193, 192, 191, 191, 190, 191, 191, 191, 191, 191, 191, 191, 192, 192, 192, 192, 192, 193, 195, 197, 199, 201, 203, 206, 209, 213, 215, 216, 216, 214, 213, 214, 214, 215, 217, 219, 219, 218, 217, 217, 217, 219, 221, 221, 219, 217, 215, 215, 215, 216, 217, 217, 216, 214, 210, 207, 205, 203, 202, 201, 200, 200, 201, 201, 202, 203, 204, 207, 211, 214, 217, 219, 220, 219, 217, 215, 215, 216, 218, 222, 223, 223, 222, 221, 222, 222, 221, 220, 219, 218, 217, 215, 214, 215, 218, 219, 217, 214, 211, 208]
5956B08lkkkj%%%Jj%%JJJJJLLKLK%jkJJJJ%%jkjjJJLJJ%j%j%J%jjkklljj%%k%J%KLMKJKJ%
5949B18%j%JKJ%jjk%jJJ%JJjkjj%JJ%jllmkjlk%kjk%jj%%%%j%%jjjJK%J%J%%%%%%%%%%Jjj
5941A91%%Jj%%%%%jjjjJ%KKJ%j%%J%JJJjjj%%KJJ%JJ%%jj%j%%%j%j%j%%jJ%%J%%J%%%%%%%
5934A95%JkjjJK%J%%j%%%jjj%JJ%KJ%%j%%j%jj%%%KJjjjjj%J%%jkjJ%%%j%jjjjJJJ%%jj%J
5927A86J%%%jJ%j%JJJJ%j%JKKKLKJ%%%%%jJJJJ%%j%%%%JJ%J%JJJKJ%jjjj%jkkklk%%kjjj%
5919A92%jjjjjkjjJjjlklk%%J%%jjjJJLKMLLKMLKKJK%%JLKJKKJKJK%JKJKJKKLJ%JJJJJJJk
5912B40jkj%LJJ%%%%%%JKKLLLLKKKLNOQRJ1J0RQPQRJ2J5J7J9J6J5J5J8K1K5L0L6M5N3O6Q4
5907H44J11J47J97K66L56M73O05P28P87O97M59J74j8mK16N41Q61J037R15M51k03p80j051r74
$$ y = [208, 205, 203, 201, 199, 198, 198, 198, 198, 199, 198, 198, 198, 199, 200, 201, 202, 203, 206, 209, 211, 214, 216, 216, 215, 213, 214, 215, 216, 217, 217, 217, 216, 214, 213, 212, 213, 214, 217, 218, 219, 219, 218, 218, 217, 217, 218, 218, 217, 216, 214, 212, 209, 206, 205, 204, 204, 204, 202, 202, 203, 203, 205, 208, 212, 214, 215, 217, 218, 218, 218, 217, 217, 218, 220, 221, 221, 220, 219, 217, 217, 216, 217, 218, 218, 219, 220, 219, 217, 216, 215, 215, 216, 217, 217, 216, 213, 210, 206, 204, 203, 200, 198, 198, 196, 195, 193, 193, 192, 191, 191, 191, 191, 191, 190, 190, 190, 189, 188, 187, 188, 190, 190, 191, 191, 192, 192, 192, 192, 192, 192, 192, 192, 192, 192, 192, 193, 192, 191, 191, 191, 192, 191, 191, 191, 191, 191, 191, 190, 189, 188, 187, 188, 188, 190, 192, 193, 193, 192, 192, 192, 193, 193, 194, 195, 196, 195, 194, 193, 193, 193, 195, 196, 197, 197, 198, 199, 199, 199, 198, 197, 197, 196, 196, 196, 196, 195, 195, 194, 194, 193, 193, 193, 192, 193, 193, 193, 194, 194, 194, 195, 195, 195, 195, 195, 195, 195, 195, 195, 196, 194, 193, 192, 193, 195, 195, 196, 196, 196, 195, 195, 195, 195, 194, 193, 192, 192, 193, 194, 194, 196, 197, 197, 197, 196, 196, 196, 195, 195, 194, 193, 193, 193, 193, 195, 196, 195, 194, 193, 192, 191, 191, 192, 192, 192, 191, 189, 188, 189, 189, 189, 189, 188, 188, 187, 186, 185, 184, 185, 186, 187, 187, 187, 186, 185, 185, 186, 187, 187, 187, 187, 186, 187, 187, 186, 186, 187, 188, 189, 190, 190, 189, 189, 190, 192, 194, 196, 199, 201, 202, 202, 202, 202, 202, 202, 201, 202, 203, 204, 205, 205, 205, 204, 204, 204, 204, 204, 205, 206, 206, 207, 207, 208, 209, 210, 212, 213, 213, 212, 211, 210, 209, 209, 208, 206, 204, 202, 199, 197, 197, 197, 195, 194, 193, 192, 192, 192, 191, 190, 189, 188, 187, 185, 184, 183, 184, 183, 182, 179, 177, 174, 172, 172, 172, 173, 173, 173, 172, 171, 170, 171, 172, 175, 177, 181, 184, 187, 189, 193, 196, 198, 200, 201, 203, 203, 203, 204, 207, 209, 210, 212, 214, 215, 217, 218, 220, 220, 221, 223, 224, 226, 227, 229, 231, 234, 235, 235, 236, 237, 238, 239, 240, 241, 242, 240, 239, 237, 236, 236, 239, 240, 241, 241, 241, 241, 241, 241, 241, 242, 244, 246, 249, 252, 255, 258, 260, 262, 264, 267, 272, 278, 286, 295, 306, 316, 325, 333, 340, 348, 357, 369, 384, 401, 420, 436, 451, 466, 484, 505, 530, 560, 596, 641, 694, 760, 844, 955, 1102, 1299, 1565, 1921, 2394, 2999, 3727, 4514, 5211, 5670, 5844, 5826, 5822, 6038, 6579, 7440, 8477, 9392, 9843, 9640, 8860, 7809, 6835]
5904F835o75l20l2P9m5l30o32q12q11o95n45m06k95k12j53j10q3o4n1m2l4k6k1j5j2rrqnm
5901D58j%KLKJ%LNQJ2J5J4J3J3J1J3J6K3K9L7M7N8P3R3J24J66K24L06M12N42O83Q01Q14O51
5897E671L61P4n8M9L41P01J007J089Q07K02m94r94j123r22n66k02M6P2j38m65p50q65q08o67
5895B368n11l75k72j94j40j03p8o1m8m1l3k6k0j7j3j4j3j4j3j2j0qpppqpppnmnnoonnkjjk
5890B55jkkllkjJLKK%klmjJMNLJkopomj%KJ%lnnlkj%JJJJJjj%KJJKJJJJKKLLLJJ%j%%KKJj
5883B42kmlk%%J%kmmljJJKJjjjjkjj%jlllllllkjjj%%%%JKLLLLJ%jkkk%JJ%jljj%LMMMNLK
5876B18KKKKJ%jjj%kjj%%JJ%JJKJMLKLKJJKKNNLLJJKKMOOOLKLLOQRQRQQRJ0J2J2J3J1J0QN
5869D48PJ0J3J5J5J5J7J9K3K7L5M2N0O1P2Q6J07J35J73K23K90L75M71N60O13N80M19J64o9
$$ y = [6835, 6160, 5840, 5808, 5887, 5842, 5512, 4880, 4068, 3257, 2562, 2017, 1611, 1316, 1104, 951, 841, 758, 694, 643, 601, 567, 541, 520, 505, 493, 484, 475, 467, 462, 458, 457, 457, 459, 462, 464, 465, 465, 468, 473, 481, 493, 508, 522, 535, 548, 559, 572, 588, 611, 640, 677, 724, 782, 855, 948, 1072, 1238, 1462, 1768, 2180, 2722, 3405, 4206, 5020, 5671, 6032, 6106, 6048, 6097, 6438, 7139, 8146, 9235, 10042, 10244, 9750, 8756, 7633, 6711, 6145, 5943, 5989, 6061, 5923, 5458, 4708, 3843, 3035, 2368, 1857, 1482, 1210, 1016, 876, 773, 695, 634, 586, 545, 512, 486, 466, 449, 436, 422, 409, 395, 382, 370, 360, 352, 345, 338, 331, 323, 316, 309, 302, 297, 293, 288, 283, 277, 271, 266, 261, 259, 258, 257, 255, 254, 252, 250, 247, 244, 242, 241, 242, 245, 247, 249, 249, 247, 244, 240, 239, 240, 244, 249, 252, 253, 251, 245, 238, 232, 228, 227, 227, 229, 230, 230, 227, 222, 217, 214, 212, 211, 211, 212, 213, 214, 215, 216, 215, 214, 214, 216, 217, 218, 220, 221, 222, 223, 224, 226, 228, 231, 234, 237, 238, 239, 239, 238, 238, 238, 240, 242, 243, 242, 240, 236, 233, 231, 231, 231, 232, 232, 230, 226, 222, 219, 218, 219, 220, 222, 223, 222, 221, 220, 219, 217, 216, 215, 215, 214, 211, 208, 205, 202, 199, 196, 193, 191, 190, 189, 188, 188, 188, 188, 188, 189, 191, 194, 197, 200, 203, 204, 204, 203, 201, 199, 197, 197, 198, 199, 199, 198, 195, 194, 193, 193, 196, 200, 204, 208, 213, 216, 218, 220, 222, 224, 226, 227, 227, 226, 225, 224, 224, 222, 221, 220, 220, 220, 221, 222, 222, 223, 224, 226, 227, 231, 234, 236, 239, 241, 242, 243, 245, 247, 252, 257, 260, 263, 264, 265, 267, 269, 273, 279, 285, 291, 294, 296, 299, 302, 308, 316, 325, 333, 342, 350, 358, 367, 377, 389, 401, 414, 425, 435, 443, 448, 455, 465, 478, 493, 508, 523, 540, 559, 582, 609, 644, 686, 736, 797, 869, 955, 1062, 1197, 1370, 1593, 1883, 2258, 2729, 3289, 3902, 4482, 4901, 5065, 4996]
5866D996j79j43qJ51K61K59J19j00k70l05k06l1J63L17L69K73M4j97l21k90j54J3J35J44P
5863E047k33m58n70n59m76l67k59j61p7%P4J53K39L36M39N34N87N46L74J14j14k06j52oJ59
5861D964K66K51R2j39l08l33k24m0J54L02L46K39Qk23l31k89j49J2J24J18l6k88n10o15o03
5858B788n22m20l23k42j78j33j02q0o6n8m9m2l4k9k3j8j5j4j1j1j1qnlkklnqrqolklmoqol
5854C13j%Jjkmnnlmk%jmnnonmmljjkjjjkkjjj%kjkjlljk%%J%KJJ%j%Jjj%%%jkjk%jkjjj%J
5846B13JKLJ%jkkkjkklklklljJJKK%%%%%JJLL%jkkkjjjj%%%%%JKLKJ%jkj%%%JJK%jkjj%JK
5839B01%jj%JJJ%%kkjk%%%%jjlkjjJKKJJ%%%%j%J%Jjjjk%JJJ%jk%J%JKKKJJ%kj%%%JJ%%j%
5832A97J%JJj%%%JJ%%%j%jjjJ%Kjklmlj%JLJ%jjmnlk%%JJJklkkkjj%JJK%JJ%LKLK%j%%KLM
$$ y = [4996, 4817, 4674, 4666, 4817, 5078, 5337, 5456, 5356, 5086, 4781, 4575, 4544, 4707, 5024, 5393, 5666, 5710, 5513, 5192, 4902, 4748, 4761, 4896, 5040, 5047, 4814, 4356, 3786, 3227, 2751, 2384, 2125, 1964, 1887, 1887, 1961, 2114, 2353, 2689, 3128, 3662, 4249, 4795, 5169, 5283, 5169, 4963, 4811, 4805, 4964, 5230, 5481, 5573, 5434, 5126, 4793, 4569, 4529, 4683, 4985, 5331, 5570, 5578, 5355, 5024, 4735, 4586, 4598, 4722, 4840, 4804, 4516, 4006, 3391, 2788, 2266, 1846, 1523, 1281, 1103, 970, 868, 788, 722, 664, 615, 573, 539, 510, 487, 469, 454, 440, 429, 418, 407, 399, 394, 391, 389, 387, 384, 379, 371, 362, 354, 348, 345, 343, 340, 336, 330, 322, 316, 313, 312, 312, 313, 312, 310, 306, 301, 296, 293, 289, 287, 287, 286, 282, 277, 272, 266, 261, 257, 253, 250, 249, 248, 246, 245, 244, 243, 241, 239, 238, 237, 236, 236, 234, 233, 231, 230, 227, 224, 223, 221, 221, 221, 222, 222, 224, 225, 226, 226, 225, 225, 226, 225, 224, 224, 224, 224, 223, 221, 220, 218, 218, 217, 215, 214, 213, 212, 212, 213, 214, 216, 219, 220, 220, 219, 217, 215, 213, 212, 210, 208, 205, 203, 200, 198, 195, 192, 191, 192, 193, 195, 197, 197, 197, 197, 197, 197, 198, 199, 202, 205, 205, 204, 202, 200, 198, 197, 196, 195, 194, 194, 194, 194, 194, 194, 195, 197, 200, 202, 203, 203, 202, 200, 199, 199, 199, 199, 200, 201, 203, 203, 202, 200, 199, 198, 198, 199, 201, 201, 200, 199, 199, 200, 201, 202, 202, 202, 200, 198, 197, 195, 195, 195, 195, 195, 194, 193, 190, 188, 187, 186, 187, 189, 191, 192, 193, 193, 193, 193, 193, 192, 192, 193, 193, 194, 193, 192, 191, 189, 189, 190, 191, 192, 192, 191, 189, 189, 190, 190, 191, 193, 195, 197, 198, 199, 199, 197, 196, 196, 196, 196, 197, 198, 198, 198, 197, 197, 198, 198, 199, 200, 199, 199, 199, 199, 200, 201, 201, 201, 201, 200, 200, 199, 198, 197, 198, 198, 200, 199, 197, 194, 190, 187, 186, 186, 187, 190, 191, 191, 190, 189, 185, 180, 177, 175, 175, 175, 176, 177, 178, 176, 173, 171, 169, 167, 166, 165, 165, 166, 167, 169, 169, 170, 171, 171, 174, 176, 179, 181, 181, 180, 180, 180, 182, 185, 189]
5825A89LLJ%%JKMLKKKLKKJ%%J%JJJKJ%%%kk%JKLK%%j%jjjJMMNONOMMLKLMORJ4J4J5J2QMJJ
5818C62MQJ0J4J6J7J7J4J3J3J5J9K4L3M2N3O6Q1J00J28J71K33L22M35N76P25Q34Q04N14N8
5814E721k57k73o3K67O21R13J020Q10L70j30o35r91j022p87m34p7J99L07J27l12p21q71q06
5812B976o48m82l48k44j74j28r8p9o2m8l5k6j8j2rnljkkkjj%MOQJ0RRJ0J2J6K3L3M2N4P0Q6
5808I40J09J48K03K77L79N12O72Q27R10P84L68j14l39k45M7M28P99J063J053O84J50l87q75
5805H393j116j017p02l14M3K86L05qn10q59r21q01o20m55l25k30j66j25r9q0o6n3m2l3k5j9
5803D41j4j4j5j3j3j2j0j0ppoopppnmlkmmnoomlljkj%j%lmmmonkj%%%jllmmkj%J%%Jjkj%J
5796A91JJJJKKJKj%%%JKLKLL%%j%JJKKJJJKkjjj%jjjjjkj%%%%jlmmljJJJJ%jmomkj%JJ%%j
$$ y = [189, 192, 195, 196, 196, 196, 197, 199, 203, 206, 208, 210, 212, 215, 217, 219, 220, 220, 220, 221, 221, 222, 223, 224, 226, 227, 227, 227, 227, 225, 223, 223, 224, 226, 229, 231, 231, 231, 230, 230, 229, 228, 227, 228, 232, 236, 241, 247, 252, 258, 262, 266, 269, 271, 274, 278, 284, 293, 307, 321, 336, 348, 356, 360, 361, 362, 366, 374, 384, 398, 414, 431, 448, 462, 475, 488, 503, 522, 546, 579, 621, 674, 740, 821, 921, 1049, 1220, 1453, 1775, 2210, 2786, 3511, 4345, 5149, 5663, 5721, 5464, 5191, 5128, 5395, 6016, 6929, 7949, 8759, 9129, 8999, 8364, 7373, 6351, 5564, 5130, 5053, 5252, 5559, 5686, 5374, 4653, 3782, 2976, 2328, 1846, 1498, 1254, 1080, 952, 854, 775, 713, 665, 630, 604, 586, 574, 565, 560, 557, 556, 554, 552, 550, 549, 548, 548, 552, 558, 566, 576, 585, 594, 604, 616, 632, 655, 688, 730, 784, 854, 940, 1049, 1197, 1400, 1677, 2056, 2568, 3240, 4067, 4977, 5761, 6129, 6015, 5676, 5431, 5478, 5906, 6705, 7768, 8821, 9505, 9655, 9268, 8393, 7277, 6260, 5558, 5244, 5287, 5573, 5878, 5870, 5360, 4501, 3580, 2779, 2159, 1704, 1379, 1149, 983, 858, 759, 679, 613, 560, 518, 485, 460, 441, 427, 413, 398, 385, 372, 360, 350, 340, 333, 326, 320, 314, 307, 300, 293, 288, 284, 281, 279, 275, 271, 266, 260, 254, 250, 247, 244, 243, 241, 240, 240, 239, 239, 236, 232, 228, 224, 218, 213, 211, 210, 210, 210, 210, 209, 206, 203, 199, 195, 193, 192, 192, 193, 193, 193, 194, 193, 191, 190, 190, 191, 192, 193, 194, 195, 197, 199, 200, 202, 201, 201, 201, 201, 202, 204, 207, 209, 212, 215, 215, 215, 214, 214, 215, 216, 218, 220, 221, 222, 223, 225, 223, 222, 221, 220, 220, 219, 218, 217, 216, 215, 213, 212, 212, 212, 212, 212, 211, 208, 204, 200, 197, 196, 197, 198, 199, 200, 200, 199, 195, 189, 185, 183, 182, 182, 183, 184, 184, 184, 183]
5789A83ljkJ%%%J%J%JKJjkkjJKKJJ%kj%KJJJKK%%jkJJJ%J%%%j%%JJ%%jjkkJKLJK%%klj%%%
5782A90JJj%kjjjj%%Jjjjj%jJ%JJJ%jj%%%%%%%j%j%%J%JJ%%JJJ%J%KKKLMMLJ%j%jJJJJ%%%
5774B11jKJKKJ%kj%JJJ%Jkmnmmk%%%jjj%JKKKKKK%jJ%J%%j%%jjj%JJKK%jlk%JJ%jkllkkjj
5767A92j%j%%JJKKj%%%jJKJJj%kjkk%%%Jj%jjkkkj%%%J%%%%J%j%j%%j%%%Jj%jjJJ%J%J%%%
5760A83%%j%%%%%J%%JJ%j%%j%%j%JJ%jjjJ%Jj%%k%jJJJJj%j%jjjj%J%JJ%JJ%%%%%%%%%%%%
5752A82%j%%jj%%JK%%%%%%j%%%%J%%%%J%j%%jJ%%J%Jj%%%jj%J%%jj%%JJJ%%jj%%%%%J%%%%
5745A82%J%%%jj%J%%%%J%%%j%%J%%J%%%%%%jkjJJJJj%%jJJ%j%%%%j%%%%j%J%%%%%%%%J%%%
5738A83jk%%%J%JK%%j%j%j%J%%j%%%%%%%J%%%j%j%%JJJ%%%Jjj%JJ%j%%Jj%%%JJJJ%jj%%JJ
$$ y = [183, 180, 179, 177, 178, 178, 178, 178, 179, 179, 180, 180, 181, 183, 184, 183, 181, 179, 178, 179, 181, 183, 184, 185, 185, 183, 182, 182, 184, 185, 186, 187, 189, 191, 191, 191, 190, 188, 189, 190, 191, 191, 192, 192, 192, 192, 191, 191, 191, 192, 193, 193, 193, 192, 191, 189, 187, 188, 190, 193, 194, 196, 196, 196, 194, 191, 190, 190, 190, 190, 191, 192, 191, 191, 189, 188, 187, 186, 185, 185, 185, 186, 185, 184, 183, 182, 182, 181, 182, 182, 183, 184, 185, 185, 184, 183, 183, 183, 183, 183, 183, 183, 183, 182, 182, 181, 181, 181, 182, 182, 183, 184, 184, 184, 185, 186, 187, 187, 188, 188, 190, 192, 194, 197, 201, 205, 208, 209, 209, 208, 208, 207, 208, 209, 210, 211, 211, 211, 211, 210, 212, 213, 215, 217, 218, 218, 216, 215, 215, 216, 217, 218, 218, 219, 217, 213, 208, 204, 200, 198, 198, 198, 198, 197, 196, 195, 195, 196, 198, 200, 202, 204, 206, 208, 208, 207, 208, 208, 209, 209, 209, 208, 208, 208, 207, 206, 205, 205, 206, 207, 209, 211, 211, 210, 207, 205, 205, 206, 207, 207, 206, 204, 201, 198, 196, 194, 193, 192, 191, 191, 190, 190, 190, 191, 192, 194, 196, 195, 195, 195, 195, 194, 195, 197, 198, 199, 198, 198, 196, 195, 193, 191, 191, 191, 191, 192, 191, 191, 190, 189, 187, 185, 183, 182, 182, 182, 182, 183, 183, 183, 183, 183, 184, 184, 183, 183, 182, 182, 182, 181, 181, 181, 181, 182, 181, 181, 180, 179, 180, 181, 181, 182, 182, 183, 183, 183, 183, 183, 183, 182, 182, 182, 182, 182, 182, 183, 183, 183, 184, 185, 185, 184, 184, 184, 183, 183, 183, 182, 182, 183, 184, 184, 183, 182, 181, 182, 182, 183, 182, 182, 182, 180, 180, 179, 180, 181, 182, 183, 182, 182, 181, 181, 180, 179, 178, 177, 177, 178, 178, 179, 180, 180, 181, 182, 182, 182, 182, 182, 182, 182, 182, 182, 182, 182, 182, 182, 182, 181, 181, 181, 180, 179, 179, 179, 180, 182, 182, 182, 182, 182, 182, 182, 181, 181, 181, 181, 181, 182, 182, 182, 182, 182, 183, 183, 182, 182, 182, 181, 182, 182, 182, 183, 183, 184, 183, 183, 183, 183, 182, 181, 181, 182, 182, 182, 181, 180, 180, 180, 181, 182, 183, 183, 183, 182, 181, 181, 181, 181, 181, 181, 182, 182, 182, 182, 182, 182, 183, 183, 183, 183, 182, 181, 181, 182, 182, 182, 182, 182, 183, 183, 183, 183, 182, 182, 182, 183, 183, 183, 184, 184, 184, 184, 184, 184, 184, 183, 181, 180, 181, 182, 183, 184, 183, 183, 183, 182, 183, 184, 184, 183, 183, 183, 183, 183, 182, 182, 182, 182, 182, 181, 181, 182, 182, 182, 182, 182, 182, 182, 182, 182, 183, 183, 183, 183, 182, 180, 180, 180, 180, 181, 181, 182, 184, 184, 184, 183, 183, 182, 182, 181, 181, 182, 182, 182, 181, 181, 181, 181, 181, 181, 181, 181, 182, 182, 182, 182, 181, 181, 180, 180, 180, 181, 182, 183, 183, 183, 183, 184, 183, 182, 182, 183, 184, 184, 183, 183, 183, 184, 183, 183, 183, 183, 184, 185, 186, 187, 187, 186, 185, 185, 185, 186, 187]
5730A87JJJJJLKMLLLJ%jjJLNMMJ%kllnlj%%%jmnmkkkkjjjjj%%J%%%%%%%%J%%%%%%%%%JjjJ
5723A85%%%JJ%JJJLLLMNMK%jkJJNNOM%kmnmlj%JJklnnmmkjjjjjj%%j%%%%%%j%jJ%%%%%%Jj
5716A83%%%%J%J%j%%J%%jjjJK%Jjjj%%%jj%j%JKJj%j%%%J%jjJ%%%j%%j%J%%%j%%%%%%J%%J
5708A82J%%%%%%jjjKJj%jJ%%%%j%%j%J%Jj%J%jJJJ%%j%j%%%JJ%%kkJ%%J%J%J%%%%jjjjj%J
5701A80J%%%jJ%%J%%%j%J%%%%%J%J%Jjj%j%%J%%%jkJJJJ%Jj%%%%%jj%J%%j%%%%j%j%JJ%%%
5694A82%%%j%%%%%%%J%Jj%kjJJJJ%J%%%J%JjkjJJ%%%kj%Jjj%%%%%%%%%JJ%%j%%JJ%J%Jkj%
5687A82JJkj%%%J%%%%J%Jjj%%j%J%J%jJJJ%%jj%Jj%%Jjjjjj%%%J%JJ%J%Jj%%%%%j%%%jJJj
5679A82jj%j%JJJ%%%%%j%%j%%%JJj%Jj%J%%%j%%%jJ%J%KJ%%k%%%J%%%%%j%jk%%%%J%J%%%%
$$ y = [187, 188, 189, 190, 191, 192, 195, 197, 201, 204, 207, 210, 211, 211, 210, 209, 210, 213, 218, 222, 226, 227, 227, 225, 222, 219, 214, 211, 210, 210, 210, 210, 209, 205, 200, 196, 194, 192, 190, 188, 187, 186, 185, 184, 183, 183, 183, 184, 184, 184, 184, 184, 184, 184, 184, 184, 185, 185, 185, 185, 185, 185, 185, 185, 185, 185, 186, 185, 184, 185, 185, 185, 185, 186, 187, 187, 188, 189, 190, 193, 196, 199, 203, 208, 212, 214, 214, 213, 211, 212, 213, 218, 223, 229, 233, 233, 231, 227, 222, 218, 215, 214, 214, 215, 216, 214, 211, 206, 201, 197, 193, 191, 190, 189, 188, 187, 186, 185, 185, 185, 184, 184, 184, 184, 184, 184, 184, 183, 183, 182, 183, 183, 183, 183, 183, 183, 183, 184, 183, 183, 183, 183, 183, 184, 184, 185, 185, 184, 184, 184, 185, 185, 185, 184, 183, 182, 183, 185, 185, 186, 185, 184, 183, 183, 183, 183, 182, 181, 181, 180, 180, 181, 183, 184, 183, 183, 182, 182, 182, 182, 183, 183, 182, 181, 182, 182, 182, 182, 181, 181, 181, 180, 180, 181, 181, 181, 181, 180, 180, 180, 180, 180, 180, 180, 181, 181, 181, 182, 183, 183, 183, 183, 183, 183, 183, 182, 181, 180, 182, 183, 182, 182, 181, 182, 182, 182, 182, 182, 181, 181, 181, 180, 180, 181, 181, 182, 181, 181, 182, 182, 181, 182, 183, 184, 184, 184, 183, 183, 182, 182, 182, 182, 183, 184, 184, 184, 182, 180, 181, 181, 181, 182, 182, 183, 183, 184, 184, 184, 184, 184, 183, 182, 181, 180, 179, 179, 180, 181, 181, 181, 181, 180, 181, 181, 181, 182, 182, 182, 182, 181, 181, 182, 182, 182, 182, 182, 182, 183, 183, 184, 184, 185, 184, 183, 183, 182, 182, 182, 183, 183, 183, 183, 182, 180, 181, 182, 183, 184, 184, 185, 184, 184, 184, 184, 184, 184, 183, 182, 182, 183, 183, 183, 182, 182, 182, 182, 182, 181, 181, 180, 180, 181, 182, 182, 182, 182, 182, 182, 182, 181, 181, 181, 181, 181, 181, 181, 181, 182, 182, 183, 182, 182, 180, 179, 180, 181, 182, 183, 183, 184, 184, 184, 184, 185, 185, 186, 185, 183, 182, 183, 184, 184, 184, 184, 182, 181, 181, 182, 181, 180, 180, 180, 180, 180, 180, 180, 180, 180, 180, 181, 182, 182, 182, 181, 181, 181, 182, 183, 183, 184, 184, 185, 183, 182, 182, 183, 184, 182, 181, 181, 181, 181, 182, 182, 182, 182, 182, 183, 183, 184, 183, 182, 182, 182, 181, 181, 182, 182, 183, 183, 182, 183, 184, 185, 185, 185, 184, 183, 183, 184, 183, 183, 183, 184, 183, 182, 181, 180, 179, 179, 179, 179, 180, 180, 181, 182, 182, 183, 183, 184, 183, 183, 183, 183, 183, 183, 182, 182, 182, 182, 181, 182, 183, 182, 181, 180, 180, 179, 179, 180, 181, 182, 182, 182, 182, 182, 182, 181, 181, 181, 180, 180, 180, 180, 181, 182, 181, 181, 182, 181, 181, 182, 182, 182, 182, 181, 181, 181, 181, 180, 181, 181, 182, 182, 184, 185, 185, 185, 183, 183, 183, 183, 184, 184, 184, 184, 184, 184, 183, 183, 182, 180, 180, 180, 180, 180, 181, 181, 182, 182, 182, 182, 182]
5672A82%J%%%J%jkjJ%%K%J%%%%%j%%%%%J%%%%%j%%j%%%J%%J%JJjjjj%J%jjJJ%jj%%%%%J%%
5665A82%%j%J%JJ%%%%j%%%j%j%%%%%%%%jJ%J%JJj%%%j%%%jjJ%%%%jJ%%%%%J%%J%%%jjjJ%J
5657A82%%%j%%JJjjJKJ%%%%jjjj%%JJ%jj%JJ%%J%%kj%%%J%KJ%%j%jkJ%%%%%%%%%J%JJ%%%%
5650A85%%jjj%%%J%%%%%%%%%JJjjj%j%%%%%%%J%JJ%J%j%%j%%j%%%%%%J%%%%%%J%%J%%%%%%
5643A85%jjJ%%%J%%%%%J%%Jjjjj%J%%%%%jj%%%J%%%%%jJ%j%%%jJ%JK%jJ%j%%%j%%%jj%JJJ
5635A84%%j%J%JJ%%%k%%%J%J%%j%%J%%%J%Jjj%%%%%%%%JKLKNMMJkmllkkJ%JJKKKLKKjklml
5628A95llkj%%Jj%%%j%%j%%%%%%%%%%%%%%j%JJ%JJ%%%KJJKKKNMPONL%lnonmkj%KLLNMNK%l
5621B22noommlkklkJ%J%%%%jJj%%%%j%%%%%j%%J%Jj%%j%JJj%%KKKKLLLM%jllkkkj%%KJKLK
$$ y = [182, 182, 183, 183, 183, 183, 184, 184, 183, 181, 180, 181, 181, 181, 183, 183, 184, 184, 184, 184, 184, 184, 183, 183, 183, 183, 183, 183, 184, 184, 184, 184, 184, 184, 183, 183, 183, 182, 182, 182, 182, 183, 183, 183, 184, 184, 185, 186, 185, 184, 183, 182, 182, 183, 183, 182, 181, 182, 183, 183, 182, 181, 181, 181, 181, 181, 181, 182, 182, 182, 182, 182, 181, 181, 182, 182, 183, 184, 184, 184, 184, 184, 183, 183, 183, 183, 182, 182, 181, 181, 181, 181, 181, 181, 181, 181, 181, 180, 181, 181, 182, 182, 183, 184, 183, 183, 183, 183, 182, 182, 182, 182, 181, 180, 181, 181, 181, 181, 181, 180, 181, 181, 181, 181, 181, 181, 182, 182, 182, 183, 183, 183, 183, 182, 181, 180, 181, 181, 182, 182, 182, 182, 181, 181, 181, 182, 183, 182, 181, 182, 184, 185, 185, 185, 185, 185, 184, 183, 182, 181, 181, 181, 182, 183, 183, 182, 181, 181, 182, 183, 183, 183, 184, 184, 184, 182, 181, 181, 181, 181, 182, 182, 184, 185, 185, 185, 184, 184, 183, 181, 182, 182, 182, 182, 182, 182, 182, 182, 182, 182, 183, 183, 184, 185, 185, 185, 185, 185, 185, 185, 184, 183, 182, 182, 182, 182, 183, 183, 183, 183, 183, 183, 183, 183, 183, 183, 184, 185, 184, 183, 182, 182, 181, 181, 181, 181, 181, 181, 181, 181, 182, 182, 183, 184, 184, 185, 185, 184, 184, 184, 183, 183, 183, 182, 182, 182, 182, 182, 182, 182, 183, 183, 183, 183, 183, 183, 183, 184, 184, 184, 185, 185, 185, 185, 185, 185, 185, 185, 184, 183, 184, 184, 184, 184, 185, 185, 185, 185, 185, 185, 186, 186, 186, 187, 186, 185, 184, 183, 183, 184, 184, 184, 184, 184, 184, 183, 182, 182, 182, 182, 183, 183, 183, 183, 183, 183, 182, 183, 183, 182, 182, 182, 182, 181, 182, 182, 183, 185, 185, 184, 185, 185, 184, 184, 184, 184, 183, 183, 183, 183, 182, 181, 181, 182, 183, 184, 184, 184, 183, 183, 184, 184, 185, 186, 186, 186, 186, 184, 184, 184, 184, 185, 185, 186, 186, 186, 185, 185, 185, 186, 186, 186, 186, 187, 187, 188, 187, 186, 186, 186, 186, 186, 186, 186, 186, 186, 187, 189, 192, 194, 199, 203, 207, 208, 206, 202, 199, 196, 194, 192, 193, 193, 194, 195, 197, 199, 201, 204, 206, 208, 207, 205, 202, 198, 195, 192, 189, 187, 186, 186, 186, 187, 186, 186, 186, 186, 185, 185, 185, 184, 184, 184, 184, 184, 184, 184, 184, 184, 184, 184, 184, 184, 184, 184, 183, 183, 184, 185, 185, 186, 187, 187, 187, 187, 189, 190, 191, 193, 195, 197, 202, 206, 213, 219, 224, 227, 227, 224, 219, 213, 208, 204, 202, 201, 201, 203, 206, 209, 214, 218, 223, 225, 225, 222, 217, 211, 205, 201, 197, 194, 192, 190, 187, 185, 186, 186, 187, 187, 187, 187, 187, 186, 187, 186, 186, 186, 186, 186, 185, 185, 185, 185, 185, 185, 184, 184, 184, 185, 185, 186, 185, 185, 185, 184, 184, 185, 186, 185, 185, 185, 187, 189, 191, 193, 196, 199, 202, 206, 206, 205, 202, 199, 197, 195, 193, 192, 192, 192, 194, 195, 197, 200, 202]
5613B02KJkkllkkkjj%%jjj%j%%j%J%%%J%J%%jj%%JJ%Jj%jj%%%%%j%%%%%J%Jj%%j%Jj%jjJJ
5606A82%JJJJ%%jjj%%j%%%%%%%JK%j%%j%%%j%KJj%%%%%%J%%%j%%%j%%%%%%%jjJJj%j%%JJ%
5599A83%J%%%J%%%%jj%JJ%%jj%%JJ%%%%%j%j%JJ%%J%J%%j%kjjJ%J%%%%%J%%%%%%jj%%J%%%
5592A84J%%J%%%j%%%J%kj%%%J%%%%%%J%j%jj%%J%J%Jjj%jJ%J%%Jj%%%%jj%%JJJJJ%J%jjj%
5584A85%%j%%%JJJ%J%%%J%%jjjj%%%jJ%J%J%%%j%%%%Jjj%JJJJ%j%jjJJj%%jJJj%jkJJJJJ%
5577A89j%%j%J%j%KJJ%J%%JJjjjjjj%%jjj%J%j%jj%JjJJKj%%%%%j%k%KJJJ%%%kk%%jJJKKJ
5570A90K%%Jjjkj%kj%KJJJKKK%%%%jjJ%J%%%jjjkkklk%KKLMLJjj%jjjknmljKJ%jjjjj%JKK
5562A80KKLM%jklmlk%%KKLKKKLJ%%%JKJLMLML%j%kjjlklkkKLNNNMJ%J%%klonnk%j%%jj%KM
$$ y = [202, 204, 205, 203, 201, 198, 195, 193, 191, 189, 188, 187, 187, 187, 186, 185, 184, 184, 183, 183, 183, 182, 182, 183, 183, 183, 183, 184, 184, 185, 185, 185, 184, 183, 183, 183, 184, 185, 185, 186, 185, 185, 184, 183, 183, 183, 183, 183, 183, 182, 182, 182, 182, 182, 182, 183, 183, 184, 183, 183, 183, 182, 182, 183, 182, 182, 181, 180, 181, 182, 182, 183, 184, 185, 186, 186, 186, 185, 184, 183, 183, 183, 182, 182, 182, 182, 182, 182, 182, 182, 183, 185, 185, 184, 184, 184, 183, 183, 183, 183, 182, 182, 184, 185, 184, 184, 184, 184, 184, 184, 184, 185, 185, 185, 185, 184, 184, 184, 184, 183, 183, 183, 183, 183, 183, 183, 183, 182, 181, 182, 183, 182, 182, 181, 181, 181, 182, 183, 183, 183, 184, 184, 184, 184, 185, 185, 185, 185, 185, 184, 183, 183, 184, 185, 185, 185, 184, 183, 183, 183, 184, 185, 185, 185, 185, 185, 185, 184, 184, 183, 183, 184, 185, 185, 185, 186, 186, 187, 187, 187, 186, 186, 184, 183, 182, 183, 183, 184, 184, 184, 184, 184, 184, 185, 185, 185, 185, 185, 185, 185, 184, 183, 183, 183, 184, 184, 184, 184, 185, 185, 185, 186, 186, 186, 186, 185, 185, 185, 185, 186, 186, 184, 183, 183, 183, 183, 184, 184, 184, 184, 184, 184, 184, 185, 185, 184, 184, 183, 182, 182, 182, 183, 183, 184, 184, 185, 184, 183, 183, 182, 183, 183, 184, 184, 184, 185, 184, 184, 184, 184, 184, 183, 182, 182, 182, 183, 184, 185, 186, 187, 187, 188, 188, 187, 186, 185, 185, 185, 185, 184, 184, 184, 184, 185, 186, 187, 187, 188, 188, 188, 188, 189, 189, 189, 188, 187, 186, 185, 185, 185, 185, 184, 185, 185, 186, 186, 187, 187, 187, 187, 186, 186, 186, 186, 186, 187, 186, 185, 185, 186, 187, 188, 189, 189, 188, 188, 187, 186, 187, 188, 187, 187, 187, 186, 187, 188, 187, 187, 186, 184, 185, 186, 187, 188, 189, 189, 188, 188, 188, 187, 187, 188, 188, 187, 187, 189, 190, 191, 191, 192, 192, 192, 193, 194, 193, 192, 191, 190, 189, 188, 188, 188, 187, 186, 185, 185, 186, 186, 185, 185, 184, 183, 183, 184, 183, 184, 185, 187, 186, 186, 186, 186, 186, 186, 185, 185, 183, 183, 185, 186, 187, 188, 188, 188, 188, 186, 184, 184, 184, 183, 184, 185, 187, 189, 190, 192, 192, 192, 193, 192, 191, 189, 188, 188, 186, 185, 185, 187, 188, 189, 190, 192, 194, 196, 196, 196, 196, 196, 195, 194, 195, 195, 196, 196, 196, 196, 195, 194, 193, 191, 189, 187, 184, 182, 182, 184, 186, 189, 193, 196, 197, 196, 195, 195, 194, 193, 192, 190, 185, 181, 178, 177, 179, 180, 180, 179, 178, 177, 176, 175, 175, 176, 178, 180, 182, 184, 187, 191, 191, 190, 188, 185, 181, 178, 176, 176, 176, 178, 180, 183, 185, 187, 189, 192, 193, 193, 193, 193, 194, 196, 197, 200, 204, 207, 211, 214, 214, 213, 213, 211, 210, 209, 206, 204, 201, 199, 197, 199, 202, 207, 212, 217, 221, 222, 222, 223, 223, 223, 221, 218, 212, 207, 202, 200, 200, 199, 199, 199, 198, 197, 197, 199, 203]
5555B03MLONONMLKLKNORPNJjJLOQQPRJ0J4J6K0K0K1J9J9K2L0M0N2O9R5J30J77K38L22M30N61
5550B625O90P61O70K71k95o67p44o40m68l02j56k6R2K10L32M70O07O91O32K71l01p12q17p29
5548B465n65m13k89j96j33r2o8n1m1l0k2j9j6j5j0mjjknqnjPJ2J6J9J7J6J6K0K4K9K9L1L4
5544G48L8N0O9R6J31J77K42L29M46O03Q00J028J232J328J111N47j20p40j156j222j037p49
5541C951m47j73Q0L21N68Q22J046J170J018N20j23p63j240j370j224r72p15n09l53k48j76
5539A183j32j03p9o4n3m9m4l9l4k5k1j8k0j7j2oKQJ2J1RNJjl%LMMPJ3K2L4M9O8R6J29J77K40
5535A357L26M35N68O94P64O61K35l46p04p60o42m65k97j49k2R6K12L35M76O09O89O18K42l28
5533D604p24q13p18n54m05k86j98j36r5p2n4m3l2k4k3k2k3k2k0j6j4j1qnlJNPOOLkqj2j2j3
$$ y = [203, 207, 210, 216, 221, 227, 232, 236, 239, 241, 244, 246, 251, 257, 266, 273, 278, 279, 278, 279, 282, 288, 296, 304, 311, 320, 330, 344, 360, 380, 400, 421, 440, 459, 481, 511, 551, 603, 672, 767, 897, 1074, 1312, 1634, 2064, 2625, 3315, 4076, 4746, 5017, 4722, 4055, 3311, 2671, 2203, 1901, 1745, 1719, 1811, 2021, 2353, 2823, 3430, 4121, 4753, 5024, 4723, 4011, 3194, 2465, 1900, 1487, 1198, 1002, 869, 777, 709, 658, 617, 587, 565, 546, 530, 515, 505, 501, 500, 499, 497, 492, 484, 479, 478, 485, 497, 513, 532, 549, 565, 581, 601, 625, 654, 683, 714, 748, 786, 836, 905, 1001, 1132, 1309, 1551, 1880, 2326, 2929, 3729, 4757, 5989, 7317, 8428, 8975, 8855, 8115, 6959, 5737, 4700, 3951, 3504, 3331, 3411, 3732, 4300, 5122, 6168, 7338, 8356, 8876, 8753, 7990, 6750, 5380, 4156, 3184, 2469, 1960, 1607, 1359, 1183, 1051, 948, 869, 805, 752, 703, 659, 620, 586, 561, 540, 522, 502, 485, 473, 467, 469, 477, 489, 500, 509, 514, 515, 514, 511, 511, 514, 518, 522, 529, 542, 564, 598, 647, 715, 811, 940, 1117, 1357, 1683, 2118, 2686, 3380, 4144, 4805, 5040, 4694, 3990, 3230, 2588, 2123, 1826, 1677, 1655, 1751, 1963, 2298, 2774, 3383, 4072, 4690, 4932, 4604, 3880, 3067, 2349, 1795, 1390, 1104, 906, 770, 675, 603, 549, 506, 474, 450, 427, 405, 382, 360, 340, 324, 310, 299, 291, 286, 283, 284, 289, 296, 302, 308, 311, 309, 301, 289, 277, 264]
5529B64j0rpmjJ%JJKJ%jllmkj%%jjnmll%jjj%JKLKLJlmmmlj%J%j%JJKL%jkljkJJKKLKKJJ%
5522B11jkllmnj%KLMMKK%Jj%%jJKKLKJJklmkjJ%%%JLMLKKJjnmlmkj%%Jjj%jjjjj%jkkjJJ%
5514A95j%jlkkkkkJJJJLKKLJ%jkj%JKKKJJkj%%JJKKJJKJJJ%knmlljJJK%JJ%%%jj%jlljk%J
5507A87J%%JJjkkj%J%jk%jKKJ%%J%%JJKJJK%jjkjk%%%%jKKLK%jjkljkjk%j%J%J%%%j%j%%j
5500A81%j%%%%%%J%%%J%%%j%jJ%%%J%%j%JJJJKJJjjjj%%%J%%KKJJJ%jkjjjkkj%%J%%%%%%j
5492A82%%j%j%jJ%JK%%j%jJ%%%%%%%%%%J%%JjjjKJj%k%%jJ%J%j%%%%j%%%%%J%%%%J%%Jj%J
5485A83j%%j%JJ%j%jJJ%J%%%j%%JjJ%%j%%jj%JJ%%J%jj%J%JJ%%%%%j%%%Jj%%JJk%jj%%%J%
5478A83%%%%J%J%j%j%%%%jJ%%J%%%%%j%J%J%%%%jJJJJjj%%j%%J%%%%%J%%%JK%j%j%j%%%%j
$$ y = [264, 254, 245, 238, 234, 233, 234, 234, 235, 236, 238, 239, 239, 238, 235, 232, 228, 226, 225, 225, 225, 224, 223, 218, 214, 211, 208, 208, 207, 206, 205, 205, 206, 208, 211, 213, 216, 217, 214, 210, 206, 202, 199, 198, 198, 199, 199, 198, 198, 199, 200, 202, 205, 205, 204, 202, 199, 198, 196, 197, 198, 200, 202, 205, 207, 209, 210, 211, 211, 210, 208, 205, 202, 198, 193, 192, 192, 194, 197, 201, 205, 207, 209, 209, 210, 209, 209, 209, 208, 209, 211, 213, 216, 218, 219, 220, 218, 215, 211, 209, 208, 209, 209, 209, 209, 210, 213, 217, 220, 222, 224, 225, 224, 219, 215, 212, 208, 206, 205, 205, 205, 206, 205, 204, 204, 203, 202, 201, 200, 199, 199, 198, 196, 194, 193, 194, 195, 195, 194, 194, 193, 190, 188, 186, 184, 182, 180, 181, 182, 183, 184, 187, 189, 191, 194, 195, 195, 194, 192, 191, 191, 192, 194, 196, 198, 199, 200, 198, 197, 197, 197, 198, 199, 201, 203, 204, 205, 207, 208, 209, 210, 210, 208, 203, 199, 196, 193, 192, 193, 194, 196, 196, 197, 198, 198, 198, 198, 197, 196, 196, 195, 192, 189, 188, 186, 186, 187, 188, 188, 188, 189, 190, 189, 187, 185, 184, 184, 185, 185, 184, 182, 182, 181, 183, 185, 186, 186, 186, 187, 187, 187, 188, 189, 191, 192, 193, 195, 195, 194, 193, 191, 190, 188, 188, 188, 188, 188, 187, 189, 191, 194, 196, 196, 195, 194, 192, 189, 188, 186, 185, 183, 183, 182, 182, 183, 183, 184, 184, 184, 184, 183, 183, 182, 182, 182, 181, 181, 180, 180, 180, 180, 180, 180, 180, 181, 181, 181, 181, 182, 182, 182, 182, 181, 181, 180, 181, 181, 181, 181, 182, 182, 182, 181, 181, 182, 183, 184, 185, 187, 188, 189, 188, 187, 186, 185, 185, 185, 185, 186, 186, 186, 188, 190, 191, 192, 193, 193, 192, 190, 189, 188, 187, 185, 183, 182, 182, 182, 183, 183, 183, 183, 183, 183, 183, 182, 182, 182, 181, 181, 180, 180, 179, 180, 180, 181, 183, 183, 183, 182, 182, 181, 182, 182, 182, 182, 182, 182, 182, 182, 182, 182, 182, 183, 183, 183, 184, 183, 182, 181, 183, 184, 183, 183, 181, 181, 181, 180, 181, 181, 182, 182, 181, 181, 181, 181, 181, 180, 180, 180, 180, 180, 180, 181, 181, 181, 181, 181, 182, 182, 182, 183, 182, 182, 183, 182, 182, 182, 181, 181, 182, 183, 183, 182, 182, 181, 182, 183, 183, 184, 184, 184, 184, 183, 183, 183, 184, 183, 184, 184, 184, 183, 183, 183, 182, 181, 181, 182, 183, 183, 183, 184, 184, 183, 182, 182, 183, 183, 184, 185, 185, 185, 185, 185, 185, 184, 184, 184, 184, 185, 184, 184, 184, 185, 186, 184, 184, 183, 182, 182, 182, 182, 183, 183, 183, 183, 183, 183, 184, 184, 185, 185, 184, 184, 183, 183, 183, 183, 183, 182, 183, 183, 183, 184, 184, 184, 184, 184, 184, 183, 183, 184, 184, 185, 185, 185, 185, 185, 184, 185, 186, 187, 188, 187, 186, 186, 186, 185, 185, 185, 186, 186, 186, 186, 186, 186, 187, 187, 187, 187, 188, 190, 190, 189, 189, 188, 188, 187, 187, 187, 187, 187, 186]
5470A86%j%j%%%j%J%J%jj%JJ%%j%j%%JjjJKKKLKKLLMLJjklkjjj%%J%KJKKJ%klkkJ%jjJ%%%
5463A99%jjjjkjjjk%jjj%%JKKKJJj%jj%Jkjllj%KJLNPPQOMJjlnonm%%KJMOMNLJkmonljkkJ
5456B04JJJ%J%%%J%%jj%JjjjKJJ%jKJ%%%J%j%%kk%JKKLNPOQPOMJJKJ%%%JLMMNOOPPOMMPJ1
5449C38J1J2J2J3J6K1K6L2M1N3O9R3J26J71K30L01L81M51M74L90J98L0j9RJ5r4k82m02l96
5445B320l10j93p0N0J65K74L64M11L57J80Ko5m2k4j14l04m49m73m13l23k38j69j18q2o0m4
5443F32l4k7k1j6j3j0pqolJLNRJ0J2J6K0K1K5L1L8M8O2P9J03J36J84K49L28M15M92N29M59
5439C762K79J30J14J91K60K20R6K4J9k0r1q5K7J76K57K04Q4l4j65k45k03o8O0Q1rq2r3j36
5436D753k42k95k45j58j32k40m07m92m72l92l01k21j60j16q8o8n3m1l4k6k2j7j4j1pnljKL
$$ y = [186, 186, 185, 185, 184, 184, 184, 184, 183, 183, 184, 184, 185, 185, 184, 183, 183, 184, 185, 185, 185, 184, 184, 183, 183, 183, 184, 183, 182, 183, 185, 187, 189, 192, 194, 196, 199, 202, 206, 209, 210, 209, 207, 204, 202, 201, 200, 199, 199, 199, 200, 200, 202, 203, 205, 207, 208, 208, 206, 203, 201, 199, 200, 200, 199, 198, 199, 199, 199, 199, 199, 198, 197, 196, 195, 193, 192, 191, 190, 188, 188, 187, 186, 185, 185, 185, 186, 188, 190, 192, 193, 194, 193, 193, 192, 191, 191, 192, 190, 189, 186, 183, 182, 182, 184, 185, 188, 193, 200, 207, 215, 221, 225, 226, 225, 222, 217, 211, 206, 202, 202, 202, 204, 205, 209, 215, 219, 224, 227, 228, 226, 222, 216, 211, 208, 207, 205, 203, 204, 205, 206, 207, 207, 208, 208, 208, 208, 209, 209, 209, 208, 207, 207, 208, 207, 206, 205, 207, 208, 209, 209, 208, 210, 211, 211, 211, 211, 212, 212, 211, 211, 211, 209, 207, 207, 208, 210, 212, 215, 220, 227, 233, 241, 248, 254, 258, 259, 260, 262, 263, 263, 263, 263, 264, 267, 271, 275, 280, 286, 292, 299, 306, 312, 316, 320, 327, 338, 349, 361, 373, 386, 402, 423, 449, 481, 522, 575, 644, 737, 863, 1034, 1264, 1565, 1946, 2397, 2871, 3261, 3459, 3489, 3470, 3479, 3494, 3400, 3118, 2716, 2320, 2010, 1817, 1747, 1797, 1962, 2236, 2600, 3011, 3368, 3548, 3550, 3485, 3443, 3419, 3305, 3001, 2552, 2079, 1666, 1343, 1105, 936, 818, 736, 676, 632, 598, 571, 550, 534, 521, 511, 504, 496, 490, 487, 488, 491, 496, 505, 515, 527, 543, 563, 584, 609, 640, 678, 726, 788, 867, 970, 1106, 1290, 1539, 1867, 2282, 2774, 3303, 3762, 4041, 4171, 4285, 4476, 4736, 4956, 5052, 5076, 5095, 5075, 4984, 4899, 4926, 5102, 5359, 5563, 5647, 5613, 5448, 5203, 5000, 4932, 4992, 5073, 5064, 4982, 4889, 4753, 4511, 4216, 3971, 3813, 3681, 3441, 3034, 2542, 2070, 1678, 1377, 1156, 996, 880, 792, 724, 671, 630, 596, 570, 548, 531, 517, 506, 499, 494, 491, 490, 492, 495]
5433D95MMLMOJ1J5K1K7M0N3P0R7J35J84K48L22M02M63M58L26J14j6k5J4rj65l50m25l81k76
5430A869j52l0Q8K03L07L88M08L04J04m4o8l3m3j79l74m77m63l86k95k13j52j07p6n6m3l3
5427D47k7k2j8j5j2j1j0rj0pooopmklkkjj%J%kmlllmlllmlklllmmllllkkjkjj%JJ%j%%j%%
5420A92jjjjjk%j%%JKJJ%J%%JJKKJKKJJjj%j%j%kj%JJJJ%JJJJ%jjjkjllkkjkjjj%JJJJJJ%
5413A88j%%jjjklj%%jjj%JJ%JJJ%JJKjj%j%%%%jk%%%J%%LK%j%%%J%%JJJ%k%%J%%j%j%jj%%
5406A82J%%j%JJj%jkkjJ%J%%%%j%%%%%%%%%%%%%%%%Jjj%j%JKJJ%jjj%%%%%j%j%j%%J%%JJ%
5399A78J%J%%J%J%j%jj%j%j%J%%%j%jJ%%%j%j%%J%J%%J%%%%%%J%J%%%jJ%%%%%%%j%%%%J%%
5391A80%%%j%%%%%%J%J%%%%%%%j%j%kj%J%J%J%J%j%jjJJ%Jjk%J%%j%%%%j%%%%%JJJ%%%%%%
$$ y = [495, 499, 503, 506, 510, 516, 527, 542, 563, 590, 630, 683, 753, 850, 985, 1169, 1417, 1739, 2141, 2604, 3062, 3388, 3502, 3486, 3461, 3475, 3466, 3301, 2951, 2526, 2145, 1869, 1717, 1687, 1775, 1978, 2285, 2673, 3081, 3385, 3489, 3445, 3377, 3344, 3301, 3122, 2748, 2271, 1808, 1422, 1127, 914, 762, 655, 579, 523, 480, 447, 420, 398, 380, 365, 353, 342, 332, 323, 313, 306, 300, 294, 288, 281, 277, 275, 272, 270, 268, 267, 266, 266, 267, 267, 265, 261, 258, 255, 252, 248, 245, 242, 239, 235, 232, 230, 227, 224, 221, 217, 213, 210, 207, 204, 201, 199, 197, 196, 194, 193, 192, 192, 193, 194, 194, 193, 193, 193, 192, 192, 192, 191, 190, 189, 188, 187, 185, 185, 184, 184, 184, 185, 187, 188, 189, 189, 190, 190, 190, 191, 192, 194, 196, 197, 199, 201, 202, 203, 202, 201, 201, 200, 200, 199, 199, 197, 196, 196, 197, 198, 199, 200, 200, 201, 202, 203, 204, 204, 203, 202, 201, 199, 198, 195, 192, 190, 188, 187, 185, 184, 183, 182, 182, 183, 184, 185, 186, 187, 188, 188, 187, 187, 187, 186, 185, 184, 182, 179, 178, 178, 178, 177, 176, 175, 175, 176, 177, 177, 178, 179, 180, 180, 181, 182, 184, 183, 182, 182, 181, 181, 181, 181, 181, 180, 178, 178, 178, 178, 179, 179, 179, 182, 184, 184, 183, 183, 183, 183, 184, 184, 184, 185, 186, 187, 187, 185, 185, 185, 186, 186, 186, 185, 185, 184, 184, 183, 182, 182, 182, 183, 183, 183, 182, 182, 183, 184, 183, 183, 182, 180, 178, 177, 178, 178, 179, 179, 179, 179, 179, 178, 178, 178, 178, 178, 178, 178, 178, 178, 178, 178, 178, 178, 178, 178, 178, 178, 179, 178, 177, 177, 176, 176, 177, 179, 180, 181, 181, 180, 179, 178, 178, 178, 178, 178, 178, 177, 177, 176, 176, 175, 175, 175, 176, 176, 176, 177, 178, 178, 179, 179, 180, 180, 180, 181, 181, 182, 182, 181, 181, 180, 179, 179, 178, 178, 177, 177, 178, 178, 178, 178, 177, 177, 176, 177, 177, 177, 177, 176, 176, 175, 175, 175, 176, 176, 177, 177, 177, 178, 178, 178, 178, 178, 178, 178, 179, 179, 180, 180, 180, 180, 179, 180, 180, 180, 180, 180, 180, 180, 180, 179, 179, 179, 179, 179, 180, 180, 180, 180, 180, 180, 179, 179, 179, 179, 179, 179, 179, 180, 180, 181, 181, 181, 181, 181, 181, 181, 181, 180, 180, 179, 179, 177, 176, 176, 177, 177, 178, 178, 179, 179, 180, 180, 179, 179, 178, 177, 178, 179, 179, 180, 179, 177, 177, 178, 178, 178, 177, 177, 177, 177, 177, 176, 176, 176, 176, 176, 176, 177, 178, 179, 179, 179, 179, 179, 179, 179]
5384A79%j%%%%%j%%%J%%J%%%%JJ%jjjJJj%%JjJ%jjjJ%j%j%%JJJ%%%jJJ%kj%J%%%%jJ%%%%%
5377A78j%%%%%%%%%%%%%%%j%J%JJ%%%%%%%jj%JJJ%J%%kjjJJ%J%%j%jjJJ%Jj%j%j%%jJ%%JJ
5369A79%%%%%J%%j%%%j%%%JJ%jJK%kj%%J%%J%%%jjJ%%%%J%%KKKKKKJJK%j%jkkkkj%JKKKJJ
5362A95%%%%jjkkkjkjj%%%jj%JJjjjJ%JJj%%j%%J%%KJ%%%JJJKJKLLKJ%%%JJKJ%jjjjKJJJ%
5355B07jj%%%J%jjjjjjjjllkljjjj%%J%%jjjJ%%%%J%JJ%%%%jjjj%%J%j%JKKKKLJ%%%J%jkj
5347A91jj%%%%KKKJJj%jjjjlkkjjjjjjJJ%%%Jj%j%j%%J%J%j%%%k%JJ%%jj%%%j%%%%J%%%%%
5340A78jJ%%J%%%Jj%j%%%%%JJ%JJJJ%JJKKLLKLK%jkjjjJJJKLJjkmmmljjj%%%%%%%j%%%J%J
5333A86j%KJLMMLLJ%klljk%LMMKjllklj%j%JJKLLKJjklkj%%JK%Jjklkkkkl%j%jj%jjJ%J%J
$$ y = [179, 179, 178, 178, 178, 178, 178, 178, 177, 177, 177, 177, 178, 178, 178, 179, 179, 179, 179, 179, 180, 181, 181, 180, 179, 178, 179, 180, 179, 179, 179, 180, 179, 180, 180, 179, 178, 177, 178, 178, 177, 177, 176, 176, 176, 177, 178, 179, 179, 179, 179, 178, 179, 180, 180, 178, 177, 177, 178, 178, 178, 178, 178, 177, 178, 178, 178, 178, 178, 178, 177, 177, 177, 177, 177, 177, 177, 177, 177, 177, 177, 177, 177, 177, 177, 177, 176, 176, 177, 177, 178, 179, 179, 179, 179, 179, 179, 179, 179, 178, 177, 177, 178, 179, 180, 180, 181, 181, 181, 179, 178, 177, 178, 179, 179, 180, 180, 180, 179, 179, 178, 177, 178, 179, 179, 180, 179, 179, 178, 178, 177, 177, 177, 176, 177, 177, 177, 178, 179, 179, 179, 179, 179, 179, 180, 180, 180, 179, 179, 179, 179, 178, 178, 178, 178, 179, 180, 180, 179, 180, 182, 182, 180, 179, 179, 179, 180, 180, 180, 181, 181, 181, 181, 180, 179, 180, 180, 180, 180, 180, 181, 181, 181, 183, 185, 187, 189, 191, 193, 194, 195, 197, 197, 196, 196, 195, 193, 191, 189, 187, 186, 186, 187, 189, 191, 193, 194, 195, 195, 195, 195, 195, 194, 193, 191, 189, 187, 186, 184, 183, 182, 182, 182, 182, 181, 180, 180, 181, 182, 181, 180, 179, 180, 180, 181, 182, 181, 181, 181, 180, 180, 180, 181, 181, 181, 183, 184, 184, 184, 184, 185, 186, 187, 189, 190, 192, 195, 198, 200, 201, 201, 201, 201, 202, 203, 205, 206, 206, 205, 204, 203, 202, 204, 205, 206, 207, 207, 206, 205, 205, 205, 205, 206, 206, 205, 204, 203, 202, 201, 200, 199, 198, 195, 192, 190, 187, 186, 185, 184, 183, 183, 183, 184, 184, 184, 183, 182, 181, 182, 182, 182, 182, 182, 183, 183, 184, 185, 185, 185, 185, 185, 184, 183, 182, 181, 181, 181, 182, 182, 181, 181, 182, 184, 186, 188, 190, 193, 194, 194, 194, 194, 195, 195, 194, 192, 191, 190, 189, 189, 189, 189, 189, 191, 193, 195, 196, 197, 196, 196, 195, 194, 193, 192, 189, 187, 185, 184, 183, 182, 181, 180, 179, 180, 181, 181, 181, 181, 182, 181, 181, 180, 180, 179, 179, 179, 180, 180, 181, 181, 180, 180, 180, 180, 178, 178, 179, 180, 180, 180, 179, 178, 178, 178, 178, 177, 177, 177, 177, 177, 178, 178, 178, 178, 178, 178, 177, 178, 178, 178, 179, 179, 179, 179, 180, 179, 179, 178, 178, 178, 178, 178, 178, 179, 180, 180, 181, 182, 183, 184, 184, 185, 186, 188, 190, 193, 196, 198, 201, 203, 203, 202, 200, 199, 198, 197, 198, 199, 200, 202, 205, 206, 205, 203, 199, 195, 191, 188, 187, 186, 185, 185, 185, 185, 185, 185, 185, 185, 184, 184, 184, 184, 185, 185, 186, 185, 185, 187, 188, 191, 195, 199, 202, 205, 206, 206, 204, 201, 198, 197, 195, 195, 198, 202, 206, 208, 207, 204, 201, 199, 196, 195, 195, 194, 194, 195, 196, 198, 201, 204, 206, 207, 206, 204, 201, 199, 198, 198, 198, 199, 201, 201, 202, 201, 199, 196, 194, 192, 190, 188, 185, 185, 184, 184, 183, 182, 182, 181, 180, 181, 181, 182, 182, 183]
5325A83%J%JJKKJLLML%jlllj%JLMK%jllmljjjjjjj%j%j%j%%%J%%%%%%%%J%%%J%j%%%j%j%%
5318A79J%%%%%kJ%J%Jj%J%J%J%jj%jJ%%%j%jJJj%J%%j%j%%%%%jJJ%jJ%%j%%K%j%%%%%%jj%
5311A78%KKJjjjj%%jJJ%J%Jj%j%%JJ%k%%%Jj%jJ%%J%%%%%jJ%J%%j%%%J%J%%%jj%%J%%%jjj
5303A79J%%%%%%J%%%kj%%J%%%JJjjJ%j%%%%%%jJ%%%J%%%%%%%%j%JJ%Jjjjj%%%%JJJJJJ%jj
5296A82j%%%J%Jj%%j%j%j%J%J%%%%J%j%JJ%%j%JJJ%Jjkj%JJ%j%jj%JJ%kk%%JJ%J%JJJJjkj
5289A82%%JJ%%j%%%JJJjjjj%j%%%%%%%%%JjJJJ%J%%J%%%%%jjjJ%%JJjjJ%%J%j%jk%%JjjJJ
5282A83%%J%%J%%Jjj%%%%j%j%kjjJJ%JKK%K%kklj%%JJKJ%%j%j%%j%jj%KLLJJ%kjjjjj%%KK
5274A86J%j%kjjj%%JKLKKJ%jk%%jjjkkjjKKNMKkmmmk%KLLLKjjllmkj%JJJJKKJ%ljjJ%JJ%K
$$ y = [183, 183, 184, 184, 185, 186, 188, 190, 191, 194, 197, 201, 204, 204, 203, 200, 197, 194, 193, 193, 194, 197, 201, 203, 203, 202, 199, 196, 192, 189, 188, 187, 186, 185, 184, 183, 182, 182, 181, 181, 180, 180, 179, 179, 179, 179, 180, 180, 180, 180, 180, 180, 180, 180, 180, 181, 181, 181, 181, 182, 182, 181, 181, 181, 181, 180, 180, 179, 179, 179, 180, 180, 180, 180, 180, 180, 178, 179, 179, 180, 180, 181, 180, 180, 181, 181, 182, 182, 183, 183, 182, 181, 181, 180, 181, 181, 181, 181, 180, 180, 179, 180, 181, 180, 180, 181, 181, 181, 180, 180, 179, 179, 179, 179, 179, 179, 178, 179, 180, 180, 179, 180, 180, 180, 179, 179, 179, 181, 181, 180, 180, 180, 180, 180, 180, 180, 179, 178, 178, 178, 180, 182, 183, 182, 181, 180, 179, 179, 179, 178, 179, 180, 180, 181, 181, 182, 181, 181, 180, 180, 180, 181, 182, 182, 180, 180, 180, 180, 181, 180, 180, 179, 180, 180, 180, 181, 181, 181, 181, 181, 181, 180, 181, 181, 182, 182, 182, 181, 181, 181, 181, 182, 182, 183, 183, 183, 183, 182, 181, 181, 181, 182, 182, 182, 182, 181, 180, 179, 180, 180, 180, 180, 180, 180, 180, 181, 181, 181, 181, 179, 178, 178, 178, 179, 179, 179, 179, 180, 181, 180, 179, 180, 180, 179, 179, 179, 179, 179, 179, 179, 178, 179, 179, 179, 179, 180, 180, 180, 180, 180, 180, 180, 180, 180, 179, 179, 180, 181, 181, 182, 181, 180, 179, 178, 178, 178, 178, 178, 179, 180, 181, 182, 183, 184, 184, 183, 182, 181, 181, 181, 181, 182, 182, 183, 182, 182, 182, 181, 181, 180, 180, 179, 179, 180, 180, 181, 181, 181, 181, 181, 182, 182, 181, 181, 182, 183, 183, 183, 182, 182, 183, 184, 185, 185, 186, 185, 183, 182, 182, 183, 184, 184, 183, 183, 182, 181, 181, 182, 183, 183, 181, 179, 179, 179, 180, 181, 181, 182, 182, 183, 184, 185, 186, 185, 183, 182, 182, 182, 183, 184, 184, 184, 183, 183, 183, 183, 184, 185, 186, 185, 184, 183, 182, 182, 181, 181, 181, 181, 181, 181, 181, 181, 181, 181, 182, 181, 182, 183, 184, 184, 185, 185, 185, 186, 186, 186, 186, 186, 186, 185, 184, 183, 184, 184, 184, 185, 186, 185, 184, 185, 185, 185, 186, 186, 185, 185, 184, 182, 182, 182, 183, 182, 181, 182, 183, 183, 183, 184, 184, 184, 185, 185, 185, 186, 185, 184, 184, 184, 184, 184, 183, 183, 182, 182, 180, 179, 178, 179, 180, 180, 181, 183, 185, 185, 187, 187, 185, 183, 180, 179, 179, 179, 180, 181, 183, 184, 184, 184, 183, 183, 182, 182, 182, 181, 181, 180, 179, 179, 181, 184, 187, 188, 189, 189, 187, 186, 185, 184, 183, 182, 182, 182, 184, 186, 187, 187, 186, 186, 184, 183, 182, 181, 181, 181, 182, 184, 187, 189, 191, 192, 192, 191, 189, 189, 189, 188, 187, 186, 184, 182, 181, 180, 182, 184, 189, 193, 195, 193, 189, 185, 181, 179, 179, 181, 184, 187, 190, 192, 191, 190, 187, 184, 180, 178, 177, 177, 178, 179, 180, 181, 183, 185, 186, 186, 183, 182, 181, 182, 182, 183, 184, 184, 186]
5267A86JJJJK%%j%j%kk%KMMLK%kj%jjkkj%JKJLK%%kklkjJLMNNL%%j%k%JLLLMLLLJKLKNOOQ
5260B64RRQOMLKMOPRJ2J1J2J1J2J2J3J9K4L1L6M5N7P3R3J18J57K08K82L84N11O53P66P90N79
5256E240P4m28o42n94m05j63Q3L21N19O34N68J76l99p76q50p45n76m18k90j94j31r0o5n1l9
5253G59k8j5mQK0L3M5O0P8J01J31J74K36L22M33N65O93P66O87L25k02n51o15m86k71l3K04
5250C435M21N78O20M05j02n89p83p36n71l84k15o2P5K13L56N12O48P21O17K08l13o07o21m67
5248C359k43rK17M16N49N54K92k12o41p93p39n95m43l15k18j50j04p6n9m7l6k5j4%J0K3L6
5245G37M9O4Q1J06J40J93K72L74N02O37P38P33M65n8m99o38n53l54j21J10L30M99N81M69M9
5242D906m72p61p86o70n09l70k59j81j28r5p5n8m7l8l0k3j6j3j1j0j1j1j2j2j2j0pomljlm
$$ y = [186, 187, 188, 189, 190, 192, 192, 192, 191, 191, 190, 190, 188, 186, 186, 188, 192, 196, 199, 201, 201, 199, 198, 198, 197, 196, 194, 192, 191, 191, 192, 194, 195, 198, 200, 200, 200, 198, 196, 193, 191, 190, 191, 194, 198, 203, 208, 211, 211, 211, 210, 210, 208, 208, 209, 212, 215, 218, 222, 225, 228, 231, 232, 234, 237, 239, 244, 250, 256, 264, 273, 282, 290, 296, 300, 303, 305, 309, 315, 322, 331, 343, 354, 366, 377, 389, 401, 414, 433, 457, 488, 524, 569, 626, 699, 792, 910, 1067, 1275, 1557, 1941, 2452, 3105, 3871, 4661, 5240, 5314, 4886, 4244, 3650, 3245, 3082, 3165, 3486, 4005, 4639, 5207, 5383, 4984, 4208, 3358, 2613, 2037, 1619, 1329, 1135, 1004, 914, 849, 798, 759, 731, 716, 712, 720, 740, 773, 818, 878, 956, 1057, 1188, 1362, 1598, 1920, 2353, 2918, 3611, 4377, 5064, 5389, 5187, 4636, 4021, 3535, 3264, 3231, 3435, 3856, 4434, 5054, 5459, 5357, 4768, 3985, 3249, 2678, 2294, 2079, 2017, 2092, 2305, 2661, 3173, 3821, 4542, 5159, 5367, 5054, 4447, 3826, 3359, 3116, 3107, 3324, 3740, 4289, 4843, 5135, 4923, 4282, 3489, 2750, 2155, 1712, 1397, 1179, 1029, 925, 849, 790, 743, 707, 682, 668, 668, 678, 701, 737, 786, 850, 931, 1037, 1177, 1370, 1642, 2016, 2518, 3155, 3893, 4626, 5091, 5033, 4534, 3896, 3343, 2989, 2868, 2978, 3308, 3807, 4388, 4857, 4906, 4434, 3673, 2887, 2217, 1708, 1338, 1079, 898, 770, 675, 600, 542, 495, 457, 427, 404, 388, 375, 364, 354, 343, 332, 320, 308, 296, 286, 279, 273, 269, 266, 265, 262, 258]
5239B58nnlmnlllmk%KJJ%%%%jkmmm%jJLNKjjkmmmkkjKLKJjkklklk%j%%KKJKKJ%kklkkJ%JK
5231A94JJJK%%kkkjjj%KLKKK%jjlllkkj%JKLKJ%kmnmkJLKKJK%jklkk%%J%jJJKLJ%jkjk%%J
5224A81JJJ%J%j%%%jkkkJKKKKJjkkjj%%%J%%j%JJ%%%J%j%jKJ%J%j%jkjjk%j%j%JJ%%%%%%j
5217A76%%%%J%%J%%%jj%%%%%j%jj%jJJJ%%%%J%%J%%J%%J%%JjJjkjj%J%%%%j%%JJ%%j%jJ%%
5210A76%%%j%JJ%JJ%JJj%jj%%JJJk%%j%j%%j%%%JJJJKLJj%jj%%JJJ%%%jk%j%%jjJ%%jjj%j
5202A77%%JJLJ%k%jJJJKJ%%%%%%%J%%j%%kkjkjj%J%JJJKKJjkj%%J%KJJJjjjk%J%jjj%j%%j
5195A79%jjJJ%%%JJ%J%J%J%JJjjj%%%J%%j%%%j%%j%j%j%%%%Jjj%JJ%%jkJK%%%%%jj%JJJ%%
5188A81%%JJ%KJJKLMMPJ0J5K1K6L0K9J7pk5l3k9k3j8j2qnmljkk%j%j%J%%jkj%J%jjjJ%j%%
$$ y = [258, 253, 248, 245, 241, 236, 233, 230, 227, 223, 221, 221, 223, 224, 225, 225, 225, 225, 225, 224, 222, 218, 214, 210, 210, 209, 210, 213, 218, 220, 219, 218, 216, 212, 208, 204, 202, 200, 199, 201, 204, 206, 207, 206, 204, 202, 199, 197, 194, 192, 192, 191, 191, 191, 193, 195, 196, 198, 200, 201, 201, 199, 197, 194, 192, 190, 191, 191, 192, 194, 195, 196, 197, 199, 199, 199, 197, 195, 193, 192, 191, 190, 190, 192, 195, 197, 199, 201, 201, 200, 199, 196, 193, 190, 188, 186, 185, 185, 186, 188, 191, 193, 194, 194, 192, 188, 183, 179, 177, 178, 181, 183, 185, 186, 188, 188, 187, 185, 182, 180, 178, 178, 178, 179, 179, 178, 179, 180, 182, 185, 186, 186, 185, 183, 182, 180, 180, 180, 181, 182, 183, 184, 184, 185, 185, 184, 184, 184, 184, 183, 181, 179, 177, 178, 180, 182, 184, 186, 187, 186, 184, 182, 181, 180, 180, 180, 180, 181, 181, 181, 180, 180, 181, 182, 182, 182, 182, 183, 183, 182, 182, 181, 183, 184, 184, 185, 185, 184, 184, 183, 181, 180, 179, 177, 177, 176, 176, 175, 175, 176, 177, 177, 177, 177, 177, 177, 177, 176, 176, 176, 176, 176, 177, 177, 177, 178, 178, 178, 178, 177, 176, 176, 176, 176, 176, 176, 175, 175, 174, 173, 173, 172, 173, 174, 175, 175, 175, 175, 175, 176, 176, 176, 177, 177, 177, 178, 178, 178, 179, 179, 179, 180, 179, 180, 179, 177, 176, 175, 175, 176, 176, 176, 176, 176, 175, 175, 175, 176, 177, 177, 177, 176, 176, 175, 176, 176, 176, 176, 176, 176, 175, 175, 176, 177, 177, 178, 179, 179, 180, 181, 180, 180, 179, 178, 178, 178, 179, 180, 181, 179, 179, 179, 178, 178, 177, 177, 177, 176, 176, 176, 176, 177, 178, 179, 180, 182, 185, 186, 185, 185, 184, 183, 183, 183, 184, 185, 186, 186, 186, 186, 185, 183, 183, 182, 182, 182, 181, 180, 181, 181, 181, 180, 179, 178, 178, 177, 177, 177, 178, 179, 182, 183, 183, 181, 181, 180, 181, 182, 183, 185, 186, 186, 186, 186, 186, 186, 186, 186, 187, 187, 187, 186, 186, 186, 184, 182, 181, 179, 178, 177, 177, 178, 178, 179, 180, 181, 183, 185, 186, 185, 183, 182, 182, 182, 183, 183, 185, 186, 187, 188, 187, 186, 185, 183, 183, 184, 184, 183, 182, 181, 181, 180, 180, 180, 179, 179, 178, 177, 178, 179, 179, 179, 179, 180, 181, 181, 182, 182, 183, 183, 184, 184, 185, 186, 185, 184, 183, 183, 183, 183, 184, 184, 184, 183, 183, 183, 183, 182, 182, 182, 181, 181, 180, 180, 179, 179, 179, 179, 179, 180, 179, 178, 178, 179, 180, 180, 180, 179, 177, 178, 180, 180, 180, 180, 180, 180, 179, 178, 178, 179, 180, 181, 181, 181, 181, 181, 182, 183, 183, 185, 186, 187, 189, 192, 196, 200, 207, 217, 232, 253, 279, 309, 338, 355, 348, 323, 290, 261, 238, 220, 208, 200, 195, 191, 188, 187, 185, 183, 183, 182, 182, 181, 181, 182, 182, 182, 181, 179, 178, 178, 179, 179, 178, 177, 176, 177, 177, 176, 176, 176]
5182A76%%j%%%J%%%J%J%J%jjjj%%%J%%j%%jJJJJj%%jJ%JJj%%%jjJ%JJJJ%k%%%%%j%j%JK%j
5174A79%j%%%JJJJ%%%JKKKKLKKKKjkjjj%JLKK%klnmlkkk%J%%%j%%%J%JKJKKJ%LKLLLMK%ll
5167B05kkJKKLLK%klmjjljjJJKKLJ%kkllj%JKKKJjlnllkk%jJ%%%%%%%J%%J%%JKKLLLNNMMJ
5160B21jjk%jJLMK%%kmlkllkkjjjkkkkljjjjjj%J%%jjk%%%%j%%%%Jjj%JJj%%jJKJJ%JJ%JJ
5152A89JKKLKK%Jjkllkjjkjkjjj%%%JKJj%%jjJ%%%j%J%%%%%jjj%JJ%%%Jj%j%JKJJKKJJJJK
5145A96KKKJJ%J%Jjjkllkkkjj%%%Jjjjjjj%j%jJ%JjjkJ%J%%%%j%%%%%%J%%%%%%%KJJ%%J%%
5138A86jj%%J%JJJJKJJ%%jjkjjkjjj%j%%%%%%j%j%%%J%%%%%%Jj%jj%%%%JJ%jJj%%%%jj%jl
5130A73kk%KKJJJJJj%%%%%%%%JKKJjjkk%JJK%%%%%j%%%jj%%JJ%j%JJKJ%jjj%J%J%j%%jj%j
$$ y = [176, 176, 176, 175, 175, 175, 175, 176, 176, 176, 176, 177, 177, 178, 178, 179, 179, 178, 177, 176, 175, 175, 175, 175, 176, 176, 176, 175, 175, 175, 174, 175, 176, 177, 178, 177, 177, 177, 176, 177, 177, 178, 179, 178, 178, 178, 178, 177, 176, 177, 177, 178, 179, 180, 181, 181, 179, 179, 179, 179, 179, 179, 178, 178, 177, 177, 178, 180, 180, 179, 179, 178, 178, 178, 178, 179, 180, 181, 182, 182, 182, 182, 183, 185, 187, 189, 191, 194, 196, 198, 200, 202, 201, 199, 198, 197, 196, 196, 197, 200, 202, 204, 204, 202, 199, 194, 190, 187, 185, 183, 181, 181, 182, 182, 182, 182, 181, 181, 181, 181, 182, 182, 183, 185, 186, 188, 190, 191, 191, 194, 196, 199, 202, 205, 209, 211, 211, 208, 205, 203, 201, 202, 204, 206, 209, 212, 214, 214, 212, 209, 205, 204, 203, 200, 199, 198, 199, 200, 202, 204, 207, 208, 208, 206, 204, 201, 198, 197, 197, 198, 200, 202, 204, 205, 204, 201, 196, 193, 190, 188, 186, 186, 185, 186, 186, 186, 186, 186, 186, 186, 186, 187, 187, 187, 188, 188, 188, 189, 191, 193, 196, 199, 202, 207, 212, 216, 220, 221, 220, 219, 217, 217, 216, 217, 220, 224, 226, 226, 226, 224, 220, 217, 215, 212, 209, 207, 205, 204, 203, 202, 200, 198, 196, 194, 191, 190, 189, 188, 187, 186, 185, 185, 186, 186, 186, 185, 184, 182, 182, 182, 182, 182, 181, 181, 181, 181, 181, 182, 181, 180, 180, 181, 182, 181, 181, 181, 180, 181, 183, 184, 185, 185, 186, 187, 187, 188, 189, 190, 192, 194, 197, 199, 201, 201, 202, 201, 199, 196, 193, 191, 190, 189, 187, 186, 184, 183, 182, 181, 181, 181, 181, 182, 184, 185, 184, 184, 184, 183, 182, 183, 183, 183, 183, 182, 182, 183, 183, 183, 183, 183, 183, 182, 181, 180, 180, 181, 182, 182, 182, 182, 183, 182, 182, 181, 181, 182, 184, 185, 186, 188, 190, 191, 192, 193, 194, 196, 198, 200, 202, 203, 204, 204, 205, 205, 206, 205, 204, 202, 199, 196, 194, 192, 190, 189, 188, 188, 188, 188, 189, 188, 187, 186, 185, 184, 183, 183, 182, 182, 181, 182, 182, 183, 182, 181, 179, 180, 180, 181, 181, 181, 181, 181, 180, 180, 180, 180, 180, 180, 180, 181, 181, 181, 181, 181, 181, 181, 181, 183, 184, 185, 185, 185, 186, 186, 186, 185, 184, 184, 184, 185, 185, 186, 187, 188, 189, 191, 192, 193, 193, 193, 192, 191, 189, 188, 187, 185, 184, 183, 182, 182, 181, 181, 181, 181, 181, 181, 181, 180, 180, 179, 179, 179, 179, 180, 180, 180, 180, 180, 180, 180, 181, 180, 180, 179, 178, 178, 178, 178, 178, 179, 180, 180, 179, 180, 179, 179, 179, 179, 179, 178, 177, 177, 176, 173, 171, 169, 169, 171, 173, 174, 175, 176, 177, 178, 177, 177, 177, 177, 177, 177, 177, 177, 177, 178, 180, 182, 183, 182, 181, 179, 177, 177, 178, 179, 181, 181, 181, 181, 181, 181, 180, 180, 180, 180, 179, 178, 178, 178, 179, 180, 180, 179, 179, 180, 181, 183, 184, 184, 183, 182, 181, 181, 182, 182, 183, 183, 182, 182, 182, 181, 180, 180, 179]
5123A79%jJ%J%j%jj%JJ%%J%%%jJJJJ%%%jj%%JJJ%J%kj%%kj%jj%%j%JJJJ%J%J%%J%%JJ%%JK
5116A88JJ%jjkklkj%%J%Jj%%JJ%J%%%jjJ%JJ%JJKJj%jjj%%kjjk%%J%LKLMK%jkkkjjkj%JJ%
5109A83%JJ%%%KK%JJ%jkkmlllnprn%LPJ0J0QL%llmllk%%%%JKJKkkllnlkLRJ2J3J1ONKJjkk
5102B13llllkmlmj%%KLMMLNQJ0J1J0OLkjkloj2j8k0j7j2mKMOONMLKMMOJjlmnqj1j5j8j7j0
5096A14jNRQOMMNMLJknnlJOQJ0QPOMLJ%JJ%%%%%J%%JKJJJJKLLK%JKKLLKJJKJJJKJKJKJKJK
5089B55KLKKMMOQJ1J3J3J6J4RPOQPQRJ1J3J5J7J9J9K0J9K2K5L0L3L9M6N1O0O7P8R3J12J37
5084A333J71K21K93L97N39P40J030J450K061K891L933M996N671N014K027k188n114n853n192
5082A4420m053k943k025j353r00o15m41l27k54k00j62j33j09r2p6o5n2m5l9l4l0k7k5k3k1
$$ y = [179, 179, 178, 179, 179, 180, 180, 179, 179, 178, 177, 177, 178, 179, 179, 179, 180, 180, 180, 180, 179, 180, 181, 182, 183, 183, 183, 183, 182, 181, 181, 181, 182, 183, 184, 184, 185, 185, 183, 182, 182, 182, 180, 179, 179, 178, 177, 177, 177, 176, 176, 177, 178, 179, 180, 180, 181, 181, 182, 182, 182, 183, 183, 183, 184, 185, 185, 185, 186, 188, 189, 190, 190, 189, 188, 186, 184, 181, 179, 178, 178, 178, 179, 179, 180, 179, 179, 179, 180, 181, 181, 182, 182, 182, 182, 181, 180, 181, 181, 182, 183, 183, 184, 185, 187, 188, 187, 187, 186, 185, 184, 184, 184, 182, 181, 180, 178, 178, 178, 179, 179, 182, 184, 187, 191, 193, 193, 192, 190, 188, 186, 185, 184, 182, 181, 181, 182, 183, 183, 183, 184, 185, 185, 185, 185, 187, 189, 189, 190, 191, 191, 190, 188, 186, 182, 179, 176, 173, 168, 161, 152, 147, 147, 150, 157, 167, 177, 185, 188, 188, 185, 182, 178, 175, 172, 170, 170, 170, 170, 170, 171, 173, 174, 176, 174, 172, 169, 166, 161, 158, 156, 159, 168, 180, 193, 204, 210, 215, 217, 218, 217, 215, 213, 210, 207, 204, 201, 199, 195, 192, 188, 187, 187, 187, 189, 192, 196, 200, 203, 208, 216, 226, 237, 247, 253, 256, 254, 253, 251, 248, 242, 230, 212, 192, 175, 163, 159, 161, 165, 171, 177, 182, 186, 189, 191, 195, 199, 205, 206, 205, 202, 198, 193, 185, 174, 159, 141, 124, 114, 113, 118, 127, 135, 141, 145, 149, 154, 158, 161, 162, 160, 155, 150, 147, 148, 154, 162, 172, 180, 187, 193, 197, 200, 201, 201, 202, 203, 203, 203, 203, 203, 203, 204, 204, 204, 205, 207, 208, 209, 210, 211, 213, 216, 219, 221, 221, 222, 224, 226, 229, 232, 234, 235, 236, 238, 239, 240, 241, 243, 244, 246, 247, 249, 250, 252, 253, 255, 257, 260, 262, 264, 268, 272, 278, 286, 297, 310, 323, 339, 353, 362, 369, 375, 383, 390, 398, 407, 418, 431, 446, 463, 482, 501, 521, 540, 562, 587, 617, 650, 689, 735, 786, 846, 913, 991, 1084, 1196, 1333, 1504, 1725, 2018, 2415, 2954, 3694, 4724, 6174, 8235, 11126, 15059, 20055, 25726, 30740, 32767, 30579, 25465, 19612, 14420, 10367, 7424, 5399, 4046, 3146, 2531, 2090, 1763, 1509, 1309, 1147, 1014, 905, 813, 737, 672, 620, 575, 536, 502, 472, 445, 420, 397, 376]
5080C76j9j6j4j0qqpj0j0j0rpm%LOOOKklmmmmmmllnkjjlklllkjkKJJJ%jkj%KJJ%jkjj%%jj
5073B02j%%Jkk%JJLLOQRQPKjnonlJKNNNMMOM%oj3j7j6j1pmjjjjJMMLJJLNONLjpj3j7k0j8j3
5067A31okjk%KPRJ1J2RONMLLJ%klmnnlllkmlljJLMQJ2J4J2QJmommmmjKLKJJjlkjkkkkkJNR
5060A94RRN%loppmjjjlk%%%%%%j%%jJ%%%JJ%%kkkkjlljKKLKJKJK%jjk%j%%kk%%jKJKJJj%%
5052A78%%%J%J%%%j%%J%%%jkkklkjj%%JK%J%jJJJJJ%JJ%JJ%JJJ%j%%kjjk%%j%KJKKKJLNLL
5045A97JKjkkjJ%LKJ%jlmlllkkjjj%%JJJj%j%%J%%%%JJKKLKMLLK%kk%KKKJJjlmlkk%JKKMK
5038B02J%jllj%KLJKJkmklljkjj%KJJ%%kkkj%j%%%jJJJJLLLLKJKjkkk%KKK%jllmlkkjkjjj
5031A76JJJ%j%%j%jj%%%J%%%J%J%JJ%j%jj%jKJjjj%%%%j%%jJJJ%jjJ%%J%%JJ%%j%%%%%%%%
$$ y = [376, 357, 341, 327, 317, 309, 301, 294, 284, 274, 264, 255, 248, 244, 244, 247, 253, 259, 265, 267, 265, 262, 258, 254, 250, 246, 242, 238, 235, 232, 227, 225, 224, 223, 220, 218, 215, 212, 209, 207, 206, 204, 206, 207, 208, 209, 209, 208, 206, 205, 205, 207, 208, 209, 209, 208, 206, 205, 204, 204, 204, 203, 202, 201, 201, 201, 202, 200, 198, 198, 199, 200, 203, 206, 212, 220, 229, 237, 244, 246, 245, 240, 234, 229, 226, 227, 229, 234, 239, 244, 248, 252, 258, 262, 262, 256, 243, 226, 210, 199, 192, 188, 187, 186, 185, 184, 185, 189, 193, 196, 197, 198, 201, 206, 212, 217, 220, 219, 212, 199, 182, 162, 144, 131, 125, 123, 122, 120, 120, 122, 129, 138, 149, 161, 170, 176, 181, 185, 188, 191, 192, 192, 190, 187, 183, 178, 173, 170, 167, 164, 162, 158, 155, 152, 151, 152, 155, 159, 167, 179, 193, 205, 213, 214, 210, 204, 200, 196, 192, 188, 187, 189, 192, 194, 195, 196, 195, 192, 190, 189, 187, 185, 183, 181, 179, 180, 185, 194, 203, 212, 217, 217, 214, 208, 201, 194, 190, 189, 188, 187, 184, 182, 182, 182, 182, 182, 182, 182, 181, 181, 181, 180, 181, 181, 181, 181, 182, 183, 183, 183, 181, 179, 177, 175, 174, 171, 168, 167, 169, 171, 174, 176, 177, 179, 180, 182, 182, 181, 180, 178, 178, 177, 177, 177, 175, 173, 173, 173, 172, 174, 175, 177, 178, 179, 178, 178, 178, 178, 178, 178, 179, 179, 180, 180, 180, 180, 179, 179, 179, 180, 180, 180, 180, 179, 177, 175, 173, 170, 168, 167, 166, 166, 166, 167, 169, 169, 170, 170, 169, 170, 171, 172, 173, 174, 174, 175, 176, 176, 177, 178, 178, 179, 180, 181, 181, 180, 180, 180, 178, 177, 176, 174, 174, 174, 173, 173, 175, 176, 178, 180, 182, 183, 186, 191, 194, 197, 198, 200, 199, 197, 195, 194, 195, 195, 198, 200, 201, 201, 200, 197, 193, 190, 187, 184, 182, 180, 179, 178, 177, 177, 177, 178, 179, 180, 179, 179, 178, 178, 178, 179, 179, 179, 179, 179, 180, 181, 183, 185, 188, 190, 194, 197, 200, 202, 202, 200, 198, 198, 200, 202, 204, 205, 206, 205, 202, 198, 195, 193, 191, 191, 192, 194, 196, 200, 202, 203, 203, 202, 199, 196, 195, 195, 197, 200, 201, 203, 204, 202, 198, 196, 193, 190, 189, 187, 186, 185, 185, 187, 188, 189, 189, 189, 187, 185, 183, 182, 182, 181, 181, 181, 181, 180, 181, 182, 183, 184, 187, 190, 193, 196, 198, 199, 201, 200, 198, 196, 194, 194, 196, 198, 200, 200, 199, 196, 193, 189, 186, 184, 182, 181, 179, 178, 177, 176, 177, 178, 179, 179, 178, 178, 178, 177, 177, 176, 175, 175, 175, 175, 176, 176, 176, 176, 177, 177, 178, 178, 179, 180, 180, 179, 179, 178, 177, 177, 176, 178, 179, 178, 177, 176, 176, 176, 176, 176, 175, 175, 175, 174, 175, 176, 177, 177, 176, 175, 176, 176, 176, 177, 177, 177, 178, 179, 179, 179, 178, 178, 178, 178, 178, 178, 178, 178, 178]
5023A78J%%%j%j%j%%j%k%JJKJ%%%%j%j%%%%%%J%j%j%J%%J%J%kjJJJ%%j%%%%%J%%%%%%j%%%
5016A77J%%%%%kjJ%%%JK%%j%kjJ%%J%J%%%%%JJ%j%jj%jjj%j%J%JJJ%%Jj%%JJ%jj%J%%J%j%
5009A78jJJ%%jj%%J%%Jkj%%%jJJJJj%%jJJjj%jJKJjjj%%JJjj%%J%J%jj%%%%%J%J%j%%JJ%j
5001A79%%JJ%jjjj%%%%%%%%%%%%%%%%%J%jJ%%J%JJj%%jj%KJ%j%%J%JJj%kk%%j%JJ%J%jj%%
4994A78%%JJJJJ%%%%%%%%%j%j%jJJJJ%J%j%jjj%j%J%%%J%%jjJJJJ%%j%j%jkjj%%%%JJ%J%%
4987A80jjjjJJJJJ%JJjj%%%j%%j%JKL%%%j%%%%JKjjkj%j%%j%%%JjJKKJKJ%J%J%kkjjjj%JJ
4979A85J%%jjjjJKLMKJJJjjjJJMPJ2J8K3K8L1K6Qj4k8l1k6k0j4rokllkk%jk%%%%%jJKLLL%
4973B01%%J%%jlllm%JLL%%kll%KKLLKLJJ%jjj%jLLKLJKMMMMMMMMQPRRQQOLLLMMQPJ2J1J3J0
$$ y = [178, 179, 179, 179, 179, 178, 178, 177, 177, 176, 176, 176, 175, 175, 173, 173, 174, 175, 177, 178, 178, 178, 178, 178, 177, 177, 176, 176, 176, 176, 176, 176, 176, 177, 177, 176, 176, 175, 175, 176, 176, 176, 177, 177, 178, 178, 176, 175, 176, 177, 178, 178, 178, 177, 177, 177, 177, 177, 177, 178, 178, 178, 178, 178, 178, 178, 177, 177, 177, 177, 178, 178, 178, 178, 178, 178, 176, 175, 176, 176, 176, 176, 177, 179, 179, 179, 178, 178, 176, 175, 176, 176, 176, 177, 177, 178, 178, 178, 178, 178, 178, 179, 180, 180, 179, 179, 178, 177, 177, 176, 175, 174, 174, 173, 173, 174, 174, 175, 176, 177, 177, 177, 178, 177, 177, 177, 178, 179, 179, 178, 177, 177, 178, 178, 178, 179, 179, 178, 178, 177, 178, 179, 179, 179, 178, 177, 177, 177, 178, 178, 178, 179, 177, 176, 176, 176, 176, 175, 176, 177, 178, 179, 178, 178, 178, 177, 178, 179, 178, 177, 177, 176, 177, 179, 180, 179, 178, 177, 177, 177, 178, 179, 178, 177, 177, 177, 178, 178, 179, 179, 178, 177, 177, 177, 177, 177, 177, 178, 178, 179, 179, 178, 178, 178, 179, 180, 180, 179, 179, 179, 180, 181, 181, 180, 179, 178, 177, 177, 177, 177, 177, 177, 177, 177, 177, 177, 177, 177, 177, 177, 177, 177, 177, 177, 178, 178, 177, 178, 178, 178, 179, 179, 180, 181, 180, 180, 180, 179, 178, 178, 180, 181, 181, 180, 180, 180, 181, 181, 182, 183, 182, 182, 180, 178, 178, 178, 177, 177, 178, 179, 179, 180, 180, 179, 178, 178, 178, 178, 178, 179, 180, 181, 182, 183, 183, 183, 183, 183, 183, 183, 183, 183, 183, 182, 182, 181, 181, 180, 181, 182, 183, 184, 184, 185, 185, 184, 184, 183, 182, 181, 181, 180, 180, 181, 181, 181, 181, 182, 182, 182, 181, 180, 181, 182, 183, 184, 184, 184, 183, 183, 182, 182, 181, 179, 178, 177, 177, 177, 177, 177, 178, 179, 179, 180, 180, 180, 179, 178, 177, 176, 177, 178, 179, 180, 181, 181, 182, 183, 182, 181, 181, 181, 181, 180, 180, 180, 179, 179, 180, 182, 185, 185, 185, 185, 184, 184, 184, 184, 184, 185, 187, 186, 185, 183, 182, 182, 181, 181, 181, 180, 180, 180, 180, 181, 180, 181, 183, 185, 186, 188, 189, 189, 190, 190, 191, 191, 189, 187, 186, 185, 184, 183, 183, 184, 185, 186, 186, 186, 185, 184, 183, 182, 183, 185, 188, 192, 194, 195, 196, 197, 196, 195, 194, 195, 196, 200, 207, 219, 237, 260, 288, 319, 345, 353, 339, 311, 280, 254, 234, 220, 211, 205, 203, 200, 197, 195, 193, 193, 192, 190, 190, 190, 190, 190, 190, 189, 190, 192, 195, 198, 201, 201, 201, 201, 202, 202, 202, 201, 198, 195, 192, 188, 188, 189, 192, 195, 195, 195, 193, 190, 187, 187, 189, 191, 194, 197, 199, 202, 203, 204, 204, 203, 202, 201, 201, 200, 203, 206, 208, 211, 212, 214, 218, 222, 226, 230, 234, 238, 242, 246, 254, 261, 270, 279, 287, 295, 301, 304, 307, 310, 314, 318, 326, 333, 345, 356, 369, 379]
4966C79J0J3J6K0K3K8L6M6N8P4R6J26J64K18K93L97N27O70P83P94N61O5l87n45m47k12O5L24
4963D195N04N20K24l15p36q58p77o13m53l21k19j49j00p0m9l7k8k3j9j1mPJ5K8L6M7N9P3R7
4960A023J25J62K18K95M01N32O70P70P57M98J0m00n22m04j66J06L57N24N15J94l27o93p60
4958C885o37m35k28k7J71L65N49O88P24N14K9m24n80m79k42L2K86M62M78K09k93o95q21p51
4955B780o01m48l20k24j56j10q0n8m3l3k7k5j7qKJ1K0K8L7M7O1Q4J11J51K04K81L86N15O56
4952C224P62P61N05nm34n58m38j97P5L18M80M73J62l56p33q27p36n77m24l01k08j47j05p8
4950F36o2n1m1l4k8k3j8j2rpoj0j1j4j1j0qnmmpqpoklkklkljJKKJjj%jjjkklmljj%KKKJJ%
4944B15jlnmkjKLKjknnnlj%JJ%JJKLKKJjkjjjjjkjj%KJJJJJ%JJjk%%%JKLjklmmmk%%%KKKL
$$ y = [379, 389, 402, 418, 438, 461, 489, 525, 571, 629, 703, 799, 925, 1089, 1307, 1600, 1997, 2524, 3194, 3977, 4771, 5332, 5397, 5010, 4465, 4018, 3806, 3871, 4195, 4699, 5219, 5443, 5128, 4392, 3534, 2757, 2144, 1691, 1370, 1151, 1002, 902, 832, 783, 746, 718, 695, 676, 665, 661, 668, 683, 711, 747, 794, 853, 926, 1023, 1148, 1310, 1528, 1823, 2224, 2756, 3426, 4196, 4953, 5451, 5461, 5061, 4539, 4135, 3969, 4075, 4432, 4956, 5471, 5665, 5338, 4645, 3885, 3248, 2813, 2585, 2558, 2729, 3094, 3643, 4331, 5055, 5569, 5598, 5174, 4594, 4115, 3873, 3905, 4191, 4653, 5131, 5340, 5047, 4352, 3531, 2780, 2179, 1731, 1411, 1187, 1031, 921, 841, 783, 740, 707, 680, 655, 638, 630, 632, 643, 663, 691, 728, 775, 836, 920, 1031, 1182, 1386, 1667, 2053, 2568, 3224, 3986, 4747, 5252, 5247, 4813, 4255, 3817, 3620, 3695, 4013, 4493, 4966, 5128, 4772, 4039, 3212, 2476, 1899, 1475, 1174, 966, 819, 714, 636, 574, 523, 482, 448, 420, 397, 379, 367, 358, 351, 345, 335, 324, 310, 299, 289, 281, 276, 272, 268, 261, 253, 246, 240, 238, 235, 233, 231, 228, 226, 223, 222, 223, 225, 227, 228, 227, 226, 226, 225, 224, 223, 221, 219, 216, 212, 209, 208, 207, 207, 209, 211, 213, 214, 215, 215, 214, 211, 206, 202, 200, 199, 201, 204, 206, 205, 203, 198, 193, 188, 185, 184, 184, 185, 186, 186, 187, 188, 190, 193, 195, 197, 198, 197, 195, 194, 193, 192, 191, 190, 188, 187, 186, 186, 188, 189, 190, 191, 192, 193, 193, 194, 195, 194, 192, 192, 192, 192, 193, 195, 198, 197, 195, 192, 188, 184, 180, 178, 178, 178, 178, 180, 182, 184, 187]
4936A87Jjkjkjj%%JJJjlkkj%jjJJKKKJJ%%jjj%Jj%%j%%j%JJ%%jjkjJJKKJJJjkkkjjJjJJ%J
4929A77JJJJJjjj%%J%%jj%jkkj%Jj%j%%Jj%%J%%J%%%jj%%J%J%jj%%JJJ%%j%j%%J%%JJj%j%
4922A73J%%%%jJ%J%%J%%%j%j%j%j%j%j%J%%J%%%jjjJJ%JJJJj%j%%J%%%Jj%%%%%%%%%%Jjj%
4914A73j%%%%%J%JJJJ%%jjj%%%%JJ%%j%j%%jj%J%%j%jJK%jJJ%%j%j%%%j%%%%J%%%%%%%%%%
4907A73Jjjk%%%J%%%%Jj%%J%%%JJj%%%jJ%%%%%j%%%%%%%%%%J%jJ%%%%%Jj%%%%j%%%%%%%%%
4900A72Jjj%j%%%%J%%%%%%%%J%JJ%%j%j%jj%%J%J%JJ%%%%%j%j%%%%%%%J%%%%%KJJJJKj%%j
4893A79%jj%j%jj%jjjjJJ%j%%%%%%%J%JJj%%Jj%J%%%%j%%%j%%%%%%%%JJjjJ%%j%%%%%%%%%
4885A72%%%%jJ%JJjJJ%J%jjj%%JJ%%%%jJJ%J%%%%j%KJKJKJKLMN%jjkjjJJJK%lmnlkk%jj%j
$$ y = [187, 188, 187, 185, 184, 182, 181, 180, 180, 180, 181, 182, 183, 182, 179, 177, 175, 174, 174, 173, 172, 173, 174, 176, 178, 180, 181, 182, 182, 182, 181, 180, 179, 179, 180, 179, 179, 179, 178, 178, 178, 177, 177, 178, 179, 179, 179, 178, 177, 175, 174, 175, 176, 178, 180, 181, 182, 183, 182, 180, 178, 176, 175, 174, 175, 174, 175, 176, 176, 177, 178, 179, 180, 181, 182, 181, 180, 179, 179, 179, 180, 180, 180, 179, 178, 178, 177, 175, 173, 172, 172, 173, 172, 172, 171, 171, 171, 172, 171, 171, 171, 172, 172, 172, 173, 173, 173, 173, 172, 171, 171, 171, 172, 172, 173, 173, 172, 171, 171, 171, 172, 173, 174, 174, 174, 173, 173, 172, 172, 172, 173, 173, 173, 174, 175, 174, 174, 173, 173, 174, 174, 174, 174, 174, 173, 174, 174, 175, 175, 175, 176, 176, 176, 176, 175, 175, 174, 174, 173, 173, 172, 172, 171, 171, 170, 170, 171, 171, 171, 172, 172, 172, 172, 171, 170, 169, 170, 171, 171, 172, 173, 174, 175, 174, 174, 173, 173, 173, 174, 174, 174, 174, 175, 174, 174, 174, 174, 174, 174, 174, 174, 174, 174, 174, 175, 174, 173, 173, 172, 172, 172, 172, 172, 172, 173, 173, 174, 175, 176, 177, 177, 177, 176, 175, 174, 174, 174, 174, 174, 175, 176, 176, 176, 175, 175, 174, 174, 174, 173, 172, 172, 173, 173, 173, 172, 172, 171, 172, 174, 174, 173, 174, 175, 175, 175, 174, 174, 173, 173, 173, 173, 172, 172, 172, 172, 172, 173, 173, 173, 173, 173, 173, 173, 173, 173, 173, 173, 174, 173, 172, 170, 170, 170, 170, 171, 171, 171, 171, 171, 172, 171, 171, 171, 172, 172, 172, 172, 173, 174, 173, 173, 173, 173, 172, 173, 173, 173, 173, 173, 173, 172, 172, 172, 172, 172, 172, 172, 172, 172, 172, 172, 173, 173, 172, 173, 173, 173, 173, 173, 173, 174, 173, 173, 173, 173, 173, 172, 172, 172, 172, 172, 172, 172, 172, 172, 172, 173, 172, 171, 171, 170, 170, 170, 170, 170, 171, 171, 171, 171, 171, 171, 171, 171, 171, 172, 172, 173, 174, 174, 174, 173, 173, 172, 172, 171, 170, 170, 170, 171, 171, 172, 172, 173, 174, 174, 174, 174, 174, 174, 173, 173, 172, 172, 172, 172, 172, 172, 172, 172, 173, 173, 173, 173, 173, 173, 175, 176, 177, 178, 179, 181, 180, 180, 180, 179, 179, 178, 177, 177, 176, 176, 175, 174, 174, 173, 172, 171, 170, 171, 172, 172, 171, 171, 171, 171, 171, 171, 171, 171, 172, 172, 173, 174, 173, 173, 173, 174, 173, 173, 174, 174, 174, 174, 174, 173, 173, 173, 173, 172, 172, 172, 172, 172, 172, 172, 172, 172, 173, 174, 173, 172, 173, 173, 173, 172, 172, 172, 172, 172, 172, 172, 172, 172, 172, 172, 172, 172, 172, 171, 172, 172, 173, 174, 173, 174, 175, 175, 176, 176, 175, 174, 173, 173, 173, 174, 175, 175, 175, 175, 175, 174, 175, 176, 176, 177, 177, 177, 177, 177, 176, 176, 178, 179, 181, 182, 184, 185, 187, 190, 194, 199, 199, 198, 197, 195, 194, 193, 194, 195, 196, 198, 198, 195, 191, 186, 183, 181, 179, 179, 178, 177, 177, 176]
4878A76%jj%J%J%%J%%jJ%JKLKKKLMLJjkjj%KJJKjlmlkk%JKKKLK%kkjjJJKKKjllmmkkkkkj%
4871A74JJ%J%%j%%%%%%j%JJJKKMMLLKjkkj%%KKJkklmlkkjjjj%j%%J%%%%j%j%j%JJ%jjjJ%J
4863A73%jJKJj%JJj%jj%j%J%JJ%j%%%j%%j%%%%J%%j%%%%%%%%j%jJJ%%%%%j%%JJ%jkj%%%JJ
4856A72%%jJ%%%%%J%%JkjJ%%Jj%%%J%%Jj%jjJ%%%%%%%JJ%%%j%%%%jj%%J%%jJ%%%J%j%%%JJ
4849A74%%%%%j%j%J%%%%%Jkj%Jj%%%%%%%J%%%%%%J%%%%%%%%j%jjJJJJj%%%%%J%kjJJ%%%%%
4841A73%j%%jJjjJJJ%J%jjjJ%JJj%%%%%%j%%%J%J%jJjj%JJJjkj%J%%%jJ%Kjjj%%%j%%Jj%J
4834A71%J%%%%%%Jj%%%j%%j%%JJK%jj%j%J%J%J%%j%jJJj%%%%%%%%%%j%jJ%J%%%%%%%j%%%J
4827A73%%j%%jK%%%J%%%%%jjj%J%%%%%jJJ%%%jjj%%%J%Jj%%%jJJJj%%j%J%%%%j%JJ%%j%%j
$$ y = [176, 176, 175, 174, 174, 175, 175, 176, 176, 176, 177, 177, 177, 176, 177, 177, 178, 180, 183, 185, 187, 189, 192, 196, 199, 200, 199, 197, 196, 195, 195, 197, 198, 199, 201, 200, 197, 193, 190, 188, 186, 186, 187, 189, 191, 193, 196, 198, 198, 196, 194, 193, 192, 193, 194, 196, 198, 200, 199, 196, 193, 189, 185, 183, 181, 179, 177, 175, 174, 174, 175, 176, 176, 177, 177, 177, 176, 176, 176, 176, 176, 176, 176, 175, 175, 176, 177, 178, 180, 182, 186, 190, 193, 196, 198, 197, 195, 193, 192, 192, 192, 194, 196, 197, 195, 193, 190, 186, 183, 181, 179, 178, 177, 176, 175, 175, 174, 174, 174, 175, 175, 175, 175, 175, 174, 174, 173, 173, 172, 172, 173, 174, 174, 173, 172, 171, 172, 172, 173, 173, 172, 173, 175, 176, 175, 175, 176, 177, 176, 176, 175, 174, 174, 173, 173, 174, 174, 175, 176, 176, 175, 175, 175, 175, 174, 174, 174, 173, 173, 173, 173, 173, 174, 174, 174, 173, 173, 173, 173, 173, 173, 173, 173, 173, 172, 172, 171, 172, 173, 173, 173, 173, 173, 173, 172, 172, 172, 173, 174, 174, 173, 171, 170, 170, 170, 170, 171, 172, 172, 172, 171, 172, 172, 172, 172, 172, 172, 173, 173, 173, 174, 172, 171, 172, 172, 172, 173, 172, 172, 172, 172, 173, 173, 173, 174, 173, 173, 172, 171, 172, 172, 172, 172, 172, 172, 172, 172, 173, 174, 174, 174, 174, 173, 173, 173, 173, 173, 172, 171, 171, 171, 172, 172, 172, 171, 172, 172, 172, 172, 173, 173, 172, 172, 172, 172, 173, 174, 174, 174, 174, 174, 174, 173, 173, 172, 172, 173, 173, 173, 173, 173, 173, 174, 172, 171, 171, 172, 171, 171, 171, 171, 171, 171, 171, 171, 172, 172, 172, 172, 172, 172, 172, 173, 173, 173, 173, 173, 173, 173, 173, 173, 172, 172, 171, 170, 171, 172, 173, 174, 173, 173, 173, 173, 173, 173, 174, 174, 172, 171, 172, 173, 173, 173, 173, 173, 173, 173, 172, 172, 172, 171, 172, 171, 170, 171, 172, 173, 173, 174, 174, 173, 172, 171, 172, 172, 173, 174, 173, 173, 173, 173, 173, 173, 173, 172, 172, 172, 172, 173, 173, 174, 174, 173, 174, 173, 172, 172, 173, 174, 175, 174, 172, 171, 171, 172, 172, 172, 172, 171, 172, 172, 174, 173, 172, 171, 171, 171, 171, 170, 170, 170, 171, 170, 170, 171, 171, 172, 172, 172, 172, 172, 172, 172, 173, 172, 172, 172, 172, 171, 171, 171, 170, 170, 170, 171, 172, 174, 174, 173, 172, 172, 171, 171, 172, 172, 173, 173, 174, 174, 174, 173, 173, 172, 173, 174, 173, 173, 173, 173, 173, 173, 173, 173, 173, 173, 173, 172, 172, 171, 172, 172, 173, 173, 173, 173, 173, 173, 173, 173, 172, 172, 172, 172, 173, 173, 173, 172, 172, 172, 171, 173, 173, 173, 173, 174, 174, 174, 174, 174, 174, 173, 172, 171, 171, 172, 172, 172, 172, 172, 172, 171, 172, 173, 173, 173, 173, 172, 171, 170, 170, 170, 170, 171, 171, 172, 171, 171, 171, 171, 170, 171, 172, 173, 172, 172, 172, 171, 171, 172, 172, 172, 172, 172, 171, 171, 172, 173, 173, 173, 172, 172, 172, 171]
4819A71j%%J%Jj%%%KJ%%j%%%%%%%J%JJjkjjj%JJ%Jjj%J%%%%j%%J%%%%%jJ%%jJ%j%%J%%%%%
4812A72%%%kj%KJ%%%j%J%J%jjjj%jKK%jJ%%Jj%%j%%%%%%J%j%%jJJJ%kjjJJ%K%jj%JJj%%J%
4805A73j%j%%%%%%%%%%J%%J%%%%%%%%j%%JjjJJjj%%%JJj%%%j%%%j%J%%J%J%%jjjjJ%%J%%%
4798A71%%%%%J%%Jj%%%J%%J%jj%%%%%%J%%%%%%%J%%%%%%%j%%J%%%jjjJJ%jJJ%%%jjJ%J%jj
4790A72%j%%%Jj%j%%J%%%J%%%J%j%%%%j%%JK%jj%j%J%%J%jk%%%j%jJJJJ%j%%%jjJ%%%%%%%
4783A70%%J%%JJJ%%%kj%%%J%Jjjj%%%J%%%%%JJj%j%%%%J%%%j%%JJ%%jjJ%J%j%%%j%JJ%%%%
4776A73jjkJJ%%J%%%%Jj%%j%JJ%jkjJJ%%%%%J%%j%%%jJ%%%%Jj%JJj%%%J%Jjj%j%J%J%J%%j
4768A73jjj%J%%J%%%%%%J%%%%%%j%j%%%%%j%j%%%JKj%%j%%%J%%%KJjj%%%jj%%J%%J%%%%%%
$$ y = [171, 170, 170, 170, 171, 171, 172, 171, 171, 171, 171, 173, 174, 174, 174, 173, 173, 173, 173, 173, 173, 173, 173, 174, 174, 175, 176, 175, 173, 172, 171, 170, 170, 171, 172, 172, 173, 172, 171, 171, 172, 172, 172, 172, 172, 171, 171, 171, 172, 172, 172, 172, 172, 172, 171, 172, 172, 172, 171, 172, 172, 171, 171, 171, 172, 172, 172, 172, 172, 172, 172, 172, 172, 170, 169, 169, 171, 172, 172, 172, 172, 171, 171, 172, 172, 173, 173, 172, 171, 170, 169, 169, 168, 170, 172, 172, 171, 172, 172, 172, 173, 172, 172, 172, 171, 171, 171, 171, 171, 171, 171, 172, 172, 171, 171, 171, 170, 171, 172, 173, 173, 171, 170, 169, 170, 171, 171, 173, 173, 172, 171, 171, 172, 173, 172, 172, 172, 173, 173, 172, 172, 171, 171, 171, 171, 171, 171, 171, 171, 171, 171, 171, 172, 172, 172, 173, 173, 173, 173, 173, 173, 173, 173, 173, 172, 172, 172, 173, 172, 171, 172, 173, 172, 171, 171, 171, 171, 172, 173, 172, 172, 172, 172, 171, 171, 171, 171, 170, 170, 171, 171, 171, 172, 172, 173, 173, 173, 172, 171, 170, 169, 170, 170, 170, 171, 171, 171, 171, 171, 171, 171, 171, 171, 172, 172, 172, 173, 172, 172, 172, 172, 173, 173, 173, 174, 174, 173, 172, 172, 172, 172, 172, 172, 172, 173, 173, 173, 173, 173, 173, 173, 173, 174, 174, 174, 174, 174, 174, 174, 174, 173, 173, 173, 174, 174, 174, 174, 173, 172, 171, 172, 173, 173, 172, 173, 174, 174, 174, 174, 173, 172, 173, 173, 174, 174, 173, 172, 172, 171, 171, 171, 171, 172, 171, 171, 170, 170, 170, 171, 171, 171, 171, 172, 172, 172, 172, 173, 173, 172, 172, 172, 172, 172, 171, 171, 171, 172, 174, 174, 173, 172, 172, 171, 171, 172, 172, 172, 173, 173, 172, 170, 170, 170, 170, 169, 169, 168, 169, 170, 171, 172, 172, 171, 171, 171, 171, 170, 169, 170, 170, 170, 170, 170, 170, 170, 170, 170, 170, 171, 171, 171, 172, 173, 174, 174, 174, 174, 172, 171, 171, 171, 171, 172, 172, 173, 172, 171, 170, 170, 170, 170, 171, 171, 171, 171, 171, 171, 172, 173, 172, 172, 171, 171, 171, 171, 171, 172, 172, 172, 172, 171, 171, 171, 172, 173, 173, 173, 172, 171, 172, 172, 173, 173, 172, 172, 172, 172, 171, 171, 172, 173, 173, 173, 173, 173, 172, 171, 169, 170, 171, 171, 171, 172, 172, 172, 172, 172, 173, 172, 172, 172, 171, 171, 172, 173, 173, 172, 170, 169, 170, 171, 171, 171, 171, 171, 171, 172, 172, 172, 171, 171, 171, 171, 170, 171, 171, 171, 171, 171, 172, 171, 171, 172, 173, 172, 172, 172, 172, 173, 173, 174, 173, 172, 172, 171, 171, 172, 172, 173, 173, 174, 174, 174, 173, 172, 171, 170, 170, 171, 171, 171, 172, 172, 172, 172, 172, 172, 172, 173, 173, 173, 173, 173, 173, 173, 172, 172, 171, 171, 171, 171, 171, 171, 170, 170, 169, 169, 169, 169, 170, 172, 171, 171, 171, 170, 170, 170, 170, 171, 171, 171, 171, 173, 174, 173, 172, 172, 172, 172, 171, 170, 170, 170, 171, 171, 171, 172, 172, 172, 172, 172, 172, 172]
4761A72jjjjJJJJ%%jjJ%j%j%JJ%%%%j%%JJ%%jJK%j%J%%%Jjj%j%j%JK%%%%%%jj%j%%%%%%%%
4754A71JjjJ%J%J%J%%j%j%%Jj%J%%j%%J%%J%%%j%%jJjj%J%%J%%%jj%%%jJ%J%J%J%jjjj%%j
4746A69%%J%%J%%J%%jj%j%J%%%J%%%%%J%jJj%Jj%%%%%%J%%%jjJ%J%J%Jj%kjj%j%%%JJ%%%j
4739A69%Jj%%J%%J%%%%%Jjjj%JJ%jJJJ%%%Jjjj%J%%%%%j%%%%%%%%k%%J%J%%%J%jJ%%jj%%J
4732A71%%%%%%JJ%%jjjJJ%%%%%jjJJ%Jjj%%%%JjJ%j%%JJ%%j%j%%J%j%%J%%%%%j%J%%%%J%%
4724A73j%%j%%%%%%%%%%J%%j%J%J%%%%%%%j%%%%%%%j%%%%J%%%%%Jjjj%J%J%j%j%%%%JJ%jj
4717A70%%%%J%%%%%%%%%%%JJ%Jjj%%j%%Jj%kj%J%J%KJ%%%j%%%%%j%%%JJ%%%%j%j%%JJ%%%%
4710A73%%%j%%%jJJjj%%j%J%JJ%j%%%J%%%jJJjjjjj%j%%JJ%J%%%%%%j%JJ%j%%%%%Jjj%%JK
$$ y = [172, 171, 170, 169, 168, 169, 170, 171, 172, 172, 172, 171, 170, 171, 171, 170, 170, 169, 169, 170, 171, 171, 171, 171, 171, 170, 170, 170, 171, 172, 172, 172, 171, 172, 174, 174, 173, 173, 174, 174, 174, 174, 175, 174, 173, 173, 172, 172, 171, 171, 172, 174, 174, 174, 174, 174, 174, 174, 173, 172, 172, 171, 171, 171, 171, 171, 171, 171, 171, 171, 172, 171, 170, 171, 171, 172, 172, 173, 173, 174, 174, 174, 173, 173, 172, 172, 172, 173, 172, 172, 173, 173, 173, 172, 172, 172, 173, 173, 173, 174, 174, 174, 174, 173, 173, 173, 172, 173, 172, 171, 171, 172, 172, 172, 173, 173, 173, 173, 172, 171, 171, 171, 171, 170, 171, 171, 172, 172, 173, 173, 174, 174, 173, 172, 171, 170, 170, 170, 169, 169, 169, 170, 170, 170, 171, 171, 171, 172, 172, 172, 171, 170, 170, 169, 169, 170, 170, 170, 170, 171, 171, 171, 171, 171, 171, 172, 172, 171, 172, 171, 171, 172, 171, 171, 171, 171, 171, 171, 171, 172, 172, 172, 172, 171, 170, 171, 171, 172, 172, 173, 173, 174, 173, 173, 171, 170, 169, 169, 168, 168, 168, 168, 169, 170, 170, 170, 170, 169, 169, 170, 169, 169, 169, 170, 170, 170, 171, 171, 171, 171, 171, 171, 172, 171, 170, 169, 169, 170, 171, 171, 170, 171, 172, 173, 173, 173, 173, 174, 173, 172, 171, 171, 172, 172, 172, 172, 172, 172, 171, 171, 171, 171, 171, 171, 171, 171, 171, 169, 169, 169, 170, 170, 171, 171, 171, 171, 172, 172, 171, 172, 172, 172, 171, 170, 170, 170, 171, 171, 171, 171, 171, 171, 171, 172, 173, 173, 173, 172, 171, 170, 171, 172, 172, 172, 172, 172, 172, 171, 170, 171, 172, 172, 173, 172, 171, 171, 171, 171, 171, 172, 171, 172, 172, 171, 171, 171, 172, 173, 173, 173, 172, 172, 171, 171, 171, 172, 172, 171, 171, 171, 172, 172, 172, 172, 172, 172, 171, 171, 172, 172, 172, 172, 172, 173, 173, 173, 172, 172, 172, 171, 171, 171, 171, 171, 171, 171, 171, 171, 171, 171, 172, 172, 172, 171, 171, 172, 172, 173, 173, 173, 173, 173, 173, 173, 173, 172, 172, 172, 172, 172, 172, 172, 172, 171, 171, 171, 171, 171, 172, 172, 172, 172, 172, 172, 173, 172, 171, 170, 170, 171, 171, 172, 172, 171, 171, 170, 170, 170, 170, 170, 171, 172, 172, 171, 170, 170, 170, 170, 170, 171, 171, 171, 171, 171, 171, 171, 171, 171, 171, 171, 171, 172, 173, 173, 174, 173, 172, 172, 172, 171, 171, 171, 172, 171, 171, 169, 168, 168, 169, 169, 170, 170, 172, 173, 173, 173, 173, 172, 172, 172, 172, 172, 172, 171, 171, 171, 171, 172, 173, 173, 173, 173, 173, 172, 172, 171, 171, 171, 172, 173, 173, 173, 173, 173, 173, 173, 173, 172, 172, 172, 172, 171, 172, 173, 172, 171, 171, 171, 170, 170, 171, 171, 172, 173, 173, 172, 172, 172, 172, 173, 173, 173, 173, 172, 173, 174, 173, 172, 171, 170, 169, 169, 168, 168, 168, 169, 170, 170, 171, 171, 171, 171, 171, 171, 171, 170, 170, 171, 172, 172, 171, 171, 171, 171, 171, 171, 172, 171, 170, 170, 170, 171, 173]
4702A73%%j%%%%%J%%%j%j%%%%J%Jjjj%j%%%j%KJ%%%k%J%%j%%J%%%jJ%J%%%%%%J%%J%%j%%%
4695A72%%%%%J%j%%%%J%%jj%%%J%%%%%j%JK%jjj%j%%%JJ%J%jj%%J%%%jJ%j%%%J%%j%%%jJJ
4688A72%jj%J%JjjJ%jJJ%%j%J%jj%%%%%%j%KJ%%%%JJ%%jj%%JJj%%%j%%j%%%%%%%%%j%jJ%J
4681A71%J%%J%Jjjj%%J%J%%%%%%%%%j%%%%%J%Jj%j%%%%Jj%%jJ%%%%%%%j%%%%jJJ%Jjk%%JK
4673A73j%jj%%JJj%%%%%%%J%%%%%%%%%%Jj%%%j%j%J%JJj%%%j%j%%JK%j%%%%%j%%J%%J%%jj
4666A71jJ%%J%jjkJ%JJ%%%%%%%%%%%%%Jj%j%%%%%%jJ%J%Jj%%%J%Jj%%JJ%%%%j%%j%%j%%%j
4659A70%jJ%J%%%%%j%JKj%%kjJ%%J%%%%j%J%J%jjJJj%%j%J%%J%%%%J%%j%j%%%%%j%%%j%J%
4651A70%J%%%jj%%J%J%J%%%%%jjJJJjjjj%%%KJ%%%j%%%J%%%Jj%%%%%%%%Jj%%%jjkjJ%J%%J
$$ y = [173, 173, 173, 172, 172, 172, 172, 172, 172, 173, 173, 173, 173, 172, 172, 171, 171, 171, 171, 171, 172, 172, 173, 172, 171, 170, 170, 169, 169, 169, 169, 168, 168, 170, 171, 171, 171, 171, 169, 169, 170, 170, 170, 169, 169, 169, 170, 170, 170, 170, 169, 170, 170, 171, 171, 171, 171, 171, 171, 171, 172, 172, 172, 173, 173, 173, 172, 172, 172, 172, 172, 172, 172, 172, 172, 173, 173, 172, 172, 172, 172, 172, 173, 173, 173, 172, 171, 171, 171, 171, 172, 172, 172, 172, 172, 172, 171, 171, 172, 174, 174, 173, 172, 171, 171, 170, 170, 170, 170, 171, 172, 172, 173, 173, 172, 171, 171, 171, 172, 172, 172, 172, 171, 172, 172, 171, 171, 171, 171, 172, 172, 172, 171, 171, 171, 171, 170, 171, 172, 172, 171, 170, 170, 171, 171, 172, 171, 170, 171, 171, 170, 171, 172, 172, 172, 171, 171, 172, 172, 171, 170, 170, 170, 170, 170, 170, 170, 169, 169, 171, 172, 172, 172, 172, 172, 173, 174, 174, 174, 173, 172, 172, 172, 173, 174, 173, 173, 173, 173, 172, 172, 172, 171, 171, 171, 171, 171, 171, 171, 171, 171, 171, 170, 170, 169, 170, 170, 171, 171, 172, 172, 172, 173, 173, 174, 173, 172, 171, 171, 171, 172, 172, 173, 173, 173, 173, 173, 173, 173, 173, 173, 173, 172, 172, 172, 172, 172, 172, 173, 173, 174, 173, 173, 172, 172, 172, 172, 172, 173, 172, 172, 172, 171, 172, 172, 172, 172, 172, 172, 172, 172, 171, 171, 171, 171, 171, 170, 171, 172, 172, 173, 172, 170, 170, 170, 171, 173, 172, 172, 171, 170, 170, 170, 171, 172, 171, 171, 171, 171, 171, 171, 171, 171, 172, 172, 172, 172, 172, 172, 172, 172, 172, 172, 172, 173, 172, 172, 172, 172, 171, 171, 170, 170, 171, 171, 172, 173, 172, 172, 172, 172, 171, 171, 170, 170, 170, 171, 173, 173, 172, 172, 172, 172, 172, 172, 171, 171, 171, 172, 172, 172, 173, 173, 173, 172, 171, 170, 171, 171, 171, 172, 172, 171, 170, 168, 169, 169, 170, 171, 171, 171, 171, 171, 171, 171, 171, 171, 171, 171, 171, 171, 171, 172, 171, 171, 170, 170, 170, 170, 170, 170, 170, 169, 170, 170, 171, 171, 172, 171, 171, 171, 171, 172, 172, 173, 172, 172, 172, 173, 174, 174, 174, 174, 174, 173, 173, 173, 172, 172, 172, 171, 171, 171, 171, 170, 170, 169, 170, 170, 171, 171, 171, 171, 171, 171, 170, 170, 171, 173, 172, 172, 172, 170, 169, 170, 170, 170, 171, 171, 171, 171, 171, 170, 170, 171, 171, 172, 172, 171, 170, 171, 172, 171, 171, 171, 170, 170, 171, 171, 171, 172, 172, 172, 172, 172, 173, 173, 173, 172, 172, 171, 171, 171, 171, 171, 171, 170, 170, 170, 170, 169, 169, 170, 170, 170, 171, 171, 171, 171, 170, 169, 169, 169, 170, 170, 171, 171, 172, 172, 172, 172, 172, 172, 171, 170, 171, 172, 173, 172, 171, 170, 169, 169, 169, 169, 171, 172, 172, 172, 172, 171, 171, 171, 171, 172, 172, 172, 172, 173, 172, 172, 172, 172, 172, 172, 172, 172, 172, 173, 172, 172, 172, 172, 171, 170, 168, 167, 168, 168, 169, 169, 169, 170]
4644A70J%%j%%J%%%%%jj%JJJ%J%%%J%j%%%j%j%%j%%%J%%%%%%j%j%%j%%J%Jj%%%%%%%%%%%%
4637A69%%jj%%KJJ%j%%JJj%j%%j%%%%%%JJ%j%%j%JJj%j%j%J%JJ%J%JjjjJK%%%%jj%%%Jj%%
4629A71j%j%%%%J%%%%j%%%J%%%%%%J%%%j%JJ%j%%%J%%%%%%j%%%j%%%%%jJ%%%%%%%%%J%%j%
4622A70%%%J%%%%%%%j%jJJkjJ%JJ%%%%%J%%%%%jJ%%J%jj%j%K%jJ%%%%jJ%%JkjjJJJ%j%%J%
4615A72%%%jj%%%%j%jJJ%jjJ%%%%j%J%%Jj%KJ%jjjJ%%jJJ%%%%%j%%j%J%%J%%J%%%%%%jjJ%
4607A71Jj%j%Jj%%JJJ%%%%j%j%%%jJ%%Jj%%j%%%jJ%%%%%%%J%%%%%j%%%%%%j%%J%J%J%%%%%
4600A72%%jj%J%%j%%J%Jj%%%%J%Jj%%j%%j%%%j%JJjj%%%%%%%%%%j%%%j%JJJJJj%%%J%jk%%
4593A69%%%J%%%j%%j%J%%%%%%%Jj%%jJ%%%%%%jJ%J%J%J%j%j%%%%%j%%j%KJ%%%%%%%j%%J%J
$$ y = [170, 171, 171, 171, 170, 170, 170, 171, 171, 171, 171, 171, 171, 170, 169, 169, 170, 171, 172, 172, 173, 173, 173, 173, 174, 174, 173, 173, 173, 173, 172, 172, 171, 171, 171, 170, 170, 170, 170, 171, 171, 171, 171, 171, 171, 171, 170, 170, 169, 169, 169, 168, 168, 168, 169, 169, 170, 169, 169, 169, 169, 169, 169, 169, 169, 169, 169, 169, 169, 169, 169, 169, 168, 167, 167, 167, 169, 170, 171, 171, 170, 170, 170, 171, 172, 171, 171, 170, 170, 170, 169, 169, 169, 169, 169, 169, 169, 170, 171, 171, 170, 170, 170, 169, 169, 170, 171, 170, 170, 169, 169, 168, 168, 169, 169, 170, 171, 171, 172, 172, 173, 172, 171, 170, 171, 173, 173, 173, 173, 173, 172, 171, 171, 171, 171, 172, 171, 171, 171, 170, 170, 169, 169, 169, 169, 169, 170, 170, 170, 170, 170, 169, 169, 169, 169, 170, 170, 170, 170, 170, 170, 170, 171, 171, 171, 171, 170, 170, 171, 172, 172, 171, 171, 171, 171, 172, 172, 172, 172, 172, 172, 172, 171, 171, 171, 171, 170, 170, 170, 170, 170, 170, 169, 170, 170, 170, 170, 170, 170, 170, 170, 170, 170, 171, 171, 171, 170, 170, 170, 170, 170, 171, 171, 171, 171, 171, 171, 171, 171, 170, 170, 169, 170, 171, 169, 168, 169, 169, 170, 171, 171, 171, 171, 171, 171, 172, 172, 172, 172, 172, 172, 171, 172, 172, 172, 173, 173, 172, 171, 171, 170, 170, 172, 172, 171, 172, 172, 172, 172, 172, 171, 172, 172, 172, 173, 171, 170, 169, 170, 171, 172, 172, 171, 171, 171, 172, 172, 172, 172, 172, 171, 170, 170, 170, 170, 170, 169, 169, 168, 169, 170, 170, 169, 168, 169, 169, 169, 169, 169, 168, 168, 169, 169, 169, 170, 169, 169, 171, 172, 172, 171, 170, 169, 170, 170, 170, 169, 170, 171, 171, 171, 171, 171, 171, 170, 170, 170, 169, 169, 170, 170, 170, 171, 171, 171, 172, 172, 172, 172, 172, 172, 172, 171, 170, 171, 171, 172, 171, 171, 170, 170, 171, 170, 170, 170, 171, 172, 173, 173, 173, 173, 173, 172, 172, 171, 171, 171, 171, 170, 171, 171, 171, 172, 171, 171, 171, 170, 170, 170, 170, 169, 170, 170, 170, 170, 170, 170, 170, 170, 171, 171, 171, 171, 171, 171, 170, 170, 170, 170, 170, 170, 170, 169, 169, 169, 170, 170, 171, 171, 172, 172, 172, 172, 172, 172, 172, 172, 171, 170, 170, 171, 171, 171, 170, 170, 170, 171, 171, 172, 171, 171, 171, 171, 171, 172, 172, 173, 172, 172, 172, 171, 171, 171, 170, 170, 170, 170, 169, 169, 170, 171, 170, 169, 169, 169, 169, 169, 169, 169, 169, 169, 169, 169, 168, 168, 168, 168, 167, 167, 168, 169, 170, 171, 172, 171, 171, 171, 171, 172, 172, 171, 169, 169, 169, 169, 169, 169, 170, 170, 170, 170, 169, 169, 169, 168, 168, 169, 169, 169, 169, 169, 169, 169, 169, 170, 169, 169, 169, 168, 169, 169, 169, 169, 169, 169, 169, 168, 169, 169, 170, 170, 171, 171, 172, 172, 171, 171, 170, 170, 170, 170, 170, 170, 169, 169, 169, 168, 168, 170, 171, 171, 171, 171, 171, 171, 171, 171, 170, 170, 170, 171, 171, 172]
4585A72%%j%JJjj%j%j%J%%%%%%%jJJjj%J%Jjj%%JJJJ%%j%%%%%%%%%%%j%j%%%%Jj%j%%%j%%
4578A68%%%JJK%j%j%JJ%jjj%JJ%jkjJj%JJ%%%JJ%%j%%jJJ%j%J%JJ%jjj%%%JJ%J%%%j%%j%%
4571A71Jj%Jjjjj%JJJ%%%%JJ%%%%j%j%j%jjJ%J%%J%J%J%%J%jj%J%J%%%Jj%Jjj%%J%%%jJ%J
4564A75%%%%jJJJKJJj%JJKJJ%KK%%J%jkklk%kjj%jj%%%%%%%%j%jjKJ%j%%%%%%JJJJJ%KJKJ
4556A85KJKJJKJ%kjklljjjjjjjkjJJJJJKJKJKJLKK%jjjkljk%%kkk%%j%jjk%%%jJ%%%%%J%J
4549A75%%%KJJJ%jjJ%JKKJJKJJJ%jJlkkjj%jjkjk%j%j%%%%j%%%J%%J%%%jJ%%J%%%%jjjj%j
4542A70%%%%jj%%JJ%jJJ%j%JJ%j%jJ%%%jJ%%%j%%jJ%%%%J%%J%j%j%%jj%%J%%%%%jJ%j%%JJ
4534A70J%J%j%jj%%%%%%%%%j%j%JK%jJ%%%%j%%%%%jJ%j%%JJ%%jJJ%%%%%jjj%%JJ%jj%J%%%
$$ y = [172, 172, 172, 171, 171, 172, 173, 172, 171, 171, 170, 170, 169, 169, 170, 170, 170, 170, 170, 170, 170, 170, 169, 170, 171, 170, 169, 169, 170, 170, 171, 170, 169, 169, 169, 170, 171, 172, 173, 173, 173, 172, 172, 172, 172, 172, 172, 172, 172, 172, 172, 172, 172, 171, 171, 170, 170, 170, 170, 170, 171, 170, 170, 169, 169, 169, 169, 168, 168, 168, 168, 168, 168, 169, 170, 172, 172, 171, 171, 170, 170, 171, 172, 172, 171, 170, 169, 169, 170, 171, 171, 170, 168, 167, 168, 167, 167, 168, 169, 169, 169, 169, 170, 171, 171, 171, 170, 170, 170, 169, 170, 171, 171, 170, 170, 171, 171, 172, 173, 173, 172, 171, 170, 170, 170, 170, 171, 172, 172, 173, 173, 173, 173, 172, 172, 172, 171, 171, 171, 172, 171, 171, 172, 171, 170, 169, 168, 168, 169, 170, 171, 171, 171, 171, 171, 172, 173, 173, 173, 173, 173, 172, 172, 171, 171, 170, 170, 169, 168, 169, 169, 170, 170, 170, 171, 171, 172, 172, 173, 173, 173, 174, 174, 173, 172, 172, 173, 173, 174, 174, 174, 174, 175, 174, 174, 175, 174, 173, 173, 173, 174, 174, 174, 174, 173, 174, 174, 175, 175, 175, 175, 175, 174, 175, 176, 177, 179, 180, 181, 180, 180, 181, 182, 184, 185, 186, 186, 188, 190, 190, 190, 191, 191, 190, 188, 186, 183, 181, 181, 179, 178, 177, 177, 176, 175, 175, 175, 175, 175, 175, 175, 175, 175, 174, 174, 173, 172, 174, 175, 175, 174, 174, 174, 174, 174, 174, 174, 175, 176, 177, 178, 179, 179, 181, 182, 184, 185, 187, 188, 190, 191, 192, 194, 195, 195, 193, 192, 190, 187, 184, 183, 182, 181, 180, 179, 178, 177, 175, 174, 175, 176, 177, 178, 179, 181, 182, 184, 185, 187, 188, 191, 193, 195, 195, 194, 193, 192, 190, 187, 186, 184, 184, 184, 182, 180, 178, 178, 178, 177, 177, 176, 175, 173, 173, 173, 173, 172, 173, 173, 173, 173, 173, 173, 174, 174, 175, 175, 175, 175, 177, 178, 179, 180, 180, 179, 178, 179, 179, 180, 182, 184, 185, 186, 188, 189, 190, 191, 191, 190, 191, 188, 186, 184, 183, 182, 182, 181, 180, 178, 177, 175, 175, 174, 174, 173, 173, 173, 173, 173, 172, 172, 172, 172, 173, 173, 173, 174, 174, 174, 174, 173, 174, 174, 174, 175, 175, 175, 175, 175, 174, 173, 172, 171, 171, 170, 170, 170, 170, 170, 169, 168, 168, 168, 169, 170, 170, 169, 170, 171, 171, 170, 170, 171, 172, 172, 171, 171, 170, 171, 171, 171, 171, 170, 171, 171, 171, 171, 170, 170, 170, 169, 170, 170, 170, 170, 170, 171, 171, 171, 172, 172, 171, 171, 170, 170, 170, 169, 168, 168, 168, 169, 169, 169, 169, 169, 169, 168, 169, 169, 168, 168, 168, 169, 170, 171, 171, 172, 172, 171, 171, 170, 169, 169, 169, 169, 169, 169, 169, 169, 169, 169, 168, 168, 167, 167, 168, 170, 170, 169, 170, 170, 170, 170, 170, 169, 169, 169, 169, 169, 169, 168, 169, 169, 168, 168, 168, 169, 170, 170, 170, 169, 170, 171, 171, 171, 171, 171, 171, 170, 169, 168, 168, 168, 169, 170, 170, 169, 168, 168, 169, 169, 169, 169]
4527A69%%%%%%%%%jJJ%%j%J%J%jjJ%JJ%jjjJ%%%%Jj%%%jjJJ%J%%%%%%%jj%JJj%%%%%%jjKJ
4520A71Jjjk%%jJ%%%%%%%JJJ%%jj%%jJJj%J%%%j%j%j%JJJ%%%j%%j%%%%%%J%K%%%j%%j%%%j
4512A68%j%jJ%JJ%%j%J%JJJ%%jj%J%J%%%%jjj%J%%k%%%%%J%J%%%J%%j%%%jj%%J%%%%J%%%%
4505A70J%%%%j%%j%%%%%%%%%J%%%jj%J%J%%%%%k%JJ%%%%j%j%%%J%%J%%J%%%J%%%%j%j%%jj
4498A68JKjj%%J%%jjjJ%%%%%J%JJjj%%%%%jJ%%Jjj%%%%%j%j%%%%JJ%JJ%%%%jJJ%j%%%%j%j
4490A68jJ%J%jj%J%j%jJJJ%%%jJ%Jj%J%J%%J%j%%jjJ%%%%%J%j%j%%%%JJ%%%j%%j%%%%%Jjj
4483A68JJ%%j%%%%jjj%JJ%jJ%Jj%%%%%J%%J%%%Jj%j%%%J%%%%j%%JJj%%%%%%%%%%%jj%j%J%
4476A68%J%J%%jjK%%%%j%%%j%j%J%JJ%j%%%%J%%%%%%%%%%%j%%JJjjjj%J%%j%%K%%%%%%J%%
$$ y = [169, 169, 169, 169, 169, 169, 169, 169, 169, 169, 168, 169, 170, 170, 170, 169, 169, 170, 170, 171, 171, 170, 169, 170, 170, 171, 172, 172, 171, 170, 169, 170, 170, 170, 170, 170, 171, 170, 170, 170, 170, 169, 168, 169, 170, 170, 171, 171, 171, 171, 171, 171, 171, 171, 170, 169, 169, 170, 171, 170, 170, 170, 170, 170, 170, 170, 169, 168, 170, 171, 172, 171, 170, 168, 168, 168, 167, 168, 168, 168, 168, 168, 168, 168, 168, 169, 170, 171, 171, 171, 170, 169, 169, 169, 168, 169, 170, 169, 169, 170, 170, 170, 170, 169, 169, 168, 168, 167, 167, 168, 169, 170, 170, 170, 170, 169, 169, 169, 168, 168, 168, 168, 168, 168, 168, 169, 169, 171, 171, 171, 171, 170, 170, 170, 169, 169, 169, 169, 168, 168, 167, 167, 166, 167, 167, 168, 169, 169, 169, 168, 168, 169, 169, 170, 171, 172, 172, 172, 171, 170, 170, 171, 171, 172, 172, 172, 172, 172, 171, 170, 169, 169, 170, 170, 170, 168, 168, 168, 168, 168, 168, 169, 169, 170, 170, 170, 170, 171, 171, 171, 170, 170, 170, 170, 169, 168, 168, 168, 169, 169, 169, 169, 169, 170, 170, 170, 170, 170, 171, 171, 171, 171, 171, 170, 170, 170, 169, 169, 169, 169, 169, 169, 169, 169, 169, 169, 170, 170, 170, 170, 169, 168, 168, 169, 169, 170, 170, 170, 170, 170, 170, 168, 168, 169, 170, 170, 170, 170, 170, 169, 169, 168, 168, 168, 168, 169, 169, 169, 170, 170, 170, 171, 171, 171, 171, 172, 172, 172, 172, 172, 171, 171, 170, 170, 170, 169, 168, 169, 171, 170, 169, 169, 169, 170, 170, 170, 169, 168, 167, 168, 168, 168, 168, 168, 168, 169, 169, 170, 171, 170, 169, 169, 169, 169, 169, 169, 168, 169, 169, 169, 170, 169, 168, 168, 168, 168, 168, 168, 167, 167, 166, 166, 166, 166, 166, 167, 168, 168, 169, 170, 170, 170, 170, 170, 169, 170, 171, 171, 170, 170, 170, 170, 170, 169, 169, 168, 167, 168, 168, 169, 169, 168, 167, 167, 168, 168, 167, 167, 166, 167, 168, 169, 169, 169, 169, 168, 169, 169, 170, 169, 169, 170, 170, 171, 171, 171, 172, 172, 171, 171, 171, 170, 169, 170, 170, 170, 170, 170, 170, 171, 171, 170, 170, 169, 169, 169, 169, 169, 170, 171, 171, 171, 171, 170, 170, 170, 169, 169, 169, 169, 169, 169, 170, 169, 168, 169, 170, 170, 170, 169, 169, 169, 169, 169, 168, 167, 166, 166, 167, 168, 168, 167, 168, 168, 169, 168, 168, 168, 168, 168, 168, 169, 169, 169, 170, 170, 170, 170, 171, 170, 170, 169, 169, 169, 169, 170, 170, 170, 170, 170, 169, 169, 169, 170, 171, 170, 170, 170, 170, 170, 170, 170, 170, 170, 170, 170, 170, 169, 168, 168, 167, 167, 168, 168, 168, 169, 169, 170, 170, 170, 169, 168, 170, 170, 170, 170, 170, 169, 169, 169, 169, 168, 168, 167, 167, 168, 168, 169, 170, 170, 169, 169, 169, 169, 169, 170, 170, 170, 170, 170, 170, 170, 170, 170, 170, 170, 170, 169, 169, 169, 170, 171, 170, 169, 168, 167, 167, 168, 168, 168, 167, 167, 167, 169, 169, 169, 169, 169, 169, 169, 170, 170, 170]
4468A70jjj%%J%J%%%%%%J%j%%%j%%%J%j%J%k%%J%%%jJJ%J%JJjjJ%J%Jjj%jjj%%%jJJ%%%%%
4461A69JJ%jj%jJK%jj%J%%%%%%jjjJJj%jj%%J%JJJJ%j%%%%J%j%%jJJj%%j%%%j%Jj%J%%%J%
4454A70%%%%J%j%jjJ%J%%J%%%j%jj%j%%%%%%%J%jJ%%%%J%%%%%%%%%%%%%jjj%J%%%J%%J%k%
4447A67jj%JJ%%%jj%J%%%%%%JJJ%%%j%J%%%jj%J%%%%J%%j%jjJ%%J%%%%%%%J%J%%jJ%jj%JK
4439A71JJjjjjjjJJj%%jJJ%j%%J%%%%%%%J%jjJ%%Jj%%%J%jj%jJ%KJj%%%JJj%%jj%jj%J%%%
4432A68%%%%%jj%JJJ%J%j%%%j%%JJ%%%%%jj%%%KJj%jjJ%%%%%j%%j%%%%JJJjjjj%jJJK%jjJ
4425A68j%%%J%%%%Jj%J%%Jj%j%J%%%jJJJ%%%%jj%%%%JJj%jj%j%%%%%jj%%%%JJJJJjjjk%%j
4417A64%JJJJ%JK%j%jJ%%%%%%j%JJ%j%jjJ%%jJJJjj%%%%%j%%%JJJj%%%%%jjJ%%jkJ%%%%JJ
$$ y = [170, 169, 168, 167, 167, 167, 168, 168, 169, 169, 169, 169, 169, 169, 169, 170, 170, 169, 169, 169, 169, 168, 168, 168, 168, 169, 169, 168, 168, 169, 169, 167, 167, 167, 168, 168, 168, 168, 167, 168, 169, 169, 170, 170, 171, 172, 171, 170, 171, 171, 172, 172, 173, 172, 171, 171, 170, 169, 168, 168, 168, 168, 167, 168, 169, 169, 169, 169, 169, 169, 170, 171, 171, 170, 169, 169, 168, 169, 171, 171, 170, 169, 169, 170, 170, 170, 170, 170, 170, 170, 169, 168, 167, 168, 169, 168, 168, 167, 166, 166, 166, 167, 167, 168, 169, 170, 171, 171, 170, 170, 170, 170, 170, 171, 171, 170, 170, 170, 169, 170, 171, 170, 170, 170, 169, 169, 169, 169, 168, 168, 169, 168, 168, 169, 169, 169, 169, 170, 170, 170, 170, 170, 170, 171, 171, 170, 170, 169, 168, 169, 169, 170, 170, 170, 171, 171, 171, 171, 170, 170, 169, 168, 168, 167, 167, 167, 167, 167, 167, 167, 167, 168, 168, 167, 168, 168, 168, 168, 168, 169, 169, 169, 169, 169, 169, 169, 169, 169, 169, 169, 169, 169, 169, 168, 167, 166, 166, 167, 167, 167, 167, 168, 168, 168, 169, 169, 167, 167, 166, 165, 165, 166, 167, 167, 167, 167, 166, 165, 165, 166, 166, 166, 166, 166, 166, 166, 167, 168, 169, 169, 169, 169, 168, 168, 169, 169, 169, 169, 168, 167, 167, 168, 168, 168, 168, 168, 169, 169, 169, 168, 168, 167, 166, 167, 167, 167, 168, 168, 168, 168, 168, 168, 168, 168, 169, 169, 170, 170, 170, 169, 170, 170, 169, 168, 168, 169, 171, 172, 173, 172, 171, 170, 169, 168, 167, 168, 169, 168, 168, 168, 167, 168, 169, 169, 168, 168, 168, 169, 169, 169, 169, 169, 169, 169, 169, 170, 170, 169, 168, 169, 169, 169, 170, 169, 169, 169, 169, 170, 170, 169, 168, 168, 167, 168, 168, 170, 171, 170, 170, 170, 170, 171, 172, 171, 171, 171, 170, 169, 169, 168, 167, 167, 168, 168, 168, 168, 168, 168, 168, 168, 168, 167, 166, 166, 167, 168, 169, 169, 170, 170, 169, 169, 169, 169, 168, 168, 168, 169, 170, 170, 170, 170, 170, 170, 169, 168, 168, 168, 168, 170, 171, 170, 170, 169, 168, 169, 169, 169, 169, 169, 169, 168, 168, 168, 167, 167, 167, 167, 167, 168, 169, 170, 169, 168, 167, 166, 166, 165, 166, 167, 169, 169, 168, 167, 168, 167, 167, 167, 167, 168, 168, 168, 168, 168, 169, 168, 168, 169, 169, 169, 170, 169, 169, 168, 168, 169, 169, 169, 169, 168, 169, 170, 171, 171, 171, 171, 171, 170, 169, 169, 169, 169, 169, 170, 171, 170, 170, 169, 168, 168, 167, 167, 167, 167, 167, 167, 166, 165, 165, 165, 165, 165, 166, 167, 168, 169, 170, 169, 168, 167, 165, 165, 165, 164, 164, 165, 166, 167, 168, 168, 169, 171, 171, 170, 170, 169, 170, 170, 170, 170, 170, 170, 170, 169, 169, 170, 171, 171, 170, 170, 169, 168, 169, 169, 169, 168, 169, 170, 171, 170, 169, 169, 169, 169, 169, 169, 168, 168, 168, 168, 169, 170, 171, 170, 170, 170, 170, 170, 170, 169, 168, 169, 169, 169, 168, 166, 167, 167, 167, 167, 167, 168, 169]
4410A69%%J%J%j%j%j%%j%%%%%%%jJJJ%%j%%j%JJJ%%jj%%J%%%%j%%%%%JjjJ%%jJ%%%%j%jJ%
4403A67%J%%%Jj%J%%%Jjjj%%j%J%%%J%%J%%%%j%%%%%%%%j%J%%J%%J%%%j%j%%%JJj%%%%J%J
4395A71jj%%%%j%jj%%%%%%%%%%%%J%J%j%%%JJjj%j%%%J%%%JK%j%j%%J%%%j%%%%%%%J%J%jj
4388A68%%%jJ%%%%jjj%J%%%%%%%J%%%%J%%KJ%%jjj%jj%jJJ%J%%%J%j%%%%%%%Jjjk%%%j%JJ
4381A66%j%%J%j%j%%KJ%J%J%j%%K%%%%jJ%jjjjJJ%%J%Jj%j%jJ%J%%%%%Jjk%jJJ%j%%j%%%K
4373A68%j%J%%Jj%%%jjJ%J%%Jj%%%jkJJJ%%J%j%%%%jjjj%JJ%J%%%%%J%%%j%%%JJ%%jjjjJJ
4366A67%J%%%jJ%%Jj%%%%%%jJ%%%%%%%j%%%%J%%jjjj%JJ%J%%%%%%%%%%%%%%J%%%%J%jj%J%
4359A68%%jJ%JJj%j%%%%Jjj%%%%%%%J%%%%jj%%%%%%%%%%%J%Jjjjj%%J%%JJjj%%J%%j%JJJJ
$$ y = [169, 169, 169, 170, 170, 171, 171, 170, 170, 169, 169, 168, 168, 168, 167, 167, 167, 167, 167, 167, 167, 167, 166, 167, 168, 169, 169, 169, 168, 168, 168, 167, 167, 168, 169, 170, 170, 170, 169, 168, 168, 168, 169, 169, 169, 169, 169, 168, 168, 168, 168, 168, 168, 169, 168, 167, 168, 168, 168, 167, 168, 168, 168, 168, 168, 167, 167, 166, 167, 167, 167, 168, 168, 168, 168, 169, 168, 168, 169, 169, 169, 169, 170, 169, 168, 167, 167, 167, 166, 166, 167, 167, 167, 167, 168, 168, 168, 169, 169, 169, 169, 169, 168, 168, 168, 168, 168, 168, 168, 168, 168, 167, 167, 168, 168, 168, 169, 169, 169, 170, 170, 170, 170, 169, 169, 168, 168, 168, 168, 169, 170, 169, 169, 169, 169, 169, 170, 170, 171, 170, 169, 169, 169, 169, 169, 168, 168, 167, 166, 166, 166, 166, 166, 166, 166, 166, 166, 166, 166, 166, 166, 167, 167, 168, 168, 167, 167, 167, 167, 168, 169, 168, 167, 167, 166, 166, 166, 166, 167, 167, 167, 167, 168, 170, 170, 169, 169, 168, 168, 168, 169, 169, 169, 169, 168, 168, 168, 168, 168, 168, 168, 168, 169, 169, 170, 170, 169, 168, 168, 168, 168, 167, 168, 168, 168, 168, 168, 167, 166, 165, 165, 166, 166, 166, 166, 166, 166, 166, 166, 167, 167, 167, 167, 167, 168, 168, 168, 170, 171, 171, 171, 170, 169, 168, 168, 167, 166, 166, 165, 166, 167, 167, 168, 168, 168, 168, 169, 169, 168, 168, 168, 168, 168, 168, 168, 168, 169, 168, 167, 165, 165, 165, 165, 164, 164, 165, 166, 166, 165, 165, 165, 166, 166, 165, 165, 164, 164, 164, 166, 167, 167, 168, 168, 169, 169, 168, 168, 168, 170, 170, 170, 170, 170, 169, 170, 170, 169, 168, 167, 166, 167, 168, 168, 168, 169, 169, 170, 169, 169, 168, 168, 167, 168, 168, 169, 169, 169, 169, 169, 169, 170, 169, 167, 167, 166, 167, 168, 168, 167, 167, 167, 166, 166, 166, 166, 168, 168, 167, 167, 168, 168, 168, 169, 168, 168, 168, 168, 167, 166, 167, 167, 168, 168, 168, 169, 168, 168, 168, 168, 167, 165, 166, 167, 168, 168, 168, 169, 169, 168, 168, 168, 168, 168, 167, 166, 165, 164, 164, 165, 166, 166, 167, 167, 167, 167, 167, 167, 168, 168, 168, 168, 167, 167, 167, 167, 168, 169, 169, 169, 168, 167, 166, 165, 166, 167, 167, 168, 168, 168, 168, 167, 168, 168, 168, 169, 168, 168, 168, 168, 168, 168, 168, 167, 168, 168, 168, 168, 168, 168, 168, 168, 167, 167, 167, 167, 167, 168, 168, 168, 167, 166, 165, 164, 164, 165, 166, 166, 167, 167, 167, 167, 167, 167, 167, 167, 167, 167, 167, 167, 167, 167, 167, 168, 168, 168, 168, 168, 169, 169, 168, 167, 167, 168, 168, 168, 168, 167, 168, 168, 169, 170, 169, 169, 168, 168, 168, 168, 168, 169, 168, 167, 167, 167, 167, 167, 167, 167, 167, 168, 168, 168, 168, 168, 167, 166, 166, 166, 166, 166, 166, 166, 166, 166, 166, 166, 166, 167, 167, 168, 167, 166, 165, 164, 164, 164, 165, 165, 165, 166, 167, 166, 165, 165, 165, 166, 166, 166, 165, 165, 166, 167, 168, 169]
4352A69j%j%%jJj%J%Jj%j%%%%%J%%%J%%%j%jj%JJjjjJj%J%J%JJ%%%%%j%%jJ%%J%%%%j%%%%
4344A67%%jJ%%j%%%%%%%J%J%%jjJ%%J%%%j%JJ%jj%%%J%%%%%j%%j%%JJJ%%%jjj%%%JJ%j%JK
4337A70%%j%JJJjjj%JJ%%j%j%%j%%%%%%%j%jjJ%J%%j%J%%%%j%%JjJJjJ%%%%%%jJJ%Jj%%Jj
4330A69jj%%%%%J%%%%%%%J%%%%%%%%%j%j%%%%jJ%%%J%J%jkjjJ%JJ%%j%%%%%%%jKJ%%%j%%%
4322A67%j%%%%JJ%%%%jjJ%%Jj%%%%%J%%Jj%%j%%%%%%%%%JJ%%%j%%j%%%%J%%J%%%%%%j%j%%
4315A67%jJJ%%%jj%%%%J%j%%jJ%J%%j%jJJJ%%J%%%jJ%jjj%K%jJJj%%%%j%j%%%%%j%%JJJjj
4308A66%%J%%j%%%%%%%%%%J%%J%%%jJ%%%%j%%%%%Jj%%%%j%jJ%J%%J%%jj%%J%%J%%%%%%%%j
4300A67jJ%J%J%%jjJJJJJ%%jj%j%J%%%%%J%%%jj%%jJ%%%jJ%%jjj%J%%%j%j%JJ%%J%%%%%jj
$$ y = [169, 168, 168, 167, 167, 167, 166, 167, 166, 166, 167, 167, 168, 167, 167, 166, 166, 166, 166, 166, 166, 167, 167, 167, 167, 168, 168, 168, 168, 167, 167, 166, 165, 165, 166, 167, 166, 165, 164, 165, 164, 164, 165, 165, 166, 166, 167, 168, 168, 168, 168, 168, 168, 167, 167, 167, 166, 167, 167, 167, 168, 168, 168, 168, 168, 167, 167, 167, 167, 167, 167, 167, 166, 167, 167, 167, 166, 166, 166, 166, 166, 166, 166, 166, 167, 167, 168, 168, 168, 167, 166, 167, 167, 167, 168, 168, 168, 168, 167, 167, 168, 169, 169, 168, 167, 167, 167, 167, 168, 168, 168, 168, 168, 168, 167, 167, 167, 166, 166, 166, 167, 168, 169, 169, 169, 169, 168, 167, 166, 166, 166, 166, 167, 168, 168, 167, 167, 168, 170, 170, 170, 169, 169, 170, 171, 172, 171, 170, 169, 169, 170, 171, 171, 171, 170, 170, 169, 169, 169, 168, 168, 168, 168, 168, 168, 168, 168, 167, 167, 166, 165, 166, 166, 167, 167, 167, 166, 166, 167, 167, 167, 167, 167, 166, 166, 166, 167, 166, 167, 168, 167, 168, 168, 168, 168, 168, 168, 168, 167, 168, 169, 169, 170, 169, 169, 169, 170, 169, 168, 167, 167, 167, 167, 167, 167, 168, 168, 168, 168, 168, 168, 168, 168, 169, 169, 169, 169, 169, 169, 169, 169, 169, 169, 168, 168, 167, 167, 167, 167, 167, 166, 167, 167, 167, 167, 168, 168, 169, 169, 168, 166, 165, 164, 165, 165, 166, 167, 167, 167, 166, 166, 166, 166, 166, 166, 166, 166, 165, 167, 168, 168, 168, 168, 167, 167, 167, 167, 167, 166, 166, 166, 166, 166, 167, 168, 168, 168, 168, 168, 167, 166, 167, 167, 167, 168, 167, 167, 167, 167, 167, 167, 168, 168, 168, 169, 168, 168, 168, 167, 167, 167, 167, 167, 167, 167, 167, 167, 167, 168, 169, 169, 169, 169, 168, 168, 168, 167, 167, 167, 167, 167, 168, 168, 168, 169, 169, 169, 169, 169, 169, 169, 168, 168, 167, 167, 167, 167, 166, 167, 168, 168, 168, 168, 167, 166, 166, 166, 166, 166, 167, 167, 166, 166, 166, 165, 166, 166, 167, 167, 167, 166, 166, 165, 166, 167, 168, 168, 168, 169, 169, 169, 169, 168, 169, 169, 168, 167, 166, 166, 168, 168, 167, 168, 169, 168, 168, 168, 168, 168, 167, 167, 166, 166, 166, 166, 166, 166, 165, 165, 165, 166, 167, 168, 167, 166, 166, 166, 167, 167, 167, 166, 166, 166, 166, 166, 166, 166, 166, 166, 166, 166, 167, 167, 167, 168, 168, 168, 168, 167, 168, 168, 168, 168, 168, 167, 167, 167, 167, 167, 167, 168, 167, 167, 167, 167, 167, 166, 166, 165, 166, 166, 167, 167, 167, 168, 168, 168, 167, 166, 166, 166, 167, 167, 167, 168, 168, 168, 168, 168, 168, 168, 168, 168, 167, 166, 167, 167, 168, 168, 169, 169, 169, 168, 167, 168, 169, 170, 171, 172, 172, 172, 171, 170, 170, 169, 169, 170, 170, 170, 170, 170, 170, 171, 171, 171, 171, 170, 169, 169, 169, 168, 169, 169, 169, 169, 168, 169, 169, 169, 168, 167, 166, 166, 167, 167, 167, 167, 166, 166, 165, 165, 166, 167, 167, 167, 168, 168, 168, 168, 168, 168, 167, 166]
4293A66%%%%%J%%%%%%%%jj%%JJJ%%jj%%jJ%%J%%J%%%j%J%%%jk%jJJJJ%%JJ%%kkj%%J%%%%%
4286A66%%%%jJ%J%%%JJ%%%%%%%%%j%%j%JJJ%%%jjj%%JJJjjjj%%JKjj%%JJj%%j%j%JJj%%j%
4278A66j%j%%LJjjj%J%Jj%%J%j%%%%%%%%%%%%%%%%%%%J%Jjj%j%%%%jJJj%J%%%%%%%%J%jJJ
4271A68%j%%%%%j%JJ%%j%%JJ%%%j%jjJ%%%%%%%%%%j%%%%%%%%J%%%%J%%%J%J%%%jjj%JJJ%j
4264A69jjjj%%j%%J%%%%%%J%J%%jJJj%J%%k%%%%%%%%j%%%J%j%%j%%%%%%%JjjJK%%%%%%j%J
4256A66%%j%%J%%%J%j%%%JJjj%%%%%JJ%%%%%j%%%j%Jj%%J%%J%jjjj%%J%jJJJJj%j%%%J%%%
4249A67%%j%j%j%%j%jJJKJ%J%%jj%%%%%j%jJ%J%JJjj%J%%%%J%jJ%%j%j%%%%%%%J%jJ%%%%%
4242A67j%%%%%%%%%%%%%%%JJJjjjj%%%jJ%%%jj%J%J%jj%%j%%JJJJ%JJ%%%j%%%%%%%%%%j%j
$$ y = [166, 166, 166, 166, 166, 166, 167, 167, 167, 167, 167, 167, 167, 167, 167, 166, 165, 165, 165, 166, 167, 168, 168, 168, 167, 166, 166, 166, 165, 166, 166, 166, 167, 167, 167, 168, 168, 168, 168, 167, 167, 168, 168, 168, 168, 167, 165, 165, 164, 165, 166, 167, 168, 168, 168, 169, 170, 170, 170, 168, 166, 165, 165, 165, 166, 166, 166, 166, 166, 166, 166, 166, 166, 166, 165, 166, 166, 167, 167, 167, 167, 168, 169, 169, 169, 169, 169, 169, 169, 169, 169, 169, 168, 168, 168, 167, 167, 168, 169, 170, 170, 170, 170, 169, 168, 167, 167, 167, 168, 169, 170, 169, 168, 167, 166, 166, 166, 167, 169, 168, 167, 167, 167, 168, 169, 168, 168, 168, 167, 167, 166, 166, 167, 168, 167, 167, 167, 166, 166, 165, 165, 164, 164, 164, 167, 168, 167, 166, 165, 165, 166, 166, 167, 166, 166, 166, 167, 167, 166, 166, 166, 166, 166, 166, 166, 166, 166, 166, 166, 166, 166, 166, 166, 166, 166, 166, 166, 166, 167, 167, 168, 167, 166, 166, 165, 165, 165, 165, 165, 164, 165, 166, 165, 165, 166, 166, 166, 166, 166, 166, 166, 166, 166, 167, 167, 166, 167, 168, 168, 167, 167, 167, 167, 167, 167, 166, 166, 167, 168, 168, 168, 167, 167, 167, 168, 169, 169, 169, 169, 168, 168, 167, 166, 167, 167, 167, 167, 167, 167, 167, 167, 167, 167, 167, 166, 166, 166, 166, 166, 166, 166, 166, 166, 167, 167, 167, 167, 167, 168, 168, 168, 168, 169, 169, 170, 170, 170, 170, 169, 168, 167, 167, 168, 169, 170, 170, 169, 168, 167, 166, 165, 165, 165, 164, 164, 164, 165, 165, 165, 165, 165, 165, 165, 166, 166, 167, 167, 167, 166, 167, 168, 167, 167, 168, 168, 168, 166, 166, 166, 166, 166, 166, 166, 166, 166, 165, 165, 165, 165, 166, 166, 165, 165, 165, 164, 164, 164, 164, 164, 164, 164, 164, 165, 164, 163, 164, 166, 166, 166, 166, 166, 166, 166, 165, 165, 166, 166, 166, 165, 165, 165, 166, 166, 166, 166, 167, 167, 166, 166, 166, 166, 167, 168, 167, 166, 166, 166, 166, 166, 166, 167, 168, 168, 168, 168, 168, 168, 167, 167, 167, 167, 166, 166, 167, 166, 166, 166, 167, 167, 167, 168, 168, 167, 166, 165, 164, 164, 164, 165, 165, 164, 165, 166, 167, 168, 167, 167, 166, 166, 166, 166, 167, 167, 167, 167, 167, 167, 166, 166, 165, 165, 164, 164, 164, 163, 163, 162, 163, 164, 166, 167, 167, 168, 168, 168, 167, 166, 166, 166, 166, 166, 166, 165, 165, 164, 165, 165, 166, 166, 167, 168, 167, 166, 166, 167, 167, 167, 167, 167, 168, 168, 167, 168, 168, 168, 167, 167, 166, 166, 166, 166, 166, 166, 166, 166, 167, 167, 166, 167, 167, 167, 167, 167, 167, 166, 166, 166, 166, 166, 166, 166, 166, 166, 166, 166, 166, 166, 166, 166, 166, 167, 168, 169, 168, 167, 166, 165, 165, 165, 165, 164, 165, 165, 165, 165, 164, 163, 163, 164, 164, 165, 165, 164, 163, 163, 163, 162, 162, 162, 163, 164, 165, 166, 166, 167, 168, 168, 168, 168, 167, 167, 167, 167, 167, 167, 167, 167, 167, 167, 167, 166, 166, 165]
4235A65J%%J%J%j%jJJj%%jJJjjjjJJ%Jjj%J%Jj%%j%J%J%%%J%Jjjjj%JJj%J%JJJj%j%%%%%j
4227A67%j%%%%%%jJJ%Jjj%%%j%%J%%%J%%%%%%%%%%j%jJ%%J%%j%%%%%J%J%%j%j%%JJjj%J%%
4220A67%%%%J%%%%%%j%%%%%Jj%%j%%J%jjj%J%J%J%%J%j%%%%jj%%JJj%%%%%j%%%J%%J%%%j%
4213A66%%%%%%%J%jjj%%%%%%J%J%%%%jJ%%JJ%%jj%Jj%J%jj%J%JJJj%J%jjJ%%j%%%%jj%J%%
4205A66%%J%%%jj%jJJ%j%%%%J%%J%%%j%jJ%%J%J%J%j%%%%kj%%JJ%j%%%%%%%jj%%%J%j%%J%
4198A65J%%J%j%%%JKjjjjjj%J%%%J%%j%%%%J%jJjj%JL%jj%%j%%J%%%%%JJj%%%jJ%%%%%%%%
4191A66%jJJ%j%jJJ%%%%jjjjJ%J%%%JJJj%%j%%%%%%jj%%%J%J%j%%%J%j%j%JJ%%J%%%%j%j%
4183A65J%j%%%%JJJ%%%jj%J%jjj%J%%J%J%%%j%Jj%%%j%jJ%%%JJJ%%jj%jJ%jJjjJ%J%Jj%%J
$$ y = [165, 166, 166, 166, 167, 167, 168, 168, 167, 167, 166, 167, 168, 167, 167, 167, 166, 167, 168, 167, 166, 165, 164, 165, 166, 166, 167, 166, 165, 165, 166, 166, 167, 166, 166, 166, 165, 165, 166, 166, 167, 167, 167, 167, 168, 168, 169, 168, 167, 166, 165, 165, 166, 167, 166, 166, 167, 167, 168, 169, 170, 169, 169, 168, 168, 168, 168, 168, 168, 167, 167, 166, 166, 166, 166, 166, 166, 166, 165, 166, 167, 167, 168, 167, 166, 166, 166, 166, 165, 165, 165, 166, 166, 166, 166, 167, 167, 167, 167, 167, 167, 167, 167, 167, 167, 167, 166, 166, 165, 166, 166, 166, 167, 167, 167, 166, 166, 166, 166, 166, 166, 167, 167, 168, 168, 168, 167, 167, 166, 166, 166, 167, 168, 167, 166, 166, 167, 167, 167, 167, 167, 167, 167, 168, 168, 168, 168, 168, 168, 168, 167, 167, 167, 167, 167, 167, 168, 167, 167, 167, 166, 166, 166, 167, 167, 166, 165, 164, 164, 165, 165, 166, 166, 167, 167, 167, 168, 168, 167, 167, 167, 167, 167, 166, 165, 165, 165, 166, 167, 166, 166, 166, 166, 166, 166, 165, 165, 165, 165, 166, 166, 166, 167, 167, 167, 167, 166, 166, 166, 166, 166, 166, 166, 166, 166, 167, 167, 166, 165, 164, 164, 164, 164, 164, 164, 164, 165, 165, 166, 166, 166, 166, 166, 165, 166, 166, 166, 167, 168, 168, 168, 167, 166, 166, 167, 166, 166, 167, 167, 166, 165, 165, 166, 166, 167, 168, 169, 168, 168, 169, 169, 168, 167, 168, 168, 168, 167, 167, 167, 167, 167, 166, 165, 165, 166, 166, 166, 166, 166, 167, 167, 167, 167, 166, 165, 165, 164, 165, 166, 166, 165, 165, 165, 165, 165, 166, 166, 166, 167, 167, 167, 167, 166, 166, 165, 166, 166, 166, 167, 167, 168, 168, 169, 169, 168, 168, 168, 168, 168, 166, 165, 165, 165, 166, 167, 167, 166, 166, 166, 166, 166, 166, 166, 166, 165, 164, 164, 164, 164, 165, 165, 164, 164, 164, 165, 165, 166, 166, 166, 167, 167, 166, 166, 166, 166, 167, 169, 168, 167, 166, 165, 164, 163, 163, 164, 164, 164, 164, 165, 165, 165, 164, 164, 164, 164, 164, 165, 165, 164, 165, 164, 163, 163, 164, 167, 167, 166, 165, 165, 165, 164, 164, 164, 165, 165, 165, 165, 165, 165, 166, 167, 166, 166, 166, 166, 165, 166, 166, 166, 166, 166, 166, 166, 166, 166, 166, 165, 166, 167, 167, 166, 166, 165, 166, 167, 167, 167, 167, 167, 166, 165, 164, 163, 164, 164, 165, 165, 165, 165, 166, 167, 168, 167, 167, 167, 166, 166, 166, 166, 166, 166, 166, 165, 164, 164, 164, 164, 165, 165, 166, 166, 165, 165, 165, 165, 166, 166, 165, 165, 164, 164, 165, 166, 166, 166, 167, 167, 167, 167, 167, 166, 166, 165, 165, 166, 166, 165, 165, 165, 165, 165, 166, 167, 168, 168, 168, 168, 167, 166, 166, 167, 167, 166, 165, 164, 164, 165, 165, 165, 166, 166, 167, 167, 167, 167, 166, 166, 167, 166, 166, 166, 166, 165, 165, 164, 165, 165, 165, 165, 166, 167, 168, 168, 168, 167, 166, 166, 165, 166, 166, 165, 166, 165, 164, 165, 165, 166, 166, 167, 166, 166, 166, 167]
4176A67%%J%jk%k%%%%JJJJ%j%j%j%%J%%%%%%%%%%%%%J%%j%Jj%%J%%%j%%j%J%JJ%j%%%%%jJ
4169A66%jj%%%%%J%%JJjj%%%%%J%%%JJ%j%%%%%%%%%%%j%%j%%J%kjJJ%j%%%J%J%%%%%%%%%%
4161A66jj%%%%%J%jjJ%%%%%%JJ%j%%%j%JJ%jjJ%%%%%J%J%%j%%%%J%jj%J%jj%%jjJ%J%%Jjj
4154A63%%%J%%J%%J%J%%j%jJ%%Jjjj%jJJ%%J%J%%J%%jj%jjJJ%%jJ%%J%%j%jjJ%%%%%%%Jjj
4147A64%%%%%%%%%J%%%jj%j%JK%JJ%%j%j%%%%j%j%%JJ%JKj%%%%j%%j%%%%%%jJJj%%jj%JJ%
4139A65%J%%jj%%%J%%%%%%%%%J%jjJ%%J%j%%%jJ%%%%%J%%%%%%%jJ%j%JJj%%%%%j%jJ%J%jj
4132A64jjKK%jjJj%J%J%%%j%%%%Jj%%%jJ%%j%%jJJJ%%j%JK%jjj%j%j%%jJ%J%%%%J%%%%%%%
4125A65%%%%%%%%%%%J%%%j%JJ%j%%%%%%%%j%%J%jJjj%JK%kj%%Kj%jJ%%%%%%%j%jJ%%%%J%J
$$ y = [167, 167, 167, 168, 168, 167, 165, 165, 163, 163, 163, 163, 163, 164, 165, 166, 167, 167, 166, 166, 165, 165, 164, 164, 164, 165, 165, 165, 165, 165, 165, 165, 165, 165, 165, 165, 165, 165, 165, 166, 166, 166, 165, 165, 166, 165, 165, 165, 166, 166, 166, 166, 165, 165, 165, 164, 164, 165, 165, 166, 167, 167, 166, 166, 166, 166, 166, 166, 165, 166, 166, 165, 164, 164, 164, 164, 164, 164, 165, 165, 165, 166, 167, 166, 165, 165, 165, 165, 165, 165, 166, 166, 166, 166, 167, 168, 168, 167, 167, 167, 167, 167, 167, 167, 167, 167, 167, 167, 167, 166, 166, 166, 165, 165, 165, 166, 166, 164, 163, 164, 165, 165, 164, 164, 164, 164, 165, 165, 166, 166, 166, 166, 166, 166, 166, 166, 166, 166, 166, 165, 164, 164, 164, 164, 164, 164, 165, 165, 164, 163, 164, 164, 164, 164, 164, 164, 164, 165, 166, 166, 165, 165, 165, 165, 164, 164, 165, 166, 166, 165, 164, 165, 165, 165, 165, 165, 165, 166, 166, 167, 167, 167, 166, 166, 166, 166, 166, 167, 167, 166, 165, 165, 166, 166, 165, 164, 164, 164, 163, 162, 163, 163, 164, 164, 164, 165, 164, 163, 163, 163, 163, 164, 164, 164, 165, 165, 165, 166, 166, 167, 167, 167, 166, 166, 165, 166, 166, 166, 167, 166, 165, 164, 164, 163, 164, 165, 165, 165, 166, 166, 167, 167, 167, 168, 168, 168, 167, 166, 166, 165, 164, 165, 166, 166, 166, 165, 166, 166, 166, 167, 167, 167, 166, 166, 165, 164, 165, 165, 165, 165, 165, 165, 165, 165, 166, 165, 164, 164, 164, 164, 164, 164, 164, 164, 164, 164, 165, 165, 165, 165, 164, 163, 163, 162, 162, 163, 165, 165, 166, 167, 167, 167, 166, 166, 165, 165, 165, 165, 165, 164, 164, 163, 163, 163, 164, 165, 165, 166, 168, 167, 167, 167, 167, 167, 166, 166, 166, 165, 165, 165, 165, 165, 165, 165, 164, 165, 166, 165, 165, 165, 164, 163, 163, 164, 165, 165, 165, 166, 166, 166, 165, 164, 164, 164, 164, 165, 165, 165, 165, 165, 165, 165, 165, 165, 165, 166, 166, 165, 164, 165, 165, 165, 166, 166, 165, 165, 165, 165, 164, 165, 165, 165, 165, 165, 165, 166, 166, 166, 166, 166, 166, 166, 166, 165, 166, 166, 165, 165, 166, 167, 166, 166, 166, 166, 166, 166, 165, 165, 164, 165, 165, 166, 166, 165, 164, 163, 162, 164, 166, 166, 165, 164, 165, 164, 164, 165, 165, 166, 166, 166, 166, 165, 165, 165, 165, 165, 166, 165, 165, 165, 165, 164, 165, 165, 165, 164, 164, 164, 163, 164, 165, 166, 166, 166, 165, 165, 166, 168, 168, 167, 166, 165, 165, 164, 164, 163, 163, 163, 162, 163, 163, 164, 164, 164, 164, 164, 165, 165, 165, 165, 165, 165, 165, 165, 165, 165, 165, 165, 165, 165, 165, 165, 165, 165, 165, 166, 166, 166, 166, 165, 165, 166, 167, 167, 166, 166, 166, 166, 166, 166, 166, 166, 166, 165, 165, 165, 166, 166, 165, 166, 165, 164, 164, 165, 167, 167, 165, 164, 164, 164, 166, 165, 165, 164, 165, 165, 165, 165, 165, 165, 165, 165, 164, 164, 163, 164, 164, 164, 164, 164, 165, 165, 166]
4118A66%JJ%kj%%%%J%%jj%J%%k%%%%%%%%JJ%J%j%%%%%%%%j%%%j%J%%J%J%%J%%%j%j%%j%%%
4110A64%%%%J%J%%%j%%%%%%%%jJJj%%%%%%%Jj%%%JJ%j%%%Jj%j%%Jjj%%Jjj%J%J%%%%j%j%%
4103A63%%%%j%J%J%J%%%%j%%%%%Jj%%%%JJ%j%J%kj%%%%%J%%%Jj%%%%%%%%%%%%%%%%%%%%%%
4096A64%j%%%%%J%%%%J%%%%%%%Jj%%%%%j%j%JJJJkj%%J%%jjJ%J%j%JjJJJkj%JJ%JJjj%%%%
4088A66%j%%j%J%%jj%%%J%%J%Jj%%%%%Jj%%%%%%%J%%%kj%JJjJ%J%%%J%jj%%jjjJ%%%%%%JJ
4081A65%Jk%j%J%%%J%%J%j%jj%%%%J%J%%%J%%%%%J%k%%J%kj%J%%%%J%%%%%%%j%%%%%%%%JJ
4074A66%%%%J%%j%J%jj%jJJ%%%%%j%j%%j%%J%%j%J%%%%%jj%J%j%J%%%%J%jJ%%Jj%%%%%%%%
4066A64%%%JJ%%%j%%j%%%%%%%j%%%%J%Jjj%%%J%J%J%j%jJJ%%%%%j%j%KJjk%%J%JjjjjJ%%%
$$ y = [166, 166, 167, 168, 168, 166, 165, 165, 165, 165, 165, 166, 166, 166, 165, 164, 164, 165, 165, 165, 163, 163, 163, 163, 163, 163, 163, 163, 163, 164, 165, 165, 166, 166, 165, 165, 165, 165, 165, 165, 165, 165, 165, 164, 164, 164, 164, 163, 163, 164, 164, 164, 165, 165, 166, 166, 166, 167, 167, 167, 167, 166, 166, 165, 165, 165, 164, 164, 164, 164, 164, 164, 164, 164, 165, 165, 166, 166, 166, 166, 165, 165, 165, 165, 165, 165, 165, 165, 165, 164, 165, 166, 165, 165, 165, 165, 165, 165, 165, 165, 166, 165, 165, 165, 165, 166, 167, 167, 166, 166, 166, 166, 167, 166, 166, 165, 165, 165, 166, 165, 164, 164, 164, 165, 164, 163, 163, 164, 164, 165, 165, 165, 165, 165, 164, 164, 163, 163, 163, 163, 163, 163, 163, 162, 162, 163, 163, 164, 164, 165, 165, 165, 165, 165, 164, 164, 164, 164, 164, 164, 165, 164, 164, 164, 164, 164, 165, 166, 166, 165, 165, 166, 166, 164, 163, 163, 163, 163, 163, 163, 164, 164, 164, 164, 165, 164, 164, 164, 164, 164, 164, 164, 164, 164, 164, 164, 164, 164, 164, 164, 164, 164, 164, 164, 164, 164, 164, 164, 164, 163, 163, 163, 163, 163, 163, 164, 164, 164, 164, 164, 165, 165, 165, 165, 165, 165, 165, 165, 166, 165, 165, 165, 165, 165, 165, 164, 164, 163, 163, 164, 165, 166, 167, 165, 164, 164, 164, 165, 165, 165, 164, 163, 164, 164, 165, 165, 164, 164, 165, 164, 165, 166, 167, 165, 164, 164, 165, 166, 166, 167, 168, 167, 166, 166, 166, 166, 166, 166, 165, 165, 165, 164, 164, 165, 165, 165, 164, 163, 163, 163, 163, 164, 164, 164, 165, 165, 166, 165, 165, 165, 165, 165, 165, 166, 165, 165, 165, 165, 165, 165, 165, 165, 166, 166, 166, 166, 164, 163, 163, 164, 165, 164, 165, 165, 166, 166, 166, 166, 167, 167, 166, 165, 165, 165, 164, 163, 162, 163, 163, 163, 163, 163, 163, 163, 164, 165, 165, 166, 164, 164, 163, 163, 164, 164, 164, 164, 165, 165, 165, 166, 166, 165, 165, 164, 163, 163, 163, 163, 163, 164, 164, 165, 165, 165, 165, 166, 166, 166, 166, 166, 166, 167, 167, 165, 165, 165, 166, 166, 164, 163, 163, 164, 164, 164, 164, 164, 165, 165, 165, 165, 165, 165, 165, 165, 164, 164, 164, 164, 164, 164, 164, 164, 164, 165, 166, 166, 166, 166, 166, 167, 167, 167, 166, 166, 167, 167, 166, 165, 165, 164, 165, 166, 166, 166, 166, 166, 166, 165, 165, 164, 164, 164, 163, 163, 163, 164, 164, 164, 163, 163, 164, 164, 164, 164, 164, 164, 163, 162, 162, 163, 163, 162, 162, 163, 163, 163, 163, 163, 164, 164, 163, 164, 164, 164, 165, 164, 164, 164, 164, 164, 164, 164, 164, 164, 164, 164, 164, 165, 166, 166, 166, 166, 165, 165, 165, 164, 164, 164, 164, 164, 164, 164, 164, 163, 163, 163, 163, 163, 164, 164, 165, 164, 163, 163, 163, 163, 164, 164, 165, 165, 166, 166, 165, 165, 164, 165, 166, 166, 166, 166, 166, 166, 165, 165, 164, 164, 166, 167, 166, 164, 164, 164, 165, 165, 166, 165, 164, 163, 162, 163, 163, 163, 163]
4059A63%%%%%j%%%J%J%%%Jj%%%%%%J%j%jJ%j%J%%j%%Jjj%%%%%%KJJjj%%%%%%%%J%%j%jJ%%
4052A64%j%%J%%%%%%%j%jJ%%%Jj%J%%%Jj%%j%%%%%J%%J%kj%%JJ%%%%J%JJjjj%jJ%J%%%%jj
4044A63%J%Jjj%%%%J%%jJ%%%%Jj%%%J%%%%%j%%jJ%%%%%J%%j%%jj%J%JJJ%%%%%jj%%JJ%%%j
4037A65%%JJ%j%%%j%%%%Jj%j%%%%J%jKJjjj%%j%%J%%%%%%%%K%jj%%%JJ%jjj%%J%JJ%%j%jj
4030A63%%%%%%%%%%%%j%%%J%jk%%JJ%%%%%%%%%Jj%JJ%%j%JjjJJJ%%%j%%J%jj%jJ%%%j%%%J
4022A63%%%%%%J%J%%%jj%%%J%%%j%j%Jj%%%%J%%%J%%%JJ%%j%jj%%%%%J%J%%jj%%%%%Jj%j%
4015A62J%JJjjJ%%%j%%%%J%J%%%%%j%jJ%jjJJj%j%%K%%j%%%%%%j%%JJ%Jjj%%%%%J%%%%j%%
4008A63JkjJ%JJ%jj%%%J%J%J%%Jjj%Jj%j%%%%%J%%jJJ%j%%%%%jjJJ%J%j%%%j%%%%%%%jjJ%
$$ y = [163, 163, 163, 163, 163, 163, 162, 162, 162, 162, 163, 163, 164, 164, 164, 164, 165, 164, 164, 164, 164, 164, 164, 164, 165, 165, 164, 164, 163, 164, 164, 163, 163, 164, 164, 164, 163, 163, 163, 164, 163, 162, 162, 162, 162, 162, 162, 162, 164, 165, 166, 165, 164, 164, 164, 164, 164, 164, 164, 164, 164, 165, 165, 165, 164, 164, 163, 164, 164, 164, 164, 163, 163, 163, 164, 164, 164, 164, 164, 164, 164, 164, 163, 163, 162, 163, 163, 163, 163, 164, 163, 163, 164, 164, 164, 164, 165, 164, 164, 164, 163, 163, 163, 163, 163, 163, 164, 164, 164, 165, 165, 163, 162, 162, 162, 163, 164, 164, 164, 164, 164, 165, 165, 166, 167, 166, 165, 164, 164, 163, 164, 164, 165, 165, 165, 165, 165, 164, 163, 163, 164, 164, 165, 164, 163, 163, 163, 163, 163, 164, 164, 164, 163, 164, 164, 164, 164, 164, 165, 164, 164, 164, 164, 165, 165, 165, 165, 165, 165, 164, 164, 164, 163, 164, 164, 164, 164, 164, 164, 165, 165, 165, 164, 164, 164, 163, 162, 162, 163, 163, 164, 165, 166, 166, 166, 166, 166, 166, 165, 164, 164, 164, 165, 166, 166, 166, 166, 165, 165, 165, 166, 167, 167, 166, 166, 166, 166, 165, 165, 165, 165, 165, 166, 165, 165, 164, 164, 164, 164, 164, 165, 165, 164, 166, 167, 166, 165, 164, 164, 164, 163, 163, 163, 164, 164, 164, 164, 164, 164, 164, 164, 164, 166, 166, 165, 164, 164, 164, 164, 165, 166, 166, 165, 164, 163, 163, 163, 164, 164, 165, 166, 166, 166, 165, 165, 164, 163, 163, 163, 163, 163, 163, 163, 163, 163, 163, 163, 163, 163, 162, 162, 162, 162, 163, 163, 162, 160, 160, 160, 161, 162, 162, 162, 162, 162, 162, 162, 162, 162, 162, 163, 162, 162, 163, 164, 164, 164, 163, 163, 164, 163, 162, 163, 164, 165, 165, 165, 165, 164, 164, 164, 165, 165, 164, 163, 163, 162, 163, 163, 163, 163, 162, 162, 162, 162, 163, 163, 163, 163, 163, 163, 163, 164, 164, 165, 165, 165, 165, 164, 163, 163, 163, 163, 164, 164, 164, 164, 163, 163, 162, 162, 163, 162, 162, 162, 162, 162, 163, 163, 163, 163, 164, 164, 164, 164, 165, 166, 166, 166, 165, 165, 164, 163, 163, 163, 163, 163, 163, 164, 164, 165, 165, 165, 164, 163, 163, 163, 163, 163, 163, 164, 163, 163, 162, 162, 163, 163, 164, 165, 164, 163, 164, 164, 164, 164, 163, 163, 163, 163, 163, 164, 164, 165, 165, 165, 165, 165, 165, 164, 164, 163, 164, 164, 163, 162, 163, 164, 163, 163, 162, 162, 162, 164, 164, 164, 163, 163, 163, 163, 163, 163, 163, 162, 162, 162, 163, 164, 164, 165, 164, 163, 163, 163, 163, 163, 163, 164, 164, 164, 164, 164, 163, 163, 163, 164, 162, 161, 162, 162, 163, 164, 164, 163, 162, 162, 162, 162, 163, 163, 164, 164, 165, 165, 165, 166, 165, 164, 164, 165, 164, 164, 163, 163, 163, 163, 163, 163, 164, 164, 164, 163, 164, 165, 165, 164, 164, 164, 164, 164, 164, 163, 162, 163, 164, 164, 165, 165, 164, 164, 164, 164, 163, 163, 163, 163, 163, 163, 163, 163, 162, 161, 162, 162]
4001A62JKj%%J%%%jJ%%%jj%j%j%%KJJjjj%jJ%J%%JjjJ%J%J%%jj%jj%JJK%%jjjj%KJ%%Jj%%
3993A64j%%j%%%j%%J%%%JJj%%%%J%%%%%%%jj%j%%%JJJ%%%Jj%%jkJJK%%%J%%jjj%%jjJKKj%
3986A65j%%J%jJj%jj%%%%%%J%J%%%%%%%%j%J%j%j%%%%JJ%%%jJ%J%j%j%jJJ%j%J%%%%k%J%j
3979A62J%%%%%%J%j%%j%%J%%%%JjJJ%%Jj%j%%jJ%%Jjj%jJ%%%%%%%J%JJj%j%%%%%%%J%%%%j
3971A64%%%%%jj%j%%JJJj%jjJJJ%%jj%%%J%Jjjj%%JJ%%JJj%%%j%%%%%%jj%%J%JK%jj%j%%j
3964A61%%J%%%%%%j%%J%Jj%%%%%%jJJJJ%k%JJ%J%%%j%%%%%%%%jj%K%jjj%JJj%%jj%%%%J%J
3957A63%J%%%%%%%%jj%j%JJ%%%j%%%%%jjJ%%%%jJJJjjJ%Jjj%%J%%%J%J%%kj%J%JJ%jj%%%%
3949A62%JJJJ%%j%jj%j%J%J%%%%%%jJ%%JJj%jjJ%%Jj%%j%J%%jj%J%j%JJJj%j%%%%j%%%%%%
$$ y = [162, 163, 165, 164, 164, 164, 165, 165, 165, 165, 164, 165, 165, 165, 165, 164, 163, 163, 162, 162, 161, 161, 161, 163, 164, 165, 164, 163, 162, 162, 161, 162, 162, 163, 163, 163, 164, 163, 162, 163, 163, 164, 164, 165, 165, 165, 164, 163, 163, 162, 161, 161, 162, 163, 165, 165, 165, 164, 163, 162, 161, 161, 163, 164, 164, 164, 165, 164, 164, 164, 163, 163, 163, 162, 162, 162, 162, 161, 161, 161, 162, 162, 162, 162, 163, 164, 163, 163, 163, 163, 163, 164, 164, 164, 164, 164, 164, 164, 164, 163, 162, 162, 161, 161, 161, 161, 162, 163, 164, 164, 164, 164, 165, 164, 164, 164, 163, 161, 162, 163, 165, 165, 165, 165, 166, 166, 166, 165, 164, 163, 163, 163, 162, 161, 162, 164, 166, 165, 165, 164, 164, 164, 165, 165, 164, 165, 164, 164, 163, 162, 162, 162, 162, 162, 162, 162, 163, 163, 164, 164, 164, 164, 164, 164, 164, 164, 164, 163, 163, 164, 164, 163, 163, 162, 162, 162, 162, 162, 163, 164, 164, 164, 164, 163, 164, 164, 165, 165, 164, 164, 163, 163, 162, 163, 164, 164, 163, 163, 164, 164, 164, 164, 164, 162, 162, 163, 163, 162, 163, 163, 163, 163, 163, 163, 163, 164, 164, 163, 163, 163, 162, 162, 162, 163, 163, 163, 163, 163, 164, 163, 164, 165, 165, 165, 166, 165, 165, 164, 164, 164, 163, 164, 164, 164, 165, 164, 163, 163, 162, 163, 163, 163, 163, 163, 163, 163, 163, 164, 164, 165, 166, 165, 165, 164, 164, 164, 164, 164, 164, 164, 164, 165, 165, 165, 165, 165, 164, 164, 164, 164, 164, 164, 163, 162, 162, 161, 161, 161, 162, 163, 164, 163, 163, 162, 161, 162, 163, 164, 164, 164, 163, 162, 162, 162, 162, 163, 163, 164, 163, 162, 161, 161, 161, 162, 163, 163, 163, 164, 165, 164, 164, 164, 164, 163, 163, 163, 163, 163, 163, 163, 162, 161, 161, 161, 162, 162, 163, 165, 165, 164, 163, 163, 162, 162, 162, 161, 161, 161, 162, 162, 162, 162, 162, 162, 162, 161, 161, 161, 162, 162, 163, 162, 162, 162, 162, 162, 162, 162, 161, 162, 163, 164, 165, 165, 163, 163, 164, 165, 165, 166, 166, 166, 166, 165, 165, 165, 165, 165, 165, 165, 165, 165, 164, 163, 163, 165, 165, 164, 163, 162, 162, 163, 164, 163, 163, 163, 162, 161, 161, 161, 161, 161, 162, 162, 163, 163, 164, 164, 164, 164, 164, 164, 164, 164, 164, 163, 162, 162, 161, 161, 162, 163, 163, 163, 163, 162, 162, 162, 162, 162, 162, 161, 160, 161, 161, 161, 161, 161, 160, 161, 162, 163, 162, 161, 162, 162, 163, 162, 161, 161, 161, 162, 162, 162, 162, 163, 163, 164, 164, 164, 162, 161, 161, 162, 162, 163, 164, 164, 163, 162, 162, 162, 162, 162, 162, 163, 164, 165, 166, 166, 166, 165, 165, 164, 163, 163, 162, 162, 163, 163, 164, 164, 164, 164, 164, 164, 164, 163, 164, 164, 164, 165, 166, 165, 165, 164, 163, 164, 164, 164, 165, 164, 164, 164, 163, 163, 164, 164, 164, 163, 162, 162, 163, 163, 162, 162, 163, 164, 165, 164, 164, 163, 163, 163, 163, 163, 162, 162, 162, 162, 162, 162, 162]
3942A62JJ%%jjj%JJj%%j%%JJ%%%%J%%j%%j%%%JJjj%%%j%JJ%%%%j%Jj%Jj%%%%%%J%%%J%%jJ
3935A64%J%%%kjj%J%%JJ%jjJ%%Jjj%j%%J%%jJ%j%%%J%%%%%%j%%J%%%%%%%%%%%%%j%J%%J%K
3927A65%jj%%%%%j%%j%%%J%%%j%%%%%J%%%%%J%J%%%%kj%JJ%JJ%%jkj%%J%%%j%%%%%%J%JJ%
3920A64jjJ%%%J%%%jjj%%J%jjJJJjjJ%%J%%%jjj%j%JJJjjJJJ%%%%jj%J%%%%%J%%%%%%%%%J
3913A64%j%%j%%%%%%J%JJ%%j%%j%%j%%Jj%j%jJJJK%j%%jj%JJjjjj%%%JJj%jJJ%%%%Jj%%jJ
3906A62j%%Jj%%JJjk%%J%%KJJ%%jkj%%J%J%%J%jj%%%%%%%J%kj%JJJJ%Jjjj%%j%JJ%JjJ%%%
3898A64%jj%JJ%%jjJ%%%%%JJ%jjj%j%%%%JJ%jj%%JK%%%JJj%j%j%%%J%%%j%j%%%%%%j%j%J%
3891A61%%%%%%J%%%JJ%%jj%J%%j%%%%%j%%J%%JJ%j%%%J%j%%jJ%%%jj%%J%%%%%%J%%%%%%%%
$$ y = [162, 163, 164, 164, 164, 163, 162, 161, 161, 162, 163, 162, 162, 162, 161, 161, 161, 162, 163, 163, 163, 163, 163, 164, 164, 164, 163, 163, 163, 162, 162, 162, 162, 163, 164, 163, 162, 162, 162, 162, 161, 161, 162, 163, 163, 163, 163, 163, 162, 162, 163, 162, 162, 163, 162, 162, 162, 162, 162, 162, 162, 163, 163, 163, 163, 164, 164, 164, 163, 164, 164, 165, 165, 165, 165, 163, 162, 161, 161, 162, 162, 162, 163, 164, 164, 163, 162, 163, 163, 163, 164, 163, 162, 162, 161, 161, 161, 162, 162, 162, 161, 162, 162, 161, 161, 161, 161, 162, 162, 162, 162, 162, 162, 162, 161, 161, 161, 162, 162, 162, 162, 162, 162, 162, 162, 162, 162, 162, 162, 162, 162, 161, 161, 162, 162, 162, 163, 163, 165, 165, 164, 163, 163, 163, 163, 163, 163, 162, 162, 162, 161, 161, 161, 161, 162, 162, 162, 162, 161, 161, 161, 161, 161, 161, 162, 162, 162, 162, 162, 162, 163, 163, 164, 164, 164, 164, 164, 162, 161, 161, 162, 163, 163, 164, 165, 165, 165, 164, 162, 161, 161, 161, 162, 162, 162, 162, 161, 161, 161, 161, 161, 161, 161, 162, 162, 163, 164, 164, 163, 162, 163, 163, 163, 163, 164, 164, 164, 164, 163, 162, 161, 161, 161, 162, 162, 161, 160, 161, 162, 163, 162, 161, 162, 162, 162, 163, 163, 163, 163, 162, 161, 160, 160, 159, 159, 160, 161, 162, 161, 160, 161, 162, 163, 163, 163, 163, 163, 162, 161, 161, 162, 162, 162, 162, 162, 162, 163, 163, 163, 163, 163, 163, 163, 163, 163, 163, 164, 164, 163, 163, 163, 162, 162, 162, 162, 162, 162, 162, 163, 163, 164, 165, 165, 165, 164, 164, 164, 163, 163, 163, 162, 162, 162, 163, 162, 162, 161, 161, 160, 161, 162, 163, 165, 165, 164, 164, 164, 163, 162, 162, 163, 164, 163, 162, 161, 160, 160, 160, 160, 161, 162, 161, 161, 160, 161, 162, 162, 162, 162, 162, 163, 162, 162, 162, 161, 162, 161, 161, 161, 162, 161, 161, 161, 162, 163, 162, 160, 160, 160, 161, 161, 161, 163, 164, 165, 165, 165, 164, 162, 161, 161, 161, 162, 162, 163, 163, 163, 164, 164, 163, 162, 162, 162, 162, 162, 162, 162, 162, 163, 163, 161, 160, 160, 161, 162, 163, 164, 164, 165, 164, 163, 162, 162, 162, 161, 161, 162, 163, 163, 164, 163, 164, 164, 164, 164, 164, 163, 162, 162, 163, 164, 164, 164, 163, 162, 163, 163, 163, 163, 163, 163, 164, 165, 165, 164, 163, 162, 162, 161, 161, 161, 161, 161, 162, 163, 163, 162, 161, 161, 161, 162, 164, 164, 164, 164, 165, 166, 165, 165, 164, 164, 163, 163, 163, 163, 164, 164, 164, 164, 163, 163, 162, 162, 162, 162, 162, 162, 162, 161, 161, 160, 160, 161, 161, 161, 161, 161, 161, 161, 161, 162, 162, 162, 162, 163, 164, 164, 164, 163, 162, 162, 163, 163, 163, 162, 162, 162, 162, 162, 162, 161, 161, 161, 162, 162, 162, 163, 164, 164, 163, 163, 163, 163, 164, 164, 163, 163, 163, 162, 163, 163, 163, 163, 162, 161, 161, 161, 162, 162, 162, 162, 162, 162, 162, 163, 163, 163, 163, 163, 163, 163, 163, 163]
3884A63jJ%%j%%j%j%K%%J%%%j%%jj%%%%Jj%%%%jJ%J%J%%j%%%%%%%%%jKJ%%%%%%%%%jj%%%J
3876A62J%%kj%%JJ%J%j%%%%%jjjJ%J%J%%j%%%%JJ%%%j%%%%jj%jJ%JJ%%%%jjj%JJJJj%jjJ%
3869A61J%%%%jj%JJ%%%%jjjjJ%J%J%%Jj%%j%%J%%JjjJ%%%j%%%%J%J%%j%%%%%%%%%%%%%%%J
3862A62%%%%%Jj%%%j%j%%JJJ%jj%jJJJ%jjk%J%%%%Jj%%%jjJJJJJ%k%%%%%%jj%JJ%jj%JJ%%
3854A61jkJJ%J%J%%j%%%%%%%j%%%%%%%J%%J%jjjJJ%JJj%%J%jj%jJj%JJ%%j%%j%%%%jKJ%%%
3847A62jJJ%%j%%J%%j%J%jjjjJ%%J%%%%Jj%jjjJ%J%%J%%%j%jJ%%J%j%j%j%%JJJ%J%%%%Jjj
3840A61%%%J%%%JJ%%%%Jjkkj%J%Jjj%J%J%J%%kk%JJ%J%%JKjjjj%%%%%%J%%j%%%%j%J%%JJ%
3832A62%%J%j%%J%%%j%%%%j%J%%%%%%%%jjJ%J%j%%jj%%J%%%%J%%%%j%J%jj%%%%%KJ%%%jj%
$$ y = [163, 162, 163, 163, 163, 162, 162, 162, 161, 161, 160, 160, 162, 162, 162, 163, 163, 163, 163, 162, 162, 162, 161, 160, 160, 160, 160, 160, 161, 160, 160, 160, 160, 160, 159, 160, 160, 161, 161, 162, 162, 162, 161, 161, 161, 161, 161, 161, 161, 161, 161, 161, 160, 162, 163, 163, 163, 163, 163, 163, 163, 163, 163, 163, 162, 161, 161, 161, 161, 162, 163, 163, 163, 161, 160, 160, 160, 161, 162, 162, 163, 163, 162, 162, 162, 162, 162, 162, 161, 160, 159, 160, 160, 161, 161, 162, 162, 162, 161, 161, 161, 161, 161, 162, 163, 163, 163, 163, 162, 162, 162, 162, 162, 161, 160, 160, 159, 160, 160, 161, 162, 162, 162, 162, 162, 161, 160, 159, 159, 160, 161, 162, 163, 162, 162, 161, 160, 161, 161, 162, 162, 162, 162, 162, 161, 160, 160, 161, 162, 162, 162, 162, 162, 161, 160, 159, 158, 159, 159, 160, 160, 161, 161, 161, 162, 161, 161, 161, 160, 160, 160, 161, 161, 161, 162, 161, 160, 161, 161, 161, 161, 160, 160, 160, 160, 160, 161, 161, 162, 162, 162, 161, 161, 161, 161, 161, 161, 161, 161, 161, 161, 161, 161, 161, 161, 161, 161, 162, 162, 162, 162, 162, 162, 163, 162, 162, 162, 162, 161, 161, 160, 160, 160, 161, 162, 163, 163, 162, 161, 161, 160, 161, 162, 163, 163, 162, 161, 159, 159, 160, 160, 160, 160, 160, 161, 160, 160, 160, 160, 159, 158, 159, 160, 161, 162, 163, 163, 161, 161, 161, 161, 161, 161, 161, 160, 159, 159, 160, 161, 161, 160, 159, 159, 160, 161, 161, 161, 160, 158, 159, 160, 160, 161, 161, 162, 162, 162, 161, 161, 161, 161, 161, 161, 161, 161, 160, 160, 160, 160, 160, 160, 160, 160, 161, 161, 161, 162, 162, 161, 160, 159, 160, 161, 161, 162, 163, 162, 162, 162, 163, 163, 162, 161, 161, 160, 161, 160, 160, 161, 162, 162, 162, 161, 161, 161, 160, 160, 160, 160, 160, 159, 161, 162, 162, 162, 162, 161, 162, 163, 163, 163, 162, 162, 162, 163, 163, 163, 162, 162, 163, 163, 162, 161, 160, 159, 160, 160, 160, 161, 161, 161, 161, 161, 162, 161, 161, 160, 159, 158, 159, 159, 160, 160, 160, 161, 161, 161, 161, 160, 160, 159, 160, 160, 160, 161, 161, 160, 160, 159, 159, 158, 158, 158, 159, 160, 161, 161, 162, 162, 162, 162, 162, 163, 162, 161, 161, 161, 161, 162, 162, 162, 162, 163, 164, 164, 164, 164, 164, 165, 164, 162, 160, 159, 159, 160, 160, 161, 160, 159, 159, 160, 160, 161, 161, 162, 162, 162, 160, 158, 158, 159, 160, 160, 161, 161, 161, 162, 164, 163, 162, 161, 160, 160, 160, 160, 160, 160, 160, 161, 161, 161, 160, 160, 160, 160, 160, 159, 159, 160, 160, 160, 161, 162, 162, 162, 162, 163, 163, 162, 162, 162, 163, 163, 163, 163, 162, 162, 162, 162, 162, 161, 161, 162, 162, 162, 162, 162, 162, 162, 162, 162, 161, 160, 161, 161, 162, 162, 161, 161, 161, 160, 159, 159, 159, 160, 160, 160, 160, 160, 161, 161, 161, 161, 161, 160, 160, 161, 161, 160, 159, 159, 159, 159, 159, 159, 161, 162, 162, 162, 162, 161, 160, 160]
3825A60%%%%%%j%JJ%%%%%%%jj%%J%%%J%%%%%%%j%%jJ%%%J%%%j%%%%J%JJj%%%%%j%%JJ%jk%
3818A60J%%%%%%J%%%%%jjj%%J%J%%J%%Jjjj%%%%j%%%%J%%%%%%%%%J%JJ%jj%%J%%%%jkk%JJ
3810A59%j%KJ%%j%%%J%%%%%%J%%Jj%%%j%%jjJJ%%jJ%%JJj%%jJ%j%%%j%%%%%%%%%%%j%%j%J
3803A59JJ%%%jjJ%%J%%%%%%%JJjjj%jJJ%%j%j%jjJ%%%%JJjJ%%J%%jjj%%%%%%%J%J%%J%%%%
3796A61%%%%%%j%J%%%%%%j%%j%%%JJ%kjKJ%j%%%%J%%%Jj%%%%%jJ%%J%%%jj%jJJJ%%jj%%%%
3789A60%%%JJJ%jk%%%JjjjJ%%%%%%J%%J%j%%%%JJ%%j%j%%j%KJ%jj%j%%%J%%j%J%%%%%%%JJ
3781A62%%jj%%%KJ%j%%J%%%%%%%%j%%j%%%j%J%JJ%jj%JJjj%j%j%J%JJj%JJ%J%j%j%j%jJ%%
3774A61jJ%k%JJj%%%JJj%%%j%j%%%j%j%%KKJj%jj%J%j%%Jj%jJ%%%J%%J%%J%%%%%j%j%j%JJ
$$ y = [160, 160, 160, 160, 160, 160, 160, 159, 159, 160, 161, 161, 161, 161, 161, 161, 161, 161, 160, 159, 159, 159, 160, 160, 160, 160, 161, 161, 161, 161, 161, 161, 161, 161, 160, 160, 160, 159, 160, 160, 160, 160, 161, 161, 161, 161, 160, 160, 160, 160, 160, 161, 161, 162, 163, 162, 162, 162, 162, 162, 162, 161, 161, 161, 162, 163, 163, 162, 160, 160, 161, 161, 161, 161, 161, 161, 161, 162, 162, 162, 162, 162, 162, 161, 160, 159, 159, 159, 160, 160, 161, 161, 161, 162, 162, 162, 163, 162, 161, 160, 160, 160, 160, 160, 159, 159, 159, 159, 159, 160, 160, 160, 160, 160, 160, 160, 160, 160, 160, 161, 161, 162, 163, 163, 162, 161, 161, 161, 162, 162, 162, 162, 162, 161, 159, 157, 157, 158, 159, 159, 158, 158, 160, 161, 161, 161, 160, 160, 160, 160, 161, 161, 161, 161, 161, 161, 161, 162, 162, 162, 163, 162, 162, 162, 162, 161, 161, 161, 160, 159, 160, 161, 161, 161, 160, 161, 161, 161, 162, 163, 162, 162, 162, 161, 162, 162, 161, 161, 161, 161, 160, 160, 160, 160, 160, 160, 160, 160, 160, 160, 160, 160, 159, 159, 159, 158, 158, 159, 160, 161, 161, 161, 161, 160, 159, 160, 160, 160, 161, 161, 161, 161, 161, 161, 161, 161, 162, 163, 162, 161, 160, 160, 159, 160, 161, 161, 161, 160, 160, 159, 159, 158, 157, 158, 158, 158, 158, 158, 159, 160, 159, 160, 160, 160, 161, 161, 161, 160, 159, 158, 158, 158, 158, 158, 158, 158, 158, 159, 159, 160, 160, 160, 161, 161, 161, 161, 161, 161, 161, 161, 161, 161, 161, 160, 160, 161, 161, 161, 161, 161, 161, 161, 160, 160, 160, 159, 159, 159, 159, 160, 161, 161, 159, 158, 160, 161, 161, 160, 160, 160, 160, 160, 161, 161, 161, 161, 162, 161, 161, 161, 161, 161, 161, 160, 161, 161, 161, 162, 162, 162, 162, 161, 160, 160, 159, 160, 161, 162, 162, 162, 161, 160, 160, 160, 160, 160, 160, 160, 160, 161, 162, 163, 163, 162, 160, 160, 160, 160, 161, 160, 159, 158, 159, 159, 159, 159, 159, 159, 159, 160, 160, 160, 161, 161, 160, 160, 160, 160, 160, 161, 162, 162, 162, 161, 161, 160, 160, 160, 159, 159, 161, 162, 162, 161, 160, 160, 159, 159, 159, 159, 160, 160, 160, 159, 159, 160, 160, 160, 160, 160, 160, 160, 160, 161, 162, 162, 162, 161, 160, 160, 160, 160, 162, 163, 163, 162, 162, 162, 163, 163, 163, 163, 163, 163, 163, 163, 163, 162, 162, 162, 161, 161, 161, 161, 160, 160, 161, 161, 162, 163, 163, 162, 161, 161, 162, 163, 162, 161, 161, 160, 160, 159, 159, 160, 160, 161, 162, 161, 161, 162, 163, 163, 164, 164, 163, 163, 162, 162, 161, 161, 160, 161, 161, 161, 160, 161, 161, 159, 159, 160, 161, 160, 160, 160, 160, 161, 162, 161, 161, 161, 161, 160, 160, 159, 159, 159, 159, 158, 158, 157, 157, 157, 159, 161, 162, 161, 161, 160, 159, 159, 160, 160, 159, 159, 159, 160, 159, 159, 158, 159, 159, 159, 159, 160, 160, 160, 161, 161, 161, 162, 162, 162, 162, 162, 162, 161, 161, 160, 160, 159, 159, 160, 161]
3767A61j%%j%j%jJJ%J%%%jJ%%%%%%%%%J%%J%%J%%%jj%j%%%JjJ%%%J%%%%j%%jk%%J%J%j%J%
3759A60Jj%%%JJ%jjjJJ%%%%k%%%%%%%%JJ%%J%%jj%%%%%%%%j%%JJ%jjj%%%JJJJ%j%%%j%%jJ
3752A60%%%%%%J%j%%%%%j%J%j%%%J%%%%%%%J%%J%%j%jj%%%%J%%j%%%J%%JJ%%%jj%%j%K%%%
3745A61j%jj%%%JJ%%JJ%Jjj%JJ%j%j%j%J%%J%%%%%j%%%jj%%jJJJJjjJ%%jj%%%J%%jjJ%%%J
3737A60%J%k%%%J%Jjj%J%%J%%%j%%JJj%%%%jjj%JJJ%%jj%%JjJJ%j%%jJ%%J%%jJKJ%jkj%JJ
3730A62%J%jj%j%J%%%j%%j%%jJ%J%%%%%%%%Jj%%%%jj%J%%J%j%%%%j%JJj%JJj%jjjJJjJJ%j
3723A59j%J%J%%%%%J%%JJjj%%%%%%j%%j%%%J%%%%J%kj%J%%%%%%%j%%J%%%%%%%j%%JJ%j%%%
3715A59%%%%%%%J%%%j%%J%jj%JJ%%%%j%j%JJ%J%%J%%%%%%%%%j%J%%JJKJJJLMOQRJ0P%oj0j0
$$ y = [161, 160, 160, 160, 159, 159, 158, 158, 157, 158, 159, 159, 160, 160, 160, 160, 159, 160, 160, 160, 160, 160, 160, 160, 160, 160, 160, 161, 161, 161, 162, 162, 162, 163, 163, 163, 163, 162, 161, 161, 160, 160, 160, 160, 161, 160, 161, 161, 161, 161, 162, 162, 162, 162, 162, 161, 161, 161, 160, 158, 158, 158, 159, 159, 160, 160, 159, 159, 160, 160, 161, 160, 160, 160, 160, 161, 162, 162, 161, 160, 159, 160, 161, 161, 161, 161, 161, 159, 159, 159, 159, 159, 159, 159, 159, 159, 160, 161, 161, 161, 162, 162, 162, 161, 160, 160, 160, 160, 160, 160, 160, 160, 160, 159, 159, 159, 160, 161, 161, 160, 159, 158, 158, 158, 158, 159, 160, 161, 162, 162, 161, 161, 161, 161, 160, 160, 160, 159, 160, 160, 160, 160, 160, 160, 160, 161, 161, 160, 160, 160, 160, 160, 160, 159, 159, 160, 160, 159, 159, 159, 159, 160, 160, 160, 160, 160, 160, 160, 160, 161, 161, 161, 162, 162, 162, 161, 161, 160, 159, 159, 159, 159, 159, 160, 160, 160, 159, 159, 159, 159, 160, 160, 160, 161, 162, 162, 162, 162, 161, 160, 160, 160, 159, 159, 161, 161, 161, 161, 160, 160, 159, 158, 158, 158, 158, 159, 160, 160, 160, 161, 162, 162, 163, 162, 161, 161, 162, 163, 163, 162, 162, 161, 161, 160, 160, 161, 161, 161, 162, 162, 162, 162, 162, 162, 161, 161, 161, 161, 160, 159, 159, 159, 158, 159, 160, 161, 162, 161, 160, 161, 161, 161, 160, 159, 159, 159, 159, 160, 160, 160, 159, 158, 159, 159, 159, 159, 160, 160, 161, 161, 159, 159, 159, 159, 160, 160, 161, 160, 159, 159, 160, 160, 160, 161, 161, 161, 161, 160, 160, 160, 161, 162, 161, 161, 161, 161, 161, 160, 159, 158, 158, 159, 160, 161, 161, 161, 160, 159, 159, 159, 160, 159, 160, 161, 161, 160, 160, 160, 159, 160, 160, 160, 161, 161, 161, 160, 161, 163, 164, 164, 163, 161, 160, 160, 161, 162, 162, 163, 163, 162, 161, 161, 160, 160, 161, 161, 161, 161, 160, 160, 160, 159, 159, 159, 158, 159, 159, 160, 160, 160, 160, 160, 160, 160, 160, 160, 161, 160, 160, 160, 160, 160, 159, 158, 158, 159, 159, 159, 160, 160, 159, 159, 159, 159, 159, 158, 158, 159, 160, 159, 159, 160, 161, 160, 160, 159, 158, 157, 158, 159, 158, 159, 160, 160, 159, 158, 158, 159, 159, 160, 160, 160, 160, 160, 160, 161, 161, 161, 162, 163, 162, 161, 161, 161, 161, 161, 161, 161, 160, 160, 160, 159, 159, 159, 159, 160, 160, 160, 160, 160, 161, 161, 159, 158, 158, 159, 159, 159, 159, 159, 159, 159, 159, 158, 158, 158, 159, 159, 159, 159, 159, 159, 159, 159, 158, 158, 158, 159, 160, 160, 159, 159, 159, 159, 159, 159, 159, 159, 159, 159, 159, 160, 160, 160, 160, 159, 159, 159, 160, 160, 159, 158, 158, 159, 160, 160, 160, 160, 160, 159, 159, 158, 158, 159, 160, 160, 161, 161, 161, 162, 162, 162, 162, 162, 162, 162, 162, 162, 162, 161, 161, 162, 162, 162, 163, 164, 166, 167, 168, 169, 172, 176, 182, 190, 199, 209, 216, 216, 210, 200, 190]
3708A90opmmllj%%%j%jj%%%%%%%jJ%J%%%%%%%%%J%%jj%%Jjj%%%J%J%%%%%%j%J%%J%JJ%jjj
3701A60%kjJ%%%J%%%%%%%%J%Jj%jjJ%%%%J%%j%%%%%jj%jJJJJJJj%jj%JjjJJJ%j%%j%%Jj%J
3694A60jj%%%%jJ%%%J%jjJ%J%J%%%%j%%%JJ%%%J%%%%j%Jj%j%JJ%k%jj%jJJ%%j%%J%%j%J%%
3686A59j%j%%JJJjjJJ%%J%j%j%%%%%%%j%%Jj%%%%%J%%%J%Jj%jjJ%JJ%%j%J%jJ%j%%%j%%%%
3679A59jjJ%%%%jJJ%Jj%%j%%%%jJ%%jJ%JJ%jj%J%%%%%j%J%%kjJJ%%%JjjJJJJj%j%jJJJJ%j
3672A61%%%%j%%%j%%%%%JJ%Jj%%%j%j%%jj%J%%%%%J%%jJ%%%%%jj%%%J%%%%%JJJ%%jj%%j%%
3664A58j%j%%J%J%%J%%%%%%%J%j%j%j%JJ%%%%j%%%JJ%j%%%%jj%JJJjjJJ%%%Jjjjk%%J%JJJ
3657A60J%kjJ%jj%%%%JJ%j%%jJJ%%%%K%kj%JJ%kjjJJj%J%%j%%%%J%JJJ%%j%jJJ%jjjjJ%%%
$$ y = [190, 184, 177, 173, 169, 166, 163, 162, 162, 162, 162, 161, 161, 160, 159, 159, 159, 159, 159, 159, 159, 159, 158, 159, 159, 160, 160, 160, 160, 160, 160, 160, 160, 160, 160, 161, 161, 161, 160, 159, 159, 159, 160, 159, 158, 158, 158, 158, 159, 159, 160, 160, 160, 160, 160, 160, 160, 159, 159, 160, 160, 160, 161, 161, 162, 163, 163, 162, 161, 160, 160, 158, 157, 158, 158, 158, 158, 159, 159, 159, 159, 159, 159, 159, 159, 159, 160, 160, 161, 160, 160, 159, 158, 159, 159, 159, 159, 159, 160, 160, 160, 159, 159, 159, 159, 159, 159, 158, 157, 157, 156, 157, 158, 159, 160, 161, 162, 161, 161, 160, 159, 159, 160, 159, 158, 159, 160, 161, 161, 160, 160, 160, 159, 159, 159, 160, 159, 159, 160, 159, 158, 158, 158, 158, 158, 157, 158, 158, 158, 158, 159, 159, 158, 157, 158, 158, 159, 159, 160, 160, 160, 160, 160, 159, 159, 159, 159, 160, 161, 161, 161, 161, 162, 162, 162, 162, 162, 161, 161, 162, 161, 161, 160, 160, 161, 162, 162, 160, 160, 159, 158, 158, 157, 158, 159, 159, 159, 158, 158, 158, 159, 159, 159, 158, 158, 159, 159, 159, 158, 158, 157, 157, 157, 158, 159, 160, 159, 158, 159, 160, 160, 160, 161, 161, 160, 160, 159, 159, 159, 159, 159, 159, 159, 159, 158, 158, 158, 159, 158, 158, 158, 158, 158, 158, 159, 159, 159, 159, 160, 160, 161, 160, 160, 159, 158, 159, 159, 160, 161, 161, 161, 160, 160, 161, 161, 160, 161, 161, 160, 160, 160, 160, 159, 159, 159, 159, 159, 158, 157, 158, 158, 158, 158, 158, 157, 158, 159, 159, 160, 159, 159, 159, 158, 158, 158, 158, 158, 157, 158, 158, 158, 157, 158, 158, 159, 160, 160, 159, 158, 158, 159, 159, 159, 159, 159, 159, 158, 158, 159, 159, 159, 157, 156, 157, 158, 158, 158, 158, 159, 158, 157, 158, 159, 160, 161, 160, 160, 159, 159, 158, 159, 160, 161, 162, 162, 161, 161, 161, 161, 161, 160, 160, 160, 160, 159, 159, 159, 159, 159, 159, 160, 161, 161, 162, 161, 161, 161, 161, 160, 160, 159, 159, 159, 158, 157, 157, 158, 158, 158, 158, 158, 158, 159, 159, 159, 158, 159, 159, 159, 159, 159, 159, 158, 157, 157, 157, 157, 158, 158, 158, 158, 158, 158, 159, 160, 161, 161, 161, 160, 159, 159, 159, 158, 158, 158, 157, 157, 156, 156, 156, 157, 157, 158, 158, 158, 159, 159, 159, 159, 159, 159, 159, 159, 160, 160, 159, 159, 158, 158, 157, 157, 158, 159, 159, 159, 159, 159, 158, 158, 158, 158, 159, 160, 160, 159, 159, 159, 159, 159, 158, 157, 157, 158, 159, 160, 159, 158, 159, 160, 160, 160, 160, 161, 160, 159, 158, 156, 156, 156, 157, 157, 158, 159, 160, 161, 161, 159, 158, 159, 159, 158, 157, 157, 157, 157, 157, 158, 159, 159, 158, 158, 158, 157, 158, 159, 159, 159, 159, 159, 161, 161, 159, 158, 158, 159, 160, 160, 158, 157, 156, 157, 158, 157, 157, 158, 158, 158, 157, 157, 157, 157, 157, 158, 158, 159, 160, 161, 161, 161, 160, 160, 159, 160, 161, 161, 160, 159, 158, 157, 158, 158, 158, 158]
3650A58%jkJ%JJJjjJ%%J%J%Jjjjj%%%J%Jj%%%%%%%%%%%J%J%%%%%%%%jJ%j%%jJ%%jJ%%Jjj%
3643A58%%J%%%j%%%%%%%%j%J%%J%%%%jj%%%%JJ%Jjk%JK%%JJjkjJ%Jj%j%%%%%%j%%%%%%%JJ
3635A59%%%Jj%j%j%J%KJjk%J%%%%%j%JJj%JJ%jkJJ%jjjJJJ%j%jj%%%%%j%%%%JJ%%j%%J%%%
3628A58%%%%J%JjkjjJ%J%%%J%%%J%%j%%J%j%%jJJJk%%%Jj%jjJ%%%JJJJ%%%jJ%%%jj%j%j%J
3621A58%%%%jjjJJ%kJ%J%%J%%%J%j%%j%J%%%j%%%%%%%%%%%J%%%jJjjJ%jjJJJ%%%%J%%JJj%
3613A60%%j%%%%j%%J%%%%J%%%%%%JjjjjJ%%%J%%jJ%J%jkJ%%%%%%%%JjjJ%J%%kj%%%%J%%J%
3606A58%%j%%%%%j%%%JJjjj%JJj%%JJ%J%%j%j%%jj%%JJJjj%J%J%%%%%%J%%%%j%%j%JJkj%J
3599A57JJJj%%%j%Jjj%%J%%j%%%%J%jj%%%%JJ%%%%%J%%j%%J%%jJ%J%j%%%%J%%j%j%jkKJ%%
$$ y = [158, 158, 157, 155, 156, 156, 157, 158, 159, 158, 157, 158, 158, 158, 159, 159, 160, 160, 161, 160, 159, 158, 157, 157, 157, 157, 158, 158, 159, 158, 158, 158, 158, 158, 158, 158, 158, 158, 158, 158, 158, 159, 159, 160, 160, 160, 160, 160, 160, 160, 160, 160, 159, 160, 160, 159, 159, 159, 158, 159, 159, 159, 158, 159, 159, 159, 160, 159, 158, 158, 158, 158, 159, 159, 159, 159, 158, 158, 158, 158, 158, 158, 158, 158, 158, 157, 157, 158, 158, 158, 159, 159, 159, 159, 159, 158, 157, 157, 157, 157, 157, 158, 159, 159, 160, 159, 157, 157, 158, 160, 160, 160, 161, 162, 161, 159, 158, 159, 159, 160, 159, 159, 158, 158, 158, 158, 158, 158, 158, 157, 157, 157, 157, 157, 157, 157, 157, 158, 159, 159, 159, 159, 160, 159, 159, 158, 158, 157, 157, 158, 158, 160, 161, 160, 158, 158, 159, 159, 159, 159, 159, 159, 158, 158, 159, 160, 159, 159, 160, 161, 161, 160, 158, 159, 160, 160, 159, 158, 157, 158, 159, 160, 160, 159, 159, 158, 157, 157, 157, 157, 157, 157, 156, 156, 156, 156, 156, 157, 158, 158, 158, 157, 157, 157, 158, 158, 158, 158, 158, 158, 158, 158, 159, 159, 160, 159, 157, 156, 155, 156, 156, 157, 157, 157, 157, 158, 158, 158, 158, 159, 159, 159, 158, 158, 158, 159, 159, 158, 158, 158, 157, 158, 159, 160, 158, 158, 158, 158, 159, 158, 158, 157, 156, 157, 157, 157, 157, 158, 159, 160, 161, 161, 161, 161, 160, 161, 161, 161, 161, 160, 159, 159, 158, 158, 157, 157, 158, 158, 158, 158, 158, 157, 156, 155, 156, 157, 157, 155, 156, 156, 157, 157, 157, 158, 158, 158, 158, 159, 159, 158, 158, 158, 157, 157, 158, 158, 158, 158, 157, 157, 157, 157, 157, 157, 157, 157, 157, 157, 157, 157, 158, 158, 158, 158, 157, 158, 157, 156, 157, 157, 156, 155, 156, 157, 158, 158, 158, 158, 158, 159, 159, 159, 160, 161, 160, 160, 160, 160, 159, 159, 159, 159, 159, 158, 158, 158, 159, 159, 159, 159, 159, 160, 160, 160, 160, 160, 160, 160, 161, 160, 159, 158, 157, 158, 158, 158, 158, 159, 159, 159, 158, 159, 159, 160, 160, 159, 157, 158, 158, 158, 158, 158, 158, 158, 158, 158, 159, 158, 157, 158, 158, 159, 159, 159, 157, 156, 156, 156, 156, 156, 157, 157, 157, 158, 158, 158, 158, 157, 157, 157, 157, 157, 157, 156, 156, 156, 156, 157, 158, 157, 156, 155, 155, 156, 157, 156, 156, 156, 157, 158, 158, 159, 159, 159, 158, 158, 157, 157, 157, 156, 155, 155, 155, 156, 157, 158, 157, 156, 156, 157, 157, 158, 158, 158, 158, 158, 158, 158, 159, 159, 159, 159, 159, 158, 158, 158, 157, 157, 158, 159, 157, 156, 156, 157, 158, 159, 160, 159, 159, 159, 159, 158, 158, 159, 158, 157, 157, 157, 158, 158, 158, 157, 157, 157, 157, 157, 158, 158, 157, 156, 156, 156, 156, 156, 157, 158, 158, 158, 158, 158, 158, 159, 159, 159, 158, 158, 158, 159, 159, 159, 158, 159, 159, 160, 160, 159, 159, 159, 159, 159, 160, 160, 160, 159, 159, 158, 158, 157, 155, 157, 158, 158, 158]
3591A58%%Jjj%%JJ%%%j%%%%%J%jjJJ%j%%%J%j%%j%%%%J%%%%j%%J%Jj%JJ%j%%jjJ%%J%%j%%
3584A58%J%%%j%%%%%%%%jJJ%j%J%jj%%%%J%%%j%J%%%%%j%%JJ%%%%%jj%%%J%%j%%j%%%%JJJ
3577A59JJ%j%%%jjjJ%j%jjJJ%J%JJ%jjj%%%JjjJ%%%J%%%J%%j%%jJ%%Jjj%j%Jjj%%JJJ%%%%
3569A58j%jJJ%Jjj%%JJj%j%j%%%J%%%jj%%KJ%%J%%j%%jj%%%%%Jj%J%%K%jj%%%j%%%%%%%J%
3562A57%%%%JkjJJJ%%J%j%j%j%J%JJj%j%jj%%JJ%%%%J%%%j%%%%%%%j%%J%%%%%%%%%J%%%J%
3555A59%Jjjj%%J%%%%%%%jjJJ%j%%%j%JJ%j%%j%J%%%%j%J%JJ%j%%jj%%J%JJJ%jjj%%%%%%%
3547A57J%%j%jJJ%J%J%%JJjk%J%k%J%%%%j%%J%j%%%j%%%%%%%%%%J%j%Jj%%%%%%J%%jj%%J%
3540A57%%%%%j%%%%%JJkj%%JJJ%%j%%j%j%%%JJ%jJJJJ%jjj%%j%jjJ%JKj%%%JJjjjjJ%J%J%
$$ y = [158, 158, 158, 159, 158, 157, 157, 157, 158, 159, 159, 159, 159, 158, 158, 158, 158, 158, 158, 159, 159, 158, 157, 158, 159, 159, 158, 158, 158, 158, 159, 159, 158, 158, 158, 157, 157, 157, 157, 157, 158, 158, 158, 158, 158, 157, 157, 157, 158, 158, 159, 158, 158, 159, 160, 160, 159, 159, 159, 158, 157, 158, 158, 158, 159, 159, 159, 158, 158, 158, 158, 159, 159, 159, 159, 158, 158, 158, 158, 158, 158, 158, 158, 158, 157, 158, 159, 159, 158, 158, 159, 159, 158, 157, 157, 157, 157, 157, 158, 158, 158, 158, 157, 157, 158, 158, 158, 158, 158, 158, 157, 157, 157, 158, 159, 159, 159, 159, 159, 159, 158, 157, 157, 157, 157, 158, 158, 158, 157, 157, 157, 156, 156, 156, 156, 156, 157, 158, 159, 160, 161, 161, 160, 160, 160, 160, 159, 158, 157, 158, 158, 157, 157, 156, 155, 156, 157, 157, 158, 158, 159, 160, 160, 159, 158, 157, 157, 157, 157, 158, 157, 156, 157, 157, 157, 157, 158, 158, 158, 158, 159, 159, 159, 158, 158, 158, 157, 158, 158, 158, 159, 158, 157, 157, 156, 156, 157, 156, 155, 155, 155, 156, 157, 158, 158, 158, 158, 158, 157, 157, 156, 157, 158, 158, 159, 158, 157, 157, 157, 158, 159, 158, 158, 157, 157, 156, 156, 156, 156, 157, 157, 157, 157, 156, 155, 155, 155, 157, 158, 158, 158, 159, 159, 159, 158, 158, 158, 157, 156, 156, 156, 156, 156, 156, 157, 156, 156, 157, 157, 157, 159, 159, 158, 157, 157, 157, 157, 156, 156, 156, 156, 156, 156, 156, 156, 157, 157, 157, 157, 157, 157, 158, 156, 155, 156, 157, 158, 158, 158, 159, 159, 158, 158, 157, 157, 156, 156, 157, 157, 158, 159, 158, 158, 157, 157, 156, 155, 155, 155, 156, 157, 157, 157, 157, 157, 158, 158, 158, 158, 157, 157, 157, 157, 157, 157, 157, 157, 156, 156, 156, 157, 157, 157, 157, 157, 157, 157, 157, 157, 157, 158, 158, 158, 158, 159, 159, 159, 160, 159, 158, 157, 157, 157, 158, 158, 158, 158, 158, 158, 158, 158, 157, 156, 157, 158, 158, 157, 157, 157, 157, 156, 156, 157, 158, 158, 157, 157, 157, 156, 156, 157, 157, 157, 157, 157, 156, 156, 157, 157, 158, 159, 159, 158, 158, 158, 157, 156, 156, 156, 157, 157, 158, 159, 160, 160, 159, 158, 157, 157, 157, 157, 157, 157, 157, 157, 158, 158, 158, 157, 157, 156, 157, 158, 158, 159, 159, 160, 160, 160, 161, 162, 161, 159, 159, 160, 160, 158, 158, 159, 159, 159, 159, 159, 158, 158, 158, 159, 159, 158, 158, 158, 158, 157, 157, 157, 157, 157, 157, 157, 157, 157, 157, 157, 158, 158, 157, 157, 158, 157, 157, 157, 157, 157, 157, 157, 158, 158, 158, 157, 156, 156, 156, 157, 157, 157, 157, 157, 157, 157, 156, 156, 156, 156, 156, 156, 157, 158, 156, 155, 155, 155, 156, 157, 158, 158, 158, 157, 157, 157, 156, 156, 155, 155, 155, 155, 156, 157, 157, 156, 157, 158, 159, 160, 160, 159, 158, 157, 157, 157, 156, 156, 155, 154, 155, 155, 156, 158, 157, 157, 157, 157, 158, 159, 158, 157, 156, 155, 156, 156, 157, 157, 158, 158]
3533A58%jjjJJ%%%J%%%%%j%j%JJ%kjJ%%%%J%%%%%%%jJJ%JJj%%%%%%k%J%j%%JJJ%%%%j%kj%
3526A56%%%%%J%%J%Jjj%%j%J%JJ%%J%jjj%%JJ%%%%j%%%j%J%%JJjj%%%%%%%j%%j%%%J%j%j%
3518A55jJJ%%JJ%JJj%j%%j%J%%J%jj%jJJ%jk%J%J%%%%j%%%jJJJJ%kj%%%%%%%%%%%%%%%j%%
3511A55%%J%%J%%%%%J%%%j%jjJ%%%%J%J%J%J%jjjJ%jj%%JJjj%j%%%%%JJ%J%%Jj%jj%%%%%%
3504A56%JJJjj%j%%JJJJJj%%j%%jJ%jj%%J%%j%JJ%kkjjJK%%J%%%%%%J%J%%%%%jj%J%%%j%j
3496A56j%%JJ%%j%%JJjjj%%%%%J%J%jj%%JJJJ%%%%%%j%jjJ%%%%%J%%%j%%%%j%%%j%%%J%J%
3489A57J%%%%jj%%J%J%j%%%%JJ%Jjj%jk%J%J%J%%%%%j%%J%jj%Jj%%JK%%%jjJjj%%%%%jJ%%
$$ y = [158, 158, 157, 156, 155, 156, 157, 157, 157, 157, 158, 158, 158, 158, 158, 158, 157, 157, 156, 156, 157, 158, 158, 156, 155, 156, 156, 156, 156, 156, 157, 157, 157, 157, 157, 157, 157, 157, 156, 157, 158, 158, 159, 160, 159, 159, 159, 159, 159, 159, 159, 157, 157, 158, 158, 157, 157, 157, 158, 159, 160, 160, 160, 160, 160, 159, 159, 157, 156, 156, 156, 156, 156, 156, 156, 157, 157, 157, 158, 158, 159, 158, 157, 157, 157, 156, 156, 157, 157, 158, 159, 159, 159, 160, 160, 159, 158, 157, 157, 157, 158, 159, 159, 159, 159, 159, 158, 158, 158, 158, 157, 157, 158, 158, 158, 159, 160, 159, 158, 158, 158, 158, 158, 158, 158, 158, 157, 157, 157, 156, 156, 156, 156, 157, 157, 156, 156, 155, 155, 154, 155, 156, 156, 156, 157, 158, 158, 159, 160, 159, 159, 158, 158, 158, 157, 157, 158, 158, 158, 159, 159, 158, 157, 157, 156, 157, 158, 158, 157, 155, 155, 156, 156, 157, 157, 157, 157, 157, 156, 156, 156, 156, 155, 156, 157, 158, 159, 159, 157, 156, 156, 156, 156, 156, 156, 156, 156, 156, 156, 156, 156, 156, 156, 156, 156, 155, 155, 155, 155, 155, 156, 156, 156, 157, 157, 157, 157, 157, 157, 158, 158, 158, 158, 157, 157, 156, 155, 156, 156, 156, 156, 156, 157, 157, 158, 158, 159, 159, 160, 160, 159, 158, 157, 158, 158, 157, 156, 156, 156, 157, 158, 157, 156, 156, 155, 155, 155, 155, 155, 155, 156, 157, 157, 158, 158, 158, 159, 158, 158, 157, 156, 156, 156, 156, 156, 156, 156, 156, 157, 158, 159, 158, 157, 157, 156, 156, 156, 157, 158, 159, 160, 161, 160, 160, 160, 159, 159, 159, 158, 159, 159, 158, 157, 157, 157, 158, 158, 158, 157, 157, 158, 159, 159, 157, 155, 154, 153, 154, 156, 156, 156, 157, 157, 157, 157, 157, 157, 157, 158, 158, 159, 159, 159, 159, 159, 159, 158, 157, 157, 158, 158, 158, 158, 157, 157, 156, 155, 155, 155, 156, 157, 157, 157, 156, 156, 156, 157, 158, 157, 156, 155, 155, 155, 155, 155, 155, 156, 156, 157, 157, 156, 155, 155, 155, 156, 157, 158, 159, 159, 159, 159, 159, 159, 159, 158, 158, 157, 156, 157, 157, 157, 157, 157, 157, 158, 158, 158, 158, 157, 157, 157, 157, 157, 156, 156, 156, 156, 155, 155, 155, 155, 156, 156, 157, 157, 158, 158, 158, 158, 158, 157, 156, 156, 156, 157, 157, 158, 158, 157, 157, 157, 157, 157, 158, 159, 159, 160, 159, 158, 158, 157, 155, 155, 156, 156, 157, 157, 158, 158, 158, 158, 158, 158, 157, 157, 157, 158, 158, 157, 156, 156, 157, 156, 156, 156, 157, 159, 159, 159, 159, 158, 157, 158, 157, 156, 156, 156, 156, 156, 156, 155, 156, 156, 156]
$$ [...]
-2638A30
##END=		$$ NMR SPECTRUM
##END=		$$ LINK
