##TITLE=	RP313 cleaner.10.fid
##JCAMP-DX=	6.0	$$ MestReNova 14.3.3-33362
##DATA TYPE=	LINK
##BLOCKS=	1    
##ORIGIN=	Mestrelab Research S.L.
##OWNER=	hrzepa
##$MNOVA/METADATA=	(DOCUMENT,BASE64)
eyJuYW1lIjoiL1VzZXJzL2hyemVwYS9MaWJyYXJ5L01vYmlsZSBEb2N1bWVudHMvY29tfmFwcGxlfkN
sb3VkRG9jcy9TaGVwcGFyZC9OTVIgZmlsZXMgemlwcy0yLzMzLzMzLUgubW5vdmEiLCJwYWdlcyI6W3
siaXRlbXMiOlsiMSIgICAgIF19XX0=
##TITLE=	RP313 cleaner.10.fid
##JCAMP-DX=	6.0	$$ MestReNova 14.3.3-33362
##DATA TYPE=	NMR SPECTRUM
##DATA CLASS=	XYDATA
##BLOCK_ID=	1
##ORIGIN=	Bruker BioSpin GmbH
##OWNER=	nmrsu
##NUMDIM=	1
##$MNOVA/METADATA=	(ITEM,BASE64)
eyJhbmdsZSI6MCwiYXhlcyI6eyJ4Ijp7Im1heCI6MTYuMDY0MjU5OTk5OTM5MTI1LCJtaW4iOi0zLjc
2Njk0MjMzOTE1NjYyMjZ9LCJ5Ijp7Im1heCI6NTkxNTQuMzA5MDgyMDMxMjUsIm1pbiI6LTU0OTguMD
U5OTI4ODk0MDQzfX0sInBvaW50cyI6W3sieCI6NTMyMSwieSI6NTgzNX0seyJ4Ijo4NzIyLCJ5Ijo1O
DM1fSx7IngiOjg3MjIsInkiOjgyMDh9LHsieCI6NTMyMSwieSI6ODIwOH0seyJ4Ijo1MzIxLCJ5Ijo1
ODM1fV0sInoiOjB9
##.OBSERVE FREQUENCY=	700.35432466099996418
##.OBSERVE NUCLEUS=	^1H
##.SOLVENT NAME=	CDCl3
##.PULSE SEQUENCE=	zg30
##LONGDATE=	2024/07/24 18:26:01.000
##.ACQUISITIONMODE=	SIMULTANEOUS (DQD)
##$ORIGINAL FORMAT=	Bruker XWIN-NMR
##$MNOVA/SCALES_VERSION=	9
##$PARAMETER FILE=	(acqus, ASCII, /private/var/folders/f6/rjf_tdyn2v98c5c0wvkgn4s80000gq/T/PnHbLYesTW6$M$zSj7dX2Q/10/acqus, 0)
$$ ##TITLE= Parameter file, TopSpin 4.1.3
$$ ##JCAMPDX= 5.0
$$ ##DATATYPE= Parameter Values
$$ ##NPOINTS= 1	$$ modification sequence number
$$ ##ORIGIN= Bruker BioSpin GmbH
$$ ##OWNER= nmrsu
$$ $$ 2024-07-24 18:24:56.659 +0100  nmrsu@CZC7167VR1
$$ $$ Z:/700/data/tds/nmr/RP313 cleaner/10/acqus
$$ $$ process C:\Bruker\TopSpin4.1.3\prog\mod\dirdata.exe
$$ ##$ACQT0= -2.0981556054023
$$ ##$AMP= (0..31)
$$ 100 100 100 100 100 100 100 100 100 100 100 100 100 100 100 100 100 100
$$ 100 100 100 100 100 100 100 100 100 100 100 100 100 100
$$ ##$AMPCOIL= (0..32)
$$ -1 0 0 0 0 0 0 0 0 0 0 0 0 0 0 0 0 0 0 0 0 0 0 0 0 0 0 0 0 0 0 0 0
$$ ##$AQSEQ= 0
$$ ##$AQ_mod= 3
$$ ##$AUNM= <au_zg>
$$ ##$AUTOPOS= <45 >
$$ ##$BF1= 700.349999998
$$ ##$BF2= 700.349999998
$$ ##$BF3= 700.349999998
$$ ##$BF4= 700.349999998
$$ ##$BF5= 700.349999998
$$ ##$BF6= 700.349999998
$$ ##$BF7= 700.349999998
$$ ##$BF8= 700.349999998
$$ ##$BWFAC= (0..63)
$$ 0 0 0 0 0 0 0 0 0 0 0 0 0 0 0 0 0 0 0 0 0 0 0 0 0 0 0 0 0 0 0 0 0 0 0 0
$$ 0 0 0 0 0 0 0 0 0 0 0 0 0 0 0 0 0 0 0 0 0 0 0 0 0 0 0 0
$$ ##$BYTORDA= 0
$$ ##$CHANFCU= (0..24)
$$ 0 1 0 0 0 0 0 0 0 0 0 0 0 0 0 0 0 0 0 0 0 0 0 0 0
$$ ##$CHANREC= (0..24)
$$ 0 0 0 0 0 0 0 0 0 0 0 0 0 0 0 0 0 0 0 0 0 0 0 0 0
$$ ##$CHEMSTR= <none>
$$ ##$CNST= (0..63)
$$ 1 1 1 1 1 1 1 1 1 1 1 1 1 1 1 1 1 1 1 1 1 1 1 1 1 1 1 1 1 1 1 1 1 1 1 1
$$ 1 1 1 1 1 1 1 1 1 1 1 1 1 1 1 1 1 1 1 1 1 1 1 1 1 1 1 1
$$ ##$CPDPRG= (0..8)
$$ <> <> <> <> <> <> <> <> <>
$$ ##$D= (0..63)
$$ 0 1 0 0 0 0 0 0 0 0 0 0 0 0 0 0 0.0002 0 0 0 0 0 0 0 0 0 0 0 0 0 0 0 0
$$ 0 0 0 0 0 0 0 0 0 0 0 0 0 0 0 0 0 0 0 0 0 0 0 0 0 0 0 0 0 0 0
$$ ##$DATE= 1721841961
$$ ##$DATE_START= 1721841918
$$ [...]
$$ ##$ShimPowRng3= (0..63)
$$ 1 1 1 1 1 1 1 1 1 1 1 1 1 1 1 1 1 1 1 1 1 1 1 1 1 1 1 1 1 1 1 1 1 1 1 1
$$ 1 1 1 1 0 0 0 0 0 0 0 0 0 0 0 0 0 0 0 0 0 0 0 0 0 0 0 0
$$ ##$ShimPowType1= 8
$$ ##$ShimPowType2= 8
$$ ##$ShimPowType3= 0
$$ ##$ShimPowType4= 0
$$ ##$ShimPowType5= 0
$$ ##$ShimPowType6= 0
$$ ##$ShimPowType7= 0
$$ ##$ShimPowType8= 0
$$ ##$ShimSysActGrad= (0..63)
$$ 1 2 3 4 13 5 7 11 10 9 6 8 12 18 19 20 21 15 22 23 24 14 25 16 26 17 27
$$ 28 31 32 33 34 35 36 37 38 0 0 0 0 0 0 0 0 0 0 0 0 0 0 0 0 0 0 0 0 0 0
$$ 0 0 0 0 0 0
$$ ##$ShimSysAngle= <>
$$ ##$ShimSysFunc= (0..63)
$$ 1 2 3 4 5 6 7 8 9 10 0 37 38 35 16 15 14 13 12 11 28 27 26 25 24 23 36
$$ 22 30 29 20 21 34 33 32 31 17 18 19 0 0 0 0 0 0 0 0 0 0 0 0 0 0 0 0 0 0
$$ 0 0 0 0 0 0 0
$$ ##$ShimSysMatId= <292722da.dat>
$$ ##$ShimSysMatrix= 1
$$ ##$ShimSysMinMaxUG= 130000
$$ ##$ShimSysOffset= <29 mm>
$$ ##$ShimSysType= 4
$$ ##$ShimUnit= 3
$$ ##$SpectrOsVersion= <4.1.156.20210628>
$$ ##$TCubeEth= <192.168.180.38>
$$ ##$TCubeSeqDevice= <>
$$ ##$TOSITY= <no>
$$ ##$TRIPLO2= 0
$$ ##$TopSpinVersion= <TopSpin 4.1.3>
$$ ##$TrxFreqFormula= (0..23)
$$ <TrxFreqFormula(2.0,700350000.000000,'TRX',Trx(1.0,'TRX 1200.1',1,5.000000,1290.000000))>
$$ <TrxFreqFormula(2.0,700350000.000000,'TRX',Trx(1.0,'TRX 1200.2',1,5.000000,1290.000000))>
$$ <TrxFreqFormula(2.0,700350000.000000,'TRX',Trx(1.0,'TRX 1200.3',1,5.000000,1290.000000))>
$$ <> <> <> <> <> <> <> <> <> <> <> <> <> <> <> <> <> <> <> <> <>
$$ ##$TrxPN= (0..23)
$$ <Z148391> <Z148391> <Z148391> <> <> <> <> <> <> <> <> <> <> <> <> <> <>
$$ <> <> <> <> <> <> <>
$$ ##$TrxSN= (0..23)
$$ <00336> <00337> <00342> <> <> <> <> <> <> <> <> <> <> <> <> <> <> <> <>
$$ <> <> <> <> <>
$$ ##$VCubeEth= (0..23)
$$ <no> <no> <no> <no> <no> <no> <no> <no> <no> <no> <no> <no> <no> <no> <no>
$$ <no> <no> <no> <no> <no> <no> <no> <no> <no>
$$ ##$VTU= 2
$$ ##$VTUETH= <192.168.99.11>
$$ ##$VTUTY= <no>
$$ ##$ValueLine= no
$$ ##$VpuPN= (0..23)
$$ <no> <no> <no> <no> <no> <no> <no> <no> <no> <no> <no> <no> <no> <no> <no>
$$ <no> <no> <no> <no> <no> <no> <no> <no> <no>
$$ ##$VpuSN= (0..23)
$$ <no> <no> <no> <no> <no> <no> <no> <no> <no> <no> <no> <no> <no> <no> <no>
$$ <no> <no> <no> <no> <no> <no> <no> <no> <no>
$$ ##$WBREFAM= (0..31)
$$ 99.8 100 100 100 100 100 100 100 100 100 100 100 100 100 100 100 100 100
$$ 100 100 100 100 100 100 100 100 100 100 100 100 100 100
$$ ##$WBREFLM= (0..31)
$$ 1 0 1 0 0 0 0 0 0 0 0 0 0 0 0 0 0 0 0 0 0 0 0 0 0 0 0 0 0 0 0 0
$$ ##$WBREFPH= (0..31)
$$ 0.05 0 0 0 0 0 0 0 0 0 0 0 0 0 0 0 0 0 0 0 0 0 0 0 0 0 0 0 0 0 0 0
$$ ##$WBSGU= (0..31)
$$ 1 2 4 0 0 0 0 0 0 0 0 0 0 0 0 0 0 0 0 0 0 0 0 0 0 0 0 0 0 0 0 0
$$ ##END=
$$ 
##$DECIM=	1440
##$DSPFVS=	21
##XUNITS=	HZ
##YUNITS=	ARBITRARY UNITS
##FIRSTX=	11250.604788156719223
##LASTX=	-2638.1781369192458442
##DELTAX=	-0.10596381293402784562
##XFACTOR=	1
##YFACTOR=	1.6411823204367199658
##FIRSTY=	79.07924652099609375
##MINY=	-120.5606231689453125
##MAXY=	53776.62109375
##NPOINTS=	131072
##XYDATA=	(X++(Y..Y))
$$ [...]
7590 59 59 59 59 59 59 59 59 59 58 58 58 58 57 57 57 58 58 58 58 58 58 58 58 58 58 58 58 58 58 58 58 58 58 58 58 58 58 58 58 58 58 58 59 58 58 58 58 58 58 58 58 58 58 57 57 57 58 58 58 58 58 58 58 58 58 58 57 58 58 58
7582 58 59 58 58 58 58 58 58 58 58 58 58 58 58 58 58 58 58 59 59 59 58 58 59 59 59 60 59 59 59 59 59 59 59 59 59 59 58 58 58 58 58 58 58 58 58 58 58 58 58 58 58 58 58 58 58 58 58 58 58 59 60 60 59 59 59 59 59 59 59 58
7575 58 58 58 58 58 58 58 58 58 58 59 59 59 59 59 59 59 59 59 59 58 58 57 57 58 58 58 58 58 58 58 58 58 58 58 58 58 58 58 58 58 58 59 59 59 59 58 58 58 58 58 58 57 58 58 58 58 58 58 58 58 58 58 58 58 58 58 58 58 58 58
7568 58 59 59 58 58 58 57 57 58 58 58 58 58 58 58 58 58 58 58 58 57 57 58 58 57 57 58 58 58 58 59 59 58 58 58 58 58 58 59 59 59 59 59 58 59 59 59 59 59 59 58 58 58 58 58 58 58 59 59 59 59 59 58 58 58 58 58 58 58 59 59
7560 59 58 58 58 58 58 58 59 59 58 58 58 58 58 58 59 59 59 59 59 59 58 58 58 58 58 58 58 58 58 59 59 59 60 60 60 60 60 59 59 59 59 59 58 58 58 58 59 59 59 59 60 59 59 58 59 59 59 60 59 58 58 58 58 58 58 58 58 59 58 58
7553 58 58 58 58 58 58 58 58 58 58 58 59 58 58 58 59 59 59 58 58 58 58 57 57 57 57 57 57 57 57 57 58 58 58 58 58 58 58 58 58 59 59 59 59 58 58 58 58 58 58 58 58 58 58 58 58 58 58 58 58 58 58 58 58 58 58 59 58 58 58 58
7545 58 58 58 58 58 59 58 58 58 58 58 58 59 59 58 58 58 59 59 58 57 58 58 58 58 58 59 58 58 58 58 58 58 58 59 59 59 59 58 58 58 58 58 58 58 58 58 58 58 58 58 58 58 58 58 59 59 59 59 59 59 59 58 58 58 58 58 58 58 58 58
7538 58 58 58 58 58 58 57 57 57 57 57 58 58 58 58 58 58 58 59 58 58 58 58 58 58 58 58 58 58 59 59 59 59 58 58 58 58 58 58 58 58 58 58 58 58 58 58 57 57 57 57 58 58 57 58 58 58 57 57 58 58 59 59 59 59 59 59 58 58 59 59
7530 59 58 58 58 58 59 58 58 59 59 58 58 58 58 58 59 59 58 58 58 57 57 58 58 58 58 58 58 58 58 59 59 59 59 59 59 59 58 58 58 58 58 58 58 59 59 59 59 59 59 59 59 59 58 58 58 58 59 59 59 59 59 59 59 59 59 58 59 59 59 59
7523 59 59 59 59 59 58 58 59 59 58 58 58 58 58 58 58 58 58 58 58 58 58 59 59 59 59 59 59 59 60 60 60 59 59 59 58 58 57 57 57 57 57 57 58 58 58 58 58 58 58 58 57 57 57 58 58 58 58 58 58 58 58 58 58 59 58 58 58 58 57 57
7516 57 58 58 59 59 58 58 58 58 58 58 58 57 57 57 57 57 57 57 57 57 58 58 58 58 58 58 58 58 58 58 58 58 58 58 58 58 58 58 58 58 58 58 57 58 58 58 58 58 58 57 57 57 57 58 58 58 58 58 58 59 59 59 59 58 58 58 58 58 58 58
7508 58 59 59 59 59 59 59 59 59 59 58 58 58 58 58 58 58 58 58 58 58 59 59 59 59 59 59 59 59 59 59 59 59 59 59 59 59 59 59 59 59 58 58 58 58 58 58 58 58 58 58 58 58 57 58 58 58 58 59 59 59 58 58 58 58 59 59 58 58 58 58
7501 58 58 58 59 58 58 58 58 58 58 58 58 59 59 59 59 59 59 58 58 58 57 57 57 58 58 58 58 58 58 58 58 59 58 58 58 58 58 58 58 58 58 58 59 59 59 58 57 57 58 58 58 59 59 58 58 58 59 59 59 59 59 59 59 59 59 59 58 58 58 58
7493 58 58 58 57 58 58 58 58 58 58 58 58 58 58 58 57 57 57 57 57 58 58 59 59 58 58 58 58 58 58 58 58 58 58 58 58 58 58 58 58 58 57 57 58 58 58 58 58 57 58 58 58 58 58 59 59 59 59 59 59 59 59 58 58 58 58 57 58 58 58 58
7486 58 58 59 59 59 58 58 58 58 58 58 59 58 58 58 58 58 58 58 59 59 59 59 59 59 60 60 59 59 58 58 59 58 57 57 58 58 59 59 59 59 58 58 58 58 58 58 58 58 58 58 57 57 58 58 58 58 58 57 57 57 57 58 59 59 58 58 57 57 57 57
7479 57 57 58 58 58 58 58 58 58 58 58 58 59 59 58 58 58 58 59 59 59 59 59 59 59 58 58 58 58 58 58 58 58 58 58 58 59 59 59 59 59 59 59 58 58 58 58 58 58 58 58 57 57 58 58 59 59 59 59 59 59 59 58 58 58 58 58 58 58 58 57
7471 57 58 58 58 59 59 59 59 59 59 59 59 59 60 59 59 58 58 58 58 58 58 58 58 58 58 58 58 58 58 58 58 57 57 57 58 58 58 57 57 57 57 58 58 58 58 58 58 59 58 58 58 58 58 58 58 58 58 58 58 57 57 58 58 58 58 58 58 57 57 58
7464 58 58 58 57 57 58 59 59 58 58 58 58 58 58 58 58 58 58 58 58 58 58 58 58 58 58 58 58 58 58 58 58 58 58 58 59 59 58 58 58 58 58 58 58 59 59 59 59 59 59 59 59 59 59 59 59 58 57 57 58 58 58 58 58 58 58 58 58 58 57 58
7456 58 58 58 58 58 58 58 58 58 58 59 59 60 59 59 58 58 58 58 58 58 58 58 58 58 58 58 58 57 57 57 57 57 58 58 58 58 57 57 57 57 58 58 58 58 58 59 59 60 59 59 59 59 59 59 59 59 59 59 59 60 59 58 58 58 59 59 59 59 59 59
7449 59 59 59 58 58 58 57 57 57 57 57 57 58 58 58 58 58 58 58 58 58 58 58 58 58 58 58 58 58 58 58 58 58 58 59 58 58 58 58 58 58 58 58 58 58 58 57 57 58 58 58 58 58 58 58 58 58 58 59 59 59 59 59 58 58 58 58 58 58 59 59
7441 59 58 58 58 58 58 57 57 57 58 59 58 58 59 59 59 59 59 60 59 58 58 58 58 58 58 58 58 58 57 58 58 58 59 59 58 58 58 58 58 58 58 58 58 58 59 59 58 58 58 58 58 57 58 58 58 58 59 59 59 59 58 58 58 57 57 57 58 57 57 57
7434 57 57 57 58 58 58 58 58 58 58 58 58 58 58 57 57 58 58 58 58 58 58 58 58 58 58 58 58 58 58 58 58 58 58 58 58 58 58 57 58 58 58 58 58 59 58 57 57 57 57 57 57 57 57 57 57 57 57 57 57 57 58 58 58 58 58 58 58 58 58 58
7427 58 57 57 57 58 58 58 58 58 58 58 58 58 58 58 57 57 57 57 57 57 57 57 57 58 58 58 58 58 58 58 58 57 57 57 57 57 58 58 58 58 58 59 59 60 59 59 59 58 58 58 58 57 57 57 57 58 59 59 58 58 58 59 58 58 58 58 58 58 58 57
7419 57 57 57 57 57 57 57 57 57 57 57 58 58 58 58 58 58 58 58 59 59 58 58 58 58 58 58 58 58 58 59 59 59 59 59 59 58 58 59 58 58 58 58 58 58 58 59 59 59 58 58 58 59 59 59 59 59 58 58 57 57 57 57 57 57 57 57 57 57 57 57
7412 57 58 58 58 58 58 58 58 59 59 59 59 58 58 57 57 57 57 57 57 57 57 58 58 58 58 58 58 58 58 58 58 58 58 58 58 57 57 57 57 57 57 57 57 57 57 57 57 58 58 59 58 58 57 57 58 58 58 58 59 58 57 57 57 58 58 58 58 58 58 58
7404 58 58 58 58 58 58 58 58 57 57 58 58 58 58 58 58 58 57 57 56 56 57 57 57 57 58 58 58 58 58 58 59 59 59 58 59 59 58 58 58 58 58 57 57 57 57 58 58 58 58 59 59 59 59 59 59 58 58 58 58 58 57 57 57 58 58 58 58 58 58 57
7397 57 58 58 58 58 58 58 57 57 57 57 57 57 58 59 58 58 58 58 58 58 58 58 58 58 58 58 58 58 58 57 58 58 58 59 58 58 58 58 58 58 58 58 58 59 59 58 58 58 58 59 59 59 59 59 59 59 59 59 58 58 58 58 58 59 59 59 59 58 58 59
7389 59 59 58 58 58 58 58 58 58 58 59 58 58 58 58 58 58 58 59 58 58 58 58 58 58 58 57 57 57 57 57 58 59 58 58 58 58 58 59 59 59 59 59 59 58 58 58 58 58 58 58 58 58 58 59 59 60 59 59 58 58 58 58 58 58 58 58 58 58 58 58
7382 58 58 58 58 59 59 59 58 58 57 57 57 57 58 58 58 58 58 58 58 58 58 58 58 58 58 58 58 58 58 58 58 58 58 58 58 58 58 58 57 58 58 59 59 59 58 57 56 57 58 58 58 59 59 58 58 58 58 58 58 58 58 58 58 58 57 58 58 58 58 58
7375 58 58 59 59 59 59 59 59 59 59 58 58 58 58 58 58 58 58 58 58 59 59 58 58 58 58 58 59 59 59 58 58 58 58 57 57 57 57 57 57 57 57 57 57 58 58 58 58 58 58 58 58 58 58 59 59 59 59 59 59 59 58 58 58 58 58 58 58 57 57 57
7367 57 58 59 59 58 58 58 59 59 59 59 59 59 58 59 59 59 59 59 59 59 59 59 59 59 58 58 58 58 58 58 59 59 59 58 58 58 59 59 59 59 59 59 59 59 58 58 58 59 59 59 59 58 58 58 59 59 59 59 59 59 59 59 59 58 58 58 58 58 58 58
7360 58 59 59 59 59 58 58 59 59 59 59 59 58 58 58 58 58 58 57 56 57 57 57 57 58 58 58 58 58 58 59 59 58 58 58 58 58 58 58 58 58 58 58 58 58 57 57 57 57 58 58 58 58 58 58 58 59 59 59 59 58 58 58 58 58 58 58 58 58 58 58
7352 58 58 59 58 58 57 57 57 58 58 58 58 58 58 59 59 58 58 58 59 59 59 59 59 59 59 59 59 59 59 58 58 58 59 59 58 58 58 58 57 57 57 57 57 58 58 57 57 58 58 58 58 58 59 59 59 58 58 58 57 57 57 58 58 58 57 57 57 57 57 57
7345 57 58 57 57 57 57 58 58 58 58 58 58 58 58 58 58 58 58 58 58 57 57 58 58 58 58 58 58 57 57 57 57 57 57 57 57 57 58 58 57 58 58 58 58 58 58 58 58 58 58 58 58 58 58 58 58 58 57 57 57 57 57 57 57 58 59 59 59 58 58 58
7338 58 58 58 58 58 58 58 58 58 59 59 59 58 58 58 58 58 58 58 58 58 58 57 57 57 58 58 58 57 57 57 58 59 58 58 59 58 58 58 58 58 58 58 57 57 58 57 57 57 57 57 57 57 58 58 58 58 58 57 57 57 57 57 58 58 58 58 58 58 58 58
7330 58 58 59 59 59 58 58 58 58 58 58 59 59 59 59 59 59 58 58 58 58 58 58 58 58 58 58 58 58 58 58 58 58 58 58 58 57 57 57 57 58 58 59 59 58 58 58 58 58 58 58 58 58 59 59 59 59 59 59 58 58 58 57 57 57 58 58 58 58 58 58
7323 58 58 58 58 59 58 57 58 58 57 57 57 58 58 59 58 57 57 57 57 57 57 56 57 57 57 57 57 58 57 57 57 57 57 58 58 58 58 58 58 58 58 58 58 58 58 58 58 58 58 58 58 58 58 59 59 59 58 58 58 58 57 57 58 58 58 59 58 58 57 57
7315 57 57 57 58 58 58 57 57 57 57 58 59 59 59 58 58 58 58 58 58 58 58 58 58 58 58 57 57 57 57 57 57 58 58 58 59 59 59 58 57 57 57 57 58 58 58 58 57 57 57 57 57 57 57 57 57 57 57 57 57 58 58 58 58 58 58 59 59 58 58 58
7308 58 58 58 58 58 58 58 58 58 58 58 58 58 58 58 59 58 58 58 57 57 57 57 58 58 58 58 58 58 58 58 58 58 58 58 58 58 58 58 58 58 59 59 60 59 59 59 58 58 58 58 58 58 58 58 58 59 59 58 58 58 58 58 57 57 58 58 58 58 57 57
7300 57 57 58 58 58 57 57 57 58 58 58 58 58 58 58 58 58 58 58 57 58 58 58 58 58 58 58 58 58 58 58 58 58 58 58 58 58 57 57 58 58 58 58 58 59 58 58 58 58 58 57 57 58 58 58 58 58 58 58 58 58 58 58 59 58 58 58 58 58 58 58
7293 58 58 58 58 58 58 58 58 58 57 58 58 58 58 58 57 57 57 57 57 57 57 57 57 57 57 57 57 57 58 58 57 57 57 57 58 58 58 58 58 58 58 58 58 58 57 57 58 57 57 58 58 58 58 58 57 57 58 57 57 58 58 58 58 59 58 58 58 58 57 57
7286 57 57 57 58 58 57 57 57 57 57 57 57 57 57 58 58 57 57 57 57 58 58 58 58 57 57 56 56 56 57 57 57 58 58 58 58 58 58 57 57 57 57 57 57 56 56 56 57 57 58 58 58 58 58 58 57 57 57 57 57 57 57 57 57 58 58 58 57 57 57 57
7278 57 57 58 57 57 57 57 58 58 57 57 57 57 57 58 58 58 58 58 58 58 58 58 58 58 57 57 57 56 57 57 57 57 57 57 57 58 58 58 58 58 58 58 58 58 58 58 57 57 57 57 57 57 57 57 58 57 57 57 57 58 58 58 58 58 58 58 58 58 58 58
7271 58 58 58 58 57 57 57 57 57 57 58 58 58 58 58 58 57 57 57 57 57 57 57 57 57 57 57 57 57 57 57 57 57 57 57 57 57 57 57 57 56 56 56 56 56 57 57 57 57 57 57 57 56 57 57 57 57 57 57 57 57 56 56 56 57 57 57 57 57 58 58
7263 58 58 58 57 57 57 57 58 58 58 58 58 58 58 58 58 58 58 58 58 57 57 57 57 57 57 57 57 57 57 58 58 58 58 58 58 57 58 58 58 58 58 58 58 58 58 58 58 59 58 58 58 58 58 58 59 58 58 57 57 57 57 57 57 57 57 57 57 57 58 57
7256 57 57 57 58 58 58 58 58 57 57 57 57 57 57 57 58 58 58 58 58 58 58 58 57 57 58 58 58 58 57 57 57 57 57 57 57 57 57 56 57 57 57 57 57 57 57 58 58 58 58 58 58 58 58 58 58 58 59 58 58 58 58 57 57 58 58 58 58 58 58 57
7249 57 57 57 57 57 57 57 57 57 57 58 58 58 58 58 58 58 58 58 58 58 58 59 59 58 58 58 58 58 59 59 59 58 58 58 58 58 58 58 58 58 58 58 58 58 58 58 58 58 57 57 58 58 58 58 58 57 57 57 58 57 57 58 57 58 58 58 58 58 58 58
7241 58 57 58 58 57 57 57 58 58 58 57 57 57 57 57 58 58 58 58 58 58 58 58 58 57 57 57 57 57 57 57 57 57 57 58 58 57 57 57 58 57 57 58 58 58 58 58 57 57 57 57 57 57 58 58 58 57 57 57 57 57 57 57 57 57 58 58 58 58 57 57
7234 57 57 57 57 57 57 57 57 57 57 57 57 57 57 58 58 59 58 58 58 58 57 56 56 57 57 57 58 58 58 58 58 58 58 57 58 57 57 58 58 58 58 58 58 58 58 58 58 58 58 58 58 58 59 59 59 58 57 57 57 57 57 57 58 58 58 58 58 58 58 58
7226 58 58 58 58 58 58 58 59 59 58 57 57 57 57 58 58 58 57 57 57 57 57 57 57 57 57 57 58 58 58 58 58 58 57 57 57 57 58 58 58 58 58 58 58 58 59 59 59 59 58 58 58 57 57 57 57 57 57 57 57 58 58 58 57 57 57 58 58 57 56 56
7219 56 57 57 57 57 57 57 57 57 58 58 58 58 58 58 58 58 58 57 57 57 58 58 58 58 57 57 57 58 57 57 57 58 58 58 58 57 57 57 57 57 57 57 57 56 57 57 57 57 57 58 58 57 57 58 58 58 58 58 58 58 58 58 58 58 57 57 57 57 57 57
7211 57 57 58 58 58 58 59 58 58 58 58 58 58 58 58 58 58 58 58 58 58 58 58 58 58 58 58 58 57 57 57 57 57 57 57 57 57 57 57 58 58 58 58 58 58 58 58 57 57 56 57 58 58 58 58 58 57 58 59 59 58 58 57 57 58 58 58 58 58 58 58
7204 58 58 58 58 58 58 58 58 59 59 59 59 59 58 58 57 57 57 57 57 57 57 57 57 57 57 57 57 57 57 57 57 57 57 57 57 57 57 58 58 58 57 57 57 57 57 58 59 59 59 59 59 59 58 58 58 58 58 58 58 57 58 58 58 58 58 57 58 58 58 58
7197 58 58 58 58 58 57 57 58 57 57 58 58 57 57 57 57 57 58 58 58 57 57 57 57 57 57 57 57 57 56 56 56 57 57 57 57 58 58 58 58 58 57 57 57 57 57 57 57 56 57 57 57 57 57 57 57 57 56 56 57 58 57 57 57 57 57 58 58 58 57 58
7189 58 58 58 58 58 58 58 58 58 58 58 58 58 58 57 57 57 57 57 57 57 57 57 57 57 57 57 57 58 58 58 58 58 57 57 57 58 58 57 58 58 58 58 57 57 57 57 58 57 57 57 57 58 58 58 58 58 58 57 57 57 57 57 57 57 57 58 58 58 58 58
7182 58 57 57 57 57 57 58 58 58 58 58 58 58 58 58 58 58 58 58 58 58 58 58 58 58 58 58 58 58 58 58 58 58 57 58 58 58 58 59 59 58 58 58 58 58 58 58 58 58 58 58 58 58 58 58 58 58 57 57 57 57 57 57 57 57 57 57 57 57 57 57
7174 57 58 58 58 59 58 58 58 58 57 57 57 57 57 58 58 58 58 58 59 59 59 59 59 59 59 58 59 59 59 58 58 58 59 58 59 59 59 59 58 58 58 58 58 57 57 57 57 58 58 58 57 57 57 57 58 58 58 58 58 58 58 57 57 57 57 57 57 57 58 58
7167 58 58 59 59 58 58 58 58 57 58 58 58 58 58 58 58 59 59 59 59 59 59 59 59 58 58 58 58 58 58 58 58 58 58 58 58 59 59 59 59 58 58 57 57 57 57 57 57 57 57 57 57 57 58 58 59 59 59 59 59 58 58 58 57 57 57 56 56 56 57 57
7160 57 57 57 57 57 58 58 58 58 58 58 58 58 58 58 58 58 58 58 58 58 58 58 58 58 58 58 59 59 59 58 58 57 58 58 58 58 58 58 58 57 57 57 57 57 57 57 57 57 57 57 57 57 57 57 57 57 57 57 57 57 57 58 58 58 57 57 58 58 58 58
7152 58 58 58 58 58 58 58 58 58 57 57 57 57 57 57 57 57 58 58 58 58 58 58 58 58 58 57 57 58 58 58 58 58 57 57 57 57 58 58 58 58 58 58 58 58 58 58 58 58 58 58 57 57 57 57 57 57 57 57 57 57 57 57 57 57 58 58 58 58 58 58
7145 58 58 58 58 57 57 57 57 57 57 57 57 58 58 58 59 59 59 59 59 59 59 59 58 58 58 58 58 57 58 58 58 58 58 58 58 58 58 58 58 58 58 58 57 57 57 57 57 57 57 58 58 58 58 58 58 58 58 58 57 57 57 57 58 58 58 57 57 57 57 58
7137 58 57 57 57 57 57 57 57 57 57 57 57 57 57 56 57 57 57 57 57 57 57 56 56 56 57 57 57 58 57 57 57 57 57 57 57 57 58 58 58 58 57 57 57 58 58 58 58 58 58 58 58 58 58 58 58 59 59 59 59 58 58 58 57 57 57 57 57 57 57 57
7130 57 57 57 58 58 58 58 57 57 57 57 57 57 57 58 58 58 58 58 59 58 57 57 57 57 57 57 57 58 57 57 57 57 57 57 56 56 57 57 57 57 58 58 58 57 57 58 58 58 58 58 58 57 57 57 57 57 57 57 57 57 57 57 57 57 57 57 57 57 57 58
7122 58 58 58 58 58 58 58 58 59 58 58 57 57 57 57 57 57 57 57 57 57 57 58 58 57 57 57 58 58 58 58 59 59 59 58 58 58 58 58 58 58 58 58 58 58 58 58 58 57 58 58 58 59 59 59 59 58 58 58 58 58 58 58 58 58 58 58 58 58 58 58
7115 58 58 59 59 59 59 59 59 58 58 58 58 58 58 58 58 58 58 58 58 58 58 57 57 57 57 57 58 58 58 58 58 58 58 58 58 58 58 58 58 58 58 59 58 58 58 58 58 58 58 58 58 58 58 58 57 57 57 57 57 57 58 58 58 58 58 58 58 57 58 58
7108 58 58 58 58 57 57 57 57 57 57 57 57 58 58 58 58 58 57 57 57 57 58 58 58 58 58 58 57 57 58 58 58 58 58 58 58 58 58 58 58 58 57 57 57 58 58 58 58 58 58 58 58 58 57 57 57 57 58 57 57 57 57 57 58 58 58 57 57 57 57 57
7100 57 58 58 58 58 57 57 56 57 57 57 57 57 58 58 58 58 58 58 58 58 58 58 58 58 58 58 58 58 58 58 58 58 58 58 58 58 58 58 58 58 58 58 58 58 58 57 57 57 58 58 58 58 58 58 57 57 58 58 58 59 59 59 59 59 58 58 58 57 57 57
7093 57 57 57 58 58 58 58 58 58 57 57 57 57 57 57 57 57 56 56 56 56 56 57 57 56 56 56 56 57 57 57 57 57 57 57 57 57 57 57 58 58 57 57 57 57 57 57 57 57 57 57 57 57 57 57 57 57 57 57 57 57 58 58 58 57 57 57 57 57 57 58
7085 58 57 57 57 57 57 57 57 57 57 57 58 58 58 58 58 58 58 58 57 57 57 57 57 58 58 58 59 59 58 58 58 58 57 57 58 58 58 58 58 58 57 57 57 58 58 58 58 58 59 58 58 58 58 58 58 58 57 57 57 57 57 57 57 57 57 57 56 56 56 57
7078 57 57 57 57 57 57 57 57 57 57 57 58 58 58 58 58 58 58 57 58 58 58 58 58 58 58 58 58 58 58 58 58 58 58 58 58 58 58 57 57 56 56 57 57 57 57 57 57 58 58 58 58 58 58 59 59 59 59 58 58 57 57 57 57 58 58 58 58 58 57 57
7071 57 57 57 58 58 58 58 58 58 58 58 58 58 58 59 59 58 58 58 59 58 58 58 58 58 58 58 58 58 57 57 57 57 57 57 57 57 57 57 57 57 57 58 58 58 59 58 58 58 58 58 58 58 58 59 58 58 58 58 58 58 58 58 58 57 57 57 57 57 57 57
7063 57 57 57 57 57 57 58 57 57 57 58 58 58 58 57 56 57 57 57 57 57 56 57 57 57 57 57 57 57 57 57 57 57 57 57 57 57 57 57 57 58 57 57 57 57 57 58 58 57 57 57 57 57 57 57 57 57 57 57 56 57 57 57 57 57 58 58 58 57 57 57
7056 57 57 57 56 56 56 57 57 57 57 57 57 57 56 56 56 56 56 56 56 56 57 56 56 56 57 57 57 57 57 57 57 57 57 58 58 58 58 57 57 58 57 57 57 57 57 57 57 57 57 57 57 57 57 58 57 56 56 57 57 58 59 58 58 58 58 58 58 58 58 58
7048 58 58 58 57 56 57 57 57 57 57 57 57 57 56 56 56 56 57 57 57 57 57 57 57 57 57 57 57 57 57 57 57 57 57 57 57 57 57 57 57 57 57 57 57 57 57 56 57 57 57 56 56 56 57 57 58 58 58 58 58 58 57 57 58 58 58 57 57 57 57 57
7041 57 57 57 57 57 58 58 58 57 57 57 57 57 58 57 57 58 59 59 59 59 58 58 57 57 57 58 58 57 57 58 58 59 58 58 58 58 57 57 57 57 58 58 58 58 57 57 57 57 57 57 57 57 57 57 57 57 57 57 57 57 58 58 58 58 57 58 58 58 57 57
7033 57 58 57 57 57 57 57 57 57 57 57 57 58 58 58 58 58 59 59 58 59 59 58 58 58 58 58 58 58 58 58 58 58 58 58 58 58 57 57 57 57 57 58 58 58 58 58 58 57 57 57 57 57 57 57 57 57 56 57 57 57 58 58 58 57 57 57 57 57 57 57
7026 57 57 57 56 56 56 57 57 58 58 58 58 58 58 58 57 57 57 57 58 57 57 57 57 57 57 58 58 57 58 58 58 58 57 57 56 56 57 58 57 57 58 58 58 57 57 57 57 57 57 57 56 56 56 56 57 57 57 58 57 57 57 57 57 58 58 58 58 58 58 58
7019 58 58 58 58 58 58 58 58 58 58 58 57 57 57 57 57 57 58 58 58 58 58 58 58 58 58 58 58 58 58 57 57 58 58 58 58 58 58 58 57 57 57 58 58 58 58 58 58 58 58 58 58 59 59 59 59 59 59 59 59 59 58 58 59 59 59 59 59 58 58 58
7011 58 58 58 58 58 58 58 58 58 58 58 58 59 59 59 59 59 59 59 58 57 57 57 57 57 57 57 57 57 57 58 58 58 58 58 58 57 58 58 58 58 58 58 59 59 58 58 58 59 59 59 59 59 58 58 58 58 59 59 59 59 59 59 58 58 59 59 59 59 59 59
7004 59 59 58 58 58 58 58 58 57 57 56 57 57 57 58 58 58 57 57 57 57 57 57 58 58 58 59 58 58 58 58 58 58 58 58 58 58 58 58 57 57 57 57 57 57 58 58 58 58 58 58 58 58 58 58 58 58 58 58 58 58 57 57 58 58 58 57 57 57 58 58
6996 58 57 57 57 57 57 58 57 57 57 57 57 58 58 58 57 57 57 57 57 57 57 57 57 57 57 57 57 57 58 58 58 58 58 57 57 57 57 57 57 58 58 58 58 58 58 58 58 58 58 58 58 58 58 58 59 59 58 57 58 58 58 57 57 57 57 57 57 57 57 56
6989 56 57 57 57 57 58 58 58 57 57 57 57 57 57 57 57 57 57 58 57 57 57 57 57 57 57 57 57 57 57 58 58 58 57 57 57 57 57 57 57 57 56 56 56 57 57 57 57 57 57 57 57 57 57 57 57 57 58 58 58 58 57 57 56 56 57 57 57 57 57 57
6982 57 57 57 57 57 57 57 57 56 56 56 56 56 57 57 57 57 56 56 57 56 56 55 55 56 57 58 58 58 58 57 57 57 57 57 57 57 58 58 58 58 58 58 57 57 57 57 57 58 57 57 57 57 56 56 56 57 57 57 57 57 57 57 57 57 57 57 57 57 57 57
6974 57 57 57 57 57 57 58 58 57 57 57 57 57 57 57 57 57 57 56 57 57 57 57 57 57 57 57 57 57 56 56 56 57 57 57 57 57 57 56 56 57 57 57 57 57 57 57 57 57 57 57 56 56 56 57 57 57 56 57 56 56 56 56 56 56 57 57 57 56 56 56
6967 56 56 56 56 56 56 56 56 56 57 57 57 57 58 58 58 58 57 57 57 57 57 57 57 57 57 57 57 57 57 57 57 57 58 58 57 57 57 57 56 56 56 57 57 57 57 57 57 57 57 57 57 57 56 56 56 57 57 57 57 57 56 56 56 56 56 57 57 57 57 57
6959 57 58 58 58 58 58 58 58 58 58 57 57 57 56 56 56 56 57 57 57 57 58 58 58 58 58 58 58 58 57 57 57 57 57 57 56 57 56 57 57 57 58 58 58 57 58 58 58 58 58 58 58 57 57 56 56 57 57 57 57 57 57 57 57 57 57 57 57 57 57 57
6952 57 57 57 57 57 57 57 57 57 57 58 58 58 58 57 57 57 57 57 57 58 58 58 58 58 57 57 57 57 57 57 56 56 56 56 56 56 55 55 55 55 55 55 55 56 56 56 56 56 56 57 57 58 58 57 57 57 57 57 56 56 57 57 57 57 57 56 57 57 57 57
6944 57 57 57 57 57 57 57 57 57 57 57 57 57 56 56 56 56 56 56 57 57 57 57 57 57 57 56 56 57 57 57 57 57 57 57 57 57 57 56 56 57 57 57 57 56 56 56 56 56 56 57 57 57 57 57 57 57 57 56 56 56 56 56 56 56 56 56 56 56 56 56
6937 56 56 56 57 57 57 57 57 57 57 57 57 57 57 57 57 57 57 57 57 56 56 57 57 57 57 57 57 56 56 56 56 56 56 55 56 56 56 56 56 57 57 56 56 56 56 57 57 58 58 57 58 58 58 58 58 57 57 57 57 57 57 57 57 57 57 57 57 57 57 57
6930 57 57 57 57 57 57 57 57 56 56 56 56 57 57 57 58 57 57 57 57 56 57 57 57 57 56 57 57 57 56 56 56 56 56 57 56 56 56 56 56 56 56 56 56 57 57 57 57 57 57 57 57 57 57 57 56 56 56 56 56 56 56 56 56 56 57 57 57 58 57 57
6922 57 57 57 57 57 57 57 57 58 57 57 56 56 56 57 57 57 57 57 57 57 57 57 57 57 57 57 57 57 57 57 56 56 57 57 57 57 57 56 56 56 57 58 58 58 57 57 57 57 58 58 58 57 57 57 57 57 57 56 56 56 56 57 57 57 57 56 56 56 56 57
6915 57 58 58 58 58 57 57 57 57 57 57 57 57 57 57 58 58 58 57 57 57 57 58 58 58 58 58 58 57 56 55 56 56 56 56 56 56 55 56 56 57 57 58 58 58 58 57 57 57 57 57 56 56 56 56 57 57 57 58 57 57 57 57 57 58 58 58 58 58 58 58
6907 58 58 58 58 58 58 58 57 57 57 58 58 58 58 58 58 57 57 57 57 57 56 56 56 56 57 57 57 58 58 58 58 57 57 57 56 57 57 57 57 57 57 57 57 57 57 57 57 57 57 56 56 56 57 57 57 57 58 58 58 58 57 57 57 57 56 56 57 57 58 58
6900 58 58 58 58 58 58 58 58 57 58 58 58 57 56 57 57 57 57 57 56 56 56 56 57 57 57 57 57 57 56 56 57 56 56 56 57 57 57 57 57 57 56 56 57 57 57 58 58 58 57 57 57 57 57 57 58 58 58 57 57 57 57 58 58 58 57 57 57 57 57 57
6893 57 57 57 56 56 57 56 56 56 57 57 57 56 56 57 57 58 57 57 57 57 58 58 57 57 57 56 56 56 56 56 56 56 56 56 56 56 56 56 56 56 56 56 56 56 56 56 56 56 56 56 56 56 56 56 56 56 56 56 56 56 56 56 56 56 56 56 56 57 57 57
6885 57 57 57 57 56 57 57 57 56 56 55 55 56 56 56 56 56 56 55 55 56 56 56 55 55 54 54 54 55 55 55 56 55 55 55 56 56 56 57 57 57 57 57 57 57 57 57 57 57 57 57 57 57 57 56 56 56 56 56 56 56 56 56 57 57 57 57 57 57 56 56
6878 56 56 56 57 57 57 57 57 57 57 56 56 56 57 57 57 57 57 57 57 57 57 57 57 57 57 57 57 57 56 56 56 56 56 56 56 56 57 57 57 57 57 57 57 57 58 57 57 57 57 57 57 57 58 58 57 57 57 57 57 57 57 57 57 57 57 57 57 57 57 57
6870 57 56 56 56 57 57 57 58 58 58 58 58 57 57 57 57 57 58 58 57 57 56 56 56 57 57 57 57 57 57 57 57 57 58 57 57 57 57 57 57 57 56 56 55 55 55 56 56 56 56 56 56 57 57 57 57 57 57 56 56 56 56 56 56 57 57 57 57 57 57 57
6863 57 57 57 56 56 56 56 56 56 56 56 55 55 55 56 56 56 57 57 57 56 56 56 56 57 57 57 57 57 57 57 56 56 56 56 56 56 56 56 55 55 55 55 55 55 55 55 56 56 56 56 56 56 55 55 55 55 55 55 55 55 56 56 56 56 56 56 56 57 57 57
6855 57 57 57 56 56 56 56 56 57 57 57 57 57 57 58 57 57 57 57 57 57 56 56 56 57 57 57 57 57 56 56 55 55 55 56 57 56 56 56 56 56 57 57 57 57 57 57 57 57 56 56 56 56 56 57 56 56 56 55 56 56 56 56 56 56 57 57 57 57 57 57
6848 57 57 57 57 57 57 57 56 56 56 57 57 57 57 57 56 56 56 57 57 57 57 57 57 57 56 55 55 55 55 56 57 57 57 57 57 57 57 57 57 57 57 57 57 57 57 57 57 57 57 57 57 57 56 56 56 56 56 57 57 58 57 57 57 56 56 56 56 56 56 56
6841 56 56 56 56 56 56 57 56 55 55 56 56 56 56 56 56 56 57 57 57 57 56 56 57 56 56 56 56 56 56 56 56 56 56 56 56 56 56 56 56 56 56 56 56 57 57 57 57 57 56 56 56 56 56 56 56 57 57 57 57 56 56 56 56 56 56 56 56 55 55 55
6833 55 55 55 56 56 56 56 56 56 56 56 57 57 56 56 57 56 56 56 56 56 56 56 56 56 56 56 56 56 56 56 57 57 56 56 55 55 55 55 55 55 55 55 55 55 55 56 56 56 56 56 56 56 56 56 56 56 56 56 56 56 56 56 56 56 56 56 56 57 56 56
6826 56 56 56 57 57 57 56 56 56 56 56 56 56 56 56 55 55 55 55 55 55 55 55 55 55 56 55 55 55 55 55 56 56 56 57 57 57 57 58 58 58 58 58 58 57 57 57 57 57 57 57 57 57 58 57 57 57 56 56 57 57 57 57 56 56 56 56 56 57 57 57
6818 57 57 57 58 58 58 58 57 57 57 57 57 57 57 57 57 57 57 57 57 57 57 57 57 57 57 56 56 57 57 57 57 57 57 57 57 56 56 56 56 56 57 57 58 57 57 57 57 57 57 57 57 56 57 57 57 57 57 56 56 56 56 56 56 56 57 57 57 57 57 57
6811 57 57 57 58 58 58 58 58 58 57 57 57 57 57 57 57 57 57 57 58 58 57 57 57 57 58 59 59 59 59 58 57 57 57 57 57 57 57 57 57 57 58 58 58 58 58 58 57 57 57 58 58 58 58 58 58 58 57 57 57 57 57 58 58 58 59 59 59 59 59 59
6804 59 58 58 58 58 58 58 58 58 57 57 57 57 57 57 57 58 58 57 57 57 57 57 57 57 57 58 58 58 58 58 57 57 57 57 58 58 58 57 57 57 57 57 58 58 58 57 57 57 56 57 57 56 57 57 57 57 57 57 56 56 56 57 57 57 57 57 57 57 57 57
6796 57 56 56 57 57 57 57 57 56 56 56 56 57 57 58 57 57 57 57 57 57 57 57 57 57 56 56 56 56 56 56 56 57 56 56 56 56 56 57 57 56 56 56 56 56 57 57 56 56 56 56 56 56 57 57 57 57 57 57 56 56 56 56 56 56 56 56 55 56 56 57
6789 57 57 56 56 56 56 57 57 57 57 57 57 57 57 57 58 58 58 57 57 57 57 57 57 57 57 57 57 57 57 57 57 57 57 57 57 57 57 57 56 56 55 56 56 57 57 57 57 57 57 57 56 55 55 55 56 56 56 56 56 56 56 56 56 56 56 56 56 56 56 57
6781 57 57 57 56 56 56 56 56 56 56 56 56 56 56 56 56 56 56 56 56 56 56 56 56 56 56 56 56 56 56 56 57 57 56 56 56 56 55 55 55 56 56 56 56 56 57 57 56 56 56 55 55 55 55 55 55 55 55 55 55 56 56 56 56 56 56 56 56 56 57 57
6774 57 57 57 56 56 56 55 55 55 55 56 56 56 56 55 55 55 55 55 56 56 56 56 56 56 57 56 56 56 56 56 56 56 56 56 56 55 55 55 55 55 55 55 55 56 56 56 55 55 56 56 56 56 56 56 56 57 57 56 56 56 56 56 56 56 56 57 57 57 57 57
6766 57 57 57 57 56 57 57 57 57 57 58 57 57 58 58 58 57 56 56 57 57 57 57 56 56 56 56 56 56 56 56 56 56 56 57 57 57 57 57 57 57 57 56 56 56 56 57 56 56 56 57 57 57 57 57 56 56 56 56 56 57 57 57 57 56 56 56 56 56 56 57
6759 57 57 57 57 57 57 57 57 57 56 56 57 57 57 57 57 57 56 55 56 56 56 56 57 57 56 55 56 57 57 56 56 56 56 56 56 56 56 56 56 56 56 55 56 56 56 56 56 57 57 57 56 56 56 55 55 55 55 55 55 56 56 56 56 56 56 55 56 56 57 57
6752 57 57 57 57 57 57 56 56 56 56 56 56 56 56 55 55 55 56 56 56 56 56 55 55 56 56 56 56 57 57 57 56 56 56 56 56 56 56 56 56 56 55 55 55 55 55 54 55 56 55 55 55 55 55 56 56 56 55 55 55 55 55 55 55 55 55 55 56 56 56 56
6744 56 56 56 56 55 56 56 56 56 56 56 56 55 55 55 55 55 55 55 55 55 55 55 55 55 55 54 54 54 54 54 54 54 54 55 55 55 55 55 55 56 55 55 55 54 54 54 54 54 54 55 55 55 55 55 55 55 55 56 56 56 56 56 56 56 56 56 56 56 55 55
6737 55 55 55 56 56 56 55 56 57 57 57 56 55 55 55 55 55 56 56 56 55 55 56 56 56 56 56 56 56 56 56 56 56 56 55 55 55 55 55 55 56 56 55 55 55 54 54 55 55 55 56 56 56 56 56 56 56 56 56 55 55 55 56 56 57 56 56 56 56 55 55
6729 55 56 56 56 55 55 55 55 55 54 54 54 55 56 56 56 56 57 56 56 56 56 57 57 57 57 57 56 56 56 56 57 57 57 58 58 58 58 58 57 58 59 59 59 58 58 58 58 57 57 57 57 57 57 57 57 57 58 58 58 58 58 58 57 57 56 56 57 58 57 57
6722 57 57 57 57 57 57 57 56 56 56 56 56 56 57 57 57 56 57 57 57 57 57 57 57 57 57 57 57 58 58 58 58 58 57 57 57 57 57 57 57 57 57 57 57 57 57 57 57 57 58 58 57 57 57 57 57 57 57 57 57 57 57 57 57 57 56 56 56 56 56 56
6715 56 57 57 57 57 57 57 57 57 57 56 56 56 57 57 58 57 57 57 57 57 57 57 57 57 56 56 56 56 56 56 56 56 56 56 56 56 56 56 57 57 57 57 57 57 57 57 56 56 56 55 56 56 56 56 56 57 57 57 57 57 57 57 57 57 57 57 57 57 57 57
6707 57 57 56 57 57 56 57 57 57 57 57 57 57 58 58 57 57 57 57 57 57 57 56 56 56 57 57 57 57 56 55 55 55 56 56 55 55 55 55 55 56 56 56 56 57 57 57 57 57 56 56 56 55 55 55 55 55 56 56 56 56 56 56 56 56 56 56 56 56 56 56
6700 56 56 56 56 56 56 56 56 56 56 56 56 56 56 56 56 55 55 55 55 55 55 55 55 55 55 56 56 56 56 55 55 56 56 56 55 55 55 56 56 56 55 55 55 55 55 55 54 54 55 55 55 55 55 55 55 55 55 55 56 56 56 56 56 56 55 55 55 56 56 57
6692 57 56 56 56 56 56 56 56 56 56 56 56 56 57 56 56 56 57 56 56 56 55 55 55 55 56 56 55 55 56 56 56 56 56 56 56 56 56 56 56 55 55 55 55 55 55 55 55 55 55 56 57 57 57 56 56 56 56 57 57 58 57 57 57 57 57 57 57 57 57 57
6685 57 58 58 58 58 58 58 58 58 58 58 58 58 58 59 59 59 58 58 58 58 58 59 59 58 59 59 59 58 58 57 57 57 57 58 58 58 58 58 58 58 57 57 57 57 57 57 57 57 57 57 57 57 57 57 57 57 57 57 57 57 57 58 58 58 58 58 58 58 58 58
6677 58 57 57 58 59 59 59 59 59 58 58 58 57 58 58 59 59 59 59 59 59 59 58 58 58 58 58 58 58 58 57 57 57 58 58 58 57 57 58 59 59 59 58 58 58 58 57 57 57 57 57 57 57 57 57 58 58 58 58 58 58 57 57 57 56 56 56 56 56 56 56
6670 56 57 57 57 57 57 57 57 58 58 58 57 57 57 58 58 58 58 58 57 57 57 57 56 57 57 58 58 58 57 56 56 56 57 57 57 57 57 57 57 57 57 57 57 57 57 57 57 58 58 58 58 58 58 58 58 58 57 57 57 57 57 57 57 57 57 58 58 58 57 57
6663 57 57 58 58 57 57 57 57 57 57 57 57 57 57 57 57 57 57 57 57 57 57 58 57 57 57 56 56 56 56 56 56 56 57 57 57 57 57 57 57 57 57 57 57 57 57 57 57 56 56 57 57 57 57 57 57 57 57 57 57 57 57 56 56 56 56 56 56 56 56 56
6655 56 56 56 56 56 56 56 56 56 56 56 57 57 57 57 57 57 58 58 58 58 58 58 58 57 57 57 57 57 57 57 57 58 58 58 57 57 57 57 57 57 57 57 57 57 57 57 57 57 57 57 57 57 57 57 58 58 58 57 57 57 57 57 57 57 57 57 56 56 56 56
6648 56 56 56 56 57 57 57 57 56 56 55 55 55 55 56 57 56 56 56 56 56 56 56 56 56 57 56 56 56 56 56 56 56 56 56 56 56 56 56 56 56 57 57 56 56 56 56 56 56 56 56 56 56 57 57 57 56 56 57 57 57 57 57 56 56 56 57 57 57 57 57
6640 57 57 57 57 57 57 57 57 57 57 57 56 56 56 56 56 56 56 57 57 57 57 57 57 57 57 57 56 56 56 56 56 56 56 57 57 57 57 57 57 57 57 56 56 56 56 56 56 56 55 55 55 56 56 56 56 56 56 56 56 57 56 57 57 57 57 57 57 57 57 57
6633 57 57 57 57 57 57 57 57 56 57 57 57 56 56 57 57 57 57 57 57 57 57 58 57 57 57 57 56 56 57 57 57 57 57 57 57 57 56 56 56 56 56 56 57 56 56 56 56 56 56 55 55 56 56 56 56 56 56 55 55 55 56 56 56 56 56 57 57 56 56 56
6625 56 56 56 56 56 56 56 56 56 56 56 57 57 57 57 57 57 56 56 56 56 56 56 56 57 57 57 57 57 57 57 57 57 57 57 57 57 56 56 56 56 57 57 57 57 56 56 56 56 56 56 56 56 56 56 56 57 56 57 57 57 56 56 56 55 56 56 56 56 56 57
6618 57 57 57 57 57 56 56 56 55 55 55 55 55 56 56 56 56 56 56 56 56 56 56 56 56 56 56 57 56 56 56 57 57 57 57 57 56 56 56 56 56 56 55 56 56 56 56 56 56 56 56 56 56 56 56 56 56 57 57 57 57 56 56 56 56 56 56 56 56 56 56
6611 56 56 56 56 56 56 56 55 55 55 55 55 56 56 56 56 56 56 56 56 56 56 56 56 56 56 56 56 56 55 55 54 55 55 55 55 55 55 55 55 55 55 55 55 55 55 55 56 56 56 56 56 55 55 56 56 56 56 55 55 55 55 55 55 55 56 55 55 54 54 54
6603 54 55 55 55 55 56 56 56 56 56 56 56 55 55 55 55 55 55 55 55 55 55 55 55 55 55 55 55 55 55 55 55 55 55 55 55 56 56 57 57 57 57 56 56 56 56 56 56 56 56 56 56 56 55 55 56 56 56 56 56 56 56 56 56 56 56 56 57 57 57 58
6596 58 58 57 56 56 56 56 56 56 56 56 56 56 56 56 56 56 55 55 55 55 55 56 56 56 56 56 56 56 56 56 56 56 56 55 55 55 55 55 56 56 55 55 54 54 55 55 55 55 55 55 55 55 55 55 55 55 55 56 56 56 56 56 55 55 55 55 55 55 55 56
6588 56 56 56 56 56 56 56 56 55 55 55 55 55 55 55 55 55 55 55 55 55 55 55 55 56 56 55 55 55 55 55 55 55 55 54 54 55 55 55 55 55 55 55 55 54 55 55 55 55 55 55 55 55 55 55 55 55 55 55 55 56 55 55 55 54 54 54 54 54 54 54
6581 54 54 54 54 54 54 54 54 55 55 55 55 54 55 55 55 54 55 55 55 55 56 56 56 55 55 55 54 55 55 55 55 55 55 55 55 55 55 55 55 55 55 56 55 54 55 55 55 56 56 56 56 56 55 55 55 55 55 55 55 55 55 55 55 55 55 55 55 55 54 54
6574 54 55 55 55 55 54 54 54 55 55 54 54 54 55 55 55 55 55 55 55 55 55 55 55 55 55 56 55 55 55 56 56 56 56 56 56 56 56 56 56 56 56 56 56 55 55 55 55 54 54 54 55 55 55 55 55 54 54 55 55 55 55 55 55 55 55 55 55 55 56 56
6566 56 55 55 55 54 54 54 54 54 54 54 54 55 55 55 55 54 54 54 54 54 54 54 54 54 54 54 54 54 53 54 54 54 54 53 53 54 54 54 54 55 55 54 54 54 54 54 54 55 54 54 54 54 55 55 55 55 54 54 54 55 54 54 54 54 53 53 53 54 54 54
6559 54 54 54 54 54 54 55 55 54 54 54 54 53 53 53 53 53 53 53 54 53 53 53 53 53 53 53 53 53 53 53 53 53 53 54 54 54 54 54 55 55 55 54 53 53 53 53 53 53 53 53 53 53 53 53 53 53 53 52 52 52 52 52 52 52 52 52 52 53 53 53
6551 53 53 53 52 52 53 53 53 54 54 53 53 53 53 54 54 53 53 53 53 52 52 52 52 53 52 52 52 52 53 53 53 52 52 53 53 53 54 53 53 53 53 54 54 54 54 54 54 54 54 54 54 54 54 54 54 53 53 54 54 54 54 54 54 54 54 54 54 54 53 53
6544 53 54 54 54 55 55 55 55 54 54 54 54 54 53 53 53 53 53 54 54 53 53 53 54 54 54 55 55 54 54 54 54 54 54 54 54 54 54 54 54 54 55 55 55 55 54 54 54 54 55 56 56 55 54 53 53 54 54 55 55 55 55 55 55 55 55 55 55 55 55 55
6536 55 55 55 55 55 55 55 55 55 55 56 56 56 56 56 56 57 57 56 56 56 55 56 56 56 56 56 56 56 57 57 57 58 57 57 57 57 57 57 57 57 57 56 56 56 56 57 57 57 57 57 57 56 56 56 56 56 55 55 55 55 55 55 56 56 56 56 56 56 56 56
6529 56 57 57 57 57 57 57 57 57 57 57 57 57 57 57 57 57 57 57 58 58 58 58 58 58 58 58 58 58 58 58 57 57 56 56 56 56 56 57 57 57 57 57 57 57 57 57 57 57 57 57 57 57 57 57 57 57 57 57 56 56 57 57 57 57 57 57 57 56 56 56
6522 56 56 56 57 57 57 57 57 57 56 56 56 57 57 57 57 56 56 56 56 56 56 56 57 57 57 57 57 57 57 57 57 56 56 56 56 56 56 57 57 57 57 57 58 58 58 58 58 58 58 58 58 58 57 57 57 57 57 57 57 57 57 57 58 58 58 58 58 58 58 58
6514 58 58 58 58 58 58 58 57 57 57 56 56 56 56 57 57 57 56 57 57 57 57 57 57 57 57 57 57 57 57 57 57 57 57 58 58 58 58 58 58 58 57 57 58 58 58 58 58 58 58 58 58 58 58 58 58 58 58 57 57 57 57 57 57 57 58 58 57 57 57 57
6507 57 57 57 57 57 57 57 57 57 58 58 58 58 57 56 56 56 57 57 57 57 56 55 55 56 56 56 56 57 56 56 56 56 55 55 56 56 56 55 55 55 55 55 55 55 55 56 55 55 55 55 56 56 55 56 55 55 55 55 55 55 55 56 56 56 56 56 56 56 55 55
6499 55 55 55 55 55 55 55 55 55 55 55 54 54 54 55 55 54 54 54 54 54 54 54 54 54 54 54 54 54 54 54 55 55 55 55 55 55 55 55 55 56 55 55 55 55 55 55 55 56 56 56 56 56 57 56 56 56 56 56 56 56 57 56 56 56 55 55 55 55 55 55
6492 55 55 55 55 55 56 56 56 56 56 56 56 56 56 55 56 56 56 56 56 56 55 54 54 55 56 57 57 57 56 56 56 56 56 57 57 58 57 57 57 58 58 58 57 57 58 58 58 58 58 58 58 58 58 57 58 58 59 58 58 58 57 57 57 57 57 57 57 57 57 57
6485 57 57 57 57 57 57 57 57 58 58 58 58 57 57 57 58 57 57 57 57 57 57 57 57 57 57 58 57 57 57 57 57 57 57 57 57 57 57 57 57 57 57 58 58 59 59 59 59 59 58 58 58 58 58 58 58 58 58 59 59 59 59 59 58 58 57 56 56 56 57 57
6477 57 57 57 57 57 58 57 57 57 57 56 56 57 57 58 58 57 57 57 57 57 58 58 58 58 59 59 59 60 59 59 59 59 58 58 58 57 58 58 58 58 58 57 58 58 58 58 59 59 58 58 58 58 58 57 57 57 57 58 58 58 58 58 58 57 57 57 58 58 59 59
6470 59 58 58 58 57 58 58 58 58 58 57 57 57 57 57 57 57 57 57 57 57 57 57 56 56 57 57 58 58 58 58 58 58 58 58 58 57 57 58 58 58 58 58 58 57 58 58 58 58 58 58 59 60 59 59 58 58 59 59 59 58 58 58 58 58 58 58 58 58 58 58
6462 58 58 58 58 58 57 57 57 57 57 57 57 57 58 58 58 58 58 58 58 57 57 57 57 57 57 56 57 57 58 58 57 57 57 57 57 58 58 58 58 58 58 58 58 58 58 59 59 58 58 57 58 58 58 59 59 59 58 58 58 58 57 58 58 58 59 59 59 59 59 59
6455 59 60 60 60 60 60 60 59 59 59 59 59 59 59 59 59 60 60 60 59 59 59 59 59 59 59 59 59 59 59 59 59 59 59 59 59 59 59 59 60 60 60 59 59 58 58 59 59 59 59 60 59 59 59 58 58 59 59 59 59 58 58 58 58 58 58 58 58 58 58 58
6447 58 58 58 58 58 58 59 59 59 59 59 59 59 58 58 58 58 58 58 59 59 59 58 58 58 58 58 58 58 58 58 58 58 58 58 58 58 58 58 58 58 58 58 58 58 58 58 57 57 57 56 57 57 57 58 57 57 57 57 57 57 57 58 58 58 58 58 58 58 58 58
6440 58 58 58 58 58 58 58 58 58 58 57 57 57 57 57 57 56 56 57 57 57 57 57 57 58 58 57 57 57 57 57 58 58 58 58 58 58 57 57 57 57 57 57 57 58 58 58 58 58 58 58 58 58 58 59 58 57 58 58 58 58 57 57 57 57 57 57 57 57 57 57
6433 57 57 57 57 57 57 58 58 58 58 57 57 57 57 58 58 58 58 58 57 57 57 57 57 57 57 57 57 58 58 58 58 58 58 58 58 58 58 58 58 58 58 59 59 59 59 59 58 58 58 58 58 58 58 58 58 59 59 59 59 59 59 60 60 60 60 60 60 60 59 59
6425 59 59 59 59 59 59 59 59 59 59 59 59 59 59 59 59 59 59 59 59 59 59 59 59 59 59 60 60 60 60 60 60 59 60 60 60 60 59 59 59 60 60 59 59 59 59 59 59 59 59 59 59 60 60 59 59 59 59 59 58 59 59 59 59 58 58 58 58 58 58 59
6418 59 59 59 59 59 59 59 59 59 59 60 60 60 60 60 59 59 59 59 59 59 59 59 59 59 59 59 59 59 58 58 58 58 58 59 59 59 59 59 59 59 59 59 59 59 59 59 59 59 59 59 59 59 59 59 59 59 59 59 59 59 59 59 59 59 59 59 59 59 59 59
6410 59 59 59 59 59 59 60 60 60 60 60 61 61 61 61 61 61 61 60 60 60 60 60 60 60 59 60 60 60 60 60 60 61 60 60 60 60 60 60 61 61 61 60 60 60 60 60 60 59 59 59 59 59 60 61 61 61 61 61 61 60 60 60 60 59 59 59 59 59 59 60
6403 60 60 60 60 60 61 60 60 60 60 60 60 60 60 60 60 60 60 60 60 60 60 60 60 60 60 60 60 60 60 61 60 60 60 59 59 59 59 58 59 59 60 60 60 61 61 61 61 61 61 60 60 60 60 60 61 61 61 61 61 61 62 62 61 61 61 61 60 60 60 60
6396 60 60 60 60 60 60 60 60 60 60 60 59 59 59 59 59 59 59 59 58 58 59 59 59 60 60 59 59 59 59 59 59 59 59 60 60 60 60 60 59 59 59 58 58 59 59 59 59 59 59 59 59 59 58 58 58 59 59 59 59 59 60 60 60 59 59 59 58 58 59 58
6388 58 58 59 59 59 59 59 58 58 59 59 59 60 60 59 59 58 58 58 58 58 58 58 58 58 58 58 59 59 59 59 59 59 59 59 59 59 59 59 59 59 59 59 58 59 59 59 59 59 59 59 59 59 59 59 59 59 60 60 59 59 59 59 59 59 59 59 59 59 59 59
6381 59 59 59 59 58 58 58 58 58 58 58 58 58 58 58 58 58 58 58 58 58 59 59 58 58 58 58 58 59 59 59 59 59 60 60 61 61 61 61 61 61 60 59 59 59 60 60 60 61 61 60 60 60 60 60 60 60 61 61 60 60 60 60 59 59 59 60 59 59 59 59
6373 59 59 59 59 59 59 59 60 60 60 60 59 59 59 59 59 59 59 59 59 59 59 59 59 59 58 58 59 60 60 60 60 60 60 60 60 60 60 59 59 59 59 59 59 59 59 59 59 59 59 59 59 59 59 60 60 60 60 60 60 61 61 61 61 60 60 59 60 60 60 60
6366 60 60 60 59 59 60 60 60 60 60 59 59 59 59 59 59 59 60 60 60 60 60 60 60 60 60 60 60 60 60 60 60 60 60 60 61 61 61 61 61 60 60 60 60 60 60 61 61 61 61 61 62 62 62 62 62 62 63 63 62 62 62 62 63 62 62 61 61 62 62 62
6358 62 62 62 62 62 62 62 63 63 63 63 63 63 63 63 62 62 62 62 62 61 61 61 60 60 61 61 62 62 62 63 63 63 63 63 63 63 63 63 62 62 62 62 62 62 62 62 62 63 64 64 64 65 64 64 64 64 64 64 65 65 65 65 65 65 65 65 65 65 65 65
6351 65 65 65 65 64 64 64 64 64 64 63 64 64 64 64 65 65 64 65 65 65 65 65 65 65 65 65 65 65 65 65 65 64 65 65 65 66 66 65 65 65 65 65 65 65 65 65 65 65 64 64 64 64 65 65 64 65 65 65 65 65 65 65 65 65 65 66 66 66 66 66
6344 66 66 66 67 67 67 67 67 67 66 66 66 66 66 66 66 66 66 65 65 64 65 65 66 66 67 67 67 67 66 66 65 65 65 66 66 66 67 67 67 67 67 67 67 67 67 67 67 67 67 67 66 66 66 66 67 67 67 68 68 68 68 67 67 67 67 66 67 67 66 67
6336 67 67 68 68 68 67 67 67 67 68 68 68 68 67 67 67 68 68 68 69 69 69 69 69 69 69 70 70 70 70 71 71 70 70 70 70 70 70 70 70 70 70 70 70 71 71 71 72 72 71 71 70 70 71 71 71 71 70 70 71 71 71 71 72 72 71 71 71 71 72 72
6329 72 71 71 71 71 71 71 71 71 72 72 72 72 71 72 72 72 72 72 73 73 73 73 73 73 73 73 73 73 73 73 73 72 73 73 74 74 75 75 74 74 75 75 75 75 75 75 75 75 75 75 76 76 75 75 75 75 75 76 76 76 75 76 76 77 77 77 77 77 76 76
6321 76 76 76 77 77 77 77 77 77 77 77 77 77 77 77 78 77 77 76 76 76 76 76 76 77 77 77 77 77 77 77 78 79 79 79 79 79 79 79 79 79 79 79 79 79 79 79 79 79 79 80 80 80 80 80 80 80 80 80 80 81 81 81 81 82 82 82 82 82 81 81
6314 81 81 81 81 81 82 82 82 82 82 82 82 83 83 83 83 83 83 83 83 83 83 83 82 83 83 83 84 84 84 84 84 84 85 85 85 86 86 86 85 85 85 85 85 85 86 86 86 85 85 86 86 85 85 86 86 87 87 87 87 87 87 86 86 87 87 87 87 87 87 87
6307 87 88 88 88 88 88 87 88 88 89 89 89 89 89 89 89 89 89 90 90 90 90 90 90 90 90 90 90 90 90 90 90 90 90 90 91 91 91 92 92 92 92 92 92 93 93 93 93 93 93 93 93 94 94 94 95 95 95 95 95 95 95 95 95 95 96 96 96 96 96 96
6299 96 96 97 97 97 98 98 99 99 99 99 99 99 99 99 99 99 100 101 101 101 101 100 100 100 100 100 100 100 101 101 102 103 103 103 103 103 103 104 104 104 104 104 104 105 106 106 106 106 106 106 106 106 107 107 107 107 108 108 108 109 109 110 110 110 111 111 111 112 112 112
6292 112 112 111 111 112 112 112 113 113 113 113 114 114 115 115 115 116 116 116 116 117 117 117 118 118 119 119 119 120 120 120 121 121 122 122 123 124 125 125 126 127 128 128 128 128 129 130 130 131 133 135 136 138 139 141 142 143 144 146 147 147 148 148 149 150 151 151 152 152 153
6284 153 154 156 157 158 159 161 162 164 166 167 168 168 169 171 173 174 176 177 179 179 180 180 180 181 180 180 179 178 178 176 175 174 172 171 171 170 169 168 167 166 165 164 164 163 162 162 162 162 162 161 161 162 162 163 164 164 164 165 165 166 167 167 168 168 168 169 169 170 171
6277 171 171 172 172 172 173 174 175 176 176 176 177 178 179 180 180 181 182 182 182 183 183 184 185 186 188 189 190 190 191 191 191 192 193 194 195 196 196 197 199 199 200 201 202 203 204 205 205 206 207 209 210 211 212 212 214 215 216 218 218 219 221 222 223 225 226 228 229 230 231
6270 231 232 233 235 236 237 239 240 241 242 243 244 246 248 249 251 252 254 256 257 259 260 262 263 265 267 268 270 272 274 276 278 280 282 284 285 287 289 291 293 294 296 298 300 303 305 307 310 312 314 317 319 321 323 326 328 330 333 336 338 341 344 346 349 351 353 356 359 362 364
6262 364 367 370 373 376 379 382 386 389 392 395 398 402 405 408 411 415 418 421 425 429 434 437 441 444 448 451 455 458 463 467 471 475 479 483 487 492 496 500 504 508 513 518 522 527 532 536 541 546 551 555 561 566 571 576 581 586 592 597 602 608 614 619 625 631 637 643 649 656 663
6255 663 670 676 682 688 695 702 709 716 724 731 739 746 754 762 771 780 788 798 807 817 826 836 846 856 867 878 889 900 912 924 937 949 962 975 989 1004 1018 1033 1049 1065 1081 1098 1115 1133
6250 1133 1151 1169 1187 1207 1227 1248 1269 1290 1312 1335 1358 1382 1406 1431 1457 1483 1509 1537 1566 1595 1625 1656 1687 1720 1753 1786 1821 1857 1894 1931 1969 2008 2048 2090
6247 2090 2132 2174 2218 2264 2310 2357 2405 2454 2504 2555 2608 2661 2715 2771 2827 2885 2943 3003 3065 3127 3191 3255 3319 3385 3452 3520 3589 3658 3728 3799 3870 3943 4015 4089
6243 4089 4162 4236 4310 4384 4457 4531 4604 4677 4751 4823 4896 4967 5037 5107 5176 5243 5309 5373 5436 5498 5558 5616 5672 5726 5778 5827 5874 5919 5961 6000 6037 6070 6101 6128
6240 6128 6152 6173 6190 6205 6215 6222 6226 6226 6223 6215 6205 6191 6173 6152 6127 6099 6067 6033 5995 5954 5910 5864 5815 5762 5708 5651 5592 5530 5467 5403 5337 5270 5201 5131 5060 4989 4917
6236 4917 4844 4771 4698 4624 4551 4477 4403 4330 4257 4184 4113 4042 3972 3902 3833 3765 3698 3632 3567 3503 3441 3379 3318 3258 3199 3141 3085 3030 2975 2922 2870 2819 2768 2719
6232 2719 2670 2623 2578 2533 2490 2447 2405 2364 2324 2285 2247 2210 2173 2137 2102 2068 2034 2001 1970 1938 1908 1878 1849 1820 1792 1765 1739 1712 1686 1661 1637 1613 1589 1566
6229 1566 1543 1520 1499 1478 1457 1436 1416 1396 1376 1357 1338 1319 1300 1282 1264 1247 1230 1213 1197 1180 1164 1148 1133 1118 1102 1087 1072 1057 1042 1028 1014 1001 988 974
6225 974 960 947 934 921 909 896 884 872 861 849 838 826 815 804 794 783 773 763 753 743 734 724 715 706 697 688 679 671 663 655 647 639 631 623 616 609 603 596 589 583 577 571 565 559 553 547 541 535
6220 535 530 525 520 514 509 505 500 495 491 487 482 478 474 469 465 461 457 453 449 445 442 439 435 430 427 424 421 417 415 411 408 405 402 399 396 394 391 388 385 383 380 378 375 373 371 368 365 363 360 358 356 353 351 348 345 342 341 339 337 336 333 331 329 327 325 322 320 318 316
6213 316 314 312 310 308 307 305 304 302 300 298 296 295 293 291 289 288 286 284 283 281 279 278 276 274 273 271 270 268 267 266 264 263 261 260 258 257 256 255 254 253 252 251 250 249 248 246 245 244 243 242 240 239 238 236 235 234 232 231 230 230 229 228 226 226 225 224 223 223 222
6205 222 221 220 219 217 216 215 214 213 212 211 210 209 208 207 206 205 205 204 203 202 201 200 199 198 197 196 195 194 194 193 192 191 190 188 187 186 186 185 185 184 183 182 182 181 180 179 179 178 177 177 176 176 175 175 174 173 173 172 171 171 170 170 170 171 171 170 169 169 170
6198 170 170 171 171 172 173 173 174 174 175 175 175 175 175 174 174 174 173 173 173 173 173 173 172 172 173 173 174 175 175 176 177 177 178 179 180 180 181 181 181 181 180 180 180 180 180 178 176 174 172 170 168 166 164 162 160 158 156 154 152 150 148 146 145 143 142 141 140 139 138
6191 138 137 136 136 135 133 133 132 132 131 130 130 129 129 128 128 127 127 126 125 125 126 126 126 126 126 125 125 125 125 125 125 125 124 124 124 124 124 123 123 123 123 124 124 124 124 123 123 122 121 121 121 121 121 121 121 120 120 120 120 120 120 120 119 119 119 119 119 119 118
6183 118 117 118 118 117 117 116 116 115 115 114 114 114 114 113 113 113 113 112 112 112 112 111 111 111 110 110 110 111 111 111 111 110 110 110 110 110 110 110 110 110 110 109 109 109 109 109 110 109 108 108 108 109 109 109 109 108 108 108 108 108 108 108 107 107 107 107 106 106 107
6176 107 107 107 107 107 107 107 106 105 105 104 104 104 103 103 103 103 103 102 102 103 102 101 101 101 101 101 100 100 101 101 101 100 100 100 100 99 99 99 99 99 99 99 99 100 100 99 99 99 99 98 97 97 97 97 97 97 97 97 97 96 96 96 96 96 96 96 97 97 97
6169 97 96 96 96 96 96 96 96 95 95 95 95 95 94 94 94 94 94 94 94 93 93 93 93 93 93 93 93 92 93 93 92 92 92 92 92 92 92 92 92 92 92 91 91 90 90 90 91 91 91 90 91 90 90 90 90 90 89 90 90 90 90 90 90 90 90 90 90 90 90 90
6161 90 89 89 89 89 89 89 89 89 89 89 89 88 88 88 88 89 89 89 88 87 87 87 86 87 87 87 87 86 86 86 86 86 86 86 86 86 86 86 86 86 86 86 86 86 86 86 86 86 86 85 85 85 85 85 85 85 85 85 85 85 85 85 85 85 85 84 84 84 84 84
6154 84 84 84 84 83 83 83 83 83 83 83 83 84 84 83 83 83 83 83 82 82 82 82 81 81 81 81 81 81 82 81 81 81 81 81 81 81 81 81 81 81 81 81 81 81 81 81 81 81 82 81 81 81 81 81 81 81 80 80 80 80 79 79 79 78 78 78 78 79 79 79
6146 79 79 80 79 79 79 79 79 79 79 79 79 78 78 78 78 78 77 77 77 77 77 78 78 78 78 77 77 77 77 77 77 76 76 76 76 76 76 76 76 76 76 77 77 77 77 77 76 77 76 76 76 77 77 77 77 77 77 76 76 76 76 77 77 77 77 77 77 77 77 77
6139 77 77 76 76 76 75 75 75 75 75 75 75 74 74 74 74 74 73 73 73 73 73 73 73 72 72 73 73 73 73 73 73 72 72 72 72 73 73 73 73 73 73 73 73 73 73 73 74 74 74 74 74 73 74 74 74 74 74 74 74 74 74 74 74 74 74 73 73 73 73 73
6132 73 73 73 73 73 72 72 72 72 72 73 73 73 73 72 72 72 72 72 72 72 72 71 72 72 72 72 72 71 71 71 71 71 71 71 71 72 71 71 71 71 71 71 71 71 71 71 71 71 71 71 71 71 70 70 70 70 71 71 71 71 71 71 71 71 71 71 71 71 71 71
6124 71 71 71 71 71 71 71 71 71 71 71 71 71 70 70 69 69 70 70 70 70 70 70 70 70 70 71 71 71 72 71 71 71 71 72 72 72 71 71 71 70 70 70 70 69 69 69 69 69 69 70 70 69 69 69 69 69 69 69 69 69 69 69 69 69 69 69 69 69 69 69
6117 69 69 69 69 69 69 69 69 69 69 69 69 69 69 69 69 69 69 69 69 69 69 69 68 68 68 68 68 68 68 68 68 68 68 68 68 68 68 68 67 67 67 67 67 67 67 67 66 67 67 68 67 67 67 67 67 67 67 67 66 66 66 67 67 67 67 67 66 66 66 66
6109 66 67 67 67 67 67 67 66 66 66 66 66 66 66 66 66 67 67 66 66 65 66 66 66 66 66 66 66 66 66 66 66 65 65 66 66 67 67 67 67 67 66 66 66 66 66 65 65 65 65 65 65 66 66 66 66 66 66 65 65 64 65 65 65 65 65 65 65 65 65 65
6102 65 65 66 66 65 65 65 65 65 66 66 66 66 66 66 66 66 66 66 66 66 66 66 66 65 65 65 65 65 65 65 65 65 65 66 65 65 65 65 65 65 65 65 65 65 65 65 65 65 65 65 65 65 64 64 64 64 64 64 64 64 63 63 63 64 64 64 64 64 64 64
6095 64 64 65 64 64 65 65 65 65 65 64 64 64 65 65 65 65 65 65 65 65 65 65 65 65 65 65 65 65 65 65 65 65 65 65 65 64 64 64 65 65 65 65 64 64 64 64 64 63 63 63 63 62 62 63 63 64 64 64 64 63 63 63 63 62 62 62 62 62 62 62
6087 62 62 62 63 63 63 63 63 63 63 63 63 63 63 63 63 63 63 63 63 63 64 64 64 64 63 63 63 63 63 62 62 62 62 62 62 62 62 62 61 61 62 62 62 62 62 62 62 62 61 61 61 61 61 62 61 61 61 61 61 62 62 62 61 61 61 61 61 62 61 61
6080 61 61 61 60 60 59 60 60 61 61 61 61 61 61 61 61 61 61 61 61 61 60 60 60 61 61 60 60 60 61 61 62 62 62 62 62 62 62 62 62 63 62 62 62 61 61 61 61 61 61 61 61 61 61 61 61 61 60 61 61 61 61 61 61 60 60 60 60 59 59 59
6072 59 60 60 60 60 60 59 59 59 59 59 59 59 59 59 60 60 61 60 60 60 60 60 60 60 60 60 60 60 60 60 60 61 62 62 60 60 59 60 60 60 60 60 60 60 60 59 59 59 60 60 60 60 60 60 60 60 60 60 60 59 59 59 59 58 58 58 58 58 58 59
6065 59 59 58 58 58 57 57 57 57 57 57 57 57 56 56 55 55 56 56 56 55 55 56 56 56 56 56 56 56 56 56 55 55 55 55 55 56 56 56 56 56 56 56 56 56 56 55 55 55 55 55 54 55 55 54 54 54 55 55 56 56 56 55 55 54 54 54 54 55 55 55
6057 55 55 55 55 54 54 54 54 54 54 54 54 54 54 54 54 54 53 53 53 53 53 53 52 52 52 51 51 51 51 51 52 52 51 51 51 51 51 51 50 51 50 50 50 50 51 51 51 51 51 52 52 52 52 52 52 52 53 53 54 54 53 53 53 53 53 54 54 54 53 54
6050 54 54 54 54 54 54 54 54 54 54 53 53 53 54 54 53 53 53 53 53 54 54 54 54 54 53 53 53 53 52 52 52 52 52 52 52 52 52 52 52 53 53 53 53 53 53 53 53 53 53 53 53 53 54 54 54 54 55 54 54 54 54 54 54 54 54 55 56 55 55 56
6043 56 56 56 55 55 55 55 55 56 56 56 57 57 56 56 56 56 56 57 57 57 56 56 56 56 56 57 56 56 56 56 55 55 55 55 55 55 56 56 56 57 57 57 57 57 57 57 57 57 57 57 57 57 57 57 57 57 57 57 58 58 57 57 57 57 58 58 58 58 58 58
6035 58 58 58 58 58 58 58 58 57 57 57 57 57 57 57 57 57 58 58 59 59 59 59 59 59 59 59 59 58 58 58 59 59 59 59 59 59 59 59 60 59 59 59 59 59 59 59 59 59 59 59 59 59 59 59 59 59 59 58 58 58 58 58 58 58 58 58 58 58 58 58
6028 58 58 58 59 58 58 58 58 58 57 57 57 57 56 56 56 56 56 56 56 57 57 58 58 58 58 58 58 58 58 59 58 58 58 58 58 58 57 58 58 58 58 58 58 58 58 58 58 58 58 58 58 57 57 57 57 57 58 58 57 57 57 57 57 57 57 56 56 56 56 56
6020 56 56 56 56 56 56 57 56 56 57 57 57 57 56 56 55 55 56 56 56 56 56 55 55 55 56 56 56 55 55 55 55 55 55 55 55 56 55 55 55 55 55 55 55 55 55 55 56 56 55 55 55 55 55 55 55 55 55 55 55 55 55 55 55 55 54 54 54 55 55 54
6013 54 54 54 54 54 54 53 54 54 54 54 54 54 55 55 55 55 54 54 54 54 54 55 55 55 55 55 55 55 55 55 55 55 55 55 55 55 56 56 56 56 56 56 57 57 57 57 57 57 57 57 57 57 57 57 57 57 57 57 57 57 56 56 56 57 56 56 55 55 56 56
6006 56 55 54 55 55 55 55 55 55 55 55 55 55 55 55 55 55 55 55 55 54 54 54 55 56 56 56 56 56 56 56 56 56 56 56 56 56 56 56 57 57 57 57 57 57 57 57 57 57 57 57 58 59 59 59 59 58 58 58 58 58 58 58 58 58 57 58 58 58 59 58
5998 58 58 58 58 57 57 57 57 57 57 58 58 58 57 57 56 56 56 56 55 55 56 56 56 55 55 55 54 55 55 55 55 55 55 55 56 56 56 56 56 56 56 57 57 56 56 55 55 55 56 56 57 57 57 57 57 57 57 58 58 57 57 57 57 57 57 57 57 57 58 58
5991 58 58 58 58 58 59 58 58 58 58 58 58 58 58 58 58 58 58 58 58 58 58 58 58 58 58 58 57 57 57 56 57 57 57 57 58 58 58 58 58 58 58 57 57 57 57 57 57 56 56 57 57 57 57 57 57 56 57 57 57 57 58 58 57 57 57 57 57 57 57 57
5983 57 57 57 57 57 56 56 56 56 56 57 57 57 56 56 55 55 55 55 56 56 56 55 55 55 55 56 56 56 56 55 55 55 55 55 55 55 55 55 55 55 55 56 56 56 56 56 56 56 56 56 56 56 56 56 57 57 57 57 57 57 57 57 57 57 57 57 57 57 57 57
5976 57 57 57 57 57 57 56 56 56 56 56 56 57 57 57 56 56 56 56 57 58 58 58 57 57 56 56 56 56 56 57 57 58 58 59 59 60 60 61 61 62 63 64 65 66 68 69 71 73 76 79 83 88 94 100 106 112 117 121 123 126 130 134 140 146 152 156 156 153 147 141
5968 141 136 132 130 128 126 123 117 110 104 97 92 87 84 80 78 76 74 72 70 69 67 66 65 65 65 64 63 63 62 62 62 62 63 62 62 61 61 61 62 62 62 62 62 62 62 63 63 64 64 65 66 68 69 71 72 75 77 80 83 87 92 98 105 112 118 122 126 129 132
5961 132 135 139 145 151 156 160 161 158 152 145 140 136 133 131 129 125 120 113 106 99 93 89 85 82 79 77 75 74 72 70 68 67 66 65 65 64 64 63 63 62 62 62 61 61 61 60 60 59 60 60 60 60 60 60 59 58 58 58 58 58 58 58 58 58 58 58 58 58 58
5954 58 58 57 57 56 56 56 56 55 55 55 55 55 55 55 54 55 56 56 56 56 56 57 57 57 57 56 56 56 55 55 56 56 56 56 56 56 56 56 56 56 55 55 55 55 54 55 55 55 55 55 55 55 55 56 55 55 55 55 55 55 55 55 54 54 53 53 53 53 53 53
5946 53 53 52 52 52 52 52 52 52 52 51 51 50 50 51 51 51 52 52 52 52 51 51 51 52 52 52 52 52 52 53 53 53 53 53 53 53 53 53 53 53 53 53 54 54 54 53 53 53 52 52 52 51 51 52 52 53 53 53 52 52 52 52 53 53 53 53 53 53 52 51
5939 51 51 51 52 52 52 52 52 52 52 52 52 52 52 52 52 52 52 53 53 53 53 54 55 55 54 54 55 55 55 54 54 54 54 54 53 54 54 55 55 55 55 56 56 56 57 58 58 58 59 59 59 59 60 60 61 61 62 62 61 61 61 61 61 61 60 60 59 60 60 59
5932 59 58 57 56 56 55 54 53 52 53 52 52 52 51 51 51 51 51 51 52 52 52 52 52 53 54 54 54 54 54 54 55 55 56 57 57 57 57 57 58 58 58 59 59 59 59 60 60 60 61 61 62 62 63 63 64 64 64 65 65 65 66 66 67 67 68 69 69 69 70 70
5924 70 70 71 72 72 73 73 72 72 71 72 73 73 73 74 74 75 75 76 77 78 78 80 82 84 86 88 90 92 94 97 100 102 105 107 110 114 118 122 127 132 137 142 148 155 163 171 180 190 200 211 223 235 248 261 274 288 302 315 328
5918 328 340 351 361 370 378 384 389 393 398 401 403 405 407 408 410 410 410 408 406 403 398 393 387 380 372 363 353 343 333 323 314 305 296 289 282 276 271 267 264 262 260 260 261 263 266 269 274 280 288 296 304 314 324 334 345 356 367
5912 367 377 386 394 401 406 411 414 416 418 418 418 418 417 415 414 412 410 407 403 398 392 386 378 369 360 350 339 327 315 303 291 278 266 256 245 234 225 216 208 201 194 188 182 177 171 166 162 160 157 154 152 149 147 144 141 139 138
5906 138 137 137 136 135 134 132 131 129 128 128 128 129 129 128 129 129 129 129 129 130 131 133 133 135 136 137 138 139 140 141 142 145 147 150 154 157 162 166 171 175 179 183 188 194 202 210 218 225 230 233 235 236 236 236 234 231 224 215 206 197 189 180 170 156 137 114
5899 114 90 69 51 38 27 16 5 -8 -22 -36 -47 -56 -63 -68 -72 -73 -73 -72 -69 -66 -61 -56 -51 -45 -39 -33 -26 -19 -13 -8 -1 6 14 23 32 39 45 50 54 58 62 68 74 80 87 94 101 108 115 122 130 139 147 154 161 169 178 189
5893 189 199 210 220 227 233 238 242 246 250 253 253 250 246 242 239 238 236 234 229 219 205 190 178 171 167 167 170 174 178 181 184 189 198 209 225 247 273 303 336 370 406 444 487 535 590 651 718 790
5888 790 867 954 1053 1168 1305 1468 1658 1881 2139 2436 2784 3195 3689 4286 5005 5863 6870 8021 9272 10502 11507 12148 12504
5885 12504 12804 13268 14019 15078 16356 17609 18439 18493 17757 16560 15310 14283 13591 13216 13035 12807 12262 11302 10058 8746
5883 8746 7524 6469 5594 4882 4302 3823 3415 3058 2739 2451 2197 1979 1797 1653 1540 1453 1384 1327 1277 1232 1193 1161 1138 1123 1115 1113 1114
5880 1114 1118 1124 1133 1147 1167 1196 1232 1275 1325 1382 1450 1532 1632 1754 1902 2079 2290 2538 2831 3178 3593 4095 4705 5444 6331 7378 8578
5877 8578 9887 11172 12206 12841 13173 13461 13935 14722 15840 17190 18502 19333 19322 18491 17209 15900 14840 14138 13769 13597
5875 13597 13368 12799 11794 10500 9141 7881 6792 5891 5157 4559 4063 3638 3264 2930 2629 2365 2136 1944 1789 1664 1562
5873 1562 1479 1409 1349 1294 1244 1198 1157 1122 1091 1063 1037 1012 987 959 930 900 870 840 809 778 746 717 690 665 639 612 581 545 508 471 438 412 390 371
5869 371 353 335 314 293 273 258 246 238 232 227 223 220 219 221 224 228 232 236 239 242 246 251 257 262 267 272 277 283 290 297 303 309 314 317 320 323 327 333 341 350 359 369 380 390 401 411 421 429 436 442 448 454 459 464 468 471
5863 471 474 477 476 469 458 443 426 408 387 367 348 330 313 295 274 249 220 187 156 129 108 91 78 66 53 38 24 11 1 -5 -8 -9 -10 -9 -6 -2 5 12 19 26 30 35 39 43
5859 43 49 55 61 66 71 76 81 84 87 89 91 92 93 96 99 102 106 111 116 122 128 134 140 144 147 151 153 152 150 146 142 139 136 135 136 137 140 144 147 147 144 138 132 126 122 118 116 114 113 112 109 106 103 100 98 97 97 96 96 96 96 96 95 96 96 96 97 97 98 99
5851 99 99 100 100 101 102 101 100 99 98 97 96 96 95 94 92 90 88 86 84 82 81 81 80 79 77 76 74 73 72 72 71 70 69 68 67 67 66 65 65 64 63 63 63 62 62 62 62 62 63 64 65 66 67 67 68 69 69 70 71 72 74 75 75 76 77 77 78 79 79 79
5844 79 80 80 81 82 82 82 82 81 81 81 80 80 80 80 80 81 81 80 80 80 80 80 80 80 79 78 78 77 76 76 75 74 74 73 73 72 72 71 71 70 70 70 70 71 71 71 72 72 73 73 74 74 75 76 77 77 78 78 79 81 82 83 85 86 87 90 93 96 101 106
5836 106 111 116 120 123 126 128 130 132 133 135 137 138 138 138 137 136 136 136 136 136 136 135 135 134 133 132 130 128 125 122 119 116 112 108 105 102 99 96 95 94 93 94 94 96 99 103 107 111 114 117 119 121 123 126 128 130 131 132 133 133 133 133 133 133 133 134 134 134 133
5829 133 132 131 130 130 128 127 124 121 118 115 112 109 105 101 98 95 92 89 87 86 85 83 82 81 80 78 77 76 76 76 76 76 76 76 76 76 76 76 76 76 77 77 78 79 81 83 85 86 88 89 92 95 97 101 105 110 115 121 128 136 145 155 166 179 193
5822 193 207 221 233 242 251 261 275 294 318 348 385 430 485 550 627 714 805 881 922 930 926 923 925 928 932 938 955 989 1036 1078 1083 1034 956 881 824 784 752 720 690 659
5818 659 625 587 549 518 494 473 451 422 387 352 320 294 272 255 240 228 217 207 200 194 190 187 186 186 186 187 190 195 201 209 218 230 244 261 280 303 329 356 379 396 404 407
5814 407 411 421 438 464 500 546 602 669 747 830 907 971 1019 1061 1103 1132 1125 1076 1007 938 882 846 832 838 861 900 947 984 980 921 829 735 651 582 527 485 452
5810 452 424 394 360 324 290 262 239 220 205 193 183 174 166 159 153 148 143 139 135 132 129 126 124 123 121 119 118 116 114 113 112 111 110 108 107 105 102 100 98 96 95 94 92 90 89 87 86 85 83 82 81 79 78 77 76 75 74 74
5804 74 74 74 73 73 72 72 72 72 72 72 72 72 73 73 74 75 75 76 76 77 77 78 78 79 79 80 80 81 82 83 84 86 87 89 91 94 96 98 100 102 106 110 114 120 126 132 137 142 145 148 150 152 157 162 167 171 172 169 164 157 150 145 141 139 136 133 128 122 115 107
5796 107 100 94 89 85 82 80 78 76 74 73 72 71 70 68 68 68 69 68 68 69 69 69 69 69 69 70 70 70 71 71 71 71 71 71 72 72 73 74 75 76 77 78 79 80 82 85 87 90 94 98 102 107 113 120 127 134 138 141 143 146 149 155 161 167 172 174 172 167 161
5789 161 154 149 145 142 141 138 134 128 121 114 108 102 98 94 91 88 86 85 84 82 81 80 80 79 79 79 79 79 79 79 79 80 80 80 81 81 81 81 81 81 80 79 78 77 77 77 77 76 76 75 75 74 74 73 73 73 73 73 73 73 73 73 72 72 72 71 71 70 70
5781 70 69 69 69 69 69 70 70 71 71 71 71 72 72 73 73 73 74 74 75 75 75 76 76 76 77 78 78 79 80 80 81 82 83 85 86 88 91 94 96 97 98 100 101 102 104 107 111 116 122 129 137 148 160 172 180 184 183 182 181 181 181 182 184 186 191 197 200
5774 200 197 189 179 171 165 161 157 153 150 147 143 139 135 132 130 129 128 125 121 118 115 112 110 109 108 107 106 105 105 106 106 107 108 109 110 111 113 114 116 117 119 122 124 126 129 132 135 137 139 141 142 142 143 146 149 154 159 166 175 185 197 208 218 226
5768 226 233 240 245 249 247 241 234 228 224 223 225 229 236 244 252 256 254 247 238 230 226 222 222 222 222 223 223 223 222 222 222 222 224 226 227 228 228 228 228 227 226 222 218 212 205 200 194 189 182 175 169 162 154 146 138 129 121 113 106 99 91 83 76 69 65 60 55 51 48
5760 48 44 41 39 37 37 38 40 44 48 54 59 64 69 74 79 84 88 90 92 92 92 90 90 89 89 88 87 84 81 76 70 66 61 55 50 45 41 37 32 26 22 19 16 14 12 12 12 12 14 18 23 30 39 49 60 73 86 100 113 128 144 160
5754 160 176 192 208 226 244 264 285 308 332 357 383 411 440 473 507 544 583 622 663 707 754 804 858 917 979 1046 1117 1195 1280 1378 1491 1622 1774
5750 1774 1947 2143 2364 2615 2902 3233 3617 4065 4588 5192 5874 6621 7408 8198 8930 9523 9952 10273 10568 10854 11105 11310 11487
5748 11487 11620 11660 11602 11520 11483 11494 11526 11577 11669 11780 11829 11764 11630 11508 11417 11317 11180 11018 10814 10505 10064 9547 9018 8487 7938 7389
5745 7389 6905 6538 6307 6214 6257 6436 6751 7196 7753 8393 9075 9736 10290 10684 10956 11192 11431 11648 11821 11966 12080 12109 12023 11884
5742 11884 11778 11723 11690 11668 11684 11734 11747 11654 11472 11282 11121 10960 10766 10540 10276 9913 9403 8780 8113 7426 6701 5942 5202 4535 3963
5740 3963 3479 3071 2727 2439 2201 2005 1844 1710 1598 1502 1420 1349 1288 1235 1189 1149 1114 1083 1055 1031 1008 986 963 942 923 905 887 870 854 839
5737 839 823 808 795 784 774 764 754 746 737 727 718 709 701 693 685 678 669 660 648 635 621 605 589 572 555 538 522 507 492 476 462 447 433 420 408 396 384 371 359 346
5732 346 334 322 311 302 294 287 281 275 271 266 261 257 256 256 256 255 255 255 257 260 262 264 266 268 268 268 268 267 265 260 254 249 243 237 231 223 215 206 196 187 177 168 158 148 138 127 116 105 94 85 76 67 59 52 45 38 31
5726 31 25 19 16 13 10 8 7 7 8 10 13 16 18 21 24 27 31 34 37 41 44 48 52 55 58 60 62 64 66 68 69 71 72 73 74 74 74 75 75 76 77 78 79 80 80 81 82 81 81 81 82 82 82 82 82 81 81 80 79 79 79 78 77 76 75 75 74 74 75 75
5719 75 75 76 77 77 77 78 79 79 79 79 80 80 81 81 82 82 83 83 84 85 85 85 86 87 88 89 89 89 90 90 91 91 91 92 92 92 91 91 91 90 90 89 89 88 87 87 87 86 86 86 86 86 86 86 85 85 85 84 84 83 82 82 81 81 80 80 80 80 79 79
5712 79 78 78 78 79 78 78 78 78 77 77 77 77 77 77 77 77 77 77 76 76 76 76 76 76 75 76 76 76 77 77 77 77 78 78 78 77 76 76 76 76 75 75 75 74 74 74 73 73 73 73 73 72 72 72 72 72 72 71 70 70 69 68 68 68 68 68 67 67 66 66
5704 66 65 64 65 64 64 64 65 65 65 65 65 65 65 65 65 65 65 65 66 66 66 66 67 67 67 68 69 69 69 70 70 71 71 72 74 75 77 78 79 81 83 85 86 87 89 90 92 95 99 104 110 117 125 135 147 158 168 174 176 176 176 176 177 178 179 181
5697 181 185 191 197 200 196 187 177 168 161 156 151 146 142 138 133 128 124 120 117 113 109 105 100 96 93 89 86 84 83 82 80 79 78 78 78 78 77 77 78 78 79 80 82 83 85 87 90 93 97 102 106 110 112 113 115 117 119 122 126 131 138 146 156 167 177
5690 177 186 194 201 207 212 213 207 199 190 182 176 172 172 173 177 182 187 189 184 174 161 148 138 129 123 118 114 111 106 101 96 92 89 86 83 81 80 78 76 75 74 74 74 74 73 73 73 73 73 74 74 74 73 73 72 72 72 72 73 73 73 74 74 74 75
5683 75 76 76 76 76 76 76 76 75 74 73 72 72 72 72 72 73 74 74 74 73 72 71 70 69 68 68 67 67 67 67 67 67 67 67 67 67 67 67 67 68 69 70 70 72 73 75 77 80 83 86 89 93 98 100 99 96 93 89 87 85 85 85 85 85 87 88 91 94 97 100
5676 100 102 101 97 92 87 83 81 78 77 76 74 73 71 70 69 69 68 68 67 67 68 67 67 67 67 67 67 67 67 66 66 67 67 67 67 68 69 69 70 71 72 74 75 77 78 81 83 86 90 95 101 106 108 108 105 103 102 103 106 109 113 118 121 121 120 119 119 119 120
5669 120 121 118 114 109 106 105 105 106 108 110 112 110 104 98 93 89 86 84 81 78 77 76 75 73 72 71 70 70 70 69 69 69 69 69 69 69 69 68 69 69 70 70 70 70 70 70 71 71 71 72 73 73 74 75 77 79 82 85 89 94 99 103 105 104 100 96 92 90 88
5661 88 87 86 87 88 89 92 95 98 102 105 107 106 102 97 93 90 89 88 87 87 87 88 89 91 92 94 97 99 103 107 110 114 118 121 123 125 126 128 129 129 130 130 130 130 129 129 129 129 130 130 130 130 130 129 128 128 126 124 123 120 118 115 112 109 107 104 101 99 98 97
5654 97 97 98 99 102 104 107 111 114 118 121 123 124 125 126 128 129 130 131 131 131 131 131 131 132 132 132 131 131 130 130 130 129 128 127 125 124 121 118 115 111 107 103 99 95 91 88 86 84 83 82 81 80 79 78 78 77 77 77 76 76 76 75 75 75 75 75 75 74 73 73
5646 73 72 72 72 71 71 71 72 72 73 74 74 75 75 76 77 77 78 79 80 82 84 87 89 93 97 101 107 113 120 128 138 151 165 183 205 230 260 292 322 343 341 319 291 266 248 236 229 226 227 231 239 251 267
5641 267 288 312 337 352 345 316 280 246 219 199 183 171 160 151 142 134 126 120 115 110 107 105 104 102 101 100 100 100 100 99 98 98 99 101 103 105 107 109 112 116 121 127 134 143 152 163 177 193 212 236 266
5635 266 300 339 379 412 423 411 390 376 371 377 393 417 450 488 526 551 557 552 548 551 555 547 521 488 461 445 441 446 456 470 484 497 495 468 425 383 350 327 311 301
5631 301 294 287 280 274 269 263 257 250 242 233 225 218 214 212 212 214 217 219 220 219 215 209 204 199 195 193 191 190 187 184 183 183 185 189 195 204 217 235 257 284 315 351 386 405 397 367 333 306 288 276 269 267 268 273 283
5625 283 297 317 341 370 399 415 406 376 342 314 295 283 275 269 262 253 246 240 235 234 235 236 235 232 228 221 214 207 202 200 199 199 199 197 194 192 191 188 184 181 177 173 170 167 161 154 146 137 130 123 117 111 107 102 99 96 92 89
5619 89 87 85 83 81 79 78 76 75 74 73 73 72 71 71 70 69 69 68 67 66 66 66 65 65 65 64 65 65 65 65 65 65 66 66 66 65 66 66 66 66 66 66 66 66 66 66 67 67 66 66 66 66 65 65 65 65 65 65 65 64 65 66 66 66 66 65 65 65 65 64
5612 64 63 63 63 62 62 62 61 61 61 61 61 61 61 62 62 62 61 62 62 62 62 63 63 63 63 63 63 64 64 65 65 66 66 66 66 67 67 69 70 71 73 75 76 78 79 79 78 76 74 73 72 72 71 71 71 72 73 74 75 77 78 79 78 77 75 73 71 69 69 69
5604 69 68 67 66 65 65 65 65 65 65 65 65 65 65 66 66 67 67 68 69 69 70 70 70 71 71 71 72 72 73 74 75 76 77 79 81 82 84 87 90 92 95 97 98 97 96 94 94 93 94 95 97 99 100 102 103 103 102 101 100 98 96 94 91 89 88 87 87 88 89 90
5597 90 91 91 90 87 85 83 82 81 81 80 79 79 78 78 78 77 77 77 77 77 78 78 78 79 79 79 80 80 81 81 81 81 81 81 82 83 84 84 85 86 87 88 90 91 93 96 98 101 103 105 107 108 108 107 105 103 102 101 100 100 100 100 100 100 100 101 102 103 105 106
5590 106 104 102 99 98 96 95 94 93 92 91 90 90 90 90 89 89 88 88 87 87 86 85 84 84 83 83 83 83 83 82 82 82 82 81 80 80 80 81 81 81 82 82 83 84 84 84 85 85 85 86 86 87 87 88 89 91 93 94 95 95 95 95 95 96 97 98 98 99 100
5582 100 101 102 103 103 102 101 100 99 98 98 98 98 98 97 96 96 95 94 94 92 91 91 91 91 90 90 89 88 87 88 88 88 88 89 88 87 87 86 85 84 83 81 81 81 81 81 82 83 84 87 89 91 93 95 97 101 104 107 110 113 116 118 121 122 123 124 125 127 128
5575 128 129 131 133 135 138 140 141 143 145 146 148 149 150 151 153 153 153 153 153 155 158 162 165 168 171 175 179 183 185 190 196 202 209 217 225 233 242 251 262 275 290 305 323 341 361 381 400 417 435 454 480 513 556 606
5569 606 666 736 817 910 1009 1099 1157 1179 1182 1185 1195 1207 1217 1229 1246 1277 1322 1368 1388 1356 1278 1186 1105 1040 983 928 876 825 773 715 655 594 536 482 432 384
5565 384 335 286 242 204 171 140 112 89 70 56 45 35 25 19 17 20 28 40 54 69 86 105 126 150 174 200 230 263 303 346 391 429 458 479 499 524 555
5562 555 593 640 698 770 852 943 1033 1114 1183 1240 1295 1349 1393 1399 1363 1310 1261 1220 1189 1173 1171 1186 1214 1247 1270 1256 1190 1085 975 882 811 759 724 701 685
5558 685 666 639 603 564 530 507 501 511 537 576 623 675 729 781 832 883 942 1012 1097 1199 1318 1454 1607 1781 1979 2205 2466 2765 3106 3487
5555 3487 3888 4257 4535 4716 4858 5036 5302 5679 6178 6810 7593 8555 9727 11150 12862 14899 17264 19871 22379 24208
5553 24208 25035 25113 24945 24885 25025 25297 25655 26169 26953 27968 28759 28610 27268 25227 23176 21529 20393 19657 19097 18528 17908
5550 17908 17253 16517 15661 14761 13939 13224 12508 11652 10637 9560 8533 7623 6849 6206 5675 5234 4864 4555 4301 4095 3937 3824
5548 3824 3756 3734 3755 3819 3924 4076 4276 4532 4856 5258 5750 6339 7024 7791 8582 9270 9708 9869 9876 9903 10078 10472 11121 12039 13236
5545 13236 14726 16530 18643 20976 23322 25411 27076 28403 29616 30653 30977 30126 28305 26172 24288 22942 22227 22132
5543 22132 22595 23533 24802 26012 26451 25602 23686 21367 19165 17276 15704 14406 13326 12369 11405 10358 9260 8195 7232
5541 7232 6399 5704 5134 4668 4277 3939 3643 3384 3157 2960 2789 2643 2516 2404 2302 2211 2129 2056 1991 1932 1874 1818 1764 1712 1661 1612 1562
5539 1562 1510 1454 1393 1330 1266 1206 1151 1102 1059 1018 978 937 896 854 810 763 714 667 625 592 568 551 533 511 488 469 456 447 438 428 417 407 399 396 394 393 393 397
5534 397 403 410 416 421 428 438 448 459 467 474 479 485 492 499 506 511 515 520 527 539 553 569 584 597 605 609 609 605 600 592 583 573 565 559 554 549 543 535 524 508 486 460 428 392 352 309 266 228 196
5529 196 174 159 147 132 112 90 68 43 15 -13 -37 -54 -62 -63 -61 -62 -65 -67 -64 -59 -53 -48 -45 -42 -36 -25 -13 -3 6 14 22 29 34 37 40 43 47 53 58 62 65 69 73 75 77 79 80 82 83 84 85 85 85 84
5524 84 84 82 81 80 80 81 81 82 84 87 89 90 91 91 91 90 90 90 88 87 86 85 84 85 86 87 90 93 96 98 100 102 103 104 104 105 106 108 110 112 114 116 117 117 118 118 119 120 120 120 120 120 120 120 120 119 118 117 116 114 112 111 110 109 108 107 105 104 102 101
5516 101 100 98 96 94 92 91 90 90 90 91 91 92 93 94 96 99 102 106 110 113 116 118 119 119 118 116 114 112 111 110 111 112 113 115 118 121 124 128 132 135 136 135 133 130 126 122 119 116 113 111 110 108 107 106 105 105 105 105 104 103 103 102 101 100 99 98 97 96 96
5509 96 95 94 93 93 93 93 93 93 93 93 94 94 95 96 99 101 104 108 112 117 121 124 126 127 127 128 129 130 132 134 136 137 138 138 138 137 136 136 135 136 135 133 131 129 127 124 124 123 122 121 119 116 113 108 103 99 95 92 89 87 85 84 83 82 81 80 79 79 79 79
5501 79 78 78 78 78 78 78 78 78 78 78 78 78 78 78 79 80 81 81 83 84 86 87 90 92 95 98 102 106 109 112 114 114 114 113 111 109 107 105 103 101 100 99 100 100 101 103 106 109 110 110 108 105 101 97 93 89 86 84 82 80 78 77 76 75 74 74 74 74 73 73
5494 73 73 74 74 74 74 74 74 74 73 73 73 73 73 73 73 73 73 73 73 74 74 74 73 73 73 73 74 74 74 73 73 73 73 74 74 74 73 72 72 73 73 73 73 74 74 74 74 74 74 74 74 74 74 75 75 75 75 76 76 76 76 76 76 76 76 76 76 76 76 76
5487 76 76 77 77 77 77 78 78 78 78 78 78 78 78 78 78 78 78 78 78 78 78 78 79 79 78 78 78 78 78 78 78 77 77 77 76 76 76 76 77 77 77 77 77 77 77 77 76 76 76 76 76 75 75 75 75 75 76 76 77 77 77 77 76 76 76 77 77 77 77 77
5479 77 77 77 77 77 77 78 78 78 78 78 78 79 79 79 79 80 80 80 80 80 80 80 80 81 81 81 81 81 81 81 81 82 82 82 83 83 84 84 85 85 85 86 87 88 89 90 91 91 91 91 93 94 96 97 98 100 102 105 108 113 118 124 131 138 143 148 151 153 155 158
5472 158 163 170 177 184 190 195 198 200 201 204 207 212 218 220 218 211 201 190 180 173 168 165 164 164 166 166 166 164 161 159 156 152 147 141 135 130 125 121 119 117 115 113 111 109 107 105 105 104 105 105 106 107 107 108 109 110 111 114 118 121 126 132 138 145 152 159
5465 159 163 166 167 168 171 175 180 185 188 189 191 192 194 196 198 198 198 198 199 201 203 203 204 206 208 211 213 212 207 201 196 192 190 189 187 183 179 174 169 163 155 146 137 130 123 117 112 107 104 101 99 96 95 94 93 92 91 91 91 90 90 90 90 91 92 92 93 93 94
5457 94 94 94 95 95 96 96 96 96 97 98 99 100 102 102 103 104 104 104 104 104 103 103 102 102 101 102 102 102 103 104 104 105 106 105 105 104 104 104 103 103 102 102 102 102 101 102 103 103 104 105 106 107 108 110 112 114 116 118 119 122 125 128 131 135 140 143 146 149 151 153
5450 153 155 157 159 160 161 161 161 160 159 156 153 147 141 134 129 125 122 120 118 116 114 111 107 102 97 90 83 76 69 62 55 49 43 41 40 40 41 42 42 42 42 41 40 40 40 41 43 46 50 54 60 65 71 77 82 87 92 97 102 108 114 121 127 135 142 148 155 161 167
5443 167 173 179 185 190 193 196 199 201 202 202 200 198 194 190 186 184 182 181 180 178 176 171 166 161 155 150 146 142 140 138 137 137 138 139 142 145 148 150 150 150 150 151 154 159 166 176 188 204 222 242 264 289 315 342 373 407 445
5437 445 490 541 599 667 746 839 948 1076 1227 1404 1612 1857 2146 2488 2895 3378 3947 4605 5341 6114 6837 7392 7684 7687 7423 6953
5434 6953 6378 5819 5364 5046 4865 4805 4859 5023 5295 5677 6159 6704 7228 7611 7751 7610 7203 6580 5834 5080 4405 3839 3375 2991
5431 2991 2665 2383 2134 1915 1725 1565 1432 1326 1242 1178 1130 1096 1073 1058 1050 1049 1055 1068 1091 1125 1171 1230 1302 1390 1494 1617 1762 1932 2131
5428 2131 2366 2643 2970 3359 3823 4376 5032 5798 6670 7615 8556 9377 9979 10332 10465 10443 10373 10388 10577 10940 11395 11814 12099 12223
5426 12223 12210 12117 12035 12044 12149 12263 12277 12128 11814 11376 10898 10496 10257 10186 10198 10157 9943 9506 8851 8021 7104 6208 5415 4749 4201 3746
5423 3746 3360 3026 2734 2476 2250 2055 1890 1753 1643 1555 1488 1436 1398 1370 1348 1331 1318 1310 1308 1313 1326 1350 1385 1431 1492 1568 1664 1780 1922 2093
5420 2093 2298 2545 2844 3207 3645 4170 4787 5488 6239 6959 7528 7842 7864 7615 7146 6555 5966 5474 5120 4904 4815 4841 4979 5228
5417 5228 5587 6049 6580 7107 7510 7680 7573 7198 6600 5863 5105 4418 3839 3363 2970 2636 2347 2092 1865 1666 1494 1348 1228
5415 1228 1129 1049 984 931 887 849 815 784 755 728 704 683 666 652 641 632 624 616 606 594 580 563 545 526 505 486 467 448 430 411 391 372 352 334 316 300
5411 300 283 267 251 235 219 204 190 179 170 163 156 148 139 130 121 112 105 101 98 97 97 97 98 100 102 105 109 113 117 121 125 129 133 138 142 147 151 154 157 160 163 168 173 178 183 188 192 196 199 201 202 201 199 197 194 191 189 188 188 187 187
5405 187 186 183 179 172 164 155 145 137 129 123 117 111 106 101 97 94 91 88 84 79 73 67 59 52 46 41 38 37 35 34 34 35 36 38 39 41 42 43 45 48 51 54 57 60 62 64 66 68 69 70 71 71 72 73 74 75 74 74 74 74 74 74 73 72 71 70 69 69
5397 69 68 68 68 68 68 69 69 69 70 70 70 70 70 70 70 70 69 68 67 67 68 68 69 69 71 72 74 75 76 76 76 77 78 79 79 79 79 79 80 81 81 81 82 82 83 83 83 83 83 83 82 82 82 81 81 81 81 81 81 80 79 78 77 76 76 75 74 73 72 72
5390 72 71 70 69 69 69 68 67 67 67 67 67 67 67 67 67 67 67 67 67 67 66 66 66 66 66 66 66 66 66 66 66 67 68 68 69 70 70 70 70 70 70 70 70 70 69 69 69 69 70 70 70 71 71 72 72 72 71 71 71 71 71 71 71 70 70 69 69 69 69 70
5383 70 70 70 70 70 70 70 70 70 71 71 72 73 72 72 73 73 74 75 77 78 79 81 83 85 87 89 91 92 92 92 91 92 93 95 98 101 105 107 108 107 104 100 97 94 93 93 93 93 93 93 92 90 87 84 82 79 77 76 75 75 75 75 75 74 74 73 73 73 73 73
5375 73 73 74 74 75 75 75 75 75 76 76 77 78 79 80 81 84 86 88 91 94 97 101 105 110 115 119 122 124 126 129 131 132 136 140 144 150 156 162 165 163 157 151 145 140 136 134 133 132 131 129 126 122 118 113 108 103 99 96 93 90 89 87 85 84 82 81 80 79 78 77
5368 77 77 76 76 76 76 76 76 77 76 76 76 76 77 78 78 79 79 80 82 83 85 88 90 93 96 99 101 103 103 103 104 104 106 108 111 114 118 121 123 123 120 116 111 108 106 105 105 105 106 105 104 101 98 95 92 89 87 86 84 83 81 80 79 78 77 76 76 76 76 75
5360 75 74 73 73 72 72 72 72 72 72 72 72 72 71 70 70 70 70 70 70 70 70 70 70 70 70 71 71 70 70 70 70 71 71 72 72 71 71 70 70 70 70 71 71 71 71 70 71 71 71 71 71 70 71 71 71 71 71 71 71 72 72 72 72 72 72 73 74 75 76 77
5353 77 79 80 82 84 87 90 93 97 101 103 105 107 107 106 103 101 99 98 96 96 95 96 97 99 100 102 105 108 109 110 109 107 104 101 98 95 92 90 88 86 85 84 83 82 81 81 81 81 81 80 80 79 79 80 79 79 79 79 79 79 79 80 80 81 82 82 83 84 85 87
5345 87 88 90 93 96 100 105 109 114 118 122 125 128 129 130 130 130 132 134 136 138 139 140 140 140 140 140 141 142 142 141 140 138 135 133 132 132 131 130 129 127 123 120 115 111 107 104 102 100 98 97 95 94 92 91 89 88 88 87 87 86 86 86 86 86 86 85 86 86 86 86
5338 86 87 87 87 88 89 90 91 92 93 95 97 99 101 103 107 111 114 118 121 123 123 122 119 116 114 112 110 109 108 108 109 110 113 116 119 122 124 125 124 123 120 118 115 113 111 110 110 111 112 114 114 113 111 110 109 110 110 112 113 116 120 123 125 124 121 118 116 115 114 114
5331 114 115 116 118 120 121 122 122 121 122 123 124 126 129 132 136 139 141 143 145 147 146 144 142 141 140 141 143 146 147 149 152 156 158 158 154 148 142 138 136 135 136 137 138 141 144 147 148 148 146 145 145 146 148 150 153 155 158 161 166 172 178 183 186 185 181 176 172 170 169
5323 169 169 169 170 171 171 171 173 176 179 183 186 189 193 199 205 209 212 215 219 223 226 227 226 226 228 232 240 249 258 263 265 267 268 267 262 253 241 231 224 220 217 216 216 215 213 210 209 209 208 206 202 199 195 192 191 191 192 193 196 200 206 214 221 224 224 221 219
5316 219 218 217 215 212 211 210 210 210 210 207 203 201 200 200 197 193 188 182 176 170 165 162 161 161 163 165 167 170 173 177 181 184 183 178 172 169 168 169 169 170 171 173 177 180 184 187 187 185 184 185 186 187 187 188 189 190 192 195 201 207 214 220 225 231 237 243 248 253 258
5309 258 263 267 271 274 278 282 287 290 291 288 280 271 263 256 250 243 233 221 209 201 197 199 205 214 223 231 234 230 224 220 222 229 240 257 278 303 331 361 384 393 388 380 378 383 396 415 436 457 475 494 514 534
5303 534 552 571 597 633 679 737 806 884 973 1074 1194 1338 1513 1727 1985 2294 2655 3074 3539 3997 4312 4361 4226 4096 4077 4195 4446
5301 4446 4816 5295 5876 6523 7110 7336 6975 6240 5516 4973 4630 4451 4393 4425 4523 4665 4775 4690 4307 3765 3263 2867 2571 2350
5298 2350 2190 2077 1996 1938 1887 1827 1748 1654 1566 1499 1461 1448 1454 1471 1488 1505 1524 1555 1602 1668 1754 1857 1972 2103 2261 2459 2707 3013 3385 3825
5295 3825 4332 4900 5494 6007 6288 6324 6300 6387 6652 7109 7754 8589 9610 10780 11961 12951 13751 14590 15580 16575 17303 17469 16977
5292 16977 15995 14761 13549 12578 11839 11141 10314 9415 8621 8013 7586 7318 7191 7166 7121 6832 6211 5457 4785 4250 3839 3513 3234
5290 3234 2977 2737 2523 2339 2188 2071 1986 1930 1893 1870 1850 1830 1802 1773 1756 1759 1790 1847 1930 2037 2165 2315 2492 2708 2971 3294 3689 4167
5287 4167 4743 5420 6203 7059 7860 8325 8282 7965 7717 7688 7901 8343 8990 9817 10805 11875 12772 12970 12176 10836 9568 8611 7974
5285 7974 7599 7421 7392 7473 7615 7688 7442 6737 5788 4897 4174 3616 3182 2837 2551 2305 2088 1891 1714 1552 1408 1287 1190 1116 1059
5282 1059 1017 984 958 937 917 894 866 837 811 790 774 762 755 749 744 740 738 734 725 715 703 690 678 667 656 648 641 636 634 635 639 650 664 681 696 709 716 715 709 704 706 713 721 725 722
5277 722 715 708 704 700 689 669 643 619 601 586 571 548 516 481 445 413 387 365 349 335 323 313 305 299 297 298 301 304 310 316 320 322 323 326 329 336 344 352 361 371 383 396 410 424 435
5272 435 441 440 433 422 410 397 386 378 372 369 364 356 343 327 309 289 268 247 227 208 193 183 173 161 149 140 133 126 118 109 102 99 99 103 106 107 108 110 115 120 125 128 132 136 142 148 153 159 164 170 175 180
5267 180 185 189 194 200 206 214 220 224 226 229 234 242 251 261 271 282 296 313 331 346 357 365 374 383 392 399 405 409 414 419 425 430 432 431 428 426 422 413 397 375 352 328 303 278 251 222 193 170 153 142
5262 142 130 117 101 84 69 55 43 33 24 15 7 0 -1 4 12 21 31 40 49 57 65 74 84 94 103 111 122 135 149 163 176 189 202 216 230 246 263 281 300 317 333 348
5257 348 362 377 394 413 432 454 477 501 525 547 567 585 600 610 617 619 616 604 587 568 550 531 514 502 494 490 491 493 489 470 437 398 362 337 325 327 337 349 363
5253 363 380 400 418 430 438 449 465 488 519 560 610 663 718 777 843 914 988 1066 1152 1248 1355 1473 1608 1767 1956 2180 2446 2761 3130 3557
5250 3557 4046 4596 5185 5737 6155 6442 6737 7169 7791 8623 9672 10948 12457 14214 16205 18289 20109 21273 21850 22248
5248 22248 22502 22146 20894 19183 17669 16593 15843 15117 14178 13124 12206 11534 11106 10889 10797 10653 10196 9314 8207 7154 6276
5245 6276 5571 5005 4544 4164 3841 3558 3306 3087 2904 2761 2660 2598 2567 2561 2572 2596 2632 2687 2763 2858 2973 3112 3284 3497 3759 4079
5243 4079 4467 4932 5484 6132 6885 7760 8774 9922 11148 12359 13550 14839 16271 17705 18955 20063 21287 22744 24230
5241 24230 25472 26548 27756 29098 30333 31273 31822 32138 32503 32767 32366 31019 29072 26926 24563 22016 19661 17779 16384
5239 16384 15390 14681 14109 13466 12622 11665 10772 9981 9183 8305 7426 6653 6015 5490 5048 4669 4344 4070 3843 3658 3508 3390 3298
5236 3298 3221 3151 3090 3045 3021 3021 3048 3102 3183 3294 3440 3625 3855 4140 4488 4904 5391 5955 6579 7184 7601 7686 7520 7343 7312 7466 7801
5233 7801 8309 8992 9850 10835 11793 12540 13131 13838 14769 15686 16064 15621 14772 14070 13622 13175 12359 11138 9863 8800 7987 7384
5231 7384 6947 6640 6406 6162 5809 5328 4813 4345 3959 3661 3440 3264 3103 2937 2769 2605 2449 2300 2167 2059 1975 1906 1841 1776
5228 1776 1707 1638 1576 1521 1471 1423 1376 1333 1295 1261 1228 1195 1163 1131 1100 1066 1028 988 948 909 870 830 791 753 716 678 641 605 569 533 497 460 423 391
5225 391 363 342 329 328 337 348 360 369 371 367 364 366 375 391 415 448 487 529 569 605 641 683 728 765 781 773 757 738 711 672 628 590 559 535 516 502 491 480 468
5221 468 452 436 423 412 404 398 394 392 390 387 382 375 367 358 350 343 338 333 325 315 304 294 285 275 266 255 240 221 199 179 163 151 142 133 125 116 111 109 110 110 105 96 87 82 82 86 92 96 100 105 109 113 114 114
5215 114 114 113 114 115 115 115 115 115 116 116 116 115 116 116 116 115 114 113 113 113 112 112 112 113 114 115 116 117 118 121 123 125 126 125 123 121 118 116 116 117 118 120 123 127 132 138 146 154 162 169 174 178 181 182 182 180 176 171 165 159 153 149 147 145 144 143 143 143 144
5208 144 145 147 149 153 157 161 165 169 171 173 174 175 177 181 188 195 205 217 230 242 250 254 254 251 244 235 226 218 210 202 194 186 179 174 170 168 167 166 164 159 153 146 140 134 129 125 122 120 120 120 120 122 123 124 124 122 120 118 117 117 117 117 117 118 118
5201 118 119 119 119 119 119 121 123 125 128 132 137 143 149 156 164 171 181 191 201 210 220 230 241 253 265 276 287 296 302 304 304 305 306 308 306 299 287 271 254 237 222 209 198 189 181 173 165 158 151 144 137 131
5195 131 125 120 116 112 110 108 106 104 103 102 101 100 99 99 98 98 98 98 98 97 97 97 97 97 97 98 99 100 101 103 105 108 111 116 120 124 125 125 126 127 129 132 136 142 148 156 162 168 174 181 188 193 194 191 186 180 171 161 151 142 135 130 125 122 119 117 114
5188 114 110 106 103 100 98 97 96 95 94 94 94 93 94 94 94 95 96 97 98 100 102 104 107 110 115 120 127 135 144 152 155 149 139 128 119 112 107 103 100 97 94 92 90 88 86 85 83 82 82 81 81 81 80 80 80 80 80 80 79 79 80 80 81 81 81 82 82
5181 82 82 82 82 82 82 83 83 84 85 85 85 85 86 87 87 87 88 89 89 90 90 90 91 91 92 91 91 92 92 94 96 99 102 106 109 113 115 115 113 110 108 106 105 106 107 109 112 114 114 113 109 104 100 97 94 91 90 88 88 87 86 86 86 85 85 85 86 86 87 87
5174 87 88 88 88 89 89 89 90 91 92 94 95 96 97 98 100 102 105 107 110 114 118 123 128 132 133 132 131 130 130 131 133 137 143 150 155 158 155 148 140 134 129 127 126 127 129 131 133 133 130 127 124 122 122 122 123 124 125 127 130 133 137 143 149 157 166 175 185 195
5166 195 202 209 216 225 237 253 272 295 321 347 370 388 397 402 407 418 438 470 511 564 629 702 775 834 867 873 854 817 771 725 686 657 631 601 568 537 510 488 471
5162 471 458 448 434 411 380 346 316 291 270 253 240 229 221 214 209 205 202 200 200 201 203 207 212 219 227 238 251 265 281 296 308 316 320 326 336 352 372 398 428 463 497 530 562
5158 562 592 620 648 683 724 770 817 869 929 998 1069 1131 1179 1215 1232 1229 1217 1210 1217 1230 1236 1217 1168 1093 1001 906 821 753 701 661 626 590 551 511 473 438 403
5154 403 368 337 310 289 271 256 243 234 226 220 216 212 210 209 210 212 216 220 225 230 233 234 232 232 234 237 244 252 263 273 282 292 304 319 339 362 384 400 409 413 417 426 439 455 473 494 519 546
5149 546 568 589 615 648 682 706 711 694 661 614 556 496 445 403 372 346 326 310 295 279 259 237 216 198 183 171 162 154 149 143 138 134 131 128 126 124 123 121 119 118 117 116 116 116
5144 116 116 115 114 113 113 112 111 110 110 110 109 109 108 106 105 104 103 103 101 100 98 97 95 94 92 91 89 88 86 83 81 79 78 76 76 75 74 73 73 73 74 74 74 73 72 72 72 73 74 74 75 76 76 77 77 77 78 78 79 79 80 81 82 83 84 85 86 87 88
5137 88 88 89 90 91 93 95 96 98 100 103 105 108 111 114 118 123 129 135 142 151 161 173 187 206 228 255 284 316 348 371 377 365 344 325 312 307 310 318 333 351 369 380 375 350 314 278 247 223
5132 223 204 190 177 166 156 148 140 134 129 125 121 119 119 118 118 118 119 120 121 122 123 125 127 131 135 141 147 155 164 176 189 204 223 245 271 301 336 374 412 442 455 454 449 449 460 482 515 557
5127 557 605 652 681 680 649 599 547 504 475 458 451 452 457 459 447 418 377 334 297 266 241 223 207 194 183 173 163 154 147 140 135 131 128 126 124 122 121 120 120 121 122 124 126 128 131 135 141
5122 141 147 154 162 172 185 200 218 239 264 293 325 357 382 388 373 351 331 318 313 314 322 335 352 369 379 373 347 310 274 244 219 199 183 170 160 150 140 131 122 115
5117 115 108 104 100 96 93 91 89 88 87 86 86 85 85 84 84 83 82 81 80 80 80 79 78 77 77 77 77 77 77 77 77 76 76 77 78 78 78 78 78 77 77 77 77 76 76 76 77 78 78 78 78 77 77 76 75 75 75 75 74 73 72 71 70 69 69 68 68 69 69
5110 69 68 68 68 68 68 69 70 71 71 71 71 70 70 69 70 70 69 68 67 67 66 65 65 66 66 66 67 68 69 70 71 72 73 74 75 75 76 77 77 78 79 79 79 78 78 78 76 75 74 72 71 70 70 70 70 71 72 72 72 72 73 73 73 73 73 72 72 72 72 72
5103 72 73 74 75 76 76 77 77 78 79 80 80 81 81 81 82 82 83 83 83 83 83 84 85 86 88 89 90 93 95 97 99 100 102 104 108 112 116 119 124 128 132 133 132 131 132 135 140 144 143 138 132 128 125 121 113 100 81 60 43 32 25 23 21 19 16
5096 16 12 6 2 -2 -6 -11 -16 -20 -21 -19 -15 -10 -3 3 8 12 16 21 25 27 27 26 26 27 30 35 39 43 46 48 49 50 50 50 50 50 52 54 54 54 54 55 54 55 57 58 60 62 63 65 66 68 69 69 70 71 72 74 75 76 78 79 81 85 88 91 93 95 98 100
5088 100 102 105 107 109 112 116 122 129 136 144 149 152 154 154 154 157 163 169 176 183 191 199 208 218 229 241 254 269 286 305 326 349 374 403 436 473 517 566 626 696 784 891 1021 1181 1373
5084 1373 1600 1864 2170 2529 2960 3492 4153 4979 5996 7238 8748 10528 12219 12949 12220 10521 8640 7026 5790 4879
5081 4879 4208 3689 3255 2862 2487 2128 1793 1494 1240 1040 891 779 694 626 570 524 485 452 422 396 372 352 335 319 306 293 281 271
5079 271 261 252 244 236 228 222 217 212 207 203 198 192 188 185 182 180 178 175 172 170 168 165 163 160 158 156 155 153 152 152 151 150 150 148 147 146 145 145 144 144 143 142 141 140 139 139 139 139 138 138 138 137 136 135 134 133 132 132 132 132 132 132 131 131 132 133 136 138
5071 138 141 143 145 146 144 142 141 141 145 149 154 160 166 174 180 187 194 198 198 194 187 181 176 172 168 162 158 154 150 147 142 134 121 100 75 53 37 28 24 24 24 19 13 11 13 18 24 28 29 29 29 32 37 41 45 48 52 56 59 62 64 66 68 68
5065 68 68 67 67 66 65 65 65 64 63 62 62 62 61 60 60 61 61 61 62 63 64 64 65 65 66 67 69 69 69 69 69 69 69 70 71 72 73 74 76 78 80 84 87 89 90 89 89 89 88 88 89 91 93 94 95 94 93 91 90 89 89 89 89 90 90 90 90 88 86 84
5057 84 82 81 79 77 75 74 72 71 71 70 69 68 67 66 66 65 65 64 64 63 63 64 64 65 65 67 68 68 68 69 69 69 70 70 71 72 73 75 76 77 78 79 78 77 76 75 75 75 76 77 78 79 80 81 80 78 76 75 74 73 72 71 70 70 69 69 68 68 67 67
5050 67 67 67 67 67 67 66 65 65 65 64 64 64 64 64 64 64 64 65 65 65 65 66 66 66 65 65 64 64 63 63 63 64 64 63 63 63 63 62 62 61 61 60 60 60 60 60 60 60 60 60 60 60 60 60 60 60 59 59 59 60 60 60 61 61 61 62 62 62 63 62
5042 62 62 62 62 62 62 62 62 63 63 64 64 65 64 64 65 65 65 65 65 65 65 65 65 65 65 65 65 65 65 65 65 64 64 64 65 64 64 64 64 64 64 64 64 64 64 64 64 65 65 66 66 67 67 67 66 66 66 66 67 67 67 67 67 67 67 67 67 66 66 65
5035 65 64 63 63 62 62 63 64 64 65 65 66 66 66 66 66 66 66 66 66 66 66 66 67 66 66 66 65 65 65 65 65 65 65 65 65 65 65 65 65 65 65 65 65 65 65 65 65 66 66 66 66 66 66 66 66 66 66 67 67 67 66 66 67 67 67 67 67 66 66 66
5027 66 66 66 66 66 66 66 66 66 66 67 67 67 67 67 66 67 67 67 67 67 67 66 65 65 66 66 67 67 67 67 66 65 65 66 66 67 67 67 68 68 68 69 69 69 69 69 69 68 68 68 68 69 69 69 69 70 71 71 72 72 73 73 73 74 75 75 76 78 79 81
5020 81 84 87 89 92 95 100 105 110 115 118 119 118 116 114 114 114 116 118 119 118 114 109 104 99 94 90 88 86 84 83 82 81 80 80 80 79 79 79 80 80 80 81 82 83 84 86 88 90 93 96 100 105 110 115 119 122 123 123 122 121 120 121 123 125 127 128 127 123 119 116
5013 116 114 114 113 114 116 119 122 125 127 127 125 122 120 120 120 121 122 123 122 119 114 109 103 99 96 93 90 88 86 84 83 83 82 82 81 81 81 81 81 81 82 83 84 85 86 88 90 93 95 98 102 106 111 116 119 121 120 118 116 115 115 116 117 118 118 115 111 106 101
5005 101 96 92 89 86 84 83 81 80 79 78 77 75 74 73 72 72 71 71 71 71 71 72 72 72 72 72 72 72 72 72 72 72 71 71 70 69 70 70 70 71 71 71 71 71 71 71 71 71 71 71 71 70 70 70 70 70 69 69 69 69 69 69 68 68 68 67 67 67 67
4998 67 67 67 68 67 67 67 66 66 66 66 67 67 67 67 67 67 67 67 67 68 68 68 68 68 68 68 68 69 69 69 69 69 69 69 69 69 68 69 69 69 69 69 69 69 70 70 69 69 69 69 68 68 68 68 68 67 67 67 67 67 67 67 67 66 66 66 65 64 64 64
4991 64 64 64 65 65 64 64 64 65 66 66 66 66 66 66 65 65 66 66 66 66 66 66 67 67 67 67 67 67 67 67 68 68 68 68 69 69 70 70 69 69 69 70 70 70 70 71 71 71 70 70 70 69 69 69 69 69 69 69 69 69 69 68 67 66 65 65 65 65 65 65
4983 65 65 65 66 65 65 66 66 66 67 67 67 68 68 69 70 70 70 70 70 71 72 73 73 73 72 72 73 73 73 73 73 73 74 73 73 73 73 73 73 73 73 73 74 75 75 76 76 76 76 76 77 78 79 80 81 83 84 85 86 88 90 92 95 99 104 110 117 127 137
4976 137 144 143 135 125 115 108 102 98 95 93 91 89 87 85 84 83 82 81 80 80 81 81 81 81 81 80 79 78 78 78 78 77 78 78 77 77 76 76 76 75 75 75 76 76 77 77 77 77 77 77 77 78 78 79 78 78 79 79 79 80 80 80 81 81 81 81 81
4969 81 81 81 81 81 81 82 82 82 83 83 83 83 83 83 84 84 83 83 83 82 82 82 82 82 82 81 80 80 79 79 79 79 79 79 79 79 78 79 79 79 80 80 80 80 81 81 81 81 81 81 80 80 80 81 82 84 84 85 86 86 87 87 87 87 88 89 91 93 95 96
4961 96 97 97 96 95 94 94 95 95 96 96 97 97 96 96 96 96 96 95 95 95 95 95 96 95 94 92 91 92 93 94 95 95 96 97 98 98 100 102 104 106 108 111 113 116 117 119 120 121 121 122 123 124 126 128 130 133 136 139 142 145 147 151 154 158 163 169 175 180 183 184
4954 184 186 189 192 197 201 203 203 200 198 196 192 188 180 170 158 145 134 127 123 119 115 107 94 77 60 49 42 39 37 37 38 40 42 46 50 54 60 65 70 76 85 95 105 115 123 131 138 146 155 165 174 180 181 181 180 181 181
4948 181 181 179 175 168 160 152 146 145 146 148 144 135 122 109 101 99 99 100 98 96 94 93 92 91 89 83 74 64 56 54 57 61 64 64 61 56 49 46 48 54 60 66 72 81 91 102 113 125 137 150 163 178 197 218 239
4942 239 260 282 304 328 354 384 414 443 467 488 510 536 567 604 646 691 737 784 837 902 986 1094 1227 1384 1567 1776 2016 2294 2624 3019
4939 3019 3497 4077 4779 5614 6579 7667 8839 9924 10558 10425 9730 9040 8685 8686 8969 9462 10060 10504 10361 9386 7927 6554
4937 6554 5490 4704 4116 3657 3285 2965 2686 2440 2232 2064 1938 1854 1808 1800 1828 1888 1982 2107 2264 2450 2670 2931 3241 3612 4057
4934 4057 4600 5258 6045 6961 7997 9129 10232 10996 11075 10529 9868 9493 9481 9777 10310 10996 11632 11821 11239 10099 8980 8203
4932 8203 7788 7682 7834 8208 8767 9489 10344 11199 11721 11536 10740 9888 9369 9226 9386 9769 10280 10703 10651 9834 8475 7106 6004
4929 6004 5172 4544 4053 3653 3309 3003 2731 2496 2303 2150 2037 1961 1922 1919 1948 2010 2102 2225 2376 2558 2777 3040 3361 3752 4236
4926 4236 4832 5556 6412 7390 8484 9598 10442 10605 10032 9237 8704 8539 8681 9054 9578 10086 10221 9603 8316 6901 5733
4924 5733 4850 4185 3666 3242 2876 2544 2239 1960 1717 1512 1347 1217 1114 1031 960 897 841 791 745 705 669 636 607 583 562 544 530 520
4921 520 511 501 490 479 470 464 461 460 460 459 456 452 447 444 442 439 436 433 430 424 416 406 398 389 376 360 344 333 326 322 318 314 306 294 277 262 250 244 240 237 233 230 225 218 210 203 195 183 168 151 139 132 129
4916 129 129 127 121 111 98 87 80 77 76 76 77 78 78 78 81 89 98 108 116 123 130 138 146 155 164 171 177 180 183 186 189 192 193 194 193 191 186 180 171 160 146 128 109 94 84 78 73 67 59 47 32 17 6 -1 -5
4910 -5 -7 -9 -10 -10 -11 -10 -7 -3 1 3 4 6 8 13 19 26 31 35 37 38 40 42 43 46 48 51 53 54 55 56 56 57 57 57 58 60 62 64 66 67 69 70 71 72 73 73 74 74 74 75 75 75 74 74 73 72 70 69 69 69 68 68 67 66 65 64 64 63 63 63 64
4902 64 64 64 64 64 64 63 62 61 60 60 62 63 64 66 66 67 67 67 68 69 69 69 70 70 71 72 72 72 72 72 72 72 71 71 71 71 71 71 71 71 72 73 73 73 73 73 72 72 71 71 71 70 69 68 67 66 65 65 65 65 64 64 63 63 64 64 64 64 64 64
4895 64 64 65 65 65 65 65 64 64 63 63 64 64 64 64 65 65 65 66 65 65 65 64 64 65 66 66 66 66 66 66 66 66 66 66 66 66 66 65 65 65 65 65 64 63 63 62 62 62 61 61 60 59 58 58 58 59 59 58 58 58 58 58 58 58 59 59 59 60 60 59
4887 59 59 59 60 60 61 61 61 60 60 60 60 60 60 60 60 60 59 59 59 59 60 60 61 61 61 60 60 61 61 61 61 61 62 62 63 63 63 63 62 62 62 61 61 60 60 60 60 61 60 60 60 59 59 59 59 59 59 60 60 60 60 60 60 60 60 60 60 61 61 61
4880 61 62 62 63 63 64 64 64 64 64 64 64 64 64 63 62 62 62 61 60 61 62 62 62 61 61 61 61 61 61 61 62 62 62 63 63 63 63 62 62 62 62 62 63 64 64 65 65 65 64 64 64 64 64 63 63 63 64 63 63 63 63 63 63 63 63 63 63 64 63 63
4873 63 64 64 64 64 64 65 64 64 64 64 64 65 65 64 65 64 64 64 64 64 65 65 65 64 64 64 64 64 64 64 64 64 64 63 64 64 64 64 64 63 64 64 64 65 65 65 65 65 65 65 64 64 64 64 64 64 63 63 63 64 64 65 65 65 65 65 65 65 65 65
4865 65 65 65 65 65 66 66 66 66 66 66 65 65 65 65 65 65 65 64 63 63 63 64 63 63 63 63 64 64 64 64 64 64 63 63 62 62 62 63 63 63 63 62 62 62 62 62 62 62 63 63 63 63 64 64 64 64 64 65 65 65 65 65 65 65 65 66 66 66 66 66
4858 66 66 66 66 66 66 67 67 67 67 66 66 67 67 68 68 68 67 67 68 69 70 71 72 73 75 77 79 81 84 88 92 96 101 105 110 113 114 113 112 110 110 110 112 113 114 113 110 106 101 96 92 88 85 84 82 80 79 78 77 76 75 75 74 74 74 75 75 76 77 78
4850 78 80 81 83 85 88 91 94 98 103 108 112 116 118 118 117 116 115 116 118 120 122 123 121 118 114 110 108 107 107 108 110 113 116 119 122 122 120 118 115 113 113 113 114 115 114 112 107 101 96 91 88 85 83 80 78 77 75 74 72 72 72 72 72 73 73 73 73 74 75 76
4843 76 78 80 82 85 88 91 94 98 103 108 112 114 113 111 108 107 108 109 111 112 112 110 105 100 94 90 86 83 81 79 77 76 75 73 72 70 69 68 68 67 67 66 66 66 65 65 65 65 65 64 64 64 63 64 64 63 63 63 63 64 64 64 64 63 64 63 63 63 63 63
4836 63 63 63 63 63 63 62 62 62 62 62 62 63 63 63 63 63 63 63 63 63 62 62 62 62 62 62 62 62 62 62 63 63 63 62 62 62 62 61 61 61 61 61 61 61 62 62 62 62 62 62 62 62 63 63 63 63 63 63 62 62 62 63 63 63 64 64 64 64 64 64
4828 64 63 62 62 62 63 63 63 63 63 63 63 64 64 64 64 64 63 63 62 62 63 63 63 63 62 62 62 62 62 62 62 62 62 62 62 61 61 60 60 61 61 62 62 62 62 62 61 61 61 61 61 62 62 63 62 62 62 62 62 62 62 62 62 62 62 62 63 63 63 64
4821 64 64 63 63 63 63 64 64 65 65 65 64 65 65 64 64 64 64 64 64 63 64 64 63 63 63 63 63 64 64 64 64 64 63 62 62 63 63 63 63 63 63 63 64 64 63 64 64 63 63 63 64 64 64 64 64 64 64 64 63 63 63 63 63 63 62 62 62 62 62 63
4813 63 63 63 63 63 63 63 62 62 62 62 62 62 62 62 63 63 63 63 63 63 63 63 63 63 62 62 62 62 62 62 62 63 63 63 64 63 63 63 63 63 63 64 63 63 63 63 64 64 64 64 64 64 64 63 63 63 63 63 63 62 62 62 62 62 62 62 62 62 62 62
4806 62 62 62 62 62 62 62 61 61 61 61 61 62 62 62 63 62 62 61 62 62 61 61 61 61 61 62 62 62 62 61 61 61 61 61 61 61 61 61 61 62 62 62 61 61 60 60 60 60 60 60 60 60 59 59 59 59 59 60 59 59 59 59 59 59 59 59 59 58 58 58
4798 58 59 59 59 59 59 59 59 59 59 59 59 59 59 59 59 59 60 60 60 60 60 60 60 60 60 60 60 60 60 60 60 61 60 60 60 60 60 60 60 60 60 60 60 60 60 60 60 60 60 60 59 59 59 59 59 59 59 58 58 58 58 58 58 59 59 59 59 58 58 58
4791 58 58 58 58 58 58 58 58 58 58 59 59 58 59 59 59 59 59 59 60 60 60 61 60 60 60 60 60 61 61 60 60 60 60 61 61 61 61 62 61 61 60 60 60 61 61 61 61 62 61 61 61 61 61 61 61 61 60 60 60 60 60 60 60 60 60 60 60 60 60 60
4784 60 60 60 60 60 60 60 61 61 61 61 61 61 61 61 60 60 60 60 60 60 60 60 59 60 60 59 59 60 60 60 60 59 59 59 59 60 60 60 60 61 61 61 61 61 61 61 61 61 61 61 62 61 61 61 62 62 62 63 63 63 63 63 63 63 63 62 62 62 62 62
4776 62 62 62 62 62 62 63 63 63 63 64 64 64 63 62 62 61 61 61 62 62 62 62 62 61 62 62 62 62 62 62 62 61 61 61 61 61 61 61 61 62 62 63 63 63 63 63 63 63 63 63 63 64 64 64 64 64 64 64 64 64 64 63 63 63 63 63 64 64 64 64
4769 64 64 64 64 64 64 64 64 64 64 64 64 64 64 64 64 64 64 64 64 64 63 63 63 63 63 63 63 63 63 63 64 64 64 65 65 66 65 65 66 66 65 66 66 65 65 65 65 64 64 65 64 64 65 64 64 64 64 64 64 65 65 65 65 65 65 65 65 65 65 65
4761 65 64 64 65 64 64 64 64 64 65 65 65 65 65 66 66 66 66 66 65 65 65 65 66 67 67 67 67 67 67 67 67 67 67 67 67 67 67 66 66 66 66 66 66 66 66 66 66 66 66 65 65 64 64 64 63 63 63 63 63 63 62 62 62 62 61 61 61 61 61 61
4754 61 62 62 62 63 63 63 63 62 63 63 64 64 64 64 64 64 65 65 66 67 67 67 67 67 67 67 68 69 70 71 72 73 74 74 75 76 77 79 80 82 84 87 91 94 97 100 103 105 106 107 106 104 102 100 97 95 94 92 91 90 90 90 89 89 89 90 91 92 93 94
4747 94 96 98 100 103 107 112 117 122 129 136 144 152 159 166 170 174 174 174 173 171 171 171 173 177 182 189 197 208 219 233 248 266 284 303 321 337 350 360 368 379 392 410 432 458 489 520 550 573 587
4741 587 588 577 555 526 494 462 431 403 377 354 333 315 299 286 275 267 261 257 254 252 251 249 246 242 236 230 225 221 219 218 218 220 224 228 234 241 250 262 275 290 306 323 338 352 364 376
4736 376 388 404 423 446 473 502 533 561 582 594 593 579 555 525 494 463 433 405 381 359 340 324 310 299 291 286 285 286 290 297 308 321 338 358 381 408 437 467
4732 467 498 528 555 577 591 594 586 567 541 511 483 458 436 418 404 392 382 372 359 343 326 309 292 278 266 256 248 242 238 235 234 235 237 241 245 251 257 264 269 274 276 277 277 279 283
4728 283 288 296 305 316 330 347 367 389 414 441 469 498 525 549 567 578 578 568 549 524 496 469 445 425 409 396 385 375 364 351 335 317 298 279 262 247 234
4724 234 223 213 206 200 196 193 191 190 190 191 191 192 191 189 184 178 170 163 155 148 142 136 131 126 122 118 114 111 108 105 103 102 101 100 100 100 99 100 100 102 103 105 107 108 110 111 113 114 114 113 112 111 109 107 103 100 97 94 92 89 86 84 82 80 78 77 75
4717 75 74 73 72 71 71 70 70 69 69 69 69 68 68 69 69 69 70 69 69 68 68 68 68 69 69 69 69 69 69 70 70 69 69 69 69 69 68 68 67 67 67 67 67 67 68 68 67 66 65 64 63 62 62 61 60 60 59 59 59 59 59 60 60 60 60 59 59 59 59 59
4709 59 59 60 60 60 60 59 59 59 59 58 59 59 59 60 60 60 60 60 59 59 60 60 60 60 60 61 61 61 61 61 61 61 61 61 61 61 62 61 61 61 60 60 61 61 61 61 60 60 60 61 61 61 61 61 61 61 61 60 60 60 60 60 59 59 59 60 60 60 60 60
4702 60 60 60 60 60 60 60 59 59 60 60 60 60 60 60 60 60 60 60 61 61 61 61 61 61 61 60 60 60 60 61 61 61 61 61 61 60 60 60 60 61 61 62 61 61 61 61 61 61 60 61 61 61 61 61 61 61 61 61 61 61 61 61 61 61 61 61 61 61 60 60
4694 60 60 60 61 61 61 61 61 61 61 61 61 61 61 61 61 61 61 61 62 62 61 61 61 61 61 61 61 61 61 61 61 61 61 61 61 61 61 61 61 62 62 62 62 61 61 61 60 60 61 61 61 60 60 60 60 61 61 61 61 60 60 60 60 60 60 60 60 60 60 60
4687 60 60 60 60 59 59 59 59 59 60 60 60 60 60 60 60 60 60 60 60 60 61 61 61 61 60 61 60 60 60 61 61 61 61 61 61 60 60 60 60 60 61 61 60 60 60 59 60 60 60 60 60 60 61 60 60 60 59 59 59 59 60 60 59 60 60 59 59 59 59 59
4680 59 59 59 59 59 59 59 59 60 60 60 60 60 60 60 60 60 60 60 59 60 60 60 60 59 60 59 59 59 59 59 59 59 59 59 59 59 59 59 59 59 59 59 60 60 60 59 58 58 58 58 58 58 59 59 60 60 60 59 59 59 59 59 59 59 60 60 60 60 60 60
4672 60 60 60 59 59 60 60 60 60 60 60 60 60 60 59 59 59 60 60 60 60 60 61 60 60 60 60 59 59 59 59 59 60 60 60 60 60 60 60 60 60 60 60 60 60 60 60 60 60 60 60 59 59 59 59 59 59 59 59 59 58 58 58 58 58 58 58 59 59 59 59
4665 59 59 59 60 60 60 60 59 59 60 59 60 60 59 59 59 59 60 60 60 60 60 60 60 60 61 61 61 61 62 61 61 61 61 61 61 61 61 62 62 62 62 61 61 61 60 60 61 61 60 61 61 61 61 61 61 61 61 61 61 60 60 60 60 59 59 59 60 60 59 60
4657 60 60 60 60 60 60 60 60 60 60 60 60 60 60 60 61 61 61 62 62 62 62 63 63 62 62 62 61 62 61 61 62 62 62 62 62 62 62 62 62 62 62 61 61 61 61 61 61 61 61 61 61 61 62 62 62 61 61 61 60 60 60 60 61 61 61 61 60 60 60 59
4650 59 60 60 60 59 59 60 60 60 60 60 60 60 60 60 60 60 61 60 60 60 60 61 61 61 61 61 61 62 62 62 62 62 62 62 62 62 62 63 62 62 62 61 61 61 61 61 61 62 62 62 62 62 62 62 62 62 62 61 61 61 61 61 61 61 61 61 61 60 60 60
4642 60 60 60 60 60 60 60 60 60 60 60 60 61 61 61 61 61 61 61 61 62 62 62 62 61 61 61 61 62 62 61 61 61 61 61 61 61 61 60 61 61 61 61 61 62 62 61 60 60 60 59 59 59 59 59 59 59 59 59 59 58 58 58 58 58 58 58 58 58 57 57
4635 57 57 58 58 58 58 58 58 58 58 57 57 57 57 58 58 58 58 58 58 58 58 58 58 58 58 58 58 58 58 58 58 57 58 58 58 58 58 58 58 58 57 57 57 57 57 57 57 57 57 56 55 55 55 55 55 55 56 56 56 56 56 56 56 56 56 57 57 57 57 57
4628 57 57 57 57 57 56 56 56 56 56 56 56 57 57 57 57 57 57 56 56 56 56 56 56 56 57 57 57 57 57 57 57 57 57 57 57 57 57 57 57 56 56 56 56 56 56 56 56 56 56 55 55 55 55 55 56 57 56 56 57 57 57 58 57 57 57 57 57 57 57 57
4620 57 57 57 57 57 57 57 57 57 58 58 58 58 58 58 57 57 57 57 57 58 58 58 58 58 58 58 59 58 57 58 58 58 58 58 58 58 57 57 57 57 57 57 56 56 56 56 56 56 56 57 57 57 57 57 57 57 57 57 57 56 56 56 56 56 56 57 57 57 57 56
4613 56 56 56 56 56 57 57 57 57 57 57 57 57 57 57 57 58 58 58 58 57 57 57 57 58 59 59 59 59 59 59 58 58 58 58 58 58 58 57 57 57 57 57 57 58 58 57 57 57 57 58 58 58 58 57 57 57 57 56 56 56 56 56 56 55 55 55 55 56 55 55
4605 55 54 54 54 55 55 55 55 55 55 55 55 55 55 55 54 54 54 54 54 54 55 55 56 56 56 56 56 56 56 56 56 56 57 57 58 58 58 58 57 57 56 56 56 57 57 57 57 56 56 56 56 56 56 57 57 57 57 57 56 56 56 56 56 56 56 56 55 55 55 55
4598 55 55 55 55 55 55 56 56 57 56 56 55 55 55 56 56 56 55 55 56 56 57 58 58 58 58 58 58 57 57 57 58 58 58 58 58 58 58 58 59 59 59 59 59 59 59 59 59 59 58 58 58 59 59 59 59 59 59 58 58 59 59 59 59 59 59 59 59 58 59 60
4591 60 60 59 59 59 59 59 59 59 59 60 59 59 59 58 58 58 58 58 58 58 59 59 59 60 60 60 60 59 58 58 59 59 59 59 59 59 60 60 60 59 59 59 59 59 60 60 60 60 60 60 60 60 60 60 60 60 60 60 60 60 60 60 60 60 60 60 60 60 60 60
4583 60 60 60 60 60 59 59 60 61 60 60 60 60 59 59 59 59 59 59 59 59 59 59 60 60 60 60 59 60 60 60 60 60 60 60 60 60 60 60 61 60 60 59 59 60 60 60 60 59 60 60 60 61 61 61 61 61 61 61 61 61 60 61 61 61 61 61 61 61 61 60
4576 60 60 60 60 61 61 60 61 60 60 59 59 60 60 60 60 60 60 60 60 60 60 60 60 60 60 60 60 60 60 60 60 60 60 60 60 61 61 60 60 60 60 60 60 60 61 61 61 62 62 62 62 62 62 61 61 61 61 62 62 62 62 62 61 61 61 61 62 62 61 62
4568 62 62 62 61 61 60 60 60 60 60 60 60 60 60 60 59 59 59 59 59 59 59 59 60 60 60 61 61 62 62 61 61 61 61 62 61 61 61 61 61 62 62 62 62 62 62 62 62 63 63 63 63 64 64 64 65 65 66 66 66 67 67 67 68 69 71 71 71 71 71 71
4561 71 70 70 69 68 68 68 68 68 68 67 67 68 67 67 67 67 67 67 68 68 69 70 70 71 72 72 73 74 76 78 80 83 85 86 87 88 88 88 87 86 86 86 86 87 87 89 91 93 95 98 102 106 110 115 120 125 130 134 137 140 142 146 151 156 163 172 181 189 195 198
4553 198 197 193 187 180 172 165 158 150 144 139 134 130 127 124 121 119 116 115 114 113 111 110 107 105 103 101 101 100 100 99 99 99 100 102 103 105 108 111 116 121 126 131 137 142 146 150 155 161 167 175 183 192 200 207 211 212 209 203 196 188 180 172 166 160 156 152 148 145 143
4546 143 141 140 140 142 146 151 157 165 173 182 191 200 210 222 234 247 260 271 279 280 274 263 250 238 226 216 208 200 193 186 180 174 167 161 154 148 142 136 130 126 123 120 119 118 117 117 118 118 119 122 125 128 131 133 136 138 141 144
4540 144 147 152 158 165 172 180 187 195 203 214 226 239 252 264 272 276 273 266 257 247 235 224 214 204 196 189 184 178 174 169 164 160 156 153 152 151 150 151 152 154 156 158 160 163 168 172 175 174 170 164 158 153 149 145 141 136 131 125 120
4534 120 114 109 105 101 98 95 92 91 89 88 87 86 86 86 87 88 89 90 92 94 97 99 102 105 107 109 111 113 115 117 119 121 124 128 130 133 135 138 141 143 145 146 142 136 130 124 119 115 112 110 107 105 100 96 93 90 87 85 84 83 82 82 82 81 80 79 78 77 77
4526 77 76 76 77 77 77 78 78 79 79 78 77 76 75 73 72 71 70 70 69 68 67 66 65 65 65 64 64 64 64 64 64 64 64 64 64 64 64 63 63 64 65 65 66 66 66 66 66 66 66 65 65 65 64 63 62 62 62 61 61 61 61 61 61 60 60 60 60 60 60 61
4519 61 60 59 59 59 60 60 60 60 60 60 60 61 60 60 59 59 59 60 60 60 60 61 61 60 60 60 60 61 62 62 61 61 61 60 60 59 59 59 59 59 59 59 59 59 58 58 58 58 58 58 58 59 59 59 59 58 58 58 58 58 58 58 58 59 59 59 59 58 58 58
4512 58 58 57 57 58 58 58 59 59 59 59 59 59 59 59 59 59 59 59 59 59 59 59 59 59 59 59 59 59 59 59 59 59 59 59 59 59 60 60 60 60 60 59 59 59 59 59 59 59 59 59 59 59 59 59 58 58 58 58 58 59 59 59 59 59 59 60 60 59 59 59
4504 59 59 60 60 60 60 61 60 60 60 60 60 60 60 60 59 60 60 60 60 60 60 60 60 60 60 60 59 59 60 60 60 59 59 59 59 59 59 59 59 60 60 60 60 60 60 60 59 59 59 59 60 60 60 60 60 60 60 60 61 61 61 61 61 61 61 61 61 61 61 61
4497 61 61 61 61 60 60 60 60 60 60 60 60 60 60 60 60 60 60 60 60 60 60 60 60 60 60 61 61 61 60 60 59 59 60 60 60 60 60 60 60 59 59 59 58 58 59 59 59 59 60 59 59 59 58 58 58 59 59 59 60 60 60 60 60 59 59 59 59 59 58 58
4489 58 59 59 59 59 60 60 60 60 60 60 60 59 60 59 59 59 59 59 59 59 60 60 59 59 58 59 58 58 58 57 57 58 58 58 59 59 59 59 58 58 58 58 58 59 59 59 59 58 58 58 58 58 58 58 58 58 58 57 57 58 58 58 58 58 58 58 58 57 57 57
4482 57 57 57 57 57 57 57 57 57 57 58 58 58 58 58 58 58 58 58 58 58 59 59 59 59 59 59 58 58 58 58 58 58 58 59 59 59 59 59 59 59 58 58 58 58 58 58 58 58 58 58 58 58 58 58 58 57 57 57 57 57 56 57 57 58 58 58 58 58 58 58
4475 58 58 58 58 58 58 58 58 58 59 58 58 58 58 57 58 58 58 58 58 59 59 59 59 59 58 58 58 58 58 58 59 59 58 58 58 58 58 58 58 58 58 58 58 59 59 59 59 59 59 59 59 59 58 58 58 58 58 58 58 59 59 59 59 59 60 60 59 59 59 59
4467 59 58 59 59 60 60 59 59 59 60 60 60 60 59 58 58 58 58 58 58 58 59 59 59 59 58 58 58 58 58 59 59 58 58 59 58 58 59 59 59 59 59 59 59 59 59 59 58 58 58 58 58 59 59 59 59 59 59 59 59 60 60 60 60 60 60 60 60 60 60 60
4460 60 60 60 60 60 60 60 60 60 60 60 60 60 60 60 59 59 59 59 59 59 58 58 58 58 59 59 58 59 59 59 60 59 59 59 59 59 59 59 59 59 59 59 59 59 59 59 59 59 60 60 59 59 59 60 60 60 60 59 59 60 59 59 60 60 60 60 60 59 59 59
4452 59 60 60 60 60 60 60 60 60 59 59 59 59 59 59 59 59 59 59 59 59 60 60 60 60 59 59 59 59 59 59 59 60 60 60 59 59 60 60 60 60 59 59 59 59 59 59 59 59 58 58 57 57 57 57 56 57 57 58 58 58 58 58 59 59 59 59 59 59 59 58
4445 58 59 59 59 59 59 59 59 59 59 59 59 59 59 59 59 58 58 58 58 58 58 58 59 58 59 59 58 58 57 57 57 57 57 57 57 57 57 57 57 57 57 57 57 57 57 58 57 57 57 57 56 56 56 56 56 57 57 57 56 56 56 56 56 57 57 57 57 56 56 57
4437 57 57 57 57 57 57 56 56 56 56 57 57 57 57 57 56 57 57 57 57 57 57 57 57 57 57 57 57 56 55 56 56 56 56 56 56 56 56 56 56 56 56 56 56 56 56 56 57 56 56 56 56 56 56 56 55 55 55 55 56 56 56 57 57 56 56 56 56 56 55 55
4430 55 55 55 54 55 55 55 56 56 57 56 56 56 56 56 57 57 57 57 56 56 56 56 57 57 57 57 57 56 56 56 57 57 57 57 57 57 57 56 56 56 56 56 57 57 57 56 56 57 57 57 57 57 57 57 58 57 57 57 57 57 57 57 57 57 57 56 56 57 57 58
4423 58 58 58 58 58 58 58 58 58 59 59 59 59 59 59 58 58 58 58 58 58 58 58 58 58 58 58 58 58 58 58 58 58 59 59 59 59 58 58 58 58 58 58 57 58 58 58 58 58 58 58 58 58 58 59 59 59 58 58 58 58 59 59 60 60 59 59 59 59 59 59
4415 59 59 59 60 60 60 60 60 60 60 59 60 60 60 59 59 59 59 59 59 59 59 58 58 59 59 59 59 58 58 58 59 58 58 58 59 59 59 59 59 59 59 59 59 59 58 59 59 59 59 59 59 59 59 59 59 59 60 60 59 59 59 60 59 59 59 59 60 59 59 60
4408 60 61 61 60 60 60 60 60 60 60 60 60 60 60 60 60 60 60 60 59 59 59 59 58 58 58 59 59 60 59 59 59 59 59 59 59 60 60 60 60 60 60 59 60 60 60 60 59 59 59 59 59 59 58 58 59 59 59 58 59 59 59 59 59 59 59 59 59 59 59 59
4400 59 58 58 58 59 58 58 58 58 58 58 58 59 59 59 58 58 58 58 58 58 58 58 58 58 58 58 57 57 57 57 58 58 58 58 58 58 59 58 58 58 57 58 58 58 58 58 58 58 58 58 58 59 59 59 59 59 59 59 59 59 59 58 58 58 58 58 59 59 59 58
4393 58 58 58 58 58 58 57 58 58 58 58 58 58 58 58 58 57 57 58 58 58 58 58 59 59 59 59 59 59 59 59 59 59 59 59 59 59 59 59 59 59 58 58 58 58 57 58 58 58 59 58 58 58 58 58 58 58 59 59 59 59 59 59 59 59 60 59 59 59 59 58
4386 58 58 58 59 59 59 59 59 58 58 58 58 58 57 58 58 58 58 58 58 59 59 59 59 59 59 59 59 59 59 59 59 59 59 60 60 59 59 58 58 58 58 58 58 58 58 58 58 58 58 58 57 57 57 57 58 58 59 59 59 59 59 59 58 58 58 58 58 58 58 58
4378 58 58 58 58 57 58 58 58 58 58 59 59 59 58 58 58 58 58 59 58 58 57 58 58 58 58 58 58 58 58 58 59 59 59 59 58 58 58 58 59 59 59 60 60 60 59 58 58 58 58 58 58 58 58 58 59 59 60 59 59 59 59 59 59 59 58 58 58 59 59 59
4371 59 60 59 59 58 58 58 58 58 58 58 58 58 58 58 57 57 57 57 57 58 58 59 59 59 58 58 58 58 59 59 58 58 58 59 59 59 59 59 59 59 59 59 58 58 58 58 57 58 58 58 58 58 58 58 58 58 58 59 59 59 59 59 58 58 58 58 58 58 58 58
4363 58 58 58 58 58 57 58 58 58 58 58 58 58 59 59 59 59 58 58 57 57 57 57 57 58 58 58 57 57 57 57 57 57 57 58 58 58 58 59 59 59 59 59 58 58 58 58 58 58 58 58 58 58 58 57 57 58 58 58 58 58 58 59 59 59 58 58 58 58 58 58
4356 58 58 58 58 58 58 58 59 58 57 57 57 56 56 56 57 57 57 58 57 57 57 57 57 57 57 58 58 57 57 57 57 57 57 57 57 58 58 58 58 58 58 58 58 58 58 58 58 58 58 58 58 58 58 58 57 57 57 57 57 57 57 57 57 57 57 56 56 56 57 56
4348 56 56 56 56 56 56 57 57 57 57 56 56 57 56 56 56 56 56 56 56 56 57 57 57 57 57 57 57 57 57 57 57 57 56 56 56 56 56 56 56 57 57 57 57 57 57 57 57 57 57 57 57 57 57 57 56 56 57 57 57 57 57 57 57 58 58 58 57 57 57 57
4341 57 57 57 57 57 57 57 57 57 57 57 57 57 57 58 58 58 58 58 58 58 58 58 58 58 58 58 58 57 57 58 57 57 57 57 57 57 57 57 57 57 57 57 57 57 57 57 57 57 57 57 57 57 57 57 58 58 58 58 57 57 57 57 57 57 57 57 57 57 57 57
4334 57 57 57 57 57 57 57 57 58 58 58 58 58 58 58 57 57 57 57 57 58 58 58 59 59 59 58 58 58 58 58 58 58 58 58 58 58 58 58 58 58 58 58 58 58 58 57 57 57 57 57 57 57 57 57 57 57 56 56 57 58 58 58 58 57 58 58 58 58 58 58
4326 58 58 58 58 58 58 58 58 58 58 58 58 58 58 58 58 58 58 58 58 58 58 58 58 58 58 58 58 58 58 58 58 58 57 58 58 58 58 57 57 57 57 57 57 57 57 57 57 58 57 57 56 56 56 56 57 57 57 57 57 57 57 57 57 57 57 57 57 57 57 57
4319 57 57 57 57 57 57 57 57 58 58 57 57 57 57 57 57 57 57 58 58 58 57 57 57 57 57 57 57 57 57 57 57 57 57 57 58 57 57 57 57 57 57 57 57 57 57 57 57 57 57 57 57 56 56 56 56 56 56 57 57 57 57 57 57 57 58 58 58 58 58 58
4311 58 58 58 58 58 59 59 59 59 58 58 58 57 57 57 58 58 58 58 58 58 58 59 59 58 58 57 58 58 57 57 57 57 57 57 57 58 58 57 57 58 58 58 58 58 58 57 57 58 57 57 57 57 57 57 57 57 57 57 57 56 56 56 56 56 57 57 57 57 57 57
4304 57 57 57 57 57 57 56 56 56 56 56 56 56 56 55 55 56 56 56 56 56 56 56 57 57 57 57 57 57 57 57 57 57 57 57 56 56 57 57 57 57 57 57 57 57 57 56 56 56 57 57 57 57 57 57 57 56 55 55 55 55 55 55 55 55 54 54 55 56 56 56
4297 56 56 55 55 55 56 56 56 56 56 56 56 56 56 55 55 55 55 55 55 55 55 55 55 56 56 56 57 56 56 56 56 56 56 57 57 57 57 57 57 57 56 56 56 56 56 57 56 56 56 56 56 57 57 57 57 57 57 57 56 56 56 55 56 56 56 56 56 56 56 55
4289 55 55 55 55 55 55 55 55 55 56 56 57 57 56 56 56 56 57 56 57 57 57 57 57 57 57 57 56 56 57 58 58 58 58 58 58 58 58 58 58 58 58 58 57 57 57 57 57 57 57 57 57 57 57 57 57 57 57 57 56 56 56 56 56 56 57 57 57 57 57 57
4282 57 57 57 57 57 56 56 56 56 56 56 56 56 56 56 56 56 57 57 57 57 57 57 56 56 56 57 57 57 56 57 57 57 57 57 56 57 58 58 58 58 58 58 58 58 58 59 59 58 58 57 57 56 57 57 58 58 57 57 57 57 57 57 57 57 57 57 58 58 58 58
4274 58 57 57 57 57 57 57 57 56 57 57 57 57 57 57 57 57 58 58 58 58 58 58 57 57 57 57 57 57 57 57 58 57 57 57 57 57 57 57 57 57 58 58 58 58 58 58 58 58 58 58 58 58 58 58 58 58 58 59 59 59 58 58 57 57 57 57 58 58 59 59
4267 59 59 59 59 59 59 59 58 57 57 57 57 58 58 58 58 58 57 58 58 58 58 58 58 58 58 58 58 58 58 57 57 57 57 57 57 57 57 57 57 57 57 57 57 57 57 57 56 56 56 56 57 57 57 58 57 57 57 57 57 58 58 58 57 57 58 58 58 58 58 57
4259 57 57 57 56 56 56 56 56 56 56 56 56 56 57 57 58 57 57 57 57 57 57 57 57 57 57 57 57 57 57 56 56 56 56 56 56 57 56 56 56 56 56 57 57 56 57 57 57 57 57 57 57 56 56 56 55 55 55 55 55 56 56 56 56 56 56 56 56 56 56 56
4252 56 56 56 56 56 56 56 56 56 56 56 56 56 56 56 56 56 55 55 55 55 55 55 55 55 55 55 56 56 56 56 56 56 56 56 56 56 56 56 57 57 57 57 57 57 56 56 55 55 55 55 55 56 56 56 56 57 57 56 56 56 56 56 56 56 56 56 56 56 57 57
4245 57 57 56 56 55 55 54 54 54 54 55 55 55 54 54 54 54 54 55 55 55 56 56 56 57 57 57 57 56 55 55 55 55 55 55 55 56 56 56 55 55 55 56 56 56 56 56 56 56 56 56 56 56 56 55 55 55 55 55 55 55 55 55 54 54 55 55 55 55 55 55
4237 55 55 55 55 56 56 56 56 56 55 56 56 56 56 56 56 56 56 56 56 56 56 56 56 56 55 56 56 56 56 56 56 57 57 57 57 57 56 56 56 56 56 56 56 56 56 56 57 57 57 57 57 57 57 57 57 57 57 57 57 56 56 57 57 57 56 56 55 56 56 57
4230 57 57 57 57 57 57 57 58 57 57 57 57 57 57 56 56 56 57 57 57 57 57 57 57 57 58 57 57 57 57 57 57 57 57 58 58 58 58 58 58 58 58 58 58 58 58 58 58 58 58 58 58 58 57 57 57 56 56 56 57 57 57 57 57 57 57 58 58 58 58 58
4222 58 58 57 57 57 58 58 58 58 57 57 57 58 57 57 57 57 56 57 57 57 57 57 57 57 58 57 57 57 56 57 57 57 57 57 58 58 58 58 58 58 57 57 57 57 57 57 57 57 57 57 57 58 58 58 58 58 58 58 58 59 59 58 58 58 58 58 58 57 57 58
4215 58 57 57 56 56 56 56 57 57 57 57 57 57 57 57 57 57 57 57 57 57 57 57 57 57 57 56 56 57 57 57 57 57 57 58 58 58 58 58 58 57 57 57 57 57 57 57 57 57 57 57 57 57 57 57 58 58 58 58 59 58 58 58 57 57 57 57 57 57 57 57
4208 57 56 57 57 57 57 57 57 57 57 56 57 57 56 57 57 57 57 57 57 57 57 57 57 57 57 57 57 57 57 57 57 56 57 57 57 56 56 57 57 58 58 58 58 58 58 58 58 58 58 58 58 57 57 57 58 58 58 58 58 58 57 57 57 57 57 57 57 57 57 57
4200 57 57 57 57 57 57 57 57 57 58 58 58 58 57 57 57 57 57 56 56 56 57 57 57 57 57 56 56 56 56 56 56 56 57 57 57 57 57 57 57 57 57 57 57 57 57 57 57 57 56 56 57 57 58 58 57 58 58 57 57 57 57 56 56 56 56 56 57 57 57 58
4193 58 58 58 57 57 56 57 57 57 57 57 57 57 57 57 57 56 57 57 57 57 57 57 56 57 57 58 58 58 58 58 58 58 58 58 58 57 57 57 57 57 57 57 57 57 57 57 57 57 57 57 57 57 57 57 57 58 58 58 58 58 59 58 58 58 58 57 57 57 58 58
4185 58 57 57 57 57 57 57 57 57 57 57 58 57 57 57 56 57 57 57 57 57 57 58 58 58 58 58 57 57 57 58 57 57 58 58 58 58 58 58 58 58 58 58 58 58 57 58 58 58 58 58 59 59 58 58 58 58 58 58 58 58 58 57 57 57 57 57 57 57 58 57
4178 57 57 57 57 57 58 58 58 58 58 58 58 58 58 58 58 57 57 57 57 58 58 58 58 58 58 58 58 58 58 58 58 58 58 58 58 58 58 59 60 60 59 59 58 58 58 58 59 59 59 58 58 57 57 57 57 57 56 57 57 58 58 58 58 58 58 57 57 58 59 58
4170 58 58 58 58 58 58 58 58 57 57 57 57 57 57 57 57 57 57 57 57 57 57 57 57 57 57 57 58 58 58 58 58 57 57 57 58 57 57 57 57 57 57 58 58 58 58 57 57 57 58 58 58 58 57 57 57 57 57 57 57 57 57 58 58 58 58 58 58 58 58 58
4163 58 57 57 57 57 57 57 57 58 58 58 58 57 57 57 57 57 57 57 57 57 57 57 57 57 57 57 57 57 57 58 58 57 58 58 57 57 56 57 57 58 58 59 59 58 58 58 58 58 58 58 58 58 57 58 58 58 58 58 58 58 57 57 57 57 57 57 57 58 58 58
4156 58 58 58 58 58 58 58 58 58 58 57 58 58 58 58 58 57 57 57 56 57 57 57 57 56 57 57 57 57 57 57 57 57 57 57 57 57 57 57 57 57 57 57 57 57 57 57 57 57 57 57 57 57 57 57 57 57 57 57 57 57 56 57 57 57 57 57 57 57 56 56
4148 56 56 56 57 56 56 56 56 57 57 57 57 57 57 57 57 56 56 56 57 57 57 57 58 58 58 58 58 58 58 58 57 57 57 57 57 57 57 57 57 57 56 56 57 57 57 57 57 56 56 57 57 57 57 57 57 57 57 57 57 57 58 58 58 58 58 58 57 58 57 57
4141 57 57 57 57 57 57 58 58 58 57 57 57 56 56 56 57 57 57 57 57 57 57 57 57 57 57 56 56 56 56 57 57 57 58 57 57 56 56 56 57 57 57 57 57 57 57 58 58 58 58 58 58 58 58 58 58 57 57 57 57 57 57 57 57 57 57 57 56 56 56 56
4133 56 56 56 56 56 56 56 56 56 56 56 56 56 56 56 56 56 57 57 57 57 57 57 57 58 58 58 57 57 57 57 57 58 58 58 57 57 57 57 57 58 57 57 57 57 56 57 57 57 57 58 58 58 58 58 58 58 58 57 57 57 57 57 57 57 57 57 56 56 56 56
4126 56 56 56 55 56 56 56 56 56 56 56 55 55 55 55 55 56 56 55 56 56 56 55 56 56 56 56 56 57 57 57 57 57 57 57 57 57 57 57 57 57 57 57 56 57 57 57 57 57 57 58 58 58 57 57 57 56 56 56 56 56 56 56 57 57 57 56 57 58 58 58
4118 58 58 57 56 56 56 56 56 55 55 55 55 56 56 56 56 56 56 56 57 57 58 58 58 58 58 57 57 57 57 57 57 57 57 57 57 57 56 56 56 56 57 56 56 57 57 57 57 57 57 56 56 57 57 57 57 56 56 56 56 56 56 56 57 57 57 57 57 58 58 57
4111 57 57 57 57 57 57 57 57 57 57 57 57 57 57 56 56 56 56 57 58 58 58 58 58 58 57 57 57 57 57 57 57 57 58 58 58 58 58 58 58 58 58 58 58 57 57 57 57 57 57 57 57 57 57 57 57 58 58 58 57 57 57 57 57 57 58 58 58 58 58 58
4104 58 58 58 58 58 57 58 58 58 58 58 58 58 58 58 58 58 58 57 57 57 57 57 57 58 58 58 57 57 57 57 56 57 57 57 57 58 58 58 57 57 58 57 57 57 58 58 58 58 58 58 58 58 58 58 58 58 58 58 58 57 57 57 57 57 57 57 57 57 57 57
4096 57 57 57 57 57 57 56 56 56 56 57 57 57 57 56 56 56 56 56 56 56 56 56 55 56 56 56 56 57 57 57 57 57 57 57 57 57 57 57 58 58 57 57 56 56 56 56 56 56 56 56 56 56 56 56 57 57 57 57 57 57 57 57 57 57 57 57 57 57 57 57
4089 57 57 57 56 56 56 56 55 55 55 55 55 55 55 56 56 56 56 56 56 57 57 57 57 57 57 57 57 57 57 57 57 57 57 57 57 57 57 56 56 56 56 56 56 57 57 57 57 57 57 57 57 57 57 56 56 56 56 56 56 56 56 56 56 57 57 56 56 56 56 56
4081 56 57 57 57 57 57 56 56 56 56 56 56 56 56 56 56 56 56 56 56 57 57 57 57 57 57 56 56 56 56 56 56 56 56 55 55 56 56 56 56 56 56 56 56 56 56 57 57 57 57 57 57 57 57 57 57 57 57 57 57 57 56 56 56 56 56 56 56 55 56 57
4074 57 57 57 56 56 56 56 56 56 56 56 56 56 56 56 56 56 56 56 56 56 56 56 56 55 55 55 56 56 56 56 56 56 56 57 57 57 57 57 57 56 56 56 56 56 56 56 56 56 56 56 56 56 56 56 56 56 56 56 56 56 56 56 56 56 57 56 56 56 55 55
4067 55 55 55 55 56 56 56 56 56 56 56 56 56 56 56 56 56 56 56 57 57 57 57 58 58 58 57 57 57 57 57 57 57 57 57 57 57 58 57 57 56 56 56 57 57 57 57 57 57 57 57 57 57 57 57 56 56 56 56 55 56 56 57 57 57 57 57 57 57 57 56
4059 56 56 56 56 56 56 56 56 56 56 56 56 56 56 56 57 57 57 57 57 57 56 56 56 56 57 56 56 56 56 56 56 56 56 56 56 55 55 55 56 56 56 57 57 57 57 57 57 57 56 56 56 55 55 56 57 56 56 56 56 56 57 57 58 57 57 57 56 56 56 57
4052 57 57 56 56 56 56 56 56 56 56 56 56 56 56 56 56 56 55 55 55 56 56 56 56 56 56 56 56 56 56 56 56 56 56 56 57 57 57 57 57 57 58 58 58 58 58 58 57 57 57 57 57 57 57 57 58 58 58 57 57 56 56 55 56 56 56 57 57 57 57 57
4044 57 57 57 57 57 57 57 56 56 56 56 56 57 57 57 57 56 56 56 56 56 56 57 57 57 57 57 56 57 56 56 56 56 56 56 56 57 57 57 56 56 56 56 56 56 56 56 56 56 56 56 56 56 56 56 56 57 57 57 57 57 57 57 57 57 57 56 56 56 56 56
4037 56 57 57 57 57 57 57 57 57 57 56 56 56 56 56 56 56 56 56 56 56 56 56 56 56 56 56 56 56 56 55 56 56 56 56 56 56 56 56 56 56 56 56 56 56 55 56 56 56 56 56 55 56 56 56 56 56 56 56 56 56 57 57 56 56 56 56 56 56 56 56
4029 56 57 56 56 56 56 56 55 55 55 56 56 57 56 56 56 56 56 56 56 56 56 57 57 57 57 57 56 56 56 56 56 56 56 56 56 56 56 56 56 56 56 56 56 56 56 56 56 56 55 55 55 55 55 56 56 56 56 56 56 56 56 56 56 57 57 57 57 57 56 56
4022 56 57 57 57 57 57 57 57 57 57 56 56 56 56 56 56 56 56 56 56 56 56 57 56 56 56 56 56 56 55 55 56 56 56 56 56 55 55 56 56 56 56 56 56 56 56 56 56 56 56 56 57 57 57 57 56 56 56 56 56 56 55 55 55 55 55 56 55 55 55 55
4015 55 55 55 55 55 55 55 55 56 56 56 56 57 57 56 56 56 57 57 57 57 57 57 56 56 56 56 56 56 56 56 56 56 56 55 56 56 56 56 56 55 55 56 56 56 57 56 56 55 55 55 55 55 55 56 55 55 55 56 56 56 56 56 56 56 55 56 56 56 57 57
4007 57 56 56 55 55 56 56 56 56 56 56 56 56 56 56 56 56 56 56 56 56 56 56 56 56 56 56 56 56 56 55 55 55 55 55 56 56 56 56 56 56 56 56 56 56 56 56 56 56 56 56 56 56 56 56 56 56 56 56 56 56 55 55 55 55 56 56 56 56 56 56
4000 56 56 56 56 57 57 57 56 56 56 55 55 56 56 55 55 55 56 56 56 56 56 55 55 55 55 55 55 55 55 55 56 56 56 56 55 55 55 55 55 55 55 55 56 56 56 56 56 55 55 56 56 56 56 55 55 55 55 55 55 55 56 56 56 56 56 56 55 55 55 55
3992 55 55 54 54 55 55 56 56 56 56 56 55 56 56 56 56 56 56 56 57 57 56 57 57 58 58 57 57 57 57 56 56 56 56 56 56 56 56 56 56 55 56 56 56 55 55 56 56 55 55 55 55 55 55 55 54 54 55 55 55 55 55 55 55 54 54 54 55 55 55 55
3985 55 55 55 56 56 56 56 56 56 56 56 56 56 56 56 56 56 56 55 54 54 54 54 54 54 54 55 55 56 56 56 56 55 55 55 56 56 56 55 55 55 55 55 55 55 55 55 56 56 56 57 56 56 56 56 56 55 55 55 55 55 55 55 55 55 55 55 55 55 56 56
3978 56 56 56 56 57 57 56 56 56 55 55 55 55 55 55 55 55 55 56 56 56 56 56 56 56 56 55 55 55 55 55 55 55 55 55 56 55 55 55 55 55 56 56 56 56 56 57 57 57 57 56 56 55 55 55 55 54 55 55 55 56 56 56 56 56 56 56 56 56 56 56
3970 56 56 55 55 55 55 55 55 55 56 56 56 56 56 56 56 56 56 56 56 57 57 56 56 56 56 56 56 56 56 56 56 56 56 56 56 56 56 56 56 56 56 56 56 56 56 56 56 56 56 56 56 56 56 56 56 56 55 55 56 56 56 56 56 56 56 56 56 56 56 56
3963 56 56 57 57 56 56 56 56 56 55 55 55 55 55 55 55 55 56 56 55 55 55 55 55 55 55 55 55 55 56 56 56 56 56 56 56 56 56 56 56 56 56 56 56 56 55 55 55 55 56 56 56 56 55 55 55 55 56 56 56 56 55 55 55 55 55 55 55 56 56 56
3955 56 56 57 57 56 55 55 55 55 55 55 55 54 54 55 55 55 56 56 56 56 56 56 56 56 56 56 55 55 55 55 55 56 56 56 56 55 56 55 55 55 55 55 56 55 56 56 55 55 55 55 55 55 55 55 56 56 55 55 56 56 56 56 56 55 55 55 55 55 55 55
3948 55 55 55 55 55 55 55 55 55 55 55 55 55 55 55 54 54 55 55 55 55 55 54 54 55 55 55 55 55 55 55 55 55 55 55 54 54 55 55 55 55 55 55 55 55 55 55 56 55 55 55 55 55 55 55 55 55 55 55 55 56 56 56 56 56 56 55 55 55 55 55
3940 55 55 55 55 55 56 56 56 56 56 56 55 55 55 55 55 55 55 55 55 55 55 55 55 55 56 55 55 55 55 55 55 55 55 55 56 56 56 56 56 56 55 55 55 55 55 55 55 55 55 54 53 54 54 54 54 54 54 54 54 54 55 55 55 56 56 55 55 55 55 55
3933 55 54 54 54 54 53 54 54 54 55 55 55 54 54 54 54 54 54 54 55 54 54 54 54 55 55 56 56 56 55 55 55 55 55 55 55 55 55 55 55 55 56 56 56 55 54 54 55 55 55 55 55 55 55 55 54 55 55 55 55 55 55 54 54 54 54 54 53 53 54 55
3926 55 55 55 55 55 55 54 54 54 55 55 55 55 55 55 55 55 56 56 55 55 54 55 55 55 55 55 55 55 55 55 55 55 55 55 55 55 55 55 55 55 55 55 55 55 55 55 56 55 55 55 55 56 56 56 56 56 55 55 55 55 55 55 56 56 56 56 56 56 56 56
3918 56 56 55 55 55 55 56 56 56 56 56 56 56 55 56 56 56 56 56 56 56 56 55 55 55 56 55 55 55 55 55 55 55 55 56 56 55 55 55 55 55 55 55 55 55 55 55 55 55 55 55 55 55 56 56 56 56 56 55 55 55 55 55 55 55 55 55 55 55 55 55
3911 55 56 55 55 55 56 56 56 56 55 55 55 54 55 55 55 55 55 55 56 55 55 55 55 55 55 55 54 54 54 54 55 55 55 55 55 55 55 55 56 56 56 56 56 56 56 56 55 55 54 54 55 55 55 55 55 55 54 55 55 55 55 55 56 56 56 56 56 56 55 55
3903 55 55 55 55 55 55 54 54 54 55 55 55 56 56 56 56 56 56 56 56 56 56 56 56 56 56 56 56 56 56 56 56 56 56 56 56 56 57 57 57 56 55 55 55 55 55 55 55 55 55 55 56 56 56 56 56 56 56 56 57 56 56 56 56 56 55 55 55 55 56 56
3896 56 56 56 57 56 56 56 56 56 56 55 55 55 55 55 55 55 56 56 55 55 55 55 55 55 55 55 55 55 55 55 55 55 55 55 55 55 55 55 55 55 55 55 55 55 55 55 55 55 56 56 55 55 56 56 56 56 55 55 55 55 56 56 56 56 56 56 57 56 56 56
3889 56 56 56 56 56 56 55 55 56 56 56 55 55 54 55 55 55 55 54 54 54 54 54 54 55 55 55 55 55 55 55 55 55 55 56 55 55 55 55 54 54 55 55 55 55 55 56 56 56 56 56 55 56 56 56 56 56 55 55 54 54 54 54 54 54 54 54 54 54 55 55
3881 55 55 55 55 55 55 56 55 54 54 54 55 55 56 56 55 54 54 54 55 55 55 55 56 56 56 56 55 55 55 55 55 55 55 55 55 55 55 55 55 55 55 55 55 55 55 55 55 55 55 55 56 55 54 54 55 55 55 55 55 55 56 55 55 55 55 55 54 54 54 54
3874 54 54 55 55 55 55 55 55 55 55 55 55 56 56 56 56 56 56 56 56 55 56 55 55 54 54 55 55 55 55 55 55 55 55 55 54 55 55 55 55 55 55 55 55 54 54 54 54 54 54 54 54 55 55 55 55 55 55 55 55 55 54 55 55 56 55 55 55 54 55 55
3866 55 55 55 55 55 55 55 55 55 55 55 56 56 56 56 55 55 55 55 55 54 54 54 55 55 55 55 54 54 54 54 55 55 56 56 55 55 55 55 55 55 55 55 55 54 54 54 54 54 54 54 54 54 54 55 55 55 55 54 54 54 54 55 55 55 55 55 55 55 55 55
3859 55 55 55 55 54 54 54 55 55 55 54 54 54 54 55 54 54 55 55 55 55 55 55 55 55 55 54 54 54 55 55 55 55 55 55 55 55 55 55 55 55 55 56 56 56 56 55 56 56 56 56 56 56 56 56 55 55 55 55 55 55 55 55 54 54 55 55 55 55 55 55
3851 55 55 55 55 55 55 55 55 55 55 55 56 56 56 56 56 55 55 55 55 55 55 55 55 55 55 55 55 55 55 56 56 55 54 54 54 55 55 55 55 55 55 55 55 55 55 54 54 54 54 54 54 54 54 55 55 55 55 54 54 54 54 54 55 55 55 55 55 55 55 54
3844 54 54 54 55 55 55 55 55 55 56 56 55 55 56 55 55 55 55 55 56 56 56 55 55 55 55 55 55 55 56 56 56 56 55 55 55 54 54 54 54 54 54 55 55 55 55 55 55 55 55 55 56 55 55 55 55 55 55 55 54 55 55 55 55 55 55 55 56 56 56 56
3837 56 56 56 56 56 56 56 56 55 55 55 55 55 55 55 55 55 55 55 55 55 55 55 56 55 55 55 55 55 55 55 55 55 55 55 54 55 55 55 55 55 55 56 56 56 56 56 55 55 55 55 55 55 55 56 56 56 55 55 55 55 55 55 55 55 55 54 54 55 55 55
3829 55 55 55 55 55 55 55 55 55 55 55 55 55 55 55 55 55 55 56 56 55 55 55 54 54 54 55 55 55 55 55 55 55 55 55 56 56 56 55 55 55 55 55 56 56 56 56 56 55 56 56 55 55 55 55 55 55 55 55 55 55 55 55 55 56 55 55 55 55 55 55
3822 55 56 55 55 55 55 56 56 56 56 56 55 55 54 55 56 55 55 55 55 55 55 55 56 56 56 56 56 56 56 56 56 56 56 56 55 55 55 55 55 55 56 56 56 56 56 56 56 56 56 56 57 57 57 57 56 56 56 56 56 55 56 56 55 55 55 55 55 55 55 55
3814 55 54 55 55 56 56 56 56 55 55 55 56 56 55 55 55 56 56 56 56 56 56 56 56 56 56 56 56 56 56 55 55 55 56 56 56 56 56 56 56 56 55 55 55 55 55 55 55 55 55 55 55 55 55 55 55 55 55 55 54 55 55 55 55 55 55 55 55 55 55 56
3807 56 56 56 56 56 55 55 55 56 55 55 55 55 56 57 56 56 55 55 55 56 56 56 56 56 56 56 56 56 56 56 56 56 55 55 56 56 56 56 56 56 56 57 57 57 56 56 56 56 56 56 55 55 55 55 55 55 55 55 56 55 54 54 54 55 55 55 55 55 56 55
3800 55 55 55 55 55 55 55 56 56 56 56 56 56 57 56 56 56 56 56 57 57 56 56 55 56 56 56 56 56 56 56 56 56 57 57 56 56 56 56 56 56 56 56 56 55 56 56 56 56 55 55 55 55 55 55 55 55 55 56 56 56 57 57 57 57 56 56 55 55 55 55
3792 55 55 55 55 55 55 55 55 55 55 56 56 56 57 56 56 57 56 57 57 57 57 56 56 56 57 57 57 57 57 57 57 57 58 57 57 57 57 57 57 57 56 56 56 56 56 56 56 56 56 55 55 55 55 56 56 56 56 55 55 56 56 56 56 55 55 55 55 55 56 56
3785 56 56 55 55 55 56 55 55 55 55 55 55 55 55 55 56 56 55 55 55 55 54 54 54 54 55 55 55 55 54 54 54 54 54 55 55 54 54 54 54 54 54 54 54 54 54 54 54 54 55 55 55 55 55 54 55 55 55 55 54 54 55 55 55 55 55 55 55 54 54 54
3777 54 54 54 55 55 54 54 54 54 55 55 54 54 54 54 54 55 55 55 55 55 55 55 54 54 55 55 55 54 55 55 56 56 56 56 55 55 55 55 54 54 54 54 54 55 55 55 55 55 55 55 55 54 54 54 54 55 55 54 54 54 54 54 55 56 56 56 56 55 55 55
3770 55 55 56 56 55 55 55 54 55 55 55 55 55 55 55 54 54 54 54 54 54 55 55 55 55 55 55 55 55 55 55 55 55 54 55 55 56 56 56 57 57 56 56 55 54 54 54 55 55 55 55 55 55 55 55 55 55 55 55 55 55 55 55 54 54 54 54 54 54 54 55
3762 55 55 55 55 55 55 55 55 55 55 55 55 54 54 54 54 55 55 55 55 55 55 55 55 56 56 55 55 55 55 55 55 55 54 53 53 53 53 54 54 55 55 55 55 55 54 54 54 55 54 54 54 54 54 54 54 54 54 55 55 55 55 55 55 55 55 55 55 55 55 55
3755 55 55 55 55 54 54 54 55 55 54 54 54 54 54 54 54 54 54 54 55 55 56 55 55 55 55 55 56 55 55 55 55 55 55 55 55 55 56 56 56 56 56 55 55 55 55 56 55 55 55 55 55 55 55 55 55 55 55 55 55 55 55 55 55 55 55 55 55 55 55 55
3748 55 55 55 55 55 55 55 55 55 55 55 54 54 54 54 55 55 55 55 56 56 55 55 54 54 54 54 54 54 54 55 55 55 55 54 54 54 54 54 54 55 55 55 55 55 55 55 55 55 55 55 55 55 56 56 55 55 55 55 54 54 54 54 55 55 55 55 55 55 55 55
3740 55 55 55 55 54 54 53 54 54 55 55 55 55 55 55 54 54 54 55 55 55 55 55 55 55 55 54 54 54 55 55 56 56 55 54 54 54 54 54 54 54 54 55 56 56 57 56 56 56 56 55 54 54 55 55 55 55 54 54 54 54 54 54 55 55 54 54 54 54 55 55
3733 55 55 55 54 54 55 55 55 55 55 56 56 56 55 55 55 55 55 55 55 55 55 55 55 55 55 55 55 55 54 54 54 54 54 54 54 54 55 55 55 54 54 54 54 55 55 54 55 55 55 54 54 54 54 54 54 54 54 54 55 55 54 54 54 54 55 55 55 55 55 55
3725 55 54 55 55 56 55 55 55 55 55 55 54 54 54 54 54 54 54 54 54 54 54 54 55 55 55 55 55 55 55 55 55 55 55 55 56 56 56 56 55 55 55 56 56 56 56 56 56 56 56 56 55 55 55 55 55 55 55 55 55 55 56 56 56 56 56 56 56 56 56 56
3718 56 56 56 56 56 56 56 57 56 56 56 55 55 56 56 56 55 54 53 53 53 53 53 53 52 52 52 53 52 52 52 52 52 51 51 51 52 52 52 53 52 52 52 52 53 53 53 52 52 52 53 53 54 55 55 55 54 53 53 53 53 54 55 55 54 54 54 54 54 55 54
3711 54 54 54 54 54 55 54 54 54 54 54 54 54 54 55 55 55 55 55 55 56 56 56 56 56 56 56 56 56 57 57 57 57 57 57 57 57 57 57 58 58 58 58 58 59 59 60 60 60 60 61 61 61 62 63 63 64 65 66 67 67 68 69 71 73 76 80 84 89 95 101
3703 101 108 117 127 139 155 173 196 225 260 304 355 412 452 446 398 334 277 234 203 180 163 149 137 126 115 104 95 88 81 76 73 71 69 68 66 65 65 64 63 62 61 61 60 60 59 59
3698 59 59 59 58 58 58 59 58 58 58 58 57 57 58 58 58 58 58 58 58 57 57 57 56 57 57 57 57 57 57 57 57 57 57 57 57 57 58 58 59 59 59 59 58 58 59 59 59 59 59 59 59 58 58 58 59 59 59 59 60 60 60 59 58 57 57 56 56 56 57 57
3691 57 57 57 57 57 57 56 56 56 56 56 56 57 57 57 58 58 58 59 59 58 58 58 58 58 58 58 58 57 57 57 56 56 55 55 54 53 53 52 52 52 52 52 52 52 53 53 53 52 51 52 53 53 54 54 54 54 54 54 54 54 54 54 54 53 53 53 54 54 54 55
3683 55 55 55 55 55 54 54 54 54 54 55 55 55 55 55 55 55 55 55 54 54 54 54 54 54 54 54 55 55 55 54 54 55 56 55 55 55 56 56 56 56 55 55 55 55 54 54 54 54 54 54 55 55 56 56 55 55 54 54 55 55 55 55 54 54 54 53 53 53 52 53
3676 53 53 54 54 54 53 53 54 54 54 53 53 54 55 55 54 54 54 54 54 54 54 54 54 54 54 54 54 54 54 54 54 54 55 55 55 54 54 54 54 54 54 54 54 54 54 54 54 54 54 54 54 54 54 54 54 54 54 54 54 54 54 55 54 54 54 54 54 55 55 54
3669 54 54 54 54 54 54 53 54 54 54 54 54 54 54 54 55 55 54 54 54 54 54 54 54 55 55 55 55 55 55 55 55 55 55 55 54 54 54 54 54 54 54 54 55 55 55 55 54 54 54 54 55 55 55 54 54 55 54 54 54 54 54 54 54 54 54 54 54 54 54 54
3661 54 54 54 54 54 55 55 55 55 55 55 55 55 55 55 55 55 55 55 54 54 54 54 54 54 55 55 55 55 54 54 55 55 55 55 55 54 54 55 54 55 55 55 55 54 54 54 54 54 54 54 54 54 54 54 54 53 53 53 54 54 54 54 54 55 55 55 54 54 54 54
3654 54 54 54 54 54 54 54 54 53 53 53 53 53 53 53 53 53 53 54 54 54 54 54 54 54 54 55 55 55 54 54 54 54 54 55 55 56 56 56 55 55 55 55 55 55 55 54 54 54 54 55 55 54 54 54 54 55 55 55 55 55 54 54 54 54 54 54 53 53 54 54
3646 54 54 54 54 54 54 54 54 54 54 54 54 53 53 53 53 54 54 54 54 54 54 54 54 54 54 54 54 54 54 54 54 54 54 54 54 54 54 54 53 53 54 54 54 55 55 55 54 54 54 54 54 54 54 54 54 54 54 54 54 54 54 54 54 54 54 54 54 54 55 54
3639 54 54 54 54 54 54 54 54 54 54 54 54 54 54 54 54 54 54 55 55 55 55 55 55 55 54 55 55 55 55 54 54 54 54 54 54 54 54 54 54 54 54 54 54 54 54 54 54 54 54 54 54 54 54 53 53 53 53 54 54 55 55 55 55 55 54 54 54 54 54 54
3631 54 54 55 55 54 54 54 54 53 53 54 54 54 54 54 53 53 53 53 53 53 53 53 53 53 53 53 54 54 54 54 54 54 54 55 55 55 54 54 54 53 54 54 54 54 54 54 54 55 55 55 55 55 54 54 54 54 54 54 54 54 54 54 54 54 55 55 55 55 55 55
3624 55 54 54 53 54 54 54 54 54 54 54 54 54 54 55 55 55 55 54 54 54 54 54 55 55 55 55 55 55 55 54 54 54 54 54 54 53 53 53 53 53 53 53 53 53 53 53 53 53 53 53 53 53 54 54 54 54 55 55 55 55 54 54 54 54 54 54 53 53 53 54
3617 54 53 53 53 54 53 53 53 53 53 54 54 54 54 54 54 54 54 54 53 53 53 53 54 54 55 55 55 55 55 55 55 55 55 55 55 55 55 55 55 54 54 54 54 54 54 54 54 54 54 54 55 55 56 56 55 55 55 55 55 55 55 55 54 54 54 54 54 54 54 54
3609 54 54 54 54 54 53 54 54 54 54 54 55 55 55 55 56 55 55 55 55 54 54 55 55 54 54 54 54 54 54 55 55 55 55 55 55 55 55 55 55 55 55 55 55 54 54 54 54 54 54 55 55 54 54 54 54 54 54 54 54 54 54 54 53 53 53 53 53 53 53 53
3602 53 53 53 53 53 53 54 54 53 53 53 53 54 54 53 54 54 55 54 53 53 54 54 54 54 54 54 54 54 54 55 55 56 56 55 54 55 55 55 55 54 54 54 53 53 54 54 55 54 54 54 54 54 54 54 54 54 54 54 54 54 54 54 54 54 54 54 54 54 53 53
3594 53 53 54 54 54 54 53 53 53 53 53 53 53 53 53 53 54 54 54 54 54 53 54 54 54 54 54 54 53 53 53 54 54 54 54 53 54 54 55 55 55 55 55 54 53 54 54 54 54 54 54 53 54 54 54 54 54 54 54 54 54 54 54 55 54 54 54 54 54 54 54
3587 54 53 53 53 53 53 54 55 54 54 54 54 54 54 54 54 54 54 54 54 53 53 53 53 54 54 53 54 53 53 53 53 53 53 53 53 53 53 53 54 54 54 54 54 54 54 54 54 54 54 54 54 54 53 53 54 54 54 54 54 55 55 54 54 53 53 53 54 54 53 53
3580 53 54 54 54 54 54 54 53 53 53 53 53 53 53 53 53 53 54 54 54 54 54 53 53 54 54 54 54 54 54 54 54 54 54 53 53 54 54 54 54 55 55 55 55 54 53 53 53 53 53 53 53 53 53 53 53 53 53 53 53 53 54 53 54 54 54 54 54 54 54 54
3572 54 53 54 54 53 53 53 52 53 53 54 53 53 53 54 53 53 54 54 54 54 54 54 54 53 53 53 52 53 53 53 53 53 53 53 53 53 53 54 54 54 54 55 55 55 55 54 54 54 53 53 53 53 52 53 53 53 54 54 54 54 54 54 54 55 55 54 54 53 53 53
3565 53 53 53 54 54 54 54 54 54 54 54 54 54 54 54 54 54 54 55 54 53 53 53 53 53 53 53 53 53 53 53 53 53 53 53 53 54 54 54 53 53 53 53 53 53 53 53 54 54 54 54 54 54 54 53 53 54 54 54 54 54 53 53 54 54 53 53 53 53 53 54
3557 54 54 54 54 54 54 54 55 55 55 54 54 54 54 54 54 53 53 53 52 52 53 53 54 54 54 54 53 53 53 53 53 54 54 54 53 53 53 53 53 53 53 53 54 54 54 54 54 54 54 54 54 54 54 54 53 53 53 53 53 53 53 52 52 52 53 53 54 53 53 53
3550 53 52 53 53 53 53 53 53 53 53 53 53 53 53 53 53 53 53 53 54 54 53 53 54 54 54 54 54 53 53 53 53 53 53 53 53 53 53 54 54 54 54 54 54 54 54 54 53 53 53 53 53 52 52 53 54 54 54 54 54 54 53 54 54 54 54 53 53 53 53 53
3542 53 53 53 54 54 54 53 53 53 54 54 53 53 53 53 53 53 53 53 53 52 53 53 54 54 54 53 53 53 53 53 53 53 53 53 54 53 53 53 53 53 53 53 53 53 53 53 53 53 53 53 53 53 53 53 52 53 53 53 54 54 54 54 54 54 54 53 53 53 52 52
3535 52 53 53 54 54 54 53 53 54 54 54 54 54 54 53 53 53 53 53 53 53 52 52 53 54 54 54 54 54 54 54 54 54 54 54 54 54 55 54 54 53 53 53 53 54 54 54 54 54 54 54 53 53 53 53 53 53 54 54 54 54 54 54 53 54 54 54 54 54 54 54
3528 54 54 54 54 54 54 54 54 53 53 54 54 54 54 54 54 54 54 54 54 54 54 54 54 54 53 53 52 52 52 52 52 53 54 53 53 52 52 52 52 52 52 52 52 52 53 52 52 52 52 53 53 53 52 52 52 52 52 53 53 53 53 53 53 52 52 52 52 52 52 52
3520 52 53 53 53 53 53 53 53 53 53 53 53 53 53 53 53 53 54 54 54 54 54 53 53 53 53 53 53 54 53 53 53 53 54 54 54 54 53 53 53 53 53 53 54 54 53 53 53 53 53 53 53 53 52 52 53 53 53 53 53 53 53 53 53 52 52 53 53 54 54 54
3513 54 53 53 53 53 52 52 52 52 52 53 53 54 54 54 54 54 54 54 54 54 54 54 54 54 54 53 53 53 53 53 53 53 53 54 55 55 55 55 54 54 54 53 53 52 52 52 53 53 53 53 53 54 54 54 54 53 53 53 53 53 53 53 54 54 54 54 54 54 53 53
3505 53 53 54 54 54 54 55 55 55 55 55 54 54 54 54 53 53 53 53 53 54 54 54 55 55 55 54 54 54 54 54 54 54 53 53 53 53 53 53 53 53 53 53 53 53 53 53 53 53 54 54 54 54 54 54 54 54 54 54 54 54 54 54 54 53 53 53 53 54 55 55
3498 55 54 54 53 53 53 53 53 53 54 54 53 53 53 53 53 52 52 52 52 53 53 53 53 53 54 54 54 54 53 53 53 54 55 55 54 54 54 54 53 53 53 53 52 52 53 53 53 53 53 53 53 53 53 54 54 53 53 54 54 54 54 54 54 54 54 54 54 54 54 54
3491 54 53 53 53 53 53 53 53 53 53 53 53 54 55 55 54 54 54 54 54 54 54 54 54 54 54 54 54 54 54 54 53 53 54 54 54 54 54 53 53 54 54 54 54 54 53 53 54 54 54 54 54 54 54 54 54 54 54 54 54 53 53 53 53 54 54 54 53 54 54 54
3483 54 54 54 53 53 53 52 53 53 53 53 53 53 53 54 54 54 54 54 54 54 53 53 53 53 54 54 54 53 52 53 53 53 53 53 53 53 53 53 53 53 53 53 53 53 53 54 54 54 54 54 54 54 54 54 54 54 53 53 54 53 53 53 53 54 54 54 54 53 53 53
3476 53 54 53 53 53 53 53 53 53 53 53 53 54 54 54 54 54 55 55 55 55 55 55 54 54 54 53 53 53 53 53 53 53 53 53 53 53 53 53 53 53 53 54 54 54 54 54 54 54 54 54 54 53 54 54 54 54 54 53 54 53 53 52 52 53 54 54 54 54 54 54
3468 54 54 54 53 53 53 53 53 53 53 53 53 53 53 53 53 54 54 54 54 54 54 54 53 53 53 53 53 54 54 53 53 53 53 53 53 53 53 53 53 53 53 53 53 53 53 53 53 53 52 52 53 53 53 53 52 53 53 53 53 53 53 53 54 54 54 53 53 53 52 51
3461 51 51 52 52 52 53 54 53 53 53 53 52 53 53 53 53 53 53 54 54 53 53 53 52 52 53 53 53 52 52 52 53 53 53 53 53 53 53 53 53 53 54 54 54 54 54 53 53 53 53 53 53 53 53 54 54 54 54 54 54 54 54 54 53 53 53 53 53 53 53 53
3453 53 53 53 53 53 53 53 53 53 53 53 53 54 54 54 54 54 54 53 53 53 53 53 53 53 53 53 53 53 53 53 53 53 53 53 52 53 53 53 54 54 54 54 54 53 53 53 53 54 54 54 53 53 53 53 53 53 53 53 54 54 54 54 54 54 54 54 54 54 54 54
3446 54 54 54 53 53 52 52 53 52 52 53 53 54 53 53 53 53 53 53 53 53 53 53 53 53 54 54 53 53 53 53 53 53 54 54 54 54 54 54 54 54 54 53 53 53 54 54 54 54 54 54 54 54 53 54 54 54 54 54 54 54 54 53 53 53 53 53 53 53 52 53
3439 53 53 53 53 53 53 53 54 54 53 53 53 53 53 53 54 54 54 53 53 54 54 53 53 53 53 53 53 53 53 53 54 54 54 54 54 54 54 53 53 52 52 53 53 53 53 53 53 53 53 53 53 54 54 54 53 53 53 53 53 54 54 54 54 54 54 54 54 54 54 53
3431 53 53 53 53 53 53 54 54 54 54 53 53 53 53 53 53 53 54 54 54 54 54 54 54 54 54 54 54 54 54 54 54 53 53 53 53 53 53 53 52 52 52 52 52 53 53 53 53 53 53 53 53 53 53 53 53 53 53 53 53 53 53 53 53 53 53 53 52 53 53 53
3424 53 53 53 53 53 53 54 54 55 55 55 55 55 55 54 54 54 54 54 54 53 53 53 53 53 52 53 53 54 54 54 54 54 54 54 53 53 53 53 53 53 54 54 55 54 54 54 53 53 53 53 53 53 53 53 52 52 53 53 53 53 53 53 53 52 52 53 54 53 53 53
3416 53 53 53 52 53 53 53 54 54 54 53 53 53 53 53 54 54 54 54 54 54 54 54 54 54 53 53 53 53 53 53 53 53 53 53 53 53 54 54 54 54 54 54 53 53 53 54 53 54 54 53 53 53 53 53 53 53 53 53 53 53 53 52 52 52 53 53 53 53 53 53
3409 53 53 52 53 53 53 52 52 52 52 52 53 53 53 53 53 53 53 53 53 53 53 53 53 53 53 53 53 53 53 53 54 54 53 53 53 53 53 53 53 53 53 53 54 54 54 53 53 53 53 53 53 53 53 53 53 52 52 52 53 53 53 53 53 53 53 53 53 53 53 53
3402 53 53 53 53 53 53 53 53 53 53 54 54 54 54 53 53 53 53 53 53 53 53 53 54 53 53 52 51 52 53 53 53 53 54 53 53 53 52 53 53 53 53 53 53 53 53 53 53 53 53 54 54 53 54 54 54 53 53 53 52 52 52 52 52 52 52 52 52 52 52 52
3394 52 52 52 53 53 54 54 53 53 53 53 53 53 53 53 53 53 54 54 54 54 54 53 53 53 54 54 54 53 53 53 53 52 52 52 52 53 54 54 53 53 53 53 53 52 52 53 53 53 53 53 53 53 53 53 53 53 53 53 52 52 52 52 53 53 53 53 53 53 54 54
3387 54 54 54 54 54 54 54 54 53 53 52 52 52 52 52 52 52 53 53 53 53 52 52 52 52 52 51 52 52 52 53 53 53 53 53 53 53 53 52 52 52 52 52 52 52 52 52 52 53 53 54 54 53 53 54 54 53 53 52 52 52 52 53 53 53 53 52 52 53 54 54
3379 54 53 53 53 53 53 53 53 53 53 53 53 53 53 53 52 52 52 52 52 52 52 52 53 53 53 53 53 53 53 53 52 52 52 52 52 52 53 53 53 53 52 52 51 52 52 53 53 52 53 53 53 53 53 54 54 53 54 54 53 53 53 53 53 53 53 53 53 53 54 53
3372 53 53 53 52 53 53 53 53 53 53 52 52 52 52 52 53 52 53 53 53 52 52 52 52 52 52 52 52 52 52 53 53 53 52 52 52 52 52 53 53 52 52 52 51 52 52 53 53 52 52 52 52 52 52 53 52 52 52 52 52 52 51 52 52 53 53 53 52 53 53 53
3364 53 53 53 54 53 53 53 52 53 53 53 53 53 53 54 54 54 54 54 53 53 52 52 52 52 52 52 52 52 53 53 53 52 52 52 51 52 52 53 53 53 53 53 53 52 52 52 52 53 53 53 54 53 53 53 52 53 53 53 53 53 53 52 52 52 52 52 52 52 52 52
3357 52 52 52 52 52 53 53 53 53 53 53 54 54 54 54 54 53 53 52 52 52 52 52 52 52 53 53 53 53 53 53 53 53 53 53 53 53 53 53 53 54 54 53 53 53 53 53 53 53 52 52 52 52 52 53 53 52 52 52 52 53 53 53 53 53 53 52 52 53 53 54
3350 54 53 52 52 52 52 53 53 53 53 52 52 52 52 52 52 51 51 52 52 53 53 53 53 53 53 53 53 53 52 52 53 53 53 53 53 53 53 53 52 52 52 52 52 52 52 53 53 53 53 53 53 53 53 53 53 53 53 53 53 53 54 53 53 52 52 52 52 52 52 52
3342 52 53 53 53 53 53 53 53 53 53 53 53 53 53 53 54 54 54 54 54 54 54 53 53 53 53 53 53 53 52 52 52 52 52 52 52 52 52 52 52 52 52 52 52 51 51 51 52 52 52 52 52 52 53 53 53 54 54 54 54 54 54 53 53 53 53 52 52 52 51 52
3335 52 53 52 52 52 52 52 53 53 54 54 54 54 54 54 54 54 53 53 53 53 52 52 52 52 52 52 52 52 52 53 53 53 53 53 52 53 53 53 52 52 53 53 54 53 53 53 53 53 54 54 54 53 53 52 52 52 53 53 53 53 52 52 52 52 52 53 53 53 54 53
3327 53 53 53 53 53 53 53 53 53 53 53 53 52 53 52 52 52 53 53 53 53 53 53 53 53 53 53 53 53 54 54 54 54 53 53 53 53 53 53 53 53 53 53 53 53 53 53 53 53 53 52 52 52 52 51 51 52 52 53 53 53 53 53 53 53 53 53 53 53 53 53
3320 53 53 52 52 53 53 53 52 53 53 53 53 53 52 52 52 52 52 52 51 51 52 52 52 53 53 53 53 53 53 53 53 53 53 53 53 53 53 53 53 53 52 53 53 53 53 53 53 52 52 52 53 53 53 53 54 54 54 54 54 53 53 53 53 53 53 53 54 54 53 53
3313 53 52 52 52 53 53 53 53 53 53 52 52 53 53 53 52 52 52 52 52 52 52 52 52 52 52 53 53 53 53 53 53 52 52 53 53 53 52 52 53 53 52 52 51 52 52 53 53 53 53 54 54 54 53 53 53 53 53 53 53 52 53 53 53 53 53 53 53 53 53 52
3305 52 52 52 52 52 52 52 52 53 54 53 53 53 52 52 52 53 53 52 52 53 53 52 52 52 53 53 53 53 53 53 53 53 53 53 53 53 52 52 52 52 53 53 53 54 54 54 53 53 53 53 53 54 54 54 53 52 52 53 53 53 54 53 53 53 52 52 52 53 53 53
3298 53 53 53 53 53 53 53 53 53 52 52 52 52 52 52 52 52 53 53 53 53 54 53 53 53 53 53 52 52 52 52 52 52 52 52 52 52 52 53 53 53 53 53 53 53 53 52 52 52 52 52 52 53 53 53 53 53 53 53 53 53 53 53 53 53 54 53 53 53 53 53
3290 53 53 53 52 52 52 51 51 51 51 51 52 52 53 53 52 52 52 52 53 53 53 53 53 53 53 53 53 53 54 53 53 53 53 53 53 53 53 53 54 53 53 53 53 52 52 52 52 52 52 52 53 53 53 52 52 52 52 52 52 52 52 53 53 53 54 54 54 54 54 54
3283 54 54 54 54 54 54 53 53 53 53 54 54 53 53 53 52 52 52 52 52 52 53 53 53 53 52 52 52 52 51 51 51 51 51 51 52 52 52 52 53 53 53 53 52 53 53 53 53 54 54 53 52 52 51 51 51 51 52 53 52 52 52 52 51 51 52 52 52 52 52 52
3275 52 53 54 54 53 53 53 53 54 54 54 54 54 54 53 53 53 53 53 53 54 53 53 53 53 53 53 53 53 53 53 53 52 52 52 52 52 52 52 52 52 52 53 53 53 52 52 52 52 52 53 53 53 52 52 52 52 53 53 52 52 51 51 51 52 52 52 52 53 52 52
3268 52 51 51 52 52 53 53 53 53 53 53 53 53 53 53 52 52 52 52 53 54 54 53 53 53 53 53 54 53 53 53 53 53 53 53 53 53 53 53 52 52 52 52 53 53 53 53 53 52 53 53 53 52 52 52 52 52 53 52 52 52 53 53 53 53 53 53 53 54 54 54
3261 54 54 54 54 53 53 53 53 54 54 54 53 53 53 53 53 53 53 53 53 53 53 53 53 53 53 53 53 53 53 53 53 52 52 52 52 52 52 52 53 53 53 53 53 52 52 52 52 52 52 52 51 52 53 53 53 53 53 53 53 53 54 53 53 53 53 53 53 53 53 53
3253 53 53 52 52 52 53 53 53 54 54 53 53 52 52 51 51 51 51 51 51 52 52 53 52 52 52 52 52 52 52 52 52 53 53 52 52 52 52 52 53 53 52 52 52 52 52 53 53 53 53 53 53 53 53 53 53 53 53 53 53 52 52 52 51 51 52 52 52 52 52 52
3246 52 52 52 52 52 53 52 52 52 52 52 52 52 52 52 53 52 52 52 52 52 52 52 52 52 52 52 52 52 51 52 52 52 52 52 53 53 53 53 52 52 52 52 53 53 53 53 53 52 52 52 52 52 52 52 52 52 52 53 53 52 52 52 52 52 52 52 53 52 52 52
3238 52 52 52 52 53 53 53 53 53 53 52 52 52 52 52 53 53 53 53 53 52 52 52 52 52 52 52 52 52 52 53 53 53 53 53 53 53 53 53 53 52 52 52 52 52 52 52 52 52 53 53 53 53 53 52 52 52 52 52 52 52 52 52 52 52 52 52 52 52 52 51
3231 51 51 51 51 51 52 52 52 52 53 53 53 53 53 52 52 52 52 52 52 52 52 52 52 52 52 52 52 52 51 52 52 52 51 51 50 50 51 51 52 52 52 52 52 52 52 52 53 53 52 52 52 52 52 52 53 53 53 53 53 52 53 54 54 53 53 53 53 53 53 53
3224 53 52 52 52 52 52 52 52 52 52 52 52 52 52 52 52 52 52 52 52 53 53 53 53 53 53 53 52 52 52 52 52 52 52 51 51 51 52 52 52 52 52 52 52 52 51 51 51 51 51 51 51 52 52 52 52 52 52 52 51 51 51 52 52 52 51 52 52 52 52 52
3216 52 51 51 51 51 52 52 51 51 51 51 51 51 51 51 51 51 51 51 51 52 52 52 53 52 52 52 52 53 53 53 52 53 53 53 53 53 53 53 53 53 53 53 53 53 53 53 53 53 53 52 52 52 52 52 51 51 51 51 51 51 51 52 52 52 52 52 52 52 52 52
3209 52 52 52 52 53 53 53 52 52 52 52 52 52 52 53 53 53 53 52 52 52 53 53 53 52 52 52 52 52 52 52 52 52 52 52 52 52 52 53 53 53 53 53 53 52 52 52 52 52 52 52 52 52 52 52 52 52 52 53 53 53 53 53 53 53 53 52 52 52 52 52
3201 52 52 52 52 52 52 52 52 52 52 52 52 52 52 52 52 51 51 51 52 51 52 53 53 53 53 52 52 52 52 52 51 51 52 52 52 52 52 52 52 52 52 52 52 52 52 52 52 51 51 52 52 52 52 52 52 52 51 51 51 51 51 51 51 52 52 52 52 51 51 51
3194 51 52 52 52 52 52 52 51 51 52 52 52 52 52 52 52 53 52 52 52 52 52 52 52 53 53 53 53 53 53 52 52 52 52 53 53 52 52 52 52 51 51 51 51 51 51 51 51 51 51 51 51 52 52 52 52 52 52 52 52 52 52 52 51 51 50 51 51 51 51 51
3186 51 51 51 51 51 51 51 51 52 52 52 51 51 50 50 50 51 52 52 52 52 52 52 52 51 51 52 53 53 52 52 52 52 52 52 52 51 51 51 51 51 51 51 51 51 51 51 51 52 52 52 52 52 52 52 52 52 52 52 52 52 52 52 53 53 53 53 52 52 52 52
3179 52 52 52 52 52 52 52 52 51 51 51 51 51 52 52 52 52 52 52 51 51 52 52 52 52 52 52 52 51 51 51 51 51 51 52 52 52 52 52 51 51 51 51 51 51 51 52 52 52 52 52 52 52 52 52 52 53 53 53 53 52 52 52 51 51 51 51 51 52 52 52
3172 52 52 52 52 52 52 52 52 52 52 52 52 52 51 51 52 51 51 50 51 51 52 52 52 52 52 52 52 52 52 52 52 52 52 52 51 51 50 51 51 51 51 51 51 52 52 52 51 52 52 52 52 52 52 52 52 52 52 52 51 51 51 51 51 51 51 51 52 52 52 52
3164 52 52 52 51 51 51 52 52 52 52 52 52 52 52 52 52 52 52 52 52 52 51 51 51 51 51 51 51 52 52 53 52 51 51 51 52 52 52 51 51 51 52 52 52 52 52 53 53 52 52 52 52 52 52 52 53 52 52 52 52 52 52 52 52 52 52 52 52 52 51 51
3157 51 52 52 52 52 51 52 53 53 53 53 52 52 52 52 53 52 52 52 51 51 51 51 51 51 50 51 51 51 51 51 52 51 51 51 51 51 51 51 52 52 52 52 51 52 52 53 53 52 52 52 52 52 52 52 52 52 51 51 51 51 51 51 51 52 52 52 52 52 53 52
3149 52 52 52 51 52 52 52 52 52 51 51 51 51 51 51 51 51 51 51 51 51 52 52 52 53 53 53 53 53 53 53 53 52 52 52 52 51 51 51 51 51 51 51 51 51 51 52 52 52 52 52 52 52 52 52 52 52 52 52 52 52 51 51 51 51 51 52 52 51 51 51
3142 51 51 51 51 52 52 51 52 52 51 51 52 52 52 52 51 51 51 51 51 51 51 51 52 52 52 52 52 52 52 52 52 51 51 51 51 52 52 52 52 51 51 52 51 51 51 52 52 52 52 52 51 51 52 52 51 51 51 51 52 52 52 52 52 52 52 52 52 52 52 52
3135 52 52 52 52 52 52 52 52 52 52 52 52 51 52 52 52 52 52 52 52 52 52 52 52 52 51 51 51 51 51 51 52 52 52 52 52 51 51 52 51 51 52 52 52 51 52 52 52 52 51 51 51 51 51 52 52 52 52 51 51 51 51 51 51 52 52 52 53 52 52 52
3127 52 51 51 51 51 51 51 51 52 52 52 52 52 52 52 51 51 51 51 51 51 51 51 51 51 51 52 52 52 52 52 52 52 52 52 52 51 51 51 52 52 53 52 52 52 52 52 51 51 51 51 51 51 51 51 51 51 51 51 51 51 51 51 51 52 52 51 51 51 51 50
3120 50 50 50 50 51 51 51 52 51 51 51 52 52 52 52 51 51 51 51 51 51 51 51 51 51 51 51 52 52 52 51 51 52 52 52 52 52 52 52 51 51 51 52 52 52 52 52 52 52 52 52 52 52 52 52 52 52 52 52 52 52 52 52 52 52 52 51 51 51 51 51
3112 51 51 51 51 51 51 51 51 51 51 51 51 51 51 51 52 52 52 52 52 52 51 51 51 51 51 51 51 52 52 52 52 52 52 51 51 51 51 51 51 52 52 52 53 53 52 52 52 52 52 52 52 52 52 52 52 52 52 51 51 51 50 50 50 51 51 51 52 51 52 52
3105 52 52 52 52 51 52 52 52 52 51 51 51 51 51 51 51 51 52 52 52 52 52 52 52 52 51 52 52 52 52 52 52 52 52 52 52 52 52 51 51 51 52 52 52 52 52 51 51 52 52 51 51 51 51 52 52 52 52 51 51 52 51 52 52 52 52 52 52 52 52 52
3097 52 52 52 52 52 52 52 52 52 52 52 52 53 52 52 51 51 51 51 51 51 51 51 51 51 50 51 51 51 51 51 51 51 51 52 52 52 52 52 52 52 51 51 51 51 50 51 51 51 51 51 51 50 50 51 51 51 51 51 51 51 50 50 50 50 51 51 51 51 51 51
3090 51 51 51 51 51 51 51 51 51 51 52 52 52 52 52 52 52 52 52 52 52 52 52 52 52 52 52 52 52 52 52 52 52 52 52 52 52 52 52 52 52 52 52 52 52 52 52 52 52 52 52 52 52 51 51 51 51 51 51 51 51 51 51 51 51 51 51 51 51 51 51
3083 51 52 52 52 51 51 51 51 51 51 50 50 51 51 51 52 52 52 52 52 53 53 52 53 53 52 52 52 51 51 51 51 51 51 51 51 51 50 51 51 51 51 52 52 53 53 53 52 51 51 51 51 52 52 51 51 51 51 51 51 51 51 51 51 51 51 51 52 52 52 52
3075 52 52 52 52 52 52 52 52 52 52 52 52 51 51 52 52 53 52 52 52 51 51 51 51 51 51 51 51 51 51 51 51 51 51 51 51 52 52 52 52 52 51 51 51 51 51 52 52 51 51 51 51 51 51 52 52 52 51 51 51 51 51 51 51 51 51 51 51 51 51 51
3068 51 51 51 51 51 51 52 52 52 52 52 52 52 52 51 51 51 52 52 52 52 52 51 51 52 52 52 52 52 52 51 51 52 51 51 52 52 52 52 51 51 51 50 51 51 51 51 51 51 51 51 52 52 52 51 51 51 51 51 51 51 52 52 52 52 52 52 52 52 52 52
3060 52 52 52 52 52 51 51 51 51 51 51 51 51 52 52 52 52 52 52 52 52 52 51 51 50 50 50 51 51 51 51 51 52 52 52 52 52 52 52 52 52 52 52 52 52 52 52 52 52 53 52 52 52 52 52 53 52 52 52 52 52 52 51 51 51 51 51 52 52 52 52
3053 52 52 52 52 52 52 52 52 51 51 51 51 51 51 51 51 50 50 50 50 51 51 51 51 52 51 51 51 51 52 51 51 51 51 51 52 52 53 52 52 51 51 51 51 51 51 51 51 51 51 51 51 51 51 51 51 51 51 52 52 52 52 52 51 52 52 52 52 51 51 51
3046 51 51 51 51 51 51 51 51 51 51 50 50 51 51 51 51 51 51 51 51 52 52 52 52 52 52 52 52 52 52 52 52 52 52 52 52 52 52 52 52 52 52 52 52 52 51 52 52 52 53 52 52 52 52 52 52 52 52 53 53 52 52 51 51 51 51 51 51 51 51 51
3038 51 51 52 52 52 52 51 51 52 52 52 52 52 52 52 51 51 51 51 52 51 51 51 51 51 51 51 51 51 51 51 51 51 51 51 51 51 51 51 51 51 51 51 51 52 52 52 51 51 51 51 51 51 50 51 51 51 51 51 51 51 51 52 52 52 52 53 53 52 52 52
3031 52 51 51 51 51 51 51 52 51 51 51 50 50 50 50 50 51 51 51 52 52 52 52 52 52 52 51 51 51 51 51 51 51 51 51 51 51 51 51 51 51 52 52 52 52 52 52 52 51 51 51 51 51 51 52 52 52 51 51 51 51 51 51 51 51 51 51 51 51 51 51
3023 51 50 50 50 50 50 49 49 50 50 51 51 51 51 51 52 52 52 52 51 51 51 51 51 52 52 52 52 52 52 52 52 52 52 52 52 51 52 52 52 52 52 51 51 51 51 51 51 51 51 51 52 52 52 52 51 51 51 51 52 52 52 52 52 52 52 53 53 53 53 53
3016 53 53 53 53 53 53 52 52 53 53 53 53 53 53 53 53 53 53 52 51 51 51 52 52 52 51 51 51 51 51 51 51 51 51 51 51 51 51 51 51 51 51 51 51 51 51 51 51 50 50 50 50 50 51 51 51 51 51 51 50 51 51 52 52 51 51 50 51 51 52 52
3008 52 52 52 51 51 51 51 51 50 50 50 50 51 51 51 51 51 52 52 52 52 52 52 52 52 51 52 52 52 52 52 52 52 51 51 51 51 51 51 51 51 51 51 51 51 52 52 52 52 52 52 52 51 51 51 51 51 51 51 51 52 52 52 52 52 52 51 51 51 51 51
3001 51 51 51 51 51 51 51 51 51 51 51 51 51 50 51 51 51 52 52 52 53 52 51 51 51 51 51 51 51 51 51 51 51 52 52 52 52 52 51 51 51 51 52 52 52 51 51 51 51 51 50 50 51 51 51 51 52 51 52 52 52 52 51 51 50 50 50 50 50 51 51
2994 51 51 51 51 51 52 52 52 52 52 52 52 51 51 51 51 51 51 51 51 51 51 52 52 52 52 52 51 51 50 50 51 51 51 51 51 50 50 50 51 51 51 51 51 51 51 51 51 51 51 51 51 51 51 51 52 52 52 52 52 52 52 52 52 52 51 51 51 51 51 51
2986 51 51 51 51 51 51 51 51 51 51 51 50 50 51 51 51 51 51 51 51 52 52 51 51 51 51 51 51 51 51 51 51 51 52 52 51 51 52 52 52 52 52 51 51 51 51 51 51 51 51 51 51 51 51 51 51 51 51 51 51 51 51 51 51 51 51 51 52 52 52 52
2979 52 52 52 52 52 52 52 52 52 51 51 51 51 51 51 51 51 51 51 50 50 50 50 50 50 50 50 50 50 51 50 50 50 50 51 51 51 52 52 52 51 51 51 51 52 51 51 51 52 52 51 51 52 51 51 52 52 52 52 52 52 52 52 52 52 52 52 52 52 51 51
2971 51 51 51 51 51 51 51 51 51 51 51 51 50 50 50 50 50 50 50 50 50 50 50 51 51 52 52 52 52 52 51 51 51 51 51 50 50 50 51 51 51 51 51 51 51 51 51 51 52 52 52 52 52 51 51 51 50 50 50 50 51 51 51 50 50 51 51 51 51 51 50
2964 50 50 50 50 50 50 51 51 51 52 52 51 51 52 52 52 53 53 52 52 51 51 51 51 51 51 51 50 50 50 50 50 51 51 51 50 50 50 50 50 50 51 51 51 51 51 51 52 52 52 51 51 51 50 50 50 50 51 51 51 51 51 51 51 51 51 51 51 51 51 51
2956 51 51 51 52 52 52 52 51 51 51 51 51 51 51 51 51 51 51 51 51 51 51 51 51 51 51 50 50 50 50 50 50 50 50 51 51 51 51 51 51 51 50 50 50 51 51 51 50 50 50 51 51 52 52 52 51 51 51 51 51 51 51 51 51 51 51 51 51 51 51 51
2949 51 51 51 51 51 51 51 51 51 51 51 51 51 51 51 51 51 51 51 52 52 52 52 52 52 51 51 51 51 51 51 51 52 52 52 52 52 51 52 52 52 52 52 51 51 51 51 51 51 51 51 50 50 50 51 51 51 52 52 52 51 51 51 51 51 51 51 51 51 52 52
2942 52 52 52 52 52 51 51 51 51 51 51 52 52 51 51 51 52 52 52 52 52 52 51 51 50 50 50 50 50 51 51 51 51 51 52 52 51 51 51 51 51 50 50 50 51 51 51 50 50 50 51 51 52 52 51 51 51 51 51 51 52 52 51 51 51 51 51 51 51 51 51
2934 51 51 51 51 51 51 51 51 51 51 51 52 52 52 52 52 52 52 52 52 52 52 52 51 51 51 51 51 51 51 52 52 52 52 52 52 52 52 52 52 52 52 52 52 52 51 52 52 52 51 51 51 51 51 51 50 50 50 50 50 50 50 51 50 49 50 50 50 50 50 50
2927 50 50 50 50 51 50 51 51 51 50 50 50 50 50 50 50 50 51 51 51 51 51 51 51 51 51 51 50 50 50 50 50 50 50 51 51 51 51 51 51 51 51 51 51 51 51 51 52 51 51 51 50 50 51 51 51 51 52 51 51 51 51 51 52 52 51 51 51 51 52 52
2919 52 52 52 52 51 51 51 51 51 51 51 51 52 51 51 51 51 51 51 51 52 52 51 52 52 52 52 52 52 52 52 51 51 52 51 51 51 51 51 51 52 52 51 51 51 51 50 50 50 51 51 52 52 51 52 52 52 51 51 51 52 52 51 51 51 51 51 51 50 50 50
2912 50 49 50 50 51 52 52 52 52 52 52 51 51 51 51 50 51 51 51 51 51 52 52 52 52 52 51 51 51 50 51 51 51 51 51 51 50 50 50 51 51 51 51 52 52 51 51 51 50 50 50 50 50 50 50 50 51 51 52 52 52 52 51 51 51 51 51 51 51 51 51
2905 51 50 50 50 50 50 51 51 51 51 51 51 51 51 51 51 51 51 51 51 51 51 50 51 51 51 51 51 51 51 50 50 50 49 50 50 51 51 51 51 50 50 51 51 51 51 50 50 50 51 51 51 52 52 52 52 52 52 51 51 51 51 51 51 51 51 51 51 51 52 52
2897 52 51 51 51 51 51 51 51 51 51 51 51 51 51 50 50 50 50 50 51 50 50 50 50 50 50 51 51 51 51 51 50 50 50 50 50 50 50 51 51 51 51 50 50 50 51 51 51 51 51 51 51 51 51 51 51 50 50 50 50 50 50 50 50 50 49 50 51 51 52 52
2890 52 52 52 52 52 51 51 50 50 50 51 51 51 51 51 51 51 51 51 51 51 51 51 52 51 51 51 51 51 51 51 51 51 51 51 51 51 51 51 51 51 52 52 52 51 51 51 51 51 51 51 51 51 51 51 51 51 51 51 51 51 51 50 50 51 51 51 51 51 51 51
2882 51 51 51 51 51 51 51 51 51 51 51 51 51 50 50 50 50 50 50 50 50 50 50 50 50 50 50 50 51 51 51 51 51 51 51 51 51 51 52 52 52 52 52 52 52 51 51 51 50 50 50 50 50 51 51 51 52 51 51 51 51 52 52 52 52 51 51 51 51 51 50
2875 50 50 50 50 50 50 50 50 50 50 50 50 50 50 50 51 51 51 51 51 51 51 51 51 51 51 51 50 50 50 50 50 50 50 50 50 51 51 51 50 50 50 50 51 51 51 51 51 50 50 50 51 51 51 51 51 51 51 52 52 52 52 51 50 51 51 51 51 51 50 50
2867 50 50 50 50 50 50 50 50 51 51 51 51 51 50 50 50 50 50 50 50 51 51 51 51 51 51 51 52 51 51 51 51 51 51 51 51 51 50 50 50 50 50 50 51 51 51 51 51 51 51 51 51 51 51 50 50 50 50 51 51 51 51 51 50 51 51 51 51 51 50 50
2860 50 50 50 50 51 51 51 51 51 52 51 51 51 51 51 51 51 51 51 51 51 51 51 51 51 51 51 51 51 51 51 50 50 50 50 50 50 51 51 51 51 51 50 50 50 51 50 50 50 50 50 51 51 51 51 51 50 51 51 51 51 51 51 51 50 50 51 51 51 51 51
2853 51 51 51 51 51 51 51 51 51 50 50 51 51 52 52 52 51 51 51 51 51 50 50 50 50 50 50 49 50 50 50 50 50 50 50 50 50 50 50 49 50 50 50 49 50 50 50 50 50 50 50 50 51 51 51 50 50 49 49 50 50 50 50 50 50 50 50 51 51 50 50
2845 50 50 50 51 51 51 51 51 51 51 51 51 51 51 51 51 51 51 51 51 51 51 51 51 51 51 51 51 51 51 51 51 50 50 50 51 51 51 51 50 50 50 50 50 50 51 50 50 50 51 51 51 51 51 51 50 50 50 50 50 50 50 50 50 51 51 51 51 50 51 51
2838 51 52 51 51 51 51 51 51 51 50 50 49 50 50 51 51 51 51 50 50 50 51 51 51 50 50 50 51 51 51 51 50 50 50 50 50 51 52 52 51 50 50 51 51 51 51 51 51 51 51 51 51 51 50 49 50 50 51 52 52 52 52 52 52 51 51 52 51 51 51 50
2830 50 50 50 51 51 51 51 51 52 51 51 51 51 52 53 53 52 51 52 52 52 52 52 52 52 51 52 52 52 52 53 53 53 53 53 53 52 52 51 51 51 51 52 52 52 52 52 51 50 50 50 50 50 50 50 50 50 50 50 50 51 50 50 51 51 51 50 50 51 51 51
2823 51 51 51 51 51 51 51 50 50 50 50 50 51 51 51 51 51 50 50 50 50 50 50 50 50 50 51 50 50 51 51 51 51 51 51 50 51 51 51 51 51 51 51 51 51 51 51 51 51 51 51 51 51 52 52 52 51 51 50 50 50 50 50 50 50 51 51 51 51 51 51
2816 51 51 51 51 51 51 51 50 50 50 50 50 51 51 51 51 51 51 51 50 50 50 50 51 51 51 51 50 50 50 50 51 51 51 51 51 51 51 51 51 51 51 50 50 50 50 50 50 50 50 50 50 50 50 50 50 50 50 51 51 50 51 51 51 51 51 51 51 51 51 51
2808 51 51 51 51 51 50 50 50 50 50 51 51 51 51 50 50 50 51 50 50 50 50 51 51 50 50 50 50 50 51 51 51 51 51 51 51 51 51 50 51 50 50 51 51 51 51 51 51 51 50 50 50 50 51 51 51 51 51 51 51 51 51 51 51 51 51 51 51 50 50 50
2801 50 49 49 49 49 49 50 50 50 51 50 49 49 49 49 50 50 50 50 50 50 50 50 50 50 50 50 50 50 50 50 50 50 50 50 50 50 51 51 51 51 51 51 50 50 51 51 51 51 51 51 50 50 50 50 50 50 50 50 50 50 50 50 50 50 50 50 51 50 51 51
2793 51 51 51 51 51 50 50 50 50 50 50 50 50 51 51 50 50 50 50 50 50 50 50 50 50 51 51 51 51 51 51 51 51 51 51 51 51 51 51 51 51 50 50 50 50 50 50 50 51 51 50 50 50 50 50 51 50 50 50 50 50 50 50 50 50 50 50 50 50 50 51
2786 51 51 50 50 51 51 51 51 51 51 50 50 50 50 51 51 51 50 50 50 50 50 49 49 49 49 50 50 50 51 50 50 50 50 50 50 50 51 51 51 51 50 50 50 50 50 50 50 50 50 50 50 50 51 51 51 51 52 52 52 51 51 51 51 51 51 51 50 50 50 50
2778 50 50 50 50 50 50 50 51 51 51 51 51 50 50 50 50 51 51 51 51 52 51 51 51 51 51 52 52 52 52 52 51 51 50 50 51 50 50 50 50 50 49 50 50 50 50 50 50 50 50 50 50 50 50 50 50 51 51 50 51 51 51 51 51 51 51 51 51 51 51 52
2771 52 52 52 51 51 51 51 51 51 50 50 51 51 51 51 51 51 50 50 50 50 50 50 50 50 50 50 50 50 50 50 50 50 50 50 50 49 49 49 50 50 50 50 50 50 50 50 51 50 50 49 49 50 50 50 51 51 50 50 50 50 50 50 50 51 51 51 52 51 51 51
2764 51 51 51 51 51 51 51 51 51 51 51 51 50 51 51 51 50 50 50 50 50 50 50 50 50 50 50 50 50 51 51 51 51 51 51 51 51 51 51 51 51 51 51 51 51 51 51 51 51 51 51 51 50 50 49 49 49 49 49 50 50 50 50 50 50 50 51 51 51 51 50
2756 50 50 50 50 49 49 49 49 49 49 49 49 50 50 50 50 50 49 50 50 50 50 50 50 50 50 50 50 50 50 50 50 50 50 50 50 50 50 50 50 50 50 50 50 50 50 49 49 49 49 49 49 49 49 49 49 49 49 50 50 51 51 51 51 51 51 50 50 50 49 50
2749 50 50 50 50 50 49 50 50 50 50 50 50 50 50 51 50 50 50 50 50 50 50 50 51 50 50 50 50 50 50 50 50 50 49 49 49 49 49 50 50 50 50 50 51 51 51 51 50 50 50 50 50 50 50 50 50 50 50 50 50 50 50 50 50 50 50 50 50 50 50 50
2741 50 50 50 50 50 50 51 51 50 51 51 50 50 50 50 50 50 50 50 50 50 50 50 51 51 51 51 51 50 50 51 51 50 50 49 50 50 50 49 49 50 49 49 49 50 50 51 51 51 50 50 51 50 50 50 50 50 51 51 51 51 51 51 51 51 51 50 49 49 49 50
2734 50 50 50 50 51 51 51 50 50 50 50 50 50 49 49 50 50 50 51 51 51 50 50 50 49 49 49 50 50 50 50 50 50 50 50 50 50 50 50 50 50 50 50 50 50 50 51 50 50 50 50 50 50 50 50 51 51 51 51 51 51 50 50 50 50 50 50 50 50 50 50
2727 50 50 50 50 50 50 50 50 50 50 50 50 50 50 50 51 51 51 51 51 50 50 50 50 50 50 50 50 50 49 49 49 49 49 49 50 50 50 50 50 50 50 50 51 51 51 51 51 51 51 51 50 50 50 50 51 51 51 51 52 52 51 51 50 49 49 49 49 49 49 50
2719 50 50 51 50 50 50 50 50 50 51 51 50 50 50 50 50 50 50 50 50 50 50 50 50 50 50 50 50 51 50 50 50 50 50 51 51 51 51 51 50 50 50 50 50 50 50 50 50 50 50 50 50 50 50 49 49 49 49 50 50 50 50 51 51 50 50 49 49 49 50 50
2712 50 51 51 50 50 50 50 50 50 51 50 50 50 50 50 50 50 50 50 50 50 50 50 51 51 51 51 51 50 50 50 50 50 50 50 50 50 50 50 50 50 50 49 49 50 50 50 50 50 50 50 50 51 50 50 50 50 50 50 50 50 51 51 51 51 50 50 50 50 50 50
2704 50 50 50 50 50 50 50 50 50 50 49 49 50 50 50 51 51 50 50 50 50 49 49 49 49 49 50 50 51 51 51 51 51 50 50 50 51 51 50 50 50 51 50 50 51 51 51 51 51 51 52 52 53 53 53 53 53 53 53 54 54 55 56 56 57 57 57 56 56 57 57
$$ [...]
-2638D5
##END=		$$ NMR SPECTRUM
##END=		$$ LINK
