##TITLE=	RP314 char.10.fid
##JCAMP-DX=	6.0	$$ MestReNova 14.3.3-33362
##DATA TYPE=	LINK
##BLOCKS=	1    
##ORIGIN=	Mestrelab Research S.L.
##OWNER=	hrzepa
##$MNOVA/METADATA=	(DOCUMENT,BASE64)
eyJuYW1lIjoiL1VzZXJzL2hyemVwYS9MaWJyYXJ5L01vYmlsZSBEb2N1bWVudHMvY29tfmFwcGxlfkN
sb3VkRG9jcy9TaGVwcGFyZC9OTVIgZmlsZXMgemlwcy0yLzMwLzMwLUgubW5vdmEiLCJwYWdlcyI6W3
siaXRlbXMiOlsiMSIgICAgIF19XX0=
##TITLE=	RP314 char.10.fid
##JCAMP-DX=	6.0	$$ MestReNova 14.3.3-33362
##DATA TYPE=	NMR SPECTRUM
##DATA CLASS=	XYDATA
##BLOCK_ID=	1
##ORIGIN=	Bruker BioSpin GmbH
##OWNER=	nmrsu
##NUMDIM=	1
##$MNOVA/METADATA=	(ITEM,BASE64)
eyJhbmdsZSI6MCwiYXhlcyI6eyJ4Ijp7Im1heCI6MTYuMDY0MjU5OTk5OTM5MTI1LCJtaW4iOi0zLjc
2Njk0MjMzOTE1NjYyMjZ9LCJ5Ijp7Im1heCI6MTI5NTI5LjU4ODg2NzE4NzUsIm1pbiI6LTExNjk3Lj
k5NTg4Nzc1NjM0OH19LCJwb2ludHMiOlt7IngiOjUzMjEsInkiOjU4MzV9LHsieCI6ODcyMiwieSI6N
TgzNX0seyJ4Ijo4NzIyLCJ5Ijo4MjA4fSx7IngiOjUzMjEsInkiOjgyMDh9LHsieCI6NTMyMSwieSI6
NTgzNX1dLCJ6IjowfQ==
##.OBSERVE FREQUENCY=	700.35432466099996418
##.OBSERVE NUCLEUS=	^1H
##.SOLVENT NAME=	CDCl3
##.PULSE SEQUENCE=	zg30
##LONGDATE=	2023/03/15 13:24:43.000
##.ACQUISITIONMODE=	SIMULTANEOUS (DQD)
##$ORIGINAL FORMAT=	Bruker XWIN-NMR
##$MNOVA/SCALES_VERSION=	9
##$PARAMETER FILE=	(acqus, ASCII, /private/var/folders/f6/rjf_tdyn2v98c5c0wvkgn4s80000gq/T/C+TQoXMwSp6LXjUJjhG6lw/10/acqus, 0)
$$ ##TITLE= Parameter file, TopSpin 4.1.3
$$ ##JCAMPDX= 5.0
$$ ##DATATYPE= Parameter Values
$$ ##NPOINTS= 1	$$ modification sequence number
$$ ##ORIGIN= Bruker BioSpin GmbH
$$ ##OWNER= nmrsu
$$ $$ 2023-03-15 13:24:22.550 +0000  nmrsu@CZC7167VR1
$$ $$ Z:/700/data/tds/nmr/RP314 char/10/acqus
$$ $$ process C:\Bruker\TopSpin4.1.3\prog\mod\dirdata.exe
$$ ##$ACQT0= -2.0981556054023
$$ ##$AMP= (0..31)
$$ 100 100 100 100 100 100 100 100 100 100 100 100 100 100 100 100 100 100
$$ 100 100 100 100 100 100 100 100 100 100 100 100 100 100
$$ ##$AMPCOIL= (0..32)
$$ -1 0 0 0 0 0 0 0 0 0 0 0 0 0 0 0 0 0 0 0 0 0 0 0 0 0 0 0 0 0 0 0 0
$$ ##$AQSEQ= 0
$$ ##$AQ_mod= 3
$$ ##$AUNM= <au_zg>
$$ ##$AUTOPOS= <27 >
$$ ##$BF1= 700.349999998
$$ ##$BF2= 700.349999998
$$ ##$BF3= 700.349999998
$$ ##$BF4= 700.349999998
$$ ##$BF5= 700.349999998
$$ ##$BF6= 700.349999998
$$ ##$BF7= 700.349999998
$$ ##$BF8= 700.349999998
$$ ##$BWFAC= (0..63)
$$ 0 0 0 0 0 0 0 0 0 0 0 0 0 0 0 0 0 0 0 0 0 0 0 0 0 0 0 0 0 0 0 0 0 0 0 0
$$ 0 0 0 0 0 0 0 0 0 0 0 0 0 0 0 0 0 0 0 0 0 0 0 0 0 0 0 0
$$ ##$BYTORDA= 0
$$ ##$CHANFCU= (0..24)
$$ 0 1 0 0 0 0 0 0 0 0 0 0 0 0 0 0 0 0 0 0 0 0 0 0 0
$$ ##$CHANREC= (0..24)
$$ 0 0 0 0 0 0 0 0 0 0 0 0 0 0 0 0 0 0 0 0 0 0 0 0 0
$$ ##$CHEMSTR= <none>
$$ ##$CNST= (0..63)
$$ 1 1 1 1 1 1 1 1 1 1 1 1 1 1 1 1 1 1 1 1 1 1 1 1 1 1 1 1 1 1 1 1 1 1 1 1
$$ 1 1 1 1 1 1 1 1 1 1 1 1 1 1 1 1 1 1 1 1 1 1 1 1 1 1 1 1
$$ ##$CPDPRG= (0..8)
$$ <> <> <> <> <> <> <> <> <>
$$ ##$D= (0..63)
$$ 0 1 0 0 0 0 0 0 0 0 0 0 0 0 0 0 0.0002 0 0 0 0 0 0 0 0 0 0 0 0 0 0 0 0
$$ 0 0 0 0 0 0 0 0 0 0 0 0 0 0 0 0 0 0 0 0 0 0 0 0 0 0 0 0 0 0 0
$$ ##$DATE= 1678886683
$$ ##$DATE_START= 1678886640
$$ ##$DE= 6.901845
$$ [...]
$$ ##$ShimPowRng3= (0..63)
$$ 1 1 1 1 1 1 1 1 1 1 1 1 1 1 1 1 1 1 1 1 1 1 1 1 1 1 1 1 1 1 1 1 1 1 1 1
$$ 1 1 1 1 0 0 0 0 0 0 0 0 0 0 0 0 0 0 0 0 0 0 0 0 0 0 0 0
$$ ##$ShimPowType1= 8
$$ ##$ShimPowType2= 8
$$ ##$ShimPowType3= 0
$$ ##$ShimPowType4= 0
$$ ##$ShimPowType5= 0
$$ ##$ShimPowType6= 0
$$ ##$ShimPowType7= 0
$$ ##$ShimPowType8= 0
$$ ##$ShimSysActGrad= (0..63)
$$ 1 2 3 4 13 5 7 11 10 9 6 8 12 18 19 20 21 15 22 23 24 14 25 16 26 17 27
$$ 28 31 32 33 34 35 36 37 38 0 0 0 0 0 0 0 0 0 0 0 0 0 0 0 0 0 0 0 0 0 0
$$ 0 0 0 0 0 0
$$ ##$ShimSysAngle= <>
$$ ##$ShimSysFunc= (0..63)
$$ 1 2 3 4 5 6 7 8 9 10 0 37 38 35 16 15 14 13 12 11 28 27 26 25 24 23 36
$$ 22 30 29 20 21 34 33 32 31 17 18 19 0 0 0 0 0 0 0 0 0 0 0 0 0 0 0 0 0 0
$$ 0 0 0 0 0 0 0
$$ ##$ShimSysMatId= <292722da.dat>
$$ ##$ShimSysMatrix= 1
$$ ##$ShimSysMinMaxUG= 130000
$$ ##$ShimSysOffset= <29 mm>
$$ ##$ShimSysType= 4
$$ ##$ShimUnit= 3
$$ ##$SpectrOsVersion= <4.1.156.20210628>
$$ ##$TCubeEth= <192.168.180.38>
$$ ##$TCubeSeqDevice= <>
$$ ##$TOSITY= <no>
$$ ##$TRIPLO2= 0
$$ ##$TopSpinVersion= <TopSpin 4.1.3>
$$ ##$TrxFreqFormula= (0..23)
$$ <TrxFreqFormula(2.0,700350000.000000,'TRX',Trx(1.0,'TRX 1200.1',1,5.000000,1290.000000))>
$$ <TrxFreqFormula(2.0,700350000.000000,'TRX',Trx(1.0,'TRX 1200.2',1,5.000000,1290.000000))>
$$ <TrxFreqFormula(2.0,700350000.000000,'TRX',Trx(1.0,'TRX 1200.3',1,5.000000,1290.000000))>
$$ <> <> <> <> <> <> <> <> <> <> <> <> <> <> <> <> <> <> <> <> <>
$$ ##$TrxPN= (0..23)
$$ <Z148391> <Z148391> <Z148391> <> <> <> <> <> <> <> <> <> <> <> <> <> <>
$$ <> <> <> <> <> <> <>
$$ ##$TrxSN= (0..23)
$$ <00336> <00337> <00342> <> <> <> <> <> <> <> <> <> <> <> <> <> <> <> <>
$$ <> <> <> <> <>
$$ ##$VCubeEth= (0..23)
$$ <no> <no> <no> <no> <no> <no> <no> <no> <no> <no> <no> <no> <no> <no> <no>
$$ <no> <no> <no> <no> <no> <no> <no> <no> <no>
$$ ##$VTU= 2
$$ ##$VTUETH= <192.168.99.11>
$$ ##$VTUTY= <no>
$$ ##$ValueLine= no
$$ ##$VpuPN= (0..23)
$$ <no> <no> <no> <no> <no> <no> <no> <no> <no> <no> <no> <no> <no> <no> <no>
$$ <no> <no> <no> <no> <no> <no> <no> <no> <no>
$$ ##$VpuSN= (0..23)
$$ <no> <no> <no> <no> <no> <no> <no> <no> <no> <no> <no> <no> <no> <no> <no>
$$ <no> <no> <no> <no> <no> <no> <no> <no> <no>
$$ ##$WBREFAM= (0..31)
$$ 99.8 100 100 100 100 100 100 100 100 100 100 100 100 100 100 100 100 100
$$ 100 100 100 100 100 100 100 100 100 100 100 100 100 100
$$ ##$WBREFLM= (0..31)
$$ 1 0 1 0 0 0 0 0 0 0 0 0 0 0 0 0 0 0 0 0 0 0 0 0 0 0 0 0 0 0 0 0
$$ ##$WBREFPH= (0..31)
$$ 0.05 0 0 0 0 0 0 0 0 0 0 0 0 0 0 0 0 0 0 0 0 0 0 0 0 0 0 0 0 0 0 0
$$ ##$WBSGU= (0..31)
$$ 1 2 4 0 0 0 0 0 0 0 0 0 0 0 0 0 0 0 0 0 0 0 0 0 0 0 0 0 0 0 0 0
$$ ##END=
$$ 
##$DECIM=	1440
##$DSPFVS=	21
##XUNITS=	HZ
##YUNITS=	ARBITRARY UNITS
##FIRSTX=	11250.604788156719223
##LASTX=	-2638.1781369192458442
##DELTAX=	-0.10596381293402784562
##XFACTOR=	1
##YFACTOR=	3.5936851481673635078
##FIRSTY=	150.54290771484375
##MINY=	77.5013275146484375
##MAXY=	117754.28125
##NPOINTS=	131072
##XYDATA=	(X++(Y..Y))
$$ [...]
$$ plain form
4559 57 57 57 57 57 57 57 57 57 57 57 57 57 57 57 57 57 57 57 57 57 57 57 57 57 57 57 57 57 56 56 56 57 56 56 57 57 57 57 57 57 57 57 57 57 57 57 56 56 56 56 56 56 56 56 56 56 56 56 56 56 56 56 56 56 56 56 56 56 56 56
4551 56 56 56 56 56 56 56 56 56 56 56 56 56 55 56 56 56 56 56 56 56 56 56 56 56 56 56 56 56 56 56 56 56 56 56 55 55 55 56 56 56 56 56 56 56 56 56 56 56 56 56 56 56 56 56 56 56 56 56 56 56 56 56 56 56 57 57 57 56 56 56
4544 56 56 56 56 56 56 56 56 56 56 56 56 56 56 56 56 56 56 55 55 55 55 56 56 56 56 56 56 56 55 55 55 56 56 56 56 56 56 56 56 56 56 56 56 56 56 56 56 56 56 55 55 55 55 56 56 55 55 55 55 56 56 56 56 56 56 56 56 56 56 56
4537 56 56 56 56 56 56 56 56 56 56 56 56 56 56 56 56 56 56 56 56 56 56 56 56 56 56 56 56 56 56 56 56 56 56 56 56 56 56 57 57 56 56 56 57 57 57 56 56 56 57 57 57 57 57 57 57 57 57 57 57 57 57 57 57 57 57 57 57 57 57 57
4529 57 57 57 57 57 57 57 57 57 57 57 57 57 57 56 56 57 57 56 56 56 57 57 57 56 56 56 56 56 57 57 57 57 57 57 57 57 57 57 57 57 57 57 57 57 57 57 57 57 57 57 57 57 57 57 57 57 57 57 57 57 57 57 57 57 57 57 57 57 57 57
4522 57 57 57 57 57 57 56 56 56 56 56 56 56 56 56 56 56 56 56 56 56 56 56 57 57 56 56 56 56 57 57 57 57 57 57 57 57 57 57 57 57 57 57 56 56 57 57 56 56 56 56 56 56 56 56 56 57 56 56 57 57 56 56 56 56 56 56 56 56 56 56
4514 56 56 56 56 56 56 56 56 56 56 56 57 57 57 57 57 57 56 57 57 57 57 57 57 57 57 57 57 57 57 57 57 57 56 56 57 57 57 57 57 57 57 57 57 56 56 56 56 56 56 56 56 56 56 56 56 56 56 56 56 56 56 56 56 56 56 56 57 57 57 57
4507 57 57 57 56 57 57 56 56 56 56 56 56 56 56 56 56 56 56 56 56 56 56 56 56 56 56 56 56 56 56 56 56 56 56 56 56 56 56 56 57 57 57 57 57 57 57 57 57 57 57 57 57 56 56 56 56 56 56 56 56 56 56 56 56 56 56 56 56 56 56 56
$$ packed form
4559E7%%%%%%%%%%%%%%%%%%%%%%%%%%%%j%%Jj%J%%%%%%%%%%%j%%%%%%%%%%%%%%%%%%%%%%%
4551E6%%%%%%%%%%%%jJ%%%%%%%%%%%%%%%%%%%%j%%J%%%%%%%%%%%%%%%%%%%%%%%%%%J%%j%%
4544E6%%%%%%%%%%%%%%%%%j%%%J%%%%%%j%%J%%%%%%%%%%%%%%%%%j%%%J%j%%%J%%%%%%%%%%
4537E6%%%%%%%%%%%%%%%%%%%%%%%%%%%%%%%%%%%%%J%j%%J%%j%%J%%%%%%%%%%%%%%%%%%%%%
4529E7%%%%%%%%%%%%%j%J%j%%J%%j%%%%J%%%%%%%%%%%%%%%%%%%%%%%%%%%%%%%%%%%%%%%%%
4522E7%%%%%j%%%%%%%%%%%%%%%%J%j%%%J%%%%%%%%%%%%%j%J%j%%%%%%%%Jj%J%j%%%%%%%%%
4514E6%%%%%%%%%%J%%%%%jJ%%%%%%%%%%%%%%j%J%%%%%%%%j%%%%%%%%%%%%%%%%%%%%%%J%%%
4507E7%%jJ%j%%%%%%%%%%%%%%%%%%%%%%%%%%%%%%%%J%%%%%%%%%%%%j%%%%%%%%%%%%%%%%%%
$$ plain form
4500 56 56 56 56 56 56 56 56 56 56 56 57 57 57 57 57 57 56 56 57 57 57 57 57 57 57 57 57 57 57 57 57 57 57 57 57 57 57 57 57 57 56 56 57 57 57 57 57 57 57 56 57 57 57 57 57 57 57 57 57 57 57 57 57 57 57 57 57 57 57 57
4492 57 57 57 57 57 57 57 57 57 57 57 57 57 57 57 57 57 57 57 57 57 57 57 57 57 57 57 57 57 57 57 57 57 57 57 57 57 57 57 56 56 57 57 57 57 57 57 57 57 57 57 57 57 57 57 57 57 57 57 57 57 57 57 57 57 56 56 57 56 56 57
4485 57 56 56 57 57 57 57 57 57 57 57 57 57 57 57 57 56 56 56 56 56 56 56 56 56 56 56 56 57 57 56 56 57 57 57 56 56 56 56 56 56 56 56 56 57 57 57 56 56 56 56 56 57 57 57 56 57 57 57 57 57 56 57 57 57 57 57 57 57 57 57
4477 57 57 57 57 57 56 56 56 57 57 57 57 57 56 56 56 56 56 56 56 56 56 56 57 57 57 57 57 57 57 57 56 56 56 57 57 57 56 56 56 56 56 57 57 57 57 57 57 57 57 57 57 57 56 56 57 57 57 57 57 57 57 56 56 56 56 56 56 56 56 56
4470 56 56 56 56 56 57 57 57 56 56 56 56 56 56 56 56 56 56 56 56 56 56 56 56 56 56 56 56 56 56 56 56 56 56 56 57 57 56 56 56 56 56 56 56 56 56 56 56 56 56 56 57 57 57 56 56 56 56 56 57 57 56 56 57 57 57 57 57 56 56 56
4462 56 56 56 56 56 56 56 56 56 56 56 56 56 56 57 57 56 56 56 56 56 56 56 56 56 56 56 56 56 56 56 56 56 56 56 56 56 56 56 56 56 56 56 56 56 56 56 56 56 57 57 57 57 57 57 56 56 56 56 56 56 56 56 56 56 56 56 56 56 56 56
4455 56 57 57 56 56 56 56 56 56 56 56 56 56 56 56 56 56 56 56 56 56 56 56 56 56 56 56 56 56 56 56 56 56 56 56 56 56 56 56 56 56 56 56 56 56 55 56 56 56 56 56 55 55 55 55 56 56 56 56 55 55 55 55 55 55 55 55 55 55 55 55
4448 55 55 55 55 55 55 55 55 56 56 56 56 55 55 55 55 55 55 55 55 55 55 55 55 55 55 55 55 55 55 55 55 55 55 55 55 55 55 56 56 55 55 55 55 55 55 55 55 55 55 55 55 55 55 55 55 55 55 55 55 55 55 55 55 55 55 55 55 55 55 55
$$ packed form
4500E6%%%%%%%%%%J%%%%%j%J%%%%%%%%%%%%%%%%%%%%%j%J%%%%%%jJ%%%%%%%%%%%%%%%%%%%
4492E7%%%%%%%%%%%%%%%%%%%%%%%%%%%%%%%%%%%%%%j%J%%%%%%%%%%%%%%%%%%%%%%%j%Jj%J
4485E7j%J%%%%%%%%%%%%j%%%%%%%%%%%J%j%J%%j%%%%%%%%J%%j%%%%J%%jJ%%%%jJ%%%%%%%%
4477E7%%%%j%%J%%%%j%%%%%%%%%J%%%%%%%j%%J%%j%%%%J%%%%%%%%%%j%J%%%%%%j%%%%%%%%
4470E6%%%%J%%j%%%%%%%%%%%%%%%%%%%%%%%%%%J%j%%%%%%%%%%%%%J%%j%%%%J%j%J%%%%j%%
4462E6%%%%%%%%%%%%%J%j%%%%%%%%%%%%%%%%%%%%%%%%%%%%%%%%J%%%%%j%%%%%%%%%%%%%%%
4455E6J%j%%%%%%%%%%%%%%%%%%%%%%%%%%%%%%%%%%%%%%%%%jJ%%%%j%%%J%%%j%%%%%%%%%%%
4448E5%%%%%%%J%%%j%%%%%%%%%%%%%%%%%%%%%%%%%J%j%%%%%%%%%%%%%%%%%%%%%%%%%%%%%%
$$ plain form
4440 55 55 55 55 55 55 55 56 56 56 56 56 55 55 55 56 56 56 56 56 56 56 56 56 56 56 56 56 56 56 56 56 56 56 56 56 56 56 56 56 56 56 56 56 56 56 56 56 56 56 56 56 56 56 56 56 56 56 56 56 56 56 56 56 56 56 56 56 56 56 56
4433 56 56 56 56 56 56 56 56 56 56 56 55 56 56 56 56 56 56 56 56 56 56 56 56 56 57 57 57 56 56 56 56 56 56 56 56 56 56 56 56 56 56 56 56 56 57 57 57 57 57 57 57 57 57 56 56 57 57 57 57 57 57 57 57 57 57 57 57 57 58 58
4425 58 58 58 58 58 58 58 58 58 58 58 58 58 58 58 57 57 57 57 57 57 57 57 57 57 56 56 56 56 56 57 57 57 57 57 58 58 58 59 59 60 60 60 60 60 60 60 59 59 59 59 59 59 59 59 60 60 60 61 62 63 64 64 65 65 66 66 67 68 68 69
4418 69 70 72 73 75 76 77 78 78 77 76 74 73 72 70 69 67 66 65 64 63 63 63 63 63 63 63 63 63 63 62 62 61 61 61 61 61 61 60 60 61 61 61 62 62 63 63 64 65 65 66 67 67 68 68 69 70 71 73 74 76 77 78 79 78 77 76 75 73 71 70
4411 70 68 67 66 65 64 63 63 62 62 63 63 64 64 65 67 68 69 70 71 73 75 76 77 78 78 78 78 76 74 73 71 70 69 68 68 67 67 66 65 65 64 63 63 62 61 61 61 60 60 60 60 60 61 62 62 62 63 63 63 63 63 63 63 63 63 63 64 64 65 66
4403 66 67 68 69 70 71 73 74 75 76 77 77 77 76 75 73 72 70 69 69 68 67 67 67 66 66 65 64 63 63 62 62 61 61 60 60 60 60 60 60 60 60 60 60 60 60 60 60 60 60 59 59 59 58 58 58 58 58 58 57 57 57 57 57 57 57 57 57 57 57 57
4396 57 57 57 57 57 57 57 57 57 58 58 58 58 58 57 57 57 57 57 57 57 57 56 56 56 56 56 56 56 56 56 56 56 56 56 56 56 56 56 56 56 56 56 56 56 56 56 56 56 55 56 56 56 56 56 56 56 56 56 56 56 56 56 56 56 56 56 56 56 56 56
4388 56 56 56 56 56 56 56 56 56 56 56 56 56 56 56 56 56 56 56 56 56 56 56 56 56 56 56 56 56 56 56 56 56 56 56 56 56 56 56 56 56 56 56 56 56 56 57 56 56 56 56 56 56 56 56 56 56 56 56 56 56 56 56 56 56 56 56 56 56 56 56
$$ packed form
4440E5%%%%%%J%%%%j%%J%%%%%%%%%%%%%%%%%%%%%%%%%%%%%%%%%%%%%%%%%%%%%%%%%%%%%%%
4433E6%%%%%%%%%%jJ%%%%%%%%%%%%J%%j%%%%%%%%%%%%%%%%J%%%%%%%%j%J%%%%%%%%%%%%J%
4425E8%%%%%%%%%%%%%%j%%%%%%%%%j%%%%J%%%%J%%J%J%%%%%%j%%%%%%%J%%JJJJ%J%J%JJ%J
4418F9JKJKJJJ%jjkjjkjkjjjj%%%%%%%%%j%j%%%%%j%J%%J%J%JJ%JJ%J%JJJKJKJJJjjjjkkj
4411G0kjjjjj%j%J%J%JKJJJJKKJJJ%%%kkjkjjj%j%jj%jj%jj%%j%%%%JJ%%J%%%%%%%%%J%JJ
4403F6JJJJJKJJJJ%%jjkjkj%jj%%j%jjj%j%j%j%%%%%%%%%%%%%%%j%%j%%%%%j%%%%%%%%%%%
4396E7%%%%%%%%J%%%%j%%%%%%%j%%%%%%%%%%%%%%%%%%%%%%%%%%jJ%%%%%%%%%%%%%%%%%%%%
4388E6%%%%%%%%%%%%%%%%%%%%%%%%%%%%%%%%%%%%%%%%%%%%%Jj%%%%%%%%%%%%%%%%%%%%%%%
$$ plain form
4381 56 56 56 56 56 56 56 56 55 55 56 56 56 56 56 56 56 57 57 56 56 56 56 56 56 56 56 56 56 56 56 56 56 56 56 56 56 56 56 56 56 56 56 56 56 56 56 56 56 56 56 56 56 56 56 56 56 56 56 56 56 56 56 56 56 56 56 56 56 56 56
4373 56 56 56 56 56 56 56 56 56 56 56 56 56 56 56 56 56 56 56 56 56 56 56 56 56 56 56 56 56 56 57 57 56 56 56 56 56 56 56 56 56 56 56 56 56 56 56 56 56 56 56 57 56 56 56 56 56 56 56 56 56 56 56 56 56 56 56 55 56 56 56
4366 56 56 56 56 56 56 56 56 56 56 56 56 56 56 56 56 56 56 56 56 56 56 56 56 56 56 56 56 56 56 56 56 56 56 56 56 56 56 56 56 56 56 56 56 56 56 56 56 56 56 56 56 56 56 56 56 56 56 56 56 56 56 56 56 56 56 56 56 56 56 56
4359 56 56 56 56 56 56 56 56 56 56 56 56 56 56 56 56 56 56 56 56 56 56 56 56 56 56 56 56 56 56 56 56 56 56 56 56 56 56 56 56 56 56 56 56 56 56 56 56 56 56 56 56 56 56 57 57 56 56 57 57 57 57 56 56 57 57 56 56 56 56 56
4351 56 56 56 56 56 56 56 56 56 56 56 56 56 56 56 57 57 57 57 57 57 57 57 56 56 56 56 56 56 56 56 56 56 56 56 56 56 56 56 56 56 56 56 56 56 56 56 56 56 56 56 56 56 56 56 56 56 55 55 55 55 56 56 56 56 55 55 55 55 55 55
4344 55 55 55 55 55 55 55 55 55 55 55 55 55 54 54 55 55 55 55 55 55 55 55 55 55 54 54 54 54 55 55 55 55 55 55 55 55 55 55 54 54 54 54 54 54 54 54 54 54 54 54 54 54 55 55 55 55 55 55 55 55 55 55 55 55 55 55 55 55 55 55
4336 55 55 55 55 55 55 55 55 55 55 55 55 54 54 55 55 55 55 55 55 55 55 55 55 56 55 55 55 55 55 55 56 56 56 56 55 55 55 55 55 55 56 56 55 55 55 55 56 56 56 56 56 56 56 56 56 56 56 56 56 55 55 55 55 56 55 55 56 56 56 56
4329 56 56 56 56 56 56 56 56 56 56 56 56 56 56 56 57 57 57 57 57 57 57 56 56 56 56 56 56 56 56 56 57 57 57 57 57 56 56 56 56 56 56 56 56 56 56 56 56 56 56 56 56 56 56 56 56 57 57 56 56 56 56 56 56 56 56 56 56 56 56 56
$$ packed form
4381E6%%%%%%%j%J%%%%%%J%j%%%%%%%%%%%%%%%%%%%%%%%%%%%%%%%%%%%%%%%%%%%%%%%%%%%
4373E6%%%%%%%%%%%%%%%%%%%%%%%%%%%%%J%j%%%%%%%%%%%%%%%%%%Jj%%%%%%%%%%%%%%jJ%%
4366E6%%%%%%%%%%%%%%%%%%%%%%%%%%%%%%%%%%%%%%%%%%%%%%%%%%%%%%%%%%%%%%%%%%%%%%
4359E6%%%%%%%%%%%%%%%%%%%%%%%%%%%%%%%%%%%%%%%%%%%%%%%%%%%%%J%j%J%%%j%J%j%%%%
4351E6%%%%%%%%%%%%%%J%%%%%%%j%%%%%%%%%%%%%%%%%%%%%%%%%%%%%%%%%j%%%J%%%j%%%%%
4344E5%%%%%%%%%%%%j%J%%%%%%%%%j%%%J%%%%%%%%%j%%%%%%%%%%%%%J%%%%%%%%%%%%%%%%%
4336E5%%%%%%%%%%%j%J%%%%%%%%%Jj%%%%%J%%%j%%%%%J%j%%%J%%%%%%%%%%%%j%%%Jj%J%%%
4329E6%%%%%%%%%%%%%%J%%%%%%j%%%%%%%%J%%%%j%%%%%%%%%%%%%%%%%%%J%j%%%%%%%%%%%%
$$ plain form
4322 56 56 56 56 56 56 56 56 56 56 56 56 56 56 56 56 56 56 56 56 56 56 56 56 56 56 56 56 55 56 56 56 56 56 56 56 56 56 56 56 56 56 56 56 56 55 55 55 55 55 55 55 55 55 55 55 55 56 55 55 55 55 55 55 55 55 55 55 55 55 55
4314 55 55 55 55 55 55 55 55 55 55 55 55 55 55 55 55 55 55 55 55 55 55 55 55 55 55 55 55 55 55 55 54 55 55 55 55 55 55 55 55 55 55 55 55 55 55 55 55 55 55 55 55 55 55 55 55 55 55 55 55 55 55 55 55 55 55 55 55 55 55 54
4307 54 54 54 55 54 54 54 54 55 55 55 55 55 55 55 55 55 55 55 55 55 55 55 55 55 55 55 55 55 55 55 55 55 54 54 54 54 55 55 55 55 55 55 55 55 55 55 55 55 55 55 55 55 55 55 55 55 55 55 55 55 55 55 55 55 55 55 56 55 55 55
4299 55 55 55 55 55 55 55 55 55 55 55 55 55 55 56 55 55 56 56 56 55 55 55 55 55 55 55 55 56 56 56 56 56 56 56 56 56 56 56 56 56 56 56 57 57 57 57 57 57 56 56 56 56 56 57 57 56 56 56 56 56 56 56 56 56 56 56 55 55 55 55
4292 55 56 56 56 56 56 55 56 56 56 56 56 56 56 56 56 56 56 56 56 56 56 56 55 56 55 55 55 56 56 56 56 55 55 55 55 55 55 55 55 55 55 55 55 55 55 55 55 55 55 55 55 55 55 55 55 55 55 55 55 55 56 56 56 56 55 55 55 55 55 55
4284 55 55 55 56 56 56 56 56 55 55 55 55 55 55 55 55 55 55 55 55 55 55 55 55 55 55 55 56 56 55 55 55 55 55 55 55 55 55 55 55 55 55 55 55 55 55 55 56 56 56 56 56 56 56 56 56 55 55 55 55 55 55 56 56 55 55 55 55 55 55 55
4277 55 55 55 55 55 55 55 55 55 55 55 55 56 56 55 56 55 55 55 56 56 56 56 55 55 55 55 55 55 55 55 55 55 55 55 55 56 56 55 55 55 55 55 55 55 55 55 55 55 56 55 55 55 55 55 55 55 55 55 56 55 55 55 55 55 55 55 55 55 56 55
4270 55 55 55 55 56 56 56 56 56 55 56 56 56 56 55 55 55 55 55 55 55 55 55 55 55 55 55 55 55 55 55 55 55 55 55 55 56 56 55 55 55 55 55 55 55 55 55 55 55 55 55 55 55 55 55 55 55 55 55 55 55 55 55 55 55 55 56 56 56 56 56
$$ packed form
4322E6%%%%%%%%%%%%%%%%%%%%%%%%%%%jJ%%%%%%%%%%%%%%%j%%%%%%%%%%%Jj%%%%%%%%%%%%
4314E5%%%%%%%%%%%%%%%%%%%%%%%%%%%%%%jJ%%%%%%%%%%%%%%%%%%%%%%%%%%%%%%%%%%%%%j
4307E4%%Jj%%%J%%%%%%%%%%%%%%%%%%%%%%%%j%%%J%%%%%%%%%%%%%%%%%%%%%%%%%%%%%Jj%%
4299E5%%%%%%%%%%%%%Jj%J%%j%%%%%%%J%%%%%%%%%%%%%%J%%%%%j%%%%J%j%%%%%%%%%%j%%%
4292E5J%%%%jJ%%%%%%%%%%%%%%%jJj%%J%%%j%%%%%%%%%%%%%%%%%%%%%%%%%%%%J%%%j%%%%%
4284E5%%J%%%%j%%%%%%%%%%%%%%%%%%J%j%%%%%%%%%%%%%%%%%J%%%%%%%%j%%%%%J%j%%%%%%
4277E5%%%%%%%%%%%J%jJj%%J%%%j%%%%%%%%%%%%J%j%%%%%%%%%%Jj%%%%%%%%Jj%%%%%%%%Jj
4270E5%%%J%%%%jJ%%%j%%%%%%%%%%%%%%%%%%%%%J%j%%%%%%%%%%%%%%%%%%%%%%%%%%%J%%%%
$$ plain form
4262 56 56 56 56 56 56 55 55 55 55 55 55 55 55 56 56 56 55 55 55 55 55 55 55 55 55 55 56 56 56 56 56 56 55 55 55 55 56 56 56 56 55 55 55 56 55 55 56 56 56 56 56 56 56 55 55 55 55 55 55 55 56 56 56 56 55 55 55 56 56 56
4255 56 56 56 55 55 56 55 55 55 55 55 55 55 55 55 55 55 55 55 55 55 55 55 55 55 55 56 56 56 55 55 55 55 55 55 55 55 55 55 55 55 55 55 55 55 55 55 55 55 55 55 55 55 55 56 56 56 56 55 55 55 55 56 56 56 55 55 55 55 55 55
4247 55 55 55 55 55 55 55 55 55 55 55 55 56 56 56 56 55 55 55 55 55 55 56 56 55 55 55 55 55 55 55 56 56 55 55 55 55 55 55 55 55 55 55 55 55 55 56 56 55 55 55 55 55 55 55 55 55 55 55 55 56 56 55 55 55 55 55 55 55 55 55
4240 55 55 55 55 55 55 54 54 55 55 55 55 55 55 55 55 55 55 55 54 54 54 54 54 54 54 54 54 54 54 54 54 54 54 54 54 54 54 54 54 54 54 54 54 54 54 54 54 54 54 54 54 54 54 54 54 54 54 54 54 54 54 54 54 54 54 54 54 54 54 54
4233 54 54 54 54 54 54 54 54 54 54 54 54 54 54 54 54 54 54 54 54 55 55 55 55 55 55 55 54 54 55 55 55 55 55 54 54 55 55 55 54 54 55 55 55 55 55 55 55 55 55 55 55 55 55 55 55 55 54 54 54 55 55 55 55 55 55 55 55 55 55 55
4225 55 55 55 55 55 55 55 55 55 55 55 55 55 55 55 55 55 55 55 55 55 55 55 55 55 55 55 55 55 55 55 56 55 55 55 55 55 55 55 55 55 55 55 55 55 55 55 55 55 55 55 55 55 55 55 55 55 55 55 56 56 56 56 55 55 55 55 55 55 55 55
4218 55 55 55 55 56 56 55 55 55 55 55 55 55 55 55 55 55 55 55 55 55 55 55 55 56 56 56 56 55 55 55 55 55 55 55 55 55 55 55 55 55 55 55 55 55 55 55 55 55 56 56 56 56 56 56 56 55 55 55 55 55 55 55 56 55 55 55 55 55 55 55
4210 55 55 55 55 55 56 56 55 55 55 55 55 55 55 55 55 55 55 55 55 55 55 55 55 55 55 55 55 55 55 55 54 54 54 54 54 54 55 55 55 55 55 54 54 54 55 55 55 55 55 55 55 55 54 54 54 54 54 54 54 54 54 54 54 55 54 54 54 54 54 55
$$ packed form
4262E6%%%%%j%%%%%%%J%%j%%%%%%%%%J%%%%%j%%%J%%%j%%Jj%J%%%%%%j%%%%%%J%%%j%%J%%
4255E6%%j%Jj%%%%%%%%%%%%%%%%%%%J%%j%%%%%%%%%%%%%%%%%%%%%%%%J%%%j%%%J%%j%%%%%
4247E5%%%%%%%%%%%J%%%j%%%%%J%j%%%%%%J%j%%%%%%%%%%%%J%j%%%%%%%%%%%J%j%%%%%%%%
4240E5%%%%%j%J%%%%%%%%%%j%%%%%%%%%%%%%%%%%%%%%%%%%%%%%%%%%%%%%%%%%%%%%%%%%%%
4233E4%%%%%%%%%%%%%%%%%%%J%%%%%%j%J%%%%j%J%%j%J%%%%%%%%%%%%%%%j%%J%%%%%%%%%%
4225E5%%%%%%%%%%%%%%%%%%%%%%%%%%%%%%Jj%%%%%%%%%%%%%%%%%%%%%%%%%%J%%%j%%%%%%%
4218E5%%%J%j%%%%%%%%%%%%%%%%%J%%%j%%%%%%%%%%%%%%%%%%%%J%%%%%%j%%%%%%Jj%%%%%%
4210E5%%%%J%j%%%%%%%%%%%%%%%%%%%%%%%j%%%%%J%%%%j%%J%%%%%%%j%%%%%%%%%%Jj%%%%J
$$ plain form
4203 55 55 55 55 55 54 54 54 54 54 54 54 55 55 54 54 54 54 54 54 54 54 55 55 55 55 55 55 54 54 55 54 54 55 55 55 55 55 55 55 55 55 55 54 54 55 55 55 55 54 54 54 54 55 55 55 55 55 55 55 55 55 55 55 55 54 55 55 55 55 55
4195 55 55 55 55 55 55 55 55 55 55 55 55 55 55 55 55 55 55 56 56 56 55 55 55 55 55 55 55 55 55 55 55 55 55 55 55 55 55 55 55 55 55 55 55 55 55 55 55 55 55 55 55 55 55 55 55 55 55 55 55 56 56 56 56 56 56 56 55 55 56 56
4188 56 56 56 56 56 56 56 55 55 55 55 55 55 55 55 55 55 55 55 55 56 55 55 55 55 55 55 55 55 55 55 55 55 55 55 55 55 55 55 55 55 55 55 55 55 55 55 55 55 55 55 55 55 55 55 55 55 55 55 55 55 55 55 55 55 55 55 55 55 55 55
4181 55 56 56 55 55 55 55 55 55 55 55 55 55 55 55 55 55 55 55 55 55 55 55 55 55 55 55 55 55 55 55 55 55 55 55 55 55 55 55 55 55 55 55 55 55 55 55 55 55 55 55 55 55 55 55 55 55 55 55 56 56 55 55 55 55 55 55 55 55 55 55
4173 55 55 55 55 55 55 55 55 55 55 55 55 55 55 55 55 55 55 55 55 55 55 55 55 55 55 55 55 55 55 55 55 55 55 55 55 55 55 55 55 55 55 55 55 55 55 54 54 55 55 55 55 55 54 54 54 54 55 55 55 55 55 55 55 55 55 55 55 55 55 55
4166 55 55 55 55 55 55 55 55 55 55 55 55 55 55 55 55 55 55 55 55 55 55 55 55 55 55 55 55 55 55 55 55 55 55 55 55 55 55 55 55 55 55 55 55 55 55 55 55 55 55 55 55 54 54 55 55 55 55 55 55 55 55 55 55 55 55 55 55 55 55 55
4158 55 55 55 55 55 55 55 55 55 55 55 55 55 55 54 55 55 55 55 55 55 55 55 55 55 55 55 55 55 55 55 55 55 55 55 55 55 55 55 55 55 54 54 55 54 54 54 54 54 54 54 54 54 54 55 55 55 55 54 54 54 54 54 54 54 54 54 54 54 54 54
4151 54 55 55 55 55 55 55 55 55 55 55 55 55 55 55 55 55 54 54 54 54 54 54 55 55 55 55 55 55 55 54 55 55 54 54 54 55 55 55 55 55 55 55 55 55 55 55 55 55 55 55 55 55 55 55 55 55 55 55 55 55 55 55 55 55 55 55 55 55 55 55
$$ packed form
4203E5%%%%j%%%%%%J%j%%%%%%%J%%%%%j%Jj%J%%%%%%%%%j%J%%%j%%%J%%%%%%%%%%%jJ%%%%
4195E5%%%%%%%%%%%%%%%%%J%%j%%%%%%%%%%%%%%%%%%%%%%%%%%%%%%%%%%%%%%J%%%%%%j%J%
4188E6%%%%%%j%%%%%%%%%%%%Jj%%%%%%%%%%%%%%%%%%%%%%%%%%%%%%%%%%%%%%%%%%%%%%%%%
4181E5J%j%%%%%%%%%%%%%%%%%%%%%%%%%%%%%%%%%%%%%%%%%%%%%%%%%%%%%%%J%j%%%%%%%%%
4173E5%%%%%%%%%%%%%%%%%%%%%%%%%%%%%%%%%%%%%%%%%%%%%j%J%%%%j%%%J%%%%%%%%%%%%%
4166E5%%%%%%%%%%%%%%%%%%%%%%%%%%%%%%%%%%%%%%%%%%%%%%%%%%%j%J%%%%%%%%%%%%%%%%
4158E5%%%%%%%%%%%%%jJ%%%%%%%%%%%%%%%%%%%%%%%%%j%Jj%%%%%%%%%J%%%j%%%%%%%%%%%%
4151E4J%%%%%%%%%%%%%%%j%%%%%J%%%%%%jJ%j%%J%%%%%%%%%%%%%%%%%%%%%%%%%%%%%%%%%%
$$ plain form
4144 55 55 55 55 55 55 55 55 55 55 55 55 55 55 55 55 55 55 55 55 55 55 55 55 55 55 55 55 55 55 55 55 55 55 55 55 55 55 55 55 54 54 54 54 54 54 54 54 54 54 54 54 54 55 55 55 54 55 55 55 55 55 55 55 55 55 55 55 55 55 55
4136 55 55 55 54 54 54 54 54 54 54 54 54 54 54 54 54 54 54 54 54 54 55 55 55 54 54 54 54 54 54 54 54 54 54 54 54 54 54 55 55 55 55 55 54 55 55 55 55 55 55 55 55 55 55 55 55 55 55 55 55 55 55 55 55 55 55 54 54 54 54 55
4129 55 55 54 54 54 54 54 54 55 55 55 55 55 55 55 54 54 54 54 54 54 55 55 54 54 54 54 55 55 55 55 55 55 55 55 55 55 55 55 55 54 55 55 55 55 55 55 55 55 55 55 55 55 55 55 55 55 55 55 55 55 55 55 55 55 55 55 55 55 55 55
4121 55 55 55 54 54 54 54 54 55 55 55 55 55 55 55 55 55 55 55 55 55 55 55 55 55 55 55 55 55 55 55 55 55 55 55 55 55 55 55 55 55 55 55 54 54 55 55 55 55 55 55 55 55 55 55 55 55 55 55 55 55 55 55 55 55 55 55 55 55 55 55
4114 55 55 55 55 55 55 55 55 55 55 55 55 55 54 55 55 55 55 55 54 54 54 55 55 55 55 55 55 55 54 54 54 55 55 55 55 55 55 55 55 55 55 55 55 55 55 55 55 55 55 55 55 55 55 55 55 54 54 54 54 54 55 54 54 54 54 54 54 54 54 54
4106 54 54 55 55 55 54 54 54 54 54 54 54 54 54 54 54 54 54 54 54 54 54 54 54 54 54 54 54 54 54 54 54 54 54 54 54 54 54 54 54 54 54 54 54 54 54 54 54 54 54 54 54 54 54 54 54 54 54 54 54 54 54 54 54 54 54 54 55 55 55 55
4099 55 55 54 55 55 55 55 54 54 54 54 54 54 54 54 54 54 54 54 54 54 54 54 54 54 54 54 54 54 54 54 54 54 54 54 54 55 55 55 55 54 54 54 55 55 55 55 55 55 54 55 55 55 55 55 55 55 54 54 55 55 55 55 55 55 55 55 55 55 55 55
4092 55 55 55 54 55 55 55 55 55 55 54 54 54 54 54 54 55 55 55 55 55 55 55 55 55 55 55 55 55 55 55 55 55 55 55 55 55 55 55 55 55 55 55 55 55 55 55 55 55 55 55 55 55 55 55 55 55 55 55 55 55 55 55 55 55 55 55 55 55 55 55
$$ packed form
4144E5%%%%%%%%%%%%%%%%%%%%%%%%%%%%%%%%%%%%%%%j%%%%%%%%%%%%J%%jJ%%%%%%%%%%%%%
4136E5%%j%%%%%%%%%%%%%%%%%J%%j%%%%%%%%%%%%%J%%%%jJ%%%%%%%%%%%%%%%%%%%%%j%%%J
4129E5%j%%%%%J%%%%%%j%%%%%J%j%%%J%%%%%%%%%%%%jJ%%%%%%%%%%%%%%%%%%%%%%%%%%%%%
4121E5%%j%%%%J%%%%%%%%%%%%%%%%%%%%%%%%%%%%%%%%%%j%J%%%%%%%%%%%%%%%%%%%%%%%%%
4114E5%%%%%%%%%%%%jJ%%%%j%%J%%%%%%j%%J%%%%%%%%%%%%%%%%%%%%%%%j%%%%Jj%%%%%%%%
4106E4%J%%j%%%%%%%%%%%%%%%%%%%%%%%%%%%%%%%%%%%%%%%%%%%%%%%%%%%%%%%%%%%%%J%%%
4099E5%jJ%%%j%%%%%%%%%%%%%%%%%%%%%%%%%%%%J%%%j%%J%%%%%jJ%%%%%%j%J%%%%%%%%%%%
4092E5%%jJ%%%%%j%%%%%J%%%%%%%%%%%%%%%%%%%%%%%%%%%%%%%%%%%%%%%%%%%%%%%%%%%%%%
$$ plain form
4084 55 55 55 55 55 55 55 55 55 55 55 55 55 55 55 55 55 55 55 55 55 55 55 55 55 55 55 54 54 54 54 54 54 54 54 54 54 54 54 54 54 54 54 54 54 54 54 54 54 54 54 54 54 54 54 54 54 54 54 54 54 54 54 54 54 54 54 54 54 54 54
4077 54 54 54 54 54 54 54 54 54 54 55 55 55 54 54 54 54 54 54 54 54 54 54 54 54 54 54 54 54 54 54 54 54 54 54 54 54 54 54 54 54 54 54 54 54 54 54 54 54 54 54 54 54 54 54 54 55 55 55 55 55 55 55 55 55 55 55 55 55 54 54
4069 54 54 54 54 55 55 54 55 55 54 54 54 54 54 54 54 54 54 54 54 54 54 54 54 54 55 54 54 54 54 54 54 54 54 54 54 54 55 54 54 54 54 54 54 54 54 54 54 54 54 54 54 54 54 54 54 54 54 54 54 54 54 54 55 55 55 54 54 54 54 54
4062 54 54 54 54 55 55 55 55 55 55 55 55 55 55 55 55 55 54 54 54 54 54 54 54 54 55 55 55 55 54 54 54 54 54 55 55 55 54 54 54 54 54 54 54 55 55 55 55 55 54 54 54 54 54 54 54 54 54 54 54 54 54 54 54 54 54 54 54 54 54 54
4054 54 54 54 54 54 54 54 54 54 54 54 54 54 54 54 54 54 55 55 55 54 54 54 54 54 54 54 54 54 54 54 53 53 53 53 53 53 53 53 54 53 53 53 54 54 54 53 54 54 54 54 54 54 54 54 54 54 54 54 54 54 54 54 54 54 54 54 54 54 54 54
4047 54 54 54 54 54 53 53 53 53 53 53 54 54 54 54 54 54 54 54 54 54 54 54 54 54 54 54 54 54 54 54 54 54 54 54 54 54 54 54 54 54 54 54 54 54 54 54 54 54 54 54 54 54 54 54 54 54 54 54 54 54 54 54 54 54 54 54 54 54 54 54
4040 54 54 54 54 54 54 54 54 54 54 54 55 54 54 54 54 54 54 54 54 54 54 54 54 54 54 54 54 54 53 54 54 54 54 54 54 55 55 55 54 54 54 54 54 54 54 54 54 54 54 54 54 54 54 54 54 54 54 54 54 54 54 54 54 54 54 54 54 54 54 54
4032 54 54 54 54 54 55 54 54 54 55 54 54 54 54 54 54 54 54 54 54 54 54 54 54 54 54 54 54 54 54 54 54 54 54 54 54 54 54 54 54 54 54 54 54 54 54 54 54 54 54 54 54 54 54 55 55 54 54 54 54 54 54 54 54 54 54 54 54 54 54 54
$$ packed form
4084E5%%%%%%%%%%%%%%%%%%%%%%%%%%j%%%%%%%%%%%%%%%%%%%%%%%%%%%%%%%%%%%%%%%%%%%
4077E4%%%%%%%%%J%%j%%%%%%%%%%%%%%%%%%%%%%%%%%%%%%%%%%%%%%%%%%J%%%%%%%%%%%%j%
4069E4%%%J%jJ%j%%%%%%%%%%%%%%%Jj%%%%%%%%%%Jj%%%%%%%%%%%%%%%%%%%%%%%%J%%j%%%%
4062E4%%%J%%%%%%%%%%%%j%%%%%%%J%%%j%%%%J%%j%%%%%%J%%%%j%%%%%%%%%%%%%%%%%%%%%
4054E4%%%%%%%%%%%%%%%%J%%j%%%%%%%%%%j%%%%%%%Jj%%J%%jJ%%%%%%%%%%%%%%%%%%%%%%%
4047E4%%%%j%%%%%J%%%%%%%%%%%%%%%%%%%%%%%%%%%%%%%%%%%%%%%%%%%%%%%%%%%%%%%%%%%
4040E4%%%%%%%%%%Jj%%%%%%%%%%%%%%%%jJ%%%%%J%%j%%%%%%%%%%%%%%%%%%%%%%%%%%%%%%%
4032E4%%%%Jj%%Jj%%%%%%%%%%%%%%%%%%%%%%%%%%%%%%%%%%%%%%%%%%%J%j%%%%%%%%%%%%%%
$$ plain form
4025 54 54 54 54 54 54 54 54 54 55 54 54 54 54 54 54 54 54 54 54 54 54 54 54 54 54 54 54 54 54 54 54 54 54 54 54 54 55 55 55 55 55 55 55 54 54 54 54 54 54 54 54 54 54 54 54 54 54 54 54 54 54 54 54 54 55 55 54 54 54 54
4017 54 54 54 54 54 54 54 54 54 54 54 54 54 54 54 54 54 54 54 54 54 54 54 54 54 54 54 54 54 54 54 54 54 54 54 54 54 54 54 54 54 54 54 54 54 54 54 54 54 54 54 54 54 54 55 55 55 55 55 55 55 55 55 55 54 54 55 55 55 55 54
4010 54 54 54 54 54 54 54 54 54 54 54 54 54 54 54 54 54 54 54 54 54 54 54 54 54 54 54 54 54 54 54 54 54 54 54 54 54 54 54 54 54 54 54 54 55 55 55 55 55 55 55 55 55 55 55 54 54 54 54 54 54 54 54 55 55 55 54 54 55 55 55
4003 55 55 55 55 55 55 55 55 54 54 54 55 55 55 55 54 54 54 54 54 54 54 54 54 54 54 54 54 54 54 54 54 54 54 54 54 54 54 54 54 54 54 54 54 54 54 54 54 54 54 55 55 54 54 54 54 54 54 54 54 54 54 54 54 54 55 55 55 55 55 55
3995 55 54 54 54 54 54 54 54 54 54 54 54 54 55 55 55 55 55 55 55 55 55 55 54 54 54 54 54 54 54 54 54 54 54 54 54 54 54 54 54 54 54 54 54 54 54 54 54 54 54 54 54 54 55 54 54 54 54 54 55 55 55 55 54 54 54 54 54 54 54 54
3988 54 54 54 55 55 54 54 54 54 54 54 54 54 54 54 54 54 54 54 54 54 54 54 54 54 54 54 54 54 54 54 54 54 54 54 54 54 54 54 54 54 54 53 53 53 53 53 53 53 53 53 53 53 53 53 53 53 53 53 53 53 53 53 53 53 53 53 53 53 53 53
3980 53 53 53 53 53 53 53 53 53 54 54 54 54 54 54 54 54 54 54 54 54 54 54 54 54 54 54 54 54 54 54 54 54 54 54 54 53 53 54 54 54 54 54 54 55 55 55 55 54 54 54 54 54 54 54 55 55 55 55 55 55 54 54 55 54 54 54 54 54 54 54
3973 54 55 55 54 54 54 54 54 54 54 54 55 55 55 55 55 55 55 55 55 55 55 55 54 54 55 55 55 55 55 55 55 55 55 55 54 54 54 54 54 54 55 55 55 55 55 55 54 54 54 54 54 55 55 55 54 54 55 55 55 55 55 55 55 55 55 55 55 55 55 55
$$ packed form
4025E4%%%%%%%%Jj%%%%%%%%%%%%%%%%%%%%%%%%%%J%%%%%%j%%%%%%%%%%%%%%%%%%%%J%j%%%
4017E4%%%%%%%%%%%%%%%%%%%%%%%%%%%%%%%%%%%%%%%%%%%%%%%%%%%%%J%%%%%%%%%j%J%%%j
4010E4%%%%%%%%%%%%%%%%%%%%%%%%%%%%%%%%%%%%%%%%%%%J%%%%%%%%%%j%%%%%%%J%%j%J%%
4003E5%%%%%%%j%%J%%%j%%%%%%%%%%%%%%%%%%%%%%%%%%%%%%%%%%J%j%%%%%%%%%%%%J%%%%%
3995E5j%%%%%%%%%%%J%%%%%%%%%j%%%%%%%%%%%%%%%%%%%%%%%%%%%%%Jj%%%%J%%%j%%%%%%%
3988E4%%J%j%%%%%%%%%%%%%%%%%%%%%%%%%%%%%%%%%%%%j%%%%%%%%%%%%%%%%%%%%%%%%%%%%
3980E3%%%%%%%%J%%%%%%%%%%%%%%%%%%%%%%%%%%j%J%%%%%J%%%j%%%%%%J%%%%%j%Jj%%%%%%
3973E4J%j%%%%%%%J%%%%%%%%%%%j%J%%%%%%%%%j%%%%%J%%%%%j%%%%J%%j%J%%%%%%%%%%%%%
$$ plain form
3965 55 55 55 54 55 55 55 55 55 55 55 55 55 55 55 55 55 55 55 55 55 55 55 55 55 55 55 55 55 55 55 55 55 55 55 55 55 55 55 55 55 55 55 55 55 55 55 55 55 55 55 55 55 55 55 55 54 55 55 55 55 54 55 55 55 55 55 55 55 55 55
3958 55 55 55 55 55 55 55 55 55 55 55 55 55 55 55 55 55 55 55 55 55 55 55 55 55 55 55 55 55 55 54 54 54 54 55 54 54 54 54 54 54 54 54 54 54 54 55 55 55 55 55 55 55 55 55 55 55 55 54 54 54 54 54 55 55 54 54 54 54 54 54
3951 54 54 54 54 55 55 55 55 55 55 55 54 54 54 54 54 54 54 54 54 54 54 54 54 54 54 55 55 55 55 55 55 55 54 54 54 55 55 55 55 55 55 55 55 55 54 54 55 55 55 55 54 54 54 54 54 54 54 54 54 54 54 55 55 55 54 54 54 54 54 54
3943 54 54 54 54 54 55 55 54 54 54 54 54 55 55 55 54 54 54 54 54 54 54 54 54 54 54 54 54 54 54 54 54 54 54 54 54 54 54 54 54 54 54 54 54 54 54 54 54 54 55 55 54 54 54 54 54 54 54 54 54 54 54 54 54 54 54 54 54 54 54 54
3936 54 54 54 54 54 54 54 54 54 54 54 54 54 54 54 54 54 54 54 54 54 54 54 54 54 55 55 54 54 54 54 54 54 54 54 54 54 54 54 54 54 54 54 54 54 54 54 54 54 54 54 54 54 54 54 54 54 54 54 54 54 54 54 54 54 54 54 54 54 54 54
3928 54 54 54 55 54 54 54 54 54 54 54 54 54 54 54 54 54 55 55 55 54 54 55 55 55 55 55 55 55 55 54 54 54 54 54 54 54 54 54 54 54 54 54 54 54 54 54 55 55 55 55 55 55 55 54 54 55 54 54 54 54 54 54 54 54 54 54 54 54 54 54
3921 54 54 54 54 54 53 54 54 54 54 54 54 54 54 54 54 54 54 54 54 54 54 54 54 54 54 54 54 54 54 54 54 54 54 54 54 54 54 54 54 54 54 54 54 54 54 54 54 54 54 54 54 55 55 54 54 54 54 54 54 54 54 54 54 54 54 54 54 54 54 54
3914 54 54 54 54 54 54 55 55 55 55 55 55 55 55 55 56 56 55 55 55 56 56 56 57 57 58 58 59 60 61 61 62 63 65 66 66 66 66 66 65 64 63 62 61 60 59 58 58 58 57 57 56 56 56 55 55 55 55 55 55 55 55 55 55 55 55 55 55 55 55 55
$$ packed form
3965E5%%jJ%%%%%%%%%%%%%%%%%%%%%%%%%%%%%%%%%%%%%%%%%%%%%%%%%%%jJ%%%jJ%%%%%%%%
3958E5%%%%%%%%%%%%%%%%%%%%%%%%%%%%%j%%%Jj%%%%%%%%%%J%%%%%%%%%%%j%%%%J%j%%%%%
3951E4%%%J%%%%%%j%%%%%%%%%%%%%%J%%%%%%j%%J%%%%%%%%j%J%%%j%%%%%%%%%%J%%j%%%%%
3943E4%%%%J%j%%%%J%%j%%%%%%%%%%%%%%%%%%%%%%%%%%%%%%%%%J%j%%%%%%%%%%%%%%%%%%%
3936E4%%%%%%%%%%%%%%%%%%%%%%%%J%j%%%%%%%%%%%%%%%%%%%%%%%%%%%%%%%%%%%%%%%%%%%
3928E4%%Jj%%%%%%%%%%%%J%%j%J%%%%%%%j%%%%%%%%%%%%%%%%J%%%%%%j%Jj%%%%%%%%%%%%%
3921E4%%%%jJ%%%%%%%%%%%%%%%%%%%%%%%%%%%%%%%%%%%%%%%%%%%%%J%j%%%%%%%%%%%%%%%%
3914E4%%%%%J%%%%%%%%J%j%%J%%J%J%JJJ%JJKJ%%%%jjjjjjjj%%j%j%%j%%%%%%%%%%%%%%%%
$$ plain form
3906 55 54 54 54 54 54 54 54 54 54 54 54 54 54 54 54 54 54 54 54 54 54 54 54 54 54 54 54 54 54 54 54 54 54 54 54 54 54 54 54 54 54 54 54 54 54 54 54 54 54 54 54 54 54 54 54 54 54 54 54 54 54 54 54 54 54 54 54 54 54 54
3899 54 54 54 55 54 54 54 54 54 54 54 54 54 54 54 54 54 54 54 54 54 54 54 54 54 54 54 54 54 55 54 54 54 54 54 54 54 54 54 55 55 55 55 54 54 54 54 54 54 54 54 54 54 54 54 54 54 54 54 54 54 54 54 54 54 54 54 54 54 54 54
3891 54 54 54 54 54 54 54 54 54 54 54 54 54 54 54 55 54 54 54 54 54 54 54 54 54 54 54 54 54 53 53 53 53 53 54 54 54 54 54 54 54 54 54 54 54 53 54 54 54 54 54 54 54 54 54 54 54 54 54 54 54 54 54 54 54 54 54 54 54 54 54
3884 54 54 54 54 54 54 54 54 54 54 54 54 54 54 54 54 54 54 54 54 54 54 54 53 54 54 54 54 54 54 54 54 54 54 54 54 54 54 54 55 54 54 54 54 54 54 54 55 55 54 54 54 54 54 54 54 54 54 54 54 54 54 54 54 54 54 54 54 54 54 54
3876 54 54 54 54 54 54 54 54 54 54 54 54 54 54 54 54 54 54 54 54 54 54 54 54 54 54 54 54 54 54 54 54 54 54 54 54 54 54 54 54 54 54 54 54 54 54 54 54 54 54 54 54 54 54 54 54 54 54 54 54 54 54 54 54 54 54 54 54 54 54 54
3869 54 54 54 54 54 54 54 54 54 54 54 55 55 55 55 54 54 54 54 55 55 54 55 54 55 55 55 54 54 54 54 54 54 54 54 54 54 54 54 54 54 54 54 54 54 54 54 54 54 54 54 54 54 54 54 54 54 54 54 54 54 54 54 54 54 54 54 54 54 54 54
3862 54 54 54 54 54 54 54 54 54 54 54 54 54 54 54 54 54 54 54 54 54 54 54 54 54 54 54 54 54 54 54 54 54 54 54 54 54 55 55 55 55 55 55 54 54 54 54 54 54 54 54 54 54 54 54 54 54 54 54 54 54 54 54 54 54 54 54 54 54 54 54
3854 54 54 54 54 54 54 54 54 54 54 54 54 54 54 54 54 54 54 54 54 54 54 54 54 54 54 54 54 54 54 54 54 54 54 54 54 54 54 54 54 54 54 54 54 54 54 54 54 54 54 54 54 54 54 54 54 54 54 54 54 54 54 54 54 54 54 54 54 54 54 54
$$ packed form
3906E5j%%%%%%%%%%%%%%%%%%%%%%%%%%%%%%%%%%%%%%%%%%%%%%%%%%%%%%%%%%%%%%%%%%%%%
3899E4%%Jj%%%%%%%%%%%%%%%%%%%%%%%%Jj%%%%%%%%J%%%j%%%%%%%%%%%%%%%%%%%%%%%%%%%
3891E4%%%%%%%%%%%%%%Jj%%%%%%%%%%%%j%%%%J%%%%%%%%%%jJ%%%%%%%%%%%%%%%%%%%%%%%%
3884E4%%%%%%%%%%%%%%%%%%%%%%jJ%%%%%%%%%%%%%%Jj%%%%%%J%j%%%%%%%%%%%%%%%%%%%%%
3876E4%%%%%%%%%%%%%%%%%%%%%%%%%%%%%%%%%%%%%%%%%%%%%%%%%%%%%%%%%%%%%%%%%%%%%%
3869E4%%%%%%%%%%J%%%j%%%J%jJjJ%%j%%%%%%%%%%%%%%%%%%%%%%%%%%%%%%%%%%%%%%%%%%%
3862E4%%%%%%%%%%%%%%%%%%%%%%%%%%%%%%%%%%%%J%%%%%j%%%%%%%%%%%%%%%%%%%%%%%%%%%
3854E4%%%%%%%%%%%%%%%%%%%%%%%%%%%%%%%%%%%%%%%%%%%%%%%%%%%%%%%%%%%%%%%%%%%%%%
$$ plain form
3847 54 54 54 54 54 54 54 54 54 54 54 54 54 54 54 54 54 54 54 54 54 54 54 54 54 54 54 54 54 54 54 54 54 54 54 54 54 54 54 54 54 54 54 54 54 53 53 54 54 54 54 54 54 54 54 54 54 54 54 54 53 53 53 53 54 54 54 54 54 54 54
3839 54 54 54 54 54 54 54 54 54 54 54 54 54 54 54 54 54 54 54 54 54 54 54 55 55 54 54 54 54 54 54 54 54 54 54 54 54 54 54 54 54 54 54 54 54 54 54 54 54 54 54 54 54 54 54 54 54 54 54 54 54 54 54 54 54 54 54 54 54 54 54
3832 54 54 54 54 54 54 54 54 54 54 54 54 54 54 54 54 54 54 54 54 54 54 54 54 54 54 54 54 54 54 54 54 54 54 54 54 54 54 54 54 54 54 54 54 54 53 54 54 54 54 54 54 54 54 54 54 54 54 54 54 54 54 54 54 54 54 54 54 54 54 54
3825 54 54 54 54 54 54 54 54 54 54 54 54 54 54 54 54 54 54 54 53 53 54 54 54 53 53 53 53 53 53 53 53 53 54 54 54 54 54 54 54 53 53 53 53 53 53 53 53 53 53 53 53 53 53 53 53 53 53 53 53 53 53 53 53 54 53 53 54 53 53 53
3817 53 53 53 53 53 53 53 53 53 53 53 53 53 53 53 53 53 53 53 53 53 53 53 53 53 53 53 53 53 53 53 53 53 53 53 53 53 53 53 53 53 53 53 53 53 53 54 54 54 54 54 54 54 54 54 54 53 54 54 54 54 54 54 54 54 54 54 54 54 54 54
3810 54 54 54 54 54 54 54 54 54 54 54 54 54 54 54 54 54 54 54 54 54 54 54 54 54 54 54 54 54 54 53 54 54 54 54 54 54 54 54 54 54 53 53 54 54 54 54 54 54 54 54 54 54 54 54 54 54 54 54 53 53 53 53 53 53 53 53 53 53 53 54
3802 54 54 54 54 54 54 54 54 54 54 54 54 53 54 54 54 54 54 54 53 53 53 53 54 54 54 54 54 54 53 53 53 53 53 53 53 53 53 53 53 53 53 53 53 53 53 53 53 53 53 53 53 53 54 54 54 54 53 53 53 53 54 54 54 54 54 54 54 54 54 54
3795 54 54 54 54 54 54 54 54 54 53 54 54 54 54 54 54 53 53 54 54 54 54 53 53 53 53 53 53 53 53 53 53 53 53 53 53 54 53 53 53 53 53 54 54 54 54 54 54 53 53 53 53 53 54 54 54 53 53 53 53 53 53 53 53 54 54 53 53 54 54 54
$$ packed form
3847E4%%%%%%%%%%%%%%%%%%%%%%%%%%%%%%%%%%%%%%%%%%%%j%J%%%%%%%%%%%%j%%%J%%%%%%
3839E4%%%%%%%%%%%%%%%%%%%%%%J%j%%%%%%%%%%%%%%%%%%%%%%%%%%%%%%%%%%%%%%%%%%%%%
3832E4%%%%%%%%%%%%%%%%%%%%%%%%%%%%%%%%%%%%%%%%%%%%jJ%%%%%%%%%%%%%%%%%%%%%%%%
3825E4%%%%%%%%%%%%%%%%%%j%J%%j%%%%%%%%J%%%%%%j%%%%%%%%%%%%%%%%%%%%%%%Jj%Jj%%
3817E3%%%%%%%%%%%%%%%%%%%%%%%%%%%%%%%%%%%%%%%%%%%%%J%%%%%%%%%jJ%%%%%%%%%%%%%
3810E4%%%%%%%%%%%%%%%%%%%%%%%%%%%%%jJ%%%%%%%%%j%J%%%%%%%%%%%%%%%j%%%%%%%%%%J
3802E4%%%%%%%%%%%jJ%%%%%j%%%J%%%%%j%%%%%%%%%%%%%%%%%%%%%%%J%%%j%%%J%%%%%%%%%
3795E4%%%%%%%%jJ%%%%%j%J%%%j%%%%%%%%%%%%%Jj%%%%J%%%%%j%%%%J%%j%%%%%%%J%j%J%%
$$ plain form
3787 54 53 53 53 53 53 53 53 53 53 53 53 53 53 53 53 53 53 53 54 54 54 54 54 54 53 53 53 53 54 54 53 53 53 53 53 53 54 54 54 54 54 53 53 53 53 54 53 53 53 53 53 53 53 53 53 53 54 54 53 53 53 53 53 53 53 53 53 53 54 54
3780 54 53 53 53 53 53 53 53 53 53 53 53 53 53 53 53 53 53 53 53 53 53 53 53 53 53 53 53 53 53 53 54 54 54 54 53 53 53 53 54 54 54 53 53 53 53 53 53 53 54 54 54 54 54 54 54 54 54 54 53 53 54 54 54 54 54 53 53 53 53 53
3773 53 53 54 54 54 53 53 53 54 53 54 54 54 54 54 54 53 54 54 54 53 53 53 53 53 53 53 53 53 53 53 53 53 53 53 53 53 53 53 53 53 54 53 53 53 53 53 53 53 53 53 54 54 54 54 54 54 54 53 53 53 53 53 53 53 53 54 54 54 54 54
3765 54 54 53 53 54 54 54 53 53 53 54 53 53 53 54 53 53 53 53 53 53 54 54 53 53 53 53 53 53 53 53 53 53 53 53 53 53 53 53 53 53 53 53 53 53 53 53 53 53 53 53 54 54 54 54 54 54 54 53 53 54 54 54 54 54 54 54 53 53 53 53
3758 53 53 54 54 54 54 54 53 53 53 53 53 53 53 53 53 53 53 53 53 53 53 53 54 54 54 54 54 54 53 53 53 53 53 54 54 54 54 54 54 53 53 53 53 53 53 53 53 53 54 53 53 53 53 53 53 53 53 53 53 53 53 53 53 53 53 53 53 53 53 53
3750 53 54 54 54 54 54 54 54 53 53 53 53 53 53 53 53 53 53 53 53 53 54 53 53 53 53 53 53 53 53 53 53 53 53 53 53 53 53 53 53 53 53 53 53 53 53 53 53 54 54 53 54 54 53 53 53 53 53 53 54 53 53 53 53 53 53 53 53 53 53 53
3743 53 54 54 54 54 54 54 54 54 54 54 54 54 54 54 54 54 54 54 54 54 54 54 54 54 54 54 54 54 54 54 54 54 54 54 54 54 54 54 54 54 54 54 54 54 54 54 54 54 54 54 54 54 54 54 54 54 54 54 54 54 54 55 55 55 55 55 55 54 54 54
3736 54 54 55 55 55 55 55 54 54 54 54 54 54 54 54 54 54 54 54 54 54 55 55 55 55 54 54 54 54 54 54 54 54 54 54 54 54 54 54 54 54 54 54 54 54 54 54 54 54 54 54 54 54 54 54 54 54 54 54 54 54 54 54 54 54 54 54 54 54 54 54
$$ packed form
3787E4j%%%%%%%%%%%%%%%%%J%%%%%j%%%J%j%%%%%J%%%%j%%%Jj%%%%%%%%%J%j%%%%%%%%%J%
3780E4j%%%%%%%%%%%%%%%%%%%%%%%%%%%%%J%%%j%%%J%%j%%%%%%J%%%%%%%%%j%J%%%%j%%%%
3773E3%J%%j%%JjJ%%%%%jJ%%j%%%%%%%%%%%%%%%%%%%%Jj%%%%%%%%J%%%%%%j%%%%%%%J%%%%
3765E4%j%J%%j%%Jj%%Jj%%%%%J%j%%%%%%%%%%%%%%%%%%%%%%%%%%%J%%%%%%j%J%%%%%%j%%%
3758E3%J%%%%j%%%%%%%%%%%%%%%J%%%%%j%%%%J%%%%%j%%%%%%%%Jj%%%%%%%%%%%%%%%%%%%%
3750E3J%%%%%%j%%%%%%%%%%%%Jj%%%%%%%%%%%%%%%%%%%%%%%%%J%jJ%j%%%%%Jj%%%%%%%%%%
3743E3J%%%%%%%%%%%%%%%%%%%%%%%%%%%%%%%%%%%%%%%%%%%%%%%%%%%%%%%%%%%%J%%%%%j%%
3736E4%J%%%%j%%%%%%%%%%%%%J%%%j%%%%%%%%%%%%%%%%%%%%%%%%%%%%%%%%%%%%%%%%%%%%%
$$ plain form
3728 54 54 54 54 54 54 54 54 54 54 54 54 54 54 54 54 54 54 54 54 54 54 54 54 54 54 54 54 54 54 54 54 54 54 54 54 54 54 54 54 54 54 54 54 54 54 54 54 54 54 54 54 54 54 54 54 54 54 54 54 54 54 54 54 54 54 54 54 54 54 54
3721 54 54 54 54 54 54 54 54 54 54 54 54 54 54 54 54 54 54 54 54 54 54 54 54 54 54 54 54 54 54 54 54 54 53 53 54 54 54 54 54 54 54 54 53 53 54 54 54 54 53 53 53 53 53 53 53 53 53 53 53 53 53 53 53 53 53 53 52 53 53 53
3713 53 53 53 53 53 53 53 52 52 52 52 52 52 53 53 53 53 53 52 52 52 52 52 52 52 53 53 53 53 53 53 53 53 53 53 53 53 53 53 53 53 53 53 53 53 53 53 53 53 53 53 53 53 54 54 54 53 54 54 54 54 54 54 54 54 54 54 54 54 54 54
3706 54 54 54 54 53 54 54 54 54 54 54 54 54 54 54 54 54 54 54 54 54 54 54 55 55 56 56 57 58 60 61 62 63 63 62 61 60 58 57 57 56 55 55 55 55 55 54 54 55 55 55 55 54 54 54 54 54 54 54 54 54 54 54 54 54 54 54 54 54 54 54
3698 54 54 54 54 54 54 54 54 54 54 54 54 54 54 53 53 54 54 54 54 53 53 53 53 53 53 53 53 53 53 53 53 53 54 54 54 54 54 54 55 55 55 55 54 54 54 54 54 54 54 54 54 54 54 54 54 54 54 54 54 53 53 54 53 53 54 54 54 53 53 54
3691 54 54 54 54 53 53 53 53 54 54 54 54 53 53 53 54 54 54 54 54 54 54 54 54 54 53 53 54 54 53 53 53 53 53 53 53 53 53 53 53 54 54 54 54 54 53 53 53 54 54 54 54 54 54 54 54 54 54 54 54 54 54 54 54 54 54 53 53 53 53 53
3684 53 53 53 53 53 53 53 54 54 54 54 53 53 53 54 54 54 54 54 53 53 53 53 53 53 53 53 53 53 53 53 54 54 54 54 54 53 53 54 54 54 54 53 53 53 53 53 53 53 53 53 53 53 53 53 53 53 53 53 53 53 53 53 53 53 53 54 54 54 54 54
3676 54 53 53 53 52 53 53 53 53 53 53 53 53 53 53 53 53 53 53 53 53 53 53 53 53 53 53 53 53 53 53 53 53 53 53 53 53 53 53 53 53 53 53 53 53 53 53 53 53 53 53 53 53 53 53 53 53 53 53 53 53 53 53 53 53 53 53 53 53 53 53
$$ packed form
3728E4%%%%%%%%%%%%%%%%%%%%%%%%%%%%%%%%%%%%%%%%%%%%%%%%%%%%%%%%%%%%%%%%%%%%%%
3721E4%%%%%%%%%%%%%%%%%%%%%%%%%%%%%%%%j%J%%%%%%%j%J%%%j%%%%%%%%%%%%%%%%%jJ%%
3713E3%%%%%%j%%%%%J%%%%j%%%%%%J%%%%%%%%%%%%%%%%%%%%%%%%%%%J%%jJ%%%%%%%%%%%%%
3706E4%%%jJ%%%%%%%%%%%%%%%%%J%J%JJKJJJ%jjjkj%jj%%%%j%J%%%j%%%%%%%%%%%%%%%%%%
3698E4%%%%%%%%%%%%%j%J%%%j%%%%%%%%%%%%J%%%%%J%%%j%%%%%%%%%%%%%%%%j%Jj%J%%j%J
3691E4%%%j%%%J%%%j%%J%%%%%%%%%j%J%j%%%%%%%%%%J%%%%j%%J%%%%%%%%%%%%%%%%%j%%%%
3684E3%%%%%%J%%%j%%J%%%%j%%%%%%%%%%%J%%%%j%J%%%j%%%%%%%%%%%%%%%%%%%%%%%J%%%%
3676E4j%%jJ%%%%%%%%%%%%%%%%%%%%%%%%%%%%%%%%%%%%%%%%%%%%%%%%%%%%%%%%%%%%%%%%%
$$ plain form
3669 53 53 53 53 53 53 53 53 53 53 53 53 53 53 53 52 53 53 53 53 53 53 53 53 53 53 53 53 53 53 53 53 53 53 53 53 53 53 53 53 53 53 53 53 53 53 53 53 53 53 53 53 53 53 53 53 53 53 53 53 53 53 53 53 53 53 53 53 53 53 53
3661 53 53 53 53 53 53 53 53 54 53 54 53 53 53 53 53 53 53 53 53 53 53 53 53 53 53 53 53 53 53 53 53 53 53 53 53 53 53 53 53 53 53 53 53 53 53 53 53 53 53 53 53 53 53 53 53 53 53 53 53 53 53 53 53 53 53 53 53 53 53 53
3654 53 53 53 53 53 52 53 53 53 53 53 53 53 53 53 53 53 53 53 53 53 53 53 53 53 53 53 53 53 53 53 53 53 53 53 53 52 52 52 53 53 53 53 53 53 53 53 53 53 53 52 53 53 53 53 52 52 52 53 52 52 52 53 53 53 53 53 53 53 53 53
3647 53 53 53 53 53 53 53 53 53 53 53 53 53 53 52 52 52 53 53 53 53 53 53 53 53 53 53 53 53 53 53 52 52 53 53 53 53 53 53 53 53 53 53 53 53 53 53 53 53 53 53 53 53 53 53 53 53 53 53 53 53 53 53 53 53 53 53 53 53 53 53
3639 53 53 53 53 53 53 53 53 53 53 53 53 53 53 53 53 53 53 53 53 53 53 53 53 53 53 53 53 53 53 53 53 53 53 53 53 53 53 54 54 54 53 53 53 53 53 53 53 53 53 53 53 54 54 54 53 53 53 53 53 53 54 54 54 54 53 53 53 53 53 53
3632 53 53 53 53 53 53 54 54 54 54 53 53 53 53 53 53 53 53 53 54 54 54 53 53 53 54 54 54 54 54 54 54 54 54 54 53 54 53 53 53 54 54 54 54 54 54 54 53 53 54 54 54 54 54 54 54 54 54 54 53 54 54 54 54 54 54 54 54 53 53 53
3624 53 53 53 54 54 54 54 54 54 54 53 53 53 53 53 54 54 54 54 53 53 53 53 53 54 54 54 54 54 54 54 54 53 53 53 53 53 53 53 53 53 53 53 53 54 54 54 54 54 54 54 53 53 53 53 53 53 53 53 53 53 53 53 53 53 53 53 53 53 53 53
3617 53 53 53 53 53 53 53 53 53 53 53 53 53 53 53 53 53 53 53 53 53 53 53 54 53 53 53 53 53 53 53 53 53 53 53 53 53 53 53 53 53 53 53 53 53 53 53 53 53 53 53 53 53 53 53 53 53 52 52 52 52 52 52 52 52 52 52 53 53 53 53
$$ packed form
3669E3%%%%%%%%%%%%%%jJ%%%%%%%%%%%%%%%%%%%%%%%%%%%%%%%%%%%%%%%%%%%%%%%%%%%%%%
3661E3%%%%%%%JjJj%%%%%%%%%%%%%%%%%%%%%%%%%%%%%%%%%%%%%%%%%%%%%%%%%%%%%%%%%%%
3654E3%%%%jJ%%%%%%%%%%%%%%%%%%%%%%%%%%%%%j%%J%%%%%%%%%%jJ%%%j%%Jj%%J%%%%%%%%
3647E3%%%%%%%%%%%%%j%%J%%%%%%%%%%%%%j%J%%%%%%%%%%%%%%%%%%%%%%%%%%%%%%%%%%%%%
3639E3%%%%%%%%%%%%%%%%%%%%%%%%%%%%%%%%%%%%%J%%j%%%%%%%%%%J%%j%%%%%J%%%j%%%%%
3632E3%%%%%J%%%j%%%%%%%%J%%j%%J%%%%%%%%%jJj%%J%%%%%%j%J%%%%%%%%%jJ%%%%%%%j%%
3624E3%%J%%%%%%j%%%%J%%%j%%%%J%%%%%%%j%%%%%%%%%%%J%%%%%%j%%%%%%%%%%%%%%%%%%%
3617E3%%%%%%%%%%%%%%%%%%%%%%Jj%%%%%%%%%%%%%%%%%%%%%%%%%%%%%%%%j%%%%%%%%%J%%%
$$ plain form
3609 53 53 52 52 52 52 52 52 52 53 53 53 53 53 53 53 53 53 53 53 53 53 53 53 53 53 53 53 53 53 53 53 53 53 53 53 53 53 53 53 52 52 52 52 52 52 53 53 53 53 53 53 53 53 53 53 53 53 53 53 53 53 53 53 53 54 53 53 53 53 53
3602 53 54 54 54 54 54 53 53 53 53 54 54 54 54 54 53 54 54 54 54 54 53 53 53 53 53 53 54 54 54 54 54 54 54 54 54 54 54 54 54 54 54 54 54 54 54 54 54 54 54 54 54 54 54 54 54 54 54 54 54 54 54 54 54 54 54 54 54 54 54 54
3595 54 54 54 54 54 54 53 53 53 53 53 53 53 53 54 54 54 54 54 54 54 54 54 54 54 54 53 53 53 54 54 54 54 54 53 53 53 53 53 54 54 54 53 53 53 53 53 54 54 53 53 53 53 53 53 53 54 54 54 54 54 53 53 53 53 53 53 53 53 53 53
3587 53 53 53 53 53 53 53 53 53 53 53 53 53 53 53 53 53 53 53 53 53 53 53 53 53 53 53 53 53 53 53 53 53 53 53 53 53 53 53 53 53 53 53 53 53 52 52 52 52 52 52 52 52 52 53 53 52 52 52 52 52 52 52 52 52 52 52 52 52 52 52
3580 52 52 52 52 52 52 52 53 53 53 53 53 53 53 53 53 52 52 52 52 52 52 52 53 53 53 52 52 52 52 52 52 52 52 52 52 52 52 52 52 52 52 52 52 52 52 52 52 52 52 52 52 52 52 53 53 53 53 53 52 52 52 52 52 52 52 53 53 53 53 53
3572 53 53 53 53 53 53 53 53 53 53 53 53 53 53 53 53 53 53 53 53 53 53 53 53 53 53 53 53 53 53 53 53 53 53 53 53 53 53 53 53 53 53 53 53 53 53 53 52 52 52 52 52 52 53 53 53 53 53 53 53 53 53 53 53 53 53 53 53 53 53 53
3565 53 53 53 53 53 53 53 53 53 53 53 53 53 53 53 53 53 53 53 53 53 53 53 53 53 53 53 53 53 53 53 53 54 54 54 54 53 53 53 53 53 53 53 53 53 53 53 54 54 54 54 54 54 54 54 54 54 54 55 55 55 55 55 55 54 54 54 54 53 53 53
3558 53 53 53 53 53 53 52 52 52 52 52 52 52 52 52 52 52 52 52 52 52 52 52 52 52 52 52 52 52 52 52 52 52 52 52 52 52 52 52 52 52 52 52 52 52 52 52 52 52 52 52 52 52 52 52 52 52 52 52 52 52 52 52 52 52 52 52 52 52 52 52
$$ packed form
3609E3%j%%%%%%J%%%%%%%%%%%%%%%%%%%%%%%%%%%%%%j%%%%%J%%%%%%%%%%%%%%%%%%Jj%%%%
3602E3J%%%%j%%%J%%%%jJ%%%%j%%%%%J%%%%%%%%%%%%%%%%%%%%%%%%%%%%%%%%%%%%%%%%%%%
3595E4%%%%%j%%%%%%%J%%%%%%%%%%%j%%J%%%%j%%%%J%%j%%%%J%j%%%%%%J%%%%j%%%%%%%%%
3587E3%%%%%%%%%%%%%%%%%%%%%%%%%%%%%%%%%%%%%%%%%%%%j%%%%%%%%J%j%%%%%%%%%%%%%%
3580E2%%%%%%J%%%%%%%%j%%%%%%J%%j%%%%%%%%%%%%%%%%%%%%%%%%%%%J%%%%j%%%%%%J%%%%
3572E3%%%%%%%%%%%%%%%%%%%%%%%%%%%%%%%%%%%%%%%%%%%%%%j%%%%%J%%%%%%%%%%%%%%%%%
3565E3%%%%%%%%%%%%%%%%%%%%%%%%%%%%%%%J%%%j%%%%%%%%%%J%%%%%%%%%%J%%%%%j%%%j%%
3558E3%%%%%j%%%%%%%%%%%%%%%%%%%%%%%%%%%%%%%%%%%%%%%%%%%%%%%%%%%%%%%%%%%%%%%%
$$ plain form
3550 52 52 52 52 52 52 52 52 52 52 52 52 52 52 52 52 52 52 52 52 52 52 52 52 52 52 52 52 52 52 52 52 52 52 52 52 52 52 52 53 53 53 53 53 52 52 52 52 52 52 52 52 52 52 52 52 52 52 52 52 53 53 53 53 52 52 52 52 52 52 52
3543 52 52 52 52 52 52 52 52 53 53 53 53 53 53 53 53 52 52 52 52 52 52 52 52 52 52 52 52 52 52 52 52 52 52 52 53 53 52 52 52 52 52 53 52 52 52 52 52 52 52 52 52 52 52 52 52 52 52 52 52 52 52 52 52 52 52 52 52 52 52 52
3535 52 52 52 53 52 52 52 52 53 53 53 52 52 53 53 52 52 52 52 52 52 52 52 52 52 52 52 53 53 53 52 52 52 52 52 52 52 52 52 52 52 52 52 52 52 52 52 52 52 53 53 53 52 52 52 52 52 52 52 52 52 52 52 52 52 52 52 52 52 52 52
3528 52 52 52 52 52 52 52 52 52 52 51 51 51 52 52 52 52 52 52 52 52 52 52 52 52 52 52 52 52 52 52 52 52 52 52 52 52 52 52 52 52 52 52 52 52 52 52 52 52 52 51 51 51 51 52 52 52 52 52 52 52 52 52 52 52 52 52 52 52 52 52
3520 52 51 51 51 52 51 51 51 51 51 52 52 52 52 52 52 52 52 52 52 52 52 52 52 52 52 52 52 52 52 52 52 52 52 52 52 52 52 52 52 52 52 52 52 52 52 52 52 52 52 52 52 52 53 53 52 52 52 53 53 52 52 52 52 52 52 52 52 52 52 52
3513 52 52 52 52 52 52 52 52 52 52 52 52 52 52 52 52 52 52 52 52 52 52 52 52 52 52 52 52 52 53 53 52 52 52 52 52 52 52 52 52 52 52 52 52 52 52 52 52 52 52 52 52 52 52 52 52 52 52 52 52 52 52 52 52 53 52 52 53 53 52 52
3506 52 52 52 52 52 52 52 52 52 52 52 52 52 52 52 52 52 52 52 52 52 52 52 52 52 52 52 52 52 52 52 52 52 52 52 52 52 52 52 52 52 52 52 52 52 52 52 52 52 52 52 52 52 52 52 52 52 52 52 52 52 52 52 52 52 53 53 53 53 52 52
3498 52 52 52 52 52 52 52 52 52 52 52 52 52 51 51 51 51 51 51 51 51 50 50 50 51 50 50 50 50 50 50 50 50 50 50 50 50 50 50 50 50 50 50 50 50 50 49 49 49 50 50 50 50 50 50 50 50 50 50 50 50 50 50 50 50 49 49 50 50 50 50
$$ packed form
3550E2%%%%%%%%%%%%%%%%%%%%%%%%%%%%%%%%%%%%%%J%%%%j%%%%%%%%%%%%%%%J%%%j%%%%%%
3543E2%%%%%%%J%%%%%%%j%%%%%%%%%%%%%%%%%%J%j%%%%Jj%%%%%%%%%%%%%%%%%%%%%%%%%%%
3535E2%%Jj%%%J%%j%J%j%%%%%%%%%%%J%%j%%%%%%%%%%%%%%%%%%J%%j%%%%%%%%%%%%%%%%%%
3528E2%%%%%%%%%j%%J%%%%%%%%%%%%%%%%%%%%%%%%%%%%%%%%%%%%j%%%J%%%%%%%%%%%%%%%%
3520E2j%%Jj%%%%J%%%%%%%%%%%%%%%%%%%%%%%%%%%%%%%%%%%%%%%%%%J%j%%J%j%%%%%%%%%%
3513E2%%%%%%%%%%%%%%%%%%%%%%%%%%%%J%j%%%%%%%%%%%%%%%%%%%%%%%%%%%%%%%%Jj%J%j%
3506E2%%%%%%%%%%%%%%%%%%%%%%%%%%%%%%%%%%%%%%%%%%%%%%%%%%%%%%%%%%%%%%%%J%%%j%
3498E2%%%%%%%%%%%%j%%%%%%%j%%Jj%%%%%%%%%%%%%%%%%%%%j%%J%%%%%%%%%%%%%%%j%J%%%
$$ plain form
3491 50 50 50 49 49 49 49 49 49 49 49 49 49 49 49 49 49 49 49 49 49 50 49 49 49 49 49 49 49 49 50 50 50 50 50 50 50 50 50 50 50 50 50 50 50 50 50 50 50 50 50 50 50 50 50 50 50 50 50 50 50 50 50 50 50 50 50 50 50 50 50
3483 50 50 50 51 50 50 50 50 50 51 51 51 51 51 51 51 51 51 52 51 51 51 51 51 52 52 51 51 51 51 51 51 51 51 51 52 52 52 52 52 52 52 52 52 53 53 53 53 53 53 53 52 52 52 52 52 52 52 52 52 52 52 52 52 52 52 52 53 53 53 53
3476 53 53 53 53 53 53 53 53 53 53 53 53 53 53 53 53 53 53 53 53 53 53 53 53 53 53 53 53 53 53 53 53 53 53 53 53 53 53 52 52 52 52 53 53 53 52 52 52 52 53 53 53 53 53 53 52 52 52 52 52 52 52 52 52 52 52 52 52 52 52 52
3469 52 52 52 52 52 52 52 52 52 52 52 52 52 52 52 52 52 52 52 52 52 52 52 52 52 52 52 52 52 51 51 51 51 51 51 51 51 51 51 51 51 50 51 51 51 51 50 50 50 50 50 50 50 50 50 50 50 50 50 50 50 50 50 51 51 51 51 51 51 50 50
3461 50 50 50 50 50 50 50 50 50 50 50 50 50 50 49 49 49 49 49 49 49 49 49 49 49 49 49 49 49 49 49 49 49 49 49 49 49 49 49 49 49 49 49 49 49 50 50 50 50 50 50 50 50 50 50 51 51 51 51 51 51 51 51 51 51 51 51 51 51 51 51
3454 51 51 51 51 52 52 52 52 52 51 51 51 52 52 52 52 52 52 52 52 52 52 52 52 52 52 53 53 53 53 53 53 53 53 53 53 53 53 53 53 53 53 54 54 54 54 54 53 53 53 53 53 53 53 53 53 53 53 53 53 53 53 53 53 53 53 53 53 53 53 53
3446 53 53 53 53 53 53 53 53 53 53 53 53 53 53 53 53 53 53 53 53 53 53 53 53 53 53 53 53 53 53 53 53 53 53 53 53 52 52 53 53 53 53 53 53 53 53 53 53 53 53 53 53 53 53 53 52 52 52 52 52 52 53 53 53 53 53 53 53 53 53 53
3439 53 53 53 53 53 53 53 52 52 52 52 52 52 52 52 53 53 53 52 52 52 52 52 52 52 52 52 52 52 52 52 52 52 52 53 53 53 53 53 53 53 53 52 52 52 52 53 53 53 53 53 53 53 53 53 53 53 53 53 53 53 53 53 53 52 52 52 52 52 52 52
$$ packed form
3491E0%%j%%%%%%%%%%%%%%%%%Jj%%%%%%%J%%%%%%%%%%%%%%%%%%%%%%%%%%%%%%%%%%%%%%%%
3483E0%%Jj%%%%J%%%%%%%%Jj%%%%J%j%%%%%%%%J%%%%%%%%J%%%%%%j%%%%%%%%%%%%%%%J%%%
3476E3%%%%%%%%%%%%%%%%%%%%%%%%%%%%%%%%%%%%%j%%%J%%j%%%J%%%%%j%%%%%%%%%%%%%%%
3469E2%%%%%%%%%%%%%%%%%%%%%%%%%%%%j%%%%%%%%%%%jJ%%%j%%%%%%%%%%%%%%%%J%%%%%j%
3461E0%%%%%%%%%%%%%j%%%%%%%%%%%%%%%%%%%%%%%%%%%%%%J%%%%%%%%%J%%%%%%%%%%%%%%%
3454E1%%%J%%%%j%%J%%%%%%%%%%%%%J%%%%%%%%%%%%%%%J%%%%j%%%%%%%%%%%%%%%%%%%%%%%
3446E3%%%%%%%%%%%%%%%%%%%%%%%%%%%%%%%%%%%j%J%%%%%%%%%%%%%%%%j%%%%%J%%%%%%%%%
3439E3%%%%%%j%%%%%%%J%%j%%%%%%%%%%%%%%%J%%%%%%%j%%%J%%%%%%%%%%%%%%%%%j%%%%%%
$$ plain form
3431 52 52 52 52 52 52 52 52 52 53 53 53 53 53 53 53 53 53 53 53 53 52 52 52 53 53 53 53 52 52 53 53 53 53 53 53 53 53 53 53 52 52 52 52 53 53 53 53 53 53 53 53 53 53 53 53 53 53 53 53 53 53 53 53 54 53 53 53 53 53 53
3424 53 53 53 53 53 53 53 53 53 53 53 53 53 53 53 53 53 53 53 52 52 52 52 52 52 53 53 53 53 53 53 53 53 53 53 53 53 53 53 53 53 53 53 52 52 52 52 52 52 53 52 52 52 52 52 52 52 52 52 52 52 52 52 52 53 52 52 52 52 52 52
3417 52 52 52 52 52 52 52 52 52 52 52 52 52 52 52 52 52 52 52 52 52 52 52 52 52 52 51 52 52 52 52 52 52 52 52 52 52 53 53 52 52 52 52 52 52 52 52 52 52 52 52 53 52 52 52 52 53 53 52 52 52 52 52 52 52 52 52 52 52 52 52
3409 52 52 51 51 52 52 52 52 52 52 52 51 52 52 52 52 52 52 52 52 52 52 52 52 52 52 52 52 52 52 52 52 52 52 52 52 52 52 52 52 52 52 52 52 52 52 52 52 52 52 52 52 52 52 52 52 52 52 52 52 52 52 52 52 52 52 52 52 52 52 52
3402 52 52 52 52 52 52 52 52 52 52 52 52 52 52 52 52 52 52 52 52 52 52 52 52 52 52 52 52 52 52 52 52 52 52 52 52 52 52 52 52 52 52 52 52 52 52 51 51 52 52 52 52 52 52 52 52 52 52 52 52 51 51 51 51 51 52 52 52 52 52 51
3394 51 51 51 51 51 52 52 52 52 51 51 51 51 51 51 51 52 52 52 52 52 52 52 51 52 52 52 52 52 52 52 52 52 52 52 52 52 52 52 52 52 52 52 52 52 52 52 52 52 52 52 52 52 52 52 52 52 52 52 52 52 52 52 52 52 52 52 52 52 52 52
3387 52 52 52 52 52 52 52 52 52 52 52 52 53 53 53 53 53 53 53 52 52 52 52 52 52 52 52 52 52 52 52 52 52 52 52 52 52 52 52 52 52 52 52 52 52 53 53 52 52 52 52 52 52 52 52 52 52 52 52 52 53 53 52 53 52 52 52 52 53 53 53
3380 53 53 52 52 52 52 52 52 52 52 53 53 53 52 52 52 52 52 52 52 52 52 52 52 53 53 53 52 52 52 52 52 52 52 52 52 52 52 52 52 52 52 52 52 52 52 52 52 52 52 52 52 52 52 52 52 52 52 52 52 52 52 52 51 51 52 52 52 52 52 52
$$ packed form
3431E2%%%%%%%%J%%%%%%%%%%%j%%J%%%j%J%%%%%%%%%j%%%J%%%%%%%%%%%%%%%%%%%Jj%%%%%
3424E3%%%%%%%%%%%%%%%%%%j%%%%%J%%%%%%%%%%%%%%%%%j%%%%%Jj%%%%%%%%%%%%%Jj%%%%%
3417E2%%%%%%%%%%%%%%%%%%%%%%%%%jJ%%%%%%%%%J%j%%%%%%%%%%%Jj%%%J%j%%%%%%%%%%%%
3409E2%j%J%%%%%%jJ%%%%%%%%%%%%%%%%%%%%%%%%%%%%%%%%%%%%%%%%%%%%%%%%%%%%%%%%%%
3402E2%%%%%%%%%%%%%%%%%%%%%%%%%%%%%%%%%%%%%%%%%%%%%j%J%%%%%%%%%%%j%%%%J%%%%j
3394E1%%%%J%%%j%%%%%%J%%%%%%jJ%%%%%%%%%%%%%%%%%%%%%%%%%%%%%%%%%%%%%%%%%%%%%%
3387E2%%%%%%%%%%%J%%%%%%j%%%%%%%%%%%%%%%%%%%%%%%%%J%j%%%%%%%%%%%%J%jJj%%%J%%
3380E3%j%%%%%%%J%%j%%%%%%%%%%J%%j%%%%%%%%%%%%%%%%%%%%%%%%%%%%%%%%%%%j%J%%%%%
$$ plain form
3372 52 52 52 52 52 52 52 52 52 52 52 52 52 52 52 52 52 52 52 52 52 52 52 52 52 52 52 52 52 52 52 52 52 52 52 52 52 53 53 52 52 52 52 52 52 52 52 52 52 51 51 51 51 51 51 52 51 51 51 51 51 51 51 51 52 52 52 51 51 51 51
3365 51 51 51 51 51 51 51 51 51 51 51 51 51 51 51 51 51 51 51 51 51 51 51 51 51 51 51 51 51 51 51 51 51 51 51 51 51 51 51 51 51 51 51 51 51 51 51 51 50 50 50 50 50 50 51 51 51 51 51 51 50 50 50 50 50 50 50 49 49 49 50
3357 50 49 49 49 49 49 48 49 49 49 48 49 49 49 49 49 49 49 49 49 48 48 48 48 48 48 48 48 48 48 48 48 48 48 48 48 48 48 48 48 48 49 49 49 49 49 49 49 49 49 49 49 49 49 49 49 49 49 49 49 49 49 50 50 50 50 50 50 50 50 50
3350 50 50 50 50 51 51 51 51 51 51 51 51 51 51 51 51 51 51 51 51 52 52 52 52 52 52 52 52 52 52 52 52 52 52 52 52 52 52 52 52 52 52 52 52 53 53 52 52 52 52 52 52 52 52 52 52 52 52 52 52 52 52 53 53 53 52 52 52 52 52 52
3342 52 52 52 52 52 52 52 52 52 52 52 52 52 52 52 52 52 52 52 52 52 52 52 52 52 52 52 52 52 52 52 52 52 52 52 52 52 52 52 52 52 52 52 52 52 52 52 52 52 52 52 52 52 52 52 52 52 52 52 52 52 52 52 52 52 52 51 52 51 51 51
3335 51 52 52 52 52 52 52 52 52 52 52 52 52 52 52 52 52 52 52 52 52 52 52 52 52 52 52 52 52 52 52 52 52 52 52 53 52 52 52 52 53 53 53 53 52 52 52 52 52 51 51 51 51 52 52 52 52 52 53 53 53 53 52 52 52 52 52 53 53 52 52
3328 52 52 53 53 53 53 53 53 53 54 54 54 54 55 55 55 55 54 54 54 54 54 53 53 53 53 53 53 53 53 53 53 53 52 52 52 52 52 52 52 52 52 52 52 52 52 52 52 52 52 52 52 52 52 52 52 52 52 52 52 52 52 52 52 52 52 52 52 52 52 51
3320 51 51 51 51 52 52 52 52 52 52 52 51 52 52 52 52 52 52 51 51 52 52 52 52 52 52 52 52 52 52 52 51 51 51 51 51 51 51 51 51 51 51 51 51 51 51 51 51 51 51 51 51 51 51 51 51 51 51 51 52 52 52 52 52 52 52 52 52 51 51 51
$$ packed form
3372E2%%%%%%%%%%%%%%%%%%%%%%%%%%%%%%%%%%%%J%j%%%%%%%%%j%%%%%Jj%%%%%%%J%%j%%%
3365E1%%%%%%%%%%%%%%%%%%%%%%%%%%%%%%%%%%%%%%%%%%%%%%%j%%%%%J%%%%%j%%%%%%j%%J
3357E0j%%%%jJ%%jJ%%%%%%%%j%%%%%%%%%%%%%%%%%%%%J%%%%%%%%%%%%%%%%%%%%J%%%%%%%%
3350E0%%%J%%%%%%%%%%%%%%%J%%%%%%%%%%%%%%%%%%%%%%%J%j%%%%%%%%%%%%%%%J%%j%%%%%
3342E2%%%%%%%%%%%%%%%%%%%%%%%%%%%%%%%%%%%%%%%%%%%%%%%%%%%%%%%%%%%%%%%%%jJj%%
3335E1J%%%%%%%%%%%%%%%%%%%%%%%%%%%%%%%%%Jj%%%J%%%j%%%%j%%%J%%%%J%%%j%%%%J%j%
3328E2%J%%%%%%J%%%J%%%j%%%%j%%%%%%%%%%j%%%%%%%%%%%%%%%%%%%%%%%%%%%%%%%%%%%%j
3320E1%%%J%%%%%%jJ%%%%%j%J%%%%%%%%%%j%%%%%%%%%%%%%%%%%%%%%%%%%%%J%%%%%%%%j%%
$$ plain form
3313 51 51 51 51 51 51 52 52 52 52 52 52 52 52 52 52 52 52 52 52 52 52 52 52 52 52 51 51 51 52 52 52 52 52 52 52 52 52 52 52 52 52 52 52 52 51 52 52 52 52 52 52 52 52 52 52 51 51 51 51 51 51 52 52 52 52 51 51 51 52 52
3305 52 51 51 51 51 51 51 51 51 51 51 51 51 51 51 51 51 51 51 51 51 51 51 52 51 51 51 51 51 51 51 51 51 51 51 51 51 51 51 52 52 52 52 52 52 52 52 52 51 51 51 51 51 51 51 51 52 52 52 52 52 51 51 51 51 51 51 51 51 51 52
3298 52 52 51 51 51 51 51 51 51 52 52 52 52 52 52 52 52 52 52 52 52 52 52 52 52 51 51 51 51 52 52 52 52 52 52 52 52 52 51 51 51 51 51 52 52 52 52 52 52 52 52 52 52 52 52 52 52 52 52 51 51 51 51 51 52 52 51 51 51 51 51
3290 51 51 51 51 51 51 51 51 51 51 51 51 51 51 51 51 51 51 51 51 51 51 51 51 51 51 51 51 51 51 51 51 51 51 51 51 51 51 51 51 51 51 51 51 51 51 51 51 51 51 51 51 51 51 51 51 51 51 51 51 51 51 51 50 50 50 51 51 51 51 51
3283 51 51 51 51 51 51 52 51 51 51 51 51 51 51 51 51 51 51 51 51 51 51 51 51 51 51 51 51 51 51 51 51 51 51 51 51 51 51 51 51 51 51 51 51 51 51 51 51 51 51 51 52 52 52 52 51 51 51 51 51 52 52 52 52 52 52 52 52 52 52 52
3276 52 52 52 52 51 52 52 52 52 52 52 52 52 52 52 52 52 52 52 52 52 52 52 52 52 52 52 52 52 52 52 52 52 52 52 52 51 51 51 51 51 51 51 51 51 52 52 52 52 52 52 52 52 52 52 52 52 52 52 52 52 52 52 51 51 51 51 51 51 52 52
3268 52 52 52 52 52 52 52 52 52 52 52 52 52 52 52 52 52 52 52 52 52 52 52 52 52 52 52 52 52 52 52 52 52 52 52 52 52 52 52 52 52 52 52 52 52 52 52 52 52 52 52 52 52 52 52 52 52 52 52 51 51 51 51 52 52 52 52 52 52 52 52
3261 52 52 52 52 52 52 51 51 51 51 51 51 51 51 52 52 51 51 51 51 51 51 51 51 51 51 51 51 51 51 51 51 51 51 51 51 51 51 51 51 51 51 51 51 51 51 51 51 50 50 50 50 50 50 50 50 50 50 50 50 50 50 50 50 50 50 50 50 50 50 50
$$ packed form
3313E1%%%%%J%%%%%%%%%%%%%%%%%%%j%%J%%%%%%%%%%%%%%%jJ%%%%%%%%%j%%%%%J%%%j%%J%
3305E2j%%%%%%%%%%%%%%%%%%%%%Jj%%%%%%%%%%%%%%J%%%%%%%%j%%%%%%%J%%%%j%%%%%%%%J
3298E2%j%%%%%%J%%%%%%%%%%%%%%%j%%%J%%%%%%%%j%%%%J%%%%%%%%%%%%%%%j%%%%J%j%%%%
3290E1%%%%%%%%%%%%%%%%%%%%%%%%%%%%%%%%%%%%%%%%%%%%%%%%%%%%%%%%%%%%%%j%%J%%%%
3283E1%%%%%Jj%%%%%%%%%%%%%%%%%%%%%%%%%%%%%%%%%%%%%%%%%%%J%%%j%%%%J%%%%%%%%%%
3276E2%%%jJ%%%%%%%%%%%%%%%%%%%%%%%%%%%%%%j%%%%%%%%J%%%%%%%%%%%%%%%%%j%%%%%J%
3268E2%%%%%%%%%%%%%%%%%%%%%%%%%%%%%%%%%%%%%%%%%%%%%%%%%%%%%%%%%%j%%%J%%%%%%%
3261E2%%%%%j%%%%%%%J%j%%%%%%%%%%%%%%%%%%%%%%%%%%%%%%%j%%%%%%%%%%%%%%%%%%%%%%
$$ plain form
3253 50 50 50 50 50 50 50 50 50 50 49 49 49 49 49 49 49 50 50 50 49 49 49 49 49 49 49 49 49 49 49 49 49 49 49 49 49 49 49 49 49 49 49 49 49 49 49 49 49 49 49 49 49 49 48 48 48 48 48 48 48 48 48 48 48 48 48 48 49 49 49
3246 49 48 48 48 48 49 49 49 49 49 49 48 48 49 49 49 49 49 49 49 49 49 49 49 49 50 50 50 50 50 50 50 50 50 50 50 51 51 51 51 50 50 50 51 51 51 51 51 51 51 51 51 51 51 51 51 51 51 51 51 51 51 51 51 51 51 51 51 52 52 52
3239 52 52 52 52 52 52 52 52 52 52 52 52 52 52 52 52 52 51 52 52 52 52 52 52 52 52 52 52 52 52 52 52 52 52 52 52 52 52 52 52 52 52 52 52 52 52 52 52 52 52 52 52 52 52 52 52 52 52 52 52 52 52 52 52 52 52 52 52 52 52 52
3231 52 52 52 52 52 52 52 52 52 52 52 51 52 52 52 52 52 52 52 52 52 52 52 52 52 52 52 52 52 52 52 52 52 52 52 52 52 52 52 52 52 52 52 52 52 52 52 52 52 52 52 52 52 52 52 52 52 52 52 52 52 52 52 52 52 52 52 52 52 52 52
3224 52 53 53 53 52 52 52 52 52 52 52 52 52 52 52 52 52 52 52 53 53 53 53 53 53 53 52 52 52 52 52 52 52 52 52 52 52 52 52 52 52 52 52 52 52 52 52 52 52 52 52 52 52 52 52 53 53 52 52 52 52 52 52 51 52 52 52 52 52 52 52
3216 52 52 52 52 52 52 52 52 52 52 52 52 51 51 52 52 52 52 52 52 52 52 52 52 52 51 51 51 51 51 51 51 51 51 51 51 52 52 52 52 52 51 51 51 51 51 51 51 51 51 51 51 51 51 51 51 52 51 51 51 51 51 51 52 52 52 52 52 52 52 52
3209 52 52 52 51 51 51 51 51 52 52 52 52 52 52 51 51 51 51 51 51 51 51 51 51 51 51 51 51 51 51 51 51 51 51 51 51 51 51 51 51 51 51 51 51 51 51 51 51 51 51 51 51 51 51 51 51 51 52 51 51 51 51 51 51 51 51 51 51 51 51 51
3201 51 51 51 51 51 51 51 51 51 51 51 51 51 51 51 51 51 51 51 51 51 51 51 51 51 51 51 51 51 51 51 51 51 51 51 51 51 51 51 51 51 51 51 51 51 51 51 51 51 51 51 51 51 51 51 51 51 51 51 51 51 51 52 52 51 51 51 51 51 51 51
$$ packed form
3253E0%%%%%%%%%j%%%%%%J%%j%%%%%%%%%%%%%%%%%%%%%%%%%%%%%%%%%j%%%%%%%%%%%%%J%%
3246D9j%%%J%%%%%j%J%%%%%%%%%%%J%%%%%%%%%%J%%%j%%J%%%%%%%%%%%%%%%%%%%%%%%%J%%
3239E2%%%%%%%%%%%%%%%%jJ%%%%%%%%%%%%%%%%%%%%%%%%%%%%%%%%%%%%%%%%%%%%%%%%%%%%
3231E2%%%%%%%%%%jJ%%%%%%%%%%%%%%%%%%%%%%%%%%%%%%%%%%%%%%%%%%%%%%%%%%%%%%%%%%
3224E2J%%j%%%%%%%%%%%%%%J%%%%%%j%%%%%%%%%%%%%%%%%%%%%%%%%%%%J%j%%%%%jJ%%%%%%
3216E2%%%%%%%%%%%j%J%%%%%%%%%%j%%%%%%%%%%J%%%%j%%%%%%%%%%%%%%Jj%%%%%J%%%%%%%
3209E2%%j%%%%J%%%%%j%%%%%%%%%%%%%%%%%%%%%%%%%%%%%%%%%%%%%%%%%%Jj%%%%%%%%%%%%
3201E1%%%%%%%%%%%%%%%%%%%%%%%%%%%%%%%%%%%%%%%%%%%%%%%%%%%%%%%%%%%%%J%j%%%%%%
$$ plain form
3194 51 51 51 51 51 51 51 51 51 51 51 51 51 51 51 51 51 51 51 51 51 51 51 51 51 51 51 51 51 51 51 51 51 51 51 51 51 51 51 51 51 51 51 51 51 51 52 52 52 52 52 52 51 51 51 51 51 51 51 51 51 51 51 51 51 51 51 51 51 50 51
3187 51 51 51 51 51 51 51 51 52 52 52 51 51 51 51 51 52 52 52 52 52 52 52 51 51 51 51 51 51 51 51 51 51 51 51 51 51 51 51 50 50 50 51 51 51 51 51 51 51 51 51 51 51 51 51 51 51 51 51 51 51 51 51 51 51 51 51 51 51 51 51
3179 51 51 52 52 51 51 51 51 51 51 51 51 51 51 51 51 51 51 51 51 51 51 51 51 51 51 50 50 51 51 51 51 51 51 51 51 51 51 51 51 51 51 51 51 51 51 51 51 51 51 51 51 51 51 51 51 51 51 51 51 51 51 51 51 52 52 52 52 52 52 51
3172 51 51 51 51 51 51 51 51 51 51 51 51 51 51 51 51 51 51 51 51 51 51 51 51 51 51 51 51 51 51 51 51 51 51 51 51 51 51 51 51 51 51 51 51 51 51 51 51 51 51 51 52 51 51 51 51 51 51 51 51 51 51 51 51 51 51 51 51 51 51 51
3164 51 51 51 51 51 51 51 51 51 51 51 51 51 51 51 51 51 51 51 51 51 51 51 51 51 52 52 52 52 52 52 52 52 52 52 52 52 52 52 51 52 52 52 52 51 51 51 51 51 51 51 51 52 52 52 52 51 51 51 51 51 52 52 51 51 51 52 51 51 51 52
3157 52 52 52 52 52 52 52 52 52 52 52 52 52 52 52 52 52 52 52 52 52 52 52 52 52 52 52 52 52 52 52 52 52 52 52 52 52 52 52 52 52 52 52 52 52 52 52 52 52 52 52 52 52 52 52 52 52 52 52 52 52 52 52 52 52 52 52 52 52 52 52
3150 52 52 52 52 52 52 52 52 52 52 52 52 52 52 52 52 52 52 52 52 52 52 52 52 52 52 52 52 53 53 53 52 52 52 52 52 52 52 52 52 52 52 52 52 52 52 52 52 52 52 52 52 52 52 52 52 53 53 53 52 52 52 52 51 51 52 52 52 52 52 52
3142 52 52 52 52 52 52 52 52 52 52 52 52 52 52 52 52 52 52 52 52 52 52 52 52 52 52 52 51 52 52 52 52 52 52 51 51 51 51 51 52 52 52 52 52 52 51 51 51 51 51 51 51 51 51 51 52 52 52 52 52 52 52 51 51 51 52 52 52 52 52 51
$$ packed form
3194E1%%%%%%%%%%%%%%%%%%%%%%%%%%%%%%%%%%%%%%%%%%%%%J%%%%%j%%%%%%%%%%%%%%%%jJ
3187E1%%%%%%%J%%j%%%%J%%%%%%j%%%%%%%%%%%%%%%j%%J%%%%%%%%%%%%%%%%%%%%%%%%%%%%
3179E1%J%j%%%%%%%%%%%%%%%%%%%%%j%J%%%%%%%%%%%%%%%%%%%%%%%%%%%%%%%%%%%J%%%%%j
3172E1%%%%%%%%%%%%%%%%%%%%%%%%%%%%%%%%%%%%%%%%%%%%%%%%%%Jj%%%%%%%%%%%%%%%%%%
3164E1%%%%%%%%%%%%%%%%%%%%%%%%J%%%%%%%%%%%%%jJ%%%j%%%%%%%J%%%j%%%%J%j%%Jj%%J
3157E2%%%%%%%%%%%%%%%%%%%%%%%%%%%%%%%%%%%%%%%%%%%%%%%%%%%%%%%%%%%%%%%%%%%%%%
3150E2%%%%%%%%%%%%%%%%%%%%%%%%%%%J%%j%%%%%%%%%%%%%%%%%%%%%%%%J%%j%%%j%J%%%%%
3142E2%%%%%%%%%%%%%%%%%%%%%%%%%%jJ%%%%%j%%%%J%%%%%j%%%%%%%%%J%%%%%%j%%J%%%%j
$$ plain form
3135 51 51 51 52 51 51 51 51 51 51 51 51 51 51 51 51 51 51 51 52 52 52 52 51 51 51 51 51 51 52 51 51 51 51 51 51 52 52 52 51 51 51 51 51 51 51 51 51 51 51 51 51 51 51 51 51 51 51 51 51 51 51 51 51 51 51 51 51 51 51 51
3127 51 51 51 51 51 51 51 51 51 52 52 52 51 51 51 51 51 51 51 52 51 51 51 51 51 51 51 51 51 51 51 51 51 51 51 51 51 51 51 51 51 51 51 51 50 50 50 50 50 50 50 50 51 51 51 51 51 51 51 51 51 51 51 51 51 51 51 51 51 51 51
3120 51 51 51 51 51 51 51 51 51 51 51 51 51 51 51 51 51 51 51 51 51 51 51 51 51 51 51 51 51 51 50 50 50 50 50 50 50 50 50 50 49 49 49 50 50 50 50 50 50 50 50 50 50 50 50 50 50 50 50 50 50 50 50 50 50 50 50 50 50 50 50
3112 50 50 50 50 51 51 51 51 51 51 50 50 51 51 51 51 51 51 51 50 51 51 51 51 51 50 50 50 50 51 50 50 50 50 50 50 50 50 50 50 50 50 50 50 50 50 50 50 50 50 50 49 50 50 50 50 50 50 50 50 50 50 50 50 50 50 50 50 50 51 51
3105 51 51 51 51 51 51 51 51 51 51 51 51 51 51 51 51 51 51 51 51 51 51 51 51 51 51 51 51 51 51 51 51 51 51 51 51 51 51 51 51 50 50 50 50 50 50 50 50 50 51 51 51 51 51 51 51 51 50 50 50 50 50 51 51 51 50 50 50 50 50 50
3098 50 50 50 50 50 50 50 50 51 51 50 50 50 51 51 51 51 51 51 51 51 51 50 50 50 51 51 51 51 51 51 51 51 51 51 50 50 51 51 51 51 51 51 51 51 50 50 50 50 50 50 50 50 50 50 50 50 50 50 50 50 50 50 50 49 49 49 49 49 50 49
3090 49 49 49 50 50 50 50 50 50 50 50 50 50 50 50 50 50 50 50 50 50 50 50 50 50 50 50 50 50 50 50 50 50 50 50 50 50 50 50 50 50 50 50 50 50 50 50 50 50 50 50 50 50 50 50 50 50 50 50 50 50 50 50 50 50 50 49 49 50 49 49
3083 49 49 49 49 49 50 50 50 50 50 50 50 50 50 50 50 50 50 50 50 50 50 50 50 50 50 50 50 51 51 51 50 50 50 50 50 50 50 50 50 51 51 51 50 51 51 51 51 51 51 51 50 50 50 50 50 50 50 50 50 50 50 50 50 50 50 50 50 50 50 50
$$ packed form
3135E1%%Jj%%%%%%%%%%%%%%J%%%j%%%%%Jj%%%%%J%%j%%%%%%%%%%%%%%%%%%%%%%%%%%%%%%%
3127E1%%%%%%%%J%%j%%%%%%Jj%%%%%%%%%%%%%%%%%%%%%%%j%%%%%%%J%%%%%%%%%%%%%%%%%%
3120E1%%%%%%%%%%%%%%%%%%%%%%%%%%%%%j%%%%%%%%%j%%J%%%%%%%%%%%%%%%%%%%%%%%%%%%
3112E0%%%J%%%%%j%J%%%%%%jJ%%%%j%%%Jj%%%%%%%%%%%%%%%%%%%%jJ%%%%%%%%%%%%%%%%J%
3105E1%%%%%%%%%%%%%%%%%%%%%%%%%%%%%%%%%%%%%%%j%%%%%%%%J%%%%%%%j%%%%J%%j%%%%%
3098E0%%%%%%%J%j%%J%%%%%%%%j%%J%%%%%%%%%j%J%%%%%%%j%%%%%%%%%%%%%%%%%%j%%%%Jj
3090D9%%J%%%%%%%%%%%%%%%%%%%%%%%%%%%%%%%%%%%%%%%%%%%%%%%%%%%%%%%%%%%%%%j%Jj%
3083D9%%%%J%%%%%%%%%%%%%%%%%%%%%%J%%j%%%%%%%%J%%jJ%%%%%%j%%%%%%%%%%%%%%%%%%%
$$ plain form
3075 50 50 50 50 50 50 50 50 50 51 51 51 51 51 51 51 51 51 51 51 51 51 50 51 51 51 51 51 51 51 51 51 51 51 51 51 51 51 51 51 51 51 50 51 51 51 51 51 51 51 51 51 51 51 51 51 51 51 51 51 51 51 51 51 51 51 51 51 51 51 51
3068 51 51 51 51 51 51 51 51 51 51 51 51 51 51 51 50 50 51 51 51 51 51 51 51 51 51 51 51 51 51 51 51 51 51 51 51 50 50 50 50 50 50 50 50 50 50 50 50 50 50 50 50 50 50 50 51 51 51 51 51 51 51 51 51 51 51 51 51 51 51 51
3061 51 51 50 50 50 50 50 51 51 51 51 50 50 50 50 50 50 50 50 50 50 50 50 50 50 51 51 51 51 51 51 51 51 51 50 50 50 50 50 50 50 50 50 50 50 51 51 51 51 51 51 50 50 50 50 50 50 50 50 50 50 50 50 50 51 51 50 50 50 50 50
3053 50 50 50 50 50 50 50 50 50 50 50 50 50 51 51 51 50 51 51 51 51 50 50 50 50 50 50 50 51 51 51 51 51 51 51 51 51 51 51 51 51 50 50 50 50 50 50 50 50 50 50 50 50 50 50 50 50 50 50 50 50 50 51 50 50 50 50 51 51 51 51
3046 51 51 51 50 50 50 50 50 50 50 50 50 50 51 51 51 51 50 51 51 51 50 50 51 51 51 50 50 50 50 51 51 51 51 50 50 51 51 51 51 51 50 50 50 50 50 50 50 50 50 50 50 50 50 50 50 50 50 50 50 50 50 50 50 50 51 51 51 50 50 51
3038 51 51 51 51 51 51 51 51 51 51 50 50 50 50 50 50 50 50 50 50 50 50 50 50 50 50 50 50 50 50 50 51 51 50 50 50 50 50 50 50 50 50 50 50 50 50 50 50 50 50 51 50 50 50 50 50 50 50 50 50 50 50 50 50 50 50 50 50 50 50 50
3031 50 50 50 50 50 50 50 50 50 50 50 50 50 50 50 50 50 50 50 50 49 49 50 50 49 50 50 49 49 49 49 49 49 49 49 49 49 49 49 49 49 49 49 49 49 49 49 49 49 49 49 49 49 49 49 49 49 49 49 49 49 49 49 49 49 49 49 49 49 49 49
3023 49 49 49 49 49 49 49 49 49 49 49 49 49 49 49 49 49 49 49 49 49 49 49 49 49 49 49 49 49 49 49 49 49 48 48 48 48 48 49 49 49 49 48 48 48 48 48 48 48 48 48 48 48 48 48 48 48 48 48 49 49 49 49 49 49 48 48 49 49 49 49
$$ packed form
3075E0%%%%%%%%J%%%%%%%%%%%%jJ%%%%%%%%%%%%%%%%%%jJ%%%%%%%%%%%%%%%%%%%%%%%%%%%
3068E1%%%%%%%%%%%%%%j%J%%%%%%%%%%%%%%%%%%j%%%%%%%%%%%%%%%%%%J%%%%%%%%%%%%%%%
3061E1%j%%%%J%%%j%%%%%%%%%%%%%J%%%%%%%%j%%%%%%%%%%J%%%%%j%%%%%%%%%%%%J%j%%%%
3053E0%%%%%%%%%%%%J%%jJ%%%j%%%%%%J%%%%%%%%%%%%j%%%%%%%%%%%%%%%%%%%%Jj%%%J%%%
3046E1%%j%%%%%%%%%J%%%jJ%%j%J%%j%%%J%%%j%J%%%%j%%%%%%%%%%%%%%%%%%%%%%%J%%j%J
3038E1%%%%%%%%%j%%%%%%%%%%%%%%%%%%%%J%j%%%%%%%%%%%%%%%%Jj%%%%%%%%%%%%%%%%%%%
3031E0%%%%%%%%%%%%%%%%%%%j%J%jJ%j%%%%%%%%%%%%%%%%%%%%%%%%%%%%%%%%%%%%%%%%%%%
3023D9%%%%%%%%%%%%%%%%%%%%%%%%%%%%%%%%j%%%%J%%%j%%%%%%%%%%%%%%%%J%%%%%j%J%%%
$$ plain form
3016 49 49 49 49 49 49 49 49 49 49 49 49 49 49 49 49 49 49 49 49 49 49 49 49 49 49 49 49 49 49 49 49 49 49 49 49 49 49 50 50 50 49 49 49 49 49 49 49 50 50 50 50 50 50 50 50 50 50 50 50 50 50 50 50 50 50 50 51 51 50 50
3009 50 50 50 50 50 50 50 50 50 51 50 50 50 50 50 50 50 50 50 50 50 50 50 50 50 50 50 50 50 51 50 50 50 50 50 50 50 50 51 51 51 51 51 51 51 51 51 51 51 51 51 51 51 52 51 51 51 51 51 51 51 51 51 51 51 51 51 51 51 51 51
3001 51 51 51 52 51 51 51 51 51 51 51 51 51 51 51 51 51 51 51 51 51 51 51 51 51 51 51 51 51 51 51 51 51 51 51 51 51 51 51 51 51 51 51 51 51 51 51 51 51 51 51 51 51 51 51 51 51 51 51 51 51 51 51 51 51 50 50 50 50 50 51
2994 51 51 50 50 50 50 50 50 50 50 50 50 50 50 50 50 50 50 50 50 50 50 50 50 51 51 51 50 51 51 51 51 51 51 50 50 50 50 50 50 50 50 51 51 51 51 50 50 50 50 50 50 50 50 50 50 50 50 50 50 50 51 51 51 51 50 50 50 50 50 50
2986 50 50 50 50 50 50 50 50 50 50 49 49 49 49 49 49 49 49 49 49 49 49 49 49 49 49 49 49 49 48 48 48 48 48 48 49 49 49 49 49 49 49 49 49 49 49 49 49 49 49 49 49 49 49 49 49 49 49 50 49 49 49 49 49 49 49 50 50 50 50 50
2979 50 50 50 50 50 50 50 50 50 50 50 50 50 50 50 50 50 50 50 50 50 50 50 50 50 50 50 50 50 50 50 50 50 50 49 49 49 49 50 50 50 50 49 49 49 50 50 50 50 50 49 49 49 49 49 49 49 50 50 50 50 50 49 49 50 50 50 50 50 50 50
2972 50 50 50 50 50 50 50 50 50 50 50 50 50 50 50 50 50 50 50 50 50 50 50 50 50 50 50 50 51 51 51 51 50 50 51 51 51 51 51 51 51 51 51 51 51 51 51 51 51 51 51 51 50 51 51 51 51 50 50 50 50 50 50 50 50 50 50 50 50 51 51
2964 51 51 51 51 51 51 51 51 51 51 51 51 51 51 51 51 51 51 51 51 51 51 51 51 50 50 50 50 50 50 50 50 50 50 50 50 50 50 50 50 50 50 50 50 50 50 50 50 50 50 50 50 50 50 50 50 51 51 51 51 51 51 51 51 51 51 51 51 51 51 51
$$ packed form
3016D9%%%%%%%%%%%%%%%%%%%%%%%%%%%%%%%%%%%%%J%%j%%%%%%J%%%%%%%%%%%%%%%%%%J%j%
3009E0%%%%%%%%Jj%%%%%%%%%%%%%%%%%%Jj%%%%%%%J%%%%%%%%%%%%%%Jj%%%%%%%%%%%%%%%%
3001E1%%Jj%%%%%%%%%%%%%%%%%%%%%%%%%%%%%%%%%%%%%%%%%%%%%%%%%%%%%%%%%%%%j%%%%J
2994E1%j%%%%%%%%%%%%%%%%%%%%%J%%jJ%%%%%j%%%%%%%J%%%j%%%%%%%%%%%%%%J%%%j%%%%%
2986E0%%%%%%%%%j%%%%%%%%%%%%%%%%%%j%%%%%J%%%%%%%%%%%%%%%%%%%%%%Jj%%%%%%J%%%%
2979E0%%%%%%%%%%%%%%%%%%%%%%%%%%%%%%%%%j%%%J%%%j%%J%%%%j%%%%%%J%%%%j%J%%%%%%
2972E0%%%%%%%%%%%%%%%%%%%%%%%%%%%J%%%j%J%%%%%%%%%%%%%%%%%jJ%%%j%%%%%%%%%%%J%
2964E1%%%%%%%%%%%%%%%%%%%%%%%j%%%%%%%%%%%%%%%%%%%%%%%%%%%%%%%J%%%%%%%%%%%%%%
$$ plain form
2957 51 51 51 51 51 51 51 51 51 50 50 50 50 50 50 50 50 50 50 50 50 50 50 50 50 50 50 50 49 49 49 50 50 50 50 50 50 50 50 50 50 50 50 50 50 50 51 51 51 51 50 50 51 51 51 51 51 50 50 50 50 50 51 51 51 51 51 51 51 51 52
2949 52 52 51 51 51 51 51 51 50 50 50 50 50 50 50 50 50 50 50 50 50 50 50 50 50 50 50 50 50 50 50 50 50 50 50 50 50 50 50 50 50 50 50 50 50 50 50 50 50 50 50 50 50 50 50 50 50 50 50 50 50 50 50 50 50 50 50 50 50 50 50
2942 50 50 50 50 50 50 50 50 50 50 50 50 50 50 50 50 50 50 50 50 50 50 50 50 50 50 50 50 50 50 50 50 50 50 50 50 50 50 50 50 49 49 50 50 50 50 50 50 50 50 50 50 50 50 50 50 50 50 50 50 50 50 50 50 50 50 50 50 50 50 50
2934 50 50 50 50 50 50 50 50 50 50 50 50 50 51 51 50 50 50 51 51 50 50 50 50 50 50 50 49 50 50 50 50 50 50 50 50 50 50 50 50 50 50 50 50 50 50 50 50 50 50 49 49 49 50 50 50 50 50 50 50 50 50 50 50 50 50 50 50 50 50 50
2927 50 50 50 50 50 50 50 51 51 51 51 51 51 51 51 51 51 51 51 51 51 52 51 51 51 51 51 51 51 51 51 51 51 51 51 50 50 50 50 50 51 51 51 51 51 51 50 50 50 51 51 51 50 50 51 51 50 50 50 50 50 50 50 50 51 51 51 51 50 50 50
2920 50 50 51 51 50 50 50 51 51 51 51 51 51 51 51 51 51 51 51 51 51 51 51 51 51 51 51 51 51 51 51 51 51 51 51 51 51 51 50 50 50 50 50 50 51 51 51 51 50 50 51 51 51 51 51 51 51 51 51 51 51 51 51 51 51 51 51 51 51 51 51
2912 51 51 51 51 51 52 52 52 52 52 52 51 51 51 51 51 51 51 51 50 50 51 51 51 51 51 51 51 51 51 51 51 51 51 51 51 51 51 51 50 50 50 51 51 51 51 51 51 51 51 51 51 50 50 50 51 51 51 51 51 51 51 51 51 51 51 51 51 51 51 51
2905 51 51 51 51 51 51 51 51 51 51 51 51 51 51 51 51 51 51 51 51 51 51 51 51 51 51 51 50 50 50 50 50 51 51 51 52 52 51 51 51 51 51 52 52 52 52 51 51 51 51 51 51 51 51 51 51 51 51 51 50 50 50 50 51 51 51 52 51 51 51 51
$$ packed form
2957E1%%%%%%%%j%%%%%%%%%%%%%%%%%%j%%J%%%%%%%%%%%%%%J%%%j%J%%%%j%%%%J%%%%%%%J
2949E2%j%%%%%j%%%%%%%%%%%%%%%%%%%%%%%%%%%%%%%%%%%%%%%%%%%%%%%%%%%%%%%%%%%%%%
2942E0%%%%%%%%%%%%%%%%%%%%%%%%%%%%%%%%%%%%%%%j%J%%%%%%%%%%%%%%%%%%%%%%%%%%%%
2934E0%%%%%%%%%%%%J%j%%J%j%%%%%%jJ%%%%%%%%%%%%%%%%%%%%%j%%J%%%%%%%%%%%%%%%%%
2927E0%%%%%%J%%%%%%%%%%%%%Jj%%%%%%%%%%%%j%%%%J%%%%%j%%J%%j%J%j%%%%%%%J%%%j%%
2920E0%J%j%%J%%%%%%%%%%%%%%%%%%%%%%%%%%%%%%j%%%%%J%%%j%J%%%%%%%%%%%%%%%%%%%%
2912E1%%%%J%%%%%j%%%%%%%j%J%%%%%%%%%%%%%%%%%j%%J%%%%%%%%%j%%J%%%%%%%%%%%%%%%
2905E1%%%%%%%%%%%%%%%%%%%%%%%%%%j%%%%J%%J%j%%%%J%%%j%%%%%%%%%%%%j%%%J%%Jj%%%
$$ plain form
2897 51 51 51 51 52 52 52 52 52 51 51 51 51 51 51 51 51 51 51 51 51 52 52 52 52 52 52 52 52 52 53 53 53 53 54 54 55 56 58 59 61 64 67 71 76 81 88 94 101 107 111 112 109 105 98 90 83 76 71 67 63 61 60 59 59 58 58 58 57 57 58
2890 58 58 58 58 58 59 59 59 59 59 59 59 60 60 59 59 59 59 58 58 57 57 57 57 57 57 57 57 57 57 58 59 60 62 64 67 71 76 82 91 102 116 133 152 172 194 214 229 237 235 223 203 179 155 132 114 99
2884 99 89 81 75 71 68 66 64 62 61 60 59 57 56 56 55 54 54 54 53 53 52 52 52 52 52 52 52 52 53 53 53 53 53 53 53 53 53 54 54 55 55 56 58 59 61 64 67 72 78 86 97 110 125 143 163 185 206 224 236 238
2878 238 230 213 190 165 141 121 105 93 83 77 72 68 66 64 62 61 59 58 57 56 55 55 54 54 53 53 53 52 52 52 52 52 52 52 52 52 51 51 51 51 51 51 51 51 51 51 51 51 52 52 53 54 55 56 57 60 62 65 69 74 79
2871 79 85 92 99 106 110 113 112 107 100 92 84 76 70 66 62 60 58 57 56 55 54 54 53 53 52 52 52 52 51 51 51 51 51 51 51 51 51 51 50 50 50 50 50 50 50 50 50 50 50 50 50 50 50 50 50 50 50 49 49 49 49 49 49 50 50 50 50 51 50 50
2864 50 49 49 49 49 49 49 49 49 49 49 48 48 48 48 49 49 49 49 49 49 49 50 50 50 50 50 50 50 50 49 49 49 49 49 49 49 49 49 49 49 49 49 49 48 48 48 48 48 48 48 48 48 48 48 48 48 48 49 49 49 49 49 49 49 49 49 49 49 49 49
2856 49 49 49 49 49 49 48 48 48 48 48 48 48 48 48 48 48 48 48 48 48 48 48 48 48 48 48 49 49 49 49 49 49 49 49 50 50 50 50 50 50 50 50 50 50 50 49 49 49 49 50 50 50 50 49 49 50 50 50 50 50 50 50 50 50 50 50 50 50 49 49
2849 49 49 49 50 49 49 49 50 50 50 50 51 51 51 51 51 51 51 51 51 52 52 51 52 52 52 53 53 53 53 53 53 53 52 52 52 52 52 52 51 51 51 51 51 51 51 51 51 51 51 51 50 50 50 50 50 50 50 50 50 50 50 50 50 50 50 50 50 50 50 50
$$ packed form
2897E1%%%J%%%%j%%%%%%%%%%%J%%%%%%%%J%%%J%JJKJKLLMNNPOPOMJlmpqppnmmkjj%j%%j%J
2890E8%%%%J%%%%%%J%j%%%j%j%%%%%%%%%JJJKKLMNORJ1J4J7J9K0K2K0J5Qkj2k0k4k4k3j8j5
2884I9j0qomlkkkjjjkj%jj%%j%j%%%%%%%J%%%%%%%%J%J%JKJKLLNOQJ1J3J5J8K0K2K1J8J2K
2878B38qj7k3k5k4k0j6j2j0onmkkkjkjjjj%j%j%%j%%%%%%%%j%%%%%%%%%%%J%JJJJJLKLMNN
2871G9OPPPMLjnpqqqommkkjjjj%j%j%%%j%%%%%%%%%j%%%%%%%%%%%%%%%%%%j%%%%%J%%%Jj%
2864E0j%%%%%%%%%j%%%J%%%%%%J%%%%%%%j%%%%%%%%%%%%%j%%%%%%%%%%%%%J%%%%%%%%%%%%
2856D9%%%%%j%%%%%%%%%%%%%%%%%%%%J%%%%%%%J%%%%%%%%%%j%%%J%%%j%J%%%%%%%%%%%%j%
2849D9%%Jj%%J%%%J%%%%%%%%J%jJ%%J%%%%%%j%%%%%j%%%%%%%%%%%j%%%%%%%%%%%%%%%%%%%
$$ plain form
2842 50 50 50 50 50 50 50 50 50 50 50 50 50 50 50 50 50 50 50 50 51 51 51 51 51 51 51 51 51 50 50 50 50 50 50 50 50 50 50 50 50 50 49 49 49 50 50 50 50 50 50 50 50 50 50 50 50 50 50 49 49 49 49 49 50 50 50 50 50 50 50
2834 50 50 50 50 50 50 50 50 50 50 50 50 50 50 50 50 50 50 50 50 49 49 49 50 50 50 50 49 49 49 49 49 49 50 50 50 50 50 50 50 50 50 50 50 50 50 50 50 50 50 50 50 50 50 50 50 50 50 50 50 50 50 50 50 50 50 50 50 50 50 49
2827 49 49 49 50 50 50 50 50 50 50 50 50 50 50 50 50 49 49 49 49 49 50 50 50 50 50 50 50 50 50 50 50 50 50 50 50 50 50 50 50 50 50 50 50 51 51 51 51 51 51 50 50 50 50 50 50 50 50 50 50 50 50 50 50 50 50 50 50 49 49 49
2819 49 49 49 49 49 49 49 50 50 50 50 50 50 50 50 49 50 50 50 50 50 50 50 50 50 50 50 50 50 50 50 50 49 50 50 50 50 49 49 49 49 50 50 50 50 50 50 49 49 50 50 50 50 50 50 50 49 49 49 49 49 50 50 50 50 50 50 50 50 50 50
2812 50 50 50 50 50 50 50 50 50 50 50 49 49 49 49 50 50 50 50 50 50 50 50 50 50 50 50 50 50 50 50 50 50 49 49 49 50 50 50 50 50 50 50 50 50 50 50 50 50 50 50 50 49 49 49 49 49 50 50 50 50 49 49 50 50 50 50 50 50 50 50
2804 50 50 50 50 50 50 50 50 49 49 50 50 50 50 50 50 50 50 50 50 50 50 50 50 50 50 50 50 50 50 50 50 50 49 49 49 49 49 49 49 49 50 50 49 49 49 49 49 49 49 49 49 49 49 49 49 49 49 49 49 49 49 49 49 49 49 49 49 49 49 49
2797 49 48 48 48 48 48 48 49 49 49 49 49 49 49 49 49 49 49 50 50 50 50 50 50 50 50 50 50 50 50 50 50 50 50 50 50 50 50 50 50 50 50 50 50 50 50 50 50 50 50 50 50 50 50 50 50 50 50 50 50 51 51 51 51 51 51 51 51 51 51 51
2790 51 50 50 50 50 50 50 50 50 50 50 50 50 50 49 49 49 49 49 49 49 50 50 50 50 50 50 50 50 50 50 50 49 49 49 49 49 49 49 49 49 49 50 50 50 49 49 49 49 49 49 49 49 49 49 49 49 49 49 50 49 49 50 50 49 49 49 49 49 49 49
$$ packed form
2842E0%%%%%%%%%%%%%%%%%%%J%%%%%%%%j%%%%%%%%%%%%j%%J%%%%%%%%%%%%%j%%%%J%%%%%%
2834E0%%%%%%%%%%%%%%%%%%%j%%J%%%j%%%%%J%%%%%%%%%%%%%%%%%%%%%%%%%%%%%%%%%%%%j
2827D9%%J%%%%%%%%%%%%j%%%%J%%%%%%%%%%%%%%%%%%%%%%J%%%%%j%%%%%%%%%%%%%%%%%j%%
2819D9%%%%%%J%%%%%%%jJ%%%%%%%%%%%%%%%jJ%%%j%%%J%%%%%j%J%%%%%%j%%%%J%%%%%%%%%
2812E0%%%%%%%%%%j%%%J%%%%%%%%%%%%%%%%%j%%J%%%%%%%%%%%%%%%j%%%%J%%%j%J%%%%%%%
2804E0%%%%%%%j%J%%%%%%%%%%%%%%%%%%%%%%j%%%%%%%J%j%%%%%%%%%%%%%%%%%%%%%%%%%%%
2797D9j%%%%%J%%%%%%%%%%J%%%%%%%%%%%%%%%%%%%%%%%%%%%%%%%%%%%%%%%%%J%%%%%%%%%%
2790E1j%%%%%%%%%%%%j%%%%%%J%%%%%%%%%%j%%%%%%%%%J%%j%%%%%%%%%%%%%Jj%J%j%%%%%%
$$ plain form
2782 49 49 49 49 49 49 49 49 49 49 49 50 50 50 50 50 50 50 50 49 49 49 49 49 49 49 50 50 50 50 50 50 50 50 50 50 50 50 50 50 50 50 50 50 49 49 49 49 49 49 49 49 49 49 49 49 49 49 49 49 49 49 49 49 49 49 49 49 49 49 49
2775 49 49 49 49 49 49 49 49 49 49 49 49 49 49 49 49 49 49 49 49 49 49 49 49 49 49 49 49 49 49 49 49 49 49 49 49 49 49 49 49 49 49 49 49 49 49 49 49 49 49 49 49 49 49 49 49 49 49 49 50 50 50 50 50 50 50 50 50 50 50 50
2767 50 50 50 50 50 51 51 51 51 50 50 50 50 50 51 50 51 51 50 50 50 50 50 50 50 50 50 50 50 51 51 51 51 51 51 50 51 51 51 51 51 51 51 51 51 51 51 51 51 51 51 51 51 51 51 51 51 51 51 51 51 51 51 51 50 50 50 51 51 51 51
2760 51 50 50 50 50 50 50 51 51 51 51 51 50 51 51 51 51 50 50 50 50 50 50 50 50 50 50 50 50 50 50 50 50 49 49 49 49 49 49 49 49 49 48 48 48 48 48 48 47 47 47 47 46 46 46 46 46 46 46 46 46 46 46 46 46 46 46 45 45 45 45
2753 45 45 46 46 46 46 46 46 46 46 46 46 46 46 46 46 46 46 46 46 46 46 46 46 45 45 45 45 46 46 46 46 46 46 46 46 46 46 46 46 47 47 47 47 47 47 47 47 48 48 48 49 49 48 48 48 48 48 48 48 48 48 48 49 49 49 49 49 50 50 50
2745 50 50 50 50 50 50 51 51 51 51 51 51 51 51 51 51 51 51 51 51 51 52 52 51 51 52 52 52 52 52 52 51 52 52 52 52 52 52 52 52 52 52 52 52 51 52 52 52 52 52 51 51 51 51 51 51 51 51 51 51 51 51 51 51 51 51 51 51 51 51 51
2738 51 50 50 50 50 50 50 50 50 50 50 50 50 50 51 51 51 51 51 51 51 51 51 51 51 51 51 51 51 51 51 51 51 51 51 51 51 52 52 52 51 51 52 52 51 51 51 51 51 51 51 51 51 51 52 52 51 51 51 51 51 51 51 51 51 51 51 51 51 51 51
2730 51 51 51 51 51 51 51 51 51 51 51 51 51 51 51 51 51 51 51 51 52 52 52 52 52 52 52 52 52 52 52 52 52 52 52 52 52 51 52 52 52 52 52 52 52 52 52 52 52 52 52 52 52 52 52 52 52 52 52 52 52 52 52 52 53 53 53 53 53 53 53
$$ packed form
2782D9%%%%%%%%%%J%%%%%%%j%%%%%%J%%%%%%%%%%%%%%%%%j%%%%%%%%%%%%%%%%%%%%%%%%%%
2775D9%%%%%%%%%%%%%%%%%%%%%%%%%%%%%%%%%%%%%%%%%%%%%%%%%%%%%%%%%%J%%%%%%%%%%%
2767E0%%%%J%%%j%%%%JjJ%j%%%%%%%%%%J%%%%%jJ%%%%%%%%%%%%%%%%%%%%%%%%%%%j%%J%%%
2760E1j%%%%%J%%%%jJ%%%j%%%%%%%%%%%%%%%j%%%%%%%%j%%%%%j%%%j%%%%%%%%%%%%%%j%%%
2753D5%J%%%%%%%%%%%%%%%%%%%%%j%%%J%%%%%%%%%%%J%%%%%%%J%%J%j%%%%%%%%%J%%%%J%%
2745E0%%%%%J%%%%%%%%%%%%%%J%j%J%%%%%jJ%%%%%%%%%%%jJ%%%%j%%%%%%%%%%%%%%%%%%%%
2738E1j%%%%%%%%%%%%J%%%%%%%%%%%%%%%%%%%%%%J%%j%J%j%%%%%%%%%J%j%%%%%%%%%%%%%%
2730E1%%%%%%%%%%%%%%%%%%%J%%%%%%%%%%%%%%%%jJ%%%%%%%%%%%%%%%%%%%%%%%%%J%%%%%%
$$ plain form
2723 53 53 53 53 53 53 53 53 53 53 53 53 53 54 54 54 54 54 54 54 54 54 54 54 54 54 55 55 55 54 54 54 54 54 54 54 54 54 54 54 54 54 55 55 55 55 56 56 56 56 56 56 56 56 56 56 56 56 56 56 56 57 57 56 56 56 56 56 57 57 57
2715 57 57 57 57 57 57 57 57 58 58 58 58 58 59 59 59 60 60 60 60 60 61 61 62 62 62 62 63 64 64 65 65 66 67 68 69 70 71 72 73 74 75 77 78 80 82 84 87 89 92 96 100 104 109 115 122 130 138 147 157 168 178 189 200 210
2709 210 219 226 232 237 239 240 240 237 232 226 218 209 199 188 177 166 156 146 137 129 121 114 108 103 99 95 92 88 86 83 81 80 78 76 75 74 73 72 71 70 69 69 68 67 66 65 65 64 64 63 62 62 61 61 61 60 60 60 60 59 59 59 59
2702 59 58 58 58 58 57 57 57 57 57 57 57 57 57 57 57 56 56 56 56 56 56 56 56 56 56 56 55 56 56 56 56 56 56 56 56 56 56 57 57 57 57 57 57 57 57 57 57 58 58 58 59 60 60 61 62 62 63 63 63 63 63 64 64 64 65 66 66 67 69 70
2695 70 71 72 74 76 78 80 82 84 86 88 90 93 95 98 100 102 104 106 107 108 109 109 109 109 108 107 106 104 103 101 98 96 93 91 88 86 84 82 81 79 78 77 76 75 74 74 74 74 74 73 73 73 73 73 72 72 73 73 73 72 73 73 73 73 73 73 72 72 72 72
2687 72 72 72 72 71 71 71 71 71 71 71 71 71 71 71 71 71 71 71 71 72 72 72 72 72 73 73 72 72 72 72 72 72 73 73 73 73 72 73 73 74 74 74 74 74 74 75 75 76 77 78 79 80 82 85 88 91 95 99 103 107 111 115 118 120 121 121 121 120 118 116
2680 116 113 109 105 100 95 91 86 82 79 77 75 73 72 71 71 70 70 70 70 70 70 70 70 70 69 69 69 68 68 67 66 66 65 64 63 62 61 60 59 58 57 57 56 56 56 56 56 56 56 57 57 58 58 58 59 59 60 61 62 64 65 66 67 68 70 71 73 75 76
2672 76 78 79 81 82 83 84 86 87 88 89 90 91 92 93 94 95 96 97 98 99 100 102 103 104 105 106 108 109 109 110 111 111 111 111 110 110 109 109 108 108 107 107 106 106 106 106 106 106 106 106 106 107 107 108 108 109 109 110 110 110 111 111 111 111 110 110 109 109 108 108
$$ packed form
2723E3%%%%%%%%%%%%J%%%%%%%%%%%%J%%j%%%%%%%%%%%%J%%%J%%%%%%%%%%%%%%J%j%%%%J%%
2715E7%%%%%%%J%%%%J%%J%%%%J%J%%%JJ%J%JJJJJJJJJJKJKKKLKLMMMNOPQQRJ0J1J0J1J1J0
2709B10RPONKJ%lnoqrj0j1j1j1j0j0rqqponmmlmklkjkkjjjjjjj%jjjj%j%jj%j%%j%%%j%%%
2702E9j%%%j%%%%%%%%%%j%%%%%%%%%%jJ%%%%%%%%%J%%%%%%%%%J%%JJ%JJ%J%%%%J%%JJ%JKJ
2695G0JJKKKKKKKKKLKLKKKKJJJ%%%jjjkjklklklkkkjkjjjjj%%%%j%%%%j%J%%jJ%%%%%j%%%
2687G2%%%j%%%%%%%%%%%%%%%J%%%%J%j%%%%%J%%%jJ%J%%%%%J%JJJJJKLLLMMMMMMLKJ%%jkk
2680A16lmmnnmnmlkkkjj%j%%%%%%%%j%%j%jj%jjjjjjjjj%j%%%%%%J%J%%J%JJJKJJJJKJKKJ
2672G6KJKJJJKJJJJJJJJJJJJJJKJJJJKJ%JJ%%%j%j%j%j%j%%%%%%%%J%J%J%J%%J%%%j%j%j%
$$ plain form
2665 108 107 107 107 106 107 107 107 107 108 109 110 112 113 115 117 119 121 124 126 128 130 132 135 137 140 142 145 148 152 156 161 167 173 180 187 195 204 214 224 234 244 253 262 270 276 282 286 289 291 291 290 288 286 282 278 274 271 268 265 264 265 268 273 279 287
2658 287 297 307 319 330 342 354 365 377 387 397 406 414 421 427 432 436 438 441 442 444 445 447 449 452 455 458 462 466 471 476 483 490 497 505 513 522 530 540 549 559 569 579 589 600 611 622 634 646 659
2653 659 673 687 702 718 736 754 773 794 816 839 863 889 917 946 976 1008 1041 1076 1112 1149 1188 1229 1272 1316 1362 1410 1461 1513 1569 1628 1691 1758 1830 1908 1992
2649 1992 2083 2182 2289 2405 2531 2666 2812 2969 3137 3317 3508 3713 3931 4165 4416 4686 4980 5300 5653 6044 6481 6973 7531 8166
2647 8166 8891 9720 10666 11741 12954 14307 15798 17416 19139 20934 22761 24567 26301 27907 29336 30547 31510 32206 32625
2645 32625 32767 32635 32236 31581 30683 29558 28229 26724 25079 23339 21552 19764 18022 16363 14816 13399 12120 10978
2643 10978 9967 9075 8293 7606 7003 6472 6003 5587 5217 4886 4588 4318 4072 3845 3636 3441 3258 3085 2921 2766 2617 2475
2640 2475 2339 2210 2086 1968 1856 1750 1651 1558 1470 1389 1314 1245 1181 1123 1069 1021 976 936 900 866 836 808 782 758 736 715 695 677 659 641 624
$$ packed form
2665A08j%%jJ%%%JJJKJKKKKLKKKKLKLKLLMMNOOPPQRJ0J0J0J0RRQOOMLK%jkkmmmllljJLNOQ
2658B87J0J0J2J1J2J2J1J2J0J0RQPONMKLJKJKKLLLMMNNPPPQQRQJ0RJ0J0J0J0J1J1J1J2J2J3
2653F59J4J4J5J6J8J8J9K1K2K3K4K6K8K9L0L2L3L5L6L7L9M1M3M4M6M8N1N2N6N9O3O7P2P8Q4
2649A992R1R9J07J16J26J35J46J57J68J80J91K05K18K34K51K70K94L20L53L91M37M92N58O35
2647H166P25Q29R46J075J213J353J491J618J723J795J827J806J734J606J429J211R63O96M19
2645C2625J42j32l99o55q98j125j329j505j645j740j787j788j742j659j547j417j279j142
2643A0978j011q92p82o87o03n31m69m16l70l31k98k70k46k27k09j95j83j73j64j55j49j42
2640B475j36j29j24j18j12j06r9r3q8q1p5o9o4n8n4m8m5m0l6l4l0k8k6k4k2k1k0j8j8j8j7
$$ plain form
2637 624 607 591 575 560 544 529 514 500 486 472 459 447 435 423 412 401 391 382 373 364 356 348 341 334 328 321 314 308 301 294 286 279 271 263 255 247 239 231 224 217 210 204 199 196 193 191 191 192 194 198 201 206
2632 206 210 215 219 222 225 226 227 227 225 221 215 208 200 191 181 170 160 150 142 135 129 124 120 118 117 118 119 123 127 132 138 145 152 158 164 169 174 179 183 186 188 189 190 191 191 190 190 189 189 188 187 186 185 185 184 183 183 182 181 180 179 178 177 175 174
2625 174 172 170 169 167 165 163 162 159 157 155 153 151 149 147 146 145 144 143 141 140 140 139 138 137 136 135 133 132 130 128 127 125 123 121 120 118 116 114 112 110 108 106 105 104 102 102 101 101 101 101 101 101 101 102 102 102 103 103 103 104 105 106 106 107 107 108 108 108 109
2617 109 109 109 109 110 110 110 111 111 112 112 112 113 113 113 114 114 114 115 115 115 116 116 116 116 117 117 117 117 117 117 116 116 115 115 114 114 113 111 110 109 107 106 105 104 103 101 100 99 99 98 97 97 96 96 95 95 95 95 94 94 94 94 94 93 93 93 93 92 91
2610 91 91 90 89 89 88 87 86 86 85 84 83 82 82 81 80 79 78 77 76 76 76 75 75 74 74 74 74 74 74 73 73 73 73 73 73 73 72 72 72 72 72 71 71 71 71 71 71 70 70 70 70 70 69 69 69 69 69 69 69 69 69 69 69 69 69 69 69 68 68 68
2603 68 68 68 68 67 67 67 66 66 66 66 65 65 65 65 65 65 65 65 64 64 64 64 63 63 63 62 62 62 62 62 61 61 60 60 59 57 56 54 53 51 49 47 44 42 39 37 34 32 30 27 26 24 23 23 22 22 22 22 23 24 26 28 30 32 35 37 40 42 45 47
2595 47 50 52 53 55 56 58 60 61 62 63 64 65 66 67 67 68 68 68 69 69 69 70 70 70 70 70 70 70 70 70 70 70 71 71 71 71 71 71 71 72 72 72 72 72 72 71 71 71 71 71 71 71 71 71 71 71 71 71 71 71 71 71 70 70 70 70 70 70 70 70
2588 70 70 70 70 70 70 70 70 70 70 70 70 70 70 70 70 71 71 71 71 71 71 71 71 71 72 72 72 72 72 72 72 73 73 73 74 74 74 74 74 74 75 75 76 76 77 78 78 79 79 80 80 81 82 83 84 85 87 88 89 90 92 94 96 98 101 104 107 110 114 119
$$ packed form
2637F24j7j6j6j5j6j5j5j4j4j4j3j2j2j2j1j1j0rrrqqppoppoppqpqqqqqqppponllk%JKMLN
2632B06MNMLLJJ%kmopqrj0j1j0j0qponmkjJJMMNOPPOONNNMLKJJJ%j%j%jjjj%jj%jjjjjjkj
2625A74kkjkkkjlkkkkkkjjjjkj%jjjjjkjkkjkkkjkkkkkkkjjk%j%%%%%%J%%J%%JJJ%J%J%%J
2617A09%%%J%%J%J%%J%%J%%J%%J%%%J%%%%%j%j%j%jkjjkjjjjkjj%jj%j%j%%%j%%%%j%%%jj
2610I1%jj%jjj%jjjj%jjjjjj%%j%j%%%%%j%%%%%%j%%%%j%%%%%j%%%%j%%%%%%%%%%%%%%j%%
2603F8%%%j%%j%%%j%%%%%%%j%%%j%%j%%%%j%j%jkjkjkkklklklkkljkj%j%%%JJKKKKLKLKLK
2595D7LKJKJKKJJJJJJJ%J%%J%%J%%%%%%%%%%J%%%%%%J%%%%%j%%%%%%%%%%%%%%%%j%%%%%%%
2588G0%%%%%%%%%%%%%%%J%%%%%%%%J%%%%%%J%%J%%%%%J%J%JJ%J%J%JJJJJKJJJKKKKLLLLMN
$$ plain form
2580 119 125 132 139 148 157 166 177 188 199 210 220 230 238 246 251 254 256 256 254 250 245 238 229 219 209 198 187 176 165 155 146 138 130 124 118 113 109 105 102 99 96 94 92 90 89 88 87 85 84 82 81 80 79 78 77 76
2574 76 75 74 74 73 72 72 71 70 69 69 68 68 67 67 66 66 66 66 65 65 65 65 65 65 64 64 64 64 64 64 64 64 64 64 64 64 64 64 64 64 64 64 63 63 63 63 63 63 63 63 63 62 62 63 62 62 62 62 62 61 61 61 61 61 61 61 61 61 61 61
2567 61 61 62 61 61 61 61 61 61 61 61 61 61 61 61 62 62 62 62 62 61 61 61 61 61 61 61 61 61 61 60 60 60 60 60 60 60 60 60 60 60 60 60 60 60 60 60 60 60 60 60 60 60 60 60 60 60 61 61 60 60 60 60 60 60 59 60 60 60 60 60
2560 60 59 59 60 60 60 60 59 59 59 59 60 60 59 59 59 59 59 60 59 59 59 60 60 60 60 60 59 59 59 59 59 59 59 59 59 59 59 58 58 58 58 58 58 58 58 58 58 58 58 58 58 58 58 58 58 58 58 58 58 58 58 59 59 59 59 59 59 59 59 59
2552 59 59 59 59 60 60 59 59 59 59 59 59 59 59 59 59 59 59 59 59 59 59 59 59 59 59 59 59 59 59 59 59 59 59 59 59 59 59 59 59 58 58 58 58 58 58 58 58 58 58 57 57 57 57 57 57 57 57 56 56 56 56 56 56 56 55 55 55 55 55 55
2545 55 54 54 54 54 54 54 54 54 54 53 53 53 53 53 53 53 53 53 53 53 53 53 52 52 52 52 52 52 52 51 52 52 52 52 51 51 51 51 51 52 52 52 52 52 52 52 52 52 52 52 52 52 52 52 52 52 52 52 52 52 52 52 52 52 53 53 53 52 52 52
2537 52 52 52 52 53 53 53 53 53 53 53 53 53 53 53 53 54 54 54 54 55 55 55 55 55 55 55 55 55 55 56 56 56 56 56 56 56 56 56 56 56 56 55 56 56 56 56 56 56 56 56 56 56 56 56 56 56 57 57 57 57 57 57 57 57 57 57 57 57 57 57
2530 57 56 56 57 57 57 57 57 57 57 57 57 57 57 57 56 57 57 57 57 57 57 57 57 56 57 57 56 56 56 57 57 57 57 57 56 56 56 56 56 56 56 56 56 56 56 56 56 56 57 57 56 57 57 57 56 56 56 56 56 57 57 57 57 57 57 57 57 58 58 58
$$ packed form
2580A19OPPRRRJ1J1J1J1J0J0QQNLK%kmnprj0j0j1j1j1j1j0rqqoonmmlllkkkjjjkjkjjjjjj
2574G6jj%jj%jjj%j%j%j%%%j%%%%%j%%%%%%%%%%%%%%%%%j%%%%%%%%j%Jj%%%%j%%%%%%%%%%
2567F1%Jj%%%%%%%%%%%J%%%%j%%%%%%%%%j%%%%%%%%%%%%%%%%%%%%%%%%%%J%j%%%%%jJ%%%%
2560F0j%J%%%j%%%J%j%%%%Jj%%J%%%%j%%%%%%%%%%j%%%%%%%%%%%%%%%%%%%%%%%J%%%%%%%%
2552E9%%%J%j%%%%%%%%%%%%%%%%%%%%%%%%%%%%%%%%%j%%%%%%%%%j%%%%%%%j%%%%%%j%%%%%
2545E5j%%%%%%%%j%%%%%%%%%%%%j%%%%%%jJ%%%j%%%%J%%%%%%%%%%%%%%%%%%%%%%%%J%%j%%
2537E2%%%J%%%%%%%%%%%J%%%J%%%%%%%%%J%%%%%%%%%%%jJ%%%%%%%%%%%%%J%%%%%%%%%%%%%
2530E7j%J%%%%%%%%%%%jJ%%%%%%%jJ%j%%J%%%%j%%%%%%%%%%%%%J%jJ%%j%%%%J%%%%%%%J%%
$$ plain form
2523 58 59 59 59 60 60 60 60 60 60 59 59 58 58 57 57 57 57 56 56 56 56 56 56 56 56 56 56 56 56 56 56 56 56 56 55 55 55 55 55 55 55 55 55 56 55 56 56 56 56 55 55 55 55 55 55 55 56 56 56 57 57 57 58 58 59 60 61 62 63 64
2515 64 66 67 69 70 70 70 69 68 66 64 63 62 60 59 59 58 58 57 57 56 56 56 56 56 56 55 55 55 55 55 55 55 55 55 55 55 55 55 55 54 55 55 55 55 55 55 55 55 55 55 55 55 55 55 55 55 55 55 56 56 57 58 58 59 60 61 62 63 64 66
2508 66 67 68 69 70 70 69 67 66 64 63 62 60 59 58 58 57 57 56 56 56 56 56 55 55 55 55 55 55 55 55 55 55 55 55 55 55 55 55 55 55 55 55 55 55 55 55 55 55 55 55 55 55 55 55 56 55 55 55 55 55 55 56 56 56 57 57 58 58 59 59
2500 59 60 60 61 61 61 61 60 59 59 59 58 58 57 57 57 56 56 56 56 56 55 55 55 55 55 55 55 55 55 55 55 55 55 55 55 55 55 55 55 55 54 54 54 54 54 54 54 54 54 54 54 55 55 55 55 55 55 55 55 55 55 56 56 56 56 56 56 56 56 56
2493 56 56 55 55 55 55 55 55 55 55 55 55 55 55 55 55 55 55 55 55 55 55 54 54 54 54 54 54 54 54 54 54 54 54 54 54 54 55 55 55 55 55 55 55 54 54 54 54 54 54 54 54 54 54 54 55 55 54 54 54 54 54 54 54 54 54 54 54 54 54 54
2485 54 54 54 54 54 54 54 54 54 54 54 54 54 54 53 53 54 54 54 54 54 54 54 54 54 54 54 53 53 53 54 54 54 54 54 54 54 54 54 54 54 54 54 54 54 54 54 54 54 54 53 54 54 54 54 54 54 53 53 53 53 53 53 53 53 53 53 53 54 53 53
2478 53 53 53 53 53 53 53 53 53 53 53 53 54 54 53 53 53 53 54 54 54 54 54 54 53 53 53 53 53 53 53 54 54 54 54 54 54 54 53 54 54 54 54 54 54 54 54 54 54 54 53 53 53 53 53 54 54 54 53 54 54 54 54 54 54 54 53 54 54 54 54
2471 54 54 53 53 53 54 54 53 53 53 54 53 53 53 53 53 53 53 53 53 53 53 53 53 53 54 54 53 53 53 53 53 53 53 53 53 53 53 53 53 53 53 53 53 54 54 53 53 53 53 53 53 53 53 53 53 53 53 53 53 53 53 53 53 53 53 53 53 53 53 53
$$ packed form
2523E8J%%J%%%%%j%j%j%%%j%%%%%%%%%%%%%%%%j%%%%%%%%JjJ%%%j%%%%%%J%%J%%J%JJJJJJ
2515F4KJKJ%%jjkkjjkj%j%j%j%%%%%j%%%%%%%%%%%%%jJ%%%%%%%%%%%%%%%%%J%JJ%JJJJJJK
2508F6JJJJ%jkjkjjkjj%j%j%%%%j%%%%%%%%%%%%%%%%%%%%%%%%%%%%%%%Jj%%%%%J%%J%J%J%
2500E9J%J%%%jj%%j%j%%j%%%%j%%%%%%%%%%%%%%%%%%%j%%%%%%%%%%J%%%%%%%%%J%%%%%%%%
2493E6%j%%%%%%%%%%%%%%%%%%%j%%%%%%%%%%%%%%J%%%%%%j%%%%%%%%%%J%j%%%%%%%%%%%%%
2485E4%%%%%%%%%%%%%j%J%%%%%%%%%%j%%J%%%%%%%%%%%%%%%%%%%jJ%%%%%j%%%%%%%%%%Jj%
2478E3%%%%%%%%%%%J%j%%%J%%%%%j%%%%%%J%%%%%%jJ%%%%%%%%%%j%%%%J%%jJ%%%%%%jJ%%%
2471E4%j%%J%j%%Jj%%%%%%%%%%%%%J%j%%%%%%%%%%%%%%%%J%j%%%%%%%%%%%%%%%%%%%%%%%%
$$ plain form
2463 53 53 53 53 53 53 53 53 53 53 53 53 53 53 53 53 53 53 53 53 53 53 52 52 52 52 52 53 52 52 52 52 52 52 52 52 52 52 52 52 52 52 52 52 52 53 53 53 53 53 53 53 53 53 53 53 53 53 53 53 53 53 53 52 52 52 52 52 52 53 53
2456 53 53 53 53 53 53 53 53 53 53 53 53 53 53 53 53 52 52 52 52 53 53 53 53 53 53 53 53 53 53 53 53 53 52 52 53 53 53 53 53 53 53 53 53 53 53 53 53 53 53 53 53 53 53 52 52 53 53 53 53 53 53 53 53 53 53 53 53 53 53 53
2448 53 53 53 53 53 53 54 54 54 54 54 54 53 53 53 53 53 53 53 53 53 53 53 53 53 53 53 53 53 53 53 53 53 53 53 53 53 53 53 53 53 53 53 53 53 53 53 53 53 53 52 52 52 52 52 52 52 52 52 52 52 52 52 52 52 52 52 52 52 52 52
2441 52 51 51 51 51 51 52 52 52 52 52 51 52 52 52 52 52 52 52 52 52 52 52 52 51 51 51 51 51 51 51 51 51 51 50 50 50 50 50 50 51 50 50 50 50 50 50 50 50 50 50 51 51 51 51 50 50 51 51 51 51 51 51 51 51 51 51 51 51 51 51
2434 51 50 50 50 51 50 50 50 50 50 50 50 50 50 50 50 51 51 51 51 51 51 51 51 51 51 51 51 51 51 51 51 52 52 52 52 52 52 52 52 52 52 51 51 51 51 52 52 52 52 52 52 52 52 52 52 52 52 52 52 52 52 52 52 52 52 52 52 52 52 52
2426 52 52 52 52 52 52 52 52 53 52 52 52 52 51 51 52 52 52 52 52 52 52 52 52 52 52 52 52 52 52 52 52 52 52 52 52 52 52 52 52 52 52 52 52 52 52 52 52 52 52 52 52 51 51 51 51 51 51 51 51 51 52 51 51 51 51 51 51 51 51 51
2419 51 51 51 51 51 51 51 51 51 51 51 51 51 51 51 51 51 51 51 51 51 51 51 51 51 51 51 51 51 51 51 51 50 50 50 50 51 51 51 51 51 51 51 51 51 51 51 50 50 50 50 50 50 50 50 50 50 50 50 49 49 49 50 49 49 49 49 49 50 50 50
2411 50 50 50 50 50 50 50 50 51 50 50 50 50 50 50 50 50 50 50 50 50 50 50 50 50 50 50 50 51 51 50 50 51 51 50 50 50 50 51 51 51 51 51 51 51 51 51 50 50 50 50 50 50 50 50 50 50 50 50 50 50 50 50 50 50 50 50 50 50 50 50
$$ packed form
2463E3%%%%%%%%%%%%%%%%%%%%%j%%%%Jj%%%%%%%%%%%%%%%%J%%%%%%%%%%%%%%%%%j%%%%%J%
2456E3%%%%%%%%%%%%%%%j%%%J%%%%%%%%%%%%j%J%%%%%%%%%%%%%%%%%%j%J%%%%%%%%%%%%%%
2448E3%%%%%J%%%%%j%%%%%%%%%%%%%%%%%%%%%%%%%%%%%%%%%%%%%j%%%%%%%%%%%%%%%%%%%%
2441E2j%%%%J%%%%jJ%%%%%%%%%%%j%%%%%%%%%j%%%%%Jj%%%%%%%%%J%%%j%J%%%%%%%%%%%%%
2434E1j%%Jj%%%%%%%%%%J%%%%%%%%%%%%%%%J%%%%%%%%%j%%%J%%%%%%%%%%%%%%%%%%%%%%%%
2426E2%%%%%%%Jj%%%j%J%%%%%%%%%%%%%%%%%%%%%%%%%%%%%%%%%%%%j%%%%%%%%Jj%%%%%%%%
2419E1%%%%%%%%%%%%%%%%%%%%%%%%%%%%%%%j%%%J%%%%%%%%%%j%%%%%%%%%%%j%%Jj%%%%J%%
2411E0%%%%%%%Jj%%%%%%%%%%%%%%%%%%J%j%J%j%%%J%%%%%%%%j%%%%%%%%%%%%%%%%%%%%%%%
$$ plain form
2404 50 50 50 50 50 50 51 51 51 51 51 51 51 51 51 51 51 51 51 51 51 51 51 51 51 51 51 51 51 52 52 52 52 52 52 52 52 52 52 52 52 52 52 52 52 52 52 52 52 52 52 52 53 52 52 52 52 53 53 53 52 52 52 52 52 52 52 52 52 52 52
2396 52 52 52 52 52 52 52 52 52 52 52 52 52 52 52 52 52 52 52 52 52 52 52 52 52 52 52 52 52 52 52 52 52 52 52 52 52 52 52 52 52 52 52 52 52 52 52 52 52 52 52 52 52 52 52 52 52 52 52 52 52 52 52 53 53 53 53 53 52 52 52
2389 52 52 52 52 52 52 52 52 52 52 52 53 53 53 53 53 53 53 53 52 52 52 52 52 52 52 52 52 52 52 52 52 52 52 52 52 52 52 52 52 52 52 52 52 52 52 52 52 52 52 52 52 52 52 52 52 52 52 52 52 52 52 53 53 53 53 53 52 52 52 52
2382 52 52 52 52 52 52 52 52 52 52 52 52 52 52 52 52 52 52 52 52 52 52 52 52 52 52 52 52 52 52 52 52 52 52 52 52 52 52 52 52 52 52 52 52 52 52 52 52 52 52 52 52 52 52 52 52 52 52 52 52 52 52 52 52 51 51 51 52 52 52 52
2374 52 52 52 52 52 52 52 52 52 52 52 52 52 52 52 52 52 52 52 52 52 52 51 51 51 51 51 51 52 52 51 51 51 51 52 52 52 52 52 52 51 51 51 51 51 51 51 51 51 51 51 51 52 52 52 52 52 52 52 52 52 52 52 52 51 51 51 51 51 51 51
2367 51 51 51 51 51 51 51 51 51 51 51 51 51 51 51 51 51 51 51 51 51 51 51 51 51 51 51 51 51 51 51 51 51 51 51 51 51 51 51 51 51 51 51 51 51 51 51 51 51 51 51 51 51 51 51 51 51 51 51 51 51 51 51 51 51 51 51 51 51 51 50
2359 50 50 50 51 51 51 51 51 51 51 51 51 51 51 51 51 51 51 51 51 51 51 51 51 51 51 51 51 51 51 51 51 51 51 51 51 51 51 51 51 51 51 51 51 51 51 51 50 51 51 51 51 51 51 51 50 50 50 51 51 51 51 51 51 51 50 50 50 50 50 50
2352 50 50 50 50 50 51 51 50 50 50 50 50 50 50 50 50 50 51 51 51 51 51 51 51 52 51 51 51 51 50 50 51 51 51 51 51 51 51 51 51 51 51 51 51 51 51 51 51 50 50 50 50 50 50 50 50 50 50 51 51 51 51 51 51 51 50 50 50 50 51 51
$$ packed form
2404E0%%%%%J%%%%%%%%%%%%%%%%%%%%%%J%%%%%%%%%%%%%%%%%%%%%%Jj%%%J%%j%%%%%%%%%%
2396E2%%%%%%%%%%%%%%%%%%%%%%%%%%%%%%%%%%%%%%%%%%%%%%%%%%%%%%%%%%%%%%J%%%%j%%
2389E2%%%%%%%%%%J%%%%%%%j%%%%%%%%%%%%%%%%%%%%%%%%%%%%%%%%%%%%%%%%%%J%%%%j%%%
2382E2%%%%%%%%%%%%%%%%%%%%%%%%%%%%%%%%%%%%%%%%%%%%%%%%%%%%%%%%%%%%%%%j%%J%%%
2374E2%%%%%%%%%%%%%%%%%%%%%j%%%%%J%j%%%J%%%%%j%%%%%%%%%%%J%%%%%%%%%%%j%%%%%%
2367E1%%%%%%%%%%%%%%%%%%%%%%%%%%%%%%%%%%%%%%%%%%%%%%%%%%%%%%%%%%%%%%%%%%%%%j
2359E0%%J%%%%%%%%%%%%%%%%%%%%%%%%%%%%%%%%%%%%%%%%%%%jJ%%%%%%j%%J%%%%%%j%%%%%
2352E0%%%%J%j%%%%%%%%%J%%%%%%Jj%%%j%J%%%%%%%%%%%%%%%%j%%%%%%%%%J%%%%%%j%%%J%
$$ plain form
2345 51 51 51 51 51 50 50 50 50 50 50 51 51 51 51 51 51 50 50 51 51 51 51 51 51 51 51 51 51 51 51 51 51 51 51 51 51 51 51 51 51 51 51 51 51 51 51 50 50 50 50 50 50 51 51 51 51 51 51 51 51 51 51 51 51 51 51 50 50 50 50
2337 50 50 50 51 51 51 51 51 51 51 51 51 51 51 51 51 51 51 51 51 51 51 52 52 51 51 51 51 51 51 51 51 51 51 51 51 51 51 51 51 51 51 51 51 52 52 51 51 51 51 51 51 51 51 51 51 52 51 51 51 51 51 51 51 51 51 51 51 51 51 52
2330 52 52 51 51 51 51 51 51 51 51 51 51 52 51 51 51 51 51 51 51 51 51 51 51 51 51 51 51 51 51 51 51 51 51 51 51 51 51 51 51 51 51 51 51 51 51 51 51 50 50 51 51 51 51 51 51 51 51 51 51 51 51 51 51 51 51 51 51 51 51 51
2322 51 51 51 51 51 51 51 51 51 51 51 51 51 51 51 51 51 50 50 50 50 51 51 50 50 51 50 50 50 50 50 50 50 50 51 51 51 50 50 50 50 50 50 50 50 50 50 50 50 50 50 50 50 50 50 51 50 50 50 50 50 50 49 50 50 50 50 50 50 50 50
2315 50 50 50 50 51 51 51 51 51 50 50 50 50 51 51 51 51 51 51 51 51 51 51 51 51 51 51 51 51 51 51 51 51 51 50 50 50 50 50 50 50 50 50 50 50 50 50 50 50 50 50 50 50 50 50 49 50 50 50 50 50 50 50 50 50 49 49 49 49 49 49
2307 49 50 50 50 50 50 50 50 50 50 50 50 50 50 50 51 51 51 51 51 51 51 51 51 51 51 51 51 51 51 51 51 52 52 52 52 52 52 51 51 51 51 51 51 51 51 51 51 50 51 51 51 51 51 51 51 50 50 50 50 50 50 50 50 50 50 50 50 50 50 50
2300 50 50 50 51 50 51 50 50 50 50 50 50 50 50 50 50 50 50 50 50 50 50 50 50 50 50 51 51 51 51 51 51 51 51 51 51 51 51 51 51 51 51 51 51 51 51 51 51 51 51 51 51 51 51 51 51 51 51 51 51 51 51 51 51 51 51 51 51 51 51 51
2293 51 51 51 51 51 51 51 51 51 51 52 52 51 51 51 51 51 51 51 51 51 51 51 51 51 51 51 51 51 51 51 51 51 51 51 51 51 51 51 51 51 51 51 51 51 51 51 51 51 51 51 51 51 51 51 51 50 50 50 50 50 50 50 50 50 50 50 50 50 50 50
$$ packed form
2345E1%%%%j%%%%%J%%%%%j%J%%%%%%%%%%%%%%%%%%%%%%%%%%%j%%%%%J%%%%%%%%%%%%%j%%%
2337E0%%J%%%%%%%%%%%%%%%%%%J%j%%%%%%%%%%%%%%%%%%%J%j%%%%%%%%%Jj%%%%%%%%%%%%J
2330E2%j%%%%%%%%%Jj%%%%%%%%%%%%%%%%%%%%%%%%%%%%%%%%%%j%J%%%%%%%%%%%%%%%%%%%%
2322E1%%%%%%%%%%%%%%%%j%%%J%j%Jj%%%%%%%J%%j%%%%%%%%%%%%%%%%%Jj%%%%%jJ%%%%%%%
2315E0%%%J%%%%j%%%J%%%%%%%%%%%%%%%%%%%%j%%%%%%%%%%%%%%%%%%%%jJ%%%%%%%%j%%%%%
2307D9J%%%%%%%%%%%%%J%%%%%%%%%%%%%%%%J%%%%%j%%%%%%%%%jJ%%%%%%j%%%%%%%%%%%%%%
2300E0%%JjJj%%%%%%%%%%%%%%%%%%%J%%%%%%%%%%%%%%%%%%%%%%%%%%%%%%%%%%%%%%%%%%%%
2293E1%%%%%%%%%J%j%%%%%%%%%%%%%%%%%%%%%%%%%%%%%%%%%%%%%%%%%%%j%%%%%%%%%%%%%%
$$ plain form
2285 50 49 49 49 50 50 50 50 50 50 50 50 50 50 50 50 50 50 50 50 50 51 50 50 50 50 50 50 50 50 50 50 50 50 50 50 50 50 50 50 50 50 50 50 50 50 50 50 50 50 50 50 50 50 50 50 49 49 49 49 49 49 49 49 49 49 49 49 49 49 50
2278 50 50 50 49 49 49 49 49 49 49 49 48 48 48 49 48 48 48 49 49 49 49 49 49 49 49 48 48 48 48 48 48 48 48 48 48 48 48 48 48 48 48 48 48 48 48 48 48 48 48 49 49 49 49 49 49 49 49 49 49 49 49 49 49 49 49 49 49 49 49 49
2270 49 49 49 49 49 49 49 49 49 49 49 49 49 50 50 50 50 50 49 50 50 50 50 50 49 49 49 49 49 49 49 49 49 49 49 49 49 49 49 48 48 48 48 48 48 48 48 48 48 49 49 49 48 48 48 48 49 49 49 49 49 49 49 49 49 49 49 49 49 49 49
2263 49 49 49 49 49 50 50 50 50 50 50 50 50 50 50 50 50 50 50 50 50 50 50 50 50 51 51 51 51 51 51 51 51 50 50 51 51 50 50 50 51 51 51 51 51 51 50 50 50 50 50 50 50 50 50 50 50 51 51 51 50 50 50 50 50 50 50 50 50 50 50
2256 50 50 51 51 51 51 51 51 51 51 51 51 51 51 51 51 51 51 51 50 50 50 50 51 51 51 50 50 50 50 50 51 51 51 51 51 50 50 50 50 50 50 50 50 50 51 51 51 51 51 51 51 50 50 51 51 51 51 51 51 51 51 51 51 51 51 51 51 51 51 51
2248 51 51 51 51 51 51 50 50 50 51 51 51 51 50 51 51 50 50 50 51 51 51 51 51 50 50 50 50 50 50 50 50 50 50 50 50 50 50 50 50 50 50 50 50 50 50 50 50 50 50 50 50 51 51 51 51 50 50 50 50 50 50 50 50 50 50 50 50 50 50 50
2241 50 50 50 50 50 50 50 50 50 50 50 50 50 50 50 50 50 50 50 50 50 50 50 50 50 50 50 50 50 50 50 50 50 50 50 50 50 50 50 50 50 50 50 50 50 50 50 50 51 51 51 51 51 51 50 50 50 50 50 50 50 50 50 50 50 50 50 50 50 50 50
2233 50 50 50 50 50 50 50 50 50 50 50 50 50 50 50 50 50 50 50 50 50 50 50 50 50 50 50 50 51 51 51 51 50 50 50 50 50 50 50 50 50 50 50 50 50 50 50 50 50 50 50 50 50 50 50 50 50 50 50 50 50 50 50 50 50 50 50 50 50 50 50
$$ packed form
2285E0j%%J%%%%%%%%%%%%%%%%Jj%%%%%%%%%%%%%%%%%%%%%%%%%%%%%%%%%j%%%%%%%%%%%%%J
2278E0%%j%%%%%%%j%%Jj%%J%%%%%%%j%%%%%%%%%%%%%%%%%%%%%%%J%%%%%%%%%%%%%%%%%%%%
2270D9%%%%%%%%%%%%J%%%%jJ%%%%j%%%%%%%%%%%%%%j%%%%%%%%%J%%j%%%J%%%%%%%%%%%%%%
2263D9%%%%J%%%%%%%%%%%%%%%%%%%J%%%%%%%j%J%j%%J%%%%%j%%%%%%%%%%J%%j%%%%%%%%%%
2256E0%J%%%%%%%%%%%%%%%%j%%%J%%j%%%%J%%%%j%%%%%%%%J%%%%%%j%J%%%%%%%%%%%%%%%%
2248E1%%%%%j%%J%%%jJ%j%%J%%%%j%%%%%%%%%%%%%%%%%%%%%%%%%%%J%%%j%%%%%%%%%%%%%%
2241E0%%%%%%%%%%%%%%%%%%%%%%%%%%%%%%%%%%%%%%%%%%%%%%%J%%%%%j%%%%%%%%%%%%%%%%
2233E0%%%%%%%%%%%%%%%%%%%%%%%%%%%J%%%j%%%%%%%%%%%%%%%%%%%%%%%%%%%%%%%%%%%%%%
$$ plain form
2226 50 50 50 50 50 50 50 50 50 50 50 50 50 50 50 50 50 50 50 50 50 50 50 50 50 50 51 51 51 51 51 50 50 50 50 50 50 50 50 50 50 50 50 50 50 50 50 50 50 50 50 50 50 50 51 51 51 51 51 51 50 50 50 50 50 50 50 50 50 50 50
2218 50 50 50 50 50 50 50 50 50 50 50 50 50 50 50 50 50 50 51 51 50 50 50 50 50 50 50 50 50 49 49 49 50 50 50 50 50 50 50 50 50 50 50 50 49 49 49 49 50 50 50 50 50 50 50 50 50 50 50 50 50 50 50 50 50 51 51 50 50 50 50
2211 50 50 50 50 50 50 49 50 50 50 50 50 49 49 49 49 49 49 49 49 49 49 49 49 49 49 49 49 49 49 49 49 48 48 49 49 49 49 49 49 49 49 49 49 49 49 49 49 49 49 49 49 50 50 50 50 50 50 50 50 49 49 49 49 49 50 49 49 49 49 49
2204 49 49 49 49 49 49 49 49 49 49 49 49 49 49 49 49 49 49 49 49 49 49 49 49 49 49 48 49 49 48 49 49 49 49 49 49 49 49 49 49 49 49 49 49 49 49 49 49 49 50 50 50 50 49 49 49 50 50 50 50 50 50 50 50 50 50 49 49 50 50 50
2196 50 50 50 50 49 50 50 50 50 50 50 50 50 50 50 50 50 50 50 50 50 50 50 50 50 50 50 50 50 50 50 50 49 49 49 50 49 50 50 50 50 50 50 50 50 50 50 50 50 50 50 50 50 50 50 50 50 50 50 50 50 50 50 50 50 50 50 50 50 50 50
2189 50 50 50 50 50 50 50 50 50 50 50 50 50 50 50 50 50 50 50 50 50 50 50 50 50 50 49 49 50 49 49 49 50 49 49 49 49 49 49 49 49 49 49 49 49 49 49 49 49 49 49 49 49 49 49 49 49 49 49 49 49 49 50 50 49 49 49 49 49 49 50
2181 50 50 50 50 50 50 50 50 50 50 50 50 50 50 50 50 50 50 50 50 50 50 50 50 50 49 49 49 49 50 50 50 50 50 50 50 49 49 49 49 49 49 50 50 50 50 50 50 50 49 49 49 49 49 49 49 49 50 50 50 50 50 50 50 50 50 50 50 50 50 50
2174 50 50 50 50 50 49 49 50 50 50 50 50 50 50 50 50 50 50 50 50 50 50 50 50 50 50 50 50 50 50 50 50 50 50 50 50 50 50 49 50 49 49 49 49 49 49 49 49 49 49 49 50 50 50 50 50 50 50 51 51 51 51 50 50 50 50 50 50 50 51 51
$$ packed form
2226E0%%%%%%%%%%%%%%%%%%%%%%%%%J%%%%j%%%%%%%%%%%%%%%%%%%%%%J%%%%%j%%%%%%%%%%
2218E0%%%%%%%%%%%%%%%%%J%j%%%%%%%%j%%J%%%%%%%%%%%j%%%J%%%%%%%%%%%%%%%%J%j%%%
2211E0%%%%%jJ%%%%j%%%%%%%%%%%%%%%%%%%j%J%%%%%%%%%%%%%%%%%J%%%%%%%j%%%%Jj%%%%
2204D9%%%%%%%%%%%%%%%%%%%%%%%%%jJ%jJ%%%%%%%%%%%%%%%%%%J%%%j%%J%%%%%%%%%j%J%%
2196E0%%%jJ%%%%%%%%%%%%%%%%%%%%%%%%%%j%%JjJ%%%%%%%%%%%%%%%%%%%%%%%%%%%%%%%%%
2189E0%%%%%%%%%%%%%%%%%%%%%%%%%j%Jj%%Jj%%%%%%%%%%%%%%%%%%%%%%%%%%%%J%j%%%%%J
2181E0%%%%%%%%%%%%%%%%%%%%%%%%j%%%J%%%%%%j%%%%%J%%%%%%j%%%%%%%J%%%%%%%%%%%%%
2174E0%%%%j%J%%%%%%%%%%%%%%%%%%%%%%%%%%%%%%jJj%%%%%%%%%%J%%%%%%J%%%j%%%%%%J%
$$ plain form
2167 51 51 51 51 51 51 51 51 51 51 51 51 51 51 51 51 51 51 51 51 51 51 51 51 51 51 51 51 50 50 50 50 50 50 50 50 50 50 50 50 50 50 51 51 51 50 50 50 50 50 50 50 50 50 50 50 50 50 51 51 51 50 50 50 50 50 50 50 50 50 50
2159 50 50 50 50 50 50 51 51 50 50 50 50 50 50 50 50 50 50 50 50 50 50 50 50 50 50 50 50 50 50 50 50 50 50 50 50 50 50 50 50 50 50 50 50 50 50 50 49 49 50 50 50 50 50 50 50 50 50 50 51 51 51 51 51 51 51 51 51 51 51 51
2152 51 51 50 50 50 50 50 50 50 50 50 50 50 50 50 50 50 50 51 50 50 50 50 50 50 51 51 50 50 50 50 50 50 50 50 50 50 50 50 50 50 50 50 50 50 50 50 50 50 50 50 50 50 51 51 51 51 50 50 50 50 51 51 50 50 50 50 50 50 50 50
2144 50 50 50 50 50 51 51 50 50 50 50 50 51 51 51 51 51 51 51 50 50 50 50 50 50 51 51 50 50 50 50 50 50 50 50 50 50 50 50 50 50 50 50 50 50 50 50 50 50 50 50 50 50 50 51 50 50 50 50 50 50 50 50 50 50 50 50 50 50 50 49
2137 49 50 50 50 50 50 50 50 49 50 50 50 50 50 50 51 51 50 50 50 50 50 50 50 49 49 49 49 49 49 49 50 50 50 50 50 50 50 50 50 50 50 50 50 50 50 50 50 49 50 50 50 50 50 50 50 50 50 50 49 49 49 49 49 49 49 49 49 49 49 49
2129 49 49 49 49 49 49 49 49 49 49 49 49 49 50 50 50 50 49 49 49 49 49 49 50 50 50 50 49 49 49 49 49 49 49 49 49 49 49 49 49 49 49 49 49 49 49 49 49 50 49 49 49 49 49 49 49 49 49 49 49 49 49 49 49 49 49 49 49 49 48 48
2122 48 48 48 49 49 49 49 49 49 49 49 49 49 49 48 48 48 48 49 49 49 49 49 49 49 49 49 49 49 49 49 49 49 49 49 49 49 49 49 49 49 49 49 49 49 49 49 49 49 49 49 49 49 49 49 49 49 49 49 49 49 49 49 48 49 49 49 49 49 49 49
2115 49 49 49 49 49 49 49 49 49 49 49 49 49 49 49 49 49 49 49 49 50 50 49 49 49 49 50 50 50 50 50 50 50 50 50 49 49 49 49 50 50 49 49 50 50 50 50 50 50 50 49 49 49 50 49 49 49 49 49 49 49 49 49 49 50 50 50 50 50 49 49
$$ packed form
2167E1%%%%%%%%%%%%%%%%%%%%%%%%%%%j%%%%%%%%%%%%%J%%j%%%%%%%%%%%%J%%j%%%%%%%%%
2159E0%%%%%J%j%%%%%%%%%%%%%%%%%%%%%%%%%%%%%%%%%%%%%%j%J%%%%%%%%%J%%%%%%%%%%%
2152E1%j%%%%%%%%%%%%%%%Jj%%%%%J%j%%%%%%%%%%%%%%%%%%%%%%%%%J%%%j%%%J%j%%%%%%%
2144E0%%%%J%j%%%%J%%%%%%j%%%%%J%j%%%%%%%%%%%%%%%%%%%%%%%%%%Jj%%%%%%%%%%%%%%j
2137D9J%%%%%%jJ%%%%%J%j%%%%%%j%%%%%%J%%%%%%%%%%%%%%%%jJ%%%%%%%%%j%%%%%%%%%%%
2129D9%%%%%%%%%%%%J%%%j%%%%%J%%%j%%%%%%%%%%%%%%%%%%%%Jj%%%%%%%%%%%%%%%%%%%j%
2122D8%%J%%%%%%%%%%j%%%J%%%%%%%%%%%%%%%%%%%%%%%%%%%%%%%%%%%%%%%%%%%%jJ%%%%%%
2115D9%%%%%%%%%%%%%%%%%%%J%j%%%J%%%%%%%%j%%%J%j%J%%%%%%j%%Jj%%%%%%%%%J%%%%j%
$$ plain form
2107 49 49 49 49 49 49 49 49 50 50 50 49 49 49 49 49 49 49 49 49 49 49 49 49 50 50 49 49 49 49 49 50 50 50 50 50 50 49 49 49 50 50 49 49 49 49 49 49 49 49 49 49 49 49 49 49 50 49 49 49 49 49 49 49 49 49 49 49 49 49 49
2100 49 49 49 49 49 49 49 49 49 49 50 50 50 50 50 50 50 49 49 49 49 49 49 49 49 49 49 49 49 49 49 49 49 49 49 49 49 49 49 49 49 49 49 49 49 49 49 50 50 50 49 49 49 49 49 49 49 49 49 49 49 49 49 49 49 50 50 49 49 50 49
2092 49 49 49 49 49 49 49 49 49 49 49 50 50 50 50 50 50 49 49 49 49 49 49 49 49 49 49 49 49 49 50 49 49 49 49 49 49 49 49 49 49 49 49 49 49 49 49 49 50 49 49 49 49 49 49 49 49 49 50 50 50 50 50 50 49 50 50 49 49 49 49
2085 49 49 49 49 49 49 49 49 49 49 49 49 49 49 49 49 50 50 50 50 49 50 50 50 50 50 50 50 50 50 50 50 50 50 50 50 50 50 50 50 50 50 50 50 50 50 50 50 50 50 50 50 50 50 50 50 50 50 50 50 50 50 50 50 50 50 50 50 50 50 50
2078 50 50 50 50 50 50 50 50 50 50 50 50 50 50 50 50 50 50 50 50 50 50 50 50 50 50 50 50 50 50 50 50 50 50 50 50 50 50 50 50 50 50 50 50 50 50 50 50 50 50 50 51 51 51 51 50 50 50 50 50 50 50 50 50 50 50 50 50 50 50 50
2070 50 50 50 50 50 50 50 51 51 50 50 50 50 50 50 50 50 50 50 50 50 50 50 50 50 50 50 50 50 50 50 50 50 50 50 50 50 50 50 50 50 50 49 50 50 50 50 50 50 50 50 50 50 50 50 50 50 50 50 50 50 50 50 50 50 49 49 49 49 49 49
2063 49 49 49 50 50 50 50 50 50 50 50 50 50 50 50 50 49 49 49 49 49 50 50 50 50 50 50 50 49 49 50 49 49 49 49 49 50 50 50 50 50 50 50 50 50 50 50 50 50 50 50 49 49 49 49 49 49 49 49 49 50 50 50 50 50 50 49 49 49 49 49
2055 49 49 49 49 49 49 49 49 49 50 50 50 49 50 50 50 50 50 50 49 49 49 49 50 50 49 49 49 49 49 49 49 49 49 49 48 48 48 49 49 49 48 48 48 48 48 48 48 48 48 48 48 48 48 48 48 48 48 48 48 48 48 48 48 48 48 48 48 48 47 47
$$ packed form
2107D9%%%%%%%J%%j%%%%%%%%%%%%J%j%%%%J%%%%%j%%J%j%%%%%%%%%%%%%Jj%%%%%%%%%%%%%
2100D9%%%%%%%%%J%%%%%%j%%%%%%%%%%%%%%%%%%%%%%%%%%%%%J%%j%%%%%%%%%%%%%%J%j%Jj
2092D9%%%%%%%%%%J%%%%%j%%%%%%%%%%%%Jj%%%%%%%%%%%%%%%%Jj%%%%%%%%J%%%%%jJ%j%%%
2085D9%%%%%%%%%%%%%%%J%%%jJ%%%%%%%%%%%%%%%%%%%%%%%%%%%%%%%%%%%%%%%%%%%%%%%%%
2078E0%%%%%%%%%%%%%%%%%%%%%%%%%%%%%%%%%%%%%%%%%%%%%%%%%%J%%%j%%%%%%%%%%%%%%%
2070E0%%%%%%J%j%%%%%%%%%%%%%%%%%%%%%%%%%%%%%%%%jJ%%%%%%%%%%%%%%%%%%%%%j%%%%%
2063D9%%J%%%%%%%%%%%%j%%%%J%%%%%%j%Jj%%%%J%%%%%%%%%%%%%%j%%%%%%%%J%%%%%j%%%%
2055D9%%%%%%%%J%%jJ%%%%%j%%%J%j%%%%%%%%%j%%J%%j%%%%%%%%%%%%%%%%%%%%%%%%%%%j%
$$ plain form
2048 47 47 47 47 47 47 47 47 47 47 47 47 47 47 47 47 47 46 46 46 46 47 47 46 46 46 46 46 46 46 46 46 46 47 47 47 47 47 46 46 46 46 46 46 47 47 47 47 47 46 46 46 46 46 47 47 47 47 46 46 46 46 46 47 47 47 46 46 46 46 47
2040 47 47 47 47 47 47 47 47 47 47 47 47 47 47 47 47 47 47 47 48 48 48 48 47 47 48 48 48 47 48 48 48 48 48 48 48 48 48 48 48 48 48 48 48 48 48 48 49 49 49 49 49 49 49 49 49 49 49 49 49 49 49 49 49 49 49 49 49 49 49 49
2033 49 48 48 48 48 49 49 49 49 49 49 49 49 49 49 49 49 49 49 49 49 49 49 49 49 49 49 49 49 49 49 49 49 49 49 49 49 49 49 49 49 49 49 49 49 49 49 49 49 49 49 49 49 49 49 49 49 49 49 49 49 49 49 49 49 49 49 49 49 49 49
2026 49 49 49 49 49 49 49 49 49 49 49 49 49 49 49 49 49 49 49 49 49 49 49 49 49 49 49 49 49 49 49 49 49 49 49 49 49 49 49 49 49 49 49 49 49 49 49 49 49 49 49 49 49 49 49 49 49 49 49 49 49 49 49 49 49 49 49 49 49 49 49
2018 49 49 49 49 49 49 49 48 49 49 49 49 49 49 49 49 49 49 49 49 49 49 49 49 49 49 49 49 49 49 49 49 49 49 49 49 49 49 49 49 49 49 49 49 49 49 49 49 49 49 49 49 49 49 49 49 49 49 49 49 49 49 49 49 49 49 49 49 49 49 48
2011 48 48 48 48 48 48 48 48 48 48 48 48 48 48 48 48 48 48 48 48 48 48 49 48 48 48 48 48 48 48 48 48 49 49 49 49 49 49 49 49 49 49 49 49 49 49 49 49 49 49 49 49 49 49 49 49 49 49 49 49 49 49 49 49 49 49 49 49 49 49 49
2003 49 49 49 49 49 50 50 50 50 50 49 49 49 49 49 49 49 49 49 49 49 49 48 48 48 49 49 49 49 49 49 49 49 49 49 49 48 48 48 48 48 49 49 49 49 49 49 48 49 49 49 49 49 49 49 49 49 49 49 49 49 49 49 49 49 49 49 49 49 49 49
1996 49 49 49 49 49 49 49 49 50 50 49 49 49 49 49 49 49 49 49 48 48 49 49 49 49 49 49 49 49 49 49 49 49 49 49 49 49 49 49 49 49 49 49 49 49 49 49 49 49 49 49 49 49 49 49 49 49 49 49 49 49 49 49 49 49 49 49 49 49 49 49
$$ packed form
2048D7%%%%%%%%%%%%%%%%j%%%J%j%%%%%%%%%J%%%%j%%%%%J%%%%j%%%%J%%%j%%%%J%%j%%%J
2040D7%%%%%%%%%%%%%%%%%%J%%%j%J%%jJ%%%%%%%%%%%%%%%%%J%%%%%%%%%%%%%%%%%%%%%%%
2033D9j%%%J%%%%%%%%%%%%%%%%%%%%%%%%%%%%%%%%%%%%%%%%%%%%%%%%%%%%%%%%%%%%%%%%%
2026D9%%%%%%%%%%%%%%%%%%%%%%%%%%%%%%%%%%%%%%%%%%%%%%%%%%%%%%%%%%%%%%%%%%%%%%
2018D9%%%%%%jJ%%%%%%%%%%%%%%%%%%%%%%%%%%%%%%%%%%%%%%%%%%%%%%%%%%%%%%%%%%%%%j
2011D8%%%%%%%%%%%%%%%%%%%%%Jj%%%%%%%%J%%%%%%%%%%%%%%%%%%%%%%%%%%%%%%%%%%%%%%
2003D9%%%%J%%%%j%%%%%%%%%%%j%%J%%%%%%%%%%j%%%%J%%%%%jJ%%%%%%%%%%%%%%%%%%%%%%
1996D9%%%%%%%J%j%%%%%%%%j%J%%%%%%%%%%%%%%%%%%%%%%%%%%%%%%%%%%%%%%%%%%%%%%%%%
$$ plain form
1989 49 49 49 49 49 49 49 49 49 49 49 49 49 49 49 49 49 49 49 49 49 49 49 49 49 50 50 50 49 49 49 49 49 49 49 49 49 49 49 49 49 49 49 49 49 49 49 49 49 49 49 49 48 49 49 49 49 49 49 49 49 49 49 48 48 48 48 48 48 49 49
1981 49 49 49 49 49 49 49 49 49 49 49 49 49 49 49 49 49 49 49 49 49 49 48 48 48 48 48 48 49 49 49 49 48 48 48 49 49 49 49 49 49 49 49 49 49 49 49 49 49 49 49 49 49 48 49 49 49 49 49 49 49 49 49 49 49 49 49 49 49 49 49
1974 49 49 48 49 49 49 49 49 49 49 49 49 48 48 48 48 48 48 49 49 49 49 49 49 49 49 49 49 49 49 49 49 49 49 49 49 49 49 49 49 49 49 49 49 49 49 49 49 49 49 49 50 50 50 50 50 49 49 49 49 50 50 50 49 49 49 49 49 49 49 49
1966 49 49 49 49 49 49 49 49 48 48 49 49 49 49 49 49 49 49 49 49 49 49 49 49 49 49 49 49 49 49 49 49 49 49 49 49 49 49 49 49 49 49 49 49 49 49 49 49 49 49 49 49 49 49 49 49 49 49 49 49 49 49 49 49 49 49 49 49 49 49 49
1959 49 49 49 49 49 49 49 49 49 49 49 49 49 49 49 49 49 49 49 49 48 48 48 49 48 48 48 48 49 49 49 49 49 49 49 49 49 49 49 49 49 49 49 49 49 49 49 49 49 49 49 49 49 49 49 49 49 49 49 49 49 49 49 49 49 48 48 49 49 49 49
1951 49 49 49 49 49 49 49 49 49 49 49 49 49 49 49 49 49 48 48 48 48 49 49 49 49 49 49 49 49 49 49 49 49 49 49 49 49 49 49 49 49 49 49 49 49 49 49 49 49 49 49 49 49 49 50 50 49 49 49 49 49 49 49 49 49 49 49 49 49 49 49
1944 49 49 49 49 49 49 49 49 49 49 48 48 48 48 48 48 48 48 48 48 48 48 47 47 47 47 47 47 47 47 47 47 47 46 46 46 46 46 46 45 45 45 45 45 45 45 45 45 46 46 46 45 45 45 45 45 45 45 45 45 45 45 45 45 45 45 45 45 45 45 45
1937 45 45 45 45 45 45 45 45 45 45 45 45 45 45 45 45 45 45 45 45 45 46 46 46 46 46 46 46 46 46 46 46 46 46 46 46 46 47 47 47 47 47 47 47 47 47 47 47 47 47 47 47 47 47 47 47 47 47 47 47 47 47 48 48 48 48 48 48 48 48 48
$$ packed form
1989D9%%%%%%%%%%%%%%%%%%%%%%%%J%%j%%%%%%%%%%%%%%%%%%%%%%%jJ%%%%%%%%%j%%%%%J%
1981D9%%%%%%%%%%%%%%%%%%%%%j%%%%%J%%%j%%J%%%%%%%%%%%%%%%%%jJ%%%%%%%%%%%%%%%%
1974D9%jJ%%%%%%%%j%%%%%J%%%%%%%%%%%%%%%%%%%%%%%%%%%%%%%%J%%%%j%%%J%%j%%%%%%%
1966D9%%%%%%%j%J%%%%%%%%%%%%%%%%%%%%%%%%%%%%%%%%%%%%%%%%%%%%%%%%%%%%%%%%%%%%
1959D9%%%%%%%%%%%%%%%%%%%j%%Jj%%%J%%%%%%%%%%%%%%%%%%%%%%%%%%%%%%%%%%%%j%J%%%
1951D9%%%%%%%%%%%%%%%%j%%%J%%%%%%%%%%%%%%%%%%%%%%%%%%%%%%%%J%j%%%%%%%%%%%%%%
1944D9%%%%%%%%%j%%%%%%%%%%%j%%%%%%%%%%j%%%%%j%%%%%%%%J%%j%%%%%%%%%%%%%%%%%%%
1937D5%%%%%%%%%%%%%%%%%%%%J%%%%%%%%%%%%%%%J%%%%%%%%%%%%%%%%%%%%%%%%J%%%%%%%%
$$ plain form
1929 48 48 48 48 48 48 48 48 48 48 48 47 47 47 47 47 47 47 47 47 48 48 48 48 48 48 48 48 48 48 48 48 48 48 48 48 48 48 48 48 48 48 48 48 48 48 48 48 48 48 48 48 49 49 49 49 49 49 49 49 49 49 49 49 49 49 49 49 49 48 48
1922 48 48 48 48 49 48 49 49 49 49 49 49 49 49 49 49 49 49 49 50 49 49 49 49 49 49 49 49 49 49 49 49 49 49 48 48 48 48 48 48 48 48 48 48 48 48 48 48 48 48 48 48 49 49 49 49 49 49 49 49 49 49 49 49 49 49 49 49 49 49 49
1914 49 49 49 49 49 49 49 49 49 49 49 49 49 49 49 49 49 49 49 49 49 49 49 49 49 49 49 50 50 50 50 50 50 50 50 49 49 49 49 49 49 49 49 49 49 49 49 49 48 48 48 48 48 49 49 49 49 49 49 49 49 49 49 49 49 49 49 49 49 49 49
1907 49 49 49 49 49 48 48 48 48 48 48 49 49 49 49 49 49 48 48 48 48 48 48 49 49 49 48 48 48 49 49 49 49 49 49 49 49 49 49 49 49 49 49 48 48 48 48 48 48 48 48 48 48 48 48 48 48 48 48 48 48 48 48 48 48 48 48 48 48 48 48
1900 48 48 48 48 48 48 48 48 48 48 48 48 48 48 48 48 48 48 48 48 48 48 48 48 48 48 49 49 49 49 49 49 49 49 49 49 48 48 48 48 48 48 48 48 48 48 48 48 48 48 48 48 48 48 48 48 48 48 48 48 48 48 48 48 48 48 48 48 48 48 48
1892 48 48 48 48 48 48 48 48 48 48 48 48 48 48 48 49 49 49 49 49 49 49 49 49 49 49 49 48 48 48 48 48 48 48 48 48 48 48 48 48 48 48 48 48 48 48 48 48 48 48 48 48 48 48 48 48 48 48 49 49 49 49 49 49 49 49 48 48 48 49 49
1885 49 49 49 49 48 48 49 49 48 48 48 48 49 49 48 48 48 48 48 48 48 48 48 48 48 49 49 49 48 48 48 48 48 49 49 49 49 49 49 49 48 48 48 48 48 48 48 48 49 49 49 49 49 48 48 48 48 48 48 48 48 48 48 48 48 48 48 48 48 48 48
1877 48 48 48 49 49 49 49 49 48 49 49 49 49 49 49 48 48 48 49 48 48 48 48 48 48 48 49 49 49 49 49 49 49 49 49 49 49 49 49 49 49 49 49 49 49 49 49 49 49 48 49 49 49 49 49 49 49 49 49 49 49 49 49 49 49 49 48 48 48 48 48
$$ packed form
1929D8%%%%%%%%%%j%%%%%%%%J%%%%%%%%%%%%%%%%%%%%%%%%%%%%%%%J%%%%%%%%%%%%%%%%j%
1922D8%%%JjJ%%%%%%%%%%%%Jj%%%%%%%%%%%%%j%%%%%%%%%%%%%%%%%J%%%%%%%%%%%%%%%%%%
1914D9%%%%%%%%%%%%%%%%%%%%%%%%%%J%%%%%%%j%%%%%%%%%%%%j%%%%J%%%%%%%%%%%%%%%%%
1907D9%%%%j%%%%%J%%%%%j%%%%%J%%j%%J%%%%%%%%%%%%%j%%%%%%%%%%%%%%%%%%%%%%%%%%%
1900D8%%%%%%%%%%%%%%%%%%%%%%%%%J%%%%%%%%%j%%%%%%%%%%%%%%%%%%%%%%%%%%%%%%%%%%
1892D8%%%%%%%%%%%%%%J%%%%%%%%%%%j%%%%%%%%%%%%%%%%%%%%%%%%%%%%%%J%%%%%%%j%%J%
1885D9%%%j%J%j%%%J%j%%%%%%%%%%J%%j%%%%J%%%%%%j%%%%%%%J%%%%j%%%%%%%%%%%%%%%%%
1877D8%%J%%%%jJ%%%%%j%%Jj%%%%%%J%%%%%%%%%%%%%%%%%%%%%%jJ%%%%%%%%%%%%%%%j%%%%
$$ plain form
1870 48 48 48 48 49 49 49 49 49 49 49 48 48 49 49 49 49 49 49 49 49 49 49 49 49 49 49 49 49 49 49 49 49 49 49 49 49 49 49 49 49 48 48 48 48 48 48 48 48 48 49 49 49 49 49 49 49 49 49 49 49 48 48 49 49 49 49 49 48 48 48
1862 48 49 49 49 49 49 49 49 49 49 48 48 48 49 48 48 48 48 48 48 49 49 49 48 48 48 48 48 48 48 48 48 48 49 49 49 49 49 49 49 48 49 49 49 49 49 49 49 49 48 48 48 48 49 49 49 49 49 48 48 48 48 48 48 48 49 49 49 49 49 49
1855 49 48 48 48 48 48 49 49 49 48 48 48 48 48 48 48 48 48 48 48 48 48 48 48 48 48 48 48 48 48 48 48 48 49 49 48 48 48 48 48 48 48 48 48 48 48 48 48 48 48 48 48 48 48 48 48 48 48 48 48 48 48 48 48 48 48 48 48 49 49 49
1848 49 49 48 48 48 49 49 49 49 48 48 48 48 48 48 48 48 48 48 48 48 48 49 49 48 48 48 48 48 49 49 49 49 49 48 48 48 48 48 48 48 48 48 48 48 49 49 49 49 49 49 49 49 49 49 49 49 49 49 49 50 50 50 50 50 50 50 50 50 50 50
1840 50 50 49 49 49 49 48 48 48 48 48 48 48 47 47 47 47 47 48 48 48 48 48 48 49 48 48 48 48 48 48 48 47 47 47 47 47 47 46 46 46 46 46 46 46 46 46 46 45 45 45 45 46 46 46 45 45 45 45 45 44 45 45 45 44 44 44 45 45 45 45
1833 45 45 45 45 45 45 45 45 45 45 45 45 45 45 45 45 45 45 45 45 46 46 46 46 46 46 46 46 46 46 46 46 46 46 46 46 46 46 46 46 46 46 46 46 46 46 46 46 46 46 46 46 46 46 47 47 47 47 47 47 47 47 47 47 47 47 47 47 48 48 48
1825 48 48 48 47 47 48 48 48 48 49 49 48 48 48 48 48 48 48 48 48 48 48 48 48 48 48 48 48 48 48 48 48 48 48 49 49 49 49 49 49 49 49 49 49 49 49 49 49 48 48 48 48 48 48 48 48 48 49 49 49 49 49 49 48 48 48 48 48 48 48 49
1818 49 49 49 49 49 48 48 48 48 48 48 49 49 49 49 49 48 48 48 48 48 48 48 48 48 48 48 48 49 49 48 48 48 48 48 48 48 48 48 49 49 49 49 49 49 49 49 49 49 49 49 49 48 48 48 48 48 48 48 48 48 48 48 48 47 47 47 47 47 47 47
$$ packed form
1870D8%%%J%%%%%%j%J%%%%%%%%%%%%%%%%%%%%%%%%%%%j%%%%%%%%J%%%%%%%%%%j%J%%%%j%%
1862D8J%%%%%%%%j%%Jj%%%%%J%%j%%%%%%%%%J%%%%%%jJ%%%%%%%j%%%J%%%%j%%%%%%J%%%%%
1855D9j%%%%J%%j%%%%%%%%%%%%%%%%%%%%%%%J%j%%%%%%%%%%%%%%%%%%%%%%%%%%%%%%%%J%%
1848D9%j%%J%%%j%%%%%%%%%%%%J%j%%%%J%%%%j%%%%%%%%%%J%%%%%%%%%%%%%%J%%%%%%%%%%
1840E0%j%%%j%%%%%%j%%%%J%%%%%Jj%%%%%%j%%%%%j%%%%%%%%%j%%%J%%j%%%%jJ%%j%%J%%%
1833D5%%%%%%%%%%%%%%%%%%%J%%%%%%%%%%%%%%%%%%%%%%%%%%%%%%%%%J%%%%%%%%%%%%%J%%
1825D8%%j%J%%%J%j%%%%%%%%%%%%%%%%%%%%%%J%%%%%%%%%%%%%j%%%%%%%%J%%%%%j%%%%%%J
1818D9%%%%j%%%%%J%%%%j%%%%%%%%%%%J%j%%%%%%%%J%%%%%%%%%%%%j%%%%%%%%%%%j%%%%%%
$$ plain form
1811 47 47 47 47 47 47 47 47 46 46 46 46 46 46 46 46 46 46 46 46 45 46 46 45 46 46 45 45 45 45 45 46 46 46 46 46 46 46 46 46 46 46 46 46 46 46 46 46 46 46 46 46 46 46 46 46 46 46 46 46 46 46 46 45 45 45 45 45 45 45 45
1803 45 45 45 44 44 44 44 44 44 44 44 44 44 44 44 44 44 44 45 45 45 45 45 45 45 45 45 45 45 45 46 45 46 46 46 46 45 45 45 45 45 46 46 46 45 45 45 45 46 46 46 46 46 45 45 46 46 46 46 46 46 46 46 46 46 46 46 46 46 46 46
1796 46 46 46 46 45 45 46 46 46 46 46 47 47 47 47 47 47 47 47 47 47 47 47 47 47 47 47 47 47 47 47 47 47 47 47 47 47 47 47 47 47 47 47 47 48 47 47 47 47 47 47 47 47 47 47 47 47 47 47 47 47 47 47 47 47 48 48 48 48 48 48
1788 48 48 48 48 48 47 47 47 48 48 48 48 48 48 48 48 48 48 48 48 48 48 48 48 48 48 48 48 48 48 48 48 48 48 48 48 48 49 49 49 49 48 48 48 48 48 48 48 48 48 48 48 48 48 48 48 48 48 48 48 48 48 48 48 48 48 47 48 48 48 48
1781 48 48 48 48 48 48 48 48 48 48 48 47 48 48 48 48 48 48 48 48 48 48 48 48 47 48 48 48 48 48 48 48 48 48 48 48 48 48 48 48 47 47 47 47 47 47 47 47 47 47 47 47 47 47 47 47 47 47 47 47 47 47 47 47 47 47 47 48 48 47 47
1773 47 47 47 47 47 47 48 48 48 47 47 47 47 47 47 47 47 47 47 47 47 47 47 47 48 48 48 48 48 48 48 48 48 47 47 47 47 47 48 47 47 47 47 47 48 48 47 47 47 47 47 47 47 47 47 47 47 47 47 47 47 47 47 47 47 47 47 47 47 47 47
1766 47 47 47 48 48 48 48 47 47 47 47 47 47 47 47 47 47 48 48 47 47 47 47 47 47 47 47 47 47 47 47 47 47 47 47 47 47 47 47 47 48 48 47 48 47 48 48 48 48 48 47 47 47 47 47 47 47 47 47 47 48 48 48 48 48 48 48 47 47 47 48
1759 48 48 48 48 48 47 47 47 47 47 47 48 48 48 48 47 47 47 47 48 48 48 48 48 48 48 48 48 48 48 48 48 48 48 48 48 48 48 48 48 48 48 48 48 48 48 48 48 48 48 47 47 47 47 47 47 48 48 48 48 48 48 48 48 48 48 48 48 48 47 47
$$ packed form
1811D7%%%%%%%j%%%%%%%%%%%jJ%jJ%j%%%%J%%%%%%%%%%%%%%%%%%%%%%%%%%%%%%%j%%%%%%%
1803D5%%j%%%%%%%%%%%%%%J%%%%%%%%%%%JjJ%%%j%%%%J%%j%%%J%%%%j%J%%%%%%%%%%%%%%%
1796D6%%%j%J%%%%J%%%%%%%%%%%%%%%%%%%%%%%%%%%%%%%%Jj%%%%%%%%%%%%%%%%%%%J%%%%%
1788D8%%%%j%%J%%%%%%%%%%%%%%%%%%%%%%%%%%%%J%%%j%%%%%%%%%%%%%%%%%%%%%%%%jJ%%%
1781D8%%%%%%%%%%jJ%%%%%%%%%%%jJ%%%%%%%%%%%%%%j%%%%%%%%%%%%%%%%%%%%%%%%%%J%j%
1773D7%%%%%J%%j%%%%%%%%%%%%%%J%%%%%%%%j%%%%Jj%%%%J%j%%%%%%%%%%%%%%%%%%%%%%%%
1766D7%%J%%%j%%%%%%%%%J%j%%%%%%%%%%%%%%%%%%%%J%jJjJ%%%%j%%%%%%%%%J%%%%%%j%%J
1759D8%%%%j%%%%%J%%%j%%%J%%%%%%%%%%%%%%%%%%%%%%%%%%%%%%j%%%%%J%%%%%%%%%%%%j%
$$ plain form
1751 47 47 47 47 47 47 47 47 47 47 47 47 48 48 48 48 48 48 48 48 48 48 48 48 48 48 48 48 48 48 48 48 48 47 47 47 47 47 47 48 48 48 48 48 48 48 48 47 47 47 47 47 47 47 47 48 48 48 48 48 48 48 48 47 47 47 48 48 48 48 48
1744 48 48 48 48 48 47 48 48 48 48 48 48 48 48 48 47 48 48 48 47 48 48 48 48 48 48 48 48 48 47 47 47 48 48 48 48 48 47 47 47 48 48 48 48 48 48 48 48 48 48 48 48 48 48 48 48 48 48 48 48 48 48 48 48 48 48 48 48 48 48 48
1736 48 48 48 48 48 48 48 48 48 48 48 48 48 48 48 48 48 48 48 48 48 48 48 48 49 48 48 48 48 48 48 48 48 47 47 47 48 48 48 48 48 48 48 48 48 48 48 48 49 48 48 48 48 48 48 48 48 48 48 48 48 48 48 48 48 48 48 48 48 48 48
1729 48 48 48 48 48 48 48 48 48 48 48 48 48 48 48 48 48 48 49 49 48 48 48 48 48 48 48 48 48 48 48 49 49 49 49 48 48 48 48 48 48 49 49 49 48 48 48 48 48 48 48 48 48 48 48 48 48 48 48 48 48 48 48 48 48 48 48 48 48 48 48
1721 48 48 48 48 48 48 48 48 48 48 48 47 47 47 47 47 47 48 48 48 48 48 48 48 48 48 48 48 48 48 48 48 48 48 48 48 48 48 48 47 47 47 48 48 48 48 48 48 48 48 48 48 48 48 48 48 48 48 48 48 48 48 48 48 48 47 47 47 48 48 48
1714 48 48 48 48 48 48 47 48 48 47 47 47 47 48 48 48 48 47 47 48 48 48 48 48 48 48 48 47 47 47 47 48 48 48 48 48 48 48 47 48 48 48 48 48 48 48 48 48 48 48 48 48 48 48 48 48 48 48 48 48 48 48 48 48 48 48 48 48 48 48 48
1707 48 48 48 48 48 48 48 48 48 48 48 48 48 48 48 48 48 48 48 48 48 48 48 48 48 48 48 48 48 48 48 48 48 48 49 49 49 49 49 49 49 49 49 49 48 48 48 48 48 48 48 48 48 48 48 48 48 48 48 48 48 48 48 48 48 48 48 48 48 49 49
1699 49 49 49 49 49 49 48 48 48 48 48 48 48 48 48 48 48 48 48 49 49 49 49 49 49 49 49 49 49 49 49 49 49 49 49 48 48 48 49 48 48 48 48 48 48 48 48 48 48 48 48 48 48 48 48 48 48 48 48 48 48 48 48 48 48 48 48 48 48 48 48
$$ packed form
1751D7%%%%%%%%%%%J%%%%%%%%%%%%%%%%%%%%j%%%%%J%%%%%%%j%%%%%%%J%%%%%%%j%%J%%%%
1744D8%%%%jJ%%%%%%%%jJ%%jJ%%%%%%%%j%%J%%%%j%%J%%%%%%%%%%%%%%%%%%%%%%%%%%%%%%
1736D8%%%%%%%%%%%%%%%%%%%%%%%Jj%%%%%%%j%%J%%%%%%%%%%%Jj%%%%%%%%%%%%%%%%%%%%%
1729D8%%%%%%%%%%%%%%%%%J%j%%%%%%%%%%J%%%j%%%%%J%%j%%%%%%%%%%%%%%%%%%%%%%%%%%
1721D8%%%%%%%%%%j%%%%%J%%%%%%%%%%%%%%%%%%%%%j%%J%%%%%%%%%%%%%%%%%%%%%%j%%J%%
1714D8%%%%%jJ%j%%%J%%%j%J%%%%%%%j%%%J%%%%%%jJ%%%%%%%%%%%%%%%%%%%%%%%%%%%%%%%
1707D8%%%%%%%%%%%%%%%%%%%%%%%%%%%%%%%%%J%%%%%%%%%j%%%%%%%%%%%%%%%%%%%%%%%%J%
1699D9%%%%%j%%%%%%%%%%%%J%%%%%%%%%%%%%%%j%%Jj%%%%%%%%%%%%%%%%%%%%%%%%%%%%%%%
$$ plain form
1692 48 48 48 48 47 47 47 47 47 47 47 48 48 48 48 48 48 48 48 48 48 48 48 48 48 48 48 48 47 47 47 47 47 47 48 48 48 48 48 48 48 48 48 48 48 48 48 48 48 48 48 48 48 48 48 48 48 48 48 48 47 48 48 47 48 48 48 48 47 47 47
1684 47 48 48 48 48 48 48 48 48 48 48 48 48 47 47 47 47 47 47 47 47 48 48 48 48 48 48 48 48 48 49 49 49 49 49 49 49 49 49 49 49 49 49 49 49 49 48 48 48 48 48 48 48 48 48 48 48 48 48 48 48 48 47 47 48 48 48 48 48 48 48
1677 48 48 48 48 48 48 47 47 47 48 48 48 48 48 47 47 47 47 48 48 48 48 48 48 48 48 48 48 48 48 48 48 48 49 49 49 49 49 49 49 49 49 49 49 49 49 49 49 49 49 49 49 49 49 49 49 49 49 48 48 48 48 48 48 48 48 48 48 48 48 48
1670 48 48 48 48 48 48 48 48 48 48 48 48 48 48 48 48 48 48 48 48 48 48 47 48 48 48 48 48 48 48 48 48 48 48 48 48 48 48 48 48 48 48 48 48 48 48 48 48 48 48 48 48 48 48 48 48 48 48 48 48 48 48 48 48 48 48 48 48 48 48 48
1662 48 48 48 48 48 48 48 47 48 48 48 48 48 47 47 47 47 47 47 47 47 47 47 47 47 47 47 47 47 47 47 48 48 48 48 48 48 47 47 47 47 47 47 47 48 48 48 48 48 48 47 47 47 47 47 47 47 47 47 47 47 47 47 47 47 48 48 47 47 47 47
1655 47 47 47 47 47 47 48 48 47 47 47 47 47 47 47 47 47 47 47 48 48 48 48 48 48 47 47 47 48 48 47 47 47 47 47 48 48 48 48 47 47 47 47 47 47 47 47 47 47 47 47 47 47 47 47 47 47 47 47 47 47 48 48 47 47 47 47 47 47 47 48
1647 48 47 47 47 47 47 47 47 47 47 47 48 48 48 47 47 47 47 47 47 47 47 47 47 47 47 47 47 48 47 47 47 47 47 47 47 47 47 47 48 48 47 47 47 47 47 47 47 47 47 47 48 48 48 48 48 48 48 48 48 48 47 47 48 48 48 48 48 47 48 48
1640 48 48 48 47 47 47 47 47 47 47 47 47 47 47 48 48 48 48 48 48 48 48 48 48 47 47 47 48 48 48 48 48 48 47 47 47 47 47 47 47 47 47 47 47 48 47 47 47 47 47 48 48 48 48 48 48 48 48 47 48 48 48 48 48 48 48 48 48 48 48 48
$$ packed form
1692D8%%%j%%%%%%J%%%%%%%%%%%%%%%%j%%%%%J%%%%%%%%%%%%%%%%%%%%%%%%%jJ%jJ%%%j%%
1684D7J%%%%%%%%%%%j%%%%%%%J%%%%%%%%J%%%%%%%%%%%%%%%j%%%%%%%%%%%%%%%j%J%%%%%%
1677D8%%%%%j%%J%%%%j%%%J%%%%%%%%%%%%%%J%%%%%%%%%%%%%%%%%%%%%%%%j%%%%%%%%%%%%
1670D8%%%%%%%%%%%%%%%%%%%%%jJ%%%%%%%%%%%%%%%%%%%%%%%%%%%%%%%%%%%%%%%%%%%%%%%
1662D8%%%%%%jJ%%%%j%%%%%%%%%%%%%%%%%J%%%%%j%%%%%%J%%%%%j%%%%%%%%%%%%%%J%j%%%
1655D7%%%%%J%j%%%%%%%%%%J%%%%%j%%J%j%%%%J%%%j%%%%%%%%%%%%%%%%%%%%%J%j%%%%%%J
1647D8j%%%%%%%%%J%%j%%%%%%%%%%%%%Jj%%%%%%%%%J%j%%%%%%%%%J%%%%%%%%%j%J%%%%jJ%
1640D8%%j%%%%%%%%%%J%%%%%%%%%j%%J%%%%%j%%%%%%%%%%Jj%%%%J%%%%%%%jJ%%%%%%%%%%%
$$ plain form
1632 48 48 48 48 48 48 48 48 48 48 48 48 48 48 48 48 48 48 48 48 48 48 48 48 48 48 48 48 48 48 48 48 48 48 47 47 47 47 47 47 47 47 47 47 47 47 48 48 48 48 48 48 47 47 47 47 47 47 47 47 47 47 48 48 48 48 48 48 48 47 47
1625 47 47 47 47 47 48 48 48 48 48 48 48 48 48 48 48 48 48 48 48 48 48 48 48 48 47 47 48 48 48 47 47 47 47 47 47 48 48 48 48 48 47 47 47 47 47 47 47 48 47 47 47 47 47 47 47 47 47 47 47 47 47 47 47 47 47 47 48 48 48 47
1618 47 47 47 47 47 47 48 47 47 47 48 47 47 47 47 47 47 47 47 47 47 48 48 48 48 48 48 48 48 47 47 47 47 47 48 48 48 48 48 48 48 48 48 48 47 47 48 48 48 48 48 48 47 47 47 47 47 48 48 48 47 47 47 47 47 47 47 47 47 47 47
1610 47 47 47 47 47 47 47 47 47 47 48 48 48 47 47 47 47 47 47 48 48 48 48 48 48 48 47 47 47 48 48 48 48 48 48 48 48 48 48 48 48 49 48 49 49 49 49 49 50 50 50 50 51 51 51 50 50 49 49 49 49 49 49 48 48 48 48 48 48 48 48
1603 48 48 48 48 48 48 48 48 48 48 47 47 47 47 47 47 47 47 47 47 47 47 47 47 47 47 47 47 47 47 47 47 47 47 48 48 48 48 48 48 48 48 48 48 48 48 48 48 48 48 48 47 47 47 47 47 47 48 48 48 48 48 48 48 48 48 48 48 48 48 48
1595 48 48 48 48 48 48 48 48 48 48 48 48 48 48 48 48 48 48 48 48 47 47 47 47 47 47 48 48 48 48 48 48 48 48 48 48 48 48 48 48 48 47 47 47 47 47 47 47 47 47 48 48 48 48 48 47 48 48 48 48 48 48 48 48 48 47 47 47 47 47 47
1588 47 47 48 48 48 48 48 48 49 49 49 49 50 50 51 51 51 51 50 50 49 48 48 48 48 48 48 48 48 48 48 48 48 48 48 48 48 48 48 48 48 48 48 48 48 48 48 48 48 48 48 47 47 47 48 48 48 48 48 48 48 48 48 48 48 48 48 48 47 48 48
1581 48 48 48 47 47 48 48 48 48 48 48 48 48 48 48 47 47 47 47 47 47 47 48 48 48 48 48 48 48 48 48 48 48 48 49 49 49 49 49 49 49 49 49 49 48 48 48 48 48 48 48 48 48 48 47 47 47 47 48 47 47 47 47 47 47 47 48 48 48 48 48
$$ packed form
1632D8%%%%%%%%%%%%%%%%%%%%%%%%%%%%%%%%%j%%%%%%%%%%%J%%%%%j%%%%%%%%%J%%%%%%j%
1625D7%%%%J%%%%%%%%%%%%%%%%%%%j%J%%j%%%%%J%%%%j%%%%%%Jj%%%%%%%%%%%%%%%%%J%%j
1618D7%%%%%Jj%%Jj%%%%%%%%%J%%%%%%%j%%%%J%%%%%%%%%j%J%%%%%j%%%%J%%j%%%%%%%%%%
1610D7%%%%%%%%%J%%j%%%%%J%%%%%%j%%J%%%%%%%%%%%JjJ%%%%J%%%J%%j%j%%%%%j%%%%%%%
1603D8%%%%%%%%%j%%%%%%%%%%%%%%%%%%%%%%%J%%%%%%%%%%%%%%%%j%%%%%J%%%%%%%%%%%%%
1595D8%%%%%%%%%%%%%%%%%%%j%%%%%J%%%%%%%%%%%%%%j%%%%%%%%J%%%%jJ%%%%%%%%j%%%%%
1588D7%J%%%%%J%%%J%J%%%j%jj%%%%%%%%%%%%%%%%%%%%%%%%%%%%%j%%J%%%%%%%%%%%%%jJ%
1581D8%%j%J%%%%%%%%%j%%%%%%J%%%%%%%%%%%J%%%%%%%%%j%%%%%%%%%j%%%Jj%%%%%%J%%%%
$$ plain form
1573 48 48 47 47 47 48 48 48 48 48 48 48 47 47 48 48 48 48 48 48 48 48 47 47 47 47 47 47 47 47 47 47 47 48 48 48 48 48 47 47 47 47 48 48 48 48 48 48 48 48 47 47 48 48 48 48 48 48 48 48 48 48 48 48 48 48 48 48 48 48 48
1566 48 48 48 48 48 48 48 48 48 48 48 48 48 48 47 47 48 48 48 48 48 48 48 48 48 48 48 48 48 48 48 48 48 48 48 48 48 48 48 48 48 48 48 47 47 47 47 47 48 48 48 48 48 48 48 48 48 48 48 48 48 48 48 48 48 48 48 48 48 47 47
1558 47 47 48 48 48 48 48 48 48 48 48 48 48 48 48 48 48 48 48 48 48 47 47 47 47 48 48 48 48 48 47 47 47 47 47 47 47 47 47 47 48 48 48 48 48 48 47 47 47 47 47 47 47 47 47 47 46 46 47 47 47 47 47 47 47 47 47 47 47 47 47
1551 47 47 47 47 47 47 47 47 46 47 47 47 47 47 47 47 47 47 47 47 48 48 48 48 48 47 47 47 47 47 47 47 47 47 47 47 46 47 46 46 46 47 47 47 47 46 46 46 46 47 46 46 46 46 46 46 46 46 46 46 46 46 46 46 46 47 47 47 47 47 47
1543 47 46 46 46 47 46 46 46 46 46 46 47 47 47 47 47 47 47 47 46 46 46 46 46 47 47 47 47 47 47 47 47 47 47 47 47 47 47 47 47 47 47 47 47 48 48 48 48 48 47 47 47 47 47 47 47 47 46 46 47 47 47 47 47 47 47 47 47 47 47 47
1536 47 47 47 47 47 47 47 47 48 48 48 47 47 47 47 47 47 47 47 47 47 47 47 47 47 47 47 47 47 47 47 47 47 47 47 47 47 47 47 47 47 47 47 47 47 47 47 47 47 47 47 47 47 47 47 47 48 48 48 48 49 49 49 49 49 48 48 48 47 47 47
1529 47 47 46 46 46 47 47 47 47 46 46 47 47 48 49 49 49 49 49 49 48 48 48 48 48 48 48 48 48 48 48 48 48 48 48 48 48 48 48 48 48 48 48 48 48 48 48 48 48 48 48 48 48 48 47 48 48 48 48 48 48 48 48 48 48 48 48 48 48 49 49
1521 49 49 50 50 50 50 50 50 50 51 51 52 53 53 53 53 54 54 54 54 53 53 53 52 52 52 52 52 52 52 52 53 53 54 55 56 56 56 56 57 57 58 59 60 61 62 63 64 64 66 67 70 73 78 84 95 109 129 155 189 230 276 327
$$ packed form
1573D8%j%%J%%%%%%j%J%%%%%%%j%%%%%%%%%%J%%%%j%%%J%%%%%%%j%J%%%%%%%%%%%%%%%%%%
1566D8%%%%%%%%%%%%%j%J%%%%%%%%%%%%%%%%%%%%%%%%%%j%%%%J%%%%%%%%%%%%%%%%%%%%j%
1558D7%J%%%%%%%%%%%%%%%%%%j%%%J%%%%j%%%%%%%%%J%%%%%j%%%%%%%%%j%J%%%%%%%%%%%%
1551D7%%%%%%%jJ%%%%%%%%%%J%%%%j%%%%%%%%%%jJj%%J%%%j%%%Jj%%%%%%%%%%%%%%J%%%%%
1543D7j%%Jj%%%%%J%%%%%%%j%%%%J%%%%%%%%%%%%%%%%%%%J%%%%j%%%%%%%j%J%%%%%%%%%%%
1536D7%%%%%%%J%%j%%%%%%%%%%%%%%%%%%%%%%%%%%%%%%%%%%%%%%%%%%%%J%%%J%%%%j%%j%%
1529D7%j%%J%%%j%J%JJ%%%%%j%%%%%%%%%%%%%%%%%%%%%%%%%%%%%%%%%jJ%%%%%%%%%%%%%J%
1521D9%J%%%%%%J%JJ%%%J%%%j%%j%%%%%%%J%JJJ%%%J%JJJJJJJ%KJLLNOJ1J4K0K6L4M1M6N1
$$ plain form
1515 327 383 441 494 526 525 490 424 347 278 220 175 142 119 104 94 86 79 74 70 67 65 62 61 59 58 57 56 55 55 54 54 54 54 54 54 54 53 53 52 52 51 51 50 50 50 49 49 49 48 48 47 47 47 47 47
1509 47 46 47 47 47 47 47 47 47 47 47 47 47 47 47 46 47 47 48 48 48 48 48 48 48 48 48 47 47 47 46 46 46 46 47 47 47 47 47 47 47 48 48 48 48 48 48 47 47 47 47 47 48 48 49 49 49 50 50 50 51 51 51 51 50 50 49 49 48 48 47
1501 47 47 47 47 48 48 48 49 49 49 49 49 48 48 49 49 49 49 49 48 48 47 47 46 46 46 46 47 47 48 48 49 49 49 49 48 48 48 48 48 48 48 48 48 48 48 47 47 47 47 47 47 47 47 47 48 48 47 47 47 48 48 48 48 48 48 48 48 48 48 48
1494 48 48 48 48 47 47 47 47 47 47 48 48 48 47 47 47 47 47 47 47 47 47 47 48 47 48 48 48 49 49 50 50 50 51 51 51 51 50 50 49 49 48 48 48 47 47 47 47 47 47 47 48 48 48 47 47 47 47 47 47 47 47 47 47 47 47 47 47 47 47 47
1487 47 47 47 47 47 47 47 47 47 47 47 47 47 47 47 47 47 47 47 47 47 47 47 48 47 47 47 47 47 47 47 47 47 47 47 47 47 47 47 46 46 46 47 47 47 47 47 47 47 47 47 47 47 47 47 47 47 47 47 47 47 47 47 47 47 46 47 47 47 47 47
1479 47 47 47 47 47 47 47 47 47 47 47 47 47 47 47 46 46 47 46 46 47 47 47 47 47 47 47 47 47 47 47 47 47 47 47 47 47 47 47 47 47 47 47 47 47 47 47 47 47 47 47 47 47 47 47 47 47 47 47 47 47 46 47 47 47 47 47 47 47 47 47
1472 47 47 47 47 47 47 47 46 47 47 47 47 47 47 47 47 47 47 47 47 47 47 47 47 47 47 47 47 47 47 47 47 47 47 47 47 47 47 46 46 46 47 47 47 46 46 46 46 46 46 46 46 46 46 46 47 47 47 46 46 46 46 46 47 47 47 47 47 47 47 47
1464 47 47 47 47 47 47 47 47 47 47 47 47 47 46 47 47 47 47 47 47 47 47 47 47 47 47 47 47 47 46 46 47 47 47 47 47 47 47 47 46 46 47 47 47 47 47 47 47 47 47 47 47 47 47 46 46 46 46 46 46 46 46 46 46 46 46 47 47 47 47 47
$$ packed form
1515C27N6N8N3L2jl5o6p7o9n8m5l3k3j5j0qpnmlkljkjjjj%j%%%%%%j%j%j%j%%j%%j%j%%%%
1509D7jJ%%%%%%%%%%%%jJ%J%%%%%%%%j%%j%%%J%%%%%%J%%%%%j%%%%J%J%%J%%J%%%j%j%j%j
1501D7%%%J%%J%%%%j%J%%%%j%j%j%%%J%J%J%%%j%%%%%%%%%%j%%%%%%%%J%j%%J%%%%%%%%%%
1494D8%%%j%%%%%J%%j%%%%%%%%%JjJ%%J%J%%J%%%j%j%j%%j%%%%%%J%%j%%%%%%%%%%%%%%%%
1487D7%%%%%%%%%%%%%%%%%%%%%%Jj%%%%%%%%%%%%%%j%%J%%%%%%%%%%%%%%%%%%%%%%jJ%%%%
1479D7%%%%%%%%%%%%%%j%Jj%J%%%%%%%%%%%%%%%%%%%%%%%%%%%%%%%%%%%%%%%%jJ%%%%%%%%
1472D7%%%%%%jJ%%%%%%%%%%%%%%%%%%%%%%%%%%%%%j%%J%%j%%%%%%%%%%J%%j%%%%J%%%%%%%
1464D7%%%%%%%%%%%%jJ%%%%%%%%%%%%%%j%J%%%%%%%j%J%%%%%%%%%%%%j%%%%%%%%%%%J%%%%
$$ plain form
1457 47 47 47 47 46 46 46 46 46 46 46 46 47 47 47 46 46 46 46 47 47 47 47 47 47 47 47 47 47 47 47 47 47 47 47 46 46 46 46 46 47 47 47 47 47 47 47 47 47 47 47 47 47 47 47 47 47 47 48 48 47 47 48 48 48 48 48 48 48 48 48
1449 48 48 48 48 48 48 48 48 48 48 47 47 47 47 47 47 47 47 47 47 47 47 47 47 47 47 47 47 47 47 47 47 46 46 46 46 46 46 46 47 47 47 47 47 46 46 47 47 47 47 47 47 47 47 47 47 47 47 47 47 47 48 48 48 49 49 49 50 50 50 50
1442 50 50 49 49 48 48 47 47 46 46 46 46 46 46 46 46 46 46 47 47 49 49 50 50 51 51 50 50 49 49 49 49 49 49 48 48 48 48 49 49 49 49 49 49 49 48 48 48 48 48 48 48 49 49 49 49 49 49 49 49 49 49 49 49 49 49 49 49 49 49 49
1435 49 49 50 50 50 50 50 51 51 50 51 51 51 51 51 51 52 52 52 52 53 53 53 53 53 53 53 53 53 53 53 53 53 53 53 54 54 55 56 56 57 58 59 60 61 62 62 63 64 64 65 66 67 69 71 73 77 81 86 94 104 118 139 167 204 252
1428 252 312 384 466 556 651 742 816 856 851 798 707 595 483 383 301 239 193 160 137 121 108 98 91 85 80 75 72 69 67 64 62 61 60 59 59 58 58 58 57 57 57 58 57 57 57
1423 57 57 56 55 54 53 52 51 50 49 49 48 48 48 48 48 48 48 48 48 48 48 48 48 48 48 48 48 48 48 48 48 48 49 49 49 49 49 48 48 48 48 47 47 47 47 47 47 47 47 47 47 47 47 47 47 48 48 47 47 47 47 47 47 47 47 47 47 48 48 47
1416 47 47 47 46 46 46 46 45 45 45 45 45 45 45 45 46 46 47 48 49 49 49 49 48 48 48 48 48 48 48 47 47 47 46 46 45 44 44 44 44 45 45 46 46 47 47 48 48 48 48 48 48 48 48 47 48 48 48 48 48 48 48 48 47 47 47 48 47 48 48 48
1408 48 48 48 48 48 48 48 48 48 48 48 48 48 48 48 48 48 48 47 47 47 47 47 47 47 48 48 48 48 47 47 47 47 48 48 48 48 48 48 48 48 47 47 47 47 47 47 47 47 47 47 47 47 47 47 47 47 47 46 47 47 47 46 47 47 47 47 47 47 47 47
$$ packed form
1457D7%%%j%%%%%%%J%%j%%%J%%%%%%%%%%%%%%%j%%%%J%%%%%%%%%%%%%%%%%J%j%J%%%%%%%%
1449D8%%%%%%%%%j%%%%%%%%%%%%%%%%%%%%%j%%%%%%J%%%%j%J%%%%%%%%%%%%%%J%%J%%J%%%
1442E0%j%j%j%j%%%%%%%%%J%K%J%J%j%j%%%%%j%%%J%%%%%%j%%%%%%J%%%%%%%%%%%%%%%%%%
1435D9%J%%%%J%jJ%%%%%J%%%J%%%%%%%%%%%%%%J%JJ%JJJJJJ%JJ%JJJKKKMMNQJ0J4K1K8L7M8
1428B52O0P2Q2R0R5R1P4M0nn3r1j12j12j00q2o2m6l3k3j6j3j0ponnllklkjjj%j%%j%%Jj%%
1423E7%jjjjjjjj%j%%%%%%%%%%%%%%%%%%%%%J%%%%j%%%j%%%%%%%%%%%%%J%j%%%%%%%%%J%j
1416D7%%j%%%j%%%%%%%J%JJJ%%%j%%%%%%j%%j%jj%%%J%J%J%J%%%%%%%jJ%%%%%%%j%%JjJ%%
1408D8%%%%%%%%%%%%%%%%%j%%%%%%J%%%j%%%J%%%%%%%j%%%%%%%%%%%%%%%%jJ%%jJ%%%%%%%
$$ plain form
1401 47 47 47 47 47 47 47 47 47 48 48 48 47 47 48 48 48 48 48 48 48 48 48 48 48 47 47 47 47 47 47 47 47 47 47 48 48 48 48 48 47 47 47 47 47 47 47 47 47 47 47 47 47 47 47 47 47 47 47 47 47 47 47 47 47 47 47 47 47 47 47
1393 47 47 47 47 47 47 47 47 47 47 47 47 47 46 47 47 47 47 47 47 47 47 47 47 47 47 46 47 47 47 47 47 47 47 47 47 47 47 47 47 48 47 47 47 47 47 47 47 47 47 47 47 47 47 47 47 47 47 47 47 47 47 47 47 47 47 47 47 47 47 47
1386 47 47 47 47 47 47 47 47 47 47 47 47 47 47 47 47 47 47 47 47 47 47 47 47 47 47 47 47 47 47 47 47 47 47 47 48 48 48 48 48 47 47 47 47 47 47 47 47 47 47 47 47 47 47 47 47 46 46 47 46 46 46 46 46 46 46 46 46 46 46 46
1378 46 46 46 47 47 47 47 47 46 47 47 46 47 47 47 47 47 47 47 47 47 47 47 47 47 47 47 47 47 47 47 47 47 47 47 47 47 47 47 47 47 47 47 47 47 47 47 47 47 47 47 47 47 47 47 47 47 47 47 48 47 47 47 47 47 47 47 47 47 47 47
1371 47 47 47 47 47 47 47 47 47 47 47 47 47 47 47 47 47 47 47 47 47 47 47 47 47 47 47 47 47 47 47 47 47 47 47 47 47 47 47 47 47 47 47 47 47 47 47 47 47 47 47 47 47 47 48 48 48 47 47 47 47 47 47 48 48 47 47 47 47 47 47
1364 47 47 47 47 47 47 47 47 47 47 48 48 47 47 48 48 48 48 49 49 50 50 51 51 51 52 51 51 50 50 49 49 49 49 48 48 48 48 49 49 49 49 49 49 49 49 50 50 50 50 50 50 51 51 51 51 52 52 52 53 53 53 53 54 54 54 54 54 54 53 53
1356 53 53 53 53 52 52 51 51 50 50 50 50 50 50 50 50 50 49 49 49 49 49 49 49 49 49 49 49 49 49 50 50 49 49 49 49 49 49 48 49 49 49 49 49 49 49 49 49 49 49 49 49 48 48 49 49 49 49 49 49 49 49 49 49 49 49 49 49 49 49 49
1349 49 49 49 49 49 49 49 49 49 49 49 49 49 49 49 49 49 49 49 49 49 49 49 49 49 49 49 49 49 49 49 49 49 49 49 49 49 49 49 49 49 49 49 49 48 48 48 48 48 48 49 49 49 49 49 49 49 49 49 49 49 49 49 49 49 49 49 49 49 49 49
$$ packed form
1401D7%%%%%%%%J%%j%J%%%%%%%%%%j%%%%%%%%%J%%%%j%%%%%%%%%%%%%%%%%%%%%%%%%%%%%%
1393D7%%%%%%%%%%%%jJ%%%%%%%%%%%jJ%%%%%%%%%%%%Jj%%%%%%%%%%%%%%%%%%%%%%%%%%%%%
1386D7%%%%%%%%%%%%%%%%%%%%%%%%%%%%%%%%%%J%%%%j%%%%%%%%%%%%%%%j%Jj%%%%%%%%%%%
1378D6%%J%%%%jJ%jJ%%%%%%%%%%%%%%%%%%%%%%%%%%%%%%%%%%%%%%%%%%%%%%Jj%%%%%%%%%%
1371D7%%%%%%%%%%%%%%%%%%%%%%%%%%%%%%%%%%%%%%%%%%%%%%%%%%%%%J%%j%%%%%J%j%%%%%
1364D7%%%%%%%%%J%j%J%%%J%J%J%%Jj%j%j%%%j%%%J%%%%%%%J%%%%%J%%%J%%J%%%J%%%%%j%
1356E3%%%j%j%j%%%%%%%%j%%%%%%%%%%%%J%j%%%%%jJ%%%%%%%%%%%%j%J%%%%%%%%%%%%%%%%
1349D9%%%%%%%%%%%%%%%%%%%%%%%%%%%%%%%%%%%%%%%%%%%j%%%%%J%%%%%%%%%%%%%%%%%%%%
$$ plain form
1341 49 49 49 49 49 49 48 48 48 48 48 48 48 48 48 48 48 48 48 48 47 47 47 47 47 48 48 48 48 48 48 48 49 49 49 49 49 49 49 50 50 50 50 50 51 51 51 51 51 52 52 52 52 52 53 53 53 53 53 53 53 53 54 54 54 54 54 54 55 55 55
1334 55 55 55 55 55 54 54 54 54 54 54 54 54 54 54 54 54 54 54 54 54 54 54 54 54 54 54 54 54 54 54 53 54 54 54 54 54 54 54 54 54 54 54 54 54 54 54 54 54 54 54 54 54 55 55 55 55 56 56 56 56 56 57 57 57 58 58 58 59 59 59
1327 59 60 61 61 62 63 64 64 65 66 67 68 69 70 72 73 74 75 75 76 76 76 76 76 76 76 75 75 74 73 73 72 72 73 73 73 74 75 77 78 80 81 83 85 86 87 89 91 92 93 94 94 94 94 94 95 95 95 95 96 96 96 97 97 97 98 99 99 100 101 102
1319 102 103 104 105 106 107 108 109 111 112 113 114 116 117 119 120 122 124 125 127 130 132 134 136 139 141 144 148 151 154 158 161 165 169 173 178 182 186 191 195 201 206 212 217 223 229 236 242 249 257 265 273 281 291 301 313 325 339 353 369 387 406
1313 406 427 450 476 504 535 570 608 651 699 753 814 882 960 1047 1146 1257 1382 1522 1676 1845 2028 2223 2428 2641 2857 3074 3284 3483
1310 3483 3665 3823 3952 4045 4099 4110 4078 4004 3890 3737 3551 3339 3107 2864 2620 2383 2158 1949 1760 1590 1438 1304 1185 1081 989
1307 989 907 835 770 713 661 615 574 536 502 472 444 419 395 374 355 337 320 305 291 277 265 253 242 232 222 213 205 197 190 183 177 171 166 161 156 152 148 145 141 138 135 133 130 128
1302 128 126 124 122 120 118 117 115 113 111 110 108 106 104 103 101 100 98 96 95 93 91 90 89 88 87 86 85 84 83 82 81 81 80 79 78 78 77 76 75 74 73 72 72 71 70 69 68 67 67 66 65 65 64 65 65 65 65 66 67 67 68 68 69 69 69 69 69 69 69
$$ packed form
1341D9%%%%%j%%%%%%%%%%%%%j%%%%J%%%%%%J%%%%%%J%%%%J%%%%J%%%%J%%%%%%%J%%%%%J%%
1334E5%%%%j%%%%%%%%%%%%%%%%%%%%%%%%%jJ%%%%%%%%%%%%%%%%%%%%J%%%J%%%%J%%J%%J%%
1327E9JJ%JJJ%JJJJJJKJJJ%J%%%%%%j%jj%j%J%%JJKJKJKKJJKKJJJ%%%%J%%%J%%J%%JJ%JJJ
1319A02JJJJJJJKJJJKJKJKKJKLKKKLKLMLLMLMMMNMMNMONONOOPOPQQQQJ0J0J2J2J4J4J6J8J9
1313D06K1K3K6K8L1L5L8M3M8N4O1O8P8Q7R9J11J25J40J54J69J83J95K05K13K16K17K10J99
1310C483J82J58J29R3N4J1l2p4j14j53j86k12k32k43k44k37k25k09j89j70j52j34j19j04r2
1307I89q2p2o5n7n2m6m1l8l4l0k8k5k4k1j9j8j7j5j4j4j2j2j1j0j0rqqppoonnnmmlmllklk
1302A28kkkkkjkkkjkkkjkjkkjkkjjjjjjjjjj%jjj%jjjjjj%jjjjj%jj%jJ%%%JJ%J%J%%%%%%
$$ plain form
1295 69 68 67 65 64 63 61 60 59 58 57 56 55 55 55 55 55 55 56 57 58 59 60 61 61 62 63 63 64 64 64 64 64 65 65 65 65 65 65 64 64 64 63 63 63 63 63 63 63 63 63 63 63 63 63 62 62 62 62 61 61 61 60 60 60 59 59 59 59 59 59
1288 59 59 59 58 58 58 58 58 58 58 57 57 57 57 57 56 56 56 56 56 56 55 55 55 54 54 54 53 53 53 53 54 54 53 53 53 53 53 53 53 53 54 54 54 54 54 54 54 53 53 53 53 53 53 54 54 54 54 54 54 54 54 54 55 55 55 54 54 54 54 54
1280 54 55 55 55 55 54 54 54 54 54 54 54 54 54 54 55 55 55 55 54 54 54 54 54 53 53 53 53 52 52 52 52 52 52 52 52 52 52 52 52 52 52 52 52 52 52 52 52 52 52 52 51 51 52 52 51 51 51 51 51 51 51 51 51 50 50 50 50 50 50 50
1273 50 50 50 50 49 49 49 49 49 49 49 49 49 49 49 49 49 49 49 49 49 50 50 49 49 49 49 49 49 49 49 48 48 49 49 49 49 49 49 49 49 49 49 49 49 49 49 49 49 49 48 48 48 48 48 48 49 49 48 48 48 48 48 48 48 48 49 48 48 48 48
1265 48 48 48 48 48 48 48 48 48 48 48 48 48 48 48 48 48 48 47 47 47 47 47 46 46 46 46 45 45 45 44 44 44 43 43 43 43 42 42 42 43 43 43 43 43 44 44 44 45 45 45 45 46 46 46 46 46 47 47 47 47 48 48 48 48 48 48 48 49 49 49
1258 49 49 49 49 49 49 49 49 49 49 49 49 49 49 48 48 48 48 48 48 48 48 48 48 48 48 48 48 48 49 49 49 49 49 49 49 49 49 49 49 49 49 49 48 48 48 48 48 48 48 48 48 48 48 48 48 48 48 48 48 48 48 48 48 48 48 48 48 48 48 48
1251 48 48 48 48 48 48 48 48 48 48 48 48 48 48 48 48 48 48 48 48 48 48 48 48 47 47 47 48 48 48 48 48 48 48 48 48 48 48 48 48 48 48 48 48 48 48 48 48 48 48 48 48 48 48 48 48 48 48 48 48 48 48 48 48 48 48 48 48 48 48 48
1243 48 48 48 48 48 48 48 48 48 48 48 48 48 48 48 48 48 48 48 48 48 48 47 48 48 48 48 48 48 48 48 48 48 48 48 48 48 48 48 48 48 48 48 48 47 47 47 47 47 47 48 48 48 48 48 48 48 48 47 47 47 47 47 48 48 48 48 48 47 47 47
$$ packed form
1295F9jjkjjkjjjjjj%%%%%JJJJJJ%JJ%J%%%%J%%%%%j%%j%%%%%%%%%%%%j%%%j%%j%%j%%%%%
1288E9%%j%%%%%%j%%%%j%%%%%j%%j%%j%%%J%j%%%%%%%J%%%%%%j%%%%%J%%%%%%%%J%%j%%%%
1280E4J%%%j%%%%%%%%%J%%%j%%%%j%%%j%%%%%%%%%%%%%%%%%%%%%%j%J%j%%%%%%%%j%%%%%%
1273E0%%%j%%%%%%%%%%%%%%%%J%j%%%%%%%j%J%%%%%%%%%%%%%%%%j%%%%%J%j%%%%%%%Jj%%%
1265D8%%%%%%%%%%%%%%%%%j%%%%j%%%j%%j%%j%%%j%%J%%%%J%%J%%%J%%%%J%%%J%%%%%%J%%
1258D9%%%%%%%%%%%%%j%%%%%%%%%%%%%%J%%%%%%%%%%%%%j%%%%%%%%%%%%%%%%%%%%%%%%%%%
1251D8%%%%%%%%%%%%%%%%%%%%%%%j%%J%%%%%%%%%%%%%%%%%%%%%%%%%%%%%%%%%%%%%%%%%%%
1243D8%%%%%%%%%%%%%%%%%%%%%jJ%%%%%%%%%%%%%%%%%%%%j%%%%%J%%%%%%%j%%%%J%%%%j%%
$$ plain form
1236 47 47 47 47 48 48 48 48 48 48 48 48 48 48 48 48 48 48 47 47 47 48 48 48 48 48 48 48 48 48 48 48 48 48 48 48 48 48 48 47 48 48 48 48 48 48 48 48 48 48 48 48 48 48 48 48 48 48 48 48 48 48 48 48 48 48 48 48 48 48 48
1228 48 48 48 48 48 48 48 48 48 48 48 48 48 48 48 48 48 48 48 48 48 48 48 48 48 48 48 48 48 48 48 48 48 48 48 48 48 48 48 48 48 48 47 47 47 47 47 47 47 47 47 47 47 47 47 48 48 48 48 48 48 48 48 48 48 47 47 47 48 48 48
1221 48 48 48 48 48 47 48 48 47 47 47 47 47 47 47 47 47 47 47 47 47 47 47 47 47 47 47 47 47 47 47 47 47 47 47 47 47 47 47 47 47 47 47 47 47 47 47 47 47 47 47 47 48 48 48 48 48 48 48 48 47 47 47 47 47 47 47 47 47 47 47
1214 47 48 47 47 47 47 47 47 47 47 47 47 47 47 47 47 47 47 47 47 47 47 47 47 47 48 48 48 48 48 47 47 47 47 47 47 47 47 47 47 47 47 47 47 47 47 47 47 47 47 47 47 47 47 47 47 47 47 47 47 47 47 47 47 47 47 47 47 47 47 47
1206 47 47 47 46 46 46 47 47 47 47 47 47 47 47 47 47 47 47 47 47 47 47 47 47 47 47 47 47 47 47 47 47 47 47 47 47 47 47 47 47 47 47 47 47 47 47 47 47 47 47 47 47 47 47 47 47 47 47 47 47 47 47 47 47 47 47 47 48 48 48 48
1199 48 48 47 48 48 48 48 48 48 47 47 47 47 48 48 48 48 48 48 48 48 48 48 48 48 48 48 48 48 48 48 48 48 48 48 47 47 47 48 48 48 48 48 48 48 48 48 48 48 48 48 48 48 48 48 48 48 48 48 48 48 48 48 48 48 48 48 48 48 48 48
1191 48 48 48 48 48 48 48 48 48 48 48 48 48 48 48 48 48 48 48 48 48 48 48 48 48 48 48 48 48 48 48 48 48 47 47 47 47 47 47 47 47 47 47 47 47 47 47 47 47 47 47 47 47 47 47 47 47 47 47 47 47 47 47 47 47 47 47 47 47 47 47
1184 47 47 47 47 47 47 47 47 47 47 47 47 47 47 47 47 47 47 47 47 47 47 47 47 47 47 47 47 47 47 47 47 47 47 47 46 47 47 47 46 47 47 46 46 46 46 46 46 46 47 47 47 47 47 47 47 46 47 46 46 46 46 46 46 46 46 47 47 46 46 46
$$ packed form
1236D7%%%J%%%%%%%%%%%%%j%%J%%%%%%%%%%%%%%%%%jJ%%%%%%%%%%%%%%%%%%%%%%%%%%%%%%
1228D8%%%%%%%%%%%%%%%%%%%%%%%%%%%%%%%%%%%%%%%%%j%%%%%%%%%%%%J%%%%%%%%%j%%J%%
1221D8%%%%jJ%j%%%%%%%%%%%%%%%%%%%%%%%%%%%%%%%%%%%%%%%%%%%J%%%%%%%j%%%%%%%%%%
1214D7Jj%%%%%%%%%%%%%%%%%%%%%%J%%%%j%%%%%%%%%%%%%%%%%%%%%%%%%%%%%%%%%%%%%%%%
1206D7%%j%%J%%%%%%%%%%%%%%%%%%%%%%%%%%%%%%%%%%%%%%%%%%%%%%%%%%%%%%%%%%%%J%%%
1199D8%jJ%%%%%j%%%J%%%%%%%%%%%%%%%%%%%%%j%%J%%%%%%%%%%%%%%%%%%%%%%%%%%%%%%%%
1191D8%%%%%%%%%%%%%%%%%%%%%%%%%%%%%%%%j%%%%%%%%%%%%%%%%%%%%%%%%%%%%%%%%%%%%%
1184D7%%%%%%%%%%%%%%%%%%%%%%%%%%%%%%%%%%jJ%%jJ%j%%%%%%J%%%%%%jJj%%%%%%%J%j%%
$$ plain form
1176 46 46 46 46 46 46 46 46 46 46 46 47 47 47 47 47 47 47 47 47 47 47 47 47 47 47 47 47 46 46 46 47 47 46 46 46 46 46 46 46 47 47 47 47 47 47 46 47 47 47 47 47 47 47 46 46 46 46 47 47 47 47 47 47 47 47 47 47 47 47 47
1169 47 47 47 47 46 46 46 46 46 46 46 46 46 46 46 46 46 46 47 47 47 47 47 47 46 46 46 46 47 47 47 46 46 46 46 46 46 46 47 47 47 47 47 46 47 47 47 46 46 46 46 46 46 47 47 46 46 46 46 46 47 47 47 47 47 47 47 47 47 47 47
1162 47 47 47 47 47 47 47 47 47 47 47 47 47 47 47 47 47 46 46 46 46 46 46 47 47 47 47 47 47 47 47 47 47 47 47 47 47 46 46 46 46 46 46 46 46 46 46 46 46 46 46 46 46 47 47 47 47 46 46 46 46 46 46 46 46 46 46 46 46 46 46
1154 46 46 46 46 46 46 46 46 46 46 46 46 46 46 46 46 46 46 46 46 46 46 47 47 47 46 46 46 46 46 46 46 46 47 47 47 47 46 46 46 46 46 46 47 46 46 46 46 46 46 46 46 46 46 46 46 46 46 46 46 46 46 46 46 46 46 46 46 46 46 46
1147 46 46 46 46 46 46 47 47 47 47 47 47 46 46 46 46 47 47 47 47 47 47 47 47 46 46 46 46 46 46 46 46 46 46 46 47 47 47 47 47 47 47 46 46 46 46 46 46 46 46 46 46 46 46 46 46 46 46 46 46 46 46 46 46 46 47 47 47 47 47 47
1139 47 47 47 47 47 47 46 46 46 46 46 46 46 47 47 47 47 47 47 46 46 46 46 46 46 46 46 46 46 46 46 47 47 46 47 47 47 47 47 47 46 46 46 46 46 46 46 46 46 46 46 46 46 46 46 46 46 47 47 47 47 47 47 47 47 47 46 46 46 46 46
1132 46 46 46 46 46 47 46 47 47 47 47 47 47 47 47 47 47 47 48 47 47 47 47 47 47 47 47 47 47 47 47 47 47 47 47 47 47 47 47 47 47 47 47 47 47 47 47 47 47 47 47 47 47 47 47 47 47 47 47 47 47 47 47 47 47 47 47 47 47 47 47
1124 47 47 47 47 47 47 47 48 48 48 47 47 48 48 48 48 47 47 47 47 47 48 48 48 48 47 47 47 47 47 47 47 47 47 47 47 47 47 47 47 47 47 47 48 48 48 47 47 47 47 47 48 47 47 47 47 47 47 47 47 47 47 47 47 47 47 47 47 47 47 47
$$ packed form
1176D6%%%%%%%%%%J%%%%%%%%%%%%%%%%j%%J%j%%%%%%J%%%%%jJ%%%%%%j%%%J%%%%%%%%%%%%
1169D7%%%j%%%%%%%%%%%%%J%%%%%j%%%J%%j%%%%%%J%%%%jJ%%j%%%%%J%j%%%%J%%%%%%%%%%
1162D7%%%%%%%%%%%%%%%%j%%%%%J%%%%%%%%%%%%%j%%%%%%%%%%%%%%%J%%%j%%%%%%%%%%%%%
1154D6%%%%%%%%%%%%%%%%%%%%%J%%j%%%%%%%J%%%j%%%%%Jj%%%%%%%%%%%%%%%%%%%%%%%%%%
1147D6%%%%%J%%%%%j%%%J%%%%%%%j%%%%%%%%%%J%%%%%%j%%%%%%%%%%%%%%%%%%%%%%J%%%%%
1139D7%%%%%j%%%%%%J%%%%%j%%%%%%%%%%%J%jJ%%%%%j%%%%%%%%%%%%%%%%J%%%%%%%%j%%%%
1132D6%%%%JjJ%%%%%%%%%%Jj%%%%%%%%%%%%%%%%%%%%%%%%%%%%%%%%%%%%%%%%%%%%%%%%%%%
1124D7%%%%%%J%%j%J%%%j%%%%J%%%j%%%%%%%%%%%%%%%%%J%%j%%%%Jj%%%%%%%%%%%%%%%%%%
$$ plain form
1117 47 47 47 47 47 47 47 47 47 47 47 48 48 48 48 48 48 47 47 47 47 47 47 47 47 47 47 47 47 47 47 47 47 47 46 46 46 46 46 46 46 47 47 47 47 47 47 47 47 47 47 47 47 47 47 47 47 47 47 47 46 47 47 47 47 47 47 47 47 47 47
1110 47 47 47 47 47 47 47 47 47 47 48 48 48 48 48 47 47 47 47 47 47 47 47 47 47 47 46 47 47 47 47 47 47 47 47 47 47 47 47 47 47 47 47 47 47 47 47 47 47 47 47 47 47 47 47 47 47 47 47 47 47 47 47 47 47 47 47 47 47 47 48
1102 48 48 47 47 47 47 47 47 47 47 47 47 47 48 48 48 48 48 48 47 48 48 48 47 47 47 47 47 47 47 47 48 48 48 47 47 47 47 47 47 47 47 47 47 47 47 48 48 48 47 47 47 47 47 47 47 47 47 48 48 48 48 48 48 48 48 48 48 48 48 48
1095 48 48 48 48 48 48 48 48 48 48 48 48 48 48 48 48 48 48 48 48 48 48 48 48 48 48 48 48 48 48 48 48 48 48 48 48 48 48 48 48 48 48 48 48 48 48 48 48 48 47 47 47 47 48 48 48 48 48 48 48 48 48 48 48 48 48 48 48 48 47 47
1087 47 47 48 48 48 48 48 48 48 48 48 48 48 47 47 47 47 47 48 47 47 47 47 47 47 47 47 47 47 47 47 47 47 47 47 47 47 48 48 48 48 48 49 49 49 49 50 49 49 49 49 49 49 49 48 48 48 48 47 47 47 47 47 47 47 47 47 47 47 47 47
1080 47 47 47 46 46 46 46 46 46 46 46 46 46 46 46 46 46 46 46 46 46 46 46 46 46 46 45 45 46 46 46 46 46 46 46 46 46 46 46 46 46 46 46 46 46 46 46 46 46 46 46 46 46 45 45 45 46 46 46 46 46 45 45 45 45 46 46 46 46 46 46
1073 46 46 46 46 46 46 45 46 46 46 46 46 46 46 46 46 46 46 46 46 46 46 46 46 46 46 46 46 46 46 46 46 46 46 46 45 45 45 46 46 46 46 46 46 46 46 46 46 46 46 46 46 46 46 46 46 46 46 46 46 46 46 46 46 46 47 47 47 47 47 46
1065 46 46 46 46 46 46 46 46 46 47 47 47 47 47 47 46 46 46 46 46 47 46 46 46 46 47 47 47 46 46 46 46 46 46 46 46 47 46 47 47 47 47 47 47 47 47 47 47 47 47 47 47 47 47 47 47 47 47 47 46 46 47 47 47 47 47 47 47 47 47 47
$$ packed form
1117D7%%%%%%%%%%J%%%%%j%%%%%%%%%%%%%%%%j%%%%%%J%%%%%%%%%%%%%%%%%%jJ%%%%%%%%%
1110D7%%%%%%%%%J%%%%j%%%%%%%%%%jJ%%%%%%%%%%%%%%%%%%%%%%%%%%%%%%%%%%%%%%%%%%J
1102D8%j%%%%%%%%%%J%%%%%jJ%%j%%%%%%%J%%j%%%%%%%%%%%J%%j%%%%%%%%J%%%%%%%%%%%%
1095D8%%%%%%%%%%%%%%%%%%%%%%%%%%%%%%%%%%%%%%%%%%%%%%%%j%%%J%%%%%%%%%%%%%%%j%
1087D7%J%%%%%%%%%%j%%%%Jj%%%%%%%%%%%%%%%%%J%%%%J%%%Jj%%%%%%j%%%j%%%%%%%%%%%%
1080D7%%j%%%%%%%%%%%%%%%%%%%%%%j%J%%%%%%%%%%%%%%%%%%%%%%%%j%%J%%%%j%%%J%%%%%
1073D6%%%%%jJ%%%%%%%%%%%%%%%%%%%%%%%%%%%j%%J%%%%%%%%%%%%%%%%%%%%%%%%%%J%%%%j
1065D6%%%%%%%%J%%%%%j%%%%Jj%%%J%%j%%%%%%%JjJ%%%%%%%%%%%%%%%%%%%%j%J%%%%%%%%%
$$ plain form
1058 47 47 47 47 47 47 47 47 47 47 47 47 47 47 47 47 47 47 47 47 48 47 47 47 47 47 47 47 47 47 47 47 47 47 47 47 47 47 47 47 47 47 47 47 47 47 47 47 47 47 47 46 47 47 47 47 47 46 46 46 46 46 46 46 46 47 46 46 46 47 47
1050 47 47 47 47 47 47 46 46 46 46 46 46 46 46 46 46 46 46 46 46 46 46 46 46 46 46 47 47 47 47 47 47 46 46 46 46 46 46 46 46 46 46 46 46 46 46 47 47 47 47 47 47 47 47 47 47 47 47 47 47 47 47 47 47 47 47 47 47 47 47 47
1043 47 47 47 47 47 47 47 47 47 47 47 47 47 47 47 47 47 48 47 47 47 47 47 47 47 47 47 47 47 47 47 47 47 47 47 47 47 47 47 47 47 47 47 46 46 47 46 46 46 46 46 47 47 47 46 47 46 46 46 47 46 46 47 47 47 47 47 47 47 46 46
1035 46 46 46 46 46 46 46 46 46 46 46 46 46 46 46 46 46 46 46 46 46 46 46 46 46 46 46 46 46 46 46 46 46 47 47 47 47 46 46 46 47 46 47 47 47 47 47 47 47 46 46 46 46 46 46 47 46 46 46 46 47 47 47 47 46 46 46 46 46 46 46
1028 46 46 46 46 46 46 46 46 47 47 47 47 47 47 47 47 47 46 46 46 46 46 46 47 47 47 47 47 47 47 47 47 47 47 47 47 47 47 47 47 47 47 47 47 47 47 47 47 47 47 47 47 47 47 47 46 46 46 46 46 46 46 47 47 47 47 47 47 47 47 47
1021 47 47 47 47 47 47 47 47 47 47 47 47 47 47 47 47 47 47 47 47 47 47 47 47 47 47 47 47 47 47 47 47 47 48 48 48 48 48 48 48 48 48 48 48 48 48 47 48 48 48 48 48 48 49 49 50 50 50 50 51 51 52 52 53 54 55 55 56 57 58 59
1013 59 59 59 59 59 58 57 57 56 55 54 54 53 52 52 52 51 51 51 51 51 51 50 50 50 50 50 50 50 50 50 50 50 50 50 50 50 50 50 50 50 50 51 51 51 52 52 52 53 53 53 54 54 55 55 56 56 57 57 58 59 60 62 64 66 68 69 71 73 74 75
1006 75 75 75 74 73 72 70 69 67 65 64 63 62 61 60 59 58 58 57 57 56 56 56 56 56 56 56 56 56 56 56 56 56 56 56 56 56 56 56 57 57 57 57 58 58 58 58 59 59 60 60 61 61 62 63 64 65 66 67 68 69 70 71 72 73 75 76 77 78 80 81
$$ packed form
1058D7%%%%%%%%%%%%%%%%%%%Jj%%%%%%%%%%%%%%%%%%%%%%%%%%%%%jJ%%%%j%%%%%%%Jj%%J%
1050D7%%%%%j%%%%%%%%%%%%%%%%%%%J%%%%%j%%%%%%%%%%%%%J%%%%%%%%%%%%%%%%%%%%%%%%
1043D7%%%%%%%%%%%%%%%%Jj%%%%%%%%%%%%%%%%%%%%%%%%j%Jj%%%%J%%jJj%%Jj%J%%%%%%j%
1035D6%%%%%%%%%%%%%%%%%%%%%%%%%%%%%%%%J%%%j%%JjJ%%%%%%j%%%%%Jj%%%J%%%j%%%%%%
1028D6%%%%%%%J%%%%%%%%j%%%%%J%%%%%%%%%%%%%%%%%%%%%%%%%%%%%%%j%%%%%%J%%%%%%%%
1021D7%%%%%%%%%%%%%%%%%%%%%%%%%%%%%%%%J%%%%%%%%%%%%jJ%%%%%J%J%%%J%J%JJJ%JJJJ
1013E9%%%%jj%jjj%jj%%j%%%%%j%%%%%%%%%%%%%%%%%%%J%%J%%J%%J%J%J%J%JJJKKKKJKKJJ
1006G5%%jjjkjkkjjjjjjj%j%j%%%%%%%%%%%%%%%%%%J%%%J%%%J%J%J%JJJJJJJJJJJJKJJJKJ
$$ plain form
998 81 82 82 83 83 84 84 84 84 85 85 86 86 87 88 89 90 92 93 96 98 100 103 106 109 113 117 122 128 134 142 151 160 171 184 198 212 228 244 259 275 290 305 322 341 361 384 407 431 454 475 493 507
993 507 514 515 510 499 482 460 436 411 384 358 333 309 286 266 247 230 214 200 187 176 166 156 148 141 134 128 123 118 113 109 105 102 99 95 93 91 88 86 84 82 80 78 76 75 74 72 71 70 68 67 66
987 66 66 65 64 64 63 62 62 61 60 60 60 59 59 59 59 58 58 58 57 57 57 57 56 56 56 56 55 55 55 54 54 54 54 53 53 53 53 53 53 52 52 52 52 52 52 52 52 52 52 51 51 51 51 50 50 50 50 50 50 50 50 50 50 50 50 50 49 49 49 49 49
980 49 49 49 50 50 50 50 50 50 50 50 50 50 49 49 49 49 49 49 48 48 48 48 48 48 48 48 48 48 48 48 48 48 48 48 48 48 48 49 49 49 49 49 49 48 48 49 49 49 49 49 49 49 49 49 49 49 49 49 49 49 49 49 48 48 48 48 48 48 48 49 49
972 49 49 49 48 48 48 48 48 48 48 48 48 48 48 48 48 48 48 47 47 47 47 47 47 47 47 47 47 47 47 47 47 47 47 47 47 47 47 47 47 47 47 47 47 47 47 47 47 47 47 47 47 47 47 47 47 47 47 47 47 47 47 47 47 47 47 47 47 47 47 47 47
965 47 47 47 47 47 47 47 47 47 48 48 48 48 48 48 48 48 48 48 48 48 48 48 48 48 48 48 47 47 47 48 48 48 47 47 47 47 47 47 47 47 47 47 47 47 47 48 48 48 48 48 48 48 48 48 48 47 47 47 47 47 47 47 48 48 48 48 48 48 48 49 49
957 49 49 49 49 49 49 49 49 48 48 48 48 48 48 48 48 48 48 48 48 48 47 48 48 47 48 48 48 48 48 48 48 48 48 48 48 48 48 47 48 47 47 47 47 47 47 47 47 47 47 47 47 47 47 47 47 47 47 47 47 47 48 47 47 47 47 47 47 47 47 47 47
950 47 47 47 47 47 47 47 47 47 47 47 47 47 47 47 47 46 46 47 47 47 47 47 47 47 47 47 47 46 47 47 46 46 46 46 46 46 46 46 46 46 46 46 47 47 47 47 47 47 47 47 47 47 47 47 47 47 46 46 46 46 46 46 47 47 47 47 47 47 47 47 47
$$ packed form
998H1J%J%J%%%J%J%JJJJKJLKKLLLMMNOOQRRJ1J3J4J4J6J6J5J6J5J5J7J9K0K3K3K4K3K1J8J4
993E07PJnj1j7k2k4k5k7k6k5k4k3k0j9j7j6j4j3j1j0j0qpponnnmmllmkklkkkkkkjjkjjkjj
987F6%jj%jj%jj%%j%%%j%%j%%%j%%%j%%j%%%j%%%%%j%%%%%%%%%j%%%j%%%%%%%%%%%%j%%%%
980D9%%J%%%%%%%%%j%%%%%j%%%%%%%%%%%%%%%%%%J%%%%%j%J%%%%%%%%%%%%%%%%j%%%%%%J%
972D9%%j%%%%%%%%%%%%%%j%%%%%%%%%%%%%%%%%%%%%%%%%%%%%%%%%%%%%%%%%%%%%%%%%%%%%
965D7%%%%%%%%J%%%%%%%%%%%%%%%%%j%%J%%j%%%%%%%%%%%%J%%%%%%%%%j%%%%%%J%%%%%%J%
957D9%%%%%%%j%%%%%%%%%%%%jJ%jJ%%%%%%%%%%%%jJj%%%%%%%%%%%%%%%%%%%%Jj%%%%%%%%%
950D7%%%%%%%%%%%%%%%j%J%%%%%%%%%jJ%j%%%%%%%%%%%J%%%%%%%%%%%%%j%%%%%J%%%%%%%%
$$ plain form
942 47 47 47 47 47 47 47 47 47 47 47 47 47 47 47 47 47 47 47 47 47 47 47 47 47 47 47 47 47 47 47 47 47 47 47 46 47 47 47 47 48 48 48 49 49 49 48 48 48 48 47 47 47 47 47 47 47 47 47 47 47 47 48 48 48 47 47 47 47 47 48 48
935 48 47 47 47 48 48 47 47 47 47 48 48 48 48 48 48 48 48 48 48 48 48 48 48 48 49 49 49 50 50 51 51 51 52 53 54 55 56 57 58 58 58 57 56 55 54 53 52 51 51 51 50 50 50 49 49 49 48 48 48 48 48 48 48 48 48 48 48 48 48 48 48
927 48 48 48 48 48 48 48 48 48 48 47 47 47 48 48 48 48 48 48 47 47 47 47 48 48 48 48 48 48 48 48 48 48 48 48 48 48 48 48 48 48 48 48 48 48 48 47 47 47 47 48 48 47 47 47 47 47 47 47 47 47 47 47 47 47 47 47 47 48 48 48 48
920 48 47 47 48 48 48 48 48 48 48 48 48 48 48 48 48 48 48 48 47 47 48 48 48 48 48 48 47 47 47 47 47 48 48 48 48 48 48 48 48 48 48 48 48 48 48 48 48 48 48 48 48 48 48 48 48 48 48 48 48 48 48 48 48 48 48 48 48 48 48 48 47
912 47 47 47 47 48 48 48 48 48 48 48 48 48 48 48 48 48 48 48 48 48 48 48 48 49 49 49 49 49 49 49 49 49 48 48 48 48 48 48 48 48 48 49 49 49 49 49 49 49 49 49 49 49 49 49 49 49 49 49 49 49 49 49 50 50 50 51 51 51 51 51 51
905 51 50 50 50 50 50 50 50 50 50 50 50 50 50 51 51 51 52 52 52 52 52 51 51 51 51 51 50 50 50 50 50 51 50 50 50 50 50 50 50 50 50 50 51 51 51 50 50 50 50 50 50 50 50 51 50 50 50 50 50 51 51 51 51 52 52 52 52 51 51 51 51
897 51 51 51 51 51 51 51 51 51 52 52 52 53 53 53 54 54 54 54 54 55 55 55 56 57 57 59 60 61 62 63 64 63 62 61 60 58 57 56 55 54 54 53 53 53 53 52 52 52 52 52 52 52 52 52 52 53 53 53 53 54 54 54 54 54 53 53 53 53 53 53 53
890 53 53 53 53 54 54 54 54 54 54 54 54 55 55 56 56 56 56 56 56 56 56 56 56 56 55 55 55 55 55 55 56 56 57 57 57 57 58 58 59 59 60 61 62 63 64 65 66 67 67 68 68 69 70 71 74 79 85 93 104 118 136 156 179 203 229
$$ packed form
942D7%%%%%%%%%%%%%%%%%%%%%%%%%%%%%%%%%%jJ%%%J%%J%%j%%%j%%%%%%%%%%%J%%j%%%%J%
935D8j%%J%j%%%J%%%%%%%%%%%%%%J%%J%J%%JJJJJJJ%%jjjjjjj%%j%%j%%j%%%%%%%%%%%%%%
927D8%%%%%%%%%j%%J%%%%%j%%%J%%%%%%%%%%%%%%%%%%%%%%j%%%J%j%%%%%%%%%%%%%%%J%%%
920D8j%J%%%%%%%%%%%%%%%j%J%%%%%j%%%%J%%%%%%%%%%%%%%%%%%%%%%%%%%%%%%%%%%%%%%j
912D7%%%J%%%%%%%%%%%%%%%%%%%J%%%%%%%%j%%%%%%%%J%%%%%%%%%%%%%%%%%%%%J%%J%%%%%
905E1j%%%%%%%%%%%%J%%J%%%%j%%%%j%%%%Jj%%%%%%%%%J%%j%%%%%%%Jj%%%%J%%%J%%%j%%%
897E1%%%%%%%%J%%J%%J%%%%J%%JJ%KJJJJJjjjjkjjjj%j%%%j%%%%%%%%%J%%%J%%%%j%%%%%%
890E3%%%J%%%%%%%J%J%%%%%%%%%%j%%%%%J%J%%%J%J%JJJJJJJJ%J%JJJLNOQJ1J4J8K0K3K4K6
$$ plain form
883 229 252 267 268 253 225 193 164 139 120 105 94 87 82 78 76 74 72 71 70 69 68 67 67 67 67 66 66 66 66 66 66 66 66 66 67 67 67 68 69 70 70 71 73 74 75 76 78 80 82 84 87 91 94 99 103 109 115 124 136
877 136 151 172 198 231 270 313 362 413 464 505 523 506 459 398 337 285 243 210 187 171 159 151 145 140 135 131 127 123 120 116 112 109 105 102 99 96 93 90 87 84 82 80 78 76 75 74 73 71 71
871 71 70 69 68 68 67 67 66 66 66 66 66 66 67 68 69 71 74 79 85 94 105 120 137 157 179 203 227 249 263 261 244 215 183 154 129 110 95 85 77 72 68 65 63 61 59 58 57 57 56 56 56 55 55 55
866 55 55 55 54 53 53 52 52 52 51 51 51 51 50 50 50 50 50 50 50 49 49 48 48 48 48 48 48 48 48 48 48 49 50 50 50 50 50 50 49 49 49 49 49 49 49 49 49 49 49 48 48 48 48 48 48 48 49 49 49 49 49 49 49 49 49 49 49 49 49 49 49
858 49 49 49 48 48 48 48 48 48 48 48 48 48 48 48 48 48 47 47 47 47 47 48 48 48 48 48 48 48 48 48 48 48 48 48 48 48 48 48 48 48 48 48 48 48 48 48 47 47 47 47 47 48 48 48 48 49 49 49 49 49 49 48 48 48 48 48 48 48 48 48 48
851 48 48 48 48 48 47 47 47 47 47 48 48 48 48 48 48 48 48 48 48 49 49 49 49 48 48 48 48 48 48 48 48 48 48 48 48 48 48 48 48 48 48 48 48 48 48 48 48 48 48 48 48 48 48 48 48 48 48 48 48 48 48 48 48 48 48 47 47 47 47 47 47
843 47 47 47 47 47 47 47 47 48 48 48 47 47 48 48 48 48 48 48 48 48 48 48 48 48 48 48 48 48 48 48 48 48 48 48 48 48 47 47 47 47 47 47 47 47 47 47 47 47 47 47 47 47 47 47 47 47 47 47 47 47 47 47 46 46 46 46 46 46 46 46 46
836 46 46 46 46 46 46 46 46 46 46 46 46 47 47 47 48 47 47 47 47 47 47 47 47 47 47 47 47 47 47 46 46 46 46 46 46 46 46 46 46 46 46 47 47 46 46 46 46 46 46 46 46 46 46 46 46 46 46 46 46 46 46 46 46 46 46 45 45 45 45 45 45
$$ packed form
883B29K3J5Jj5k8l2k9k5j9j5j1pnmkkkjjjjj%%%j%%%%%%%%J%%JJJ%JKJJJKKKKLMLNMOORJ2
877A36J5K1K6L3L9M3M9N1N1M1J8j7m7o1o1n2m2l3k3j6j2qonnmmmlmmlmlllllllkkkkjjjk%
871G1jjj%j%j%%%%%JJJKLNORJ1J5J7K0K2K4K4K2J4kj7k9l2k9k5j9j5j0qnmlkkkjj%j%%j%%
866E5%%jj%j%%j%%%j%%%%%%j%j%%%%%%%%%JJ%%%%%j%%%%%%%%%%j%%%%%%J%%%%%%%%%%%%%%
858D9%%j%%%%%%%%%%%%%j%%%%J%%%%%%%%%%%%%%%%%%%%%%%%j%%%%J%%%J%%%%%j%%%%%%%%%
851D8%%%%j%%%%J%%%%%%%%%J%%%j%%%%%%%%%%%%%%%%%%%%%%%%%%%%%%%%%%%%%%%%%j%%%%%
843D7%%%%%%%J%%j%J%%%%%%%%%%%%%%%%%%%%%%%j%%%%%%%%%%%%%%%%%%%%%%%%%j%%%%%%%%
836D6%%%%%%%%%%%J%%Jj%%%%%%%%%%%%%j%%%%%%%%%%%J%j%%%%%%%%%%%%%%%%%%%%%j%%%%%
$$ plain form
828 45 45 45 45 45 45 45 45 45 46 46 46 46 46 46 45 45 45 45 46 46 46 46 46 46 46 46 46 46 46 46 46 46 46 46 46 46 46 46 46 46 46 46 46 46 46 46 46 46 46 46 45 45 45 45 46 46 46 46 46 46 46 46 46 46 46 46 46 46 46 45 45
820 45 45 45 45 46 46 46 46 45 45 45 45 45 45 46 46 46 46 46 46 47 47 47 47 47 47 47 47 46 46 46 46 46 46 46 46 46 46 46 46 46 46 46 46 46 46 46 46 46 46 46 46 46 46 46 46 46 46 46 46 46 45 46 46 46 46 46 45 45 46 46 46
813 46 46 46 46 46 46 46 46 46 46 46 46 46 46 47 47 47 48 48 48 48 48 48 48 48 48 47 47 47 47 47 47 47 46 46 46 46 46 46 46 46 46 46 46 45 45 46 46 46 45 45 45 45 45 46 46 46 46 46 46 45 45 45 45 45 46 46 46 46 46 46 46
805 46 46 46 46 46 46 46 46 46 46 46 47 47 47 47 47 47 47 47 47 47 46 46 45 45 45 45 45 45 45 45 45 45 45 45 45 45 45 45 45 45 45 45 45 45 45 45 45 45 45 45 45 45 45 45 45 45 45 45 46 46 46 46 46 46 47 47 47 48 47 48 48
798 48 47 47 47 47 47 47 47 46 46 46 46 46 46 45 45 45 45 45 46 46 46 46 45 45 45 45 45 45 45 45 46 46 46 45 45 45 45 45 45 45 45 45 45 45 45 45 45 45 45 45 45 45 45 45 46 45 45 45 45 45 45 45 45 45 45 45 45 45 45 45 45
790 45 45 45 45 45 45 45 45 45 45 45 45 45 45 45 45 45 46 45 45 45 45 45 45 45 45 45 45 45 45 45 45 45 45 45 45 45 45 45 45 45 45 45 45 45 45 45 45 45 45 45 45 45 45 45 45 45 45 45 45 45 45 45 45 45 45 45 45 45 45 45 45
783 45 45 45 45 46 46 46 46 46 46 46 46 46 46 46 46 46 46 46 46 46 46 46 46 45 45 45 45 45 45 45 45 45 45 45 45 45 45 45 45 45 45 45 45 45 45 45 45 45 45 45 45 45 45 45 45 45 45 45 45 45 45 45 46 46 46 46 45 45 45 45 45
775 45 45 45 45 45 45 45 45 45 45 45 45 45 45 45 45 45 45 46 46 46 46 45 45 45 45 45 45 45 45 45 45 45 45 45 45 45 45 45 45 45 45 45 45 45 45 45 45 45 45 45 44 44 44 44 45 45 45 45 45 45 45 45 45 45 45 45 45 45 45 45 45
$$ packed form
828D5%%%%%%%%J%%%%%j%%%J%%%%%%%%%%%%%%%%%%%%%%%%%%%%%%%j%%%J%%%%%%%%%%%%%%j%
820D5%%%J%%%j%%%%%J%%%%%J%%%%%%%j%%%%%%%%%%%%%%%%%%%%%%%%%%%%%%%%jJ%%%%j%J%%
813D6%%%%%%%%%%%%%J%%J%%%%%%%%j%%%%%%j%%%%%%%%%%j%J%%j%%%%J%%%%%j%%%%J%%%%%%
805D6%%%%%%%%%%J%%%%%%%%%j%j%%%%%%%%%%%%%%%%%%%%%%%%%%%%%%%%%%%J%%%%%J%%JjJ%
798D8j%%%%%%j%%%%%j%%%%J%%%j%%%%%%%J%%j%%%%%%%%%%%%%%%%%%%%Jj%%%%%%%%%%%%%%%
790D5%%%%%%%%%%%%%%%%Jj%%%%%%%%%%%%%%%%%%%%%%%%%%%%%%%%%%%%%%%%%%%%%%%%%%%%%
783D5%%%J%%%%%%%%%%%%%%%%%%%j%%%%%%%%%%%%%%%%%%%%%%%%%%%%%%%%%%%%%%J%%%j%%%%
775D5%%%%%%%%%%%%%%%%%J%%%j%%%%%%%%%%%%%%%%%%%%%%%%%%%%j%%%J%%%%%%%%%%%%%%%%
$$ plain form
768 45 45 45 45 45 45 45 46 46 46 46 46 45 45 45 46 46 45 45 45 45 45 45 45 45 45 45 45 45 45 45 45 45 45 45 46 46 46 46 45 45 45 45 45 45 45 45 45 45 45 45 45 45 45 45 46 46 46 46 46 45 45 45 45 46 45 45 45 45 45 45 45
760 45 45 45 45 45 45 45 45 45 45 45 45 45 45 45 46 46 46 46 46 46 46 46 46 46 46 46 46 46 46 46 46 46 46 46 45 45 45 45 45 45 45 46 46 46 46 46 45 45 45 46 46 46 46 46 46 46 46 46 46 46 46 46 46 46 45 45 45 46 46 46 45
753 45 45 45 45 46 46 45 45 45 45 45 45 45 45 46 46 46 46 45 45 46 46 46 45 45 45 45 45 45 45 45 45 45 45 46 46 46 46 46 46 46 45 45 45 45 46 46 46 45 45 45 45 46 46 46 46 46 46 46 46 46 46 46 46 46 45 45 45 45 45 45 45
745 45 45 45 45 45 45 45 45 45 45 45 45 45 46 46 46 46 46 46 46 46 46 46 45 46 46 46 46 46 46 46 46 46 46 45 45 45 45 45 45 45 46 45 45 45 45 46 46 46 45 45 45 45 45 45 45 45 45 45 45 45 45 45 45 45 45 45 45 46 46 46 45
$$ packed form
768D5%%%%%%J%%%%j%%J%j%%%%%%%%%%%%%%%%%J%%%j%%%%%%%%%%%%%%%J%%%%j%%%Jj%%%%%%
760D5%%%%%%%%%%%%%%J%%%%%%%%%%%%%%%%%%%j%%%%%%J%%%%j%%J%%%%%%%%%%%%%%j%%J%%j
753D5%%%J%j%%%%%%%J%%%j%J%%j%%%%%%%%%%J%%%%%%j%%%J%%j%%%J%%%%%%%%%%%%j%%%%%%
745D5%%%%%%%%%%%%J%%%%%%%%%jJ%%%%%%%%%j%%%%%%Jj%%%J%%j%%%%%%%%%%%%%%%%%%J%%j
$$ [...]
-2638D4
##END=		$$ NMR SPECTRUM
##END=		$$ LINK
