##TITLE=	RP501 clean.10.fid
##JCAMP-DX=	6.0	$$ MestReNova 14.3.3-33362
##DATA TYPE=	LINK
##BLOCKS=	1    
##ORIGIN=	Mestrelab Research S.L.
##OWNER=	hrzepa
##$MNOVA/METADATA=	(DOCUMENT,BASE64)
eyJuYW1lIjoiL1VzZXJzL2hyemVwYS9MaWJyYXJ5L01vYmlsZSBEb2N1bWVudHMvY29tfmFwcGxlfkN
sb3VkRG9jcy9TaGVwcGFyZC9OTVIgZmlsZXMgemlwcy0yLzI5LzI5LUgubW5vdmEiLCJwYWdlcyI6W3
siaXRlbXMiOlsiMSIgICAgIF19XX0=
##TITLE=	RP501 clean.10.fid
##JCAMP-DX=	6.0	$$ MestReNova 14.3.3-33362
##DATA TYPE=	NMR SPECTRUM
##DATA CLASS=	XYDATA
##BLOCK_ID=	1
##ORIGIN=	Bruker BioSpin GmbH
##OWNER=	nmrsu
##NUMDIM=	1
##$MNOVA/METADATA=	(ITEM,BASE64)
eyJhbmdsZSI6MCwiYXhlcyI6eyJ4Ijp7Im1heCI6MTYuMDY0MjU5OTk5OTM5MTI1LCJtaW4iOi0zLjc
2Njk0MjMzOTE1NjYyMjZ9LCJ5Ijp7Im1heCI6MzE0NTMuNTk5ODUzNTE1NjI1LCJtaW4iOi0yODQzLj
M1OTE2NTE5MTY1MDR9fSwicG9pbnRzIjpbeyJ4Ijo1MzIxLCJ5Ijo1ODM1fSx7IngiOjg3MjIsInkiO
jU4MzV9LHsieCI6ODcyMiwieSI6ODIwOH0seyJ4Ijo1MzIxLCJ5Ijo4MjA4fSx7IngiOjUzMjEsInki
OjU4MzV9XSwieiI6MH0=
##.OBSERVE FREQUENCY=	700.35432466099996418
##.OBSERVE NUCLEUS=	^1H
##.SOLVENT NAME=	CDCl3
##.PULSE SEQUENCE=	zg30
##LONGDATE=	2024/09/06 17:27:58.000
##.ACQUISITIONMODE=	SIMULTANEOUS (DQD)
##$ORIGINAL FORMAT=	Bruker XWIN-NMR
##$MNOVA/SCALES_VERSION=	9
##$PARAMETER FILE=	(acqus, ASCII, /private/var/folders/f6/rjf_tdyn2v98c5c0wvkgn4s80000gq/T/v1NW9DC7R1+Wf8ryhKJcag/10/acqus, 0)
$$ ##TITLE= Parameter file, TopSpin 4.1.3
$$ ##JCAMPDX= 5.0
$$ ##DATATYPE= Parameter Values
$$ ##NPOINTS= 1	$$ modification sequence number
$$ ##ORIGIN= Bruker BioSpin GmbH
$$ ##OWNER= nmrsu
$$ $$ 2024-09-06 17:26:04.592 +0100  nmrsu@CZC7167VR1
$$ $$ Z:/700/data/tds/nmr/RP501 triturated/10/acqus
$$ $$ process C:\Bruker\TopSpin4.1.3\prog\mod\dirdata.exe
$$ ##$ACQT0= -2.0981556054023
$$ ##$AMP= (0..31)
$$ 100 100 100 100 100 100 100 100 100 100 100 100 100 100 100 100 100 100
$$ 100 100 100 100 100 100 100 100 100 100 100 100 100 100
$$ ##$AMPCOIL= (0..32)
$$ -1 0 0 0 0 0 0 0 0 0 0 0 0 0 0 0 0 0 0 0 0 0 0 0 0 0 0 0 0 0 0 0 0
$$ ##$AQSEQ= 0
$$ ##$AQ_mod= 3
$$ ##$AUNM= <au_zg>
$$ ##$AUTOPOS= <28 >
$$ ##$BF1= 700.349999998
$$ ##$BF2= 700.349999998
$$ ##$BF3= 700.349999998
$$ ##$BF4= 700.349999998
$$ ##$BF5= 700.349999998
$$ ##$BF6= 700.349999998
$$ ##$BF7= 700.349999998
$$ ##$BF8= 700.349999998
$$ ##$BWFAC= (0..63)
$$ 0 0 0 0 0 0 0 0 0 0 0 0 0 0 0 0 0 0 0 0 0 0 0 0 0 0 0 0 0 0 0 0 0 0 0 0
$$ 0 0 0 0 0 0 0 0 0 0 0 0 0 0 0 0 0 0 0 0 0 0 0 0 0 0 0 0
$$ ##$BYTORDA= 0
$$ ##$CHANFCU= (0..24)
$$ 0 1 0 0 0 0 0 0 0 0 0 0 0 0 0 0 0 0 0 0 0 0 0 0 0
$$ ##$CHANREC= (0..24)
$$ 0 0 0 0 0 0 0 0 0 0 0 0 0 0 0 0 0 0 0 0 0 0 0 0 0
$$ ##$CHEMSTR= <none>
$$ ##$CNST= (0..63)
$$ 1 1 1 1 1 1 1 1 1 1 1 1 1 1 1 1 1 1 1 1 1 1 1 1 1 1 1 1 1 1 1 1 1 1 1 1
$$ 1 1 1 1 1 1 1 1 1 1 1 1 1 1 1 1 1 1 1 1 1 1 1 1 1 1 1 1
$$ ##$CPDPRG= (0..8)
$$ <> <> <> <> <> <> <> <> <>
$$ ##$D= (0..63)
$$ 0 1 0 0 0 0 0 0 0 0 0 0 0 0 0 0 0.0002 0 0 0 0 0 0 0 0 0 0 0 0 0 0 0 0
$$ 0 0 0 0 0 0 0 0 0 0 0 0 0 0 0 0 0 0 0 0 0 0 0 0 0 0 0 0 0 0 0
$$ ##$DATE= 1725640078
$$ ##$DATE_START= 1725640035
$$ [...]
$$ ##$ShimPowRng3= (0..63)
$$ 1 1 1 1 1 1 1 1 1 1 1 1 1 1 1 1 1 1 1 1 1 1 1 1 1 1 1 1 1 1 1 1 1 1 1 1
$$ 1 1 1 1 0 0 0 0 0 0 0 0 0 0 0 0 0 0 0 0 0 0 0 0 0 0 0 0
$$ ##$ShimPowType1= 8
$$ ##$ShimPowType2= 8
$$ ##$ShimPowType3= 0
$$ ##$ShimPowType4= 0
$$ ##$ShimPowType5= 0
$$ ##$ShimPowType6= 0
$$ ##$ShimPowType7= 0
$$ ##$ShimPowType8= 0
$$ ##$ShimSysActGrad= (0..63)
$$ 1 2 3 4 13 5 7 11 10 9 6 8 12 18 19 20 21 15 22 23 24 14 25 16 26 17 27
$$ 28 31 32 33 34 35 36 37 38 0 0 0 0 0 0 0 0 0 0 0 0 0 0 0 0 0 0 0 0 0 0
$$ 0 0 0 0 0 0
$$ ##$ShimSysAngle= <>
$$ ##$ShimSysFunc= (0..63)
$$ 1 2 3 4 5 6 7 8 9 10 0 37 38 35 16 15 14 13 12 11 28 27 26 25 24 23 36
$$ 22 30 29 20 21 34 33 32 31 17 18 19 0 0 0 0 0 0 0 0 0 0 0 0 0 0 0 0 0 0
$$ 0 0 0 0 0 0 0
$$ ##$ShimSysMatId= <292722da.dat>
$$ ##$ShimSysMatrix= 1
$$ ##$ShimSysMinMaxUG= 130000
$$ ##$ShimSysOffset= <29 mm>
$$ ##$ShimSysType= 4
$$ ##$ShimUnit= 3
$$ ##$SpectrOsVersion= <4.1.156.20210628>
$$ ##$TCubeEth= <192.168.180.38>
$$ ##$TCubeSeqDevice= <>
$$ ##$TOSITY= <no>
$$ ##$TRIPLO2= 0
$$ ##$TopSpinVersion= <TopSpin 4.1.3>
$$ ##$TrxFreqFormula= (0..23)
$$ <TrxFreqFormula(2.0,700350000.000000,'TRX',Trx(1.0,'TRX 1200.1',1,5.000000,1290.000000))>
$$ <TrxFreqFormula(2.0,700350000.000000,'TRX',Trx(1.0,'TRX 1200.2',1,5.000000,1290.000000))>
$$ <TrxFreqFormula(2.0,700350000.000000,'TRX',Trx(1.0,'TRX 1200.3',1,5.000000,1290.000000))>
$$ <> <> <> <> <> <> <> <> <> <> <> <> <> <> <> <> <> <> <> <> <>
$$ ##$TrxPN= (0..23)
$$ <Z148391> <Z148391> <Z148391> <> <> <> <> <> <> <> <> <> <> <> <> <> <>
$$ <> <> <> <> <> <> <>
$$ ##$TrxSN= (0..23)
$$ <00336> <00337> <00342> <> <> <> <> <> <> <> <> <> <> <> <> <> <> <> <>
$$ <> <> <> <> <>
$$ ##$VCubeEth= (0..23)
$$ <no> <no> <no> <no> <no> <no> <no> <no> <no> <no> <no> <no> <no> <no> <no>
$$ <no> <no> <no> <no> <no> <no> <no> <no> <no>
$$ ##$VTU= 2
$$ ##$VTUETH= <192.168.99.11>
$$ ##$VTUTY= <no>
$$ ##$ValueLine= no
$$ ##$VpuPN= (0..23)
$$ <no> <no> <no> <no> <no> <no> <no> <no> <no> <no> <no> <no> <no> <no> <no>
$$ <no> <no> <no> <no> <no> <no> <no> <no> <no>
$$ ##$VpuSN= (0..23)
$$ <no> <no> <no> <no> <no> <no> <no> <no> <no> <no> <no> <no> <no> <no> <no>
$$ <no> <no> <no> <no> <no> <no> <no> <no> <no>
$$ ##$WBREFAM= (0..31)
$$ 99.8 100 100 100 100 100 100 100 100 100 100 100 100 100 100 100 100 100
$$ 100 100 100 100 100 100 100 100 100 100 100 100 100 100
$$ ##$WBREFLM= (0..31)
$$ 1 0 1 0 0 0 0 0 0 0 0 0 0 0 0 0 0 0 0 0 0 0 0 0 0 0 0 0 0 0 0 0
$$ ##$WBREFPH= (0..31)
$$ 0.05 0 0 0 0 0 0 0 0 0 0 0 0 0 0 0 0 0 0 0 0 0 0 0 0 0 0 0 0 0 0 0
$$ ##$WBSGU= (0..31)
$$ 1 2 4 0 0 0 0 0 0 0 0 0 0 0 0 0 0 0 0 0 0 0 0 0 0 0 0 0 0 0 0 0
$$ ##END=
$$ 
##$DECIM=	1440
##$DSPFVS=	21
##XUNITS=	HZ
##YUNITS=	ARBITRARY UNITS
##FIRSTX=	11250.604788156719223
##LASTX=	-2638.1781369192458442
##DELTAX=	-0.10596381293402784562
##XFACTOR=	1
##YFACTOR=	0.87265585659733879709
##FIRSTY=	77.670623779296875
##MINY=	16.03009033203125
##MAXY=	28594.314453125
##NPOINTS=	131072
##XYDATA=	(X++(Y..Y))
$$ [...]
2616A99J%LKKJKJJLLJKKKKLLKLLKLLKLLLLLLLMLNMNMMMMMNONNMNNOOOOOONPOPPNPPQPPQPO
$$ 199 200 200 203 205 207 208 210 211 212 215 218 219 221 223 225 227 230 233 235 238 241 243 246 249 251 254 257 260 263 266 269 272 276 279 284 288 293 297 301 305 309 313 318 324 329 334 338 343 348 354 360 366 372 378 384 389 396 402 409 416 421 428 435 443 450 457 465 472 478
2609D78ONOPOOOPNOOONNOONNMNNNNNMMNNNMMNNOONOOONPPPPPOPPOPPOOOPOOPQPONPPQPPOO
$$ 478 484 489 495 502 508 514 520 527 532 538 544 550 555 560 566 572 577 582 586 591 596 601 606 611 615 619 624 629 634 638 642 647 652 658 664 669 675 681 687 692 699 706 713 720 727 733 740 747 753 760 767 773 779 785 792 798 804 811 819 826 832 837 844 851 859 866 873 879 885
2601H85OOPPPPONOONPOOOPOOPPPOPPOOPPOOOPQOOOOOOONMMNMMMMMLLMKLJKJKJJJJJ%J%J%%
$$ 885 891 897 904 911 918 925 931 936 942 948 953 960 966 972 978 985 991 997 1004 1011 1018 1024 1031 1038 1044 1050 1057 1064 1070 1076 1082 1089 1097 1103 1109 1115 1121 1127 1133 1139 1144 1148 1152 1157 1161 1165 1169 1173 1177 1180 1183 1187 1189 1192 1193 1195 1196 1198 1199 1200 1201 1202 1203 1203 1204 1204 1205 1205 1205
2594A205%J%J%J%%%%%%j%%%j%%jkkjk%jjkjlmmlllllmmmmlmnnnmnnooooonnooppoonnnnon
$$ 1205 1205 1206 1206 1207 1207 1208 1208 1208 1208 1208 1208 1208 1207 1207 1207 1207 1206 1206 1206 1205 1203 1201 1200 1198 1198 1197 1196 1194 1193 1190 1186 1182 1179 1176 1173 1170 1167 1163 1159 1155 1151 1148 1144 1139 1134 1129 1125 1120 1115 1109 1103 1097 1091 1085 1080 1075 1069 1063 1056 1049 1043 1037 1032 1027 1022 1017 1011 1006
2587A006nnnnnmnmmnmmnnnmnnnooooopppqpqqqqqrrrqqqj0rj0j0rrqqrrqrqqpprrpqpoppp
$$ 1006 1001 996 991 986 981 977 972 968 964 959 955 951 946 941 936 932 927 922 917 911 905 899 893 887 880 873 866 858 851 843 835 827 819 811 802 793 784 776 768 760 750 741 731 721 712 703 695 687 678 669 661 652 644 636 629 622 613 604 597 589 582 576 569 562 555
2580E55noonponmnnmnmmlmmnmmmmllllkklllllkkklklkjkjkkjkkkjjkjjjjjjjjj%jjjjjj%
$$ 555 550 544 538 533 526 520 515 511 506 501 497 492 488 484 481 477 473 468 464 460 456 452 449 446 443 440 438 436 433 430 427 424 421 419 417 415 412 410 407 405 404 402 401 399 397 396 394 392 390 389 388 386 385 384 383 382 381 380 379 378 377 377 376 375 374 373 372 371 371
2572C71j%%j%%j%%j%%j%%%%%%JJJ%%%j%JK%%jJLKJJJ%JJJ%JJKKJJJJJ%JJJKKJKLKKJKJKMK
$$ 371 370 370 370 369 369 369 368 368 368 367 367 367 366 366 366 366 366 366 366 367 368 369 369 369 369 368 368 369 371 371 371 370 371 374 376 377 378 379 379 380 381 382 382 383 384 386 388 389 390 391 392 393 393 394 395 396 398 400 401 403 406 408 410 411 413 414 416 420 422
2565D22KKLKKLMLLLLLLLLLMMNNLMMMNNNMNMONOOOPOOPPPPPQQRQQRQRRRQJ0J0RJ0J1J1J0J0
$$ 422 424 426 429 431 433 436 440 443 446 449 452 455 458 461 464 467 471 475 480 485 488 492 496 500 505 510 515 519 524 528 534 539 545 551 557 564 570 576 583 590 597 604 611 619 627 636 644 652 661 669 678 687 696 704 714 724 733 743 754 765 775 785
2559G85J1J0J0J0J0RJ1J1J1J1J0RRRRRJ0RRROPPPPPPPNONONNONNOOPNOOOPPPQPPQJ0J0J1J0
$$ 785 796 806 816 826 836 845 856 867 878 889 899 908 917 926 935 944 954 963 972 981 987 994 1001 1008 1015 1022 1029 1036 1041 1047 1052 1058 1063 1068 1074 1079 1084 1090 1096 1103 1108 1114 1120 1126 1133 1140 1147 1155 1162 1169 1177 1187 1197 1208 1218
2553A218J0J0J0J2J1J3J2J4J4J4J4J4J5J4J3J4J4J4J5J4J4J5J5J4J2J3J3J2J1J2J2J2J0QR
$$ 1218 1228 1238 1248 1260 1271 1284 1296 1310 1324 1338 1352 1366 1381 1395 1408 1422 1436 1450 1465 1479 1493 1508 1523 1537 1549 1562 1575 1587 1598 1610 1622 1634 1644 1652 1661
2549A661QONMNMMLJJJJJjkjklkkklklmmlllklkmmllkkkjkk%jj%%%%JJKKKJKJKKKKKKKJKJK
$$ 1661 1669 1675 1680 1684 1689 1693 1697 1700 1701 1702 1703 1704 1705 1704 1702 1701 1699 1696 1694 1692 1690 1687 1685 1682 1678 1674 1671 1668 1665 1663 1660 1658 1654 1650 1647 1644 1642 1640 1638 1637 1635 1633 1633 1632 1631 1631 1631 1631 1631 1632 1633 1635 1637 1639 1640 1642 1643 1645 1647 1649 1651 1653 1655 1657 1658 1660 1661 1663
2542A663JKJ%%jj%kjkljllmllnonnnnoopqqprrj0j0j0j0j1j1j1j1j1j1j1j2j3j3j3j3j2j3
$$ 1663 1664 1666 1667 1667 1667 1666 1665 1665 1663 1662 1660 1657 1656 1653 1650 1646 1643 1640 1635 1629 1624 1619 1614 1609 1603 1597 1590 1582 1574 1567 1558 1549 1539 1529 1519 1509 1498 1487 1476 1465 1454 1443 1432 1420 1407 1394 1381 1368 1356 1343
2537A343j3j3j2j3j2j1j1j1j2j2j2j1j0j1j0j0j0j0j0qrrqqqqqopopoponpononooooonooo
$$ 1343 1330 1317 1305 1292 1280 1269 1258 1247 1235 1223 1211 1200 1190 1179 1169 1159 1149 1139 1129 1121 1112 1103 1095 1087 1079 1071 1063 1057 1050 1044 1037 1031 1024 1018 1013 1006 1000 995 989 984 978 972 966 960 954 949 943 937 931
2531I31oooqpoqqpqqrqqrqrrqrrrj0rrrrj0rrrrrrrrrqrrrpqqqqqqppppopponnonnnnnonn
$$ 931 925 919 913 905 898 892 884 876 869 861 853 844 836 828 819 811 802 793 785 776 767 758 748 739 730 721 712 702 693 684 675 666 657 648 639 630 621 613 604 595 586 579 571 563 555 547 539 531 524 517 510 503 497 490 483 477 472 467 461 456 451 446 441 436 430 425 420
2524D20nnlmmlnmmlmlmmmmmlmmmklllkjlllllljkjlkkkkkkklkkjkkkkkjjkklj%%%kkkjjkj
$$ 420 415 410 407 403 399 396 391 387 383 380 376 373 369 365 361 357 353 350 346 342 338 336 333 330 327 325 324 321 318 315 312 309 306 305 303 302 299 297 295 293 291 289 287 285 282 280 278 277 275 273 271 269 267 266 265 263 261 258 257 257 257 257 255 253 251 250 249 247 246
2517B46jjkk%j%kj%jj%kkjkjk%j%j%j%%%jjkjjkj%%jjj%j%k%%%%j%%kjjjj%j%j%jj%%jj%%
$$ 246 245 244 242 240 240 239 239 237 236 236 235 234 234 232 230 229 227 226 224 224 223 223 222 222 221 221 221 221 220 219 217 216 215 213 212 212 212 211 210 209 209 208 208 206 206 206 206 206 205 205 205 203 202 201 200 199 199 198 198 197 197 196 195 195 195 194 193 193 193
2510A93jjj%jj%j%J%jjjj%j%%J%%jJ%%jj%jjj%j%j%%jj%j%%j%%j%%jj%%%%%%%jJ%%j%%jj%
$$ 193 192 191 190 190 189 188 188 187 187 188 188 187 186 185 184 184 183 183 183 184 184 184 183 184 184 184 183 182 182 181 180 179 179 178 178 177 177 177 176 175 175 174 174 174 173 173 173 172 172 172 171 170 170 170 170 170 170 170 170 169 170 170 170 169 169 169 168 167 167
2502A67j%J%%%%j%%j%%j%JJ%%%%jj%jjj%%%%%%j%%%%J%j%jJ%%%%jJ%Jjj%j%%J%%j%j%%%%%
$$ 167 166 166 167 167 167 167 167 166 166 166 165 165 165 164 164 165 166 166 166 166 166 165 164 164 163 162 161 161 161 161 161 161 161 160 160 160 160 160 161 161 160 160 159 160 160 160 160 160 159 160 160 161 160 159 159 158 158 158 159 159 159 158 158 157 157 157 157 157 157
2495A57%%%%jj%%JJ%J%j%%%%%%%%%%j%j%%j%%%%%%JJj%%%j%%%%%%%%jJ%%JJ%k%%%%j%%J%%
$$ 157 157 157 157 157 156 155 155 155 156 157 157 158 158 157 157 157 157 157 157 157 157 157 157 157 156 156 155 155 155 154 154 154 154 154 154 154 155 156 155 155 155 155 154 154 154 154 154 154 154 154 154 153 154 154 154 155 156 156 154 154 154 154 154 153 153 153 154 154 154
2488A54j%JJJ%%%j%%%%%%%%JjjJ%%k%%J%JJ%J%jj%J%JJj%%%%%%%%%%%%%J%J%%%%%J%%%%%%
$$ 154 153 153 154 155 156 156 156 156 155 155 155 155 155 155 155 155 155 156 155 154 155 155 155 153 153 153 154 154 155 156 156 157 157 156 155 155 156 156 157 158 157 157 157 157 157 157 157 157 157 157 157 157 157 157 158 158 159 159 159 159 159 159 160 160 160 160 160 160 160
2480A60%%%J%%%%%%J%%%%%j%JJJJ%j%%jj%J%JJ%J%JJ%JjjJ%JJ%%%%%%%%J%J%%j%%J%jJJ%J
$$ 160 160 160 160 161 161 161 161 161 161 161 162 162 162 162 162 162 161 161 162 163 164 165 165 164 164 164 163 162 162 163 163 164 165 165 166 166 167 168 168 169 168 167 168 168 169 170 170 170 170 170 170 170 170 170 171 171 172 172 172 171 171 171 172 172 171 172 173 173 174
2473A74%%JJ%jj%%JJ%J%%%%J%J%J%%%J%jJKJ%J%%%%%J%%%%%%%%JJJJ%J%J%Jj%JJJJ%%JK%J
$$ 174 174 174 175 176 176 175 174 174 174 175 176 176 177 177 177 177 177 178 178 179 179 180 180 180 180 181 181 180 181 183 184 184 185 185 185 185 185 185 186 186 186 186 186 186 186 186 186 187 188 189 190 190 191 191 192 192 193 192 192 193 194 195 196 196 196 197 199 199 200
2466B00J%%%%%J%%KJJJ%%J%JJJ%JJJ%%JJJJJJJ%J%J%J%JKJJKJJKJJJJKJJK%JKJK%JLKKJKK
$$ 200 201 201 201 201 201 201 202 202 202 204 205 206 207 207 207 208 208 209 210 211 211 212 213 214 214 214 215 216 217 218 219 220 221 221 222 222 223 223 224 224 225 227 228 229 231 232 233 235 236 237 238 239 241 242 243 245 245 246 248 249 251 251 252 255 257 259 260 262 264
2458B64%JKKKKKJKJJKLJJKLKKJKLKKKKKLLLKKJLKLLLLLLKKLLLLLLLLKKMLKLLLKLLKMMKKLK
$$ 264 264 265 267 269 271 273 275 276 278 279 280 282 285 286 287 289 292 294 296 297 299 302 304 306 308 310 312 315 318 321 323 325 326 329 331 334 337 340 343 346 349 351 353 356 359 362 365 368 371 374 377 379 381 385 388 390 393 396 399 401 404 407 409 413 417 419 421 424 426
2451D26LLKKJKKKJKKLLJJLKKKLKKLKLLJKLKLLJJJLLLLKKLLMLMKLLMKLMLLLLKMLLKMLLMKKL
$$ 426 429 432 434 436 437 439 441 443 444 446 448 451 454 455 456 459 461 463 465 468 470 472 475 477 480 483 484 486 489 491 494 497 498 499 500 503 506 509 512 514 516 519 522 526 529 533 535 538 541 545 547 550 554 557 560 563 566 568 572 575 578 580 584 587 590 594 596 598 601
2444F01KKLKKKKLLKKKKKKJJJ%J%JJJJ%%%jjj%J%%%%jkk%%%jjjjjj%%kjjkjk%%j%jk%j%j%j
$$ 601 603 605 608 610 612 614 616 619 622 624 626 628 630 632 634 635 636 637 637 638 638 639 640 641 642 642 642 642 641 640 639 639 640 640 640 640 640 639 637 635 635 635 635 634 633 632 631 630 629 629 629 627 626 625 623 622 620 620 620 619 619 618 616 616 615 615 614 614 613
2437F13%J%%J%%Jkjj%%kkjjj%j%jjjjjkjjj%kkkkkllkkkllkkkmmkllmlmlmmlmmllllmnlll
$$ 613 613 614 614 614 615 615 615 616 614 613 612 612 612 610 608 607 606 605 605 604 604 603 602 601 600 599 597 596 595 594 594 592 590 588 586 584 581 578 576 574 572 569 566 564 562 560 556 552 550 547 544 540 537 533 530 526 522 519 515 511 508 505 502 499 495 490 487 484 481
2429D81lmlllmllmmlmmlklkllllmlkklmkllklklklkkjklllkkkkljkkklkkllllljkkllklkl
$$ 481 478 474 471 468 465 461 458 455 451 447 444 440 436 433 431 428 426 423 420 417 414 410 407 405 403 400 396 394 391 388 386 383 381 378 376 373 371 369 368 366 363 360 357 355 353 351 349 346 345 343 341 339 336 334 332 329 326 323 320 317 316 314 312 309 306 304 301 299 296
2422B96lkkkllllklklklkkklklkklkkklkkjlkkkkkjkjkkjjjkljklkjjjk%jkjk%%jj%jkkjj
$$ 296 293 291 289 287 284 281 278 275 273 270 268 265 263 260 258 256 254 251 249 246 244 242 239 237 235 233 230 228 226 225 222 220 218 216 214 212 211 209 208 206 204 203 202 201 199 196 195 193 190 188 187 186 185 183 183 182 180 179 177 177 177 176 175 175 174 172 170 169 168
2415A68%jkkjk%j%jjjjjjjjjj%%%%%jjj%jjjj%%%jjjj%j%%%%jkjj%Jj%j%J%jJj%j%%j%J%%
$$ 168 168 167 165 163 162 160 160 159 159 158 157 156 155 154 153 152 151 150 149 149 149 149 149 149 148 147 146 146 145 144 143 142 142 142 142 141 140 139 138 138 137 137 137 137 137 136 134 133 132 132 133 132 132 131 131 132 132 131 132 131 131 130 130 130 129 129 130 130 130
2407A30%jjj%j%jjj%J%%jj%%%%jJ%j%jjJ%%j%j%j%%%%J%j%j%%%%%%%%%%%%k%%jJJjj%%%j%
$$ 130 130 129 128 127 127 126 126 125 124 123 123 124 124 124 123 122 122 122 122 122 121 122 122 121 121 120 119 120 120 120 119 119 118 118 117 117 117 117 117 118 118 117 117 116 116 116 116 116 116 116 116 116 116 116 116 116 114 114 114 113 114 115 114 113 113 113 113 112 112
2400A12j%j%J%%%%%j%%%JJ%jj%%%J%kjjJJJj%%J%j%j%Jj%Jj%%%%j%%%J%%jj%j%%%%j%%J%J
$$ 112 111 111 110 110 111 111 111 111 111 111 110 110 110 110 111 112 112 111 110 110 110 110 111 111 109 108 107 108 109 110 109 109 109 110 110 109 109 108 108 109 108 108 109 108 108 108 108 108 107 107 107 107 108 108 108 107 106 106 105 105 105 105 105 104 104 104 105 105 106
2393A06J%%%%%%j%%%J%j%j%%%%J%%jj%J%%J%%%%%jj%%%JJ%%%%%%j%%j%j%%%j%j%JJ%j%j%%
$$ 106 107 107 107 107 107 107 107 106 106 106 106 107 107 106 106 105 105 105 105 105 106 106 106 105 104 104 105 105 105 106 106 106 106 106 106 105 104 104 104 104 105 106 106 106 106 106 106 106 105 105 105 104 104 103 103 103 103 102 102 101 101 102 103 103 102 102 101 101 101
2385A01J%%%%%%%%%J%J%%%%J%k%%%%%%%%%%%%J%%jj%J%%%%%j%j%%%%%J%%jJ%%%%%Jj%%%%%
$$ 101 102 102 102 102 102 102 102 102 102 102 103 103 104 104 104 104 104 105 105 103 103 103 103 103 103 103 103 103 103 103 103 103 104 104 104 103 102 102 103 103 103 103 103 103 102 102 101 101 101 101 101 101 102 102 102 101 102 102 102 102 102 102 103 102 102 102 102 102 102
2378A02%J%j%%%%%Jjj%JJ%J%%j%j%%%%%%%%JJj%%j%%%%Jj%j%%%%%%%j%J%%J%%j%JJjj%j%%
$$ 102 102 103 103 102 102 102 102 102 102 103 102 101 101 102 103 103 104 104 104 103 103 102 102 102 102 102 102 102 102 102 103 104 103 103 103 102 102 102 102 102 103 102 102 101 101 101 101 101 101 101 101 100 100 101 101 101 102 102 102 101 101 102 103 102 101 101 100 100 100
2371A00%%%%%%%J%%%J%%%%Jj%j%%%%%%%J%%j%%j%JJ%%J%j%j%j%%j%%J%%J%%%jJ%%j%%%J%%
$$ 100 100 100 100 100 100 100 100 101 101 101 101 102 102 102 102 102 103 102 102 101 101 101 101 101 101 101 101 102 102 102 101 101 101 100 100 101 102 102 102 103 103 102 102 101 101 100 100 100 99 99 99 100 100 100 101 101 101 101 100 101 101 101 100 100 100 100 101 101 101
2363A01%jJJ%%j%j%%%%j%%JJJJ%j%jjjJ%J%%%%%j%%%J%J%%%%j%%%J%%j%%%J%%j%%jjJ%JJj
$$ 101 101 100 101 102 102 102 101 101 100 100 100 100 100 99 99 99 100 101 102 103 103 102 102 101 100 99 100 100 101 101 101 101 101 101 100 100 100 100 101 101 102 102 102 102 102 101 101 101 101 102 102 102 101 101 101 101 102 102 102 101 101 101 100 99 100 100 101 102 101
2356A01k%Jj%%%%j%%J%%%j%%j%%J%%J%%%%%%%%%J%jj%%jj%J%%Jj%jJ%J%%%J%%j%%%%%Jj%J
$$ 101 99 99 100 99 99 99 99 99 98 98 98 99 99 99 99 98 98 98 97 97 97 98 98 98 99 99 99 99 99 99 99 99 99 99 100 100 99 98 98 98 97 96 96 97 97 97 98 97 97 96 97 97 98 98 98 98 99 99 99 98 98 98 98 98 98 99 98 98 99
2349I9j%%j%%j%J%%J%%j%j%%J%%%%%%%%%%%%%%%%%%%%%%J%%j%j%j%JJ%j%j%%%%%%%J%%J%%
$$ 99 98 98 98 97 97 97 96 96 97 97 97 98 98 98 97 97 96 96 96 97 97 97 97 97 97 97 97 97 97 97 97 97 97 97 97 97 97 97 97 97 97 97 98 98 98 97 97 96 96 95 95 96 97 97 96 96 95 95 95 95 95 95 95 95 96 96 96 97 97 97
2341I7%%j%%%%%J%%j%%%J%%%%%%jj%%J%JJ%%jj%%%Jj%%%j%j%J%%j%%jJ%%JJ%%%%%%%j%%j%
$$ 97 97 97 96 96 96 96 96 96 97 97 97 96 96 96 96 97 97 97 97 97 97 97 96 95 95 95 96 96 97 98 98 98 97 96 96 96 96 97 96 96 96 96 95 95 94 94 95 95 95 94 94 94 93 94 94 94 95 96 96 96 96 96 96 96 96 95 95 95 94 94
2334I4%J%J%%jj%%j%%%JJJ%j%%%%%%%%j%j%%JJJ%%%%j%%%%%%%%%j%%%JK%%%Jj%j%j%%J%J%
$$ 94 94 95 95 96 96 96 95 94 94 94 93 93 93 93 94 95 96 96 95 95 95 95 95 95 95 95 95 94 94 93 93 93 94 95 96 96 96 96 96 95 95 95 95 95 95 95 95 95 95 94 94 94 94 95 97 97 97 97 98 97 97 96 96 95 95 95 96 96 97 97
2327I7%%Jj%j%j%J%%%%%%J%j%%%J%%j%%%jJ%J%%jjj%JJ%%%%jJ%%Jjj%%%%%JJJ%j%jj%%%jJ
$$ 97 97 97 98 97 97 96 96 95 95 96 96 96 96 96 96 96 97 97 96 96 96 96 97 97 97 96 96 96 96 95 96 96 97 97 97 96 95 94 94 95 96 96 96 96 96 95 96 96 96 97 96 95 95 95 95 95 95 96 97 98 98 97 97 96 95 95 95 95 94 95
2319I5%%%jJj%J%%%%%j%%%JJJj%j%%%j%%%%%J%jk%%%%JJJjj%%JjjJ%J%%J%j%%j%JJ%%J%%%
$$ 95 95 95 95 94 95 94 94 95 95 95 95 95 95 94 94 94 94 95 96 97 96 96 95 95 95 95 94 94 94 94 94 94 95 95 94 92 92 92 92 92 93 94 95 94 93 93 93 94 93 92 93 93 94 94 94 95 95 94 94 94 93 93 94 95 95 95 96 96 96 96
2312I6J%kjJ%%%%%%jJ%%%%%%jJ%%%j%%%%%%%%%%JJ%j%%jJJ%%%%%%%j%%%%jj%JJ%%%%%%j%%
$$ 96 97 97 95 94 95 95 95 95 95 95 95 94 95 95 95 95 95 95 95 94 95 95 95 95 94 94 94 94 94 94 94 94 94 94 94 95 96 96 95 95 95 94 95 96 96 96 96 96 96 96 96 95 95 95 95 95 94 93 93 94 95 95 95 95 95 95 95 94 94 94
2304I4j%%jJ%%J%%J%%%J%%j%j%%%%%jJ%%%%%%%%%%%%%%j%%%%J%%%%%%%%%jJJj%J%%%%%%%k
$$ 94 93 93 93 92 93 93 93 94 94 94 95 95 95 95 96 96 96 95 95 94 94 94 94 94 94 93 94 94 94 94 94 94 94 94 94 94 94 94 94 94 94 93 93 93 93 93 94 94 94 94 94 94 94 94 94 94 93 94 95 94 94 95 95 95 95 95 95 95 95 93
2297I3%%JJ%%%j%JJj%j%%%%%J%%%%%%%Jj%%j%J%%jJ%%%%J%J%%j%j%%j%J%JJj%%%j%%j%%j%
$$ 93 93 93 94 95 95 95 95 94 94 95 96 95 95 94 94 94 94 94 94 95 95 95 95 95 95 95 95 96 95 95 95 94 94 95 95 95 94 95 95 95 95 95 96 96 97 97 97 96 96 95 95 95 94 94 95 95 96 97 96 96 96 96 95 95 95 94 94 94 93 93
2289I3J%%%JJ%jj%%J%j%%%%%%jj%%JJ%J%%j%%%j%%J%%%%%%%%%%%%j%%J%%%K%jjJ%%j%Jj%%
$$ 93 94 94 94 94 95 96 96 95 94 94 94 95 95 94 94 94 94 94 94 94 93 92 92 92 93 94 94 95 95 95 94 94 94 94 93 93 93 94 94 94 94 94 94 94 94 94 94 94 94 94 93 93 93 94 94 94 94 96 96 95 94 95 95 95 94 94 95 94 94 94
2282I4J%j%J%%j%%j%%%%JJKj%jj%j%jJJ%J%Jj%j%jJJ%%%%j%JJ%%jj%%%%%%%%jJJ%%%%%%%j
$$ 94 95 95 94 94 95 95 95 94 94 94 93 93 93 93 93 94 95 97 96 96 95 94 94 93 93 92 93 94 94 95 95 96 95 95 94 94 93 94 95 95 95 95 95 94 94 95 96 96 96 95 94 94 94 94 94 94 94 94 94 93 94 95 95 95 95 95 95 95 95 94
2275I4%%J%j%j%%J%J%%%%%%j%J%%%%%jj%%%J%%%%%Jj%%%%jJ%%%J%J%%%%j%jjj%%%Jj%%jJK
$$ 94 94 94 95 95 94 94 93 93 93 94 94 95 95 95 95 95 95 95 94 94 95 95 95 95 95 95 94 93 93 93 93 94 94 94 94 94 94 95 94 94 94 94 94 93 94 94 94 94 95 95 96 96 96 96 96 95 95 94 93 92 92 92 92 93 92 92 92 91 92 94
2267I4j%%j%jJJ%%%J%%%%%%%JJ%jj%%JjjjJJ%%j%%%%%%J%%%%j%%%%%J%jJ%%%%%%%%%jJ%%%
$$ 94 93 93 93 92 92 91 92 93 93 93 93 94 94 94 94 94 94 94 94 95 96 96 95 94 94 94 95 94 93 92 93 94 94 94 93 93 93 93 93 93 93 94 94 94 94 94 93 93 93 93 93 93 94 94 93 94 94 94 94 94 94 94 94 94 94 93 94 94 94 94
2260I4%%%%%Jj%%%j%%%%jJK%%%jj%J%%JJ%jjjjJJ%j%jJ%J%%%JJjj%%j%j%%%%%%%%jJJ%jJ%
$$ 94 94 94 94 94 94 95 94 94 94 94 93 93 93 93 93 92 93 95 95 95 95 94 93 93 94 94 94 95 96 96 95 94 93 92 93 94 94 93 93 92 93 93 94 94 94 94 95 96 95 94 94 94 93 93 92 92 92 92 92 92 92 92 92 91 92 93 93 92 93 93
2252I3%%K%jj%%%%Jj%%%%%j%%%%j%J%J%%%%%%JjjJ%%%%%jj%%JJ%J%j%j%%%%J%%%%jj%%%KJ
$$ 93 93 93 95 95 94 93 93 93 93 93 94 93 93 93 93 93 93 92 92 92 92 92 91 91 92 92 93 93 93 93 93 93 93 94 93 92 93 93 93 93 93 93 92 91 91 91 92 93 93 94 94 93 93 92 92 92 92 92 93 93 93 93 93 92 91 91 91 91 93 94
2245I4j%%%%%%%j%%%%%%JJj%J%%jjJ%%%%Jjj%%%%%J%%%J%%%%%%jj%j%JJ%%j%%jJJjJJ%Jj%
$$ 94 93 93 93 93 93 93 93 93 92 92 92 92 92 92 92 93 94 93 93 94 94 94 93 92 93 93 93 93 93 94 93 92 92 92 92 92 92 93 93 93 93 94 94 94 94 94 94 94 93 92 92 91 91 92 93 93 93 92 92 92 91 92 93 92 93 94 94 95 94 94
2238I4%j%%j%%%%%JJ%jjj%%%jJJ%JJ%%j%j%%J%%%j%%J%%%JJ%Jjjj%%%%%%J%%%J%j%JjjjJJ
$$ 94 94 93 93 93 92 92 92 92 92 92 93 94 94 93 92 91 91 91 91 90 91 92 92 93 94 94 94 93 93 92 92 92 93 93 93 93 92 92 92 93 93 93 93 94 95 95 96 95 94 93 93 93 93 93 93 93 94 94 94 94 95 95 94 94 95 94 93 92 93 94
2230I4%j%%%j%j%%%jJJ%%%%%%%%j%JJ%%%%J%%%j%%%%J%%%%%%%%j%%J%J%jJ%j%jj%%%J%%%%
$$ 94 94 93 93 93 93 92 92 91 91 91 91 90 91 92 92 92 92 92 92 92 92 92 91 91 92 93 93 93 93 93 94 94 94 94 93 93 93 93 93 94 94 94 94 94 94 94 94 94 93 93 93 94 94 95 95 94 95 95 94 94 93 92 92 92 92 93 93 93 93 93
2223I3%%%%J%%%J%%jj%jj%%JJ%Jj%%%%%%J%%%j%%j%%jJJ%%Jj%%%%%%J%%j%%%%J%j%Jjj%%j
$$ 93 93 93 93 93 94 94 94 94 95 95 95 94 93 93 92 91 91 91 92 93 93 94 93 93 93 93 93 93 93 94 94 94 94 93 93 93 92 92 92 91 92 93 93 93 94 93 93 93 93 93 93 93 94 94 94 93 93 93 93 93 94 94 93 93 94 93 92 92 92 91
2215I1%J%J%%%%%%%J%j%%J%j%%%%j%J%%jJj%%J%%%jjj%%%%JJ%%J%%jj%Jj%J%J%%%%%%%%j%
$$ 91 91 92 92 93 93 93 93 93 93 93 93 94 94 93 93 93 94 94 93 93 93 93 93 92 92 93 93 93 92 93 92 92 92 93 93 93 93 92 91 90 90 90 90 90 91 92 92 92 93 93 93 92 91 91 92 91 91 92 92 93 93 93 93 93 93 93 93 93 92 92
2208I2%%%j%%%JJ%%%%%jJ%%%%%%%j%j%%%%JJj%%j%J%J%J%%jJ%jjJJ%jjj%JJ%J%%jjjj%%J%
$$ 92 92 92 92 91 91 91 91 92 93 93 93 93 93 93 92 93 93 93 93 93 93 93 93 92 92 91 91 91 91 91 92 93 92 92 92 91 91 92 92 93 93 94 94 94 93 94 94 93 92 93 94 94 93 92 91 91 92 93 93 94 94 94 93 92 91 90 90 90 91 91
2200I1%J%J%%%j%%%J%%jj%%JJ%j%%J%%%j%J%%jjJJ%j%J%%%jjj%JJ%%%%J%%%%jJ%J%%jJ%%%
$$ 91 91 92 92 93 93 93 93 92 92 92 92 93 93 93 92 91 91 91 92 93 93 92 92 92 93 93 93 93 92 92 93 93 93 92 91 92 93 93 92 92 93 93 93 93 92 91 90 90 91 92 92 92 92 92 93 93 93 93 93 92 93 93 94 94 94 93 94 94 94 94
2193I4jj%%%J%%j%j%%J%%J%JJ%%jjjj%%%%%%%J%%%%j%%%%J%%j%%J%%%j%jJ%J%%%%jJJ%%%%
$$ 94 93 92 92 92 92 93 93 93 92 92 91 91 91 92 92 92 93 93 94 95 95 95 94 93 92 91 91 91 91 91 91 91 91 92 92 92 92 92 91 91 91 91 91 92 92 92 91 91 91 92 92 92 92 91 91 90 91 91 92 92 92 92 92 91 92 93 93 93 93 93
2186I3%jj%%%%%%J%J%%jj%%J%%%%%%%j%%%%%%%%%%%%%J%jJJ%jjj%%J%%%%%J%%%%%%j%jj%J
$$ 93 93 92 91 91 91 91 91 91 91 92 92 93 93 93 92 91 91 91 92 92 92 92 92 92 92 92 91 91 91 91 91 91 91 91 91 91 91 91 91 91 92 92 91 92 93 93 92 91 90 90 90 91 91 91 91 91 91 92 92 92 92 92 92 92 91 91 90 89 89 90
2178I0JJ%JjjJ%%j%%%J%%%%%%%%%%J%j%%%%%%%%%Jjj%%%%%%j%%J%%%J%%j%%%JJ%%jj%%%%%
$$ 90 91 92 92 93 92 91 92 92 92 91 91 91 91 92 92 92 92 92 92 92 92 92 92 92 93 93 92 92 92 92 92 92 92 92 92 92 93 92 91 91 91 91 91 91 91 90 90 90 91 91 91 91 92 92 92 91 91 91 91 92 93 93 93 92 91 91 91 91 91 91
2171I1%%J%%j%%%%%%%J%%jjjjJ%%J%JJ%%j%%%%%J%%JJJjjJ%jjJ%JjjjJ%jj%%JJ%J%%%%%jJ
$$ 91 91 91 92 92 92 91 91 91 91 91 91 91 91 92 92 92 91 90 89 88 89 89 89 90 90 91 92 92 92 91 91 91 91 91 91 92 92 92 93 94 95 94 93 94 94 93 92 93 93 94 93 92 91 92 92 91 90 90 90 91 92 92 93 93 93 93 93 93 92 93
2163I3%%%%%%%j%%%%j%%Jjj%J%JJ%j%j%%%%j%%JJ%%jj%j%JJ%%%%%%%%jJ%%%%J%%j%%%%%%J
$$ 93 93 93 93 93 93 93 93 92 92 92 92 92 91 91 91 92 91 90 90 91 91 92 93 93 92 92 91 91 91 91 91 90 90 90 91 92 92 92 91 90 90 89 89 90 91 91 91 91 91 91 91 91 91 90 91 91 91 91 91 92 92 92 91 91 91 91 91 91 91 92
2156I2%%J%%%%%%%%%j%j%%%J%JJ%%%j%j%%%j%JJ%jj%J%%j%%%%J%%j%%j%%%J%J%%%%%%%%%J
$$ 92 92 92 93 93 93 93 93 93 93 93 93 93 92 92 91 91 91 91 92 92 93 94 94 94 94 93 93 92 92 92 92 91 91 92 93 93 92 91 91 92 92 92 91 91 91 91 91 92 92 92 91 91 91 90 90 90 90 91 91 92 92 92 92 92 92 92 92 92 92 93
2149I3jjjJJJ%Jj%j%j%JJj%%j%j%%%%JJj%%%jJ%%%j%%%j%J%%%%%%%%%%%J%%%%%%%Jj%jj%%
$$ 93 92 91 90 91 92 93 93 94 93 93 92 92 91 91 92 93 92 92 92 91 91 90 90 90 90 90 91 92 91 91 91 91 90 91 91 91 91 90 90 90 90 89 89 90 90 90 90 90 90 90 90 90 90 90 90 91 91 91 91 91 91 91 91 92 91 91 90 89 89 89
2141H9K%%Jj%%%j%%j%%JJ%jj%J%J%%J%%%j%j%%%%%J%J%j%%%%%%%%%%%j%J%%j%j%jJ%%J%%%
$$ 89 91 91 91 92 91 91 91 91 90 90 90 89 89 89 90 91 91 90 89 89 90 90 91 91 91 92 92 92 92 91 91 90 90 90 90 90 90 91 91 92 92 91 91 91 91 91 91 91 91 91 91 91 91 90 90 91 91 91 90 90 89 89 88 89 89 89 90 90 90 90
2134I0Jj%%%%J%%%%%%jJ%%%jJ%%jj%JJJJ%j%%Jj%%jJ%Jjj%%%%%jJJJjj%%%j%%%%%%%%J%%%
$$ 90 91 90 90 90 90 90 91 91 91 91 91 91 91 90 91 91 91 91 90 91 91 91 90 89 89 90 91 92 93 93 92 92 92 93 92 92 92 91 92 92 93 92 91 91 91 91 91 91 90 91 92 93 92 91 91 91 91 90 90 90 90 90 90 90 90 90 91 91 91 91
2126I1j%%J%%J%J%jj%J%%j%jJ%%jj%J%%j%%J%%J%%j%%%%%%JJJJ%%J%kjj%%%j%j%%JJ%j%%%
$$ 91 90 90 90 91 91 91 92 92 93 93 92 91 91 92 92 92 91 91 90 91 91 91 90 89 89 90 90 90 89 89 89 90 90 90 91 91 91 90 90 90 90 90 90 90 91 92 93 94 94 94 95 95 93 92 91 91 91 91 90 90 89 89 89 90 91 91 90 90 90 90
2119I0J%%%j%%%jj%JJ%JjJ%J%%j%%J%%JJJjjj%%%%%%j%J%%j%%%%j%%%%JJ%%%%%%kjjJ%jJ%
$$ 90 91 91 91 91 90 90 90 90 89 88 88 89 90 90 91 90 91 91 92 92 92 91 91 91 92 92 92 93 94 95 94 93 92 92 92 92 92 92 92 91 91 92 92 92 91 91 91 91 91 90 90 90 90 90 91 92 92 92 92 92 92 92 90 89 88 89 89 88 89 89
2111H9J%%jJJ%%%%j%%J%%%%%%%%%Jj%%J%Jjjj%JJj%%%j%%J%%J%%jj%%%%%%%J%jj%JJ%%%jj
$$ 89 90 90 90 89 90 91 91 91 91 91 90 90 90 91 91 91 91 91 91 91 91 91 91 92 91 91 91 92 92 93 92 91 90 90 91 92 91 91 91 91 90 90 90 91 91 91 92 92 92 91 90 90 90 90 90 90 90 90 91 91 90 89 89 90 91 91 91 91 90 89
2104H9JJ%%%JjJ%%j%jj%Jj%J%%j%JJ%J%%%%%j%%%%%%%j%%%%j%%JJ%%%%%j%J%%j%J%%%j%%%
$$ 89 90 91 91 91 91 92 91 92 92 92 91 91 90 89 89 90 89 89 90 90 90 89 89 90 91 91 92 92 92 92 92 92 91 91 91 91 91 91 91 91 90 90 90 90 90 89 89 89 90 91 91 91 91 91 91 90 90 91 91 91 90 90 91 91 91 91 90 90 90 90
2097I0%jJj%%%%JJJ%%j%%%%j%%J%jj%J%J%%%J%J%jjj%JjJJ%%j%jJ%%j%j%%J%JJ%JjjJ%J%j
$$ 90 90 89 90 89 89 89 89 89 90 91 92 92 92 91 91 91 91 91 90 90 90 91 91 90 89 89 90 90 91 91 91 91 92 92 93 93 92 91 90 90 91 90 91 92 92 92 91 91 90 91 91 91 90 90 89 89 89 90 90 91 92 92 93 92 91 92 92 93 93 92
2089I2%%%%j%%%%j%%%%%%j%%%%%J%%JJ%%j%%%%jJ%j%jJ%%%Jj%%%j%J%J%%%j%%%%%J%%j%j%
$$ 92 92 92 92 92 91 91 91 91 91 90 90 90 90 90 90 90 89 89 89 89 89 89 90 90 90 91 92 92 92 91 91 91 91 91 90 91 91 90 90 89 90 90 90 90 91 90 90 90 90 89 89 90 90 91 91 91 91 90 90 90 90 90 90 91 91 91 90 90 89 89
2082H9JJ%j%%%J%%jj%%%Jjj%K%j%%%J%%%J%Jj%%%%j%jJ%%%%%%%JJj%jjJ%%jJJJ%%%jjjjj%
$$ 89 90 91 91 90 90 90 90 91 91 91 90 89 89 89 89 90 89 88 88 90 90 89 89 89 89 90 90 90 90 91 91 92 91 91 91 91 91 90 90 89 90 90 90 90 90 90 90 90 91 92 91 91 90 89 90 90 90 89 90 91 92 92 92 92 91 90 89 88 87 87
2074H7KJ%J%Jj%%%%J%%j%jj%%%%J%%%%%%%%%%%%%%J%%%Jj%%j%%j%%%%%%J%JJj%j%J%j%%kJ
$$ 87 89 90 90 91 91 92 91 91 91 91 91 92 92 92 91 91 90 89 89 89 89 89 90 90 90 90 90 90 90 90 90 90 90 90 90 90 90 91 91 91 91 92 91 91 91 90 90 90 89 89 89 89 89 89 89 90 90 91 92 91 91 90 90 91 91 90 90 90 88 89
2067H9%%%%%JJ%%jJ%%%%jjJ%%%%%j%%%%J%%j%%%%%%%%%%%%%%JJ%jJ%J%j%%%J%jj%JJ%jJ%j
$$ 89 89 89 89 89 89 90 91 91 91 90 91 91 91 91 91 90 89 90 90 90 90 90 90 89 89 89 89 89 90 90 90 89 89 89 89 89 89 89 89 89 89 89 89 89 89 89 90 91 91 90 91 91 92 92 91 91 91 91 92 92 91 90 90 91 92 92 91 92 92 91
2060I1%JJ%%%jkj%K%%j%j%j%j%J%J%%%%%%jJ%%%%%%J%%Jj%jjJ%J%%%%%%%J%%%jjj%%J%Jj%
$$ 91 91 92 93 93 93 93 92 90 89 89 91 91 91 90 90 89 89 88 88 87 87 88 88 89 89 89 89 89 89 89 88 89 89 89 89 89 89 89 90 90 90 91 90 90 89 88 89 89 90 90 90 90 90 90 90 90 91 91 91 91 90 89 88 88 88 89 89 90 89 89
2052H9%%%%%%j%J%%%%%%%J%%jJJ%jjJ%%J%%%%j%%%%%Jj%j%%%%J%J%jj%J%%%%j%J%%JJ%jjj
$$ 89 89 89 89 89 89 89 88 88 89 89 89 89 89 89 89 89 90 90 90 89 90 91 91 90 89 90 90 90 91 91 91 91 91 90 90 90 90 90 90 91 90 90 89 89 89 89 89 90 90 91 91 90 89 89 90 90 90 90 90 89 89 90 90 90 91 92 92 91 90 89
2045H9J%%%%%%J%%%%%%%%j%%%%J%j%%%%%%%J%j%j%Jj%%Jj%%%J%%%%%%%%jj%%%%%JJJ%%jj%
$$ 89 90 90 90 90 90 90 90 91 91 91 91 91 91 91 91 91 90 90 90 90 90 91 91 90 90 90 90 90 90 90 90 91 91 90 90 89 89 90 89 89 89 90 89 89 89 89 90 90 90 90 90 90 90 90 90 89 88 88 88 88 88 88 89 90 91 91 91 90 89 89
2037H9JJj%%j%%JjJ%j%%j%%%%%Jj%JJ%j%J%Jj%%%%Jj%j%%%J%%j%%%%j%%%%J%J%%%%jJ%j%%
$$ 89 90 91 90 90 90 89 89 89 90 89 90 90 89 89 89 88 88 88 88 88 88 89 88 88 89 90 90 89 89 90 90 91 90 90 90 90 90 91 90 90 89 89 89 89 90 90 90 89 89 89 89 89 88 88 88 88 88 89 89 90 90 90 90 90 89 90 90 89 89 89
2030H9%%%%%%J%JJ%jj%%JjjJ%%%jJJj%j%%%%%%%%%%%J%Jjj%j%%JJ%%%%%j%jJ%%%%J%%%%%J
$$ 89 89 89 89 89 89 89 90 90 91 92 92 91 90 90 90 91 90 89 90 90 90 90 89 90 91 90 90 89 89 89 89 89 89 89 89 89 89 89 89 90 90 91 90 89 89 88 88 88 89 90 90 90 90 90 90 89 89 88 89 89 89 89 89 90 90 90 90 90 90 91
2022I1j%%%%%j%%%%%%%%J%%%%%J%%%j%jjJJjjJ%Jj%%J%%%%jjJ%J%j%%JJ%Jj%%j%%J%%j%%%
$$ 91 90 90 90 90 90 90 89 89 89 89 89 89 89 89 89 90 90 90 90 90 90 91 91 91 91 90 90 89 88 89 90 89 88 89 89 90 89 89 89 90 90 90 90 90 89 88 89 89 90 90 89 89 89 90 91 91 92 91 91 91 90 90 90 91 91 91 90 90 90 90
2015I0%j%J%%j%j%J%%J%J%j%j%j%J%jJ%%jjjJJJJJjj%%%%%%j%jJ%J%J%j%%%J%%%%%j%%jJ%
$$ 90 90 89 89 90 90 90 89 89 88 88 89 89 89 90 90 91 91 90 90 89 89 88 88 89 89 88 89 89 89 88 87 86 87 88 89 90 91 90 89 89 89 89 89 89 89 88 88 87 88 88 89 89 90 90 89 89 89 89 90 90 90 90 90 90 89 89 89 88 89 89
2008H9%%j%J%JJ%%%%%j%%%J%jj%%JJ%j%%%Jj%J%%%j%%J%%j%j%J%jj%J%%j%J%j%j%%K%J%%%
$$ 89 89 89 88 88 89 89 90 91 91 91 91 91 91 90 90 90 90 91 91 90 89 89 89 90 91 91 90 90 90 90 91 90 90 91 91 91 91 90 90 90 91 91 91 90 90 89 89 90 90 89 88 88 89 89 89 88 88 89 89 88 88 87 87 87 89 89 90 90 90 90
2000I0%%%%%%%%j%%J%jJJ%%%j%%%%j%%%jJ%J%J%%%%%%j%JjJ%j%%j%%%%%%%%%J%%%jj%J%J%
$$ 90 90 90 90 90 90 90 90 90 89 89 89 90 90 89 90 91 91 91 91 90 90 90 90 90 89 89 89 89 88 89 89 90 90 91 91 91 91 91 91 91 90 90 91 90 91 91 90 90 90 89 89 89 89 89 89 89 89 89 89 90 90 90 90 89 88 88 89 89 90 90
1993I0%%j%%%%%%%J%j%%J%jj%%J%J%%%J%j%%%jJ%J%%%%%jj%%%JJ%%%jj%j%J%J%%%%JJj%%%
$$ 90 90 90 89 89 89 89 89 89 89 89 90 90 89 89 89 90 90 89 88 88 88 89 89 90 90 90 90 91 91 90 90 90 90 89 90 90 91 91 91 91 91 91 90 89 89 89 89 90 91 91 91 91 90 89 89 88 88 89 89 90 90 90 90 90 91 92 91 91 91 91
1985I1%%%%j%%Jjj%%%%%%%%%%%jJJ%j%%J%%%Jk%%%Jj%%%%%%jkJ%%%JJ%%%%%%jj%%jJK%J%%
$$ 91 91 91 91 91 90 90 90 91 90 89 89 89 89 89 89 89 89 89 89 89 89 88 89 90 90 89 89 89 90 90 90 90 91 89 89 89 89 90 89 89 89 89 89 89 89 88 86 87 87 87 87 88 89 89 89 89 89 89 89 88 87 87 87 86 87 89 89 90 90 90
1978I0j%%%%%%%%%%%%%%j%%JJ%%%%J%%j%%%%%J%%%j%%%J%j%%j%%Jj%j%%J%%%%j%%%%%%%%%
$$ 90 89 89 89 89 89 89 89 89 89 89 89 89 89 89 89 88 88 88 89 90 90 90 90 90 91 91 91 90 90 90 90 90 90 91 91 91 91 90 90 90 90 91 91 90 90 90 89 89 89 90 89 89 88 88 88 89 89 89 89 89 88 88 88 88 88 88 88 88 88 88
1971H8%%%%%J%%J%j%%%J%jj%%j%%JJ%jjJJ%%%j%J%%%%%%%j%%%JJ%%%j%%%%%%%%%%%%%%jj%
$$ 88 88 88 88 88 88 89 89 89 90 90 89 89 89 89 90 90 89 88 88 88 87 87 87 88 89 89 88 87 88 89 89 89 89 88 88 89 89 89 89 89 89 89 89 88 88 88 88 89 90 90 90 90 89 89 89 89 89 89 89 89 89 89 89 89 89 89 89 88 87 87
1963H7J%JJj%%jjJ%%%JJ%%J%Jj%j%%%J%j%j%%j%%j%J%%%j%J%JJ%j%%%j%%%%J%j%%%J%%%%%
$$ 87 88 88 89 90 89 89 89 88 87 88 88 88 88 89 90 90 90 91 91 92 91 91 90 90 90 90 91 91 90 90 89 89 89 88 88 88 87 87 88 88 88 88 87 87 88 88 89 90 90 89 89 89 89 88 88 88 88 88 89 89 88 88 88 88 89 89 89 89 89 89
1956H9j%%%%%j%%JJJ%jjJ%%%%jjj%%%J%%JJ%j%j%JJ%%j%%jj%%KJ%%jj%JJK%%j%jJ%%J%%J%
$$ 89 88 88 88 88 88 88 87 87 87 88 89 90 90 89 88 89 89 89 89 89 88 87 86 86 86 86 87 87 87 88 89 89 88 88 87 87 88 89 89 89 88 88 88 87 86 86 86 88 89 89 89 88 87 87 88 89 91 91 91 90 90 89 90 90 90 91 91 91 92 92
1948I2jjjj%JK%j%jj%%j%%J%J%%J%%%%%%jjjJ%%%%%%%%J%J%j%%%%%%Jjj%J%j%%%%%%Jj%%%
$$ 92 91 90 89 88 88 89 91 91 90 90 89 88 88 88 87 87 87 88 88 89 89 89 90 90 90 90 90 90 90 89 88 87 88 88 88 88 88 88 88 88 88 89 89 90 90 89 89 89 89 89 89 89 90 89 88 88 89 89 88 88 88 88 88 88 88 89 88 88 88 88
1941H8%Jj%%%%%%JJ%%%J%jjj%%J%J%JJjjjj%%%%%JJj%%%j%j%J%j%JJJj%j%%%JJ%jj%%%%j%
$$ 88 88 89 88 88 88 88 88 88 88 89 90 90 90 90 91 91 90 89 88 88 88 89 89 90 90 91 92 91 90 89 88 88 88 88 88 88 89 90 89 89 89 89 88 88 87 87 88 88 87 87 88 89 90 89 89 88 88 88 88 89 90 90 89 88 88 88 88 88 87 87
1933H7JJ%%%%%%%Jj%%%%jj%JJ%jj%%J%%%%%%j%J%%J%%%J%jj%%j%%%%j%J%%%%j%%JJJJ%%%%
$$ 87 88 89 89 89 89 89 89 89 89 90 89 89 89 89 89 88 87 87 88 89 89 88 87 87 87 88 88 88 88 88 88 88 87 87 88 88 88 89 89 89 89 90 90 89 88 88 88 87 87 87 87 87 86 86 87 87 87 87 87 86 86 86 87 88 89 90 90 90 90 90
1926I0j%%%%%%J%j%jJJ%jj%J%%%%%%%J%j%J%%j%%%%%%%%%%j%%jj%%%J%jJJ%%J%%%%%%%j%%
$$ 90 89 89 89 89 89 89 89 90 90 89 89 88 89 90 90 89 88 88 89 89 89 89 89 89 89 89 90 90 89 89 90 90 90 89 89 89 89 89 89 89 89 89 89 89 88 88 88 87 86 86 86 86 87 87 86 87 88 88 88 89 89 89 89 89 89 89 89 88 88 88
1919H8jjJ%J%%%j%%%%%%%%J%%%%J%K%kJ%j%%j%%%%%J%%%j%%%j%J%J%%%jj%J%%j%%%%%%%%%
$$ 88 87 86 87 87 88 88 88 88 87 87 87 87 87 87 87 87 87 88 88 88 88 88 89 89 91 91 89 90 90 89 89 89 88 88 88 88 88 88 89 89 89 89 88 88 88 88 87 87 88 88 89 89 89 89 88 87 87 88 88 88 87 87 87 87 87 87 87 87 87 87
1911H7KJj%jj%jJ%%%%%%%J%%J%Jj%%j%%J%%%%%%%%%%%%%j%j%JJJjjj%%J%%Jj%%j%%J%%J%%
$$ 87 89 90 89 89 88 87 87 86 87 87 87 87 87 87 87 87 88 88 88 89 89 90 89 89 89 88 88 88 89 89 89 89 89 89 89 89 89 89 89 89 89 89 88 88 87 87 88 89 90 89 88 87 87 87 88 88 88 89 88 88 88 87 87 87 88 88 88 89 89 89
1904H9%j%%%J%J%%%jj%%%j%%J%Jj%%J%%%j%%%j%j%JJJJj%j%%%%j%jJ%%JJJJ%jk%J%%%%%%%
$$ 89 89 88 88 88 88 89 89 90 90 90 90 89 88 88 88 88 87 87 87 88 88 89 88 88 88 89 89 89 89 88 88 88 88 87 87 86 86 87 88 89 90 89 89 88 88 88 88 88 87 87 86 87 87 87 88 89 90 91 91 90 88 88 89 89 89 89 89 89 89 89
1896H9j%j%J%%jjj%J%%J%Jj%j%%J%J%J%%%%%%%%%%%j%%%J%j%%j%%%%%%j%JJ%%%%j%%%%%J%
$$ 89 88 88 87 87 88 88 88 87 86 85 85 86 86 86 87 87 88 87 87 86 86 86 87 87 88 88 89 89 89 89 89 89 89 89 89 89 89 89 88 88 88 88 89 89 88 88 88 87 87 87 87 87 87 87 86 86 87 88 88 88 88 88 87 87 87 87 87 87 88 88
1889H8jj%%J%jJJ%%%%%%%%J%%jj%%J%J%%j%%%J%%%j%%%%j%%%%%%J%Jjj%j%J%%Jj%jJJ%%J%
$$ 88 87 86 86 86 87 87 86 87 88 88 88 88 88 88 88 88 88 89 89 89 88 87 87 87 88 88 89 89 89 88 88 88 88 89 89 89 89 88 88 88 88 88 87 87 87 87 87 87 87 88 88 89 88 87 87 86 86 87 87 87 88 87 87 86 87 88 88 88 89 89
1881H9j%%%%%%%%%j%%JJj%J%%%j%j%%JJ%%J%jJ%jj%%%Jj%%%%%j%j%%J%%J%J%jj%jjJ%%J%J
$$ 89 88 88 88 88 88 88 88 88 88 88 87 87 87 88 89 88 88 89 89 89 89 88 88 87 87 87 88 89 89 89 90 90 89 90 90 89 88 88 88 88 89 88 88 88 88 88 88 87 87 86 86 86 87 87 87 88 88 89 89 88 87 87 86 85 86 86 86 87 87 88
1874H8j%%J%J%J%%J%%j%%%jj%%%%jj%%%%%JJ%%%%j%j%%J%J%j%%%%JJ%j%%j%%%JJj%%%%%%%
$$ 88 87 87 87 88 88 89 89 90 90 90 91 91 91 90 90 90 90 89 88 88 88 88 88 87 86 86 86 86 86 86 87 88 88 88 88 88 87 87 86 86 86 87 87 88 88 87 87 87 87 87 88 89 89 88 88 88 87 87 87 87 88 89 88 88 88 88 88 88 88 88
1867H8Jj%%%J%jj%%%%jJ%%jJ%%%%%j%k%J%%%%%%%j%J%%%%%%%K%j%%%J%%%%J%jj%%J%J%jjJ
$$ 88 89 88 88 88 88 89 89 88 87 87 87 87 87 86 87 87 87 86 87 87 87 87 87 87 86 86 84 84 85 85 85 85 85 85 85 85 84 84 85 85 85 85 85 85 85 85 87 87 86 86 86 86 87 87 87 87 87 88 88 87 86 86 86 87 87 88 88 87 86 87
1859H7%%%J%%j%J%KJJ%j%jj%%%Jj%j%%%JJjj%%JJJ%jj%Jj%j%%jJ%%%%J%%%jjjJ%%%J%%%j%
$$ 87 87 87 87 88 88 88 87 87 88 88 90 91 92 92 91 91 90 89 89 89 89 90 89 89 88 88 88 88 89 90 89 88 88 88 89 90 91 91 90 89 89 90 89 89 88 88 88 87 88 88 88 88 88 89 89 89 89 88 87 86 87 87 87 87 88 88 88 88 87 87
1852H7%%j%J%%%%%%j%jJ%%J%%%JJ%jj%%%%%J%%%%jJj%JJ%J%%jj%jj%JJ%%j%%%%%%%%%%%j%
$$ 87 87 87 86 86 87 87 87 87 87 87 87 86 86 85 86 86 86 87 87 87 87 88 89 89 88 87 87 87 87 87 87 88 88 88 88 88 87 88 87 87 88 89 89 90 90 90 89 88 88 87 86 86 87 88 88 88 87 87 87 87 87 87 87 87 87 87 87 87 86 86
1844H6%JJ%J%%j%%%%J%%j%%%%j%JJ%k%%J%%%J%j%jj%%%J%%%%%%%Jj%%jJ%J%%%%%J%jjJ%%%
$$ 86 86 87 88 88 89 89 89 88 88 88 88 88 89 89 89 88 88 88 88 88 87 87 88 89 89 87 87 87 88 88 88 88 89 89 88 88 87 86 86 86 86 87 87 87 87 87 87 87 87 88 87 87 87 86 87 87 88 88 88 88 88 88 89 89 88 87 88 88 88 88
1837H8%j%%%%%%%%JJJjjjj%J%%j%%%%J%JJ%%%%%%j%%%j%%Jj%jjJJ%%j%%%%Jj%%%%J%%%%J%
$$ 88 88 87 87 87 87 87 87 87 87 87 88 89 90 89 88 87 86 86 87 87 87 86 86 86 86 86 87 87 88 89 89 89 89 89 89 89 88 88 88 88 87 87 87 88 87 87 86 85 86 87 87 87 86 86 86 86 86 87 86 86 86 86 86 87 87 87 87 87 88 88
1830H8%%j%%J%j%%%%J%j%%KJ%%jj%j%%%%%%J%%j%%%%J%%%j%j%%%%%JJj%J%%%%j%J%%%%%%%
$$ 88 88 88 87 87 87 88 88 87 87 87 87 87 88 88 87 87 87 89 90 90 90 89 88 88 87 87 87 87 87 87 87 88 88 88 87 87 87 87 87 88 88 88 88 87 87 86 86 86 86 86 86 87 88 87 87 88 88 88 88 88 87 87 88 88 88 88 88 88 88 88
1822H8j%%%JJ%%%%%%%%%j%j%%%%%J%jj%JJ%j%%Kj%J%Jjj%%%%%%j%%%J%%%%%%%%%%%%%JJj%
$$ 88 87 87 87 87 88 89 89 89 89 89 89 89 89 89 89 88 88 87 87 87 87 87 87 88 88 87 86 86 87 88 88 87 87 87 89 88 88 89 89 90 89 88 88 88 88 88 88 88 87 87 87 87 88 88 88 88 88 88 88 88 88 88 88 88 88 88 89 90 89 89
1815H9j%%j%%%JJJj%%j%%%j%J%Jj%%%%K%%jjjj%%JJ%%%jJ%%J%%%%JJ%j%jj%jj%%%%%J%J%%
$$ 89 88 88 88 87 87 87 87 88 89 90 89 89 89 88 88 88 88 87 87 88 88 89 88 88 88 88 88 90 90 90 89 88 87 86 86 86 87 88 88 88 88 87 88 88 88 89 89 89 89 89 90 91 91 90 90 89 88 88 87 86 86 86 86 86 86 87 87 88 88 88
1807H8%%JjjjJJ%%j%Jjj%JJ%J%%j%%Jj%J%%%%%%%%%%%%j%j%%%%J%%J%J%%j%%%j%%%%%%j%J
$$ 88 88 88 89 88 87 86 87 88 88 88 87 87 88 87 86 86 87 88 88 89 89 89 88 88 88 89 88 88 89 89 89 89 89 89 89 89 89 89 89 89 89 88 88 87 87 87 87 87 88 88 88 89 89 90 90 90 89 89 89 89 88 88 88 88 88 88 88 87 87 88
1800H8%%%jJ%%%jJ%%%J%%%%J%%%j%j%j%%JK%j%jJ%%%%%%%J%j%%J%%j%J%%%Jj%j%%%j%%J%j
$$ 88 88 88 88 87 88 88 88 88 87 88 88 88 88 89 89 89 89 89 90 90 90 90 89 89 88 88 87 87 87 88 90 90 89 89 88 89 89 89 89 89 89 89 89 90 90 89 89 89 90 90 90 89 89 90 90 90 90 91 90 90 89 89 89 89 88 88 88 89 89 88
1792H8%%%%%%%%%%%jJ%J%%%%%%%%%%%%%%%%%%%%%JJjjjj%%JJJ%%j%%%J%Jj%jJJ%%%j%%%%%
$$ 88 88 88 88 88 88 88 88 88 88 88 88 87 88 88 89 89 89 89 89 89 89 89 89 89 89 89 89 89 89 89 89 89 89 89 89 89 90 91 90 89 88 87 87 87 88 89 90 90 90 89 89 89 89 90 90 91 90 90 89 90 91 91 91 91 90 90 90 90 90 90
1785I0jjj%%%J%%jJJj%%J%%%%%%J%%%%jJJ%%%%%%j%%j%J%%J%%%%jj%j%%jJJ%%%jJJ%%JJ%j
$$ 90 89 88 87 87 87 87 88 88 88 87 88 89 88 88 88 89 89 89 89 89 89 89 90 90 90 90 90 89 90 91 91 91 91 91 91 91 90 90 90 89 89 90 90 90 91 91 91 91 91 90 89 89 88 88 88 87 88 89 89 89 89 88 89 90 90 90 91 92 92 91
1778I1j%%%JJ%%%jJ%J%j%%%Jjj%J%%j%j%%%%%%j%%%%JJ%J%J%jj%%%J%%%J%%j%j%%j%%%%%J
$$ 91 90 90 90 90 91 92 92 92 92 91 92 92 93 93 92 92 92 92 93 92 91 91 92 92 92 91 91 90 90 90 90 90 90 90 89 89 89 89 89 90 91 91 92 92 93 93 92 91 91 91 91 92 92 92 92 93 93 93 92 92 91 91 91 90 90 90 90 90 90 91
1770I1%%J%%J%J%jj%%%%J%%%%%%%%%%%%%%%%%%%%%%%j%J%j%%%JJ%%%jj%%%%J%%%%%%%%Jj%
$$ 91 91 91 92 92 92 93 93 94 94 93 92 92 92 92 92 93 93 93 93 93 93 93 93 93 93 93 93 93 93 93 93 93 93 93 93 93 93 93 93 92 92 93 93 92 92 92 92 93 94 94 94 94 93 92 92 92 92 92 93 93 93 93 93 93 93 93 93 94 93 93
1763I3%%%%%%J%%%%Jjj%%%j%%%J%jJJ%J%j%JJ%%%jjJ%JJkj%%%JJJkjj%%J%Jj%%%%%j%%JJ%
$$ 93 93 93 93 93 93 93 94 94 94 94 94 95 94 93 93 93 93 92 92 92 92 93 93 92 93 94 94 95 95 94 94 95 96 96 96 96 95 94 95 95 96 97 95 94 94 94 94 95 96 97 95 94 93 93 93 94 94 95 94 94 94 94 94 94 93 93 93 94 95 95
1755I5%%j%%J%%%%JJjj%%J%j%%%Jj%%JJj%%%%%%J%%%j%%%j%J%%%j%JJj%%%%jJ%J%%%%%%j%
$$ 95 95 95 94 94 94 95 95 95 95 95 96 97 96 95 95 95 96 96 95 95 95 95 96 95 95 95 96 97 96 96 96 96 96 96 96 97 97 97 97 96 96 96 96 95 95 96 96 96 96 95 95 96 97 96 96 96 96 96 95 96 96 97 97 97 97 97 97 97 96 96
1748I6%j%J%%%%j%%%%%J%J%%%%jj%%J%%%%%J%%%%J%%%jjj%j%%%%KJ%JJj%%j%%J%jJ%J%%J%
$$ 96 96 95 95 96 96 96 96 96 95 95 95 95 95 95 96 96 97 97 97 97 97 96 95 95 95 96 96 96 96 96 96 97 97 97 97 97 98 98 98 98 97 96 95 95 94 94 94 94 94 96 97 97 98 99 98 98 98 97 97 97 98 98 97 98 98 99 99 99 100 100
1741A00%%JjJjjj%%jJ%%%J%JJJ%j%j%%%%%%%JJ%%%%%J%j%%%%%%%%J%%%%J%%%j%JJ%%j%J%%
$$ 100 100 100 101 100 101 100 99 98 98 98 97 98 98 98 98 99 99 100 101 102 102 101 101 100 100 100 100 100 100 100 100 101 102 102 102 102 102 102 103 103 102 102 102 102 102 102 102 102 102 103 103 103 103 103 104 104 104 104 103 103 104 105 105 105 104 104 105 105 105
1733A05%jj%J%%J%%%J%%Jj%%%JJJ%%%%J%Jj%%%j%%J%%%%JjJ%J%JJ%j%J%%%%%J%Jj%J%JJJJ
$$ 105 105 104 103 103 104 104 104 105 105 105 105 106 106 106 107 106 106 106 106 107 108 109 109 109 109 109 110 110 111 110 110 110 110 109 109 109 110 110 110 110 110 111 110 111 111 112 112 113 114 114 113 113 114 114 114 114 114 114 115 115 116 115 115 116 116 117 118 119 120
1726A20%%j%%J%JJ%JKJJ%jj%%J%JJ%%%J%%J%%JK%%%J%jJJ%K%%%JJJ%%J%JJJJK%JJJ%%%JKJ
$$ 120 120 120 119 119 119 120 120 121 122 122 123 125 126 127 127 126 125 125 125 126 126 127 128 128 128 128 129 129 129 130 130 130 131 133 133 133 133 134 134 133 134 135 135 137 137 137 137 138 139 140 140 140 141 141 142 143 144 145 147 147 148 149 150 150 150 150 151 153 154
1719A54JJJJ%JKJJJ%JKKJJ%J%KKJKJKJJKJKKKKKKK%J%JKJJJKJJLLLLJJKLKKKKLLKLLKLLKL
$$ 154 155 156 157 158 158 159 161 162 163 164 164 165 167 169 170 171 171 172 172 174 176 177 179 180 182 183 184 186 187 189 191 193 195 197 199 201 201 202 202 203 205 206 207 208 210 211 212 215 218 221 224 225 226 228 231 233 235 237 239 242 245 247 250 253 255 258 261 263 266
1711B66LLLLKKMMLMKLLLLKLLMNMLMLLMMMMMLLMLLLLLLLLMNLLLLKLMMMLMKLLLLMMKLKLLKLK
$$ 266 269 272 275 278 280 282 286 290 293 297 299 302 305 308 311 313 316 319 323 328 332 335 339 342 345 349 353 357 361 365 368 371 375 378 381 384 387 390 393 396 399 403 408 411 414 417 420 422 425 429 433 437 440 444 446 449 452 455 458 462 466 468 471 473 476 479 481 484 486
1704D86KMLKKLKKLKLKKLKKKKKKJLLJKKKJJKKKKKKJJJJKKLLJJJ%KKJKJJJJKJKJJJK%%JJJKJ
$$ 486 488 492 495 497 499 502 504 506 509 511 514 516 518 521 523 525 527 529 531 533 534 537 540 541 543 545 547 548 549 551 553 555 557 559 561 562 563 564 565 567 569 572 575 576 577 578 578 580 582 583 585 586 587 588 589 591 592 594 595 596 597 599 599 599 600 601 602 604 605
1697F05JJ%JJ%K%JJJJ%JJJJJ%J%Jj%%%JK%%J%%jJJ%J%j%jj%JJ%%jj%%%Jjjjk%jj%%%jjjk%
$$ 605 606 607 607 608 609 609 611 611 612 613 614 615 615 616 617 618 619 620 620 621 621 622 621 621 621 621 622 624 624 624 625 625 625 624 625 626 626 627 627 626 626 625 624 624 625 626 626 626 625 624 624 624 624 625 624 623 622 620 620 619 618 618 618 618 617 616 615 613 613
1689F13j%jj%jkjjkkjjjjkkkkkjklkkjjkklkkklkklmllmklkllmklllmmmmmllkmnmlmmlmml
$$ 613 612 612 611 610 610 609 607 606 605 603 601 600 599 598 597 595 593 591 589 587 586 584 581 579 577 576 575 573 571 568 566 564 562 559 557 555 552 548 545 542 538 536 533 531 528 525 521 519 516 513 510 506 502 498 494 490 487 484 482 478 473 469 466 462 458 455 451 447 444
1682D44llmllmmlllllmmlmkkmmnllkklmllllkkjkllllkllklkklkkkkkkjjklkjjlklkjjkjj
$$ 444 441 438 434 431 428 424 420 417 414 411 408 405 401 397 394 390 388 386 382 378 373 370 367 365 363 360 356 353 350 347 344 342 340 339 337 334 331 328 325 323 320 317 315 312 310 308 305 303 301 299 297 295 293 292 291 289 286 284 283 282 279 277 274 272 271 270 268 267 266
1675B66j%jkjkjkjjkjjkjjjkkjjj%jkjjj%jjjjjk%j%jj%%jj%jj%%%jjjj%jj%jjkjj%j%j%%
$$ 266 265 265 264 262 261 259 258 256 255 254 252 251 250 248 247 246 245 243 241 240 239 238 238 237 235 234 233 232 232 231 230 229 228 227 225 225 224 224 223 222 222 222 221 220 220 219 218 218 218 218 217 216 215 214 214 213 212 212 211 210 208 207 206 206 205 205 204 204 204
1667B04%%%%kjj%%j%%%j%jj%%j%%jjj%j%%jJ%j%%%%%jJJ%j%%%jj%%%J%jjj%%j%%%%%%%%%J
$$ 204 204 204 204 204 202 201 200 200 200 199 199 199 199 198 198 197 196 196 196 195 195 195 194 193 192 192 191 191 191 190 191 191 190 190 190 190 190 190 189 190 191 191 190 190 190 190 189 188 188 188 188 189 189 188 187 186 186 186 185 185 185 185 185 185 185 185 185 185 186
1660A86j%j%%J%%jj%jj%J%J%%%%J%jj%J%J%%%J%%%Jj%%%%J%J%%J%%%%j%J%%%J%j%%%%%%jJ
$$ 186 185 185 184 184 184 185 185 185 184 183 183 182 181 181 182 182 183 183 183 183 183 184 184 183 182 182 183 183 184 184 184 184 185 185 185 185 186 185 185 185 185 185 186 186 187 187 187 188 188 188 188 188 187 187 188 188 188 188 189 189 188 188 188 188 188 188 188 187 188
1653A88JJ%JJJ%JJ%%%JJJJJJKKKKLKKMMMMLLJklmmlkjj%%J%JJKJ%JJ%J%J%JJKKKKLKLLJJJ
$$ 188 189 190 190 191 192 193 193 194 195 195 195 195 196 197 198 199 200 201 203 205 207 209 212 214 216 220 224 228 232 235 238 239 237 234 230 226 223 221 220 219 219 219 220 220 221 222 224 225 225 226 227 227 228 228 229 229 230 231 233 235 237 239 242 244 247 250 251 252 253
1646B53JJJJJKKJKKKKKJKKLLLKJKLKKLKKKKKLKKKKKKKKL%JLKLKJJJJLKKKKLKKLLLLLLMLML
$$ 253 254 255 256 257 258 260 262 263 265 267 269 271 273 274 276 278 281 284 287 289 290 292 295 297 299 302 304 306 308 310 312 315 317 319 321 323 325 327 329 331 334 334 335 338 340 343 345 346 347 348 349 352 354 356 358 360 363 365 367 370 373 376 379 382 385 389 392 396 399
1638C99KLLLKJJLLNMMMMMLNMNMONNNNNNOONONNNNNNMONNNNNNMMNMMMMNMMLMMNMMMNMONNON
$$ 399 401 404 407 410 412 413 414 417 420 425 429 433 437 441 445 448 453 457 462 466 472 477 482 487 492 497 502 508 514 519 525 530 535 540 545 550 555 559 565 570 575 580 585 590 595 599 603 608 612 616 620 624 629 633 637 640 644 648 653 657 661 665 670 674 680 685 690 696 701
1631G01ONMMLLLMMNNNMNNNNNMMMNNNNNNNMNOMMNMNMNNNMNNNNMMOONNOONNOOOOPPQPQPPQPQ
$$ 701 707 712 716 720 723 726 729 733 737 742 747 752 756 761 766 771 776 781 785 789 793 798 803 808 813 818 823 828 832 837 843 847 851 856 860 865 869 874 879 884 888 893 898 903 908 912 916 922 928 933 938 944 950 955 960 966 972 978 984 991 998 1006 1013 1021 1028 1035 1043 1050 1058
1624A058QQPPRRRQQQPQQQQPPPOPPPONNONMLKLLLLJK%JJJJJ%J%%%J%JKKJJKJLLNMMMNMOOOQ
$$ 1058 1066 1074 1081 1088 1097 1106 1115 1123 1131 1139 1146 1154 1162 1170 1178 1185 1192 1199 1205 1212 1219 1226 1232 1237 1242 1248 1253 1257 1260 1262 1265 1268 1271 1274 1275 1277 1277 1278 1279 1280 1281 1282 1282 1283 1283 1283 1283 1284 1284 1285 1287 1289 1290 1291 1293 1294 1297 1300 1305 1309 1313 1317 1322 1326 1332 1338 1344 1352
1616A352QQQRQQJ1J0J0J1J0J1J0J1J0J1J0J1J1J1J1J1J0RRJ0QQQQQPPONMMNNLLKLKKJJJJK
$$ 1352 1360 1368 1376 1385 1393 1401 1412 1422 1432 1443 1453 1464 1474 1485 1495 1506 1516 1527 1538 1549 1560 1571 1581 1590 1599 1609 1617 1625 1633 1641 1649 1656 1663 1669 1674 1678 1682 1687 1692 1695 1698 1700 1703 1705 1707 1708 1709 1710 1711 1713
1611A713%%J%%jJ%%j%%%j%jj%j%j%kkjjjjkjjjkkjk%jjjjk%%j%jjj%jjj%j%kkjjkjklmllm
$$ 1713 1713 1713 1714 1714 1714 1713 1714 1714 1714 1713 1713 1713 1713 1712 1712 1711 1710 1710 1709 1709 1708 1708 1706 1704 1703 1702 1701 1700 1698 1697 1696 1695 1693 1691 1690 1688 1688 1687 1686 1685 1684 1682 1682 1682 1681 1681 1680 1679 1678 1678 1677 1676 1675 1675 1674 1674 1672 1670 1669 1668 1666 1665 1663 1660 1656 1653 1650 1646
1604A646nnnnooppppqqrrj0rj1j1j2j1j2j1j1j2j2j3j2j1j2j2j1j1j1j1j3j3j1j2j0j1j0j0
$$ 1646 1641 1636 1631 1626 1620 1614 1607 1600 1593 1586 1578 1570 1561 1552 1542 1533 1522 1511 1499 1488 1476 1465 1454 1442 1430 1417 1405 1394 1382 1370 1359 1348 1337 1326 1313 1300 1289 1277 1267 1256 1246 1236
1599A236rqj0j0rrrqqqqqppqqpqqqpppqrqrrqrqqqqrrrj0rj0rrj0rrj0qqqqqqrrpqppoppp
$$ 1236 1227 1219 1209 1199 1190 1181 1172 1164 1156 1148 1140 1132 1125 1118 1110 1102 1095 1087 1079 1071 1064 1057 1050 1042 1033 1025 1016 1007 999 990 982 974 966 958 949 940 931 921 912 902 893 884 874 865 856 846 838 830 822 814 806 798 789 780 773 765 758 751 745 738 731 724
1593G24poooononnnnmllljJKLLjj0j4j4j2rrpqoooononnnoononnnnnmnonnmnmnmnlmnmnnm
$$ 724 717 711 705 699 693 688 682 677 672 667 662 658 655 652 649 648 649 651 654 657 656 646 632 618 606 597 588 581 573 567 561 555 549 544 538 533 528 523 517 511 506 500 495 490 485 480 475 471 466 460 455 450 446 441 437 432 428 423 420 416 411 407 402 397 393
1586C93nllmlmlmmlmmmlmmmllkkmllmklllllmlllkllklklkllklklkkkkkjjkkkjkkkjjjkl%
$$ 393 388 385 382 378 375 371 368 364 360 357 353 349 345 342 338 334 330 327 324 322 320 316 313 310 306 304 301 298 295 292 289 285 282 279 276 274 271 268 266 263 261 258 256 253 250 248 245 243 240 238 236 234 232 230 229 228 226 224 222 221 219 217 215 214 213 212 210 207 207
1579B07jjkkkkj%%jjjj%kjjj%jjk%j%%%jjjj%%%kkj%%%%j%j%%%%j%jj%%jk%%j%%%jjj%%%%
$$ 207 206 205 203 201 199 197 196 196 196 195 194 193 192 192 190 189 188 187 187 186 185 183 183 182 182 182 182 181 180 179 178 178 178 178 176 174 173 173 173 173 173 172 172 171 171 171 171 171 170 170 169 168 168 168 167 165 165 165 164 164 164 164 163 162 161 161 161 161 161
1571A61%%jj%%j%%j%%J%%jjjjJ%jjj%jj%%JJJ%%jj%%jJ%jj%j%%JJjj%j%%%%%jJ%J%%%j%%%
$$ 161 161 161 160 159 159 159 158 158 158 157 157 157 158 158 158 157 156 155 154 155 155 154 153 152 152 151 150 150 150 151 152 153 153 153 152 151 151 151 150 151 151 150 149 149 148 148 148 149 150 149 148 148 147 147 147 147 147 147 146 147 147 148 148 148 148 147 147 147 147
1564A47%%%%%%j%j%jJ%j%j%%J%%J%%%%%%j%%%%%%%%%%%%j%%%%%J%J%%%%%%j%%%%%jjjJ%J%
$$ 147 147 147 147 147 147 147 146 146 145 145 144 145 145 144 144 143 143 143 144 144 144 145 145 145 145 145 145 145 144 144 144 144 144 144 144 144 144 144 144 144 144 143 143 143 143 143 143 144 144 145 145 145 145 145 145 145 144 144 144 144 144 144 143 142 141 142 142 143 143
1557A43j%J%%%%%JJJ%j%%%%%j%J%%%Jjk%J%JJ%Jj%j%jjJ%%%%%%JJJ%%J%%JJJJ%%jj%j%%%j
$$ 143 142 142 143 143 143 143 143 143 144 145 146 146 145 145 145 145 145 145 144 144 145 145 145 145 146 145 143 143 144 144 145 146 146 147 146 146 145 145 144 143 144 144 144 144 144 144 144 145 146 147 147 147 148 148 148 149 150 151 152 152 152 151 150 150 149 149 149 149 148
1549A48j%J%%%j%%jJ%JJ%%%j%%%%JJJ%%%%J%%%J%%%%J%%%%%%%JJJJ%%%%%%JJjjJ%%%%%j%J
$$ 148 147 147 148 148 148 148 147 147 147 146 147 147 148 149 149 149 149 148 148 148 148 148 149 150 151 151 151 151 151 152 152 152 152 153 153 153 153 153 154 154 154 154 154 154 154 154 155 156 157 158 158 158 158 158 158 158 159 160 159 158 159 159 159 159 159 159 158 158 159
1542A59%%JJK%JJK%%jJ%JKJKLLLMMMLK%klmmmlkjjjJj%jJJ%J%J%JJ%%%J%J%%%J%JJ%JJ%KJ
$$ 159 159 159 160 161 163 163 164 165 167 167 167 166 167 167 168 170 171 173 176 179 182 186 190 194 197 199 199 197 194 190 186 182 179 177 176 175 174 175 174 174 173 174 175 175 176 176 177 177 178 179 179 179 179 180 180 181 181 181 181 182 182 183 184 184 185 186 186 188 189
1535A89%%%%JK%JJ%%%%KJJ%%JJ%KJ%%%KJJJJJJKJJJJJKJ%JKJJJJJJKJJJLKKK%JJKJJJJKLK
$$ 189 189 189 189 189 190 192 192 193 194 194 194 194 194 196 197 198 198 198 199 200 200 202 203 203 203 203 205 206 207 208 209 210 211 213 214 215 216 217 218 220 221 221 222 224 225 226 227 228 229 230 232 233 234 235 238 240 242 244 244 245 246 248 249 250 251 252 254 257 259
1527B59KJJJKKKJKKJKKJJKJKJKKJKJJKJJKJKKLJKJJKKKJKJLJJKLKLLMLMOPPOLjmkjJJLMNO
$$ 259 261 262 263 264 266 268 270 271 273 275 276 278 280 281 282 284 285 287 288 290 292 293 295 296 297 299 300 301 303 304 306 308 311 312 314 315 316 318 320 322 323 325 326 329 330 331 333 336 338 341 344 348 351 355 361 368 375 381 384 383 379 377 376 377 378 381 385 390 396
1520C96POJllmk%JJJJKKLLKLKLKLLLMMMMNNMNJjlkjJJ%%%JJKLJJKJJJJJJJ%KKJKJKJJ%KJJ
$$ 396 403 409 410 407 404 400 398 398 399 400 401 402 404 406 409 412 414 417 419 422 424 427 430 433 437 441 445 449 454 459 463 468 469 468 465 463 462 463 464 464 464 464 465 466 468 471 472 473 475 476 477 478 479 480 481 482 482 484 486 487 489 490 492 493 494 494 496 497 498
1513D98JJJJJ%%KKJJJJJJJJJJJJJJJJJJKJJJJJJKJJKJJJJJ%JJJKJ%J%%JJJK%J%%%%J%JJ%%
$$ 498 499 500 501 502 503 503 503 505 507 508 509 510 511 512 513 514 515 516 517 518 519 520 521 522 523 524 525 527 528 529 530 531 532 533 535 536 537 539 540 541 542 543 544 544 545 546 547 549 550 550 551 551 551 552 553 554 556 556 557 557 557 557 557 558 558 559 560 560 560
1506E60%JJJ%JKJJKLML%monmkkj%%KKKJknoonlllljkkkkjjjkjjkkkkjkkjjj%jjlkjkjkjj%
$$ 560 560 561 562 563 563 564 566 567 568 570 573 577 580 580 576 570 565 561 559 557 556 556 556 558 560 562 563 561 556 550 544 539 536 533 530 527 526 524 522 520 518 517 516 515 513 512 511 509 507 505 503 502 500 498 497 496 495 495 494 493 490 488 487 485 484 482 481 480 480
1498D80jjkjjkjlkjjkjkjkk%jjjkkkljkkkklkkjkkjkjkkklkkllklklllkkkklllkkklllklk
$$ 480 479 478 476 475 474 472 471 468 466 465 464 462 461 459 458 456 454 454 453 452 451 449 447 445 442 441 439 437 435 433 430 428 426 425 423 421 420 418 417 415 413 411 408 406 404 401 398 396 393 391 388 385 382 380 378 376 374 371 368 365 363 361 359 356 353 350 348 345 343
1491C43llkkkkkklllkjkkkkkkkkklkjjjjkklkjjjjkkjkkjkkjkj%kkkkkkjkjjkkjjjkkjjjk
$$ 343 340 337 335 333 331 329 327 325 322 319 316 314 313 311 309 307 305 303 301 299 297 295 292 290 289 288 287 286 284 282 279 277 276 275 274 273 271 269 268 266 264 263 261 259 258 256 255 255 253 251 249 247 245 243 242 240 239 238 236 234 233 232 231 229 227 226 225 224 222
1484B22kjklkkkjjjkkkkjkkjjkkkjk%jjjjkjj%jjjkkjjjjjjjjj%jjjjj%j%jjjj%jj%j%%jj
$$ 222 220 219 217 214 212 210 208 207 206 205 203 201 199 197 196 194 192 191 190 188 186 184 183 181 181 180 179 178 177 175 174 173 173 172 171 170 168 166 165 164 163 162 161 160 159 158 157 157 156 155 154 153 152 152 151 151 150 149 148 147 147 146 145 145 144 144 144 143 142
1476A42j%%j%kjjjj%%j%%J%jjJj%jkjj%%%%%j%j%%%%J%%jk%%%%j%%jj%%%%%%%%%J%j%jj%%
$$ 142 141 141 141 140 140 138 137 136 135 134 134 134 133 133 133 134 134 133 132 133 132 132 131 129 128 127 127 127 127 127 127 126 126 125 125 125 125 125 126 126 126 125 123 123 123 123 123 122 122 122 121 120 120 120 120 120 120 120 120 120 120 121 121 120 120 119 118 118 118
1469A18J%%%j%%%jjjj%j%%%%%%J%%J%%jjjjJ%%J%%%jjjj%J%%%j%J%J%%j%J%J%J%%%jj%%J%
$$ 118 119 119 119 119 118 118 118 118 117 116 115 114 114 113 113 113 113 113 113 113 114 114 114 115 115 115 114 113 112 111 112 112 112 113 113 113 113 112 111 110 109 109 110 110 110 110 109 109 110 110 111 111 111 110 110 111 111 112 112 113 113 113 113 112 111 111 111 112 112
1462A12J%%j%%JJJ%KJKLLNMJloollkjkjjJ%j%%%%%%j%%%%%%j%%%%j%%%j%%%%%j%JJJ%j%JJ
$$ 112 113 113 113 112 112 112 113 114 115 115 117 118 120 123 126 131 135 136 133 127 121 118 115 113 112 110 109 108 109 109 108 108 108 108 108 108 108 107 107 107 107 107 107 107 106 106 106 106 106 105 105 105 105 104 104 104 104 104 104 103 103 104 105 106 106 105 105 106 107
1454A07%%jjjj%Jj%Jj%%J%%%%jj%J%Jj%%j%%%j%J%%%%j%%%%%%%%%Jj%%%%j%%K%%jj%%%%J%
$$ 107 107 107 106 105 104 103 103 104 103 103 104 103 103 103 104 104 104 104 104 103 102 102 103 103 104 103 103 103 102 102 102 102 101 101 102 102 102 102 102 101 101 101 101 101 101 101 101 101 101 102 101 101 101 101 101 100 100 100 102 102 102 101 100 100 100 100 100 101 101
1447A01%%%%J%j%%%J%J%Jjjj%%JJJ%J%%%%%%%%jj%%%%%%%%%%%JK%jjj%J%%J%%%%J%%JJKJJ
$$ 101 101 101 101 101 102 102 101 101 101 101 102 102 103 103 104 103 102 101 101 101 102 103 104 104 105 105 105 105 105 105 105 105 105 104 103 103 103 103 103 103 103 103 103 103 103 103 104 106 106 105 104 103 103 104 104 104 105 105 105 105 105 106 106 106 107 108 110 111 112
1440A12%J%%JjjkJJJ%J%j%%%%J%J%%%J%J%%J%%J%%k%%jJJJj%%J%%%%JJ%KJ%%%JJKJJK%LKJ
$$ 112 112 113 113 113 114 113 112 110 111 112 113 113 114 114 113 113 113 113 113 114 114 115 115 115 115 116 116 117 117 117 118 118 118 119 119 119 117 117 117 116 117 118 119 118 118 118 119 119 119 119 119 120 121 121 123 124 124 124 124 125 126 128 129 130 132 132 135 137 138
1432A38JJJ%J%J%%J%%JJ%JKKJJJJJKKLKKLKKLLKMLNNMNNNMONOPOQPOPPPPPPOPPPNNNMLLK%
$$ 138 139 140 141 141 142 142 143 143 143 144 144 144 145 146 146 147 149 151 152 153 154 155 156 158 160 163 165 167 170 172 174 177 180 182 186 189 194 199 203 208 213 218 222 228 233 239 246 252 260 267 273 280 287 294 301 308 315 321 328 335 342 347 352 357 361 364 367 369 369
1425C69jkkjjklmlmlllkkkkkjj%jJJLKLLNMNNNPPRQQRJ0J2J1J2J2J3J3J6J6J6J6J6J8J7J7
$$ 369 368 366 364 363 362 360 357 353 350 346 343 340 337 335 333 331 329 327 326 325 325 324 325 326 329 331 334 337 342 346 351 356 361 368 375 384 392 400 409 419 431 442 454 466 479 492 508 524 540 556 572 590 607 624
1419F24J8J8J8J8J7J6J6J4J5J4J3J2J0J0QQOLLJ%kkllmmllnmmmlmjkjj%JLMNOPRRJ0J2J2J1
$$ 624 642 660 678 696 713 729 745 759 774 788 801 813 823 833 841 849 855 858 861 862 862 860 858 855 852 848 844 841 838 833 829 825 821 818 814 813 811 810 809 809 810 813 817 822 828 835 844 853 863 875 887 898
1414H98J3J5J5J5J4J4J5J4J4J3J3J3J3J1J2RRRJ0J0J0J0RJ0J0QRQRQQPQPPONMNMMLKKJKJL
$$ 898 911 926 941 956 970 984 999 1013 1027 1040 1053 1066 1079 1090 1102 1111 1120 1129 1139 1149 1159 1169 1178 1188 1198 1206 1215 1223 1232 1240 1248 1255 1263 1270 1277 1283 1288 1292 1297 1301 1305 1308 1310 1312 1313 1315 1316 1319
1409A319KKLLLMONPQJ0J1J2J3J5J4J6J7J9K0K0K0J9K1K0K0J9J9J8J5J5J3J1RQNMJ%lmnoqr
$$ 1319 1321 1323 1326 1329 1332 1336 1342 1347 1354 1362 1372 1383 1395 1408 1423 1437 1453 1470 1489 1509 1529 1549 1568 1589 1609 1629 1648 1667 1685 1700 1715 1728 1739 1748 1756 1761 1765 1766 1766 1763 1759 1754 1748 1740 1731
1404A731j0j1j1j2j3j3j2j3j4j3j1j1j1j0j0j0rrqqpoomlljkKLMLMMOOPPPJ0J3J3J4J5J6J8
$$ 1731 1721 1710 1699 1687 1674 1661 1649 1636 1622 1609 1598 1587 1576 1566 1556 1546 1537 1528 1520 1512 1505 1499 1493 1489 1486 1483 1482 1480 1482 1485 1489 1492 1496 1500 1506 1512 1519 1526 1533 1543 1556 1569 1583 1598 1614 1632
1399A632K0J9J9J8J8J8J7J7J6J6J5J3J2RRONKjmmpj0rj0j4j5j6j8j9k2k1k2k3k3k4k3k4k3
$$ 1632 1652 1671 1690 1708 1726 1744 1761 1778 1794 1810 1825 1838 1850 1859 1868 1874 1879 1881 1880 1876 1872 1865 1855 1846 1836 1822 1807 1791 1773 1754 1732 1711 1689 1666 1643 1619 1596 1572 1549
1395A549k4k4k3k2k2k1k1j9k0j8j8j6j7j6j4j3j3j3j1rrpqomllj%%KKLKKNNONNNNMNMLMKJ
$$ 1549 1525 1501 1478 1456 1434 1413 1392 1373 1353 1335 1317 1301 1284 1268 1254 1241 1228 1215 1204 1195 1186 1179 1171 1165 1161 1158 1155 1154 1154 1154 1156 1158 1161 1163 1165 1170 1175 1181 1186 1191 1196 1201 1205 1210 1214 1217 1221 1223 1224
1390A224J%jkllnopqrj0j0j2j3j5j5j4j6j5j6j5j7j6j6j6j6j6j6j6j5j5j6j5j4j4j4j4j3j4
$$ 1224 1225 1225 1224 1222 1219 1216 1211 1205 1198 1190 1181 1171 1161 1149 1136 1121 1106 1092 1076 1061 1045 1030 1013 997 981 965 949 933 917 901 886 871 855 840 826 812 798 784 771 757
1386G57j1j2j2j1j1j0rrrqqppoppmmnnmnlllkkjkkkkjkJ%J%J%J%JJLLMNOQJ1J4J7K1K6L1L9
$$ 757 746 734 722 711 700 690 681 672 663 655 647 640 633 627 620 613 609 605 600 595 591 586 583 580 577 575 573 572 570 568 566 564 563 561 562 562 563 563 564 564 565 565 566 567 570 573 577 582 588 596 607 621 638 659 685 716 755
1380G55M6N5O4P4Q0Q1P5N8L1ll6o4q1q7q4p6o4n4m4l6k9k2j7j2qnjKNQJ2J6K0K4K9L7M4N2
$$ 755 801 856 920 994 1074 1155 1230 1288 1319 1316 1280 1216 1135 1048 964 888 824 770 726 690 661 639 622 610 602 597 596 598 603 611 623 639 659 683 712 749 793 845
1376H45O1P0Q2R4J05J14J18J16J04Q1M8J3j8m2n8o2o2n7n0m3l5k5j5oLJ5K3L3M4N4O4P2P9
$$ 845 906 976 1058 1152 1257 1371 1489 1605 1709 1790 1838 1851 1833 1791 1733 1671 1609 1552 1502 1459 1424 1399 1384 1378 1381 1396 1419 1452 1496 1550 1614 1686 1765
1372A765Q4Q6Q4P2N0J3k9p2j02j16j15j01q2o2m3l0j7pjLNNPQQJ1J2K0K6L5M3N5O7P9R4J10
$$ 1765 1849 1935 2019 2091 2141 2154 2125 2053 1951 1835 1720 1619 1537 1475 1432 1402 1385 1378 1377 1380 1385 1390 1397 1405 1413 1424 1436 1456 1482 1517 1560 1615 1682 1761 1855 1965
1368A965J26J41J53J65J71J69J55J29Q8L3k5p8j16j34j35j22j03q4o6n7o0o8p9q6q6p8o7n3
$$ 1965 2091 2232 2385 2550 2721 2890 3045 3174 3262 3295 3270 3192 3076 2942 2807 2685 2582 2498 2432 2375 2315 2247 2168 2082 1996 1918 1851 1798
1365A798l9k7j9j5j2j4j6j9j9j7j2mOJ8L1M3N5O3O5O3N5M5L3K0J2J0J3J9K7L1L3K4J1pk1l0
$$ 1798 1759 1732 1713 1698 1686 1672 1656 1637 1618 1601 1589 1585 1591 1609 1640 1683 1738 1801 1866 1929 1984 2029 2062 2082 2094 2104 2117 2136 2163 2194 2227 2251 2262 2255 2234 2204
1361B204l2k8j9rMJ5K5L6M1M4M1L2J5rl9o7q5r1q5p2n6m3l4l5m2n7p4q7r0q5p3n9m5l3k1j1
$$ 2204 2172 2144 2125 2116 2120 2135 2160 2196 2237 2281 2322 2354 2369 2360 2321 2254 2169 2078 1993 1921 1865 1822 1788 1753 1711 1654 1580 1493 1403 1318 1245 1186 1141 1108 1087 1076
1358A076lLPJ1J5J8K2K7L2L6M4N1N8O4O5O5O0N2M2L4K8K8L1L6L9L8K8J0j8n0p9j02j14j17
$$ 1076 1073 1076 1083 1094 1109 1127 1149 1176 1208 1244 1288 1339 1397 1461 1526 1591 1651 1703 1745 1779 1807 1835 1866 1902 1941 1979 2007 2017 1999 1949 1870 1768 1654 1537
1354A537j13j04r3q2p1n9m9m0l1k4j8j3pl%LLJjlorj0qokMJ0J5K2K5K6K3J9Rjj2k0k7l0l1
$$ 1537 1424 1320 1227 1145 1074 1015 966 926 895 871 853 840 833 830 830 833 836 837 836 833 827 818 808 800 794 792 796 806 821 843 868 894 917 936 945 944 932 912 885 855 824
1350H24k9k8k5k1j8j2qkKOJ1J5J9K4K5K8K8K7K3J5Mj0k8m5n8o4o7o2n6m9m1l4k8k4k0j6j3
$$ 824 795 767 742 721 703 691 683 681 683 689 700 715 734 758 783 811 839 866 889 904 908 898 870 825 767 703 636 574 518 469 428 394 366 342 322 306 293
1346B93j0rqpnlljJKMOQJ0J2J3J7J8K0K0K1K0J5J1Lmj2k1k5k8k8k7k6k3j9j5j4j2j1rqopn
$$ 293 283 274 266 259 254 251 248 247 248 250 254 260 268 278 290 303 320 338 358 378 399 419 434 445 448 444 432 411 386 358 330 303 277 254 235 220 206 194 183 174 166 160 153 148
1341A48mmllklkkkjkkjkjk%jjk%%j%%j%%j%jk%%J%kjjj%%j%j%%%%%%%%%%j%j%j%%J%%%j%J
$$ 148 144 140 137 134 132 129 127 125 123 122 120 118 117 115 114 112 112 111 110 108 108 108 107 107 107 106 106 106 105 105 104 102 102 102 103 103 101 100 99 98 98 98 97 97 96 96 96 96 96 96 96 96 96 96 96 95 95 94 94 93 93 93 94 94 94 94 93 93 94
1334I4J%%j%J%%%%j%JJ%%%Jj%%%%%%%j%%%%%j%%J%%j%%jJJJ%jj%J%j%jjJ%%%%%%%j%Jjj%%
$$ 94 95 95 95 94 94 95 95 95 95 95 94 94 95 96 96 96 96 97 96 96 96 96 96 96 96 96 95 95 95 95 95 95 94 94 94 95 95 95 94 94 94 93 94 95 96 96 95 94 94 95 95 94 94 93 92 93 93 93 93 93 93 93 93 92 92 93 92 91 91 91
1326I1%J%%%%%jjj%JJ%j%JJ%kj%%J%%%%J%%%%j%%J%%JJ%jj%j%%j%%J%%J%%j%jJj%%%%Jj%%
$$ 91 91 92 92 92 92 92 92 91 90 89 89 90 91 91 90 90 91 92 92 90 89 89 89 90 90 90 90 90 91 91 91 91 91 90 90 90 91 91 91 92 93 93 92 91 91 90 90 90 89 89 89 90 90 90 91 91 91 90 90 89 90 89 89 89 89 89 90 89 89 89
1319H9j%jJ%%%j%Jj%%%%%%%%%%%j%KJj%%j%j%%%%%j%%JJ%%j%%%%%jJJ%j%%J%Jj%%%%%%JJ%
$$ 89 88 88 87 88 88 88 88 87 87 88 87 87 87 87 87 87 87 87 87 87 87 87 86 86 88 89 88 88 88 87 87 86 86 86 86 86 86 85 85 85 86 87 87 87 86 86 86 86 86 86 85 86 87 87 86 86 86 87 87 88 87 87 87 87 87 87 87 88 89 89
1312H9%jJ%%J%jj%%%%%%J%%%%jj%j%%JJ%Jj%%%j%jKJJKKJKLLMOOPNjoqomlllkjj%j%%j%j%
$$ 89 89 88 89 89 89 90 90 89 88 88 88 88 88 88 88 89 89 89 89 89 88 87 87 86 86 86 87 88 88 89 88 88 88 88 87 87 86 88 89 90 92 94 95 97 100 103 107 113 119 126 131 130 124 116 110 106 103 100 97 95 94 93 93 92 92 92 91 91 90 90
1304I0%J%J%JJ%%%%j%%%j%jjjJJ%J%j%%J%%%%%J%JJLK%%jJ%j%%%j%%j%j%%%J%%%j%j%j%J%
$$ 90 90 91 91 92 92 93 94 94 94 94 94 93 93 93 93 92 92 91 90 89 90 91 91 92 92 91 91 91 92 92 92 92 92 92 93 93 94 95 98 100 100 100 99 100 100 99 99 99 99 98 98 98 97 97 96 96 96 96 97 97 97 97 96 96 95 95 94 94 95 95
1297I5%%%%j%j%jJ%%%%J%J%%%%%%J%JJ%JJ%%Jj%%%jj%Jjjjj%%%j%%%%JJj%j%%Jj%j%%%jj%
$$ 95 95 95 95 95 94 94 93 93 92 93 93 93 93 93 94 94 95 95 95 95 95 95 95 96 96 97 98 98 99 100 100 100 101 100 100 100 100 99 98 98 99 98 97 96 95 95 95 95 94 94 94 94 94 95 96 95 95 94 94 94 95 94 94 93 93 93 93 92 91 91
1289I1j%%j%%J%%J%%J%J%J%%%J%J%J%%%jjkkjj%%%j%j%%J%%%%j%%%Jj%%J%J%j%%%%%%%%%J
$$ 91 90 90 90 89 89 89 90 90 90 91 91 91 92 92 93 93 94 94 94 94 95 95 96 96 97 97 97 97 96 95 93 91 90 89 89 89 89 88 88 87 87 87 88 88 88 88 88 87 87 87 87 88 87 87 87 88 88 89 89 88 88 88 88 88 88 88 88 88 88 89
1282H9%%%jj%%%Jj%%J%Jjj%jj%%J%%j%%Jjj%JjjJJ%%jJ%jj%jJ%JJJ%%%%%Jj%jJ%%%%%%%%%
$$ 89 89 89 89 88 87 87 87 87 88 87 87 87 88 88 89 88 87 87 86 85 85 85 86 86 86 85 85 85 86 85 84 84 85 84 83 84 85 85 85 84 85 85 84 83 83 82 83 83 84 85 86 86 86 86 86 86 87 86 86 85 86 86 86 86 86 86 86 86 86 86
1274H6Jj%%%jj%j%%%%%J%%%%J%%j%%%%J%%%j%J%j%%J%%J%%%j%j%JJ%%jj%J%%%%%%J%j%%jJ
$$ 86 87 86 86 86 86 85 84 84 83 83 83 83 83 83 84 84 84 84 84 85 85 85 84 84 84 84 84 85 85 85 85 84 84 85 85 84 84 84 85 85 85 86 86 86 86 85 85 84 84 85 86 86 86 85 84 84 85 85 85 85 85 85 85 86 86 85 85 85 84 85
1267H5%J%%%%%%jJ%%%%%%%%jJ%%%%J%JJ%%jjj%%JJ%jjj%Jjj%J%J%j%JJ%%%j%%%%%%%%%jJ%
$$ 85 85 86 86 86 86 86 86 86 85 86 86 86 86 86 86 86 86 86 85 86 86 86 86 86 87 87 88 89 89 89 88 87 86 86 86 87 88 88 87 86 85 85 86 85 84 84 85 85 86 86 85 85 86 87 87 87 87 86 86 86 86 86 86 86 86 86 86 85 86 86
1260H6jJ%%%Jj%%%JJ%%j%%%%%%%JJ%j%jj%%%%%%j%J%%J%%%%%%%%%%%%%%%JJJjjj%Jj%jJ%%
$$ 86 85 86 86 86 86 87 86 86 86 86 87 88 88 88 87 87 87 87 87 87 87 87 88 89 89 88 88 87 86 86 86 86 86 86 86 85 85 86 86 86 87 87 87 87 87 87 87 87 87 87 87 87 87 87 87 87 88 89 90 89 88 87 87 88 87 87 86 87 87 87
1252H7Jj%%J%j%%J%%%%j%%j%J%JJ%Jj%jk%J%%%J%%%%%J%%j%%j%%%%%%j%JJ%jJ%%%%J%%jj%
$$ 87 88 87 87 87 88 88 87 87 87 88 88 88 88 88 87 87 87 86 86 87 87 88 89 89 90 89 89 88 86 86 87 87 87 87 88 88 88 88 88 88 89 89 89 88 88 88 87 87 87 87 87 87 87 86 86 87 88 88 87 88 88 88 88 88 89 89 89 88 87 87
1245H7%%%JjJ%%%%%j%J%%%J%%%%%%%%%%%%%%%JJjj%%%%%Jj%%%J%jj%j%jJ%JJJJjjj%%J%J%
$$ 87 87 87 87 88 87 88 88 88 88 88 88 87 87 88 88 88 88 89 89 89 89 89 89 89 89 89 89 89 89 89 89 89 89 90 91 90 89 89 89 89 89 89 90 89 89 89 89 90 90 89 88 88 87 87 86 87 87 88 89 90 91 90 89 88 88 88 89 89 90 90
1237I0j%J%J%jJ%%J%%JKJ%jk%j%jJ%J%j%j%%%jjjJJ%Jj%%%%%j%%%%JJjjJ%J%%%J%j%%j%%J
$$ 90 89 89 90 90 91 91 90 91 91 91 92 92 92 93 95 96 96 95 93 93 92 92 91 92 92 93 93 92 92 91 91 91 91 90 89 88 89 90 90 91 90 90 90 90 90 90 89 89 89 89 89 90 91 90 89 90 90 91 91 91 91 92 92 91 91 91 90 90 90 91
1230I1J%%%%%%J%JJJjj%%%j%%j%%%%jj%%J%J%%J%%%%J%j%%%J%%%%J%j%%%%K%jj%%jJ%%%J%
$$ 91 92 92 92 92 92 92 92 93 93 94 95 96 95 94 94 94 94 93 93 93 92 92 92 92 92 91 90 90 90 91 91 92 92 92 93 93 93 93 93 94 94 93 93 93 93 94 94 94 94 94 95 95 94 94 94 94 94 96 96 95 94 94 94 93 94 94 94 94 95 95
1223I5j%%%J%%%%%%%%%%%j%%%J%%%J%%%%%%%%J%%%j%%J%jjJ%%%%%Jj%%%j%JJ%%%j%J%%J%%
$$ 95 94 94 94 94 95 95 95 95 95 95 95 95 95 95 95 95 94 94 94 94 95 95 95 95 96 96 96 96 96 96 96 96 96 97 97 97 97 96 96 96 97 97 96 95 96 96 96 96 96 96 97 96 96 96 96 95 95 96 97 97 97 97 96 96 97 97 97 98 98 98
1215I8%J%%J%j%%%j%%%%J%%jj%%JJJ%%j%jj%J%J%%J%Jj%%JjJ%J%%JJj%%j%j%%%%J%%%%%%%
$$ 98 98 99 99 99 100 100 99 99 99 99 98 98 98 98 98 99 99 99 98 97 97 97 98 99 100 100 100 99 99 98 97 97 98 98 99 99 99 100 100 101 100 100 100 101 100 101 101 102 102 102 103 104 103 103 103 102 102 101 101 101 101 101 102 102 102 102 102 102 102 102
1208A02j%j%J%%%j%J%%J%%%%%J%%J%j%%%%%%%%%j%J%%JJJ%j%Jj%JJj%jj%JJJ%%%%Jj%%j%%
$$ 102 101 101 100 100 101 101 101 101 100 100 101 101 101 102 102 102 102 102 102 103 103 103 104 104 103 103 103 103 103 103 103 103 103 103 102 102 103 103 103 104 105 106 106 105 105 106 105 105 106 107 106 106 105 104 104 105 106 107 107 107 107 107 108 107 107 107 106 106 106
1200A06J%%Jjj%%%J%%%jJ%KJJ%j%%j%j%%J%%%%%%%%JJJj%%%%JJ%%%j%J%%%j%%JJJj%%%J%%
$$ 106 107 107 107 108 107 106 106 106 106 107 107 107 107 106 107 107 109 110 111 111 110 110 110 109 109 108 108 108 109 109 109 109 109 109 109 109 109 110 111 112 111 111 111 111 111 112 113 113 113 113 112 112 113 113 113 113 112 112 112 113 114 115 114 114 114 114 115 115 115
1193A15%%%%%%%%j%j%%%%J%%JKJ%j%%%%%%JJ%%%%J%%%J%%%%%%%%%%%Jjjj%J%JJ%%%%%Jj%%
$$ 115 115 115 115 115 115 115 115 115 114 114 113 113 113 113 113 114 114 114 115 117 118 118 117 117 117 117 117 117 117 118 119 119 119 119 119 120 120 120 120 121 121 121 121 121 121 121 121 121 121 121 121 122 121 120 119 119 120 120 121 122 122 122 122 122 122 123 122 122 122
1186A22%J%J%J%%k%j%%J%J%%J%%jJJ%%J%J%%j%Jj%KJ%J%J%%%j%%%J%%j%J%JJJ%%%J%j%JJ%
$$ 122 122 123 123 124 124 125 125 125 123 123 122 122 122 123 123 124 124 124 125 125 125 124 125 126 126 126 127 127 128 128 128 127 127 128 127 127 129 130 130 131 131 132 132 132 132 131 131 131 131 132 132 132 131 131 132 132 133 134 135 135 135 135 136 136 135 135 136 137 137
1178A37J%J%%j%jJ%JJJ%JJ%J%K%%%%%%J%%JJ%%%%%j%JJ%JJ%J%J%Jj%%%J%J%%J%JJ%%J%%%j
$$ 137 138 138 139 139 139 138 138 137 138 138 139 140 141 141 142 143 143 144 144 146 146 146 146 146 146 146 147 147 147 148 149 149 149 149 149 149 148 148 149 150 150 151 152 152 153 153 154 154 155 154 154 154 154 155 155 156 156 156 157 157 158 159 159 159 160 160 160 160 159
1171A59JKJ%%%Jj%%JJ%J%J%%J%%J%J%%JJJ%J%J%JJJj%%JJJ%J%JJ%JJJ%JJJJJ%JJJJJJJJ%J
$$ 159 160 162 163 163 163 163 164 163 163 163 164 165 165 166 166 167 167 167 168 168 168 169 169 170 170 170 171 172 173 173 174 174 175 175 176 177 178 177 177 177 178 179 180 180 181 181 182 183 183 184 185 186 186 187 188 189 190 191 191 192 193 194 195 196 197 198 199 199 200
1164B00JJJKK%JJ%KJJJJJJKKJJ%KJJJJJJJKKKKJJLKKLKJKLKKLLLKKLLLKKKLLMLLLLLLKLKK
$$ 200 201 202 203 205 207 207 208 209 209 211 212 213 214 215 216 217 219 221 222 223 223 225 226 227 228 229 230 231 232 234 236 238 240 241 242 245 247 249 252 254 255 257 260 262 264 267 270 273 275 277 280 283 286 288 290 292 295 298 302 305 308 311 314 317 320 322 325 327 329
1156C29KKKLLKLLLKMMKLLMLMMMLLLLMLMLNNMLMONNMMNLNMMNMNLMNONNNOOONNONONOPOPOPP
$$ 329 331 333 335 338 341 343 346 349 352 354 358 362 364 367 370 374 377 381 385 389 392 395 398 401 405 408 412 415 420 425 429 432 436 442 447 452 456 460 465 468 473 477 481 486 490 495 498 502 507 513 518 523 528 534 540 546 551 556 562 567 573 578 584 591 597 604 610 617 624
1149F24PPQQRRJ0J0RRJ1J1J2J2J1J3J3J3J4J3J5J5J6J5J7J9J8J8J9K1K0K2K2K3K2K5K4K6K6
$$ 624 631 638 646 654 663 672 682 692 701 710 721 732 744 756 767 780 793 806 820 833 848 863 879 894 911 930 948 966 985 1006 1026 1048 1070 1093 1115 1140 1164 1190 1216
1145A216K8K9L0L2L2L4L6L6L8M0M1M3M6M7M9N0N3N5N8O0O2O6P0P4P6Q0Q4Q8R3R7J02J07J13
$$ 1216 1244 1273 1303 1335 1367 1401 1437 1473 1511 1551 1592 1635 1681 1728 1777 1827 1880 1935 1993 2053 2115 2181 2251 2325 2401 2481 2565 2653 2746 2843 2945 3052 3165
1142C165J18J24J31J39J45J54J61J68J76J84J94K01K10K19K27K35K42K49K53K57K60K61K61
$$ 3165 3283 3407 3538 3677 3822 3976 4137 4305 4481 4665 4859 5060 5270 5489 5716 5951 6193 6442 6695 6952 7212 7473 7734
1139G734K58K51K42K29K15J96J74J51J23R3O2L0ll5o9r9j29j55j78k00k17k31k43k53k58k62
$$ 7734 7992 8243 8485 8714 8929 9125 9299 9450 9573 9666 9728 9758 9755 9720 9651 9552 9423 9268 9090 8890 8673 8442 8199 7946 7688 7426
1136G426k64k61k60k55k51k42k36k28k19k10k04j95j87j78j69j62j55j47j40j33j26j19j15
$$ 7426 7162 6901 6641 6386 6135 5893 5657 5429 5210 5000 4796 4601 4414 4236 4067 3905 3750 3603 3463 3330 3204 3085 2970
1134B970j09j05r9r4r0q5q1p7p4o9o6o3n9n7n5n1n1m8m6m3m2m0l8l6l5l4l2l1l0k9k7k6k6
$$ 2970 2861 2756 2657 2563 2473 2388 2307 2230 2156 2087 2021 1958 1899 1842 1787 1736 1685 1637 1591 1548 1506 1466 1428 1392 1357 1323 1291 1260 1230 1201 1174 1148 1122
1130A122k4k3k2k1k2k0j9j9j8j7j6j4j5j6j5j6j5j3j1j2j2j2j2j1j1j1j0j0rj0rj0j0j0rq
$$ 1122 1098 1075 1053 1032 1010 990 971 952 934 917 901 887 872 856 841 825 810 797 786 774 762 750 738 727 716 705 695 685 676 666 657 647 637 627 618 610
1127F10qrqrpqpqppopppomnmnoommmlnmlmlmllllklklkkkjjjkkljjkjkjjjjjkjjjj%%%j%%
$$ 610 602 593 585 576 569 561 554 546 539 532 526 519 512 505 499 495 490 486 481 475 469 465 461 457 454 449 445 442 438 435 431 428 425 422 419 417 414 412 409 407 405 403 402 401 400 398 396 393 392 391 389 388 386 385 384 383 382 381 379 378 377 376 375 375 375 375 374 374 374
1119C74%j%%%%%%%%J%KJ%J%JJJjJKJJJJ%JK%JJJKJJ%jJ%J%KJKJJJJJJJJJJJJJJJJ%KKKJKK
$$ 374 374 373 373 373 373 373 373 373 373 373 374 374 376 377 377 378 378 379 380 381 380 381 383 384 385 386 387 387 388 390 390 391 392 393 395 396 397 397 396 397 397 398 398 400 401 403 404 405 406 407 408 409 410 411 412 413 414 415 416 417 418 419 419 421 423 425 426 428 430
1112D30JKJJKKKJJKJKLKJKKLKJKKLKLKKKLLLKJKLLMLLLLMLLLMLLLLMLMMMLMLMNMNMNMMMNN
$$ 430 431 433 434 435 437 439 441 442 443 445 446 448 451 453 454 456 458 461 463 464 466 468 471 473 476 478 480 482 485 488 491 493 494 496 499 502 506 509 512 515 518 522 525 528 531 535 538 541 544 547 551 554 558 562 566 569 573 576 580 585 589 594 598 603 607 611 615 620 625
1105F25ONNNNNNNNNNONONPPPPPOOPPOPPPQQPPPRQQPQQQQRRJ0J0J0RJ0J1J0J1J0J0J1J0J1J1
$$ 625 631 636 641 646 651 656 661 666 671 676 681 687 692 698 703 710 717 724 731 738 744 750 757 764 770 777 784 791 799 807 814 821 828 837 845 853 860 868 876 884 892 901 910 920 930 940 949 959 970 980 991 1001 1011 1022 1032 1043 1054
1099A054J0J2J1J2J2J1J2J3J3J4J3J3J4J3J4J4J5J5J5J5J5J6J5J6J7J7J8J8J9J7J8K0K0J9
$$ 1054 1064 1076 1087 1099 1111 1122 1134 1147 1160 1174 1187 1200 1214 1227 1241 1255 1270 1285 1300 1315 1330 1346 1361 1377 1394 1411 1429 1447 1466 1483 1501 1521 1541 1560
1095A560K0K0K0K1K2K3K2K3K5K5K5K4K5K6K6K7K8K8K9L0L0L1L2L2L3L4L5L5L6L7L8L8L9L9
$$ 1560 1580 1600 1620 1641 1663 1686 1708 1731 1756 1781 1806 1830 1855 1881 1907 1934 1962 1990 2019 2049 2079 2110 2142 2174 2207 2241 2276 2311 2347 2384 2422 2460 2499 2538
1091B538M0M2M2M4M5M6M6M7M9M9N0N0N2N5N6N6N7N8N9O1O3O4O5O7O7O9O9P1P2P4P5P8P8P9
$$ 2538 2578 2620 2662 2706 2751 2797 2843 2890 2939 2988 3038 3088 3140 3195 3251 3307 3364 3422 3481 3542 3605 3669 3734 3801 3868 3937 4006 4077 4149 4223 4298 4376 4454 4533
1088D533Q0Q1Q4Q6Q6Q7Q7Q9Q9R1R3R4R4R5R5R6R6R7R8R7R7R8R7R7R7R6R6R5R4R2R0Q9Q7Q5
$$ 4533 4613 4694 4778 4864 4950 5037 5124 5213 5302 5393 5486 5580 5674 5769 5864 5960 6056 6153 6251 6348 6445 6543 6640 6737 6834 6930 7026 7121 7215 7307 7397 7486 7573 7658
1084G658Q2Q0P7P4P2O9O5O2N9N4M9M5M2L7L3K8K3J8J3RMjpj1j6k1k4l0l4l7m2m6n1n5n7o0
$$ 7658 7740 7820 7897 7971 8043 8112 8177 8239 8298 8352 8401 8446 8488 8525 8558 8586 8609 8627 8640 8649 8653 8652 8645 8634 8618 8597 8573 8543 8509 8472 8430 8384 8333 8278 8221 8161
1080H161o4o7o9p1p3p7p9q2q3q4q5q5q7q8q9q9r0q9r0r1r0r1q9r0q9q8q7q7q6q6q5q4q2q2
$$ 8161 8097 8030 7961 7890 7817 7740 7661 7579 7496 7412 7327 7242 7155 7067 6978 6889 6799 6710 6620 6529 6439 6348 6259 6169 6080 5992 5905 5818 5732 5646 5561 5477 5395 5313
1077E313q1p9p9p9p6p5p4p3p2p1o9p0o8o6o6o5o3o2o0o0n9n8n6n6n5n3n1n2n1m9n0m8m6m6
$$ 5313 5232 5153 5074 4995 4919 4844 4770 4697 4625 4554 4485 4415 4347 4281 4215 4150 4087 4025 3965 3905 3846 3788 3732 3676 3621 3568 3517 3465 3414 3365 3315 3267 3221 3175
1073C175m5m6m4m3m2m1l9l9l9l7l8l8l6l6l5l3l3l3l2l2l1l1l1l0k9k8k8k7k7k6k6k5k5k5
$$ 3175 3130 3084 3040 2997 2955 2914 2875 2836 2797 2760 2722 2684 2648 2612 2577 2544 2511 2478 2446 2414 2383 2352 2321 2291 2262 2234 2206 2179 2152 2126 2100 2075 2050 2025
1070B025k3k4k3k3k2k3k2k1k1k1j9k0j9j9j9j9j8j8j8j7j7j6j6j6j7j5j5j5j4j5j5j4j3j3
$$ 2025 2002 1978 1955 1932 1910 1887 1865 1844 1823 1802 1783 1763 1744 1725 1706 1687 1669 1651 1633 1616 1599 1583 1567 1551 1534 1519 1504 1489 1475 1460 1445 1431 1418 1405
1066A405j4j3j3j4j2j3j2j2j2j2j1j1j0j0j0j1j0j1j0rrj0qrrqrrrqrqrpoprqqoopoopooo
$$ 1405 1391 1378 1365 1351 1339 1326 1314 1302 1290 1278 1267 1256 1246 1236 1226 1215 1205 1194 1184 1175 1166 1156 1148 1139 1130 1122 1113 1104 1095 1087 1078 1070 1061 1054 1048 1041 1032 1024 1016 1010 1004 997 991 985 978 972 966 960
1061I60pooooonoonnmonnnnnponmnlnnmmmmmmlmmnmmmnmmmlllnmmmmmmmmlmlllklmlmllll
$$ 960 953 947 941 935 929 923 918 912 906 901 896 892 886 881 876 871 866 861 854 848 843 839 834 831 826 821 817 813 809 805 801 797 794 790 786 781 777 773 769 764 760 756 752 749 746 743 738 734 730 726 722 718 714 710 706 703 699 696 693 690 688 685 681 678 674 671 668 665 662
1054F62kklkklkmmlllmklljlllklllkkjkklllklklkkkkjkjlkkkJjjjj%JJJKJkopommlkjkj
$$ 662 660 658 655 653 651 648 646 642 638 635 632 629 625 623 620 617 616 613 610 607 605 602 599 596 594 592 591 589 587 584 581 578 576 573 571 568 566 564 562 560 559 557 556 553 551 549 547 548 547 546 545 544 544 545 546 547 549 550 548 542 535 529 525 521 518 516 515 513 512
1046E12llkkjkjkjkkkjjjj%jjjjkjkkkkkj%%jjkjjjjkjjjkj%jjjJjjkjjj%%kkjjjjjk%j%j
$$ 512 509 506 504 502 501 499 498 496 495 493 491 489 488 487 486 485 485 484 483 482 481 479 478 476 474 472 470 468 467 467 467 466 465 463 462 461 460 459 457 456 455 454 452 451 451 450 449 448 449 448 447 445 444 443 442 442 442 440 438 437 436 435 434 433 431 431 430 430 429
1039D29j%jjj%jj%jkkj%j%j%%%jjjj%%jjjk%j%%%kjjjj%%%jjjjj%jj%%%%j%j%jjJ%%%jkj%
$$ 429 428 428 427 426 425 425 424 423 423 422 420 418 417 417 416 416 415 415 415 415 414 413 412 411 411 411 410 409 408 406 406 405 405 405 405 403 402 401 400 399 399 399 399 398 397 396 395 394 394 393 392 392 392 392 392 391 391 390 390 389 388 389 389 389 389 388 386 385 385
1032C85j%j%%j%%%%%%j%%Jjj%j%jjjjj%J%%jj%J%J%%%j%%%jj%J%%J%j%jJ%%%J%%J%%%%%%%
$$ 385 384 384 383 383 383 382 382 382 382 382 382 382 381 381 381 382 381 380 380 379 379 378 377 376 375 374 374 375 375 375 374 373 373 374 374 375 375 375 375 374 374 374 374 373 372 372 373 373 373 374 374 373 373 372 373 373 373 373 374 374 374 375 375 375 375 375 375 375 375
1024C75%%J%%%%%%%J%%%%KJ%j%%%%%%JJ%J%%J%%JJJ%JK%J%jJJJJK%Jj%jJJJ%J%%%JJ%%j%%
$$ 375 375 375 376 376 376 376 376 376 376 376 377 377 377 377 377 379 380 380 379 379 379 379 379 379 379 380 381 381 382 382 382 383 383 383 384 385 386 386 387 389 389 390 390 389 390 391 392 393 395 395 396 395 395 394 395 396 397 397 398 398 398 398 399 400 400 400 399 399 399
1017C99%%j%%%%%J%%%%%%%%%%%%%J%jk%jJ%JJ%%%J%j%%%J%%%%JJJJ%j%%JJ%JJKJJJJ%JKKJ
$$ 399 399 399 398 398 398 398 398 398 399 399 399 399 399 399 399 399 399 399 399 399 399 399 400 400 399 397 397 396 397 397 398 399 399 399 399 400 400 399 399 399 399 400 400 400 400 400 401 402 403 404 404 403 403 403 404 405 405 406 407 409 410 411 412 413 413 414 416 418 419
1010D19%J%KKKKJJKKJJJJKJKJKKJKK%%KJKJK%J%%JJJj%KJJ%k%jjjj%%%kkkkjkkk%%jkkkjk
$$ 419 419 420 420 422 424 426 428 429 430 432 434 435 436 437 438 440 441 443 444 446 448 449 451 453 453 453 455 456 458 459 461 461 462 462 462 463 464 465 464 464 466 467 468 468 466 466 465 464 463 462 462 462 462 460 458 456 454 453 451 449 447 447 447 446 444 442 440 439 437
1002D37jkjkkkjj%jkjkjj%j%jjj%j%%kj%%jj%jjj%j%%J%JjjjjJ%JJ%%%J%J%%J%%%JK%JJKJ
$$ 437 436 434 433 431 429 427 426 425 425 424 422 421 419 418 417 417 416 416 415 414 413 413 412 412 412 410 409 409 409 408 407 407 406 405 404 404 403 403 403 404 404 405 404 403 402 401 402 402 403 404 404 404 404 405 405 406 406 406 407 407 407 407 408 410 410 411 412 414 415
995D15J%JJJJJ%JjjJJ%%jjkkk%JJJ%%%%%JKJ%%j%%%J%%J%%%KJJJJJ%J%%%%%J%JJJJJJ%JJK
$$ 415 416 416 417 418 419 420 421 421 422 421 420 421 422 422 422 421 420 418 416 414 414 415 416 417 417 417 417 417 417 418 420 421 421 421 420 420 420 420 421 421 421 422 422 422 422 424 425 426 427 428 429 429 430 430 430 430 430 430 431 431 432 433 434 435 436 437 437 438 439 441
988D41JKJJJ%J%JJK%JJKKJJKJK%JJJ%JJ%JKKKKJJJJJKKJKJJKJJJJKKKKKJ%KJKKKJLKLKKKK
$$ 441 442 444 445 446 447 447 448 448 449 450 452 452 453 454 456 458 459 460 462 463 465 465 466 467 468 468 469 470 470 471 473 475 477 479 480 481 482 483 484 486 488 489 491 492 493 495 496 497 498 499 501 503 505 507 509 510 510 512 513 515 517 519 520 523 525 528 530 532 534 536
980E36KKKLK%%J%JJJJKLKKLKKKJKJKKKKKKKKKKKLKKJKKKLKLLKKLJKKMMKLKLKLKLLLLMLKML
$$ 536 538 540 542 545 547 547 547 548 548 549 550 551 552 554 557 559 561 564 566 568 570 571 573 574 576 578 580 582 584 586 588 590 592 594 596 599 601 603 604 606 608 610 613 615 618 621 623 625 628 629 631 633 637 641 643 646 648 651 653 656 658 661 664 667 670 674 677 679 683 686
973F86MLMKLMMLLLLMMLMMMMNMLMMMMMMNNNNNNNMMNNOMNNNOOPNNOOPOOOPQPOPOPPQQQPQQQQ
$$ 686 690 693 697 699 702 706 710 713 716 719 722 726 730 733 737 741 745 749 754 758 761 765 769 773 777 781 785 790 795 800 805 810 815 820 824 828 833 838 844 848 853 858 863 869 875 882 887 892 898 904 911 917 923 929 936 944 951 957 964 970 977 984 992 1000 1008 1015 1023 1031 1039 1047
965A047RRJ0QRQRRJ0J0J0J0J0J0J1J0J1J0J0J1J0J1J2J1J2J2J2J2J1J3J3J2J3J2J3J3J3J2
$$ 1047 1056 1065 1075 1083 1092 1100 1109 1118 1128 1138 1148 1158 1168 1178 1189 1199 1210 1220 1230 1241 1251 1262 1274 1285 1297 1309 1321 1333 1344 1357 1370 1382 1395 1407 1420 1433 1446 1458
961A458J3J3J4J5J4J4J5J5J5J5J6J4J5J6J6J6J7J7J7J7J8J8J8J8J8J9J9K0K1J9K1K1K2K1K1
$$ 1458 1471 1484 1498 1513 1527 1541 1556 1571 1586 1601 1617 1631 1646 1662 1678 1694 1711 1728 1745 1762 1780 1798 1816 1834 1852 1871 1890 1910 1931 1950 1971 1992 2014 2035 2056
958B056K2K2K3K4K4K3K3K6K5K7K6K7K7K8K8K8K9L1L1L1L2L2L4L4L4L4L6L6L8L9L9M0M1M3M4
$$ 2056 2078 2100 2123 2147 2171 2194 2217 2243 2268 2295 2321 2348 2375 2403 2431 2459 2488 2519 2550 2581 2613 2645 2679 2713 2747 2781 2817 2853 2891 2930 2969 3009 3050 3093 3137
954C137M4M5M7M9M9N1N3N3N6N7N9O0O1O3O5O6O9P0P2P3P6Q0Q1Q2Q5Q8R0R3R6R7J00J04J07
$$ 3137 3181 3226 3273 3322 3371 3422 3475 3528 3584 3641 3700 3760 3821 3884 3949 4015 4084 4154 4226 4299 4375 4455 4536 4618 4703 4791 4881 4974 5070 5167 5267 5371 5478
950E478J09J12J17J20J23J26J31J35J37J43J47J50J54J59J65J69J73J78J84J88J94J99K04
$$ 5478 5587 5699 5816 5936 6059 6185 6316 6451 6588 6731 6878 7028 7182 7341 7506 7675 7848 8026 8210 8398 8592 8791 8995
948H995K11K16K22K28K34K39K45K51K57K63K69K73K77K83K89K92K97K99L03L06L08L09L09
$$ 8995 9206 9422 9644 9872 10106 10345 10590 10841 11098 11361 11630 11903 12180 12463 12752 13044 13341 13640 13943 14249 14557 14866 15175
946A5175L08L06L04L01K97K91K83K75K66K55K43K30K15J99J80J61J41J20R9P7N2K8Kk1m6o9
$$ 15175 15483 15789 16093 16394 16691 16982 17265 17540 17806 18061 18304 18534 18749 18948 19128 19289 19430 19550 19649 19726 19778 19806 19808 19787 19741 19672
943A9672r3j16j39j60j80k01k19k35k51k65k78k91l01l08l15l21l25l29l31l32l33l31l30
$$ 19672 19579 19463 19324 19164 18984 18783 18564 18329 18078 17813 17535 17244 16943 16635 16320 15999 15674 15345 15014 14682 14349 14018 13688
940A3688l26l24l21l16l12l06l01k96k90k83k76k72k65k58k51k44k38k33k25k18k11k06k01
$$ 13688 13362 13038 12717 12401 12089 11783 11482 11186 10896 10613 10337 10065 9800 9542 9291 9047 8809 8576 8351 8133 7922 7716 7515
938G515j95j89j84j76j72j68j61j57j52j48j43j38j34j31j27j23j18j16j11j08j06j02r9r6
$$ 7515 7320 7131 6947 6771 6599 6431 6270 6113 5961 5813 5670 5532 5398 5267 5140 5017 4899 4783 4672 4564 4458 4356 4257 4161
935D161r4r0q8q5q2q1p8p6p5p3p0o9o6o4o3o1o0n7n7n5n3n2n2n0m9m7m6m4m4m4m1m0m1l9l8
$$ 4161 4067 3977 3889 3804 3722 3641 3563 3487 3412 3339 3269 3200 3134 3070 3007 2946 2886 2829 2772 2717 2664 2612 2560 2510 2461 2414 2368 2324 2280 2236 2195 2155 2114 2075 2037
932B037l8l7l6l5l4l2l2l1l0l0k8k7k6k6k6k5k5k6k6k6k7k4k4k4k2k2k1k1k0k0j9j8j8j7j7
$$ 2037 1999 1962 1926 1891 1857 1825 1793 1762 1732 1702 1674 1647 1621 1595 1569 1544 1519 1493 1467 1441 1414 1390 1366 1342 1320 1298 1277 1256 1236 1216 1197 1179 1161 1144 1127
928A127j7j7j6j5j5j5j5j4j3j2j3j1j2j3j3j3j2j2j1j1j0j0j0rrj0rrrrrj0qrpqppoppopo
$$ 1127 1110 1093 1077 1062 1047 1032 1017 1003 990 978 965 954 942 929 916 903 891 879 868 857 847 837 827 818 809 799 790 781 772 763 754 744 736 727 720 712 705 698 692 685 678 672 665 659
923F59nnooonnmnnonmnnmnmmmnmllmmllllklklklllmlmmnmlkllllmmllmnlmlmnnmlmllllm
$$ 659 654 649 643 637 631 626 621 617 612 607 601 596 592 587 582 578 573 569 565 561 556 552 549 546 542 538 535 532 529 526 524 521 519 516 514 511 508 505 501 498 494 490 485 481 478 476 473 470 467 464 460 456 453 450 446 441 438 434 431 427 422 417 413 410 406 403 400 397 394 390
916C90kllklkkklllllkkjkjkjk%kj%jjjjj%j%JJK%jJJjjkklnnmmllklmmlmmlkjkklklkkkj
$$ 390 388 385 382 380 377 375 373 371 368 365 362 359 356 354 352 351 349 348 346 345 343 343 341 340 340 339 338 337 336 335 335 334 334 335 336 338 338 337 338 339 338 337 335 333 330 325 320 316 312 309 306 304 301 297 293 290 286 282 279 277 276 274 272 269 267 264 262 260 258 257
909B57ljkjjjjkjjkjjjjj%j%j%JJJ%jJJJKMLLLKKKKJJ%jjllkmnmmllllmlkklkjkjj%jkjjj
$$ 257 254 253 251 250 249 248 247 245 244 243 241 240 239 238 237 236 236 235 235 234 234 235 236 237 237 236 237 238 239 241 245 248 251 254 256 258 260 262 263 264 264 263 262 259 256 254 250 245 241 237 234 231 228 225 221 218 216 214 211 209 208 206 205 204 204 203 201 200 199 198
901A98jjkk%%%%jjjjjJ%j%j%JJ%%JJJJJKLKKLKKJ%%kjkkkkjkkkk%KKKKJjmmmnlllljjk%j%
$$ 198 197 196 194 192 192 192 192 192 191 190 189 188 187 188 188 187 187 186 186 187 188 188 188 189 190 191 192 193 195 198 200 202 205 207 209 210 210 210 208 207 205 203 201 199 198 196 194 192 190 190 192 194 196 198 199 198 194 190 186 181 178 175 172 169 168 167 165 165 164 164
894A64%j%%jjjjjj%j%%%jJ%%J%J%%%JJJJJ%%%jjjj%%J%j%jj%%J%%J%%%J%kjjkjJ%Jj%%J%%
$$ 164 164 163 163 163 162 161 160 159 158 157 157 156 156 156 156 155 156 156 156 157 157 158 158 158 158 159 160 161 162 163 163 163 163 162 161 160 159 159 159 160 160 159 159 158 157 157 157 158 158 158 159 159 159 159 160 160 158 157 156 154 153 154 154 155 154 154 154 155 155 155
886A55%J%J%J%jKJJj%JJJ%JJJJ%JKJJJJJJJ%JKJJJKKJKKKKKLKKJKKKJJKKKKKLKKJJJKJKJK
$$ 155 155 156 156 157 157 158 158 157 159 160 161 160 160 161 162 163 163 164 165 166 167 167 168 170 171 172 173 174 175 176 177 177 178 180 181 182 183 185 187 188 190 192 194 196 198 201 203 205 206 208 210 212 213 214 216 218 220 222 224 227 229 231 232 233 234 236 237 239 240 242
879B42KKKLKJKJ%Jjj%jj%%jKJJJ%J%J%JKKKKKJKKLLKKKJJ%jjkllnonoonnnononnmnnlllkl
$$ 242 244 246 248 251 253 254 256 257 257 258 257 256 256 255 254 254 254 253 255 256 257 258 258 259 259 260 260 261 263 265 267 269 271 272 274 276 279 282 284 286 288 289 290 290 289 288 286 283 280 275 269 264 258 252 247 242 237 231 226 220 215 210 206 201 196 193 190 187 185 182
871A82kkkklmnmmlllklkjkkjkjjjk%j%J%Jjj%jj%%J%jjkkj%%%J%jJ%JJ%J%%%J%%%%JKjjjj
$$ 182 180 178 176 174 171 167 162 158 154 151 148 145 143 140 138 137 135 133 132 130 129 128 127 125 125 124 124 125 125 126 125 124 124 123 122 122 122 123 123 122 121 119 117 116 116 116 116 117 117 116 117 117 118 119 119 120 120 120 120 121 121 121 121 121 122 124 123 122 121 120
864A20jjkk%jjjj%jjjjj%kjjj%%jjk%%%j%J%J%%JJ%J%J%jjjjJ%%Jjj%j%Jj%%%jj%%J%%%%%
$$ 120 119 118 116 114 114 113 112 111 110 110 109 108 107 106 105 105 103 102 101 100 100 100 99 98 96 96 96 96 95 95 96 96 97 97 97 98 99 99 100 100 101 101 100 99 98 97 98 98 98 99 98 97 97 96 96 97 96 96 96 96 95 94 94 94 95 95 95 95 95 95
857I5%%%%J%%%j%jjjj%j%%%JJjjjjj%j%JJ%j%%%j%%j%J%%%%%%J%%%%j%j%j%%%%%JJ%%JJ%%
$$ 95 95 95 95 95 96 96 96 96 95 95 94 93 92 91 91 90 90 90 90 91 92 91 90 89 88 87 87 86 86 87 88 88 87 87 87 87 86 86 86 85 85 86 86 86 86 86 86 86 87 87 87 87 87 86 86 85 85 84 84 84 84 84 84 85 86 86 86 87 88 88 88
849H8jj%jj%jjj%J%%JJJ%jj%j%%%%J%%J%jj%%%%%jjjj%J%%%%%J%%%%%JJ%%%%%%%%J%kjJ%%
$$ 88 87 86 86 85 84 84 83 82 81 81 82 82 82 83 84 85 85 84 83 83 82 82 82 82 82 83 83 83 84 84 83 82 82 82 82 82 82 81 80 79 78 78 79 79 79 79 79 79 80 80 80 80 80 80 81 82 82 82 82 82 82 82 82 82 83 83 81 80 81 81 81
842H1%jJ%%%%%jj%%%jJ%%%j%%j%%%%%%j%J%%%kJ%%JJ%%%j%j%j%%JJJ%J%J%%jj%j%J%j%%j%
$$ 81 81 80 81 81 81 81 81 81 80 79 79 79 79 78 79 79 79 79 78 78 78 77 77 77 77 77 77 77 76 76 77 77 77 77 75 76 76 76 77 78 78 78 78 77 77 76 76 75 75 75 76 77 78 78 79 79 80 80 80 79 78 78 77 77 78 78 77 77 77 76 76
834G6%j%j%JJj%%%%J%%j%%%j%%Jj%%%%%%j%%J%%j%%%%%J%%%J%J%%jjjjJ%%%%Jj%%jJ%%%%J
$$ 76 76 75 75 74 74 75 76 75 75 75 75 75 76 76 76 75 75 75 75 74 74 74 75 74 74 74 74 74 74 74 73 73 73 74 74 74 73 73 73 73 73 73 74 74 74 74 75 75 76 76 76 75 74 73 72 73 73 73 73 73 74 73 73 73 72 73 73 73 73 73 74
827G4j%%J%jj%%%%J%%J%%%j%%%Jj%%%%jJ%%j%%%%j%%%%JJ%%%Jj%jJ%%%%%%%%%%%%%%j%%j%
$$ 74 73 73 73 74 74 73 72 72 72 72 72 73 73 73 74 74 74 74 73 73 73 73 74 73 73 73 73 73 72 73 73 73 72 72 72 72 72 71 71 71 71 71 72 73 73 73 73 74 73 73 72 73 73 73 73 73 73 73 73 73 73 73 73 73 73 73 72 72 72 71 71
819G1%J%%JJ%%jjjJ%%j%%%%%jjJJJj%j%%%%%%%j%%%J%%%%%%%%%%%J%%%J%%%%j%%jj%J%J%j
$$ 71 71 72 72 72 73 74 74 74 73 72 71 72 72 72 71 71 71 71 71 71 70 69 70 71 72 71 71 70 70 70 70 70 70 70 70 69 69 69 69 70 70 70 70 70 70 70 70 70 70 70 70 71 71 71 71 72 72 72 72 72 71 71 71 70 69 69 70 70 71 71 70
811G0%%%%JJ%J%%%%j%%%j%%%%j%jJJ%%%%J%%Jjj%%%%%%%%%%%%j%j%J%%%jJJ%j%JJ%%%%j%%
$$ 70 70 70 70 70 71 72 72 73 73 73 73 73 72 72 72 72 71 71 71 71 71 70 70 69 70 71 71 71 71 71 72 72 72 73 72 71 71 71 71 71 71 71 71 71 71 71 71 71 70 70 69 69 70 70 70 70 69 70 71 71 70 70 71 72 72 72 72 72 71 71 71
804G1%%%J%%%%J%%%%jjj%%JJ%jJ%j%jJ%Jj%jj%%Jj%%%JK%j%%j%j%J%%jJ%%%%%%J%J%%%%%j
$$ 71 71 71 71 72 72 72 72 72 73 73 73 73 73 72 71 70 70 70 71 72 72 71 72 72 71 71 70 71 71 72 71 71 70 69 69 69 70 69 69 69 69 70 72 72 71 71 71 70 70 69 69 70 70 70 69 70 70 70 70 70 70 70 71 71 72 72 72 72 72 72 71
796G1j%%%%%%%Jj%j%%JK%%%%%%jj%%%jJ%J%%jJJ%%kj%J%j%%%%%%%%%%J%jjJJ%%%%%%j%%J%
$$ 71 70 70 70 70 70 70 70 70 71 70 70 69 69 69 70 72 72 72 72 72 72 72 71 70 70 70 70 69 70 70 71 71 71 70 71 72 72 72 70 69 69 70 70 69 69 69 69 69 69 69 69 69 69 69 70 70 69 68 69 70 70 70 70 70 70 70 69 69 69 70 70
789G0%%%%jjJ%J%J%%%%%%%%jjJ%%jJ%%%%%%%j%j%%J%J%%%kj%J%%%J%%J%j%%%%%J%%%j%%%%
$$ 70 70 70 70 70 69 68 69 69 70 70 71 71 71 71 71 71 71 71 71 70 69 70 70 70 69 70 70 70 70 70 70 70 70 69 69 68 68 68 69 69 70 70 70 70 68 67 67 68 68 68 68 69 69 69 70 70 69 69 69 69 69 69 70 70 70 70 69 69 69 69 69
781F9j%%J%jj%%%%%JJ%J%J%%%j%%j%j%%JJ%jJj%%jJjj%JKjjJ%%J%%%%j%%J%Jj%jj%%%Jj%%
$$ 69 68 68 68 69 69 68 67 67 67 67 67 67 68 69 69 70 70 71 71 71 71 70 70 70 69 69 68 68 68 69 70 70 69 70 69 69 69 68 69 68 67 67 68 70 69 68 69 69 69 70 70 70 70 70 69 69 69 70 70 71 70 70 69 68 68 68 68 69 68 68 68
774F8%%%%%%J%%%Jjj%J%%%J%%j%%%%%%%j%%j%%%%%%JJ%%j%%j%%%%%%%%%%JJj%j%%%j%J%jJ
$$ 68 68 68 68 68 68 68 69 69 69 69 70 69 68 68 69 69 69 69 70 70 70 69 69 69 69 69 69 69 69 68 68 68 67 67 67 67 67 67 67 68 69 69 69 68 68 68 67 67 67 67 67 67 67 67 67 67 67 68 69 68 68 67 67 67 67 66 66 67 67 66 67
766F7KJJ%j%%jJjj%Jj%%j%%%%%%jJ%%j%JJ%j%%J%%J%J%jjJJ%%%%k%%%%%%J%%%j%%j%J%%%%
$$ 67 69 70 71 71 70 70 70 69 70 69 68 68 69 68 68 68 67 67 67 67 67 67 67 66 67 67 67 66 66 67 68 68 67 67 67 68 68 68 69 69 70 70 69 68 69 70 70 70 70 70 68 68 68 68 68 68 68 69 69 69 69 68 68 68 67 67 68 68 68 68 68
759F8j%J%%%jJ%JJj%%%j%%%%%j%%%Jj%%%%%%%%J%%%j%j%%JJ%%j%j%%%J%%%%%%%%JJj%%j%j
$$ 68 67 67 68 68 68 68 67 68 68 69 70 69 69 69 69 68 68 68 68 68 68 67 67 67 67 68 67 67 67 67 67 67 67 67 67 68 68 68 68 67 67 66 66 66 67 68 68 68 67 67 66 66 66 66 67 67 67 67 67 67 67 67 67 68 69 68 68 68 67 67 66
751F6%J%%%%J%%%J%%j%%j%j%%J%%JJ%J%jj%%J%%%j%%%%j%JJ%j%J%%%jJJ%j%j%J%%%jJ%%j%
$$ 66 66 67 67 67 67 67 68 68 68 68 69 69 69 68 68 68 67 67 66 66 66 67 67 67 68 69 69 70 70 69 68 68 68 69 69 69 69 68 68 68 68 68 67 67 68 69 69 68 68 69 69 69 69 68 69 70 70 69 69 68 68 69 69 69 69 68 69 69 69 68 68
744F8%j%J%%%%%%J%%jj%%%%%j%%%%JJJJ%%%k%J%%%j%%%%%%j%J%j%%J%%%%%%j%%%%J%j%JJj
$$ 68 68 67 67 68 68 68 68 68 68 68 69 69 69 68 67 67 67 67 67 67 66 66 66 66 66 67 68 69 70 70 70 70 68 68 69 69 69 69 68 68 68 68 68 68 68 67 67 68 68 67 67 67 68 68 68 68 68 68 68 67 67 67 67 67 68 68 67 67 68 69 68
736F8%%J%jj%%%JJ%%%%%j%%%j%%%%%%%%%%J%J%J%%%%%%jjj%J%%%%%%j%%%%%J%%%%%%%j%%%
$$ 68 68 68 69 69 68 67 67 67 67 68 69 69 69 69 69 69 68 68 68 68 67 67 67 67 67 67 67 67 67 67 67 68 68 69 69 70 70 70 70 70 70 70 69 68 67 67 68 68 68 68 68 68 68 67 67 67 67 67 67 68 68 68 68 68 68 68 68 67 67 67 67
729F7Jj%%%j%%J%J%%%%%j%j%%%J%%%%%%%%%jJ%%%%%%%JJJ%%%J%%jkk%%jJ%%K%j%%%J%j%j%
$$ 67 68 67 67 67 67 66 66 66 67 67 68 68 68 68 68 68 67 67 66 66 66 66 67 67 67 67 67 67 67 67 67 67 66 67 67 67 67 67 67 67 67 68 69 70 70 70 70 71 71 71 70 68 66 66 66 65 66 66 66 68 68 67 67 67 67 68 68 67 67 66 66
721F6%%JJj%jJJ%%%%%j%J%jJ%%kjJJ%%j%%J%%%j%J%%%%%%%Jj%%J%%j%j%Jj%j%%JJJ%%j%%j
$$ 66 66 66 67 68 67 67 66 67 68 68 68 68 68 68 67 67 68 68 67 68 68 68 66 65 66 67 67 67 66 66 66 67 67 67 67 66 66 67 67 67 67 67 67 67 67 68 67 67 67 68 68 68 67 67 66 66 67 66 66 65 65 65 66 67 68 68 68 67 67 67 66
714F6%%J%%%%%Jj%J%J%jj%j%%J%%%j%%%%%J%%j%%%%%%%Jj%%%JJJ%j%j%%%j%%J%J%%J%j%jj
$$ 66 66 66 67 67 67 67 67 67 68 67 67 68 68 69 69 68 67 67 66 66 66 67 67 67 67 66 66 66 66 66 66 67 67 67 66 66 66 66 66 66 66 66 67 66 66 66 66 67 68 69 69 68 68 67 67 67 67 66 66 66 67 67 68 68 68 69 69 68 68 67 66
706F6%%%Jj%%%J%%%jj%%%J%%%J%%%%%%%%J%%%j%%%%%%%%%Jjj%J%%%%%j%JJ%J%%j%j%%%%%j
$$ 66 66 66 66 67 66 66 66 66 67 67 67 67 66 65 65 65 65 66 66 66 66 67 67 67 67 67 67 67 67 67 68 68 68 68 67 67 67 67 67 67 67 67 67 67 68 67 66 66 67 67 67 67 67 67 66 66 67 68 68 69 69 69 68 68 67 67 67 67 67 67 66
699F6%JJ%%%j%%%j%%%%%%%%JJ%%%%%j%%%%jj%%J%%%J%jJJ%jj%J%jj%%%%J%%jj%J%%%%J%J%
$$ 66 66 67 68 68 68 68 67 67 67 67 66 66 66 66 66 66 66 66 66 67 68 68 68 68 68 68 67 67 67 67 67 66 65 65 65 66 66 66 66 67 67 66 67 68 68 67 66 66 67 67 66 65 65 65 65 65 66 66 66 65 64 64 65 65 65 65 65 66 66 67 67
691F7%%%%%%%kj%JJ%%J%j%j%%%%%JJj%%%%%%%J%j%j%j%%J%%%%J%%Jj%%%J%%%%%j%JJ%j%%%
$$ 67 67 67 67 67 67 67 67 65 64 64 65 66 66 66 67 67 66 66 65 65 65 65 65 65 66 67 66 66 66 66 66 66 66 66 67 67 66 66 65 65 64 64 64 65 65 65 65 65 66 66 66 67 66 66 66 66 67 67 67 67 67 67 66 66 67 68 68 67 67 67 67
684F7j%%j%JJJ%j%%JJ%jj%jjJ%j%%J%%%%J%%%%jJ%%J%%j%%%Jjj%j%%%%%%J%%%%%j%%%JJ%j
$$ 67 66 66 66 65 65 66 67 68 68 67 67 67 68 69 69 68 67 67 66 65 66 66 65 65 65 66 66 66 66 66 67 67 67 67 67 66 67 67 67 68 68 68 67 67 67 67 68 67 66 66 65 65 65 65 65 65 65 66 66 66 66 66 66 65 65 65 65 66 67 67 66
676F6%%j%%%J%%%J%jJJ%%%j%jj%%%%%%J%%J%%%j%%%%%%%jj%JJJJ%%k%%%J%j%jJ%J%J%j%%%
$$ 66 66 66 65 65 65 65 66 66 66 66 67 67 66 67 68 68 68 68 67 67 66 65 65 65 65 65 65 65 66 66 66 67 67 67 67 66 66 66 66 66 66 66 66 65 64 64 65 66 67 68 68 68 66 66 66 66 67 67 66 66 65 66 66 67 67 68 68 67 67 67 67
669F7Jj%j%%%%%%j%J%%%%%%%%%%%j%%%JJ%%J%j%j%J%%j%jJJ%j%J%%j%jj%jJJJ%%%%%%%J%J
$$ 67 68 67 67 66 66 66 66 66 66 66 65 65 66 66 66 66 66 66 66 66 66 66 66 66 65 65 65 65 66 67 67 67 68 68 67 67 66 66 67 67 67 66 66 65 66 67 67 66 66 67 67 67 66 66 65 64 64 63 64 65 66 66 66 66 66 66 66 66 67 67 68
661F8%j%%J%%%%%%jj%jjJ%%%JjJ%jj%jJ%J%J%j%%J%j%%J%J%%%jj%%J%%j%j%%JJ%%%%%%%%%
$$ 68 68 67 67 67 68 68 68 68 68 68 68 67 66 66 65 64 65 65 65 65 66 65 66 66 65 64 64 63 64 64 65 65 66 66 65 65 65 66 66 65 65 65 66 66 67 67 67 67 66 65 65 65 66 66 66 65 65 64 64 64 65 66 66 66 66 66 66 66 66 66 66
653F6J%JJ%J%%jjk%%%%%Jj%%%j%JJj%j%%%%K%%%%j%j%%%%%%JJ%J%%Jjj%j%j%%JJ%%J%j%%%
$$ 66 67 67 68 69 69 70 70 70 69 68 66 66 66 66 66 66 67 66 66 66 66 65 65 66 67 66 66 65 65 65 65 65 67 67 67 67 67 66 66 65 65 65 65 65 65 65 66 67 67 68 68 68 69 68 67 67 66 66 65 65 65 66 67 67 67 68 68 67 67 67 67
646F7%j%%%Jj%%jJ%J%%%%jJ%%Jj%%J%%%jJj%%JJJ%j%%j%%%%%%%%%jj%J%J%%%jjj%J%%j%j%
$$ 67 67 66 66 66 66 67 66 66 66 65 66 66 67 67 67 67 67 66 67 67 67 68 67 67 67 68 68 68 68 67 68 67 67 67 68 69 70 70 69 69 69 68 68 68 68 68 68 68 68 68 68 67 66 66 67 67 68 68 68 68 67 66 65 65 66 66 66 65 65 64 64
638F4J%%%%%%%J%%%J%J%%%%%%%%%j%%%%%%j%%%%J%j%j%J%%%%%j%%J%JJ%%%%%j%%%%J%J%%j
$$ 64 65 65 65 65 65 65 65 65 66 66 66 66 67 67 68 68 68 68 68 68 68 68 68 68 67 67 67 67 67 67 67 66 66 66 66 66 67 67 66 66 65 65 66 66 66 66 66 66 65 65 65 66 66 67 68 68 68 68 68 68 67 67 67 67 67 68 68 69 69 69 68
631F8%%%%j%%%%%J%%%jJ%j%%%Jj%%%%JJ%Jj%j%J%J%j%j%J%Jjj%%JJ%%%%%%jJ%J%%%%%%%%J
$$ 68 68 68 68 68 67 67 67 67 67 67 68 68 68 68 67 68 68 67 67 67 67 68 67 67 67 67 67 68 69 69 70 69 69 68 68 69 69 70 70 69 69 68 68 69 69 70 69 68 68 68 69 70 70 70 70 70 70 70 69 70 70 71 71 71 71 71 71 71 71 71 72
623G2JJKJ%%JKJJJKJKLLKLOPOQRJ2J1J1OLjqj1j2j1rpmmkjj%kjkklkllj%jjjjjjj%%%jj%J
$$ 72 73 74 76 77 77 77 78 80 81 82 83 85 86 88 91 94 96 99 105 112 118 126 135 147 158 169 175 178 177 169 158 146 135 126 119 115 111 109 108 107 107 105 104 102 100 97 95 92 89 88 88 87 86 85 84 83 82 81 81 81 81 80 79 79 80
617H0JJ%jJKLKJKKLLKLMMOOORJ0J3J5J8K2K6K6K2J3%j7k7l1k6k1j6j1qolk%lmnnoonmljjl
$$ 80 81 82 82 81 82 84 87 89 90 92 94 97 100 102 105 109 113 119 125 131 140 150 163 178 196 218 244 270 292 305 305 288 261 230 204 183 167 156 148 142 139 137 137 134 130 125 120 114 108 103 99 96 95 94 91
611I1kkk%jj%j%jj%%%%%%%j%%%JJ%KJJKJKLMNNONORJ0J2J3J1P%qj2j5j4j1romlkjkklllkl
$$ 91 89 87 85 85 84 83 83 82 82 81 80 80 80 80 80 80 80 80 79 79 79 79 80 81 81 83 84 85 87 88 90 93 97 102 107 113 118 124 133 143 155 168 179 186 186 178 166 151 137 126 117 111 107 104 102 101 99 97 94 91 88 86 83
604H3kkkj%%j%%%j%j%j%%j%%%J%j%%%%j%j%%J%%%%j%%J%j%%%JJ%%jjjj%%jJJ%%j%%%%jKJ%
$$ 83 81 79 77 76 76 76 75 75 75 75 74 74 73 73 72 72 72 71 71 71 71 72 72 71 71 71 71 71 70 70 69 69 69 70 70 70 70 70 69 69 69 70 70 69 69 69 69 70 71 71 71 70 69 68 67 67 67 66 67 68 68 68 67 67 67 67 67 66 68 69 69
596F9j%j%jJ%%J%%%%%J%%%%%jjJJJ%jj%J%%J%%%jJj%%%%%%%%J%%%%%%%%%%J%%Jjjj%%%J%j
$$ 69 68 68 67 67 66 67 67 67 68 68 68 68 68 68 69 69 69 69 69 69 68 67 68 69 70 70 69 68 68 69 69 69 70 70 70 70 69 70 69 69 69 69 69 69 69 69 69 70 70 70 70 70 70 70 70 70 70 70 71 71 71 72 71 70 69 69 69 69 70 70 69
589F9%%J%K%%%j%%%J%%%J%%j%JJJ%%%%j%j%%%%j%%J%j%J%%%%%j%%%j%%jJJ%j%J%J%j%%%J%
$$ 69 69 69 70 70 72 72 72 72 71 71 71 71 72 72 72 72 73 73 73 72 72 73 74 75 75 75 75 75 74 74 73 73 73 73 73 72 72 72 73 73 72 72 73 73 73 73 73 73 72 72 72 72 71 71 71 70 71 72 72 71 71 72 72 73 73 72 72 72 72 73 73
581G3%%jj%%%%J%%%%J%%J%%jj%j%j%J%%J%%%%jJJjj%%%%%j%J%%%J%%%%%%jj%%%%%J%%%%%j
$$ 73 73 73 72 71 71 71 71 71 72 72 72 72 72 73 73 73 74 74 74 73 72 72 71 71 70 70 71 71 71 72 72 72 72 72 71 72 73 72 71 71 71 71 71 71 70 70 71 71 71 71 72 72 72 72 72 72 72 71 70 70 70 70 70 70 71 71 71 71 71 71 70
574G0j%j%j%%%%%JJ%%%%%J%%%jJ%%%%jjJ%J%jjj%%%%%%jjJ%JJ%%Kj%j%%J%%jj%j%jJJ%J%J
$$ 70 69 69 68 68 67 67 67 67 67 67 68 69 69 69 69 69 69 70 70 70 70 69 70 70 70 70 70 69 68 69 69 70 70 69 68 67 67 67 67 67 67 67 66 65 66 66 67 68 68 68 70 69 69 68 68 68 69 69 69 68 67 67 66 66 65 66 67 67 68 68 69
566F9%%%%j%jJ%%%%%j%%%J%j%%%%%j%jj%JK%%%%%%%J%%J%Jjj%%j%%j%JJ%%%j%%jjJ%%JJ%%
$$ 69 69 69 69 69 68 68 67 68 68 68 68 68 68 67 67 67 67 68 68 67 67 67 67 67 67 66 66 65 64 64 65 67 67 67 67 67 67 67 67 68 68 68 69 69 70 69 68 68 68 67 67 67 66 66 67 68 68 68 68 67 67 67 66 65 66 66 66 67 68 68 68
559F8%j%%%%j%J%Jj%j%%%jJJ%J%%%%jj%jj%J%JJjj%jJJjj%JJ%%%%%%%jjJ%jK%%j%%Jj%%%%
$$ 68 68 67 67 67 67 67 66 66 67 67 68 67 67 66 66 66 66 65 66 67 67 68 68 68 68 68 67 66 66 65 64 64 65 65 66 67 66 65 65 64 65 66 65 64 64 65 66 66 66 66 66 66 66 66 65 64 65 65 64 66 66 66 65 65 65 66 65 65 65 65 65
551F5J%%jj%J%J%JJ%%j%%%%j%%jj%j%J%%%%J%J%%%%%j%%%%jJ%j%jjJ%%%J%J%j%%%%%%J%jj
$$ 65 66 66 66 65 64 64 65 65 66 66 67 68 68 68 67 67 67 67 67 66 66 66 65 64 64 63 63 64 64 64 64 64 65 65 66 66 66 66 66 66 65 65 65 65 65 64 65 65 64 64 63 62 63 63 63 63 64 64 65 65 64 64 64 64 64 64 64 65 65 64 63
544F3J%%%%%j%%%%j%%%%%j%%JJ%J%%%%%%%%J%j%%%J%%%j%%jJ%J%%%JjjJ%J%%%j%%%%%%%%%
$$ 63 64 64 64 64 64 64 63 63 63 63 63 62 62 62 62 62 62 61 61 61 62 63 63 64 64 64 64 64 64 64 64 64 65 65 64 64 64 64 65 65 65 65 64 64 64 63 64 64 65 65 65 65 66 65 64 65 65 66 66 66 66 65 65 65 65 65 65 65 65 65 65
536F5jj%Jjjj%%JJ%%%%%%%%%%%%%%%%%%%%%jJJ%Jj%%jk%J%JJ%j%%%Jj%%%%%%%%%jj%J%%J%
$$ 65 64 63 63 64 63 62 61 61 61 62 63 63 63 63 63 63 63 63 63 63 63 63 63 63 63 63 63 63 63 63 63 63 62 63 64 64 65 64 64 64 63 61 61 62 62 63 64 64 63 63 63 63 64 63 63 63 63 63 63 63 63 63 63 62 61 61 62 62 62 63 63
529F3JJj%j%j%%%%%%J%j%%%J%%J%%%%%%j%%%%J%j%JJ%J%j%%%j%%%%%%%%J%j%%JJ%%j%jj%j
$$ 63 64 65 64 64 63 63 62 62 62 62 62 62 62 63 63 62 62 62 62 63 63 63 64 64 64 64 64 64 64 63 63 63 63 63 64 64 63 63 64 65 65 66 66 65 65 65 65 64 64 64 64 64 64 64 64 64 65 65 64 64 64 65 66 66 66 65 65 64 63 63 62
521F2jJJ%%%%%%J%%jj%J%%%%%jj%J%%J%%j%JJJj%%%k%%%%%%%%%J%%j%%J%j%%J%j%JJ%%%%%
$$ 62 61 62 63 63 63 63 63 63 63 64 64 64 63 62 62 63 63 63 63 63 63 62 61 61 62 62 62 63 63 63 62 62 63 64 65 64 64 64 64 62 62 62 62 62 62 62 62 62 62 63 63 63 62 62 62 63 63 62 62 62 63 63 62 62 63 64 64 64 64 64 64
514F4%%%%%Jjj%%J%Jj%j%%J%jj%%%jJ%%%JJJ%j%jk%%J%%JJJ%%j%J%j%%j%J%%%%%jj%%%%%%
$$ 64 64 64 64 64 64 65 64 63 63 63 64 64 65 64 64 63 63 63 64 64 63 62 62 62 62 61 62 62 62 62 63 64 65 65 64 64 63 61 61 61 62 62 62 63 64 65 65 65 64 64 65 65 64 64 64 63 63 64 64 64 64 64 64 63 62 62 62 62 62 62 62
506F2%j%J%JJJ%%%jjj%%J%%%j%j%j%JJ%J%J%j%%Jj%%%%%%%J%%%%j%%jjJ%JjjJ%%%JJ%%%%%
$$ 62 62 61 61 62 62 63 64 65 65 65 65 64 63 62 62 62 63 63 63 63 62 62 61 61 60 60 61 62 62 63 63 64 64 63 63 63 64 63 63 63 63 63 63 63 63 64 64 64 64 64 63 63 63 62 61 62 62 63 62 61 62 62 62 62 63 64 64 64 64 64 64
499F4%j%%%%%%%%%%J%%%%j%jj%%J%%%%J%j%%Jj%%J%jJ%%%%j%J%j%%JJ%%%%j%j%%%j%%J%%%
$$ 64 64 63 63 63 63 63 63 63 63 63 63 63 64 64 64 64 64 63 63 62 61 61 61 62 62 62 62 62 63 63 62 62 62 63 62 62 62 63 63 62 63 63 63 63 63 62 62 63 63 62 62 62 63 64 64 64 64 64 63 63 62 62 62 62 61 61 61 62 62 62 62
491F2jJJ%j%%%J%%%%jJJ%%j%j%JJj%%j%%%J%%%J%%%J%%jj%%%%%%%%%%%%j%%J%%j%JJ%%%%J
$$ 62 61 62 63 63 62 62 62 62 63 63 63 63 63 62 63 64 64 64 63 63 62 62 63 64 63 63 63 62 62 62 62 63 63 63 63 64 64 64 64 65 65 65 64 63 63 63 63 63 63 63 63 63 63 63 63 63 62 62 62 63 63 63 62 62 63 64 64 64 64 64 65
484F5%%%%%jj%%%j%J%%J%%%%%%j%%%%%%%%%%%%%%%%%%%%%j%J%%J%%%jJ%%%kjJJJJ%%%jj%J
$$ 65 65 65 65 65 65 64 63 63 63 63 62 62 63 63 63 64 64 64 64 64 64 64 63 63 63 63 63 63 63 63 63 63 63 63 63 63 63 63 63 63 63 63 63 63 62 62 63 63 63 64 64 64 64 63 64 64 64 64 62 61 62 63 64 65 65 65 65 64 63 63 64
476F4%jjJ%%jJ%%%%jJJ%%%J%J%j%%%jj%%Jj%%jJJ%Jj%%%j%%%%j%jKJ%%jj%jJ%%jJJj%j%%J
$$ 64 64 63 62 63 63 63 62 63 63 63 63 63 62 63 64 64 64 64 65 65 66 66 65 65 65 65 64 63 63 63 64 63 63 63 62 63 64 64 65 64 64 64 64 63 63 63 63 63 62 62 61 63 64 64 64 63 62 62 61 62 62 62 61 62 63 62 62 61 61 61 62
469F2%%J%J%%jjJ%J%jJ%%%%%jj%J%J%j%%%%%jj%jJ%%J%JJ%%j%Jjj%J%J%j%%%%%%%J%J%j%j
$$ 62 62 62 63 63 64 64 64 63 62 63 63 64 64 63 64 64 64 64 64 64 63 62 62 63 63 64 64 63 63 63 63 63 63 62 61 61 60 61 61 61 62 62 63 64 64 64 63 63 64 63 62 62 63 63 64 64 63 63 63 63 63 63 63 63 64 64 65 65 64 64 63
461F3j%%j%%%j%%JJj%%J%J%%%%j%%%%%%%%%J%%%j%j%jJ%J%%%j%J%%JjjJ%%Jj%%%%%%J%%jj
$$ 63 62 62 62 61 61 61 61 60 60 60 61 62 61 61 61 62 62 63 63 63 63 63 62 62 62 62 62 62 62 62 62 62 63 63 63 63 62 62 61 61 60 61 61 62 62 62 62 61 61 62 62 62 63 62 61 62 62 62 63 62 62 62 62 62 62 62 63 63 63 62 61
454F1J%%jJ%%%JJj%%j%%j%%J%%J%%jJ%%%jj%%JJ%J%%jj%j%%%J%%jJJj%%%%%%%%%%%%J%%j%
$$ 61 62 62 62 61 62 62 62 62 63 64 63 63 63 62 62 62 61 61 61 62 62 62 63 63 63 62 63 63 63 63 62 61 61 61 62 63 63 64 64 64 63 62 62 61 61 61 61 62 62 62 61 62 63 62 62 62 62 62 62 62 62 62 62 62 62 62 63 63 63 62 62
446F2%%J%J%jjk%%J%J%j%%%%Jj%%J%J%%j%%%%JjjjJJJjjJ%%J%%%%%%jj%%JK%%j%%%%%j%%%
$$ 62 62 62 63 63 64 64 63 62 60 60 60 61 61 62 62 61 61 61 61 61 62 61 61 61 62 62 63 63 63 62 62 62 62 62 63 62 61 60 61 62 63 62 61 62 62 62 63 63 63 63 63 63 63 62 61 61 61 62 64 64 64 63 63 63 63 63 63 62 62 62 62
438F2J%%%%%j%%jJ%%%%%J%%kj%KJJJj%j%%%%j%%JJjj%%%J%%j%j%j%%%JJ%%%Jj%%%%%%J%J%
$$ 62 63 63 63 63 63 63 62 62 62 61 62 62 62 62 62 62 63 63 63 61 60 60 62 63 64 65 64 64 63 63 63 63 63 62 62 62 63 64 63 62 62 62 62 63 63 63 62 62 61 61 60 60 60 60 61 62 62 62 62 63 62 62 62 62 62 62 62 63 63 64 64
431F4%j%J%%jjjJ%%jJ%%J%%%jJ%%%%J%%%k%J%%%%%%%%j%%jJ%%%j%JJ%%%%j%%j%%%J%%%Jjj
$$ 64 64 63 63 64 64 64 63 62 61 62 62 62 61 62 62 62 63 63 63 63 62 63 63 63 63 63 64 64 64 64 62 62 63 63 63 63 63 63 63 63 63 62 62 62 61 62 62 62 62 61 61 62 63 63 63 63 63 62 62 62 61 61 61 61 62 62 62 62 63 62 61
423F1%%J%%j%%J%%%J%jj%%%%%jJ%jjJj%KJ%%%%JJ%%j%jJ%%%%j%Jj%%%%%J%%%%j%%%j%%JJ%
$$ 61 61 61 62 62 62 61 61 61 62 62 62 62 63 63 62 61 61 61 61 61 61 60 61 61 60 59 60 59 59 61 62 62 62 62 62 63 64 64 64 63 63 62 63 63 63 63 63 62 62 63 62 62 62 62 62 62 63 63 63 63 63 62 62 62 62 61 61 61 62 63 63
416F3j%%J%j%%J%%%jj%J%J%j%%%jj%J%Jj%JJ%%%jjJ%%%%%jJ%%%%j%JJ%%j%%%%%%%%%%j%jJ
$$ 63 62 62 62 63 63 62 62 62 63 63 63 63 62 61 61 62 62 63 63 62 62 62 62 61 60 60 61 61 62 61 61 62 63 63 63 63 62 61 62 62 62 62 62 62 61 62 62 62 62 62 61 61 62 63 63 63 62 62 62 62 62 62 62 62 62 62 62 61 61 60 61
408F1%J%Jjj%%%%J%%%j%J%%%%J%%%%%%%%j%%J%%jj%%%J%%JJ%J%Jjjjj%j%JJ%JJJ%j%%%%%%
$$ 61 61 62 62 63 62 61 61 61 61 61 62 62 62 62 61 61 62 62 62 62 62 63 63 63 63 63 63 63 63 63 62 62 62 63 63 63 62 61 61 61 61 62 62 62 63 64 64 65 65 66 65 64 63 62 62 61 61 62 63 63 64 65 66 66 65 65 65 65 65 65 65
401F5%j%%j%j%%%%%J%j%%J%%jJ%%%j%j%%%JJJ%j%%j%%%%%J%%%jjj%JJ%JJ%jj%%%%J%%jJj%
$$ 65 65 64 64 64 63 63 62 62 62 62 62 62 63 63 62 62 62 63 63 63 62 63 63 63 63 62 62 61 61 61 61 62 63 64 64 63 63 63 62 62 62 62 62 62 63 63 63 63 62 61 60 60 61 62 62 63 64 64 63 62 62 62 62 62 63 63 63 62 63 62 62
393F2J%%jjjJ%%%%%J%%%J%%J%%%%j%j%j%%%%JJj%%%%%%J%%j%%%%%%J%%j%%%%%%J%%%%kj%J
$$ 62 63 63 63 62 61 60 61 61 61 61 61 61 62 62 62 62 63 63 63 64 64 64 64 64 63 63 62 62 61 61 61 61 61 62 63 62 62 62 62 62 62 62 63 63 63 62 62 62 62 62 62 62 63 63 63 62 62 62 62 62 62 62 63 63 63 63 63 61 60 60 61
386F1J%%%%J%%%%%%%%%%k%%J%%%J%%j%jJ%j%J%%%%%JJ%%%j%j%jJ%%%JJ%%%%%%jj%%%%%%J%
$$ 61 62 62 62 62 62 63 63 63 63 63 63 63 63 63 63 63 61 61 61 62 62 62 62 63 63 63 62 62 61 62 62 61 61 62 62 62 62 62 62 63 64 64 64 64 63 63 62 62 61 62 62 62 62 63 64 64 64 64 64 64 64 63 62 62 62 62 62 62 62 63 63
378F3j%j%j%JJJjJ%%%%%J%J%%jjjjJJJj%%j%J%%j%J%%%%jkJ%JjjJ%%%%%%%j%J%%Jj%J%jj%
$$ 63 62 62 61 61 60 60 61 62 63 62 63 63 63 63 63 63 64 64 65 65 65 64 63 62 61 62 63 64 63 63 63 62 62 63 63 63 62 62 63 63 63 63 63 62 60 61 61 62 61 60 61 61 61 61 61 61 61 61 60 60 61 61 61 62 61 61 62 62 61 60 60
371F0K%%jj%JJJ%j%%%%%J%%%%%%%%Jkj%Jj%%%%%%%%%%%J%%%J%%j%j%%J%%%%%j%%%%JJ%Jjj
$$ 60 62 62 62 61 60 60 61 62 63 63 62 62 62 62 62 62 63 63 63 63 63 63 63 63 63 64 62 61 61 62 61 61 61 61 61 61 61 61 61 61 61 61 62 62 62 62 63 63 63 62 62 61 61 61 62 62 62 62 62 62 61 61 61 61 61 62 63 63 64 63 62
363F2%j%J%%%%J%%j%J%%%%%%J%jj%JJjjj%J%%%%j%J%jj%%JJ%j%j%J%%J%%%%%j%JJjk%%%J%
$$ 62 62 61 61 62 62 62 62 62 63 63 63 62 62 63 63 63 63 63 63 63 64 64 63 62 62 63 64 63 62 61 61 62 62 62 62 62 61 61 62 62 61 60 60 60 61 62 62 61 61 60 60 61 61 61 62 62 62 62 62 62 61 61 62 63 62 60 60 60 60 61 61
356F1JJ%%%%%J%%%%j%j%%%%%%%%%%%%%%j%%%j%Jj%JJ%%%j%%%%%J%%J%%%%%Jj%%%J%%jj%%%
$$ 61 62 63 63 63 63 63 63 64 64 64 64 64 63 63 62 62 62 62 62 62 62 62 62 62 62 62 62 62 62 61 61 61 61 60 60 61 60 60 61 62 62 62 62 61 61 61 61 61 61 62 62 62 63 63 63 63 63 63 64 63 63 63 63 64 64 64 63 62 62 62 62
348F2J%jJ%%%%J%j%%%jjj%%%%%JJ%jj%%%%%JJ%jjJJJ%%%%%JjkjJ%j%%J%%%j%J%%%J%%J%%%
$$ 62 63 63 62 63 63 63 63 63 64 64 63 63 63 63 62 61 60 60 60 60 60 60 61 62 62 61 60 60 60 60 60 60 61 62 62 61 60 61 62 63 63 63 63 63 63 64 63 61 60 61 61 60 60 60 61 61 61 61 60 60 61 61 61 61 62 62 62 63 63 63 63
341F3jj%jJ%j%%JJ%%%%j%%jJ%%%%%%jJJJj%jj%%Jj%%%J%%%%J%%%%j%%J%%%%j%%j%%%JJ%%%
$$ 63 62 61 61 60 61 61 60 60 60 61 62 62 62 62 62 61 61 61 60 61 61 61 61 61 61 61 60 61 62 63 62 62 61 60 60 60 61 60 60 60 60 61 61 61 61 61 62 62 62 62 62 61 61 61 62 62 62 62 62 61 61 61 60 60 60 60 61 62 62 62 62
333F2%j%%JJJjj%jjJ%%%jJ%jjJ%J%%jj%%J%J%%%j%%J%%%%J%%%%Jj%kj%%%jJJ%%%JJJ%%%%j
$$ 62 62 61 61 61 62 63 64 63 62 62 61 60 61 61 61 61 60 61 61 60 59 60 60 61 61 61 60 59 59 59 60 60 61 61 61 61 60 60 60 61 61 61 61 61 62 62 62 62 62 63 62 62 60 59 59 59 59 58 59 60 60 60 60 61 62 63 63 63 63 63 62
326F2j%%%J%j%jJJjj%jJ%JJ%j%%%%%%%k%%JKj%%%%jJ%j%%j%%JJ%%%j%%%J%jJ%J%%%%j%%%%
$$ 62 61 61 61 61 62 62 61 61 60 61 62 61 60 60 59 60 60 61 62 62 61 61 61 61 61 61 61 61 59 59 59 60 62 61 61 61 61 61 60 61 61 60 60 60 59 59 59 60 61 61 61 61 60 60 60 60 61 61 60 61 61 62 62 62 62 62 61 61 61 61 61
318F1%%%%J%%%%j%%j%%%%%%%j%%%%J%Jj%j%J%%J%%%%j%J%%%%j%%%%J%%J%%%%j%%JJ%%j%j%
$$ 61 61 61 61 61 62 62 62 62 62 61 61 61 60 60 60 60 60 60 60 60 59 59 59 59 59 60 60 61 60 60 59 59 60 60 60 61 61 61 61 61 60 60 61 61 61 61 61 60 60 60 60 60 61 61 61 62 62 62 62 62 61 61 61 62 63 63 63 62 62 61 61
311F1%j%%%%%j%%%%%%%%%JJ%%%%J%%Jj%%%%%%j%%%j%%%%%%%%%J%%%%%jJ%%j%j%J%%%%J%%j
$$ 61 61 60 60 60 60 60 60 59 59 59 59 59 59 59 59 59 59 60 61 61 61 61 61 62 62 62 63 62 62 62 62 62 62 62 61 61 61 61 60 60 60 60 60 60 60 60 60 60 61 61 61 61 61 61 60 61 61 61 60 60 59 59 60 60 60 60 60 61 61 61 60
303F0%%J%jj%%%%%Jj%%%%%J%J%%j%J%j%%J%%j%%%%%%%%JJj%j%jjJ%JJj%%%%%J%%%%%%%jj%
$$ 60 60 60 61 61 60 59 59 59 59 59 59 60 59 59 59 59 59 59 60 60 61 61 61 60 60 61 61 60 60 60 61 61 61 60 60 60 60 60 60 60 60 60 61 62 61 61 60 60 59 58 59 59 60 61 60 60 60 60 60 60 61 61 61 61 61 61 61 61 60 59 59
296E9%%%JJ%%jj%%%jJ%%J%%%%%%j%%%%JKJ%%%%%%j%jjj%%%%J%%J%jj%%%%JJj%%Jj%%%%j%%
$$ 59 59 59 59 60 61 61 61 60 59 59 59 59 58 59 59 59 60 60 60 60 60 60 60 59 59 59 59 59 60 62 63 63 63 63 63 63 63 62 62 61 60 59 59 59 59 59 60 60 60 61 61 60 59 59 59 59 59 60 61 60 60 60 61 60 60 60 60 60 59 59 59
288E9%J%%J%%jjjJJJ%J%%%jJj%%%%%j%%%%%J%%%%%j%%%%Jj%k%JJ%J%%%J%%%jJ%%%j%%%j%%
$$ 59 59 60 60 60 61 61 61 60 59 58 59 60 61 61 62 62 62 62 61 62 61 61 61 61 61 61 60 60 60 60 60 60 61 61 61 61 61 61 60 60 60 60 60 61 60 60 58 58 59 60 60 61 61 61 61 62 62 62 62 61 62 62 62 62 61 61 61 61 60 60 60
280F0%%%%%%%JJ%jj%JJ%%jj%J%%jjJ%%Jj%%j%%%jJ%%%JJ%%jj%JJJ%%%%%%%jj%%%%Jj%%jJ%
$$ 60 60 60 60 60 60 60 60 61 62 62 61 60 60 61 62 62 62 61 60 60 61 61 61 60 59 60 60 60 61 60 60 60 59 59 59 59 58 59 59 59 59 60 61 61 61 60 59 59 60 61 62 62 62 62 62 62 62 62 61 60 60 60 60 60 61 60 60 60 59 60 60
273F0jjJ%%J%%J%%%%%%Jj%jj%%%j%%%%%%%%J%jJJj%J%%%%J%%jj%%%%J%Jj%%jJJj%%Jj%%j%
$$ 60 59 58 59 59 59 60 60 60 61 61 61 61 61 61 61 62 61 61 60 59 59 59 59 58 58 58 58 58 58 58 58 58 59 59 58 59 60 59 59 60 60 60 60 60 61 61 61 60 59 59 59 59 59 60 60 61 60 60 60 59 60 61 60 60 60 61 60 60 60 59 59
265E9%%j%jJJJJ%%j%j%%J%j%jJJ%%%jJJj%j%JJ%%%%jj%%JJ%J%%J%%k%%%jj%J%%J%%j%%%J%
$$ 59 59 59 58 58 57 58 59 60 61 61 61 60 60 59 59 59 60 60 59 59 58 59 60 60 60 60 59 60 61 60 60 59 59 60 61 61 61 61 61 60 59 59 59 60 61 61 62 62 62 63 63 63 61 61 61 61 60 59 59 60 60 60 61 61 61 60 60 60 60 61 61
258F1%%jJ%j%%%%%%j%%J%%JJ%J%jj%j%%%%J%%jj%j%J%J%%%J%j%%J%%j%%%%%Jj%jjjJJ%%Jj
$$ 61 61 61 60 61 61 60 60 60 60 60 60 60 59 59 59 60 60 60 61 62 62 63 63 62 61 61 60 60 60 60 60 61 61 61 60 59 59 58 58 59 59 60 60 60 60 61 61 60 60 60 61 61 61 60 60 60 60 60 60 61 60 60 59 58 57 58 59 59 59 60 59
250E9%%%jj%%JJ%%%%%%%J%%%%%%%J%%j%jj%J%%J%%%%Jjj%jJ%%%%%%Jj%%%j%J%j%%%J%%J%%
$$ 59 59 59 59 58 57 57 57 58 59 59 59 59 59 59 59 59 60 60 60 60 60 60 60 60 61 61 61 60 60 59 58 58 59 59 59 60 60 60 60 60 61 60 59 59 58 59 59 59 59 59 59 59 60 59 59 59 59 58 58 59 59 58 58 58 58 59 59 59 60 60 60
243F0%Jj%%jJ%JJ%%jj%%%%%J%%%j%%%%%%%j%%%%%J%%%%J%%%%jj%%j%J%%%%%%J%%jJ%%%j%%
$$ 60 60 61 60 60 60 59 60 60 61 62 62 62 61 60 60 60 60 60 60 61 61 61 61 60 60 60 60 60 60 60 60 59 59 59 59 59 59 60 60 60 60 60 61 61 61 61 61 60 59 59 59 58 58 59 59 59 59 59 59 59 60 60 60 59 60 60 60 60 59 59 59
235E9%jJ%%J%j%%jJ%Jj%%%jJJj%%%%J%%j%%Jj%jJ%j%%JJj%jJ%KJj%jj%%%J%j%%JJjj%%J%%
$$ 59 59 58 59 59 59 60 60 59 59 59 58 59 59 60 59 59 59 59 58 59 60 59 59 59 59 59 60 60 60 59 59 59 60 59 59 58 59 59 58 58 58 59 60 59 59 58 59 59 61 62 61 61 60 59 59 59 59 60 60 59 59 59 60 61 60 59 59 59 60 60 60
228F0J%%j%%%%%%j%%%%J%%%J%%%j%%%%%%%J%%j%%%%%J%%kj%J%%%%%jJJJ%j%jj%%%%%%%j%%
$$ 60 61 61 61 60 60 60 60 60 60 60 59 59 59 59 59 60 60 60 60 61 61 61 61 60 60 60 60 60 60 60 60 61 61 61 60 60 60 60 60 60 61 61 61 59 58 58 59 59 59 59 59 59 58 59 60 61 61 60 60 59 58 58 58 58 58 58 58 58 57 57 57
220E7%JJ%%j%%jJ%%J%J%%%%%%jJ%%j%jj%JJ%%%%J%%%%%%%%%jjJJ%%%j%%%%Jj%JJ%j%jjj%J
$$ 57 57 58 59 59 59 58 58 58 57 58 58 58 59 59 60 60 60 60 60 60 60 59 60 60 60 59 59 58 57 57 58 59 59 59 59 59 60 60 60 60 60 60 60 60 60 60 59 58 59 60 60 60 60 59 59 59 59 59 60 59 59 60 61 61 60 60 59 58 57 57 58
213E8%%%J%Jj%%J%%%%%%%%j%%%%%%%j%%J%%%%%J%%%jj%J%JJ%%%%%j%J%%%%%%j%%%j%J%%%J
$$ 58 58 58 58 59 59 60 59 59 59 60 60 60 60 60 60 60 60 60 59 59 59 59 59 59 59 59 58 58 58 59 59 59 59 59 59 60 60 60 60 59 58 58 59 59 60 61 61 61 61 61 61 60 60 61 61 61 61 61 61 61 60 60 60 60 59 59 60 60 60 60 61
205F1%%%jj%%%%%JJ%%%jj%%%%%%%%j%%%%%Jj%%%JJ%%%jjj%JjJ%%%%%%J%%J%%%%Jj%jJ%%%%
$$ 61 61 61 61 60 59 59 59 59 59 59 60 61 61 61 61 60 59 59 59 59 59 59 59 59 59 58 58 58 58 58 58 59 58 58 58 58 59 60 60 60 60 59 58 57 57 58 57 58 58 58 58 58 58 58 59 59 59 60 60 60 60 60 61 60 60 59 60 60 60 60 60
198F0%%J%j%%%%%%j%%%J%j%%%j%j%Jj%%%%J%J%J%%%Jj%j%%KJj%%j%%%%%j%%%j%JJ%jj%%JJ
$$ 60 60 60 61 61 60 60 60 60 60 60 60 59 59 59 59 60 60 59 59 59 59 58 58 57 57 58 57 57 57 57 57 58 58 59 59 60 60 60 60 61 60 60 59 59 59 61 62 61 61 61 60 60 60 60 60 60 59 59 59 59 58 58 59 60 60 59 58 58 58 59 60
190F0%%j%j%JJ%%j%%%jJ%%%j%%%%%%JJj%%j%jjJ%J%%%%%%%%J%Jj%j%%%%%%%%Jj%J%%%%jJJ
$$ 60 60 60 59 59 58 58 59 60 60 60 59 59 59 59 58 59 59 59 59 58 58 58 58 58 58 58 59 60 59 59 59 58 58 57 56 57 57 58 58 58 58 58 58 58 58 58 59 59 60 59 59 58 58 58 58 58 58 58 58 58 59 58 58 59 59 59 59 59 58 59 60
183F0%J%jk%JJ%%%%%%j%%j%J%%j%J%%j%J%%%%%jJJJj%%%%%Jj%%Jj%j%%Jj%%j%%%%J%%%J%%
$$ 60 60 61 61 60 58 58 59 60 60 60 60 60 60 60 59 59 59 58 58 59 59 59 58 58 59 59 59 58 58 59 59 59 59 59 59 58 59 60 61 60 60 60 60 60 60 61 60 60 60 61 60 60 59 59 59 60 59 59 59 58 58 58 58 58 59 59 59 59 60 60 60
175F0%jj%%%%%%J%%%JJj%jjjJ%%%J%%%%%%%%%%%%%%%%j%jj%%JJ%J%%%%J%%%%jj%%%%JjJ%%
$$ 60 60 59 58 58 58 58 58 58 58 59 59 59 59 60 61 60 60 59 58 57 58 58 58 58 59 59 59 59 59 59 59 59 59 59 59 59 59 59 59 59 59 58 58 57 56 56 56 57 58 58 59 59 59 59 59 60 60 60 60 60 59 58 58 58 58 58 59 58 59 59 59
168E9%%%j%%j%%%JJ%J%J%%jj%%%%%J%j%j%J%%%j%J%J%jjj%J%%Jj%j%JJJj%j%j%J%Jj%%J%j
$$ 59 59 59 59 58 58 58 57 57 57 57 58 59 59 60 60 61 61 61 60 59 59 59 59 59 59 60 60 59 59 58 58 59 59 59 59 58 58 59 59 60 60 59 58 57 57 58 58 58 59 58 58 57 57 58 59 60 59 59 58 58 57 57 58 58 59 58 58 58 59 59 58
160E8j%J%%%JJJ%%j%%jk%%J%%%%J%j%J%%j%j%JJ%%%Jj%%j%%%%JJJj%j%j%%%%%%%jj%%%%%%
$$ 58 57 57 58 58 58 58 59 60 61 61 61 60 60 60 59 57 57 57 58 58 58 58 58 59 59 58 58 59 59 59 58 58 57 57 58 59 59 59 59 60 59 59 59 58 58 58 58 58 59 60 61 60 60 59 59 58 58 58 58 58 58 58 58 57 56 56 56 56 56 56 56
153E6J%JJj%%%%%J%j%%jJ%%JJ%jjJ%Jjk%%%J%%%%j%%%%J%j%jjJ%J%J%%%%%JjjJJ%%%jjj%J
$$ 56 57 57 58 59 58 58 58 58 58 58 59 59 58 58 58 57 58 58 58 59 60 60 59 58 59 59 60 59 57 57 57 57 58 58 58 58 58 57 57 57 57 57 58 58 57 57 56 55 56 56 57 57 58 58 58 58 58 58 59 58 57 58 59 59 59 59 58 57 56 56 57
145E7J%jJ%%Jj%%%%Jj%%%J%%j%%%%J%J%%J%jjj%j%%%JJ%%jJJ%%j%%%%jjj%JJ%J%%Jjjj%%%
$$ 57 58 58 57 58 58 58 59 58 58 58 58 58 59 58 58 58 58 59 59 59 58 58 58 58 58 59 59 60 60 60 61 61 60 59 58 58 57 57 57 57 58 59 59 59 58 59 60 60 60 59 59 59 59 59 58 57 56 56 57 58 58 59 59 59 60 59 58 57 57 57 57
138E7J%%j%jJ%%%%J%%%%%j%J%%%%%%%jJj%%J%J%jj%%J%%%j%j%JJ%j%JJJj%%%%j%%%%J%%j%
$$ 57 58 58 58 57 57 56 57 57 57 57 57 58 58 58 58 58 58 57 57 58 58 58 58 58 58 58 58 57 58 57 57 57 58 58 59 59 58 57 57 57 58 58 58 58 57 57 56 56 57 58 58 57 57 58 59 60 59 59 59 59 59 58 58 58 58 58 59 59 59 58 58
130E8j%%JJ%%j%%%%Jjjj%%%J%%%%%J%%%%J%j%%%%%J%J%j%%%j%%%%%%%%jj%%J%JJj%%%j%%%
$$ 58 57 57 57 58 59 59 59 58 58 58 58 58 59 58 57 56 56 56 56 57 57 57 57 57 57 58 58 58 58 58 59 59 58 58 58 58 58 58 59 59 60 60 59 59 59 59 58 58 58 58 58 58 58 58 58 57 56 56 56 57 57 58 59 58 58 58 58 57 57 57 57
122E7%J%%%J%%j%J%%J%%j%Jj%%%J%%%%%%%j%%%%%%%%j%%%%jJ%%%j%%J%J%Jj%j%%J%jjJ%JJ
$$ 57 57 58 58 58 58 59 59 59 58 58 59 59 59 60 60 60 59 59 60 59 59 59 59 60 60 60 60 60 60 60 60 59 59 59 59 59 59 59 59 59 58 58 58 58 58 57 58 58 58 58 57 57 57 58 58 59 59 60 59 59 58 58 58 59 59 58 57 58 58 59 60
115F0j%%%%jJJ%%j%%%%%%%%J%jj%j%%%j%%%%J%J%JJ%jj%J%J%%jj%%%Jj%%%%%%%%%%J%%J%%
$$ 60 59 59 59 59 59 58 59 60 60 60 59 59 59 59 59 59 59 59 59 60 60 59 58 58 57 57 57 57 56 56 56 56 56 57 57 58 58 59 60 60 59 58 58 59 59 60 60 60 59 58 58 58 58 59 58 58 58 58 58 58 58 58 58 58 58 59 59 59 60 60 60
107F0%%%%%j%%j%j%%%%%%%%%Jj%J%J%%%%Jjj%jj%JJ%%%JJ%Jjj%j%j%%%%%J%J%%j%%%%%jJJ
$$ 60 60 60 60 60 60 59 59 59 58 58 57 57 57 57 57 57 57 57 57 57 58 57 57 58 58 59 59 59 59 59 60 59 58 58 57 56 56 57 58 58 58 58 59 60 60 61 60 59 59 58 58 57 57 57 57 57 57 58 58 59 59 59 58 58 58 58 58 58 57 58 59
100E9%%jj%JJjj%J%j%%%%J%j%%%%%%J%%%j%%J%%%%%%%%%j%%JJ%%%%%%%%Jjj%%j%%%%%J%%%
$$ 59 59 59 58 57 57 58 59 58 57 57 58 58 57 57 57 57 57 58 58 57 57 57 57 57 57 57 58 58 58 58 57 57 57 58 58 58 58 58 58 58 58 58 58 57 57 57 58 59 59 59 59 59 59 59 59 59 60 59 58 58 58 57 57 57 57 57 57 58 58 58 58
92E8%JJ%%j%%%%%j%jJJ%%%J%Jjj%%%%J%%%j%jj%%J%%%J%J%%jJ%jj%%%jJ%%%%j%JJ%%%%jj%
$$ 58 58 59 60 60 60 59 59 59 59 59 59 58 58 57 58 59 59 59 59 60 60 61 60 59 59 59 59 59 60 60 60 60 59 59 58 57 57 57 58 58 58 58 59 59 60 60 60 59 60 60 59 58 58 58 58 57 58 58 58 58 58 57 57 58 59 59 59 59 59 58 57 57
85E7%j%J%%%jJjjJ%%JJ%%%%%%%%%%%%%j%JJ%jjj%J%%jJ%%%%J%Jjj%K%j%J%%%%j%%j%%%%J%
$$ 57 57 56 56 57 57 57 57 56 57 56 55 56 56 56 57 58 58 58 58 58 58 58 58 58 58 58 58 58 58 57 57 58 59 59 58 57 56 56 57 57 57 56 57 57 57 57 57 58 58 59 58 57 57 59 59 58 58 59 59 59 59 59 58 58 58 57 57 57 57 57 58 58
77E8%%J%%%%jj%%%%%jJ%%%j%%%%J%%J%j%%%%%J%%%%%%j%%J%%%%k%%J%J%%j%j%%%J%j%%J%J
$$ 58 58 58 59 59 59 59 59 58 57 57 57 57 57 57 56 57 57 57 57 56 56 56 56 56 57 57 57 58 58 57 57 57 57 57 57 58 58 58 58 58 58 58 57 57 57 58 58 58 58 58 56 56 56 57 57 58 58 58 57 57 56 56 56 56 57 57 56 56 56 57 57 58
70E8jjjjJ%J%%Jj%jJJJJ%jj%j%J%J%%j%%j%J%%J%%%j%Jj%%Jj%%J%%%j%jjJJ%j%J%%%%%%%j
$$ 58 57 56 55 54 55 55 56 56 56 57 56 56 55 56 57 58 59 59 58 57 57 56 56 57 57 58 58 58 57 57 57 56 56 57 57 57 58 58 58 58 57 57 58 57 57 57 58 57 57 57 58 58 58 58 57 57 56 55 56 57 57 56 56 57 57 57 57 57 57 57 57 56
62E6jJJJ%j%%%j%%J%%J%j%%%J%%%%%%%%%jj%j%J%JJ%%%%%Jjj%%J%%%%J%%%j%jJ%jj%%%J%J
$$ 56 55 56 57 58 58 57 57 57 57 56 56 56 57 57 57 58 58 57 57 57 57 58 58 58 58 58 58 58 58 58 58 57 56 56 55 55 56 56 57 58 58 58 58 58 58 59 58 57 57 57 58 58 58 58 58 59 59 59 59 58 58 57 58 58 57 56 56 56 56 57 57 58
54E8%jJ%J%%jj%%%J%%%J%j%%J%%jj%%%%%%%JJ%JJ%%jjj%jjJ%%%JJj%%j%j%%jJJ%J%J%%Jjj
$$ 58 58 57 58 58 59 59 59 58 57 57 57 57 58 58 58 58 59 59 58 58 58 59 59 59 58 57 57 57 57 57 57 57 57 58 59 59 60 61 61 61 60 59 58 58 57 56 57 57 57 57 58 59 58 58 58 57 57 56 56 56 55 56 57 57 58 58 59 59 59 60 59 58
47E8%J%%%JJJ%%%%j%jj%%%%j%j%%j%JjJ%J%jJ%%Jj%%j%%jjJ%%JJ%%j%%%%J%%%%%j%%%%Jjj
$$ 58 58 59 59 59 59 60 61 62 62 62 62 62 61 61 60 59 59 59 59 59 58 58 57 57 57 56 56 57 56 57 57 58 58 57 58 58 58 59 58 58 58 57 57 57 56 55 56 56 56 57 58 58 58 57 57 57 57 57 58 58 58 58 58 58 57 57 57 57 57 58 57 56
39E6jJJ%%j%%%%%%%%JJj%%J%%%%%j%j%j%%%%Jj%%%%%%J%%%J%jjJ%%J%j%%%%%%J%j%j%JJ%J
$$ 56 55 56 57 57 57 56 56 56 56 56 56 56 56 56 57 58 57 57 57 58 58 58 58 58 58 57 57 56 56 55 55 55 55 55 56 55 55 55 55 55 55 55 56 56 56 56 57 57 56 55 56 56 56 57 57 56 56 56 56 56 56 56 57 57 56 56 55 55 56 57 57 58
31E8jj%J%JJjj%%j%%%%J%%jJ%%%%%%%%Jj%j%jJJ%%%j%%%j%%%J%%%%%%jJ%%J%j%j%jJ%J%%%
$$ 58 57 56 56 57 57 58 59 58 57 57 57 56 56 56 56 56 57 57 57 56 57 57 57 57 57 57 57 57 57 58 57 57 56 56 55 56 57 57 57 57 56 56 56 56 55 55 55 55 56 56 56 56 56 56 56 55 56 56 56 57 57 56 56 55 55 54 55 55 56 56 56 56
24E6JJ%%jjJ%%%%Jj%%%%%%%%%j%jjJ%J%%jj%jJJJ%%%j%JJJ%Jjj%j%%J%%%J%j%%%%%j%J%%%
$$ 56 57 58 58 58 57 56 57 57 57 57 57 58 57 57 57 57 57 57 57 57 57 57 56 56 55 54 55 55 56 56 56 55 54 54 53 54 55 56 56 56 56 55 55 56 57 58 58 59 58 57 57 56 56 56 57 57 57 57 58 58 57 57 57 57 57 57 56 56 57 57 57 57
16E7%%%%j%J%%jjjJJJ%%%jJj%j%%%J%%%%J%%%%%Jjjkj%%%JK%jj%%Jj%%K%%J%%%j%%%%%%%%
$$ 57 57 57 57 57 56 56 57 57 57 56 55 54 55 56 57 57 57 57 56 57 56 56 55 55 55 55 56 56 56 56 56 57 57 57 57 57 57 58 57 56 54 53 53 53 53 54 56 56 55 54 54 54 55 54 54 54 56 56 56 57 57 57 57 56 56 56 56 56 56 56 56 56
8E6J%j%JJJkjJ%%%%JJjj%j%j%%%%%%%%JJjj%%J%%%%%j%j%J%J%J%%%%%%j%%%%%%%%%jJ%%%j
$$ 56 57 57 56 56 57 58 59 57 56 57 57 57 57 57 58 59 58 57 57 56 56 55 55 55 55 55 55 55 55 55 56 57 56 55 55 55 56 56 56 56 56 56 55 55 54 54 55 55 56 56 57 57 57 57 57 57 57 56 56 56 56 56 56 56 56 56 56 55 56 56 56 56 55
1E5%JJ%%%jJ%j%%J%%J%j%%jjJJj%J%%%%%jJ%%j%%%%%%%%j%JJ%j%%%jJJj%JJJjjJjj%j%jJJ
$$ 55 55 56 57 57 57 57 56 57 57 56 56 56 57 57 57 58 58 57 57 57 56 55 56 57 56 56 57 57 57 57 57 57 56 57 57 57 56 56 56 56 56 56 56 56 56 55 55 56 57 57 56 56 56 56 55 56 57 56 56 57 58 59 58 57 58 57 56 56 55 55 54 55 56
-7E6J%%j%%JJj%%%%j%J%j%J%J%jj%%%%%jj%%%J%J%%j%%Jj%JJ%%j%%j%%%JJ%%%j%%j%%%J%%
$$ 56 57 57 57 56 56 56 57 58 57 57 57 57 57 56 56 57 57 56 56 57 57 58 58 57 56 56 56 56 56 56 55 54 54 54 54 55 55 56 56 56 55 55 55 56 55 55 56 57 57 57 56 56 56 55 55 55 55 56 57 57 57 57 56 56 56 55 55 55 55 56 56 56
-15E6%Jj%%JJ%j%j%%%%%J%j%%%%J%%%j%jJ%j%J%%%%%j%JJJ%%%j%Jj%j%%%%%%%%j%%%JJJ%%
$$ 56 56 57 56 56 56 57 58 58 57 57 56 56 56 56 56 56 57 57 56 56 56 56 56 57 57 57 57 56 56 55 56 56 55 55 56 56 56 56 56 56 55 55 56 57 58 58 58 58 57 57 58 57 57 56 56 56 56 56 56 56 56 56 55 55 55 55 56 57 58 58 58
-22E8jj%J%J%jjj%J%%%j%Jj%%JJ%jjjJJJJ%jjjJ%J%J%jjjJ%%%%Jj%J%%j%%Jj%%Jj%Jj%%%%
$$ 58 57 56 56 57 57 58 58 57 56 55 55 56 56 56 56 55 55 56 55 55 55 56 57 57 56 55 54 55 56 57 58 58 57 56 55 56 56 57 57 58 58 57 56 55 56 56 56 56 56 57 56 56 57 57 57 56 56 56 57 56 56 56 57 56 56 57 56 56 56 56 56
-30E6%j%%JJ%%%%%%jk%%%%%J%%J%%j%%%JJ%%j%%%%%%j%%%%J%Jj%%%%%%%%%jJ%%%%%%%%%%%
$$ 56 56 55 55 55 56 57 57 57 57 57 57 57 56 54 54 54 54 54 54 55 55 55 56 56 56 55 55 55 55 56 57 57 57 56 56 56 56 56 56 56 55 55 55 55 55 56 56 57 56 56 56 56 56 56 56 56 56 56 55 56 56 56 56 56 56 56 56 56 56 56 56
-37E6J%%%%%%J%jk%%j%JJ%J%%%j%%%%j%%%%JJJjjJ%%%%Jj%jjJJj%j%jJJJ%jJ%%Jjj%%JJj%
$$ 56 57 57 57 57 57 57 57 58 58 57 55 55 55 54 54 55 56 56 57 57 57 57 56 56 56 56 56 55 55 55 55 55 56 57 58 57 56 57 57 57 57 57 58 57 57 56 55 56 57 56 56 55 55 54 55 56 57 57 56 57 57 57 58 57 56 56 56 57 58 57 57
-45E7j%JJ%%%jjjJ%Jj%j%j%Jj%%%%J%%J%J%%j%j%JJJ%j%%j%%%%%%%%%%%j%%Jj%%%%j%%%%J
$$ 57 56 56 57 58 58 58 58 57 56 55 56 56 57 56 56 55 55 54 54 55 54 54 54 54 54 55 55 55 56 56 57 57 57 56 56 55 55 56 57 58 58 57 57 57 56 56 56 56 56 56 56 56 56 56 56 56 55 55 55 56 55 55 55 55 55 54 54 54 54 54 55
-52E5%j%%jJ%J%%%%%%%j%JJJj%%%jj%%%Jj%%JJ%J%%%%%%%%%%jj%%%%J%%%j%J%%%%%j%%%%%
$$ 55 55 54 54 54 53 54 54 55 55 55 55 55 55 55 55 54 54 55 56 57 56 56 56 56 55 54 54 54 54 55 54 54 54 55 56 56 57 57 57 57 57 57 57 57 57 57 57 56 55 55 55 55 55 56 56 56 56 55 55 56 56 56 56 56 56 55 55 55 55 55 55
-60E5%JJj%%%j%%j%%J%%%%%jj%%J%%%JJ%%j%%%%J%%Jj%%%jjJ%%jJ%%%%%%%%jJ%%J%%%%j%%
$$ 55 55 56 57 56 56 56 56 55 55 55 54 54 54 55 55 55 55 55 55 54 53 53 53 54 54 54 54 55 56 56 56 55 55 55 55 55 56 56 56 57 56 56 56 56 55 54 55 55 55 54 55 55 55 55 55 55 55 55 55 54 55 55 55 56 56 56 56 56 55 55 55
-67E5%%%%%J%%%%%j%%%%%jJ%j%JJj%j%J%%%%%%%%J%j%%JjjJ%%%j%J%%J%%%%jj%%%%j%JJ%%
$$ 55 55 55 55 55 55 56 56 56 56 56 56 55 55 55 55 55 55 54 55 55 54 54 55 56 55 55 54 54 55 55 55 55 55 55 55 55 55 56 56 55 55 55 56 55 54 55 55 55 55 54 54 55 55 55 56 56 56 56 56 55 54 54 54 54 54 53 53 54 55 55 55
-75E5%%%%J%j%j%%Jj%%jJJ%J%%%%JjjjjJJjJ%%%J%jj%jJ%%%%J%%%jJJj%%j%%%jJJ%J%%%j%
$$ 55 55 55 55 55 56 56 55 55 54 54 54 55 54 54 54 53 54 55 55 56 56 56 56 56 57 56 55 54 53 54 55 54 55 55 55 55 56 56 55 54 54 53 54 54 54 54 54 55 55 55 55 54 55 56 55 55 55 54 54 54 54 53 54 55 55 56 56 56 56 55 55
-82E5jJ%%%%%%%%%%%j%%%%jJ%JJJ%j%%jj%j%%%%%J%JJj%j%%%%%%%%J%J%j%J%%jj%%%%JJ%j
$$ 55 54 55 55 55 55 55 55 55 55 55 55 55 55 54 54 54 54 54 53 54 54 55 56 57 57 56 56 56 55 54 54 53 53 53 53 53 53 54 54 55 56 55 55 54 54 54 54 54 54 54 54 54 55 55 56 56 55 55 56 56 56 55 54 54 54 54 54 55 56 56 55
-90E5j%J%j%jjJJJ%jJ%k%j%J%J%%%j%%%%%J%%%j%j%JJJJ%k%%%J%%%%%%%%%%%%%%%%%%%%jJ
$$ 55 54 54 55 55 54 54 53 52 53 54 55 55 54 55 55 53 53 52 52 53 53 54 54 54 54 53 53 53 53 53 53 54 54 54 54 53 53 52 52 53 54 55 56 56 54 54 54 54 55 55 55 55 55 55 55 55 55 55 55 55 55 55 55 55 55 55 55 55 55 54 55
-97E5%%J%%%%J%jj%%%%%%%%%j%%J%%J%j%%j%%j%J%%J%%j%%%J%jJ%%%j%%%%%%%%J%J%j%Jjj
$$ 55 55 55 56 56 56 56 56 57 57 56 55 55 55 55 55 55 55 55 55 55 54 54 54 55 55 55 56 56 55 55 55 54 54 54 53 53 54 54 54 55 55 55 54 54 54 54 55 55 54 55 55 55 55 54 54 54 54 54 54 54 54 54 55 55 56 56 55 55 56 55 54
-105E4J%JJjjj%j%J%J%J%j%J%jj%%J%J%%%jjJ%jjjJJ%Jj%%J%%jj%%J%%J%j%%%%Jjj%%JJ%%
$$ 54 55 55 56 57 56 55 54 54 53 53 54 54 55 55 56 56 55 55 56 56 55 54 54 54 55 55 56 56 56 56 55 54 55 55 54 53 52 53 54 54 55 54 54 54 55 55 55 54 53 53 53 54 54 54 55 55 54 54 54 54 54 55 54 53 53 53 54 55 55 55
-112E5%j%%J%%%%%%j%jj%%%JJ%%%j%%%%JJJJjj%%%%%%j%%%j%%%J%%%jjJ%j%%J%%JJJj%jj%
$$ 55 55 54 54 54 55 55 55 55 55 55 55 54 54 53 52 52 52 52 53 54 54 54 54 53 53 53 53 53 54 55 56 57 56 55 55 55 55 55 55 55 54 54 54 54 53 53 53 53 54 54 54 54 53 52 53 53 52 52 52 53 53 53 54 55 56 55 55 54 53 53
-120E3%%JJ%Jjk%%JJJj%%%%%%j%j%%J%%Jj%%%J%J%%jj%%%%J%%%%%%%%j%%jkJ%%%%JJ%j%J%
$$ 53 53 53 54 55 55 56 55 53 53 53 54 55 56 55 55 55 55 55 55 55 54 54 53 53 53 54 54 54 55 54 54 54 54 55 55 56 56 56 55 54 54 54 54 54 55 55 55 55 55 55 55 55 55 54 54 54 53 51 52 52 52 52 52 53 54 54 53 53 54 54
-127E4K%%%%%%%%%j%jj%%%%%%JJj%%%%J%Jj%j%%%%%%%JJj%%%%%%%%%%jJ%%j%%%%%%%%J%%j
$$ 54 56 56 56 56 56 56 56 56 56 56 55 55 54 53 53 53 53 53 53 53 54 55 54 54 54 54 54 55 55 56 55 55 54 54 54 54 54 54 54 54 55 56 55 55 55 55 55 55 55 55 55 55 55 54 55 55 55 54 54 54 54 54 54 54 54 54 55 55 55 54
-135E4J%%Jj%%%%%%%%J%j%%%%j%%%jJJ%%%jJJj%%jj%%%%%%%J%%%%j%%%JKJJjj%j%%%%%%j%
$$ 54 55 55 55 56 55 55 55 55 55 55 55 55 55 56 56 55 55 55 55 55 54 54 54 54 53 54 55 55 55 55 54 55 56 55 55 55 54 53 53 53 53 53 53 53 53 54 54 54 54 54 53 53 53 53 54 56 57 58 57 56 56 55 55 55 55 55 55 55 54 54
-142E4%%J%%j%JJ%j%%%%j%%%j%Jj%%%J%%jJJ%%j%%%%%%%%Jjj%%%%%%%%%J%%J%%Jj%jj%%%J
$$ 54 54 54 55 55 55 54 54 55 56 56 55 55 55 55 55 54 54 54 54 53 53 54 53 53 53 53 54 54 54 53 54 55 55 55 54 54 54 54 54 54 54 54 54 55 54 53 53 53 53 53 53 53 53 53 53 54 54 54 55 55 55 56 55 55 54 53 53 53 53 54
-149E4%%%J%%%Jj%j%j%%%%%J%%%%%j%J%%j%%%%%%JJj%%J%%%%%%j%%%%%%%%j%%%Jj%%%%%%J
$$ 54 54 54 54 55 55 55 55 56 55 55 54 54 53 53 53 53 53 53 54 54 54 54 54 54 53 53 54 54 54 53 53 53 53 53 53 53 54 55 54 54 54 55 55 55 55 55 55 55 54 54 54 54 54 54 54 54 54 53 53 53 53 54 53 53 53 53 53 53 53 54
-157E4%%%%J%j%%%jJ%%j%JJ%%%j%%%%J%j%%%%j%j%J%%%%%%%%%%J%Jjj%%JJJj%%%%%%jkjJ%
$$ 54 54 54 54 54 55 55 54 54 54 54 53 54 54 54 53 53 54 55 55 55 55 54 54 54 54 54 55 55 54 54 54 54 54 53 53 52 52 53 53 53 53 53 53 53 53 53 53 53 54 54 55 54 53 53 53 54 55 56 55 55 55 55 55 55 55 54 52 51 52 52
-164E2J%%%%J%j%%jJJ%j%%%J%jJ%%%j%J%J%%%%jjJ%%Jj%%j%%%%%%J%%j%%j%%j%J%J%%J%jj
$$ 52 53 53 53 53 53 54 54 53 53 53 52 53 54 54 53 53 53 53 54 54 53 54 54 54 54 53 53 54 54 55 55 55 55 55 54 53 54 54 54 55 54 54 54 53 53 53 53 53 53 53 54 54 54 53 53 53 52 52 52 51 51 52 52 53 53 53 54 54 53 52
-172E2%J%J%jJ%J%%%%j%%%%%Jjj%%%JK%%%%%%%j%%%%jj%J%%J%%%%j%%j%%%%%J%%%%%%j%Jj
$$ 52 52 53 53 54 54 53 54 54 55 55 55 55 55 54 54 54 54 54 54 55 54 53 53 53 53 54 56 56 56 56 56 56 56 56 55 55 55 55 55 54 53 53 54 54 54 55 55 55 55 55 54 54 54 53 53 53 53 53 53 54 54 54 54 54 54 54 53 53 54 53
-179E3jJ%j%J%%%%j%J%%%Jj%%%%%%%%J%%jj%J%%%%%%%%%%J%JjjJ%JJjjjjJ%%%%%j%JJ%%J%
$$ 53 52 53 53 52 52 53 53 53 53 53 52 52 53 53 53 53 54 53 53 53 53 53 53 53 53 53 54 54 54 53 52 52 53 53 53 53 53 53 53 53 53 53 53 54 54 55 54 53 54 54 55 56 55 54 53 52 53 53 53 53 53 53 52 52 53 54 54 54 55 55
-186E5%jj%%Jj%jJ%%J%%%%%%%j%%%%%%%J%%j%%%JJ%%%j%J%J%%j%j%%%%J%%%%J%jkj%%J%J%
$$ 55 55 54 53 53 53 54 53 53 52 53 53 53 54 54 54 54 54 54 54 54 53 53 53 53 53 53 53 53 54 54 54 53 53 53 53 54 55 55 55 55 54 54 55 55 56 56 56 55 55 54 54 54 54 54 55 55 55 55 55 56 56 55 53 52 52 52 53 53 54 54
-194E4j%jjJJj%%Jj%%%Jj%%JJ%%%j%J%%%%%%%%%%j%%%%Jj%jj%Jj%J%%J%%j%%%%%%%%%J%jj
$$ 54 53 53 52 51 52 53 52 52 52 53 52 52 52 52 53 52 52 52 53 54 54 54 54 53 53 54 54 54 54 54 54 54 54 54 54 54 53 53 53 53 53 54 53 53 52 51 51 52 51 51 52 52 52 53 53 53 52 52 52 52 52 52 52 52 52 52 53 53 52 51
-201E1%%JJ%%jj%jJ%JJ%%J%%%j%%J%%J%%%j%%k%jjJJ%j%%J%%jJJ%%J%%%Jj%jjJ%JJ%%%j%J
$$ 51 51 51 52 53 53 53 52 51 51 50 51 51 52 53 53 53 54 54 54 54 53 53 53 54 54 54 55 55 55 55 54 54 54 52 52 51 50 51 52 52 51 51 51 52 52 52 51 52 53 53 53 54 54 54 54 55 54 54 53 52 53 53 54 55 55 55 55 54 54 55
-209E5Jjj%j%%%%%%%%%%%J%jJ%%J%j%%j%%JJ%Jj%jj%%%%%%jJ%%%%j%%%%JJ%%%j%%%%J%Jjj
$$ 55 56 55 54 54 53 53 53 53 53 53 53 53 53 53 53 53 54 54 53 54 54 54 55 55 54 54 54 53 53 53 54 55 55 56 55 55 54 53 53 53 53 53 53 53 52 53 53 53 53 53 52 52 52 52 52 53 54 54 54 54 53 53 53 53 53 54 54 55 54 53
-216E3%j%J%%Jj%%j%%j%%J%J%j%%%%%J%%j%%%%J%%jJ%%jJ%%%%%%%%J%%%J%jj%%%%%%%%%%j
$$ 53 53 52 52 53 53 53 54 53 53 53 52 52 52 51 51 51 52 52 53 53 52 52 52 52 52 52 53 53 53 52 52 52 52 52 53 53 53 52 53 53 53 52 53 53 53 53 53 53 53 53 53 54 54 54 54 55 55 54 53 53 53 53 53 53 53 53 53 53 53 52
-224E2J%jj%J%%j%%K%%%%j%j%J%J%%%%%JJ%jjj%%%%j%JJ%%Jj%%%%%jjJj%%J%%%J%%%%%j%J
$$ 52 53 53 52 51 51 52 52 52 51 51 51 53 53 53 53 53 52 52 51 51 52 52 53 53 53 53 53 53 54 55 55 54 53 52 52 52 52 52 51 51 52 53 53 53 54 53 53 53 53 53 53 52 51 52 51 51 51 52 52 52 52 53 53 53 53 53 53 52 52 53
-231E3%%j%j%jJj%JJJ%%j%%j%%jJ%%%J%%J%J%%J%%%%j%%jj%%J%%%%jJj%%Jj%J%%%%%%%j%%
$$ 53 53 53 52 52 51 51 50 51 50 50 51 52 53 53 53 52 52 52 51 51 51 50 51 51 51 51 52 52 52 53 53 54 54 54 55 55 55 55 55 54 54 54 53 52 52 52 53 53 53 53 53 52 53 52 52 52 53 52 52 53 53 53 53 53 53 53 53 52 52 52
-238E2%J%J%%%j%jJJ%%j%%%%J%%jJ%j%%%%%jJ%%%%j%%%%%J%%%J%%jJjjj%%J%J%%%j%j%jJ%
$$ 52 52 53 53 54 54 54 54 53 53 52 53 54 54 54 53 53 53 53 53 54 54 54 53 54 54 53 53 53 53 53 53 52 53 53 53 53 53 52 52 52 52 52 52 53 53 53 53 54 54 54 53 54 53 52 51 51 51 52 52 53 53 53 53 52 52 51 51 50 51 51
-246E1J%%%Jj%%%%%%%%%%%%j%%%%JJ%%j%%%%%%%%j%%jJJ%j%%%%%%JJ%Jj%%%%j%%j%%%%%J%
$$ 51 52 52 52 52 53 52 52 52 52 52 52 52 52 52 52 52 52 52 51 51 51 51 51 52 53 53 53 52 52 52 52 52 52 52 52 52 51 51 51 50 51 52 52 51 51 51 51 51 51 51 52 53 53 54 53 53 53 53 53 52 52 52 51 51 51 51 51 51 52 52
-253E2%J%%%j%jJ%Jj%J%%%%%%%J%j%%%J%%jj%JJJj%jj%%%%%%%%J%j%%%j%J%Jjj%K%%%%j%%
$$ 52 52 53 53 53 53 52 52 51 52 52 53 52 52 53 53 53 53 53 53 53 53 54 54 53 53 53 53 54 54 54 53 52 52 53 54 55 54 54 53 52 52 52 52 52 52 52 52 52 53 53 52 52 52 52 51 51 52 52 53 52 51 51 53 53 53 53 53 52 52 52
-261E2%Jj%%J%j%j%%%JJK%j%%jj%j%%%J%%J%%%%%jj%%%J%%%%%J%Jj%jj%%%%JJJ%jj%j%%JJ
$$ 52 52 53 52 52 52 53 53 52 52 51 51 51 51 52 53 55 55 54 54 54 53 52 52 51 51 51 51 52 52 52 53 53 53 53 53 53 52 51 51 51 51 52 52 52 52 52 52 53 53 54 53 53 52 51 51 51 51 51 52 53 54 54 53 52 52 51 51 51 52 53
-268E3%%%%%%%%%%jjj%%JkjJJK%k%%J%J%%%%j%%%%j%%%%J%%J%%%%%J%%%%%%%Jjjjjj%J%JJ
$$ 53 53 53 53 53 53 53 53 53 53 53 52 51 50 50 50 51 49 48 49 50 52 52 50 50 50 51 51 52 52 52 52 52 51 51 51 51 51 50 50 50 50 50 51 51 51 52 52 52 52 52 52 53 53 53 53 53 53 53 53 54 53 52 51 50 49 49 50 50 51 52
-276E2JJjjjJK%Jj%%%%%jj%%%%JJjjJ%j%%Jj%J%%jJ%%%%j%%%%%%%J%%%%%J%%%%%jjJJjjJ%
$$ 52 53 54 53 52 51 52 54 54 55 54 54 54 54 54 54 53 52 52 52 52 52 53 54 53 52 53 53 52 52 52 53 52 52 53 53 53 52 53 53 53 53 53 52 52 52 52 52 52 52 52 53 53 53 53 53 53 54 54 54 54 54 54 53 52 53 54 53 52 53 53
-283E3J%%%%%jj%j%%jJJjj%%j%%%%J%%%%JJ%%j%j%%j%j%%J%%%%%%%%JK%%%%J%%jJ%%%%%%%
$$ 53 54 54 54 54 54 54 53 52 52 51 51 51 50 51 52 51 50 50 50 49 49 49 49 49 50 50 50 50 50 51 52 52 52 51 51 50 50 50 49 49 48 48 48 49 49 49 49 49 49 49 49 49 50 52 52 52 52 52 53 53 53 52 53 53 53 53 53 53 53 53
-290E3%%jjJ%J%%j%J%%jj%%%%%%J%jj%J%Jj%%%%%%%%%%%%J%J%%j%%j%j%%JJ%%jj%%%JJjJ%
$$ 53 53 53 52 51 52 52 53 53 53 52 52 53 53 53 52 51 51 51 51 51 51 51 52 52 51 50 50 51 51 52 51 51 51 51 51 51 51 51 51 51 51 51 51 52 52 53 53 53 52 52 52 51 51 50 50 50 51 52 52 52 51 50 50 50 50 51 52 51 52 52
-298E2%%jj%J%%%j%%%JJ%%%%%%%J%%j%%%%%j%jJj%JJ%%%%%%j%%%%Kj%j%%JJ%Jj%j%%Jjj%J
$$ 52 52 52 51 50 50 51 51 51 51 50 50 50 50 51 52 52 52 52 52 52 52 52 53 53 53 52 52 52 52 52 52 51 51 50 51 50 50 51 52 52 52 52 52 52 52 51 51 51 51 51 53 52 52 51 51 51 52 53 53 54 53 53 52 52 52 53 52 51 51 52
-305E2Jj%J%j%%%jJ%J%%j%%%%%%%%J%%j%j%%%J%%%Jj%Jj%J%%j%jj%%j%JJ%%%%j%%%%%%%%%
$$ 52 53 52 52 53 53 52 52 52 52 51 52 52 53 53 53 52 52 52 52 52 52 52 52 52 53 53 53 52 52 51 51 51 51 52 52 52 52 53 52 52 53 52 52 53 53 53 52 52 51 50 50 50 49 49 50 51 51 51 51 51 50 50 50 50 50 50 50 50 50 50
-313E0%%J%Jj%jJ%%%%%%%j%JJ%%%%jj%JJJj%j%%j%%%J%Jj%%%%j%%J%%%JJj%%%%j%%%%%j%%
$$ 50 50 50 51 51 52 51 51 50 51 51 51 51 51 51 51 51 50 50 51 52 52 52 52 52 51 50 50 51 52 53 52 52 51 51 51 50 50 50 50 51 51 52 51 51 51 51 51 50 50 50 51 51 51 51 52 53 52 52 52 52 52 51 51 51 51 51 51 50 50 50
-320E0%%J%J%%%%%jj%%%%JJJ%%%%%%%%j%jJJ%J%jjj%%%%%j%%%%%%jJ%Jj%%J%J%%%%%%%J%j
$$ 50 50 50 51 51 52 52 52 52 52 52 51 50 50 50 50 50 51 52 53 53 53 53 53 53 53 53 53 52 52 51 52 53 53 54 54 53 52 51 51 51 51 51 51 50 50 50 50 50 50 50 49 50 50 51 50 50 50 51 51 52 52 52 52 52 52 52 52 53 53 52
-327E2%%%%%%%%%JJkj%jJ%Jj%j%JJJ%jj%%%%%%%%%%j%%J%jJ%%%J%%%%%j%%%j%%Jj%jj%J%J
$$ 52 52 52 52 52 52 52 52 52 52 53 54 52 51 51 50 51 51 52 51 51 50 50 51 52 53 53 52 51 51 51 51 51 51 51 51 51 51 51 50 50 50 51 51 50 51 51 51 51 52 52 52 52 52 52 51 51 51 51 50 50 50 51 50 50 49 48 48 49 49 50
-335E0J%J%%%%%J%%jjj%%%J%%%%Jjj%%J%%%Jj%jjJJ%%%%jjJ%J%J%%%%j%%%%J%%jJ%j%%Jj%
$$ 50 51 51 52 52 52 52 52 52 53 53 53 52 51 50 50 50 50 51 51 51 51 51 52 51 50 50 50 51 51 51 51 52 51 51 50 49 50 51 51 51 51 51 50 49 50 50 51 51 52 52 52 52 52 51 51 51 51 51 52 52 52 51 52 52 51 51 51 52 51 51
-342E1j%%%%Jjj%K%%%%%%%J%j%%%%%%jj%J%%%J%%%%%J%JkjJJJJ%kj%%%%%%%%Jj%jjJJ%%J%
$$ 51 50 50 50 50 50 51 50 49 49 51 51 51 51 51 51 51 51 52 52 51 51 51 51 51 51 51 50 49 49 50 50 50 50 51 51 51 51 51 51 52 52 53 51 50 51 52 53 54 54 52 51 51 51 51 51 51 51 51 51 52 51 51 50 49 50 51 51 51 52 52
-350E2J%%j%%j%%J%%J%%%%kjj%%JJ%%jj%%%J%%%%%%J%%%J%%j%j%J%%%j%%%%%JJ%%Jj%%%j%
$$ 52 53 53 53 52 52 52 51 51 51 52 52 52 53 53 53 53 53 51 50 49 49 49 50 51 51 51 50 49 49 49 49 50 50 50 50 50 50 50 51 51 51 51 52 52 52 51 51 50 50 51 51 51 51 50 50 50 50 50 50 51 52 52 52 53 52 52 52 52 51 51
-357E1%Jj%jJ%%%J%%k%%Jj%%%%%%J%%jJ%%%%%%%%%%J%j%%%%%%%%jJ%%J%j%%%j%%%Jj%J%J%
$$ 51 51 52 51 51 50 51 51 51 51 52 52 52 50 50 50 51 50 50 50 50 50 50 50 51 51 51 50 51 51 51 51 51 51 51 51 51 51 51 52 52 51 51 51 51 51 51 51 51 51 50 51 51 51 52 52 51 51 51 51 50 50 50 50 51 50 50 51 51 52 52
-365E2j%%%J%%%%%j%%j%%%%%%J%j%%%%%J%Jj%j%%%%J%%%%j%%%Jjj%%JJ%%JJ%%j%%%j%%jjj
$$ 52 51 51 51 51 52 52 52 52 52 52 51 51 51 50 50 50 50 50 50 50 51 51 50 50 50 50 50 50 51 51 52 51 51 50 50 50 50 50 51 51 51 51 51 50 50 50 50 51 50 49 49 49 50 51 51 51 52 53 53 53 52 52 52 52 51 51 51 50 49 48
-372D8%J%%%J%%%J%%%%J%%j%%%%jJ%%%%%j%jJ%%%J%J%%j%%%%%jJ%%%J%J%%jjjJJ%jj%J%%%
$$ 48 48 49 49 49 49 50 50 50 50 51 51 51 51 51 52 52 52 51 51 51 51 51 50 51 51 51 51 51 51 50 50 49 50 50 50 50 51 51 52 52 52 51 51 51 51 51 51 50 51 51 51 51 52 52 53 53 53 52 51 50 51 52 52 51 50 50 51 51 51 51
-379E1%j%%%%%J%%j%%j%%J%%%%%J%%J%j%%%%%jJ%%%kj%JJ%J%%%%%%j%j%J%%J%%%%j%%%%jJ
$$ 51 51 50 50 50 50 50 50 51 51 51 50 50 50 49 49 49 50 50 50 50 50 50 51 51 51 52 52 51 51 51 51 51 51 50 51 51 51 51 49 48 48 49 50 50 51 51 51 51 51 51 51 50 50 49 49 50 50 50 51 51 51 51 51 50 50 50 50 50 49 50
-387E0%%%%%Jj%%Jj%%%%%j%%JJ%%%Jjj%%%%%%%%j%%%%JJ%J%%jj%%%j%%%JJJj%%J%jjjjJj%
$$ 50 50 50 50 50 50 51 50 50 50 51 50 50 50 50 50 50 49 49 49 50 51 51 51 51 52 51 50 50 50 50 50 50 50 50 50 49 49 49 49 49 50 51 51 52 52 52 51 50 50 50 50 49 49 49 49 50 51 52 51 51 51 52 52 51 50 49 48 49 48 48
-394D8%%%%jJ%%JJJ%jj%J%%%jJ%%Jjj%j%%JJK%%jj%%JJ%j%%jk%%%K%%j%J%%j%%%%%jjJJ%J
$$ 48 48 48 48 48 47 48 48 48 49 50 51 51 50 49 49 50 50 50 50 49 50 50 50 51 50 49 49 48 48 48 49 50 52 52 52 51 50 50 50 51 52 52 51 51 51 50 48 48 48 48 50 50 50 49 49 50 50 50 49 49 49 49 49 49 48 47 48 49 49 50
-402E0J%JJjj%j%%%%%%j%%%J%J%jjJJ%jjj%%JJj%J%%%j%%J%%%%%%J%%j%j%%%J%jJ%%J%%jj
$$ 50 51 51 52 53 52 51 51 50 50 50 50 50 50 50 49 49 49 49 50 50 51 51 50 49 50 51 51 50 49 48 48 48 49 50 49 49 50 50 50 50 49 49 49 50 50 50 50 50 50 50 51 51 51 50 50 49 49 49 49 50 50 49 50 50 50 51 51 51 50 49
-409D9j%%J%%J%J%%%j%%%jj%j%JKK%%%%jj%%jj%jJJJJj%%j%j%%%jJ%JJ%%%J%j%%%%J%%Jj%
$$ 49 48 48 48 49 49 49 50 50 51 51 51 51 50 50 50 50 49 48 48 47 47 48 50 52 52 52 52 52 51 50 50 50 49 48 48 47 48 49 50 51 50 50 50 49 49 48 48 48 48 47 48 48 49 50 50 50 50 51 51 50 50 50 50 50 51 51 51 52 51 51
-416E1%j%%%%%%%%%j%J%%%%%%%%Jjj%%J%%%jjJ%J%%%j%%JJ%%%%j%%J%%jj%J%%%j%J%%j%%%
$$ 51 51 50 50 50 50 50 50 50 50 50 50 49 49 50 50 50 50 50 50 50 50 50 51 50 49 49 49 50 50 50 50 49 48 49 49 50 50 50 50 49 49 49 50 51 51 51 51 51 50 50 50 51 51 51 50 49 49 50 50 50 50 49 49 50 50 50 49 49 49 49
-424D9J%%%%Jjj%%%%%%J%%Jjjj%j%%%J%JJJ%%j%jjk%%J%JJJ%J%j%jJ%%%J%J%jj%%%%Jjj%%
$$ 49 50 50 50 50 50 51 50 49 49 49 49 49 49 49 50 50 50 51 50 49 48 48 47 47 47 47 48 48 49 50 51 51 51 50 50 49 48 46 46 46 47 47 48 49 50 50 51 51 50 50 49 50 50 50 50 51 51 52 52 51 50 50 50 50 50 51 50 49 49 49
-431D9%%%J%j%%J%%%%J%%%j%j%%%%%j%JJJj%j%%%%%%%%KJ%jj%%%j%j%JjJ%j%J%%jJ%%J%%J
$$ 49 49 49 49 50 50 49 49 49 50 50 50 50 50 51 51 51 51 50 50 49 49 49 49 49 49 48 48 49 50 51 50 50 49 49 49 49 49 49 49 49 49 51 52 52 51 50 50 50 50 49 49 48 48 49 48 49 49 48 48 49 49 49 48 49 49 49 50 50 50 51
-439E1Jj%J%%j%%j%%J%%j%%%%%%%JJj%j%%%%%j%JJjjJ%j%%%%%%%%%%%%j%%%%%J%%%j%jjJ%
$$ 51 52 51 51 52 52 52 51 51 51 50 50 50 51 51 51 50 50 50 50 50 50 50 50 51 52 51 51 50 50 50 50 50 50 49 49 50 51 50 49 50 50 49 49 49 49 49 49 49 49 49 49 49 49 49 48 48 48 48 48 48 49 49 49 49 48 48 47 46 47 47
-446D7%J%J%%%%%%%%%J%%j%%jJ%%%%J%%%j%%%jJ%JJj%%j%%jJ%%%%%%J%%%%Jj%%Jj%%%%%%j
$$ 47 47 48 48 49 49 49 49 49 49 49 49 49 49 50 50 50 49 49 49 48 49 49 49 49 49 50 50 50 50 49 49 49 49 48 49 49 50 51 50 50 50 49 49 49 48 49 49 49 49 49 49 49 50 50 50 50 50 51 50 50 50 51 50 50 50 50 50 50 50 49
-454D9%J%%%%%%j%%J%jJj%%Jjj%%%%jJ%%%%%J%J%%%%jJJ%j%%j%%%%j%%%jJ%%%J%%%j%%J%%
$$ 49 49 50 50 50 50 50 50 50 49 49 49 50 50 49 50 49 49 49 50 49 48 48 48 48 48 47 48 48 48 48 48 48 49 49 50 50 50 50 50 49 50 51 51 50 50 50 49 49 49 49 49 48 48 48 48 47 48 48 48 48 49 49 49 49 48 48 48 49 49 49
-461D9%%%j%%j%J%J%J%%Jjjjj%J%J%j%%%J%J%%%jj%j%Jj%%%%%%j%JJj%J%%JJj%%%%%%j%%%
$$ 49 49 49 49 48 48 48 47 47 48 48 49 49 50 50 50 51 50 49 48 47 47 48 48 49 49 48 48 48 48 49 49 50 50 50 50 49 48 48 47 47 48 47 47 47 47 47 47 47 46 46 47 48 47 47 48 48 48 49 50 49 49 49 49 49 49 49 48 48 48 48
-468D8%%%JJ%%%j%%%%%%%%j%%%%%%%Jj%%%J%%%%%%%%jJ%Jjj%%%Jjj%JJ%%%%%%jJ%%%%%%kj
$$ 48 48 48 48 49 50 50 50 50 49 49 49 49 49 49 49 49 49 48 48 48 48 48 48 48 48 49 48 48 48 48 49 49 49 49 49 49 49 49 49 48 49 49 50 49 48 48 48 48 49 48 47 47 48 49 49 49 49 49 49 49 48 49 49 49 49 49 49 49 47 46
-476D6%%JJJJ%%j%j%j%J%J%%j%%%%jJJJJ%J%jjjjJ%Jjj%%%%J%%%%%%%jj%%%JJ%%%%%%%%jj
$$ 46 46 46 47 48 49 50 50 50 49 49 48 48 47 47 48 48 49 49 49 48 48 48 48 48 47 48 49 50 51 51 52 52 51 50 49 48 49 49 50 49 48 48 48 48 48 49 49 49 49 49 49 49 49 48 47 47 47 47 48 49 49 49 49 49 49 49 49 49 48 47
-483D7%%%%J%%J%j%%j%JJ%j%%Jj%%J%%%%j%j%j%J%%%j%J%%JJ%%%jJ%j%%%%%%%%%J%jJJ%j%
$$ 47 47 47 47 47 48 48 48 49 49 48 48 48 47 47 48 49 49 48 48 48 49 48 48 48 49 49 49 49 49 48 48 47 47 46 46 47 47 47 47 46 46 47 47 47 48 49 49 49 49 48 49 49 48 48 48 48 48 48 48 48 48 48 49 49 48 49 50 50 49 49
-491D9j%J%J%%%jj%%%jJ%J%%k%%jJ%Jj%%%%%%%J%%%%%J%j%%JJ%j%j%%%J%j%%%J%J%%%j%%%
$$ 49 48 48 49 49 50 50 50 50 49 48 48 48 48 47 48 48 49 49 49 47 47 47 46 47 47 48 47 47 47 47 47 47 47 47 48 48 48 48 48 48 49 49 48 48 48 49 50 50 49 49 48 48 48 48 49 49 48 48 48 48 49 49 50 50 50 50 49 49 49 49
-498D9%Jj%%j%%%j%%J%jjJ%JJ%j%%JJJ%j%%%%%j%j%%j%%j%J%%%%JJ%j%%%%%%%%%%%J%%J%j
$$ 49 49 50 49 49 49 48 48 48 48 47 47 47 48 48 47 46 47 47 48 49 49 48 48 48 49 50 51 51 50 50 50 50 50 50 49 49 48 48 48 47 47 47 46 46 47 47 47 47 47 48 49 49 48 48 48 48 48 48 48 48 48 48 48 48 49 49 49 50 50 49
-505D9j%j%%%j%J%J%%%%%%J%j%jjJ%%%J%%J%j%J%%%j%%j%%%%%Jj%%j%%%%J%J%%%Jj%%J%J%
$$ 49 48 48 47 47 47 47 46 46 47 47 48 48 48 48 48 48 48 49 49 48 48 47 46 47 47 47 47 48 48 48 49 49 48 48 49 49 49 49 48 48 48 47 47 47 47 47 47 48 47 47 47 46 46 46 46 46 47 47 48 48 48 48 49 48 48 48 49 49 50 50
-513E0jjJ%jjJ%J%j%j%%J%j%%j%%%%%J%%%J%Jjjj%%J%%%%J%jJ%J%j%jjJ%%jJJ%J%%jj%%%%
$$ 50 49 48 49 49 48 47 48 48 49 49 48 48 47 47 47 48 48 47 47 47 46 46 46 46 46 46 47 47 47 47 48 48 49 48 47 46 46 46 47 47 47 47 47 48 48 47 48 48 49 49 48 48 47 46 47 47 47 46 47 48 48 49 49 49 48 47 47 47 47 47
-520D7%%JJj%%%%JJJ%%j%%%%j%%%%jj%%%%J%%Jj%jj%%JJJJ%%j%%%%j%j%%J%jjjJJJ%%J%%j
$$ 47 47 47 48 49 48 48 48 48 48 49 50 51 51 51 50 50 50 50 50 49 49 49 49 49 48 47 47 47 47 47 48 48 48 49 48 48 47 46 46 46 47 48 49 50 50 50 49 49 49 49 49 48 48 47 47 47 48 48 47 46 45 46 47 48 48 48 49 49 49 48
-528D8%%%%%J%%%%j%%%%%%Jj%%%%%J%%%%%%%%jj%J%JJ%j%%%j%Jj%JK%jk%%J%Jj%%%jj%Jj%
$$ 48 48 48 48 48 48 49 49 49 49 49 48 48 48 48 48 48 48 49 48 48 48 48 48 48 49 49 49 49 49 49 49 49 49 48 47 47 48 48 49 50 50 49 49 49 49 48 48 49 48 48 49 51 51 50 48 48 48 49 49 50 49 49 49 49 48 47 47 48 47 47
-535D7%jJJ%%%%%%%%%%JJJ%%%j%%jjjJ%%%%%JJjj%%%j%J%%%JJ%j%j%%%j%%j%J%%%%j%J%%%
$$ 47 47 46 47 48 48 48 48 48 48 48 48 48 48 48 49 50 51 51 51 51 50 50 50 49 48 47 48 48 48 48 48 48 49 50 49 48 48 48 48 47 47 48 48 48 48 49 50 50 49 49 48 48 48 48 47 47 47 46 46 47 47 47 47 47 46 46 47 47 47 47
-543D7%J%%%%jj%%Jj%%%%%%%%%%JJ%%j%%%j%%J%%%J%J%%%%%%%Jj%j%%%%J%j%%j%%%JJ%%j%
$$ 47 47 48 48 48 48 48 47 46 46 46 47 46 46 46 46 46 46 46 46 46 46 46 47 48 48 48 47 47 47 47 46 46 46 47 47 47 47 48 48 49 49 49 49 49 49 49 49 50 49 49 48 48 48 48 48 49 49 48 48 48 47 47 47 47 48 49 49 49 48 48
-550D8%%%%%%%%%%%%%%j%KJ%%%j%%%%j%%%%%%%%%%%%%j%%JJJ%%j%jj%j%%j%JJJjjJ%%%J%%
$$ 48 48 48 48 48 48 48 48 48 48 48 48 48 48 48 47 47 49 50 50 50 50 49 49 49 49 49 48 48 48 48 48 48 48 48 48 48 48 48 48 48 47 47 47 48 49 50 50 50 49 49 48 47 47 46 46 46 45 45 46 47 48 47 46 47 47 47 47 48 48 48
-557D8%%j%jjJ%%%%J%%%%%%%%%%%j%%jJ%%%%J%%JJ%%%j%%JJk%%%%%%j%%%%%%%jJJ%%J%%%%
$$ 48 48 48 47 47 46 45 46 46 46 46 46 47 47 47 47 47 47 47 47 47 47 47 47 46 46 46 45 46 46 46 46 46 47 47 47 48 49 49 49 49 48 48 48 49 50 48 48 48 48 48 48 48 47 47 47 47 47 47 47 47 46 47 48 48 48 49 49 49 49 49
-565D9%%%%%%%%jjj%jJ%%J%%J%%jJ%%jJj%j%%%%%J%%J%%%%%Jj%%%%%%%j%%%jJ%J%jj%%%%%
$$ 49 49 49 49 49 49 49 49 49 48 47 46 46 45 46 46 46 47 47 47 48 48 48 47 48 48 48 47 48 47 47 46 46 46 46 46 46 47 47 47 48 48 48 48 48 48 49 48 48 48 48 48 48 48 48 47 47 47 47 46 47 47 48 48 47 46 46 46 46 46 46
-572D6%J%%j%J%%%%j%%%%%%j%%j%J%%%%%%j%%JJ%%%%JJJj%%%%%%j%%j%%%%JJ%jj%%J%J%J%
$$ 46 46 47 47 47 46 46 47 47 47 47 47 46 46 46 46 46 46 46 45 45 45 44 44 45 45 45 45 45 45 45 44 44 44 45 46 46 46 46 46 47 48 49 48 48 48 48 48 48 48 47 47 47 46 46 46 46 46 47 48 48 47 46 46 46 47 47 48 48 49 49
-580D9%j%JJj%jjJ%%j%%%%%j%%%J%j%J%JJjk%%%J%%%jj%%J%%J%j%%%J%%%%%%J%%jJ%%jJ%%
$$ 49 49 48 48 49 50 49 49 48 47 48 48 48 47 47 47 47 47 47 46 46 46 46 47 47 46 46 47 47 48 49 48 46 46 46 46 47 47 47 47 46 45 45 45 46 46 46 47 47 46 46 46 46 47 47 47 47 47 47 47 48 48 48 47 48 48 48 47 48 48 48
-587D8j%%jjJ%%J%J%j%%Jjj%%JJ%jJ%%JJjjj%%%j%%%JJJ%j%%j%%%%%%%j%%%J%J%%j%%%%%%
$$ 48 47 47 47 46 45 46 46 46 47 47 48 48 47 47 47 48 47 46 46 46 47 48 48 47 48 48 48 49 50 49 48 47 47 47 47 46 46 46 46 47 48 49 49 48 48 48 47 47 47 47 47 47 47 47 46 46 46 46 47 47 48 48 48 47 47 47 47 47 47 47
-594D7%%j%%%%J%J%%J%j%%%jj%JJ%%JJ%jjjJ%J%%j%%j%j%J%j%%J%%%%%%%%%%Jjj%%%JjJK%
$$ 47 47 47 46 46 46 46 46 47 47 48 48 48 49 49 48 48 48 48 47 46 46 47 48 48 48 49 50 50 49 48 47 48 48 49 49 49 48 48 48 47 47 46 46 47 47 46 46 46 47 47 47 47 47 47 47 47 47 47 47 48 47 46 46 46 46 47 46 47 49 49
-602D9%%%%%%j%%%%j%J%%%%jJ%%%%%jJ%J%%J%%%jk%%j%%%%J%%%%%%%%%%%%%%%J%%%j%jj%%
$$ 49 49 49 49 49 49 49 48 48 48 48 48 47 47 48 48 48 48 48 47 48 48 48 48 48 48 47 48 48 49 49 49 50 50 50 50 49 47 47 47 46 46 46 46 46 47 47 47 47 47 47 47 47 47 47 47 47 47 47 47 47 48 48 48 48 47 47 46 45 45 45
-609D5JJJ%j%j%%j%J%%%J%j%%%%%%%%%%%J%%Jjj%%%j%%JjJJ%%%%%j%%%J%%%J%kk%%%J%JJJ
$$ 45 46 47 48 48 47 47 46 46 46 45 45 46 46 46 46 47 47 46 46 46 46 46 46 46 46 46 46 46 46 47 47 47 48 47 46 46 46 46 45 45 45 46 45 46 47 47 47 47 47 47 46 46 46 46 47 47 47 47 48 48 46 44 44 44 44 45 45 46 47 48
-617D8%J%%j%%%%%J%%j%jj%JJJj%jj%j%j%%%%%JJJ%J%%%J%%%%jj%J%J%%j%%j%j%%%%%%%%%
$$ 48 48 49 49 49 48 48 48 48 48 48 49 49 49 48 48 47 46 46 47 48 49 48 48 47 46 46 45 45 44 44 44 44 44 44 45 46 47 47 48 48 48 48 49 49 49 49 49 48 47 47 48 48 49 49 49 48 48 48 47 47 46 46 46 46 46 46 46 46 46 46
-624D6J%%%J%%%JjjJJ%jjJ%j%%%%%%%%%%%%jJ%%%%%%%%%j%%%%%J%%Jj%%j%%%j%%%%%J%%jJ
$$ 46 47 47 47 47 48 48 48 48 49 48 47 48 49 49 48 47 48 48 47 47 47 47 47 47 47 47 47 47 47 47 47 46 47 47 47 47 47 47 47 47 47 47 46 46 46 46 46 46 47 47 47 48 47 47 47 46 46 46 46 45 45 45 45 45 45 46 46 46 45 46
-632D6JJ%%j%j%j%%%%J%j%%%JJj%%jJ%%jjJJ%J%%jj%J%%J%j%%%J%%J%%%%%%%jj%%j%jJJ%J
$$ 46 47 48 48 48 47 47 46 46 45 45 45 45 45 46 46 45 45 45 45 46 47 46 46 46 45 46 46 46 45 44 45 46 46 47 47 47 46 45 45 46 46 46 47 47 46 46 46 46 47 47 47 48 48 48 48 48 48 48 48 47 46 46 46 45 45 44 45 46 46 47
-639D7%Jjjj%J%JJj%Jjj%%%%%j%J%%%%%j%%%%%%%J%%J%%%%%j%%%%%%%J%J%j%%j%%%j%%%JJ
$$ 47 47 48 47 46 45 45 46 46 47 48 47 47 48 47 46 46 46 46 46 46 45 45 46 46 46 46 46 46 45 45 45 45 45 45 45 45 46 46 46 47 47 47 47 47 47 46 46 46 46 46 46 46 46 47 47 48 48 47 47 47 46 46 46 46 45 45 45 45 46 47
-646D7%%%j%JJ%%%%%%j%%%j%%%j%j%J%j%%J%%J%%%j%%JJ%%j%%%%%%%%%%J%Jj%%jjJJ%j%jj
$$ 47 47 47 47 46 46 47 48 48 48 48 48 48 48 47 47 47 47 46 46 46 46 45 45 44 44 45 45 44 44 44 45 45 45 46 46 46 46 45 45 45 46 47 47 47 46 46 46 46 46 46 46 46 46 46 46 47 47 48 47 47 47 46 45 46 47 47 46 46 45 44
-654D4%JJ%%jJ%J%%j%%%%J%%j%%JJ%J%j%jj%%%%JJJj%%jj%J%%J%jjj%%%%%%%%JJ%Jj%j%%%
$$ 44 44 45 46 46 46 45 46 46 47 47 47 46 46 46 46 46 47 47 47 46 46 46 47 48 48 49 49 48 48 47 46 46 46 46 46 47 48 49 48 48 48 47 46 46 47 47 47 48 48 47 46 45 45 45 45 45 45 45 45 45 46 47 47 48 47 47 46 46 46 46
-661D6%%%%J%%%%%%j%%%%%J%Jj%j%%%%%J%%%%%%%%%%%%%%%%j%j%j%J%%%%%%%j%J%J%J%%J%
$$ 46 46 46 46 46 47 47 47 47 47 47 47 46 46 46 46 46 46 47 47 48 47 47 46 46 46 46 46 46 47 47 47 47 47 47 47 47 47 47 47 47 47 47 47 47 47 46 46 45 45 44 44 45 45 45 45 45 45 45 45 44 44 45 45 46 46 47 47 47 48 48
-669D8%jj%%%%%%JjJ%%%%%%%jJ%%Jj%%jJ%%%jj%J%j%%JjjJJ%JJ%j%j%%J%jjjJ%Jjj%%%J%%
$$ 48 48 47 46 46 46 46 46 46 46 47 46 47 47 47 47 47 47 47 47 46 47 47 47 48 47 47 47 46 47 47 47 47 46 45 45 46 46 45 45 45 46 45 44 45 46 46 47 48 48 47 47 46 46 46 47 47 46 45 44 45 45 46 45 44 44 44 44 45 45 45
-676D5%%%%%%J%%J%%%%%%%%%%J%%%j%jj%%%%J%%%%%%%%%j%%%j%%JJJ%%%j%%%%%%J%J%jj%j
$$ 45 45 45 45 45 45 45 46 46 46 47 47 47 47 47 47 47 47 47 47 47 48 48 48 48 47 47 46 45 45 45 45 45 46 46 46 46 46 46 46 46 46 46 45 45 45 45 44 44 44 45 46 47 47 47 47 46 46 46 46 46 46 46 47 47 48 48 47 46 46 45
-683D5J%J%%%%%%j%%%%%%%%%%%%jJJ%jj%%%%%J%%%%j%JJ%%j%%%%J%%%%%j%J%%%%%%%%%%%%
$$ 45 46 46 47 47 47 47 47 47 47 46 46 46 46 46 46 46 46 46 46 46 46 46 45 46 47 47 46 45 45 45 45 45 45 46 46 46 46 46 45 45 46 47 47 47 46 46 46 46 46 47 47 47 47 47 47 46 46 47 47 47 47 47 47 47 47 47 47 47 47 47
-691D7%%%%%%j%Jj%%%%jjJ%%J%%%%%%j%%J%j%J%%%%%%%%%JjjJ%%%Jjj%%%%J%j%JJ%%%%j%%
$$ 47 47 47 47 47 47 47 46 46 47 46 46 46 46 46 45 44 45 45 45 46 46 46 46 46 46 46 45 45 45 46 46 45 45 46 46 46 46 46 46 46 46 46 46 47 46 45 46 46 46 46 47 46 45 45 45 45 45 46 46 45 45 46 47 47 47 47 47 46 46 46
-698D6%%J%%%jk%%%j%%%J%%%J%jJJj%%%%%%%%%%%%J%J%%jj%JJ%jjJJ%%%%%%%kjJ%jJJJj%%
$$ 46 46 46 47 47 47 47 46 44 44 44 44 43 43 43 43 44 44 44 44 45 45 44 45 46 45 45 45 45 45 45 45 45 45 45 45 45 45 46 46 47 47 47 46 45 45 46 47 47 46 45 46 47 47 47 47 47 47 47 47 45 44 45 45 44 45 46 47 46 46 46
-706D6j%%Jj%%%%Jj%%%%j%%%J%%%%%J%%j%J%%%%%j%%J%%%%j%%J%%J%%j%%%%%jJ%%%%%j%%%
$$ 46 45 45 45 46 45 45 45 45 45 46 45 45 45 45 45 44 44 44 44 45 45 45 45 45 45 46 46 46 45 45 46 46 46 46 46 46 45 45 45 46 46 46 46 46 45 45 45 46 46 46 47 47 47 46 46 46 46 46 46 45 46 46 46 46 46 46 45 45 45 45
-713D5JJ%%%%%j%JjjJ%J%%JjJ%jj%j%%%%%%j%j%%%%%J%%J%j%%%JJjj%%%%%%J%%%J%%j%%j%
$$ 45 46 47 47 47 47 47 47 46 46 47 46 45 46 46 47 47 47 48 47 48 48 47 46 46 45 45 45 45 45 45 45 44 44 43 43 43 43 43 43 44 44 44 45 45 44 44 44 44 45 46 45 44 44 44 44 44 44 44 45 45 45 45 46 46 46 45 45 45 44 44
-721D4jJKJ%%jj%j%jJJ%J%jJ%%%%j%jJ%%jJJ%jJ%%%%%%%%%%j%jJ%J%%%%%%%%%%j%%j%%J%%
$$ 44 43 44 46 47 47 47 46 45 45 44 44 43 44 45 45 46 46 45 46 46 46 46 46 45 45 44 45 45 45 44 45 46 46 45 46 46 46 46 46 46 46 46 46 46 46 45 45 44 45 45 46 46 46 46 46 46 46 46 46 46 46 45 45 45 44 44 44 45 45 45
-728D5J%%%%jj%%%%J%j%J%%%%jjjjJ%JJ%%j%J%J%J%%jj%J%jjJJJJj%%j%%J%%%%J%%%%j%%%
$$ 45 46 46 46 46 46 45 44 44 44 44 44 45 45 44 44 45 45 45 45 45 44 43 42 41 42 42 43 44 44 44 43 43 44 44 45 45 46 46 46 45 44 44 45 45 44 43 44 45 46 47 46 46 46 45 45 45 46 46 46 46 46 47 47 47 47 47 46 46 46 46
-735D6%jJ%%J%%j%%%%%j%%J%%j%%%JKjj%jJ%%%%j%j%%J%J%%%%j%%jj%j%J%%J%%jJJJjjj%%
$$ 46 46 45 46 46 46 47 47 47 46 46 46 46 46 46 45 45 45 46 46 46 45 45 45 45 46 48 47 46 46 45 46 46 46 46 46 45 45 44 44 44 45 45 46 46 46 46 46 45 45 45 44 43 43 42 42 43 43 43 44 44 44 43 44 45 46 45 44 43 43 43
-743D3J%JJ%%j%%%%%%%j%%j%%%%%j%%%J%%J%%J%jJ%J%%%jj%j%%%%JJj%%jJ%%j%JJ%j%%%jJ
$$ 43 44 44 45 46 46 46 45 45 45 45 45 45 45 45 44 44 44 43 43 43 43 43 43 42 42 42 42 43 43 43 44 44 44 45 45 44 45 45 46 46 46 46 45 44 44 43 43 43 43 43 44 45 44 44 44 43 44 44 44 43 43 44 45 45 44 44 44 44 43 44
-750D4JJj%%%%JjjJ%J%%j%j%%%J%%%%%%J%%jj%%J%%%Jj%%%JJ%%%%%jj%%j%J%%%%%%%%%%%%
$$ 44 45 46 45 45 45 45 45 46 45 44 45 45 46 46 46 45 45 44 44 44 44 45 45 45 45 45 45 45 46 46 46 45 44 44 44 45 45 45 45 46 45 45 45 45 46 47 47 47 47 47 47 46 45 45 45 44 44 45 45 45 45 45 45 45 45 45 45 45 45 45
-758D5%%%%%j%Jj%%%%%%%J%j%j%j%JJJ%%j%%%j%%%J%%%%%%j%JJ%j%jjJ%%J%%Jjj%JJ%j%%%
$$ 45 45 45 45 45 45 44 44 45 44 44 44 44 44 44 44 44 45 45 44 44 43 43 42 42 43 44 45 45 45 44 44 44 44 43 43 43 43 44 44 44 44 44 44 44 43 43 44 45 45 44 44 43 42 43 43 43 44 44 44 45 44 43 43 44 45 45 44 44 44 44
-765D4J%j%j%%%%%%%%%%%%%J%j%%%%J%%J%%j%jJ%J%%%%jjJ%J%j%%%%%%%j%%J%J%Jj%jJ%j%
$$ 44 45 45 44 44 43 43 43 43 43 43 43 43 43 43 43 43 43 43 44 44 43 43 43 43 43 44 44 44 45 45 45 44 44 43 44 44 45 45 45 45 45 44 43 44 44 45 45 44 44 44 44 44 44 44 44 43 43 43 44 44 45 45 46 45 45 44 45 45 44 44
-772D4%%%%%jJ%jj%%JJj%%%%%%J%%J%%%jj%%%%J%%%%j%%%JjJ%jJ%J%%%j%%%J%%%j%%%%Jj%
$$ 44 44 44 44 44 44 43 44 44 43 42 42 42 43 44 43 43 43 43 43 43 43 44 44 44 45 45 45 45 44 43 43 43 43 43 44 44 44 44 44 43 43 43 43 44 43 44 44 43 44 44 45 45 45 45 44 44 44 44 45 45 45 45 44 44 44 44 44 45 44 44
-780D4j%jJJj%%%%%JJ%J%j%j%jJ%%J%%J%%J%%%j%%J%J%j%%j%J%j%%jj%J%%%%%j%JJj%jJ%%
$$ 44 43 43 42 43 44 43 43 43 43 43 43 44 45 45 46 46 45 45 44 44 43 44 44 44 45 45 45 46 46 46 47 47 47 47 46 46 46 47 47 48 48 47 47 47 46 46 47 47 46 46 46 45 44 44 45 45 45 45 45 45 44 44 45 46 45 45 44 45 45 45
-787D5j%%%%%jJ%JJJ%%%jjj%J%%%JjJJjj%%j%%%%%JJJ%j%%JJ%%jjj%j%%%%%j%JJJ%J%jj%j
$$ 45 44 44 44 44 44 44 43 44 44 45 46 47 47 47 47 46 45 44 44 45 45 45 45 46 45 46 47 46 45 45 45 44 44 44 44 44 44 45 46 47 47 46 46 46 47 48 48 48 47 46 45 45 44 44 44 44 44 44 43 43 44 45 46 46 47 47 46 45 45 44
-795D4%%%%J%%j%%%%%Jj%%%j%%%%J%%J%%%%%%%jj%%J%%%%%J%%%%%jjjJJ%J%%j%%%%%%%j%%
$$ 44 44 44 44 44 45 45 45 44 44 44 44 44 44 45 44 44 44 44 43 43 43 43 43 44 44 44 45 45 45 45 45 45 45 45 44 43 43 43 44 44 44 44 44 44 45 45 45 45 45 45 44 43 42 43 44 44 45 45 45 44 44 44 44 44 44 44 44 43 43 43
-802D3%%jj%JL%j%%%%J%%%Jj%%jjJJ%%%jjk%JJJ%j%%%%%J%%%%%%j%JJJ%%%Jjjjj%%%%%%%%
$$ 43 43 43 42 41 41 42 45 45 44 44 44 44 44 45 45 45 45 46 45 45 45 44 43 44 45 45 45 45 44 43 41 41 42 43 44 44 43 43 43 43 43 43 44 44 44 44 44 44 44 43 43 44 45 46 46 46 46 47 46 45 44 43 43 43 43 43 43 43 43 43
-810D3Jjj%J%%%%jjKK%j%j%%%%%J%jj%%%%JJK%%%%%%jj%jjJ%j%%JJjJ%%J%%%%jj%%%%J%%%
$$ 43 44 43 42 42 43 43 43 43 43 42 41 43 45 45 44 44 43 43 43 43 43 43 44 44 43 42 42 42 42 42 43 44 46 46 46 46 46 46 46 45 44 44 43 42 43 43 42 42 42 43 44 43 44 44 44 45 45 45 45 45 44 43 43 43 43 43 44 44 44 44
-817D4%%%%%%j%J%%Jjj%Jj%%%%%J%J%%jJ%%%jj%%J%%%%%%%%%j%%Jj%%J%%%%%%j%%%%%%%%%
$$ 44 44 44 44 44 44 44 43 43 44 44 44 45 44 43 43 44 43 43 43 43 43 43 44 44 45 45 45 44 45 45 45 45 44 43 43 43 44 44 44 44 44 44 44 44 44 44 43 43 43 44 43 43 43 44 44 44 44 44 44 44 43 43 43 43 43 43 43 43 43 43
-824D3%%%J%%%J%%%j%%%%j%%j%%%J%%JJ%%%%j%%%J%%%%%j%Jj%J%%%j%%j%%%%%%%%J%%%%%%
$$ 43 43 43 43 44 44 44 44 45 45 45 45 44 44 44 44 44 43 43 43 42 42 42 42 43 43 43 44 45 45 45 45 45 44 44 44 44 45 45 45 45 45 45 44 44 45 44 44 45 45 45 45 44 44 44 43 43 43 43 43 43 43 43 43 44 44 44 44 44 44 44
-832D4%%%JJ%%kkj%JJJ%Jj%J%j%j%%J%%%jJ%%%%%%%%Jjj%jJJ%k%JJ%%%%J%%%%%jk%J%%%J%
$$ 44 44 44 44 45 46 46 46 44 42 41 41 42 43 44 44 45 44 44 45 45 44 44 43 43 43 44 44 44 44 43 44 44 44 44 44 44 44 44 44 45 44 43 43 42 43 44 44 42 42 43 44 44 44 44 44 45 45 45 45 45 45 44 42 42 43 43 43 43 44 44
-839D4%J%J%%jj%%j%j%%J%%%%%Jj%%%%%%jJ%%jJ%JJj%%j%%j%%J%%%j%%J%JJ%j%j%%%Jj%%j
$$ 44 44 45 45 46 46 46 45 44 44 44 43 43 42 42 42 43 43 43 43 43 43 44 43 43 43 43 43 43 43 42 43 43 43 42 43 43 44 45 44 44 44 43 43 43 42 42 42 43 43 43 43 42 42 42 43 43 44 45 45 44 44 43 43 43 43 44 43 43 43 42
-847D2J%%J%JJ%%j%%%%%%%jj%J%%%JJ%%jj%Jj%%j%%%%JJ%%j%Jjjj%J%j%jJ%%%%%%J%%J%jJ
$$ 42 43 43 43 44 44 45 46 46 46 45 45 45 45 45 45 45 45 44 43 43 44 44 44 44 45 46 46 46 45 44 44 45 44 44 44 43 43 43 43 43 44 45 45 45 44 44 45 44 43 42 42 43 43 42 42 41 42 42 42 42 42 42 42 43 43 43 44 44 43 44
-854D4%j%%%j%JJ%J%%%jj%j%J%%%%%jJJ%J%j%%%%%%%j%%%%%%J%J%%jj%%%%%J%%%%JJ%j%jj
$$ 44 44 43 43 43 43 42 42 43 44 44 45 45 45 45 44 43 43 42 42 43 43 43 43 43 43 42 43 44 44 45 45 44 44 44 44 44 44 44 44 43 43 43 43 43 43 43 44 44 45 45 45 44 43 43 43 43 43 43 44 44 44 44 44 45 46 46 45 45 44 43
-861D3%%%jJ%%%JJj%j%%J%%%%j%%J%%%%%%%%j%j%%%%J%%%%%%J%%%%%%%%%j%j%%%%%%%%%J%
$$ 43 43 43 43 42 43 43 43 43 44 45 44 44 43 43 43 44 44 44 44 44 43 43 43 44 44 44 44 44 44 44 44 44 43 43 42 42 42 42 42 43 43 43 43 43 43 43 44 44 44 44 44 44 44 44 44 44 43 43 42 42 42 42 42 42 42 42 42 42 43 43
-869D3%J%%%%j%j%%JJ%%j%%%%%jJ%%%J%%%jj%j%%%%%%JJ%%jJ%%%K%jjjj%%J%Jj%%%%%%%J%
$$ 43 43 44 44 44 44 44 43 43 42 42 42 43 44 44 44 43 43 43 43 43 43 42 43 43 43 43 44 44 44 44 43 42 42 41 41 41 41 41 41 41 42 43 43 43 42 43 43 43 43 45 45 44 43 42 41 41 41 42 42 43 42 42 42 42 42 42 42 42 43 43
-876D3%%%j%J%J%%%%jjj%%%%%%KJj%%%%%J%%jj%%%%%J%%j%JJjj%%Jj%%%J%j%%J%%%%%%%%%
$$ 43 43 43 43 42 42 43 43 44 44 44 44 44 43 42 41 41 41 41 41 41 41 43 44 43 43 43 43 43 43 44 44 44 43 42 42 42 42 42 42 43 43 43 42 42 43 44 43 42 42 42 43 42 42 42 42 43 43 42 42 42 43 43 43 43 43 43 43 43 43 43
-884D3%J%%%%%%jj%%J%jj%%%J%%%%%%JJ%j%%%j%%%%%J%%%%J%JJ%jjj%j%%j%%%%J%%%%%j%j
$$ 43 43 44 44 44 44 44 44 44 43 42 42 42 43 43 42 41 41 41 41 42 42 42 42 42 42 42 43 44 44 43 43 43 43 42 42 42 42 42 42 43 43 43 43 43 44 44 45 46 46 45 44 43 43 42 42 42 41 41 41 41 41 42 42 42 42 42 42 41 41 40
-891D0JJJ%%%%%%j%%%%%%j%J%%%%%%J%J%%j%%J%jj%%%J%%J%j%%%%%%J%%jj%%j%%J%%%%%%J
$$ 40 41 42 43 43 43 43 43 43 43 42 42 42 42 42 42 42 41 41 42 42 42 42 42 42 42 43 43 44 44 44 43 43 43 44 44 43 42 42 42 42 43 43 43 44 44 43 43 43 43 43 43 43 44 44 44 43 42 42 42 41 41 41 42 42 42 42 42 42 42 43
-899D3%J%j%%jj%%%%%J%J%%k%%%%%J%j%%%%%jJJJJ%j%Jj%%J%%j%j%%j%%J%J%%%%%KJjjj%%
$$ 43 43 44 44 43 43 43 42 41 41 41 41 41 41 42 42 43 43 43 41 41 41 41 41 41 42 42 41 41 41 41 41 41 40 41 42 43 44 44 43 43 44 43 43 43 44 44 44 43 43 42 42 42 41 41 41 42 42 43 43 43 43 43 43 45 46 45 44 43 43 43
$$ [...]
-2638I0
##END=		$$ NMR SPECTRUM
##END=		$$ LINK
