##TITLE=	UHS-603-F1-FULL-DATA.10.fid
##JCAMP-DX=	6.0	$$ MestReNova 14.3.3-33362
##DATA TYPE=	LINK
##BLOCKS=	1    
##ORIGIN=	Mestrelab Research S.L.
##OWNER=	hrzepa
##$MNOVA/METADATA=	(DOCUMENT,BASE64)
eyJuYW1lIjoiL1VzZXJzL2hyemVwYS9MaWJyYXJ5L01vYmlsZSBEb2N1bWVudHMvY29tfmFwcGxlfkN
sb3VkRG9jcy9TaGVwcGFyZC9OTVIgZmlsZXMgemlwcy0yLzI4LzI4LUgubW5vdmEiLCJwYWdlcyI6W3
siaXRlbXMiOlsiMSIgICAgIF19XX0=
##TITLE=	UHS-603-F1-FULL-DATA.10.fid
##JCAMP-DX=	6.0	$$ MestReNova 14.3.3-33362
##DATA TYPE=	NMR SPECTRUM
##DATA CLASS=	XYDATA
##BLOCK_ID=	1
##ORIGIN=	Bruker BioSpin GmbH
##OWNER=	Cryotool
##NUMDIM=	1
##$MNOVA/METADATA=	(ITEM,BASE64)
eyJhbmdsZSI6MCwiYXhlcyI6eyJ4Ijp7Im1heCI6MTYuMTgyMDY5OTk5OTU1NTMsIm1pbiI6LTMuODQ
1NDg5MDA5MzEyNjI1fSwieSI6eyJtYXgiOjUzODAuMDc1Mjg2ODY1MjM0LCJtaW4iOi00ODkuMjQ1Nj
I2NzkyMzExNjd9fSwicG9pbnRzIjpbeyJ4Ijo1MzIxLCJ5Ijo1ODM1fSx7IngiOjg3MjIsInkiOjU4M
zV9LHsieCI6ODcyMiwieSI6ODIwOH0seyJ4Ijo1MzIxLCJ5Ijo4MjA4fSx7IngiOjUzMjEsInkiOjU4
MzV9XSwieiI6MH0=
##.OBSERVE FREQUENCY=	600.13370580200000859
##.OBSERVE NUCLEUS=	^1H
##.SOLVENT NAME=	DMSO
##.PULSE SEQUENCE=	zg30
##LONGDATE=	2024/07/04 17:13:35.000
##.ACQUISITIONMODE=	SIMULTANEOUS (DQD)
##$ORIGINAL FORMAT=	Bruker XWIN-NMR
##$MNOVA/SCALES_VERSION=	9
##$PARAMETER FILE=	(acqus, ASCII, /private/var/folders/f6/rjf_tdyn2v98c5c0wvkgn4s80000gq/T/gHtK0R+LS3KE5awfXU72Mg/10/acqus, 0)
$$ ##TITLE= Parameter file, TopSpin 3.6.4
$$ ##JCAMPDX= 5.0
$$ ##DATATYPE= Parameter Values
$$ ##NPOINTS= 1	$$ modification sequence number
$$ ##ORIGIN= Bruker BioSpin GmbH
$$ ##OWNER= Cryotool
$$ $$ 2024-07-04 17:13:43.242 +0100  Cryotool@topspin3
$$ $$ Y:/600/data/tds/nmr/UHS-603-F1-FULL-DATA/10/acqus
$$ $$ process C:\Bruker\TopSpin3.6.4\prog\mod\dirdata.exe
$$ ##$ACQT0= -1.36465403113263
$$ ##$AMP= (0..31)
$$ 100 100 100 100 100 100 100 100 100 100 100 100 100 100 100 100 100 100
$$ 100 100 100 100 100 100 100 100 100 100 100 100 100 100
$$ ##$AMPCOIL= (0..19)
$$ -1 0 0 0 0 0 0 0 0 0 0 0 0 0 0 0 0 0 0 0
$$ ##$ANAVPT= -1
$$ ##$AQSEQ= 0
$$ ##$AQ_mod= 3
$$ ##$AUNM= <au_zg>
$$ ##$AUTOPOS= <1 >
$$ ##$BF1= 600.13
$$ ##$BF2= 600.13
$$ ##$BF3= 600.13
$$ ##$BF4= 600.13
$$ ##$BF5= 600.13
$$ ##$BF6= 600.13
$$ ##$BF7= 600.13
$$ ##$BF8= 600.13
$$ ##$BWFAC= (0..63)
$$ 0 0 0 0 0 0 0 0 0 0 0 0 0 0 0 0 0 0 0 0 0 0 0 0 0 0 0 0 0 0 0 0 0 0 0 0
$$ 0 0 0 0 0 0 0 0 0 0 0 0 0 0 0 0 0 0 0 0 0 0 0 0 0 0 0 0
$$ ##$BYTORDA= 0
$$ ##$CAGPARS= (0..11)
$$ 0 0 0 0 0 0 0 0 0 0 0 0
$$ ##$CHEMSTR= <none>
$$ ##$CNST= (0..63)
$$ 1 1 1 1 1 1 1 1 1 1 1 1 1 1 1 1 1 1 1 1 1 1 1 1 1 1 1 1 1 1 1 1 1 1 1 1
$$ 1 1 1 1 1 1 1 1 1 1 1 1 1 1 1 1 1 1 1 1 1 1 1 1 1 1 1 1
$$ ##$CPDPRG= (0..8)
$$ <> <> <> <> <> <> <> <> <>
$$ ##$D= (0..63)
$$ 0 1 0 0 0 0 0 0 0 0 0 0 0 0 0 0 0.0002 0 0 0 0 0 0 0 0 0 0 0 0 0 0 0 0
$$ 0 0 0 0 0 0 0 0 0 0 0 0 0 0 0 0 0 0 0 0 0 0 0 0 0 0 0 0 0 0 0
$$ ##$DATE= 1720109615
$$ ##$DATE_START= 1720109597
$$ ##$DE= 43.81035
$$ ##$DECBNUC= <off>
$$ ##$DECIM= 1664
$$ ##$DECNUC= <off>
$$ ##$DECSTAT= 4
$$ ##$DIGMOD= 3
$$ ##$DIGTYP= 12
$$ ##$DQDMODE= 0
$$ [...]
$$ ##$ShimPowMaxUC= (0..63)
$$ 130000 130000 130000 130000 130000 130000 130000 130000 130000 130000 130000
$$ 130000 130000 130000 130000 130000 130000 130000 130000 130000 130000 130000
$$ 130000 130000 130000 130000 130000 130000 130000 130000 130000 130000 130000
$$ 130000 130000 130000 130000 130000 130000 130000 0 0 0 0 0 0 0 0 0 0 0
$$ 0 0 0 0 0 0 0 0 0 0 0 0 0
$$ ##$ShimPowMaxUG= (0..63)
$$ 1000000 1000000 1000000 1000000 1000000 1000000 1000000 1000000 1000000
$$ 1000000 1000000 1000000 1000000 1000000 1000000 1000000 1000000 1000000
$$ 1000000 1000000 1000000 1000000 1000000 1000000 1000000 1000000 1000000
$$ 1000000 1000000 1000000 1000000 1000000 1000000 1000000 1000000 1000000
$$ 1000000 1000000 1000000 0 0 0 0 0 0 0 0 0 0 0 0 0 0 0 0 0 0 0 0 0 0 0 0
$$ 0
$$ ##$ShimPowNum= 0
$$ ##$ShimPowRcbType= 3
$$ ##$ShimPowRes= (0..63)
$$ 1e-020 1e-020 1e-020 1e-020 1e-020 1e-020 1e-020 1e-020 1e-020 1e-020 1e-020
$$ 1e-020 1e-020 1e-020 1e-020 1e-020 1e-020 1e-020 1e-020 1e-020 1e-020 1e-020
$$ 1e-020 1e-020 1e-020 1e-020 1e-020 1e-020 1e-020 1e-020 1e-020 1e-020 1e-020
$$ 1e-020 1e-020 1e-020 1e-020 1e-020 1e-020 1e-020 0 0 0 0 0 0 0 0 0 0 0
$$ 0 0 0 0 0 0 0 0 0 0 0 0 0
$$ ##$ShimPowRng0= (0..63)
$$ 1 1 1 1 1 1 1 1 1 1 1 1 1 1 1 1 1 1 1 1 1 1 1 1 1 1 1 1 1 1 1 1 1 1 1 1
$$ 1 1 1 1 0 0 0 0 0 0 0 0 0 0 0 0 0 0 0 0 0 0 0 0 0 0 0 0
$$ ##$ShimPowRng1= (0..63)
$$ 1 1 1 1 1 1 1 1 1 1 1 1 1 1 1 1 1 1 1 1 1 1 1 1 1 1 1 1 1 1 1 1 1 1 1 1
$$ 1 1 1 1 0 0 0 0 0 0 0 0 0 0 0 0 0 0 0 0 0 0 0 0 0 0 0 0
$$ ##$ShimPowRng2= (0..63)
$$ 1 1 1 1 1 1 1 1 1 1 1 1 1 1 1 1 1 1 1 1 1 1 1 1 1 1 1 1 1 1 1 1 1 1 1 1
$$ 1 1 1 1 0 0 0 0 0 0 0 0 0 0 0 0 0 0 0 0 0 0 0 0 0 0 0 0
$$ ##$ShimPowRng3= (0..63)
$$ 1 1 1 1 1 1 1 1 1 1 1 1 1 1 1 1 1 1 1 1 1 1 1 1 1 1 1 1 1 1 1 1 1 1 1 1
$$ 1 1 1 1 0 0 0 0 0 0 0 0 0 0 0 0 0 0 0 0 0 0 0 0 0 0 0 0
$$ ##$ShimPowType1= 0
$$ ##$ShimPowType2= 0
$$ ##$ShimPowType3= 0
$$ ##$ShimPowType4= 0
$$ ##$ShimSysAngle= <>
$$ ##$ShimSysFunc= (0..63)
$$ 1 2 3 4 5 6 7 8 9 10 0 37 38 35 16 15 14 13 12 11 28 27 26 25 24 23 36
$$ 22 30 29 20 21 34 33 32 31 17 18 19 0 0 0 0 0 0 0 0 0 0 0 0 0 0 0 0 0 0
$$ 0 0 0 0 0 0 0
$$ ##$ShimSysMatId= <no>
$$ ##$ShimSysMatrix= 1
$$ ##$ShimSysOffset= <42 mm>
$$ ##$ShimSysType= 4
$$ ##$ShimUnit= 0
$$ ##$TFXNUM= 0
$$ ##$TOSITY= <no>
$$ ##$TRIPLO2= 0
$$ ##$VTU= 1
$$ ##$VTUETH= <no>
$$ ##$VTUTY= <tty05>
$$ ##$WBREFAM= (0..15)
$$ 100 100 100 100 100 100 100 100 100 100 100 100 100 100 100 100
$$ ##$WBREFLM= (0..15)
$$ 0 0 0 0 0 0 0 0 0 0 0 0 0 0 0 0
$$ ##$WBREFPH= (0..15)
$$ 0 0 0 0 0 0 0 0 0 0 0 0 0 0 0 0
$$ ##$WBSGU= (0..15)
$$ 0 0 0 0 0 0 0 0 0 0 0 0 0 0 0 0
$$ ##$XFAC= 2
$$ ##END=
$$ 
##$DECIM=	1664
##$DSPFVS=	21
##XUNITS=	HZ
##YUNITS=	ARBITRARY UNITS
##FIRSTX=	9711.3457349610307574
##LASTX=	-2307.7933348162696348
##DELTAX=	-0.091699453500601199596
##XFACTOR=	1
##YFACTOR=	0.14926526986468854896
##FIRSTY=	0.061004981398582458496
##MINY=	-0.14818874001502990723
##MAXY=	4890.97509765625
##NPOINTS=	131072
##XYDATA=	(X++(Y..Y))
$$ [...]
2644B%%J%%%%%%%%%%%%%%%%%%%%%%%J%%%%%%%j%%%%%%%j%%J%%%%%J%%jJ%j%%%%%%%%%%%%%
$$ 2 2 2 3 3 3 3 3 3 3 3 3 3 3 3 3 3 3 3 3 3 3 3 3 3 3 3 4 4 4 4 4 4 4 4 3 3 3 3 3 3 3 3 2 2 2 3 3 3 3 3 3 4 4 4 3 4 4 3 3 3 3 3 3 3 3 3 3 3 3 3 3
2638C%%J%%%%%%%%j%%%%J%%%%%J%%%%%%%%%%%%%%J%%j%%%%%%%%%%%J%%%j%J%j%%%%%%%%%%
$$ 3 3 3 4 4 4 4 4 4 4 4 4 3 3 3 3 3 4 4 4 4 4 4 5 5 5 5 5 5 5 5 5 5 5 5 5 5 5 6 6 6 5 5 5 5 5 5 5 5 5 5 5 5 6 6 6 6 5 5 6 6 5 5 5 5 5 5 5 5 5 5 5
2631E%%%J%%%J%%%%%%%%%%%%%%%%%%%%%%%%%%%%%%%%%J%%%%%%%J%%%%J%%%%%%%%%%J%%%%%
$$ 5 5 5 5 6 6 6 6 7 7 7 7 7 7 7 7 7 7 7 7 7 7 7 7 7 7 7 7 7 7 7 7 7 7 7 7 7 7 7 7 7 7 8 8 8 8 8 8 8 8 9 9 9 9 9 10 10 10 10 10 10 10 10 10 10 10 11 11 11 11 11 11
2625A1J%j%%J%%J%%%%J%%%%%J%%%J%J%%%J%J%J%JJ%JJJJ%JJJKJJKJKKKKKLKLLLMLMNNNOOO
$$ 11 12 12 11 11 11 12 12 12 13 13 13 13 13 14 14 14 14 14 14 15 15 15 15 16 16 17 17 17 17 18 18 19 19 20 20 21 22 22 23 24 25 26 26 27 28 29 31 32 33 35 36 38 40 42 44 46 49 51 54 57 60 64 67 71 76 81 86 92 98 104
2618A04PQRRJ0J0J0J1J1J1J2J2J2J2J2J1J1J0J0QQONLLJJjkmmmoooppqppppoonmnllkkjj%
$$ 104 111 119 128 137 147 157 167 178 189 200 212 224 236 248 260 271 282 292 302 310 318 324 329 332 335 336 337 336 334 330 326 322 316 310 304 297 290 282 275 268 261 254 248 242 237 233 228 225 222 220 218 217 216 216
2613B16JJKKMMNNPPQJ0J1J1J3J4J6J7J9K0K2K4K6K8L0L2L3L5L6L7L7L8L6L6L3L2K9K5K1J7
$$ 216 217 218 220 222 226 230 235 240 247 254 262 272 283 294 307 321 337 354 373 393 415 439 465 493 523 555 588 623 659 696 733 771 807 843 876 908 937 962 983 1000
2609A000J1PJmj0j4j9k4k7l1l2l5l6l6l7l7l5l4l3l2k9k7k5k4k0j9j8j5j4j2j1rqoommkj%
$$ 1000 1011 1018 1019 1015 1005 991 972 948 921 890 858 823 787 751 714 677 642 608 575 543 514 487 462 438 418 399 381 366 352 340 329 320 312 306 300 296 292 290 289 289
2606B89JKKMNOQRRJ2J2J5J6J7K0K1K3K4K7K7K9K9K9K9K8K8K5K4K1J8J4J2PNJlnqj0j1j3j3
$$ 289 290 292 294 298 303 309 317 326 335 347 359 374 390 407 427 448 471 495 522 549 578 607 636 665 693 721 746 770 791 809 823 835 842 847 848 845 840 832 822 811 798 785
2602G85j3j4j3j2j1j0j0qponnnnnnppprj0j1j1j2j3j4j3j4j4j4j4j3j2j2j1j1rrponmmkj%
$$ 785 772 758 745 733 722 712 702 694 687 681 676 671 666 661 656 651 644 637 630 621 611 600 589 577 564 550 537 523 509 495 481 468 456 444 433 422 413 404 397 391 386 382 378 376 375 375
2598C75JKMNPPJ0J0J2J4J6J7J9K1K4K6K8L1L4L7M0M2M5M7M9N1N2N2N2N1M9M6M3L8L3K7K0J4
$$ 375 376 378 382 387 394 401 411 421 433 447 463 480 499 520 544 570 598 629 663 700 740 782 827 874 923 974 1026 1078 1130 1181 1230 1276 1319 1357 1390 1417 1437 1451
2594A451Okqj6k3k9l5m0m3m7m9n1n1n1n1m8m8m5m2m1l7l5l2k8k6k4k2j9j7j5j4j1j0qonlk
$$ 1451 1457 1455 1447 1431 1408 1379 1344 1304 1261 1214 1165 1114 1063 1012 961 913 865 820 778 737 700 665 633 605 579 555 533 514 497 482 468 457 447 439 433 428 425 423
2591D23jJKMOPRJ1J2J5J6J9K1K2K5K6K9K9L1L2L3L3L1L1K9K6K3J9J5J0M%oj2j6k2k6l1l5l7
$$ 423 422 423 425 429 435 442 451 462 474 489 505 524 545 567 592 618 647 676 707 739 772 805 836 867 896 922 945 964 979 989 993 993 987 975 959 937 911 880 845 808
2587H08l9m0m2m2m1m1l9l7l6l3l2k9k7k4k3k1j8j8j5j5j2j2j1j0rrpqopnonnmmmlllllkkl
$$ 808 769 729 687 645 604 563 524 487 451 418 386 357 330 306 283 262 244 226 211 196 184 172 161 151 142 133 126 118 112 105 100 94 89 84 80 76 72 69 66 63 60 57 55 53 50
2583E0kkjkjjkjjjjkjj%jjjj%jj%jj%j%j%j%j%%%%%%%j%%%%%%%j%j%%%%%%j%%%%j%%%j%%%
$$ 50 48 46 45 43 42 41 39 38 37 36 35 33 32 31 31 30 29 28 27 27 26 25 25 24 23 23 22 22 21 21 20 20 19 19 19 19 19 19 19 19 18 18 18 18 18 18 18 18 17 17 16 16 16 16 16 16 16 15 15 15 15 15 14 14 14 14 13 13 13 13
2577A3%%j%%%%j%%%%j%%%%%%j%%%jJ%j%%%J%%j%%%%%%%%%%%%%%%%%%%%%%%%%%%%%j%%%%%j
$$ 13 13 13 12 12 12 12 12 11 11 11 11 11 10 10 10 10 10 10 10 9 9 9 9 8 9 9 8 8 8 8 9 9 9 8 8 8 8 8 8 8 8 8 8 8 8 8 8 8 8 8 8 8 8 8 8 8 8 8 8 8 8 8 8 7 7 7 7 7 7 6
2570F%%%%%j%%%%%%%%%%%%%%%%%%%%%%j%%%%%%%%%%%%J%%j%%%%%%%%%%%%%%%%%%%%%%%%%%
$$ 6 6 6 6 6 6 5 5 5 5 5 5 5 5 5 5 5 5 5 5 5 5 5 5 5 5 5 5 5 4 4 4 4 4 4 4 4 4 4 4 4 4 5 5 5 4 4 4 4 4 4 4 4 4 4 4 4 4 4 4 4 4 4 4 4 4 4 4 4 4 4 4
2564D%j%J%%%%J%%%%%%%%j%%J%%%%%%%%j%%%%%%%%%%J%%%%%%%%%%%%%%%%%%%%%%%%%%j%%%
$$ 4 4 3 3 4 4 4 4 4 5 5 5 5 5 5 5 5 5 4 4 4 5 5 5 5 5 5 5 5 5 4 4 4 4 4 4 4 4 4 4 4 5 5 5 5 5 5 5 5 5 5 5 5 5 5 5 5 5 5 5 5 5 5 5 5 5 5 5 4 4 4 4
2557DJ%%%%%%%%%%J%%%%%%%%%%%j%J%%%%%J%%%%%j%%%%%J%%%%%%%J%%%%J%%%%%%%%%%%%%%
$$ 4 5 5 5 5 5 5 5 5 5 5 5 6 6 6 6 6 6 6 6 6 6 6 6 5 5 6 6 6 6 6 6 7 7 7 7 7 7 6 6 6 6 6 6 7 7 7 7 7 7 7 7 8 8 8 8 8 9 9 9 9 9 9 9 9 9 9 9 9 9 9 9
2551I%J%%%%%%j%J%J%%%%%J%%%%%%%J%%%%%J%%J%%J%%%%J%%%%J%%%J%%%%J%J%J%%J%%J%J%
$$ 9 9 10 10 10 10 10 10 10 9 9 10 10 11 11 11 11 11 11 12 12 12 12 12 12 12 12 13 13 13 13 13 13 14 14 14 15 15 15 16 16 16 16 16 17 17 17 17 17 18 18 18 18 19 19 19 19 19 20 20 21 21 22 22 22 23 23 23 24 24 25 25
2544B5JJ%JJ%JJKJJKJJKJJKKKKKLKLLLLMLNMNNNOOPPQRRJ0J0J1J1J3J3J4J4J6J5J6J7J6J6
$$ 25 26 27 27 28 29 29 30 31 33 34 35 37 38 39 41 42 43 45 47 49 51 53 56 58 61 64 67 70 74 77 82 86 91 96 101 107 113 120 127 135 144 153 163 173 184 195 208 221 235 249 265 280 296 313 329 345
2539C45J6J6J4J5J3J1J1RPOLK%jmopqrj0j1j1j2j2j2j1j2j2j1j0rrrpoonmmkjj%JJLLNNPP
$$ 345 361 377 391 406 419 430 441 450 457 463 466 468 468 467 463 457 450 442 433 423 412 401 389 377 365 354 342 330 319 309 300 291 282 275 269 263 258 254 250 248 247 246 246 247 248 251 254 259 264 271 278
2534B78QJ0J0J1J1J3J3J4J5J4J5J5J5J4J3J2J1RQPNLJklnpqrj1j2j3j3j5j4j4j4j3j4j3j2
$$ 278 286 296 306 317 328 341 354 368 383 397 412 427 442 456 469 481 492 501 509 516 521 524 525 523 520 515 508 500 491 480 468 455 442 427 413 399 385 372 358 345 333
2531C33j2j1j1j0rqqppnnnmlkkkj%%JJKKLMMNOPPQRJ0J1J2J4J4J7J7K0K2K3K6K8L0L2L5L6
$$ 333 321 310 299 289 280 272 264 257 250 245 240 235 231 228 226 224 222 221 221 221 222 223 225 227 230 234 238 243 249 256 263 271 280 290 301 313 327 341 358 375 395 417 440 466 494 524 556 591 627
2526F27L9M0M1M2M2M1M1L8L7L2K9K4K0J4RMjoj1j5j9k1k3k4k5k6k5k5k4k2k1j9j8j7j5j4j3
$$ 627 666 706 747 789 831 872 913 951 988 1020 1049 1073 1093 1107 1116 1120 1119 1113 1102 1087 1068 1047 1024 1000 975 949 924 899 875 853 832 813 795 778 763 749 736
2523G36j2j1j1j0j0rrqppnnlkjKLNRJ0J4J6J9K2K5K8L0L2L4L5L6L5L4L3L0K7K3J8J3QKlqj3
$$ 736 724 713 702 692 682 673 664 656 649 642 637 632 629 627 626 628 631 636 645 655 669 685 704 726 751 779 809 841 875 910 946 981 1015 1048 1078 1105 1128 1146 1159 1167 1169 1166 1158 1145
2519A145j8k2k5k8l0l2l2l3l2l2l0k9k8k6k5k4k2k2k0k0j9j9j9j8j8j8j8j8j8j7j7j7j6j5
$$ 1145 1127 1105 1080 1052 1022 990 958 925 893 861 831 802 774 748 723 699 677 655 635 615 596 577 558 540 522 504 486 468 450 433 416 399 383 368
2516C68j5j5j4j3j2j2j1j0rrqppnommmlkkjj%%JJKKLMMNOOPQJ0J0J1J3J4J6J7J9K0K2K3K5
$$ 368 353 338 324 311 299 287 276 266 257 248 240 233 226 221 215 211 207 203 200 198 196 195 194 194 194 195 196 198 200 203 207 211 216 222 228 235 243 253 263 274 287 301 317 334 353 373 395 418 443
2511D43K7K7K8K8K8K7K6K5K2J9J6J2QMjnrj3j8k0k2k5k7k8k8k8k8k7k5k5k2k1j9j7j5j4j1
$$ 443 470 497 525 553 581 608 634 659 681 700 716 728 736 740 739 734 725 712 694 674 652 627 600 572 544 516 488 461 436 411 389 368 349 332 317 303 292
2508B92j0rppmmlj%KKLNNOQRJ1J2J4J5J7J9K0K1K3K4K5K5K5K5K4K3K0J9J5J1QM%mqj3j5k0
$$ 292 282 273 266 259 255 251 248 247 247 249 251 254 259 264 270 278 287 298 310 324 339 356 375 395 416 439 463 488 513 538 563 587 610 630 649 664 675 683 687 687 683 675 662 647 627
2503F27k2k5k7k8k9l0l0k9k8k7k5k5k2k1j9j8j6j5j3j3j1j0rrqppoonnmmmmllllkkkkkjkk
$$ 627 605 580 553 525 496 466 436 407 379 352 327 302 280 259 240 222 206 191 178 165 154 144 135 126 118 111 104 98 92 87 82 78 74 70 66 63 60 57 54 52 50 48 46 44 43 41 39
2499C9jjkjjjkjjj%j%j%jj%j%%j%%j%j%j%%j%%%j%%%%%j%%%%%%j%%%%%%%j%%%%%%%%%%%%%
$$ 39 38 37 35 34 33 32 30 29 28 27 27 26 26 25 25 24 23 23 22 22 22 21 21 21 20 20 19 19 18 18 18 17 17 17 17 16 16 16 16 16 16 15 15 15 15 15 15 15 14 14 14 14 14 14 14 14 13 13 13 13 13 13 13 13 13 13 13 13 13 13
2493A3j%%%%%%%%%%%%%J%%%j%%%%jJ%%%%%%%%%%%%%%%%%%%%%%%J%%%%%%%%%%J%%J%%%J%%%
$$ 13 12 12 12 12 12 12 12 12 12 12 12 12 12 12 13 13 13 13 12 12 12 12 12 11 12 12 12 12 12 12 12 12 12 12 12 12 12 12 12 12 12 12 12 12 12 12 12 12 13 13 13 13 13 13 13 13 13 13 13 14 14 14 15 15 15 15 16 16 16 16
2486A6J%%J%%J%%%J%J%%J%J%JJ%J%JJJ%JJJJJJJKJJKKJKKJKLLKLLLMLMNMNNOOPPQQQRJ0J1
$$ 16 17 17 17 18 18 18 19 19 19 19 20 20 21 21 21 22 22 23 23 24 25 25 26 26 27 28 29 29 30 31 32 33 34 35 36 38 39 40 42 44 45 47 49 50 52 55 58 60 63 66 69 73 76 80 85 89 94 99 105 111 118 125 133 141 149 158 168 179
2480A79J2J2J4J4J4J5J6J6J7J7J6J6J6J4J3J1RQOMKJkklmnmnnmmlmkjJJLLNOPRRRJ0J0J0J0
$$ 179 191 203 217 231 245 260 276 292 309 326 342 358 374 388 401 412 421 429 435 439 441 442 440 438 435 431 426 422 417 412 408 404 401 397 395 394 395 396 399 402 407 413 420 429 438 447 457 467 477 487
2476D87QPOMK%knprj0j2j4j4j5j6j6j6j5j4j5j3j2j1j0j0qqpnnmlkkj%JKLLMOOPRJ0J0J2J3
$$ 487 495 502 508 512 514 514 512 507 500 491 481 469 455 441 426 410 394 378 363 349 334 321 309 298 288 278 270 262 255 250 245 241 238 236 234 233 233 234 236 239 242 246 252 258 265 274 284 294 306 319
2471C19J4J5J6J6J8J7J8J7J6J5J4J2J0QOMK%lmnoppppooonmlkjjJJJKKLLLLKKJ%jkmoprj1
$$ 319 333 348 364 380 398 415 433 450 466 481 495 507 517 525 531 535 537 537 534 530 525 519 512 505 498 491 485 479 473 468 464 461 459 458 457 458 459 460 462 464 467 470 473 476 478 480 481 481 480 478 474 468 461 452 441
2466D41j2j3j4j5j5j5j6j6j5j5j4j4j3j2j2j1j0rrqqpoooonmnmmllllklkkljkkjkkjjjjjj
$$ 441 429 416 402 387 372 357 341 325 310 295 281 267 254 242 230 219 209 200 191 183 175 168 162 156 150 144 139 135 130 126 122 119 116 113 110 108 105 103 101 98 97 95 93 92 90 88 87 86 85 84 83 82
2461H2jjjjjjj%%%%%%j%%%%%%%%J%J%%%%J%J%J%J%J%JJKJJJKJKJKKJLKLKLLLLMLMNNNNOOP
$$ 82 81 80 79 78 77 76 75 75 75 75 75 75 75 74 74 74 74 74 74 74 74 74 75 75 76 76 76 76 76 77 77 78 78 79 79 80 80 81 81 82 83 85 86 87 88 90 91 93 94 96 98 99 102 104 107 109 112 115 118 121 125 128 132 137 142 147 152 158 164 171
2455A71PQRJ0J0J2J2J3J5J6J7K0K1K3K6K8L1L3L6L8M1M4M5M6M5M4M1L8L2K6J9J1Lmj1j6k0
$$ 171 178 186 195 205 215 227 239 252 267 283 300 320 341 364 390 418 449 482 518 556 597 641 686 732 777 821 862 900 932 958 977 988 991 987 976 960 940
2451I40k4k5k5k5k3k1j9j6j2j0pl%KOQJ1J3J6J8J9K1K1K1K1J9J8J5J1QLkqj2j8k3k8l1l5l7
$$ 940 916 891 866 841 818 797 778 762 750 740 733 730 730 732 738 746 757 770 786 804 823 844 865 886 907 926 944 959 970 978 981 979 971 959 941 918 890 859 824 787
2448G87l9l9l8l8l6l4l1k9k6k4k1j8j6j3j1rpnmj%JMNPRJ1J3J5J8K1K3K6K8L2L5L7M1M2M4
$$ 787 748 709 671 633 597 563 532 503 477 453 432 414 398 385 374 365 358 353 349 348 348 349 353 358 365 374 385 398 413 431 452 475 501 529 561 596 633 674 716 760
2444G60M4M5M2M0L6K9K3J6Pjqj5k0k4k7k8k8k8k5k4k2j8j6j3j0pljLOJ0J2J6J9K2K3K5K5K5
$$ 760 804 849 891 931 967 996 1019 1035 1042 1041 1033 1018 998 974 947 919 891 863 838 814 792 774 758 745 735 728 725 724 727 733 743 755 771 790 812 835 860 885 910
2440I10K2K0J3Q%pj6k3l0l6m0m3m6m6m6m5m3m1l9l6l3l1k7k6k3k0k0j7j6j4j3j2j2j0rqqp
$$ 910 932 952 965 973 973 966 950 927 897 861 821 778 732 686 640 595 552 511 472 436 403 372 345 319 296 276 256 239 223 209 196 184 172 162 153 145 137 130
2437A30poonmnmmmlmkllkjklkkjkjkjkjkjjjjjjjjjjj%%jjj%jj%jjj%j%jjj%%j%jj%j%j%j
$$ 130 123 117 111 106 102 97 93 89 85 82 78 76 73 70 68 67 65 62 60 58 57 55 54 52 51 49 48 46 45 44 43 42 41 40 39 38 37 36 35 35 35 34 33 32 32 31 30 30 29 28 27 27 26 26 25 24 23 23 23 22 22 21 20 20 19 19 18 18 17
2431A7%%%j%%j%%j%%j%%j%%%%%%%%%%%%%%%%%%J%%%%%%%j%j%j%%j%j%%%%j%%%%%%j%%%%%%
$$ 17 17 17 17 16 16 16 15 15 15 14 14 14 13 13 13 12 12 12 12 12 12 12 12 12 12 12 12 12 12 12 12 12 12 12 13 13 13 13 13 13 13 13 12 12 11 11 10 10 10 9 9 8 8 8 8 8 7 7 7 7 7 7 7 6 6 6 6 6 6 6
2424F%j%%%J%%%%%j%%%J%%%%%%j%%J%%%%%%%J%%J%J%JJJJKJJ%%%jjkjkj%j%j%j%j%%%%%%%
$$ 6 6 5 5 5 5 6 6 6 6 6 6 5 5 5 5 6 6 6 6 6 6 6 5 5 5 6 6 6 6 6 6 6 6 7 7 7 8 8 9 9 10 11 12 13 15 16 17 17 17 17 16 15 13 12 10 9 9 8 8 7 7 6 6 5 5 5 5 5 5 5 5
2418Ej%%%%%%%%%%%%%%%%%%%j%%J%%%%%%%%%%%%%%%J%%J%J%JJJJJKJK%%%kjkjjjjjj%j%%%
$$ 5 4 4 4 4 4 4 4 4 4 4 4 4 4 4 4 4 4 4 4 4 3 3 3 4 4 4 4 4 4 4 4 4 4 4 4 4 4 4 4 5 5 5 6 6 7 7 8 9 10 11 12 14 15 17 17 17 17 15 14 12 11 10 9 8 7 6 6 5 5 5 5
2411E%j%%%%%%%%%%%%%%j%Jj%%%%J%j%%%%%%J%%%%%%j%%J%j%%%%%J%%J%J%J%J%%j%%%j%%%
$$ 5 5 4 4 4 4 4 4 4 4 4 4 4 4 4 4 4 3 3 4 3 3 3 3 3 4 4 3 3 3 3 3 3 3 4 4 4 4 4 4 4 3 3 3 4 4 3 3 3 3 3 3 4 4 4 5 5 6 6 7 7 8 8 8 7 7 7 7 6 6 6 6
2405F%j%%%%%%%%%%J%%j%%%%%%%%%%%%%%%%%%%%%%%%%%%%%%%%%%%%%%%%jJj%%%%%%%%%%j%
$$ 6 6 5 5 5 5 5 5 5 5 5 5 5 6 6 6 5 5 5 5 5 5 5 5 5 5 5 5 5 5 5 5 5 5 5 5 5 5 5 5 5 5 5 5 5 5 5 5 5 5 5 5 5 5 5 5 5 4 5 4 4 4 4 4 4 4 4 4 4 4 3 3
2398CJj%%%%%%%%%J%%jJ%%J%%%%j%%%%%%%%%J%%%%%%j%%%%%%%%%%%%%%J%j%%%J%%%%%%%%j
$$ 3 4 3 3 3 3 3 3 3 3 3 3 4 4 4 3 4 4 4 5 5 5 5 5 4 4 4 4 4 4 4 4 4 4 5 5 5 5 5 5 5 4 4 4 4 4 4 4 4 4 4 4 4 4 4 4 5 5 4 4 4 4 5 5 5 5 5 5 5 5 5 4
2392D%%%%%%%%%%%%%%%%%%%%%%j%%%%%%j%J%%%%%%%%%%%%%%%%%%%%%%%%%%%%%j%%%%%%%%%
$$ 4 4 4 4 4 4 4 4 4 4 4 4 4 4 4 4 4 4 4 4 4 4 4 3 3 3 3 3 3 3 2 2 3 3 3 3 3 3 3 3 3 3 3 3 3 3 3 3 3 3 3 3 3 3 3 3 3 3 3 3 3 3 2 2 2 2 2 2 2 2 2 2
2385B%%J%%%%%%%%%%%%%%jJ%%%%j%%%%%%%%J%%%%%j%%%%%%%%%%%%%%%%%%J%%%%%%%%%J%%%
$$ 2 2 2 3 3 3 3 3 3 3 3 3 3 3 3 3 3 3 2 3 3 3 3 3 2 2 2 2 2 2 2 2 2 3 3 3 3 3 3 2 2 2 2 2 2 2 2 2 2 2 2 2 2 2 2 2 2 2 3 3 3 3 3 3 3 3 3 3 4 4 4 4
2379D%%%J%%%%J%J%J%%J%%%%J%%j%%j%%j%%%%j%j%%%J%%%%%%%%%J%%%%j%%%%%%%%%%%%%%j
$$ 4 4 4 4 5 5 5 5 5 6 6 7 7 8 8 8 9 9 9 9 9 10 10 10 9 9 9 8 8 8 7 7 7 7 7 6 6 5 5 5 5 6 6 6 6 6 6 6 6 6 6 7 7 7 7 7 6 6 6 6 6 6 6 6 6 6 6 6 6 6 6 5
2372E%j%%%J%%%j%%%%%%%%%%%%%%%%J%%%%%%%%%J%%%J%%%%%%%%%%j%%%%%%%%%%%%%%%%%%%
$$ 5 5 4 4 4 4 5 5 5 5 4 4 4 4 4 4 4 4 4 4 4 4 4 4 4 4 4 5 5 5 5 5 5 5 5 5 5 6 6 6 6 7 7 7 7 7 7 7 7 7 7 7 6 6 6 6 6 6 6 6 6 6 6 6 6 6 6 6 6 6 6 6
2366F%%J%%%%%%%j%%%%j%%%j%%%j%%%%j%%%Jj%%%%J%%%%j%%%%Jj%%%%%%%%%%%%%%%%%%%%%
$$ 6 6 6 7 7 7 7 7 7 7 7 6 6 6 6 6 5 5 5 5 4 4 4 4 3 3 3 3 3 2 2 2 2 3 2 2 2 2 2 3 3 3 3 3 2 2 2 2 2 3 2 2 2 2 2 2 2 2 2 2 2 2 2 2 2 2 2 2 2 2 2 2
2359B%%%%j%%%%%%%%%%J%%%%%%j%%%%%%%%J%%j%%%%%J%%%%%%%%%%%%%j%%%%J%%j%%%%%%%%
$$ 2 2 2 2 2 1 1 1 1 1 1 1 1 1 1 1 2 2 2 2 2 2 2 1 1 1 1 1 1 1 1 1 2 2 2 1 1 1 1 1 1 2 2 2 2 2 2 2 2 2 2 2 2 2 2 1 1 1 1 1 2 2 2 1 1 1 1 1 1 1 1 1
2353A%%%%%%%%%%%%%%%%%%%%%%%%%J%%%%%%j%%%%%%%%%%%%%J%%%%%%j%%%%%%%%%%%%%%%%%
$$ 1 1 1 1 1 1 1 1 1 1 1 1 1 1 1 1 1 1 1 1 1 1 1 1 1 1 2 2 2 2 2 2 2 1 1 1 1 1 1 1 1 1 1 1 1 1 1 2 2 2 2 2 2 2 1 1 1 1 1 1 1 1 1 1 1 1 1 1 1 1 1 1
2346A%%%%%%%Jj%%%J%%%%%%j%%%%%%%%%%%J%j%%J%%%%%%%%%%j%%%Jj%%%%%%%%%%%%%%%%%%
$$ 1 1 1 1 1 1 1 1 2 1 1 1 1 2 2 2 2 2 2 2 1 1 1 1 1 1 1 1 1 1 1 1 2 2 1 1 1 2 2 2 2 2 2 2 2 2 2 2 1 1 1 1 2 1 1 1 1 1 1 1 1 1 1 1 1 1 1 1 1 1 1 1
2340A%%%%%%%%%%%%%%%%%%%%%J%%%%%%%%%j%%%%%%%J%%j%%%%%%%%%%%%%%%%%%%%%%%%%%%%
$$ 1 1 1 1 1 1 1 1 1 1 1 1 1 1 1 1 1 1 1 1 1 1 2 2 2 2 2 2 2 2 2 2 1 1 1 1 1 1 1 1 2 2 2 1 1 1 1 1 1 1 1 1 1 1 1 1 1 1 1 1 1 1 1 1 1 1 1 1 1 1 1 1
2333A%%%%%%%%%%%%%%%%%%%%%%%%%%%%%%%%%%%%%%%%%%%%%%%%J%%%%%%j%%%%%%%%%%%%%%%
$$ 1 1 1 1 1 1 1 1 1 1 1 1 1 1 1 1 1 1 1 1 1 1 1 1 1 1 1 1 1 1 1 1 1 1 1 1 1 1 1 1 1 1 1 1 1 1 1 1 1 2 2 2 2 2 2 2 1 1 1 1 1 1 1 1 1 1 1 1 1 1 1 1
2327A%%%%%%%%%%%%%%%%%%%%%%%%%%%J%j%%%%%%%%%%%%Jj%%%%%%J%%j%%%%%%%J%%%%%%%%j
$$ 1 1 1 1 1 1 1 1 1 1 1 1 1 1 1 1 1 1 1 1 1 1 1 1 1 1 1 1 2 2 1 1 1 1 1 1 1 1 1 1 1 1 1 2 1 1 1 1 1 1 1 2 2 2 1 1 1 1 1 1 1 1 2 2 2 2 2 2 2 2 2 1
2320A%%%%%%%%%%%%%%%%%%%%%%%%%%%%%%%%%%%%%J%%%%%%%%%%%%%%%j%%%J%j%J%%%%%%%%%
$$ 1 1 1 1 1 1 1 1 1 1 1 1 1 1 1 1 1 1 1 1 1 1 1 1 1 1 1 1 1 1 1 1 1 1 1 1 1 1 2 2 2 2 2 2 2 2 2 2 2 2 2 2 2 2 1 1 1 1 2 2 1 1 2 2 2 2 2 2 2 2 2 2
2313B%j%%%%%%%%%%%%%%%%%%Jj%%%%%%%%%%%%%%Jj%%%%%%%%%%%%%%%%%%%%%%%%%%%%%%%%%
$$ 2 2 1 1 1 1 1 1 1 1 1 1 1 1 1 1 1 1 1 1 1 2 1 1 1 1 1 1 1 1 1 1 1 1 1 1 1 2 1 1 1 1 1 1 1 1 1 1 1 1 1 1 1 1 1 1 1 1 1 1 1 1 1 1 1 1 1 1 1 1 1 1
2307A%%%%%%%%%%%%%%%%%%%%%%%%%%%%%%%J%j%%%%%%%%%Jj%%%%%J%%j%%%%%J%j%%%%%%%%%
$$ 1 1 1 1 1 1 1 1 1 1 1 1 1 1 1 1 1 1 1 1 1 1 1 1 1 1 1 1 1 1 1 1 2 2 1 1 1 1 1 1 1 1 1 1 2 1 1 1 1 1 1 2 2 2 1 1 1 1 1 1 2 2 1 1 1 1 1 1 1 1 1 1
2300A%%%%%%%%%%%%%%%%%%%%%%%%%%%%%%%%%%%%%%%%%%%%%%%%%%%%%%%%%%%%%%%J%%%%%j%
$$ 1 1 1 1 1 1 1 1 1 1 1 1 1 1 1 1 1 1 1 1 1 1 1 1 1 1 1 1 1 1 1 1 1 1 1 1 1 1 1 1 1 1 1 1 1 1 1 1 1 1 1 1 1 1 1 1 1 1 1 1 1 1 1 1 2 2 2 2 2 2 1 1
2294A%%%%J%j%J%%j%%%%%%%J%%%%j%%%%J%j%%%%%%%%%%%%%%%%%%%%%%%%%%%%%%%%%%%%%J%
$$ 1 1 1 1 1 2 2 1 1 2 2 2 1 1 1 1 1 1 1 1 2 2 2 2 2 1 1 1 1 1 2 2 1 1 1 1 1 1 1 1 1 1 1 1 1 1 1 1 1 1 1 1 1 1 1 1 1 1 1 1 1 1 1 1 1 1 1 1 1 1 2 2
2287B%%%%j%%%%%%%%%Jj%%%%%%%%%%%%%J%j%%%%%%J%j%%%%%%%%%%%%%%%%%%%%%Jj%%%%%%%
$$ 2 2 2 2 2 1 1 1 1 1 1 1 1 1 1 2 1 1 1 1 1 1 1 1 1 1 1 1 1 1 2 2 1 1 1 1 1 1 1 2 2 1 1 1 1 1 1 1 1 1 1 1 1 1 1 1 1 1 1 1 1 1 1 2 1 1 1 1 1 1 1 1
2281A%Jj%%%%%%%%%%J%%%%%j%%%%%%%%%%%%%%%%%%%%%%%%j%J%%%%%%%%%%%%%%%%%%%%%%%%
$$ 1 1 2 1 1 1 1 1 1 1 1 1 1 1 2 2 2 2 2 2 1 1 1 1 1 1 1 1 1 1 1 1 1 1 1 1 1 1 1 1 1 1 1 1 1 0 0 1 1 1 1 1 1 1 1 1 1 1 1 1 1 1 1 1 1 1 1 1 1 1 1 1
2274A%%%%%%%%%%%%%%%%%%%%%%%%%%%%%%%%%%%%%%%%%%%%%%%%%%%%%%%%%%%%%%%%%%%%%J%
$$ 1 1 1 1 1 1 1 1 1 1 1 1 1 1 1 1 1 1 1 1 1 1 1 1 1 1 1 1 1 1 1 1 1 1 1 1 1 1 1 1 1 1 1 1 1 1 1 1 1 1 1 1 1 1 1 1 1 1 1 1 1 1 1 1 1 1 1 1 1 1 2 2
2268B%%j%%%%%%%%%%%%%%%%%%%%%%%%%J%%%j%%%%%%%%%%%%%%%%%%%%%%%%%%%%%j%%%%%%%%
$$ 2 2 2 1 1 1 1 1 1 1 1 1 1 1 1 1 1 1 1 1 1 1 1 1 1 1 1 1 1 2 2 2 2 1 1 1 1 1 1 1 1 1 1 1 1 1 1 1 1 1 1 1 1 1 1 1 1 1 1 1 1 1 1 0 0 0 0 0 0 0 0 0
2261@J%%%%%%%%%%%%%%%%%%%%%%%%%%%%%%%%%%%%%%%%%%%J%j%%%%%%%%%%%%%%%%%%%%%%%%
$$ 0 1 1 1 1 1 1 1 1 1 1 1 1 1 1 1 1 1 1 1 1 1 1 1 1 1 1 1 1 1 1 1 1 1 1 1 1 1 1 1 1 1 1 1 1 2 2 1 1 1 1 1 1 1 1 1 1 1 1 1 1 1 1 1 1 1 1 1 1 1 1 1
2255A%%%%%%%%%%%%%%%%%%J%j%%%%%%%%%%%%%%%Jj%%%%%%%%%%%%%%%%%%%%%%%%%%%%%%%%%
$$ 1 1 1 1 1 1 1 1 1 1 1 1 1 1 1 1 1 1 1 2 2 1 1 1 1 1 1 1 1 1 1 1 1 1 1 1 1 2 1 1 1 1 1 1 1 1 1 1 1 1 1 1 1 1 1 1 1 1 1 1 1 1 1 1 1 1 1 1 1 1 1 1
2248AJ%j%%%%%%%%%%%%%%%%%%%%%%%%%%%%%%%%J%j%%%%%%%%J%%%%%%%%%%%%%%%%%%%%%%%%
$$ 1 2 2 1 1 1 1 1 1 1 1 1 1 1 1 1 1 1 1 1 1 1 1 1 1 1 1 1 1 1 1 1 1 1 1 1 2 2 1 1 1 1 1 1 1 1 1 2 2 2 2 2 2 2 2 2 2 2 2 2 2 2 2 2 2 2 2 2 2 2 2 2
2242B%j%%%%%%%J%%%%j%%%%%%%J%%%%%%%%%%%%%%%%jJ%j%%%%%%%%%%%%%%%%%%%%%%%%%%%%
$$ 2 2 1 1 1 1 1 1 1 1 2 2 2 2 2 1 1 1 1 1 1 1 1 2 2 2 2 2 2 2 2 2 2 2 2 2 2 2 2 2 1 2 2 1 1 1 1 1 1 1 1 1 1 1 1 1 1 1 1 1 1 1 1 1 1 1 1 1 1 1 1 1
2235A%%%%%%%%J%%%%%%%%j%%J%%j%%%%%%%%%%%%%%%J%%%j%%%%%%%%%J%%%%%%%j%%%%%%%%%
$$ 1 1 1 1 1 1 1 1 1 2 2 2 2 2 2 2 2 2 1 1 1 2 2 2 1 1 1 1 1 1 1 1 1 1 1 1 1 1 1 1 2 2 2 2 1 1 1 1 1 1 1 1 1 1 2 2 2 2 2 2 2 2 1 1 1 1 1 1 1 1 1 1
2229A%J%j%%%%%%%Jj%%%%%%%%%%%%%%%%%%%%%%%%%%%%%%%%%%%%%%%%%%%%%%%%%%%%%%%%%%
$$ 1 1 2 2 1 1 1 1 1 1 1 1 2 1 1 1 1 1 1 1 1 1 1 1 1 1 1 1 1 1 1 1 1 1 1 1 1 1 1 1 1 1 1 1 1 1 1 1 1 1 1 1 1 1 1 1 1 1 1 1 1 1 1 1 1 1 1 1 1 1 1 1
2222A%%%%%%%%%%%%%%%%%%%%%J%%j%%%%%%%%%%%%%%%%%%%%%%%%%%%%%%%%%%%%%%%%%%%%%%
$$ 1 1 1 1 1 1 1 1 1 1 1 1 1 1 1 1 1 1 1 1 1 1 2 2 2 1 1 1 1 1 1 1 1 1 1 1 1 1 1 1 1 1 1 1 1 1 1 1 1 1 1 1 1 1 1 1 1 1 1 1 1 1 1 1 1 1 1 1 1 1 1 1
2216AJj%%%%%%%%%%%%%%%%%%%%%%%%%%%%%%%%%%%%%%%%%%%%%%%%%%%J%%%%%j%%%%%%%%%%%
$$ 1 2 1 1 1 1 1 1 1 1 1 1 1 1 1 1 1 1 1 1 1 1 1 1 1 1 1 1 1 1 1 1 1 1 1 1 1 1 1 1 1 1 1 1 1 1 1 1 1 1 1 1 1 1 2 2 2 2 2 2 1 1 1 1 1 1 1 1 1 1 1 1
2209A%%%%%%%%%%%%%%%%j%%J%%%%%%J%%%%%j%%%%J%%%%%j%%%%J%%%%%%j%%%%%%%J%j%%%%%
$$ 1 1 1 1 1 1 1 1 1 1 1 1 1 1 1 1 1 0 0 0 1 1 1 1 1 1 1 2 2 2 2 2 2 1 1 1 1 1 2 2 2 2 2 2 1 1 1 1 1 2 2 2 2 2 2 2 1 1 1 1 1 1 1 1 2 2 1 1 1 1 1 1
2203A%%J%%%%j%%%J%%%j%%%%J%%%j%%%%%%%%%%%%%%%%%%%%%%%%%%%%%%%%%%%%%%%%%%%%%%
$$ 1 1 1 2 2 2 2 2 1 1 1 1 2 2 2 2 1 1 1 1 1 2 2 2 2 1 1 1 1 1 1 1 1 1 1 1 1 1 1 1 1 1 1 1 1 1 1 1 1 1 1 1 1 1 1 1 1 1 1 1 1 1 1 1 1 1 1 1 1 1 1 1
2196A%%%%%%%%%%%%%%%%%J%%j%%%%j%%%%J%%%%%%%%%%%%%%%%%%%%%%%%%%%%J%%j%%%%%%%%
$$ 1 1 1 1 1 1 1 1 1 1 1 1 1 1 1 1 1 1 2 2 2 1 1 1 1 1 0 0 0 0 0 1 1 1 1 1 1 1 1 1 1 1 1 1 1 1 1 1 1 1 1 1 1 1 1 1 1 1 1 1 2 2 2 1 1 1 1 1 1 1 1 1
2190A%%%%%%%%%%%%%%%%%%%%%%%%%%%%%%%%%%%%%%Jj%%%%%%%%%%%%%%%%%%%%%%%%J%j%%%%
$$ 1 1 1 1 1 1 1 1 1 1 1 1 1 1 1 1 1 1 1 1 1 1 1 1 1 1 1 1 1 1 1 1 1 1 1 1 1 1 1 2 1 1 1 1 1 1 1 1 1 1 1 1 1 1 1 1 1 1 1 1 1 1 1 1 1 2 2 1 1 1 1 1
2183A%%%%%%%%%%%%%%%%%%%%%%%%%%%%%%%%%%%%%%%%%%%%%%%%Jj%%%%%J%%%%%j%%%%%%J%%
$$ 1 1 1 1 1 1 1 1 1 1 1 1 1 1 1 1 1 1 1 1 1 1 1 1 1 1 1 1 1 1 1 1 1 1 1 1 1 1 1 1 1 1 1 1 1 1 1 1 1 2 1 1 1 1 1 1 2 2 2 2 2 2 1 1 1 1 1 1 1 2 2 2
2177B%%j%%%%%%%%%%%%%%%%%%%%%%%%%%%%%%%%%%%%%%%%%%%%%%%%%%%%%%%%%%%%%%%%%%%%
$$ 2 2 2 1 1 1 1 1 1 1 1 1 1 1 1 1 1 1 1 1 1 1 1 1 1 1 1 1 1 1 1 1 1 1 1 1 1 1 1 1 1 1 1 1 1 1 1 1 1 1 1 1 1 1 1 1 1 1 1 1 1 1 1 1 1 1 1 1 1 1 1 1
2170A%%%%J%%j%%%%%%%%%%J%%%%%%%%j%%%%%J%%%%%%%%%%%%%%%%%%%j%%%%%%%%%%%J%%%%%
$$ 1 1 1 1 1 2 2 2 1 1 1 1 1 1 1 1 1 1 1 2 2 2 2 2 2 2 2 2 1 1 1 1 1 1 2 2 2 2 2 2 2 2 2 2 2 2 2 2 2 2 2 2 2 2 1 1 1 1 1 1 1 1 1 1 1 1 2 2 2 2 2 2
2164B%%%j%%%%%J%%%%%%%j%%J%%%%%%%%%%%%%J%%%%%%%%%j%j%%J%%%%%j%%%%%%J%j%%%%%J
$$ 2 2 2 2 1 1 1 1 1 1 2 2 2 2 2 2 2 2 1 1 1 2 2 2 2 2 2 2 2 2 2 2 2 2 2 3 3 3 3 3 3 3 3 3 3 2 2 1 1 1 2 2 2 2 2 2 1 1 1 1 1 1 1 2 2 1 1 1 1 1 1 2
2157B%%j%%%%J%%%%%%%%%%%%%%%%%%%%%%%%%%%%%%%%%%%j%%%%%%%%J%j%%%%%%J%j%%%%%%%
$$ 2 2 2 1 1 1 1 1 2 2 2 2 2 2 2 2 2 2 2 2 2 2 2 2 2 2 2 2 2 2 2 2 2 2 2 2 2 2 2 2 2 2 2 2 1 1 1 1 1 1 1 1 1 2 2 1 1 1 1 1 1 1 2 2 1 1 1 1 1 1 1 1
2151A%%%%%%%%%%%%%%%%%%%%%%%%%%%%%%%%%%J%%j%%%%%%%%%%%%%%%%%%%%%%J%%%j%%%%%%
$$ 1 1 1 1 1 1 1 1 1 1 1 1 1 1 1 1 1 1 1 1 1 1 1 1 1 1 1 1 1 1 1 1 1 1 1 2 2 2 1 1 1 1 1 1 1 1 1 1 1 1 1 1 1 1 1 1 1 1 1 1 1 2 2 2 2 1 1 1 1 1 1 1
2144A%%%%%%%%%%%%%%%%J%%%%%%%%%%%%%%%%%%%%%%%%%%%j%%%%%%%%%%%%%%%%%%%%J%%%%%
$$ 1 1 1 1 1 1 1 1 1 1 1 1 1 1 1 1 1 2 2 2 2 2 2 2 2 2 2 2 2 2 2 2 2 2 2 2 2 2 2 2 2 2 2 2 2 1 1 1 1 1 1 1 1 1 1 1 1 1 1 1 1 1 1 1 1 1 2 2 2 2 2 2
2138B%%%%%%%%%%%%%%%%%%%%%%%%%%%%%%%%j%%%%%%%%%%Jj%%J%%%%%%%%%j%%%J%%%%%%%%%
$$ 2 2 2 2 2 2 2 2 2 2 2 2 2 2 2 2 2 2 2 2 2 2 2 2 2 2 2 2 2 2 2 2 2 1 1 1 1 1 1 1 1 1 1 1 2 1 1 1 2 2 2 2 2 2 2 2 2 2 1 1 1 1 2 2 2 2 2 2 2 2 2 2
2131B%%%%%%%%%%%%%%%%%J%%%%j%%%%%%%%J%%%%%j%%%%J%%%j%%%%%%%J%%%%j%%%%%J%%%%%
$$ 2 2 2 2 2 2 2 2 2 2 2 2 2 2 2 2 2 2 3 3 3 3 3 2 2 2 2 2 2 2 2 2 3 3 3 3 3 3 2 2 2 2 2 3 3 3 3 2 2 2 2 2 2 2 2 3 3 3 3 3 2 2 2 2 2 2 3 3 3 3 3 3
2125C%%%%%%%%%%%%%%%%%%%%%%%%%%%J%j%%%%%%%J%%%%%%%J%%%%%%%%%%%%%%%%%%%%%%%%%
$$ 3 3 3 3 3 3 3 3 3 3 3 3 3 3 3 3 3 3 3 3 3 3 3 3 3 3 3 3 4 4 3 3 3 3 3 3 3 3 4 4 4 4 4 4 4 4 5 5 5 5 5 5 5 5 5 5 5 5 5 5 5 5 5 5 5 5 5 5 5 5 5 5
2118E%%jJ%%%%%%%%%%%%%J%%%j%%J%%%%j%%%%%%%%%%%%%%%%%%%%%%%J%%%%%%%%%%%j%%J%%
$$ 5 5 5 4 5 5 5 5 5 5 5 5 5 5 5 5 5 5 6 6 6 6 5 5 5 6 6 6 6 6 5 5 5 5 5 5 5 5 5 5 5 5 5 5 5 5 5 5 5 5 5 5 5 5 6 6 6 6 6 6 6 6 6 6 6 6 5 5 5 6 6 6
2112F%%%j%%%%%J%%%%%%%%%%%%%%%%%%%%%%%%J%%%%%%%%jJ%%%%%%%%j%J%%j%%%%%%%%%%%%
$$ 6 6 6 6 5 5 5 5 5 5 6 6 6 6 6 6 6 6 6 6 6 6 6 6 6 6 6 6 6 6 6 6 6 6 6 7 7 7 7 7 7 7 7 7 6 7 7 7 7 7 7 7 7 7 6 6 7 7 7 6 6 6 6 6 6 6 6 6 6 6 6 6
2105F%%%%%%Jj%%%Jj%%%%%%J%%%%%%j%%%%j%%j%%%%%%%%J%%%%%J%%%%%%%%%%j%%%%%jJ%%%
$$ 6 6 6 6 6 6 6 7 6 6 6 6 7 6 6 6 6 6 6 6 7 7 7 7 7 7 7 6 6 6 6 6 5 5 5 4 4 4 4 4 4 4 4 4 5 5 5 5 5 5 6 6 6 6 6 6 6 6 6 6 6 5 5 5 5 5 5 4 5 5 5 5
2099Ej%%%%jJ%%%%%%%%j%J%%%%Jj%%%j%%%%%j%J%%%%%%%%%%%%%%%%%%%J%%%%%J%j%j%%%%%
$$ 5 4 4 4 4 4 3 4 4 4 4 4 4 4 4 4 3 3 4 4 4 4 4 5 4 4 4 4 3 3 3 3 3 3 2 2 3 3 3 3 3 3 3 3 3 3 3 3 3 3 3 3 3 3 3 3 4 4 4 4 4 4 5 5 4 4 3 3 3 3 3 3
2092C%%%%%%%%%%%%%%%%%%%%%%%%%%%%j%%%%%%%J%%j%%J%%%%%%%%%%%%%%%%%%%%%%%%%J%j
$$ 3 3 3 3 3 3 3 3 3 3 3 3 3 3 3 3 3 3 3 3 3 3 3 3 3 3 3 3 3 2 2 2 2 2 2 2 2 3 3 3 2 2 2 3 3 3 3 3 3 3 3 3 3 3 3 3 3 3 3 3 3 3 3 3 3 3 3 3 3 4 4 3
2086C%%%%J%j%%%%%%%%%%%%%%%%%%%%%j%%J%%%%%%%%%%%%%%%%%%%%J%%%%%%%%%j%%%%Jj%%
$$ 3 3 3 3 3 4 4 3 3 3 3 3 3 3 3 3 3 3 3 3 3 3 3 3 3 3 3 3 3 2 2 2 3 3 3 3 3 3 3 3 3 3 3 3 3 3 3 3 3 3 3 3 3 4 4 4 4 4 4 4 4 4 4 3 3 3 3 3 4 3 3 3
2079C%%%%%%%%J%%%%%%%%%%%%%%j%%J%%%%%J%%%%%%%%%%%%%%j%%%%%%%%%J%%%%%%%%%%%%%
$$ 3 3 3 3 3 3 3 3 3 4 4 4 4 4 4 4 4 4 4 4 4 4 4 4 3 3 3 4 4 4 4 4 4 5 5 5 5 5 5 5 5 5 5 5 5 5 5 5 4 4 4 4 4 4 4 4 4 4 5 5 5 5 5 5 5 5 5 5 5 5 5 5
2073E%J%%%%%%J%%%%%%%%%%%%%%%%%%%%%J%%%%%%%%%%%J%%%%%%%%%%%%%%%%J%%%%%J%%%%%
$$ 5 5 6 6 6 6 6 6 6 7 7 7 7 7 7 7 7 7 7 7 7 7 7 7 7 7 7 7 7 7 7 8 8 8 8 8 8 8 8 8 8 8 8 9 9 9 9 9 9 9 9 9 9 9 9 9 9 9 9 9 10 10 10 10 10 10 11 11 11 11 11 11
2066A1J%%J%%%%%J%%%J%J%%J%%%J%J%JJJJJ%J%JJJJ%JKJJKJKKJKLKKLKLLLMMMNNNNONOONO
$$ 11 12 12 12 13 13 13 13 13 13 14 14 14 14 15 15 16 16 16 17 17 17 17 18 18 19 19 20 21 22 23 24 24 25 25 26 27 28 29 29 30 32 33 34 36 37 39 41 42 44 47 49 51 54 56 59 62 65 69 73 77 82 87 92 97 103 108 114 120 125 131
2060A31NONNNMMMLLKJKJ%%%%jjkjkjjjjjj%j%JJJKKKLLMMMNNNNOONONNMMMLKKJ%%jjjkjjj
$$ 131 136 142 147 152 157 161 165 169 172 175 177 178 180 181 181 181 181 181 180 179 177 176 174 173 172 171 170 169 168 168 167 167 168 169 170 172 174 176 179 182 186 190 194 199 204 209 214 220 226 231 237 242 247 251 255 259 262 264 266 267 267 267 266 265 264 262 261 260 259
2053B59j%%JJKLMMMNONPOPQQRRJ0J0J1J1J2J2J3J3J4J4J4J5J6J7J6J7J7J7J7J7J6J5J4J2J1
$$ 259 258 258 258 259 260 262 265 269 273 277 282 288 293 300 306 313 321 329 338 347 357 367 378 389 401 413 426 439 453 467 481 496 512 529 545 562 579 596 613 630 646 661 675 687 698
2049F98RQNMJ%klnnppqqpqppoonmmmllljk%%%JKLMNQQJ1J1J2J4J5J5J6J5J5J4J2J1J0POLK
$$ 698 707 715 720 724 725 725 723 720 715 710 703 696 688 680 673 665 658 651 645 639 634 630 626 622 619 616 613 612 610 610 610 610 611 613 616 620 625 633 641 652 663 675 689 704 719 735 750 765 779 791 802 812 819 825 828 830
2044H30Jjklmmnmnllljj%%JJJJKLKLMLLLLLLKKJ%%%jjj%%%KMNORRJ1J3J5J7J7J9J7J3Pjpj0
$$ 830 831 830 828 825 821 817 812 808 803 800 797 794 793 792 792 792 793 794 795 796 798 801 803 806 810 813 816 819 822 825 828 830 832 833 833 833 833 832 831 830 830 830 830 832 836 841 847 856 865 876 889 904 921 938 957 974 987 994 993 986 976
2038I76j3j2j3j1j0rqnnlkj%%%J%jlloorrj2j2j2j2j2j2j0qomkKMOQJ0J2J3J2J3J1J0QNLj
$$ 976 963 951 938 927 917 908 900 895 890 887 885 884 884 884 884 885 885 884 881 878 872 866 857 848 836 824 812 800 788 776 766 758 752 748 746 748 752 758 766 776 788 801 813 826 837 847 855 860 863 862
2034H62lorj1j3j4j4j5j5j3j1rn%LJ0J6K4L2L7M0L4J9lk5m0m8m9m7m6m2l7l4k9k6k2j9j5j4
$$ 862 859 853 844 833 820 806 792 777 762 749 738 729 724 724 727 737 753 777 809 846 886 920 939 936 911 871 823 774 727 681 639 602 568 539 513 491 472 457 443
2030D43j2rrppommlljj%%JKLLMNNNOOOPOONNNLKKJ%jjkklmmnooooonk%NRJ6K4K9L4L1K0Jk2
$$ 443 431 422 413 406 399 393 389 385 382 379 378 377 377 377 378 380 383 386 390 395 400 405 411 417 423 430 436 442 447 452 457 460 462 464 465 465 464 463 461 459 456 452 448 443 437 431 425 419 413 408 406 406 411 420 436 460 489 523 554 574 575 553
2025E53l8m8m9m8m4m1l6l0k6k1j7j4j1j0pnmmlkkjklkklklkkkjkjjjj%j%%j%%%%%%%%JJKK
$$ 553 515 467 418 370 326 285 249 219 193 172 155 141 130 120 113 108 104 100 97 95 93 92 90 87 85 83 80 78 75 73 71 69 68 66 65 64 63 62 62 61 61 61 60 60 60 60 60 60 60 60 60 61 62 64 66
2020F6KKKKKKLMMNOQRJ1J3J6J6J7J2P%nj0j2j1j0j0qonlljj%JJKLKLKLMMNNPQJ0RJ1J3J3J3
$$ 66 68 70 72 74 76 78 81 85 89 94 100 108 117 128 141 157 173 190 202 209 209 204 194 182 171 161 151 143 137 132 129 126 125 124 124 125 126 128 131 133 136 138 141 145 149 154 159 166 174 184 193 204 217 230 243
2015B43J4J4J5J6J7K0K3K6K8L3L7M1M5N2N9O5P5Q6R9J14J34J57J87K18K59L11L71M45N36O47
$$ 243 257 271 286 302 319 339 362 388 416 449 486 527 572 624 683 748 823 909 1008 1122 1256 1413 1600 1818 2077 2388 2759 3204 3740 4387
2012D387P76R24J093J274J432J520J482J260Q11J69n17j058j351j428j390j310j199j060r06
$$ 4387 5163 6087 7180 8454 9886 11406 12888 14148 14959 15128 14611 13553 12202 10774 9384 8074 6875 5815 4909
2010D909p62o31n15m18l44k84k36j97j66j43j22j04r1q1o9o0n4m8m2l7l5l2k8k7k5k4k1j9
$$ 4909 4147 3516 3001 2583 2239 1955 1719 1522 1356 1213 1091 987 896 815 746 686 632 584 542 505 470 438 410 383 358 334 313 294
2007B94j8j6j3j2j0j0qqqqqqqpqooonmmnmmmmlllllkllkkkkjjjjjj%jjjjjjj%jj%%J%%%%j
$$ 294 276 260 247 235 225 215 207 199 191 183 175 167 159 152 144 138 132 126 121 117 113 108 104 100 96 92 89 86 83 80 77 75 72 69 67 65 63 61 60 59 58 57 56 55 55 54 53 52 51 50 49 48 48 47 46 46 46 47 47 47 47 47 46
2002D6jjjjjjj%j%j%j%j%jjjjjjjj%J%JKKKKKJJJ%%jj%jkjjkjjj%%jJ%J%%%%%%%%jjjj%j%
$$ 46 45 44 43 42 41 40 39 39 38 38 37 37 36 36 35 35 34 33 32 31 30 29 28 27 27 28 28 29 31 33 35 37 39 40 41 42 42 42 41 40 40 39 37 36 35 33 32 31 30 30 30 29 30 30 31 31 31 31 31 31 31 31 31 30 29 28 27 27 26 26
1995B6jj%jj%j%%%%%%%J%%J%%%%J%%%%%j%%j%%%%jJ%J%%JJ%JJJJJJKJJKJKKKKKKKLKLLMLM
$$ 26 25 24 24 23 22 22 21 21 21 21 21 21 21 21 22 22 22 23 23 23 23 23 24 24 24 24 24 24 23 23 23 22 22 22 22 22 21 22 22 23 23 23 24 25 25 26 27 28 29 30 31 33 34 35 37 38 40 42 44 46 48 50 52 55 57 60 63 67 70 74
1989G4MMMMMMMMMNMNNNNOOOPPOPPOOONNMLLKJ%%jkkllmlmmmlmllkkkjk%%%%JJJKJKKLKLLM
$$ 74 78 82 86 90 94 98 102 106 110 115 119 124 129 134 139 145 151 157 164 171 177 184 191 197 203 209 214 219 223 226 229 231 232 232 232 231 229 227 224 221 217 214 210 206 202 199 195 192 189 187 185 183 182 180 180 180 180 180 181 182 183 185 186 188 190 193 195 198 201 205
1982B05LNNNOPQRRJ1J2J3J4J5J7J9K0K1K3K5K7K9L1L2L4L5L5L6L6L5L3L1K7K4J8J4QKmqj3
$$ 205 208 213 218 223 229 236 244 253 262 273 285 298 312 327 344 363 383 404 427 452 479 508 539 571 605 640 675 711 747 782 815 846 873 897 915 929 937 939 935 927 914
1979I14j6j9k1k3k3k3k4k2k1k0j9j8j5j5j2j2rrpoomlkkkjkkjkkklkkkj%%KLMOPRJ1J3J5J8
$$ 914 898 879 858 835 812 789 765 743 722 702 683 665 650 635 623 611 602 593 586 580 574 570 567 565 563 561 560 558 556 555 553 551 549 546 544 542 540 539 539 539 541 544 548 554 561 570 581 594 609 627
1974F27J9K1K4K6K8L0L3L4L6L7L8L8L9L7L5L3L0K6K1J6J1Mkqj4j9k3k8k9l2l3l2l2k9k8k4
$$ 627 646 667 691 717 745 775 808 842 878 915 953 991 1030 1067 1102 1135 1165 1191 1212 1228 1239 1243 1241 1233 1219 1200 1177 1149 1120 1088 1055 1023 991 962 934 910
1971I10k2j9j5j1qnjKMPJ0J0J2J3J2J3J1RQOL%knpj0j2j4j5j7j7j8j8j8j7j6j6j4j2j1j0p
$$ 910 888 869 854 843 835 830 829 831 835 842 852 862 874 887 899 912 923 932 940 946 949 949 947 942 935 925 913 899 884 867 850 832 814 796 779 763 747 733 721 710 700 693
1967F93omkj%JKLMMMMMMKK%klnoqj0j0j2j1j0j0rpnljJLNQJ1J3J5J8J9K2K4K5K6K6K4K3J9
$$ 693 687 683 681 680 680 681 683 686 690 694 698 702 706 710 712 714 714 712 709 704 698 690 680 670 658 647 637 627 618 611 606 603 602 603 606 611 619 630 643 658 676 695 717 741 766 792 818 842 865 884
1962H84J7J2QKlrj4j8k1k5k7k9l1l1l1l2l1l0k9k8k8k6k4k4k2k0k0j8j8j6j4j4j2j1j0rqq
$$ 884 901 913 921 923 920 911 897 879 858 833 806 777 746 715 684 652 621 591 562 534 506 480 456 432 410 390 370 352 334 318 304 290 278 267 257 248 240 232
1959B32oonmlkkj%%JJKKKLLMLMMNNNOPQQRJ0J0J0J1J1J0J0QPNK%morj1j3j5j5j7j7j6j6j6
$$ 232 226 220 215 211 208 206 204 203 203 203 204 205 207 209 211 214 217 221 224 228 232 237 242 247 253 260 268 276 285 295 305 315 326 337 347 357 365 372 377 379 379 375 369 360 349 336 321 306 289 272 256 240 224
1954B24j5j3j3j2j1j0rrqpooonnmlmllklkkkkjkjkjkjkjkjkjjkjjjj%j%j%jj%jj%j%j%j%j
$$ 224 209 196 183 171 160 150 141 132 124 117 111 105 99 94 89 85 82 78 75 72 70 67 65 63 61 59 58 56 55 53 52 50 49 47 46 44 43 41 40 39 37 36 35 34 33 33 32 32 31 31 30 29 29 28 27 27 26 26 25 25 24 24 23
1948B3%%j%jj%j%j%%j%%j%%j%%j%j%%%j%%%j%J%j%%%%%%j%%%%%%%%%%%%%%j%%%%%j%%j%%%
$$ 23 23 23 22 22 21 20 20 19 19 18 18 18 17 17 17 16 16 16 15 15 15 14 14 13 13 13 13 12 12 12 12 11 11 12 12 11 11 11 11 11 11 11 10 10 10 10 10 10 10 10 10 10 10 10 10 10 10 9 9 9 9 9 9 8 8 8 7 7 7 7
1942G%%j%%%J%%j%%%%%%%J%j%%%%%%%%%%%%%%%%%%%%%%%%%%%j%%%%%%%%%%%%%%%%%%%%%%%
$$ 7 7 7 6 6 6 6 7 7 7 6 6 6 6 6 6 6 6 7 7 6 6 6 6 6 6 6 6 6 6 6 6 6 6 6 6 6 6 6 6 6 6 6 6 6 6 6 6 5 5 5 5 5 5 5 5 5 5 5 5 5 5 5 5 5 5 5 5 5 5 5 5
1935E%%%%%j%%%%%%%%%%%%%%%%%%%%%%%%%%%%%%%%%%%%%%%%%%%%%%%%%%%%%%%%%%%%%%%%%
$$ 5 5 5 5 5 5 4 4 4 4 4 4 4 4 4 4 4 4 4 4 4 4 4 4 4 4 4 4 4 4 4 4 4 4 4 4 4 4 4 4 4 4 4 4 4 4 4 4 4 4 4 4 4 4 4 4 4 4 4 4 4 4 4 4 4 4 4 4 4 4 4 4
1929D%%%%%%%%%%%%%%%%%%%%%%%%%%%%%%j%%%%%%%%%%%%%%%%%%%%%%%%%%%J%%j%%%%%Jj%%
$$ 4 4 4 4 4 4 4 4 4 4 4 4 4 4 4 4 4 4 4 4 4 4 4 4 4 4 4 4 4 4 4 3 3 3 3 3 3 3 3 3 3 3 3 3 3 3 3 3 3 3 3 3 3 3 3 3 3 3 3 4 4 4 3 3 3 3 3 3 4 3 3 3
1922C%%%%%%%%%%%%%%%%%%%%%%%%%%%%%%%%%%%%%%%%%%%%%%%%%%%%%%%%%%%%%%%%%%%%%%%
$$ 3 3 3 3 3 3 3 3 3 3 3 3 3 3 3 3 3 3 3 3 3 3 3 3 3 3 3 3 3 3 3 3 3 3 3 3 3 3 3 3 3 3 3 3 3 3 3 3 3 3 3 3 3 3 3 3 3 3 3 3 3 3 3 3 3 3 3 3 3 3 3 3
1916C%J%%%%%%%%%Jj%%%%%%%%%%%%%%%%%%%%%%%j%%%%J%%%%%%j%%%%%%J%%%%%%%%%%%%%%%
$$ 3 3 4 4 4 4 4 4 4 4 4 4 5 4 4 4 4 4 4 4 4 4 4 4 4 4 4 4 4 4 4 4 4 4 4 4 4 3 3 3 3 3 4 4 4 4 4 4 4 3 3 3 3 3 3 3 4 4 4 4 4 4 4 4 4 4 4 4 4 4 4 4
1909D%%%%J%%%%J%%%%%%%%%%%%%%%%%%%%%%%%%J%%j%%%%%%%J%%%%%%%%%%%%JJ%JJJ%J%%jj
$$ 4 4 4 4 4 5 5 5 5 5 6 6 6 6 6 6 6 6 6 6 6 6 6 6 6 6 6 6 6 6 6 6 6 6 6 6 7 7 7 6 6 6 6 6 6 6 6 7 7 7 7 7 7 7 7 7 7 7 7 7 8 9 9 10 11 12 12 13 13 13 12 11
1903A1j%j%j%j%%%%J%%%%%%%%%%%%J%%%%%%%%%%%%%j%%%J%%J%JJ%J%J%%jj%j%j%%j%j%%%%
$$ 11 10 10 9 9 8 8 7 7 7 7 7 8 8 8 8 8 8 8 8 8 8 8 8 8 9 9 9 9 9 9 9 9 9 9 9 9 9 9 8 8 8 8 9 9 9 10 10 11 12 12 13 13 14 14 14 13 12 12 11 11 10 10 10 9 9 8 8 8 8 8
1896H%%j%%%%%%%%%%%%%%j%%%%%%%%%%%%%%%%%%%%%%%%%%%jJ%%%%%%%%%%%%%%%%%%J%%%%%
$$ 8 8 8 7 7 7 7 7 7 7 7 7 7 7 7 7 7 7 6 6 6 6 6 6 6 6 6 6 6 6 6 6 6 6 6 6 6 6 6 6 6 6 6 6 6 6 5 6 6 6 6 6 6 6 6 6 6 6 6 6 6 6 6 6 6 6 7 7 7 7 7 7
1890G%%%j%%%%%%%j%%%%%%%%%j%%%%%%j%%%%%%J%%j%%%%%%%%%%%%%%%%%%%%%%J%jJ%%%%%%
$$ 7 7 7 7 6 6 6 6 6 6 6 6 5 5 5 5 5 5 5 5 5 5 4 4 4 4 4 4 4 3 3 3 3 3 3 3 4 4 4 3 3 3 3 3 3 3 3 3 3 3 3 3 3 3 3 3 3 3 3 3 3 3 4 4 3 4 4 4 4 4 4 4
1883D%%%%%%%%%%%j%%%%%%%%j%%%%%%%%%%j%%J%%%%%%%%%%%%%%%%%%%%%%%%%Jj%%%%%%%%%
$$ 4 4 4 4 4 4 4 4 4 4 4 4 3 3 3 3 3 3 3 3 3 2 2 2 2 2 2 2 2 2 2 2 1 1 1 2 2 2 2 2 2 2 2 2 2 2 2 2 2 2 2 2 2 2 2 2 2 2 2 2 2 3 2 2 2 2 2 2 2 2 2 2
1877B%%%%jJ%%%jJ%j%%%%J%%%%%%%%%jJ%%jJ%%%%%%%j%%%%%%%%J%%%%j%%%%%%%%%J%%%%%%
$$ 2 2 2 2 2 1 2 2 2 2 1 2 2 1 1 1 1 1 2 2 2 2 2 2 2 2 2 2 1 2 2 2 1 2 2 2 2 2 2 2 2 1 1 1 1 1 1 1 1 1 2 2 2 2 2 1 1 1 1 1 1 1 1 1 1 2 2 2 2 2 2 2
1870B%%%%%%%%j%Jj%%%%%J%%%%%%%%j%%%%%J%%%%%%%%%j%%%J%%%%%%j%%J%%%%%%%%%%%%j%
$$ 2 2 2 2 2 2 2 2 2 1 1 2 1 1 1 1 1 1 2 2 2 2 2 2 2 2 2 1 1 1 1 1 1 2 2 2 2 2 2 2 2 2 2 1 1 1 1 2 2 2 2 2 2 2 1 1 1 2 2 2 2 2 2 2 2 2 2 2 2 2 1 1
1864A%J%%%%%j%%J%%%%%j%J%j%%%%%%%%%%J%%%j%J%%%%jJ%%%%j%%J%%%%%%%%%%%%%%%%%%%
$$ 1 1 2 2 2 2 2 2 1 1 1 2 2 2 2 2 2 1 1 2 2 1 1 1 1 1 1 1 1 1 1 1 2 2 2 2 1 1 2 2 2 2 2 1 2 2 2 2 2 1 1 1 2 2 2 2 2 2 2 2 2 2 2 2 2 2 2 2 2 2 2 2
1857B%%%%%%%%j%%%%%%%%%%%%%%%%%%%J%%%%%j%%%%%J%%%%%j%%J%%%%%%%%%%%%%%%%%j%%%
$$ 2 2 2 2 2 2 2 2 2 1 1 1 1 1 1 1 1 1 1 1 1 1 1 1 1 1 1 1 1 2 2 2 2 2 2 1 1 1 1 1 1 2 2 2 2 2 2 1 1 1 2 2 2 2 2 2 2 2 2 2 2 2 2 2 2 2 2 2 1 1 1 1
1851A%J%j%%J%%%%%%j%%J%%%%%j%%%%J%%%%j%Jj%%%%%%%%%%%%%%%%%%J%j%%%%%%J%%%%%%%
$$ 1 1 2 2 1 1 1 2 2 2 2 2 2 2 1 1 1 2 2 2 2 2 2 1 1 1 1 1 2 2 2 2 2 1 1 2 1 1 1 1 1 1 1 1 1 1 1 1 1 1 1 1 1 1 1 2 2 1 1 1 1 1 1 1 2 2 2 2 2 2 2 2
1844B%%%%%%%%%%%%j%%%%%%%%%%%%%%%%%%%%%%Jj%%%%J%%%%%%%%%%%%%%%%%%%%%%%%%j%%%
$$ 2 2 2 2 2 2 2 2 2 2 2 2 2 1 1 1 1 1 1 1 1 1 1 1 1 1 1 1 1 1 1 1 1 1 1 1 2 1 1 1 1 1 2 2 2 2 2 2 2 2 2 2 2 2 2 2 2 2 2 2 2 2 2 2 2 2 2 2 1 1 1 1
1838A%%%%%%J%%%%%%j%%%%%%%%%%%J%%%%%%%%%%%%%%%%%%j%%%%%%%%%%%%%%%%%%J%%%%%%%
$$ 1 1 1 1 1 1 1 2 2 2 2 2 2 2 1 1 1 1 1 1 1 1 1 1 1 1 2 2 2 2 2 2 2 2 2 2 2 2 2 2 2 2 2 2 2 1 1 1 1 1 1 1 1 1 1 1 1 1 1 1 1 1 1 1 2 2 2 2 2 2 2 2
1831B%j%%%%%%%%%%%%%%%%%%%%%%%%%%%%%%%%%%%%%%%%%%%%%%%%%%%%%%J%%%%%%%%%%%%%%
$$ 2 2 1 1 1 1 1 1 1 1 1 1 1 1 1 1 1 1 1 1 1 1 1 1 1 1 1 1 1 1 1 1 1 1 1 1 1 1 1 1 1 1 1 1 1 1 1 1 1 1 1 1 1 1 1 1 1 2 2 2 2 2 2 2 2 2 2 2 2 2 2 2
1825B%j%%%%%%%%%%%%%%%%%%J%%%%%%%%%jJ%%%%%j%J%%%j%%%%%%%%%%%%%%%%%%%%%%%%%%%
$$ 2 2 1 1 1 1 1 1 1 1 1 1 1 1 1 1 1 1 1 1 1 2 2 2 2 2 2 2 2 2 2 1 2 2 2 2 2 2 1 1 2 2 2 2 1 1 1 1 1 1 1 1 1 1 1 1 1 1 1 1 1 1 1 1 1 1 1 1 1 1 1 1
1818A%%%%%%J%%%%%%%%%%%j%%%%%%%%%%%%%%%%%%%%%J%%%%%%%%%%%%%%%%%%%%%%%%%j%%%%
$$ 1 1 1 1 1 1 1 2 2 2 2 2 2 2 2 2 2 2 2 1 1 1 1 1 1 1 1 1 1 1 1 1 1 1 1 1 1 1 1 1 1 2 2 2 2 2 2 2 2 2 2 2 2 2 2 2 2 2 2 2 2 2 2 2 2 2 2 1 1 1 1 1
1812A%%%%%%%%%%%%%%%%%%%J%%%%%%%%%%%%%%%%%%j%%%%%%%%%%%%%%%%%%%%%%%%%%%%%%%%
$$ 1 1 1 1 1 1 1 1 1 1 1 1 1 1 1 1 1 1 1 1 2 2 2 2 2 2 2 2 2 2 2 2 2 2 2 2 2 2 2 1 1 1 1 1 1 1 1 1 1 1 1 1 1 1 1 1 1 1 1 1 1 1 1 1 1 1 1 1 1 1 1 1
1805A%%%%%%%%%%%%%%%%%J%%%%%j%%%%%J%%%j%%%%J%%%%%%j%%%%%%%%%%%J%j%%%%%%%%%%%
$$ 1 1 1 1 1 1 1 1 1 1 1 1 1 1 1 1 1 1 2 2 2 2 2 2 1 1 1 1 1 1 2 2 2 2 1 1 1 1 1 2 2 2 2 2 2 2 1 1 1 1 1 1 1 1 1 1 1 1 2 2 1 1 1 1 1 1 1 1 1 1 1 1
1799A%%%%J%%%j%%%%%%%J%%%%%%j%%%%%%%%%%%%%%%j%J%%%%%%%%%%%%Jj%%%%%%%%%%%%J%j
$$ 1 1 1 1 1 2 2 2 2 1 1 1 1 1 1 1 1 2 2 2 2 2 2 2 1 1 1 1 1 1 1 1 1 1 1 1 1 1 1 1 0 0 1 1 1 1 1 1 1 1 1 1 1 1 1 2 1 1 1 1 1 1 1 1 1 1 1 1 1 2 2 1
1792A%%%%%%%%%%%%%%%%%%%%%%%%%%%%%%%%%%%%%%%%%%%%jJ%%%%%%%%%%%%%%%%%%%%%%%%%
$$ 1 1 1 1 1 1 1 1 1 1 1 1 1 1 1 1 1 1 1 1 1 1 1 1 1 1 1 1 1 1 1 1 1 1 1 1 1 1 1 1 1 1 1 1 1 0 1 1 1 1 1 1 1 1 1 1 1 1 1 1 1 1 1 1 1 1 1 1 1 1 1 1
1786A%%%%%%%%%J%j%%%%%%%%J%%%j%%%%%%%%%%%%%%%%%%%%%%%%%%%%%%%%%%%%%%%J%j%%%%
$$ 1 1 1 1 1 1 1 1 1 1 2 2 1 1 1 1 1 1 1 1 1 2 2 2 2 1 1 1 1 1 1 1 1 1 1 1 1 1 1 1 1 1 1 1 1 1 1 1 1 1 1 1 1 1 1 1 1 1 1 1 1 1 1 1 1 2 2 1 1 1 1 1
1779AJ%%j%J%j%%%%%%%%%%%%%%%%%%%%%%%%%%%%%%%%%%%%%%%%%%%%%%%%%%%%%%%%%%%%%%%
$$ 1 2 2 2 1 1 2 2 1 1 1 1 1 1 1 1 1 1 1 1 1 1 1 1 1 1 1 1 1 1 1 1 1 1 1 1 1 1 1 1 1 1 1 1 1 1 1 1 1 1 1 1 1 1 1 1 1 1 1 1 1 1 1 1 1 1 1 1 1 1 1 1
1773A%%%%%%%%%%%%%%%%%%%j%%%%%J%%%%%%%%%%%%%%%%%%%%%%%%%%%%%%%%%%%%%%%%%%%%%
$$ 1 1 1 1 1 1 1 1 1 1 1 1 1 1 1 1 1 1 1 1 0 0 0 0 0 0 1 1 1 1 1 1 1 1 1 1 1 1 1 1 1 1 1 1 1 1 1 1 1 1 1 1 1 1 1 1 1 1 1 1 1 1 1 1 1 1 1 1 1 1 1 1
1766A%%%%%%J%%%%j%%%%%%%%%%%%%%%%%%J%%j%%%J%%%%%%%%%%%%j%%J%%%j%%%%%%%%%%%%%
$$ 1 1 1 1 1 1 1 2 2 2 2 2 1 1 1 1 1 1 1 1 1 1 1 1 1 1 1 1 1 1 1 2 2 2 1 1 1 1 2 2 2 2 2 2 2 2 2 2 2 2 2 1 1 1 2 2 2 2 1 1 1 1 1 1 1 1 1 1 1 1 1 1
1760A%%%%%%%%%%%J%j%%%%%%%%j%%%J%%%%%%j%J%%%%%%%%%%%%%%%%%%%%j%%J%%%%%%%%j%%
$$ 1 1 1 1 1 1 1 1 1 1 1 1 2 2 1 1 1 1 1 1 1 1 1 0 0 0 0 1 1 1 1 1 1 1 0 0 1 1 1 1 1 1 1 1 1 1 1 1 1 1 1 1 1 1 1 1 1 0 0 0 1 1 1 1 1 1 1 1 1 0 0 0
1753@%%%%J%%%%%%%%%%%%%%%%%%%j%J%%%%%%%J%%j%Jj%%%%%%%%%%%%%%%%%J%j%%%%%%%%j%
$$ 0 0 0 0 0 1 1 1 1 1 1 1 1 1 1 1 1 1 1 1 1 1 1 1 1 0 0 1 1 1 1 1 1 1 1 2 2 2 1 1 2 1 1 1 1 1 1 1 1 1 1 1 1 1 1 1 1 1 1 2 2 1 1 1 1 1 1 1 1 1 0 0
1747@%%J%%%%%%%%%%%%%%%%J%%%%%%j%%%%%%%%%%%%%%%%%%%%%%%%%%%%%%%%%%%%%%%%%%%%
$$ 0 0 0 1 1 1 1 1 1 1 1 1 1 1 1 1 1 1 1 1 2 2 2 2 2 2 2 1 1 1 1 1 1 1 1 1 1 1 1 1 1 1 1 1 1 1 1 1 1 1 1 1 1 1 1 1 1 1 1 1 1 1 1 1 1 1 1 1 1 1 1 1
1740A%%%%%%%%%%%%%%%%%%%%%%%%%J%j%%%%%%%%%%%%%%%%%%%%J%j%%%%%%%%%%%%%%%Jj%%%
$$ 1 1 1 1 1 1 1 1 1 1 1 1 1 1 1 1 1 1 1 1 1 1 1 1 1 1 2 2 1 1 1 1 1 1 1 1 1 1 1 1 1 1 1 1 1 1 1 1 1 2 2 1 1 1 1 1 1 1 1 1 1 1 1 1 1 1 1 2 1 1 1 1
1734A%%%j%%%%%%J%%%%%j%%J%%%%%%%%%%%%%%%%%%%%%%%%%%%%%%%%%%%%%%%%%%%%%%%%%%%
$$ 1 1 1 1 0 0 0 0 0 0 0 1 1 1 1 1 1 0 0 0 1 1 1 1 1 1 1 1 1 1 1 1 1 1 1 1 1 1 1 1 1 1 1 1 1 1 1 1 1 1 1 1 1 1 1 1 1 1 1 1 1 1 1 1 1 1 1 1 1 1 1 1
1727A%Jj%%%%%%%%%%%%%%%%%%%%jJ%%%%%%%j%%J%%%%%%%%%%%%%%%%%%%%%%%%J%%%%j%%%%%
$$ 1 1 2 1 1 1 1 1 1 1 1 1 1 1 1 1 1 1 1 1 1 1 1 1 0 1 1 1 1 1 1 1 1 0 0 0 1 1 1 1 1 1 1 1 1 1 1 1 1 1 1 1 1 1 1 1 1 1 1 1 1 2 2 2 2 2 1 1 1 1 1 1
1721A%%%%j%J%%%%%%%%%%%%%%%%%%%%%%%%%%%%%%%%%%%%%%%jJ%%%%jJ%%%%%%%%%%%%%%%%%
$$ 1 1 1 1 1 0 0 1 1 1 1 1 1 1 1 1 1 1 1 1 1 1 1 1 1 1 1 1 1 1 1 1 1 1 1 1 1 1 1 1 1 1 1 1 1 1 1 0 1 1 1 1 1 0 1 1 1 1 1 1 1 1 1 1 1 1 1 1 1 1 1 1
1714A%%%%%%%%%%%%%%%%%%%%%%%%%%%%%%%%%%%Jj%%%%%%%%%%%%%%%%%%%%%%%j%%%%%%%%%%
$$ 1 1 1 1 1 1 1 1 1 1 1 1 1 1 1 1 1 1 1 1 1 1 1 1 1 1 1 1 1 1 1 1 1 1 1 1 2 1 1 1 1 1 1 1 1 1 1 1 1 1 1 1 1 1 1 1 1 1 1 1 1 0 0 0 0 0 0 0 0 0 0 0
1708@%%J%%%%%%%J%%j%Jj%%%%%%%%%%%%%%%%jJ%%j%J%%%%%%%%%%%%%%%%%%%%%%%J%%j%%%%
$$ 0 0 0 1 1 1 1 1 1 1 1 2 2 2 1 1 2 1 1 1 1 1 1 1 1 1 1 1 1 1 1 1 1 1 0 1 1 1 0 0 1 1 1 1 1 1 1 1 1 1 1 1 1 1 1 1 1 1 1 1 1 1 1 1 2 2 2 1 1 1 1 1
1701A%%j%%J%%%%%%%%%%%%%%%%%%%%%%%%%J%%j%%%%%%%%%%%%%%%%%%%%%%%%%%%%%%%%%%%%
$$ 1 1 1 0 0 0 1 1 1 1 1 1 1 1 1 1 1 1 1 1 1 1 1 1 1 1 1 1 1 1 1 1 2 2 2 1 1 1 1 1 1 1 1 1 1 1 1 1 1 1 1 1 1 1 1 1 1 1 1 1 1 1 1 1 1 1 1 1 1 1 1 1
1695A%%%%%%%%%%%%%%%%%%%%%%%%%%%%%%%%%%%%%%%%%%%%%%%%%%%%j%%%%%J%%%%%%%%%%%%
$$ 1 1 1 1 1 1 1 1 1 1 1 1 1 1 1 1 1 1 1 1 1 1 1 1 1 1 1 1 1 1 1 1 1 1 1 1 1 1 1 1 1 1 1 1 1 1 1 1 1 1 1 1 1 0 0 0 0 0 0 1 1 1 1 1 1 1 1 1 1 1 1 1
1688A%%%%%%%%%%%%%%%%%%%%%%%%%%%%%%%%%%%%%%%%%%%%%%%%%%%%%%%%%%%%%%%%%J%%%%j
$$ 1 1 1 1 1 1 1 1 1 1 1 1 1 1 1 1 1 1 1 1 1 1 1 1 1 1 1 1 1 1 1 1 1 1 1 1 1 1 1 1 1 1 1 1 1 1 1 1 1 1 1 1 1 1 1 1 1 1 1 1 1 1 1 1 1 1 2 2 2 2 2 1
1681A%%%%%%%%jJ%%%%%%%%%%%%%%%%%%%%%%%%Jj%%%%%%%%%J%%%j%%%%%%%%%%%%%%%%%%%%%
$$ 1 1 1 1 1 1 1 1 1 0 1 1 1 1 1 1 1 1 1 1 1 1 1 1 1 1 1 1 1 1 1 1 1 1 1 2 1 1 1 1 1 1 1 1 1 1 2 2 2 2 1 1 1 1 1 1 1 1 1 1 1 1 1 1 1 1 1 1 1 1 1 1
1675A%%J%%%j%J%%%%%%%%%%%j%%%%%%%%%%%%%%%%Jj%%%%%%%%%%%%%%%%%%%%%j%%%%%J%%%%
$$ 1 1 1 2 2 2 2 1 1 2 2 2 2 2 2 2 2 2 2 2 2 1 1 1 1 1 1 1 1 1 1 1 1 1 1 1 1 1 2 1 1 1 1 1 1 1 1 1 1 1 1 1 1 1 1 1 1 1 1 1 1 0 0 0 0 0 0 1 1 1 1 1
1668A%%%%%%%%%%%%%%%%%%%%%%%%%%%%%%%%%%%%%%%%%%%%%%%jJ%%%%%%%%%Jj%%%%j%%%%J%
$$ 1 1 1 1 1 1 1 1 1 1 1 1 1 1 1 1 1 1 1 1 1 1 1 1 1 1 1 1 1 1 1 1 1 1 1 1 1 1 1 1 1 1 1 1 1 1 1 1 0 1 1 1 1 1 1 1 1 1 1 2 1 1 1 1 1 0 0 0 0 0 1 1
1662A%%%%%%%%jJ%%%%%J%j%%%%%%%j%%J%%%%%%%%%%j%Jj%J%%%%%%%%%%%%%%j%%%%%J%%%%%
$$ 1 1 1 1 1 1 1 1 1 0 1 1 1 1 1 1 2 2 1 1 1 1 1 1 1 1 0 0 0 1 1 1 1 1 1 1 1 1 1 1 0 0 1 0 0 1 1 1 1 1 1 1 1 1 1 1 1 1 1 1 0 0 0 0 0 0 1 1 1 1 1 1
1655A%%%%%%%%%%%%%%%%%%%%%%%%%%%%%%%%%%%%%%%%%%%%%%%%%%%%%%%%%%%%%%%%%%%%%%%
$$ 1 1 1 1 1 1 1 1 1 1 1 1 1 1 1 1 1 1 1 1 1 1 1 1 1 1 1 1 1 1 1 1 1 1 1 1 1 1 1 1 1 1 1 1 1 1 1 1 1 1 1 1 1 1 1 1 1 1 1 1 1 1 1 1 1 1 1 1 1 1 1 1
1649A%%%%%%%%%J%%j%%%%%%%%%%%%%J%%%%j%%%%%%%%%%%%%%%%%%%%%%%%%%%%%%%%%%%%%%%
$$ 1 1 1 1 1 1 1 1 1 1 2 2 2 1 1 1 1 1 1 1 1 1 1 1 1 1 1 2 2 2 2 2 1 1 1 1 1 1 1 1 1 1 1 1 1 1 1 1 1 1 1 1 1 1 1 1 1 1 1 1 1 1 1 1 1 1 1 1 1 1 1 1
1642A%%J%%jJ%%%%%j%%%%%%%%%%%%%J%%%%%jJj%%%%Jj%%%%%%%%%%%%%%%%%%%%%%%%%%%%%%
$$ 1 1 1 2 2 2 1 2 2 2 2 2 2 1 1 1 1 1 1 1 1 1 1 1 1 1 1 2 2 2 2 2 2 1 2 1 1 1 1 1 2 1 1 1 1 1 1 1 1 1 1 1 1 1 1 1 1 1 1 1 1 1 1 1 1 1 1 1 1 1 1 1
1636A%j%J%%%%%%%jJ%%%%%%%%%%%%%%%%%%%%%%%J%%%%j%%%%%%%%%%%%%%%%%%%%%%%%%%%%%
$$ 1 1 0 0 1 1 1 1 1 1 1 1 0 1 1 1 1 1 1 1 1 1 1 1 1 1 1 1 1 1 1 1 1 1 1 1 1 2 2 2 2 2 1 1 1 1 1 1 1 1 1 1 1 1 1 1 1 1 1 1 1 1 1 1 1 1 1 1 1 1 1 1
1629A%%%%%%%%%%%%%%%%%%%%%%%%%%%%%%%%%%%%%j%%%%%%%J%%%%%%J%%j%%%%%%%%%%%J%%%
$$ 1 1 1 1 1 1 1 1 1 1 1 1 1 1 1 1 1 1 1 1 1 1 1 1 1 1 1 1 1 1 1 1 1 1 1 1 1 1 0 0 0 0 0 0 0 0 1 1 1 1 1 1 1 2 2 2 1 1 1 1 1 1 1 1 1 1 1 1 2 2 2 2
1623B%%%%j%%%%%%%%%%%%%%%%%%%%%%%j%%%%%%%%%%J%%%%%%%%%%%%%%%%%%%%%%%%%%%%%%%
$$ 2 2 2 2 2 1 1 1 1 1 1 1 1 1 1 1 1 1 1 1 1 1 1 1 1 1 1 1 1 0 0 0 0 0 0 0 0 0 0 0 1 1 1 1 1 1 1 1 1 1 1 1 1 1 1 1 1 1 1 1 1 1 1 1 1 1 1 1 1 1 1 1
1616A%%%%%%%%%%%%%%%%%%%%%%%%%%%%%%%%%%%%%%%%%%%j%%%J%j%J%%%%Jj%%%%%%%%%%%%%
$$ 1 1 1 1 1 1 1 1 1 1 1 1 1 1 1 1 1 1 1 1 1 1 1 1 1 1 1 1 1 1 1 1 1 1 1 1 1 1 1 1 1 1 1 1 0 0 0 0 1 1 0 0 1 1 1 1 1 2 1 1 1 1 1 1 1 1 1 1 1 1 1 1
1610A%%%%%%%%%%%%%%%%%%j%J%%%%%%%%%%j%J%%%%%%%%%%%%%%%%%%J%%j%%%%%%%%%%%%%%j
$$ 1 1 1 1 1 1 1 1 1 1 1 1 1 1 1 1 1 1 1 0 0 1 1 1 1 1 1 1 1 1 1 1 0 0 1 1 1 1 1 1 1 1 1 1 1 1 1 1 1 1 1 1 1 2 2 2 1 1 1 1 1 1 1 1 1 1 1 1 1 1 1 0
1603@%%J%%%%%%%%%%%%%%%%j%%J%%%%%%J%%%%%j%J%%jJ%%%j%%%%%%%%%%%%%%%%%%%%%%%%%
$$ 0 0 0 1 1 1 1 1 1 1 1 1 1 1 1 1 1 1 1 1 0 0 0 1 1 1 1 1 1 1 2 2 2 2 2 2 1 1 2 2 2 1 2 2 2 2 1 1 1 1 1 1 1 1 1 1 1 1 1 1 1 1 1 1 1 1 1 1 1 1 1 1
1597A%%%j%%J%%%%%%%%%%%%%%%%%j%%%%%J%%%%%%%%%%%%%%%%%%%%%%%%%%%%%%%%%%%%%%%%
$$ 1 1 1 1 0 0 0 1 1 1 1 1 1 1 1 1 1 1 1 1 1 1 1 1 1 0 0 0 0 0 0 1 1 1 1 1 1 1 1 1 1 1 1 1 1 1 1 1 1 1 1 1 1 1 1 1 1 1 1 1 1 1 1 1 1 1 1 1 1 1 1 1
1590A%%%%Jj%%%%%%%%%%%%%%%%%%%%%%%%%%%%%%%%%%%%%%%%%%%%%%%%%%%%%%%%%%%%%%%%j
$$ 1 1 1 1 1 2 1 1 1 1 1 1 1 1 1 1 1 1 1 1 1 1 1 1 1 1 1 1 1 1 1 1 1 1 1 1 1 1 1 1 1 1 1 1 1 1 1 1 1 1 1 1 1 1 1 1 1 1 1 1 1 1 1 1 1 1 1 1 1 1 1 0
1584@J%%%%%%%%%%%%%%%%%%%%%%%%%%%%%%%J%j%%%%%j%%J%%%%%%%%%%%%%%%%%%%%%%%%%%%
$$ 0 1 1 1 1 1 1 1 1 1 1 1 1 1 1 1 1 1 1 1 1 1 1 1 1 1 1 1 1 1 1 1 1 2 2 1 1 1 1 1 1 0 0 0 1 1 1 1 1 1 1 1 1 1 1 1 1 1 1 1 1 1 1 1 1 1 1 1 1 1 1 1
1577A%%%%%J%j%%%%%%%%%%%%%%%%J%%j%%%%%%J%%%%%%%%%%%%%%%J%%%J%%J%J%%%%%%%%%J%
$$ 1 1 1 1 1 1 2 2 1 1 1 1 1 1 1 1 1 1 1 1 1 1 1 1 1 2 2 2 1 1 1 1 1 1 1 2 2 2 2 2 2 2 2 2 2 2 2 2 2 2 2 3 3 3 3 4 4 4 5 5 6 6 6 6 6 6 6 6 6 6 7 7
1571G%J%%JJ%JJ%%%%%%%j%%%%%JJ%JJJJ%%%j%j%jjj%j%%%%J%%%J%%j%jjj%j%j%%j%%%%%%%
$$ 7 7 8 8 8 9 10 10 11 12 12 12 12 12 12 12 12 11 11 11 11 11 11 12 13 13 14 15 16 17 17 17 17 16 16 15 15 14 13 12 12 11 11 11 11 11 12 12 12 12 13 13 13 12 12 11 10 9 9 8 8 7 7 7 6 6 6 6 6 6 6 6
1564F%j%%j%%j%%%%j%%Jj%%%%%%j%%%%%%%%%%%%%%%%%%%%%%%j%%%J%%%%%%j%J%%%%%%%%%%
$$ 6 6 5 5 5 4 4 4 3 3 3 3 3 2 2 2 3 2 2 2 2 2 2 2 1 1 1 1 1 1 1 1 1 1 1 1 1 1 1 1 1 1 1 1 1 1 1 1 0 0 0 0 1 1 1 1 1 1 1 0 0 1 1 1 1 1 1 1 1 1 1 1
1558A%%%%%%%%%%%%%%%%%%%%%%%%%%%%%%%%%%%%%%%%%j%J%%J%%%%j%%%%%jJ%%%%%%%%%%%%
$$ 1 1 1 1 1 1 1 1 1 1 1 1 1 1 1 1 1 1 1 1 1 1 1 1 1 1 1 1 1 1 1 1 1 1 1 1 1 1 1 1 1 1 0 0 1 1 1 2 2 2 2 2 1 1 1 1 1 1 0 1 1 1 1 1 1 1 1 1 1 1 1 1
1551A%%%%%%%%%%%%%%%%%%%%%%%%%%%%%%%%%%%%%%%%%%%%J%%j%%%%%%%%%%J%%%j%%%%%%%%
$$ 1 1 1 1 1 1 1 1 1 1 1 1 1 1 1 1 1 1 1 1 1 1 1 1 1 1 1 1 1 1 1 1 1 1 1 1 1 1 1 1 1 1 1 1 1 2 2 2 1 1 1 1 1 1 1 1 1 1 1 2 2 2 2 1 1 1 1 1 1 1 1 1
1545A%%%%%%%J%%j%%%%%%%%%%%%%%%%%%%%%j%%%%%%%J%%%%%%%%%%%%%%%%%J%%%%j%%%%%%%
$$ 1 1 1 1 1 1 1 1 2 2 2 1 1 1 1 1 1 1 1 1 1 1 1 1 1 1 1 1 1 1 1 1 1 0 0 0 0 0 0 0 0 1 1 1 1 1 1 1 1 1 1 1 1 1 1 1 1 1 1 2 2 2 2 2 1 1 1 1 1 1 1 1
1538A%%J%%%%%%j%%%%%%%%%%%%%%%%%%%%%%%%%%%%%%%%%%%%%%j%%J%%%%%%%%%%%J%%%%%%%
$$ 1 1 1 2 2 2 2 2 2 2 1 1 1 1 1 1 1 1 1 1 1 1 1 1 1 1 1 1 1 1 1 1 1 1 1 1 1 1 1 1 1 1 1 1 1 1 1 1 1 0 0 0 1 1 1 1 1 1 1 1 1 1 1 1 2 2 2 2 2 2 2 2
1532B%%%%%%%%%%%%%%J%%j%%%%%j%%Jj%Jj%%%%%J%%%%%%%%%%%%%%%%%%%%%%%J%%j%%%%%J%
$$ 2 2 2 2 2 2 2 2 2 2 2 2 2 2 2 3 3 3 2 2 2 2 2 2 1 1 1 2 1 1 2 1 1 1 1 1 1 2 2 2 2 2 2 2 2 2 2 2 2 2 2 2 2 2 2 2 2 2 2 2 2 3 3 3 2 2 2 2 2 2 3 3
1525C%%%%%%%%%J%%%%%%%%%%%%%%%%%J%%%%%%%%%%%%%%%%%%%%%%%%%%jJ%j%%%%%%%%J%%%%
$$ 3 3 3 3 3 3 3 3 3 3 4 4 4 4 4 4 4 4 4 4 4 4 4 4 4 4 4 4 5 5 5 5 5 5 5 5 5 5 5 5 5 5 5 5 5 5 5 5 5 5 5 5 5 5 5 4 5 5 4 4 4 4 4 4 4 4 4 5 5 5 5 5
1519E%%%%%%%%%%%%j%%%%%%%J%%J%%j%%%%%%%%%%%%%%%%J%%J%%J%%J%%J%%%%%jJ%%%%%J%J
$$ 5 5 5 5 5 5 5 5 5 5 5 5 5 4 4 4 4 4 4 4 4 5 5 5 6 6 6 5 5 5 5 5 5 5 5 5 5 5 5 5 5 5 5 5 6 6 6 7 7 7 8 8 8 9 9 9 10 10 10 10 10 10 9 10 10 10 10 10 10 11 11 12
1512A2J%J%%%J%%%%%%%%J%J%J%J%JJ%J%%J%%J%%JJJ%JJKJJJKJKKLKLKLMMMMOOOPQJ0J0J2J3
$$ 12 13 13 14 14 14 14 15 15 15 15 15 15 15 15 15 16 16 17 17 18 18 19 19 20 21 21 22 22 22 23 23 23 24 24 24 25 26 27 27 28 29 31 32 33 34 36 37 39 41 44 46 49 51 54 58 62 66 70 76 82 88 95 103 113 123 135 148
1506A48J6J8K0K4K7L2L7M3N0N5O2O7O9O9O6N7M5L2J9RKjjNJ1K2L5M9O4Q2R9J14J25J28J23
$$ 148 164 182 202 226 253 285 322 365 415 470 532 599 668 737 803 860 905 937 956 965 967 966 965 970 981 1003 1038 1087 1151 1233 1332 1446 1571 1699 1822
1503A822J06P7M3Qk1m2n4n4m9l6j9JK5M9P5J00J23J39J47J42J20Q2L2k1p0j06j29j37j36j24
$$ 1822 1928 2005 2048 2056 2035 1993 1939 1885 1836 1800 1781 1782 1807 1856 1931 2031 2154 2293 2440 2582 2702 2784 2816 2795 2725 2619 2490 2353 2217 2093
1500B093j08q7o3m0j4RL0M7N8N9N1K9jl7o9r7j13j22j20j14j02q8p4n8m3k9j7qjKJoj6k8m1
$$ 2093 1985 1898 1835 1795 1781 1790 1820 1867 1925 1984 2035 2064 2063 2026 1957 1860 1747 1625 1505 1391 1289 1201 1127 1069 1026 997 980 972 971 973 974 968 952 924 883
1497H83n3o1o6o7o5o2n8n2m6m1l6l1k6k3k0j7j5j3j1rrpoonomnmllllkklkjkjkjjjjjjjjj
$$ 883 830 769 703 636 571 509 451 399 353 312 276 245 219 196 176 159 144 131 120 111 102 95 89 83 78 72 68 63 59 56 53 50 47 45 43 40 38 37 35 34 32 31 30 29 28 27 26 25 24 23
1492B3j%%jj%%j%jj%j%j%%%%%j%%%%%j%%%j%%j%%%%%%%%%%jJ%j%%j%j%%j%%%%%%%%%j%%%%
$$ 23 22 22 22 21 20 20 20 19 19 18 17 17 16 16 15 15 15 15 15 15 14 14 14 14 14 14 13 13 13 13 12 12 12 11 11 11 11 11 11 11 11 11 11 11 10 11 11 10 10 10 9 9 8 8 8 7 7 7 7 7 7 7 7 7 7 6 6 6 6 6
1486F%%%%j%%j%%J%%%%%%%%%%j%%%%%j%%%%%%%%%%%j%%%%%%%%%j%%%%%%%%%%%%%%%%%%%%%
$$ 6 6 6 6 6 5 5 5 4 4 4 5 5 5 5 5 5 5 5 5 5 5 4 4 4 4 4 4 3 3 3 3 3 3 3 3 3 3 3 3 2 2 2 2 2 2 2 2 2 2 1 1 1 1 1 1 1 1 1 1 1 1 1 1 1 1 1 1 1 1 1 1
1479A%%%%%%%J%%%%%%%j%%%J%%%%%%%%%%j%%%%J%%%%%%%%%%%%j%%%%%J%%%%%%%%%%%%%%%%
$$ 1 1 1 1 1 1 1 1 2 2 2 2 2 2 2 2 1 1 1 1 2 2 2 2 2 2 2 2 2 2 2 1 1 1 1 1 2 2 2 2 2 2 2 2 2 2 2 2 2 1 1 1 1 1 1 2 2 2 2 2 2 2 2 2 2 2 2 2 2 2 2 2
1473B%%%%%%%%%%%%%%%%%%%%%%%%%%%%%%%%%%%%%%%%%%%%%%%%%%%%%%%%%%%%J%%%j%%%%%%
$$ 2 2 2 2 2 2 2 2 2 2 2 2 2 2 2 2 2 2 2 2 2 2 2 2 2 2 2 2 2 2 2 2 2 2 2 2 2 2 2 2 2 2 2 2 2 2 2 2 2 2 2 2 2 2 2 2 2 2 2 2 2 3 3 3 3 2 2 2 2 2 2 2
1466B%%%%%%%%%%%%%%%%%%j%%%%%%%%%J%%%%%%%%%%%%%%%%%%%%%%%%j%%%%%%%%%%%%%%%%%
$$ 2 2 2 2 2 2 2 2 2 2 2 2 2 2 2 2 2 2 2 1 1 1 1 1 1 1 1 1 1 2 2 2 2 2 2 2 2 2 2 2 2 2 2 2 2 2 2 2 2 2 2 2 2 2 1 1 1 1 1 1 1 1 1 1 1 1 1 1 1 1 1 1
1460A%%%%%%%%%%%%%%%%%%%%%%%%%%J%j%%%%%%%%%%%%%%%%%%%%%%%%%J%%%%%%%%%%%%%%%%
$$ 1 1 1 1 1 1 1 1 1 1 1 1 1 1 1 1 1 1 1 1 1 1 1 1 1 1 1 2 2 1 1 1 1 1 1 1 1 1 1 1 1 1 1 1 1 1 1 1 1 1 1 1 1 1 1 2 2 2 2 2 2 2 2 2 2 2 2 2 2 2 2 2
1453B%%%%%%%%%%%%%%%%%%j%%%%%%%%%J%%%%%%%%%%j%%%%J%%%%%%j%%%%%%%%%%%%%%%%%%%
$$ 2 2 2 2 2 2 2 2 2 2 2 2 2 2 2 2 2 2 2 1 1 1 1 1 1 1 1 1 1 2 2 2 2 2 2 2 2 2 2 2 1 1 1 1 1 2 2 2 2 2 2 2 1 1 1 1 1 1 1 1 1 1 1 1 1 1 1 1 1 1 1 1
1447A%%%%%J%%%%%%%%%%%%%%%jJ%%%%%%%%%%%%j%J%%%j%%%%%%%%J%%%%j%%%%J%%%%%%%%%j
$$ 1 1 1 1 1 1 2 2 2 2 2 2 2 2 2 2 2 2 2 2 2 2 1 2 2 2 2 2 2 2 2 2 2 2 2 2 1 1 2 2 2 2 1 1 1 1 1 1 1 1 1 2 2 2 2 2 1 1 1 1 1 2 2 2 2 2 2 2 2 2 2 1
1440A%J%%j%%%%%%%%%%J%%%%j%%%%%%%%%J%%%jJ%%%%%%J%%%%%%J%%%J%%%%J%%%%%%J%%%%%
$$ 1 1 2 2 2 1 1 1 1 1 1 1 1 1 1 1 2 2 2 2 2 1 1 1 1 1 1 1 1 1 1 2 2 2 2 1 2 2 2 2 2 2 2 3 3 3 3 3 3 3 4 4 4 4 5 5 5 5 5 6 6 6 6 6 6 6 7 7 7 7 7 7
1434GJ%JJ%J%J%%%%%%j%%%J%%%JJ%JJJ%%%%jjj%jj%j%%%%%J%%%%%%j%jj%j%j%%%%%%j%%%%
$$ 7 8 8 9 10 10 11 11 12 12 12 12 12 12 12 11 11 11 11 12 12 12 12 13 14 14 15 16 17 17 17 17 17 16 15 14 14 13 12 12 11 11 11 11 11 11 12 12 12 12 12 12 12 11 11 10 9 9 8 8 7 7 7 7 7 7 7 6 6 6 6 6
1427F%j%%j%j%%%%%jJ%%%j%%%%%%%%%%%%%%jJ%j%%%%%%%%%%%%%%%%%J%%%%j%%%%%%%%%%%%
$$ 6 6 5 5 5 4 4 3 3 3 3 3 3 2 3 3 3 3 2 2 2 2 2 2 2 2 2 2 2 2 2 2 2 1 2 2 1 1 1 1 1 1 1 1 1 1 1 1 1 1 1 1 1 1 2 2 2 2 2 1 1 1 1 1 1 1 1 1 1 1 1 1
1421AJ%%%%j%%%%%%%%%%%%%%Jj%%%%J%%%%%%%%j%%%%%J%%%%%j%%%%%%%%J%%j%%%%%%%%%%%
$$ 1 2 2 2 2 2 1 1 1 1 1 1 1 1 1 1 1 1 1 1 1 2 1 1 1 1 1 2 2 2 2 2 2 2 2 2 1 1 1 1 1 1 2 2 2 2 2 2 1 1 1 1 1 1 1 1 1 2 2 2 1 1 1 1 1 1 1 1 1 1 1 1
1414A%%%%%%%J%j%%%%%%%%%%%%%%%%%%%%%%%%%%%%%%J%%%j%%%%%Jj%%%%%%%%%%%%%%%%%%%
$$ 1 1 1 1 1 1 1 1 2 2 1 1 1 1 1 1 1 1 1 1 1 1 1 1 1 1 1 1 1 1 1 1 1 1 1 1 1 1 1 1 1 2 2 2 2 1 1 1 1 1 1 2 1 1 1 1 1 1 1 1 1 1 1 1 1 1 1 1 1 1 1 1
1408A%%%%%%%%%%%%%%%%%%%%%%%%%%%%%%%J%%%%%j%%%%%%%%%%%%%%%%%%%%%%%%%%%%%%%j%
$$ 1 1 1 1 1 1 1 1 1 1 1 1 1 1 1 1 1 1 1 1 1 1 1 1 1 1 1 1 1 1 1 1 2 2 2 2 2 2 1 1 1 1 1 1 1 1 1 1 1 1 1 1 1 1 1 1 1 1 1 1 1 1 1 1 1 1 1 1 1 1 0 0
1401@%J%%%J%%j%%%%J%%j%%%%%%%%%%%%%%J%%j%%%%%J%%%%%%j%%%%%%%%%%%%%%%J%j%%%%%
$$ 0 0 1 1 1 1 2 2 2 1 1 1 1 1 2 2 2 1 1 1 1 1 1 1 1 1 1 1 1 1 1 1 2 2 2 1 1 1 1 1 1 2 2 2 2 2 2 2 1 1 1 1 1 1 1 1 1 1 1 1 1 1 1 1 2 2 1 1 1 1 1 1
1395A%%%%%%%%%%%%%%%%%%%J%%%%%%j%%%%%%%J%%%jJ%%%%%%%j%%%%%%%%%%%%%%%%%%%%%%%
$$ 1 1 1 1 1 1 1 1 1 1 1 1 1 1 1 1 1 1 1 1 2 2 2 2 2 2 2 1 1 1 1 1 1 1 1 2 2 2 2 1 2 2 2 2 2 2 2 2 1 1 1 1 1 1 1 1 1 1 1 1 1 1 1 1 1 1 1 1 1 1 1 1
1388A%%%%%%%%%%%%%%%%%%%%J%%%%%j%%%%%%%Jj%%%J%%%j%%%%%%J%%%%%%j%%%%%%%%%%%%%
$$ 1 1 1 1 1 1 1 1 1 1 1 1 1 1 1 1 1 1 1 1 1 2 2 2 2 2 2 1 1 1 1 1 1 1 1 2 1 1 1 1 2 2 2 2 1 1 1 1 1 1 1 2 2 2 2 2 2 2 1 1 1 1 1 1 1 1 1 1 1 1 1 1
1382A%%%%%Jj%%%%%%%%%%%%%%%%%%%%%%%%%%%%%%%%%%%%%%%%%%%%%%%%%J%%%%j%J%%%j%%%
$$ 1 1 1 1 1 1 2 1 1 1 1 1 1 1 1 1 1 1 1 1 1 1 1 1 1 1 1 1 1 1 1 1 1 1 1 1 1 1 1 1 1 1 1 1 1 1 1 1 1 1 1 1 1 1 1 1 1 2 2 2 2 2 1 1 2 2 2 2 1 1 1 1
1375A%%%%%%%%%%%%%%J%%%%%%%%%%%%j%%%%%J%%%%%%%%%%j%%%%%J%%%%%%%%j%%J%%%%%%%%
$$ 1 1 1 1 1 1 1 1 1 1 1 1 1 1 1 2 2 2 2 2 2 2 2 2 2 2 2 2 1 1 1 1 1 1 2 2 2 2 2 2 2 2 2 2 2 1 1 1 1 1 1 2 2 2 2 2 2 2 2 2 1 1 1 2 2 2 2 2 2 2 2 2
1369B%%%%%%j%%%%%%%%%%%%%%%%%%J%%%%%%%%j%%%J%%%%%j%%%%%%%%%%J%%%%%%%%%%%%%%%
$$ 2 2 2 2 2 2 2 1 1 1 1 1 1 1 1 1 1 1 1 1 1 1 1 1 1 1 2 2 2 2 2 2 2 2 2 1 1 1 1 2 2 2 2 2 2 1 1 1 1 1 1 1 1 1 1 1 2 2 2 2 2 2 2 2 2 2 2 2 2 2 2 2
1362B%%%%%%%%%J%%j%%%%%%%%%%%%%%%%%J%%j%%%%%%%%%%%%%%%%%%%%%%jJ%%%%%%%%%%%%%
$$ 2 2 2 2 2 2 2 2 2 2 3 3 3 2 2 2 2 2 2 2 2 2 2 2 2 2 2 2 2 2 2 3 3 3 2 2 2 2 2 2 2 2 2 2 2 2 2 2 2 2 2 2 2 2 2 2 2 1 2 2 2 2 2 2 2 2 2 2 2 2 2 2
1356B%%%%%%%%%%%%%%%%%%%%J%%%%%%%J%%%%%%jJ%%%%%J%%%%%%%%%j%%%%%%j%%%%%%%%%%%
$$ 2 2 2 2 2 2 2 2 2 2 2 2 2 2 2 2 2 2 2 2 2 3 3 3 3 3 3 3 3 4 4 4 4 4 4 4 3 4 4 4 4 4 4 5 5 5 5 5 5 5 5 5 5 4 4 4 4 4 4 4 3 3 3 3 3 3 3 3 3 3 3 3
1349C%%%%%J%%j%%J%%%j%%%%J%%%j%%%%%%%%%%%%%%%%J%%%%J%%%%%%%%%%%%%j%%J%%%%%%%
$$ 3 3 3 3 3 3 4 4 4 3 3 3 4 4 4 4 3 3 3 3 3 4 4 4 4 3 3 3 3 3 3 3 3 3 3 3 3 3 3 3 3 3 4 4 4 4 4 5 5 5 5 5 5 5 5 5 5 5 5 5 5 4 4 4 5 5 5 5 5 5 5 5
1343E%j%%%%%%%%%%%%%%%%%%%%%%%%%%%%%%%J%%j%%%%Jj%%%%%%%%%%%%%%%%%j%%%%%%%%%%
$$ 5 5 4 4 4 4 4 4 4 4 4 4 4 4 4 4 4 4 4 4 4 4 4 4 4 4 4 4 4 4 4 4 4 4 5 5 5 4 4 4 4 4 5 4 4 4 4 4 4 4 4 4 4 4 4 4 4 4 4 4 4 3 3 3 3 3 3 3 3 3 3 3
1336C%%%J%%%%j%%%J%%j%%%%%%%%%%%%%J%%%%%%%%%%%%%%%%J%%%%%%%j%J%%%%jJ%j%%%%%%
$$ 3 3 3 3 4 4 4 4 4 3 3 3 3 4 4 4 3 3 3 3 3 3 3 3 3 3 3 3 3 3 4 4 4 4 4 4 4 4 4 4 4 4 4 4 4 4 4 5 5 5 5 5 5 5 5 4 4 5 5 5 5 5 4 5 5 4 4 4 4 4 4 4
1330D%%%j%J%%%%%j%%%%%%%%%%%%%%%%%%j%%%%%%%J%%%%%j%%%%%J%%%%%%%%j%J%%%%%J%%%
$$ 4 4 4 4 3 3 4 4 4 4 4 4 3 3 3 3 3 3 3 3 3 3 3 3 3 3 3 3 3 3 3 2 2 2 2 2 2 2 2 3 3 3 3 3 3 2 2 2 2 2 2 3 3 3 3 3 3 3 3 3 2 2 3 3 3 3 3 3 4 4 4 4
1323D%%%%%%%%%%%%%%%%%%%%%%%%j%%J%%%%%%%%%%%j%%%%%%%%%%%%J%%%%%j%%%J%j%%%%%J
$$ 4 4 4 4 4 4 4 4 4 4 4 4 4 4 4 4 4 4 4 4 4 4 4 4 4 3 3 3 4 4 4 4 4 4 4 4 4 4 4 4 3 3 3 3 3 3 3 3 3 3 3 3 3 4 4 4 4 4 4 3 3 3 3 4 4 3 3 3 3 3 3 4
1317Dj%%%%%%%%J%%%%%%j%%J%%%%%%%%%%%%%Jj%%J%%%%%%%%%%%%%j%%%%Jj%%J%%%%%%%%%%
$$ 4 3 3 3 3 3 3 3 3 3 4 4 4 4 4 4 4 3 3 3 4 4 4 4 4 4 4 4 4 4 4 4 4 4 5 4 4 4 5 5 5 5 5 5 5 5 5 5 5 5 5 5 4 4 4 4 4 5 4 4 4 5 5 5 5 5 5 5 5 5 5 5
1310E%%%%%%%%%J%%%j%J%%j%J%%%%%%%%%%%%%%%%%%%%%%%%%%J%%%%j%%J%%%%%J%%%%%%%J%
$$ 5 5 5 5 5 5 5 5 5 5 6 6 6 6 5 5 6 6 6 5 5 6 6 6 6 6 6 6 6 6 6 6 6 6 6 6 6 6 6 6 6 6 6 6 6 6 6 6 7 7 7 7 7 6 6 6 7 7 7 7 7 7 8 8 8 8 8 8 8 8 9 9
1304I%%%%%J%%J%%%%%%J%%J%J%J%J%J%JJ%JJJ%JKJJJKJKKJKLKKLLKLLLLLMMMLMLKLKKJJ%%
$$ 9 9 9 9 9 9 10 10 10 11 11 11 11 11 11 11 12 12 12 13 13 14 14 15 15 16 16 17 17 18 19 19 20 21 22 22 23 25 26 27 28 30 31 33 35 36 38 41 43 45 48 51 53 56 59 62 65 68 72 76 80 83 87 90 92 95 97 99 100 101 101 101
1297A01jjkkllllllllklkkkkjkj%jjj%%j%%%%%%J%J%J%J%JJJKJJKJKJKKKKKLLLLLLMLMLML
$$ 101 100 99 97 95 92 89 86 83 80 77 74 71 69 66 64 62 60 58 57 55 54 54 53 52 51 51 51 50 50 50 50 50 50 50 51 51 52 52 53 53 54 54 55 56 57 59 60 61 63 64 66 67 69 71 73 75 77 80 83 86 89 92 95 99 102 106 109 113 116
1291A16MMMMMMNMMNMNMMMMLMLLLLKKKKKKKKLKLMMMNOOPOQPPPPPOPOOONNNLLJJjkkmmnnnnn
$$ 116 120 124 128 132 136 140 145 149 153 158 162 167 171 175 179 183 186 190 193 196 199 202 204 206 208 210 212 214 216 218 221 223 226 230 234 238 243 249 255 262 268 276 283 290 297 304 311 317 324 330 336 342 347 352 357 360 363 364 365 364 362 360 356 352 347 342 337 332 327
1284C27nmmlljjJKLMOPPRJ0J0J0J1RRQONLJ%lnoprrrrrqponmkk%KLNOPQRJ0J1J2J3J4J5J5
$$ 327 322 318 314 311 308 307 306 307 309 312 316 322 329 336 345 355 365 375 386 395 404 412 418 423 426 427 427 424 419 413 406 397 388 379 370 361 353 346 340 335 331 329 327 327 329 332 337 343 350 358 367 377 388 400 413 427 442 457
1279D57J5J5J4J4J3J0RONK%klmmnnmmmkjjj%%%%%%%j%JJJJLLMMMMMKKJ%kkllmmmmmnoopqr
$$ 457 472 487 501 515 528 538 547 553 558 560 560 558 555 551 547 542 537 533 529 525 523 522 521 520 520 520 520 520 520 520 520 519 519 520 521 522 523 526 529 533 537 541 545 549 551 553 554 554 552 550 547 544 540 536 532 528 524 519 513 507 500 492 483
1273D83j0j1j1j2j2j2j1j1j0qqonlk%JKNNPQRJ0J1J2J2J2J2J2J2J1J0QPMKjlnpqrj0j0j0r
$$ 483 473 462 451 439 427 415 404 393 383 375 367 361 356 353 351 351 352 354 359 364 371 379 388 398 409 421 433 445 457 469 481 492 502 510 517 521 523 522 519 514 507 499 490 480 470 460 451
1269D51rpnnlkj%JJJKKJKJJKJJKJJJ%%kkmooqj0j0j1j1j2j1j1j1j0rrpoonmllljkjkjj%j%
$$ 451 442 435 430 425 422 420 419 419 420 421 422 424 426 427 429 430 431 433 434 435 437 438 439 440 440 440 438 436 432 426 420 412 402 392 381 370 358 347 336 325 315 306 297 290 284 278 273 269 266 263 260 259 257 256 254 253 252 252 251 251
1264B51%%JJJJKLKLLMMMLMLLKKKKJJKJKJKKLKLKKKJJ%%%kjkkkkkjkj%j%%j%%j%jjjkkklmm
$$ 251 251 251 252 253 254 255 257 260 262 265 268 272 276 280 283 287 290 293 295 297 299 301 302 303 305 306 308 309 311 313 316 318 321 323 325 327 328 329 329 329 329 327 326 324 322 320 318 316 315 313 312 312 311 311 311 310 310 310 309 309 308 307 306 304 302 300 297 293 289
1257B89nmnonnonmnmlmklkkj%j%J%JJJJJJJJJKJJJJJKJJKJKKJKJ%%%kjkkkklkkk%jJ%Jjjk
$$ 289 284 280 275 269 264 259 253 248 244 239 235 232 228 226 223 221 219 218 218 217 217 218 218 219 220 221 222 223 224 225 226 227 229 230 231 232 233 234 236 237 238 240 241 243 245 246 248 249 249 249 249 247 246 244 242 240 238 235 233 231 229 229 228 229 229 230 229 228 226
1251B26%%JJLLNNNOOPPOPOONMMMKJ%jkklmmnmnnnmnmmllkjjjJ%JKLKLMLLMMMMLMMMNMNMNM
$$ 226 226 226 227 228 231 234 239 244 249 255 261 268 275 281 288 294 300 305 309 313 317 319 320 320 319 317 315 312 308 304 299 295 290 285 280 276 271 267 263 260 257 255 254 253 252 253 253 254 256 259 261 264 268 271 274 278 282 286 290 293 297 301 305 310 314 319 323 328 332
1245C32LMLKKJjjlmnooqqrrrqrqqppoonnlmkkjjj%%JJJKJKKLKKKJK%Jjjjkklllllllkkkjj
$$ 332 335 339 342 344 346 347 346 345 342 338 333 327 321 313 305 296 287 278 270 261 253 245 238 231 225 219 214 209 206 202 200 198 197 196 195 195 195 196 197 198 200 201 203 205 208 210 212 214 215 217 217 218 217 216 215 213 211 208 205 202 199 196 193 190 188 186 184 183 182
1238A82j%%%JJJJJJKKJKKKKKKKKKKLKKKKKKJ%J%jjkkllmmmnnnonononnnnmnnmmmmmmllllk
$$ 182 181 181 181 181 182 183 184 185 186 187 189 191 192 194 196 198 200 202 204 206 208 210 212 215 217 219 221 223 225 227 228 228 229 229 228 227 225 223 220 217 213 209 205 200 195 190 184 179 173 168 162 157 152 147 142 138 133 128 124 120 116 112 108 104 101 98 95 92 90
1232I0ljkkjjj%j%%%%%J%%JJ%J%J%%%%%%j%jjj%jjjjjjkjjkjkjkjjjjkjjj%j%j%%j%%%j%j
$$ 90 87 86 84 82 81 80 79 79 78 78 78 78 78 78 79 79 79 80 81 81 82 82 83 83 83 83 83 83 83 82 82 81 80 79 79 78 77 76 75 74 73 71 70 69 67 66 64 63 61 60 59 58 57 55 54 53 52 52 51 51 50 50 50 49 49 49 49 48 48 47
1225D7%j%j%jjj%j%jj%jjj%jjjj%jj%jjjj%jjj%j%jj%jjj%%%j%%%j%%%%%j%j%j%%%%%J%%j
$$ 47 47 46 46 45 45 44 43 42 42 41 41 40 39 39 38 37 36 36 35 34 33 32 32 31 30 30 29 28 27 26 26 25 24 23 23 22 22 21 20 20 19 18 17 17 17 17 16 16 16 16 15 15 15 15 15 15 14 14 13 13 12 12 12 12 12 12 13 13 13 12
1219A2%j%%%%%%%%j%%%%j%%%%%%j%%%%%%%j%%%%%%%%%%%%j%%%%%%%%%%%%%%%%J%%%jJ%%%%
$$ 12 12 11 11 11 11 11 11 11 11 11 10 10 10 10 10 9 9 9 9 9 9 9 8 8 8 8 8 8 8 8 7 7 7 7 7 7 7 7 7 7 7 7 7 6 6 6 6 6 6 6 6 6 6 6 6 6 6 6 6 6 7 7 7 7 6 7 7 7 7 7
1213G%%%%%%%%%%%%%%%jJ%%%%%%%%%%jJ%%%%%%%%j%%%%%%%%%%%%%%%%%%%%%J%%%%%%%%%%%
$$ 7 7 7 7 7 7 7 7 7 7 7 7 7 7 7 7 6 7 7 7 7 7 7 7 7 7 7 7 6 7 7 7 7 7 7 7 7 7 6 6 6 6 6 6 6 6 6 6 6 6 6 6 6 6 6 6 6 6 6 6 7 7 7 7 7 7 7 7 7 7 7 7
1206G%%%%%%%%%%%%%%%%%%%%%%%%%j%%%%%%%%%%%%%j%%Jj%%%%%%J%%j%%%%%%%%%%%%%j%J%
$$ 7 7 7 7 7 7 7 7 7 7 7 7 7 7 7 7 7 7 7 7 7 7 7 7 7 7 6 6 6 6 6 6 6 6 6 6 6 6 6 6 5 5 5 6 5 5 5 5 5 5 5 6 6 6 5 5 5 5 5 5 5 5 5 5 5 5 5 5 4 4 5 5
1200E%%J%%J%%%%%%%%%%%J%%%%%j%%%%%%%%J%j%%%%%%%%%%%%%%J%JJ%JJJKJLLMNOPPOMJjm
$$ 5 5 5 6 6 6 7 7 7 7 7 7 7 7 7 7 7 7 8 8 8 8 8 8 7 7 7 7 7 7 7 7 7 8 8 7 7 7 7 7 7 7 7 7 7 7 7 7 7 7 8 8 9 10 10 11 12 13 15 16 19 22 26 31 37 44 51 57 61 62 61 57
1193E7oooonmlllkjjjjj%j%%%j%%%%j%%%J%%%%%%%%Jj%%%%%%%%j%%Jj%%%jJ%%%j%%J%%%%j
$$ 57 51 45 39 33 28 24 21 18 15 13 12 11 10 9 8 8 7 7 7 7 6 6 6 6 6 5 5 5 5 6 6 6 6 6 6 6 6 6 7 6 6 6 6 6 6 6 6 6 5 5 5 6 5 5 5 5 4 5 5 5 5 4 4 4 5 5 5 5 5 4
1187D%%%%%%%%%%%%%%%%%%J%%%%%%%j%%%%%%%%%%%%%%%%%%%%%%%%%%J%%%%%%%%%%%%%J%%%
$$ 4 4 4 4 4 4 4 4 4 4 4 4 4 4 4 4 4 4 4 5 5 5 5 5 5 5 5 4 4 4 4 4 4 4 4 4 4 4 4 4 4 4 4 4 4 4 4 4 4 4 4 4 4 4 5 5 5 5 5 5 5 5 5 5 5 5 5 5 6 6 6 6
1180F%%%%%%j%%%%J%%%%%%%%%%%%%%%%j%%%%%%%%%%%%%%%%%%%%%%%J%%j%%%%%%%%%%%%%%%
$$ 6 6 6 6 6 6 6 5 5 5 5 5 6 6 6 6 6 6 6 6 6 6 6 6 6 6 6 6 6 5 5 5 5 5 5 5 5 5 5 5 5 5 5 5 5 5 5 5 5 5 5 5 5 6 6 6 5 5 5 5 5 5 5 5 5 5 5 5 5 5 5 5
1174E%%%%%%%%%%%%%%%%%%%%%%%%%%%%%%%%%%%%%%%%%%%%%%%J%%%%%%%%%%J%%%%%%%%%%%%
$$ 5 5 5 5 5 5 5 5 5 5 5 5 5 5 5 5 5 5 5 5 5 5 5 5 5 5 5 5 5 5 5 5 5 5 5 5 5 5 5 5 5 5 5 5 5 5 5 5 6 6 6 6 6 6 6 6 6 6 6 7 7 7 7 7 7 7 7 7 7 7 7 7
1167Gj%%%%%%%%j%%%%%%%%%%%%%%%%%%%%%%%%%%%%%%%%%%%%%%jJ%%%%%%%%%%%%%%%%%%%%%
$$ 7 6 6 6 6 6 6 6 6 6 5 5 5 5 5 5 5 5 5 5 5 5 5 5 5 5 5 5 5 5 5 5 5 5 5 5 5 5 5 5 5 5 5 5 5 5 5 5 5 4 5 5 5 5 5 5 5 5 5 5 5 5 5 5 5 5 5 5 5 5 5 5
1161E%J%%j%%%%%%%%%%%%J%%%%%j%%%%%%%%%%%%%%%%%%%%%%%%%%%%%%%%%%%%%%%%J%%%%%%
$$ 5 5 6 6 6 5 5 5 5 5 5 5 5 5 5 5 5 5 6 6 6 6 6 6 5 5 5 5 5 5 5 5 5 5 5 5 5 5 5 5 5 5 5 5 5 5 5 5 5 5 5 5 5 5 5 5 5 5 5 5 5 5 5 5 5 6 6 6 6 6 6 6
1154F%%%%%%%%%%%%%%%%%%J%%%%j%%%%%%%J%%%%%%%%%%J%%%J%%%%%%%%%%%%%%J%j%%%%%%%
$$ 6 6 6 6 6 6 6 6 6 6 6 6 6 6 6 6 6 6 6 7 7 7 7 7 6 6 6 6 6 6 6 6 7 7 7 7 7 7 7 7 7 7 7 8 8 8 8 9 9 9 9 9 9 9 9 9 9 9 9 9 9 9 10 10 9 9 9 9 9 9 9 9
1148IJjJ%%%%%J%%j%%j%%%%%J%%%%%%%%%%%%%%J%%%%%%%%%%J%%%%%%%%%%%J%%%%%%%%%%%%
$$ 9 10 9 10 10 10 10 10 10 11 11 11 10 10 10 9 9 9 9 9 9 10 10 10 10 10 10 10 10 10 10 10 10 10 10 10 11 11 11 11 11 11 11 11 11 11 11 12 12 12 12 12 12 12 12 12 12 12 12 13 13 13 13 13 13 13 13 13 13 13 13 13
1141A3%%%%%%%%%j%%%%%%%%j%%%%%%%%%%%%J%%%%%%%%%%%%%J%%%%%%%%%%%%%%%%J%%J%%%%
$$ 13 13 13 13 13 13 13 13 13 13 12 12 12 12 12 12 12 12 12 11 11 11 11 11 11 11 11 11 11 11 11 11 12 12 12 12 12 12 12 12 12 12 12 12 12 12 13 13 13 13 13 13 13 13 13 13 13 13 13 13 13 13 13 14 14 14 15 15 15 15 15
1135A5%%%%%%%J%%j%J%%%%J%%%j%%%J%J%%J%%J%%JJ%JJ%JJJJJJJJJKJJKJJJJ%JJ%J%J%j%j
$$ 15 15 15 15 15 15 15 15 16 16 16 15 15 16 16 16 16 16 17 17 17 17 16 16 16 16 17 17 18 18 18 19 19 19 20 20 20 21 22 22 23 24 24 25 26 27 28 29 30 31 32 33 35 36 37 39 40 41 42 43 43 44 45 45 46 46 47 47 46 46 45
1128D5%jjj%jjj%j%j%j%j%%%%%%%%%J%%J%%J%JJJJJJKJKJKKJKKLKKLKLLKMLLLKLLKLLKKJK
$$ 45 45 44 43 42 42 41 40 39 39 38 38 37 37 36 36 35 35 35 35 35 35 35 35 35 35 36 36 36 37 37 37 38 38 39 40 41 42 43 44 46 47 49 50 52 54 55 57 59 62 64 66 69 71 74 77 79 83 86 89 92 94 97 100 102 105 108 110 112 113 115
1122A15%JJ%%jjjjjjjjkkjkjjkjk%jjjj%%jJ%%%JJJKKKKKKLKLLLLKKKKKKJJKJKJKKKKKLKL
$$ 115 115 116 117 117 117 116 115 114 113 112 111 110 109 107 105 104 102 101 100 98 97 95 95 94 93 92 91 91 91 90 91 91 91 91 92 93 94 96 98 100 102 104 106 109 111 114 117 120 123 125 127 129 131 133 135 136 137 139 140 142 143 145 147 149 151 153 156 158 161
1116A61MMMLMMMLLLKKJJ%%kjjkkkkkkkjkkjjkjj%%%JJKKKLLMMNNNOOOOOOPONONNMMLLKJJJ
$$ 161 165 169 173 176 180 184 188 191 194 197 199 201 202 203 203 203 201 200 199 197 195 193 191 189 187 185 184 182 180 179 178 176 175 174 174 174 174 175 176 178 180 182 185 188 192 196 201 206 211 217 223 229 235 241 247 254 260 265 271 276 281 285 289 292 295 297 298 299 300
1109C00j%jkkkkllkklkkkkkjkjjjj%j%j%%%J%J%JJ%JJ%JJ%%%%%%j%J%J%JKKJLKLLLLLLLLL
$$ 300 299 299 298 296 294 292 290 287 284 282 280 277 275 273 271 269 267 266 264 263 262 261 260 260 259 259 258 258 258 258 259 259 260 260 261 262 262 263 264 264 265 266 266 266 266 266 266 266 265 265 266 266 267 267 268 270 272 273 276 278 281 284 287 290 293 296 299 302 305
1103C05KLKLKLLKLMLLLLLLLKLJKJJ%%jkkklklmllllllkjjj%%JKKKLLLLLMLMLKLKKJKKKJKK
$$ 305 307 310 312 315 317 320 323 325 328 332 335 338 341 344 347 350 353 355 358 359 361 362 363 363 363 362 360 358 356 353 351 348 344 341 338 335 332 329 326 324 323 322 321 321 321 322 324 326 328 331 334 337 340 343 347 350 354 357 359 362 364 366 367 369 371 373 374 376 378
1097C78KKKJJJJ%jkkllmmmlmmllkkjj%%JKKKLLLKLLKJKJ%%%jkjj%jJJKMMNPQJ0J1J2J3J5J5
$$ 378 380 382 384 385 386 387 388 388 387 385 383 380 377 373 369 365 362 358 354 351 348 346 344 343 342 342 342 343 345 347 349 352 355 358 360 363 366 368 369 371 372 372 372 372 371 369 368 367 367 366 367 368 370 374 378 383 390 398 408 419 431 444 459 474
1091D74J6J6J6J6J5J5J3J3J0J0PONLKJ%kkmmnoppppopnommlkkk%jJ%JKLLMNOOOPOOOONMNM
$$ 474 490 506 522 538 553 568 581 594 604 614 621 627 632 635 637 638 638 636 634 630 626 621 615 608 601 594 587 581 574 569 563 559 555 552 550 548 546 546 545 546 546 547 549 552 555 559 564 570 576 582 589 595 601 607 613 618 622 627 631
1085F31MNNOPRJ0J2J4J6J8K1K3K5K8L0L2L5L6L8M0M2M2M4M4M5M5M5M4M3M0L7L3L0K4K0J5J0
$$ 631 635 640 645 651 658 667 677 689 703 719 737 758 781 806 834 864 896 931 967 1005 1045 1087 1129 1173 1217 1262 1307 1352 1396 1439 1479 1516 1549 1579 1603 1623 1638 1648
1082A648OLjklnmmmlkk%JLMOPQRRRQPNLJ%jklmlmmoqqj1j3j5j7k0k2k4k4k4k5k3k2k0j7j4
$$ 1648 1654 1657 1656 1654 1651 1646 1642 1638 1634 1631 1629 1627 1627 1628 1631 1635 1641 1648 1656 1665 1674 1683 1691 1698 1703 1706 1707 1707 1706 1704 1701 1697 1694 1690 1686 1680 1672 1664 1653 1640 1625 1608 1588 1566 1542 1518 1494 1469 1446 1424 1404 1387 1373
1077A373j1qnk%LNOQJ0J0J2J4J4J7J8K0K1K3K4K6K7K6K6K4K2J9J4J0Mjoj0j5j9k1k3k5k5k5
$$ 1373 1362 1354 1349 1347 1347 1350 1355 1361 1369 1379 1389 1401 1415 1429 1446 1464 1484 1505 1528 1552 1578 1605 1631 1657 1681 1703 1722 1736 1746 1750 1749 1743 1733 1718 1699 1678 1655 1630 1605 1580
1073A580k4k3k1k0j7j4j2j0pnj%LNPQRRJ1J0J1J1J0J0J0J0QQPONK%mpj0j4j7k0k3k6k8k8k9
$$ 1580 1556 1533 1512 1492 1475 1461 1449 1439 1432 1427 1426 1426 1429 1434 1441 1449 1458 1467 1478 1488 1499 1510 1520 1530 1540 1550 1558 1566 1573 1579 1584 1586 1586 1582 1575 1565 1551 1534 1514 1491 1465 1437 1409 1380
1069A380k8k8k6k4k2j8j6j3rok%MNPRJ1J1J1J2J1J0J0RQPOMNLJ%jloqj0j1j4j5j7j6j7j7j6
$$ 1380 1352 1324 1298 1274 1252 1234 1218 1205 1196 1190 1188 1188 1192 1197 1204 1213 1224 1235 1246 1258 1269 1279 1289 1298 1306 1313 1319 1323 1328 1331 1332 1332 1331 1328 1322 1314 1304 1293 1279 1264 1247 1231 1214 1197 1181
1065A181j5j4j3j1j0qoomkj%JKMMNOONMLKJjkmnopooponnlljj%%JJ%jjlnopj0j0j3j3j4j5
$$ 1181 1166 1152 1139 1128 1118 1110 1104 1098 1094 1092 1091 1091 1092 1094 1098 1102 1107 1113 1119 1124 1128 1131 1133 1134 1133 1131 1127 1122 1116 1109 1103 1097 1090 1084 1079 1074 1071 1068 1067 1066 1066 1066 1067 1068 1068 1067 1066 1063 1058 1052 1045 1035 1025 1012 999 985 970
1060I70j5j5j4j4j2j2j1rrppooopqqrj1j1j2j2j2j2j1j0qqnmmjj%%J%jjjkllmmnnonopoon
$$ 970 955 940 926 912 900 888 877 868 859 852 845 839 833 827 820 812 804 795 784 773 761 749 737 725 714 704 696 688 683 679 675 674 673 673 673 674 674 673 672 671 669 666 663 659 655 650 645 639 634 628 621 615 609 604
1055F04nllk%%KLLMNOONOMMKJjlmnoqqj0rj1j1j0j1j1j0j1rrrqpqopoonmmllkj%JKLMNOPQ
$$ 604 599 596 593 591 591 591 593 596 599 603 608 614 620 625 631 635 639 641 642 641 638 634 629 623 615 607 597 588 577 566 556 545 534 524 513 504 495 486 478 471 463 457 450 444 438 433 429 425 422 419 417 416 416 417 419 422 426 431 437 444 452
1049D52RJ0J1J2J3J3J3J3J2J2J0J0QOMK%klmnnommlk%JKLMLMLK%jknnpqj0rj0j0j0rj0qrr
$$ 452 461 471 482 494 507 520 533 546 558 570 580 590 598 604 608 610 610 608 605 601 596 591 585 581 577 574 572 572 573 575 578 582 585 589 592 594 594 593 591 586 581 574 566 556 547 537 527 517 508 498 490 481 472
1044D72qrqqqpppponnmllkkj%%KLLNOOPQQPQPONLK%lmprj0j1j3j3j3j3j2j2j1j0rponnmlm
$$ 472 464 455 447 439 431 424 417 410 403 397 392 387 383 380 377 375 373 372 372 372 374 377 380 385 391 397 404 412 420 427 435 442 448 453 456 458 458 455 451 444 435 425 414 401 388 375 362 350 338 327 317 308 301 295 290 285 281 278 274
1039B74lmmmnnonopopopopoponoonnnmnlmlkljkjjj%%%JJKKKLLLLLMKLKKJJ%%kjllllllll
$$ 274 271 267 263 259 254 249 243 238 232 225 219 212 206 199 193 186 180 173 167 162 156 150 145 140 135 131 126 123 119 116 114 111 110 108 107 106 105 105 105 105 106 107 109 111 113 116 119 122 125 128 132 134 137 139 141 142 143 143 143 141 140 137 134 131 128 125 122 119 116
1033A16lkjkjj%%%%J%J%%%jjkjkkkkkllkllkllllkklklkkjkjkjkjjjjjjjjjjj%%j%j%%%%%
$$ 116 113 111 110 108 107 106 106 106 106 106 107 107 108 108 108 108 107 106 104 103 101 99 97 95 93 90 87 85 82 79 77 74 71 68 65 63 61 58 56 53 51 49 48 46 45 43 42 40 39 38 37 36 35 34 33 32 31 30 29 29 29 28 28 27 27 27 27 27 27
1026B7%%%%%%jJ%%%jj%%%j%j%j%j%j%j%%j%%%%j%%%%j%%%j%%j%%%%%%%%%j%%J%%j%%%%%%%
$$ 27 27 27 27 27 27 27 26 27 27 27 27 26 25 25 25 25 24 24 23 23 22 22 21 21 20 20 19 19 19 18 18 18 18 18 17 17 17 17 17 16 16 16 16 15 15 15 14 14 14 14 14 14 14 14 14 14 13 13 13 14 14 14 13 13 13 13 13 13 13 13
1020A3%%%%%%j%%%%%J%%%j%%%%%%%J%%%%%%j%J%%%%%%%%%%%%%%%%J%j%%%%%%%%%%%%%%%%%
$$ 13 13 13 13 13 13 13 12 12 12 12 12 12 13 13 13 13 12 12 12 12 12 12 12 12 13 13 13 13 13 13 13 12 12 13 13 13 13 13 13 13 13 13 13 13 13 13 13 13 13 13 14 14 13 13 13 13 13 13 13 13 13 13 13 13 13 13 13 13 13 13
1014A3%%%%%%%%%%%%%%%%%%%%J%j%%J%%%%%%%%%%%%%%%%%%%J%%j%%J%%%%%%%%%%%%%j%%%%
$$ 13 13 13 13 13 13 13 13 13 13 13 13 13 13 13 13 13 13 13 13 13 14 14 13 13 13 14 14 14 14 14 14 14 14 14 14 14 14 14 14 14 14 14 14 14 14 15 15 15 14 14 14 15 15 15 15 15 15 15 15 15 15 15 15 15 15 14 14 14 14 14
1007A4%j%%J%%j%%%j%%%%%j%%%%%%%%%%%%%%%%J%%%%%%%%%%J%%%%%%%%%%%%%%%%%%%%%%%j
$$ 14 14 13 13 13 14 14 14 13 13 13 13 12 12 12 12 12 12 11 11 11 11 11 11 11 11 11 11 11 11 11 11 11 11 11 12 12 12 12 12 12 12 12 12 12 12 13 13 13 13 13 13 13 13 13 13 13 13 13 13 13 13 13 13 13 13 13 13 13 13 12
1001A2%%%%J%%j%%%j%%%%%%%%%%%%%%%%%%%%%jJ%%j%%%%%%%%%%%%%%%%%%%%%%%%%%%%%%%%
$$ 12 12 12 12 12 13 13 13 12 12 12 12 11 11 11 11 11 11 11 11 11 11 11 11 11 11 11 11 11 11 11 11 11 11 10 11 11 11 10 10 10 10 10 10 10 10 10 10 10 10 10 10 10 10 10 10 10 10 10 10 10 10 10 10 10 10 10 10 10 10 10
994A0%%%j%%%%%J%%%jJ%%%%%%%%%j%J%%%%%%%%j%%%%%%%%%%%j%%%%%%j%J%%%%%%%%%%%%%j
$$ 10 10 10 10 9 9 9 9 9 9 10 10 10 10 9 10 10 10 10 10 10 10 10 10 10 9 9 10 10 10 10 10 10 10 10 10 9 9 9 9 9 9 9 9 9 9 9 9 8 8 8 8 8 8 8 7 7 8 8 8 8 8 8 8 8 8 8 8 8 8 8 7
988GJ%%%%%%%%%J%%%%%%%j%%%%%%%%%%%%%%j%%%%%%%%%%j%%%J%%%%j%%%%Jj%%%J%%%%%%%%
$$ 7 8 8 8 8 8 8 8 8 8 8 9 9 9 9 9 9 9 9 8 8 8 8 8 8 8 8 8 8 8 8 8 8 8 7 7 7 7 7 7 7 7 7 7 7 6 6 6 6 7 7 7 7 7 6 6 6 6 6 7 6 6 6 6 7 7 7 7 7 7 7 7 7
981G%%%%%J%%%%%%%%%%j%%%%%%%%%%%%%%%%%%%%%%j%%%%%%%%%%%%%%%%%%%%%%%%%%%%%%%%
$$ 7 7 7 7 7 7 8 8 8 8 8 8 8 8 8 8 8 7 7 7 7 7 7 7 7 7 7 7 7 7 7 7 7 7 7 7 7 7 7 7 6 6 6 6 6 6 6 6 6 6 6 6 6 6 6 6 6 6 6 6 6 6 6 6 6 6 6 6 6 6 6 6 6
975F%%%%%%%%%%%%%%%%%%%%%%j%%%%%%%%j%%%%%%%%%%%%%%%%%%%%%%%%%%%%J%%%%%%%%%%%
$$ 6 6 6 6 6 6 6 6 6 6 6 6 6 6 6 6 6 6 6 6 6 6 6 5 5 5 5 5 5 5 5 5 4 4 4 4 4 4 4 4 4 4 4 4 4 4 4 4 4 4 4 4 4 4 4 4 4 4 4 4 4 5 5 5 5 5 5 5 5 5 5 5 5
968E%%%%j%%%%J%%%%%%%%%%%%%%%%%jJ%%%j%%%%%%%%%%%%%%%%%%j%J%%%%%%%%%%%%%%j%J%
$$ 5 5 5 5 5 4 4 4 4 4 5 5 5 5 5 5 5 5 5 5 5 5 5 5 5 5 5 5 4 5 5 5 5 4 4 4 4 4 4 4 4 4 4 4 4 4 4 4 4 4 4 4 3 3 4 4 4 4 4 4 4 4 4 4 4 4 4 4 4 3 3 4 4
961D%%%%%%%%%%%%%%%%%%%%%%%%%j%%%%%J%%%%%%%%%%%%%%%%%j%%%%%%%%J%%%%%%%%%%%%%
$$ 4 4 4 4 4 4 4 4 4 4 4 4 4 4 4 4 4 4 4 4 4 4 4 4 4 4 3 3 3 3 3 3 4 4 4 4 4 4 4 4 4 4 4 4 4 4 4 4 4 4 3 3 3 3 3 3 3 3 3 4 4 4 4 4 4 4 4 4 4 4 4 4 4
955D%%%%%Jj%%%%%%Jj%%%%%J%j%%%%%%%%%%%%%%%%%%%%%%%%%%%%%%%%%%%%%%%%%%%%%%%%%
$$ 4 4 4 4 4 4 5 4 4 4 4 4 4 4 5 4 4 4 4 4 4 5 5 4 4 4 4 4 4 4 4 4 4 4 4 4 4 4 4 4 4 4 4 4 4 4 4 4 4 4 4 4 4 4 4 4 4 4 4 4 4 4 4 4 4 4 4 4 4 4 4 4 4
948D%%%%%%%%%%%%%%%%%%%%%%%%%%%%%%%%%%%%%%%%J%%%%j%%%%J%j%%%%%%%Jj%%%%J%%j%%
$$ 4 4 4 4 4 4 4 4 4 4 4 4 4 4 4 4 4 4 4 4 4 4 4 4 4 4 4 4 4 4 4 4 4 4 4 4 4 4 4 4 4 5 5 5 5 5 4 4 4 4 4 5 5 4 4 4 4 4 4 4 4 5 4 4 4 4 4 5 5 5 4 4 4
942D%%%%%%%%%%%%%%%%%%%%%%%%%%%%%%%%%%J%%j%%%J%j%%%%%%%%%%%J%%jJ%%%%%%%%j%%%
$$ 4 4 4 4 4 4 4 4 4 4 4 4 4 4 4 4 4 4 4 4 4 4 4 4 4 4 4 4 4 4 4 4 4 4 4 5 5 5 4 4 4 4 5 5 4 4 4 4 4 4 4 4 4 4 4 4 5 5 5 4 5 5 5 5 5 5 5 5 5 4 4 4 4
935DJ%%%%%%%%%%%%%%%%%%%%%%jJ%%%%j%%%%%%%%%%%%%%%%%%%%%%%%%%%%%%%%%%%%%%%J%%
$$ 4 5 5 5 5 5 5 5 5 5 5 5 5 5 5 5 5 5 5 5 5 5 5 5 4 5 5 5 5 5 4 4 4 4 4 4 4 4 4 4 4 4 4 4 4 4 4 4 4 4 4 4 4 4 4 4 4 4 4 4 4 4 4 4 4 4 4 4 4 4 5 5 5
928E%%%%j%%%%%%%%%%%%%%%J%%%%%%%%%%%%j%%%%%Jj%%%%J%%%%%%%%%%%%%%%%%%%%%%%%%J
$$ 5 5 5 5 5 4 4 4 4 4 4 4 4 4 4 4 4 4 4 4 4 5 5 5 5 5 5 5 5 5 5 5 5 5 4 4 4 4 4 4 5 4 4 4 4 4 5 5 5 5 5 5 5 5 5 5 5 5 5 5 5 5 5 5 5 5 5 5 5 5 5 5 6
922F%%%j%%%%%%%%%%%%%%%%%%%%%%%J%%%%%%%%%%%%%%%%%%j%%J%%%%J%%%%%%%%%%%%%J%%%
$$ 6 6 6 6 5 5 5 5 5 5 5 5 5 5 5 5 5 5 5 5 5 5 5 5 5 5 5 5 6 6 6 6 6 6 6 6 6 6 6 6 6 6 6 6 6 6 6 5 5 5 6 6 6 6 6 7 7 7 7 7 7 7 7 7 7 7 7 7 7 8 8 8 8
915H%%%%%%%%%%%J%%%%%%%J%%%J%%%%J%%J%J%J%J%J%J%JJ%JJJJJJJJJKKKKJKKKKKKKLKKKK
$$ 8 8 8 8 8 8 8 8 8 8 8 8 9 9 9 9 9 9 9 9 10 10 10 10 11 11 11 11 11 12 12 12 13 13 14 14 15 15 16 16 17 17 18 18 19 20 20 21 22 23 24 25 26 27 28 29 31 33 35 37 38 40 42 44 46 48 50 52 55 57 59 61 63
909F3KKJJJJ%%%%jjjkkkkkkkkkkkkkkkjkjkjkjjjjjj%jj%jjjj%%j%%j%%j%%%j%%%j%%%%%%
$$ 63 65 67 68 69 70 71 71 71 71 71 70 69 68 66 64 62 60 58 56 54 52 50 48 46 44 42 40 38 37 35 34 32 31 29 28 27 26 25 24 23 23 22 21 21 20 19 18 17 17 17 16 16 16 15 15 15 14 14 14 14 13 13 13 13 12 12 12 12 12 12 12
902A2j%%%%%%%%%%%%%%%%%%%%%%%%j%%%%%%%%%%%%%%%%%j%%%j%%J%j%%%%%%%%%%%%%%%%%%
$$ 12 11 11 11 11 11 11 11 11 11 11 11 11 11 11 11 11 11 11 11 11 11 11 11 11 11 10 10 10 10 10 10 10 10 10 10 10 10 10 10 10 10 10 10 9 9 9 9 8 8 8 9 9 8 8 8 8 8 8 8 8 8 8 8 8 8 8 8 8 8 8 8
896H%%%%%%%%J%%%%%%%%%%J%%%%%%%%%Jj%%%%%J%%%j%J%%%%%%%%%%%%%%%%%%%%%J%%j%%%J
$$ 8 8 8 8 8 8 8 8 8 9 9 9 9 9 9 9 9 9 9 9 10 10 10 10 10 10 10 10 10 10 11 10 10 10 10 10 10 11 11 11 11 10 10 11 11 11 11 11 11 11 11 11 11 11 11 11 11 11 11 11 11 11 11 11 11 12 12 12 11 11 11 11 12
889A2%%%%%%%%%%%%%%%%J%%%j%%%%%%J%%%%%J%%%%%%%%%%%J%%j%J%%%%j%%%%%%J%%%%%%%%
$$ 12 12 12 12 12 12 12 12 12 12 12 12 12 12 12 12 12 13 13 13 13 12 12 12 12 12 12 12 13 13 13 13 13 13 14 14 14 14 14 14 14 14 14 14 14 14 15 15 15 14 14 15 15 15 15 15 14 14 14 14 14 14 14 15 15 15 15 15 15 15 15 15
882A5%%J%%%j%J%%%%%%%%%%%J%%j%%%%%%%%%%%%%%%%%J%%%%J%%J%%%%J%%J%%%%%%%J%%%J%
$$ 15 15 15 16 16 16 16 15 15 16 16 16 16 16 16 16 16 16 16 16 16 17 17 17 16 16 16 16 16 16 16 16 16 16 16 16 16 16 16 16 16 16 17 17 17 17 17 18 18 18 19 19 19 19 19 20 20 20 21 21 21 21 21 21 21 21 22 22 22 22 23 23
876B3%J%%%%%%%%%%J%%%J%%%%%%%J%%%%J%%%%%J%%%J%%%%%J%%%%%%J%JJ%%J%J%%J%%%%%J%
$$ 23 23 24 24 24 24 24 24 24 24 24 24 24 25 25 25 25 26 26 26 26 26 26 26 26 27 27 27 27 27 28 28 28 28 28 28 29 29 29 29 30 30 30 30 30 30 31 31 31 31 31 31 31 32 32 33 34 34 34 35 35 36 36 36 37 37 37 37 37 37 38 38
869C8%J%%J%JJ%J%J%J%J%J%J%JJJ%JJ%%J%JJ%JJ%JJ%%%J%%J%J%J%%J%%%%J%%J%JJ%JJ%J%J
$$ 38 38 39 39 39 40 40 41 42 42 43 43 44 44 45 45 46 46 47 47 48 48 49 50 51 51 52 53 53 53 54 54 55 56 56 57 58 58 59 60 60 60 60 61 61 61 62 62 63 63 64 64 64 65 65 65 65 65 66 66 66 67 67 68 69 69 70 71 71 72 72 73
863G3%JJK%JJJJJJ%JJJ%JJJJJJJJKJJJJJKJKJJJJJJJJJJJJJKJKKKKLKLLLLLLLMLLLLMMLLL
$$ 73 73 74 75 77 77 78 79 80 81 82 83 83 84 85 86 86 87 88 89 90 91 92 93 94 96 97 98 99 100 101 103 104 106 107 108 109 110 111 112 113 114 115 116 117 118 119 121 122 124 126 128 130 133 135 138 141 144 147 150 153 156 160 163 166 169 172 176 180 183 186 189
856A89MLMMMMMMNMNONNOOOOOPPPQPQQRQRRJ0J0J0J0J1J2J1J2J3J3J3J4J5J4J6J6J6J8J8J9
$$ 189 193 196 200 204 208 212 216 220 225 229 234 240 245 250 256 262 268 274 280 287 294 301 309 316 324 332 341 349 358 367 377 387 397 407 418 430 441 453 466 479 492 506 521 535 551 567 583 601 619 638
852F38K0K1K2K2K4K6K6K8K9L1L3L5L6L9M1M3M6M9N2N5N9O3O7P2P6Q1Q7R3R9J07J14J22J32
$$ 638 658 679 701 723 747 773 799 827 856 887 920 955 991 1030 1071 1114 1160 1209 1261 1316 1375 1438 1505 1577 1653 1734 1821 1914 2013 2120 2234 2356 2488
849B488J41J52J64J76J90K04K20K37K56K75K97L21L44L72L99M28M58M90N20N50N77N99O16
$$ 2488 2629 2781 2945 3121 3311 3515 3735 3972 4228 4503 4800 5121 5465 5837 6236 6664 7122 7612 8132 8682 9259 9858 10474
847A0474O24O21O05N74N25M59L77K79J69N3o4j79k84l78m56n18n63n93o07o10o01n85n64n36
$$ 10474 11098 11719 12324 12898 13423 13882 14259 14538 14707 14760 14696 14517 14233 13855 13399 12881 12318 11725 11118 10508 9907 9322 8758 8222
844H222n08m77m47m16l88l60l33l10k87k66k47k31k14k00j86j75j63j52j43j34j25j18j10
$$ 8222 7714 7237 6790 6374 5986 5626 5293 4983 4696 4430 4183 3952 3738 3538 3352 3177 3014 2862 2719 2585 2460 2342 2232
842B232j03r7r0q5q0p5p1o7o3n9n5n3n0m7m5m2m1l8l6l4l3l1l0k8k7k6k4k4k2k1k1j9j8j8
$$ 2232 2129 2032 1942 1857 1777 1702 1631 1564 1501 1442 1387 1334 1284 1237 1192 1150 1109 1071 1035 1001 968 937 907 879 852 826 802 778 756 735 714 695 677 659
839F59j7j6j5j5j3j4j3j2j1j1j1j0j0rrrqrpqpqppppoopoopnonnnnmnmnmmmlmllklkkkjkj
$$ 659 642 626 611 596 583 569 556 544 533 522 511 501 491 482 473 464 456 447 440 432 425 417 410 403 396 389 383 377 370 364 358 351 346 340 335 330 325 320 316 311 307 302 298 294 290 287 283 280 277 275 272 270 268 266 265 263 262
834B62jj%j%%%%J%J%JKJKKKLLKMLMMMLLLKJ%%kllmnoopqqqqqqppopoonnnmmmmmmllkllklk
$$ 262 261 260 260 259 259 259 259 259 260 260 261 261 262 264 265 267 269 271 274 277 279 283 286 290 294 298 301 304 307 309 310 310 310 308 305 302 298 293 287 281 274 266 258 250 242 234 226 219 212 206 199 193 187 182 177 172 168 164 160 156 152 148 145 142 140 137 134 132 129 127
828A27kkkkkklkjkkjjjjjk%jjjjjjjj%j%j%jjj%j%%j%%j%%jj%j%%j%%j%j%j%%j%%j%j%%j%
$$ 127 125 123 121 119 117 115 112 110 109 107 105 104 103 102 101 100 98 98 97 96 95 94 93 92 91 90 90 89 89 88 88 87 86 85 85 84 84 84 83 83 83 82 82 82 81 80 80 79 79 79 78 78 78 77 77 76 76 75 75 75 74 74 74 73 73 72 72 72 71 71
821G1%%%%%%j%j%%j%%j%%j%j%%%j%j%%%%%%%%%%J%j%%%%%%%j%%%%%%%%%%j%%%%%%%%%Jj%%
$$ 71 71 71 71 71 71 71 70 70 69 69 69 68 68 68 67 67 67 66 66 65 65 65 65 64 64 63 63 63 63 63 63 63 63 63 63 63 64 64 63 63 63 63 63 63 63 63 62 62 62 62 62 62 62 62 62 62 62 61 61 61 61 61 61 61 61 61 61 62 61 61 61
815F1%%%%%%%%%%%%%%%%%%J%%%%%J%%%J%%%%J%%JJ%JJ%JJJKJ%J%jjjjjkjjjj%j%j%j%%j%%
$$ 61 61 61 61 61 61 61 61 61 61 61 61 61 61 61 61 61 61 61 62 62 62 62 62 62 63 63 63 63 64 64 64 64 64 65 65 65 66 67 67 68 69 69 70 71 72 74 75 75 76 76 75 74 73 72 71 69 68 67 66 65 65 64 64 63 63 62 62 62 61 61 61
808F1%%%%%%%j%%%%%%%%jJ%%%%%%%%%%%%J%%%%%J%%J%%J%%JJ%JJ%JJJJJJKKLLLLMNNONOML
$$ 61 61 61 61 61 61 61 61 60 60 60 60 60 60 60 60 60 59 60 60 60 60 60 60 60 60 60 60 60 60 60 61 61 61 61 61 61 62 62 62 63 63 63 64 64 64 65 66 66 67 68 68 69 70 71 72 73 74 76 78 81 84 87 90 94 99 104 110 115 121 125 128
802A28K%klmmnmmmmlllkkjjkj%jj%%j%%j%%%%%%%%%%Jj%%%%%%%%%%J%J%J%J%%J%%J%%%J%%
$$ 128 130 130 128 125 121 117 112 108 104 100 96 93 90 87 85 83 82 81 79 78 78 77 76 76 76 75 75 75 74 74 74 74 74 74 74 74 74 74 74 75 74 74 74 74 74 74 74 74 74 74 74 75 75 76 76 77 77 78 78 78 79 79 79 80 80 80 80 81 81 81
795H1%%%J%%%%J%JJJJJ%J%JJ%J%J%%%JJJ%J%J%%J%JJJJJJJJJJKJJJJJJJJJJJ%JJKJJJKJJJ
$$ 81 81 81 81 82 82 82 82 82 83 83 84 85 86 87 88 88 89 89 90 91 91 92 92 93 93 93 93 94 95 96 96 97 97 98 98 98 99 99 100 101 102 103 104 105 106 107 108 109 111 112 113 114 115 116 117 118 119 120 121 122 122 123 124 126 127 128 129 131 132 133 134
789A34JJJJ%JJ%J%%%%%J%%%J%JJJJJKJKJKKKJKKKJKKKJKKKKKKKKLLKMLLNMMMMMNMMMLLLLK
$$ 134 135 136 137 138 138 139 140 140 141 141 141 141 141 141 142 142 142 142 143 143 144 145 146 147 148 150 151 153 154 156 158 160 161 163 165 167 168 170 172 174 175 177 179 181 183 185 187 189 191 194 197 199 203 206 209 214 218 222 226 230 234 239 243 247 251 254 257 260 263 265
782B65LKLKKKLKLLMLMMNMMNLMLLLLLLKLLLLMLNMNNNOOOPPPQPRRRJ0J0J1J2J1J2J2J3J3J3J4
$$ 265 268 270 273 275 277 279 282 284 287 290 294 297 301 305 310 314 318 323 326 330 333 336 339 342 345 348 350 353 356 359 362 366 369 374 378 383 388 393 399 405 411 418 425 432 440 447 456 465 474 484 494 505 517 528 540 552 565 578 591 605
777F05J4J5J6J5J6J7J8J8J8K0K0K0K1K2K2K4K4K6K6K8K9K9L2L3L5L6L8M0M3M5M7N0N3N7N9
$$ 605 619 634 650 665 681 698 716 734 752 772 792 812 833 855 877 901 925 951 977 1005 1034 1063 1095 1128 1163 1199 1237 1277 1320 1365 1412 1462 1515 1572 1631
774A631O4O8P2P8Q3Q9R5J01J09J16J24J34J43J53J66J78J93K08K26K44K65K87L13L39L69M02
$$ 1631 1695 1763 1835 1913 1996 2085 2180 2281 2390 2506 2630 2764 2907 3060 3226 3404 3597 3805 4031 4275 4540 4827 5140 5479 5848 6250
771F250M37M77N20N69O21O81P46Q19Q99R86J080J181J286J392J494J586J658J701J702J648
$$ 6250 6687 7164 7684 8253 8874 9555 10301 11120 12019 13005 14085 15266 16552 17944 19438 21024 22682 24383 26085 27733
769B7733J528J336J069P39L62l8m32p95j107j355j534j647j699j700j662j592j504j402j295
$$ 27733 29261 30597 31666 32405 32767 32729 32297 31502 30395 29040 27506 25859 24160 22460 20798 19206 17702 16300 15005
768A5005j188j082r84q90q06p29o59n98n43m96m52m15l82l53l27l03k82k62k45k27k12j97
$$ 15005 13817 12735 11751 10861 10055 9326 8667 8069 7526 7030 6578 6163 5781 5428 5101 4798 4516 4254 4009 3782 3570 3373
766C373j83j70j58j47j36j26j17j09j02r5q9q3p9p4p0o6o2n8n5n2m9m6m3m1l9l6l5l3l1l0
$$ 3373 3190 3020 2862 2715 2579 2453 2336 2227 2125 2030 1941 1858 1779 1705 1635 1569 1507 1449 1394 1342 1293 1247 1204 1163 1124 1088 1053 1020 989 959
763I59k8k8k7k5k6k5k4k3k3k1k1j9j9j8j7j6j5j5j4j3j2j2j2j1j0j0j0rrqrqqqqpqpppppo
$$ 959 931 903 876 851 825 800 776 753 730 709 688 669 650 632 615 599 584 569 555 542 530 518 506 495 485 475 465 456 447 439 430 422 414 406 398 391 383 376 369 362 355 348 342
759C42poonooonnnnnnmlmlkklkjjkjklkmlmmmnnnnmnnmmlllllkkkjkkkkjkjklkkkjklkkjk
$$ 342 335 329 323 318 312 306 300 295 290 285 280 275 270 266 263 259 256 254 252 249 247 246 245 243 242 240 237 235 231 228 224 220 216 211 206 201 196 192 187 182 178 174 171 168 165 162 159 157 155 153 152 150 148 146 144 143 141 140 138 135 133 131 129 128 126 123 121 119 118 116
752A16kjjjkjjjjjjjjjjkjkkjjkjkkkjkkjkjjjjj%j%j%%j%%%%%%%%%%%j%%%%%%J%%%%%%%%
$$ 116 114 113 112 111 109 108 107 106 105 104 103 102 101 100 99 97 96 94 92 91 90 88 87 85 83 81 80 78 76 75 73 72 71 70 69 68 68 67 67 66 66 66 65 65 65 65 65 65 65 65 65 65 65 65 64 64 64 64 64 64 64 65 65 65 65 65 65 65 65 65
746F5J%%%j%j%%%%%j%%%%%%J%%J%J%J%J%JJJ%JJJ%JJJ%JJJJJJJKJKJKJKJKJJJJ%J%J%%%%%
$$ 65 66 66 66 66 65 65 64 64 64 64 64 64 63 63 63 63 63 63 63 64 64 64 65 65 66 66 67 67 68 68 69 70 71 71 72 73 74 74 75 76 77 77 78 79 80 81 82 83 84 86 87 89 90 92 93 95 96 98 99 100 101 102 102 103 103 104 104 104 104 104 104
740A04%%j%j%jjjjj%jjjjjjjjjkjjkjjjj%j%j%%j%J%%%%J%JKKKKMMOPPQQPLjmqrrrqqponn
$$ 104 104 104 103 103 102 102 101 100 99 98 97 97 96 95 94 93 92 91 90 89 88 86 85 84 82 81 80 79 78 78 77 77 76 76 76 75 75 76 76 76 76 76 77 77 78 80 82 84 86 90 94 100 107 114 122 130 137 140 139 135 127 118 109 100 92 84 77 71 66 61
733F1llllkjkjjjjj%jj%jjj%j%j%%%j%j%%%j%j%%%j%%%%j%%%j%%%%%%%%%%%j%%%j%%%%%j%
$$ 61 58 55 52 49 47 46 44 43 42 41 40 39 39 38 37 37 36 35 34 34 33 33 32 32 32 32 31 31 30 30 30 30 29 29 28 28 28 28 27 27 27 27 27 26 26 26 26 25 25 25 25 25 25 25 25 25 25 25 25 24 24 24 24 23 23 23 23 23 23 22 22
727B2%j%%%%%%%%%%%%%%%%j%%%%%%%%%%%%%%%%j%%J%%%J%%%%%j%%j%%%%j%%%%%%%J%%%%%%
$$ 22 22 21 21 21 21 21 21 21 21 21 21 21 21 21 21 21 21 21 20 20 20 20 20 20 20 20 20 20 20 20 20 20 20 20 20 19 19 19 20 20 20 20 21 21 21 21 21 21 20 20 20 19 19 19 19 19 18 18 18 18 18 18 18 18 19 19 19 19 19 19 19
720A9%J%%%%%%%%%%%%%%%%%%j%%%%%j%%j%%%%J%%%%%%%%J%%JJ%%%%j%j%j%%j%%%%%%%j%%J
$$ 19 19 20 20 20 20 20 20 20 20 20 20 20 20 20 20 20 20 20 20 20 19 19 19 19 19 19 18 18 18 17 17 17 17 17 18 18 18 18 18 18 18 18 18 19 19 19 20 21 21 21 21 21 20 20 19 19 18 18 18 17 17 17 17 17 17 17 17 16 16 16 17
714A7%%%%%%%%J%%%%%%%J%%J%J%JJJKKKKJ%%jkjjjjjj%j%%J%%%%J%JJ%JJJ%JJJJJJKJKJKK
$$ 17 17 17 17 17 17 17 17 17 18 18 18 18 18 18 18 18 19 19 19 20 20 21 21 22 23 24 26 28 30 32 33 33 33 32 30 29 28 27 26 25 24 24 23 23 23 24 24 24 24 24 25 25 26 27 27 28 29 30 30 31 32 33 34 35 36 38 39 41 42 44 46
707D6KLLLKLMLLMNNNNNONONONNMMMKLJJ%%j%jjjkloqqrqqqponnnmlmlkllkkjjkjkjjjkj%j
$$ 46 48 51 54 57 59 62 66 69 72 76 81 86 91 96 101 107 112 118 123 129 134 139 143 147 151 153 156 157 158 158 158 157 157 156 155 154 152 149 143 135 127 118 110 102 94 87 81 76 71 66 62 59 55 52 50 47 44 42 40 39 38 36 35 33 32 31 30 28 27 27 26
701B6j%jjjjj%j%%j%%%%j%j%%%%%%%%%%%%j%%J%JJKJJKKJJjjjkkjkj%jj%j%jj%%%%%%j%%%
$$ 26 25 25 24 23 22 21 20 20 19 19 19 18 18 18 18 18 17 17 16 16 16 16 16 16 16 16 16 16 16 16 16 15 15 15 16 16 17 18 20 21 22 24 26 27 28 27 26 25 23 21 20 18 17 17 16 15 15 14 14 13 12 12 12 12 12 12 12 11 11 11 11
694A1%%%j%%j%%J%%%j%%%%%%%%j%%%%%%J%%%%%%%%j%%%%%%%%%%%%J%%%%%%%%%%%%%%%%%%%
$$ 11 11 11 11 10 10 10 9 9 9 10 10 10 10 9 9 9 9 9 9 9 9 9 8 8 8 8 8 8 8 9 9 9 9 9 9 9 9 9 8 8 8 8 8 8 8 8 8 8 8 8 8 9 9 9 9 9 9 9 9 9 9 9 9 9 9 9 9 9 9 9 9
688I%%%%%%%%%%Jj%%%%%%%%%%%%%%j%%%%%%%%%%%j%J%%j%%%%%%%%%%%%%%%%j%%%%%%%%%%%
$$ 9 9 9 9 9 9 9 9 9 9 9 10 9 9 9 9 9 9 9 9 9 9 9 9 9 9 9 8 8 8 8 8 8 8 8 8 8 8 8 7 7 8 8 8 7 7 7 7 7 7 7 7 7 7 7 7 7 7 7 7 7 6 6 6 6 6 6 6 6 6 6 6 6
681FJ%%%%j%%%%%%%%%%%%%%%%%%%%%%%%%J%%j%%J%%%%%%%%%%%%j%%J%%j%%%J%%%%%%%%%%%
$$ 6 7 7 7 7 7 6 6 6 6 6 6 6 6 6 6 6 6 6 6 6 6 6 6 6 6 6 6 6 6 6 6 7 7 7 6 6 6 7 7 7 7 7 7 7 7 7 7 7 7 7 6 6 6 7 7 7 6 6 6 6 7 7 7 7 7 7 7 7 7 7 7 7
674G%j%%%%%%%%%%%%%J%%%%j%%%%%%%j%%%%%J%%%%%%%%%J%%j%%%%%J%%%%j%J%%%%%%%%%%%
$$ 7 7 6 6 6 6 6 6 6 6 6 6 6 6 6 6 7 7 7 7 7 6 6 6 6 6 6 6 6 5 5 5 5 5 5 6 6 6 6 6 6 6 6 6 6 7 7 7 6 6 6 6 6 6 7 7 7 7 7 6 6 7 7 7 7 7 7 7 7 7 7 7 7
668G%%%%%%%%%%%%%%%jJ%%%%%%%%%%J%%%%%%%J%%J%%%%JJ%JJJJJKJKJKKLLMMNPQRJ1J5J8K3
$$ 7 7 7 7 7 7 7 7 7 7 7 7 7 7 7 7 6 7 7 7 7 7 7 7 7 7 7 7 8 8 8 8 8 8 8 8 9 9 9 10 10 10 10 10 11 12 12 13 14 15 16 17 19 20 22 23 25 27 30 33 37 41 46 53 61 70 81 96 114 137
661A37K9L7M3M8M8M0K2%k2l5m1m1l9l5l1k6k1j8j4j2rponmllkkjjjjj%j%%%j%%j%%%J%%JJ
$$ 137 166 203 246 294 342 382 404 404 382 347 306 265 226 191 160 134 113 95 81 69 60 53 47 42 38 35 32 30 28 27 26 25 24 23 23 22 22 22 22 21 21 21 20 20 20 20 21 21 21 22 23
657B3%JJJJKKKLLMLMNNOQRJ2J4J6K1K7L3M1N3O7Q2R4J01R3O3J6l3o8q3q5q1p4o5n6m6l8l0
$$ 23 23 24 25 26 27 29 31 33 36 39 43 46 50 55 60 66 74 83 95 109 125 146 173 206 247 300 367 449 543 644 737 800 816 783 715 632 547 466 392 327 271 225 187 157
653A57k5j9j6j3rqponmllkkjjkjjkjjjjj%jj%j%%%J%%J%JJJJKJKLKLLMOOQRJ2J5J9K3L1L6
$$ 157 132 113 97 84 75 67 60 54 49 45 42 39 37 35 34 33 31 30 29 27 26 25 24 23 22 22 21 20 20 19 19 19 19 20 20 20 21 21 22 23 24 25 27 28 30 33 35 38 41 45 51 57 65 74 86 101 120 143 174 210
647B10M4M7M6L5J7pk6l7m1m0l8l4k9k4k1j6j4j0qpomlllkkkjjj%jjjj%jj%j%j%%jj%j%%%%
$$ 210 254 301 347 382 399 392 366 329 288 248 210 176 147 123 102 86 72 62 54 47 41 37 34 31 28 26 24 22 21 20 19 19 18 17 16 15 15 14 13 13 12 12 11 11 11 10 9 9 8 8 8 8 8
642Hj%%J%%%j%%Jj%%%%%%%%%%j%%%%j%%%%%%%%%%%%%%jJ%%%%%%%%%j%J%%%%%%%%%%J%%%%j
$$ 8 7 7 7 8 8 8 8 7 7 7 8 7 7 7 7 7 7 7 7 7 7 7 6 6 6 6 6 5 5 5 5 5 5 5 5 5 5 5 5 5 5 5 4 5 5 5 5 5 5 5 5 5 5 4 4 5 5 5 5 5 5 5 5 5 5 5 6 6 6 6 6 5
636E%%%%%%%%%j%%%%%J%%%j%%%%%%%%%%%%%%%%%%%%%J%jJ%%%%%%%%jJ%%%j%J%%%%%j%%%%%
$$ 5 5 5 5 5 5 5 5 5 5 4 4 4 4 4 4 5 5 5 5 4 4 4 4 4 4 4 4 4 4 4 4 4 4 4 4 4 4 4 4 4 4 5 5 4 5 5 5 5 5 5 5 5 5 4 5 5 5 5 4 4 5 5 5 5 5 5 4 4 4 4 4 4
629DJ%%j%%%%%%%%%%%J%%%%%%%%%%%%%j%%%%%%%%%%%%%%%%%%%%%%%%%%%%%%%%%%%%%%%%J%
$$ 4 5 5 5 4 4 4 4 4 4 4 4 4 4 4 4 5 5 5 5 5 5 5 5 5 5 5 5 5 5 4 4 4 4 4 4 4 4 4 4 4 4 4 4 4 4 4 4 4 4 4 4 4 4 4 4 4 4 4 4 4 4 4 4 4 4 4 4 4 4 4 5 5
623E%%%j%%%%%%%%%%%%%%%%%%%%%%%%%%%%%%J%%%%%%%%%%j%%%%%%%Jj%%%%%%%%%%%%%%%%%
$$ 5 5 5 5 4 4 4 4 4 4 4 4 4 4 4 4 4 4 4 4 4 4 4 4 4 4 4 4 4 4 4 4 4 4 4 5 5 5 5 5 5 5 5 5 5 5 4 4 4 4 4 4 4 4 5 4 4 4 4 4 4 4 4 4 4 4 4 4 4 4 4 4 4
616D%%%%%j%%J%%%%%Jj%%%%%%%j%%%J%%%j%J%%%%%%%%%%jJ%%%%%j%J%%%%j%J%%%%%%%%%%%
$$ 4 4 4 4 4 4 3 3 3 4 4 4 4 4 4 5 4 4 4 4 4 4 4 4 3 3 3 3 4 4 4 4 3 3 4 4 4 4 4 4 4 4 4 4 4 3 4 4 4 4 4 4 3 3 4 4 4 4 4 3 3 4 4 4 4 4 4 4 4 4 4 4 4
609D%%%%J%j%%%j%%%J%j%%%%%%J%%%%%%%%%%%%%%%%%%jJ%%%%%%%%%%j%%%J%%%%%%%%%j%%%
$$ 4 4 4 4 4 5 5 4 4 4 4 3 3 3 3 4 4 3 3 3 3 3 3 3 4 4 4 4 4 4 4 4 4 4 4 4 4 4 4 4 4 4 4 3 4 4 4 4 4 4 4 4 4 4 4 3 3 3 3 4 4 4 4 4 4 4 4 4 4 3 3 3 3
603C%%%%%%%%%%%%%%%%%%J%%j%%J%%j%%%%J%%%j%%J%%%%%jJ%%%%%%%%%%J%%J%%%%%%j%%%%
$$ 3 3 3 3 3 3 3 3 3 3 3 3 3 3 3 3 3 3 3 4 4 4 3 3 3 4 4 4 3 3 3 3 3 4 4 4 4 3 3 3 4 4 4 4 4 4 3 4 4 4 4 4 4 4 4 4 4 4 5 5 5 6 6 6 6 6 6 6 5 5 5 5 5
596E%j%%j%%%%%%%%%J%%%%%%%%%%%%%j%%%J%%%%%%%j%%%%%J%j%J%%%%%J%%%%%%J%J%%%%%j
$$ 5 5 4 4 4 3 3 3 3 3 3 3 3 3 3 4 4 4 4 4 4 4 4 4 4 4 4 4 4 3 3 3 3 4 4 4 4 4 4 4 4 3 3 3 3 3 3 4 4 3 3 4 4 4 4 4 4 5 5 5 5 5 5 5 6 6 7 7 7 7 7 7 6
590F%%j%%j%%%%%j%%%%%%%J%%%j%%%%Jj%%%%%%%%%%%%%%%%%%%%%%%%%J%%%%%%jJ%%%%%J%%
$$ 6 6 6 5 5 5 4 4 4 4 4 4 3 3 3 3 3 3 3 3 4 4 4 4 3 3 3 3 3 4 3 3 3 3 3 3 3 3 3 3 3 3 3 3 3 3 3 3 3 3 3 3 3 3 3 3 4 4 4 4 4 4 4 3 4 4 4 4 4 4 5 5 5
583E%%%%%j%%%%%j%%%%%%%%%%%%%%%%%%J%%j%%%%%%%%%%%%%J%j%%%J%j%%%%%%%%%%%%%%%%
$$ 5 5 5 5 5 5 4 4 4 4 4 4 3 3 3 3 3 3 3 3 3 3 3 3 3 3 3 3 3 3 3 4 4 4 3 3 3 3 3 3 3 3 3 3 3 3 3 3 4 4 3 3 3 3 4 4 3 3 3 3 3 3 3 3 3 3 3 3 3 3 3 3 3
576C%%%%%%%%%%%%%%%%%%%%%%%J%%%%%%j%%%%%%%%%j%J%%%%%%%%%%%%%%j%%%%%%%J%%%%%%
$$ 3 3 3 3 3 3 3 3 3 3 3 3 3 3 3 3 3 3 3 3 3 3 3 3 4 4 4 4 4 4 4 3 3 3 3 3 3 3 3 3 3 2 2 3 3 3 3 3 3 3 3 3 3 3 3 3 3 3 2 2 2 2 2 2 2 2 3 3 3 3 3 3 3
570C%%%%%%%%%%%%%%%%%%%%%%%%%%%%%j%J%%%%%%%%%%%%%%%%%%%%%%%%%%%%%%%%%%%%%%%%
$$ 3 3 3 3 3 3 3 3 3 3 3 3 3 3 3 3 3 3 3 3 3 3 3 3 3 3 3 3 3 3 2 2 3 3 3 3 3 3 3 3 3 3 3 3 3 3 3 3 3 3 3 3 3 3 3 3 3 3 3 3 3 3 3 3 3 3 3 3 3 3 3 3 3
563C%J%j%J%%%%%%%%%%%%%%%%%%%%%j%%%%%%%%%%%%%%%%%J%j%%%%%%%%%%%%%%%%%%%%%%%%
$$ 3 3 4 4 3 3 4 4 4 4 4 4 4 4 4 4 4 4 4 4 4 4 4 4 4 4 4 4 3 3 3 3 3 3 3 3 3 3 3 3 3 3 3 3 3 3 4 4 3 3 3 3 3 3 3 3 3 3 3 3 3 3 3 3 3 3 3 3 3 3 3 3 3
557C%%%%%%%%%%%j%%%J%%%%%%%%%%%%%%%%%%%%%%%%%%%%%%%%%%j%%J%%%%%%%%%jJ%%%%%%%
$$ 3 3 3 3 3 3 3 3 3 3 3 3 2 2 2 2 3 3 3 3 3 3 3 3 3 3 3 3 3 3 3 3 3 3 3 3 3 3 3 3 3 3 3 3 3 3 3 3 3 3 3 2 2 2 3 3 3 3 3 3 3 3 3 3 2 3 3 3 3 3 3 3 3
550C%J%%%%%%%jJ%%j%%%%%%%%%%%%%%%%J%%%%%%%j%%%%%%J%%j%%%%%J%%%%%%%%%%%%%%%%%
$$ 3 3 4 4 4 4 4 4 4 4 3 4 4 4 3 3 3 3 3 3 3 3 3 3 3 3 3 3 3 3 3 4 4 4 4 4 4 4 4 3 3 3 3 3 3 3 4 4 4 3 3 3 3 3 3 4 4 4 4 4 4 4 4 4 4 4 4 4 4 4 4 4 4
543D%%%%%j%%%%%%%%%%%%%%%%%J%%j%%%%J%%j%%%%%%%%%%%%%%%%%%%%%%%%%J%%%%%%%%%%%
$$ 4 4 4 4 4 4 3 3 3 3 3 3 3 3 3 3 3 3 3 3 3 3 3 3 4 4 4 3 3 3 3 3 4 4 4 3 3 3 3 3 3 3 3 3 3 3 3 3 3 3 3 3 3 3 3 3 3 3 3 3 3 4 4 4 4 4 4 4 4 4 4 4 4
537D%%%j%%%%%%%%%%%%%%%%%%%%%%%%%%%%%%%%%%%%%%%%%%%%%%%%%%%%%%%%%%%%%%%%%%%%
$$ 4 4 4 4 3 3 3 3 3 3 3 3 3 3 3 3 3 3 3 3 3 3 3 3 3 3 3 3 3 3 3 3 3 3 3 3 3 3 3 3 3 3 3 3 3 3 3 3 3 3 3 3 3 3 3 3 3 3 3 3 3 3 3 3 3 3 3 3 3 3 3 3 3
530C%%%%%%%%%%j%%J%%%%j%%%%%J%%%%%%j%%%%%%%J%j%%J%%%%%%%%%%%%%%%%%%%%%%%%%%%
$$ 3 3 3 3 3 3 3 3 3 3 3 2 2 2 3 3 3 3 3 2 2 2 2 2 2 3 3 3 3 3 3 3 2 2 2 2 2 2 2 2 3 3 2 2 2 3 3 3 3 3 3 3 3 3 3 3 3 3 3 3 3 3 3 3 3 3 3 3 3 3 3 3 3
524C%%%%%%%%%%%%J%%%%%%%%%%%%%jJ%%%%%%%%%%%%%J%%%%%%J%%%J%%J%%%%%%j%%%%%%%jJ
$$ 3 3 3 3 3 3 3 3 3 3 3 3 3 4 4 4 4 4 4 4 4 4 4 4 4 4 4 3 4 4 4 4 4 4 4 4 4 4 4 4 4 4 5 5 5 5 5 5 5 6 6 6 6 7 7 7 8 8 8 8 8 8 8 7 7 7 7 7 7 7 7 6 7
517G%%%%%%%%%%j%%j%%%%%%%%%%%J%%%%%%jJ%%%%%%%%J%%%%%%J%%JJJJJJ%Jj%%%%j%jj%j%
$$ 7 7 7 7 7 7 7 7 7 7 7 6 6 6 5 5 5 5 5 5 5 5 5 5 5 5 6 6 6 6 6 6 6 5 6 6 6 6 6 6 6 6 6 7 7 7 7 7 7 7 8 8 8 9 10 11 12 13 14 14 15 14 14 14 14 14 13 13 12 11 11 10 10
510A0%%%j%%%j%%%%%%j%%%%%j%%%%%%%%%%%%%%j%%%%%%%%%%%J%%%%%%%%%J%%J%J%%%%%%%%
$$ 10 10 10 10 9 9 9 9 8 8 8 8 8 8 8 7 7 7 7 7 7 6 6 6 6 6 6 6 6 6 6 6 6 6 6 6 5 5 5 5 5 5 5 5 5 5 5 5 6 6 6 6 6 6 6 6 6 6 7 7 7 8 8 9 9 9 9 9 9 9 9 9
504Ij%%j%%%%%%%%%%%%j%%%%j%%%%%%%%%%%%%%%%j%%%%j%J%%%%%%%%%%%%%%%%%%%%%%%%%%
$$ 9 8 8 8 7 7 7 7 7 7 7 7 7 7 7 7 7 6 6 6 6 6 5 5 5 5 5 5 5 5 5 5 5 5 5 5 5 5 5 4 4 4 4 4 3 3 4 4 4 4 4 4 4 4 4 4 4 4 4 4 4 4 4 4 4 4 4 4 4 4 4 4 4
497D%%%%%%%%%%%Jj%%%%%%%%%%%%%%J%%%%%%%%%%%%%%%%%%%%%%%%J%%%%%%%%j%%%%%%%%%%
$$ 4 4 4 4 4 4 4 4 4 4 4 4 5 4 4 4 4 4 4 4 4 4 4 4 4 4 4 4 5 5 5 5 5 5 5 5 5 5 5 5 5 5 5 5 5 5 5 5 5 5 5 5 5 6 6 6 6 6 6 6 6 6 5 5 5 5 5 5 5 5 5 5 5
491Ej%%%%%%%%%%%%%%%%%%%%%%%%%%%%%%%%%%%%%%%%%%%%%%%%%%J%%j%%J%%%%j%%%%%%%%%
$$ 5 4 4 4 4 4 4 4 4 4 4 4 4 4 4 4 4 4 4 4 4 4 4 4 4 4 4 4 4 4 4 4 4 4 4 4 4 4 4 4 4 4 4 4 4 4 4 4 4 4 4 4 5 5 5 4 4 4 5 5 5 5 5 4 4 4 4 4 4 4 4 4 4
484D%%%%%%%%%%%%%j%J%%%%jJ%%%%%j%%%%%%%%%%%%J%%%%%%%%%%%%%%%%%%j%%%%%%%%%%%%
$$ 4 4 4 4 4 4 4 4 4 4 4 4 4 4 3 3 4 4 4 4 4 3 4 4 4 4 4 4 3 3 3 3 3 3 3 3 3 3 3 3 3 4 4 4 4 4 4 4 4 4 4 4 4 4 4 4 4 4 4 4 3 3 3 3 3 3 3 3 3 3 3 3 3
477C%%%%%%%%%%%%%%%%%%%%%%%J%%%j%%%Jj%%%%%%%%%%%%%%%%%%%%%%%%J%jJ%%%%j%%%%%%
$$ 3 3 3 3 3 3 3 3 3 3 3 3 3 3 3 3 3 3 3 3 3 3 3 3 4 4 4 4 3 3 3 3 4 3 3 3 3 3 3 3 3 3 3 3 3 3 3 3 3 3 3 3 3 3 3 3 3 3 4 4 3 4 4 4 4 4 3 3 3 3 3 3 3
471C%%%%%j%J%%%%%%%%%%%%%%%%%%%%%%%%%%%%j%%%%%%%%%%%%%%J%%%%%%%%%%%%j%%J%%%j
$$ 3 3 3 3 3 3 2 2 3 3 3 3 3 3 3 3 3 3 3 3 3 3 3 3 3 3 3 3 3 3 3 3 3 3 3 3 3 2 2 2 2 2 2 2 2 2 2 2 2 2 2 2 3 3 3 3 3 3 3 3 3 3 3 3 3 2 2 2 3 3 3 3 2
464B%%%%%%%J%%%%%%%%j%%%%%%%%%%%%%%%%%%J%j%%%%%%%%%%%%%%%%%%%%%%%%%%%%%%%%%%
$$ 2 2 2 2 2 2 2 2 3 3 3 3 3 3 3 3 3 2 2 2 2 2 2 2 2 2 2 2 2 2 2 2 2 2 2 2 3 3 2 2 2 2 2 2 2 2 2 2 2 2 2 2 2 2 2 2 2 2 2 2 2 2 2 2 2 2 2 2 2 2 2 2 2
458B%%%%%%J%%%%j%%%%%%Jj%%J%%%j%%J%%%j%%%%%%%%%J%j%%%%%%%%%%%%%%%%%%%J%%%j%%
$$ 2 2 2 2 2 2 2 3 3 3 3 3 2 2 2 2 2 2 2 3 2 2 2 3 3 3 3 2 2 2 3 3 3 3 2 2 2 2 2 2 2 2 2 2 3 3 2 2 2 2 2 2 2 2 2 2 2 2 2 2 2 2 2 2 2 2 3 3 3 3 2 2 2
451B%%%%%%%%%%%%%%%%%%%%%%%%%%%%%%%%%%%%%%%%%%%%%%%%%%%%%%%%%%%%%%%%%%%%%%%%
$$ 2 2 2 2 2 2 2 2 2 2 2 2 2 2 2 2 2 2 2 2 2 2 2 2 2 2 2 2 2 2 2 2 2 2 2 2 2 2 2 2 2 2 2 2 2 2 2 2 2 2 2 2 2 2 2 2 2 2 2 2 2 2 2 2 2 2 2 2 2 2 2 2 2
444B%%%%%%%%%%%%%%%%%%%%%%%%%%%%%%%%J%%j%%%%%%%%%%%%%%%%%%%%%%%%%%%%%%%%%%%%
$$ 2 2 2 2 2 2 2 2 2 2 2 2 2 2 2 2 2 2 2 2 2 2 2 2 2 2 2 2 2 2 2 2 2 3 3 3 2 2 2 2 2 2 2 2 2 2 2 2 2 2 2 2 2 2 2 2 2 2 2 2 2 2 2 2 2 2 2 2 2 2 2 2 2
438B%%%%%j%J%%%%%%j%Jj%%%J%%%%%%%%%%%%%%%%%%%%%%%%%%%%%j%J%%%%j%%J%%%%%%%%%%
$$ 2 2 2 2 2 2 1 1 2 2 2 2 2 2 2 1 1 2 1 1 1 1 2 2 2 2 2 2 2 2 2 2 2 2 2 2 2 2 2 2 2 2 2 2 2 2 2 2 2 2 2 2 1 1 2 2 2 2 2 1 1 1 2 2 2 2 2 2 2 2 2 2 2
431B%%%j%J%%%%%%%%%%%%%%%%%%%%%%%%%%%%%%%%%%%%%%%%%%%%%%%%%%%%%%%Jj%%%%%%%%%
$$ 2 2 2 2 1 1 2 2 2 2 2 2 2 2 2 2 2 2 2 2 2 2 2 2 2 2 2 2 2 2 2 2 2 2 2 2 2 2 2 2 2 2 2 2 2 2 2 2 2 2 2 2 2 2 2 2 2 2 2 2 2 2 3 2 2 2 2 2 2 2 2 2 2
425B%%%%%%%%%%%%j%%%J%%%%%%%%%%%%jJ%%%%%%%j%J%%%%%%%j%%%%%Jj%%%%%J%%%j%%%%J%
$$ 2 2 2 2 2 2 2 2 2 2 2 2 2 1 1 1 1 2 2 2 2 2 2 2 2 2 2 2 2 2 1 2 2 2 2 2 2 2 2 1 1 2 2 2 2 2 2 2 2 1 1 1 1 1 1 2 1 1 1 1 1 1 2 2 2 2 1 1 1 1 1 2 2
418B%j%%%%J%%%%%%%%%%%%%%%%%%%%%%%%%%%%%%%%%%jJ%%%%%j%%J%%%%%%%%%%%%%%%%%%%%
$$ 2 2 1 1 1 1 1 2 2 2 2 2 2 2 2 2 2 2 2 2 2 2 2 2 2 2 2 2 2 2 2 2 2 2 2 2 2 2 2 2 2 2 1 2 2 2 2 2 2 1 1 1 2 2 2 2 2 2 2 2 2 2 2 2 2 2 2 2 2 2 2 2 2
411B%Jj%%%%%%%%%%%%%%%%%%%%%%%%%%j%%%%%J%%%%%%%%%%%%%%%%%%%%%%j%%%%J%%%j%%J%
$$ 2 2 3 2 2 2 2 2 2 2 2 2 2 2 2 2 2 2 2 2 2 2 2 2 2 2 2 2 2 2 1 1 1 1 1 1 2 2 2 2 2 2 2 2 2 2 2 2 2 2 2 2 2 2 2 2 2 2 2 1 1 1 1 1 2 2 2 2 1 1 1 2 2
405B%%%%%%%jJ%%%j%J%%%%%%%%%%%%j%%%%%%%%%%%J%%%%j%J%%%%j%%%%%%%%%%%%%%%%%%%%
$$ 2 2 2 2 2 2 2 2 1 2 2 2 2 1 1 2 2 2 2 2 2 2 2 2 2 2 2 2 1 1 1 1 1 1 1 1 1 1 1 1 2 2 2 2 2 1 1 2 2 2 2 2 1 1 1 1 1 1 1 1 1 1 1 1 1 1 1 1 1 1 1 1 1
398A%%%J%%%%%%%%j%%%%%%%J%%%%%%%%%%%%j%%%%%%%%%%%%%%%Jj%%%%%J%j%%J%%%%%%%%%%
$$ 1 1 1 1 2 2 2 2 2 2 2 2 2 1 1 1 1 1 1 1 1 2 2 2 2 2 2 2 2 2 2 2 2 2 1 1 1 1 1 1 1 1 1 1 1 1 1 1 1 1 2 1 1 1 1 1 1 2 2 1 1 1 2 2 2 2 2 2 2 2 2 2 2
392B%%%%%%%%%Jj%%%%%%%%%%%J%%%%%j%%%%%%J%%%%%%%%%%%%j%%%%%%%%%%%%%%%%%%%%%%%
$$ 2 2 2 2 2 2 2 2 2 2 3 2 2 2 2 2 2 2 2 2 2 2 2 3 3 3 3 3 3 2 2 2 2 2 2 2 3 3 3 3 3 3 3 3 3 3 3 3 3 2 2 2 2 2 2 2 2 2 2 2 2 2 2 2 2 2 2 2 2 2 2 2 2
385B%%%%J%%j%%%%%%%%%%%%%%%%%%%%%%%%%%%%%%%%%%%%%j%%%J%%%%%%%%%%%%%J%j%%%%%%
$$ 2 2 2 2 2 3 3 3 2 2 2 2 2 2 2 2 2 2 2 2 2 2 2 2 2 2 2 2 2 2 2 2 2 2 2 2 2 2 2 2 2 2 2 2 2 2 1 1 1 1 2 2 2 2 2 2 2 2 2 2 2 2 2 2 3 3 2 2 2 2 2 2 2
378B%%%%%%%%%%%%%%%%%%%%%%%%%%jJ%%%%%%%%%%%%%%%%%j%%%%%%%%%%%%%%%%%%%Jj%%J%j
$$ 2 2 2 2 2 2 2 2 2 2 2 2 2 2 2 2 2 2 2 2 2 2 2 2 2 2 2 1 2 2 2 2 2 2 2 2 2 2 2 2 2 2 2 2 2 2 1 1 1 1 1 1 1 1 1 1 1 1 1 1 1 1 1 1 1 1 2 1 1 1 2 2 1
372A%%%%%%%%%%%%%%%%%Jj%%%%%%%%%J%%%%%%%%j%%%%%%J%%%j%%%%%%%%%%%%%%%%%%%%%%%
$$ 1 1 1 1 1 1 1 1 1 1 1 1 1 1 1 1 1 1 2 1 1 1 1 1 1 1 1 1 1 2 2 2 2 2 2 2 2 2 1 1 1 1 1 1 1 2 2 2 2 1 1 1 1 1 1 1 1 1 1 1 1 1 1 1 1 1 1 1 1 1 1 1 1
365A%%%%%%%%%%%%%%%J%%%%jJ%%%%%j%%%%J%%%%%%%%j%%%%%%%%%%%J%%j%%%%%%%%%%%%J%%
$$ 1 1 1 1 1 1 1 1 1 1 1 1 1 1 1 1 2 2 2 2 2 1 2 2 2 2 2 2 1 1 1 1 1 2 2 2 2 2 2 2 2 2 1 1 1 1 1 1 1 1 1 1 1 1 2 2 2 1 1 1 1 1 1 1 1 1 1 1 1 1 2 2 2
359B%j%%%%%%%%%%%%%%%J%%%%j%%%J%%%%%%%%%%%%%%%%%%%%%%%%j%%%J%%%%%%J%j%%%%%%%
$$ 2 2 1 1 1 1 1 1 1 1 1 1 1 1 1 1 1 1 2 2 2 2 2 1 1 1 1 2 2 2 2 2 2 2 2 2 2 2 2 2 2 2 2 2 2 2 2 2 2 2 2 2 1 1 1 1 2 2 2 2 2 2 2 3 3 2 2 2 2 2 2 2 2
352B%%%jJ%%%%%%%j%%%%%%J%%%%%%%%%%%%%%%%%%%%%%%%%%j%%%%%%%%%%%%%%%%%%%%J%%%%
$$ 2 2 2 2 1 2 2 2 2 2 2 2 2 1 1 1 1 1 1 1 2 2 2 2 2 2 2 2 2 2 2 2 2 2 2 2 2 2 2 2 2 2 2 2 2 2 2 1 1 1 1 1 1 1 1 1 1 1 1 1 1 1 1 1 1 1 1 1 2 2 2 2 2
345Bj%%%J%%jJ%j%%J%%%%%%j%%%J%%%%%%%%j%%%%%%%%J%%%j%%%%%%%%%%%J%%%%j%%%%%%%J
$$ 2 1 1 1 1 2 2 2 1 2 2 1 1 1 2 2 2 2 2 2 2 1 1 1 1 2 2 2 2 2 2 2 2 2 1 1 1 1 1 1 1 1 1 2 2 2 2 1 1 1 1 1 1 1 1 1 1 1 1 2 2 2 2 2 1 1 1 1 1 1 1 1 2
339B%%%%%j%%%%%%%%%%%%%%%%%J%%%%%%j%%J%jJ%%%%%%%j%J%%%%%%%%%j%%J%%%j%%%%%%Jj
$$ 2 2 2 2 2 2 1 1 1 1 1 1 1 1 1 1 1 1 1 1 1 1 1 1 2 2 2 2 2 2 2 1 1 1 2 2 1 2 2 2 2 2 2 2 2 1 1 2 2 2 2 2 2 2 2 2 2 1 1 1 2 2 2 2 1 1 1 1 1 1 1 2 1
332A%%%%%%%%%Jj%%%%%J%%j%%%%%%%%J%%%%%%%j%%%%J%%%%j%%%%%%%%%%%%%%%%%%Jj%%%%%
$$ 1 1 1 1 1 1 1 1 1 1 2 1 1 1 1 1 1 2 2 2 1 1 1 1 1 1 1 1 1 2 2 2 2 2 2 2 2 1 1 1 1 1 2 2 2 2 2 1 1 1 1 1 1 1 1 1 1 1 1 1 1 1 1 1 1 1 2 1 1 1 1 1 1
326A%%%%%J%%j%%%%%%%%%J%%%%%%%j%%%%%%%%%%%%%%%%%%%%%%%%%%%%%J%%%%%%%%%j%%%%%
$$ 1 1 1 1 1 1 2 2 2 1 1 1 1 1 1 1 1 1 1 2 2 2 2 2 2 2 2 1 1 1 1 1 1 1 1 1 1 1 1 1 1 1 1 1 1 1 1 1 1 1 1 1 1 1 1 1 1 2 2 2 2 2 2 2 2 2 2 1 1 1 1 1 1
319A%%%%%%%%J%%%%j%%%%%%%%%%%%%%%%J%%%%j%%%%%%%%%%%J%%%%%%%%j%%%%J%%%%%%%%%%
$$ 1 1 1 1 1 1 1 1 1 2 2 2 2 2 1 1 1 1 1 1 1 1 1 1 1 1 1 1 1 1 1 2 2 2 2 2 1 1 1 1 1 1 1 1 1 1 1 1 2 2 2 2 2 2 2 2 2 1 1 1 1 1 2 2 2 2 2 2 2 2 2 2 2
312B%%%%%%%%%%%%%j%%%%%%%%%%%%%%%%%%%%%%%%%%%%%%%%%%%%%%%%%%%%J%%j%%%%J%%%%%
$$ 2 2 2 2 2 2 2 2 2 2 2 2 2 2 1 1 1 1 1 1 1 1 1 1 1 1 1 1 1 1 1 1 1 1 1 1 1 1 1 1 1 1 1 1 1 1 1 1 1 1 1 1 1 1 1 1 1 1 1 2 2 2 1 1 1 1 1 2 2 2 2 2 2
306B%%%j%%%%%%J%%%%%%j%%%%%%%%%%Jj%%%j%%%J%%%%%%%%%%%%%%%%%%%%%%%%%%%%%%%%%%
$$ 2 2 2 2 1 1 1 1 1 1 1 2 2 2 2 2 2 2 1 1 1 1 1 1 1 1 1 1 1 2 1 1 1 1 0 0 0 0 1 1 1 1 1 1 1 1 1 1 1 1 1 1 1 1 1 1 1 1 1 1 1 1 1 1 1 1 1 1 1 1 1 1 1
299A%%%%%%%%%%%%%%%%J%%%%%j%%%%%%%%%%%%J%%%j%%%%%%%%%%%%%%%%%%%%%%%%J%%%%%jJ
$$ 1 1 1 1 1 1 1 1 1 1 1 1 1 1 1 1 1 2 2 2 2 2 2 1 1 1 1 1 1 1 1 1 1 1 1 1 2 2 2 2 1 1 1 1 1 1 1 1 1 1 1 1 1 1 1 1 1 1 1 1 1 1 1 1 1 2 2 2 2 2 2 1 2
293B%jJj%%%J%j%%%%%Jj%%%%%%J%%j%%%%%%%%J%%%%%%%%j%%%%%J%%j%%%%%%%%%%%%%%%%%%
$$ 2 2 1 2 1 1 1 1 2 2 1 1 1 1 1 1 2 1 1 1 1 1 1 1 2 2 2 1 1 1 1 1 1 1 1 1 2 2 2 2 2 2 2 2 2 1 1 1 1 1 1 2 2 2 1 1 1 1 1 1 1 1 1 1 1 1 1 1 1 1 1 1 1
286A%%%%%%%%%%%%%%%%%%%%J%j%%%%%%%%J%%%%%%%%%%%j%%%J%%%%%%%%%j%%%%%J%%%%%%%%
$$ 1 1 1 1 1 1 1 1 1 1 1 1 1 1 1 1 1 1 1 1 1 2 2 1 1 1 1 1 1 1 1 1 2 2 2 2 2 2 2 2 2 2 2 2 1 1 1 1 2 2 2 2 2 2 2 2 2 2 1 1 1 1 1 1 2 2 2 2 2 2 2 2 2
279B%%%%%%%%%%%%%j%%%%%%%%%%%%%%%%%%%%%%%%%%%%%%%%%%%%%%%%%%%%%%%%%%J%%%%%%j
$$ 2 2 2 2 2 2 2 2 2 2 2 2 2 2 1 1 1 1 1 1 1 1 1 1 1 1 1 1 1 1 1 1 1 1 1 1 1 1 1 1 1 1 1 1 1 1 1 1 1 1 1 1 1 1 1 1 1 1 1 1 1 1 1 1 1 2 2 2 2 2 2 2 1
273A%%%%%%%%%%%%%%%%%%%J%j%%%%%J%%j%%%%%%%%%%%%%%%%%%Jj%%%%%%%%%%%%%%%%%%%%%
$$ 1 1 1 1 1 1 1 1 1 1 1 1 1 1 1 1 1 1 1 1 2 2 1 1 1 1 1 1 2 2 2 1 1 1 1 1 1 1 1 1 1 1 1 1 1 1 1 1 1 1 2 1 1 1 1 1 1 1 1 1 1 1 1 1 1 1 1 1 1 1 1 1 1
266A%J%j%%%%%%J%%j%%%%%J%%%%%%%%%%j%%%%%%%%%%%%%%%%%%%%%J%%%%%j%%%%%%%%%%%%%
$$ 1 1 2 2 1 1 1 1 1 1 1 2 2 2 1 1 1 1 1 1 2 2 2 2 2 2 2 2 2 2 2 1 1 1 1 1 1 1 1 1 1 1 1 1 1 1 1 1 1 1 1 1 1 2 2 2 2 2 2 1 1 1 1 1 1 1 1 1 1 1 1 1 1
260A%%%%%%%%%%%%%%%%%%%%%%%%J%%%%j%%J%jJ%%j%%%%%%%%%J%%%%j%%%%%%%%%%%%%%%%%%
$$ 1 1 1 1 1 1 1 1 1 1 1 1 1 1 1 1 1 1 1 1 1 1 1 1 1 2 2 2 2 2 1 1 1 2 2 1 2 2 2 1 1 1 1 1 1 1 1 1 1 2 2 2 2 2 1 1 1 1 1 1 1 1 1 1 1 1 1 1 1 1 1 1 1
253A%%%%%%%%%%%%%%%%%%%%%%%%%%%%%%%%%%%%%%%%%%%%%%%%%%%%J%j%%%%%%%J%%%%j%%%%
$$ 1 1 1 1 1 1 1 1 1 1 1 1 1 1 1 1 1 1 1 1 1 1 1 1 1 1 1 1 1 1 1 1 1 1 1 1 1 1 1 1 1 1 1 1 1 1 1 1 1 1 1 1 1 2 2 1 1 1 1 1 1 1 1 2 2 2 2 2 1 1 1 1 1
246A%%%%%%%%%%%%%%%%%%%%%%%%%%%%%%%%%%%%%%%%%%%%%%%%%%%%%J%%j%%%%%%%%%%%%J%%
$$ 1 1 1 1 1 1 1 1 1 1 1 1 1 1 1 1 1 1 1 1 1 1 1 1 1 1 1 1 1 1 1 1 1 1 1 1 1 1 1 1 1 1 1 1 1 1 1 1 1 1 1 1 1 1 2 2 2 1 1 1 1 1 1 1 1 1 1 1 1 1 2 2 2
240B%%%%%%%%%%%%j%%%%%%%%%%%%%%%%%%%%%%%%%%%%%%%%%%%%%%%%J%%%%j%%%%%%%%%%%%%
$$ 2 2 2 2 2 2 2 2 2 2 2 2 2 1 1 1 1 1 1 1 1 1 1 1 1 1 1 1 1 1 1 1 1 1 1 1 1 1 1 1 1 1 1 1 1 1 1 1 1 1 1 1 1 1 2 2 2 2 2 1 1 1 1 1 1 1 1 1 1 1 1 1 1
233A%%%%%%%%%%%%%%%%%J%%j%%J%%%%%%%%j%%%%%%%%%%%j%%%J%%%%%%%%%%%%%%%%%%%%%%%
$$ 1 1 1 1 1 1 1 1 1 1 1 1 1 1 1 1 1 1 2 2 2 1 1 1 2 2 2 2 2 2 2 2 2 1 1 1 1 1 1 1 1 1 1 1 1 0 0 0 0 1 1 1 1 1 1 1 1 1 1 1 1 1 1 1 1 1 1 1 1 1 1 1 1
227A%%%%%%%%%%%%%%%%%%%%%%%%%%%%%%%%%%%j%%J%%%%%%%%%%%%%%%%%%%%j%%J%%%%%%%%%
$$ 1 1 1 1 1 1 1 1 1 1 1 1 1 1 1 1 1 1 1 1 1 1 1 1 1 1 1 1 1 1 1 1 1 1 1 1 0 0 0 1 1 1 1 1 1 1 1 1 1 1 1 1 1 1 1 1 1 1 1 1 0 0 0 1 1 1 1 1 1 1 1 1 1
220A%%j%%J%%%%%%%%%%%%%%%%%%%%%%%%%%%%%%%%%%%%%%%%%%%%%%%%%%%%%%%%%%%%%%%%%%
$$ 1 1 1 0 0 0 1 1 1 1 1 1 1 1 1 1 1 1 1 1 1 1 1 1 1 1 1 1 1 1 1 1 1 1 1 1 1 1 1 1 1 1 1 1 1 1 1 1 1 1 1 1 1 1 1 1 1 1 1 1 1 1 1 1 1 1 1 1 1 1 1 1 1
213A%%%%%%%%%%%%%%%%%%%%%%%%%%%%%%%%%%%%J%%%j%%%%%%%%%%%%%%%%%%%%%%%%%%%%%%%
$$ 1 1 1 1 1 1 1 1 1 1 1 1 1 1 1 1 1 1 1 1 1 1 1 1 1 1 1 1 1 1 1 1 1 1 1 1 1 2 2 2 2 1 1 1 1 1 1 1 1 1 1 1 1 1 1 1 1 1 1 1 1 1 1 1 1 1 1 1 1 1 1 1 1
207A%Jj%%%%%%%%%j%J%%%%%%%%%%%%%%%%%%%%%%%%%%%%%%%%%%%%%%%%%%%%%J%%%%%%%%%%%
$$ 1 1 2 1 1 1 1 1 1 1 1 1 1 0 0 1 1 1 1 1 1 1 1 1 1 1 1 1 1 1 1 1 1 1 1 1 1 1 1 1 1 1 1 1 1 1 1 1 1 1 1 1 1 1 1 1 1 1 1 1 1 2 2 2 2 2 2 2 2 2 2 2 2
200B%j%J%%%%j%%J%%%j%%%%%J%%%%%%%%%%%%%%j%%%%%%%J%%%%%%%j%%%%%%%%%%%%%%%%%%%
$$ 2 2 1 1 2 2 2 2 2 1 1 1 2 2 2 2 1 1 1 1 1 1 2 2 2 2 2 2 2 2 2 2 2 2 2 2 2 1 1 1 1 1 1 1 1 2 2 2 2 2 2 2 2 1 1 1 1 1 1 1 1 1 1 1 1 1 1 1 1 1 1 1 1
193A%%%%%%%%%%%%%%%%%%%%%%%%%%%%%%%%%%%%%%%%%%%%%%%%%%%%%%%%%%%%%%%%%%%%%%%%
$$ 1 1 1 1 1 1 1 1 1 1 1 1 1 1 1 1 1 1 1 1 1 1 1 1 1 1 1 1 1 1 1 1 1 1 1 1 1 1 1 1 1 1 1 1 1 1 1 1 1 1 1 1 1 1 1 1 1 1 1 1 1 1 1 1 1 1 1 1 1 1 1 1 1
187A%%%%%J%%%%j%%%%%%%%%%%%%%J%j%%%J%%%%%%%j%%%%J%%%%%j%%%%%%%%%%%%%%%%J%%%%
$$ 1 1 1 1 1 1 2 2 2 2 2 1 1 1 1 1 1 1 1 1 1 1 1 1 1 1 2 2 1 1 1 1 2 2 2 2 2 2 2 2 1 1 1 1 1 2 2 2 2 2 2 1 1 1 1 1 1 1 1 1 1 1 1 1 1 1 1 1 2 2 2 2 2
180B%%%%%%j%%J%%%%%%j%%%%%%%%%%%%%%%%%%%%%%%%%%%%%%%%%%%%%%%%%%%%%%%%%%%%%%%
$$ 2 2 2 2 2 2 2 1 1 1 2 2 2 2 2 2 2 1 1 1 1 1 1 1 1 1 1 1 1 1 1 1 1 1 1 1 1 1 1 1 1 1 1 1 1 1 1 1 1 1 1 1 1 1 1 1 1 1 1 1 1 1 1 1 1 1 1 1 1 1 1 1 1
174A%J%%%%%%%%%j%%%%%%%%%%%%%%%%%%J%j%%%%%%%%%%%%%%%%%%%%%%%%%%%%%J%%%%%%%j%
$$ 1 1 2 2 2 2 2 2 2 2 2 2 1 1 1 1 1 1 1 1 1 1 1 1 1 1 1 1 1 1 1 2 2 1 1 1 1 1 1 1 1 1 1 1 1 1 1 1 1 1 1 1 1 1 1 1 1 1 1 1 1 1 1 2 2 2 2 2 2 2 2 1 1
167A%%%%%%%%%%%%%%%%%%%%%%%%%%%%%%%J%%j%%%%%%%%%J%%%j%%%%%%%%%%%%%%%%%%%%%%%
$$ 1 1 1 1 1 1 1 1 1 1 1 1 1 1 1 1 1 1 1 1 1 1 1 1 1 1 1 1 1 1 1 1 2 2 2 1 1 1 1 1 1 1 1 1 1 2 2 2 2 1 1 1 1 1 1 1 1 1 1 1 1 1 1 1 1 1 1 1 1 1 1 1 1
160A%%%%%%%%%%j%%%%J%%%%%Jj%%%%%%Jj%%%%%%%%%%%%%%%%%%%%%%%%J%%j%%%%%%%%%%%%%
$$ 1 1 1 1 1 1 1 1 1 1 1 0 0 0 0 0 1 1 1 1 1 1 2 1 1 1 1 1 1 1 2 1 1 1 1 1 1 1 1 1 1 1 1 1 1 1 1 1 1 1 1 1 1 1 1 1 2 2 2 1 1 1 1 1 1 1 1 1 1 1 1 1 1
154A%%%%%%%%%%%%%%%%%%%%%%%%%%%%%j%%%%%%J%%%%%%%%%%%%%%%%%%%%jJ%%%%%%%%%%%%%
$$ 1 1 1 1 1 1 1 1 1 1 1 1 1 1 1 1 1 1 1 1 1 1 1 1 1 1 1 1 1 1 0 0 0 0 0 0 0 1 1 1 1 1 1 1 1 1 1 1 1 1 1 1 1 1 1 1 1 1 0 1 1 1 1 1 1 1 1 1 1 1 1 1 1
147A%%%%%%%%%%%%%%%%%%%%%%%%%%%%%Jj%%%%%%%%%J%%%%%%%j%%%%%%%%%%J%%%%j%%%%%%%
$$ 1 1 1 1 1 1 1 1 1 1 1 1 1 1 1 1 1 1 1 1 1 1 1 1 1 1 1 1 1 1 2 1 1 1 1 1 1 1 1 1 1 2 2 2 2 2 2 2 2 1 1 1 1 1 1 1 1 1 1 1 2 2 2 2 2 1 1 1 1 1 1 1 1
141A%%%%%%%%%%%%%%%%%%%%%%J%j%%%%%%jJ%%%%%%%%%%%%J%%%%%j%%%%%%%%%J%%%j%%%%%%
$$ 1 1 1 1 1 1 1 1 1 1 1 1 1 1 1 1 1 1 1 1 1 1 1 2 2 1 1 1 1 1 1 1 0 1 1 1 1 1 1 1 1 1 1 1 1 1 2 2 2 2 2 2 1 1 1 1 1 1 1 1 1 1 2 2 2 2 1 1 1 1 1 1 1
134A%%%%%%%%%%Jj%%J%%%j%%%J%%%%j%%%J%%%%j%%%%%%%%%%%%%J%%%%j%%%%%%%jJ%%%%%%J
$$ 1 1 1 1 1 1 1 1 1 1 1 2 1 1 1 2 2 2 2 1 1 1 1 2 2 2 2 2 1 1 1 1 2 2 2 2 2 1 1 1 1 1 1 1 1 1 1 1 1 1 1 2 2 2 2 2 1 1 1 1 1 1 1 1 0 1 1 1 1 1 1 1 2
127B%%%%j%%%%%%J%%%%%%%%%%%j%%%%%%%J%%j%%%%%%%%%%%%%%%%%%%%J%%%%j%%%%%%%%%%%
$$ 2 2 2 2 2 1 1 1 1 1 1 1 2 2 2 2 2 2 2 2 2 2 2 2 1 1 1 1 1 1 1 1 2 2 2 1 1 1 1 1 1 1 1 1 1 1 1 1 1 1 1 1 1 1 1 1 2 2 2 2 2 1 1 1 1 1 1 1 1 1 1 1 1
121A%J%%%%%%j%Jj%j%%J%%%%J%%j%%%%%%%%%%J%j%%%%%%%%%%%%%%%%%%%%%%%%%%%%%%%%%%
$$ 1 1 2 2 2 2 2 2 2 1 1 2 1 1 0 0 0 1 1 1 1 1 2 2 2 1 1 1 1 1 1 1 1 1 1 1 2 2 1 1 1 1 1 1 1 1 1 1 1 1 1 1 1 1 1 1 1 1 1 1 1 1 1 1 1 1 1 1 1 1 1 1 1
114A%%%%%%%%%%%%%%%%%%%%%%%%%%%%%%%%%%%%%%%%%%%%%%J%%%%%j%%%%%%J%%j%%%%J%%%j
$$ 1 1 1 1 1 1 1 1 1 1 1 1 1 1 1 1 1 1 1 1 1 1 1 1 1 1 1 1 1 1 1 1 1 1 1 1 1 1 1 1 1 1 1 1 1 1 1 2 2 2 2 2 2 1 1 1 1 1 1 1 2 2 2 1 1 1 1 1 2 2 2 2 1
108A%%Jj%%%%%%%J%%%%%j%%%%%%%%%%%%J%%j%%%%J%%%%%%%%%%%%%%j%J%%%%j%%%%%%%%%%%
$$ 1 1 1 2 1 1 1 1 1 1 1 1 2 2 2 2 2 2 1 1 1 1 1 1 1 1 1 1 1 1 1 2 2 2 1 1 1 1 1 2 2 2 2 2 2 2 2 2 2 2 2 2 2 2 1 1 2 2 2 2 2 1 1 1 1 1 1 1 1 1 1 1 1
101A%%%%%%%%%%%%%%%%%%%%%%J%%%%jJ%%%j%%%%%%%%%%%%%%%%%%%%%%%%%%%%%%%%%%%%%%%
$$ 1 1 1 1 1 1 1 1 1 1 1 1 1 1 1 1 1 1 1 1 1 1 1 2 2 2 2 2 1 2 2 2 2 1 1 1 1 1 1 1 1 1 1 1 1 1 1 1 1 1 1 1 1 1 1 1 1 1 1 1 1 1 1 1 1 1 1 1 1 1 1 1 1
94A%%%%%J%%%%%%j%%%%Jj%%%%%%%J%%%%%%%%%%%j%%%%%%%%%%%%%%%%%%%%%%%%%%%%%%J%%%
$$ 1 1 1 1 1 1 2 2 2 2 2 2 2 1 1 1 1 1 2 1 1 1 1 1 1 1 1 2 2 2 2 2 2 2 2 2 2 2 2 1 1 1 1 1 1 1 1 1 1 1 1 1 1 1 1 1 1 1 1 1 1 1 1 1 1 1 1 1 1 1 2 2 2 2
88B%%j%%%%%%%%%%%%%%%%%%%%%%%%%%%%%%%%%%%%%%%%J%%%%j%%%J%%%%%%%%j%%%%%%%J%%%
$$ 2 2 2 1 1 1 1 1 1 1 1 1 1 1 1 1 1 1 1 1 1 1 1 1 1 1 1 1 1 1 1 1 1 1 1 1 1 1 1 1 1 1 1 1 2 2 2 2 2 1 1 1 1 2 2 2 2 2 2 2 2 2 1 1 1 1 1 1 1 1 2 2 2 2
81B%%%%%%%%%%%%%%%%%%%%%j%%%%J%%%j%%J%%%%%jJ%%%%%%%%%%%%%j%%%%%%J%jJ%%%%%%%%
$$ 2 2 2 2 2 2 2 2 2 2 2 2 2 2 2 2 2 2 2 2 2 2 1 1 1 1 1 2 2 2 2 1 1 1 2 2 2 2 2 2 1 2 2 2 2 2 2 2 2 2 2 2 2 2 2 1 1 1 1 1 1 1 2 2 1 2 2 2 2 2 2 2 2 2
74B%%%%%%%%%%%j%%%%%%%%%%%J%%j%%%%%%%%J%%%%%%%%%j%%%%%%%%J%%%%%%%j%%%%%%%%%%
$$ 2 2 2 2 2 2 2 2 2 2 2 2 1 1 1 1 1 1 1 1 1 1 1 1 2 2 2 1 1 1 1 1 1 1 1 1 2 2 2 2 2 2 2 2 2 2 1 1 1 1 1 1 1 1 1 2 2 2 2 2 2 2 2 1 1 1 1 1 1 1 1 1 1 1
68A%%%%%%%%%%%%J%%j%%%%J%%j%%%%%%Jj%%%J%%jJ%%%%%%%%%%%%%%%%%j%%%%%%%%%J%%%%%
$$ 1 1 1 1 1 1 1 1 1 1 1 1 1 2 2 2 1 1 1 1 1 2 2 2 1 1 1 1 1 1 1 2 1 1 1 1 2 2 2 1 2 2 2 2 2 2 2 2 2 2 2 2 2 2 2 2 2 2 1 1 1 1 1 1 1 1 1 1 2 2 2 2 2 2
61B%%j%%%%J%%j%%%Jj%%%%%J%%%%%%%%%%%%%%%%%%%%%%%%%%%%%%%%%%%%%%%%j%%J%j%%J%%
$$ 2 2 2 1 1 1 1 1 2 2 2 1 1 1 1 2 1 1 1 1 1 1 2 2 2 2 2 2 2 2 2 2 2 2 2 2 2 2 2 2 2 2 2 2 2 2 2 2 2 2 2 2 2 2 2 2 2 2 2 2 2 2 2 1 1 1 2 2 1 1 1 2 2 2
54B%%%%%%%j%%%%%J%%%%%%%%j%J%%%%%%%%%%%%%%%%%%%%%%%%%%%%%%%%%%%%j%%%%%%%%%J%
$$ 2 2 2 2 2 2 2 2 1 1 1 1 1 1 2 2 2 2 2 2 2 2 2 1 1 2 2 2 2 2 2 2 2 2 2 2 2 2 2 2 2 2 2 2 2 2 2 2 2 2 2 2 2 2 2 2 2 2 2 2 2 2 1 1 1 1 1 1 1 1 1 1 2 2
48B%%%%%%%j%%%J%%%%%j%%%%%%%%%%%J%%j%%%J%%%%%%%%%%jJ%%%%%%j%%%J%%%%%%%%%%%%%
$$ 2 2 2 2 2 2 2 2 1 1 1 1 2 2 2 2 2 2 1 1 1 1 1 1 1 1 1 1 1 1 2 2 2 1 1 1 1 2 2 2 2 2 2 2 2 2 2 2 1 2 2 2 2 2 2 2 1 1 1 1 2 2 2 2 2 2 2 2 2 2 2 2 2 2
41B%%%%%%%%j%J%%jJ%%%%%%%%%%%%%%%%%%%j%%%%%%%%%J%%%%%%%%%%%%%%%%%%%%%%%%%%%%
$$ 2 2 2 2 2 2 2 2 2 1 1 2 2 2 1 2 2 2 2 2 2 2 2 2 2 2 2 2 2 2 2 2 2 2 2 1 1 1 1 1 1 1 1 1 1 2 2 2 2 2 2 2 2 2 2 2 2 2 2 2 2 2 2 2 2 2 2 2 2 2 2 2 2 2
34B%%%%%%%%%%%%%%%J%%%%%%%%%%%%%%j%%%J%%%%%j%%%%%%%%%%%%%%%%%%%%%%%%%%%%%%%%
$$ 2 2 2 2 2 2 2 2 2 2 2 2 2 2 2 2 3 3 3 3 3 3 3 3 3 3 3 3 3 3 3 2 2 2 2 3 3 3 3 3 3 2 2 2 2 2 2 2 2 2 2 2 2 2 2 2 2 2 2 2 2 2 2 2 2 2 2 2 2 2 2 2 2 2
28B%%%%%%%%%%%%%%J%%%%%j%%%%%%%Jj%%%%%%%%%%%%%%J%%%%%%j%%%%%%%%%J%j%J%%%%j%%
$$ 2 2 2 2 2 2 2 2 2 2 2 2 2 2 2 3 3 3 3 3 3 2 2 2 2 2 2 2 2 3 2 2 2 2 2 2 2 2 2 2 2 2 2 2 2 3 3 3 3 3 3 3 2 2 2 2 2 2 2 2 2 2 3 3 2 2 3 3 3 3 3 2 2 2
21B%%%%jJ%%%%%%%%%%%%%J%j%%%%%%%%%%%%%%%%%%%%%%%%%%%%%%%J%%%%%%%%%j%%%%J%j%J
$$ 2 2 2 2 2 1 2 2 2 2 2 2 2 2 2 2 2 2 2 2 3 3 2 2 2 2 2 2 2 2 2 2 2 2 2 2 2 2 2 2 2 2 2 2 2 2 2 2 2 2 2 2 2 2 3 3 3 3 3 3 3 3 3 3 2 2 2 2 2 3 3 2 2 3
14C%%%%%%%%%%%%%%jJ%%%%%j%%%%%%%%%%%%%%J%%j%%%%J%%%j%J%%%%%%%%%%j%J%%%%%%%%%
$$ 3 3 3 3 3 3 3 3 3 3 3 3 3 3 3 2 3 3 3 3 3 3 2 2 2 2 2 2 2 2 2 2 2 2 2 2 2 3 3 3 2 2 2 2 2 3 3 3 3 2 2 3 3 3 3 3 3 3 3 3 3 3 2 2 3 3 3 3 3 3 3 3 3 3
7C%j%%%%%%%%%%%%%%%%%%%%%%%%%Jj%%%%%%J%%%%%%%%%%%%j%%%%%%%%%%J%%j%%%%%%%J%%%
$$ 3 3 2 2 2 2 2 2 2 2 2 2 2 2 2 2 2 2 2 2 2 2 2 2 2 2 2 2 3 2 2 2 2 2 2 2 3 3 3 3 3 3 3 3 3 3 3 3 3 2 2 2 2 2 2 2 2 2 2 2 3 3 3 2 2 2 2 2 2 2 2 3 3 3 3
1C%%%%%%%%%%%%%%%%%%%%%%%%%%%%%%%%%%%%%%%%%%%%%%%%%%%%%%%%%%%%%%%%%%%%%%%%%%
$$ 3 3 3 3 3 3 3 3 3 3 3 3 3 3 3 3 3 3 3 3 3 3 3 3 3 3 3 3 3 3 3 3 3 3 3 3 3 3 3 3 3 3 3 3 3 3 3 3 3 3 3 3 3 3 3 3 3 3 3 3 3 3 3 3 3 3 3 3 3 3 3 3 3 3 3
-6C%%%%%%%%%%%%%%%%%%%%%%Jj%%%%%%%%%%j%%%%J%%%%j%%%J%%%%%%%%%%%%%%%%%%%jJ%%%
$$ 3 3 3 3 3 3 3 3 3 3 3 3 3 3 3 3 3 3 3 3 3 3 3 4 3 3 3 3 3 3 3 3 3 3 3 2 2 2 2 2 3 3 3 3 3 2 2 2 2 3 3 3 3 3 3 3 3 3 3 3 3 3 3 3 3 3 3 3 3 2 3 3 3 3
-13C%%%%%%%%%%%%j%%%%%%%J%%%%%%%%%%%%%%%%%%%%%%%%%%%%%%%%%%%%%%%%%%%%%%%J%%j
$$ 3 3 3 3 3 3 3 3 3 3 3 3 3 2 2 2 2 2 2 2 2 3 3 3 3 3 3 3 3 3 3 3 3 3 3 3 3 3 3 3 3 3 3 3 3 3 3 3 3 3 3 3 3 3 3 3 3 3 3 3 3 3 3 3 3 3 3 3 3 4 4 4 3
-19C%%%%%%%%%%%%%%%%%%%%%%%%J%%%%%%%%%%%%%%%%j%%%J%%j%%%%%%%%%%%%%%%%%%%%%%%
$$ 3 3 3 3 3 3 3 3 3 3 3 3 3 3 3 3 3 3 3 3 3 3 3 3 3 4 4 4 4 4 4 4 4 4 4 4 4 4 4 4 4 4 3 3 3 3 4 4 4 3 3 3 3 3 3 3 3 3 3 3 3 3 3 3 3 3 3 3 3 3 3 3 3
-26C%%J%%%%%%%%j%%%%%Jj%%%%%%%%%%J%%j%%%%%%%%%%%%%%%%%%%%%%%%%%%%%%%%%%%J%j%
$$ 3 3 3 4 4 4 4 4 4 4 4 4 3 3 3 3 3 3 4 3 3 3 3 3 3 3 3 3 3 3 4 4 4 3 3 3 3 3 3 3 3 3 3 3 3 3 3 3 3 3 3 3 3 3 3 3 3 3 3 3 3 3 3 3 3 3 3 3 3 4 4 3 3
-33C%%%%%%J%%j%%%%%%%%%%%%%%%%%J%%%%j%%%%%%Jj%%%%%%%%%%%%%%%%%%%%J%%%%j%%%%%
$$ 3 3 3 3 3 3 3 4 4 4 3 3 3 3 3 3 3 3 3 3 3 3 3 3 3 3 3 3 4 4 4 4 4 3 3 3 3 3 3 3 4 3 3 3 3 3 3 3 3 3 3 3 3 3 3 3 3 3 3 3 3 3 4 4 4 4 4 3 3 3 3 3 3
-39C%%%%%%J%%%%j%%%%%%%%%%%%%%%%%%%%%%%%%%%%%%J%j%%%%%%%%%%%%%%%%%%%%%%%%%%%
$$ 3 3 3 3 3 3 3 4 4 4 4 4 3 3 3 3 3 3 3 3 3 3 3 3 3 3 3 3 3 3 3 3 3 3 3 3 3 3 3 3 3 3 3 4 4 3 3 3 3 3 3 3 3 3 3 3 3 3 3 3 3 3 3 3 3 3 3 3 3 3 3 3 3
-46C%%%%%%%%%%%%%%%%%%%%%%%%%%%%%%%%%%%%%%%%%%%%%%%%%%%%%jJ%%%%%%%%%%%%%%%%%
$$ 3 3 3 3 3 3 3 3 3 3 3 3 3 3 3 3 3 3 3 3 3 3 3 3 3 3 3 3 3 3 3 3 3 3 3 3 3 3 3 3 3 3 3 3 3 3 3 3 3 3 3 3 3 3 2 3 3 3 3 3 3 3 3 3 3 3 3 3 3 3 3 3 3
-52C%%%%%%%%%%%%%%%%%%%%%%%%%%%%%%%%%%%%%%%%%%%%%%%%%%%%%%%%%%%%%%%%%%%%%%%%
$$ 3 3 3 3 3 3 3 3 3 3 3 3 3 3 3 3 3 3 3 3 3 3 3 3 3 3 3 3 3 3 3 3 3 3 3 3 3 3 3 3 3 3 3 3 3 3 3 3 3 3 3 3 3 3 3 3 3 3 3 3 3 3 3 3 3 3 3 3 3 3 3 3 3
-59C%%%jJ%%%%%%%%%%%%%%%%%%%%%%%%j%%%%%%%%J%j%%%%%%%%%%%%%%%J%%%%%%j%%%%%%%%
$$ 3 3 3 3 2 3 3 3 3 3 3 3 3 3 3 3 3 3 3 3 3 3 3 3 3 3 3 3 3 3 2 2 2 2 2 2 2 2 2 3 3 2 2 2 2 2 2 2 2 2 2 2 2 2 2 2 2 3 3 3 3 3 3 3 2 2 2 2 2 2 2 2 2
-66B%J%%%j%%%%%%%%%%%Jj%%%J%%%%%%%%%j%%%%Jj%%%%%%J%%%%%%%%j%%%J%%%%j%%%J%%%%
$$ 2 2 3 3 3 3 2 2 2 2 2 2 2 2 2 2 2 2 3 2 2 2 2 3 3 3 3 3 3 3 3 3 3 2 2 2 2 2 3 2 2 2 2 2 2 2 3 3 3 3 3 3 3 3 3 2 2 2 2 3 3 3 3 3 2 2 2 2 3 3 3 3 3
-72C%%%%%%j%%%%%%%%%%%jJ%j%%%J%%%%%%%%%%%%%%%%%%%%%%%J%%%%%%%%%j%%%%%%%%%%%%
$$ 3 3 3 3 3 3 3 2 2 2 2 2 2 2 2 2 2 2 2 1 2 2 1 1 1 1 2 2 2 2 2 2 2 2 2 2 2 2 2 2 2 2 2 2 2 2 2 2 2 2 3 3 3 3 3 3 3 3 3 3 2 2 2 2 2 2 2 2 2 2 2 2 2
-79B%%%%%%%%%%%%%%%%%J%%%%j%%%%%%%%%%%%%%%%%J%j%%%%%%%%%%%%%%%%%%%%%%%%%%%j%
$$ 2 2 2 2 2 2 2 2 2 2 2 2 2 2 2 2 2 2 3 3 3 3 3 2 2 2 2 2 2 2 2 2 2 2 2 2 2 2 2 2 2 3 3 2 2 2 2 2 2 2 2 2 2 2 2 2 2 2 2 2 2 2 2 2 2 2 2 2 2 2 2 1 1
-85A%%J%%%%%%%%%%%%%%%%%j%%%%%%%%J%%%%%%%%%%%%%%%%%%%%%%%%%%%%%%%%%%%%%%%%%%
$$ 1 1 1 2 2 2 2 2 2 2 2 2 2 2 2 2 2 2 2 2 2 1 1 1 1 1 1 1 1 1 2 2 2 2 2 2 2 2 2 2 2 2 2 2 2 2 2 2 2 2 2 2 2 2 2 2 2 2 2 2 2 2 2 2 2 2 2 2 2 2 2 2 2
-92BjJ%%%%%%%%%%%%%%%%%%%%%%%%%%%%%%%%%%%%%%%%%%%%%%%%%%%%%%%%%%%%%%%%%j%%%%
$$ 2 1 2 2 2 2 2 2 2 2 2 2 2 2 2 2 2 2 2 2 2 2 2 2 2 2 2 2 2 2 2 2 2 2 2 2 2 2 2 2 2 2 2 2 2 2 2 2 2 2 2 2 2 2 2 2 2 2 2 2 2 2 2 2 2 2 2 2 1 1 1 1 1
-99A%J%%%%%%%%%%%%j%%%%%%%%J%%%%%j%%%%J%%%%j%%%%J%%%%%%%%%%jJ%%%%%j%J%%%%%%%
$$ 1 1 2 2 2 2 2 2 2 2 2 2 2 2 2 1 1 1 1 1 1 1 1 1 2 2 2 2 2 2 1 1 1 1 1 2 2 2 2 2 1 1 1 1 1 2 2 2 2 2 2 2 2 2 2 2 1 2 2 2 2 2 2 1 1 2 2 2 2 2 2 2 2
-105B%jJ%%%%%%%%%%%%%%%jJ%%%%%%j%%%%%%%J%%%%%%%%j%%%%%%%J%%%%%%%%%%%%%%%%%%%
$$ 2 2 1 2 2 2 2 2 2 2 2 2 2 2 2 2 2 2 2 1 2 2 2 2 2 2 2 1 1 1 1 1 1 1 1 2 2 2 2 2 2 2 2 2 1 1 1 1 1 1 1 1 2 2 2 2 2 2 2 2 2 2 2 2 2 2 2 2 2 2 2 2
-112B%j%%%%%%%%%%%%%%%%%J%%%%%%%j%%%%%%%%J%%%%%j%%%%%%%%%%J%%%%%%%%%%%%%%%%%
$$ 2 2 1 1 1 1 1 1 1 1 1 1 1 1 1 1 1 1 1 1 2 2 2 2 2 2 2 2 1 1 1 1 1 1 1 1 1 2 2 2 2 2 2 1 1 1 1 1 1 1 1 1 1 1 2 2 2 2 2 2 2 2 2 2 2 2 2 2 2 2 2 2
-118B%%%%%%%j%%%%%J%%%%%%%%%%%%%%%%%%%j%%%%%%%%%%%%%%%%J%%%%%%j%%%%%J%j%%%%%
$$ 2 2 2 2 2 2 2 2 1 1 1 1 1 1 2 2 2 2 2 2 2 2 2 2 2 2 2 2 2 2 2 2 2 2 1 1 1 1 1 1 1 1 1 1 1 1 1 1 1 1 1 2 2 2 2 2 2 2 1 1 1 1 1 1 2 2 1 1 1 1 1 1
-125A%%%%%%%%%%%%%%%%%%J%%%%%%%%%j%%%%%%J%%j%J%%%%%%%j%%J%%%j%%J%%%%%%%%%%%%
$$ 1 1 1 1 1 1 1 1 1 1 1 1 1 1 1 1 1 1 1 2 2 2 2 2 2 2 2 2 2 1 1 1 1 1 1 1 2 2 2 1 1 2 2 2 2 2 2 2 2 1 1 1 2 2 2 2 1 1 1 2 2 2 2 2 2 2 2 2 2 2 2 2
-131B%j%%%%%J%j%%%%%%%%%%%%%%j%J%%%%%%%%J%%j%%%%%Jj%%%J%j%%%%%%%%%%%%%%%J%%%
$$ 2 2 1 1 1 1 1 1 2 2 1 1 1 1 1 1 1 1 1 1 1 1 1 1 1 0 0 1 1 1 1 1 1 1 1 1 2 2 2 1 1 1 1 1 1 2 1 1 1 1 2 2 1 1 1 1 1 1 1 1 1 1 1 1 1 1 1 1 2 2 2 2
-138B%j%%%%%%%%%%%%%%%%%%%%%%%%%%%%%%%%%%%%%J%%%j%%%%%%%%%%%%%%%%%%%%%%%%%%%
$$ 2 2 1 1 1 1 1 1 1 1 1 1 1 1 1 1 1 1 1 1 1 1 1 1 1 1 1 1 1 1 1 1 1 1 1 1 1 1 1 1 2 2 2 2 1 1 1 1 1 1 1 1 1 1 1 1 1 1 1 1 1 1 1 1 1 1 1 1 1 1 1 1
-144A%%%%%%%%%%%%%%%%%%%%%%%%%%%%%%%%%%%%%%%%%%%%%J%%%%j%%%%%%%%%%%%%%%%%%%J
$$ 1 1 1 1 1 1 1 1 1 1 1 1 1 1 1 1 1 1 1 1 1 1 1 1 1 1 1 1 1 1 1 1 1 1 1 1 1 1 1 1 1 1 1 1 1 1 2 2 2 2 2 1 1 1 1 1 1 1 1 1 1 1 1 1 1 1 1 1 1 1 1 2
-151B%%j%%J%j%%%%%%%%%%%%%%%%%j%%J%%%%%%%%%%%%%%%%%%%%%%%%%%%%%%%%%%%%%%%%%%
$$ 2 2 2 1 1 1 2 2 1 1 1 1 1 1 1 1 1 1 1 1 1 1 1 1 1 1 0 0 0 1 1 1 1 1 1 1 1 1 1 1 1 1 1 1 1 1 1 1 1 1 1 1 1 1 1 1 1 1 1 1 1 1 1 1 1 1 1 1 1 1 1 1
-157A%%%%%%%%%J%%j%%%%%%%%%%%%%%%%%%%%%J%%j%%%%%%%%%%%%%%%%%%%%%%%%%%%%%%%%%
$$ 1 1 1 1 1 1 1 1 1 1 2 2 2 1 1 1 1 1 1 1 1 1 1 1 1 1 1 1 1 1 1 1 1 1 1 2 2 2 1 1 1 1 1 1 1 1 1 1 1 1 1 1 1 1 1 1 1 1 1 1 1 1 1 1 1 1 1 1 1 1 1 1
-164A%%%%%%%%%%%%%%%%%%%j%%%%J%%%%%%%%%%%%%%%%%%%%%%%%J%%j%%%%%%%%%%%%%%%%%%
$$ 1 1 1 1 1 1 1 1 1 1 1 1 1 1 1 1 1 1 1 1 0 0 0 0 0 1 1 1 1 1 1 1 1 1 1 1 1 1 1 1 1 1 1 1 1 1 1 1 1 1 2 2 2 1 1 1 1 1 1 1 1 1 1 1 1 1 1 1 1 1 1 1
-170A%%%%%%%%%%%%%%%%%%%%%%%%%%j%%J%%%%%%j%%%%J%%%j%%J%%%%%%%%%%%%%%%%%%%%%%
$$ 1 1 1 1 1 1 1 1 1 1 1 1 1 1 1 1 1 1 1 1 1 1 1 1 1 1 1 0 0 0 1 1 1 1 1 1 1 0 0 0 0 0 1 1 1 1 0 0 0 1 1 1 1 1 1 1 1 1 1 1 1 1 1 1 1 1 1 1 1 1 1 1
-177A%%%%%%%%%%%%%%%%%j%J%%%%%%%%%%%%j%%%J%%%%%%%%%%%%%%%%%%%%%%%%%%%%%%%%%%
$$ 1 1 1 1 1 1 1 1 1 1 1 1 1 1 1 1 1 1 0 0 1 1 1 1 1 1 1 1 1 1 1 1 1 0 0 0 0 1 1 1 1 1 1 1 1 1 1 1 1 1 1 1 1 1 1 1 1 1 1 1 1 1 1 1 1 1 1 1 1 1 1 1
-183A%%%%%%%%%%%%%%%%%%%%%%%Jj%%%%%%%%%%%%%%%%%%%j%%%J%%%%%%%%%%%%%%%%%%%%%%
$$ 1 1 1 1 1 1 1 1 1 1 1 1 1 1 1 1 1 1 1 1 1 1 1 1 2 1 1 1 1 1 1 1 1 1 1 1 1 1 1 1 1 1 1 1 1 0 0 0 0 1 1 1 1 1 1 1 1 1 1 1 1 1 1 1 1 1 1 1 1 1 1 1
-190A%%%%%%%%%%%%%%J%j%%%%%%%%%%%%%%%%%%%%%%%%%%%%%%%%%%%%%%%%%%%j%%%Jj%J%%%
$$ 1 1 1 1 1 1 1 1 1 1 1 1 1 1 1 2 2 1 1 1 1 1 1 1 1 1 1 1 1 1 1 1 1 1 1 1 1 1 1 1 1 1 1 1 1 1 1 1 1 1 1 1 1 1 1 1 1 1 1 1 1 0 0 0 0 1 0 0 1 1 1 1
-196A%%%%%%%%%%%%%%%%%%%%j%J%%%%%%%%%%%%%%%%%%%%%%%%%%%%%%%%%%%%%%%%%%j%J%%%
$$ 1 1 1 1 1 1 1 1 1 1 1 1 1 1 1 1 1 1 1 1 1 0 0 1 1 1 1 1 1 1 1 1 1 1 1 1 1 1 1 1 1 1 1 1 1 1 1 1 1 1 1 1 1 1 1 1 1 1 1 1 1 1 1 1 1 1 0 0 1 1 1 1
-203A%%%%%%%%%%%%%%%%%%%%%%%%%%%%%%j%%%%%J%%%%%%%%%%%%%%%%%%%%%%%j%%J%%%%%%%
$$ 1 1 1 1 1 1 1 1 1 1 1 1 1 1 1 1 1 1 1 1 1 1 1 1 1 1 1 1 1 1 1 0 0 0 0 0 0 1 1 1 1 1 1 1 1 1 1 1 1 1 1 1 1 1 1 1 1 1 1 1 1 0 0 0 1 1 1 1 1 1 1 1
-209A%j%%%%%%%%J%%%%%%%%%j%%J%%%%%%%%%%%%%%%%%J%j%%%%%%j%%%J%%%%%%%%%%%%%%%j
$$ 1 1 0 0 0 0 0 0 0 0 0 1 1 1 1 1 1 1 1 1 1 0 0 0 1 1 1 1 1 1 1 1 1 1 1 1 1 1 1 1 1 1 2 2 1 1 1 1 1 1 1 0 0 0 0 1 1 1 1 1 1 1 1 1 1 1 1 1 1 1 1 0
-216@%%J%%%%%Jj%%%%j%J%%%%%%%%%%%%%%%%%%%%%%j%%%J%%%%%%%%%%%%%%%%%%%%%%%%%%%
$$ 0 0 0 1 1 1 1 1 1 2 1 1 1 1 1 0 0 1 1 1 1 1 1 1 1 1 1 1 1 1 1 1 1 1 1 1 1 1 1 1 0 0 0 0 1 1 1 1 1 1 1 1 1 1 1 1 1 1 1 1 1 1 1 1 1 1 1 1 1 1 1 1
-222A%%%%%%%%%%%%%%%%%%%%%%%%%%%%%%%%%%%%%%%%%%%%%%%%%%%j%%%%%J%%%%%%%%%%%%%
$$ 1 1 1 1 1 1 1 1 1 1 1 1 1 1 1 1 1 1 1 1 1 1 1 1 1 1 1 1 1 1 1 1 1 1 1 1 1 1 1 1 1 1 1 1 1 1 1 1 1 1 1 1 0 0 0 0 0 0 1 1 1 1 1 1 1 1 1 1 1 1 1 1
-229A%%%%%%%%%%%%%%%%%%%j%%%%%%%%%J%%%%%%%%J%%j%%%%%%%%%%%%%%%%%%%%%%%%%%%%%
$$ 1 1 1 1 1 1 1 1 1 1 1 1 1 1 1 1 1 1 1 1 0 0 0 0 0 0 0 0 0 0 1 1 1 1 1 1 1 1 1 2 2 2 1 1 1 1 1 1 1 1 1 1 1 1 1 1 1 1 1 1 1 1 1 1 1 1 1 1 1 1 1 1
-235A%%%jJ%%%%%%%%j%%%J%%%%%%%%%%%%%%j%%%J%%%%%%%%%%%%%%%%%%%%%%%%%%%%%%%%j%
$$ 1 1 1 1 0 1 1 1 1 1 1 1 1 1 0 0 0 0 1 1 1 1 1 1 1 1 1 1 1 1 1 1 1 0 0 0 0 1 1 1 1 1 1 1 1 1 1 1 1 1 1 1 1 1 1 1 1 1 1 1 1 1 1 1 1 1 1 1 1 1 0 0
-242@%J%%%%j%%%%J%%%%%%%%%%%%%%%%%%%%%%%%%%%%%%%%%%%%%%%%%%%%%%%%%%%%%%%%%%%
$$ 0 0 1 1 1 1 1 0 0 0 0 0 1 1 1 1 1 1 1 1 1 1 1 1 1 1 1 1 1 1 1 1 1 1 1 1 1 1 1 1 1 1 1 1 1 1 1 1 1 1 1 1 1 1 1 1 1 1 1 1 1 1 1 1 1 1 1 1 1 1 1 1
-248A%%%J%%%j%%%%%%%%%Jj%%%%%%%%%%J%j%%%%%%%%%%j%%%%%%%%J%%j%J%%%%%%%%%%%%%%
$$ 1 1 1 1 2 2 2 2 1 1 1 1 1 1 1 1 1 1 2 1 1 1 1 1 1 1 1 1 1 1 2 2 1 1 1 1 1 1 1 1 1 1 1 0 0 0 0 0 0 0 0 0 1 1 1 0 0 1 1 1 1 1 1 1 1 1 1 1 1 1 1 1
-255A%%%%%%%%%%%%%jJ%%%%%%%%%%%%%%%%%%%%%%%%%%%%%%%%%%%%%%%j%J%%%j%J%%j%%%%%
$$ 1 1 1 1 1 1 1 1 1 1 1 1 1 1 0 1 1 1 1 1 1 1 1 1 1 1 1 1 1 1 1 1 1 1 1 1 1 1 1 1 1 1 1 1 1 1 1 1 1 1 1 1 1 1 1 0 0 1 1 1 1 0 0 1 1 1 0 0 0 0 0 0
-262@%%J%%%%%%%%%%%%%%%%%j%%J%%%%j%%%%J%%%%%%%%%%%%%%%%%%%%%%%%%%%%%%%%%%%%%
$$ 0 0 0 1 1 1 1 1 1 1 1 1 1 1 1 1 1 1 1 1 1 0 0 0 1 1 1 1 1 0 0 0 0 0 1 1 1 1 1 1 1 1 1 1 1 1 1 1 1 1 1 1 1 1 1 1 1 1 1 1 1 1 1 1 1 1 1 1 1 1 1 1
-268A%%%%%%%j%%%%%J%%%%%%%%%%%j%J%%%%j%%%%%%%%%%J%%%%%%%j%%J%%%%%%%%%%%%%%%%
$$ 1 1 1 1 1 1 1 1 0 0 0 0 0 0 1 1 1 1 1 1 1 1 1 1 1 1 0 0 1 1 1 1 1 0 0 0 0 0 0 0 0 0 0 0 1 1 1 1 1 1 1 1 0 0 0 1 1 1 1 1 1 1 1 1 1 1 1 1 1 1 1 1
-275A%%%%%%%%%%%%%%%%%%%%%%%%%%%%%%%%%%%%%%%%%%%%%%%%%%%%%%%%%%%%%%%%%%%%%%%
$$ 1 1 1 1 1 1 1 1 1 1 1 1 1 1 1 1 1 1 1 1 1 1 1 1 1 1 1 1 1 1 1 1 1 1 1 1 1 1 1 1 1 1 1 1 1 1 1 1 1 1 1 1 1 1 1 1 1 1 1 1 1 1 1 1 1 1 1 1 1 1 1 1
-281A%%%%%%%%j%J%%%%j%J%%%%%%%%%%%%%%%%%%%%%%%j%J%%%%%%%%%%%%%%%%%%%%%%%%%j%
$$ 1 1 1 1 1 1 1 1 1 0 0 1 1 1 1 1 0 0 1 1 1 1 1 1 1 1 1 1 1 1 1 1 1 1 1 1 1 1 1 1 1 1 0 0 1 1 1 1 1 1 1 1 1 1 1 1 1 1 1 1 1 1 1 1 1 1 1 1 1 1 0 0
-288@%%%%%J%%%j%%%%J%%%%%%%%%%%%%%%%%%%%%%%%%%%jJ%%%%%%%%%%%%%%%%%%j%%J%%%%%
$$ 0 0 0 0 0 0 1 1 1 1 0 0 0 0 0 1 1 1 1 1 1 1 1 1 1 1 1 1 1 1 1 1 1 1 1 1 1 1 1 1 1 1 1 0 1 1 1 1 1 1 1 1 1 1 1 1 1 1 1 1 1 1 1 0 0 0 1 1 1 1 1 1
-294A%%%%%%%%%%%%%%%%%%%%j%%%%%%%%J%%%%%%%%%%%%%%%j%%%%J%%%%%%%%%%%%%%%%%%j%
$$ 1 1 1 1 1 1 1 1 1 1 1 1 1 1 1 1 1 1 1 1 1 0 0 0 0 0 0 0 0 0 1 1 1 1 1 1 1 1 1 1 1 1 1 1 1 1 0 0 0 0 0 1 1 1 1 1 1 1 1 1 1 1 1 1 1 1 1 1 1 1 0 0
-301@%J%%%%%%%%%%%%%%%%%%%%%%%%%%%jJ%%jJ%%%%%%%%%%%%%%%%%%%%%%%%%%%%%%%%%Jj%
$$ 0 0 1 1 1 1 1 1 1 1 1 1 1 1 1 1 1 1 1 1 1 1 1 1 1 1 1 1 1 1 0 1 1 1 0 1 1 1 1 1 1 1 1 1 1 1 1 1 1 1 1 1 1 1 1 1 1 1 1 1 1 1 1 1 1 1 1 1 1 2 1 1
-307A%%%%%%%%%%%%%%%%j%J%%%jJ%j%%J%%%%%jJ%%%%%%%%%%%%%%%%%%%%%%%%%%%%%%%%%%%
$$ 1 1 1 1 1 1 1 1 1 1 1 1 1 1 1 1 1 0 0 1 1 1 1 0 1 1 0 0 0 1 1 1 1 1 1 0 1 1 1 1 1 1 1 1 1 1 1 1 1 1 1 1 1 1 1 1 1 1 1 1 1 1 1 1 1 1 1 1 1 1 1 1
-314A%%%%%%%%%%%%%%%%%%%%%%%%%%%%%%%%%%%j%%J%%%%%%%%%%%%%%%%%%%%%%%%%%%%%j%%
$$ 1 1 1 1 1 1 1 1 1 1 1 1 1 1 1 1 1 1 1 1 1 1 1 1 1 1 1 1 1 1 1 1 1 1 1 1 0 0 0 1 1 1 1 1 1 1 1 1 1 1 1 1 1 1 1 1 1 1 1 1 1 1 1 1 1 1 1 1 1 0 0 0
-320@%J%j%%%%%%%%J%jJ%%%%%%%%%%%%%%%%%%%%%j%J%%j%%Jj%%%J%%%%%%%%%j%%%J%j%%%%
$$ 0 0 1 1 0 0 0 0 0 0 0 0 0 1 1 0 1 1 1 1 1 1 1 1 1 1 1 1 1 1 1 1 1 1 1 1 1 1 0 0 1 1 1 0 0 0 1 0 0 0 0 1 1 1 1 1 1 1 1 1 1 0 0 0 0 1 1 0 0 0 0 0
-327@%%%%J%%%%%%%%%%%%%%%%%%%j%%%%%%%%J%%%%%%%%%%%%%%%%%%%%%%%j%%J%%%%%%%%%j
$$ 0 0 0 0 0 1 1 1 1 1 1 1 1 1 1 1 1 1 1 1 1 1 1 1 1 0 0 0 0 0 0 0 0 0 1 1 1 1 1 1 1 1 1 1 1 1 1 1 1 1 1 1 1 1 1 1 1 1 0 0 0 1 1 1 1 1 1 1 1 1 1 0
-333@%%%%%J%%%%%%%%%%%%%%%%%%%%%%%%%%%%%%j%%%%%%J%%%%%%%%%%%%Jj%%%%%%%%%%%j%
$$ 0 0 0 0 0 0 1 1 1 1 1 1 1 1 1 1 1 1 1 1 1 1 1 1 1 1 1 1 1 1 1 1 1 1 1 1 1 0 0 0 0 0 0 0 1 1 1 1 1 1 1 1 1 1 1 1 1 2 1 1 1 1 1 1 1 1 1 1 1 1 0 0
-340@J%%%%%%%%%%%%%%%%%%J%j%%%%%j%%%%%%J%%%%%%%%%j%%J%%%%%%%%%%%%%%%j%J%%%J%
$$ 0 1 1 1 1 1 1 1 1 1 1 1 1 1 1 1 1 1 1 1 2 2 1 1 1 1 1 1 0 0 0 0 0 0 0 1 1 1 1 1 1 1 1 1 1 0 0 0 1 1 1 1 1 1 1 1 1 1 1 1 1 1 1 1 0 0 1 1 1 1 2 2
-346Bj%%j%%%%%J%%jJ%%%%%%%%%%%%%%%%%%%%%%%%%j%%%%J%%%%%%%%%%%%%%%%%%%%%%%%%%
$$ 2 1 1 1 0 0 0 0 0 0 1 1 1 0 1 1 1 1 1 1 1 1 1 1 1 1 1 1 1 1 1 1 1 1 1 1 1 1 1 1 0 0 0 0 0 1 1 1 1 1 1 1 1 1 1 1 1 1 1 1 1 1 1 1 1 1 1 1 1 1 1 1
-353A%j%J%%%%%%%%%%%%%j%%%%J%%%%%j%%%J%%j%%%%J%%%%%%%%%%%%%%%%%%%%%%%%%%jJ%%
$$ 1 1 0 0 1 1 1 1 1 1 1 1 1 1 1 1 1 1 0 0 0 0 0 1 1 1 1 1 1 0 0 0 0 1 1 1 0 0 0 0 0 1 1 1 1 1 1 1 1 1 1 1 1 1 1 1 1 1 1 1 1 1 1 1 1 1 1 1 0 1 1 1
-359A%%%%%%%%%%%%%%%%%%%%%%%%%%%%%%%%jJ%%%%%%%%%%%%%j%%%%%%%J%%%%%%j%J%%%%%%
$$ 1 1 1 1 1 1 1 1 1 1 1 1 1 1 1 1 1 1 1 1 1 1 1 1 1 1 1 1 1 1 1 1 1 0 1 1 1 1 1 1 1 1 1 1 1 1 1 1 0 0 0 0 0 0 0 0 1 1 1 1 1 1 1 0 0 1 1 1 1 1 1 1
-366A%%%%%%%%%%%%j%J%%%%j%%%%%%%%J%%%%%%%%%%%%%%%%%%%%%%j%%%J%%%%%%%%%%%%%%%
$$ 1 1 1 1 1 1 1 1 1 1 1 1 1 0 0 1 1 1 1 1 0 0 0 0 0 0 0 0 0 1 1 1 1 1 1 1 1 1 1 1 1 1 1 1 1 1 1 1 1 1 1 1 0 0 0 0 1 1 1 1 1 1 1 1 1 1 1 1 1 1 1 1
-372A%%%%%%%%%%%%%%%%%j%J%%%%jJ%%%%%%%%%%%%%j%%%%%%%%%%J%%%%%%%%%%%%%%%j%%%%
$$ 1 1 1 1 1 1 1 1 1 1 1 1 1 1 1 1 1 1 0 0 1 1 1 1 1 0 1 1 1 1 1 1 1 1 1 1 1 1 1 1 0 0 0 0 0 0 0 0 0 0 0 1 1 1 1 1 1 1 1 1 1 1 1 1 1 1 1 0 0 0 0 0
-379@%%%%J%%%%%%%%%%%%%%%%%%%%%%%%%%%%%%%%%%%%%%%%%%%%%%%%%%%%%%%%%%%%%%%%%%
$$ 0 0 0 0 0 1 1 1 1 1 1 1 1 1 1 1 1 1 1 1 1 1 1 1 1 1 1 1 1 1 1 1 1 1 1 1 1 1 1 1 1 1 1 1 1 1 1 1 1 1 1 1 1 1 1 1 1 1 1 1 1 1 1 1 1 1 1 1 1 1 1 1
-385A%%%%j%%%%%%%J%%%%%%%%%%j%%%%%%%%%J%%%%%%%%%%%%%%%%%%%%%%%%%%%%j%%%J%%%%
$$ 1 1 1 1 1 0 0 0 0 0 0 0 0 1 1 1 1 1 1 1 1 1 1 1 0 0 0 0 0 0 0 0 0 0 1 1 1 1 1 1 1 1 1 1 1 1 1 1 1 1 1 1 1 1 1 1 1 1 1 1 1 1 1 0 0 0 0 1 1 1 1 1
-392A%jJ%%%%%%%%%%jJ%%%%%%%%%%%%%%%%%%%%%%j%%%%%%%%J%%%%%%%%%%%%%%%%%%%%j%%J
$$ 1 1 0 1 1 1 1 1 1 1 1 1 1 1 0 1 1 1 1 1 1 1 1 1 1 1 1 1 1 1 1 1 1 1 1 1 1 1 0 0 0 0 0 0 0 0 0 1 1 1 1 1 1 1 1 1 1 1 1 1 1 1 1 1 1 1 1 1 0 0 0 1
-398Aj%%%%Jj%%%%%%%%J%%%%%%%%%%%%%%%%%%%%%%%%%%%%%%%%%%%%%Jj%%%%%%%%%%%%%%%%
$$ 1 0 0 0 0 0 1 0 0 0 0 0 0 0 0 0 1 1 1 1 1 1 1 1 1 1 1 1 1 1 1 1 1 1 1 1 1 1 1 1 1 1 1 1 1 1 1 1 1 1 1 1 1 1 2 1 1 1 1 1 1 1 1 1 1 1 1 1 1 1 1 1
-405A%%%%%%%%%%j%J%%%%%%%%%%%%%%%%%%%%%%%%%%%%%%%%%j%%%%%%%%%%%%%%%%%J%%%%%%
$$ 1 1 1 1 1 1 1 1 1 1 1 0 0 1 1 1 1 1 1 1 1 1 1 1 1 1 1 1 1 1 1 1 1 1 1 1 1 1 1 1 1 1 1 1 1 1 1 0 0 0 0 0 0 0 0 0 0 0 0 0 0 0 0 0 0 1 1 1 1 1 1 1
-411A%%%%%%%%%%%%%%%%%%%%%j%J%%%%%%%%%%%%%%%%%%%%%j%%%%%%%J%%%%%%%%%%%%%%%%%
$$ 1 1 1 1 1 1 1 1 1 1 1 1 1 1 1 1 1 1 1 1 1 1 0 0 1 1 1 1 1 1 1 1 1 1 1 1 1 1 1 1 1 1 1 1 1 1 0 0 0 0 0 0 0 0 1 1 1 1 1 1 1 1 1 1 1 1 1 1 1 1 1 1
-418A%%%%%%%%%j%%J%%%%%%%%%%%%%%%%%%%%%%%%Jj%%%%%%%J%%%j%%%%%%j%%%J%%%%j%%%%
$$ 1 1 1 1 1 1 1 1 1 1 0 0 0 1 1 1 1 1 1 1 1 1 1 1 1 1 1 1 1 1 1 1 1 1 1 1 1 1 2 1 1 1 1 1 1 1 1 2 2 2 2 1 1 1 1 1 1 1 0 0 0 0 1 1 1 1 1 0 0 0 0 0
-424@%J%%%%%%%%%%%%%%%%%%%%%%%%%%%%%%Jj%%%%%%%%jJ%%%%%%%%%%%%%%j%%J%%%%%%%%%
$$ 0 0 1 1 1 1 1 1 1 1 1 1 1 1 1 1 1 1 1 1 1 1 1 1 1 1 1 1 1 1 1 1 1 2 1 1 1 1 1 1 1 1 1 0 1 1 1 1 1 1 1 1 1 1 1 1 1 1 1 0 0 0 1 1 1 1 1 1 1 1 1 1
-431A%%%%%%%%%%%%%%%%%Jj%%%%%%%%%%j%%%J%%%%%%%%%%%%%%%%%%%%%%%%%%%%%%%%%%%%%
$$ 1 1 1 1 1 1 1 1 1 1 1 1 1 1 1 1 1 1 2 1 1 1 1 1 1 1 1 1 1 1 0 0 0 0 1 1 1 1 1 1 1 1 1 1 1 1 1 1 1 1 1 1 1 1 1 1 1 1 1 1 1 1 1 1 1 1 1 1 1 1 1 1
-437A%%j%J%%%j%%%%J%%%%%%%%%%%%%%%%%%%%%%%j%%%%J%%j%%%%%%%%%%%%%%J%%%%%%%%%j
$$ 1 1 1 0 0 1 1 1 1 0 0 0 0 0 1 1 1 1 1 1 1 1 1 1 1 1 1 1 1 1 1 1 1 1 1 1 1 1 0 0 0 0 0 1 1 1 0 0 0 0 0 0 0 0 0 0 0 0 0 0 0 1 1 1 1 1 1 1 1 1 1 0
-444@%%%%J%%%%%%%%jJ%%%%%%%%j%%%%%J%%%%%%%%%%%%%%%%%%j%J%%%%j%J%%%%%j%%%%%%%
$$ 0 0 0 0 0 1 1 1 1 1 1 1 1 1 0 1 1 1 1 1 1 1 1 1 0 0 0 0 0 0 1 1 1 1 1 1 1 1 1 1 1 1 1 1 1 1 1 1 1 0 0 1 1 1 1 1 0 0 1 1 1 1 1 1 0 0 0 0 0 0 0 0
-450@%%J%%%%j%%J%%%%%%%%%%%%%%%J%j%%%%%%%%%%%%%%%%%%%%%%%%%%%%%%%%%%%%%%%%%%
$$ 0 0 0 1 1 1 1 1 0 0 0 1 1 1 1 1 1 1 1 1 1 1 1 1 1 1 1 2 2 1 1 1 1 1 1 1 1 1 1 1 1 1 1 1 1 1 1 1 1 1 1 1 1 1 1 1 1 1 1 1 1 1 1 1 1 1 1 1 1 1 1 1
-457A%%%%%%%%%%%%%%%%%%%%%%%%%%%%%%%jJ%%%%%%%%%%%%%%%j%J%%%%%%%%%%%%%%%%%%%%
$$ 1 1 1 1 1 1 1 1 1 1 1 1 1 1 1 1 1 1 1 1 1 1 1 1 1 1 1 1 1 1 1 1 0 1 1 1 1 1 1 1 1 1 1 1 1 1 1 1 1 0 0 1 1 1 1 1 1 1 1 1 1 1 1 1 1 1 1 1 1 1 1 1
-463A%%%%%%%Jj%%%%%j%%%%%%%J%%%jJ%%%%%%%%%%%%%%%%%%%%%%%%%%%%%%%%%%%%%%%%%%%
$$ 1 1 1 1 1 1 1 1 2 1 1 1 1 1 1 0 0 0 0 0 0 0 0 1 1 1 1 0 1 1 1 1 1 1 1 1 1 1 1 1 1 1 1 1 1 1 1 1 1 1 1 1 1 1 1 1 1 1 1 1 1 1 1 1 1 1 1 1 1 1 1 1
-470A%j%%%J%%%%%%%%%%%%%j%J%%%%j%%%%%%%%%%%%%%%%%J%%%j%J%%%%%%%%%%%%%%%%%%%%
$$ 1 1 0 0 0 0 1 1 1 1 1 1 1 1 1 1 1 1 1 1 0 0 1 1 1 1 1 0 0 0 0 0 0 0 0 0 0 0 0 0 0 0 0 0 0 1 1 1 1 0 0 1 1 1 1 1 1 1 1 1 1 1 1 1 1 1 1 1 1 1 1 1
-476AjJ%%j%%%%%%%%%%J%%%j%J%%%%%%%%%%%%%%%%j%%J%%%%%%%%%%%%%%%%%%%%%%%%%%%%%
$$ 1 0 1 1 1 0 0 0 0 0 0 0 0 0 0 0 1 1 1 1 0 0 1 1 1 1 1 1 1 1 1 1 1 1 1 1 1 1 1 0 0 0 1 1 1 1 1 1 1 1 1 1 1 1 1 1 1 1 1 1 1 1 1 1 1 1 1 1 1 1 1 1
-483Aj%%J%%%%%%%%%%%%%%%%%%%%%%%%%%%%%%%%%jJ%%%%%%%%%%%%%%%%%%%%jJ%%%%%%%%%%
$$ 1 0 0 0 1 1 1 1 1 1 1 1 1 1 1 1 1 1 1 1 1 1 1 1 1 1 1 1 1 1 1 1 1 1 1 1 1 1 0 1 1 1 1 1 1 1 1 1 1 1 1 1 1 1 1 1 1 1 1 1 0 1 1 1 1 1 1 1 1 1 1 1
-489A%%%%%%%%%%%%%%%%%%%%%%%%%%%j%%%%%%J%%%%%%%%%%%%%%%%%%%%%%%%%%%%%%%%%j%%
$$ 1 1 1 1 1 1 1 1 1 1 1 1 1 1 1 1 1 1 1 1 1 1 1 1 1 1 1 1 0 0 0 0 0 0 0 1 1 1 1 1 1 1 1 1 1 1 1 1 1 1 1 1 1 1 1 1 1 1 1 1 1 1 1 1 1 1 1 1 1 0 0 0
-496@J%%j%J%%%%%%%%%j%J%%%%%%%%%%%%j%%J%%%%%%j%%%%%%%J%%%%%j%J%%%%%%%%%%%%%%
$$ 0 1 1 1 0 0 1 1 1 1 1 1 1 1 1 1 0 0 1 1 1 1 1 1 1 1 1 1 1 1 1 0 0 0 1 1 1 1 1 1 1 0 0 0 0 0 0 0 0 1 1 1 1 1 1 0 0 1 1 1 1 1 1 1 1 1 1 1 1 1 1 1
-502A%%%%%jJ%%%%%Jj%%%%%%%%%%%%%%%%%%%%%%%%%%%%%%%%%%%%%%%%%J%%j%%%%%j%JjJ%%
$$ 1 1 1 1 1 1 0 1 1 1 1 1 1 2 1 1 1 1 1 1 1 1 1 1 1 1 1 1 1 1 1 1 1 1 1 1 1 1 1 1 1 1 1 1 1 1 1 1 1 1 1 1 1 1 1 1 2 2 2 1 1 1 1 1 1 0 0 1 0 1 1 1
-509A%%%%%j%%%%%%%%%%%%J%%%%%%%%%%%%%%%%%%%%%%%%%%%%%j%%%J%%%%%%%%%%%%%%%%%%
$$ 1 1 1 1 1 1 0 0 0 0 0 0 0 0 0 0 0 0 0 1 1 1 1 1 1 1 1 1 1 1 1 1 1 1 1 1 1 1 1 1 1 1 1 1 1 1 1 1 1 0 0 0 0 1 1 1 1 1 1 1 1 1 1 1 1 1 1 1 1 1 1 1
-515A%%%%%%%%%%%%%j%%%%%%%%%%%J%%%%%%%%%%%j%%%%%%%J%%%%%%%%%%%%%j%%%%J%%%%%%
$$ 1 1 1 1 1 1 1 1 1 1 1 1 1 1 0 0 0 0 0 0 0 0 0 0 0 0 1 1 1 1 1 1 1 1 1 1 1 1 0 0 0 0 0 0 0 0 1 1 1 1 1 1 1 1 1 1 1 1 1 1 0 0 0 0 0 1 1 1 1 1 1 1
-522A%%%%%j%J%%%%%%%%%%%%%%%%%%%jJ%%%%%%%%j%%%%%%%%J%%%%%%%%%%%%%%%%%%%%%%j%
$$ 1 1 1 1 1 1 0 0 1 1 1 1 1 1 1 1 1 1 1 1 1 1 1 1 1 1 1 1 0 1 1 1 1 1 1 1 1 1 0 0 0 0 0 0 0 0 0 1 1 1 1 1 1 1 1 1 1 1 1 1 1 1 1 1 1 1 1 1 1 1 0 0
-528@J%%%%%%%%%%%Jj%%%%%%j%%J%j%%%J%%%%j%%%%%%%J%%%%%%%%%%%%%%%%j%J%%%%%%%%%
$$ 0 1 1 1 1 1 1 1 1 1 1 1 1 2 1 1 1 1 1 1 1 0 0 0 1 1 0 0 0 0 1 1 1 1 1 0 0 0 0 0 0 0 0 1 1 1 1 1 1 1 1 1 1 1 1 1 1 1 1 1 0 0 1 1 1 1 1 1 1 1 1 1
-535A%%%%%%%%%jJ%%%%%%%j%%%%%%%%%%%%%J%%%%%%%%%%%%%%%%%%%%%%%%%%%%%%%%%%%%%%
$$ 1 1 1 1 1 1 1 1 1 1 0 1 1 1 1 1 1 1 1 0 0 0 0 0 0 0 0 0 0 0 0 0 0 1 1 1 1 1 1 1 1 1 1 1 1 1 1 1 1 1 1 1 1 1 1 1 1 1 1 1 1 1 1 1 1 1 1 1 1 1 1 1
-541A%j%%%%%%J%%%%j%J%%%%%j%%%%Jj%%%%%J%%%%%%%j%%J%%%%%%%%%%%%%%%%%%%j%%%%%%
$$ 1 1 0 0 0 0 0 0 0 1 1 1 1 1 0 0 1 1 1 1 1 1 0 0 0 0 0 1 0 0 0 0 0 0 1 1 1 1 1 1 1 1 0 0 0 1 1 1 1 1 1 1 1 1 1 1 1 1 1 1 1 1 1 1 1 0 0 0 0 0 0 0
-548@%%J%j%%%%%J%%%%%%%%%%%%%%%%%%%%%%%%%%%%%%%%%%%%%%%%jJ%%%%%%%j%%%%%%%%J%
$$ 0 0 0 1 1 0 0 0 0 0 0 1 1 1 1 1 1 1 1 1 1 1 1 1 1 1 1 1 1 1 1 1 1 1 1 1 1 1 1 1 1 1 1 1 1 1 1 1 1 1 1 1 0 1 1 1 1 1 1 1 1 0 0 0 0 0 0 0 0 0 1 1
-554A%%%%%%%%%%%%%j%%%%%%J%%%%%%%%%%%%%%%%%%%%%%%%%%%%%%%%%%%%%%%%%%%%%%%%%%
$$ 1 1 1 1 1 1 1 1 1 1 1 1 1 1 0 0 0 0 0 0 0 1 1 1 1 1 1 1 1 1 1 1 1 1 1 1 1 1 1 1 1 1 1 1 1 1 1 1 1 1 1 1 1 1 1 1 1 1 1 1 1 1 1 1 1 1 1 1 1 1 1 1
-561A%%%%%%%%%jJ%%%%%%%%%j%J%%%%%%%j%J%%%%%%%%%%j%%%%J%%%%%%%%%%%%%%%%%%%%%%
$$ 1 1 1 1 1 1 1 1 1 1 0 1 1 1 1 1 1 1 1 1 1 0 0 1 1 1 1 1 1 1 1 0 0 1 1 1 1 1 1 1 1 1 1 1 0 0 0 0 0 1 1 1 1 1 1 1 1 1 1 1 1 1 1 1 1 1 1 1 1 1 1 1
-568A%%%%%%%%j%%%%%%%J%%%%%%%%%%%%%%%%j%%%%%%%%%%J%%%%%%%%%%%%j%J%%%%%%%%%%j
$$ 1 1 1 1 1 1 1 1 1 0 0 0 0 0 0 0 0 1 1 1 1 1 1 1 1 1 1 1 1 1 1 1 1 1 0 0 0 0 0 0 0 0 0 0 0 1 1 1 1 1 1 1 1 1 1 1 1 1 0 0 1 1 1 1 1 1 1 1 1 1 1 0
-574@J%%%%%%%j%J%%%%%%%%%%%%%%%%%%%%%%%j%%%%%%%%%%%%%%%%%%%%%%%%%%%%%J%%%%j%
$$ 0 1 1 1 1 1 1 1 1 0 0 1 1 1 1 1 1 1 1 1 1 1 1 1 1 1 1 1 1 1 1 1 1 1 1 0 0 0 0 0 0 0 0 0 0 0 0 0 0 0 0 0 0 0 0 0 0 0 0 0 0 0 0 0 0 1 1 1 1 1 0 0
-581@%J%%j%%%%%%%%%j%J%%%%%%%%%%J%%%%%%%%%%%%%%%%%%%%%%j%%%%J%%j%%%%%%%%%%%%
$$ 0 0 1 1 1 0 0 0 0 0 0 0 0 0 0 -1 -1 0 0 0 0 0 0 0 0 0 0 0 1 1 1 1 1 1 1 1 1 1 1 1 1 1 1 1 1 1 1 1 1 1 1 0 0 0 0 0 1 1 1 0 0 0 0 0 0 0 0 0 0 0 0 0
-587@%J%%%%%%%%%%%jJ%j%%J%%%%%%%%%%%%%%%%%%%%%%%%j%%J%%%%%%%%%%%%%%%%%%%%%%%
$$ 0 0 1 1 1 1 1 1 1 1 1 1 1 1 0 1 1 0 0 0 1 1 1 1 1 1 1 1 1 1 1 1 1 1 1 1 1 1 1 1 1 1 1 1 1 0 0 0 1 1 1 1 1 1 1 1 1 1 1 1 1 1 1 1 1 1 1 1 1 1 1 1
-594A%%j%%%%J%%%%%%%%%%%%%%%%j%J%%%%%%%%%j%%%%%%%%%%%%%%J%%%%%%%%%%%%%%j%%J%
$$ 1 1 1 0 0 0 0 0 1 1 1 1 1 1 1 1 1 1 1 1 1 1 1 1 1 0 0 1 1 1 1 1 1 1 1 1 1 0 0 0 0 0 0 0 0 0 0 0 0 0 0 0 1 1 1 1 1 1 1 1 1 1 1 1 1 1 1 0 0 0 1 1
-600A%%%j%%%%%%%%J%%%j%J%%j%J%%%%%%%%%%%%%%%%%%j%%%%%%%%%J%%%%%%%%j%%%%%J%%%
$$ 1 1 1 1 0 0 0 0 0 0 0 0 0 1 1 1 1 0 0 1 1 1 0 0 1 1 1 1 1 1 1 1 1 1 1 1 1 1 1 1 1 1 1 0 0 0 0 0 0 0 0 0 0 1 1 1 1 1 1 1 1 1 0 0 0 0 0 0 1 1 1 1
-607A%%%%%%%%%%%%%%%%%%j%%%%%%%%J%%%%%%%%%j%%%%%%%%%%%%%%%%%%%%%%%%%J%j%%%%%
$$ 1 1 1 1 1 1 1 1 1 1 1 1 1 1 1 1 1 1 1 0 0 0 0 0 0 0 0 0 1 1 1 1 1 1 1 1 1 1 0 0 0 0 0 0 0 0 0 0 0 0 0 0 0 0 0 0 0 0 0 0 0 0 0 0 1 1 0 0 0 0 0 0
-613@%%%%J%%j%%%J%%%%j%%%%%J%%%%%%%%%%%%%%%%%%%%%%%%%%%%%%%%jJ%%%%J%%j%%%%%%
$$ 0 0 0 0 0 1 1 1 0 0 0 0 1 1 1 1 1 0 0 0 0 0 0 1 1 1 1 1 1 1 1 1 1 1 1 1 1 1 1 1 1 1 1 1 1 1 1 1 1 1 1 1 1 1 1 1 0 1 1 1 1 1 2 2 2 1 1 1 1 1 1 1
-620A%%%%%%%%%%%%jJ%%%%%%%%%%%%%%%j%%J%%%%j%%J%%j%%%J%%%%%%%%%%%%%%%j%%%Jj%J
$$ 1 1 1 1 1 1 1 1 1 1 1 1 1 0 1 1 1 1 1 1 1 1 1 1 1 1 1 1 1 1 0 0 0 1 1 1 1 1 0 0 0 1 1 1 0 0 0 0 1 1 1 1 1 1 1 1 1 1 1 1 1 1 1 1 0 0 0 0 1 0 0 1
-626A%%%%%%%%%%jJ%%%%%%%%%%%%j%%%%%%%%%J%%%%%%j%%%J%j%%%%%%J%%%j%%%%%%%%%%%%
$$ 1 1 1 1 1 1 1 1 1 1 1 0 1 1 1 1 1 1 1 1 1 1 1 1 1 0 0 0 0 0 0 0 0 0 0 1 1 1 1 1 1 1 0 0 0 0 1 1 0 0 0 0 0 0 0 1 1 1 1 0 0 0 0 0 0 0 0 0 0 0 0 0
-633@%%%J%%%%%J%%j%%%%%%%%%%%%%%%%%%%%%%%%%%%%%%%%%%%%%%%%j%%%J%%%j%%%J%%%%%
$$ 0 0 0 0 1 1 1 1 1 1 2 2 2 1 1 1 1 1 1 1 1 1 1 1 1 1 1 1 1 1 1 1 1 1 1 1 1 1 1 1 1 1 1 1 1 1 1 1 1 1 1 1 1 1 0 0 0 0 1 1 1 1 0 0 0 0 1 1 1 1 1 1
-639A%%%%%%%%%%%%%%%%%%%%%%j%%%%%J%%%j%J%%%%%%%%%%%%%%%j%%%%J%%%%%j%%%%%%%%%
$$ 1 1 1 1 1 1 1 1 1 1 1 1 1 1 1 1 1 1 1 1 1 1 1 0 0 0 0 0 0 1 1 1 1 0 0 1 1 1 1 1 1 1 1 1 1 1 1 1 1 1 1 0 0 0 0 0 1 1 1 1 1 1 0 0 0 0 0 0 0 0 0 0
-646@%%J%%%%%%%%%%%%%%%j%%%%%J%%%%%%%%%%%%j%%%%%%J%%%%%%%j%%%%J%%%j%%%%Jj%%J
$$ 0 0 0 1 1 1 1 1 1 1 1 1 1 1 1 1 1 1 1 0 0 0 0 0 0 1 1 1 1 1 1 1 1 1 1 1 1 1 0 0 0 0 0 0 0 1 1 1 1 1 1 1 1 0 0 0 0 0 1 1 1 1 0 0 0 0 0 1 0 0 0 1
-652A%%%%%%%%j%%%%%%%%%%%%J%%%%%%%%%%%%%%%j%%%%J%%%%j%%%%%%%%%%J%%%%%%%%%%%%
$$ 1 1 1 1 1 1 1 1 1 0 0 0 0 0 0 0 0 0 0 0 0 0 1 1 1 1 1 1 1 1 1 1 1 1 1 1 1 1 0 0 0 0 0 1 1 1 1 1 0 0 0 0 0 0 0 0 0 0 0 1 1 1 1 1 1 1 1 1 1 1 1 1
-659A%%%%%%%jJ%%%%j%%%%%%%%%%%%%%J%%%%%%%%%%%%%%%%%%%%%%%%%%%%%%%%%%%%%%%%%%
$$ 1 1 1 1 1 1 1 1 0 1 1 1 1 1 0 0 0 0 0 0 0 0 0 0 0 0 0 0 0 1 1 1 1 1 1 1 1 1 1 1 1 1 1 1 1 1 1 1 1 1 1 1 1 1 1 1 1 1 1 1 1 1 1 1 1 1 1 1 1 1 1 1
-665A%%%%jJ%%%%%%%%%%j%J%%%%%%%%%%%%%%%%%%%%%%%%j%%%%%%%%%%J%j%%%%%%%%%%%%%%
$$ 1 1 1 1 1 0 1 1 1 1 1 1 1 1 1 1 1 0 0 1 1 1 1 1 1 1 1 1 1 1 1 1 1 1 1 1 1 1 1 1 1 1 1 1 0 0 0 0 0 0 0 0 0 0 0 1 1 0 0 0 0 0 0 0 0 0 0 0 0 0 0 0
-672@Jj%J%j%%%%J%%%%%%%%%%%%%%%j%%%%J%%%%%j%%%%%%%%%%%%%%%%%%%J%%%%%%%%%j%J%
$$ 0 1 0 0 1 1 0 0 0 0 0 1 1 1 1 1 1 1 1 1 1 1 1 1 1 1 1 0 0 0 0 0 1 1 1 1 1 1 0 0 0 0 0 0 0 0 0 0 0 0 0 0 0 0 0 0 0 0 1 1 1 1 1 1 1 1 1 1 0 0 1 1
-678A%%%%%jJ%%%%%%%%%%%%%%%%%%%%%%%%%%%%%%%%%%%%%%%%Jj%%%%%%%%%%%%%%%%%%%%%%
$$ 1 1 1 1 1 1 0 1 1 1 1 1 1 1 1 1 1 1 1 1 1 1 1 1 1 1 1 1 1 1 1 1 1 1 1 1 1 1 1 1 1 1 1 1 1 1 1 1 2 1 1 1 1 1 1 1 1 1 1 1 1 1 1 1 1 1 1 1 1 1 1 1
-685A%%%%%%%%%%%%%%%%%%%%%%%%%%%%%%%%%%j%%%%%%J%%%%%%%%%%%%jJ%%%%%%%%%%%%%%%
$$ 1 1 1 1 1 1 1 1 1 1 1 1 1 1 1 1 1 1 1 1 1 1 1 1 1 1 1 1 1 1 1 1 1 1 1 0 0 0 0 0 0 0 1 1 1 1 1 1 1 1 1 1 1 1 1 0 1 1 1 1 1 1 1 1 1 1 1 1 1 1 1 1
-691A%%%%%%%%%%%%%%%%%%%%%%%%%%%%%%%%%j%J%%%%%%%%%%%%%%%%%%%%%%%%%%%%%%%%%%%
$$ 1 1 1 1 1 1 1 1 1 1 1 1 1 1 1 1 1 1 1 1 1 1 1 1 1 1 1 1 1 1 1 1 1 1 0 0 1 1 1 1 1 1 1 1 1 1 1 1 1 1 1 1 1 1 1 1 1 1 1 1 1 1 1 1 1 1 1 1 1 1 1 1
-698A%%%%%j%%J%%%%%%%%%%%%%%%%%%%%j%%J%j%%%%%%%%%%J%%%%%%j%%J%%%%%%%%%j%%%Jj
$$ 1 1 1 1 1 1 0 0 0 1 1 1 1 1 1 1 1 1 1 1 1 1 1 1 1 1 1 1 1 1 0 0 0 1 1 0 0 0 0 0 0 0 0 0 0 0 1 1 1 1 1 1 1 0 0 0 1 1 1 1 1 1 1 1 1 1 0 0 0 0 1 0
-704@%%%%%%%%J%%%%%%%%%%%j%J%%%%%%%%%%%%%%%%%%%%%%%%%%%%%%%%%%%%%%%%%jJ%%%%%
$$ 0 0 0 0 0 0 0 0 0 1 1 1 1 1 1 1 1 1 1 1 1 0 0 1 1 1 1 1 1 1 1 1 1 1 1 1 1 1 1 1 1 1 1 1 1 1 1 1 1 1 1 1 1 1 1 1 1 1 1 1 1 1 1 1 1 0 1 1 1 1 1 1
-711A%%%%%%j%%%%%%%%%Jj%%%%J%%%%%%%%j%%%J%%%%%%%%%%%%%%j%J%%%%%%%j%%%%%%%J%%
$$ 1 1 1 1 1 1 1 0 0 0 0 0 0 0 0 0 0 1 0 0 0 0 0 1 1 1 1 1 1 1 1 1 0 0 0 0 1 1 1 1 1 1 1 1 1 1 1 1 1 1 1 0 0 1 1 1 1 1 1 1 1 0 0 0 0 0 0 0 0 1 1 1
-717A%%%%%%%%%%%%%j%%J%%%%%%%%%%%%j%%J%%%%%%%%%j%%%%%%%%%%%%J%%%%%%%%%%%%%%%
$$ 1 1 1 1 1 1 1 1 1 1 1 1 1 1 0 0 0 1 1 1 1 1 1 1 1 1 1 1 1 1 0 0 0 1 1 1 1 1 1 1 1 1 1 0 0 0 0 0 0 0 0 0 0 0 0 0 1 1 1 1 1 1 1 1 1 1 1 1 1 1 1 1
-724A%%%%%%%j%%%J%%%%%%%%j%%J%%%%%%%%j%%%%%J%%%%%%%%%%%%%%%%%%%j%%%J%j%%%%%J
$$ 1 1 1 1 1 1 1 1 0 0 0 0 1 1 1 1 1 1 1 1 1 0 0 0 1 1 1 1 1 1 1 1 1 0 0 0 0 0 0 1 1 1 1 1 1 1 1 1 1 1 1 1 1 1 1 1 1 1 1 0 0 0 0 1 1 0 0 0 0 0 0 1
-730A%%%%%%%%%%%%%%%%%%%%j%%%%%%%%%%%%%%%%%%J%%%%%%%%%%%%%%%%%%%%%%%%%%j%%%%
$$ 1 1 1 1 1 1 1 1 1 1 1 1 1 1 1 1 1 1 1 1 1 0 0 0 0 0 0 0 0 0 0 0 0 0 0 0 0 0 0 0 1 1 1 1 1 1 1 1 1 1 1 1 1 1 1 1 1 1 1 1 1 1 1 1 1 1 1 0 0 0 0 0
-737@J%j%%%%%%%%%J%%j%%%%J%%%%%%%%%%%%%%%%%%%%%%%%%%%%%%%%%j%%%%%J%%%%%%%%%%
$$ 0 1 1 0 0 0 0 0 0 0 0 0 0 1 1 1 0 0 0 0 0 1 1 1 1 1 1 1 1 1 1 1 1 1 1 1 1 1 1 1 1 1 1 1 1 1 1 1 1 1 1 1 1 1 1 0 0 0 0 0 0 1 1 1 1 1 1 1 1 1 1 1
-743A%%%%%%%%%%%%%%%%%%%%%%%%%%%Jj%%%%%%%%%%%%%%%%%%%%%%%%%%%%%%%%%%%%j%J%%%
$$ 1 1 1 1 1 1 1 1 1 1 1 1 1 1 1 1 1 1 1 1 1 1 1 1 1 1 1 1 2 1 1 1 1 1 1 1 1 1 1 1 1 1 1 1 1 1 1 1 1 1 1 1 1 1 1 1 1 1 1 1 1 1 1 1 1 1 0 0 1 1 1 1
-750A%%%jJ%%%%%jJ%%j%%%%%J%%%%%%%%%%%%%%%%%%%%%%%%%%%%%%%%%%%%%%%j%%%%%%%%J%
$$ 1 1 1 1 0 1 1 1 1 1 1 0 1 1 1 0 0 0 0 0 0 1 1 1 1 1 1 1 1 1 1 1 1 1 1 1 1 1 1 1 1 1 1 1 1 1 1 1 1 1 1 1 1 1 1 1 1 1 1 1 1 0 0 0 0 0 0 0 0 0 1 1
-756A%%%j%%J%%%%%%j%%%%%%%%%J%%%%%%%%%%%%%%%%%j%%%%%%%%%%J%%%%%%%%%%%%%%%%j%
$$ 1 1 1 1 0 0 0 1 1 1 1 1 1 1 0 0 0 0 0 0 0 0 0 0 1 1 1 1 1 1 1 1 1 1 1 1 1 1 1 1 1 1 0 0 0 0 0 0 0 0 0 0 0 1 1 1 1 1 1 1 1 1 1 1 1 1 1 1 1 1 0 0
-763@%%%J%%%%%%j%%%%%%%%%%%J%%%%%%%%%%%%%%%%%%%jJ%%%%%%%%%%%%%%%%%%%%j%%%%%%
$$ 0 0 0 0 1 1 1 1 1 1 1 0 0 0 0 0 0 0 0 0 0 0 0 1 1 1 1 1 1 1 1 1 1 1 1 1 1 1 1 1 1 1 1 0 1 1 1 1 1 1 1 1 1 1 1 1 1 1 1 1 1 1 1 1 1 0 0 0 0 0 0 0
-769@J%%%%%%%%%%%%%%%%%%%%%%%%%%%%%%%%%j%%%J%%%%%%%%%%%%%%%j%%J%%%%%j%%%%%%%
$$ 0 1 1 1 1 1 1 1 1 1 1 1 1 1 1 1 1 1 1 1 1 1 1 1 1 1 1 1 1 1 1 1 1 1 1 0 0 0 0 1 1 1 1 1 1 1 1 1 1 1 1 1 1 1 1 0 0 0 1 1 1 1 1 1 0 0 0 0 0 0 0 0
-776@%%J%%%%j%J%%%%%j%%%%%%%%%%J%%%%%%%%j%%%%%%%%%%%%%J%%%%%%%%%%j%%%%%%%%%J
$$ 0 0 0 1 1 1 1 1 0 0 1 1 1 1 1 1 0 0 0 0 0 0 0 0 0 0 0 1 1 1 1 1 1 1 1 1 0 0 0 0 0 0 0 0 0 0 0 0 0 0 1 1 1 1 1 1 1 1 1 1 1 0 0 0 0 0 0 0 0 0 0 1
-782A%%%%j%%%%%J%%%%%%%%%%%%%%%%%%%%%%%j%%%J%%%%%%%%%%%%%%%%%%%%%%%%%%%%%%%j
$$ 1 1 1 1 1 0 0 0 0 0 0 1 1 1 1 1 1 1 1 1 1 1 1 1 1 1 1 1 1 1 1 1 1 1 1 0 0 0 0 1 1 1 1 1 1 1 1 1 1 1 1 1 1 1 1 1 1 1 1 1 1 1 1 1 1 1 1 1 1 1 1 0
-789@%%%%%%%J%%%j%%J%%%%%%%%%%%%%%%%%%%%%%%%%%j%%%%%J%%%%%%jJ%%%%j%%%%%%J%%%
$$ 0 0 0 0 0 0 0 0 1 1 1 1 0 0 0 1 1 1 1 1 1 1 1 1 1 1 1 1 1 1 1 1 1 1 1 1 1 1 1 1 1 1 0 0 0 0 0 0 1 1 1 1 1 1 1 0 1 1 1 1 1 0 0 0 0 0 0 0 1 1 1 1
-795A%%%%%%%%%%%%%%%%%%%%%%%%%%%%%%%%%%%%%%%%%%%%%j%J%%%j%%%%J%%%%%%%%%%%%%%
$$ 1 1 1 1 1 1 1 1 1 1 1 1 1 1 1 1 1 1 1 1 1 1 1 1 1 1 1 1 1 1 1 1 1 1 1 1 1 1 1 1 1 1 1 1 1 1 0 0 1 1 1 1 0 0 0 0 0 1 1 1 1 1 1 1 1 1 1 1 1 1 1 1
-802A%%%%%%%%%%%%%%%%%%%%%%%%%%%%jJ%%%%%%%%%%%%%%%%%%%%j%%%%%%%%J%%%%%%%%%%j
$$ 1 1 1 1 1 1 1 1 1 1 1 1 1 1 1 1 1 1 1 1 1 1 1 1 1 1 1 1 1 0 1 1 1 1 1 1 1 1 1 1 1 1 1 1 1 1 1 1 1 1 1 0 0 0 0 0 0 0 0 0 1 1 1 1 1 1 1 1 1 1 1 0
-808@%%%%%%%J%%%%%%j%%%%J%%%jJ%%%%%%%%%%%%%%J%%j%%%%%%%%%%%%%%%%%%%%%%%%%%%%
$$ 0 0 0 0 0 0 0 0 1 1 1 1 1 1 1 0 0 0 0 0 1 1 1 1 0 1 1 1 1 1 1 1 1 1 1 1 1 1 1 1 2 2 2 1 1 1 1 1 1 1 1 1 1 1 1 1 1 1 1 1 1 1 1 1 1 1 1 1 1 1 1 1
-815A%%%%%%%%%%%%%%%j%%J%%%j%%%%J%%%%%%%%%%%%%%%%%%j%%J%%%%%%j%%%%%J%%%%%%%%
$$ 1 1 1 1 1 1 1 1 1 1 1 1 1 1 1 1 0 0 0 1 1 1 1 0 0 0 0 0 1 1 1 1 1 1 1 1 1 1 1 1 1 1 1 1 1 1 1 0 0 0 1 1 1 1 1 1 1 0 0 0 0 0 0 1 1 1 1 1 1 1 1 1
-821A%j%%%%%%%%%%%%%%%J%%%j%%%%%%%%%%%%%%%%%%%%J%%%%%%%%%%%%%%%%j%%%J%%%%j%%
$$ 1 1 0 0 0 0 0 0 0 0 0 0 0 0 0 0 0 0 1 1 1 1 0 0 0 0 0 0 0 0 0 0 0 0 0 0 0 0 0 0 0 0 0 1 1 1 1 1 1 1 1 1 1 1 1 1 1 1 1 1 0 0 0 0 1 1 1 1 1 0 0 0
-828@%%%%%%%%%%%%%J%%%%%%j%%J%%%%%%%%%j%%%J%%%%%%%%%%%%%%%%%%%%%%%%%%%%%%%%%
$$ 0 0 0 0 0 0 0 0 0 0 0 0 0 0 1 1 1 1 1 1 1 0 0 0 1 1 1 1 1 1 1 1 1 1 0 0 0 0 1 1 1 1 1 1 1 1 1 1 1 1 1 1 1 1 1 1 1 1 1 1 1 1 1 1 1 1 1 1 1 1 1 1
-834A%%%%%%%%%%%%%%%%%%%j%%%%%%%J%%%j%J%%%%%%%%%%%j%%%%J%%jJ%%%%j%%%%%%%%%%%
$$ 1 1 1 1 1 1 1 1 1 1 1 1 1 1 1 1 1 1 1 1 0 0 0 0 0 0 0 0 1 1 1 1 0 0 1 1 1 1 1 1 1 1 1 1 1 1 0 0 0 0 0 1 1 1 0 1 1 1 1 1 0 0 0 0 0 0 0 0 0 0 0 0
-841@Jj%%%%%%J%j%J%%%j%%%%%%%%J%%%%%%%%%%j%%J%%%%%%%%%%jJ%%%%%%%%%%%j%%J%%%%
$$ 0 1 0 0 0 0 0 0 0 1 1 0 0 1 1 1 1 0 0 0 0 0 0 0 0 0 1 1 1 1 1 1 1 1 1 1 1 0 0 0 1 1 1 1 1 1 1 1 1 1 1 0 1 1 1 1 1 1 1 1 1 1 1 1 0 0 0 1 1 1 1 1
-847A%j%%%%%%%%%%%%%%%%J%j%%%J%%%%%%%%%%%%%%%%jJ%%%%%%%%%%%%j%J%%%%%jJ%%%%%%
$$ 1 1 0 0 0 0 0 0 0 0 0 0 0 0 0 0 0 0 0 1 1 0 0 0 0 1 1 1 1 1 1 1 1 1 1 1 1 1 1 1 1 1 0 1 1 1 1 1 1 1 1 1 1 1 1 1 0 0 1 1 1 1 1 1 0 1 1 1 1 1 1 1
-854A%%%%%%%%%%%%j%%%%%%%%%J%%%%%%%%%%%%%%%%%%%%%j%%%%%%J%%%%%%%%%%%%%%%%%%%
$$ 1 1 1 1 1 1 1 1 1 1 1 1 1 0 0 0 0 0 0 0 0 0 0 1 1 1 1 1 1 1 1 1 1 1 1 1 1 1 1 1 1 1 1 1 1 0 0 0 0 0 0 0 1 1 1 1 1 1 1 1 1 1 1 1 1 1 1 1 1 1 1 1
-861A%%%%%%%%%%j%%%%%%%%%%%%%%%%%%%%%J%%%%j%%%Jj%%%%%%%%%%%%%%J%j%%%%%%%%%%J
$$ 1 1 1 1 1 1 1 1 1 1 1 0 0 0 0 0 0 0 0 0 0 0 0 0 0 0 0 0 0 0 0 0 0 1 1 1 1 1 0 0 0 0 1 0 0 0 0 0 0 0 0 0 0 0 0 0 0 0 1 1 0 0 0 0 0 0 0 0 0 0 0 1
-867A%%%%%%%%%%%%%%%%%%%%%%j%%%%%%%%%%%J%%%%%%%%%%%%%%j%%%J%j%%%%J%%%%%%%j%J
$$ 1 1 1 1 1 1 1 1 1 1 1 1 1 1 1 1 1 1 1 1 1 1 1 0 0 0 0 0 0 0 0 0 0 0 0 1 1 1 1 1 1 1 1 1 1 1 1 1 1 1 0 0 0 0 1 1 0 0 0 0 0 1 1 1 1 1 1 1 1 0 0 1
-874A%%%%%%%%%%%%%%%%%%%%%%%%%j%%%%%%%%%%%%%%%%%%J%%%%%j%%%%%%%%%%%%%J%%%%%%
$$ 1 1 1 1 1 1 1 1 1 1 1 1 1 1 1 1 1 1 1 1 1 1 1 1 1 1 0 0 0 0 0 0 0 0 0 0 0 0 0 0 0 0 0 0 0 1 1 1 1 1 1 0 0 0 0 0 0 0 0 0 0 0 0 0 0 1 1 1 1 1 1 1
-880A%%%%%%%%%%%%%%%%%%%%%%%%%%%%%%%%%%%%%%%%%%%%%%%%%%%%%%%%%%%%%%j%J%%%%%%
$$ 1 1 1 1 1 1 1 1 1 1 1 1 1 1 1 1 1 1 1 1 1 1 1 1 1 1 1 1 1 1 1 1 1 1 1 1 1 1 1 1 1 1 1 1 1 1 1 1 1 1 1 1 1 1 1 1 1 1 1 1 1 1 1 0 0 1 1 1 1 1 1 1
-887A%%%%%%j%J%%%%%%%%%%%%%%%%%%%%j%%%%%%%J%%j%%%J%%%%%%%%j%%J%%j%J%%%%%%%%%
$$ 1 1 1 1 1 1 1 0 0 1 1 1 1 1 1 1 1 1 1 1 1 1 1 1 1 1 1 1 1 1 0 0 0 0 0 0 0 0 1 1 1 0 0 0 0 1 1 1 1 1 1 1 1 1 0 0 0 1 1 1 0 0 1 1 1 1 1 1 1 1 1 1
-893A%%%j%%%%%%J%%%%%%%%%%%%j%%%%%%%%J%%%%%%%%%%%%%%%%%%%%%%%%%%%jJ%%%%%%%%%
$$ 1 1 1 1 0 0 0 0 0 0 0 1 1 1 1 1 1 1 1 1 1 1 1 1 0 0 0 0 0 0 0 0 0 1 1 1 1 1 1 1 1 1 1 1 1 1 1 1 1 1 1 1 1 1 1 1 1 1 1 1 1 0 1 1 1 1 1 1 1 1 1 1
-900A%%%%%%%%%%%%%%%%%%%%%%j%%%%%%Jj%%%Jj%%%%%%%%%%J%%j%%%J%%%j%%J%%%%%%%%%%
$$ 1 1 1 1 1 1 1 1 1 1 1 1 1 1 1 1 1 1 1 1 1 1 1 0 0 0 0 0 0 0 1 0 0 0 0 1 0 0 0 0 0 0 0 0 0 0 0 1 1 1 0 0 0 0 1 1 1 1 0 0 0 1 1 1 1 1 1 1 1 1 1 1
-906A%%%%%%%%%%%%%%%%%%%%%%%%%%%%%%%%%j%%%%%J%%j%%%%%%%%%J%%%%%%%%%%%%%%%%%%
$$ 1 1 1 1 1 1 1 1 1 1 1 1 1 1 1 1 1 1 1 1 1 1 1 1 1 1 1 1 1 1 1 1 1 1 0 0 0 0 0 0 1 1 1 0 0 0 0 0 0 0 0 0 0 1 1 1 1 1 1 1 1 1 1 1 1 1 1 1 1 1 1 1
-913Aj%%%%%%%%%J%%%%%%%%%%%%j%%%%%%%%%%%%%%%J%j%%%%%J%%j%%%%%%J%%%%j%%%%%%%%
$$ 1 0 0 0 0 0 0 0 0 0 0 1 1 1 1 1 1 1 1 1 1 1 1 1 0 0 0 0 0 0 0 0 0 0 0 0 0 0 0 0 1 1 0 0 0 0 0 0 1 1 1 0 0 0 0 0 0 0 1 1 1 1 1 0 0 0 0 0 0 0 0 0
-919@Jj%%%%%%%%J%%%%%j%%%%%J%j%%%J%%%%%%%%%%%j%%J%%%%%jJ%%%%%%%%%%%%%%%%%%%%
$$ 0 1 0 0 0 0 0 0 0 0 0 1 1 1 1 1 1 0 0 0 0 0 0 1 1 0 0 0 0 1 1 1 1 1 1 1 1 1 1 1 1 0 0 0 1 1 1 1 1 1 0 1 1 1 1 1 1 1 1 1 1 1 1 1 1 1 1 1 1 1 1 1
-926A%%%%%%%%j%%%%%J%%j%%%%%%%%%%%%%%%J%%%%%%%%%%j%%%%%%J%%%%%%%j%%%%%%%Jj%%
$$ 1 1 1 1 1 1 1 1 1 0 0 0 0 0 0 1 1 1 0 0 0 0 0 0 0 0 0 0 0 0 0 0 0 0 1 1 1 1 1 1 1 1 1 1 1 0 0 0 0 0 0 0 1 1 1 1 1 1 1 1 0 0 0 0 0 0 0 0 1 0 0 0
-932@%%%J%%%%%j%J%%%%%%j%%%%%%%%%%%%%%%%%%J%%%%%%%%%%%%%%%%%%%%jJ%%%%%%%%%%%
$$ 0 0 0 0 1 1 1 1 1 1 0 0 1 1 1 1 1 1 1 0 0 0 0 0 0 0 0 0 0 0 0 0 0 0 0 0 0 0 1 1 1 1 1 1 1 1 1 1 1 1 1 1 1 1 1 1 1 1 1 0 1 1 1 1 1 1 1 1 1 1 1 1
-939A%%%%%%%%%%%%%%%%%%%%%%%%%%%%%%%%%%%%%%%j%J%%%%%%%%%%%%%%%%%%%%%%%%%%%%%
$$ 1 1 1 1 1 1 1 1 1 1 1 1 1 1 1 1 1 1 1 1 1 1 1 1 1 1 1 1 1 1 1 1 1 1 1 1 1 1 1 1 0 0 1 1 1 1 1 1 1 1 1 1 1 1 1 1 1 1 1 1 1 1 1 1 1 1 1 1 1 1 1 1
-945A%%%%%%%%%%%%%%%j%%%%%%%J%%%%%%j%J%%%%%%%%%%j%%%%J%%j%%%%%%%J%%%%%%%%%%%
$$ 1 1 1 1 1 1 1 1 1 1 1 1 1 1 1 1 0 0 0 0 0 0 0 0 1 1 1 1 1 1 1 0 0 1 1 1 1 1 1 1 1 1 1 1 0 0 0 0 0 1 1 1 0 0 0 0 0 0 0 0 1 1 1 1 1 1 1 1 1 1 1 1
-952Aj%J%%j%%%J%%%%%%j%%%%%%J%%%%j%%%%%%%%%%%%%%%%%J%%%%j%%%J%%%j%%%%J%%%j%%
$$ 1 0 0 1 1 1 0 0 0 0 1 1 1 1 1 1 1 0 0 0 0 0 0 0 1 1 1 1 1 0 0 0 0 0 0 0 0 0 0 0 0 0 0 0 0 0 0 1 1 1 1 1 0 0 0 0 1 1 1 1 0 0 0 0 0 1 1 1 1 0 0 0
-958@%J%%%%j%%%%%%%%J%%%%%%%j%%%%%%%%%%%%%%%%%%%%%%%%J%%%%%j%%%%%%J%j%%%%J%%
$$ 0 0 1 1 1 1 1 0 0 0 0 0 0 0 0 0 1 1 1 1 1 1 1 1 0 0 0 0 0 0 0 0 0 0 0 0 0 0 0 0 0 0 0 0 0 0 0 0 0 1 1 1 1 1 1 0 0 0 0 0 0 0 1 1 0 0 0 0 0 1 1 1
-965A%j%%%%%%%%%%J%%%%%%%%%%%%%%%%%%%%%%j%%J%%%%j%%%%%%J%%%%%%%%%%%%j%%%%%%J
$$ 1 1 0 0 0 0 0 0 0 0 0 0 0 1 1 1 1 1 1 1 1 1 1 1 1 1 1 1 1 1 1 1 1 1 1 1 0 0 0 1 1 1 1 1 0 0 0 0 0 0 0 1 1 1 1 1 1 1 1 1 1 1 1 1 0 0 0 0 0 0 0 1
-971A%%%%%%%%%%j%%%%%%%%%%%%J%%%%%%%%%%%%j%%J%%%%%%%%%%%j%%J%%%j%%%%%J%%jJ%%
$$ 1 1 1 1 1 1 1 1 1 1 1 0 0 0 0 0 0 0 0 0 0 0 0 0 1 1 1 1 1 1 1 1 1 1 1 1 1 0 0 0 1 1 1 1 1 1 1 1 1 1 1 1 0 0 0 1 1 1 1 0 0 0 0 0 0 1 1 1 0 1 1 1
-978A%j%J%%%%%%j%%%%%%%J%j%%%%J%%%%%%j%%J%%%%%%%%%j%J%%%%%%%%%%%%%%%%%%%%%j%
$$ 1 1 0 0 1 1 1 1 1 1 1 0 0 0 0 0 0 0 0 1 1 0 0 0 0 0 1 1 1 1 1 1 1 0 0 0 1 1 1 1 1 1 1 1 1 1 0 0 1 1 1 1 1 1 1 1 1 1 1 1 1 1 1 1 1 1 1 1 1 1 0 0
-984@J%%%%%%%%%%%%%%%%%%%%%jJ%%%%%%%%%%%%%%%%%%%%%%%%%%%%%%%%%%%%%%%%%%%%%%%
$$ 0 1 1 1 1 1 1 1 1 1 1 1 1 1 1 1 1 1 1 1 1 1 1 0 1 1 1 1 1 1 1 1 1 1 1 1 1 1 1 1 1 1 1 1 1 1 1 1 1 1 1 1 1 1 1 1 1 1 1 1 1 1 1 1 1 1 1 1 1 1 1 1
-991A%%j%J%j%%%J%%%%%%%%%%%%%%%%%%j%%%%%J%%%%%%%%%%%%%%%%%%%%%j%%%%%%%%J%%%j
$$ 1 1 1 0 0 1 1 0 0 0 0 1 1 1 1 1 1 1 1 1 1 1 1 1 1 1 1 1 1 1 0 0 0 0 0 0 1 1 1 1 1 1 1 1 1 1 1 1 1 1 1 1 1 1 1 1 1 1 0 0 0 0 0 0 0 0 0 1 1 1 1 0
-997@%%%%%%%%%%%%%%%%%Jj%%%%%%%J%%%j%%%%J%%%%%%%%%%%%%%%%%%j%J%%%%%%%%%%%%%%
$$ 0 0 0 0 0 0 0 0 0 0 0 0 0 0 0 0 0 0 1 0 0 0 0 0 0 0 0 1 1 1 1 0 0 0 0 0 1 1 1 1 1 1 1 1 1 1 1 1 1 1 1 1 1 1 1 0 0 1 1 1 1 1 1 1 1 1 1 1 1 1 1 1
-1004A%%%%%%%j%%%J%%%%%%%%%%%%%%%%%jJ%%%%j%%%%J%%%%%%%%%%%%%%%%%%%j%%%%%%J%%
$$ 1 1 1 1 1 1 1 1 0 0 0 0 1 1 1 1 1 1 1 1 1 1 1 1 1 1 1 1 1 1 0 1 1 1 1 1 0 0 0 0 0 1 1 1 1 1 1 1 1 1 1 1 1 1 1 1 1 1 1 1 1 0 0 0 0 0 0 0 1 1 1
-1010A%%%%%%%%%%%%j%%%%%J%%%%%%%j%%%J%%%%%%%%%%j%%%%%%J%%%%%%%%%%j%%%%%J%%%%
$$ 1 1 1 1 1 1 1 1 1 1 1 1 1 0 0 0 0 0 0 1 1 1 1 1 1 1 1 0 0 0 0 1 1 1 1 1 1 1 1 1 1 1 0 0 0 0 0 0 0 1 1 1 1 1 1 1 1 1 1 1 0 0 0 0 0 0 1 1 1 1 1
-1017A%%j%%%J%%%%%%%%%%%j%%%J%%%%%j%%%%%%%J%%%%%%%%%%j%%%%%%%%%%J%%%%%%%%%%%
$$ 1 1 1 0 0 0 0 1 1 1 1 1 1 1 1 1 1 1 1 0 0 0 0 1 1 1 1 1 1 0 0 0 0 0 0 0 0 1 1 1 1 1 1 1 1 1 1 1 0 0 0 0 0 0 0 0 0 0 0 1 1 1 1 1 1 1 1 1 1 1 1
-1023A%%j%%%%%%%J%%j%%%%J%%%%%%%%j%%%%%%%%%%%%%%%%%%%%%%J%%%%%%%%%%jJ%%%%%%%
$$ 1 1 1 0 0 0 0 0 0 0 0 1 1 1 0 0 0 0 0 1 1 1 1 1 1 1 1 1 0 0 0 0 0 0 0 0 0 0 0 0 0 0 0 0 0 0 0 0 0 0 0 1 1 1 1 1 1 1 1 1 1 1 0 1 1 1 1 1 1 1 1
-1029A%%%j%%%J%%%j%%%%%%%%%%%%%J%j%%%J%%%%j%%%%%%%J%%%%%j%%%%%J%%%%%%%%%%%%%
$$ 1 1 1 1 0 0 0 0 1 1 1 1 0 0 0 0 0 0 0 0 0 0 0 0 0 0 1 1 0 0 0 0 1 1 1 1 1 0 0 0 0 0 0 0 0 1 1 1 1 1 1 0 0 0 0 0 0 1 1 1 1 1 1 1 1 1 1 1 1 1 1
-1036A%%%j%%%%%%%%%%%%%%J%%%%%%%%%%j%%%%%%%%%%J%%%%%j%%%%%J%%%%%%j%%J%%%%jJ%
$$ 1 1 1 1 0 0 0 0 0 0 0 0 0 0 0 0 0 0 0 1 1 1 1 1 1 1 1 1 1 1 0 0 0 0 0 0 0 0 0 0 0 1 1 1 1 1 1 0 0 0 0 0 0 1 1 1 1 1 1 1 0 0 0 1 1 1 1 1 0 1 1
-1042A%%%%%%%%%%%%%%j%%J%%%%%%%%%%%%%%%%%%%%%%%%%%%%%%%%%%%%%%%%j%%%J%%%%%%%
$$ 1 1 1 1 1 1 1 1 1 1 1 1 1 1 1 0 0 0 1 1 1 1 1 1 1 1 1 1 1 1 1 1 1 1 1 1 1 1 1 1 1 1 1 1 1 1 1 1 1 1 1 1 1 1 1 1 1 1 1 0 0 0 0 1 1 1 1 1 1 1 1
-1049A%%%%j%J%%%%%%%%j%%J%%%%%%%%jJ%j%%%%%J%%%%%%%%%j%%%%%%%%J%%%j%%%%%J%%%%
$$ 1 1 1 1 1 0 0 1 1 1 1 1 1 1 1 1 0 0 0 1 1 1 1 1 1 1 1 1 0 1 1 0 0 0 0 0 0 1 1 1 1 1 1 1 1 1 1 0 0 0 0 0 0 0 0 0 1 1 1 1 0 0 0 0 0 0 1 1 1 1 1
-1055A%%%%j%J%%%%%%%%%%%%%%j%%%%%%%%%%%%%%J%%%%%j%%%%J%%%%%%%%%%%%%%%%%%j%%J
$$ 1 1 1 1 1 0 0 1 1 1 1 1 1 1 1 1 1 1 1 1 1 1 0 0 0 0 0 0 0 0 0 0 0 0 0 0 0 1 1 1 1 1 1 0 0 0 0 0 1 1 1 1 1 1 1 1 1 1 1 1 1 1 1 1 1 1 1 0 0 0 1
-1062A%%%%%j%Jj%%%%%%%%%%%J%%j%%%%%%%Jj%J%%%%%j%%%%%%%%%%%%%%%%%%%%J%%%%%%%%
$$ 1 1 1 1 1 1 0 0 1 0 0 0 0 0 0 0 0 0 0 0 0 1 1 1 0 0 0 0 0 0 0 0 1 0 0 1 1 1 1 1 1 0 0 0 0 0 0 0 0 0 0 0 0 0 0 0 0 0 0 0 0 0 1 1 1 1 1 1 1 1 1
-1068A%%j%J%%%%%%%%%%%%%%%%%%%%%%%j%%%%%%%%%J%j%%%%%%J%%%%%%%%%%%%%%%%j%%J%%
$$ 1 1 1 0 0 1 1 1 1 1 1 1 1 1 1 1 1 1 1 1 1 1 1 1 1 1 1 1 1 0 0 0 0 0 0 0 0 0 0 1 1 0 0 0 0 0 0 0 1 1 1 1 1 1 1 1 1 1 1 1 1 1 1 1 1 0 0 0 1 1 1
-1074A%%j%%%%%%%J%%j%%%J%%%%%%%%%%j%%%%%%%%%%%J%%%%%%%%%j%J%%%%%%%%%%%%%%%%%
$$ 1 1 1 0 0 0 0 0 0 0 0 1 1 1 0 0 0 0 1 1 1 1 1 1 1 1 1 1 1 0 0 0 0 0 0 0 0 0 0 0 0 1 1 1 1 1 1 1 1 1 1 0 0 1 1 1 1 1 1 1 1 1 1 1 1 1 1 1 1 1 1
-1081A%%%%%%%%%%%%%%%%%%%%%%%%%%%%%%%%%%%%%%%%%j%%%J%%jJ%%jJ%%%%%%j%J%%%%j%%
$$ 1 1 1 1 1 1 1 1 1 1 1 1 1 1 1 1 1 1 1 1 1 1 1 1 1 1 1 1 1 1 1 1 1 1 1 1 1 1 1 1 1 1 0 0 0 0 1 1 1 0 1 1 1 0 1 1 1 1 1 1 1 0 0 1 1 1 1 1 0 0 0
-1087@%%%%%%%%%%%%%%%Jj%%%%%%%%%%%%%%%%%%%%%%%%J%%%%%%%%%%%%%%%j%%%%%%%%%%J%
$$ 0 0 0 0 0 0 0 0 0 0 0 0 0 0 0 0 1 0 0 0 0 0 0 0 0 0 0 0 0 0 0 0 0 0 0 0 0 0 0 0 0 0 1 1 1 1 1 1 1 1 1 1 1 1 1 1 1 1 0 0 0 0 0 0 0 0 0 0 0 1 1
-1094A%%%%%%%%%%%%%%%%j%%%%%%%%%%%%%J%%%%j%%%%%%J%%%%%%%%%%%%%%%%j%%%Jj%%%%%
$$ 1 1 1 1 1 1 1 1 1 1 1 1 1 1 1 1 1 0 0 0 0 0 0 0 0 0 0 0 0 0 0 1 1 1 1 1 0 0 0 0 0 0 0 1 1 1 1 1 1 1 1 1 1 1 1 1 1 1 1 1 0 0 0 0 1 0 0 0 0 0 0
-1100@%%J%%%%%%%%%%%%%%%%%%jJ%%j%J%%%%%%%%%%%%%%%%%%J%%j%%%%%j%J%%%%%%%%%%%j
$$ 0 0 0 1 1 1 1 1 1 1 1 1 1 1 1 1 1 1 1 1 1 1 0 1 1 1 0 0 1 1 1 1 1 1 1 1 1 1 1 1 1 1 1 1 1 1 1 2 2 2 1 1 1 1 1 1 0 0 1 1 1 1 1 1 1 1 1 1 1 1 0
-1106@%%%%%J%%%%%%j%%%%%%Jj%%%%%%%j%J%%%%%%J%%%%jJ%%%%%%%%%%%%%%%%%%%%%j%%%%
$$ 0 0 0 0 0 0 1 1 1 1 1 1 1 0 0 0 0 0 0 0 1 0 0 0 0 0 0 0 0 -1 -1 0 0 0 0 0 0 0 1 1 1 1 1 0 1 1 1 1 1 1 1 1 1 1 1 1 1 1 1 1 1 1 1 1 1 1 0 0 0 0 0
-1113@J%%j%%%%%%J%%%%%%j%J%%%%%%%%%%%%%%j%J%%%%%%%%%%%%%%%%%%%%%%%%%%%%%%%%%
$$ 0 1 1 1 0 0 0 0 0 0 0 1 1 1 1 1 1 1 0 0 1 1 1 1 1 1 1 1 1 1 1 1 1 1 1 0 0 1 1 1 1 1 1 1 1 1 1 1 1 1 1 1 1 1 1 1 1 1 1 1 1 1 1 1 1 1 1 1 1 1 1
-1119A%%%%%%%%%%%%%j%%%J%%%%%%%%%%%j%%%%%%%%%%%%%J%%j%%%%%%%%%%%%%%%%%%%%%%J
$$ 1 1 1 1 1 1 1 1 1 1 1 1 1 1 0 0 0 0 1 1 1 1 1 1 1 1 1 1 1 1 0 0 0 0 0 0 0 0 0 0 0 0 0 0 1 1 1 0 0 0 0 0 0 0 0 0 0 0 0 0 0 0 0 0 0 0 0 0 0 0 1
-1126A%%%%%%%%%%%j%%Jj%%%%%J%%%%%%%%%%%j%%%%%%%%%%J%%%%%j%J%%%j%%%%J%%%%j%%%
$$ 1 1 1 1 1 1 1 1 1 1 1 1 0 0 0 1 0 0 0 0 0 0 1 1 1 1 1 1 1 1 1 1 1 1 0 0 0 0 0 0 0 0 0 0 0 1 1 1 1 1 1 0 0 1 1 1 1 0 0 0 0 0 1 1 1 1 1 0 0 0 0
-1132@%%%%J%%%%j%%%%%%%%%%%%J%%%%%%%%%j%%%%%%%%J%%%%j%%%%%%%%%%%%%%%%J%%%%j%
$$ 0 0 0 0 0 1 1 1 1 1 0 0 0 0 0 0 0 0 0 0 0 0 0 1 1 1 1 1 1 1 1 1 1 0 0 0 0 0 0 0 0 0 1 1 1 1 1 0 0 0 0 0 0 0 0 0 0 0 0 0 0 0 0 0 1 1 1 1 1 0 0
-1139@%%%%%%%%%%%%%%%J%%%%%%j%%%%%J%%%%%%%%%%%%%%%%j%%%%%%J%%%%j%%%%Jj%J%%%%
$$ 0 0 0 0 0 0 0 0 0 0 0 0 0 0 0 0 1 1 1 1 1 1 1 0 0 0 0 0 0 1 1 1 1 1 1 1 1 1 1 1 1 1 1 1 1 1 0 0 0 0 0 0 0 1 1 1 1 1 0 0 0 0 0 1 0 0 1 1 1 1 1
-1145A%%%%%j%%J%j%%%%%J%%%%%%j%%%%%%J%%%%%%%j%%%%%%%%%%%%%%%%%%%%J%%%%j%%%%%
$$ 1 1 1 1 1 1 0 0 0 1 1 0 0 0 0 0 0 1 1 1 1 1 1 1 0 0 0 0 0 0 0 1 1 1 1 1 1 1 1 0 0 0 0 0 0 0 0 0 0 0 0 0 0 0 0 0 0 0 0 0 1 1 1 1 1 0 0 0 0 0 0
-1151@%%%%%%%%%%%%%%%%%%%%J%j%%%J%%j%%%%%%%%%%J%%%%%%%j%%%%%%%%%J%%%%%j%%%%%
$$ 0 0 0 0 0 0 0 0 0 0 0 0 0 0 0 0 0 0 0 0 0 1 1 0 0 0 0 1 1 1 0 0 0 0 0 0 0 0 0 0 0 1 1 1 1 1 1 1 1 0 0 0 0 0 0 0 0 0 0 1 1 1 1 1 1 0 0 0 0 0 0
-1158@%J%%%%%%%%%%%%%%%%jJ%%%%%%%%%%%%jJ%%%%%%%j%%%%%%%J%%%%%%%%j%%%%%%%%%J%
$$ 0 0 1 1 1 1 1 1 1 1 1 1 1 1 1 1 1 1 1 0 1 1 1 1 1 1 1 1 1 1 1 1 1 0 1 1 1 1 1 1 1 1 0 0 0 0 0 0 0 0 1 1 1 1 1 1 1 1 1 0 0 0 0 0 0 0 0 0 0 1 1
-1164A%%%%%%%%%%%%%%%%%%%%%%%%%%%%%%%%%%%%j%%%%%J%%%%%%%jJ%%%%%j%%%J%%%%%%%%
$$ 1 1 1 1 1 1 1 1 1 1 1 1 1 1 1 1 1 1 1 1 1 1 1 1 1 1 1 1 1 1 1 1 1 1 1 1 1 0 0 0 0 0 0 1 1 1 1 1 1 1 1 0 1 1 1 1 1 1 0 0 0 0 1 1 1 1 1 1 1 1 1
-1171A%%%%%j%%%%%%%%%%%%%%%J%%%%%%%%%%%jJ%%%%%%%%%%jJ%%%%%%%%%j%%%J%%j%%%%%%
$$ 1 1 1 1 1 1 0 0 0 0 0 0 0 0 0 0 0 0 0 0 0 0 1 1 1 1 1 1 1 1 1 1 1 1 0 1 1 1 1 1 1 1 1 1 1 1 0 1 1 1 1 1 1 1 1 1 1 0 0 0 0 1 1 1 0 0 0 0 0 0 0
-1177@%%%%%%%%%%%%%%%J%%%%%%%%%%%j%%%%%%%%%JjJ%%%%%%%%%%%%%%j%%%%%%%%J%j%%%%
$$ 0 0 0 0 0 0 0 0 0 0 0 0 0 0 0 0 1 1 1 1 1 1 1 1 1 1 1 1 0 0 0 0 0 0 0 0 0 0 1 0 1 1 1 1 1 1 1 1 1 1 1 1 1 1 1 0 0 0 0 0 0 0 0 0 1 1 0 0 0 0 0
-1183@J%%%%%%%j%J%%%%%%%j%%%%J%%%%%%%%%%%%j%%%%%%%%%%%%%%%%%%%%%%%J%%%%%%%%%
$$ 0 1 1 1 1 1 1 1 1 0 0 1 1 1 1 1 1 1 1 0 0 0 0 0 1 1 1 1 1 1 1 1 1 1 1 1 1 0 0 0 0 0 0 0 0 0 0 0 0 0 0 0 0 0 0 0 0 0 0 0 0 1 1 1 1 1 1 1 1 1 1
-1190A%%%j%%%%%%%%%J%%%j%%%%%%%%%%%%%%%%%%%%%%%J%%%%%%%j%%%%J%%j%%%%%%%%jJ%%
$$ 1 1 1 1 0 0 0 0 0 0 0 0 0 0 1 1 1 1 0 0 0 0 0 0 0 0 0 0 0 0 0 0 0 0 0 0 0 0 0 0 0 0 1 1 1 1 1 1 1 1 0 0 0 0 0 1 1 1 0 0 0 0 0 0 0 0 0 -1 0 0 0
-1196@%Jj%%%%%%%%%%Jj%%%%%J%%%%%%%%%j%%%%%%%%%%%J%%j%J%%%%%%%%%%%j%%%%%%%J%%
$$ 0 0 1 0 0 0 0 0 0 0 0 0 0 0 1 0 0 0 0 0 0 1 1 1 1 1 1 1 1 1 1 0 0 0 0 0 0 0 0 0 0 0 0 1 1 1 0 0 1 1 1 1 1 1 1 1 1 1 1 1 0 0 0 0 0 0 0 0 1 1 1
-1203A%%%%%%%j%%%%%%%%%%%%J%%%%%%%%%%%j%J%%%j%%J%%%%%%%%%%%%j%%%J%%%%%%%%%%%
$$ 1 1 1 1 1 1 1 1 0 0 0 0 0 0 0 0 0 0 0 0 0 1 1 1 1 1 1 1 1 1 1 1 1 0 0 1 1 1 1 0 0 0 1 1 1 1 1 1 1 1 1 1 1 1 1 0 0 0 0 1 1 1 1 1 1 1 1 1 1 1 1
-1209Aj%%%%%J%%%%%%%%%%%%j%%%J%j%J%%%%%%%%%%%%%%%%%%%%%%%%%%%%%%%%j%%%%%%%%%
$$ 1 0 0 0 0 0 0 1 1 1 1 1 1 1 1 1 1 1 1 1 0 0 0 0 1 1 0 0 1 1 1 1 1 1 1 1 1 1 1 1 1 1 1 1 1 1 1 1 1 1 1 1 1 1 1 1 1 1 1 1 1 0 0 0 0 0 0 0 0 0 0
-1216@%%%%%%%%%%%J%%j%%%%%%%%%%%%%%%%J%%%j%%%%%%%J%j%%%%%%J%%%j%%%%Jj%%J%%%%
$$ 0 0 0 0 0 0 0 0 0 0 0 0 1 1 1 0 0 0 0 0 0 0 0 0 0 0 0 0 0 0 0 0 1 1 1 1 0 0 0 0 0 0 0 0 1 1 0 0 0 0 0 0 0 1 1 1 1 0 0 0 0 0 1 0 0 0 1 1 1 1 1
-1222Aj%%%%%J%%%%%%j%%%%%%%%%%%%%%%%%%%%%%%%J%%%%%%%%j%%%%%Jj%%%%%%J%%%j%%%%
$$ 1 0 0 0 0 0 0 1 1 1 1 1 1 1 0 0 0 0 0 0 0 0 0 0 0 0 0 0 0 0 0 0 0 0 0 0 0 0 0 1 1 1 1 1 1 1 1 1 0 0 0 0 0 0 1 0 0 0 0 0 0 0 1 1 1 1 0 0 0 0 0
-1228@%%%J%%j%%%%J%j%%%%%J%%%%%%%%%%j%%J%%%%%%%%j%%%%%%%%%%%%%%%Jj%%%%%%%%%%
$$ 0 0 0 0 1 1 1 0 0 0 0 0 1 1 0 0 0 0 0 0 1 1 1 1 1 1 1 1 1 1 1 0 0 0 1 1 1 1 1 1 1 1 1 0 0 0 0 0 0 0 0 0 0 0 0 0 0 0 0 1 0 0 0 0 0 0 0 0 0 0 0
-1235@%%J%%%%%%%j%%%J%%%j%%%%%%J%%%%%%%%%j%%%%%%%%%%J%%%%%%%%%%%%%%j%J%%%%%%
$$ 0 0 0 1 1 1 1 1 1 1 1 0 0 0 0 1 1 1 1 0 0 0 0 0 0 0 1 1 1 1 1 1 1 1 1 1 0 0 0 0 0 0 0 0 0 0 0 1 1 1 1 1 1 1 1 1 1 1 1 1 1 1 0 0 1 1 1 1 1 1 1
-1241Aj%%%%%%%%%J%%%%%%%%%%%%%jJ%j%%%%%%%Jj%%%%%%%%%%%%%J%%%%%%%%%%%%j%%%%%%
$$ 1 0 0 0 0 0 0 0 0 0 0 1 1 1 1 1 1 1 1 1 1 1 1 1 1 0 1 1 0 0 0 0 0 0 0 0 1 0 0 0 0 0 0 0 0 0 0 0 0 0 0 1 1 1 1 1 1 1 1 1 1 1 1 1 0 0 0 0 0 0 0
-1248@%%%J%%j%%%%J%j%Jj%%%%J%%%j%%%%%%%%%%%%%%J%%%%%%%%jJ%%%%%%jJ%%%j%%%%J%%
$$ 0 0 0 0 1 1 1 0 0 0 0 0 1 1 0 0 1 0 0 0 0 0 1 1 1 1 0 0 0 0 0 0 0 0 0 0 0 0 0 0 0 1 1 1 1 1 1 1 1 1 0 1 1 1 1 1 1 1 0 1 1 1 1 0 0 0 0 0 1 1 1
-1254Aj%%%%%%%%%%%%%J%%jJ%%%j%%%J%%%j%J%%%%%%j%%%%%%J%%%%%%%%%%%%%%%%%%%%%%%
$$ 1 0 0 0 0 0 0 0 0 0 0 0 0 0 0 1 1 1 0 1 1 1 1 0 0 0 0 1 1 1 1 0 0 1 1 1 1 1 1 1 0 0 0 0 0 0 0 1 1 1 1 1 1 1 1 1 1 1 1 1 1 1 1 1 1 1 1 1 1 1 1
-1260A%j%%%%%%%%%%%%J%%%%%j%%%%%%%%%%%%%%%%%J%%%%%%%%%%j%J%%%%%%%j%%%%%J%%%%
$$ 1 1 0 0 0 0 0 0 0 0 0 0 0 0 0 1 1 1 1 1 1 0 0 0 0 0 0 0 0 0 0 0 0 0 0 0 0 0 0 1 1 1 1 1 1 1 1 1 1 1 0 0 1 1 1 1 1 1 1 1 0 0 0 0 0 0 1 1 1 1 1
-1267A%%%%%%%%%%%%%%%%%%%%%%%%%%%%%%%%%%%%%%%%%%%jJ%%%%%%%%%%%%%%%%%%%%%%%%%
$$ 1 1 1 1 1 1 1 1 1 1 1 1 1 1 1 1 1 1 1 1 1 1 1 1 1 1 1 1 1 1 1 1 1 1 1 1 1 1 1 1 1 1 1 1 0 1 1 1 1 1 1 1 1 1 1 1 1 1 1 1 1 1 1 1 1 1 1 1 1 1 1
-1273A%%%%%%%Jj%%j%%J%%%%%%%%%%%%j%%%%J%%%%%%%%jJ%%%%%%%%%%%%%%%%%%%%%%%%%%%
$$ 1 1 1 1 1 1 1 1 2 1 1 1 0 0 0 1 1 1 1 1 1 1 1 1 1 1 1 1 0 0 0 0 0 1 1 1 1 1 1 1 1 1 0 1 1 1 1 1 1 1 1 1 1 1 1 1 1 1 1 1 1 1 1 1 1 1 1 1 1 1 1
-1280A%%%%%%%%%%%%%%%%%%%%%%%%%%%%%%%%%%%%%%%%j%%%J%%%%j%%%%%%%%J%%%%j%%%J%%
$$ 1 1 1 1 1 1 1 1 1 1 1 1 1 1 1 1 1 1 1 1 1 1 1 1 1 1 1 1 1 1 1 1 1 1 1 1 1 1 1 1 1 0 0 0 0 1 1 1 1 1 0 0 0 0 0 0 0 0 0 1 1 1 1 1 0 0 0 0 1 1 1
-1286A%%%%%%%%%%%%%%%%%%%%%j%%%%%J%%%j%J%%%%%%%%%%%%%%j%%%%J%j%%J%%%%%%%%%j%
$$ 1 1 1 1 1 1 1 1 1 1 1 1 1 1 1 1 1 1 1 1 1 1 0 0 0 0 0 0 1 1 1 1 0 0 1 1 1 1 1 1 1 1 1 1 1 1 1 1 1 0 0 0 0 0 1 1 0 0 0 1 1 1 1 1 1 1 1 1 1 0 0
$$ [...]
-2308@
##END=		$$ NMR SPECTRUM
##END=		$$ LINK
