##TITLE=	RP360.10.fid
##JCAMP-DX=	6.0	$$ MestReNova 14.3.3-33362
##DATA TYPE=	LINK
##BLOCKS=	1    
##ORIGIN=	Mestrelab Research S.L.
##OWNER=	hrzepa
##$MNOVA/METADATA=	(DOCUMENT,BASE64)
eyJuYW1lIjoiL1VzZXJzL2hyemVwYS9MaWJyYXJ5L01vYmlsZSBEb2N1bWVudHMvY29tfmFwcGxlfkN
sb3VkRG9jcy9TaGVwcGFyZC9OTVIgZmlsZXMgemlwcy0yLzI2LzI2LUgubW5vdmEiLCJwYWdlcyI6W3
siaXRlbXMiOlsiMSIgICAgIF19XX0=
##TITLE=	RP360.10.fid
##JCAMP-DX=	6.0	$$ MestReNova 14.3.3-33362
##DATA TYPE=	NMR SPECTRUM
##DATA CLASS=	XYDATA
##BLOCK_ID=	1
##ORIGIN=	Bruker BioSpin GmbH
##OWNER=	nmrsu
##NUMDIM=	1
##$MNOVA/METADATA=	(ITEM,BASE64)
eyJhbmdsZSI6MCwiYXhlcyI6eyJ4Ijp7Im1heCI6MTYuMDY0MjU5OTk5OTM5MTI1LCJtaW4iOi0zLjc
2Njk0MjMzOTE1NjYyMjZ9LCJ5Ijp7Im1heCI6MjUyNDAuNzE4MjYxNzE4NzUsIm1pbiI6LTIyNDEuNz
I4ODE2OTg2MDg0fX0sInBvaW50cyI6W3sieCI6NTMyMSwieSI6NTgzNX0seyJ4Ijo4NzIyLCJ5Ijo1O
DM1fSx7IngiOjg3MjIsInkiOjgyMDh9LHsieCI6NTMyMSwieSI6ODIwOH0seyJ4Ijo1MzIxLCJ5Ijo1
ODM1fV0sInoiOjB9
##.OBSERVE FREQUENCY=	700.35432466099996418
##.OBSERVE NUCLEUS=	^1H
##.SOLVENT NAME=	CDCl3
##.PULSE SEQUENCE=	zg30
##LONGDATE=	2023/11/21 21:58:58.000
##.ACQUISITIONMODE=	SIMULTANEOUS (DQD)
##$ORIGINAL FORMAT=	Bruker XWIN-NMR
##$MNOVA/SCALES_VERSION=	9
##$PARAMETER FILE=	(acqus, ASCII, /private/var/folders/f6/rjf_tdyn2v98c5c0wvkgn4s80000gq/T/9GeB6h3FQD21XH$87JOrWA/10/acqus, 0)
$$ ##TITLE= Parameter file, TopSpin 4.1.3
$$ ##JCAMPDX= 5.0
$$ ##DATATYPE= Parameter Values
$$ ##NPOINTS= 1	$$ modification sequence number
$$ ##ORIGIN= Bruker BioSpin GmbH
$$ ##OWNER= nmrsu
$$ $$ 2023-11-21 21:58:54.975 +0000  nmrsu@CZC7167VR1
$$ $$ Z:/700/data/tds/nmr/RP360/10/acqus
$$ $$ process C:\Bruker\TopSpin4.1.3\prog\mod\dirdata.exe
$$ ##$ACQT0= -2.0981556054023
$$ ##$AMP= (0..31)
$$ 100 100 100 100 100 100 100 100 100 100 100 100 100 100 100 100 100 100
$$ 100 100 100 100 100 100 100 100 100 100 100 100 100 100
$$ ##$AMPCOIL= (0..32)
$$ -1 0 0 0 0 0 0 0 0 0 0 0 0 0 0 0 0 0 0 0 0 0 0 0 0 0 0 0 0 0 0 0 0
$$ ##$AQSEQ= 0
$$ ##$AQ_mod= 3
$$ ##$AUNM= <au_zg>
$$ ##$AUTOPOS= <49 >
$$ ##$BF1= 700.349999998
$$ ##$BF2= 700.349999998
$$ ##$BF3= 700.349999998
$$ ##$BF4= 700.349999998
$$ ##$BF5= 700.349999998
$$ ##$BF6= 700.349999998
$$ ##$BF7= 700.349999998
$$ ##$BF8= 700.349999998
$$ ##$BWFAC= (0..63)
$$ 0 0 0 0 0 0 0 0 0 0 0 0 0 0 0 0 0 0 0 0 0 0 0 0 0 0 0 0 0 0 0 0 0 0 0 0
$$ 0 0 0 0 0 0 0 0 0 0 0 0 0 0 0 0 0 0 0 0 0 0 0 0 0 0 0 0
$$ ##$BYTORDA= 0
$$ ##$CHANFCU= (0..24)
$$ 0 1 0 0 0 0 0 0 0 0 0 0 0 0 0 0 0 0 0 0 0 0 0 0 0
$$ ##$CHANREC= (0..24)
$$ 0 0 0 0 0 0 0 0 0 0 0 0 0 0 0 0 0 0 0 0 0 0 0 0 0
$$ ##$CHEMSTR= <none>
$$ ##$CNST= (0..63)
$$ 1 1 1 1 1 1 1 1 1 1 1 1 1 1 1 1 1 1 1 1 1 1 1 1 1 1 1 1 1 1 1 1 1 1 1 1
$$ 1 1 1 1 1 1 1 1 1 1 1 1 1 1 1 1 1 1 1 1 1 1 1 1 1 1 1 1
$$ ##$CPDPRG= (0..8)
$$ <> <> <> <> <> <> <> <> <>
$$ ##$D= (0..63)
$$ 0 1 0 0 0 0 0 0 0 0 0 0 0 0 0 0 0.0002 0 0 0 0 0 0 0 0 0 0 0 0 0 0 0 0
$$ 0 0 0 0 0 0 0 0 0 0 0 0 0 0 0 0 0 0 0 0 0 0 0 0 0 0 0 0 0 0 0
$$ ##$DATE= 1700603938
$$ ##$DATE_START= 1700603895
$$ ##$DE= 6.901845
$$ [...]
$$ ##$ShimPowRng3= (0..63)
$$ 1 1 1 1 1 1 1 1 1 1 1 1 1 1 1 1 1 1 1 1 1 1 1 1 1 1 1 1 1 1 1 1 1 1 1 1
$$ 1 1 1 1 0 0 0 0 0 0 0 0 0 0 0 0 0 0 0 0 0 0 0 0 0 0 0 0
$$ ##$ShimPowType1= 8
$$ ##$ShimPowType2= 8
$$ ##$ShimPowType3= 0
$$ ##$ShimPowType4= 0
$$ ##$ShimPowType5= 0
$$ ##$ShimPowType6= 0
$$ ##$ShimPowType7= 0
$$ ##$ShimPowType8= 0
$$ ##$ShimSysActGrad= (0..63)
$$ 1 2 3 4 13 5 7 11 10 9 6 8 12 18 19 20 21 15 22 23 24 14 25 16 26 17 27
$$ 28 31 32 33 34 35 36 37 38 0 0 0 0 0 0 0 0 0 0 0 0 0 0 0 0 0 0 0 0 0 0
$$ 0 0 0 0 0 0
$$ ##$ShimSysAngle= <>
$$ ##$ShimSysFunc= (0..63)
$$ 1 2 3 4 5 6 7 8 9 10 0 37 38 35 16 15 14 13 12 11 28 27 26 25 24 23 36
$$ 22 30 29 20 21 34 33 32 31 17 18 19 0 0 0 0 0 0 0 0 0 0 0 0 0 0 0 0 0 0
$$ 0 0 0 0 0 0 0
$$ ##$ShimSysMatId= <292722da.dat>
$$ ##$ShimSysMatrix= 1
$$ ##$ShimSysMinMaxUG= 130000
$$ ##$ShimSysOffset= <29 mm>
$$ ##$ShimSysType= 4
$$ ##$ShimUnit= 3
$$ ##$SpectrOsVersion= <4.1.156.20210628>
$$ ##$TCubeEth= <192.168.180.38>
$$ ##$TCubeSeqDevice= <>
$$ ##$TOSITY= <no>
$$ ##$TRIPLO2= 0
$$ ##$TopSpinVersion= <TopSpin 4.1.3>
$$ ##$TrxFreqFormula= (0..23)
$$ <TrxFreqFormula(2.0,700350000.000000,'TRX',Trx(1.0,'TRX 1200.1',1,5.000000,1290.000000))>
$$ <TrxFreqFormula(2.0,700350000.000000,'TRX',Trx(1.0,'TRX 1200.2',1,5.000000,1290.000000))>
$$ <TrxFreqFormula(2.0,700350000.000000,'TRX',Trx(1.0,'TRX 1200.3',1,5.000000,1290.000000))>
$$ <> <> <> <> <> <> <> <> <> <> <> <> <> <> <> <> <> <> <> <> <>
$$ ##$TrxPN= (0..23)
$$ <Z148391> <Z148391> <Z148391> <> <> <> <> <> <> <> <> <> <> <> <> <> <>
$$ <> <> <> <> <> <> <>
$$ ##$TrxSN= (0..23)
$$ <00336> <00337> <00342> <> <> <> <> <> <> <> <> <> <> <> <> <> <> <> <>
$$ <> <> <> <> <>
$$ ##$VCubeEth= (0..23)
$$ <no> <no> <no> <no> <no> <no> <no> <no> <no> <no> <no> <no> <no> <no> <no>
$$ <no> <no> <no> <no> <no> <no> <no> <no> <no>
$$ ##$VTU= 2
$$ ##$VTUETH= <192.168.99.11>
$$ ##$VTUTY= <no>
$$ ##$ValueLine= no
$$ ##$VpuPN= (0..23)
$$ <no> <no> <no> <no> <no> <no> <no> <no> <no> <no> <no> <no> <no> <no> <no>
$$ <no> <no> <no> <no> <no> <no> <no> <no> <no>
$$ ##$VpuSN= (0..23)
$$ <no> <no> <no> <no> <no> <no> <no> <no> <no> <no> <no> <no> <no> <no> <no>
$$ <no> <no> <no> <no> <no> <no> <no> <no> <no>
$$ ##$WBREFAM= (0..31)
$$ 99.8 100 100 100 100 100 100 100 100 100 100 100 100 100 100 100 100 100
$$ 100 100 100 100 100 100 100 100 100 100 100 100 100 100
$$ ##$WBREFLM= (0..31)
$$ 1 0 1 0 0 0 0 0 0 0 0 0 0 0 0 0 0 0 0 0 0 0 0 0 0 0 0 0 0 0 0 0
$$ ##$WBREFPH= (0..31)
$$ 0.05 0 0 0 0 0 0 0 0 0 0 0 0 0 0 0 0 0 0 0 0 0 0 0 0 0 0 0 0 0 0 0
$$ ##$WBSGU= (0..31)
$$ 1 2 4 0 0 0 0 0 0 0 0 0 0 0 0 0 0 0 0 0 0 0 0 0 0 0 0 0 0 0 0 0
$$ ##END=
$$ 
##$DECIM=	1440
##$DSPFVS=	21
##XUNITS=	HZ
##YUNITS=	ARBITRARY UNITS
##FIRSTX=	11250.604788156719223
##LASTX=	-2638.1781369192458442
##DELTAX=	-0.10596381293402784562
##XFACTOR=	1
##YFACTOR=	0.70027950663014615351
##FIRSTY=	81.81304931640625
##MINY=	52.83835601806640625
##MAXY=	22946.05859375
##NPOINTS=	131072
##XYDATA=	(X++(Y..Y))
$$ [...]
$$ plain form
2640 144 143 142 142 142 143 143 143 143 142 142 142 141 142 142 142 142 142 142 141 141 141 141 142 143 144 144 144 143 143 143 142 141 140 140 141 141 141 141 141 142 142 141 140 140 140 140 141 142 141 139 139 139 140 141 141 141 140 140 141 142 143 144 144 145 144 142 140 140 141
2633 141 140 140 140 141 142 142 142 142 143 144 144 144 143 142 143 142 142 141 141 140 141 143 142 142 142 141 141 140 140 140 142 142 141 139 138 138 138 139 140 140 140 141 141 142 141 141 141 140 140 140 140 140 140 140 140 141 141 142 142 140 139 139 139 140 140 139 140 140 140
2625 140 141 139 138 138 138 138 138 139 140 140 140 140 140 141 143 144 145 145 144 143 143 143 143 143 143 144 144 144 144 144 143 142 141 141 142 143 143 142 142 143 143 143 144 143 144 144 144 144 145 145 145 145 145 145 144 145 145 145 145 144 144 144 143 144 144 144 144 143 143
2618 143 143 143 144 145 146 146 146 147 145 144 143 144 144 145 145 145 144 144 144 143 144 144 145 144 143 144 145 145 144 144 143 142 143 144 145 145 143 142 141 141 141 140 140 141 142 143 144 145 146 145 144 144 143 142 142 142 141 141 141 141 140 140 139 139 139 139 139 139 140
2611 140 141 143 144 145 144 142 142 142 144 144 144 144 144 144 145 144 143 143 143 143 143 143 143 143 143 142 141 141 142 143 144 144 144 143 142 142 141 142 143 143 143 142 141 141 142 143 143 143 143 143 143 143 142 142 142 142 143 143 143 143 143 143 143 143 143 143 142 141 141
2603 141 141 142 143 144 145 145 145 145 144 144 143 143 143 143 143 144 143 143 143 142 143 144 144 144 144 144 144 144 145 146 145 145 145 145 143 143 144 145 145 143 141 140 139 138 139 139 140 141 141 141 141 141 141 142 142 143 143 144 144 143 143 143 143 142 142 142 142 142 143
2596 143 143 143 143 143 144 143 143 143 142 141 140 141 141 142 142 142 142 140 139 139 140 140 141 141 141 142 142 143 144 143 142 142 141 141 141 141 141 141 142 142 143 144 144 143 143 142 141 141 140 141 142 142 143 142 142 141 141 142 142 142 141 142 143 144 143 143 144 144 144
2589 144 144 142 141 141 141 142 142 142 143 143 143 144 144 143 142 142 142 142 144 143 143 143 142 142 142 142 143 143 143 143 143 143 143 142 142 142 143 143 144 145 144 143 142 141 141 142 142 143 143 144 143 142 141 140 141 141 141 141 141 141 142 143 143 144 144 144 143 143 143
$$ packed form
2640A44jj%%J%%%j%%jJ%%%%%j%%%JJJ%%j%%jjj%J%%%%J%jj%%%JJjk%%JJ%%j%JJJJ%Jjkk%J
2633A41j%%JJ%%%JJ%%jjJj%j%jJKj%%j%j%%K%jkj%%JJ%%J%Jj%%j%%%%%%%J%J%kj%%J%jJ%%
2625A40Jkj%%%%JJ%%%%JKJJ%jj%%%%%J%%%%jjj%JJ%j%J%%JjJ%%%J%%%%%jJ%%%j%%jJ%%%j%
2618A43%%JJJ%%JkjjJ%J%%j%%jJ%JjjJJ%j%jjJJJ%kjj%%j%JJJJJJjj%jj%%j%%%j%j%%%%%J
2611A40JKJJjk%%K%%%%%Jjj%%%%%%%%jj%JJJ%%jj%jJJ%%jj%JJ%%%%%%j%%%J%%%%%%%%%jj%
2603A41%JJJJ%%%j%j%%%%Jj%%jJJ%%%%%%JJj%%%k%JJ%kkjjjJ%JJ%%%%%J%J%J%j%%%j%%%%J
2596A43%%%%Jj%%jjjJ%J%%%kj%J%J%%J%JJjj%j%%%%%J%JJ%j%jj%jJJ%Jj%j%J%%jJJJj%J%%
2589A44%kj%%J%%J%%J%jj%%%Kj%%j%%%J%%%%%%j%%J%JJjjjj%J%J%JjjjjJ%%%%%JJ%J%%j%%
$$ plain form
2581 143 142 143 144 144 144 144 143 143 143 143 143 143 142 141 141 142 143 144 145 145 146 146 146 145 143 142 142 142 143 144 145 146 146 145 146 145 143 142 143 144 144 143 143 143 143 143 143 143 143 143 142 143 144 144 143 142 143 143 144 145 144 142 141 141 141 140 141 141 141
2574 141 140 139 140 141 142 143 142 142 141 141 141 141 140 140 141 142 141 141 141 142 142 142 142 142 142 142 142 142 143 143 143 143 144 144 144 144 143 141 141 140 140 140 140 141 142 142 143 143 143 142 142 143 143 143 143 143 143 143 143 143 142 142 142 143 143 142 143 144 143
2567 143 142 142 142 142 144 145 146 145 145 144 143 144 144 144 144 144 143 143 143 143 143 144 144 145 145 144 143 143 143 143 142 141 140 140 140 140 139 138 139 140 141 141 142 142 142 142 143 142 142 141 141 142 142 142 143 142 142 142 142 142 143 143 143 142 142 142 141 141 142
2559 142 142 142 142 142 140 140 141 141 142 143 142 142 142 142 142 142 142 143 143 143 142 143 143 142 140 140 141 142 142 142 142 142 142 143 144 143 142 142 143 143 143 143 144 144 143 143 143 143 143 143 142 142 143 144 145 144 143 142 142 142 142 142 142 142 141 141 142 141 141
2552 141 142 142 142 142 143 143 143 144 144 143 142 142 141 141 140 140 139 140 140 140 140 141 143 143 144 144 143 142 142 142 142 141 141 140 140 140 140 140 140 141 141 141 142 142 142 142 142 143 144 143 143 142 142 142 143 143 143 143 144 144 144 144 144 144 145 144 143 143 142
2545 142 141 141 141 142 142 143 143 142 142 141 141 141 141 140 141 141 142 143 143 143 143 143 143 143 142 142 142 142 142 142 143 143 143 143 142 141 141 141 141 141 141 141 142 142 142 143 144 145 144 143 143 142 142 142 142 142 141 141 142 143 143 144 144 144 145 145 145 144 144
2538 144 144 143 143 142 143 143 143 141 141 141 141 141 141 141 142 143 143 143 142 142 141 141 141 142 143 143 143 142 141 141 141 142 143 143 144 144 144 143 141 140 141 141 141 141 142 142 142 142 142 142 142 143 143 143 144 144 145 145 145 145 145 143 142 141 139 139 138 140 142
2530 142 143 143 143 143 142 141 142 143 143 143 143 143 142 142 142 142 142 143 143 143 143 143 143 144 145 144 144 143 143 143 142 140 140 140 140 141 142 142 141 139 139 140 141 141 140 140 141 140 139 139 140 141 140 139 140 141 141 140 141 141 142 143 144 143 142 142 143 143 142
$$ packed form
2581A43jJJ%%%j%%%%%jj%JJJJ%J%%jkj%%JJJJ%jJjkjJJ%j%%%%%%%%jJJ%jjJ%JJjkj%%jJ%%
2574A41jjJJJJj%j%%%j%JJj%%J%%%%%%%%J%%%J%%%jk%j%%%JJ%J%%j%J%%%%%%%%j%%J%jJJj
2567A43j%%%KJJj%jjJ%%%%j%%%%J%J%jj%%%jjj%%%jjJJJ%J%%%Jj%j%J%%Jj%%%%J%%j%%j%J
2559A42%%%%k%J%JJj%%%%%%J%%jJ%jk%JJ%%%%%JJjj%J%%%J%j%%%%%j%JJJjjj%%%%%%j%Jj%
2552A41J%%%J%%J%jj%j%j%jJ%%%JK%J%jj%%%j%j%%%%%J%%J%%%%JJj%j%%J%%%J%%%%%Jjj%j
2545A42j%%J%J%j%j%%%jJ%JJ%%%%%%j%%%%%J%%%jj%%%%%%J%%JJJjj%j%%%%j%JJ%J%%J%%j%
2538A44%j%jJ%%k%%%%%%JJ%%j%j%%JJ%%jj%%JJ%J%%jkjJ%%%J%%%%%%J%%J%J%%%%kjjk%jKK
2530A42J%%%jjJJ%%%%j%%%%J%%%%%JJj%j%%jk%%%JJ%jk%JJ%j%Jjj%JJjjJJ%jJ%JJJjj%J%j
$$ plain form
2523 142 142 142 141 141 140 140 139 140 141 141 142 143 144 144 144 143 143 143 143 142 141 140 139 139 140 141 142 142 142 142 142 144 145 145 146 145 143 142 142 142 142 141 140 140 141 142 143 142 141 140 140 141 141 142 142 142 143 143 143 144 143 142 142 143 143 142 141 141 141
2516 141 141 141 142 142 141 140 140 139 139 140 141 141 141 141 141 141 140 139 140 141 141 142 143 144 144 142 141 142 142 143 143 143 143 143 143 143 144 144 144 143 143 142 143 142 141 142 142 142 142 143 144 143 143 143 144 144 143 143 143 144 143 143 142 142 142 142 142 141 141
2508 141 140 141 142 141 141 141 142 142 143 142 142 142 142 142 143 143 143 143 143 144 144 144 143 142 142 141 140 140 141 141 141 142 142 143 142 142 142 142 143 143 144 144 143 143 142 142 141 142 142 143 143 143 142 142 141 142 142 143 143 144 145 145 145 145 146 146 146 146 146
2501 146 145 144 146 148 147 147 147 146 146 147 149 150 150 150 150 150 151 152 153 153 154 154 155 156 157 158 160 161 163 166 170 174 177 181 186 191 197 203 209 215 223 230 237 242 245 249 253 256 258 259 259 258 256 254 250 246 242 236 230 223 218 212 205 198 192 187 182 177 174
2494 174 172 169 166 163 162 161 160 158 155 153 152 152 152 153 153 152 151 151 152 152 151 151 151 151 151 151 150 149 148 147 146 146 147 147 149 150 151 150 149 148 148 148 148 148 148 149 149 149 150 150 150 151 151 152 152 152 153 152 152 151 150 150 150 151 151 152 153 153 153
2486 153 153 153 154 155 155 155 155 154 155 156 158 160 161 162 163 163 165 166 168 170 172 174 177 179 182 185 187 188 189 189 190 191 192 192 192 191 190 189 187 185 183 181 177 175 172 168 164 160 157 154 152 150 147 144 140 136 134 133 132 131 130 128 128 127 127 126 126 125 125
2479 125 125 125 126 126 127 128 128 129 129 129 130 130 130 130 131 132 131 130 130 129 129 130 131 134 134 134 133 132 131 131 132 133 133 133 133 133 133 133 133 133 133 134 134 134 135 135 135 136 136 136 136 136 136 136 137 137 138 138 138 139 140 141 141 141 140 140 141 142 142
2472 142 142 142 142 141 140 138 139 140 140 141 142 142 142 141 141 140 141 142 142 143 143 142 143 143 144 145 145 145 145 145 144 145 145 145 146 146 147 147 147 146 146 146 147 147 147 147 146 146 146 145 145 145 144 144 143 143 142 141 141 140 140 140 140 140 140 140 139 139 140
$$ packed form
2523A42%%j%j%jJJ%JJJ%%j%%%jjjj%JJJ%%%%KJ%Jjkj%%%jj%JJJjjj%J%J%%J%%Jjj%J%jj%%
2516A41%%J%jj%j%JJ%%%%%jjJJ%JJJ%kjJ%J%%%%%%J%%j%jJjjJ%%%JJj%%J%j%%Jj%j%%%%j%
2508A41jJJj%%J%Jj%%%%J%%%%J%%jj%jj%J%%J%Jj%%%J%J%j%j%jJ%J%%j%jJ%J%JJ%%%J%%%%
2501A46jjKKj%%j%JKJ%%%%JJJ%J%JJJJKJKLMMLMNNOOOOQPPNLMMLKJ%jkkmmmoopnopponnnl
2494A74kllljjjklkj%%J%jj%J%j%%%%%jjjjj%J%KJJjjj%%%%%J%%J%%J%J%%Jj%jj%%J%JJ%%
2486A53%%JJ%%%jJJKKJJJ%KJKKKKLKLLKJJ%JJJ%%jjjkkkkmklmmmllkkllmmkjjjjk%j%j%j%
2479A25%%J%JJ%J%%J%%%JJjj%j%JJL%%jjj%JJ%%%%%%%%%J%%J%%J%%%%%%J%J%%JJJ%%j%JJ%
2472A42%%%jjkJJ%JJ%%j%jJJ%J%jJ%JJ%%%%jJ%%J%J%%j%%J%%%j%%j%%j%j%jj%j%%%%%%j%J
$$ plain form
2464 140 141 142 142 141 139 138 139 140 141 141 142 143 143 144 145 145 145 145 145 146 146 146 146 146 145 145 144 144 144 143 143 143 143 142 141 141 141 141 141 141 142 142 143 143 144 144 145 146 148 149 151 152 154 155 156 158 159 160 161 162 162 162 161 162 163 165 165 165 166
2457 166 165 165 164 164 163 164 165 165 166 167 167 167 166 166 167 169 170 169 167 166 167 166 165 164 162 161 159 157 155 153 152 150 147 145 142 140 138 137 137 137 138 139 138 137 138 139 141 142 144 147 147 146 147 148 149 150 152 154 156 157 159 160 160 160 162 163 164 166 168
2450 168 169 172 174 176 178 180 182 185 186 188 189 190 192 194 196 198 201 205 209 212 216 219 222 224 227 230 232 233 234 233 232 231 228 225 222 218 213 209 204 199 195 191 188 187 184 183 183 183 183 184 186 187 189 192 195 198 200 204 208 212 215 219 222 225 228 232 237 239 242
2442 242 245 248 252 256 260 265 269 273 277 281 285 290 295 299 305 311 318 324 330 335 340 345 351 357 364 372 380 388 396 405 413 421 432 444 455 468 483 498 513 531 549 570 594 620 648 679 714 752 794 839 889
2437 889 943 1000 1064 1131 1203 1280 1362 1451 1549 1654 1770 1900 2046 2213 2405 2628 2890 3197 3556 3976 4466 5030 5675 6405 7220 8118
2434 8118 9091 10132 11228 12364 13522 14682 15820 16914 17941 18879 19710 20414 20976 21382 21623 21692 21586 21307 20856 20245 19485
2432 19485 18592 17587 16492 15332 14130 12912 11703 10525 9400 8343 7369 6484 5695 5000 4396 3880 3443 3076 2769 2515
2430 2515 2304 2125 1974 1843 1728 1626 1534 1450 1373 1301 1233 1169 1110 1053 998 945 896 849 804 763 725 689 656 627 599 573 549 527 507 489 473
$$ packed form
2464A40JJ%jkjJJJ%JJ%JJ%%%%J%%%%j%j%%j%%%jj%%%%%J%J%J%JJKJKJKJJKJJJJ%%jJJK%%J
2457A66j%j%jJJ%JJ%%j%JKJjkjJjjjkjkkkkjklklkkj%%JJjjJJKJKL%jJJJJKKKJKJ%%KJJKK
2450A68JLKKKKKLJKJJKKKKLMMLMLLKLLKJJjjjlllmnmnnmmljlj%%%JKJKLLLKMMMLMLLLMNKL
2442B42LLMMMNMMMMMNNMOOPOONNNOOPQQQQRQQJ1J2J1J3J5J5J5J8J8K1K4K6K8L1L5L8M2M5N0
2437H89N4N7O4O7P2P7Q2Q9R8J05J16J30J46J67J92K23K62L07L59M20M90N64O45P30Q15Q98
2434H118R73J041J096J136J158J160J138J094J027R38Q31P04N62M06K41O9j06k79m51o11p60
2432A9485q93j005j095j160j202j218j209j178j125j057r74q85p89o95o04n16m37l67l07k54
2430B515k11j79j51j31j15j02r2q4p7p2o8o4n9n7n5n3m9m7m5m1l8l6l3k9k8k6k4k2k0j8j6
$$ plain form
2427 473 458 444 432 420 409 401 393 384 376 368 361 355 348 341 334 328 322 317 313 309 306 303 300 297 294 290 288 287 285 282 280 277 275 273 271 270 269 268 267 265 263 262 262 263 264 265 264 264 263 262 260 258 256 254 251 246 241 236 231 225 217 209 201 193
2420 193 184 175 168 162 156 150 145 139 135 133 131 132 134 137 141 145 149 154 159 165 172 178 184 190 194 198 200 201 203 204 206 205 204 203 202 199 196 195 194 193 193 193 194 195 195 195 194 194 195 196 195 195 196 197 196 196 195 195 195 196 196 197 198 200 201 202 201 200 199
2413 199 199 198 197 196 194 192 190 187 185 183 181 178 176 173 172 170 168 164 161 159 158 156 155 154 153 153 153 154 154 154 155 155 156 156 156 155 154 154 153 154 153 152 151 152 152 152 152 153 153 153 154 155 155 156 157 159 160 161 162 164 164 164 166 167 167 167 168 170 170
2405 170 170 169 169 169 168 167 166 165 165 165 164 164 164 164 164 163 162 162 163 163 163 163 163 163 163 163 163 163 163 163 163 164 165 165 165 164 164 165 165 165 165 165 165 165 165 164 164 163 162 162 161 160 160 159 158 158 159 157 156 155 154 153 154 154 153 151 150 149 149
2398 149 149 150 152 152 152 154 154 153 152 152 152 153 153 153 153 153 153 153 152 153 155 156 156 156 156 156 156 156 156 157 157 157 157 157 157 157 156 156 156 156 156 156 156 157 157 157 158 158 158 157 157 156 157 157 157 157 157 157 158 159 158 158 157 158 159 161 162 162 161
2391 161 160 160 160 159 158 157 158 159 159 159 160 160 159 159 159 159 159 159 159 160 160 160 160 160 161 162 162 163 164 164 164 165 164 163 163 163 163 163 163 164 164 164 164 164 165 164 164 163 162 160 158 157 156 153 151 149 147 144 142 139 136 133 130 127 124 121 118 116 113
2383 113 110 107 106 104 102 100 99 99 101 102 103 104 104 105 107 108 112 114 115 118 121 123 123 124 125 127 128 130 131 132 132 133 134 135 135 136 136 136 136 137 136 136 137 137 139 140 140 140 139 139 139 139 140 140 141 141 141 140 140 140 140 141 141 141 140 140 141 142 141
2376 141 141 141 140 139 140 140 140 142 143 143 143 143 143 143 143 143 143 143 142 142 142 143 144 144 145 144 144 144 144 145 145 146 146 147 147 146 146 146 146 147 147 148 148 148 148 149 150 151 152 153 153 155 156 157 157 158 159 160 163 166 169 172 175 179 183 187 192 197 203
$$ packed form
2427D73j5j4j2j2j1qqrqqpopppoonmmlllllmkjklklkkkjjjjkkj%JJJj%jjkkkklnnnnoqqqq
2420A93rrpooonomkkJKLMMMNNOPOOOMMKJKJKjjjjlljjj%%JJ%%j%JJj%JJj%j%%J%JJKJJjjj
2413A99%jjjkkklkkklkljkkmlkjkjjj%%J%%J%J%%jj%jJjjjJ%%%J%%JJ%JJKJJJK%%KJ%%JK%
2405A70%j%%jjjj%%j%%%%jj%J%%%%%%%%%%%%JJ%%j%J%%%%%%%j%jj%jj%jj%JkjjjjJ%jkjj%
2398A49%JK%%K%jj%%J%%%%%%jJKJ%%%%%%%J%%%%%%j%%%%%%J%%J%%j%jJ%%%%%JJj%jJJKJ%j
2391A61j%%jjjJJ%%J%j%%%%%%J%%%%JJ%JJ%%Jjj%%%%%J%%%%Jj%jjkkjjlkkklkllllllllkl
2383A13lljkkkj%KJJJ%JKJMKJLLK%JJKJKJJ%JJJ%J%%%Jj%J%KJ%%j%%%J%J%%j%%%J%%j%JJj
2376A41%%jjJ%%KJ%%%%%%%%%j%%JJ%Jj%%%J%J%J%j%%%J%J%%%JJJJJ%KJJ%JJJLLLLLMMMNNO
$$ plain form
2369 203 209 213 218 223 229 235 240 245 250 255 259 261 261 259 257 254 251 248 244 240 234 227 222 215 207 201 195 190 184 179 174 170 166 163 161 158 157 156 155 154 154 153 152 151 151 150 151 151 150 149 148 148 147 146 145 145 144 143 144 145 145 146 146 146 146 147 146 144 144
2361 144 144 145 144 143 144 143 143 143 143 143 143 143 144 143 143 143 144 146 146 145 144 143 143 143 142 141 140 141 141 141 142 143 142 142 142 142 142 142 143 143 143 143 144 144 144 144 144 144 143 144 145 145 144 145 145 146 146 146 145 144 145 145 145 145 145 145 144 143 143
2354 143 143 143 143 143 142 142 142 142 141 141 141 141 141 142 142 143 143 144 144 145 145 146 145 144 144 145 144 144 143 143 142 142 141 141 141 142 143 143 144 145 144 143 142 142 144 145 146 145 145 145 145 144 145 146 146 146 145 144 143 143 144 144 145 145 145 145 144 142 142
2347 142 141 141 141 140 140 141 142 142 143 143 143 144 144 143 142 143 143 143 143 143 143 144 146 146 147 146 145 144 144 143 143 143 143 143 142 142 143 146 146 145 145 145 145 145 145 145 144 143 143 144 144 145 145 144 143 144 144 145 145 145 144 144 144 144 144 145 145 144 143
2339 143 143 143 144 144 144 143 143 144 145 146 146 146 145 145 145 144 144 144 144 144 145 147 146 146 145 145 144 143 143 143 143 144 144 143 143 143 143 143 143 143 142 142 143 144 144 144 144 144 145 145 145 145 144 144 144 144 144 144 143 143 143 143 144 145 146 145 144 144 145
2332 145 144 142 142 142 142 142 142 143 144 145 145 145 144 144 144 145 145 145 145 144 144 143 143 141 141 143 144 146 146 145 145 145 144 142 142 143 143 143 144 144 144 144 144 143 142 143 144 143 143 143 143 143 142 142 142 142 142 142 142 142 141 140 141 142 142 142 142 142 143
2325 143 143 143 142 143 144 144 144 144 144 143 142 142 143 142 142 141 142 143 144 144 144 143 143 142 142 143 143 144 145 144 143 144 143 142 142 142 143 143 144 144 144 144 143 142 142 142 142 142 141 140 141 142 142 141 140 140 140 141 141 141 141 141 140 139 138 138 139 139 140
2318 140 141 140 140 139 140 141 142 143 143 143 143 143 143 143 143 143 142 142 142 141 141 142 143 142 142 142 142 141 140 140 141 142 143 142 142 142 143 142 141 140 140 140 141 142 143 143 143 143 142 142 142 141 141 142 142 144 144 144 143 144 144 143 142 142 142 142 142 142 143
$$ packed form
2369B03OMNNOONNNNMK%kklllmmopnpqoononnmmlkljjjj%jjj%jJ%jjj%jjj%jjJJ%J%%%Jjk%
2361A44%JjjJj%%%%%%Jj%%JK%jjj%%jjjJ%%JJj%%%%%J%%%J%%%%%jJJ%jJ%J%%jjJ%%%%%jj%
2354A43%%%%j%%%j%%%%J%J%J%J%Jjj%Jj%j%j%j%%JJ%JJjjj%KJJj%%%jJJ%%jjj%J%J%%%jk%
2347A42j%%j%JJ%J%%J%jjJ%%%%%JK%Jjjj%j%%%%j%JL%j%%%%%%jj%J%J%jjJ%J%%j%%%%J%jj
2339A43%%J%%j%JJJ%%j%%j%%%%JKj%j%jj%%%J%j%%%%%%j%JJ%%%%J%%%j%%%%%j%%%JJJjj%J
2332A45jk%%%%%JJJ%%j%%J%%%j%j%k%KJK%j%%jk%J%%J%%%%jjJJj%%%%j%%%%%%%jjJJ%%%%J
2325A43%%jJJ%%%%jj%Jj%jJJJ%%j%j%J%JJjjJjj%%J%J%%%jj%%%%jjJJ%jj%%J%%%%jjj%J%J
2318A40Jj%jJJJJ%%%%%%%%j%%j%JJj%%%jj%JJJj%%Jjjj%%JJJ%%%j%%j%J%K%%jJ%jj%%%%%J
$$ plain form
2310 143 143 143 143 144 144 144 143 142 142 142 142 142 142 143 144 144 144 144 144 143 144 144 144 144 144 144 143 142 142 143 144 144 145 145 144 143 143 144 144 144 143 142 142 141 142 143 144 144 144 144 144 143 144 144 144 143 142 141 140 139 140 140 141 142 142 142 142 141 141
2303 141 141 141 142 142 142 142 142 141 140 140 140 139 139 139 140 140 140 141 142 143 144 143 143 142 141 141 141 141 142 141 141 141 141 142 143 142 142 142 142 142 142 143 144 144 143 144 145 145 144 143 143 143 142 141 141 141 142 143 143 143 144 144 145 144 144 144 143 143 143
2296 143 142 141 141 141 141 141 142 143 143 142 142 141 142 143 144 144 144 144 144 143 142 142 143 143 143 142 141 141 141 140 141 142 142 141 141 141 142 141 141 140 140 140 140 139 140 140 141 141 141 141 141 141 140 140 140 140 141 141 140 139 138 140 142 143 144 143 142 141 141
2288 141 141 142 142 142 142 141 141 141 141 141 141 141 141 141 141 142 142 142 140 139 140 139 138 138 139 140 140 140 139 139 139 139 140 140 140 141 141 141 142 142 142 142 142 141 141 141 142 142 143 143 142 142 140 139 140 141 142 141 141 141 141 140 140 140 141 141 142 142 142
2281 142 142 142 142 142 142 143 142 141 141 140 141 142 142 142 142 142 142 143 142 141 141 140 141 142 143 144 143 142 141 140 139 140 142 143 143 142 142 142 142 142 143 144 143 141 140 140 141 143 143 143 144 144 143 143 142 141 140 139 139 140 140 141 142 142 142 141 142 143 144
2274 144 143 142 142 142 141 142 143 143 143 142 141 141 141 141 141 141 141 142 142 142 141 141 141 141 141 141 141 140 140 139 139 140 140 141 141 140 139 140 142 142 142 141 142 142 141 140 140 140 141 140 140 140 140 139 138 138 139 139 139 139 138 140 141 140 140 140 139 140 140
2266 140 141 142 141 141 140 139 138 137 138 138 139 140 141 142 143 143 143 142 140 141 141 141 141 141 142 143 142 142 141 140 139 140 141 141 141 141 142 142 141 141 142 143 143 143 143 142 142 142 143 143 142 142 142 142 142 142 142 142 142 142 143 143 142 141 142 142 141 141 140
2259 140 141 142 143 142 141 140 140 140 140 140 140 140 139 140 141 140 140 139 139 139 138 137 137 138 139 140 141 141 141 141 142 141 140 141 142 141 141 140 140 140 140 141 142 144 145 145 143 141 141 142 142 142 143 142 141 141 140 140 140 140 140 139 139 139 139 139 140 140 140
$$ packed form
2310A43%%%J%%jj%%%%%JJ%%%%jJ%%%%%jj%JJ%J%jj%J%%jj%jJJJ%%%%jJ%%jjjjjJ%JJ%%%j%
2303A41%%J%%%%jj%%j%%J%%JJJJj%jj%%%Jj%%%JJj%%%%%JJ%jJJ%jj%%jj%%JJ%%J%Jj%%j%%
2296A43jj%%%%JJ%j%jJJJ%%%%jj%J%%jj%%jJJ%j%%Jj%j%%%jJ%J%%%%%j%%%J%jjjKKJJjjj%
2288A41%J%%%j%%%%%%%%%J%%kjJjj%JJ%%j%%%J%%J%%J%%%%j%%J%J%j%kjJJJj%%%j%%J%J%%
2281A42%%%%%Jjj%jJJ%%%%%Jjj%jJJJJjjjjjJKJ%j%%%%JJjkj%JK%%J%j%jjjj%J%JJ%%jJJJ
2274A44jj%%jJJ%%jj%%%%%%J%%j%%%%%%j%j%J%J%jjJK%%jJ%jj%%Jj%%%jj%J%%%jKJj%%jJ%
2266A40JJj%jjjjJ%JJJJJ%%jkJ%%%%JJj%jjjJJ%%%J%j%JJ%%%j%%J%j%%%%%%%%%J%jjJ%j%j
2259A40JJJjjj%%%%%%jJJj%j%%jj%JJJJ%%%JjjJJj%j%%%JJKJ%kk%J%%Jjj%j%%%%j%%%%J%%
$$ plain form
2252 140 141 141 141 141 141 141 141 142 141 140 140 140 141 141 141 142 141 140 139 139 140 141 140 140 140 140 140 140 140 140 140 140 140 140 140 140 140 140 139 139 139 139 138 138 138 137 137 137 138 139 137 136 136 136 136 135 136 136 137 138 138 139 139 138 138 138 137 136 136
2244 136 137 138 138 137 138 138 139 138 138 138 137 137 137 138 139 138 138 138 138 137 136 136 137 138 139 139 140 140 140 140 140 140 139 139 139 139 140 140 141 140 139 139 138 137 137 136 136 136 137 137 138 138 139 138 138 138 137 137 138 138 139 139 140 140 141 141 142 142 141
2237 141 141 140 140 140 141 141 142 142 142 143 143 143 143 143 143 144 143 142 142 142 142 143 142 141 141 141 140 140 142 142 142 142 141 141 140 140 141 141 141 141 141 140 139 139 140 140 140 141 142 142 142 141 141 141 141 141 141 141 140 140 140 139 140 140 141 140 140 140 140
2230 140 140 140 139 140 141 142 143 143 143 142 141 140 139 140 140 140 141 142 143 143 143 143 142 142 142 141 141 140 140 140 141 141 142 142 142 143 144 143 143 143 143 143 143 143 142 142 141 141 141 140 141 141 141 140 139 139 139 140 140 140 141 143 143 143 142 141 140 140 139
2222 139 139 140 140 140 139 139 139 140 141 141 141 141 141 140 140 140 139 139 140 140 141 140 140 140 140 141 142 142 142 141 141 141 142 143 143 143 142 141 141 140 140 141 142 142 142 142 142 142 142 142 141 141 141 142 142 142 142 141 142 143 143 143 142 141 141 141 141 140 139
2215 139 139 140 141 140 140 140 140 140 140 140 140 141 141 141 142 141 141 141 140 141 141 141 142 143 142 142 142 141 139 140 140 140 140 140 140 140 140 141 141 140 140 140 140 140 140 140 140 141 140 140 140 140 140 140 140 139 139 139 139 139 139 139 139 139 139 139 139 139 140
2208 140 140 141 140 140 140 140 141 142 143 144 145 143 141 140 141 142 141 141 140 139 138 137 138 138 138 138 139 140 141 141 141 140 138 138 138 139 141 141 140 139 139 139 139 140 140 140 142 143 142 142 141 140 140 139 138 137 137 138 139 139 139 139 140 140 140 140 139 139 138
2201 138 137 137 137 137 137 137 138 138 138 138 138 139 140 141 140 139 139 139 140 140 140 140 139 139 139 139 140 141 142 142 143 143 144 143 143 143 143 142 141 141 140 140 141 141 141 141 141 141 140 139 138 138 140 141 142 142 142 142 142 141 140 139 138 138 138 139 140 141 141
$$ packed form
2252A40J%%%%%%Jjj%%J%%Jjjj%JJj%%%%%%%%%%%%%%%j%%%j%%j%%JJkj%%%jJ%JJ%J%j%%jj%
2244A36JJ%jJ%Jj%%j%%JJj%%%jj%JJJ%J%%%%%j%%%J%Jjj%jj%j%%J%J%Jj%%j%J%J%J%J%J%j
2237A41%j%%J%J%%J%%%%%Jjj%%%Jjj%%j%K%%%j%j%J%%%%jj%J%%JJ%%j%%%%%%j%%jJ%Jj%%%
2230A40%%jJJJJ%%jjjjJ%%JJJ%%%j%%j%j%%J%J%%JJj%%%%%%j%j%%jJ%%jj%%J%%JK%%jjj%j
2222A39%J%%j%%JJ%%%%j%%j%J%Jj%%%JJ%%j%%JJ%%jj%j%JJ%%%%%%%j%%J%%%jJJ%%jj%%%jj
2215A39%JJj%%%%%%%J%%Jj%%jJ%%JJj%%jkJ%%%%%%%J%j%%%%%%%Jj%%%%%%j%%%%%%%%%%%%J
2208A40%Jj%%%JJJJJkkjJJj%jjjjJ%%%JJJ%%jk%%JK%jj%%%J%%KJj%jj%jjj%JJ%%%J%%%j%j
2201A38j%%%%%J%%%%JJJjj%%J%%%j%%%JJJ%J%Jj%%%jj%j%J%%%%%jjj%KJJ%%%%jjjj%%JJJ%
$$ plain form
2193 141 141 140 140 139 139 139 138 138 139 139 139 140 139 139 139 139 140 141 141 141 140 139 139 140 142 142 141 139 138 138 138 139 139 138 138 138 139 141 141 140 140 140 141 142 141 140 140 141 142 141 140 141 142 141 140 139 139 139 139 138 138 138 138 138 139 140 140 140 140
2186 140 141 142 143 143 142 142 142 141 140 139 139 138 139 140 140 140 140 140 140 140 141 141 141 141 141 140 139 138 137 138 140 141 140 140 140 140 141 141 141 140 140 140 139 140 140 140 140 139 138 138 138 137 137 138 140 140 141 141 141 141 140 141 140 139 140 140 139 139 139
2179 139 139 139 138 137 137 137 139 140 140 140 140 140 139 139 139 138 137 137 138 140 139 139 139 140 139 139 139 138 139 140 141 141 139 138 138 138 137 137 138 139 140 140 141 141 140 139 140 140 141 141 141 141 140 140 140 139 140 140 140 141 141 139 138 137 137 137 138 139 140
2171 140 141 140 140 139 139 139 140 140 140 141 141 141 142 141 140 139 140 140 140 140 139 139 138 139 140 140 141 141 141 141 141 141 141 141 139 137 137 137 138 138 139 139 140 140 141 139 138 138 139 139 139 139 139 139 140 139 138 139 139 139 139 139 139 140 140 140 140 139 139
2164 139 139 139 139 139 139 139 139 139 139 140 140 141 141 141 141 141 141 141 141 142 142 141 140 140 139 139 139 139 140 141 141 141 141 141 142 142 141 140 139 139 139 139 138 137 136 136 136 137 136 136 136 136 135 135 136 137 137 137 137 137 137 138 138 138 139 139 139 139 140
2157 140 140 140 140 139 139 139 138 139 139 139 139 139 139 139 139 140 140 140 141 141 141 141 140 140 140 140 140 140 140 140 139 139 139 139 139 139 139 140 140 140 140 140 140 140 139 139 138 139 139 139 140 140 138 137 137 138 139 139 138 139 140 140 141 141 141 141 141 141 141
2149 141 141 142 142 142 142 143 141 140 139 138 139 139 140 141 141 142 142 142 142 141 141 140 139 139 139 139 139 140 139 138 139 140 140 139 139 140 140 140 140 139 139 140 139 138 138 137 137 137 137 136 137 137 137 138 138 137 136 138 139 139 139 138 137 137 137 138 138 139 139
2142 139 138 138 137 137 138 138 138 138 138 138 138 138 138 138 139 139 139 139 139 138 138 138 138 139 140 141 141 141 140 140 141 141 141 141 140 141 140 139 139 139 139 139 139 139 138 136 136 137 137 137 137 138 139 140 141 141 141 140 140 139 139 140 141 141 141 140 140 139 139
$$ packed form
2193A41%j%j%%j%J%%Jj%%%JJ%%jj%JK%jkj%%J%j%%JK%j%%JJjj%JJjjJJjjj%%%j%%%%JJ%%%
2186A40JJJ%j%%jjj%jJJ%%%%%%J%%%%jjjjJKJj%%%J%%j%%jJ%%%jj%%j%JK%J%%%jJjjJ%j%%
2179A39%%jj%%KJ%%%%j%%jj%JKj%%Jj%%jJJJ%kj%%j%JJJ%J%jjJ%J%%%j%%jJ%%J%kjj%%JJJ
2171A40Jj%j%%J%%J%%JjjjJ%%%j%jJJ%J%%%%%%%kk%%J%J%J%Jkj%J%%%%%JjjJ%%%%%J%%%j%
2164A39%%%%%%%%%J%J%%%%%%%J%jj%j%%%JJ%%%%J%jjj%%%jjj%%Jj%%%j%JJ%%%%%J%%J%%%J
2157A40%%%j%%jJ%%%%%%%J%%J%%%j%%%%%%%j%%%%%%J%%%%%%j%jJ%%J%kj%JJ%jJJ%J%%%%%%
2149A41%J%%%JkjjjJ%JJ%J%%%j%jj%%%%JjjJJ%j%J%%%j%Jjj%j%%%jJ%%J%jjKJ%%jj%%J%J%
2142A39j%j%J%%%%%%%%%J%%%%j%%%JJJ%%j%J%%%jJjj%%%%%%jk%J%%%JJJJ%%j%j%JJ%%j%j%
$$ plain form
2135 139 138 138 139 139 139 139 139 139 138 139 139 139 139 140 142 141 139 138 138 138 138 138 138 138 137 138 138 139 139 139 138 138 138 138 139 139 140 140 140 140 140 140 139 139 138 138 139 139 138 138 137 136 136 135 135 135 135 135 136 137 138 139 141 142 143 143 142 142 140
2127 140 139 139 138 138 138 140 141 141 141 140 140 140 140 141 141 140 139 138 139 140 140 141 141 140 139 139 139 139 140 140 140 140 139 139 139 138 138 138 138 139 140 140 139 138 138 138 137 138 138 139 139 139 140 140 140 140 139 139 139 139 139 138 138 138 137 136 137 137 137
2120 137 138 138 137 137 136 135 136 137 137 138 138 139 139 139 139 138 139 140 139 139 138 137 137 136 137 138 140 141 140 139 138 139 138 138 139 139 138 138 138 139 139 139 139 138 138 138 139 140 139 138 139 139 138 139 141 141 141 142 142 142 142 142 141 140 140 140 139 138 139
2113 139 140 140 140 139 138 138 138 137 137 138 139 139 139 139 138 138 138 138 138 138 138 139 139 138 137 136 136 137 138 139 140 140 139 138 138 138 138 138 138 138 138 138 138 138 139 139 139 139 139 139 138 137 137 138 138 139 140 139 139 139 139 138 138 139 139 139 137 137 138
2106 138 138 138 138 138 139 140 140 140 140 140 139 139 140 141 141 141 141 141 139 138 138 139 139 138 138 139 140 139 138 138 138 137 137 138 138 138 138 138 138 138 138 139 139 139 139 139 139 139 139 138 138 138 137 138 138 138 138 139 139 140 140 139 138 139 139 139 139 138 138
2098 138 138 140 140 141 140 139 138 138 138 139 140 139 139 139 139 139 138 138 138 137 137 138 139 139 138 138 138 138 138 138 137 138 138 138 139 139 139 138 138 138 138 137 137 137 138 138 138 138 137 136 137 137 138 139 139 139 139 139 139 138 137 138 138 139 139 139 138 137 137
2091 137 137 137 137 136 136 136 136 135 135 135 136 137 139 139 140 139 138 138 138 139 138 138 137 136 136 136 137 137 137 138 138 137 137 137 138 139 138 138 137 137 137 136 137 137 137 137 138 139 139 138 138 139 139 140 139 139 139 138 136 136 136 136 136 137 137 138 140 139 138
2084 138 138 139 139 139 139 139 139 138 138 138 137 137 137 137 138 138 138 138 138 138 138 138 138 139 139 138 138 138 137 138 138 138 138 138 138 137 136 137 137 138 138 138 137 137 137 137 137 137 137 137 138 138 139 139 139 139 139 138 137 137 138 138 139 138 136 135 137 138 138
$$ packed form
2135A39j%J%%%%%jJ%%%JKjkj%%%%%%jJ%J%%j%%%J%J%%%%%j%j%J%j%jj%j%%%%JJJJKJJ%j%k
2127A40j%j%%KJ%%j%%%J%jjjJJ%J%jj%%%J%%%j%%j%%%JJ%jj%%jJ%J%%J%%%j%%%%j%%jjJ%%
2120A37J%j%jjJJ%J%J%%%jJJj%jj%jJJKJjjjJj%J%j%%J%%%j%%JJjjJ%jJK%%J%%%%jj%%jjJ
2113A39J%%jj%%j%JJ%%%j%%%%%%J%jjj%JJJJ%jj%%%%%%%%%%J%%%%%jj%J%JJj%%%j%J%%k%J
2106A38%%%%JJ%%%%j%JJ%%%%kj%J%j%JJjj%%j%J%%%%%%%J%%%%%%%j%%jJ%%%J%J%jjJ%%%j%
2098A38%K%Jjjj%%JJj%%%%j%%j%JJ%j%%%%%jJ%%J%%j%%%j%%J%%%jjJ%JJ%%%%%jjJ%J%%jj%
2091A37%%%j%%%j%%JJK%Jjj%%Jj%jj%%J%%J%j%%JJj%j%%jJ%%%JJ%j%J%Jj%%jk%%%%J%JKjj
2084A38%J%%%%%j%%j%%%J%%%%%%%%J%j%%jJ%%%%%jjJ%J%%j%%%%%%%J%J%%%%jj%J%JjkjKJ%
$$ plain form
2076 138 138 138 138 137 137 137 137 138 138 138 137 137 138 139 138 138 138 138 139 139 138 138 137 137 136 135 136 137 138 138 138 137 138 139 140 139 138 139 138 138 138 138 137 137 138 140 140 139 138 137 138 138 138 138 138 138 138 138 137 137 136 135 135 135 137 139 139 139 140
2069 140 140 140 141 140 140 139 139 139 139 138 138 138 139 139 139 138 137 138 138 139 140 139 139 139 138 138 139 139 140 140 140 141 142 142 142 141 140 139 138 138 137 137 136 136 136 137 137 137 137 137 138 139 139 139 138 138 137 138 140 140 140 140 140 140 140 141 141 141 140
2062 140 139 139 138 138 137 136 136 137 138 138 138 138 138 138 139 139 139 140 140 140 140 140 139 138 137 137 137 137 137 138 138 138 138 138 138 138 138 138 138 139 138 138 138 138 139 140 140 140 139 139 139 138 138 138 139 140 140 139 138 137 138 138 138 138 138 138 138 138 138
2054 138 139 140 139 139 138 138 138 138 138 139 138 137 136 136 135 135 135 137 139 139 138 138 137 136 137 137 137 137 137 137 137 137 137 138 138 139 139 139 139 138 138 138 137 137 136 136 136 136 136 136 136 138 139 140 141 141 140 138 138 139 139 139 139 139 138 138 137 136 135
2047 135 136 136 136 137 138 139 138 136 136 137 137 138 138 138 138 138 139 140 139 139 138 137 137 136 136 136 136 136 136 136 137 137 136 136 135 135 136 137 138 138 139 139 138 138 137 138 138 137 137 137 137 138 139 139 140 140 139 138 137 138 138 137 136 135 136 137 137 137 137
2040 137 137 137 137 137 137 137 137 136 136 136 136 135 134 135 136 136 136 136 136 136 135 136 136 136 137 137 137 138 138 137 136 135 135 135 136 135 135 135 135 135 135 136 137 139 139 138 137 138 139 139 139 139 138 138 138 139 138 137 137 138 138 138 138 138 138 139 139 138 137
2032 137 137 136 136 136 137 137 138 138 138 138 137 136 136 136 136 136 136 137 138 139 139 138 136 135 135 136 137 138 138 138 138 138 137 137 137 136 134 135 136 137 138 137 137 137 138 137 137 136 135 135 135 135 135 135 136 137 138 138 138 138 138 137 136 135 135 135 135 136 136
2025 136 137 136 136 136 136 136 136 135 135 134 133 135 136 136 137 136 135 135 135 135 136 136 136 137 137 137 137 137 137 136 136 136 136 137 138 138 138 139 139 139 139 137 136 135 134 135 136 137 137 136 137 138 138 138 138 137 137 137 137 137 138 138 139 138 138 139 139 139 139
$$ packed form
2076A38%%%j%%%J%%j%JJj%%%J%j%j%jjJJJ%%jJJJjjJj%%%j%JK%jjjJ%%%%%%%j%jj%%KK%%J
2069A40%%Jj%j%%%j%%J%%jjJ%JJj%%j%J%J%%JJ%%jjjj%j%j%%J%%%%JJ%%j%jJK%%%%%%J%%j
2062A40j%j%jj%JJ%%%%%J%%J%%%%jjj%%%%J%%%%%%%%%Jj%%%JJ%%j%%j%%JJ%jjjJ%%%%%%%%
2054A38JJj%j%%%%Jjjj%j%%KK%j%jjJ%%%%%%%%J%J%%%j%%j%j%%%%%%KJJJ%jk%J%%%%j%jjj
2047A35J%%JJJjk%J%J%%%%JJj%jj%j%%%%%%J%j%j%JJJ%J%j%jJ%j%%%JJ%J%jjjJ%jjjJJ%%%
2040A37%%%%%%%j%%%jjJJ%%%%%jJ%%J%%J%jjj%%Jj%%%%%JJK%jjJJ%%%j%%Jjj%J%%%%%J%jj
2032A37%j%%J%J%%%jj%%%%%JJJ%jkj%JJJ%%%%j%%jkJJJJj%%Jj%jj%%%%%JJJ%%%%jjj%%%J%
2025A36Jj%%%%%j%jjKJ%Jjj%%%J%%J%%%%%j%%%JJ%%J%%%kjjjJJJ%jJJ%%%j%%%%J%Jj%J%%%
$$ plain form
2018 139 139 139 138 138 138 137 136 136 136 137 137 137 136 135 135 137 138 138 137 137 137 138 138 138 137 137 137 137 137 137 137 137 137 137 137 137 138 138 139 139 139 139 139 138 138 138 139 139 139 139 139 139 138 138 138 138 138 139 137 136 137 138 138 138 137 138 138 138 139
2010 139 138 137 137 137 137 137 138 138 139 139 140 140 140 141 140 140 139 138 138 139 139 139 138 137 137 137 138 139 139 138 138 139 140 140 139 139 139 139 138 139 140 139 138 138 139 139 139 139 139 139 138 138 138 139 140 139 139 139 138 138 138 138 138 138 138 139 139 138 138
2003 138 138 138 137 137 137 137 138 139 138 138 137 137 137 137 136 135 136 136 136 135 134 135 136 137 137 137 137 137 137 138 138 137 136 136 136 136 136 136 136 137 138 138 138 138 139 139 139 140 140 140 140 140 139 139 140 140 139 138 138 139 139 139 139 138 139 140 140 139 139
1996 139 139 138 137 136 135 134 134 136 137 137 137 138 139 139 137 136 135 136 136 137 136 136 135 135 135 136 136 137 137 137 136 136 135 135 135 134 135 135 136 136 136 136 136 135 135 135 134 135 137 139 139 138 137 138 138 138 138 138 137 137 137 136 135 135 136 136 136 136 135
1989 135 136 136 136 137 136 135 135 135 136 137 137 137 136 135 136 136 136 136 136 136 136 135 135 136 137 138 138 137 137 136 137 137 136 135 136 137 138 139 139 138 138 137 136 136 136 136 135 135 136 136 136 135 135 136 135 135 137 137 137 137 136 135 135 136 136 137 137 136 134
1981 134 134 135 136 138 139 140 141 139 138 138 137 137 137 137 136 136 137 138 139 138 137 136 135 135 136 136 136 136 136 137 137 137 138 137 137 136 136 136 135 136 136 136 137 137 138 138 138 138 138 137 137 136 136 136 135 136 136 136 136 137 138 138 136 135 134 135 134 133 134
1974 134 135 135 135 135 135 136 136 136 136 136 136 136 135 135 136 136 136 136 136 136 137 138 138 138 137 136 136 137 136 136 135 135 135 133 132 133 134 135 136 136 136 136 136 137 138 137 136 136 136 136 136 136 136 136 136 137 138 138 138 136 135 136 137 136 137 137 137 137 136
1967 136 136 136 135 135 135 135 135 135 134 133 134 135 135 135 136 135 135 135 136 137 137 138 138 137 137 139 139 139 138 138 137 137 137 137 137 137 137 137 137 136 136 136 135 136 138 138 137 136 136 136 137 138 138 138 138 137 136 136 136 137 137 137 137 136 136 136 135 135 135
$$ packed form
2018A39%%j%%jj%%J%%jj%KJ%j%%J%%j%%%%%%%%%%%J%J%%%%j%%J%%%%%j%%%%JkjJJ%%jJ%%J
2010A39jj%%%%J%J%J%%Jj%jj%J%%jj%%JJ%j%JJ%j%%%jJJjj%J%%%%%j%%JJj%%j%%%%%%J%j%
2003A38%%j%%%JJj%j%%%jjJ%%jjJJJ%%%%%J%jj%%%%%%JJ%%%J%%J%%%%j%J%jj%J%%%jJJ%j%
1996A39%jjjjj%KJ%%JJ%kjjJ%Jj%j%%J%J%%j%j%%jJ%J%%%%j%%jJKK%jjJ%%%%j%%jj%J%%%j
1989A35J%%Jjj%%JJ%%jjJ%%%%%%j%JJJ%j%jJ%jjJJJJ%j%jj%%%j%J%%j%Jj%K%%%jj%J%J%jk
1981A34%JJKJJJkj%j%%%j%JJJjjjj%J%%%%J%%Jj%j%%jJ%%J%J%%%%j%j%%jJ%%%JJ%kjjJjjJ
1974A34J%%%%J%%%%%%j%J%%%%%JJ%%jj%Jj%j%%kjJJJJ%%%%JJjj%%%%%%%%JJ%%kjJJjJ%%%j
1967A36%%j%%%%%jjJJ%%Jj%%JJ%J%j%K%%j%j%%%%%%%%j%%jJK%jj%%JJ%%%jj%%J%%%j%%j%%
$$ plain form
1959 135 135 135 136 136 138 139 138 137 136 135 135 135 135 135 136 136 135 135 135 134 135 135 135 134 133 133 133 134 134 134 134 134 135 136 135 135 135 134 134 134 135 135 135 135 134 134 134 135 134 133 132 133 133 133 134 135 135 134 134 133 134 135 135 135 135 135 135 135 135
1952 135 136 136 137 136 136 135 135 135 134 135 136 136 136 135 135 135 135 135 136 136 136 135 135 134 135 136 137 137 138 137 136 135 134 135 136 137 138 137 137 137 137 137 137 138 138 136 134 134 133 134 134 134 134 135 135 135 136 136 137 137 136 136 136 136 136 135 135 137 137
1945 137 137 138 137 137 136 134 135 135 134 134 134 135 135 136 136 135 135 135 136 136 137 137 136 136 135 135 135 135 136 135 136 136 136 136 136 136 136 136 136 136 135 135 135 136 136 136 136 136 136 136 136 136 136 136 137 137 138 138 138 138 138 138 137 136 137 138 137 137 137
1937 137 137 137 137 136 136 136 136 136 136 136 137 137 137 137 137 137 136 137 136 135 134 135 135 136 137 137 137 137 137 137 137 136 136 135 135 135 134 135 135 135 135 136 136 137 137 138 137 137 137 138 137 138 138 138 138 138 138 137 136 134 134 135 135 136 137 137 137 137 136
1930 136 137 138 138 139 138 137 138 138 137 136 136 135 135 135 135 136 137 138 137 137 137 137 139 140 140 140 139 138 138 137 138 138 138 138 137 137 136 135 136 136 136 136 136 135 135 134 135 135 136 136 136 136 136 137 137 137 137 137 136 136 136 136 135 135 135 135 135 135 136
1923 136 136 136 136 136 135 135 135 135 135 134 134 135 136 135 134 135 135 135 136 135 135 135 134 134 135 136 136 135 135 135 135 135 135 135 135 135 134 133 133 133 134 135 135 136 137 137 138 137 136 136 137 137 136 135 136 136 136 136 136 137 137 138 138 138 137 137 137 136 137
1915 137 137 137 136 136 135 135 135 136 137 137 137 136 135 135 135 135 134 134 135 135 135 135 136 136 136 136 135 134 135 135 135 135 135 135 136 137 137 136 135 134 134 134 135 135 136 136 136 136 136 136 136 137 137 137 137 137 137 136 136 136 135 135 136 136 137 137 137 136 136
1908 136 136 135 135 135 134 134 134 133 133 134 133 133 134 135 136 136 136 136 136 137 137 138 138 138 138 137 137 136 136 135 135 135 135 135 135 134 134 134 134 135 135 135 135 135 135 135 135 135 135 134 134 135 135 136 136 136 135 135 135 135 135 136 136 137 137 137 137 136 136
$$ packed form
1959A35%%J%KJjjjj%%%%J%j%%jJ%%jj%%J%%%%JJj%%j%%J%%%j%%JjjjJ%%JJ%j%jJJ%%%%%%%
1952A35J%Jj%j%%jJJ%%j%%%%J%%j%jJJJ%JjjjjJJJJj%%%%%J%kk%jJ%%%J%%J%J%j%%%%j%K%
1945A37%Jj%jkJ%j%%J%J%j%%J%J%j%j%%%JjJ%%%%%%%%%j%%J%%%%%%%%%%J%J%%%%%jjJJj%%
1937A37%%%j%%%%%%J%%%%%jJjjjJ%JJ%%%%%%j%j%%jJ%%%J%J%Jj%%JjJ%%%%%jjk%J%JJ%%%j
1930A36JJ%JjjJ%jj%j%%%JJJj%%%KJ%%jj%jJ%%%j%jjJ%%%%j%jJ%J%%%%J%%%%j%%%j%%%%%J
1923A36%%%%j%%%%j%JJjjJ%%Jj%%j%JJ%j%%%%%%%%jj%%JJ%JJ%Jjj%J%jjJ%%%%J%J%%j%%jJ
1915A37%%j%j%%JJ%%jj%%%j%J%%%J%%%jjJ%%%%%JJ%jjj%%J%J%%%%%%J%%%%%j%%j%J%J%%j%
1908A36%j%%j%%j%Jj%JJJ%%%%J%J%%%j%j%j%%%%%j%%%J%%%%%%%%%j%J%J%%j%%%%J%J%%%j%
$$ plain form
1901 136 135 135 133 133 134 135 136 137 136 136 136 135 134 134 133 133 132 132 133 135 134 134 133 133 134 135 135 134 135 135 136 137 136 136 136 135 135 135 135 135 135 136 137 138 137 136 135 134 135 135 136 136 137 137 138 138 138 138 139 140 138 137 137 136 136 136 136 135 136
1893 136 136 136 136 135 134 135 135 135 135 135 134 134 134 134 134 134 135 136 135 134 134 134 135 136 136 135 134 134 134 134 134 135 135 135 136 136 136 135 135 136 136 136 136 137 137 137 137 137 138 138 137 135 134 133 133 134 135 135 136 136 136 135 135 135 135 136 136 135 135
1886 135 136 136 136 136 136 136 135 135 134 133 134 135 136 137 137 136 135 134 133 133 133 132 131 132 133 133 135 137 136 135 135 135 134 134 134 134 134 134 135 136 137 137 136 135 135 134 134 133 133 133 134 134 134 135 135 134 133 133 135 135 134 134 134 133 133 132 133 133 135
1879 135 136 137 137 135 134 133 133 134 134 135 135 134 134 134 134 134 135 136 136 137 137 136 135 134 134 134 135 134 134 135 136 137 137 136 135 135 134 134 135 135 136 135 135 134 134 133 135 137 137 136 136 135 135 135 134 134 134 134 134 134 134 134 134 134 134 133 132 132 133
1872 133 133 133 132 132 133 133 134 134 135 136 136 135 135 136 136 136 136 136 135 134 133 132 132 133 133 133 133 133 134 135 135 135 134 134 134 133 134 134 136 138 137 136 136 137 137 137 136 137 137 136 135 135 134 133 132 133 133 134 134 133 133 132 132 133 133 133 133 133 134
1864 134 134 135 135 136 136 136 137 137 137 136 135 134 134 135 136 137 137 136 135 135 134 134 134 135 135 134 134 134 134 135 135 134 133 133 134 133 132 131 131 132 134 135 134 133 133 133 134 134 135 134 133 133 133 133 134 135 136 136 136 136 136 136 136 136 135 136 136 134 133
1857 133 133 133 133 134 133 133 133 133 133 133 134 134 134 135 135 136 135 135 135 135 134 135 135 135 135 135 136 136 136 136 136 135 135 134 134 133 134 135 136 137 136 135 135 136 137 137 136 135 133 134 134 134 134 134 135 135 136 136 136 137 137 137 137 137 135 134 134 133 134
1850 134 135 136 135 134 134 135 134 134 133 134 134 133 132 131 133 134 135 135 135 134 133 133 133 133 132 132 133 133 134 135 136 135 134 135 135 135 135 135 136 136 135 135 135 135 135 135 134 134 133 134 133 133 134 135 136 135 134 134 133 134 135 135 135 135 135 135 135 135 135
$$ packed form
1901A36j%k%JJJJj%%jj%j%j%JKj%j%JJ%jJ%JJj%%j%%%%%JJJjjjjJ%J%J%J%%%JJkj%j%%%jJ
1893A36%%%jjJ%%%%j%%%%%JJjj%%JJ%jj%%%%J%%J%%j%J%%%J%%%%J%jkjj%JJ%J%%j%%%J%j%
1886A35J%%%%%j%jjJJJJ%jjjj%%jjJJ%KKjj%%j%%%%%JJJ%jj%j%j%%J%%J%jj%K%j%%j%jJ%K
1879A35JJ%kjj%J%J%j%%%%JJ%J%jjj%%Jj%JJJ%jj%j%J%Jj%j%jKK%j%j%%j%%%%%%%%%%jj%J
1872A33%%j%J%J%JJ%j%J%%%%jjjj%J%%%%JJ%%j%%jJ%KKjj%J%%jJ%jj%jjjJ%J%j%j%J%%%%J
1864A34%J%J%%J%%jjj%JJJ%jj%j%%J%j%%%J%jj%Jjjj%JKJjj%%J%Jjj%%%JJJ%%%%%%%jJ%kj
1857A33%%%Jj%%%%%J%%J%Jj%%%jJ%%%%J%%%%j%j%jJJJJjj%JJ%jjkJ%%%%J%J%%J%%%%kj%jJ
1850A34JJjj%Jj%jJ%jjjKJJ%%jj%%%j%J%JJJjjJ%%%%J%j%%%%%j%jJj%JJJjj%jJJ%%%%%%%%
$$ plain form
1842 135 135 136 135 134 134 134 134 134 133 132 133 134 134 135 135 134 133 133 133 133 134 134 135 135 134 134 133 133 133 133 133 133 134 135 136 137 138 138 137 137 136 136 135 135 134 134 133 133 132 132 132 132 134 135 136 136 137 136 135 135 135 135 135 135 134 134 133 133 133
1835 133 134 134 135 134 134 134 134 135 135 135 135 134 133 133 133 133 133 133 133 133 133 132 132 133 133 134 134 135 135 135 135 136 136 136 137 136 135 133 132 132 132 132 133 132 132 133 134 135 136 137 137 137 136 135 135 134 134 133 133 133 133 133 133 133 133 133 133 133 134
1828 134 134 133 133 133 132 132 132 131 132 133 134 134 134 133 133 132 133 133 134 134 133 132 132 132 132 132 132 132 133 134 135 136 135 135 134 134 135 134 133 133 132 132 133 134 135 136 137 136 135 134 134 136 136 137 137 137 137 137 137 138 137 137 136 136 136 135 136 136 135
1820 135 135 135 135 135 136 135 135 134 135 136 136 137 138 136 135 135 135 135 136 135 134 133 134 135 136 136 135 136 137 136 136 136 136 136 136 137 138 138 138 138 137 136 136 137 137 137 137 137 137 137 137 136 136 136 135 134 134 134 136 137 137 136 137 137 138 138 138 138 138
1813 138 138 138 137 137 137 137 137 137 137 137 136 135 135 135 136 136 137 137 137 136 134 134 133 132 131 132 133 133 134 135 135 135 135 136 136 135 134 134 134 133 134 135 135 134 134 135 136 136 136 136 135 135 135 134 134 134 133 133 132 132 133 134 133 133 134 135 135 136 137
1806 137 136 136 136 137 136 136 137 137 137 137 137 137 137 138 139 138 136 136 136 136 136 137 138 137 136 136 135 135 136 137 136 136 135 134 134 133 133 134 134 135 136 135 134 133 133 133 133 133 133 133 133 134 133 133 133 133 133 133 133 133 133 133 133 133 133 133 133 132 132
1798 132 132 132 132 132 133 134 135 134 134 134 135 134 133 132 132 132 133 133 134 134 135 136 136 136 136 136 135 134 132 131 131 130 130 130 130 131 132 132 132 133 133 134 134 134 135 136 136 135 135 136 137 136 136 135 135 134 134 134 134 134 134 133 133 134 134 134 133 132 131
1791 131 130 131 131 131 132 132 133 133 134 133 133 133 133 133 132 131 130 130 131 131 131 132 132 133 134 133 133 132 132 132 132 132 132 133 133 134 134 135 135 135 135 135 135 135 134 134 133 133 134 135 135 135 134 133 132 133 134 134 133 133 133 133 133 133 133 134 134 135 135
$$ packed form
1842A35%Jjj%%%%jjJJ%J%jj%%%J%J%j%j%%%%%JJJJJ%j%j%j%j%j%j%%%KJJ%Jjj%%%%%j%j%%
1835A33J%Jj%%%J%%%jj%%%%%%%%j%J%J%J%%%J%%Jjjkj%%%Jj%JJJJJ%%jj%j%j%%%%%%%%%%J
1828A34%j%%j%%jJJJ%%j%jJ%J%jj%%%%%%JJJJj%j%Jjj%j%JJJJJjjj%K%J%%%%%Jj%j%%jJ%j
1820A35%%%%Jj%jJJ%JJkj%%%JjjjJJJ%jJJj%%%%%JJ%%%jj%J%%%%%%%j%%jj%%KJ%jJ%J%%%%
1813A38%%j%%%%%%%jj%%J%J%%jk%jjjJJ%JJ%%%J%jj%%jJJ%j%JJ%%%j%%j%%j%j%JJj%JJ%JJ
1806A37j%%Jj%J%%%%%%JJjk%%%%JJjj%j%JJj%jj%j%J%JJjjj%%%%%%%Jj%%%%%%%%%%%%%%j%
1798A32%%%%JJJj%%Jjjj%%J%J%JJ%%%%jjkj%j%%%JJ%%J%J%%JJ%j%JJj%j%j%%%%%j%J%%jjj
1791A31jJ%%J%J%Jj%%%%jjj%J%%J%JJj%j%%%%%J%J%J%%%%%%j%j%JJ%%jjjJJ%j%%%%%%J%J%
$$ plain form
1784 135 135 135 135 135 133 134 135 135 134 134 135 135 134 133 132 132 132 132 133 133 133 133 133 133 132 133 133 133 133 133 134 134 134 134 134 135 134 133 133 133 133 132 131 132 133 133 134 134 134 134 133 132 133 134 134 132 132 132 131 131 131 131 131 131 131 132 133 133 133
1776 133 133 133 133 132 132 132 133 133 134 134 134 133 132 133 133 134 135 135 134 133 134 134 134 134 134 134 134 133 132 132 133 134 134 134 134 134 134 135 136 134 133 133 133 132 132 133 134 135 136 136 136 135 135 134 133 133 133 133 132 133 134 135 134 133 133 133 133 133 133
1769 133 134 134 134 133 134 133 133 133 133 133 133 133 134 134 134 134 133 132 132 132 133 133 132 132 133 133 131 131 131 132 134 135 135 135 135 134 134 133 132 133 133 133 133 133 133 133 133 133 133 133 132 131 130 129 130 131 131 132 132 132 132 132 132 132 132 131 131 131 131
1762 131 131 132 133 133 133 132 132 131 130 131 132 133 133 133 134 134 134 134 134 134 134 134 133 133 133 132 132 131 131 131 132 132 132 133 132 132 132 132 132 132 132 132 132 133 133 133 133 133 132 132 132 131 131 131 132 132 132 133 133 132 131 131 130 131 132 132 132 133 133
1755 133 133 132 132 131 132 132 131 131 131 131 132 133 134 134 134 134 133 132 132 131 132 132 133 134 134 135 135 133 132 130 130 130 130 131 131 130 131 132 132 134 133 132 132 133 133 134 134 133 133 132 132 132 133 133 134 134 134 135 135 134 134 134 134 134 134 133 132 133 132
1747 132 131 131 131 131 131 131 131 132 132 132 132 133 134 135 135 135 135 134 133 132 131 131 131 132 133 133 133 133 134 133 133 133 134 133 133 132 131 131 131 132 133 132 132 132 132 132 131 131 131 132 133 132 131 130 129 129 130 130 130 130 131 131 131 132 132 131 131 132 132
1740 132 132 131 131 131 131 131 132 132 131 131 131 130 130 131 131 131 131 132 132 132 132 131 131 132 132 133 132 132 132 133 133 133 134 133 133 134 134 134 134 133 133 132 132 131 131 131 131 130 131 132 131 131 131 132 132 132 132 131 130 130 130 130 130 131 130 131 132 132 131
1733 131 131 131 132 134 135 134 134 133 132 132 131 131 132 133 132 133 133 132 131 130 130 130 131 132 132 132 132 132 132 133 133 133 132 131 130 130 129 130 131 130 130 130 130 131 131 132 133 133 133 132 132 132 132 134 135 135 134 133 132 131 132 133 133 131 130 131 132 132 133
$$ packed form
1784A35%%%%kJJ%j%J%jjj%%%J%%%%%jJ%%%%J%%%%Jjj%%%jjJJ%J%%%jjJJ%k%%j%%%%%%JJ%%
1776A33%%%j%%J%J%%jjJ%JJ%jjJ%%%%%%jj%JJ%%%%%JJkj%%j%JJJJ%%j%jj%%%jJJJjj%%%%%
1769A33J%%jJj%%%%%%J%%%jj%%J%j%J%k%%JKJ%%%j%jjJ%%%%%%%%%%jjjjJJ%J%%%%%%%j%%%
1762A31%JJ%%j%jjJJJ%%J%%%%%%%j%%j%j%%J%%Jj%%%%%%%%J%%%%j%%j%%J%%J%jj%jJJ%%J%
1755A33%j%jJ%j%%%JJJ%%%jj%jJ%JJ%J%kjk%%%J%jJJ%Kjj%J%J%j%j%%J%J%%J%j%%%%%jjJj
1747A32j%%%%%%J%%%JJJ%%%jjjj%%JJ%%%Jj%%Jj%jj%%JJj%%%%j%%JJjjjj%J%%%J%%J%j%J%
1740A32%j%%%%J%j%%j%J%%%J%%%j%J%Jj%%J%%Jj%J%%%j%j%j%%%jJJj%%J%%%jj%%%%JjJJ%j
1733A31%%JKJj%jj%j%JJjJ%jjj%%JJ%%%%%J%%jjj%jJJj%%%J%JJ%%j%%%KJ%jjjjJJ%kjJJ%J
$$ plain form
1725 133 133 132 131 130 131 131 132 132 132 131 131 131 131 132 132 133 133 134 134 135 134 134 134 134 133 132 132 132 131 130 131 132 132 132 131 131 131 131 132 132 132 132 132 132 132 132 131 131 131 131 133 132 131 130 130 129 129 129 130 130 130 130 130 131 131 130 129 128 129
1718 129 129 131 132 133 133 133 133 132 132 132 132 132 133 132 132 131 130 130 131 129 128 129 129 130 131 132 133 133 133 132 131 131 131 130 129 129 130 130 130 130 131 131 131 130 130 130 131 130 131 132 131 131 131 130 129 129 129 130 130 131 131 132 131 131 131 132 133 133 133
1711 133 132 132 131 131 131 131 131 132 132 133 132 132 131 131 131 131 130 130 130 130 131 132 133 132 131 131 131 131 131 131 131 132 132 132 132 132 132 133 132 132 132 132 131 130 131 131 132 133 133 133 132 131 131 131 132 132 131 131 130 130 130 130 131 132 131 131 132 132 132
1703 132 132 132 133 135 135 133 133 133 134 133 132 132 133 133 132 131 131 131 129 129 128 128 127 126 125 126 127 127 128 128 129 129 130 130 130 129 129 130 131 132 131 131 130 129 129 130 129 128 127 127 126 128 129 130 131 131 131 131 131 132 132 131 131 130 129 129 130 131 131
1696 131 130 129 129 129 130 131 131 132 133 133 133 134 133 132 132 132 133 133 132 131 131 131 130 130 130 129 131 132 132 133 133 133 132 132 132 131 132 132 132 131 131 131 132 132 132 131 130 129 129 128 129 130 131 131 131 132 131 130 130 130 131 131 132 132 133 133 132 131 130
1689 130 129 130 131 131 132 133 132 131 130 130 130 130 130 130 130 131 130 130 132 133 133 132 131 130 130 131 132 131 131 131 131 132 133 133 132 131 131 130 131 132 131 131 130 130 129 129 129 129 129 130 130 130 130 131 131 131 130 131 131 131 131 131 132 133 133 133 132 132 132
1681 132 132 132 132 132 132 131 131 131 131 130 130 129 129 130 130 130 130 130 130 131 131 132 132 132 132 131 131 131 130 128 127 128 129 131 131 129 129 130 131 130 129 128 129 130 130 130 130 129 129 129 129 129 129 129 129 128 127 128 129 129 130 131 130 130 130 131 132 132 133
1674 133 133 132 131 131 131 131 131 132 132 132 132 131 131 131 132 132 132 131 130 131 131 131 131 130 130 130 130 130 130 129 129 130 130 131 132 131 131 131 130 129 128 128 127 128 129 129 129 129 129 129 129 129 129 130 130 130 130 129 129 128 127 127 128 128 129 130 131 130 130
$$ packed form
1725A33%jjjJ%J%%j%%%J%J%J%Jj%%%jj%%jjJJ%%j%%%J%%%%%%%j%%%Kjjj%j%%J%%%%J%jjjJ
1718A29%KJJ%%%j%%%%Jj%jj%JkjJ%JJJJ%%jj%%jj%J%%%J%%j%%JjJJj%%jj%%J%J%Jj%%JJ%%
1711A33j%j%%%%J%Jj%j%%%j%%%JJJjj%%%%%%J%%%%%Jj%%%jjJ%JJ%%jj%%J%j%j%%%JJj%J%%
1703A32%%JK%k%%Jjj%J%jj%%k%j%jjjJJ%J%J%J%%j%JJJj%jj%Jjjj%jKJJJ%%%%J%j%jj%JJ%
1696A31jj%%JJ%JJ%%Jjj%%J%jj%%j%%jKJ%J%%j%%jJ%%j%%J%%jjj%jJJJ%%Jjj%%J%J%J%jjj
1689A30jJJ%JJjjj%%%%%%Jj%KJ%jjj%JJj%%%JJ%jj%jJJj%j%j%%%%J%%%J%%jJ%%%%JJ%%j%%
1681A32%%%%%j%%%j%j%J%%%%%J%J%%%j%%jkjJJK%k%JJjjjJJ%%%j%%%%%%%jjJJ%JJj%%JJ%J
1674A33%jj%%%%J%%%j%%J%%jjJ%%%j%%%%%j%J%JJj%%jjj%jJJ%%%%%%%%J%%%j%jj%J%JJJj%
$$ plain form
1667 130 129 129 130 131 131 132 131 131 130 129 129 129 129 130 129 129 129 130 130 131 130 130 131 131 131 131 130 129 130 132 134 134 134 133 132 131 131 130 129 129 129 128 128 128 129 131 131 131 131 131 131 131 132 133 133 133 132 132 132 132 132 132 132 132 132 132 131 131 131
1660 131 131 131 131 132 133 133 133 132 132 131 131 130 129 129 130 130 129 128 129 129 130 131 132 132 132 132 132 132 132 133 131 130 130 129 130 130 130 131 131 131 131 132 133 132 130 130 129 129 128 129 131 133 133 132 131 131 131 130 130 131 132 133 134 133 133 134 134 134 133
1652 133 133 132 132 132 132 133 133 133 133 134 134 134 134 135 134 134 134 136 137 138 138 139 139 139 139 138 138 137 137 136 135 136 136 135 134 134 134 134 133 133 132 132 131 132 132 132 131 131 130 130 130 130 130 131 131 131 132 132 132 132 133 134 133 132 132 132 133 134 135
1645 135 135 135 135 136 136 136 135 136 137 137 138 139 139 140 141 142 142 143 145 145 145 146 147 146 146 144 143 143 143 143 143 143 143 143 142 141 141 141 140 139 138 137 135 134 132 132 132 132 132 132 132 131 131 131 131 131 132 133 133 134 134 135 134 134 134 134 134 134 133
1638 133 133 133 133 133 133 133 133 133 134 134 134 135 135 135 135 135 135 135 135 135 135 136 136 137 137 137 138 137 136 137 136 136 136 136 136 135 134 133 133 133 132 131 131 130 130 130 130 130 130 129 129 129 129 130 131 132 132 132 131 131 131 130 130 130 131 132 132 131 132
1630 132 132 132 132 131 131 131 131 130 130 130 130 130 131 131 130 129 129 127 126 125 126 127 127 127 126 126 128 129 130 131 131 131 131 131 130 131 131 130 130 129 129 129 128 130 131 130 130 130 128 128 128 129 131 131 131 130 129 129 129 129 129 129 129 129 130 130 130 130 130
1623 130 129 129 128 128 128 128 128 128 127 126 126 127 128 129 128 128 127 126 127 127 128 129 128 127 128 128 127 127 126 126 126 127 127 127 128 128 128 129 128 128 128 127 127 127 127 128 129 129 128 127 126 126 126 125 126 126 127 127 127 127 127 128 128 129 129 129 129 128 128
1616 128 128 127 127 126 125 126 127 128 128 128 128 127 126 126 125 125 126 126 127 127 127 128 127 126 126 128 129 130 130 130 130 128 127 126 126 127 127 128 128 128 129 129 130 130 130 130 131 132 131 129 128 129 129 128 128 129 130 130 130 130 130 130 130 130 130 131 131 130 129
$$ packed form
1667A30j%JJ%Jj%jj%%%Jj%%J%Jj%J%%%jjJKK%%jjj%jj%%j%%JK%%%%%%JJ%%j%%%%%%%%%j%%
1660A31%%%JJ%%j%j%jj%J%jjJ%JJJ%%%%%%Jkj%jJ%%J%%%JJjk%j%jJKK%jj%%j%JJJJj%J%%j
1652A33%j%%%J%%%J%%%Jj%%KJJ%J%%%j%j%jjJ%jj%%%j%j%jJ%%j%j%%%%J%%J%%%JJjj%%JJJ
1645A35%%%J%%jJJ%JJ%JJJ%JK%%JJj%kj%%%%%%%jj%%jjjjkjk%%%%%%j%%%%JJ%J%Jj%%%%%j
1638A33%%%%%%%%J%%J%%%%%%%%%J%J%%JjjJj%%%%jjj%%jj%j%%%%%j%%%JJJ%%j%%j%%JJ%jJ
1630A32%%%j%%%j%%%%J%jj%kjjJJ%%j%KJJJ%%%%jJ%j%j%%jKJj%%k%%JK%%jj%%%%%%%J%%%%
1623A30j%j%%%%%jj%JJJj%jjJ%JJjjJ%j%j%%J%%J%%Jj%%j%%%JJ%jjj%%jJ%J%%%%J%J%%%j%
1616A28%j%jjJJJ%%%jj%j%J%J%%Jjj%KJJ%%%kjj%J%J%%J%J%%%JJjkjJ%j%JJ%%%%%%%%J%jj
$$ plain form
1608 129 130 131 131 131 130 130 129 129 129 129 130 131 132 134 134 134 134 133 132 131 131 131 131 131 132 131 130 129 128 128 128 129 129 130 130 130 131 130 129 129 130 129 128 127 127 128 129 129 128 128 129 130 131 131 131 131 130 130 131 130 129 129 129 129 130 131 132 130 129
1601 129 128 127 127 128 128 128 127 127 127 128 129 130 130 130 130 130 129 130 130 131 130 130 131 131 131 131 130 129 129 129 130 130 130 129 128 129 130 131 132 131 130 129 128 129 129 129 129 129 128 128 128 128 129 129 130 130 129 129 128 128 128 129 130 130 129 130 130 130 129
1594 129 129 129 129 130 130 130 130 130 131 131 130 129 128 128 128 129 130 132 132 132 131 130 129 128 128 129 130 131 130 130 129 128 127 127 127 128 128 128 128 128 129 129 129 130 129 129 129 129 129 129 129 130 129 129 129 128 128 128 130 131 131 131 131 131 130 128 128 127 127
1586 127 127 128 128 128 128 128 128 128 127 127 127 129 130 130 129 127 126 127 127 128 128 129 129 129 129 130 131 131 131 131 129 128 128 128 127 127 127 127 126 126 126 126 127 128 129 129 129 130 130 130 131 131 131 131 130 131 131 130 130 130 130 130 130 130 130 129 129 129 129
1579 129 129 129 129 129 129 129 130 130 130 130 131 131 130 129 128 127 127 127 127 127 127 128 128 129 128 128 128 128 128 129 129 129 130 130 130 131 130 130 130 130 131 132 132 132 130 129 128 128 130 131 131 130 130 130 130 130 130 130 129 128 128 129 130 129 129 130 130 131 131
1572 131 131 132 132 132 132 131 130 129 128 128 128 128 128 129 130 130 130 130 130 129 129 128 128 128 128 127 127 127 127 127 128 129 131 131 131 131 130 130 130 130 130 130 130 130 129 130 130 130 130 129 129 129 129 129 130 130 131 132 132 131 130 130 129 128 128 128 128 127 128
1564 128 128 128 129 130 129 129 131 131 131 131 131 131 130 129 129 130 130 129 128 129 129 129 129 129 129 129 128 128 128 129 130 130 128 127 127 128 128 129 128 128 128 128 128 128 129 130 130 130 130 130 130 130 129 129 129 128 128 128 127 127 127 127 128 128 128 128 128 129 129
1557 129 129 129 128 128 128 128 127 128 128 128 128 127 128 128 128 127 127 126 126 126 127 127 128 128 128 128 128 128 128 128 129 129 129 129 128 129 130 131 131 130 129 128 127 127 129 130 130 130 129 129 129 128 128 129 129 129 129 129 128 128 129 129 130 131 130 128 128 129 130
$$ packed form
1608A29JJ%%j%j%%%JJJK%%%jjj%%%%Jjjjj%%J%J%%Jjj%Jjjj%JJ%j%JJJ%%%j%Jjj%%%JJJkj
1601A29jj%J%%j%%JJJ%%%%jJ%Jj%J%%%jj%%J%%jjJJJJjjjjJ%%%%j%%%J%J%j%j%%JJ%jJ%%j
1594A29%%%J%%%%J%jjj%%JJK%%jjjj%JJJj%jjj%%J%%%%J%%Jj%%%%%%Jj%%j%%KJ%%%%jk%j%
1586A27%J%%%%%%j%%KJ%jkjJ%J%J%%%JJ%%%kj%%j%%%j%%%JJJ%%J%%J%%%jJ%j%%%%%%%j%%%
1579A29%%%%%%J%%%J%jjjj%%%%%J%Jj%%%%J%%J%%Jj%%%JJ%%kjj%KJ%j%%%%%%jj%JJj%J%J%
1572A31%J%%%jjjj%%%%JJ%%%%j%j%%%j%%%%JJK%%%j%%%%%%%jJ%%%j%%%%J%JJ%jj%jj%%%jJ
1564A28%%JJj%K%%%%%jj%J%jjJ%%%%%%j%%JJ%kj%J%Jj%%%%%JJ%%%%%%j%%j%%j%%%J%%%%J%
1557A29%%j%%%jJ%%%jJ%%j%j%%J%J%%%%%%%J%%%jJJJ%jjjj%KJ%%j%%j%J%%%%j%J%JJjk%JJ
$$ plain form
1550 130 130 129 129 129 128 126 125 126 128 129 129 129 128 129 130 130 129 127 127 128 129 129 129 128 128 129 129 129 128 128 128 128 128 128 128 128 128 128 127 128 129 129 130 130 129 127 125 125 126 126 127 127 127 126 127 127 127 127 127 127 126 125 125 125 125 126 126 127 127
1543 127 127 127 127 127 126 126 126 126 126 127 127 127 127 127 127 126 127 128 128 127 126 125 124 124 124 123 123 124 125 126 127 126 126 125 125 125 126 126 127 127 126 126 127 128 128 129 128 127 126 125 125 126 127 126 126 125 125 126 126 126 125 126 126 125 124 126 127 127 128
1535 128 127 126 125 125 126 126 125 125 125 125 125 126 126 125 126 126 126 126 126 126 126 126 125 125 126 127 127 125 124 124 124 123 123 123 124 125 126 126 127 127 126 126 125 125 125 126 125 124 125 126 126 126 126 126 127 127 128 128 128 128 127 127 127 127 126 125 124 125 126
1528 126 127 127 127 127 126 126 126 127 128 128 128 129 129 129 130 129 128 128 128 129 130 130 130 130 129 128 128 129 130 130 130 130 130 131 131 131 129 129 130 130 130 131 132 132 132 130 129 129 128 129 129 129 129 129 131 132 132 132 131 129 129 130 131 132 132 132 132 132 131
1521 131 132 132 133 133 133 133 133 133 133 133 133 133 132 131 130 129 129 129 128 128 128 129 129 128 129 129 129 130 129 128 128 127 127 128 129 128 127 127 128 129 130 131 130 130 129 129 129 130 129 129 128 127 128 128 127 127 127 127 127 127 128 129 129 129 128 129 130 130 130
1513 130 130 129 127 125 127 129 130 130 129 128 128 128 128 128 128 127 127 127 128 128 128 129 129 129 130 130 130 130 130 129 128 128 129 129 127 127 127 128 129 129 128 128 128 127 127 128 129 130 129 128 129 129 129 129 130 130 131 132 132 131 130 130 131 133 133 133 133 133 132
1506 132 132 132 133 133 134 135 136 137 136 135 136 136 136 135 136 137 137 138 138 137 138 138 138 138 137 137 137 137 139 140 141 141 140 140 141 143 142 142 141 140 142 144 144 143 144 145 145 144 143 143 143 143 144 145 146 147 147 147 148 149 149 148 147 148 148 148 148 148 147
1499 147 147 147 148 149 148 146 146 146 147 146 146 147 148 148 148 147 147 146 146 146 146 147 147 147 147 147 148 148 148 148 147 147 146 146 147 148 149 149 150 150 150 149 149 149 150 151 152 153 154 155 156 157 157 157 157 157 157 156 156 157 157 159 160 162 163 164 164 164 165
$$ packed form
1550A30%j%%jkjJKJ%%jJJ%jk%JJ%%j%J%%j%%%%%%%%%jJJ%J%jkk%J%J%%jJ%%%%%jj%%%J%J%
1543A27%%%%j%%%%J%%%%%jJJ%jjjj%%j%JJJJj%j%%J%J%j%JJ%Jjjjj%JJj%j%J%%jJ%jjKJ%J
1535A28jjj%J%j%%%%J%jJ%%%%%%%j%JJ%kj%%j%%JJJ%J%j%j%%JjjJJ%%%%J%J%%%j%%%jjjJJ
1528A26J%%%j%%JJ%%J%%Jjj%%JJ%%%jj%JJ%%%%J%%k%J%%JJ%%kj%jJ%%%%KJ%%jk%JJJ%%%%j
1521A31J%J%%%%%%%%%jjjj%%j%%J%jJ%%Jjj%j%JJjj%JJJJj%j%%Jj%jjJ%j%%%%%JJ%%jJJ%%
1513A30%jkkKKJ%jj%%%%%j%%J%%J%%J%%%%jj%J%k%%JJ%j%%j%JJJjjJ%%%J%JJ%jj%JK%%%%j
1506A32%%J%JJJJjjJ%%jJJ%J%jJ%%%j%%%KJJ%j%JKj%jjKK%jJJ%jj%%%JJJJ%%JJ%jjJ%%%%j
1499A47%%JJjk%%Jj%JJ%%j%j%%%J%%%%J%%%j%j%JJJ%J%%j%%JJJJJJJJ%%%%%j%J%KJKJJ%%J
$$ plain form
1491 165 165 165 165 165 166 167 168 169 170 170 171 172 172 173 173 174 174 175 176 177 177 177 178 178 179 179 179 179 180 181 181 182 183 183 183 183 183 184 183 184 184 184 183 183 183 184 184 183 183 183 183 182 181 180 180 180 180 180 179 179 179 180 179 179 178 178 178 177 177
1484 177 176 175 174 173 173 172 172 172 171 170 170 169 169 169 168 166 164 164 164 164 165 164 163 162 161 161 161 160 161 161 159 158 158 158 158 157 157 156 155 155 155 155 156 155 155 155 154 153 153 152 152 152 152 152 152 152 151 152 153 153 152 151 150 150 150 150 150 151 152
1477 152 152 152 153 154 154 154 154 154 155 155 155 155 155 154 154 153 153 152 152 153 154 154 153 152 152 152 153 152 151 150 151 151 151 151 151 150 149 150 150 150 151 151 151 152 152 152 150 148 147 146 147 147 147 146 145 143 142 144 145 145 145 145 145 143 141 141 142 142 141
1469 141 140 140 139 137 136 136 135 134 135 136 136 135 135 134 133 132 132 132 132 131 130 129 129 128 127 127 127 127 128 128 128 128 129 128 128 128 128 127 127 127 126 126 127 127 127 127 127 127 127 127 128 128 128 128 129 130 129 129 128 127 126 126 125 125 125 125 125 125 125
1462 125 125 126 125 125 125 125 124 124 125 125 124 125 127 127 127 126 126 126 125 126 127 127 127 127 129 129 129 129 129 128 128 128 129 129 130 130 131 131 131 131 131 130 129 129 129 130 130 130 130 129 129 129 130 131 131 130 130 132 133 133 133 133 133 133 132 132 131 131 131
1455 131 131 130 131 131 132 132 133 133 133 133 132 133 133 134 134 134 135 135 135 136 136 136 136 135 135 135 136 136 135 135 136 136 136 137 138 138 139 139 139 139 140 140 141 142 142 143 143 144 145 145 145 144 144 143 142 143 143 144 144 144 144 144 145 144 144 146 147 147 147
1447 147 148 148 148 147 147 146 146 145 147 149 150 151 152 154 153 153 152 152 152 152 152 152 153 153 153 154 154 154 155 155 154 153 154 155 155 155 155 155 156 157 158 159 159 159 159 159 160 161 162 163 164 165 166 167 167 166 166 165 166 167 169 169 170 170 171 172 173 174 175
1440 175 177 178 179 180 181 182 183 183 184 186 188 190 192 193 194 195 196 198 199 200 201 203 205 207 209 212 213 214 216 219 223 226 229 232 235 237 241 245 248 252 256 260 265 269 274 279 284 289 295 301 308 317 326 336 346 356 368 381 394 408 424
$$ packed form
1491A65%%%%JJJJJ%JJ%J%J%JJJ%%J%J%%%JJ%JJ%%%%JjJ%%j%%J%j%%%jjj%%%%j%%Jj%j%%j%
1484A77jjjj%j%%jj%j%%jkk%%%Jjjjj%%jJ%kj%%%j%jj%%%Jj%%jj%j%%%%%%jJJ%jjj%%%%JJ
1477A52%%JJ%%%%J%%%%j%j%j%JJ%jj%%JjjjJ%%%%jjJ%%J%%J%%kkjjJ%%jjkjKJ%%%%kk%J%j
1469A41j%jkj%jjJJ%j%jjj%%%jjj%jj%%%J%%%Jj%%%j%%j%J%%%%%%%J%%%JJj%jjj%j%%%%%%
1462A25%Jj%%%j%J%jJK%%j%%jJJ%%%K%%%%j%%J%J%J%%%%jj%%J%%%j%%JJ%j%KJ%%%%%j%j%%
1455A31%jJ%J%J%%%jJ%J%%J%%J%%%j%%J%j%J%%JJ%J%%%J%JJ%J%JJ%%j%jjJ%J%%%%Jj%KJ%%
1447A47J%%j%j%jKKJJJKj%j%%%%%J%%J%%J%jjJJ%%%%JJJJ%%%%JJJJJJJJ%j%jJJK%J%JJJJJ
1440A75KJJJJJJ%JKKKKJJJJKJJJKKKKLJJKLMLLLLKMMLMMMNMNNNNOOPRRJ0J0J0J2J3J3J4J6
$$ plain form
1434 424 440 458 477 496 518 539 561 585 610 637 666 695 726 757 790 825 862 900 939 981 1024 1069 1117 1166 1216 1268 1323 1381 1440 1503 1569 1638 1709 1784 1862
1430 1862 1942 2025 2111 2199 2290 2384 2480 2578 2679 2782 2886 2992 3099 3206 3315 3425 3537 3651 3766 3885 4007 4130 4255 4383 4513 4646
1427 4646 4784 4924 5067 5214 5363 5514 5667 5822 5977 6132 6287 6441 6594 6745 6893 7037 7178 7316 7449 7576 7699 7818 7933
1425 7933 8043 8148 8249 8348 8445 8539 8631 8722 8812 8902 8991 9079 9166 9253 9336 9418 9495 9570 9640 9704 9761 9812 9855 9888 9912 9926 9932 9928 9913 9889 9857 9817 9770 9715
1421 9715 9656 9592 9524 9452 9379 9304 9227 9150 9072 8993 8914 8833 8749 8664 8575 8485 8391 8294 8192 8085 7972 7854 7729 7600 7466 7327 7183 7035 6883
1418 6883 6730 6577 6421 6265 6108 5952 5797 5644 5494 5348 5204 5063 4926 4791 4660 4531 4404 4279 4156 4035 3915 3798 3682
1416 3682 3565 3449 3335 3222 3111 3001 2891 2783 2677 2573 2471 2370 2272 2179 2089 2000 1914 1832 1754 1679 1608 1539 1473 1411 1351 1293 1238 1185
1413 1185 1135 1088 1043 1001 961 921 883 845 809 775 743 712 684 656 630 605 581 558 535 514 495 476 458 442 427 414 401 387 374 363 354 345 337 329 321 312 307 301
$$ packed form
1434D24J6J8J9J9K2K1K2K4K5K7K9K9L1L1L3L5L7L8L9M2M3M5M8M9N0N2N5N8N9O3O6O9P1P5P8
1430A862Q0Q3Q6Q8R1R4R6R8J01J03J04J06J07J07J09J10J12J14J15J19J22J23J25J28J30J33
1427D646J38J40J43J47J49J51J53J55J55J55J55J54J53J51J48J44J41J38J33J27J23J19J15
1425G933J10J05J01R9R7R4R2R1R0R0Q9Q8Q7Q7Q3Q2P7P5P0O4N7N1M3L3K4J4Omj5k4l2m0m7n5
1421I715n9o4o8p2p3p5p7p7p8p9p9q1q4q5q9r0r4r7j02j07j13j18j25j29j34j39j44j48j52
1418F883j53j53j56j56j57j56j55j53j50j46j44j41j37j35j31j29j27j25j23j21j20j17j16
1416C682j17j16j14j13j11j10j10j08j06j04j02j01r8r3r0q9q6q2p8p5p1o9o6o2o0n8n5n3
1413A185n0m7m5m2m0m0l8l8l6l4l2l1k8k8k6k5k4k3k3k1j9j9j8j6j5j3j3j4j3j1rrqqqrno
$$ plain form
1409 301 295 290 285 281 277 273 269 265 261 258 255 253 251 248 246 246 246 244 242 241 240 240 240 241 240 239 240 240 241 242 244 245 246 248 251 256 260 264 268 272 275 280 286 292 298 305 310 315 320 326 332 338 342 346 351 355 358 361 363 366 367 366 365 365 364 363 361 359 358
1401 358 357 354 352 349 347 344 341 339 337 335 334 331 328 326 324 321 318 317 316 314 311 309 307 303 299 294 291 287 282 278 274 269 264 259 253 247 243 238 233 228 224 220 216 213 210 207 204 202 201 199 197 196 195 194 193 192 191 191 191 190 190 191 191 191 190 190 190 190 190
1394 190 190 190 190 189 190 190 190 190 191 192 193 194 195 195 196 197 199 200 201 203 205 208 209 211 214 217 220 222 225 228 230 232 234 236 238 239 241 243 244 245 246 247 246 246 246 245 243 242 241 240 238 236 233 231 229 227 226 225 222 220 219 218 217 215 214 213 210 208 205
1387 205 203 201 200 197 194 191 188 186 184 181 177 173 169 166 163 159 156 153 150 147 145 141 138 136 134 132 130 128 127 126 125 124 123 123 123 122 122 121 120 121 122 122 122 122 122 123 123 123 124 124 124 125 125 126 127 127 128 129 129 129 130 131 132 134 135 135 134 134 134
1379 134 135 135 136 137 137 137 137 137 136 136 136 136 136 136 137 137 137 137 138 138 138 138 139 140 139 139 139 139 139 140 139 139 139 139 139 139 139 138 138 139 139 140 140 141 140 139 139 140 138 137 137 136 136 136 136 135 135 134 133 132 132 131 131 131 129 129 128 128 128
1372 128 129 127 125 124 124 124 124 125 126 126 127 126 125 123 123 124 124 124 124 124 124 125 125 125 125 125 125 125 125 124 122 123 123 123 124 124 125 125 124 124 124 125 126 126 127 126 126 127 129 130 131 132 133 135 138 140 142 144 145 148 149 150 153 155 157 158 158 160 161
1365 161 163 164 166 167 168 170 171 172 174 175 176 177 179 181 184 187 189 192 194 197 199 201 204 205 206 207 207 208 208 209 209 210 208 207 206 204 204 202 200 199 199 200 200 198 197 197 196 196 197 197 198 200 201 202 203 204 206 207 208 209 209 208 208 210 212 212 213 215 216
1358 216 218 219 221 223 225 227 229 231 235 238 241 245 249 254 259 264 269 275 280 286 293 299 306 313 320 327 334 342 349 355 362 368 374 380 386 390 394 397 399 401 403 404 406 407 409 410 411 411 412 414 415 417 420 423 427 430 434 437 442 448 454 458 462 466 470 474 478 480 483
$$ packed form
1409C01onnmmmmmmllkklk%%kkjj%%JjjJ%JJKJJKLNMMMMLNOOOPNNNOOOMMNMLLKLJjj%jjkkj
1401C58jlklkllkkkjllkklljjklkkmmnlmnmmnnnoomnnnmmmllllkjkkjjjjjj%%j%J%%j%%%%
1394A90%%%jJ%%%JJJJJ%JJKJJKKLJKLLLKLLKKKKKJKKJJJJj%%jkjjjkklkkkjjlkjjjkjjlkl
1387B05kkjllllkklmmmllmllllkmlkkkkkjjjjj%%j%jjJJ%%%%J%%J%%J%JJ%JJ%%JJJKJ%j%%
1379A34J%JJ%%%%j%%%%%J%%%J%%%JJj%%%%Jj%%%%%%j%J%J%Jjj%Jkj%j%%%j%jjj%j%%k%j%%
1372A28Jkkj%%%JJ%Jjjk%J%%%%%J%%%%%%%jkJ%%J%J%j%%JJ%Jj%JKJJJJKLKKKJLJJLKKJ%KJ
1365A61KJKJJKJJKJJJKKLLKLKLKKLJJJ%J%J%Jkjjk%kkj%J%kj%j%J%JKJJJJKJJJ%j%KK%JKJ
1358B16KJKKKKKKMLLMMNNNNONOPOPPPPPQPOPOOOOMMLKKKJKJKJJ%JKJKLLMLMLNOOMMMMMMKL
$$ plain form
1350 483 486 489 490 491 492 493 494 496 498 499 501 505 510 516 521 527 534 541 549 556 565 574 585 595 606 619 631 644 658 673 688 704 720 737 754 772 792 812 834 857 881 905 932 963 996 1030
1345 1030 1067 1108 1153 1200 1249 1303 1363 1430 1500 1577 1660 1752 1854 1965 2087 2220 2366 2528 2707 2904 3123 3364 3633 3930 4263 4636 5052
1342 5052 5517 6035 6612 7254 7966 8751 9611 10549 11563 12651 13809 15031 16306 17625 18974 20337 21700 23046 24358
1340 24358 25619 26812 27923 28938 29847 30639 31307 31848 32259 32545 32711 32767 32725 32600 32409 32170 31901 31621 31347 31093 30874 30698
1338 30698 30573 30500 30478 30503 30567 30659 30766 30872 30965 31025 31037 30988 30864 30653 30344 29931 29407 28771 28027 27175 26222 25177 24050 22854 21606
1335 21606 20322 19017 17709 16414 15150 13931 12765 11665 10638 9690 8821 8029 7314 6674 6101 5590 5133 4726 4363 4037
1333 4037 3744 3481 3243 3026 2829 2648 2483 2333 2196 2069 1952 1845 1745 1655 1572 1495 1425 1361 1302 1248 1200 1155 1114 1076 1041 1008 978 951
1330 951 926 902 880 860 840 822 806 792 778 765 753 741 730 719 709 699 690 682 674 665 657 647 637 627 617 607 597 587 576 565 554 543 532 520 509 497 486
$$ packed form
1350D83LLJJJJJKKJKMNONOPPQPRRJ1J0J1J3J2J3J4J5J5J6J6J7J7J8K0K0K2K3K4K4K7L1L3L4
1345A030L7M1M5M7M9N4O0O7P0P7Q3R2J02J11J22J33J46J62J79J97K19K41K69K97L33L73M16
1342E052M65N18N77O42P12P85Q60R38J014J088J158J222J275J319J349J363J363J346J312
1340B4358J261J193J111J015R09P92O68N41M11K86J66N6m2j25j91k39k69k80k74k54k19j76
1338C0698j25p3k2K5O4R2J07J06R3O0J2m9j24k11l09m13n24o36p44q52r53j045j127j196j248
1335B1606j284j305j308j295j264j219j166j100j027r48q69p92p15o40n73n11m57m07l63l26
1333D037k93k63k38k17j97j81j65j50j37j27j17j07j00r0q3p7p0o4n9n4m8m5m1l8l5l3l0k7
1330I51k5k4k2k0k0j8j6j4j4j3j2j2j1j1j0j0rqqrqj0j0j0j0j0j0j0j1j1j1j1j1j2j1j2j1
$$ plain form
1326 486 474 464 456 448 441 434 428 424 421 417 415 413 412 410 410 407 405 402 399 396 392 387 381 374 367 359 352 344 337 329 322 315 308 301 296 292 289 286 285 283 284 285 287 290 293 296 299 302 304 305 308 312 314 317 319 321 321 322 321 321 320 319 318 317 316 315 315
1319 315 313 309 305 303 300 297 295 293 290 287 285 282 280 277 275 272 269 267 265 262 260 259 258 257 256 254 253 251 249 247 245 242 240 237 234 231 227 225 223 220 217 214 211 208 205 203 200 198 197 196 194 194 195 196 195 195 195 195 197 198 198 199 200 201 201 200 199 200 201
1312 201 200 200 199 198 198 197 197 197 197 198 198 198 198 198 198 198 199 199 200 202 202 203 204 204 205 206 206 207 207 207 207 208 206 204 204 205 205 204 202 202 202 202 201 200 200 199 199 197 196 195 194 194 194 193 192 191 190 190 188 187 187 187 187 186 186 187 188 188 187
1305 187 187 186 184 182 182 181 181 181 181 180 179 179 179 178 178 178 177 178 177 176 175 174 174 174 174 172 171 171 172 172 172 172 171 172 173 173 174 173 172 172 173 174 175 176 177 178 178 179 180 180 180 179 180 181 182 182 182 182 182 181 181 182 184 185 184 184 185 185 183
1297 183 184 186 186 185 184 184 185 186 186 186 187 187 187 187 188 188 189 189 189 190 191 191 191 191 192 192 193 193 194 196 196 197 197 197 196 195 195 195 194 194 194 194 192 191 190 190 189 187 185 184 183 180 177 173 170 168 165 162 160 157 153 149 144 140 138 134 131 127 125
1290 125 122 120 117 114 111 109 106 104 101 100 99 98 95 93 93 93 92 90 89 88 88 87 86 85 82 80 78 77 75 76 76 77 77 77 76 76 76 76 78 81 84 85 87 89 91 93 95 98 100 103 106 109 110 111 113 116 119 121 121 121 122 124 124 124 124 125 127 128 127
1283 127 128 129 130 131 132 132 132 132 133 135 136 137 136 136 136 138 139 140 140 140 140 141 140 139 139 139 140 140 140 141 141 141 142 142 143 144 145 146 146 147 146 148 150 151 153 154 155 155 157 159 160 161 164 168 171 174 177 180 184 189 194 198 203 210 216 222 226 231 236
1275 236 241 247 253 259 265 270 276 281 284 287 290 292 294 296 298 298 299 300 302 303 301 300 300 300 300 300 300 298 297 296 296 296 296 295 296 297 297 296 296 295 295 293 291 288 285 282 279 275 271 266 261 255 249 244 239 234 230 225 220 214 209 203 198 194 191 188 184 180 176
$$ packed form
1326D86j2j0qqppomlmkkjk%lklllmnoppqpqpqppppnmlljkJJKLLLLLKJLMKLKK%Jj%jjjjjj%
1319C15kmmkllkkllklklkllkklkjjjjkjkkkklklllmkkllllllklkjjk%JJj%%%KJ%JJJ%jjJJ
1312B01j%jj%j%%%J%%%%%%J%JK%JJ%JJ%J%%%Jkk%J%jk%%%jj%j%kjjj%%jjjj%kj%%%j%JJ%j
1305A87%jkk%j%%%jj%%j%%jJjjjj%%%kj%J%%%jJJ%Jjj%JJJJJJ%JJ%%jJJJ%%%%j%JKJj%J%k
1297A83JK%jj%JJ%%J%%%J%J%%JJ%%%J%J%JK%J%%jj%%j%%%kjj%jkkjjllmlkllklmmnmkmlmk
1290A25lklllklkljjjlk%%jkjj%jjjlkkjkJ%J%%j%%%KLLJKKKKKLKLLLJJKLLK%%JK%%%JKJj
1283A27JJJJJ%%%JKJJj%%KJJ%%%Jjj%%J%%J%%J%JJJJ%JjKKJKJJ%KKJJLMLLLLMNNMNPOOMNN
1275B36NOOOONONLLLKKKK%JJKJkj%%%%%kjj%%%jJJ%j%j%kkllllmmnnoonnnmnnononmllmmm
$$ plain form
1268 176 172 169 167 165 163 161 160 159 158 157 155 154 153 152 150 148 148 149 149 149 148 147 147 148 149 150 148 146 144 143 142 142 144 145 144 143 143 142 143 143 144 145 145 145 145 145 146 146 146 145 145 145 145 144 144 144 144 143 143 142 143 143 144 145 145 144 143 144 144
1261 144 144 144 142 140 141 142 143 143 143 143 143 142 142 142 143 143 141 141 143 142 142 141 141 141 141 142 142 143 143 143 142 142 141 141 140 140 139 139 139 140 140 141 142 142 142 143 144 144 145 145 145 144 144 143 142 142 141 141 141 141 141 141 142 141 140 139 140 141 142
1254 142 141 141 140 139 138 138 138 139 139 139 141 142 142 142 141 141 141 140 140 139 139 140 140 140 141 141 142 142 142 142 142 141 141 141 141 141 141 142 143 143 143 142 142 141 141 140 140 140 139 139 139 138 139 139 139 140 140 140 140 141 140 139 139 140 140 140 140 140 141
1246 141 142 141 141 140 139 139 139 139 138 138 138 138 138 137 137 137 137 137 137 138 138 139 140 140 140 141 141 140 139 138 137 137 137 137 137 137 138 138 138 139 139 139 139 139 139 138 139 138 138 137 137 137 137 136 136 136 136 136 136 136 136 137 138 138 137 137 137 138 138
1239 138 138 138 138 138 138 137 137 138 139 139 140 140 140 139 139 138 138 138 138 138 138 138 139 137 137 137 137 137 137 137 136 136 135 135 135 136 135 136 138 138 139 139 139 139 139 139 138 137 137 137 136 135 135 136 136 136 136 136 136 137 137 137 137 138 137 137 137 137 137
1232 137 137 137 136 136 135 136 137 137 137 136 135 135 135 135 136 138 138 137 136 136 136 136 136 136 136 136 136 138 139 139 139 139 139 139 139 139 139 139 140 140 141 142 143 144 143 142 142 142 142 142 142 142 142 143 142 142 142 141 140 141 143 143 143 141 139 140 141 142 142
1224 142 142 141 140 140 140 140 141 141 141 141 141 142 142 143 143 143 143 143 142 142 141 140 140 140 141 141 142 142 142 142 143 144 144 143 142 142 142 143 142 143 144 144 145 144 144 144 145 145 144 144 144 144 144 144 144 144 146 147 147 146 146 147 146 145 146 147 147 148 147
1217 147 147 147 147 147 147 148 148 148 148 149 150 151 152 152 153 154 155 156 158 159 160 162 163 165 168 170 171 172 175 178 181 184 187 191 194 197 200 204 208 212 216 221 223 226 230 234 237 240 242 244 246 248 251 253 254 256 257 259 261 264 266 268 271 274 278 281 285 288 291
$$ packed form
1268A76mlkkkkjjjjkjjjkk%J%%jj%JJJkkkjj%KJjj%jJ%JJ%%%%J%%j%%%j%%%j%jJ%JJ%jjJ%
1261A44%%kkJJJ%%%%j%%J%k%Kj%j%%%J%J%%j%j%j%j%%J%JJ%%JJ%J%%j%jj%j%%%%%JjjjJJJ
1254A42j%jjj%%J%%KJ%%j%%j%j%J%%J%J%%%%j%%%%%JJ%%j%j%j%%j%%jJ%%J%%%Jjj%J%%%%J
1246A41Jj%jj%%%j%%%%j%%%%%J%JJ%%J%jjjj%%%%%J%%J%%%%%jJj%j%%%j%%%%%%%JJ%j%%J%
1239A38%%%%%j%JJ%J%%j%j%%%%%%Jk%%%%%%j%j%%JjJK%J%%%%%jj%%jj%J%%%%%J%%%Jj%%%%
1232A37%%j%jJJ%%jj%%%JK%jj%%%%%%%%KJ%%%%%%%%%J%JJJJjj%%%%%%%Jj%%jjJK%%kkJJJ%
1224A42%jj%%%J%%%%J%J%%%%j%jj%%J%J%%%JJ%jj%%JjJJ%Jj%%J%j%%%%%%%KJ%j%JjjJJ%Jj
1217A47%%%%%J%%%JJJJ%JJJJKJJKJKLKJJLLLLLMLLLMMMMNKLMMLLKKKKLKJKJKKLKKLLMLMLL
$$ plain form
1210 291 294 296 298 300 303 305 306 306 305 305 304 303 301 299 295 292 290 288 286 283 279 275 272 269 266 263 260 256 254 252 251 251 250 248 245 243 242 241 239 237 235 233 231 229 225 222 219 216 213 210 207 204 202 200 198 195 194 194 193 193 192 192 192 193 193 193 194 195 196
1202 196 197 198 201 204 207 209 212 215 218 221 225 228 231 235 239 242 246 249 251 252 255 257 258 260 262 263 264 265 265 264 263 263 264 265 266 266 266 265 264 264 265 266 268 268 267 266 266 266 266 264 262 260 257 253 252 250 247 243 240 236 230 224 219 216 212 208 203 199 194
1195 194 189 185 181 178 174 171 169 166 163 160 158 157 156 154 151 149 147 146 144 142 139 137 135 133 132 131 130 129 126 124 123 123 123 122 120 119 118 117 116 116 114 113 114 115 115 115 115 115 115 116 116 116 117 118 120 121 121 121 121 121 122 122 123 124 124 125 126 127 127
1188 127 127 127 127 127 126 127 127 129 131 131 131 132 133 133 133 135 136 137 138 138 137 137 137 137 139 140 142 142 142 141 141 141 141 142 143 144 145 145 145 144 143 144 145 146 146 146 146 147 147 148 149 149 150 150 151 150 150 150 150 150 150 150 149 150 151 151 150 150 150
1180 150 151 151 151 152 151 150 150 149 149 148 149 150 149 148 148 148 149 150 150 150 149 149 149 148 147 146 147 148 148 148 149 149 150 151 151 151 152 153 154 155 156 157 158 159 159 159 159 160 160 160 161 163 165 165 165 165 166 167 167 168 169 169 171 172 173 174 177 179 182
1173 182 184 186 187 188 190 192 194 194 195 196 196 196 197 196 196 197 197 198 198 197 196 195 195 195 196 196 195 195 195 196 196 196 197 198 199 200 201 202 202 201 201 201 201 201 200 200 199 198 198 197 196 194 192 193 193 193 194 196 197 198 199 200 202 204 205 208 211 214 217
1166 217 219 221 223 226 230 234 239 244 246 249 254 260 265 268 271 276 280 283 287 291 296 301 305 309 314 319 322 326 331 337 342 348 352 357 362 367 373 379 385 391 397 405 411 416 422 428 433 437 441 444 448 452 455 459 461 464 467 469 474 478 481 484 489 494 499 505 511 518 524
1159 524 531 537 543 550 557 564 572 580 589 597 606 614 623 632 640 649 657 666 677 687 698 711 725 740 757 775 794 814 837 861 887 915 944 975 1009 1045 1085 1126 1173 1223 1277 1335 1397 1464
$$ packed form
1210B91LKKKLKJ%j%jjkkmlkkklmmlllllmkkj%jklkjjkkkkkkmlllllllkkklj%j%j%%J%%JJJ
1202A96JJLLLKLLLLMLLMMLMLKJLKJKKJJJ%jj%JJJ%%jj%JJK%jj%%%kkklmjklmlmoonlmmnmn
1195A94nmmlmlklllkjjklkkjkklkkkjjjjlkj%%jkjjjj%kjJJ%%%%%J%%JJKJ%%%%J%JJ%JJJ%
1188A27%%%%jJ%KK%%JJ%%KJJJ%j%%%KJK%%j%%%JJJJ%%jjJJJ%%%J%JJ%J%Jj%%%%%%jJJ%j%%
1180A50J%%Jjj%j%jJJjj%%JJ%%j%%jjjJJ%%J%JJ%%JJJJJJJJ%%%J%%JKK%%%JJ%JJ%KJJJLKL
1173A82KKJJKKK%JJ%%Jj%J%J%jjj%%J%j%%J%%JJJJJJ%j%%%%j%jj%jjkkJ%%JKJJJJKKJLLLL
1166B17KKKLMMNNKLNONLLNMLMMNNMMNNLMNONOMNNNOOOOOQONOONMMLMMLMKLLKNMLLNNNOOPO
1159E24POOPPPQQRQRQRRQRQRJ1J0J1J3J4J5J7J8J9K0K3K4K6K8K9L1L4L6M0M1M7N0N4N8O2O7
$$ plain form
1154 1464 1537 1618 1707 1804 1911 2027 2154 2296 2453 2627 2821 3036 3277 3546 3845 4180 4551 4961 5415 5914 6457 7044 7674 8343
1151 8343 9044 9774 10525 11289 12058 12824 13578 14312 15019 15692 16327 16916 17456 17946 18385 18777 19126 19437 19720 19984 20242 20505 20784
1149 20784 21093 21440 21834 22282 22785 23343 23953 24609 25300 26015 26738 27455 28151 28809 29413 29950 30405 30765 31023 31169 31199 31114 30913
1146 30913 30599 30181 29668 29072 28407 27690 26935 26161 25382 24616 23878 23178 22526 21930 21391 20909 20485 20111 19779 19479 19201 18933 18664
1144 18664 18384 18082 17750 17382 16971 16513 16005 15448 14844 14196 13509 12791 12052 11299 10542 9792 9059 8349 7673 7036 6444 5899 5401
1142 5401 4949 4542 4177 3851 3560 3300 3066 2856 2667 2498 2345 2206 2079 1963 1857 1759 1670 1587 1512 1444 1381 1323 1270 1220 1174 1132 1094
1139 1094 1059 1026 996 968 942 917 895 872 851 830 810 792 775 758 742 728 713 699 685 672 660 649 639 628 618 608 601 594 588 582 576 570 566 561 558 554 550 545 538 531 524 517
1134 517 508 500 492 483 474 465 457 449 441 433 426 420 414 409 405 401 399 397 395 393 392 392 393 393 392 392 390 389 387 384 380 376 373 370 366 362 357 353 349 345 341 338 335 333 332 330 329 327 328 329 330 330 330 331 331 331 330 329 329 328 329 329 330 328 325 323 320 319 317
$$ packed form
1154A464P3Q1Q9R7J07J16J27J42J57J74J94K15K41K69K99L35L71M10M54M99N43N87O30O69
1151H343P01P30P51P64P69P66P54P34P07O73O35N89N40M90M39L92L49L11K83K64K58K63K79
1149B0784L09L47L94M48N03N58O10O56O91P15P23P17O96O58O04N37M55L60K58J46L0q5k01
1146C0913l14m18n13n96o65p17p55p74p79p66p38p00o52n96n39m82m24l74l32l00k78k68k69
1144A8664k80l02l32l68m11m58n08n57o04o48o87p18p39p53p57p50p33p10o76o37n92n45m98
1142E401m52m07l65l26k91k60k34k10j89j69j53j39j27j16j06r8q9q3p5o8o3n8n3n0m6m2l8
1139A094l5l3l0k8k6k5k2k3k1k1k0j8j7j7j6j4j5j4j4j3j2j1j0j1j0j0ppoooomnlmmnpppp
1134E17rqqrrrqqqqpoonmmkkkkj%J%j%kjklmmllmmnmmmmllkjkjkJJJ%%J%%jj%jJ%Jklkljk
$$ plain form
1127 317 315 313 312 311 309 308 306 303 299 296 294 292 290 287 285 283 280 277 273 270 268 264 261 259 256 255 253 253 252 250 249 248 247 247 247 247 246 245 245 245 244 243 242 241 240 240 240 240 240 240 239 238 238 239 238 237 238 240 243 244 246 249 250 251 254 256 257 258 259
1120 259 260 260 263 265 266 268 269 269 270 273 274 274 274 274 276 277 278 279 279 279 277 276 275 274 273 272 272 272 270 269 267 265 264 262 261 259 258 258 257 256 255 255 254 254 255 256 257 258 259 260 260 261 262 264 266 269 270 271 273 274 276 277 279 281 283 286 288 291 293
1112 293 294 298 301 305 310 312 314 318 321 324 328 332 337 340 344 349 354 359 364 370 376 381 386 393 399 406 412 421 429 439 450 460 471 481 493 505 518 533 548 564 582 601 621 643 665 690 718 747 780
1107 780 817 856 899 947 1000 1059 1124 1196 1276 1366 1468 1586 1721 1875 2053 2259 2498 2773 3087 3443 3839 4273 4739 5230 5735 6240 6730
1104 6730 7194 7620 7999 8326 8599 8817 8980 9087 9139 9138 9084 8979 8824 8619 8366 8068 7731 7360 6962 6539 6097 5643 5180 4719
1102 4719 4269 3841 3446 3089 2771 2492 2248 2035 1853 1695 1556 1435 1328 1234 1151 1076 1011 951 896 848 804 766 729 696 664 635 607 582
1099 582 559 538 519 500 482 464 446 430 416 403 390 378 367 356 346 336 327 318 310 302 296 290 283 278 274 269 264 260 257 253 249 245 242 240 238 234 231 228 227 225 223 221 219 218 217 216 215 213 211 210 210 209 207
1093 207 206 207 208 209 210 211 211 211 212 214 214 215 215 216 215 214 212 210 208 206 204 202 198 194 190 186 184 182 180 177 176 174 173 174 175 174 174 175 176 177 179 180 183 186 190 194 196 198 201 204 208 213 216 220 224 228 231 234 235 237 240 243 247 250 253 257 259 262 265
$$ packed form
1127C17kkjjkjklmlkkklkkllmlkmlkljk%jkjjj%%%jj%%jjjjj%%%%%jj%JjjJKLJKLJJLKJJJ
1120B59J%LKJKJ%JLJ%%%KJJJ%%kjjjjj%%kjkkjkjkj%jjj%j%JJJJJJ%JJKKLJJKJKJKKKLKLK
1112B93JMLMNKKMLLMMNLMNNNNOONNPOPORQJ0J1J0J1J0J2J2J3J5J5J6J8J9K0K2K2K5K8K9L3
1107G80L7L9M3M8N3N9O5P2Q0R0J02J18J35J54J78K06K39K75L14L56L96M34M66M91N05N05M90
1104F730M64M26L79L27K73K18J63J07N2jn4j05j55k05k53k98l37l71l98m23m42m54m63m61
1102D719m50m28l95l57l18k79k44k13j82j58j39j21j07r4q3p5o5o0n5m8m4l8l7l3l2k9k8k5
1099E82k3k1j9j9j8j8j8j6j4j3j3j2j1j1j0j0rrqqoopnmnnmlmmmlkkmlljkkkkjjjjkkj%jk
1093B07jJJJJJ%%JK%J%JjjkkkkkkmmmmkkkljkjJJj%JJJKJLLMMKKLLMNLMMMLLJKLLMLLMKLL
$$ plain form
1086 265 268 272 276 279 282 283 284 286 288 290 293 296 298 301 303 306 309 310 311 314 317 320 323 326 329 332 334 337 339 341 342 343 344 346 346 345 343 340 336 331 328 324 321 317 313 309 304 300 296 293 290 286 282 279 278 276 274 272 271 269 267 264 261 257 254 251 249 246 242
1079 242 239 235 232 229 225 221 217 214 211 207 205 202 200 198 195 193 191 190 189 188 187 185 184 183 182 180 179 178 177 175 174 174 172 171 170 170 169 168 167 167 167 167 166 166 167 167 166 166 166 166 166 165 164 164 164 164 164 165 165 165 166 166 166 165 166 167 168 168 168
1071 168 167 166 166 166 166 165 165 165 164 163 163 163 162 162 160 159 158 157 158 158 159 160 160 160 159 159 159 158 157 157 156 155 155 156 157 157 156 155 155 155 156 157 158 158 158 158 159 160 161 161 161 161 160 159 159 159 160 160 161 160 160 159 159 158 158 159 160 160 160
1064 160 160 161 162 163 162 162 161 161 162 161 160 159 159 159 159 159 158 158 159 159 160 161 161 161 160 160 160 158 158 159 160 160 160 160 160 161 161 162 161 161 160 161 162 163 163 163 162 160 161 162 162 162 161 161 161 162 162 162 162 162 162 162 162 161 161 161 161 161 162
1057 162 164 164 163 162 162 161 160 159 158 158 157 157 156 155 154 153 151 149 148 146 144 143 142 141 139 138 137 138 138 139 138 137 138 137 136 135 135 135 136 137 138 139 140 141 142 142 142 142 143 144 145 147 148 148 149 149 149 149 149 148 148 148 149 149 149 150 150 150 151
1049 151 150 150 149 149 149 150 152 152 152 152 152 153 154 154 153 152 152 152 153 154 153 152 152 153 152 152 153 153 153 152 152 152 151 151 149 148 148 148 149 149 149 149 149 149 149 148 148 148 149 149 149 149 149 148 147 146 147 148 148 149 149 149 150 150 150 150 148 147 147
1042 147 146 146 146 146 147 148 148 147 147 147 147 148 149 149 147 146 147 147 146 146 146 146 145 145 145 144 144 145 146 147 148 148 149 149 150 149 148 148 147 147 148 148 149 148 148 148 147 148 148 148 148 147 147 148 148 149 150 150 150 148 147 147 148 149 150 150 149 148 149
1035 149 150 150 150 150 151 151 149 148 148 148 149 150 150 150 149 147 146 146 147 147 146 146 145 145 145 145 145 145 144 144 145 145 146 147 146 146 146 146 146 147 147 148 148 148 148 148 148 148 148 148 148 147 147 147 148 149 149 148 148 148 148 149 150 149 149 149 149 149 149
$$ packed form
1086B65LMMLLJJKKKLLKLKLLJJLLLLLLLKLKKJJJK%jklmnlmlmmmnmmllmmljkkkjkkllmllklm
1079B42lmllmmmllmklkklkkjjjjkjjjkjjjkj%kjj%jjj%%%j%J%j%%%%jj%%%%J%%J%%jJJJ%%
1071A68jj%%%j%%jj%%j%kjjjJ%JJ%%j%%jj%jj%JJ%jj%%JJJ%%%JJJ%%%jj%%J%Jj%j%j%JJ%%
1064A60%JJJj%j%Jjjj%%%%j%J%JJ%%j%%k%JJ%%%%J%Jj%jJJJ%%jkJJ%%j%%J%%%%%%%j%%%%J
1057A62K%jj%jjjj%j%jjjjkkjkkjjjkjjJ%JjjJjjj%%JJJJJJJ%%%JJJKJ%J%%%%j%%J%%J%%J
1049A51j%j%%JK%%%%JJ%jj%%JJjj%Jj%J%%j%%j%kj%%J%%%%%%j%%J%%%%jjjJJ%J%%J%%%kj%
1042A47j%%%JJ%j%%%JJ%kjJ%j%%%j%%j%JJJJ%J%Jjj%j%J%Jj%%jJ%%%j%J%JJ%%kj%JJJ%jjJ
1035A49J%%%J%kj%%JJ%%jkj%J%j%j%%%%%j%J%JJj%%%%J%J%%%%%%%%%j%%JJ%j%%%JJj%%%%%
$$ plain form
1027 149 149 150 149 149 148 148 147 148 149 149 148 148 148 148 149 150 150 149 150 150 150 150 149 148 148 147 146 146 145 146 147 147 148 149 149 149 150 150 150 151 151 152 152 153 153 152 151 152 153 153 152 152 152 152 152 152 152 152 151 150 148 148 149 149 149 149 149 148 148
1020 148 148 149 149 150 150 150 150 150 150 149 148 148 148 148 149 149 149 148 147 147 147 146 146 146 147 147 148 150 151 151 150 149 149 149 148 147 149 150 151 151 151 151 153 153 152 152 154 155 155 155 155 156 156 157 157 158 157 156 155 154 155 155 154 155 156 158 158 159 159
1013 159 158 159 159 159 160 160 160 161 162 162 162 161 161 160 160 160 161 162 163 163 163 162 162 162 160 160 161 161 161 161 162 163 163 163 163 162 161 162 163 164 165 166 167 169 171 171 172 172 172 171 170 170 170 170 171 172 174 174 175 176 176 178 179 181 182 184 185 187 189
1005 189 191 193 193 194 194 195 196 199 202 204 205 206 207 208 211 213 215 217 218 221 225 229 233 236 240 245 250 255 261 268 274 280 285 291 297 303 312 323 333 343 356 368 382 396 410 428 448 470 493 518 546 576 609
1000 609 645 684 727 774 825 880 940 1001 1065 1131 1196 1262 1328 1392 1452 1508 1558 1602 1639 1668 1688 1699 1701 1693 1675 1648 1613 1570 1520 1463 1401 1336 1266 1197 1129 1061
996 1061 995 933 875 820 771 724 681 642 606 574 545 517 492 470 450 431 414 398 383 370 359 348 336 325 316 308 299 293 287 282 275 268 263 258 253 249 245 241 238 234 230 226 224 222 220
991 220 218 216 213 210 209 208 207 205 203 201 200 199 197 196 194 192 192 191 191 190 188 186 184 182 180 180 180 179 179 179 178 178 177 175 174 173 172 172 173 174 174 174 173 172 171 171 170 169 168 167 167 166 166 166 165 165 164 164 163 162 162 161 161 160 159 158 157 156 155 154
984 154 155 156 156 157 157 156 156 156 154 153 153 153 153 154 154 156 156 155 156 156 157 157 156 155 154 154 154 155 155 155 154 154 154 154 153 153 152 152 152 152 151 152 152 151 150 150 151 153 154 155 154 153 153 153 153 153 153 153 152 152 152 152 152 153 152 152 151 150 149 149
$$ packed form
1027A49%Jj%j%jJJ%j%%%JJ%jJ%%%jj%jj%jJJ%JJ%%J%%J%J%J%jjJJ%j%%%%%%%jjk%J%%%%j%
1020A48%J%J%%%%%jj%%%J%%jj%%j%%J%JKJ%jj%%jjKJJ%%%K%j%KJ%%%J%J%JjjjjJ%jJJK%J%
1013A59jJ%%J%%JJ%%j%j%%JJJ%%j%%k%J%%%JJ%%%jjJJJJJJKK%J%%jj%%%JJK%JJ%KJKJKJKK
1005A89KK%J%JJLLKJJJJLKKKJLMMMLMNNNOPOONOOORJ1J0J0J3J2J4J4J4J8K0K2K3K5K8L0L3
1000F09L6L9M3M7N1N5O0O1O4O6O5O6O6O4O0N6N0M4L7K9K0J1Kqj8k7l5m3n0n7o2o5p0o9o8o8
996A061o6o2n8n5m9m7m3l9l6l2k9k8k5k2k0j9j7j6j5j3j1j1j2j1rqroonppnnnmmmlmmmkkk
991B20kklljjjkkkjjkjkk%j%jkkkkk%%j%%j%jkjjj%JJ%%jjj%jjjj%j%%j%j%jj%j%jjjjjjj
984A54JJ%J%j%%kj%%%J%K%jJ%J%jjj%%J%%j%%%j%j%%%jJ%jj%JKJJjj%%%%%%j%%%%Jj%jjj%
$$ plain form
976 149 150 151 152 152 152 151 151 150 150 148 148 148 148 147 146 146 146 147 147 146 146 147 147 147 149 148 147 146 146 145 145 145 145 146 145 145 145 145 146 146 145 145 145 146 146 146 145 145 145 146 146 146 146 146 146 146 145 145 146 147 148 148 147 146 145 144 145 145 146 147
969 147 147 147 148 148 148 148 147 147 147 147 147 147 146 146 147 147 147 147 147 147 146 147 147 146 146 146 146 146 147 148 148 147 147 146 147 148 148 149 148 148 147 147 146 145 145 144 144 143 143 144 145 146 146 146 146 146 145 146 146 145 145 145 145 144 145 145 145 144 144 144
962 144 145 145 146 146 145 144 144 144 145 146 146 147 147 146 145 144 144 144 145 146 146 146 145 144 144 144 144 144 145 146 145 145 144 144 144 143 142 142 144 145 145 146 146 145 145 145 145 145 146 146 145 145 145 145 145 145 144 144 144 144 145 146 146 145 145 145 146 145 146 148
954 148 148 148 147 146 145 145 145 146 146 146 147 147 147 147 147 146 146 147 147 147 149 150 150 150 149 147 147 146 147 147 148 150 151 151 150 149 148 148 148 148 149 149 150 150 149 149 148 147 147 146 145 143 143 144 143 142 142 142 142 142 143 144 145 145 145 145 145 145 146 147
947 147 146 146 146 147 147 147 147 147 146 146 146 146 148 150 150 151 151 150 148 147 147 146 147 149 150 151 151 150 150 151 152 152 152 151 150 150 150 150 150 151 152 152 152 153 152 151 151 150 150 150 150 150 150 150 150 150 150 151 152 152 152 152 151 151 151 152 152 153 152 151
939 151 150 149 150 150 151 151 152 152 153 154 154 154 153 153 153 152 152 152 152 152 153 153 154 155 155 155 155 156 156 156 156 156 155 154 154 153 155 156 156 156 157 157 157 158 158 159 161 163 165 166 165 165 165 166 169 172 174 177 180 182 185 188 190 192 194 196 197 198 200 201
932 201 201 200 199 197 196 194 192 189 186 182 180 177 174 171 169 169 168 166 164 163 162 161 160 159 158 157 157 156 156 157 157 157 157 157 157 157 158 159 159 160 160 160 158 157 157 156 155 154 154 155 156 157 158 158 156 155 155 155 156 157 157 158 157 157 156 156 156 156 157 158
924 158 158 158 158 158 157 156 156 156 157 157 157 157 158 158 158 158 159 159 159 160 160 158 158 159 160 159 159 158 157 157 158 158 159 160 160 158 156 156 156 155 156 156 155 155 155 155 155 155 155 156 156 156 156 155 154 154 154 153 153 152 152 151 151 151 151 150 151 152 152 153
$$ packed form
976A49JJJ%%j%j%k%%%jj%%J%j%J%%Kjjj%j%%%Jj%%%J%j%%J%%j%%J%%%%%%j%JJJ%jjjjJ%JJ
969A47%%J%%%j%%%%%j%J%%%%%jJ%j%%%%JJ%j%jJJ%Jj%j%jj%j%j%JJJ%%%%jJ%j%%%jJ%%j%%
962A44J%J%jj%%JJ%J%jjj%%JJ%%jj%%%%JJj%j%%jj%KJ%J%j%%%%J%j%%%%%j%%%JJ%j%%JjJK
954A48%%jjj%%J%%J%%%%j%J%%KJ%%jk%jJ%JKJ%jjj%%%J%J%j%jj%jjk%Jjj%%%%JJJ%%%%%JJ
947A47j%%J%%%%j%%%KK%J%jkj%jJKJJ%j%JJ%%jj%%%%JJ%%Jjj%j%%%%%%%%%JJ%%%j%%J%Jjj
939A51jjJ%J%J%JJ%%j%%j%%%%J%JJ%%%J%%%%jj%jKJ%%J%%J%JKKKJj%%JLLKLLKLLKKKKJJKJ
932B01%jjkjkkllmklllk%jkkjjjjjjj%j%J%%%%%%JJ%J%%kj%jjj%JJJJ%kj%%JJ%Jj%j%%%JJ
924A58%%%%jj%%J%%%J%%%J%%J%k%JJj%jj%J%JJ%kk%%jJ%j%%%%%%J%%%jj%%j%j%j%%%jJJ%J
$$ plain form
917 153 153 154 153 153 152 152 153 153 154 155 156 156 156 156 155 155 154 154 154 154 155 156 157 158 158 158 158 157 158 158 159 159 159 158 159 159 159 159 158 157 158 158 158 159 159 159 159 160 160 159 158 158 158 158 158 157 156 156 157 157 157 158 159 160 160 160 160 160 159 159
910 159 159 159 159 160 161 162 162 163 163 164 164 164 163 162 162 163 163 164 164 165 166 166 167 168 169 170 169 168 169 169 170 171 171 171 172 173 172 172 172 173 173 174 174 173 173 172 171 169 169 169 170 170 171 171 170 169 170 170 170 169 167 167 168 168 169 170 170 171 170 170
902 170 170 171 171 172 172 171 169 169 170 170 170 171 173 175 175 176 176 177 177 177 179 181 183 185 187 188 189 192 196 199 201 204 207 210 213 217 219 221 223 225 228 230 230 229 228 226 226 224 220 217 213 210 207 203 199 195 193 191 189 187 187 187 186 185 184 182 182 181 180 180
895 180 180 180 181 181 181 182 181 181 180 178 178 178 180 181 183 184 184 184 184 183 184 184 184 183 183 183 183 183 183 183 182 182 182 181 181 181 181 181 181 181 181 182 184 184 184 184 184 184 185 185 185 186 186 186 187 187 188 190 190 190 191 193 195 197 198 198 198 198 197 196
887 196 196 196 195 194 194 195 196 196 196 196 196 195 195 195 195 195 196 196 197 197 198 199 199 200 199 198 198 200 201 202 204 206 205 205 206 208 209 211 214 216 218 219 222 224 227 229 232 235 239 243 248 252 255 258 262 268 274 280 284 289 294 300 305 310 316 321 327 332 338 344
880 344 351 358 363 369 376 382 390 398 406 413 421 429 437 445 455 466 477 487 496 505 514 522 530 537 545 553 559 566 571 574 577 578 579 579 578 575 571 565 556 546 537 528 517 507 494 480 465 452 438 424 409 395 382 369
874 369 357 345 334 324 314 305 296 287 280 273 267 260 255 249 244 240 235 230 225 221 217 215 213 210 208 206 203 201 199 196 194 194 193 191 189 188 187 186 186 185 184 184 183 183 182 181 180 179 178 177 177 176 174 173 173 172 172 171 171 171 170 170 169 168 168
867 168 168 168 168 168 167 166 165 164 165 165 165 164 163 163 162 163 163 163 164 163 163 162 162 162 162 161 160 159 159 160 161 160 159 159 159 159 159 159 159 159 158 157 156 156 156 156 155 154 155 155 155 156 157 158 158 158 158 158 157 157 157 158 158 158 157 157 157 156 155 155
$$ packed form
917A53%Jj%j%J%JJJ%%%j%j%%%JJJJ%%%jJ%J%%jJ%%%jjJ%%J%%%J%jj%%%%jj%J%%JJJ%%%%j%
910A59%%%JJJ%J%J%%jj%J%J%JJ%JJJJjjJ%JJ%%JJj%%J%J%j%jjk%%J%J%jjJ%%jk%J%JJ%Jj%
902A70%J%J%jk%J%%JKK%J%J%%KKKKKJJLMLKLLLLMKKKKLK%jjk%kmlmllmmmkkkk%%jjjk%jj%
895A80%%J%%Jj%jk%%KJKJ%%%jJ%%j%%%%%%j%%j%%%%%%%JK%%%%%J%%J%%J%JK%%JKKKJ%%%jj
887A96%%jj%JJ%%%%j%%%%J%J%JJ%Jjj%KJJKKj%JKJKLKKJLKLKLLMMNMLLMOOOMNNONNONONOO
880C44PPNOPOQQQPQQQQJ0J1J1J0RRRQQPQQOPNLLJJ%jlmorj0rrj1j0j3j4j5j3j4j4j5j4j3j3
874C69j2j2j1j0j0rrrppopnonmnnnmmkklkklkklk%jkkjjj%jj%j%jjjjjj%jkj%j%j%%j%jj%
867A68%%%%jjjjJ%%jj%jJ%%Jj%j%%%jjj%JJjj%%%%%%%jjj%%%jjJ%%JJJ%%%%j%%J%%j%%jj%
$$ plain form
860 155 155 154 153 152 153 154 154 155 156 156 154 153 153 154 154 154 154 154 154 153 153 152 151 150 149 150 150 151 151 151 150 149 149 149 150 151 151 151 150 150 149 150 150 151 151 150 150 149 148 148 148 148 148 149 149 150 150 151 151 150 150 151 152 152 152 150 149 150 151 152
852 152 153 152 152 152 151 149 148 148 149 148 149 149 148 146 146 149 150 148 148 148 148 148 148 148 148 149 149 149 149 149 149 148 147 147 147 147 146 147 148 148 147 146 146 146 146 146 147 149 149 149 148 147 147 147 147 148 148 148 147 147 148 147 146 146 147 148 148 147 148 148
845 148 148 147 146 146 145 145 145 146 147 147 147 147 147 146 147 147 147 146 145 145 145 145 145 145 145 145 145 144 144 145 144 144 144 144 144 145 145 145 145 146 146 146 145 145 145 145 145 144 144 144 144 144 144 144 144 144 145 144 144 143 142 143 144 144 143 143 143 144 143 142
838 142 140 140 141 142 141 141 142 143 143 143 143 144 144 144 144 144 145 145 145 145 145 144 144 145 145 145 144 143 143 144 145 145 145 144 144 143 142 142 142 142 142 143 143 143 142 143 143 143 143 143 143 143 144 143 142 141 140 140 141 141 141 140 140 140 140 140 141 140 139 139
830 139 139 139 140 141 141 141 142 140 139 139 140 140 141 142 142 142 141 140 139 139 139 139 139 139 139 139 138 138 138 137 136 136 135 136 136 137 137 138 139 140 140 140 139 138 139 140 139 139 139 140 141 142 142 141 140 141 141 141 140 140 140 140 141 141 141 141 141 141 142 141
823 141 140 139 140 141 141 140 139 138 139 139 140 140 141 140 139 138 137 138 138 138 138 138 138 138 139 140 139 140 140 141 141 141 140 140 140 139 138 138 140 140 139 138 138 137 137 138 139 140 141 142 141 140 138 138 139 139 140 141 140 141 142 142 143 143 142 143 143 143 143 143
815 143 142 142 141 141 141 141 141 141 142 142 142 142 142 142 142 142 142 142 142 142 142 141 141 141 141 140 140 140 139 138 139 139 139 139 140 140 140 139 139 139 140 141 142 141 140 140 140 139 138 138 138 139 139 138 138 139 140 141 141 140 141 141 141 141 140 140 139 139 138 139
808 139 140 141 141 141 141 140 139 140 141 140 140 139 139 139 139 139 140 141 142 141 140 139 137 138 138 138 138 138 139 138 137 137 138 138 137 137 137 138 138 138 138 138 138 138 138 139 139 139 138 138 138 137 137 137 137 137 137 136 136 136 135 135 135 135 135 135 135 135 136 137
$$ packed form
860A55%jjjJJ%JJ%kj%J%%%%%j%jjjjJ%J%%jj%%JJ%%j%jJ%J%j%jj%%%%J%J%J%j%JJ%%kjJJJ
852A52Jj%%jkj%JjJ%jk%LJk%%%%%%%J%%%%%jj%%%jJJ%jj%%%%JK%%jj%%%J%%j%Jjj%JJ%jJ%
845A48%jj%j%%JJ%%%%jJ%%jj%%%%%%%%j%Jj%%%%J%%%J%%j%%%%j%%%%%%%%Jj%jjJJ%j%%Jjj
838A42k%JJj%JJ%%%J%%%%J%%%%j%J%%jj%JJ%%j%jj%%%%J%%jJ%%%%%%Jjjjj%J%%j%%%%Jjj%
830A39%%JJ%%Jkj%J%JJ%%jjj%%%%%%%j%%jj%jJ%J%JJJ%%jjJJj%%JJJ%jjJ%%j%%%J%%%%%Jj
823A41jjJJ%jjjJ%J%JjjjjJ%%%%%%JJjJ%J%%j%%jj%K%jj%j%JJJJJjjk%J%JJjJJ%J%jJ%%%%
815A43j%j%%%%%J%%%%%%%%%%%%j%%%j%%jjJ%%%J%%j%%JJJjj%%jj%%J%j%JJJ%jJ%%%j%j%jJ
808A39JJ%%%jjJJj%j%%%%JJJjjjkJ%%%%Jjj%J%j%%J%%%%%%%J%%j%%j%%%%%j%%j%%%%%%%JJ
$$ plain form
801 137 138 139 138 137 137 137 138 138 138 139 140 140 138 137 137 137 137 137 137 136 136 137 137 138 138 136 136 137 137 137 137 136 136 136 136 137 136 136 137 136 136 135 136 137 136 135 135 135 135 135 136 135 135 135 135 135 135 135 135 135 136 137 137 136 136 135 135 136 137 137
793 137 138 138 138 138 137 136 136 136 136 136 137 138 138 138 138 138 138 137 136 136 135 136 136 137 138 137 136 137 137 137 137 138 138 138 136 135 135 136 136 137 137 138 137 137 138 138 136 134 133 134 134 134 134 135 136 136 136 136 136 137 137 138 138 138 136 135 135 134 134 133
786 133 133 134 134 134 134 134 134 133 133 132 132 133 133 133 133 133 134 134 134 135 135 135 134 134 134 134 134 134 133 133 133 133 133 134 134 134 134 134 135 135 135 135 134 133 133 133 133 133 133 134 134 135 136 136 136 136 136 135 135 136 137 137 136 136 135 134 134 134 134 135
778 135 135 135 136 137 138 138 137 136 136 137 137 135 134 134 135 135 136 136 137 137 138 137 137 136 136 137 138 137 137 137 137 136 135 134 133 134 135 135 135 135 136 136 136 137 138 137 136 135 135 135 136 137 137 135 134 134 136 137 138 138 137 137 137 137 136 136 137 137 137 136
771 136 136 135 135 135 135 135 135 135 135 135 136 136 136 137 137 137 137 138 138 138 137 136 136 137 138 138 139 137 135 134 135 137 137 137 137 136 136 135 134 134 135 135 136 135 135 135 135 135 134 135 136 137 138 137 137 136 134 135 135 135 135 135 135 136 136 136 136 136 137 137
763 137 138 138 138 137 136 136 136 136 137 136 136 136 137 137 136 134 134 135 136 137 138 137 137 137 136 136 136 136 136 136 136 136 135 135 136 136 135 135 135 135 134 134 135 135 136 136 136 135 136 136 135 135 135 136 136 137 137 137 136 136 135 135 137 139 140 140 141 140 139 138
756 138 138 138 138 138 138 138 138 136 135 135 135 135 135 135 135 135 135 135 136 137 136 136 136 136 135 134 133 133 134 135 134 135 135 136 136 136 135 135 134 134 135 136 138 138 138 137 136 137 137 137 138 138 138 138 137 137 136 136 136 136 135 136 137 137 137 136 136 137 137 137
749 137 138 138 138 139 139 140 139 139 138 137 137 137 138 138 138 139 138 138 138 138 138 138 138 137 137 136 135 135 135 136 137 137 137 137 137 137 137 137 136 137 138 138 137 136 136 137 137 137 136 135 135 135 135 135 135 136 137 138 138 137 137 136 136 135 135 135 136 135 135 136
$$ packed form
801A37JJjj%%J%%JJ%kj%%%%%j%J%J%k%J%%%j%%%Jj%Jj%jJJjj%%%%Jj%%%%%%%%JJ%j%j%JJ%
793A37J%%%jj%%%%JJ%%%%%jj%jJ%JJjjJ%%%J%%kj%J%J%Jj%J%kkjJ%%%JJ%%%%J%J%%kj%j%j
786A33%J%%%%%j%j%J%%%%J%%J%%j%%%%%j%%%%J%%%%J%%%jj%%%%%J%JJ%%%%j%JJ%j%jj%%%J
778A35%%JJJ%jj%J%kj%J%J%J%Jj%j%JJj%%%jjjjJJ%%%J%%JJjjj%%JJ%kj%KJJ%j%%%j%J%%j
771A36%j%%%%%%%%J%%J%%%J%%jj%JJ%JkkjJK%%%j%jj%J%Jj%%%%jJJJJj%jkJ%%%%%J%%%%J%
763A37J%%jj%%%Jj%%J%jk%JJJJj%%j%%%%%%%j%J%j%%%j%J%J%%jJ%j%%J%J%%j%j%KKJ%Jjjj
756A38%%%%%%%kj%%%%%%%%%JJj%%%jjj%JJjJ%J%%j%j%JJK%%jjJ%%J%%%j%j%%%jJJ%%j%J%%
749A37J%%J%Jj%jj%%J%%Jj%%%%%%j%jj%%JJ%%%%%%%jJJ%jj%J%%jj%%%%%JJJ%j%j%j%%Jj%J
$$ plain form
741 136 137 137 136 137 137 136 136 137 137 136 136 135 135 135 134 134 135 134 133 134 135 135 136 136 136 136 136 136 136 136 136 137 138 139 138 137 136 135 134 134 133 134 134 135 135 135 134 135 136 136 134 134 135 136 135 135 136 136 137 136 135 135 136 137 137 137 136 134 134 134
734 134 134 133 133 133 133 134 134 134 133 133 133 133 134 134 134 134 134 133 133 133 134 134 134 134 134 135 135 135 135 135 135 135 135 135 135 135 135 135 135 135 134 134 134 134 134 134 135 134 134 134 135 135 136 136 135 135 135 136 136 135 135 134 134 134 134 134 134 134 133 133
726 133 133 132 132 132 132 132 133 133 133 133 132 132 132 132 132 131 131 133 132 132 134 134 134 134 134 134 134 135 136 136 135 135 135 135 135 134 134 133 132 131 132 132 132 132 133 132 132 133 134 134 134 134 133 134 135 134 133 130 129 130 132 132 132 133 133 134 134 134 134 134
719 134 133 134 134 135 136 136 135 134 134 133 132 132 131 132 132 133 134 135 136 136 135 133 133 134 134 134 133 133 132 133 133 132 132 132 133 133 132 131 132 132 131 132 133 133 133 132 131 132 132 133 133 133 132 133 134 134 135 134 133 133 132 132 132 133 133 134 134 135 135 135
712 135 134 133 133 132 131 131 131 131 130 130 130 131 133 134 133 133 132 132 132 132 131 133 134 135 135 134 133 133 133 133 133 134 135 136 137 137 137 136 135 135 134 134 134 135 136 136 136 136 136 135 135 136 136 135 134 134 134 134 133 132 133 135 136 136 136 136 136 135 135 135
704 135 135 134 134 134 135 135 135 134 134 134 135 135 134 133 134 136 137 136 136 136 135 135 135 135 136 135 135 135 135 135 134 134 134 135 135 135 134 134 134 134 134 133 133 132 132 133 135 134 134 134 135 134 133 133 134 135 134 134 134 134 133 133 133 133 133 132 132 132 132 132
697 132 132 134 134 133 132 133 134 135 136 135 134 134 133 133 132 132 131 130 131 132 132 132 133 133 133 133 132 133 134 135 135 135 135 135 135 134 132 132 132 134 134 134 133 132 132 132 133 134 135 135 135 135 134 134 133 133 132 132 133 133 133 133 133 132 131 131 131 132 133 133
689 133 131 130 130 130 131 132 132 132 133 133 132 132 132 133 133 133 133 132 131 131 131 132 133 134 135 135 134 134 134 134 134 133 133 133 132 133 133 133 133 133 133 132 132 133 133 133 133 134 134 134 133 133 132 132 132 132 133 133 134 133 133 132 132 132 132 133 134 134 134 134
$$ packed form
741A36J%jJ%j%J%j%j%%j%JjjJJ%J%%%%%%%%JJJjjjjj%jJ%J%%jJJ%k%JJj%J%Jjj%JJ%%jk%%
734A34%j%%%J%%j%%%J%%%%j%%J%%%%J%%%%%%%%%%%%%%j%%%%%Jj%%J%J%j%%J%j%j%%%%%%j%
726A33%j%%%%J%%%j%%%%j%Kj%K%%%%%%JJ%j%%%%j%jjjJ%%%Jj%JJ%%%jJJjjljJK%%J%J%%%%
719A34jJ%JJ%jj%jj%jJ%JJJJ%jk%J%%j%jJ%j%%J%jjJ%jJJ%%jjJ%J%%jJJ%Jjj%j%%J%J%J%%
712A35jj%jj%%%j%%JKJj%j%%%jKJJ%jj%%%%JJJJ%%jj%j%%JJ%%%%j%J%jj%%%jjJKJ%%%%j%%
704A35%j%%J%%j%%J%jjJKJj%%j%%%Jj%%%%j%%J%%j%%%%j%j%JKj%%Jjj%JJj%%%j%%%%j%%%%
697A32%K%jjJJJJjj%j%j%jjJJ%%J%%%jJJJ%%%%%jk%%K%%jj%%JJJ%%%j%j%j%J%%%%jj%%JJ%
689A33kj%%JJ%%J%j%%J%%%jj%%JJJJ%j%%%%j%%jJ%%%%%j%J%%%J%%j%j%%%J%Jj%j%%%JJ%%%
$$ plain form
682 134 134 134 134 134 135 135 135 136 136 136 136 136 136 136 135 135 135 135 135 136 136 136 136 135 135 135 134 134 133 134 135 135 135 135 135 135 135 135 135 135 135 135 135 135 134 133 134 135 136 135 134 133 133 134 134 133 133 133 133 133 133 133 133 133 134 135 135 135 135 134
674 134 133 133 132 132 132 132 132 133 134 134 134 134 134 133 133 131 130 129 128 128 128 129 131 131 132 132 131 131 133 133 133 134 135 135 134 135 136 137 136 134 131 131 132 132 132 132 132 132 132 132 131 132 133 134 134 135 134 134 134 134 133 133 132 133 133 134 135 135 135 135
667 135 136 136 134 134 133 132 132 133 133 133 132 132 133 133 133 133 132 132 132 132 132 132 132 132 132 132 132 133 132 132 132 132 133 133 134 133 132 132 133 132 132 132 132 132 133 133 133 133 132 131 131 131 132 132 132 131 131 132 132 132 133 133 133 133 134 134 134 133 133 133
660 133 133 133 132 132 132 133 134 134 134 134 134 133 132 132 132 132 133 133 133 134 135 134 132 131 132 133 132 131 130 130 130 131 130 130 131 131 132 133 133 132 131 129 128 129 131 131 132 132 134 135 134 133 133 133 133 133 133 134 134 134 134 134 133 133 132 132 132 132 132 133
652 133 133 133 133 133 133 133 133 133 133 133 133 134 135 134 134 134 133 132 131 131 132 133 134 135 135 135 134 133 133 132 132 132 134 135 134 133 132 132 132 132 132 133 133 133 132 131 130 131 131 132 132 133 134 133 133 132 132 133 134 134 133 133 132 131 130 130 132 133 134 134
645 134 135 135 135 135 134 134 134 134 134 132 132 132 131 132 132 132 132 132 132 132 132 133 133 134 134 133 132 131 130 130 131 132 133 133 134 134 135 134 134 134 134 134 133 132 132 133 134 134 133 132 132 132 132 131 131 131 132 132 131 132 132 133 133 133 133 132 131 132 132 132
637 132 133 133 133 133 133 133 133 133 133 134 134 134 132 131 131 131 132 131 132 133 134 133 133 133 132 132 131 129 129 129 130 130 130 131 132 133 133 132 132 133 133 133 132 132 131 132 133 132 132 131 131 132 133 133 132 133 133 134 133 132 133 133 134 134 134 134 134 135 134 133
630 133 132 133 133 133 133 133 134 134 134 134 134 134 135 135 135 134 133 133 133 134 134 134 133 134 134 134 134 134 134 134 134 135 135 135 136 135 135 135 135 135 134 134 134 136 137 136 135 136 137 137 137 138 139 140 141 141 141 141 141 141 142 144 146 147 147 149 151 152 153 154
$$ packed form
682A34%%%%J%%J%%%%%%j%%%%J%%%j%%j%jJJ%%%%%%%%%%%%%jjJJJjjj%J%j%%%%%%%%JJ%%%j
674A34j%j%%%%JJ%%%%j%kjjj%%JK%J%j%K%%JJ%jJJJjkl%J%%%%%%%jJJJ%Jj%%%j%jJ%JJ%%%
667A35J%k%jj%J%%j%J%%%j%%%%%%%%%%Jj%%%J%Jjj%Jj%%%%J%%%jj%%J%%j%J%%J%%%J%%j%%
660A33%%j%%JJ%%%%jj%%%J%%JJjkjJJjjj%%Jj%J%JJ%jjkjJK%J%KJjj%%%%%J%%%%j%j%%%%J
652A33%%%%%%%%%%%JJj%%jjj%JJJJ%%jj%j%%KJjjj%%%%J%%jjjJ%J%JJj%j%JJ%j%jjj%KJJ%
645A34J%%%j%%%%k%%jJ%%%%%%%J%J%jjjj%JJJ%J%Jj%%%%jj%JJ%jj%%%j%%J%jJ%J%%%jjJ%%
637A32J%%%%%%%%J%%kj%%JjJJJj%%j%jk%%J%%JJJ%j%J%%j%jJJj%j%JJ%jJ%JjjJ%J%%%%Jjj
630A33jJ%%%%J%%%%%J%%jj%%J%%jJ%%%%%%%J%%Jj%%%%j%%KJjjJJ%%JJJJ%%%%%JKKJ%KKJJJ
$$ plain form
623 154 155 157 159 161 162 163 163 164 165 166 167 168 165 163 162 162 161 160 159 158 157 156 154 153 151 150 150 149 148 147 146 146 146 145 145 145 145 144 144 143 142 143 143 145 146 146 146 146 148 149 150 151 152 153 154 154 155 157 159 161 163 166 170 173 176 179 181 184 187 189
615 189 190 192 194 195 195 196 196 196 195 193 191 190 188 183 179 174 171 167 164 161 160 158 156 154 152 150 148 147 146 146 145 145 145 145 145 144 143 141 141 141 141 141 142 142 142 141 142 144 145 146 146 146 145 145 145 146 147 148 149 151 153 154 156 158 160 161 163 164 165 166
608 166 166 167 167 167 167 166 165 164 163 161 160 158 157 156 155 154 153 151 149 148 147 146 144 143 141 141 141 141 141 141 140 140 139 139 139 139 138 139 140 140 141 140 139 138 138 138 137 137 137 138 138 139 140 141 140 139 139 139 138 138 137 137 138 138 138 138 136 136 136 138
600 138 140 141 141 140 139 139 139 140 141 141 142 141 140 140 141 142 143 144 145 146 145 144 145 145 145 145 145 145 146 145 144 144 143 143 143 143 143 143 144 143 143 143 143 143 143 144 145 144 143 144 145 144 144 144 144 145 145 145 145 144 143 144 145 146 147 147 148 148 147 147
593 147 146 147 148 149 150 151 151 151 151 152 152 152 152 151 151 152 153 154 155 155 156 156 155 154 154 155 156 157 157 158 158 157 156 157 157 157 156 156 156 155 154 153 154 154 153 153 154 155 154 154 155 155 155 155 155 155 156 155 154 154 153 153 153 154 155 155 155 154 152 152
585 152 151 150 151 152 153 153 154 153 152 151 150 149 149 150 152 152 151 151 152 152 151 151 151 150 150 150 150 149 149 150 149 149 150 152 153 153 152 151 150 150 149 149 149 149 148 147 147 147 147 148 149 150 150 149 148 147 147 146 146 147 147 145 144 143 142 142 142 142 142 141
578 141 141 141 141 141 140 139 138 138 138 139 140 140 140 140 140 141 142 143 144 143 142 142 142 141 140 141 141 141 141 140 139 139 138 138 140 140 140 139 139 138 137 137 136 137 137 137 137 137 137 137 137 137 137 136 135 135 135 136 137 137 136 136 136 137 138 137 136 136 135 136
571 136 136 136 137 136 135 136 136 136 136 136 136 136 136 137 137 138 138 136 135 136 137 136 136 137 138 138 137 137 137 136 136 135 135 136 137 138 139 138 137 137 136 135 135 136 135 135 135 135 135 135 135 134 133 133 133 133 134 135 135 136 135 133 133 134 135 135 134 135 135 134
$$ packed form
623A54JKKKJJ%JJJJJlkj%jjjjjjkjkj%jjjj%%j%%%j%jjJ%KJ%%%KJJJJJJ%JKKKKLMLLLKLLK
615A89JKKJ%J%%jkkjknmnlmlljkkkkkkjj%j%%%%jjk%%%%J%%jJKJJ%%j%%JJJJKKJKKKJKJJJ
608A66%J%%%jjjjkjkjjjjjkkjjjkjk%%%%%j%j%%%jJJ%Jjjj%%j%%J%JJJjj%%j%j%J%%%k%%K
600A38KJ%jj%%JJ%Jjj%JJJJJJjjJ%%%%%Jjj%j%%%%%Jj%%%%%JJjjJJj%%%J%%%jjJJJJ%J%j%
593A47jJJJJJ%%%J%%%j%JJJJ%J%jj%JJJ%J%jjJ%%j%%jjjJ%j%JJj%J%%%%%Jjj%j%%JJ%%jk%
585A52jjJJJ%Jjjjjj%JK%j%J%j%%j%%%j%Jj%JKJ%jjj%j%%%jj%%%JJJ%jjj%j%J%kjjj%%%%j
578A41%%%%jjj%%JJ%%%%JJJJjj%%jjJ%%%jj%j%K%%j%jj%jJ%%%%%%%%%jj%%JJ%j%%JJjj%jJ
571A36%%JjjJ%%%%%%%J%J%kjJJj%JJ%j%%j%j%JJJJjj%jj%Jj%%%%%%jj%%%JJ%Jjk%JJ%jJ%j
$$ plain form
563 134 133 133 133 133 135 135 134 133 133 134 134 134 134 134 134 134 135 134 134 134 134 135 136 135 135 135 134 136 137 137 136 136 136 135 135 134 134 134 135 135 135 134 134 134 134 135 136 135 134 134 133 133 133 132 131 131 131 131 131 132 132 132 133 133 134 134 133 134 135 135
556 135 135 134 133 133 133 133 133 133 132 132 132 132 132 131 131 131 131 131 132 132 133 132 131 131 131 131 130 130 130 130 130 131 131 131 131 131 131 131 132 131 131 131 131 131 132 132 133 133 133 131 131 132 132 131 131 131 131 131 130 130 129 130 130 130 130 130 130 131 130 129
548 129 129 131 132 132 133 132 131 131 130 129 129 128 127 128 128 129 129 129 129 130 130 130 130 130 130 131 132 132 133 132 131 130 130 129 128 129 130 130 130 130 130 129 128 127 126 127 127 129 130 131 131 131 130 130 130 130 129 129 128 128 129 128 127 127 127 127 127 127 127 128
541 128 128 127 126 127 129 129 129 128 128 128 129 130 129 128 128 129 129 129 129 129 129 130 131 131 131 130 129 129 129 128 128 129 129 129 128 127 127 128 129 129 128 130 131 132 132 132 131 131 131 131 130 130 128 127 128 129 129 128 128 128 128 128 128 129 130 131 131 131 131 131
534 131 131 131 131 131 132 131 131 130 130 130 130 129 129 129 129 128 128 128 128 128 128 128 129 129 130 130 129 129 129 129 129 129 128 127 128 128 127 127 127 127 127 127 128 129 129 129 129 128 128 128 127 127 127 127 128 128 127 129 130 129 128 129 129 129 130 129 129 128 128 128
526 128 128 128 128 129 130 131 132 131 130 130 129 129 129 129 130 129 128 128 127 128 128 128 128 129 130 129 129 129 129 129 130 129 129 128 129 130 129 129 130 130 131 131 132 131 131 131 130 130 131 131 131 131 130 130 130 130 130 129 130 130 130 130 131 130 129 129 129 129 128 128
519 128 128 128 128 128 129 129 129 130 130 130 129 129 129 129 129 129 129 129 130 130 131 130 130 129 128 128 129 130 130 129 130 130 129 129 129 129 129 129 129 130 130 131 131 131 130 129 128 127 127 127 127 128 128 130 131 131 132 132 132 131 130 129 129 129 128 127 127 128 127 127
511 127 128 128 129 129 129 129 130 130 130 130 131 131 131 129 128 128 128 128 128 128 128 129 130 130 130 129 129 128 128 128 127 126 127 128 128 127 127 127 126 126 126 126 126 127 128 128 129 129 130 131 131 130 129 129 129 129 129 129 128 128 128 128 128 129 129 130 128 126 125 126
$$ packed form
563A34j%%%K%jj%J%%%%%%Jj%%%JJj%%jKJ%j%%j%j%%J%%j%%%JJjj%j%%jj%%%%J%%J%J%jJJ%
556A35%jj%%%%%j%%%%j%%%%J%Jjj%%%j%%%%J%%%%%%Jj%%%%J%J%%k%J%j%%%%j%jJ%%%%%Jjj
548A29%KJ%Jjj%jj%jjJ%J%%%J%%%%%JJ%Jjjj%jjJJ%%%%jjjjJ%KJJ%%j%%%j%j%Jjj%%%%%%J
541A28%jjJK%%j%%JJjj%J%%%%%JJ%%jj%%j%J%%jj%JJ%jKJJ%%j%%%j%kjJJ%j%%%%%JJJ%%%%
534A31%%%%Jj%j%%%j%%%j%%%%%%J%J%j%%%%%jjJ%j%%%%%JJ%%%j%%j%%%J%jKJjjJ%%Jj%j%%
526A28%%%JJJJjj%j%%%Jjj%jJ%%%JJj%%%%Jj%jJJj%J%J%Jj%%j%J%%%j%%%%jJ%%%Jjj%%%j%
519A28%%%%J%%J%%j%%%%%%%J%Jj%jj%JJ%jJ%j%%%%%%J%J%%jjjj%%%J%KJ%J%%jjj%%jj%Jj%
511A27J%J%%%J%%%J%%kj%%%%%%JJ%%j%j%%jjJJ%j%%j%%%%JJ%J%JJ%jj%%%%%j%%%%J%JkkjJ
$$ plain form
504 126 127 126 126 126 127 127 128 127 126 126 127 127 127 127 127 126 126 127 127 128 129 128 128 128 127 127 127 127 127 127 128 128 128 128 128 128 128 129 129 128 128 127 126 126 128 128 128 128 128 129 128 127 127 128 130 130 130 130 130 130 130 129 129 129 128 128 128 128 128 128
496 128 129 129 129 130 131 130 129 129 128 128 129 128 127 127 126 127 127 126 127 127 126 126 126 127 128 128 127 127 126 127 127 128 128 128 128 127 127 127 127 128 128 127 127 126 127 128 128 128 128 128 129 130 130 130 129 128 128 127 126 127 127 128 128 128 128 128 128 128 129 130
489 130 130 129 129 129 128 127 128 129 129 128 127 127 128 128 127 127 127 127 126 126 126 126 127 127 127 127 128 129 129 129 130 130 129 129 129 129 129 128 129 128 128 129 128 128 128 128 128 129 129 129 128 128 128 128 128 128 129 128 128 128 128 128 129 129 129 128 127 127 128 129
482 129 128 128 129 128 128 127 125 126 126 127 128 129 130 129 129 129 128 128 127 127 126 127 127 127 127 127 127 126 126 128 128 127 128 129 129 128 127 128 128 129 129 128 128 127 126 126 126 125 125 126 127 127 128 129 129 128 128 128 128 128 128 129 130 129 129 128 126 125 126 127
474 127 128 129 129 129 129 129 129 130 130 131 131 129 128 127 126 125 125 125 126 127 127 127 127 127 127 127 127 128 128 128 128 128 127 126 127 127 126 126 126 127 128 129 129 129 128 128 127 127 128 128 127 126 126 126 127 127 126 126 126 126 127 128 128 127 127 129 130 130 129 129
467 129 129 128 128 127 127 127 128 129 130 130 129 128 128 128 129 128 128 129 129 128 127 127 126 125 124 124 123 123 124 125 126 126 126 126 127 127 128 126 125 125 125 125 124 125 125 126 126 125 124 124 125 127 127 127 127 127 127 127 127 128 129 128 127 126 126 127 127 127 127 126
459 126 126 127 127 127 128 129 129 129 128 127 127 125 124 125 127 128 128 128 127 126 126 127 129 130 129 128 128 128 128 128 129 128 127 127 127 127 127 126 126 126 126 127 127 127 126 126 125 124 126 128 128 128 127 127 126 125 125 126 127 126 126 127 127 127 127 127 126 126 127 128
452 128 129 129 130 130 129 129 130 129 129 129 129 130 130 129 128 128 128 128 128 129 129 128 127 127 126 126 126 127 127 127 128 127 126 126 126 127 127 127 127 127 127 127 127 127 127 127 127 127 127 128 128 129 130 130 129 129 130 130 129 127 127 127 127 127 129 129 129 127 126 126
$$ packed form
504A26Jj%%J%Jjj%J%%%%j%J%JJj%%j%%%%%J%%%%%%J%j%jj%K%%%%Jjj%JK%%%%%%j%%j%%%%%
496A28J%%JJjj%j%Jjj%jJ%jJ%j%%JJ%j%jJ%J%%%j%%%J%j%jJJ%%%%JJ%%jj%jjJ%J%%%%%%JJ
489A30%j%%jjJJ%jj%J%j%%%j%%%J%%%JJ%%J%j%%%%jJj%Jj%%%%J%%j%%%%%Jj%%%%J%%jj%JJ
482A29j%Jj%jkJ%JJJJj%%j%j%jJ%%%%%j%K%jJJ%jjJ%J%j%jj%%j%JJ%JJ%j%%%%%JJj%jkjJJ
474A27JJ%%%%%J%J%kjjjj%%JJ%%%%%%%J%%%%jjJ%j%%JJJ%%j%j%J%jj%%J%j%%%JJ%j%KJ%j%
467A29%j%j%%JJJ%jj%%Jj%J%jj%jjj%j%JJJ%%%J%Jkj%%%jJ%J%jj%JK%%%%%%%JJjjj%J%%%j
459A26%J%%JJ%%jj%kjJKJ%%jj%JKJjj%%%%Jjj%%%%j%%%J%%j%jjKK%%j%jj%JJj%J%%%%j%JJ
452A28J%J%j%Jj%%%J%jj%%%%J%jj%j%%J%%Jjj%%J%%%%%%%%%%%%%J%JJ%j%J%jk%%%%K%%kj%
$$ plain form
445 126 126 127 127 128 128 129 130 129 128 126 125 125 124 124 124 125 125 127 128 127 127 127 126 126 125 125 125 125 126 126 127 126 125 125 125 125 125 125 126 127 128 128 127 127 127 126 126 125 124 124 123 124 125 126 127 128 129 129 128 128 128 128 127 127 126 127 127 127 128 128
437 128 129 129 128 128 127 127 127 127 128 127 127 126 125 125 125 125 125 126 128 129 127 126 126 126 127 128 128 128 127 127 129 129 129 129 129 128 127 126 126 125 125 125 125 126 125 125 126 126 127 127 127 127 127 127 127 126 125 126 126 126 126 126 126 126 126 126 126 126 125 126
430 126 126 126 126 126 127 127 126 126 127 128 128 127 127 127 126 126 126 126 126 126 126 126 125 126 126 126 126 127 127 126 125 125 124 124 124 124 124 125 126 126 127 126 125 126 127 127 127 127 126 125 125 125 125 125 125 126 127 127 127 126 125 126 127 127 128 128 127 126 126 126
422 126 126 126 126 125 125 125 125 127 127 125 125 126 127 127 126 126 125 126 127 127 127 127 127 127 127 128 129 129 129 129 127 125 125 126 127 128 128 128 129 128 127 127 127 126 125 124 125 127 129 128 128 127 126 126 126 126 126 125 125 125 125 125 125 125 125 125 126 127 128 129
415 129 129 128 127 127 126 126 126 126 126 126 126 125 125 126 126 126 127 127 127 127 126 127 127 127 128 128 127 128 128 129 129 128 126 125 125 126 127 127 127 127 127 128 128 128 129 129 130 129 128 127 127 128 128 128 128 128 128 127 127 126 125 125 125 125 125 125 126 126 127 128
407 128 128 129 130 130 129 129 128 127 126 126 127 127 126 125 125 126 127 127 127 127 126 125 125 125 126 127 129 129 130 128 127 127 126 127 128 128 128 128 127 128 127 126 127 127 128 128 128 128 128 127 127 127 126 127 127 127 126 126 126 127 128 127 127 126 126 126 126 126 126 126
400 126 126 126 126 127 127 127 127 127 127 127 126 125 125 126 125 124 125 126 126 125 125 125 125 125 125 125 125 125 125 125 125 125 125 126 127 127 128 128 128 127 127 126 126 126 126 126 126 127 128 128 127 127 127 127 128 127 126 126 126 126 126 126 127 127 128 128 128 128 129 128
393 128 128 128 127 128 129 129 128 128 128 127 127 126 125 125 125 125 125 125 125 125 124 125 125 126 127 127 128 128 128 127 127 126 125 125 125 125 125 126 128 127 127 127 127 127 127 127 126 125 124 124 124 125 125 126 127 127 126 126 126 126 126 126 125 126 125 124 125 127 128 127
$$ packed form
445A26%J%J%JJjjkj%j%%J%KJj%%j%j%%%J%Jjj%%%%%JJJ%j%%j%jj%jJJJJJJ%j%%%j%jJ%%J%
437A28J%j%j%%%Jj%jj%%%%JKJkj%%JJ%%j%K%%%%jjj%j%%%Jj%J%J%%%%%%jjJ%%%%%%%%%%jJ
430A26%%%%J%j%JJ%j%%j%%%%%%%jJ%%%J%jj%j%%%%JJ%JjjJJ%%%jj%%%%%JJ%%jjJJ%J%jj%%
422A26%%%j%%%K%k%JJ%j%jJJ%%%%%%JJ%%%kk%JJJ%%Jjj%%jjjJKKj%jj%%%%j%%%%%%%%JJJJ
415A29%jj%j%%%%%%j%J%%J%%%jJ%%J%jJ%J%jkj%JJ%%%%J%%J%Jjjj%J%%%%%j%jj%%%%%J%JJ
407A28%JJ%j%jjj%J%jj%JJ%%%jj%%JJK%Jkj%jJJ%%%jJjjJ%J%%%%j%%jJ%%j%%JJj%j%%%%%%
400A26%%%J%%%%%%jj%JjjJJ%j%%%%%%%%%%%%%JJ%J%%j%j%%%%%JJ%j%%%Jjj%%%%%J%J%%%Jj
393A28%%jJJ%j%%j%jj%%%%%%%jJ%JJ%J%%j%jj%%%%JKj%%%%%%jjj%%J%JJ%j%%%%%jJjjJKJj
$$ plain form
385 127 126 126 126 126 126 127 128 128 128 127 127 126 126 126 127 127 128 127 127 126 125 125 126 126 127 127 127 128 128 127 127 127 126 126 126 126 126 126 125 125 126 127 128 128 127 126 125 125 125 125 125 126 126 126 126 125 124 124 126 126 126 125 126 127 128 128 128 129 129 128
378 128 126 125 124 124 124 124 123 124 125 125 125 127 127 127 127 127 127 128 128 129 129 128 127 127 126 125 124 124 125 126 126 126 126 127 127 127 128 127 127 126 125 125 124 124 124 124 124 125 125 125 125 127 128 128 128 127 127 126 126 126 126 125 125 125 125 124 124 124 125 125
370 125 126 127 127 126 125 126 126 127 128 127 127 126 126 125 124 124 123 124 126 125 125 124 123 122 122 122 123 124 124 124 124 124 124 124 125 125 125 126 126 127 128 127 127 126 126 125 124 125 125 125 125 125 125 125 125 125 125 126 126 125 125 125 124 125 126 127 127 126 126 126
363 126 125 125 124 124 123 123 123 124 125 126 126 127 127 127 126 126 126 126 126 127 127 128 128 127 126 127 127 127 127 126 126 126 125 125 125 124 124 125 125 126 127 127 126 126 126 126 127 126 126 126 126 127 128 128 128 127 126 126 126 126 127 126 126 125 124 124 124 125 126 127
356 127 127 127 127 127 126 126 125 126 126 127 128 128 128 127 127 127 127 126 126 126 125 126 126 126 127 126 126 126 126 126 126 126 126 126 126 125 125 125 125 125 124 124 124 125 127 128 129 127 126 126 126 125 126 126 127 128 129 128 127 127 126 125 124 124 124 124 124 125 126 126
348 126 126 125 125 125 126 126 127 127 125 125 126 126 127 126 125 125 125 126 126 126 126 126 126 125 125 125 125 125 126 125 126 127 126 126 127 126 126 126 126 125 124 124 125 126 126 126 126 126 126 126 126 126 127 127 127 127 127 127 127 126 126 126 125 125 125 125 125 125 125 126
341 126 126 126 125 125 125 125 126 126 127 127 127 125 124 124 124 124 124 124 124 124 124 123 123 123 124 124 124 124 125 125 124 124 125 126 126 126 125 123 122 121 122 123 124 125 126 126 126 126 126 126 126 126 126 126 125 125 125 125 126 127 127 127 127 127 127 127 126 126 126 126
333 126 126 126 126 126 125 125 125 125 125 125 126 126 126 126 126 126 126 126 125 124 123 123 123 124 125 125 124 124 124 124 124 124 124 125 124 124 124 123 123 123 123 124 124 123 123 124 124 124 123 123 124 125 125 124 124 123 123 123 124 125 127 127 127 127 127 128 128 128 128 127
$$ packed form
385A27j%%%%JJ%%j%j%%J%Jj%jj%J%J%%J%j%%j%%%%%j%JJJ%jjj%%%%J%%%jj%K%%jJJJ%%J%j
378A28kjj%%%jJJ%%K%%%%%J%J%jj%jjj%JJ%%%J%%Jj%jj%j%%%%J%%%KJ%%j%j%%%j%%%j%%J%
370A25JJ%jjJ%JJj%j%jj%jJKj%jjj%%JJ%%%%%%J%%J%JJj%j%jjJ%%%%%%%%%J%j%%jJJJ%j%%
363A26j%j%j%%JJJ%J%%j%%%%J%J%jjJ%%%j%%j%%j%J%JJ%j%%%Jj%%%JJ%%jj%%%Jj%jj%%JJJ
356A27%%%%j%jJ%JJ%%j%%%j%%jJ%%Jj%%%%%%%%%j%%%%j%%JKJJkj%%jJ%JJJjj%jjj%%%%JJ%
348A26%j%%J%J%k%J%Jjj%%J%%%%%j%%%%JjJJj%Jj%%%jj%JJ%%%%%%%%J%%%%%%j%%j%%%%%%J
341A26%%j%%%J%J%%kj%%%%%%%%j%%J%%%J%j%JJ%%jkjjJJJJJ%%%%%%%%%j%%%JJ%%%%%%j%%%
333A26%%%%j%%%%%J%%%%%%%jjj%%JJ%j%%%%%%Jj%%j%%%J%j%J%%j%JJ%j%j%%JJK%%%%J%%%j
$$ plain form
326 127 125 125 126 126 126 126 126 126 126 127 127 127 127 126 126 126 127 127 126 126 126 126 126 126 126 127 127 128 128 128 127 127 126 126 126 126 126 126 126 126 126 126 126 125 125 125 125 125 125 126 126 126 125 124 123 124 125 125 125 125 125 126 126 127 127 127 127 126 127 128
318 128 128 128 127 126 126 125 124 124 123 124 125 124 124 125 126 126 126 127 127 127 127 128 128 128 128 128 128 127 127 127 126 126 127 126 126 125 126 127 126 126 126 126 126 126 126 125 125 125 124 124 123 123 123 124 125 125 125 125 125 125 125 126 128 127 127 127 126 126 127 127
311 127 127 126 125 124 123 124 124 125 126 125 125 124 124 124 124 125 125 125 125 125 125 124 123 122 121 120 120 120 121 122 123 123 124 124 123 122 122 122 123 124 125 124 124 123 123 124 124 124 123 123 122 122 121 122 123 122 122 122 122 122 122 122 123 123 124 124 125 125 126 126
304 126 126 126 126 126 126 126 126 125 123 124 125 125 126 126 127 127 127 126 125 125 125 126 126 126 126 126 127 126 125 124 124 124 125 125 126 124 123 123 124 125 126 125 125 126 126 127 127 127 127 126 125 124 124 125 125 124 124 124 124 124 123 124 125 126 125 124 123 123 124 124
296 124 124 124 125 125 125 124 122 122 122 124 126 127 127 126 125 125 125 126 126 126 126 126 126 126 127 127 127 127 127 126 125 125 125 126 126 127 128 128 129 128 127 127 127 127 127 127 127 126 126 126 126 126 126 126 126 126 126 125 125 125 125 125 125 124 124 125 125 125 126 125
289 125 125 125 126 126 126 126 126 126 126 125 125 126 126 127 127 127 127 126 125 125 126 126 126 126 126 126 126 126 126 126 127 127 126 124 124 126 126 125 124 124 124 125 125 126 126 126 125 123 123 124 125 126 126 126 125 125 124 124 124 125 125 125 125 126 126 125 125 125 124 123
281 123 123 124 124 125 126 126 125 125 125 125 126 126 126 126 126 126 127 127 127 126 125 125 125 126 126 126 125 125 124 124 124 126 127 128 127 126 125 124 123 123 122 123 124 124 124 124 125 124 124 125 126 125 125 127 127 127 125 125 125 126 126 125 124 124 124 124 124 123 122 121
274 121 121 122 123 123 123 124 124 124 125 125 126 126 126 125 124 124 123 122 123 123 124 123 122 122 122 122 122 122 122 123 124 124 123 124 125 125 126 126 125 125 124 124 124 124 125 126 126 126 126 126 126 126 126 126 126 126 125 125 124 125 126 126 126 125 125 125 124 125 126 126
$$ packed form
326A27k%J%%%%%%J%%%j%%J%j%%%%%%J%J%%j%j%%%%%%%%%%j%%%%%J%%jjjJJ%%%%J%J%%%jJJ
318A28%%jj%jj%jJJj%JJ%%J%%%J%%%%%j%%j%Jj%jJJj%%%%%%j%%j%j%%JJ%%%%%%JKj%%j%J%
311A27%jjjjJ%JJj%j%%%J%%%%%jjjjj%%JJJ%J%jj%%JJJj%j%J%%j%j%jJJj%%%%%%J%J%J%J%
304A26%%%%%%%jkJJ%J%J%%jj%%J%%%%Jjjj%%J%Jkj%JJJj%J%J%%%jjj%J%j%%%%jJJJjjj%J%
296A24%%J%%jk%%KKJ%jj%%J%%%%%%J%%%%jj%%J%JJ%Jjj%%%%%%j%%%%%%%%%j%%%%%j%J%%Jj
289A25%%J%%%%%%j%J%J%%%jj%J%%%%%%%%%J%jk%K%jj%%J%J%%jk%JJJ%%j%j%%J%%%J%j%%jj
281A23%J%JJ%j%%%J%%%%%J%%jj%%J%%j%j%%KJJjjjjj%jJJ%%%Jj%JJj%K%%k%%J%jj%%%%jjj
274A21%JJ%%J%%J%J%%jj%jjJ%Jjj%%%%%%JJ%jJJ%J%j%j%%%JJ%%%%%%%%%%j%jJJ%%j%%jJJ%
$$ plain form
267 126 126 125 124 124 122 122 122 123 124 124 123 123 124 125 124 123 123 123 124 124 124 124 125 123 122 121 121 121 121 122 123 124 125 126 126 126 125 126 127 128 129 127 125 124 123 123 123 123 124 123 123 124 125 125 125 125 124 124 125 124 123 123 122 123 124 125 125 125 124 123
259 123 123 122 122 122 123 122 121 122 123 124 125 125 124 124 124 123 123 123 122 123 125 125 126 126 126 125 125 124 124 123 123 124 124 124 123 122 122 122 122 123 124 124 124 124 124 124 124 125 125 125 125 124 124 123 123 123 124 124 125 124 123 123 122 123 123 123 123 123 123 122
252 122 122 122 122 122 122 122 122 122 122 123 125 125 125 125 125 125 124 124 124 123 122 121 120 119 120 122 123 123 122 122 121 121 120 121 122 121 121 122 122 123 124 123 123 122 121 121 121 121 121 120 122 123 123 122 123 123 123 122 121 121 120 121 121 123 123 122 122 123 124 124
244 124 123 124 125 125 126 126 125 124 123 122 121 122 123 124 126 126 127 126 126 126 126 126 125 125 125 125 125 124 123 123 124 124 124 123 123 125 125 124 124 124 123 123 123 123 123 124 125 125 125 125 125 124 124 123 122 123 124 125 126 125 125 124 124 123 123 122 121 121 122 122
237 122 121 121 122 124 125 126 125 125 125 125 124 124 124 124 124 124 123 124 124 124 124 125 126 126 126 125 124 124 124 125 126 126 126 126 126 126 126 126 126 126 126 125 124 124 124 125 125 125 124 124 124 123 123 124 124 125 125 125 124 124 123 124 124 125 125 125 125 126 126 125
229 125 125 124 123 124 124 124 124 124 124 123 123 124 124 125 125 126 126 126 125 125 124 124 123 123 123 123 123 123 123 124 125 124 124 124 123 124 124 124 124 124 124 124 124 123 123 123 123 123 124 125 125 124 124 124 123 124 124 124 125 124 124 124 124 124 124 124 124 123 123 123
222 123 125 126 126 125 124 124 123 122 122 122 122 123 123 123 124 124 124 124 124 124 124 123 123 123 123 123 123 123 123 123 124 126 127 125 124 124 123 124 125 125 125 125 124 125 125 125 126 125 125 124 123 123 124 123 123 123 123 123 123 124 124 124 124 124 125 124 124 123 122 123
215 123 123 123 123 123 122 122 121 122 122 122 122 122 122 122 121 122 124 125 126 126 125 125 125 125 125 125 125 125 124 123 123 123 123 122 123 124 124 124 124 123 123 123 122 123 125 126 126 126 126 126 126 125 125 126 126 126 125 124 125 126 126 125 125 124 124 124 123 124 124 123
$$ packed form
267A26%jj%k%%JJ%j%JJjj%%J%%%Jkjj%%%JJJJJ%%jJJJJkkjj%%%Jj%JJ%%%j%Jjj%jJJJ%%jj
259A23%j%%JjjJJJJ%j%%j%%jJK%J%%j%j%j%J%%jj%%%JJ%%%%%%J%%%j%j%%J%Jjj%jJ%%%%%j
252A22%%%%%%%%%JK%%%%%j%%jjjjjJKJ%j%j%jJJj%J%JJj%jj%%%%jKJ%jJ%%jj%jJ%K%j%JJ%
244A24jJJ%J%jjjjjJJJK%Jj%%%%j%%%%jj%J%%j%K%j%%j%%%%JJ%%%%j%jjJJJJj%j%j%jj%J%
237A22j%JKJJj%%%j%%%%%jJ%%%JJ%%jj%%JJ%%%%%%%%%%jj%%J%%j%%j%J%J%%j%jJ%J%%%J%j
229A25%jjJ%%%%%j%J%J%J%%j%j%j%%%%%%JJj%%jJ%%%%%%%j%%%%JJ%j%%jJ%%Jj%%%%%%%j%%
222A23KJ%jj%jj%%%J%%J%%%%%%j%%%%%%%%JKJkj%jJJ%%%jJ%%Jj%jj%Jj%%%%%J%%%%Jj%jjJ
215A23%%%%j%jJ%%%%%%jJKJJ%j%%%%%%%jj%%%jJJ%%%j%%jJKJ%%%%%j%J%%jjJJ%j%j%%jJ%j
$$ plain form
207 123 123 123 123 124 124 123 123 124 123 123 122 122 122 123 124 124 124 124 124 123 123 123 123 123 123 123 124 123 123 123 123 123 124 123 122 122 122 122 123 124 123 123 122 122 123 123 123 124 124 124 125 125 125 125 126 126 126 127 127 126 126 125 124 124 123 123 123 123 123 124
200 124 124 124 125 124 124 124 123 123 123 123 123 122 122 122 122 122 121 120 121 122 123 124 124 124 124 124 125 125 125 125 125 125 124 124 124 124 124 124 124 123 123 123 123 123 124 123 123 124 124 124 125 124 123 123 122 122 122 123 124 124 124 124 124 123 123 122 122 122 122 122
192 122 123 123 124 124 125 125 125 125 126 126 124 123 123 123 124 125 126 127 126 126 125 124 124 124 124 125 126 127 125 123 122 122 123 123 123 123 122 122 122 122 122 122 123 124 123 123 123 123 123 123 122 123 124 124 125 125 124 123 124 123 123 123 123 123 123 123 124 124 123 124
185 124 126 125 125 124 123 123 123 122 122 122 121 122 123 123 123 123 122 122 123 124 125 125 125 125 125 125 124 124 125 124 123 123 122 122 123 123 123 124 125 124 123 123 124 124 123 123 123 123 122 123 124 124 124 124 123 123 123 123 123 122 122 122 122 122 123 123 124 124 124 122
177 122 121 122 123 124 125 124 124 123 123 123 122 122 121 121 121 121 121 121 122 123 123 123 124 125 125 124 124 123 122 123 123 123 123 123 123 123 123 124 124 123 122 122 123 124 124 123 123 122 121 123 124 125 125 125 125 125 125 125 125 125 125 123 121 121 122 122 123 124 125 125
170 125 125 125 126 125 125 124 124 124 125 125 125 125 124 124 123 123 123 123 123 123 124 124 123 123 123 123 124 125 125 123 123 123 123 124 124 124 123 122 122 122 122 123 123 122 122 121 121 121 122 122 123 123 124 124 125 124 123 122 121 122 123 123 124 125 125 125 125 125 125 124
163 124 125 125 125 126 126 125 124 123 123 124 124 123 122 121 122 121 121 122 122 122 123 124 125 125 125 124 124 124 124 124 124 123 121 120 120 121 122 122 122 123 123 123 123 123 124 123 123 123 123 123 123 123 123 123 124 124 124 123 123 122 122 122 122 122 123 123 123 123 123 124
155 124 124 124 123 124 125 125 124 125 125 124 122 122 123 124 125 125 124 124 124 123 122 121 120 121 122 123 122 122 121 120 120 121 122 124 125 124 124 124 124 124 123 122 122 123 124 124 125 126 127 127 126 124 124 124 124 124 124 124 124 123 122 122 123 122 121 120 120 121 121 122
$$ packed form
207A23%%%J%j%Jj%j%%JJ%%%%j%%%%%%Jj%%%%Jjj%%%JJj%j%J%%J%%J%%%J%%J%j%jj%j%%%%J
200A24%%Jj%%j%%%%j%%%%jjJJJJ%%%%J%%%%%j%%%%%%j%%%%Jj%J%%Jjj%j%%JJ%%%%j%j%%%%
192A22J%J%J%%%J%kj%%JJJJj%jj%%%JJJkkj%J%%%j%%%%%JJj%%%%%jJJ%J%jjJj%%%%%%J%jJ
185A24Kj%jj%%j%%jJJ%%%j%JJJ%%%%%j%Jjj%j%J%%JJjj%J%j%%%jJJ%%%j%%%%j%%%%J%J%%k
177A22jJJJJj%j%%j%j%%%%%JJ%%JJ%j%jjJ%%%%%%%J%jj%JJ%j%jjKJJ%%%%%%%%%kk%J%JJJ%
170A25%%Jj%j%%J%%%j%j%%%%%J%j%%%JJ%k%%%J%%jj%%%J%j%j%%J%J%J%JjjjjJJ%JJ%%%%%j
163A24J%%J%jjj%J%jjjJj%J%%JJJ%%j%%%%%jkj%JJ%%J%%%%Jj%%%%%%%%J%%j%j%%%%J%%%%J
155A24%%jJJ%jJ%jk%JJJ%j%%jjjjJJJj%jj%JJKJj%%%%jj%JJ%JJJ%jk%%%%%%%jj%Jjjj%J%J
$$ plain form
148 122 122 123 123 123 123 123 124 125 125 125 124 123 123 122 122 123 124 124 123 122 122 123 124 124 125 125 125 124 123 123 124 124 124 124 124 123 123 123 123 123 123 122 120 119 120 121 121 121 121 121 120 120 119 120 120 121 123 123 122 123 123 124 124 124 122 121 122 123 123 124
140 124 124 124 124 124 123 122 122 122 122 123 123 123 123 124 123 123 123 123 123 123 123 123 123 123 124 124 124 124 124 124 124 124 125 125 125 125 125 124 123 123 124 124 124 124 124 124 124 124 124 124 124 125 125 126 126 126 125 125 124 124 124 125 125 125 125 125 125 125 125 125
133 125 125 125 124 124 124 124 124 123 123 123 124 124 124 124 124 123 123 122 122 123 124 126 126 125 125 124 123 123 124 124 123 123 123 123 124 123 122 121 122 124 125 126 127 126 124 124 124 124 124 124 124 125 125 125 124 124 124 124 124 124 124 124 124 124 124 124 125 125 125 125
126 125 125 124 125 126 126 126 126 126 124 123 123 123 124 123 123 122 122 122 123 123 123 123 124 126 125 124 123 123 122 123 123 124 124 124 124 123 123 123 123 123 124 124 124 124 125 125 125 124 123 123 122 122 122 123 124 124 123 123 122 121 121 123 123 122 121 122 122 122 123 123
118 123 123 123 122 122 123 124 124 123 123 123 122 122 122 122 122 121 121 121 122 122 123 124 124 124 124 125 126 126 127 127 126 126 126 126 126 125 124 124 123 124 124 123 123 123 123 123 124 124 125 125 125 125 125 124 123 123 123 123 122 122 123 122 122 122 123 124 124 124 124 125
111 125 125 126 126 126 126 125 124 124 125 125 125 125 125 125 125 124 124 123 123 123 124 125 126 126 125 124 125 126 127 128 127 127 126 126 125 126 126 126 125 126 126 127 128 128 128 129 129 131 133 134 134 134 134 134 134 135 135 135 135 136 136 137 137 136 135 134 134 133 131 130
103 130 129 128 127 127 127 127 126 125 125 126 125 125 125 125 124 123 122 123 124 124 125 125 125 125 125 125 126 126 127 127 126 126 125 125 125 125 125 126 126 127 127 127 127 126 126 126 125 126 127 127 127 128 128 128 129 129 130 130 130 131 131 131 130 129 129 128 129 129 129 128
96 128 128 127 126 126 126 128 129 129 128 128 127 126 124 124 124 124 124 124 125 124 124 123 123 124 125 125 125 123 123 122 122 123 123 123 123 123 123 122 122 122 122 122 122 122 122 122 123 123 123 123 123 123 124 124 124 125 124 124 125 125 125 125 126 125 125 125 125 125 124 124 123
$$ packed form
148A22%J%%%%JJ%%jj%j%JJ%jj%JJ%J%%jj%J%%%%j%%%%%jkjJJ%%%%j%jJ%JK%jJ%J%%kjJJ%J
140A24%%%%jj%%%J%%%Jj%%%%%%%%%J%%%%%%%J%%%%jj%J%%%%%%%%%%J%J%%j%j%%J%%%%%%%%
133A25%%j%%%%j%%J%%%%j%j%JJK%j%jj%J%j%%%JjjjJKJJJjk%%%%%%J%%j%%%%%%%%%%%J%%%
126A25%jJJ%%%%kj%%Jj%j%%J%%%JKjjj%jJ%J%%%j%%%%J%%%J%%jj%j%%JJ%j%jj%K%jjJ%%J%
118A23%%j%JJ%j%%j%%%%j%%J%JJ%%%JJ%J%j%%%%jj%jJ%j%%%%J%J%%%%jj%%%j%Jj%%JJ%%%J
111A25%J%%%jj%J%%%%%%j%j%%JJJ%jjJJJJj%j%jJ%%jJ%JJ%%J%KKJ%%%%%J%%%J%J%jjj%jkj
103A30jjj%%%jj%Jj%%%jjjJJ%J%%%%%J%J%j%j%%%%J%J%%%j%%jJJ%%J%%J%J%%J%%jj%jJ%%j
96A28%jj%%KJ%j%jjk%%%%%Jj%j%JJ%%k%j%J%%%%%j%%%%%%%%J%%%%%J%%Jj%J%%%Jj%%%%j%j
$$ plain form
88 123 123 123 123 123 123 124 124 125 125 125 125 125 125 124 124 123 123 123 123 123 124 125 126 127 127 125 123 123 124 125 124 124 124 125 124 125 126 125 125 124 123 122 121 122 123 122 122 123 123 124 124 123 123 123 123 123 123 123 123 123 123 124 125 125 125 124 123 124 123 122 122
81 122 123 123 122 122 122 123 124 124 124 123 123 123 122 121 122 123 124 124 124 123 122 122 121 122 122 123 124 124 124 123 123 122 122 122 122 122 122 122 123 123 124 123 123 123 122 123 124 124 125 124 124 124 124 123 122 123 123 124 124 124 124 124 124 124 124 124 124 124 124 123 123
73 123 123 123 124 125 126 125 125 125 125 126 127 128 128 127 127 127 127 128 128 129 129 130 128 127 126 125 125 125 126 127 127 125 125 126 125 125 125 125 125 126 126 126 125 125 125 125 126 126 125 124 123 122 122 122 122 121 122 122 123 123 123 123 123 123 123 123 123 124 124 124 124
66 124 125 126 126 125 125 127 128 129 128 127 127 126 126 126 127 128 129 130 131 131 132 133 134 134 134 133 132 130 130 131 130 130 130 130 130 130 132 133 133 134 134 134 135 136 137 138 138 139 139 140 140 141 142 141 141 141 140 140 140 141 141 141 142 143 142 142 142 142 142 141 140
58 140 140 140 140 140 140 139 139 139 138 138 137 137 137 136 137 137 138 138 139 139 139 139 138 138 137 136 137 138 139 140 141 142 142 143 143 144 145 147 147 147 147 147 149 151 152 153 155 157 159 160 161 163 164 166 169 172 175 178 183 187 192 197 203 209 215 221 228 235 242 250 257
51 257 263 270 278 286 294 302 309 317 326 336 347 360 375 393 417 446 481 523 575 637 710 796 895 1008 1136 1278 1431 1588 1745 1901 2054 2199 2330 2441 2534
47 2534 2609 2666 2705 2718 2705 2662 2592 2497 2378 2237 2079 1911 1738 1563 1389 1219 1059 913 787 682 597 531 479 439 407 380 358 341 328
44 328 317 307 300 293 289 285 281 276 271 266 261 256 250 243 237 230 224 218 212 206 199 193 187 182 176 171 168 166 164 162 161 161 159 157 154 151 150 149 148 148 147 146 145 146 145 144 143 143 142 142 141 141 140 140 140 140 139 140 140 140 140 140 140 139 139 138 136 137 137
$$ packed form
88A23%%%%%J%J%%%%%j%j%%%%JJJJ%kk%JJj%%JjJJj%jjjjJJj%J%J%j%%%%%%%%%JJ%%jjJjj%
81A22J%j%%JJ%%j%%jjJJJ%%jj%jJ%JJ%%j%j%%%%%%J%Jj%%jJJ%Jj%%%jjJ%J%%%%%%%%%%%j%
73A23%%JJJj%%%JJJ%j%%%J%J%Jkjjj%%JJ%k%Jj%%%%J%%j%%%J%jjjj%%%jJ%J%%%%%%%%J%%%
66A24JJ%j%KJJjj%j%%JJJJJ%JJJ%%jjk%Jj%%%%%KJ%J%%JJJJ%J%J%JJj%%j%%J%%JJj%%%%jj
58A40%%%%%j%%j%j%%jJ%J%J%%%j%jjJJJJJJ%J%JJK%%%%KKJJKKKJJKJKLLLLNMNNOOOOPPPQP
51B57OPQQQQPQRJ0J1J3J5J8K4K9L5M2N2O2P3Q6R9J13J28J42J53J57J57J56J53J45J31J11R3
47B534P5N7L9J3j3m3p0r5j19j41j58j68j73j75j74j70j60j46j26j05q5o6n2m0l2k7k2j7j3
44C28j1j0ppmmmnnnnnopopoooopoononlkkkj%kklljjj%jjjJjjj%j%j%j%%%jJ%%%%%j%jkJ%
$$ plain form
37 137 137 137 137 137 138 139 139 139 139 139 138 138 137 137 137 137 137 138 138 136 134 133 131 130 129 128 127 127 126 126 124 123 121 121 121 121 121 122 123 123 123 123 125 126 128 130 130 129 130 130 132 134 135 136 137 138 138 136 136 136 137 137 138 138 138 138 138 138 137 137 137
29 137 136 134 135 136 134 134 133 133 132 132 133 132 131 131 130 131 131 130 129 129 129 130 130 130 130 130 131 131 131 130 130 129 129 129 129 128 128 128 128 128 127 127 127 127 127 127 127 127 127 127 126 126 126 124 124 125 126 127 127 127 127 127 126 126 125 125 124 125 125 125 124
22 124 124 123 123 123 124 126 126 126 125 125 125 126 125 124 125 126 126 127 127 125 124 124 124 125 125 126 127 127 127 127 127 125 124 124 125 126 125 125 125 125 126 125 124 124 125 125 125 125 125 125 126 126 126 125 123 123 124 124 124 123 123 124 124 123 123 123 123 124 126 126 124
14 124 123 122 123 124 125 125 123 123 123 123 123 123 122 122 122 121 121 121 122 121 121 122 123 124 125 124 124 123 122 122 121 122 123 124 125 125 124 124 123 122 121 121 120 121 121 122 123 121 122 122 122 122 121 122 122 122 121 120 119 120 120 121 121 122 124 125 124 124 123 123 123
7 123 122 121 122 122 123 124 124 125 124 124 125 125 125 125 125 126 125 125 125 125 125 125 125 125 125 125 125 124 124 123 124 125 125 125 125 125 125 125 125 125 125 126 126 126 127 127 125 124 123 122 123 124 126 127 126 126 126 126 126 126 126 126 125 124 123 124 124 123 123 123 122 123
-1 123 123 122 121 120 120 121 122 121 121 120 120 119 119 119 119 119 119 119 119 119 118 117 117 116 117 117 118 118 118 118 118 118 119 119 119 120 120 119 118 118 118 118 118 118 118 117 118 119 120 121 122 122 123 123 122 122 121 120 118 119 119 119 120 121 121 121 121 121 121 122 122
-9 122 122 122 122 122 122 122 122 121 119 120 121 121 121 121 120 120 119 120 120 121 121 123 125 126 126 125 125 126 126 127 127 128 127 127 128 130 132 134 134 133 133 133 133 134 135 135 135 135 135 134 134 134 132 131 130 129 128 128 128 128 127 126 124 124 123 123 121 120 121 121 121
-16 121 122 122 122 121 121 122 122 123 123 123 123 123 123 122 122 122 123 122 121 121 122 121 120 121 121 122 122 122 122 122 123 123 123 123 123 122 121 120 120 120 119 119 120 120 121 122 121 121 122 122 122 122 121 121 120 119 119 120 121 122 121 120 119 120 121 123 123 122 121 121
$$ packed form
37A37%%%%JJ%%%%j%j%%%%J%kkjkjjjj%j%kjk%%%%JJ%%%KJKK%jJ%KKJJJJ%k%%J%J%%%%%j%%
29A37jkJJk%j%j%Jjj%jJ%jj%%J%%%%J%%j%j%%%j%%%%j%%%%%%%%%j%%k%JJJ%%%%j%j%jJ%%j
22A24%j%%JK%%j%%JjjJJ%J%kj%%J%JJ%%%%kj%JJj%%%Jjj%J%%%%%J%%jk%J%%j%J%j%%%JK%k
14A24jjJJJ%k%%%%%j%%j%%Jj%JJJJj%jj%jJJJJ%j%jjj%jJ%JJkJ%%%jJ%%jjjJ%J%JKJj%j%%
7A23jjJ%JJ%Jj%J%%%%Jj%%%%%%%%%%j%jJJ%%%%%%%%%J%%J%kjjjJJKJj%%%%%%%jjjJ%j%%jJ
-1A23%jjj%JJj%j%j%%%%%%%%jj%jJ%J%%%%%J%%J%jj%%%%%%jJJJJJ%J%j%jjkJ%%JJ%%%%%J%
-9A22%%%%%%%jkJJ%%%j%jJ%J%KKJ%j%J%J%Jj%JKKK%j%%%JJ%%%%j%%kjjjj%%%jjk%j%kjJ%%
-16A21J%%j%J%J%%%%%j%%Jjj%JjjJ%J%%%%J%%%%jjj%%j%J%JJj%J%%%j%jj%JJJjjjJJK%jj%
$$ plain form
-24 121 121 121 121 121 122 122 121 120 120 121 120 120 120 121 121 122 122 121 121 120 120 120 122 124 124 123 122 122 122 121 121 120 120 121 121 121 121 121 121 121 121 121 121 122 122 122 122 122 123 123 122 121 121 121 120 120 120 120 121 122 122 122 123 123 123 123 123 123 123 123
-31 123 122 122 122 121 120 120 120 120 120 120 120 121 120 120 120 121 122 123 122 122 122 123 122 121 120 120 120 119 120 120 121 121 121 121 122 121 120 120 120 119 119 119 119 118 118 118 118 119 119 119 119 119 120 120 120 121 121 121 122 122 122 121 122 122 122 122 122 122 122 122
-38 122 122 121 121 120 121 121 120 120 120 119 120 121 121 121 122 122 121 119 119 119 119 119 120 120 120 120 121 122 122 123 122 122 121 121 121 121 121 121 122 122 122 123 123 122 122 122 122 123 123 123 122 122 123 123 123 123 123 123 124 124 124 123 122 121 120 122 122 123 123 123
-46 123 122 121 121 120 121 121 122 122 122 122 122 121 121 121 120 120 120 120 120 121 121 121 122 122 123 123 123 123 122 122 122 122 121 121 121 122 122 121 121 121 122 124 124 124 125 124 122 123 123 122 120 119 119 120 119 119 119 119 120 120 120 120 121 122 123 123 122 120 118 119
-53 119 121 121 122 121 120 120 120 121 121 121 121 120 120 120 120 119 120 120 120 120 120 121 120 119 119 118 118 120 121 122 121 121 121 121 122 122 122 121 121 121 122 122 122 121 121 122 122 122 123 124 123 123 121 120 120 119 119 118 118 118 119 120 121 120 120 120 120 120 120 119
-61 119 119 118 119 119 119 118 119 120 120 120 119 118 118 119 120 120 120 120 120 120 120 121 122 122 122 121 121 120 120 121 122 120 118 118 118 119 119 120 121 122 121 121 121 121 120 120 119 118 119 119 121 121 120 121 122 123 123 122 122 123 123 123 122 121 120 119 119 119 119 119
-68 119 120 121 120 120 120 120 121 121 121 120 120 120 121 121 122 122 121 121 121 121 121 121 120 120 121 121 122 122 122 121 121 120 120 120 120 120 120 120 120 119 120 120 120 120 120 120 120 121 121 121 121 121 121 121 121 122 122 122 122 122 122 122 121 121 122 122 121 121 120 120
-75 120 120 121 121 120 120 120 120 120 120 120 121 121 121 121 122 122 122 122 121 121 120 120 120 120 120 120 120 121 121 121 122 122 122 122 123 123 122 123 125 125 125 124 123 121 121 120 120 121 121 121 120 120 120 120 120 121 122 122 120 119 118 118 118 118 119 120 120 120 120 119
$$ packed form
-24A21%%%%J%jj%Jj%%J%J%j%j%%KK%jj%%j%j%J%%%%%%%%%J%%%%J%jj%%j%%%JJ%%J%%%%%%%
-31A23j%%jj%%%%%%Jj%%JJJj%%Jjjj%%jJ%J%%%Jjj%%j%%%j%%%J%%%%J%%J%%J%%jJ%%%%%%%
-38A22%j%jJ%j%%jJJ%%J%jk%%%%J%%%JJ%Jj%j%%%%%J%%J%j%%%J%%j%J%%%%%J%%jjjjK%J%%
-46A23jj%jJ%J%%%%j%%j%%%%J%%J%J%%%j%%%j%%J%j%%JK%%JjkJ%jkj%Jj%%%J%%%JJJ%jkkJ
-53A19K%Jjj%%J%%%j%%%jJ%%%%Jjj%j%KJJj%%%J%%j%%J%%j%J%%JJj%kj%j%j%%JJJj%%%%%j
-61A19%jJ%%jJJ%%jj%JJ%%%%%%JJ%%j%j%JJkk%%J%JJJj%%%j%jjJ%K%jJJJ%j%J%%jjjj%%%%
-68A19JJj%%%J%%j%%J%J%j%%%%%j%J%J%%j%j%%%%%%%jJ%%%%%%J%%%%%%%J%%%%%%j%J%j%j%
-75A20%J%j%%%%%%J%%%J%%%j%j%%%%%%J%%J%%%J%jJK%%jjk%j%J%%j%%%%JJ%kjj%%%JJ%%%j
$$ plain form
-83 119 119 119 119 119 120 120 120 121 121 120 118 117 118 118 119 119 119 118 118 118 117 119 120 120 120 120 120 120 120 120 119 118 119 120 120 121 121 121 121 121 122 122 123 124 123 122 121 120 121 121 121 122 121 121 121 121 122 122 121 122 122 121 121 121 122 122 122 123 124 123
-90 123 121 120 119 119 119 118 119 120 120 120 120 119 120 120 120 119 119 118 119 119 120 121 121 122 122 122 121 121 121 121 121 122 121 121 121 121 121 121 122 123 123 123 122 121 120 119 119 119 119 119 119 120 119 118 118 119 120 121 122 123 122 122 121 121 121 121 121 120 119 118
-98 118 119 119 119 119 120 120 120 120 120 120 120 119 120 120 120 120 119 119 119 119 118 118 118 118 119 119 120 121 121 120 120 121 120 120 119 119 119 120 120 120 119 119 120 120 120 122 122 122 122 122 121 121 121 120 119 119 120 120 120 120 120 120 119 118 120 121 121 120 118 117
-105 117 117 117 118 118 119 119 121 122 122 121 121 121 121 121 120 119 120 120 118 118 119 120 120 121 122 122 122 122 121 121 120 120 120 120 120 120 120 120 119 120 121 121 120 121 121 121 119 117 117 117 118 118 118 118 118 118 119 120 121 120 119 120 120 119 119 119 119 120 120
-112 120 120 121 122 123 122 121 120 119 118 119 119 119 118 119 118 118 119 120 121 121 121 121 121 120 119 119 120 120 120 120 120 120 120 120 120 120 120 121 122 122 120 120 120 119 119 118 118 119 119 119 121 120 119 120 121 120 120 119 119 119 119 119 119 119 119 119 119 119 119
-120 119 119 119 118 117 118 118 119 120 121 122 122 122 122 123 122 121 121 121 121 120 120 120 121 121 120 120 119 119 119 119 119 119 118 118 118 119 119 119 118 117 117 117 118 118 119 120 120 120 121 121 121 121 120 121 122 122 121 121 120 119 120 120 120 120 120 120 120 120 120
-127 120 119 119 119 118 118 118 119 120 120 120 120 120 120 120 121 120 120 119 118 118 118 118 119 119 119 120 121 122 122 122 121 121 121 121 121 121 121 121 121 121 120 120 119 119 118 118 119 119 119 119 118 117 116 117 118 120 120 119 119 118 117 116 116 116 116 117 118 118 118
-134 118 117 117 117 117 118 118 118 119 119 120 119 118 118 118 117 116 117 118 120 119 118 117 117 117 118 119 120 119 118 118 118 119 119 119 119 118 118 118 118 118 118 119 120 120 120 120 120 120 120 120 119 119 119 118 118 117 118 119 120 121 120 120 120 120 120 120 120 120 120
$$ packed form
-83A19%%%%J%%J%jkjJ%J%%j%%jKJ%%%%%%%jjJJ%J%%%%J%JJjjjjJ%%Jj%%%J%jJ%j%%J%%JJj
-90A23kjj%%jJJ%%%jJ%%j%jJ%JJ%J%%j%%%%Jj%%%%%JJ%%jjjj%%%%%Jjj%JJJJJj%j%%%%jjj
-98A18J%%%J%%%%%%jJ%%%j%%%j%%%J%JJ%j%Jj%j%%J%%j%J%%K%%%%j%%jj%J%%%%%jjKJ%jkj
-105A17%%J%J%KJ%j%%%%jjJ%k%JJ%JJ%%%j%j%%%%%%%jJJ%jJ%%kk%%J%%%%%JJJjjJ%j%%%J%
-112A20%JJJjjjjjJ%%jJj%JJJ%%%%jj%J%%%%%%%%%%JJ%k%%j%j%J%%KjjJJj%j%%%%%%%%%%%
-120A19%%jjJ%JJJJ%%%Jjj%%%j%%J%j%j%%%%%j%%J%%jj%%J%JJ%%J%%%jJJ%j%jjJ%%%%%%%%
-127A20j%%j%%JJ%%%%%%Jj%jj%%%J%%JJJ%%j%%%%%%%%%j%j%j%J%%%jjjJJK%j%jjj%%%JJ%%
-134A18j%%%J%%J%Jjj%%jjJJKjjj%%JJJjj%%J%%%j%%%%%JJ%%%%%%%j%%j%jJJJJj%%%%%%%%
$$ plain form
-142 120 120 120 120 121 120 119 119 119 119 120 121 120 119 119 119 120 120 121 121 120 119 118 118 119 120 120 119 120 121 121 122 122 121 122 123 123 122 120 119 118 119 119 119 120 120 120 120 120 120 120 120 120 120 120 120 120 120 120 119 119 119 117 115 115 117 118 119 119 119
-149 119 120 120 120 120 120 120 120 119 120 120 119 118 118 118 118 118 118 119 119 119 119 119 120 120 120 119 119 119 119 118 118 118 119 120 120 121 121 121 121 121 121 121 121 122 121 120 119 118 117 117 117 117 117 117 117 117 118 119 118 118 118 119 119 119 119 118 119 119 120
-156 120 120 119 119 119 118 118 118 118 119 119 119 120 120 120 120 121 121 121 120 120 120 120 119 119 118 119 120 120 120 119 120 121 121 120 118 117 117 118 118 119 121 121 121 119 119 119 120 120 120 119 119 121 121 120 120 119 119 119 119 119 119 119 118 118 118 119 120 120 120
-164 120 120 119 119 119 120 120 120 119 120 120 120 120 120 121 120 120 120 120 120 120 119 118 117 116 116 116 116 116 117 118 119 119 119 119 119 118 119 119 120 120 120 120 119 119 119 118 118 120 121 121 120 120 121 120 120 119 119 118 118 118 118 118 118 118 118 117 116 116 116
-171 116 116 116 117 118 120 120 120 120 119 120 119 118 117 117 117 118 119 119 120 120 120 120 120 121 121 122 122 121 121 120 119 119 118 118 118 118 118 118 118 118 118 117 117 117 116 117 117 117 117 118 118 118 119 119 118 118 118 117 116 116 117 117 118 119 119 120 120 120 120
-178 120 120 120 119 119 118 117 118 118 118 119 119 119 119 119 119 118 119 120 120 120 119 119 119 120 120 120 119 118 118 119 119 119 119 118 118 118 118 118 118 118 119 120 119 118 118 118 118 118 118 118 118 118 119 119 119 119 119 119 120 120 119 118 117 117 117 116 116 115 116
-186 116 117 117 118 118 117 118 119 119 119 118 117 117 118 117 117 117 117 117 118 118 118 117 118 118 119 119 119 120 120 120 120 120 120 120 121 121 120 120 119 119 118 117 117 117 118 118 118 118 118 118 118 118 119 119 120 120 121 122 122 121 120 119 118 118 118 118 119 118 117
-193 117 118 119 121 121 121 120 119 119 119 119 118 118 119 120 120 121 120 119 119 118 118 117 118 118 118 118 118 118 118 118 118 118 118 118 118 118 118 118 118 119 119 119 118 117 118 118 118 118 118 117 118 118 119 119 119 120 121 121 120 120 119 118 118 118 117 117 117 117 117
$$ packed form
-142A20%%%Jjj%%%JJjj%%J%J%jjj%JJ%jJJ%J%jJJ%jkjjJ%%J%%%%%%%%%%%%%%j%%kk%KJJ%%
-149A19J%%%%%%jJ%jj%%%%%J%%%%J%%j%%%j%%JJ%J%%%%%%%Jjjjjj%%%%%%%JJj%%J%%%jJ%J
-156A20%j%%j%%%J%%J%%%J%%j%%%j%jJJ%%jJJ%jkj%J%JK%%k%%J%%j%K%j%j%%%%%%j%%JJ%%
-164A20%j%%J%%jJ%%%%Jj%%%%%jjjj%%%%JJJ%%%%jJ%J%%%j%%j%KJ%j%Jj%j%j%%%%%%%jj%%
-171A16%%JJK%%%jJjjj%%JJ%J%%%%J%J%j%jj%j%%%%%%%%j%%jJ%%%J%%J%j%%jj%J%JJ%J%%%
-178A20%%j%jjJ%%J%%%%%jJJ%%j%%J%%jj%J%%%j%%%%%%JJjj%%%%%%%%J%%%%%J%jjj%%j%jJ
-186A16J%J%jJJ%%jj%Jj%%%%J%%jJ%J%%J%%%%%%J%j%j%jj%%J%%%%%%%J%J%JJ%jjjj%%%Jjj
-193A17JJK%%jj%%%j%JJ%Jjj%j%jJ%%%%%%%%%%%%%%%%J%%jjJ%%%%jJ%J%%JJ%j%jj%%j%%%%
$$ plain form
-200 117 117 117 116 116 116 115 115 115 117 118 118 118 118 119 120 120 121 120 120 119 119 119 119 119 119 119 118 118 118 118 119 120 118 116 116 116 117 118 119 120 121 121 119 119 121 122 121 121 121 120 120 120 119 119 119 119 120 120 120 120 120 119 118 118 117 117 117 117 117
-207 117 117 117 117 118 118 119 118 117 118 118 119 120 121 120 119 119 120 121 120 120 119 118 118 117 116 117 118 118 118 118 117 117 118 118 119 119 119 119 119 118 118 118 118 118 118 118 118 118 118 118 119 120 121 121 121 120 119 119 118 118 117 118 119 118 118 119 118 117 116
-215 116 115 116 116 117 117 117 116 116 117 118 118 117 117 118 118 119 119 118 117 117 118 118 118 118 118 118 118 118 118 118 117 117 118 118 118 118 118 117 115 116 116 117 118 118 118 118 118 118 118 118 118 118 118 118 118 118 119 119 118 119 120 119 118 118 118 118 118 119 118
-222 118 118 118 119 120 120 118 116 116 117 118 117 117 117 117 119 118 118 118 119 118 118 117 117 116 116 117 118 119 120 121 120 120 120 119 119 119 118 117 118 119 120 120 120 120 119 118 117 117 117 118 118 118 118 118 118 118 118 118 117 116 116 116 117 117 117 118 118 118 119
-229 119 118 117 117 117 118 119 119 120 121 121 121 120 119 118 117 117 117 117 117 118 119 119 119 119 118 118 119 119 119 119 118 118 118 118 118 118 118 118 118 119 119 119 118 119 119 119 119 119 119 119 120 120 119 118 118 118 118 117 117 117 118 120 120 119 119 118 117 117 117
-237 117 117 117 117 116 117 119 119 119 119 119 119 118 118 119 120 120 119 119 118 118 118 119 119 118 117 117 117 117 119 121 121 121 121 121 120 119 121 122 122 122 121 121 121 121 120 118 118 118 117 117 117 118 119 119 118 118 117 117 116 116 117 117 118 118 118 118 117 117 116
-244 116 116 117 118 118 119 119 119 119 119 118 118 118 119 118 118 118 118 118 118 118 117 118 119 119 119 120 120 119 118 118 118 118 119 119 119 117 116 116 116 116 116 116 117 116 116 116 116 116 116 117 117 118 118 119 119 117 117 117 117 117 117 118 119 119 120 119 119 118 116
-251 116 115 115 116 116 117 117 117 117 117 117 117 116 116 117 118 119 119 119 118 118 118 118 117 117 117 117 118 118 118 118 119 119 119 120 120 119 119 118 119 119 119 119 119 119 119 120 120 118 118 119 119 119 118 118 118 117 117 117 118 119 120 120 121 121 119 118 117 118 118
$$ packed form
-200A17%%j%%j%%KJ%%%JJ%Jj%j%%%%%%j%%%JJkk%%JJJJJ%k%KJj%%j%%j%%%J%%%%jj%j%%%%
-207A17%%%J%JjjJ%JJJjj%JJj%jj%jjJJ%%%j%J%J%%%%j%%%%%%%%%%JJJ%%jj%j%jJJj%Jjjj
-215A16jJ%J%%j%JJ%j%J%J%jj%J%%%%%%%%%j%J%%%%jkJ%JJ%%%%%%%%%%%%%J%jJJjj%%%%Jj
-222A18%%JJ%kk%JJj%%%Kj%%Jj%j%j%JJJJJj%%j%%jjJJJ%%%jjj%%J%%%%%%%%jj%%J%%J%%J
-229A19jj%%JJ%JJ%%jjjj%%%%JJ%%%j%J%%%j%%%%%%%%J%%jJ%%%%%%J%jj%%%j%%JK%j%jj%%
-237A17%%%jJK%%%%%j%JJ%j%j%%J%jj%%%KK%%%%jjKJ%%j%%%jk%%j%%JJ%j%j%j%J%J%%%j%j
-244A16%JJ%J%%%%j%%Jj%%%%%%jJJ%%J%jj%%%J%%kj%%%%%Jj%%%%%J%J%J%k%%%%%JJ%Jj%jk
-251A16j%J%J%%%%%%j%JJJ%%j%%%j%%%J%%%J%%J%j%jJ%%%%%%J%k%J%%j%%j%%JJJ%J%kjjJ%
$$ plain form
-259 118 118 119 120 120 120 119 118 118 117 117 117 117 117 117 117 117 117 117 117 118 118 119 119 119 119 118 117 117 117 117 117 117 117 117 117 118 119 119 119 118 118 118 118 117 117 117 117 116 115 114 116 118 119 118 117 117 118 117 117 119 120 119 119 118 118 117 118 118 117
-266 117 117 117 117 117 117 117 117 116 115 114 114 114 114 114 115 116 116 117 117 118 118 118 118 117 117 116 116 118 117 117 118 117 117 118 118 118 118 118 119 119 120 120 119 118 117 117 117 118 118 118 118 118 118 118 118 118 117 117 118 118 119 119 118 117 117 117 118 118 117
-273 117 116 117 117 118 119 119 119 118 118 117 116 117 117 117 117 118 118 119 119 119 119 118 117 117 118 119 118 118 117 117 118 118 118 118 117 118 118 119 119 118 117 117 118 119 118 117 117 116 117 118 118 118 118 118 118 118 117 118 119 118 118 118 119 118 118 118 118 118 118
-281 118 118 118 117 116 116 117 118 119 120 119 118 118 117 117 117 117 117 117 117 118 118 118 118 118 117 117 118 118 119 119 118 117 116 115 116 117 117 117 118 118 118 118 118 119 118 118 118 118 118 118 118 118 117 118 118 118 118 118 118 118 118 118 118 117 117 116 117 117 117
-288 117 118 117 117 117 118 118 118 118 118 117 117 116 117 117 117 117 117 118 119 119 119 119 118 118 118 117 117 116 115 116 117 117 118 119 119 119 118 119 119 119 119 118 117 118 119 119 120 120 121 120 118 117 117 118 117 116 116 117 117 117 116 117 118 118 119 118 118 117 117
-295 117 116 116 116 117 117 116 116 116 116 117 117 117 118 118 118 118 117 117 117 117 117 117 117 117 116 115 115 115 115 116 116 116 116 115 116 116 117 117 118 119 118 118 118 117 117 116 116 116 116 116 116 115 115 115 114 114 114 114 115 116 117 117 117 117 116 116 115 115 116
-303 116 116 115 116 117 116 116 116 117 118 119 119 119 118 117 117 117 116 116 116 115 115 115 114 114 115 116 117 116 116 116 116 116 116 115 115 115 116 116 116 116 117 117 118 118 118 118 117 117 116 116 115 116 117 118 117 116 116 116 115 115 116 117 117 117 116 116 116 117 117
-310 117 117 117 118 118 118 118 118 117 118 119 119 118 118 118 118 118 118 118 118 118 117 117 118 117 118 118 117 117 117 116 117 117 118 118 118 118 118 118 117 117 117 116 117 117 118 119 119 119 118 116 115 116 117 116 115 114 113 114 115 116 116 116 116 115 115 114 116 117 117
$$ packed form
-259A18%JJ%%jj%j%%%%%%%%%%J%J%%%jj%%%%%%%%JJ%%j%%%j%%%jjjKKJjj%Jj%KJj%j%jJ%j
-266A17%%%%%%%jjj%%%%JJ%J%J%%%j%j%Kj%Jj%J%%%%J%J%jjj%%J%%%%%%%%j%J%J%jj%%J%j
-273A17jJ%JJ%%j%jjJ%%%J%J%%%jj%JJj%j%J%%%jJ%J%jj%JJjj%jJJ%%%%%%jJJj%%Jj%%%%%
-281A18%%jj%JJJJjj%j%%%%%%J%%%%j%J%J%jjjjJJ%%J%%%%Jj%%%%%%%jJ%%%%%%%%%j%jJ%%
-288A17Jj%%J%%%%j%jJ%%%%JJ%%%j%%j%jjJJ%JJ%%jJ%%%jjJJ%J%Jjkj%Jjj%J%%jJJ%Jj%j%
-295A17j%%J%j%%%J%%J%%%j%%%%%%%jj%%%J%%%jJ%J%JJj%%j%j%%%%%j%%j%%%JJJ%%%j%j%J
-303A16%jJJj%%JJJ%%jj%%j%%j%%j%JJJj%%%%%j%%J%%%J%J%%%j%j%jJJJjj%%j%JJ%%j%%J%
-310A17%%J%%%%jJJ%j%%%%%%%%j%JjJ%j%%jJ%J%%%%%j%%jJ%JJ%%jkjJJjjjjJJJ%%%j%jKJ%
$$ plain form
-317 117 117 117 117 118 119 118 117 117 116 117 117 117 117 116 118 119 120 120 119 119 118 118 117 117 118 118 118 117 117 117 117 117 116 116 116 116 116 116 117 117 118 118 118 118 117 115 115 116 116 116 117 118 118 118 118 118 118 118 119 119 119 119 118 117 117 117 117 117 117
-324 117 115 114 115 115 116 117 117 117 117 118 117 117 116 116 116 115 115 116 116 116 117 117 118 117 116 116 116 118 120 120 119 118 118 119 119 120 119 119 119 118 118 118 117 117 117 117 117 117 117 117 116 116 117 119 119 119 118 117 118 118 118 118 118 118 118 118 118 118 117
-332 117 116 115 114 114 114 114 114 115 114 114 115 116 116 115 115 115 115 115 115 116 116 117 118 118 118 118 117 117 118 118 118 119 119 119 119 118 118 117 117 115 113 113 115 116 117 118 119 119 119 117 116 116 117 117 117 117 117 118 118 117 118 119 119 119 118 118 118 118 118
-339 118 118 118 118 119 119 119 119 119 118 117 117 117 117 118 117 116 116 115 116 116 117 118 118 117 117 116 117 117 116 116 116 115 115 116 116 115 115 115 116 116 116 117 117 117 118 117 116 115 115 114 115 115 116 116 117 117 117 116 116 115 114 114 115 115 116 117 118 117 116
-346 116 116 117 118 118 117 117 117 116 116 115 115 115 115 115 116 116 116 117 117 117 116 116 116 116 116 115 115 115 115 115 115 113 114 114 114 114 114 114 114 115 115 115 116 116 116 117 118 118 117 117 117 117 116 116 115 116 116 115 116 116 115 115 116 117 116 117 118 117 117
-354 117 116 115 116 116 117 118 118 117 116 115 115 115 115 115 116 117 117 116 116 116 115 115 114 113 114 116 116 117 117 116 115 114 115 115 116 116 116 117 117 117 117 117 117 118 118 119 119 120 119 119 119 119 119 119 118 118 118 117 116 115 116 116 116 116 116 116 116 116 116
-361 116 117 117 116 116 116 117 118 118 118 117 115 115 114 114 115 114 113 114 114 114 114 114 114 115 116 116 117 117 117 116 115 115 115 115 115 116 116 117 117 116 115 115 115 116 116 116 115 116 117 117 118 117 117 117 116 116 115 116 117 117 118 118 118 117 117 117 118 117 117
-368 117 117 117 117 117 117 117 117 117 118 118 116 116 115 115 115 115 116 116 116 116 115 115 116 117 118 116 116 116 116 116 116 117 117 117 117 117 117 117 116 115 116 116 116 116 116 117 117 117 118 118 118 117 116 116 116 116 115 115 116 116 116 116 116 116 117 117 117 118 117
$$ packed form
-317A17%%%JJjj%jJ%%%jKJJ%j%j%j%J%%j%%%%j%%%%%J%J%%%jk%J%%JJ%%%%%%J%%%jj%%%%%
-324A17kjJ%JJ%%%Jj%j%%j%J%%J%Jjj%%KK%jj%J%Jj%%j%%j%%%%%%%j%JK%%jjJ%%%%%%%%%j
-332A17jjj%%%%Jj%JJ%j%%%%%J%JJ%%%j%J%%J%%%j%j%kk%KJJJJ%%kj%J%%%%J%jJJ%%j%%%%
-339A18%%%J%%%%jj%%%Jjj%jJ%JJ%j%jJ%j%%j%J%j%%J%%J%%Jjjj%jJ%J%J%%j%jj%J%JJJjj
-346A16%JJ%j%%j%j%%%%J%%J%%j%%%%j%%%%%kJ%%%%%%J%%J%%JJ%j%%%j%jJ%jJ%j%JJjJJj%
-354A17jjJ%JJ%jjj%%%%JJ%j%%j%jjJK%J%jjjJ%J%%J%%%%%J%J%Jj%%%%%j%%jjjJ%%%%%%%%
-361A16J%j%%JJ%%jk%j%JjjJ%%%%%JJ%J%%jj%%%%J%J%jj%%J%%jJJ%Jj%%j%jJJ%J%%j%%Jj%
-368A17%%%%%%%%J%k%j%%%J%%%j%JJJk%%%%%J%%%%%%jjJ%%%%J%%J%%jj%%%j%J%%%%%J%%Jj
$$ plain form
-376 117 116 116 115 115 115 116 117 117 116 116 117 116 116 116 117 118 117 117 117 117 116 116 116 115 115 115 115 116 118 118 118 118 118 118 118 118 119 119 119 118 119 118 116 116 115 114 114 114 113 114 114 115 116 115 115 115 115 116 117 118 117 115 114 113 114 115 115 115 115
-383 115 114 115 115 116 115 115 115 114 115 115 115 115 115 115 115 115 115 115 115 115 115 116 117 117 117 117 117 117 117 117 117 117 117 116 116 115 113 114 115 115 115 115 116 116 115 116 117 117 116 115 114 115 117 118 118 116 116 116 117 118 118 115 113 113 113 114 114 115 115
-390 115 115 115 114 115 115 115 114 114 116 117 117 117 117 117 116 117 117 117 117 117 117 117 117 117 117 116 115 115 115 115 115 115 114 115 115 115 115 115 115 115 114 114 113 114 114 115 116 115 115 115 115 115 114 114 114 114 114 114 114 114 115 116 117 116 115 116 117 118 117
-398 117 117 116 115 115 115 115 115 115 115 115 114 115 117 118 118 119 118 118 117 116 116 115 115 115 115 115 116 116 115 114 113 113 114 115 116 117 117 116 115 115 116 117 116 116 116 116 115 115 115 115 114 113 114 114 115 115 115 115 115 115 115 115 115 115 115 115 115 115 116
-405 116 117 118 117 117 117 117 117 118 118 118 116 114 113 114 115 116 116 116 116 116 115 114 115 116 117 117 116 116 115 116 116 115 115 114 114 115 116 115 115 115 115 115 116 115 114 114 115 114 114 115 115 116 117 117 118 117 117 117 118 118 117 115 114 114 115 116 115 116 116
-412 116 115 114 114 113 113 112 113 114 114 115 115 115 115 114 114 116 117 116 116 115 115 114 114 115 115 115 116 116 116 116 116 116 116 116 116 116 116 117 119 119 118 117 116 115 115 114 115 116 117 117 117 117 117 117 118 118 117 116 116 115 114 113 114 116 116 117 116 115 115
-420 115 115 115 116 116 116 116 116 116 116 115 114 115 115 116 117 116 116 116 116 116 116 116 116 117 117 117 117 116 116 116 117 117 117 118 119 119 119 119 120 119 118 118 118 118 119 118 118 117 117 116 114 113 114 115 114 114 114 114 114 114 114 115 116 115 115 115 115 115 115
$$ packed form
-376A17j%j%%JJ%j%Jj%%JJj%%%j%%j%%%JK%%%%%%%J%%jJjk%jj%%jJ%JJj%%%JJJjkjjJJ%%%
-383A15jJ%Jj%%jJ%%%%%%%%%%%%JJ%%%%%%%%%%j%jkJJ%%%J%jJJ%jjjJKJ%k%%JJ%lk%%J%J%
-390A15%%jJ%%j%KJ%%%%jJ%%%%%%%%%jj%%%%%jJ%%%%%%j%jJ%JJj%%%%j%%%%%%%JJJjjJJJj
-398A17%jj%%%%%%%jJKJ%Jj%jj%j%%%%J%jjj%JJJJ%jj%JJj%%%j%%%jjJ%J%%%%%%%%%%%%%J
-405A16JJj%%%%J%%kkjJJJ%%%%jjJJJ%j%jJ%j%j%JJj%%%%Jjj%Jj%J%JJ%Jj%%J%jkj%JJjJ%
-412A16jj%j%jJJ%J%%%j%KJj%j%j%J%%J%%%%%%%%%%JK%jjjj%jJJJ%%%%%J%jj%jjjJK%Jjj%
-420A15%%J%%%%%%jjJ%JJj%%%%%%%J%%%j%%J%%JJ%%%Jjj%%%Jj%j%jkjJJj%%%%%%JJj%%%%%
$$ [...]
-2638A25
##END=		$$ NMR SPECTRUM
##END=		$$ LINK
