##TITLE=	RP336 2D.10.fid
##JCAMP-DX=	6.0	$$ MestReNova 14.3.3-33362
##DATA TYPE=	LINK
##BLOCKS=	1    
##ORIGIN=	Mestrelab Research S.L.
##OWNER=	hrzepa
##$MNOVA/METADATA=	(DOCUMENT,BASE64)
eyJuYW1lIjoiL1VzZXJzL2hyemVwYS9MaWJyYXJ5L01vYmlsZSBEb2N1bWVudHMvY29tfmFwcGxlfkN
sb3VkRG9jcy9TaGVwcGFyZC9OTVIgZmlsZXMgemlwcy0yLzI1LzI1LUgubW5vdmEiLCJwYWdlcyI6W3
siaXRlbXMiOlsiMSIgICAgIF19XX0=
##TITLE=	RP336 2D.10.fid
##JCAMP-DX=	6.0	$$ MestReNova 14.3.3-33362
##DATA TYPE=	NMR SPECTRUM
##DATA CLASS=	XYDATA
##BLOCK_ID=	1
##ORIGIN=	Bruker BioSpin GmbH
##OWNER=	nmrsu
##NUMDIM=	1
##$MNOVA/METADATA=	(ITEM,BASE64)
eyJhbmdsZSI6MCwiYXhlcyI6eyJ4Ijp7Im1heCI6MTYuMDY0MjU5OTk5OTM5MTI1LCJtaW4iOi0zLjc
2Njk0MjMzOTE1NjYyMjZ9LCJ5Ijp7Im1heCI6NDI3NTcuMzQ4MTQ0NTMxMjUsIm1pbiI6LTM4MzcuMD
M4NzY4NzY4MzEwNX19LCJwb2ludHMiOlt7IngiOjUzMjEsInkiOjU4MzV9LHsieCI6ODcyMiwieSI6N
TgzNX0seyJ4Ijo4NzIyLCJ5Ijo4MjA4fSx7IngiOjUzMjEsInkiOjgyMDh9LHsieCI6NTMyMSwieSI6
NTgzNX1dLCJ6IjowfQ==
##.OBSERVE FREQUENCY=	700.35432466099996418
##.OBSERVE NUCLEUS=	^1H
##.SOLVENT NAME=	CDCl3
##.PULSE SEQUENCE=	zg30
##LONGDATE=	2023/12/05 04:16:59.000
##.ACQUISITIONMODE=	SIMULTANEOUS (DQD)
##$ORIGINAL FORMAT=	Bruker XWIN-NMR
##$MNOVA/SCALES_VERSION=	9
##$PARAMETER FILE=	(acqus, ASCII, /private/var/folders/f6/rjf_tdyn2v98c5c0wvkgn4s80000gq/T/Ig5CK6ZpQoWBDRlUk5z0jg/10/acqus, 0)
$$ ##TITLE= Parameter file, TopSpin 4.1.3
$$ ##JCAMPDX= 5.0
$$ ##DATATYPE= Parameter Values
$$ ##NPOINTS= 1	$$ modification sequence number
$$ ##ORIGIN= Bruker BioSpin GmbH
$$ ##OWNER= nmrsu
$$ $$ 2023-12-05 04:17:08.264 +0000  nmrsu@CZC7167VR1
$$ $$ Z:/700/data/tds/nmr/RP336 2D/10/acqus
$$ $$ process C:\Bruker\TopSpin4.1.3\prog\mod\dirdata.exe
$$ ##$ACQT0= -2.0981556054023
$$ ##$AMP= (0..31)
$$ 100 100 100 100 100 100 100 100 100 100 100 100 100 100 100 100 100 100
$$ 100 100 100 100 100 100 100 100 100 100 100 100 100 100
$$ ##$AMPCOIL= (0..32)
$$ -1 0 0 0 0 0 0 0 0 0 0 0 0 0 0 0 0 0 0 0 0 0 0 0 0 0 0 0 0 0 0 0 0
$$ ##$AQSEQ= 0
$$ ##$AQ_mod= 3
$$ ##$AUNM= <au_zg>
$$ ##$AUTOPOS= <4 >
$$ ##$BF1= 700.349999998
$$ ##$BF2= 700.349999998
$$ ##$BF3= 700.349999998
$$ ##$BF4= 700.349999998
$$ ##$BF5= 700.349999998
$$ ##$BF6= 700.349999998
$$ ##$BF7= 700.349999998
$$ ##$BF8= 700.349999998
$$ ##$BWFAC= (0..63)
$$ 0 0 0 0 0 0 0 0 0 0 0 0 0 0 0 0 0 0 0 0 0 0 0 0 0 0 0 0 0 0 0 0 0 0 0 0
$$ 0 0 0 0 0 0 0 0 0 0 0 0 0 0 0 0 0 0 0 0 0 0 0 0 0 0 0 0
$$ ##$BYTORDA= 0
$$ ##$CHANFCU= (0..24)
$$ 0 1 0 0 0 0 0 0 0 0 0 0 0 0 0 0 0 0 0 0 0 0 0 0 0
$$ ##$CHANREC= (0..24)
$$ 0 0 0 0 0 0 0 0 0 0 0 0 0 0 0 0 0 0 0 0 0 0 0 0 0
$$ ##$CHEMSTR= <none>
$$ ##$CNST= (0..63)
$$ 1 1 1 1 1 1 1 1 1 1 1 1 1 1 1 1 1 1 1 1 1 1 1 1 1 1 1 1 1 1 1 1 1 1 1 1
$$ 1 1 1 1 1 1 1 1 1 1 1 1 1 1 1 1 1 1 1 1 1 1 1 1 1 1 1 1
$$ ##$CPDPRG= (0..8)
$$ <> <> <> <> <> <> <> <> <>
$$ ##$D= (0..63)
$$ 0 1 0 0 0 0 0 0 0 0 0 0 0 0 0 0 0.0002 0 0 0 0 0 0 0 0 0 0 0 0 0 0 0 0
$$ 0 0 0 0 0 0 0 0 0 0 0 0 0 0 0 0 0 0 0 0 0 0 0 0 0 0 0 0 0 0 0
$$ ##$DATE= 1701749819
$$ ##$DATE_START= 1701749777
$$ ##$DE= 6.901845
$$ [...]
$$ ##$ShimPowRng3= (0..63)
$$ 1 1 1 1 1 1 1 1 1 1 1 1 1 1 1 1 1 1 1 1 1 1 1 1 1 1 1 1 1 1 1 1 1 1 1 1
$$ 1 1 1 1 0 0 0 0 0 0 0 0 0 0 0 0 0 0 0 0 0 0 0 0 0 0 0 0
$$ ##$ShimPowType1= 8
$$ ##$ShimPowType2= 8
$$ ##$ShimPowType3= 0
$$ ##$ShimPowType4= 0
$$ ##$ShimPowType5= 0
$$ ##$ShimPowType6= 0
$$ ##$ShimPowType7= 0
$$ ##$ShimPowType8= 0
$$ ##$ShimSysActGrad= (0..63)
$$ 1 2 3 4 13 5 7 11 10 9 6 8 12 18 19 20 21 15 22 23 24 14 25 16 26 17 27
$$ 28 31 32 33 34 35 36 37 38 0 0 0 0 0 0 0 0 0 0 0 0 0 0 0 0 0 0 0 0 0 0
$$ 0 0 0 0 0 0
$$ ##$ShimSysAngle= <>
$$ ##$ShimSysFunc= (0..63)
$$ 1 2 3 4 5 6 7 8 9 10 0 37 38 35 16 15 14 13 12 11 28 27 26 25 24 23 36
$$ 22 30 29 20 21 34 33 32 31 17 18 19 0 0 0 0 0 0 0 0 0 0 0 0 0 0 0 0 0 0
$$ 0 0 0 0 0 0 0
$$ ##$ShimSysMatId= <292722da.dat>
$$ ##$ShimSysMatrix= 1
$$ ##$ShimSysMinMaxUG= 130000
$$ ##$ShimSysOffset= <29 mm>
$$ ##$ShimSysType= 4
$$ ##$ShimUnit= 3
$$ ##$SpectrOsVersion= <4.1.156.20210628>
$$ ##$TCubeEth= <192.168.180.38>
$$ ##$TCubeSeqDevice= <>
$$ ##$TOSITY= <no>
$$ ##$TRIPLO2= 0
$$ ##$TopSpinVersion= <TopSpin 4.1.3>
$$ ##$TrxFreqFormula= (0..23)
$$ <TrxFreqFormula(2.0,700350000.000000,'TRX',Trx(1.0,'TRX 1200.1',1,5.000000,1290.000000))>
$$ <TrxFreqFormula(2.0,700350000.000000,'TRX',Trx(1.0,'TRX 1200.2',1,5.000000,1290.000000))>
$$ <TrxFreqFormula(2.0,700350000.000000,'TRX',Trx(1.0,'TRX 1200.3',1,5.000000,1290.000000))>
$$ <> <> <> <> <> <> <> <> <> <> <> <> <> <> <> <> <> <> <> <> <>
$$ ##$TrxPN= (0..23)
$$ <Z148391> <Z148391> <Z148391> <> <> <> <> <> <> <> <> <> <> <> <> <> <>
$$ <> <> <> <> <> <> <>
$$ ##$TrxSN= (0..23)
$$ <00336> <00337> <00342> <> <> <> <> <> <> <> <> <> <> <> <> <> <> <> <>
$$ <> <> <> <> <>
$$ ##$VCubeEth= (0..23)
$$ <no> <no> <no> <no> <no> <no> <no> <no> <no> <no> <no> <no> <no> <no> <no>
$$ <no> <no> <no> <no> <no> <no> <no> <no> <no>
$$ ##$VTU= 2
$$ ##$VTUETH= <192.168.99.11>
$$ ##$VTUTY= <no>
$$ ##$ValueLine= no
$$ ##$VpuPN= (0..23)
$$ <no> <no> <no> <no> <no> <no> <no> <no> <no> <no> <no> <no> <no> <no> <no>
$$ <no> <no> <no> <no> <no> <no> <no> <no> <no>
$$ ##$VpuSN= (0..23)
$$ <no> <no> <no> <no> <no> <no> <no> <no> <no> <no> <no> <no> <no> <no> <no>
$$ <no> <no> <no> <no> <no> <no> <no> <no> <no>
$$ ##$WBREFAM= (0..31)
$$ 99.8 100 100 100 100 100 100 100 100 100 100 100 100 100 100 100 100 100
$$ 100 100 100 100 100 100 100 100 100 100 100 100 100 100
$$ ##$WBREFLM= (0..31)
$$ 1 0 1 0 0 0 0 0 0 0 0 0 0 0 0 0 0 0 0 0 0 0 0 0 0 0 0 0 0 0 0 0
$$ ##$WBREFPH= (0..31)
$$ 0.05 0 0 0 0 0 0 0 0 0 0 0 0 0 0 0 0 0 0 0 0 0 0 0 0 0 0 0 0 0 0 0
$$ ##$WBSGU= (0..31)
$$ 1 2 4 0 0 0 0 0 0 0 0 0 0 0 0 0 0 0 0 0 0 0 0 0 0 0 0 0 0 0 0 0
$$ ##END=
$$ 
##$DECIM=	1440
##$DSPFVS=	21
##XUNITS=	HZ
##YUNITS=	ARBITRARY UNITS
##FIRSTX=	11250.604788156719223
##LASTX=	-2638.1781369192458442
##DELTAX=	-0.10596381293402784562
##XFACTOR=	1
##YFACTOR=	1.1862678151799066484
##FIRSTY=	64.1075897216796875
##MINY=	49.82318878173828125
##MAXY=	38870.4375
##NPOINTS=	131072
##XYDATA=	(X++(Y..Y))
$$ [...]
$$ plain form
2200 72 73 73 73 73 73 73 73 73 73 73 73 74 74 73 73 72 72 73 72 72 73 73 72 72 71 72 72 72 72 72 72 73 73 73 74 73 73 73 74 74 74 73 73 72 72 72 72 73 73 73 73 73 74 74 74 74 74 74 74 73 73 73 72 72 72 73 73 73 72 73
2192 73 73 74 74 74 73 72 72 71 71 71 72 72 72 72 72 72 73 74 74 73 73 73 72 72 72 73 73 72 72 73 74 74 73 72 72 72 72 71 72 71 71 71 71 71 72 72 72 72 72 72 72 72 72 72 73 73 73 72 72 72 71 71 72 72 72 72 73 73 73 72
2185 72 72 73 73 74 73 73 73 74 73 73 73 72 72 72 72 72 73 74 74 74 74 74 73 73 73 73 74 74 74 75 75 75 75 75 75 74 74 74 74 73 73 73 73 73 72 72 73 73 73 73 73 73 73 73 72 72 72 72 72 72 72 72 72 72 72 72 72 72 73 74
2177 74 74 74 74 73 73 74 73 73 73 73 72 72 72 73 73 73 73 73 73 74 74 74 73 73 73 73 73 73 73 73 73 72 72 72 72 72 72 73 73 73 73 72 72 72 72 73 73 73 73 72 73 73 73 72 73 73 73 73 73 74 74 75 75 75 75 75 75 74 74 74
2170 74 73 73 74 74 74 74 73 73 73 73 74 74 73 73 73 73 73 73 72 72 72 72 72 72 73 73 73 73 73 73 73 73 73 73 73 73 73 73 74 74 74 74 74 73 73 73 74 74 74 74 75 74 74 74 73 73 73 73 73 73 73 73 73 74 74 73 73 73 73 73
2163 73 73 73 73 73 73 73 73 73 72 72 73 74 74 73 72 73 73 73 73 73 73 73 73 73 74 74 74 73 72 73 73 74 75 74 74 75 75 74 73 73 73 73 74 73 73 72 72 72 72 73 73 73 73 73 73 73 74 74 74 73 73 73 73 73 73 73 73 73 74 74
2155 74 75 75 75 75 75 76 76 75 75 74 74 74 74 74 74 75 75 75 74 73 73 74 75 74 73 73 74 74 74 74 75 75 75 75 75 75 75 75 74 74 73 73 74 74 74 73 73 73 73 73 74 74 74 73 73 73 72 72 71 71 72 73 73 74 74 74 73 73 73 73
2148 73 73 74 74 74 74 74 74 75 75 75 75 74 73 73 73 73 73 73 73 73 73 74 74 74 74 73 73 74 74 74 74 74 74 74 74 74 74 74 75 75 75 75 75 74 74 74 74 74 74 74 75 75 75 75 75 75 75 75 75 75 75 75 75 75 75 75 75 75 75 76
$$ packed form
2200G2J%%%%%%%%%%J%j%j%Jj%J%j%jJ%%%%%J%%Jj%%J%%j%j%%%J%%%%J%%%%%%j%%j%%J%%jJ
2192G3%J%%jj%j%%J%%%%%JJ%j%%j%%J%j%JJ%jj%%%jJj%%%%J%%%%%%%%%J%%j%%j%J%%%J%%j
2185G2%J%Jj%%Jj%%j%%%%JJ%%%%j%%%J%%J%%%%%j%%%j%%%%j%J%%%%%%%j%%%%%%%%%%%%%JJ
2177G4%%%j%Jj%%%j%%J%%%%%J%%j%%%%%%%%j%%%%%J%%%j%%%J%%%jJ%%jJ%%%%J%J%%%%%j%%
2170G4j%J%%%j%%%J%j%%%%%j%%%%%J%%%%%%%%%%%%%J%%%%j%%J%%%Jj%%j%%%%%%%%J%j%%%%
2163G3%%%%%%%%j%JJ%jjJ%%%%%%%%J%%jjJ%JJj%J%jj%%%Jj%j%%%J%%%%%%J%%j%%%%%%%%J%
2155G4J%%%%J%j%j%%%%%J%%jj%JJjj%J%%%J%%%%%%%j%j%J%%j%%%%J%%j%%j%j%JJ%J%%j%%%
2148G3%J%%%%%J%%%jj%%%%%%%%J%%%j%J%%%%%%%%%%J%%%%j%%%%%%J%%%%%%%%%%%%%%%%%%J
$$ plain form
2140 76 76 76 75 75 75 75 75 75 75 74 74 73 73 73 73 73 74 74 74 75 75 75 75 75 74 74 74 75 75 74 74 74 74 74 74 74 74 74 75 76 75 74 74 74 74 75 75 74 74 74 73 74 74 74 74 74 74 73 74 74 75 75 75 75 75 75 75 75 75 75
2133 75 75 75 74 73 73 73 73 73 74 74 74 74 74 75 75 75 75 75 75 75 75 75 75 74 74 74 75 76 76 75 75 75 75 75 75 75 75 75 75 75 76 75 75 75 74 74 74 74 75 75 75 75 74 74 73 73 74 74 74 74 74 74 74 74 75 74 73 74 74 74
2126 74 74 74 74 73 73 73 73 74 74 75 74 74 74 74 74 74 74 75 74 75 75 75 75 75 75 75 75 75 76 75 75 75 74 74 74 73 73 73 74 74 75 75 75 75 75 75 75 74 74 74 74 74 74 74 73 73 73 74 74 73 73 73 73 74 74 74 74 74 74 74
2118 74 74 74 74 74 75 75 75 75 74 74 74 73 74 74 73 73 73 73 73 73 73 73 73 72 72 72 72 73 73 73 72 72 72 72 72 72 72 72 72 72 72 72 72 72 72 72 72 72 72 72 72 72 72 72 72 72 72 72 72 72 72 72 72 73 73 73 73 73 73 73
2111 73 73 72 72 72 72 72 72 72 73 73 73 72 72 72 71 71 71 71 71 71 72 72 72 72 72 72 71 71 71 71 71 71 72 72 72 72 71 72 72 72 71 71 71 71 71 71 70 71 71 72 73 73 72 72 73 73 72 72 71 71 71 71 71 70 70 70 70 70 70 70
2103 70 69 69 69 69 69 70 71 71 71 71 71 71 71 72 72 72 72 72 72 71 71 71 72 71 71 71 71 71 71 71 72 71 71 71 71 71 71 71 70 70 70 70 70 70 70 71 71 71 71 71 70 70 70 70 70 70 71 72 72 72 72 73 72 71 71 71 72 72 72 72
2096 72 72 72 72 73 73 73 72 72 72 72 72 72 71 70 70 70 70 71 71 72 72 71 71 72 72 72 72 72 72 72 72 72 71 71 72 72 71 71 70 71 71 71 71 71 71 71 71 71 71 71 71 72 72 72 72 72 72 72 72 72 73 73 73 73 73 73 72 72 71 72
2088 72 72 71 71 71 71 71 71 72 72 73 74 74 74 74 73 72 71 71 71 71 71 71 71 71 71 72 72 72 73 74 74 73 72 72 73 73 74 73 73 73 73 72 72 72 73 73 73 73 73 73 73 73 72 72 72 72 73 73 74 74 73 73 73 73 73 73 73 73 73 73
$$ packed form
2140G6%%j%%%%%%j%j%%%%J%%J%%%%j%%J%j%%%%%%%%JJjj%%%J%j%%jJ%%%%%jJ%J%%%%%%%%%
2133G5%%jj%%%%J%%%%J%%%%%%%%%j%%JJ%j%%%%%%%%%%Jj%%j%%%J%%%j%j%J%%%%%%%JjjJ%%
2126G4%%%j%%%J%Jj%%%%%%JjJ%%%%%%%%Jj%%j%%j%%J%J%%%%%%j%%%%%%j%%J%j%%%J%%%%%%
2118G4%%%%J%%%j%%jJ%j%%%%%%%%j%%%J%%j%%%%%%%%%%%%%%%%%%%%%%%%%%%%%%%%J%%%%%%
2111G3%j%%%%%%J%%j%%j%%%%%J%%%%%j%%%%%J%%%jJ%%j%%%%%jJ%JJ%j%J%j%j%%%%j%%%%%%
2103G0j%%%%JJ%%%%%%J%%%%%j%%Jj%%%%%%Jj%%%%%%j%%%%%%J%%%%j%%%%%JJ%%%Jjj%%J%%%
2096G2%%%J%%j%%%%%jj%%%J%J%j%J%%%%%%%%j%J%j%jJ%%%%%%%%%%%J%%%%%%%%J%%%%%j%jJ
2088G2%j%%%%%J%JJ%%%jjj%%%%%%%%J%%JJ%jj%J%Jj%%%j%%J%%%%%%%j%%%J%J%j%%%%%%%%%
$$ plain form
2081 73 73 73 72 72 73 74 74 74 74 74 75 75 75 76 76 76 75 75 75 75 75 75 74 74 73 73 73 73 74 74 74 73 74 74 74 74 75 75 74 74 73 73 74 74 74 74 75 74 74 73 73 74 74 74 74 74 74 74 74 74 74 73 73 73 74 74 74 74 74 74
2074 74 75 75 76 75 74 74 74 74 75 75 75 75 75 74 73 73 73 74 75 74 74 75 75 75 75 75 75 75 76 76 76 76 75 75 75 75 75 75 75 75 75 75 75 75 75 75 75 75 74 75 75 75 75 74 74 74 74 75 75 75 75 75 75 76 76 76 76 76 76 76
2066 76 76 76 75 75 75 75 75 75 75 75 75 75 75 75 75 75 75 75 75 75 76 76 76 75 75 74 75 75 75 75 75 75 75 75 75 74 74 74 74 74 74 75 75 75 75 75 75 75 75 75 75 75 75 74 74 75 75 75 75 75 75 75 75 75 74 74 74 74 75 75
2059 75 75 74 74 74 74 74 74 74 74 74 75 74 74 74 73 73 73 73 73 74 74 73 74 74 74 74 74 75 75 74 73 73 73 73 73 73 73 73 73 73 73 73 74 73 73 73 73 74 73 73 73 74 75 75 74 74 74 73 73 74 74 75 74 73 73 74 74 74 73 73
2051 73 72 72 72 71 71 71 72 72 73 73 73 73 74 74 73 72 72 72 72 72 72 73 73 73 72 71 71 72 72 72 72 73 73 73 73 73 73 73 73 72 72 72 72 72 73 73 73 72 71 72 72 72 72 72 72 71 71 71 71 71 71 71 71 71 72 72 72 72 72 72
2044 72 72 72 72 72 73 73 72 71 71 71 72 72 72 72 73 73 74 73 73 72 72 71 71 71 71 70 70 70 70 71 71 70 70 70 70 70 71 71 71 72 72 71 71 71 71 71 71 72 71 71 71 72 72 71 71 71 71 71 70 70 70 71 71 71 71 71 71 71 71 72
2037 72 72 72 72 72 72 73 72 72 72 72 72 72 72 71 71 71 71 71 71 72 72 72 72 72 72 72 73 73 73 72 72 73 72 72 72 72 72 72 72 72 71 71 70 71 71 71 72 72 71 72 72 72 72 72 72 71 71 71 72 71 71 71 72 71 71 71 71 71 72 72
2029 72 72 72 72 72 72 71 71 71 71 71 71 71 71 71 71 71 71 71 72 72 72 72 71 71 71 71 71 71 71 71 71 71 71 71 72 72 72 72 72 72 72 72 72 72 72 72 72 71 70 70 70 71 70 70 71 71 72 72 72 72 72 72 72 72 72 72 71 71 72 72
$$ packed form
2081G3%%j%JJ%%%%J%%J%%j%%%%%j%j%%%J%%jJ%%%J%j%j%J%%%Jj%j%J%%%%%%%%%j%%J%%%%%
2074G4J%Jjj%%%J%%%%jj%%JJj%J%%%%%%J%%%j%%%%%%%%%%%%%%%jJ%%%j%%%J%%%%%J%%%%%%
2066G6%%j%%%%%%%%%%%%%%%%%J%%j%jJ%%%%%%%%j%%%%%J%%%%%%%%%%%j%J%%%%%%%%j%%%J%
2059G5%j%%%%%%%%Jj%%j%%%%J%jJ%%%%J%jj%%%%%%%%%%%Jj%%%Jj%%JJ%j%%j%J%Jjj%J%%j%
2051G3j%%j%%J%J%%%J%jj%%%%%J%%jj%J%%%J%%%%%%%j%%%%J%%jjJ%%%%%j%%%%%%%%J%%%%%
2044G2%%%%J%jj%%J%%%J%Jj%j%j%%%j%%%J%j%%%%J%%J%j%%%%%Jj%%J%j%%%%j%%J%%%%%%%J
2037G2%%%%%Jj%%%%%%j%%%%%J%%%%%%J%%j%Jj%%%%%%%j%jJ%%J%jJ%%%%%j%%Jj%%Jj%%%%J%
2029G2%%%%%j%%%%%%%%%%%%J%%%j%%%%%%%%%%%J%%%%%%%%%%%%jj%%Jj%J%J%%%%%%%%%j%J%
$$ plain form
2022 72 72 72 72 72 72 72 73 73 73 73 73 73 73 72 72 72 72 72 72 72 73 72 72 71 71 71 73 73 73 72 72 72 72 73 73 73 73 73 72 72 72 71 71 71 71 71 71 71 72 73 73 74 74 73 73 73 74 74 74 74 73 73 73 73 73 72 72 72 72 72
2014 72 72 72 72 72 73 73 73 73 73 72 72 72 72 72 72 73 73 73 73 73 73 73 73 72 72 72 72 72 72 72 72 73 73 73 73 73 73 73 73 73 74 74 74 74 73 73 72 72 72 72 72 73 73 72 72 72 72 72 73 73 74 74 73 72 72 72 73 73 73 74
2007 74 73 73 73 73 73 74 74 73 73 73 72 73 73 73 73 73 72 72 72 73 73 73 73 73 73 73 74 74 73 72 72 73 72 71 71 71 71 71 72 71 71 71 72 72 72 72 72 72 72 72 72 72 72 72 72 72 72 72 72 72 72 73 74 74 74 73 73 73 72 72
1999 72 71 71 71 71 71 72 72 72 71 71 71 72 72 72 72 72 72 72 71 71 71 71 71 71 72 72 72 71 71 71 71 71 71 71 71 71 72 72 72 72 72 72 72 72 72 72 72 72 72 72 72 72 72 72 72 72 72 72 71 72 72 72 72 72 71 71 70 71 71 71
1992 71 71 71 72 72 72 72 71 71 71 72 73 72 72 72 71 71 72 72 73 72 72 72 72 73 73 72 72 72 72 71 71 72 71 71 71 70 70 71 71 71 72 71 71 71 70 70 71 71 71 71 71 72 72 72 72 72 72 71 71 71 71 72 71 71 71 71 71 71 71 71
1985 71 71 72 72 72 72 71 70 70 70 70 69 69 69 69 70 70 70 70 70 71 71 71 71 71 71 72 72 72 72 72 71 72 72 72 72 72 72 72 72 72 72 72 72 72 72 71 71 72 71 71 71 71 71 72 72 72 72 72 72 72 72 72 72 72 72 72 72 72 71 71
1977 71 71 71 71 72 73 73 73 72 72 72 72 72 73 72 72 72 73 73 72 72 72 72 72 72 72 72 73 73 73 73 72 72 72 72 72 72 73 73 74 74 74 73 74 74 74 74 73 73 73 73 72 72 72 73 73 73 73 73 73 74 74 74 74 74 74 74 74 74 74 74
1970 74 73 74 74 74 74 75 74 74 74 74 74 74 74 75 75 75 75 74 73 73 72 72 72 73 73 73 74 74 74 74 74 74 73 73 73 73 73 72 72 71 71 71 72 72 73 74 74 73 73 74 74 74 74 73 73 73 73 74 75 75 74 74 73 73 73 73 73 74 74 74
$$ packed form
2022G2%%%%%%J%%%%%%j%%%%%%Jj%j%%K%%j%%%J%%%%j%%j%%%%%%JJ%J%j%%J%%%j%%%%j%%%%
2014G2%%%%J%%%%j%%%%%J%%%%%%%j%%%%%%%J%%%%%%%%J%%%j%j%%%%J%j%%%%J%J%jj%%J%%J
2007G4j%%%%J%j%%jJ%%%%j%%J%%%%%%J%jj%Jjj%%%%Jj%%J%%%%%%%%%%%%%%%%%%JJ%%j%%j%
1999G2j%%%%J%%j%%J%%%%%%j%%%%%J%%j%%%%%%%%J%%%%%%%%%%%%%%%%%%%%%jJ%%%%j%jJ%%
1992G1%%J%%%j%%JJj%%j%J%Jj%%%J%j%%%j%Jj%%j%J%%Jj%%j%J%%%%J%%%%%j%%%Jj%%%%%%%
1985G1%J%%%jj%%%j%%%J%%%%J%%%%%J%%%%jJ%%%%%%%%%%%%%j%Jj%%%%J%%%%%%%%%%%%%%j%
1977G1%%%JJ%%j%%%%Jj%%J%j%%%%%%%J%%%j%%%%%J%J%%jJ%%%j%%%j%%J%%%%%J%%%%%%%%%%
1970G4jJ%%%Jj%%%%%%J%%%jj%j%%J%%J%%%%%j%%%%j%j%%J%JJ%j%J%%%j%%%JJ%j%j%%%%J%%
$$ plain form
1962 74 73 73 73 73 73 74 74 74 74 74 74 74 75 75 74 73 72 72 72 73 73 73 73 73 74 74 74 74 74 74 73 73 73 73 73 73 73 73 73 73 73 73 74 74 74 74 74 75 75 74 74 73 74 73 73 73 73 73 73 73 73 74 74 74 75 75 75 75 75 75
1955 75 75 75 75 74 73 73 72 73 73 73 73 73 73 73 74 73 73 72 72 72 72 72 72 72 72 73 73 73 73 73 73 73 72 72 72 72 72 72 73 74 74 74 74 74 74 74 74 74 74 73 73 74 74 74 74 74 74 73 73 73 73 73 73 73 72 73 73 73 73 73
1948 73 73 73 74 74 74 74 73 73 73 73 73 73 72 72 72 73 74 74 74 73 73 73 73 73 73 73 73 73 73 74 74 74 73 73 73 74 74 74 74 74 74 74 74 75 75 75 75 74 73 73 73 73 73 73 72 72 72 73 73 73 73 73 73 73 73 73 74 74 74 74
1940 74 73 73 74 74 73 73 73 73 74 74 73 74 74 74 74 73 74 74 74 75 75 74 73 73 72 73 73 73 73 73 73 72 72 72 73 73 73 73 73 73 73 73 74 73 73 73 73 73 74 74 75 75 74 74 74 74 74 73 74 74 74 74 74 74 74 75 75 74 74 74
1933 74 74 74 75 75 74 74 74 74 75 74 74 73 73 72 73 73 73 73 73 74 74 74 74 74 74 74 73 73 72 72 73 75 75 74 75 75 75 74 74 74 74 73 73 73 73 73 74 74 74 75 75 75 75 75 74 74 74 74 74 74 74 74 74 74 74 75 74 74 74 75
1925 75 75 76 76 76 75 75 75 75 75 75 74 74 75 76 76 76 76 76 76 75 75 75 75 74 74 75 75 75 75 75 76 76 75 75 75 75 75 75 75 75 75 76 76 76 76 76 76 76 75 75 75 75 74 74 74 75 75 75 76 76 76 76 76 76 76 75 74 74 75 76
1918 76 76 76 76 75 75 75 75 74 74 75 75 75 75 76 76 75 74 74 74 75 74 74 73 74 74 74 73 74 74 75 75 75 75 74 74 74 74 74 75 74 74 74 75 76 76 76 76 76 76 75 75 75 74 74 74 73 73 74 74 74 75 75 75 75 74 74 73 73 73 74
1910 74 74 74 74 74 74 73 74 74 74 74 74 74 75 75 75 74 74 73 74 74 73 73 73 74 74 74 75 75 75 75 75 75 75 75 74 74 74 73 73 73 73 73 73 73 73 74 74 74 74 74 73 74 75 75 75 74 74 74 73 73 73 72 72 72 73 73 74 74 73 72
$$ packed form
1962G4j%%%%J%%%%%%J%jjj%%J%%%%J%%%%%j%%%%%%%%%%%J%%%%J%j%jJj%%%%%%%J%%J%%%%%
1955G5%%%jj%jJ%%%%%%Jj%j%%%%%%%J%%%%%%j%%%%%JJ%%%%%%%%%j%J%%%%%j%%%%%%jJ%%%%
1948G3%%J%%%j%%%%%j%%JJ%%j%%%%%%%%%J%%j%%J%%%%%%%J%%%jj%%%%%j%%J%%%%%%%%J%%%
1940G4j%J%j%%%J%jJ%%%jJ%%J%jj%jJ%%%%%j%%J%%%%%%%Jj%%%%J%J%j%%%%jJ%%%%%%J%j%%
1933G4%%J%j%%%Jj%j%jJ%%%%J%%%%%%j%j%JK%jJ%%j%%%j%%%%J%%J%%%%j%%%%%%%%%%Jj%%J
1925G5%J%%j%%%%%j%JJ%%%%%j%%%j%J%%%%J%j%%%%%%%%J%%%%%%j%%%j%%J%%J%%%%%%jj%JJ
1918G6%%%j%%%j%J%%%J%jj%%Jj%jJ%%jJ%J%%%j%%%%Jj%%JJ%%%%%j%%j%%j%J%%J%%%j%j%%J
1910G4%%%%%jJ%%%%%J%%j%jJ%j%%J%%J%%%%%%%j%%j%%%%%%%J%%%%jJJ%%j%%j%%j%%J%J%jj
$$ plain form
1903 72 72 72 72 73 73 73 74 74 73 73 73 73 73 73 72 72 73 73 73 73 73 73 73 73 74 74 75 75 75 75 75 74 73 73 73 73 73 73 73 73 73 73 73 73 73 73 73 72 73 73 73 73 73 73 73 72 71 71 71 71 71 72 71 71 71 72 72 73 73 73
1896 73 73 72 72 72 72 71 71 70 70 70 71 71 71 72 72 72 72 72 71 71 71 71 71 71 71 72 72 72 72 72 72 72 71 70 70 71 71 71 71 71 71 72 71 71 71 70 70 70 70 70 70 70 70 70 70 70 70 70 71 71 70 70 70 70 70 70 70 70 70 71
1888 71 71 71 71 71 71 71 72 72 71 71 71 70 70 71 71 70 70 70 69 70 70 70 70 70 70 70 70 69 69 69 70 70 70 70 70 70 71 71 71 71 71 71 70 70 69 69 70 70 70 70 70 70 70 70 70 70 70 70 70 70 71 70 70 70 70 70 70 69 68 68
1881 68 69 70 69 69 69 69 69 69 69 69 68 68 68 69 69 69 69 70 70 70 70 70 70 70 69 69 69 69 69 69 69 69 70 69 68 67 68 69 69 69 69 68 68 68 69 69 69 69 69 69 69 69 70 70 71 71 71 69 68 68 68 68 69 70 70 69 69 69 68 68
1873 68 69 69 69 69 69 69 69 69 69 69 69 69 69 69 69 69 69 69 69 69 69 69 69 69 70 70 70 70 71 71 70 70 70 70 69 70 70 70 70 70 70 70 71 71 71 70 70 70 71 71 71 70 70 69 69 70 71 71 72 71 70 69 70 70 70 70 70 71 71 72
1866 72 71 71 70 69 69 69 69 70 70 70 71 71 70 70 70 71 71 72 71 71 71 71 71 71 71 71 71 71 71 71 71 70 70 70 71 71 72 72 72 72 71 70 70 70 70 70 70 70 71 72 72 72 73 73 73 72 71 71 71 71 71 72 72 72 71 71 71 71 71 71
1859 71 71 71 71 71 71 71 72 72 72 72 72 72 72 72 72 72 72 72 72 73 73 73 73 73 74 75 74 73 73 73 72 72 73 73 74 74 74 74 74 74 74 74 74 74 74 74 74 74 74 74 74 74 74 74 74 73 72 72 72 72 72 72 73 73 74 74 74 73 73 72
1851 72 73 73 73 73 72 72 72 73 73 73 73 73 72 72 72 72 72 72 72 73 73 73 72 73 73 73 73 73 72 72 72 72 72 72 73 73 73 73 73 73 73 72 72 73 73 73 72 72 72 73 74 74 73 72 72 72 72 72 72 73 73 73 73 73 73 73 72 72 73 72
$$ packed form
1903G2%%%J%%J%j%%%%%j%J%%%%%%%J%J%%%%jj%%%%%%%%%%%%%%jJ%%%%%%jj%%%%Jj%%J%J%%
1896G3%j%%%j%j%%J%%J%%%%j%%%%%%J%%%%%%jj%J%%%%%Jj%%j%%%%%%%%%%%%J%j%%%%%%%%J
1888G1%%%%%%J%j%%j%J%j%%jJ%%%%%%%j%%J%%%%%J%%%%%j%j%J%%%%%%%%%%%%%Jj%%%%%jj%
1881F8JJj%%%%%%%j%%J%%%J%%%%%%j%%%%%%%JjjjJJ%%%j%%J%%%%%%%J%J%%kj%%%JJ%j%%j%
1873F8J%%%%%%%%%%%%%%%%%%%%%%%J%%%J%j%%%jJ%%%%%%J%%j%%J%%j%j%JJ%JjjjJ%%%%J%J
1866G2j%jj%%%J%%J%j%%J%Jj%%%%%%%%%%%%j%%J%J%%%jj%%%%%%JJ%%J%%jj%%%%J%%j%%%%%
1859G1%%%%%%J%%%%%%%%%%%%J%%%%JJjj%%j%J%J%%%%%%%%%%%%%%%%%%%%jj%%%%%J%J%%j%j
1851G2J%%%j%%J%%%%j%%%%%%J%%jJ%%%%j%%%%%J%%%%%%j%J%%j%%JJ%jj%%%%%J%%%%%%j%Jj
$$ plain form
1844 72 72 72 73 73 73 73 73 73 73 73 73 74 74 73 72 72 71 71 71 71 72 72 72 73 73 73 73 73 73 73 73 73 73 73 72 72 72 73 73 73 72 72 72 72 72 73 74 74 74 74 74 74 73 73 73 73 73 73 73 73 73 73 74 74 74 73 73 73 74 73
1836 73 73 73 73 73 73 72 72 73 74 74 74 73 73 73 73 73 73 73 72 72 72 72 72 73 73 73 73 73 73 73 72 72 71 71 71 72 72 72 72 73 73 73 73 73 73 72 71 71 72 72 72 71 71 71 71 72 73 72 72 72 72 73 73 73 73 73 73 73 73 73
1829 73 73 73 72 71 71 71 71 71 71 72 72 72 72 72 72 72 73 73 73 73 73 73 73 73 73 73 72 72 72 72 72 72 73 73 73 73 73 73 73 73 74 74 74 74 74 73 72 72 72 72 72 72 72 72 73 73 74 74 74 74 73 73 72 72 72 72 72 72 72 72
1821 72 72 72 72 72 72 72 72 73 73 73 72 72 72 73 73 73 73 73 73 73 73 73 72 73 73 73 73 73 73 73 74 73 72 73 73 73 72 72 72 72 72 73 73 73 73 73 72 72 71 71 71 71 71 71 71 71 71 71 71 71 71 72 73 73 72 72 72 73 73 72
1814 72 71 72 72 71 71 71 71 71 71 71 71 71 71 71 71 72 73 73 72 72 72 72 72 72 71 71 71 72 72 72 72 72 72 72 72 73 72 72 71 72 72 72 72 72 72 71 71 70 70 70 71 71 72 72 72 72 72 72 72 72 71 71 71 70 70 70 71 71 71 71
1807 71 71 71 70 70 70 71 72 72 71 71 70 71 71 71 71 71 71 71 71 71 70 70 70 70 71 71 72 72 72 73 72 71 71 71 71 71 72 72 71 72 72 72 72 72 71 70 70 70 71 72 71 70 70 70 70 70 71 70 70 69 69 70 70 70 70 70 69 70 71 71
1799 71 71 71 71 71 70 70 69 69 69 69 69 69 69 70 70 71 71 70 69 69 70 69 69 69 69 70 70 70 71 71 71 71 71 72 72 72 72 72 71 69 69 69 69 69 69 69 69 69 69 69 69 69 69 69 69 69 69 69 69 69 69 69 68 68 69 68 68 69 70 70
1792 70 70 70 70 71 71 69 69 69 69 69 69 69 69 69 70 71 72 72 71 71 70 70 70 70 70 70 70 70 70 71 71 71 71 72 72 72 72 72 73 72 71 71 70 70 70 70 71 71 71 71 70 70 69 69 70 70 70 70 70 71 71 70 70 70 71 71 70 71 71 71
$$ packed form
1844G2%%J%%%%%%%%J%jj%j%%%J%%J%%%%%%%%%%j%%J%%j%%%%JJ%%%%%j%%%%%%%%%J%%j%%Jj
1836G3%%%%%j%JJ%%j%%%%%%j%%%%J%%%%%%j%j%%J%%%J%%%%%jj%J%%j%%%JJj%%%J%%%%%%%%
1829G3%%jj%%%%%J%%%%%%J%%%%%%%%%j%%%%%J%%%%%%%J%%%%jj%%%%%%%J%J%%%j%j%%%%%%%
1821G2%%%%%%%J%%j%%J%%%%%%%%jJ%%%%%%JjjJ%%j%%%%J%%%%j%j%%%%%%%%%%%%JJ%j%%J%j
1814G2jJ%j%%%%%%%%%%%JJ%j%%%%%j%%J%%%%%%%Jj%jJ%%%%%j%j%%J%J%%%%%%%j%%j%%J%%%
1807G1%%j%%JJ%j%jJ%%%%%%%%j%%%J%J%%Jjj%%%%J%jJ%%%%jj%%JJjj%%%%Jj%j%J%%%%jJJ%
1799G1%%%%j%j%%%%%%J%J%jj%Jj%%%J%%J%%%%J%%%%jk%%%%%%%%%%%%%%%%%%%%%%j%Jj%JJ%
1792G0%%%J%k%%%%%%%%JJJ%j%j%%%%%%%%J%%%J%%%%Jjj%j%%%J%%%j%j%J%%%%J%j%%J%jJ%%
$$ plain form
1784 71 71 70 70 70 70 71 73 73 72 72 72 72 71 71 70 70 71 72 72 71 71 71 71 71 71 71 72 72 72 72 72 72 73 73 73 73 74 73 73 73 73 73 73 73 72 73 74 74 74 73 73 72 72 72 73 73 73 73 72 71 71 71 72 73 74 74 73 73 73 73
1777 73 73 72 72 72 73 74 73 73 73 73 73 73 73 73 74 74 74 74 74 74 74 74 75 74 74 73 73 73 73 74 74 74 74 74 74 74 74 74 74 74 74 73 73 73 72 73 73 73 73 72 72 73 74 75 75 75 75 75 75 74 74 74 74 74 73 73 73 73 73 73
1769 73 73 73 73 73 72 73 74 73 73 73 73 72 73 73 72 72 72 73 73 73 73 73 73 73 73 73 73 73 74 74 73 73 72 72 72 72 72 73 73 74 74 74 74 74 74 74 74 74 74 74 74 73 72 72 72 73 73 73 73 74 74 73 74 74 73 73 73 73 72 72
1762 72 72 72 72 73 73 72 71 71 71 72 72 72 72 72 73 73 73 73 73 74 74 74 74 74 73 73 72 72 71 72 72 72 72 72 73 73 73 72 72 72 73 72 72 72 72 71 71 71 71 71 71 71 71 70 70 70 70 70 71 71 71 71 71 71 71 71 71 71 71 71
1755 71 71 71 71 71 71 72 71 71 71 71 71 71 71 71 71 71 70 70 70 70 71 71 72 72 71 70 70 69 70 70 70 70 71 71 70 70 70 70 71 70 70 70 71 71 71 70 70 70 71 71 71 71 71 70 69 70 70 70 69 69 69 68 67 67 68 69 69 69 69 69
1747 69 70 70 70 69 68 68 68 68 68 68 68 69 70 70 68 68 68 68 68 68 69 69 69 69 69 69 69 69 69 69 69 69 68 67 67 66 67 67 68 68 68 68 68 68 69 70 69 68 68 69 69 69 69 70 70 70 69 69 69 69 69 69 69 69 69 68 68 69 69 69
1740 69 69 69 69 69 69 69 69 69 69 69 69 69 70 69 69 68 68 68 68 68 68 68 69 69 69 69 69 69 69 69 69 69 69 69 68 68 68 69 70 70 69 70 70 69 68 68 68 68 69 69 69 68 67 67 68 69 68 68 68 68 68 69 69 69 70 70 69 69 68 68
1732 68 68 67 67 67 67 66 67 68 69 69 69 69 69 69 68 68 68 68 69 69 69 69 70 70 70 69 69 69 68 68 68 68 68 68 68 69 70 69 69 69 69 69 69 69 69 69 70 70 71 70 70 70 70 70 70 70 70 70 70 70 69 69 69 70 71 71 71 70 70 70
$$ packed form
1784G1%j%%%JK%j%%%j%j%JJ%j%%%%%%J%%%%%J%%%Jj%%%%%%jJJ%%j%j%%J%%%jj%%JJJ%j%%%
1777G3%j%%JJj%%%%%%%J%%%%%%%Jj%j%%%J%%%%%%%%%%%j%%jJ%%%j%JJJ%%%%%j%%%%j%%%%%
1769G3%%%%jJJj%%%jJ%j%%J%%%%%%%%%%J%j%j%%%%J%J%%%%%%%%%%%jj%%J%%%J%jJ%j%%%j%
1762G2%%%J%jj%%J%%%%J%%%%J%%%%j%j%jJ%%%%J%%j%%Jj%%%j%%%%%%%j%%%%J%%%%%%%%%%%
1755G1%%%%%Jj%%%%%%%%%j%%%J%J%jj%jJ%%%J%j%%%Jj%%J%%j%%J%%%%jjJ%%j%%jj%JJ%%%%
1747F9J%%jj%%%%%%JJ%k%%%%%J%%%%%%%%%%%jj%jJ%J%%%%%JJjj%J%%%J%%j%%%%%%%%j%J%%
1740F9%%%%%%%%%%%%Jj%j%%%%%%J%%%%%%%%%%%j%%JJ%jJ%jj%%%J%%jj%JJj%%%%J%%J%j%j%
1732F8%j%%%jJJJ%%%%%j%%%J%%%J%%j%%j%%%%%%JJj%%%%%%%%J%Jj%%%%%%%%%%j%%JJ%%j%%
$$ plain form
1725 70 70 69 69 69 69 69 69 69 69 70 71 70 70 70 70 70 70 70 70 71 71 70 70 70 69 69 69 69 70 70 70 69 69 69 69 69 70 70 69 69 69 69 69 70 71 71 71 72 71 71 70 69 69 70 70 71 71 70 69 70 71 70 70 71 71 71 71 71 72 72
1718 72 72 71 71 71 71 71 71 71 71 71 71 71 72 72 72 72 72 71 71 71 71 71 71 71 72 71 71 71 71 71 71 71 71 71 71 71 71 71 71 71 71 71 71 71 72 72 72 72 71 71 71 71 71 72 73 72 72 72 71 72 72 73 73 73 73 73 73 73 73 73
1710 73 73 73 73 73 73 72 72 72 71 71 71 72 72 73 74 74 74 73 73 73 73 73 74 74 74 74 74 74 74 74 73 73 73 73 73 74 74 73 72 72 72 72 72 72 73 73 72 72 72 72 73 73 74 74 74 74 74 74 74 73 73 74 74 74 74 74 75 74 74 74
1703 74 75 74 74 74 74 74 74 74 74 74 74 74 74 74 74 74 74 74 74 74 74 74 73 73 74 74 73 72 72 72 73 73 73 73 73 74 74 74 74 74 73 73 73 73 73 73 73 73 74 74 74 74 74 74 75 74 74 73 74 74 74 73 73 74 74 74 73 73 73 73
1695 73 73 73 74 74 74 74 75 75 75 74 74 74 73 73 73 73 73 73 72 73 73 73 73 73 73 73 72 72 72 72 71 71 71 72 73 73 73 72 72 72 72 71 70 70 70 71 71 71 71 72 74 74 74 74 74 74 74 74 73 73 73 73 73 73 73 73 73 73 73 73
1688 73 73 74 74 73 73 73 72 72 72 72 72 72 72 72 73 72 72 71 71 71 70 71 72 71 71 72 72 72 71 71 71 71 72 73 73 73 73 72 72 72 71 71 72 72 72 71 71 71 71 71 71 71 72 72 73 72 72 72 72 73 73 72 71 71 71 71 71 71 71 72
1680 72 72 73 73 73 72 72 71 71 71 72 71 71 72 72 72 72 72 72 71 72 72 72 72 71 71 71 71 72 71 71 71 71 71 71 71 71 71 71 71 71 71 71 71 71 71 70 69 69 69 68 69 69 70 71 71 71 71 71 70 71 71 71 71 71 71 71 71 71 71 71
1673 71 71 72 72 72 71 71 71 70 71 72 72 72 71 71 71 71 70 69 69 70 70 70 70 70 68 68 68 69 70 70 70 71 70 71 71 71 71 70 70 70 70 69 69 69 69 70 70 70 70 70 70 70 70 70 70 70 70 70 70 70 70 71 70 69 69 70 70 70 70 70
$$ packed form
1725G0%j%%%%%%%JJj%%%%%%%J%j%%j%%%J%%j%%%%J%j%%%%JJ%%Jj%jj%J%J%jjJJj%J%%%%J%
1718G2%j%%%%%%%%%%J%%%%j%%%%%%Jj%%%%%%%%%%%%%%%%%%J%%%j%%%%JJj%%jJ%J%%%%%%%%
1710G3%%%%%j%%j%%J%JJ%%j%%%%J%%%%%%%j%%%%J%jj%%%%%J%j%%%J%J%%%%%%j%J%%%%Jj%%
1703G4Jj%%%%%%%%%%%%%%%%%%%%j%J%jj%%J%%%%J%%%%j%%%%%%%J%%%%%Jj%jJ%%j%J%%j%%%
1695G3%%J%%%J%%j%%j%%%%%jJ%%%%%%j%%%j%%JJ%%j%%%jj%%J%%%JK%%%%%%%j%%%%%%%%%%%
1688G3%J%j%%j%%%%%%%Jj%j%%jJJj%J%%j%%%JJ%%%j%%j%J%%j%%%%%%J%Jj%%%J%jj%%%%%%J
1680G2%J%%j%j%%Jj%J%%%%%jJ%%%j%%%Jj%%%%%%%%%%%%%%%%jj%%jJ%JJ%%%%jJ%%%%%%%%%%
1673G1%J%%j%%jJJ%%j%%%jj%J%%%%k%%JJ%%JjJ%%%j%%%j%%%J%%%%%%%%%%%%%%%Jjj%J%%%%
$$ plain form
1666 70 69 69 69 68 68 68 69 69 69 69 69 69 70 70 70 70 70 70 69 68 67 67 67 68 69 69 70 71 71 70 70 70 69 69 69 70 70 69 69 69 69 69 69 68 68 69 69 69 68 69 69 69 69 69 69 69 69 68 67 67 67 68 68 69 69 69 68 68 68 68
1658 68 68 68 68 67 67 67 68 68 68 68 68 67 67 67 68 69 68 67 67 67 67 67 67 68 68 69 68 68 68 68 69 69 68 68 68 69 68 67 67 66 67 67 66 67 67 68 68 68 68 67 67 67 68 68 67 67 66 67 67 67 67 67 66 66 66 66 66 67 67 67
1651 67 67 67 67 67 68 68 68 67 67 68 67 67 68 67 67 66 66 66 67 67 67 67 67 66 66 66 66 67 66 66 67 66 65 66 66 66 67 66 66 66 66 67 67 67 66 66 66 66 67 67 67 66 65 65 65 65 66 67 67 67 67 67 67 67 67 66 65 65 65 66
1643 66 66 67 67 67 67 68 68 68 67 67 67 67 67 67 66 65 65 66 66 66 66 66 66 66 66 65 66 66 66 66 66 66 66 67 67 67 68 68 68 67 67 67 67 67 67 67 67 67 68 69 69 68 68 68 68 67 67 68 67 67 67 67 67 67 66 66 67 67 67 66
1636 66 66 67 68 69 70 70 70 69 69 69 68 67 67 68 68 69 69 69 69 69 69 69 69 70 71 70 70 70 70 70 71 70 70 70 70 70 70 71 71 71 71 70 69 70 69 69 69 68 68 68 68 68 69 69 68 68 68 68 68 69 69 69 69 69 69 69 69 68 67 67
1629 67 67 67 67 69 69 69 69 69 69 70 70 70 70 69 69 69 69 70 71 71 71 71 71 71 71 71 72 72 72 72 72 72 72 72 72 72 72 72 72 72 71 71 71 71 71 71 72 72 72 72 71 71 71 71 71 71 70 70 70 71 71 72 72 73 73 73 73 73 72 72
1621 72 72 72 72 72 72 72 73 73 73 73 73 73 73 72 72 71 70 71 71 72 72 72 72 73 73 73 74 73 72 72 72 73 74 74 74 74 74 75 75 74 74 74 75 75 75 75 74 74 74 74 74 73 73 73 74 73 72 72 73 73 74 74 74 74 74 74 74 74 74 74
1614 74 73 74 73 73 72 72 72 71 72 72 73 73 73 73 74 74 74 74 74 74 73 73 73 73 73 73 74 74 74 74 74 74 74 74 74 74 75 75 76 76 76 76 76 76 76 76 76 75 75 75 75 75 75 75 75 74 74 74 74 74 73 72 72 72 71 71 72 72 72 71
$$ packed form
1666G0j%%j%%J%%%%%J%%%%%jjj%%JJ%JJ%j%%j%%J%j%%%%%j%J%%jJ%%%%%%%jj%%J%J%%j%%%
1658F8%%%j%%J%%%%j%%JJjj%%%%%J%Jj%%%J%j%%Jjj%jJ%jJ%J%%%j%%J%j%jJ%%%%j%%%%J%%
1651F7%%%%J%%j%Jj%Jj%j%%J%%%%j%%%Jj%JjjJ%%Jj%%%J%%j%%%J%%jj%%%JJ%%%%%%%jj%%J
1643F6%J%%%J%%j%%%%%jj%J%%%%%%%jJ%%%%%%J%%J%%j%%%%%%%%JJ%j%%%j%Jj%%%%%j%J%%j
1636F6%JJJJ%%j%%jj%J%J%%%%%%%JJj%%%%Jj%%%%%J%%%jjJj%%j%%%%J%j%%%%J%%%%%%%jj%
1629F7%%%K%%%%%J%%%j%%%JJ%%%%%%%J%%%%%%%%%%%%%j%%%%%J%%%j%%%%%j%%J%J%J%%%%j%
1621G2%%%%%%J%%%%%%j%jjJ%J%%%J%%Jjj%%JJ%%%%J%j%%J%%%j%%%%j%%Jjj%J%J%%%%%%%%%
1614G4jJj%j%%jJ%J%%%J%%%%%j%%%%%J%%%%%%%%%J%J%%%%%%%%j%%%%%%%j%%%%jj%%j%J%%j
$$ plain form
1606 71 71 72 72 72 72 72 72 71 70 71 71 71 72 72 73 73 72 71 72 72 72 73 73 73 73 74 73 72 73 73 73 73 73 72 72 72 71 72 72 72 72 71 71 72 72 72 72 72 72 72 72 72 73 72 72 72 72 71 71 71 71 70 70 70 70 70 70 70 70 70
1599 70 69 70 69 68 69 70 70 70 70 70 70 70 70 70 70 70 70 70 70 69 69 68 68 69 69 69 70 70 71 71 70 69 69 68 69 68 68 68 68 68 68 68 68 68 68 67 68 67 67 67 67 68 68 68 68 68 68 68 68 68 67 67 67 68 68 69 70 70 70 69
1591 69 68 68 67 67 68 68 68 68 68 68 68 68 68 68 68 67 67 67 68 68 68 68 68 68 68 68 68 68 68 69 69 69 69 68 67 67 68 68 68 68 68 67 68 68 68 67 67 67 66 66 67 67 67 67 67 67 67 67 67 68 68 68 68 67 67 67 67 66 66 67
1584 67 66 66 65 65 66 66 66 67 67 68 68 68 68 68 68 67 67 67 68 68 68 67 68 68 67 67 67 67 68 68 68 68 68 68 68 68 68 68 68 68 68 68 68 68 69 68 68 67 67 67 66 67 67 67 67 67 68 68 67 67 67 67 68 68 69 69 68 68 69 69
1577 69 69 69 69 68 68 68 68 68 68 69 69 68 67 68 68 68 68 69 70 70 71 71 70 70 70 70 70 70 70 69 68 68 68 69 68 68 69 69 69 70 70 70 70 70 70 70 70 69 69 69 70 70 70 70 70 70 70 70 70 70 70 70 70 69 69 69 69 70 70 70
1569 70 71 71 71 71 71 71 71 71 71 72 72 72 72 72 72 72 72 72 72 71 72 72 73 73 73 73 73 73 73 73 72 71 71 72 72 73 74 73 73 74 73 73 72 71 71 71 71 71 71 71 72 72 72 71 72 72 72 72 72 72 72 72 71 71 71 71 71 72 72 73
1562 73 73 73 73 73 73 72 71 72 72 72 73 73 73 73 73 72 72 72 72 73 73 73 73 74 74 73 73 74 74 74 74 73 73 73 73 74 74 74 75 74 74 74 75 75 75 75 74 74 75 76 75 75 74 74 74 74 74 74 74 74 74 74 74 74 74 74 74 74 75 76
1554 76 76 75 74 75 75 76 76 75 75 76 75 74 74 74 73 74 74 75 75 75 74 74 74 74 75 74 73 73 73 73 73 73 73 74 74 74 74 74 74 75 74 74 73 72 73 73 74 74 74 74 75 75 74 73 73 73 73 74 74 74 74 74 74 74 74 75 75 75 74 74
$$ packed form
1606G1%J%%%%%jjJ%%J%J%jjJ%%J%%%JjjJ%%%%j%%jJ%%%j%J%%%%%%%%Jj%%%j%%%j%%%%%%%%
1599G0jJjjJJ%%%%%%%%%%%%%j%j%J%%J%J%jj%jJj%%%%%%%%%jJj%%%J%%%%%%%%j%%J%JJ%%j
1591F9j%j%J%%%%%%%%%%j%%J%%%%%%%%%%J%%%jj%J%%%%jJ%%j%%j%J%%%%%%%%J%%%j%%%j%J
1584F7j%j%J%%J%J%%%%%j%%J%%jJ%j%%%J%%%%%%%%%%%%%%%Jj%j%%jJ%%%%J%j%%%J%J%j%J%
1577F9%%%j%%%%%J%jjJ%%%JJ%J%j%%%%%%jj%%Jj%J%%J%%%%%%%j%%J%%%%%%%%%%%%j%%%J%%
1569G0J%%%%%%%%J%%%%%%%%%jJ%J%%%%%%%jj%J%JJj%Jj%jj%%%%%%J%%jJ%%%%%%%j%%%%J%J
1562G3%%%%%jjJ%%J%%%%j%%%J%%%J%j%J%%%j%%%J%%Jj%%J%%%j%JJj%j%%%%%%%%%%%%%%%JJ
1554G6%jjJ%J%j%Jjj%%jJ%J%%j%%%Jjj%%%%%%J%%%%%Jj%jjJ%J%%%J%jj%%%J%%%%%%%J%%j%
$$ plain form
1547 74 74 74 73 74 74 74 74 74 75 75 75 75 75 76 76 75 75 75 75 75 75 74 74 74 74 74 74 75 75 75 74 74 74 74 74 74 74 74 74 74 74 74 74 74 73 74 73 73 73 74 74 74 75 75 75 75 74 74 73 73 73 73 73 72 72 73 74 74 74 75
1540 75 74 74 75 75 76 75 75 75 75 75 75 74 75 75 75 74 74 75 74 74 74 73 73 73 73 73 73 73 73 74 74 74 74 75 75 74 74 74 74 74 73 74 74 74 73 73 72 72 72 73 73 73 73 73 73 73 73 73 74 74 74 74 73 73 73 73 72 72 72 72
1532 72 72 73 73 73 73 72 73 73 73 73 73 73 73 73 73 73 73 73 73 73 74 73 72 72 72 72 72 72 73 73 73 73 74 73 73 73 73 72 72 72 72 71 71 71 72 72 72 72 72 72 72 71 71 71 70 71 71 71 70 70 70 70 70 69 69 69 69 70 70 69
1525 69 69 69 69 70 70 71 71 71 72 71 71 71 71 70 70 70 71 71 71 71 71 70 70 70 71 71 71 70 70 70 69 69 70 69 69 69 68 69 68 68 68 68 67 68 69 69 70 70 69 68 68 69 69 69 69 69 69 70 69 68 66 66 67 68 67 67 66 66 67 69
1517 69 69 70 70 70 69 69 69 69 68 68 69 69 68 68 68 69 69 69 69 69 68 69 69 69 70 70 70 70 69 70 71 71 72 73 74 75 75 74 73 71 70 69 69 69 68 68 67 68 68 67 67 67 67 67 68 68 68 68 68 68 68 67 67 67 67 68 67 67 67 68
1510 68 68 68 68 67 68 68 68 68 68 68 68 68 68 67 68 68 69 68 68 67 67 67 68 68 70 70 70 69 69 68 68 69 68 67 67 67 67 67 67 66 67 67 67 67 66 66 65 66 66 67 67 67 68 68 68 68 68 68 68 68 68 68 68 68 68 68 68 68 67 67
1502 67 67 68 68 68 69 69 69 69 69 69 69 69 69 69 68 68 68 68 69 69 69 69 69 68 68 68 68 68 68 68 68 69 69 69 70 69 69 69 68 69 69 69 69 69 69 69 70 70 70 69 69 68 68 69 69 69 69 70 69 70 70 70 70 70 69 69 69 69 69 69
1495 69 70 70 70 70 70 70 70 70 70 70 71 71 71 71 71 70 71 72 72 72 72 72 70 70 70 70 70 69 69 69 69 70 69 69 69 69 70 70 69 69 68 67 67 68 68 69 69 69 69 69 70 69 69 68 68 68 68 69 69 69 69 69 69 69 69 69 69 69 69 69
$$ packed form
1547G4%%jJ%%%%J%%%%J%j%%%%%j%%%%%J%%j%%%%%%%%%%%%%jJj%%J%%J%%%j%j%%%%j%JJ%%J
1540G5j%J%Jj%%%%%jJ%%j%Jj%%j%%%%%%%J%%%J%j%%%%jJ%%j%j%%J%%%%%%%%J%%%j%%%j%%%
1532G2%J%%%jJ%%%%%%%%%%%%%Jjj%%%%%J%%%Jj%%%j%%%j%%J%%%%%%j%%jJ%%j%%%%j%%%J%j
1525F9%%%J%J%%Jj%%%j%%J%%%%j%%J%%j%%j%Jj%%jJj%%%jJJ%J%jj%J%%%%%Jjjk%JJj%j%JK
1517F9%J%%j%%%j%J%j%%J%%%%jJ%%J%%%jJJ%JJJJ%jjkjj%%j%jJ%j%%%%J%%%%%%j%%%Jj%%J
1510F8%%%jJ%%%%%%%%jJ%Jj%j%%J%K%%j%j%Jjj%%%%%jJ%%%j%jJ%J%%J%%%%%%%%%%%%%%%j%
1502F7%J%%J%%%%%%%%%j%%%J%%%%j%%%%%%%J%%Jj%%jJ%%%%%%J%%j%j%J%%%JjJ%%%%j%%%%%
1495F9J%%%%%%%%%J%%%%jJJ%%%%k%%%%j%%%Jj%%%J%j%jj%J%J%%%%Jj%j%%%J%%%%%%%%%%%%
$$ plain form
1488 69 69 69 69 69 68 69 70 70 70 69 69 70 70 70 70 70 70 70 70 71 71 71 71 71 71 71 70 71 71 72 72 72 72 72 73 74 73 72 71 71 71 70 70 71 70 69 69 69 69 70 70 70 70 70 69 68 69 69 69 69 69 70 70 70 70 70 70 71 71 71
1480 71 72 72 71 71 72 71 70 69 69 70 70 70 70 70 70 70 71 71 71 71 72 72 72 71 72 73 73 74 74 75 75 74 74 73 73 74 74 74 73 72 72 72 71 71 71 71 72 73 73 72 72 72 71 71 71 71 71 71 71 70 70 70 69 69 69 70 71 70 70 70
1473 70 71 71 71 71 71 71 71 70 70 70 71 71 72 72 72 72 72 72 72 72 72 72 72 72 71 71 72 73 73 73 73 73 73 74 74 74 75 75 75 75 74 74 74 74 73 73 74 74 74 74 74 75 75 74 73 73 74 75 75 75 74 74 74 74 74 74 74 74 74 75
1465 75 75 75 75 75 75 75 75 75 75 75 75 75 75 74 74 75 75 76 76 75 75 75 75 75 75 75 75 76 76 76 77 77 77 77 78 78 77 77 77 77 78 78 78 78 78 78 78 78 77 77 77 77 78 78 78 78 78 78 79 79 79 78 78 77 77 78 77 77 78 78
1458 78 78 78 79 79 79 79 79 79 79 78 78 79 80 80 80 80 79 79 79 79 80 80 80 80 80 80 80 80 80 79 79 79 79 78 79 79 80 79 79 79 78 79 80 80 80 80 79 79 79 80 80 80 80 80 80 80 80 80 80 80 80 81 81 82 82 81 81 82 82 82
1451 82 82 82 81 82 82 82 82 82 81 81 81 81 81 81 81 80 80 81 81 81 81 80 80 80 80 81 81 80 80 80 80 81 81 81 80 79 79 80 80 79 79 80 80 80 79 79 79 79 80 80 80 80 80 80 81 80 80 79 79 79 80 81 81 81 80 80 80 80 80 80
1443 80 79 79 79 80 80 80 80 80 80 80 79 79 80 80 80 80 80 79 79 79 79 80 80 80 80 82 82 81 81 81 80 81 81 81 81 82 81 81 80 80 80 80 81 80 80 80 80 80 80 80 80 80 81 82 82 81 80 79 79 80 80 81 80 81 81 80 80 80 81 81
1436 81 81 81 80 80 81 82 81 81 80 79 79 79 79 80 80 81 80 80 80 81 81 81 82 82 83 84 85 86 86 88 89 90 92 94 96 97 98 98 96 95 93 91 89 88 87 87 86 86 86 86 86 85 85 85 84 84 84 84 83 83 83 82 82 83 83 84 84 85 84 84
$$ packed form
1488F9%%%%jJJ%%j%J%%%%%%%J%%%%%%jJ%J%%%%JJjjj%%j%Jjj%%%J%%%%jjJ%%%%J%%%%%J%%
1480G1J%j%Jjjj%J%%%%%%J%%%J%%jJJ%J%J%j%j%J%%jj%%j%%%JJ%j%%j%%%%%%j%%j%%JJj%%
1473G0J%%%%%%j%%J%J%%%%%%%%%%%j%JJ%%%%%J%%J%%%j%%%j%J%%%%J%jj%JJ%%j%%%%%%%%J
1465G5%%%%%%%%%%%%%j%J%J%j%%%%%%%J%%J%%%J%j%%%J%%%%%%%j%%%J%%%%%J%%j%j%Jj%J%
1458G8%%J%%%%%%j%JJ%%%j%%%J%%%%%%%%j%%%jJ%Jj%%jJJ%%%j%%J%%%%%%%%%%%J%J%j%J%%
1451H2%%jJ%%%%j%%%%%%j%J%%%j%%%J%j%%%J%%jj%J%j%J%%j%%%J%%%%%Jj%j%%JJ%%j%%%%%
1443H0j%%J%%%%%%j%J%%%%j%%%J%%%K%j%%jJ%%%Jj%j%%%Jj%%%%%%%%JJ%jjj%J%JjJ%j%%J%
1436H1%%j%JJj%jj%%%J%Jj%%J%%J%JJJJ%KJJKKKJJ%kjkkkjj%j%%%%j%%j%%%j%%j%J%J%Jj%
$$ plain form
1428 84 83 83 84 85 85 85 85 85 85 85 86 85 85 86 86 86 87 87 88 88 89 89 90 91 92 94 96 99 103 108 113 121 131 142 154 165 175 180 180 176 167 156 145 135 127 120 113 108 104 102 99 97 95 94 94 93 92 92 92 91 91 91
1422 91 91 91 91 90 90 90 91 92 92 93 92 92 92 92 92 91 91 91 91 92 93 93 93 92 92 92 92 93 92 92 92 93 93 93 94 94 94 94 95 96 97 97 97 97 97 98 99 98 99 100 101 101 102 103 103 105 106 107 108 109 109 110 111 111 112 112 112 114 115 116
1414 116 117 118 119 120 121 121 123 124 125 126 126 127 128 128 129 130 131 133 135 137 139 140 142 144 146 148 150 152 154 157 159 160 162 164 165 168 171 173 175 177 180 182 184 185 187 189 192 194 196 198 200 202 204 205 207 210 213 216 219 222 225 229 233 236 239 242 245 247 249
1407 249 252 255 258 261 263 266 269 272 275 278 281 284 287 290 292 295 298 300 303 305 309 312 315 319 322 324 329 333 336 340 343 347 350 353 356 359 363 366 368 370 372 375 377 378 379 380 382 383 385 386 387 389 390 391 392 393 394 394 395 395 396 397 397 398 399 400 401 402 404
1400 404 406 407 408 408 409 409 409 410 410 410 409 408 408 407 406 405 405 403 402 401 400 399 398 396 395 394 392 390 388 386 384 383 381 379 378 376 375 375 374 374 374 373 372 372 371 371 371 370 369 368 367 366 367 366 366 366 367 367 367 368 368 367 367 367 367 367 367 367 368
1392 368 368 369 369 369 370 370 371 371 372 373 374 375 377 379 380 380 380 381 382 382 382 383 383 384 384 385 385 386 386 386 386 386 386 385 385 384 384 382 381 381 380 380 379 379 378 379 378 377 376 374 374 373 372 372 371 370 369 368 366 365 363 361 358 357 355 352 349 346 343
1385 343 340 336 333 329 326 322 318 314 310 306 302 298 294 291 287 283 280 277 274 271 268 265 262 260 257 254 251 248 245 243 240 237 234 231 227 225 222 219 215 213 210 207 204 201 199 196 194 192 190 187 184 182 180 179 177 175 173 172 170 169 168 167 166 164 163 162 161 160 159
1378 159 158 158 158 156 155 153 152 153 154 154 153 152 152 152 152 153 153 153 153 153 153 154 154 154 155 156 156 157 158 157 157 157 157 158 158 159 159 159 159 159 159 159 160 160 161 161 162 162 163 163 163 162 163 163 165 166 166 167 167 168 168 168 168 169 169 170 170 169 169
$$ packed form
1428H4j%JJ%%%%%%Jj%J%%J%J%J%JJJKKLMNNQJ0J1J2J1J0N%mrj1j1j0qppnmklkkj%jj%%j%%
1422I1%%%j%%JJ%Jj%%%%j%%%JJ%%j%%%Jj%%J%%J%%%JJJ%%%%JJjJJJ%JJ%KJJJJ%JJ%J%%KJJ
1414A16JJJJJ%KJJJ%JJ%JJJKKKKJKKKKKKKLKJKKJLLKKKLKKJKKLKKKKKKJKLLLLLLMMLLLLKK
1407B49LLLLKLLLLLLLLLKLLKLKMLLMLKNMLMLMLLLLMLKKKLKJJJKJKJJKJJJJJ%J%JJ%JJJJJK
1400D04KJJ%J%%J%%jj%jjj%kjjjjjkjjkkkkkjkkjkj%j%%jj%j%%jjjjjJj%%J%%J%j%%%%%%J
1392C68%J%%J%J%JJJJKKJ%%JJ%%J%J%J%J%%%%%j%j%kj%j%j%jJjjjk%jj%jjjjkjkkljkllll
1385C43lmlmlmmmmmmmmlmmlllllllklllllkllllmkllmkllllklkkkllkkjkkkjkjjjjkjjjjj
1378A59j%%kjkjJJ%jj%%%J%%%%%J%%JJ%JJj%%%J%J%%%%%%J%J%J%J%%jJ%KJ%J%J%%%J%J%j%
$$ plain form
1370 169 170 171 172 172 172 172 172 173 173 173 174 174 174 173 173 174 174 175 176 176 176 177 177 178 180 181 182 183 184 185 186 187 188 189 190 191 192 192 193 194 194 194 194 194 195 195 196 196 197 197 198 199 199 200 201 203 205 206 208 209 210 212 214 216 217 218 220 223 225
1363 225 227 229 231 232 234 235 236 237 239 242 243 245 246 246 247 248 250 251 253 254 255 256 258 260 262 264 265 267 269 271 274 277 280 283 286 289 292 296 301 305 309 313 316 320 323 327 330 334 337 341 344 348 351 355 358 362 366 370 375 381 386 391 398 404 411 417 425 433 443
1356 443 453 463 474 486 498 512 526 541 556 572 590 610 630 651 674 698 725 754 787 821 857 898 943 993 1047 1107 1173 1246 1325 1412 1507 1611 1722 1840
1352 1840 1964 2093 2227 2362 2498 2633 2768 2903 3038 3174 3313 3455 3599 3745 3892 4039 4185 4326 4460 4586 4703 4809 4904
1350 4904 4988 5067 5141 5217 5298 5388 5493 5615 5756 5918 6099 6299 6513 6740 6977 7222 7474 7732 7995 8263 8535 8810 9089 9370 9652
1347 9652 9931 10205 10472 10728 10969 11192 11392 11567 11713 11828 11909 11959 11976 11962 11922 11859 11780 11691 11599 11510 11428 11360 11305 11266 11243 11235 11241 11257 11284 11320
1344 11320 11364 11416 11478 11549 11629 11717 11813 11915 12019 12120 12214 12298 12367 12419 12450 12459 12442 12401 12332 12237 12113 11964 11791 11597 11387 11163 10934 10704 10477
1341 10477 10259 10053 9861 9684 9521 9372 9237 9116 9007 8911 8826 8754 8694 8648 8615 8597 8592 8600 8619 8647 8682 8723 8766 8810 8851 8887 8917 8937 8946 8944 8930
$$ packed form
1370A69JJJ%%%%J%%J%%j%J%JJ%%J%JKJJJJJJJJJJJJ%JJ%%%%J%J%J%JJ%JJKKJKJJKKKJJKLK
1363B25KKKJKJJJKLJKJ%JJKJKJJJKKKKJKKKLLLLLLLMNMMMLMLMLMLMLMLMLMMMNONNPOPOQQJ0
1356D43J0J0J1J2J2J4J4J5J5J6J8K0K0K1K3K4K7K9L3L4L6M1M5N0N4O0O6P3P9Q7R5J04J11J18
1352A840J24J29J34J35J36J35J35J35J35J36J39J42J44J46J47J47J46J41J34J26J17J06R5
1350D904Q4P9P4P6Q1R0J05J22J41J62J81K00K14K27K37K45K52K58K63K68K72K75K79K81K82
1347I652K79K74K67K56K41K23K00J75J46J15Q1N0J7j4m0o3p9q9r2q9q2o8n5l9k3qOJ6K7L6
1344A1320M4N2O2P1Q0Q8R6J02J04J01R4Q4O9N2L1Rj7m1o9r5j24j49j73j94k10k24k29k30k27
1341A0477k18k06j92j77j63j49j35j21j09r6q5p2o0m6l3j8nQJ9K8L5M1M3M4M1L6L0K0Rkj4
$$ plain form
1338 8930 8907 8875 8838 8796 8754 8713 8676 8646 8625 8616 8623 8644 8681 8734 8802 8884 8979 9085 9201 9328 9466 9615 9778 9954 10145 10349 10566 10793 11023
1335 11023 11254 11479 11696 11898 12081 12244 12384 12499 12589 12655 12695 12711 12703 12673 12622 12555 12475 12387 12296 12205 12120 12042 11973 11914 11865 11824 11791 11765 11747 11739 11740
1331 11740 11753 11781 11824 11882 11954 12039 12132 12230 12325 12412 12484 12537 12565 12566 12536 12475 12383 12260 12108 11928 11722 11494 11248 10987 10713 10430 10141 9850 9559
1328 9559 9271 8986 8705 8429 8158 7893 7634 7384 7145 6921 6711 6520 6348 6196 6064 5949 5849 5761 5679 5599 5518 5431 5336 5232 5119
1326 5119 4995 4864 4726 4582 4433 4283 4131 3978 3826 3675 3524 3373 3221 3068 2913 2758 2604 2452 2302 2157 2020 1890 1770
1323 1770 1660 1558 1466 1381 1304 1234 1171 1113 1060 1011 966 925 886 850 817 787 758 731 706 683 660 640 621 603 585 569 554 540 525 512 499 486 474
1320 474 462 452 441 430 420 411 401 392 383 374 366 359 351 345 339 333 327 322 317 312 307 302 298 293 289 284 281 277 274 270 268 265 262 259 256 254 250 246 243 241 239 237 233 230 228 226 223 220 217 214 211 209 206 204 201 200 198 196 194 193 192 191 190
1313 190 188 187 186 185 184 183 183 182 181 181 181 180 179 177 176 176 175 174 172 171 171 171 170 169 168 167 166 164 161 160 159 157 156 155 155 153 151 151 151 151 150 150 150 149 149 148 147 147 147 147 146 146 146 145 145 144 143 143 142 141 141 140 139 138 137 137 136 135 135
$$ packed form
1338H930k3l2l7m2m2m1l7l0k1rPK1L7N3O8Q2R5J06J16J27J38J49J63J76J91K04K17K27K30
1335A1023K31K25K17K02J83J63J40J15R0O6M0J6ql0n1o7q0q8r1r1q5p8o9n9m9m1l3k6j8qJ
1331A1740J3K8M3N8P2Q5R3R8R5Q7P2N3K8Jl0o1r2j23j52j80k06k28k46k61k74k83k89k91k91
1328I559k88k85k81k76k71k65k59k50k39k24k10j91j72j52j32j15j00q8q2q0q1q7r5j04j13
1326E119j24j31j38j44j49j50j52j53j52j51j51j51j52j53j55j55j54j52j50j45j37j30j20
1323A770j10j02r2q5p7p0o3n8n3m9m5m1l9l6l3l0k9k7k5k3k3k0j9j8j8j6j5j4j5j3j3j3j2
1320D74j2j0j1j1j0rj0rrrqpqoooonnnnnmnmnlmlmkllllkmmlkkkmlkklllllklkljkkkjjjj
1313A90kjjjjj%jj%%jjkj%jjkj%%jjjjjkljjkjj%kk%%%j%%j%jj%%%j%%j%jj%jj%jjjj%jj%
$$ plain form
1306 135 134 134 133 133 132 132 131 131 131 130 130 130 130 129 129 129 129 129 129 129 129 129 128 128 128 127 127 127 127 127 127 127 127 126 126 125 125 125 125 125 125 126 126 127 127 128 129 130 130 129 130 130 130 128 128 130 131 131 130 130 130 130 130 130 131 131 131 131 131
1298 131 131 131 131 131 131 131 132 132 132 132 132 132 132 133 132 132 132 133 133 133 133 133 133 133 133 134 133 133 133 133 133 133 133 133 132 132 133 133 133 133 133 133 133 132 131 131 131 132 133 134 134 134 134 133 133 133 133 133 134 134 134 135 136 137 137 137 137 137 137
1291 137 137 137 137 137 137 137 137 137 137 138 138 138 138 139 140 140 140 140 140 141 142 143 143 143 143 144 144 145 145 146 147 148 149 149 150 150 151 152 153 154 156 156 157 157 158 159 160 161 162 163 163 164 164 165 166 166 167 168 170 171 172 173 174 176 178 179 181 182 184
1284 184 185 186 186 186 187 188 189 190 191 193 195 196 198 200 202 203 204 204 205 206 205 205 205 205 206 206 207 208 209 210 212 213 214 214 214 215 215 215 215 215 215 216 216 217 218 219 219 220 221 222 223 223 224 225 227 228 229 229 230 231 232 234 235 236 238 239 239 239 240
1276 240 240 240 241 241 241 242 243 243 243 244 244 245 245 244 244 244 244 244 244 243 243 243 243 243 243 243 244 246 246 246 246 248 249 251 252 253 254 255 256 258 259 261 262 265 267 269 270 271 272 273 275 278 280 282 284 286 288 291 294 297 300 303 306 309 312 314 317 320 323
1269 323 326 329 333 336 339 343 346 349 352 357 361 366 370 373 376 379 383 387 391 395 399 403 407 412 417 422 427 432 436 442 447 453 458 464 469 474 478 484 489 494 498 504 510 516 522 528 535 541 549 556 564 572 579 587 595 602 610 618 626 636 645 654 662 671 681 692
1262 692 703 715 726 737 748 758 769 780 790 800 811 822 833 845 857 869 883 896 910 923 937 951 965 979 993 1008 1022 1037 1051 1065 1080 1095 1110 1126 1141
1258 1141 1156 1173 1189 1205 1221 1237 1253 1268 1282 1294 1306 1318 1329 1339 1349 1357 1366 1373 1381 1387 1393 1399 1404 1407 1411 1413 1414 1414 1412 1409 1405 1401 1396 1390 1384 1377 1369 1361 1352 1343 1334 1325 1315 1304 1293 1282 1270 1257
$$ packed form
1306A35j%j%j%j%%j%%%j%%%%%%%%j%%j%%%%%%%j%j%%%%%J%J%JJJ%jJ%%k%KJ%j%%%%%J%%%%
1298A31%%%%%%J%%%%%%Jj%%J%%%%%%%Jj%%%%%%%j%J%%%%%%jj%%JJJ%%%j%%%%J%%JJJ%%%%%
1291A37%%%%%%%%%J%%%JJ%%%%JJJ%%%J%J%JJJJ%J%JJJJK%J%JJJJJJ%J%JJ%JJKJJJJKKJKJK
1284A84JJ%%JJJJJKKJKKKJJ%JJj%%%J%JJJJKJJ%%J%%%%%J%JJJ%JJJJ%JJKJJ%JJJKJJKJ%%J
1276B40%%J%%JJ%%J%J%j%%%%%j%%%%%%JK%%%KJKJJJJJKJKJLKKJJJJKLKKKKKLLLLLLLLKLLL
1269C23LLMLLMLLLNMNMLLLMMMMMMMNNNNNMONONONNMONNMOOOOOPOQPQQPQQPQQQJ0RRQRJ0J1
1262F92J1J2J1J1J1J0J1J1J0J0J1J1J1J2J2J2J4J3J4J3J4J4J4J4J4J5J4J5J4J4J5J5J5J6J5
1258A141J5J7J6J6J6J6J6J5J4J2J2J2J1J0J0QRPQOOONLMKJ%klmmnoopqqrrrrj0j1j1j1j2j3
$$ plain form
1253 1257 1244 1230 1215 1200 1185 1171 1156 1141 1126 1112 1098 1083 1069 1054 1039 1024 1009 993 977 962 946 930 915 901 886 872 859 847 835 823 811 799 788 776
1250 776 764 753 742 732 722 713 704 696 688 682 675 668 661 655 650 645 639 634 628 622 616 610 604 599 593 588 583 577 572 568 564 560 556 552 547 542 538 533 528 523 519 515 512 509 506 504 504 504 504 505 506 508 508 509 510 512 514 515 516 517 517 518 519 520
1243 520 521 522 522 522 522 521 520 518 515 512 509 505 501 496 492 488 485 482 480 478 478 478 477 478 478 479 480 482 484 486 488 490 491 493 495 496 497 498 499 499 498 497 496 495 494 492 489 485 482 477 473 468 463 458 454 449 443 440 437 434 431 428 426 424 422 420 418 417 416
1236 416 416 415 415 415 414 414 413 412 411 411 410 409 408 407 405 403 402 400 397 394 392 389 386 382 379 377 375 373 371 368 366 364 362 361 359 357 356 354 354 353 353 352 353 353 354 354 355 356 358 360 362 364 367 369 370 372 374 377 378 380 381 382 384 385 386 387 387 387 387
1228 387 388 387 387 386 386 385 385 384 384 384 384 384 384 386 387 388 389 391 393 396 399 402 405 408 412 415 418 420 423 426 427 429 429 429 430 430 429 428 427 425 423 420 417 415 412 409 407 403 400 397 394 392 390 389 388 386 385 385 384 383 382 382 381 380 379 378 377 375 374
1221 374 371 369 368 365 362 359 356 353 350 346 343 340 337 333 329 326 323 320 317 314 312 309 306 303 302 299 297 295 293 290 287 284 282 279 276 274 271 268 267 265 263 260 259 256 253 251 250 249 249 249 249 248 248 248 248 248 248 249 249 249 249 249 249 249 249 248 247 247 246
1214 246 245 245 243 241 240 240 239 239 238 238 237 238 238 239 240 241 243 245 247 249 250 252 255 257 259 262 264 266 268 271 273 275 277 279 280 282 284 286 288 289 291 293 294 295 296 297 298 299 301 304 307 310 313 317 322 327 332 337 343 347 353 359 366 373 380 387 394 402 409
1206 409 418 426 434 443 454 465 476 489 503 517 533 551 570 590 612 637 664 693 726 763 805 852 904 963 1031 1106 1191 1283 1382 1488 1600 1716 1833 1950
$$ packed form
1253A257j3j4j5j5j5j4j5j5j5j4j4j5j4j5j5j5j5j6j6j5j6j6j5j4j5j4j3j2j2j2j2j2j1j2
1250G76j2j1j1j0j0rrqqoppponnonooooononnonmmmmmnnmnnnmmlllk%%%JJK%JJKKJJJ%JJJ
1243E20JJ%%%jjklllmmnmmllkk%%jJ%JJKKKKKJKKJJJJ%jjjjjklmlnmnnnmnolllllkkkkkjj
1236D16%j%%j%jjj%jjjjkkjkllkllmlkkkklkkkjkkjk%j%jJ%J%JJKKKKLKJKKLJKJJKJJJ%%%
1228C87Jj%j%j%j%%%%%KJJJKKLLLLLMLLKLLJK%%J%jjjkkllkllkmlllkkjjkj%jjj%jjjjjkj
1221C74lkjllllllmlllmmlllllkllljlkkklllkllklljkkljllkjj%%%j%%%%%J%%%%%%%jj%j
1214B46j%kkj%j%j%jJ%JJJKKKKJKLKKLKKKLKKKKJKKKKJKKJJJJJJKLLLLMNNNNOMOOPPPPPQP
1206D09RQQRJ1J1J1J3J4J4J6J8J9K0K2K5K7K9L3L7M2M7N2N9O8P5Q5R2R9J06J12J16J17J17
$$ plain form
1203 1950 2062 2168 2266 2356 2435 2503 2563 2615 2662 2705 2746 2787 2829 2871 2913 2953 2991 3025 3058 3091 3126 3168 3219 3286 3374 3488 3633 3811 4024 4273 4556
1199 4556 4870 5209 5568 5941 6318 6691 7051 7391 7705 7986 8231 8436 8602 8730 8820 8877 8904 8905 8882 8836 8770 8683 8577 8455 8320 8176
1197 8176 8031 7892 7769 7672 7611 7595 7632 7728 7886 8107 8388 8725 9110 9532 9980 10441 10900 11345 11763 12142 12472 12745 12956 13102 13184
1194 13184 13205 13168 13079 12945 12772 12565 12331 12070 11785 11478 11153 10812 10462 10110 9767 9440 9141 8879 8666 8508 8408 8369 8389 8464 8588
1191 8588 8751 8943 9152 9367 9577 9773 9947 10094 10210 10295 10348 10372 10370 10344 10298 10236 10160 10070 9966 9845 9707 9549 9371 9173 8957 8728
1189 8728 8491 8252 8020 7802 7603 7428 7280 7162 7072 7009 6968 6944 6933 6931 6935 6943 6955 6974 7003 7046 7109 7195 7308 7450 7622 7821 8044 8285 8538
1186 8538 8793 9045 9285 9511 9718 9905 10074 10225 10362 10487 10600 10700 10786 10852 10896 10912 10898 10851 10769 10653 10504 10329 10134 9927 9719
1183 9719 9521 9345 9203 9107 9065 9083 9166 9312 9519 9780 10084 10426 10792 11173 11557 11937 12308 12666 13008 13330 13630 13904 14146 14351
$$ packed form
1203A950J12J06R8R0P9O8O0N2M7M3M1M1M2M2M2M0L8L4L3L3L5M2N1O7Q8J14J45J78K13K49K83
1199D556L14L39L59L73L77L73L60L40L14K81K45K05J66J28R0N7K7Jk3m6o6q7j06j22j35j44
1197H176j45j39j23r7o1j6L7R6J58K21K81L37L85M22M48M61M59M45M18L79L30K73K11J46Q2
1194A3184K1l7q9j34j73k07k34k61k85l07l25l41l50l52l43l27k99k62k13j58j00l9K0P5J24
1191H588J63J92K09K15K10J96J74J47J16Q5N3K4kk6m6o2p6r0j04j21j38j58j78j98k16k29
1189H728k37k39k32k18j99j75j48j18r0o3m1k4j1kMQJ2J9K9M3O3Q6J13J42J72J99K23K41K53
1186H538K55K52K40K26K07J87J69J51J37J25J13J00Q6O6M4J6j4m7q2j16j49j75j95k07k08
1183I719j98j76j42r6m2J8Q3J46K07K61L04L42L66L81L84L80L71L58L42L22L00K74K42K05
$$ plain form
1180 14351 14508 14612 14653 14626 14527 14353 14107 13794 13422 13000 12540 12056 11561 11073 10605 10170 9782 9449 9179 8976 8841 8772 8764 8809 8898
1178 8898 9021 9167 9325 9486 9644 9793 9926 10043 10141 10218 10271 10300 10300 10268 10200 10091 9938 9739 9495 9207 8878 8512 8116 7700 7274 6846
1175 6846 6428 6027 5653 5312 5006 4739 4513 4325 4174 4054 3962 3892 3837 3792 3753 3715 3676 3634 3589 3541 3491 3440 3388 3336 3282 3224 3161 3091 3012
1172 3012 2923 2822 2711 2590 2462 2328 2190 2051 1914 1782 1656 1538 1429 1329 1238 1156 1082 1015 957 904 858 816 778 742 710 680 652 627
1169 627 605 583 562 543 526 510 495 482 469 458 447 438 429 419 410 401 392 384 377 370 362 355 348 341 334 327 321 314 308 301 294 287 280 275 270 264 259 254 249 246 242 239 236 233 229 227 225 223 220 219 218 217 216 215 213 213 213
1163 213 213 213 212 212 211 210 208 206 204 202 201 199 197 195 193 192 189 187 185 183 182 181 180 179 179 179 179 178 179 180 181 182 184 185 187 189 191 193 195 197 200 202 204 207 209 211 212 213 215 215 215 215 214 212 210 208 207 205 203 202 200 198 197 196 195 195 194 194 194
1156 194 194 195 197 198 200 202 204 207 209 211 214 216 219 222 225 228 232 236 241 245 249 252 255 258 259 262 264 265 265 265 266 265 265 265 264 265 265 265 265 266 266 267 269 271 274 277 280 284 288 291 295 299 304 308 313 316 320 324 328 331 334 336 338 339 341 342 344 345 346
1148 346 347 348 349 350 351 352 353 354 355 356 358 360 362 365 368 371 375 379 385 390 396 401 408 415 422 430 437 444 450 457 462 466 469 471 472 472 471 469 467 464 461 458 455 451 449 446 443 441 439 438 438 438 438 439 440 441 443 444 446 448 449 453 456 459 463 466 470 473 477
$$ packed form
1180A4351J57J04M1k7r9j74k46l13l72m22m60m84m95m88m68m35l88l33k70k03j35o9qM5Q9
1178H898J23J46J58J61J58J49J33J17R8P7N3K9%l2o8j09j53j99k44k88l29l66l96m16m26m28
1175F846m18m01l74l41l06k67k26j88j51j20r2p0n5m5l9l8l9m2m5m8n0n1n2n2n4n8o3p0p9
1172C012q9j01j11j21j28j34j38j39j37j32j26j18j09j00r1q2p4o7n8n3m6m2l8l6l2l0k8k5
1169F27k2k2k1j9j7j6j5j3j3j1j1rrj0rrrqppqpppppopoppppnnonnnlmlllmkkkljjjjjk%%
1163B13%%j%jjkkkkjkkkkjlkkkjjjj%%%jJJJJKJKKKKKKLKKLKKJJK%%%jkkkjkkjkkjjj%j%%
1156A94%JKJKKKLKKLKLLLLMMNMMLLLJLKJ%%Jj%%jJ%%%J%JKKLLLMMLMMNMNLMMMLLKKJKJKJJ
1148C46JJJJJJJJJJKKKLLLMMONONPPPQPPOPNMLKJ%jkkllllmkllkkj%%%JJJKJKKJMLLMLMLM
$$ plain form
1141 477 480 483 487 490 494 497 501 504 506 509 511 512 513 516 518 521 525 529 534 540 547 555 562 572 584 598 613 630 650 674 700 730 763 801 844 891 940 992 1045 1098 1151 1203 1251 1298 1342 1384
1136 1384 1426 1470 1517 1568 1621 1676 1730 1779 1822 1857 1882 1898 1907 1914 1921 1932 1950 1977 2015 2064 2125 2197 2280 2374 2478 2593 2717 2849 2987 3125 3263 3397
1133 3397 3525 3648 3769 3889 4014 4146 4287 4434 4583 4726 4855 4959 5032 5070 5072 5044 4991 4923 4851 4784 4727 4684 4656 4642 4641 4651 4670 4699 4738
1130 4738 4790 4854 4930 5017 5111 5208 5307 5406 5504 5605 5714 5833 5965 6111 6267 6426 6576 6705 6800 6851 6852 6802 6709 6582 6434 6277 6122 5975
1127 5975 5841 5719 5607 5501 5395 5288 5180 5074 4972 4877 4793 4722 4664 4621 4590 4572 4565 4572 4595 4636 4694 4771 4864 4966 5070 5165 5243 5297 5321 5315
1123 5315 5278 5217 5140 5055 4969 4889 4818 4754 4696 4639 4578 4510 4430 4340 4239 4130 4018 3907 3803 3711 3634 3575 3535 3515 3517 3540 3583 3646 3729 3829 3943
1120 3943 4068 4199 4331 4459 4578 4686 4784 4874 4959 5046 5139 5241 5352 5471 5591 5702 5794 5858 5886 5875 5826 5747 5645 5530 5414 5306 5214
1117 5214 5140 5084 5048 5028 5021 5027 5045 5077 5124 5186 5263 5352 5449 5551 5653 5755 5857 5962 6073 6196 6336 6490 6655 6824 6984 7122 7222 7274
$$ packed form
1141D77LLMLMLMLKLKJJLKLMMNOPQPJ0J2J4J5J7K0K4K6L0L3L8M3M7M9N2N3N3N3N2M8M7M4M2
1136A384M2M4M7N1N3N5N4M9M3L5K5J6RPPJ1J8K7L8M9O1P2Q3R4J04J15J24J32J38J38J38J34
1133C397J28J23J21J20J25J32J41J47J49J43J29J04P3L8Kk8n3o8p2o7n7m3k8j4jJ0J9K9L9
1130D738N2O4P6Q7R4R7R9R9R8J01J09J19J32J46J56J59J50J29R5N1Jn0r3j27j48j57j55j47
1127E975j34j22j12j06j06j07j08j06j02r5q4p1n8m3l1j8pPK3M1N8P7R3J02J04R5P8N4K4o
1123E315l7o1p7q5q6q0p1o4n8n7o1o8q0r0j01j09j12j11j04r2p7n9m0k0KK3M3O3Q3J00J14
1120C943J25J31J32J28J19J08R8R0Q5Q7R3J02J11J19J20J11R2O4K8j1m9p9j02j15j16j08r2
1117E214p4n6l6k0pOJ8L2M7O2P7Q9R7J02J02J02J02J05J11J23J40J54J65J69J60J38J00N2
$$ plain form
1114 7274 7271 7214 7109 6967 6801 6624 6448 6284 6132 5993 5865 5743 5621 5498 5373 5249 5129 5017 4916 4828 4755 4695 4647 4609 4582 4568
1112 4568 4567 4582 4614 4660 4720 4787 4853 4907 4941 4946 4917 4854 4758 4638 4501 4357 4212 4072 3937 3809 3684 3560 3433 3300 3161 3018 2873 2730
1109 2730 2591 2460 2338 2227 2127 2038 1959 1891 1833 1785 1746 1718 1697 1683 1672 1661 1649 1631 1605 1572 1531 1485 1435 1384 1333 1284 1236 1191 1148 1105 1061 1015
1105 1015 967 917 865 812 761 711 665 621 582 545 512 483 456 432 411 391 374 359 345 333 322 312 303 293 284 276 269 263 257 251 247 242 237 231 227 222 218 214 211 208 204 201 198 195 191
1100 191 188 185 181 179 177 174 171 168 165 162 160 158 155 153 152 150 148 145 143 141 139 137 135 135 134 134 133 133 133 133 133 132 132 132 132 131 130 129 128 128 127 125 124 123 122 121 121 120 118 117 116 115 114 113 112 111 109 108 107 107 107 107 107 107 106 106 106 106 106
1093 106 107 107 107 108 107 107 106 106 105 105 105 104 104 103 103 102 102 101 101 100 99 97 96 96 96 96 95 94 94 94 93 93 92 93 94 94 94 94 95 95 95 95 95 95 94 95 96 96 95 94 94 93 93 92 92 91 91 90 90 90 89 89 89 88 88 88 88 88 89
1086 89 89 89 89 89 88 88 88 88 88 89 89 89 89 89 89 89 89 89 90 90 89 90 90 89 89 89 90 89 89 89 88 88 89 88 88 88 88 89 89 89 89 89 89 88 88 88 89 89 89 89 89 89 89 89 89 89 88 88 87 87 87 86 85 84 84 84 85 84 84 84
1078 84 83 84 84 84 84 85 85 86 86 86 86 86 87 86 85 86 86 86 85 86 86 86 85 85 85 85 85 85 85 84 84 84 83 83 82 82 83 83 83 83 83 84 84 84 84 83 82 82 82 83 84 84 84 84 85 85 85 84 84 85 85 85 85 85 86 86 86 86 86 86
$$ packed form
1114G274ln7j05j42j66j77j76j64j52j39j28j22j22j23j25j24j20j12j01q8p3o0m8l8k7j4
1112D568jJ5L2M6O0O7O6N4L4Nk9o3r6j20j37j44j45j40j35j28j25j24j27j33j39j43j45j43
1109B730j39j31j22j11j00q9p9o8n8m8l9k8k1j4j1j1j2j8k6l3m1m6n0n1n1m9m8m5m3m3m4m6
1105A015m8n0n2n3n1n0m6m4l9l7l3k9k7k4k1k0j7j5j4j2j1j0rj0rqpooomnnomnmmllmlllm
1100A91llmkklllllkklkjkklkkkkk%j%j%%%%j%%%jjjj%jkjjjj%jkjjjjjjjkjj%%%%%j%%%%
1093A06J%%Jj%j%j%%j%j%j%j%jjkj%%%jj%%j%jJJ%%%J%%%%%jJJ%jj%j%j%j%j%%j%%j%%%%J
1086H9%%%%j%%%%J%%%%%%%%J%jJ%j%%Jj%%j%Jj%%%J%%%%%j%%J%%%%%%%%%j%j%%jjj%%Jj%%
1078H4jJ%%%J%J%%%%JjjJ%%jJ%%j%%%%%%j%%j%j%J%%%%J%%%jj%%JJ%%%J%%j%J%%%%J%%%%%
$$ plain form
1071 86 87 87 87 88 88 88 88 88 88 88 88 89 89 89 90 89 88 89 90 91 91 91 91 92 93 93 94 95 95 95 96 96 97 98 98 98 99 100 100 101 101 101 102 102 102 102 102 102 102 101 100 100 99 99 99 99 100 100 100 101 102 102 102 102 101 101 102 103 103 103
1064 103 103 103 104 104 105 105 106 106 107 107 107 106 105 105 105 104 103 102 101 100 100 99 98 98 98 97 95 94 94 94 93 93 93 92 92 92 91 92 92 92 92 93 93 93 94 94 95 94 94 94 94 94 94 93 93 93 93 93 93 92 91 90 89 88 87 87 86 85 85
1056 85 84 84 84 83 83 83 83 84 84 84 84 84 85 86 88 88 89 90 90 90 91 92 92 93 93 94 95 96 97 97 97 96 96 95 95 94 94 94 93 93 93 93 93 93 93 92 93 93 94 94 94 94 96 97 98 98 99 100 100 101 102 103 103 104 105 106 106 106 106 105
1049 105 103 102 102 101 100 99 98 98 98 97 95 94 94 93 94 93 92 92 93 93 92 92 92 91 91 91 92 93 94 94 94 95 95 95 94 94 93 92 91 90 89 88 88 87 86 86 86 85 84 83 83 83 82 81 80 79 78 77 76 75 75 75 76 77 77 77 78 78 78
1042 78 77 77 76 76 75 75 74 74 74 74 74 73 73 73 73 72 72 72 72 72 72 72 72 72 71 71 71 71 71 70 69 68 68 69 70 70 70 69 69 69 68 68 68 69 69 69 69 69 69 69 69 69 68 68 70 70 70 70 70 70 70 70 70 70 69 69 69 70 71 71
1034 71 70 70 70 70 71 71 71 70 70 70 70 70 70 69 69 71 72 72 71 70 70 69 69 69 69 69 69 69 70 70 70 70 71 71 70 70 70 70 70 70 70 70 70 70 69 69 69 69 69 70 70 69 69 70 70 70 70 70 70 70 71 71 70 70 70 70 71 71 71 72
1027 72 73 72 72 72 72 72 72 72 72 74 73 72 72 73 73 73 73 73 74 74 75 76 76 77 78 79 80 82 83 85 86 88 89 90 92 92 92 92 91 90 88 87 86 85 84 83 83 83 83 83 83 83 83 84 84 84 85 86 87 89 90 92 94 96 99 102 105 107 108 109
1019 109 110 110 109 108 106 104 102 99 97 95 93 91 89 88 87 86 85 84 84 85 86 86 86 87 87 88 89 90 91 93 94 95 96 96 96 97 97 96 94 93 92 92 92 91 90 89 88 87 87 86 86 86 86 87 86 86 86 86 86 87 87 87 88 90 91 91 93 96 98
$$ packed form
1071H6J%%J%%%%%%%J%%JjjJJJ%%%JJ%JJ%%J%JJ%%JJ%J%%J%%%%%%jj%j%%%J%%JJ%%%j%JJ%%
1064A03%%J%J%J%J%%jj%%jjjjj%jj%%jkj%%j%%j%%jJ%%%J%%J%Jj%%%%%j%%%%%jjjjjj%jj%
1056H5j%%j%%%J%%%%JJK%JJ%%JJ%J%JJJJ%%j%j%j%%j%%%%%%jJ%J%%%KJJ%JJ%JJJ%JJJ%%%j
1049A05kj%jjjj%%jkj%jJjj%J%j%%j%%JJJ%%J%%j%jjjjjj%jj%%jjj%%jjjjjjjj%%JJ%%J%%
1042G8j%j%j%j%%%%j%%%j%%%%%%%%j%%%%jjj%JJ%%j%%j%%J%%%%%%%%j%K%%%%%%%%%j%%JJ%
1034G1j%%%J%%j%%%%%j%KJ%jj%j%%%%%%J%%%J%j%%%%%%%%%j%%%%J%j%J%%%%%%J%j%%%J%%J
1027G2Jj%%%%%%%Kjj%J%%%%J%JJ%JJJJKJKJKJJK%%%jjkjjjjj%%%%%%%J%%JJJKJKKKLLLKJJ
1019A09J%jjkkklkkkkkjjjjj%JJ%%J%JJJJKJJJ%%J%jkjj%%jjjjj%j%%%Jj%%%%J%%JKJ%KLK
$$ plain form
1012 98 100 102 104 107 110 114 118 121 125 127 129 129 129 129 128 126 125 123 122 121 120 119 119 118 118 118 117 117 116 116 117 117 119 121 123 126 130 135 141 147 153 159 164 167 170 171 171 169 166 164 160 155 152 148 146 144 142 141 138 136 134 132 130 128 126 124 123 122 122 121
1005 121 122 122 124 126 129 131 132 134 134 135 134 133 131 129 128 126 125 124 123 121 120 119 118 117 116 115 114 113 112 110 109 108 107 106 106 105 105 105 105 105 106 106 107 108 110 112 114 116 118 120 122 124 126 129 130 132 133 134 135 135 136 137 138 139 139 140 141 142 142
997 142 142 141 140 138 136 135 135 134 134 135 136 138 140 143 147 150 154 158 162 165 166 167 167 167 167 167 167 167 168 170 172 174 175 175 176 175 174 173 171 169 167 164 162 163 163 164 166 168 171 176 180 185 191 196 202 208 216 225 234 244 253 263 273 283 293
990 293 301 308 312 314 313 310 304 297 288 277 265 253 242 231 220 211 202 194 186 179 173 168 163 159 155 153 150 148 146 144 143 142 141 140 140 139 138 137 137 138 139 141 142 143 145 147 149 150 152 153 153 154 153 152 149 145 142 138 134 132 130 127 126 125
984 125 124 124 124 124 125 126 128 130 132 134 134 135 137 139 141 143 144 145 146 147 147 147 147 147 148 149 150 153 156 159 161 163 163 162 159 155 151 146 143 141 139 139 138 138 138 138 140 141 143 144 146 147 149 151 153 156 159 162 166 169 172 175 177 178 177 176 173 170 168 165
976 165 164 164 164 166 168 169 169 168 167 165 164 163 163 162 162 162 162 162 163 163 164 164 166 167 169 171 174 177 182 188 194 202 210 218 227 233 236 236 233 227 220 212 204 199 194 190 187 184 183 182 182 182 182 181 181 181 182 183 183 184 186 188 190 192 195 198 201 204 205 207
969 207 208 210 213 216 221 226 231 237 243 248 251 253 254 254 253 253 253 254 257 260 264 268 273 278 284 291 299 308 318 328 339 352 366 382 401 420 443 469 498 530 565 602 643 687 737 793 857 930 1011
964 1011 1104 1208 1327 1458 1606 1769 1947 2136 2336 2538 2734 2913 3063 3173 3239 3260 3237 3177 3086 2974 2848 2716 2582 2454 2335
$$ packed form
1012I8KKKLLMMLMKK%%%jkjkjjjj%j%%j%j%J%KKKLMNOOOONLLJ%klkmnlmkkkjlkkkkkkkjj%j
1005A21J%KKLKJK%Jjjkkjkjjjkjjjjjjjjjkjjjj%j%%%%J%JJKKKKKKKKKLJKJJJ%JJJJ%JJJ%
997A42%jjkkj%j%JJKKLMLMMMLJJ%%%%%%JKKKJ%JjjjkkklkJ%JKKLNMNONOOQRRJ0RJ0J0J0J0
990B93QPMKjloprj1j2j2j1j1j1rrqqponnmmklkkkjjjj%jjj%JJKJJKKKJKJ%Jjjlmlmmkkljj
984A25j%%%JJKKKK%JKKKKJJJJ%%%%JJJLLLKK%jlmmnlkk%j%%%KJKJKJKKKLLLMLLLKJjjllkl
976A65j%%KKJ%jjkjj%j%%%%J%J%KJKKLLNOOQQQROL%lopqqnnmlljj%%%j%%JJ%JKKKKLLLLJK
969B07JKLLNNNOONLKJ%j%%JLLMMNNOPQRJ0J0J1J3J4J6J9J9K3K6K9L2L5L7M1M4N0N6O4P3Q1
964A011R3J04J19J31J48J63J78J89K00K02J96J79J50J10O6K1k3o0r1j12j26j32j34j28j19
$$ plain form
961 2335 2231 2147 2084 2046 2034 2051 2097 2172 2277 2410 2575 2770 2994 3244 3518 3810 4115 4423 4726 5009 5258 5456 5589 5647 5629 5542 5395
958 5395 5202 4973 4723 4462 4197 3933 3674 3425 3191 2975 2782 2613 2472 2361 2279 2227 2204 2207 2238 2292 2367 2458 2562 2671 2782 2888
955 2888 2984 3063 3121 3152 3154 3127 3073 2997 2905 2801 2693 2585 2480 2378 2280 2185 2094 2007 1926 1852 1787 1734 1693 1666 1654 1657 1676 1711 1763 1832 1920 2027 2156
952 2156 2307 2481 2681 2908 3165 3453 3776 4135 4527 4949 5394 5851 6308 6744 7140 7473 7729 7900 7989 8007 7968 7890 7788 7674 7562
949 7562 7461 7377 7315 7278 7267 7278 7309 7355 7416 7496 7604 7751 7945 8197 8515 8902 9357 9878 10454 11072 11716 12358 12970 13515 13956 14261
946 14261 14414 14417 14286 14050 13739 13385 13013 12642 12283 11942 11620 11319 11035 10762 10494 10222 9942 9654 9364 9082 8820 8589 8398 8255
944 8255 8161 8117 8119 8160 8230 8319 8413 8495 8548 8555 8505 8395 8230 8019 7776 7516 7251 6993 6748 6518 6303 6101 5909 5722 5537 5350 5156 4956
941 4956 4750 4542 4335 4135 3945 3771 3615 3481 3370 3286 3230 3202 3204 3237 3302 3399 3528 3688 3880 4102 4350 4622 4909 5207 5506 5797
$$ packed form
961B335j04q4o3l8j2J7M6P5J05J33J65J95K24K50K74K92L05L08L03K83K49J98J33N8j8q7j47
958E395j93k29k50k61k65k64k59k49k34k16j93j69j41j11q2n2k3LL1N4P5R1J04J09J11J06
955B888R6P9N8L1Kk7n4p6r2j04j08j08j05j02r8r5r1q7q1p4o5n3m1k7j2LJ9L5N2O9Q8J07J29
952B156J51J74K00K27K57K88L23L59L92M22M45M57M57M36L96L33K56J71Q9J8l9p8j02j14j12
949G562j01q4o2l7j1J1L1M6O1Q0J08J47J94K52L18L87M55N21N76O18O44O42O12N45M41L05
946A4261J53Lj31k36l11l54l72l71l59l41l22l01k84k73k68k72k80k88k90k82k62k31j91j43
944H255r4m4KM1P0Q9R4Q2N3Pn0j10j65k11k43k60k65k58k45k30k15k02j92j87j85j87j94k00
941D956k06k08k07k00j90j74j56j34j11q4n6k8KL3O5R7J29J60J92K22K48K72K87K98K99K91
$$ plain form
938 5797 6070 6320 6545 6745 6926 7095 7258 7422 7593 7774 7968 8176 8394 8616 8830 9022 9176 9281 9332 9334 9297 9237 9172 9120 9096 9115
935 9115 9186 9317 9510 9761 10067 10414 10787 11166 11528 11852 12131 12361 12552 12716 12866 13015 13172 13343 13530 13727 13923 14104 14248 14332
933 14332 14332 14228 14010 13677 13249 12748 12203 11641 11085 10557 10072 9643 9275 8969 8725 8537 8398 8295 8215 8143 8071 7994 7910 7825 7743 7670
930 7670 7612 7572 7548 7539 7537 7533 7515 7470 7385 7249 7056 6806 6504 6164 5799 5423 5048 4681 4330 4001 3694 3413 3158 2929 2725 2545 2388
927 2388 2254 2141 2048 1974 1917 1879 1857 1851 1863 1892 1938 2001 2081 2176 2286 2407 2538 2676 2821 2972 3128 3288 3451 3615 3772 3916 4038 4127
924 4127 4178 4186 4149 4073 3963 3828 3676 3516 3359 3210 3079 2971 2891 2843 2831 2857 2920 3020 3156 3327 3529 3760 4015 4287 4574 4871 5175
921 5175 5482 5786 6079 6350 6582 6757 6861 6881 6811 6656 6427 6139 5810 5458 5096 4738 4394 4070 3772 3505 3272 3073 2910 2782
919 2782 2689 2630 2603 2606 2637 2693 2770 2865 2975 3094 3218 3344 3466 3576 3664 3722 3741 3714 3640 3520 3361 3173 2967 2754 2541 2335 2141 1960
$$ packed form
938E797K73K50K25K00J81J69J63J64J71J81J94K08K18K22K14J92J54J05N1Kl7o0o5n2k4J9
935I115P1J31J93K51L06L47L73L79L62L24K79K30J91J64J50J49J57J71J87J97J96J81J44Q4
933A4332%j04k18l33m28n01n45n62n56n28m85m29l68l06k44j88j39j03q0p2p2p7q4q5q2p3
930G670n8m0k4rkmj8m5q5j36j93k50l02l40l65l76l75l67l51l29l07k81k55k29k04j80j57
927B388j34j13r3p4n7l8k2oJ2K9M6O3Q0R5J10J21J31J38J45J51J56J60J63J64J57J44J22Q9
924D127N1Ql7p6j10j35j52j60j57j49j31j08q0m8j2K6O3J00J36J71K02K31K55K72K87K97L04
921E175L07L04K93K71K32J75J04K0p0j55k29k88l29l52l62l58l44l24k98k67k33j99j63j28
919B782r3n9k7LL1N6P7R5J10J19J24J26J22J10Q8N8J9k7p4j20j59j88k06k13k13k06j94j81
$$ plain form
916 1960 1793 1639 1499 1371 1255 1149 1054 968 892 825 766 714 670 634 601 573 548 527 509 494 480 468 457 445 433 423 412 403 395 387 379 370 362 354 346 338
912 338 331 323 315 309 304 300 296 293 291 288 286 284 282 280 277 277 276 276 277 278 280 283 287 290 293 297 301 305 309 311 314 316 319 324 329 334 340 347 354 362 370 380 393 408 424 444 470 502 543 596 663 748 857 996 1171
906 1171 1388 1650 1963 2323 2724 3151 3581 3973 4268 4405 4355 4142 3815 3429 3028 2649 2309 2016 1772 1572 1409 1278 1172 1089
904 1089 1024 975 938 912 896 889 892 904 923 953 993 1049 1121 1215 1336 1492 1695 1956 2292 2714 3237 3864 4596 5422 6317 7238 8114 8828 9234
901 9234 9232 8839 8163 7334 6459 5620 4869 4229 3701 3276 2938 2677 2481 2342 2253 2211 2217 2275 2390 2572 2832 3184 3638 4203 4879 5659
898 5659 6525 7441 8351 9163 9760 10036 9959 9596 9075 8519 8021 7640 7402 7299 7295 7316 7261 7049 6663 6150 5574 4992 4446 3967 3568
895 3568 3249 3002 2820 2696 2625 2605 2635 2718 2860 3074 3376 3791 4346 5070 5989 7121 8471 10028 11754 13585 15407 17037
893 17037 18208 18658 18288 17213 15668 13893 12085 10386 8881 7601 6538 5668 4962 4392 3936 3573 3287 3067 2906 2802
$$ packed form
916A960j67j54j40j28j16j06r5q6p6o7n9n2m4l6l3k8k5k1j8j5j4j2j1j2j2j0j1rqqqrqqqq
912C38pqqonmmlklkkkkl%j%JJKLMLLMMMMKLKLNNNOPPQQJ0J3J5J6K0K6L2M1N3O7Q5J09J39J75
906A171K17K62L13L60M01M27M30L92K95J37n0k13l27l86m01l79l40k93k44k00j63j31j06q3
904A089o5m9l7k6j6pLJ2J9L0M0N6P2R4J21J56K03K61L36M22N23O27P32Q26Q95R21Q76P14M06
901I234kl93o76q29q75q39p51o40n28m25l38k61j96j39q9m2ON8J15J82K60L52M54N65O76P80
898E659Q66R16R10Q12N97K76p7l63n21n56m98l81k38j03mK1n5k12l86n13n76n82n46m79l99
895C568l19k47j82j24p1k0L0Q3J42K14L02M15N55P24R19J132J350J557J726J831J822J630
893A7037J171M50l70j075j545j775j808j699j505j280j063q70p06n70m56l63k86k20j61j04
$$ plain form
891 2802 2754 2767 2842 2987 3206 3502 3874 4319 4825 5377 5942 6463 6869 7117 7232 7294 7383 7563 7875 8334 8923 9593 10252 10768 10994
888 10994 10828 10275 9440 8455 7435 6465 5600 4862 4253 3761 3369 3063 2830 2657 2539 2471 2453 2488 2586 2756 3013 3368 3836 4423
886 4423 5127 5941 6842 7789 8717 9516 10033 10136 9795 9106 8208 7229 6266 5386 4622 3982 3454 3022 2670 2383 2148 1953 1790
883 1790 1655 1542 1447 1369 1305 1255 1219 1193 1180 1177 1186 1207 1242 1295 1372 1478 1621 1809 2050 2347 2702 3112 3567 4050 4531 4961 5264 5365
880 5365 5236 4915 4473 3975 3476 3012 2605 2258 1970 1732 1537 1376 1242 1129 1031 945 869 801 741 689 645 607 574 546 522 501 481 464
877 464 449 435 423 412 403 395 389 385 382 380 379 379 380 382 384 387 390 393 395 397 400 403 408 413 420 429 439 450 461 472 482 491 498 501 501 498 496 494 492 491 489 487 486 486 485 486 487 489 492 496 503 511 521 532 543 555 566
871 566 578 588 598 606 611 613 612 611 607 604 602 599 596 592 587 581 574 566 559 550 542 535 527 520 513 508 503 499 496 492 488 485 481 478 474 470 467 464 461 457 453 448 444 438 430 421 411 401 391 380 370 360 351 343 337 331 326 322 318 315 312
865 312 309 306 304 302 300 299 300 301 303 305 307 309 312 314 318 321 325 328 332 336 339 342 344 347 349 353 357 362 368 372 377 382 386 390 393 397 400 402 404 405 407 409 410 412 413 414 414 415 416 417 418 419 421 422 423 425 427 429 431 433 435 437 439 440 440 439 438 436 433 429
$$ packed form
891B802m8J3P5J45K19K96L72M45N06N52N65N21M06K48J15O2Q9J80L12M59N89O70O59N16K26
888A0994j66n53q35r85j020r70q65p38o09m92l92l06k33j73j18o8j8L5R8J70K57L55M68N87
886D423P04Q14R01R47R28P99N17J03l41o89q98r79r63q80p64o40n28m32l52k87k35j95j63
883A790j35j13r5p8o4n0l6k6j3lRK1L5N3P7J06J43J88K41K97L55M10M55M83M81M30L03J01
880E365j29l21m42m98m99m64m07l47k88k38j95j61j34j13r8q6p6o8o0n2m4l8l3k8k4k1k0j7
877D64j5j4j2j1rqomlkj%JKKLLLKKLLNNPRJ0J1J1J1J0RPL%lkkkjkkj%jJJKLMPQJ0J1J1J2J1
871E66J2J0J0QNKjjmlkllmnopqprqpqppnnmlmmlmlmmlllmmnmoqrj0j0j0j1j0j0rqoonmmll
865C12llkkkjJJKKKKLKMLMLMMLLKLKMMNOMNNMMLMLKKJKKJKJJ%JJJJJKJJKKKKKKKKJ%jjklm
$$ plain form
857 429 425 421 417 413 409 406 403 399 397 394 391 389 387 385 383 381 378 376 373 370 369 367 366 365 364 362 360 358 356 354 352 351 350 349 348 346 345 344 343 342 340 338 336 334 333 332 332 331 331 331 332 334 333 333 333 333 333 333 332 330 330 329 328 328 328 328 328 330 331 332
850 332 333 335 335 334 334 334 335 336 337 338 338 339 339 339 338 336 334 333 332 331 329 328 327 326 324 322 320 319 317 316 314 314 314 315 315 317 318 319 320 321 322 322 321 321 318 315 311 307 303 301 299 298 297 297 297 298 299 301 302 303 306 308 310 313 314 316 317 319 321 322
842 322 324 326 329 331 334 338 340 342 345 348 351 354 357 361 364 366 367 368 367 365 363 360 358 356 353 352 351 350 348 346 345 344 343 342 342 342 341 341 340 340 339 338 339 340 340 340 339 339 338 337 334 331 329 326 324 322 319 317 314 312 310 308 306 304 302 300 299 298 298 296
835 296 295 293 291 290 288 287 287 286 287 288 288 288 290 291 292 294 295 297 299 301 303 304 306 306 306 307 309 311 313 316 320 323 327 331 335 339 344 349 354 359 365 371 377 384 390 397 403 409 417 426 434 443 453 463 473 484 495 508 520 533 546
829 546 560 575 592 610 629 651 676 702 730 762 798 839 886 938 997 1062 1133 1212 1297 1388 1484 1583 1682 1778 1867 1947 2014 2064 2096 2108 2102 2079 2042 1994 1939 1881
825 1881 1823 1768 1719 1678 1645 1621 1610 1610 1622 1648 1687 1740 1806 1887 1983 2094 2220 2360 2512 2674 2840 3005 3164 3309 3431 3526 3586 3607 3589 3534
822 3534 3446 3330 3193 3042 2884 2726 2572 2427 2294 2174 2068 1976 1900 1838 1790 1756 1735 1727 1731 1747 1775 1816 1866 1926 1992 2061 2130 2195 2253 2300 2333
818 2333 2350 2349 2329 2291 2239 2176 2104 2026 1947 1870 1796 1729 1669 1617 1575 1541 1515 1498 1489 1488 1495 1510 1533 1565 1605 1652 1708 1771 1843 1924 2015 2118 2235 2363 2504
$$ packed form
857D29mmmmmllmkllkkkkklklljkjjjkkkkkkjjjjkjjjjkkkkjj%j%%JKj%%%%%jk%jj%%%%KJJ
850C32JK%j%%JJJJ%J%%jkkjjjkjjjkkkjkjk%%J%KJJJJJ%j%llmmmkkjj%%JJKJJLKKLJKJKKJ
842C22KKLKLMKKLLLLLMLKJJjkklkkljjjkkjjjj%%j%j%jjJJ%%j%jjllklkklklkkkkkkkjj%k
835B96jkkjkj%jJJ%%KJJKJKKKKJK%%JKKKLMLMMMMNNNNOOOPOPOOQRQRJ0J0J0J1J1J3J2J3J3
829E46J4J5J7J8J9K2K5K6K8L2L6M1M7N2N9O5P1P9Q5R1R6R9R9R6Q9Q0O7N0L2J2ok3l7m8n5n8
825A881n8n5m9m1l3k4j1%J2K6L9N3O6Q1R6J11J26J40J52J62J66J65J59J45J22R5O0K1j8n5
822C534q8j16j37j51j58j58j54j45j33j20j06r2p6o2m8l4k1qMJ6K8M1N0O0O6O9O9O5N8M7L3
818B333J7jk0l8n2o3p2p8p9p7p4o7o0n2m2l4k6j7rjPJ5K3L2M0M7N6O3P2Q1R1J03J17J28J41
$$ plain form
815 2504 2655 2816 2984 3156 3329 3499 3661 3814 3953 4077 4185 4274 4344 4397 4433 4454 4461 4454 4436 4406 4368 4324 4276 4228 4185 4151 4132 4132 4155 4204 4283
811 4283 4393 4535 4709 4913 5145 5400 5674 5962 6256 6547 6826 7082 7306 7489 7627 7718 7760 7759 7718 7642 7535 7400 7239 7056 6853
809 6853 6634 6403 6165 5926 5692 5470 5265 5081 4923 4792 4690 4616 4570 4553 4562 4594 4648 4720 4803 4894 4988 5079 5162 5235 5296 5344 5378 5400 5414 5420
805 5420 5420 5415 5406 5394 5380 5368 5360 5358 5366 5386 5422 5476 5550 5642 5753 5881 6022 6172 6326 6480 6626 6761 6879 6977 7052 7104 7135 7148 7148 7138 7123 7108 7096 7087
802 7087 7088 7097 7117 7150 7195 7255 7328 7415 7513 7621 7736 7854 7971 8084 8188 8282 8365 8436 8493 8538 8570 8591 8601 8601 8593 8579 8562 8545 8530 8521 8519 8526 8542 8566 8597
798 8597 8635 8677 8720 8765 8809 8852 8893 8929 8954 8966 8957 8921 8853 8749 8606 8425 8210 7967 7705 7434 7164 6903 6660 6441 6250 6090 5965 5875
795 5875 5819 5797 5807 5848 5918 6016 6140 6289 6459 6648 6854 7076 7315 7569 7835 8113 8401 8696 8994 9292 9586 9873 10152 10419 10674
793 10674 10914 11142 11356 11556 11744 11919 12083 12237 12382 12517 12643 12759 12865 12959 13041 13109 13159 13192 13206 13201 13175 13129 13066 12990 12905 12816 12729 12649
$$ packed form
815B504J51J61J68J72J73J70J62J53J39J24J08Q9P0N3L6K1Ppj8l0l8m4m8m8m3l4j9%K3M9P9
811D283J10J42J74K04K32K55K74K88K94K91K79K56K24J83J38R1M2jm1p6j07j35j61j83k03
809F853k19k31k38k39k34k22k05j84j58j31j02p4m6j7RL2N4P2Q3R1R4R1Q3P3O1M8L4K2J4O
805E420%nrj2j4j2qkQK0L6N4P4R2J11J28J41J50J54J54J46J35J18R8P5N2L1J3%j0j5j5j2r
802G087JRK0L3M5O0P3Q7R8J08J15J18J17J13J04R4Q3P1N7M5L2K1J0%qj4j7j7j5rkPJ6K4L1
798H597L8M2M3M5M4M3M1L6K5J2rl6o8j04j43j81k15k43k62k71k70k61k43k19j91j60j25r0
795E875n6k2J0M1P0R8J24J49J70J89K06K22K39K54K66K78K88K95K98K98K94K87K79K67K55
793A0674K40K28K14K00J88J75J64J54J45J35J26J16J06R4Q2O8N0L3J4nk6m6o3p6q5q9q7q0
$$ plain form
790 12649 12582 12532 12502 12493 12507 12543 12597 12666 12746 12832 12918 13001 13076 13140 13192 13229 13248 13247 13223 13175 13099 12994 12859 12692 12494 12267 12011 11729 11425 11105 10772
786 10772 10431 10087 9747 9414 9094 8790 8505 8240 7996 7770 7563 7371 7189 7013 6839 6664 6485 6302 6116 5928 5739 5555 5378
784 5378 5210 5057 4920 4801 4700 4619 4559 4519 4500 4503 4526 4571 4639 4729 4843 4982 5145 5333 5547 5786 6050 6336 6643 6968 7307 7657 8015
781 8015 8374 8734 9089 9436 9772 10094 10400 10686 10949 11185 11391 11564 11703 11805 11870 11900 11895 11860 11800 11717 11619 11511 11398 11283 11171 11065
778 11065 10967 10883 10814 10761 10728 10714 10721 10748 10795 10857 10933 11019 11108 11198 11282 11357 11417 11459 11480 11478 11452 11400 11323 11221 11094 10943 10770 10574 10359 10125 9873
775 9873 9604 9318 9015 8698 8368 8029 7682 7332 6982 6636 6296 5966 5648 5344 5056 4784 4528 4289 4067 3861 3671 3496 3336
772 3336 3190 3057 2936 2825 2724 2632 2549 2474 2406 2345 2292 2244 2202 2166 2136 2111 2093 2082 2077 2079 2089 2106 2131 2165 2208 2259 2320 2391 2470 2558 2656 2760 2871
769 2871 2988 3111 3237 3363 3491 3619 3742 3861 3973 4076 4168 4245 4305 4348 4370 4372 4353 4315 4260 4189 4106 4013 3914 3814 3715 3621 3534 3457 3392 3341
$$ packed form
790A2649o7n0l0rJ4L6N4O9Q0Q6Q6Q3P5O4N2L7J9jk4m8p6j05j35j67j98k27k56k82l04l20l33
786A0772l41l44l40l33l20l04k85k65k44k26k07j92j82j76j74j75j79j83j86j88j89j84j77
784E378j68j53j37j19j01q1o0m0j9LK3M5O8R0J14J39J63J88K14K39K64K86L07L25L39L50L58
781H015L59L60L55L47L36L22L06K86K63K36K06J73J39J02O5L0nl5o0q3r8j08j13j15j12j06
778A1065r8q4o9n3l3j4PK7M7O2P6Q6Q9R0Q4P5O0M2K1kk6n2p7j02j27j51j73j96k15k34k52
775I873k69k86l03l17l30l39l47l50l50l46l40l30l18l04k88k72k56k39k22k06j90j75j60
772C336j46j33j21j11j01r2q3p5o8o1n3m8m2l6l0k5j8j1nKJ0J7K5L4M3N1O1P1P9Q8R8J04J11
769B871J17J23J26J26J28J28J23J19J12J03R2P7O0M3K2Kj9l8n5p1q3r3r9j00r9r4q7p7o5n1
$$ plain form
766 3341 3305 3285 3281 3293 3321 3365 3422 3489 3566 3650 3738 3825 3910 3988 4055 4107 4141 4154 4144 4111 4055 3975 3875 3757 3623 3478 3324 3166 3005 2845 2687
763 2687 2534 2387 2247 2114 1988 1869 1758 1656 1562 1475 1395 1320 1253 1191 1135 1083 1035 990 949 912 877 844 813 785 758 735 713 692 673 655 639
759 639 623 608 593 578 565 553 541 529 517 506 495 485 475 465 456 448 440 433 426 419 411 405 398 393 387 382 376 371 367 362 357 353 349 346 343 339 335 332 328 324 321 317 314 311 307 304 300 298 296 293 290 288 285 282 279 276
753 276 274 273 269 266 263 260 257 255 252 250 247 246 244 242 240 239 237 236 235 234 233 233 233 233 232 232 232 232 231 231 230 230 229 228 228 227 226 225 224 222 220 219 217 215 213 213 212 213 213 213 214 217 221 225 228 233 238 243 248 252 254 254 252 249 247 243 240 237 234 232
746 232 230 228 226 224 223 221 219 217 215 214 212 211 211 211 212 213 215 216 219 222 226 231 236 241 246 250 252 254 254 255 255 256 255 253 250 246 242 236 231 226 223 220 219 218 217 217 219 221 224 228 232 236 240 243 244 244 241 238 235 233 230 229 229 229 230 232 234 236 238 238
738 238 238 237 236 236 238 240 244 247 252 257 261 265 266 267 267 266 265 265 265 265 265 264 263 263 262 261 258 255 252 247 241 236 231 227 224 222 222 223 225 228 232 237 243 248 254 259 264 268 270 272 273 273 274 274 273 270 266 262 259 257 255 252 249 245 242 240 239 238 237 238
731 238 240 244 249 254 259 262 262 261 260 258 257 257 258 261 266 271 275 280 285 290 293 294 294 293 293 292 292 293 296 300 305 312 319 328 337 346 355 366 374 382 388 392 394 395 394 394 393 392 390 387 383 378 372 368 365 364 364 366 369 373 379 386 394 403 414 427 440
724 440 455 469 485 501 517 532 545 557 569 580 589 597 604 608 611 612 610 606 600 591 582 574 566 560 555 551 551 551 553 557 563 571 579 587 594 601 608 616 622 627 631 633 635 637 637 637 638 638 638 638 638 638 636 632 628 624 618 612 607 601
$$ packed form
766C341l6k0mJ2K8M4N7O7P7Q4Q8Q7Q5P8O7N2L4J3j0l3n6q0j00j18j34j45j54j58j61j60j58
763B687j53j47j40j33j26j19j11j02r4q7q0p5o7o2n6n2m8m5m1l7l5l3l1k8k7k3k2k1j9j8j6
759F39j6j5j5j5j3j2j2j2j2j1j1j0j0j0rqqpppqopnononmnnmmllmmlmmlmllmlmkkllkllll
753B76kjmllllklkljkkkjkjjjj%%%j%%%j%j%jj%jjjjkkjkkk%jJ%%JLMMLNNNNMK%klkmlllk
746B32kkkkjkkkkjkj%%JJKJLLMNNNNMKK%J%Jjklmmonnlljjj%KKLMMMMLJ%lllklj%%JKKKK%
738B38%jj%KKMLNNMMJJ%jj%%%%jj%jjlllnonnmlk%JKLMNONONNMKKJ%J%jlmmlkkllmlkjjjJ
731B38KMNNNL%jjkj%JLNNMNNNLJ%j%j%JLMNPPRRRRJ1QQOMKJj%jjklmnomlj%KLMOPQRJ1J3J3
724D40J5J4J6J6J6J5J3J2J2J1RQPMLJkmorrqqonm%%KMOQQQPPPQONMKKK%%J%%%%%kmmmoono
$$ plain form
718 601 595 591 587 584 582 581 581 582 584 587 590 594 599 603 607 609 611 612 610 608 604 598 590 580 569 555 541 526 510 494 479 464 450 436 423 411 401 393 384 376 370 365 360 357 355 352 350 348 347 345 343 340 338 336 333 330
712 330 325 320 314 308 301 294 286 278 271 264 256 248 240 233 226 220 215 210 206 202 198 194 191 188 186 183 180 177 174 172 169 166 163 160 156 152 150 148 147 145 146 146 144 143 142 140 139 137 136 134 134 133 132 132 132 134 136 139 140 142 145 147 149 151 153 154 153 152 149 145
704 145 139 133 127 121 115 111 107 104 101 99 98 99 101 104 107 111 114 117 118 120 122 122 121 120 119 117 115 112 110 107 105 105 105 106 108 110 112 113 113 113 111 108 104 99 92 85 80 75 72 70 69 69 70 72 74 78 81 84 87 89 91 93 94 95 95 95 93 91 88 85
697 85 83 80 75 72 70 69 68 68 68 70 72 73 75 77 78 78 79 79 80 80 80 82 84 86 88 89 91 93 94 95 95 96 95 95 95 94 93 91 88 86 85 84 84 84 85 86 87 88 90 92 94 96 97 98 99 101 102 103 104 104 104 105 105 105 105 105 105 106 107 108 109
689 109 110 112 113 114 115 115 115 116 117 117 118 118 118 119 120 120 121 121 122 122 122 123 124 125 126 126 127 129 130 131 133 134 135 136 137 138 139 139 139 138 138 139 139 141 142 144 145 146 148 149 151 151 151 151 151 153 152 151 150 149 148 147 145 144 143 143 143 143 144 146
682 146 148 150 153 157 160 163 167 169 172 174 176 177 178 177 177 175 173 170 167 164 161 158 154 151 149 147 145 143 141 139 138 137 139 141 144 148 152 158 164 171 179 186 193 200 206 210 215 219 224 231 240 252 268 288 312 342 377 417 460 504 545
675 545 575 587 577 551 513 469 423 379 340 308 281 258 239 225 215 209 209 211 214 219 225 230 234 237 239 241 242 243 243 244 244 244 246 249 254 262 273 288 307 331 362 399 440 485 528 561
671 561 576 572 552 523 489 454 421 391 366 347 332 322 314 309 303 298 293 288 283 278 272 265 258 249 240 232 224 218 215 215 218 223 229 235 241 247 256 269 282 293 301 308 314 320 325 330 336 342 348 354 359 365 372 381 390 400
$$ packed form
718F01ommlkj%JKLLMNMMKKJkkmoqj0j1j4j4j5j6j6j5j5j4j4j3j2j0qrqonnlklkkjkklkkll
712C30nnooppqqppqqqpponnmmmmllkllllkllllmmkkjkJ%kjjkjkjk%jj%%KKLJKLKKKKJjjlm
704A45ooooommllkjJKLLMLLJKK%jjjkklklk%%JKKKJ%%klmnppnnlkj%JKKMLLLKKKJJ%%kkll
697H5klnlkjj%%KKJKKJ%J%J%%KKKKJKKJJ%Jj%%jjklkjj%%JJJJKKKKJJJKJJJ%%J%%%%%JJJJ
689A09JKJJJ%%JJ%J%%JJ%J%J%%JJJJ%JKJJKJJJJJJ%%j%J%KJKJJKJK%%%%Kjjjjjjkjj%%%JK
682A46KKLMLLMKLKKJJj%kklllllmlkkkkkkjjKKLMMOOPQPPPOMNMNPRJ2J6K0K4L0L5M0M3M4M1
675E45L0J2j0k6l8m4m6m4l9l2k7k3j9j4j0o%KLNONMLKKJJ%J%%KLNQJ1J5J9K4L1L7M1M5M3L3
671E61J5mk0k9l4l5l3l0k5j9j5j0qnonnnnnopprrqqol%LNOOOORJ3J3J1QPOONNOOOONOPRRJ0
$$ plain form
665 400 410 419 427 436 445 455 467 481 498 515 535 557 580 608 640 676 718 763 814 870 931 997 1073 1163 1271 1401 1561 1761 2013 2331 2730 3222 3816
661 3816 4516 5313 6192 7110 7979 8688 9165 9372 9264 8831 8153 7354 6533 5749 5042 4445 3969 3607 3342 3156 3037 2973 2956 2980
659 2980 3041 3140 3282 3470 3715 4031 4437 4959 5634 6505 7619 9027 10769 12872 15343 18157 21248 24479 27598 30242 32039
656 32039 32767 32448 31276 29492 27350 25085 22852 20693 18616 16678 14955 13492 12306 11417 10856 10650 10818 11379 12350
654 12350 13743 15556 17771 20333 23154 26109 28956 31207 32296 32021 30675 28732 26567 24461 22688 21494 21005 21225
652 21225 22087 23488 25293 27275 29056 30168 30272 29339 27593 25338 22845 20339 18016 16022 14428 13246 12465 12071 12054
650 12054 12401 13099 14138 15494 17092 18817 20591 22394 24203 25986 27740 29477 31092 32253 32512 31630 29739 27174
649 27174 24249 21202 18239 15538 13206 11257 9655 8347 7289 6437 5753 5203 4764 4416 4149 3949 3811 3731 3708 3747 3853
$$ packed form
665D00J0RQRRJ0J2J4J7J7K0K2K3K8L2L6M2M5N1N6O1O6P6R0J08J30J60K00K52L18L99M92N94
661C816P00P97Q79R18Q69P09M77K07j08m33o78p99q21p84p07n97m76l62k65j86j19o4j7K4
659B980O1R9J42J88K45L16M06N22O75Q71J114J408J742K103K471K814L091L231L119K644J797
656C2039P28l19j172j784k142k265k233k159k077j938j723j463j186q89n61k06J68N61R71
654A2350J393J813K215K562K821K955K847K251J089k75j346j943k165k106j773j194m89K20
652B1225Q62J401J805J982J781J112J04r33j746k255k493k506k323j994j594j182p81l94j7
650A2054L47O98J039J356J598J725J774J803J809J783J754J737J615J161K59q82j891k565
649B7174k925l047k963k701k332j949j602j308j058q52o84n50m39l48k67k00j38q0k3L9J06
$$ plain form
646 3853 4036 4308 4681 5166 5764 6469 7261 8089 8838 9383 9687 9794 9726 9441 8903 8161 7321 6466 5637 4864 4177 3593 3109 2712
644 2712 2388 2126 1916 1748 1614 1507 1420 1349 1291 1240 1194 1150 1107 1064 1020 975 930 887 847 810 777 746 719 693 670 647 624 602 579 557 538 522
640 522 509 497 486 476 470 465 460 456 451 443 434 423 411 401 394 392 394 398 402 406 410 412 413 409 402 390 374 356 338 321 307 297 289 284 280 278 279 281 285 290 296 306 320 338 361 388 423 466 521
635 521 585 657 736 818 897 963 1005 1012 985 931 861 782 699 621 550 490 439 396 359 329 304 282 265 251 242 238 236 237 240 245 253 262 273 285 298 313 330 349 373 404
631 404 441 488 544 608 679 753 824 881 910 904 866 805 731 651 572 499 436 383 338 300 270 244 223 207 194 183 175 170 167 165 164 164 163 163 161 160 159 158 157 154 151 148 144 140 135
626 135 131 127 123 118 113 109 104 99 95 91 88 85 83 81 80 80 80 81 83 84 85 87 89 92 94 96 98 100 100 99 97 96 94 93 91 89 87 85 83 82 80 78 77 77 77 76 76 76 77 78 80 80 80 81 81 82 82 82 81 81 80 80 80 80 81 82 82 83 83 84
619 84 84 85 85 85 85 86 86 87 88 88 89 90 91 91 91 91 92 91 91 92 92 93 94 95 96 97 98 98 98 98 98 99 100 101 102 104 106 107 109 110 111 112 113 114 115 115 115 117 118 118 119 119 120 120 120 119 118 117 115 113 111 110 108 107 106 107 107 107 107 109 110
611 110 111 112 114 116 118 119 120 121 123 124 126 127 129 131 134 137 140 143 145 146 147 146 145 141 137 133 129 126 125 124 124 124 125 127 129 132 135 138 140 144 147 150 152 154 155 155 154 153 151 147 143 135 127 120 115 111 109 109 109 111 114 118 120 122 123 123 121 117 112 108
$$ packed form
646C853J83K72L73M85N98P05P92Q28P49N45L04J07o8k85n38p42q40q55q29p73o87n84m84l97
644B712l24k62k10j68j34j07q7p1n8n1m6m4m3m3m4m5m5m3m0l7l3l1k7k6k3k3k3k2k3k2j9j6
640E22j3j2j1j0onnmnqrj1j2j0pkKMMMMKJmpj2j6j8j8j7j4j0qnmkJKMNOJ0J4J8K3K7L5M3N5
635E21O4P2P9Q2P9O6M2Pk7n4p0p9q3p8p1o0n1m3l7l0k5k2j7j4rmkJLNQRJ1J2J3J5J7J9K4L1
631D04L7M7N6O4P1P4P1N7K9ol8o1p4q0p9p3o3n3m5l8l0k6k1j6j3j1qnlkj%j%kjjjjlllmmn
626A35mmmnnmnnmmllkkj%%JKJJKKLKKKK%jkjkjkkkkkjkkj%%j%%JJK%%J%J%%j%j%%%JJ%J%J
619H4%J%%%J%JJ%JJJ%%%Jj%J%JJJJJJ%%%%JJJJKKJKJJJJJJ%%KJ%J%J%%jjjkkkjkjjJ%%%KJ
611A10JJKKKJJJKJKJKKLLLLKJJjjmmmmljj%%JKKLLLKMLLKKJ%jjkmmqqpnmk%%KLMKKJ%kmnm
$$ plain form
604 108 106 103 101 100 100 99 100 100 102 104 107 110 114 118 121 123 124 124 124 122 119 115 111 107 101 94 88 83 80 78 78 79 80 82 84 85 87 88 89 90 90 91 92 92 91 91 90 90 88 87 86 86 84 83 83 83 82 82 81 80 79 78 76 74 73 72 71 71 70 70
596 70 70 72 73 74 75 76 76 76 77 77 77 76 76 76 75 75 75 75 75 75 75 75 75 75 75 76 77 76 76 75 75 75 76 77 77 77 77 76 76 76 77 77 76 77 77 77 77 77 78 79 79 80 80 80 80 80 80 80 80 80 80 81 81 82 81 81 81 81 81 81 82
589 82 82 82 82 82 82 82 82 83 83 84 83 82 82 82 82 83 83 84 85 85 85 85 85 85 85 85 84 85 85 86 86 87 87 86 86 86 87 87 88 88 88 89 89 89 90 90 90 91 91 92 92 93 94 94 95 96 97 99 101 102 105 108 111 116 121 125 130 134 138 141 142
581 142 140 137 133 129 125 122 118 115 113 111 110 109 108 108 108 107 108 108 109 110 110 112 114 116 118 121 126 130 136 142 149 155 162 169 174 176 177 179 180 181 181 180 179 177 175 173 172 172 173 175 176 177 177 177 176 175 175 175 175 175 176 177 177 176 172 168 164 160 157 156
574 156 157 158 161 164 169 174 179 182 185 186 187 188 189 192 195 200 205 210 214 217 219 219 218 218 218 220 222 225 225 223 221 219 218 216 214 211 208 205 201 198 195 194 194 195 197 200 202 203 206 208 212 217 224 232 240 247 252 254 255 255 255 256 258 262 267 273 279 287 294 300
566 300 302 301 298 294 290 286 284 284 287 292 299 306 312 316 320 323 324 325 326 327 329 332 335 337 339 341 343 344 345 345 345 344 344 345 345 344 342 340 341 344 348 355 364 377 393 411 432 454 476 496 513 526 536 544 549 552 554 554 551 547
560 547 542 536 528 519 510 500 491 485 481 479 480 484 490 496 501 506 510 514 520 526 534 542 550 558 565 570 575 577 579 578 576 573 568 562 554 545 535 524 513 501 489 476 465 454 446 440 437 435 434 432 431 429 428 428 428 429 431 434 440 447 455
554 455 462 470 478 485 493 500 506 511 516 520 522 522 521 519 516 512 505 496 484 472 459 447 437 429 422 417 414 413 414 415 417 421 425 430 434 437 438 438 437 434 430 423 416 407 399 390 381 373 365 358 350 342 333 323 311 300 289 279 271 262
$$ packed form
604A08klkj%jJ%KKLLMMLKJ%%klmmmoponlk%JJKKJKJJJ%JJ%j%j%kjj%kj%%j%jjjjkkjjj%j%
596G0%KJJJJ%%J%%j%%j%%%%%%%%%%JJj%j%%JJ%%%j%%J%jJ%%%%JJ%J%%%%%%%%%J%Jj%%%%%J
589H2%%%%%%%J%Jjj%%%J%JJ%%%%%%%jJ%J%J%j%%J%J%%J%%J%%J%J%JJ%JJJKKJLLLNNMNMMLJ
581A42klmmmlmlkkjjj%%jJ%JJ%KKKKLNMOOPOPPNKJKJJ%jjkkkj%JKJJ%%jj%%%%JJ%jmmmmlj
574A56JJLLNNNLLJJJJLLNNNMLK%j%%KKL%kkkjkklllmllj%JKLKJLKMNPQQPNKJ%%JKMNOOQPO
566C00Kjlmmmk%LNPPOMMLJJJJKLLKKKKJJ%%j%J%jkkJLMPRJ3J6J8K1K2K2K0J7J3J0QNLK%lm
560E47noqrrj0romkJMOONNMMOOQQQQPNNKKjklnoqrj0j1j1j2j2j3j1j1qolkjkjkj%%JKLOPQ
554D55PQQPQPONNMK%jklmprj2j2j3j2j0qpnljJJKMMNMLJ%jlmpprqrrqqpqqrj0j2j1j1j0qr
$$ plain form
547 262 255 249 244 240 238 236 234 234 233 233 233 232 231 229 228 226 223 220 217 212 208 203 199 193 188 183 179 174 170 166 161 158 155 152 148 145 142 141 139 137 135 134 132 131 129 128 127 126 125 124 122 121 121 120 119 118 117 117 116 116 116 115 115 114 113 112 112 112 111 111
540 111 111 112 113 114 115 115 115 115 114 114 114 114 113 111 110 108 107 105 103 101 99 98 97 96 96 95 94 94 93 92 91 89 88 87 88 89 90 92 95 98 101 103 104 104 104 104 104 102 100 96 91 84 77 70 65 62 60 58 57 57 58 60 62 65 68 72 75 77 79 80
532 80 82 84 86 86 86 85 85 83 80 77 73 70 68 67 66 66 66 66 67 66 65 64 63 64 64 64 64 64 64 66 67 67 67 68 68 69 69 70 70 71 73 75 77 79 81 82 82 82 82 80 79 77 76 73 70 66 61 56 51 48 45 43 42 43 44 45 45 48 51 55 59
525 59 62 66 69 72 75 77 79 80 80 78 76 72 67 62 58 54 52 50 49 49 51 53 55 56 59 61 63 65 66 67 69 71 73 74 77 79 80 81 82 83 84 85 87 88 88 89 88 87 86 86 85 84 84 84 83 83 84 86 87 89 91 92 94 96 97 98 99 100 100 101 101
517 101 102 102 102 102 102 102 103 105 106 107 109 110 110 111 112 113 114 114 115 115 115 116 116 117 117 118 119 121 122 124 124 124 124 124 124 125 125 125 124 123 122 121 119 118 117 115 115 115 117 118 120 122 125 128 132 135 138 141 144 146 149 151 154 154 155 154 151 148 144 139
510 139 135 132 129 126 125 123 122 121 119 118 119 120 123 127 134 142 150 158 166 174 183 191 200 208 216 224 232 242 254 270 291 319 354 397 449 510 579 654 731 801 852 872 857 812 749 674 597 524 459
505 459 404 358 321 292 269 252 240 232 228 226 226 225 225 225 225 225 223 222 219 217 214 210 205 200 195 190 184 178 170 162 154 146 140 133 127 122 119 119 122 130 141 155 170 186 201 215 229 246 263 277 288 295
499 295 301 307 313 321 332 348 370 400 436 481 536 601 672 748 820 875 900 891 853 798 735 671 613 565 527 498 475 457 444 434 426 420 415 410 405 399 394 389 384 381 379 380 383 387 393
$$ packed form
547B62ponmkkk%j%%jjkjklllnmnmonnmnmmnlllmlljkkkjkjkjjjjjkj%jjjj%j%%j%jjj%%j%
540A11%JJJJ%%%j%%%jkjkjkkkkjjj%jj%jjjkjjJJJKLLLKJ%%%%kkmnpppnlkkj%JKKLLMLKKJ
532H0KKK%%j%kllmlkjj%%%JjjjjJ%%%%%KJ%%J%J%J%JKKKKKJ%%%kjkjllmnnnllkjJJJ%LLMM
525E9LMLLLKKJ%kkmnnmmkkj%KKKJLKKKJJKKKJLKJJJJJJKJ%Jjjj%jj%%j%JKJKKJKKJJJJ%J%
517A01J%%%%%JKJJKJ%JJJJ%J%%J%J%JJKJK%%%%%J%%jjjjkjjk%%KJKKLLMLLLLKLKL%Jjllmn
510A39mllljkjjkjJJLMPQQQQQRQRQQQQJ0J2J6K1K8L5M3N2O1O9P5P7P0N1K0j5m5o3p5p7p3o5
505D59n5m6l7k9k3j7j2qmk%j%%%%kjlklmnnnnooqqqqoponl%LQJ1J4J5J6J5J4J4J7J7J4J1P
499B95OOOQJ1J6K2L0L6M5N5O5P1P6P2N5K5rl8n5o3o4n8m8l8k9k3j8j3j0qonnnonnnlkJLMO
$$ plain form
495 393 402 412 424 436 448 462 476 491 507 526 548 573 602 637 679 726 778 835 900 972 1054 1147 1255 1383 1541 1741 1995 2315 2717 3214 3821
491 3821 4544 5382 6321 7327 8308 9126 9687 9998 10081 9901 9417 8683 7824 6942 6098 5332 4679 4156 3754 3454 3240 3102 3029 3012
489 3012 3047 3131 3268 3466 3736 4095 4566 5183 5991 7042 8394 10091 12161 14611 17402 20446 23609 26640 29038 30180
487 30180 29792 28144 25715 22888 19942 17142 14696 12684 11088 9859 8953 8331 7962 7820 7894 8191 8735 9563 10715 12223
484 12223 14103 16347 18906 21691 24535 27132 29063 29986 29815 28711 26984 24977 22989 21245 19869 18845 18033 17284
483 17284 16512 15648 14609 13386 12069 10769 9555 8467 7539 6788 6210 5788 5508 5359 5337 5443 5683 6067 6604 7305 8176
480 8176 9214 10410 11712 13031 14313 15592 16942 18377 19878 21481 23260 25227 27283 29181 30521 30872 30039 28194
478 28194 25698 22883 20009 17298 14914 12929 11334 10090 9158 8502 8091 7908 7947 8218 8746 9569 10723 12234 14107 16319
$$ packed form
495C93RJ0J2J2J2J4J4J5J6J9K2K5K9L5M2M7N2N7O5P2Q2R3J08J28J58K00K54L20M02M97O07
491C821P23Q38R39J006R81Q18N61L11Q3j80m84p34q59q82q44p66o53n23m02l00k14j38p3j7
489C012L5Q4J37J98K70L59M71O17Q08J051J352J697K070K450K791L044L163L031K398J142
487C0180l88j648k429k827k946k800k446k012j596j229r06o22l69j42P4K97N44Q28J152J508
484A2223J880K244K559K785K844K597J931R23j71j104j727k007j988j744j376j024q12p49
483A7284p72q64j039j223j317j300j214j088r28p51n78m22k80j49k2J06K40L84N37P01Q71
480H176J038J196J302J319J282J279J350J435J501J603J779J967K056J898J340L51q33j845
478B8194k496k815k874k711k384j985j595j244r32o56m11j83L9K71N28Q23J154J511J873K212
$$ plain form
476 16319 18805 21441 24018 26207 27566 27730 26655 24641 22084 19301 16533 13981 11775 9944 8453 7252 6291 5527
474 5527 4917 4423 4017 3678 3395 3161 2975 2835 2739 2688 2683 2730 2836 3011 3266 3612 4059 4612 5271 6022 6840 7658 8364 8856 9097
472 9097 9074 8755 8152 7360 6494 5637 4834 4118 3512 3017 2618 2296 2036 1827 1657 1517 1402 1304 1220 1147 1082 1025 972 924 883 849 818
469 818 791 766 743 721 700 679 656 632 609 585 562 542 522 505 489 474 461 449 439 431 424 419 416 414 415 417 421 431 446 470 501 541 587 639 695 752 807 851 874
465 874 871 841 792 730 662 595 533 478 433 396 363 335 311 289 270 253 240 230 223 221 222 226 231 239 248 257 266 274 278 279 276 270 260 250 242 235 227 220 214 209 203 197 191 185 179 173 168 163 160 157 157
459 157 157 159 161 165 170 176 184 194 206 219 234 253 275 301 332 367 408 454 503 551 593 621 627 613 581 538 489 438 390 347 310 278 250 226 206 190 176 164 152
455 152 143 136 131 127 124 123 124 127 130 133 135 138 140 143 144 144 142 140 137 134 131 128 125 122 118 113 108 104 98 94 91 88 87 86 86 87 88 90 91 92 94 95 96 98 99 100 102 103 104 104 104 104 104 103 102 101 99 97 96 94 94 94 94 94 93 93 93 92 92 93
448 93 93 94 94 93 93 93 93 93 93 93 92 92 91 91 91 91 93 94 96 97 97 97 96 96 96 96 96 96 97 97 98 98 98 98 99 100 102 103 104 105 106 107 109 110 110 109 109 109 108 107 105 102 100 99 99 100 101 101 102 103 104 105 107 108 111 113 114 115 117 120 122
$$ packed form
476A6319K486K636K577K189J359J64j075k014k557k783k768k552k206j831j491j201r61p64
474E527o10m94m06l39k83k34j86j40r6n1nM7J06J75K55L46M47N53O59P51Q18Q18P06M92K41
472I097k3l19o03p92q66q57q03p16o06m95l99l22k60k09j70j40j15r8q4p3o5n7n3m8m1l4l1
469H18k7k5k3k2k1k1k3k4k3k4k3k0k0j7j6j5j3j2j0qpnlkJKMJ0J5K4L1M0M6N2N6N7N5M4K3
465H74ll0m9o2o8o7o2n5m5l7l3k8k4k2j9j7j3j0pkJMNQRRRQMJloj0j0qpqponoooooonnll%
459A57%KKMNOQJ0J2J3J5J9K2K6L1L5M1M6M9M8M2K8Oj4l2m3m9n1m8m3l7l2k8k4k0j6j4j2j2
455A52rpnmljJLLLKLKLJ%kkllllllmnnmomlljj%JJKJJKJJKJJKJJ%%%%jjjkkjk%%%%j%%j%J
448I3%J%j%%%%%%j%j%%%KJKJ%%j%%%%%J%J%%%JJKJJJJJKJ%j%%jjklkj%JJ%JJJJKJLKJJKLK
$$ plain form
440 122 124 125 127 128 131 133 136 137 137 137 134 130 124 117 109 104 100 98 97 97 99 101 103 105 107 110 114 118 122 126 130 133 135 137 138 138 137 135 132 128 122 116 111 106 102 100 100 100 100 100 99 99 99 98 98 98 100 101 101 102 103 104 104 104 105 104 105 106 107 108
433 108 110 111 112 113 113 113 113 114 114 114 114 115 115 114 114 112 109 104 99 94 89 86 84 84 84 85 88 90 93 95 96 97 100 103 105 108 110 113 115 116 115 113 110 105 99 92 85 78 73 69 67 67 68 68 68 69 71 72 74 76 77 79 81 83 83 83 82 81 80 79
425 79 78 79 79 80 80 80 80 80 80 80 79 78 77 75 72 70 69 68 67 67 68 68 68 68 68 68 68 69 70 71 72 72 73 73 74 73 73 73 73 72 72 71 71 71 71 71 71 71 72 72 72 71 71 71 70 70 70 70 71 71 71 71 70 70 70 70 70 69 70 70 70
418 70 71 71 71 71 71 71 71 71 72 72 71 71 71 72 73 74 74 75 76 75 75 75 75 75 75 75 75 74 74 74 74 75 75 75 76 77 78 79 78 78 78 80 82 84 86 88 91 95 100 106 112 118 122 126 127 127 124 120 116 111 106 102 98 94 91 89 87 86 84 83 83
410 83 83 82 82 82 82 84 85 87 88 89 92 95 99 104 111 117 123 128 132 133 131 128 123 117 112 108 103 100 97 96 94 94 93 93 93 95 96 98 100 103 107 110 115 121 127 133 137 141 144 145 144 144 145 146 148 150 152 154 153 150 146 143 140 138 136 136 136 138 140 142 143
403 143 142 141 139 138 137 137 139 141 144 148 151 153 154 154 153 151 150 149 149 151 152 153 153 152 149 145 140 137 135 134 134 136 138 140 141 141 140 137 133 129 125 122 121 121 122 124 128 132 136 141 143 144 144 141 139 136 134 134 133 134 136 137 139 140 141 140 138 138 137 137
395 137 138 139 141 143 143 141 139 137 136 135 134 135 137 140 143 146 147 146 144 140 136 132 130 130 130 132 134 135 137 138 137 135 133 132 131 131 131 132 132 132 131 128 124 119 114 109 104 99 97 94 92 91 90 90 90 89 89 90 91 92 95 97 100 103 107 111 115 118 119 117
388 117 114 111 107 104 100 97 93 91 89 88 86 85 84 84 83 83 83 82 82 83 82 83 84 85 87 89 91 94 98 102 105 109 113 115 116 114 111 107 102 97 93 91 88 86 84 82 80 80 79 78 77 77 78 77 76 75 75 75 75 75 74 74 73 74 74 74 73 73 74 74
$$ packed form
440A22KJKJLKLJ%%lmopqnmkj%KKKKKLMMMMMLKKJ%jklmoonnmk%%%%j%%j%%KJ%JJJ%%JjJJJJ
433A08KJJJ%%%J%%%J%j%klnnnnlk%%JLKLKJJLLKLKLKJjklnopppnmk%J%%JKJKKJKKK%%jjjj
425G9jJ%J%%%%%%jjjklkjjj%J%%%%%%JJJJ%J%Jj%%%j%j%%%%%%J%%j%%j%%%J%%%j%%%%jJ%%
418G0J%%%%%%%J%j%%JJJ%JJj%%%%%%%j%%%J%%JJJJj%%KKKKKLMNOOOMMJ%lmmnnmmmlkkjkj%
410H3%j%%%KJKJJLLMNPOONMJklnonmnlljk%j%%KJKKLMLNOOOMMLJj%JJKKKKjlmllkk%%KKKJ
403A43jjkjj%KKLMLKJ%jkjj%KJJ%jlmnlkj%KKKJ%jlmmmlj%JKMMMNKJ%lklk%jJKJKJJjk%j%
395A37JJKK%kkkjjjJKLLLJjkmmmk%%KKJKJjkkjj%%J%%jlmnnnnnklkjj%%j%JJJLKLLMMMLJk
388A17llmlmlmkkjkjj%j%%j%JjJJJKKKLMMLMMKJklmnnmklkkkk%jjj%Jjjj%%%%j%jJ%%j%J%
$$ plain form
381 74 74 73 73 74 74 73 74 74 74 73 73 73 73 72 71 71 71 71 71 71 71 71 71 71 71 71 71 72 72 72 72 72 71 71 71 71 72 72 71 71 71 70 70 71 71 72 71 71 71 71 71 71 72 72 71 70 70 70 70 71 70 70 70 70 70 70 70 70 70 70 70
373 70 71 72 72 72 72 72 71 71 70 70 71 71 72 71 70 70 70 70 70 69 69 69 69 69 69 69 69 69 69 68 68 69 69 69 70 70 70 69 69 68 68 68 69 69 69 69 69 69 70 70 70 70 70 70 70 70 70 69 69 69 69 69 69 69 69 69 69 69 69 69 69
366 69 69 68 68 68 68 68 68 68 68 68 68 68 67 67 67 67 68 68 69 69 69 68 68 68 68 68 68 68 68 67 68 68 68 68 68 68 68 67 68 68 68 69 68 68 67 66 66 67 67 67 66 66 66 66 66 67 67 67 67 67 67 68 69 68 68 68 69 69 68 68 68
358 68 68 68 67 67 67 67 67 67 66 66 66 66 66 67 67 67 67 66 66 67 68 68 68 67 66 66 66 66 66 67 67 66 66 66 66 66 66 66 67 67 68 68 67 67 67 67 67 67 67 67 66 66 67 66 67 67 67 67 67 66 65 66 66 66 67 67 67 67 67 68 68
351 68 67 67 66 66 66 66 65 66 66 66 66 67 67 67 67 68 67 67 67 67 66 66 66 67 67 67 67 66 66 66 66 66 66 66 66 67 66 66 66 66 66 66 66 66 66 65 65 65 65 65 64 64 65 64 64 64 65 65 64 64 64 64 64 64 65 65 65 65 66 66 67
343 67 66 65 66 66 65 65 65 65 65 65 65 65 64 65 66 65 65 65 65 65 65 65 66 65 65 64 64 64 64 64 63 64 64 64 64 64 65 65 65 66 66 66 66 65 65 65 65 65 65 65 65 65 65 65 64 64 63 63 64 64 63 63 63 63 63 63 63 64 64 64 63
335 63 63 63 63 63 64 65 65 64 64 64 64 65 65 65 65 65 65 65 64 64 64 64 64 64 64 64 64 64 65 65 65 66 66 65 65 64 65 65 64 65 65 65 64 64 64 65 65 65 65 64 64 64 64 64 64 64 64 64 64 64 64 65 65 65 65 65 65 65 65 65 65
328 65 64 64 63 63 63 64 64 64 64 64 64 64 64 63 63 63 63 63 64 64 64 64 64 64 64 64 64 63 63 63 64 64 65 64 64 63 63 63 64 65 66 66 65 65 65 65 65 63 62 62 63 63 63 63 63 63 63 63 63 62 62 62 63 63 64 64 64 64 65 65 64
$$ packed form
381G4%j%J%jJ%%j%%%jj%%%%%%%%%%%%J%%%%j%%%J%j%%j%J%Jj%%%%%J%jj%%%Jj%%%%%%%%%%
373G0JJ%%%%j%j%J%Jjj%%%%j%%%%%%%%%j%J%%J%%j%j%%J%%%%%J%%%%%%%%j%%%%%%%%%%%%%
366F9%j%%%%%%%%%%j%%%J%J%%j%%%%%%%jJ%%%%%%jJ%%Jj%jj%J%%j%%%%J%%%%%JJj%%J%j%%
358F8%%j%%%%%j%%%%J%%%j%JJ%%jj%%%%J%j%%%%%%J%J%j%%%%%%%j%JjJ%%%%jjJ%%J%%%%J%
351F8j%j%%%jJ%%%J%%%Jj%%%j%%J%%%j%%%%%%%Jj%%%%%%%%j%%%%j%Jj%%J%j%%%%%J%%%J%J
343F7jjJ%j%%%%%%%jJJj%%%%%%Jj%j%%%%jJ%%%%J%%J%%%j%%%%%%%%%%j%j%J%j%%%%%%J%%j
335F3%%%%JJ%j%%%J%%%%%%j%%%%%%%%%J%%J%j%jJ%jJ%%j%%J%%%j%%%%%%%%%%%J%%%%%%%%%
328F5j%j%%J%%%%%%%j%%%%J%%%%%%%%j%%J%Jj%j%%JJJ%j%%%%kj%J%%%%%%%%j%%J%J%%%J%j
$$ plain form
320 64 63 63 64 63 64 64 64 63 63 63 63 63 63 63 63 63 63 63 63 62 62 63 63 62 62 62 62 62 63 63 63 63 63 63 63 63 63 63 63 63 63 63 63 63 62 62 62 62 63 63 63 63 63 63 63 63 63 63 63 63 63 64 64 63 63 63 63 64 64 64 64
313 64 65 65 65 65 65 65 65 65 65 65 64 64 64 64 64 63 64 64 64 64 65 66 66 66 66 65 64 64 64 64 64 65 66 66 67 67 67 66 66 66 65 66 67 68 68 67 67 68 68 68 68 68 68 68 67 67 66 66 65 66 66 66 66 66 67 68 68 67 67 67 67
305 67 67 68 68 68 69 70 70 69 69 68 68 68 69 69 69 69 69 68 68 68 68 68 68 69 69 69 69 69 69 69 70 70 70 70 69 69 69 70 71 71 70 70 70 70 71 71 70 69 68 68 69 69 69 69 69 69 69 69 69 69 69 70 69 69 68 69 69 69 68 69 70
298 70 70 70 70 70 69 70 70 70 70 69 69 69 70 70 70 69 69 70 69 70 70 69 69 69 70 70 71 71 71 70 71 71 71 71 71 71 71 71 71 71 71 71 71 71 70 70 70 70 69 69 68 69 69 69 69 69 70 70 70 70 70 70 71 71 70 70 70 70 70 70 70
290 70 69 70 70 71 71 72 71 71 70 70 69 68 68 68 69 69 69 69 69 69 70 70 70 69 69 69 69 69 69 69 69 69 69 69 68 67 67 67 68 68 68 68 69 69 69 69 69 69 69 70 69 69 68 68 68 67 68 69 69 69 69 68 68 68 69 69 69 69 69 70 70
283 70 70 69 69 69 70 70 70 70 70 70 70 69 69 68 68 68 68 68 68 69 69 70 70 70 70 69 69 69 69 69 68 68 68 68 68 68 68 69 70 70 70 69 69 69 69 68 68 68 68 68 68 68 67 67 67 67 67 67 67 67 67 67 67 67 67 67 67 67 67 67 67
275 67 67 67 67 67 66 66 66 66 66 66 66 67 66 66 66 66 65 65 65 64 64 64 65 66 66 66 65 66 66 67 67 66 66 66 65 65 65 66 66 66 66 65 64 65 65 64 64 64 65 65 65 65 66 67 67 67 66 66 66 66 66 66 66 66 66 66 65 64 63 63 63
268 63 64 64 64 64 64 65 65 65 64 64 64 64 65 65 64 64 64 64 64 64 64 64 64 64 64 64 65 65 64 63 63 64 64 64 64 63 62 62 63 63 63 63 63 64 65 64 64 63 63 63 63 63 63 62 63 63 63 62 62 62 63 63 63 63 63 62 62 61 61 61 61
$$ packed form
320F4j%JjJ%%j%%%%%%%%%%%j%J%j%%%%J%%%%%%%%%%%%%%%j%%%J%%%%%%%%%%%%J%j%%%J%%%
313F4J%%%%%%%%%j%%%%jJ%%%JJ%%%jj%%%%JJ%J%%j%%jJJJ%j%J%%%%%%j%j%jJ%%%%JJ%j%%%
305F7%J%%JJ%j%j%%J%%%%j%%%%%J%%%%%%J%%%j%%JJ%j%%%J%jjj%J%%%%%%%%%%Jj%jJ%%jJJ
298G0%%%%jJ%%%j%%J%%j%JjJ%j%%J%J%%jJ%%%%%%%%%%%%%j%%%j%jJ%%%%J%%%%%J%j%%%%%%
290G0jJ%J%Jj%j%jj%%J%%%%%J%%j%%%%%%%%%%jj%%J%%%J%%%%%%Jj%j%%jJJ%%%j%%J%%%%J%
283G0%j%%J%%%%%%j%j%%%%%J%J%%%j%%%%j%%%%%%JJ%%j%%%j%%%%%%j%%%%%%%%%%%%%%%%%%
275F7%%%%j%%%%%%Jj%%%j%%j%%JJ%%jJ%J%j%%j%%J%%%jjJ%j%%J%%%JJ%%j%%%%%%%%%jjj%%
268F3J%%%%J%%j%%%J%j%%%%%%%%%%%J%jj%J%%%jj%J%%%%JJj%j%%%%%jJ%%j%%J%%%%j%j%%%
$$ plain form
260 61 61 62 61 61 61 60 60 60 60 60 60 59 59 59 59 59 60 61 61 60 59 60 60 61 60 60 60 60 60 60 60 60 60 60 60 60 60 59 59 60 60 60 59 59 59 59 59 59 59 59 59 58 58 57 57 57 58 59 59 59 59 59 60 60 60 60 60 59 58 58 58
253 58 58 58 58 59 59 58 58 57 57 58 58 59 59 59 59 59 59 59 58 58 59 59 59 60 61 61 61 61 61 61 61 61 60 61 61 61 60 60 59 59 58 58 58 58 58 57 58 59 59 59 58 59 59 60 60 61 60 60 60 60 61 61 60 60 60 60 59 59 60 60 60
245 60 59 59 59 59 59 59 59 60 60 61 60 59 58 57 57 58 59 59 60 60 60 60 60 60 59 59 59 60 61 61 61 61 62 62 62 62 62 62 62 62 62 61 60 60 61 61 60 61 61 61 60 60 61 61 61 62 62 61 61 61 62 62 63 64 65 64 64 63 63 63 63
238 63 63 63 63 63 63 63 63 63 63 63 64 64 64 64 65 64 64 64 64 63 64 64 64 63 63 64 65 66 66 67 67 67 68 67 67 67 67 66 66 66 67 67 67 66 66 67 67 66 66 66 66 65 65 65 64 64 65 66 66 67 67 67 67 66 66 66 67 67 67 67 68
230 68 68 68 68 68 68 68 68 68 68 68 67 67 67 67 67 68 68 68 68 68 67 67 67 67 68 69 69 69 69 69 69 69 68 68 68 68 68 68 68 68 68 69 69 69 68 68 69 70 70 69 68 68 68 68 68 68 67 67 67 68 67 67 67 67 67 66 67 68 69 69 69
223 69 69 69 69 69 68 68 68 68 68 68 68 69 69 68 68 68 68 69 68 68 68 68 69 69 68 68 68 68 68 68 69 69 68 68 67 68 69 68 68 68 67 68 68 68 68 68 68 69 69 70 70 69 69 69 69 68 68 68 68 68 68 69 69 69 68 68 68 68 68 69 69
215 69 69 69 69 69 69 69 69 69 68 68 68 68 68 68 69 69 69 69 70 70 69 69 68 68 68 68 68 68 68 68 67 67 67 68 68 68 68 68 68 68 67 67 66 66 66 66 66 66 67 68 68 68 68 68 67 67 68 68 68 68 67 67 67 67 66 66 66 65 66 66 66
208 66 67 67 67 67 67 67 67 67 67 67 67 67 67 67 67 67 67 67 67 67 67 67 67 66 66 66 66 67 67 66 66 65 65 65 64 65 65 65 64 64 65 66 66 66 66 66 66 67 67 67 67 67 67 67 66 66 66 66 66 66 66 66 65 65 65 65 65 65 65 65 64
$$ packed form
260F1%Jj%%j%%%%%j%%%%JJ%jjJ%Jj%%%%%%%%%%%%j%J%%j%%%%%%%%j%j%%JJ%%%%J%%%%jj%%
253E8%%%J%j%j%J%J%%%%%%j%J%%JJ%%%%%%%jJ%%j%j%j%%%%jJJ%%jJ%J%Jj%%%J%j%%%j%J%%
245F0j%%%%%%J%Jjjjj%JJ%J%%%%%j%%JJ%%%J%%%%%%%%jj%J%jJ%%j%J%%J%j%%J%JJJj%j%%%
238F3%%%%%%%%%%J%%%Jj%%%jJ%%j%JJJ%J%%Jj%%%j%%J%%j%J%j%%%j%%j%JJ%J%%%j%%J%%%J
230F8%%%%%%%%%%j%%%%J%%%%j%%%JJ%%%%%%j%%%%%%%%J%%j%JJ%jj%%%%%j%%Jj%%%%jJJJ%%
223F9%%%%j%%%%%%J%j%%%Jj%%%J%j%%%%%J%j%jJJj%%jJ%%%%%J%J%j%%%j%%%%%J%%j%%%%J%
215F9%%%%%%%%j%%%%%J%%%J%j%j%%%%%%%j%%J%%%%%%j%j%%%%%JJ%%%%j%J%%%j%%%j%%jJ%%
208F6J%%%%%%%%%%%%%%%%%%%%%%j%%%J%j%j%%jJ%%j%JJ%%%%%J%%%%%%j%%%%%%%j%%%%%%%j
$$ plain form
200 64 64 64 64 64 64 64 64 64 64 65 65 65 64 63 64 64 64 65 65 65 65 64 64 65 65 66 66 66 65 65 65 65 65 65 64 64 63 63 63 63 64 63 63 64 64 64 64 64 65 64 64 64 64 64 63 62 62 63 64 65 65 65 65 65 65 65 65 65 65 65 65
193 65 64 64 64 64 64 64 64 64 64 64 64 64 64 64 63 64 64 64 65 65 65 65 65 65 65 65 65 65 66 66 65 65 64 64 63 64 64 64 64 64 64 64 64 65 65 64 64 64 64 63 63 64 64 64 64 64 64 64 64 64 64 64 63 63 63 63 63 64 64 64 64
185 64 64 64 64 64 64 65 66 66 66 66 66 66 66 65 65 65 65 65 65 65 65 64 63 63 63 64 63 64 65 66 65 64 64 65 65 66 66 67 67 68 68 68 68 67 67 67 67 67 66 66 66 66 66 65 65 65 65 65 64 64 64 64 64 65 65 65 65 65 65 65 65
177 65 65 65 65 66 66 66 66 66 66 66 65 65 65 65 66 66 66 66 66 66 66 66 66 66 66 66 66 66 66 66 66 66 66 67 67 68 68 68 68 68 68 68 67 68 68 68 68 68 68 68 67 67 67 67 67 67 68 68 67 67 67 67 66 66 66 67 67 67 66 66 66
170 66 67 67 67 67 67 67 68 68 68 69 69 69 69 68 68 67 68 68 68 69 69 69 68 67 67 67 68 68 67 68 68 68 69 68 67 66 66 67 67 66 66 67 68 68 67 67 66 66 66 65 66 66 66 67 67 67 67 68 68 67 66 66 66 67 68 68 67 67 67 68 68
162 68 68 68 68 67 68 67 67 67 67 67 68 68 67 67 67 67 67 67 67 67 67 66 66 65 65 65 65 66 66 67 67 67 66 66 65 65 66 66 66 66 66 66 66 66 67 66 66 66 65 66 66 66 66 67 66 66 66 66 66 66 65 65 65 65 65 65 65 65 65 65 65
155 65 65 66 66 66 65 65 65 66 66 66 66 66 66 65 65 65 65 65 65 65 66 66 66 66 66 65 65 65 66 66 65 64 64 65 65 65 65 65 65 65 65 65 65 65 65 65 65 66 65 65 66 66 66 66 66 67 66 65 65 64 64 65 65 65 65 64 65 65 65 65 65
147 65 64 65 65 65 65 66 67 66 66 66 66 66 66 67 67 66 66 66 66 66 66 66 66 66 66 66 66 65 65 65 65 66 66 66 66 66 66 66 66 66 66 66 66 66 66 66 66 66 66 66 65 65 65 65 65 65 65 66 66 66 66 66 65 65 65 65 66 66 66 66 66
$$ packed form
200F4%%%%%%%%%J%%jjJ%%J%%%j%J%J%%j%%%%%j%j%%%Jj%J%%%%Jj%%%%jj%JJJ%%%%%%%%%%%
193F5j%%%%%%%%%%%%%jJ%%J%%%%%%%%%J%j%j%jJ%%%%%%%J%j%%%j%J%%%%%%%%%%j%%%%J%%%
185F4%%%%%JJ%%%%%%j%%%%%%%jj%%JjJJJjj%J%J%J%J%%%j%%%%j%%%%j%%%%j%%%%J%%%%%%%
177F5%%%J%%%%%%j%%%J%%%%%%%%%%%%%%%%%%J%J%%%%%%jJ%%%%%%j%%%%%J%j%%%j%%J%%j%%
170F6J%%%%%J%%J%%%j%jJ%%J%%jj%%J%jJ%%Jjjj%J%j%JJ%j%j%%jJ%%J%%%J%jj%%JJ%j%%J%
162F8%%%jJj%%%%J%j%%%%%%%%j%j%%%J%J%%j%j%J%%%%%%%Jj%%jJ%%%Jj%%%%%j%%%%%%%%%%
155F5%J%%j%%J%%%%%j%%%%%%J%%%%j%%J%jj%J%%%%%%%%%%%%%Jj%J%%%%Jjj%j%J%%%jJ%%%%
147F5jJ%%%JJj%%%%%J%j%%%%%%%%%%%j%%%J%%%%%%%%%%%%%%%%%%j%%%%%%J%%%%j%%%J%%%%
$$ plain form
140 66 65 66 66 66 66 66 65 65 64 64 64 64 65 65 65 65 65 65 64 64 64 65 65 64 64 64 64 65 65 65 66 66 67 66 66 66 66 66 66 66 65 65 65 65 65 66 66 66 65 65 65 64 65 65 65 66 65 65 64 64 65 65 65 65 65 65 66 66 65 64 63
132 63 63 63 64 65 64 64 64 64 64 64 63 64 64 64 65 65 65 65 65 64 64 64 64 64 63 63 63 63 63 63 63 63 64 64 64 64 64 64 64 64 64 64 64 64 64 64 64 65 65 65 65 66 66 65 65 64 64 64 64 64 64 64 64 64 63 64 65 65 65 65 65
125 65 66 66 66 66 66 65 65 65 64 64 63 63 63 63 64 64 65 65 65 65 64 64 63 64 64 65 66 66 66 65 64 64 64 64 64 64 65 65 65 64 63 64 64 65 65 66 66 65 65 65 65 65 65 65 65 65 64 64 64 63 63 64 64 64 64 64 64 63 62 63 63
117 63 64 64 65 64 64 64 64 64 63 63 63 63 64 64 64 64 64 64 64 64 64 64 63 63 64 64 64 64 64 63 62 62 63 62 62 63 64 64 64 64 63 63 63 63 63 63 63 63 63 63 63 63 63 63 63 64 64 64 64 64 64 63 63 64 64 64 64 64 64 64 64
110 64 63 63 63 63 63 64 64 64 63 63 63 64 64 64 64 64 64 64 63 62 62 62 62 63 63 63 63 63 62 62 62 63 63 63 63 63 62 62 62 62 62 62 62 61 61 62 62 62 61 61 62 62 62 63 64 64 63 63 63 63 63 63 63 64 64 64 64 63 62 62 62
102 62 63 64 64 63 63 63 64 64 64 64 63 63 63 63 63 63 63 62 62 62 63 64 64 63 63 63 62 62 62 62 62 62 63 63 63 64 64 65 66 67 67 67 68 69 69 68 68 68 67 67 66 67 67 66 65 65 64 63 63 63 62 62 63 63 62 62 62 62 62 62 63
95 63 64 64 64 63 63 62 62 62 61 61 61 61 61 61 61 60 61 61 60 60 60 60 60 60 60 61 62 62 61 61 61 61 61 61 61 61 61 61 62 62 62 62 62 61 61 61 61 61 61 62 61 61 61 61 61 61 60 60 61 61 61 61 61 61 61 61 61 60 60 59 59 59
87 59 59 60 60 59 59 59 60 60 60 60 61 61 61 62 62 61 61 61 60 59 60 60 61 61 61 61 61 62 62 62 61 61 61 61 61 61 60 61 61 62 62 62 61 61 61 61 61 61 60 59 59 59 59 59 59 59 59 59 60 60 59 59 60 60 60 60 60 60 60 60 60 60
$$ packed form
140F6jJ%%%%j%j%%%J%%%%%j%%J%j%%%J%%J%Jj%%%%%%j%%%%J%%j%%jJ%%Jj%j%J%%%%%J%jjj
132F3%%JJj%%%%%jJ%%J%%%%j%%%%j%%%%%%%J%%%%%%%%%%%%%%J%%%J%j%j%%%%%%%%jJJ%%%%
125F5J%%%%j%%j%j%%%J%J%%%j%jJ%JJ%%jj%%%%%J%%jjJ%J%J%j%%%%%%%%j%%j%J%%%%%jjJ%
117F3J%Jj%%%%j%%%J%%%%%%%%%j%J%%%%jj%Jj%JJ%%%j%%%%%%%%%%%%%%J%%%%%j%J%%%%%%%
110F4j%%%%J%%j%%J%%%%%%jj%%%J%%%%j%%J%%%%j%%%%%%j%J%%j%J%%JJ%j%%%%%%J%%%jj%%
102F2JJ%j%%J%%%j%%%%%%j%%JJ%j%%j%%%%%J%%J%JJJ%%JJ%j%%j%jJ%jj%jj%%j%J%j%%%%%J
95F3J%%j%j%%j%%%%%%jJ%j%%%%%%JJ%j%%%%%%%%%J%%%%j%%%%%Jj%%%%%j%J%%%%%%%%j%j%%
87E9%J%j%%J%%%J%%J%j%%jjJ%J%%%%J%%j%%%%%jJ%J%%j%%%%%jj%%%%%%%%J%j%J%%%%%%%%%
$$ plain form
79 60 60 59 59 59 59 59 60 61 61 61 61 61 61 61 61 61 61 61 60 60 60 61 62 62 62 61 61 61 61 62 61 61 61 61 62 62 62 62 62 62 62 61 61 61 62 61 61 60 60 60 61 61 61 62 62 62 62 62 63 63 63 62 62 62 63 63 64 64 64 64 64 64
72 64 62 62 63 63 63 63 63 62 62 62 62 63 62 62 63 63 64 64 64 65 65 65 65 66 66 65 65 65 65 65 65 65 65 65 65 64 65 65 65 65 64 63 64 64 64 64 63 63 63 63 63 63 63 63 63 65 65 64 64 64 64 65 65 65 65 65 66 67 67 67 67 66
64 66 66 66 65 65 65 65 64 64 64 64 64 65 65 65 65 65 65 64 64 64 64 64 64 63 63 64 64 65 65 65 66 66 66 67 66 66 65 65 66 66 66 67 67 67 67 66 66 66 65 65 65 65 65 66 66 66 66 67 67 67 67 67 67 67 66 66 67 68 68 69 69 69
57 69 69 69 68 67 67 67 67 68 68 68 68 67 68 68 68 68 67 67 66 66 65 65 65 65 65 65 65 64 64 65 65 66 67 67 67 68 68 69 70 72 72 73 74 75 74 74 73 73 72 71 70 69 68 69 69 69 68 68 67 67 67 67 67 67 67 66 66 66 67 67 67 68
49 68 68 67 67 67 67 67 67 67 67 67 68 68 67 67 67 68 68 68 68 69 70 70 70 70 70 71 71 71 72 72 72 72 73 74 74 75 75 75 76 76 76 77 77 79 80 82 84 86 90 93 96 99 102 105 108 109 109 109 107 106 107 108 109 111 114 116 120 124 129 136 143 152
41 152 162 175 191 212 237 269 311 363 426 502 590 689 797 911 1023 1120 1178 1178 1125 1036 928 810 694 587 495 419 356 306 265 233 206 185 168
38 168 154 143 134 127 121 116 112 108 105 104 103 102 102 103 104 105 106 107 108 107 105 101 98 95 92 89 86 83 81 79 78 77 77 76 76 74 73 72 72 71 70 69 69 68 68 67 67 67 67 67 67 68 68 67 67 67 67 67 67 67 67 67 67 67 67 66 66 66 66
31 66 66 66 65 65 65 65 65 65 65 64 64 64 64 64 64 64 65 64 64 64 64 64 64 64 64 64 63 63 63 62 62 62 62 61 62 62 63 63 63 63 63 65 65 65 66 66 66 66 66 66 65 64 63 62 61 62 62 61 61 61 61 61 62 62 62 62 63 63 63 63 64 64
$$ packed form
79F0%j%%%%JJ%%%%%%%%%%j%%JJ%%j%%%Jj%%%J%%%%%%j%%Jj%j%%J%%J%%%%J%%j%%J%J%%%%%
72F4k%J%%%%j%%%Jj%J%J%%J%%%J%j%%%%%%%%%jJ%%%jjJ%%%j%%%%%%%%K%j%%%J%%%%JJ%%%j
64F6%%j%%%j%%%%J%%%%%j%%%%%j%J%J%%J%%Jj%j%J%%J%%%j%%j%%%%J%%%J%%%%%%j%JJ%J%%
57F9%%jj%%%J%%%jJ%%%j%j%j%%%%%%j%J%JJ%%J%JJK%JJJj%j%jjjjjJ%%j%j%%%%%%j%%J%%J
49F8%j%%%%%%%%J%j%%J%%%JJ%%%%J%%J%%%JJ%J%%J%%J%KJKKKMLLLLLLJ%%kjJJJKLKMMNPPR
41A52J0J3J6K1K5L2M2N2O3P6Q8R9J08J14J12R7N8%n3q9j08j18j16j07r2p6o3n0m1l2k7k1j7
38A68j4j1rponmmljjj%JJJJJJjkmllllllkkjj%j%kjj%jjj%j%j%%%%%J%j%%%%%%%%%%%j%%%
31F6%%j%%%%%%j%%%%%%Jj%%%%%%%%j%%j%%%jJ%J%%%%K%%J%%%%%jjjjjJ%j%%%%J%%%J%%%J%
$$ plain form
23 64 65 65 65 65 65 66 66 65 65 65 65 65 65 64 63 63 63 62 62 62 61 62 63 63 62 62 63 64 63 63 62 62 62 62 62 62 61 61 60 61 61 61 62 63 63 64 63 63 62 62 61 62 63 63 63 63 63 64 64 63 63 62 62 61 61 61 61 61 61 61 62 62
15 62 62 62 62 62 62 63 63 64 63 62 63 63 63 63 62 62 62 61 61 62 62 62 63 63 63 63 63 62 62 62 62 63 63 63 63 62 61 61 62 62 62 63 63 62 62 62 62 62 62 62 62 62 62 62 62 62 63 62 62 62 62 62 62 62 63 64 64 65 64 64 63 64
8 64 65 65 64 64 64 63 63 63 64 64 63 63 62 62 63 63 63 62 62 62 63 63 63 63 63 63 63 63 62 62 62 63 63 64 64 64 64 64 64 64 64 64 64 64 64 64 64 64 64 63 64 64 64 64 64 64 64 64 63 63 64 63 63 63 63 64 64 64 64 63 63 63 63
0 63 63 64 64 64 64 65 65 65 65 65 65 65 65 65 65 66 66 66 66 66 66 66 65 64 64 64 64 64 65 65 66 66 66 66 66 66 67 66 66 65 65 65 66 66 67 66 66 66 65 65 66 67 67 67 67 67 67 66 66 66 66 66 67 67 66 66 66 65 66 67 68 68 68
-8 68 68 69 69 68 67 66 66 66 67 67 66 66 66 66 66 66 66 66 66 66 66 66 65 65 66 66 66 65 65 65 65 65 65 65 65 65 65 65 65 65 65 65 65 64 65 65 65 65 65 66 66 65 65 65 66 66 65 65 65 65 65 65 65 64 64 64 64 64 64 64 64 64
-15 64 64 64 64 64 64 65 64 64 64 64 65 65 65 65 65 65 65 65 64 63 63 63 64 64 64 64 64 65 65 65 65 65 65 65 64 64 65 66 66 66 66 67 67 68 70 70 70 69 69 69 69 69 69 69 68 67 66 65 65 65 65 65 65 65 65 65 66 66 65 65 64
-23 64 64 64 65 65 66 66 66 65 65 65 64 64 63 63 63 63 63 63 63 63 63 64 64 64 64 64 64 64 64 64 64 64 64 64 64 64 64 64 63 62 63 63 64 64 64 64 64 64 65 64 64 64 65 65 65 65 65 65 65 64 64 64 63 62 62 63 64 64 65 64 63
-31 63 63 63 63 63 63 63 63 63 62 62 63 62 63 63 63 63 64 64 64 64 64 64 64 64 64 64 63 63 62 62 62 62 61 61 62 62 62 63 64 64 64 64 64 63 63 62 62 62 62 62 62 62 62 62 62 62 61 61 61 61 60 61 61 62 62 62 62 61 60 60 60
$$ packed form
23F4J%%%%J%j%%%%%jj%%j%%jJJ%j%JJj%j%%%%%j%jJ%%JJ%Jj%j%jJJ%%%%J%j%j%j%%%%%%J%
15F2%%%%%J%JjjJ%%%j%%j%J%%J%%%%j%%%J%%%jj%J%%J%j%%%%%%%%%%%%Jj%%%%%%JJ%Jj%jJ
8F4J%j%%j%%J%j%j%J%%j%%J%%%%%%%j%%J%J%%%%%%%%%%%%%%%jJ%%%%%%%j%Jj%%%J%%%j%%%
0F3%J%%%J%%%%%%%%%J%%%%%%jj%%%%J%J%%%%%Jj%j%%J%Jj%%j%JJ%%%%%j%%%%J%j%%jJJJ%%
-8F8%J%jjj%%J%j%%%%%%%%%%%j%J%%j%%%%%%%%%%%%%%%jJ%%%%J%j%%J%j%%%%%%j%%%%%%%%
-15F4%%%%%Jj%%%J%%%%%%%jj%%J%%%%J%%%%%%j%JJ%%%J%JK%%j%%%%%%jjjj%%%%%%%%J%j%j
-23F4%%J%J%%j%%j%j%%%%%%%%J%%%%%%%%%%%%%%%%jjJ%J%%%%%Jj%%J%%%%%%j%%jj%JJ%Jjj
-31F3%%%%%%%%j%JjJ%%%J%%%%%%%%%j%j%%%j%J%%JJ%%%%j%j%%%%%%%%%%j%%%jJ%J%%%jj%%
$$ plain form
-38 60 61 61 62 61 61 61 60 60 61 61 60 60 60 60 60 60 60 60 60 60 61 61 62 61 61 61 60 60 61 61 61 61 61 62 62 62 61 61 61 61 60 60 59 59 59 60 60 60 60 60 60 60 60 61 61 61 61 60 59 60 60 60 61 61 60 60 60 59 59 59 60
-46 60 61 61 60 60 60 60 59 60 60 60 60 60 60 61 60 60 60 60 60 60 60 59 59 59 60 60 60 59 59 59 59 59 59 59 59 59 59 59 59 60 60 60 60 60 60 60 60 60 60 61 60 60 60 60 60 60 60 60 60 59 59 58 58 58 59 60 60 60 59 58 58
-53 58 58 58 58 59 59 59 59 59 58 58 58 57 57 58 59 60 60 60 60 60 60 60 61 61 60 60 60 61 60 60 60 60 60 59 59 59 58 58 58 58 58 58 58 58 58 58 59 60 60 59 59 59 60 60 60 60 60 60 59 59 59 60 61 60 60 59 58 58 58 59 59
-61 59 59 60 60 60 59 60 59 59 59 59 59 59 59 60 60 60 59 60 60 60 60 61 61 62 62 63 63 63 63 62 61 61 61 61 60 60 61 61 61 61 61 61 61 60 60 60 60 60 61 60 60 61 62 62 62 62 62 62 63 64 63 63 63 63 63 64 63 63 63 62 63
-68 63 63 63 64 64 63 64 63 62 61 61 61 61 61 62 62 62 62 62 62 62 61 61 61 61 62 62 62 63 63 64 64 63 62 63 63 63 63 63 64 64 64 64 63 63 64 63 62 62 62 62 62 62 62 62 62 62 62 62 62 63 63 62 62 62 62 62 62 61 61 61 61
-76 61 62 62 62 63 63 63 63 63 63 63 63 63 64 64 64 63 63 64 64 64 64 64 64 64 64 64 64 64 64 64 64 64 64 64 64 64 64 63 63 63 63 63 63 63 63 63 62 62 62 62 63 63 64 64 64 64 64 63 63 63 63 62 63 62 62 62 63 63 63 62 62
-83 62 63 64 64 63 63 63 63 63 62 63 63 64 64 65 64 64 63 63 62 62 62 63 63 63 64 65 65 64 64 64 63 63 63 63 63 64 64 63 62 62 62 62 63 63 62 63 63 62 61 62 62 62 62 62 62 62 63 63 64 64 64 63 63 63 64 64 64 64 64 64 63
-91 63 63 63 63 63 63 63 64 65 64 64 64 64 63 63 63 63 63 62 63 64 64 64 63 63 63 63 63 63 63 63 63 63 64 64 64 64 64 64 64 64 63 63 62 62 62 62 62 62 62 62 62 63 63 64 64 64 64 64 63 63 63 62 62 62 62 61 62 62 63 63 63
$$ packed form
-38F0J%Jj%%j%J%j%%%%%%%%%J%Jj%%j%J%%%%J%%j%%%j%j%%J%%%%%%%J%%%jjJ%%J%j%%j%%J
-46F0J%j%%%jJ%%%%%Jj%%%%%%j%%J%%j%%%%%%%%%%%J%%%%%%%%%Jj%%%%%%%%j%j%%JJ%%jj%
-53E8%%%J%%%%j%%j%JJJ%%%%%%J%j%%Jj%%%%j%%j%%%%%%%%%JJ%j%%J%%%%%j%%JJj%jj%%J%
-61E9%J%%jJj%%%%%%J%%jJ%%%J%J%J%%%jj%%%j%J%%%%%%j%%%%Jj%JJ%%%%%JJj%%%%Jj%%jJ
-68F3%%J%jJjjj%%%%J%%%%%%j%%%J%%J%J%jjJ%%%%J%%%j%Jjj%%%%%%%%%%%%J%j%%%%%j%%%
-76F1J%%J%%%%%%%%J%%j%J%%%%%%%%%%%%%%%%%%%j%%%%%%%%j%%%J%J%%%%j%%%jJj%%J%%j%
-83F2JJ%j%%%%jJ%J%Jj%j%j%%J%%JJ%j%%j%%%%J%jj%%%J%jJ%jjJ%%%%%%J%J%%j%%J%%%%%j
-91F3%%%%%%JJj%%%j%%%%jJJ%%j%%%%%%%%%J%%%%%%%j%j%%%%%%%%J%J%%%%j%%j%%%jJ%J%%
$$ plain form
-98 63 63 63 63 63 64 63 62 61 62 62 62 62 62 62 62 63 63 63 62 62 62 61 61 61 62 62 62 62 62 62 63 63 62 62 62 62 62 62 62 63 62 62 62 63 63 63 63 63 63 63 62 62 62 63 63 63 63 63 62 62 62 61 61 62 62 63 64 64 64 63 62
-106 62 62 61 62 62 62 62 62 62 62 62 62 62 62 62 62 62 62 62 62 61 61 60 61 61 61 62 62 62 62 63 63 63 63 62 62 62 63 62 62 62 62 62 62 62 61 60 60 61 61 62 62 62 62 62 61 61 61 61 61 61 61 62 62 63 63 63 62 62 62 63
-113 63 63 63 63 63 63 63 63 63 63 63 63 63 62 62 62 61 62 62 63 63 63 63 63 63 63 63 63 62 61 62 62 62 62 61 61 61 62 62 62 63 63 62 61 61 62 62 62 61 62 62 62 62 62 62 63 63 63 63 63 63 62 62 62 62 62 61 62 62 62 62
-121 62 62 62 62 63 62 62 62 63 62 62 62 61 62 62 61 62 62 62 62 63 63 63 63 63 63 62 62 61 61 61 62 62 62 63 63 63 63 63 62 63 63 63 62 62 63 63 63 64 64 65 65 64 64 63 63 62 62 62 63 64 64 63 63 63 63 64 63 63 63 63
-128 63 63 63 63 63 63 63 63 63 64 64 64 64 64 65 65 65 65 65 65 65 65 65 65 65 64 65 65 65 64 64 64 63 64 65 64 64 64 64 64 65 64 64 64 63 63 63 63 64 64 64 64 64 64 63 63 63 64 64 64 64 64 64 63 63 63 63 63 63 63 62
-135 62 63 63 63 63 63 63 63 64 64 63 63 63 64 64 64 64 64 63 63 64 64 64 64 64 64 64 64 64 63 63 63 62 62 62 62 62 62 62 63 63 63 63 64 64 64 64 65 64 64 64 63 63 63 63 63 62 62 62 62 62 62 62 63 63 63 64 64 64 63 63
-143 63 63 63 63 63 63 63 63 63 63 63 63 62 62 62 62 62 63 63 63 64 63 63 63 63 63 63 62 62 62 62 62 62 62 62 62 62 62 62 62 62 62 62 63 63 63 63 63 63 63 63 62 62 62 62 62 62 62 63 62 62 62 62 62 63 63 63 63 62 61 61
-150 61 61 62 62 62 62 62 62 62 62 61 61 61 61 62 63 63 63 63 63 64 64 63 63 63 63 63 63 62 62 62 62 62 62 62 62 62 62 62 62 62 62 61 62 62 62 62 62 63 62 62 62 62 61 60 60 61 60 60 60 60 61 60 60 60 61 61 62 63 62 63
$$ packed form
-98F3%%%%JjjjJ%%%%%%J%%j%%j%%J%%%%%J%j%%%%%%Jj%%J%%%%%%j%%J%%%%j%%j%J%JJ%%jj
-106F2%jJ%%%%%%%%%%%%%%%%j%jJ%%J%%%J%%%j%%Jj%%%%%%jj%J%J%%%%j%%%%%%J%J%%j%%J
-113F3%%%%%%%%%%%%j%%jJ%J%%%%%%%%jjJ%%%j%%J%%J%jj%J%%jJ%%%%%J%%%%%j%%%%jJ%%%
-121F2%%%Jj%%Jj%%jJ%jJ%%%J%%%%%j%j%%J%%J%%%%jJ%%j%J%%J%J%j%j%j%%JJ%j%%%Jj%%%
-128F3%%%%%%%%J%%%%J%%%%%%%%%%jJ%%j%%jJJj%%%%Jj%%j%%%J%%%%%j%%J%%%%%j%%%%%%j
-135F2J%%%%%%J%j%%J%%%%j%J%%%%%%%%j%%j%%%%%%J%%%J%%%Jj%%j%%%%j%%%%%%J%%J%%j%
-143F3%%%%%%%%%%%j%%%%J%%Jj%%%%%j%%%%%%%%%%%%%%%J%%%%%%%j%%%%%%Jj%%%%J%%%jj%
-150F1%J%%%%%%%j%%%JJ%%%%J%j%%%%%j%%%%%%%%%%%%%jJ%%%%Jj%%%jj%Jj%%%Jj%%J%JJjJ
$$ plain form
-158 63 63 63 63 63 63 62 62 62 61 61 61 61 61 61 61 61 61 61 61 61 61 61 61 61 61 61 61 61 61 61 62 62 62 62 61 61 61 61 61 61 61 62 61 61 61 61 61 61 61 60 60 60 60 60 60 60 60 60 59 59 60 60 61 61 62 61 60 61 61 62
-165 62 62 62 62 62 63 63 63 62 61 60 60 61 62 62 62 62 61 61 61 61 61 61 62 62 61 61 61 61 62 62 62 62 62 62 62 63 62 62 62 62 62 62 62 62 62 62 62 62 62 62 62 62 62 62 62 62 62 62 62 62 62 62 61 61 62 62 62 62 61 61
-173 61 60 61 61 61 61 62 62 62 62 62 62 63 63 63 63 63 62 62 62 62 62 62 62 63 63 63 63 62 63 63 63 63 63 63 63 63 63 64 64 64 64 64 64 64 64 64 63 63 63 62 62 63 62 63 64 64 64 64 64 64 65 64 64 64 64 64 64 64 64 64
-180 64 64 64 64 64 64 64 63 63 63 63 64 64 64 64 64 64 64 65 65 65 64 63 63 63 63 63 63 62 63 63 64 65 65 65 65 65 65 65 65 64 64 64 64 64 64 64 65 65 64 63 63 63 63 63 63 63 63 63 63 62 62 62 62 62 62 62 62 62 62 63
-187 63 63 63 63 63 63 63 63 63 63 63 63 63 63 62 62 62 62 62 62 62 61 61 61 61 61 61 62 62 61 60 60 60 60 60 61 62 62 62 62 62 61 61 61 60 61 61 61 60 60 60 60 61 61 61 61 61 62 62 62 62 61 61 62 62 62 60 60 60 61 62
-195 62 61 61 61 61 61 61 61 61 60 60 59 60 60 61 60 60 60 61 61 61 61 61 60 60 60 60 60 60 60 60 60 60 60 60 60 60 60 60 60 60 60 60 60 61 61 61 61 62 61 61 61 61 61 61 61 61 61 60 60 60 60 60 60 60 60 60 60 61 62 61
-202 61 61 60 60 60 60 60 60 60 60 60 59 59 59 59 60 60 60 60 60 60 60 60 60 60 61 61 61 60 60 59 60 60 60 60 60 60 61 61 61 61 61 61 61 61 60 60 60 59 60 60 60 61 61 60 59 59 59 58 59 59 59 59 60 60 60 60 59 60 59 59
-210 59 59 59 60 61 60 60 61 62 62 62 62 62 62 61 61 61 61 61 61 61 61 60 60 60 60 60 60 60 60 60 60 60 60 60 60 60 60 61 61 61 61 61 61 62 62 63 63 63 63 63 63 62 61 61 61 61 63 63 64 64 64 63 64 64 63 63 63 62 62 62
$$ packed form
-158F3%%%%%j%%j%%%%%%%%%%%%%%%%%%%%%J%%%j%%%%%%Jj%%%%%%j%%%%%%%%j%J%J%JjjJ%J
-165F2%%%%J%%jjj%JJ%%%j%%%%%J%j%%%J%%%%%%Jj%%%%%%%%%%%%%%%%%%%%%%%%%j%J%%%j%
-173F1jJ%%%J%%%%%J%%%%j%%%%%%J%%%jJ%%%%%%%%J%%%%%%%%j%%j%JjJJ%%%%%Jj%%%%%%%%
-180F4%%%%%%j%%%J%%%%%%J%%jj%%%%%jJ%JJ%%%%%%%j%%%%%%J%jj%%%%%%%%%j%%%%%%%%%J
-187F3%%%%%%%%%%%%%j%%%%%%j%%%%%J%jj%%%%JJ%%%%j%%jJ%%j%%%J%%%%J%%%j%J%%k%%JJ
-195F2j%%%%%%%j%jJ%Jj%%J%%%%j%%%%%%%%%%%%%%%%%%%%J%%%Jj%%%%%%%%j%%%%%%%%%JJj
-202F1%j%%%%%%%%j%%%J%%%%%%%%%J%%j%jJ%%%%%J%%%%%%%j%%jJ%%J%jj%%jJ%%%J%%%jJj%
-210E9%%JJj%JJ%%%%%j%%%%%%%j%%%%%%%%%%%%%%%J%%%%%J%J%%%%%jj%%%K%J%%jJ%j%%j%%
$$ plain form
-217 62 62 62 62 62 63 63 62 62 62 62 62 62 62 62 62 62 62 62 62 62 62 62 62 62 62 62 62 62 62 63 62 62 62 62 62 62 63 63 63 63 63 63 63 63 63 62 62 61 62 62 62 62 62 62 62 62 62 62 62 63 63 63 64 63 62 61 61 61 61 62
-224 62 62 62 62 62 62 62 61 60 60 61 62 62 61 61 62 62 62 63 62 62 62 63 63 63 62 62 62 61 61 61 61 61 61 62 62 62 62 62 62 62 61 61 62 62 62 62 62 62 62 61 61 61 61 61 61 60 60 60 60 61 61 62 62 62 63 63 62 61 61 61
-232 61 61 61 61 61 61 61 61 61 60 60 61 61 61 61 60 60 60 60 61 61 61 62 61 61 60 60 60 61 61 62 61 61 60 59 60 60 61 61 61 61 61 62 62 62 62 61 61 61 61 61 61 61 62 62 62 61 60 60 60 61 63 62 62 61 61 61 61 61 61 62
-239 62 62 62 62 62 61 60 60 60 60 60 60 60 60 60 60 60 60 61 61 62 62 62 61 61 61 61 61 61 60 60 60 60 61 60 60 61 61 62 62 62 61 61 60 60 60 61 60 60 60 61 61 60 60 60 61 61 62 62 62 62 62 61 62 62 62 62 62 61 61 61
-247 61 61 61 61 61 60 60 60 60 59 59 60 60 60 60 60 61 61 61 60 60 59 59 59 59 59 59 60 59 60 60 60 60 60 60 60 59 59 60 60 60 60 60 61 61 62 62 61 61 60 60 60 60 60 60 60 60 60 60 60 60 60 60 60 61 61 61 61 61 61 61
-254 61 62 62 61 61 60 60 61 61 62 62 61 60 60 61 61 61 60 60 60 61 61 61 60 59 59 58 58 59 60 62 62 62 62 62 61 60 60 60 59 59 59 60 60 60 61 61 61 60 60 61 61 61 61 61 60 61 61 61 61 61 60 60 60 60 61 60 60 61 61 61
-262 61 60 60 60 60 59 59 59 60 60 61 61 61 61 61 61 61 61 61 61 61 60 60 60 61 60 60 59 60 60 61 61 61 61 60 60 59 60 60 60 59 59 59 60 61 61 60 60 60 60 60 60 60 60 60 60 59 60 61 61 61 60 60 61 61 61 62 61 61 61 61
-269 61 62 62 62 62 62 61 61 61 61 61 60 60 59 59 60 60 60 60 60 61 61 61 61 61 62 62 62 62 62 62 62 62 62 62 62 62 62 62 62 61 61 61 62 62 61 61 61 61 61 60 60 60 61 61 61 61 61 61 62 62 63 63 63 62 62 62 62 62 62 62
$$ packed form
-217F2%%%%J%j%%%%%%%%%%%%%%%%%%%%%%Jj%%%%%J%%%%%%%%j%jJ%%%%%%%%%%J%%Jjjj%%%J
-224F2%%%%%%jj%JJ%j%J%%Jj%%J%%j%%j%%%%%J%%%%%%j%J%%%%%%j%%%%%j%%%J%J%%J%jj%%
-232F1%%%%%%%%j%J%%%j%%%J%%Jj%j%%J%Jj%jjJ%J%%%%J%%%j%%%%%%J%%jj%%JKj%j%%%%%J
-239F2%%%%jj%%%%%%%%%%%J%J%%j%%%%%j%%%Jj%J%J%%j%j%%Jj%%J%j%%J%J%%%%jJ%%%%j%%
-247F1%%%%j%%%j%J%%%%J%%j%j%%%%%JjJ%%%%%%j%J%%%%J%J%j%j%%%%%%%%%%%%%%J%%%%%%
-254F1J%j%j%J%J%jj%J%%j%%J%%jj%j%JJK%%%%jj%%j%%J%%J%%j%J%%%%jJ%%%%j%%%Jj%J%%
-262F1j%%%j%%J%J%%%%%%%%%%j%%Jj%jJ%J%%%j%jJ%%j%%JJ%j%%%%%%%%%jJJ%%j%J%%Jj%%%
-269F1J%%%%j%%%%j%j%J%%%%J%%%%J%%%%%%%%%%%%%%j%%J%j%%%%j%%J%%%%%J%J%%j%%%%%%
$$ plain form
-276 62 62 62 61 61 62 62 62 62 62 61 62 62 62 62 62 62 62 61 61 62 63 63 63 62 62 63 63 63 63 62 62 62 62 62 62 61 61 61 61 61 61 61 61 61 61 61 61 61 61 61 60 60 60 59 59 59 60 60 61 61 61 60 60 60 60 59 59 60 61 61
-284 61 61 61 62 62 61 62 62 62 61 60 60 60 60 60 61 61 61 61 61 61 61 61 60 60 61 61 61 61 61 61 61 61 61 62 62 62 62 62 62 61 61 62 62 62 62 62 61 61 61 61 60 60 60 60 60 61 61 61 61 61 61 61 61 61 61 61 60 60 60 61
-291 61 61 61 60 60 61 61 62 62 62 61 61 60 60 60 60 61 60 60 60 60 61 61 61 61 61 61 61 61 60 60 60 60 60 60 60 60 60 61 61 60 60 60 60 60 60 60 60 60 60 60 59 59 59 60 60 61 61 61 60 59 59 59 59 59 58 58 59 59 59 60
-299 60 60 60 60 60 60 60 59 59 59 59 59 59 59 59 59 59 59 60 60 60 61 61 61 62 61 61 60 60 60 60 60 61 61 60 60 60 60 60 60 60 60 61 61 61 61 60 60 59 59 58 59 59 59 60 59 59 59 58 59 59 60 60 60 60 59 59 59 59 60 60
-306 60 60 61 61 61 61 60 60 60 61 60 60 60 60 60 59 59 59 59 60 60 60 60 61 61 61 60 60 59 59 59 60 60 60 59 59 59 59 59 59 58 58 58 58 58 59 59 59 60 60 60 60 60 59 59 58 58 58 59 59 59 59 58 59 59 59 59 59 59 60 60
-313 60 60 60 60 60 60 59 59 59 60 61 61 61 61 61 61 61 60 60 61 61 60 59 59 60 60 60 60 60 60 59 59 59 60 61 61 60 60 60 60 60 60 60 60 60 60 60 59 59 60 61 61 61 61 61 61 60 60 60 60 60 61 60 59 59 59 60 60 59 58 58
-321 58 59 59 60 60 60 60 60 61 61 61 61 60 60 60 60 60 60 59 60 61 62 61 61 61 61 60 60 60 60 60 60 60 61 62 63 62 61 61 61 60 60 60 60 61 60 60 60 60 60 60 61 61 60 60 60 61 61 61 61 61 61 61 62 62 61 60 60 59 60 60
-328 60 60 60 60 60 60 60 60 61 61 61 61 61 62 62 62 61 60 60 60 60 60 60 60 60 60 60 60 61 61 61 62 62 62 62 61 61 61 61 61 61 61 60 60 59 59 59 59 60 60 60 60 60 60 60 60 59 60 60 61 61 61 61 61 61 61 60 60 60 60 60
$$ packed form
-276F2%%j%J%%%%jJ%%%%%%j%JJ%%j%J%%%j%%%%%j%%%%%%%%%%%%%%j%%j%%J%J%%j%%%j%JJ%
-284F1%%J%jJ%%jj%%%%J%%%%%%%j%J%%%%%%%%J%%%%%j%J%%%%j%%%j%%%%J%%%%%%%%%%j%%J
-291F1%%j%J%J%%j%j%%%Jj%%%J%%%%%%%j%%%%%%%%J%j%%%%%%%%%%j%%J%J%%jj%%%%j%J%%J
-299F0%%%%%%j%%%%%%%%%%J%%J%%Jj%j%%%%J%j%%%%%%%J%%%j%j%jJ%%Jj%%jJ%J%%%j%%%J%
-306F0%J%%%j%%Jj%%%%j%%%J%%%J%%j%j%%J%%j%%%%%j%%%%J%%J%%%%j%j%%J%%%jJ%%%%%J%
-313F0%%%%%j%%JJ%%%%%%j%J%jj%J%%%%%j%%JJ%j%%%%%%%%%%j%JJ%%%%%j%%%%Jjj%%J%jj%
-321E8J%J%%%%J%%%j%%%%%jJJJj%%%j%%%%%%JJJjj%%j%%%Jj%%%%%J%j%%J%%%%%%J%jj%jJ%
-328F0%%%%%%%J%%%%J%%jj%%%%%%%%%%J%%J%%%j%%%%%%j%j%%%J%%%%%%%jJ%J%%%%%%j%%%%
$$ plain form
-336 60 60 60 60 60 59 59 60 61 61 61 61 61 61 61 61 62 62 61 61 61 61 61 60 61 61 61 61 62 61 61 62 62 62 62 62 61 61 61 61 62 62 62 62 62 61 61 61 61 61 61 62 62 61 60 60 60 60 60 60 60 60 61 61 61 62 62 62 62 61 61
-343 61 61 60 60 61 61 61 61 61 61 61 61 61 60 60 59 59 59 59 60 61 62 62 62 62 62 63 62 61 60 60 60 61 63 63 63 62 62 62 62 62 61 60 59 59 60 60 61 61 61 62 61 61 61 60 60 60 60 60 60 59 59 59 60 60 60 60 60 59 59 59
-351 59 60 61 62 62 62 63 62 62 61 60 59 59 59 59 60 60 61 62 61 61 61 62 61 61 60 60 59 59 59 59 60 60 60 59 59 59 59 59 59 59 60 59 59 59 59 59 59 59 59 60 60 60 60 60 60 60 60 60 59 59 60 60 60 61 61 61 61 60 59 59
-358 59 59 59 59 59 59 59 59 59 59 58 58 58 58 58 58 58 58 57 57 57 57 57 58 58 59 59 59 59 59 59 58 58 58 58 58 58 58 58 59 58 59 59 58 59 59 60 59 59 59 59 60 59 59 59 60 59 58 58 58 57 58 58 58 58 58 58 58 58 59 59
-365 59 58 58 58 57 57 56 56 56 56 56 56 57 58 58 58 58 57 57 56 56 56 57 57 58 57 57 56 56 56 56 57 57 56 57 58 59 59 58 58 57 56 56 56 56 56 57 57 57 57 57 57 57 56 56 56 56 56 56 57 58 57 57 57 56 56 56 56 56 56 57
-373 57 57 57 57 58 57 57 57 57 58 58 57 57 57 57 57 57 58 58 58 57 57 58 58 58 58 57 57 58 58 58 58 58 58 58 58 57 57 57 57 58 58 58 58 58 58 58 58 58 58 58 58 57 57 57 57 57 57 57 57 57 57 57 57 57 57 57 57 57 57 58
-380 58 58 58 58 59 59 59 58 57 57 57 57 57 57 57 57 57 57 57 57 57 58 58 58 59 58 58 58 58 58 58 58 58 57 57 58 59 59 59 59 59 59 59 59 59 59 58 59 59 59 59 59 59 59 59 59 58 57 57 57 57 57 57 56 56 57 58 58 57 57 57
-388 57 58 59 59 59 59 59 59 58 58 58 58 58 57 58 58 58 58 58 58 59 59 59 59 59 58 58 57 57 57 57 57 57 58 58 58 58 58 59 59 58 58 57 58 58 58 58 58 58 58 58 58 57 57 58 59 59 59 59 59 59 58 58 58 59 59 59 59 59 58 58
$$ packed form
-336F0%%%%j%JJ%%%%%%%J%j%%%%jJ%%%Jj%J%%%%j%%%J%%%%j%%%%%J%jj%%%%%%%J%%J%%%j%
-343F1%j%J%%%%%%%%j%j%%%JJJ%%%%Jjjj%%JK%%j%%%%jjj%J%J%%Jj%%j%%%%%j%%J%%%%j%%
-351E9JJJ%%Jj%jjj%%%J%JJj%%Jj%j%j%%%J%%j%%%%%%Jj%%%%%%%J%%%%%%%%j%J%%J%%%jj%
-358E9%%%%%%%%%j%%%%%%%j%%%%J%J%%%%%j%%%%%%%JjJ%jJ%Jj%%%Jj%%Jjj%%jJ%%%%%%%J%
-365E9j%%j%j%%%%%JJ%%%j%j%%J%Jj%j%%%J%jJJJ%j%jj%%%%J%%%%%%j%%%%%JJj%%j%%%%%J
-373E7%%%Jj%%%J%j%%%%%J%%j%J%%%j%J%%%%%%%j%%%J%%%%%%%%%%%j%%%%%%%%%%%%%%%%%J
-380E8%%%J%%jj%%%%%%%%%%%%J%%Jj%%%%%%%j%JJ%%%%%%%%%jJ%%%%%%%%jj%%%%%j%JJ%j%%
-388E7JJ%%%%%j%%%%jJ%%%%%J%%%%j%j%%%%%J%%%%J%j%jJ%%%%%%%%j%JJ%%%%%j%%J%%%%j%
$$ plain form
-395 58 58 58 58 58 58 58 58 58 58 59 59 59 59 59 59 59 59 59 58 57 57 58 59 59 59 59 59 59 59 58 58 58 58 58 57 57 57 57 57 57 57 57 57 58 58 58 57 57 58 58 59 59 59 58 59 59 59 58 58 57 57 57 57 57 57 58 58 59 60 61
-402 61 60 60 59 58 58 58 59 59 58 59 59 59 58 58 58 58 58 58 58 58 58 58 58 58 58 58 57 57 57 57 57 58 58 59 59 58 58 57 57 58 58 57 58 59 58 58 58 58 58 58 58 58 58 58 57 57 57 58 59 60 60 60 60 59 59 59 59 59 58 58
-410 58 58 58 57 57 57 57 57 57 58 58 58 58 58 58 58 57 57 58 57 57 57 57 57 57 57 56 56 57 57 57 58 58 58 58 59 58 58 58 58 58 57 57 57 57 57 57 57 57 58 58 57 56 57 57 57 57 57 57 58 58 58 58 58 58 58 58 58 58 59 58
-417 58 58 58 58 58 58 58 58 57 57 57 57 58 58 58 57 57 57 57 58 58 58 59 59 59 59 59 59 59 58 58 58 57 58 59 58 57 57 57 58 59 60 60 61 62 61 60 59 58 58 58 58 58 58 58 58 58 58 59 59 59 59 59 59 59 60 60 59 58 58 58
-425 58 58 58 58 59 59 59 59 59 59 59 59 59 59 59 59 59 59 59 58 59 59 59 59 60 60 60 60 59 59 59 59 60 60 60 60 60 60 60 60 60 60 61 61 61 60 59 60 61 61 61 61 61 60 60 59 58 58 59 59 60 59 59 58 58 58 58 59 59 60 60
-432 60 61 61 60 60 59 59 59 60 60 61 61 61 60 60 59 59 58 58 59 59 59 58 58 58 58 59 59 59 59 60 59 59 59 59 59 60 60 60 60 59 59 58 59 59 59 59 59 59 59 59 60 60 59 59 59 60 60 60 60 60 59 59 59 59 59 59 59 59 59 59
-440 59 59 59 59 58 59 59 59 59 59 60 59 59 59 59 59 59 59 59 59 59 59 59 60 60 60 60 60 60 60 60 60 59 59 59 59 59 59 59 59 60 60 60 60 61 61 60 60 60 59 58 59 59 59 59 59 60 60 60 59 59 59 58 58 58 58 59 59 59 59 59
-447 59 59 59 59 59 59 59 59 60 60 60 60 61 61 61 61 61 60 60 60 61 61 61 61 60 60 60 59 59 59 59 58 58 58 58 58 59 59 59 60 60 60 60 59 59 59 60 60 60 59 58 58 58 58 59 59 59 59 59 59 59 60 59 60 60 60 59 59 59 59 58
$$ packed form
-395E8%%%%%%%%%J%%%%%%%%jj%JJ%%%%%%j%%%%j%%%%%%%%J%%j%J%J%%jJ%%j%j%%%%%J%JJJ
-402F1j%jj%%J%jJ%%j%%%%%%%%%%%%%j%%%%J%J%j%j%J%jJJj%%%%%%%%%j%%JJJ%%%j%%%%j%
-410E8%%j%%%%%J%%%%%%j%Jj%%%%%%j%J%%J%%%Jj%%%%j%%%%%%%J%jjJ%%%%%J%%%%%%%%%Jj
-417E8%%%%%%%j%%%J%%j%%%J%%J%%%%%%j%%jJJjj%%JJJ%JJjjjj%%%%%%%%%J%%%%%%J%jj%%
-425E8%%%J%%%%%%%%%%%%%%jJ%%%J%%%j%%%J%%%%%%%%%J%%jjJJ%%%%j%jj%J%Jj%j%%%J%J%
-432F0J%j%j%%J%J%%j%j%j%J%%j%%%J%%%Jj%%%%J%%%j%jJ%%%%%%%J%j%%J%%%%j%%%%%%%%%
-440E9%%%jJ%%%%Jj%%%%%%%%%%%J%%%%%%%%j%%%%%%%J%%%J%j%%jjJ%%%%J%%j%%j%%%J%%%%
-447E9%%%%%%%J%%%J%%%%j%%J%%%j%%j%%%j%%%%J%%J%%%j%%J%%jj%%%J%%%%%%JjJ%%j%%%j
$$ plain form
-454 58 59 59 59 59 60 60 60 59 59 59 59 59 59 58 59 59 58 59 58 58 58 59 59 60 60 59 59 59 59 59 59 60 60 60 59 58 58 58 58 58 58 59 59 59 59 59 60 60 60 59 58 58 59 59 58 59 60 60 60 60 60 60 59 59 59 60 60 59 58 59
-462 59 58 59 59 59 59 59 59 59 58 58 58 58 58 58 58 58 58 57 57 58 58 58 58 57 58 59 59 58 57 57 58 58 58 57 57 57 58 58 59 59 59 58 58 59 59 59 58 58 57 57 57 57 58 57 57 57 58 58 57 57 57 57 57 58 58 58 58 58 58 59
-469 59 58 58 58 58 58 58 58 58 58 59 58 58 58 58 57 57 57 57 57 57 57 57 58 58 58 58 59 59 59 59 59 60 60 60 59 58 58 58 58 59 59 59 59 59 59 58 59 59 59 59 59 59 59 59 58 58 58 58 59 59 59 59 59 59 58 58 58 58 58 58
-477 58 57 57 58 58 58 57 57 57 57 57 57 58 58 58 58 58 58 58 58 58 58 57 57 57 58 58 58 57 57 57 57 57 57 57 57 57 58 59 59 59 58 58 58 58 57 57 56 56 57 58 58 57 58 58 59 59 58 58 57 57 57 57 57 58 58 58 58 58 58 57
-484 57 57 57 57 58 58 58 58 58 58 58 58 58 58 59 59 59 59 58 59 59 59 58 58 57 57 58 58 58 58 58 58 58 58 58 59 59 59 58 58 58 58 57 57 57 57 56 57 58 57 57 57 57 58 58 58 58 58 57 57 57 58 58 58 58 58 58 58 58 58 59
-491 59 59 59 58 57 57 57 57 58 57 57 57 57 57 57 57 57 58 58 57 56 56 56 57 58 59 59 60 60 59 59 59 58 58 58 59 58 58 58 58 58 58 58 57 57 56 56 56 57 57 57 57 58 58 59 59 59 59 58 57 56 56 56 56 56 57 57 57 58 57 57
-499 57 57 56 57 57 57 57 57 57 57 57 57 57 57 57 57 57 57 57 57 57 57 57 56 56 56 56 56 57 57 57 57 57 57 57 57 57 57 57 57 57 57 57 57 57 57 57 57 57 58 58 58 58 58 57 56 56 56 57 57 57 57 57 56 56 56 56 56 56 56 56
-506 56 56 56 56 57 57 57 57 57 58 58 58 58 57 58 58 58 58 58 58 57 56 56 57 57 57 57 57 57 57 56 56 57 57 57 56 56 56 56 57 57 57 57 56 56 56 56 57 57 58 58 57 57 56 55 56 56 56 57 56 56 56 57 57 57 57 57 56 56 56 56
$$ packed form
-454E8J%%%J%%j%%%%%jJ%jJj%%J%J%j%%%%%J%%jj%%%%%J%%%%J%%jj%J%jJJ%%%%%j%%J%jjJ
-462E9jJ%%%%%%j%%%%%%%%j%J%%%jJJ%jj%J%%j%%J%J%%j%J%%j%j%%%Jj%%J%j%%%%J%%%%%J
-469E9j%%%%%%%%Jj%%%j%%%%%%%J%%%J%%%%J%%jj%%%J%%%%%jJ%%%%%%%j%%%J%%%%%j%%%%%
-477E8j%J%%j%%%%%J%%%%%%%%%j%%J%%j%%%%%%%%JJ%%j%%%j%j%JJ%jJ%J%j%j%%%%J%%%%%j
-484E7%%%J%%%%%%%%%J%%%jJ%%j%j%J%%%%%%%%J%%j%%%j%%%jJJj%%%J%%%%j%%J%%%%%%%%J
-491E9%%jj%%%Jj%%%%%%%J%jj%%JJJ%J%j%%j%%Jj%%%%%%j%j%%J%%%J%J%%%jjj%%%%J%%Jj%
-499E7%jJ%%%%%%%%%%%%%%%%%%%j%%%%J%%%%%%%%%%%%%%%%%%%%J%%%%jj%%J%%%%j%%%%%%%
-506E6%%%J%%%%J%%%jJ%%%%%jj%J%%%%%%j%J%%j%%%J%%%j%%%J%J%j%jjJ%%Jj%%J%%%%j%%%
$$ plain form
-514 56 56 56 56 55 55 56 56 56 56 55 55 56 55 55 55 56 56 55 55 55 55 55 55 56 56 57 57 57 58 58 58 58 58 57 57 57 57 56 56 57 57 57 57 56 56 55 56 56 57 57 57 57 58 57 57 56 56 55 56 56 57 57 57 58 58 58 58 58 57 57
-521 57 57 57 57 57 56 56 57 57 57 58 58 58 58 58 58 58 58 58 58 58 58 58 57 57 57 57 57 56 55 55 57 58 58 58 58 57 57 57 56 56 56 56 55 55 55 55 55 56 56 56 57 57 57 57 56 57 57 57 57 58 58 58 58 58 58 58 58 58 58 59
-529 59 59 59 59 59 59 58 58 57 57 57 56 56 56 57 58 58 58 58 58 59 59 59 58 57 56 56 56 55 56 56 56 56 57 57 57 57 57 57 58 58 58 58 58 58 58 57 57 58 58 58 58 58 57 57 57 56 56 57 57 57 57 57 57 58 57 57 57 58 58 58
-536 58 58 58 58 57 57 57 56 56 57 57 57 57 57 57 57 57 56 56 56 56 56 57 56 55 55 55 55 56 56 56 55 56 56 56 55 56 56 57 57 58 58 57 56 56 56 57 57 57 57 57 57 57 57 57 58 58 58 57 57 57 57 57 57 57 57 56 56 56 56 56
-543 56 57 57 57 57 57 57 56 56 56 56 56 56 56 56 56 56 56 56 56 56 56 56 56 56 57 57 56 56 56 56 56 56 56 56 55 55 55 55 55 55 55 55 56 57 57 56 56 57 57 57 57 56 56 56 56 55 55 56 56 56 55 55 55 55 55 55 54 54 55 55
-551 55 55 56 56 56 57 57 57 58 58 57 57 57 57 57 58 58 57 57 57 56 56 56 56 56 57 56 56 56 56 56 56 56 55 54 54 54 55 55 56 56 55 55 55 54 54 55 55 55 56 56 57 57 57 57 56 56 57 57 57 56 57 57 57 57 57 57 56 56 56 56
-558 56 56 56 56 56 56 56 56 55 55 55 56 56 57 57 57 57 56 55 55 55 55 56 56 56 56 56 55 55 55 55 56 56 56 56 56 56 56 56 55 56 56 56 57 56 56 56 56 56 57 57 56 56 56 57 57 57 56 55 55 55 56 57 57 57 56 55 55 55 55 56
-566 56 56 55 55 55 55 55 56 56 56 56 56 56 56 56 56 56 55 55 55 55 56 57 56 56 56 56 56 56 56 56 56 56 56 56 56 56 56 55 55 56 57 57 57 58 58 57 57 57 57 56 56 56 55 55 55 56 56 56 56 55 55 56 56 57 57 57 57 57 58 58
$$ packed form
-514E6%%%j%J%%%j%Jj%%J%j%%%%%J%J%%J%%%%j%%%j%J%%%j%jJ%J%%%Jj%j%jJ%J%%J%%%%j%
-521E7%%%%j%J%%J%%%%%%%%%%%%j%%%%jj%KJ%%%j%%j%%%j%%%%J%%J%%%jJ%%%J%%%%%%%%%J
-529E9%%%%%j%j%%j%%JJ%%%%J%%jjj%%jJ%%%J%%%%%J%%%%%%j%J%%%%j%%j%J%%%%%Jj%%J%%
-536E8%%%j%%j%J%%%%%%%j%%%%Jjj%%%J%%jJ%%jJ%J%J%jj%%J%%%%%%%%J%%j%%%%%%%j%%%%
-543E6J%%%%%j%%%%%%%%%%%%%%%%%J%j%%%%%%%j%%%%%%%JJ%j%J%%%j%%%j%J%%j%%%%%j%J%
-551E5%J%%J%%J%j%%%%J%j%%j%%%%Jj%%%%%%jj%%J%J%j%%j%J%%J%J%%%j%J%%jJ%%%%%j%%%
-558E6%%%%%%%j%%J%J%%%jj%%%J%%%%j%%%J%%%%%%%jJ%%Jj%%%%J%j%%J%%jj%%JJ%%jj%%%J
-566E6%j%%%%J%%%%%%%%%j%%%JJj%%%%%%%%%%%%%%j%JJ%%J%j%%%j%%j%%J%%%j%J%J%%%%J%
$$ plain form
-573 58 57 57 57 57 57 57 57 57 57 57 57 58 58 58 59 59 59 58 57 57 57 57 57 58 58 58 58 57 57 58 57 57 57 56 56 56 55 55 55 55 55 56 56 56 56 56 56 57 57 57 57 56 56 56 56 56 56 56 56 56 56 56 56 56 55 55 55 56 56 56
-580 56 56 56 56 56 56 57 56 55 56 56 56 56 57 58 57 57 57 57 57 57 58 58 57 57 56 56 57 58 58 58 58 58 57 57 57 57 57 57 57 57 57 57 57 58 58 58 58 58 58 58 58 57 57 58 58 58 58 58 58 58 58 58 57 57 57 57 58 58 58 57
-588 57 57 57 57 57 56 56 56 56 56 56 56 56 56 56 56 57 57 57 58 57 57 57 58 58 58 57 57 57 57 57 56 57 57 57 58 58 58 58 57 57 57 57 57 57 57 57 58 58 58 58 58 58 57 57 57 57 58 59 59 59 59 59 59 60 59 59 58 58 58 58
-595 58 58 58 57 57 57 57 57 57 57 57 57 58 58 58 58 58 58 58 59 59 58 58 58 58 58 58 58 57 57 57 58 59 58 58 58 58 58 58 58 59 59 59 58 58 57 57 57 57 56 57 57 58 58 59 60 60 60 60 60 60 59 59 59 58 58 58 59 59 58 58
-603 58 58 57 57 57 57 57 58 58 58 59 58 58 58 57 57 57 57 57 58 58 58 58 58 58 59 59 59 58 58 58 58 57 56 57 58 58 58 57 58 58 58 58 57 57 57 58 58 58 58 58 58 58 58 57 58 58 58 58 59 59 58 58 58 57 57 57 57 57 58 58
-610 58 58 58 58 58 58 59 58 58 58 58 58 58 58 57 57 57 57 58 58 57 57 57 57 57 57 57 58 58 57 57 57 57 57 57 57 57 57 57 57 57 58 57 56 57 56 56 56 56 57 57 58 59 58 57 57 57 58 58 58 57 57 57 57 56 57 57 57 57 57 57
-618 57 57 58 58 58 57 57 57 57 58 58 58 58 58 58 58 58 58 58 58 58 58 58 58 58 57 57 57 57 57 57 58 59 58 58 58 57 57 57 57 57 57 57 57 56 56 56 56 56 56 57 57 57 57 57 58 58 58 59 59 59 59 59 59 59 59 59 58 58 58 57
-625 57 57 57 57 57 57 57 57 56 56 57 58 59 58 58 58 58 57 57 57 57 57 56 56 55 56 56 56 56 56 56 55 55 56 56 56 56 56 56 56 56 55 55 54 54 54 55 55 56 55 56 56 56 56 55 55 54 54 55 55 55 55 55 56 55 55 55 56 56 56 56
$$ packed form
-573E8j%%%%%%%%%%J%%J%%jj%%%%J%%%j%Jj%%j%%j%%%%J%%%%%J%%%j%%%%%%%%%%%%j%%J%%
-580E6%%%%%JjjJ%%%JJj%%%%%J%j%j%JJ%%%%j%%%%%%%%%%J%%%%%%%j%J%%%%%%%%j%%%J%%j
-588E7%%%%j%%%%%%%%%%J%%Jj%%J%%j%%%%jJ%%J%%%j%%%%%%%J%%%%%j%%%JJ%%%%%Jj%j%%%
-595E8%%j%%%%%%%%J%%%%%%J%j%%%%%%j%%JJj%%%%%%J%%j%j%%%jJ%J%JJ%%%%%j%%j%%J%j%
-603E8%j%%%%J%%Jj%%j%%%%J%%%%%J%%j%%%jjJJ%%jJ%%%j%%J%%%%%%%jJ%%%J%j%%j%%%%J%
-610E8%%%%%Jj%%%%%%j%%%J%j%%%%%%J%j%%%%%%%%%%%JjjJj%%%J%JJjj%%J%%j%%%jJ%%%%%
-618E7%J%%j%%%J%%%%%%%%%%%%%%%j%%%%%JJj%%j%%%%%%%j%%%%%J%%%%J%%J%%%%%%%%j%%j
-625E7%%%%%%%j%JJJj%%%j%%%%j%jJ%%%%%j%J%%%%%%%j%j%%J%JjJ%%%j%j%J%%%%Jj%%J%%%
$$ plain form
-632 56 56 55 56 55 55 55 55 55 56 56 56 56 56 55 56 56 56 56 56 57 57 57 57 57 57 56 55 54 54 55 55 55 55 55 54 54 54 55 56 56 56 56 56 56 56 56 56 56 56 56 55 56 56 55 55 55 54 54 54 55 56 57 56 56 55 55 55 56 56 55
-640 55 55 55 55 55 55 55 55 55 55 55 55 56 56 56 56 56 55 55 55 56 56 56 57 57 56 56 55 55 54 54 54 54 55 55 55 55 55 55 55 55 55 55 55 55 55 55 55 54 54 54 54 53 54 54 54 55 55 54 54 54 55 55 55 55 55 54 55 55 55 55
-647 55 55 55 55 55 56 56 55 55 56 56 56 56 55 54 55 55 55 56 56 56 56 56 56 55 55 56 56 56 56 56 56 56 56 55 55 55 56 56 57 57 56 56 55 55 55 55 55 55 55 54 54 54 55 55 55 55 55 55 55 55 55 56 56 56 56 56 55 56 56 56
-655 56 56 55 55 55 55 55 56 56 56 56 55 55 55 55 55 56 56 56 56 56 56 57 56 56 56 56 57 57 56 56 56 56 56 56 56 56 56 56 57 57 57 56 56 56 56 56 56 57 57 57 58 57 56 56 55 56 56 56 56 55 55 56 56 56 56 56 57 57 57 57
-662 57 57 57 57 57 57 57 57 57 57 57 56 55 55 55 56 57 57 57 56 57 57 57 56 57 57 56 56 57 57 57 57 57 57 57 57 58 58 58 58 57 57 57 56 57 58 58 58 58 57 56 57 58 58 58 58 58 57 57 57 57 57 57 57 57 58 58 58 58 58 57
-669 57 57 57 57 57 56 57 57 57 57 57 57 57 57 57 57 57 57 57 58 58 58 58 57 57 58 58 58 58 58 57 57 57 56 56 56 57 57 57 57 58 58 58 58 58 58 58 58 58 58 59 58 58 58 58 58 57 57 57 58 58 58 59 59 58 57 57 56 56 56 57
-677 57 57 57 57 57 57 57 56 56 56 56 56 56 56 57 57 57 57 57 57 57 57 57 58 58 58 59 58 58 57 57 57 57 57 56 56 57 57 57 57 56 56 56 56 57 56 56 56 56 56 56 56 56 56 57 57 57 58 58 57 57 57 56 56 56 56 56 56 56 56 56
-684 56 56 56 56 56 56 56 57 57 57 57 57 57 57 57 57 57 57 58 58 58 58 58 58 58 58 57 57 57 57 57 56 56 56 57 57 57 57 57 57 57 57 57 57 57 57 56 56 56 56 56 56 56 57 57 56 56 55 55 56 56 57 57 57 58 58 58 57 57 57 56
$$ packed form
-632E6%jJj%%%%J%%%%jJ%%%%J%%%%%jjj%J%%%%j%%JJ%%%%%%%%%%%jJ%j%%j%%JJJj%j%%J%j
-640E5%%%%%%%%%%%J%%%%j%%J%%J%j%j%j%%%J%%%%%%%%%%%%%%j%%%jJ%%J%j%%J%%%%jJ%%%
-647E5%%%%J%j%J%%%jjJ%%J%%%%%j%J%%%%%%%j%%J%J%j%j%%%%%%j%%J%%%%%%%%J%%%%jJ%%
-655E6%j%%%%J%%%j%%%%J%%%%%Jj%%%J%j%%%%%%%%%J%%j%%%%%J%%Jjj%jJ%%%j%J%%%%J%%%
-662E7%%%%%%%%%%jj%%JJ%%jJ%%jJ%j%J%%%%%%%J%%%j%%jJJ%%%jjJJ%%%%j%%%%%%%J%%%%j
-669E7%%%%jJ%%%%%%%%%%%%J%%%j%J%%%%j%%j%%J%%%J%%%%%%%%%Jj%%%%j%%J%%J%jj%j%%J
-677E7%%%%%%j%%%%%%J%%%%%%%%J%%Jj%j%%%%j%J%%%j%%%Jj%%%%%%%%J%%J%j%%j%%%%%%%%
-684E6%%%%%%J%%%%%%%%%%J%%%%%%%j%%%%j%%J%%%%%%%%%%%j%%%%%%J%j%j%J%J%%J%%j%%j
$$ plain form
-692 56 55 55 55 56 56 57 57 57 57 57 57 56 56 56 56 56 56 56 56 57 57 57 57 57 56 56 56 57 57 57 56 55 56 57 57 57 57 57 56 56 55 55 55 56 56 56 56 55 55 55 56 56 56 56 56 56 56 57 57 57 58 58 57 57 57 57 56 56 56 55
-699 55 55 55 55 55 55 56 56 56 56 55 56 55 55 56 56 56 56 57 57 56 56 56 56 56 56 56 56 56 56 56 56 56 56 56 55 55 55 55 55 55 55 55 55 55 55 56 56 56 56 56 56 56 56 55 55 55 55 55 55 55 56 56 56 56 56 56 56 57 56 56
-707 56 56 55 55 55 55 54 54 54 54 54 55 55 55 55 56 56 56 57 57 57 57 56 56 55 55 55 56 57 56 56 56 56 55 55 55 55 56 56 56 57 56 56 55 55 55 55 55 55 55 55 54 54 54 55 55 55 55 56 56 56 57 57 56 56 56 56 56 55 55 55
-714 55 55 55 55 55 55 55 55 55 55 55 55 56 56 56 55 54 54 55 55 56 55 55 55 55 55 55 55 55 55 55 55 55 55 55 55 55 56 56 56 56 56 55 55 56 56 56 56 57 56 56 55 54 54 54 54 54 55 55 55 55 54 54 55 55 56 56 56 56 57 57
-721 57 57 57 56 56 55 56 56 55 55 55 54 54 55 56 56 56 57 57 56 56 55 55 55 55 55 55 55 55 55 56 56 56 56 56 56 56 56 55 56 56 56 56 56 56 56 56 56 56 56 56 56 56 56 55 55 56 56 56 56 56 56 56 56 56 56 56 55 56 56 57
-729 57 58 58 57 57 56 56 56 56 56 56 56 56 56 56 56 56 56 56 56 56 56 57 58 58 57 57 56 56 56 55 55 54 55 55 55 55 55 56 56 56 57 57 58 58 57 56 55 55 55 55 55 55 55 55 55 55 56 55 55 55 55 55 55 55 56 57 57 57 56 56
-736 56 55 55 56 57 56 56 56 57 57 57 57 57 57 57 57 57 58 57 57 56 56 56 56 56 56 56 56 56 56 56 56 56 57 58 57 57 57 57 57 57 57 57 57 57 57 57 57 57 57 57 56 56 56 56 56 56 56 57 57 56 56 56 56 56 56 55 55 56 56 56
-744 56 56 56 56 56 56 56 55 55 55 56 56 57 57 56 56 56 56 56 56 55 56 56 56 57 57 58 58 58 57 56 56 56 56 55 55 56 56 56 55 56 56 55 55 55 55 55 55 55 55 56 56 55 56 56 57 56 56 56 57 57 57 57 57 57 56 55 55 55 56 56
$$ packed form
-692E6j%%J%J%%%%%j%%%%%%%J%%%%j%%J%%jjJJ%%%%j%j%%J%%%j%%J%%%%%%J%%J%j%%%j%%j
-699E5%%%%%J%%%jJj%J%%%J%j%%%%%%%%%%%%%%j%%%%%%%%%%J%%%%%%%j%%%%%%J%%%%%%Jj%
-707E6%j%%%j%%%%J%%%J%%J%%%j%j%%JJj%%%j%%%J%%Jj%j%%%%%%%j%%J%%%J%%J%j%%%%j%%
-714E5%%%%%%%%%%%J%%jj%J%Jj%%%%%%%%%%%%%%%J%%%%j%J%%%Jj%jj%%%%J%%%j%J%J%%%J%
-721E7%%j%jJ%j%%j%JJ%%J%j%j%%%%%%%%J%%%%%%%jJ%%%%%%%%%%%%%%j%J%%%%%%%%%%jJ%J
-729E7J%j%j%%%%%%%%%%%%%%%%JJ%j%j%%j%jJ%%%%J%%J%J%jjj%%%%%%%%%Jj%%%%%%JJ%%j%
-736E6j%JJj%%J%%%%%%%%Jj%j%%%%%%%%%%%%JJj%%%%%%%%%%%%%%%j%%%%%%J%j%%%%%j%J%%
-744E6%%%%%%j%%J%J%j%%%%%jJ%%J%J%%jj%%%j%J%%jJ%j%%%%%%%J%jJ%Jj%%J%%%%%jj%%J%
$$ plain form
-751 56 56 56 56 56 56 56 57 57 57 56 56 56 56 56 56 56 56 56 56 56 55 55 56 56 56 57 57 57 56 56 57 57 57 57 56 56 56 57 57 57 57 57 57 57 56 56 56 56 56 56 55 54 54 54 54 54 55 55 56 56 56 56 55 56 56 56 56 56 56 57
-758 57 56 56 56 57 57 57 57 57 57 57 57 57 57 56 56 56 56 56 57 57 58 58 57 57 57 57 57 57 57 57 57 57 57 57 57 57 57 57 57 57 56 56 56 56 56 56 56 57 56 56 56 56 56 56 56 56 56 55 55 56 56 56 56 56 56 56 56 55 55 55
-766 55 55 55 56 56 55 55 56 56 56 57 57 56 56 56 56 57 57 57 57 56 56 56 56 55 55 55 55 56 55 56 57 57 56 56 56 56 56 56 56 56 56 55 56 57 56 55 56 56 56 56 56 56 56 56 56 56 56 56 57 57 56 57 57 57 57 56 55 54 55 56
-773 56 56 55 54 55 55 56 56 57 57 56 56 55 55 55 56 56 56 57 56 56 56 56 56 56 56 56 57 57 57 57 57 57 57 57 56 56 56 55 56 57 58 58 57 57 57 57 57 56 56 55 54 54 54 54 55 55 55 55 55 55 55 55 56 56 55 55 55 55 55 55
-781 55 55 55 55 55 56 57 57 57 57 57 56 56 56 56 56 56 56 56 56 55 55 55 54 54 54 55 55 55 56 56 56 56 57 56 55 55 55 55 55 54 55 55 55 54 54 54 54 55 55 55 56 56 56 56 55 55 55 55 54 54 54 53 53 54 55 55 54 54 54 55
-788 55 55 54 54 54 55 55 55 55 55 55 55 55 55 55 55 55 55 54 54 54 55 55 55 55 55 55 55 56 56 56 55 54 53 54 54 53 54 54 55 56 55 55 55 54 54 55 55 55 55 55 54 54 54 55 55 56 56 55 53 52 52 53 54 54 55 55 55 55 55 56
-796 56 55 55 54 54 54 55 55 55 55 55 55 55 55 54 54 53 54 54 54 55 55 55 55 55 55 55 55 54 55 55 55 55 54 54 54 55 55 56 55 55 54 55 55 55 55 55 55 55 55 55 54 54 54 54 54 54 54 54 54 54 54 54 54 55 54 54 54 54 54 55
-803 55 54 54 54 54 54 54 54 54 54 53 53 54 54 54 54 54 54 53 53 53 53 53 53 53 53 53 54 54 54 54 55 55 55 55 55 55 55 54 54 53 53 54 54 54 54 55 55 54 54 54 54 54 54 54 55 55 54 54 54 53 53 53 54 54 54 55 55 55 55 55
$$ packed form
-751E6%%%%%%J%%j%%%%%%%%%%j%J%%J%%j%J%%%j%%J%%%%%%j%%%%%jj%%%%J%J%%%jJ%%%%%J
-758E7j%%J%%%%%%%%%j%%%%J%J%j%%%%%%%%%%%%%%%%%j%%%%%%Jj%%%%%%%%j%J%%%%%%%j%%
-766E5%%J%j%J%%J%j%%%J%%%j%%%j%%%JjJJ%j%%%%%%%%jJJjjJ%%%%%%%%%%%J%jJ%%%jjjJJ
-773E6%jjJ%J%J%j%j%%J%%Jj%%%%%%%J%%%%%%%j%%jJJJ%j%%%%j%jj%%%J%%%%%%%J%j%%%%%
-781E5%%%%JJ%%%%j%%%%%%%%j%%j%%J%%J%%%Jjj%%%%jJ%%j%%%J%%J%%%j%%%j%%j%JJ%j%%J
-788E5%j%%J%%%%%%%%%%%%j%%J%%%%%%J%%jjjJ%jJ%JJj%%j%J%%%%j%%J%J%jkj%JJ%J%%%%J
-796E6j%j%%J%%%%%%%j%jJ%%J%%%%%%%jJ%%%j%%J%Jj%jJ%%%%%%%%j%%%%%%%%%%%%Jj%%%%J
-803E5j%%%%%%%%j%J%%%%%j%%%%%%%%J%%%J%%%%%%j%j%J%%%J%j%%%%%%J%j%%j%%J%%J%%%%
$$ plain form
-810 55 55 55 55 55 55 54 54 54 54 54 54 54 54 55 55 56 56 55 54 54 54 55 55 55 55 54 55 55 55 54 55 55 55 55 55 55 55 54 55 55 55 56 56 56 56 56 55 55 55 55 56 55 55 55 55 55 55 54 53 53 54 55 55 54 54 54 54 54 54 53
-818 53 53 53 53 54 54 53 53 53 53 54 54 55 55 54 54 53 53 54 55 55 55 54 54 55 55 55 55 55 56 55 55 55 55 55 55 55 56 55 55 55 55 55 54 54 55 55 55 55 55 55 55 55 55 56 56 56 56 56 55 55 55 55 55 55 55 54 53 53 54 56
-825 56 56 56 56 56 57 57 56 56 56 56 56 55 55 55 55 55 55 55 55 55 55 55 55 55 55 55 56 55 55 55 55 55 56 56 56 55 55 55 55 55 56 56 56 56 56 56 56 56 56 55 55 54 55 55 55 56 56 56 56 56 56 56 56 56 56 56 56 57 57 56
-833 56 57 57 57 56 55 55 55 55 55 54 54 54 54 55 55 55 55 55 56 56 56 57 56 56 56 56 56 55 55 55 55 55 55 55 56 56 55 55 54 54 54 54 54 55 55 55 55 56 56 56 55 55 55 54 54 54 54 54 55 56 56 56 56 56 56 56 57 58 58 57
-840 57 56 56 56 56 57 57 56 55 54 54 55 55 56 56 56 56 56 56 55 54 54 54 55 55 55 55 55 55 55 55 55 55 55 55 56 57 57 56 55 54 54 54 54 55 56 56 55 55 54 54 54 55 55 56 56 56 56 56 56 56 56 56 55 55 55 54 54 54 54 54
-847 54 55 55 55 54 54 55 55 55 55 55 55 55 55 55 54 54 54 55 55 55 55 54 54 54 54 55 55 55 54 54 54 54 54 54 54 55 54 54 54 54 54 54 54 53 54 54 54 55 54 54 54 55 55 55 54 54 54 54 55 56 56 57 56 55 55 55 54 54 54 54
-855 54 54 53 53 54 54 54 54 54 54 55 55 55 55 55 55 54 54 54 54 54 55 55 55 55 55 56 56 56 56 55 55 54 54 54 55 55 55 55 55 54 54 54 54 54 54 54 54 53 53 53 54 55 54 54 54 53 53 54 54 54 54 54 54 54 54 54 54 54 54 54
-862 54 55 55 55 56 55 54 54 53 54 54 53 53 54 54 54 55 54 53 53 53 53 53 53 54 54 54 53 53 53 53 53 53 53 53 53 53 53 54 56 56 56 55 55 55 56 56 55 55 54 54 54 54 54 54 55 55 55 56 55 54 53 53 54 55 55 55 55 55 55 55
$$ packed form
-810E5%%%%%j%%%%%%%J%J%jj%%J%%%jJ%%jJ%%%%%%jJ%%J%%%%j%%%Jj%%%%%jj%JJ%j%%%%%j
-818E3%%%J%j%%%J%J%j%j%JJ%%j%J%%%%Jj%%%%%%Jj%%%%j%J%%%%%%%%J%%%%j%%%%%%jj%JK
-825E6%%%%J%j%%%%j%%%%%%%%%%%%%%Jj%%%%J%%j%%%%J%%%%%%%%j%jJ%%J%%%%%%%%%%%J%j
-833E6J%%jj%%%%j%%%J%%%%J%%Jj%%%%j%%%%%%J%j%j%%%%J%%%J%%j%%j%%%%JJ%%%%%%JJ%j
-840E7j%%%J%jjj%J%J%%%%%jj%%J%%%%%%%%%%%JJ%jjj%%%JJ%j%j%%J%J%%%%%%%%j%%j%%%%
-847E4J%%j%J%%%%%%%%j%%J%%%j%%%J%%j%%%%%%Jj%%%%%%jJ%%Jj%%J%%j%%%JJ%Jjj%%j%%%
-855E4%j%J%%%%%J%%%%%j%%%%J%%%%J%%%j%j%%J%%%%j%%%%%%%j%%JJj%%j%J%%%%%%%%%%%%
-862E4J%%Jjj%jJ%j%J%%Jjj%%%%%J%%j%%%%%%%%%%JK%%j%%J%j%j%%%%%J%%Jjjj%JJ%%%%%%
$$ plain form
-870 55 55 56 56 56 56 56 56 56 56 56 56 57 56 55 55 55 55 55 55 56 56 57 57 58 57 58 58 57 56 56 55 55 55 56 56 56 56 56 56 55 55 54 54 54 54 54 55 55 55 55 55 55 55 54 53 53 54 54 55 55 56 56 57 57 56 56 56 55 55 55
-877 55 55 55 54 54 55 55 55 55 56 56 56 56 56 56 56 56 56 56 55 55 56 56 56 55 55 54 54 55 56 57 57 56 56 56 56 56 56 55 56 57 56 56 56 55 55 55 55 56 57 57 57 56 56 56 55 55 55 55 55 55 54 54 55 55 55 55 56 55 55 55
-885 55 55 55 56 56 56 55 55 56 56 56 56 56 56 56 56 56 56 56 56 56 56 56 56 56 55 55 55 56 56 55 55 55 55 55 55 55 55 55 56 57 56 56 57 57 57 56 56 55 55 55 55 55 55 55 55 55 56 56 56 57 57 56 55 55 55 56 56 56 56 56
-892 56 56 56 56 56 56 56 55 56 56 56 56 56 56 56 56 56 56 56 56 56 55 55 55 55 55 54 55 56 56 56 56 56 56 56 56 56 56 56 56 57 57 56 56 56 57 57 56 56 56 56 56 57 57 56 56 57 57 56 56 56 56 56 56 57 57 57 57 56 57 56
-899 56 56 56 57 57 57 57 57 56 55 55 55 55 54 54 54 55 55 55 55 54 54 54 54 55 56 56 56 56 56 55 56 56 55 55 55 54 54 54 55 55 56 56 56 56 56 57 57 57 56 56 56 55 55 56 57 56 56 56 56 56 56 56 56 56 56 56 56 55 55 56
-907 56 56 56 56 56 55 55 55 55 56 56 56 56 56 56 56 56 56 56 56 56 56 56 55 55 56 56 56 55 54 54 55 55 55 56 56 56 57 56 55 55 54 54 55 55 56 56 56 56 55 55 55 55 55 55 55 55 55 55 55 55 55 55 54 55 55 55 55 55 55 55
-914 55 54 54 54 54 53 53 54 55 55 55 55 55 56 56 55 55 55 55 55 54 55 56 55 55 55 55 54 54 54 54 55 55 55 55 55 55 55 55 55 55 55 55 56 56 56 56 55 55 55 56 56 56 56 57 56 54 55 55 55 56 56 55 55 55 55 55 55 55 55 55
-922 55 55 55 54 55 55 54 54 54 55 55 55 55 54 54 54 54 54 55 55 56 55 55 54 54 55 55 56 56 56 56 55 55 55 55 56 56 56 56 55 55 56 56 56 56 55 55 55 55 55 55 55 54 55 55 56 56 56 56 56 55 55 55 56 56 56 56 56 55 55 55
$$ packed form
-870E5%J%%%%%%%%%Jjj%%%%%J%J%JjJ%jj%j%%J%%%%%j%j%%%%J%%%%%%jj%J%J%J%J%j%%j%%
-877E5%%j%J%%%J%%%%%%%%%j%J%%j%j%JJJ%j%%%%%jJJj%%j%%%JJ%%j%%j%%%%%j%J%%%Jj%%
-885E5%%J%%j%J%%%%%%%%%%%%%%%%j%%J%j%%%%%%%%JJj%J%%j%j%%%%%%%%J%%J%jj%%J%%%%
-892E6%%%%%%jJ%%%%%%%%%%%%j%%%%jJJ%%%%%%%%%%%J%j%%J%j%%%%J%j%J%j%%%%%J%%%jJj
-899E6%%J%%%%jj%%%j%%J%%%j%%%JJ%%%%jJ%j%%j%%J%J%%%%J%%j%%j%JJj%%%%%%%%%%%j%J
-907E6%%%%j%%%J%%%%%%%%%%%%%j%J%%jj%J%%J%%Jjj%j%J%J%%%j%%%%%%%%%%%%%jJ%%%%%%
-914E5j%%%j%JJ%%%%J%j%%%%jJJj%%%j%%%J%%%%%%%%%%%J%%%j%%J%%%JjkJ%%J%j%%%%%%%%
-922E5%%jJ%j%%J%%%j%%%%J%Jj%j%J%J%%%j%%%J%%%j%J%%%j%%%%%%jJ%J%%%%j%%J%%%%j%%
$$ plain form
-929 55 56 55 55 55 54 54 54 54 54 54 54 55 55 55 55 55 55 55 55 55 55 56 56 56 56 57 56 56 56 56 56 56 56 56 56 55 55 55 56 55 56 56 56 56 55 55 54 54 54 54 55 56 56 56 56 56 55 56 56 56 56 57 56 55 55 55 55 55 55 55
-937 55 55 55 55 56 56 55 55 55 55 55 54 54 54 55 55 55 55 56 56 56 56 56 56 55 56 56 55 55 55 54 55 55 55 55 55 55 56 55 55 55 55 55 55 55 55 55 55 54 54 54 55 56 56 57 56 55 55 55 55 54 55 55 55 55 55 54 53 53 54 54
-944 54 55 55 55 55 55 54 54 54 54 55 55 54 54 54 55 55 55 54 54 54 53 53 54 55 55 55 54 53 53 53 53 54 55 55 54 55 54 54 54 54 54 55 55 54 55 55 55 55 55 55 54 54 54 53 54 54 54 54 54 55 55 54 54 54 53 53 53 53 53 53
-951 53 54 54 54 54 54 53 54 54 54 55 55 54 54 54 55 54 54 54 54 53 53 53 54 54 54 54 54 54 54 54 54 54 55 55 54 54 54 54 54 54 54 54 54 53 53 53 54 55 55 55 54 54 55 54 54 54 54 54 54 54 54 53 52 52 53 53 53 52 53 53
-959 53 53 53 53 53 53 53 53 52 53 53 53 53 53 53 53 53 53 53 53 53 53 53 52 52 52 52 53 53 53 53 53 53 52 52 53 53 53 54 54 53 53 52 52 52 53 53 52 53 53 53 53 52 52 53 54 53 53 53 53 54 55 55 55 54 54 54 54 54 54 54
-966 54 54 54 54 54 54 53 53 53 53 54 53 53 53 54 54 53 54 54 54 54 54 54 54 55 54 54 54 54 54 54 53 53 53 54 54 54 54 55 55 55 55 55 55 55 55 54 54 54 53 53 53 53 53 53 53 53 53 52 53 53 53 53 52 52 52 52 52 53 52 52
-974 52 52 52 52 53 53 54 54 54 55 55 54 54 53 53 53 53 53 54 54 54 54 53 53 52 52 53 53 53 53 53 53 53 53 53 54 53 53 52 52 53 54 55 55 55 55 54 54 53 53 54 55 55 55 54 54 54 53 53 54 55 55 54 54 54 55 54 54 54 54 53
-981 53 53 54 54 54 54 54 54 54 54 54 54 54 54 55 55 55 56 55 54 53 53 53 54 54 54 53 53 52 53 53 53 54 54 54 54 55 55 55 55 55 55 56 55 54 54 54 54 53 53 53 53 54 54 54 53 53 53 53 53 53 54 54 54 55 54 54 54 54 54 54
$$ packed form
-929E5Jj%%j%%%%%%J%%%%%%%%%J%%%Jj%%%%%%%%j%%JjJ%%%j%j%%%JJ%%%%jJ%%%Jjj%%%%%%
-937E5%%%J%j%%%%j%%J%%%J%%%%%jJ%j%%jJ%%%%%Jj%%%%%%%%%j%%JJ%Jjj%%%jJ%%%%jj%J%
-944E4J%%%%j%%%J%j%%J%%j%%j%JJ%%jj%%%JJ%jJj%%%%J%jJ%%%%%j%%jJ%%%%J%j%%j%%%%%
-951E3J%%%%jJ%%J%j%%Jj%%%j%%J%%%%%%%%%J%j%%%%%%%%j%%JJ%%j%Jj%%%%%%%jj%J%%jJ%
-959E3%%%%%%%jJ%%%%%%%%%%%%%j%%%J%%%%%j%J%%J%j%j%%J%jJ%%%j%JJj%%%JJ%%j%%%%%%
-966E4%%%%%j%%%Jj%%J%jJ%%%%%%Jj%%%%%j%%J%%%J%%%%%%%j%%j%%%%%%%%jJ%%%j%%%%Jj%
-974E2%%%J%J%%J%j%j%%%%J%%%j%j%J%%%%%%%%Jj%j%JJJ%%%j%j%JJ%%j%%j%JJ%j%%Jj%%%j
-981E3%J%%%%%%%%%%%J%%Jjjj%%J%%j%jJ%%J%%%J%%%%%Jjj%%%j%%%J%%j%%%%%J%%Jj%%%%%
$$ plain form
-988 54 54 54 54 54 55 55 55 55 55 55 55 56 56 55 54 53 53 53 52 52 53 53 54 55 55 55 54 54 54 55 55 55 56 55 55 55 55 55 55 55 55 55 55 55 55 55 54 53 54 55 55 55 55 55 54 53 54 54 55 54 54 54 55 55 55 55 55 54 53 54
-996 54 54 54 54 55 55 54 54 54 54 54 54 53 53 53 54 55 55 55 54 54 54 54 54 54 54 54 54 54 54 55 55 54 54 54 54 54 54 54 54 53 53 53 54 55 55 56 56 57 56 56 56 56 56 56 56 55 56 56 56 56 55 55 55 55 55 55 55 56 56 56
-1003 56 56 55 54 54 55 56 55 55 55 54 54 54 54 54 54 55 55 54 54 54 54 55 55 55 55 54 54 54 55 54 54 53 54 54 54 54 54 54 55 55 55 55 55 54 55 55 55 55 55 55 55 55 54 54 54 55 54 54 54 54 54 53 54 54 54 54 54 54 54
-1011 54 54 54 54 54 55 55 55 55 56 55 55 54 54 54 54 54 55 55 56 55 55 54 54 54 54 54 54 54 53 53 53 52 52 53 53 53 54 53 53 53 54 54 55 55 55 54 54 53 54 55 54 54 53 54 54 54 55 55 56 55 55 55 54 54 54 54 54 53 53
-1018 53 53 54 54 55 54 54 54 53 53 53 54 54 54 54 54 55 55 55 55 55 55 55 54 54 54 54 53 53 53 53 53 54 54 54 53 53 54 54 54 54 54 54 54 54 55 54 54 55 54 54 54 54 53 53 52 52 53 53 53 53 53 53 53 53 53 53 54 53 53
-1025 53 52 52 53 54 53 53 53 53 53 54 54 53 53 52 52 52 53 53 53 54 54 54 53 53 53 53 53 53 53 53 53 54 54 53 53 53 52 52 53 53 54 53 53 53 52 52 52 52 53 53 52 51 52 52 52 52 52 52 53 53 53 53 52 53 53 52 52 52 53
-1033 53 53 53 53 53 52 52 52 53 52 51 51 52 53 53 53 53 53 53 53 53 53 53 52 53 53 52 52 51 51 51 52 53 54 54 53 52 52 52 52 53 53 52 52 52 52 52 52 52 52 52 52 52 53 53 53 54 53 53 53 53 54 55 55 55 54 54 54 54 54
-1040 54 54 54 54 54 54 54 53 53 53 53 53 53 52 53 53 53 53 53 53 54 54 54 54 54 54 53 53 53 53 53 52 52 53 53 54 53 53 53 52 52 52 52 52 53 53 53 53 54 54 54 54 54 54 54 53 52 52 52 53 53 53 53 54 54 54 54 54 53 53
$$ packed form
-988E4%%%%J%%%%%%J%jjj%%j%J%JJ%%j%%J%%Jj%%%%%%%%%%%%jjJJ%%%%jjJ%Jj%%J%%%%jjJ
-996E4%%%J%j%%%%%j%%JJ%%j%%%%%%%%%%J%j%%%%%%%j%%JJ%J%Jj%%%%%%jJ%%%j%%%%%%J%%
-1003E6%jj%JJj%%j%%%%%J%j%%%J%%%j%%Jj%jJ%%%%%J%%%%jJ%%%%%%%j%%Jj%%%%jJ%%%%%%
-1011E4%%%%J%%%Jj%j%%%%J%Jj%j%%%%%%j%%j%J%%Jj%%J%J%%j%jJJj%jJ%%J%Jj%%j%%%%j%
-1018E3%J%Jj%%j%%J%%%%J%%%%%%j%%%j%%%%J%%j%J%%%%%%%Jj%Jj%%%j%j%J%%%%%%%%%Jj%
-1025E3j%JJj%%%%J%j%j%%J%%J%%j%%%%%%%%J%j%%j%J%Jj%%j%%%J%jjJ%%%%%J%%%jJ%j%%J
-1033E3%%%%j%%Jjj%JJ%%%%%%%%%jJ%j%j%%JJJ%jj%%%J%j%%%%%%%%%%J%%Jj%%%JJ%%j%%%%
-1040E4%%%%%%j%%%%%jJ%%%%%J%%%%%j%%%%j%J%Jj%%j%%%%J%%%J%%%%%%jj%%J%%%J%%%%j%
$$ plain form
-1047 53 53 53 53 53 53 54 55 55 54 53 53 53 54 54 54 54 54 53 53 53 53 53 54 54 54 54 54 53 53 53 53 52 53 53 53 54 55 55 55 56 55 55 54 54 54 53 53 53 53 53 53 53 53 53 53 53 53 52 53 53 53 54 54 54 54 54 54 54 54
-1054 54 54 54 54 53 53 53 53 53 54 54 55 54 55 55 55 54 54 54 53 54 54 55 55 56 55 54 54 54 54 54 54 54 54 54 54 54 54 54 54 54 55 55 55 56 56 56 56 56 55 54 53 53 53 54 55 55 55 55 54 54 54 54 54 54 54 54 54 54 54
-1062 54 54 53 54 54 54 55 55 54 54 54 54 54 55 55 54 54 54 54 54 54 55 55 55 54 54 55 55 55 55 54 55 55 55 56 56 55 55 55 55 54 53 53 54 54 54 54 55 55 55 55 55 55 55 55 55 55 55 55 55 55 54 54 55 55 55 55 55 55 54
-1069 54 54 54 54 53 53 53 53 53 53 53 54 55 55 56 55 56 56 55 55 54 55 55 55 55 55 55 55 55 55 54 53 52 52 52 53 54 54 55 55 54 53 54 54 54 54 55 55 55 55 54 54 54 53 53 54 53 53 53 54 54 55 55 55 55 55 54 55 55 55
-1076 55 54 54 54 53 53 53 54 54 54 54 54 54 53 54 54 54 54 54 54 53 53 53 53 53 53 53 53 53 54 55 56 55 54 54 54 53 54 54 54 55 55 54 54 54 54 54 54 54 54 53 53 53 53 54 53 53 52 52 53 53 54 54 54 54 54 54 54 55 55
-1084 55 55 55 55 54 54 54 53 53 53 54 54 54 54 54 54 54 54 54 54 54 54 54 55 54 54 54 54 54 54 54 55 55 55 55 55 54 54 53 53 54 54 54 55 55 56 55 55 55 54 55 55 55 55 55 55 55 55 56 56 56 56 56 56 55 55 55 54 54 54
-1091 54 53 53 53 54 54 54 54 54 54 54 54 55 54 54 54 54 55 55 55 55 54 54 54 55 55 55 55 55 55 55 55 55 55 55 55 56 55 55 55 55 56 56 55 55 55 55 55 54 54 54 54 55 55 55 55 54 54 54 54 54 54 54 54 54 53 53 53 53 53
-1098 53 53 54 54 54 54 54 54 55 55 55 54 55 55 55 55 55 55 55 56 56 56 55 55 55 54 54 54 54 54 54 55 55 55 55 55 55 54 54 54 55 56 57 57 56 56 57 57 56 55 55 55 55 56 56 55 55 55 55 55 55 54 55 55 55 55 56 56 56 56
$$ packed form
-1047E3%%%%%JJ%jj%%J%%%%j%%%%J%%%%j%%%jJ%%JJ%%Jj%j%%j%%%%%%%%%%%jJ%%J%%%%%%%
-1054E4%%%j%%%%J%JjJ%%j%%jJ%J%Jjj%%%%%%%%%%%%%%J%%J%%%%jjj%%JJ%%%j%%%%%%%%%%
-1062E4%jJ%%J%j%%%%J%j%%%%%J%%j%J%%%jJ%%J%j%%%jj%J%%%J%%%%%%%%%%%%%j%J%%%%%j
-1069E4%%%j%%%%%%JJ%JjJ%j%jJ%%%%%%%%jjj%%JJ%J%jjJ%%%J%%%j%%j%Jj%%J%J%%%%jJ%%
-1076E5j%%j%%J%%%%%jJ%%%%%j%%%%%%%%JJJjj%%jJ%%J%j%%%%%%%j%%%Jj%j%J%J%%%%%%J%
-1084E5%%%j%%j%%J%%%%%%%%%%%%Jj%%%%%%J%%%%j%j%J%%J%Jj%%jJ%%%%%%%J%%%%%j%%j%%
-1091E4j%%J%%%%%%%Jj%%%J%%%j%%J%%%%%%%%%%%Jj%%%J%j%%%%j%%%J%%%j%%%%%%%%j%%%%
-1098E3%J%%%%%J%%jJ%%%%%%J%%j%%j%%%%%J%%%%%j%%JJJ%j%J%jj%%%J%j%%%%%jJ%%%J%%%
$$ plain form
-1106 56 56 55 56 57 57 57 56 56 56 56 56 56 56 56 56 56 55 54 55 55 55 55 55 55 55 55 55 55 55 55 56 56 56 55 55 55 55 54 55 54 54 54 54 54 54 54 54 54 55 54 53 53 54 54 55 55 55 55 55 55 55 55 55 55 56 56 56 56 55
-1113 55 55 55 55 56 56 55 55 54 54 55 55 55 55 54 54 54 54 54 54 54 55 55 54 54 55 56 56 55 56 56 55 55 55 55 55 55 55 55 55 55 56 56 55 55 55 55 54 54 54 54 54 55 55 55 55 55 54 54 54 53 53 53 53 53 53 54 55 56 56
-1120 56 56 56 57 56 55 55 55 55 56 56 55 54 54 54 54 54 54 54 54 54 54 54 54 54 53 53 54 54 54 55 55 56 55 55 55 56 56 55 54 54 53 53 53 53 53 54 54 55 55 56 55 55 55 55 55 54 53 52 52 52 53 54 54 54 54 53 53 54 54
-1128 54 54 54 54 54 54 53 53 53 53 53 54 55 56 57 56 55 54 53 53 54 54 54 55 54 54 54 53 53 54 54 54 54 54 54 53 54 55 54 53 52 53 53 53 54 54 54 55 55 55 54 54 54 54 54 54 54 54 54 53 53 53 53 53 53 53 53 53 53 53
-1135 53 53 54 54 53 53 53 54 54 54 54 54 54 54 54 54 55 55 54 53 53 53 53 53 54 54 54 54 54 54 54 54 54 54 54 54 54 54 54 54 54 54 54 54 54 54 55 55 55 55 55 55 55 55 55 55 55 55 55 55 55 55 55 54 54 54 55 55 54 54
-1142 54 54 54 53 53 53 53 54 53 53 53 53 53 53 53 53 52 52 52 52 52 52 53 53 53 52 52 53 52 52 52 52 52 52 53 53 53 54 54 53 53 53 53 53 53 53 54 54 54 54 54 54 55 55 54 53 53 53 53 53 53 54 54 54 53 53 53 54 54 55
-1149 55 55 54 54 54 53 53 53 53 54 54 54 54 54 54 54 54 54 54 53 53 53 52 53 54 55 55 55 55 55 56 55 54 54 54 53 52 52 53 53 53 52 52 52 52 53 53 53 53 54 54 54 53 54 54 54 54 54 54 54 54 54 54 54 54 54 54 54 54 55
-1157 55 55 55 55 54 54 54 54 54 54 54 54 54 53 54 54 53 53 53 53 53 54 54 54 54 54 54 54 54 55 54 54 54 53 53 53 53 53 52 52 53 52 52 52 52 51 51 52 53 53 53 53 53 53 53 53 53 54 54 54 54 54 54 53 53 53 53 53 53 53
$$ packed form
-1106E6%jJJ%%j%%%%%%%%%jjJ%%%%%%%%%%%J%%j%%%jJj%%%%%%%%Jjj%J%J%%%%%%%%%J%%%j
-1113E5%%%J%j%j%J%%%j%%%%%%J%j%JJ%jJ%j%%%%%%%%%J%j%%%j%%%%J%%%%j%%j%%%%%JJJ%
-1120E6%%Jjj%%%J%jj%%%%%%%%%%%%j%J%%J%Jj%%J%jj%j%%%%J%J%Jj%%%%jjj%%JJ%%%j%J%
-1128E4%%%%%j%%%%JJJJjjjj%J%%Jj%%j%J%%%%%jJJjjjJ%%J%%J%%j%%%%%%%%j%%%%%%%%%%
-1135E3%J%j%%J%%%%%%%%J%jj%%%%J%%%%%%%%%%%%%%%%%%%%%J%%%%%%%%%%%%%%%%j%%J%j%
-1142E4%%j%%%Jj%%%%%%%j%%%%%J%%j%Jj%%%%%J%%J%j%%%%%%J%%%%%J%jj%%%%%J%%j%%J%J
-1149E5%j%%j%%%J%%%%%%%%%j%%jJJJ%%%%Jjj%%jj%J%%j%%%J%%%J%%jJ%%%%%%%%%%%%%%%J
-1157E5%%%j%%%%%%%%jJ%j%%%%J%%%%%%%Jj%%j%%%%j%Jj%%%j%JJ%%%%%%%%J%%%%%j%%%%%%
$$ plain form
-1164 53 53 53 54 54 54 54 54 53 53 53 53 53 53 53 53 53 53 53 53 52 52 52 52 52 51 51 52 53 53 54 54 54 54 55 55 55 55 54 53 53 53 53 53 53 53 54 53 53 53 52 52 53 53 53 53 53 53 53 54 53 53 53 53 52 52 53 52 52 52
-1171 52 52 52 52 52 51 51 52 52 53 54 54 55 55 55 56 55 55 54 54 54 54 53 53 53 53 54 54 53 53 53 54 53 53 53 53 53 53 54 54 54 54 54 54 54 53 54 54 54 54 54 54 54 53 54 54 54 54 53 52 52 53 54 54 55 55 54 53 53 53
-1179 53 54 54 54 54 53 53 53 52 53 53 54 54 54 53 53 53 53 53 53 54 54 54 53 53 53 54 53 53 53 52 52 52 52 53 54 54 54 54 53 53 53 53 54 53 52 52 52 52 52 53 53 52 52 52 52 52 52 53 53 53 53 53 54 54 54 54 54 54 54
-1186 54 53 52 52 52 51 52 52 52 52 51 52 53 53 53 52 52 52 52 52 52 52 53 53 53 53 53 53 53 53 53 53 52 52 52 51 51 51 51 51 51 51 51 52 52 52 52 52 53 54 54 53 52 52 52 53 53 53 53 53 52 52 52 52 51 52 53 53 54 53
-1193 53 52 52 52 51 51 51 51 51 52 52 52 52 53 53 53 53 53 53 53 53 53 53 53 52 53 53 53 53 53 53 53 52 52 52 53 52 51 51 52 52 52 52 52 53 52 52 53 53 53 53 53 53 52 52 52 52 52 52 53 53 53 52 52 52 51 51 51 52 52
-1201 52 52 53 53 53 52 52 52 52 52 52 52 52 52 52 52 51 51 52 53 52 52 52 51 51 51 51 51 52 52 52 52 52 52 52 52 52 52 52 52 51 51 51 50 50 49 50 51 51 51 52 52 52 52 53 53 53 52 52 52 52 52 52 52 52 52 52 52 52 52
-1208 52 52 51 52 52 52 52 51 51 51 51 51 51 52 52 52 52 52 53 52 52 52 51 52 52 53 53 53 54 53 52 51 50 51 51 51 52 52 52 52 52 51 51 52 52 53 53 53 52 51 51 51 51 51 52 51 51 51 51 51 52 52 52 52 52 52 51 51 50 50
$$ packed form
-1164E3%%J%%%%j%%%%%%%%%%%j%%%%j%JJ%J%%%J%%%jj%%%%%%Jj%%j%J%%%%%%Jj%%%j%Jj%%
-1171E2%%%%j%J%JJ%J%%Jj%j%%%j%%%J%j%%Jj%%%%%J%%%%%%jJ%%%%%%jJ%%%jj%JJ%J%jj%%
-1179E3J%%%j%%jJ%J%%j%%%%%J%%j%%Jj%%j%%%JJ%%%j%%%Jjj%%%%J%j%%%%%J%%%%J%%%%%%
-1186E4jj%%jJ%%%jJJ%%j%%%%%%J%%%%%%%%%j%%j%%%%%%%J%%%%JJ%jj%%J%%%%j%%%jJJ%Jj
-1193E3j%%j%%%%J%%%J%%%%%%%%%%jJ%%%%%%j%%Jjj%J%%%%Jj%J%%%%%j%%%%%J%%j%%j%%J%
-1201E2%J%%j%%%%%%%%%%j%JJj%%j%%%%J%%%%%%%%%%%j%%j%jJJ%%J%%%J%%j%%%%%%%%%%%%
-1208E2%jJ%%%j%%%%%J%%%%Jj%%jJ%J%%JjjjjJ%%J%%%%j%J%J%%jj%%%%Jj%%%%J%%%%%j%j%
$$ [...]
-2638F9
##END=		$$ NMR SPECTRUM
##END=		$$ LINK
