##TITLE=	RP345 with 13C.10.fid
##JCAMP-DX=	6.0	$$ MestReNova 14.3.3-33362
##DATA TYPE=	LINK
##BLOCKS=	1    
##ORIGIN=	Mestrelab Research S.L.
##OWNER=	hrzepa
##$MNOVA/METADATA=	(DOCUMENT,BASE64)
eyJuYW1lIjoiL1VzZXJzL2hyemVwYS9MaWJyYXJ5L01vYmlsZSBEb2N1bWVudHMvY29tfmFwcGxlfkN
sb3VkRG9jcy9TaGVwcGFyZC9OTVIgZmlsZXMgemlwcy0yLzI0LzI0LUgubW5vdmEiLCJwYWdlcyI6W3
siaXRlbXMiOlsiMSIgICAgIF19XX0=
##TITLE=	RP345 with 13C.10.fid
##JCAMP-DX=	6.0	$$ MestReNova 14.3.3-33362
##DATA TYPE=	NMR SPECTRUM
##DATA CLASS=	XYDATA
##BLOCK_ID=	1
##ORIGIN=	Bruker BioSpin GmbH
##OWNER=	nmrsu
##NUMDIM=	1
##$MNOVA/METADATA=	(ITEM,BASE64)
eyJhbmdsZSI6MCwiYXhlcyI6eyJ4Ijp7Im1heCI6MTYuMDY0MjU5OTk5OTM5MTI1LCJtaW4iOi0zLjc
2Njk0MjMzOTE1NjYyMjZ9LCJ5Ijp7Im1heCI6MTYyMzg0LjY5ODI0MjE4NzUsIm1pbiI6LTE1MTU3Lj
AwOTEyNDc1NTg2fX0sInBvaW50cyI6W3sieCI6NTMyMSwieSI6NTgzNX0seyJ4Ijo4NzIyLCJ5Ijo1O
DM1fSx7IngiOjg3MjIsInkiOjgyMDh9LHsieCI6NTMyMSwieSI6ODIwOH0seyJ4Ijo1MzIxLCJ5Ijo1
ODM1fV0sInoiOjB9
##.OBSERVE FREQUENCY=	700.35432466099996418
##.OBSERVE NUCLEUS=	^1H
##.SOLVENT NAME=	CDCl3
##.PULSE SEQUENCE=	zg30
##LONGDATE=	2023/11/21 19:05:38.000
##.ACQUISITIONMODE=	SIMULTANEOUS (DQD)
##$ORIGINAL FORMAT=	Bruker XWIN-NMR
##$MNOVA/SCALES_VERSION=	9
##$PARAMETER FILE=	(acqus, ASCII, /private/var/folders/f6/rjf_tdyn2v98c5c0wvkgn4s80000gq/T/PaRMFZoaQlSacJE4Wv+Y1g/10/acqus, 0)
$$ ##TITLE= Parameter file, TopSpin 4.1.3
$$ ##JCAMPDX= 5.0
$$ ##DATATYPE= Parameter Values
$$ ##NPOINTS= 1	$$ modification sequence number
$$ ##ORIGIN= Bruker BioSpin GmbH
$$ ##OWNER= nmrsu
$$ $$ 2023-11-21 19:05:35.922 +0000  nmrsu@CZC7167VR1
$$ $$ Z:/700/data/tds/nmr/RP345/10/acqus
$$ $$ process C:\Bruker\TopSpin4.1.3\prog\mod\dirdata.exe
$$ ##$ACQT0= -2.0981556054023
$$ ##$AMP= (0..31)
$$ 100 100 100 100 100 100 100 100 100 100 100 100 100 100 100 100 100 100
$$ 100 100 100 100 100 100 100 100 100 100 100 100 100 100
$$ ##$AMPCOIL= (0..32)
$$ -1 0 0 0 0 0 0 0 0 0 0 0 0 0 0 0 0 0 0 0 0 0 0 0 0 0 0 0 0 0 0 0 0
$$ ##$AQSEQ= 0
$$ ##$AQ_mod= 3
$$ ##$AUNM= <au_zg>
$$ ##$AUTOPOS= <44 >
$$ ##$BF1= 700.349999998
$$ ##$BF2= 700.349999998
$$ ##$BF3= 700.349999998
$$ ##$BF4= 700.349999998
$$ ##$BF5= 700.349999998
$$ ##$BF6= 700.349999998
$$ ##$BF7= 700.349999998
$$ ##$BF8= 700.349999998
$$ ##$BWFAC= (0..63)
$$ 0 0 0 0 0 0 0 0 0 0 0 0 0 0 0 0 0 0 0 0 0 0 0 0 0 0 0 0 0 0 0 0 0 0 0 0
$$ 0 0 0 0 0 0 0 0 0 0 0 0 0 0 0 0 0 0 0 0 0 0 0 0 0 0 0 0
$$ ##$BYTORDA= 0
$$ ##$CHANFCU= (0..24)
$$ 0 1 0 0 0 0 0 0 0 0 0 0 0 0 0 0 0 0 0 0 0 0 0 0 0
$$ ##$CHANREC= (0..24)
$$ 0 0 0 0 0 0 0 0 0 0 0 0 0 0 0 0 0 0 0 0 0 0 0 0 0
$$ ##$CHEMSTR= <none>
$$ ##$CNST= (0..63)
$$ 1 1 1 1 1 1 1 1 1 1 1 1 1 1 1 1 1 1 1 1 1 1 1 1 1 1 1 1 1 1 1 1 1 1 1 1
$$ 1 1 1 1 1 1 1 1 1 1 1 1 1 1 1 1 1 1 1 1 1 1 1 1 1 1 1 1
$$ ##$CPDPRG= (0..8)
$$ <> <> <> <> <> <> <> <> <>
$$ ##$D= (0..63)
$$ 0 1 0 0 0 0 0 0 0 0 0 0 0 0 0 0 0.0002 0 0 0 0 0 0 0 0 0 0 0 0 0 0 0 0
$$ 0 0 0 0 0 0 0 0 0 0 0 0 0 0 0 0 0 0 0 0 0 0 0 0 0 0 0 0 0 0 0
$$ ##$DATE= 1700593538
$$ ##$DATE_START= 1700593495
$$ ##$DE= 6.901845
$$ [...]
$$ ##$ShimPowRng3= (0..63)
$$ 1 1 1 1 1 1 1 1 1 1 1 1 1 1 1 1 1 1 1 1 1 1 1 1 1 1 1 1 1 1 1 1 1 1 1 1
$$ 1 1 1 1 0 0 0 0 0 0 0 0 0 0 0 0 0 0 0 0 0 0 0 0 0 0 0 0
$$ ##$ShimPowType1= 8
$$ ##$ShimPowType2= 8
$$ ##$ShimPowType3= 0
$$ ##$ShimPowType4= 0
$$ ##$ShimPowType5= 0
$$ ##$ShimPowType6= 0
$$ ##$ShimPowType7= 0
$$ ##$ShimPowType8= 0
$$ ##$ShimSysActGrad= (0..63)
$$ 1 2 3 4 13 5 7 11 10 9 6 8 12 18 19 20 21 15 22 23 24 14 25 16 26 17 27
$$ 28 31 32 33 34 35 36 37 38 0 0 0 0 0 0 0 0 0 0 0 0 0 0 0 0 0 0 0 0 0 0
$$ 0 0 0 0 0 0
$$ ##$ShimSysAngle= <>
$$ ##$ShimSysFunc= (0..63)
$$ 1 2 3 4 5 6 7 8 9 10 0 37 38 35 16 15 14 13 12 11 28 27 26 25 24 23 36
$$ 22 30 29 20 21 34 33 32 31 17 18 19 0 0 0 0 0 0 0 0 0 0 0 0 0 0 0 0 0 0
$$ 0 0 0 0 0 0 0
$$ ##$ShimSysMatId= <292722da.dat>
$$ ##$ShimSysMatrix= 1
$$ ##$ShimSysMinMaxUG= 130000
$$ ##$ShimSysOffset= <29 mm>
$$ ##$ShimSysType= 4
$$ ##$ShimUnit= 3
$$ ##$SpectrOsVersion= <4.1.156.20210628>
$$ ##$TCubeEth= <192.168.180.38>
$$ ##$TCubeSeqDevice= <>
$$ ##$TOSITY= <no>
$$ ##$TRIPLO2= 0
$$ ##$TopSpinVersion= <TopSpin 4.1.3>
$$ ##$TrxFreqFormula= (0..23)
$$ <TrxFreqFormula(2.0,700350000.000000,'TRX',Trx(1.0,'TRX 1200.1',1,5.000000,1290.000000))>
$$ <TrxFreqFormula(2.0,700350000.000000,'TRX',Trx(1.0,'TRX 1200.2',1,5.000000,1290.000000))>
$$ <TrxFreqFormula(2.0,700350000.000000,'TRX',Trx(1.0,'TRX 1200.3',1,5.000000,1290.000000))>
$$ <> <> <> <> <> <> <> <> <> <> <> <> <> <> <> <> <> <> <> <> <>
$$ ##$TrxPN= (0..23)
$$ <Z148391> <Z148391> <Z148391> <> <> <> <> <> <> <> <> <> <> <> <> <> <>
$$ <> <> <> <> <> <> <>
$$ ##$TrxSN= (0..23)
$$ <00336> <00337> <00342> <> <> <> <> <> <> <> <> <> <> <> <> <> <> <> <>
$$ <> <> <> <> <>
$$ ##$VCubeEth= (0..23)
$$ <no> <no> <no> <no> <no> <no> <no> <no> <no> <no> <no> <no> <no> <no> <no>
$$ <no> <no> <no> <no> <no> <no> <no> <no> <no>
$$ ##$VTU= 2
$$ ##$VTUETH= <192.168.99.11>
$$ ##$VTUTY= <no>
$$ ##$ValueLine= no
$$ ##$VpuPN= (0..23)
$$ <no> <no> <no> <no> <no> <no> <no> <no> <no> <no> <no> <no> <no> <no> <no>
$$ <no> <no> <no> <no> <no> <no> <no> <no> <no>
$$ ##$VpuSN= (0..23)
$$ <no> <no> <no> <no> <no> <no> <no> <no> <no> <no> <no> <no> <no> <no> <no>
$$ <no> <no> <no> <no> <no> <no> <no> <no> <no>
$$ ##$WBREFAM= (0..31)
$$ 99.8 100 100 100 100 100 100 100 100 100 100 100 100 100 100 100 100 100
$$ 100 100 100 100 100 100 100 100 100 100 100 100 100 100
$$ ##$WBREFLM= (0..31)
$$ 1 0 1 0 0 0 0 0 0 0 0 0 0 0 0 0 0 0 0 0 0 0 0 0 0 0 0 0 0 0 0 0
$$ ##$WBREFPH= (0..31)
$$ 0.05 0 0 0 0 0 0 0 0 0 0 0 0 0 0 0 0 0 0 0 0 0 0 0 0 0 0 0 0 0 0 0
$$ ##$WBSGU= (0..31)
$$ 1 2 4 0 0 0 0 0 0 0 0 0 0 0 0 0 0 0 0 0 0 0 0 0 0 0 0 0 0 0 0 0
$$ ##END=
$$ 
##$DECIM=	1440
##$DSPFVS=	21
##XUNITS=	HZ
##YUNITS=	ARBITRARY UNITS
##FIRSTX=	11250.604788156719223
##LASTX=	-2638.1781369192458442
##DELTAX=	-0.10596381293402784562
##XFACTOR=	1
##YFACTOR=	4.5052196188238164964
##FIRSTY=	124.196075439453125
##MINY=	-394.609619140625
##MAXY=	147622.53125
##NPOINTS=	131072
##XYDATA=	(X++(Y..Y))
$$ [...]
4367D1%%%%%%%%%J%%%%%j%%%%%%%%%%%%%%%%%%%%%%%%%%%%%%%%%%%%%%%Jj%%%%%%%%%%%%%
$$ 41 41 41 41 41 41 41 41 41 41 42 42 42 42 42 42 41 41 41 41 41 41 41 41 41 41 41 41 41 41 41 41 41 41 41 41 41 41 41 41 41 41 41 41 41 41 41 41 41 41 41 41 41 41 41 41 42 41 41 41 41 41 41 41 41 41 41 41 41 41 41
4360D1%%%%%%%%%%%%%%%%%%%%%%%%%%%%%%%%%%%%%%%Jj%%%%%%%%%%%%%%%%%%%%%%%%%%%%%
$$ 41 41 41 41 41 41 41 41 41 41 41 41 41 41 41 41 41 41 41 41 41 41 41 41 41 41 41 41 41 41 41 41 41 41 41 41 41 41 41 41 42 41 41 41 41 41 41 41 41 41 41 41 41 41 41 41 41 41 41 41 41 41 41 41 41 41 41 41 41 41 41
4352D1J%%j%J%%j%J%%j%%%%%%%%%%%%%%%%%%%%%%%%%%%%%%%%%%%%%%%%%%%%%%%%%%%%%%%J
$$ 41 42 42 42 41 41 42 42 42 41 41 42 42 42 41 41 41 41 41 41 41 41 41 41 41 41 41 41 41 41 41 41 41 41 41 41 41 41 41 41 41 41 41 41 41 41 41 41 41 41 41 41 41 41 41 41 41 41 41 41 41 41 41 41 41 41 41 41 41 41 42
4345D2%%j%%%%%%%%%%%%%%%%%%%%%%%%%%%%%Jj%%%%%%%%Jj%%%%%%%%%%%%%%%%%%%%%%%%%%
$$ 42 42 42 41 41 41 41 41 41 41 41 41 41 41 41 41 41 41 41 41 41 41 41 41 41 41 41 41 41 41 41 41 41 42 41 41 41 41 41 41 41 41 41 42 41 41 41 41 41 41 41 41 41 41 41 41 41 41 41 41 41 41 41 41 41 41 41 41 41 41 41
4337D1%%%%%%%%%%%%%%%%%%%%%%%%%%%%%%%%%%%%%%%%%%%%%%%%%%%%%%%%%%%%%%%%%%%%%%
$$ 41 41 41 41 41 41 41 41 41 41 41 41 41 41 41 41 41 41 41 41 41 41 41 41 41 41 41 41 41 41 41 41 41 41 41 41 41 41 41 41 41 41 41 41 41 41 41 41 41 41 41 41 41 41 41 41 41 41 41 41 41 41 41 41 41 41 41 41 41 41 41
4330D1%%%%%%%%%%%%%%%%%%%%%%%J%%%j%%%%%%%%%%%%%%%%%%%%%%%%%%%%%%%%%%%%%%%%%%
$$ 41 41 41 41 41 41 41 41 41 41 41 41 41 41 41 41 41 41 41 41 41 41 41 41 42 42 42 42 41 41 41 41 41 41 41 41 41 41 41 41 41 41 41 41 41 41 41 41 41 41 41 41 41 41 41 41 41 41 41 41 41 41 41 41 41 41 41 41 41 41 41
4322D1%%%%%%%%%%%%%%%%%%%%%%%%%%%%%%%%%%%%%%%%%%%%%%%j%%J%%%%%%%%%%%%%%%%%%%
$$ 41 41 41 41 41 41 41 41 41 41 41 41 41 41 41 41 41 41 41 41 41 41 41 41 41 41 41 41 41 41 41 41 41 41 41 41 41 41 41 41 41 41 41 41 41 41 41 41 40 40 40 41 41 41 41 41 41 41 41 41 41 41 41 41 41 41 41 41 41 41 41
4315D1%%%%%%%%%%%Jj%%%%%%%%%%%%%%%%%%%%%%%%%%%%%%%%%%%%%%%%%%%%%%%%%%%%%%%%%
$$ 41 41 41 41 41 41 41 41 41 41 41 41 42 41 41 41 41 41 41 41 41 41 41 41 41 41 41 41 41 41 41 41 41 41 41 41 41 41 41 41 41 41 41 41 41 41 41 41 41 41 41 41 41 41 41 41 41 41 41 41 41 41 41 41 41 41 41 41 41 41 41
4308D1%%%%%%%%%%%%%%%%%%%%%%%%%%%%%%%%%%%%%%%%%%%%%%%%%%%%%%%%%%%%%%%%%%%%%%
$$ 41 41 41 41 41 41 41 41 41 41 41 41 41 41 41 41 41 41 41 41 41 41 41 41 41 41 41 41 41 41 41 41 41 41 41 41 41 41 41 41 41 41 41 41 41 41 41 41 41 41 41 41 41 41 41 41 41 41 41 41 41 41 41 41 41 41 41 41 41 41 41
4300D1%%%%%%%%%%%%%%%%%%%%%%%%%%%%%%%%%%%%%%%%%%%%%%%%%%%%%%%%%%%%%%%%%%%%%%
$$ 41 41 41 41 41 41 41 41 41 41 41 41 41 41 41 41 41 41 41 41 41 41 41 41 41 41 41 41 41 41 41 41 41 41 41 41 41 41 41 41 41 41 41 41 41 41 41 41 41 41 41 41 41 41 41 41 41 41 41 41 41 41 41 41 41 41 41 41 41 41 41
4293D1%%%%%%%%%jJ%%%%%%%%%%%%%%%%%%%%%%%%%%%%%%%%%%%%%%%%%%%%%%%%%%%%%%%%%%%
$$ 41 41 41 41 41 41 41 41 41 41 40 41 41 41 41 41 41 41 41 41 41 41 41 41 41 41 41 41 41 41 41 41 41 41 41 41 41 41 41 41 41 41 41 41 41 41 41 41 41 41 41 41 41 41 41 41 41 41 41 41 41 41 41 41 41 41 41 41 41 41 41
4285D1%%%%%%%jJ%%%%%%%%%%%%%%%%%%%%%%%%%%%%%%%%%%%%%%%%%%%%%%%%%%%%%%%%%%%%%
$$ 41 41 41 41 41 41 41 41 40 41 41 41 41 41 41 41 41 41 41 41 41 41 41 41 41 41 41 41 41 41 41 41 41 41 41 41 41 41 41 41 41 41 41 41 41 41 41 41 41 41 41 41 41 41 41 41 41 41 41 41 41 41 41 41 41 41 41 41 41 41 41
4278D1%%%%%%%%%%%%%%%%%%%%%%%%%%%%%%%%%%%%%%%%%%%%%%%%%%%%%%%%%%%%%%%%%%%%%%
$$ 41 41 41 41 41 41 41 41 41 41 41 41 41 41 41 41 41 41 41 41 41 41 41 41 41 41 41 41 41 41 41 41 41 41 41 41 41 41 41 41 41 41 41 41 41 41 41 41 41 41 41 41 41 41 41 41 41 41 41 41 41 41 41 41 41 41 41 41 41 41 41
4271D1%%%%%%%%%%%%%%%%%%%%%%%%j%%J%%%%%%%%%%%%%%%%%%%%%%%%%%%%%%%%%%%%%%%%%%
$$ 41 41 41 41 41 41 41 41 41 41 41 41 41 41 41 41 41 41 41 41 41 41 41 41 41 40 40 40 41 41 41 41 41 41 41 41 41 41 41 41 41 41 41 41 41 41 41 41 41 41 41 41 41 41 41 41 41 41 41 41 41 41 41 41 41 41 41 41 41 41 41
4263D1%%%%%%j%J%%%%%%%%%%%%%%%%%%%%%%j%J%%%%%%%%%%%%%%%%%%%%%%%%%%%%%%%%%%%%
$$ 41 41 41 41 41 41 41 40 40 41 41 41 41 41 41 41 41 41 41 41 41 41 41 41 41 41 41 41 41 41 41 41 40 40 41 41 41 41 41 41 41 41 41 41 41 41 41 41 41 41 41 41 41 41 41 41 41 41 41 41 41 41 41 41 41 41 41 41 41 41 41
4256D1%%%%%%%%%%%%%%%%%%%%%%%%%%%%%%j%%J%%%%%%%%%j%J%%%%%%%%%%%%%%%%%%%%%%%%
$$ 41 41 41 41 41 41 41 41 41 41 41 41 41 41 41 41 41 41 41 41 41 41 41 41 41 41 41 41 41 41 41 40 40 40 41 41 41 41 41 41 41 41 41 41 40 40 41 41 41 41 41 41 41 41 41 41 41 41 41 41 41 41 41 41 41 41 41 41 41 41 41
4248D1%%%%%%j%%%%%%J%%%%%%%%%%%%%%%%%%%%%%%%%%%%%j%J%%%%%%%%%%%%%%%%%%%%%%%%
$$ 41 41 41 41 41 41 41 40 40 40 40 40 40 40 41 41 41 41 41 41 41 41 41 41 41 41 41 41 41 41 41 41 41 41 41 41 41 41 41 41 41 41 41 41 40 40 41 41 41 41 41 41 41 41 41 41 41 41 41 41 41 41 41 41 41 41 41 41 41 41 41
4241D1%%%%%%j%%%%%%%%%%J%%%%%%%%%%%%%%%j%J%%%%%%%%%%%%%%%%%%%%%%%%%%%%%%jJ%%
$$ 41 41 41 41 41 41 41 40 40 40 40 40 40 40 40 40 40 40 41 41 41 41 41 41 41 41 41 41 41 41 41 41 41 41 40 40 41 41 41 41 41 41 41 41 41 41 41 41 41 41 41 41 41 41 41 41 41 41 41 41 41 41 41 41 41 41 41 40 41 41 41
4233D1%%%%%%%%%%%%%%j%%%%%J%j%J%%%%%%%%%%%%%%%%%%%%%%%%%%%%%%%%%%%%%%%%%%%%%
$$ 41 41 41 41 41 41 41 41 41 41 41 41 41 41 41 40 40 40 40 40 40 41 41 40 40 41 41 41 41 41 41 41 41 41 41 41 41 41 41 41 41 41 41 41 41 41 41 41 41 41 41 41 41 41 41 41 41 41 41 41 41 41 41 41 41 41 41 41 41 41 41
4226D1%%%%j%%%%%%J%jJ%%%%%%%%%%%%%%%%%%%%%%%%%%%%%%%%%%%%%%%%%%%%%%%%%%j%J%%
$$ 41 41 41 41 41 40 40 40 40 40 40 40 41 41 40 41 41 41 41 41 41 41 41 41 41 41 41 41 41 41 41 41 41 41 41 41 41 41 41 41 41 41 41 41 41 41 41 41 41 41 41 41 41 41 41 41 41 41 41 41 41 41 41 41 41 41 40 40 41 41 41
4219D1%%%%%%%%%%%%%%%%%%%%%%%%%jJ%j%%%%J%%%%%%%%%%%%%%%%jJ%%%%%%%%%%%j%%%J%%
$$ 41 41 41 41 41 41 41 41 41 41 41 41 41 41 41 41 41 41 41 41 41 41 41 41 41 41 40 41 41 40 40 40 40 40 41 41 41 41 41 41 41 41 41 41 41 41 41 41 41 41 41 40 41 41 41 41 41 41 41 41 41 41 41 41 40 40 40 40 41 41 41
4211D1%%%%%%%%%%%%%%%%%%%%%%%%%%%%%%%%%%%%%%%%%%%%%%%%%%%%%%%jJ%%%j%%J%%%%j%
$$ 41 41 41 41 41 41 41 41 41 41 41 41 41 41 41 41 41 41 41 41 41 41 41 41 41 41 41 41 41 41 41 41 41 41 41 41 41 41 41 41 41 41 41 41 41 41 41 41 41 41 41 41 41 41 41 41 40 41 41 41 41 40 40 40 41 41 41 41 41 40 40
4204D0J%j%J%%%%%%j%%%J%%%%%%%jJ%%%%%%%%%%%%%j%J%%%%j%%%%%J%%%%%%%%%%%%%%%%%%
$$ 40 41 41 40 40 41 41 41 41 41 41 41 40 40 40 40 41 41 41 41 41 41 41 41 40 41 41 41 41 41 41 41 41 41 41 41 41 41 41 40 40 41 41 41 41 41 40 40 40 40 40 40 41 41 41 41 41 41 41 41 41 41 41 41 41 41 41 41 41 41 41
4196D1%%%%%%j%%J%%%%%%%%%%%j%%J%j%%J%%%%%%%%%%%%%%%%%%%j%%%J%%%%%%%%%%%%%%%%
$$ 41 41 41 41 41 41 41 40 40 40 41 41 41 41 41 41 41 41 41 41 41 41 40 40 40 41 41 40 40 40 41 41 41 41 41 41 41 41 41 41 41 41 41 41 41 41 41 41 41 41 40 40 40 40 41 41 41 41 41 41 41 41 41 41 41 41 41 41 41 41 41
4189D1%j%%%%%%%%%%%%%%Jj%%%%%J%%%%%%%%%j%%%J%%%%%%%%%%%%%%%j%%J%%%%j%%%%%J%%
$$ 41 41 40 40 40 40 40 40 40 40 40 40 40 40 40 40 40 41 40 40 40 40 40 40 41 41 41 41 41 41 41 41 41 41 40 40 40 40 41 41 41 41 41 41 41 41 41 41 41 41 41 41 41 41 40 40 40 41 41 41 41 41 40 40 40 40 40 40 41 41 41
4182D1%%j%%%%%%%%%J%%%%%%%%%%%j%%%J%%%j%%J%%%j%J%j%%%%J%%%%%%%%%%%%%%%%j%%J%
$$ 41 41 41 40 40 40 40 40 40 40 40 40 40 41 41 41 41 41 41 41 41 41 41 41 41 40 40 40 40 41 41 41 41 40 40 40 41 41 41 41 40 40 41 41 40 40 40 40 40 41 41 41 41 41 41 41 41 41 41 41 41 41 41 41 41 41 40 40 40 41 41
4174D1%%%%%%%%%%%%%%%%%%%j%%%%%%%Jj%%J%jJ%%j%%%%%%%%%%%%%%%%%%%%%%%%%%%%%J%j
$$ 41 41 41 41 41 41 41 41 41 41 41 41 41 41 41 41 41 41 41 41 40 40 40 40 40 40 40 40 41 40 40 40 41 41 40 41 41 41 40 40 40 40 40 40 40 40 40 40 40 40 40 40 40 40 40 40 40 40 40 40 40 40 40 40 40 40 40 40 41 41 40
4167D0%%%%%%J%j%%%%%%%%%%%%%%%%%%%%%%%J%jJ%jJ%%%%%%%%%%%%%%%%%%jJ%%%jJ%%j%%J
$$ 40 40 40 40 40 40 40 41 41 40 40 40 40 40 40 40 40 40 40 40 40 40 40 40 40 40 40 40 40 40 40 40 40 41 41 40 41 41 40 41 41 41 41 41 41 41 41 41 41 41 41 41 41 41 41 41 41 41 40 41 41 41 41 40 41 41 41 40 40 40 41
4159D1%j%%%%%J%j%%%Jj%%%%%%%J%%j%%J%j%%%%%%J%%%j%J%%%%%%%%%%%%%%%%%%%%%%j%%%
$$ 41 41 40 40 40 40 40 40 41 41 40 40 40 40 41 40 40 40 40 40 40 40 40 41 41 41 40 40 40 41 41 40 40 40 40 40 40 40 41 41 41 41 40 40 41 41 41 41 41 41 41 41 41 41 41 41 41 41 41 41 41 41 41 41 41 41 41 40 40 40 40
4152D0J%j%%%%%J%%%%jJ%%%%%%%%%%%%j%%%%%%J%%j%%%%%%%J%%%%j%%%%%%%%%%%%%%%%%%%
$$ 40 41 41 40 40 40 40 40 40 41 41 41 41 41 40 41 41 41 41 41 41 41 41 41 41 41 41 41 40 40 40 40 40 40 40 41 41 41 40 40 40 40 40 40 40 40 41 41 41 41 41 40 40 40 40 40 40 40 40 40 40 40 40 40 40 40 40 40 40 40 40
4144D0J%%%%%%%%%%%%j%%J%j%%%%J%%%%%%j%%%%%%%%%%J%j%%J%j%%%%%J%%j%J%%%%%%%%%%
$$ 40 41 41 41 41 41 41 41 41 41 41 41 41 41 40 40 40 41 41 40 40 40 40 40 41 41 41 41 41 41 41 40 40 40 40 40 40 40 40 40 40 40 41 41 40 40 40 41 41 40 40 40 40 40 40 41 41 41 40 40 41 41 41 41 41 41 41 41 41 41 41
4137D1%%%j%%%%J%%%%%%%%%%%%j%%J%%%j%%%%%J%j%J%%j%J%%j%%%%Jj%%%%%%%J%%%%%%%%%
$$ 41 41 41 41 40 40 40 40 40 41 41 41 41 41 41 41 41 41 41 41 41 41 40 40 40 41 41 41 41 40 40 40 40 40 40 41 41 40 40 41 41 41 40 40 41 41 41 40 40 40 40 40 41 40 40 40 40 40 40 40 40 41 41 41 41 41 41 41 41 41 41
4130D1%%%j%%J%j%%%%%%%%%J%%%%%%%%%%%%%%%%%%%%%%%%%%%%%%%%j%%%%%%%%%%%%%%%J%%
$$ 41 41 41 41 40 40 40 41 41 40 40 40 40 40 40 40 40 40 40 41 41 41 41 41 41 41 41 41 41 41 41 41 41 41 41 41 41 41 41 41 41 41 41 41 41 41 41 41 41 41 41 41 40 40 40 40 40 40 40 40 40 40 40 40 40 40 40 40 41 41 41
4122D1%%%j%%%%%%J%%j%%%%J%%j%J%j%%%%%%%%Jj%J%%%%%%%%%%%%j%Jj%J%%%%j%%JjJ%%j%
$$ 41 41 41 41 40 40 40 40 40 40 40 41 41 41 40 40 40 40 40 41 41 41 40 40 41 41 40 40 40 40 40 40 40 40 40 41 40 40 41 41 41 41 41 41 41 41 41 41 41 41 41 40 40 41 40 40 41 41 41 41 41 40 40 40 41 40 41 41 41 40 40
4115D0%%%%J%jJ%%j%Jj%%%%%Jj%%%%%%%%%%J%%%%j%%%%%J%%%j%%%%%%J%%%j%%%J%%%%%%j%
$$ 40 40 40 40 40 41 41 40 41 41 41 40 40 41 40 40 40 40 40 40 41 40 40 40 40 40 40 40 40 40 40 40 41 41 41 41 41 40 40 40 40 40 40 41 41 41 41 40 40 40 40 40 40 40 41 41 41 41 40 40 40 40 41 41 41 41 41 41 41 40 40
4107D0%%%%%Jj%%J%%%%j%%%%%%%JjJ%%%%%%%%%%%j%%%%%%%%%%Jj%%%%%%%%%%%%%%J%j%%%J
$$ 40 40 40 40 40 40 41 40 40 40 41 41 41 41 41 40 40 40 40 40 40 40 40 41 40 41 41 41 41 41 41 41 41 41 41 41 41 40 40 40 40 40 40 40 40 40 40 40 41 40 40 40 40 40 40 40 40 40 40 40 40 40 40 40 41 41 40 40 40 40 41
4100D1%%%%%%%%%%%%%%j%%%%%J%%j%%%%%%%%%%%%%%%%%%J%%%jJ%jJ%%%%j%%%%%%%%%Jj%%%
$$ 41 41 41 41 41 41 41 41 41 41 41 41 41 41 41 40 40 40 40 40 40 41 41 41 40 40 40 40 40 40 40 40 40 40 40 40 40 40 40 40 40 40 40 41 41 41 41 40 41 41 40 41 41 41 41 41 40 40 40 40 40 40 40 40 40 40 41 40 40 40 40
4093D0%%%%%%%%%%%%%%%%%%%J%%%%%%j%%%%%%%%%J%%%%%%%%%%%%%%%%j%%%%%%%J%%%j%%%%
$$ 40 40 40 40 40 40 40 40 40 40 40 40 40 40 40 40 40 40 40 40 41 41 41 41 41 41 41 40 40 40 40 40 40 40 40 40 40 41 41 41 41 41 41 41 41 41 41 41 41 41 41 41 41 41 40 40 40 40 40 40 40 40 41 41 41 41 40 40 40 40 40
4085D0%Jj%%%%J%%%%%%%%%%%%%%%%%%j%J%%%%%j%%%%%%%%%%Jj%%%%%%%%%%%%%J%%%%%j%%J
$$ 40 40 41 40 40 40 40 40 41 41 41 41 41 41 41 41 41 41 41 41 41 41 41 41 41 41 41 40 40 41 41 41 41 41 41 40 40 40 40 40 40 40 40 40 40 40 41 40 40 40 40 40 40 40 40 40 40 40 40 40 40 41 41 41 41 41 41 40 40 40 41
4078D1j%%%%%%%%%J%%%%%%%j%%J%%%%%%%%%%%%%%%%%%%%%%%%%%%%%%%%%%%%j%%%%%%%%%%%
$$ 41 40 40 40 40 40 40 40 40 40 40 41 41 41 41 41 41 41 41 40 40 40 41 41 41 41 41 41 41 41 41 41 41 41 41 41 41 41 41 41 41 41 41 41 41 41 41 41 41 41 41 41 41 41 41 41 41 41 41 40 40 40 40 40 40 40 40 40 40 40 40
4070D0%%%%%%%%%%%%%%J%%%%j%%%%J%%%%%%%%%%%%%%%%%%%%%%%%%%%%%%j%%J%%%%%%%%%%%
$$ 40 40 40 40 40 40 40 40 40 40 40 40 40 40 40 41 41 41 41 41 40 40 40 40 40 41 41 41 41 41 41 41 41 41 41 41 41 41 41 41 41 41 41 41 41 41 41 41 41 41 41 41 41 41 41 41 40 40 40 41 41 41 41 41 41 41 41 41 41 41 41
4063D1%%%%%%%%%%%%%%%%%%%j%%%%%%%%%J%%%%%j%%%%%%%%%%%%%%%%%%J%%j%%%%%%J%%j%%
$$ 41 41 41 41 41 41 41 41 41 41 41 41 41 41 41 41 41 41 41 41 40 40 40 40 40 40 40 40 40 40 41 41 41 41 41 41 40 40 40 40 40 40 40 40 40 40 40 40 40 40 40 40 40 40 40 41 41 41 40 40 40 40 40 40 40 41 41 41 40 40 40
4055D0%%%%%%%%%%%%%%%%%%J%%%%j%%%%%%%%%%%%%%%%Jj%%%Jj%%%%%%%%Jj%%%%%%%%%%%%%
$$ 40 40 40 40 40 40 40 40 40 40 40 40 40 40 40 40 40 40 40 41 41 41 41 41 40 40 40 40 40 40 40 40 40 40 40 40 40 40 40 40 40 41 40 40 40 40 41 40 40 40 40 40 40 40 40 40 41 40 40 40 40 40 40 40 40 40 40 40 40 40 40
4048D0%J%j%%%%%Jj%%%%%%%%%%%%%%%%%%%%%%%%%%%%%%%%%%%%%%%%%%%%%%%%%%%%%%J%j%%
$$ 40 40 41 41 40 40 40 40 40 40 41 40 40 40 40 40 40 40 40 40 40 40 40 40 40 40 40 40 40 40 40 40 40 40 40 40 40 40 40 40 40 40 40 40 40 40 40 40 40 40 40 40 40 40 40 40 40 40 40 40 40 40 40 40 40 40 41 41 40 40 40
4041D0J%j%%J%%%%j%%%J%%%%%%j%%%%%%%%%%%%%%%%%%%%%%%%%%J%%%%%%j%%%%%%%%J%%%%j
$$ 40 41 41 40 40 40 41 41 41 41 41 40 40 40 40 41 41 41 41 41 41 41 40 40 40 40 40 40 40 40 40 40 40 40 40 40 40 40 40 40 40 40 40 40 40 40 40 40 40 41 41 41 41 41 41 41 40 40 40 40 40 40 40 40 40 41 41 41 41 41 40
4033D0%%%%%%%%%%%%%%%%%%%%%%%%%%%%%%%%%%%Jj%%%%%%%%%%%%%%%%%%%%%%%%%%%%%%%%%
$$ 40 40 40 40 40 40 40 40 40 40 40 40 40 40 40 40 40 40 40 40 40 40 40 40 40 40 40 40 40 40 40 40 40 40 40 40 41 40 40 40 40 40 40 40 40 40 40 40 40 40 40 40 40 40 40 40 40 40 40 40 40 40 40 40 40 40 40 40 40 40 40
4026D0%%%%%%%%%%%%%%%%%%%%%%%%%%%%%%%%%%%%J%%%%j%%J%j%%%%%%%%%%%%%%%%%%%%%%%
$$ 40 40 40 40 40 40 40 40 40 40 40 40 40 40 40 40 40 40 40 40 40 40 40 40 40 40 40 40 40 40 40 40 40 40 40 40 40 41 41 41 41 41 40 40 40 41 41 40 40 40 40 40 40 40 40 40 40 40 40 40 40 40 40 40 40 40 40 40 40 40 40
4018D0%%%%%%%%%%%%%%%%%%%%%%%%%%%%%%%%%%%%%%%%%%%%%%%%%%%%%%%%%%%%%%%J%j%%%%
$$ 40 40 40 40 40 40 40 40 40 40 40 40 40 40 40 40 40 40 40 40 40 40 40 40 40 40 40 40 40 40 40 40 40 40 40 40 40 40 40 40 40 40 40 40 40 40 40 40 40 40 40 40 40 40 40 40 40 40 40 40 40 40 40 40 41 41 40 40 40 40 40
4011D0%%%%%%%%%%%%%%%%%%%%%%%%%J%%j%%%%%%%%%%%%%%%%%%%%%%%%%%%%%%%%%%%%%%%%%
$$ 40 40 40 40 40 40 40 40 40 40 40 40 40 40 40 40 40 40 40 40 40 40 40 40 40 40 41 41 41 40 40 40 40 40 40 40 40 40 40 40 40 40 40 40 40 40 40 40 40 40 40 40 40 40 40 40 40 40 40 40 40 40 40 40 40 40 40 40 40 40 40
4004D0%%%%%%%%%%%%%%%%%%%%%%%%%%%%%%%%%%%%%%%%%%%%%%%%%%%%%%%%%%%%%%%%%%%%%%
$$ 40 40 40 40 40 40 40 40 40 40 40 40 40 40 40 40 40 40 40 40 40 40 40 40 40 40 40 40 40 40 40 40 40 40 40 40 40 40 40 40 40 40 40 40 40 40 40 40 40 40 40 40 40 40 40 40 40 40 40 40 40 40 40 40 40 40 40 40 40 40 40
3996D0%%%%%%%%%%%%%%%%%%%%%%%%%%%%%%%%%%%%%%%%%%%%%%%%%%%%%%%%%%%%%%%%%%%%%%
$$ 40 40 40 40 40 40 40 40 40 40 40 40 40 40 40 40 40 40 40 40 40 40 40 40 40 40 40 40 40 40 40 40 40 40 40 40 40 40 40 40 40 40 40 40 40 40 40 40 40 40 40 40 40 40 40 40 40 40 40 40 40 40 40 40 40 40 40 40 40 40 40
3989D0%%%%%%%%%%J%%j%%%%%%%%%%%%%%%%%%%%%%%%%%%%%%%%%%%%%%%%%%%%%%%%%%%%%%%%
$$ 40 40 40 40 40 40 40 40 40 40 40 41 41 41 40 40 40 40 40 40 40 40 40 40 40 40 40 40 40 40 40 40 40 40 40 40 40 40 40 40 40 40 40 40 40 40 40 40 40 40 40 40 40 40 40 40 40 40 40 40 40 40 40 40 40 40 40 40 40 40 40
3981D0%%%%%%%%%%%%%%%%%%%%%%%%%%%%%%%%%%%%%%Jj%%%%%%%%%Jj%%%%%%%%%%%%%%%%%%%
$$ 40 40 40 40 40 40 40 40 40 40 40 40 40 40 40 40 40 40 40 40 40 40 40 40 40 40 40 40 40 40 40 40 40 40 40 40 40 40 40 41 40 40 40 40 40 40 40 40 40 40 41 40 40 40 40 40 40 40 40 40 40 40 40 40 40 40 40 40 40 40 40
3974D0%%J%%%j%%J%%%%j%%%%%%%%%%%%%%%%%%%%%%%%%%%%%%%%%%%%%%%%%%%%%%%%%%%%%%%
$$ 40 40 40 41 41 41 41 40 40 40 41 41 41 41 41 40 40 40 40 40 40 40 40 40 40 40 40 40 40 40 40 40 40 40 40 40 40 40 40 40 40 40 40 40 40 40 40 40 40 40 40 40 40 40 40 40 40 40 40 40 40 40 40 40 40 40 40 40 40 40 40
3966D0%%%%%%%%%%%%%%%%%%%%%%%%%%%%%%%%%%%%%%%%%%%%%%%%%%%%%%%%%%%%%%%%%%%%%%
$$ 40 40 40 40 40 40 40 40 40 40 40 40 40 40 40 40 40 40 40 40 40 40 40 40 40 40 40 40 40 40 40 40 40 40 40 40 40 40 40 40 40 40 40 40 40 40 40 40 40 40 40 40 40 40 40 40 40 40 40 40 40 40 40 40 40 40 40 40 40 40 40
3959D0%%%%%%%%%%%%%%%%%%%%%%%%%%%%%%%%%%%%%%%%%%%%%%%%%%%%%jJ%%%%%%%%%%%%%%%
$$ 40 40 40 40 40 40 40 40 40 40 40 40 40 40 40 40 40 40 40 40 40 40 40 40 40 40 40 40 40 40 40 40 40 40 40 40 40 40 40 40 40 40 40 40 40 40 40 40 40 40 40 40 40 40 39 40 40 40 40 40 40 40 40 40 40 40 40 40 40 40 40
3952D0%%%%%%%%%%%%%%%%%%%%%%%%%%%%%%%%%%%%%%%%%%%%%%%%%%%%%%%%%%%%%%%%%%%%%%
$$ 40 40 40 40 40 40 40 40 40 40 40 40 40 40 40 40 40 40 40 40 40 40 40 40 40 40 40 40 40 40 40 40 40 40 40 40 40 40 40 40 40 40 40 40 40 40 40 40 40 40 40 40 40 40 40 40 40 40 40 40 40 40 40 40 40 40 40 40 40 40 40
3944D0%%%%%%%%%%%%%%%%%%%%%%%%%%%%%%%%%%%%%%%%%%%%%%%%%%%%%%%%%%%%%%%%%%%%%%
$$ 40 40 40 40 40 40 40 40 40 40 40 40 40 40 40 40 40 40 40 40 40 40 40 40 40 40 40 40 40 40 40 40 40 40 40 40 40 40 40 40 40 40 40 40 40 40 40 40 40 40 40 40 40 40 40 40 40 40 40 40 40 40 40 40 40 40 40 40 40 40 40
3937D0%%%%%%%%%%%%%%%%%%%%%%%%%%%%%%%%%%%%%%%%%%%%%%%%%%%%%%%%%%%%%%%%%%%%%%
$$ 40 40 40 40 40 40 40 40 40 40 40 40 40 40 40 40 40 40 40 40 40 40 40 40 40 40 40 40 40 40 40 40 40 40 40 40 40 40 40 40 40 40 40 40 40 40 40 40 40 40 40 40 40 40 40 40 40 40 40 40 40 40 40 40 40 40 40 40 40 40 40
3929D0%%%%%%%%%%%%%%%%%%%%%%%%%%%%%%%%%%%%j%J%%%%%%%%%%%%%%%J%%j%%%%%%%%%%%%
$$ 40 40 40 40 40 40 40 40 40 40 40 40 40 40 40 40 40 40 40 40 40 40 40 40 40 40 40 40 40 40 40 40 40 40 40 40 40 39 39 40 40 40 40 40 40 40 40 40 40 40 40 40 40 40 40 41 41 41 40 40 40 40 40 40 40 40 40 40 40 40 40
3922D0%%%%%%%%%%%%%%%%%%%%%%%%%%%%%%%%%%%%j%J%%%j%J%%%%%%%%%%%%%%%%%%%%%%%%%
$$ 40 40 40 40 40 40 40 40 40 40 40 40 40 40 40 40 40 40 40 40 40 40 40 40 40 40 40 40 40 40 40 40 40 40 40 40 40 39 39 40 40 40 40 39 39 40 40 40 40 40 40 40 40 40 40 40 40 40 40 40 40 40 40 40 40 40 40 40 40 40 40
3915D0%%%%%%%%%%%%%%%%%%%%%%%%%%%%%%%%%%%%%%j%%J%%j%J%%%%%%%%%%%%%%%%%%%%%%%
$$ 40 40 40 40 40 40 40 40 40 40 40 40 40 40 40 40 40 40 40 40 40 40 40 40 40 40 40 40 40 40 40 40 40 40 40 40 40 40 40 39 39 39 40 40 40 39 39 40 40 40 40 40 40 40 40 40 40 40 40 40 40 40 40 40 40 40 40 40 40 40 40
3907D0%%%%%%%%%%%%%%%%%%%%%%%%%%%%%%%%%%%%%%%%%%%%%%%Jj%%%%%%%%%%%%%%%%%%%%%
$$ 40 40 40 40 40 40 40 40 40 40 40 40 40 40 40 40 40 40 40 40 40 40 40 40 40 40 40 40 40 40 40 40 40 40 40 40 40 40 40 40 40 40 40 40 40 40 40 40 41 40 40 40 40 40 40 40 40 40 40 40 40 40 40 40 40 40 40 40 40 40 40
3900D0%%%%%%%%%%%%%%%%%%%%J%%j%%%%%%%%%%%%%%%%%%%%%%%%%%%%%%%%%%%%%%%%%%%%%%
$$ 40 40 40 40 40 40 40 40 40 40 40 40 40 40 40 40 40 40 40 40 40 41 41 41 40 40 40 40 40 40 40 40 40 40 40 40 40 40 40 40 40 40 40 40 40 40 40 40 40 40 40 40 40 40 40 40 40 40 40 40 40 40 40 40 40 40 40 40 40 40 40
3892D0%%%%%%%%%%%%%%%%%%%%%%%%%%%%%%%%%%%%%%%%%%%%%%%%%%%%%%%%%%%%%%%%%%%%%%
$$ 40 40 40 40 40 40 40 40 40 40 40 40 40 40 40 40 40 40 40 40 40 40 40 40 40 40 40 40 40 40 40 40 40 40 40 40 40 40 40 40 40 40 40 40 40 40 40 40 40 40 40 40 40 40 40 40 40 40 40 40 40 40 40 40 40 40 40 40 40 40 40
3885D0%%%%%%%%%%%%%%%%%%%%%%%%%%%%%%%%%%%%%%%%%%%%%%%%%%%%%%%%%%%%%%%%%%%%%%
$$ 40 40 40 40 40 40 40 40 40 40 40 40 40 40 40 40 40 40 40 40 40 40 40 40 40 40 40 40 40 40 40 40 40 40 40 40 40 40 40 40 40 40 40 40 40 40 40 40 40 40 40 40 40 40 40 40 40 40 40 40 40 40 40 40 40 40 40 40 40 40 40
3877D0%%%%%%%%%%%%%%%%%%%%%%%%%%%%%%%%%%%%%%%%%%%%%%%%%%%%%%%%%%%%%%%%%%%j%%
$$ 40 40 40 40 40 40 40 40 40 40 40 40 40 40 40 40 40 40 40 40 40 40 40 40 40 40 40 40 40 40 40 40 40 40 40 40 40 40 40 40 40 40 40 40 40 40 40 40 40 40 40 40 40 40 40 40 40 40 40 40 40 40 40 40 40 40 40 40 39 39 39
3870C9J%jJ%%%%%%%%%%%%%%%%%%%%%%%%%%%%%%%%%%%%%%%%%%%%%%j%J%%%%%%%%%%%%%%%%%
$$ 39 40 40 39 40 40 40 40 40 40 40 40 40 40 40 40 40 40 40 40 40 40 40 40 40 40 40 40 40 40 40 40 40 40 40 40 40 40 40 40 40 40 40 40 40 40 40 40 40 40 40 39 39 40 40 40 40 40 40 40 40 40 40 40 40 40 40 40 40 40 40
3863D0%%%%%%%%%%%%%%%%%%%%%%%%%%%%%%%%%%%%%%%%%%%%%%%%%%%%%%%%%%%%%%%%j%%J%%
$$ 40 40 40 40 40 40 40 40 40 40 40 40 40 40 40 40 40 40 40 40 40 40 40 40 40 40 40 40 40 40 40 40 40 40 40 40 40 40 40 40 40 40 40 40 40 40 40 40 40 40 40 40 40 40 40 40 40 40 40 40 40 40 40 40 40 39 39 39 40 40 40
3855D0%%%%j%%JjJ%%%j%%%%%%%J%%%%%%%%%%j%J%%%%%%%%%%%%%%j%%%%%%%J%%%%j%%%%%%%
$$ 40 40 40 40 40 39 39 39 40 39 40 40 40 40 39 39 39 39 39 39 39 39 40 40 40 40 40 40 40 40 40 40 40 39 39 40 40 40 40 40 40 40 40 40 40 40 40 40 40 40 39 39 39 39 39 39 39 39 40 40 40 40 40 39 39 39 39 39 39 39 39
3848C9%%%%%%%%%%%%%%%%%%%%J%%%%%%%%%%%%%%%%%%%%%%%%%%%%%%%%%%jJ%%%%%%%%%%%%%
$$ 39 39 39 39 39 39 39 39 39 39 39 39 39 39 39 39 39 39 39 39 39 40 40 40 40 40 40 40 40 40 40 40 40 40 40 40 40 40 40 40 40 40 40 40 40 40 40 40 40 40 40 40 40 40 40 40 39 40 40 40 40 40 40 40 40 40 40 40 40 40 40
3840D0%%%%%%%%%%%%%%%%%jJ%%%%%%%%%%%%%%%%%%%%%%%%%%%%%%%%%%%%%%%%%%%%%%%%%%%
$$ 40 40 40 40 40 40 40 40 40 40 40 40 40 40 40 40 40 40 39 40 40 40 40 40 40 40 40 40 40 40 40 40 40 40 40 40 40 40 40 40 40 40 40 40 40 40 40 40 40 40 40 40 40 40 40 40 40 40 40 40 40 40 40 40 40 40 40 40 40 40 40
3833D0%%%%%%%%%%%%%jJ%%%%%%%%%%%%jJ%%%%%%%%%%%%%%%%%%%%%%%%%%%%%jJ%%%%%%%%%%
$$ 40 40 40 40 40 40 40 40 40 40 40 40 40 40 39 40 40 40 40 40 40 40 40 40 40 40 40 40 39 40 40 40 40 40 40 40 40 40 40 40 40 40 40 40 40 40 40 40 40 40 40 40 40 40 40 40 40 40 40 39 40 40 40 40 40 40 40 40 40 40 40
3826D0%%%%%%%%%%%%%%%%%%%%%%%%%%%%%%%%%%%%j%%Jj%%J%%%%%%%%%%%%j%%%%J%%%%%%%%
$$ 40 40 40 40 40 40 40 40 40 40 40 40 40 40 40 40 40 40 40 40 40 40 40 40 40 40 40 40 40 40 40 40 40 40 40 40 40 39 39 39 40 39 39 39 40 40 40 40 40 40 40 40 40 40 40 40 40 39 39 39 39 39 40 40 40 40 40 40 40 40 40
3818D0%%%jJ%%%%%%%%%%%%%%%%%%%%%%%%%%%%%%%%%%%%%%%%%%%%%%%%%%%%%%%%%%%%%%%%%
$$ 40 40 40 40 39 40 40 40 40 40 40 40 40 40 40 40 40 40 40 40 40 40 40 40 40 40 40 40 40 40 40 40 40 40 40 40 40 40 40 40 40 40 40 40 40 40 40 40 40 40 40 40 40 40 40 40 40 40 40 40 40 40 40 40 40 40 40 40 40 40 40
3811D0%%%%%%%%%%%%%%j%J%%%%%%%%%j%%J%%%%%%%%j%%%%%%%%%%%%%%J%%%%j%%J%%%jJ%%%
$$ 40 40 40 40 40 40 40 40 40 40 40 40 40 40 40 39 39 40 40 40 40 40 40 40 40 40 40 39 39 39 40 40 40 40 40 40 40 40 40 39 39 39 39 39 39 39 39 39 39 39 39 39 39 39 40 40 40 40 40 39 39 39 40 40 40 40 39 40 40 40 40
3803D0%%%%%%%j%%%%%%%%%%%%J%%%%%%j%%%%%%%%%%J%%%%j%%J%%%%%jJ%%%%%%%%%%%j%J%%
$$ 40 40 40 40 40 40 40 40 39 39 39 39 39 39 39 39 39 39 39 39 39 40 40 40 40 40 40 40 39 39 39 39 39 39 39 39 39 39 39 40 40 40 40 40 39 39 39 40 40 40 40 40 40 39 40 40 40 40 40 40 40 40 40 40 40 40 39 39 40 40 40
3796D0%%%%j%J%%%%j%J%%%%%%%%%%%%%j%%%J%%%%%%%j%Jj%%%%%%%J%%%%j%J%%%%%jJ%%%%%
$$ 40 40 40 40 40 39 39 40 40 40 40 40 39 39 40 40 40 40 40 40 40 40 40 40 40 40 40 40 39 39 39 39 40 40 40 40 40 40 40 40 39 39 40 39 39 39 39 39 39 39 39 40 40 40 40 40 39 39 40 40 40 40 40 40 39 40 40 40 40 40 40
3788D0%%%j%%%%%J%j%%%J%%%%%%j%%J%%%%%%%%%%%%%%%%%%%%%%%%%%%%%%j%%%%%J%%%%%%%
$$ 40 40 40 40 39 39 39 39 39 39 40 40 39 39 39 39 40 40 40 40 40 40 40 39 39 39 40 40 40 40 40 40 40 40 40 40 40 40 40 40 40 40 40 40 40 40 40 40 40 40 40 40 40 40 40 40 40 39 39 39 39 39 39 40 40 40 40 40 40 40 40
3781D0%%%%%j%J%%%%%%%%%%%%%%%%%%%%%%%%%%%%%%%%%%%%%%%%%%%%%%%%%%%jJ%%%%%%%%%
$$ 40 40 40 40 40 40 39 39 40 40 40 40 40 40 40 40 40 40 40 40 40 40 40 40 40 40 40 40 40 40 40 40 40 40 40 40 40 40 40 40 40 40 40 40 40 40 40 40 40 40 40 40 40 40 40 40 40 40 40 40 39 40 40 40 40 40 40 40 40 40 40
3774D0%%%%%%%%%%%%%%%%%%%%%%%%%jJ%j%%J%%%%%%%%%%%jJ%%%%%%%%%%%%%%%%%%%%%%%%%
$$ 40 40 40 40 40 40 40 40 40 40 40 40 40 40 40 40 40 40 40 40 40 40 40 40 40 40 39 40 40 39 39 39 40 40 40 40 40 40 40 40 40 40 40 40 39 40 40 40 40 40 40 40 40 40 40 40 40 40 40 40 40 40 40 40 40 40 40 40 40 40 40
3766D0%%%%%%%%%%%%%%%j%%J%%%%%j%J%%%%%%%%%j%%%J%%%%%%%%%%%%%%%%%%%%%%%%%%%%%
$$ 40 40 40 40 40 40 40 40 40 40 40 40 40 40 40 40 39 39 39 40 40 40 40 40 40 39 39 40 40 40 40 40 40 40 40 40 40 39 39 39 39 40 40 40 40 40 40 40 40 40 40 40 40 40 40 40 40 40 40 40 40 40 40 40 40 40 40 40 40 40 40
3759D0%%%%%%%%%%%%%%%%%%%%%%%%%%%%%%%%%%%%%%%%%%%%%%%%%%%%%%%%%%%%%%%%%%%%%%
$$ 40 40 40 40 40 40 40 40 40 40 40 40 40 40 40 40 40 40 40 40 40 40 40 40 40 40 40 40 40 40 40 40 40 40 40 40 40 40 40 40 40 40 40 40 40 40 40 40 40 40 40 40 40 40 40 40 40 40 40 40 40 40 40 40 40 40 40 40 40 40 40
3751D0%%j%%%J%%%%%%%%%%j%J%%%%%%%%%%%%%%%%%%%%%%%%%%%%%%%%%%%%%%%%%%%%%%%Jj%
$$ 40 40 40 39 39 39 39 40 40 40 40 40 40 40 40 40 40 40 39 39 40 40 40 40 40 40 40 40 40 40 40 40 40 40 40 40 40 40 40 40 40 40 40 40 40 40 40 40 40 40 40 40 40 40 40 40 40 40 40 40 40 40 40 40 40 40 40 40 41 40 40
3744D0%%%%%%%%%%%%%%%%%%%%%%%%%%%%%%%%%%%%%%%%%%%%%%%%%%%%%%%%%%%%%%%%%%%%%%
$$ 40 40 40 40 40 40 40 40 40 40 40 40 40 40 40 40 40 40 40 40 40 40 40 40 40 40 40 40 40 40 40 40 40 40 40 40 40 40 40 40 40 40 40 40 40 40 40 40 40 40 40 40 40 40 40 40 40 40 40 40 40 40 40 40 40 40 40 40 40 40 40
3736D0%%j%J%%j%J%%%%%%%%%%j%%J%%%%%%%%%%%%%%%%%%%%%%%%%%%%%%j%J%%%%%%%%%%j%%
$$ 40 40 40 39 39 40 40 40 39 39 40 40 40 40 40 40 40 40 40 40 40 39 39 39 40 40 40 40 40 40 40 40 40 40 40 40 40 40 40 40 40 40 40 40 40 40 40 40 40 40 40 40 40 40 40 39 39 40 40 40 40 40 40 40 40 40 40 40 39 39 39
3729C9%J%%%%%%%%%%%%%%%%jJ%%%jJ%%%%j%J%%%%%%%%%%%%%%%%%%%%%%%%%%%%%%jJ%%%j%J
$$ 39 39 40 40 40 40 40 40 40 40 40 40 40 40 40 40 40 40 40 39 40 40 40 40 39 40 40 40 40 40 39 39 40 40 40 40 40 40 40 40 40 40 40 40 40 40 40 40 40 40 40 40 40 40 40 40 40 40 40 40 40 40 40 39 40 40 40 40 39 39 40
3722D0%%%%%%%%%%%%%%%%%%%%%%%j%J%%%%%%%%%%%%%%%%%%%%%%%%%%%%%%%%%%%%%jJ%%%%%
$$ 40 40 40 40 40 40 40 40 40 40 40 40 40 40 40 40 40 40 40 40 40 40 40 40 39 39 40 40 40 40 40 40 40 40 40 40 40 40 40 40 40 40 40 40 40 40 40 40 40 40 40 40 40 40 40 40 40 40 40 40 40 40 40 40 39 40 40 40 40 40 40
3714D0%%%%%%%%%%jJ%j%%%%%%%%%%J%%%%%j%%J%%%%%%%j%%%%%%%%%%%%%%%%%%%%%%%%%%%%
$$ 40 40 40 40 40 40 40 40 40 40 40 39 40 40 39 39 39 39 39 39 39 39 39 39 39 40 40 40 40 40 40 39 39 39 40 40 40 40 40 40 40 40 39 39 39 39 39 39 39 39 39 39 39 39 39 39 39 39 39 39 39 39 39 39 39 39 39 39 39 39 39
3707C9%%%J%%%j%%%%%%%%%%%%%%%%%J%%%%%%%%%j%%%%%%%%%%%%%%%J%%%%%%%%%%%%%jJ%%%
$$ 39 39 39 39 40 40 40 40 39 39 39 39 39 39 39 39 39 39 39 39 39 39 39 39 39 39 40 40 40 40 40 40 40 40 40 40 39 39 39 39 39 39 39 39 39 39 39 39 39 39 39 39 40 40 40 40 40 40 40 40 40 40 40 40 40 40 39 40 40 40 40
3699D0%j%J%%%%%%%j%%J%%%%%%%%%%%%%%%%%%%%j%JjJ%%%%%%j%%%%%%J%%%%%%%%%%j%%%%%
$$ 40 40 39 39 40 40 40 40 40 40 40 40 39 39 39 40 40 40 40 40 40 40 40 40 40 40 40 40 40 40 40 40 40 40 40 40 39 39 40 39 40 40 40 40 40 40 40 39 39 39 39 39 39 39 40 40 40 40 40 40 40 40 40 40 40 39 39 39 39 39 39
3692C9%J%%%%%jJ%%%%%%%%%%%%%%%%%%%%%j%%%%%%%%%J%%%%%%j%%%%J%%%%%%j%%%%%%%J%%
$$ 39 39 40 40 40 40 40 40 39 40 40 40 40 40 40 40 40 40 40 40 40 40 40 40 40 40 40 40 40 40 40 39 39 39 39 39 39 39 39 39 39 40 40 40 40 40 40 40 39 39 39 39 39 40 40 40 40 40 40 40 39 39 39 39 39 39 39 39 40 40 40
3685D0j%%%%%%%%%%%%%%%%%%%%%%J%%%%%j%%J%%j%%%%%%%%%%%J%%%%%%%j%%%%%%%%%%%%%%
$$ 40 39 39 39 39 39 39 39 39 39 39 39 39 39 39 39 39 39 39 39 39 39 39 39 40 40 40 40 40 40 39 39 39 40 40 40 39 39 39 39 39 39 39 39 39 39 39 39 40 40 40 40 40 40 40 40 39 39 39 39 39 39 39 39 39 39 39 39 39 39 39
3677C9%%%%%%%%%%%%%%%%%%%%%%%Jj%%%%%%%%%%%%%%%%%%%%%%%%%%%%%%%%%%%%%%%%%%%%%
$$ 39 39 39 39 39 39 39 39 39 39 39 39 39 39 39 39 39 39 39 39 39 39 39 39 40 39 39 39 39 39 39 39 39 39 39 39 39 39 39 39 39 39 39 39 39 39 39 39 39 39 39 39 39 39 39 39 39 39 39 39 39 39 39 39 39 39 39 39 39 39 39
3670C9%%%%%%%%%%%%%%%%%%%%%%%%%%%%%%%%%%%%%%%J%j%%%%%%%%%%%%%%%%%%%%%%%J%%%j
$$ 39 39 39 39 39 39 39 39 39 39 39 39 39 39 39 39 39 39 39 39 39 39 39 39 39 39 39 39 39 39 39 39 39 39 39 39 39 39 39 39 40 40 39 39 39 39 39 39 39 39 39 39 39 39 39 39 39 39 39 39 39 39 39 39 39 39 40 40 40 40 39
3662C9J%%%%%%%%%%j%%%J%%%%j%%%%%J%%%%%%%%%j%%J%%%%%%j%%%%Jj%%%%%%%%%%%%%%%J%
$$ 39 40 40 40 40 40 40 40 40 40 40 40 39 39 39 39 40 40 40 40 40 39 39 39 39 39 39 40 40 40 40 40 40 40 40 40 40 39 39 39 40 40 40 40 40 40 40 39 39 39 39 39 40 39 39 39 39 39 39 39 39 39 39 39 39 39 39 39 39 40 40
3655D0%%%%j%%%%%%%%%%%%%%%%%%%%%%%%%%%%%%%%%%%%%%%%%%%%%%%%%%%%%%%%%%%%%J%j%
$$ 40 40 40 40 40 39 39 39 39 39 39 39 39 39 39 39 39 39 39 39 39 39 39 39 39 39 39 39 39 39 39 39 39 39 39 39 39 39 39 39 39 39 39 39 39 39 39 39 39 39 39 39 39 39 39 39 39 39 39 39 39 39 39 39 39 39 39 40 40 39 39
3647C9%%%%%%%%%%%J%j%%%%%%%%%J%%%%%j%%%%%%%%%%%J%j%%%%%%%%%%%%%%%%%%%%%%%%%%
$$ 39 39 39 39 39 39 39 39 39 39 39 39 40 40 39 39 39 39 39 39 39 39 39 39 40 40 40 40 40 40 39 39 39 39 39 39 39 39 39 39 39 39 40 40 39 39 39 39 39 39 39 39 39 39 39 39 39 39 39 39 39 39 39 39 39 39 39 39 39 39 39
3640C9%%%%%%%%%%%%%%%%%%%%%%%%%%%%%%Jj%%%%%%%%%%%%%%%%%%%%%%%%%%%%Jj%%%J%%%%
$$ 39 39 39 39 39 39 39 39 39 39 39 39 39 39 39 39 39 39 39 39 39 39 39 39 39 39 39 39 39 39 39 40 39 39 39 39 39 39 39 39 39 39 39 39 39 39 39 39 39 39 39 39 39 39 39 39 39 39 39 39 39 40 39 39 39 39 40 40 40 40 40
3633D0%j%%%%%%%%%%%%%%%%%%%%%J%%%%j%%%%%%%%%%%%%%%%%%%%J%%j%%%%%%%%%%%%%J%%%
$$ 40 40 39 39 39 39 39 39 39 39 39 39 39 39 39 39 39 39 39 39 39 39 39 39 40 40 40 40 40 39 39 39 39 39 39 39 39 39 39 39 39 39 39 39 39 39 39 39 39 39 40 40 40 39 39 39 39 39 39 39 39 39 39 39 39 39 39 40 40 40 40
3625D0j%%%%%%%%%%%%%%J%%%j%%%%%%%%J%%%%%%j%%%%%%%%%%%%%%%%%%%%%%%%%%%%%J%%j%
$$ 40 39 39 39 39 39 39 39 39 39 39 39 39 39 39 39 40 40 40 40 39 39 39 39 39 39 39 39 39 40 40 40 40 40 40 40 39 39 39 39 39 39 39 39 39 39 39 39 39 39 39 39 39 39 39 39 39 39 39 39 39 39 39 39 39 39 40 40 40 39 39
3618C9%%%%%%%%%%%%%%%%%%J%%%j%%%%%%%J%%j%%%%%%%%%%%%%%%%%%%%%%%%%%%%%%%Jj%%%
$$ 39 39 39 39 39 39 39 39 39 39 39 39 39 39 39 39 39 39 39 40 40 40 40 39 39 39 39 39 39 39 39 40 40 40 39 39 39 39 39 39 39 39 39 39 39 39 39 39 39 39 39 39 39 39 39 39 39 39 39 39 39 39 39 39 39 39 40 39 39 39 39
3610C9%%%%%%%%%%%%%%%%%%%%%%%%%%%%%%%%J%j%%%%%%%%%%%%%%%%%%%%%Jj%%%%%%%%%%%%
$$ 39 39 39 39 39 39 39 39 39 39 39 39 39 39 39 39 39 39 39 39 39 39 39 39 39 39 39 39 39 39 39 39 39 40 40 39 39 39 39 39 39 39 39 39 39 39 39 39 39 39 39 39 39 39 39 39 39 40 39 39 39 39 39 39 39 39 39 39 39 39 39
3603C9%%J%j%%%%%%%%%%%%%%%%%%%%%%%%%%%%%%%%%%%%%%%%%%%%%%%%Jj%%%%%%%%%%%%%%%
$$ 39 39 39 40 40 39 39 39 39 39 39 39 39 39 39 39 39 39 39 39 39 39 39 39 39 39 39 39 39 39 39 39 39 39 39 39 39 39 39 39 39 39 39 39 39 39 39 39 39 39 39 39 39 39 40 39 39 39 39 39 39 39 39 39 39 39 39 39 39 39 39
3596C9%%%%%%%%%%%%%%%%%%%%%%%%%%%%%%%%%%%%Jj%%%%%%%%%%%%%%%%%%%%%%%%%%%%%%%%
$$ 39 39 39 39 39 39 39 39 39 39 39 39 39 39 39 39 39 39 39 39 39 39 39 39 39 39 39 39 39 39 39 39 39 39 39 39 39 40 39 39 39 39 39 39 39 39 39 39 39 39 39 39 39 39 39 39 39 39 39 39 39 39 39 39 39 39 39 39 39 39 39
3588C9%%%%%%%%%%%%%%%%%%%%%%%%%%%%%%%%%%%%%%%%%%%%%%%%%%%%%%%%%%%%%%%%%%%%%%
$$ 39 39 39 39 39 39 39 39 39 39 39 39 39 39 39 39 39 39 39 39 39 39 39 39 39 39 39 39 39 39 39 39 39 39 39 39 39 39 39 39 39 39 39 39 39 39 39 39 39 39 39 39 39 39 39 39 39 39 39 39 39 39 39 39 39 39 39 39 39 39 39
3581C9%%%J%j%%%%%%%%%%%%%%%%%%%%%%%%%%%%%%%%%%%%%%%%%%%%%%%%%%%%%%%%%%%%%J%%
$$ 39 39 39 39 40 40 39 39 39 39 39 39 39 39 39 39 39 39 39 39 39 39 39 39 39 39 39 39 39 39 39 39 39 39 39 39 39 39 39 39 39 39 39 39 39 39 39 39 39 39 39 39 39 39 39 39 39 39 39 39 39 39 39 39 39 39 39 39 40 40 40
3573D0j%%%%%%%%%%%%%%%%%%%%%%%%%%%%%%%%%%%%%%%%%%%%%%%%%%%%%%%%%%%%%%%J%%j%%
$$ 40 39 39 39 39 39 39 39 39 39 39 39 39 39 39 39 39 39 39 39 39 39 39 39 39 39 39 39 39 39 39 39 39 39 39 39 39 39 39 39 39 39 39 39 39 39 39 39 39 39 39 39 39 39 39 39 39 39 39 39 39 39 39 39 39 40 40 40 39 39 39
3566C9%%%%%%%%%%%%%%%%%%%%%%%%%%%%%%%%%%%%%%%%%%%%%%%%%%%%%%%%%%%%%%%%%%%%%%
$$ 39 39 39 39 39 39 39 39 39 39 39 39 39 39 39 39 39 39 39 39 39 39 39 39 39 39 39 39 39 39 39 39 39 39 39 39 39 39 39 39 39 39 39 39 39 39 39 39 39 39 39 39 39 39 39 39 39 39 39 39 39 39 39 39 39 39 39 39 39 39 39
3558C9%%%%%%%%%%%%%%%%%%%%%%%%%%%%%%%%%%%%%%%%%%%%%%%%%%%%%%%%%%%%%%%%%%%%%%
$$ 39 39 39 39 39 39 39 39 39 39 39 39 39 39 39 39 39 39 39 39 39 39 39 39 39 39 39 39 39 39 39 39 39 39 39 39 39 39 39 39 39 39 39 39 39 39 39 39 39 39 39 39 39 39 39 39 39 39 39 39 39 39 39 39 39 39 39 39 39 39 39
3551C9%%%%%%%%%%%%%%%%%%%%%%%%%%%%%%%%%%%%%%%%%%%%%%%%%%%%%%%%%%%%%%%%%%%%%%
$$ 39 39 39 39 39 39 39 39 39 39 39 39 39 39 39 39 39 39 39 39 39 39 39 39 39 39 39 39 39 39 39 39 39 39 39 39 39 39 39 39 39 39 39 39 39 39 39 39 39 39 39 39 39 39 39 39 39 39 39 39 39 39 39 39 39 39 39 39 39 39 39
3544C9%%%%%%%%%%%%%%%%%%j%J%%%%%%%%%%%%%%%%%%%%%%%%%%%%%%%%%%%%%%%j%%J%%%%%%
$$ 39 39 39 39 39 39 39 39 39 39 39 39 39 39 39 39 39 39 39 38 38 39 39 39 39 39 39 39 39 39 39 39 39 39 39 39 39 39 39 39 39 39 39 39 39 39 39 39 39 39 39 39 39 39 39 39 39 39 39 39 39 38 38 38 39 39 39 39 39 39 39
3536C9j%J%%%%%%%%%%%%%%%%%%%%%%%%%%%%%%%%%%%%%%%%jJ%%%%%%%%%%%%%%%%j%J%%%%%%
$$ 39 38 38 39 39 39 39 39 39 39 39 39 39 39 39 39 39 39 39 39 39 39 39 39 39 39 39 39 39 39 39 39 39 39 39 39 39 39 39 39 39 39 39 39 38 39 39 39 39 39 39 39 39 39 39 39 39 39 39 39 39 39 38 38 39 39 39 39 39 39 39
3529C9%%%%%%%%%%%%j%%%J%%%%%j%%J%%%%%jJ%%%%%%%%%%%jJ%j%JjJ%%%%%jJ%%%%%%%%%%%
$$ 39 39 39 39 39 39 39 39 39 39 39 39 39 38 38 38 38 39 39 39 39 39 39 38 38 38 39 39 39 39 39 39 38 39 39 39 39 39 39 39 39 39 39 39 39 38 39 39 38 38 39 38 39 39 39 39 39 39 38 39 39 39 39 39 39 39 39 39 39 39 39
3521C9%%%%%%%%%%%%%%%%%%%%%%%%%%%%%%%%%%%%%%%%%%%%%%%%%%%%%%%%%%%%%%%%%%%%%%
$$ 39 39 39 39 39 39 39 39 39 39 39 39 39 39 39 39 39 39 39 39 39 39 39 39 39 39 39 39 39 39 39 39 39 39 39 39 39 39 39 39 39 39 39 39 39 39 39 39 39 39 39 39 39 39 39 39 39 39 39 39 39 39 39 39 39 39 39 39 39 39 39
3514C9%%%%%%%%%%%%%%%%%%%%%%%%%%%%%j%%%%%J%%%%%%%%%%%%%%%%%%%%%%%%%%%%%%%%%%
$$ 39 39 39 39 39 39 39 39 39 39 39 39 39 39 39 39 39 39 39 39 39 39 39 39 39 39 39 39 39 39 38 38 38 38 38 38 39 39 39 39 39 39 39 39 39 39 39 39 39 39 39 39 39 39 39 39 39 39 39 39 39 39 39 39 39 39 39 39 39 39 39
3507C9%%%%%%%%%%%%%%%%%%%%%%%%%%%%%%%%%%%%%%%%%%%%%J%%%%j%J%%%%%%j%%%%%%%%%%
$$ 39 39 39 39 39 39 39 39 39 39 39 39 39 39 39 39 39 39 39 39 39 39 39 39 39 39 39 39 39 39 39 39 39 39 39 39 39 39 39 39 39 39 39 39 39 39 40 40 40 40 40 39 39 40 40 40 40 40 40 40 39 39 39 39 39 39 39 39 39 39 39
3499C9%%%%%%%%%%%%%%%%%%%%%%%jJ%%%%%%%%%%%%%%jJ%%%%%%%%%%%%%%%%%%j%%J%%%%%%%
$$ 39 39 39 39 39 39 39 39 39 39 39 39 39 39 39 39 39 39 39 39 39 39 39 39 38 39 39 39 39 39 39 39 39 39 39 39 39 39 39 39 38 39 39 39 39 39 39 39 39 39 39 39 39 39 39 39 39 39 39 39 38 38 38 39 39 39 39 39 39 39 39
3492C9%%%%%%%%%%%%%%%%%j%%%%%J%%%%%%%%%%%%%%%%%%%%%%%%%%%%%%%%%%%%%%%%%%%%%%
$$ 39 39 39 39 39 39 39 39 39 39 39 39 39 39 39 39 39 39 38 38 38 38 38 38 39 39 39 39 39 39 39 39 39 39 39 39 39 39 39 39 39 39 39 39 39 39 39 39 39 39 39 39 39 39 39 39 39 39 39 39 39 39 39 39 39 39 39 39 39 39 39
3484C9%%%%%%%%J%%j%%%%%%jJ%%%%%%%%%%%jJ%%%%j%%%%%%%%%%%%%%J%%%%j%J%%%%%%%%%%
$$ 39 39 39 39 39 39 39 39 39 40 40 40 39 39 39 39 39 39 39 38 39 39 39 39 39 39 39 39 39 39 39 39 38 39 39 39 39 39 38 38 38 38 38 38 38 38 38 38 38 38 38 38 38 39 39 39 39 39 38 38 39 39 39 39 39 39 39 39 39 39 39
3477C9%%%%%%%%%%%%%%%%%%%%%%%%%%%%%%%%%%%%%%%%%%%%%%%%%%%%%%%%%%%%%%%%%%%%%%
$$ 39 39 39 39 39 39 39 39 39 39 39 39 39 39 39 39 39 39 39 39 39 39 39 39 39 39 39 39 39 39 39 39 39 39 39 39 39 39 39 39 39 39 39 39 39 39 39 39 39 39 39 39 39 39 39 39 39 39 39 39 39 39 39 39 39 39 39 39 39 39 39
3469C9%%j%%J%%%j%J%%%%%%j%%%%%%%%%%%J%%%%%%%%%%%%%%%%j%%J%%%%%%%j%%%J%%%%%%j
$$ 39 39 39 38 38 38 39 39 39 39 38 38 39 39 39 39 39 39 39 38 38 38 38 38 38 38 38 38 38 38 38 39 39 39 39 39 39 39 39 39 39 39 39 39 39 39 39 39 38 38 38 39 39 39 39 39 39 39 39 38 38 38 38 39 39 39 39 39 39 39 38
3462C8%Jj%%%%J%%%%%%%%%%%%%%%%%%%%%%%%%%j%%%%J%%%%%%%%%%%%%%%%%%%%%%%%%%%%%%
$$ 38 38 39 38 38 38 38 38 39 39 39 39 39 39 39 39 39 39 39 39 39 39 39 39 39 39 39 39 39 39 39 39 39 39 39 38 38 38 38 38 39 39 39 39 39 39 39 39 39 39 39 39 39 39 39 39 39 39 39 39 39 39 39 39 39 39 39 39 39 39 39
3455C9%%%%%%%%%%%%%%%%%%%%%%%%%%%%%%%%%%%%%%%%%%%%%%%%%%%%%%%jJ%%%%%%jJ%%%%%
$$ 39 39 39 39 39 39 39 39 39 39 39 39 39 39 39 39 39 39 39 39 39 39 39 39 39 39 39 39 39 39 39 39 39 39 39 39 39 39 39 39 39 39 39 39 39 39 39 39 39 39 39 39 39 39 39 39 38 39 39 39 39 39 39 39 38 39 39 39 39 39 39
3447C9%%%%%%%%%%%%%%%%%%%%%%%%%%%%%%%%%%%%%%%%%%%%%%%%%%%%%%%%%%%%%%%%%%%%%%
$$ 39 39 39 39 39 39 39 39 39 39 39 39 39 39 39 39 39 39 39 39 39 39 39 39 39 39 39 39 39 39 39 39 39 39 39 39 39 39 39 39 39 39 39 39 39 39 39 39 39 39 39 39 39 39 39 39 39 39 39 39 39 39 39 39 39 39 39 39 39 39 39
3440C9%%%%%%%%%%%%%jJ%%%%%%%%j%%%%%%%%%%%%%%%J%%%%%%%%%%%%%j%%%%%%%%J%%j%%%%
$$ 39 39 39 39 39 39 39 39 39 39 39 39 39 39 38 39 39 39 39 39 39 39 39 39 38 38 38 38 38 38 38 38 38 38 38 38 38 38 38 38 39 39 39 39 39 39 39 39 39 39 39 39 39 39 38 38 38 38 38 38 38 38 38 39 39 39 38 38 38 38 38
3432C8%%J%%%%%j%%%%%J%%%%jJ%%%%%%%%%%%%%%%%j%%%%%%%J%%%%%%%%%%j%%%%J%%%%%%%%
$$ 38 38 38 39 39 39 39 39 39 38 38 38 38 38 38 39 39 39 39 39 38 39 39 39 39 39 39 39 39 39 39 39 39 39 39 39 39 39 38 38 38 38 38 38 38 38 39 39 39 39 39 39 39 39 39 39 39 38 38 38 38 38 39 39 39 39 39 39 39 39 39
3425C9%%%%%%%%%%%%%%jJ%%%j%%%J%jJ%%%j%%%%J%%%%%%%%%%%%%%%j%%%%%%%%%%%%%%%%J%
$$ 39 39 39 39 39 39 39 39 39 39 39 39 39 39 39 38 39 39 39 39 38 38 38 38 39 39 38 39 39 39 39 38 38 38 38 38 39 39 39 39 39 39 39 39 39 39 39 39 39 39 39 39 38 38 38 38 38 38 38 38 38 38 38 38 38 38 38 38 38 39 39
3418C9%%%%%j%%%%%%J%%%%%%%%%%%%%%%%%j%%%%%%%%%%%J%%%%%%%%%%j%%%%Jj%%%%%%%%%%
$$ 39 39 39 39 39 39 38 38 38 38 38 38 38 39 39 39 39 39 39 39 39 39 39 39 39 39 39 39 39 39 39 38 38 38 38 38 38 38 38 38 38 38 38 39 39 39 39 39 39 39 39 39 39 39 38 38 38 38 38 39 38 38 38 38 38 38 38 38 38 38 38
3410C8%%%%%%%J%%%%%%%%%%%%%%%%%%%%%%j%%%J%%%%%%%%%%%%%%%j%%%%%%%%J%%%j%%%%%%
$$ 38 38 38 38 38 38 38 38 39 39 39 39 39 39 39 39 39 39 39 39 39 39 39 39 39 39 39 39 39 39 39 38 38 38 38 39 39 39 39 39 39 39 39 39 39 39 39 39 39 39 39 38 38 38 38 38 38 38 38 38 39 39 39 39 38 38 38 38 38 38 38
3403C8%Jj%%%%%%%%J%j%%%%%%%%%%%%%%%%%%%%%%%%%%%%%%%J%%%%j%%%J%%%%%%%%%%%j%%%
$$ 38 38 39 38 38 38 38 38 38 38 38 38 39 39 38 38 38 38 38 38 38 38 38 38 38 38 38 38 38 38 38 38 38 38 38 38 38 38 38 38 38 38 38 38 38 38 39 39 39 39 39 38 38 38 38 39 39 39 39 39 39 39 39 39 39 39 39 38 38 38 38
3395C8%%%%%%%%%%%%%%%%%%%%%%%%%J%%j%%%%%%%%%%%J%%%%j%%%%%%%%%%%J%j%%%%%J%%%%
$$ 38 38 38 38 38 38 38 38 38 38 38 38 38 38 38 38 38 38 38 38 38 38 38 38 38 38 39 39 39 38 38 38 38 38 38 38 38 38 38 38 38 39 39 39 39 39 38 38 38 38 38 38 38 38 38 38 38 38 39 39 38 38 38 38 38 38 39 39 39 39 39
3388C9%%%%%%%j%Jj%%%%%J%%%%%%j%%J%%%%%%%j%%%%J%%%%%%%%%%%%%%j%%%%%%J%j%%%%%%
$$ 39 39 39 39 39 39 39 39 38 38 39 38 38 38 38 38 38 39 39 39 39 39 39 39 38 38 38 39 39 39 39 39 39 39 39 38 38 38 38 38 39 39 39 39 39 39 39 39 39 39 39 39 39 39 39 38 38 38 38 38 38 38 39 39 38 38 38 38 38 38 38
3380C8%%%%%%%%%%%J%%j%J%j%J%%j%%%%%%%%%%%%%%%J%j%%%%%%%%%%%%%%%%%%%%%%%%%%%%
$$ 38 38 38 38 38 38 38 38 38 38 38 38 39 39 39 38 38 39 39 38 38 39 39 39 38 38 38 38 38 38 38 38 38 38 38 38 38 38 38 38 39 39 38 38 38 38 38 38 38 38 38 38 38 38 38 38 38 38 38 38 38 38 38 38 38 38 38 38 38 38 38
3373C8%Jj%%%%%%%%%%%%J%j%%%%%%%J%%j%%%%%%%%%%%%%%%%%J%%%%%%%%%%%j%%%%%%%J%%j
$$ 38 38 39 38 38 38 38 38 38 38 38 38 38 38 38 38 39 39 38 38 38 38 38 38 38 38 39 39 39 38 38 38 38 38 38 38 38 38 38 38 38 38 38 38 38 38 38 39 39 39 39 39 39 39 39 39 39 39 39 38 38 38 38 38 38 38 38 39 39 39 38
3366C8%J%%j%J%%j%%%%%%%%%%%J%%j%%%J%%%j%%%%%%J%%%%%%%%j%%%%%%%%%%%%%%%%%%%%%
$$ 38 38 39 39 39 38 38 39 39 39 38 38 38 38 38 38 38 38 38 38 38 38 39 39 39 38 38 38 38 39 39 39 39 38 38 38 38 38 38 38 39 39 39 39 39 39 39 39 39 38 38 38 38 38 38 38 38 38 38 38 38 38 38 38 38 38 38 38 38 38 38
3358C8%%%%%%%%%%%J%%j%%%%%%%%%%J%%%%%%j%%%%%%%%%%%%%%%%%%%%%%%%%%%%%%%%J%%%%
$$ 38 38 38 38 38 38 38 38 38 38 38 38 39 39 39 38 38 38 38 38 38 38 38 38 38 38 39 39 39 39 39 39 39 38 38 38 38 38 38 38 38 38 38 38 38 38 38 38 38 38 38 38 38 38 38 38 38 38 38 38 38 38 38 38 38 38 39 39 39 39 39
3351C9%%%%%%j%%%%%%%%%%%%%%%%%%%%%%%%%%%%%%%%%J%%%j%%%%%%%%%%%%%%J%j%%%%%%%%
$$ 39 39 39 39 39 39 39 38 38 38 38 38 38 38 38 38 38 38 38 38 38 38 38 38 38 38 38 38 38 38 38 38 38 38 38 38 38 38 38 38 38 39 39 39 39 38 38 38 38 38 38 38 38 38 38 38 38 38 38 38 39 39 38 38 38 38 38 38 38 38 38
3343C8J%j%%%%%%%%%%%%%%Jj%%%%%%%%%%%%%%%J%%j%%Jj%%%%%%%%%%J%%j%%%%%%%%%%Jj%%
$$ 38 39 39 38 38 38 38 38 38 38 38 38 38 38 38 38 38 38 39 38 38 38 38 38 38 38 38 38 38 38 38 38 38 38 38 39 39 39 38 38 38 39 38 38 38 38 38 38 38 38 38 38 38 39 39 39 38 38 38 38 38 38 38 38 38 38 38 39 38 38 38
3336C8%%%%%%%%%%J%%j%%%%%%%%%%%%%%%%%%%%%%%%%%%%%%%%%%%%%J%%j%%%%%%%%%%%J%j%
$$ 38 38 38 38 38 38 38 38 38 38 38 39 39 39 38 38 38 38 38 38 38 38 38 38 38 38 38 38 38 38 38 38 38 38 38 38 38 38 38 38 38 38 38 38 38 38 38 38 38 38 38 38 39 39 39 38 38 38 38 38 38 38 38 38 38 38 38 39 39 38 38
3329C8%%%%%%%%%%%%J%%%j%%%%%%%%%%%%%J%%%j%%%%%%%%%%%%%%%%%%%%%%J%j%%%%%%%%%%
$$ 38 38 38 38 38 38 38 38 38 38 38 38 38 39 39 39 39 38 38 38 38 38 38 38 38 38 38 38 38 38 38 39 39 39 39 38 38 38 38 38 38 38 38 38 38 38 38 38 38 38 38 38 38 38 38 38 38 38 39 39 38 38 38 38 38 38 38 38 38 38 38
3321C8%%%%%%%%%%%%%%%%%%%%%%%%%%%%%%%%%%%%%%J%%%j%%%%%%J%j%%%%%%%%%%%%%%%%%%
$$ 38 38 38 38 38 38 38 38 38 38 38 38 38 38 38 38 38 38 38 38 38 38 38 38 38 38 38 38 38 38 38 38 38 38 38 38 38 38 38 39 39 39 39 38 38 38 38 38 38 38 39 39 38 38 38 38 38 38 38 38 38 38 38 38 38 38 38 38 38 38 38
3314C8%%%%%%%%%%%%%%%%%%%%%%%%%%%%%%%%%%%%%%%J%j%%%%%%%%%%%%%%%%%%%%%%%%%%%%
$$ 38 38 38 38 38 38 38 38 38 38 38 38 38 38 38 38 38 38 38 38 38 38 38 38 38 38 38 38 38 38 38 38 38 38 38 38 38 38 38 38 39 39 38 38 38 38 38 38 38 38 38 38 38 38 38 38 38 38 38 38 38 38 38 38 38 38 38 38 38 38 38
3306C8%%J%j%%%%%%%%%%%%%%%%%%%%%%%%%%%%%%%%%%%%%%%%%%%%%%%%%%%%%%%%%%%%%%%%%
$$ 38 38 38 39 39 38 38 38 38 38 38 38 38 38 38 38 38 38 38 38 38 38 38 38 38 38 38 38 38 38 38 38 38 38 38 38 38 38 38 38 38 38 38 38 38 38 38 38 38 38 38 38 38 38 38 38 38 38 38 38 38 38 38 38 38 38 38 38 38 38 38
3299C8%%%%J%%j%%%%%%%%%%%%%%%%%%%%J%%j%%%%%%%%%%%%%J%%%%%j%%%%%%%%%%%%%%%%%%
$$ 38 38 38 38 38 39 39 39 38 38 38 38 38 38 38 38 38 38 38 38 38 38 38 38 38 38 38 38 38 39 39 39 38 38 38 38 38 38 38 38 38 38 38 38 38 38 39 39 39 39 39 39 38 38 38 38 38 38 38 38 38 38 38 38 38 38 38 38 38 38 38
3291C8%%%%%%%%%%%%J%%%j%%%%%%%%%%%%%%%%%%%%%%%%%%%%%%%%%JjJ%%j%%%%%%%%%%%%%%
$$ 38 38 38 38 38 38 38 38 38 38 38 38 38 39 39 39 39 38 38 38 38 38 38 38 38 38 38 38 38 38 38 38 38 38 38 38 38 38 38 38 38 38 38 38 38 38 38 38 38 38 38 39 38 39 39 39 38 38 38 38 38 38 38 38 38 38 38 38 38 38 38
3284C8%%%%%%%%%%%%%%%%%%%%%%%%%%%%%%%%%%%%%%%%%%%J%j%%%%%%%%%%%%%%%%%%%%%%%%
$$ 38 38 38 38 38 38 38 38 38 38 38 38 38 38 38 38 38 38 38 38 38 38 38 38 38 38 38 38 38 38 38 38 38 38 38 38 38 38 38 38 38 38 38 38 39 39 38 38 38 38 38 38 38 38 38 38 38 38 38 38 38 38 38 38 38 38 38 38 38 38 38
3277C8%%%%%%%%%%%%%%%%%%%%%%%%%%%%%%%%%%%%%%%%%%%%%%%%%%%%%%%%%%%%%%%%%%%%%%
$$ 38 38 38 38 38 38 38 38 38 38 38 38 38 38 38 38 38 38 38 38 38 38 38 38 38 38 38 38 38 38 38 38 38 38 38 38 38 38 38 38 38 38 38 38 38 38 38 38 38 38 38 38 38 38 38 38 38 38 38 38 38 38 38 38 38 38 38 38 38 38 38
3269C8%%%%%%%%%%%%%%%%%%%%%%%%%%%%%%%%%%%%%%%%%%%%%%%%%%%%%%%%%%%%%%%%%%%%%%
$$ 38 38 38 38 38 38 38 38 38 38 38 38 38 38 38 38 38 38 38 38 38 38 38 38 38 38 38 38 38 38 38 38 38 38 38 38 38 38 38 38 38 38 38 38 38 38 38 38 38 38 38 38 38 38 38 38 38 38 38 38 38 38 38 38 38 38 38 38 38 38 38
3262C8%%%%%%%%%%%%%%Jj%%%%%%%%%%%%%%%%%%%%%%%%%%%%%%%%%%%j%J%%%%%%%%%%%%%%%%
$$ 38 38 38 38 38 38 38 38 38 38 38 38 38 38 38 39 38 38 38 38 38 38 38 38 38 38 38 38 38 38 38 38 38 38 38 38 38 38 38 38 38 38 38 38 38 38 38 38 38 38 38 38 37 37 38 38 38 38 38 38 38 38 38 38 38 38 38 38 38 38 38
3254C8%%%%%%%%%%%%%%%%%%%%%%%%%%%%%%%%%%%%%%%%%%%%%%%%%%%%%jJ%%%%%%%%%%%%%%%
$$ 38 38 38 38 38 38 38 38 38 38 38 38 38 38 38 38 38 38 38 38 38 38 38 38 38 38 38 38 38 38 38 38 38 38 38 38 38 38 38 38 38 38 38 38 38 38 38 38 38 38 38 38 38 38 37 38 38 38 38 38 38 38 38 38 38 38 38 38 38 38 38
3247C8%%%%%%%%%%%%%%%%%%%%%%%%%%%%%%%%%%%%%%%%%%%%%%%%%%j%J%%%%%%%%%%%%%%%jJ
$$ 38 38 38 38 38 38 38 38 38 38 38 38 38 38 38 38 38 38 38 38 38 38 38 38 38 38 38 38 38 38 38 38 38 38 38 38 38 38 38 38 38 38 38 38 38 38 38 38 38 38 38 37 37 38 38 38 38 38 38 38 38 38 38 38 38 38 38 38 38 37 38
3240C8%%%%%j%%J%%%%%%%j%J%%%%%%%%%%%%%%%%%%%%%%%%%%%%%%%%jJ%%%%%%%%%%%%%%%%%
$$ 38 38 38 38 38 38 37 37 37 38 38 38 38 38 38 38 38 37 37 38 38 38 38 38 38 38 38 38 38 38 38 38 38 38 38 38 38 38 38 38 38 38 38 38 38 38 38 38 38 38 38 38 37 38 38 38 38 38 38 38 38 38 38 38 38 38 38 38 38 38 38
3232C8%%%%%jJ%%%%%%%%%%%%%%%%%%%%%%%j%J%%%%%jJ%%%%%%j%%J%%%%%j%J%%%%%%%%%%%%
$$ 38 38 38 38 38 38 37 38 38 38 38 38 38 38 38 38 38 38 38 38 38 38 38 38 38 38 38 38 38 38 38 37 37 38 38 38 38 38 38 37 38 38 38 38 38 38 38 37 37 37 38 38 38 38 38 38 37 37 38 38 38 38 38 38 38 38 38 38 38 38 38
3225C8%%%%%%%%%%%%%%%%%%%%%%%%%%%%%%%%%%%jJj%J%%%%%%%%%%%%%%%%%%%%%%%%%%%%%%
$$ 38 38 38 38 38 38 38 38 38 38 38 38 38 38 38 38 38 38 38 38 38 38 38 38 38 38 38 38 38 38 38 38 38 38 38 38 37 38 37 37 38 38 38 38 38 38 38 38 38 38 38 38 38 38 38 38 38 38 38 38 38 38 38 38 38 38 38 38 38 38 38
3217C8%%%%j%%J%%%%%%%%%%%%%%%%%%%j%%%%%J%%%%%%%%%%%%%%%%%%%%%%%%%%%%%%%%%%%%
$$ 38 38 38 38 38 37 37 37 38 38 38 38 38 38 38 38 38 38 38 38 38 38 38 38 38 38 38 38 37 37 37 37 37 37 38 38 38 38 38 38 38 38 38 38 38 38 38 38 38 38 38 38 38 38 38 38 38 38 38 38 38 38 38 38 38 38 38 38 38 38 38
3210C8%%%%j%%%J%%%%%%%%%%%%%%%%%%%%%%%%%%%%%%%%%%%%%%%%%%%%%%%%%%j%%%%J%%%%%
$$ 38 38 38 38 38 37 37 37 37 38 38 38 38 38 38 38 38 38 38 38 38 38 38 38 38 38 38 38 38 38 38 38 38 38 38 38 38 38 38 38 38 38 38 38 38 38 38 38 38 38 38 38 38 38 38 38 38 38 38 38 37 37 37 37 37 38 38 38 38 38 38
3202C8%%%%j%J%%%%%%%%%%%%%%%%%%%%%%%%%%%%%%%%%%%%%%%%%%%%%%%%jJ%%%j%J%%j%%%%
$$ 38 38 38 38 38 37 37 38 38 38 38 38 38 38 38 38 38 38 38 38 38 38 38 38 38 38 38 38 38 38 38 38 38 38 38 38 38 38 38 38 38 38 38 38 38 38 38 38 38 38 38 38 38 38 38 38 37 38 38 38 38 37 37 38 38 38 37 37 37 37 37
3195C7%Jj%%%J%%%%%%%j%%J%%%j%J%%%%%%%%%%%%%%%%j%%%%Jj%%%%J%%%%%%%%%%%%%%j%%%
$$ 37 37 38 37 37 37 37 38 38 38 38 38 38 38 38 37 37 37 38 38 38 38 37 37 38 38 38 38 38 38 38 38 38 38 38 38 38 38 38 38 38 37 37 37 37 37 38 37 37 37 37 37 38 38 38 38 38 38 38 38 38 38 38 38 38 38 38 37 37 37 37
3188C7J%%%%%%%%%%%%%%%%%%%%%%j%%%%J%j%%J%%%%%%%%%%%%%%%%%%%%%%%%%%%%%%%%%%%%
$$ 37 38 38 38 38 38 38 38 38 38 38 38 38 38 38 38 38 38 38 38 38 38 38 38 37 37 37 37 37 38 38 37 37 37 38 38 38 38 38 38 38 38 38 38 38 38 38 38 38 38 38 38 38 38 38 38 38 38 38 38 38 38 38 38 38 38 38 38 38 38 38
3180C8%%%%%%%%%%%%%%%%%%%%%%%%%%%%%%%jJ%%%%%%%%%%j%%J%%%%%%%%%%%j%%%%%%%%%%%
$$ 38 38 38 38 38 38 38 38 38 38 38 38 38 38 38 38 38 38 38 38 38 38 38 38 38 38 38 38 38 38 38 38 37 38 38 38 38 38 38 38 38 38 38 38 37 37 37 38 38 38 38 38 38 38 38 38 38 38 38 37 37 37 37 37 37 37 37 37 37 37 37
3173C7%%%%%%%%%%%%%%%%J%%%%%%%%%%%%%%%%%%jJ%%%%%%%%j%%%%%%J%%j%J%%%j%%%J%%%%
$$ 37 37 37 37 37 37 37 37 37 37 37 37 37 37 37 37 37 38 38 38 38 38 38 38 38 38 38 38 38 38 38 38 38 38 38 38 37 38 38 38 38 38 38 38 38 38 37 37 37 37 37 37 37 38 38 38 37 37 38 38 38 38 37 37 37 37 38 38 38 38 38
3165C8%%%%%j%%%%%%%%%%%%%J%%%%%%j%%%%%%%%%%%%J%%%%%%%%%%j%%%%%%%%%%%%%J%%%%%
$$ 38 38 38 38 38 38 37 37 37 37 37 37 37 37 37 37 37 37 37 37 38 38 38 38 38 38 38 37 37 37 37 37 37 37 37 37 37 37 37 37 38 38 38 38 38 38 38 38 38 38 38 37 37 37 37 37 37 37 37 37 37 37 37 37 37 38 38 38 38 38 38
3158C8%%%%%%%%%%j%%%%%%%%%%%%%J%%%j%%%%%%%%%%J%%%%%%jJ%%%jJ%%%%%%%%%%j%%%%%%
$$ 38 38 38 38 38 38 38 38 38 38 38 37 37 37 37 37 37 37 37 37 37 37 37 37 37 38 38 38 38 37 37 37 37 37 37 37 37 37 37 37 38 38 38 38 38 38 38 37 38 38 38 38 37 38 38 38 38 38 38 38 38 38 38 38 37 37 37 37 37 37 37
3151C7%%J%%%j%%%%%%%%%%%J%%%%%%%%%%%j%%%%%%J%%%%%%%%%%%%%j%%%%%%%%%%%%%%%%J%
$$ 37 37 37 38 38 38 38 37 37 37 37 37 37 37 37 37 37 37 37 38 38 38 38 38 38 38 38 38 38 38 38 37 37 37 37 37 37 37 38 38 38 38 38 38 38 38 38 38 38 38 38 38 37 37 37 37 37 37 37 37 37 37 37 37 37 37 37 37 37 38 38
3143C8j%%%%%%J%%%%%%%%%%j%%%%J%j%%J%%%%j%%%%%%%J%%%%%%%j%%%J%%%%%%%%%j%%Jj%%
$$ 38 37 37 37 37 37 37 37 38 38 38 38 38 38 38 38 38 38 38 37 37 37 37 37 38 38 37 37 37 38 38 38 38 38 37 37 37 37 37 37 37 37 38 38 38 38 38 38 38 38 37 37 37 37 38 38 38 38 38 38 38 38 38 38 37 37 37 38 37 37 37
3136C7%%%%%%%%%%%%%%%%J%%%%%%%%%%%%j%%%J%%%%%j%%%%%%%%J%%j%%%%%%J%%j%%%%%%%%
$$ 37 37 37 37 37 37 37 37 37 37 37 37 37 37 37 37 37 38 38 38 38 38 38 38 38 38 38 38 38 38 37 37 37 37 38 38 38 38 38 38 37 37 37 37 37 37 37 37 37 38 38 38 37 37 37 37 37 37 37 38 38 38 37 37 37 37 37 37 37 37 37
3128C7%%%%%%%%%%%%%J%j%%J%%%jJ%%%%%%j%%%%%%J%%j%%%%%%J%%%%%%%%%%%%%%%%%%%%j%
$$ 37 37 37 37 37 37 37 37 37 37 37 37 37 37 38 38 37 37 37 38 38 38 38 37 38 38 38 38 38 38 38 37 37 37 37 37 37 37 38 38 38 37 37 37 37 37 37 37 38 38 38 38 38 38 38 38 38 38 38 38 38 38 38 38 38 38 38 38 38 37 37
3121C7%%%%%%%%%%%%%%%%%%%%%%%%%%%%%%%%J%%%%%j%%%%%J%%%%%%%%%j%%%%%%%%%%%%J%j
$$ 37 37 37 37 37 37 37 37 37 37 37 37 37 37 37 37 37 37 37 37 37 37 37 37 37 37 37 37 37 37 37 37 37 38 38 38 38 38 38 37 37 37 37 37 37 38 38 38 38 38 38 38 38 38 38 37 37 37 37 37 37 37 37 37 37 37 37 37 38 38 37
3113C7%%%%%%%%%%%J%%%%%%%j%%Jj%%%%%%%%%%%%%%%%%%J%%j%%%%J%%%j%%%%J%%%%%%%%%%
$$ 37 37 37 37 37 37 37 37 37 37 37 37 38 38 38 38 38 38 38 38 37 37 37 38 37 37 37 37 37 37 37 37 37 37 37 37 37 37 37 37 37 37 37 38 38 38 37 37 37 37 37 38 38 38 38 37 37 37 37 37 38 38 38 38 38 38 38 38 38 38 38
3106C8j%%%%%%%%%%J%%%%jJ%%%%%%%%%%%j%J%%%%%%%%%%%%%%j%%%%%%%%%%J%%%%j%%%%%%%
$$ 38 37 37 37 37 37 37 37 37 37 37 37 38 38 38 38 38 37 38 38 38 38 38 38 38 38 38 38 38 38 37 37 38 38 38 38 38 38 38 38 38 38 38 38 38 38 38 37 37 37 37 37 37 37 37 37 37 37 38 38 38 38 38 37 37 37 37 37 37 37 37
3099C7%%%J%%j%%J%%%%%%%%%%%jJ%%%%%%%%%%%%%%%%%%%%%%%%%%%%%j%%%%J%%%j%%%%%%%%
$$ 37 37 37 37 38 38 38 37 37 37 38 38 38 38 38 38 38 38 38 38 38 38 37 38 38 38 38 38 38 38 38 38 38 38 38 38 38 38 38 38 38 38 38 38 38 38 38 38 38 38 38 38 38 37 37 37 37 37 38 38 38 38 37 37 37 37 37 37 37 37 37
3091C7%%%%%%%%%%%%%%%%%%%%%%%%%%%%%%J%%j%%%%J%j%%%%%%%%%%%%%%%%%%%%%%%%%%%%%
$$ 37 37 37 37 37 37 37 37 37 37 37 37 37 37 37 37 37 37 37 37 37 37 37 37 37 37 37 37 37 37 37 38 38 38 37 37 37 37 37 38 38 37 37 37 37 37 37 37 37 37 37 37 37 37 37 37 37 37 37 37 37 37 37 37 37 37 37 37 37 37 37
3084C7%%%%%%%%%%%%%%%%%%%%%%%%%%%Jj%%%%%%%%%%%%%%%%%%%%%%%%%%%%%%%%%%%%%%%%%
$$ 37 37 37 37 37 37 37 37 37 37 37 37 37 37 37 37 37 37 37 37 37 37 37 37 37 37 37 37 38 37 37 37 37 37 37 37 37 37 37 37 37 37 37 37 37 37 37 37 37 37 37 37 37 37 37 37 37 37 37 37 37 37 37 37 37 37 37 37 37 37 37
3076C7%%%%%%%%%%%%%%%%%%%%%%%%%%%%%%%%%%%%%%%%%%%%%%%%%%%%%%%%%%%%%%%%%%%%%%
$$ 37 37 37 37 37 37 37 37 37 37 37 37 37 37 37 37 37 37 37 37 37 37 37 37 37 37 37 37 37 37 37 37 37 37 37 37 37 37 37 37 37 37 37 37 37 37 37 37 37 37 37 37 37 37 37 37 37 37 37 37 37 37 37 37 37 37 37 37 37 37 37
3069C7%%%%%%%%%%%%%%%%%%%%%%%%%%%%%%%%%%%%%%%%%%%%%%%%%%%%%%%%%%%%%%%%%%%%%%
$$ 37 37 37 37 37 37 37 37 37 37 37 37 37 37 37 37 37 37 37 37 37 37 37 37 37 37 37 37 37 37 37 37 37 37 37 37 37 37 37 37 37 37 37 37 37 37 37 37 37 37 37 37 37 37 37 37 37 37 37 37 37 37 37 37 37 37 37 37 37 37 37
3062C7%%%%%%%%%%%%%%%%%%%%%%%%%%%%%%%%%%%%%%%%%%%%%%%%%%%%%%%%%%%%%%%%%%%%%%
$$ 37 37 37 37 37 37 37 37 37 37 37 37 37 37 37 37 37 37 37 37 37 37 37 37 37 37 37 37 37 37 37 37 37 37 37 37 37 37 37 37 37 37 37 37 37 37 37 37 37 37 37 37 37 37 37 37 37 37 37 37 37 37 37 37 37 37 37 37 37 37 37
3054C7%%%%%%%%%%%%%%%%%%%%%%%%%%%%%%%%%%%%%%%%%%%%%%%%%%%%%%%%%%%%%%%%%%%%%%
$$ 37 37 37 37 37 37 37 37 37 37 37 37 37 37 37 37 37 37 37 37 37 37 37 37 37 37 37 37 37 37 37 37 37 37 37 37 37 37 37 37 37 37 37 37 37 37 37 37 37 37 37 37 37 37 37 37 37 37 37 37 37 37 37 37 37 37 37 37 37 37 37
3047C7%%%%%%%%%%%%%%%%%%%%%%%%%%%%%%%%%%%%%%%%%%%%%%%%%%%%%%%%%%%%%%%%%%%%%%
$$ 37 37 37 37 37 37 37 37 37 37 37 37 37 37 37 37 37 37 37 37 37 37 37 37 37 37 37 37 37 37 37 37 37 37 37 37 37 37 37 37 37 37 37 37 37 37 37 37 37 37 37 37 37 37 37 37 37 37 37 37 37 37 37 37 37 37 37 37 37 37 37
3039C7%%%%%%%%%%%%%%%%%%%%%%%%j%%J%%%%%%%%%%%%%%%%%%%%%%%%%%%%%%%%%%%%%%%%%%
$$ 37 37 37 37 37 37 37 37 37 37 37 37 37 37 37 37 37 37 37 37 37 37 37 37 37 36 36 36 37 37 37 37 37 37 37 37 37 37 37 37 37 37 37 37 37 37 37 37 37 37 37 37 37 37 37 37 37 37 37 37 37 37 37 37 37 37 37 37 37 37 37
3032C7%%%%%%%%%%%%%%%%%%%%%%%%%%%%%%%%%%%%%%%%%%%%%%%%%%%%%%%%%%%%%%%%%%%%%%
$$ 37 37 37 37 37 37 37 37 37 37 37 37 37 37 37 37 37 37 37 37 37 37 37 37 37 37 37 37 37 37 37 37 37 37 37 37 37 37 37 37 37 37 37 37 37 37 37 37 37 37 37 37 37 37 37 37 37 37 37 37 37 37 37 37 37 37 37 37 37 37 37
3024C7%%%%%%%%%%%%%%%%%%%%%%%%%%%%%%%%%%%%%%%%%%%%%%%%%%%%%%%%%%%%%%%%%%%%%%
$$ 37 37 37 37 37 37 37 37 37 37 37 37 37 37 37 37 37 37 37 37 37 37 37 37 37 37 37 37 37 37 37 37 37 37 37 37 37 37 37 37 37 37 37 37 37 37 37 37 37 37 37 37 37 37 37 37 37 37 37 37 37 37 37 37 37 37 37 37 37 37 37
3017C7%%%%%%%%%%%%%%%%%%%%%%%%%%%%j%J%%%%%%%%%%%%%%%%%%%%%%%%%%%%%%%%%%%%%%%
$$ 37 37 37 37 37 37 37 37 37 37 37 37 37 37 37 37 37 37 37 37 37 37 37 37 37 37 37 37 37 36 36 37 37 37 37 37 37 37 37 37 37 37 37 37 37 37 37 37 37 37 37 37 37 37 37 37 37 37 37 37 37 37 37 37 37 37 37 37 37 37 37
3010C7%%%%%%%%%%%%%%%%%%%%%%%%%%%%%%%%%%%%%%%%%%%%%%%%%%%%%%%%%%%%%%%%%%%%%%
$$ 37 37 37 37 37 37 37 37 37 37 37 37 37 37 37 37 37 37 37 37 37 37 37 37 37 37 37 37 37 37 37 37 37 37 37 37 37 37 37 37 37 37 37 37 37 37 37 37 37 37 37 37 37 37 37 37 37 37 37 37 37 37 37 37 37 37 37 37 37 37 37
3002C7%j%J%%j%J%%%%%%%%j%%%%%%J%%%%%%j%%%%%%%%%%%%%%%J%%%%%%%%%j%%%%J%%%%%%%
$$ 37 37 36 36 37 37 37 36 36 37 37 37 37 37 37 37 37 37 36 36 36 36 36 36 36 37 37 37 37 37 37 37 36 36 36 36 36 36 36 36 36 36 36 36 36 36 36 36 37 37 37 37 37 37 37 37 37 37 36 36 36 36 36 37 37 37 37 37 37 37 37
2995C7%%j%%%%%J%%%%%%%%%%%%%%%%jJ%%%%%j%%%J%%%%j%%%J%%%%%%%%%%%%%%%%%%%%%%%%
$$ 37 37 37 36 36 36 36 36 36 37 37 37 37 37 37 37 37 37 37 37 37 37 37 37 37 37 36 37 37 37 37 37 37 36 36 36 36 37 37 37 37 37 36 36 36 36 37 37 37 37 37 37 37 37 37 37 37 37 37 37 37 37 37 37 37 37 37 37 37 37 37
2987C7%%%%%%%%%%%%%%%%%%%%%%%%%%%%%%%%%%%%%%%%%%%%%%%%%%%%%%%%%%jJ%%%%jJ%%%%
$$ 37 37 37 37 37 37 37 37 37 37 37 37 37 37 37 37 37 37 37 37 37 37 37 37 37 37 37 37 37 37 37 37 37 37 37 37 37 37 37 37 37 37 37 37 37 37 37 37 37 37 37 37 37 37 37 37 37 37 37 36 37 37 37 37 37 36 37 37 37 37 37
2980C7%%%%%%%j%Jj%%%J%%%%%%%%%%%%%%%%%%%%%%%%%%%%%%%%j%%%%%J%%%%%%%%%%%%%%%%
$$ 37 37 37 37 37 37 37 37 36 36 37 36 36 36 36 37 37 37 37 37 37 37 37 37 37 37 37 37 37 37 37 37 37 37 37 37 37 37 37 37 37 37 37 37 37 37 37 37 36 36 36 36 36 36 37 37 37 37 37 37 37 37 37 37 37 37 37 37 37 37 37
2972C7%%%%%%%%%j%Jj%%%%%%%%%%%%%%%%%%%%J%%%%%%%%%%%%%%%%%%%%%%%%%%%%%%%%%%%%
$$ 37 37 37 37 37 37 37 37 37 37 36 36 37 36 36 36 36 36 36 36 36 36 36 36 36 36 36 36 36 36 36 36 36 36 37 37 37 37 37 37 37 37 37 37 37 37 37 37 37 37 37 37 37 37 37 37 37 37 37 37 37 37 37 37 37 37 37 37 37 37 37
2965C7j%%J%%%%%%j%J%%%%%%%j%%%%%%%%J%j%%%%%%J%%%%%%%%jJ%%%%%%%%%%%j%%%J%%%%%
$$ 37 36 36 36 37 37 37 37 37 37 37 36 36 37 37 37 37 37 37 37 37 36 36 36 36 36 36 36 36 36 37 37 36 36 36 36 36 36 36 37 37 37 37 37 37 37 37 37 36 37 37 37 37 37 37 37 37 37 37 37 37 36 36 36 36 37 37 37 37 37 37
2958C7%%%%%%%%%%j%%%%%%%J%j%%%%%%%%J%%j%%J%%%%j%J%%%%%%j%%%%%%%%%%%%%%%%%%%%
$$ 37 37 37 37 37 37 37 37 37 37 37 36 36 36 36 36 36 36 36 37 37 36 36 36 36 36 36 36 36 36 37 37 37 36 36 36 37 37 37 37 37 36 36 37 37 37 37 37 37 37 36 36 36 36 36 36 36 36 36 36 36 36 36 36 36 36 36 36 36 36 36
2950C6%%%%J%j%%%J%%%%%%%%%%%j%%%%%%%%%%%J%%j%%%%%%%%%%%J%%j%%%%%%%%%J%j%%%%%
$$ 36 36 36 36 36 37 37 36 36 36 36 37 37 37 37 37 37 37 37 37 37 37 37 36 36 36 36 36 36 36 36 36 36 36 36 37 37 37 36 36 36 36 36 36 36 36 36 36 36 36 37 37 37 36 36 36 36 36 36 36 36 36 36 37 37 36 36 36 36 36 36
2943C6%%%%%%%J%j%%%%%%%J%%%%%%%j%%%%%%%%%Jj%%%%%J%%%%%%%jJ%j%%%%Jj%%%%%J%j%%
$$ 36 36 36 36 36 36 36 36 37 37 36 36 36 36 36 36 36 36 37 37 37 37 37 37 37 37 36 36 36 36 36 36 36 36 36 36 37 36 36 36 36 36 36 37 37 37 37 37 37 37 37 36 37 37 36 36 36 36 36 37 36 36 36 36 36 36 37 37 36 36 36
2935C6%%%%%%%%%%%%%%%%J%%j%%%%Jj%%%%%%%%%%J%%j%%%%%%%J%%%%j%J%%%%%%%%%j%%%%%
$$ 36 36 36 36 36 36 36 36 36 36 36 36 36 36 36 36 36 37 37 37 36 36 36 36 36 37 36 36 36 36 36 36 36 36 36 36 36 37 37 37 36 36 36 36 36 36 36 36 37 37 37 37 37 36 36 37 37 37 37 37 37 37 37 37 37 36 36 36 36 36 36
2928C6%%%%%%%%%%%%%%%%%%%%%%%%%%%%%%%%%%%%%%%%%%%%%%%%%%%J%%%%%%%%j%%%%%%%%%
$$ 36 36 36 36 36 36 36 36 36 36 36 36 36 36 36 36 36 36 36 36 36 36 36 36 36 36 36 36 36 36 36 36 36 36 36 36 36 36 36 36 36 36 36 36 36 36 36 36 36 36 36 36 37 37 37 37 37 37 37 37 37 36 36 36 36 36 36 36 36 36 36
2921C6%%%%%%%%%%%%%%J%j%%%%%%%%%%%%%J%%%j%%%%%%%%%%%%%%%%%%%%%%%%%%%%%%%%%%%
$$ 36 36 36 36 36 36 36 36 36 36 36 36 36 36 36 37 37 36 36 36 36 36 36 36 36 36 36 36 36 36 36 37 37 37 37 36 36 36 36 36 36 36 36 36 36 36 36 36 36 36 36 36 36 36 36 36 36 36 36 36 36 36 36 36 36 36 36 36 36 36 36
2913C6%%%%%%%%%%%%%%%%%%%%%%%%%%%%%%%%%%%%J%%j%%%%%%%%%%%%%%%%%%%%%%%J%j%%%%
$$ 36 36 36 36 36 36 36 36 36 36 36 36 36 36 36 36 36 36 36 36 36 36 36 36 36 36 36 36 36 36 36 36 36 36 36 36 36 37 37 37 36 36 36 36 36 36 36 36 36 36 36 36 36 36 36 36 36 36 36 36 36 36 36 36 37 37 36 36 36 36 36
2906C6%%J%j%J%j%%%Jj%%%%%%%%%%%%%%%%%%%%%%%%%%%%%Jj%%%%%%%J%%%%%j%%%%%%%%%%J
$$ 36 36 36 37 37 36 36 37 37 36 36 36 36 37 36 36 36 36 36 36 36 36 36 36 36 36 36 36 36 36 36 36 36 36 36 36 36 36 36 36 36 36 36 36 37 36 36 36 36 36 36 36 36 37 37 37 37 37 37 36 36 36 36 36 36 36 36 36 36 36 37
2898C7%j%%%%%%%%%%%%%%%%%%%%%%%%%%%%%%%%%%%%%%J%%j%%%%%Jj%%%%%%%%%%%%%%%%%%%
$$ 37 37 36 36 36 36 36 36 36 36 36 36 36 36 36 36 36 36 36 36 36 36 36 36 36 36 36 36 36 36 36 36 36 36 36 36 36 36 36 36 36 37 37 37 36 36 36 36 36 36 37 36 36 36 36 36 36 36 36 36 36 36 36 36 36 36 36 36 36 36 36
2891C6%%%%%%%%%%%%%%%%%%%%%%%%%%%%%%%%%%%%%%%%%%%%%%%%%JjJ%%%%%%j%%%%%%%%%%%
$$ 36 36 36 36 36 36 36 36 36 36 36 36 36 36 36 36 36 36 36 36 36 36 36 36 36 36 36 36 36 36 36 36 36 36 36 36 36 36 36 36 36 36 36 36 36 36 36 36 36 36 37 36 37 37 37 37 37 37 37 36 36 36 36 36 36 36 36 36 36 36 36
2883C6%%J%j%%%%%%%%%%%%%%%%%%%%Jj%%%%%%%%%%%%%%%%%%%%%%%%%%%%%%%%j%J%%%%%%%%
$$ 36 36 36 37 37 36 36 36 36 36 36 36 36 36 36 36 36 36 36 36 36 36 36 36 36 36 37 36 36 36 36 36 36 36 36 36 36 36 36 36 36 36 36 36 36 36 36 36 36 36 36 36 36 36 36 36 36 36 36 36 35 35 36 36 36 36 36 36 36 36 36
2876C6%%%%%%%%%%%%%%%%%%%%%%%%%%%%%%j%%%%%%J%%%%%%j%%%%J%%%%%j%%%J%%%%%%%%%%
$$ 36 36 36 36 36 36 36 36 36 36 36 36 36 36 36 36 36 36 36 36 36 36 36 36 36 36 36 36 36 36 36 35 35 35 35 35 35 35 36 36 36 36 36 36 36 35 35 35 35 35 36 36 36 36 36 36 35 35 35 35 36 36 36 36 36 36 36 36 36 36 36
2869C6%%%%%%%%%%%%%%%%%%%%%%%j%%%%%%%%%%%J%j%%%%%%J%%%%%%%%%%%%%%%%%%%%%%%%%
$$ 36 36 36 36 36 36 36 36 36 36 36 36 36 36 36 36 36 36 36 36 36 36 36 36 35 35 35 35 35 35 35 35 35 35 35 35 36 36 35 35 35 35 35 35 35 36 36 36 36 36 36 36 36 36 36 36 36 36 36 36 36 36 36 36 36 36 36 36 36 36 36
2861C6%%%%%%%%%%%%j%J%%%%%j%%%J%%%%%%%%%%%%%%%%%%%%%%%%%%%%%%%%%%%%%%%%%%%%%
$$ 36 36 36 36 36 36 36 36 36 36 36 36 36 35 35 36 36 36 36 36 36 35 35 35 35 36 36 36 36 36 36 36 36 36 36 36 36 36 36 36 36 36 36 36 36 36 36 36 36 36 36 36 36 36 36 36 36 36 36 36 36 36 36 36 36 36 36 36 36 36 36
2854C6%%%%%%%j%J%%j%%J%%%%%%%%%%%%%%%%%%%%%%%%%%%%%%%%j%%J%%%%%%%%%%%%%%%%%%
$$ 36 36 36 36 36 36 36 36 35 35 36 36 36 35 35 35 36 36 36 36 36 36 36 36 36 36 36 36 36 36 36 36 36 36 36 36 36 36 36 36 36 36 36 36 36 36 36 36 36 35 35 35 36 36 36 36 36 36 36 36 36 36 36 36 36 36 36 36 36 36 36
2846C6%%%%jJ%%%%%%%%%%j%%%J%%%%%%j%J%%%%%%%%%%%%%%%%%%%%%%%%%%%%%j%%J%%%%%%%
$$ 36 36 36 36 36 35 36 36 36 36 36 36 36 36 36 36 36 35 35 35 35 36 36 36 36 36 36 36 35 35 36 36 36 36 36 36 36 36 36 36 36 36 36 36 36 36 36 36 36 36 36 36 36 36 36 36 36 36 36 36 35 35 35 36 36 36 36 36 36 36 36
2839C6%%%%%%%%%%%%%jJ%%%%%%%jJ%%%%%%%%%%%%%%%%%%%%j%%%%%J%%%%%%%%%%%%%%%%%%%
$$ 36 36 36 36 36 36 36 36 36 36 36 36 36 36 35 36 36 36 36 36 36 36 36 35 36 36 36 36 36 36 36 36 36 36 36 36 36 36 36 36 36 36 36 36 36 35 35 35 35 35 35 36 36 36 36 36 36 36 36 36 36 36 36 36 36 36 36 36 36 36 36
2832C6jJ%%%%%%%%%%%%%%%%%%%%%%%%%%%%%%%%%%%jJ%%%%j%J%%%%%%%j%%J%%j%%%%J%%%%%
$$ 36 35 36 36 36 36 36 36 36 36 36 36 36 36 36 36 36 36 36 36 36 36 36 36 36 36 36 36 36 36 36 36 36 36 36 36 36 36 35 36 36 36 36 36 35 35 36 36 36 36 36 36 36 36 35 35 35 36 36 36 35 35 35 35 35 36 36 36 36 36 36
2824C6j%%%%%%%%%%%%%%%%%%%%J%%%%%%%%%%%jJ%%%%%%%%%j%%J%%%%j%%%%%J%%%%%%j%%%%
$$ 36 35 35 35 35 35 35 35 35 35 35 35 35 35 35 35 35 35 35 35 35 35 36 36 36 36 36 36 36 36 36 36 36 36 35 36 36 36 36 36 36 36 36 36 36 35 35 35 36 36 36 36 36 35 35 35 35 35 35 36 36 36 36 36 36 36 35 35 35 35 35
2817C5%%%%%%%%%%%%%%%%%%%Jj%%%%%%%%%%%%%%%%%%%%%%%%%%%%%%%%%%%%%%%%%%%%%%%%%
$$ 35 35 35 35 35 35 35 35 35 35 35 35 35 35 35 35 35 35 35 35 36 35 35 35 35 35 35 35 35 35 35 35 35 35 35 35 35 35 35 35 35 35 35 35 35 35 35 35 35 35 35 35 35 35 35 35 35 35 35 35 35 35 35 35 35 35 35 35 35 35 35
2809C5%%%%%%%%%%%%%%%%%%%%%%%%%%%%%%%%%%%%%%%%%%%%%%%%%%%%%%%%%%%%%%%%%%%%%%
$$ 35 35 35 35 35 35 35 35 35 35 35 35 35 35 35 35 35 35 35 35 35 35 35 35 35 35 35 35 35 35 35 35 35 35 35 35 35 35 35 35 35 35 35 35 35 35 35 35 35 35 35 35 35 35 35 35 35 35 35 35 35 35 35 35 35 35 35 35 35 35 35
2802C5%%J%%%j%%%%j%J%%%%Jj%%%%%%%%%%%%%%%%%%%%%%%%%%%%%%%%%%%%%%%%%%%%%%%%%%
$$ 35 35 35 36 36 36 36 35 35 35 35 35 34 34 35 35 35 35 35 36 35 35 35 35 35 35 35 35 35 35 35 35 35 35 35 35 35 35 35 35 35 35 35 35 35 35 35 35 35 35 35 35 35 35 35 35 35 35 35 35 35 35 35 35 35 35 35 35 35 35 35
2794C5%%%%%%%%%%%%%%%%%%%%%%%%%%%%%%%%%%%%%%%%%J%j%%%%%%%%%%%%%%%%%%%%%%%%%%
$$ 35 35 35 35 35 35 35 35 35 35 35 35 35 35 35 35 35 35 35 35 35 35 35 35 35 35 35 35 35 35 35 35 35 35 35 35 35 35 35 35 35 35 36 36 35 35 35 35 35 35 35 35 35 35 35 35 35 35 35 35 35 35 35 35 35 35 35 35 35 35 35
2787C5%%%%%%%%%%%%%%%%%%%%%%%%%%%%%%%%%%J%%%j%%%%%%%%%%%%%%%%%%%%%%%%%%%%%%%
$$ 35 35 35 35 35 35 35 35 35 35 35 35 35 35 35 35 35 35 35 35 35 35 35 35 35 35 35 35 35 35 35 35 35 35 35 36 36 36 36 35 35 35 35 35 35 35 35 35 35 35 35 35 35 35 35 35 35 35 35 35 35 35 35 35 35 35 35 35 35 35 35
2780C5%%%%%%%%%%%%%%%%%%%%%%%%%%%%%%%%%%%%%%%%%%%%%%j%%J%%%%%%%%%%%%%%%%%%%%
$$ 35 35 35 35 35 35 35 35 35 35 35 35 35 35 35 35 35 35 35 35 35 35 35 35 35 35 35 35 35 35 35 35 35 35 35 35 35 35 35 35 35 35 35 35 35 35 35 34 34 34 35 35 35 35 35 35 35 35 35 35 35 35 35 35 35 35 35 35 35 35 35
2772C5%%%%%%%%%%%%%%%%%%%%%%%%%%%%%%%%j%J%%%%%%%%%%%%%%%%%%%%%%%%%%%%%j%%%%J
$$ 35 35 35 35 35 35 35 35 35 35 35 35 35 35 35 35 35 35 35 35 35 35 35 35 35 35 35 35 35 35 35 35 35 34 34 35 35 35 35 35 35 35 35 35 35 35 35 35 35 35 35 35 35 35 35 35 35 35 35 35 35 35 35 35 35 34 34 34 34 34 35
2765C5%%j%J%%%%%%%%%j%J%%%%%%%%%%j%%J%%%%j%%J%%%%%%%%%%%%%%j%J%%j%%J%%%j%J%%
$$ 35 35 35 34 34 35 35 35 35 35 35 35 35 35 35 34 34 35 35 35 35 35 35 35 35 35 35 35 34 34 34 35 35 35 35 35 34 34 34 35 35 35 35 35 35 35 35 35 35 35 35 35 35 35 34 34 35 35 35 34 34 34 35 35 35 35 34 34 35 35 35
2757C5%%%%%%%%%%%%jJ%%%%%%%%%%%%%%%%%jJ%%%%%%%%%%%%%%%%%%%j%J%%%%%%%%%%%%%%%
$$ 35 35 35 35 35 35 35 35 35 35 35 35 35 34 35 35 35 35 35 35 35 35 35 35 35 35 35 35 35 35 35 35 34 35 35 35 35 35 35 35 35 35 35 35 35 35 35 35 35 35 35 35 35 34 34 35 35 35 35 35 35 35 35 35 35 35 35 35 35 35 35
2750C5j%%%%%%J%%%%%%%%%%%%%%j%%J%%%%%%%%%%%%%j%%%%%%%%%%%%%%%%%%%%%%%%%%%%%%
$$ 35 34 34 34 34 34 34 34 35 35 35 35 35 35 35 35 35 35 35 35 35 35 35 34 34 34 35 35 35 35 35 35 35 35 35 35 35 35 35 35 34 34 34 34 34 34 34 34 34 34 34 34 34 34 34 34 34 34 34 34 34 34 34 34 34 34 34 34 34 34 34
2743C4%%%%%%%%%%%%%%%%%%%%%%%%%%%%%%%%%%%%%%%%%%%%%%J%%%%%%j%%%%%%%%%%%%%%%%
$$ 34 34 34 34 34 34 34 34 34 34 34 34 34 34 34 34 34 34 34 34 34 34 34 34 34 34 34 34 34 34 34 34 34 34 34 34 34 34 34 34 34 34 34 34 34 34 34 35 35 35 35 35 35 35 34 34 34 34 34 34 34 34 34 34 34 34 34 34 34 34 34
2735C4%%%%%%%%%%%%%%%%%%%%%%%%%%%%%%%%%%%%%%%%J%%%%%%%%%%%%%%%%%%%%%%%%%%%%%
$$ 34 34 34 34 34 34 34 34 34 34 34 34 34 34 34 34 34 34 34 34 34 34 34 34 34 34 34 34 34 34 34 34 34 34 34 34 34 34 34 34 34 35 35 35 35 35 35 35 35 35 35 35 35 35 35 35 35 35 35 35 35 35 35 35 35 35 35 35 35 35 35
2728C5j%%J%%j%%%%%%%%%%%%%%%%%%J%%%%%%%%%%%%%%%%%%%j%%%J%%%%%%%%j%%%J%%j%%%%
$$ 35 34 34 34 35 35 35 34 34 34 34 34 34 34 34 34 34 34 34 34 34 34 34 34 34 34 35 35 35 35 35 35 35 35 35 35 35 35 35 35 35 35 35 35 35 35 34 34 34 34 35 35 35 35 35 35 35 35 35 34 34 34 34 35 35 35 34 34 34 34 34
2720C4%%%%%%%%%%J%j%%J%j%%%%%%%%J%%%%%%j%%%%%%%%%%%%%%%%J%%%%%%%%%%%j%%%%%%%
$$ 34 34 34 34 34 34 34 34 34 34 34 35 35 34 34 34 35 35 34 34 34 34 34 34 34 34 34 35 35 35 35 35 35 35 34 34 34 34 34 34 34 34 34 34 34 34 34 34 34 34 34 35 35 35 35 35 35 35 35 35 35 35 35 34 34 34 34 34 34 34 34
2713C4%%%%%%%J%%%%%%%%j%%%%%%%%%%%%%%%%%%%%%%%%%%%%%%%%%%%%%%%%%%%jJ%%%%%%%%
$$ 34 34 34 34 34 34 34 34 35 35 35 35 35 35 35 35 35 34 34 34 34 34 34 34 34 34 34 34 34 34 34 34 34 34 34 34 34 34 34 34 34 34 34 34 34 34 34 34 34 34 34 34 34 34 34 34 34 34 34 34 34 33 34 34 34 34 34 34 34 34 34
2705C4%%%%%%%%%jJ%%%%%%%%%%%%%%%%%%%%%%%%%%%%%%%%%%%%%%%%%%%%%%%%%%%%%%%%%%%
$$ 34 34 34 34 34 34 34 34 34 34 33 34 34 34 34 34 34 34 34 34 34 34 34 34 34 34 34 34 34 34 34 34 34 34 34 34 34 34 34 34 34 34 34 34 34 34 34 34 34 34 34 34 34 34 34 34 34 34 34 34 34 34 34 34 34 34 34 34 34 34 34
2698C4%%%%%%%%%%%%%%%%%%%%%%%%%%%%Jj%%%%%%%%%%%%%%%%%%%%%%%%%%%%Jj%%%%%%%%%%
$$ 34 34 34 34 34 34 34 34 34 34 34 34 34 34 34 34 34 34 34 34 34 34 34 34 34 34 34 34 34 35 34 34 34 34 34 34 34 34 34 34 34 34 34 34 34 34 34 34 34 34 34 34 34 34 34 34 34 34 34 35 34 34 34 34 34 34 34 34 34 34 34
2691C4%%%%%%%%%%%%%%%%%%%%%%%%%%%%%%%%%%%%%%%Jj%%%%%%%%%%%%%%%%%%%%%%%%%%%%%
$$ 34 34 34 34 34 34 34 34 34 34 34 34 34 34 34 34 34 34 34 34 34 34 34 34 34 34 34 34 34 34 34 34 34 34 34 34 34 34 34 34 35 34 34 34 34 34 34 34 34 34 34 34 34 34 34 34 34 34 34 34 34 34 34 34 34 34 34 34 34 34 34
2683C4%%%%%%Jj%%%%%%J%j%%%%%%%%%%%%%%%%%%%%%%%%%%%%%%%%%%%%%%%%%%%%%%%%%%%%%
$$ 34 34 34 34 34 34 34 35 34 34 34 34 34 34 34 35 35 34 34 34 34 34 34 34 34 34 34 34 34 34 34 34 34 34 34 34 34 34 34 34 34 34 34 34 34 34 34 34 34 34 34 34 34 34 34 34 34 34 34 34 34 34 34 34 34 34 34 34 34 34 34
2676C4%%%%%%%%%%%%%%%%%%%%%%%%%%%%%%%%%%%%%%%%%%%%%jJ%%%%%%%%%%%%%%%%%%jJ%%%
$$ 34 34 34 34 34 34 34 34 34 34 34 34 34 34 34 34 34 34 34 34 34 34 34 34 34 34 34 34 34 34 34 34 34 34 34 34 34 34 34 34 34 34 34 34 34 34 33 34 34 34 34 34 34 34 34 34 34 34 34 34 34 34 34 34 34 34 33 34 34 34 34
2668C4%%%%%%%%%%%%%%%%%%%%%%%%%%%%%%%%j%%%%%%%%%%%%%%%%Jj%%%%%%%%%%%%%%%%%%%
$$ 34 34 34 34 34 34 34 34 34 34 34 34 34 34 34 34 34 34 34 34 34 34 34 34 34 34 34 34 34 34 34 34 34 33 33 33 33 33 33 33 33 33 33 33 33 33 33 33 33 33 34 33 33 33 33 33 33 33 33 33 33 33 33 33 33 33 33 33 33 33 33
2661C3%%%%%%%%%%%%%%%%%%%%%%%%%%%%%%%%%%%%%%%%%%%%%%%%%%%%%%%%%%%%%%%%%%%%%%
$$ 33 33 33 33 33 33 33 33 33 33 33 33 33 33 33 33 33 33 33 33 33 33 33 33 33 33 33 33 33 33 33 33 33 33 33 33 33 33 33 33 33 33 33 33 33 33 33 33 33 33 33 33 33 33 33 33 33 33 33 33 33 33 33 33 33 33 33 33 33 33 33
2654C3%%%%%%%%%%%%%%%%%%%%%%%%%%%%%%%%%J%%%j%%%%%%%%%%%J%%j%J%%j%%%%%%%%J%%%
$$ 33 33 33 33 33 33 33 33 33 33 33 33 33 33 33 33 33 33 33 33 33 33 33 33 33 33 33 33 33 33 33 33 33 33 34 34 34 34 33 33 33 33 33 33 33 33 33 33 33 33 34 34 34 33 33 34 34 34 33 33 33 33 33 33 33 33 33 34 34 34 34
2646C4%%%%%%j%J%%%%%jJ%%%%%j%%%%%%%%%%%%%%j%%%%%%%%%%%%%%%%%%%%%%%j%%%%%%%%%
$$ 34 34 34 34 34 34 34 33 33 34 34 34 34 34 34 33 34 34 34 34 34 34 33 33 33 33 33 33 33 33 33 33 33 33 33 33 33 32 32 32 32 32 32 32 32 32 32 32 32 32 32 32 32 32 32 32 32 32 32 32 32 31 31 31 31 31 31 31 31 31 31
2639C1%%%%%%%%%%%%%%%%J%%%%%%%%%%%%%%%%%%%%%%%%j%%%%%%%%%%%%%%%%%%j%%%%%%%%%
$$ 31 31 31 31 31 31 31 31 31 31 31 31 31 31 31 31 31 32 32 32 32 32 32 32 32 32 32 32 32 32 32 32 32 32 32 32 32 32 32 32 32 32 31 31 31 31 31 31 31 31 31 31 31 31 31 31 31 31 31 31 31 30 30 30 30 30 30 30 30 30 30
2631C0%%%%%%%%%%%%%%%%%%J%%%%j%%%J%%%%%%%%%%%J%j%%%%%%%%%%%%%%%%%%%%%%%%%%%%
$$ 30 30 30 30 30 30 30 30 30 30 30 30 30 30 30 30 30 30 30 31 31 31 31 31 30 30 30 30 31 31 31 31 31 31 31 31 31 31 31 31 32 32 31 31 31 31 31 31 31 31 31 31 31 31 31 31 31 31 31 31 31 31 31 31 31 31 31 31 31 31 31
2624C1%%%%%%%Jj%%%%%%%%%%Jj%%%%%%%J%%%%%%%%%%%%%%J%%%%j%%%J%%%%%%%%j%%%%J%%%
$$ 31 31 31 31 31 31 31 31 32 31 31 31 31 31 31 31 31 31 31 31 32 31 31 31 31 31 31 31 31 32 32 32 32 32 32 32 32 32 32 32 32 32 32 32 33 33 33 33 33 32 32 32 32 33 33 33 33 33 33 33 33 33 32 32 32 32 32 33 33 33 33
2616C3%%%%%%%%%%%%%jJ%%%%%%%%jJ%%%%j%%%%J%%%%%%%%%j%%%%%%%%%%%%%%%%%%%%%%%%%
$$ 33 33 33 33 33 33 33 33 33 33 33 33 33 33 32 33 33 33 33 33 33 33 33 33 32 33 33 33 33 33 32 32 32 32 32 33 33 33 33 33 33 33 33 33 33 32 32 32 32 32 32 32 32 32 32 32 32 32 32 32 32 32 32 32 32 32 32 32 32 32 32
2609C2%%%%%%%%%%%%J%%j%%%%%%%%%%%%%%%%%J%%%%%%%%%%%%%%%%%%j%%%%%%%%%%%%%%%%%
$$ 32 32 32 32 32 32 32 32 32 32 32 32 32 33 33 33 32 32 32 32 32 32 32 32 32 32 32 32 32 32 32 32 32 32 33 33 33 33 33 33 33 33 33 33 33 33 33 33 33 33 33 33 33 32 32 32 32 32 32 32 32 32 32 32 32 32 32 32 32 32 32
2602C2%%%J%%%%%%%j%%%%%%%%%%%%%%%%%J%%%%%%%j%%%%%%%%%%%%%%%%%J%%%%j%%%%%%%%%
$$ 32 32 32 32 33 33 33 33 33 33 33 33 32 32 32 32 32 32 32 32 32 32 32 32 32 32 32 32 32 32 33 33 33 33 33 33 33 33 32 32 32 32 32 32 32 32 32 32 32 32 32 32 32 32 32 32 33 33 33 33 33 32 32 32 32 32 32 32 32 32 32
2594C2%%%%%%%%%%%%%%%%%%%%%%%%%%%%%%%%%%%%%%%j%J%%%%%%%%%%%%%%%%%%%%%%%%%%%%
$$ 32 32 32 32 32 32 32 32 32 32 32 32 32 32 32 32 32 32 32 32 32 32 32 32 32 32 32 32 32 32 32 32 32 32 32 32 32 32 32 32 31 31 32 32 32 32 32 32 32 32 32 32 32 32 32 32 32 32 32 32 32 32 32 32 32 32 32 32 32 32 32
2587C2%%%%%%%%%%%%j%%%%%%%%%%%%%%%%%%%J%%%%J%%%J%%%%%%%j%Jj%%%%j%%%%%%%%%%%%
$$ 32 32 32 32 32 32 32 32 32 32 32 32 32 31 31 31 31 31 31 31 31 31 31 31 31 31 31 31 31 31 31 31 31 32 32 32 32 32 33 33 33 33 34 34 34 34 34 34 34 34 33 33 34 33 33 33 33 33 32 32 32 32 32 32 32 32 32 32 32 32 32
2579C2%%j%%%%%%%%%%%%j%%%%%%%%j%%%%%%%%%%%%%%%%%%%%%%%%%%%%%%%%J%%%%%%%%%%%%
$$ 32 32 32 31 31 31 31 31 31 31 31 31 31 31 31 31 30 30 30 30 30 30 30 30 30 29 29 29 29 29 29 29 29 29 29 29 29 29 29 29 29 29 29 29 29 29 29 29 29 29 29 29 29 29 29 29 29 29 30 30 30 30 30 30 30 30 30 30 30 30 30
2572C0%%%Jj%%%%%%%%%%%%%%%%%%%%%%%%%%%%%%%%j%%%%%%%%%%%%%%%J%%%%%%%%%%%%%%%%
$$ 30 30 30 30 31 30 30 30 30 30 30 30 30 30 30 30 30 30 30 30 30 30 30 30 30 30 30 30 30 30 30 30 30 30 30 30 30 30 29 29 29 29 29 29 29 29 29 29 29 29 29 29 29 29 30 30 30 30 30 30 30 30 30 30 30 30 30 30 30 30 30
2565C0%%%%%%%%J%%%%%%%%%%%%jJ%%%j%%%%%%%%%%%%%%%j%%%%%%%%%j%%%%%%%%%%%%%%%%%
$$ 30 30 30 30 30 30 30 30 30 31 31 31 31 31 31 31 31 31 31 31 31 31 30 31 31 31 31 30 30 30 30 30 30 30 30 30 30 30 30 30 30 30 30 29 29 29 29 29 29 29 29 29 29 28 28 28 28 28 28 28 28 28 28 28 28 28 28 28 28 28 28
2557B8%%%%%Jj%%%J%%%%%%%%%%%%%%%Jj%J%j%%%%%%%%%%%%%%%%%%%%%%%%%%%%%%%J%%j%%%
$$ 28 28 28 28 28 28 29 28 28 28 28 29 29 29 29 29 29 29 29 29 29 29 29 29 29 29 29 30 29 29 30 30 29 29 29 29 29 29 29 29 29 29 29 29 29 29 29 29 29 29 29 29 29 29 29 29 29 29 29 29 29 29 29 29 30 30 30 29 29 29 29
2550B9%%%%j%%%%%j%%%%%%j%%%%%%%J%%%%jJ%%%j%%%%J%%%%%%%%j%%%%%%%%%%%%%%%%j%%%
$$ 29 29 29 29 29 28 28 28 28 28 28 27 27 27 27 27 27 27 26 26 26 26 26 26 26 26 27 27 27 27 27 26 27 27 27 27 26 26 26 26 26 27 27 27 27 27 27 27 27 27 26 26 26 26 26 26 26 26 26 26 26 26 26 26 26 26 26 25 25 25 25
2542B5%%%%%%%j%%%%%%%%%%%%%j%J%%%jJ%%%%%%%J%%%%%%J%%%%%%%%%%%%%%%%%%%%%%%%%%
$$ 25 25 25 25 25 25 25 25 24 24 24 24 24 24 24 24 24 24 24 24 24 24 23 23 24 24 24 24 23 24 24 24 24 24 24 24 24 25 25 25 25 25 25 25 26 26 26 26 26 26 26 26 26 26 26 26 26 26 26 26 26 26 26 26 26 26 26 26 26 26 26
2535B6%j%%%%%%%%%%%%%%%%%%%%J%%%%%%%%%j%%%%%%%%%%%%%%%%%%%%%%%%%%%%%%%%%%%%%
$$ 26 26 25 25 25 25 25 25 25 25 25 25 25 25 25 25 25 25 25 25 25 25 25 26 26 26 26 26 26 26 26 26 26 25 25 25 25 25 25 25 25 25 25 25 25 25 25 25 25 25 25 25 25 25 25 25 25 25 25 25 25 25 25 25 25 25 25 25 25 25 25
2527B5%%%%%%%%%%J%%%%%%%%%%%%%%%%jJ%%%%%%%%%%%%%J%J%%%J%J%JJ%JJJJKJKLKLMMNOO
$$ 25 25 25 25 25 25 25 25 25 25 25 26 26 26 26 26 26 26 26 26 26 26 26 26 26 26 26 26 25 26 26 26 26 26 26 26 26 26 26 26 26 26 26 27 27 28 28 28 28 29 29 30 30 31 32 32 33 34 35 36 38 39 41 44 46 49 53 57 62 68 74
2520G4PQRJ0J1J2J2J3J3J2J1J0QNM%lnprj0j1j2j3j3j2j2j1j0rqoonmmlklkjkjjjjjjj%j%
$$ 74 81 89 98 108 119 131 143 156 169 181 192 202 210 215 219 219 216 211 204 195 185 174 162 149 136 124 112 101 91 82 74 68 62 57 53 49 46 44 41 39 38 36 35 34 33 32 31 30 29 29 28 28
2515B8j%%j%%j%%%j%%%%%j%%%%%%%%%%%%%j%%%%%%%%j%%%%%%%%%j%%%%%%j%%%%j%%%%%%%%
$$ 28 27 27 27 26 26 26 25 25 25 25 24 24 24 24 24 24 23 23 23 23 23 23 23 23 23 23 23 23 23 23 22 22 22 22 22 22 22 22 22 21 21 21 21 21 21 21 21 21 21 20 20 20 20 20 20 20 19 19 19 19 19 18 18 18 18 18 18 18 18 18
2507A8j%%%%j%%%%%j%%j%%j%%j%%j%%%%j%%%%%%%%%%%%%j%%%%%j%%%%%%%%%%j%%%%%%%%%J
$$ 18 17 17 17 17 17 16 16 16 16 16 16 15 15 15 14 14 14 13 13 13 12 12 12 11 11 11 11 11 10 10 10 10 10 10 10 10 10 10 10 10 10 10 9 9 9 9 9 9 8 8 8 8 8 8 8 8 8 8 8 7 7 7 7 7 7 7 7 7 7 8
2500H%JJJKKLLMMNNNNNNMNLLLKJ%Jj%kjkkklkklkjkkjkjkjjjjjjjjj%jj%jj%j%jj%j%%j%%
$$ 8 8 9 10 11 13 15 18 21 25 29 34 39 44 49 54 59 63 68 71 74 77 79 80 80 81 80 80 78 77 75 73 71 68 66 64 61 59 58 56 54 53 51 50 48 47 46 45 44 43 42 41 40 39 39 38 37 37 36 35 35 34 34 33 32 32 31 31 31 30 30 30
2492C0j%%%j%%%%J%%%%%%%J%%J%%%J%J%%J%JJ%%J%J%%%%%%%%j%%%j%%%jJ%%%j%J%%J%%J%%
$$ 30 29 29 29 29 28 28 28 28 28 29 29 29 29 29 29 29 29 30 30 30 31 31 31 31 32 32 33 33 33 34 34 35 36 36 36 37 37 38 38 38 38 38 38 38 38 38 37 37 37 37 36 36 36 36 35 36 36 36 36 35 35 36 36 36 37 37 37 38 38 38
2485C8%%%%%j%j%j%jj%j%j%j%%%j%%%%J%%%J%J%%%J%%%j%%j%jj%jjkjjjjjkjjjjj%jjj%%%
$$ 38 38 38 38 38 38 37 37 36 36 35 35 34 33 33 32 32 31 31 30 30 30 30 29 29 29 29 29 30 30 30 30 31 31 32 32 32 32 33 33 33 33 32 32 32 31 31 30 29 29 28 27 25 24 23 22 21 20 18 17 16 15 14 13 13 12 11 10 10 10 10
2477A0jJ%%%J%JJKJJKKKKKKKJJJ%%%%j%jkjkjjjkjjj%%%J%JJJJJJJKJJJJJ%J%%%%J%%%J%J
$$ 10 9 10 10 10 10 11 11 12 13 15 16 17 19 21 23 25 27 29 31 32 33 34 34 34 34 34 33 33 32 30 29 27 26 25 24 22 21 20 19 19 19 19 20 20 21 22 23 24 25 26 27 29 30 31 32 33 34 34 35 35 35 35 35 36 36 36 36 37 37 38
2470C8%J%%J%J%%%%%%jjjjjkjjjj%%JJJLLMMPPRJ0J1J3J5J6J8J9K0K1K2K2K3K3K3K3K1K1J9
$$ 38 38 39 39 39 40 40 41 41 41 41 41 41 41 40 39 38 37 36 34 33 32 31 30 30 30 31 32 33 36 39 43 47 54 61 70 80 91 104 119 135 153 172 192 213 235 257 280 303 326 349 370 391 410
2464D10J6J2OJnj0j6k1k4k7k9k9k9k8k7k5k3k1j9j6j3j0romkj%JJKJKKJKJJ%%J%JJJKKLMM
$$ 410 426 438 444 445 440 430 414 393 369 342 313 284 255 227 200 175 152 131 112 96 83 73 64 58 54 52 51 51 52 53 55 56 58 60 61 63 64 65 65 65 66 66 67 68 69 71 73 76 80 84
2459H4OOOPQQRJ0J0J1J2J2J3J3J4J4J5J4J6J5J6J6J7J7J9J9K0K1K3K3K5K6K8K9L1L2L5L7M0
$$ 84 90 96 102 109 117 125 134 144 154 165 177 189 202 215 229 243 258 272 288 303 319 335 352 369 388 407 427 448 471 494 519 545 573 602 633 665 700 737 777
2455G77M2M6M9N4N8O4P0P7Q4R3J03J14J28J44J63J85K12K44K84L33L93M63N45O38P40Q49R63
$$ 777 819 865 914 968 1026 1090 1160 1237 1321 1414 1517 1631 1759 1903 2066 2251 2463 2707 2991 3324 3717 4180 4725 5363 6103 6952 7915
2452G915J078J198J323J460J602J744J868J962K012J999J912J756J550J308J030P07L43m0
$$ 7915 8993 10191 11514 12974 14576 16320 18188 20150 22162 24161 26073 27829 29379 30687 31717 32424 32767 32727
2450C2727m13p42j010j220j391j541j674j789j874j910j882j802j691j561j415j258j102r55
$$ 32727 32314 31572 30562 29342 27951 26410 24736 22947 21073 19163 17281 15479 13788 12227 10812 9554 8452 7497
2448G497q22p08o11n28m58m01l49l07k71k39k13j89j69j52j36j22j11j00r0q3p5o8o2n6n1
$$ 7497 6675 5967 5356 4828 4370 3969 3620 3313 3042 2803 2590 2401 2232 2080 1944 1822 1711 1611 1521 1438 1363 1295 1233 1177 1126
2446A126m6m2l9l6l3l1k9k7k7k5k3k3k1k1j8j8j6j5j4j2j1j0qqoommmmmmmnnopqrrj0j0j0
$$ 1126 1080 1038 999 963 930 899 870 843 816 791 768 745 724 703 685 667 651 636 622 610 599 589 581 573 567 561 557 553 549 545 541 537 533 528 523 517 510 502 493 484 474 464 454
2441D54j1j0rrrpppnommlmmmonpqj0j0j3j4j6j9k1k3k4k7k6k7k6k4k3k1j9j6j4j2rqolkJM
$$ 454 443 433 424 415 406 399 392 385 380 374 370 366 363 359 355 351 345 340 333 325 315 305 292 278 262 243 222 199 175 148 122 95 69 45 22 1 -18 -34 -48 -60 -69 -77 -83 -86 -88 -87 -83
2436h3OQJ0J2J4J5J7J7J6J6J6J5J3J3J2J1RRQONMLKK%%%jkkkklkkkklkjkjkj%jj%j%j%jj%
$$ -83 -77 -69 -59 -47 -33 -18 -1 16 32 48 64 79 92 105 117 128 137 146 154 160 165 169 172 174 176 176 176 176 175 173 171 169 167 164 162 160 158 156 153 151 150 148 147 145 144 144 143 142 142 141 141 140 140 139 138 138
2430A38jjjkjj%jjj%%%%J%JJ%J%%%%j%jjkjkkkklkkkkkjjj%%JJJJKJKKKKKKJKJJ%J%%%j%j
$$ 138 137 136 135 133 132 131 131 130 129 128 128 128 128 128 129 129 130 131 131 132 132 132 132 132 131 131 130 129 127 126 124 122 120 118 115 113 111 109 107 105 104 103 102 102 102 103 104 105 106 108 109 111 113 115 117 119 121 122 124 125 126 126 127 127 127 127 126 126 125
2423A25jjjjkjkjkkkklkkkkkkkjjjjjj%%%%%%%J%%%%%%%%%jjj%jjj%jjjjjjjj%j%%j%%%%%
$$ 125 124 123 122 121 119 118 116 115 113 111 109 107 104 102 100 98 96 94 92 90 89 88 87 86 85 84 84 84 84 84 84 84 84 85 85 85 85 85 85 85 85 85 85 84 83 82 82 81 80 79 79 78 77 76 75 74 73 72 71 71 70 70 70 69 69 69 69 69 69
2415F9%%%%%%%%%%%%j%%j%j%j%j%%%%jJ%%%%%%J%%%J%%%%J%%%j%%%%%%%j%%%%j%%j%j%j%j
$$ 69 69 69 69 69 69 69 69 69 69 69 69 69 68 68 68 67 67 66 66 65 65 64 64 64 64 64 63 64 64 64 64 64 64 64 65 65 65 65 66 66 66 66 66 67 67 67 67 66 66 66 66 66 66 66 66 65 65 65 65 65 64 64 64 63 63 62 62 61 61 60
2408F0%%jjj%%j%jj%jjjj%jjjjjjjjkjkkkkkkklklklklkkjj%JKKLLMNMNNNNMMMMLKKKJJ%J
$$ 60 60 60 59 58 57 57 57 56 56 55 54 54 53 52 51 50 50 49 48 47 46 45 44 43 42 40 39 37 35 33 31 29 27 25 22 20 17 15 12 10 7 5 3 2 1 1 2 4 6 9 12 16 21 25 30 35 40 45 49 53 57 61 64 66 68 70 71 72 72 73
2401G3%%%%J%%%%J%%%%%%%%%%%j%%%j%%%j%%%%%%%j%%%j%%j%%%j%%%%j%%%j%%jJ%%%%%J%%
$$ 73 73 73 73 73 74 74 74 74 74 75 75 75 75 75 75 75 75 75 75 75 75 74 74 74 74 73 73 73 73 72 72 72 72 72 72 72 72 71 71 71 71 70 70 70 69 69 69 69 68 68 68 68 68 67 67 67 67 66 66 66 65 66 66 66 66 66 66 67 67 67
2393F7%%%%%%%%%%%%%%j%%%j%%%%%%J%%%%%%%%%%%j%%%%%%%j%%%%j%%%%%%j%%%%%%j%%%%%
$$ 67 67 67 67 67 67 67 67 67 67 67 67 67 67 67 66 66 66 66 65 65 65 65 65 65 65 66 66 66 66 66 66 66 66 66 66 66 66 65 65 65 65 65 65 65 65 64 64 64 64 64 63 63 63 63 63 63 63 62 62 62 62 62 62 62 61 61 61 61 61 61
2386F1%%%%%%%%%%%%%%J%%%%J%%J%%%J%J%%J%J%JJJJJJKKKLLMNNNPPQRJ0J2J2J3J2J3J2J0
$$ 61 61 61 61 61 61 61 61 61 61 61 61 61 61 61 62 62 62 62 62 63 63 63 64 64 64 64 65 65 66 66 66 67 67 68 68 69 70 71 72 73 74 76 78 80 83 86 90 95 100 105 112 119 127 136 146 158 170 183 195 208 220 230
2379B30J0PNK%mopj0j0j1j2j3j2j3j1j1j0qpoonmllkkkkjjjjjjj%j%j%%%%%%%%%%%%%%%j%
$$ 230 240 247 252 254 254 250 244 237 227 217 206 194 181 169 156 145 134 124 116 109 103 97 92 88 85 82 80 78 76 74 73 72 71 70 69 68 67 67 66 66 65 65 65 65 65 65 65 65 65 65 65 65 65 65 65 65 64 64
2373F4%%%j%%%j%%j%%%j%%%j%%%%%%j%%%j%%%%%j%%%%%%%%%%%%%%%%%%%%%%%%%%%%j%%%%%
$$ 64 64 64 64 63 63 63 63 62 62 62 61 61 61 61 60 60 60 60 59 59 59 59 59 59 59 58 58 58 58 57 57 57 57 57 57 56 56 56 56 56 56 56 56 56 56 56 56 56 56 56 56 56 56 56 56 56 56 56 56 56 56 56 56 56 55 55 55 55 55 55
2366E5j%%%%%%%%%jJ%%%%%%%%%%%%j%%%%%%%%j%%%%%%%%%%%j%%%%%%%%%%%%%J%%%%%%%%%J
$$ 55 54 54 54 54 54 54 54 54 54 54 53 54 54 54 54 54 54 54 54 54 54 54 54 54 53 53 53 53 53 53 53 53 53 52 52 52 52 52 52 52 52 52 52 52 52 51 51 51 51 51 51 51 51 51 51 51 51 51 51 52 52 52 52 52 52 52 52 52 52 53
2358E3%%%%%%%%%%J%%%%%%%%%%%%%%%%%%j%%%%%%j%%%%%%j%%%%%%%%%%%jJ%%%%%%%%%%%%%
$$ 53 53 53 53 53 53 53 53 53 53 53 54 54 54 54 54 54 54 54 54 54 54 54 54 54 54 54 54 54 54 53 53 53 53 53 53 53 52 52 52 52 52 52 52 51 51 51 51 51 51 51 51 51 51 51 51 50 51 51 51 51 51 51 51 51 51 51 51 51 51 51
2351E1%%%%%%%J%%%%%%%%%J%%%%%%%%%%%%%%%%%%%%%%%%%%j%%%%%%%%%%%%%%%%%%%j%%%%%
$$ 51 51 51 51 51 51 51 51 52 52 52 52 52 52 52 52 52 52 53 53 53 53 53 53 53 53 53 53 53 53 53 53 53 53 53 53 53 53 53 53 53 53 53 53 53 52 52 52 52 52 52 52 52 52 52 52 52 52 52 52 52 52 52 52 52 51 51 51 51 51 51
2343E1%%%%%%%%%%%J%%%%%%%%%%%%%%%%%j%%%J%%%%%%%%%j%%%%%%%%%j%%%%%%%%%%%%%j%%
$$ 51 51 51 51 51 51 51 51 51 51 51 51 52 52 52 52 52 52 52 52 52 52 52 52 52 52 52 52 52 52 51 51 51 51 52 52 52 52 52 52 52 52 52 52 51 51 51 51 51 51 51 51 51 51 50 50 50 50 50 50 50 50 50 50 50 50 50 50 49 49 49
2336D9%%%%%%%%%%%%%%%%%%%%%%%%%%%%%%%%%%%%%%%%%%%%%J%j%Jj%J%%%j%%%%%%%%%%%j%
$$ 49 49 49 49 49 49 49 49 49 49 49 49 49 49 49 49 49 49 49 49 49 49 49 49 49 49 49 49 49 49 49 49 49 49 49 49 49 49 49 49 49 49 49 49 49 49 50 50 49 49 50 49 49 50 50 50 50 49 49 49 49 49 49 49 49 49 49 49 49 48 48
2329D8%%%%%%J%%%%%J%%J%%%J%%J%%%%%%%j%j%%%j%%%j%%%%j%%%%%%%%%%%%%%%%%%jJj%%%
$$ 48 48 48 48 48 48 48 49 49 49 49 49 49 50 50 50 51 51 51 51 52 52 52 53 53 53 53 53 53 53 53 52 52 51 51 51 51 50 50 50 50 49 49 49 49 49 48 48 48 48 48 48 48 48 48 48 48 48 48 48 48 48 48 48 48 47 48 47 47 47 47
2321D7%%%%%%%%%%%%%%%j%%J%%%%%%%j%%J%%%%%%%%%%%%%%%%%%%J%%%%%%%%%%%%%%%%%%%%
$$ 47 47 47 47 47 47 47 47 47 47 47 47 47 47 47 47 46 46 46 47 47 47 47 47 47 47 47 46 46 46 47 47 47 47 47 47 47 47 47 47 47 47 47 47 47 47 47 47 47 47 48 48 48 48 48 48 48 48 48 48 48 48 48 48 48 48 48 48 48 48 48
2314D8%%%%%%%%%%%%%%%%%%%%%%%%%%%%%%%%%%%%%%%%%%%%%%%%%%%%%%%%%%%%%%%%%%%%%%
$$ 48 48 48 48 48 48 48 48 48 48 48 48 48 48 48 48 48 48 48 48 48 48 48 48 48 48 48 48 48 48 48 48 48 48 48 48 48 48 48 48 48 48 48 48 48 48 48 48 48 48 48 48 48 48 48 48 48 48 48 48 48 48 48 48 48 48 48 48 48 48 48
2306D8%%%J%%%%%%%%%%%j%%%%%%%%%%%%%%%%%%%%%%%%%%%%%%%%%%%%%%%%%%%%%%%%%%%jJ%
$$ 48 48 48 48 49 49 49 49 49 49 49 49 49 49 49 49 48 48 48 48 48 48 48 48 48 48 48 48 48 48 48 48 48 48 48 48 48 48 48 48 48 48 48 48 48 48 48 48 48 48 48 48 48 48 48 48 48 48 48 48 48 48 48 48 48 48 48 48 47 48 48
2299D8%%j%J%%%%%jJ%%%%%%j%%%%%%%%%%%%%%%%%%%%%%%%%%J%%j%%%%%%%Jj%%%%%%%%%%%%
$$ 48 48 48 47 47 48 48 48 48 48 48 47 48 48 48 48 48 48 48 47 47 47 47 47 47 47 47 47 47 47 47 47 47 47 47 47 47 47 47 47 47 47 47 47 47 47 48 48 48 47 47 47 47 47 47 47 47 48 47 47 47 47 47 47 47 47 47 47 47 47 47
2291D7%%%%%%Jj%%%%%%%%%%%J%j%%%%%%%%%%%%%%%%%%%%%%%%%%%%%%%%%%%%%%%%%%%%%%%%
$$ 47 47 47 47 47 47 47 48 47 47 47 47 47 47 47 47 47 47 47 47 48 48 47 47 47 47 47 47 47 47 47 47 47 47 47 47 47 47 47 47 47 47 47 47 47 47 47 47 47 47 47 47 47 47 47 47 47 47 47 47 47 47 47 47 47 47 47 47 47 47 47
2284D7%%%%%%%%%%%%%%%%%%%%%%%%%%%%%%%%%%%%%%%j%%%%%%%%%%%%%j%%%%%%%%J%%%%j%%
$$ 47 47 47 47 47 47 47 47 47 47 47 47 47 47 47 47 47 47 47 47 47 47 47 47 47 47 47 47 47 47 47 47 47 47 47 47 47 47 47 47 46 46 46 46 46 46 46 46 46 46 46 46 46 46 45 45 45 45 45 45 45 45 45 46 46 46 46 46 45 45 45
2277D5%%%%%J%%%%%%%%%%%%%%%%%%%%%%%%%j%%%%j%%%%%%%%%%%%j%%%%%%%%%%%%%%%%%%%%
$$ 45 45 45 45 45 45 46 46 46 46 46 46 46 46 46 46 46 46 46 46 46 46 46 46 46 46 46 46 46 46 46 46 45 45 45 45 45 44 44 44 44 44 44 44 44 44 44 44 44 44 43 43 43 43 43 43 43 43 43 43 43 43 43 43 43 43 43 43 43 43 43
2269D3%J%%%%j%%%J%%%%%%%%%%%%%%%%%J%j%%%%J%%%%%%jJ%%%%%%%%%%%%%%%%%%%%%%%%%%
$$ 43 43 44 44 44 44 44 43 43 43 43 44 44 44 44 44 44 44 44 44 44 44 44 44 44 44 44 44 44 45 45 44 44 44 44 44 45 45 45 45 45 45 45 44 45 45 45 45 45 45 45 45 45 45 45 45 45 45 45 45 45 45 45 45 45 45 45 45 45 45 45
2262D5%%%%%%%%J%%%%%%%%%%J%%%%%%%%%%%%%%%j%%%%%%%%%%%%j%%%%%%%%%%%%%%%%%%%%%
$$ 45 45 45 45 45 45 45 45 45 46 46 46 46 46 46 46 46 46 46 46 47 47 47 47 47 47 47 47 47 47 47 47 47 47 47 47 46 46 46 46 46 46 46 46 46 46 46 46 46 45 45 45 45 45 45 45 45 45 45 45 45 45 45 45 45 45 45 45 45 45 45
2254D5%%%%%%%%%%%%%%%%%%%%%%%%%%%%%%%%%%%%j%J%%%%%%%%%j%J%%%%j%%%%%%%%%%%%%%
$$ 45 45 45 45 45 45 45 45 45 45 45 45 45 45 45 45 45 45 45 45 45 45 45 45 45 45 45 45 45 45 45 45 45 45 45 45 45 44 44 45 45 45 45 45 45 45 45 45 45 44 44 45 45 45 45 45 44 44 44 44 44 44 44 44 44 44 44 44 44 44 44
2247D4%%Jj%%%%%%%%%%%%%%%%J%j%%%%%%%%%%%%%%%%%%%%%%%%%%Jj%%%%%%%%%%%%%jJ%%%%
$$ 44 44 44 45 44 44 44 44 44 44 44 44 44 44 44 44 44 44 44 44 44 45 45 44 44 44 44 44 44 44 44 44 44 44 44 44 44 44 44 44 44 44 44 44 44 44 44 44 44 44 45 44 44 44 44 44 44 44 44 44 44 44 44 44 44 43 44 44 44 44 44
2240D4%%%%%%%%%%%%%%%%%%%%%%J%j%%%%%%%%%%%%%%%J%%%%%%j%%%%%%Jj%%%%%%J%%%%%%%
$$ 44 44 44 44 44 44 44 44 44 44 44 44 44 44 44 44 44 44 44 44 44 44 44 45 45 44 44 44 44 44 44 44 44 44 44 44 44 44 44 44 44 45 45 45 45 45 45 45 44 44 44 44 44 44 44 45 44 44 44 44 44 44 44 45 45 45 45 45 45 45 45
2232D5%%%%%%%%%%%j%%%%%J%%%%%%j%%%%%%%%%%%Jj%%%%%%%%%J%%%%j%%%%%%%%%%J%%%j%%
$$ 45 45 45 45 45 45 45 45 45 45 45 45 44 44 44 44 44 44 45 45 45 45 45 45 45 44 44 44 44 44 44 44 44 44 44 44 44 45 44 44 44 44 44 44 44 44 44 44 45 45 45 45 45 44 44 44 44 44 44 44 44 44 44 44 45 45 45 45 44 44 44
2225D4%%%%%%%%%%%%%%%%%%Jj%%%%%%%%%%%%%%%%%%%%%%%%%%%%%%%jJj%J%jJ%%%j%%%J%%j
$$ 44 44 44 44 44 44 44 44 44 44 44 44 44 44 44 44 44 44 44 45 44 44 44 44 44 44 44 44 44 44 44 44 44 44 44 44 44 44 44 44 44 44 44 44 44 44 44 44 44 44 44 44 43 44 43 43 44 44 43 44 44 44 44 43 43 43 43 44 44 44 43
2217D3%%%%J%%%%%%%%%%%j%%%%%%%JjJ%%%%%%%%%%%%%%%%%%%%%jJ%%%%%%%%%%%%%%%%%%%%
$$ 43 43 43 43 43 44 44 44 44 44 44 44 44 44 44 44 44 43 43 43 43 43 43 43 43 44 43 44 44 44 44 44 44 44 44 44 44 44 44 44 44 44 44 44 44 44 44 44 44 43 44 44 44 44 44 44 44 44 44 44 44 44 44 44 44 44 44 44 44 44 44
2210D4%%j%%%%%%%%%%%%%%%%%%%%%%%%%%%%%%%%%%%%%%%%%%%%%%%%%%%%%%%%%%%%%%%%%%%
$$ 44 44 44 43 43 43 43 43 43 43 43 43 43 43 43 43 43 43 43 43 43 43 43 43 43 43 43 43 43 43 43 43 43 43 43 43 43 43 43 43 43 43 43 43 43 43 43 43 43 43 43 43 43 43 43 43 43 43 43 43 43 43 43 43 43 43 43 43 43 43 43
2202D3%%%%%%%%%%%%%%%%jJ%%%%%j%%%%%%%%J%%%%%%%%%%%%%%%%%%%%%%%%%%%%%%%%%%%%%
$$ 43 43 43 43 43 43 43 43 43 43 43 43 43 43 43 43 43 42 43 43 43 43 43 43 42 42 42 42 42 42 42 42 42 43 43 43 43 43 43 43 43 43 43 43 43 43 43 43 43 43 43 43 43 43 43 43 43 43 43 43 43 43 43 43 43 43 43 43 43 43 43
2195D3%%%%%%%%%%%%j%%%%J%j%%%J%%%j%%%%%%%J%%jJ%%%%%%%j%%%%J%%jJ%%j%%%J%%%%%%
$$ 43 43 43 43 43 43 43 43 43 43 43 43 43 42 42 42 42 42 43 43 42 42 42 42 43 43 43 43 42 42 42 42 42 42 42 42 43 43 43 42 43 43 43 43 43 43 43 43 42 42 42 42 42 43 43 43 42 43 43 43 42 42 42 42 43 43 43 43 43 43 43
2188D3%%%%%%%%%%%%%%%j%%J%%%%%%j%%%J%j%%J%j%%%%J%j%%%%%%%J%%%%j%J%%j%%%%%%%%
$$ 43 43 43 43 43 43 43 43 43 43 43 43 43 43 43 43 42 42 42 43 43 43 43 43 43 43 42 42 42 42 43 43 42 42 42 43 43 42 42 42 42 42 43 43 42 42 42 42 42 42 42 42 43 43 43 43 43 42 42 43 43 43 42 42 42 42 42 42 42 42 42
2180D2%%%%%%%%%%%%%%%%%%%J%%j%%%%%%%%%%%%%%%%%%%%%%%%J%j%%%%%%%%%%%%%%%%%%%%
$$ 42 42 42 42 42 42 42 42 42 42 42 42 42 42 42 42 42 42 42 42 43 43 43 42 42 42 42 42 42 42 42 42 42 42 42 42 42 42 42 42 42 42 42 42 42 42 42 42 43 43 42 42 42 42 42 42 42 42 42 42 42 42 42 42 42 42 42 42 42 42 42
2173D2%%%%%%%%%Jj%%%%%%%%%%%%%%%%%%%%%%%%%%%%%%%%%%%%%%%%%%%%%%%%%%%%%%%%%%%
$$ 42 42 42 42 42 42 42 42 42 42 43 42 42 42 42 42 42 42 42 42 42 42 42 42 42 42 42 42 42 42 42 42 42 42 42 42 42 42 42 42 42 42 42 42 42 42 42 42 42 42 42 42 42 42 42 42 42 42 42 42 42 42 42 42 42 42 42 42 42 42 42
2165D2j%J%%%%%%%%%j%%J%%%%%%%%%%%%%%%%%%%%%%%%%%%%%%%%%%%%%%%%%%%%%j%J%%%%%%
$$ 42 41 41 42 42 42 42 42 42 42 42 42 42 41 41 41 42 42 42 42 42 42 42 42 42 42 42 42 42 42 42 42 42 42 42 42 42 42 42 42 42 42 42 42 42 42 42 42 42 42 42 42 42 42 42 42 42 42 42 42 42 42 41 41 42 42 42 42 42 42 42
2158D2%%%%%%%%%%j%%%%%%%J%j%%%%%J%%%%%%%%%%%j%%%J%%%%%%%%%j%%J%%%%j%%Jj%%Jj%
$$ 42 42 42 42 42 42 42 42 42 42 42 41 41 41 41 41 41 41 41 42 42 41 41 41 41 41 41 42 42 42 42 42 42 42 42 42 42 42 42 41 41 41 41 42 42 42 42 42 42 42 42 42 42 41 41 41 42 42 42 42 42 41 41 41 42 41 41 41 42 41 41
2151D1J%j%%%%%%%%J%%%%%%j%%%J%%%%j%%J%%%%%%%%%%%%%%jJ%%%%%%%%%%%j%%J%%j%%%%%
$$ 41 42 42 41 41 41 41 41 41 41 41 41 42 42 42 42 42 42 42 41 41 41 41 42 42 42 42 42 41 41 41 42 42 42 42 42 42 42 42 42 42 42 42 42 42 42 41 42 42 42 42 42 42 42 42 42 42 42 42 41 41 41 42 42 42 41 41 41 41 41 41
2143D1%%%%%%%%%%%%%%%%%%%%%%%%%%%%%%%%%%%%%%%%%%%%%%%%%%%%%%%%%%%%%%%%%%%%%%
$$ 41 41 41 41 41 41 41 41 41 41 41 41 41 41 41 41 41 41 41 41 41 41 41 41 41 41 41 41 41 41 41 41 41 41 41 41 41 41 41 41 41 41 41 41 41 41 41 41 41 41 41 41 41 41 41 41 41 41 41 41 41 41 41 41 41 41 41 41 41 41 41
2136D1%%Jj%%%%%%%%%%%%%%%%%%%%%%%%%%%%%%%%%%%%%%%%%%%%%%%%%%%%%%%%%%%%%%%%%%
$$ 41 41 41 42 41 41 41 41 41 41 41 41 41 41 41 41 41 41 41 41 41 41 41 41 41 41 41 41 41 41 41 41 41 41 41 41 41 41 41 41 41 41 41 41 41 41 41 41 41 41 41 41 41 41 41 41 41 41 41 41 41 41 41 41 41 41 41 41 41 41 41
2128D1%%%%%%%%%%%%%%%%%%%%%%%%%%%%%%%%%%%%%%%%%%%%%%%%%%%%%%%%%%%%%%%%%%%%%%
$$ 41 41 41 41 41 41 41 41 41 41 41 41 41 41 41 41 41 41 41 41 41 41 41 41 41 41 41 41 41 41 41 41 41 41 41 41 41 41 41 41 41 41 41 41 41 41 41 41 41 41 41 41 41 41 41 41 41 41 41 41 41 41 41 41 41 41 41 41 41 41 41
2121D1%%%j%J%%%%%%%jJ%%%j%%%J%%%%%%%%%%%%%%%%%%%%%%%%%%%%%%%%j%%%%%%J%%%%%%%
$$ 41 41 41 41 40 40 41 41 41 41 41 41 41 41 40 41 41 41 41 40 40 40 40 41 41 41 41 41 41 41 41 41 41 41 41 41 41 41 41 41 41 41 41 41 41 41 41 41 41 41 41 41 41 41 41 41 40 40 40 40 40 40 40 41 41 41 41 41 41 41 41
2113D1%jJ%%%%%%%j%Jj%J%%%%%%%%%%%%%%%%%%%%%j%%%%%%%J%%%%%j%%%%%%%J%%%%%%%%%%
$$ 41 41 40 41 41 41 41 41 41 41 41 40 40 41 40 40 41 41 41 41 41 41 41 41 41 41 41 41 41 41 41 41 41 41 41 41 41 41 40 40 40 40 40 40 40 40 41 41 41 41 41 41 40 40 40 40 40 40 40 40 41 41 41 41 41 41 41 41 41 41 41
2106D1%%%%%%%%%%%%%%%%%%%%%%%%%%%%%%%%%%%j%%%%%%J%%%%%%%%%%%%%%%%%%%%%%%%%%%
$$ 41 41 41 41 41 41 41 41 41 41 41 41 41 41 41 41 41 41 41 41 41 41 41 41 41 41 41 41 41 41 41 41 41 41 41 41 40 40 40 40 40 40 40 41 41 41 41 41 41 41 41 41 41 41 41 41 41 41 41 41 41 41 41 41 41 41 41 41 41 41 41
2099D1%%j%%Jj%%%%%%%%%J%%%%%%%%%%%%%%%%%%%%%%%%%%%%%%%%%%%%%%jJ%%%%%%%%%%%%%
$$ 41 41 41 40 40 40 41 40 40 40 40 40 40 40 40 40 40 41 41 41 41 41 41 41 41 41 41 41 41 41 41 41 41 41 41 41 41 41 41 41 41 41 41 41 41 41 41 41 41 41 41 41 41 41 41 41 40 41 41 41 41 41 41 41 41 41 41 41 41 41 41
2091D1%%%%%%%%%j%J%%%%%%%%%%%%%%j%J%%%%%%%%%%%%%%%%%%%%%%%%%%%%%%%%%%%j%%J%%
$$ 41 41 41 41 41 41 41 41 41 41 40 40 41 41 41 41 41 41 41 41 41 41 41 41 41 41 41 40 40 41 41 41 41 41 41 41 41 41 41 41 41 41 41 41 41 41 41 41 41 41 41 41 41 41 41 41 41 41 41 41 41 41 41 41 41 40 40 40 41 41 41
2084D1%%%%%%%%%%%%%j%%%J%%%%%%%%%%%%%%%%%%%%%%%%%%jJ%%%%%%%%%%%%%%%%%%%%%%%%
$$ 41 41 41 41 41 41 41 41 41 41 41 41 41 41 40 40 40 40 41 41 41 41 41 41 41 41 41 41 41 41 41 41 41 41 41 41 41 41 41 41 41 41 41 41 41 40 41 41 41 41 41 41 41 41 41 41 41 41 41 41 41 41 41 41 41 41 41 41 41 41 41
2076D1%%%%%%%j%%%%%%%%%%%%%J%%%%%%j%%J%%j%%%%%%%%%%%%%%%%%%%J%%j%%%%%%%%%J%%
$$ 41 41 41 41 41 41 41 41 40 40 40 40 40 40 40 40 40 40 40 40 40 40 41 41 41 41 41 41 41 40 40 40 41 41 41 40 40 40 40 40 40 40 40 40 40 40 40 40 40 40 40 40 40 40 40 41 41 41 40 40 40 40 40 40 40 40 40 40 41 41 41
2069D1%%jJ%%%%%%j%%%%%J%%%%j%%%%%%%%J%%%%%%%%%%%%%%%%%%%%%%j%%%J%%%%%%j%%%%%
$$ 41 41 41 40 41 41 41 41 41 41 41 40 40 40 40 40 40 41 41 41 41 41 40 40 40 40 40 40 40 40 40 41 41 41 41 41 41 41 41 41 41 41 41 41 41 41 41 41 41 41 41 41 41 41 40 40 40 40 41 41 41 41 41 41 41 40 40 40 40 40 40
2062D0%%%%J%%j%%%%%%%%%%%%%%%%%%%%Jj%J%%%%%%%%%j%%J%%%%%%j%%%%%%%%J%%%j%%%%J
$$ 40 40 40 40 40 41 41 41 40 40 40 40 40 40 40 40 40 40 40 40 40 40 40 40 40 40 40 40 40 41 40 40 41 41 41 41 41 41 41 41 41 41 40 40 40 41 41 41 41 41 41 41 40 40 40 40 40 40 40 40 40 41 41 41 41 40 40 40 40 40 41
2054D1%%%%%%j%%%%%J%%%%%%j%%%%%%%J%%%%jJ%%%j%%%%J%%%%%%%%%%%%%%%%%j%%%%%%%%%
$$ 41 41 41 41 41 41 41 40 40 40 40 40 40 41 41 41 41 41 41 41 40 40 40 40 40 40 40 40 41 41 41 41 41 40 41 41 41 41 40 40 40 40 40 41 41 41 41 41 41 41 41 41 41 41 41 41 41 41 41 41 41 40 40 40 40 40 40 40 40 40 40
2047D0%%%%%%J%%j%%%%%%Jj%%%%%%%%%%%%%%%%%%%%%%%%%%J%j%%%%%%%%%%%%%%%%%%%%%%%
$$ 40 40 40 40 40 40 40 41 41 41 40 40 40 40 40 40 40 41 40 40 40 40 40 40 40 40 40 40 40 40 40 40 40 40 40 40 40 40 40 40 40 40 40 40 40 41 41 40 40 40 40 40 40 40 40 40 40 40 40 40 40 40 40 40 40 40 40 40 40 40 40
2039D0%%%%%%%%%%%%J%%%%%%%%j%%%%%J%%%%%%%%%%J%%%%%%%%%%%%%%j%%%%%%%%%%j%%J%%
$$ 40 40 40 40 40 40 40 40 40 40 40 40 40 41 41 41 41 41 41 41 41 41 40 40 40 40 40 40 41 41 41 41 41 41 41 41 41 41 41 42 42 42 42 42 42 42 42 42 42 42 42 42 42 42 41 41 41 41 41 41 41 41 41 41 41 40 40 40 41 41 41
2032D1%%%%%%%j%%%%%%%%%%%J%j%%%%%%%%J%j%%%%%%%%%%%%%%%%%%%%%%%%Jj%%%%%%%%%%%
$$ 41 41 41 41 41 41 41 41 40 40 40 40 40 40 40 40 40 40 40 40 41 41 40 40 40 40 40 40 40 40 40 41 41 40 40 40 40 40 40 40 40 40 40 40 40 40 40 40 40 40 40 40 40 40 40 40 40 40 41 40 40 40 40 40 40 40 40 40 40 40 40
2024D0%%%%%%%%%%%%%%%%%%%%%%%%%%%%%%%%%%%%%%%%%%%%%%%%%%%%%J%j%%%%%%%%%%%%%%
$$ 40 40 40 40 40 40 40 40 40 40 40 40 40 40 40 40 40 40 40 40 40 40 40 40 40 40 40 40 40 40 40 40 40 40 40 40 40 40 40 40 40 40 40 40 40 40 40 40 40 40 40 40 40 40 41 41 40 40 40 40 40 40 40 40 40 40 40 40 40 40 40
2017D0%%%%%%%%%%%%%%%%%%%%%%%%%%%%%%%%%%%%%%%%%%%%%%%%%%%%%%%%%%%%%%%%%%%%%%
$$ 40 40 40 40 40 40 40 40 40 40 40 40 40 40 40 40 40 40 40 40 40 40 40 40 40 40 40 40 40 40 40 40 40 40 40 40 40 40 40 40 40 40 40 40 40 40 40 40 40 40 40 40 40 40 40 40 40 40 40 40 40 40 40 40 40 40 40 40 40 40 40
2010D0%%%%%%%%%%%%%%%%%%%%%%%%%%%%%%%%%%%%%%%%%%%%%%%%%%%%%%%%%%%%%%%%%%%%%%
$$ 40 40 40 40 40 40 40 40 40 40 40 40 40 40 40 40 40 40 40 40 40 40 40 40 40 40 40 40 40 40 40 40 40 40 40 40 40 40 40 40 40 40 40 40 40 40 40 40 40 40 40 40 40 40 40 40 40 40 40 40 40 40 40 40 40 40 40 40 40 40 40
2002D0%%%%%%%%%%%%%%%%%%%%%%%%%%%%%%%%%%%%%%%%%%%%%%%%%%%%%%%%%%%%%%%%%%%%%%
$$ 40 40 40 40 40 40 40 40 40 40 40 40 40 40 40 40 40 40 40 40 40 40 40 40 40 40 40 40 40 40 40 40 40 40 40 40 40 40 40 40 40 40 40 40 40 40 40 40 40 40 40 40 40 40 40 40 40 40 40 40 40 40 40 40 40 40 40 40 40 40 40
1995D0%%%%%%%%%%%%%%%%%%%%%%%%%%%%%%%%%%%%%%%%%%%%%%%%%%%%%%%%%%%%%%%%%%%%%%
$$ 40 40 40 40 40 40 40 40 40 40 40 40 40 40 40 40 40 40 40 40 40 40 40 40 40 40 40 40 40 40 40 40 40 40 40 40 40 40 40 40 40 40 40 40 40 40 40 40 40 40 40 40 40 40 40 40 40 40 40 40 40 40 40 40 40 40 40 40 40 40 40
1987D0%%%%%%%%%%%%J%%j%%%%%J%%%%%%j%%%%%%%%%%%%%%%%%%%%%%%%%%%%%%%%%%%%%%%%%
$$ 40 40 40 40 40 40 40 40 40 40 40 40 40 41 41 41 40 40 40 40 40 40 41 41 41 41 41 41 41 40 40 40 40 40 40 40 40 40 40 40 40 40 40 40 40 40 40 40 40 40 40 40 40 40 40 40 40 40 40 40 40 40 40 40 40 40 40 40 40 40 40
1980D0%%%%%%%%%%j%J%%%%%%%%%%%%%%%%%%%%%%%%%%%%%%%%%%%%%%%%%%%%%%%%%%%%%%%%%
$$ 40 40 40 40 40 40 40 40 40 40 40 39 39 40 40 40 40 40 40 40 40 40 40 40 40 40 40 40 40 40 40 40 40 40 40 40 40 40 40 40 40 40 40 40 40 40 40 40 40 40 40 40 40 40 40 40 40 40 40 40 40 40 40 40 40 40 40 40 40 40 40
1973D0%%%%%%%jJ%%%%%%%%%%%%%%%%%%%%%%%%J%%%%%%%%%%%%%%%j%%%%%%%%%%%%%%%%%%%%
$$ 40 40 40 40 40 40 40 40 39 40 40 40 40 40 40 40 40 40 40 40 40 40 40 40 40 40 40 40 40 40 40 40 40 40 41 41 41 41 41 41 41 41 41 41 41 41 41 41 41 41 40 40 40 40 40 40 40 40 40 40 40 40 40 40 40 40 40 40 40 40 40
1965D0%%%%%j%J%%%%%%%%%%%%%%%%%%%%%%%%%%%%%%%%%%%%%%%%%%%%%%%%%%%%%%%%%%%%%%
$$ 40 40 40 40 40 40 39 39 40 40 40 40 40 40 40 40 40 40 40 40 40 40 40 40 40 40 40 40 40 40 40 40 40 40 40 40 40 40 40 40 40 40 40 40 40 40 40 40 40 40 40 40 40 40 40 40 40 40 40 40 40 40 40 40 40 40 40 40 40 40 40
1958D0%%%%%%%%%%j%%J%%%j%%%%J%%%%%%%%%%%%%%%%%%%%%%%%%%%%%%%%%%%%%%%%%%%%%%%
$$ 40 40 40 40 40 40 40 40 40 40 40 39 39 39 40 40 40 40 39 39 39 39 39 40 40 40 40 40 40 40 40 40 40 40 40 40 40 40 40 40 40 40 40 40 40 40 40 40 40 40 40 40 40 40 40 40 40 40 40 40 40 40 40 40 40 40 40 40 40 40 40
1950D0%%%%%j%J%%%%%%%%%%%%%%%%%%%%%%%%%%%%j%%%%%%J%%%%%%%%%%%%%%%%%%%%%%%%%%
$$ 40 40 40 40 40 40 39 39 40 40 40 40 40 40 40 40 40 40 40 40 40 40 40 40 40 40 40 40 40 40 40 40 40 40 40 40 40 39 39 39 39 39 39 39 40 40 40 40 40 40 40 40 40 40 40 40 40 40 40 40 40 40 40 40 40 40 40 40 40 40 40
1943D0%%%%%j%J%%%%%%%%%%%%%%%%%%j%%%%%Jj%J%%%j%%%%%%%J%%%%%%%%%%%%%%%%%%%%%%
$$ 40 40 40 40 40 40 39 39 40 40 40 40 40 40 40 40 40 40 40 40 40 40 40 40 40 40 40 39 39 39 39 39 39 40 39 39 40 40 40 40 39 39 39 39 39 39 39 39 40 40 40 40 40 40 40 40 40 40 40 40 40 40 40 40 40 40 40 40 40 40 40
1935D0%%%%%%%%%%%j%%%%%%%%%%%%%%J%%%%%%j%%%%%%%%%%%%%%%%%J%%%%%%%%j%J%%%%%j%
$$ 40 40 40 40 40 40 40 40 40 40 40 40 39 39 39 39 39 39 39 39 39 39 39 39 39 39 39 40 40 40 40 40 40 40 39 39 39 39 39 39 39 39 39 39 39 39 39 39 39 39 39 39 40 40 40 40 40 40 40 40 40 39 39 40 40 40 40 40 40 39 39
1928C9%%%%%%%%%%%%%J%%%%%%%%j%%%%%J%j%%Jj%J%%j%%Jj%%%%%%%%%%J%%%%%%%%%j%%%%%
$$ 39 39 39 39 39 39 39 39 39 39 39 39 39 39 40 40 40 40 40 40 40 40 40 39 39 39 39 39 39 40 40 39 39 39 40 39 39 40 40 40 39 39 39 40 39 39 39 39 39 39 39 39 39 39 39 40 40 40 40 40 40 40 40 40 40 39 39 39 39 39 39
1921C9%%%%%%%%%%%%%%Jj%%%%%%%%%%J%%j%%%J%%j%%%%%%J%%%%%%%%%%%%%%%%%%%%%%%%%%
$$ 39 39 39 39 39 39 39 39 39 39 39 39 39 39 39 40 39 39 39 39 39 39 39 39 39 39 39 40 40 40 39 39 39 39 40 40 40 39 39 39 39 39 39 39 40 40 40 40 40 40 40 40 40 40 40 40 40 40 40 40 40 40 40 40 40 40 40 40 40 40 40
1913D0%%%%%%%%%%%%%%j%%%J%%%%%%%%%%%%%%%%%%%%%%%%%%%%%%%%%%j%%Jj%%%%%%%%%%%%
$$ 40 40 40 40 40 40 40 40 40 40 40 40 40 40 40 39 39 39 39 40 40 40 40 40 40 40 40 40 40 40 40 40 40 40 40 40 40 40 40 40 40 40 40 40 40 40 40 40 40 40 40 40 40 40 39 39 39 40 39 39 39 39 39 39 39 39 39 39 39 39 39
1906C9%%%%%%%%%%%J%%j%%%%%%%%%%Jj%%%%%%%%%%%J%%%%j%J%%j%%J%%%j%%%%%%%%%%%%%%
$$ 39 39 39 39 39 39 39 39 39 39 39 39 40 40 40 39 39 39 39 39 39 39 39 39 39 39 40 39 39 39 39 39 39 39 39 39 39 39 39 40 40 40 40 40 39 39 40 40 40 39 39 39 40 40 40 40 39 39 39 39 39 39 39 39 39 39 39 39 39 39 39
1898C9J%%%%%%%%%%%%%%%%%%%%%j%%%%%%%%%J%j%%%%%%%%%J%%j%%%%%%%%%%%%%%J%%%%%jJ
$$ 39 40 40 40 40 40 40 40 40 40 40 40 40 40 40 40 40 40 40 40 40 40 40 39 39 39 39 39 39 39 39 39 39 40 40 39 39 39 39 39 39 39 39 39 39 40 40 40 39 39 39 39 39 39 39 39 39 39 39 39 39 39 39 40 40 40 40 40 40 39 40
1891D0%%%j%%%%%%%%%%%%%%%%%Jj%%%%%%%%%%%%%%%%%%%%%%%%%%%%%%%%%%%%%%%%%%%%%%%
$$ 40 40 40 40 39 39 39 39 39 39 39 39 39 39 39 39 39 39 39 39 39 39 40 39 39 39 39 39 39 39 39 39 39 39 39 39 39 39 39 39 39 39 39 39 39 39 39 39 39 39 39 39 39 39 39 39 39 39 39 39 39 39 39 39 39 39 39 39 39 39 39
1884C9%%%%%%%%%%%%%%%%%%%%%%%%%%%%%%%%%%%%%%%%%%%%%%%%%%%%%%%%%%%%%%%%%%%%%%
$$ 39 39 39 39 39 39 39 39 39 39 39 39 39 39 39 39 39 39 39 39 39 39 39 39 39 39 39 39 39 39 39 39 39 39 39 39 39 39 39 39 39 39 39 39 39 39 39 39 39 39 39 39 39 39 39 39 39 39 39 39 39 39 39 39 39 39 39 39 39 39 39
1876C9%%%%%%%%%%%%%%%%%%%%%%%%%%%%%%%%%%%%%%%%%%%%%%%%%%%%%%%%%%%%%%%%%%%%%%
$$ 39 39 39 39 39 39 39 39 39 39 39 39 39 39 39 39 39 39 39 39 39 39 39 39 39 39 39 39 39 39 39 39 39 39 39 39 39 39 39 39 39 39 39 39 39 39 39 39 39 39 39 39 39 39 39 39 39 39 39 39 39 39 39 39 39 39 39 39 39 39 39
1869C9%%%%%%%%%%%%%%%%%%%%%%%%%%%%%%%J%%j%%%%%%%%%%%%%%%%%%%Jj%%%%%%%%%%%%%%
$$ 39 39 39 39 39 39 39 39 39 39 39 39 39 39 39 39 39 39 39 39 39 39 39 39 39 39 39 39 39 39 39 39 40 40 40 39 39 39 39 39 39 39 39 39 39 39 39 39 39 39 39 39 39 39 39 40 39 39 39 39 39 39 39 39 39 39 39 39 39 39 39
1861C9%%%%%%%%%%%%%%%%%%%J%%j%%%%%%%%%%%%%%%%%%%%%%%%%%%%%%%%%%J%j%%%%%%J%%%
$$ 39 39 39 39 39 39 39 39 39 39 39 39 39 39 39 39 39 39 39 39 40 40 40 39 39 39 39 39 39 39 39 39 39 39 39 39 39 39 39 39 39 39 39 39 39 39 39 39 39 39 39 39 39 39 39 39 39 39 40 40 39 39 39 39 39 39 39 40 40 40 40
1854D0%%%%%%J%%%%%%%%%%%%%%%%%j%%%%%%%jJ%%%j%%%%%%%%%%%%%%%%%%J%%%j%%%%%%%%%
$$ 40 40 40 40 40 40 40 41 41 41 41 41 41 41 41 41 41 41 41 41 41 41 41 41 41 40 40 40 40 40 40 40 40 39 40 40 40 40 39 39 39 39 39 39 39 39 39 39 39 39 39 39 39 39 39 39 39 40 40 40 40 39 39 39 39 39 39 39 39 39 39
1846C9%%%%%%%%%%%%%%%%%%%%%%%%%%%%%%%%%%%%%%%%%%%%%%%%%%%%%%%%%%%%%%%%%%%%%%
$$ 39 39 39 39 39 39 39 39 39 39 39 39 39 39 39 39 39 39 39 39 39 39 39 39 39 39 39 39 39 39 39 39 39 39 39 39 39 39 39 39 39 39 39 39 39 39 39 39 39 39 39 39 39 39 39 39 39 39 39 39 39 39 39 39 39 39 39 39 39 39 39
1839C9%%%%%%%%%%%%%%%%%%%%%%%%%%%%%%%%%%%%%%%%%%%%%%%%%%%%%%%%%%%%%%%%%%%%%%
$$ 39 39 39 39 39 39 39 39 39 39 39 39 39 39 39 39 39 39 39 39 39 39 39 39 39 39 39 39 39 39 39 39 39 39 39 39 39 39 39 39 39 39 39 39 39 39 39 39 39 39 39 39 39 39 39 39 39 39 39 39 39 39 39 39 39 39 39 39 39 39 39
1832C9%%%%%%%%%%%%%%%%%%%%%%%%%%%%%%%%%%%%%%%%%%%%%%%%%%%%%%%%%%%%%%%%%%%%%%
$$ 39 39 39 39 39 39 39 39 39 39 39 39 39 39 39 39 39 39 39 39 39 39 39 39 39 39 39 39 39 39 39 39 39 39 39 39 39 39 39 39 39 39 39 39 39 39 39 39 39 39 39 39 39 39 39 39 39 39 39 39 39 39 39 39 39 39 39 39 39 39 39
1824C9%%%%%%%%%%%%%%%%%%%J%%j%%%%%%%%%%%%%%%%%%%%%%%%%%%%%%%%%%%%%%%%%%%%%%%
$$ 39 39 39 39 39 39 39 39 39 39 39 39 39 39 39 39 39 39 39 39 40 40 40 39 39 39 39 39 39 39 39 39 39 39 39 39 39 39 39 39 39 39 39 39 39 39 39 39 39 39 39 39 39 39 39 39 39 39 39 39 39 39 39 39 39 39 39 39 39 39 39
1817C9%%%%%%%%%%%%%%%%%%%%%%%%%%%j%%J%%%%%%%%%%%%%%%%%%%%%%%%%%%%%%%%%%%%%%%
$$ 39 39 39 39 39 39 39 39 39 39 39 39 39 39 39 39 39 39 39 39 39 39 39 39 39 39 39 39 38 38 38 39 39 39 39 39 39 39 39 39 39 39 39 39 39 39 39 39 39 39 39 39 39 39 39 39 39 39 39 39 39 39 39 39 39 39 39 39 39 39 39
1809C9%%%%%%%%%%%%%%%%%%%%%%%%%%%%%%%%%%%%%j%J%%%%%%%%%%%%%%%%%%%%%%%%%%%%%%
$$ 39 39 39 39 39 39 39 39 39 39 39 39 39 39 39 39 39 39 39 39 39 39 39 39 39 39 39 39 39 39 39 39 39 39 39 39 39 39 38 38 39 39 39 39 39 39 39 39 39 39 39 39 39 39 39 39 39 39 39 39 39 39 39 39 39 39 39 39 39 39 39
1802C9%%%%%%%%%%%%%%%%%%%%%%%%%%%%%%%%%%%%%%%%%%%%%%%%%%%%%%%%%%%%%%%%%j%J%%
$$ 39 39 39 39 39 39 39 39 39 39 39 39 39 39 39 39 39 39 39 39 39 39 39 39 39 39 39 39 39 39 39 39 39 39 39 39 39 39 39 39 39 39 39 39 39 39 39 39 39 39 39 39 39 39 39 39 39 39 39 39 39 39 39 39 39 39 38 38 39 39 39
1795C9%%%%%%%%%%%%%%%%%%jJ%%%%%%%%%%%%%%%%%%jJ%%%%%%%%%%%%%%%%%%%%%%%%%%%j%%
$$ 39 39 39 39 39 39 39 39 39 39 39 39 39 39 39 39 39 39 39 38 39 39 39 39 39 39 39 39 39 39 39 39 39 39 39 39 39 39 39 38 39 39 39 39 39 39 39 39 39 39 39 39 39 39 39 39 39 39 39 39 39 39 39 39 39 39 39 39 38 38 38
1787C8%%%%%J%%%%%%%%%%%%%%%%%%%%%%%%j%J%%%%%%%j%J%%%j%%%%%J%%%j%%%%%J%%%%%%%
$$ 38 38 38 38 38 38 39 39 39 39 39 39 39 39 39 39 39 39 39 39 39 39 39 39 39 39 39 39 39 39 39 38 38 39 39 39 39 39 39 39 39 38 38 39 39 39 39 38 38 38 38 38 38 39 39 39 39 38 38 38 38 38 38 39 39 39 39 39 39 39 39
1780C9%%%%%%%%%%%%%%%%j%%%%%%%%J%%j%%%%J%j%%%J%%%%%%j%%%%Jj%%%J%%%%%%%%%%%%%
$$ 39 39 39 39 39 39 39 39 39 39 39 39 39 39 39 39 39 38 38 38 38 38 38 38 38 38 39 39 39 38 38 38 38 38 39 39 38 38 38 38 39 39 39 39 39 39 39 38 38 38 38 38 39 38 38 38 38 39 39 39 39 39 39 39 39 39 39 39 39 39 39
1772C9j%%%%%%%%J%jJ%%%%%%%%%%%%%%%%%%%%%%%%%%%%%%%j%%%%%%%%%%%%%%J%%%%j%%%%%
$$ 39 38 38 38 38 38 38 38 38 38 39 39 38 39 39 39 39 39 39 39 39 39 39 39 39 39 39 39 39 39 39 39 39 39 39 39 39 39 39 39 39 39 39 39 39 38 38 38 38 38 38 38 38 38 38 38 38 38 38 38 39 39 39 39 39 38 38 38 38 38 38
1765C8%%%%%Jj%J%%%%%%%%j%%J%%%j%%%%%%%%%%J%%%j%%%%J%j%%%%%%%%J%j%%%%%%%%%%%%
$$ 38 38 38 38 38 38 39 38 38 39 39 39 39 39 39 39 39 39 38 38 38 39 39 39 39 38 38 38 38 38 38 38 38 38 38 38 39 39 39 39 38 38 38 38 38 39 39 38 38 38 38 38 38 38 38 38 39 39 38 38 38 38 38 38 38 38 38 38 38 38 38
1757C8%%J%%%%%j%%%%J%%%%%%%%j%%%%%%%%J%%%j%%%%%%%%%%%%%%%%%%%%%%%%%%%%%%%%%%
$$ 38 38 38 39 39 39 39 39 39 38 38 38 38 38 39 39 39 39 39 39 39 39 39 38 38 38 38 38 38 38 38 38 39 39 39 39 38 38 38 38 38 38 38 38 38 38 38 38 38 38 38 38 38 38 38 38 38 38 38 38 38 38 38 38 38 38 38 38 38 38 38
1750C8%%%%%%%%%%%J%%%%%%%%%%%%%%%%%%%%%%%%%%%%%%%%%%j%%%%%%%%%%%%%%%%%%%%%%%
$$ 38 38 38 38 38 38 38 38 38 38 38 38 39 39 39 39 39 39 39 39 39 39 39 39 39 39 39 39 39 39 39 39 39 39 39 39 39 39 39 39 39 39 39 39 39 39 39 38 38 38 38 38 38 38 38 38 38 38 38 38 38 38 38 38 38 38 38 38 38 38 38
1743C8%%%%%%%%%%%%%%J%j%%%%%%%%J%%jJ%%j%%%%%%%%%%%%%%%%%%%%%%%%%%%%%%%J%%%%j
$$ 38 38 38 38 38 38 38 38 38 38 38 38 38 38 38 39 39 38 38 38 38 38 38 38 38 38 39 39 39 38 39 39 39 38 38 38 38 38 38 38 38 38 38 38 38 38 38 38 38 38 38 38 38 38 38 38 38 38 38 38 38 38 38 38 38 39 39 39 39 39 38
1735C8%%%%%%%%%%%%%%%%%Jj%%J%%j%%%%%%%%%%%%%%%%%%%%%%%%J%j%%%%%%%%J%%%%%%j%%
$$ 38 38 38 38 38 38 38 38 38 38 38 38 38 38 38 38 38 38 39 38 38 38 39 39 39 38 38 38 38 38 38 38 38 38 38 38 38 38 38 38 38 38 38 38 38 38 38 38 38 38 39 39 38 38 38 38 38 38 38 38 38 39 39 39 39 39 39 39 38 38 38
1728C8%J%%%%%%%%%j%%%%%%%%%%%%%%%%%%%%J%%%j%%%%%%%%%%%%%%Jj%%%%%%%J%%%%%j%%%
$$ 38 38 39 39 39 39 39 39 39 39 39 39 38 38 38 38 38 38 38 38 38 38 38 38 38 38 38 38 38 38 38 38 38 39 39 39 39 38 38 38 38 38 38 38 38 38 38 38 38 38 38 38 39 38 38 38 38 38 38 38 38 39 39 39 39 39 39 38 38 38 38
1720C8%%%%%%%%%%%%%%Jj%%%%%%%%%%%%%%%%%%%%%%%%%%%%%%%%%%%%%%%%%%%%%%%%%%%%%%
$$ 38 38 38 38 38 38 38 38 38 38 38 38 38 38 38 39 38 38 38 38 38 38 38 38 38 38 38 38 38 38 38 38 38 38 38 38 38 38 38 38 38 38 38 38 38 38 38 38 38 38 38 38 38 38 38 38 38 38 38 38 38 38 38 38 38 38 38 38 38 38 38
1713C8%%%%%%%%%%%%%%%%%%%%%%%%%%%%%%%%%%%%%%%%%%%%%%%%%%%%%%%%%%%%%%%%%%Jj%%
$$ 38 38 38 38 38 38 38 38 38 38 38 38 38 38 38 38 38 38 38 38 38 38 38 38 38 38 38 38 38 38 38 38 38 38 38 38 38 38 38 38 38 38 38 38 38 38 38 38 38 38 38 38 38 38 38 38 38 38 38 38 38 38 38 38 38 38 38 39 38 38 38
1705C8J%%%%j%%%%%%%%J%%j%%%%J%jJ%%%%%%%j%%%%%%%%%%%%%%%%%%%%%Jj%%%%%%%%%%%%%
$$ 38 39 39 39 39 39 38 38 38 38 38 38 38 38 38 39 39 39 38 38 38 38 38 39 39 38 39 39 39 39 39 39 39 39 38 38 38 38 38 38 38 38 38 38 38 38 38 38 38 38 38 38 38 38 38 38 39 38 38 38 38 38 38 38 38 38 38 38 38 38 38
1698C8%%%%%%%%%%%%%%%%%J%%j%%%%%%%%J%%%j%%%%%%%%J%j%%%%%%%%%%%%%%%%%%%%%%%%%
$$ 38 38 38 38 38 38 38 38 38 38 38 38 38 38 38 38 38 38 39 39 39 38 38 38 38 38 38 38 38 38 39 39 39 39 38 38 38 38 38 38 38 38 38 39 39 38 38 38 38 38 38 38 38 38 38 38 38 38 38 38 38 38 38 38 38 38 38 38 38 38 38
1691C8%%%%%%%%%J%%%%%%%j%Jj%%%%%%%%%%%%%%%%%J%%%%%%%%%j%J%%j%%%%%%%%%%%%%%%%
$$ 38 38 38 38 38 38 38 38 38 38 39 39 39 39 39 39 39 39 38 38 39 38 38 38 38 38 38 38 38 38 38 38 38 38 38 38 38 38 38 39 39 39 39 39 39 39 39 39 39 38 38 39 39 39 38 38 38 38 38 38 38 38 38 38 38 38 38 38 38 38 38
1683C8%%%%%%%%%%%%%%%%%%%%%%%%%%%%%%%%%%%%%%%%%%J%j%%%%%%%%%%%%%%%%%%%%%%%%%
$$ 38 38 38 38 38 38 38 38 38 38 38 38 38 38 38 38 38 38 38 38 38 38 38 38 38 38 38 38 38 38 38 38 38 38 38 38 38 38 38 38 38 38 38 39 39 38 38 38 38 38 38 38 38 38 38 38 38 38 38 38 38 38 38 38 38 38 38 38 38 38 38
1676C8%%%%%%%%J%j%%%%%%%%%%%%%%%%%Jj%%%%%%%%%%%%%%%%%%%%%%%%%%%%%Jj%%%%%%%%%
$$ 38 38 38 38 38 38 38 38 38 39 39 38 38 38 38 38 38 38 38 38 38 38 38 38 38 38 38 38 38 39 38 38 38 38 38 38 38 38 38 38 38 38 38 38 38 38 38 38 38 38 38 38 38 38 38 38 38 38 38 38 39 38 38 38 38 38 38 38 38 38 38
1668C8%%%%%%%%%%%%%%%%%%%%%%%%%%%%%%%%%%%%%%J%j%J%%%j%%%%%%%%%J%%%%%%%%%%%%%
$$ 38 38 38 38 38 38 38 38 38 38 38 38 38 38 38 38 38 38 38 38 38 38 38 38 38 38 38 38 38 38 38 38 38 38 38 38 38 38 38 39 39 38 38 39 39 39 39 38 38 38 38 38 38 38 38 38 38 39 39 39 39 39 39 39 39 39 39 39 39 39 39
1661C9j%%%%%Jj%%%%%%%%Jj%%%%J%%%%%%%%%%%%%%j%%%%%%%%%%%%%%%%%%%%J%%%%%%%%%j%
$$ 39 38 38 38 38 38 38 39 38 38 38 38 38 38 38 38 38 39 38 38 38 38 38 39 39 39 39 39 39 39 39 39 39 39 39 39 39 39 38 38 38 38 38 38 38 38 38 38 38 38 38 38 38 38 38 38 38 38 38 39 39 39 39 39 39 39 39 39 39 38 38
1654C8J%%%%%%%%%%j%%%%%%%%%%J%j%%%%%%%%%%%%%%%%%%%%%%%%%%%%%%%%%%%%%%%%%%%%%
$$ 38 39 39 39 39 39 39 39 39 39 39 39 38 38 38 38 38 38 38 38 38 38 38 39 39 38 38 38 38 38 38 38 38 38 38 38 38 38 38 38 38 38 38 38 38 38 38 38 38 38 38 38 38 38 38 38 38 38 38 38 38 38 38 38 38 38 38 38 38 38 38
1646C8%%J%%%j%%%Jj%J%%%%%%%%J%%%%%%J%%%J%J%JJJJJJKKKKKLLLLLLMLKKKJJ%%jjkkkll
$$ 38 38 38 39 39 39 39 38 38 38 38 39 38 38 39 39 39 39 39 39 39 39 39 40 40 40 40 40 40 40 41 41 41 41 42 42 43 43 44 45 46 47 48 49 51 53 55 57 59 62 65 68 71 74 77 81 84 86 88 90 91 92 92 92 91 90 88 86 84 81 78
1639G8llllllkkkkjkjjj%jj%j%%j%%%%%j%%%%%%%j%%%%%%%%%%%%%j%%%%%%%%%%%%%%%%%%J
$$ 78 75 72 69 66 63 60 58 56 54 52 51 49 48 47 46 46 45 44 44 43 43 43 42 42 42 42 42 42 41 41 41 41 41 41 41 41 40 40 40 40 40 40 40 40 40 40 40 40 40 40 39 39 39 39 39 39 39 39 39 39 39 39 39 39 39 39 39 39 39 40
1631D0%%%j%%J%%%%%%J%%%%%J%%%J%%%%%Jj%%%%%j%j%%j%%%%j%%%%%%%%%%%%%%j%J%%%%%%
$$ 40 40 40 40 39 39 39 40 40 40 40 40 40 40 41 41 41 41 41 41 42 42 42 42 43 43 43 43 43 43 44 43 43 43 43 43 43 42 42 41 41 41 40 40 40 40 40 39 39 39 39 39 39 39 39 39 39 39 39 39 39 39 38 38 39 39 39 39 39 39 39
1624C9%%J%%%%%%%%J%%%J%%J%J%J%J%%J%%%%%%%j%%j%j%j%j%%j%%j%%%%%%%%%%%%%j%Jj%%
$$ 39 39 39 40 40 40 40 40 40 40 40 40 41 41 41 41 42 42 42 43 43 44 44 45 45 46 46 46 47 47 47 47 47 47 47 47 46 46 46 45 45 44 44 43 43 42 42 42 41 41 41 40 40 40 40 40 40 40 40 40 40 40 40 40 40 39 39 40 39 39 39
1616C9%J%%j%%%%%%%J%%%%%%%J%%J%%J%%%J%%%%j%%%j%%%j%%%j%%%%j%%%%%%%%%%%%%%%%%
$$ 39 39 40 40 40 39 39 39 39 39 39 39 39 40 40 40 40 40 40 40 40 41 41 41 42 42 42 43 43 43 43 44 44 44 44 44 43 43 43 43 42 42 42 42 41 41 41 41 40 40 40 40 40 39 39 39 39 39 39 39 39 39 39 39 39 39 39 39 39 39 39
1609C9%%%%%%%%%%%%%%%%%%%%%%%%%%%%%%%%%%%%%%%%%%j%%%J%%%%%j%%%%J%%%j%%%%%%%%
$$ 39 39 39 39 39 39 39 39 39 39 39 39 39 39 39 39 39 39 39 39 39 39 39 39 39 39 39 39 39 39 39 39 39 39 39 39 39 39 39 39 39 39 39 38 38 38 38 39 39 39 39 39 39 38 38 38 38 38 39 39 39 39 38 38 38 38 38 38 38 38 38
1602C8%%%%J%%%%%%%%%%j%%%J%%%%%%%%%%%%%j%%%J%%%%%%j%%%%J%%j%%%%%%%%%Jj%%%%%%
$$ 38 38 38 38 38 39 39 39 39 39 39 39 39 39 39 39 38 38 38 38 39 39 39 39 39 39 39 39 39 39 39 39 39 39 38 38 38 38 39 39 39 39 39 39 39 38 38 38 38 38 39 39 39 38 38 38 38 38 38 38 38 38 38 39 38 38 38 38 38 38 38
1594C8%%%%%%%%%%%%%%%%%%%%%%%%%%%%%%%%%%%%%%%%Jj%%%%%%%%%%%%%%%%%%Jj%%%%%%%%
$$ 38 38 38 38 38 38 38 38 38 38 38 38 38 38 38 38 38 38 38 38 38 38 38 38 38 38 38 38 38 38 38 38 38 38 38 38 38 38 38 38 38 39 38 38 38 38 38 38 38 38 38 38 38 38 38 38 38 38 38 38 38 39 38 38 38 38 38 38 38 38 38
1587C8%%%%%%%%%%%%%%%%%%%%%%%%%%%%%%%%%%%%%%%%%%%%%%%%%%%%%%%%%%%%%%%%%%%%%%
$$ 38 38 38 38 38 38 38 38 38 38 38 38 38 38 38 38 38 38 38 38 38 38 38 38 38 38 38 38 38 38 38 38 38 38 38 38 38 38 38 38 38 38 38 38 38 38 38 38 38 38 38 38 38 38 38 38 38 38 38 38 38 38 38 38 38 38 38 38 38 38 38
1579C8%%%%%%%%%%%%%%%%%%%%%%J%j%%%%%J%%%%%%%%%%%%%%%%%J%j%%%%%%%%%%%%%%%%%%%
$$ 38 38 38 38 38 38 38 38 38 38 38 38 38 38 38 38 38 38 38 38 38 38 38 39 39 38 38 38 38 38 38 39 39 39 39 39 39 39 39 39 39 39 39 39 39 39 39 39 39 40 40 39 39 39 39 39 39 39 39 39 39 39 39 39 39 39 39 39 39 39 39
1572C9%%%%%%%%%%%%%j%%%%%%%%%%%%%%%%%%%%%%%%%%%%%%%%%%%%%%%%%%%%%%%%%%%%%%%%
$$ 39 39 39 39 39 39 39 39 39 39 39 39 39 39 38 38 38 38 38 38 38 38 38 38 38 38 38 38 38 38 38 38 38 38 38 38 38 38 38 38 38 38 38 38 38 38 38 38 38 38 38 38 38 38 38 38 38 38 38 38 38 38 38 38 38 38 38 38 38 38 38
1565C8%%%%%%%%%%%%%%%%%%%%%%%%%%%%%%%%%%%%%%%%%%%%%%%%%%%%%%%%%%%%%%%%%%%%%%
$$ 38 38 38 38 38 38 38 38 38 38 38 38 38 38 38 38 38 38 38 38 38 38 38 38 38 38 38 38 38 38 38 38 38 38 38 38 38 38 38 38 38 38 38 38 38 38 38 38 38 38 38 38 38 38 38 38 38 38 38 38 38 38 38 38 38 38 38 38 38 38 38
1557C8%%%%%%%%%%%%%%%%%%%%%%%%%%%%%%%%%%%%%%%%%%%%%%J%%%%j%%J%%j%%%%%%%%%%%%
$$ 38 38 38 38 38 38 38 38 38 38 38 38 38 38 38 38 38 38 38 38 38 38 38 38 38 38 38 38 38 38 38 38 38 38 38 38 38 38 38 38 38 38 38 38 38 38 38 39 39 39 39 39 38 38 38 39 39 39 38 38 38 38 38 38 38 38 38 38 38 38 38
1550C8%%%%%J%%%%%%%%%%%%%%%%%%%%%%%%%jJ%%%j%%%%%%%%%%%%J%%%%j%%%%J%%%%%%%%%%
$$ 38 38 38 38 38 38 39 39 39 39 39 39 39 39 39 39 39 39 39 39 39 39 39 39 39 39 39 39 39 39 39 39 38 39 39 39 39 38 38 38 38 38 38 38 38 38 38 38 38 38 39 39 39 39 39 38 38 38 38 38 39 39 39 39 39 39 39 39 39 39 39
1542C9%%%%%%%%%%%%j%J%%%%jJ%%%%%%%%%%%%%%%%%%%%%%%%%%%jJ%%%j%%%J%%%%%%%%j%%%
$$ 39 39 39 39 39 39 39 39 39 39 39 39 39 38 38 39 39 39 39 39 38 39 39 39 39 39 39 39 39 39 39 39 39 39 39 39 39 39 39 39 39 39 39 39 39 39 39 39 39 38 39 39 39 39 38 38 38 38 39 39 39 39 39 39 39 39 39 38 38 38 38
1535C8%%%J%%%%%%%j%%%%%%%J%%%%%%%%%%%%%%%%%%%%%%j%%%%J%%%%%j%%Jj%%%%%%J%%%%%
$$ 38 38 38 38 39 39 39 39 39 39 39 39 38 38 38 38 38 38 38 38 39 39 39 39 39 39 39 39 39 39 39 39 39 39 39 39 39 39 39 39 39 39 39 38 38 38 38 38 39 39 39 39 39 39 38 38 38 39 38 38 38 38 38 38 38 39 39 39 39 39 39
1527C9%%j%%J%%%%%%%%%%%%%%%%%%J%%%J%%%J%%J%%J%%%%%%j%%j%j%%j%%%%j%%%%%%%%%%%
$$ 39 39 39 38 38 38 39 39 39 39 39 39 39 39 39 39 39 39 39 39 39 39 39 39 39 40 40 40 40 41 41 41 41 42 42 42 43 43 43 44 44 44 44 44 44 44 43 43 43 42 42 41 41 41 40 40 40 40 40 39 39 39 39 39 39 39 39 39 39 39 39
1520C9%%%%%%%%%%%%%%%%%%%%%%%%%J%%%%J%%J%%%%%%%%j%%%%j%%%%j%%%%%%%%%%%%%j%%%
$$ 39 39 39 39 39 39 39 39 39 39 39 39 39 39 39 39 39 39 39 39 39 39 39 39 39 39 40 40 40 40 40 41 41 41 42 42 42 42 42 42 42 42 42 41 41 41 41 41 40 40 40 40 40 39 39 39 39 39 39 39 39 39 39 39 39 39 39 38 38 38 38
1513C8%%%%%%%%%%%%%%%%%%%%%%%%%%%%%%%%%%%%%%j%J%%%%%%%%%%%%%%%%%J%%j%%%%%%%%
$$ 38 38 38 38 38 38 38 38 38 38 38 38 38 38 38 38 38 38 38 38 38 38 38 38 38 38 38 38 38 38 38 38 38 38 38 38 38 38 38 37 37 38 38 38 38 38 38 38 38 38 38 38 38 38 38 38 38 38 38 39 39 39 38 38 38 38 38 38 38 38 38
1505C8%%%%%%%%jJ%%jJ%%%%%%%%%%%%%%%%%%%%%%%%%%%%%%%%%%%%%%j%J%%%%%%%%%%%%%%%
$$ 38 38 38 38 38 38 38 38 38 37 38 38 38 37 38 38 38 38 38 38 38 38 38 38 38 38 38 38 38 38 38 38 38 38 38 38 38 38 38 38 38 38 38 38 38 38 38 38 38 38 38 38 38 37 37 38 38 38 38 38 38 38 38 38 38 38 38 38 38 38 38
1498C8%%%%%%jJ%%%%j%%J%%%%%%%%%%%%%%j%%J%j%J%%%%%%%%%%%%%%%%%%%J%%j%%J%%%%%%
$$ 38 38 38 38 38 38 38 37 38 38 38 38 38 37 37 37 38 38 38 38 38 38 38 38 38 38 38 38 38 38 38 37 37 37 38 38 37 37 38 38 38 38 38 38 38 38 38 38 38 38 38 38 38 38 38 38 38 38 39 39 39 38 38 38 39 39 39 39 39 39 39
1490C9%%%%%%%%%%%%%%%%%%%%%%%j%%%%%%%%%%%%%%%%%%%%%%%%%%%%%%%%j%%%%%%%%%JjJ%
$$ 39 39 39 39 39 39 39 39 39 39 39 39 39 39 39 39 39 39 39 39 39 39 39 39 38 38 38 38 38 38 38 38 38 38 38 38 38 38 38 38 38 38 38 38 38 38 38 38 38 38 38 38 38 38 38 38 38 37 37 37 37 37 37 37 37 37 37 38 37 38 38
1483C8%%jJ%%%%%%%%j%%J%j%%%%%%%%%J%%j%%%%%%%%%%%%%%%%J%j%%J%j%%%%J%%%j%J%%%%
$$ 38 38 38 37 38 38 38 38 38 38 38 38 38 37 37 37 38 38 37 37 37 37 37 37 37 37 37 37 38 38 38 37 37 37 37 37 37 37 37 37 37 37 37 37 37 37 37 37 38 38 37 37 37 38 38 37 37 37 37 37 38 38 38 38 37 37 38 38 38 38 38
1476C8%j%%%%J%%%%%%%%j%%%%%%%%%J%%%%%%%%j%%J%%%%%%%%%%%%%%%%%j%J%%%%j%%%%%%%
$$ 38 38 37 37 37 37 37 38 38 38 38 38 38 38 38 38 37 37 37 37 37 37 37 37 37 37 38 38 38 38 38 38 38 38 38 37 37 37 38 38 38 38 38 38 38 38 38 38 38 38 38 38 38 38 38 38 37 37 38 38 38 38 38 37 37 37 37 37 37 37 37
1468C7%%%%%%%%J%%%%%%j%%%%%%%%%%Jj%%%Jj%%%Jj%%%%J%j%%%%%%%%%%%%%%%%%%%%%%%%%
$$ 37 37 37 37 37 37 37 37 37 38 38 38 38 38 38 38 37 37 37 37 37 37 37 37 37 37 37 38 37 37 37 37 38 37 37 37 37 38 37 37 37 37 37 38 38 37 37 37 37 37 37 37 37 37 37 37 37 37 37 37 37 37 37 37 37 37 37 37 37 37 37
1461C7%%%%%%%%%%%%%%%Jj%%%%%%%%%%%%%%%%%%%J%j%%%%%%%%J%%%%j%%%%%%%%%%%%%%%%%
$$ 37 37 37 37 37 37 37 37 37 37 37 37 37 37 37 37 38 37 37 37 37 37 37 37 37 37 37 37 37 37 37 37 37 37 37 37 37 38 38 37 37 37 37 37 37 37 37 37 38 38 38 38 38 37 37 37 37 37 37 37 37 37 37 37 37 37 37 37 37 37 37
1453C7%J%%%%%%%j%%%%%%%%%%%%%%%%%%%%%%%%%%%%%%%%%J%%%j%%%%%%%%%%%%%%%%%%%%%%
$$ 37 37 38 38 38 38 38 38 38 38 37 37 37 37 37 37 37 37 37 37 37 37 37 37 37 37 37 37 37 37 37 37 37 37 37 37 37 37 37 37 37 37 37 37 38 38 38 38 37 37 37 37 37 37 37 37 37 37 37 37 37 37 37 37 37 37 37 37 37 37 37
1446C7Jj%%%%J%j%%%%%J%%%%%%%j%%%J%%%%%%%%%%%%%%%%%J%%%%%J%J%JJJJ%JJJ%%J%j%jj
$$ 37 38 37 37 37 37 37 38 38 37 37 37 37 37 37 38 38 38 38 38 38 38 38 37 37 37 37 38 38 38 38 38 38 38 38 38 38 38 38 38 38 38 38 38 38 39 39 39 39 39 39 40 40 41 41 42 43 44 45 45 46 47 48 48 48 49 49 48 48 47 46
1438D6%jj%jjj%j%%%j%%%%%%%%%%%j%%%%J%%%%%%j%%%%%%%%%%%%%%%%%%%%%%%%%%%%%%%%%
$$ 46 46 45 44 44 43 42 41 41 40 40 40 40 39 39 39 39 39 39 39 39 39 39 39 39 38 38 38 38 38 39 39 39 39 39 39 39 38 38 38 38 38 38 38 38 38 38 38 38 38 38 38 38 38 38 38 38 38 38 38 38 38 38 38 38 38 38 38 38 38 38
1431C8%%%%%J%%%%%%%%%%%J%%%%%%%%%%%%%%%%%%%j%%%%%%j%%%%%%%%%%%%%%%%%%%%%%%%%
$$ 38 38 38 38 38 38 39 39 39 39 39 39 39 39 39 39 39 39 40 40 40 40 40 40 40 40 40 40 40 40 40 40 40 40 40 40 40 40 39 39 39 39 39 39 39 38 38 38 38 38 38 38 38 38 38 38 38 38 38 38 38 38 38 38 38 38 38 38 38 38 38
1424C8%%%%%%%%%%%%J%%%%%%%%j%%%%%%Jj%%%%%%%%%%%%%%%%%%%%%%%%%%%%%%%%%%%%%%%%
$$ 38 38 38 38 38 38 38 38 38 38 38 38 38 39 39 39 39 39 39 39 39 39 38 38 38 38 38 38 38 39 38 38 38 38 38 38 38 38 38 38 38 38 38 38 38 38 38 38 38 38 38 38 38 38 38 38 38 38 38 38 38 38 38 38 38 38 38 38 38 38 38
1416C8%%%%%%%%%J%%%%j%%%%J%%%%j%%%%%%%%%%%%%%%%%%%%%%%%%%%%%%%%%%%%%%%%%%%%%
$$ 38 38 38 38 38 38 38 38 38 38 39 39 39 39 39 38 38 38 38 38 39 39 39 39 39 38 38 38 38 38 38 38 38 38 38 38 38 38 38 38 38 38 38 38 38 38 38 38 38 38 38 38 38 38 38 38 38 38 38 38 38 38 38 38 38 38 38 38 38 38 38
1409C8%%%%%%%%%%%%%%%%%%%%%%%%%%%%%%%%%%%%%%%%%%%%%%%%%%%%%%%%J%%j%JjJ%%%%%j
$$ 38 38 38 38 38 38 38 38 38 38 38 38 38 38 38 38 38 38 38 38 38 38 38 38 38 38 38 38 38 38 38 38 38 38 38 38 38 38 38 38 38 38 38 38 38 38 38 38 38 38 38 38 38 38 38 38 38 39 39 39 38 38 39 38 39 39 39 39 39 39 38
1401C8%%%%%%%%%%%%%%%%%%%%%%%%%%%%%%%%%%%%%%%%%%%%%%%%%%%%%%%%%%%%%%%%%%%%%%
$$ 38 38 38 38 38 38 38 38 38 38 38 38 38 38 38 38 38 38 38 38 38 38 38 38 38 38 38 38 38 38 38 38 38 38 38 38 38 38 38 38 38 38 38 38 38 38 38 38 38 38 38 38 38 38 38 38 38 38 38 38 38 38 38 38 38 38 38 38 38 38 38
1394C8%%%%%%%%%%%%%%%%%%%%%%%%%%%%%%%%%%%%%%%%%%%%%%%%%%%%%%%%%%%%%%%%%%%%%%
$$ 38 38 38 38 38 38 38 38 38 38 38 38 38 38 38 38 38 38 38 38 38 38 38 38 38 38 38 38 38 38 38 38 38 38 38 38 38 38 38 38 38 38 38 38 38 38 38 38 38 38 38 38 38 38 38 38 38 38 38 38 38 38 38 38 38 38 38 38 38 38 38
1387C8%%%%%%%jJ%%%%%%%%%%%%j%%%%%J%%%%%%%%%%%%%%%%%%%j%J%%%%%%%%%%%%%%%%%%%%
$$ 38 38 38 38 38 38 38 38 37 38 38 38 38 38 38 38 38 38 38 38 38 38 37 37 37 37 37 37 38 38 38 38 38 38 38 38 38 38 38 38 38 38 38 38 38 38 38 38 37 37 38 38 38 38 38 38 38 38 38 38 38 38 38 38 38 38 38 38 38 38 38
1379C8%%%%%%%%%%%%%%%%%%%%%%%%%%%j%%JjJ%%%%%%%%%%%%%%%%%%%%%%%%%%%%%%%%%jJ%%
$$ 38 38 38 38 38 38 38 38 38 38 38 38 38 38 38 38 38 38 38 38 38 38 38 38 38 38 38 38 37 37 37 38 37 38 38 38 38 38 38 38 38 38 38 38 38 38 38 38 38 38 38 38 38 38 38 38 38 38 38 38 38 38 38 38 38 38 38 37 38 38 38
1372C8%%%%%%%%%%%%%%%%%%%j%%%%J%%%%%%%%jJ%%%%%%%%%%%jJ%%%%%%%%%%%%%%%%%%%%%%
$$ 38 38 38 38 38 38 38 38 38 38 38 38 38 38 38 38 38 38 38 38 37 37 37 37 37 38 38 38 38 38 38 38 38 38 37 38 38 38 38 38 38 38 38 38 38 38 38 37 38 38 38 38 38 38 38 38 38 38 38 38 38 38 38 38 38 38 38 38 38 38 38
1364C8%%%%%%%%%%%%%%%%%%%%%%%%%%%j%%%%%%%%%%%J%%%%j%J%%%%%%%%%j%%%J%%%%%j%%%
$$ 38 38 38 38 38 38 38 38 38 38 38 38 38 38 38 38 38 38 38 38 38 38 38 38 38 38 38 38 37 37 37 37 37 37 37 37 37 37 37 37 38 38 38 38 38 37 37 38 38 38 38 38 38 38 38 38 38 37 37 37 37 38 38 38 38 38 38 37 37 37 37
1357C7%J%%jJ%%%%%%%%%%%%%%%%%%%%%%%%%%j%%%%%%%%%%%%%%%%%%%%%J%%jJ%%%%%%%%%%%
$$ 37 37 38 38 38 37 38 38 38 38 38 38 38 38 38 38 38 38 38 38 38 38 38 38 38 38 38 38 38 38 38 38 38 37 37 37 37 37 37 37 37 37 37 37 37 37 37 37 37 37 37 37 37 37 37 38 38 38 37 38 38 38 38 38 38 38 38 38 38 38 38
1349C8%%%%j%%%%J%%%%%%%%%%j%J%%%%%%%%%%%%%%%%%j%%%%%%%J%%%%%%j%%%%%%%%%%%%%%
$$ 38 38 38 38 38 37 37 37 37 37 38 38 38 38 38 38 38 38 38 38 38 37 37 38 38 38 38 38 38 38 38 38 38 38 38 38 38 38 38 38 38 37 37 37 37 37 37 37 37 38 38 38 38 38 38 38 37 37 37 37 37 37 37 37 37 37 37 37 37 37 37
1342C7%%%%%%%%J%%%%%%%%%%%%%%%jJ%%%%%%%j%%J%%%%%%%%%%%j%%%J%%%j%J%%%%%%%%%%%
$$ 37 37 37 37 37 37 37 37 37 38 38 38 38 38 38 38 38 38 38 38 38 38 38 38 38 37 38 38 38 38 38 38 38 38 37 37 37 38 38 38 38 38 38 38 38 38 38 38 38 37 37 37 37 38 38 38 38 37 37 38 38 38 38 38 38 38 38 38 38 38 38
1335C8%%%j%J%%%%%%%%%%j%%%%%J%%%jJ%%%%%%%%j%%%%%J%%%%%%%%%%%%%%%%%%%%%%%%%%%
$$ 38 38 38 38 37 37 38 38 38 38 38 38 38 38 38 38 38 37 37 37 37 37 37 38 38 38 38 37 38 38 38 38 38 38 38 38 38 37 37 37 37 37 37 38 38 38 38 38 38 38 38 38 38 38 38 38 38 38 38 38 38 38 38 38 38 38 38 38 38 38 38
1327C8%%%%%%%%%j%%%%J%%j%%%%%%%J%%%j%%%%%%%%%%%%%%%%%%%%%%%%%%%J%%j%%%%%J%%%
$$ 38 38 38 38 38 38 38 38 38 38 37 37 37 37 37 38 38 38 37 37 37 37 37 37 37 37 38 38 38 38 37 37 37 37 37 37 37 37 37 37 37 37 37 37 37 37 37 37 37 37 37 37 37 37 37 37 37 37 38 38 38 37 37 37 37 37 37 38 38 38 38
1320C8%j%%%%%%%%J%%%%%%%%j%%%J%jJj%%%%%%%%%%%%%%%J%%%%%jJ%%%%%%%%%%%%%%%%%%%
$$ 38 38 37 37 37 37 37 37 37 37 37 38 38 38 38 38 38 38 38 38 37 37 37 37 38 38 37 38 37 37 37 37 37 37 37 37 37 37 37 37 37 37 37 37 38 38 38 38 38 38 37 38 38 38 38 38 38 38 38 38 38 38 38 38 38 38 38 38 38 38 38
1312C8%%%%%%%%%%%%%%%%%%%%%%%%%%%%%%%%%%%%%%%%%%%%%%%%%%%%%%%%%%%%%%%%%%%%%%
$$ 38 38 38 38 38 38 38 38 38 38 38 38 38 38 38 38 38 38 38 38 38 38 38 38 38 38 38 38 38 38 38 38 38 38 38 38 38 38 38 38 38 38 38 38 38 38 38 38 38 38 38 38 38 38 38 38 38 38 38 38 38 38 38 38 38 38 38 38 38 38 38
1305C8%%%%%%%%%j%%J%%%%%%%%%%j%%J%%%%%%%%%%%%%%%%%%%%%%%%%%%%%%%%%%%%%%%%%%%
$$ 38 38 38 38 38 38 38 38 38 38 37 37 37 38 38 38 38 38 38 38 38 38 38 38 37 37 37 38 38 38 38 38 38 38 38 38 38 38 38 38 38 38 38 38 38 38 38 38 38 38 38 38 38 38 38 38 38 38 38 38 38 38 38 38 38 38 38 38 38 38 38
1298C8%%%%%%%%%%%%%%%%%%%%%%%%%%%%%%%%%%%%%%%%%%%%%%%%%%%%%%%%%%%%%%%%%%%%%%
$$ 38 38 38 38 38 38 38 38 38 38 38 38 38 38 38 38 38 38 38 38 38 38 38 38 38 38 38 38 38 38 38 38 38 38 38 38 38 38 38 38 38 38 38 38 38 38 38 38 38 38 38 38 38 38 38 38 38 38 38 38 38 38 38 38 38 38 38 38 38 38 38
1290C8%%%%%%%%%%%%%%%%%%%%%%%%%%%%%%%%%%%%%%%jJ%%%%%%%%%%%%%%%%%%%%%%%%%%%%%
$$ 38 38 38 38 38 38 38 38 38 38 38 38 38 38 38 38 38 38 38 38 38 38 38 38 38 38 38 38 38 38 38 38 38 38 38 38 38 38 38 38 37 38 38 38 38 38 38 38 38 38 38 38 38 38 38 38 38 38 38 38 38 38 38 38 38 38 38 38 38 38 38
1283C8%%%%%%jJ%%%%%%%%%%%%jJ%%%%%%%%%%%%%%%%%%%%%%%%%%%%%%%%%%%j%J%%%%%%%%%%
$$ 38 38 38 38 38 38 38 37 38 38 38 38 38 38 38 38 38 38 38 38 38 37 38 38 38 38 38 38 38 38 38 38 38 38 38 38 38 38 38 38 38 38 38 38 38 38 38 38 38 38 38 38 38 38 38 38 38 38 37 37 38 38 38 38 38 38 38 38 38 38 38
1275C8%%%%%%%%%%%%%%%%%%%%%%%%%%%%%%%%%%%%%%%%%%%%%%%%%%%%%%%%%%%%%%%%%%%%%%
$$ 38 38 38 38 38 38 38 38 38 38 38 38 38 38 38 38 38 38 38 38 38 38 38 38 38 38 38 38 38 38 38 38 38 38 38 38 38 38 38 38 38 38 38 38 38 38 38 38 38 38 38 38 38 38 38 38 38 38 38 38 38 38 38 38 38 38 38 38 38 38 38
1268C8%%%%%%%%%%%%%%%%%%%%%%%%%%%%%%%%%%%%%%%%%%%%%%%%%%%%%%%%%%%%%%%%%%%%%%
$$ 38 38 38 38 38 38 38 38 38 38 38 38 38 38 38 38 38 38 38 38 38 38 38 38 38 38 38 38 38 38 38 38 38 38 38 38 38 38 38 38 38 38 38 38 38 38 38 38 38 38 38 38 38 38 38 38 38 38 38 38 38 38 38 38 38 38 38 38 38 38 38
1260C8%%%%%%%%%%%%%%%%%%%%%%%%%%%%%%%%%%%%%%%%%%%%%%%%%%%J%%j%%%%%%%%%Jj%%%%
$$ 38 38 38 38 38 38 38 38 38 38 38 38 38 38 38 38 38 38 38 38 38 38 38 38 38 38 38 38 38 38 38 38 38 38 38 38 38 38 38 38 38 38 38 38 38 38 38 38 38 38 38 38 39 39 39 38 38 38 38 38 38 38 38 38 38 39 38 38 38 38 38
1253C8%%%%%%%%%%J%%%%%%%%%%%%%%%%%%%%jJ%%%%%%%%%%%%%%%%%%%%%%%%%%%%%%%%%%%%J
$$ 38 38 38 38 38 38 38 38 38 38 38 39 39 39 39 39 39 39 39 39 39 39 39 39 39 39 39 39 39 39 39 39 38 39 39 39 39 39 39 39 39 39 39 39 39 39 39 39 39 39 39 39 39 39 39 39 39 39 39 39 39 39 39 39 39 39 39 39 39 39 40
1246D0j%J%%%%%%%%%%%%%%%%J%%%%%%%%%%%%J%%%%%%%%%%%%%%%%%%%%%%%%%%%%%%%%%%%%%
$$ 40 39 39 40 40 40 40 40 40 40 40 40 40 40 40 40 40 40 40 40 41 41 41 41 41 41 41 41 41 41 41 41 41 42 42 42 42 42 42 42 42 42 42 42 42 42 42 42 42 42 42 42 42 42 42 42 42 42 42 42 42 42 42 42 42 42 42 42 42 42 42
1238D2%%%%%%%%%%%%%%%%%%%%%J%%j%%%%J%%%%%%%%%%%%%%%%%%%%%%J%%%%%%%%%%%%%%%%%
$$ 42 42 42 42 42 42 42 42 42 42 42 42 42 42 42 42 42 42 42 42 42 42 43 43 43 42 42 42 42 42 43 43 43 43 43 43 43 43 43 43 43 43 43 43 43 43 43 43 43 43 43 43 43 44 44 44 44 44 44 44 44 44 44 44 44 44 44 44 44 44 44
1231D4%%%%%%%%%%%%%%%%J%%%j%J%%%%%%%%%%%%%%%%%%%%J%%%%%%%%%%%%J%%%%%%%%%%%%%
$$ 44 44 44 44 44 44 44 44 44 44 44 44 44 44 44 44 44 45 45 45 45 44 44 45 45 45 45 45 45 45 45 45 45 45 45 45 45 45 45 45 45 45 45 45 46 46 46 46 46 46 46 46 46 46 46 46 46 47 47 47 47 47 47 47 47 47 47 47 47 47 47
1223D7J%%%%%%%%%J%%%%%%%%%%%%%J%%%%%%J%%%%%%J%%%%J%%%%J%%%%%%%J%%%J%%%J%%J%%
$$ 47 48 48 48 48 48 48 48 48 48 48 49 49 49 49 49 49 49 49 49 49 49 49 49 49 50 50 50 50 50 50 50 51 51 51 51 51 51 51 52 52 52 52 52 53 53 53 53 53 54 54 54 54 54 54 54 54 55 55 55 55 56 56 56 56 57 57 57 58 58 58
1216E8%%J%%J%%J%%%%J%J%%J%%J%J%J%%J%J%J%J%J%J%JJ%J%JJJ%J%JJ%JJ%JJJJ%JJJ%JJ%J
$$ 58 58 58 59 59 59 60 60 60 61 61 61 61 61 62 62 63 63 63 64 64 64 65 65 66 66 67 67 67 68 68 69 69 70 70 71 71 72 72 73 73 74 75 75 76 76 77 78 79 79 80 80 81 82 82 83 84 84 85 86 87 88 88 89 90 91 91 92 93 93 94
1209I4JJ%JJJ%JJ%JJJJJJJJ%JJJKJJJKJJKJJKJKKKKKJKLKKLKLKLLLLLLMLMMMMMMMNNNNNNO
$$ 94 95 96 96 97 98 99 99 100 101 101 102 103 104 105 106 107 108 109 109 110 111 112 114 115 116 117 119 120 121 123 124 125 127 128 130 132 134 136 138 139 141 144 146 148 151 153 156 158 161 164 167 170 173 176 180 183 187 191 195 199 203 207 211 216 221 226 231 236 241 247
1201B47OOOPPPPQQQQRRJ0J0J0J0J1J1J2J2J2J3J3J4J4J5J5J5J6J6J6J7J7J7J7J8J8J8J8J7
$$ 247 253 259 265 272 279 286 293 301 309 317 325 334 343 353 363 373 383 394 405 417 429 441 454 467 481 495 510 525 540 556 572 588 605 622 639 656 674 692 710 728 745
1197G45J8J7J8J6J7J6J5J4J4J2J2J0J0QPOMLJ%jkmopqqj0j2j2j3j4j4j5j6j5j7j7j6j7j7j7
$$ 745 763 780 798 814 831 847 862 876 890 902 914 924 934 942 949 955 959 962 963 963 962 960 956 950 943 935 927 917 905 893 880 866 852 837 821 806 789 772 756 739 722 705
1192G05j7j7j6j7j6j6j6j5j5j5j4j4j3j4j2j3j2j1j2j1j0j0j1rrrqrqpqpppooooonnonmnm
$$ 705 688 671 655 638 622 606 590 575 560 545 531 517 504 490 478 465 453 442 430 419 409 399 388 379 370 361 353 344 336 329 321 314 307 300 294 288 282 276 270 265 260 254 249 245 240 236
1187B36nmmmmmllmllllmkllkllklkklkkkkkkkkkkkjkkkjkjkjkjkjkjjjkjjkj%jjjjjj%jjj
$$ 236 231 227 223 219 215 211 208 205 201 198 195 192 189 185 183 180 177 175 172 169 167 164 162 160 157 155 153 151 149 147 145 143 141 139 137 135 134 132 130 128 127 125 124 122 121 119 118 116 115 113 112 111 110 108 107 106 104 103 103 102 101 100 99 98 97 97 96 95 94
1180I4j%j%jj%j%j%%j%j%j%%%j%%j%j%%j%%j%%%%j%j%%%j%%j%%j%%j%%%j%%%j%%%%j%j%j%
$$ 94 93 93 92 92 91 90 90 89 89 88 88 88 87 87 86 86 85 85 85 85 84 84 84 83 83 82 82 82 81 81 81 80 80 80 80 80 79 79 78 78 78 78 77 77 77 76 76 76 75 75 75 74 74 74 74 73 73 73 73 72 72 72 72 72 71 71 70 70 69 69
1173F9%%%%%j%%%%j%%%%%j%%%j%%%%%%%j%%%%j%%%%%%%%j%%%%%%%%%j%%%%%%%%%%j%%%%%j
$$ 69 69 69 69 69 69 68 68 68 68 68 67 67 67 67 67 67 66 66 66 66 65 65 65 65 65 65 65 65 64 64 64 64 64 63 63 63 63 63 63 63 63 63 62 62 62 62 62 62 62 62 62 62 61 61 61 61 61 61 61 61 61 61 61 60 60 60 60 60 60 59
1165E9%%%%j%%%%%j%%j%%%%%%%%%%%j%%%Jj%%%%%j%%%%%%%%j%%%%%%%%%%%j%%%%%%%%%%%%
$$ 59 59 59 59 59 58 58 58 58 58 58 57 57 57 56 56 56 56 56 56 56 56 56 56 56 56 55 55 55 55 56 55 55 55 55 55 55 54 54 54 54 54 54 54 54 54 53 53 53 53 53 53 53 53 53 53 53 53 52 52 52 52 52 52 52 52 52 52 52 52 52
1158E2%%%j%%%%%%%%%%%%%%j%%%%%%%%%%%%%%%%%%j%%%%%%%%%%%%%j%%%%%%%%%%%%%%%%%%
$$ 52 52 52 52 51 51 51 51 51 51 51 51 51 51 51 51 51 51 51 50 50 50 50 50 50 50 50 50 50 50 50 50 50 50 50 50 50 50 49 49 49 49 49 49 49 49 49 49 49 49 49 49 48 48 48 48 48 48 48 48 48 48 48 48 48 48 48 48 48 48 48
1150D8Jj%%%%%%%%%%%%j%%%%J%j%%%%%%%%%%%%J%%%%%%j%J%%%%%%%%%J%%%%%%%%%%%%J%%%
$$ 48 49 48 48 48 48 48 48 48 48 48 48 48 48 48 47 47 47 47 47 48 48 47 47 47 47 47 47 47 47 47 47 47 47 47 48 48 48 48 48 48 48 47 47 48 48 48 48 48 48 48 48 48 48 49 49 49 49 49 49 49 49 49 49 49 49 49 50 50 50 50
1143E0%%%%%%%%%%%%%%%%%%%%j%%Jj%%%%%%%%%%%j%%%%%J%%%%%%%%j%J%%J%%%%%%%%%%%J%
$$ 50 50 50 50 50 50 50 50 50 50 50 50 50 50 50 50 50 50 50 50 50 49 49 49 50 49 49 49 49 49 49 49 49 49 49 49 49 48 48 48 48 48 48 49 49 49 49 49 49 49 49 49 48 48 49 49 49 50 50 50 50 50 50 50 50 50 50 50 50 51 51
1136E1%J%%%%%%%%%%j%%%%j%%%%%%%%%j%%%%%%%%j%%%%%%%%%%%%%%%%%%%%%%%%J%%%%%%%%
$$ 51 51 52 52 52 52 52 52 52 52 52 52 52 51 51 51 51 51 50 50 50 50 50 50 50 50 50 50 49 49 49 49 49 49 49 49 49 48 48 48 48 48 48 48 48 48 48 48 48 48 48 48 48 48 48 48 48 48 48 48 48 48 49 49 49 49 49 49 49 49 49
1128D9%%%%%%%%%%%%%%%j%%%%%%j%%%%%%%%jJ%j%%%%%%%%%%%%%%%%%%%%%j%%%%%%%J%%%%%
$$ 49 49 49 49 49 49 49 49 49 49 49 49 49 49 49 49 48 48 48 48 48 48 48 47 47 47 47 47 47 47 47 47 46 47 47 46 46 46 46 46 46 46 46 46 46 46 46 46 46 46 46 46 46 46 46 46 46 45 45 45 45 45 45 45 45 46 46 46 46 46 46
1121D6%%%%%%%%%%%%%%%%%%%%%%%%j%%Jj%%J%j%%%%%%%%%%%%%%%Jj%%%%%%%%%%%%%%%%%%%
$$ 46 46 46 46 46 46 46 46 46 46 46 46 46 46 46 46 46 46 46 46 46 46 46 46 46 45 45 45 46 45 45 45 46 46 45 45 45 45 45 45 45 45 45 45 45 45 45 45 45 45 46 45 45 45 45 45 45 45 45 45 45 45 45 45 45 45 45 45 45 45 45
1113D5%%%%%%%%J%j%%%J%%%%%%%%%%%%%%%%%%%%%%%%%%%%J%%%%j%%%%%%%%%%%%%%%%%%%%%
$$ 45 45 45 45 45 45 45 45 45 46 46 45 45 45 45 46 46 46 46 46 46 46 46 46 46 46 46 46 46 46 46 46 46 46 46 46 46 46 46 46 46 46 46 46 47 47 47 47 47 46 46 46 46 46 46 46 46 46 46 46 46 46 46 46 46 46 46 46 46 46 46
1106D6%J%%%%%%%%%%%%%%%%%%%%%%%%%%%%%%%%%%%%%%%%%%%%%%%%%%%%%%%%%%%%%%%%%%%%
$$ 46 46 47 47 47 47 47 47 47 47 47 47 47 47 47 47 47 47 47 47 47 47 47 47 47 47 47 47 47 47 47 47 47 47 47 47 47 47 47 47 47 47 47 47 47 47 47 47 47 47 47 47 47 47 47 47 47 47 47 47 47 47 47 47 47 47 47 47 47 47 47
1099D7%J%%%%%%%%%%%%%%%%%%%%%%%j%%%%%%%%%%%%%%%%%%%%%%%%%%%%%%jJ%%%%%%%%%%%%
$$ 47 47 48 48 48 48 48 48 48 48 48 48 48 48 48 48 48 48 48 48 48 48 48 48 48 48 47 47 47 47 47 47 47 47 47 47 47 47 47 47 47 47 47 47 47 47 47 47 47 47 47 47 47 47 47 47 47 46 47 47 47 47 47 47 47 47 47 47 47 47 47
1091D7%%%%%%%%%%%%%%%%%%j%%%%%%%%%%%%%%%%%%%%%%%%%%%%%%%%%%%%%%%%%%%%%%%j%%%
$$ 47 47 47 47 47 47 47 47 47 47 47 47 47 47 47 47 47 47 47 46 46 46 46 46 46 46 46 46 46 46 46 46 46 46 46 46 46 46 46 46 46 46 46 46 46 46 46 46 46 46 46 46 46 46 46 46 46 46 46 46 46 46 46 46 46 46 46 45 45 45 45
1084D5%%%J%%j%%%%%%%%%%%%%%j%%%%%%%%J%%j%%%%%%%%%%%%%%%J%%%jJ%%%%%%j%%%%%%%%
$$ 45 45 45 45 46 46 46 45 45 45 45 45 45 45 45 45 45 45 45 45 45 45 44 44 44 44 44 44 44 44 44 45 45 45 44 44 44 44 44 44 44 44 44 44 44 44 44 44 44 44 45 45 45 45 44 45 45 45 45 45 45 45 44 44 44 44 44 44 44 44 44
1076D4%%%%%%%%%%%%%%%%%%%j%%%%%%%J%%%%%%%%%%%%%%%%%%%%%J%j%%%%%%%%%%%%%%%%%%
$$ 44 44 44 44 44 44 44 44 44 44 44 44 44 44 44 44 44 44 44 44 43 43 43 43 43 43 43 43 44 44 44 44 44 44 44 44 44 44 44 44 44 44 44 44 44 44 44 44 44 44 45 45 44 44 44 44 44 44 44 44 44 44 44 44 44 44 44 44 44 44 44
1069D4%%%j%%%%%%%%%%%%%J%%%%%%%%%%%%%%%%%%%%%%%%%%%%%%%%%%%%%%%%%%%j%%J%%%%%
$$ 44 44 44 44 43 43 43 43 43 43 43 43 43 43 43 43 43 43 44 44 44 44 44 44 44 44 44 44 44 44 44 44 44 44 44 44 44 44 44 44 44 44 44 44 44 44 44 44 44 44 44 44 44 44 44 44 44 44 44 44 44 44 43 43 43 44 44 44 44 44 44
1061D4%%%%%%%%%%%%%%%%%%%%%%%%%%%%%%%%J%%%%%j%%%%J%%%%%%%%%%%%%%%%%%%%%%%%%%
$$ 44 44 44 44 44 44 44 44 44 44 44 44 44 44 44 44 44 44 44 44 44 44 44 44 44 44 44 44 44 44 44 44 44 45 45 45 45 45 45 44 44 44 44 44 45 45 45 45 45 45 45 45 45 45 45 45 45 45 45 45 45 45 45 45 45 45 45 45 45 45 45
1054D5%%%%%%%%%%%%%%%%%%%%%J%%%j%%J%%%j%%%%j%%J%%%%%%%%%%%%%%%%%%%%%%%%%%%%%
$$ 45 45 45 45 45 45 45 45 45 45 45 45 45 45 45 45 45 45 45 45 45 45 46 46 46 46 45 45 45 46 46 46 46 45 45 45 45 45 44 44 44 45 45 45 45 45 45 45 45 45 45 45 45 45 45 45 45 45 45 45 45 45 45 45 45 45 45 45 45 45 45
1047D5%%%J%j%%J%%%%%%%%%%%%%%%%%%%%%%%j%%%%%%J%%%%%%%%%%%%%%%%%%%%%%%%%%j%J%
$$ 45 45 45 45 46 46 45 45 45 46 46 46 46 46 46 46 46 46 46 46 46 46 46 46 46 46 46 46 46 46 46 46 46 45 45 45 45 45 45 45 46 46 46 46 46 46 46 46 46 46 46 46 46 46 46 46 46 46 46 46 46 46 46 46 46 46 46 45 45 46 46
1039D6%%%%%%%%%%%%jJ%%%%%%%%%%%%%%%%%%%%%%%%%%%%%%%%%%%%%%J%%%%%%%J%%J%jJ%%j
$$ 46 46 46 46 46 46 46 46 46 46 46 46 46 45 46 46 46 46 46 46 46 46 46 46 46 46 46 46 46 46 46 46 46 46 46 46 46 46 46 46 46 46 46 46 46 46 46 46 46 46 46 46 46 47 47 47 47 47 47 47 47 48 48 48 49 49 48 49 49 49 48
1032D8%%%%j%%%%j%%%%%%%%%%%%%j%%%%%%%%%%%%%%%%%%%%%%%%%%%%%%%%%%%%%%%jJ%%%%%
$$ 48 48 48 48 48 47 47 47 47 47 46 46 46 46 46 46 46 46 46 46 46 46 46 46 45 45 45 45 45 45 45 45 45 45 45 45 45 45 45 45 45 45 45 45 45 45 45 45 45 45 45 45 45 45 45 45 45 45 45 45 45 45 45 45 44 45 45 45 45 45 45
1024D5%%%%%%%j%%%%%%%J%%%j%%%%%%%%%%%%%%%%%%%%%%%%%%%%%%%%%Jj%%%%%%%%%%%%%%%
$$ 45 45 45 45 45 45 45 45 44 44 44 44 44 44 44 44 45 45 45 45 44 44 44 44 44 44 44 44 44 44 44 44 44 44 44 44 44 44 44 44 44 44 44 44 44 44 44 44 44 44 44 44 44 44 45 44 44 44 44 44 44 44 44 44 44 44 44 44 44 44 44
1017D4%%%%%%j%%%J%%%%%%%%%%j%%%%%%%%%%%%%%%%%%%%%%%%%%%J%%j%%%%%%%%%%%%%%%%%
$$ 44 44 44 44 44 44 44 43 43 43 43 44 44 44 44 44 44 44 44 44 44 44 43 43 43 43 43 43 43 43 43 43 43 43 43 43 43 43 43 43 43 43 43 43 43 43 43 43 43 43 44 44 44 43 43 43 43 43 43 43 43 43 43 43 43 43 43 43 43 43 43
1010D3%%%%%%%%%%%%%%%%%%%%%%%%%%%%%%J%%%%%%%%j%%%%%%%%%%%%jJ%%%%%%%j%%J%%%jJ
$$ 43 43 43 43 43 43 43 43 43 43 43 43 43 43 43 43 43 43 43 43 43 43 43 43 43 43 43 43 43 43 43 44 44 44 44 44 44 44 44 44 43 43 43 43 43 43 43 43 43 43 43 43 43 42 43 43 43 43 43 43 43 43 42 42 42 43 43 43 43 42 43
1002D3%%%%%%%%jJ%%%%%%%J%%%%%%%%%%%%%%%%%j%%%%%%%%%%%%%%%%%%%%%%%%%%%j%%%%%%
$$ 43 43 43 43 43 43 43 43 43 42 43 43 43 43 43 43 43 43 44 44 44 44 44 44 44 44 44 44 44 44 44 44 44 44 44 44 43 43 43 43 43 43 43 43 43 43 43 43 43 43 43 43 43 43 43 43 43 43 43 43 43 43 43 43 42 42 42 42 42 42 42
995D2J%%%j%J%%%%%%%%%j%%%J%%%%%%%%%%%%%%%%%%%%%J%%%%%%%%%%%%%J%%%%J%%J%JJ%J%
$$ 42 43 43 43 43 42 42 43 43 43 43 43 43 43 43 43 43 42 42 42 42 43 43 43 43 43 43 43 43 43 43 43 43 43 43 43 43 43 43 43 43 43 43 44 44 44 44 44 44 44 44 44 44 44 44 44 44 45 45 45 45 45 46 46 46 47 47 48 49 49 50 50
987E0%%%%J%j%%%%%j%%%j%%%%j%j%Jj%%j%%%%j%%%%%%%%%%%%%%%%%%%%%%%%%J%%%%J%%J%J
$$ 50 50 50 50 50 51 51 50 50 50 50 50 50 49 49 49 49 48 48 48 48 48 47 47 46 46 47 46 46 46 45 45 45 45 45 44 44 44 44 44 44 44 44 44 44 44 44 44 44 44 44 44 44 44 44 44 44 44 44 44 44 45 45 45 45 45 46 46 46 47 47 48
980D8%%J%J%J%%%%%%J%j%%j%j%%j%j%%j%%%%j%%%%%%%%%%%%%%%%j%%%J%%%%%%%%%%J%%J%%
$$ 48 48 48 49 49 50 50 51 51 51 51 51 51 51 52 52 51 51 51 50 50 49 49 49 48 48 47 47 47 46 46 46 46 46 45 45 45 45 45 45 45 45 45 45 45 45 45 45 45 45 45 44 44 44 44 45 45 45 45 45 45 45 45 45 45 45 46 46 46 47 47 47
972D7%J%%%%J%%%%j%%%%%%j%%%%j%%%%%%%%%%j%%%%%%%%%%%%%%%%%%%%%%%%%%%%%%%%%%J%
$$ 47 47 48 48 48 48 48 49 49 49 49 49 48 48 48 48 48 48 48 47 47 47 47 47 46 46 46 46 46 46 46 46 46 46 46 45 45 45 45 45 45 45 45 45 45 45 45 45 45 45 45 45 45 45 45 45 45 45 45 45 45 45 45 45 45 45 45 45 45 45 46 46
965D6%%%%%%%%%%J%%%%%%j%%%%%%%%%%%%%%%Jj%%J%%%j%J%%%%%%%%%%%%%%%%%%%%%%%%%%%
$$ 46 46 46 46 46 46 46 46 46 46 46 47 47 47 47 47 47 47 46 46 46 46 46 46 46 46 46 46 46 46 46 46 46 46 47 46 46 46 47 47 47 47 46 46 47 47 47 47 47 47 47 47 47 47 47 47 47 47 47 47 47 47 47 47 47 47 47 47 47 47 47 47
957D7%%%%%%%%%%%%%%%%%%%%J%j%J%%%%%%%%j%%%%%%%J%%%%%%%%%%%%%j%J%%%j%Jj%%%%%%
$$ 47 47 47 47 47 47 47 47 47 47 47 47 47 47 47 47 47 47 47 47 47 48 48 47 47 48 48 48 48 48 48 48 48 48 47 47 47 47 47 47 47 47 48 48 48 48 48 48 48 48 48 48 48 48 48 48 47 47 48 48 48 48 47 47 48 47 47 47 47 47 47 47
950D7%Jj%%%J%%%%%%%%J%%%%%%%%%%%%jJ%%j%%%%%%%%%%%%%%%j%%%%%%%%%%%%%%J%%j%%%%
$$ 47 47 48 47 47 47 47 48 48 48 48 48 48 48 48 48 49 49 49 49 49 49 49 49 49 49 49 49 49 48 49 49 49 48 48 48 48 48 48 48 48 48 48 48 48 48 48 48 48 47 47 47 47 47 47 47 47 47 47 47 47 47 47 47 48 48 48 47 47 47 47 47
942D7%%%J%%%%%%%%%%%%%%%%%%%%%%J%%jJ%%%%j%%J%%%%j%%%%%%J%%%%%%%%%%%%%%%J%%%%
$$ 47 47 47 47 48 48 48 48 48 48 48 48 48 48 48 48 48 48 48 48 48 48 48 48 48 48 48 49 49 49 48 49 49 49 49 49 48 48 48 49 49 49 49 49 48 48 48 48 48 48 48 49 49 49 49 49 49 49 49 49 49 49 49 49 49 49 49 50 50 50 50 50
934E0%J%%J%%J%JJ%JJ%J%%%%%%%%%j%j%j%jj%%j%%j%%%%%%%%%%%%%%%%%%%j%%%%%%%%%J%j
$$ 50 50 51 51 51 52 52 52 53 53 54 55 55 56 57 57 58 58 58 58 58 58 58 58 58 58 57 57 56 56 55 55 54 53 53 53 52 52 52 51 51 51 51 51 51 51 51 51 51 51 51 51 51 51 51 51 51 51 51 50 50 50 50 50 50 50 50 50 50 51 51 50
927E0%%%%J%%%%%%%J%%%%%%%%%%%%%%%%%J%%%%%%%%%%%%%%%%%%J%%%%%J%%%%%%%%%%%%%j%
$$ 50 50 50 50 50 51 51 51 51 51 51 51 51 52 52 52 52 52 52 52 52 52 52 52 52 52 52 52 52 52 52 53 53 53 53 53 53 53 53 53 53 53 53 53 53 53 53 53 53 53 54 54 54 54 54 54 55 55 55 55 55 55 55 55 55 55 55 55 55 55 54 54
919E4J%%%%j%J%%%%%%%%%%%%%%%%J%%%%%%%J%%%%%%J%%%J%%%%J%%%%%%J%%%%%J%%%%%%%%%
$$ 54 55 55 55 55 55 54 54 55 55 55 55 55 55 55 55 55 55 55 55 55 55 55 55 55 56 56 56 56 56 56 56 56 57 57 57 57 57 57 57 58 58 58 58 59 59 59 59 59 60 60 60 60 60 60 60 61 61 61 61 61 61 62 62 62 62 62 62 62 62 62 62
912F2%J%%%%%j%J%%%%%jJ%%%%%%%J%%%J%%%%%J%%%%J%%%J%%%%J%%J%J%%%%J%%%%%%%%%%%%
$$ 62 62 63 63 63 63 63 63 62 62 63 63 63 63 63 63 62 63 63 63 63 63 63 63 63 64 64 64 64 65 65 65 65 65 65 66 66 66 66 66 67 67 67 67 68 68 68 68 68 69 69 69 70 70 71 71 71 71 71 72 72 72 72 72 72 72 72 72 72 72 72 72
904G2%%j%%%J%%%%%%%%%J%J%J%J%J%%J%%%%%%%%%%%%%%%%%J%%%J%%J%J%J%JJ%JJ%J%JJ%%%
$$ 72 72 72 71 71 71 71 72 72 72 72 72 72 72 72 72 72 73 73 74 74 75 75 76 76 77 77 77 78 78 78 78 78 78 78 78 78 78 78 78 78 78 78 78 78 78 79 79 79 79 80 80 80 81 81 82 82 83 83 84 85 85 86 87 87 88 88 89 90 90 90 90
897I0%%j%jjj%j%jj%%%%%%%%%%J%J%%%%%%%%J%%%J%%%%%J%%%%%%j%%%J%%%%%%%%J%%%%%%%
$$ 90 90 90 89 89 88 87 86 86 85 85 84 83 83 83 83 83 83 83 83 83 83 83 84 84 85 85 85 85 85 85 85 85 85 86 86 86 86 87 87 87 87 87 87 88 88 88 88 88 88 88 87 87 87 87 88 88 88 88 88 88 88 88 88 89 89 89 89 89 89 89 89
889H9J%%%%%J%%%%J%%%%%J%%J%%%J%%J%%J%J%J%J%JJ%J%JJJJJJJJJJJJJJKKJKJKKKKKLKLK
$$ 89 90 90 90 90 90 90 91 91 91 91 91 92 92 92 92 92 92 93 93 93 94 94 94 94 95 95 95 96 96 96 97 97 98 98 99 99 100 100 101 102 102 103 103 104 105 106 107 108 109 110 111 112 113 114 115 116 117 119 121 122 124 125 127 129 131 133 135 138 140 143 145
882A45LKLMLLLMMMMMMNMNNNNNNNONNONONNNONNNNMNMMMMMLLLKKJJ%jkkmmoooqprqrqrrqqq
$$ 145 148 150 153 157 160 163 166 170 174 178 182 186 190 195 199 204 209 214 219 224 229 234 240 245 250 256 261 267 272 277 282 288 293 298 303 308 312 317 321 325 329 333 337 340 343 346 348 350 351 352 352 351 349 347 343 339 333 327 321 313 306 297 289 280 272 263 254 246 238 230
874B30pppopooonnnmnmlmlmklllkkkkkkjkjjjkjjjjjjjjj%jjj%jj%jj%jj%j%j%j%j%%j%%j
$$ 230 223 216 209 203 196 190 184 178 173 168 163 159 154 150 147 143 140 136 134 131 128 125 123 121 119 117 115 113 112 110 109 108 107 105 104 103 102 101 100 99 98 97 96 96 95 94 93 93 92 91 91 90 89 89 88 87 87 86 86 85 85 84 84 83 83 83 82 82 82 81
867H1%j%%%j%%%j%%%j%%%%%j%%%j%%%j%%%j%%j%%%j%j%%%%%J%j%%%%%%%%%%j%%%%%%%%j%%
$$ 81 81 80 80 80 80 79 79 79 79 78 78 78 78 77 77 77 77 77 77 76 76 76 76 75 75 75 75 74 74 74 74 73 73 73 72 72 72 72 71 71 70 70 70 70 70 70 71 71 70 70 70 70 70 70 70 70 70 70 70 69 69 69 69 69 69 69 69 69 68 68 68
859F8%%%%%%%%%%%%%%%%%%%%%%%j%%j%%j%%%%%%%%%%%%j%%%%j%%J%j%J%%j%%%J%%%%%%%%%
$$ 68 68 68 68 68 68 68 68 68 68 68 68 68 68 68 68 68 68 68 68 68 68 68 68 67 67 67 66 66 66 65 65 65 65 65 65 65 65 65 65 65 65 65 64 64 64 64 64 63 63 63 64 64 63 63 64 64 64 63 63 63 63 64 64 64 64 64 64 64 64 64 64
852F4%%%%%%%%%%%%%%Jj%%%%%%j%%j%%%%%%%j%%%%%%%%%%%%%j%%%%%%%%j%%%%%j%%%%%%%%
$$ 64 64 64 64 64 64 64 64 64 64 64 64 64 64 64 65 64 64 64 64 64 64 64 63 63 63 62 62 62 62 62 62 62 62 61 61 61 61 61 61 61 61 61 61 61 61 61 61 60 60 60 60 60 60 60 60 60 59 59 59 59 59 59 58 58 58 58 58 58 58 58 58
844E8%%%%%%%%%%%j%%%%%%%%%jJ%j%%%%%%%%%%%%%%%%%%%j%%%%%%%%%%%%%%%%%j%%%%%%%%
$$ 58 58 58 58 58 58 58 58 58 58 58 58 57 57 57 57 57 57 57 57 57 57 56 57 57 56 56 56 56 56 56 56 56 56 56 56 56 56 56 56 56 56 56 56 56 55 55 55 55 55 55 55 55 55 55 55 55 55 55 55 55 55 55 54 54 54 54 54 54 54 54 54
837E4%%%%%%%%%%%%j%%%%%%%%%%%%%%j%%%%%%%%%%%%%%%%%%%%%%%%%%%%%j%%%%%%%%%%%%%
$$ 54 54 54 54 54 54 54 54 54 54 54 54 54 53 53 53 53 53 53 53 53 53 53 53 53 53 53 53 52 52 52 52 52 52 52 52 52 52 52 52 52 52 52 52 52 52 52 52 52 52 52 52 52 52 52 52 52 52 51 51 51 51 51 51 51 51 51 51 51 51 51 51
829E1%%j%%%%%%%%%%%%%%%%%%%%%%%%%%%%%%%%%%%%%%%%%%%j%%%%%J%%jJ%%%%j%%%%%%%%%
$$ 51 51 51 50 50 50 50 50 50 50 50 50 50 50 50 50 50 50 50 50 50 50 50 50 50 50 50 50 50 50 50 50 50 50 50 50 50 50 50 50 50 50 50 50 50 50 50 49 49 49 49 49 49 50 50 50 49 50 50 50 50 50 49 49 49 49 49 49 49 49 49 49
822D9%%%%%%%%%%%%%jJ%%%%j%%%%%%%%%%%%%%%%%%%%%%%%%%%%%%%%%%%%%%%%%%%%%%%%%%%
$$ 49 49 49 49 49 49 49 49 49 49 49 49 49 49 48 49 49 49 49 49 48 48 48 48 48 48 48 48 48 48 48 48 48 48 48 48 48 48 48 48 48 48 48 48 48 48 48 48 48 48 48 48 48 48 48 48 48 48 48 48 48 48 48 48 48 48 48 48 48 48 48 48
814D8%%%%%%%%%%%%%%J%%%%%j%%%%%%J%%%%%%%j%J%%%%%%%%%%%%%j%%J%%%%%%%%%%%j%%%%
$$ 48 48 48 48 48 48 48 48 48 48 48 48 48 48 48 49 49 49 49 49 49 48 48 48 48 48 48 48 49 49 49 49 49 49 49 49 48 48 49 49 49 49 49 49 49 49 49 49 49 49 49 49 48 48 48 49 49 49 49 49 49 49 49 49 49 49 49 48 48 48 48 48
807D8%%%%%%%%%%%%%%%%%%%j%%J%%%%%j%%%J%%%%%%%%%%%jJj%%%J%%%%%%%%%%%%%%J%%j%%
$$ 48 48 48 48 48 48 48 48 48 48 48 48 48 48 48 48 48 48 48 48 47 47 47 48 48 48 48 48 48 47 47 47 47 48 48 48 48 48 48 48 48 48 48 48 48 47 48 47 47 47 47 48 48 48 48 48 48 48 48 48 48 48 48 48 48 48 49 49 49 48 48 48
799D8%%%%%%%%%%%%%j%%%%%%%%%%%%%%j%%%%%%%%%%%%%%%%%%%%%%%%%%%%%%%%%%%%%%%%j%
$$ 48 48 48 48 48 48 48 48 48 48 48 48 48 48 47 47 47 47 47 47 47 47 47 47 47 47 47 47 47 46 46 46 46 46 46 46 46 46 46 46 46 46 46 46 46 46 46 46 46 46 46 46 46 46 46 46 46 46 46 46 46 46 46 46 46 46 46 46 46 46 45 45
792D5%%%%%%%%%%jJ%%%%%%%%%%%%%%%%j%%J%%%jJ%j%%%%%%%%%%%%%%%%%%%%j%%%%%%%J%%%
$$ 45 45 45 45 45 45 45 45 45 45 45 44 45 45 45 45 45 45 45 45 45 45 45 45 45 45 45 45 45 44 44 44 45 45 45 45 44 45 45 44 44 44 44 44 44 44 44 44 44 44 44 44 44 44 44 44 44 44 44 44 43 43 43 43 43 43 43 43 44 44 44 44
784D4%%%j%%%%%%%J%%%%%%%%%%%%%%%%%%%%%%%%%%%%%%%%%%%%%%j%%%%%%J%%%%%j%%%%%%J
$$ 44 44 44 44 43 43 43 43 43 43 43 43 44 44 44 44 44 44 44 44 44 44 44 44 44 44 44 44 44 44 44 44 44 44 44 44 44 44 44 44 44 44 44 44 44 44 44 44 44 44 44 43 43 43 43 43 43 43 44 44 44 44 44 44 43 43 43 43 43 43 43 44
777D4%j%%%%J%%%%%%%%%%%%%%%%j%%%%%%%%%%%%%%%%%%%%%%%%%%%%%J%j%%%%%%%%%J%%j%%
$$ 44 44 43 43 43 43 43 44 44 44 44 44 44 44 44 44 44 44 44 44 44 44 44 44 43 43 43 43 43 43 43 43 43 43 43 43 43 43 43 43 43 43 43 43 43 43 43 43 43 43 43 43 43 43 44 44 43 43 43 43 43 43 43 43 43 43 44 44 44 43 43 43
769D3%J%%%%%%%%%%%%%%%%%%%%%%%%%%%%%%%%%%%%%%%%%%%%%%%%%%%%%%%%%%%%%%%%%J%jJ
$$ 43 43 44 44 44 44 44 44 44 44 44 44 44 44 44 44 44 44 44 44 44 44 44 44 44 44 44 44 44 44 44 44 44 44 44 44 44 44 44 44 44 44 44 44 44 44 44 44 44 44 44 44 44 44 44 44 44 44 44 44 44 44 44 44 44 44 44 44 45 45 44 45
762D5%%jJ%%%%%%%%%%%%%%%J%%%j%%J%%%%%%%%%%%%%%%%%%%%%%%%%%%%%%%%%%%%%%%%%%Jj
$$ 45 45 45 44 45 45 45 45 45 45 45 45 45 45 45 45 45 45 45 45 46 46 46 46 45 45 45 46 46 46 46 46 46 46 46 46 46 46 46 46 46 46 46 46 46 46 46 46 46 46 46 46 46 46 46 46 46 46 46 46 46 46 46 46 46 46 46 46 46 46 47 46
754D6%%%%J%%%%%%%%j%%J%%%%%%%%%%%%%%j%%J%j%%%%J%%%%%%%%%%%%%%%%%%%%%%%%%%%%%
$$ 46 46 46 46 46 47 47 47 47 47 47 47 47 47 46 46 46 47 47 47 47 47 47 47 47 47 47 47 47 47 47 47 46 46 46 47 47 46 46 46 46 46 47 47 47 47 47 47 47 47 47 47 47 47 47 47 47 47 47 47 47 47 47 47 47 47 47 47 47 47 47 47
747D7%%%%%%%%%%%%%%%%%%%%j%%%%%%%%%%%%%%%%j%%%%%J%%j%J%jJ%%%%jJ%%%%%%%%%%%%%
$$ 47 47 47 47 47 47 47 47 47 47 47 47 47 47 47 47 47 47 47 47 47 46 46 46 46 46 46 46 46 46 46 46 46 46 46 46 46 46 45 45 45 45 45 45 46 46 46 45 45 46 46 45 46 46 46 46 46 45 46 46 46 46 46 46 46 46 46 46 46 46 46 46
739D6%%%%%%%%jJj%%%%%%%%%%%%%%%%%%%%%%%%%%%j%%%%J%%%%%%j%J%%j%%%%%%%%%%%%%%%
$$ 46 46 46 46 46 46 46 46 46 45 46 45 45 45 45 45 45 45 45 45 45 45 45 45 45 45 45 45 45 45 45 45 45 45 45 45 45 45 45 44 44 44 44 44 45 45 45 45 45 45 45 44 44 45 45 45 44 44 44 44 44 44 44 44 44 44 44 44 44 44 44 44
732D4%%%%%%%%%%%%%%%%%%%%jJ%j%%%%%%%%%Jj%%%%%%%%%%%%j%%J%j%%%%%%%%%%%%%%%%%%
$$ 44 44 44 44 44 44 44 44 44 44 44 44 44 44 44 44 44 44 44 44 44 43 44 44 43 43 43 43 43 43 43 43 43 43 44 43 43 43 43 43 43 43 43 43 43 43 43 43 42 42 42 43 43 42 42 42 42 42 42 42 42 42 42 42 42 42 42 42 42 42 42 42
724D2%%%%%%J%%%%j%%%%%%%%%%%%%%%%%%%%%%%%%%%%%%%%%%%%%%%%%%%%%%%%%%%%%%%%%%%
$$ 42 42 42 42 42 42 42 43 43 43 43 43 42 42 42 42 42 42 42 42 42 42 42 42 42 42 42 42 42 42 42 42 42 42 42 42 42 42 42 42 42 42 42 42 42 42 42 42 42 42 42 42 42 42 42 42 42 42 42 42 42 42 42 42 42 42 42 42 42 42 42 42
717D2%%%%%%%%%%%%%%%%%%%%%%%%%%%%%%%%%%%%%%%%%%%%%%%%%%%%%%%%%%%%%%%%%%%%%%%
$$ 42 42 42 42 42 42 42 42 42 42 42 42 42 42 42 42 42 42 42 42 42 42 42 42 42 42 42 42 42 42 42 42 42 42 42 42 42 42 42 42 42 42 42 42 42 42 42 42 42 42 42 42 42 42 42 42 42 42 42 42 42 42 42 42 42 42 42 42 42 42 42 42
709D2%%%%%%%%%%%%%%%%%%%%J%%%jJ%%%%%%%%%%J%%%%J%%%J%%%J%%J%%%J%%j%%%j%%j%j%%
$$ 42 42 42 42 42 42 42 42 42 42 42 42 42 42 42 42 42 42 42 42 42 43 43 43 43 42 43 43 43 43 43 43 43 43 43 43 43 44 44 44 44 44 45 45 45 45 46 46 46 46 47 47 47 48 48 48 48 49 49 49 48 48 48 48 47 47 47 46 46 45 45 45
701D5j%%%%%j%%%%%%%%%%%%j%%%%%%%%%%%%%%%%%%%%%%%%%%%%%%%%%%%%%%%%%%%%%%%%%%%
$$ 45 44 44 44 44 44 44 43 43 43 43 43 43 43 43 43 43 43 43 43 42 42 42 42 42 42 42 42 42 42 42 42 42 42 42 42 42 42 42 42 42 42 42 42 42 42 42 42 42 42 42 42 42 42 42 42 42 42 42 42 42 42 42 42 42 42 42 42 42 42 42 42
694D2%%%%%%%%%%%%%%%%%%%%%%%%%%%j%%%%%%%%%%%%%%%%%%%%%%%J%%j%%%%%%%%%%%%%%%%
$$ 42 42 42 42 42 42 42 42 42 42 42 42 42 42 42 42 42 42 42 42 42 42 42 42 42 42 42 42 41 41 41 41 41 41 41 41 41 41 41 41 41 41 41 41 41 41 41 41 41 41 41 41 42 42 42 41 41 41 41 41 41 41 41 41 41 41 41 41 41 41 41 41
686D1%%%%%%%%%%%%%%%%%%%%%%%%%%%%%%%%%%%%%%%%%%%%%%%%%%%%%%%%%%%%%%%%%%%%%%%
$$ 41 41 41 41 41 41 41 41 41 41 41 41 41 41 41 41 41 41 41 41 41 41 41 41 41 41 41 41 41 41 41 41 41 41 41 41 41 41 41 41 41 41 41 41 41 41 41 41 41 41 41 41 41 41 41 41 41 41 41 41 41 41 41 41 41 41 41 41 41 41 41 41
679D1%%%%%%%%%%%J%j%%%%J%%%%%%%%%%%%%j%%%J%%%%%%%%%%%j%%%J%j%%%%%%J%%%%%%%%%
$$ 41 41 41 41 41 41 41 41 41 41 41 41 42 42 41 41 41 41 41 42 42 42 42 42 42 42 42 42 42 42 42 42 42 41 41 41 41 42 42 42 42 42 42 42 42 42 42 42 42 41 41 41 41 42 42 41 41 41 41 41 41 41 42 42 42 42 42 42 42 42 42 42
671D2%%%%%%%%%%%j%%%%%%J%%%%%j%%%%J%%%%%%%%%%%%%%%%%%%%%%%Jj%%%%Jj%%%%%%%%%%
$$ 42 42 42 42 42 42 42 42 42 42 42 42 41 41 41 41 41 41 41 42 42 42 42 42 42 41 41 41 41 41 42 42 42 42 42 42 42 42 42 42 42 42 42 42 42 42 42 42 42 42 42 42 42 42 43 42 42 42 42 42 43 42 42 42 42 42 42 42 42 42 42 42
664D2%%%%%%%%%%%%%%%%%%%%%%%J%%%%%%%%%%%%%%jJ%%%%jJj%J%%%%%%%%%%%%%%%%%%%%%%
$$ 42 42 42 42 42 42 42 42 42 42 42 42 42 42 42 42 42 42 42 42 42 42 42 42 43 43 43 43 43 43 43 43 43 43 43 43 43 43 43 42 43 43 43 43 43 42 43 42 42 43 43 43 43 43 43 43 43 43 43 43 43 43 43 43 43 43 43 43 43 43 43 43
656D3%%j%%%%%%%%%%%%%J%%%%%%%%%%jJ%%%%%%%%%%J%%j%J%%j%%%%%%%%%%%%%%%%%J%%%%%
$$ 43 43 43 42 42 42 42 42 42 42 42 42 42 42 42 42 42 43 43 43 43 43 43 43 43 43 43 43 42 43 43 43 43 43 43 43 43 43 43 43 44 44 44 43 43 44 44 44 43 43 43 43 43 43 43 43 43 43 43 43 43 43 43 43 43 43 44 44 44 44 44 44
649D4%%%J%%%%%J%%%%%%%%%%%%%j%%%%%%%%%%j%%%%%%%%%j%%%Jj%%%%%%%%%%%J%%%%%%%J%
$$ 44 44 44 44 45 45 45 45 45 45 46 46 46 46 46 46 46 46 46 46 46 46 46 46 45 45 45 45 45 45 45 45 45 45 45 44 44 44 44 44 44 44 44 44 44 43 43 43 43 44 43 43 43 43 43 43 43 43 43 43 43 43 44 44 44 44 44 44 44 44 45 45
641D5%%%%%%%Jj%%%%j%%%%%%%%j%J%%j%%%%%%%%%%j%%%%%%%jJ%%%%%%%%%%%%%%%%%%%%%%%
$$ 45 45 45 45 45 45 45 45 46 45 45 45 45 45 44 44 44 44 44 44 44 44 44 43 43 44 44 44 43 43 43 43 43 43 43 43 43 43 43 42 42 42 42 42 42 42 42 41 42 42 42 42 42 42 42 42 42 42 42 42 42 42 42 42 42 42 42 42 42 42 42 42
634D2%%%%%%%%%%%%%%%%%%%%%%%J%j%%%%%%J%%%%%J%%%%%%%%%%%%%%%J%%%%%%%%%%J%%%%%
$$ 42 42 42 42 42 42 42 42 42 42 42 42 42 42 42 42 42 42 42 42 42 42 42 42 43 43 42 42 42 42 42 42 42 43 43 43 43 43 43 44 44 44 44 44 44 44 44 44 44 44 44 44 44 44 44 45 45 45 45 45 45 45 45 45 45 45 46 46 46 46 46 46
626D6%J%%%%J%%%%J%%J%%%J%%J%J%J%%JJ%JJ%JJJ%JJJJJJKJJJJJ%J%%%j%jjj%jjjjjj%j%%
$$ 46 46 47 47 47 47 47 48 48 48 48 48 49 49 49 50 50 50 50 51 51 51 52 52 53 53 54 54 54 55 56 56 57 58 58 59 60 61 61 62 63 64 65 66 67 69 70 71 72 73 74 74 75 75 75 75 74 74 73 72 71 71 70 69 68 67 66 65 65 64 64 64
619F4j%%%%%%%%%%J%%%J%JJ%JJJ%JJJJJKJKJKJKKKKKKKKKJJ%%jjjkkklklkklkkjjkjj%jj%
$$ 64 63 63 63 63 63 63 63 63 63 63 63 64 64 64 64 65 65 66 67 67 68 69 70 70 71 72 73 74 75 77 78 80 81 83 84 86 88 90 92 94 96 98 100 102 103 104 104 104 103 102 101 99 97 95 92 90 87 85 83 80 78 76 75 74 72 71 70 70 69 68 68
611F8%j%%%jJ%%%%J%%%J%%J%J%JJ%JJJJJ%JJJJKJJJ%JJ%%%%j%jjkjjjjjjjj%j%j%j%jj%j%
$$ 68 68 67 67 67 67 66 67 67 67 67 67 68 68 68 68 69 69 69 70 70 71 71 72 73 73 74 75 76 77 78 78 79 80 81 82 84 85 86 87 87 88 89 89 89 89 89 88 88 87 86 84 83 82 81 80 79 78 77 76 76 75 75 74 74 73 73 72 71 71 70 70
604G0j%%j%%j%%%%%%%%%%%%%%%%%%%%%%J%%%J%%J%JJ%JJ%JJJJJ%J%J%J%%%%j%j%j%j%j%j%
$$ 70 69 69 69 68 68 68 67 67 67 67 67 67 67 67 67 67 67 67 67 67 67 67 67 67 67 67 67 67 67 68 68 68 68 69 69 69 70 70 71 72 72 73 74 74 75 76 77 78 79 79 80 80 81 81 82 82 82 82 82 81 81 80 80 79 79 78 78 77 77 76 76
596G6j%%j%%%%%%%J%%%J%J%%JJ%J%JJ%J%JJJ%JJJ%JJJ%J%J%J%J%J%%%%%%%%%%%%%%j%%%J%
$$ 76 75 75 75 74 74 74 74 74 74 74 74 75 75 75 75 76 76 77 77 77 78 79 79 80 80 81 82 82 83 83 84 85 86 86 87 88 89 89 90 91 92 92 93 93 94 94 95 95 96 96 97 97 97 97 97 97 97 97 97 97 97 97 97 97 97 96 96 96 96 97 97
589I7J%%J%JJ%J%J%J%%J%%%%%j%j%jjj%jjjjj%jj%jj%%%j%%%%j%%%%j%%%j%%%j%%%%j%%%%
$$ 97 98 98 98 99 99 100 101 101 102 102 103 103 104 104 104 105 105 105 105 105 105 104 104 103 103 102 101 100 100 99 98 97 96 95 95 94 93 93 92 91 91 91 91 90 90 90 90 90 89 89 89 89 89 88 88 88 88 87 87 87 87 86 86 86 86 86 85 85 85 85 85
581H5%%j%%%%%j%%j%%jjjjjjj%jk%jjjj%jjj%j%j%%j%%%j%j%%j%%j%j%%j%%%%j%%%%%%j%%
$$ 85 85 85 84 84 84 84 84 84 83 83 83 82 82 82 81 80 79 78 77 76 75 75 74 72 72 71 70 69 68 68 67 66 65 65 64 64 63 63 63 62 62 62 62 61 61 60 60 60 59 59 59 58 58 57 57 57 56 56 56 56 56 55 55 55 55 55 55 55 54 54 54
574E4%%%%%%%%%J%%%%%%%%J%j%%%%%%j%%j%%%j%%%j%%%%%%j%%%%%%%%%%%j%%%%%%%%%J%%%
$$ 54 54 54 54 54 54 54 54 54 54 55 55 55 55 55 55 55 55 55 56 56 55 55 55 55 55 55 55 54 54 54 53 53 53 53 52 52 52 52 51 51 51 51 51 51 51 50 50 50 50 50 50 50 50 50 50 50 50 49 49 49 49 49 49 49 49 49 49 50 50 50 50
566E0%%%%%J%%%%%J%%%%%j%%%%j%%%j%%j%%%j%%%j%%%%%%%%%%%%%j%%%%%%%%%%%%%%%%%%%
$$ 50 50 50 50 50 50 51 51 51 51 51 51 52 52 52 52 52 52 51 51 51 51 51 50 50 50 50 49 49 49 48 48 48 48 47 47 47 47 46 46 46 46 46 46 46 46 46 46 46 46 46 46 45 45 45 45 45 45 45 45 45 45 45 45 45 45 45 45 45 45 45 45
559D5%%%%%%%j%%%%%%%%%%%%%%%%%j%%%%%%%%%%%j%%%%%%%%%%%%%%%%%%%%%%%%j%%%%%%%%
$$ 45 45 45 45 45 45 45 45 44 44 44 44 44 44 44 44 44 44 44 44 44 44 44 44 44 44 43 43 43 43 43 43 43 43 43 43 43 43 42 42 42 42 42 42 42 42 42 42 42 42 42 42 42 42 42 42 42 42 42 42 42 42 42 41 41 41 41 41 41 41 41 41
551D1%%%%%%%%%%%%%%%%%%%%%%%%%%j%%%%%%%%%%%%%%%%%%%%%%%%%%%%%%%%%%%%%%%J%j%%
$$ 41 41 41 41 41 41 41 41 41 41 41 41 41 41 41 41 41 41 41 41 41 41 41 41 41 41 41 40 40 40 40 40 40 40 40 40 40 40 40 40 40 40 40 40 40 40 40 40 40 40 40 40 40 40 40 40 40 40 40 40 40 40 40 40 40 40 40 41 41 40 40 40
543D0%%%%%%%%%%%%%%%%%%%%%j%J%j%%%%%%%%%%%%%%%%%%%%%%%%%%%%%%%%%J%%j%%J%jJ%j
$$ 40 40 40 40 40 40 40 40 40 40 40 40 40 40 40 40 40 40 40 40 40 40 39 39 40 40 39 39 39 39 39 39 39 39 39 39 39 39 39 39 39 39 39 39 39 39 39 39 39 39 39 39 39 39 39 39 39 39 39 39 40 40 40 39 39 39 40 40 39 40 40 39
536C9%%%%%%%%%J%%j%%%%%%%%%%Jj%%%%%%%%%%%%%%%%%%%%%%%%%%%%%%%%%%%%%%%%%%%%%%
$$ 39 39 39 39 39 39 39 39 39 39 40 40 40 39 39 39 39 39 39 39 39 39 39 39 40 39 39 39 39 39 39 39 39 39 39 39 39 39 39 39 39 39 39 39 39 39 39 39 39 39 39 39 39 39 39 39 39 39 39 39 39 39 39 39 39 39 39 39 39 39 39 39
$$ [...]
-2638C4
##END=		$$ NMR SPECTRUM
##END=		$$ LINK
