##TITLE=	RP319 5-7 xtra vac.10.fid
##JCAMP-DX=	6.0	$$ MestReNova 14.3.3-33362
##DATA TYPE=	LINK
##BLOCKS=	1    
##ORIGIN=	Mestrelab Research S.L.
##OWNER=	hrzepa
##$MNOVA/METADATA=	(DOCUMENT,BASE64)
eyJuYW1lIjoiL1VzZXJzL2hyemVwYS9MaWJyYXJ5L01vYmlsZSBEb2N1bWVudHMvY29tfmFwcGxlfkN
sb3VkRG9jcy9TaGVwcGFyZC9OTVIgZmlsZXMgemlwcy0yLzIzLzIzLUgubW5vdmEiLCJwYWdlcyI6W3
siaXRlbXMiOlsiMSIgICAgIF19XX0=
##TITLE=	RP319 5-7 xtra vac.10.fid
##JCAMP-DX=	6.0	$$ MestReNova 14.3.3-33362
##DATA TYPE=	NMR SPECTRUM
##DATA CLASS=	XYDATA
##BLOCK_ID=	1
##ORIGIN=	Bruker BioSpin GmbH
##OWNER=	nmrsu
##NUMDIM=	1
##$MNOVA/METADATA=	(ITEM,BASE64)
eyJhbmdsZSI6MCwiYXhlcyI6eyJ4Ijp7Im1heCI6MTYuMDY0MjU5OTk5OTM5MTI1LCJtaW4iOi0zLjc
2Njk0MjMzOTE1NjYyMjZ9LCJ5Ijp7Im1heCI6MTcxMTk4LjcwNjA1NDY4NzUsIm1pbiI6LTE1Mzg1Lj
Q2NjQ0NTkyMjg1Mn19LCJwb2ludHMiOlt7IngiOjUzMjEsInkiOjU4MzV9LHsieCI6ODcyMiwieSI6N
TgzNX0seyJ4Ijo4NzIyLCJ5Ijo4MjA4fSx7IngiOjUzMjEsInkiOjgyMDh9LHsieCI6NTMyMSwieSI6
NTgzNX1dLCJ6IjowfQ==
##.OBSERVE FREQUENCY=	700.35432466099996418
##.OBSERVE NUCLEUS=	^1H
##.SOLVENT NAME=	CDCl3
##.PULSE SEQUENCE=	zg30
##LONGDATE=	2023/04/01 02:19:24.000
##.ACQUISITIONMODE=	SIMULTANEOUS (DQD)
##$ORIGINAL FORMAT=	Bruker XWIN-NMR
##$MNOVA/SCALES_VERSION=	9
##$PARAMETER FILE=	(acqus, ASCII, /private/var/folders/f6/rjf_tdyn2v98c5c0wvkgn4s80000gq/T/RbHxSy9BTJesjDhESZ$ndw/10/acqus, 0)
$$ ##TITLE= Parameter file, TopSpin 4.1.3
$$ ##JCAMPDX= 5.0
$$ ##DATATYPE= Parameter Values
$$ ##NPOINTS= 1	$$ modification sequence number
$$ ##ORIGIN= Bruker BioSpin GmbH
$$ ##OWNER= nmrsu
$$ $$ 2023-04-01 02:18:28.383 +0100  nmrsu@CZC7167VR1
$$ $$ Z:/700/data/tds/nmr/RP319 5-7 xtra vac/10/acqus
$$ $$ process C:\Bruker\TopSpin4.1.3\prog\mod\dirdata.exe
$$ ##$ACQT0= -2.0981556054023
$$ ##$AMP= (0..31)
$$ 100 100 100 100 100 100 100 100 100 100 100 100 100 100 100 100 100 100
$$ 100 100 100 100 100 100 100 100 100 100 100 100 100 100
$$ ##$AMPCOIL= (0..32)
$$ -1 0 0 0 0 0 0 0 0 0 0 0 0 0 0 0 0 0 0 0 0 0 0 0 0 0 0 0 0 0 0 0 0
$$ ##$AQSEQ= 0
$$ ##$AQ_mod= 3
$$ ##$AUNM= <au_zg>
$$ ##$AUTOPOS= <8 >
$$ ##$BF1= 700.349999998
$$ ##$BF2= 700.349999998
$$ ##$BF3= 700.349999998
$$ ##$BF4= 700.349999998
$$ ##$BF5= 700.349999998
$$ ##$BF6= 700.349999998
$$ ##$BF7= 700.349999998
$$ ##$BF8= 700.349999998
$$ ##$BWFAC= (0..63)
$$ 0 0 0 0 0 0 0 0 0 0 0 0 0 0 0 0 0 0 0 0 0 0 0 0 0 0 0 0 0 0 0 0 0 0 0 0
$$ 0 0 0 0 0 0 0 0 0 0 0 0 0 0 0 0 0 0 0 0 0 0 0 0 0 0 0 0
$$ ##$BYTORDA= 0
$$ ##$CHANFCU= (0..24)
$$ 0 1 0 0 0 0 0 0 0 0 0 0 0 0 0 0 0 0 0 0 0 0 0 0 0
$$ ##$CHANREC= (0..24)
$$ 0 0 0 0 0 0 0 0 0 0 0 0 0 0 0 0 0 0 0 0 0 0 0 0 0
$$ ##$CHEMSTR= <none>
$$ ##$CNST= (0..63)
$$ 1 1 1 1 1 1 1 1 1 1 1 1 1 1 1 1 1 1 1 1 1 1 1 1 1 1 1 1 1 1 1 1 1 1 1 1
$$ 1 1 1 1 1 1 1 1 1 1 1 1 1 1 1 1 1 1 1 1 1 1 1 1 1 1 1 1
$$ ##$CPDPRG= (0..8)
$$ <> <> <> <> <> <> <> <> <>
$$ ##$D= (0..63)
$$ 0 1 0 0 0 0 0 0 0 0 0 0 0 0 0 0 0.0002 0 0 0 0 0 0 0 0 0 0 0 0 0 0 0 0
$$ 0 0 0 0 0 0 0 0 0 0 0 0 0 0 0 0 0 0 0 0 0 0 0 0 0 0 0 0 0 0 0
$$ ##$DATE= 1680311964
$$ [...]
$$ ##$ShimPowRng3= (0..63)
$$ 1 1 1 1 1 1 1 1 1 1 1 1 1 1 1 1 1 1 1 1 1 1 1 1 1 1 1 1 1 1 1 1 1 1 1 1
$$ 1 1 1 1 0 0 0 0 0 0 0 0 0 0 0 0 0 0 0 0 0 0 0 0 0 0 0 0
$$ ##$ShimPowType1= 8
$$ ##$ShimPowType2= 8
$$ ##$ShimPowType3= 0
$$ ##$ShimPowType4= 0
$$ ##$ShimPowType5= 0
$$ ##$ShimPowType6= 0
$$ ##$ShimPowType7= 0
$$ ##$ShimPowType8= 0
$$ ##$ShimSysActGrad= (0..63)
$$ 1 2 3 4 13 5 7 11 10 9 6 8 12 18 19 20 21 15 22 23 24 14 25 16 26 17 27
$$ 28 31 32 33 34 35 36 37 38 0 0 0 0 0 0 0 0 0 0 0 0 0 0 0 0 0 0 0 0 0 0
$$ 0 0 0 0 0 0
$$ ##$ShimSysAngle= <>
$$ ##$ShimSysFunc= (0..63)
$$ 1 2 3 4 5 6 7 8 9 10 0 37 38 35 16 15 14 13 12 11 28 27 26 25 24 23 36
$$ 22 30 29 20 21 34 33 32 31 17 18 19 0 0 0 0 0 0 0 0 0 0 0 0 0 0 0 0 0 0
$$ 0 0 0 0 0 0 0
$$ ##$ShimSysMatId= <292722da.dat>
$$ ##$ShimSysMatrix= 1
$$ ##$ShimSysMinMaxUG= 130000
$$ ##$ShimSysOffset= <29 mm>
$$ ##$ShimSysType= 4
$$ ##$ShimUnit= 3
$$ ##$SpectrOsVersion= <4.1.156.20210628>
$$ ##$TCubeEth= <192.168.180.38>
$$ ##$TCubeSeqDevice= <>
$$ ##$TOSITY= <no>
$$ ##$TRIPLO2= 0
$$ ##$TopSpinVersion= <TopSpin 4.1.3>
$$ ##$TrxFreqFormula= (0..23)
$$ <TrxFreqFormula(2.0,700350000.000000,'TRX',Trx(1.0,'TRX 1200.1',1,5.000000,1290.000000))>
$$ <TrxFreqFormula(2.0,700350000.000000,'TRX',Trx(1.0,'TRX 1200.2',1,5.000000,1290.000000))>
$$ <TrxFreqFormula(2.0,700350000.000000,'TRX',Trx(1.0,'TRX 1200.3',1,5.000000,1290.000000))>
$$ <> <> <> <> <> <> <> <> <> <> <> <> <> <> <> <> <> <> <> <> <>
$$ ##$TrxPN= (0..23)
$$ <Z148391> <Z148391> <Z148391> <> <> <> <> <> <> <> <> <> <> <> <> <> <>
$$ <> <> <> <> <> <> <>
$$ ##$TrxSN= (0..23)
$$ <00336> <00337> <00342> <> <> <> <> <> <> <> <> <> <> <> <> <> <> <> <>
$$ <> <> <> <> <>
$$ ##$VCubeEth= (0..23)
$$ <no> <no> <no> <no> <no> <no> <no> <no> <no> <no> <no> <no> <no> <no> <no>
$$ <no> <no> <no> <no> <no> <no> <no> <no> <no>
$$ ##$VTU= 2
$$ ##$VTUETH= <192.168.99.11>
$$ ##$VTUTY= <no>
$$ ##$ValueLine= no
$$ ##$VpuPN= (0..23)
$$ <no> <no> <no> <no> <no> <no> <no> <no> <no> <no> <no> <no> <no> <no> <no>
$$ <no> <no> <no> <no> <no> <no> <no> <no> <no>
$$ ##$VpuSN= (0..23)
$$ <no> <no> <no> <no> <no> <no> <no> <no> <no> <no> <no> <no> <no> <no> <no>
$$ <no> <no> <no> <no> <no> <no> <no> <no> <no>
$$ ##$WBREFAM= (0..31)
$$ 99.8 100 100 100 100 100 100 100 100 100 100 100 100 100 100 100 100 100
$$ 100 100 100 100 100 100 100 100 100 100 100 100 100 100
$$ ##$WBREFLM= (0..31)
$$ 1 0 1 0 0 0 0 0 0 0 0 0 0 0 0 0 0 0 0 0 0 0 0 0 0 0 0 0 0 0 0 0
$$ ##$WBREFPH= (0..31)
$$ 0.05 0 0 0 0 0 0 0 0 0 0 0 0 0 0 0 0 0 0 0 0 0 0 0 0 0 0 0 0 0 0 0
$$ ##$WBSGU= (0..31)
$$ 1 2 4 0 0 0 0 0 0 0 0 0 0 0 0 0 0 0 0 0 0 0 0 0 0 0 0 0 0 0 0 0
$$ ##END=
$$ 
##$DECIM=	1440
##$DSPFVS=	21
##XUNITS=	HZ
##YUNITS=	ARBITRARY UNITS
##FIRSTX=	11250.604788156719223
##LASTX=	-2638.1781369192458442
##DELTAX=	-0.10596381293402784562
##XFACTOR=	1
##YFACTOR=	4.7497601435895866473
##FIRSTY=	259.296112060546875
##MINY=	178.08453369140625
##MAXY=	155635.390625
##NPOINTS=	131072
##XYDATA=	(X++(Y..Y))
$$ [...]
4836 79 79 79 79 78 78 78 78 78 78 78 77 77 77 77 77 77 77 76 76 76 76 77 77 77 78 78 77 77 77 77 77 77 77 78 78 78 78 78 79 79 79 79 79 79 79 79 79 79 79 79 78 78 78 78 78 78 78 78 78 78 78 78 77 77 77 77 77 77 76 77
4828 77 77 76 76 76 76 76 75 75 76 76 76 76 76 76 76 76 76 76 76 76 76 76 76 76 75 75 75 75 75 75 75 75 75 75 76 76 76 76 76 76 76 76 76 76 76 76 76 75 75 75 75 76 76 76 76 76 76 76 76 76 76 76 77 77 77 77 76 76 76 76
4821 76 76 76 76 77 77 77 77 77 77 77 77 76 76 75 75 76 76 76 75 75 75 75 76 76 76 76 76 76 76 76 76 76 76 77 77 76 76 76 76 76 76 76 77 77 77 76 76 76 76 76 76 76 76 76 76 77 77 77 77 76 77 77 77 77 76 76 76 76 76 77
4814 77 77 77 77 77 77 77 77 77 77 78 77 77 77 77 77 77 77 77 77 77 77 77 77 77 77 77 77 77 77 77 77 77 77 77 77 77 77 77 77 77 77 78 78 78 78 78 78 78 78 78 78 78 78 78 78 78 78 77 77 77 77 77 77 77 77 77 78 78 78 77
4806 77 77 77 77 76 76 76 76 76 75 76 76 76 76 76 75 76 76 76 76 76 76 76 76 76 76 76 76 76 76 76 76 76 76 76 77 77 77 77 77 77 77 77 77 77 77 77 76 76 76 76 76 76 76 76 76 76 76 76 76 76 77 77 77 77 77 76 76 76 76 75
4799 75 75 75 75 75 75 75 75 75 75 75 75 75 75 75 75 75 75 75 75 75 75 74 74 75 75 75 75 75 75 75 74 74 74 74 74 74 74 74 74 74 74 74 74 74 74 74 74 74 74 74 74 74 74 74 74 74 74 74 74 74 74 74 74 74 75 75 74 74 74 74
4791 74 75 75 75 75 75 75 75 75 75 75 75 75 75 75 75 75 75 76 76 76 76 75 75 75 75 75 76 76 75 75 75 75 75 75 75 75 75 75 75 75 75 75 75 75 75 75 75 75 75 75 75 75 75 75 75 75 75 75 74 74 74 74 74 74 74 74 74 74 74 74
4784 74 73 73 73 73 73 73 73 73 73 73 74 74 74 74 74 74 74 74 74 74 74 74 74 73 73 73 73 73 74 74 74 74 74 74 73 73 73 74 74 74 74 74 75 75 75 75 75 75 75 75 75 75 75 75 75 75 75 75 75 75 75 75 76 76 76 76 76 75 75 75
4777 75 75 75 75 75 75 75 75 75 75 75 75 75 75 74 74 74 74 74 74 74 74 74 74 74 75 75 75 74 74 74 75 75 74 74 74 74 74 75 75 75 75 76 76 76 76 76 77 77 77 77 76 76 76 76 77 77 77 77 77 77 77 77 77 77 77 78 78 78 78 78
4769 78 78 79 79 80 81 81 81 81 82 83 83 84 84 85 85 86 87 87 87 87 87 87 87 87 86 86 85 85 84 84 84 84 84 83 83 82 81 81 80 79 79 78 78 78 78 78 77 77 77 77 77 77 77 77 77 77 77 77 77 77 76 77 77 77 77 77 77 77 77 77
4762 77 77 77 77 78 78 78 78 79 79 80 80 80 80 81 81 82 82 82 82 83 83 84 84 85 85 85 86 86 86 86 86 85 85 86 85 85 84 84 83 83 82 82 81 81 80 80 79 79 79 79 78 78 78 77 77 77 77 77 77 77 77 77 76 76 76 75 75 75 75 75
4754 75 75 75 75 75 75 75 76 75 75 76 76 77 77 77 77 77 76 76 76 76 76 76 76 76 75 75 76 76 76 76 76 76 76 76 77 77 77 77 78 78 78 79 79 79 79 79 79 79 79 79 78 78 78 78 78 78 77 77 77 76 76 76 76 76 75 75 75 74 74 74
4747 74 74 74 74 74 74 74 74 74 74 74 74 74 74 74 74 74 74 75 75 75 76 76 76 76 76 77 77 78 78 79 79 80 81 81 82 83 84 84 85 86 86 86 86 86 86 86 86 86 85 85 85 85 85 84 84 83 83 82 81 81 80 80 79 79 78 78 78 78 78 77
4739 77 76 76 76 76 75 76 76 75 75 74 74 75 75 75 75 75 75 75 75 75 75 76 76 77 77 77 77 78 78 79 79 79 80 80 80 80 80 81 81 81 81 82 82 82 82 82 82 82 82 81 81 80 80 80 80 80 80 79 79 79 78 78 77 77 77 77 76 76 75 75
4732 75 75 75 75 75 75 75 74 74 74 74 74 74 74 74 74 74 74 74 74 74 74 73 73 73 73 73 73 73 73 73 73 73 74 74 73 73 73 73 73 73 73 73 73 73 73 73 73 73 73 74 74 74 73 73 73 73 74 74 74 74 74 74 74 74 74 74 74 74 74 74
4725 74 74 74 74 73 73 73 74 74 74 74 74 74 74 74 73 73 73 73 73 73 73 73 74 74 73 73 73 73 73 73 73 73 72 72 72 72 73 73 73 73 72 72 72 73 73 73 73 74 74 74 74 74 73 73 73 73 73 74 74 74 74 74 74 74 74 75 75 75 75 75
4717 75 75 75 75 75 75 75 75 75 74 75 74 74 74 74 73 73 73 73 73 74 74 74 74 74 74 74 74 74 73 73 73 73 73 73 73 73 73 73 73 73 73 73 73 72 72 72 72 73 73 73 73 73 73 74 74 74 74 74 74 75 75 75 75 75 75 74 74 74 74 74
4710 74 74 74 74 74 74 74 74 74 74 74 74 74 74 74 74 74 74 74 74 74 74 74 74 74 74 74 74 74 74 74 75 75 75 75 75 75 75 74 74 74 74 74 74 74 74 74 74 74 74 74 74 73 73 73 73 73 73 73 73 73 73 73 73 73 73 73 74 74 74 74
4702 74 74 74 74 74 73 73 73 74 74 74 74 74 74 74 73 74 74 74 74 74 74 74 74 74 74 74 74 74 74 74 74 74 74 74 74 74 74 74 74 74 73 73 73 73 74 74 74 74 74 74 74 74 74 74 74 73 73 73 74 74 74 74 73 73 73 73 73 73 73 73
4695 73 73 73 72 72 72 72 73 73 73 73 73 72 72 72 72 72 72 72 72 72 72 72 72 72 73 72 72 72 72 72 72 73 73 73 74 74 74 74 75 75 75 75 75 75 75 76 76 76 76 76 76 76 76 76 76 76 76 76 75 75 75 75 74 74 75 75 75 75 75 74
4688 74 74 74 74 74 74 74 74 74 73 73 73 73 73 74 74 74 74 74 74 75 75 75 75 75 74 74 74 74 74 74 74 74 74 74 74 74 74 74 74 74 74 74 74 74 74 74 74 74 74 74 74 74 75 75 75 75 74 75 75 75 75 75 75 75 75 75 75 75 75 75
4680 75 76 76 76 76 76 76 76 76 75 75 75 75 76 76 76 75 75 75 75 75 75 75 75 75 75 75 75 75 75 75 75 75 74 75 75 75 75 75 75 75 74 74 75 75 75 75 75 75 75 75 75 75 75 76 76 76 76 76 76 77 77 77 77 77 78 78 78 78 78 79
4673 79 79 79 79 79 80 80 80 80 79 79 79 79 79 79 79 79 79 79 79 80 80 80 79 79 79 79 79 79 79 79 79 79 78 78 78 78 78 78 78 78 77 77 77 76 76 76 76 76 76 75 75 75 75 75 76 75 75 75 75 75 75 75 75 75 75 75 75 75 75 75
4665 75 75 75 75 75 75 76 76 76 77 77 77 77 77 77 77 77 77 78 78 78 78 78 77 77 78 79 79 79 80 80 79 79 79 78 78 78 78 78 78 79 78 78 78 78 77 77 77 77 77 76 76 76 76 76 76 76 76 75 75 75 75 75 74 74 75 75 74 74 74 74
4658 74 74 74 74 74 74 74 74 75 75 75 75 75 75 75 75 75 75 76 76 75 75 76 76 77 77 78 78 78 78 78 78 78 78 79 79 79 80 79 79 79 79 78 78 78 77 77 77 76 76 76 76 76 75 75 75 75 74 74 74 74 73 73 72 73 73 73 73 73 73 73
4650 73 73 73 73 73 73 73 73 73 73 73 73 73 73 73 73 73 73 73 73 73 73 73 73 73 73 73 73 73 73 73 73 73 73 74 74 74 74 74 75 75 75 76 76 76 76 77 77 76 76 76 76 77 77 77 77 77 77 77 77 76 76 76 76 76 76 76 76 76 76 76
4643 76 76 76 76 76 76 76 75 75 75 75 74 74 74 74 74 74 74 74 74 74 74 74 74 74 75 74 74 74 75 75 75 75 75 75 75 75 75 75 76 76 76 76 76 76 76 76 77 77 77 78 78 79 79 80 80 81 82 82 83 83 84 84 85 85 85 85 85 85 85 84
4636 84 84 83 83 82 81 80 79 78 78 77 77 76 76 76 76 75 75 75 75 75 75 75 75 74 75 75 75 75 75 75 75 75 75 75 75 75 75 75 75 76 76 76 76 76 76 76 76 76 76 76 76 76 76 77 77 77 77 77 77 77 77 77 78 78 78 78 79 79 79 79
4628 79 79 79 79 79 79 79 79 79 79 78 78 78 77 77 76 76 75 75 75 74 74 74 74 74 74 74 74 75 75 75 75 75 75 75 75 75 75 75 75 75 76 76 76 76 76 76 76 76 76 76 76 76 76 76 75 75 75 75 75 75 74 74 74 74 74 74 74 74 74 73
4621 73 73 73 73 73 73 73 73 73 73 73 73 73 73 73 73 73 73 73 73 73 73 73 73 73 73 73 73 73 73 73 73 73 73 73 73 73 73 73 73 73 74 74 73 73 72 73 73 73 73 72 72 72 72 72 72 72 72 72 72 72 72 72 72 72 72 72 72 72 72 72
4613 72 72 72 72 72 73 73 72 72 72 72 72 72 72 72 72 72 72 73 72 73 73 73 73 73 73 74 74 74 74 74 74 74 74 74 74 74 74 74 74 74 74 74 75 75 75 75 74 74 73 73 73 73 73 74 74 73 73 73 73 73 73 73 73 73 74 74 73 73 72 72
4606 72 72 72 72 73 73 73 73 73 73 73 73 73 73 73 73 73 74 74 74 74 74 75 75 75 75 75 75 75 75 76 76 76 76 75 76 76 76 76 77 77 77 77 77 77 77 77 76 76 75 75 75 75 75 75 75 75 75 75 75 75 74 74 74 74 74 74 74 74 74 74
4599 74 73 73 73 73 73 74 74 74 74 74 74 74 74 74 75 75 74 74 74 75 75 75 75 75 74 75 75 75 75 75 75 75 75 75 75 75 75 75 75 75 75 75 75 76 76 76 76 75 75 75 75 75 75 75 75 75 75 75 75 75 75 75 75 76 76 76 76 76 76 76
4591 76 76 76 76 76 75 76 76 76 76 76 76 76 77 77 77 76 76 77 76 76 76 76 75 76 76 76 76 75 75 75 75 75 75 75 75 75 75 74 74 74 74 73 73 74 74 73 73 73 73 73 73 73 74 74 74 74 74 74 74 74 74 74 74 74 74 74 74 74 74 74
4584 74 75 74 74 75 75 75 75 75 75 75 75 75 75 75 75 75 75 75 75 75 75 75 75 75 75 75 75 75 75 75 75 75 75 75 74 74 74 74 74 74 74 74 74 73 73 73 73 73 73 73 73 73 73 73 73 73 73 73 73 73 73 73 73 73 72 72 72 72 72 71
4576 71 71 71 71 71 71 71 71 70 70 70 70 70 70 70 70 70 70 70 70 70 69 69 70 70 70 71 71 70 70 70 71 71 71 71 71 71 71 71 71 71 72 72 72 73 73 73 73 73 73 72 72 72 73 73 73 73 72 72 72 72 73 73 73 72 72 72 72 71 71 71
4569 71 71 70 70 70 69 69 69 69 69 69 68 68 68 68 68 68 68 68 68 68 68 68 68 68 69 69 69 69 69 70 70 70 71 71 71 71 71 71 71 71 72 72 72 73 73 73 73 73 74 74 73 73 73 73 73 73 73 72 73 73 72 72 72 72 72 72 72 72 72 72
4561 72 72 72 72 72 72 72 72 72 72 71 71 70 70 70 70 70 70 70 70 70 71 71 71 70 70 70 70 70 71 71 71 71 72 72 71 71 71 71 71 72 71 71 71 71 71 72 72 72 72 72 72 72 72 72 72 72 72 72 72 71 71 71 71 71 71 71 71 70 70 70
4554 70 70 70 70 70 70 69 70 70 70 70 70 70 69 70 70 71 71 71 71 71 71 71 71 72 72 72 73 73 73 74 74 74 74 74 74 75 75 75 75 75 75 75 75 74 74 74 74 74 74 73 73 73 73 73 73 73 72 72 72 72 72 72 72 72 72 72 72 72 71 71
4547 71 71 72 72 72 72 72 71 71 71 71 72 72 72 72 72 72 72 72 72 72 72 73 73 74 74 75 75 75 76 76 77 77 77 77 77 77 78 78 78 77 77 77 77 77 77 77 77 77 77 76 76 75 75 75 75 75 75 75 75 75 75 75 75 75 75 75 75 75 75 75
4539 75 75 75 75 75 75 75 75 76 76 76 76 76 76 76 76 76 75 75 75 75 75 75 75 76 76 76 77 77 77 78 78 79 79 80 80 81 81 81 82 82 82 82 83 83 83 82 82 82 81 81 81 81 81 80 80 79 79 79 79 79 79 79 79 80 80 80 80 80 79 80
4532 80 80 80 80 79 79 79 78 78 78 78 78 77 77 77 76 76 75 75 74 74 74 74 74 74 74 74 74 74 74 74 74 74 74 74 75 75 75 75 75 76 76 76 76 76 77 77 77 78 78 78 79 79 79 79 79 79 79 79 79 79 79 79 79 79 78 78 78 79 78 78
4524 78 78 77 77 76 76 76 76 76 76 76 75 75 74 74 74 73 73 73 73 72 72 72 72 72 72 72 72 72 72 72 72 71 71 71 71 71 72 72 72 72 72 72 71 71 71 71 71 72 72 72 72 72 72 72 72 72 72 72 72 72 71 71 71 71 71 71 71 71 71 71
4517 71 71 71 71 71 71 72 72 72 72 72 72 71 71 71 71 71 71 71 71 71 71 71 71 71 71 71 71 71 71 71 71 71 71 71 71 71 71 72 72 71 71 71 72 72 72 72 72 72 72 72 71 72 72 72 72 72 71 71 71 71 71 71 71 71 71 71 71 71 71 71
4510 71 71 71 71 71 71 70 70 70 70 70 70 70 70 70 70 70 70 70 70 70 70 70 70 70 70 70 70 70 70 70 70 70 70 71 71 71 71 71 71 71 71 71 71 71 71 71 71 71 71 72 72 72 72 72 72 72 72 72 72 72 72 72 72 72 72 72 72 71 71 71
4502 71 71 71 71 71 71 71 71 72 72 72 72 72 72 72 72 72 72 72 72 72 72 72 73 74 74 75 75 75 76 76 77 77 77 77 76 76 75 75 74 74 74 74 75 75 75 75 75 75 75 75 76 76 76 77 77 78 78 79 79 80 80 81 83 84 85 87 88 89 89 89
4495 89 89 88 87 86 85 85 84 84 84 84 85 85 86 88 89 90 92 93 94 95 97 98 100 101 103 105 107 110 114 119 123 127 130 132 132 130 127 123 119 115 111 106 103 100 97 95 93 92 91 91 91 91 90 90 90 89 88 87 86 85 85 84 84 84 84 84 85 86 86 87
4487 87 88 90 91 94 96 98 100 101 103 105 107 110 114 119 124 127 131 133 134 133 130 126 122 118 113 109 105 101 98 95 92 91 90 88 88 88 88 89 91 94 96 99 103 106 111 115 120 124 128 131 134 135 134 132 128 124 119 115 112 110 107 104 102 100 98 96 94 92 90 89
4480 89 88 87 85 84 84 83 83 83 83 84 85 86 86 87 89 89 90 91 91 91 91 92 92 94 96 98 100 103 107 111 115 119 123 126 129 130 130 129 127 124 120 115 112 108 106 104 102 100 98 97 95 93 91 89 88 86 85 84 83 82 81 81 80 80 81 81 82 83 83 84
4472 84 84 83 83 82 81 80 79 79 78 77 76 75 74 74 73 73 73 73 73 73 72 72 72 72 72 72 72 72 72 72 72 72 72 73 73 73 74 74 74 75 75 75 74 73 73 72 72 72 72 71 71 71 71 71 71 71 71 71 72 72 72 72 73 73 74 74 74 74 74 74
4465 74 74 74 74 74 73 73 73 73 72 72 72 72 72 72 72 72 72 72 71 71 71 70 70 69 69 69 69 69 69 68 68 68 68 68 68 68 68 68 68 68 68 68 68 68 68 68 69 69 69 69 70 70 70 70 70 70 71 71 71 71 71 71 71 71 71 71 71 71 71 70
4458 70 70 70 70 70 70 70 70 70 70 70 70 70 70 70 70 70 70 70 70 70 70 70 70 70 70 70 70 70 70 70 70 70 70 70 71 71 71 71 71 71 71 71 71 71 71 71 71 71 71 71 71 71 70 71 71 70 70 70 70 70 70 70 70 70 70 70 70 70 70 70
4450 70 70 70 70 70 70 70 70 70 70 71 71 71 70 70 70 70 71 71 71 71 71 71 71 71 71 71 71 71 71 71 71 72 72 72 71 72 72 72 72 71 71 71 71 71 72 72 71 71 71 71 71 71 71 71 70 70 70 70 70 69 69 69 69 69 69 69 69 69 69 69
4443 69 69 69 69 69 69 69 69 69 69 69 69 69 69 69 69 69 69 69 70 70 70 70 70 70 70 71 71 71 71 71 71 71 71 72 72 72 72 72 72 72 71 72 72 72 72 71 72 72 72 72 72 72 72 72 72 71 71 71 71 71 71 71 71 71 71 71 71 71 71 71
4435 71 70 70 70 70 70 70 70 70 70 70 70 70 70 70 70 70 70 70 70 70 70 70 71 71 70 70 70 70 70 70 70 70 70 71 71 70 70 70 70 70 70 70 70 70 70 70 70 70 70 70 70 70 70 70 70 70 70 71 71 70 70 70 70 70 70 70 71 71 70 70
4428 70 70 70 70 70 70 70 70 70 70 70 70 70 70 70 70 70 70 70 70 70 70 70 70 70 70 70 70 70 70 70 70 70 70 70 70 70 70 70 70 70 70 70 69 69 69 69 69 69 70 70 70 70 70 70 70 70 70 70 70 70 70 70 70 70 70 70 70 70 70 70
4420 70 69 70 70 70 70 70 70 70 70 71 71 71 71 71 71 70 70 70 70 70 70 70 70 70 70 70 70 70 70 70 70 70 70 70 70 70 70 70 71 71 71 71 71 71 70 70 70 70 70 70 70 70 70 70 70 71 71 70 70 70 70 70 70 70 70 70 70 70 70 69
4413 69 69 70 70 70 70 69 69 69 69 69 69 70 70 70 70 70 69 69 69 69 69 69 69 69 69 69 69 69 69 69 69 68 68 69 69 69 69 69 69 69 68 69 69 69 69 69 69 69 69 69 69 69 69 69 69 69 69 69 69 69 69 69 68 68 69 69 69 69 69 69
4406 69 69 69 69 69 69 69 69 69 69 69 69 69 69 69 69 69 69 70 70 70 70 70 70 70 70 70 70 70 70 70 70 70 70 70 70 70 70 70 69 69 69 69 69 69 70 70 70 70 70 70 70 70 70 70 70 69 69 69 70 70 70 70 70 70 70 70 70 71 71 70
4398 70 71 71 71 71 71 70 70 71 71 71 71 71 71 71 71 71 71 71 71 71 71 71 71 71 71 71 71 71 71 72 72 71 71 71 71 72 72 72 72 72 72 72 72 72 72 72 72 72 71 71 71 71 71 71 71 71 71 71 71 71 71 71 71 71 71 71 71 71 71 71
4391 71 71 71 71 71 71 70 70 71 71 71 71 71 71 71 71 71 71 71 71 71 71 71 71 71 71 70 70 71 70 70 70 70 70 70 70 70 70 70 70 70 70 70 70 70 70 70 70 70 70 70 70 70 70 70 70 70 70 70 69 69 69 69 69 69 70 70 70 70 70 70
4383 70 70 70 70 70 70 70 70 70 70 70 70 70 70 70 70 70 71 71 70 70 70 70 71 71 71 71 71 71 71 71 70 71 71 71 71 71 71 71 71 71 71 71 71 71 71 71 71 71 71 71 71 71 71 71 71 70 70 70 71 71 71 71 70 70 70 70 70 70 70 70
4376 70 70 70 69 69 69 70 70 69 69 69 69 69 69 69 69 69 69 69 69 69 69 69 69 69 69 70 70 69 69 69 69 69 69 69 69 69 69 69 69 69 69 69 69 69 68 68 68 69 69 69 69 69 70 69 69 69 69 69 70 70 70 70 70 70 69 69 69 69 70 70
4369 70 69 69 69 69 69 69 69 69 70 69 69 69 69 68 68 68 68 68 68 68 68 68 68 68 67 67 67 67 66 66 66 66 66 66 66 66 66 66 66 66 66 66 66 66 66 66 66 66 67 67 67 67 67 67 67 68 68 68 68 68 69 69 69 69 69 69 69 69 70 70
4361 70 69 69 69 70 70 70 70 70 71 70 70 70 70 70 69 69 70 70 70 70 70 70 70 70 70 70 70 70 70 70 70 70 69 69 69 70 70 70 71 71 71 71 70 70 70 70 70 71 71 71 71 71 71 72 72 72 72 71 71 72 72 72 72 72 72 72 72 72 72 72
4354 72 72 72 72 72 72 72 72 72 72 72 72 72 72 73 73 73 73 73 73 73 73 73 73 73 73 73 73 74 73 73 73 73 73 73 72 72 72 72 72 71 71 71 71 71 71 71 70 70 70 70 70 70 70 70 70 70 69 69 69 69 69 69 69 69 69 69 69 69 69 69
4346 69 69 69 69 69 69 69 69 69 69 69 69 70 70 70 70 70 70 70 70 70 70 70 70 70 69 69 69 69 69 69 70 70 70 69 69 69 69 69 69 69 68 68 67 67 67 67 67 67 67 67 67 66 66 66 66 65 65 65 66 66 66 66 66 66 66 66 67 67 67 67
4339 67 67 67 67 67 68 68 68 68 68 69 69 69 70 70 70 70 71 71 70 70 70 70 71 71 71 71 71 71 71 71 72 71 71 71 71 71 71 71 70 70 70 70 70 70 70 70 70 70 70 70 70 70 69 69 69 69 69 69 69 69 69 69 69 69 69 69 70 69 69 69
4331 69 69 69 69 69 69 69 69 69 69 69 69 70 70 70 70 70 70 71 70 70 70 70 70 70 70 70 70 70 70 71 71 71 71 71 71 71 71 70 70 70 70 71 71 70 70 70 70 70 70 70 70 70 70 70 70 70 70 70 70 70 70 70 70 70 70 70 70 70 70 70
4324 70 70 70 70 69 69 69 70 70 70 70 70 70 69 69 69 69 69 69 69 69 69 69 69 69 69 69 69 69 69 69 69 70 70 70 70 70 70 70 70 69 69 69 69 69 69 69 69 69 69 69 69 69 68 69 69 69 69 70 70 70 70 70 70 70 69 69 69 69 69 69
4317 69 69 69 69 69 69 69 69 69 69 69 69 68 68 69 69 69 70 70 70 70 70 70 69 69 69 69 69 69 69 70 70 70 70 70 70 70 70 70 70 70 70 70 70 70 70 70 70 70 70 70 71 70 70 70 71 71 71 70 70 70 69 69 69 69 69 70 70 70 70 70
4309 70 70 70 70 70 70 69 69 69 69 69 69 69 69 69 68 69 69 69 69 69 69 69 70 69 69 69 69 69 69 69 69 69 69 69 69 69 69 70 70 70 69 69 69 70 70 69 70 70 70 70 70 70 70 70 70 69 69 69 69 69 70 69 69 69 69 69 69 69 69 69
4302 69 69 69 69 69 69 69 69 69 69 69 69 69 69 69 69 69 69 69 69 69 69 69 70 70 70 69 69 70 70 70 70 70 70 69 70 70 70 70 70 70 70 70 69 69 69 69 69 69 69 69 69 68 68 68 69 69 69 69 69 69 69 69 69 69 69 69 69 69 69 70
4294 70 70 70 70 69 69 69 69 69 69 69 69 69 69 69 69 69 69 69 70 70 69 69 69 69 69 69 69 69 69 69 69 69 69 68 68 68 68 69 69 69 69 69 69 69 69 69 69 70 70 69 70 70 70 69 69 69 69 69 69 69 69 69 69 69 69 70 70 70 70 70
4287 70 70 70 71 70 70 70 70 70 70 70 69 69 69 69 69 69 69 69 69 70 70 70 70 70 70 70 69 69 69 69 69 69 69 69 70 70 70 70 70 70 70 70 70 69 69 69 69 70 70 70 70 70 70 70 70 70 69 69 69 69 70 70 70 70 69 69 70 70 70 70
4280 70 70 69 69 69 69 69 69 69 69 69 69 68 68 68 69 69 69 69 69 69 69 69 69 69 69 69 69 69 68 69 69 69 69 69 69 69 69 69 70 69 69 69 69 69 69 68 68 69 69 69 69 70 70 69 69 70 70 70 70 70 70 70 70 70 69 69 69 69 69 69
4272 69 69 69 69 70 70 70 70 70 70 70 70 70 70 70 70 70 70 70 70 70 70 70 70 70 70 70 70 70 70 70 70 70 70 70 70 70 70 70 70 70 70 70 70 70 70 70 70 70 70 70 70 70 71 71 71 71 71 71 71 70 70 70 70 70 71 71 71 71 71 71
4265 71 71 71 71 71 71 71 71 71 71 71 71 71 71 71 71 71 71 71 70 70 70 70 71 71 71 71 71 71 71 71 71 71 71 71 71 71 71 71 70 70 70 70 70 70 70 70 70 70 70 70 70 70 70 70 70 70 70 70 70 70 70 70 70 70 70 70 70 70 70 70
4257 70 70 70 70 69 69 69 69 69 69 69 69 69 69 69 69 69 69 69 68 68 68 68 68 68 68 68 69 68 68 68 68 68 68 68 68 68 68 68 68 68 68 68 68 68 68 68 68 68 68 68 68 67 67 68 68 69 69 69 69 69 69 69 69 68 69 69 69 69 69 69
4250 69 69 69 68 68 68 68 68 68 68 68 68 69 69 69 69 69 69 69 69 69 69 69 69 68 68 68 69 69 69 69 69 69 69 70 70 70 70 70 70 70 71 71 71 70 70 70 70 70 70 70 70 70 71 71 71 71 71 71 71 71 71 71 71 71 71 71 71 71 71 71
4242 71 71 71 72 72 72 72 72 72 72 72 72 72 71 71 71 71 71 71 71 71 71 71 71 72 72 72 72 72 71 71 71 71 71 70 70 70 70 70 70 70 69 69 69 69 69 69 69 69 69 69 69 69 69 70 70 70 70 70 70 70 70 71 71 71 71 71 71 71 71 71
4235 71 71 71 71 72 72 71 71 71 71 71 71 71 71 71 71 71 71 70 70 70 70 70 70 70 69 69 69 69 69 69 69 69 69 69 69 68 68 68 68 68 69 69 69 69 69 69 69 69 68 68 68 69 69 69 70 70 70 70 70 70 70 70 70 70 71 71 71 71 71 70
4228 70 70 70 70 70 70 70 71 70 70 70 71 71 71 71 71 71 70 71 71 71 71 71 70 70 70 71 71 71 70 70 70 71 71 71 71 70 70 70 71 71 70 70 70 70 70 70 70 70 70 70 70 70 70 71 70 70 70 70 70 70 70 70 69 69 69 69 69 69 69 70
4220 70 70 70 69 69 69 69 69 70 70 70 70 70 69 70 70 70 70 70 70 70 70 70 70 70 70 70 70 70 70 70 70 70 70 70 70 70 71 71 71 71 71 71 71 71 71 71 71 71 71 71 71 71 70 70 70 70 71 71 71 70 70 71 71 71 71 71 70 70 70 70
4213 70 71 71 71 71 71 70 70 70 71 71 71 71 71 71 71 71 71 71 71 70 70 70 70 70 71 71 71 71 71 71 71 71 71 71 71 71 71 71 70 71 71 71 71 71 71 71 72 72 71 71 71 71 71 71 71 71 71 71 71 70 70 70 71 71 71 71 71 71 71 71
4205 71 71 71 71 71 71 71 71 71 71 71 71 70 70 70 70 70 70 70 69 69 69 69 69 70 70 69 69 69 69 70 70 70 70 70 70 70 70 70 70 70 70 70 70 70 70 70 70 71 71 71 71 71 71 72 72 72 72 73 73 73 74 74 75 76 77 78 79 80 81 81
4198 81 81 82 82 80 79 78 77 77 76 75 74 74 73 73 72 72 72 72 72 72 72 72 72 72 72 72 72 72 72 72 72 72 72 72 72 72 72 72 73 72 72 73 73 73 73 74 75 75 76 76 77 79 81 83 86 89 91 93 94 95 95 94 92 90 87 85 84 82 80 79
4191 79 78 78 77 77 76 76 76 76 76 76 76 76 76 77 77 78 78 78 79 80 81 82 83 84 85 85 85 85 85 84 83 82 81 80 79 78 78 78 78 78 78 78 79 80 81 82 83 84 84 85 84 84 83 82 81 80 79 78 78 77 77 77 77 77 76 76 76 76 76 77
4183 77 77 77 78 79 80 81 83 85 87 90 92 95 98 101 103 104 104 105 104 103 101 99 97 95 92 90 87 86 84 83 82 81 79 79 78 77 77 76 76 76 76 76 76 76 75 75 75 75 75 75 75 75 75 75 75 75 75 75 75 76 76 77 77 78 79 79 80 82 84 86
4176 86 87 90 92 95 98 101 103 105 106 107 107 106 104 102 99 96 94 91 89 87 84 83 81 81 80 79 79 79 78 78 78 78 78 78 78 79 79 79 80 81 81 82 83 84 85 86 87 87 86 86 85 84 83 82 81 81 80 80 80 79 79 79 79 80 81 82 83 84 85 86
4168 86 86 86 86 85 84 83 82 80 79 78 77 77 76 76 75 75 75 76 76 76 76 77 77 77 78 79 81 82 83 85 87 90 93 96 97 99 100 100 99 98 96 94 91 89 87 85 84 82 81 80 80 79 78 77 77 77 77 77 77 76 76 76 76 76 75 75 75 74 74 74
4161 74 74 74 74 75 75 75 75 75 76 76 76 76 76 76 77 77 78 79 80 81 82 83 84 85 86 86 86 86 86 85 84 83 83 82 81 81 80 79 78 78 77 77 77 77 77 77 76 76 76 76 76 76 76 76 77 77 77 78 77 77 77 76 76 76 76 76 76 75 75 75
4153 75 75 75 75 75 75 75 75 75 75 75 75 76 75 75 75 75 76 75 75 75 75 75 75 75 75 75 75 75 75 75 74 75 75 75 75 75 75 75 75 75 76 76 76 76 76 76 77 77 78 78 79 79 80 80 81 81 80 81 80 80 80 81 80 80 80 80 80 80 80 80
4146 80 81 81 81 81 81 81 81 81 81 81 81 81 82 82 82 82 82 81 81 81 81 81 81 81 81 82 82 82 82 83 83 82 83 83 84 85 86 86 87 87 88 88 87 87 86 86 85 85 84 84 83 83 83 83 84 84 84 84 83 83 83 83 83 82 82 82 81 81 81 81
4139 81 81 80 80 81 81 82 82 83 83 83 83 83 83 83 83 83 83 84 84 85 86 86 86 87 87 87 87 87 87 87 87 87 87 86 86 85 84 83 81 80 80 79 79 80 81 81 82 84 84 85 86 86 86 86 86 85 85 85 85 84 84 84 85 86 87 88 89 90 91 91
4131 91 92 92 92 92 92 91 91 91 92 92 93 93 94 95 95 94 94 95 96 96 96 96 96 95 94 93 91 90 89 88 88 88 89 91 92 95 97 100 103 104 106 108 109 111 112 113 114 116 117 118 119 121 124 126 128 131 134 137 139 142 145 147 149 152 155 158 162 167 173 180
4124 180 188 197 207 218 231 246 262 281 303 327 356 391 434 487 553 636 739 865 1017 1192 1382 1576 1757 1907 2012 2058 2043 1966 1840 1681
4121 1681 1507 1334 1171 1025 897 788 698 624 563 513 473 440 414 393 376 362 351 342 334 328 322 318 314 311 310 310 312 315 321 330 341 355 372 393 418 447 479 517
4117 517 561 612 673 747 839 954 1101 1287 1523 1816 2167 2569 3003 3435 3823 4126 4309 4353 4251 4014 3677 3286 2885 2505 2161
4114 2161 1861 1607 1397 1228 1093 987 905 841 793 759 736 722 718 723 738 764 803 857 930 1025 1146 1294 1467 1658 1854 2039 2195 2304
4111 2304 2356 2346 2276 2155 2003 1838 1677 1530 1404 1304 1230 1185 1171 1188 1239 1326 1449 1606 1789 1985 2174 2335 2448 2499 2479 2391 2243
4108 2243 2057 1855 1657 1474 1312 1174 1060 969 901 851 818 798 791 794 809 834 870 918 980 1060 1161 1291 1457 1669 1938 2274 2681 3156
4105 3156 3680 4224 4749 5210 5571 5808 5903 5852 5672 5394 5051 4665 4251 3822 3395 2987 2614 2282 1993 1747 1539 1367 1224 1107
4103 1107 1011 932 867 813 767 729 697 669 645 625 608 593 581 571 564 560 560 563 572 585 602 625 653 688 729 779 838 910 997 1104 1236 1400 1604 1853
4099 1853 2154 2507 2907 3345 3806 4277 4739 5172 5547 5836 6014 6064 5978 5753 5396 4932 4407 3873 3365 2907 2506 2164 1878 1645
4096 1645 1457 1307 1189 1096 1024 968 927 898 881 874 878 893 919 961 1020 1102 1209 1344 1507 1693 1893 2090 2267 2406 2491 2513 2471 2371 2226
4093 2226 2058 1884 1719 1573 1450 1354 1289 1254 1252 1286 1357 1468 1617 1801 2007 2216 2406 2555 2643 2657 2595 2462 2275 2059 1838 1627
4091 1627 1438 1274 1136 1024 936 868 819 784 763 753 754 765 786 819 863 922 999 1099 1230 1399 1616 1890 2227 2625 3070 3534 3977 4353
4088 4353 4620 4747 4719 4538 4226 3825 3388 2954 2550 2188 1873 1607 1386 1205 1058 938 841 762 697 644 601 565 534 508 486 465 447
4085 447 429 413 399 385 374 364 356 349 345 344 344 347 353 361 372 386 402 423 448 479 517 565 626 703 802 926 1079 1264 1476 1704 1934 2142 2308 2411
4081 2411 2439 2390 2266 2085 1872 1650 1435 1238 1064 914 789 684 599 529 472 426 388 356 330 307 289 273 260 248 238 228 219 211 203 195 187 180
4078 180 173 167 161 157 152 149 147 144 142 140 139 137 136 134 132 129 127 125 123 121 119 118 117 116 116 117 117 118 119 120 120 120 119 118 116 114 112 109 106 103 101 99 97 97 96 95 95 94 94 94 94 95 96 96 97 97 97 97 96 95 94 93 92 92 91 91 91 92 92
4070 92 93 94 94 94 94 93 92 91 90 90 89 88 88 87 87 87 88 89 89 90 91 91 92 92 91 91 90 88 86 85 83 81 80 79 79 78 78 77 78 78 78 78 79 79 79 79 79 79 79 79 78 78 78 77 78 78 78 79 79 80 80 80 80 80 79 79 78 77 77 76
4063 76 76 75 75 74 75 75 75 75 75 76 76 76 76 75 75 75 74 73 72 71 70 69 69 69 69 69 69 69 69 70 70 71 71 72 72 72 72 72 73 73 73 73 72 72 72 72 72 73 73 73 73 73 72 72 72 71 71 70 70 70 70 70 70 70 70 70 70 70 71 71
4056 71 71 70 70 70 70 70 70 70 70 69 69 69 69 69 69 69 70 70 70 69 69 70 70 70 70 70 70 70 70 71 70 70 70 70 70 70 70 70 70 70 70 69 69 69 69 68 68 68 68 68 68 68 68 68 69 69 69 68 68 68 69 68 68 68 69 69 69 69 69 68
4048 68 68 68 69 69 69 69 69 69 69 69 69 69 70 70 69 69 69 70 69 69 69 69 69 69 69 69 69 69 69 69 68 69 69 69 69 69 69 69 69 69 69 69 69 69 69 69 69 69 69 69 69 69 69 69 69 69 70 70 71 72 72 73 74 75 77 78 79 79 80 79
4041 79 79 79 78 77 76 75 74 74 73 73 72 72 72 71 71 71 71 71 71 71 71 71 71 71 71 72 72 72 71 71 71 71 72 72 72 72 72 72 72 73 73 73 73 73 73 74 74 75 76 77 78 80 82 85 87 89 91 92 92 92 91 89 87 85 83 81 80 78 77 76
4033 76 76 75 75 74 74 74 74 74 74 74 74 75 75 75 76 76 76 77 78 78 79 80 81 82 82 82 82 81 80 79 79 78 77 77 77 76 76 76 76 77 77 78 79 81 82 83 83 83 83 83 83 82 81 79 79 78 77 77 76 75 75 74 74 74 74 74 74 74 74 75
4026 75 76 76 77 78 79 81 82 84 86 89 92 95 98 100 102 102 102 101 100 98 96 94 91 89 86 84 82 81 79 78 77 76 75 75 74 74 74 73 73 73 73 73 73 72 73 73 73 73 73 72 73 73 73 73 73 73 73 73 73 74 74 75 75 76 77 78 80 82 84 86
4019 86 88 91 93 96 98 100 102 103 103 103 102 100 98 95 93 90 88 86 84 82 81 80 79 79 78 77 76 76 76 76 75 75 75 75 75 76 76 77 78 79 79 80 81 82 82 82 83 82 82 81 80 79 78 77 76 76 76 75 75 76 76 77 77 78 80 81 82 83 83 83
4011 83 83 82 81 80 79 78 77 76 75 75 74 74 74 74 74 74 74 73 73 73 73 73 74 74 75 76 77 79 80 83 85 88 90 92 93 94 94 94 93 91 88 86 84 82 80 79 77 76 75 75 74 74 74 74 73 73 73 73 73 72 72 72 72 72 71 71 71 71 71 71
4004 71 71 71 71 71 71 71 71 70 70 70 71 71 71 71 71 72 72 73 74 76 77 78 79 80 81 81 81 80 79 78 77 76 75 74 74 73 72 72 71 70 70 69 69 69 69 69 69 69 69 69 69 69 69 68 68 68 68 69 69 69 69 69 68 68 69 69 69 69 69 69
3996 69 69 69 69 69 69 68 68 68 68 68 68 68 68 68 68 68 68 68 68 68 68 68 68 68 68 68 67 67 67 67 67 67 67 67 68 68 68 68 68 68 68 68 68 67 67 67 68 68 68 67 67 67 68 68 68 68 68 68 68 68 68 68 68 69 69 69 69 70 69 69
3989 69 69 69 69 69 69 69 69 69 68 68 68 68 69 69 69 69 69 69 69 69 69 69 68 68 68 68 68 68 68 68 68 68 68 68 69 69 69 68 68 68 69 68 68 69 69 69 69 69 69 68 69 69 69 69 68 68 68 68 69 69 69 69 69 69 69 69 69 69 69 69
3981 69 69 69 68 69 69 69 69 69 69 69 69 69 69 69 69 69 69 69 68 68 68 68 69 69 69 69 69 69 69 69 69 69 69 69 69 68 68 68 68 68 68 68 68 69 68 68 68 68 67 67 67 67 67 67 67 67 67 68 68 68 68 69 69 69 69 68 69 69 69 69
3974 69 69 69 68 68 68 68 68 68 68 68 68 68 68 69 69 69 69 69 69 69 69 69 69 69 69 69 69 69 69 69 69 68 68 68 69 69 69 69 69 69 69 69 69 69 69 69 69 68 68 68 69 69 69 69 69 69 69 69 69 69 69 69 69 69 69 69 69 69 69 69
3967 69 69 69 69 69 69 69 69 69 69 69 69 69 70 70 70 70 70 69 69 69 69 69 69 69 69 69 69 68 68 68 68 69 69 69 69 69 69 68 68 68 69 69 69 69 69 69 69 69 69 68 69 69 69 69 68 68 68 69 69 69 69 69 69 69 68 68 68 68 68 68
3959 68 68 68 68 68 68 68 68 69 69 69 69 69 69 68 69 69 69 69 69 69 69 69 69 69 69 69 69 69 69 68 68 68 68 68 68 69 69 69 69 69 69 69 69 69 69 69 69 69 69 69 69 69 68 68 68 68 68 68 69 69 69 69 69 69 69 68 69 69 69 69
3952 69 69 69 69 69 69 69 69 69 69 69 69 69 69 69 69 68 68 68 68 68 68 69 69 69 69 69 68 68 68 68 68 68 68 68 68 68 68 68 68 68 68 68 68 68 68 68 68 68 68 68 68 68 69 69 69 69 69 68 69 69 69 70 69 69 69 69 69 69 69 69
3944 69 69 69 68 68 69 68 68 68 68 68 67 67 67 67 67 67 67 67 67 67 67 67 68 68 68 68 68 68 68 68 68 68 68 68 68 68 68 68 68 68 68 69 69 69 69 69 69 69 69 69 69 69 69 69 68 68 68 68 68 68 68 68 68 68 68 68 68 68 68 68
3937 68 68 68 68 68 68 68 68 68 67 67 68 68 68 68 68 68 68 69 69 69 69 68 68 68 68 68 68 68 68 69 69 68 68 68 68 68 68 68 69 69 69 68 68 68 68 68 68 68 68 68 68 68 68 68 68 68 69 69 69 69 69 69 69 69 69 69 69 69 69 69
3930 69 69 69 69 69 69 69 69 69 69 69 69 69 69 69 69 69 69 69 69 69 68 68 68 68 69 69 68 68 68 68 68 68 68 68 68 69 69 68 69 69 69 69 69 70 69 69 69 69 70 69 69 69 69 69 70 70 70 71 71 71 70 70 70 70 70 70 71 71 71 70
3922 70 70 70 70 70 70 69 69 69 70 70 69 69 69 69 69 68 68 68 68 68 68 67 67 67 68 68 68 68 68 68 68 68 68 68 68 68 68 68 68 68 68 68 68 68 68 69 69 69 69 69 68 68 68 68 68 67 67 67 67 67 67 67 67 67 67 68 68 67 67 68
3915 68 68 67 67 67 67 68 68 68 68 68 68 68 68 68 68 68 68 68 68 69 69 69 69 69 69 69 69 69 69 69 69 69 69 68 68 68 68 68 68 68 68 68 68 68 68 68 68 68 67 67 67 68 68 67 67 67 67 67 67 67 67 67 67 67 67 67 67 67 67 67
3907 67 67 67 67 67 67 67 67 67 67 67 68 68 68 67 67 67 67 67 67 67 67 67 67 67 68 68 68 68 68 69 68 68 68 68 68 68 68 68 68 68 68 68 68 68 68 69 69 69 69 69 68 68 68 68 69 69 69 69 69 69 69 68 68 68 68 68 68 68 68 68
3900 68 68 67 68 68 68 68 68 68 68 68 68 68 68 68 67 67 67 67 67 67 67 67 67 67 67 67 67 67 67 67 67 67 67 67 67 67 67 68 68 68 68 68 68 68 67 68 68 68 69 69 69 69 69 69 69 69 69 69 69 69 69 69 69 69 69 70 70 70 69 69
3892 69 69 69 69 69 69 69 70 70 70 70 69 69 70 70 70 69 69 69 69 69 69 69 69 69 69 69 69 69 69 68 68 68 68 68 68 68 68 68 68 67 67 67 67 67 67 67 68 68 68 68 68 68 68 68 68 68 68 68 68 68 68 68 68 68 68 68 68 68 68 68
3885 68 68 68 68 68 68 68 68 68 68 68 68 68 68 68 69 69 69 69 69 69 69 68 68 68 68 69 69 69 69 69 69 69 68 68 68 68 68 68 68 67 68 68 68 68 68 69 69 69 68 68 68 68 68 68 68 68 68 68 68 68 68 69 69 69 68 68 68 68 68 68
3878 68 68 68 68 68 68 68 68 69 69 69 69 69 69 69 69 69 70 70 70 70 70 70 71 71 71 71 71 71 71 70 70 71 71 70 70 70 70 70 70 71 70 70 70 70 70 70 70 70 70 69 69 69 69 68 68 69 68 68 68 68 68 68 68 68 69 68 68 68 68 67
3870 67 67 67 68 68 68 68 68 68 69 69 69 69 69 69 69 69 69 69 69 70 70 70 70 70 70 70 70 69 69 70 70 70 70 70 70 70 70 70 70 70 70 70 71 70 70 70 70 70 70 71 71 71 71 70 70 70 70 70 70 70 70 70 70 70 70 70 71 71 71 71
3863 71 71 71 71 71 71 70 70 70 70 70 70 70 70 70 70 69 69 69 69 69 69 69 69 69 68 68 68 68 68 68 67 67 67 68 67 67 67 67 67 67 67 66 66 67 67 67 67 67 66 66 66 66 66 66 66 66 66 66 67 67 67 67 67 67 66 66 66 66 66 66
3855 66 66 67 66 66 67 66 66 66 66 66 67 67 67 67 68 68 67 67 67 68 68 68 68 68 68 68 68 68 67 67 67 67 67 68 68 68 68 67 67 67 67 67 67 67 67 67 67 67 67 67 68 68 68 68 67 67 67 68 68 67 67 67 67 67 67 67 67 67 67 66
3848 66 67 67 67 67 67 67 68 68 68 68 67 68 68 68 68 68 68 68 68 69 69 69 68 68 68 68 69 69 69 69 69 69 69 69 69 69 69 69 69 69 69 69 70 70 70 70 70 70 70 70 70 70 70 69 69 69 69 69 69 69 69 69 69 69 69 69 68 68 68 68
3841 68 68 69 69 69 69 69 69 69 69 69 69 69 69 69 69 69 69 69 69 69 69 69 69 69 69 69 68 68 68 68 68 68 67 67 67 67 67 67 67 67 67 67 67 67 67 67 67 67 67 67 67 67 67 67 67 67 67 67 67 67 67 67 67 67 68 68 68 68 67 67
3833 67 67 67 67 68 68 67 67 67 67 67 67 67 67 67 67 67 67 67 67 67 66 66 67 67 67 67 67 67 67 67 67 67 67 66 67 67 67 67 67 67 67 67 67 67 68 68 68 68 68 68 68 68 68 69 69 68 69 69 69 69 69 69 69 69 69 69 69 69 69 69
3826 69 69 69 69 69 69 69 68 68 68 69 69 69 69 69 69 69 69 69 69 69 69 69 69 69 69 69 69 69 69 69 69 69 69 69 69 69 69 69 69 69 69 69 69 69 69 69 68 68 68 68 68 68 68 68 68 68 69 68 68 68 69 68 68 68 68 68 68 68 68 68
3818 68 68 68 68 68 68 68 68 68 68 68 68 68 68 68 68 68 68 68 68 68 68 68 68 68 69 69 69 69 69 69 69 69 69 69 69 69 69 69 69 70 69 69 69 69 68 69 69 69 69 69 69 70 70 70 69 69 69 68 68 68 68 68 68 68 68 68 68 68 68 68
3811 68 67 68 68 68 68 68 68 68 67 67 67 67 67 67 67 67 67 67 67 67 67 67 67 67 67 68 68 68 68 68 68 68 68 69 69 68 69 69 69 69 69 69 69 69 69 69 69 69 69 69 70 70 70 70 70 70 70 70 69 69 69 69 69 69 70 70 70 70 70 70
3803 70 69 69 68 68 69 69 69 69 69 69 69 69 69 69 70 70 69 69 69 69 69 68 68 68 68 69 69 69 69 69 69 69 69 69 69 69 69 69 69 68 68 68 68 68 68 68 68 68 68 68 68 68 68 68 68 68 68 68 68 68 68 68 68 68 68 68 68 68 67 67
3796 67 67 67 67 67 67 67 67 67 67 67 67 67 67 67 68 68 68 68 68 68 68 68 68 69 68 68 68 68 68 68 68 68 69 69 69 69 69 69 69 70 70 70 70 70 69 69 69 69 69 69 69 69 69 70 70 70 70 70 69 69 69 70 70 69 69 69 69 69 68 68
3789 68 68 69 69 68 68 68 68 68 68 68 68 68 68 68 68 68 68 68 68 67 67 67 67 67 67 67 67 67 67 67 67 67 68 68 68 68 68 68 68 68 68 68 68 68 68 68 68 68 68 69 69 69 69 69 69 69 69 70 70 70 70 70 70 70 70 70 70 70 70 70
3781 70 70 70 69 69 69 69 70 69 69 69 69 69 69 69 69 69 69 69 69 69 69 69 69 69 70 70 70 69 69 69 69 69 68 68 68 68 68 68 68 68 68 69 69 69 69 69 68 68 68 68 69 69 69 69 69 69 69 69 69 69 69 69 69 69 69 69 69 69 69 69
3774 69 69 69 69 70 70 70 70 70 70 70 70 70 69 70 70 69 69 69 69 69 70 70 70 70 69 69 69 69 69 69 70 70 69 69 69 69 70 70 70 70 70 70 70 70 70 70 70 70 70 70 70 70 70 70 70 70 70 71 71 71 71 71 70 70 70 70 71 71 71 71
3766 71 71 70 70 70 70 70 70 70 69 70 70 70 70 71 71 71 71 71 70 70 70 70 70 70 70 70 70 70 70 70 70 69 69 69 69 69 69 69 69 69 69 69 69 69 70 70 70 70 70 70 70 70 70 70 70 70 70 70 70 70 69 69 69 69 69 70 70 70 70 70
3759 70 70 70 70 70 71 70 71 71 70 70 70 70 70 70 70 70 70 70 70 70 70 70 70 70 70 69 69 70 70 70 70 70 70 70 70 69 69 69 69 69 70 70 70 70 70 70 70 70 70 70 70 70 70 70 70 70 70 70 70 71 71 71 71 71 71 71 71 71 71 71
3752 71 71 71 71 71 71 71 71 71 71 71 71 70 70 70 70 71 71 71 71 71 71 71 71 70 70 71 71 71 72 72 71 71 71 71 71 71 71 71 71 71 71 71 72 72 72 72 72 72 72 72 72 73 73 73 73 73 72 72 72 73 73 73 73 73 73 73 73 73 73 73
3744 73 73 74 74 73 73 73 72 73 73 73 73 73 73 73 73 73 74 74 73 73 73 73 73 72 72 72 72 72 72 72 71 71 71 71 71 72 72 72 71 71 72 72 72 71 71 71 71 71 71 72 72 72 72 72 72 72 72 73 73 73 73 73 73 73 73 74 74 74 74 74
3737 74 74 74 74 74 74 75 75 75 75 75 75 75 75 75 75 74 74 75 75 75 75 74 74 75 75 75 75 75 75 75 75 75 74 74 74 74 74 74 74 74 74 74 74 74 74 74 74 74 73 73 74 74 74 74 74 74 74 74 74 74 73 74 74 74 74 74 75 75 75 75
3729 75 75 75 75 75 75 75 76 76 76 76 76 76 76 76 76 76 76 76 76 76 76 76 76 76 76 76 76 76 76 76 77 77 77 76 76 76 76 76 76 77 77 77 77 77 77 77 78 78 78 78 78 78 78 78 78 77 77 77 77 77 77 77 77 77 78 78 78 78 77 78
3722 78 78 78 78 77 77 78 78 78 78 78 78 78 78 78 78 79 79 79 79 79 79 79 79 79 79 79 79 80 80 80 80 80 80 80 79 80 80 80 80 80 80 80 80 80 80 80 80 80 80 80 80 80 80 80 80 80 81 81 81 81 81 81 82 81 81 81 81 81 81 81
3714 81 82 82 82 82 82 82 82 82 82 82 82 82 83 83 83 83 83 84 84 84 84 85 85 86 86 86 86 87 87 86 86 86 86 87 87 87 87 87 87 88 88 88 88 88 88 88 89 89 89 89 88 88 88 88 88 89 89 89 89 89 89 89 89 89 89 89 89 89 89 89
3707 89 90 90 89 89 89 89 89 90 90 91 91 91 91 92 93 93 95 96 99 101 103 105 107 108 109 108 107 105 103 101 100 98 97 96 96 95 95 95 95 95 95 95 95 94 94 94 95 95 95 95 95 95 95 95 95 95 95 95 95 96 95 95 95 95 95 95 95 95 95 95
3700 95 95 96 96 96 96 96 96 97 97 97 97 97 97 97 97 97 97 97 97 98 98 98 98 98 99 98 98 98 98 98 99 99 99 99 99 100 99 99 99 99 100 100 100 100 100 100 100 100 100 101 101 101 101 102 102 102 101 102 102 102 102 102 102 102 102 103 103 103 103 103
3692 103 103 104 104 104 104 104 104 104 105 105 105 105 105 104 104 105 105 105 105 105 105 105 105 106 106 106 106 106 106 106 106 106 106 106 107 107 107 108 108 108 109 109 109 109 109 109 109 108 108 108 108 108 109 109 109 109 109 109 109 109 108 108 108 109 109 109 109 109 109
3685 109 109 109 109 109 110 110 110 110 110 110 110 110 110 110 110 110 110 110 110 110 110 110 110 110 110 110 111 111 111 110 110 110 110 111 111 111 111 111 111 111 111 111 111 111 111 111 111 111 112 112 112 112 112 113 112 112 112 113 113 113 114 114 114 114 114 114 114 115 115
3678 115 115 115 115 115 116 116 115 116 116 117 117 117 117 118 118 118 118 118 117 117 117 117 117 118 118 118 118 118 118 118 119 119 119 119 119 119 118 118 118 118 117 117 117 116 116 117 117 117 117 117 117 117 117 116 116 116 116 116 116 116 116 116 116 117 117 117 117 117 117
3670 117 117 117 117 117 117 117 116 116 117 117 117 117 117 117 117 117 117 117 117 117 117 117 117 117 117 117 117 117 117 117 117 117 117 117 117 117 117 117 116 116 116 115 115 114 114 115 114 114 114 113 113 113 113 112 112 112 112 112 112 112 112 112 112 112 112 112 112 112 112
3663 112 112 112 112 112 112 112 112 112 112 112 113 112 112 112 112 112 112 112 112 112 112 113 113 113 113 113 113 113 113 113 113 113 113 114 114 114 114 114 114 114 114 114 114 114 113 113 113 113 113 113 113 114 114 114 114 114 114 114 113 113 113 112 112 112 112 112 112 111 111
3656 111 111 110 110 110 110 110 109 109 109 109 109 109 109 109 109 109 108 108 108 107 108 108 108 108 108 108 108 108 108 108 108 108 108 109 109 109 110 110 111 111 111 112 112 112 113 113 112 112 112 112 113 113 114 115 116 117 117 119 120 120 121 122 122 123 124 126 127 128 129
3648 129 130 132 134 135 137 139 140 142 144 145 146 147 148 149 149 149 149 149 149 150 151 151 151 151 150 150 148 147 145 143 141 139 137 135 133 132 130 129 128 126 124 123 121 119 118 116 115 114 113 112 111 110 109 109 108 108 108 107 107 107 107 107 107 107 107 106 106 106 106
3641 106 106 106 106 106 107 107 107 107 108 108 108 108 109 109 109 110 111 111 111 112 113 113 114 115 116 118 119 120 121 122 123 125 126 127 128 129 131 132 133 134 135 136 137 137 138 138 139 139 139 139 139 139 138 137 137 136 135 133 132 131 131 130 128 127 126 125 124 123 122
3634 122 121 120 119 119 118 117 117 116 116 116 116 116 116 117 117 117 118 118 118 118 118 117 117 116 116 116 117 117 118 119 119 120 120 120 120 119 118 117 117 116 115 115 114 115 115 115 115 115 115 114 114 113 112 112 111 110 109 109 109 108 108 108 108 107 107 107 106 106 106
3626 106 106 105 105 105 105 105 104 104 104 104 104 104 104 104 104 105 105 105 105 105 105 105 104 105 105 105 105 105 105 106 106 107 107 107 108 108 108 108 108 108 109 109 110 110 111 111 111 111 111 110 110 110 109 109 109 110 110 110 111 110 110 110 110 109 109 109 108 108 108
3619 108 108 108 108 107 107 107 107 107 107 107 108 108 108 109 109 110 110 110 111 111 112 113 113 115 116 117 118 119 120 122 123 124 125 126 127 128 130 131 132 134 135 136 137 138 139 140 140 140 141 141 141 141 141 141 141 141 141 141 141 140 140 139 138 136 135 133 132 131 129
3612 129 128 127 127 126 126 125 124 123 122 121 120 119 118 117 117 116 116 116 116 115 115 115 115 115 115 115 114 114 114 114 114 114 114 114 114 114 114 114 114 114 114 114 114 114 115 115 115 116 116 116 116 116 116 115 115 115 115 114 114 114 114 114 114 115 115 115 115 115 115
3604 115 114 114 114 114 114 114 114 114 114 114 114 114 115 115 116 116 116 115 116 116 116 116 116 117 117 117 117 117 117 118 118 119 119 119 120 120 121 121 122 122 123 124 124 125 126 127 128 129 130 132 133 134 135 137 138 139 141 143 145 147 148 150 152 154 156 157 159 160 161
3597 161 162 162 163 163 164 164 165 165 165 166 166 166 166 166 165 164 163 162 161 160 159 158 157 156 155 154 153 151 150 149 148 146 145 144 143 142 141 141 140 139 139 138 138 137 137 137 137 137 137 137 137 137 136 137 137 137 137 137 138 138 138 138 139 139 140 140 139 139 140
3590 140 141 141 142 142 142 143 143 142 142 142 142 142 143 144 144 144 145 145 145 145 145 145 145 144 145 145 146 146 146 147 148 148 149 149 150 150 150 150 150 151 151 151 152 152 153 154 154 155 156 156 157 157 158 158 159 159 160 161 162 162 163 163 164 165 166 167 167 168 169
3583 169 170 170 171 172 173 175 176 177 179 180 182 183 185 187 188 190 192 194 195 197 199 201 203 206 208 210 213 215 217 220 223 226 229 231 234 237 240 243 246 249 253 257 261 265 268 272 277 281 286 291 296 301 307 313 318 325 331 338 345 352 359 367 375 383 391 400 408 417 425
3575 425 434 443 453 463 474 485 497 509 522 536 549 564 579 596 613 632 652 673 696 721 748 778 810 844 882 923 968 1018 1073 1134 1202 1277 1361 1455 1560
3572 1560 1676 1805 1949 2107 2279 2464 2661 2868 3084 3306 3533 3765 4001 4242 4489 4743 5003 5267 5532 5791 6036 6260 6459
3569 6459 6627 6763 6870 6951 7010 7052 7081 7097 7100 7086 7050 6985 6889 6758 6593 6398 6179 5941 5692 5440 5187 4938 4692 4450 4210 3973 3739
3566 3739 3509 3283 3064 2855 2657 2473 2303 2148 2008 1882 1769 1668 1579 1501 1431 1370 1317 1270 1229 1194 1163 1137 1115 1097 1083 1072 1065 1060 1059 1061
3563 1061 1066 1075 1087 1102 1122 1145 1172 1204 1241 1284 1333 1388 1452 1524 1606 1698 1803 1920 2050 2195 2353 2524 2706 2899 3100 3308 3520 3737 3957
3560 3957 4183 4414 4653 4897 5146 5394 5636 5866 6076 6261 6416 6541 6637 6707 6757 6791 6812 6821 6817 6797 6756 6688 6589 6458 6294 6100 5883
3557 5883 5649 5404 5155 4907 4662 4420 4182 3946 3713 3481 3253 3030 2813 2606 2409 2226 2056 1901 1759 1631 1516 1413 1320
3555 1320 1237 1161 1093 1031 976 925 880 838 800 766 734 706 681 657 636 616 597 580 564 549 535 523 511 500 489 479 469 461 452 444 436 429 423 416 411 405 400 395 389 384 379
3550 379 374 368 364 360 356 353 350 347 345 342 340 338 336 334 333 331 330 330 329 329 329 330 331 331 332 333 334 336 337 339 341 343 346 348 351 355 358 361 365 368 372 377 381 386 391 396 401 407 414 421 428 436 444 453 462 472 482 493 504 517 530 543
3544 543 558 573 590 607 626 647 670 694 720 747 777 809 844 882 924 970 1021 1076 1138 1207 1283 1367 1461 1566 1683 1811 1952 2104 2268 2440 2620
3540 2620 2804 2990 3176 3360 3544 3727 3914 4106 4308 4523 4750 4989 5233 5476 5708 5918 6099 6242 6346 6411 6442 6449 6441 6426 6413 6405
3538 6405 6401 6397 6386 6359 6307 6221 6100 5941 5750 5534 5300 5058 4817 4583 4360 4148 3948 3756 3571 3390 3209 3030 2850 2672 2497 2327
3535 2327 2164 2010 1867 1733 1611 1500 1399 1307 1224 1150 1082 1021 966 916 870 829 791 756 724 694 667 641 618 596 577 559 542 526 512 498 485
3532 485 473 462 452 443 434 426 419 413 407 403 398 394 391 388 385 383 382 380 380 379 380 380 381 381 383 384 386 389 392 395 398 403 408 413 417 423 429 436 443 450 459 468 477 487 497 509 521 534 548 562 578 595 614 633 655
3526 655 678 702 729 758 789 822 859 900 944 993 1047 1107 1175 1250 1333 1426 1528 1641 1765 1901 2047 2203 2367 2537 2709 2883 3056 3227 3399
3523 3399 3571 3748 3933 4128 4336 4556 4785 5016 5242 5454 5641 5797 5915 5997 6044 6063 6064 6055 6044 6037 6035 6035 6033 6020 5987 5925 5830 5700 5536 5343
3520 5343 5130 4905 4676 4451 4234 4028 3833 3648 3470 3296 3123 2952 2780 2608 2439 2274 2115 1963 1821 1687 1564 1452 1348
3517 1348 1255 1171 1094 1025 963 907 856 810 767 729 693 660 629 600 573 549 526 504 484 466 448 431 415 401 387 374 362 351 340 329 319 310 302 293 285 278 271
3513 271 264 258 252 247 241 236 231 226 223 219 215 211 208 205 202 199 196 194 191 189 187 186 184 183 181 180 179 177 176 175 174 172 171 171 169 169 168 167 167 166 165 165 164 163 163 162 162 160 159 158 157 156 155 154 154 153 152 152 151 150 149 148 147 146 145 144 143 143 142
3506 142 141 140 139 138 137 137 136 135 134 134 133 133 132 132 132 131 130 129 128 128 127 126 125 124 124 123 122 121 120 120 119 118 117 116 115 114 113 111 110 109 108 107 106 105 104 103 102 101 100 99 98 97 96 95 94 94 93 93 92 92 91 90 90 90 90 90 89 89 88
3499 88 88 88 88 87 87 87 87 87 86 86 85 85 84 84 84 83 83 83 82 82 82 81 81 81 80 80 79 79 78 78 78 77 77 77 77 77 76 76 76 76 76 76 76 76 76 76 76 76 76 76 76 76 77 77 77 77 77 77 77 78 78 78 79 79 79 80 80 80 81 81
3491 81 82 82 83 83 84 85 85 86 87 87 88 88 89 90 91 93 94 95 97 98 99 101 102 103 104 105 106 107 108 110 111 112 113 113 113 114 114 114 114 114 113 112 112 111 110 108 106 105 103 102 101 100 98 97 95 94 93 91 90 89 88 87 85 84 83 82 81 81 80 79
3484 79 78 78 78 78 77 77 77 77 77 77 77 77 77 77 77 77 77 77 77 77 77 77 77 76 77 77 77 78 79 79 79 80 80 81 82 82 83 84 85 86 87 88 89 90 91 93 94 95 97 98 100 101 102 103 104 105 106 106 106 107 107 107 108 108 108 108 107 106 105 104
3476 104 103 102 102 100 99 97 96 95 93 92 90 89 88 87 85 84 83 82 81 80 79 78 78 77 77 76 76 76 75 75 75 74 74 73 73 72 72 72 72 71 71 71 71 71 70 71 71 71 71 70 70 70 70 70 70 70 69 70 70 70 70 70 70 70 70 70 70 70 70
3469 70 70 70 70 70 70 70 71 71 70 70 70 70 70 70 71 71 71 71 71 71 71 71 71 71 71 71 71 70 70 70 70 70 70 71 71 71 71 71 71 71 71 71 71 71 71 71 71 71 71 72 72 72 72 72 72 72 72 73 74 74 74 74 75 75 76 77 77 78 79 80
3462 80 81 82 83 84 85 86 87 88 89 91 92 93 95 96 97 98 99 100 101 102 102 103 103 103 103 104 104 104 104 104 103 103 102 102 101 101 100 99 97 96 95 94 93 92 91 90 89 88 87 86 85 84 83 82 81 81 80 79 78 77 77 76 76 76 75 74 73 73 73 72
3454 72 72 72 72 71 71 71 71 70 70 70 70 70 70 70 70 70 70 70 70 70 70 70 70 70 70 70 70 70 70 70 70 70 70 70 70 70 70 70 70 70 70 70 70 70 70 70 70 70 70 70 70 70 70 70 70 70 70 70 71 71 71 71 71 71 71 72 72 72 73 73
3447 73 73 73 73 73 74 74 74 74 74 74 75 75 75 75 76 76 77 78 78 79 80 81 81 82 83 84 85 86 87 88 89 90 91 92 93 94 95 97 98 98 99 99 100 100 100 101 100 100 100 100 100 100 99 99 99 98 97 96 95 94 93 91 90 88 87 86 85 84 83 82
3439 82 82 81 80 79 78 78 77 76 75 74 74 73 73 72 72 72 71 71 70 70 70 70 69 69 69 69 69 69 69 69 69 68 68 68 68 68 68 68 68 68 68 67 67 67 67 67 67 67 67 67 67 67 67 67 67 67 66 66 66 66 66 66 66 66 66 66 66 66 66 66
3432 66 66 66 66 66 66 66 66 67 67 67 67 66 66 66 66 66 66 66 66 66 66 66 66 66 66 67 67 67 67 67 67 67 67 67 67 67 67 67 67 67 67 67 66 66 66 66 66 66 66 66 66 67 67 67 66 66 66 66 66 67 67 66 66 66 66 66 66 66 66 66
3425 66 66 66 66 66 66 67 67 67 67 68 68 68 69 69 69 69 70 70 70 70 71 71 70 70 69 69 69 69 68 68 68 67 67 67 67 67 67 67 67 67 67 66 67 67 67 67 67 67 67 67 67 67 66 66 66 66 66 66 66 66 66 66 66 66 66 66 66 66 66 66
3417 66 66 66 65 65 66 66 66 66 66 66 65 65 65 65 65 65 65 65 65 65 65 65 64 64 64 65 65 66 66 66 66 67 66 66 66 66 67 67 67 67 67 67 67 67 67 67 67 68 68 67 67 67 67 68 68 68 68 68 68 67 67 67 67 67 67 67 67 67 66 66
3410 66 66 66 66 67 67 67 67 67 67 66 66 66 66 66 66 66 66 66 66 66 66 66 66 66 66 66 66 66 66 66 66 66 66 66 66 66 66 66 66 66 66 66 66 66 67 67 67 67 67 67 67 67 67 67 67 67 67 67 67 67 67 67 67 67 67 68 68 68 68 68
3402 68 67 67 67 67 68 68 68 68 68 68 68 68 67 67 67 67 67 67 67 67 67 67 67 66 66 67 67 67 67 66 66 66 67 67 67 67 67 66 66 67 67 67 68 68 67 68 68 67 67 67 67 67 67 67 68 68 68 68 68 68 69 69 69 69 69 69 69 69 70 70
3395 70 70 70 70 69 70 69 69 69 69 70 70 69 69 69 69 69 69 70 69 69 69 69 69 69 68 68 68 68 68 68 68 67 67 68 68 68 68 68 67 67 67 67 67 67 67 66 66 66 66 66 66 66 65 65 65 65 65 66 66 65 65 66 66 66 66 66 66 66 66 66
3387 66 66 66 66 66 66 66 66 65 66 66 66 66 67 67 67 67 67 67 67 67 68 68 68 68 68 69 69 69 69 69 69 68 68 68 68 68 68 68 69 68 67 67 68 68 68 68 68 68 68 68 68 67 67 67 67 67 67 67 67 67 67 67 67 66 66 67 67 67 67 66
3380 66 66 66 66 66 66 66 66 66 66 66 67 67 66 66 66 66 66 66 66 66 66 66 66 66 66 66 66 66 66 66 66 66 66 66 65 65 65 66 66 66 66 66 66 66 66 66 66 66 66 66 66 66 66 66 66 66 66 67 66 66 66 66 66 66 66 67 67 67 66 66
3373 66 66 66 66 66 66 66 66 66 66 66 66 65 65 65 65 65 65 65 65 65 65 65 65 66 66 65 65 65 66 66 66 66 66 66 66 66 66 66 66 65 65 65 65 65 65 65 65 65 65 65 65 65 65 65 65 65 65 65 65 65 65 66 66 66 66 66 66 65 65 66
3365 66 66 66 65 65 66 66 66 66 66 66 67 67 67 67 66 66 66 66 66 66 65 65 65 66 66 66 66 66 67 67 67 66 66 66 66 66 66 66 67 67 67 66 67 67 67 67 67 67 67 67 66 66 66 66 66 65 65 65 65 65 65 65 65 65 65 65 66 65 65 65
3358 65 65 65 64 64 64 65 65 65 65 65 65 65 65 65 65 65 65 65 65 66 66 66 66 66 66 66 66 66 66 66 66 66 66 66 66 67 67 67 67 67 67 67 67 67 67 66 66 66 66 66 67 67 66 66 66 67 67 66 66 66 66 66 66 65 65 65 65 65 65 64
3350 64 64 64 64 64 64 64 64 64 63 63 64 64 64 64 64 64 64 64 64 65 65 65 65 65 66 66 66 66 66 67 67 67 67 68 68 68 68 68 68 68 68 68 68 68 68 68 68 67 67 67 67 68 68 68 68 67 67 67 67 67 67 67 66 66 66 66 66 65 65 65
3343 65 65 65 65 65 65 65 65 65 66 65 65 65 65 65 65 65 66 66 67 67 67 67 67 67 67 67 67 67 67 67 67 67 67 67 67 67 68 68 68 68 68 68 68 68 68 68 68 68 67 67 67 67 67 67 67 67 67 67 67 67 67 67 67 66 66 66 66 66 66 66
3336 66 66 66 66 66 66 66 66 66 66 66 66 65 65 65 65 65 65 65 65 65 65 65 65 65 65 65 65 65 65 65 65 65 65 64 65 65 65 65 65 65 65 65 65 65 66 66 66 66 66 66 66 66 66 66 66 66 66 66 66 66 66 66 66 66 66 66 66 66 66 66
3328 66 65 65 65 65 65 65 65 65 65 65 65 65 65 65 65 66 66 66 66 66 66 66 66 65 65 65 65 66 66 66 66 66 66 66 66 66 66 66 66 66 66 66 66 67 66 66 66 66 66 65 66 66 66 67 67 67 67 67 66 66 66 66 66 66 66 66 66 66 66 66
3321 66 66 66 65 65 66 66 66 66 66 66 66 66 66 66 66 66 66 65 65 65 65 65 65 65 65 65 66 66 66 66 66 66 66 66 66 66 66 66 66 66 66 66 66 66 66 66 66 66 66 66 66 65 66 66 66 66 66 66 66 66 65 65 66 66 66 66 66 66 66 66
3313 66 66 66 66 66 65 65 65 65 65 65 65 65 65 65 65 65 65 65 65 65 65 65 65 65 65 65 65 65 65 65 65 65 65 65 65 65 65 65 65 65 65 65 65 65 65 65 66 66 66 66 66 66 66 66 66 66 66 66 66 66 66 67 67 67 67 67 67 67 67 67
3306 67 67 67 66 67 67 67 67 67 67 67 67 67 66 66 66 66 66 66 66 66 66 66 66 66 66 66 66 66 66 66 66 66 66 66 66 66 66 66 66 66 66 66 66 66 66 66 66 66 66 66 66 66 66 66 66 66 67 66 66 67 67 67 67 67 67 67 67 67 67 67
3298 67 67 67 67 67 67 67 67 67 67 66 66 66 67 67 67 66 66 66 66 66 66 66 66 66 65 65 65 65 65 65 65 65 65 65 65 65 65 65 64 65 65 65 65 65 65 65 65 65 65 65 65 65 65 65 66 66 66 66 66 66 66 66 66 66 66 67 66 66 66 66
3291 66 66 66 66 66 66 67 67 67 67 67 67 66 66 66 66 66 66 66 66 66 66 66 66 66 66 66 66 66 66 66 66 66 66 66 66 66 66 66 66 66 66 66 66 66 66 67 67 66 66 66 65 66 66 66 66 66 67 67 67 67 67 66 66 66 66 66 66 66 66 65
3284 65 65 65 65 66 66 66 66 66 66 66 66 66 66 66 65 65 65 65 65 65 65 65 65 65 65 65 65 65 65 65 65 65 65 65 65 65 65 65 65 65 65 65 65 65 65 65 65 66 66 66 66 65 65 65 65 65 65 65 65 65 65 65 65 65 65 65 65 65 65 65
3276 65 65 65 65 65 65 65 65 65 65 65 65 65 65 65 65 65 65 65 65 65 65 65 65 65 65 65 64 64 64 64 64 64 64 64 64 64 64 64 64 64 64 64 65 64 64 64 64 65 65 65 65 65 66 66 66 65 65 65 65 66 66 66 66 66 66 65 65 66 66 66
3269 66 66 66 66 66 66 66 65 65 65 65 65 65 65 65 65 65 65 65 65 65 65 65 65 65 65 65 65 65 65 65 65 65 65 65 65 65 65 65 65 65 65 65 65 65 65 65 65 65 65 66 66 66 66 66 66 66 66 67 67 67 66 66 66 66 66 66 66 66 66 66
3261 66 66 66 66 66 66 66 66 66 66 66 66 66 66 66 66 66 66 66 66 66 66 67 66 66 66 67 66 66 66 66 66 66 66 66 66 66 66 66 66 66 66 66 66 66 67 67 66 66 66 66 66 66 66 66 66 66 66 67 66 66 66 66 66 66 65 65 65 65 65 65
3254 65 65 65 65 65 65 65 65 66 66 67 67 67 67 67 67 67 67 67 67 67 67 67 67 67 67 67 67 67 67 67 67 67 66 66 66 66 66 66 66 66 66 66 66 66 66 66 66 66 65 65 65 65 65 65 65 65 65 65 65 65 64 64 64 64 65 65 65 65 65 65
3247 65 65 65 65 65 65 65 65 65 65 66 66 66 66 66 66 66 66 66 66 66 67 67 67 67 67 68 68 67 67 67 67 67 67 67 67 67 67 67 67 67 67 67 66 66 66 66 66 66 66 66 66 66 65 65 65 65 64 64 65 65 65 64 65 65 65 65 65 65 65 65
3239 65 65 66 66 66 66 66 65 65 65 66 66 66 66 66 66 66 66 65 66 66 66 66 67 67 67 67 67 67 67 68 68 68 68 68 68 67 67 67 66 66 67 67 66 66 66 66 66 66 66 66 66 66 66 66 66 66 65 65 66 66 66 66 66 65 65 65 65 65 65 65
3232 65 66 66 66 66 65 65 65 65 66 66 66 66 66 67 67 67 67 67 67 67 68 68 68 69 69 70 70 71 71 71 71 71 71 72 71 71 71 70 70 69 69 69 68 68 68 68 68 67 67 67 66 66 66 66 66 66 66 66 66 66 66 66 66 66 66 66 66 66 66 66
3224 66 66 66 66 66 66 66 66 66 66 66 66 66 66 66 66 66 66 66 67 67 67 67 67 67 67 67 67 67 68 68 68 68 68 67 67 67 67 67 67 67 67 68 67 67 67 67 67 67 67 67 67 67 66 66 66 66 66 66 66 66 66 66 66 66 66 66 66 66 65 65
3217 65 65 64 65 65 65 65 65 65 66 66 65 65 65 66 66 65 66 66 66 66 66 67 67 67 67 67 68 68 68 68 69 69 69 69 69 70 69 69 69 69 69 69 69 69 69 70 69 70 70 69 69 69 69 69 69 68 68 68 68 68 68 68 67 67 67 66 66 66 66 66
3209 66 66 66 66 66 66 65 65 65 65 65 65 65 65 65 65 65 65 65 65 65 65 65 65 65 65 66 66 66 66 66 66 66 66 66 66 66 66 66 66 66 66 66 66 67 67 67 67 67 67 66 66 65 65 65 65 66 66 66 66 66 66 66 66 66 66 65 65 66 66 66
3202 66 66 65 65 65 65 65 65 65 65 65 65 65 65 64 64 65 65 65 65 65 65 65 65 65 66 66 66 66 66 66 66 67 67 67 67 67 67 67 67 67 67 67 67 68 68 68 68 68 68 68 68 68 68 68 68 69 69 70 69 69 69 69 69 68 68 68 68 69 69 69
3195 69 69 69 69 69 68 68 68 68 67 67 67 67 67 67 67 67 67 67 67 67 67 67 67 67 66 67 67 67 67 67 67 67 67 67 67 66 67 67 67 67 67 67 67 67 67 67 67 66 66 66 66 66 66 66 66 66 66 66 66 66 67 67 66 67 67 66 66 67 67 67
3187 67 67 67 67 67 67 67 67 67 67 67 67 67 66 66 66 66 67 66 66 66 67 66 66 67 67 67 67 67 67 67 67 67 67 67 67 67 67 67 67 67 67 66 66 66 66 66 66 66 66 66 66 66 67 67 66 66 66 66 66 66 66 66 66 67 67 67 67 66 66 66
3180 66 66 66 67 67 67 67 67 67 67 67 67 67 67 67 67 67 67 67 67 66 66 66 66 66 67 67 66 66 67 66 66 66 66 66 66 66 66 66 66 66 66 66 66 66 66 66 66 66 66 67 67 66 67 67 67 67 67 66 66 66 66 66 66 66 66 66 66 66 66 67
3172 67 67 67 66 66 66 66 66 66 66 66 66 66 66 66 66 66 67 67 66 67 67 67 67 67 67 67 67 67 67 67 67 67 67 67 67 67 67 67 67 67 67 67 67 67 67 67 67 67 67 67 67 66 66 67 67 67 67 67 67 67 67 67 67 67 67 67 67 66 66 66
3165 66 66 67 67 67 67 67 67 67 67 66 66 67 67 67 67 67 67 67 67 67 67 67 67 67 67 67 67 67 67 67 67 67 67 67 67 67 67 67 67 67 68 68 68 68 68 68 68 68 68 67 67 67 67 67 67 68 68 68 68 68 68 68 68 68 68 67 67 67 67 67
3158 67 68 68 68 68 68 68 67 67 67 68 68 68 68 68 68 67 67 68 68 68 68 67 67 68 68 68 68 68 68 68 67 67 67 67 67 67 68 68 68 68 68 68 68 68 68 68 68 68 68 68 67 67 68 68 68 68 68 68 68 68 68 68 68 68 68 68 68 68 68 68
3150 68 68 68 68 68 68 68 68 68 68 68 68 68 68 68 68 69 68 68 68 68 68 68 68 68 67 67 67 67 67 67 67 68 67 67 67 67 67 67 67 67 67 67 67 67 67 67 67 67 67 67 67 67 68 68 68 68 68 68 68 68 68 68 68 68 68 68 68 68 68 68
3143 68 68 69 69 69 68 68 68 68 68 68 68 68 68 67 67 67 67 67 67 67 67 66 67 67 67 67 67 67 67 67 67 67 67 66 66 66 66 66 66 66 66 66 66 66 66 66 66 65 65 66 66 66 67 66 66 66 66 66 66 66 66 66 66 67 67 67 67 67 67 67
3135 67 67 67 67 67 67 67 67 67 67 67 67 67 67 67 67 67 67 67 67 67 67 67 67 66 67 67 67 67 67 67 67 68 68 68 68 67 68 68 68 68 68 68 68 68 68 68 68 68 68 68 68 68 68 68 68 68 68 68 68 69 69 69 69 69 68 68 68 68 68 68
3128 68 68 69 68 68 68 68 68 68 68 68 68 68 68 68 68 68 68 68 68 68 68 68 68 68 68 68 68 68 68 68 68 68 68 68 68 68 68 68 68 68 68 69 69 69 69 69 69 69 69 69 68 69 69 69 69 70 70 70 69 69 69 69 69 69 69 69 69 69 69 69
3120 69 69 69 69 69 69 69 69 68 68 68 68 67 67 67 67 67 66 66 66 66 66 66 66 66 66 66 66 66 66 67 67 67 67 67 67 67 67 67 67 67 67 67 68 68 68 68 68 68 68 69 69 69 68 68 69 69 69 69 69 69 69 69 69 69 69 69 69 70 69 69
3113 69 69 69 69 69 69 68 68 68 68 67 67 67 67 67 67 66 66 66 66 66 66 66 66 65 65 65 65 65 65 66 66 66 66 66 66 65 65 65 66 66 66 66 67 67 67 67 67 67 68 68 68 69 69 69 69 69 70 70 70 70 70 70 70 70 70 69 70 70 70 70
3106 70 70 70 69 69 69 69 69 69 69 68 68 68 68 68 68 67 67 67 67 67 67 68 68 68 68 68 68 68 68 68 68 68 69 69 69 69 70 71 71 72 73 73 74 76 77 78 78 79 79 79 79 79 78 78 79 79 80 82 83 85 86 87 87 87 86 85 83 82 81 80
3098 80 80 79 79 79 79 79 79 79 78 77 76 75 74 74 73 73 72 72 71 71 71 72 73 74 74 75 76 77 78 78 79 79 79 79 79 79 79 79 80 81 82 83 85 86 87 88 88 87 86 84 83 82 81 81 80 80 80 80 80 80 80 80 79 78 77 76 76 75 74 74
3091 74 73 73 73 72 72 72 72 71 71 71 71 72 72 72 72 72 72 72 72 72 72 72 72 72 73 73 73 73 73 73 73 73 73 73 73 73 74 74 74 75 75 75 75 76 76 76 76 76 76 76 76 76 77 77 77 77 77 77 78 78 79 79 79 80 80 81 82 83 84 85
3083 85 86 87 88 90 92 94 96 99 102 106 110 114 118 122 126 130 134 137 140 143 146 149 152 155 158 161 164 165 166 167 166 166 164 161 159 157 154 152 149 146 144 141 138 135 132 128 124 121 118 115 112 110 108 107 106 105 104 105 105 105 105 105 106 107 108 110 112 115 118 122
3076 122 125 129 133 136 139 142 145 147 149 152 155 157 160 163 166 168 170 171 172 171 169 168 165 162 159 156 154 151 148 146 143 140 136 132 129 125 121 117 113 110 107 105 104 102 101 99 98 97 96 95 94 93 93 92 92 92 92 93 93 92 92 91 90 89 88 88 87 86 85
3069 85 85 85 85 85 84 84 84 83 82 82 81 81 81 81 81 81 81 81 81 81 81 81 81 81 81 81 81 81 80 80 80 80 81 81 81 81 80 80 80 80 80 81 81 80 80 80 80 81 81 81 81 81 81 81 81 82 82 82 82 82 82 82 81 81 81 81 82 82 82 82
3061 82 82 82 82 82 82 82 83 83 82 82 82 82 82 83 83 83 83 83 83 82 82 82 83 83 83 83 83 83 83 83 84 84 84 84 84 84 84 84 84 84 84 84 84 85 85 85 85 85 85 85 85 85 85 85 85 85 85 85 86 86 86 86 86 86 86 86 86 86 86 86
3054 86 86 86 86 86 86 86 86 86 86 87 87 87 88 88 88 88 88 89 89 89 89 89 90 90 91 91 91 92 92 93 93 94 94 94 94 94 94 94 94 95 95 95 95 94 94 94 94 94 94 94 94 94 94 94 94 94 94 94 95 94 94 94 95 95 95 95 95 95 95 96
3046 96 96 96 97 97 97 98 98 98 99 99 99 100 100 100 100 100 101 101 102 102 102 102 102 102 102 102 102 102 102 102 102 102 102 102 102 102 102 102 102 102 102 102 103 103 103 103 103 104 104 105 106 107 107 108 109 110 110 111 112 113 114 115 115 116 117 118 119 119 120 121
3039 121 121 122 122 122 122 121 121 121 121 121 121 120 120 120 120 119 118 118 118 118 117 117 117 117 116 116 116 116 115 115 115 115 116 116 117 118 118 119 120 121 122 123 124 125 126 126 127 128 128 129 129 130 130 130 131 131 131 132 132 132 132 132 132 131 130 129 128 127 126
3032 126 125 124 123 122 121 120 118 117 115 114 113 113 112 111 110 109 108 107 107 106 105 105 106 106 108 109 111 112 113 114 114 115 116 116 117 118 119 121 122 123 124 124 125 124 124 123 123 122 122 122 123 124 125 125 126 125 125 125 124 125 125 127 129 131 133 136 139 142 145
3024 145 148 151 154 157 160 162 165 168 171 175 179 183 188 193 198 203 209 214 219 224 229 233 238 243 248 254 260 267 273 280 288 295 302 308 315 321 328 335 342 350 359 368 378 389 399 410 421 432 444 456 468 482 497 514 532 551
3018 551 571 593 615 639 663 689 716 745 775 807 841 879 920 964 1012 1063 1118 1178 1242 1312 1386 1467 1554 1648 1751 1865 1990 2129 2284 2458 2653
3015 2653 2874 3124 3410 3737 4113 4547 5043 5608 6242 6942 7697 8489 9295 10088 10845 11546 12185 12763 13296 13805 14313 14840 15391
3013 15391 15959 16517 17030 17455 17754 17896 17869 17677 17343 16902 16394 15859 15328 14817 14329 13855 13375 12870 12324 11727 11081 10396 9690
3010 9690 8985 8303 7663 7077 6556 6102 5716 5396 5138 4937 4788 4688 4634 4624 4660 4744 4878 5069 5322 5645 6043 6521 7077 7708
3008 7708 8398 9128 9871 10601 11291 11923 12491 13002 13474 13932 14401 14902 15437 15994 16543 17041 17443 17706 17803 17723 17475 17085 16595 16048
3005 16048 15484 14934 14410 13912 13423 12924 12390 11806 11163 10464 9723 8960 8199 7461 6764 6121 5539 5020 4562 4161 3810 3503 3234
3003 3234 2996 2785 2596 2426 2273 2134 2009 1895 1792 1698 1612 1532 1459 1391 1327 1268 1212 1160 1112 1067 1025 986 949 915 884 855 828 803 780 759
3000 759 739 720 703 686 669 653 637 622 608 594 582 570 559 549 539 530 521 513 504 496 488 480 473 466 461 455 450 446 442 438 434 429 425 420 416 412 407 404 400 397 394 391 388 385 383 380 377 374 371 367 363 360 356 352
2994 352 349 345 342 339 337 334 332 329 327 324 320 317 313 308 303 299 294 290 287 284 281 279 276 274 271 268 264 261 258 255 252 250 248 247 246 245 243 242 239 237 235 233 231 229 227 226 224 222 221 218 216 214 211 208 205 202 198 195 192 190 187 184 181 179 176 173 169 166 163
2986 163 161 158 156 154 151 148 146 143 140 138 136 134 132 131 129 128 127 126 125 124 124 122 122 121 121 121 121 120 120 120 120 119 119 119 119 119 119 119 119 119 118 117 116 116 115 114 113 112 111 109 108 107 106 105 104 103 102 100 99 98 97 95 94 93 93 92 91 91 90
2979 90 89 89 88 88 88 88 88 88 88 88 88 89 89 89 89 89 89 89 89 90 90 90 91 91 91 91 92 92 92 92 92 92 91 91 91 91 91 91 91 91 90 90 90 90 89 89 89 88 88 87 87 87 86 86 86 85 85 85 84 84 83 83 83 83 83 83 83 83 83 82
2972 82 82 82 81 81 80 80 80 80 79 79 79 79 79 78 78 78 78 78 78 78 77 77 77 77 76 76 76 76 76 75 75 75 75 75 75 75 75 75 74 74 74 73 73 73 73 73 73 73 73 73 73 73 74 74 74 74 74 74 73 73 74 74 74 74 73 73 73 73 73 72
2964 72 72 71 71 71 71 71 71 71 71 71 71 71 71 70 70 70 70 70 70 69 69 69 69 69 69 69 69 69 69 69 69 69 69 69 69 69 69 69 69 68 68 68 68 68 67 67 68 68 68 68 68 68 68 68 68 67 67 67 67 67 67 67 66 66 66 67 67 67 67 67
2957 67 68 68 67 68 68 68 68 68 68 68 68 69 69 69 68 69 68 68 69 69 70 70 70 70 71 70 70 70 70 70 69 69 69 69 69 69 69 69 69 69 69 69 69 69 69 69 69 69 68 68 68 68 68 68 68 68 68 68 68 68 68 68 69 69 69 69 69 69 68 68
2950 68 68 68 68 68 68 68 69 69 69 69 68 68 68 68 68 68 68 68 68 68 68 68 68 68 69 69 68 68 68 68 69 69 69 68 69 69 69 70 70 70 71 71 72 72 73 73 74 74 75 76 77 78 79 80 81 83 85 87 89 92 95 99 103 107 110 114 118 122 126 130
2942 130 133 136 139 142 145 148 151 154 156 158 160 160 159 158 157 154 151 149 146 143 141 138 135 132 130 126 122 119 115 112 108 105 102 100 98 96 94 93 93 92 91 92 92 93 93 94 95 97 98 101 103 107 110 113 117 121 125 129 132 134 137 140 142 145 148 151 154 157 160
2935 160 162 162 162 161 159 156 154 151 148 145 142 139 137 134 130 127 123 119 115 111 107 104 100 96 94 91 89 87 85 84 82 81 80 79 78 77 76 75 75 74 73 72 72 72 71 71 71 70 70 69 69 69 68 68 68 68 67 67 67 67 66 66 66 66 66 66 66 67 66
2927 66 66 66 66 66 66 66 66 66 67 67 67 67 67 67 68 68 68 68 68 68 68 68 68 68 68 68 68 68 68 68 68 68 68 68 68 67 67 67 66 66 66 66 66 66 67 67 67 67 67 67 67 67 67 67 68 68 68 68 68 68 67 67 67 68 68 68 68 68 68 69
2920 69 69 69 69 69 69 69 70 70 70 70 70 70 71 71 71 70 70 70 70 70 70 70 70 70 70 70 70 70 70 70 70 69 69 69 69 69 69 69 69 69 69 69 69 69 69 69 69 69 69 69 69 69 70 69 69 69 69 69 69 69 70 70 70 69 69 69 69 69 68 68
2913 68 68 68 68 68 68 68 68 68 67 67 68 68 68 68 68 68 68 68 68 68 68 68 68 68 67 67 67 67 66 66 66 66 66 66 65 65 65 65 65 65 64 64 64 64 64 64 64 63 63 63 63 63 63 64 64 64 65 65 65 65 65 65 65 65 65 65 65 66 66 67
2905 67 67 67 68 68 68 68 68 68 68 68 68 68 68 68 68 68 68 68 67 67 66 66 65 65 65 65 65 65 65 64 64 64 65 64 64 64 64 63 63 63 63 63 63 63 63 64 64 64 64 65 65 65 65 65 65 65 65 66 66 66 67 67 67 68 68 69 70 72 73 75
2898 75 78 82 87 92 99 107 114 121 127 130 131 129 124 118 110 103 96 90 85 81 78 76 74 73 72 71 70 70 69 69 68 68 67 67 67 67 67 66 66 66 66 66 66 66 66 66 67 67 67 67 67 67 68 68 68 69 70 71 72 73 74 75 77 80 82 86 91 98 107 119
2890 119 134 154 177 200 223 242 256 262 258 247 230 208 186 164 145 129 116 106 98 92 87 84 81 79 78 77 75 74 73 72 71 71 70 70 69 69 69 69 69 69 68 68 68 68 68 69 69 69 69 69 70 70 70
2885 70 70 71 72 73 74 76 77 79 82 85 89 96 104 115 129 147 168 191 214 235 251 261 262 253 238 218 195 172 152 134 120 109 99 93 88 85 82 80 78 76 75 73 72 71 70 70 70 69 69 69 69 68
2879 68 68 68 68 68 68 68 68 67 67 67 67 67 67 67 68 68 68 68 69 69 70 70 71 71 72 74 76 78 81 86 91 98 105 113 120 125 129 130 129 125 118 111 103 96 90 85 81 77 74 73 71 70 69 68 68 68 67 67 66 66 66 65 65 65 65 65 65 65 65 65
2872 65 65 65 65 65 65 65 65 65 65 65 65 65 65 64 65 65 65 65 65 65 65 65 65 65 65 65 65 65 65 65 65 65 65 65 64 64 64 65 64 64 64 64 64 65 65 65 64 64 64 65 65 65 64 64 64 65 65 65 65 65 65 64 64 64 64 64 64 64 64 64
2864 64 64 64 64 63 63 63 63 63 63 63 63 63 63 63 63 63 63 63 63 64 64 64 64 64 64 64 64 64 64 64 64 63 63 64 64 64 64 64 64 64 64 64 64 64 64 64 63 64 64 64 64 65 64 64 64 64 64 64 64 64 64 64 64 64 65 65 65 65 65 65
2857 65 65 65 64 64 64 64 64 63 63 63 63 63 63 63 63 63 63 63 63 63 63 63 63 63 63 63 63 64 64 64 64 64 64 63 63 63 63 63 64 64 64 64 64 64 64 64 64 64 64 64 64 65 65 65 65 65 65 66 66 66 67 67 67 67 68 68 67 67 67 66
2850 66 66 65 65 65 65 65 65 65 64 64 65 65 65 65 65 65 65 65 65 65 65 65 65 65 65 65 65 65 65 65 65 65 65 64 64 65 65 65 65 64 64 65 65 65 65 65 66 66 66 66 66 66 66 66 66 66 67 67 66 66 66 66 66 66 66 66 66 66 66 66
2842 66 65 65 65 65 65 65 65 65 65 65 65 65 65 64 65 65 65 65 65 64 64 64 64 64 65 65 65 65 65 65 65 65 65 65 65 65 65 66 66 66 66 65 65 65 65 65 65 65 65 65 65 65 65 64 65 65 65 65 65 65 65 64 64 64 64 64 65 65 65 65
2835 65 65 65 65 64 64 64 64 64 64 64 64 64 64 64 65 65 65 65 65 64 64 64 64 64 64 64 65 65 65 64 64 64 65 65 64 64 65 65 65 65 65 65 65 65 65 66 66 66 65 65 65 65 65 65 65 65 65 65 65 65 65 65 65 65 66 65 65 66 66 66
2827 66 66 66 66 66 66 66 66 66 66 66 66 66 66 65 65 65 65 66 66 66 66 66 65 65 65 65 65 65 65 65 65 65 65 65 65 65 65 66 66 65 65 65 66 66 66 66 66 65 66 66 66 66 66 66 66 66 66 66 66 66 67 67 66 66 66 66 66 66 66 66
2820 66 66 66 66 66 66 66 66 66 66 65 65 65 66 66 65 65 65 65 64 65 64 64 65 65 65 65 64 64 64 64 65 65 65 65 65 65 65 66 66 66 66 66 66 66 66 66 66 67 67 67 67 68 68 68 68 68 68 68 68 68 68 68 68 67 67 67 67 67 67 67
2812 67 66 66 66 66 66 66 65 65 65 65 65 65 65 65 64 64 64 64 64 65 64 64 64 64 64 64 64 65 65 66 66 66 66 66 66 65 66 66 66 67 67 67 67 67 67 68 68 68 68 68 68 68 68 68 68 69 69 69 69 68 68 67 67 67 67 67 67 67 67 66
2805 66 66 66 67 66 66 66 66 66 66 66 66 66 66 65 65 65 65 65 65 65 65 65 65 65 65 65 65 65 65 65 65 65 65 65 65 65 65 66 66 66 66 66 66 66 67 67 67 67 67 68 68 68 68 67 67 67 67 67 67 67 67 67 67 67 67 67 67 67 67 67
2798 67 67 67 67 67 67 67 68 68 68 68 67 67 67 68 68 68 68 68 68 68 68 69 68 68 68 68 68 68 67 67 68 67 67 67 67 67 67 67 67 67 67 67 67 67 67 68 68 68 68 68 68 68 68 68 68 68 68 68 67 67 68 68 68 69 69 69 69 69 69 69
2790 69 69 69 69 69 70 69 69 69 69 69 69 69 69 69 69 69 69 69 69 69 69 69 69 69 69 69 69 68 68 68 67 67 67 67 67 67 67 67 67 67 67 66 66 66 66 66 66 66 66 66 67 67 67 67 67 67 67 67 68 68 68 68 68 68 69 69 69 69 69 69
2783 69 69 69 69 69 69 69 69 69 69 69 69 70 70 70 69 69 69 69 69 69 69 69 69 69 69 69 69 69 69 69 69 69 69 68 68 68 68 68 67 67 67 68 68 68 68 68 68 68 68 68 68 68 68 69 69 69 69 69 69 69 70 70 70 71 71 71 71 71 71 71
2775 71 71 72 72 73 73 73 73 73 73 73 73 73 74 74 74 75 75 75 76 76 76 76 76 76 76 77 77 77 78 78 79 79 79 79 79 79 80 80 80 80 81 81 81 82 82 83 83 83 84 84 84 85 85 85 85 85 84 84 84 84 84 84 84 84 84 84 84 84 84 83
2768 83 83 83 83 82 83 83 83 83 83 83 83 83 83 84 84 84 83 83 83 83 83 83 83 83 84 84 84 84 84 84 85 85 85 84 84 84 84 84 83 83 83 82 82 82 82 81 81 81 81 80 80 80 80 79 79 79 79 79 79 79 79 79 79 79 79 79 79 78 78 77
2761 77 77 78 78 78 78 78 79 79 79 79 79 79 80 80 80 80 80 81 81 81 81 81 81 81 81 81 81 82 82 82 82 82 82 82 82 82 83 83 83 83 83 83 83 83 83 83 83 84 84 84 84 84 85 85 86 86 87 87 87 88 88 88 88 88 89 89 89 89 90 90
2753 90 90 90 90 90 91 91 91 92 92 92 92 92 92 92 92 91 91 91 90 90 90 89 89 89 89 89 89 90 89 89 88 88 87 87 87 87 87 87 87 87 87 87 87 86 87 87 87 87 87 87 88 88 89 89 90 90 90 90 90 90 89 89 89 89 88 88 88 88 88 88
2746 88 88 89 88 88 88 88 88 88 88 88 87 87 87 87 86 86 86 86 86 86 86 86 86 86 86 86 86 86 85 86 86 86 86 86 86 87 87 88 88 88 88 88 87 88 88 88 88 88 88 88 89 89 89 89 89 90 90 89 90 90 90 90 90 90 90 90 91 91 91 91
2738 91 91 91 91 91 91 92 92 92 92 92 92 93 93 93 93 93 93 93 93 93 93 93 94 94 94 94 95 95 94 94 94 95 95 95 95 96 96 95 95 96 96 96 96 96 96 96 96 96 96 97 97 97 97 97 97 97 97 98 98 98 98 98 98 99 99 99 99 99 99 100
2731 100 100 101 101 101 101 102 102 102 102 102 102 102 102 102 102 102 102 102 102 102 102 102 102 102 102 103 103 103 103 104 104 104 104 104 104 104 105 105 105 105 105 104 105 105 105 105 105 106 106 106 106 106 106 106 106 106 106 106 106 106 106 106 106 106 106 106 106 106 107
2724 107 107 107 107 107 108 108 108 108 108 108 108 109 109 109 109 109 109 109 110 110 110 110 110 110 110 111 111 111 111 111 111 110 110 110 111 111 111 111 111 111 111 112 111 111 111 112 112 112 112 112 112 112 112 112 112 112 113 113 113 112 112 112 112 112 112 112 112 113 113
2716 113 113 113 113 113 113 113 113 113 114 114 114 114 113 113 113 114 113 113 113 113 114 114 114 114 114 114 114 114 113 113 113 113 113 113 113 113 113 112 112 112 112 112 112 112 112 112 112 112 112 112 112 112 112 112 112 112 111 111 111 111 111 111 111 111 111 111 111 111 111
2709 111 111 111 111 111 111 111 111 111 112 111 111 111 111 110 110 110 110 110 109 109 110 110 110 110 110 110 110 110 111 110 110 110 109 109 109 109 109 108 108 108 108 108 108 108 108 108 107 107 107 107 106 106 106 106 106 106 106 105 105 105 104 104 104 104 104 104 104 104 103
2702 103 103 103 103 103 103 103 103 103 103 103 104 103 103 102 102 101 101 101 101 101 101 101 101 101 101 101 101 101 101 101 101 101 101 100 100 100 100 100 100 100 100 99 99 99 99 99 99 98 98 98 98 99 99 99 98 98 98 98 98 98 98 97 97 97 97 97 97 97 97
2694 97 96 96 96 96 96 96 96 96 96 96 96 96 95 95 95 95 95 95 95 95 95 94 94 94 94 94 94 94 94 94 94 94 94 93 93 93 93 93 93 93 93 93 93 93 92 93 93 93 93 93 93 93 92 92 92 92 91 91 91 91 92 92 92 91 91 91 91 90 90 90
2687 90 90 90 89 89 89 89 90 89 89 89 89 89 89 88 88 88 88 88 87 87 88 88 87 87 87 87 87 87 87 87 86 86 87 87 87 86 86 86 86 86 85 85 85 86 86 86 86 86 86 85 85 85 85 85 86 86 86 85 85 85 85 86 86 85 85 84 84 84 84 85
2680 85 85 84 84 84 84 84 84 85 85 84 84 84 84 84 84 84 84 84 84 84 84 83 83 83 83 84 83 83 83 83 83 83 83 84 83 83 83 83 83 83 83 83 82 82 82 83 83 83 83 83 83 83 83 83 83 83 83 83 83 83 83 82 82 82 81 81 81 80 80 80
2672 80 81 81 81 81 80 80 80 80 80 80 79 79 79 79 79 79 79 79 79 79 79 79 79 79 79 79 79 79 79 79 79 79 79 79 79 79 79 79 79 79 79 79 79 79 79 78 78 78 78 78 78 78 78 78 78 78 78 78 78 78 78 78 78 78 78 78 78 78 78 78
2665 78 78 78 78 78 78 78 78 78 78 78 78 78 79 79 79 79 79 79 79 79 80 80 80 80 80 80 80 81 81 81 81 81 82 82 82 81 81 81 81 82 82 83 83 84 84 84 84 84 85 85 85 85 85 85 85 85 85 85 85 85 85 84 84 84 84 84 84 84 84 83
2657 83 84 84 84 84 83 84 84 84 83 83 83 83 84 84 84 84 83 84 84 84 84 84 84 84 84 84 84 84 84 84 84 84 84 83 83 83 83 82 82 81 81 81 81 81 80 80 80 80 80 80 79 79 78 78 78 78 77 77 77 76 76 76 75 75 75 75 75 75 75 74
2650 74 74 74 74 74 73 73 73 74 74 74 74 74 74 74 74 74 74 74 74 74 74 74 75 75 75 75 75 75 75 75 75 75 75 75 76 76 76 76 76 76 76 76 76 76 76 76 76 76 76 76 76 76 76 76 76 76 76 76 76 76 76 75 75 75 75 74 74 74 74 74
2642 74 74 74 74 73 73 73 73 73 73 73 73 73 73 73 73 73 73 73 73 73 73 73 73 73 73 73 73 73 73 74 74 74 74 74 74 75 75 75 75 75 75 75 75 75 75 75 75 76 76 76 76 76 76 75 75 75 76 76 76 75 75 75 74 74 75 74 74 74 74 74
2635 74 74 74 74 74 74 74 74 74 74 74 74 74 74 74 74 74 74 75 75 75 75 75 75 75 75 75 75 75 75 76 76 77 77 77 77 78 78 79 79 80 81 82 83 83 84 85 87 88 89 90 92 93 95 96 96 97 97 97 96 95 94 93 92 90 89 87 85 84 83 82
2628 82 81 79 78 78 77 76 75 75 75 75 75 75 74 74 73 73 73 72 72 72 72 72 72 72 72 72 71 72 72 72 72 72 73 73 73 73 73 73 73 73 73 73 73 73 73 73 73 73 73 73 73 73 74 74 74 73 73 73 74 73 73 73 73 73 73 73 73 74 74 74
2620 74 74 74 74 74 74 74 74 74 74 75 75 74 75 75 75 75 75 76 76 77 77 78 78 79 79 79 79 79 79 79 78 78 77 77 77 76 76 76 75 75 75 75 75 75 75 75 75 75 75 75 75 75 76 76 76 77 77 77 77 78 78 78 79 79 79 79 79 79 79 79
2613 79 79 79 80 80 80 81 81 82 82 83 84 84 85 87 88 89 90 91 92 92 92 91 91 90 89 87 86 85 84 83 82 81 81 80 80 79 78 78 78 78 78 77 77 77 77 76 76 76 76 76 76 77 77 77 77 77 77 77 78 78 79 79 79 79 78 79 79 79 79 79
2605 79 79 79 79 80 80 81 81 81 82 82 82 82 82 82 81 81 81 80 79 79 78 77 76 76 76 76 75 75 75 75 74 74 74 74 74 74 74 74 74 73 73 73 73 73 73 73 73 73 73 73 73 73 73 73 73 73 73 73 73 72 72 73 73 73 73 73 73 73 73 72
2598 72 72 72 72 72 72 72 72 72 72 72 72 72 72 71 71 71 71 71 71 71 70 70 70 70 70 70 70 70 70 70 70 70 70 71 71 71 71 71 71 71 71 71 71 71 71 71 72 71 72 72 72 71 72 71 71 72 72 72 71 71 71 71 71 71 72 72 72 72 72 72
2591 72 71 71 71 71 71 71 71 71 71 71 71 71 71 71 71 71 72 71 71 71 70 70 70 70 70 70 70 70 70 70 70 70 70 70 70 70 70 70 70 70 70 70 70 69 69 69 70 70 70 70 70 70 69 70 69 69 69 69 70 70 70 70 70 69 69 69 69 69 69 70
2583 70 70 70 70 70 70 70 70 70 70 70 70 70 71 71 71 71 71 70 70 71 71 71 71 71 70 70 70 70 71 71 71 70 70 70 71 71 70 70 70 70 70 70 70 71 71 71 71 70 70 70 70 70 70 70 71 70 70 70 70 70 71 71 70 70 71 71 71 71 71 71
2576 71 71 71 71 71 71 72 72 72 73 73 74 74 75 75 76 76 77 77 77 77 77 77 77 77 77 77 78 78 79 80 81 83 84 86 88 90 91 93 94 95 95 96 95 94 93 92 90 89 87 85 84 82 81 80 79 79 79 78 77 77 77 76 75 75 75 75 75 75 75 75
2568 75 75 75 75 75 75 75 75 75 75 76 76 77 77 78 79 80 81 82 83 84 86 87 88 89 90 90 90 91 91 92 92 92 92 93 93 94 96 97 98 100 101 101 102 102 102 101 100 99 97 96 95 94 93 92 92 92 92 92 91 91 91 91 91 90 89 88 87 86 85 83
2561 83 82 81 81 80 79 78 77 77 77 76 76 76 76 76 76 75 75 75 75 75 75 75 75 75 75 76 77 77 78 78 79 80 80 81 82 84 85 87 89 90 92 94 95 96 97 98 98 97 96 94 92 91 89 88 86 85 83 82 81 79 79 78 77 77 76 76 76 76 76 75
2553 75 75 75 75 75 75 75 75 75 75 75 75 75 75 75 75 75 75 75 75 74 74 74 75 75 75 75 75 75 75 75 75 75 75 75 75 75 75 75 75 75 75 74 74 74 74 74 74 74 74 74 74 74 73 73 73 73 73 73 73 73 73 73 73 73 73 73 73 73 73 72
2546 72 72 72 72 71 71 71 71 71 72 71 71 71 71 71 71 71 71 72 72 72 72 73 73 73 73 73 73 73 73 73 73 73 73 73 73 73 73 73 73 73 73 72 72 72 72 72 72 71 71 72 72 71 71 71 71 71 71 71 71 71 72 72 72 72 72 72 72 73 73 72
2539 72 72 72 72 73 72 72 72 73 72 72 72 72 72 72 72 73 72 72 72 72 72 72 72 72 72 71 71 71 72 72 72 72 73 73 72 73 73 73 73 73 73 73 73 73 73 73 73 74 74 74 75 75 75 75 75 76 76 77 77 77 78 79 79 79 80 80 80 80 80 80
2531 80 80 80 80 79 79 79 79 79 79 79 78 78 78 78 78 78 77 77 77 76 76 76 76 76 76 76 76 76 76 76 76 76 75 76 76 75 76 76 76 77 77 76 77 78 78 78 78 79 79 79 79 80 80 80 80 80 80 80 81 81 81 82 82 83 83 84 84 84 84 84
2524 84 84 85 85 85 85 85 85 85 84 84 84 83 83 83 83 82 82 81 81 81 81 80 79 79 79 79 78 78 78 77 77 77 76 76 76 75 75 75 75 74 74 74 74 74 74 74 74 74 74 74 74 74 74 74 74 74 74 75 75 76 77 77 77 78 78 79 80 81 81 81
2516 81 81 81 80 80 80 80 80 80 80 79 79 79 79 79 78 78 78 78 77 77 77 77 78 78 78 78 77 77 77 77 77 77 78 78 78 78 78 78 77 77 77 76 75 75 74 74 74 74 73 73 73 72 72 73 73 73 73 72 72 73 73 73 73 73 73 73 73 73 73 74
2509 74 74 74 74 74 74 75 75 75 75 76 76 76 76 77 77 77 77 77 77 77 77 77 77 76 76 77 77 77 77 78 78 78 79 79 79 79 79 79 80 80 79 79 79 79 79 78 78 78 78 77 77 76 76 76 75 75 75 75 75 76 76 76 76 76 76 76 76 76 76 76
2501 76 77 77 77 77 77 77 77 77 77 77 77 77 77 77 77 77 77 77 77 77 77 77 77 77 77 76 76 76 76 76 77 76 76 76 76 76 76 77 77 77 77 77 78 78 79 79 79 79 79 80 80 80 80 80 80 80 80 80 80 80 80 80 80 80 79 80 80 80 80 80
2494 80 79 79 79 79 79 79 79 79 80 80 80 79 79 79 79 79 80 80 79 80 80 80 79 79 79 79 79 79 79 78 78 78 78 77 78 78 78 78 77 78 78 78 78 78 78 78 79 79 79 79 79 79 80 80 80 80 80 80 81 81 82 82 82 82 82 82 82 82 83 83
2487 83 83 83 83 83 83 83 83 83 83 84 84 84 84 84 85 85 85 86 86 86 86 86 86 87 87 87 87 87 87 87 87 87 87 87 87 87 87 88 88 88 89 89 89 89 90 90 91 91 91 92 93 93 94 95 96 97 98 99 100 101 102 104 106 107 108 110 112 114 116 119
2479 119 121 124 127 131 135 139 144 149 154 161 168 175 183 191 200 208 217 225 233 241 248 254 259 262 264 265 264 261 257 252 246 238 231 222 214 205 197 189 181 173 165 159 153 148 143 138 134 130 127 124 122 120 118 116 114 112 111 110 108 107 107 106 105 103 102 101 100 100 99
2472 99 99 99 98 98 97 96 96 96 96 96 95 95 95 95 95 95 96 96 96 96 96 96 96 97 97 97 97 97 97 97 96 96 96 96 96 96 95 95 95 95 95 95 95 95 96 96 96 96 96 95 96 96 96 96 96 96 96 96 97 97 97 97 97 97 97 97 97 97 97 97
2465 97 98 98 98 98 98 98 99 99 99 99 99 98 98 99 99 99 99 99 99 99 99 98 98 98 98 99 98 98 99 99 99 99 99 98 98 98 98 98 98 99 99 99 99 100 100 100 101 101 101 101 101 102 103 103 103 103 104 104 104 105 105 105 105 105 106 106 106 106 107 107
2457 107 107 107 108 108 108 109 109 109 110 110 111 111 112 112 112 113 113 113 113 114 114 115 115 115 116 116 117 118 118 118 118 118 118 117 117 117 117 117 117 117 117 117 117 117 117 117 117 117 117 118 117 118 118 118 119 119 120 120 120 120 121 121 121 121 122 122 123 123 122
2450 122 122 122 122 122 122 122 122 122 122 122 122 122 122 122 122 122 122 123 123 123 123 124 125 125 126 126 126 127 127 127 128 128 128 128 128 128 127 127 128 128 128 129 129 129 129 130 130 130 130 131 131 131 132 133 133 133 134 134 134 135 136 136 137 138 138 139 141 142 143
2442 143 144 145 147 148 150 151 153 155 157 159 161 163 165 167 169 171 173 175 177 179 180 181 182 183 184 184 184 184 184 183 183 182 182 181 180 179 179 179 178 178 177 177 176 176 175 174 173 173 172 172 172 171 171 171 171 172 172 172 173 174 176 177 178 179 180 181 183 184 185
2435 185 185 186 187 187 187 188 188 188 188 187 186 186 185 184 183 183 182 182 181 181 180 180 180 180 179 179 179 178 178 178 177 177 177 176 176 176 175 175 175 175 176 176 176 177 178 179 181 183 185 188 190 193 196 199 202 205 208 212 215 219 222 226 229 232 235 237 240 243 245
2428 245 247 248 250 251 253 255 257 259 262 266 269 274 279 286 293 301 309 319 328 338 348 358 369 379 390 400 410 421 431 441 450 460 469 479 489 499 508 518 529 540 551 563 574 586 598
2423 598 611 624 638 652 666 681 697 713 729 746 764 782 801 820 840 860 881 903 926 950 974 1000 1027 1055 1085 1115 1147 1180 1216 1253 1292 1334 1377 1424 1473
2419 1473 1524 1579 1637 1698 1764 1833 1906 1985 2068 2157 2253 2356 2466 2583 2709 2845 2990 3145 3312 3491 3683 3889 4109 4344 4597 4868 5158
2417 5158 5471 5809 6176 6574 7010 7488 8016 8599 9245 9962 10759 11643 12622 13698 14874 16148 17513 18957 20463 22010 23567
2414 23567 25106 26591 27988 29261 30377 31307 32026 32516 32765 32767 32525 32046 31345 30442 29362 28133 26784 25349 23857 22340
2412 22340 20827 19341 17904 16534 15242 14038 12926 11907 10979 10138 9378 8693 8077 7521 7020 6567 6156 5782 5440 5126
2410 5126 4837 4570 4321 4089 3871 3668 3476 3296 3126 2966 2815 2672 2538 2412 2293 2182 2078 1980 1889 1804 1724 1650 1581 1516 1455 1397
2407 1397 1344 1293 1245 1201 1158 1118 1080 1045 1011 979 948 920 893 867 842 819 797 777 757 739 721 705 690 676 662 649 637 626 615 606 597 589 581 575 568 562 556 551 545
2403 545 540 535 530 524 519 513 508 502 496 490 483 478 472 466 461 457 453 449 446 442 439 436 433 430 427 424 421 417 413 408 403 398 393 388 382 377 372 366 361 356 351 347 343 339 336 332 329 326 323 321 318 316 313 311 309 307 305 303 301 298 296 293 291 288 286 283 280 276 273
2396 273 269 265 262 258 254 250 246 243 240 236 233 230 227 224 220 217 214 211 209 206 202 199 195 192 188 184 181 178 174 171 168 166 163 162 160 159 159 159 160 161 162 165 168 171 175 179 183 188 193 198 202 205 208 210 211 211 209 207 203 199 193 187 181 174 167 160 153 146 140
2389 140 134 129 124 120 116 113 110 107 104 102 100 98 96 94 93 91 90 89 88 87 87 87 86 86 86 87 87 87 88 89 90 91 92 93 94 95 95 96 97 98 99 99 100 100 100 100 100 100 100 99 99 99 98 98 97 96 96 95 95 94 94 94 93 93 93 93 92 91 90
2381 90 90 89 89 89 88 88 87 86 86 86 86 85 85 84 84 84 84 84 84 83 83 83 83 83 82 82 82 82 82 82 82 82 81 80 80 79 79 79 79 79 78 78 78 78 78 78 78 77 77 77 77 77 77 77 77 77 77 77 76 76 76 75 76 75 75 75 75 75 75 74
2374 74 74 74 75 75 75 75 75 75 75 75 75 75 75 74 74 74 74 74 74 74 74 74 74 74 74 74 74 73 73 73 73 73 73 73 73 73 73 73 73 73 73 73 73 72 72 72 72 72 72 72 71 71 71 71 71 71 70 70 70 71 71 71 71 71 71 71 71 71 72 72
2366 72 72 72 71 71 72 72 72 71 72 72 72 72 72 71 71 71 70 70 70 69 69 69 69 69 69 69 69 69 69 69 69 70 71 71 71 71 72 72 72 72 72 72 72 73 73 73 73 73 73 73 73 73 72 72 72 71 72 72 72 72 71 71 71 71 71 71 71 71 71 71
2359 71 71 70 70 70 70 70 70 70 69 69 69 70 70 70 71 71 71 71 70 71 71 71 71 71 71 71 71 71 71 71 72 72 72 72 72 73 73 73 74 74 74 75 75 76 76 77 77 78 78 79 79 80 80 81 81 82 82 82 82 83 83 83 83 83 84 84 85 85 86 87
2352 87 87 88 89 91 92 94 95 97 99 101 103 105 108 111 115 119 123 128 133 139 145 152 159 167 175 184 193 201 210 218 225 232 238 243 246 248 248 247 244 240 234 228 220 212 203 194 185 177 168 160 153 145 139 133 128 122 118 114 110 107 104 101 98 96 94 93 92 90 89 88
2344 88 87 86 85 84 83 82 81 80 79 79 78 78 77 76 75 75 74 74 74 73 73 72 72 72 72 72 71 71 71 72 72 72 71 71 70 70 70 70 70 69 69 69 69 69 68 68 68 68 67 67 68 68 68 67 67 67 67 67 67 67 67 66 66 66 66 66 66 66 67 67
2337 67 66 66 66 66 66 65 65 66 66 66 66 66 66 66 65 65 65 65 65 65 65 65 65 64 64 65 65 65 65 66 66 66 66 66 66 66 67 67 67 66 66 66 67 67 67 67 67 67 67 67 67 67 67 67 67 67 67 67 67 67 66 66 66 66 66 66 66 66 66 67
2329 67 66 66 66 66 66 66 66 66 66 66 66 66 66 66 66 67 67 67 67 67 68 68 69 69 69 69 70 70 70 71 71 72 71 71 71 71 70 70 70 70 69 69 68 68 67 67 67 67 66 66 66 66 66 66 66 66 66 66 66 65 65 65 65 65 65 65 66 66 66 66
2322 66 66 67 66 66 66 66 66 66 66 66 66 66 66 66 66 66 66 66 66 66 67 67 67 67 67 66 67 67 67 67 67 67 67 67 67 67 66 66 66 66 65 65 65 64 64 63 62 62 62 61 61 60 60 60 59 59 59 60 59 59 60 60 60 60 60 60 60 60 61 61
2314 61 61 62 62 62 62 62 62 62 63 63 64 64 64 64 64 64 64 64 65 65 65 65 66 66 66 66 66 66 66 66 66 66 65 65 65 64 64 63 63 63 63 62 62 61 61 61 60 60 60 59 59 59 59 59 60 60 60 60 60 60 60 60 61 61 62 62 62 63 63 63
2307 63 63 63 64 64 64 64 64 64 64 64 64 64 63 63 63 63 63 63 64 64 64 64 64 64 64 64 63 64 64 64 64 63 63 63 63 63 63 63 63 62 62 62 62 62 62 62 62 62 62 61 61 61 61 60 61 61 61 61 61 61 61 61 61 61 61 61 61 61 61 61
2300 61 62 62 62 62 62 62 62 62 62 62 62 63 62 62 62 62 62 62 62 62 62 62 62 62 62 62 62 62 62 62 62 62 62 62 62 62 62 62 62 62 62 62 61 61 62 62 62 62 62 62 61 61 61 61 61 61 61 62 61 61 61 61 61 61 61 61 61 61 61 60
2292 60 60 60 60 60 61 61 61 61 61 61 61 61 61 61 61 61 62 62 62 62 62 62 62 63 63 63 63 64 64 64 64 64 64 63 63 63 63 63 63 63 63 63 63 63 63 62 62 62 62 63 63 63 62 62 62 62 63 63 63 63 63 63 63 63 64 65 65 65 65 65
2285 65 65 65 65 65 65 64 64 64 64 63 63 63 63 63 62 62 62 62 62 62 62 61 62 62 62 62 61 61 61 61 62 62 62 63 63 63 63 63 63 64 64 64 64 64 64 64 64 64 64 64 63 63 63 64 63 63 63 63 63 63 63 64 64 64 64 64 64 64 64 64
2277 64 63 63 63 63 63 62 62 62 62 62 62 62 62 62 62 62 62 62 62 61 61 61 61 61 61 61 61 61 60 61 61 61 61 62 63 63 63 63 63 63 63 63 63 63 63 62 62 62 61 61 61 61 61 61 61 61 61 61 60 60 60 60 60 60 60 60 60 60 60 60
2270 60 61 61 61 61 61 61 61 61 61 61 61 61 61 61 61 61 61 61 61 61 61 61 61 61 61 61 61 61 61 61 60 60 60 60 61 61 61 61 61 60 60 60 61 61 61 61 61 61 61 61 61 60 61 61 61 61 61 61 61 61 60 60 60 60 60 60 60 60 59 59
2263 59 59 60 60 60 60 60 60 59 60 60 60 60 60 60 60 61 60 60 60 60 60 60 60 60 60 61 61 61 61 60 60 60 60 60 60 60 60 61 61 61 61 61 62 61 61 61 61 61 60 60 60 60 60 61 61 61 61 60 60 60 61 61 61 61 61 61 61 61 60 60
2255 60 60 60 60 60 60 60 60 60 60 60 60 61 60 60 60 60 60 60 60 60 60 60 60 60 60 60 60 60 60 60 60 60 60 60 60 60 60 60 60 60 60 60 60 60 60 60 60 60 60 60 60 60 60 60 60 61 60 60 60 60 60 61 61 61 61 61 61 61 61 61
2248 61 61 61 61 62 62 61 61 61 61 61 62 62 62 62 62 62 62 62 63 63 63 63 63 63 63 63 63 63 63 63 63 63 62 62 63 63 63 62 62 62 62 62 62 62 62 62 63 63 63 63 63 63 63 63 64 64 64 64 64 64 64 64 63 63 63 63 63 63 63 62
2240 62 62 62 63 63 63 62 62 63 63 63 63 63 63 63 63 63 63 63 62 62 62 62 62 62 62 63 63 63 63 63 63 63 63 64 64 64 63 63 63 63 63 63 63 63 63 63 63 62 62 62 62 62 62 62 62 63 63 63 63 63 63 63 63 63 63 63 63 63 63 63
2233 63 63 62 62 62 62 62 62 62 62 62 62 61 61 61 61 61 61 62 62 62 62 62 62 62 62 62 62 61 61 61 61 61 61 61 61 61 61 61 61 61 61 61 61 61 61 61 61 61 61 61 61 61 60 60 60 60 60 60 60 60 60 60 61 61 61 61 61 61 61 61
2225 61 61 61 61 62 62 62 62 62 62 61 61 61 61 61 61 61 61 61 61 61 62 62 62 62 62 62 62 62 61 61 61 62 62 61 61 62 62 62 62 62 62 62 62 62 62 62 61 61 61 61 61 61 61 61 60 60 60 60 60 60 60 60 60 60 61 61 61 61 61 60
2218 60 60 60 60 60 60 60 60 60 60 60 60 61 61 61 61 61 62 62 62 62 62 62 62 62 61 62 62 62 62 62 62 62 62 62 62 62 62 62 62 62 62 62 61 61 61 61 61 61 61 61 61 61 61 61 60 60 59 59 59 59 59 59 59 59 59 59 59 59 59 59
2211 59 59 59 59 59 59 59 59 59 59 59 59 59 60 60 60 60 60 60 60 60 60 60 60 60 60 61 60 60 60 60 61 61 61 61 61 61 61 61 61 61 61 62 61 61 60 60 60 60 60 60 60 60 60 60 60 60 59 59 59 58 58 59 59 59 59 59 59 59 59 59
2203 59 59 59 58 58 59 59 59 59 59 59 59 59 59 58 58 59 59 60 60 60 59 60 60 60 60 60 60 60 60 60 60 61 61 61 61 61 61 61 61 61 60 60 61 61 60 60 60 61 61 61 61 61 61 61 61 61 61 61 61 61 61 60 60 60 60 61 60 60 60 60
2196 60 60 60 60 60 60 60 60 60 60 59 59 59 59 59 58 58 59 59 59 59 59 59 59 59 59 60 60 60 60 61 60 60 60 60 60 60 60 61 61 61 61 61 61 61 61 62 61 61 61 61 61 61 61 61 61 61 61 61 61 61 61 61 61 60 60 60 60 60 60 59
2188 59 59 59 59 58 58 58 59 59 58 58 58 58 58 58 58 57 57 57 57 57 57 57 57 58 58 58 58 58 58 58 59 59 59 59 60 60 60 60 60 60 61 61 61 61 60 60 60 60 61 61 61 61 61 61 61 61 61 61 61 61 61 61 61 61 61 61 61 60 60 60
2181 60 59 60 60 60 59 59 59 59 59 59 59 59 59 59 59 59 59 59 59 59 59 59 59 59 58 58 58 58 58 58 58 58 58 58 59 59 60 60 60 60 60 60 60 60 60 60 60 60 60 60 61 61 61 61 61 61 61 61 61 61 60 60 60 61 61 61 61 61 61 61
2174 61 61 61 61 60 60 60 60 60 60 60 60 60 60 60 60 60 60 61 61 61 61 60 60 60 60 60 59 59 59 60 61 61 61 61 61 61 61 61 61 61 60 60 61 61 61 61 61 61 60 60 60 61 61 61 61 61 61 61 61 61 61 60 61 61 61 61 61 61 61 61
2166 61 60 60 60 60 60 61 61 61 61 61 61 61 61 61 60 60 60 60 60 60 61 61 61 61 60 60 60 61 61 61 60 61 61 61 60 60 60 60 60 60 60 60 60 60 60 60 60 60 60 60 60 61 60 60 60 60 60 60 60 61 61 61 61 61 61 60 60 60 60 61
2159 61 61 61 61 61 61 61 61 61 61 61 61 61 61 60 61 61 61 61 61 61 61 61 61 60 60 60 60 60 60 60 60 60 60 60 59 59 59 59 59 59 59 59 59 59 59 59 59 59 59 59 59 59 59 60 60 60 60 60 60 60 60 60 60 60 60 60 60 60 60 60
2151 60 60 60 60 60 60 60 59 59 59 59 59 59 59 59 59 60 60 60 60 59 59 59 59 59 59 59 59 59 59 59 59 59 59 59 60 59 59 59 59 59 60 60 60 59 59 59 59 59 60 60 60 60 60 60 60 59 60 60 60 60 60 60 60 60 60 60 60 60 60 60
2144 60 60 60 61 61 61 61 61 61 61 60 60 61 61 62 62 63 63 63 64 64 64 64 64 64 64 64 64 64 64 65 65 65 66 66 66 66 67 67 66 66 66 66 66 66 65 65 65 66 66 65 65 65 64 64 64 64 65 65 65 64 64 64 64 63 64 64 64 64 64 64
2136 64 64 64 64 64 64 64 64 64 64 64 64 65 65 65 65 65 65 66 66 67 67 67 67 67 67 66 66 65 65 65 65 65 65 65 64 64 64 64 64 64 64 64 64 64 63 62 62 62 62 62 62 62 62 61 61 61 61 61 61 61 61 60 61 61 61 61 60 60 60 60
2129 60 60 60 60 60 60 60 60 60 60 60 60 60 60 60 60 60 60 60 60 60 60 60 60 60 60 60 60 59 59 59 59 59 59 59 59 59 59 59 60 60 60 60 60 60 59 59 59 59 60 59 59 59 59 59 59 59 59 59 59 59 59 59 59 59 60 60 60 59 59 59
2122 59 59 59 59 59 59 59 59 59 59 59 59 59 60 60 60 60 59 59 60 60 60 60 60 59 59 59 59 59 59 59 59 59 59 59 59 59 59 59 59 59 59 59 59 59 59 59 59 59 60 59 59 59 59 59 59 59 59 59 59 59 59 59 59 60 60 60 60 60 60 60
2114 60 60 60 60 60 60 60 60 60 60 60 60 60 60 60 60 60 60 60 60 60 60 60 60 61 60 60 60 60 60 61 60 60 60 60 60 60 60 60 60 60 60 60 60 60 60 60 60 60 60 60 60 60 60 60 60 60 60 60 60 60 60 60 60 60 60 60 60 60 60 60
2107 60 60 60 60 60 60 60 60 61 60 60 60 59 59 60 60 60 60 60 59 59 59 59 59 59 59 59 59 59 59 59 60 60 60 60 60 60 60 60 60 60 60 60 59 59 59 59 59 59 59 59 60 60 60 59 59 59 59 59 60 60 60 60 59 59 59 59 59 59 59 59
2099 59 59 59 59 59 60 60 60 60 60 60 60 60 60 60 60 60 60 61 60 60 60 60 60 59 59 60 60 60 60 60 60 60 60 60 60 61 61 60 60 60 60 60 60 60 60 60 60 60 61 61 61 60 60 60 60 60 60 60 60 60 60 60 60 60 60 60 60 60 60 60
2092 60 60 60 61 61 61 60 60 60 61 61 60 60 60 60 61 61 61 61 61 60 61 61 61 61 61 61 61 60 60 60 60 60 60 60 60 60 60 61 61 61 61 61 61 60 60 60 60 60 60 60 60 60 60 60 60 60 60 60 60 60 60 60 60 60 60 60 60 60 60 60
2085 60 60 60 60 60 60 60 60 60 61 61 61 60 60 61 61 61 60 60 60 60 60 60 60 59 59 59 59 60 60 60 60 60 60 60 60 60 60 60 60 60 60 60 60 60 60 60 60 60 61 61 61 60 60 60 60 60 60 60 61 61 61 61 61 60 60 60 60 60 60 60
2077 60 60 60 60 60 59 59 59 59 59 59 59 59 60 59 59 59 60 60 60 59 59 59 59 59 59 59 59 59 59 60 60 60 60 60 60 60 60 60 60 60 60 59 59 59 59 59 59 59 59 59 59 59 59 59 59 59 60 60 60 60 60 60 60 60 60 60 60 60 60 60
2070 60 60 60 60 59 60 60 60 60 60 60 60 60 60 59 59 59 59 59 59 59 59 59 59 59 60 60 60 60 59 60 60 60 60 60 60 60 61 61 61 61 61 61 61 61 61 61 61 61 61 61 60 60 60 60 60 60 60 59 59 59 60 60 60 60 60 60 60 60 60 60
2062 60 60 61 61 60 60 60 60 60 60 60 60 60 60 60 60 60 60 60 60 60 60 60 60 60 60 60 60 60 60 60 60 60 60 60 60 60 60 60 61 61 61 61 61 61 60 60 61 60 60 60 61 61 60 60 60 60 60 59 60 60 60 60 60 60 60 60 60 60 60 60
2055 60 60 60 60 60 60 60 60 60 61 61 61 61 60 60 60 61 61 61 61 61 61 61 60 60 60 61 61 61 61 61 61 61 60 60 60 60 61 61 61 61 61 61 61 61 61 61 61 61 61 61 61 60 61 60 60 60 60 60 61 61 61 61 61 61 61 61 60 60 60 60
2047 60 60 60 60 61 60 59 59 59 59 59 59 60 59 59 59 59 59 59 59 60 60 59 59 59 59 59 59 60 60 60 60 59 59 60 60 60 60 60 60 60 60 60 60 60 60 60 60 60 60 60 60 60 60 59 60 59 59 60 60 60 60 60 60 60 60 60 60 60 60 59
2040 59 59 59 59 59 59 59 59 59 59 59 59 58 59 59 59 59 59 59 59 59 59 59 59 59 59 59 59 60 59 59 59 59 59 59 59 59 59 59 59 59 59 59 59 59 59 59 59 59 59 60 59 59 59 59 59 59 59 59 59 59 58 58 59 59 59 59 59 59 60 60
2033 60 60 60 60 60 60 60 61 61 61 60 60 60 60 60 60 60 60 60 60 61 61 60 60 60 60 60 60 60 60 60 60 60 60 60 60 60 60 60 60 60 61 61 61 61 60 60 60 60 60 60 60 60 60 60 60 60 60 60 60 60 60 61 61 60 60 60 60 60 60 60
2025 60 60 60 60 60 60 61 61 61 61 60 60 60 60 60 60 60 60 60 60 60 60 60 60 60 60 60 60 60 60 60 60 60 60 60 60 60 60 60 60 60 60 60 60 60 60 60 60 60 61 61 61 61 60 60 60 60 60 60 60 61 61 61 61 61 61 61 61 62 62 63
2018 63 63 63 63 63 63 62 62 62 61 61 62 62 62 61 61 61 61 61 61 60 60 60 61 61 61 61 61 61 60 60 60 60 61 61 61 61 61 61 60 60 60 60 60 60 60 61 61 61 61 61 61 61 61 60 61 61 61 61 61 61 61 61 61 61 61 61 61 61 61 62
2010 62 62 62 62 62 62 62 62 62 62 62 62 62 62 62 62 62 62 62 62 62 62 61 61 61 62 62 61 61 61 61 61 61 61 61 61 60 60 60 60 60 60 60 60 59 59 59 59 59 60 60 59 59 59 59 59 59 60 60 60 60 60 59 59 60 60 60 60 60 60 60
2003 60 60 60 60 60 60 60 60 60 61 60 60 61 61 61 61 61 61 61 61 61 61 61 61 61 61 61 61 61 61 61 61 60 60 60 60 60 60 59 59 59 59 60 60 60 60 60 60 60 59 59 59 59 59 59 59 60 59 59 59 59 59 59 59 59 59 59 59 59 59 59
1996 59 59 59 59 59 59 59 59 59 59 59 59 59 59 60 60 60 59 59 59 60 60 60 60 60 60 60 60 60 60 60 61 61 61 61 61 61 60 60 60 60 60 60 60 60 59 59 59 59 59 60 60 60 60 59 60 60 60 59 59 59 59 59 59 59 59 59 59 59 59 59
1988 59 59 59 59 59 59 59 59 59 59 60 60 60 60 59 59 59 60 60 60 60 60 60 60 60 60 59 60 60 60 60 60 60 60 59 59 59 60 60 60 60 60 60 60 60 60 60 60 61 60 60 60 60 60 60 59 59 59 60 60 60 59 59 59 59 59 59 59 59 59 59
1981 59 59 59 59 59 59 59 59 60 60 60 60 59 59 59 59 59 59 59 59 59 59 59 59 59 59 59 59 59 59 59 59 59 60 60 60 60 59 59 59 59 59 59 60 60 59 59 59 59 59 59 60 59 59 59 59 59 59 59 59 59 60 60 60 60 60 60 60 60 60 60
1973 60 60 60 60 60 60 60 59 60 60 59 59 59 59 59 59 59 60 60 60 60 60 60 60 60 60 60 59 59 59 60 60 59 59 59 59 59 59 59 59 59 60 60 60 60 60 60 60 60 60 60 60 60 60 60 60 60 60 60 60 60 60 60 60 60 60 60 60 60 60 60
1966 60 60 60 60 60 60 60 60 60 60 59 60 60 60 60 60 60 60 60 60 60 60 60 60 60 60 60 60 60 60 60 60 60 60 60 60 60 60 60 60 60 60 60 60 60 59 59 59 60 60 60 60 60 60 60 60 60 60 60 60 60 60 60 60 60 60 60 60 60 60 60
1958 60 59 59 59 59 59 59 60 60 60 60 60 59 60 60 60 60 60 60 60 60 60 60 60 60 60 60 60 60 60 60 60 60 60 60 59 59 59 59 59 59 59 60 59 59 59 59 59 59 59 59 60 60 60 60 60 60 59 59 59 59 59 59 59 59 59 59 59 59 58 58
1951 58 58 59 59 59 59 60 60 60 60 60 59 59 59 59 60 60 60 60 60 60 60 60 60 61 61 61 61 61 61 61 61 61 60 60 60 60 60 60 60 60 60 60 59 59 59 59 59 59 59 59 59 59 59 59 59 59 59 59 59 59 59 59 59 59 59 59 59 60 60 60
1944 60 60 60 60 60 60 59 59 59 59 59 59 59 59 59 59 59 59 59 59 59 59 59 59 59 59 59 59 59 59 59 59 59 59 59 59 59 59 59 59 59 59 58 58 58 58 58 59 59 59 59 59 59 59 59 59 58 58 58 58 58 58 59 59 59 59 59 59 59 59 59
1936 59 59 60 59 59 59 59 59 59 59 59 59 59 59 59 59 59 59 59 59 59 59 59 59 59 59 59 59 59 59 59 59 59 59 59 58 58 58 57 57 58 58 58 59 59 59 59 59 59 58 58 58 59 59 59 59 59 59 59 59 60 60 60 60 60 59 60 60 60 60 60
1929 60 60 60 60 60 60 60 60 60 60 60 60 60 60 60 60 60 60 60 60 60 60 60 60 60 60 60 60 61 61 60 60 60 60 61 61 61 61 61 60 60 61 61 61 61 60 60 60 60 61 61 61 60 60 60 60 60 61 61 61 61 61 61 61 61 61 61 61 61 60 61
1921 61 61 61 61 61 61 60 60 60 60 60 60 60 60 60 60 60 60 60 61 61 61 61 61 61 61 61 61 61 62 62 62 61 61 61 61 62 62 62 61 61 62 62 62 62 62 62 61 61 61 61 61 61 61 61 61 61 61 61 61 61 61 61 61 61 62 62 62 62 62 62
1914 62 62 62 62 62 62 61 61 61 61 61 61 62 62 62 62 62 61 61 61 61 62 61 61 61 61 61 61 61 61 61 61 61 61 61 61 61 61 60 60 60 61 61 61 61 61 61 61 61 60 60 60 60 60 60 60 60 60 60 61 61 61 61 60 60 61 61 60 60 60 60
1907 60 60 60 60 60 60 60 59 59 59 59 59 58 58 58 58 58 58 58 58 58 58 58 58 58 58 58 58 57 58 58 58 57 57 58 58 58 58 58 58 58 57 57 57 57 57 57 57 58 58 58 58 58 58 58 57 57 58 59 59 59 59 59 59 58 58 58 58 58 58 58
1899 58 58 58 58 58 58 58 58 59 58 58 58 58 58 58 59 59 59 59 59 59 59 59 59 59 59 59 59 59 59 59 59 59 59 60 60 60 60 60 60 60 60 60 60 60 60 60 60 60 60 61 61 61 61 61 61 61 61 61 61 61 61 61 61 61 61 61 61 61 61 61
1892 61 61 61 61 61 61 61 61 61 61 61 61 61 61 60 60 60 60 60 59 59 59 60 59 59 59 59 59 59 59 59 59 60 59 59 59 59 59 59 59 59 59 59 59 59 59 59 59 59 59 59 59 59 59 59 59 59 59 59 59 59 59 59 59 59 59 59 59 59 59 59
1884 59 59 59 59 59 59 60 60 60 60 60 60 60 60 60 60 59 59 59 59 59 60 60 60 60 60 60 60 60 60 60 60 59 59 59 60 60 60 60 60 60 60 59 59 59 59 60 60 60 60 60 60 60 60 60 60 61 61 61 60 60 61 61 61 61 61 61 61 61 61 61
1877 61 62 62 62 62 62 62 62 62 61 61 61 61 61 61 61 61 61 61 61 62 62 62 61 61 61 61 61 61 61 61 61 60 60 60 60 60 60 60 60 60 60 60 60 60 60 60 60 60 60 60 60 59 60 60 60 60 60 59 59 59 59 59 59 59 58 58 58 58 58 58
1869 58 58 59 59 58 58 58 58 58 58 58 58 58 58 58 58 58 58 58 58 58 58 58 58 58 58 58 58 58 58 58 58 58 59 59 59 59 59 59 59 59 59 59 59 59 59 59 59 59 59 59 59 59 59 59 59 59 58 58 58 58 59 59 59 59 59 60 59 59 58 58
1862 58 58 58 58 58 58 58 58 58 58 58 58 58 58 58 58 58 57 58 58 58 58 58 58 58 58 58 58 58 58 58 58 58 58 58 58 58 58 58 58 58 58 58 58 58 58 58 58 58 58 58 58 57 58 58 58 58 58 58 59 59 59 59 59 59 59 59 59 59 59 59
1855 59 59 59 59 58 58 58 58 58 59 59 59 59 58 58 58 58 58 58 58 58 58 58 58 58 58 58 58 58 58 58 58 58 58 58 58 58 58 58 58 58 58 58 58 58 58 58 58 58 58 58 58 58 58 58 58 58 59 59 59 59 59 59 59 59 59 60 60 60 60 60
1847 60 61 60 60 60 60 60 60 60 60 60 60 60 60 61 60 60 60 60 60 60 61 61 61 61 61 61 60 61 61 61 61 61 61 61 61 61 61 61 61 61 61 61 61 61 61 61 61 62 61 61 61 61 61 61 61 61 62 61 61 61 61 61 61 61 61 61 61 62 62 62
1840 62 62 63 63 64 64 64 64 65 66 66 67 68 69 69 69 69 69 69 68 67 67 67 66 66 65 64 64 63 63 63 62 62 61 61 61 61 61 61 61 61 61 60 60 61 61 61 61 60 60 60 61 61 61 61 61 62 62 62 62 62 62 63 64 64 65 66 67 68 69 70
1832 70 71 73 74 76 77 78 79 79 79 79 78 77 76 74 73 72 70 69 68 67 67 66 66 66 65 65 65 65 64 64 64 64 63 63 63 63 63 63 63 63 63 63 64 64 64 63 63 63 63 63 63 63 63 63 63 64 64 64 64 65 65 66 66 67 68 69 70 71 72 72
1825 72 72 72 71 70 70 69 68 67 66 65 64 63 63 62 61 61 61 61 60 60 60 59 59 58 58 58 58 57 57 57 57 57 57 56 56 57 57 57 57 57 57 57 57 57 57 58 58 58 58 57 58 58 58 58 58 58 58 58 58 58 58 58 58 59 59 59 59 59 59 58
1817 58 58 59 59 59 59 59 59 59 59 59 59 59 59 59 58 58 58 58 58 57 57 57 57 57 57 57 57 57 57 57 57 57 58 58 58 58 58 58 58 58 58 59 59 59 59 59 59 59 59 59 59 59 58 59 59 59 59 60 60 61 60 60 60 60 61 61 61 61 60 60
1810 60 61 61 61 61 61 61 61 61 62 62 62 63 63 63 62 62 62 62 61 61 61 61 61 61 61 60 60 61 61 61 61 61 61 61 60 61 61 60 60 60 60 60 60 60 60 60 60 60 59 59 59 59 59 59 59 59 59 59 59 59 59 59 59 59 59 59 59 59 59 59
1803 59 59 59 59 59 59 59 59 59 59 58 59 59 59 59 59 59 59 59 59 59 58 58 58 58 58 59 59 59 59 59 59 59 59 59 59 60 60 60 60 60 60 60 60 59 59 59 59 59 60 60 60 60 60 60 60 60 60 60 60 60 60 60 60 60 60 60 60 60 60 60
1795 60 60 60 60 61 60 60 60 60 61 61 61 61 60 60 60 60 60 60 61 61 61 61 61 61 61 61 61 61 61 60 60 60 60 60 60 61 61 61 61 61 61 61 61 60 60 60 60 60 60 60 60 60 60 59 59 59 59 59 59 59 59 59 59 59 59 59 59 58 58 58
1788 58 58 58 58 58 58 58 58 58 58 58 58 58 58 58 58 58 58 58 58 58 58 59 59 59 59 59 59 59 59 59 60 59 59 59 59 59 59 59 59 59 59 59 59 58 58 58 58 59 59 58 58 58 58 58 58 58 58 58 58 58 57 57 57 58 57 57 57 57 57 57
1780 57 58 58 58 58 58 58 58 58 58 58 58 58 58 58 58 58 58 59 59 59 59 59 59 59 59 58 59 59 59 59 59 58 58 59 59 59 59 59 59 59 59 59 59 59 59 59 59 59 59 59 59 59 59 59 59 59 60 60 60 60 59 59 59 59 59 59 59 59 59 59
1773 59 59 59 59 59 59 59 59 59 59 59 59 59 59 59 59 58 58 59 58 58 58 58 58 58 58 58 59 59 59 59 59 59 58 58 58 59 59 59 59 59 59 59 58 58 58 58 58 59 59 59 59 59 59 59 59 59 60 60 59 59 59 59 59 59 60 60 60 60 60 60
1766 60 60 60 60 60 60 60 60 60 60 60 60 60 60 60 61 60 60 60 60 60 60 60 60 60 60 60 60 60 60 60 60 61 61 61 60 60 60 60 60 60 60 60 60 60 60 60 60 60 60 60 60 61 61 61 61 61 61 61 61 61 60 60 60 60 60 60 60 60 60 60
1758 60 60 60 60 60 60 60 60 60 60 60 60 60 60 60 60 61 60 60 60 60 60 60 60 60 60 60 60 60 60 60 60 60 60 60 60 59 59 59 59 59 59 59 59 59 60 59 59 59 59 59 59 60 60 60 60 60 59 59 59 59 59 59 59 59 59 58 58 58 58 58
1751 58 58 58 58 58 58 58 58 58 58 58 58 58 58 58 58 58 58 58 58 59 59 59 59 59 59 59 59 59 59 59 58 58 59 58 58 58 59 59 59 59 59 59 59 59 59 59 59 59 59 58 58 58 58 58 58 59 58 58 58 58 58 58 58 58 58 59 59 59 59 58
1743 58 58 58 58 58 58 58 58 58 58 58 58 58 58 58 58 58 58 58 58 58 58 58 58 58 58 59 59 59 59 60 60 59 59 59 59 59 59 59 58 59 59 59 59 59 59 60 59 59 59 59 59 59 59 58 58 58 58 59 58 58 58 58 58 58 59 59 59 58 58 58
1736 58 58 58 58 57 58 58 58 58 58 58 58 58 58 58 58 57 58 58 58 58 58 58 57 57 57 57 57 57 58 58 59 59 58 58 58 58 58 58 58 58 58 58 58 58 58 58 58 58 58 58 58 58 58 58 58 58 59 58 58 58 59 58 58 58 59 59 59 59 59 59
1728 59 59 59 58 58 58 58 58 58 58 59 59 59 59 59 59 58 58 59 59 59 59 59 59 59 59 59 59 59 59 59 59 59 59 60 60 60 61 61 61 60 60 60 60 60 60 60 59 59 59 59 59 59 59 59 59 59 59 59 60 60 60 60 60 60 60 60 60 60 60 60
1721 60 60 60 60 60 59 59 59 60 60 60 60 60 60 60 60 60 60 61 61 60 61 61 60 60 60 60 61 61 60 60 61 61 61 61 61 61 61 61 61 60 60 60 60 60 60 60 60 60 60 60 60 60 60 60 60 59 59 59 59 59 60 59 59 59 59 59 60 60 59 59
1714 59 59 59 59 59 59 59 59 59 59 59 59 59 59 59 59 59 59 59 59 59 59 59 59 59 59 59 59 59 59 59 59 59 59 59 59 59 59 59 59 59 59 59 59 58 59 59 59 59 59 59 58 58 58 58 58 58 58 58 58 58 58 58 58 58 58 58 58 57 57 57
1706 57 58 58 57 57 57 57 57 57 57 57 58 58 58 58 57 57 57 57 57 57 57 57 57 57 57 57 57 57 57 57 57 57 57 57 57 57 58 58 58 58 58 59 59 59 59 59 59 58 58 58 58 58 58 58 58 58 58 58 58 58 58 59 59 59 59 59 58 58 58 58
1699 58 58 58 58 58 58 58 58 58 58 58 58 58 58 58 59 59 58 58 58 58 58 58 58 58 59 59 59 59 59 59 59 59 59 59 59 59 59 59 59 59 59 60 60 60 60 60 60 60 60 60 60 59 59 60 60 60 60 60 60 60 61 60 60 60 60 60 60 61 60 60
1691 60 60 59 60 60 60 60 60 60 60 59 59 59 59 59 59 59 59 59 59 59 59 59 59 59 59 59 59 59 59 59 59 59 59 59 59 59 59 59 59 59 59 59 59 59 60 60 60 59 60 60 60 60 60 60 60 60 59 59 59 59 59 60 60 60 60 60 60 60 60 60
1684 60 60 60 60 60 60 60 60 60 60 60 60 60 60 61 61 61 60 60 61 61 61 62 62 61 62 62 62 63 63 63 64 64 65 65 65 65 64 64 64 65 65 64 64 63 63 62 62 62 62 62 62 61 61 62 62 61 61 61 60 61 61 61 61 62 62 62 62 61 61 61
1677 61 61 61 61 61 61 61 61 60 61 61 61 62 62 62 63 63 64 64 64 64 64 64 64 64 64 64 65 65 65 64 65 65 65 65 65 65 65 65 65 65 65 65 65 65 65 65 64 64 64 64 64 64 64 64 64 64 64 64 63 63 63 63 63 63 63 63 62 62 62 62
1669 62 62 62 61 61 61 61 61 61 61 60 60 60 60 61 61 61 61 61 61 61 60 60 61 61 62 62 62 62 62 63 63 64 64 64 65 65 65 65 64 64 64 64 63 63 63 62 62 61 61 61 60 60 60 60 60 60 60 60 60 60 61 61 61 60 60 60 60 60 60 60
1662 60 60 59 59 59 59 59 59 59 59 59 59 59 59 60 60 60 61 60 59 59 59 59 59 59 60 60 59 59 59 59 59 59 59 59 59 59 60 60 60 60 60 60 59 59 59 59 59 59 59 60 60 60 60 60 59 59 59 59 59 59 59 60 60 60 60 60 59 59 59 59
1654 59 60 59 59 59 59 59 59 59 59 59 59 60 60 60 60 60 60 60 60 60 60 59 60 60 60 60 60 60 60 59 59 59 59 59 59 59 59 59 60 60 60 60 60 60 60 60 61 61 62 62 62 62 61 61 61 61 61 61 61 61 60 60 59 60 60 60 59 59 59 59
1647 59 59 59 59 59 59 59 59 59 59 59 59 59 59 59 59 59 58 59 59 59 59 59 59 59 59 59 59 59 59 59 59 59 59 59 59 59 59 59 59 59 59 58 58 58 58 58 58 58 58 58 58 58 58 58 58 57 57 57 57 57 58 58 58 58 58 58 58 58 58 58
1639 58 58 58 58 58 59 59 59 58 58 58 58 58 59 59 59 59 59 59 58 58 58 59 59 58 59 58 58 58 59 59 58 58 58 58 58 58 58 58 58 58 58 58 58 58 58 58 58 58 58 58 58 59 59 58 58 58 58 58 58 58 58 58 58 58 58 58 58 58 59 59
1632 59 58 58 59 59 59 59 59 59 58 58 58 58 58 58 58 58 58 58 58 58 58 58 58 58 58 58 59 59 59 59 59 58 58 58 58 58 58 58 58 58 59 59 59 59 59 59 59 59 59 59 59 59 59 59 58 58 58 58 59 59 59 59 59 59 59 60 60 60 60 60
1625 60 60 60 60 60 60 60 60 59 60 60 60 60 60 60 59 59 58 58 59 59 58 59 59 59 59 58 59 59 59 59 59 59 59 59 59 59 59 60 60 60 60 60 60 60 60 60 59 59 58 59 59 59 59 59 59 59 59 59 59 59 59 59 59 59 59 59 59 59 59 59
1617 59 59 60 60 60 60 60 60 60 60 60 59 59 59 60 59 59 59 59 59 59 59 59 59 59 59 59 59 59 59 59 60 60 59 59 59 59 59 59 59 59 59 59 59 59 59 58 58 59 58 58 59 59 59 60 60 60 60 60 59 59 59 59 59 59 59 59 59 58 58 58
1610 58 59 59 58 58 58 58 59 59 59 59 59 59 59 59 59 58 58 58 58 58 59 59 59 59 59 59 59 59 59 59 58 58 58 58 58 58 59 59 59 58 59 59 59 59 59 59 58 58 59 59 59 59 59 59 59 59 59 59 59 59 59 59 59 59 59 59 59 59 59 60
1602 60 60 59 59 59 59 59 60 59 59 59 59 59 59 59 59 59 59 59 59 59 59 59 60 60 60 60 60 60 60 61 61 61 60 60 60 60 59 59 59 59 59 59 60 60 60 60 60 59 59 59 59 59 59 59 59 59 59 59 59 59 59 59 59 59 59 59 59 59 60 60
1595 60 60 60 60 60 60 60 60 60 60 60 60 60 60 60 61 61 62 62 63 64 64 64 64 63 63 62 62 61 61 60 60 60 60 60 60 60 60 60 60 60 60 61 61 60 60 60 60 60 60 60 60 60 60 60 60 60 60 60 60 60 60 60 59 59 59 59 60 60 60 60
1588 60 60 60 60 60 60 59 59 59 59 59 60 60 60 60 60 59 59 59 60 60 60 59 59 59 59 59 59 59 60 60 61 60 60 60 61 60 60 60 60 60 60 61 61 61 60 60 60 60 60 60 60 60 60 60 61 61 60 60 60 60 60 60 59 59 59 59 59 59 59 59
1580 59 59 58 59 59 59 59 59 58 58 58 58 58 59 59 59 59 59 59 59 59 59 60 60 60 60 59 59 59 59 59 59 59 59 59 59 59 59 60 59 59 59 59 59 59 59 59 59 59 58 58 59 59 59 58 58 58 58 58 58 58 58 58 58 57 57 57 57 57 57 57
1573 57 57 57 57 57 57 57 57 57 57 57 57 57 57 58 57 57 57 57 57 57 57 57 57 57 57 57 57 57 57 56 57 57 57 57 57 57 57 57 57 57 57 57 57 57 57 57 57 57 57 58 58 57 57 57 57 57 57 58 57 57 57 57 58 58 58 57 57 57 57 57
1565 57 58 58 58 58 58 58 58 58 58 58 58 58 58 58 57 57 57 57 57 57 57 58 58 58 57 57 57 57 57 57 57 57 57 57 57 57 57 57 57 57 57 57 57 57 58 58 58 58 58 58 58 58 58 59 59 59 59 59 59 59 59 59 59 59 59 59 59 58 58 58
1558 58 58 59 59 59 59 59 58 58 57 57 57 58 58 58 58 58 58 58 58 59 59 59 58 58 58 58 58 58 58 58 58 58 58 58 58 58 58 58 58 58 58 58 58 58 58 58 58 58 58 59 58 58 58 58 59 59 59 59 59 59 58 58 58 58 58 58 58 58 58 58
1550 58 58 58 58 58 58 59 59 58 58 58 58 58 58 58 58 58 58 58 58 58 58 58 58 58 58 58 58 58 59 59 59 59 58 58 58 58 58 59 58 58 58 58 58 58 58 58 58 58 58 58 58 58 59 59 59 59 59 58 59 59 59 59 59 58 58 59 59 59 59 59
1543 59 59 59 58 58 58 59 59 59 59 59 59 59 60 60 60 60 60 59 59 59 59 59 59 59 59 59 59 59 59 59 59 58 58 58 58 58 58 58 58 58 58 58 58 58 58 58 58 58 58 58 58 58 58 57 57 57 57 58 58 58 58 58 58 58 58 58 58 58 58 58
1536 58 59 59 59 58 58 58 58 59 59 59 59 59 59 59 59 58 58 58 59 59 59 58 58 58 58 59 59 59 59 59 59 59 59 58 58 58 58 58 58 58 58 58 58 58 58 58 58 58 58 58 58 58 58 58 58 58 58 58 58 58 58 58 57 58 58 58 58 58 58 58
1528 58 58 58 59 59 59 59 59 59 59 59 59 59 59 59 59 59 59 59 59 59 59 59 59 60 60 60 59 59 60 60 60 60 60 60 60 60 60 61 62 62 63 63 63 63 62 62 62 62 61 61 61 61 62 62 62 62 62 61 61 61 60 60 60 60 59 59 59 59 59 59
1521 59 59 59 59 59 59 59 59 59 59 59 60 60 61 62 63 64 65 66 67 68 68 68 67 66 65 63 63 62 61 61 60 60 60 60 59 59 59 59 59 59 59 59 59 59 59 59 59 59 58 58 59 59 59 59 59 59 58 58 58 58 58 58 58 58 58 58 58 58 58 58
1513 58 59 59 58 58 58 58 59 59 59 59 59 59 59 59 59 59 59 58 58 58 58 58 58 58 58 58 58 58 58 58 58 57 58 58 58 58 58 58 58 58 58 58 58 58 58 58 59 59 59 59 59 58 58 58 58 58 58 59 59 59 59 59 59 60 60 60 60 60 61 61
1506 61 61 61 61 61 61 60 60 60 60 60 60 60 60 60 60 60 61 61 61 61 60 60 60 59 59 59 58 58 58 58 58 58 58 58 58 58 58 58 59 59 59 59 59 58 58 58 58 58 58 58 58 58 58 58 58 58 59 59 59 59 59 59 59 59 58 58 58 58 58 58
1499 58 58 58 57 57 58 57 57 57 58 58 58 58 58 58 58 58 58 58 58 58 58 58 58 58 58 58 58 58 59 59 59 59 60 60 61 61 62 62 63 63 62 62 62 61 61 60 60 59 59 59 59 59 58 58 58 58 57 57 57 57 57 57 57 57 57 57 57 57 57 57
1491 57 57 58 57 57 57 57 58 58 58 58 58 58 58 58 59 58 58 58 58 58 58 58 58 58 58 58 58 58 58 58 58 58 58 58 58 58 58 58 58 58 58 58 58 58 58 58 58 58 58 57 57 57 57 58 58 58 58 58 58 58 58 58 58 58 57 57 57 57 57 57
1484 57 57 57 57 57 58 58 57 57 57 57 57 57 57 58 57 57 57 58 58 58 58 58 58 57 58 58 58 58 58 58 58 58 58 58 58 59 59 58 58 58 58 58 58 58 58 58 58 58 58 58 58 58 57 57 57 58 58 58 58 58 58 58 58 58 58 58 58 58 58 59
1476 59 58 58 58 58 58 58 58 58 58 58 58 58 58 59 59 59 59 59 59 59 59 59 59 58 59 59 59 59 59 59 59 59 59 59 59 58 58 58 58 58 59 59 59 59 59 59 59 59 59 59 59 59 59 58 58 58 58 58 58 58 59 59 59 59 59 59 59 59 60 60
1469 60 60 60 60 59 59 59 59 59 59 59 59 58 58 59 59 59 59 59 59 59 59 59 59 58 59 59 59 59 58 59 59 59 59 59 59 59 59 59 59 59 59 59 59 59 59 59 59 59 59 59 59 59 59 59 59 59 59 59 59 59 59 59 60 60 59 59 59 59 59 59
1461 59 60 60 60 59 59 59 59 59 59 59 59 59 59 59 59 59 59 59 59 59 59 59 59 59 59 59 59 59 59 59 60 60 60 59 59 59 59 59 59 59 59 59 59 58 58 59 59 59 59 59 59 60 60 60 60 60 60 60 60 60 59 59 59 59 59 59 59 59 59 59
1454 59 59 59 59 59 59 59 59 59 60 59 59 59 59 59 59 60 60 60 60 60 59 59 59 59 59 59 59 59 59 59 59 58 58 58 58 58 58 59 59 59 59 58 58 59 58 58 58 58 58 59 58 58 58 58 58 58 58 58 58 58 58 58 59 59 59 59 59 59 59 58
1447 58 58 59 59 59 59 59 59 59 59 59 59 59 59 60 60 60 60 60 60 60 59 58 58 58 57 57 57 58 58 59 59 60 60 61 60 60 60 60 60 60 60 60 60 60 60 60 61 62 62 63 64 66 67 69 70 71 71 71 71 69 68 67 66 65 64 63 63 63 63 63
1439 63 62 62 63 63 63 63 63 63 63 63 63 63 63 63 63 62 63 63 63 63 63 63 63 64 64 64 65 65 65 65 65 66 66 66 66 67 67 67 67 68 68 69 69 71 72 73 75 76 77 78 79 80 81 82 83 84 86 87 90 92 96 101 106 113 122 135 152 175
1432 175 208 255 319 402 501 610 719 815 886 923 919 874 794 693 585 483 396 323 264 218 183 157 138 124 113 105 99 94 89 86 83 80 79 77 76 74 74 73 73 73
1428 73 72 72 72 72 72 72 72 71 71 70 70 69 68 67 67 67 67 66 66 66 66 65 65 65 65 65 64 64 64 64 64 64 64 64 64 63 63 63 62 62 62 61 61 61 61 61 61 61 61 61 60 60 61 61 61 61 61 61 61 61 61 61 61 61 61 61 61 61 62 62
1420 62 62 61 61 62 62 62 62 62 62 62 62 61 62 62 62 63 63 64 64 65 65 65 65 65 64 64 64 63 63 62 62 62 62 62 61 62 62 61 61 61 61 61 61 61 61 61 61 61 61 61 61 60 60 60 60 60 60 60 61 61 62 62 62 61 61 61 61 61 61 61
1413 61 61 60 60 60 60 60 60 60 60 60 60 60 60 60 60 60 60 61 60 60 60 60 60 59 60 60 60 60 59 59 59 59 59 59 59 59 59 59 60 60 60 60 59 60 60 60 60 61 61 61 61 61 60 60 59 59 59 59 59 59 58 58 58 58 59 59 59 59 59 59
1406 59 59 59 59 58 58 58 58 58 58 59 59 59 59 59 59 59 59 59 60 60 60 60 60 60 60 60 60 59 59 59 58 59 59 59 59 59 59 59 58 58 58 58 58 58 58 58 58 58 58 57 57 57 57 57 58 58 58 58 58 58 58 58 58 58 57 57 57 57 57 58
1398 58 58 58 58 58 58 58 58 58 58 58 58 57 57 58 58 58 58 58 58 58 58 58 58 58 58 58 58 58 58 58 59 59 59 59 59 59 59 59 59 59 59 59 59 59 58 58 58 58 58 58 58 58 58 57 57 58 58 58 58 58 58 58 58 58 58 58 58 58 58 58
1391 58 58 58 58 58 58 58 58 58 58 58 58 58 58 58 58 58 58 59 59 59 59 59 59 59 59 59 59 59 59 59 60 60 59 59 59 59 59 59 59 59 59 59 59 59 59 59 59 59 59 58 58 58 58 57 57 57 57 57 58 58 58 59 59 58 58 58 58 58 58 58
1383 58 58 58 58 58 58 58 58 59 59 59 59 59 59 59 59 59 59 59 59 59 59 59 59 59 58 58 58 59 59 59 59 59 59 59 59 59 59 59 59 59 59 59 59 59 58 58 58 59 58 58 58 57 57 57 57 57 57 57 57 57 58 58 58 58 58 58 58 58 58 58
1376 58 58 58 58 58 58 58 58 58 58 58 59 59 59 58 58 58 58 58 59 59 59 59 59 59 59 59 59 60 60 60 59 59 59 59 59 59 59 59 60 60 60 59 59 59 60 60 60 59 59 59 59 60 60 60 59 58 58 58 58 58 58 58 58 58 58 58 58 58 58 58
1368 58 59 58 58 58 58 58 59 59 58 58 58 58 58 58 58 58 58 58 59 59 59 59 59 60 60 61 62 62 62 63 64 64 64 64 63 62 62 61 60 60 60 60 60 60 59 59 59 59 59 59 59 59 59 59 59 59 59 58 58 57 57 57 58 58 58 58 58 58 58 58
1361 58 58 58 58 58 58 58 58 58 58 57 57 57 57 57 57 57 57 57 57 57 57 58 58 58 57 58 58 58 59 59 59 59 59 59 58 58 58 58 58 59 59 59 58 58 58 58 58 58 58 58 59 59 58 58 58 58 58 58 58 58 58 58 58 58 58 58 58 57 57 57
1354 57 57 57 57 57 57 57 57 57 57 57 57 57 57 57 57 57 57 57 57 57 57 57 57 57 57 58 58 57 57 57 57 57 57 57 57 58 58 58 58 58 58 58 58 58 58 58 58 58 58 57 57 58 58 58 58 58 58 58 58 58 58 58 58 58 58 58 58 58 58 58
1346 58 57 57 57 57 58 58 58 58 58 58 58 58 58 58 57 57 57 57 57 58 58 58 58 58 58 58 58 58 58 58 58 58 58 58 58 58 58 58 59 59 58 58 58 59 58 58 58 58 58 58 58 58 58 58 58 58 58 58 57 58 58 58 58 58 58 59 59 59 59 59
1339 59 59 59 59 59 59 59 59 59 59 59 59 59 59 58 58 58 59 58 58 58 58 58 58 59 58 58 58 58 58 58 59 59 58 58 58 58 58 58 58 58 58 58 58 58 58 58 58 58 58 59 58 58 58 57 58 58 58 58 58 58 59 58 58 58 58 57 57 58 58 58
1331 58 58 59 59 59 59 59 59 59 59 59 58 58 58 58 58 58 58 58 58 58 58 57 57 57 57 57 57 57 57 57 57 57 58 57 57 57 57 57 57 57 57 57 57 58 58 58 57 57 57 57 57 58 58 58 58 58 58 58 58 58 58 58 58 57 57 57 57 57 57 57
1324 57 57 57 57 57 57 57 57 57 57 57 57 57 57 56 56 56 56 56 56 56 56 56 56 56 56 56 56 55 56 55 55 56 56 56 56 56 56 57 57 56 56 57 56 56 57 57 58 58 58 58 58 58 58 58 59 58 58 58 58 59 59 59 59 58 58 58 59 59 60 61
1316 61 62 63 64 65 66 67 67 66 65 63 62 62 62 61 60 60 60 59 59 59 59 60 60 60 60 60 60 60 60 60 59 59 59 59 59 60 59 59 59 59 58 58 58 58 58 58 58 58 58 58 58 58 58 58 58 58 58 58 58 58 58 57 57 57 57 57 57 57 57 57
1309 57 57 57 57 57 57 57 57 57 57 57 57 57 57 57 57 57 57 57 57 57 57 57 56 56 56 56 56 56 56 56 56 56 56 55 55 56 56 56 56 56 56 56 56 56 56 56 57 57 57 56 56 56 57 57 57 58 58 58 58 58 58 58 58 58 58 58 58 58 58 58
1302 58 58 59 58 58 58 58 58 58 58 58 59 59 59 59 59 59 59 59 59 60 60 59 59 59 59 59 59 59 59 59 59 59 59 59 59 59 59 60 60 60 60 60 60 59 59 59 59 59 60 60 60 59 59 59 59 59 59 59 58 58 58 58 58 58 58 58 58 58 58 58
1294 58 58 58 58 57 58 58 57 57 57 58 58 58 58 58 58 58 58 58 59 58 58 57 57 58 58 58 58 58 58 58 58 58 58 58 57 57 57 57 57 57 57 57 57 57 57 58 57 57 57 57 57 57 57 57 57 57 58 58 58 58 59 59 59 59 59 59 59 59 59 60
1287 60 60 59 59 58 58 58 58 58 58 58 58 58 58 58 58 58 58 59 59 59 59 59 60 60 60 60 60 60 60 60 61 62 62 62 62 62 62 62 62 62 62 62 62 62 61 61 61 61 61 61 61 61 61 61 60 60 60 60 60 59 59 59 59 59 59 59 60 60 60 60
1279 60 60 60 60 60 60 60 60 60 60 61 61 60 60 60 60 59 60 60 60 59 59 59 59 59 58 58 58 59 59 58 59 59 59 59 59 59 60 60 60 60 60 60 60 60 60 61 61 61 61 61 61 61 61 60 60 59 59 59 59 59 59 59 58 58 59 59 59 59 59 59
1272 59 59 58 58 58 58 58 58 58 58 59 59 59 59 59 59 59 59 59 59 59 60 60 59 59 59 59 58 58 58 58 58 58 58 58 58 58 58 58 58 58 58 58 58 58 59 59 59 59 59 59 59 59 60 60 60 60 60 60 60 60 60 60 60 60 60 60 60 60 60 61
1265 61 61 61 61 60 60 60 60 60 60 60 60 60 60 60 60 60 60 60 60 60 60 60 60 60 60 60 60 60 60 60 60 60 59 59 59 59 58 58 58 58 58 57 58 58 58 57 57 57 57 57 57 57 57 57 57 57 57 57 57 57 56 56 57 57 57 57 57 57 57 57
1257 57 57 57 57 57 57 57 58 58 58 59 59 59 59 58 58 59 59 59 59 59 60 60 60 59 59 59 59 59 59 59 59 60 59 60 60 60 60 60 60 60 60 60 60 60 60 60 60 60 60 59 59 59 58 58 58 58 58 58 58 58 58 58 58 58 58 58 59 59 59 59
1250 59 59 59 59 58 58 58 59 58 58 58 59 59 59 59 59 59 59 59 59 59 59 59 59 58 58 58 58 58 58 58 58 58 59 59 59 59 58 58 58 59 59 59 59 59 59 59 59 59 59 60 60 60 60 59 59 59 59 59 59 59 59 60 60 60 60 60 60 60 60 60
1242 60 59 59 60 60 60 60 60 59 60 60 60 60 60 60 60 60 60 60 60 60 60 60 60 60 60 60 60 60 60 60 60 61 61 61 61 62 62 62 62 62 62 62 61 61 61 60 61 61 61 61 61 61 61 61 61 61 61 61 61 61 60 60 60 60 60 60 59 59 59 59
1235 59 59 60 60 60 60 61 61 61 61 61 61 61 61 61 61 62 61 61 61 61 61 61 61 61 61 61 61 61 61 61 61 61 61 61 61 61 62 62 62 62 62 62 62 62 62 62 62 61 62 62 62 62 62 62 62 62 62 62 62 62 62 62 62 62 63 62 63 63 63 63
1227 63 63 63 63 63 63 63 63 63 63 63 62 62 63 63 63 63 64 64 64 64 64 64 64 64 64 64 64 63 63 64 64 63 63 63 63 63 63 63 62 62 62 62 62 62 62 63 63 64 64 64 65 65 65 65 65 65 64 64 64 64 63 63 62 62 62 61 61 62 62 62
1220 62 62 62 62 62 62 62 63 63 63 63 62 62 62 62 62 61 62 62 62 62 62 62 62 63 63 63 63 63 63 64 65 65 66 66 67 68 68 69 70 70 71 72 73 74 74 75 75 74 73 72 71 70 70 69 69 68 68 68 68 68 68 68 69 69 70 70 70 69 68 67
1213 67 66 66 65 64 64 64 64 64 64 64 65 65 65 65 66 66 67 67 68 68 69 69 69 70 70 70 70 70 70 70 69 69 69 68 67 66 64 63 62 61 60 59 59 59 60 60 61 61 62 62 63 63 63 63 62 61 60 60 58 57 55 54 54 53 54 54 55 55 56 57
1205 57 57 58 59 59 59 59 60 60 60 61 62 62 63 63 64 65 66 67 66 66 66 66 66 66 65 63 61 59 56 53 50 47 46 46 46 49 52 56 60 64 68 72 76 78 81 82 83 83 82 82 81 81 81 81 81 81 82 82 83 84 85 86 88 90 92 93 94 95 97 98
1198 98 99 101 102 104 105 106 108 110 111 112 114 115 117 118 120 121 122 123 125 126 127 128 130 132 134 137 139 143 146 149 152 156 159 162 166 170 174 179 184 189 195 202 208 215 222 229 236 244 252 261 271 281 292 304 317 332 348 365 385 407
1191 407 431 459 489 524 563 608 660 720 790 874 975 1098 1250 1445 1698 2035 2492 3102 3872 4768 5748 6807 7919 9000 9942 10663
1189 10663 11129 11323 11226 10840 10193 9366 8459 7517 6547 5586 4692 3902 3226 2659 2199 1836 1553 1331 1156 1014 898 802 722 654
1186 654 596 546 502 464 431 401 374 351 330 310 293 276 262 248 236 225 214 205 195 187 179 173 167 162 158 153 149 145 141 137 133 130 127 124 121 118 115 113 111 108 106 104 102 101 99 97 96 94 92 90 89
1181 89 88 87 86 86 85 84 83 83 83 83 83 83 83 83 84 84 84 84 84 85 85 85 86 87 87 88 89 89 89 89 88 87 86 84 82 80 78 77 77 77 78 80 83 86 89 92 94 97 98 99 98 96 94 92 89 87 85 83 82 81 80 80 78 77 76 76 76 77 77 78
1173 78 79 79 80 81 81 81 81 81 80 80 79 79 79 79 80 80 81 81 81 81 81 80 79 78 77 75 74 73 71 70 69 68 68 68 68 69 70 70 71 72 72 72 71 70 69 68 66 64 62 61 59 58 57 57 56 56 56 56 56 56 57 58 59 59 59 59 59 60 60 60
1166 60 60 61 61 62 63 63 63 62 62 61 60 59 58 57 56 55 55 54 54 54 54 54 54 54 55 55 55 55 54 54 53 53 52 52 52 51 51 50 50 49 49 49 49 49 50 50 51 51 52 52 53 54 55 55 55 55 56 56 57 57 58 58 58 58 58 59 59 59 59 58
1159 58 58 58 58 58 57 57 57 57 57 57 57 57 57 57 57 57 57 57 57 57 57 57 57 56 56 56 55 55 55 55 54 54 55 55 55 55 56 56 57 57 57 57 56 56 56 56 56 56 56 56 55 55 55 55 55 55 55 55 55 55 55 54 54 55 55 55 55 55 55 55
1151 55 55 55 55 55 55 55 55 55 55 55 55 55 55 55 55 56 56 56 56 56 56 56 56 56 56 56 56 57 57 57 56 56 56 56 56 56 56 56 56 56 57 57 57 57 57 56 56 56 56 56 57 56 56 56 57 57 57 57 57 57 57 56 56 56 56 56 56 56 56 56
1144 56 55 55 56 57 57 57 57 57 57 57 57 57 57 57 58 58 58 58 58 58 57 57 57 57 57 57 57 57 56 56 56 55 56 56 55 55 55 55 55 55 55 55 55 55 55 55 55 56 56 56 56 55 55 56 56 56 56 57 57 57 57 57 57 57 57 57 57 58 57 57
1136 57 57 57 57 58 57 57 57 57 57 57 57 57 57 57 56 56 56 56 56 56 56 56 56 56 56 56 56 56 56 57 56 56 56 56 57 57 57 57 57 57 56 56 56 56 56 56 56 56 56 56 56 56 56 56 56 56 56 56 57 57 57 57 57 57 57 58 58 58 58 57
1129 57 57 57 57 57 57 57 57 57 56 56 56 56 56 57 56 56 56 56 57 57 56 56 56 56 56 56 56 56 56 56 56 56 56 56 56 56 56 56 56 56 56 56 56 56 56 56 57 57 57 57 57 56 56 56 56 56 56 57 57 56 56 56 56 56 57 57 57 57 57 57
1121 57 57 57 57 57 57 57 57 57 57 57 57 57 57 57 57 57 56 56 57 57 57 57 57 57 57 57 57 57 57 57 57 57 57 57 57 57 57 57 57 58 58 57 57 57 57 56 56 57 57 57 57 57 57 57 56 56 57 57 57 57 57 57 57 57 57 57 57 57 57 57
1114 57 57 57 57 57 57 57 57 57 57 57 57 57 57 57 57 57 57 57 57 57 57 57 57 57 57 57 57 57 57 57 57 57 57 57 56 56 56 56 56 57 56 56 57 57 57 57 58 58 58 58 58 58 58 58 58 58 58 58 57 57 57 57 57 57 58 58 58 57 57 57
1107 57 57 57 57 57 57 57 57 57 57 57 57 57 56 56 57 57 57 57 57 57 57 57 57 57 56 56 56 57 57 57 57 57 57 57 57 57 57 57 57 58 58 58 58 58 58 58 58 58 59 59 59 58 58 58 58 58 57 57 57 57 57 57 57 57 57 57 57 57 57 57
1099 57 57 57 57 57 57 57 57 57 57 57 57 57 57 57 57 57 57 57 56 56 57 57 57 57 57 57 57 57 57 57 57 57 57 57 58 58 58 58 57 57 57 57 57 57 57 57 57 57 57 57 57 57 57 57 57 57 57 56 56 56 57 57 57 57 57 57 57 57 57 56
1092 56 56 56 56 56 56 56 56 56 56 56 56 56 56 56 56 56 56 56 56 57 57 57 57 57 57 57 57 57 58 57 57 57 57 57 57 57 57 57 57 57 57 57 57 57 57 57 57 58 58 58 58 58 58 58 58 59 59 59 59 59 59 58 58 58 57 57 57 57 57 57
1084 57 57 57 57 57 57 57 57 56 56 56 57 57 57 57 57 57 57 57 57 57 57 57 56 56 56 57 57 57 57 57 58 58 58 58 58 58 58 58 59 59 60 60 60 60 60 61 62 62 63 63 63 64 65 66 67 67 68 69 69 69 68 68 68 67 67 66 65 65 64 64
1077 64 63 63 62 62 62 62 62 61 61 61 61 61 61 61 61 60 60 60 60 60 60 60 60 60 60 60 61 61 61 61 61 61 62 62 63 63 64 64 65 66 66 67 67 68 68 68 69 69 70 71 71 72 73 74 76 77 78 79 80 80 81 80 79 78 77 76 75 74 72 71
1069 71 70 70 69 69 69 68 68 67 67 66 66 65 65 64 63 63 63 63 62 62 62 62 62 62 61 61 61 61 62 62 63 63 63 63 64 64 65 66 66 66 67 67 67 68 68 68 69 69 70 70 70 71 72 73 74 75 76 78 79 79 80 80 80 79 78 77 76 74 74 73
1062 73 72 71 70 69 68 68 68 67 67 66 66 65 65 64 64 63 62 62 62 61 61 61 61 60 60 60 60 60 60 60 61 61 61 61 61 61 61 61 61 61 62 62 61 61 62 63 63 63 62 63 63 64 64 65 66 67 68 68 69 69 70 70 70 70 70 69 68 67 66 65
1055 65 65 64 64 63 63 62 61 61 61 61 60 60 59 59 58 58 58 58 58 58 58 58 58 58 58 58 57 57 57 57 57 57 57 57 57 57 57 57 57 57 57 57 57 57 57 57 58 58 57 58 58 58 59 59 60 60 60 60 60 60 61 61 61 61 61 61 60 60 60 59
1047 59 59 59 59 59 59 58 58 58 58 58 58 58 58 58 58 58 58 57 57 57 57 57 57 57 57 57 56 56 56 56 56 56 56 56 56 56 56 56 56 56 55 55 55 56 56 56 56 56 56 56 55 56 56 56 56 56 56 56 56 56 56 56 56 56 56 56 56 56 56 56
1040 56 56 56 56 57 57 57 57 57 57 57 57 57 57 57 57 57 57 57 57 57 57 57 58 58 58 58 58 58 58 58 58 58 58 58 58 58 58 58 58 58 57 57 57 57 57 57 57 57 57 57 57 57 57 57 57 57 57 57 56 56 56 56 56 56 56 57 57 57 57 57
1032 57 56 56 56 56 56 56 56 56 56 56 57 56 56 56 56 56 56 56 56 56 56 56 56 56 56 57 56 56 57 57 57 57 57 57 57 57 57 57 57 57 57 57 57 56 56 56 57 57 57 56 57 57 57 57 57 58 58 58 58 57 58 58 58 58 58 57 57 57 57 58
1025 58 58 58 58 58 58 58 58 58 58 58 58 58 57 57 57 57 57 58 58 58 58 57 57 57 57 57 56 56 56 56 57 56 56 55 55 55 55 55 55 55 55 55 55 55 55 55 55 55 55 55 55 54 55 55 55 55 54 54 54 54 54 54 54 54 55 55 55 55 55 55
1018 55 55 55 55 55 55 55 55 55 55 55 55 55 55 55 55 55 55 55 55 55 55 55 56 56 56 56 56 55 55 55 55 55 55 55 55 55 55 56 56 56 56 56 56 56 56 56 56 56 56 56 56 56 56 56 56 56 56 56 56 56 56 56 56 56 56 56 56 56 56 56
1010 56 56 56 56 56 56 56 56 56 56 56 56 56 56 56 56 56 56 56 56 56 56 56 56 57 57 57 57 57 57 57 57 57 57 57 57 57 57 58 58 58 58 58 58 58 58 59 59 59 59 60 60 60 60 60 60 60 60 60 60 60 61 61 61 62 62 63 63 63 64 64
1003 64 64 65 66 67 68 69 70 71 73 75 79 83 89 96 104 113 122 130 137 141 142 140 136 130 123 116 109 103 98 93 89 86 83 81 80 79 78 76 75 74 74 74 73 73 72 72 71 71 69 68 67 66 64 63 62 61 60 60 59 59 59 59 58 58 58 58 58 57 57 57
995 57 57 57 57 56 56 56 56 56 56 56 57 57 58 58 58 59 59 59 60 60 60 59 59 58 57 57 57 57 56 57 57 57 57 57 57 57 57 57 57 57 57 57 57 57 56 57 57 57 58 57 57 57 57 57 57 57 57 57 57 57 57 57 57 57 57 57 57 57 57 57 57
988 57 57 57 57 57 56 56 56 56 56 56 56 56 55 56 55 55 55 56 56 56 56 56 56 56 56 56 56 56 55 55 55 55 55 55 56 56 56 56 56 56 56 55 56 56 57 57 58 58 58 58 58 57 57 57 58 57 57 57 57 57 57 57 57 57 57 57 56 56 56 56 56
980 56 56 56 56 56 56 56 56 56 56 56 56 56 55 55 55 55 55 54 54 54 54 54 54 55 55 55 55 55 55 55 55 56 56 56 55 55 55 55 55 55 56 56 56 56 56 56 56 56 56 56 56 56 57 57 57 57 57 57 57 57 57 57 56 56 56 56 57 57 57 57 57
973 57 57 57 57 57 57 57 56 56 56 57 57 57 57 57 57 57 57 57 57 57 57 56 56 56 56 56 56 56 57 57 57 57 57 57 57 57 57 57 57 57 57 57 57 58 58 58 57 57 57 57 58 58 58 58 58 58 58 58 58 58 58 58 58 58 58 59 59 59 59 59 59
965 59 58 58 58 58 58 58 59 59 59 59 60 60 60 61 61 62 62 63 64 65 66 66 66 67 67 66 65 64 63 63 62 62 61 61 61 60 60 60 60 60 59 59 59 59 59 59 58 58 58 58 57 57 57 57 57 57 57 57 56 57 57 57 57 57 56 56 56 56 56 56 56
958 56 56 56 56 56 56 56 56 56 56 57 57 57 57 58 57 57 57 57 58 58 58 58 58 58 58 58 58 58 58 58 58 58 58 58 57 57 57 58 58 58 58 58 58 58 58 57 57 57 58 58 58 57 57 57 57 57 57 57 57 57 57 57 57 57 57 57 57 57 57 57 57
950 57 57 57 57 57 57 57 57 57 57 57 57 57 57 57 57 56 56 56 56 56 57 57 57 57 57 57 57 57 56 56 56 56 56 56 56 57 57 57 57 57 57 57 57 57 57 58 58 57 57 57 57 57 57 57 57 57 57 57 57 58 58 58 59 59 59 59 59 58 58 57 57
943 57 57 57 56 56 56 56 56 56 56 56 56 57 57 57 57 57 56 56 56 56 56 56 57 57 57 57 57 57 57 57 57 57 57 57 57 57 58 58 58 58 58 58 58 58 58 59 59 59 60 60 61 61 62 62 63 64 66 67 68 69 70 70 69 69 67 66 65 64 63 62 61
935 61 60 60 60 59 59 59 58 58 58 58 58 58 59 58 58 58 58 59 59 58 58 58 58 57 57 57 57 57 57 57 57 57 57 57 57 57 57 57 57 57 57 57 57 57 57 57 57 57 57 57 57 57 57 57 57 56 56 56 56 56 56 57 57 57 57 58 58 58 58 58 58
928 58 58 58 58 58 58 58 58 58 59 59 59 59 59 58 58 58 58 58 58 58 58 58 59 59 59 59 59 59 59 59 59 59 59 59 59 59 59 59 59 60 59 59 59 58 58 59 59 59 59 59 59 59 58 58 58 58 58 58 58 58 58 58 58 58 58 58 58 58 58 58 58
920 58 58 58 59 59 59 59 59 59 59 60 60 60 60 60 60 60 60 60 60 60 60 60 60 60 60 60 61 61 61 61 60 60 60 60 61 61 61 61 62 62 62 62 61 61 61 61 61 61 61 61 61 61 61 61 61 61 61 61 61 61 61 61 61 60 60 60 60 61 61 61 61
913 61 62 62 62 62 62 62 62 62 61 61 61 61 61 61 62 62 63 63 63 62 62 63 63 63 64 64 64 64 64 65 65 65 65 65 66 66 66 66 66 66 66 67 67 68 68 69 69 70 70 70 69 69 69 68 68 67 67 67 66 66 66 66 66 66 66 65 66 66 66 65 66
905 66 66 66 66 66 66 66 67 67 67 67 67 67 67 67 67 68 68 69 69 69 69 69 69 70 71 72 73 74 76 77 78 79 79 79 79 79 78 79 80 80 81 81 81 80 79 77 76 74 73 72 70 70 69 69 68 68 68 68 68 67 67 67 67 67 68 68 68 68 69 69 69
898 69 69 69 69 68 68 68 69 69 69 69 70 70 70 70 71 71 71 71 71 71 71 71 71 71 71 71 71 71 71 70 70 70 71 71 72 72 73 73 73 73 73 74 74 74 74 74 74 74 74 74 74 74 74 74 75 75 75 76 76 76 77 77 77 78 78 79 80 80 81 83 84
890 84 86 88 90 93 96 102 109 120 134 154 179 207 237 263 283 294 296 286 266 238 210 185 164 146 131 120 112 106 102 99 96 95 94 93 93 93 93 93 94 94 95 95 96 97 98 99 100 101 101 102 103 105 106
884 106 108 110 112 114 117 119 122 125 128 132 136 140 144 148 153 158 164 171 179 190 205 225 252 288 334 389 449 507 555 586 598 590 558 507 450 396 350 311 278 252 232 217 205 196 188 182 177
879 177 171 165 159 154 148 143 138 134 129 124 120 116 112 108 105 102 99 96 94 92 90 88 87 85 84 83 82 81 81 80 80 81 81 82 82 83 85 86 89 92 97 104 114 129 148 172 199 227 253 271 280 280 268 246 218 190 165
873 165 143 126 112 101 92 86 82 79 77 75 73 72 71 70 70 70 69 69 69 68 68 67 66 66 65 65 64 64 63 63 62 62 62 62 62 62 62 61 62 62 62 62 62 62 62 63 63 63 62 62 62 62 62 62 62 62 61 61 61 61 61 60 61 61 61 61
866 61 61 61 61 61 60 60 60 60 61 61 61 61 61 62 61 61 61 61 61 61 61 60 60 60 60 60 60 60 60 60 59 59 59 59 59 59 59 59 59 59 59 59 59 59 59 59 58 58 58 58 58 57 57 57 57 57 57 57 57 57 57 56 56 55 55 56 56 56 56 56 56
859 56 56 56 56 56 56 56 56 56 56 56 57 57 57 57 57 57 57 57 57 57 57 57 57 57 57 57 57 57 57 57 57 57 57 57 57 57 57 57 57 57 56 56 56 57 57 57 56 56 56 56 56 56 56 56 55 55 55 55 55 55 55 55 55 55 55 55 55 55 55 55 55
851 55 55 55 55 55 54 55 55 55 56 56 56 56 56 56 56 56 56 56 56 56 56 56 56 56 56 57 56 56 56 56 56 56 56 56 56 56 56 57 57 58 58 57 58 58 58 58 57 57 57 57 57 57 56 56 56 56 56 56 56 56 56 56 56 56 56 56 56 56 56 56 56
844 56 56 56 56 56 56 56 56 56 56 56 56 56 56 56 56 56 56 56 56 57 57 57 56 56 56 56 56 56 56 56 56 56 56 56 56 56 56 57 57 57 56 56 56 56 55 55 55 55 55 55 55 55 55 55 55 55 55 55 55 55 55 55 55 55 55 55 55 55 56 55 55
836 55 55 55 56 56 56 56 56 56 56 56 55 55 56 56 56 56 56 56 56 56 56 56 55 55 55 56 56 56 56 56 56 56 56 56 56 56 56 55 55 55 55 55 56 56 56 56 56 56 56 56 55 55 55 56 56 56 56 56 55 55 55 55 55 55 55 55 55 55 55 55 55
829 55 55 55 55 56 56 56 56 56 56 55 55 56 56 56 56 56 56 56 56 56 56 56 56 56 56 56 56 56 57 56 56 56 57 57 58 58 58 58 58 59 59 59 59 59 59 59 59 59 58 58 58 57 57 57 57 57 57 56 56 56 56 56 56 55 56 57 57 56 56 56 56
821 56 56 56 56 56 56 56 56 56 56 56 56 56 56 56 56 56 56 56 56 56 57 57 57 57 57 57 58 58 58 59 59 59 59 59 59 59 59 59 58 58 59 59 59 59 58 58 58 58 58 57 57 57 56 56 56 56 56 56 56 55 55 55 55 55 55 55 55 55 55 55 55
814 55 55 55 55 55 55 55 55 55 56 55 55 55 55 56 56 56 56 56 56 55 55 55 56 56 56 56 56 56 56 56 55 55 55 55 56 56 56 56 56 56 56 56 56 56 56 56 56 56 56 56 55 55 55 55 54 55 55 55 54 54 54 54 54 54 54 54 54 54 54 54 54
806 54 54 54 54 54 54 54 54 54 54 54 54 54 54 54 54 54 54 55 55 55 54 54 54 54 54 54 55 55 55 55 55 56 56 55 56 56 55 55 55 55 55 56 56 55 55 55 55 55 55 55 56 56 56 56 56 55 55 55 55 55 55 55 55 55 55 56 56 56 56 55 55
799 55 56 56 56 56 56 56 55 55 55 55 55 55 55 56 56 56 55 55 55 55 54 55 55 55 55 55 54 54 54 55 55 55 55 55 55 55 55 55 54 54 54 54 54 54 54 54 54 54 55 54 54 54 54 54 54 54 54 54 54 54 55 55 54 54 54 54 54 54 54 54 54
791 54 54 55 55 55 55 55 54 54 54 55 55 55 55 55 55 55 55 55 55 55 54 54 54 54 54 53 54 54 54 54 53 53 53 54 54 54 54 54 53 53 53 53 53 53 53 54 54 53 54 54 54 54 54 54 54 54 54 54 54 53 54 54 54 54 54 54 54 54 54 54 54
784 54 54 54 54 54 54 54 54 54 54 54 54 55 55 55 55 55 55 55 55 55 55 55 55 55 55 55 55 55 55 55 56 56 56 55 55 55 55 55 55 54 54 54 55 55 55 55 55 55 55 55 55 55 55 54 54 54 55 55 54 55 55 55 55 54 54 54 54 54 54 55 55
776 55 55 55 55 55 55 55 55 55 54 54 54 54 54 54 54 54 54 54 54 54 54 54 55 55 55 55 55 55 54 54 54 54 54 54 54 55 54 54 54 54 55 55 55 55 54 54 54 54 54 54 54 54 54 54 54 55 54 54 54 54 53 53 53 53 53 53 54 54 54 54 54
769 54 54 54 54 54 54 54 54 54 54 54 54 54 54 54 54 55 54 54 54 54 54 54 54 55 55 55 55 55 55 55 55 55 55 55 55 55 55 55 55 55 55 55 55 55 55 56 56 56 56 56 56 56 56 56 56 56 56 56 56 56 56 56 57 57 57 56 56 56 56 56 56
761 56 56 56 56 56 56 56 56 57 57 57 57 56 56 56 56 56 56 56 56 56 56 56 55 55 55 55 55 55 55 55 56 56 56 56 56 56 56 55 55 55 55 55 55 56 56 56 56 56 56 56 56 56 57 57 56 56 56 57 56 56 56 56 57 57 57 57 56 56 56 56 56
754 56 57 57 57 57 57 58 58 59 60 60 60 61 61 61 62 63 64 63 62 62 61 61 60 60 59 58 58 57 57 57 56 56 56 56 56 56 56 56 56 56 56 56 56 56 56 56 56 56 56 56 56 56 56 57 57 57 57 57 56 56 57 57 57 57 57 57 57 57 57 57 57
746 57 58 58 58 58 59 60 60 61 62 62 62 62 61 61 61 61 60 59 58 58 58 58 57 57 56 56 56 56 56 56 55 55 55 55 55 55 56 56 56 55 56 56 56 56 55 55 55 55 55 55 55 55 55 55 55 55 55 54 54 54 54 54 54 54 55 55 55 55 55 55 55
738 55 55 55 55 55 56 56 55 55 55 55 54 55 55 55 55 55 55 55 55 55 55 55 55 55 55 55 55 55 55 55 55 55 55 55 55 55 55 55 55 55 55 55 55 55 55 55 55 55 55 55 55 55 55 55 55 55 55 55 55 55 55 55 55 55 55 55 55 55 55 55 55
731 55 55 55 55 55 55 55 55 54 54 54 54 54 54 54 54 54 54 55 55 55 55 55 54 54 55 55 55 55 55 55 55 55 55 55 55 55 55 55 55 55 55 55 55 55 55 55 55 55 55 55 55 55 55 55 55 55 54 54 54 54 54 54 54 55 55 55 55 55 55 55 55
723 55 55 55 55 55 55 55 54 54 54 54 54 54 54 54 54 55 55 55 55 55 55 55 55 55 55 55 55 55 55 55 55 55 54 54 54 54 55 55 55 55 55 55 55 55 54 54 54 55 55 55 55 55 55 55 55 55 55 55 55 55 55 55 55 55 55 56 56 56 56 56 56
716 56 56 56 56 56 55 55 55 54 54 54 55 55 55 56 55 55 55 55 55 55 55 55 55 54 54 54 54 54 55 55 55 55 55 55 55 54 54 54 54 54 54 54 54 54 54 54 55 55 55 55 55 55 56 55 55 55 55 56 56 55 55 55 55 55 55 54 55 55 55 56 55
708 55 55 55 55 55 55 55 55 55 55 55 55 55 55 55 55 55 54 54 54 54 54 54 54 54 54 54 54 54 54 54 53 54 54 54 55 54 54 54 54 54 54 54 54 54 54 54 54 54 55 55 55 55 55 56 56 56 56 56 56 56 56 55 55 55 55 55 55 55 55 55 55
701 55 55 55 55 55 55 55 55 55 55 55 55 55 55 55 55 55 55 54 55 55 55 55 55 55 55 56 56 56 55 55 55 55 55 55 55 55 55 55 56 56 55 55 55 55 55 56 56 56 56 56 57 57 57 57 57 57 56 56 56 56 55 55 55 54 54 54 55 55 55 55 55
693 55 55 55 55 55 55 55 55 55 55 56 55 55 55 55 55 55 55 55 55 55 55 55 55 55 55 55 55 55 55 55 55 55 55 55 55 55 55 55 55 55 55 55 55 55 55 54 54 54 55 55 55 54 54 54 54 54 54 54 54 54 54 54 54 54 54 54 54 54 54 54 54
686 54 54 54 54 54 54 54 54 54 54 54 53 54 54 54 54 54 54 54 54 54 54 54 54 54 53 54 54 54 54 54 54 54 54 54 54 54 55 55 55 54 54 54 54 55 55 55 54 54 54 54 54 54 54 54 54 54 54 54 54 54 54 54 54 54 54 54 54 54 54 54 54
678 54 54 54 54 54 54 54 54 54 54 54 54 53 53 54 54 54 54 54 53 54 54 54 54 54 55 55 55 55 55 55 55 55 55 55 55 55 55 54 54 54 54 54 54 54 54 54 55 55 55 55 55 55 55 55 55 55 55 55 55 55 55 55 56 55 55 55 55 55 55 55 55
671 55 55 55 55 55 55 55 55 55 55 55 55 55 55 55 55 55 55 55 55 55 55 55 55 55 55 55 55 55 55 55 55 55 55 55 55 55 56 55 55 56 56 56 56 56 56 56 56 56 56 57 57 57 57 57 57 57 57 57 56 56 56 56 56 56 56 56 55 55 55 55 56
663 56 56 55 55 55 55 55 55 55 55 55 55 55 55 55 55 55 54 54 54 54 55 55 55 55 54 54 54 54 54 54 55 55 55 55 55 56 56 57 57 57 57 56 56 56 56 56 56 56 56 56 55 55 55 55 55 55 55 55 55 55 55 55 55 55 55 55 55 55 55 55 55
656 55 55 55 55 55 55 55 55 55 55 55 55 55 55 55 55 55 55 55 55 55 55 55 55 55 55 54 54 54 54 55 55 55 55 55 55 55 55 55 55 55 55 55 55 55 55 55 55 55 55 55 55 55 55 55 55 55 56 56 56 55 55 54 55 55 55 55 55 55 55 55 55
648 55 55 55 55 55 55 55 55 55 55 55 55 55 55 55 55 55 55 54 54 54 54 54 54 55 55 55 55 55 55 55 55 55 55 55 55 55 55 55 55 55 55 55 55 55 55 55 55 55 54 54 54 54 54 55 55 55 55 54 54 54 54 54 55 55 55 55 55 55 55 55 55
641 55 55 55 55 54 54 54 54 54 55 55 55 55 55 55 55 55 54 54 54 54 55 55 55 55 55 55 55 54 54 54 54 54 54 54 54 54 54 54 54 54 55 55 55 55 55 55 55 55 55 55 55 55 55 55 55 54 54 54 54 54 54 54 54 54 54 54 54 54 54 54 55
633 55 55 55 55 55 55 55 55 55 55 55 55 54 55 55 55 55 55 55 55 55 55 55 55 55 56 56 55 56 55 55 55 55 55 55 55 55 55 55 55 56 56 56 56 55 55 55 55 55 55 55 55 55 55 56 56 56 56 57 57 58 58 58 58 58 58 58 58 59 59 59 59
626 59 59 60 60 62 62 63 64 65 66 67 68 69 70 70 70 70 69 69 68 67 67 66 66 65 64 64 63 63 63 62 62 62 62 62 62 62 62 62 62 62 62 62 63 63 64 64 65 65 66 67 68 69 71 73 75 77 80 83 86 89 92 95 99 103 105 108 109 109 108 107 106
618 106 105 104 104 103 103 103 103 102 101 99 96 94 91 88 86 83 80 78 76 74 73 71 70 69 69 68 68 67 66 66 66 66 67 67 67 67 67 67 66 66 67 67 67 68 69 70 71 72 74 75 77 80 83 86 90 94 100 106 113 119 126 133 139 143 146 148 147 145 141 137
611 137 132 127 122 117 112 108 103 99 95 91 88 85 82 80 77 75 73 72 70 69 68 67 67 66 66 65 65 64 64 63 63 63 62 62 62 62 62 62 62 62 62 62 63 63 63 64 64 65 65 66 67 68 69 71 72 74 76 79 82 85 88 91 94 96 97 98 97 96 94 91
603 91 88 86 82 79 77 74 72 70 69 67 66 66 65 64 64 63 63 62 62 62 61 61 60 60 60 60 59 60 60 59 59 59 59 59 58 58 58 58 58 57 57 57 57 57 57 57 57 57 57 57 57 57 57 57 57 57 56 56 56 57 57 57 57 57 57 57 57 58 58 58 59
596 59 59 58 58 58 58 58 58 58 59 59 60 60 61 61 61 61 61 61 61 61 61 61 61 61 61 61 61 61 61 61 61 61 61 62 62 61 61 61 60 60 60 60 61 61 61 61 61 61 61 61 60 60 60 60 60 60 60 60 60 61 61 61 61 61 61 60 60 60 61 61 60
588 60 60 59 60 60 60 60 61 61 61 61 61 61 61 61 61 61 61 61 61 61 61 61 61 61 61 61 61 61 61 61 61 61 61 61 61 60 60 60 60 60 60 60 60 60 60 60 60 60 60 60 60 60 60 59 59 59 59 58 58 58 57 57 57 57 57 57 57 57 58 58 58
581 58 58 58 58 58 58 57 57 57 57 57 57 57 57 57 57 56 56 56 56 56 56 55 55 55 56 56 56 56 56 56 56 56 56 56 56 56 56 56 56 56 55 55 55 55 56 56 56 56 56 55 56 56 56 56 56 56 56 56 56 56 56 56 56 56 56 55 55 55 55 56 56
573 56 56 56 56 56 56 56 56 56 56 56 56 56 56 56 56 56 56 56 56 56 56 57 57 57 57 57 57 57 57 57 57 57 57 57 57 57 56 56 57 57 57 57 57 57 57 57 57 57 57 57 58 57 57 57 56 57 57 57 57 57 57 57 57 57 57 57 56 56 56 56 56
566 56 56 56 56 56 56 56 56 56 56 56 56 56 55 55 55 55 56 56 56 55 55 56 56 57 57 57 57 57 56 56 56 56 56 56 56 56 56 57 57 56 56 56 56 56 56 56 56 56 56 56 56 56 56 56 56 56 56 55 55 55 56 55 55 55 55 55 55 55 55 55 55
558 55 55 55 55 55 55 55 55 55 54 54 54 54 54 54 54 54 54 54 54 54 54 54 54 54 54 54 54 54 54 54 54 54 54 54 53 53 53 53 53 53 53 53 53 53 53 53 53 54 54 53 53 53 53 53 53 52 52 52 52 52 52 53 53 52 53 53 52 52 52 52 52
551 52 53 53 53 53 52 52 52 53 52 52 52 52 52 52 52 52 52 52 52 52 53 53 53 53 53 52 53 53 53 53 53 53 53 54 54 53 53 53 53 53 53 53 53 53 53 53 53 53 53 53 53 53 53 54 54 53 53 53 53 53 53 52 52 53 53 53 53 53 53 53 53
543 53 53 52 52 53 53 53 53 53 53 53 53 53 54 54 54 53 53 53 53 53 53 53 53 53 53 53 54 53 53 53 53 53 53 53 53 53 53 53 53 53 54 54 54 54 54 54 53 54 54 54 54 54 54 54 54 53 53 53 54 53 53 53 53 54 54 54 54 53 53 53 53
536 53 53 53 53 53 53 54 54 54 54 54 53 53 53 54 54 54 54 53 54 54 54 54 54 54 54 54 54 54 54 54 53 53 53 53 53 53 53 53 53 53 53 53 53 54 53 53 53 53 53 53 53 53 53 53 53 53 53 53 53 53 53 53 53 53 53 53 53 53 53 53 53
528 53 53 53 53 53 53 54 54 53 53 53 53 53 53 54 53 53 53 53 53 53 53 53 53 53 53 53 53 53 54 54 54 54 54 54 54 53 53 53 53 53 53 53 53 53 53 53 53 54 53 53 53 53 53 53 53 54 54 53 53 53 54 53 53 53 53 53 53 53 53 53 53
520 53 53 53 53 53 53 53 53 53 53 53 53 53 53 53 53 53 53 54 54 54 54 54 53 53 53 53 53 54 54 53 54 54 54 54 54 54 54 53 54 54 54 54 54 54 54 54 54 55 55 55 54 54 54 54 55 54 54 54 54 54 54 54 54 54 54 53 53 53 53 54 54
513 54 54 54 54 54 54 54 53 53 54 54 54 54 54 54 54 54 54 54 54 54 54 53 53 53 53 53 53 53 53 53 53 53 53 53 53 54 54 54 53 53 53 53 53 53 53 53 53 54 54 54 53 53 53 53 53 53 53 53 52 52 52 53 53 53 53 53 53 53 53 53 53
505 53 53 53 53 52 52 52 53 53 53 52 52 53 53 52 53 53 53 53 53 54 54 54 54 54 54 54 53 53 53 54 54 54 54 54 54 54 54 54 54 54 54 54 54 53 53 53 53 53 53 53 53 54 54 54 54 54 54 54 54 54 54 54 54 54 54 54 54 55 55 55 55
498 55 54 54 54 54 54 54 54 53 53 53 53 53 52 52 52 53 53 53 53 53 53 53 53 53 53 53 52 52 52 52 53 53 53 53 53 53 53 53 52 52 53 53 53 53 53 53 53 53 54 54 54 54 53 54 54 54 54 54 54 54 54 54 54 54 54 54 54 54 54 53 53
490 53 52 52 52 52 52 52 52 51 51 51 51 51 51 51 50 50 50 50 49 49 48 48 48 48 48 48 48 48 48 48 48 48 48 49 49 49 49 49 49 49 49 49 49 49 50 50 50 50 50 50 51 51 51 51 51 51 51 52 52 52 52 52 52 53 53 53 53 53 53 52 52
483 52 52 52 52 52 52 52 52 52 51 51 51 51 51 51 51 51 52 52 52 52 52 52 52 52 52 52 52 52 52 52 52 52 52 52 52 52 53 53 53 53 53 53 53 54 54 54 54 54 54 54 55 54 54 54 54 54 54 54 54 54 54 54 54 55 55 55 55 55 55 55 55
475 55 55 55 55 55 55 55 55 55 55 55 55 55 55 55 55 55 55 55 55 55 55 55 55 55 55 55 55 55 54 54 54 54 54 54 54 54 53 53 53 53 53 53 53 53 53 53 53 53 53 52 52 52 52 52 52 52 51 52 52 52 52 53 52 52 52 52 52 52 52 52 52
468 52 52 52 52 52 52 52 52 52 52 52 52 52 53 52 52 52 52 52 52 52 52 52 52 52 51 51 51 51 51 51 51 51 50 50 50 50 49 49 49 49 49 49 49 49 49 49 49 49 49 49 49 49 49 49 49 49 49 50 50 50 50 50 50 50 50 51 51 51 51 51 51
460 51 51 51 52 52 52 52 52 52 52 52 53 53 53 52 52 52 52 53 53 53 53 52 52 52 52 52 52 52 52 52 52 52 51 51 51 52 52 51 51 51 52 52 52 52 52 52 52 52 52 52 52 52 52 52 52 52 52 52 52 52 52 52 52 52 53 53 53 53 52 52 53
453 53 53 53 53 53 53 53 53 52 52 53 53 53 53 53 53 54 54 54 53 53 53 53 53 53 53 53 53 54 54 54 54 54 54 54 54 54 54 54 54 54 54 54 54 53 53 53 53 53 53 53 53 54 54 54 55 54 54 54 54 54 54 54 54 53 53 53 53 53 53 53 53
445 53 53 53 53 52 53 53 53 53 52 53 53 53 53 52 52 52 53 53 53 53 53 53 53 53 53 53 53 53 53 53 53 52 53 53 53 53 53 53 53 53 53 53 53 53 53 53 53 52 52 52 52 52 53 53 53 53 52 52 53 53 53 53 53 53 53 53 53 53 53 53 53
438 53 54 53 53 53 53 53 53 53 52 52 52 52 52 52 52 53 53 53 53 53 53 52 52 52 53 53 53 53 53 53 53 53 53 53 53 52 52 52 52 53 53 53 53 53 52 53 53 53 53 53 52 52 52 52 52 52 52 52 52 52 52 52 52 52 52 52 52 53 53 53 53
430 53 53 52 53 53 53 53 52 52 52 52 52 52 52 52 52 52 52 52 52 52 52 52 52 52 52 53 52 52 52 51 51 51 51 51 52 52 52 52 52 52 52 51 51 51 52 52 52 52 52 52 52 52 52 52 52 52 52 52 52 52 52 52 52 53 53 53 52 52 52 52 52
423 52 52 52 52 52 53 53 53 53 52 52 52 52 53 53 53 53 53 53 53 53 53 53 53 53 53 53 53 53 53 53 53 53 53 53 53 53 53 53 53 53 53 53 53 53 53 53 53 53 53 53 53 53 53 53 53 53 52 52 53 53 53 53 53 53 53 53 53 52 52 52 52
415 52 52 52 51 52 52 52 52 52 52 52 52 52 52 52 52 52 52 52 52 52 52 52 52 52 52 52 52 52 52 52 52 52 52 52 52 52 52 52 52 52 52 52 52 52 52 52 52 51 51 51 51 52 51 51 51 52 52 52 52 52 52 52 52 52 52 52 52 52 52 52 52
408 52 52 52 51 51 52 52 52 52 52 52 52 51 52 52 52 52 52 52 52 51 51 51 51 51 52 52 51 51 51 51 51 51 51 51 51 51 52 51 51 51 51 51 51 52 52 52 52 52 52 52 51 51 51 51 52 52 52 51 51 51 52 52 52 52 52 52 52 52 52 52 52
400 52 52 52 52 52 52 52 52 52 52 52 52 52 52 52 52 52 52 52 52 52 52 52 52 52 52 52 53 53 53 53 53 53 53 52 52 52 52 52 52 52 52 52 52 52 52 52 53 53 53 53 53 53 53 53 53 52 52 52 52 52 52 52 52 52 51 51 51 51 51 51 51
393 51 51 51 51 51 52 52 52 52 52 52 51 52 52 52 52 52 52 52 53 52 52 52 52 52 53 53 53 53 53 53 53 54 54 54 54 54 54 53 53 53 53 53 53 53 53 53 52 52 52 52 53 52 52 52 52 52 52 52 52 51 51 51 51 52 51 51 51 51 51 51 51
385 51 51 50 51 51 51 51 51 52 52 51 52 52 52 52 52 51 51 51 52 52 52 52 52 52 53 53 53 53 53 53 54 54 54 54 54 54 54 54 54 54 54 53 53 53 53 53 53 53 53 53 53 53 52 52 52 52 52 52 52 52 52 52 53 52 52 52 52 52 52 52 52
378 52 52 52 52 52 52 52 52 52 52 52 52 52 53 53 52 52 52 52 52 52 52 53 53 53 53 53 53 53 53 53 53 53 53 52 52 52 52 51 51 51 51 52 52 51 51 51 52 52 52 52 52 52 52 52 52 52 52 52 52 52 52 52 52 52 52 52 52 52 52 52 52
370 52 53 53 53 53 53 53 53 52 52 52 52 51 52 52 52 52 52 52 52 52 52 52 51 51 51 51 51 50 50 51 51 51 50 50 49 50 50 49 49 49 49 49 49 49 49 50 50 50 50 50 50 50 50 50 50 51 51 51 51 51 51 51 51 51 51 52 52 52 52 52 53
363 53 53 53 53 54 54 54 54 54 54 53 53 53 53 53 53 53 53 53 53 53 52 52 52 52 52 52 52 51 51 51 51 51 51 50 50 50 51 51 51 51 51 51 50 51 51 51 51 52 52 51 51 51 51 52 52 52 52 52 51 51 51 51 51 52 51 51 51 52 52 52 52
355 52 52 52 52 52 52 52 52 52 52 52 52 52 52 52 52 52 52 52 52 52 52 52 52 52 52 52 52 52 52 52 52 52 52 53 53 53 53 53 52 52 52 52 52 52 52 52 52 52 52 52 52 52 52 52 52 52 51 51 51 52 52 52 52 52 51 51 51 51 51 51 51
347 51 51 52 52 52 52 52 52 52 52 52 51 52 52 52 52 52 52 52 52 52 52 51 51 51 51 51 51 51 51 52 52 52 52 52 52 51 51 51 51 51 51 51 51 51 51 51 51 51 51 51 52 52 52 51 52 52 52 52 52 52 52 52 52 52 52 52 52 52 52 52 52
340 52 52 52 52 52 52 52 52 52 52 52 52 52 52 52 52 52 53 52 52 52 52 52 52 52 52 52 52 52 52 52 52 52 51 51 51 52 51 51 51 51 52 52 52 52 52 52 52 52 52 52 53 53 53 52 52 52 52 52 52 52 52 52 52 53 53 53 53 53 53 53 53
332 53 53 53 53 53 53 53 53 52 52 52 52 52 52 53 53 52 53 53 52 52 52 52 53 52 52 52 52 52 53 52 52 52 52 52 52 52 52 52 52 52 52 52 52 51 51 51 51 51 52 52 52 51 51 51 51 51 51 51 51 51 51 51 51 51 51 51 51 51 51 51 52
325 52 52 51 51 52 52 52 52 52 52 51 51 51 52 52 51 52 51 51 52 52 52 52 52 52 51 51 51 51 51 51 51 52 52 52 52 52 51 51 51 51 51 51 51 50 51 51 51 51 51 51 51 52 51 51 51 51 51 51 51 51 51 51 51 51 51 51 51 51 51 51 52
317 52 52 52 52 52 52 52 52 52 52 52 52 52 52 52 52 52 52 52 52 51 51 51 51 51 51 51 51 51 51 51 51 51 51 52 52 51 51 51 51 51 51 51 51 51 51 51 51 51 51 51 51 51 51 51 51 51 52 52 51 51 51 51 51 51 51 51 51 51 52 52 52
310 52 52 52 52 51 51 51 51 52 51 51 51 51 51 51 51 52 52 52 52 52 52 52 52 52 52 52 52 52 51 51 52 51 51 52 52 52 51 51 51 51 51 51 51 51 51 52 52 52 52 52 52 52 52 52 52 52 52 52 52 51 51 51 51 51 51 52 52 52 52 52 52
302 52 52 52 52 52 52 52 52 52 52 52 52 52 52 52 52 52 52 52 52 52 52 52 52 52 52 52 51 52 52 52 52 52 52 52 52 52 52 52 52 52 52 52 52 52 53 52 52 52 52 52 52 52 52 52 52 52 52 52 51 52 52 52 52 52 52 52 52 52 52 52 52
295 52 52 52 52 53 52 52 52 52 52 52 52 53 53 52 52 52 52 52 52 52 52 52 52 52 52 52 52 51 52 52 52 52 52 52 52 53 53 52 52 52 52 52 52 52 52 53 53 53 53 53 53 53 53 53 53 53 53 53 53 53 53 53 53 53 52 53 53 52 53 53 53
287 53 53 53 53 53 53 53 53 53 53 53 53 52 52 53 53 53 53 53 53 53 53 53 53 53 53 53 53 53 53 53 53 53 53 53 53 52 52 52 52 52 52 52 52 52 52 52 52 52 52 52 51 51 51 51 51 51 51 51 52 52 52 52 52 52 52 52 52 52 52 52 52
280 52 52 52 52 52 52 53 53 53 53 53 53 52 52 52 53 53 53 53 53 53 52 52 52 52 52 52 52 52 52 52 52 52 52 52 51 51 51 51 51 51 51 51 51 51 51 51 51 51 50 50 50 50 50 50 50 50 50 51 51 51 51 50 51 51 51 51 52 52 52 52 52
272 52 52 52 52 52 52 52 52 52 52 52 52 52 52 52 52 52 52 52 52 52 53 53 53 53 53 52 52 52 52 51 51 51 51 51 51 51 50 50 50 50 50 50 50 50 50 50 50 50 50 50 50 50 50 50 51 51 51 51 51 51 51 51 51 51 51 51 52 52 52 52 52
265 52 52 52 52 52 52 53 53 53 53 53 53 53 53 53 53 52 53 53 53 52 52 51 51 51 51 51 51 50 50 50 50 50 49 49 48 48 48 48 48 48 48 48 48 48 48 47 47 48 48 48 48 49 49 49 49 49 49 50 50 50 50 50 50 50 51 51 51 52 52 52 52
257 52 52 52 52 52 52 52 52 52 52 52 52 52 52 52 52 52 52 51 51 51 51 51 51 51 51 51 50 50 50 50 49 49 49 49 49 49 49 49 48 48 48 48 48 48 48 49 49 50 50 50 50 50 50 50 50 50 50 50 50 51 51 51 51 51 51 52 52 52 52 52 53
250 53 53 53 53 53 52 52 52 52 52 51 52 52 52 52 52 53 53 53 53 52 52 52 52 52 52 52 52 52 52 52 52 52 52 52 52 52 52 52 52 52 52 52 52 53 52 52 52 52 52 52 52 53 53 53 53 53 52 52 52 51 51 51 52 52 52 52 52 52 52 52 53
242 53 53 53 53 52 52 53 53 53 53 53 53 53 53 53 53 52 52 52 52 52 52 52 53 52 52 52 52 52 52 53 53 53 53 53 53 53 53 53 53 53 53 53 53 53 53 53 53 53 54 54 53 53 53 53 53 53 53 53 53 53 53 53 52 52 53 53 53 53 53 53 53
235 53 53 52 53 53 53 53 52 52 52 52 53 53 52 52 52 52 52 53 53 53 53 53 52 52 52 52 52 52 52 52 52 52 52 52 52 52 53 53 53 53 53 53 52 52 52 52 53 53 53 53 53 53 53 53 53 53 53 53 53 53 53 52 52 52 52 52 52 52 52 52 52
227 52 52 52 52 52 52 52 52 52 52 52 51 51 51 51 51 51 52 52 52 52 52 52 52 52 52 52 52 52 52 52 52 51 51 51 51 51 51 51 51 51 51 51 51 51 51 51 51 51 51 51 51 51 51 51 51 51 51 51 51 51 51 51 51 51 51 51 51 51 50 50 51
220 51 51 52 52 51 51 51 51 51 51 51 51 51 51 51 51 51 51 51 51 51 51 51 51 51 51 51 51 51 51 51 51 51 51 51 51 51 51 51 51 51 51 51 51 51 51 51 51 51 51 51 51 51 51 51 51 51 51 51 51 52 52 52 52 51 51 51 51 51 51 52 52
212 52 51 51 51 51 51 51 51 50 50 50 51 51 50 50 50 51 51 51 51 51 51 50 50 50 50 50 50 51 51 51 51 51 51 51 51 51 51 51 51 51 51 51 51 51 50 51 51 51 51 51 51 51 51 51 51 51 51 51 51 51 51 51 51 52 52 51 51 51 51 51 51
205 51 51 51 51 51 51 51 51 51 51 51 51 51 51 51 51 51 51 51 51 51 51 51 51 51 51 51 51 51 51 51 51 51 51 51 51 51 51 51 51 51 51 51 51 51 51 51 51 51 51 51 51 50 50 51 51 51 51 50 51 51 51 51 52 51 51 51 51 51 51 51 51
197 51 51 51 51 51 51 51 51 51 51 51 51 51 52 52 51 51 51 51 51 51 51 51 51 51 51 51 51 51 51 51 51 51 51 51 51 51 51 51 51 51 51 51 51 52 52 52 51 51 51 51 51 51 51 52 52 51 51 51 51 51 51 51 51 51 51 50 50 50 50 51 51
189 51 51 50 50 50 51 51 51 51 51 51 51 51 51 51 51 51 51 51 51 51 51 51 51 51 50 51 51 51 52 52 52 51 51 51 51 51 51 52 51 51 51 52 52 52 52 52 52 52 52 52 52 51 51 51 51 52 51 51 51 51 51 51 51 51 52 52 52 52 51 51 51
182 51 51 50 50 50 51 51 51 51 51 51 51 51 51 51 52 51 51 51 51 51 51 50 50 50 50 50 50 50 51 51 51 51 51 51 51 51 51 51 51 51 51 51 51 51 51 51 51 51 51 51 51 51 51 51 51 51 51 51 51 51 51 51 51 51 50 50 51 51 51 51 51
174 51 51 50 50 50 50 50 50 50 50 50 50 50 50 50 50 50 50 50 50 50 50 50 50 50 51 51 51 51 51 51 51 51 51 51 51 51 51 51 51 51 51 51 51 51 51 51 51 51 51 51 51 51 51 51 51 51 51 51 51 51 51 50 50 50 50 51 51 51 50 50 50
167 50 51 51 52 51 51 50 50 50 51 51 51 51 51 51 51 51 51 51 51 51 51 51 51 51 51 51 52 51 51 51 51 52 52 52 52 52 52 52 52 52 52 51 51 51 51 52 51 51 51 51 51 51 51 52 52 52 51 51 51 51 51 50 50 51 51 51 50 50 51 51 50
159 50 50 50 50 51 51 51 51 51 51 51 51 51 51 51 51 51 51 51 51 52 52 51 51 52 52 51 52 52 52 53 53 52 52 52 52 52 51 51 51 51 51 51 51 52 52 51 51 51 51 51 51 51 51 51 51 51 51 51 51 50 50 51 51 51 51 50 50 50 51 51 51
152 51 51 51 51 51 51 51 51 51 51 51 50 50 51 51 51 51 50 51 51 51 51 51 51 51 52 52 52 52 52 52 52 52 52 52 52 52 52 51 51 51 51 51 51 51 51 51 51 51 52 51 51 51 51 51 52 52 52 52 52 52 52 51 51 51 51 51 50 51 51 51 51
144 51 51 51 51 51 50 50 50 50 51 51 51 50 50 50 50 50 50 51 51 51 51 51 51 51 51 51 51 51 51 51 51 51 51 51 51 51 51 51 51 51 51 51 52 51 51 51 51 51 51 51 51 51 51 51 51 51 51 51 51 51 51 51 51 51 51 51 52 52 52 51 51
137 51 51 51 51 51 52 52 52 51 51 51 51 51 51 51 51 51 51 51 51 51 51 52 52 51 51 51 52 52 52 52 52 52 51 52 52 52 52 51 51 52 52 52 52 52 52 52 51 51 51 51 51 52 52 52 52 52 52 52 52 52 52 51 51 51 52 52 52 51 51 51 51
129 51 51 51 51 51 51 51 51 51 50 51 51 51 50 50 50 51 51 51 51 51 51 52 51 51 51 51 51 51 51 51 51 51 51 51 52 52 52 51 51 51 51 51 51 51 52 52 52 52 52 52 52 52 52 51 51 51 52 52 52 52 52 52 52 51 51 51 51 51 51 51 51
122 51 51 51 51 51 51 51 51 51 51 51 51 52 51 51 51 51 51 51 51 51 51 51 51 51 51 51 51 51 51 51 51 51 51 51 51 51 50 50 50 50 51 51 51 51 51 51 51 51 51 51 51 51 51 51 51 51 51 51 51 51 51 51 51 51 51 51 51 51 51 51 51
114 51 51 51 51 51 51 52 51 51 51 51 51 51 52 52 52 52 52 52 52 52 52 52 52 52 52 52 52 52 52 52 52 52 52 52 52 52 52 52 52 52 52 52 52 51 51 51 51 50 51 51 51 51 51 51 51 51 51 51 51 52 51 51 52 51 51 52 52 52 52 52 51
107 51 51 51 51 51 52 51 51 51 51 51 51 52 52 52 52 52 52 52 53 52 52 52 52 52 52 52 52 52 53 53 54 55 55 55 55 55 54 54 53 52 52 52 52 52 52 52 52 52 52 52 52 53 53 53 54 54 54 55 55 56 56 56 55 55 55 54 54 54 53 53 53
99 53 53 53 53 53 53 53 53 53 53 53 53 53 53 53 53 53 53 53 53 52 52 52 52 51 51 51 51 51 51 51 51 51 51 51 51 51 52 52 52 52 52 52 52 52 51 51 51 51 51 51 52 52 52 52 52 52 52 52 51 51 51 51 51 51 51 51 51 51 51 51 51 51
92 51 51 51 52 52 52 52 52 51 51 52 52 52 52 51 51 51 51 51 51 51 51 51 51 51 51 51 51 51 51 51 51 51 51 51 51 51 50 50 50 50 51 51 51 51 51 51 51 50 50 50 50 51 51 51 51 51 51 51 51 51 51 51 51 51 51 51 51 51 51 51 51 51
84 51 51 51 51 51 51 50 51 51 51 51 51 51 51 51 51 50 50 50 50 50 50 50 50 50 50 50 50 50 51 51 51 51 51 51 51 52 52 52 53 53 53 53 54 55 55 56 55 55 55 55 55 54 54 53 53 53 53 52 52 52 52 52 52 51 51 51 52 52 52 52 52 52
76 52 52 52 52 52 52 53 53 53 54 55 55 55 55 55 55 55 54 54 54 53 53 53 53 52 52 52 53 53 53 53 52 52 52 52 52 51 51 51 51 52 52 52 52 52 52 52 51 51 51 51 51 51 51 51 51 51 52 52 52 52 52 52 52 52 52 52 52 52 52 52 52 52
69 52 52 52 52 51 51 51 51 51 51 51 51 51 51 51 51 51 51 51 51 51 51 51 51 51 51 51 51 51 51 51 51 51 51 51 51 51 51 51 51 51 51 51 51 52 52 51 51 51 51 51 52 52 52 52 52 52 52 52 52 52 52 52 52 52 52 51 51 50 50 51 51 51
61 51 51 51 51 51 51 51 51 51 52 52 52 51 51 51 51 51 51 51 51 51 52 52 52 52 52 53 53 53 53 53 53 53 53 53 53 53 53 53 53 52 52 52 53 53 53 53 54 54 54 55 55 55 55 55 54 55 55 55 55 55 55 55 55 56 56 57 58 58 59 60 62 64
53 64 66 68 71 75 81 88 96 105 114 122 128 131 130 127 120 111 101 92 84 78 73 68 65 62 60 58 57 56 56 55 55 55 54 54 54 54 54 54 54 54 53 53 53 53 54 54 54 54 54 54 53 53 53 53 52 52 51 51 51 51 51 51 51 50 50 50 50 50 50 50 50
46 50 50 50 50 50 49 49 49 49 49 49 49 49 49 49 49 49 50 50 50 50 50 49 49 50 50 50 50 50 51 51 51 51 51 51 51 51 51 51 52 52 51 51 51 51 51 51 51 51 51 51 51 51 51 51 51 51 51 51 51 51 50 50 50 51 51 51 51 51 51 51 51 51
38 51 51 51 51 50 50 51 51 51 51 51 51 51 51 50 50 50 50 50 50 50 50 50 50 51 50 50 50 50 50 49 49 50 50 50 49 49 49 49 50 50 49 49 49 49 49 49 49 49 49 50 50 50 49 49 50 50 50 50 50 50 50 50 50 51 51 51 50 50 50 50 50 50
31 50 50 50 50 50 50 50 50 50 50 50 50 50 50 50 50 50 51 51 50 50 50 50 50 50 50 50 51 51 51 51 51 51 51 51 51 51 51 50 50 50 50 50 50 50 50 50 50 50 50 50 50 50 50 50 51 51 51 51 51 51 51 51 51 51 50 50 50 50 50 50 50 50
23 50 50 51 51 50 50 50 50 51 51 51 52 51 51 51 51 51 51 50 50 50 50 50 50 50 50 50 50 50 50 50 50 51 51 51 51 51 50 50 51 51 51 50 50 50 51 51 51 51 51 51 51 51 51 51 51 51 51 50 50 50 50 50 50 51 51 51 51 51 51 51 51 51
15 51 50 50 50 51 51 51 51 51 51 51 51 51 51 50 50 50 50 50 50 50 50 50 49 50 50 50 50 50 50 50 50 50 50 50 50 50 50 49 49 49 50 50 50 50 50 50 50 50 50 50 49 50 50 50 50 50 49 49 49 50 50 50 50 50 50 50 50 50 50 50 50 50
8 50 50 50 50 50 50 50 50 50 49 49 49 49 49 49 50 50 50 50 50 49 49 49 50 50 50 50 49 49 49 50 50 50 50 50 50 50 50 50 50 50 50 50 50 50 50 50 50 50 50 50 50 50 50 50 50 50 50 50 50 50 50 50 50 50 51 51 51 51 51 51 51 51 51
0 51 51 51 51 50 50 50 51 51 51 51 51 51 51 51 51 50 51 51 51 51 51 51 51 51 51 51 51 51 51 51 51 51 51 51 51 51 51 51 51 51 51 51 51 51 51 51 51 51 51 51 51 51 51 51 51 51 51 51 51 51 52 52 52 52 51 51 51 51 51 51 51 51 51
-8 51 51 51 51 51 51 51 51 51 51 51 51 51 51 51 51 51 50 51 51 51 51 50 50 50 50 50 50 50 50 51 51 51 51 51 51 51 51 51 51 50 50 50 50 50 50 50 50 50 50 50 50 50 50 51 51 51 51 51 51 50 50 50 50 51 51 51 51 50 50 50 50 51
-15 51 51 51 51 51 51 51 50 50 50 50 50 50 51 51 51 50 50 50 50 51 51 50 50 50 50 50 50 50 50 50 50 50 50 50 50 50 50 50 50 50 50 50 50 50 50 50 50 50 50 50 50 50 50 50 50 50 50 50 50 51 51 51 51 51 51 51 51 51 51 51 50
-23 50 50 50 51 51 51 51 51 51 50 50 50 50 50 50 51 51 51 51 51 51 51 50 50 50 50 50 50 50 50 50 50 50 50 51 50 50 50 50 51 51 51 50 50 50 50 50 51 51 51 51 51 51 50 50 50 51 51 51 51 51 51 51 51 50 50 51 51 51 51 51 51
-30 51 51 50 50 50 50 50 50 50 51 51 51 50 50 50 50 50 50 50 50 50 50 50 50 50 50 50 50 50 50 50 50 51 51 50 50 50 50 50 50 50 50 50 50 50 50 50 50 49 49 50 50 50 50 50 50 50 50 50 50 50 50 50 50 50 50 50 50 50 51 51 51
-38 51 51 50 50 50 50 51 50 50 50 50 50 50 50 50 50 51 51 51 51 51 51 51 51 50 50 50 50 50 50 50 50 50 50 50 50 50 51 51 51 51 51 50 50 50 50 50 50 50 50 49 49 49 50 50 50 50 50 50 50 49 50 50 50 50 50 50 50 50 50 50 50
-45 50 49 49 50 50 49 49 49 50 50 50 50 50 49 49 49 49 49 49 50 50 50 50 50 50 50 50 50 50 50 50 50 50 50 50 50 50 50 50 50 50 50 50 50 50 50 50 50 50 50 49 50 50 50 50 50 50 50 50 50 50 50 50 50 51 51 51 51 51 51 51 51
-53 51 51 51 51 51 51 50 50 50 50 50 50 50 50 50 50 50 50 49 49 49 49 49 49 49 50 50 50 50 50 50 50 50 50 50 50 50 50 50 50 50 50 50 50 50 50 51 50 50 50 50 51 51 51 51 51 51 51 51 51 51 51 51 51 51 50 50 50 50 50 50 50
-61 50 50 51 51 51 51 51 51 51 51 50 50 50 50 51 51 50 50 50 50 50 50 50 50 50 50 50 50 50 50 50 50 50 50 50 50 50 50 50 51 51 51 51 51 51 51 51 51 51 50 50 50 50 50 50 50 50 50 50 50 51 51 51 51 51 51 50 50 50 49 49 50
-68 50 50 50 50 51 51 51 51 51 51 51 51 50 50 50 50 51 51 51 50 50 50 51 51 51 51 50 50 50 50 50 50 51 51 51 50 50 50 50 50 50 50 50 50 50 50 50 50 50 50 49 49 50 50 50 50 50 50 50 50 50 50 50 50 50 50 50 50 50 50 50 50
-76 50 51 51 51 51 51 51 51 51 51 50 50 50 50 50 51 50 50 50 50 50 50 50 50 50 50 50 50 50 50 50 50 50 50 50 49 50 50 50 50 50 50 50 49 50 50 50 50 50 50 50 50 50 50 50 50 50 50 50 50 50 50 50 50 51 51 50 50 51 51 51 51
-83 51 50 50 50 50 50 50 50 50 50 50 51 51 51 51 51 51 51 51 51 51 50 50 50 51 51 51 51 51 51 51 51 51 50 50 49 49 49 50 50 50 50 50 50 50 50 50 50 50 49 49 49 50 50 50 50 50 50 49 50 50 50 50 49 49 49 50 50 49 49 50 50
-91 50 50 49 49 49 50 49 49 49 49 49 50 50 50 50 49 49 49 49 50 50 49 50 50 50 50 50 49 50 50 50 50 50 50 50 50 50 50 51 51 51 51 51 51 51 51 51 51 51 51 51 51 51 51 51 51 50 51 51 51 51 51 51 52 52 52 51 51 51 51 51 51
-98 51 51 51 51 51 51 51 51 51 51 51 51 51 51 51 51 51 51 51 51 51 51 51 51 51 51 51 51 51 51 51 50 50 50 51 51 51 51 50 50 50 49 49 50 50 50 50 50 49 49 49 49 49 49 49 49 48 48 48 48 49 49 49 49 49 49 49 49 49 49 49 49
-106 49 49 49 50 50 49 49 49 50 49 50 50 50 50 50 50 50 50 50 50 50 50 51 51 51 50 50 50 50 50 50 50 50 50 50 49 49 49 49 49 49 49 49 49 48 48 48 48 47 47 47 47 47 47 47 47 47 47 47 47 47 47 47 48 48 48 48 48 48 48 48
-113 48 48 48 48 48 48 48 48 48 48 48 48 48 49 49 49 49 49 49 50 50 50 50 50 50 50 50 50 50 51 51 51 51 51 51 51 51 51 51 51 52 52 52 51 51 52 52 52 52 52 51 51 51 52 52 52 52 52 51 52 52 52 52 52 52 52 52 52 52 53 52
-120 52 52 52 53 52 52 52 52 52 52 52 52 52 52 52 52 52 52 52 52 51 51 51 51 51 52 52 52 51 51 51 51 50 50 50 50 50 50 50 50 50 49 49 49 49 49 49 49 49 49 49 49 49 49 49 49 49 49 49 49 49 48 48 48 48 48 49 49 48 49 49
-128 49 49 49 49 49 49 48 48 48 48 48 48 48 49 49 49 50 50 50 50 49 49 49 50 50 50 50 50 50 50 50 50 50 50 51 51 51 51 51 50 50 50 51 51 51 50 50 50 50 50 50 50 50 50 50 50 50 50 49 49 49 49 49 49 49 49 49 49 48 48 48
-135 48 48 48 48 48 48 48 48 48 48 48 48 48 48 47 47 48 48 48 48 48 48 48 48 48 48 49 49 49 50 50 50 50 50 50 50 50 50 50 50 50 50 50 50 50 50 51 50 50 50 50 50 50 50 50 51 51 51 51 51 51 51 51 51 51 52 51 51 51 51 51
-143 51 51 51 51 51 51 51 51 52 51 51 51 51 51 51 51 51 51 51 51 51 51 51 51 51 51 51 50 51 50 50 50 50 50 50 50 50 50 50 50 49 49 49 49 49 49 50 50 50 50 50 50 49 49 49 49 49 49 49 49 49 49 49 49 49 49 49 49 49 49 49
-150 49 49 49 49 49 49 49 49 49 49 49 49 49 49 49 49 49 49 49 50 49 49 49 49 49 49 49 49 49 49 49 49 49 49 49 49 49 49 49 49 49 49 49 49 49 49 50 50 50 50 50 50 50 49 50 50 50 50 50 50 50 50 50 50 50 50 50 50 50 50 50
-158 50 51 51 50 50 51 51 51 50 50 50 50 50 50 51 51 51 51 51 51 51 51 51 51 50 50 50 50 50 50 49 49 49 49 49 50 50 50 50 50 50 50 50 50 50 50 50 50 50 50 50 50 50 50 50 50 50 50 50 50 50 50 49 49 49 50 50 50 50 50 50
-165 50 50 50 50 50 50 50 50 49 49 50 50 50 50 50 50 50 50 50 50 50 50 50 50 50 50 50 50 50 50 50 50 50 50 50 50 50 50 50 50 50 50 50 50 50 50 50 50 50 50 50 49 49 49 50 50 50 49 49 49 49 49 50 50 50 50 50 50 50 50 50
-172 50 50 50 50 50 50 50 49 50 50 50 50 50 50 49 49 49 50 50 50 49 49 49 49 50 50 50 50 49 49 49 49 49 49 50 49 50 50 50 50 50 49 49 49 49 49 49 49 49 49 49 49 49 49 50 50 49 49 50 50 50 50 51 51 51 50 50 50 50 50 50
-180 50 50 50 50 50 49 50 50 50 50 50 50 50 50 50 50 50 49 49 49 49 49 49 49 49 49 49 49 49 49 49 49 49 49 49 49 49 50 50 50 50 50 50 49 49 49 49 49 49 49 49 49 50 50 50 50 50 50 50 50 50 50 50 50 50 49 49 49 50 50 49
-187 49 50 50 50 50 50 50 50 50 50 50 50 50 50 50 49 49 49 49 49 49 49 49 49 49 49 49 49 50 50 50 50 50 49 49 49 49 50 50 50 50 49 49 49 49 49 49 50 49 49 49 49 49 49 49 49 49 49 49 49 49 49 49 49 49 49 49 49 49 49 49
$$ [...]
-2638E6
##END=		$$ NMR SPECTRUM
##END=		$$ LINK
