##TITLE=	RP343 char_2.10.fid
##JCAMP-DX=	6.0	$$ MestReNova 14.3.3-33362
##DATA TYPE=	LINK
##BLOCKS=	1    
##ORIGIN=	Mestrelab Research S.L.
##OWNER=	hrzepa
##$MNOVA/METADATA=	(DOCUMENT,BASE64)
eyJuYW1lIjoiL1VzZXJzL2hyemVwYS9MaWJyYXJ5L01vYmlsZSBEb2N1bWVudHMvY29tfmFwcGxlfkN
sb3VkRG9jcy9TaGVwcGFyZC9OTVIgZmlsZXMgemlwcy0yLzIyLzIyLUgubW5vdmEiLCJwYWdlcyI6W3
siaXRlbXMiOlsiMSIgICAgIF19XX0=
##TITLE=	RP343 char_2.10.fid
##JCAMP-DX=	6.0	$$ MestReNova 14.3.3-33362
##DATA TYPE=	NMR SPECTRUM
##DATA CLASS=	XYDATA
##BLOCK_ID=	1
##ORIGIN=	Bruker BioSpin GmbH
##OWNER=	nmrsu
##NUMDIM=	1
##$MNOVA/METADATA=	(ITEM,BASE64)
eyJhbmdsZSI6MCwiYXhlcyI6eyJ4Ijp7Im1heCI6MTYuMDY0MjU5OTk5OTM5MTI1LCJtaW4iOi0zLjc
2Njk0MjMzOTE1NjYyMjZ9LCJ5Ijp7Im1heCI6NDIyODcuOTc5MDAzOTA2MjUsIm1pbiI6LTM4NzEuND
Q1MzQxMTEwMjI5NX19LCJwb2ludHMiOlt7IngiOjUzMjEsInkiOjU4MzV9LHsieCI6ODcyMiwieSI6N
TgzNX0seyJ4Ijo4NzIyLCJ5Ijo4MjA4fSx7IngiOjUzMjEsInkiOjgyMDh9LHsieCI6NTMyMSwieSI6
NTgzNX1dLCJ6IjowfQ==
##.OBSERVE FREQUENCY=	700.35432466099996418
##.OBSERVE NUCLEUS=	^1H
##.SOLVENT NAME=	CDCl3
##.PULSE SEQUENCE=	zg30
##LONGDATE=	2023/07/09 09:52:14.000
##.ACQUISITIONMODE=	SIMULTANEOUS (DQD)
##$ORIGINAL FORMAT=	Bruker XWIN-NMR
##$MNOVA/SCALES_VERSION=	9
##$PARAMETER FILE=	(acqus, ASCII, /private/var/folders/f6/rjf_tdyn2v98c5c0wvkgn4s80000gq/T/gKtT28WwSb238t+9RUj7uA/10/acqus, 0)
$$ ##TITLE= Parameter file, TopSpin 4.1.3
$$ ##JCAMPDX= 5.0
$$ ##DATATYPE= Parameter Values
$$ ##NPOINTS= 1	$$ modification sequence number
$$ ##ORIGIN= Bruker BioSpin GmbH
$$ ##OWNER= nmrsu
$$ $$ 2023-07-09 09:51:23.305 +0100  nmrsu@CZC7167VR1
$$ $$ Z:/700/data/tds/nmr/RP343 char_2/10/acqus
$$ $$ process C:\Bruker\TopSpin4.1.3\prog\mod\dirdata.exe
$$ ##$ACQT0= -2.0981556054023
$$ ##$AMP= (0..31)
$$ 100 100 100 100 100 100 100 100 100 100 100 100 100 100 100 100 100 100
$$ 100 100 100 100 100 100 100 100 100 100 100 100 100 100
$$ ##$AMPCOIL= (0..32)
$$ -1 0 0 0 0 0 0 0 0 0 0 0 0 0 0 0 0 0 0 0 0 0 0 0 0 0 0 0 0 0 0 0 0
$$ ##$AQSEQ= 0
$$ ##$AQ_mod= 3
$$ ##$AUNM= <au_zg>
$$ ##$AUTOPOS= <24 >
$$ ##$BF1= 700.349999998
$$ ##$BF2= 700.349999998
$$ ##$BF3= 700.349999998
$$ ##$BF4= 700.349999998
$$ ##$BF5= 700.349999998
$$ ##$BF6= 700.349999998
$$ ##$BF7= 700.349999998
$$ ##$BF8= 700.349999998
$$ ##$BWFAC= (0..63)
$$ 0 0 0 0 0 0 0 0 0 0 0 0 0 0 0 0 0 0 0 0 0 0 0 0 0 0 0 0 0 0 0 0 0 0 0 0
$$ 0 0 0 0 0 0 0 0 0 0 0 0 0 0 0 0 0 0 0 0 0 0 0 0 0 0 0 0
$$ ##$BYTORDA= 0
$$ ##$CHANFCU= (0..24)
$$ 0 1 0 0 0 0 0 0 0 0 0 0 0 0 0 0 0 0 0 0 0 0 0 0 0
$$ ##$CHANREC= (0..24)
$$ 0 0 0 0 0 0 0 0 0 0 0 0 0 0 0 0 0 0 0 0 0 0 0 0 0
$$ ##$CHEMSTR= <none>
$$ ##$CNST= (0..63)
$$ 1 1 1 1 1 1 1 1 1 1 1 1 1 1 1 1 1 1 1 1 1 1 1 1 1 1 1 1 1 1 1 1 1 1 1 1
$$ 1 1 1 1 1 1 1 1 1 1 1 1 1 1 1 1 1 1 1 1 1 1 1 1 1 1 1 1
$$ ##$CPDPRG= (0..8)
$$ <> <> <> <> <> <> <> <> <>
$$ ##$D= (0..63)
$$ 0 1 0 0 0 0 0 0 0 0 0 0 0 0 0 0 0.0002 0 0 0 0 0 0 0 0 0 0 0 0 0 0 0 0
$$ 0 0 0 0 0 0 0 0 0 0 0 0 0 0 0 0 0 0 0 0 0 0 0 0 0 0 0 0 0 0 0
$$ ##$DATE= 1688892734
$$ ##$DATE_START= 1688892691
$$ [...]
$$ ##$ShimPowRng3= (0..63)
$$ 1 1 1 1 1 1 1 1 1 1 1 1 1 1 1 1 1 1 1 1 1 1 1 1 1 1 1 1 1 1 1 1 1 1 1 1
$$ 1 1 1 1 0 0 0 0 0 0 0 0 0 0 0 0 0 0 0 0 0 0 0 0 0 0 0 0
$$ ##$ShimPowType1= 8
$$ ##$ShimPowType2= 8
$$ ##$ShimPowType3= 0
$$ ##$ShimPowType4= 0
$$ ##$ShimPowType5= 0
$$ ##$ShimPowType6= 0
$$ ##$ShimPowType7= 0
$$ ##$ShimPowType8= 0
$$ ##$ShimSysActGrad= (0..63)
$$ 1 2 3 4 13 5 7 11 10 9 6 8 12 18 19 20 21 15 22 23 24 14 25 16 26 17 27
$$ 28 31 32 33 34 35 36 37 38 0 0 0 0 0 0 0 0 0 0 0 0 0 0 0 0 0 0 0 0 0 0
$$ 0 0 0 0 0 0
$$ ##$ShimSysAngle= <>
$$ ##$ShimSysFunc= (0..63)
$$ 1 2 3 4 5 6 7 8 9 10 0 37 38 35 16 15 14 13 12 11 28 27 26 25 24 23 36
$$ 22 30 29 20 21 34 33 32 31 17 18 19 0 0 0 0 0 0 0 0 0 0 0 0 0 0 0 0 0 0
$$ 0 0 0 0 0 0 0
$$ ##$ShimSysMatId= <292722da.dat>
$$ ##$ShimSysMatrix= 1
$$ ##$ShimSysMinMaxUG= 130000
$$ ##$ShimSysOffset= <29 mm>
$$ ##$ShimSysType= 4
$$ ##$ShimUnit= 3
$$ ##$SpectrOsVersion= <4.1.156.20210628>
$$ ##$TCubeEth= <192.168.180.38>
$$ ##$TCubeSeqDevice= <>
$$ ##$TOSITY= <no>
$$ ##$TRIPLO2= 0
$$ ##$TopSpinVersion= <TopSpin 4.1.3>
$$ ##$TrxFreqFormula= (0..23)
$$ <TrxFreqFormula(2.0,700350000.000000,'TRX',Trx(1.0,'TRX 1200.1',1,5.000000,1290.000000))>
$$ <TrxFreqFormula(2.0,700350000.000000,'TRX',Trx(1.0,'TRX 1200.2',1,5.000000,1290.000000))>
$$ <TrxFreqFormula(2.0,700350000.000000,'TRX',Trx(1.0,'TRX 1200.3',1,5.000000,1290.000000))>
$$ <> <> <> <> <> <> <> <> <> <> <> <> <> <> <> <> <> <> <> <> <>
$$ ##$TrxPN= (0..23)
$$ <Z148391> <Z148391> <Z148391> <> <> <> <> <> <> <> <> <> <> <> <> <> <>
$$ <> <> <> <> <> <> <>
$$ ##$TrxSN= (0..23)
$$ <00336> <00337> <00342> <> <> <> <> <> <> <> <> <> <> <> <> <> <> <> <>
$$ <> <> <> <> <>
$$ ##$VCubeEth= (0..23)
$$ <no> <no> <no> <no> <no> <no> <no> <no> <no> <no> <no> <no> <no> <no> <no>
$$ <no> <no> <no> <no> <no> <no> <no> <no> <no>
$$ ##$VTU= 2
$$ ##$VTUETH= <192.168.99.11>
$$ ##$VTUTY= <no>
$$ ##$ValueLine= no
$$ ##$VpuPN= (0..23)
$$ <no> <no> <no> <no> <no> <no> <no> <no> <no> <no> <no> <no> <no> <no> <no>
$$ <no> <no> <no> <no> <no> <no> <no> <no> <no>
$$ ##$VpuSN= (0..23)
$$ <no> <no> <no> <no> <no> <no> <no> <no> <no> <no> <no> <no> <no> <no> <no>
$$ <no> <no> <no> <no> <no> <no> <no> <no> <no>
$$ ##$WBREFAM= (0..31)
$$ 99.8 100 100 100 100 100 100 100 100 100 100 100 100 100 100 100 100 100
$$ 100 100 100 100 100 100 100 100 100 100 100 100 100 100
$$ ##$WBREFLM= (0..31)
$$ 1 0 1 0 0 0 0 0 0 0 0 0 0 0 0 0 0 0 0 0 0 0 0 0 0 0 0 0 0 0 0 0
$$ ##$WBREFPH= (0..31)
$$ 0.05 0 0 0 0 0 0 0 0 0 0 0 0 0 0 0 0 0 0 0 0 0 0 0 0 0 0 0 0 0 0 0
$$ ##$WBSGU= (0..31)
$$ 1 2 4 0 0 0 0 0 0 0 0 0 0 0 0 0 0 0 0 0 0 0 0 0 0 0 0 0 0 0 0 0
$$ ##END=
$$ 
##$DECIM=	1440
##$DSPFVS=	21
##XUNITS=	HZ
##YUNITS=	ARBITRARY UNITS
##FIRSTX=	11250.604788156719223
##LASTX=	-2638.1781369192458442
##DELTAX=	-0.10596381293402784562
##XFACTOR=	1
##YFACTOR=	1.173240584086123306
##FIRSTY=	65.610015869140625
##MINY=	-26.951818466186523438
##MAXY=	38443.57421875
##NPOINTS=	131072
##XYDATA=	(X++(Y..Y))
$$ [...]
4552F5%%%%JJ%%%%%%j%%%%Jj%j%%J%%%%JJ%jJ%jk%%%j%J%%%%J%%%j%%%jj%%%J%J%%%%%%%j
4545F4%jJ%J%%%%%%%j%jJ%JJ%%j%%%%%%j%%%J%%J%%%%j%J%%jJ%J%%%j%j%j%J%%%%%%J%%%%
4538F6%%j%%j%%%%%JJJj%%%%%j%%%%%%%J%j%%J%jJJj%%j%J%j%%J%%%%%Jj%jJJ%j%j%%%%%%
4530F5%J%%jJj%%%%J%j%%%%%j%KJ%%j%%%%%j%%%%%J%j%%%%%%%%Jj%jJ%J%J%%%j%j%J%%j%%
4523F5J%%%%%%%%%jJj%%%%Jj%%%%J%%%%%%%%j%%%%%%%%%%%%%%%%J%%%%J%%%%jj%%%J%J%%%
4515F7%%%%%%%%%%%%j%%j%%%jJ%%J%%jJ%%j%%%%%%%%jJ%%%J%j%%%%%j%%%J%J%j%jJJ%%%%%
4508F6j%%%J%%%%%%jj%%JJ%%%%j%%jJ%%%J%%J%%%%%%%%%%%%%j%%j%%%%%%%%%%%J%%jJJ%%%
4500F7%%%j%j%%%%%%%%J%%%%%%%%%%%%j%%%%J%j%J%%j%J%%%Jj%%%%JJ%j%%j%%J%j%j%%%J%
$$ plain form
4552 65 65 65 65 65 66 67 67 67 67 67 67 67 66 66 66 66 66 67 66 66 65 65 65 66 66 66 66 66 67 68 68 67 68 68 67 65 65 65 65 64 64 65 65 65 65 65 66 66 66 66 65 65 65 65 64 63 63 63 63 64 64 65 65 65 65 65 65 65 65 64
4545 64 64 63 64 64 65 65 65 65 65 65 65 65 64 64 63 64 64 65 66 66 66 65 65 65 65 65 65 65 64 64 64 64 65 65 65 66 66 66 66 66 65 65 66 66 66 65 66 66 67 67 67 67 66 66 65 65 64 64 65 65 65 65 65 65 65 66 66 66 66 66
4538 66 66 66 65 65 65 64 64 64 64 64 64 65 66 67 66 66 66 66 66 66 65 65 65 65 65 65 65 65 66 66 65 65 65 66 66 65 66 67 66 66 66 65 65 66 66 65 65 65 66 66 66 66 66 66 67 66 66 65 66 67 67 66 66 65 65 65 65 65 65 65
4530 65 65 66 66 66 65 66 65 65 65 65 65 66 66 65 65 65 65 65 65 64 64 66 67 67 67 66 66 66 66 66 66 65 65 65 65 65 65 66 66 65 65 65 65 65 65 65 65 65 66 65 65 64 65 65 66 66 67 67 67 67 66 66 65 65 66 66 66 65 65 65
4523 65 66 66 66 66 66 66 66 66 66 66 65 66 65 65 65 65 65 66 65 65 65 65 65 66 66 66 66 66 66 66 66 66 65 65 65 65 65 65 65 65 65 65 65 65 65 65 65 65 65 66 66 66 66 66 67 67 67 67 67 66 65 65 65 65 66 66 67 67 67 67
4515 67 67 67 67 67 67 67 67 67 67 67 67 67 66 66 66 65 65 65 65 64 65 65 65 66 66 66 65 66 66 66 65 65 65 65 65 65 65 65 65 64 65 65 65 65 66 66 65 65 65 65 65 65 64 64 64 64 65 65 66 66 65 65 64 65 66 66 66 66 66 66
4508 66 65 65 65 65 66 66 66 66 66 66 66 65 64 64 64 65 66 66 66 66 66 65 65 65 64 65 65 65 65 66 66 66 67 67 67 67 67 67 67 67 67 67 67 67 67 67 66 66 66 65 65 65 65 65 65 65 65 65 65 65 65 66 66 66 65 66 67 67 67 67
4500 67 67 67 67 66 66 65 65 65 65 65 65 65 65 65 66 66 66 66 66 66 66 66 66 66 66 66 66 65 65 65 65 65 66 66 65 65 66 66 66 65 65 66 66 66 66 67 66 66 66 66 66 67 68 68 67 67 67 66 66 66 67 67 66 66 65 65 65 65 66 66
4493F6%%%%%%%jJ%%%%%%%%%j%J%%%%%%%%jJ%%%%j%J%%j%%%%%%%%%%%%Jj%%%j%%%J%J%jJ%j
4486F5%%%%%%J%%%J%%%%%jj%J%%%%J%j%jJ%%%%j%J%%%jj%%J%%%%%%J%%%%j%%%%J%%%j%%%%
4478F5Jjj%JjJ%%j%%%J%%%%%%%%J%%%%%%%%%%%%j%%%j%JJ%%%%Jj%J%j%%%j%%%%j%%JJ%%Jj
4471F6j%%J%j%%%J%%%%%%j%J%%J%%jjjj%J%%J%J%%%Jj%%%%%%j%%%%%%%j%%J%J%%Jj%jj%%J
4463F5%%%%%%%jJ%%%%%%%%%%%%J%%j%J%Jj%%%%%%%jJ%%Jj%%%%%%%%%%jJj%%%%%%J%%%%%%%
4456F6j%%%%j%J%J%%%%jj%%%J%%%%J%%j%%%J%%%%%%j%%%%%jJ%%%%%jJ%%%J%%%%%%Jj%%j%%
4449F5%J%%%jJ%%jJ%%%j%JJj%%%%%%%%%%%%J%%jj%%%%%%%JJ%%%j%%jJ%%%%J%%j%J%jjJ%%%
4441F6%%%%%%J%%j%%%%%%jJ%j%j%JJ%%%%%J%%jj%%%%%%%J%%%%j%%%%%%%jJ%J%%jJ%%%%%%%
$$ plain form
4493 66 66 66 66 66 66 66 66 65 66 66 66 66 66 66 66 66 66 66 65 65 66 66 66 66 66 66 66 66 66 65 66 66 66 66 66 65 65 66 66 66 65 65 65 65 65 65 65 65 65 65 65 65 65 66 65 65 65 65 64 64 64 64 65 65 66 66 65 66 66 65
4486 65 65 65 65 65 65 65 66 66 66 66 67 67 67 67 67 67 66 65 65 66 66 66 66 66 67 67 66 66 65 66 66 66 66 66 65 65 66 66 66 66 65 64 64 64 65 65 65 65 65 65 65 66 66 66 66 66 65 65 65 65 65 66 66 66 66 65 65 65 65 65
4478 65 66 65 64 64 65 64 65 65 65 64 64 64 64 65 65 65 65 65 65 65 65 65 66 66 66 66 66 66 66 66 66 66 66 66 66 65 65 65 65 64 64 65 66 66 66 66 66 67 66 66 67 67 66 66 66 66 65 65 65 65 65 64 64 64 65 66 66 66 67 66
4471 66 65 65 65 66 66 65 65 65 65 66 66 66 66 66 66 66 65 65 66 66 66 67 67 67 66 65 64 63 63 64 64 64 65 65 66 66 66 66 67 66 66 66 66 66 66 66 65 65 65 65 65 65 65 65 64 64 64 65 65 66 66 66 67 66 66 65 64 64 64 65
4463 65 65 65 65 65 65 65 65 64 65 65 65 65 65 65 65 65 65 65 65 65 65 66 66 66 65 65 66 66 67 66 66 66 66 66 66 66 66 65 66 66 66 67 66 66 66 66 66 66 66 66 66 66 66 65 66 65 65 65 65 65 65 65 66 66 66 66 66 66 66 66
4456 66 65 65 65 65 65 64 64 65 65 66 66 66 66 66 65 64 64 64 64 65 65 65 65 65 66 66 66 65 65 65 65 66 66 66 66 66 66 66 65 65 65 65 65 65 64 65 65 65 65 65 65 64 65 65 65 65 66 66 66 66 66 66 66 67 66 66 66 65 65 65
4449 65 65 66 66 66 66 65 66 66 66 65 66 66 66 66 65 65 66 67 66 66 66 66 66 66 66 66 66 66 66 66 66 67 67 67 66 65 65 65 65 65 65 65 65 66 67 67 67 67 66 66 66 65 66 66 66 66 66 67 67 67 66 66 67 67 66 65 66 66 66 66
4441 66 66 66 66 66 66 66 67 67 67 66 66 66 66 66 66 66 65 66 66 65 65 64 64 65 66 66 66 66 66 66 67 67 67 66 65 65 65 65 65 65 65 65 66 66 66 66 66 65 65 65 65 65 65 65 65 64 65 65 66 66 66 65 66 66 66 66 66 66 66 66
4434F6%%j%%j%%%%%%%J%J%%%%%j%j%%%%%J%j%%%%J%%%%%%%%%%%%jJ%%%%jJ%%%%J%j%%%%%%
4426F5%%%J%%%%%%%%%%j%j%%J%%J%%%%%%%j%%j%J%%J%%%j%%jJ%%jjJJ%%%%%%Jj%%%%%%%%%
4419F5%%%%%J%Jj%%%Jj%%%%j%%%Jj%%%%%J%%%j%%%%%%%%%J%%%j%j%%JJ%J%j%%%%j%J%%%%j
4411F5%j%%J%%Jj%%%%j%jjJJJJJ%j%j%%j%%JJJ%%j%jj%JJ%j%%%J%%%j%jj%J%%%J%%%%%%J%
4404F6j%%%j%%%%%J%%%%Jj%%%%%%jJ%%%%J%%%%%j%%%%%%%%j%%J%%%Jj%%J%j%%J%%j%%%%%j
4397F4J%Jjj%%%%%%%%%J%J%%j%jJ%%%%%J%%%%%j%%%%%Jj%%Jj%%J%%%j%%%%%%%%%%%j%%J%%
4389F5%%%%%j%%J%%J%%j%%%j%%J%%%jJ%J%%%%%%%%%%%%%j%%jj%JJJJj%j%%j%JJj%%%%%%j%
4382F4J%%%%Jj%JJj%%%%%%%jjJJ%j%J%j%%jJ%%%%%Jj%%%%%J%jJ%j%j%%%%%%J%%%%%%%j%%%
$$ plain form
4434 66 66 66 65 65 65 64 64 64 64 64 64 64 64 65 65 66 66 66 66 66 66 65 65 64 64 64 64 64 64 65 65 64 64 64 64 64 65 65 65 65 65 65 65 65 65 65 65 65 65 64 65 65 65 65 65 64 65 65 65 65 65 66 66 65 65 65 65 65 65 65
4426 65 65 65 65 66 66 66 66 66 66 66 66 66 66 66 65 65 64 64 64 65 65 65 66 66 66 66 66 66 66 66 65 65 65 64 64 65 65 65 66 66 66 66 65 65 65 64 65 65 65 64 63 64 65 65 65 65 65 65 65 66 65 65 65 65 65 65 65 65 65 65
4419 65 65 65 65 65 65 66 66 67 66 66 66 66 67 66 66 66 66 66 65 65 65 65 66 65 65 65 65 65 65 66 66 66 66 65 65 65 65 65 65 65 65 65 65 66 66 66 66 65 65 64 64 64 65 66 66 67 67 66 66 66 66 66 65 65 66 66 66 66 66 65
4411 65 65 64 64 64 65 65 65 66 65 65 65 65 65 64 64 63 62 63 64 65 66 67 67 66 66 65 65 65 64 64 64 65 66 67 67 67 66 66 65 64 64 65 66 66 65 65 65 65 66 66 66 66 65 65 64 63 63 64 64 64 64 65 65 65 65 65 65 65 66 66
4404 66 65 65 65 65 64 64 64 64 64 64 65 65 65 65 65 66 65 65 65 65 65 65 65 64 65 65 65 65 65 66 66 66 66 66 66 65 65 65 65 65 65 65 65 65 64 64 64 65 65 65 65 66 65 65 65 66 66 65 65 65 66 66 66 65 65 65 65 65 65 64
4397 64 65 65 66 65 64 64 64 64 64 64 64 64 64 64 65 65 66 66 66 65 65 64 65 65 65 65 65 65 66 66 66 66 66 66 65 65 65 65 65 65 66 65 65 65 66 65 65 65 66 66 66 66 65 65 65 65 65 65 65 65 65 65 65 65 64 64 64 65 65 65
4389 65 65 65 65 65 65 64 64 64 65 65 65 66 66 66 65 65 65 65 64 64 64 65 65 65 65 64 65 65 66 66 66 66 66 66 66 66 66 66 66 66 66 66 65 65 65 64 63 63 64 65 66 67 66 66 65 65 65 64 64 65 66 65 65 65 65 65 65 65 64 64
4382 64 65 65 65 65 65 66 65 65 66 67 66 66 66 66 66 66 66 66 65 64 65 66 66 65 65 66 66 65 65 65 64 65 65 65 65 65 65 66 65 65 65 65 65 65 66 66 65 66 66 65 65 64 64 64 64 64 64 64 65 65 65 65 65 65 65 65 64 64 64 64
4374F4%%%J%%%%%%%j%%%%%%%%J%j%%%J%j%%jJ%%%%%%jJ%JJ%%Jj%j%%%j%JJ%%%jJ%jj%%%J%
4367F5%%j%%%%%J%%%%Jj%%%%%%%j%J%%%%%%j%%%%%%%Jj%%%J%%j%J%J%Jj%%%jj%%J%%%J%jJ
4360F6J%%jjj%J%%%%jJ%jJ%j%j%%J%%%%%%%%%%%%jj%K%J%%%%%%%j%J%%%%%%J%%%j%%%%jJ%
4352F5%%%j%%J%J%j%%j%%J%%jJ%%%J%j%j%%j%%%J%J%j%%%%J%%J%j%j%%%%%j%%%J%J%jJ%%j
4345F4%%JJ%%jj%jJ%%%J%%%j%%%%J%%%%j%j%%%JJJ%%j%%%Jj%%%%J%%j%%%j%%%%%%%J%%%%%
4337F5j%%%%%%%%%J%Jj%j%%jJJ%J%j%%%%%j%%%%Jj%JJ%%%%jJ%%%j%%%jJ%%%k%%J%%j%J%%%
4330F4%%J%%%%%%%%%%J%%%j%jJ%J%%%j%j%%J%%%J%%%%%%%j%Jjj%J%%%%%%%%%jJ%%J%%%j%j
4322F4%J%j%%%J%Jj%%%%%%%%j%%%%J%%%Jjj%J%%%%%%%%%%%%j%%J%j%%%%%J%%%j%%%%%%%%j
$$ plain form
4374 64 64 64 64 65 65 65 65 65 65 65 65 64 64 64 64 64 64 64 64 64 65 65 64 64 64 64 65 65 64 64 64 63 64 64 64 64 64 64 64 63 64 64 65 66 66 66 67 66 66 65 65 65 65 64 64 65 66 66 66 66 65 66 66 65 64 64 64 64 65 65
4367 65 65 65 64 64 64 64 64 64 65 65 65 65 65 66 65 65 65 65 65 65 65 65 64 64 65 65 65 65 65 65 65 64 64 64 64 64 64 64 64 65 64 64 64 64 65 65 65 64 64 65 65 66 66 67 66 66 66 66 65 64 64 64 65 65 65 65 66 66 65 66
4360 66 67 67 67 66 65 64 64 65 65 65 65 65 64 65 65 64 65 65 64 64 63 63 63 64 64 64 64 64 64 64 64 64 64 64 64 64 63 62 62 64 64 65 65 65 65 65 65 65 65 64 64 65 65 65 65 65 65 65 66 66 66 66 65 65 65 65 65 64 65 65
4352 65 65 65 65 64 64 64 65 65 66 66 65 65 65 64 64 64 65 65 65 64 65 65 65 65 66 66 65 65 64 64 64 63 63 63 63 64 64 65 65 64 64 64 64 64 65 65 65 66 66 65 65 64 64 64 64 64 64 63 63 63 63 64 64 65 65 64 65 65 65 64
4345 64 64 64 65 66 66 66 65 64 64 63 64 64 64 64 65 65 65 65 64 64 64 64 64 65 65 65 65 65 64 64 63 63 63 63 64 65 66 66 66 65 65 65 65 66 65 65 65 65 65 66 66 66 65 65 65 65 64 64 64 64 64 64 64 64 65 65 65 65 65 65
4337 65 64 64 64 64 64 64 64 64 64 64 65 65 66 65 65 64 64 64 63 64 65 65 66 66 65 65 65 65 65 65 64 64 64 64 64 65 64 64 65 66 66 66 66 66 65 66 66 66 66 65 65 65 65 64 65 65 65 65 63 63 63 64 64 64 63 63 64 64 64 64
4330 64 64 64 65 65 65 65 65 65 65 65 65 65 65 66 66 66 66 65 65 64 65 65 66 66 66 66 65 65 64 64 64 65 65 65 65 66 66 66 66 66 66 66 66 65 65 66 65 64 64 65 65 65 65 65 65 65 65 65 65 64 65 65 65 66 66 66 66 65 65 64
4322 64 64 65 65 64 64 64 64 65 65 66 65 65 65 65 65 65 65 65 65 64 64 64 64 64 65 65 65 65 66 65 64 64 65 65 65 65 65 65 65 65 65 65 65 65 65 64 64 64 65 65 64 64 64 64 64 64 65 65 65 65 64 64 64 64 64 64 64 64 64 63
4315F3%%%JJj%%JJ%jj%%%%J%%j%%%j%%J%J%%%%%j%%jJ%%%J%%jj%J%%%%%%J%%%%%%jJ%%J%j
4308F5%%%j%J%%%%%%jj%%J%%j%J%%%%%J%Jj%j%%%J%%j%%%%%%%%%%%j%%%%%J%%%Jj%%%%%%%
4300F4%J%%j%%jJ%%J%%%%%%J%%%%%%%%j%%%%%%%%%j%Jj%%%j%J%%Jj%%J%%%%j%%%%%%%J%%%
4293F5%%j%%%%%%%%%%%%%%J%J%j%%%j%%%J%%%%%Jj%jj%%%%%J%%%%J%%%%%%%%%%%%%%%%%%J
4285F6jj%%J%%%%Jj%%%%j%%%J%%j%%%j%J%%%J%Jj%%%%%%%J%%%j%%%j%%J%jJ%%%j%%j%J%%%
4278F4%%Jj%%%Jj%%%%%%%%%%%%j%%J%j%J%%%jJ%J%%%j%%%J%%%Jj%%j%%j%%KJ%J%%jjj%%%%
4271F4J%j%%%j%%J%%%J%j%J%Jj%%%J%j%%%J%J%%jJ%%j%%%%jjjJ%%%%%%%J%%%j%%%%%J%Jj%
4263F5%%%%Jj%%%%%%%%%%j%%%%J%%%%%%%%j%%%JJ%%jj%jJ%%%%%j%%%%%J%Jjj%%%J%J%jjjJ
$$ plain form
4315 63 63 63 63 64 65 64 64 64 65 66 66 65 64 64 64 64 64 65 65 65 64 64 64 64 63 63 63 64 64 65 65 65 65 65 65 64 64 64 63 64 64 64 64 65 65 65 64 63 63 64 64 64 64 64 64 64 65 65 65 65 65 65 65 64 65 65 65 66 66 65
4308 65 65 65 65 64 64 65 65 65 65 65 65 65 64 63 63 63 64 64 64 63 63 64 64 64 64 64 64 65 65 66 65 65 64 64 64 64 65 65 65 64 64 64 64 64 64 64 64 64 64 64 64 63 63 63 63 63 63 64 64 64 64 65 64 64 64 64 64 64 64 64
4300 64 64 65 65 65 64 64 64 63 64 64 64 65 65 65 65 65 65 65 66 66 66 66 66 66 66 66 66 65 65 65 65 65 65 65 65 65 65 64 64 65 64 64 64 64 63 63 64 64 64 65 64 64 64 65 65 65 65 65 64 64 64 64 64 64 64 64 65 65 65 65
4293 65 65 65 64 64 64 64 64 64 64 64 64 64 64 64 64 64 64 65 65 66 66 65 65 65 65 64 64 64 64 65 65 65 65 65 65 66 65 65 64 63 63 63 63 63 63 64 64 64 64 64 65 65 65 65 65 65 65 65 65 65 65 65 65 65 65 65 65 65 65 66
4285 66 65 64 64 64 65 65 65 65 65 66 65 65 65 65 65 64 64 64 64 65 65 65 64 64 64 64 63 63 64 64 64 64 65 65 66 65 65 65 65 65 65 65 65 66 66 66 66 65 65 65 65 64 64 64 65 65 64 65 65 65 65 64 64 64 63 63 64 64 64 64
4278 64 64 64 65 64 64 64 64 65 64 64 64 64 64 64 64 64 64 64 64 64 64 63 63 63 64 64 63 63 64 64 64 64 63 64 64 65 65 65 65 64 64 64 64 65 65 65 65 66 65 65 65 64 64 64 63 63 63 65 66 66 67 67 67 66 65 64 64 64 64 64
4271 64 65 65 64 64 64 64 63 63 63 64 64 64 64 65 65 64 64 65 65 66 65 65 65 65 66 66 65 65 65 65 66 66 67 67 67 66 67 67 67 66 66 66 66 66 65 64 63 64 64 64 64 64 64 64 64 65 65 65 65 64 64 64 64 64 64 65 65 66 65 65
4263 65 65 65 65 65 66 65 65 65 65 65 65 65 65 65 65 65 64 64 64 64 64 65 65 65 65 65 65 65 65 65 64 64 64 64 65 66 66 66 65 64 64 63 64 64 64 64 64 64 63 63 63 63 63 63 64 64 65 64 63 63 63 63 64 64 65 65 64 63 62 63
4256F3%Jj%%J%J%jJ%%%j%%%J%%%%%j%J%%%%j%J%%%%%%J%%j%j%%%jJJ%Jjjj%J%J%%j%J%%Jj
4248F5%j%%%%%%%j%j%%%%JJ%J%%%%%%j%J%jjJ%%j%J%J%%%%%Jj%%j%%j%%%%%%%J%%%j%J%%%
4241F4%%%Jj%%%J%%jJ%j%%jJ%J%%%j%%j%%%%J%%%%%%%%%J%%%%j%%%j%J%J%%j%j%%%%%%JJ%
4233F5%%%J%%j%%j%jJ%%%%%%%%j%J%%%%%%%%%%%%%jJ%J%%Jj%%j%j%J%j%J%%%%%%%%%%jjJ%
4226F3%%%J%%j%%J%Jj%j%%%J%%%%%j%%J%%J%%%%J%jj%j%%%%J%%%J%J%j%%j%%%%%%%%%%%%%
4219F4%%%%%%j%J%%%jJ%J%Jj%%j%%J%%%J%%%%%%%j%%%%%%j%%%%J%j%%%%%J%%%%%j%jJJj%J
4211F5j%%%J%%j%J%%%%%%%%%jJ%%j%J%%%%j%j%%%%%%J%%j%%j%J%%%%%%%Jj%%%%%%%%%%%%%
4204F3%%%J%%%%%%%%%%j%JJ%%%%%%%%%%%%%%%j%Jjj%J%%%j%%%%%J%%%%%%j%%JJ%Jjk%%J%%
$$ plain form
4256 63 63 64 63 63 63 64 64 65 65 64 65 65 65 65 64 64 64 64 65 65 65 65 65 65 64 64 65 65 65 65 65 64 64 65 65 65 65 65 65 65 66 66 66 65 65 64 64 64 64 63 64 65 65 66 65 64 63 63 64 64 65 65 65 64 64 65 65 65 66 65
4248 65 65 64 64 64 64 64 64 64 64 63 63 62 62 62 62 62 63 64 64 65 65 65 65 65 65 65 64 64 65 65 64 63 64 64 64 63 63 64 64 65 65 65 65 65 65 66 65 65 65 64 64 64 63 63 63 63 63 63 63 63 64 64 64 64 63 63 64 64 64 64
4241 64 64 64 64 65 64 64 64 64 65 65 65 64 65 65 64 64 64 63 64 64 65 65 65 65 64 64 64 63 63 63 63 63 64 64 64 64 64 64 64 64 64 64 65 65 65 65 65 64 64 64 64 63 63 64 64 65 65 65 64 64 63 63 63 63 63 63 63 64 65 65
4233 65 65 65 65 66 66 66 65 65 65 64 64 63 64 64 64 64 64 64 64 64 64 63 63 64 64 64 64 64 64 64 64 64 64 64 64 64 64 63 64 64 65 65 65 66 65 65 65 64 64 63 63 64 64 63 63 64 64 64 64 64 64 64 64 64 64 64 63 62 63 63
4226 63 63 63 63 64 64 64 63 63 63 64 64 65 64 64 63 63 63 63 64 64 64 64 64 64 63 63 63 64 64 64 65 65 65 65 65 66 66 65 64 64 63 63 63 63 63 64 64 64 64 65 65 66 66 65 65 65 64 64 64 64 64 64 64 64 64 64 64 64 64 64
4219 64 64 64 64 64 64 64 63 63 64 64 64 64 63 64 64 65 65 66 65 65 65 64 64 64 65 65 65 65 66 66 66 66 66 66 66 66 65 65 65 65 65 65 65 64 64 64 64 64 65 65 64 64 64 64 64 64 65 65 65 65 65 65 64 64 63 64 65 64 64 65
4211 65 64 64 64 64 65 65 65 64 64 65 65 65 65 65 65 65 65 65 65 64 65 65 65 64 64 65 65 65 65 65 64 64 63 63 63 63 63 63 63 64 64 64 63 63 63 62 62 63 63 63 63 63 63 63 63 64 63 63 63 63 63 63 63 63 63 63 63 63 63 63
4204 63 63 63 63 64 64 64 64 64 64 64 64 64 64 64 63 63 64 65 65 65 65 65 65 65 65 65 65 65 65 65 65 65 65 64 64 65 64 63 63 64 64 64 64 63 63 63 63 63 63 64 64 64 64 64 64 64 63 63 63 64 65 65 66 65 63 63 63 64 64 64
4196F4J%Jj%j%JJ%jj%%%%%J%%%%%%%%%Jj%%j%%%jJ%%%%%%Jj%Jjj%J%%jJ%J%%j%%%%%%%%%%
4189F4J%j%%j%%%%%JJ%%jJ%%%%%j%%%j%%%%%%%J%%J%%jj%%J%j%%%J%%%%J%%j%%jj%J%%%Jj
4182F3%J%J%j%%J%%%jj%%%JJ%J%%j%j%%%%%%%%%%%jj%%J%%%%%JJ%%%%jJ%%%jj%J%J%%Jjj%
4174F4%%%%JjJ%%Jjj%jJ%%j%%%%%%%J%j%%%%%%J%%%%%%j%%JJ%%%%%%jj%%J%%%%%%%%%%%J%
4167F5j%%j%%%%J%%%jJ%%%%%%%%J%%%%%j%%%%%%%j%%%%%%%J%%%%J%%%%%%j%%%%%%%%%%j%%
4159F3%J%%j%%%J%j%J%J%%%j%%%J%j%%%%%j%%J%%%%%%%%%%j%%J%j%J%%%%%%%j%%J%J%jj%%
4152F3%J%j%%%%%J%%%%%%J%%%J%%j%%%%%%%%%%%%j%%%%%J%J%%jjj%%%%J%JJ%%j%j%%%%%%J
4144F5j%%%%%%%%%%%%%%%jJ%%%%%j%%j%%%J%%J%%jJ%j%%%%%j%%JJ%jJ%%%%%%j%%%%%%%%%J
$$ plain form
4196 64 65 65 66 65 65 64 64 65 66 66 65 64 64 64 64 64 64 65 65 65 65 65 65 65 65 65 65 66 65 65 65 64 64 64 64 63 64 64 64 64 64 64 64 65 64 64 65 64 63 63 64 64 64 63 64 64 65 65 65 64 64 64 64 64 64 64 64 64 64 64
4189 64 65 65 64 64 64 63 63 63 63 63 63 64 65 65 65 64 65 65 65 65 65 65 64 64 64 64 63 63 63 63 63 63 63 63 64 64 64 65 65 65 64 63 63 63 64 64 63 63 63 63 64 64 64 64 64 65 65 65 64 64 64 63 62 62 63 63 63 63 64 63
4182 63 63 64 64 65 65 64 64 64 65 65 65 65 64 63 63 63 63 64 65 65 66 66 66 65 65 64 64 64 64 64 64 64 64 64 64 64 64 63 62 62 62 63 63 63 63 63 63 64 65 65 65 65 65 64 65 65 65 65 64 63 63 64 64 65 65 65 66 65 64 64
4174 64 64 64 64 64 65 64 65 65 65 66 65 64 64 63 64 64 64 63 63 63 63 63 63 63 63 64 64 63 63 63 63 63 63 63 64 64 64 64 64 64 64 63 63 63 64 65 65 65 65 65 65 65 64 63 63 63 64 64 64 64 64 64 64 64 64 64 64 64 65 65
4167 65 64 64 64 63 63 63 63 63 64 64 64 64 63 64 64 64 64 64 64 64 64 64 65 65 65 65 65 65 64 64 64 64 64 64 64 64 63 63 63 63 63 63 63 63 64 64 64 64 64 65 65 65 65 65 65 65 64 64 64 64 64 64 64 64 64 64 64 63 63 63
4159 63 63 64 64 64 63 63 63 63 64 64 63 63 64 64 65 65 65 65 64 64 64 64 65 65 64 64 64 64 64 64 63 63 63 64 64 64 64 64 64 64 64 64 64 64 63 63 63 64 64 63 63 64 64 64 64 64 64 64 64 63 63 63 64 64 65 65 64 63 63 63
4152 63 63 64 64 63 63 63 63 63 63 64 64 64 64 64 64 64 65 65 65 65 66 66 66 65 65 65 65 65 65 65 65 65 65 65 65 65 64 64 64 64 64 64 65 65 66 66 66 65 64 63 63 63 63 63 64 64 65 66 66 66 65 65 64 64 64 64 64 64 64 65
4144 65 64 64 64 64 64 64 64 64 64 64 64 64 64 64 64 64 63 64 64 64 64 64 64 63 63 63 62 62 62 62 63 63 63 64 64 64 63 64 64 63 63 63 63 63 63 62 62 62 63 64 64 63 64 64 64 64 64 64 64 63 63 63 63 63 63 63 63 63 63 64
4137F4j%j%%%%J%%J%jJJ%%%j%J%jj%%%J%%%%%%%%%%%%%%%%jjJ%%%%%%%%Jj%Jj%%%%%%%%%%
4130F3%%%%J%j%%%%%%JJ%%%jjj%J%%%%%%%%%J%%%%%%%j%J%%%%kj%%%%J%JJ%%%jj%J%J%%%%
4122F4%%%%%%%%%%%j%%%%%J%j%J%%%J%j%jJ%j%%%%%%%JJ%j%%%J%%%%%j%j%%J%%J%%%%%j%%
4115F4j%%%%%%%J%%%%%%%%%%%jjJ%%%%%%%j%J%%%%jJ%J%%%%j%jJ%%%%J%%%%%J%jj%%j%%J%
4107F3J%%%%%%%%j%%J%J%j%%%%%j%%%%%%%%Jj%%%%J%%%%%%Jjj%%%%JJ%j%jj%%J%J%%j%J%%
4100F4%%jj%%JJ%%j%j%%J%%%J%%%%%%%%%%%%%%%%j%%%j%%JJ%%%%Jj%%j%%%J%%%j%%%J%%%%
4093F4Jj%j%%J%%%%jj%%JJj%%%%JJ%%%%Jjj%%%%%%J%%%j%j%%%J%Jj%%%%%%%jJJ%%%%j%%%j
4085F3%%J%%%%%JJ%%%jj%%J%J%j%%%%j%%j%j%%%%J%%%%%%%%%%%%%%Jj%%%j%%%%%J%%J%%%%
$$ plain form
4137 64 63 63 62 62 62 62 62 63 63 63 64 64 63 64 65 65 65 65 64 64 65 65 64 63 63 63 63 64 64 64 64 64 64 64 64 64 64 64 64 64 64 64 64 64 63 62 63 63 63 63 63 63 63 63 63 64 63 63 64 63 63 63 63 63 63 63 63 63 63 63
4130 63 63 63 63 63 64 64 63 63 63 63 63 63 63 64 65 65 65 65 64 63 62 62 63 63 63 63 63 63 63 63 63 63 64 64 64 64 64 64 64 64 63 63 64 64 64 64 64 62 61 61 61 61 61 62 62 63 64 64 64 64 63 62 62 63 63 64 64 64 64 64
4122 64 64 64 64 64 64 64 64 64 64 64 64 63 63 63 63 63 63 64 64 63 63 64 64 64 64 65 65 64 64 63 64 64 63 63 63 63 63 63 63 63 64 65 65 64 64 64 64 65 65 65 65 65 65 64 64 63 63 63 64 64 64 65 65 65 65 65 65 64 64 64
4115 64 63 63 63 63 63 63 63 63 64 64 64 64 64 64 64 64 64 64 64 64 63 62 63 63 63 63 63 63 63 63 62 62 63 63 63 63 63 62 63 63 64 64 64 64 64 63 63 62 63 63 63 63 63 64 64 64 64 64 64 65 65 64 63 63 63 62 62 62 63 63
4107 63 64 64 64 64 64 64 64 64 64 63 63 63 64 64 65 65 64 64 64 64 64 64 63 63 63 63 63 63 63 63 63 64 63 63 63 63 63 64 64 64 64 64 64 64 65 64 63 63 63 63 63 64 65 65 64 64 63 62 62 62 63 63 64 64 64 63 63 64 64 64
4100 64 64 64 63 62 62 62 63 64 64 64 63 63 62 62 62 63 63 63 63 64 64 64 64 64 64 64 64 64 64 64 64 64 64 64 64 64 63 63 63 63 62 62 62 63 64 64 64 64 64 65 64 64 64 63 63 63 63 64 64 64 64 63 63 63 63 64 64 64 64 64
4093 64 65 64 64 63 63 63 64 64 64 64 64 63 62 62 62 63 64 63 63 63 63 63 64 65 65 65 65 65 66 65 64 64 64 64 64 64 64 65 65 65 65 64 64 63 63 63 63 64 64 65 64 64 64 64 64 64 64 64 63 64 65 65 65 65 65 64 64 64 64 63
4085 63 63 63 64 64 64 64 64 64 65 66 66 66 66 65 64 64 64 65 65 66 66 65 65 65 65 65 64 64 64 63 63 62 62 62 62 62 63 63 63 63 63 63 63 63 63 63 63 63 63 63 63 64 63 63 63 63 62 62 62 62 62 62 63 63 63 64 64 64 64 64
4078F4%%%j%%%%%%%%J%j%%%%%%%jJJ%%%%%%%%%j%%JjJ%%%%j%%j%%%J%J%j%%%jJ%%%%%%%%%
4070F3J%%Jj%%%Jj%%%%j%j%JJ%%J%Jjj%J%%%%%j%%Jj%%%%%%%%j%Jj%%J%J%%%%k%%J%%%%j%
4063F3%%%%%%j%J%%J%%%%%J%%j%%%j%%%%%j%%%%%%J%J%%%jJ%jJ%jjj%%%J%J%%%%%j%%%%J%
4055F3J%%%%j%%%%%%jJ%%%%J%%%%%%%%%%%%%%jJ%%%j%%%j%Jj%%%%%%%jJ%%%J%%JJ%%j%%%%
4048F4%%%%J%%%%%j%j%%%%%%J%J%Jj%j%%%J%%jj%%%%%%%%j%%%J%%%J%j%J%%%j%%%%j%%J%%
4041F3%%%j%J%%%%Jj%%%j%%%J%%%jJ%%%%Jj%%jJJ%j%%jj%J%%J%%J%%%%%%%%%%%%%J%%%%j%
4033F4jjJ%%Jjj%%J%%J%%%jjJJ%j%j%%%%%JJjjj%J%%%%%%%%J%%%%%%%%%j%J%%%%%%%%%%%%
4026F3%%%%Jj%j%%JJ%j%%%%%j%%j%%%J%J%%%%%%%j%%%J%j%J%%%%%%%j%%%%%%%%jJ%%%%%J%
$$ plain form
4078 64 64 64 64 63 63 63 63 63 63 63 63 63 64 64 63 63 63 63 63 63 63 63 62 63 64 64 64 64 64 64 64 64 64 64 63 63 63 64 63 64 64 64 64 64 63 63 63 62 62 62 62 63 63 64 64 63 63 63 63 62 63 63 63 63 63 63 63 63 63 63
4070 63 64 64 64 65 64 64 64 64 65 64 64 64 64 64 63 63 62 62 63 64 64 64 65 65 66 65 64 64 65 65 65 65 65 65 64 64 64 65 64 64 64 64 64 64 64 64 64 63 63 64 63 63 63 64 64 65 65 65 65 65 63 63 63 64 64 64 64 64 63 63
4063 63 63 63 63 63 63 63 62 62 63 63 63 64 64 64 64 64 64 65 65 65 64 64 64 64 63 63 63 63 63 63 62 62 62 62 62 62 62 63 63 64 64 64 64 63 64 64 63 64 64 63 62 61 61 61 61 62 62 63 63 63 63 63 63 62 62 62 62 62 63 63
4055 63 64 64 64 64 64 63 63 63 63 63 63 63 62 63 63 63 63 63 64 64 64 64 64 64 64 64 64 64 64 64 64 64 64 63 64 64 64 64 63 63 63 63 62 62 63 62 62 62 62 62 62 62 62 61 62 62 62 62 63 63 63 64 65 65 65 64 64 64 64 64
4048 64 64 64 64 64 65 65 65 65 65 65 64 64 63 63 63 63 63 63 63 64 64 65 65 66 65 65 64 64 64 64 65 65 65 64 63 63 63 63 63 63 63 63 63 62 62 62 62 63 63 63 63 64 64 63 63 64 64 64 64 63 63 63 63 63 62 62 62 63 63 63
4041 63 63 63 63 62 62 63 63 63 63 63 64 63 63 63 63 62 62 62 62 63 63 63 63 62 63 63 63 63 63 64 63 63 63 62 63 64 64 63 63 63 62 61 61 62 62 62 63 63 63 64 64 64 64 64 64 64 64 64 64 64 64 64 64 65 65 65 65 65 64 64
4033 64 63 62 63 63 63 64 63 62 62 62 63 63 63 64 64 64 64 63 62 63 64 64 63 63 62 62 62 62 62 62 63 64 63 62 61 61 62 62 62 62 62 62 62 62 62 63 63 63 63 63 63 63 63 63 63 62 62 63 63 63 63 63 63 63 63 63 63 63 63 63
4026 63 63 63 63 63 64 63 63 62 62 62 63 64 64 63 63 63 63 63 63 62 62 62 61 61 61 61 62 62 63 63 63 63 63 63 63 63 62 62 62 62 63 63 62 62 63 63 63 63 63 63 63 63 62 62 62 62 62 62 62 62 62 61 62 62 62 62 62 62 63 63
4018F3%Jj%%%%%%jJ%%j%JJ%j%%%%%%j%j%%J%J%%Jj%%J%%%%j%%%%%%J%%%%%J%j%j%jJJ%%j%
4011F3%%J%%j%J%%%%j%%%%%%JJ%j%%j%%Jj%%%%%J%%%%%jjJ%%%jJ%%J%%j%Jj%J%%j%j%%%J%
4004F3%%jJ%%%%%%%%%%%%%%%%%%%%%%j%J%%%%%%%%%%j%%%%%%%j%J%J%%%%%%j%jJ%%J%%J%%
3996F4%%%%j%%%%%%%%Jj%%%%j%%%%%%%%JJ%%%J%%%j%j%%%J%j%j%%%%%%J%%%J%J%%j%%%%%%
3989F4%j%%%j%%J%%%%%j%%%%%%%%%%%%%%%%J%%%%%%%Jjj%%JJ%%%%%%j%%%%%%%%J%%%j%%%%
3981F3%%%%%%Jj%%%J%%j%%%%j%%%%J%%%j%%J%%j%J%%j%JJ%%%%jJJj%%j%%%%%%%Jj%j%%%%%
3974F2%J%J%j%%%%%J%%%%%%%%%%%j%j%J%%%jKJj%%j%%%Jj%%%%%%j%%%%%%%%J%%%jJ%%%%%%
3966F3%%%%j%%%J%%%%%%J%%%%%%%j%%%J%%jj%%%%%%%%%%%J%%%%%%%%%%%%%%%j%j%%%%J%%%
$$ plain form
4018 63 63 64 63 63 63 63 63 63 63 62 63 63 63 62 62 63 64 64 63 63 63 63 63 63 63 62 62 61 61 61 62 62 63 63 63 64 63 63 63 64 64 64 64 64 63 63 63 63 63 63 63 64 64 64 64 64 64 65 65 64 64 63 63 62 63 64 64 64 63 63
4011 63 63 63 64 64 64 63 63 64 64 64 64 64 63 63 63 63 63 63 63 64 65 65 64 64 64 63 63 63 64 63 63 63 63 63 63 64 64 64 64 64 64 63 62 63 63 63 63 62 63 63 63 64 64 64 63 63 64 63 63 64 64 64 63 63 62 62 62 62 63 63
4004 63 63 63 62 63 63 63 63 63 63 63 63 63 63 63 63 63 63 63 63 63 63 63 63 63 63 63 62 62 63 63 63 63 63 63 63 63 63 63 63 62 62 62 62 62 62 62 62 61 61 62 62 63 63 63 63 63 63 63 62 62 61 62 62 62 63 63 63 64 64 64
3996 64 64 64 64 64 63 63 63 63 63 63 63 63 63 64 63 63 63 63 63 62 62 62 62 62 62 62 62 62 63 64 64 64 64 65 65 65 65 64 64 63 63 63 63 64 64 63 63 62 62 62 62 62 62 62 63 63 63 63 64 64 65 65 65 64 64 64 64 64 64 64
3989 64 64 63 63 63 63 62 62 62 63 63 63 63 63 63 62 62 62 62 62 62 62 62 62 62 62 62 62 62 62 62 62 63 63 63 63 63 63 63 63 64 63 62 62 62 63 64 64 64 64 64 64 64 63 63 63 63 63 63 63 63 63 64 64 64 64 63 63 63 63 63
3981 63 63 63 63 63 63 63 64 63 63 63 63 64 64 64 63 63 63 63 63 62 62 62 62 62 63 63 63 63 62 62 62 63 63 63 62 62 63 63 63 62 62 63 64 64 64 64 64 63 64 65 64 64 64 63 63 63 63 63 63 63 63 64 63 63 62 62 62 62 62 62
3974 62 62 63 63 64 64 63 63 63 63 63 63 64 64 64 64 64 64 64 64 64 64 64 64 63 63 62 62 63 63 63 63 62 64 65 64 64 64 63 63 63 63 64 63 63 63 63 63 63 63 62 62 62 62 62 62 62 62 62 63 63 63 63 62 63 63 63 63 63 63 63
3966 63 63 63 63 63 62 62 62 62 63 63 63 63 63 63 63 64 64 64 64 64 64 64 64 63 63 63 63 64 64 64 63 62 62 62 62 62 62 62 62 62 62 62 62 63 63 63 63 63 63 63 63 63 63 63 63 63 63 63 63 62 62 61 61 61 61 61 62 62 62 62
3959F2JJj%%%%j%%%J%%%%%%%%%%%%J%%%jj%JJj%%%%J%%%j%%jJ%%j%%%%J%%%%%%JjJ%j%%%J
3952F4j%%%%%%%%%%%%%%%%%%j%%%J%Jj%%%j%%j%%KJ%jJj%%%jJ%%%%%J%j%Jjj%%J%%%%%%jj
3944F1%J%%%%%%%%%%%JJ%%Jj%j%j%j%J%%%jJ%%%Jj%%jJ%J%%%j%%j%%%%JJ%j%%jJ%%%JJ%%%
3937F4J%%jj%jj%J%%J%%j%%%%J%%%%J%%j%%%%%%%%%%j%%%J%%j%%%J%%%Jj%%%%%%%%%%%%%%
3929F3j%%%J%j%%Jj%%%%%J%%%%%jj%%%%%%JJ%%%j%J%%j%%%Jj%Jj%%%J%%%%%%jJ%%%Jj%j%%
3922F2J%j%%jJ%J%%j%%%J%%%j%%%%JJ%%j%%%%%%j%%%J%%%j%%%J%j%j%J%%J%Jj%J%%%%%%%%
3915F4j%%%j%%jJ%%J%j%%%J%J%%%%%%%jj%%%J%%%j%%%%J%jjJ%%%%j%J%%J%j%jjJ%J%%%%j%
3907F1%J%%%%%j%%%%%J%%%%%%%J%j%%%%%jJJ%Jj%%j%%%%%J%%%%j%%%%%J%%JJ%%j%j%%%%J%
$$ plain form
3959 62 63 64 63 63 63 63 63 62 62 62 62 63 63 63 63 63 63 63 63 63 63 63 63 63 64 64 64 64 63 62 62 63 64 63 63 63 63 63 64 64 64 64 63 63 63 62 63 63 63 62 62 62 62 62 63 63 63 63 63 63 63 64 63 64 64 63 63 63 63 64
3952 64 63 63 63 63 63 63 63 63 63 63 63 63 63 63 63 63 63 63 63 62 62 62 62 63 63 64 63 63 63 63 62 62 62 61 61 61 63 64 64 63 64 63 63 63 63 62 63 63 63 63 63 63 64 64 63 63 64 63 62 62 62 63 63 63 63 63 63 63 62 61
3944 61 61 62 62 62 62 62 62 62 62 62 62 62 62 63 64 64 64 65 64 64 63 63 62 62 61 61 62 62 62 62 61 62 62 62 62 63 62 62 62 61 62 62 63 63 63 63 62 62 62 61 61 61 61 61 62 63 63 62 62 62 61 62 62 62 62 63 64 64 64 64
3937 64 65 65 65 64 63 63 62 61 61 62 62 62 63 63 63 62 62 62 62 62 63 63 63 63 63 64 64 64 63 63 63 63 63 63 63 63 63 63 63 62 62 62 62 63 63 63 62 62 62 62 63 63 63 63 64 63 63 63 63 63 63 63 63 63 63 63 63 63 63 63
3929 63 62 62 62 62 63 63 62 62 62 63 62 62 62 62 62 62 63 63 63 63 63 63 62 61 61 61 61 61 61 61 62 63 63 63 63 62 62 63 63 63 62 62 62 62 63 62 62 63 62 62 62 62 63 63 63 63 63 63 63 62 63 63 63 63 64 63 63 62 62 62
3922 62 63 63 62 62 62 61 62 62 63 63 63 62 62 62 62 63 63 63 63 62 62 62 62 62 63 64 64 64 63 63 63 63 63 63 63 62 62 62 62 63 63 63 63 62 62 62 62 63 63 62 62 61 61 62 62 62 63 63 64 63 63 64 64 64 64 64 64 64 64 64
3915 64 63 63 63 63 62 62 62 61 62 62 62 63 63 62 62 62 62 63 63 64 64 64 64 64 64 64 64 63 62 62 62 62 63 63 63 63 62 62 62 62 62 63 63 62 61 62 62 62 62 62 61 61 62 62 62 63 63 62 62 61 60 61 61 62 62 62 62 62 61 61
3907 61 61 62 62 62 62 62 62 61 61 61 61 61 61 62 62 62 62 62 62 62 62 63 63 62 62 62 62 62 62 61 62 63 63 64 63 63 63 62 62 62 62 62 62 63 63 63 63 63 62 62 62 62 62 62 63 63 63 64 65 65 65 64 64 63 63 63 63 63 64 64
3900F4j%j%%%%%%%jjJ%%J%J%jJ%jJ%%%%%%%%%j%%%%J%%%%%%%j%%J%J%j%%%%j%%%%%%%%J%%
3892F3%%%%j%J%%%j%%jJJj%Jjj%%%%%%%%%%J%Jj%%%%%%J%%%%%%%%%%%%%%%Jj%%j%%JJ%j%j
3885F2j%%%%J%%%%%%%jJ%%Jj%%%%%%%%%%jJ%%Jjjj%%J%%J%%%%%%%%j%%%%J%%jJ%J%%jJ%%%
3877F3%%J%%j%%%%jj%%%J%%%JjjJ%%%%%J%%%%%%J%%%%j%%%j%%%%j%%Jj%%%%J%%%%j%%%%%J
3870F2%%%%%%%j%JJ%jjJ%%%J%j%%j%%%%j%%J%%%J%%%j%%J%%j%%J%Jj%%%%j%JJJ%%j%%j%%J
3863F3j%J%j%%%%%%%%%%%J%%Jj%%%J%j%%%%%%j%%%%%%%%%%%%%%j%J%%%J%%%%j%%Jj%J%%jj
3855F1J%%%Jj%%%%%Jj%%%%%J%%j%%%JJ%jj%j%%J%%%%%%j%j%%JJ%%%%%%%jJ%%%J%%%%j%Jj%
3848F2J%%%j%J%%%%Jj%%j%%%%%%J%%%%j%%%%%J%j%%J%%j%%J%j%%%%%%%jJ%%%%%%J%%%%J%j
$$ plain form
3900 64 63 63 62 62 62 62 62 62 62 62 61 60 61 61 61 62 62 63 63 62 63 63 62 63 63 63 63 63 63 63 63 63 63 62 62 62 62 62 63 63 63 63 63 63 63 63 62 62 62 63 63 64 64 63 63 63 63 63 62 62 62 62 62 62 62 62 62 63 63 63
3892 63 63 63 63 63 62 62 63 63 63 63 62 62 62 61 62 63 62 62 63 62 61 61 61 61 61 61 61 61 61 61 61 62 62 63 62 62 62 62 62 62 62 63 63 63 63 63 63 63 63 63 63 63 63 63 63 63 63 64 63 63 63 62 62 62 63 64 64 63 63 62
3885 62 61 61 61 61 61 62 62 62 62 62 62 62 62 61 62 62 62 63 62 62 62 62 62 62 62 62 62 62 62 61 62 62 62 63 62 61 60 60 60 61 61 61 62 62 62 62 62 62 62 62 62 61 61 61 61 61 62 62 62 61 62 62 63 63 63 62 63 63 63 63
3877 63 63 63 64 64 64 63 63 63 63 63 62 61 61 61 61 62 62 62 62 63 62 61 62 62 62 62 62 62 63 63 63 63 63 63 63 64 64 64 64 64 63 63 63 63 62 62 62 62 62 61 61 61 62 61 61 61 61 61 62 62 62 62 62 61 61 61 61 61 61 62
3870 62 62 62 62 62 62 62 62 61 61 62 63 63 62 61 62 62 62 62 63 63 62 62 62 61 61 61 61 61 60 60 60 61 61 61 61 62 62 62 62 61 61 61 62 62 62 61 61 61 62 62 63 62 62 62 62 62 61 61 62 63 64 64 64 63 63 63 62 62 62 63
3863 63 62 62 63 63 62 62 62 62 62 62 62 62 62 62 62 62 63 63 63 64 63 63 63 63 64 64 63 63 63 63 63 63 63 62 62 62 62 62 62 62 62 62 62 62 62 62 62 62 61 61 62 62 62 62 63 63 63 63 63 62 62 62 63 62 62 63 63 63 62 61
3855 61 62 62 62 62 63 62 62 62 62 62 62 63 62 62 62 62 62 62 63 63 63 62 62 62 62 63 64 64 63 62 62 61 61 61 62 62 62 62 62 62 62 61 61 60 60 60 61 62 62 62 62 62 62 62 62 61 62 62 62 62 63 63 63 63 63 62 62 63 62 62
3848 62 63 63 63 63 62 62 63 63 63 63 63 64 63 63 63 62 62 62 62 62 62 62 63 63 63 63 63 62 62 62 62 62 62 63 63 62 62 62 63 63 63 62 62 62 63 63 62 62 62 62 62 62 62 62 61 62 62 62 62 62 62 62 63 63 63 63 63 64 64 63
3840F3%j%%%%%%%%j%%JJ%%%%j%j%%J%%j%jJ%Jj%J%%j%J%Jj%%%%%%%%%J%j%%%%%j%%%J%%%%
3833F2%%%%%%%jJ%%%%%%%%Jj%j%J%jJ%%J%J%%j%j%%j%J%%J%%%J%%%j%j%j%%J%j%%%%%J%jj
3826F0%J%%%%%J%J%%%%j%%%%%J%jj%jJJJ%j%%%%%%%%Jj%%%%%%%%j%%%%J%%%%j%%J%%%j%%%
3818F1%%%%%%J%%%J%%%%%%%%%%jJ%%%%%%%%j%j%%%%J%%j%%%J%%J%j%J%j%j%J%%%%%%%%%%%
3811F2%%%%%%%J%%%%%%j%%%%Jjj%J%J%%%%%%%j%%%%%%%Jj%%%%%%%%%%%j%jJJJ%%%j%%J%J%
3803F4jj%%%J%jJ%%j%J%%jJ%%j%J%j%%%J%%%%%jJj%J%%%%%%J%jj%j%%J%%Jj%%%%%%%jJ%%%
3796F2%%%%J%jJj%j%J%J%%j%%%j%%J%J%%%%%jj%J%%%%J%j%%j%jJJ%%%%%%%j%%%%J%%%J%%j
3788F2%%j%%J%J%j%%%J%%j%jJ%J%Jj%j%j%%%%%%J%%%%j%J%%%%j%%%jJ%%%%jJ%J%%%j%jJ%%
$$ plain form
3840 63 63 62 62 62 62 62 62 62 62 62 61 61 61 62 63 63 63 63 63 62 62 61 61 61 62 62 62 61 61 60 61 61 62 61 61 62 62 62 61 61 62 62 63 62 62 62 62 62 62 62 62 62 62 63 63 62 62 62 62 62 62 61 61 61 61 62 62 62 62 62
3833 62 62 62 62 62 62 62 62 61 62 62 62 62 62 62 62 62 62 63 62 62 61 61 62 62 61 62 62 62 63 63 64 64 64 63 63 62 62 62 61 61 62 62 62 63 63 63 63 64 64 64 64 63 63 62 62 61 61 61 62 62 61 61 61 61 61 61 62 62 61 60
3826 60 60 61 61 61 61 61 61 62 62 63 63 63 63 63 62 62 62 62 62 62 63 63 62 61 61 60 61 62 63 63 62 62 62 62 62 62 62 62 62 63 62 62 62 62 62 62 62 62 62 61 61 61 61 61 62 62 62 62 62 61 61 61 62 62 62 62 61 61 61 61
3818 61 61 61 61 61 61 61 62 62 62 62 63 63 63 63 63 63 63 63 63 63 63 62 63 63 63 63 63 63 63 63 63 62 62 61 61 61 61 61 62 62 62 61 61 61 61 62 62 62 63 63 62 62 63 63 62 62 61 61 62 62 62 62 62 62 62 62 62 62 62 62
3811 62 62 62 62 62 62 62 62 63 63 63 63 63 63 63 62 62 62 62 62 63 62 61 61 62 62 63 63 63 63 63 63 63 63 62 62 62 62 62 62 62 62 63 62 62 62 62 62 62 62 62 62 62 62 62 61 61 60 61 62 63 63 63 63 62 62 62 63 63 64 64
3803 64 63 62 62 62 62 63 63 62 63 63 63 62 62 63 63 63 62 63 63 63 62 62 63 63 62 62 62 62 63 63 63 63 63 63 62 63 62 62 63 63 63 63 63 63 63 64 64 63 62 62 61 61 61 62 62 62 63 62 62 62 62 62 62 62 62 61 62 62 62 62
3796 62 62 62 62 62 63 63 62 63 62 62 61 61 62 62 63 63 63 62 62 62 62 61 61 61 62 62 63 63 63 63 63 63 62 61 61 62 62 62 62 62 63 63 62 62 62 61 61 60 61 62 62 62 62 62 62 62 62 61 61 61 61 61 62 62 62 62 63 63 63 62
3788 62 62 62 61 61 61 62 62 63 63 62 62 62 62 63 63 63 62 62 61 62 62 63 63 64 63 63 62 62 61 61 61 61 61 61 61 62 62 62 62 62 61 61 62 62 62 62 62 61 61 61 61 60 61 61 61 61 61 60 61 61 62 62 62 62 61 61 60 61 61 61
3781F1J%j%%j%J%%%%%%%jJ%J%j%%j%%J%%%%%j%J%%%%j%Jj%%%%%%J%J%%j%%JJ%j%%%%%%%%%
3774F2%%%%j%%j%%%%JJ%%%j%%%%%J%%%%%%j%%J%%%%%%%jJ%%%%%j%J%J%%jj%%%J%%%%%%%%%
3766F2%j%%%j%JJ%%%%%%jJ%j%j%%%%%JJ%%jJJ%%j%%j%%%%Jj%J%%j%%%%%%J%%%%%%j%%%%%J
3759F2%%%jJ%%%jj%JJ%%%%%j%%jJ%%%%%j%JjJ%%J%%%jJ%%%jJ%jjJ%%J%%J%%%%%j%%%%%%%%
3751F2%%%%Jj%%%j%%%J%%%j%%J%%%%%%%%%J%jJ%%%%%%%%j%Jj%%%j%jJ%%Jj%%%%J%%%%jjJJ
3744F2%%j%%JJ%j%%%J%%jJ%%j%%%Jj%%%jJ%%j%%J%%%%jJ%%%%%%%Jj%%j%%%J%%%%%j%jJ%%J
3736F2%j%%j%%%%j%JJ%%%%%%J%%%%%%%%%%%%%%%%%%%%j%%%%%J%j%%%j%J%J%%%%jJ%Jjj%%%
3729F1%%%%%Jj%j%J%%%%%J%Jj%%%%%%%%J%%%%%j%%j%%%%%J%%%%%%%%%j%%J%%%%%%J%%j%%%
$$ plain form
3781 61 62 62 61 61 61 60 60 61 61 61 61 61 61 61 61 60 61 61 62 62 61 61 61 60 60 60 61 61 61 61 61 61 60 60 61 61 61 61 61 60 60 61 60 60 60 60 60 60 60 61 61 62 62 62 61 61 61 62 63 63 62 62 62 62 62 62 62 62 62 62
3774 62 62 62 62 62 61 61 61 60 60 60 60 60 61 62 62 62 62 61 61 61 61 61 61 62 62 62 62 62 62 62 61 61 61 62 62 62 62 62 62 62 62 61 62 62 62 62 62 62 61 61 62 62 63 63 63 62 61 61 61 61 62 62 62 62 62 62 62 62 62 62
3766 62 62 61 61 61 61 60 60 61 62 62 62 62 62 62 62 61 62 62 61 61 60 60 60 60 60 60 61 62 62 62 61 62 63 63 63 62 62 62 61 61 61 61 61 62 61 61 62 62 62 61 61 61 61 61 61 61 62 62 62 62 62 62 62 61 61 61 61 61 61 62
3759 62 62 62 62 61 62 62 62 62 61 60 60 61 62 62 62 62 62 62 61 61 61 60 61 61 61 61 61 61 60 60 61 60 61 61 61 62 62 62 62 61 62 62 62 62 61 62 62 61 60 61 61 61 62 62 62 63 63 63 63 63 63 62 62 62 62 62 62 62 62 62
3751 62 62 62 62 62 63 62 62 62 62 61 61 61 61 62 62 62 62 61 61 61 62 62 62 62 62 62 62 62 62 62 63 63 62 63 63 63 63 63 63 63 63 63 62 62 63 62 62 62 62 61 61 60 61 61 61 62 61 61 61 61 61 62 62 62 62 62 61 60 61 62
3744 62 62 62 61 61 61 62 63 63 62 62 62 62 63 63 63 62 63 63 63 62 62 62 62 63 62 62 62 62 61 62 62 62 61 61 61 62 62 62 62 62 61 62 62 62 62 62 62 62 62 63 62 62 62 61 61 61 61 62 62 62 62 62 62 61 61 60 61 61 61 62
3736 62 62 61 61 61 60 60 60 60 60 59 59 60 61 61 61 61 61 61 61 62 62 62 62 62 62 62 62 62 62 62 62 62 62 62 62 62 62 62 62 62 61 61 61 61 61 61 62 62 61 61 61 61 60 60 61 61 62 62 62 62 62 61 62 62 63 62 61 61 61 61
3729 61 61 61 61 61 61 62 61 61 60 60 61 61 61 61 61 61 62 62 63 62 62 62 62 62 62 62 62 62 63 63 63 63 63 63 62 62 62 61 61 61 61 61 61 62 62 62 62 62 62 62 62 62 62 61 61 61 62 62 62 62 62 62 62 63 63 63 62 62 62 62
3722F2J%%%%j%%%%%j%%%J%%j%%jJJ%%%%%%%%%%%%%%J%j%%j%J%%%%%jJ%j%%j%J%%jJ%%%%%%
3714F1%%%%%Jjj%%%%%%J%%J%%%%j%%JJJ%j%j%J%JJ%%jJ%%Jj%%%%%%%j%JJ%j%%%%%j%j%j%J
3707F3%%j%%%%%%%jJ%%%%%%%%%%%%%%J%jj%J%%jjJ%%%j%%J%%J%J%%j%%%j%%J%%%%%%%%%%j
3699F1%%%%J%%J%%%%%jj%%%%j%J%%%J%%jJ%%j%%j%%J%%%%%%%%%%%%%J%%%%jJ%%%j%%%%%%%
3692F1%%J%%j%%%%%J%%%%j%%%%%%%%%J%j%%%J%J%%j%%j%%jJ%%%j%%%J%%J%%j%%%%%%jJJ%%
3685F2%j%%%jJ%%%%%J%%%%%%j%j%%J%JJjj%%%%%j%%%%%%%%%%%j%%%J%%%%%%%J%%%J%%%%%%
3677F2%%%j%%j%J%J%%j%%jjJJ%j%%%J%%%%%%j%%%%%%%%%%%%%JJ%j%%%%%%%%%Jjj%j%%J%J%
3670F1jJ%%%%%%%j%%JJ%j%%%%j%%%%J%%%%%%%J%%jJj%%%J%%J%J%%%jjjJ%%%%j%%%%%%%j%%
$$ plain form
3722 62 63 63 63 63 63 62 62 62 62 62 62 61 61 61 61 62 62 62 61 61 61 60 61 62 62 62 62 62 62 62 62 62 62 62 62 62 62 62 63 63 62 62 62 61 61 62 62 62 62 62 62 61 62 62 61 61 61 60 60 61 61 61 60 61 61 61 61 61 61 61
3714 61 61 61 61 61 61 62 61 60 60 60 60 60 60 60 61 61 61 62 62 62 62 62 61 61 61 62 63 64 64 63 63 62 62 63 63 64 65 65 65 64 65 65 65 66 65 65 65 65 65 65 65 65 64 64 65 66 66 65 65 65 65 65 65 64 64 63 63 62 62 63
3707 63 63 63 62 62 62 62 62 62 62 62 61 62 62 62 62 62 62 62 62 62 62 62 62 62 62 62 63 63 62 61 61 62 62 62 61 60 61 61 61 61 60 60 60 61 61 61 62 62 63 63 63 62 62 62 62 61 61 61 62 62 62 62 62 62 62 62 62 62 62 61
3699 61 61 61 61 61 62 62 62 63 63 63 63 63 63 62 61 61 61 61 61 60 60 61 61 61 61 62 62 62 61 62 62 62 61 61 61 60 60 60 61 61 61 61 61 61 61 61 61 61 61 61 61 61 62 62 62 62 62 61 62 62 62 62 61 61 61 61 61 61 61 61
3692 61 61 61 62 62 62 61 61 61 61 61 61 62 62 62 62 62 61 61 61 61 61 61 61 61 61 61 62 62 61 61 61 61 62 62 63 63 63 62 62 62 61 61 61 60 61 61 61 61 60 60 60 60 61 61 61 62 62 62 61 61 61 61 61 61 61 60 61 62 62 62
3685 62 62 61 61 61 61 60 61 61 61 61 61 61 62 62 62 62 62 62 62 61 61 60 60 60 61 61 62 63 62 61 61 61 61 61 61 60 60 60 60 60 60 60 60 60 60 60 60 59 59 59 59 60 60 60 60 60 60 60 60 61 61 61 61 62 62 62 62 62 62 62
3677 62 62 62 62 61 61 61 60 60 61 61 62 62 62 61 61 61 60 59 60 61 61 60 60 60 60 61 61 61 61 61 61 61 60 60 60 60 60 60 60 60 60 60 60 60 60 60 61 62 62 61 61 61 61 61 61 61 61 61 61 62 61 60 60 59 59 59 60 60 61 61
3670 61 60 61 61 61 61 61 61 61 61 60 60 60 61 62 62 61 61 61 61 61 60 60 60 60 60 61 61 61 61 61 61 61 61 62 62 62 61 62 61 61 61 61 62 62 62 63 63 64 64 64 64 63 62 61 62 62 62 62 62 61 61 61 61 61 61 61 61 60 60 60
3662F0%j%%J%j%%JJ%%%J%j%%%%%%j%%%%%Jj%%%%%%%%%%%J%%%%jJ%%%%%j%jJJJ%j%%%jJ%%%
3655F1%%%%%JJ%%%jj%%%%%%jJj%J%Jj%%j%%%%%%%J%j%%%%%%%%%%%Jj%%J%%j%j%%J%j%%%%J
3647F0%%%J%%%j%%%%%%J%%%%%%j%%j%JJj%JJ%jJj%%%j%%JJ%%%j%%%%%%j%%%%%%%%%%%%%J%
3640F1%j%JJ%jjJ%%JJ%%%%%j%%%%%%%%j%J%j%%%%%%%%%%%jj%%%%J%%J%%%%j%%J%%%%%%%J%
3633F2%%%j%jJ%%%%%J%j%j%JJj%%%%%%%%%%%%%j%%%jjJ%J%%j%%J%%%%%%%%%%%%%%J%Jj%%%
3625F1%%%%%j%jJJ%%%%%%%%%%%jjJ%%%%%%%%%%%%%%JJ%%j%%j%J%%%%%j%%J%%%%%%%%jJ%%%
3618F1%%%%%%%%%%%%%%%%%%%%%%%%%%j%%%J%%%j%%%%%%%%%%%%%%%%%%J%%%%J%%%%%%%%%%%
3610F2%jJ%%%j%Jj%%j%%%%%%%%%%%J%%%%%j%%%%Jj%%j%%JJ%%jj%Jj%J%%%J%%%%%%%%%j%J%
$$ plain form
3662 60 60 59 59 59 60 60 59 59 59 60 61 61 61 61 62 62 61 61 61 61 61 61 61 60 60 60 60 60 60 61 60 60 60 60 60 60 60 60 60 60 60 60 61 61 61 61 61 60 61 61 61 61 61 61 60 60 59 60 61 62 62 61 61 61 61 60 61 61 61 61
3655 61 61 61 61 61 61 62 63 63 63 63 62 61 61 61 61 61 61 61 60 61 60 60 61 61 62 61 61 61 60 60 60 60 60 60 60 60 61 61 60 60 60 60 60 60 60 60 60 60 60 60 61 60 60 60 61 61 61 60 60 59 59 59 60 60 59 59 59 59 59 60
3647 60 60 60 60 61 61 61 61 60 60 60 60 60 60 60 61 61 61 61 61 61 61 60 60 60 59 59 60 61 60 60 61 62 62 61 62 61 61 61 61 60 60 60 61 62 62 62 62 61 61 61 61 61 61 61 60 60 60 60 60 60 60 60 60 60 60 60 60 60 61 61
3640 61 61 60 60 61 62 62 61 60 61 61 61 62 63 63 63 63 63 63 62 62 62 62 62 62 62 62 62 61 61 62 62 61 61 61 61 61 61 61 61 61 61 61 61 60 59 59 59 59 59 60 60 60 61 61 61 61 61 60 60 60 61 61 61 61 61 61 61 61 62 62
3633 62 62 62 62 61 61 60 61 61 61 61 61 61 62 62 61 61 60 60 61 62 61 61 61 61 61 61 61 61 61 61 61 61 61 61 60 60 60 60 59 58 59 59 60 60 60 59 59 59 60 60 60 60 60 60 60 60 60 60 60 60 60 60 60 61 61 62 61 61 61 61
3625 61 61 61 61 61 61 60 60 59 60 61 61 61 61 61 61 61 61 61 61 61 61 60 59 60 60 60 60 60 60 60 60 60 60 60 60 60 60 60 61 62 62 62 61 61 61 60 60 61 61 61 61 61 61 60 60 60 61 61 61 61 61 61 61 61 61 60 61 61 61 61
3618 61 61 61 61 61 61 61 61 61 61 61 61 61 61 61 61 61 61 61 61 61 61 61 61 61 61 61 60 60 60 60 61 61 61 61 60 60 60 60 60 60 60 60 60 60 60 60 60 60 60 60 60 60 60 61 61 61 61 61 62 62 62 62 62 62 62 62 62 62 62 62
3610 62 62 61 62 62 62 62 61 61 62 61 61 61 60 60 60 60 60 60 60 60 60 60 60 60 61 61 61 61 61 61 60 60 60 60 60 61 60 60 60 59 59 59 60 61 61 61 60 59 59 60 59 59 60 60 60 60 61 61 61 61 61 61 61 61 61 61 60 60 61 61
3603F1%J%j%j%%J%%%j%%J%%J%j%j%j%%JJ%%%%%j%J%J%J%%jj%J%%%%%%Jj%%%%jj%J%%%%%%%
3596F1%J%j%J%%%%%j%%%%%J%%%%%j%%%%%%j%%%%%J%%%%J%j%%%%jJ%J%j%%%%j%%%%%J%j%Jj
3588F0%%%J%%J%%j%%j%%J%J%j%%%%Jj%%Jj%j%%%Jj%%J%%%%%j%%%%%j%%%JJ%%j%%%%%J%%J%
3581F2%%j%%%%j%%%%KJ%j%j%%Jjj%JJ%%%%%%%jJ%%%j%j%%JJ%%%%jJ%Jjjjj%%%%%J%J%jj%J
3573F0%J%%J%j%%J%%%J%%%j%J%k%%%j%%%%%%%jJ%%%%j%jJJ%%J%Jjj%J%%%Jj%JJ%j%%j%%%%
3566F1J%Jjj%j%J%JJj%%%%%%j%%%%%j%%%%%%%%%%J%%%%%%J%%j%J%%%%%%%%%jj%%j%%%%J%%
3558F0%%%J%%%%%J%jj%%%%%Jj%j%J%J%%%J%%%%%j%%%%%%%%%j%JJj%%%%J%j%%j%%%%%J%%%j
3551F0%j%J%J%%%%%%jj%%%J%J%J%%%%%%%%%%%%%%j%j%Jj%%%%%%J%%j%%%J%jJ%%j%J%%%%%j
$$ plain form
3603 61 61 62 62 61 61 60 60 60 61 61 61 61 60 60 60 61 61 61 62 62 61 61 60 60 59 59 59 60 61 61 61 61 61 61 60 60 61 61 62 62 63 63 63 62 61 61 62 62 62 62 62 62 62 63 62 62 62 62 62 61 60 60 61 61 61 61 61 61 61 61
3596 61 61 62 62 61 61 62 62 62 62 62 62 61 61 61 61 61 61 62 62 62 62 62 62 61 61 61 61 61 61 61 60 60 60 60 60 60 61 61 61 61 61 62 62 61 61 61 61 61 60 61 61 62 62 61 61 61 61 61 60 60 60 60 60 60 61 61 60 60 61 60
3588 60 60 60 60 61 61 61 62 62 62 61 61 61 60 60 60 61 61 62 62 61 61 61 61 61 62 61 61 61 62 61 61 60 60 60 60 61 60 60 60 61 61 61 61 61 61 60 60 60 60 60 60 59 59 59 59 60 61 61 61 60 60 60 60 60 60 61 61 61 62 62
3581 62 62 62 61 61 61 61 61 60 60 60 60 60 62 63 63 62 62 61 61 61 62 61 60 60 61 62 62 62 62 62 62 62 62 61 62 62 62 62 61 61 60 60 60 61 62 62 62 62 62 61 62 62 63 62 61 60 59 59 59 59 59 59 60 60 61 61 60 59 59 60
3573 60 60 61 61 61 62 62 61 61 61 62 62 62 62 63 63 63 63 62 62 63 63 61 61 61 61 60 60 60 60 60 60 60 60 59 60 60 60 60 60 59 59 58 59 60 60 60 61 61 62 61 60 60 61 61 61 61 62 61 61 62 63 63 62 62 62 61 61 61 61 61
3566 61 62 62 63 62 61 61 60 60 61 61 62 63 62 62 62 62 62 62 62 61 61 61 61 61 61 60 60 60 60 60 60 60 60 60 60 60 61 61 61 61 61 61 61 62 62 62 61 61 62 62 62 62 62 62 62 62 62 62 61 60 60 60 59 59 59 59 59 60 60 60
3558 60 60 60 60 61 61 61 61 61 61 62 62 61 60 60 60 60 60 60 61 60 60 59 59 60 60 61 61 61 61 62 62 62 62 62 62 61 61 61 61 61 61 61 61 61 61 60 60 61 62 61 61 61 61 61 62 62 61 61 61 60 60 60 60 60 60 61 61 61 61 60
3551 60 60 59 59 60 60 61 61 61 61 61 61 61 60 59 59 59 59 60 60 61 61 62 62 62 62 62 62 62 62 62 62 62 62 62 62 62 61 61 60 60 61 60 60 60 60 60 60 60 61 61 61 60 60 60 60 61 61 60 61 61 61 60 60 61 61 61 61 61 61 60
3544F0%%%%J%%%%%%%%J%%j%j%%%%J%%Jj%%%%%%%%%%%%%J%%J%jjj%%%%%%%%j%JJJ%%%%%jj%
3536F0J%%%%%%%%%%%%%j%%%%j%%J%%Jj%j%%J%%%J%%Jjj%%%%%%%J%%%j%%J%%%%%Jj%%%%%%j
3529F0%J%%j%%%%Jj%%%J%%%%j%J%JJJ%jj%%j%%%%%Jj%%j%%J%%%j%%%%%J%%%%%%%%%jjJ%%%
3521F0jJJ%j%jJJJ%%j%%%%j%J%%%%%%%J%%j%%j%%J%j%%%JJj%%j%j%%%%%J%%%%%%%%%%%J%%
3514F1%%j%%%J%%%%J%%%J%%%J%%%%%%J%%%%%%%j%JjjjjJ%Jj%j%%%%%%%%%%J%%%%%%j%%J%%
3507F2%%%j%J%%j%%%%%%j%%j%j%%%J%%J%J%%%%%%%%%%%%%J%%j%%%%%%%%%%%%%%%%%%j%%Jj
3499F0%JJ%j%j%%%%%%%J%j%J%J%%%j%%%%%%%JJjj%%%j%%%%%%%%%%J%%Jj%j%%%%%%%%%%JJ%
3492F2%%j%%%%%jj%j%J%%J%%%%J%%%%%jJ%j%%JJj%J%%Jjj%j%%%%%%%%%%%%jJ%%%%%%JjjjJ
$$ plain form
3544 60 60 60 60 60 61 61 61 61 61 61 61 61 61 62 62 62 61 61 60 60 60 60 60 61 61 61 62 61 61 61 61 61 61 61 61 61 61 61 61 61 61 62 62 62 63 63 62 61 60 60 60 60 60 60 60 60 60 59 59 60 61 62 62 62 62 62 62 61 60 60
3536 60 61 61 61 61 61 61 61 61 61 61 61 61 61 61 60 60 60 60 60 59 59 59 60 60 60 61 60 60 59 59 59 60 60 60 60 61 61 61 62 61 60 60 60 60 60 60 60 60 61 61 61 61 60 60 60 61 61 61 61 61 61 62 61 61 61 61 61 61 61 60
3529 60 60 61 61 61 60 60 60 60 60 61 60 60 60 60 61 61 61 61 61 60 60 61 61 62 63 64 64 63 62 62 62 61 61 61 61 61 61 62 61 61 61 60 60 60 61 61 61 61 60 60 60 60 60 60 61 61 61 61 61 61 61 61 61 61 60 59 60 60 60 60
3521 60 59 60 61 61 60 60 59 60 61 62 62 62 61 61 61 61 61 60 60 61 61 61 61 61 61 61 61 62 62 62 61 61 61 60 60 60 61 61 60 60 60 60 61 62 61 61 61 60 60 59 59 59 59 59 59 60 60 60 60 60 60 60 60 60 60 60 60 61 61 61
3514 61 61 61 60 60 60 60 61 61 61 61 61 62 62 62 62 63 63 63 63 64 64 64 64 64 64 64 65 65 65 65 65 65 65 65 64 64 65 64 63 62 61 62 62 63 62 62 61 61 61 61 61 61 61 61 61 61 61 62 62 62 62 62 62 62 61 61 61 62 62 62
3507 62 62 62 62 61 61 62 62 62 61 61 61 61 61 61 61 60 60 60 59 59 58 58 58 58 59 59 59 60 60 61 61 61 61 61 61 61 61 61 61 61 61 61 61 62 62 62 61 61 61 61 61 61 61 61 61 61 61 61 61 61 61 61 61 61 61 60 60 60 61 60
3499 60 60 61 62 62 61 61 60 60 60 60 60 60 60 60 61 61 60 60 61 61 62 62 62 62 61 61 61 61 61 61 61 61 62 63 62 61 61 61 61 60 60 60 60 60 60 60 60 60 60 60 61 61 61 62 61 61 60 60 60 60 60 60 60 60 60 60 60 61 62 62
3492 62 62 62 61 61 61 61 61 61 60 59 59 58 58 59 59 59 60 60 60 60 60 61 61 61 61 61 61 60 61 61 60 60 60 61 62 61 61 62 62 62 63 62 61 61 60 60 60 60 60 60 60 60 60 60 60 60 60 59 60 60 60 60 60 60 60 61 60 59 58 59
3484E9%%J%%%%J%%%%%%j%J%j%%Jj%j%%J%j%J%%%%%%%J%%%%%J%%%%j%j%%%j%%%J%%%%j%%%J
3477F0%%J%j%j%%JJ%%%%%j%%J%%J%%%j%%j%J%%%j%jJ%%%%%%%%%j%%JJ%jj%%%%%%%%%J%%%%
3469F0%%%%J%%%%%%%%Jj%%jJ%%%%j%%%J%j%%%%%%%%J%j%%%%%%%jJJ%j%%J%%%j%j%%%%%%%%
3462E9%%j%J%%%%J%%%%%%%Jj%%%%%J%J%%j%j%%%j%J%J%j%j%J%%%jJ%jj%%JJ%%%%%j%j%%%%
3455E8J%J%j%%JJ%%%%j%%%j%%%%%%%%J%%%%j%%%%%J%jJ%%%j%%%%%%%%%%%%Jj%J%%Jjj%%%%
3447E9%J%jJj%%%%jJ%J%%%J%%%%jjj%j%JJ%%%%JJ%j%%%%%%J%%%%%j%%jJ%%Jj%%%%%j%%J%%
3440F0%%%%J%j%j%%%%J%%%%%%%%%%j%%J%J%%%%%j%%%%j%%%%J%J%jjJ%%%j%%%%%%%J%j%%%J
3432F0J%%jJjj%%%%J%%%%%%%%j%%%%J%%%%J%%j%j%%J%%%%jjJ%J%%j%%Jj%%%%%%%j%J%%Jj%
$$ plain form
3484 59 59 59 60 60 60 60 60 61 61 61 61 61 61 61 60 60 61 61 60 60 60 61 60 60 59 59 59 60 60 59 59 60 60 60 60 60 60 60 60 61 61 61 61 61 61 62 62 62 62 62 61 61 60 60 60 60 59 59 59 59 60 60 60 60 60 59 59 59 59 60
3477 60 60 60 61 61 60 60 59 59 59 60 61 61 61 61 61 61 60 60 60 61 61 61 62 62 62 62 61 61 61 60 60 61 61 61 61 60 60 59 60 60 60 60 60 60 60 60 60 60 59 59 59 60 61 61 60 59 59 59 59 59 59 59 59 59 59 60 60 60 60 60
3469 60 60 60 60 60 61 61 61 61 61 61 61 61 61 62 61 61 61 60 61 61 61 61 61 60 60 60 60 61 61 60 60 60 60 60 60 60 60 60 61 61 60 60 60 60 60 60 60 60 59 60 61 61 60 60 60 61 61 61 61 60 60 59 59 59 59 59 59 59 59 59
3462 59 59 59 58 58 59 59 59 59 59 60 60 60 60 60 60 60 60 61 60 60 60 60 60 60 61 61 62 62 62 61 61 60 60 60 60 59 59 60 60 61 61 60 60 59 59 60 60 60 60 59 60 60 59 58 58 58 59 60 60 60 60 60 60 59 59 58 58 58 58 58
3455 58 59 59 60 60 59 59 59 60 61 61 61 61 61 60 60 60 60 59 59 59 59 59 59 59 59 59 60 60 60 60 60 59 59 59 59 59 59 60 60 59 60 60 60 60 59 59 59 59 59 59 59 59 59 59 59 59 59 60 59 59 60 60 60 61 60 59 59 59 59 59
3447 59 59 60 60 59 60 59 59 59 59 59 58 59 59 60 60 60 60 61 61 61 61 61 60 59 58 58 57 57 58 59 59 59 59 59 60 61 61 60 60 60 60 60 60 60 61 61 61 61 61 61 60 60 60 59 60 60 60 61 60 60 60 60 60 60 59 59 59 60 60 60
3440 60 60 60 60 60 61 61 60 60 59 59 59 59 59 60 60 60 60 60 60 60 60 60 60 60 59 59 59 60 60 61 61 61 61 61 61 60 60 60 60 60 59 59 59 59 59 60 60 61 61 60 59 60 60 60 60 59 59 59 59 59 59 59 59 60 60 59 59 59 59 60
3432 60 61 61 61 60 61 60 59 59 59 59 59 60 60 60 60 60 60 60 60 60 59 59 59 59 59 60 60 60 60 60 61 61 61 60 60 59 59 59 60 60 60 60 60 59 58 59 59 60 60 60 59 59 59 60 59 59 59 59 59 59 59 59 58 58 59 59 59 60 59 59
3425E9J%%j%%%%J%%%%%j%%%%%%%%%%%%%%%J%%%%%%%%%j%%%J%%%%jJ%Jj%jJ%%%j%jJ%%%J%j
3418E9j%%%%jJJ%%%%%%%J%%%%j%J%%%%%%%%%%%%%%%J%j%%jJ%%Jj%%%%%J%j%%j%j%J%%%%%%
3410E9%%%%%%%%%j%%%%%%%j%%JJ%%%J%j%%j%%%%%%%Jj%%%jJ%j%J%%%j%J%%%%J%%%jJ%%J%%
3403F0%%%j%%J%%j%%%%%%%%%%%%%J%%%j%%J%%J%%%%%%%%%%%%%%%%%%j%%%%%%jJ%%%%j%%J%
3395F0jjJJ%%%J%%%j%j%%%%%%jjJ%%J%%%j%%%J%%%%J%J%%%J%J%k%%%%%jJ%%%%%j%j%%%Jj%
3388E9%%%%J%%%%%j%%J%J%Jjjj%JJ%j%j%j%J%%%%J%jj%%%J%%%%jJ%%%%%%%%%%%%%%j%%%%%
3380E8%J%%%%%%%%%J%J%%j%%%%J%%j%j%%%j%%%J%j%%%JJ%%jj%%%%Jj%J%%%%J%%%%%jj%%Jj
3373E8%%JJ%%%%j%%jJ%%%%jJ%%Jjj%JJ%%%jj%J%Jj%J%%%jj%J%J%%%j%%%%%%%%%%%%%%j%%%
$$ plain form
3425 59 60 60 60 59 59 59 59 59 60 60 60 60 60 60 59 59 59 59 59 59 59 59 59 59 59 59 59 59 59 59 60 60 60 60 60 60 60 60 60 60 59 59 59 59 60 60 60 60 60 59 60 60 61 60 60 59 60 60 60 60 59 59 58 59 59 59 59 60 60 59
3418 59 58 58 58 58 58 57 58 59 59 59 59 59 59 59 59 60 60 60 60 60 59 59 60 60 60 60 60 60 60 60 60 60 60 60 60 60 60 60 61 61 60 60 60 59 60 60 60 61 60 60 60 60 60 60 61 61 60 60 60 59 59 58 58 59 59 59 59 59 59 59
3410 59 59 59 59 59 59 59 59 59 59 58 58 58 58 58 58 58 58 57 57 57 58 59 59 59 59 60 60 59 59 59 58 58 58 58 58 58 58 58 59 58 58 58 58 57 58 58 57 57 58 58 58 58 57 57 58 58 58 58 58 59 59 59 59 58 59 59 59 60 60 60
3403 60 60 60 60 59 59 59 60 60 60 59 59 59 59 59 59 59 59 59 59 59 59 59 59 60 60 60 60 59 59 59 60 60 60 61 61 61 61 61 61 61 61 61 61 61 61 61 61 61 61 61 61 61 60 60 60 60 60 60 60 59 60 60 60 60 60 59 59 59 60 60
3395 60 59 58 59 60 60 60 60 61 61 61 61 60 60 59 59 59 59 59 59 59 58 57 58 58 58 59 59 59 59 58 58 58 58 59 59 59 59 59 60 60 61 61 61 61 62 62 63 63 61 61 61 61 61 61 60 61 61 61 61 61 61 60 60 59 59 59 59 60 59 59
3388 59 59 59 59 59 60 60 60 60 60 60 59 59 59 60 60 61 61 62 61 60 59 59 60 61 61 60 60 59 59 58 58 59 59 59 59 59 60 60 59 58 58 58 58 59 59 59 59 59 58 59 59 59 59 59 59 59 59 59 59 59 59 59 59 59 58 58 58 58 58 58
3380 58 58 59 59 59 59 59 59 59 59 59 59 60 60 61 61 61 60 60 60 60 60 61 61 61 60 60 59 59 59 59 58 58 58 58 59 59 58 58 58 58 59 60 60 60 59 58 58 58 58 58 59 58 58 59 59 59 59 59 60 60 60 60 60 60 59 58 58 58 59 58
3373 58 58 58 59 60 60 60 60 60 59 59 59 58 59 59 59 59 59 58 59 59 59 60 59 58 58 59 60 60 60 60 59 58 58 59 59 60 59 59 60 60 60 60 59 58 58 59 59 60 60 60 60 59 59 59 59 59 59 59 59 59 59 59 59 59 59 59 58 58 58 58
3366E8JjJ%%J%%%%jjJ%%%j%J%j%%%J%%%%j%J%%%%%%%%%%%%%%%j%%J%%%%%%jj%JJ%%j%%Jj%
3358E8%%%%J%%%%%%%%J%%%j%%%%%%J%%jJ%%j%%j%Jj%J%Jj%%J%j%j%%%%JJJjj%%jJJ%%j%%%
3351E9%j%%%J%%%%%%%%%%%%J%%%j%%J%%%j%%%%j%%J%%%%%J%%j%%J%%%%%%%j%%j%%j%J%%%%
3343E8%%%%%%%%J%%j%%%%%%%%%%%%%%J%%%%%Jj%jJJ%j%%%j%%%J%Jj%%%%%%%%%%%%j%%J%%%
3336E9J%%%j%%%%%%J%%%%jj%Jjj%%%J%J%JJ%%jj%j%%%%%J%%%%%%%%%%J%j%%%%%Jjj%JJ%%j
3329E9%%%%jjJ%%%JJj%%%%%%JJj%%%%%%%j%%%%%%J%%%%J%%%%%%j%%J%%%%%%j%%j%%%%J%%%
3321F0%%%%%%%%jJ%%%jJJ%j%j%%%%%%Jj%J%%%%J%%%j%JjJ%jjJ%%%jj%%Jj%J%J%%JJj%j%%%
3314F0%%%%J%%jJ%j%%%%%%%%%j%%%%%%JJ%%jj%%Jj%%%%%%%%%%%%%%%%%jJ%jj%J%J%%%%j%%
$$ plain form
3366 58 59 58 59 59 59 60 60 60 60 60 59 58 59 59 59 59 58 58 59 59 58 58 58 58 59 59 59 59 59 58 58 59 59 59 59 59 59 59 59 59 59 59 59 59 59 59 59 58 58 58 59 59 59 59 59 59 59 58 57 57 58 59 59 59 58 58 58 59 58 58
3358 58 58 58 58 58 59 59 59 59 59 59 59 59 59 60 60 60 60 59 59 59 59 59 59 59 60 60 60 59 60 60 60 59 59 59 58 58 59 58 58 59 59 60 59 59 59 60 60 59 59 58 58 58 58 58 59 60 61 60 59 59 59 58 59 60 60 60 59 59 59 59
3351 59 59 58 58 58 58 59 59 59 59 59 59 59 59 59 59 59 59 59 60 60 60 60 59 59 59 60 60 60 60 59 59 59 59 59 58 58 58 59 59 59 59 59 59 60 60 60 59 59 59 60 60 60 60 60 60 60 60 59 59 59 58 58 58 57 57 58 58 58 58 58
3343 58 58 58 58 58 58 58 58 58 59 59 59 58 58 58 58 58 58 58 58 58 58 58 58 58 58 58 59 59 59 59 59 59 60 59 59 58 59 60 60 59 59 59 59 58 58 58 58 59 59 60 59 59 59 59 59 59 59 59 59 59 59 59 59 58 58 58 59 59 59 59
3336 59 60 60 60 60 59 59 59 59 59 59 59 60 60 60 60 60 59 58 58 59 58 57 57 57 57 58 58 59 59 60 61 61 61 60 59 59 58 58 58 58 58 58 59 59 59 59 59 59 59 59 59 59 59 60 60 59 59 59 59 59 59 60 59 58 58 59 60 60 60 59
3329 59 59 59 59 59 58 57 58 58 58 58 59 60 59 59 59 59 59 59 59 60 61 60 60 60 60 60 60 60 60 59 59 59 59 59 59 59 60 60 60 60 60 61 61 61 61 61 61 61 60 60 60 61 61 61 61 61 61 61 60 60 60 59 59 59 59 59 60 60 60 60
3321 60 60 60 60 60 60 60 60 60 59 60 60 60 60 59 60 61 61 60 60 59 59 59 59 59 59 59 60 59 59 60 60 60 60 60 61 61 61 61 60 60 61 60 61 61 60 59 60 60 60 60 59 58 58 58 59 58 58 59 59 60 60 60 61 62 61 61 60 60 60 60
3314 60 60 60 60 60 61 61 61 60 61 61 60 60 60 60 60 60 60 60 60 60 59 59 59 59 59 59 59 60 61 61 61 60 59 59 59 60 59 59 59 59 59 59 59 59 59 59 59 59 59 59 59 59 59 59 58 59 59 58 57 57 58 58 59 59 59 59 59 58 58 58
3306E8j%JJj%J%%%%%%%%%%%%J%%%j%j%%%%%%%J%JjjJ%j%J%%%%%%%%%%%%j%%JJ%%%%J%%%jj
3299E9%%%%%%%%j%J%%jJ%%J%%%Jj%%%j%%J%%%%%%%J%%%%j%%%%j%%J%%%%j%J%J%j%%%%%j%%
3291E9%Jj%%%%%%j%JJ%%%%j%%%%%jJ%%%Jj%%J%%j%jJJ%%%%jjj%J%jJJ%%%%%J%%%j%%%J%%j
3284E9%%j%%%%%%%%JJj%J%j%%%%J%%%%%%%jJ%%j%%%%J%%%%J%j%%j%%%%%%%jJ%%%j%%%J%%%
3277E9%%%%%%j%%J%%%j%%%%%%%J%%%%%J%Jjj%%%%%%j%JJ%%%%%j%%%%%%%jjJ%%%%%%%J%%%%
3269E9j%J%%%j%%%%%%%%%%%J%%%j%%%%%%J%%%%%%%%%%J%%%%%j%%%%%%J%%j%%%%%%%%%%%J%
3262F0%jJ%%%j%%%J%j%%%%%%j%%J%%%J%%%%%%%%%%j%%%j%%%%%jJ%%J%%%%%J%%%j%%%J%J%%
3254F1j%%%J%jk%%JJ%J%%%%j%Jj%jJJ%%j%j%%%%%%jJ%%%%%%Jj%%%%%%%%j%%%%%%%%%%%%J%
$$ plain form
3306 58 57 57 58 59 58 58 59 59 59 59 59 59 59 59 59 59 59 59 59 60 60 60 60 59 59 58 58 58 58 58 58 58 58 59 59 60 59 58 59 59 58 58 59 59 59 59 59 59 59 59 59 59 59 59 59 58 58 58 59 60 60 60 60 60 61 61 61 61 60 59
3299 59 59 59 59 59 59 59 59 59 58 58 59 59 59 58 59 59 59 60 60 60 60 61 60 60 60 60 59 59 59 60 60 60 60 60 60 60 60 61 61 61 61 61 60 60 60 60 60 59 59 59 60 60 60 60 60 59 59 60 60 61 61 60 60 60 60 60 60 59 59 59
3291 59 59 60 59 59 59 59 59 59 59 58 58 59 60 60 60 60 60 59 59 59 59 59 59 58 59 59 59 59 60 59 59 59 60 60 60 59 59 58 59 60 60 60 60 60 59 58 57 57 58 58 57 58 59 59 59 59 59 59 60 60 60 60 59 59 59 59 60 60 60 59
3284 59 59 59 58 58 58 58 58 58 58 58 58 59 60 59 59 60 60 59 59 59 59 59 60 60 60 60 60 60 60 60 59 60 60 60 59 59 59 59 59 60 60 60 60 60 61 61 60 60 60 59 59 59 59 59 59 59 59 58 59 59 59 59 58 58 58 58 59 59 59 59
3277 59 59 59 59 59 59 59 58 58 58 59 59 59 59 58 58 58 58 58 58 58 58 59 59 59 59 59 59 60 60 61 60 59 59 59 59 59 59 59 58 58 59 60 60 60 60 60 60 59 59 59 59 59 59 59 59 58 57 58 58 58 58 58 58 58 58 59 59 59 59 59
3269 59 58 58 59 59 59 59 58 58 58 58 58 58 58 58 58 58 58 58 59 59 59 59 58 58 58 58 58 58 58 59 59 59 59 59 59 59 59 59 59 59 60 60 60 60 60 60 59 59 59 59 59 59 59 60 60 60 59 59 59 59 59 59 59 59 59 59 59 59 60 60
3262 60 60 59 60 60 60 60 59 59 59 59 60 60 59 59 59 59 59 59 59 58 58 58 59 59 59 59 60 60 60 60 60 60 60 60 60 60 60 59 59 59 59 58 58 58 58 58 58 57 58 58 58 59 59 59 59 59 59 60 60 60 60 59 59 59 59 60 60 61 61 61
3254 61 60 60 60 60 61 61 60 58 58 58 59 60 60 61 61 61 61 61 60 60 61 60 60 59 60 61 61 61 60 60 59 59 59 59 59 59 59 58 59 59 59 59 59 59 59 60 59 59 59 59 59 59 59 59 59 58 58 58 58 58 58 58 58 58 58 58 58 58 59 59
3247E9%J%%%%%j%%j%JJ%j%%%%%%%%%%%j%%J%%%%%j%%jJ%%J%j%%%%%%%%%%%%%%%J%J%Jj%j%
3240E9%%%%%%%%j%%%%J%%J%j%%%%%J%%%%%%j%%%%%%J%%%j%J%%%j%%%%%J%%%%%%j%%j%j%JJ
3232E9j%%jJ%%%%%%j%%%%J%%%JJjJj%%j%%%%%%%J%j%%%%%%%%J%%j%%j%%J%j%%J%%J%%%%%%
3225E9%J%%%%j%%j%%%J%%%%%%%%%%%%%%%%%%jjJJj%%%%%%%%J%%%J%%%%j%%%j%j%%%%%%%%%
3217E7JJJ%%%%%%%%%%%%%j%%%%j%J%%%%%%%%%%j%%%J%%%J%j%%%%j%%%%%%%%J%%%J%%%j%%%
3210E9%%%J%j%jJ%%%%J%jj%%j%j%%J%%%%%J%%Jj%%J%%%%%%%%%J%%%%%jj%%%J%%%%%%%%j%%
3202E8%%%%%J%%%j%J%%%%%%j%J%%%%%jjJ%%J%%%%jj%J%%%J%J%%%%jj%jJ%%Jj%%%%j%JJ%%J
3195F0J%%%j%%j%%j%%%%%%%%%J%%%j%%%J%%%%%%%j%%%%%%%%%%%J%%%%%%%%%%%%%Jjj%%%%%
$$ plain form
3247 59 59 60 60 60 60 60 60 59 59 59 58 58 59 60 60 59 59 59 59 59 59 59 59 59 59 59 59 58 58 58 59 59 59 59 59 59 58 58 58 57 58 58 58 59 59 58 58 58 58 58 58 58 58 58 58 58 58 58 58 58 58 59 59 60 60 61 60 60 59 59
3240 59 59 59 59 59 59 59 59 59 58 58 58 58 58 59 59 59 60 60 59 59 59 59 59 59 60 60 60 60 60 60 60 59 59 59 59 59 59 59 60 60 60 60 59 59 60 60 60 60 59 59 59 59 59 59 60 60 60 60 60 60 60 59 59 59 58 58 57 57 58 59
3232 59 58 58 58 57 58 58 58 58 58 58 58 57 57 57 57 57 58 58 58 58 59 60 59 60 59 59 59 58 58 58 58 58 58 58 58 59 59 58 58 58 58 58 58 58 58 58 59 59 59 58 58 58 57 57 57 58 58 57 57 57 58 58 58 59 59 59 59 59 59 59
3225 59 59 60 60 60 60 60 59 59 59 58 58 58 58 59 59 59 59 59 59 59 59 59 59 59 59 59 59 59 59 59 59 59 58 57 58 59 58 58 58 58 58 58 58 58 58 59 59 59 59 60 60 60 60 60 59 59 59 59 58 58 57 57 57 57 57 57 57 57 57 57
3217 57 58 59 60 60 60 60 60 60 60 60 60 60 60 60 60 60 59 59 59 59 59 58 58 59 59 59 59 59 59 59 59 59 59 59 58 58 58 58 59 59 59 59 60 60 59 59 59 59 59 58 58 58 58 58 58 58 58 58 59 59 59 59 60 60 60 60 59 59 59 59
3210 59 59 59 59 60 60 59 59 58 59 59 59 59 59 60 60 59 58 58 58 57 57 56 56 56 57 57 57 57 57 57 58 58 58 59 58 58 58 59 59 59 59 59 59 59 59 59 59 60 60 60 60 60 60 59 58 58 58 58 59 59 59 59 59 59 59 59 59 58 58 58
3202 58 58 58 58 58 58 59 59 59 59 58 58 59 59 59 59 59 59 59 58 58 59 59 59 59 59 59 58 57 58 58 58 59 59 59 59 59 58 57 57 58 58 58 58 59 59 60 60 60 60 60 59 58 58 57 58 58 58 59 58 58 58 58 58 57 57 58 59 59 59 60
3195 60 61 61 61 61 60 60 60 59 59 59 58 58 58 58 58 58 58 58 58 58 59 59 59 59 58 58 58 58 59 59 59 59 59 59 59 59 58 58 58 58 58 58 58 58 58 58 58 58 59 59 59 59 59 59 59 59 59 59 59 59 59 59 60 59 58 58 58 58 58 58
3188E8J%%jj%%JJJ%%j%%j%%%%%%%%%J%%%%j%%%J%%J%%%j%%j%%J%j%%J%j%%%J%%%j%%%%%%%
3180E8j%%%%%J%%J%%%j%%%jJ%J%%%%jJ%%jJ%j%%J%%j%%%%%%%%%J%%j%%jJJ%jjJ%JJ%%%%j%
3173E9%%%%%%j%%%%jJ%%%%%%Jjj%%%J%%%%%%%%%%%%%%%j%%%J%%%%J%%j%%%%%J%%%%%j%j%J
3165E8%%%%%j%%%%JJJ%j%%%%%jJ%%%%%%%%%%j%jJJj%%%%%%j%%jJ%J%%%%%J%%%%%%%%%%%%%
3158E9J%%J%j%%jj%%%%J%J%jj%%j%J%j%%J%Jj%%%%%J%Jj%jj%jJ%%%J%%J%%%%%%j%%%%%%%J
3151E9%%%%%%%%jj%JJ%%%%%j%j%%J%jJ%%%%%jj%J%%%%J%J%jJ%J%%jj%%%%%%%J%%%J%%%j%j
3143E8%%j%%%%J%%J%%%%%j%%J%%%%j%%J%%%%%%%jJ%%%%%j%%%J%%%j%%%%%%%%%Jj%%%%%%%%
3136E8%J%%%jjj%%%J%%%%J%%%%%%j%%%%%%J%%%%%%%%j%%%j%%JJ%%%%%J%%jj%J%%%%%%%%%J
$$ plain form
3188 58 59 59 59 58 57 57 57 58 59 60 60 60 59 59 59 58 58 58 58 58 58 58 58 58 58 59 59 59 59 59 58 58 58 58 59 59 59 60 60 60 60 59 59 59 58 58 58 59 59 58 58 58 59 59 58 58 58 58 59 59 59 59 58 58 58 58 58 58 58 58
3180 58 57 57 57 57 57 57 58 58 58 59 59 59 59 58 58 58 58 57 58 58 59 59 59 59 59 58 59 59 59 58 59 59 58 58 58 59 59 59 58 58 58 58 58 58 58 58 58 58 59 59 59 58 58 58 57 58 59 59 58 57 58 58 59 60 60 60 60 60 59 59
3173 59 59 59 59 59 59 59 58 58 58 58 58 57 58 58 58 58 58 58 58 59 58 57 57 57 57 58 58 58 58 58 58 58 58 58 58 58 58 58 58 58 58 57 57 57 57 58 58 58 58 58 59 59 59 58 58 58 58 58 58 59 59 59 59 59 59 58 58 57 57 58
3165 58 58 58 58 58 58 57 57 57 57 57 58 59 60 60 59 59 59 59 59 59 58 59 59 59 59 59 59 59 59 59 59 59 58 58 57 58 59 58 58 58 58 58 58 58 57 57 57 56 57 57 58 58 58 58 58 58 59 59 59 59 59 59 59 59 59 59 59 59 59 59
3158 59 60 60 60 61 61 60 60 60 59 58 58 58 58 58 59 59 60 60 59 58 58 58 57 57 58 58 57 57 57 58 58 59 58 58 58 58 58 58 59 59 60 59 59 58 57 57 56 57 57 57 57 58 58 58 59 59 59 59 59 59 59 58 58 58 58 58 58 58 58 59
3151 59 59 59 59 59 59 59 59 59 58 57 57 58 59 59 59 59 59 59 58 58 57 57 57 58 58 57 58 58 58 58 58 58 57 56 56 57 57 57 57 57 58 58 59 59 58 59 59 60 60 60 59 58 58 58 58 58 58 58 58 59 59 59 59 60 60 60 60 59 59 58
3143 58 58 58 57 57 57 57 57 58 58 58 59 59 59 59 59 59 58 58 58 59 59 59 59 59 58 58 58 59 59 59 59 59 59 59 59 58 59 59 59 59 59 59 58 58 58 58 59 59 59 59 58 58 58 58 58 58 58 58 58 58 59 58 58 58 58 58 58 58 58 58
3136 58 58 59 59 59 59 58 57 56 56 56 56 57 57 57 57 57 58 58 58 58 58 58 58 57 57 57 57 57 57 57 58 58 58 58 58 58 58 58 58 57 57 57 57 56 56 56 57 58 58 58 58 58 58 59 59 59 58 57 57 58 58 58 58 58 58 58 58 58 58 59
3128E9%J%%j%%%%J%%j%%%j%%%%%%%jjJ%J%%%%Jj%%%%%%JJ%j%jj%%J%%%%%%%%%%%j%%j%%J%
3121E7%%%%%%J%%J%%%j%j%%%J%%%%%%j%J%%%%%%jJJ%j%J%%jj%J%J%%%j%%%%%J%%%%jJ%J%J
3113F1%%jj%j%%%%%%%%%%%%%%J%J%%%%%%jj%%%%%%%%%%%%%%%%J%%%%%%%%j%J%%j%%%%%%%J
3106E9j%%%%%jJ%%%%J%%%%%%jj%J%Jj%j%%J%%j%%%%%J%Jj%%jJ%%J%%%%j%%%%%%%%%%%j%j%
3099E6%%%%%%J%j%%J%%%%%%%%J%j%j%J%%%%%%%J%j%J%J%k%J%jjJ%J%%%%%%%j%%%%%%J%%%%
3091E8%%%%%%j%%%%%%%%%%%%J%Jj%j%%%%J%%%%%%%%J%%%%j%jJ%%j%jJJ%%%%%j%j%%%J%%%%
3084E7%j%%%J%J%%%%%%%%j%%%%J%%%%%%j%JJj%jjJ%J%%%j%%%%%%%%%%%%%%%%%%%%j%%%Jj%
3076E6%%%jJ%J%%%%%%%j%j%%%%%J%J%%%j%J%%Jj%jj%J%%%j%%%%%%%%%JJj%j%%JJ%j%%J%jj
$$ plain form
3128 59 59 60 60 60 59 59 59 59 59 60 60 60 59 59 59 59 58 58 58 58 58 58 58 58 57 56 57 57 58 58 58 58 58 59 58 58 58 58 58 58 58 59 60 60 59 59 58 57 57 57 58 58 58 58 58 58 58 58 58 58 58 58 57 57 57 56 56 56 57 57
3121 57 57 57 57 57 57 57 58 58 58 59 59 59 59 58 58 57 57 57 57 58 58 58 58 58 58 58 57 57 58 58 58 58 58 58 58 57 58 59 59 58 58 59 59 59 58 57 57 58 58 59 59 59 59 58 58 58 58 58 58 59 59 59 59 59 58 59 59 60 60 61
3113 61 61 61 60 59 59 58 58 58 58 58 58 58 58 58 58 58 58 58 58 58 59 59 60 60 60 60 60 60 60 59 58 58 58 58 58 58 58 58 58 58 58 58 58 58 58 58 58 59 59 59 59 59 59 59 59 59 58 58 59 59 59 58 58 58 58 58 58 58 58 59
3106 59 58 58 58 58 58 58 57 58 58 58 58 58 59 59 59 59 59 59 59 58 57 57 58 58 59 58 58 57 57 57 58 58 58 57 57 57 57 57 57 58 58 59 58 58 58 57 58 58 58 59 59 59 59 59 58 58 58 58 58 58 58 58 58 58 58 58 57 57 56 56
3099 56 56 56 56 56 56 56 57 57 56 56 56 57 57 57 57 57 57 57 57 57 58 58 57 57 56 56 57 57 57 57 57 57 57 57 58 58 57 57 58 58 59 59 57 57 58 58 57 56 57 57 58 58 58 58 58 58 58 58 57 57 57 57 57 57 57 58 58 58 58 58
3091 58 58 58 58 58 58 58 57 57 57 57 57 57 57 57 57 57 57 57 57 58 58 59 58 58 57 57 57 57 57 58 58 58 58 58 58 58 58 58 59 59 59 59 59 58 58 57 58 58 58 57 57 56 57 58 58 58 58 58 58 57 57 56 56 56 56 57 57 57 57 57
3084 57 57 56 56 56 56 57 57 58 58 58 58 58 58 58 58 58 57 57 57 57 57 58 58 58 58 58 58 58 57 57 58 59 58 58 57 56 57 57 58 58 58 58 57 57 57 57 57 57 57 57 57 57 57 57 57 57 57 57 57 57 57 57 57 56 56 56 56 57 56 56
3076 56 56 56 56 55 56 56 57 57 57 57 57 57 57 57 56 56 55 55 55 55 55 55 56 56 57 57 57 57 56 56 57 57 57 58 57 57 56 55 55 56 56 56 56 55 55 55 55 55 55 55 55 55 55 56 57 56 56 55 55 55 56 57 57 56 56 56 57 57 56 55
3069E5%J%%%%%%J%%%%%%%%J%j%%%%%J%%%%%%%j%%%j%%%j%JJ%%%%%%%%%%%%%Jj%%JJj%%%%J
3062E9j%%%%%%%%%%%%%%J%Jj%%j%%J%%%%%%%%%j%%%JJ%jj%J%%%j%%%JJ%%%j%%%%%jJ%%%%%
3054E9%%%%%%%%j%%%%J%%j%%jJ%%%%J%j%%J%%%%j%J%%%%J%%%%%%%%J%%%%j%%j%%%%jj%JJJ
3047F0%j%j%%%%J%%%j%%%%%%J%%j%J%Jjj%%%j%J%%%%%j%%%j%%J%%%%%%J%%J%%j%%%%j%J%%
3039E8j%%Jj%%%%%%%%j%%%%J%%j%%%%%%%%J%%j%%%%%%%%%%%%J%%j%%%%%%%%%%%JJ%%Jj%j%
3032E7%%%J%j%%%jJ%%%%%%%%%%%%%%%%%%%%%%%%%%Jj%%j%%JJ%J%Jj%%%jj%%J%%%%j%j%%%%
3024E6%%%%%%JJj%%j%J%%%%%J%%%%%%%%jJ%%%%%%%%%%%%%jJ%%%%%%%JJ%%jj%J%%jj%%JJ%J
3017F0%jJ%%jj%%%%%%%%jJJ%%j%%%J%%j%jJ%%jJ%%%%j%%%%%%%j%%J%%j%Jj%%%%%J%%j%j%%
$$ plain form
3069 55 55 56 56 56 56 56 56 56 57 57 57 57 57 57 57 57 57 58 58 57 57 57 57 57 57 58 58 58 58 58 58 58 58 57 57 57 57 56 56 56 56 55 55 56 57 57 57 57 57 57 57 57 57 57 57 57 57 57 58 57 57 57 58 59 58 58 58 58 58 59
3062 59 58 58 58 58 58 58 58 58 58 58 58 58 58 58 58 59 59 60 59 59 59 58 58 58 59 59 59 59 59 59 59 59 59 59 58 58 58 58 59 60 60 59 58 58 59 59 59 59 58 58 58 58 59 60 60 60 60 59 59 59 59 59 59 58 59 59 59 59 59 59
3054 59 59 59 59 59 59 59 59 59 58 58 58 58 58 59 59 59 58 58 58 57 58 58 58 58 58 59 59 58 58 58 59 59 59 59 59 58 58 59 59 59 59 59 60 60 60 60 60 60 60 60 60 61 61 61 61 61 60 60 60 59 59 59 59 59 58 57 57 58 59 60
3047 60 60 59 59 58 58 58 58 58 59 59 59 59 58 58 58 58 58 58 58 59 59 59 58 58 59 59 60 59 58 58 58 58 57 57 58 58 58 58 58 58 57 57 57 57 56 56 56 57 57 57 57 57 57 57 58 58 58 59 59 59 58 58 58 58 58 57 57 58 58 58
3039 58 57 57 57 58 57 57 57 57 57 57 57 57 57 56 56 56 56 56 57 57 57 56 56 56 56 56 56 56 56 56 57 57 57 56 56 56 56 56 56 56 56 56 56 56 56 56 57 57 57 56 56 56 56 56 56 56 56 56 56 56 56 57 58 58 58 59 58 58 57 57
3032 57 57 57 57 58 58 57 57 57 57 56 57 57 57 57 57 57 57 57 57 57 57 57 57 57 57 57 57 57 57 57 57 57 57 57 57 57 57 58 57 57 57 56 56 56 57 58 58 59 59 60 59 59 59 59 58 57 57 57 58 58 58 58 58 57 57 56 56 56 56 56
3024 56 56 56 56 56 56 56 57 58 57 57 57 56 56 57 57 57 57 57 57 58 58 58 58 58 58 58 58 58 57 58 58 58 58 58 58 58 58 58 58 58 58 58 58 57 58 58 58 58 58 58 58 58 59 60 60 60 59 58 58 59 59 59 58 57 57 57 58 59 59 60
3017 60 60 59 60 60 60 59 58 58 58 58 58 58 58 58 58 57 58 59 59 59 58 58 58 58 59 59 59 58 58 57 58 58 58 57 58 58 58 58 58 57 57 57 57 57 57 57 57 56 56 56 57 57 57 56 56 57 56 56 56 56 56 56 57 57 57 56 56 55 55 55
3010E5%J%%%%%%%JJ%%j%%%Jj%j%%%%j%%J%%%%J%j%j%j%J%Jj%JJJj%%j%j%J%%%J%%%%jJ%%%
3002E7%%%%JJj%%j%%%%%J%Jj%j%j%%%%%%%JJ%%%j%%%%J%jjj%J%%J%%%%%%%%%J%%%j%%j%%J
2995E7%J%J%j%%%%%%J%Jj%%%%%%%%j%%%%%%Jjj%J%%%%j%%%%jJ%%%%%%%%%%%%%%JJ%%j%%%%
2987E8%%%%J%%Jj%j%%%%%%%J%%%%%%%%%%Jj%%jJ%%%%%%%%%%%j%%jJ%%J%%%%%%%j%%%%%%%%
2980E8%%%%%J%%%j%%%%%%JJ%%%%j%%%%%%%%%%jJ%%j%J%%%%%%j%J%%%%%j%%%%%%%%%%Jj%%%
2972E8J%%%%%%J%j%jJ%%%%%%%%%%%%J%%%%%%%%%j%j%J%%%j%%%Jj%%%j%%%J%%J%j%%%%J%J%
2965F0%%%%%%%k%%%%%%J%Jj%%%Jj%%%%j%%%%jj%%%%JJJ%j%J%%%%%%Jj%%%%%%j%%J%%j%J%%
2958E9%j%%Jj%%J%%j%%%jJj%%%%%%J%JJ%j%%%%%%%j%%%J%%%j%%%Jjj%%%%%%%J%%%j%%%%%%
$$ plain form
3010 55 55 56 56 56 56 56 56 56 56 57 58 58 58 57 57 57 57 58 57 57 56 56 56 56 56 55 55 55 56 56 56 56 56 57 57 56 56 55 55 54 54 55 55 56 55 55 56 57 58 57 57 57 56 56 55 55 56 56 56 56 57 57 57 57 57 56 57 57 57 57
3002 57 57 57 57 57 58 59 58 58 58 57 57 57 57 57 57 58 58 59 58 58 57 57 56 56 56 56 56 56 56 56 57 58 58 58 58 57 57 57 57 57 58 58 57 56 55 55 56 56 56 57 57 57 57 57 57 57 57 57 57 58 58 58 58 57 57 57 56 56 56 57
2995 57 57 58 58 59 59 58 58 58 58 58 58 58 59 59 60 59 59 59 59 59 59 59 59 59 58 58 58 58 58 58 58 59 58 57 57 58 58 58 58 58 57 57 57 57 57 56 57 57 57 57 57 57 57 57 57 57 57 57 57 57 57 58 59 59 59 58 58 58 58 58
2987 58 58 58 58 58 59 59 59 60 59 59 58 58 58 58 58 58 58 58 59 59 59 59 59 59 59 59 59 59 59 60 59 59 59 58 59 59 59 59 59 59 59 59 59 59 59 59 58 58 58 57 58 58 58 59 59 59 59 59 59 59 59 58 58 58 58 58 58 58 58 58
2980 58 58 58 58 58 58 59 59 59 59 58 58 58 58 58 58 58 59 60 60 60 60 60 59 59 59 59 59 59 59 59 59 59 59 58 59 59 59 58 58 59 59 59 59 59 59 59 58 58 59 59 59 59 59 59 58 58 58 58 58 58 58 58 58 58 58 59 58 58 58 58
2972 58 59 59 59 59 59 59 59 60 60 59 59 58 59 59 59 59 59 59 59 59 59 59 59 59 59 60 60 60 60 60 60 60 60 60 60 59 59 58 58 59 59 59 59 58 58 58 58 59 58 58 58 58 57 57 57 57 58 58 58 59 59 58 58 58 58 58 59 59 60 60
2965 60 60 60 60 60 60 60 60 58 58 58 58 58 58 58 59 59 60 59 59 59 59 60 59 59 59 59 59 58 58 58 58 58 57 56 56 56 56 56 57 58 59 59 58 58 59 59 59 59 59 59 59 60 59 59 59 59 59 59 59 58 58 58 59 59 59 58 58 59 59 59
2958 59 59 58 58 58 59 58 58 58 59 59 59 58 58 58 58 57 58 57 57 57 57 57 57 57 58 58 59 60 60 59 59 59 59 59 59 59 59 58 58 58 58 59 59 59 59 58 58 58 58 59 58 57 57 57 57 57 57 57 57 58 58 58 58 57 57 57 57 57 57 57
2950E7J%%%%%%%%jJ%%JJ%j%%%%%j%%%%%%%%%%%%Jj%%%%J%%%%j%%j%%jJ%J%%j%%J%%%%j%%%
2943E7%%%%j%J%%%%%%%J%%%%jJ%%%j%%%%%J%%J%%%%%%%%%%%%%%jj%%%%%%jJ%%J%%%%%J%%%
2935E9%%jj%%%j%JJ%j%%J%j%%%J%%%%%%%J%%j%%%%%j%J%%%%%%%%Jj%%%j%%%%J%j%%%%%J%%
2928E8%%%%%%j%%%%%%%%%%%%%%%%%%%J%%Jj%%j%J%%%%%%%%%%j%%j%%%J%%J%%%J%%%%%%%j%
2921E8%%j%%%J%%%%j%%%%J%%%J%j%%j%%%J%%J%j%%%%%%%%jJ%%%%%%j%JJ%%j%%%Jj%jj%%%J
2913E7%J%%JjJ%%j%%%%%%%%%%%%%%%%%%%%%j%%%%%%JJ%J%j%jJ%%j%%%%%%%%j%%%%%%J%%%%
2906E8%%%JJj%j%%%%%%j%%%%%Jj%%Jj%%J%%%%%%%%%j%J%%%JJ%%j%jj%%J%%%J%%%Jj%%%%%%
2898E9%%%%%J%%%%%%jj%%%%J%jj%%%%%%%%J%J%%%J%j%%%%%J%%J%%%%jJJJj%J%J%%J%j%%%%
$$ plain form
2950 57 58 58 58 58 58 58 58 58 58 57 58 58 58 59 60 60 59 59 59 59 59 59 58 58 58 58 58 58 58 58 58 58 58 58 58 59 58 58 58 58 58 59 59 59 59 59 58 58 58 57 57 57 56 57 57 58 58 58 57 57 57 58 58 58 58 58 57 57 57 57
2943 57 57 57 57 57 56 56 57 57 57 57 57 57 57 57 58 58 58 58 58 57 58 58 58 58 57 57 57 57 57 57 58 58 58 59 59 59 59 59 59 59 59 59 59 59 59 59 59 59 58 57 57 57 57 57 57 57 56 57 57 57 58 58 58 58 58 58 59 59 59 59
2935 59 59 59 58 57 57 57 57 56 56 57 58 58 57 57 57 58 58 57 57 57 57 58 58 58 58 58 58 58 58 59 59 59 58 58 58 58 58 58 57 57 58 58 58 58 58 58 58 58 58 59 58 58 58 58 57 57 57 57 57 58 58 57 57 57 57 57 57 58 58 58
2928 58 58 58 58 58 58 58 57 57 57 57 57 57 57 57 57 57 57 57 57 57 57 57 57 57 57 57 58 58 58 59 58 58 58 57 57 58 58 58 58 58 58 58 58 58 58 58 57 57 57 56 56 56 56 57 57 57 58 58 58 58 59 59 59 59 59 59 59 59 58 58
2921 58 58 58 57 57 57 57 58 58 58 58 58 57 57 57 57 57 58 58 58 58 59 59 58 58 58 57 57 57 57 58 58 58 59 59 58 58 58 58 58 58 58 58 58 57 58 58 58 58 58 58 58 57 57 58 59 59 59 58 58 58 58 59 58 58 57 56 56 56 56 57
2913 57 57 58 58 58 59 58 59 59 59 58 58 58 58 58 58 58 58 58 58 58 58 58 58 58 58 58 58 58 58 58 58 57 57 57 57 57 57 57 58 59 59 60 60 59 59 58 59 59 59 58 58 58 58 58 58 58 58 58 57 57 57 57 57 57 57 58 58 58 58 58
2906 58 58 58 58 59 60 59 59 58 58 58 58 58 58 58 57 57 57 57 57 57 58 57 57 57 58 57 57 57 58 58 58 58 58 58 58 58 58 58 57 57 58 58 58 58 59 60 60 60 59 59 58 57 57 57 58 58 58 58 59 59 59 59 60 59 59 59 59 59 59 59
2898 59 59 59 59 59 59 60 60 60 60 60 60 60 59 58 58 58 58 58 59 59 58 57 57 57 57 57 57 57 57 57 58 58 59 59 59 59 60 60 59 59 59 59 59 59 60 60 60 61 61 61 61 61 60 61 62 63 62 62 63 63 64 64 64 65 65 64 64 64 64 64
2891F4%%%%jJJ%%j%j%jj%Jjj%j%%%jJJ%%J%%j%%%%J%%j%J%%j%%%%%%%%J%J%%%J%J%kj%%JJ
2883F3%%jJ%%j%j%%J%j%j%j%%%%%J%%jjJ%%%j%%%J%j%jJ%%%%%%J%%J%%%%%%%%%%%%%%%%%%
2876F0%J%%%%j%%j%%%%J%%%%%%%j%j%%%J%Jj%j%%%%%%%%%%J%%J%%%%jjj%%%JJ%J%%%%%%%j
2869E9%%%%j%J%%%%J%jj%J%%%%%%%%%%j%%J%j%%%%J%%J%j%%%%%%%j%%%%J%J%%%J%%%%%j%%
2861F0%%J%%j%j%%%%%%JJj%%j%%J%%j%%J%%J%j%%%j%%%%%%j%JJJ%j%Jjj%j%J%%%%%%%%%%%
2854E9j%%%%%%%%%J%J%%%%%%%%jj%jJ%J%j%J%%%%%j%%%J%%%%%%%J%j%%J%%%%%%%J%J%%jj%
2846F0%%%%J%%%%%J%%jj%JJJ%%JJ%%%%J%JK%JJJ%JJJJJ%J%J%JJ%%%kkjjjjjjj%Jj%%%%%KJ
2839G3J%J%JJJ%KKLLLNNMNNNMNNMMMMKLKLJ%JKKJjlonpoonoonnmnkkjjj%%%KJKJKLLKMMNP
$$ plain form
2891 64 64 64 64 64 63 64 65 65 65 64 64 63 63 62 61 61 62 61 60 60 59 59 59 59 58 59 60 60 60 61 61 61 60 60 60 60 60 61 61 61 60 60 61 61 61 60 60 60 60 60 60 60 60 60 61 61 62 62 62 62 63 63 64 64 62 61 61 61 62 63
2883 63 63 63 62 63 63 63 62 62 61 61 61 62 62 61 61 60 60 59 59 59 59 59 59 60 60 60 59 58 59 59 59 59 58 58 58 58 59 59 58 58 57 58 58 58 58 58 58 58 59 59 59 60 60 60 60 60 60 60 60 60 60 60 60 60 60 60 60 60 60 60
2876 60 60 61 61 61 61 61 60 60 60 59 59 59 59 59 60 60 60 60 60 60 60 60 59 59 58 58 58 58 59 59 60 59 59 58 58 58 58 58 58 58 58 58 58 58 59 59 59 60 60 60 60 60 59 58 57 57 57 57 58 59 59 60 60 60 60 60 60 60 60 59
2869 59 59 59 59 59 58 58 59 59 59 59 59 60 60 59 58 58 59 59 59 59 59 59 59 59 59 59 59 58 58 58 59 59 58 58 58 58 58 59 59 59 60 60 59 59 59 59 59 59 59 59 58 58 58 58 58 59 59 60 60 60 60 61 61 61 61 61 61 60 60 60
2861 60 60 60 61 61 61 60 60 59 59 59 59 59 59 59 60 61 60 60 60 59 59 59 60 60 60 59 59 59 60 60 60 61 61 60 60 60 60 59 59 59 59 59 59 59 58 58 59 60 61 61 60 60 61 60 59 59 58 58 59 59 59 59 59 59 59 59 59 59 59 59
2854 59 58 58 58 58 58 58 58 58 58 58 59 59 60 60 60 60 60 60 60 60 60 59 58 58 57 58 58 59 59 58 58 59 59 59 59 59 59 58 58 58 58 59 59 59 59 59 59 59 59 60 60 59 59 59 60 60 60 60 60 60 60 60 61 61 62 62 62 61 60 60
2846 60 60 60 60 60 61 61 61 61 61 61 62 62 62 61 60 60 61 62 63 63 63 64 65 65 65 65 65 66 66 67 69 69 70 71 72 72 73 74 75 76 77 77 78 78 79 79 80 81 81 81 81 79 77 76 75 74 73 72 71 70 70 71 70 70 70 70 70 70 72 73
2839 73 74 74 75 75 76 77 78 78 80 82 85 88 91 96 101 105 110 115 120 124 129 134 138 142 146 150 152 155 157 160 161 161 162 164 166 167 166 163 157 152 145 139 133 128 122 116 111 106 102 97 95 93 92 91 90 90 90 90 92 93 95 96 98 101 104 106 110 114 119 126
2832A26QRJ0J1J1J3J2J1J1J1J0RRQQPOMLKKKLLkrj3j6j7j5j4j5j5j5j4j3j2j0qnlk%kj%JJ
2826A10KKKKMMNPPRJ0J1J4J5J6J5J5J5J5J4J3J2J1J1RPONNLKLLJmj2j9k1k1k1k1k0k1k1k0
2822A84j8j6j3j0onllkk%%J%JJJKMMMOQQQJ0RJ1J2J1J1J0J1RRPQPOMMLKJJL%nj1j5j6j7j5
2816B24j6j6j6j5j4j4j2rqnnlkjk%%%%jJ%%%JKLKLLMNNNMMMMLLLLKKLJJJJ%Jjknoooopppo
2810A00onmnlkkj%jj%jjjj%%J%%J%%J%JJ%KJ%JJJ%%%j%JJ%J%J%%j%jjjjkjjkjjjjj%%j%%%
2802F3%j%jj%%%Jj%%%%%%jj%%J%J%%k%%Jj%%%%J%%%%%%%j%%J%%%%%J%%%j%%Jj%%%%%j%%J%
2795E9%%%%%%%j%J%jj%%%%K%%%%j%%J%%j%J%j%JJ%%j%%%%%%%J%j%%j%%%%J%Jj%%%j%%%%JJ
2787F0J%j%j%%j%%%%%J%%j%%%%J%%%%%j%%%j%J%%%%%%%%jJj%%%%%%J%jJJJ%%%j%%%j%J%%%
$$ plain form
2832 126 134 143 153 164 175 188 200 211 222 233 243 252 261 269 277 284 290 294 297 299 301 303 306 309 307 298 285 269 252 237 223 208 193 178 164 151 139 129 121 116 113 111 111 109 108 108 109 110
2826 110 112 114 116 118 122 126 131 138 145 154 164 175 189 204 220 235 250 265 280 294 307 319 330 341 350 357 363 368 373 376 378 381 384 385 381 369 350 329 308 287 266 246 225 204 184
2822 184 166 150 137 127 121 116 113 110 108 106 106 106 107 107 108 109 110 112 116 120 124 130 138 146 154 164 173 184 196 207 218 228 239 248 257 264 272 279 285 289 293 296 298 299 300 303 303 298 287 272 256 239 224
2816 224 208 192 176 161 147 133 121 112 104 99 94 91 89 88 86 86 86 86 86 85 86 86 86 86 87 89 92 94 97 100 104 109 114 119 123 127 131 135 138 141 144 147 149 151 154 155 156 157 158 158 159 158 156 151 145 139 133 127 120 113 106 100
2810 100 94 89 85 80 77 75 73 72 72 71 70 70 69 68 67 66 66 66 67 67 67 68 68 68 69 69 70 71 71 73 74 74 75 76 77 77 77 77 76 76 77 78 78 79 79 80 80 80 79 79 78 77 76 75 73 72 71 69 68 67 66 65 64 64 64 63 63 63 63
2802 63 63 62 62 61 60 60 60 60 61 60 60 60 60 60 60 60 59 58 58 58 59 59 60 60 60 58 58 58 59 58 58 58 58 58 59 59 59 59 59 59 59 59 58 58 58 59 59 59 59 59 59 60 60 60 60 59 59 59 60 59 59 59 59 59 59 58 58 58 59 59
2795 59 59 59 59 59 59 59 59 58 58 59 59 58 57 57 57 57 57 59 59 59 59 59 58 58 58 59 59 59 58 58 59 59 58 58 59 60 60 60 59 59 59 59 59 59 59 59 60 60 59 59 59 58 58 58 58 58 59 59 60 59 59 59 59 58 58 58 58 58 59 60
2787 60 61 61 60 60 59 59 59 58 58 58 58 58 58 59 59 59 58 58 58 58 58 59 59 59 59 59 59 58 58 58 58 57 57 58 58 58 58 58 58 58 58 58 57 58 57 57 57 57 57 57 57 58 58 57 58 59 60 60 60 60 59 59 59 59 58 58 59 59 59 59
2780E9j%Jj%%J%%j%jJ%%%%%JJJ%%%j%Jjj%%%%%J%J%%%%%j%%j%%%%%%%%%J%%jj%%JJJj%%%%
2773F0%%%j%%%%%%%%J%J%%%%%%j%Jj%%%%%%%%%J%%%%%%%%%%j%%jJ%%%jjJ%JJ%%j%%%j%%J%
2765F0%J%J%j%%%%%%j%j%%%%J%%%%%j%JJ%%j%%J%j%%%%%%%%J%%J%jJjj%%%Jj%%%%%%%%j%J
2758F0%%%%J%%%jJ%%Jj%%%%%%%%jJ%j%%%%J%j%%%J%%j%%j%%JJ%%%%%%%Jj%%%%%%Jj%%J%%%
2750F2jJ%j%%%%J%J%%%%j%%j%%%%%%%J%%%j%J%%j%%%%%%%%J%j%jJ%J%Jj%%%%%j%%J%%%%%%
2743F2%%%%%J%%%j%%%%Jj%%%%%%%%%%%%%J%%%%%%%J%%%j%%%%%%%%Jj%j%%%%%%%%%J%%J%j%
2735F3%j%Jj%%Jj%%%jJ%%j%JJ%%j%%J%j%%%J%J%j%%%%%%%%%%%%%%J%%J%%%%%%%%%%%%%j%J
2728F5%j%%%%%j%%%j%Jj%%%%%%%%JJ%%%j%%%%%%%J%%%%%jJ%%%%J%%%%%%%%%j%%J%J%%%%%%
$$ plain form
2780 59 58 58 59 58 58 58 59 59 59 58 58 57 58 58 58 58 58 58 59 60 61 61 61 61 60 60 61 60 59 59 59 59 59 59 60 60 61 61 61 61 61 61 60 60 60 59 59 59 59 59 59 59 59 59 59 60 60 60 59 58 58 58 59 60 61 60 60 60 60 60
2773 60 60 60 60 59 59 59 59 59 59 59 59 59 60 60 61 61 61 61 61 61 61 60 60 61 60 60 60 60 60 60 60 60 60 60 61 61 61 61 61 61 61 61 61 61 61 60 60 60 59 60 60 60 60 59 58 59 59 60 61 61 61 60 60 60 60 59 59 59 60 60
2765 60 60 61 61 62 62 61 61 61 61 61 61 61 60 60 59 59 59 59 59 60 60 60 60 60 60 59 59 60 61 61 61 60 60 60 61 61 60 60 60 60 60 60 60 60 60 61 61 61 62 62 61 62 61 60 60 60 60 61 60 60 60 60 60 60 60 60 60 59 59 60
2758 60 60 60 60 60 61 61 61 61 60 61 61 61 62 61 61 61 61 61 61 61 61 61 60 61 61 60 60 60 60 60 61 61 60 60 60 60 61 61 61 60 60 60 59 59 59 60 61 61 61 61 61 61 61 61 62 61 61 61 61 61 61 61 62 61 61 61 62 62 62 62
2750 62 61 62 62 61 61 61 61 61 62 62 63 63 63 63 63 62 62 62 61 61 61 61 61 61 61 61 62 62 62 62 61 61 62 62 62 61 61 61 61 61 61 61 61 61 62 62 61 61 60 61 61 62 62 63 62 62 62 62 62 62 61 61 61 62 62 62 62 62 62 62
2743 62 62 62 62 62 62 63 63 63 63 62 62 62 62 62 63 62 62 62 62 62 62 62 62 62 62 62 62 62 62 63 63 63 63 63 63 63 63 64 64 64 64 63 63 63 63 63 63 63 63 63 64 63 63 62 62 62 62 62 62 62 62 62 62 63 63 63 64 64 63 63
2735 63 63 62 62 63 62 62 62 63 62 62 62 62 61 62 62 62 61 61 62 63 63 63 62 62 62 63 63 62 62 62 62 63 63 64 64 63 63 63 63 63 63 63 63 63 63 63 63 63 63 63 64 64 64 65 65 65 65 65 65 65 65 65 65 65 65 65 65 64 64 65
2728 65 65 64 64 64 64 64 64 63 63 63 63 62 62 63 62 62 62 62 62 62 62 62 62 63 64 64 64 64 63 63 63 63 63 63 63 63 64 64 64 64 64 64 63 64 64 64 64 64 65 65 65 65 65 65 65 65 65 65 64 64 64 65 65 66 66 66 66 66 66 66
2721F6%%%%%%%J%%j%JJJJ%%%%J%J%JjJJj%jJ%%JJJ%J%J%JJJJ%JJJJKJKJKKJKLLLLMMNNOOQ
2713A49QQQPQPPPONNNMMLJ%%jlmmnpqqj0rj0rrrrrppnnmmlllk%jjkj%%%jjj%j%j%j%j%%%%
2706G3%%%j%%j%%%Jj%%%Jj%%jJ%%%J%%j%%J%jj%%%j%%%J%%%j%%%J%%%j%%%Jj%jjjJ%j%%%%
2699F6%%JjJ%%Jj%jJJjj%%%%%JJJ%J%%jJJ%%JJ%%J%%%%%%JJ%%%%%%%%%%%J%%%%%%%%j%j%J
2691G6j%%jJJ%%%%%%j%%%J%%J%%%%%%j%%J%%%%%%%%J%%%%%J%%%%J%JJ%jjJ%%j%%J%%J%%%%
2684H2jj%%%%%Jjj%%jj%%%%%%%j%%JJj%j%JJ%%%J%%J%JJKKJJKJJ%%%KJJJJJJJ%%%%JJ%%%%
2676A03j%J%J%%%%%%j%%J%%%%JJ%J%J%J%JJJJJJJ%KJJKKJJJJ%JJK%j%%%%%%j%J%%%J%%%J%
2669A33%%%JJJKJJKL%JJJJKKKJJKJJ%%Jjj%jjkllllmlmmnonpppqqrrrrqpppponnmlkk%JJL
$$ plain form
2721 66 66 66 66 66 66 66 66 67 67 67 66 66 67 68 69 70 70 70 70 70 71 71 72 72 73 72 73 74 73 73 72 73 73 73 74 75 76 76 77 77 78 78 79 80 81 82 82 83 84 85 86 88 89 91 92 94 96 97 99 102 105 108 111 115 119 124 129 135 141 149
2713 149 157 165 173 180 188 195 202 209 215 220 225 230 234 238 241 242 242 242 241 238 234 230 225 218 210 202 192 183 173 164 155 146 137 128 121 114 109 104 100 96 93 90 87 85 85 84 83 81 80 80 80 80 79 78 77 77 76 76 75 75 74 74 73 73 73 73 73
2706 73 73 73 73 72 72 72 71 71 71 71 72 71 71 71 71 72 71 71 71 70 71 71 71 71 72 72 72 71 71 71 72 72 71 70 70 70 70 69 69 69 69 70 70 70 70 69 69 69 69 70 70 70 70 69 69 69 69 70 69 69 68 67 66 67 67 66 66 66 66 66
2699 66 66 66 67 66 67 67 67 68 67 67 66 67 68 67 66 66 66 66 66 66 67 68 69 69 70 70 70 69 70 71 71 71 72 73 73 73 74 74 74 74 74 74 74 75 76 76 76 76 76 76 76 76 76 76 76 76 77 77 77 77 77 77 77 77 77 76 76 75 75 76
2691 76 75 75 75 74 75 76 76 76 76 76 76 76 75 75 75 75 76 76 76 77 77 77 77 77 77 77 76 76 76 77 77 77 77 77 77 77 77 77 78 78 78 78 78 78 79 79 79 79 79 80 80 81 82 82 81 80 81 81 81 80 80 80 81 81 81 82 82 82 82 82
2684 82 81 80 80 80 80 80 80 81 80 79 79 79 78 77 77 77 77 77 77 77 77 76 76 76 77 78 77 77 76 76 77 78 78 78 78 79 79 79 80 80 81 82 84 86 87 88 90 91 92 92 92 92 94 95 96 97 98 99 100 101 101 101 101 101 102 103 103 103 103 103
2676 103 102 102 103 103 104 104 104 104 104 104 104 103 103 103 104 104 104 104 104 105 106 106 107 107 108 108 109 109 110 111 112 113 114 115 116 116 118 119 120 122 124 125 126 127 128 128 129 130 132 132 131 131 131 131 131 131 131 130 130 131 131 131 131 132 132 132 132 133 133
2669 133 133 133 133 134 135 136 138 139 140 142 145 145 146 147 148 149 151 153 155 156 157 159 160 161 161 161 162 161 160 160 159 158 156 153 150 147 144 140 137 133 129 124 118 113 106 99 92 84 76 67 58 49 40 32 25 18 11 4 -2 -7 -12 -16 -19 -21 -23 -23 -22 -21 -18
2662a8NNPQRRJ1J1J2J2J2J3J2J1J3J1J0J0RRQOPOMMNMMMNNOOOQPRJ0J2J4J5J5J7J9K1K2K5
2657D55K7K8L0L0L3L5L6L6L7M0M0M1M3M4M5M6M7M8N0N1N2N5N6N9O1O5O8P0P3P8Q1Q6R1R5J01
2653B333J06J12J20J25J33J41J49J59J68J80J90K04K19K38K60K84L13L49L93M46N06N74O50
2651H352P34Q21R12J003J090J172J245J304J348J376J387J381J356J312J253J182J099J005
2649B9332R02P85O57N14L61J95K1j64l59n63p66r65j154j328j480j606j704j768j799j797
2647A7314j761j695j600j484j351j209j062r19p82o57n43m46l63k96k43k04j74j51j34j22
2644B118j12j05r9r4q8q2p9p6p2o8o4o0n6n3n0m7m4m0l7l5l3l1k8k6k3k2k0j9j7j6j5j3j2
2641D82j0j1j0qrqppqoonoooonnnonnonnnnonmnnmnmmmlljj%JJLLNNOOPOPPQPPOOMMLJJjk
$$ plain form
2662 -18 -13 -8 -1 7 16 25 36 47 59 71 83 96 108 119 132 143 153 163 172 181 189 195 202 208 212 216 221 225 229 233 238 243 249 255 261 269 276 285 295 307 321 336 351 368 387 408 430 455
2657 455 482 510 540 570 603 638 674 710 747 787 827 868 911 955 1000 1046 1093 1141 1191 1242 1294 1349 1405 1464 1525 1590 1658 1728 1801 1879 1960 2046 2137 2232 2333
2653 2333 2439 2551 2671 2796 2929 3070 3219 3378 3546 3726 3916 4120 4339 4577 4837 5121 5434 5783 6176 6622 7128 7702 8352
2651 8352 9086 9907 10819 11822 12912 14084 15329 16633 17981 19357 20744 22125 23481 24793 26046 27228 28327 29332
2649 29332 30234 31019 31676 32190 32551 32746 32767 32603 32244 31681 30915 29950 28796 27468 25988 24382 22678 20910 19111 17314
2647 17314 15553 13858 12258 10774 9423 8214 7152 6233 5451 4794 4251 3805 3442 3146 2903 2699 2525 2374 2240 2118
2644 2118 2006 1901 1802 1708 1620 1538 1459 1383 1311 1243 1179 1119 1063 1010 960 913 869 829 792 757 724 693 665 639 616 594 574 555 538 522 507 494 482
2641 482 472 461 451 443 434 426 419 412 404 398 392 387 381 375 369 363 358 353 348 342 337 332 326 321 316 311 306 300 295 291 286 281 277 272 268 264 260 257 254 253 252 252 253 254 257 260 265 270 276 282 289 295 302 309 317 324 331 337 343 347 351 354 355 356 355 353
2634C53lnpqrj1j0j3j3j5j6j6j7j6j6j5j4j4j3j1j1j0rqoonmnmllkkkk%%%%%%JJJJJJJJ%J
2628C8JK%J%JJ%J%%%%%j%j%jj%jjjj%%jj%%%Jj%%%%J%JJJJJKJJJJ%JJJJ%%%%%%%Jj%%jj%%
2621D9%jjj%j%%j%%j%%j%%j%%J%JJ%J%J%JKJ%J%JKJJ%%J%JJ%jJ%Jj%%jj%%%jj%j%j%%%%jj
2614E1%%%%j%%j%%%%%j%%%%%j%%%%%%%%%%%%%J%%%%%%%%%%J%%%%%%J%jj%%J%%j%%%j%%%%%
2606D7%%%%%%j%j%%%%%%j%%%%J%%%%%j%%%%%%%J%%j%%%%%JJ%%JJJ%J%JJJ%J%%J%%%%%%%%%
2599E5j%j%%%j%j%j%%j%%%%jj%jJ%J%%%%%j%%%%%%J%%%%%%%%%%J%jjJJj%jJ%%%%%%%%%jjJ
2591D7%%%%%%J%J%J%j%%%%%%J%JJJJ%J%%J%J%J%%J%%J%%JJJJJ%J%JKJJKKLKLKLLMMNOOOPO
2584A35QQQPPOPPOOMMMKKKJ%llnopqqqj0rrj0rj0qpqoomlmkkkkkjjk%jj%jjj%%j%%%j%%j%
$$ plain form
2634 353 350 345 338 330 321 310 300 287 274 259 243 227 210 194 178 163 149 135 122 111 100 90 81 73 67 61 56 52 47 43 40 37 35 33 31 29 29 29 29 29 29 29 30 31 32 33 34 35 36 37 37 38
2628 38 39 41 41 42 42 43 44 44 45 45 45 45 45 45 44 44 43 43 42 41 41 40 39 38 37 37 37 36 35 35 35 35 36 35 35 35 35 35 36 36 37 38 39 40 41 43 44 45 46 47 47 48 49 50 51 51 51 51 51 51 51 51 52 51 51 51 50 49 49 49
2621 49 49 48 47 46 46 45 45 45 44 44 44 43 43 43 42 42 42 41 41 41 42 42 43 44 44 45 45 46 46 47 49 50 50 51 51 52 54 55 56 56 56 57 57 58 59 59 58 59 59 60 59 59 59 58 57 57 57 57 56 55 55 54 54 53 53 53 53 53 52 51
2614 51 51 51 51 51 50 50 50 49 49 49 49 49 49 48 48 48 48 48 48 47 47 47 47 47 47 47 47 47 47 47 47 47 47 48 48 48 48 48 48 48 48 48 48 48 49 49 49 49 49 49 49 50 50 49 48 48 48 49 49 49 48 48 48 48 47 47 47 47 47 47
2606 47 47 47 47 47 47 47 46 46 45 45 45 45 45 45 45 44 44 44 44 44 45 45 45 45 45 45 44 44 44 44 44 44 44 44 45 45 45 44 44 44 44 44 44 45 46 46 46 47 48 49 49 50 50 51 52 53 53 54 54 54 55 55 55 55 55 55 55 55 55 55
2599 55 54 54 53 53 53 53 52 52 51 51 50 50 50 49 49 49 49 49 48 47 47 46 47 47 48 48 48 48 48 48 47 47 47 47 47 47 47 48 48 48 48 48 48 48 48 48 48 48 49 49 48 47 48 49 48 48 47 48 48 48 48 48 48 48 48 48 48 47 46 47
2591 47 47 47 47 47 47 47 48 48 49 49 50 50 49 49 49 49 49 49 49 50 50 51 52 53 54 54 55 55 55 56 56 57 57 58 58 58 59 59 59 60 60 60 61 62 63 64 65 65 66 66 67 69 70 71 73 75 78 80 83 85 88 91 95 99 104 110 116 122 129 135
2584 135 143 151 159 166 173 179 186 193 199 205 209 213 217 219 221 223 224 224 221 218 213 207 200 192 184 176 166 157 148 138 129 119 111 104 96 90 84 80 77 73 71 69 67 65 63 62 61 59 59 58 57 57 56 55 54 54 54 53 53 53 53 52 52 52 51 51
2577E1%%%%%%jJ%j%%%%%%J%%%Jj%%%%j%%%%%%%%%%%%%%J%%%J%j%%%%j%jJ%Jj%j%J%%J%%j%
2570E0%%%%%%%%J%%j%JJ%j%%j%%jJ%%j%%%%%%%j%%%%J%%%%%%J%%j%%%%%%j%JJj%%%jJ%%%%
2562D9%%%J%%%%%%%%%jjJ%J%%%%%j%%%%%%J%%%%%%%%%%%%%jJ%%J%%%%j%j%JJJ%%%%j%%%%j
2555E0%j%%%%J%%%%%j%%%J%%%%%j%%%%%%J%%%%%J%%%jj%%%%JJ%j%jJjJ%j%%%%%J%%j%%%%%
2547D9Jj%j%%%%%%%%%JJ%J%%%%%j%j%%J%%J%j%j%%%%%Jj%%%%%%%Jj%%%%J%j%%jJ%%%%%j%J
2540D9%%%jJ%%%%%J%j%%%%J%%Jj%%%%%%%%J%%j%j%%%%%%JJ%%jj%J%jJ%%%%Jjj%%J%%%Jj%%
2532E0%J%%Jj%j%%j%%%%J%%%j%JJ%%jjj%J%J%%%%%%%%%%j%%%%%%%%%%%%%Jj%%%%J%%%%%%%
2525E0%%jj%J%J%j%%%J%%%%%%%%%%%%jJ%%%%%%%%%j%%%%%%j%J%%%%%J%j%%%Jj%%%j%J%J%J
$$ plain form
2577 51 51 51 51 51 51 51 50 51 51 50 50 50 50 50 50 50 51 51 51 51 52 51 51 51 51 51 50 50 50 50 50 50 50 50 50 50 50 50 50 50 50 51 51 51 51 52 52 51 51 51 51 51 50 50 49 50 50 51 50 50 49 49 50 50 50 51 51 51 50 50
2570 50 50 50 50 50 50 50 50 50 51 51 51 50 50 51 52 52 51 51 51 50 50 50 49 50 50 50 49 49 49 49 49 49 49 49 48 48 48 48 48 49 49 49 49 49 49 49 50 50 50 49 49 49 49 49 49 49 48 48 49 50 49 49 49 49 48 49 49 49 49 49
2562 49 49 49 49 50 50 50 50 50 50 50 50 50 50 49 48 49 49 50 50 50 50 50 50 49 49 49 49 49 49 49 50 50 50 50 50 50 50 50 50 50 50 50 50 50 49 50 50 50 51 51 51 51 51 50 50 49 49 50 51 52 52 52 52 52 51 51 51 51 51 50
2555 50 50 49 49 49 49 49 50 50 50 50 50 50 49 49 49 49 50 50 50 50 50 50 49 49 49 49 49 49 49 50 50 50 50 50 50 51 51 51 51 50 49 49 49 49 49 50 51 51 50 50 49 50 49 50 50 49 49 49 49 49 49 50 50 50 49 49 49 49 49 49
2547 49 50 49 49 48 48 48 48 48 48 48 48 48 48 49 50 50 51 51 51 51 51 51 50 50 49 49 49 50 50 50 51 51 50 50 49 49 49 49 49 49 50 49 49 49 49 49 49 49 49 50 49 49 49 49 49 50 50 49 49 49 48 49 49 49 49 49 49 48 48 49
2540 49 49 49 49 48 49 49 49 49 49 49 50 50 49 49 49 49 49 50 50 50 51 50 50 50 50 50 50 50 50 50 51 51 51 50 50 49 49 49 49 49 49 49 50 51 51 51 50 49 49 50 50 49 50 50 50 50 50 51 50 49 49 49 50 50 50 50 51 50 50 50
2532 50 50 51 51 51 52 51 51 50 50 50 49 49 49 49 49 50 50 50 50 49 49 50 51 51 51 50 49 48 48 49 49 50 50 50 50 50 50 50 50 50 50 50 49 49 49 49 49 49 49 49 49 49 49 49 49 49 50 49 49 49 49 49 50 50 50 50 50 50 50 50
2525 50 50 50 49 48 48 49 49 50 50 49 49 49 49 50 50 50 50 50 50 50 50 50 50 50 50 50 49 50 50 50 50 50 50 50 50 50 50 49 49 49 49 49 49 49 48 48 49 49 49 49 49 49 50 50 49 49 49 49 50 49 49 49 49 48 48 49 49 50 50 51
2518E1%%Jj%jjjJ%J%%j%%%%%%%%J%J%%j%J%%%jj%%%%%%%%%%%J%jJ%J%%j%%%j%%J%J%%j%%%
2510E0%%%%%%%%%%%%%%Jj%%jJ%%%%%%%%%%%%%%jjJ%J%J%%%%j%%jJ%%J%%jj%jJ%J%%%%Jj%%
2503E0%%J%Jj%%jj%J%%%%%%%%J%j%j%%%%%%J%%%j%%jJJJ%J%j%%%%%j%%J%%%jJ%%%%%%%%%j
2495E0%%%%Jj%%%J%%Jj%%j%%%%%J%%J%%%j%%%%%%%%j%%%%%%%%%%j%%J%%%%%j%%J%%%%j%JJ
2488E1%%%%j%%%%J%Jj%j%%jJ%%j%%J%J%j%%Jj%j%%%%%%%%%%%%%%%%j%J%%%Jj%%J%%%%%%%%
2481E0jJ%%%%%%%jJ%j%%%J%Jj%%j%%JJ%%jj%J%%%%%%%%%%%%j%J%%%%%%%%J%%%j%jJ%%J%%%
2473E1j%J%%%%%%%%J%j%j%%j%%%JJ%%%%%%%%Jj%%%j%J%%J%%j%j%%%JJ%jjj%J%%%%%j%J%Jj
2466E0%%J%%j%j%%JJ%%j%%%%%%%%JJ%j%%%j%j%J%%%%%%%%%%%Jj%%%JJjj%%%%%J%%J%j%Jj%
$$ plain form
2518 51 51 51 52 51 51 50 49 48 49 49 50 50 50 49 49 49 49 49 49 49 49 49 50 50 51 51 51 50 50 51 51 51 51 50 49 49 49 49 49 49 49 49 49 49 49 49 50 50 49 50 50 51 51 51 50 50 50 50 49 49 49 50 50 51 51 51 50 50 50 50
2510 50 50 50 50 50 50 50 50 50 50 50 50 50 50 50 51 50 50 50 49 50 50 50 50 50 50 50 50 50 50 50 50 50 50 50 49 48 49 49 50 50 51 51 51 51 51 50 50 50 49 50 50 50 51 51 51 50 49 49 48 49 49 50 50 50 50 50 51 50 50 50
2503 50 50 50 51 51 52 51 51 51 50 49 49 50 50 50 50 50 50 50 50 50 51 51 50 50 49 49 49 49 49 49 49 50 50 50 50 49 49 49 48 49 50 51 51 52 52 51 51 51 51 51 51 50 50 50 51 51 51 51 50 51 51 51 51 51 51 51 51 51 51 50
2495 50 50 50 50 50 51 50 50 50 50 51 51 51 52 51 51 51 50 50 50 50 50 50 51 51 51 52 52 52 52 51 51 51 51 51 51 51 51 51 50 50 50 50 50 50 50 50 50 50 50 49 49 49 50 50 50 50 50 50 49 49 49 50 50 50 50 50 49 49 50 51
2488 51 51 51 51 51 50 50 50 50 50 51 51 52 51 51 50 50 50 49 50 50 50 49 49 49 50 50 51 51 50 50 50 51 50 50 49 49 49 49 49 49 49 49 49 49 49 49 49 49 49 49 49 48 48 49 49 49 49 50 49 49 49 50 50 50 50 50 50 50 50 50
2481 50 49 50 50 50 50 50 50 50 50 49 50 50 49 49 49 49 50 50 51 50 50 50 49 49 49 50 51 51 51 50 49 49 50 50 50 50 50 50 50 50 50 50 50 50 50 49 49 50 50 50 50 50 50 50 50 50 51 51 51 51 50 50 49 50 50 50 51 51 51 51
2473 51 50 50 51 51 51 51 51 51 51 51 51 52 52 51 51 50 50 50 49 49 49 49 50 51 51 51 51 51 51 51 51 51 52 51 51 51 51 50 50 51 51 51 52 52 52 51 51 50 50 50 50 51 52 52 51 50 49 49 50 50 50 50 50 50 49 49 50 50 51 50
2466 50 50 50 51 51 51 50 50 49 49 49 50 51 51 51 50 50 50 50 50 50 50 50 50 51 52 52 51 51 51 51 50 50 49 49 50 50 50 50 50 50 50 50 50 50 50 50 51 50 50 50 50 51 52 51 50 50 50 50 50 50 51 51 51 52 52 51 51 52 51 51
2458E1J%%%%%%%j%%%J%%jjJ%%%%J%%%%%j%%%%%j%JJJ%%j%j%j%%%%%%%%%%jJ%J%j%%J%%j%J
2451E1j%J%Jj%%%J%%%%%%%%%j%%%j%j%%J%J%J%%%%%j%%%%j%J%%%%%J%%J%%%j%%J%j%%J%%J
2443E4%%%%%%j%Jj%%%%j%%%j%%%J%%%%j%%%%J%j%%%%%%j%%%j%%%%J%J%%j%%J%j%%J%%%%%%
2436E1%%%%j%%%%%%J%jJ%%%J%%%%%j%%j%%jJ%JJ%%%j%j%%%%%%j%JJ%jj%%%%J%%%%%%Jj%j%
2429D9%%%%%J%%%%%%j%J%%%j%%%%%%%J%%j%J%%%%%%%%%%J%j%%%jJ%J%%%%%%%%%j%j%%J%%%
2421E0%%%%J%j%J%%%%%Jjjj%J%%Jj%%%%%%jJJ%%%%%%%%%%%j%%%%j%J%j%%%JJ%%%%jjj%JJj
2414D9%%%J%J%j%%%%%%%%j%%J%%%%%%%j%%%J%%%J%%j%j%j%J%j%K%J%j%%%%%J%%j%j%%j%%%
2406D8J%j%%j%jJ%%%j%JJJ%%%%%%jjJJ%%%%%%%%%%%%%%%%%%%%%%%jJ%%%%%j%J%J%%J%%j%%
$$ plain form
2458 51 52 52 52 52 52 52 52 52 51 51 51 51 52 52 52 51 50 51 51 51 51 51 52 52 52 52 52 52 51 51 51 51 51 51 50 50 51 52 53 53 53 52 52 51 51 50 50 50 50 50 50 50 50 50 50 50 49 50 50 51 51 50 50 50 51 51 51 50 50 51
2451 51 50 50 51 51 52 51 51 51 51 52 52 52 52 52 52 52 52 52 52 51 51 51 51 50 50 49 49 49 50 50 51 51 52 52 52 52 52 52 51 51 51 51 51 50 50 51 51 51 51 51 51 52 52 52 53 53 53 53 52 52 52 53 53 52 52 52 53 53 53 54
2443 54 54 54 54 54 54 54 53 53 54 53 53 53 53 53 52 52 52 52 51 51 51 51 52 52 52 52 52 51 51 51 51 51 52 52 51 51 51 51 51 51 51 50 50 50 50 49 49 49 49 49 50 50 51 51 51 50 50 50 51 51 50 50 50 51 51 51 51 51 51 51
2436 51 51 51 51 51 50 50 50 50 50 50 50 51 51 50 51 51 51 51 52 52 52 52 52 52 51 51 51 50 50 50 49 50 50 51 52 52 52 52 51 51 50 50 50 50 50 50 50 49 49 50 51 51 50 49 49 49 49 49 50 50 50 50 50 50 50 51 50 50 49 49
2429 49 49 49 49 49 49 50 50 50 50 50 50 50 49 49 50 50 50 50 49 49 49 49 49 49 49 49 50 50 50 49 49 50 50 50 50 50 50 50 50 50 50 50 51 51 50 50 50 50 49 50 50 51 51 51 51 51 51 51 51 51 51 50 50 49 49 49 50 50 50 50
2421 50 50 50 50 50 51 51 50 50 51 51 51 51 51 51 52 51 50 49 49 50 50 50 51 50 50 50 50 50 50 50 49 50 51 51 51 51 51 51 51 51 51 51 51 51 50 50 50 50 50 49 49 50 50 49 49 49 49 50 51 51 51 51 51 50 49 48 48 49 50 49
2414 49 49 49 49 50 50 51 51 50 50 50 50 50 50 50 50 50 49 49 49 50 50 50 50 50 50 50 50 49 49 49 49 50 50 50 50 51 51 51 50 50 49 49 48 48 49 49 48 48 50 50 51 51 50 50 50 50 50 50 51 51 51 50 50 49 49 49 48 48 48 48
2406 48 49 49 48 48 48 47 47 46 47 47 47 47 46 46 47 48 49 49 49 49 49 49 49 48 47 48 49 49 49 49 49 49 49 49 49 49 49 49 49 49 49 49 49 49 49 49 49 49 49 49 48 49 49 49 49 49 49 48 48 49 49 50 50 50 51 51 51 50 50 50
2399E0%%J%%Jj%%%%%%%J%%%%%%J%%%jj%%%%%%J%%j%%%%J%j%%%J%%%%J%j%%j%%%J%%jj%%jJ
2392E0%%J%jJ%%%%%%j%jJ%J%%J%%%%%%%%j%%J%%%%%%%%j%J%%%j%J%%%%%%J%j%j%%J%%%%j%
2384E1%%%%%%%J%%%j%%Jj%%J%jj%%J%%%%%%%%%J%%j%%%%Jj%%%%%%%%%%%%%%%jj%Jj%J%%%%
2377E0%%%%%%%%J%%%%J%%j%%%%J%j%%j%%%%%J%J%j%%%%%%J%%j%%%%%jj%%JJ%Jj%%J%%j%%%
2369E1jJ%%%J%j%%%J%%Jjj%j%jJ%J%%%%J%%%%%%%j%%%%%J%%%%j%%%%%%%%J%j%%%%%%%%%%j
2362E0%%%%jJJ%%%%%%%%%j%%%j%%%%%J%%J%%%%%j%%j%JJJ%j%%%%%jJ%%%%%%j%%J%%j%j%JJ
2354E1j%%Jj%%%%%%J%jJ%%%%J%jj%j%%%%J%J%J%%j%%%j%%%%%%%%%J%%%%J%%j%%%%%%%%%%%
2347E1%%%%j%%%%%%JJj%j%%%jJ%%%%%%J%%%%%%%%%%%%%%j%%j%J%JJjj%j%J%Jj%%%%%%%%%j
$$ plain form
2399 50 50 50 51 51 51 52 51 51 51 51 51 51 51 51 52 52 52 52 52 52 52 53 53 53 53 52 51 51 51 51 51 51 51 52 52 52 51 51 51 51 51 52 52 51 51 51 51 52 52 52 52 52 53 53 52 52 52 51 51 51 51 52 52 52 51 50 50 50 49 50
2392 50 50 50 51 51 50 51 51 51 51 51 51 51 50 50 49 50 50 51 51 51 52 52 52 52 52 52 52 52 52 51 51 51 52 52 52 52 52 52 52 52 52 51 51 52 52 52 52 51 51 52 52 52 52 52 52 52 53 53 52 52 51 51 51 52 52 52 52 52 51 51
2384 51 51 51 51 51 51 51 51 52 52 52 52 51 51 51 52 51 51 51 52 52 51 50 50 50 51 51 51 51 51 51 51 51 51 51 52 52 52 51 51 51 51 51 52 51 51 51 51 51 51 51 51 51 51 51 51 51 51 51 51 50 49 49 50 49 49 50 50 50 50 50
2377 50 50 50 50 50 50 50 50 50 51 51 51 51 51 52 52 52 51 51 51 51 51 52 52 51 51 51 50 50 50 50 50 50 51 51 52 52 51 51 51 51 51 51 51 52 52 52 51 51 51 51 51 51 50 49 49 49 50 51 51 52 51 51 51 52 52 52 51 51 51 51
2369 51 50 51 51 51 51 52 52 51 51 51 51 52 52 52 53 52 51 51 50 50 49 50 50 51 51 51 51 51 52 52 52 52 52 52 52 52 51 51 51 51 51 51 52 52 52 52 52 51 51 51 51 51 51 51 51 51 52 52 51 51 51 51 51 51 51 51 51 51 51 50
2362 50 50 50 50 50 49 50 51 51 51 51 51 51 51 51 51 51 50 50 50 50 49 49 49 49 49 49 50 50 50 51 51 51 51 51 51 50 50 50 49 49 50 51 52 52 51 51 51 51 51 51 50 51 51 51 51 51 51 51 50 50 50 51 51 51 50 50 49 49 50 51
2354 51 50 50 50 51 50 50 50 50 50 50 50 51 51 50 51 51 51 51 51 52 52 51 50 50 49 49 49 49 49 50 50 51 51 52 52 52 51 51 51 51 50 50 50 50 50 50 50 50 50 50 51 51 51 51 51 52 52 52 51 51 51 51 51 51 51 51 51 51 51 51
2347 51 51 51 51 51 50 50 50 50 50 50 50 51 52 51 51 50 50 50 50 49 50 50 50 50 50 50 50 51 51 51 51 51 51 51 51 51 51 51 51 51 51 51 50 50 50 49 49 50 50 51 52 51 50 50 49 49 50 50 51 50 50 50 50 50 50 50 50 50 50 49
2340D9JJjj%JJ%%j%%J%%J%j%%j%%%%%%%%%%%%%%J%j%%%%%%J%%%jj%%J%%J%%%j%%j%%%%%J%
2332E0%J%%%%j%%%%J%%%%%J%%%%%%j%%%J%%%j%%j%%J%j%J%%j%jj%%J%J%%Jj%jJ%%j%J%%%%
2325E0J%j%%J%%%j%Jj%%%%%%%%J%%%j%%%J%%%j%%%JJ%%%%j%j%J%%%%j%%J%j%%%%%%%%J%%%
2317E1%%Jj%%j%%j%%Jj%%%%%J%%jJ%%j%%%%%%%%%%%%Jj%Jj%%%%%J%%%jj%J%%%%j%J%Jj%%%
2310D9%%J%j%%%%J%%j%%J%%%%%j%%j%%%Jj%%%%%J%%j%J%%%%%%%%%j%%%%%%Jj%j%J%%%%J%%
2302D9%J%j%j%%%%Jj%J%%%%%%%%%%j%%%%jj%%JJJ%%%j%jJ%J%%j%%JJj%%%J%%%%J%j%%%j%%
2295D9J%%%%%Jj%%%%%j%j%%%%J%j%%%JJ%%%j%%%j%JJ%%%J%%J%%%jJ%j%%%%%jJJ%%Jj%%%%%
2288E2j%%%%%J%jJ%%j%%%%%%%Jj%%%%%%%%%%j%%JJj%%%j%%%%%%%%%j%%%%%%%J%%jj%J%J%%
$$ plain form
2340 49 50 51 50 49 49 50 51 51 51 50 50 50 51 51 51 52 52 51 51 51 50 50 50 50 50 50 50 50 50 50 50 50 50 50 50 51 51 50 50 50 50 50 50 50 51 51 51 51 50 49 49 49 50 50 50 51 51 51 51 50 50 50 49 49 49 49 49 49 50 50
2332 50 50 51 51 51 51 51 50 50 50 50 50 51 51 51 51 51 51 52 52 52 52 52 52 52 51 51 51 51 52 52 52 52 51 51 51 50 50 50 51 51 50 50 51 51 51 50 50 49 48 48 48 49 49 50 50 50 51 50 50 49 50 50 50 49 49 50 50 50 50 50
2325 50 51 51 50 50 50 51 51 51 51 50 50 51 50 50 50 50 50 50 50 50 50 51 51 51 51 50 50 50 50 51 51 51 51 50 50 50 50 51 52 52 52 52 52 51 51 50 50 51 51 51 51 51 50 50 50 51 51 50 50 50 50 50 50 50 50 50 51 51 51 51
2317 51 51 51 52 51 51 51 50 50 50 49 49 49 50 49 49 49 49 49 49 50 50 50 49 50 50 50 49 49 49 49 49 49 49 49 49 49 49 49 49 50 49 49 50 49 49 49 49 49 49 50 50 50 50 49 48 48 49 49 49 49 49 48 48 49 49 50 49 49 49 49
2310 49 49 49 50 50 49 49 49 49 49 50 50 50 49 49 49 50 50 50 50 50 50 49 49 49 48 48 48 48 49 48 48 48 48 48 48 49 49 49 48 48 49 49 49 49 49 49 49 49 49 49 48 48 48 48 48 48 48 49 48 48 47 47 48 48 48 48 48 49 49 49
2302 49 49 50 50 49 49 48 48 48 48 48 49 48 48 49 49 49 49 49 49 49 49 49 49 49 48 48 48 48 48 47 46 46 46 47 48 49 49 49 49 48 48 47 48 48 49 49 49 48 48 48 49 50 49 49 49 49 50 50 50 50 50 51 51 50 50 50 50 49 49 49
2295 49 50 50 50 50 50 50 51 50 50 50 50 50 50 49 49 48 48 48 48 48 49 49 48 48 48 48 49 50 50 50 50 49 49 49 49 48 48 49 50 50 50 50 51 51 51 52 52 52 52 51 52 52 51 51 51 51 51 51 50 51 52 52 52 53 52 52 52 52 52 52
2288 52 51 51 51 51 51 51 52 52 51 52 52 52 51 51 51 51 51 51 51 51 52 51 51 51 51 51 51 51 51 51 51 51 50 50 50 51 52 51 51 51 51 50 50 50 50 50 50 50 50 50 50 49 49 49 49 49 49 49 49 50 50 50 49 48 48 49 49 50 50 50
2280E0J%%%%%jj%J%%Jj%%JJ%jj%j%J%%%%j%%%%%J%J%j%j%%%%J%j%%%%J%%%%%%%%%j%%%%%%
2273D9%J%%j%%j%J%JJ%jj%%%%%J%%J%%%%jj%%%J%%%%%%%%%%%%%j%%%%%%%%%%%%j%%JJ%%%%
2265E0%J%j%j%J%%%%%J%j%%%%j%%%%%%%%%%%jJJJjj%%%Jj%J%%%%%%%J%%%%%%%%%%jj%JJ%%
2258E1%%%%j%%%%%%%%J%%JJjj%%jJ%%%j%Jj%%%%JJj%j%%J%%%%%Jj%%%%%%%%%%j%%%%%%j%%
2251D9%%%JJ%jj%%%JJJ%%j%j%%%%J%%%%%%%j%%J%%jj%%%J%%j%jJ%J%%J%j%J%%j%j%j%%JJ%
2243E0j%%%j%%jJJ%j%JJ%%jj%%JJ%Jj%%jjJ%%J%%jj%%%%jJ%%jj%%J%J%%jJ%J%%j%jj%J%J%
2236D8%%%%jJ%%J%%%%%j%j%JJj%%%%%J%%%JJ%j%j%J%J%%%%%%%%%JJ%%j%%%%%%%%JJJ%J%J%
2228E7JJ%JJJJJJj%%%%J%%jjjjjjjjjj%jj%jj%J%%j%%J%%J%%%%%j%j%Jjj%%J%%%%%%J%%%j
$$ plain form
2280 50 51 51 51 51 51 51 50 49 49 50 50 50 51 50 50 50 51 52 52 51 50 50 49 49 50 50 50 50 50 49 49 49 49 49 49 50 50 51 51 50 50 49 49 49 49 49 50 50 49 49 49 49 49 50 50 50 50 50 50 50 50 50 50 49 49 49 49 49 49 49
2273 49 49 50 50 50 49 49 49 48 48 49 49 50 51 51 50 49 49 49 49 49 49 50 50 50 51 51 51 51 51 50 49 49 49 49 50 50 50 50 50 50 50 50 50 50 50 50 50 50 49 49 49 49 49 49 49 49 49 49 49 49 49 48 48 48 49 50 50 50 50 50
2265 50 50 51 51 50 50 49 49 50 50 50 50 50 50 51 51 50 50 50 50 50 49 49 49 49 49 49 49 49 49 49 49 49 48 49 50 51 50 49 49 49 49 50 49 49 50 50 50 50 50 50 50 50 51 51 51 51 51 51 51 51 51 51 51 50 49 49 50 51 51 51
2258 51 51 51 51 51 50 50 50 50 50 50 50 50 50 51 51 51 52 53 52 51 51 51 50 51 51 51 51 50 50 51 50 50 50 50 50 51 52 51 51 50 50 50 51 51 51 51 51 51 52 51 51 51 51 51 51 51 51 51 51 51 50 50 50 50 50 50 50 49 49 49
2251 49 49 49 49 50 51 51 50 49 49 49 49 50 51 52 52 52 51 51 50 50 50 50 50 51 51 51 51 51 51 51 51 50 50 50 51 51 51 50 49 49 49 49 50 50 50 49 49 48 49 49 50 50 50 51 51 50 50 51 51 51 50 50 49 49 48 48 48 49 50 50
2243 50 49 49 49 49 48 48 48 47 48 49 49 48 48 49 50 50 50 49 48 48 48 49 50 50 51 50 50 50 49 48 49 49 49 50 50 50 49 48 48 48 48 48 47 48 48 48 47 46 46 46 47 47 48 48 48 47 48 48 49 49 49 48 48 47 46 46 47 47 48 48
2236 48 48 48 48 48 47 48 48 48 49 49 49 49 49 49 48 48 47 47 48 49 48 48 48 48 48 48 49 49 49 49 50 51 51 50 50 49 49 50 50 51 51 51 51 51 51 51 51 51 51 52 53 53 53 52 52 52 52 52 52 52 52 52 53 54 55 55 56 56 57 57
2228 57 58 59 59 60 61 62 63 64 65 64 64 64 64 64 65 65 65 64 63 62 61 60 59 58 57 56 55 55 54 53 53 52 51 51 52 52 52 51 51 51 52 52 52 53 53 53 53 53 53 52 52 51 51 52 51 50 50 50 51 51 51 51 51 51 51 52 52 52 52 51
2221E1J%%%%%%%%%%%%%j%J%J%j%%%j%%%J%%%%%%%%%%j%%%%J%%%j%%%j%%Jj%%%%%%%%%%%J%
2213E1%%J%%%%Jj%jj%J%%%%jJ%%%%%%%j%%j%%%%J%%%%J%j%JJ%%j%j%%%%%%%%%J%%%%%%%%%
2206E1%%%j%J%%%%%%%%%%%%%J%j%%%jJJ%%%j%%jJJ%%jjJ%%%%%%%%%%%%j%%%J%%%%%%JjJ%j
2199E1%j%J%%%%J%jjJ%%j%%jJ%%%J%%j%%%%%%%%J%%J%%%%%%%j%j%%%J%%j%J%%%j%%Jj%J%%
2191E1j%%%%%%%%J%j%%%%j%%jJ%%J%%j%J%%J%Jj%%j%j%J%%%%%J%%j%%j%jJ%%%%%%%%%%J%%
2184E0%%%%%%%%%J%%j%%%%%%jJJ%j%%%%j%j%%JJj%j%%%J%%j%%J%%%jjJ%%JJ%%%%%%j%%%%%
2176D9%%j%%JJ%%j%%J%%%%%%%JJ%%j%%%J%jJ%j%%%%%j%%%%%%%%%%%%Jj%%%%j%%J%Jj%J%j%
2169E0%%%j%%%J%%%%%j%%%%%J%j%%j%J%J%%%%Jj%%%%%%%%%J%%%%j%%%%%%J%%j%%%j%%%%%%
$$ plain form
2221 51 52 52 52 52 52 52 52 52 52 52 52 52 52 52 51 51 52 52 53 53 52 52 52 52 51 51 51 51 52 52 52 52 52 52 52 52 52 52 52 51 51 51 51 51 52 52 52 52 51 51 51 51 50 50 50 51 50 50 50 50 50 50 50 50 50 50 50 50 51 51
2213 51 51 51 52 52 52 52 52 53 52 52 51 50 50 51 51 51 51 51 50 51 51 51 51 51 51 51 51 50 50 50 49 49 49 49 49 50 50 50 50 50 51 51 50 50 51 52 52 52 51 51 50 50 50 50 50 50 50 50 50 50 51 51 51 51 51 51 51 51 51 51
2206 51 51 51 51 50 50 51 51 51 51 51 51 51 51 51 51 51 51 51 51 52 52 51 51 51 51 50 51 52 52 52 52 51 51 51 50 51 52 52 52 51 50 51 51 51 51 51 51 51 51 51 51 51 51 51 50 50 50 50 51 51 51 51 51 51 51 52 51 52 52 51
2199 51 51 50 50 51 51 51 51 51 52 52 51 50 51 51 51 50 50 50 49 50 50 50 50 51 51 51 50 50 50 50 50 50 50 50 50 51 51 51 52 52 52 52 52 52 52 52 51 51 50 50 50 50 51 51 51 50 50 51 51 51 51 50 50 50 51 50 50 51 51 51
2191 51 50 50 50 50 50 50 50 50 50 51 51 50 50 50 50 50 49 49 49 48 49 49 49 50 50 50 49 49 50 50 50 51 51 52 51 51 51 50 50 49 49 50 50 50 50 50 50 51 51 51 50 50 50 49 49 48 49 49 49 49 49 49 49 49 49 49 49 50 50 50
2184 50 50 50 50 50 50 50 50 50 50 51 51 51 50 50 50 50 50 50 50 49 50 51 51 50 50 50 50 50 49 49 48 48 48 49 50 49 49 48 48 48 48 49 49 49 48 48 48 49 49 49 49 48 47 48 48 48 49 50 50 50 50 50 50 50 49 49 49 49 49 49
2176 49 49 49 48 48 48 49 50 50 50 49 49 49 50 50 50 50 50 50 50 50 51 52 52 52 51 51 51 51 52 52 51 52 52 51 51 51 51 51 51 50 50 50 50 50 50 50 50 50 50 50 50 50 51 50 50 50 50 50 49 49 49 50 50 51 50 50 51 51 50 50
2169 50 50 50 50 49 49 49 49 50 50 50 50 50 50 49 49 49 49 49 49 50 50 49 49 49 48 48 49 49 50 50 50 50 50 51 50 50 50 50 50 50 50 50 50 50 51 51 51 51 51 50 50 50 50 50 50 50 51 51 51 50 50 50 50 49 49 49 49 49 49 49
2162D9%J%%%%Jj%%%%%J%%%%%%%j%%J%%%%%%j%j%%J%%%%%%%%%%%j%%%%J%%%%%j%%%JJ%%j%%
2154E0%j%%J%J%%%%j%j%%jJ%%J%%%%%%%j%%J%%%jjJJ%%%%%k%%%J%%%%%%%J%%%%j%J%J%%%%
2147E1j%%%%%%%J%%%%j%%%J%%j%%%%%jj%%%%J%%J%%JjjJ%%j%%j%J%%J%J%%%jj%%%%%%j%%J
2139D9%j%J%J%%%%J%j%j%%%j%%J%%%%%%JJ%%j%%Jj%%%jJ%%%%%j%%%%%J%%%%%%%%j%%%%%JJ
2132E1%j%%%%%jJ%%%jJ%%%JJ%%jj%%%%%%%%%%%Jj%%Jj%%%%%J%%%j%%%j%%%%%%%%j%JJ%%%%
2124E0%%%%%%%%%%%%j%%%%%%%%%%%%%%J%%j%%%%%%j%JJ%j%jJ%%J%Jj%j%%%J%%%%%%j%%%%%
2117D9%%%%%jJ%J%j%JJ%j%%J%%%j%%Jj%J%jJ%j%%%%%J%%j%%%%%%%%J%j%j%%jJ%%%j%JJ%%%
2110E0%J%%%j%%%%%%%%%%jJ%%%%j%%%j%J%J%%%%J%%j%j%j%%%J%%%Jj%%%%J%%%%%J%%%%j%%
$$ plain form
2162 49 49 50 50 50 50 50 51 50 50 50 50 50 50 51 51 51 51 51 51 51 51 50 50 50 51 51 51 51 51 51 51 50 50 49 49 49 50 50 50 50 50 50 50 50 50 50 50 50 49 49 49 49 49 50 50 50 50 50 50 49 49 49 49 50 51 51 51 50 50 50
2154 50 50 49 49 49 50 50 51 51 51 51 51 50 50 49 49 49 48 49 49 49 50 50 50 50 50 50 50 50 49 49 49 50 50 50 50 49 48 49 50 50 50 50 50 50 48 48 48 48 49 49 49 49 49 49 49 49 50 50 50 50 50 49 49 50 50 51 51 51 51 51
2147 51 50 50 50 50 50 50 50 50 51 51 51 51 51 50 50 50 50 51 51 51 50 50 50 50 50 50 49 48 48 48 48 48 49 49 49 50 50 50 51 50 49 50 50 50 49 49 49 48 48 49 49 49 50 50 51 51 51 51 50 49 49 49 49 49 49 49 48 48 48 49
2139 49 49 48 48 49 49 50 50 50 50 50 51 51 50 50 49 49 49 49 48 48 48 49 49 49 49 49 49 49 50 51 51 51 50 50 50 51 50 50 50 50 49 50 50 50 50 50 50 49 49 49 49 49 49 50 50 50 50 50 50 50 50 50 49 49 49 49 49 49 50 51
2132 51 51 50 50 50 50 50 50 49 50 50 50 50 49 50 50 50 50 51 52 52 52 51 50 50 50 50 50 50 50 50 50 50 50 50 51 50 50 50 51 50 50 50 50 50 50 51 51 51 51 50 50 50 50 49 49 49 49 49 49 49 49 49 48 48 49 50 50 50 50 50
2124 50 50 50 50 50 50 50 50 50 50 50 50 50 49 49 49 49 49 49 49 49 49 49 49 49 49 49 49 50 50 50 49 49 49 49 49 49 49 48 48 49 50 50 49 49 48 49 49 49 50 50 51 50 50 49 49 49 49 50 50 50 50 50 50 50 49 49 49 49 49 49
2117 49 49 49 49 49 49 48 49 49 50 50 49 49 50 51 51 50 50 50 51 51 51 51 50 50 50 51 50 50 51 51 50 51 51 50 50 50 50 50 50 51 51 51 50 50 50 50 50 50 50 50 50 51 51 50 50 49 49 49 48 49 49 49 49 48 48 49 50 50 50 50
2110 50 50 51 51 51 51 50 50 50 50 50 50 50 50 50 50 50 49 50 50 50 50 50 49 49 49 49 48 48 49 49 50 50 50 50 50 51 51 51 50 50 49 49 48 48 48 48 49 49 49 49 50 49 49 49 49 49 50 50 50 50 50 50 51 51 51 51 51 50 50 50
2102E0j%%%jJ%j%JJ%jj%jJ%J%Jjjj%JJ%%J%j%%J%%%J%%%J%%%j%jJ%%jJ%%%%%j%%%%j%%%JJ
2095E1%%%%%%j%%j%%%%%%%%%%%%J%%%%%j%%jK%%%%%jJ%%%%%jJJ%%j%j%%%J%%%j%J%Jj%%j%
2087D9%J%%%%%%J%J%jjj%J%%JJ%kjj%j%J%J%%J%%%jJJ%%%%%%j%%jJ%%J%j%%j%%%%%%%%%%J
2080E0%J%%j%jJ%%j%%%%%%j%J%%J%%%%%%J%%%%j%%%%J%jj%%%%J%J%%J%%j%%%j%j%JJ%jjJ%
2073E0%J%j%j%%%%J%%%j%jJ%J%%J%j%%%%%%%j%%%%%%%%%%%%%%J%%%%Jj%%J%%%%%%%%%%%%%
2065E1%j%%%j%%%%%J%Jj%%%%%%Jj%%%jJ%%%%%j%%%%%JJ%%j%jJ%j%%%J%%J%%%j%%%j%%j%J%
2058D9%%%%%%JJ%j%%%J%%J%%%%j%j%%%jj%%KJJj%%%%%%%%%%%%%%%j%%%J%%%%jj%%%%%JJJj
2050E1j%%%%%J%jj%%J%J%%%%%J%%%j%%%j%j%%Jjj%J%%J%%%j%j%%J%JJj%%jj%J%%%%%%J%%%
$$ plain form
2102 50 49 49 49 49 48 49 49 48 48 49 50 50 49 48 48 47 48 48 49 49 50 49 48 47 47 48 49 49 49 50 50 49 49 49 50 50 50 50 51 51 51 51 52 52 52 52 51 51 50 51 51 51 50 51 51 51 51 51 51 50 50 50 50 50 49 49 49 49 50 51
2095 51 51 51 51 51 51 51 50 50 50 49 49 49 49 49 49 49 49 49 49 49 49 49 50 50 50 50 50 50 49 49 49 48 50 50 50 50 50 50 49 50 50 50 50 50 50 49 50 51 51 51 50 50 49 49 49 49 50 50 50 50 49 49 50 50 51 50 50 50 49 49
2087 49 49 50 50 50 50 50 50 50 51 51 52 52 51 50 49 49 50 50 50 51 52 52 50 49 48 48 47 47 48 48 49 49 49 50 50 50 50 49 50 51 51 51 51 51 51 51 50 50 50 49 50 50 50 51 51 50 50 50 49 49 49 49 49 49 49 49 49 49 49 50
2080 50 50 51 51 51 50 50 49 50 50 50 49 49 49 49 49 49 49 48 48 49 49 49 50 50 50 50 50 50 50 51 51 51 51 51 50 50 50 50 50 51 51 50 49 49 49 49 49 50 50 51 51 51 52 52 52 51 51 51 51 50 50 49 49 50 51 51 50 49 50 50
2073 50 50 51 51 50 50 49 49 49 49 49 50 50 50 50 49 49 48 49 49 50 50 50 51 51 50 50 50 50 50 50 50 50 49 49 49 49 49 49 49 49 49 49 49 49 49 49 49 50 50 50 50 50 51 50 50 50 51 51 51 51 51 51 51 51 51 51 51 51 51 51
2065 51 51 50 50 50 50 49 49 49 49 49 49 50 50 51 50 50 50 50 50 50 50 51 50 50 50 50 49 50 50 50 50 50 50 49 49 49 49 49 49 50 51 51 51 50 50 49 50 50 49 49 49 49 50 50 50 51 51 51 51 50 50 50 50 49 49 49 48 48 49 49
2058 49 49 49 49 49 49 49 50 51 51 50 50 50 50 51 51 51 52 52 52 52 52 51 51 50 50 50 50 49 48 48 48 50 51 52 51 51 51 51 51 51 51 51 51 51 51 51 51 51 51 51 50 50 50 50 51 51 51 51 51 50 49 49 49 49 49 49 50 51 52 51
2050 51 50 50 50 50 50 50 51 51 50 49 49 49 50 50 51 51 51 51 51 51 52 52 52 52 51 51 51 51 50 50 49 49 49 50 49 48 48 49 49 49 50 50 50 50 49 49 48 48 48 49 49 50 51 50 50 50 49 48 48 49 49 49 49 49 49 49 50 50 50 50
2043E0j%j%J%%%j%%J%%%%%%jj%%J%%J%%j%jJ%J%J%JJj%%%%%%%%%j%j%j%%%J%%J%%%j%%%%%
2035D9%jJ%J%%j%%JJ%%%jj%jJ%J%%%%%j%%J%%%%j%%%J%J%%%j%%%%%%%%%%%%%%%%j%%%%%%j
2028D8J%%%J%%%j%j%J%%%%%%%%%%%%%%%%%%J%%%%j%%JJ%%j%%%%jJ%%%j%%%%%%%J%Jjj%%%%
2021D9J%%%%j%%%%%%J%%%%%jj%%%J%jJ%%%J%%jJ%%%%%%%%j%Jjj%%%%J%%%%J%%%%%%%%%%%j
2013D9%%%J%%%J%%j%%%%%%%%J%j%j%j%%%%%JJ%J%j%j%j%J%%%%j%%J%%J%%%%%%%%%%jj%j%J
2006D8J%%%%%%%%%%%%%jJJ%j%j%J%%%J%%%%%JJjjj%jJJ%%j%%%%%%%%%j%%%%%%%J%%%%%%%%
1998D9J%%%%%%%%j%%%%%%%%J%j%%%%%%%%%j%%%J%%%J%%%j%%%%J%%%%jj%%%J%%%%%%%Jj%j%
1991D8%j%%J%J%Jj%j%%%%%%J%J%j%%J%jjJ%%%%%%j%%%J%%%Jj%%j%%%%%%J%%J%%%j%%%%%Jj
$$ plain form
2043 50 49 49 48 48 49 49 49 49 48 48 48 49 49 49 49 49 49 49 48 47 47 47 48 48 48 49 49 49 48 48 47 48 48 49 49 50 50 51 52 51 51 51 51 51 51 51 51 51 51 50 50 49 49 48 48 48 48 49 49 49 50 50 50 50 49 49 49 49 49 49
2035 49 49 48 49 49 50 50 50 49 49 49 50 51 51 51 51 50 49 49 48 49 49 50 50 50 50 50 50 49 49 49 50 50 50 50 50 49 49 49 49 50 50 51 51 51 51 50 50 50 50 50 50 50 50 50 50 50 50 50 50 50 50 50 49 49 49 49 49 49 49 48
2028 48 49 49 49 49 50 50 50 50 49 49 48 48 49 49 49 49 49 49 49 49 49 49 49 49 49 49 49 49 49 49 49 50 50 50 50 50 49 49 49 50 51 51 51 50 50 50 50 50 49 50 50 50 50 49 49 49 49 49 49 49 49 50 50 51 50 49 49 49 49 49
2021 49 50 50 50 50 50 49 49 49 49 49 49 49 50 50 50 50 50 50 49 48 48 48 48 49 49 48 49 49 49 49 50 50 50 49 50 50 50 50 50 50 50 50 50 49 49 50 49 48 48 48 48 48 49 49 49 49 49 50 50 50 50 50 50 50 50 50 50 50 50 49
2013 49 49 49 49 50 50 50 50 51 51 51 50 50 50 50 50 50 50 50 50 51 51 50 50 49 49 48 48 48 48 48 48 49 50 50 51 51 50 50 49 49 48 48 49 49 49 49 49 48 48 48 49 49 49 50 50 50 50 50 50 50 50 50 50 50 49 48 48 47 47 48
2006 48 49 49 49 49 49 49 49 49 49 49 49 49 49 49 48 49 50 50 49 49 48 48 49 49 49 49 50 50 50 50 50 50 51 52 51 50 49 49 48 49 50 50 50 49 49 49 49 49 49 49 49 49 49 48 48 48 48 48 48 48 48 49 49 49 49 49 49 49 49 49
1998 49 50 50 50 50 50 50 50 50 50 49 49 49 49 49 49 49 49 49 50 50 49 49 49 49 49 49 49 49 49 49 48 48 48 48 49 49 49 49 50 50 50 50 49 49 49 49 49 50 50 50 50 50 49 48 48 48 48 49 49 49 49 49 49 49 49 50 49 49 48 48
1991 48 48 47 47 47 48 48 49 49 50 49 49 48 48 48 48 48 48 48 49 49 50 50 49 49 49 50 50 49 48 49 49 49 49 49 49 49 48 48 48 48 49 49 49 49 50 49 49 49 48 48 48 48 48 48 48 49 49 49 50 50 50 50 49 49 49 49 49 49 50 49
1984D9%jjJ%%JjJ%J%%j%%%j%%JJJ%%jjj%%JJ%%%j%%%%%%%%J%%%%%%%%%%j%%%%%%%%%%%%%%
1976D9%jj%jJ%JJJJj%j%%%j%%%%%%J%%%%%%%%%j%%%J%%J%%%%Jj%%jj%%%J%J%j%%%J%%j%j%
1969D8%%jJ%J%%j%JJJj%%j%%%j%J%Jj%%jJ%J%%J%%%j%%%%%%%%%%Jj%%J%j%j%%jJ%%%%jJ%J
1961E0%jJ%%%%j%%%%j%J%J%%%%J%j%jJ%%%J%%%j%j%%%%%%%%%%J%%Jj%j%%%%%%%%%%%%%J%%
1954E0%%%%%%Jj%%%%%jJ%%J%j%%%jj%%%%JJ%jj%%%%%%%J%%%%JJJ%jj%%%j%j%J%Jj%%%J%%%
1946E0%j%JJ%jj%J%%%%%%%%%%%j%%%%%%%%J%%%%%Jj%j%j%J%J%%J%%%j%%%jJ%%%%j%%%j%%J
1939D9JJjjj%J%%%%%%%%%%%%J%%Jj%%j%%%%%J%%%%j%%J%%%%%Jj%%j%%%%%%%%%%%%Jj%%%j%
1932D8%%J%%%%JJj%%j%J%%%%%%%%%%j%%%J%%%j%J%Jj%%j%J%%%%jj%%J%%j%J%%%%Jj%%%%%j
$$ plain form
1984 49 49 48 47 48 48 48 49 48 49 49 50 50 50 49 49 49 49 48 48 48 49 50 51 51 51 50 49 48 48 48 49 50 50 50 50 49 49 49 49 49 49 49 49 49 50 50 50 50 50 50 50 50 50 50 50 49 49 49 49 49 49 49 49 49 49 49 49 49 49 49
1976 49 49 48 47 47 46 47 47 48 49 50 51 50 50 49 49 49 49 48 48 48 48 48 48 48 49 49 49 49 49 49 49 49 49 49 48 48 48 48 49 49 49 50 50 50 50 50 51 50 50 50 49 48 48 48 48 49 49 50 50 49 49 49 49 50 50 50 49 49 48 48
1969 48 48 48 47 48 48 49 49 49 48 48 49 50 51 50 50 50 49 49 49 49 48 48 49 49 50 49 49 49 48 49 49 50 50 50 51 51 51 51 50 50 50 50 50 50 50 50 50 50 50 51 50 50 50 51 51 50 50 49 49 49 48 49 49 49 49 49 48 49 49 50
1961 50 50 49 50 50 50 50 50 49 49 49 49 49 48 48 49 49 50 50 50 50 50 51 51 50 50 49 50 50 50 50 51 51 51 51 50 50 49 49 49 49 49 49 49 49 49 49 49 50 50 50 51 50 50 49 49 49 49 49 49 49 49 49 49 49 49 49 49 50 50 50
1954 50 50 50 50 50 50 50 51 50 50 50 50 50 50 49 50 50 50 51 51 50 50 50 50 49 48 48 48 48 48 49 50 50 49 48 48 48 48 48 48 48 48 49 49 49 49 49 50 51 52 52 51 50 50 50 50 49 49 48 48 49 49 50 49 49 49 49 50 50 50 50
1946 50 50 49 49 50 51 51 50 49 49 50 50 50 50 50 50 50 50 50 50 50 50 49 49 49 49 49 49 49 49 49 50 50 50 50 50 50 51 50 50 49 49 48 48 49 49 50 50 50 51 51 51 51 50 50 50 50 49 50 50 50 50 50 49 49 49 49 48 48 48 49
1939 49 50 51 50 49 48 48 49 49 49 49 49 49 49 49 49 49 49 49 49 50 50 50 51 50 50 50 49 49 49 49 49 49 50 50 50 50 50 49 49 49 50 50 50 50 50 50 51 50 50 50 49 49 49 49 49 49 49 49 49 49 49 49 49 50 49 49 49 49 48 48
1932 48 48 48 49 49 49 49 49 50 51 50 50 50 49 49 50 50 50 50 50 50 50 50 50 50 50 49 49 49 49 50 50 50 50 49 49 50 50 51 50 50 50 49 49 50 50 50 50 50 49 48 48 48 49 49 49 48 48 49 49 49 49 49 50 49 49 49 49 49 49 48
1924D8%%%J%%Jj%jJJ%%%%%%%%%%%%%%%%%jj%%J%%%%%J%%%%j%j%J%%%%%j%%J%j%%%J%%%%%j
1917D8J%%J%j%%jJ%%%j%J%%jJ%JJ%%%%j%j%%%J%%%j%%%%j%%%%%%%J%%J%j%%%%%%%%%%%%j%
1909D8J%%%%%%j%%%j%%J%JJ%%j%%%%%%%%%%%%%%j%JJj%%%%%%%%j%%%%%%%%J%%J%%%%%j%%%
1902D9%Jj%j%%J%%%%%%%%j%%%%%%Jj%J%%%%%%%Jjj%%%%%J%%%%%%%%J%%%%%%Jj%%%%%%j%J%
1895E0j%%j%J%%Jj%j%%jJ%JJ%%j%%J%%%Jj%j%%%%jJ%%%%%j%%%%J%%%%%J%%jjJ%%J%%%%j%%
1887D9%j%%JJ%%jJJj%%%%j%%%%J%%j%%%%%%jJ%%j%J%JjJ%%j%%%%%%j%J%KJj%j%%j%%%j%%%
1880D8%J%%%%%j%%%%%%J%%%Jj%j%%J%J%jj%%%%%%JJJkj%%%J%j%%%%%%JJ%j%%%%%%%%%Jjj%
1872D8%%J%%jJjj%J%%J%%%%%%%%%%%Jj%%%J%%%%jjj%%JJJ%J%%%%%%%%j%%%%%%%j%%%%j%%%
$$ plain form
1924 48 48 48 48 49 49 49 50 49 49 48 49 50 50 50 50 50 50 50 50 50 50 50 50 50 50 50 50 50 50 49 48 48 48 49 49 49 49 49 49 50 50 50 50 50 49 49 48 48 49 49 49 49 49 49 48 48 48 49 49 48 48 48 48 49 49 49 49 49 49 48
1917 48 49 49 49 50 50 49 49 49 48 49 49 49 49 48 48 49 49 49 48 49 49 50 51 51 51 51 51 50 50 49 49 49 49 50 50 50 50 49 49 49 49 49 48 48 48 48 48 48 48 48 49 49 49 50 50 49 49 49 49 49 49 49 49 49 49 49 49 49 48 48
1909 48 49 49 49 49 49 49 49 48 48 48 48 47 47 47 48 48 49 50 50 50 49 49 49 49 49 49 49 49 49 49 49 49 49 49 49 48 48 49 50 49 49 49 49 49 49 49 49 49 48 48 48 48 48 48 48 48 48 49 49 49 50 50 50 50 50 50 49 49 49 49
1902 49 49 50 49 49 48 48 48 49 49 49 49 49 49 49 49 49 48 48 48 48 48 48 48 49 48 48 49 49 49 49 49 49 49 49 50 49 48 48 48 48 48 48 49 49 49 49 49 49 49 49 49 50 50 50 50 50 50 50 51 50 50 50 50 50 50 50 49 49 50 50
1895 50 49 49 49 48 48 49 49 49 50 49 49 48 48 48 47 48 48 49 50 50 50 49 49 49 50 50 50 50 51 50 50 49 49 49 49 49 48 49 49 49 49 49 49 48 48 48 48 48 49 49 49 49 49 49 50 50 50 49 48 49 49 49 50 50 50 50 50 49 49 49
1887 49 49 48 48 48 49 50 50 50 49 50 51 50 50 50 50 50 49 49 49 49 49 50 50 50 49 49 49 49 49 49 49 48 49 49 49 48 48 49 49 50 49 50 50 50 49 49 49 49 49 49 49 48 48 49 49 51 52 51 51 50 50 50 49 49 49 49 48 48 48 48
1880 48 48 49 49 49 49 49 49 48 48 48 48 48 48 48 49 49 49 49 50 49 49 48 48 48 49 49 50 50 49 48 48 48 48 48 48 48 49 50 51 49 48 48 48 48 49 49 48 48 48 48 48 48 48 49 50 50 49 49 49 49 49 49 49 49 49 49 50 49 48 48
1872 48 48 48 49 49 49 48 49 48 47 47 48 48 48 49 49 49 49 49 49 49 49 49 49 49 49 50 49 49 49 49 50 50 50 50 50 49 48 47 47 47 48 49 50 50 51 51 51 51 51 51 51 51 51 50 50 50 50 50 50 50 50 49 49 49 49 49 48 48 48 48
1865D8%%%%%j%%%%J%jJ%%%%%%J%%J%%%j%%%Jj%JJ%%j%j%%J%%%j%%%%%%Jj%%%%jJ%%%%Jj%%
1857D9jJ%%%%%%%%%j%%%J%%%%%j%%%%%%%J%%jJ%j%%JJJ%%%j%j%%%%J%J%%j%%j%%j%%J%JJj
1850E0%j%jJ%%%%%%%J%j%%%%Jjj%%jJ%J%%J%%kj%j%J%%%J%%%%%%%%%%%%%%JJ%%j%%Jj%%%%
1843D9J%Jj%j%%%J%%%j%%JJj%%%%%%%%%%%%j%%j%%%%%%j%%JJJ%Jj%%%jj%%%%%J%J%%jjJ%J
1835E0%%%%%j%j%J%%j%%%%jJ%J%j%%%%Jj%J%j%%J%%j%jJ%j%%J%%%%J%%%%%J%jj%j%%%%JJ%
1828D9j%jJ%%Jj%%%%J%%%J%%%%%%j%%%%%%%%%J%%j%%%%jJ%%%%%%%%%%%%jJ%%%%j%jJ%J%Jj
1820D9%%Jjj%%%%%j%%%%J%%%%%%%%%%%Jj%J%Jj%%%%%%%%%%j%%%%%Jj%%%%%%J%J%%jj%%J%j
1813D8%%j%%%%J%%%%%%%%J%jj%%%j%J%%%%%%J%J%%%%%jJJ%%%j%%%%%%%%%%jJ%%%%jjJ%%%%
$$ plain form
1865 48 48 48 48 48 48 47 47 47 47 47 48 48 47 48 48 48 48 48 48 48 49 49 49 50 50 50 50 49 49 49 49 50 49 49 50 51 51 51 50 50 49 49 49 50 50 50 50 49 49 49 49 49 49 49 50 49 49 49 49 49 48 49 49 49 49 49 50 49 49 49
1857 49 48 49 49 49 49 49 49 49 49 49 49 48 48 48 48 49 49 49 49 49 49 48 48 48 48 48 48 48 48 49 49 49 48 49 49 48 48 48 49 50 51 51 51 51 50 50 49 49 49 49 49 50 50 51 51 51 50 50 50 49 49 49 48 48 48 49 49 50 51 50
1850 50 50 49 49 48 49 49 49 49 49 49 49 49 50 50 49 49 49 49 49 50 49 48 48 48 47 48 48 49 49 49 50 50 50 48 47 47 46 46 47 47 47 47 48 48 48 48 48 48 48 48 48 48 48 48 48 48 48 49 50 50 50 49 49 49 50 49 49 49 49 49
1843 49 50 50 51 50 50 49 49 49 49 50 50 50 50 49 49 49 50 51 50 50 50 50 50 50 50 50 50 50 50 50 50 49 49 49 48 48 48 48 48 48 48 47 47 47 48 49 50 50 51 50 50 50 50 49 48 48 48 48 48 48 49 49 50 50 50 49 48 49 49 50
1835 50 50 50 50 50 50 49 49 48 48 49 49 49 48 48 48 48 48 47 48 48 49 49 48 48 48 48 48 49 48 48 49 49 48 48 48 49 49 49 48 48 47 48 48 47 47 47 48 48 48 48 48 49 49 49 49 49 49 50 50 49 48 48 47 47 47 47 47 48 49 49
1828 49 48 48 47 48 48 48 49 48 48 48 48 48 49 49 49 49 50 50 50 50 50 50 50 49 49 49 49 49 49 49 49 49 49 50 50 50 49 49 49 49 49 48 49 49 49 49 49 49 49 49 49 49 49 49 49 48 49 49 49 49 49 48 48 47 48 48 49 49 50 49
1820 49 49 49 50 49 48 48 48 48 48 48 47 47 47 47 47 48 48 48 48 48 48 48 48 48 48 48 48 49 48 48 49 49 50 49 49 49 49 49 49 49 49 49 49 49 48 48 48 48 48 48 49 48 48 48 48 48 48 48 49 49 50 50 50 49 48 48 48 49 49 48
1813 48 48 48 47 47 47 47 47 48 48 48 48 48 48 48 48 48 49 49 48 47 47 47 47 46 46 47 47 47 47 47 47 47 48 48 49 49 49 49 49 49 48 49 50 50 50 50 49 49 49 49 49 49 49 49 49 49 49 48 49 49 49 49 49 48 47 48 48 48 48 48
1806D8j%J%%%%%%%%%Jj%%Jj%%%%j%Jj%J%J%J%%j%%%%%%jjJ%J%jk%J%%%JJ%%j%%%%%%%J%%%
1798D9%%%%%j%%%%%%%%%%%%%%%%%%%J%%%%%%jJJ%%%%jj%%%%%%J%%Jj%%%%j%%%%%%%jJJ%%%
1791D9%jJ%%jJ%j%%Jj%%%J%%J%%%%jj%%%%%%J%%%%%%%%%J%%j%jJ%jj%J%J%%j%J%%j%%J%%%
1783D9j%%%%%%%%J%J%%%j%j%%J%%j%%%%%%J%%j%%JJ%%j%j%J%j%%J%%%j%j%JJ%j%%%J%%j%%
1776D8J%j%J%%j%%%%%%%%jJ%J%%j%%jJJ%%%j%%Jj%%%%%j%%JJj%%J%%%%j%J%%%%j%%%%%%j%
1768D7J%JJj%%jJ%%J%j%%%%j%%%%%J%jJ%%%j%j%%jJ%JjJ%%%%%%%%%%%%%J%Jj%%jj%jJ%JJ%
1761D9%J%j%%%%%%%%j%%%%j%JJ%%%j%j%%J%%%%J%%j%%Jj%Jj%%%J%%%j%%J%%J%jjJ%%j%%%%
1754D8%%%%%%%%%%J%%%%j%%%%%%%%%%%%%%%%J%jjJJ%%%%%%%%k%%K%%%j%%%%jJ%%%%%%%jj%
$$ plain form
1806 48 47 47 48 48 48 48 48 48 48 48 48 48 49 48 48 48 49 48 48 48 48 48 47 47 48 47 47 48 48 49 49 50 50 50 49 49 49 49 49 49 49 48 47 48 48 49 49 48 46 46 47 47 47 47 48 49 49 49 48 48 48 48 48 48 48 48 49 49 49 49
1798 49 49 49 49 49 49 48 48 48 48 48 48 48 48 48 48 48 48 48 48 48 48 48 48 48 48 49 49 49 49 49 49 49 48 49 50 50 50 50 50 49 48 48 48 48 48 48 48 49 49 49 50 49 49 49 49 49 48 48 48 48 48 48 48 48 47 48 49 49 49 49
1791 49 49 48 49 49 49 48 49 49 48 48 48 49 48 48 48 48 49 49 49 50 50 50 50 50 49 48 48 48 48 48 48 48 49 49 49 49 49 49 49 49 49 49 50 50 50 49 49 48 49 49 48 47 47 48 48 49 49 49 48 48 49 49 49 48 48 48 49 49 49 49
1783 49 48 48 48 48 48 48 48 48 48 49 49 50 50 50 50 49 49 48 48 48 49 49 49 48 48 48 48 48 48 48 49 49 49 48 48 48 49 50 50 50 49 49 48 48 49 49 48 48 48 49 49 49 49 48 48 47 47 48 49 49 48 48 48 48 49 49 49 48 48 48
1776 48 49 49 48 48 49 49 49 48 48 48 48 48 48 48 48 48 47 48 48 49 49 49 48 48 48 47 48 49 49 49 49 48 48 48 49 48 48 48 48 48 48 47 47 47 48 49 48 48 48 49 49 49 49 49 48 48 49 49 49 49 49 48 48 48 48 48 48 48 47 47
1768 47 48 48 49 50 49 49 49 48 49 49 49 50 50 49 49 49 49 49 48 48 48 48 48 48 49 49 48 49 49 49 49 48 48 47 47 47 46 47 47 48 47 48 48 48 48 48 48 48 48 48 48 48 48 48 48 49 49 50 49 49 49 48 47 47 46 47 47 48 49 49
1761 49 49 50 50 49 49 49 49 49 49 49 49 49 48 48 48 48 48 47 47 48 49 49 49 49 48 48 47 47 47 48 48 48 48 48 49 49 49 48 48 48 49 48 48 49 48 48 48 48 49 49 49 49 48 48 48 49 49 49 50 50 49 48 49 49 49 48 48 48 48 48
1754 48 48 48 48 48 48 48 48 48 48 48 49 49 49 49 49 48 48 48 48 48 48 48 48 48 48 48 48 48 48 48 48 48 49 49 48 47 48 49 49 49 49 49 49 49 49 49 47 47 47 49 49 49 49 48 48 48 48 48 47 48 48 48 48 48 48 48 48 47 46 46
1746D6J%%J%%JjJ%%%%%%j%%%%J%%%%%%%%j%%%%%%%%j%%%J%%%%%j%JJ%%%%jJ%%%jJ%%jj%%J
1739D8%%%%%%j%%%%J%%%%%%%J%%%%%%j%%%jJ%%%j%JJ%j%%%%%%%%%J%%%%%j%%%%%%%%%Jjj%
1731D7%%JJ%%j%%%J%%j%%%jjJJ%JJj%%%%%j%%J%%%%jj%J%%%%J%jj%%%jJJ%%%%%%%J%%Jjj%
1724D8%%%%%j%%%jJJ%%%%%%%J%Jjj%j%JJ%%%%%%%j%%J%%J%%%j%%J%J%%J%%%K%%j%j%Jjj%%
1717E1%%j%j%j%jJ%%%%J%%%%%j%J%%jj%j%JJ%%%%%%%%j%J%Jj%%J%%%%j%%jJ%%%%%%%%%j%%
1709D7%%J%J%j%j%%%J%J%j%%%%Jj%J%%%%%JjJ%%%j%Jj%%J%j%%%%%j%%J%%%%jj%%J%%%%J%%
1702D9j%%%%%%J%j%%%%%%%%J%%%%%%jJj%%%%jJJj%JJ%%j%j%%%%jJ%JJ%j%%%%%%J%j%j%%%%
1694D8j%%J%%j%%%jJ%%%JK%%jJ%%%%j%%j%%j%JJ%j%j%JJ%j%%%%J%%%%j%J%%jj%%JJ%%j%%%
$$ plain form
1746 46 47 47 47 48 48 48 49 48 49 49 49 49 49 49 49 48 48 48 48 48 49 49 49 49 49 49 49 49 49 48 48 48 48 48 48 48 48 48 47 47 47 47 48 48 48 48 48 48 47 47 48 49 49 49 49 49 48 49 49 49 49 48 49 49 49 48 47 47 47 48
1739 48 48 48 48 48 48 48 47 47 47 47 47 48 48 48 48 48 48 48 48 49 49 49 49 49 49 49 48 48 48 48 47 48 48 48 48 47 47 48 49 49 48 48 48 48 48 48 48 48 48 48 49 49 49 49 49 49 48 48 48 48 48 48 48 48 48 48 49 48 47 47
1731 47 47 47 48 49 49 49 48 48 48 48 49 49 49 48 48 48 48 47 46 47 48 48 49 50 49 49 49 49 49 49 48 48 48 49 49 49 49 49 48 47 47 48 48 48 48 48 49 49 48 47 47 47 47 46 47 48 48 48 48 48 48 48 48 49 49 49 50 49 48 48
1724 48 48 48 48 48 48 47 47 47 47 46 47 48 48 48 48 48 48 48 48 49 49 50 49 48 48 47 47 48 49 49 49 49 49 49 49 49 48 48 48 49 49 49 50 50 50 50 49 49 49 50 50 51 51 51 52 52 52 52 54 54 54 53 53 52 52 53 52 51 51 51
1717 51 51 51 50 50 49 49 48 48 47 48 48 48 48 48 49 49 49 49 49 49 48 48 49 49 49 48 47 47 46 46 47 48 48 48 48 48 48 48 48 48 47 47 48 48 49 48 48 48 49 49 49 49 49 48 48 48 47 48 48 48 48 48 48 48 48 48 48 47 47 47
1709 47 47 47 48 48 49 49 48 48 47 47 47 47 48 48 49 49 48 48 48 48 48 49 48 48 49 49 49 49 49 49 50 49 50 50 50 50 49 49 50 49 49 49 50 50 49 49 49 49 49 49 48 48 48 49 49 49 49 49 48 47 47 47 48 48 48 48 48 49 49 49
1702 49 48 48 48 48 48 48 48 49 49 48 48 48 48 48 48 48 48 48 49 49 49 49 49 49 49 48 49 48 48 48 48 48 47 48 49 48 48 49 50 50 50 49 49 48 48 48 48 48 47 48 48 49 50 50 49 49 49 49 49 49 49 50 50 49 49 48 48 48 48 48
1694 48 47 47 47 48 48 48 47 47 47 47 46 47 47 47 47 48 50 50 50 49 50 50 50 50 50 49 49 49 48 48 48 47 47 48 49 49 48 48 47 47 48 49 49 48 48 48 48 48 49 49 49 49 49 48 48 49 49 49 48 47 47 47 48 49 49 49 48 48 48 48
1687D8%%%%%JJ%%%%%%%J%%%j%%%%%j%%j%%%%%%%%%j%%J%%%%%jJJj%%%%%%%%J%%%%j%%%J%%
1679D9%%%%%%%%%%%%%j%j%JJ%%%JjjjJ%%%%%%%%%%j%%jJ%JJj%%%%J%%%%j%%%%J%%%%%j%%%
1672D8%%%J%%%%%%%%%%%J%%jj%%%%J%%%%%%%j%%J%J%%j%%%%Jj%%%j%%JJj%%%%j%%%Jj%%%%
1665D8%%j%%J%JJ%%%j%jJ%%%jjJ%J%J%%%%%%j%%j%j%%JJ%%%%J%%%%%%j%%J%%%%%%%j%%%%%
1657D9%%j%%%%%J%%%%%j%%%J%Jj%%%J%%J%%%%%J%%%%j%%JJjj%%%%%%j%%J%jj%%%%%%J%J%%
1650E1%%%%%%%J%J%%J%%%%%j%%JJ%j%j%%%%j%%%%J%%%%%%j%%%%J%Jjjjjj%%%%%JJj%%%%j%
1642D9j%J%%%jJ%%Jj%%%J%%%%%%%%j%J%%J%%%jJJjj%%jJ%%%%jJjj%%JJ%j%%%%%%j%%J%%j%
1635D8%j%%J%J%%%j%J%%j%J%jj%%JJ%J%%%j%%j%%%%%%J%%%j%%j%%%%J%J%Jj%%jj%JJJ%j%j
$$ plain form
1687 48 48 48 48 48 48 49 50 50 50 50 50 50 50 50 51 51 51 51 50 50 50 50 50 50 49 49 49 48 48 48 48 48 48 48 48 48 48 47 47 47 48 48 48 48 48 48 47 48 49 48 48 48 48 48 48 48 48 48 49 49 49 49 49 48 48 48 48 49 49 49
1679 49 49 49 49 49 49 49 49 49 49 49 49 49 49 48 48 47 47 48 49 49 49 49 50 49 48 47 48 48 48 48 48 48 48 48 48 48 48 47 47 47 46 47 47 48 49 48 48 48 48 48 49 49 49 49 49 48 48 48 48 48 49 49 49 49 49 49 48 48 48 48
1672 48 48 48 48 49 49 49 49 49 49 49 49 49 49 49 49 50 50 50 49 48 48 48 48 48 49 49 49 49 49 49 49 49 48 48 48 49 49 50 50 50 49 49 49 49 49 50 49 49 49 49 48 48 48 49 50 49 49 49 49 49 48 48 48 48 49 48 48 48 48 48
1665 48 48 48 47 47 47 48 48 49 50 50 50 50 49 49 48 49 49 49 49 48 47 48 48 49 49 50 50 50 50 50 50 50 49 49 49 48 48 47 47 47 48 49 49 49 49 49 50 50 50 50 50 50 50 49 49 49 50 50 50 50 50 50 50 50 49 49 49 49 49 49
1657 49 49 49 48 48 48 48 48 48 49 49 49 49 49 49 48 48 48 48 49 49 50 49 49 49 49 50 50 50 51 51 51 51 51 51 52 52 52 52 52 51 51 51 52 53 52 51 51 51 51 51 51 51 50 50 50 51 51 50 49 49 49 49 49 49 49 50 50 51 51 51
1650 51 51 51 51 51 51 51 51 52 52 53 53 53 54 54 54 54 54 54 53 53 53 54 55 55 54 54 53 53 53 53 53 52 52 52 52 52 53 53 53 53 53 53 53 52 52 52 52 52 53 53 54 53 52 51 50 49 49 49 49 49 49 50 51 50 50 50 50 50 49 49
1642 49 48 48 49 49 49 49 48 49 49 49 50 49 49 49 49 50 50 50 50 50 50 50 50 50 49 49 50 50 50 51 51 51 51 50 51 52 51 50 50 50 49 50 50 50 50 50 49 50 49 48 48 48 49 50 50 49 49 49 49 49 49 49 48 48 48 49 49 49 48 48
1635 48 48 47 47 47 48 48 49 49 49 49 48 48 49 49 49 48 48 49 49 48 47 47 47 48 49 49 50 50 50 50 49 49 49 48 48 48 48 48 48 48 49 49 49 49 48 48 48 47 47 47 47 47 48 48 49 49 50 49 49 49 48 47 47 48 49 50 50 49 49 48
1628D8%%%%%%%%%%%%%j%%%J%%%%%%jJ%%%%%j%J%%%%%%JJ%j%%%jj%%Jj%J%J%%j%%%%%%%%%%
1620D8jJ%%%%j%%j%%J%Jj%%%%J%%%J%%%%%%%J%%j%j%jJ%j%%J%%%%J%j%%%%%J%jj%J%%%jj%
1613D6%J%%%%%%%%%%%%%%Jj%%%%%%%%J%%j%j%%JJJ%j%%%%%j%%%%%%%jJ%%%%%J%%%%%%%J%%
1605D9%%%%%j%%%%J%j%jJ%%%%%jj%JJ%Jj%%J%%j%j%%J%Jj%%%%jj%%%%%%J%J%%J%%%j%%%%%
1598D8%%jJ%%%%%%%j%%%%%%J%%%%%%%%%%%%JJJ%%%j%%%%%%Jj%%Jj%j%j%%%%%%%%%%%J%%j%
1590D8%%%j%J%%%%jJj%%JJj%%%%jJ%%J%%%%%J%%%%%%j%%%%j%J%j%%%%j%%%J%%%%%%%%%%%j
1583D7%%%%%%%%%%%%J%Jj%%%j%%%%%%%%%%J%j%j%JJ%j%%%J%%%%J%%%%j%%%%%%j%%%%%%%J%
1576D8%%Jj%j%J%%%%J%%j%%%%%%j%%%%%%%%%%%%%%%%%%%%%%%j%J%%JJjj%%j%%%%%%%J%%%%
$$ plain form
1628 48 48 48 48 48 48 48 48 48 48 48 48 48 48 47 47 47 47 48 48 48 48 48 48 48 47 48 48 48 48 48 48 47 47 48 48 48 48 48 48 48 49 50 50 49 49 49 49 48 47 47 47 48 47 47 48 48 49 49 49 48 48 48 48 48 48 48 48 48 48 48
1620 48 47 48 48 48 48 48 47 47 47 46 46 46 47 47 48 47 47 47 47 47 48 48 48 48 49 49 49 49 49 49 49 49 50 50 50 49 49 48 48 47 48 48 47 47 47 48 48 48 48 48 49 49 48 48 48 48 48 48 49 49 48 47 47 48 48 48 48 47 46 46
1613 46 46 47 47 47 47 47 47 47 47 47 47 47 47 47 47 47 48 47 47 47 47 47 47 47 47 47 48 48 48 47 47 46 46 46 47 48 49 49 48 48 48 48 48 48 47 47 47 47 47 47 47 47 46 47 47 47 47 47 47 48 48 48 48 48 48 48 48 49 49 49
1605 49 49 49 49 49 49 48 48 48 48 48 49 49 48 48 47 48 48 48 48 48 48 47 46 46 47 48 48 49 48 48 48 49 49 49 48 48 47 47 47 48 48 49 48 48 48 48 48 47 46 46 46 46 46 46 46 47 47 48 48 48 49 49 49 49 48 48 48 48 48 48
1598 48 48 48 47 48 48 48 48 48 48 48 48 47 47 47 47 47 47 47 48 48 48 48 48 48 48 48 48 48 48 48 48 49 50 51 51 51 51 50 50 50 50 50 50 50 51 50 50 50 51 50 50 49 49 48 48 48 48 48 48 48 48 48 48 48 48 49 49 49 48 48
1590 48 48 48 48 47 47 48 48 48 48 48 47 48 47 47 47 48 49 48 48 48 48 48 47 48 48 48 49 49 49 49 49 49 50 50 50 50 50 50 50 49 49 49 49 49 48 48 49 49 48 48 48 48 48 47 47 47 47 48 48 48 48 48 48 48 48 48 48 48 48 47
1583 47 47 47 47 47 47 47 47 47 47 47 47 47 48 48 49 48 48 48 48 47 47 47 47 47 47 47 47 47 47 47 48 48 47 47 46 46 47 48 48 47 47 47 47 48 48 48 48 48 49 49 49 49 49 48 48 48 48 48 48 48 47 47 47 47 47 47 47 47 48 48
1576 48 48 48 49 48 48 47 47 48 48 48 48 48 49 49 49 48 48 48 48 48 48 48 47 47 47 47 47 47 47 47 47 47 47 47 47 47 47 47 47 47 47 47 47 47 47 47 46 46 47 47 47 48 49 48 47 47 47 46 46 46 46 46 46 46 46 47 47 47 47 47
1568D7%J%%j%jJ%%J%%%%%%%j%%%%%J%%j%J%%%%%J%%%jJj%%%j%%%%%JJj%Jj%%%%%%%j%%%%%
1561D7%J%%%jj%%%%%%%JJ%%%jJ%%%%jj%%%%J%%%J%J%%j%J%%jjJ%%Jj%%%j%%%%%%%JJ%%%%%
1553D9%%%%%j%%jJ%%%%J%jjjJJ%J%jk%J%%%%%%%%%%%JJ%%j%%%J%%%J%%%j%j%%%%%j%J%%j%
1546D7%J%%%j%%%%%%%j%%JjJ%%%Jj%%%%%%%%%J%%%jj%Jj%%J%%%J%%j%%%jJ%%j%%j%%%JJJ%
1538D8%jj%%%%J%%J%%%%%%j%%%%%j%J%%J%%%jj%%%%%JJ%%%%j%%%J%%%%%J%%jJ%Jj%j%%%jJ
1531D8%J%%j%jJ%JJj%%J%j%JJ%%j%%%%J%%%%JJ%J%J%J%JJJJJKLMLMLLLKLKKKLLKKJJJ%JKJ
1524A14%knonmmmmnmmmmkkkjjJJ%j%j%%%%%j%%%%kj%%%%J%J%%Jj%j%%jJ%%%%%%%%%%%%j%%
1516D7%%%%%%J%%%%%%%%%J%%j%%%%%%%%j%%%%Jj%%%%j%%%J%J%jJJ%jjJ%%%%%%%%%jJ%%%%J
$$ plain form
1568 47 47 48 48 48 47 47 46 47 47 47 48 48 48 48 48 48 48 48 47 47 47 47 47 47 48 48 48 47 47 48 48 48 48 48 48 49 49 49 49 48 49 48 48 48 48 47 47 47 47 47 47 48 49 48 48 49 48 48 48 48 48 48 48 48 47 47 47 47 47 47
1561 47 47 48 48 48 48 47 46 46 46 46 46 46 46 46 47 48 48 48 48 47 48 48 48 48 48 47 46 46 46 46 46 47 47 47 47 48 48 49 49 49 48 48 49 49 49 48 47 48 48 48 49 48 48 48 48 47 47 47 47 47 47 47 47 48 49 49 49 49 49 49
1553 49 49 49 49 49 49 48 48 48 47 48 48 48 48 48 49 49 48 47 46 47 48 48 49 49 48 46 46 47 47 47 47 47 47 47 47 47 47 47 47 48 49 49 49 48 48 48 48 49 49 49 49 50 50 50 50 49 49 48 48 48 48 48 48 47 47 48 48 48 47 47
1546 47 47 48 48 48 48 47 47 47 47 47 47 47 47 46 46 46 47 46 47 47 47 47 48 47 47 47 47 47 47 47 47 47 47 48 48 48 48 47 46 46 47 46 46 46 47 47 47 47 48 48 48 47 47 47 47 46 47 47 47 46 46 46 45 45 45 45 46 47 48 48
1538 48 48 47 46 46 46 46 46 47 47 47 48 48 48 48 48 48 48 47 47 47 47 47 47 46 46 47 47 47 48 48 48 48 47 46 46 46 46 46 46 47 48 48 48 48 48 47 47 47 47 48 48 48 48 48 48 49 49 49 48 49 49 50 49 49 48 48 48 48 47 48
1531 48 48 49 49 49 48 48 47 48 48 49 50 49 49 49 50 50 49 49 50 51 51 51 50 50 50 50 50 51 51 51 51 51 52 53 53 54 54 55 55 56 56 57 58 59 60 61 63 66 70 73 77 80 83 86 88 91 93 95 97 100 103 105 107 108 109 110 110 111 113 114
1524 114 114 112 107 101 96 92 88 84 80 75 71 67 63 59 57 55 53 52 51 52 53 53 52 52 51 51 51 51 51 51 50 50 50 50 50 48 47 47 47 47 47 48 48 49 49 49 50 49 49 48 48 48 47 48 48 48 48 48 48 48 48 48 48 48 48 48 47 47 47
1516 47 47 47 47 47 47 47 48 48 48 48 48 48 48 48 48 48 49 49 49 48 48 48 48 48 48 48 48 48 47 47 47 47 47 48 47 47 47 47 47 46 46 46 46 47 47 48 48 47 48 49 49 48 47 48 48 48 48 48 48 48 48 48 48 47 48 48 48 48 48 49
1509D9%%%%%%%J%%%%%j%%%%Jj%%%%%%%%%%%%%%j%%%%Jj%%J%j%j%Jj%%%%%%%%j%J%%%j%%J%
1502D7%%J%%Jj%j%%J%%j%J%%%J%%%j%%%%%j%%%%Jj%%%%%%J%%%j%j%J%j%%J%j%J%%j%%%%j%
1494D5%%J%J%%%%%%J%%%j%JJ%jj%jJ%%%%%Jj%%%%J%%j%jJ%%J%%J%%j%%%jj%%%%%%%%%%J%%
1487D7%Jj%%Jj%jj%J%Jj%%%J%j%%%%%j%%%%JJ%%j%%%%%%%J%j%JK%%jJ%jjj%J%%J%%%jJ%%%
1479D8%jj%%JJj%%%j%%%%%%%J%%%%Jj%%%%%%%j%J%%%j%J%Jj%%J%%j%J%%%%%%%%%j%%%%%J%
1472D8%jJ%j%JJ%%%%%%%%j%Jj%jJ%%J%%J%%%J%%%JJJJ%J%J%%%J%%%%j%%J%Jj%jjjjj%j%jj
1464E0jj%%%%%%%%%%jjJ%%%%%%%j%%%J%%j%%%J%%%%%%%%%%%jJJ%%%%%%%%%J%j%%%%jj%J%%
1457D7%%J%%%j%Jj%j%%%%%%J%%%%%%j%%J%%%JJ%jj%%%%%%%j%%%J%%jJJ%%%%%%%%j%%%%%%%
$$ plain form
1509 49 49 49 49 49 49 49 49 50 50 50 50 50 50 49 49 49 49 49 50 49 49 49 49 49 49 49 49 49 49 49 49 49 49 49 48 48 48 48 48 49 48 48 48 49 49 48 48 47 47 48 47 47 47 47 47 47 47 47 47 46 46 47 47 47 47 46 46 46 47 47
1502 47 47 47 48 48 48 49 48 48 47 47 47 48 48 48 47 47 48 48 48 48 49 49 49 49 48 48 48 48 48 48 47 47 47 47 47 48 47 47 47 47 47 47 47 48 48 48 48 47 47 46 46 47 47 46 46 46 47 47 46 46 47 47 47 46 46 46 46 46 45 45
1494 45 45 45 46 46 47 47 47 47 47 47 47 48 48 48 48 47 47 48 49 49 48 47 47 46 47 47 47 47 47 47 48 47 47 47 47 47 48 48 48 47 47 46 47 47 47 48 48 48 49 49 49 48 48 48 48 47 46 46 46 46 46 46 46 46 46 46 46 47 47 47
1487 47 47 48 47 47 47 48 47 47 46 45 45 46 46 47 46 46 46 46 47 47 46 46 46 46 46 46 45 45 45 45 45 46 47 47 47 46 46 46 46 46 46 46 46 47 47 46 46 47 49 49 49 48 49 49 48 47 46 46 47 47 47 48 48 48 48 47 48 48 48 48
1479 48 48 47 46 46 46 47 48 47 47 47 47 46 46 46 46 46 46 46 46 47 47 47 47 47 48 47 47 47 47 47 47 47 47 46 46 47 47 47 47 46 46 47 47 48 47 47 47 48 48 48 47 47 48 48 48 48 48 48 48 48 48 48 47 47 47 47 47 47 48 48
1472 48 48 47 48 48 47 47 48 49 49 49 49 49 49 49 49 49 48 48 49 48 48 47 48 48 48 49 49 49 50 50 50 50 51 51 51 51 52 53 54 55 55 56 56 57 57 57 57 58 58 58 58 58 57 57 57 58 58 59 58 58 57 56 55 54 53 53 52 52 51 50
1464 50 49 48 48 48 48 48 48 48 48 48 48 48 47 46 47 47 47 47 47 47 47 47 46 46 46 46 47 47 47 46 46 46 46 47 47 47 47 47 47 47 47 47 47 47 47 46 47 48 48 48 48 48 48 48 48 48 48 49 49 48 48 48 48 48 47 46 46 47 47 47
1457 47 47 47 48 48 48 48 47 47 48 47 47 46 46 46 46 46 46 46 47 47 47 47 47 47 47 46 46 46 47 47 47 47 48 49 49 48 47 47 47 47 47 47 47 47 46 46 46 46 47 47 47 46 47 48 48 48 48 48 48 48 48 48 47 47 47 47 47 47 47 47
1450D7%j%%J%%j%J%%%J%jJ%%jJ%%jjjj%%%J%%%%J%%%%J%%%%J%j%%%%%%%%%J%%jj%%JJ%j%%
1442D7%j%JJ%%%%jJ%%%%%%%%%j%j%J%J%J%%%%j%%%%%j%J%jJ%J%J%J%%jJJ%JJ%JJKKJ%JJJJ
1435F5JJ%JK%%J%%%jkjkjkkkkjj%jkj%j%jJ%%%j%%J%j%%%%j%%%%%J%%Jj%jj%J%%%%%%J%%%
1427D8j%J%%JJj%j%%j%j%%J%%%%J%%%%%jj%JJj%%Jj%%%%%%%J%%%%%%%%%%%%J%%%jj%j%%%%
1420D6J%%%J%%%%%%%J%%j%%%%%%%%%%%%j%%J%%%%%%%j%%%%%%%%%%%%J%jj%%J%%%%%%Jj%%j
1413D6J%J%%%J%%%%%j%%%%%J%%j%%jJ%%%%%Jj%%J%J%%j%%%%J%j%%Jj%jJ%%j%%%j%J%%%%j%
1405D7%J%%%%%Jj%%J%%%%j%J%JJ%%%%j%j%%jj%%%%JjJ%%%JjJ%%%j%%%%%%%j%J%%j%%%J%%%
1398D8%%j%%%j%%%%%%%J%%%%%%J%j%JJj%%%%j%%%%%%J%%%Jj%%%%%%J%J%%j%%%%J%k%jJ%%j
$$ plain form
1450 47 47 46 46 46 47 47 47 46 46 47 47 47 47 48 48 47 48 48 48 47 48 48 48 47 46 45 44 44 44 44 45 45 45 45 45 46 46 46 46 46 47 47 47 47 47 48 48 47 47 47 47 47 47 47 47 47 47 48 48 48 47 46 46 46 47 48 48 47 47 47
1442 47 47 46 46 47 48 48 48 48 48 47 48 48 48 48 48 48 48 48 48 48 47 47 46 46 47 47 48 48 49 49 49 49 49 48 48 48 48 48 48 47 47 48 48 47 48 48 49 49 50 50 51 51 51 50 51 52 52 53 54 54 55 56 58 60 61 61 62 63 64 65
1435 65 66 67 67 68 70 70 70 71 71 71 71 70 68 67 65 64 62 60 58 56 55 54 54 53 51 50 50 49 49 48 49 49 49 49 48 48 48 49 49 48 48 48 48 48 47 47 47 47 47 47 48 48 48 49 48 48 47 46 46 47 47 47 47 47 47 47 48 48 48 48
1427 48 47 47 48 48 48 49 50 49 49 48 48 48 47 47 46 46 46 47 47 47 47 47 48 48 48 48 48 48 47 46 46 47 48 47 47 47 48 47 47 47 47 47 47 47 47 48 48 48 48 48 48 48 48 48 48 48 48 48 49 49 49 49 48 47 47 46 46 46 46 46
1420 46 47 47 47 47 48 48 48 48 48 48 48 48 49 49 49 48 48 48 48 48 48 48 48 48 48 48 48 48 47 47 47 48 48 48 48 48 48 48 48 47 47 47 47 47 47 47 47 47 47 47 47 47 48 48 47 46 46 46 47 47 47 47 47 47 47 48 47 47 47 46
1413 46 47 47 48 48 48 48 49 49 49 49 49 49 48 48 48 48 48 48 49 49 49 48 48 48 47 48 48 48 48 48 48 49 48 48 48 49 49 50 50 50 49 49 49 49 49 50 50 49 49 49 50 49 49 48 49 49 49 48 48 48 48 47 47 48 48 48 48 48 47 47
1405 47 47 48 48 48 48 48 48 49 48 48 48 49 49 49 49 49 48 48 49 49 50 51 51 51 51 51 50 50 49 49 49 48 47 47 47 47 47 48 47 48 48 48 48 49 48 49 49 49 49 48 48 48 48 48 48 48 48 47 47 48 48 48 47 47 47 47 48 48 48 48
1398 48 48 48 47 47 47 47 46 46 46 46 46 46 46 46 47 47 47 47 47 47 47 48 48 47 47 48 49 48 48 48 48 48 47 47 47 47 47 47 47 48 48 48 48 49 48 48 48 48 48 48 48 49 49 50 50 50 49 49 49 49 49 50 50 48 48 47 48 48 48 47
1390D7JJ%jJ%%%%%%j%%%jJ%jjJ%JJ%Jj%%%%%j%J%%j%j%J%%j%J%jJ%J%j%jJ%%%%Jj%%%Jj%%
1383D8%%jJjJ%%%%J%%%j%%jJ%J%%%%%j%%%%%%JJ%j%%%jJj%%%J%%j%%%%%%%J%%%%%%j%%j%J
1375D8%%%j%%%J%%%J%%%%%j%%%J%%%%%jj%J%%j%%%%%J%%j%%J%%%%%%%%%%%%%%%J%%%j%%%%
1368D8%%%%%JjJj%j%%%J%%j%%J%%%%%%%%%%%j%%j%%JJ%%%jJ%%j%Jj%%%%%JJ%%%jj%JJ%j%%
1361D8%j%J%j%%%Jj%%%%j%%%Jj%%%%%JJ%%Jjj%%%%%%%%%%%J%%%jj%%%JJjJ%%%jJ%j%%%J%%
1353D8%%j%%J%%%%%%%%%%%JjjJ%%Jjj%jJ%J%J%%%%%%%%j%%%J%J%%%%j%%j%%%%JJj%j%%%j%
1346D7jJ%%%J%%j%%%%%%%%%J%J%%j%%%%J%%jJ%%Jjjj%J%%j%%%J%%%%%%%%%%%J%%%%%%%%jJ
1338D9%j%%%%%%%jj%%J%%%%%j%%J%j%JJ%%j%J%j%%%j%J%%%%jJJ%%J%j%%%%%%j%J%%%jJ%%%
$$ plain form
1390 47 48 49 49 48 49 49 49 49 49 49 49 48 48 48 48 47 48 48 47 46 47 47 48 49 49 50 49 49 49 49 49 49 48 48 49 49 49 48 48 47 47 48 48 48 47 47 48 48 47 48 48 49 49 48 48 47 48 48 48 48 48 49 48 48 48 48 49 48 48 48
1383 48 48 48 47 48 47 48 48 48 48 48 49 49 49 49 48 48 48 47 48 48 49 49 49 49 49 49 48 48 48 48 48 48 48 49 50 50 49 49 49 49 48 49 48 48 48 48 49 49 49 48 48 48 48 48 48 48 48 49 49 49 49 49 49 49 48 48 48 47 47 48
1375 48 48 48 48 47 47 47 47 48 48 48 48 49 49 49 49 49 49 48 48 48 48 49 49 49 49 49 49 48 47 47 48 48 48 47 47 47 47 47 47 48 48 48 47 47 47 48 48 48 48 48 48 48 48 48 48 48 48 48 48 48 48 49 49 49 49 48 48 48 48 48
1368 48 48 48 48 48 48 49 48 49 48 48 47 47 47 47 48 48 48 47 47 47 48 48 48 48 48 48 48 48 48 48 48 48 47 47 47 46 46 46 47 48 48 48 48 47 48 48 48 47 47 48 47 47 47 47 47 47 48 49 49 49 49 48 47 47 48 49 49 48 48 48
1361 48 48 47 47 48 48 47 47 47 47 48 47 47 47 47 47 46 46 46 46 47 46 46 46 46 46 46 47 48 48 48 49 48 47 47 47 47 47 47 47 47 47 47 47 47 48 48 48 48 47 46 46 46 46 47 48 47 48 48 48 48 47 48 48 47 47 47 47 48 48 48
1353 48 48 48 47 47 47 48 48 48 48 48 48 48 48 48 48 48 48 49 48 47 48 48 48 49 48 47 47 46 47 47 48 48 49 49 49 49 49 49 49 49 49 48 48 48 48 49 49 50 50 50 50 50 49 49 49 48 48 48 48 48 49 50 49 49 48 48 48 48 47 47
1346 47 46 47 47 47 47 48 48 48 47 47 47 47 47 47 47 47 47 47 48 48 49 49 49 48 48 48 48 48 49 49 49 48 49 49 49 50 49 48 47 47 48 48 48 47 47 47 47 48 48 48 48 48 48 48 48 48 48 48 48 49 49 49 49 49 49 49 49 49 48 49
1338 49 49 48 48 48 48 48 48 48 48 47 46 46 46 47 47 47 47 47 47 46 46 46 47 47 46 46 47 48 48 48 47 47 48 48 47 47 47 47 46 46 47 47 47 47 47 46 47 48 48 48 49 49 48 48 48 48 48 48 48 47 47 48 48 48 48 47 48 48 48 48
1331D8%%%%%%%%%JJ%j%%%%%%%%%%%%%j%%%%%%j%J%%%%%%%%J%%%%%%%%%%j%%%%%%%%J%%%%J
1323E0%%%%j%%%%%%%%j%%%%%Jj%%%%%%Jj%%j%J%%%%%j%J%%%%%jJ%%%J%%%%j%%j%JJ%%j%j%
1316D7%JJj%J%%%j%%%j%J%%%J%%%%%j%%JJ%J%%j%%%J%%%j%%%%%%%%J%J%J%%%%%%%Jjj%J%J
1309E4%%%%%%%%%j%j%jj%jjJ%%%%Jj%j%%%%%%J%%%%j%JjJJ%j%j%%%%%J%J%%%%j%j%j%%JJ%
1301D9JJjj%j%j%%%J%J%%%%%%%j%%%%%%%%J%J%%Jjj%J%Jjj%%j%%%%%j%JJJ%j%%J%%%%%%%%
1294E0j%%%%j%%%%%%%J%%%%j%J%J%%j%%Jj%j%%%J%J%%%J%j%j%J%%j%%%%J%J%%%%%jjj%%%J
1286D9J%%%%%%%JjjJ%%%%j%%%%%%%J%%%%%j%J%j%%J%%%%%%%%j%J%%jj%%%J%%%%%%%%%%%%J
1279E0%Jj%%%%%%j%%J%J%j%%jJ%%j%%%%JJ%%%%j%%%%j%j%JJ%%%%%%j%%%%%%%%%J%%%%%%%J
$$ plain form
1331 48 48 48 48 48 48 48 48 48 48 49 50 50 49 49 49 49 49 49 49 49 49 49 49 49 49 49 48 48 48 48 48 48 48 47 47 48 48 48 48 48 48 48 48 48 49 49 49 49 49 49 49 49 49 49 49 48 48 48 48 48 48 48 48 48 49 49 49 49 49 50
1323 50 50 50 50 50 49 49 49 49 49 49 49 49 49 48 48 48 48 48 48 49 48 48 48 48 48 48 48 49 48 48 48 47 47 48 48 48 48 48 48 47 47 48 48 48 48 48 48 47 48 48 48 48 49 49 49 49 49 48 48 48 47 47 48 49 49 49 48 48 47 47
1316 47 47 48 49 48 48 49 49 49 49 48 48 48 48 47 47 48 48 48 48 49 49 49 49 49 49 48 48 48 49 50 50 51 51 51 50 50 50 50 51 51 51 51 50 50 50 50 50 50 50 50 50 51 51 52 52 53 53 53 53 53 53 53 53 54 53 52 52 53 53 54
1309 54 54 54 54 54 54 54 54 54 54 53 53 52 52 51 50 50 49 48 49 49 49 49 49 50 49 49 48 48 48 48 48 48 48 49 49 49 49 49 48 48 49 48 49 50 50 49 49 48 48 48 48 48 48 49 49 50 50 50 50 50 49 49 48 48 47 47 47 48 49 49
1301 49 50 51 50 49 49 48 48 47 47 47 47 48 48 49 49 49 49 49 49 49 49 48 48 48 48 48 48 48 48 48 49 49 50 50 50 51 50 49 49 50 50 51 50 49 49 49 48 48 48 48 48 48 47 47 48 49 50 50 49 49 49 50 50 50 50 50 50 50 50 50
1294 50 49 49 49 49 49 48 48 48 48 48 48 48 48 49 49 49 49 49 48 48 49 49 50 50 50 49 49 49 50 49 49 48 48 48 48 49 49 50 50 50 50 51 51 50 50 49 49 50 50 50 49 49 49 49 49 50 50 51 51 51 51 51 51 50 49 48 48 48 48 49
1286 49 50 50 50 50 50 50 50 50 51 50 49 50 50 50 50 50 49 49 49 49 49 49 49 49 50 50 50 50 50 50 49 49 50 50 49 49 49 50 50 50 50 50 50 50 50 50 49 49 50 50 50 49 48 48 48 48 49 49 49 49 49 49 49 49 49 49 49 49 49 50
1279 50 50 51 50 50 50 50 50 50 50 49 49 49 50 50 51 51 50 50 50 49 50 50 50 49 49 49 49 49 50 51 51 51 51 51 50 50 50 50 50 49 49 48 48 49 50 50 50 50 50 50 50 49 49 49 49 49 49 49 49 49 49 50 50 50 50 50 50 50 50 51
1272E1%%j%j%jJ%%%%J%%%J%%%j%%%%%%%%%%%%%%j%%%%%%%J%%%J%%%%jj%%%%%J%%J%%%%%%J
1264E2%j%j%%%J%j%%%%J%%%%%%%%%j%%%J%%jJ%%%%%%%%%%%%%j%%J%%%J%j%%j%%%%JJ%j%%%
1257E1%J%%%%%%j%%J%J%jj%J%%%%%Jj%%%%J%%j%jJ%%%%%j%J%%%j%J%J%j%%%j%%%%J%Jj%%%
1249E2%%%%%J%%j%j%%%%%%%%%%%J%Jjj%%%%%J%J%%%%%j%j%j%JJ%%JJj%%j%%%%j%Jjj%%%%%
1242E0J%%J%%%j%J%%%J%%%%j%%J%%%%%j%%%%%%%J%%%%%J%%%jJ%%Jjj%%%%%%%%J%%%j%%%j%
1234E2J%%J%%jJ%j%%%%%%%j%%%J%%J%%jJj%J%j%%%%J%%%%%%%%%%Jj%%j%J%%%j%%%%%%JjJ%
1227E4%%%%%%%%J%%%%%jJ%%j%j%JJjj%jJJ%%%%JJj%jj%%J%%J%JjjJ%%J%%%J%j%%%%j%%J%%
1220E6%%%%%%J%%%%%%j%%J%%%%%%j%%j%%J%%J%%J%%%%%J%%j%jj%%%%J%%%%J%j%%%J%Jj%%%
$$ plain form
1272 51 51 51 50 50 49 49 48 49 49 49 49 49 50 50 50 50 51 51 51 51 50 50 50 50 50 50 50 50 50 50 50 50 50 50 50 49 49 49 49 49 49 49 49 50 50 50 50 51 51 51 51 51 50 49 49 49 49 49 49 50 50 50 51 51 51 51 51 51 51 52
1264 52 52 51 51 50 50 50 50 51 51 50 50 50 50 50 51 51 51 51 51 51 51 51 51 51 50 50 50 50 51 51 51 50 51 51 51 51 51 51 51 51 51 51 51 51 51 51 50 50 50 51 51 51 51 52 52 51 51 51 50 50 50 50 50 51 52 52 51 51 51 51
1257 51 51 52 52 52 52 52 52 52 51 51 51 52 52 53 53 52 51 51 52 52 52 52 52 52 53 52 52 52 52 52 53 53 53 52 52 51 52 52 52 52 52 52 51 51 52 52 52 52 51 51 52 52 53 53 52 52 52 52 51 51 51 51 51 52 52 53 52 52 52 52
1249 52 52 52 52 52 52 53 53 53 52 52 51 51 51 51 51 51 51 51 51 51 51 51 52 52 53 52 51 51 51 51 51 51 52 52 53 53 53 53 53 53 52 52 51 51 50 50 51 52 52 52 53 54 53 53 53 52 52 52 52 52 51 51 52 51 50 50 50 50 50 50
1242 50 51 51 51 52 52 52 52 51 51 52 52 52 52 53 53 53 53 53 52 52 52 53 53 53 53 53 53 52 52 52 52 52 52 52 52 53 53 53 53 53 53 54 54 54 54 53 54 54 54 55 54 53 53 53 53 53 53 53 53 53 54 54 54 54 53 53 53 53 52 52
1234 52 53 53 53 54 54 54 53 54 54 53 53 53 53 53 53 53 53 52 52 52 52 53 53 53 54 54 54 53 54 53 53 54 54 53 53 53 53 53 54 54 54 54 54 54 54 54 54 54 54 55 54 54 54 53 53 54 54 54 54 53 53 53 53 53 53 53 54 53 54 54
1227 54 54 54 54 54 54 54 54 54 55 55 55 55 55 55 54 55 55 55 54 54 53 53 54 55 54 53 53 52 53 54 54 54 54 54 55 56 55 55 54 53 53 53 54 54 54 55 55 56 55 54 55 55 55 56 56 56 56 57 57 56 56 56 56 56 55 55 55 56 56 56
1220 56 56 56 56 56 56 56 57 57 57 57 57 57 57 56 56 56 57 57 57 57 57 57 57 56 56 56 55 55 55 56 56 56 57 57 57 58 58 58 58 58 58 59 59 59 58 58 57 56 56 56 56 56 57 57 57 57 57 58 58 57 57 57 57 58 58 59 58 58 58 58
1212E8J%%%%%%%%%%%j%%%j%J%%%j%%%%%J%%%J%j%%%J%%j%J%J%j%j%%J%%%J%%%%%%%%%%%%%
1205F0%%%%%J%j%%%J%%%%%%%%%%J%J%%%jj%%%J%%%j%%%%j%%J%Jj%%%J%%%%%%%%j%Jj%%%%%
1197F1%%%J%%J%j%%%J%%%%j%J%%%%j%%J%%j%JJ%j%%%%jj%%J%J%J%%%%%J%J%j%j%J%%%%%%%
1190F5j%%%%JJ%%%j%%Jj%jJJ%%%%J%%j%J%%j%jJ%J%%%%%%J%%%%%%%%j%J%%%%J%%j%%%%J%%
1183F9%%J%j%%%%J%J%%%%J%%%%%%%%%%%%%%%j%%%J%%%%%%%J%%%J%%%j%%%%J%%jJJJ%%j%j%
1175G4%%j%J%%%JJJ%j%J%j%%j%%J%J%%%J%%%J%%%%%%%%%%%%JJJj%%j%%%%J%%%%%%j%JJ%%J
1168H3%%%%JJ%%%j%%J%%%%%J%J%j%%%J%J%%%%%%%J%J%%j%%J%J%%jJ%%%%%J%%%%J%%%%%jJ%
1160I3%J%J%JjjJ%%%%%JJ%jJJ%JJJj%%jJJ%JJ%%%%%%J%j%JJ%j%%J%%JJJ%%Jj%%%%J%JJ%JJ
$$ plain form
1212 58 59 59 59 59 59 59 59 59 59 59 59 59 58 58 58 58 57 57 58 58 58 58 57 57 57 57 57 57 58 58 58 58 59 59 58 58 58 58 59 59 59 58 58 59 59 60 60 59 59 58 58 58 59 59 59 59 60 60 60 60 60 60 60 60 60 60 60 60 60 60
1205 60 60 60 60 60 60 61 61 60 60 60 60 61 61 61 61 61 61 61 61 61 61 61 62 62 63 63 63 63 62 61 61 61 61 62 62 62 62 61 61 61 61 61 60 60 60 61 61 62 61 61 61 61 62 62 62 62 62 62 62 62 62 61 61 62 61 61 61 61 61 61
1197 61 61 61 61 62 62 62 63 63 62 62 62 62 63 63 63 63 63 62 62 63 63 63 63 63 62 62 62 63 63 63 62 62 63 64 64 63 63 63 63 63 62 61 61 61 62 62 63 63 64 64 64 64 64 64 65 65 66 66 65 65 64 64 65 65 65 65 65 65 65 65
1190 65 64 64 64 64 64 65 66 66 66 66 65 65 65 66 65 65 64 65 66 66 66 66 66 67 67 67 66 66 67 67 67 66 66 65 66 66 67 67 67 67 67 67 67 68 68 68 68 68 68 68 68 68 67 67 68 68 68 68 68 69 69 69 68 68 68 68 68 69 69 69
1183 69 69 69 70 70 69 69 69 69 69 70 70 71 71 71 71 71 72 72 72 72 72 72 72 72 72 72 72 72 72 72 72 72 71 71 71 71 72 72 72 72 72 72 72 72 73 73 73 73 74 74 74 74 73 73 73 73 73 74 74 74 73 74 75 76 76 76 75 75 74 74
1175 74 74 74 73 73 74 74 74 74 75 76 77 77 76 76 77 77 76 76 76 75 75 75 76 76 77 77 77 77 78 78 78 78 79 79 79 79 79 79 79 79 79 79 79 79 79 80 81 82 81 81 81 80 80 80 80 80 81 81 81 81 81 81 81 80 80 81 82 82 82 83
1168 83 83 83 83 83 84 85 85 85 85 84 84 84 85 85 85 85 85 85 86 86 87 87 86 86 86 86 87 87 88 88 88 88 88 88 88 88 89 89 90 90 90 89 89 89 90 90 91 91 91 90 91 91 91 91 91 91 92 92 92 92 92 93 93 93 93 93 93 92 93 93
1160 93 93 94 94 95 95 96 95 94 95 95 95 95 95 95 96 97 97 96 97 98 98 99 100 101 100 100 100 99 100 101 101 102 103 103 103 103 103 103 103 104 104 103 103 104 105 105 104 104 104 105 105 105 106 107 108 108 108 109 108 108 108 108 108 109 109 110 111 111 112 113
1153A13J%%%%%%%%%JJJ%%%J%%%J%%%%J%J%J%JJJ%%%%%%%J%JJJ%%%JJJKJJ%j%JJ%JJ%%j%%J
1146A39JKJ%%%JJ%JJ%%J%J%%%%J%J%JJ%JJ%JJ%JJJJ%JJJJJ%%J%JJJJJJJJJ%JJJJJJJ%J%KJ
1138A87KJJ%KJJJ%JJJJJKJJK%JJJ%JJJJKJJKJJJJKKKJJJJJJKKKKK%JKKJKKKKKKJJKJLKKKK
1131B80KKKKKKKJKKKKKLKLKKKKKLKLLMLKLKKLLLKLLKLLLMLLLMLMMLMMMLMMMMNMMLMMMNNMM
1124D86MMONNONNNNOOOOOONOOOPOOPPQPOQPPPPPPQRPQRQQRJ0RRRQJ0RRRJ0J0RJ0J1J1J0J0
1117I28J1J1J1J1J1J2J1J2J2J1J1J2J1J2J2J2J3J3J2J2J3J2J2J3J4J3J3J3J3J3J3J3J3J3J3
1114A355J3J3J2J3J4J3J3J2J3J2J2J2J3J1J2J1J2J1J2J1J1J0J1J0RJ0RRQQQPQPOONNONLLL
1109A767KLKJK%Jj%jklllmmnnnnopoqqqqqrrrj1j0j0j1j1j1j1j2j1j1j2j2j2j3j2j3j2j3j2
$$ plain form
1153 113 114 114 114 114 114 114 114 114 114 114 115 116 117 117 117 117 118 118 118 118 119 119 119 119 119 120 120 121 121 122 122 123 124 125 125 125 125 125 125 125 125 126 126 127 128 129 129 129 129 130 131 132 134 135 136 136 135 135 136 137 137 138 139 139 139 138 138 138 139
1146 139 140 142 143 143 143 143 144 145 145 146 147 147 147 148 148 149 149 149 149 149 150 150 151 151 152 153 153 154 155 155 156 157 157 158 159 160 161 161 162 163 164 165 166 166 166 167 167 168 169 170 171 172 173 174 175 176 176 177 178 179 180 181 182 183 183 184 184 186 187
1138 187 189 190 191 191 193 194 195 196 196 197 198 199 200 201 203 204 205 207 207 208 209 210 210 211 212 213 214 216 217 218 220 221 222 223 224 226 228 230 231 232 233 234 235 236 238 240 242 244 246 246 247 249 251 252 254 256 258 260 262 264 265 266 268 269 272 274 276 278 280
1131 280 282 284 286 288 290 292 294 295 297 299 301 303 305 308 310 313 315 317 319 321 323 326 328 331 334 338 341 343 346 348 350 353 356 359 361 364 367 369 372 375 378 382 385 388 391 395 398 402 406 409 413 417 421 424 428 432 436 440 445 449 453 456 460 464 468 473 478 482 486
1124 486 490 494 500 505 510 516 521 526 531 536 542 548 554 560 566 572 577 583 589 595 602 608 614 621 628 636 643 649 657 664 671 678 685 692 699 707 716 723 731 740 748 756 765 775 784 793 802 810 820 829 838 847 857 867 876 886 897 908 918 928
1117 928 939 950 961 972 983 995 1006 1018 1030 1041 1052 1064 1075 1087 1099 1111 1124 1137 1149 1161 1174 1186 1198 1211 1225 1238 1251 1264 1277 1290 1303 1316 1329 1342 1355
1114 1355 1368 1381 1393 1406 1420 1433 1446 1458 1471 1483 1495 1507 1520 1531 1543 1554 1566 1577 1589 1600 1611 1621 1632 1642 1651 1661 1670 1679 1687 1695 1703 1710 1718 1725 1731 1737 1742 1747 1753 1758 1761 1764 1767
1109 1767 1769 1772 1774 1775 1777 1777 1778 1777 1777 1776 1774 1771 1768 1765 1761 1757 1752 1747 1742 1737 1731 1724 1718 1710 1702 1694 1686 1678 1669 1660 1651 1640 1630 1620 1609 1598 1587 1576 1564 1553 1542 1530 1518 1506 1493 1481 1468 1456 1443 1431
1104A431j3j3j3j4j3j3j3j3j3j3j3j3j3j3j3j3j3j3j2j2j3j2j2j2j2j1j2j2j2j2j2j2j2j1
1100A005j1j0j1j0j0j0j0j0j0j0j0j1rj0j0rrrj0rqrqqqqqqqpqqpqpopppppoooopoooonoo
1095E76oonnonoonmonnnnmmnmlmmnmmmmnmmlmmmmlmlmllmlmlllmllkkllllmlklkkkkllkkl
1087C16lklkjllllkkkjkkkkjkjlkkkkkjkkjkjkjkjjjkkjkjjjkjjjkkkjkjjkjjjjjkj%jjkj
1080B03jjkjjjjjkjj%jjjjjjjjj%j%j%j%%kjkj%jj%jjjjjj%jj%j%jjj%%jjj%j%%jjjk%j%%
1073A48jjjj%jjj%%%%j%j%j%jj%j%j%j%j%j%%j%%j%%j%jjjj%j%%%jj%%J%%%jjj%%%jj%jj%
1065A15%J%j%%%jj%%%Jjjj%jj%%%J%%%j%kj%JJ%%jjj%%%%j%%%%%j%%%jJ%%%jj%%%%%%%j%%
1058A00j%j%%%%%jj%%%j%%%%%%%j%%%j%J%%%%%%j%j%%%%Jj%%j%%%jJ%%%J%%j%%j%J%%%jjj
$$ plain form
1104 1431 1418 1405 1392 1378 1365 1352 1339 1326 1313 1300 1287 1274 1261 1248 1235 1222 1209 1196 1184 1172 1159 1147 1135 1123 1111 1100 1088 1076 1064 1052 1040 1028 1016 1005
1100 1005 994 984 973 963 953 943 933 923 913 903 893 882 873 863 853 844 835 826 816 807 799 790 782 774 766 758 750 742 734 727 719 711 704 696 689 683 676 669 662 655 648 642 636 630 624 617 611 605 599 593 588 582 576
1095 576 570 564 559 554 548 543 537 531 526 522 516 511 506 501 496 492 488 483 479 476 472 468 463 459 455 451 447 442 438 434 431 427 423 419 415 412 408 405 401 398 395 391 388 384 381 378 375 371 368 365 363 361 358 355 352 349 345 342 340 337 335 333 331 329 326 323 321 319 316
1087 316 313 311 308 306 305 302 299 296 293 291 289 287 286 284 282 280 278 277 275 274 271 269 267 265 263 261 260 258 256 255 253 252 250 249 247 246 245 244 242 240 239 237 236 235 234 232 231 230 229 227 225 223 222 220 219 218 216 215 214 213 212 211 209 208 208 207 206 204 203
1080 203 202 201 199 198 197 196 195 194 192 191 190 190 189 188 187 186 185 184 183 182 181 181 180 180 179 179 178 178 178 176 175 173 172 172 171 170 170 169 168 167 166 165 164 164 163 162 162 161 161 160 159 158 158 158 157 156 155 155 154 154 154 153 152 151 149 149 148 148 148
1073 148 147 146 145 144 144 143 142 141 141 141 141 141 140 140 139 139 138 138 137 136 136 135 135 134 134 133 133 132 132 131 131 131 130 130 130 129 129 129 128 128 127 126 125 124 124 123 123 123 123 122 121 121 121 122 122 122 122 121 120 119 119 119 119 118 117 117 116 115 115
1065 115 115 116 116 115 115 115 115 114 113 113 113 113 114 113 112 111 111 110 109 109 109 109 110 110 110 110 109 109 107 106 106 107 108 108 108 107 106 105 105 105 105 105 104 104 104 104 104 104 103 103 103 103 102 103 103 103 103 102 101 101 101 101 101 101 101 101 100 100 100
1058 100 99 99 98 98 98 98 98 98 97 96 96 96 96 95 95 95 95 95 95 95 95 94 94 94 94 93 93 94 94 94 94 94 94 94 93 93 92 92 92 92 92 93 92 92 92 91 91 91 91 90 91 91 91 91 92 92 92 91 91 91 90 90 91 91 91 91 90 89 88
1051H8%%%%%j%jj%%%j%j%J%%J%%%%jjjjj%%J%JJ%%%%%%%%%j%j%%jJ%%j%J%%J%jjJ%j%%%%%
1043H0J%J%jjjj%%J%jj%%%j%%%%%%J%j%j%j%%j%%J%jJ%%Jj%Jj%%Jj%%%Jj%%j%%%j%%%%%J%
1036G3%%j%%%%%%%j%j%%%%%%%Jj%jJJ%%%%j%j%jJ%%JJ%%%jjjJ%%%%%%%j%%%J%%jjjJ%%%%%
1028F7%%jjJ%J%%%j%j%%J%%Jj%%%%%%j%%J%%%Jj%%%j%%%%Jj%J%j%j%%%%%%J%j%%%%%j%%%%
1021F3%%%J%%j%%%%%%%%j%%Jj%J%%%%%%%%%%%%%%%%jj%%J%%J%J%%J%%%%%%%JJj%j%%%%J%%
1014F6jjj%%%%%%%%j%%%%%%j%J%j%%%j%%j%%J%%J%%jjjJ%%jJ%%%%%%%%%%jJJJj%%%j%%J%%
1006F0%%j%J%%%%%%J%%%%%j%%%%J%jjJ%%%%J%j%%%%%%%%jJ%%J%j%%JJJ%j%JJ%J%%%%J%J%%
999F7%J%%J%%J%J%%%%%j%%%%%%jjj%%jjjjj%%%%%%j%jj%%%J%%j%j%%%%%%%%%j%jJ%J%%%j%
$$ plain form
1051 88 88 88 88 88 88 87 87 86 85 85 85 85 84 84 83 83 84 84 84 85 85 85 85 85 84 83 82 81 80 80 80 81 81 82 83 83 83 83 83 83 83 83 83 83 82 82 81 81 81 80 81 81 81 80 80 81 81 81 82 82 81 80 81 81 80 80 80 80 80 80
1043 80 81 81 82 82 81 80 79 78 78 78 79 79 78 77 77 77 77 76 76 76 76 76 76 76 77 77 76 76 75 75 74 74 74 73 73 73 74 74 73 74 74 74 75 74 74 75 74 74 74 75 74 74 74 74 75 74 74 74 73 73 73 73 72 72 72 72 72 72 73 73
1036 73 73 73 72 72 72 72 72 72 72 72 71 71 70 70 70 70 70 70 70 70 71 70 70 69 70 71 71 71 71 71 70 70 69 69 68 69 69 69 70 71 71 71 71 70 69 68 69 69 69 69 69 69 69 69 68 68 68 68 69 69 69 68 67 66 67 67 67 67 67 67
1028 67 67 67 66 65 66 66 67 67 67 67 66 66 65 65 65 66 66 66 67 66 66 66 66 66 66 66 65 65 65 66 66 66 66 67 66 66 66 66 65 65 65 65 65 66 65 65 66 66 65 65 64 64 64 64 64 64 64 65 65 64 64 64 64 64 64 63 63 63 63 63
1021 63 63 63 63 64 64 64 63 63 63 63 63 63 63 63 63 62 62 62 63 62 62 63 63 63 63 63 63 63 63 63 63 63 63 63 63 63 63 63 62 61 61 61 62 62 62 63 63 64 64 64 65 65 65 65 65 65 65 65 66 67 66 66 65 65 65 65 65 66 66 66
1014 66 65 64 63 63 63 63 63 63 63 63 63 62 62 62 62 62 62 62 61 61 62 62 61 61 61 61 60 60 60 59 59 59 60 60 60 61 61 61 60 59 58 59 59 59 58 59 59 59 59 59 59 59 59 59 59 59 58 59 60 61 60 60 60 60 59 59 59 60 60 60
1006 60 60 60 59 59 60 60 60 60 60 60 60 61 61 61 61 61 61 60 60 60 60 60 61 61 60 59 60 60 60 60 60 61 61 60 60 60 60 60 60 60 60 60 59 60 60 60 61 61 60 60 60 61 62 63 63 62 62 63 64 64 65 65 65 65 65 66 66 67 67 67
999 67 67 68 68 68 69 69 69 70 70 71 71 71 71 71 71 70 70 70 70 70 70 70 69 68 67 67 67 66 65 64 63 62 62 62 62 62 62 62 61 61 60 59 59 59 59 60 60 60 59 59 58 58 58 58 58 58 58 58 58 58 57 57 56 57 57 58 58 58 58 57 57
991E7%%%%%%j%%%%j%%%j%%J%J%j%%jJ%j%%%JJj%%Jj%%%%%J%J%%%jjjj%JJ%j%%%%%JJ%j%%%
984E5%%%JJj%%j%%%jj%JJ%%%Jj%j%%%JjJ%%%jj%J%%%%JJ%%%j%j%%%%%%j%%%%%%J%j%%JJj%
976E4%%j%%%jJ%%jJJJ%%j%%%j%%j%%%JJ%%j%J%j%%J%%J%%%j%%%%%%%%jJJ%%%%%%j%%%%JJ%
969E6%%J%%%J%J%J%%J%JJ%%j%%%%%%j%%%jjj%jj%j%%%J%j%j%%Jj%%%%J%J%%%%%J%%J%%%J%
961E9%JJJj%%%%%%%%%%j%j%%jj%j%j%j%%%%%%%%%%%jJj%%%%%%%%J%jj%%%%J%%Jj%%%%J%%j
954E3%%%j%J%%j%j%JJJ%%%jj%%J%%jJ%%%%%jj%%J%%J%%jJ%J%%%%%jj%%%%J%%%J%%%%%j%%j
946E2%J%J%jjj%%%%J%%J%%%%j%%jJ%J%%%%%J%%%%jJ%%%%%%%%%j%%%%jJ%J%%%%%%%%%%%j%%
939E3%%J%%%%%%%%jJ%J%%J%j%jj%J%%%JJJJ%%Jj%J%JK%Jj%%%%%%%J%%%%%%j%%%%j%jjjj%%
$$ plain form
991 57 57 57 57 57 57 57 56 56 56 56 56 55 55 55 55 54 54 54 55 55 56 56 55 55 55 54 55 55 54 54 54 54 55 56 55 55 55 56 55 55 55 55 55 55 56 56 57 57 57 57 56 55 54 53 53 54 55 55 54 54 54 54 54 54 55 56 56 55 55 55 55
984 55 55 55 55 56 57 56 56 56 55 55 55 55 54 53 53 54 55 55 55 55 56 55 55 54 54 54 54 55 54 55 55 55 55 54 53 53 54 54 54 54 54 55 56 56 56 56 55 55 54 54 54 54 54 54 54 53 53 53 53 53 53 53 54 54 53 53 53 54 55 54 54
976 54 54 54 53 53 53 53 52 53 53 53 52 53 54 55 55 55 54 54 54 54 53 53 53 52 52 52 52 53 54 54 54 53 53 54 54 53 53 53 54 54 54 55 55 55 55 54 54 54 54 54 54 54 54 54 53 54 55 55 55 55 55 55 55 54 54 54 54 54 55 56 56
969 56 56 56 57 57 57 57 58 58 59 59 60 60 60 61 61 62 63 63 63 62 62 62 62 62 62 62 61 61 61 61 60 59 58 58 57 56 56 55 55 55 55 56 56 55 55 54 54 54 55 54 54 54 54 54 55 55 56 56 56 56 56 56 57 57 57 58 58 58 58 59 59
961 59 59 60 61 62 61 61 61 61 61 61 61 61 61 61 61 60 60 59 59 59 58 57 57 56 56 55 55 54 54 54 54 54 54 54 54 54 54 54 54 53 54 53 53 53 53 53 53 53 53 53 54 54 53 52 52 52 52 52 53 53 53 54 53 53 53 53 53 54 54 54 53
954 53 53 53 53 52 52 53 53 53 52 52 51 51 52 53 54 54 54 54 53 52 52 52 53 53 53 52 53 53 53 53 53 53 52 51 51 51 52 52 52 53 53 53 52 53 53 54 54 54 54 54 54 53 52 52 52 52 52 53 53 53 53 54 54 54 54 54 54 53 53 53 52
946 52 52 53 53 54 54 53 52 51 51 51 51 51 52 52 52 53 53 53 53 53 52 52 52 51 52 52 53 53 53 53 53 53 54 54 54 54 54 53 54 54 54 54 54 54 54 54 54 54 53 53 53 53 53 52 53 53 54 54 54 54 54 54 54 54 54 54 54 54 53 53 53
939 53 53 53 54 54 54 54 54 54 54 54 54 53 54 54 55 55 55 56 56 55 55 54 53 53 54 54 54 54 55 56 57 58 58 58 59 58 58 59 59 60 62 62 63 62 62 62 62 62 62 62 62 63 63 63 63 63 63 63 62 62 62 62 62 61 61 60 59 58 57 57 57
931E7jJ%jj%j%%j%JJ%%%%%%jJ%%%j%J%%%%%%%%%%%%Jj%j%J%%jJJ%jJ%%%%Jj%%%%%%%jj%%J
923E5%Jj%J%%J%%%j%%%J%j%jJJjJ%%%%%%jJ%%%%J%j%%%%%%jj%%JJ%%j%%%JJ%%%%%%JJ%%%%
916F0%%%J%%JJ%%%JJ%JJJ%J%J%JJJJ%%JJ%J%%%%%j%jjkjjjjjjj%j%%%%%%J%j%%JJ%J%J%%j
908F7JKJJJ%JJJJJ%J%%JJJ%%%%%jj%jjkjjjjjjjkjj%%%%J%%jj%J%%%J%%%%%%%%%%JJ%%%%%
901F8%j%%%JJ%j%%J%%%%%j%%jjJJ%%%%%j%%J%%%%J%J%%%j%%%J%JJ%j%%%%%J%J%%J%J%j%jj
893G2JJJJJj%%j%j%%j%%%j%%%%J%Jj%JJ%J%%%JJ%%%J%JJ%jk%%JJ%%%%%%JJ%JJJJJJ%%JJJ%
886I1J%%%JK%J%%J%%%J%JJ%JJJJJJKKJKKKKJKJJJLKKKJJ%JJKJKKKKJJKKLLJKLKLKLKKKKKL
878A90KLKK%JJ%Jjjjkjkkkklmlmmmonmnmnmmmmklllklklkkkkkkjjjjjj%jjjj%%j%jj%jJ%j
$$ plain form
931 57 56 57 57 56 55 55 54 54 54 53 53 54 55 55 55 55 55 55 55 54 55 55 55 55 54 54 55 55 55 55 55 55 55 55 55 55 55 55 55 56 55 55 54 54 55 55 55 54 55 56 56 55 56 56 56 56 56 57 56 56 56 56 56 56 56 56 55 54 54 54 55
923 55 55 56 55 55 56 56 56 57 57 57 57 56 56 56 56 57 57 56 56 55 56 57 56 57 57 57 57 57 57 57 56 57 57 57 57 57 58 58 57 57 57 57 57 57 57 56 55 55 55 56 57 57 57 56 56 56 56 57 58 58 58 58 58 58 58 59 60 60 60 60 60
916 60 60 60 60 61 61 61 62 63 63 63 63 64 65 65 66 67 68 68 69 69 70 70 71 72 73 74 74 74 75 76 76 77 77 77 77 77 77 76 76 75 74 72 71 70 69 68 67 66 65 65 64 64 64 64 64 64 64 65 65 64 64 64 65 66 66 67 67 68 68 68 67
908 67 68 70 71 72 73 73 74 75 76 77 78 78 79 79 79 80 81 82 82 82 82 82 82 81 80 80 79 78 76 75 74 73 72 71 70 69 67 66 65 65 65 65 65 66 66 66 65 64 64 65 65 65 65 66 66 66 66 66 66 66 66 66 66 66 67 68 68 68 68 68 68
901 68 68 67 67 67 67 68 69 69 68 68 68 69 69 69 69 69 69 68 68 68 67 66 67 68 68 68 68 68 68 67 67 67 68 68 68 68 68 69 69 70 70 70 70 69 69 69 69 70 70 71 72 72 71 71 71 71 71 71 72 72 73 73 73 74 74 75 75 74 74 73 72
893 72 73 74 75 76 77 76 76 76 75 75 74 74 74 73 73 73 73 72 72 72 72 72 73 73 74 73 73 74 75 75 76 76 76 76 77 78 78 78 78 79 79 80 81 81 80 78 78 78 79 80 80 80 80 80 80 80 81 82 82 83 84 85 86 87 88 88 88 89 90 91 91
886 91 92 92 92 92 93 95 95 96 96 96 97 97 97 97 98 98 99 100 100 101 102 103 104 105 106 108 110 111 113 115 117 119 120 122 123 124 125 128 130 132 134 135 136 136 137 138 140 141 143 145 147 149 150 151 153 155 158 161 162 164 167 169 172 174 177 179 181 183 185 187 190
878 190 192 195 197 199 199 200 201 201 202 201 200 199 197 196 194 192 190 188 185 181 178 174 170 166 160 155 151 146 142 137 133 129 125 121 119 116 113 110 108 105 103 100 98 96 94 92 90 88 87 86 85 84 83 82 82 81 80 79 78 78 78 77 77 76 75 75 74 75 75 74
871G4%J%%%j%JJ%%%%j%jJ%%%j%%%jJ%%jjj%jkjjjjjjjjjJ%J%%j%%J%JJJKJJJ%JJKJJKJJJJ
863H1J%jj%j%%kjjj%j%j%j%j%jjjjjJ%J%%J%KJKKKKLLLLMLLMMMMNNNNONNNNONOONOONONPQ
856B34PQRRRJ1J2J2J3J5J6J7K0K0K3K4K6L0L3M0M6N4O6Q0R7J16J32J42J52J62J66J64J58J54
852B277J51J40J23J03R7R0P6O2M5L0J7JJ2M8M7l1j40k12k31k29k19k13k18k23k19k05j82j51
849H46j12p6m9l1j9j0mJNRJ2J5J8K1K6L1L8M5N8P3R3J11J24J36J46J55J59J56J51J47J42J31
846B548J14R7R1Q2O7N3L5K2PpJ1M6L1n6j62k22k37k32k22k21k24k28k23k08j86j52j13q1n6
843C74m1l1k2j8j6j3j1j0rppqqqppooonnmmmklkkjjkjjj%j%J%%J%%%%%%jJ%%Jj%jj%%kjkk
836H7kkkjklklkkkjjjkj%jjj%j%J%%%%J%%JJ%J%JK%JJJJJJJ%JJ%j%jjjjjjkkjkkkkkj%jkj
$$ plain form
871 74 74 75 75 75 75 74 74 75 76 76 76 76 76 75 75 74 75 75 75 75 74 74 74 74 73 74 74 74 73 72 71 71 70 68 67 66 65 64 63 62 61 60 59 60 60 61 61 61 60 60 60 61 61 62 63 64 66 67 68 69 69 70 71 73 74 75 77 78 79 80 81
863 81 82 82 81 80 80 79 79 79 77 76 75 74 74 73 73 72 72 71 71 70 70 69 68 67 66 65 66 66 67 67 67 68 68 70 71 73 75 77 79 82 85 88 91 95 98 101 105 109 113 117 122 127 132 137 143 148 153 158 163 169 174 180 186 191 197 203 208 214 219 226 234
856 234 241 249 258 267 276 287 299 311 324 339 355 372 392 412 435 459 485 515 548 588 634 688 754 834 931 1047 1179 1321 1473 1635 1801 1965 2123 2277
852 2277 2428 2568 2691 2794 2891 2981 3057 3119 3164 3194 3211 3212 3224 3272 3319 3288 3148 2936 2705 2476 2257 2044 1826 1603 1384 1179 997 846
849 846 734 658 609 578 559 549 545 546 551 560 572 587 605 626 652 683 721 766 824 897 990 1101 1225 1361 1507 1662 1821 1977 2128 2275 2417 2548
846 2548 2662 2759 2850 2932 2999 3052 3087 3109 3116 3109 3120 3166 3197 3141 2979 2757 2520 2288 2066 1845 1621 1393 1170 962 776 624 511 430 374
843 374 333 302 280 262 246 233 222 212 203 196 189 181 173 165 158 151 145 139 133 128 123 119 115 111 109 106 104 102 101 100 98 97 96 95 95 94 94 95 95 95 96 96 96 96 96 96 96 95 96 96 96 97 96 96 95 94 94 94 92 91 89 87
836 87 85 83 81 80 78 75 73 70 68 66 64 63 62 61 59 58 58 57 56 55 55 54 54 55 55 55 55 55 56 56 56 57 58 58 59 59 60 62 62 63 64 65 66 67 68 69 69 70 71 71 70 70 69 68 67 66 65 64 62 60 59 57 55 53 51 49 48 48 47 45 44
829D4jj%%j%%%jj%%J%%%%j%%J%J%%J%%J%%%%j%j%JJ%%%%%%j%%%%%%%j%%jjJJ%%j%%%%%%J%
821D1%%%%JJ%j%%J%J%%%%%%%J%jj%J%J%%%jJ%j%jJ%j%%%jJ%%%%%%J%%J%j%j%%Jj%%%%%%%%
814D3%JJ%%%jJ%%%jjj%%%J%%%%jJ%%Jj%j%J%%%%jjj%%JJJ%%%jjJJ%%%%%j%%%%j%%J%%%J%%
806D3%j%%j%%%%%JJjj%%%%%%%JJJ%%jj%%J%%%%%%%%%%%J%j%%j%%%%%J%%j%J%J%%%%J%j%j%
799D3J%%%%%%%%%%%J%%%%JjJj%%%%%%j%JJ%%%%%jJ%%%J%JJJJJJJJKJJKJJJKK%JJ%%J%%%%%
791G1%%jjkklkjkkjjjjj%J%%JK%%%%J%JJJJ%%%J%J%j%%jjjjjjjjkj%jjjjJ%%%J%%%%%%%%J
784D8%j%%JKJ%%JJJJJ%JJ%%%%%%%%%%j%jjj%%jkjkjjjj%%%%%j%%%%%%%%%%%%%%%%%j%jjJ%
776D1J%%%jJ%%%%%j%%%%%%%j%JJJJj%J%jjj%%%%%J%%jj%%J%%%Jj%%%%%%%%%JJ%j%%%%J%%%
$$ plain form
829 44 43 42 42 42 41 41 41 41 40 39 39 39 40 40 40 40 40 39 39 39 40 40 41 41 41 42 42 42 43 43 43 43 43 42 42 41 41 42 43 43 43 43 43 43 43 42 42 42 42 42 42 42 42 41 41 41 40 39 40 41 41 41 40 40 40 40 40 40 40 41 41
821 41 41 41 41 41 42 43 43 42 42 42 43 43 44 44 44 44 44 44 44 44 45 45 44 43 43 44 44 45 45 45 45 44 45 45 44 44 43 44 44 43 43 43 43 42 43 43 43 43 43 43 43 44 44 44 45 45 44 44 43 43 43 44 43 43 43 43 43 43 43 43 43
814 43 43 44 45 45 45 45 44 45 45 45 45 44 43 42 42 42 42 43 43 43 43 43 42 43 43 43 44 43 43 42 42 43 43 43 43 43 42 41 40 40 40 41 42 43 43 43 43 42 41 42 43 43 43 43 43 43 42 42 42 42 42 41 41 41 42 42 42 42 43 43 43
806 43 43 42 42 42 41 41 41 41 41 41 42 43 42 41 41 41 41 41 41 41 41 42 43 44 44 44 43 42 42 42 43 43 43 43 43 43 43 43 43 43 43 43 44 44 43 43 43 42 42 42 42 42 42 43 43 43 42 42 43 43 44 44 44 44 44 45 45 44 44 43 43
799 43 44 44 44 44 44 44 44 44 44 44 44 44 45 45 45 45 45 46 45 46 45 45 45 45 45 45 45 44 44 45 46 46 46 46 46 46 45 46 46 46 46 47 47 48 49 50 51 52 53 54 55 57 58 59 61 62 63 64 66 68 68 69 70 70 70 71 71 71 71 71 71
791 71 71 71 70 69 67 65 62 60 59 57 55 54 53 52 51 50 50 51 51 51 52 54 54 54 54 54 55 55 56 57 58 59 59 59 59 60 60 61 61 60 60 60 59 58 57 56 55 54 53 52 50 49 49 48 47 46 45 46 46 46 46 47 47 47 47 47 47 47 47 47 48
784 48 48 47 47 47 48 50 51 51 51 52 53 54 55 56 56 57 58 58 58 58 58 58 58 58 58 58 58 57 57 56 55 54 54 54 53 51 50 48 47 46 45 44 44 44 44 44 44 43 43 43 43 43 43 43 43 43 43 43 43 43 43 43 43 43 43 42 42 41 40 41 41
776 41 42 42 42 42 41 42 42 42 42 42 42 41 41 41 41 41 41 41 41 40 40 41 42 43 44 43 43 44 44 43 42 41 41 41 41 41 41 42 42 42 41 40 40 40 41 41 41 41 42 41 41 41 41 41 41 41 41 41 41 42 43 43 42 42 42 42 42 43 43 43 43
769D3%%%%j%%%%%%%j%%%%%%J%%%j%J%j%%%J%%%jJ%%j%JJ%%%j%%%%%%%j%j%%%J%%J%%j%%%J
$$ plain form
769 43 43 43 43 43 42 42 42 42 42 42 42 42 41 41 41 41 41 41 41 42 42 42 42 41 41 42 42 41 41 41 41 42 42 42 42 41 42 42 42 41 41 42 43 43 43 43 42 42 42 42 42 42 42 42 41 41 40 40 40 40 41 41 41 42 42 42 41 41 41 41 42
$$ [...]
-2638F0
##END=		$$ NMR SPECTRUM
##END=		$$ LINK
