##TITLE=	RP329 char.10.fid
##JCAMP-DX=	6.0	$$ MestReNova 14.3.3-33362
##DATA TYPE=	LINK
##BLOCKS=	1    
##ORIGIN=	Mestrelab Research S.L.
##OWNER=	hrzepa
##$MNOVA/METADATA=	(DOCUMENT,BASE64)
eyJuYW1lIjoiL1VzZXJzL2hyemVwYS9MaWJyYXJ5L01vYmlsZSBEb2N1bWVudHMvY29tfmFwcGxlfkN
sb3VkRG9jcy9TaGVwcGFyZC9OTVIgZmlsZXMgemlwcy0yLzIxLzIxLUgubW5vdmEiLCJwYWdlcyI6W3
siaXRlbXMiOlsiMSIgICAgIF19XX0=
##TITLE=	RP329 char.10.fid
##JCAMP-DX=	6.0	$$ MestReNova 14.3.3-33362
##DATA TYPE=	NMR SPECTRUM
##DATA CLASS=	XYDATA
##BLOCK_ID=	1
##ORIGIN=	Bruker BioSpin GmbH
##OWNER=	nmrsu
##NUMDIM=	1
##$MNOVA/METADATA=	(ITEM,BASE64)
eyJhbmdsZSI6MCwiYXhlcyI6eyJ4Ijp7Im1heCI6MTYuMDY0MjU5OTk5OTM5MTI1LCJtaW4iOi0zLjc
2Njk0MjMzOTE1NjYyMjZ9LCJ5Ijp7Im1heCI6NTU3MTcuMjQzMTY0MDYyNSwibWluIjotNTAxNS4zNz
g2NjIxMDkzNzV9fSwicG9pbnRzIjpbeyJ4Ijo1MzIxLCJ5Ijo1ODM1fSx7IngiOjg3MjIsInkiOjU4M
zV9LHsieCI6ODcyMiwieSI6ODIwOH0seyJ4Ijo1MzIxLCJ5Ijo4MjA4fSx7IngiOjUzMjEsInkiOjU4
MzV9XSwieiI6MH0=
##.OBSERVE FREQUENCY=	700.35432466099996418
##.OBSERVE NUCLEUS=	^1H
##.SOLVENT NAME=	CDCl3
##.PULSE SEQUENCE=	zg30
##LONGDATE=	2023/05/31 04:06:24.000
##.ACQUISITIONMODE=	SIMULTANEOUS (DQD)
##$ORIGINAL FORMAT=	Bruker XWIN-NMR
##$MNOVA/SCALES_VERSION=	9
##$PARAMETER FILE=	(acqus, ASCII, /private/var/folders/f6/rjf_tdyn2v98c5c0wvkgn4s80000gq/T/dBoka3tCT9eMNxR9h0qcKw/10/acqus, 0)
$$ ##TITLE= Parameter file, TopSpin 4.1.3
$$ ##JCAMPDX= 5.0
$$ ##DATATYPE= Parameter Values
$$ ##NPOINTS= 1	$$ modification sequence number
$$ ##ORIGIN= Bruker BioSpin GmbH
$$ ##OWNER= nmrsu
$$ $$ 2023-05-31 04:06:12.323 +0100  nmrsu@CZC7167VR1
$$ $$ Z:/700/data/tds/nmr/RP329 char/10/acqus
$$ $$ process C:\Bruker\TopSpin4.1.3\prog\mod\dirdata.exe
$$ ##$ACQT0= -2.0981556054023
$$ ##$AMP= (0..31)
$$ 100 100 100 100 100 100 100 100 100 100 100 100 100 100 100 100 100 100
$$ 100 100 100 100 100 100 100 100 100 100 100 100 100 100
$$ ##$AMPCOIL= (0..32)
$$ -1 0 0 0 0 0 0 0 0 0 0 0 0 0 0 0 0 0 0 0 0 0 0 0 0 0 0 0 0 0 0 0 0
$$ ##$AQSEQ= 0
$$ ##$AQ_mod= 3
$$ ##$AUNM= <au_zg>
$$ ##$AUTOPOS= <28 >
$$ ##$BF1= 700.349999998
$$ ##$BF2= 700.349999998
$$ ##$BF3= 700.349999998
$$ ##$BF4= 700.349999998
$$ ##$BF5= 700.349999998
$$ ##$BF6= 700.349999998
$$ ##$BF7= 700.349999998
$$ ##$BF8= 700.349999998
$$ ##$BWFAC= (0..63)
$$ 0 0 0 0 0 0 0 0 0 0 0 0 0 0 0 0 0 0 0 0 0 0 0 0 0 0 0 0 0 0 0 0 0 0 0 0
$$ 0 0 0 0 0 0 0 0 0 0 0 0 0 0 0 0 0 0 0 0 0 0 0 0 0 0 0 0
$$ ##$BYTORDA= 0
$$ ##$CHANFCU= (0..24)
$$ 0 1 0 0 0 0 0 0 0 0 0 0 0 0 0 0 0 0 0 0 0 0 0 0 0
$$ ##$CHANREC= (0..24)
$$ 0 0 0 0 0 0 0 0 0 0 0 0 0 0 0 0 0 0 0 0 0 0 0 0 0
$$ ##$CHEMSTR= <none>
$$ ##$CNST= (0..63)
$$ 1 1 1 1 1 1 1 1 1 1 1 1 1 1 1 1 1 1 1 1 1 1 1 1 1 1 1 1 1 1 1 1 1 1 1 1
$$ 1 1 1 1 1 1 1 1 1 1 1 1 1 1 1 1 1 1 1 1 1 1 1 1 1 1 1 1
$$ ##$CPDPRG= (0..8)
$$ <> <> <> <> <> <> <> <> <>
$$ ##$D= (0..63)
$$ 0 1 0 0 0 0 0 0 0 0 0 0 0 0 0 0 0.0002 0 0 0 0 0 0 0 0 0 0 0 0 0 0 0 0
$$ 0 0 0 0 0 0 0 0 0 0 0 0 0 0 0 0 0 0 0 0 0 0 0 0 0 0 0 0 0 0 0
$$ ##$DATE= 1685502384
$$ ##$DATE_START= 1685502341
$$ ##$DE= 6.901845
$$ [...]
$$ ##$ShimPowRng3= (0..63)
$$ 1 1 1 1 1 1 1 1 1 1 1 1 1 1 1 1 1 1 1 1 1 1 1 1 1 1 1 1 1 1 1 1 1 1 1 1
$$ 1 1 1 1 0 0 0 0 0 0 0 0 0 0 0 0 0 0 0 0 0 0 0 0 0 0 0 0
$$ ##$ShimPowType1= 8
$$ ##$ShimPowType2= 8
$$ ##$ShimPowType3= 0
$$ ##$ShimPowType4= 0
$$ ##$ShimPowType5= 0
$$ ##$ShimPowType6= 0
$$ ##$ShimPowType7= 0
$$ ##$ShimPowType8= 0
$$ ##$ShimSysActGrad= (0..63)
$$ 1 2 3 4 13 5 7 11 10 9 6 8 12 18 19 20 21 15 22 23 24 14 25 16 26 17 27
$$ 28 31 32 33 34 35 36 37 38 0 0 0 0 0 0 0 0 0 0 0 0 0 0 0 0 0 0 0 0 0 0
$$ 0 0 0 0 0 0
$$ ##$ShimSysAngle= <>
$$ ##$ShimSysFunc= (0..63)
$$ 1 2 3 4 5 6 7 8 9 10 0 37 38 35 16 15 14 13 12 11 28 27 26 25 24 23 36
$$ 22 30 29 20 21 34 33 32 31 17 18 19 0 0 0 0 0 0 0 0 0 0 0 0 0 0 0 0 0 0
$$ 0 0 0 0 0 0 0
$$ ##$ShimSysMatId= <292722da.dat>
$$ ##$ShimSysMatrix= 1
$$ ##$ShimSysMinMaxUG= 130000
$$ ##$ShimSysOffset= <29 mm>
$$ ##$ShimSysType= 4
$$ ##$ShimUnit= 3
$$ ##$SpectrOsVersion= <4.1.156.20210628>
$$ ##$TCubeEth= <192.168.180.38>
$$ ##$TCubeSeqDevice= <>
$$ ##$TOSITY= <no>
$$ ##$TRIPLO2= 0
$$ ##$TopSpinVersion= <TopSpin 4.1.3>
$$ ##$TrxFreqFormula= (0..23)
$$ <TrxFreqFormula(2.0,700350000.000000,'TRX',Trx(1.0,'TRX 1200.1',1,5.000000,1290.000000))>
$$ <TrxFreqFormula(2.0,700350000.000000,'TRX',Trx(1.0,'TRX 1200.2',1,5.000000,1290.000000))>
$$ <TrxFreqFormula(2.0,700350000.000000,'TRX',Trx(1.0,'TRX 1200.3',1,5.000000,1290.000000))>
$$ <> <> <> <> <> <> <> <> <> <> <> <> <> <> <> <> <> <> <> <> <>
$$ ##$TrxPN= (0..23)
$$ <Z148391> <Z148391> <Z148391> <> <> <> <> <> <> <> <> <> <> <> <> <> <>
$$ <> <> <> <> <> <> <>
$$ ##$TrxSN= (0..23)
$$ <00336> <00337> <00342> <> <> <> <> <> <> <> <> <> <> <> <> <> <> <> <>
$$ <> <> <> <> <>
$$ ##$VCubeEth= (0..23)
$$ <no> <no> <no> <no> <no> <no> <no> <no> <no> <no> <no> <no> <no> <no> <no>
$$ <no> <no> <no> <no> <no> <no> <no> <no> <no>
$$ ##$VTU= 2
$$ ##$VTUETH= <192.168.99.11>
$$ ##$VTUTY= <no>
$$ ##$ValueLine= no
$$ ##$VpuPN= (0..23)
$$ <no> <no> <no> <no> <no> <no> <no> <no> <no> <no> <no> <no> <no> <no> <no>
$$ <no> <no> <no> <no> <no> <no> <no> <no> <no>
$$ ##$VpuSN= (0..23)
$$ <no> <no> <no> <no> <no> <no> <no> <no> <no> <no> <no> <no> <no> <no> <no>
$$ <no> <no> <no> <no> <no> <no> <no> <no> <no>
$$ ##$WBREFAM= (0..31)
$$ 99.8 100 100 100 100 100 100 100 100 100 100 100 100 100 100 100 100 100
$$ 100 100 100 100 100 100 100 100 100 100 100 100 100 100
$$ ##$WBREFLM= (0..31)
$$ 1 0 1 0 0 0 0 0 0 0 0 0 0 0 0 0 0 0 0 0 0 0 0 0 0 0 0 0 0 0 0 0
$$ ##$WBREFPH= (0..31)
$$ 0.05 0 0 0 0 0 0 0 0 0 0 0 0 0 0 0 0 0 0 0 0 0 0 0 0 0 0 0 0 0 0 0
$$ ##$WBSGU= (0..31)
$$ 1 2 4 0 0 0 0 0 0 0 0 0 0 0 0 0 0 0 0 0 0 0 0 0 0 0 0 0 0 0 0 0
$$ ##END=
$$ 
##$DECIM=	1440
##$DSPFVS=	21
##XUNITS=	HZ
##YUNITS=	ARBITRARY UNITS
##FIRSTX=	11250.604788156719223
##LASTX=	-2638.1781369192458442
##DELTAX=	-0.10596381293402784562
##XFACTOR=	1
##YFACTOR=	1.5458224690618609376
##FIRSTY=	86.3024749755859375
##MINY=	49.73947906494140625
##MAXY=	50651.96484375
##NPOINTS=	131072
##XYDATA=	(X++(Y..Y))
$$ [...]
$$ plain form
6959 82 82 81 81 82 83 83 82 81 81 81 82 82 82 82 83 83 82 81 81 81 81 81 81 82 82 82 81 82 82 83 83 83 83 83 82 82 82 81 81 81 81 82 83 83 82 82 82 82 82 81 81 81 82 82 81 82 82 81 81 80 81 81 81 82 82 82 82 82 82 82
6952 82 82 82 82 82 82 82 82 82 82 83 83 82 82 82 81 81 81 81 82 82 82 83 82 82 82 83 83 82 82 83 83 83 82 82 81 81 81 81 81 81 82 82 82 82 82 82 81 81 82 82 82 81 81 82 82 83 83 83 83 84 83 83 83 83 83 83 83 83 83 83
6944 83 83 83 83 83 82 82 82 82 82 82 83 83 82 82 81 81 82 82 82 82 82 82 81 81 81 81 81 81 81 81 81 81 81 81 81 81 81 81 81 81 82 82 83 83 82 82 82 81 81 81 81 81 81 82 81 81 81 81 81 82 82 82 83 83 83 82 82 82 81 82
6937 82 82 82 82 81 81 81 81 81 81 80 80 80 80 81 81 81 81 81 81 81 81 82 81 81 81 81 81 81 81 81 81 81 81 81 82 82 82 82 82 82 82 82 82 82 81 81 81 81 81 82 81 81 81 81 80 80 81 81 81 81 81 81 81 81 81 81 81 81 82 82
6930 82 82 82 82 82 82 82 83 83 83 83 83 83 83 83 83 83 82 82 82 82 82 82 82 82 82 82 82 82 82 81 82 82 82 82 82 82 82 82 82 82 82 83 83 83 83 83 82 82 82 82 82 82 82 82 81 81 81 82 82 83 82 82 82 81 81 82 82 83 83 83
6922 83 83 83 83 82 82 82 82 82 82 82 82 82 82 82 82 82 81 81 81 81 81 81 81 81 81 81 80 80 80 80 80 80 81 81 82 82 81 82 82 81 81 81 82 82 82 82 81 81 81 81 81 81 82 82 82 82 82 82 82 81 81 82 82 82 81 81 81 81 81 82
6915 82 82 82 82 81 81 81 81 81 81 80 80 81 81 81 81 81 81 80 81 81 81 81 81 82 82 83 83 84 83 83 83 83 82 82 82 81 81 82 81 81 81 81 82 82 82 82 82 83 82 82 82 82 82 82 82 82 82 82 82 82 82 83 82 82 81 81 81 81 81 82
6907 82 82 82 82 82 81 81 81 81 81 81 81 81 81 81 81 81 81 82 82 82 82 82 82 82 82 82 82 82 81 81 81 81 81 81 81 81 81 81 81 81 81 81 81 81 81 81 81 81 81 81 81 80 80 80 81 81 81 81 81 81 82 81 81 81 81 81 81 81 81 81
$$ packed form
6959H2%j%JJ%jj%%J%%%J%jj%%%%%J%%jJ%J%%%%j%%j%%%JJ%j%%%%j%%J%jJ%j%jJ%%J%%%%%%
6952H2%%%%%%%%%J%j%%j%%%J%%Jj%%J%j%J%%j%j%%%%%J%%%%%j%J%%j%J%J%%%Jj%%%%%%%%%
6944H3%%%%j%%%%%J%j%j%J%%%%%j%%%%%%%%%%%%%%%%%J%J%j%%j%%%%%Jj%%%%J%%J%%j%%jJ
6937H2%%%j%%%%%j%%%J%%%%%%%Jj%%%%%%%%%%%J%%%%%%%%%j%%%%Jj%%%j%J%%%%%%%%%%%J%
6930H2%%%%%%J%%%%%%%%%j%%%%%%%%%%%%jJ%%%%%%%%%%J%%%%j%%%%%%%j%%J%Jj%%j%J%J%%
6922H3%%%j%%%%%%%%%%%%j%%%%%%%%%j%%%%%J%J%jJ%j%%J%%%j%%%%%J%%%%%%j%J%%j%%%%J
6915H2%%%j%%%%%j%J%%%%%jJ%%%%J%J%Jj%%%j%%j%Jj%%%J%%%%Jj%%%%%%%%%%%%Jj%j%%%%J
6907H2%%%%j%%%%%%%%%%%%J%%%%%%%%%%j%%%%%%%%%%%%%%%%%%%%%%j%%J%%%%%Jj%%%%%%%%
$$ plain form
6900 81 81 81 81 81 81 81 81 81 82 82 82 82 82 82 82 82 82 82 82 82 82 82 82 81 82 83 83 83 83 83 82 82 82 82 82 82 82 81 81 81 82 82 83 83 83 82 82 82 82 82 82 82 82 82 82 82 82 81 81 81 81 82 82 82 82 82 82 82 82 82
6893 82 82 82 82 82 82 82 82 81 82 82 82 82 82 81 81 81 81 81 82 82 82 82 82 82 82 83 83 83 82 82 82 83 82 82 82 81 81 81 81 81 82 83 83 83 83 83 82 82 82 82 82 82 83 83 83 82 82 82 82 82 83 83 82 82 82 82 82 82 82 82
6885 82 82 82 82 83 83 83 83 83 82 82 81 81 81 82 82 82 82 82 81 81 81 81 81 81 81 81 81 81 82 82 82 81 81 81 82 82 82 82 82 81 81 81 81 81 82 82 82 82 82 81 81 81 81 80 80 80 80 80 81 81 81 81 81 81 81 81 81 81 81 81
6878 81 81 81 81 81 81 81 81 81 81 81 81 81 81 81 81 81 82 82 82 82 82 82 82 83 83 83 82 82 82 82 82 82 82 82 82 82 82 82 82 83 83 83 83 83 82 82 82 81 81 81 81 80 80 81 81 81 81 81 81 81 81 81 81 81 81 81 81 82 81 81
6870 81 81 81 81 81 80 80 80 80 80 80 80 81 81 81 81 81 81 81 81 81 81 81 81 81 81 81 82 82 82 82 82 82 81 81 81 80 81 81 82 82 82 83 83 83 83 83 83 82 82 82 81 81 81 81 81 82 83 83 82 82 81 81 81 81 81 82 82 82 82 82
6863 82 82 81 81 81 81 81 81 81 81 81 81 82 82 82 82 81 82 82 81 82 82 83 82 82 82 82 82 82 82 82 82 83 82 82 81 81 81 80 80 81 82 82 82 82 81 81 81 81 81 81 81 81 81 82 82 82 82 82 82 82 81 81 81 81 81 81 81 81 81 81
6855 81 80 80 80 81 82 82 82 82 81 81 81 81 81 81 82 82 82 82 82 81 82 83 83 82 82 82 82 82 83 82 82 82 82 82 82 82 83 83 83 84 84 83 83 82 82 82 82 82 82 82 82 82 82 82 82 82 82 82 82 82 82 83 82 82 82 82 82 82 82 82
6848 82 82 82 82 82 81 81 81 81 81 81 82 82 82 82 83 83 84 84 83 82 82 82 82 82 82 81 81 81 80 80 80 81 81 81 81 81 81 81 81 82 82 82 82 82 82 82 82 82 82 82 82 83 83 83 82 82 82 82 82 82 82 82 81 81 81 81 81 81 81 81
$$ packed form
6900H1%%%%%%%%J%%%%%%%%%%%%%%jJJ%%%%j%%%%%%j%%J%J%%j%%%%%%%%%%%j%%%J%%%%%%%%
6893H2%%%%%%%jJ%%%%j%%%%J%%%%%%J%%j%%Jj%%j%%%%JJ%%%%j%%%%%J%%j%%%%J%j%%%%%%%
6885H2%%%J%%%%j%j%%J%%%%j%%%%%%%%%J%%j%%J%%%%j%%%%J%%%%j%%%j%%%%J%%%%%%%%%%%
6878H1%%%%%%%%%%%%%%%%J%%%%%%J%%j%%%%%%%%%%%%J%%%%j%%j%%%j%J%%%%%%%%%%%%%Jj%
6870H1%%%%j%%%%%%J%%%%%%%%%%%%%%J%%%%%j%%jJ%J%%J%%%%%j%%j%%%%JJ%j%j%%%%J%%%%
6863H2%j%%%%%%%%%J%%%jJ%jJ%Jj%%%%%%%%Jj%j%%j%JJ%%%j%%%%%%%%J%%%%%%j%%%%%%%%%
6855H1j%%JJ%%%j%%%%%J%%%%jJJ%j%%%%Jj%%%%%%J%%J%j%j%%%%%%%%%%%%%%%%%Jj%%%%%%%
6848H2%%%%j%%%%%J%%%J%J%jj%%%%%j%%j%%J%%%%%%%J%%%%%%%%%%%J%%j%%%%%%%j%%%%%%%
$$ plain form
6841 81 81 82 82 81 82 83 82 82 81 81 80 80 80 80 80 81 81 82 82 82 82 82 82 81 81 81 81 81 82 82 82 82 82 83 83 82 82 82 82 82 82 82 82 82 82 82 82 82 82 81 81 81 82 82 82 83 82 82 81 81 81 81 82 81 81 81 81 81 82 82
6833 82 82 82 82 82 82 82 82 81 81 80 80 81 81 81 81 81 81 81 81 81 81 81 81 81 81 81 81 81 82 82 82 81 81 82 82 82 82 81 81 82 82 81 81 81 81 81 81 81 82 82 82 83 83 82 82 81 81 81 81 82 83 82 82 81 81 81 81 82 82 82
6826 82 82 83 83 83 83 83 82 82 82 82 82 82 82 82 81 82 82 82 82 82 82 81 81 82 81 81 80 80 80 80 80 81 81 81 81 81 81 81 81 81 82 82 82 82 82 81 81 81 81 81 82 82 82 83 83 82 82 82 82 82 82 81 81 81 81 81 81 81 81 81
6818 81 81 82 82 82 82 82 82 82 82 83 83 83 83 83 82 82 82 82 82 81 81 81 81 81 81 81 81 81 81 81 81 81 81 81 82 82 82 82 82 82 82 82 82 82 82 81 81 81 81 81 81 82 82 82 82 82 82 81 81 81 81 81 81 81 81 81 81 80 80 80
6811 80 80 81 81 81 82 82 81 80 80 80 80 80 81 81 82 82 82 81 82 82 82 81 82 82 82 82 82 82 82 81 81 81 81 82 82 82 82 82 82 82 82 82 82 82 82 82 82 82 82 82 82 82 81 81 80 80 81 81 81 81 81 81 81 81 81 81 81 81 82 82
6804 82 82 82 82 81 81 80 80 80 81 81 81 81 81 82 82 81 81 81 81 82 82 82 82 82 82 81 81 81 81 81 81 82 82 82 82 82 82 81 81 81 81 81 82 82 82 81 81 80 81 81 81 82 82 82 82 82 82 82 82 82 82 81 81 81 81 82 82 82 82 82
6796 82 81 81 81 82 82 82 82 82 82 81 81 81 81 81 81 82 82 82 82 81 81 81 81 81 81 81 81 81 81 81 81 81 81 81 81 82 81 81 81 81 81 82 82 81 81 82 82 82 82 82 81 81 81 81 81 82 82 82 81 81 81 81 82 82 82 81 81 81 81 82
6789 82 81 81 80 80 80 80 80 81 81 81 81 81 81 81 81 81 81 82 82 82 82 82 82 83 82 82 81 81 81 81 81 81 81 80 80 80 81 81 81 81 81 81 81 81 81 81 81 81 81 81 81 81 81 81 81 81 81 81 81 81 81 80 80 80 81 81 81 82 82 82
$$ packed form
6841H1%J%jJJj%j%j%%%%J%J%%%%%j%%%%J%%%%J%j%%%%%%%%%%%%%j%%J%%Jj%j%%%Jj%%%%J%
6833H2%%%%%%%j%j%J%%%%%%%%%%%%%%%%J%%j%J%%%j%J%j%%%%%%J%%J%j%j%%%JJj%j%%%J%%
6826H2%J%%%%j%%%%%%%jJ%%%%%j%Jj%j%%%%J%%%%%%%%J%%%%j%%%%J%%J%j%%%%%j%%%%%%%%
6818H1%J%%%%%%%J%%%%j%%%%j%%%%%%%%%%%%%%J%%%%%%%%%%j%%%%%J%%%%%j%%%%%%%%%j%%
6811H0%J%%J%jj%%%%J%J%%jJ%%jJ%%%%%%j%%%J%%%%%%%%%%%%%%%%%%j%j%J%%%%%%%%%%%J%
6804H2%%%j%j%%J%%%%J%j%%%J%%%%%j%%%%%J%%%%%j%%%%J%%j%jJ%%J%%%%%%%%%j%%%J%%%%
6796H2j%%J%%%%%j%%%%%J%%%j%%%%%%%%%%%%%%%Jj%%%%J%j%J%%%%j%%%%J%%j%%%J%%j%%%J
6789H2j%j%%%%J%%%%%%%%%J%%%%%Jj%j%%%%%%j%%J%%%%%%%%%%%%%%%%%%%%%%%%j%%J%%J%%
$$ plain form
6781 82 81 81 81 81 81 81 82 82 82 82 82 82 81 81 81 82 82 81 81 81 81 81 82 81 81 82 81 81 81 81 81 82 81 81 81 81 82 82 81 81 81 81 80 80 80 80 81 81 82 82 82 81 81 81 81 81 81 81 81 81 81 81 81 81 81 81 81 81 81 81
6774 81 81 82 82 82 81 81 81 81 80 80 80 80 81 81 82 82 82 82 83 82 82 81 82 82 81 81 81 81 81 81 81 81 81 81 80 80 80 80 81 81 80 80 80 81 81 81 81 81 81 82 82 82 81 81 80 81 81 81 81 81 81 81 82 82 82 81 81 80 81 81
6766 81 81 81 81 81 81 80 80 81 81 81 81 81 81 81 81 81 82 82 81 81 81 82 82 82 82 81 81 81 81 81 81 81 81 81 81 81 81 81 81 81 82 82 82 82 81 81 82 82 82 82 82 82 81 81 81 81 81 81 81 81 81 82 82 82 82 82 82 82 82 82
6759 82 82 81 80 80 81 81 80 80 81 81 81 81 81 81 81 81 81 81 80 81 81 82 82 81 81 81 81 81 81 81 81 81 81 82 82 83 83 82 82 82 82 82 82 82 81 81 81 81 82 81 81 82 82 82 82 82 82 82 82 82 82 82 81 81 80 80 80 80 80 80
6752 80 81 81 81 81 81 81 80 81 81 81 81 81 81 81 81 81 82 82 82 82 82 82 82 81 81 80 80 80 80 80 80 80 80 81 81 81 81 81 81 81 80 80 80 80 80 80 81 81 81 81 82 82 82 81 81 81 81 81 80 80 80 81 81 81 81 80 81 81 81 81
6744 81 81 81 81 80 80 80 80 80 80 80 80 80 80 80 81 81 81 80 80 80 80 81 81 81 81 81 81 81 82 82 82 82 82 82 82 82 82 82 82 82 81 81 81 82 82 82 81 81 81 82 81 81 81 81 81 81 81 81 81 80 80 80 80 81 81 81 81 81 80 80
6737 80 81 81 81 82 81 81 81 81 81 81 81 81 81 81 81 81 81 81 81 81 81 81 82 82 82 81 81 80 81 81 81 81 82 83 82 82 82 83 83 82 82 82 82 82 82 81 81 81 81 81 81 81 81 82 81 81 81 80 80 80 80 80 80 80 80 80 80 81 81 81
6729 81 81 81 81 80 81 81 81 81 81 81 81 81 81 81 81 81 81 81 81 81 82 82 82 81 81 81 81 81 81 81 81 81 81 81 81 81 81 81 81 81 81 81 81 81 81 81 82 82 82 82 82 81 82 82 82 82 82 82 81 81 81 81 81 81 81 81 82 82 82 81
$$ packed form
6781H2j%%%%%J%%%%%j%%J%j%%%%Jj%Jj%%%%Jj%%%J%j%%%j%%%J%J%%j%%%%%%%%%%%%%%%%%%
6774H1%J%%j%%%j%%%J%J%%%Jj%jJ%j%%%%%%%%%j%%%J%j%%J%%%%%J%%j%jJ%%%%%%J%%j%jJ%
6766H1%%%%%j%J%%%%%%%%J%j%%J%%%j%%%%%%%%%%%%%%J%%%j%J%%%%%j%%%%%%%%J%%%%%%%%
6759H2%jj%J%j%J%%%%%%%%%jJ%J%j%%%%%%%%%J%J%j%%%%%%j%%%Jj%J%%%%%%%%%%j%j%%%%%
6752H0J%%%%%jJ%%%%%%%%J%%%%%%j%j%%%%%%%J%%%%%%j%%%%%J%%%J%%j%%%%j%%J%%%jJ%%%
6744H1%%%j%%%%%%%%%%J%%j%%%J%%%%%%J%%%%%%%%%%%j%%J%%j%%Jj%%%%%%%%j%%%J%%%%j%
6737H0J%%Jj%%%%%%%%%%%%%%%%%J%%j%jJ%%%JJj%%J%j%%%%%j%%%%%%%Jj%%j%%%%%%%%%J%%
6729H1%%%jJ%%%%%%%%%%%%%%%J%%j%%%%%%%%%%%%%%%%%%%%%%J%%%%jJ%%%%%j%%%%%%%J%%j
$$ plain form
6722 81 81 81 81 81 81 81 81 81 81 81 81 81 81 82 81 81 81 80 80 80 80 80 81 81 81 81 82 82 82 82 82 81 81 81 81 81 81 81 82 82 82 82 82 82 81 81 81 81 81 81 81 82 82 82 82 82 82 82 81 81 81 82 82 82 81 81 82 82 82 83
6715 83 82 82 82 81 81 81 82 81 81 81 81 81 81 81 81 81 81 81 82 82 81 81 81 81 81 81 81 81 81 81 81 81 81 80 80 80 80 80 80 80 80 81 81 81 81 81 80 80 80 80 80 81 81 81 81 82 82 81 81 81 81 81 81 81 81 81 81 81 81 81
6707 81 81 81 81 80 80 81 81 82 82 82 81 81 81 81 81 81 81 81 81 81 81 81 81 81 81 81 81 82 82 82 82 82 81 81 81 81 81 81 81 81 81 81 81 81 81 81 81 81 81 81 81 81 80 80 81 81 81 82 82 81 81 80 80 80 81 81 82 82 82 82
6700 82 82 82 81 80 80 80 80 81 81 81 80 80 80 80 80 80 80 80 80 80 80 81 81 81 82 81 81 81 81 81 81 81 81 80 80 80 81 81 81 82 82 81 81 81 81 81 80 81 81 81 81 81 81 81 81 81 81 81 81 81 81 81 81 81 81 81 81 81 81 81
6692 81 81 81 81 81 82 82 81 81 81 81 81 80 80 80 80 80 80 80 80 80 80 81 81 81 81 81 81 81 80 80 81 81 81 82 81 81 81 81 81 81 81 81 81 81 82 82 81 81 81 81 81 82 82 82 82 82 82 82 81 81 81 81 81 81 81 81 82 82 82 82
6685 82 81 81 80 80 80 80 80 80 80 80 80 80 80 80 81 81 81 81 81 81 81 81 81 81 81 81 81 80 80 81 81 81 81 81 81 81 81 82 81 81 80 80 80 81 81 81 81 81 81 81 81 81 81 81 81 81 81 81 81 82 82 82 81 81 81 81 81 80 80 81
6677 81 82 82 81 81 81 81 81 80 81 81 81 81 82 82 82 82 82 81 81 82 82 82 82 81 80 80 81 81 81 81 81 82 82 81 81 81 80 80 80 80 80 81 81 81 81 81 81 81 81 81 81 80 80 80 80 80 80 81 81 81 81 81 81 80 81 81 81 81 81 80
6670 80 80 80 80 80 80 80 80 80 80 80 80 80 80 80 80 79 80 80 80 80 80 80 80 80 80 80 80 80 81 81 80 80 81 81 81 82 81 81 80 80 80 80 80 80 80 80 80 80 80 80 81 81 80 80 80 81 81 81 81 81 81 82 82 82 82 82 82 81 81 81
$$ packed form
6722H1%%%%%%%%%%%%%Jj%%j%%%%J%%%J%%%%j%%%%%%J%%%%%j%%%%%%J%%%%%%j%%J%%j%J%%J
6715H3j%%j%%Jj%%%%%%%%%%J%j%%%%%%%%%%%%j%%%%%%%J%%%%j%%%%J%%%J%j%%%%%%%%%%%%
6707H1%%%j%J%J%%j%%%%%%%%%%%%%%%%J%%%%j%%%%%%%%%%%%%%%%%%%j%J%%J%j%j%%J%J%%%
6700H2%%jj%%%J%%j%%%%%%%%%%J%%Jj%%%%%%%j%%J%%J%j%%%%jJ%%%%%%%%%%%%%%%%%%%%%%
6692H1%%%%J%j%%%%j%%%%%%%%%J%%%%%%j%J%%Jj%%%%%%%%%J%j%%%%J%%%%%%j%%%%%%%J%%%
6685H2j%j%%%%%%%%%%%J%%%%%%%%%%%%j%J%%%%%%%Jj%j%%J%%%%%%%%%%%%%%%J%%j%%%%j%J
6677H1J%j%%%%jJ%%%J%%%%j%J%%%jj%J%%%%J%j%%j%%%%J%%%%%%%%%j%%%%%J%%%%%jJ%%%%j
6670H0%%%%%%%%%%%%%%%jJ%%%%%%%%%%%J%j%J%%Jj%j%%%%%%%%%%%J%j%%J%%%%%J%%%%%j%%
$$ plain form
6663 81 81 81 81 81 82 82 82 81 81 81 81 81 81 81 81 81 81 81 81 81 81 81 81 81 81 81 81 81 80 80 80 80 80 80 81 81 81 81 81 81 81 81 80 80 79 79 80 80 80 80 80 80 80 80 81 81 81 82 82 82 82 82 82 81 81 81 81 81 81 81
6655 81 81 81 81 82 82 82 82 82 82 81 81 81 81 81 81 81 81 81 80 80 80 80 81 81 81 81 81 81 81 81 81 81 81 81 81 81 81 81 81 81 81 81 81 81 81 81 81 81 81 81 81 81 81 80 80 80 80 80 80 80 80 80 80 80 80 81 81 81 81 81
6648 81 80 80 80 80 81 81 81 81 81 81 81 80 81 81 82 82 82 82 82 82 82 82 82 82 82 81 81 81 81 81 81 81 81 81 81 81 82 82 81 81 81 81 81 81 81 81 81 82 82 82 82 81 80 80 81 81 81 81 81 81 81 80 80 80 80 81 81 82 81 81
6640 81 81 81 81 80 80 79 80 80 80 81 81 81 81 81 81 81 81 81 81 81 81 81 81 81 81 81 81 80 80 80 80 80 81 81 80 80 81 81 81 81 81 81 81 81 81 81 81 81 81 81 82 81 81 80 80 81 81 81 81 81 81 82 82 82 82 82 82 81 81 82
6633 82 82 82 82 82 82 82 82 82 81 81 81 81 81 80 79 79 79 79 79 80 80 81 81 81 81 81 81 80 80 79 80 80 80 80 80 80 81 81 81 80 80 80 80 80 81 81 81 81 81 81 81 81 81 81 81 81 80 80 81 81 81 81 82 82 81 81 82 82 82 81
6625 81 81 81 81 80 80 80 80 80 80 80 81 81 80 80 80 80 80 80 80 80 81 81 81 81 81 81 80 80 80 80 81 81 81 81 81 81 80 81 81 81 81 81 81 82 82 81 81 81 81 81 81 81 81 81 81 80 81 81 82 81 81 80 80 80 80 80 81 81 81 81
6618 81 80 79 80 80 80 81 81 81 81 80 81 81 81 82 82 81 81 81 81 81 81 81 80 80 80 80 80 80 80 80 80 80 80 80 80 80 80 81 80 80 80 79 80 80 80 81 81 81 81 81 81 81 81 80 80 80 81 81 82 82 82 81 81 80 80 81 81 82 82 81
6611 81 81 81 81 81 81 81 81 81 81 82 81 81 81 81 81 81 81 81 81 81 80 80 80 80 80 80 80 80 81 81 80 80 80 80 80 80 81 81 81 81 81 81 81 81 81 81 81 81 80 80 80 80 81 82 82 81 81 81 81 80 80 80 80 80 80 80 80 80 80 81
$$ packed form
6663H1%%%%J%%j%%%%%%%%%%%%%%%%%%%%j%%%%%J%%%%%%%j%j%J%%%%%%%J%%J%%%%%j%%%%%%
6655H1%%%J%%%%%j%%%%%%%%j%%%J%%%%%%%%%%%%%%%%%%%%%%%%%%%%%%j%%%%%%%%%%%J%%%%
6648H1j%%%J%%%%%%jJ%J%%%%%%%%%%j%%%%%%%%%%J%j%%%%%%%%J%%%jj%J%%%%%%j%%%J%Jj%
6640H1%%%j%jJ%%J%%%%%%%%%%%%%%%%%j%%%%J%j%J%%%%%%%%%%%%%Jj%j%J%%%%%J%%%%%j%J
6633H2%%%%%%%%j%%%%jj%%%%J%J%%%%%j%jJ%%%%%J%%j%%%%J%%%%%%%%%%%j%J%%%J%j%J%%j
6625H1%%%j%%%%%%J%j%%%%%%%J%%%%%j%%%J%%%%%jJ%%%%%J%j%%%%%%%%%jJ%Jj%j%%%%J%%%
6618H1jjJ%%J%%%jJ%%J%j%%%%%%j%%%%%%%%%%%%%%Jj%%jJ%%J%%%%%%%j%%J%J%%j%j%J%J%j
6611H1%%%%%%%%%Jj%%%%%%%%%j%%%%%%%J%j%%%%%J%%%%%%%%%%%j%%%JJ%j%%%j%%%%%%%%%J
$$ plain form
6603 81 81 81 81 81 81 81 81 81 81 82 82 81 81 80 80 80 80 80 81 81 81 81 81 82 82 81 81 81 81 81 81 81 81 80 80 80 80 81 81 81 81 81 81 81 81 80 80 80 80 80 80 80 80 80 80 80 81 81 81 81 81 81 81 82 83 82 81 81 81 81
6596 81 81 81 81 81 81 81 81 80 79 80 80 80 80 80 80 80 79 79 79 79 79 80 80 80 80 80 80 80 81 80 80 79 80 80 80 81 81 80 80 80 80 80 80 80 80 81 81 81 81 81 80 80 81 81 81 81 81 81 81 81 80 80 80 80 80 81 81 81 81 81
6588 81 81 81 81 81 81 81 81 82 81 81 81 81 81 81 80 80 79 80 80 80 81 80 79 80 80 81 81 81 81 81 81 81 81 80 80 80 80 80 80 80 80 80 80 80 81 80 80 80 80 80 80 80 80 80 81 80 80 80 80 80 80 79 79 79 80 80 80 80 80 81
6581 81 81 81 80 80 80 80 80 80 80 80 80 80 80 80 81 81 81 81 81 81 81 80 80 80 80 80 80 80 80 80 80 80 80 80 81 81 81 81 82 82 81 81 81 80 80 81 81 81 81 81 82 82 82 81 80 80 81 81 80 80 80 80 80 80 80 80 80 80 79 79
6574 79 80 80 80 80 79 78 78 79 79 80 81 81 81 81 81 81 80 80 80 81 81 81 81 81 80 80 80 80 80 80 80 80 80 80 80 80 80 80 80 80 80 81 80 80 80 80 80 80 80 80 80 81 81 81 81 80 81 80 80 80 80 80 81 81 80 80 80 79 79 78
6566 78 79 79 80 80 80 80 81 81 82 82 81 81 80 80 80 81 80 80 80 80 80 80 80 80 80 80 80 80 79 79 80 80 81 81 81 81 81 80 80 80 80 80 80 80 80 80 80 80 80 80 81 81 80 80 80 79 79 79 80 80 81 82 81 81 81 81 80 80 80 80
6559 80 80 80 79 79 79 79 80 80 80 80 79 79 80 80 81 81 82 82 82 81 81 81 81 80 80 80 80 80 81 81 80 80 80 81 80 80 80 80 80 80 80 80 80 80 80 80 80 80 80 80 80 80 80 80 80 80 79 79 80 80 80 81 80 80 80 79 79 79 79 80
6551 80 80 80 80 80 80 80 80 80 80 80 80 80 80 80 81 81 81 81 81 81 81 81 81 81 80 80 80 80 79 80 80 80 80 80 81 81 81 81 80 80 80 81 80 80 80 80 80 80 80 80 80 80 80 80 80 81 81 80 80 80 80 81 81 81 81 81 81 81 81 81
$$ packed form
6603H1%%%%%%%%%J%j%j%%%%J%%%%J%j%%%%%%%j%%%J%%%%%%%j%%%%%%%%%%J%%%%%%JJjj%%%
6596H1%%%%%%%jjJ%%%%%%j%%%%J%%%%%%Jj%jJ%%J%j%%%%%%%J%%%%j%J%%%%%%%j%%%%J%%%%
6588H1%%%%%%%Jj%%%%%j%jJ%%JjjJ%J%%%%%%%j%%%%%%%%%%Jj%%%%%%%%Jj%%%%%j%%J%%%%J
6581H1%%j%%%%%%%%%%%J%%%%%%j%%%%%%%%%%%%J%%%J%j%%j%J%%%%J%%jj%J%j%%%%%%%%%j%
6574G9J%%%jj%J%JJ%%%%%j%%J%%%%j%%%%%%%%%%%%%%%%Jj%%%%%%%%J%%%jJj%%%%J%j%%j%j
6566G8J%J%%%J%J%j%j%%Jj%%%%%%%%%%%j%J%J%%%%j%%%%%%%%%%%%J%j%%j%%J%JJj%%%j%%%
6559H0%%j%%%J%%%j%J%J%J%%j%%%j%%%%J%j%%Jj%%%%%%%%%%%%%%%%%%%%%j%J%%Jj%%j%%%J
6551H0%%%%%%%%%%%%%%J%%%%%%%%%j%%%jJ%%%%J%%%j%%Jj%%%%%%%%%%%%J%j%%%J%%%%%%%%
$$ plain form
6544 81 81 81 81 80 80 80 80 80 80 80 80 80 80 80 80 80 80 80 80 80 80 80 80 80 80 81 81 80 80 80 80 80 80 81 80 80 80 80 80 80 81 81 81 81 81 81 81 81 80 81 81 81 81 81 81 81 81 81 81 80 80 80 81 81 80 80 80 79 80 80
6536 80 80 80 80 81 81 81 82 82 82 82 82 82 82 82 81 81 81 81 81 81 80 80 81 81 81 81 81 80 80 80 80 79 80 80 80 80 80 80 80 80 80 80 80 80 80 80 80 80 80 81 81 81 81 81 81 81 81 80 80 80 81 81 81 81 81 81 81 80 81 81
6529 81 81 81 81 81 81 81 80 80 80 80 80 80 80 80 80 80 80 81 81 80 81 81 81 80 80 81 82 82 82 82 81 80 80 80 80 81 80 80 80 80 80 80 81 81 81 81 80 79 80 80 80 81 80 80 80 80 80 80 80 80 80 80 80 79 80 80 81 81 81 81
6522 81 80 80 80 81 81 81 80 80 80 80 81 81 81 81 81 80 80 80 80 80 80 80 80 81 80 80 81 81 82 82 81 81 81 80 80 80 80 80 81 81 81 81 82 82 81 81 81 80 81 81 81 81 81 81 81 81 81 81 81 80 80 80 80 80 80 80 80 81 81 81
6514 81 81 80 80 80 81 81 81 80 80 80 81 81 81 80 80 80 80 80 81 81 81 80 80 80 80 80 80 80 80 80 80 81 81 81 81 81 81 81 81 81 81 81 80 80 80 79 80 80 80 80 81 81 81 81 80 79 79 80 80 81 82 82 82 82 82 81 81 81 80 81
6507 81 81 81 81 80 79 79 80 80 80 80 79 79 79 79 80 80 80 81 81 81 81 81 81 81 81 81 81 80 80 80 80 80 80 80 80 80 81 80 80 80 80 81 81 81 81 81 81 80 80 81 81 81 81 81 81 81 81 80 80 80 80 81 81 81 81 80 81 81 81 82
6499 82 81 81 81 81 81 81 81 80 80 80 79 79 79 79 79 79 79 79 79 79 79 79 80 80 80 81 81 80 80 80 80 80 79 79 79 79 80 80 80 80 80 80 80 80 80 80 80 80 80 80 80 79 79 79 80 80 80 80 80 79 79 79 79 79 78 78 79 79 79 79
6492 79 79 79 79 80 80 80 80 80 80 80 80 79 80 80 79 80 80 80 81 81 81 80 80 80 79 80 80 79 79 79 80 80 80 80 80 80 80 80 79 79 80 79 80 80 80 80 80 80 80 80 80 80 80 80 80 80 80 80 80 80 79 79 80 80 80 80 80 80 80 80
$$ packed form
6544H1%%%j%%%%%%%%%%%%%%%%%%%%%J%j%%%%%Jj%%%%%J%%%%%%%jJ%%%%%%%%%j%%J%j%%jJ%
6536H0%%%J%%J%%%%%%%j%%%%%j%J%%%%j%%%jJ%%%%%%%%%%%%%%%%J%%%%%%%j%%J%%%%%%jJ%
6529H1%%%%%%j%%%%%%%%%%J%jJ%%j%JJ%%%jj%%%Jj%%%%%J%%%jjJ%%Jj%%%%%%%%%%jJ%J%%%
6522H1j%%J%%j%%%J%%%%j%%%%%%%Jj%J%J%j%%j%%%%J%%%J%j%%jJ%%%%%%%%%%j%%%%%%%J%%
6514H1%j%%J%%j%%J%%j%%%%J%%j%%%%%%%%%J%%%%%%%%%%j%%jJ%%%J%%%jj%J%JJ%%%%j%%jJ
6507H1%%%jj%J%%%j%%%J%%J%%%%%%%%%j%%%%%%%%Jj%%%J%%%%%j%J%%%%%%%j%%%J%%%jJ%%J
6499H2j%%%%%%j%%j%%%%%%%%%%%J%%J%j%%%%j%%%J%%%%%%%%%%%%%%j%%J%%%%j%%%%j%J%%%
6492G9%%%J%%%%%%%jJ%jJ%%J%%j%%jJ%j%%J%%%%%%%j%JjJ%%%%%%%%%%%%%%%%%j%J%%%%%%%
$$ plain form
6485 80 80 80 80 80 80 80 80 80 80 80 80 80 80 80 80 80 80 80 80 80 80 80 79 79 80 81 81 81 81 80 80 80 80 80 81 81 81 81 81 81 81 81 81 81 81 81 81 81 81 81 81 81 81 81 81 81 81 80 80 81 81 81 81 81 81 81 81 80 80 80
6477 80 80 80 80 80 80 80 80 80 80 81 81 81 81 81 82 82 81 81 81 81 81 81 81 81 81 81 80 80 80 79 80 80 80 80 80 81 81 81 80 80 80 79 80 80 81 81 81 81 80 80 80 80 80 80 80 81 81 81 81 81 81 81 81 81 80 80 80 80 81 81
6470 81 81 81 81 81 81 81 81 81 81 81 81 81 81 81 81 81 82 81 80 80 80 80 80 81 81 82 81 81 80 80 80 80 80 80 80 80 80 80 80 80 80 80 80 80 80 80 80 80 81 80 80 80 81 81 82 82 82 82 81 81 81 81 81 81 80 80 81 81 81 81
6462 81 81 80 80 80 80 80 80 80 80 80 80 79 79 80 80 80 80 81 81 81 80 80 80 81 80 80 80 80 80 80 81 81 81 82 81 81 81 81 81 81 81 81 81 80 80 81 81 81 81 80 81 81 81 81 82 81 81 81 81 80 80 80 80 80 80 80 80 80 80 80
6455 80 80 80 79 79 79 79 79 79 79 79 79 79 80 80 80 80 80 80 80 80 80 80 80 80 80 81 80 80 80 79 80 80 80 80 80 80 80 81 80 80 79 79 79 79 80 80 80 79 79 79 79 79 79 79 80 80 80 80 80 81 81 81 81 81 81 80 80 80 80 81
6447 81 81 80 80 80 80 81 81 81 81 80 80 80 80 80 80 80 81 82 81 81 81 80 80 80 81 80 80 80 80 81 81 81 81 80 80 80 80 80 80 80 80 80 80 81 81 81 80 80 80 80 80 80 80 80 80 80 80 80 80 81 80 80 80 80 80 80 80 81 81 81
6440 81 81 81 81 80 80 80 81 81 81 81 81 81 80 80 80 80 80 80 80 81 81 81 81 80 80 80 80 80 80 80 80 80 80 80 80 80 80 80 80 80 80 80 80 81 81 81 81 81 81 81 81 81 81 80 80 80 80 80 80 80 79 79 79 79 79 79 79 79 80 80
6433 80 80 80 80 80 80 80 80 80 80 79 79 79 79 80 80 81 81 80 80 80 80 80 80 80 80 80 80 80 80 80 80 80 81 81 81 81 81 81 81 80 80 80 80 80 80 80 79 80 81 81 80 80 79 79 79 80 80 80 79 79 80 80 80 79 79 78 78 78 79 79
$$ packed form
6485H0%%%%%%%%%%%%%%%%%%%%%%j%JJ%%%j%%%%J%%%%%%%%%%%%%%%%%%%%%%j%J%%%%%%%j%%
6477H0%%%%%%%%%J%%%%J%j%%%%%%%%%j%%jJ%%%%J%%j%%jJ%J%%%j%%%%%%J%%%%%%%%j%%%J%
6470H1%%%%%%%%%%%%%%%%Jjj%%%%J%Jj%j%%%%%%%%%%%%%%%%%%%Jj%%J%J%%%j%%%%%j%J%%%
6462H1%j%%%%%%%%%j%J%%%J%%j%%Jj%%%%%J%%Jj%%%%%%%%j%J%%%jJ%%%Jj%%%j%%%%%%%%%%
6455H0%%j%%%%%%%%%J%%%%%%%%%%%%Jj%%jJ%%%%%%Jj%j%%%J%%j%%%%%%J%%%%J%%%%%j%%%J
6447H1%j%%%J%%%j%%%%%%JJj%%j%%Jj%%%J%%%j%%%%%%%%%J%%j%%%%%%%%%%%%Jj%%%%%%J%%
6440H1%%%j%%J%%%%%j%%%%%%J%%%j%%%%%%%%%%%%%%%%%%%J%%%%%%%%%j%%%%%%j%%%%%%%J%
6433H0%%%%%%%%%j%%%J%J%j%%%%%%%%%%%%%%J%%%%%%j%%%%%%jJJ%j%j%%J%%j%J%%j%j%%J%
$$ plain form
6425 79 79 79 80 80 80 80 80 80 80 80 80 80 80 80 80 80 80 80 80 80 81 81 80 80 80 80 80 81 80 80 80 80 80 81 80 80 80 79 79 79 80 80 79 80 80 80 80 80 80 80 80 80 80 80 81 81 80 80 79 79 79 79 80 80 80 80 81 80 80 80
6418 80 80 80 80 80 80 79 80 80 80 81 80 80 80 80 80 80 80 81 81 82 82 82 81 81 81 80 81 81 81 81 81 81 81 81 81 81 81 80 80 80 80 80 80 81 80 80 80 81 80 80 80 80 80 80 81 81 81 81 81 80 81 81 81 81 81 80 79 79 80 80
6410 80 81 81 81 81 80 80 80 80 80 80 80 80 80 80 80 80 81 81 81 81 80 80 80 80 80 80 80 80 80 80 80 81 81 81 81 81 81 81 81 80 81 81 81 81 82 82 82 81 81 81 81 81 81 81 81 82 81 81 80 80 80 80 79 80 80 80 80 80 80 80
6403 80 80 80 80 79 79 79 80 80 80 80 80 80 80 80 80 80 80 80 80 80 80 80 80 79 79 79 79 79 79 79 79 80 80 80 80 80 80 80 81 81 81 80 80 80 79 79 79 79 79 80 80 80 80 81 81 80 81 81 81 80 80 79 79 79 79 79 80 80 80 80
6396 80 80 81 81 81 81 81 80 80 80 79 79 79 79 79 79 80 80 80 80 80 80 81 81 81 81 82 82 82 82 82 81 81 81 80 79 79 79 79 80 80 80 80 80 80 80 81 81 81 81 81 80 80 80 80 80 80 80 80 79 79 79 80 80 80 80 79 80 80 80 80
6388 80 79 79 80 80 80 80 80 80 81 81 80 80 80 80 81 81 80 79 79 79 80 80 81 80 80 80 80 80 81 81 82 82 81 81 81 81 81 80 80 80 81 81 81 81 81 80 80 81 81 81 81 81 81 81 81 81 80 80 81 81 81 82 82 81 81 81 80 80 80 80
6381 80 80 80 80 81 81 81 80 80 81 81 82 81 81 81 81 81 80 80 80 80 80 80 80 80 80 80 80 80 80 80 80 80 79 79 79 79 79 79 79 80 80 80 80 80 80 80 80 79 79 79 79 79 80 80 80 81 81 81 80 80 80 80 80 80 80 80 81 81 81 82
6373 82 81 81 81 80 80 81 81 81 82 82 82 82 82 82 82 81 80 80 80 80 80 79 79 79 80 80 81 80 80 79 80 80 80 80 80 80 80 80 80 79 80 80 80 80 80 80 80 79 80 80 80 80 80 80 80 79 80 80 80 80 80 80 80 80 81 81 81 80 80 80
$$ packed form
6425G9%%J%%%%%%%%%%%%%%%%%J%j%%%%Jj%%%%Jj%%j%%J%jJ%%%%%%%%%%J%j%j%%%J%%%Jj%%
6418H0%%%%%jJ%%Jj%%%%%%J%J%%j%%jJ%%%%%%%%%%j%%%%%Jj%%Jj%%%%%J%%%%jJ%%%%jj%J%
6410H0J%%%j%%%%%%%%%%%J%%%j%%%%%%%%%%J%%%%%%%jJ%%%J%%j%%%%%%%Jj%j%%%jJ%%%%%%
6403H0%%%j%%J%%%%%%%%%%%%%%%%j%%%%%%%J%%%%%%J%%j%%j%%%%J%%%J%jJ%%j%j%%%%J%%%
6396H0%J%%%%j%%j%%%%%J%%%%%J%%%J%%%%j%%jj%%%J%%%%%%J%%%%j%%%%%%%j%%J%%%jJ%%%
6388H0j%J%%%%%J%j%%%J%jj%%J%Jj%%%%J%J%j%%%%j%%J%%%%j%J%%%%%%%%j%J%%J%j%%j%%%
6381H0%%%J%%j%J%Jj%%%%j%%%%%%%%%%%%%%%j%%%%%%J%%%%%%%j%%%%J%%J%%j%%%%%%%J%%J
6373H2j%%j%J%%J%%%%%%jj%%%%j%%J%Jj%jJ%%%%%%%%jJ%%%%%%jJ%%%%%%jJ%%%%%%%J%%j%%
$$ plain form
6366 80 80 80 80 80 81 81 81 81 81 81 81 81 81 81 81 81 81 81 81 81 81 81 81 80 80 80 80 80 81 81 81 81 81 80 80 80 80 80 80 80 80 81 81 81 81 81 81 81 81 82 81 81 81 81 81 81 81 81 81 81 81 82 81 80 79 79 79 80 80 80
6358 80 81 81 80 80 80 79 79 79 79 79 79 80 80 80 80 80 80 80 80 81 81 81 81 81 81 81 80 80 81 81 81 81 80 80 80 81 81 81 81 81 80 80 80 79 79 79 79 79 79 79 79 79 79 80 80 80 80 80 80 80 80 80 80 80 80 80 80 80 80 80
6351 80 80 80 80 81 81 82 81 81 80 79 80 80 81 80 80 80 80 80 80 80 80 80 80 80 80 80 80 80 80 80 80 80 80 80 80 79 80 80 80 80 80 80 80 80 81 81 81 81 80 80 80 80 80 80 81 81 81 81 81 80 81 81 81 81 81 81 81 80 81 80
6344 80 80 80 80 80 80 80 80 80 81 81 81 82 81 81 81 81 81 81 80 80 80 80 80 80 79 79 79 79 80 80 80 80 80 80 80 80 80 80 80 80 81 81 81 80 80 80 80 81 81 81 80 80 80 80 80 80 80 80 80 80 80 80 79 79 79 79 79 79 79 79
6336 79 80 80 80 80 80 80 80 80 80 80 80 80 80 80 81 81 81 81 81 81 81 81 81 81 81 81 81 81 80 80 80 80 80 80 80 80 80 80 80 81 81 81 80 80 80 80 80 80 80 80 80 80 80 81 81 80 80 80 80 80 80 80 80 79 79 79 79 79 79 79
6329 79 79 79 80 80 80 80 80 80 79 79 80 80 80 80 80 80 81 81 81 81 80 81 81 80 80 80 80 80 80 79 79 79 79 79 79 79 79 79 79 79 79 80 80 80 80 80 80 80 80 80 80 80 80 81 81 81 81 81 80 79 80 80 80 80 80 81 81 81 81 81
6321 81 81 81 81 81 81 80 80 80 80 79 80 80 80 81 81 81 81 81 81 81 81 81 81 81 81 81 80 80 80 80 80 80 80 79 78 79 80 80 80 80 80 81 81 80 80 80 80 80 80 80 80 80 80 80 80 80 80 80 80 80 80 80 80 80 80 80 80 81 81 81
6314 81 81 80 80 80 80 81 80 80 80 80 80 80 80 80 80 81 81 81 81 81 81 81 81 81 81 81 81 81 81 81 80 80 80 80 80 80 80 80 80 80 80 80 80 80 80 80 80 81 81 81 81 81 80 80 80 80 80 80 80 80 81 81 80 79 79 79 79 80 80 80
$$ packed form
6366H0%%%%J%%%%%%%%%%%%%%%%%%j%%%%J%%%%j%%%%%%%J%%%%%%%Jj%%%%%%%%%%Jjjj%%J%%
6358H0J%j%%j%%%%%J%%%%%%%J%%%%%%j%J%%%j%%J%%%%j%%j%%%%%%%%%J%%%%%%%%%%%%%%%%
6351H0%%%J%Jj%jjJ%Jj%%%%%%%%%%%%%%%%%%%%%jJ%%%%%%%J%%%j%%%%%J%%%%jJ%%%%%%jJj
6344H0%%%%%%%%J%%Jj%%%%%j%%%%%j%%%J%%%%%%%%%%%J%%j%%%J%%j%%%%%%%%%%%j%%%%%%%
6336G9J%%%%%%%%%%%%%J%%%%%%%%%%%%%j%%%%%%%%%%J%%j%%%%%%%%%%J%j%%%%%%%j%%%%%%
6329G9%%J%%%%%j%J%%%%%J%%%jJ%j%%%%%j%%%%%%%%%%%J%%%%%%%%%%%J%%%%jjJ%%%%J%%%%
6321H1%%%%%j%%%jJ%%J%%%%%%%%%%%%j%%%%%%jjJJ%%%%J%j%%%%%%%%%%%%%%%%%%%%%%%J%%
6314H1%j%%%Jj%%%%%%%%J%%%%%%%%%%%%%%j%%%%%%%%%%%%%%%%J%%%%j%%%%%%%J%jj%%%J%%
$$ plain form
6307 80 80 80 80 80 80 80 80 80 80 80 80 80 80 80 80 80 80 79 79 79 80 80 80 80 80 79 79 80 80 80 80 80 80 81 81 81 81 80 80 80 81 81 81 81 81 81 81 81 81 81 80 80 80 79 80 81 81 81 81 81 81 81 81 81 81 80 80 80 81 81
6299 81 81 81 81 81 81 81 81 81 81 81 81 81 81 81 80 80 80 81 81 81 81 81 80 80 80 81 81 81 81 81 80 80 80 80 81 80 80 80 80 80 80 80 81 81 80 80 80 80 80 79 80 81 81 80 80 80 80 80 80 80 80 80 80 81 81 81 80 80 81 81
6292 81 81 82 82 82 82 82 82 82 82 81 81 80 80 80 80 80 80 80 80 81 81 81 81 81 81 81 81 81 81 81 81 81 81 81 81 81 81 81 81 81 81 81 81 81 81 81 82 81 81 81 81 81 80 79 79 79 79 79 79 79 79 80 80 80 80 81 80 80 80 80
6284 80 80 80 80 79 79 79 79 80 80 80 80 80 80 80 80 80 80 80 80 80 80 80 80 80 80 79 79 79 79 79 79 79 80 80 81 81 81 80 80 80 80 79 79 79 79 79 79 79 79 79 79 79 79 79 79 79 79 79 79 79 80 80 80 80 80 79 79 79 79 80
6277 80 80 81 81 80 80 80 80 80 80 80 81 81 81 80 81 81 81 81 81 80 80 81 81 81 81 81 81 80 80 80 80 79 79 79 80 80 79 79 80 80 80 80 81 81 81 81 81 81 81 81 81 81 81 81 80 80 80 79 80 80 80 80 80 80 80 80 80 80 80 80
6269 80 80 80 81 81 81 80 80 80 80 81 81 80 80 79 80 80 81 80 81 81 81 80 80 80 80 80 80 80 80 79 79 79 80 80 80 80 81 81 81 81 81 81 80 80 80 81 81 80 80 80 80 80 80 80 80 80 80 81 81 81 81 81 81 80 80 80 80 80 81 81
6262 81 81 81 81 81 81 81 80 80 80 80 80 80 80 81 81 81 81 81 81 81 81 81 81 82 82 82 82 81 81 81 80 80 79 80 80 80 81 81 80 80 81 81 81 81 81 81 81 81 81 81 81 81 81 80 80 80 80 81 82 82 81 81 81 81 81 81 80 80 80 81
6255 81 81 81 81 81 81 82 82 82 82 83 83 83 83 84 84 84 85 85 85 86 85 85 84 84 83 83 82 82 82 82 82 82 81 81 81 81 82 82 81 81 82 82 81 81 81 81 81 80 81 81 81 81 81 81 82 82 82 82 82 82 82 81 81 81 81 81 81 81 81 81
$$ packed form
6307H0%%%%%%%%%%%%%%%%%j%%J%%%%j%J%%%%%J%%%j%%J%%%%%%%%%j%%jJJ%%%%%%%%%j%%J%
6299H1%%%%%%%%%%%%%%j%%J%%%%j%%J%%%%j%%%Jj%%%%%%J%j%%%%jJJ%j%%%%%%%%%J%%j%J%
6292H1%J%%%%%%%j%j%%%%%%%J%%%%%%%%%%%%%%%%%%%%%%%%%%Jj%%%%jj%%%%%%%J%%%Jj%%%
6284H0%%%j%%%J%%%%%%%%%%%%%%%%%j%%%%%%J%J%%j%%%j%%%%%%%%%%%%%%%%%%J%%%%j%%%J
6277H0%J%j%%%%%%J%%jJ%%%%j%J%%%%%j%%%j%%J%j%J%%%J%%%%%%%%%%%j%%jJ%%%%%%%%%%%
6269H0%%J%%j%%%J%j%jJ%JjJ%%j%%%%%%%j%%J%%%J%%%%%j%%J%j%%%%%%%%%J%%%%%j%%%%J%
6262H1%%%%%%j%%%%%%J%%%%%%%%%J%%%j%%j%jJ%%J%j%J%%%%%%%%%%%%j%%%JJ%j%%%%%j%%J
6255H1%%%%%J%%%J%%%J%%J%%Jj%j%j%j%%%%%j%%%J%j%J%j%%%%jJ%%%%%J%%%%%%j%%%%%%%%
$$ plain form
6247 81 81 81 81 81 81 81 81 81 81 81 81 81 82 82 82 82 82 82 82 82 82 82 82 82 81 81 81 81 81 81 81 81 81 82 81 81 81 81 81 81 81 81 81 81 81 81 81 80 81 81 81 82 82 81 81 81 81 81 81 81 81 80 80 81 81 81 81 81 81 81
6240 81 81 81 81 81 81 81 82 82 82 81 81 81 81 80 80 80 80 79 80 80 80 80 80 81 81 81 81 81 80 80 80 79 80 80 80 81 81 81 81 81 81 81 81 82 81 80 80 81 81 81 80 80 80 80 80 80 80 80 80 80 80 80 80 80 80 80 80 80 80 80
6232 80 80 80 81 81 82 82 82 81 81 80 80 80 80 80 80 80 80 80 81 80 80 80 80 81 81 81 80 80 80 80 80 80 80 80 80 80 80 79 79 80 80 80 80 79 79 80 80 80 80 80 80 81 81 81 81 81 80 80 80 81 81 81 81 81 81 80 80 80 81 81
6225 81 81 80 80 80 80 80 80 81 81 81 81 80 79 80 80 81 80 80 80 80 80 81 80 80 80 80 80 81 81 80 80 80 80 80 80 80 80 80 80 80 80 79 79 79 79 79 80 80 80 80 80 80 80 80 80 80 80 80 80 80 81 81 81 80 80 80 80 80 80 81
6218 81 81 82 81 81 80 80 80 80 80 80 80 81 81 81 81 82 82 81 81 81 81 81 81 81 81 81 80 80 80 80 80 80 81 81 81 81 80 80 81 81 81 82 81 81 81 81 81 81 81 81 81 81 81 81 81 81 81 81 81 80 80 79 80 80 80 80 81 81 80 81
6210 81 82 82 81 80 80 79 79 79 80 80 80 80 80 80 80 80 80 80 80 80 79 79 80 80 81 81 81 80 80 80 80 80 80 80 80 80 80 80 80 80 80 80 80 80 80 80 80 80 80 80 80 80 80 80 80 80 80 80 81 81 80 80 80 81 81 81 81 80 80 80
6203 80 79 80 80 80 80 80 80 80 80 80 80 80 80 80 80 80 80 80 80 80 80 80 80 81 81 81 81 81 81 81 81 81 81 80 80 79 79 80 79 80 80 80 80 80 80 80 80 80 80 80 80 80 80 80 80 80 80 80 80 80 80 80 80 80 81 81 80 80 80 80
6195 80 80 80 80 80 81 81 81 81 81 81 81 81 81 81 81 81 81 81 81 81 80 80 80 80 80 80 81 81 81 81 81 81 81 81 80 80 80 81 81 81 81 81 81 81 80 80 81 81 81 81 80 80 79 79 80 80 80 81 80 80 79 79 80 80 80 80 80 80 80 80
$$ packed form
6247H1%%%%%%%%%%%%J%%%%%%%%%%%j%%%%%%%%Jj%%%%%%%%%%%%jJ%%J%j%%%%%%%j%J%%%%%%
6240H1%%%%%%J%%j%%%j%%%jJ%%%%J%%%%j%%jJ%%J%%%%%%%Jjj%J%%j%%%%%%%%%%%%%%%%%%%
6232H0%%J%J%%j%j%%%%%%%%Jj%%%J%%j%%%%%%%%%%j%J%%%j%J%%%%%J%%%%j%%J%%%%%j%%J%
6225H1%j%%%%%J%%%jjJ%Jj%%%%Jj%%%%J%j%%%%%%%%%%%j%%%%J%%%%%%%%%%%%%J%%j%%%%%J
6218H1%Jj%j%%%%%%J%%%J%j%%%%%%%%j%%%%%J%%%j%J%%Jj%%%%%%%%%%%%%%%%j%jJ%%%J%jJ
6210H1J%jj%j%%J%%%%%%%%%%%j%J%J%%j%%%%%%%%%%%%%%%%%%%%%%%%%%%%%%J%j%%J%%%j%%
6203H0jJ%%%%%%%%%%%%%%%%%%%%%J%%%%%%%%%j%j%JjJ%%%%%%%%%%%%%%%%%%%%%%%%J%j%%%
6195H0%%%%J%%%%%%%%%%%%%%%j%%%%%J%%%%%%%j%%J%%%%%%j%J%%%j%j%J%%Jj%j%J%%%%%%%
$$ plain form
6188 80 80 80 80 80 79 80 80 80 81 81 81 81 81 81 81 81 80 80 81 81 82 82 82 82 82 82 81 81 80 80 80 80 81 81 81 81 81 81 81 81 81 81 81 82 82 81 82 82 82 81 81 81 82 82 81 80 80 81 81 81 81 80 81 81 81 81 81 81 81 81
6180 81 81 81 82 82 81 81 82 82 82 81 81 81 81 80 80 81 81 81 80 80 80 81 82 82 82 82 82 81 81 81 80 80 80 81 81 81 82 81 81 81 82 82 82 82 82 82 82 82 82 81 81 81 82 82 82 82 82 82 82 81 81 81 81 81 81 81 80 80 80 80
6173 80 80 80 80 80 80 80 80 80 80 80 80 80 80 80 80 81 81 81 81 81 81 82 82 81 81 81 81 81 80 80 80 80 80 80 80 81 81 81 80 80 80 80 80 80 80 80 80 80 80 80 80 80 80 80 80 81 81 81 81 81 81 81 81 81 81 80 80 81 81 81
6166 81 81 81 81 81 81 81 81 81 81 81 81 81 81 82 82 82 82 83 83 83 82 82 83 84 84 84 84 85 85 86 87 89 90 91 92 94 95 96 96 96 95 93 92 90 89 88 88 87 87 88 87 87 88 89 91 93 94 95 96 96 96 95 93 91 90 88 86 84 84 83
6158 83 83 83 82 82 82 82 82 82 82 82 81 81 80 80 80 81 81 81 81 81 80 80 80 81 80 80 80 80 80 80 80 80 80 80 80 80 80 80 80 81 81 81 81 81 81 81 81 81 81 81 81 82 82 82 82 82 81 81 81 81 81 81 81 82 82 82 82 82 81 81
6151 81 81 81 81 82 82 82 82 82 82 82 82 81 81 81 81 81 81 81 80 79 79 79 80 80 81 81 81 81 81 81 81 81 81 81 81 81 81 81 81 81 81 81 80 80 80 80 80 80 80 80 80 80 80 80 81 81 81 81 81 81 80 80 80 80 81 82 82 81 81 81
6143 81 81 81 81 81 80 80 80 80 81 81 81 81 81 81 81 81 82 82 82 82 82 82 81 81 81 81 81 81 81 81 81 81 81 81 81 82 82 82 82 82 82 81 81 80 80 81 81 81 81 81 81 81 81 81 81 81 81 81 82 82 83 83 82 82 81 81 81 81 81 81
6136 81 81 81 81 81 81 81 81 81 81 81 81 81 81 81 81 81 81 82 81 82 81 81 81 80 80 80 80 80 81 80 80 80 80 81 81 81 81 81 81 81 81 81 80 80 80 80 80 80 81 81 81 81 81 81 81 81 81 81 81 81 81 80 80 80 80 80 79 79 79 79
$$ packed form
6188H0%%%%jJ%%J%%%%%%%j%J%J%%%%%j%j%%%J%%%%%%%%%%J%jJ%%j%%J%jj%J%%%jJ%%%%%%%
6180H1%%J%j%J%%j%%%j%J%%j%%JJ%%%%j%%j%%J%%Jj%%J%%%%%%%%j%%J%%%%%%j%%%%%%j%%%
6173H0%%%%%%%%%%%%%%%J%%%%%J%j%%%%j%%%%%%J%%j%%%%%%%%%%%%%%%%J%%%%%%%%%j%J%%
6166H1%%%%%%%%%%%%%J%%%J%%j%JJ%%%J%JJKJJJKJJ%%jkjkjj%j%Jj%JJKKJJJ%%jkkjkkk%j
6158H3%%j%%%%%%%j%j%%J%%%%j%%Jj%%%%%%%%%%%%%%J%%%%%%%%%%%J%%%%j%%%%%%J%%%%j%
6151H1%%%J%%%%%%%j%%%%%%jj%%J%J%%%%%%%%%%%%%%%%%j%%%%%%%%%%%J%%%%%j%%%JJ%j%%
6143H1%%%%j%%%J%%%%%%%J%%%%%j%%%%%%%%%%%%J%%%%%j%j%J%%%%%%%%%%%%J%J%j%j%%%%%
6136H1%%%%%%%%%%%%%%%%%JjJj%%j%%%%Jj%%%J%%%%%%%%j%%%%%J%%%%%%%%%%%%j%%%%j%%%
$$ plain form
6129 79 79 79 79 80 80 81 81 81 80 80 80 80 80 80 80 81 81 81 81 81 81 81 81 81 80 80 80 80 80 79 79 79 79 80 80 80 80 80 81 81 81 81 81 81 81 81 81 81 81 81 81 81 80 80 81 81 81 81 81 81 81 81 81 81 81 81 82 81 81 80
6121 80 80 81 81 81 81 81 81 81 81 80 80 81 81 81 82 82 82 82 82 82 82 82 82 82 81 81 81 80 81 80 80 80 80 80 80 80 80 81 81 81 81 80 80 80 80 80 81 81 82 82 82 81 81 81 81 80 81 81 81 82 82 82 82 82 82 82 82 81 82 82
6114 82 82 82 82 81 81 81 81 81 81 81 81 81 81 81 81 82 82 82 82 82 82 83 82 82 81 81 81 81 81 82 81 81 81 81 81 80 80 80 81 80 80 81 81 81 80 80 79 80 80 80 80 80 80 80 81 81 81 81 81 81 81 80 80 80 80 81 81 81 81 81
6106 81 81 81 82 81 81 80 80 81 82 82 81 81 81 81 81 81 81 81 80 79 79 79 79 79 80 80 80 80 80 80 81 81 80 81 81 80 80 81 81 81 80 80 80 80 80 80 81 81 81 81 80 80 80 80 80 80 80 80 80 80 80 80 80 80 80 79 80 80 80 81
6099 81 80 80 80 79 79 79 79 79 80 80 80 81 81 80 80 79 80 80 80 81 81 80 80 80 81 81 80 80 80 80 80 80 80 80 80 80 80 80 80 81 81 81 81 81 80 80 80 80 79 79 79 78 78 78 79 80 80 80 79 79 80 81 81 81 81 81 81 81 81 81
6091 81 80 80 80 79 80 80 80 79 79 78 78 78 78 79 79 79 79 79 79 79 79 79 80 80 79 79 78 78 78 79 79 80 79 79 79 79 79 79 79 79 79 78 78 78 78 78 78 78 78 79 79 79 79 79 79 79 80 80 79 80 80 80 79 79 80 80 80 81 80 80
6084 80 80 80 80 80 80 79 79 79 79 79 79 79 79 80 80 80 80 80 80 80 80 81 81 80 80 80 80 80 79 79 79 80 80 80 80 80 80 80 80 79 79 79 79 79 79 79 80 79 79 79 80 80 80 80 80 81 80 80 80 80 80 80 80 80 80 80 80 80 80 80
6077 80 81 81 81 81 81 81 81 80 80 80 80 80 80 80 80 80 79 79 79 79 80 80 80 79 80 80 80 80 80 80 79 79 80 80 80 81 81 81 81 81 81 81 81 81 81 81 81 82 82 81 81 81 81 81 81 81 81 81 81 81 81 81 81 81 81 80 80 80 80 80
$$ packed form
6129G9%%%J%J%%j%%%%%%J%%%%%%%%j%%%%j%%%J%%%%J%%%%%%%%%%%%%j%J%%%%%%%%%%%Jj%j
6121H0%J%%%%%%%j%J%%J%%%%%%%%%j%%jJj%%%%%%%J%%%j%%%%J%J%%j%%%jJ%%J%%%%%%%jJ%
6114H2%%%j%%%%%%%%%%%J%%%%%Jj%j%%%%Jj%%%%j%%Jj%J%%j%jJ%%%%%%J%%%%%%j%%%J%%%%
6106H1%%Jj%j%JJ%j%%%%%%%jj%%%%J%%%%%J%jJ%j%J%%j%%%%%J%%%j%%%%%%%%%%%%%%jJ%%J
6099H1j%%j%%%%J%%J%j%jJ%%J%j%%J%j%%%%%%%%%%%%J%%%%j%%%j%%j%%JJ%%j%JJ%%%%%%%%
6091H1j%%jJ%%j%j%%%J%%%%%%%%J%j%j%%J%Jj%%%%%%%%j%%%%%%%J%%%%%%J%jJ%%j%J%%Jj%
6084H0%%%%%j%%%%%%%J%%%%%%%J%j%%%%j%%J%%%%%%%j%%%%%%Jj%%J%%%%Jj%%%%%%%%%%%%%
6077H0J%%%%%%j%%%%%%%%j%%%J%%jJ%%%%%j%J%%J%%%%%%%%%%%J%j%%%%%%%%%%%%%%%j%%%%
$$ plain form
6069 80 81 81 81 81 81 81 81 80 81 81 82 82 82 81 80 81 81 81 81 81 80 80 80 80 80 81 81 82 81 80 80 80 80 80 80 80 80 80 80 80 80 80 80 80 80 80 80 80 80 80 81 82 82 82 82 82 82 82 82 81 81 81 81 81 81 82 83 82 82 81
6062 81 81 81 81 81 81 81 81 81 81 81 81 81 81 81 81 81 81 81 81 81 81 81 80 80 80 80 80 80 80 80 80 80 80 80 80 80 80 80 80 81 80 80 80 80 80 80 80 80 80 80 80 80 80 80 81 81 81 80 80 80 80 80 81 81 81 81 80 81 82 82
6054 82 81 81 81 81 81 81 81 81 81 81 81 81 81 81 81 81 81 81 80 80 79 79 79 79 79 79 79 79 79 79 79 79 79 79 79 78 78 77 78 78 78 78 78 78 78 78 78 79 79 79 79 79 79 79 78 79 78 78 78 77 77 77 78 78 78 78 77 77 78 78
6047 78 79 79 79 79 78 79 79 79 79 78 78 78 77 77 77 77 77 77 77 78 78 78 79 79 79 79 79 79 78 78 78 77 77 78 78 78 78 78 78 78 78 78 78 79 79 79 79 79 79 80 80 80 80 80 80 80 79 79 79 78 79 79 79 79 80 80 80 80 80 81
6040 81 80 79 79 78 78 79 79 79 79 79 79 78 78 79 79 79 79 79 79 79 79 79 79 79 78 79 79 80 80 81 80 80 79 79 79 79 79 79 79 80 80 81 81 80 80 80 80 80 79 79 79 80 80 80 80 80 80 80 79 80 80 80 80 80 80 79 79 79 79 79
6032 79 79 79 79 80 79 79 79 79 79 79 80 80 80 79 80 80 80 81 81 81 80 80 80 80 80 80 79 79 79 78 78 78 79 79 79 79 79 80 80 80 80 80 79 79 79 79 79 79 79 80 80 80 80 80 80 80 79 79 79 79 79 79 79 79 79 79 79 79 79 79
6025 79 79 79 79 79 79 79 78 78 78 78 79 80 79 79 79 79 79 79 79 79 79 80 80 79 79 79 79 79 79 78 78 79 79 79 80 80 79 79 78 78 78 78 78 78 78 78 78 78 79 79 79 79 79 79 80 80 80 80 79 79 79 79 79 79 80 80 79 79 79 79
6017 79 80 80 80 80 79 79 79 79 79 80 80 81 80 80 80 80 80 79 79 80 80 80 80 80 80 80 80 80 80 80 80 80 80 80 80 80 80 80 81 81 80 80 80 80 80 80 80 80 80 80 80 80 80 80 80 80 80 80 80 80 80 80 79 79 79 79 79 79 79 78
$$ packed form
6069H0J%%%%%%jJ%J%%jjJ%%%%j%%%%J%Jjj%%%%%%%%%%%%%%%%%%%%JJ%%%%%%%j%%%%%JJj%j
6062H1%%%%%%%%%%%%%%%%%%%%%%j%%%%%%%%%%%%%%%%Jj%%%%%%%%%%%%%J%%j%%%%J%%%jJJ%
6054H2j%%%%%%%%%%%%%%%%%j%j%%%%%%%%%%%%%%j%jJ%%%%%%%%J%%%%%%jJj%%j%%J%%%j%J%
6047G8J%%%jJ%%%j%%j%%%%%%J%%J%%%%%j%%j%J%%%%%%%%%J%%%%%J%%%%%%j%%jJ%%%J%%%%J
6040H1jj%j%J%%%%%j%J%%%%%%%%%%jJ%J%Jj%j%%%%%%J%J%j%%%%j%%J%%%%%%jJ%%%%%j%%%%
6032G9%%%Jj%%%%%J%%jJ%%J%%j%%%%%j%%j%%J%%%%J%%%%j%%%%%%J%%%%%%j%%%%%%%%%%%%%
6025G9%%%%%%j%%%JJj%%%%%%%%J%j%%%%%j%J%%J%j%j%%%%%%%%%J%%%%%J%%%j%%%%%J%j%%%
6017G9J%%%j%%%%J%Jj%%%%j%J%%%%%%%%%%%%%%%%%%J%j%%%%%%%%%%%%%%%%%%%%%j%%%%%%j
$$ plain form
6010 78 78 78 79 79 79 79 79 79 80 80 80 79 80 80 80 79 79 79 79 80 80 80 80 80 79 79 79 79 79 80 80 80 80 80 80 80 80 80 80 81 81 81 81 81 80 80 80 80 80 79 79 79 79 79 79 80 80 81 80 80 79 79 79 79 79 79 79 78 78 78
6002 78 79 79 79 79 80 80 80 80 80 80 80 80 79 78 79 79 79 80 80 80 80 80 80 80 80 80 80 80 80 81 81 81 81 81 81 80 80 80 80 80 80 80 80 80 80 80 80 80 80 80 80 81 81 80 80 80 80 80 80 81 81 81 81 81 82 82 82 81 81 81
5995 81 81 81 81 81 81 81 81 81 81 81 81 81 81 81 81 82 82 82 82 82 82 82 82 82 82 82 81 81 81 81 81 80 80 81 81 81 81 81 81 81 81 81 81 82 82 83 83 83 82 82 82 82 82 82 82 82 81 81 81 81 81 82 81 81 81 81 80 80 80 80
5988 80 80 80 80 80 80 80 79 80 80 79 79 79 79 80 80 81 81 80 80 80 80 80 80 80 80 80 80 80 80 79 80 80 80 80 80 80 80 80 80 80 80 80 79 79 79 79 79 79 79 78 78 78 78 78 78 78 78 78 78 78 78 78 78 78 78 78 78 77 77 77
5980 77 77 77 77 77 77 77 78 78 78 78 78 78 78 79 78 78 78 78 79 79 79 79 78 78 79 79 79 80 80 80 80 80 80 79 79 80 80 80 79 79 79 79 79 79 79 79 79 79 79 79 79 79 79 79 79 78 78 78 78 78 78 79 78 78 78 78 78 78 78 78
5973 78 78 78 77 77 76 77 77 78 78 78 78 78 78 78 78 79 79 79 79 79 79 80 79 79 79 79 78 79 80 80 80 81 81 81 81 81 81 80 80 80 81 81 82 82 82 81 81 81 82 82 82 82 82 82 81 81 81 81 81 81 81 81 80 80 80 80 80 80 80 81
5965 81 81 81 80 80 80 80 80 79 80 81 81 81 81 80 80 80 80 80 79 80 80 80 79 79 80 80 80 81 81 82 82 82 83 83 83 83 83 83 83 84 84 84 84 84 84 84 84 83 83 83 83 83 84 84 84 84 84 85 84 84 83 83 83 82 82 82 82 82 82 82
5958 82 82 83 83 83 83 83 82 82 82 81 81 81 82 82 82 82 81 81 81 81 82 83 83 82 83 83 83 83 83 82 82 82 82 82 82 82 82 82 82 82 82 82 82 81 82 82 82 82 82 82 82 83 83 83 83 84 84 84 84 84 83 83 83 83 83 83 83 83 83 83
$$ packed form
6010G8%%J%%%%%J%%jJ%%j%%%J%%%%j%%%%J%%%%%%%%%J%%%%j%%%%j%%%%%J%Jj%j%%%%%%j%%
6002G8J%%%J%%%%%%%jjJ%%J%%%%%%%%%%%J%%%%%j%%%%%%%%%%%%%%%J%j%%%%%J%%%%J%%j%%
5995H1%%%%%%%%%%%%%%%J%%%%%%%%%%j%%%%j%J%%%%%%%%%J%J%%j%%%%%%%j%%%%Jj%%%j%%%
5988H0%%%%%%jJ%j%%%J%J%j%%%%%%%%%%%jJ%%%%%%%%%%%j%%%%%%j%%%%%%%%%%%%%%%%%j%%
5980G7%%%%%%J%%%%%%Jj%%%J%%%j%J%%J%%%%%j%J%%j%%%%%%%%%%%%%%%%j%%%%%Jj%%%%%%%
5973G8%%j%jJ%J%%%%%%%J%%%%%Jj%%%jJJ%%J%%%%%j%%J%J%%j%%J%%%%%j%%%%%%%j%%%%%%J
5965H1%%j%%%%jJJ%%%j%%%%jJ%%j%J%%J%J%%J%%%%%%J%%%%%%%j%%%%J%%%%Jj%j%%j%%%%%%
5958H2%J%%%%j%%j%%J%%%j%%%JJ%jJ%%%%j%%%%%%%%%%%%%jJ%%%%%%J%%%J%%%%j%%%%%%%%%
$$ plain form
5951 83 83 82 82 82 82 82 82 82 82 83 83 82 82 82 82 82 81 81 81 82 82 82 83 83 83 82 82 82 82 82 82 83 82 81 81 81 82 81 81 82 82 82 82 82 82 82 82 82 82 82 82 82 81 81 81 81 81 82 82 83 82 81 81 81 81 80 81 81 81 81
5943 81 81 81 81 81 81 81 81 81 81 81 81 81 81 81 81 81 80 79 79 79 79 80 79 79 78 78 78 78 78 78 78 78 78 77 78 78 78 78 78 77 77 77 77 77 77 77 77 77 77 77 77 77 77 77 78 78 78 78 78 78 78 78 78 79 79 79 79 79 79 79
5936 79 79 79 79 79 79 79 79 79 78 78 78 78 78 78 78 78 78 78 78 78 77 77 77 77 77 77 77 77 77 77 77 76 76 75 74 74 74 74 75 75 75 75 75 75 75 75 75 75 75 75 75 75 75 75 75 76 76 76 76 76 76 77 76 76 76 76 77 77 78 78
5928 78 78 78 79 79 79 79 79 80 80 80 81 81 81 80 80 80 81 81 81 81 81 81 80 80 80 81 81 81 81 80 80 80 80 80 80 80 80 79 79 79 79 79 79 79 79 79 79 79 78 77 78 78 78 78 78 78 79 79 79 79 79 80 80 80 80 80 80 80 80 80
5921 80 80 80 80 79 79 79 79 79 80 80 80 80 80 80 80 80 80 80 80 80 81 81 81 80 80 80 81 81 81 81 81 80 80 80 80 81 80 80 80 79 80 80 80 79 79 79 79 80 80 80 80 80 80 80 80 80 80 81 81 80 80 80 80 80 80 80 81 81 81 81
5913 81 81 81 81 81 81 80 80 79 79 79 79 79 80 80 81 81 81 80 80 79 80 80 81 81 81 80 80 80 80 80 80 80 80 80 80 80 80 80 81 81 81 81 80 80 80 80 80 81 81 81 80 81 81 81 81 82 81 81 81 81 81 81 81 81 81 81 81 81 81 82
5906 82 82 82 82 81 81 80 80 80 80 80 81 81 81 81 81 82 82 82 82 82 82 83 83 83 82 81 81 81 81 82 82 82 82 82 82 81 81 81 81 82 82 83 83 83 82 82 82 83 83 83 83 83 83 83 83 83 83 83 83 83 82 81 81 81 82 82 82 82 82 82
5899 82 83 83 83 84 84 84 83 83 83 83 83 83 84 84 85 85 85 85 85 85 85 85 85 85 85 85 85 85 85 84 84 84 84 84 84 84 85 85 85 86 85 85 85 85 85 86 85 84 84 84 83 83 83 82 82 82 82 81 81 81 81 81 81 82 81 81 81 81 81 81
$$ packed form
5951H3%j%%%%%%%J%j%%%%j%%J%%J%%j%%%%%Jjj%%Jj%J%%%%%%%%%%%%j%%%%J%Jjj%%%jJ%%%
5943H1%%%%%%%%%%%%%%%%jj%%%Jj%j%%%%%%%%jJ%%%%j%%%%%%%%%%%%%%J%%%%%%%%J%%%%%%
5936G9%%%%%%%%j%%%%%%%%%%%j%%%%%%%%%%j%jj%%%J%%%%%%%%%%%%%%%%J%%%%%Jj%%%J%J%
5928G8%%J%%%%J%%J%%j%%J%%%%%j%%J%%%j%%%%%%%j%%%%%%%%%%jjJ%%%%%J%%%%J%%%%%%%%
5921H0%%%j%%%%J%%%%%%%%%%%J%%j%%J%%%%j%%%Jj%%jJ%%j%%%J%%%%%%%%%J%j%%%%%%J%%%
5913H1%%%%%j%j%%%%J%J%%j%jJ%J%%j%%%%%%%%%%%%J%%%j%%%%J%%jJ%%%Jj%%%%%%%%%%%%J
5906H2%%%j%j%%%%J%%%%J%%%%%J%%jj%%%J%%%%%j%%%J%J%%j%%J%%%%%%%%%%%%jj%%J%%%%%
5899H2J%%J%%j%%%%%J%J%%%%%%%%%%%%%%j%%%%%%J%%Jj%%%%Jjj%%j%%j%%%j%%%%%Jj%%%%%
$$ plain form
5891 81 81 81 80 80 80 80 80 80 80 79 80 80 80 80 80 80 79 79 78 78 78 79 79 79 79 80 80 79 79 79 79 79 80 80 80 80 81 81 81 82 82 82 82 81 81 80 80 80 80 80 80 80 80 80 80 80 80 80 81 81 81 80 80 80 81 81 81 80 80 80
5884 80 80 80 80 79 79 79 80 80 79 79 79 79 79 79 79 79 79 79 79 79 79 79 80 80 80 80 80 80 80 80 80 80 80 81 80 81 81 80 80 80 80 81 82 82 82 81 81 81 81 81 81 81 81 81 81 81 81 81 80 81 81 81 81 81 81 82 82 82 81 81
5876 81 81 82 82 82 81 81 81 81 81 81 81 81 82 82 82 81 81 81 81 81 80 80 80 80 80 80 81 81 81 81 81 81 81 80 80 80 80 80 81 81 81 81 81 81 81 81 81 81 82 82 82 82 82 82 82 81 80 80 80 80 81 81 81 81 81 81 81 80 80 80
5869 80 80 80 80 80 80 80 80 81 81 81 81 81 80 80 80 80 79 79 79 80 80 80 81 81 81 81 80 80 80 80 80 80 80 80 80 80 80 80 81 81 80 80 81 81 82 82 82 81 81 81 81 81 81 81 81 80 80 81 81 81 81 81 81 81 81 80 80 80 79 79
5861 79 79 80 81 81 81 81 82 81 80 80 80 80 80 79 80 80 81 80 80 81 81 81 81 81 81 80 80 80 80 81 81 81 81 81 81 80 80 80 80 80 80 80 80 80 80 81 81 81 81 81 80 80 80 80 80 80 80 80 80 80 80 79 80 80 80 80 81 81 81 81
5854 81 80 80 79 79 79 80 80 80 80 80 80 81 80 80 80 80 80 80 80 80 79 78 78 78 79 79 79 79 79 79 79 79 79 80 80 80 80 80 80 80 79 79 78 79 79 79 79 79 79 79 80 80 79 79 79 78 79 79 79 79 80 80 79 79 79 79 79 79 79 79
5847 79 79 79 80 80 80 80 79 79 79 79 79 79 79 79 80 80 80 80 79 79 79 79 79 80 80 80 79 79 79 79 79 79 78 78 78 78 78 79 79 80 80 80 79 78 79 79 79 79 79 80 80 79 79 79 79 79 79 79 79 79 79 79 79 79 79 79 79 79 79 79
5839 79 79 80 80 79 79 79 79 79 79 79 79 79 79 79 79 79 79 79 79 80 80 81 80 80 80 80 80 80 80 80 81 81 81 81 81 81 80 80 80 80 80 80 80 80 80 80 80 81 81 82 81 81 81 80 81 81 81 81 81 81 81 81 81 81 81 82 82 82 82 82
$$ packed form
5891H1%%j%%%%%%jJ%%%%%j%j%%J%%%J%j%%%%J%%%J%%J%%%j%j%%%%%%%%%%%%J%%j%%J%%j%%
5884H0%%%j%%J%j%%%%%%%%%%%%%J%%%%%%%%%%JjJ%j%%%JJ%%j%%%%%%%%%%%%jJ%%%%%J%%j%
5876H1%J%%j%%%%%%%J%%j%%%%j%%%%%J%%%%%%j%%%%J%%%%%%%%%J%%%%%%jj%%%J%%%%%%j%%
5869H0%%%%%%%J%%%%j%%%j%%J%%J%%%j%%%%%%%%%%%J%j%J%J%%j%%%%%%%j%J%%%%%%%j%%j%
5861G9%JJ%%%Jjj%%%%jJ%Jj%J%%%%%j%%%J%%%%%j%%%%%%%%%J%%%%j%%%%%%%%%%jJ%%%J%%%
5854H1j%j%%J%%%%%Jj%%%%%%%jj%%J%%%%%%%%J%%%%%%j%jJ%%%%%%J%j%%jJ%%%J%j%%%%%%%
5847G9%%J%%%j%%%%%%%J%%%j%%%%J%%j%%%%%j%%%%J%J%%jjJ%%%%J%j%%%%%%%%%%%%%%%%%%
5839G9%J%j%%%%%%%%%%%%%%%J%Jj%%%%%%%J%%%%%j%%%%%%%%%%J%Jj%%jJ%%%%%%%%%%J%%%%
$$ plain form
5832 82 82 82 82 82 82 82 82 81 81 81 82 82 82 82 82 81 81 80 81 81 81 81 81 81 82 82 82 83 83 82 82 82 82 82 82 82 81 81 81 82 82 82 83 83 82 82 82 81 81 82 82 83 83 83 83 83 83 82 82 83 83 83 83 83 83 82 82 83 83 83
5824 83 83 83 83 83 83 83 83 83 82 83 83 83 83 83 83 83 83 83 83 83 84 84 84 84 84 84 84 83 84 84 84 83 83 83 82 82 82 83 83 83 83 83 83 83 83 84 83 83 82 82 83 83 83 83 83 83 83 83 83 83 83 83 83 83 82 82 82 82 82 82
5817 82 82 82 83 83 83 83 83 83 83 83 83 82 82 82 82 82 82 82 82 82 82 82 82 82 82 82 82 82 82 81 82 82 83 82 81 81 81 81 81 81 81 81 81 81 81 81 81 80 80 80 81 81 81 80 80 81 80 80 80 80 80 80 80 81 80 80 81 81 80 80
5810 80 80 80 80 80 80 80 79 79 79 79 79 79 79 78 78 77 77 77 77 77 77 77 77 78 78 78 79 78 78 78 78 77 77 78 78 78 78 78 79 78 78 78 78 78 78 78 78 78 78 78 78 78 77 77 77 76 76 77 77 77 77 77 76 76 76 76 76 76 76 75
5802 75 75 75 75 75 76 76 76 76 76 75 75 75 75 75 75 75 75 75 75 75 75 75 75 75 74 74 74 75 75 75 76 76 76 76 77 77 76 76 76 76 76 77 77 77 77 77 77 78 78 78 77 76 76 76 77 77 78 78 77 77 77 77 77 77 77 77 77 77 77 77
5795 77 77 77 78 78 77 77 77 77 77 77 77 77 77 78 77 77 77 77 77 77 78 78 78 78 78 78 78 78 78 78 78 78 78 79 78 78 78 78 78 79 79 80 80 80 80 80 80 79 79 80 80 80 80 80 81 81 82 82 82 82 81 81 81 81 81 81 81 80 80 80
5787 80 80 80 80 80 80 81 81 81 81 81 81 82 82 82 81 81 82 81 81 81 81 80 80 80 80 80 80 80 81 81 80 80 80 80 80 81 81 81 82 81 81 80 80 80 80 80 80 80 80 80 80 81 81 81 81 81 81 81 81 81 81 81 81 81 81 81 81 81 81 81
5780 81 81 81 81 82 82 83 82 82 82 82 82 82 81 81 81 82 82 82 82 82 82 82 82 83 82 82 82 82 82 82 82 82 82 82 82 82 82 82 82 82 81 81 81 81 81 81 81 81 81 81 81 81 81 82 82 82 82 82 81 81 82 81 81 81 81 81 82 82 82 82
$$ packed form
5832H2%%%%%%%j%%J%%%%j%jJ%%%%%J%%J%j%%%%%%j%%J%%J%j%%j%J%J%%%%%j%J%%%%%j%J%%
5824H3%%%%%%%%jJ%%%%%%%%%%J%%%%%%jJ%%j%%j%%J%%%%%%%Jj%j%J%%%%%%%%%%%%%j%%%%%
5817H2%%J%%%%%%%%j%%%%%%%%%%%%%%%%%jJ%Jjj%%%%%%%%%%%%j%%J%%j%Jj%%%%%%Jj%J%j%
5810H0%%%%%%j%%%%%%j%j%%%%%%%J%%Jj%%%j%J%%%%Jj%%%%%%%%%%%%j%%j%J%%%%j%%%%%%j
5802G5%%%%J%%%%j%%%%%%%%%%%%%%j%%J%%J%%%J%j%%%%J%%%%%J%%jj%%J%J%j%%%%%%%%%%%
5795G7%%J%j%%%%%%%%Jj%%%%%J%%%%%%%%%%%%Jj%%%%J%J%%%%%j%J%%%%J%J%%%j%%%%%%j%%
5787H0%%%%%J%%%%%J%%j%Jj%%%j%%%%%%J%j%%%%J%%Jj%j%%%%%%%%%J%%%%%%%%%%%%%%%%%%
5780H1%%%J%Jj%%%%%j%%J%%%%%%%Jj%%%%%%%%%%%%%%%j%%%%%%%%%%%%J%%%%j%Jj%%%%J%%%
$$ plain form
5772 82 82 82 82 81 81 81 81 81 81 80 80 81 81 81 81 82 82 82 83 83 82 82 82 82 82 82 81 82 83 83 83 83 83 83 83 83 83 83 83 83 83 84 84 84 83 83 83 84 84 84 84 84 84 84 84 84 84 84 84 84 84 84 84 84 83 83 83 83 83 83
5765 83 83 83 83 83 83 83 83 84 84 84 84 84 84 83 84 84 84 84 84 84 84 83 84 84 84 84 83 83 83 82 82 82 82 82 82 82 82 82 83 83 82 82 82 82 83 83 83 83 83 82 82 83 82 82 82 82 82 82 81 81 82 82 82 82 82 82 82 82 82 82
5758 82 83 83 83 82 83 83 83 83 83 83 83 84 84 84 84 84 84 85 84 84 84 84 84 84 84 85 85 85 85 85 85 85 85 86 85 85 85 85 85 84 84 84 83 83 83 83 84 84 84 84 84 84 84 84 84 83 83 83 82 82 82 82 82 82 82 82 82 83 83 83
5750 83 82 82 82 81 81 82 82 82 82 83 83 84 84 84 85 84 83 83 84 84 85 84 84 83 84 84 84 85 85 85 85 84 84 84 84 84 84 84 84 84 84 84 84 84 84 84 83 83 83 83 83 82 82 82 82 82 82 82 82 82 82 81 81 81 81 81 81 81 81 81
5743 81 81 81 81 82 82 82 82 82 81 81 81 81 81 81 81 81 81 81 81 81 81 81 81 81 81 81 82 82 82 83 82 82 82 82 82 82 81 80 80 80 80 81 81 81 82 82 81 81 81 81 81 81 81 81 82 82 82 82 82 81 81 81 81 81 81 81 81 81 82 82
5735 82 81 81 80 81 81 81 80 80 80 81 81 81 81 81 81 80 80 80 79 80 80 80 80 80 80 80 80 79 79 79 79 79 79 79 79 79 79 78 78 78 77 77 78 78 78 79 79 79 79 79 79 80 80 80 81 81 81 81 81 82 82 82 82 82 83 83 83 84 84 84
5728 84 85 85 85 85 85 84 85 85 86 86 86 86 86 85 86 86 86 86 86 86 86 86 85 85 85 85 86 86 86 86 85 85 85 84 84 84 84 84 84 84 85 85 84 84 84 83 83 83 83 83 83 83 83 83 83 83 84 84 84 84 84 85 84 84 84 85 85 84 84 84
5721 84 85 86 86 87 87 87 87 87 87 88 88 88 89 89 89 89 89 89 89 89 89 89 89 89 89 89 89 90 90 90 90 90 90 90 90 90 90 90 90 89 89 89 89 89 90 90 90 90 90 90 90 90 90 90 90 90 89 89 88 88 89 89 89 89 89 89 89 89 89 90
$$ packed form
5772H2%%%j%%%%%j%J%%%J%%J%j%%%%%jJJ%%%%%%%%%%%%J%%j%%J%%%%%%%%%%%%%%%%j%%%%%
5765H3%%%%%%%J%%%%%jJ%%%%%%jJ%%%j%%j%%%%%%%%J%j%%%J%%%%j%Jj%%%%%j%J%%%%%%%%%
5758H2J%%jJ%%%%%%J%%%%%Jj%%%%%%J%%%%%%%Jj%%%%j%%j%%%J%%%%%%%%j%%j%%%%%%%%J%%
5750H3j%%j%J%%%J%J%%Jjj%J%Jj%jJ%%J%%%j%%%%%%%%%%%%%%j%%%%j%%%%%%%%%j%%%%%%%%
5743H1%%%J%%%%j%%%%%%%%%%%%%%%%%J%%Jj%%%%%jj%%%J%%J%j%%%%%%%J%%%%j%%%%%%%%J%
5735H2j%jJ%%j%%J%%%%%j%%jJ%%%%%%%j%%%%%%%%%j%%j%J%%J%%%%%J%%J%%%%J%%%%J%%J%%
5728H4J%%%%jJ%J%%%%jJ%%%%%%%j%%%J%%%j%%j%%%%%%J%j%%j%%%%%%%%%%J%%%%Jj%%J%j%%
5721H4JJ%J%%%%%J%%J%%%%%%%%%%%%%%J%%%%%%%%%%%j%%%%J%%%%%%%%%%%j%j%J%%%%%%%%J
$$ plain form
5713 90 90 90 90 90 90 90 90 90 91 91 91 91 91 91 90 90 90 90 90 90 90 90 91 91 91 92 92 92 92 92 92 92 93 93 93 93 93 93 92 93 92 92 92 93 93 93 93 93 93 93 93 93 93 93 93 94 94 94 94 93 93 93 93 93 94 95 95 95 95 95
5706 95 95 95 95 94 94 94 94 94 94 93 93 94 94 94 95 95 95 95 95 95 95 95 94 94 94 94 94 94 94 94 94 94 95 95 95 96 96 96 95 95 95 94 94 95 95 95 95 95 95 95 95 95 95 95 95 95 95 94 94 94 93 93 93 93 94 94 94 94 94 94
5698 94 94 94 94 95 95 95 95 96 96 96 96 96 96 96 96 96 96 96 96 97 96 96 95 95 95 96 96 97 96 96 96 96 97 98 98 98 98 97 97 97 97 97 97 97 97 98 98 98 98 98 98 98 98 98 98 98 98 98 98 99 98 97 97 97 98 98 98 98 98 99
5691 99 99 99 99 99 99 99 99 101 101 102 102 103 103 103 104 105 106 106 106 106 107 107 108 108 109 110 110 110 111 111 112 112 112 113 113 114 114 115 116 116 117 117 117 118 118 118 119 119 120 120 121 121 121 121 121 121 121 120 120 121 121 120 120 119 119 119 119 118 118 118
5683 118 118 117 117 116 116 115 115 114 114 113 113 112 112 111 111 112 112 112 112 111 111 111 110 109 109 109 109 108 108 108 108 108 108 108 107 106 107 107 107 107 107 107 107 106 106 106 106 106 106 105 105 105 106 106 106 107 107 107 107 107 107 107 107 108 108 108 107 107 107
5676 107 106 106 107 108 108 109 108 108 108 108 108 109 109 109 108 108 108 108 108 108 109 108 108 107 107 107 107 108 108 108 108 108 108 107 107 106 106 106 106 106 106 106 106 106 106 105 105 105 106 105 105 104 104 104 104 105 105 105 105 105 105 105 106 107 107 108 108 109 109
5669 109 110 110 110 110 111 111 111 112 112 112 113 113 113 114 114 115 115 114 114 114 114 115 115 115 116 116 117 117 117 117 117 117 116 116 116 116 116 116 116 116 116 116 115 115 115 115 115 115 116 116 116 116 116 116 116 116 116 116 116 116 116 116 116 117 117 117 118 118 118
5662 118 118 119 120 120 120 120 120 120 121 122 122 123 124 124 124 124 125 125 125 125 126 126 126 126 127 127 127 127 128 129 129 129 129 129 129 129 129 129 129 130 130 130 130 131 131 131 131 132 132 132 132 131 131 132 132 133 133 133 133 133 133 133 134 134 134 135 135 135 136
$$ packed form
5713I0%%%%%%%%J%%%%%j%%%%%%%J%%J%%%%%%J%%%%%jJj%%J%%%%%%%%%%%J%%%j%%%%JJ%%%%
5706I5%%%j%%%%%j%J%%J%%%%%%%j%%%%%%%%%J%%J%%j%%j%J%%%%%%%%%%%%%j%%j%%%J%%%%%
5698I4%%%J%%%J%%%%%%%%%%%Jj%j%%J%Jj%%%JJ%%%j%%%%%%%J%%%%%%%%%%%%%Jjj%%J%%%%J
5691I9%%%%%%%K%J%J%%JJJ%%%J%J%JJ%%J%J%%J%J%JJ%J%%J%%J%J%J%%%%%%j%J%j%j%%%j%%
5683A18%j%j%j%j%j%j%j%J%%%j%%jj%%%j%%%%%%jjJ%%%%%%j%%%%%j%%J%%J%%%%%%%J%%j%%
5676A07j%JJ%Jj%%%%J%%j%%%%%Jj%j%%%J%%%%%j%j%%%%%%%%%j%%Jj%j%%%J%%%%%%JJ%J%J%
5669A09J%%%J%%J%%J%%J%J%j%%%J%%J%J%%%%%j%%%%%%%%%j%%%%%J%%%%%%%%%%%%%%J%%J%%
5662A18%JJ%%%%%JJ%JJ%%%J%%%J%%%J%%%JJ%%%%%%%%%J%%%J%%%J%%%j%J%J%%%%%%J%%J%%J
$$ plain form
5654 136 136 136 136 136 137 137 138 138 139 139 139 139 139 139 139 140 140 141 141 142 142 142 142 142 143 143 143 144 144 144 145 145 145 145 145 146 147 147 147 147 148 149 149 150 150 151 151 151 151 151 151 151 151 151 151 152 152 153 153 153 153 154 155 156 157 157 156 156 156
5647 156 156 156 157 157 157 157 157 158 158 159 159 160 161 161 161 162 163 164 166 168 170 171 172 174 177 180 183 186 190 194 198 203 209 215 221 226 232 236 239 240 240 239 236 232 227 222 216 210 205 201 196 192 189 186 184 182 181 180 179 179 179 178 177 177 177 178 177 177 177
5640 177 177 177 178 179 179 180 180 180 180 181 182 183 183 183 183 184 184 185 185 186 186 187 189 189 189 190 190 191 192 193 193 194 196 197 198 198 200 201 202 202 202 203 204 205 206 207 208 209 210 211 212 213 214 215 216 217 218 219 220 221 221 222 223 223 224 223 223 224 225
5632 225 226 227 227 228 230 230 231 232 233 233 234 235 235 236 236 237 238 238 239 240 241 242 242 243 244 246 247 248 250 250 251 253 254 256 257 258 259 261 262 264 266 267 268 270 271 272 274 276 278 279 281 283 284 287 289 291 293 294 296 298 300 301 303 305 306 309 311 314 315
5625 315 317 319 321 323 325 327 330 332 334 336 338 341 343 345 347 349 352 355 358 360 363 366 368 371 373 376 379 382 386 390 394 398 402 406 411 417 423 429 436 444 452 461 470 479 485 491 495 497 498 498 497 497 496 496 497 498 500 505 510 516 523 530 538 547 557 567 577
5618 577 588 598 605 611 615 617 619 621 624 628 633 640 648 656 665 675 684 693 700 706 711 716 721 726 731 737 745 754 765 778 792 807 823 838 853 866 877 886 891 894 894 894 893 893 894 897 902 908 917 927 938 950 962
5612 962 974 985 996 1005 1013 1020 1026 1033 1039 1046 1054 1063 1072 1084 1096 1109 1121 1135 1150 1165 1181 1197 1214 1232 1250 1269 1289 1310 1330 1351 1373 1395 1419 1443 1468 1493 1518 1545 1572 1601
5608 1601 1630 1660 1691 1724 1756 1790 1824 1860 1897 1934 1973 2013 2055 2097 2141 2186 2233 2281 2330 2381 2433 2486 2541 2598 2656 2717 2779 2843 2909 2976 3046 3117 3191 3268
$$ packed form
5654A36%%%%J%J%J%%%%%%J%J%J%%%%J%%J%%J%%%%JJ%%%JJ%J%J%%%%%%%%%J%J%%%JJJJ%j%%
5647A56%%J%%%%J%J%JJ%%JJJKKKJJKLLLLMMMNOOONOMLJ%jlmnnoonmnmllkkjjj%%jj%%Jj%%
5640A77%%JJ%J%%%JJJ%%%J%J%J%JK%%J%JJJ%JKJJ%KJJ%%JJJJJJJJJJJJJJJJJJJ%JJ%Jj%JJ
5632B25JJ%JK%JJJ%JJ%J%JJ%JJJJ%JJKJJK%JKJKJJJKJKKJJKJJKKKJKKJLKKKJKKKJKKJLKLJ
5625C15KKKKKKLKKKKLKKKKLLLKLLKLKLLLMMMMMMNOOOPQQRRROOMKJ%j%j%JJKNNOPPQRJ0J0J0
5618E77J1J0POMKKKLMNPQQRJ0RRPONNNNNOQRJ1J3J4J5J6J5J5J3J1RNL%%j%JLNORJ0J1J2J2
5612I62J2J1J1RQPOPOPQRRJ2J2J3J2J4J5J5J6J6J7J8J8J9K0K1K0K1K2K2K4K4K5K5K5K7K7K9
5608A601K9L0L1L3L2L4L4L6L7L7L9M0M2M2M4M5M7M8M9N1N2N3N5N7N8O1O2O4O6O7P0P1P4P7
$$ plain form
5604 3268 3346 3426 3508 3592 3679 3769 3861 3955 4052 4152 4254 4359 4466 4576 4688 4803 4920 5040 5162 5287 5413 5542 5673 5805 5938 6073
5602 6073 6209 6347 6484 6622 6760 6896 7032 7167 7299 7429 7557 7681 7801 7917 8028 8134 8234 8328 8414 8493 8563 8625 8678 8721 8756 8782
5599 8782 8797 8802 8797 8782 8758 8724 8680 8626 8564 8493 8414 8327 8233 8132 8025 7912 7795 7672 7546 7417 7285 7150 7014 6876 6738 6599 6459 6320
5596 6320 6182 6044 5908 5774 5641 5509 5380 5253 5128 5006 4887 4769 4655 4543 4434 4327 4223 4122 4023 3928 3834 3743 3655 3569 3486
5593 3486 3405 3326 3249 3175 3103 3033 2965 2899 2835 2773 2713 2655 2598 2543 2489 2437 2387 2338 2290 2244 2199 2156 2114 2072 2032 1993 1955 1919 1883 1847 1813 1780 1749 1717
5590 1717 1686 1656 1626 1598 1571 1545 1518 1492 1468 1444 1420 1396 1374 1352 1330 1310 1290 1270 1250 1231 1212 1193 1175 1157 1140 1123 1107 1091 1075 1059 1044 1029 1015 1002
5586 1002 988 975 961 948 934 922 909 897 885 873 863 852 842 831 820 810 801 791 781 772 762 753 745 736 728 720 712 704 696 689 683 676 670 664 657 651 645 639 633 627 622 616 610 604 597 590 584 578 573
5581 573 567 560 554 548 543 538 534 531 527 524 520 516 511 506 501 495 489 482 476 469 463 457 452 447 444 440 437 434 431 429 426 424 420 417 413 410 406 401 397 393 390 387 383 380 377 375 373 371 370 368 367 365 363 361 359 357 355 353 351 349 347 345 344 342 340 339 337 336 334
$$ packed form
5604C268P8Q0Q2Q4Q7R0R2R4R7J00J02J05J07J10J12J15J17J20J22J25J26J29J31J32J33J35
5602F073J36J38J37J38J38J36J36J35J32J30J28J24J20J16J11J06J00R4Q6P9P0O2N3M3L5K6
5599H782J5Nnj5k4l4m4n4o2p1p9q7r4j01j07j13j17j23j26j29j32j35j36j38j38j39j40j39
5596F320j38j38j36j34j33j32j29j27j25j22j19j18j14j12j09j07j04j01r9r5r4r1q8q6q3
5593C486q1p9p7p4p2p0o8o6o4o2o0n8n7n5n4n2n0m9m8m6m5m3m2m2m0l9l8l6l6l6l4l3l1l2
5590A717l1l0l0k8k7k6k7k6k4k4k4k4k2k2k2k0k0k0k0j9j9j9j8j8j7j7j6j6j6j6j5j5j4j3
5586A002j4j3j4j3j4j2j3j2j2j2j0j1j0j1j1j0rj0j0rj0rqrqqqqqpopoopooooonoooppoon
5581E73opoonnmlmlmmnnnoopopoonnlmlllklkmlmlmnmmllmllkkkjkjkkkkkkkkkkkjkkjkjk
$$ plain form
5574 334 333 331 330 329 328 326 324 323 323 322 322 322 322 322 322 323 323 323 324 325 327 330 334 338 342 346 352 357 362 365 367 366 364 361 359 359 360 364 369 374 381 387 392 396 398 399 399 397 394 390 385 379 375 372 370 369 369 370 370 369 366 361 355 348 342 337 331 326 320
5566 320 314 307 300 294 288 283 279 276 274 272 270 268 267 266 265 265 266 267 268 269 270 271 271 271 271 271 271 272 272 275 277 281 284 289 295 301 308 316 323 330 336 339 342 344 346 348 352 357 360 361 360 357 352 347 342 338 336 335 334 335 335 333 331 329 326 322 318 314 310
5559 310 306 301 296 288 281 273 266 260 255 251 248 245 243 242 241 241 240 239 238 238 237 237 236 236 235 235 234 234 234 233 233 233 234 236 238 241 244 247 252 256 260 264 269 273 278 282 286 289 291 292 292 291 290 287 284 279 275 269 264 259 254 250 246 242 238 234 231 229 227
5552 227 224 222 221 220 220 220 220 220 221 222 223 223 222 222 221 221 220 219 220 221 222 226 230 235 241 246 250 255 259 261 262 263 262 260 258 257 257 258 262 268 275 282 289 294 297 298 297 295 292 289 286 284 283 283 285 287 289 293 298 303 308 311 311 309 303 295 285 275
5544 275 266 260 257 257 259 262 266 270 275 281 287 293 299 304 306 305 302 297 292 288 285 282 282 283 285 288 292 299 307 317 328 341 353 364 373 381 388 393 397 401 405 410 417 425 436 448 463 481 500 520 540 561 581 601
5539 601 621 640 659 679 701 724 750 780 814 850 890 933 979 1028 1080 1134 1192 1253 1319 1389 1463 1540 1622 1709 1801 1901 2011 2134 2271 2425 2599 2797
5535 2797 3023 3283 3580 3921 4312 4761 5273 5858 6526 7287 8147 9111 10168 11292 12431 13513 14452 15168 15610 15759 15633 15307
5533 15307 14889 14490 14210 14135 14323 14802 15575 16630 17934 19431 21031 22604 23996 25052 25642 25679 25141 24089 22639 20949
$$ packed form
5574C34jkjjjkkj%j%%%%%J%%JJKLMMMMONNLKjklk%JMNNPONMKJ%klmnomlkj%J%jlnoponono
5566C20oppoonmlkkkkjjj%JJJJJJ%%%%%J%LKMLNOOPQPPOLLKKKMNLJjlnnnmkjjJ%kkklmmmm
5559C10mnnqpqponmllkjj%jjj%j%j%j%j%%j%%JKKLLLNMMMNMNMMLKJ%jjllnmonnnmmmmmlkk
5552B27lkjj%%%%JJJ%j%j%jjJJJMMNONMNMKJJjkkj%JMOPPPNLJjklllkj%KKKMNNNL%koqj0j0
5544B75rol%KLMMNOOOONKjlnnmll%JKLMPQJ0J1J3J2J1RQPNMMMNPQJ1J2J5J8J9K0K0K1K0K0
5539F01K0J9J9K0K2K3K6L0L4L6M0M3M6M9N2N4N8O1O6P0P4P7Q2Q7R2J00J10J23J37J54J74J98
5535B797K26K60K97L41L91M49N12N85O68P61Q60R64J057J124J139J082R39P16M42J49j26l26
5533A5307m18l99k80p5J88M79P73J055J304J497J600J573J392J056N90L7n38j052j450j690
$$ plain form
5531 20949 19191 17523 16061 14882 14021 13478 13231 13247 13476 13850 14283 14670 14899 14885 14579 13964 13068 11969 10766 9544 8375
5529 8375 7315 6388 5596 4925 4359 3881 3479 3139 2853 2610 2404 2228 2079 1950 1838 1741 1652 1572 1496 1424 1353 1284 1218 1155 1096 1042
5526 1042 993 948 907 871 839 810 786 765 746 728 711 695 678 662 646 631 617 604 593 583 575 567 561 554 548 541 532 523 512 500 487 474 461 449 438 430 424 420 419 421 424
5522 424 425 426 423 418 411 402 392 381 371 360 350 340 330 320 311 305 301 301 302 305 307 310 312 313 312 311 309 305 300 293 284 274 263 251 242 234 229 227 227 229 231 232 234 234 234 232 230 226 222 217 211 205 201 199 199 201 205 209
5515 209 214 217 217 217 215 212 208 205 202 200 199 200 202 204 206 209 212 215 218 220 222 223 222 220 217 213 210 208 206 205 204 204 204 204 204 203 203 203 204 206 207 209 209 210 211 212 213 214 216 219 223 227 231 234 237 239 240 241 242 241 241 241 241 241 241 241 241 242 243
5508 243 244 244 245 244 243 242 239 237 233 230 228 225 225 226 231 238 248 257 266 274 282 289 295 300 305 309 314 321 327 333 338 343 348 351 353 350 344 335 325 315 303 292 286 284 288 291 290 282 271 258 248 242 239 241 248 259 273 285
5502 285 293 297 300 301 304 309 316 325 332 334 333 331 332 337 342 349 355 360 362 362 360 356 352 350 349 350 352 356 359 364 370 379 391 407 426 447 468 489 508 524 540 556 571 588 608 630 656 685 717 749 781
5497 781 811 841 870 899 925 949 969 991 1016 1045 1079 1117 1163 1221 1290 1365 1440 1511 1581 1647 1715 1788 1871 1968 2082 2215 2364 2526 2702 2892 3102
$$ packed form
5531B0949j758j668j462j179q61n43k47J6K29L74M33L87K29j4l06o15q96j099j203j222j169
5529H375j060r27p92o71n66m78m02l40k86k43k06j76j49j29j12r7q9q0p6p2p1o9o6o3n9n4
5526A042m9m5m1l6l2k9k4k1j9j8j7j6j7j6j6j5j4j3j1j0qqopoprrj1j2j3j3j3j2j1qomjKL
5522D24JJlnprj0j1j0j1j0j0j0j0rom%JLKLKJjjkmnprj0j1j2rqnk%KKJK%%kkmmnoomk%KMM
5515B09NL%%klmllkjJKKKLLLLKKJjklmlkkjj%%%%j%%JKJK%JJJJJKLMMMLLKJJJj%%%%%%%JJ
5508B43J%Jjjjlkmlkl%JNPJ0RRQQPONNMNPOONNNLKlorj0j0j2j1okMLjqj1j3j0olKPJ1J4J2
5502B85QMLJLNPRPKjkJNNPONK%kmmkjJKMLNORJ2J6J9K1K1K1J9J6J6J6J5J7K0K2K6K9L2L2L2
5497G81L0L0K9K9K6K4K0K2K5K9L4L8M6N8O9P5P5P1P0O6O8P3Q3R7J14J33J49J62J76J90K10
$$ plain form
5493 3102 3338 3608 3915 4260 4637 5028 5413 5768 6080 6357 6634 6962 7385 7934 8631 9495 10550 11824 13338 15101 17096
5491 17096 19262 21469 23520 25170 26217 26631 26607 26451 26387 26495 26764 27165 27654 28130 28402 28216 27367 25893 24119 22435 21065
5489 21065 20019 19193 18467 17757 17029 16275 15489 14682 13884 13117 12361 11568 10699 9769 8841 7984 7241 6620 6111 5699 5369 5110
5486 5110 4913 4767 4668 4613 4597 4622 4686 4791 4939 5135 5383 5688 6058 6502 7022 7616 8274 8968 9657 10282 10789 11149 11393 11611 11916
5484 11916 12402 13127 14121 15396 16947 18750 20746 22841 24902 26785 28376 29618 30495 30978 30964 30314 29007 27280 25551
5482 25551 24190 23381 23141 23391 23986 24707 25264 25329 24643 23161 21133 18958 16932 15163 13644 12340 11209 10200 9256 8340
5480 8340 7454 6629 5899 5275 4749 4305 3927 3605 3327 3087 2874 2685 2515 2364 2234 2123 2026 1942 1866 1794 1723 1652 1579 1503 1428 1356
5477 1356 1290 1233 1185 1144 1107 1069 1027 983 938 896 858 824 793 765 742 724 709 696 683 673 666 660 653 645 635 624 614 603 594 585 577 570 565 559 553 546 538 530 522 515 508 500 490
$$ packed form
5493C102K36K70L07L45L77L91L85L55L12K77K77L28M23N49O97Q64J055J274J514J763J995
5491A7096K166K207K051J650J047M14k4j56o4J08K69M01M89M76K72j86q49j474j774j684j370
5489B1065j046q26p26p10p28p54p86q07p98p67p56p93q69r30r28q57p43o21n09m12l30k59
5486E110j97j46r9n5j6K5O4J05J48J96K48L05L70M44N20N94O58O94O89O25N07L60K44K18L05
5484A1916M86P25R94J275J551J803J996K095K061J883J591J242Q77M83j4o50j307j727j729
5482B5551j361q09k40K50N95P21N57O5o86j482k028k175k026j769j519j304j131j009r44r16
5480H340q86q25p30o24n26m44l78l22k78k40k13j89j70j51j30j11r7q4p6p2p1p1p3p6p5p2
5477A356o6n7m8m1l7l8m2m4m5m2l8l4l1k8k3j8j5j3j3j0popqj0j1j0j1rrqpnoopqqqppqj0
$$ plain form
5472 490 480 467 451 433 414 396 381 370 361 355 351 347 344 342 340 338 336 334 336 340 346 350 351 350 348 345 343 341 341 340 336 329 318 305 293 282 275 272 272 274 276 275 265 248 227 206 189 176 166 161
5467 161 162 167 174 181 187 190 193 194 193 189 184 181 178 178 179 182 186 192 198 204 207 207 204 201 197 193 188 184 181 179 177 175 171 166 162 158 155 153 152 152 152 153 152 152 152 151 151 150 151 151 152 153 155 158 160 163 165 167 168 170 170 171 172 173 173 172 171 169 167
5460 167 165 163 161 161 162 163 164 165 165 165 163 160 157 153 150 147 146 145 144 144 143 144 144 144 145 145 146 145 145 144 143 141 139 138 136 135 134 133 133 133 133 133 133 132 130 129 128 128 129 131 132 131 131 131 131 131 130 130 130 131 131 132 133 134 135 135 136 136 137
5452 137 137 137 138 139 140 141 142 143 143 144 144 144 143 142 142 143 144 145 145 146 147 148 150 151 152 154 156 159 162 167 171 176 181 186 191 197 202 206 209 210 211 210 209 207 206 207 208 210 214 219 226 233 241 249 257 263 266 267 266 261 254 246 237 229 220 214 209 207 205
5445 205 204 204 205 207 208 209 209 208 206 202 198 192 187 180 175 170 164 160 155 151 146 141 136 132 129 126 124 123 121 118 116 112 109 106 103 102 101 100 99 99 98 98 97 97 96 96 96 95 96 97 98 98 99 100 101 102 102 103 103 104 104 105 106 107 108 109 110 112 113
5438 113 114 116 117 119 121 122 123 123 122 121 120 120 119 118 117 117 118 119 119 120 121 121 121 121 119 116 113 110 106 101 97 92 89 86 85 85 84 83 82 82 80 77 74 70 68 66 65 64 64 64 64 65 66 66 66 66 67 68 68 69 70 70 71 71 72 72 73 74 74
5431 74 74 74 75 75 76 77 77 78 78 79 79 79 80 80 80 81 81 81 82 82 82 81 81 81 82 82 82 82 82 83 83 83 83 82 82 82 82 82 82 82 82 83 83 83 83 83 83 83 83 83 83 83 82 82 81 80 81 81 81 81 81 81 81 81 81 81 81 80 80 80
5423 80 80 81 81 82 83 83 83 83 82 82 82 82 82 82 82 81 82 82 83 83 83 83 83 83 83 83 84 84 84 84 84 84 84 84 84 84 84 84 85 85 85 85 85 85 85 86 86 86 86 86 86 87 87 87 87 87 86 87 87 87 87 86 86 86 87 88 88 88 89 89
$$ packed form
5472D90j0j3j6j8j9j8j5j1rommlkkkkkKMOMJjklkk%jmpj1j3j2j1pl%KKjj0j7k1k1j7j3j0n
5467A61JNPPOLLJjmnll%JLMOOOL%llmmnmlkkkmnmmlkj%%Jj%%j%jJ%JJKLKLKKJK%JJJ%jjkk
5460A67kkk%JJJJ%%kllmlljjj%jJ%%J%Jj%jjkkjkjjj%%%%%jkjj%JKJj%%%%j%%J%JJJJ%J%J
5452A37%%JJJJJJ%J%%jj%JJJ%JJJKJJKKLLNMNNNNONMLJJjjkjJJKMNPPQQQOLJjnpqrqronkk
5445B05j%JKJJ%jkmmonpnnomnmnnnmllkjklkmllljjjj%j%j%j%%jJJJ%JJJJ%J%J%JJJJJJKJ
5438A13JKJKKJJ%jjj%jjj%JJ%JJ%%%klllmnmnllj%jjj%kllmkkjj%%%JJ%%%JJ%JJ%J%J%JJ%
5431G4%%J%JJ%J%J%%J%%J%%J%%j%%J%%%%J%%%j%%%%%%%J%%%%%%%%%%j%jjJ%%%%%%%%%%j%%
5423H0%J%JJ%%%j%%%%%%jJ%J%%%%%%%J%%%%%%%%%%%J%%%%%%J%%%%%J%%%%jJ%%%j%%JJ%%J%
$$ plain form
5416 89 89 89 90 90 90 90 90 90 90 91 91 92 92 93 93 94 94 94 94 94 94 94 95 96 97 98 99 100 101 102 102 103 104 105 106 107 108 110 112 115 117 120 124 128 133 138 144 150 155 160 164 168 171 174 179 184 190 196 202 206 209 212 215 218 220 223 226 227 225 221
5408 221 214 206 197 190 184 181 179 179 180 181 181 179 177 174 170 165 160 154 148 143 139 136 133 131 129 127 125 123 122 121 120 120 119 119 118 119 119 120 121 123 125 127 130 134 138 144 149 155 160 166 171 174 175 177 178 180 184 187 191 194 196 197 198 200 201 202 202 204 205
5401 205 206 208 209 210 210 211 213 214 213 209 205 201 197 194 192 191 188 184 179 174 168 161 154 147 140 133 127 123 119 116 113 110 108 106 104 102 101 100 100 99 98 97 96 95 94 93 94 94 93 93 92 92 92 91 90 90 90 89 89 89 89 89 88 88 88 88 88 89 88
5394 88 88 88 88 88 88 89 88 88 88 89 89 89 89 89 89 89 89 90 90 91 91 92 92 92 92 92 92 92 92 92 92 92 93 93 93 93 93 94 95 94 94 94 93 93 93 93 93 93 93 93 93 93 93 93 93 93 93 93 92 92 92 92 92 92 92 92 92 92 92 92
5386 92 92 92 92 92 92 92 92 93 93 92 92 92 92 92 92 93 93 93 93 93 93 93 93 93 93 93 93 93 93 93 93 94 94 93 93 94 94 94 94 94 94 94 94 94 94 94 94 94 94 94 94 94 93 92 93 94 94 94 93 93 94 94 94 94 95 95 95 94 94 93
5379 93 93 93 94 94 94 93 93 94 94 94 94 94 94 94 94 93 93 93 93 94 95 95 94 93 93 93 94 93 93 93 93 93 94 94 94 94 94 94 95 96 96 96 96 96 97 97 98 98 99 99 100 100 101 101 101 101 102 103 103 105 106 108 109 111 114 116 118 122 126 129
5371 129 133 137 142 145 147 149 150 151 152 152 153 154 156 156 156 155 154 154 154 154 156 158 159 161 163 164 165 167 168 168 169 169 169 167 165 163 160 159 157 156 155 153 151 148 144 141 138 136 134 132 131 130 129 128 127 125 124 122 120 119 118 117 117 117 117 118 119 120 122
5364 122 123 125 127 130 133 136 140 144 148 152 155 158 161 162 163 164 166 167 168 170 172 174 176 177 179 181 184 187 192 196 200 203 205 207 208 208 209 211 214 216 219 220 220 217 211 203 193 184 176 169 165 161 158 155 152 149 145 141 137 133 128 124 121 118 116 114 111 110
$$ packed form
5416H9%%J%%%%%%J%J%J%J%%%%%%JJJJJJJJ%JJJJJJKKLKLMMNNOONNMMLLNNOOOMLLLLKLLJkm
5408B21pqrpolk%JJ%kklmnnoonmllkkkkkjjj%j%jJ%JJKKKLMMONONONLJKJKMLMLKJJKJJ%KJ
5401B05JKJJ%JKJjmmmmlkjlmnnopppppommlllkkkkjj%jjjjjjjJ%j%j%%jj%%j%%%%j%%%%Jj
5394H8%%%%%Jj%%J%%%%%%%J%J%J%%%%%%%%%%J%%%%JJj%%j%%%%%%%%%%%%%%%j%%%%%%%%%%%
5386I2%%%%%%%J%j%%%%%J%%%%%%%%%%%%%%%J%j%J%%%%%%%%%%%%%%%%jjJJ%%j%J%%%J%%j%j
5379I3%%J%%j%J%%%%%%%j%%%JJ%jj%%Jj%%%%J%%%%%JJ%%%%J%J%J%J%J%%%JJ%KJKJKLKKMML
5371A29MMNLKKJJJ%JJK%%jj%%%KKJKKJJKJ%J%%kkkljkjjkklmllkkkjjjjjkjkkjjj%%%JJJK
5364A22JKKLLLMMMMLLLJJJKJJKKKKJKKLLNMMLKKJ%JKLKLJ%loqj0rqpmmllllmmmmnmllkklj
$$ plain form
5357 110 109 108 107 106 106 106 106 105 105 104 104 104 103 103 103 102 102 101 101 102 102 103 103 104 106 107 108 109 111 113 116 118 120 122 124 124 125 125 125 125 127 129 132 135 136 137 136 135 131 128 125 123 122 121 119 118 118 118 116 114 111 109 106 104 103 101 100 99 98
5350 98 98 98 98 98 98 97 97 98 98 98 98 98 98 98 98 98 98 99 98 98 98 99 99 99 99 99 99 100 100 100 100 100 100 100 100 101 102 103 105 105 106 107 108 109 109 110 111 113 114 115 117 120 121 123 125 127 129 132 136 138 141 144 147 150 151 153 155 157 159 159
5342 159 160 161 162 162 162 162 161 160 159 157 155 153 151 149 146 144 142 141 139 138 137 136 136 136 135 134 133 132 131 131 130 130 130 130 130 129 129 129 128 128 128 127 127 127 127 127 127 127 127 127 127 129 131 132 134 135 136 137 137 137 137 138 140 142 144 145 147 148 149
5335 149 151 153 154 156 159 161 163 164 165 165 166 165 165 164 164 163 162 160 158 155 152 149 146 143 141 138 136 134 133 132 132 131 131 130 130 130 130 130 130 130 130 129 128 126 125 124 123 123 122 122 121 120 120 119 118 118 117 115 113 111 108 106 105 104 104 104 103 102 101
5328 101 100 100 100 99 99 98 97 97 96 96 97 97 98 98 98 98 99 99 100 101 102 103 103 104 105 105 106 106 106 105 105 104 104 104 104 105 105 106 106 106 107 109 110 111 111 111 112 111 111 111 110 110 111 112 112 113 114 115 115 114 114 112 111 110 111 112 113 114 114
5320 114 115 116 116 117 117 118 119 120 121 123 123 124 123 123 123 123 123 123 123 124 124 124 125 125 125 125 125 126 126 125 126 126 127 128 128 128 128 128 128 129 129 130 131 131 131 131 132 132 132 133 134 135 136 138 139 140 141 141 142 143 144 145 146 147 149 151 153 153 153
5313 153 152 152 152 152 153 154 155 156 157 159 159 160 160 162 163 166 168 171 174 177 180 184 187 191 195 198 201 203 205 206 206 207 208 210 214 218 223 228 233 237 240 240 237 233 227 222 219 218 218 219 220 220 220 220 219 217 216 215 214 216 217 219 221 222 224 226 229 232 235
5306 235 239 244 249 253 256 259 261 263 265 268 272 276 281 285 290 294 298 303 308 316 324 331 337 341 344 346 348 351 356 364 373 383 391 396 397 396 394 392 392 392 393 396 397 394 387 376 365 356 351 349 350 353 357 360 363 363 363 361 357 352 348 345 343 342 343 345
$$ packed form
5357A10jjjj%%%j%j%%j%%j%j%J%J%JKJJJKKLKKKK%J%%%KKLLJJjjmllkjjkj%%kklklkjkjjj
5350I8%%%%%j%J%%%%%%%%%Jj%%J%%%%%J%%%%%%%JJJK%JJJJ%JJKJJKLJKKKKLMKLLLLJKKKK%
5342A59JJJ%%%jjjkkkkklkkjkjjj%%jjjjj%j%%%%j%%j%%j%%%%%%%%%KKJKJJJ%%%JKKKJKJJ
5335A49KKJKLKKJJ%Jj%j%jjkklllllklkkjj%j%j%%%%%%%jjkjjj%j%jj%jj%jkkklkjj%%jjj
5328A01j%%j%jj%j%J%J%%%J%JJJJ%JJ%J%%j%j%%%J%J%%JKJJ%%Jj%%j%JJ%JJJ%j%kjjJJJJ%
5320A14JJ%J%JJJJK%Jj%%%%%%J%%J%%%%J%jJ%JJ%%%%%J%JJ%%%J%%JJJJKJJJ%JJJJJJKKK%%
5313A53j%%%JJJJJK%J%KJLKLLLLMLMMLLKKJ%JJKMMNNNML%lmonlj%JJ%%%jkjjjKJKKJKKLLL
5306B35MNNMLLKKKLMMNMNMMNNQQPOMLKKLNQRJ0QNJjkk%%JLJlpj1j1rnkJLMLL%%kmnmlkjJK
$$ plain form
5299 345 348 352 358 364 370 378 384 391 397 404 411 420 430 443 457 473 492 512 534 558 580 601 621 639 654 669 683 698 716 739 765 793 825 857 891 926 961 996 1034 1071 1106
5294 1106 1138 1170 1204 1242 1286 1336 1393 1456 1522 1591 1666 1750 1845 1951 2067 2195 2335 2492 2666 2862 3086 3343 3639 3980 4375 4833 5364
5291 5364 5975 6669 7443 8278 9137 9969 10719 11341 11827 12212 12553 12913 13348 13878 14466 15022 15432 15608 15529 15276 15007 14873 14965 15295
5289 15295 15822 16459 17084 17556 17752 17583 17030 16243 15465 14851 14412 14072 13738 13332 12813 12156 11349 10398 9338 8267 7296 6482
5287 6482 5822 5295 4876 4543 4278 4066 3898 3766 3666 3596 3556 3548 3568 3612 3677 3759 3855 3968 4102 4263 4457 4690 4971 5304 5696 6153
5284 6153 6680 7289 7994 8810 9750 10819 12012 13297 14615 15869 16952 17772 18331 18743 19151 19670 20374 21281 22338 23436
5282 23436 24442 25259 25918 26520 27104 27607 27905 27859 27394 26569 25531 24432 23376 22389 21436 20485 19555 18724 18053 17516 17016 16430
5279 16430 15664 14660 13397 11964 10538 9262 8180 7279 6530 5903 5379 4941 4577 4278 4034 3835 3667 3523 3393 3276 3171
$$ packed form
5299C45LMOOOQOPOPPRJ0J3J4J6J9K0K2K4K2K1K0J8J5J5J4J5J8K3K6K8L2L2L4L5L5L5L8L7L5
5294A106L2L2L4L8M4N0N7O3O6O9P5Q4R5J06J16J28J40J57J74J96K24K57K96L41L95M58N31
5291E364O11O94P74Q35Q59Q32P50O22M86L85L41L60M35N30N88N56M10J76p9k53k69j34R2L30
5289A5295N27O37O25M72J96j69n53p87p78o14m39l40l34m06n19o57q07r51j060j071r71q14
5287F482o60n27m19l33k65k12j68j32j00p0m0qK0M4O5Q2R6J13J34J61J94K33K81L33L92M57
5284F153N27O09P05Q16R40J069J193J285J318J254J083Q20N59M12M08N19P04R07J057J098
5282B3436J006Q17O59O02N84N03K98m6m65q25j038j099j056r87r53r51r30q31o71n37n00n86
5279A6430p66j004j263j433j426j276j082r01p49o27n24m38l64k99k44j99j68j44j30j17j05
$$ plain form
5277 3171 3082 3010 2955 2918 2898 2897 2916 2958 3025 3119 3246 3410 3620 3880 4200 4591 5057 5600 6213 6871 7520 8077 8452 8570 8466 8307 8259
5274 8259 8401 8743 9266 9935 10678 11369 11838 11906 11441 10535 9496 8594 7929 7497 7257 7164 7159 7164 7083 6821 6316 5618 4879 4216 3668
5272 3668 3226 2867 2573 2329 2126 1957 1813 1687 1575 1476 1389 1317 1257 1208 1165 1125 1086 1050 1014 976 935 894 857 827 802 780 759 737 713 687
5268 687 659 633 607 583 559 536 514 494 476 461 446 434 421 409 398 389 383 378 374 368 360 350 339 327 317 309 303 300 299 300 302 306 308 308 306 302 297 291 285 279 274 270 266 263 262 260 258 255 251 246
5263 246 242 237 234 231 228 224 220 217 217 218 221 225 228 231 233 232 229 223 216 211 209 210 214 219 224 224 221 213 205 196 187 180 176 176 179 185 191 193 192 188 184 180 175 170 166 163 163 164 167 170 174 178 182 185 186 184 182 179 177 174 172 170 169 169 169 168 168 167 165
5256 165 162 161 161 160 160 160 159 158 158 157 156 155 154 155 155 156 157 158 159 160 160 161 161 161 162 163 164 166 168 168 169 170 169 169 169 169 169 168 168 167 167 166 165 164 163 161 161 161 161 162 164 165 166 167 168 169 170 171 171 172 173 174 175 178 179 181 183 184 186
5248 186 187 189 191 192 193 195 196 196 195 195 193 193 193 193 193 193 194 195 196 197 197 197 197 197 197 197 198 198 200 203 207 214 221 229 238 249 260 270 277 282 285 286 284 281 278 274 272 272 274 276 277 277 274 269 262 252 239 224 211 202 196 191
5242 191 187 186 189 193 197 200 206 214 224 232 240 247 253 256 257 259 262 268 274 276 274 269 264 259 254 253 253 255 257 260 262 264 264 265 265 265 266 269 273 279 287 296 307 322 340 362 385 409 432 455 476 496 513 527 536 544
$$ packed form
5277C171q9p2n5l7k0jJ9M2O7R4J27J64K10K60L20L91M66N43O13O58O49N57L75J18j04j59m8
5274H259J42L42N23O69P43O91M69O8m65r06j039r02o65m32k40r3nNq1k62n05o98p39o63n48
5272C668m42l59k94k44k03j69j44j26j12r9q7p2o0m9m3m0l9l6l6l8m1m1l7l0k5k2k1k2k4k6
5268F87k8k6k6k4k4k3k2k0j8j5j5j2j3j2j1ronmoqj0j1j2j0qoljJKMK%kmnooonmmljkklmn
5263B46mnlllmml%JLMLLKjlopnkJMNN%lqqrrpm%LOOKjmmmnnml%JLLMMMLJkklklkkj%%j%jk
5256A65lj%j%%jj%jjjjJ%JJJJJ%J%%JJJKK%JJj%%%%j%j%jjjjk%%%JKJJJJJJJ%JJJJLJKKJK
5248A86JKKJJKJ%j%k%%%%%JJJJ%%%%%%J%KLMPPQRJ1J1J0PNLJkllmk%KKJ%lnpj0j3j5j3ron
5242A91mjLMMLOQJ0QQPOLJKLOOKknnnnj%KKLKK%J%%JLMOQRJ1J5J8K2K3K4K3K3K1K0J7J4RQ
$$ plain form
5236 544 552 560 567 574 583 593 603 613 622 632 645 661 677 692 708 725 743 761 781 808 846 895 952 1013 1076 1140 1202 1262 1320 1380 1446 1517 1594 1677 1765 1860 1962
5232 1962 2076 2206 2359 2541 2758 3016 3322 3677 4084 4540 5032 5539 6031 6476 6865 7242 7693 8296 9099 10129 11396 12902
5230 12902 14627 16502 18395 20123 21469 22271 22528 22315 21623 20442 18960 17495 16246 15220 14313 13413 12509 11709 11114
5228 11114 10735 10512 10338 10093 9670 9012 8172 7289 6480 5793 5229 4775 4414 4134 3919 3758 3642 3563 3511 3481 3470 3475 3493 3519 3552 3598
5225 3598 3661 3742 3840 3956 4095 4267 4482 4750 5078 5475 5948 6508 7162 7920 8794 9782 10876 12050 13267 14495 15732 16996
5223 16996 18275 19539 20802 22146 23643 25262 26879 28341 29597 30677 31567 32224 32616 32767 32755 32550 31945 30718 28839
5221 28839 26507 23961 21418 19114 17219 15766 14687 13870 13193 12547 11850 11093 10322 9570 8826 8074 7336 6659 6068 5562
5219 5562 5134 4775 4478 4235 4039 3882 3757 3661 3589 3535 3493 3459 3430 3411 3407 3423 3464 3533 3635 3775 3958 4186 4464 4801 5200 5660 6166
$$ packed form
5236E44QQPPRJ0J0J0RJ0J3J6J6J5J6J7J8J8K0K7L8M9N7O1O3O4O2O0N8O0O6P1P7Q3Q8R5J02
5232A962J14J30J53J82K17K58L06L55M07M56M92N07M92M45L89L77M51O03Q03J030J267J506
5230A2902J725J875J893J728J346Q02K57k13o92j181j482j465j249j026r07r00r04q00n95
5228A1114l79k23j74k45m23o58q40q83q09o87n64m54l61k80k15j61j16p9n2l0j1NJ8K6L3M6
5225C598O3Q1R8J16J39J72K15K68L28L97M73N60O54P58Q74R88J094J174J217J228J237J264
5223A6996J279J264J263J344J497J619J617J462J256J080Q90O57L92J51j2k05o05j227j879
5221B8839k332k546k543k304j895j453j079q17o77o46o97p57p71p52p44p52p38o77n91n06
5219E562m28l59k97k43j96j57j25r6p2n4m2l4k9j9mJ6M1O9J02J40J83K28K78L37L99M60N06
$$ plain form
5216 6166 6688 7177 7568 7801 7861 7830 7838 7981 8297 8792 9449 10239 11116 12012 12853 13620 14373 15144 15841 16284 16274 15773 14988 14118 13181
5213 13181 12090 10830 9554 8432 7533 6845 6325 5921 5582 5254 4887 4456 3988 3541 3153 2832 2573 2364 2196 2064 1963
5211 1963 1887 1832 1793 1766 1745 1726 1703 1667 1611 1539 1456 1369 1285 1208 1142 1087 1044 1010 978 945 912 879 845 811 779 750 726 704 681 656 631 608 586 568
5207 568 553 540 530 522 515 509 503 497 492 488 487 486 488 491 498 506 516 526 534 541 545 546 541 532 517 499 476 453 431 413 399 389 381 375 369 363 354 341 327 312 297 284 274 267 262 260 257 255 252 251
5202 251 252 257 264 272 278 284 289 294 299 301 303 305 305 304 300 298 298 298 295 289 282 277 274 272 270 269 268 268 269 268 266 265 265 267 271 278 287 296 307 316 323 327 327 323 317 309 299 289 278 268 259 251 243 234 226 219 212 206 201 196 192 188 184 180
5195 180 177 174 171 169 167 165 163 161 159 159 159 160 160 160 160 160 161 162 162 163 163 164 164 165 166 167 169 170 172 173 174 174 175 176 176 176 174 172 170 168 167 166 166 167 167 169 169 168 167 165 162 160 157 155 153 153 152 151 151 150 149 149 148 147 146 145 145 145 145
5188 145 144 144 144 144 144 143 142 142 142 144 146 147 149 153 158 163 169 176 183 188 191 189 184 175 167 160 155 151 148 145 143 141 140 139 138 138 138 138 137 137 137 137 137 137 136 136 136 136 136 136 136 135 135 135 134 132 130 128 124 121 117 113 110 108 107 106 106 105 105
5180 105 104 104 105 106 107 107 107 107 106 106 106 106 106 106 106 107 108 108 109 110 111 112 113 114 116 116 116 117 118 119 120 121 123 125 126 128 130 132 135 137 140 144 147 152 157 162 167 172 175 178 179 180 181 181 181 182 183 183 182 179 176 174 172 170 169 169 168 167 166
$$ packed form
5216F166N22M89L91K33O0l1QJ43L16M95O57P90Q77Q96Q41P67P53P71O97M43j0n01p85q70r37
5213A3181j091j260j276j122q99o88n20m04l39l28l67m31m68m47l88l21k59k09j68j32j01
5211A963p6n5l9k7k1j9k3l6n6p2q3q7q4p7o6n5m3l4l2l3l3l3l4l4l2k9k4k2k3k5k5k3k2j8
5207E68j5j3j0qpooonmjjKLPQJ0J0QPMJnrj5j8k3k3k2j8j4j0qooorj3j4j5j5j3j0pnklklj
5202B51JNPQOONNNKKK%jmk%%lopnlkkjj%Jjkj%KMPRRJ1RPM%moqj0j0j1j0rqqrqpponnmmmm
5195A80lllkkkkkk%%J%%%%JJ%J%J%JJJKJKJJ%JJ%%kkkkjj%J%K%jjklklkk%jj%jj%jjjj%%%
5188A45j%%%%jj%%KKJKMNNOPPNLknrqpnmllkkjjj%%%j%%%%%j%%%%%%j%%jkkkmlmmlkjj%j%
5180A05j%JJJ%%%j%%%%%%JJ%JJJJJJK%%JJJJJKKJKKKLKLMLNNNNNLLJJJ%%JJ%jllkkkj%jjj
$$ plain form
5173 166 164 164 166 170 176 182 189 193 193 190 183 172 161 150 140 130 122 117 113 109 107 105 104 103 102 102 101 101 101 101 101 102 102 102 103 104 106 107 108 109 111 113 116 118 120 123 126 129 132 136 141 146 151 156 161 164 167 167 168 169 169 169 170 171
5166 171 171 170 167 164 161 159 158 158 158 158 157 155 153 153 153 155 157 159 159 159 158 158 159 161 164 166 167 165 161 154 145 137 129 122 117 113 109 107 104 103 101 100 99 99 98 98 97 97 96 95 95 94 95 95 95 95 95 95 95 95 95 96 96 96 97 97 97 97 98
5159 98 98 98 100 101 102 103 104 105 106 107 107 107 108 108 109 111 114 117 121 125 130 135 140 145 148 150 149 147 143 139 135 132 129 126 123 122 120 117 116 115 116 116 117 117 117 116 115 113 111 109 108 107 106 105 104 104 103 103 103 103 104 105 105 105 106 106 106 106 107 109
5152 109 110 111 113 115 117 118 120 122 123 125 127 130 133 137 141 146 151 157 163 169 175 183 190 198 205 210 215 218 220 222 224 228 234 239 244 247 249 247 243 239 236 235 236 238 240 241 240 236 228 218 206 193 182 173 164 157 151 146 143 140 137 135 133 133 132
5145 132 133 133 133 133 133 134 134 135 134 134 134 133 133 133 134 135 137 139 142 145 148 151 154 158 161 164 167 170 175 180 186 193 202 212 222 234 247 262 276 289 297 301 299 293 288 283 281 282 283 285 286 285 278 269 259 248 238 230 224
5139 224 220 218 217 215 211 203 193 182 172 162 154 148 145 142 140 138 137 135 133 130 128 127 125 125 124 124 123 123 123 122 122 122 123 123 123 125 126 127 128 130 132 135 138 142 147 152 158 165 171 178 184 188 189 187 184 180 178 178 178 179 180 180 179 177 175
5132 175 174 175 177 181 187 194 203 211 217 220 218 213 206 198 190 181 172 161 151 141 132 126 120 116 113 110 108 106 106 105 105 105 104 104 104 104 104 103 103 103 103 102 102 102 102 102 102 102 102 102 102 102 101 101 101 102 102 102 103 104 105 106 106 106 106 106
5125 106 107 108 109 110 111 113 115 118 122 125 129 134 140 146 154 163 173 184 196 209 222 232 239 241 238 230 219 206 192 179 167 157 149 142 137 133 129 126 124 122 121 119 118 116 115 114 114 113 112 111 110 110 109 110 111 111 111
$$ packed form
5173A66k%KMOOPM%lpj1j1j1j0j0qnmmkkjjj%j%%%%J%%JJKJJJKKLKKLLLLMNNNNNLL%JJ%%JJ
5166A71%jlllkj%%%jkk%%KKK%%j%JKLKJkmprqqpnmmkljkjj%j%j%jj%jJ%%%%%%%%J%%J%%%J
5159I8%%KJJJJJJJ%%J%JKLLMMNNNNLKjkmmmlllljkljjJ%J%%jjkkkjjjjj%j%%%JJ%%J%%%JK
5152A09JJKKKJKKJKKLLMMNNOOOOQPQPNNLKKKMONNLKkmmljJKKJjmqj0j2j3j1rrponlllkk%j
5145A32J%%%%J%Jj%%j%%JJKKLLLLLMLLLLNNOPRJ0J0J2J3J5J4J3QMkonnkJJKJjprj0j1j0qo
5139B24mkjkmqj0j1j0j0qollkkjkklkjk%j%j%%j%%J%%KJJJKKLLMNNOPOPOMJklmk%%JJ%jkk
5132A75jJKMOPRQOLknpqqrrj1j0j0roomllkk%j%%j%%%%j%%%j%%%%%%%%%%j%%J%%JJJJ%%%%
5125A06JJJJJKKLMLMNOOQRJ0J1J2J3J3J0PKlqj1j3j4j3j2j0qpnmmlkkjkjkjj%jjjj%jJJ%%
$$ plain form
5119 111 110 110 109 109 110 111 112 112 113 114 114 115 115 116 117 118 119 119 119 120 120 121 122 124 126 128 129 131 133 135 137 140 144 149 155 161 168 176 184 190 194 197 196 192 186 179 171 162 155 149 143 138 133 130 129 128 127 126 125 125 125 125 124 125 126 127 128 129 130
5111 130 131 131 132 133 134 134 134 134 133 133 133 134 134 134 134 133 131 129 129 129 130 133 136 139 143 146 148 150 152 155 158 161 164 166 169 171 172 173 174 175 178 182 186 190 192 190 186 182 177 172 169 169 172 177 181 181 176 170 162 154 149 150 156 162 166 165 161 156 152
5104 152 151 155 163 170 172 170 165 160 154 151 153 162 173 180 184 185 184 183 182 184 188 191 193 191 189 187 187 187 188 191 195 200 204 207 210 212 217 222 229 236 243 249 254 260 266 274 285 299 315 333 348 361 371 380 387 394 401 411 425
5098 425 442 459 472 480 487 492 500 512 531 558 586 606 618 625 633 643 660 686 725 774 825 873 915 957 1003 1059 1132 1227 1343 1473 1614 1768 1942 2144 2380
5094 2380 2657 2984 3369 3826 4370 5011 5755 6593 7483 8337 9039 9459 9520 9335 9152 9153 9382 9795 10290 10732 10977 10901 10533 10112
5091 10112 9876 9891 10093 10347 10500 10408 10021 9489 9038 8797 8771 8889 9030 9045 8781 8125 7150 6109 5199 4473 3908 3460 3101 2808
5089 2808 2567 2370 2211 2087 1991 1920 1868 1833 1811 1797 1794 1802 1820 1849 1888 1938 1999 2072 2157 2257 2376 2518 2686 2888 3129 3413 3748 4139 4596
5086 4596 5132 5770 6536 7448 8514 9729 11046 12357 13501 14287 14560 14390 14116 14066 14368 14988 15812 16674 17403 17845 17992 18104
$$ packed form
5119A11j%j%JJJ%JJ%J%JJJJ%%J%JJKKKJKKKKLMNOOPQQOMLjmopqrpoonnljjjjj%%%jJJJJJJ
5111A30J%JJJ%%%j%%J%%%jkk%%JLLLMLKKKLLLLKLKJJJJLMMMKkmmnnl%LNM%noqqnJOOMjmnm
5104A52jMQPKknnolKRJ1PMJjjjKMLKkkk%%JLMNMLLKNNPPPONOOQJ1J4J6J8J5J3J0RPPPJ0J4
5098D25J7J7J3QPNQJ2J9K7K8K0J2PQJ0J7K6L9M9N1M8M2M2M6N6P3R5J16J30J41J54J74K02K36
5094B380K77L27L85M57N44O41P44Q38Q90Q54P02M20O1j85j83JK29M13M95M42K45p6l68m21
5091A0112k36J5K02K54J53r2l87n32m51k41k6J18J41J5k64o56r75j041r10p26n65m48l59k93
5089B808k41j97j59j24r6p1n2l5k2j4lQJ8K9L9N0O1P3Q5J00J19J42J68K02K41K84L35L91M57
5086D596N36O38P66R12J066J215J317J311J144P86K73j70k74n0L02O20Q24Q62P29M42J47J12
$$ plain form
5084 18104 18527 19420 20739 22290 23760 24744 24859 23939 22163 20087 18291 17008 16134 15411 14567 13376 11803 10091 8528
5081 8528 7234 6198 5363 4679 4110 3633 3232 2892 2607 2371 2176 2013 1875 1754 1644 1544 1449 1360 1280 1210 1150 1098 1050 1004 959
5079 959 916 875 837 804 778 755 734 712 690 663 635 608 584 564 548 534 523 512 502 489 475 462 451 441 432 423 416 412 411 409 407 404 401 397 395 393 391 389 387 383 378 372 366 359 352
5074 352 344 337 329 320 310 299 291 285 281 280 281 281 278 269 257 246 240 238 240 244 247 245 236 223 211 207 210 217 229 242 255 261 257 249 241 240 244 253 262 267 263 250 231 212 197 188 183 180 178 175 171 166 160 153 145 139
5068 139 134 132 133 135 137 140 142 145 149 154 158 163 169 173 176 177 177 175 173 172 171 172 175 181 188 195 202 209 214 219 224 228 229 229 226 221 215 209 203 198 195 193 191 190 188 184 177 168 157 144 131 121 115 114 118 125 133 141 149 155 160 167 176 187
5061 187 198 210 221 229 235 238 239 237 233 228 222 215 208 202 196 193 190 188 186 183 181 177 173 169 164 159 155 151 148 145 144 146 150 159 173 192 215 240 266 292 317 339 359 377 393 407 420 431 443 455
5056 455 467 478 488 498 504 507 506 501 492 479 462 444 427 412 404 403 408 421 438 458 480 504 529 558 592 630 671 713 757 801 845 890 937 988 1043 1104 1172 1250 1338
5052 1338 1439 1556 1694 1858 2053 2287 2566 2899 3295 3764 4321 4983 5770 6704 7806 9090 10545 12129 13746 15238 16402
$$ packed form
5084A8104M23Q93J319J551J470R84J15r20j776k076j796j283q74p23q44j191j573j712j563
5081H528j294j036q35o84n69m77m01l40k85k36j95j63j38j21j10j00r5q9q0p0o0n2m8m6m5
5079I59m3m1l8l3k6k3k1k2k2k7k8k7k4k0j6j4j1j1j0j3j4j3j1j0rrpmjkkllmkkkkkmnoopp
5074C52qpqrj0j1qomjJ%lrj2j1okKMLkrj3j2mLPJ2J3J3OmqqjMRRNmj3j9j9j5rnlklmnopqo
5068A39nkJKKLKLMNMNOMLJ%kkjjJLOPPPPNNNMJ%lnooonlkkjkmprj1j3j3j0ojMPQQQONPRJ1
5061A87J1J2J1QOLJkmnoppoollkklkmmmnnmmlljKMRJ4J9K3K5K6K6K5K2K0J8J6J4J3J1J2J2
5056D55J2J1J0J0OLjnrj3j7j8j7j5qjNJ3J7K0K2K4K5K9L4L8M1M2M4M4M4M5M7N1N5O1O8P8Q8
5052A338J01J17J38J64J95K34K79L33L96M69N57O62P87R34J102J284J455J584J617J492J164
$$ plain form
5050 16402 17046 17060 16417 15197 13588 11796 10017 8419 7079 5994 5122 4421 3854 3396 3023 2717 2467 2259 2084 1936 1810
5047 1810 1701 1606 1523 1451 1387 1330 1277 1229 1187 1150 1122 1101 1088 1084 1088 1096 1110 1130 1157 1190 1230 1275 1325 1381 1442 1506 1575 1647 1725 1809 1902 2007 2130 2272
5044 2272 2438 2633 2862 3131 3449 3827 4279 4821 5468 6240 7159 8254 9557 11100 12910 15002 17347 19856 22355 24585
5042 24585 26229 27016 26806 25598 23548 20941 18095 15314 12831 10745 9045 7670 6555 5646 4902 4290 3786 3366 3014
5040 3014 2716 2462 2244 2057 1895 1756 1636 1532 1442 1362 1292 1230 1176 1130 1094 1065 1046 1033 1027 1027 1029 1035 1044 1057 1074 1096 1123 1154 1185 1212 1234 1250 1262
5036 1262 1273 1287 1311 1347 1398 1464 1545 1643 1760 1900 2069 2277 2532 2843 3223 3684 4239 4905 5695 6615 7653 8765 9867 10829 11498
5034 11498 11757 11554 10900 9892 8682 7415 6223 5196 4352 3671 3122 2676 2312 2013 1768 1564 1394 1251 1129 1024 932
5031 932 851 778 714 657 608 564 527 496 470 450 436 427 422 423 428 435 442 450 456 460 465 471 478 486 494 497 494 483 463 436 405 374 345 320 301 287 275 265 254 242 229 215 201
$$ packed form
5050A6402O44J4o43j220j609j792j779j598j340j085q72p01n67m58l73l06k50k08j75j48j26
5047A810j09r5q3p2o4n7n3m8m2l7k8k1j3mMQJ4K0K7L3M0M5N0N6O1O4O9P2P8Q4R3J05J23J42
5044B272J66J95K29K69L18L78M52N42O47P72R19J095J303J543J810K092K345K509K499K230
5042B4585J644P87k10j208k050k607k846k781k483k086j700j375j115r09p44o12n04m20l52
5040C014k98k54k18j87j62j39j20j04r0q0p0o2n4m6l6k9j9j3o%KORJ3J7K2K7L1L1K7K2J6J2
5036A262J1J4K4L6N1O6Q1R8J17J40J69K08K55L11L80M61N55O66P90R20J038J112J102R62O69
5034A1498K59k03o54j008j210j267j192j027q44o81n49m46l64k99k45k04j70j43j22j05r2
5031I32q1p3o4n7m9m4l7l1k6k0j4rnJNPPQOMNOPQQLlj1k0k7l1l1k9k5j9j4j2j0j1j2j3j4j4
$$ plain form
5027 201 188 177 170 166 165 169 177 188 201 215 228 240 250 256 258 256 251 244 236 227 218 210 204 198 194 190 185 180 175 170 165 160 153 145 138 130 122 116 110 107 104 104 106 109 114 120 128 137 145 153 160 166 170 172 175 178 182 185 186 185 181
5020 181 174 166 156 147 138 132 127 123 120 118 115 112 109 104 99 95 93 91 91 92 95 100 106 112 119 124 128 132 133 134 133 131 128 127 126 125 124 124 124 124 124 123 122 121 119 116 114 111 109 106 104 102 101 100 101 101 102 103 105 107 110 113 116 120 123 126 128 129
5013 129 130 131 132 134 136 138 141 144 146 146 145 143 142 141 140 140 139 139 138 137 135 132 129 126 124 123 121 120 120 119 119 119 118 119 119 118 119 119 119 120 120 122 123 125 126 128 131 133 136 138 141 144 146 150 154 160 166 173 179 183 187 189 191 194 199 204 209 214 218
5006 218 221 223 223 223 225 228 232 235 237 237 233 227 220 214 210 208 206 204 200 195 188 180 173 166 161 156 152 148 145 142 140 137 134 130 126 122 117 113 108 105 102 100 100 100 101 102 104 105 106 108 109 110 112 113 115 117 118 120 123 126 130 135 140 145 150 155 159 160 161
4999 161 161 162 163 165 168 170 173 175 176 176 177 178 177 175 173 171 169 166 164 163 162 161 160 158 155 151 146 141 137 133 131 129 127 125 124 124 123 121 119 117 113 108 103 97 91 86 82 78 76 75 75 76 77 78 79 81 82 83 83 83 84 84 84 84 84 84 84 84 84
4991 84 84 85 85 86 86 86 86 86 87 87 88 88 88 88 88 88 88 89 89 90 90 91 91 91 92 92 93 93 94 94 95 96 97 98 99 100 101 102 103 103 103 103 102 102 102 102 101 100 98 95 93 90 87 86 85 84 84 84 84 84 84 84 85 85 86 86 86 86 86 85
4984 85 84 83 82 82 81 81 82 82 82 82 82 82 82 82 82 83 83 83 83 83 83 83 83 83 83 83 83 83 83 83 83 84 84 85 85 86 85 85 86 86 87 88 89 90 90 90 90 90 90 91 92 92 93 93 93 94 94 95 97 99 101 105 109 113 118 124 129 135 140 144
4976 144 143 138 130 120 112 106 102 98 95 92 91 89 88 87 87 86 85 84 83 83 83 83 83 83 83 82 82 81 81 81 81 81 81 81 81 81 81 81 81 82 82 82 81 81 82 82 82 82 82 83 83 84 84 83 83 83 83 83 84 84 83 84 85 86 87 88 88 89
$$ packed form
5027B01j3j1pmjMQJ1J3J4J3J2J0OKknpqrrqoommnnnnnnpqpqqooll%KLNOQRQQPOMKLLMLJjm
5020A81pqj0rronmlklllnnmkk%JLNOOPNMMJJjkljjjj%%%%jjjklklklkkjjJ%JJKKLLLMLLKJ
5013A29JJJKKKLLK%jkjjj%j%jjklllkjkj%j%%jJ%jJ%%J%KJKJKLKLKLLKMMOOPOMMKKLNNNNM
5006B18LK%%KLMLK%mopomkkkmnpqppnnmmllkllmmmnmnllk%%JJKJJKJJKJKKJKLLMNNNNNMJJ
4999A61%JJKLKLKJ%JJjkkkklkjjjjklmnnmmkkkkj%jkkkmnnoonmmkj%JJJJKJJ%%J%%%%%%%%
4991H4%J%J%%%%J%J%%%%%%J%J%J%%J%J%J%JJJJJJJJJ%%%j%%%jjklklljjj%%%%%%J%J%%%%j
4984H5jjj%j%J%%%%%%%%J%%%%%%%%%%%%%%%J%J%Jj%J%JJJJ%%%%%JJ%J%%J%JKKKMMMNONONM
4976A44jnqj0qommlljkjj%jjjj%%%%%%j%j%%%%%%%%%%%J%%j%J%%%%J%J%j%%%%J%jJJJJJ%J
$$ plain form
4969 89 90 91 92 94 96 98 101 104 108 113 118 123 129 136 143 149 155 159 161 160 156 149 141 133 126 120 115 110 107 104 102 100 99 98 97 95 94 94 93 93 93 92 92 92 92 92 91 91 91 90 89 89 89 89 89 88 88 87 87 87 88 88 89 89 89 90 90 91 92 92
4962 92 93 94 95 96 97 99 100 102 104 107 111 115 120 125 132 140 148 158 170 182 195 207 218 225 227 224 217 206 193 179 166 154 144 136 129 122 117 113 109 106 104 102 100 99 98 97 96 95 95 94 93 93 93 93 93 92 92 92
4956 92 91 91 90 90 89 90 90 91 91 91 90 90 90 89 89 89 89 89 88 88 89 91 92 93 94 95 96 97 98 100 102 106 109 112 117 122 127 134 140 146 151 155 156 155 151 146 140 134 127 121 116 112 108 104 102 99 97 96 95 93 92 92 91 90 90 89 89 89 88 88
4948 88 88 87 87 87 86 86 86 86 87 86 86 86 86 86 86 86 86 87 87 87 87 87 87 86 85 85 84 84 84 85 85 85 85 86 86 86 86 86 87 87 88 88 88 89 89 90 91 92 93 93 94 94 94 94 94 93 92 91 91 90 90 89 89 89 89 88 88 88 88 88
4941 88 88 87 87 87 87 86 87 87 86 86 86 87 87 86 87 87 86 86 86 86 86 87 87 87 87 87 87 86 86 87 87 87 87 86 86 86 86 86 86 87 87 87 86 86 85 86 86 86 86 87 87 88 88 89 89 90 90 90 90 89 88 88 88 87 87 87 87 87 87 87
4933 87 87 87 87 87 87 87 86 86 86 86 86 86 86 86 86 85 85 85 85 85 85 86 86 86 86 86 86 86 86 86 86 86 86 86 86 86 87 86 86 86 86 86 85 85 85 85 85 85 85 84 84 85 85 85 85 85 85 85 85 85 85 85 85 85 85 85 86 86 86 86
4926 86 85 86 86 85 85 85 85 85 85 84 84 84 83 84 84 84 85 85 84 84 84 83 83 83 83 84 84 84 84 84 83 83 83 83 84 85 85 84 83 83 83 83 83 83 83 83 83 82 82 81 81 81 81 81 81 81 81 81 81 81 81 81 81 81 81 81 81 82 83 83
4919 83 82 82 82 81 81 81 82 82 82 82 82 82 81 81 82 82 82 82 82 81 81 81 81 81 81 82 82 82 82 82 82 82 82 82 81 81 81 80 80 81 81 80 80 79 79 79 78 79 79 79 79 79 79 79 79 79 79 79 79 79 78 78 78 78 78 78 78 78 78 78
$$ packed form
4969H9JJJKKKLLMNNNOPPOOMKjmpqqponnllkkjjjkj%j%%j%%%%j%%jj%%%%j%j%%J%J%%J%JJ%
4962I2JJJJJKJKKLMMNNPQQJ0J2J2J3J2J1PKlpj1j3j4j3j2j0qppnmmlkkkjjjjj%jj%%%%j%%
4956I2j%j%jJ%J%%j%%j%%%%j%JKJJJJJJJKKMLLNNNPOONMJjmnooponmmmklkjjkj%jj%j%%j%
4948H8%j%%j%%%Jj%%%%%%%J%%%%%jj%j%%J%%%J%%%%J%J%%J%JJJJ%J%%%%jjj%j%j%%%j%%%%
4941H8%j%%%jJ%j%%J%jJ%j%%%%J%%%%%j%J%%%j%%%%%J%%j%jJ%%%J%J%J%J%%%jj%%j%%%%%%
4933H7%%%%%%j%%%%%%%%j%%%%%J%%%%%%%%%%%%%%Jj%%%%j%%%%%%j%J%%%%%%%%%%%%%%J%%%
4926H6jJ%j%%%%%j%%jJ%%J%j%%j%%%J%%%%j%%%JJ%jj%%%%%%%%j%j%%%%%%%%%%%%%%%%%JJ%
4919H3j%%j%%J%%%%%j%J%%%%j%%%%%J%%%%%%%%j%%j%J%j%j%%jJ%%%%%%%%%%%%j%%%%%%%%%
$$ plain form
4911 78 79 79 79 80 80 80 80 80 80 80 80 81 81 80 80 80 80 80 80 81 81 82 82 82 82 82 82 82 81 81 82 82 82 82 82 81 81 81 80 80 80 80 80 79 79 79 79 80 80 79 79 79 79 79 79 78 78 78 78 79 79 79 78 78 78 78 79 78 78 78
4904 78 78 78 79 79 79 80 80 80 81 81 81 82 82 81 81 82 83 83 83 83 83 83 83 82 82 81 81 81 81 82 82 81 81 81 81 81 81 81 81 81 80 81 82 82 82 82 82 81 81 81 81 81 81 80 80 80 81 81 81 80 80 80 80 80 81 81 81 81 81 81
4896 81 81 80 80 80 81 80 80 80 79 79 79 79 79 79 80 80 80 80 80 80 80 81 81 80 80 80 80 80 80 81 81 81 81 81 81 81 81 81 81 82 82 83 84 85 86 87 88 89 90 90 91 91 91 91 91 90 89 88 88 86 85 85 84 83 82 82 82 82 82 82
4889 82 82 81 81 81 81 81 81 81 81 81 80 80 80 80 80 80 80 80 80 80 80 80 79 79 79 79 78 78 78 78 78 78 78 77 77 77 77 77 77 78 78 78 77 77 77 77 76 76 77 77 77 77 77 77 77 77 78 78 78 77 77 76 76 77 77 77 77 77 78 78
4881 78 78 79 79 79 79 79 80 80 80 80 80 80 80 80 80 81 81 81 80 80 80 80 80 80 80 80 81 81 81 81 81 80 81 81 81 81 81 81 80 80 80 80 80 80 80 81 81 81 80 80 80 80 80 79 78 79 79 79 80 80 80 80 80 80 80 80 81 81 81 80
4874 80 80 80 81 81 81 81 81 81 82 82 81 82 82 82 82 82 82 82 82 82 82 82 82 82 82 82 82 82 81 81 81 81 81 82 82 82 82 81 81 81 81 82 82 82 82 82 82 82 82 82 83 83 83 83 82 82 82 82 82 83 83 83 83 82 82 81 81 82 83 82
4867 82 82 82 82 82 82 82 81 81 81 82 82 82 83 82 82 82 82 82 82 82 82 82 83 82 82 82 82 81 80 80 80 81 80 80 81 81 81 81 81 81 80 80 80 80 80 80 80 80 80 81 82 82 81 81 81 81 81 81 81 81 82 82 82 82 82 81 81 81 82 81
4859 81 81 81 81 81 81 81 81 81 81 81 81 81 82 82 81 80 80 81 81 81 81 81 81 81 81 80 80 80 80 80 80 80 80 79 79 80 80 80 79 79 79 79 79 79 79 78 78 77 78 78 77 77 77 77 77 77 77 77 77 78 78 78 77 77 76 76 76 77 77 77
$$ packed form
4911G8J%%J%%%%%%%J%j%%%%%J%J%%%%%%j%J%%%%j%%j%%%%j%%%J%j%%%%%j%%%J%%j%%%Jj%%
4904G8%%J%%J%%J%%J%j%JJ%%%%%%j%j%%%J%j%%%%%%%%jJJ%%%%j%%%%%j%%J%%j%%%%J%%%%%
4896H1%j%%Jj%%j%%%%%J%%%%%%J%j%%%%%J%%%%%%%%%J%JJJJJJJJ%J%%%%jjj%kj%jjj%%%%%
4889H2%j%%%%%%%%j%%%%%%%%%%%j%%%j%%%%%%j%%%%%J%%j%%%j%J%%%%%%%J%%j%j%J%%%%J%
4881G8%J%%%%J%%%%%%%%J%%j%%%%%%%J%%%%jJ%%%%%j%%%%%%J%%j%%%%jjJ%%J%%%%%%%J%%j
4874H0%%J%%%%%J%jJ%%%%%%%%%%%%%%%%j%%%%J%%%j%%%J%%%%%%%%J%%%j%%%%J%%%j%j%JJj
4867H2%%%%%%j%%J%%Jj%%%%%%%%Jj%%%jj%%Jj%J%%%%%j%%%%%%%%JJ%j%%%%%%%J%%%%j%%Jj
4859H1%%%%%%%%%%%%J%jj%J%%%%%%%j%%%%%%%j%J%%j%%%%%%j%jJ%j%%%%%%%%J%%j%j%%J%%
$$ plain form
4852 77 78 77 77 77 77 76 76 77 77 77 78 78 78 78 78 78 78 77 77 77 77 77 77 77 77 77 77 77 77 77 77 77 77 77 77 77 77 77 77 77 78 77 77 77 76 76 76 76 77 76 75 75 76 75 75 75 75 75 75 75 75 75 75 75 75 75 74 74 74 74
4844 74 73 73 73 73 73 73 73 73 73 73 73 72 72 72 72 72 72 72 72 72 73 73 73 73 72 73 73 73 74 74 74 73 73 73 73 74 74 74 75 76 77 77 76 76 76 76 76 76 75 75 75 75 75 76 77 77 77 76 76 76 76 77 77 77 76 76 76 77 77 77
4837 77 77 77 76 76 76 75 75 75 75 75 75 75 75 75 75 74 74 74 74 73 73 73 73 73 73 73 73 73 73 74 74 74 74 73 72 73 73 73 74 74 74 74 74 74 74 74 74 74 74 74 75 75 76 76 76 76 76 76 76 76 77 77 77 77 78 78 77 78 78 78
4830 78 78 77 78 78 78 78 78 78 78 78 77 78 78 79 79 79 78 78 78 78 78 78 77 78 78 78 78 78 78 77 77 77 77 77 77 77 78 78 77 77 76 76 76 76 76 76 75 74 74 75 75 75 76 76 76 75 75 74 74 74 74 75 75 75 76 76 76 76 77 78
4822 78 78 78 78 78 78 77 77 78 79 79 79 80 80 80 80 80 80 80 80 80 80 80 80 81 81 81 80 80 80 80 79 79 79 79 79 79 79 79 79 80 80 80 79 79 79 79 79 79 78 78 78 78 78 78 78 78 78 78 77 77 77 77 77 77 77 78 79 79 79 78
4815 78 78 78 79 79 80 80 80 80 81 80 80 79 79 79 79 80 80 80 80 81 82 82 82 81 81 81 80 80 80 80 80 80 80 80 79 80 80 80 80 80 80 80 80 80 81 81 81 81 81 81 80 80 80 80 81 81 82 82 81 81 81 81 81 81 81 81 81 81 81 81
4807 81 81 82 81 81 80 81 81 81 80 80 80 80 79 79 79 79 79 79 79 79 79 79 79 79 79 79 79 79 80 80 80 80 80 80 80 80 80 79 79 79 79 79 79 79 79 79 79 79 79 79 79 79 79 79 80 80 80 79 79 80 80 80 80 80 80 80 80 80 80 79
4800 79 79 79 79 79 79 79 80 80 80 80 80 80 80 80 80 80 80 79 79 79 79 79 79 80 80 80 80 80 80 80 80 80 79 79 79 79 79 79 79 79 78 78 78 78 79 79 80 80 80 80 80 80 80 79 79 79 79 79 79 79 79 80 80 79 79 79 78 78 78 78
$$ packed form
4852G7Jj%%%j%J%%J%%%%%%j%%%%%%%%%%%%%%%%%%%%%%Jj%%j%%%Jjj%Jj%%%%%%%%%%%%j%%%
4844G4j%%%%%%%%%%j%%%%%%%%J%%%jJ%%J%%j%%%J%%JJJ%j%%%%%j%%%%JJ%%j%%%J%%j%%J%%
4837G7%%j%%j%%%%%%%%%j%%%j%%%%%%%%%J%%%jjJ%%J%%%%%%%%%%%J%J%%%%%%%J%%%J%jJ%%
4830G8%jJ%%%%%%%jJ%J%%j%%%%%jJ%%%%%j%%%%%%J%j%j%%%%%jj%J%%J%%j%j%%%J%%J%%%JJ
4822G8%%%%%j%JJ%%J%%%%%%%%%%%J%%j%%%j%%%%%%%%J%%j%%%%%j%%%%%%%%%j%%%%%%JJ%%j
4815G8%%J%J%%%Jj%j%%%J%%%JJ%%j%%j%%%%%%%jJ%%%%%%%%J%%%%%j%%%J%J%j%%%%%%%%%%%
4807H1%Jj%jJ%%j%%%j%%%%%%%%%%%%%%%J%%%%%%%%j%%%%%%%%%%%%%%%%J%%j%J%%%%%%%%%j
4800G9%%%%%%J%%%%%%%%%%j%%%%%J%%%%%%%%j%%%%%%%j%%%J%J%%%%%%j%%%%%%%J%j%%j%%%
$$ plain form
4792 78 78 79 80 80 80 79 79 78 78 78 78 78 78 78 78 78 78 78 77 77 77 76 76 76 76 76 77 78 78 78 77 77 77 77 77 77 77 77 78 78 78 78 78 78 78 78 79 79 79 79 79 79 78 78 79 79 79 79 79 78 78 78 78 79 79 79 79 79 79 78
4785 78 78 78 78 77 77 77 76 76 76 76 76 76 76 76 75 75 75 74 74 74 75 74 74 74 73 73 73 73 72 72 71 71 72 72 72 72 73 73 73 74 75 74 74 74 75 75 75 75 76 76 76 76 77 77 77 78 78 77 78 78 78 78 78 78 78 77 78 78 78 78
4778 78 78 78 79 79 79 79 78 78 77 77 77 77 76 76 76 75 75 75 75 75 75 75 75 75 75 75 74 74 74 73 73 73 72 73 73 74 74 74 74 75 75 74 74 74 74 74 75 75 75 76 76 76 76 76 77 77 77 77 77 77 77 77 77 77 78 78 79 79 79 78
4770 78 78 78 78 78 78 78 78 78 78 79 79 79 79 79 79 79 79 79 78 78 78 78 78 78 78 78 79 79 79 79 79 79 78 78 78 77 78 78 79 79 79 79 79 79 78 78 78 78 79 79 79 79 79 79 78 78 78 79 79 79 79 79 79 80 80 80 80 80 80 79
4763 79 79 80 80 80 80 81 81 81 81 81 81 81 81 81 81 81 81 81 81 81 81 81 81 81 81 81 81 80 80 80 80 80 80 80 80 80 80 81 81 81 82 82 81 81 81 81 81 81 81 80 80 80 80 80 80 80 79 80 80 80 81 81 81 81 81 81 81 82 82 82
4755 82 82 82 81 80 79 80 80 80 81 81 80 80 80 81 81 81 81 80 80 80 80 80 80 80 80 80 81 81 81 81 81 81 81 80 80 80 79 79 79 79 79 80 80 80 80 80 80 80 80 80 80 80 80 80 81 80 80 80 80 80 80 80 81 80 80 80 80 80 80 80
4748 80 79 79 79 79 79 79 80 80 79 80 80 80 80 80 80 80 79 79 80 80 79 79 78 78 79 79 79 79 79 79 79 79 79 79 80 80 80 79 79 79 79 79 79 79 79 79 79 78 78 78 78 78 78 78 78 79 79 79 79 79 79 78 78 78 78 78 77 78 78 78
4741 78 77 77 77 78 79 79 78 78 78 79 79 79 79 78 78 78 78 79 79 79 79 78 79 79 78 78 78 78 78 78 78 78 77 78 78 78 78 78 79 79 79 78 78 79 78 78 78 78 78 78 78 77 77 78 78 78 78 78 78 78 78 79 79 78 78 78 78 78 78 78
$$ packed form
4792G8%JJ%%j%j%%%%%%%%%%j%%j%%%%JJ%%j%%%%%%%J%%%%%%%J%%%%%j%J%%%%j%%%J%%%%%j
4785G8%%%j%%j%%%%%%%j%%j%%Jj%%j%%%j%j%J%%%J%%JJj%%J%%%J%%%J%%J%jJ%%%%%%jJ%%%
4778G8%%J%%%j%j%%%j%%j%%%%%%%%%%j%%j%%jJ%J%%%J%j%%%%J%%J%%%%J%%%%%%%%%J%J%%j
4770G8%%%%%%%%%J%%%%%%%%j%%%%%%%J%%%%%j%%jJ%J%%%%%j%%%J%%%%%j%%J%%%%%J%%%%%j
4763G9%J%%%J%%%%%%%%%%%%%%%%%%%%%j%%%%%%%%%J%%J%j%%%%%%j%%%%%%jJ%%J%%%%%%J%%
4755H2%%jjjJ%%J%j%%J%%%j%%%%%%%%J%%%%%%j%%j%%%%J%%%%%%%%%%%%Jj%%%%%%Jj%%%%%%
4748H0j%%%%%J%jJ%%%%%%j%J%j%j%J%%%%%%%%%J%%j%%%%%%%%%j%%%%%%%J%%%%%j%%%%jJ%%
4741G8j%%JJ%j%%J%%%j%%%J%%%jJ%j%%%%%%%jJ%%%%J%%j%Jj%%%%%%j%J%%%%%%%J%j%%%%%%
$$ plain form
4733 78 78 78 78 78 78 78 77 77 77 77 77 76 76 77 77 78 78 78 78 78 77 78 78 78 78 77 77 77 76 76 77 78 78 77 77 78 77 77 77 78 78 78 78 78 78 78 78 78 79 79 79 78 78 79 79 79 79 79 78 79 79 79 79 79 79 79 79 79 79 78
4726 78 78 78 78 79 79 79 78 78 78 78 78 78 78 79 79 79 78 78 78 78 79 79 79 79 80 79 79 79 78 78 78 78 78 78 78 78 78 78 79 78 78 78 79 79 79 79 79 79 80 80 80 80 80 79 79 79 79 79 79 79 79 79 79 79 79 79 80 79 79 79
4718 79 79 79 79 79 79 79 79 79 79 79 79 78 78 78 79 79 79 79 79 80 80 80 80 80 80 80 80 80 80 80 79 79 79 79 80 80 80 80 80 80 80 80 80 80 80 80 79 79 79 79 79 79 80 80 80 80 80 80 80 79 79 79 79 79 79 79 80 80 79 79
4711 79 79 80 80 79 79 79 79 79 79 79 79 79 79 80 80 80 79 79 80 80 80 80 79 80 80 80 80 79 79 79 79 79 79 79 79 79 80 80 80 79 79 79 79 80 80 80 80 80 80 79 79 79 79 80 80 80 80 79 79 80 80 80 79 79 78 78 78 78 78 79
4703 79 79 79 79 79 79 79 79 79 78 78 79 79 79 79 79 79 79 79 79 78 78 78 78 78 78 78 79 79 80 80 80 79 79 79 78 78 77 78 78 78 79 79 79 79 79 79 79 80 80 80 79 80 80 79 79 79 79 79 79 79 79 79 79 79 78 79 79 79 79 79
4696 79 79 79 79 79 79 79 79 79 79 79 78 78 78 78 77 77 77 77 77 77 77 77 78 78 78 79 78 78 77 77 78 78 78 78 78 78 78 78 78 78 79 79 79 79 78 78 77 78 78 78 79 79 78 78 78 78 79 79 79 79 80 79 79 79 79 79 78 78 77 78
4689 78 78 78 78 78 79 79 78 77 77 77 77 77 77 77 77 77 76 77 77 76 77 77 77 77 77 77 77 77 77 77 77 77 77 77 77 77 76 76 76 77 77 77 77 77 77 77 77 77 77 78 78 78 77 78 78 78 78 78 78 78 78 78 78 78 78 78 78 79 79 79
4681 79 79 79 79 79 78 78 78 77 77 77 78 78 78 79 79 79 79 79 78 78 78 78 78 78 78 78 78 78 78 77 77 77 77 77 77 76 76 77 77 77 77 77 77 77 77 78 78 78 78 78 77 77 78 78 78 78 78 78 78 78 79 79 79 78 78 78 77 77 77 77
$$ packed form
4733G8%%%%%%j%%%%j%J%J%%%%jJ%%%j%%j%JJ%j%Jj%%J%%%%%%%%J%%j%J%%%%jJ%%%%%%%%%j
4726G8%%%J%%j%%%%%%J%%j%%%J%%%Jj%%j%%%%%%%%%Jj%%J%%%%%J%%%%j%%%%%%%%%%%%Jj%%
4718G9%%%%%%%%%%%j%%J%%%%J%%%%%%%%%%j%%%J%%%%%%%%%%%j%%%%%J%%%%%%j%%%%%%J%j%
4711G9%J%j%%%%%%%%%J%%j%J%%%jJ%%%j%%%%%%%%J%%j%%%J%%%%%j%%%J%%%j%J%%j%j%%%%J
4703G9%%%%%%%%j%J%%%%%%%%j%%%%%%J%J%%j%%j%jJ%%J%%%%%%J%%jJ%j%%%%%%%%%%jJ%%%%
4696G9%%%%%%%%%%j%%%j%%%%%%%J%%Jj%j%J%%%%%%%%%J%%%j%jJ%%J%j%%%J%%%Jj%%%%j%jJ
4689G8%%%%J%jj%%%%%%%%jJ%jJ%%%%%%%%%%%%%%%j%%J%%%%%%%%%J%%jJ%%%%%%%%%%%%%J%%
4681G9%%%%j%%j%%J%%J%%%%j%%%%%%%%%%j%%%%%j%J%%%%%%%J%%%%j%J%%%%%%%J%%j%%j%%%
$$ plain form
4674 77 78 78 79 79 78 78 78 78 78 78 78 78 77 77 77 77 77 77 77 77 78 77 77 78 78 78 79 79 79 79 79 78 78 78 78 78 78 78 79 79 79 78 78 78 78 77 77 77 77 78 78 78 79 78 78 77 77 77 77 77 78 79 79 79 79 79 79 78 78 78
4666 78 78 78 79 79 79 79 79 79 79 79 79 79 79 79 79 79 78 78 79 80 80 79 79 79 79 79 79 79 79 79 78 78 79 79 79 79 79 80 80 80 80 79 79 79 78 79 79 80 80 80 80 79 79 79 79 79 79 80 80 80 80 80 80 79 79 79 79 79 79 79
4659 79 79 79 79 79 79 79 79 80 80 80 79 79 79 79 79 80 80 80 80 79 79 78 79 80 80 80 80 79 79 79 79 79 79 79 79 79 79 79 79 79 78 78 78 78 79 79 79 80 80 80 79 79 79 79 79 78 78 77 77 78 78 78 78 77 77 77 77 78 78 77
4651 77 77 78 78 78 78 78 78 77 78 78 78 79 79 79 79 79 79 79 79 79 79 80 80 80 79 79 79 79 79 79 79 78 79 79 79 79 79 79 78 79 78 78 78 78 78 78 78 79 78 78 78 78 78 77 77 76 76 75 74 75 75 75 76 76 76 75 75 75 75 75
4644 75 75 75 75 75 75 75 76 76 76 76 76 77 77 76 76 76 76 76 76 77 77 77 77 77 78 78 79 78 78 79 79 79 79 78 78 79 79 79 80 79 79 79 79 79 79 79 79 79 79 79 79 79 79 79 78 78 78 77 78 78 78 78 77 77 78 77 77 78 78 78
4637 78 78 77 77 77 77 77 77 77 77 77 77 77 77 77 77 77 78 78 78 78 78 78 78 77 78 78 77 78 78 78 78 78 78 79 79 79 79 79 79 79 79 79 79 79 79 79 79 79 79 79 79 79 79 79 79 79 79 79 79 79 80 80 80 80 80 80 80 80 80 80
4629 80 80 80 79 79 79 79 80 80 80 80 80 80 79 79 79 79 79 80 80 79 79 79 79 79 79 79 79 79 79 79 79 79 79 79 79 79 79 79 79 79 79 79 79 79 79 79 79 78 79 79 79 79 79 79 79 79 78 78 78 79 79 79 79 80 80 79 79 79 78 78
4622 78 78 78 79 79 79 79 79 79 79 79 79 79 79 79 79 79 78 79 79 79 79 79 80 80 80 80 79 79 79 78 78 78 78 79 79 78 78 78 79 79 79 79 79 79 78 78 78 78 78 79 79 79 79 79 78 78 78 78 78 78 78 78 78 78 79 79 79 79 79 79
$$ packed form
4674G7J%J%j%%%%%%%j%%%%%%%Jj%J%%J%%%%j%%%%%%J%%j%%%j%%%J%%Jj%j%%%%JJ%%%%%j%%
4666G8%%J%%%%%%%%%%%%%j%JJ%j%%%%%%%%j%J%%%%J%%%j%%jJ%J%%%j%%%%%J%%%%%j%%%%%%
4659G9%%%%%%%J%%j%%%%J%%%j%jJJ%%%j%%%%%%%%%%%%j%%%J%%J%%j%%%%j%j%J%%%j%%%J%j
4651G7%J%%%%%jJ%%J%%%%%%%%%J%%j%%%%%%jJ%%%%%jJj%%%%%%Jj%%%%j%j%jjJ%%J%%j%%%%
4644G5%%%%%%J%%%%J%j%%%%%J%%%%J%Jj%J%%%j%J%%Jj%%%%%%%%%%%%%%j%%jJ%%%j%Jj%J%%
4637G8%j%%%%%%%%%%%%%%J%%%%%%jJ%jJ%%%%%J%%%%%%%%%%%%%%%%%%%%%%%%%%J%%%%%%%%%
4629H0%%j%%%J%%%%%j%%%%J%j%%%%%%%%%%%%%%%%%%%%%%%%%%%jJ%%%%%%%j%%J%%%J%j%%j%
4622G8%%J%%%%%%%%%%%%%jJ%%%%J%%%j%%j%%%J%j%%J%%%%%j%%%%J%%%%j%%%%%%%%%J%%%%%
$$ plain form
4614 79 79 79 79 79 79 79 78 78 77 77 77 77 77 78 78 78 79 78 78 78 78 77 77 77 77 77 77 77 78 78 78 78 78 78 78 77 77 77 77 77 77 77 77 77 77 76 76 76 76 77 77 77 78 78 78 77 77 78 78 78 79 79 79 78 78 78 78 79 78 78
4607 78 77 77 77 77 77 77 78 78 78 78 78 78 78 78 78 78 78 78 78 78 78 77 77 77 77 77 78 78 78 78 77 77 77 76 76 76 76 76 76 77 77 77 77 77 77 76 76 76 76 76 76 76 75 75 75 75 75 76 76 76 77 77 77 77 78 78 78 78 78 77
4600 77 77 77 77 77 77 78 78 78 78 78 78 78 78 78 78 78 78 79 79 79 79 78 78 78 78 78 78 78 78 79 79 78 78 77 77 77 77 77 77 77 77 77 77 77 78 78 78 77 77 77 77 77 77 77 77 77 77 77 77 77 77 77 77 77 78 78 78 78 78 79
4592 79 79 79 79 79 78 79 80 80 80 80 80 80 80 80 80 80 79 79 80 80 80 80 80 80 80 80 79 80 80 80 80 81 81 81 81 81 80 80 80 80 80 79 79 79 79 79 79 79 80 80 80 80 80 80 80 80 80 80 80 79 79 79 79 79 79 79 79 79 80 80
4585 80 80 80 80 80 80 80 80 80 80 79 79 79 79 79 79 79 79 80 80 81 81 80 80 80 80 80 80 80 79 80 80 80 80 81 81 80 80 80 79 80 80 80 80 80 80 80 81 81 81 81 81 82 83 83 83 83 83 84 84 85 85 85 86 85 84 83 82 82 82 81
4577 81 81 81 81 80 80 80 81 81 81 81 81 80 80 79 79 79 79 79 80 80 80 79 79 79 79 79 78 79 79 79 79 79 79 79 78 78 78 78 77 78 78 79 79 79 79 78 78 79 79 78 78 78 78 79 79 79 78 78 78 77 77 77 77 78 78 78 78 78 78 78
4570 78 78 78 78 78 78 78 78 78 78 78 77 77 76 76 77 77 78 77 77 77 78 78 79 78 78 78 78 78 77 77 77 78 78 78 78 78 78 78 78 78 77 77 77 77 77 77 77 78 78 78 78 78 78 78 78 78 78 78 78 78 78 78 77 77 77 77 77 77 77 77
4562 77 77 77 76 77 77 78 78 78 78 77 77 76 76 76 76 76 76 76 75 76 76 76 77 77 76 76 76 77 77 77 77 77 77 77 77 76 77 77 77 76 76 77 77 77 77 77 76 76 76 76 76 76 76 77 77 77 77 77 77 78 78 78 78 78 78 78 78 78 78 78
$$ packed form
4614G9%%%%%%j%j%%%%J%%Jj%%%j%%%%%%J%%%%%%j%%%%%%%%%j%%%J%%J%%j%J%%J%%j%%%Jj%
4607G8j%%%%%J%%%%%%%%%%%%%%j%%%%J%%%j%%j%%%%%J%%%%%j%%%%%%j%%%%J%%J%%%J%%%%j
4600G7%%%%%J%%%%%%%%%%%J%%%j%%%%%%%J%j%j%%%%%%%%%%J%%j%%%%%%%%%%%%%%%%J%%%%J
4592G9%%%%jJJ%%%%%%%%%j%J%%%%%%%jJ%%%J%%%%j%%%%j%%%%%%J%%%%%%%%%%j%%%%%%%%J%
4585H0%%%%%%%%%j%%%%%%%J%J%j%%%%%%jJ%%%J%j%%jJ%%%%%%J%%%%JJ%%%%J%J%%Jjjjj%%j
4577H1%%%j%%J%%%%j%j%%%%J%%j%%%%jJ%%%%%%j%%%jJ%J%%%j%J%j%%%J%%j%%j%%%J%%%%%%
4570G8%%%%%%%%%%j%j%J%Jj%%J%Jj%%%%j%%J%%%%%%%%j%%%%%%J%%%%%%%%%%%%%%j%%%%%%%
4562G7%%jJ%J%%%j%j%%%%%%jJ%%J%j%%J%%%%%%%jJ%%j%J%%%%j%%%%%%J%%%%%J%%%%%%%%%%
$$ plain form
4555 78 78 78 77 77 77 77 77 78 78 78 77 77 77 77 77 77 77 77 77 77 77 77 77 76 76 76 76 76 76 76 77 77 77 77 77 77 77 77 77 77 77 77 77 77 77 77 77 77 77 77 77 77 78 78 78 78 78 78 78 78 78 78 78 79 79 78 78 78 78 78
4548 78 77 77 77 77 77 77 78 78 78 78 78 78 78 78 78 78 78 78 77 77 77 77 77 77 78 78 78 78 78 78 78 78 77 77 77 77 77 77 77 78 78 78 78 77 77 77 76 77 77 77 78 78 78 78 78 77 77 78 78 78 78 79 79 79 79 79 79 78 78 77
4540 77 77 77 76 77 77 77 76 76 77 77 77 77 77 77 77 77 78 78 78 79 79 79 79 78 78 78 78 78 78 78 78 78 79 79 79 79 79 79 78 78 78 77 77 77 78 77 77 77 78 78 78 78 78 78 78 77 77 76 77 77 77 77 77 76 76 77 77 77 77 77
4533 77 77 77 77 77 77 77 77 77 77 77 77 77 78 78 78 78 78 78 77 78 78 78 78 78 78 78 78 78 78 78 78 78 78 78 78 78 78 78 78 78 78 78 79 78 79 79 79 79 79 79 78 78 78 79 80 80 81 80 80 79 79 79 78 78 78 78 77 77 77 77
4525 77 77 77 78 78 78 78 79 78 78 78 77 77 77 76 76 76 77 77 78 78 78 78 79 80 80 79 79 79 79 80 80 80 80 80 80 81 81 81 81 81 81 81 80 80 80 80 80 79 79 79 78 79 79 79 78 78 78 78 78 79 79 79 79 79 79 79 79 80 80 80
4518 80 80 80 80 80 80 79 79 79 79 79 79 79 80 79 79 79 79 79 78 79 79 79 79 79 79 79 79 79 79 79 79 78 78 79 79 79 80 79 79 79 79 79 78 79 79 79 79 79 79 79 79 79 79 79 79 79 79 79 79 78 78 78 78 78 79 78 78 78 79 78
4511 78 78 77 77 78 79 79 80 80 80 79 79 79 78 78 78 78 78 78 79 78 78 78 78 78 79 78 78 79 78 77 77 77 77 77 77 78 78 78 78 78 78 78 78 79 79 78 78 78 77 77 77 77 77 77 77 77 77 77 77 76 76 76 77 77 77 77 77 77 76 76
4503 76 76 76 76 77 77 77 77 77 77 77 77 77 77 77 78 78 77 77 77 78 79 79 78 78 78 77 77 76 76 76 76 76 77 76 76 76 76 76 77 76 76 76 76 75 75 76 76 76 76 76 76 76 76 76 77 77 76 76 76 76 76 76 76 76 76 76 76 76 76 76
$$ packed form
4555G8%%j%%%%J%%j%%%%%%%%%%%%j%%%%%%J%%%%%%%%%%%%%%%%%%%%%J%%%%%%%%%%J%j%%%%
4548G8j%%%%%J%%%%%%%%%%%j%%%%%J%%%%%%%j%%%%%%J%%%j%%jJ%%J%%%%j%J%%%J%%%%%j%j
4540G7%%jJ%%j%J%%%%%%%J%%J%%%j%%%%%%%%J%%%%%j%%j%%Jj%%J%%%%%%j%jJ%%%%j%J%%%%
4533G7%%%%%%%%%%%%J%%%%%jJ%%%%%%%%%%%%%%%%%%%%%%JjJ%%%%%j%%JJ%Jj%j%%j%%%j%%%
4525G7%%J%%%Jj%%j%%j%%J%J%%%JJ%j%%%J%%%%%J%%%%%%j%%%%j%%jJ%%j%%%%J%%%%%%%J%%
4518H0%%%%%j%%%%%%Jj%%%%jJ%%%%%%%%%%%j%J%%Jj%%%%jJ%%%%%%%%%%%%%%%j%%%%Jj%%Jj
4511G8%j%JJ%J%%j%%j%%%%%Jj%%%%Jj%Jjj%%%%%J%%%%%%%J%j%%j%%%%%%%%%%j%%J%%%%%j%
4503G6%%%J%%%%%%%%%%J%j%%JJ%j%%j%j%%%%Jj%%%%Jj%%%j%J%%%%%%%%J%j%%%%%%%%%%%%%
$$ plain form
4496 76 76 76 76 76 76 76 77 77 77 77 77 77 77 77 77 77 77 76 76 76 77 77 77 76 76 76 75 75 76 75 75 75 75 75 76 77 76 76 76 76 76 76 76 76 75 75 75 76 76 76 76 76 76 76 76 76 76 76 77 77 77 77 77 77 77 77 77 77 78 78
4488 78 77 77 77 77 76 76 76 76 77 77 77 76 76 77 77 77 77 77 76 76 75 76 76 76 76 77 77 77 77 77 77 77 77 77 77 76 75 76 76 76 76 77 77 77 77 77 77 77 76 76 76 76 76 77 77 77 77 77 77 77 77 77 76 76 76 76 76 76 76 76
4481 76 76 76 76 76 76 76 76 76 77 77 78 78 79 79 79 79 79 79 79 78 78 78 78 78 78 78 78 78 78 78 78 77 77 77 77 77 77 77 78 78 78 78 78 77 77 77 77 77 77 77 77 77 77 78 78 77 77 77 77 77 77 77 77 77 78 78 77 77 77 77
4473 77 77 77 77 77 77 77 77 77 78 78 78 78 78 78 78 78 77 77 77 78 78 78 77 77 77 77 77 77 78 78 78 78 78 77 77 77 77 77 77 77 77 77 77 76 76 76 77 77 78 77 77 77 76 76 76 76 77 77 77 77 77 77 77 77 77 77 77 77 77 77
4466 77 77 77 77 77 77 77 77 77 77 77 78 77 77 77 77 77 77 78 78 78 78 78 78 78 78 77 77 77 77 77 77 77 77 77 77 77 77 77 76 77 77 77 78 78 78 77 77 77 76 76 77 77 77 77 77 77 77 77 77 77 77 77 77 77 77 77 77 77 77 77
4459 77 77 77 77 78 79 79 79 79 78 78 78 78 77 77 77 77 77 77 77 77 77 76 76 76 76 77 78 78 77 77 77 77 77 77 77 77 77 76 76 76 76 76 76 76 76 76 76 77 76 76 76 76 76 76 76 76 77 76 77 77 77 77 76 76 76 76 76 76 76 76
4451 76 76 76 76 77 77 77 77 77 77 77 77 77 77 77 77 77 77 77 77 77 77 77 77 77 77 77 77 78 78 78 78 77 77 77 77 77 77 77 77 77 77 77 76 76 76 76 76 77 78 78 77 77 77 77 77 77 77 77 78 78 78 78 78 77 77 77 77 77 77 77
4444 77 76 76 77 77 76 76 76 76 76 76 77 77 77 76 76 76 77 77 77 77 77 77 77 77 76 75 75 75 76 76 76 76 77 76 76 76 77 77 77 77 78 78 78 78 78 77 77 77 77 77 77 77 77 77 77 77 77 77 77 77 77 77 77 77 77 76 76 76 76 76
$$ packed form
4496G6%%%%%%J%%%%%%%%%%j%%J%%j%%j%Jj%%%%JJj%%%%%%%j%%J%%%%%%%%%%J%%%%%%%%%J%
4488G8j%%%j%%%J%%j%J%%%%j%jJ%%%J%%%%%%%%%jjJ%%%J%%%%%%j%%%%J%%%%%%%%j%%%%%%%
4481G6%%%%%%%%J%J%J%%%%%%j%%%%%%%%%%%j%%%%%%J%%%%j%%%%%%%%%J%j%%%%%%%%J%j%%%
4473G7%%%%%%%%J%%%%%%%j%%J%%j%%%%%J%%%%j%%%%%%%%%j%%J%Jj%%j%%%J%%%%%%%%%%%%%
4466G7%%%%%%%%%%Jj%%%%%J%%%%%%%j%%%%%%%%%%%%jJ%%J%%j%%j%J%%%%%%%%%%%%%%%%%%%
4459G7%%%JJ%%%j%%%j%%%%%%%%j%%%JJ%j%%%%%%%%j%%%%%%%%%Jj%%%%%%%JjJ%%%j%%%%%%%
4451G6%%%J%%%%%%%%%%%%%%%%%%%%%%%J%%%j%%%%%%%%%%j%%%%JJ%j%%%%%%%J%%%%j%%%%%%
4444G7j%J%j%%%%%J%%j%%J%%%%%%%jj%%J%%%Jj%%J%%%J%%%%j%%%%%%%%%%%%%%%%%%%j%%%%
$$ plain form
4436 76 76 76 76 76 77 77 76 76 76 76 76 76 76 77 77 77 77 77 77 76 76 76 76 76 77 77 77 76 77 77 77 77 76 77 77 77 77 77 77 77 77 77 77 77 76 76 76 76 76 76 76 76 75 76 77 76 76 76 76 77 77 76 76 76 76 77 77 77 76 76
4429 76 76 77 77 77 77 76 76 76 76 76 76 76 76 76 76 76 76 76 75 75 76 76 76 76 77 77 77 77 77 77 77 76 77 77 77 76 76 77 77 77 77 77 77 77 77 77 78 78 78 77 77 77 77 76 76 76 76 76 76 77 77 76 76 76 76 76 76 76 76 76
4422 76 76 76 77 77 77 76 76 76 75 75 76 76 76 76 76 77 77 76 76 76 76 76 76 75 76 76 76 76 77 77 77 77 77 76 76 76 76 76 75 76 76 76 77 77 76 76 75 75 75 75 75 75 75 75 75 75 75 76 76 76 76 77 77 77 77 77 77 77 76 76
4414 76 76 76 76 76 76 76 76 77 77 76 76 76 75 75 75 75 75 76 76 76 76 76 76 76 76 76 76 76 76 76 75 76 76 77 76 75 75 75 76 76 76 77 77 77 77 77 77 77 77 77 77 76 77 77 77 77 77 77 76 77 77 77 76 76 76 76 77 76 76 76
4407 76 76 76 77 77 77 77 77 76 76 76 77 77 76 76 76 76 77 78 78 78 77 77 77 77 77 77 77 77 77 77 77 77 77 77 77 76 76 76 76 76 75 76 76 76 76 76 77 77 77 77 77 77 76 76 76 75 75 75 75 76 76 76 76 76 76 76 75 75 75 75
4399 75 75 76 77 77 77 77 77 77 77 77 77 77 76 76 76 76 77 77 77 77 77 77 77 76 76 76 76 76 76 76 77 77 77 76 76 76 76 76 77 77 77 77 78 78 77 77 77 77 77 77 77 76 76 76 76 75 75 75 75 75 76 76 76 76 76 76 76 75 75 76
4392 76 76 76 76 76 76 76 76 75 75 75 75 75 75 75 75 75 76 76 76 75 75 75 75 75 75 75 75 75 75 75 75 75 76 76 76 76 76 76 76 76 76 76 76 76 76 76 76 76 76 76 76 76 76 76 76 76 76 77 77 77 77 77 78 78 77 76 76 76 76 76
4384 76 76 76 76 77 78 78 77 77 77 77 77 77 77 76 76 75 75 76 76 76 75 75 76 77 77 77 77 76 76 76 76 76 75 75 75 75 75 75 76 77 77 77 77 77 76 75 75 75 75 76 75 75 76 76 76 75 75 76 77 77 77 76 76 75 75 75 76 76 76 76
$$ packed form
4436G6%%%%J%j%%%%%%J%%%%%j%%%%J%%jJ%%%jJ%%%%%%%%%%j%%%%%%%jJJj%%%J%j%%%J%%j%
4429G6%J%%%j%%%%%%%%%%%%j%J%%%J%%%%%%jJ%%j%J%%%%%%%%J%%j%%%j%%%%%J%j%%%%%%%%
4422G6%%J%%j%%j%J%%%%J%j%%%%%jJ%%%J%%%%j%%%%jJ%%J%j%j%%%%%%%%%%J%%%J%%%%%%j%
4414G6%%%%%%%J%j%%j%%%%J%%%%%%%%%%%%jJ%Jjj%%J%%J%%%%%%%%%jJ%%%%%jJ%%j%%%Jj%%
4407G6%%J%%%%j%%J%j%%%JJ%%j%%%%%%%%%%%%%%j%%%%jJ%%%%J%%%%%j%%j%%%J%%%%%%j%%%
4399G5%JJ%%%%%%%%%j%%%J%%%%%%j%%%%%%J%%j%%%%J%%%J%j%%%%%%j%%%j%%%%J%%%%%%j%J
4392G6%%%%%%%j%%%%%%%%J%%j%%%%%%%%%%%%J%%%%%%%%%%%%%%%%%%%%%%%%J%%%%J%jj%%%%
4384G6%%%JJ%j%%%%%%j%j%J%%j%JJ%%%j%%%%j%%%%%JJ%%%%jj%%%Jj%J%%j%JJ%%j%j%%J%%%
$$ plain form
4377 76 76 76 76 76 76 76 75 75 75 76 76 76 76 76 76 76 76 77 77 77 77 77 76 76 76 76 76 75 75 75 76 76 76 76 76 76 76 76 76 76 76 76 76 76 76 76 76 76 76 76 77 77 77 77 77 77 77 76 76 76 76 76 77 76 76 76 76 76 76 76
4370 76 76 75 75 75 75 75 75 75 75 75 75 76 76 76 76 76 76 76 75 75 74 74 75 75 75 76 76 76 76 76 76 75 75 75 75 75 75 75 75 75 75 76 76 76 76 76 76 76 76 76 76 76 76 76 76 75 75 75 76 76 76 76 75 75 75 75 75 75 76 76
4362 76 75 76 77 77 76 76 76 76 76 76 76 75 75 75 75 75 75 75 75 75 75 75 75 75 75 75 75 75 76 76 76 76 76 77 77 76 76 75 75 75 75 75 75 75 76 76 76 76 75 76 76 76 76 76 77 76 76 75 75 75 75 75 75 75 76 75 75 75 75 75
4355 75 75 75 74 75 75 75 75 75 76 75 75 75 75 75 75 75 75 75 76 76 76 76 76 76 75 75 75 76 76 76 76 76 76 76 76 76 76 77 77 77 77 77 77 76 76 76 76 76 75 75 75 75 75 75 74 75 75 76 76 76 76 75 75 75 76 76 76 76 76 76
4347 76 75 75 75 75 75 75 75 75 75 75 75 75 75 75 75 75 75 75 75 76 76 76 76 76 76 76 76 76 76 77 77 77 77 76 76 76 77 76 76 76 76 76 76 75 74 74 74 74 74 75 76 77 77 77 77 76 76 75 75 76 75 75 75 75 75 75 75 74 74 75
4340 75 75 75 75 76 76 76 76 75 75 74 74 75 75 75 75 75 75 75 75 75 75 76 76 76 76 76 76 75 75 75 75 76 76 76 76 76 77 77 77 77 76 76 77 76 76 76 76 76 75 75 76 76 76 76 76 76 76 76 76 76 76 75 75 75 75 75 75 75 76 76
4333 76 76 75 75 75 75 75 75 75 75 76 76 76 76 76 76 76 76 76 76 76 76 75 76 76 76 76 76 76 75 75 75 75 75 75 75 74 75 76 76 76 75 75 76 75 75 75 75 75 74 74 74 75 75 75 75 76 76 76 76 76 76 76 75 75 75 75 75 75 75 75
4325 75 75 76 76 76 76 75 75 75 75 75 75 75 75 75 75 75 75 75 75 75 75 75 75 75 75 75 75 76 76 75 75 75 75 75 75 75 75 75 75 75 75 75 75 76 76 76 76 76 77 76 76 76 75 76 76 76 76 75 75 75 75 75 75 75 75 75 75 76 76 75
$$ packed form
4377G6%%%%%%j%%J%%%%%%%J%%%%j%%%%j%%J%%%%%%%%%%%%%%%%%%%J%%%%%%j%%%%Jj%%%%%%
4370G6%j%%%%%%%%%J%%%%%%j%j%J%%J%%%%%j%%%%%%%%%J%%%%%%%%%%%%%j%%J%%%j%%%%%J%
4362G6jJJ%j%%%%%%j%%%%%%%%%%%%%%%%J%%%%J%j%j%%%%%%J%%%jJ%%%%Jj%j%%%%%%Jj%%%%
4355G5%%jJ%%%%Jj%%%%%%%%J%%%%%j%%J%%%%%%%%%J%%%%%j%%%%j%%%%%jJ%J%%%j%%J%%%%%
4347G6j%%%%%%%%%%%%%%%%%%J%%%%%%%%%J%%%j%%Jj%%%%%jj%%%%JJJ%%%j%j%Jj%%%%%%j%J
4340G5%%%J%%%j%j%J%%%%%%%%%J%%%%%j%%%J%%%%J%%%j%Jj%%%%j%J%%%%%%%%%%j%%%%%%J%
4333G6%j%%%%%%%J%%%%%%%%%%%jJ%%%%%j%%%%%%jJJ%%j%Jj%%%%j%%J%%%J%%%%%%j%%%%%%%
4325G5%J%%%j%%%%%%%%%%%%%%%%%%%%%J%j%%%%%%%%%%%%%J%%%%Jj%%jJ%%%j%%%%%%%%%J%j
$$ plain form
4318 75 75 74 75 74 74 74 74 74 74 74 75 75 76 76 75 75 74 74 74 74 74 75 75 75 74 75 75 75 75 75 74 74 74 75 75 75 75 75 75 75 75 75 75 75 76 76 75 75 75 75 75 76 76 76 76 76 76 76 76 75 75 75 76 76 76 76 76 76 76 76
4310 76 76 76 76 76 76 76 75 75 76 76 76 76 76 76 76 76 76 76 75 75 75 75 75 75 75 75 75 75 75 75 75 75 75 75 75 75 75 75 76 76 76 75 75 76 76 76 76 76 76 76 76 76 75 75 75 75 75 75 74 74 74 75 75 75 75 75 75 75 75 75
4303 75 75 75 76 76 76 76 76 75 75 75 75 75 75 75 75 75 75 76 76 75 75 75 74 74 75 75 75 75 75 76 76 76 75 75 75 75 75 75 75 76 77 76 75 75 75 75 75 75 75 75 75 75 75 74 74 74 75 75 75 75 75 75 75 76 76 76 75 75 75 75
4295 75 75 75 75 75 75 75 75 75 75 75 75 75 75 75 75 75 75 76 76 76 76 77 76 76 76 76 75 75 75 75 75 75 75 75 75 75 75 76 76 76 76 76 76 75 75 74 74 74 74 74 75 75 75 74 75 75 75 75 75 75 74 74 74 74 74 75 75 75 75 75
4288 75 75 75 75 75 75 75 75 74 74 74 74 74 74 75 75 75 75 75 76 76 76 76 75 75 75 75 75 75 75 76 76 76 76 75 75 75 76 76 76 75 75 74 74 74 74 75 74 74 74 74 74 75 75 76 76 76 76 75 76 76 76 76 76 76 76 76 75 75 75 75
4281 75 76 76 76 76 75 75 75 75 75 75 76 76 76 76 76 76 77 76 76 76 75 75 75 75 75 75 75 75 75 75 75 75 75 74 74 74 74 74 74 74 74 74 74 74 74 75 75 75 75 75 75 75 74 75 75 75 75 75 75 75 74 74 74 74 74 75 75 75 75 75
4273 75 75 75 75 75 74 75 75 75 75 75 75 75 74 74 75 75 76 76 75 75 75 75 75 75 75 75 75 75 75 75 75 75 75 75 75 74 74 74 73 74 74 74 74 75 75 75 75 75 75 75 75 75 75 75 75 75 75 75 75 74 74 74 74 74 74 75 75 75 75 75
4266 75 75 74 75 75 75 75 75 75 74 75 75 75 75 75 75 75 75 75 76 76 76 76 75 75 75 75 74 74 74 74 75 75 75 75 76 76 76 76 76 75 75 74 74 74 74 74 75 75 76 76 76 75 75 75 74 74 75 75 76 76 76 75 75 75 76 76 75 75 75 75
$$ packed form
4318G5%jJj%%%%%%J%J%j%j%%%%J%%jJ%%%%j%%J%%%%%%%%%%J%j%%%%J%%%%%%%j%%J%%%%%%%
4310G6%%%%%%j%J%%%%%%%%%j%%%%%%%%%%%%%%%%%%%J%%j%J%%%%%%%%j%%%%%j%%J%%%%%%%%
4303G5%%J%%%%j%%%%%%%%%J%j%%j%J%%%%J%%j%%%%%%JJjj%%%%%%%%%%j%%J%%%%%%J%%j%%%
4295G5%%%%%%%%%%%%%%%%%J%%%Jj%%%j%%%%%%%%%%J%%%%%j%j%%%%J%%jJ%%%%%j%%%%J%%%%
4288G5%%%%%%%j%%%%%J%%%%J%%%j%%%%%%J%%%j%%J%%j%j%%%Jj%%%%J%J%%%jJ%%%%%%%j%%%
4281G5J%%%j%%%%%J%%%%%Jj%%j%%%%%%%%%%%%j%%%%%%%%%%%J%%%%%%jJ%%%%%%j%%%%J%%%%
4273G5%%%%jJ%%%%%%j%J%J%j%%%%%%%%%%%%%%%%j%%jJ%%%J%%%%%%%%%%%%%%%j%%%%%J%%%%
4266G5%jJ%%%%%jJ%%%%%%%%J%%%j%%%j%%%J%%%J%%%%j%j%%%%J%J%%j%%j%J%J%%j%%J%j%%%
$$ plain form
4258 75 75 75 75 75 75 75 75 75 75 76 76 76 76 76 76 76 75 75 75 75 75 75 74 74 75 75 75 74 74 75 75 75 75 75 75 75 75 75 74 74 74 75 75 75 74 74 74 75 74 74 74 74 74 74 74 74 75 75 75 75 75 75 75 75 75 75 75 75 75 75
4251 75 75 75 75 75 75 75 76 76 76 75 74 74 74 74 74 74 74 74 75 76 76 75 75 74 74 74 75 75 75 75 75 75 75 75 76 75 75 75 74 74 74 74 74 75 75 76 75 75 75 75 75 74 75 75 75 75 74 74 75 75 75 75 75 75 75 75 75 75 75 75
4244 75 74 74 74 74 73 74 74 74 74 74 74 75 75 75 75 75 75 75 76 76 76 75 75 74 74 74 74 74 74 74 74 74 75 75 75 75 76 76 75 75 75 75 75 75 75 75 75 75 76 75 74 74 74 74 74 74 75 75 75 75 75 75 75 75 75 75 75 74 74 75
4236 75 75 75 75 75 76 76 76 76 75 75 75 75 75 74 74 74 74 75 75 75 75 75 75 75 75 75 75 75 74 75 75 76 76 76 75 75 75 75 75 75 75 75 76 76 76 75 75 75 75 75 75 74 74 74 74 74 75 75 75 75 75 76 75 75 75 75 75 75 75 75
4229 75 75 75 75 75 75 75 75 75 75 75 75 75 75 75 74 74 74 73 73 74 74 74 74 74 74 74 74 74 75 75 76 76 76 76 76 75 75 75 75 75 75 75 75 74 74 74 74 74 74 74 74 74 74 74 74 74 74 75 75 75 75 75 75 74 74 74 75 75 75 75
4221 75 75 75 75 75 75 75 74 74 74 74 74 74 74 74 74 74 74 75 75 74 74 74 74 74 74 74 74 74 74 74 74 75 75 75 75 75 75 75 75 75 75 75 75 75 76 76 75 75 74 74 74 74 74 75 75 75 75 74 74 74 75 75 75 74 74 74 74 75 75 75
4214 75 75 74 74 75 75 75 74 74 74 74 74 74 74 74 74 74 74 74 74 74 74 74 74 75 74 74 74 74 74 75 75 75 75 75 75 74 74 75 76 76 75 75 74 74 74 74 74 74 75 75 75 75 75 75 75 75 75 75 75 74 74 75 75 75 75 76 76 75 75 75
4206 75 74 75 75 75 75 75 75 75 74 74 74 74 73 74 74 75 74 74 74 74 74 74 74 74 74 74 74 75 75 75 74 74 75 75 75 75 75 75 75 75 75 75 75 75 75 75 75 74 74 75 75 75 74 75 75 75 75 74 74 74 74 75 75 75 75 75 75 74 74 74
$$ packed form
4258G5%%%%%%%%%J%%%%%%j%%%%%j%J%%j%J%%%%%%%%j%%J%%j%%Jj%%%%%%%J%%%%%%%%%%%%%
4251G5%%%%%%J%%jj%%%%%%%JJ%j%j%%J%%%%%%%Jj%%j%%%%J%Jj%%%%jJ%%%j%J%%%%%%%%%%%
4244G5j%%%jJ%%%%%J%%%%%%J%%j%j%%%%%%%%J%%%J%j%%%%%%%%%Jjj%%%%%J%%%%%%%%%%j%J
4236G5%%%%J%%%j%%%%j%%%J%%%%%%%%%%jJ%J%%j%%%%%%%J%%j%%%%%j%%%%J%%%%Jj%%%%%%%
4229G5%%%%%%%%%%%%%%j%%j%J%%%%%%%%J%J%%%%j%%%%%%%j%%%%%%%%%%%%%J%%%%%j%%J%%%
4221G5%%%%%%j%%%%%%%%%%J%j%%%%%%%%%%%J%%%%%%%%%%%%J%j%j%%%%J%%%j%%J%%j%%%J%%
4214G5%j%J%%j%%%%%%%%%%%%%%%%Jj%%%%J%%%%%j%JJ%j%j%%%%%J%%%%%%%%%%j%J%%%J%j%%
4206G5jJ%%%%%%j%%%jJ%Jj%%%%%%%%%%J%%j%J%%%%%%%%%%%%%%j%J%%jJ%%%j%%%J%%%%%j%%
$$ plain form
4199 74 74 75 75 75 75 75 74 74 73 74 74 74 74 74 74 74 75 75 75 75 74 74 74 74 74 74 74 74 74 74 74 74 75 75 74 74 74 74 75 75 75 74 74 75 75 75 75 75 75 75 75 75 75 74 73 74 74 75 75 75 74 74 74 74 74 74 74 74 74 74
4192 74 74 74 74 74 74 74 74 74 74 74 74 74 74 74 74 74 74 74 73 74 74 74 74 74 74 74 74 74 74 74 74 75 75 75 75 75 75 75 75 74 74 75 75 74 74 74 74 74 75 75 75 75 74 74 74 74 74 75 75 75 75 75 75 75 75 75 75 75 75 75
4184 75 75 75 76 76 75 75 74 74 74 75 75 74 74 74 74 74 74 75 75 74 75 76 75 75 75 75 74 74 74 74 74 74 74 74 73 73 73 74 74 74 75 75 75 75 74 74 74 74 74 74 73 74 74 74 75 75 74 74 74 75 75 75 75 75 75 75 74 74 74 74
4177 74 74 74 74 74 74 75 75 75 75 75 75 75 75 75 74 74 74 74 73 73 73 74 74 74 74 74 74 74 74 75 75 75 75 75 74 74 74 75 75 75 75 76 76 75 75 75 75 75 75 74 74 75 75 75 75 75 75 76 76 75 75 75 74 74 74 73 73 74 75 75
4169 75 76 76 76 76 75 75 75 75 74 74 74 74 75 74 74 74 74 74 75 75 75 75 75 74 74 74 74 75 75 74 74 73 74 74 74 73 74 74 74 74 74 74 74 74 74 74 75 75 75 75 74 74 73 74 74 74 74 74 74 74 74 74 74 74 75 75 74 74 74 74
4162 74 74 74 74 74 74 74 74 73 74 74 75 75 75 74 74 74 73 73 73 74 73 74 74 75 75 75 75 75 75 75 75 75 74 74 74 74 74 74 74 74 74 74 75 75 75 75 75 74 74 74 75 75 75 75 75 75 75 75 75 75 74 74 74 74 74 74 74 74 74 74
4155 74 75 74 74 74 74 74 74 74 74 74 74 74 74 74 74 74 74 74 74 74 74 74 74 75 75 75 75 75 75 74 74 74 74 74 74 74 74 74 75 75 75 75 76 75 75 75 75 74 74 74 74 74 73 73 73 74 74 74 74 74 74 74 74 74 75 75 75 75 75 74
4147 74 73 73 74 75 75 75 75 75 75 74 74 74 75 75 75 75 75 75 75 74 75 74 74 75 75 75 75 75 74 74 74 74 74 74 74 74 73 74 74 74 74 74 74 74 75 75 75 75 75 75 75 75 75 75 75 76 76 75 75 74 74 74 74 74 74 74 74 75 75 75
$$ packed form
4199G4%J%%%%j%jJ%%%%%%J%%%j%%%%%%%%%%%J%j%%%J%%j%J%%%%%%%%%jjJ%J%%j%%%%%%%%%
4192G4%%%%%%%%%%%%%%%%%%jJ%%%%%%%%%%%J%%%%%%%j%J%j%%%%J%%%j%%%%J%%%%%%%%%%%%
4184G5%%J%j%j%%J%j%%%%%J%jJJj%%%j%%%%%%%j%%J%%J%%%j%%%%%jJ%%J%j%%J%%%%%%j%%%
4177G4%%%%%J%%%%%%%%j%%%j%%J%%%%%%%J%%%%j%%J%%%J%j%%%%%j%J%%%%%J%j%%j%%j%JJ%
4169G5J%%%j%%%j%%%Jj%%%%J%%%%j%%%J%j%jJ%%jJ%%%%%%%%%J%%%j%jJ%%%%%%%%%%J%j%%%
4162G4%%%%%%%jJ%J%%j%%j%%JjJ%J%%%%%%%%j%%%%%%%%%J%%%%j%%J%%%%%%%%%j%%%%%%%%%
4155G4Jj%%%%%%%%%%%%%%%%%%%%%J%%%%%j%%%%%%%%J%%%Jj%%%j%%%%j%%J%%%%%%%%J%%%%j
4147G4j%JJ%%%%%j%%J%%%%%%jJj%J%%%%j%%%%%%%jJ%%%%%%J%%%%%%%%%%J%j%j%%%%%%%J%%
$$ plain form
4140 75 75 75 75 75 75 75 75 75 75 75 75 75 75 75 74 75 75 75 74 73 73 73 74 74 74 75 74 74 75 75 75 75 75 74 74 74 74 74 74 74 74 75 74 74 74 74 74 75 75 75 75 76 76 76 75 75 75 75 75 75 75 75 75 75 75 75 74 74 74 74
4132 74 74 75 74 75 75 75 75 75 75 75 75 74 74 75 75 75 75 75 75 75 74 74 74 74 74 74 73 74 74 75 75 75 75 75 75 76 76 76 76 76 76 75 75 75 75 75 75 75 75 75 74 75 75 75 75 75 75 75 75 75 76 75 75 75 75 75 75 75 75 75
4125 75 75 75 75 75 75 76 75 75 74 74 74 74 73 73 74 74 75 75 75 74 73 72 72 73 74 74 74 74 74 74 74 74 75 75 75 75 75 75 75 74 74 74 75 75 75 75 75 76 75 75 75 75 74 74 74 74 74 75 76 76 76 75 75 75 75 75 75 75 75 75
4117 75 74 74 74 74 74 74 75 75 74 74 74 73 73 74 74 74 74 74 74 74 74 75 75 74 74 74 74 74 74 74 74 74 74 74 74 74 74 74 74 73 73 73 74 74 74 74 75 74 74 74 74 74 74 74 74 74 74 75 75 75 75 75 75 75 74 74 74 74 74 74
4110 74 73 73 74 74 74 74 74 74 74 74 74 75 74 74 75 75 75 75 74 74 74 74 74 75 75 75 75 74 74 74 74 75 75 74 74 74 74 74 75 75 75 75 74 74 74 75 75 74 74 73 73 73 73 73 74 74 74 74 74 74 73 73 74 74 73 73 73 73 72 72
4103 72 73 73 74 74 74 74 74 74 74 74 74 74 74 74 74 74 74 73 74 74 75 75 75 75 75 75 75 74 74 74 74 74 74 74 74 74 74 73 73 73 74 75 75 75 74 74 74 75 75 74 73 73 73 73 74 74 74 74 74 73 73 73 74 74 74 74 74 74 74 74
4095 74 74 74 74 74 74 74 74 73 73 73 73 74 74 74 74 75 75 75 75 75 75 75 75 74 74 74 74 74 74 75 75 75 75 75 76 76 76 75 75 74 74 73 74 74 74 74 74 74 74 74 74 74 73 73 73 74 73 73 74 74 74 75 74 74 74 74 74 74 74 74
4088 74 74 74 74 75 75 74 74 73 73 73 73 73 73 74 74 74 74 74 73 74 75 75 74 74 74 73 73 73 73 73 73 73 73 73 74 74 74 73 73 74 74 73 73 73 73 73 73 74 75 75 75 75 75 74 74 74 74 74 74 74 74 74 74 74 73 73 73 73 74 74
$$ packed form
4140G5%%%%%%%%%%%%%%jJ%%jj%%J%%Jj%J%%%%j%%%%%%%Jj%%%%J%%%J%%j%%%%%%%%%%%j%%%
4132G4%JjJ%%%%%%%j%J%%%%%%j%%%%%jJ%J%%%%%J%%%%%j%%%%%%%%jJ%%%%%%%%Jj%%%%%%%%
4125G5%%%%%Jj%j%%%j%J%J%%jjj%JJ%%%%%%%J%%%%%%j%%J%%%%Jj%%%j%%%%JJ%%j%%%%%%%%
4117G5j%%%%%J%j%%j%J%%%%%%%J%j%%%%%%%%%%%%%%%j%%J%%%Jj%%%%%%%%%J%%%%%%j%%%%%
4110G4j%J%%%%%%%%Jj%J%%%j%%%%J%%%j%%%J%j%%%%J%%%j%%J%j%j%%%%J%%%%%j%J%j%%%j%
4103G2J%J%%%%%%%%%%%%%%jJ%J%%%%%%j%%%%%%%%%j%%JJ%%j%%J%jj%%%J%%%%j%%J%%%%%%%
4095G4%%%%%%%j%%%J%%%J%%%%%%%j%%%%%J%%%%J%%j%j%jJ%%%%%%%%%j%%Jj%J%%Jj%%%%%%%
4088G4%%%J%j%j%%%%%J%%%%jJJ%j%%j%%%%%%%%J%%j%J%j%%%%%JJ%%%%j%%%%%%%%%%j%%%J%
$$ plain form
4080 74 73 74 74 74 74 74 74 75 75 75 75 75 75 74 74 73 73 74 74 74 74 75 75 75 75 76 75 75 75 75 75 75 75 74 73 73 74 74 74 74 75 75 74 74 74 74 74 74 74 74 73 73 73 73 73 73 73 74 73 73 74 74 74 74 73 73 73 74 74 74
4073 74 74 74 74 74 74 74 75 75 74 74 74 74 74 74 74 74 74 74 74 74 73 73 73 73 73 73 74 74 74 74 74 74 74 74 74 74 75 75 74 74 74 74 74 74 74 74 73 74 74 74 74 74 74 74 74 74 74 74 74 74 74 74 75 75 75 74 74 74 73 73
4066 73 73 73 73 74 74 74 74 74 74 74 74 74 74 74 74 74 74 74 73 73 73 73 73 73 73 73 73 73 74 74 74 74 74 74 74 74 74 74 74 74 74 73 73 73 72 73 74 74 75 74 74 74 74 74 73 73 73 73 73 74 74 74 74 74 73 72 72 72 72 72
4058 72 73 72 72 72 72 73 73 73 73 74 74 74 74 74 75 75 75 75 75 75 74 74 74 74 74 74 75 75 74 74 74 74 74 74 74 74 74 74 74 74 74 74 74 74 75 75 75 75 75 75 75 75 75 75 74 74 74 74 74 74 74 74 74 74 74 74 74 73 73 73
4051 73 73 73 73 73 73 74 73 73 74 74 74 74 74 74 74 74 74 74 74 74 74 74 75 75 75 75 75 74 74 74 74 74 74 75 75 75 75 76 75 75 75 75 75 74 74 74 74 74 75 75 76 76 76 76 76 76 76 75 74 74 75 75 74 74 74 74 74 74 74 74
4043 74 74 74 74 74 73 73 73 74 75 75 75 75 75 75 74 74 75 75 75 75 75 75 75 75 75 75 74 74 74 74 73 73 73 73 73 73 73 73 73 73 73 73 73 73 73 73 73 73 73 74 74 74 73 73 74 73 73 73 73 74 74 75 75 75 75 74 74 74 74 74
4036 74 74 74 73 73 73 73 74 74 74 74 74 74 74 75 75 75 75 74 74 75 75 75 75 74 73 73 74 74 74 74 74 74 73 73 73 74 74 74 74 74 74 74 73 74 74 74 74 73 73 73 73 73 74 74 75 75 75 75 75 74 74 74 74 75 75 75 75 75 74 75
4028 75 75 74 74 74 74 74 73 74 74 74 74 74 74 74 73 73 73 74 74 74 74 74 74 74 74 74 74 74 74 74 74 74 74 74 74 74 74 74 74 74 74 74 74 73 73 73 73 74 74 75 75 75 75 75 74 74 74 74 75 75 75 75 74 74 73 74 74 74 74 75
$$ packed form
4080G4jJ%%%%%J%%%%%j%j%J%%%J%%%Jj%%%%%%jj%J%%%J%j%%%%%%%j%%%%%%Jj%J%%%j%%J%%
4073G4%%%%%%J%j%%%%%%%%%%%j%%%%%J%%%%%%%%%J%j%%%%%%%jJ%%%%%%%%%%%%%%J%%j%%j%
4066G3%%%J%%%%%%%%%%%%%%j%%%%%%%%%J%%%%%%%%%%%%j%%jJJ%Jj%%%%j%%%%J%%%%jj%%%%
4058G2Jj%%%J%%%J%%%%J%%%%%j%%%%%J%j%%%%%%%%%%%%%%%J%%%%%%%%%j%%%%%%%%%%%%j%%
4051G3%%%%%Jj%J%%%%%%%%%%%%%J%%%%j%%%%%J%%%Jj%%%%j%%%%J%J%%%%%%jj%J%j%%%%%%%
4043G4%%%%j%%JJ%%%%%j%J%%%%%%%%%j%%%j%%%%%%%%%%%%%%%%%%J%%j%Jj%%%J%J%%%j%%%%
4036G4%%j%%%J%%%%%%J%%%j%J%%%jj%J%%%%%j%%J%%%%%%jJ%%%j%%%%J%J%%%%j%%%J%%%%jJ
4028G5%j%%%%jJ%%%%%%j%%J%%%%%%%%%%%%%%%%%%%%%%%%%j%%%J%J%%%%j%%%J%%%j%jJ%%%J
$$ plain form
4021 75 75 75 74 74 74 74 75 75 75 75 74 74 74 75 75 74 74 74 75 74 74 74 74 74 75 75 75 75 75 74 74 74 74 73 73 73 72 72 72 72 73 73 74 74 74 74 74 74 74 74 74 74 75 74 74 74 74 74 75 75 74 74 74 74 74 74 75 74 73 73
4014 73 73 73 74 74 74 74 74 74 74 74 74 74 74 74 74 74 74 74 75 75 75 74 74 74 74 74 74 74 74 74 74 74 74 74 73 73 73 72 73 73 74 74 73 73 73 74 74 74 74 74 74 74 74 74 74 74 73 74 74 74 74 74 74 73 73 73 73 73 74 74
4006 74 74 74 73 73 73 73 73 73 73 73 73 74 74 73 73 74 74 75 75 74 74 74 73 74 74 74 74 74 74 74 73 73 73 73 73 74 74 74 74 74 75 75 74 74 74 74 73 73 73 74 74 74 75 75 75 75 75 75 75 74 74 74 75 75 75 75 74 74 74 74
3999 74 75 74 73 73 73 74 74 75 75 75 75 75 75 75 75 75 76 76 75 74 74 74 74 74 74 74 74 74 75 75 74 74 74 74 74 74 73 73 74 74 74 74 74 74 74 74 74 74 74 74 74 74 74 74 74 74 74 74 74 74 74 74 74 74 74 74 73 73 74 74
3991 74 74 74 73 73 73 73 73 74 74 74 74 74 74 74 74 74 74 74 73 73 73 73 73 73 72 73 73 73 73 73 73 73 74 73 74 74 74 74 74 74 74 74 74 74 74 73 73 73 73 74 74 74 73 73 72 73 74 74 74 74 74 74 74 74 74 74 74 74 74 73
3984 73 73 73 73 73 73 74 75 75 75 75 75 75 74 74 74 74 74 73 73 73 73 73 73 73 73 73 73 73 73 74 74 74 74 74 74 74 75 75 75 75 75 75 74 74 73 73 73 73 73 73 73 74 74 74 74 74 74 74 73 73 73 73 73 73 73 73 73 73 73 73
3977 73 73 73 73 73 73 73 73 73 73 73 73 73 73 73 73 74 74 74 73 73 73 73 74 74 74 74 75 74 74 74 74 74 74 74 74 73 73 73 73 73 74 74 74 74 74 74 73 73 73 73 73 74 74 74 74 74 74 74 73 72 72 72 73 73 73 73 73 73 73 73
3969 73 73 74 74 73 74 74 74 74 74 74 74 74 74 74 74 74 74 74 74 74 74 73 73 73 73 73 73 73 73 74 74 74 75 74 74 74 74 74 75 75 75 75 75 75 75 74 74 73 73 73 72 73 73 74 74 74 74 74 74 74 74 73 74 74 74 74 74 74 74 74
$$ packed form
4021G5%%j%%%J%%%j%%J%j%%Jj%%%%J%%%%j%%%j%%j%%%J%J%%%%%%%%%Jj%%%%J%j%%%%%Jjj%
4014G3%%J%%%%%%%%%%%%%%%J%%j%%%%%%%%%%%%j%%jJ%J%j%%J%%%%%%%%%%jJ%%%%%j%%%%J%
4006G4%%j%%%%%%%%J%j%J%J%j%%jJ%%%%%%j%%%%J%%%%J%j%%%j%%J%%J%%%%%%j%%J%%%j%%%
3999G4Jjj%%J%J%%%%%%%%J%jj%%%%%%%%J%j%%%%%j%J%%%%%%%%%%%%%%%%%%%%%%%%%%%j%J%
3991G4%%j%%%%J%%%%%%%%%%j%%%%%jJ%%%%%%JjJ%%%%%%%%%%j%%%J%%j%jJJ%%%%%%%%%%%%j
3984G3%%%%%JJ%%%%%j%%%%j%%%%%%%%%%%J%%%%%%J%%%%%j%j%%%%%%J%%%%%%j%%%%%%%%%%%
3977G3%%%%%%%%%%%%%%%J%%j%%%J%%%Jj%%%%%%%j%%%%J%%%%%j%%%%J%%%%%%jj%%J%%%%%%%
3969G3%J%jJ%%%%%%%%%%%%%%%%j%%%%%%%J%%Jj%%%%J%%%%%%j%j%%jJ%J%%%%%%%jJ%%%%%%%
$$ plain form
3962 74 74 74 74 74 74 74 74 73 73 72 73 73 74 74 74 74 74 73 72 73 73 74 74 73 73 73 73 73 74 74 73 73 73 73 73 73 73 73 73 73 72 72 72 72 73 73 73 73 73 73 73 73 73 74 74 73 73 73 74 74 74 74 74 74 74 74 74 73 73 73
3954 73 73 73 73 73 73 73 74 74 74 74 74 74 75 75 74 74 74 73 73 73 72 73 73 73 73 73 74 74 74 74 74 74 74 74 74 74 73 74 74 74 74 74 74 74 74 73 73 73 73 73 73 73 73 73 73 74 74 74 73 73 74 73 73 72 72 72 73 73 74 74
3947 74 73 73 73 73 72 73 73 73 73 73 73 73 73 73 73 73 74 74 75 74 74 74 74 74 74 74 74 74 74 74 74 74 74 74 75 74 74 74 74 74 74 74 74 74 74 73 73 73 73 72 72 72 73 74 74 74 74 74 74 73 73 73 73 73 73 73 74 74 74 73
3939 73 73 73 73 74 74 74 74 74 74 73 73 73 73 73 74 74 74 74 73 73 73 73 74 74 75 75 75 75 74 74 74 74 74 73 73 73 73 73 73 74 74 73 73 73 74 73 73 73 73 73 73 73 73 73 73 73 74 74 75 75 74 74 74 74 74 74 74 74 74 74
3932 74 73 73 73 74 74 74 73 73 73 72 72 73 73 73 74 73 73 73 73 73 73 74 74 74 73 72 72 72 73 74 74 74 73 73 73 73 73 73 73 73 73 74 74 74 74 74 73 72 72 73 73 74 74 74 74 73 73 73 73 73 73 73 72 73 73 73 73 73 73 73
3925 73 73 74 74 74 74 74 74 74 74 73 73 74 74 74 74 74 74 73 74 74 74 74 74 73 73 73 72 72 73 73 74 74 75 75 75 74 74 73 73 73 73 73 73 73 73 73 73 73 74 74 74 73 73 73 73 73 74 73 73 73 73 73 73 74 74 74 73 73 73 73
3917 73 73 73 73 73 73 73 73 73 73 73 73 73 73 73 73 73 73 73 73 73 73 73 73 73 73 74 74 74 74 74 74 74 73 73 73 74 74 74 75 75 74 74 74 74 73 73 73 73 73 73 73 73 73 73 74 74 75 74 74 73 73 73 73 73 73 74 74 74 73 73
3910 73 73 73 74 74 73 73 73 73 74 74 74 74 74 74 74 74 74 74 73 74 74 74 74 74 74 74 74 74 73 73 73 73 73 73 73 73 73 73 73 73 73 73 73 73 73 73 73 73 74 74 74 74 73 73 73 73 73 73 73 73 73 73 74 74 74 75 75 75 74 74
$$ packed form
3962G4%%%%%%%j%jJ%J%%%%jjJ%J%j%%%%J%j%%%%%%%%%j%%%J%%%%%%%%J%j%%J%%%%%%%%j%%
3954G3%%%%%%J%%%%%J%j%%j%%jJ%%%%J%%%%%%%%%jJ%%%%%%%j%%%%%%%%%J%%j%Jj%j%%J%J%
3947G4j%%%jJ%%%%%%%%%%J%Jj%%%%%%%%%%%%%%Jj%%%%%%%%%j%%%j%%JJ%%%%%j%%%%%%J%%j
3939G3%%%J%%%%%j%%%%J%%%j%%%J%J%%%j%%%%j%%%%%J%j%%Jj%%%%%%%%%%J%J%j%%%%%%%%%
3932G4j%%J%%j%%j%J%%Jj%%%%%J%%jj%%JJ%%j%%%%%%%%J%%%%jj%J%J%%%j%%%%%%jJ%%%%%%
3925G3%J%%%%%%%j%J%%%%%jJ%%%%j%%j%J%J%J%%j%j%%%%%%%%%%J%%j%%%%Jj%%%%%J%%j%%%
3917G3%%%%%%%%%%%%%%%%%%%%%%%%%J%%%%%%j%%J%%J%j%%%j%%%%%%%%%J%Jj%j%%%%%J%%j%
3910G3%%J%j%%%J%%%%%%%%%jJ%%%%%%%%j%%%%%%%%%%%%%%%%%%%J%%%j%%%%%%%%%J%%J%%j%
$$ plain form
3902 74 74 74 74 74 74 74 73 73 73 73 74 74 74 74 73 73 73 73 73 73 74 74 73 73 73 73 73 73 73 73 73 73 73 74 74 74 73 73 74 75 75 74 75 75 74 74 74 74 73 73 74 74 74 74 74 74 74 74 74 73 73 73 73 73 73 73 74 74 74 74
3895 74 74 74 74 74 74 74 75 74 74 74 74 75 75 75 75 74 74 73 73 73 73 73 73 73 74 74 74 74 74 74 74 74 74 74 73 73 73 73 74 74 74 73 73 73 73 73 72 72 72 72 73 73 73 73 73 73 73 74 74 74 74 74 73 73 73 73 72 72 72 72
3887 72 72 72 73 73 73 73 73 73 73 73 73 73 73 73 73 73 73 72 72 72 73 73 74 74 74 74 74 73 73 73 73 73 74 74 74 74 74 74 74 74 74 74 74 74 74 74 74 73 73 73 73 74 74 74 74 74 74 73 73 73 73 73 73 73 73 74 74 74 74 73
3880 73 73 73 73 73 73 73 73 73 74 74 73 73 73 74 74 75 74 73 73 73 73 73 73 73 73 73 73 73 73 73 73 73 73 74 73 73 73 73 73 73 73 72 72 72 72 72 72 73 73 72 72 72 72 72 72 72 73 73 73 73 73 72 72 72 72 72 73 73 73 73
3873 73 73 72 72 72 72 72 72 72 72 72 72 72 72 72 73 73 73 73 73 73 73 73 73 73 73 72 72 73 73 73 73 73 73 73 73 73 73 73 73 73 73 72 72 73 73 74 74 73 73 73 73 73 73 72 72 72 73 73 72 72 72 72 72 72 72 73 73 74 74 74
3865 74 74 73 73 73 73 73 74 74 75 74 74 73 73 73 72 72 73 73 73 73 73 73 73 73 73 73 73 73 73 73 73 73 73 73 73 73 73 73 73 73 74 73 73 73 73 73 73 73 73 72 72 73 73 73 73 73 73 73 73 73 73 73 73 73 72 72 72 72 73 73
3858 73 73 73 74 74 75 75 74 74 74 73 73 73 73 73 73 73 73 73 73 73 73 73 73 72 72 72 72 72 73 73 73 73 73 73 73 73 73 73 73 74 74 74 74 74 74 74 74 74 74 74 74 74 74 74 73 73 73 73 73 73 74 73 73 72 73 73 73 74 74 74
3850 74 74 74 74 74 74 74 74 74 73 73 73 74 74 74 74 74 74 74 74 74 74 74 74 74 74 74 74 73 73 73 73 72 72 72 72 72 73 73 73 73 74 74 74 73 73 72 72 72 72 72 72 72 72 72 72 72 72 72 72 72 73 73 73 73 74 74 74 73 73 73
$$ packed form
3902G4%%%%%%j%%%J%%%j%%%%%J%j%%%%%%%%%%J%%j%JJ%jJ%j%%%j%J%%%%%%%%j%%%%%%J%%%
3895G4%%%%%%Jj%%%J%%%j%j%%%%%%J%%%%%%%%%j%%%J%%j%%%%j%%%J%%%%%%J%%%%j%%%j%%%
3887G2%%J%%%%%%%%%%%%%%j%%J%J%%%%j%%%%J%%%%%%%%%%%%%%j%%%J%%%%%j%%%%%%%J%%%j
3880G3%%%%%%%%J%j%%J%Jjj%%%%%%%%%%%%%%%Jj%%%%%%j%%%%%J%j%%%%%%J%%%%j%%%%J%%%
3873G3%j%%%%%%%%%%%%J%%%%%%%%%%j%J%%%%%%%%%%%%%j%J%J%j%%%%%j%%J%j%%%%%%J%J%%
3865G4%j%%%%J%Jj%j%%j%J%%%%%%%%%%%%%%%%%%%%%%%Jj%%%%%%%j%J%%%%%%%%%%%%j%%%J%
3858G3%%J%J%j%%j%%%%%%%%%%%%%j%%%%J%%%%%%%%%%J%%%%%%%%%%%%%%j%%%%%Jj%jJ%%J%%
3850G4%%%%%%%%j%%J%%%%%%%%%%%%%%%j%%%j%%%%J%%%J%%j%j%%%%%%%%%%%%%%J%%%J%%j%%
$$ plain form
3843 73 73 73 73 74 74 75 75 75 74 74 74 74 73 73 73 73 73 73 72 72 71 72 72 73 73 73 73 73 73 73 73 73 73 73 73 73 73 73 73 73 73 73 73 73 72 72 73 73 73 73 73 73 73 73 73 73 73 73 74 74 74 73 73 73 73 73 74 74 74 74
3836 74 75 74 74 74 74 74 74 74 74 73 73 73 74 73 73 72 72 72 73 73 73 73 73 73 73 72 72 72 72 72 73 73 74 73 73 74 74 73 73 72 72 72 72 72 71 71 72 72 72 72 72 73 73 73 73 73 73 73 72 72 72 72 72 72 72 73 73 73 73 72
3828 72 73 73 72 72 72 73 73 73 73 73 73 73 73 73 73 72 72 72 72 72 73 73 74 74 74 74 74 73 73 73 73 73 73 73 73 73 73 73 73 73 73 73 74 74 74 74 73 73 72 72 71 71 72 73 73 73 73 73 73 72 72 73 72 72 72 72 72 72 72 72
3821 72 71 72 72 72 72 72 71 72 72 73 73 73 73 73 73 73 72 73 73 73 74 74 74 73 73 73 73 73 73 73 74 74 74 74 74 73 73 73 73 73 73 73 73 73 73 73 73 73 73 73 73 73 74 74 74 74 73 73 73 73 73 73 73 73 73 73 72 73 73 72
3813 72 72 73 73 73 73 73 74 74 74 73 73 72 72 72 72 72 73 72 72 72 72 72 72 73 73 74 74 74 73 73 73 73 73 73 72 72 73 73 74 73 73 73 73 73 73 73 72 72 72 72 72 73 73 73 73 73 73 73 73 73 74 74 73 73 73 73 73 72 72 72
3806 72 72 73 73 73 73 74 74 74 73 73 73 73 73 73 74 73 74 74 74 74 74 74 74 74 73 73 73 73 74 74 73 73 73 73 72 72 73 73 73 73 73 72 72 73 73 73 74 74 74 74 74 73 72 72 72 72 73 73 74 74 74 73 73 73 73 73 73 73 73 74
3798 74 74 74 73 73 73 73 74 74 74 74 74 73 74 73 73 73 73 73 73 73 72 73 72 72 72 72 73 73 73 74 73 73 74 74 74 74 74 74 74 74 74 74 74 74 74 74 73 73 73 73 73 73 73 73 73 73 73 72 72 72 72 72 72 72 72 73 73 73 73 73
3791 73 73 73 73 73 73 72 72 71 71 71 72 72 73 73 73 73 73 73 73 73 73 73 73 73 74 74 73 73 72 72 72 72 73 73 73 73 73 73 73 73 73 72 72 72 73 73 73 73 73 72 72 73 73 73 74 74 73 73 73 73 73 73 73 73 73 73 73 73 73 73
$$ packed form
3843G3%%%J%J%%j%%%j%%%%%j%jJ%J%%%%%%%%%%%%%%%%%%%%j%J%%%%%%%%%%%J%%j%%%%J%%%
3836G4Jj%%%%%%%j%%Jj%j%%J%%%%%%j%%%%J%Jj%J%j%j%%%%j%J%%%%J%%%%%%j%%%%%%J%%%j
3828G2J%j%%J%%%%%%%%%j%%%%J%J%%%%j%%%%%%%%%%%%%%J%%%j%j%j%JJ%%%%%j%Jj%%%%%%%
3821G2jJ%%%%jJ%J%%%%%%jJ%%J%%j%%%%%%J%%%%j%%%%%%%%%%%%%%%%J%%%j%%%%%%%%%jJ%j
3813G2%J%%%%J%%j%j%%%%Jj%%%%%J%J%%j%%%%%j%J%Jj%%%%%%j%%%%J%%%%%%%%J%j%%%%j%%
3806G2%J%%%J%%j%%%%%JjJ%%%%%%%j%%%J%j%%%j%J%%%%j%J%%J%%%%jj%%%J%J%%j%%%%%%%J
3798G4%%j%%%J%%%%jJj%%%%%%jJj%%%J%%Jj%J%%%%%%%%%%%%%j%%%%%%%%%%j%%%%%%%J%%%%
3791G3%%%%%j%j%%J%J%%%%%%%%%%%J%j%j%%%J%%%%%%%%j%%J%%%%j%J%%J%j%%%%%%%%%%%%%
$$ plain form
3784 73 73 73 73 73 73 73 73 73 72 72 72 73 73 73 73 73 73 72 73 73 72 73 73 74 74 74 73 73 73 73 73 72 72 71 72 72 73 73 73 73 73 73 73 73 73 73 73 73 73 72 72 72 72 72 72 72 72 72 73 72 72 72 72 71 71 71 71 72 72 72
3776 72 72 72 73 73 73 73 73 73 72 73 73 73 73 73 73 73 73 73 74 73 73 73 73 73 74 74 74 74 74 74 74 73 74 74 74 73 73 73 73 73 73 73 73 73 72 72 72 73 73 73 72 73 73 73 73 72 73 73 73 73 73 73 72 72 72 72 72 72 72 72
3769 72 72 72 72 72 73 73 73 73 73 73 73 72 72 72 72 72 72 72 72 72 72 72 72 72 72 72 72 72 72 73 73 73 73 73 73 73 73 73 72 72 72 72 73 73 73 73 74 73 72 72 72 72 73 73 72 72 73 73 73 73 73 73 73 73 73 72 72 71 71 72
3761 72 72 72 72 73 72 73 73 73 73 73 73 73 73 72 72 72 72 72 72 73 73 73 73 73 73 73 73 73 73 73 73 73 73 73 73 72 72 72 72 72 72 72 72 73 73 73 73 73 72 72 72 72 72 71 71 72 72 72 72 73 73 73 73 73 73 73 73 72 72 72
3754 72 73 72 72 72 72 72 72 72 72 72 72 72 73 72 72 71 71 71 71 71 71 72 72 73 72 72 73 72 72 73 73 73 72 72 73 73 73 73 73 73 73 72 72 72 72 73 73 72 72 72 72 72 72 72 72 72 72 72 73 73 73 73 73 73 73 73 73 73 72 73
3747 73 73 73 73 72 72 72 71 71 72 73 73 73 72 72 71 71 71 72 72 72 72 72 73 73 73 72 72 72 72 72 72 72 72 72 72 71 72 72 72 72 72 73 73 72 72 71 72 73 72 72 72 71 71 71 71 71 71 71 71 71 72 72 72 72 72 72 72 72 72 73
3739 73 73 72 72 72 72 72 73 73 72 72 72 72 72 72 72 73 73 73 72 72 72 72 73 73 73 73 73 73 72 72 72 73 72 72 72 72 73 73 73 73 73 72 72 72 72 72 72 73 73 73 73 72 72 72 72 72 73 73 73 73 73 73 74 74 74 74 73 72 72 73
3732 73 73 73 73 73 73 72 72 72 72 73 73 73 72 72 73 73 72 71 72 72 72 72 72 72 73 72 72 73 73 73 74 74 74 74 74 74 73 73 73 73 73 73 73 74 74 74 74 74 74 73 73 73 73 73 73 72 72 72 72 73 73 73 73 73 73 73 73 72 72 72
$$ packed form
3784G3%%%%%%%%j%%J%%%%%jJ%jJ%J%%j%%%%j%jJ%J%%%%%%%%%%%%j%%%%%%%%Jj%%%j%%%J%%
3776G2%%J%%%%%jJ%%%%%%%%Jj%%%%J%%%%%%jJ%%j%%%%%%%%j%%J%%jJ%%%jJ%%%%%j%%%%%%%
3769G2%%%%J%%%%%%j%%%%%%%%%%%%%%%%%J%%%%%%%%j%%%J%%%Jjj%%%J%j%J%%%%%%%%j%j%J
3761G2%%%JjJ%%%%%%%j%%%%%J%%%%%%%%%%%%%%%j%%%%%%%J%%%%j%%%%j%J%%%J%%%%%%%j%%
3754G2Jj%%%%%%%%%%Jj%j%%%%%J%Jj%Jj%J%%j%J%%%%%%j%%%J%j%%%%%%%%%%J%%%%%%%%%jJ
3747G3%%%j%%j%JJ%%j%j%%J%%%%J%%j%%%%%%%%%jJ%%%%J%j%jJJj%%j%%%%%%%%J%%%%%%%%J
3739G3%j%%%%J%j%%%%%%J%%j%%%J%%%%%j%%Jj%%%J%%%%j%%%%%J%%%j%%%%J%%%%%J%%%jj%J
3732G3%%%%%j%%%J%%j%J%jjJ%%%%%Jj%J%%J%%%%%j%%%%%%J%%%%%j%%%%%j%%%J%%%%%%%j%%
$$ plain form
3724 72 72 72 72 72 72 73 73 73 72 72 72 72 72 72 72 71 71 71 72 72 72 72 72 72 71 71 71 71 71 71 71 72 73 73 73 73 72 72 72 73 73 73 74 74 74 73 73 73 72 72 72 72 72 72 73 73 73 72 72 71 71 72 72 72 72 72 73 73 72 72
3717 72 72 72 72 73 73 73 73 73 73 73 74 74 74 74 74 73 73 73 72 72 72 72 72 72 72 72 72 72 71 71 72 72 72 72 72 72 72 72 72 72 72 72 72 73 73 73 73 73 73 73 72 72 72 72 72 72 72 73 73 73 74 74 74 74 73 73 72 72 71 72
3709 72 72 73 73 73 73 73 73 73 72 73 73 73 73 73 73 73 73 74 74 74 74 74 75 75 75 75 76 76 77 78 80 82 83 85 88 90 91 91 90 87 84 82 80 79 77 77 77 76 75 74 74 74 74 74 73 73 73 73 73 73 73 73 73 73 73 73 73 73 73 73
3702 73 73 73 73 73 73 73 72 73 73 73 73 73 72 72 72 72 71 72 72 73 73 72 72 71 71 71 71 71 72 72 73 72 72 72 71 72 72 73 73 73 73 73 73 73 73 73 73 73 74 73 73 73 73 73 73 73 73 73 73 73 73 73 73 73 73 73 73 73 72 72
3695 72 73 72 72 73 73 73 72 73 73 73 73 73 73 72 72 72 72 72 71 72 72 72 72 73 73 73 73 73 72 72 72 72 71 72 72 73 73 73 72 72 71 71 72 72 72 72 72 72 72 72 72 72 72 73 73 73 73 73 72 72 72 72 72 71 71 71 72 72 72 72
3687 72 72 73 73 73 72 72 73 73 73 73 72 72 72 72 72 72 72 72 73 73 73 73 73 72 72 72 72 72 72 72 72 72 71 72 73 73 74 73 73 73 73 73 73 72 72 72 72 72 72 71 72 72 72 72 73 73 73 74 74 74 74 73 73 73 73 73 73 73 72 72
3680 72 72 72 72 72 72 72 72 72 72 72 72 72 72 73 73 73 73 73 73 72 72 72 72 72 72 72 72 72 72 72 72 73 73 73 73 73 73 73 72 72 72 72 72 72 72 72 72 72 72 72 72 72 72 72 72 73 73 73 72 72 72 72 72 72 72 72 72 73 73 73
3672 73 73 72 72 72 72 72 72 72 72 72 71 71 71 72 72 72 72 72 72 72 72 71 71 71 72 73 73 73 72 72 71 71 71 71 72 72 72 73 73 73 73 73 73 72 72 72 71 71 72 72 72 72 72 72 73 73 73 73 73 73 73 73 73 73 72 72 72 72 72 73
$$ packed form
3724G2%%%%%J%%j%%%%%%j%%J%%%%%j%%%%%%JJ%%%j%%J%%J%%j%%j%%%%%J%%j%j%J%%%%J%j%
3717G2%%%J%%%%%%J%%%%j%%j%%%%%%%%%j%J%%%%%%%%%%%%J%%%%%%j%%%%%%J%%J%%%j%j%jJ
3709G2%J%%%%%%jJ%%%%%%%J%%%%J%%%J%JJKKJKLKJ%jllkkjk%%jjj%%%%j%%%%%%%%%%%%%%%
3702G3%%%%%%jJ%%%%j%%%jJ%J%j%j%%%%J%Jj%%jJ%J%%%%%%%%%%Jj%%%%%%%%%%%%%%%%%%j%
3695G2Jj%J%%jJ%%%%%j%%%%jJ%%%J%%%%j%%%jJ%J%%j%j%J%%%%%%%%%%J%%%%j%%%%j%%J%%%
3687G2%J%%j%J%%%j%%%%%%%J%%%%j%%%%%%%%jJJ%Jj%%%%%j%%%%%jJ%%%J%%J%%%j%%%%%%j%
3680G2%%%%%%%%%%%%%J%%%%%j%%%%%%%%%%%J%%%%%%j%%%%%%%%%%%%%%%%J%%j%%%%%%%%J%%
3672G3%j%%%%%%%%j%%J%%%%%%%j%%JJ%%j%j%%%J%%J%%%%%j%%j%J%%%%%J%%%%%%%%%j%%%%J
$$ plain form
3665 73 73 73 73 73 73 73 73 73 73 73 74 73 73 73 73 73 73 73 73 72 72 73 72 72 73 73 72 72 72 72 72 72 72 71 71 71 72 72 72 72 72 72 72 72 72 72 72 73 73 73 72 71 72 72 72 72 72 72 72 72 72 72 72 72 71 71 71 71 71 71
3658 71 71 72 72 72 71 72 73 73 73 72 72 72 73 72 72 72 72 72 72 72 72 72 72 72 72 72 72 73 73 73 73 73 72 72 72 72 72 73 72 72 71 71 71 71 71 72 72 72 72 72 72 72 71 71 71 71 71 72 72 72 72 72 72 73 73 73 73 72 71 71
3650 71 71 71 71 72 72 72 72 72 72 72 72 72 72 72 72 72 72 72 72 72 72 72 72 73 73 72 72 72 72 72 72 72 71 72 72 72 72 72 72 73 74 74 73 73 73 72 72 71 71 71 71 72 72 72 72 71 71 71 71 71 71 71 71 71 71 71 72 72 72 72
3643 72 72 72 72 72 71 71 71 71 71 71 71 71 71 71 71 71 71 71 71 71 71 71 71 72 73 73 72 72 72 73 73 73 73 73 72 72 72 72 73 72 72 72 72 72 72 72 73 73 73 73 73 73 73 73 73 72 72 72 71 71 71 71 71 71 71 71 71 71 72 73
3635 73 73 73 73 73 73 73 73 72 72 72 72 72 72 72 71 71 71 71 72 72 72 72 72 72 71 71 72 72 72 72 73 73 73 73 72 72 72 72 72 72 72 72 72 72 73 72 72 72 72 72 72 72 72 72 72 72 72 72 72 72 72 72 72 71 71 71 72 72 72 72
3628 72 72 72 72 72 72 71 71 71 71 71 71 70 70 71 71 71 71 71 72 72 72 72 72 72 72 72 72 72 72 72 72 72 72 72 72 72 72 72 71 71 71 71 71 71 71 71 72 72 71 71 71 71 72 72 72 72 72 71 71 71 71 71 71 71 71 71 71 71 71 71
3620 71 71 71 71 71 72 72 72 72 72 72 72 72 72 71 71 71 71 71 71 71 71 71 71 71 71 71 71 71 71 72 72 72 72 72 72 72 72 72 72 72 72 72 72 71 71 72 72 72 73 73 73 72 71 72 73 73 72 72 72 72 72 72 72 72 72 73 73 73 73 73
3613 73 72 72 72 72 72 72 72 71 71 71 71 71 72 72 72 72 72 72 71 72 72 72 72 72 72 72 72 72 72 72 72 72 72 72 72 72 72 72 72 72 72 72 72 71 71 71 71 71 71 71 72 71 71 72 71 71 72 72 72 72 72 72 72 72 72 72 72 72 72 73
$$ packed form
3665G3%%%%%%%%%%Jj%%%%%%%j%Jj%J%j%%%%%%j%%J%%%%%%%%%%J%%jjJ%%%%%%%%%%%j%%%%%
3658G1%J%%jJJ%%j%%Jj%%%%%%%%%%%%%J%%%%j%%%%Jj%j%%%%J%%%%%%j%%%%J%%%%%J%%%jj%
3650G1%%%J%%%%%%%%%%%%%%%%%%%J%j%%%%%%jJ%%%%%JJ%j%%j%j%%%J%%%j%%%%%%%%%%J%%%
3643G2%%%%j%%%%%%%%%%%%%%%%%%JJ%j%%J%%%%j%%%Jj%%%%%%J%%%%%%%%j%%j%%%%%%%%%JJ
3635G3%%%%%%%j%%%%%%j%%%J%%%%%j%J%%%J%%%j%%%%%%%%%Jj%%%%%%%%%%%%%%%%%j%%J%%%
3628G2%%%%%j%%%%%j%J%%%%J%%%%%%%%%%%%%%%%%%%j%%%%%%%J%j%%%J%%%%j%%%%%%%%%%%%
3620G1%%%%J%%%%%%%%j%%%%%%%%%%%%%%%J%%%%%%%%%%%%%j%J%%J%%jjJJ%j%%%%%%%%J%%%%
3613G3j%%%%%%j%%%%J%%%%%jJ%%%%%%%%%%%%%%%%%%%%%%%j%%%%%%Jj%Jj%J%%%%%%%%%%%%J
$$ plain form
3606 73 73 72 72 72 72 72 72 71 71 72 72 72 72 72 72 72 72 72 72 72 72 72 72 72 72 72 72 71 71 71 72 72 72 72 72 72 72 72 71 71 71 71 71 71 71 71 71 71 71 71 71 72 72 72 72 72 72 71 71 71 72 71 71 71 71 71 71 71 72 71
3598 71 71 71 72 71 71 71 71 71 71 71 71 72 72 72 72 71 71 72 72 72 72 72 72 72 72 72 72 72 72 72 72 72 73 72 72 72 73 73 73 73 73 73 73 72 73 73 73 73 73 72 72 71 71 71 71 71 72 72 72 72 72 72 73 73 72 72 72 72 72 72
3591 72 73 73 73 73 72 72 72 72 72 71 71 71 71 71 70 71 71 72 72 72 72 72 72 72 72 72 72 72 72 72 72 72 72 72 72 72 73 72 72 72 72 72 72 72 72 72 73 72 72 72 72 72 72 72 72 72 72 72 72 72 72 72 72 72 71 71 71 71 71 71
3583 71 71 72 72 72 72 72 72 72 72 72 72 72 71 72 72 72 73 73 72 72 72 72 72 72 72 72 72 72 72 71 71 71 71 71 71 71 71 71 71 71 71 71 71 71 72 72 72 72 71 71 72 72 72 71 71 71 71 71 71 71 71 72 72 72 72 72 72 72 73 73
3576 73 73 72 72 72 71 71 71 71 71 72 72 72 72 72 72 71 71 71 71 71 71 71 71 71 71 70 70 70 70 70 70 71 72 72 72 72 72 73 73 72 72 72 71 71 71 71 71 72 71 71 71 71 71 71 71 71 72 72 72 71 71 71 71 72 72 72 72 72 71 71
3569 71 71 71 71 71 70 71 71 72 72 72 71 71 71 71 71 71 71 72 72 72 71 71 71 71 71 72 72 72 72 72 73 72 72 72 71 72 72 71 72 72 72 72 72 72 72 71 71 71 71 71 71 71 71 71 72 72 73 72 72 72 72 72 72 72 72 71 71 71 71 72
3561 72 72 73 72 73 73 72 71 71 70 71 71 71 71 71 71 71 71 72 72 72 72 72 72 72 72 72 72 72 72 72 72 71 71 72 71 72 72 72 73 73 73 72 71 72 72 72 72 72 72 72 72 72 72 72 72 72 72 72 72 73 73 73 72 72 72 73 73 73 72 73
3554 73 73 73 74 74 74 74 74 74 75 75 75 75 75 75 76 76 76 77 77 77 77 77 77 77 77 76 75 74 74 73 73 73 72 72 72 72 72 72 71 72 72 72 72 73 73 73 73 72 72 72 72 71 71 71 72 71 71 71 72 72 72 72 71 72 72 71 71 70 71 70
$$ packed form
3606G3%j%%%%%j%J%%%%%%%%%%%%%%%%%j%%J%%%%%%%j%%%%%%%%%%%%J%%%%%j%%Jj%%%%%%Jj
3598G1%%Jj%%%%%%%J%%%j%J%%%%%%%%%%%%%%Jj%%J%%%%%%jJ%%%%j%j%%%%J%%%%%J%j%%%%%
3591G2J%%%j%%%%j%%%%jJ%J%%%%%%%%%%%%%%%%%%Jj%%%%%%%%Jj%%%%%%%%%%%%%%%%j%%%%%
3583G1%J%%%%%%%%%%jJ%%J%j%%%%%%%%%%j%%%%%%%%%%%%%%J%%%j%J%%j%%%%%%%J%%%%%%J%
3576G3%j%%j%%%%J%%%%%j%%%%%%%%%j%%%%%JJ%%%%J%j%%j%%%%Jj%%%%%%%J%%j%%%J%%%%j%
3569G1%%%%jJ%J%%j%%%%%%J%%j%%%%J%%%%Jj%%jJ%jJ%%%%%%j%%%%%%%%J%Jj%%%%%%%j%%%J
3561G2%JjJ%jj%jJ%%%%%%%J%%%%%%%%%%%%%j%JjJ%%J%%jjJ%%%%%%%%%%%%%%%J%%j%%J%%jJ
3554G3%%J%%%%%J%%%%%J%%J%%%%%%%jjj%j%%j%%%%%jJ%%%J%%%j%%%j%%Jj%%J%%%jJ%j%jJj
$$ plain form
3546 70 70 71 71 71 71 71 71 72 72 72 73 73 73 73 72 72 72 72 72 72 71 71 71 72 72 72 72 72 72 72 72 71 72 72 72 72 71 71 71 72 72 72 72 72 72 73 73 73 72 72 72 73 73 73 72 72 72 72 72 72 72 72 71 71 72 73 73 73 73 72
3539 72 72 72 72 71 71 71 71 72 72 72 72 72 72 71 71 71 70 70 70 71 71 71 71 71 71 71 72 72 72 72 71 71 71 72 72 72 71 72 72 72 72 72 72 72 72 72 72 72 71 71 71 70 70 71 71 71 71 71 71 71 71 71 71 72 72 72 72 72 73 73
3531 73 73 73 72 72 71 71 71 71 71 71 72 72 72 72 72 72 71 71 71 71 71 72 72 72 72 71 71 72 72 72 72 72 72 72 71 71 71 71 71 71 71 72 72 72 72 72 72 72 72 72 72 71 71 71 72 72 71 72 72 73 72 72 72 72 72 72 72 72 72 72
3524 72 72 71 72 72 71 71 71 72 72 72 72 72 71 71 71 71 71 71 71 71 71 71 71 72 72 72 73 73 73 73 72 72 72 72 71 71 71 70 70 70 70 71 71 71 72 72 72 72 72 72 72 72 72 72 72 72 71 71 71 71 71 71 71 72 72 72 72 71 72 72
3517 72 72 72 72 72 72 72 73 72 72 72 72 72 71 71 71 70 70 70 70 71 71 71 71 71 71 71 71 71 71 71 71 72 72 72 71 71 71 71 72 72 72 71 71 72 72 72 72 72 72 72 72 71 71 71 71 72 72 72 72 72 71 71 71 70 70 70 70 70 70 70
3509 70 70 71 71 71 71 71 71 71 71 71 71 71 71 71 71 71 71 71 71 71 71 71 71 70 70 70 70 71 71 72 72 71 71 71 72 71 71 71 70 70 71 71 71 71 71 71 71 71 72 71 70 71 71 71 71 72 72 72 72 72 71 72 72 72 72 72 72 72 72 71
3502 71 71 70 70 71 71 72 72 72 72 71 71 70 70 70 70 70 70 71 72 71 71 71 71 71 71 71 71 71 71 71 71 71 71 71 70 71 71 71 71 71 72 72 72 72 72 72 72 72 72 71 71 71 71 71 71 71 70 71 71 71 71 71 71 71 71 71 72 71 71 72
3494 72 72 72 72 72 72 72 72 73 72 72 72 72 72 72 72 72 72 72 72 72 71 71 71 71 71 71 71 71 71 71 71 71 71 71 71 71 71 71 71 71 72 72 72 72 72 72 72 72 72 72 72 72 72 72 72 72 72 71 71 72 73 72 72 73 73 73 73 73 72 72
$$ packed form
3546G0%J%%%%%J%%J%%%j%%%%%j%%J%%%%%%%jJ%%%j%%J%%%%%J%%j%%J%%j%%%%%%%j%JJ%%%j
3539G2%%%j%%%J%%%%%j%%j%%J%%%%%%J%%%j%%J%%jJ%%%%%%%%%%j%%j%J%%%%%%%%%J%%%%J%
3531G3%%j%j%%%%%J%%%%%j%%%%J%%%j%J%%%%%%j%%%%%%J%%%%%%%%%j%%J%jJ%Jj%%%%%%%%%
3524G2%jJ%j%%J%%%%j%%%%%%%%%%J%%J%%%j%%%j%%j%%%J%%J%%%%%%%%%%%j%%%%%%J%%%jJ%
3517G2%%%%%%Jj%%%%j%%j%%%J%%%%%%%%%%%J%%j%%%J%%j%J%%%%%%%j%%%J%%%%j%%j%%%%%%
3509G0%J%%%%%%%%%%%%%%%%%%%%%j%%%J%J%j%%Jj%%j%J%%%%%%%JjjJ%%%J%%%%jJ%%%%%%%j
3502G1%j%J%J%%%j%j%%%%%JJj%%%%%%%%%%%%%%jJ%%%%J%%%%%%%%j%%%%%%jJ%%%%%%%%Jj%J
3494G2%%%%%%%Jj%%%%%%%%%%%j%%%%%%%%%%%%%%%%%%%J%%%%%%%%%%%%%%%%j%JJj%J%%%%j%
$$ plain form
3487 72 72 72 72 73 72 72 72 72 72 72 71 71 71 71 71 71 71 71 71 71 72 72 71 71 71 71 71 71 71 71 71 71 71 72 72 72 73 73 73 73 73 73 73 72 72 72 72 71 71 71 71 71 71 70 70 70 71 71 71 71 71 72 73 73 73 72 72 72 71 71
3480 71 71 71 72 72 72 72 72 72 72 72 72 72 72 72 72 72 72 71 71 71 71 71 70 71 71 71 71 72 71 72 72 72 72 72 72 71 70 70 70 70 71 71 71 71 71 71 71 71 71 71 72 71 71 72 72 71 71 71 71 71 71 71 70 70 71 71 71 71 71 72
3472 72 71 71 71 71 71 71 71 71 70 70 70 71 71 71 71 71 70 71 71 71 72 72 72 72 72 71 71 71 70 71 71 71 71 71 71 71 71 71 71 70 70 70 70 70 70 70 70 71 71 71 70 71 71 70 70 70 70 71 71 71 71 71 71 71 71 72 71 71 71 70
3465 70 70 70 70 71 72 71 71 72 72 71 71 71 71 71 71 71 70 70 71 71 71 71 71 71 71 71 71 71 71 70 70 70 71 71 71 71 71 71 71 71 71 71 71 72 72 71 71 71 71 70 70 70 70 71 72 72 72 72 71 71 71 71 71 71 72 72 72 71 71 71
3457 71 70 70 70 71 71 72 72 71 71 71 71 71 71 71 71 71 70 70 70 71 71 71 70 71 71 71 71 71 71 71 71 71 71 71 71 71 71 72 72 71 71 71 71 71 71 71 71 71 71 71 71 71 71 71 71 70 70 70 70 70 70 70 71 71 71 72 72 71 72 72
3450 72 72 72 72 72 71 71 70 70 70 70 71 71 71 71 72 72 72 72 72 71 71 71 70 70 71 71 71 71 70 70 70 70 70 70 70 71 71 71 70 70 70 70 71 71 71 71 71 71 71 72 72 72 72 71 71 71 71 71 70 71 71 71 71 71 70 71 71 71 71 71
3442 71 71 70 70 71 71 71 71 71 71 71 70 70 70 70 70 71 71 71 70 70 70 70 70 70 70 70 70 71 71 71 71 71 71 70 71 71 71 71 71 70 70 70 70 70 70 70 71 71 72 71 71 72 72 72 72 72 72 72 72 71 71 71 71 71 71 71 71 71 71 71
3435 71 71 71 70 71 71 71 72 72 72 72 71 71 70 70 70 70 71 71 71 71 71 71 71 71 71 71 71 71 71 71 70 70 70 71 71 71 70 70 71 70 70 70 71 71 71 71 70 70 70 70 71 71 70 70 70 71 71 71 71 71 71 71 71 71 71 71 70 71 71 71
$$ packed form
3487G2%%%Jj%%%%%j%%%%%%%%%J%j%%%%%%%%%%J%%J%%%%%%j%%%j%%%%%j%%J%%%%JJ%%j%%j%
3480G1%%J%%%%%%%%%%%%%%j%%%%jJ%%%JjJ%%%%%jj%%%J%%%%%%%%%Jj%J%j%%%%%%j%J%%%%J
3472G2j%%%%%%%j%%J%%%%jJ%%J%%%%j%%jJ%%%%%%%%%j%%%%%%%J%%jJ%j%%%J%%%%%%%Jj%%j
3465G0%%%JJj%J%j%%%%%%j%J%%%%%%%%%%j%%J%%%%%%%%%%J%j%%%j%%%JJ%%%j%%%%%J%%j%%
3457G1j%%J%J%j%%%%%%%%j%%J%%jJ%%%%%%%%%%%%%J%j%%%%%%%%%%%%%%%j%%%%%%J%%J%jJ%
3450G2%%%%j%j%%%J%%%J%%%%j%%j%J%%%j%%%%%%J%%j%%%J%%%%%%J%%%j%%%%jJ%%%%jJ%%%%
3442G1%j%J%%%%%%j%%%%J%%j%%%%%%%%J%%%%%jJ%%%%j%%%%%%J%Jj%J%%%%%%%j%%%%%%%%%%
3435G1%%jJ%%J%%%j%j%%%J%%%%%%%%%%%%%j%%J%%j%Jj%%J%%%j%%%J%j%%J%%%%%%%%%%jJ%%
$$ plain form
3428 71 71 71 71 71 71 71 71 71 71 71 71 71 71 71 71 71 71 71 71 71 71 71 71 72 71 71 71 70 70 70 70 70 71 70 70 70 71 70 70 70 70 70 71 71 71 71 71 71 71 71 71 71 71 72 72 72 72 71 71 71 71 72 71 72 72 71 71 71 71 71
3420 71 71 71 71 71 71 71 70 70 70 70 70 70 70 71 72 71 71 71 71 72 71 71 71 71 71 71 71 71 71 71 71 71 70 70 70 71 71 71 71 71 71 71 71 71 71 71 71 71 71 72 72 71 71 71 71 70 71 71 71 70 70 70 70 69 69 69 69 70 70 71
3413 71 71 71 71 71 71 71 71 71 71 71 71 71 72 72 71 71 71 71 71 70 70 70 71 71 71 71 71 71 71 72 72 72 72 72 72 72 71 71 71 71 71 71 71 72 72 72 72 72 72 72 72 71 71 71 71 70 70 70 70 70 70 70 71 71 71 70 70 70 69 70
3405 70 71 71 71 71 72 71 71 71 72 72 72 72 72 71 71 71 71 71 70 70 70 70 70 70 70 70 70 70 70 70 70 70 70 70 70 71 72 72 72 72 72 71 71 71 71 70 70 70 70 70 70 69 69 70 70 70 70 70 70 70 71 71 71 70 71 71 71 71 71 71
3398 71 71 71 70 70 70 71 72 72 71 71 72 71 71 71 71 71 71 72 72 72 72 72 72 72 71 71 71 72 73 72 71 71 71 71 70 70 71 71 71 71 71 71 71 70 70 70 70 70 70 70 71 72 72 72 72 72 72 72 71 71 71 71 71 71 71 71 71 71 72 71
3391 71 71 71 71 71 71 71 71 70 71 71 70 71 71 71 71 71 71 71 72 72 71 72 72 72 71 71 71 71 71 71 71 71 71 71 71 71 71 70 70 70 70 70 70 70 70 70 70 70 70 71 71 71 71 71 71 71 71 71 71 71 71 71 71 72 72 72 72 72 72 71
$$ packed form
3428G1%%%%%%%%%%%%%%%%%%%%%%%Jj%%j%%%%Jj%%Jj%%%%J%%%%%%%%%%J%%%j%%%JjJ%j%%%%
3420G1%%%%%%j%%%%%%JJj%%%Jj%%%%%%%%%%%j%%J%%%%%%%%%%%%%J%j%%%jJ%%j%%%j%%%J%J
3413G1%%%%%%%%%%%%J%j%%%%j%%J%%%%%%J%%%%%%j%%%%%%J%%%%%%%j%%%j%%%%%%J%%j%%jJ
3405G0J%%%Jj%%J%%%%j%%%%j%%%%%%%%%%%%%%%%JJ%%%%j%%%j%%%%%j%J%%%%%%J%%jJ%%%%%
3398G1%%j%%JJ%j%Jj%%%%%J%%%%%%j%%JJjj%%%j%J%%%%%%j%%%%%%JJ%%%%%%j%%%%%%%%%Jj
3391G1%%%%%%%jJ%jJ%%%%%%J%jJ%%j%%%%%%%%%%%%j%%%%%%%%%%%J%%%%%%%%%%%%%J%%%%%j
$$ [...]
-2638E7
##END=		$$ NMR SPECTRUM
##END=		$$ LINK
