##TITLE=	RP346 char.10.fid
##JCAMP-DX=	6.0	$$ MestReNova 14.3.3-33362
##DATA TYPE=	LINK
##BLOCKS=	1    
##ORIGIN=	Mestrelab Research S.L.
##OWNER=	hrzepa
##$MNOVA/METADATA=	(DOCUMENT,BASE64)
eyJuYW1lIjoiRG9jdW1lbnQgMSIsInBhZ2VzIjpbeyJpdGVtcyI6WyIxIiAgICAgXX1dfQ==
##TITLE=	RP346 char.10.fid
##JCAMP-DX=	6.0	$$ MestReNova 14.3.3-33362
##DATA TYPE=	NMR SPECTRUM
##DATA CLASS=	XYDATA
##BLOCK_ID=	1
##ORIGIN=	Bruker BioSpin GmbH
##OWNER=	nmrsu
##NUMDIM=	1
##$MNOVA/METADATA=	(ITEM,BASE64)
eyJhbmdsZSI6MCwiYXhlcyI6eyJ4Ijp7Im1heCI6MTYuMDY0MjU5OTk5OTM5MTI1LCJtaW4iOi0zLjc
2Njk0MjMzOTE1NjYyMjZ9LCJ5Ijp7Im1heCI6NTEwNzcuNjM2MjMwNDY4NzUsIm1pbiI6LTQ2MjcuMD
I5MzYxNzI0ODUzNX19LCJwb2ludHMiOlt7IngiOjUzMjEsInkiOjU4MzV9LHsieCI6ODcyMiwieSI6N
TgzNX0seyJ4Ijo4NzIyLCJ5Ijo4MjA4fSx7IngiOjUzMjEsInkiOjgyMDh9LHsieCI6NTMyMSwieSI6
NTgzNX1dLCJ6IjowfQ==
##.OBSERVE FREQUENCY=	700.35432466099996418
##.OBSERVE NUCLEUS=	^1H
##.SOLVENT NAME=	CDCl3
##.PULSE SEQUENCE=	zg30
##LONGDATE=	2023/06/13 12:43:36.000
##.ACQUISITIONMODE=	SIMULTANEOUS (DQD)
##$ORIGINAL FORMAT=	Bruker XWIN-NMR
##$MNOVA/SCALES_VERSION=	9
##$PARAMETER FILE=	(acqus, ASCII, /private/var/folders/f6/rjf_tdyn2v98c5c0wvkgn4s80000gq/T/GF7g2X1BQMSUDYjm6BLcpA/10/acqus, 0)
$$ ##TITLE= Parameter file, TopSpin 4.1.3
$$ ##JCAMPDX= 5.0
$$ ##DATATYPE= Parameter Values
$$ ##NPOINTS= 1	$$ modification sequence number
$$ ##ORIGIN= Bruker BioSpin GmbH
$$ ##OWNER= nmrsu
$$ $$ 2023-06-13 12:43:38.849 +0100  nmrsu@CZC7167VR1
$$ $$ Z:/700/data/tds/nmr/RP346 char/10/acqus
$$ $$ process C:\Bruker\TopSpin4.1.3\prog\mod\dirdata.exe
$$ ##$ACQT0= -2.0981556054023
$$ ##$AMP= (0..31)
$$ 100 100 100 100 100 100 100 100 100 100 100 100 100 100 100 100 100 100
$$ 100 100 100 100 100 100 100 100 100 100 100 100 100 100
$$ ##$AMPCOIL= (0..32)
$$ -1 0 0 0 0 0 0 0 0 0 0 0 0 0 0 0 0 0 0 0 0 0 0 0 0 0 0 0 0 0 0 0 0
$$ ##$AQSEQ= 0
$$ ##$AQ_mod= 3
$$ ##$AUNM= <au_zg>
$$ ##$AUTOPOS= <24 >
$$ ##$BF1= 700.349999998
$$ ##$BF2= 700.349999998
$$ ##$BF3= 700.349999998
$$ ##$BF4= 700.349999998
$$ ##$BF5= 700.349999998
$$ ##$BF6= 700.349999998
$$ ##$BF7= 700.349999998
$$ ##$BF8= 700.349999998
$$ ##$BWFAC= (0..63)
$$ 0 0 0 0 0 0 0 0 0 0 0 0 0 0 0 0 0 0 0 0 0 0 0 0 0 0 0 0 0 0 0 0 0 0 0 0
$$ 0 0 0 0 0 0 0 0 0 0 0 0 0 0 0 0 0 0 0 0 0 0 0 0 0 0 0 0
$$ ##$BYTORDA= 0
$$ ##$CHANFCU= (0..24)
$$ 0 1 0 0 0 0 0 0 0 0 0 0 0 0 0 0 0 0 0 0 0 0 0 0 0
$$ ##$CHANREC= (0..24)
$$ 0 0 0 0 0 0 0 0 0 0 0 0 0 0 0 0 0 0 0 0 0 0 0 0 0
$$ ##$CHEMSTR= <none>
$$ ##$CNST= (0..63)
$$ 1 1 1 1 1 1 1 1 1 1 1 1 1 1 1 1 1 1 1 1 1 1 1 1 1 1 1 1 1 1 1 1 1 1 1 1
$$ 1 1 1 1 1 1 1 1 1 1 1 1 1 1 1 1 1 1 1 1 1 1 1 1 1 1 1 1
$$ ##$CPDPRG= (0..8)
$$ <> <> <> <> <> <> <> <> <>
$$ ##$D= (0..63)
$$ 0 1 0 0 0 0 0 0 0 0 0 0 0 0 0 0 0.0002 0 0 0 0 0 0 0 0 0 0 0 0 0 0 0 0
$$ 0 0 0 0 0 0 0 0 0 0 0 0 0 0 0 0 0 0 0 0 0 0 0 0 0 0 0 0 0 0 0
$$ ##$DATE= 1686656616
$$ ##$DATE_START= 1686656573
$$ ##$DE= 6.901845
$$ ##$DECBNUC= <off>
$$ ##$DECIM= 1440
$$ ##$DECNUC= <off>
$$ ##$DECSTAT= 4
$$ ##$DIGMOD= 3
$$ ##$DIGTYP= 17
$$ [...]
$$ ##$ShimPowRng3= (0..63)
$$ 1 1 1 1 1 1 1 1 1 1 1 1 1 1 1 1 1 1 1 1 1 1 1 1 1 1 1 1 1 1 1 1 1 1 1 1
$$ 1 1 1 1 0 0 0 0 0 0 0 0 0 0 0 0 0 0 0 0 0 0 0 0 0 0 0 0
$$ ##$ShimPowType1= 8
$$ ##$ShimPowType2= 8
$$ ##$ShimPowType3= 0
$$ ##$ShimPowType4= 0
$$ ##$ShimPowType5= 0
$$ ##$ShimPowType6= 0
$$ ##$ShimPowType7= 0
$$ ##$ShimPowType8= 0
$$ ##$ShimSysActGrad= (0..63)
$$ 1 2 3 4 13 5 7 11 10 9 6 8 12 18 19 20 21 15 22 23 24 14 25 16 26 17 27
$$ 28 31 32 33 34 35 36 37 38 0 0 0 0 0 0 0 0 0 0 0 0 0 0 0 0 0 0 0 0 0 0
$$ 0 0 0 0 0 0
$$ ##$ShimSysAngle= <>
$$ ##$ShimSysFunc= (0..63)
$$ 1 2 3 4 5 6 7 8 9 10 0 37 38 35 16 15 14 13 12 11 28 27 26 25 24 23 36
$$ 22 30 29 20 21 34 33 32 31 17 18 19 0 0 0 0 0 0 0 0 0 0 0 0 0 0 0 0 0 0
$$ 0 0 0 0 0 0 0
$$ ##$ShimSysMatId= <292722da.dat>
$$ ##$ShimSysMatrix= 1
$$ ##$ShimSysMinMaxUG= 130000
$$ ##$ShimSysOffset= <29 mm>
$$ ##$ShimSysType= 4
$$ ##$ShimUnit= 3
$$ ##$SpectrOsVersion= <4.1.156.20210628>
$$ ##$TCubeEth= <192.168.180.38>
$$ ##$TCubeSeqDevice= <>
$$ ##$TOSITY= <no>
$$ ##$TRIPLO2= 0
$$ ##$TopSpinVersion= <TopSpin 4.1.3>
$$ ##$TrxFreqFormula= (0..23)
$$ <TrxFreqFormula(2.0,700350000.000000,'TRX',Trx(1.0,'TRX 1200.1',1,5.000000,1290.000000))>
$$ <TrxFreqFormula(2.0,700350000.000000,'TRX',Trx(1.0,'TRX 1200.2',1,5.000000,1290.000000))>
$$ <TrxFreqFormula(2.0,700350000.000000,'TRX',Trx(1.0,'TRX 1200.3',1,5.000000,1290.000000))>
$$ <> <> <> <> <> <> <> <> <> <> <> <> <> <> <> <> <> <> <> <> <>
$$ ##$TrxPN= (0..23)
$$ <Z148391> <Z148391> <Z148391> <> <> <> <> <> <> <> <> <> <> <> <> <> <>
$$ <> <> <> <> <> <> <>
$$ ##$TrxSN= (0..23)
$$ <00336> <00337> <00342> <> <> <> <> <> <> <> <> <> <> <> <> <> <> <> <>
$$ <> <> <> <> <>
$$ ##$VCubeEth= (0..23)
$$ <no> <no> <no> <no> <no> <no> <no> <no> <no> <no> <no> <no> <no> <no> <no>
$$ <no> <no> <no> <no> <no> <no> <no> <no> <no>
$$ ##$VTU= 2
$$ ##$VTUETH= <192.168.99.11>
$$ ##$VTUTY= <no>
$$ ##$ValueLine= no
$$ ##$VpuPN= (0..23)
$$ <no> <no> <no> <no> <no> <no> <no> <no> <no> <no> <no> <no> <no> <no> <no>
$$ <no> <no> <no> <no> <no> <no> <no> <no> <no>
$$ ##$VpuSN= (0..23)
$$ <no> <no> <no> <no> <no> <no> <no> <no> <no> <no> <no> <no> <no> <no> <no>
$$ <no> <no> <no> <no> <no> <no> <no> <no> <no>
$$ ##$WBREFAM= (0..31)
$$ 99.8 100 100 100 100 100 100 100 100 100 100 100 100 100 100 100 100 100
$$ 100 100 100 100 100 100 100 100 100 100 100 100 100 100
$$ ##$WBREFLM= (0..31)
$$ 1 0 1 0 0 0 0 0 0 0 0 0 0 0 0 0 0 0 0 0 0 0 0 0 0 0 0 0 0 0 0 0
$$ ##$WBREFPH= (0..31)
$$ 0.05 0 0 0 0 0 0 0 0 0 0 0 0 0 0 0 0 0 0 0 0 0 0 0 0 0 0 0 0 0 0 0
$$ ##$WBSGU= (0..31)
$$ 1 2 4 0 0 0 0 0 0 0 0 0 0 0 0 0 0 0 0 0 0 0 0 0 0 0 0 0 0 0 0 0
$$ ##END=
$$ 
##$DECIM=	1440
##$DSPFVS=	21
##XUNITS=	HZ
##YUNITS=	ARBITRARY UNITS
##FIRSTX=	11250.604788156719223
##LASTX=	-2638.1781369192458442
##DELTAX=	-0.10596381293402784562
##XFACTOR=	1
##YFACTOR=	1.4171030257194738855
##FIRSTY=	115.12073516845703125
##MINY=	16.392024993896484375
##MAXY=	46434.21484375
##NPOINTS=	131072
##XYDATA=	(X++(Y..Y))
$$ [...]
7291A18%%%%%%j%%%%%J%%%%%j%%%j%J%Jj%%Jj%Jj%%%%%%J%%%j%j%J%%%J%jJ%%%j%J%%%%%%
7283A18j%J%%jJ%%%%%%%J%%%j%%%Jj%j%J%j%%%J%%%%%%%j%%%%%J%Jj%%%%j%%JJ%%%j%%J%%
7276A19jj%Jj%JJ%%%j%j%J%%%j%%%%%%%%J%J%j%%%%%%%j%%%J%j%J%%j%J%%J%%jj%%%%J%%%
7269A18%%%Jjj%%%%%%%%%%jJ%%%Jj%%%%%%%%%%%%J%j%%Jj%%%%%%%%Jj%J%j%%%%j%J%%%%%%
7261A17jJ%J%%%%j%%%%J%J%%%%j%%%J%j%%%%j%%J%j%%%%%%%%%J%j%%j%%%%J%%%jJ%%%J%%%
7254A18%j%%%%%%%jJ%j%%%J%%jJ%%%%%%%J%j%%%%%%%%%%%%j%%J%J%%%%%%j%%%%%JJ%%jj%J
7247A18%Jjj%%%%%J%%%j%%%%%%%%j%%J%%%j%%%%%%%J%%%J%%%j%%%%%%%%%%Jj%%%%%%%J%%%
7240A18%%jJ%%%J%%j%%%j%%%%J%%%%j%%%%%J%%%%%%jJ%%%%%%%%%j%%j%%%Jj%J%j%%%%%%J%
$$ y = [118, 118, 118, 118, 118, 118, 118, 117, 117, 117, 117, 117, 117, 118, 118, 118, 118, 118, 118, 117, 117, 117, 117, 116, 116, 117, 117, 118, 117, 117, 117, 118, 117, 117, 118, 117, 117, 117, 117, 117, 117, 117, 118, 118, 118, 118, 117, 117, 116, 116, 117, 117, 117, 117, 118, 118, 117, 118, 118, 118, 118, 117, 117, 118, 118, 118, 118, 118, 118, 118, 117, 117, 118, 118, 118, 117, 118, 118, 118, 118, 118, 118, 118, 118, 119, 119, 119, 119, 118, 118, 118, 118, 119, 118, 118, 117, 117, 118, 118, 117, 117, 117, 117, 118, 118, 118, 118, 118, 118, 118, 118, 117, 117, 117, 117, 117, 117, 118, 118, 119, 118, 118, 118, 118, 118, 117, 117, 117, 118, 119, 119, 119, 119, 118, 118, 118, 119, 119, 119, 118, 117, 117, 118, 117, 117, 118, 119, 119, 119, 119, 118, 118, 117, 117, 118, 118, 118, 118, 117, 117, 117, 117, 117, 117, 117, 117, 117, 118, 118, 119, 119, 118, 118, 118, 118, 118, 118, 118, 118, 117, 117, 117, 117, 118, 118, 117, 117, 118, 118, 118, 117, 117, 118, 118, 118, 119, 119, 119, 118, 117, 117, 117, 117, 117, 118, 118, 118, 118, 118, 118, 118, 119, 118, 117, 117, 117, 117, 117, 117, 117, 117, 117, 117, 117, 116, 117, 117, 117, 117, 118, 117, 117, 117, 117, 117, 117, 117, 117, 117, 117, 117, 117, 117, 118, 118, 117, 117, 117, 118, 117, 117, 117, 117, 117, 117, 117, 117, 117, 118, 117, 117, 118, 118, 117, 117, 117, 117, 117, 116, 116, 117, 117, 117, 117, 117, 117, 117, 116, 117, 117, 118, 118, 118, 118, 118, 117, 117, 117, 117, 117, 118, 118, 119, 119, 119, 119, 119, 118, 118, 118, 118, 119, 119, 118, 118, 118, 118, 118, 117, 117, 117, 118, 118, 117, 117, 117, 117, 117, 117, 117, 117, 117, 117, 118, 118, 117, 117, 117, 116, 116, 116, 116, 116, 117, 117, 117, 117, 116, 117, 117, 117, 117, 118, 118, 118, 118, 118, 117, 117, 117, 117, 117, 117, 117, 117, 116, 117, 117, 116, 116, 116, 116, 117, 117, 117, 116, 117, 117, 117, 117, 117, 117, 117, 117, 118, 118, 117, 117, 117, 117, 117, 117, 117, 117, 117, 117, 117, 117, 117, 116, 116, 116, 117, 117, 118, 118, 118, 118, 118, 118, 118, 117, 117, 117, 117, 117, 117, 118, 119, 119, 119, 118, 117, 117, 118, 118, 119, 118, 117, 117, 117, 117, 117, 117, 118, 118, 118, 118, 117, 117, 117, 117, 117, 117, 117, 117, 117, 116, 116, 116, 117, 117, 117, 117, 116, 116, 116, 116, 116, 116, 116, 116, 117, 117, 117, 117, 118, 118, 118, 118, 117, 117, 117, 117, 117, 117, 117, 117, 117, 117, 117, 118, 117, 117, 117, 117, 117, 117, 117, 117, 118, 118, 118, 118, 118, 118, 117, 118, 118, 118, 118, 119, 119, 119, 118, 118, 118, 118, 117, 117, 117, 117, 117, 118, 118, 118, 118, 118, 117, 117, 117, 117, 117, 117, 118, 118, 118, 118, 118, 118, 118, 117, 118, 118, 118, 118, 118, 118, 118, 118, 118, 118, 117, 117, 117, 116, 116, 116, 116, 117, 116, 116, 117, 117, 116, 116, 116, 116, 116, 116, 116, 117, 117]
7232A17%%Jj%%%j%j%%%%J%%J%%%%%%%%%J%j%%%%Jj%%%%%%J%j%j%%%%%%%%%Jj%j%J%%%j%J%
7225A16%%Jj%%%j%%J%%%J%%J%j%%%%%%J%%%%j%%J%%J%%j%j%J%%%%Jjj%%%%%%J%%jj%%J%%%
7218A17%%%%%%%J%Jj%j%%J%%j%j%%%%j%%J%%J%J%%%%%%%%jj%%J%j%%%%%J%%%%j%%%%%J%%j
7210A16%%%%J%%%%%%%%%%j%%jJ%J%%%%%%jjJ%J%%%%%%%%%%Jj%j%J%%%%%%%%%%%%%%J%j%%%
7203A17%%%%%J%%%j%%J%%%%%%%%%%j%%%%%Jj%J%%j%%%%%%%J%%%j%%%%%%%J%%%%%%%j%%J%%
7196A18j%%%%j%%%Jj%%%%%%%%J%%%%%%%%%j%%%%%J%j%%%J%%%%%%%%%%J%%j%j%%%%%%%%%%j
7188A15J%J%%%%%%%%%j%%%%%J%%j%%%%J%%j%%j%J%%J%j%%%%%%J%jJ%%%%j%%%%%%J%%%%%%%
7181A17j%%J%%%jJ%%%%j%J%%%%%%J%jj%j%J%Jj%J%%J%%%%%%j%%%%j%J%j%%%J%%%%%%%%%%%
$$ y = [117, 117, 117, 118, 117, 117, 117, 117, 116, 116, 115, 115, 115, 115, 115, 116, 116, 116, 117, 117, 117, 117, 117, 117, 117, 117, 117, 117, 118, 118, 117, 117, 117, 117, 117, 118, 117, 117, 117, 117, 117, 117, 117, 118, 118, 117, 117, 116, 116, 116, 116, 116, 116, 116, 116, 116, 116, 117, 116, 116, 115, 115, 116, 116, 116, 116, 115, 115, 116, 116, 116, 116, 117, 116, 116, 116, 116, 115, 115, 115, 116, 116, 116, 116, 117, 117, 117, 118, 118, 117, 117, 117, 117, 117, 117, 117, 118, 118, 118, 118, 118, 117, 117, 117, 118, 118, 118, 119, 119, 119, 118, 118, 117, 117, 118, 118, 118, 118, 118, 119, 118, 117, 117, 117, 117, 117, 117, 117, 118, 118, 118, 117, 116, 116, 116, 117, 117, 117, 117, 117, 117, 117, 117, 117, 117, 117, 118, 118, 119, 118, 118, 117, 117, 117, 118, 118, 118, 117, 117, 116, 116, 116, 116, 116, 115, 115, 115, 116, 116, 116, 117, 117, 118, 118, 118, 118, 118, 118, 118, 118, 118, 117, 116, 116, 116, 117, 117, 116, 116, 116, 116, 116, 116, 117, 117, 117, 117, 117, 116, 116, 116, 116, 116, 116, 117, 117, 117, 116, 116, 116, 116, 116, 117, 117, 117, 117, 117, 117, 117, 117, 117, 117, 117, 116, 116, 116, 115, 116, 116, 117, 117, 117, 117, 117, 117, 117, 116, 115, 116, 116, 117, 117, 117, 117, 117, 117, 117, 117, 117, 117, 117, 118, 117, 117, 116, 116, 117, 117, 117, 117, 117, 117, 117, 117, 117, 117, 117, 117, 117, 117, 117, 118, 118, 117, 117, 117, 117, 117, 117, 117, 117, 117, 118, 118, 118, 118, 117, 117, 117, 118, 118, 118, 118, 118, 118, 118, 118, 118, 118, 118, 117, 117, 117, 117, 117, 117, 118, 117, 117, 118, 118, 118, 117, 117, 117, 117, 117, 117, 117, 117, 118, 118, 118, 118, 117, 117, 117, 117, 117, 117, 117, 117, 118, 118, 118, 118, 118, 118, 118, 118, 117, 117, 117, 118, 118, 118, 117, 117, 117, 117, 117, 116, 116, 116, 116, 117, 116, 116, 116, 116, 116, 116, 116, 116, 116, 117, 117, 117, 117, 117, 117, 117, 117, 117, 117, 116, 116, 116, 116, 116, 116, 117, 117, 116, 116, 116, 116, 117, 117, 117, 117, 117, 117, 117, 117, 117, 117, 117, 118, 118, 118, 117, 117, 116, 116, 116, 116, 116, 116, 116, 116, 116, 116, 116, 115, 116, 116, 117, 117, 117, 117, 117, 117, 117, 117, 117, 117, 116, 116, 116, 116, 116, 116, 117, 117, 117, 116, 116, 116, 116, 116, 117, 117, 117, 116, 116, 116, 115, 115, 116, 116, 116, 117, 117, 116, 116, 116, 116, 116, 116, 116, 117, 117, 116, 117, 117, 117, 117, 117, 116, 116, 116, 116, 116, 116, 116, 117, 117, 117, 117, 117, 117, 117, 117, 116, 116, 116, 117, 117, 117, 117, 116, 117, 117, 117, 117, 117, 116, 116, 117, 117, 117, 117, 117, 117, 117, 118, 118, 117, 116, 116, 115, 115, 116, 116, 117, 116, 116, 117, 117, 117, 118, 118, 118, 118, 118, 118, 118, 117, 117, 117, 117, 117, 116, 116, 117, 117, 116, 116, 116, 116, 117, 117, 117, 117, 117, 117, 117, 117, 117, 117, 117, 117]
7174A17%%%%J%j%%J%j%j%J%%%%J%%j%%%%%%%%%%%%%%%%%%%J%%j%%J%j%%%%%j%J%j%%J%%%j
7166A16%J%J%%%%j%%J%%%J%%jj%%j%J%jJ%%%%%j%%%%J%%J%%jj%jJ%J%jJ%%%j%%%J%%%%J%%
7159A18%%j%j%jJ%%%%%%%%%%%%J%%%%%%%j%%%%J%Jj%j%J%%%%%J%%%j%%%%J%j%%%%%J%%%jj
7152A16%%J%J%%jj%%%%%%%%%J%%%%%%%%%%%%%%%%%%j%j%J%J%%j%%%%%%%J%%J%%%j%%j%J%j
7145A16%%J%%%%%j%%%%%%%%%%J%%jJ%%%%%%%%%j%%%%%%%%%%%%Jj%%%J%%j%%J%%%j%J%%j%%
7137A16%%%%%%%J%%jJ%%%j%%J%%k%%%%%J%%%%jJ%%%%%%%%%J%j%%%%%%%%%%%%%J%%%%j%%%%
7130A16%%%%%j%%%%%J%%%%%%j%jJ%%%%%%%%%%%%%%%%%J%%%J%j%%%J%%%%%J%j%j%%%J%j%%%
7123A16J%%j%%%J%%%j%%%%%%J%%%%%%j%J%j%%%%%j%J%%J%%J%%%j%%%%J%%j%j%J%%%j%%%J%
$$ y = [117, 117, 117, 117, 117, 118, 118, 117, 117, 117, 118, 118, 117, 117, 116, 116, 117, 117, 117, 117, 117, 118, 118, 118, 117, 117, 117, 117, 117, 117, 117, 117, 117, 117, 117, 117, 117, 117, 117, 117, 117, 117, 117, 117, 118, 118, 118, 117, 117, 117, 118, 118, 117, 117, 117, 117, 117, 117, 116, 116, 117, 117, 116, 116, 116, 117, 117, 117, 117, 116, 116, 117, 117, 118, 118, 118, 118, 118, 117, 117, 117, 118, 118, 118, 118, 119, 119, 119, 118, 117, 117, 117, 116, 116, 117, 117, 116, 117, 117, 117, 117, 117, 117, 116, 116, 116, 116, 116, 117, 117, 117, 118, 118, 118, 117, 116, 116, 115, 116, 116, 117, 117, 116, 117, 117, 117, 117, 116, 116, 116, 116, 117, 117, 117, 117, 117, 118, 118, 118, 118, 118, 117, 117, 116, 116, 115, 116, 116, 116, 116, 116, 116, 116, 116, 116, 116, 116, 116, 116, 117, 117, 117, 117, 117, 117, 117, 117, 116, 116, 116, 116, 116, 117, 117, 118, 117, 117, 116, 116, 117, 117, 117, 117, 117, 117, 118, 118, 118, 118, 117, 117, 117, 117, 117, 118, 118, 117, 117, 117, 117, 117, 117, 118, 118, 118, 118, 117, 116, 116, 116, 117, 117, 118, 118, 118, 117, 116, 116, 116, 116, 116, 116, 116, 116, 116, 116, 117, 117, 117, 117, 117, 117, 117, 117, 117, 117, 117, 117, 117, 117, 117, 117, 117, 117, 117, 116, 116, 115, 115, 116, 116, 117, 117, 117, 116, 116, 116, 116, 116, 116, 116, 116, 117, 117, 117, 118, 118, 118, 118, 117, 117, 117, 116, 116, 117, 117, 116, 116, 116, 117, 117, 117, 117, 117, 117, 116, 116, 116, 116, 116, 116, 116, 116, 116, 116, 116, 117, 117, 117, 116, 117, 117, 117, 117, 117, 117, 117, 117, 117, 117, 116, 116, 116, 116, 116, 116, 116, 116, 116, 116, 116, 116, 116, 117, 116, 116, 116, 116, 117, 117, 117, 116, 116, 116, 117, 117, 117, 117, 116, 116, 117, 117, 117, 116, 116, 116, 116, 116, 116, 116, 116, 116, 116, 117, 117, 117, 116, 117, 117, 117, 117, 116, 116, 116, 117, 117, 117, 115, 115, 115, 115, 115, 115, 116, 116, 116, 116, 116, 115, 116, 116, 116, 116, 116, 116, 116, 116, 116, 116, 117, 117, 116, 116, 116, 116, 116, 116, 116, 116, 116, 116, 116, 116, 116, 116, 117, 117, 117, 117, 117, 116, 116, 116, 116, 116, 116, 116, 116, 116, 116, 115, 115, 115, 115, 115, 115, 116, 116, 116, 116, 116, 116, 116, 115, 115, 114, 115, 115, 115, 115, 115, 115, 115, 115, 115, 115, 115, 115, 115, 115, 115, 115, 115, 115, 116, 116, 116, 116, 117, 117, 116, 116, 116, 116, 117, 117, 117, 117, 117, 117, 118, 118, 117, 117, 116, 116, 116, 116, 117, 117, 116, 116, 116, 116, 117, 117, 117, 116, 116, 116, 116, 117, 117, 117, 117, 116, 116, 116, 116, 116, 116, 116, 117, 117, 117, 117, 117, 117, 117, 116, 116, 117, 117, 116, 116, 116, 116, 116, 116, 115, 115, 116, 116, 116, 117, 117, 117, 118, 118, 118, 118, 117, 117, 117, 117, 117, 118, 118, 118, 117, 117, 116, 116, 117, 117, 117, 117, 116, 116, 116, 116, 117, 117]
7115A17j%%%Jj%%%J%%j%%J%J%j%%%%%%j%%%%%%%%%J%%%%%j%%%%%%%%%%%%%%%%Jj%%%%j%J%
7108A16J%%%%j%J%j%%%%J%%%%j%%%%%%%%%%%%%%%%%%%%%J%%j%J%J%%%j%%%%%%%%%%%j%%%j
7101A15%J%%%J%%%%j%%%%%%%%%%%%%%%J%%%%%%%j%%%%%%%J%j%%J%%%%%J%j%%j%%%J%%%%j%
7093A16%Jj%j%%%%%%%JJ%j%J%Jj%j%%%%%%J%%j%J%%%J%j%%%%%%%%%%%j%j%%j%J%%J%%%%%%
7086A16%%Jj%j%%%J%%j%J%J%j%%%%%%%%%%%%%%%%j%%%%%%%J%%%%%%J%%%%%%%%j%%%%%%%%%
7079A16%J%%%j%%%%J%j%j%%%%JJ%j%%%%%%%%%%%%%%%%%%%%%Jj%j%%%%%J%%%%%j%%J%%%%%%
7071A16%J%%%%%jj%%J%j%j%J%%%jJJ%%%%%j%J%jJ%%%%%%%J%%%%%jjJ%J%jj%%%J%j%%JJ%%j
7064A16%%j%%%%%J%%%J%%%%%%%j%%%%%%J%j%%j%%%%j%%JJ%%%J%%%%j%%%%Jj%%%%%%%%%J%%
$$ y = [117, 116, 116, 116, 116, 117, 116, 116, 116, 116, 117, 117, 117, 116, 116, 116, 117, 117, 118, 118, 117, 117, 117, 117, 117, 117, 117, 116, 116, 116, 116, 116, 116, 116, 116, 116, 116, 117, 117, 117, 117, 117, 117, 116, 116, 116, 116, 116, 116, 116, 116, 116, 116, 116, 116, 116, 116, 116, 116, 116, 117, 116, 116, 116, 116, 116, 115, 115, 116, 116, 117, 117, 117, 117, 117, 116, 116, 117, 117, 116, 116, 116, 116, 116, 117, 117, 117, 117, 117, 116, 116, 116, 116, 116, 116, 116, 116, 116, 116, 116, 116, 116, 116, 116, 116, 116, 116, 116, 116, 116, 116, 117, 117, 117, 116, 116, 117, 117, 118, 118, 118, 118, 117, 117, 117, 117, 117, 117, 117, 117, 117, 117, 117, 117, 116, 116, 116, 116, 115, 115, 116, 116, 116, 116, 117, 117, 117, 117, 117, 116, 116, 116, 116, 116, 116, 116, 116, 116, 116, 116, 116, 116, 116, 116, 116, 117, 117, 117, 117, 117, 117, 117, 117, 116, 116, 116, 116, 116, 116, 116, 116, 117, 117, 116, 116, 116, 117, 117, 117, 117, 117, 117, 118, 118, 117, 117, 117, 116, 116, 116, 116, 117, 117, 117, 117, 117, 116, 116, 116, 117, 116, 116, 115, 115, 115, 115, 115, 115, 115, 115, 116, 117, 117, 116, 116, 117, 117, 118, 117, 117, 116, 116, 116, 116, 116, 116, 116, 117, 117, 117, 116, 116, 117, 117, 117, 117, 118, 118, 117, 117, 117, 117, 117, 117, 117, 117, 117, 117, 117, 117, 116, 116, 115, 115, 115, 114, 114, 115, 115, 115, 116, 116, 116, 116, 116, 116, 116, 116, 116, 117, 116, 116, 115, 115, 115, 115, 116, 116, 116, 115, 115, 116, 116, 117, 117, 116, 116, 116, 116, 116, 116, 116, 116, 116, 116, 116, 116, 116, 116, 116, 116, 116, 115, 115, 115, 115, 115, 115, 115, 115, 116, 116, 116, 116, 116, 116, 116, 117, 117, 117, 117, 117, 117, 117, 117, 117, 116, 116, 116, 116, 116, 116, 116, 116, 116, 116, 116, 117, 117, 117, 117, 116, 116, 116, 116, 116, 117, 117, 116, 116, 115, 115, 115, 115, 115, 116, 117, 117, 116, 116, 116, 116, 116, 116, 116, 116, 116, 116, 116, 116, 116, 116, 116, 116, 116, 116, 116, 116, 116, 116, 117, 116, 116, 115, 115, 115, 115, 115, 115, 116, 116, 116, 116, 116, 116, 115, 115, 115, 116, 116, 116, 116, 116, 116, 116, 116, 117, 117, 117, 117, 117, 117, 116, 115, 115, 115, 116, 116, 115, 115, 114, 114, 115, 115, 115, 115, 114, 115, 116, 116, 116, 116, 116, 116, 115, 115, 116, 116, 115, 116, 116, 116, 116, 116, 116, 116, 116, 117, 117, 117, 117, 117, 117, 116, 115, 116, 116, 117, 117, 116, 115, 115, 115, 115, 116, 116, 115, 115, 115, 116, 117, 117, 117, 116, 116, 116, 115, 115, 115, 115, 115, 115, 116, 116, 116, 116, 117, 117, 117, 117, 117, 117, 117, 117, 116, 116, 116, 116, 116, 116, 116, 117, 117, 116, 116, 116, 115, 115, 115, 115, 115, 114, 114, 114, 115, 116, 116, 116, 116, 117, 117, 117, 117, 117, 116, 116, 116, 116, 116, 117, 116, 116, 116, 116, 116, 116, 116, 116, 116, 116, 117, 117, 117]
7057A17%%%%j%J%%J%%j%j%%%j%%%%%%%%%%J%%%%%jJ%%%%%%%%%%%%%%%%%%j%J%%j%%%%J%%j
7049A15%%J%%%%%%%%%%%%%jJ%Jj%%%Jj%%%%%%%jJJJ%j%%%%jjj%J%%%J%j%%%%J%%%%J%J%jj
7042A16%%%%j%%J%%%%Jj%%%%%%%J%j%j%%%J%%j%%J%%%j%%%Jj%J%%%%%j%%%%%%J%%j%J%%%%
7035A16%%J%%j%%%%%%%%j%%%J%%Jj%%J%jj%J%%%%%%%J%%%%%%j%%%jJ%J%jJ%%%jJ%%jJ%%j%
7028A16%%%%j%%%%%J%%%%Jj%%%j%J%J%%%%%%%%%%%%%j%%%j%%%%jJ%J%%%%%%Jj%%%%%%%%%%
7020A16%%j%%%%%j%%%J%%%%%J%%j%%%%%%%jJ%J%%%%%%%%%%%%%jJ%Jj%%%%%%%%%j%%%%%%%J
7013A16%%jJ%j%jJ%J%%%%%%%%%J%%%j%j%%%%J%%%j%J%%%%%%%%%%%%%%%%%%%Jj%%%j%%%%%J
7006A16%%%%%%%Jj%jJ%Jj%%%%%%%%j%J%Jjj%%J%%%%%%%J%%%%%%%%%%jJ%J%%%j%%%%%%%j%j
$$ y = [117, 117, 117, 117, 117, 116, 116, 117, 117, 117, 118, 118, 118, 117, 117, 116, 116, 116, 116, 115, 115, 115, 115, 115, 115, 115, 115, 115, 115, 115, 116, 116, 116, 116, 116, 116, 115, 116, 116, 116, 116, 116, 116, 116, 116, 116, 116, 116, 116, 116, 116, 116, 116, 116, 116, 116, 115, 115, 116, 116, 116, 115, 115, 115, 115, 115, 116, 116, 116, 115, 115, 115, 116, 116, 116, 116, 116, 116, 116, 116, 116, 116, 116, 116, 116, 116, 115, 116, 116, 117, 116, 116, 116, 116, 117, 116, 116, 116, 116, 116, 116, 116, 116, 115, 116, 117, 118, 118, 117, 117, 117, 117, 117, 116, 115, 114, 114, 115, 115, 115, 115, 116, 116, 115, 115, 115, 115, 115, 116, 116, 116, 116, 116, 117, 117, 118, 118, 117, 116, 116, 116, 116, 116, 115, 115, 115, 116, 116, 116, 116, 116, 117, 116, 116, 116, 116, 116, 116, 116, 116, 117, 117, 116, 116, 115, 115, 115, 115, 116, 116, 116, 115, 115, 115, 116, 116, 116, 116, 115, 115, 115, 115, 116, 115, 115, 116, 116, 116, 116, 116, 116, 115, 115, 115, 115, 115, 115, 115, 116, 116, 116, 115, 115, 116, 116, 116, 116, 116, 116, 116, 117, 117, 117, 116, 116, 116, 116, 116, 116, 116, 116, 116, 115, 115, 115, 115, 116, 116, 116, 117, 116, 116, 116, 117, 117, 116, 115, 115, 116, 116, 116, 116, 116, 116, 116, 116, 117, 117, 117, 117, 117, 117, 117, 116, 116, 116, 116, 115, 116, 116, 117, 117, 116, 117, 117, 117, 117, 116, 117, 117, 117, 116, 117, 117, 117, 116, 116, 116, 116, 116, 116, 115, 115, 115, 115, 115, 115, 116, 116, 116, 116, 116, 117, 116, 116, 116, 116, 115, 115, 116, 116, 117, 117, 117, 117, 117, 117, 117, 117, 117, 117, 117, 117, 117, 117, 116, 116, 116, 116, 115, 115, 115, 115, 115, 114, 115, 115, 116, 116, 116, 116, 116, 116, 116, 117, 116, 116, 116, 116, 116, 116, 116, 116, 116, 116, 116, 116, 116, 115, 115, 115, 115, 115, 115, 114, 114, 114, 114, 115, 115, 115, 115, 115, 115, 116, 116, 116, 115, 115, 115, 115, 115, 115, 115, 115, 114, 115, 115, 116, 116, 116, 116, 116, 116, 116, 116, 116, 116, 116, 116, 116, 116, 115, 116, 116, 117, 116, 116, 116, 116, 116, 116, 116, 116, 116, 116, 115, 115, 115, 115, 115, 115, 115, 115, 116, 116, 116, 115, 116, 116, 115, 115, 114, 115, 115, 116, 116, 116, 116, 116, 116, 116, 116, 116, 116, 117, 117, 117, 117, 116, 116, 115, 115, 115, 115, 115, 116, 116, 116, 116, 115, 115, 116, 116, 116, 116, 116, 116, 116, 116, 116, 116, 116, 116, 116, 116, 116, 116, 116, 116, 116, 116, 117, 116, 116, 116, 116, 115, 115, 115, 115, 115, 115, 116, 116, 116, 116, 116, 116, 116, 116, 117, 116, 116, 115, 116, 116, 117, 116, 116, 116, 116, 116, 116, 116, 116, 116, 115, 115, 116, 116, 117, 116, 115, 115, 115, 116, 116, 116, 116, 116, 116, 116, 116, 117, 117, 117, 117, 117, 117, 117, 117, 117, 117, 117, 116, 117, 117, 118, 118, 118, 118, 117, 117, 117, 117, 117, 117, 117, 117, 116, 116, 115]
6998A15%%%%%%%%%%%Jj%%%%%J%%%%j%%%%%%%%J%jJ%%J%%%%j%%%%%%jJ%%%%%%%%%%%%j%%%%
6991A15%%%%jJ%%%%%%%%%J%%j%Jj%%%%J%%j%jJ%Jj%J%%j%J%%%%%%%%%%%%%%%%%%%%%Jj%%j
6984A15%%%%j%J%%Jj%%%%%%%%%%%%%%%Jj%J%%%j%%J%jJ%%%%j%%%%%%%%%%J%%%%j%%%JjJ%%
6976A16%j%%J%%%j%%J%%J%j%%j%%J%%%%%%j%%%%%%%JJ%%j%j%J%%%%%%%%%%%j%j%JJ%%%%j%
6969A15%%%%%J%%j%%Jj%%jJ%%J%%%j%Jj%%%%J%%%%%jj%%J%%J%%%%%Jj%j%%%%j%J%%%%j%%J
6962A15%J%%%%%J%j%%%jJ%%%%%jJ%%%%j%%J%j%%%%%%%%%%J%%%j%%%%%%%%%%J%%%%%%%%%%%
6954A16Jj%%%%%%%%jj%J%%%%%J%%j%%%%%%%%%%jJ%%%%J%j%%jJ%%%%%%%%jJ%%%%%%%%%%%%%
6947A15%J%%%J%j%jJ%j%jJ%%j%J%%J%%%%%%%%%J%%j%%%j%J%%j%%%%%%%%%%%J%jJ%%%%J%j%
$$ y = [115, 115, 115, 115, 115, 115, 115, 115, 115, 115, 115, 115, 116, 115, 115, 115, 115, 115, 115, 116, 116, 116, 116, 116, 115, 115, 115, 115, 115, 115, 115, 115, 115, 116, 116, 115, 116, 116, 116, 117, 117, 117, 117, 117, 116, 116, 116, 116, 116, 116, 116, 115, 116, 116, 116, 116, 116, 116, 116, 116, 116, 116, 116, 116, 116, 115, 115, 115, 115, 115, 115, 115, 115, 115, 114, 115, 115, 115, 115, 115, 115, 115, 115, 115, 115, 116, 116, 116, 115, 115, 116, 115, 115, 115, 115, 115, 116, 116, 116, 115, 115, 114, 115, 115, 116, 115, 115, 116, 116, 116, 115, 115, 116, 116, 116, 116, 116, 116, 116, 116, 116, 116, 116, 116, 116, 116, 116, 116, 116, 116, 116, 116, 116, 116, 117, 116, 116, 116, 115, 115, 115, 115, 115, 114, 114, 115, 115, 115, 116, 115, 115, 115, 115, 115, 115, 115, 115, 115, 115, 115, 115, 115, 115, 115, 115, 116, 115, 115, 116, 116, 116, 116, 115, 115, 115, 116, 116, 115, 116, 116, 116, 116, 116, 115, 115, 115, 115, 115, 115, 115, 115, 115, 115, 115, 116, 116, 116, 116, 116, 115, 115, 115, 115, 116, 115, 116, 116, 116, 116, 115, 115, 115, 116, 116, 116, 116, 115, 115, 115, 116, 116, 116, 117, 117, 116, 116, 116, 115, 115, 115, 116, 116, 116, 116, 116, 116, 116, 115, 115, 115, 115, 115, 115, 115, 115, 116, 117, 117, 117, 116, 116, 115, 115, 116, 116, 116, 116, 116, 116, 116, 116, 116, 116, 116, 116, 115, 115, 114, 114, 115, 116, 116, 116, 116, 116, 115, 115, 115, 115, 115, 115, 115, 116, 116, 116, 115, 115, 115, 116, 115, 115, 115, 114, 115, 115, 115, 116, 116, 116, 116, 115, 115, 116, 115, 115, 115, 115, 115, 116, 116, 116, 116, 116, 116, 115, 114, 114, 114, 115, 115, 115, 116, 116, 116, 116, 116, 116, 117, 116, 116, 115, 115, 115, 115, 115, 114, 114, 115, 115, 115, 115, 115, 114, 114, 114, 115, 115, 116, 116, 116, 116, 116, 116, 117, 117, 116, 116, 116, 116, 115, 116, 116, 116, 116, 116, 116, 115, 116, 116, 116, 116, 116, 115, 115, 115, 116, 116, 115, 115, 115, 115, 115, 115, 115, 115, 115, 115, 115, 116, 116, 116, 116, 115, 115, 115, 115, 115, 115, 115, 115, 115, 115, 115, 116, 116, 116, 116, 116, 116, 116, 116, 116, 116, 116, 116, 117, 116, 116, 116, 116, 116, 116, 116, 116, 116, 115, 114, 114, 115, 115, 115, 115, 115, 115, 116, 116, 116, 115, 115, 115, 115, 115, 115, 115, 115, 115, 115, 115, 114, 115, 115, 115, 115, 115, 116, 116, 115, 115, 115, 114, 115, 115, 115, 115, 115, 115, 115, 115, 115, 114, 115, 115, 115, 115, 115, 115, 115, 115, 115, 115, 115, 115, 115, 115, 115, 116, 116, 116, 116, 117, 117, 116, 116, 115, 116, 116, 115, 115, 114, 115, 115, 115, 114, 114, 115, 115, 115, 116, 116, 116, 116, 116, 116, 116, 116, 116, 116, 117, 117, 117, 116, 116, 116, 116, 115, 115, 116, 116, 116, 115, 115, 115, 115, 115, 115, 115, 115, 115, 115, 115, 115, 116, 116, 115, 116, 116, 116, 116, 116, 117, 117, 116, 116]
6940A16j%%%%jJ%%%%%%%J%%%%%%%%%%%j%jjJ%J%%%jJ%J%j%%%%%%jJ%%%%%%%%%%%%%Jj%%%%
6932A15J%j%%%j%J%%%%%J%%%%%%j%%%%j%%%%%%%%%%%%%%J%j%%%%J%%%%%%%%%%%%%%j%%J%%
6925A15Jj%%%%%%%%J%%%j%%j%%J%%%j%J%%%%%%%%j%%%%%%Jj%%J%j%J%%%%%jj%J%J%%%%%%%
6918A15j%%%j%%%J%%%%J%%%j%%%%%JjJ%J%%%j%%%%%%%%%%J%%j%%%%%%jJ%%%J%%%%jJ%%%%%
6911A16%%jJ%j%%%%%%%%%%J%%j%%Jj%%%%%%%%J%j%%%%%%%%%%%%%%%%%j%j%%%JJ%%j%%%%%J
6903A15J%%%%%%%%%%%J%%%jj%%%J%j%%%%j%%%%J%%J%j%%%J%%%jJ%j%%%%J%%%%%%jJJj%%%%
6896A16%jj%%J%J%j%%%%%%%%%J%%j%%%%J%%j%%Jj%J%j%j%J%%%%%J%j%%%%%%%%j%%%J%%J%%
6889A16j%%%J%%%%j%%%%jJ%%%%%%%j%%J%J%%j%%%%%%%%%%%j%%%J%%%%%%JJ%%%%jj%j%%%%%
$$ y = [116, 115, 115, 115, 115, 115, 114, 115, 115, 115, 115, 115, 115, 115, 115, 116, 116, 116, 116, 116, 116, 116, 116, 116, 116, 116, 116, 115, 115, 114, 113, 114, 114, 115, 115, 115, 115, 114, 115, 115, 116, 116, 115, 115, 115, 115, 115, 115, 115, 114, 115, 115, 115, 115, 115, 115, 115, 115, 115, 115, 115, 115, 115, 115, 116, 115, 115, 115, 115, 115, 116, 116, 115, 115, 115, 115, 114, 114, 115, 115, 115, 115, 115, 115, 116, 116, 116, 116, 116, 116, 116, 115, 115, 115, 115, 115, 114, 114, 114, 114, 114, 114, 114, 114, 114, 114, 114, 114, 114, 114, 114, 115, 115, 114, 114, 114, 114, 114, 115, 115, 115, 115, 115, 115, 115, 115, 115, 115, 115, 115, 115, 115, 115, 114, 114, 114, 115, 115, 115, 116, 115, 115, 115, 115, 115, 115, 115, 115, 115, 116, 116, 116, 116, 115, 115, 115, 114, 114, 114, 115, 115, 115, 115, 114, 114, 115, 115, 115, 115, 115, 115, 115, 115, 115, 114, 114, 114, 114, 114, 114, 114, 115, 114, 114, 114, 115, 115, 114, 114, 115, 115, 115, 115, 115, 115, 114, 113, 113, 114, 114, 115, 115, 115, 115, 115, 115, 115, 115, 114, 114, 114, 114, 113, 113, 113, 113, 114, 114, 114, 114, 114, 115, 115, 115, 115, 114, 114, 114, 114, 114, 114, 115, 114, 115, 115, 116, 116, 116, 116, 115, 115, 115, 115, 115, 115, 115, 115, 115, 115, 115, 116, 116, 116, 115, 115, 115, 115, 115, 115, 115, 114, 115, 115, 115, 115, 116, 116, 116, 116, 116, 115, 116, 116, 116, 116, 116, 116, 116, 116, 115, 116, 116, 115, 115, 115, 115, 115, 115, 115, 115, 115, 115, 115, 116, 116, 116, 115, 115, 115, 116, 115, 115, 115, 115, 115, 115, 115, 115, 115, 116, 116, 115, 115, 115, 115, 115, 115, 115, 115, 115, 115, 115, 115, 115, 115, 115, 115, 115, 115, 114, 114, 113, 113, 113, 113, 114, 115, 115, 115, 114, 114, 114, 114, 114, 114, 115, 116, 116, 116, 116, 116, 116, 116, 116, 116, 116, 116, 116, 117, 117, 117, 117, 116, 115, 115, 115, 115, 116, 116, 115, 115, 115, 115, 115, 114, 114, 114, 114, 114, 115, 115, 115, 116, 116, 115, 115, 115, 115, 116, 116, 116, 116, 115, 116, 116, 115, 115, 115, 115, 115, 116, 116, 116, 116, 116, 116, 116, 115, 116, 117, 116, 116, 116, 116, 116, 116, 115, 114, 114, 114, 115, 115, 116, 116, 115, 115, 115, 115, 115, 115, 115, 115, 115, 115, 116, 116, 116, 115, 115, 115, 115, 115, 116, 116, 116, 115, 115, 115, 116, 115, 115, 116, 116, 115, 115, 114, 114, 115, 115, 115, 115, 115, 115, 116, 116, 115, 115, 115, 115, 115, 115, 115, 115, 115, 114, 114, 114, 114, 115, 115, 115, 116, 116, 116, 115, 115, 115, 115, 116, 116, 116, 116, 116, 115, 115, 115, 115, 115, 114, 115, 115, 115, 115, 115, 115, 115, 115, 114, 114, 114, 115, 115, 116, 116, 116, 115, 115, 115, 115, 115, 115, 115, 115, 115, 115, 115, 115, 114, 114, 114, 114, 115, 115, 115, 115, 115, 115, 115, 116, 117, 117, 117, 117, 117, 116, 115, 115, 114, 114, 114, 114, 114, 114]
6881A14%%%%%%%%J%%%%Jj%%%%%%%%J%%j%%%%%j%%%JJj%%j%%%%%Jj%j%%%J%%%%%%%%J%%%j%
6874A14%%Jjj%j%%%%%%%%%%J%%Jj%%j%J%%%%%%%%%%J%%%%J%%%%%%%%%J%%j%%%JjJ%%%%%%%
6867A16j%%J%%%%%%J%%%%%%%%%%%j%%%%%%%j%j%%J%J%j%%%%%%%J%j%j%%J%j%%%%J%J%%%%%
6859A16%%%%%%j%J%j%jj%J%Jj%%%%J%%%%%%%%%%%J%%%%%jJ%%j%%Jj%%%%%%%%j%%J%%%%jJ%
6852A15%j%%%%%%%%J%%jJ%%%%%%%%J%%%%%%%%%j%J%%%%%j%%%%J%%%%%%j%%%%%%%%%%J%%%%
6845A16%%j%%%%%%%%%%%j%%%J%%%J%%j%%%%%%%J%jJ%%j%%%%%%%%%%%J%%j%j%%%%%J%%J%%%
6837A16%%%%j%%J%%%%%%j%jj%J%%%%%%%J%%%%%%%j%%%%%%%%J%%j%%%%%%J%%%%%%%jj%J%%%
6830A14%J%%j%%%%J%%%j%J%%%%%%%%%%j%j%J%%%%%%%%J%%%%%%%%%%%%%%%%%%%j%%%%%%J%j
$$ y = [114, 114, 114, 114, 114, 114, 114, 114, 114, 115, 115, 115, 115, 115, 116, 115, 115, 115, 115, 115, 115, 115, 115, 115, 116, 116, 116, 115, 115, 115, 115, 115, 115, 114, 114, 114, 114, 115, 116, 115, 115, 115, 114, 114, 114, 114, 114, 114, 115, 114, 114, 113, 113, 113, 113, 114, 114, 114, 114, 114, 114, 114, 114, 114, 115, 115, 115, 115, 114, 114, 114, 114, 115, 114, 113, 113, 112, 112, 112, 112, 112, 112, 112, 112, 112, 112, 112, 113, 113, 113, 114, 113, 113, 113, 112, 112, 113, 113, 113, 113, 113, 113, 113, 113, 113, 113, 113, 114, 114, 114, 114, 114, 115, 115, 115, 115, 115, 115, 115, 115, 115, 115, 116, 116, 116, 115, 115, 115, 115, 116, 115, 116, 116, 116, 116, 116, 116, 116, 116, 115, 115, 115, 116, 116, 116, 116, 116, 116, 116, 117, 117, 117, 117, 117, 117, 117, 117, 117, 117, 117, 117, 116, 116, 116, 116, 116, 116, 116, 116, 115, 115, 114, 114, 114, 115, 115, 116, 116, 115, 115, 115, 115, 115, 115, 115, 115, 116, 116, 115, 115, 114, 114, 114, 115, 115, 114, 114, 114, 114, 114, 115, 115, 116, 116, 116, 116, 116, 116, 116, 116, 116, 116, 116, 116, 115, 115, 116, 116, 115, 115, 114, 113, 113, 114, 114, 115, 114, 114, 114, 114, 114, 115, 115, 115, 115, 115, 115, 115, 115, 115, 115, 115, 115, 116, 116, 116, 116, 116, 116, 115, 116, 116, 116, 115, 115, 115, 116, 115, 115, 115, 115, 115, 115, 115, 115, 115, 114, 114, 114, 115, 115, 115, 115, 115, 114, 115, 115, 115, 114, 114, 114, 114, 114, 114, 114, 114, 114, 115, 115, 115, 114, 115, 115, 115, 115, 115, 115, 115, 115, 115, 116, 116, 116, 116, 116, 116, 116, 116, 116, 116, 115, 115, 116, 116, 116, 116, 116, 116, 115, 115, 115, 115, 115, 116, 116, 116, 116, 116, 116, 116, 115, 115, 115, 115, 115, 115, 115, 115, 115, 115, 115, 116, 116, 116, 116, 116, 116, 116, 115, 115, 115, 115, 115, 115, 115, 115, 115, 115, 115, 115, 114, 114, 114, 114, 115, 115, 115, 115, 116, 116, 116, 115, 115, 115, 115, 115, 115, 115, 115, 116, 116, 115, 116, 116, 116, 115, 115, 115, 115, 115, 115, 115, 115, 115, 115, 115, 115, 116, 116, 116, 115, 115, 114, 114, 114, 114, 114, 114, 115, 115, 115, 116, 116, 116, 116, 116, 116, 116, 116, 115, 115, 115, 116, 116, 116, 116, 116, 116, 116, 115, 115, 114, 113, 113, 114, 114, 114, 114, 114, 114, 114, 114, 115, 115, 115, 115, 115, 115, 115, 115, 114, 114, 114, 114, 114, 114, 114, 114, 114, 115, 115, 115, 114, 114, 114, 114, 114, 114, 114, 115, 115, 115, 115, 115, 115, 115, 115, 114, 113, 113, 114, 114, 114, 114, 114, 115, 115, 115, 114, 114, 114, 114, 114, 115, 115, 115, 115, 114, 114, 115, 115, 115, 115, 115, 115, 115, 115, 115, 115, 115, 114, 114, 113, 113, 114, 114, 114, 114, 114, 114, 114, 114, 114, 115, 115, 115, 115, 115, 115, 115, 115, 115, 115, 115, 115, 115, 115, 115, 115, 115, 115, 115, 115, 114, 114, 114, 114, 114, 114, 114, 115, 115, 114]
6823A14%%%%j%J%j%J%%%%%%%%JJj%%%%%%%%j%%%%%%%%%%%Jj%%J%%%%j%%%%%%J%%%%%%j%jJ
6815A14%%JjJ%%%%%%%%j%J%%j%%%J%Jj%%%%%j%%%%%%J%%%%j%%%J%%%%%%%%Jj%j%%%jJ%Jj%
6808A14%%%%Jj%%%%JJ%%%j%%j%%%%%J%%%%%j%%%%%%%%%%J%%%%J%%j%%%%j%%%%J%Jj%j%%j%
6801A13J%%%%%%jJ%J%j%%%%%J%j%%%%J%%%%j%%%%%J%%%j%%%%%jJ%J%jj%%%%J%%%%%%%%%%%
6794A14%%%J%%%j%%%%%jJ%%%%%%%%jJJ%j%%%%%J%%jj%%%%J%%%%Jj%jJ%%%Jj%%%J%%%%%j%%
6786A14%%%%%%%%%%J%%%j%%%%%%%Jj%%%%%%%%%J%%%j%%%%%%%%%%%%%J%%%%%%%jJ%%Jj%%%%
6779A15%%%%%j%%%%%%%%J%%%%%%%j%J%%J%%j%%Jjj%j%%%j%J%%J%%%%%%%%%%%%J%J%jj%%%j
6772A13J%J%%jj%J%%%%Jj%%j%JJ%J%%%%j%%j%%jj%J%%JJ%%j%%%%%jJJ%%%%%%j%%%%%%%%%%
$$ y = [114, 114, 114, 114, 114, 113, 113, 114, 114, 113, 113, 114, 114, 114, 114, 114, 114, 114, 114, 114, 115, 116, 115, 115, 115, 115, 115, 115, 115, 115, 115, 114, 114, 114, 114, 114, 114, 114, 114, 114, 114, 114, 114, 115, 114, 114, 114, 115, 115, 115, 115, 115, 114, 114, 114, 114, 114, 114, 114, 115, 115, 115, 115, 115, 115, 115, 114, 114, 113, 114, 114, 114, 115, 114, 115, 115, 115, 115, 115, 115, 115, 115, 115, 114, 114, 115, 115, 115, 114, 114, 114, 114, 115, 115, 116, 115, 115, 115, 115, 115, 115, 114, 114, 114, 114, 114, 114, 114, 115, 115, 115, 115, 115, 114, 114, 114, 114, 115, 115, 115, 115, 115, 115, 115, 115, 115, 116, 115, 115, 114, 114, 114, 114, 113, 114, 114, 115, 114, 114, 114, 114, 114, 114, 115, 114, 114, 114, 114, 114, 115, 116, 116, 116, 116, 115, 115, 115, 114, 114, 114, 114, 114, 114, 115, 115, 115, 115, 115, 115, 114, 114, 114, 114, 114, 114, 114, 114, 114, 114, 114, 115, 115, 115, 115, 115, 116, 116, 116, 115, 115, 115, 115, 115, 114, 114, 114, 114, 114, 115, 115, 116, 115, 115, 114, 114, 114, 113, 113, 114, 114, 114, 114, 114, 114, 114, 113, 114, 114, 115, 115, 114, 114, 114, 114, 114, 114, 115, 115, 114, 114, 114, 114, 114, 115, 115, 115, 115, 115, 114, 114, 114, 114, 114, 114, 115, 115, 115, 115, 114, 114, 114, 114, 114, 114, 113, 114, 114, 115, 115, 114, 113, 113, 113, 113, 113, 114, 114, 114, 114, 114, 114, 114, 114, 114, 114, 114, 114, 114, 114, 114, 115, 115, 115, 115, 114, 114, 114, 114, 114, 114, 113, 114, 114, 114, 114, 114, 114, 114, 114, 114, 113, 114, 115, 115, 114, 114, 114, 114, 114, 114, 115, 115, 115, 114, 113, 113, 113, 113, 113, 114, 114, 114, 114, 114, 115, 114, 114, 113, 114, 114, 114, 114, 115, 114, 114, 114, 114, 115, 115, 115, 115, 115, 115, 114, 114, 114, 114, 114, 114, 114, 114, 114, 114, 114, 114, 114, 115, 115, 115, 115, 114, 114, 114, 114, 114, 114, 114, 114, 115, 114, 114, 114, 114, 114, 114, 114, 114, 114, 114, 115, 115, 115, 115, 114, 114, 114, 114, 114, 114, 114, 114, 114, 114, 114, 114, 114, 114, 115, 115, 115, 115, 115, 115, 115, 115, 114, 115, 115, 115, 116, 115, 115, 115, 115, 115, 115, 115, 115, 115, 115, 114, 114, 114, 114, 114, 114, 114, 114, 114, 115, 115, 115, 115, 115, 115, 115, 115, 114, 114, 115, 115, 115, 116, 116, 116, 115, 115, 115, 116, 115, 114, 114, 113, 113, 113, 113, 112, 112, 113, 113, 113, 114, 114, 114, 114, 114, 114, 114, 114, 114, 114, 114, 114, 114, 115, 115, 116, 116, 115, 114, 114, 114, 114, 113, 114, 114, 115, 115, 115, 114, 113, 113, 114, 114, 114, 114, 114, 115, 114, 114, 114, 113, 113, 114, 115, 115, 116, 116, 116, 116, 116, 115, 115, 115, 114, 114, 114, 113, 112, 112, 113, 113, 113, 114, 115, 115, 115, 114, 114, 114, 114, 114, 114, 113, 114, 115, 115, 115, 115, 115, 115, 115, 114, 114, 114, 114, 114, 114, 114, 114, 114, 114, 114]
6764A14J%%j%%J%%%j%%%%%Jj%%%%%%%%%%j%j%%Jj%J%J%%%%%%%%%%j%J%%%%jJ%%J%%%%j%%%
6757A14%%%j%%J%%%%%%Jj%%%J%%%%j%%%j%%J%%%%j%J%%%%%%%%J%j%%J%%%jJ%j%%%J%%Jjj%
6750A14%%%%%%jJ%%%%%%%%%%Jj%%%j%J%%J%%j%j%%%%%J%%%%%J%%%%%j%%%%Jj%%jj%%JJ%%J
6742A15jj%%%%J%%%Jj%j%%%%%JJ%j%%%%%%%%%jJ%%j%%j%%J%%%%%%J%%%%%%J%%%j%J%%j%%J
6735A15%%%%jJ%%%j%%%%%%Jj%jJ%%%J%%%%%%%%%j%%%j%J%j%J%%%%%Jj%%%%%%%%j%%%%%%%J
6728A14%%%J%%%%%j%%%Jj%%%%J%%%%%%%%%%j%J%j%%%%%%%%j%%%%J%%%%%%%%Jj%%%%%j%%j%
6720A12%JJ%j%%%%%J%jj%J%%j%%%%J%%Jj%JJj%%%%%%%%%%%%j%%%%%%%Jj%%%%%%%%J%%%%j%
6713A13%%%%j%%J%%%%j%%JJJ%%j%j%%%%J%%%%%%%%%%%%%%%J%%%j%j%%%Jj%%%%%%%%J%%j%%
$$ y = [114, 115, 115, 115, 114, 114, 114, 115, 115, 115, 115, 114, 114, 114, 114, 114, 114, 115, 114, 114, 114, 114, 114, 114, 114, 114, 114, 114, 114, 113, 113, 112, 112, 112, 113, 112, 112, 113, 113, 114, 114, 114, 114, 114, 114, 114, 114, 114, 114, 114, 113, 113, 114, 114, 114, 114, 114, 113, 114, 114, 114, 115, 115, 115, 115, 115, 114, 114, 114, 114, 114, 114, 114, 113, 113, 113, 114, 114, 114, 114, 114, 114, 114, 115, 114, 114, 114, 114, 115, 115, 115, 115, 115, 114, 114, 114, 114, 113, 113, 113, 114, 114, 114, 114, 114, 113, 113, 114, 114, 114, 114, 114, 114, 114, 114, 114, 115, 115, 114, 114, 114, 115, 115, 115, 115, 114, 115, 115, 114, 114, 114, 114, 115, 115, 115, 116, 115, 114, 114, 114, 114, 114, 114, 114, 114, 113, 114, 114, 114, 114, 114, 114, 114, 114, 114, 114, 114, 115, 114, 114, 114, 114, 113, 113, 114, 114, 114, 115, 115, 115, 114, 114, 113, 113, 113, 113, 113, 113, 114, 114, 114, 114, 114, 114, 115, 115, 115, 115, 115, 115, 114, 114, 114, 114, 114, 115, 114, 114, 114, 113, 112, 112, 112, 113, 114, 114, 114, 115, 114, 113, 113, 113, 113, 113, 114, 114, 114, 114, 115, 114, 114, 113, 113, 113, 113, 113, 113, 114, 115, 115, 114, 114, 114, 114, 114, 114, 114, 114, 114, 114, 113, 114, 114, 114, 113, 113, 113, 112, 112, 112, 113, 113, 113, 113, 113, 113, 113, 114, 114, 114, 114, 114, 114, 114, 115, 115, 115, 115, 114, 114, 115, 115, 115, 114, 114, 114, 115, 115, 115, 115, 115, 114, 115, 115, 115, 115, 114, 114, 114, 114, 114, 114, 114, 115, 114, 114, 113, 114, 114, 114, 114, 115, 115, 115, 115, 115, 115, 115, 115, 115, 115, 114, 114, 114, 114, 113, 113, 114, 114, 113, 113, 114, 114, 114, 114, 114, 114, 115, 114, 114, 114, 114, 114, 114, 114, 114, 114, 113, 113, 113, 113, 113, 113, 113, 113, 114, 114, 114, 114, 115, 115, 115, 115, 115, 115, 114, 114, 114, 114, 115, 114, 114, 114, 114, 114, 115, 115, 115, 115, 115, 115, 115, 115, 115, 115, 115, 114, 114, 115, 115, 114, 114, 114, 114, 114, 114, 114, 114, 114, 113, 113, 113, 113, 113, 114, 114, 114, 114, 114, 114, 114, 114, 114, 115, 114, 114, 114, 114, 114, 114, 113, 113, 113, 112, 112, 112, 113, 114, 114, 113, 113, 113, 113, 113, 113, 114, 114, 113, 112, 112, 113, 113, 113, 112, 112, 112, 112, 112, 113, 113, 113, 114, 113, 113, 114, 115, 114, 114, 114, 114, 114, 114, 114, 114, 114, 114, 114, 114, 114, 113, 113, 113, 113, 113, 113, 113, 113, 114, 113, 113, 113, 113, 113, 113, 113, 113, 113, 114, 114, 114, 114, 114, 113, 113, 113, 113, 113, 113, 112, 112, 112, 113, 113, 113, 113, 113, 112, 112, 112, 113, 114, 115, 115, 115, 114, 114, 113, 113, 113, 113, 113, 114, 114, 114, 114, 114, 114, 114, 114, 114, 114, 114, 114, 114, 114, 114, 114, 115, 115, 115, 115, 114, 114, 113, 113, 113, 113, 114, 113, 113, 113, 113, 113, 113, 113, 113, 113, 114, 114, 114, 113, 113, 113]
6706A13%J%J%%%j%%%%%%%jJ%j%%J%%%%%%%%%%%%%%%%J%j%%Jj%%%%J%jj%%%%J%%%%%%jjjJ%
6699A12%%J%J%Jj%j%J%%%j%%%J%%%J%%%%%j%j%%%%%%%Jj%%%%%J%%j%%%%J%%%%%%j%j%JJ%%
6691A14%j%%J%Jj%%%%%%%jJ%%%%%j%%%j%%%%J%%j%J%%J%j%%%J%%%%%%Jj%%%J%%j%j%%%%J%
6684A14%j%%%j%%J%J%%j%%%%%%%%j%J%%%J%%j%%%%J%%%%%%j%J%%%%%j%%j%J%J%%%%%%%%%%
6677A14%%j%J%%j%%%%%%%J%%j%%%j%J%%%%%%%%%%%%%%%%%%%%%%%%%%J%j%j%J%%%%%%J%J%%
6669A15jj%%%J%jJj%%%%j%j%%J%%J%%%%J%%%j%%J%j%%%%%J%%%%%j%%J%%%%%%jJJ%%jj%%%%
6662A13%%J%%%j%%J%%%%%%j%%%%%%%%%%%jJ%J%%%%%%%%%%j%J%%%J%%j%%j%%%%%%%%%%%%jJ
6655A13%%JjJ%jJ%%j%%%%%J%%%%%%%%%%%%j%%J%%%Jj%%%%%%%%%%%%jJ%Jj%%j%%%J%%%%%%j
$$ y = [113, 113, 114, 114, 115, 115, 115, 115, 114, 114, 114, 114, 114, 114, 114, 114, 113, 114, 114, 113, 113, 113, 114, 114, 114, 114, 114, 114, 114, 114, 114, 114, 114, 114, 114, 114, 114, 114, 114, 115, 115, 114, 114, 114, 115, 114, 114, 114, 114, 114, 115, 115, 114, 113, 113, 113, 113, 113, 114, 114, 114, 114, 114, 114, 114, 113, 112, 111, 112, 112, 112, 112, 113, 113, 114, 114, 115, 114, 114, 113, 113, 114, 114, 114, 114, 113, 113, 113, 113, 114, 114, 114, 114, 115, 115, 115, 115, 115, 115, 114, 114, 113, 113, 113, 113, 113, 113, 113, 113, 114, 113, 113, 113, 113, 113, 113, 114, 114, 114, 113, 113, 113, 113, 113, 114, 114, 114, 114, 114, 114, 114, 113, 113, 112, 112, 113, 114, 114, 114, 114, 113, 113, 113, 114, 114, 115, 114, 114, 114, 114, 114, 114, 114, 114, 113, 114, 114, 114, 114, 114, 114, 113, 113, 113, 113, 112, 112, 112, 112, 112, 113, 113, 113, 112, 112, 113, 113, 113, 114, 114, 113, 113, 113, 113, 114, 114, 114, 114, 114, 114, 114, 115, 114, 114, 114, 114, 115, 115, 115, 114, 114, 113, 113, 113, 113, 113, 114, 114, 114, 113, 113, 113, 113, 112, 112, 112, 113, 113, 114, 114, 114, 113, 113, 113, 113, 113, 113, 113, 113, 113, 112, 112, 113, 113, 113, 113, 114, 114, 114, 113, 113, 113, 113, 113, 114, 114, 114, 114, 114, 114, 114, 113, 113, 114, 114, 114, 114, 114, 114, 113, 113, 113, 112, 112, 113, 113, 114, 114, 114, 114, 114, 114, 114, 114, 114, 114, 114, 114, 114, 113, 113, 114, 114, 114, 113, 113, 113, 113, 113, 113, 113, 113, 114, 114, 114, 113, 113, 113, 113, 112, 112, 113, 113, 113, 113, 113, 113, 113, 113, 113, 113, 113, 113, 113, 113, 113, 113, 113, 113, 113, 113, 113, 113, 113, 113, 113, 113, 113, 114, 114, 113, 113, 112, 112, 113, 113, 113, 113, 113, 113, 113, 114, 114, 115, 115, 115, 114, 113, 113, 113, 113, 114, 114, 113, 114, 113, 113, 113, 113, 113, 112, 112, 111, 111, 111, 112, 112, 112, 113, 113, 113, 113, 113, 114, 114, 114, 114, 113, 113, 113, 114, 114, 113, 113, 113, 113, 113, 113, 114, 114, 114, 114, 114, 114, 113, 113, 113, 114, 114, 114, 114, 114, 114, 114, 113, 114, 115, 115, 115, 114, 113, 113, 113, 113, 113, 113, 113, 114, 114, 114, 114, 113, 113, 113, 114, 114, 114, 114, 114, 114, 114, 113, 113, 113, 113, 113, 113, 113, 113, 113, 113, 113, 113, 112, 113, 113, 114, 114, 114, 114, 114, 114, 114, 114, 114, 114, 114, 113, 113, 114, 114, 114, 114, 115, 115, 115, 114, 114, 114, 113, 113, 113, 113, 113, 113, 113, 113, 113, 113, 113, 113, 113, 112, 113, 113, 113, 114, 113, 114, 114, 113, 114, 114, 114, 113, 113, 113, 113, 113, 113, 114, 114, 114, 114, 114, 114, 114, 114, 114, 114, 114, 114, 114, 113, 113, 113, 114, 114, 114, 114, 115, 114, 114, 114, 114, 114, 114, 114, 114, 114, 114, 114, 114, 114, 113, 114, 114, 115, 114, 114, 114, 113, 113, 113, 113, 114, 114, 114, 114, 114, 114, 114, 113]
6647A13%%%j%%J%j%%%J%%%%%%j%J%Jj%J%%%j%j%%%J%%jJ%%%%%J%%J%%j%%%j%%%%%%J%j%%%
6640A13%%%%j%%%%%jJ%Jj%%J%%%%%%%%%%%%%%Jj%%%%%%%J%j%%%j%jJ%Jj%%%%J%%%%%%%%%%
6633A13%%%%Jjj%%J%%%%%j%%J%j%J%%%%%%J%%%%%j%%%jJ%%%%j%j%J%%J%%%%Jj%JjJ%%%%%%
6625A14%%%j%%%%%J%%j%%%%%%J%j%J%%%%%%j%%%%j%%%%%%%J%%%%%%Jjj%%%%%%%%j%J%%%%%
6618A12%%%%%J%%%%j%%%%%%%%%%%%%%%J%%j%%J%%%%J%%%Jjj%j%%%%%%%%%J%%%%%%%Jj%JJj
6611A14j%%%%%j%%j%J%%j%J%%%%%%%%%J%%j%JJ%%jj%%%%J%Jj%%%Jj%%J%%j%%jJ%%%j%J%%%
6603A13%%%%%%%%%%%%%%%%%%%%%%%%%%%%%%%%%%%%%J%J%%jj%%%jJ%%%%%j%%%%J%%%%%%%%%
6596A13%%%%%%%%%%%%%%%j%%%J%%%j%j%%%%J%%%%%%%%J%%%%%%j%%J%%j%%%%%%%%%%%%%J%%
$$ y = [113, 113, 113, 113, 112, 112, 112, 113, 113, 112, 112, 112, 112, 113, 113, 113, 113, 113, 113, 113, 112, 112, 113, 113, 114, 113, 113, 114, 114, 114, 114, 113, 113, 112, 112, 112, 112, 113, 113, 113, 112, 113, 113, 113, 113, 113, 113, 114, 114, 114, 115, 115, 115, 114, 114, 114, 114, 113, 113, 113, 113, 113, 113, 113, 114, 114, 113, 113, 113, 113, 113, 113, 113, 113, 112, 112, 112, 112, 112, 112, 111, 112, 112, 113, 112, 112, 112, 113, 113, 113, 113, 113, 113, 113, 113, 113, 113, 113, 113, 113, 113, 113, 114, 113, 113, 113, 113, 113, 113, 113, 113, 114, 114, 113, 113, 113, 113, 112, 112, 111, 112, 112, 113, 112, 112, 112, 112, 112, 113, 113, 113, 113, 113, 113, 113, 113, 113, 113, 113, 113, 113, 113, 113, 114, 113, 112, 112, 112, 113, 113, 113, 113, 113, 113, 112, 112, 112, 113, 113, 112, 112, 113, 113, 113, 113, 113, 113, 113, 114, 114, 114, 114, 114, 114, 113, 113, 113, 113, 112, 113, 113, 113, 113, 113, 112, 112, 111, 111, 112, 112, 112, 113, 113, 113, 113, 113, 114, 113, 113, 114, 113, 114, 114, 114, 114, 114, 114, 114, 114, 114, 114, 113, 113, 113, 113, 113, 113, 114, 114, 114, 113, 113, 113, 113, 113, 113, 113, 114, 114, 113, 113, 114, 114, 114, 114, 114, 114, 114, 113, 113, 113, 113, 113, 112, 112, 112, 112, 112, 112, 112, 112, 113, 113, 113, 113, 113, 113, 113, 114, 113, 112, 112, 112, 112, 112, 112, 112, 112, 112, 111, 111, 112, 112, 112, 112, 112, 112, 112, 112, 112, 112, 112, 113, 113, 113, 113, 113, 112, 112, 112, 112, 112, 112, 112, 112, 112, 112, 112, 112, 112, 112, 112, 112, 113, 113, 113, 112, 112, 112, 113, 113, 113, 113, 113, 114, 114, 114, 114, 115, 114, 113, 113, 112, 112, 112, 112, 112, 112, 112, 112, 112, 112, 113, 113, 113, 113, 113, 113, 113, 113, 114, 113, 113, 114, 115, 114, 113, 113, 113, 113, 113, 113, 112, 112, 112, 111, 111, 112, 112, 112, 111, 111, 112, 112, 112, 112, 112, 112, 112, 112, 112, 112, 113, 113, 113, 112, 112, 113, 114, 114, 114, 113, 112, 112, 112, 112, 112, 113, 113, 114, 113, 113, 113, 113, 114, 113, 113, 113, 114, 114, 114, 113, 113, 113, 112, 113, 113, 113, 113, 112, 112, 113, 113, 113, 113, 113, 113, 113, 113, 113, 113, 113, 113, 113, 113, 113, 113, 113, 113, 113, 113, 113, 113, 113, 113, 113, 113, 113, 113, 113, 113, 113, 113, 113, 113, 113, 113, 113, 113, 113, 113, 113, 114, 114, 115, 115, 115, 114, 113, 113, 113, 113, 112, 113, 113, 113, 113, 113, 113, 112, 112, 112, 112, 112, 113, 113, 113, 113, 113, 113, 113, 113, 113, 113, 113, 113, 113, 113, 113, 113, 113, 113, 113, 113, 113, 113, 113, 113, 113, 112, 112, 112, 112, 113, 113, 113, 113, 112, 112, 111, 111, 111, 111, 111, 112, 112, 112, 112, 112, 112, 112, 112, 112, 113, 113, 113, 113, 113, 113, 113, 112, 112, 112, 113, 113, 113, 112, 112, 112, 112, 112, 112, 112, 112, 112, 112, 112, 112, 112, 112, 113, 113, 113]
6589A13jJj%j%jJ%JJ%%%%%j%%%%%%J%j%%%Jj%%%%J%j%%%jJJ%%%j%J%j%J%%%jJ%%%%%%%%%%
6582A13%%%%%%%j%%%jJ%%%J%%%%jj%J%%%%%%%%J%%j%J%%jj%%%%%J%%%%%%J%%%%jJ%%%j%%J
6574A13%%%j%%%%%%%%%J%jJ%%%%%%%%j%%j%%J%jJ%Jj%%J%%%j%%%%%%%%j%%J%%%%%%%%%J%%
6567A13%%j%%%%%%%%J%%%j%%J%%%j%%%%%%%Jj%%%%%J%%%%%%j%%%%J%%%%%j%%%%%%J%%%j%%
6560A12%%%%%j%%%J%%%%%j%JJ%%%%j%%j%%%%%%%%%%%%JJ%%%%j%%%jJJ%%%j%J%j%%%%%%%%%
6552A12%%%%%%%%j%jJ%J%%%%%J%%%j%%%%%%%%%j%%%%%Jj%%%%%%JJ%j%%%%%%%j%J%J%jj%%%
6545A11%%%%%%J%%%%%J%%%j%%%J%%j%%%%jJ%%%%%%j%%%%J%%J%J%%%j%J%jj%%%%%%j%J%%%%
6538A12J%%j%%%%%%%%%%%%%%%%%%%%%%%%%j%%J%j%%j%%J%J%j%%J%j%%%%%%%J%%%%J%%j%%%
$$ y = [113, 112, 113, 112, 112, 111, 111, 110, 111, 111, 112, 113, 113, 113, 113, 113, 113, 112, 112, 112, 112, 112, 112, 112, 113, 113, 112, 112, 112, 112, 113, 112, 112, 112, 112, 112, 113, 113, 112, 112, 112, 112, 111, 112, 113, 113, 113, 113, 112, 112, 113, 113, 112, 112, 113, 113, 113, 113, 112, 113, 113, 113, 113, 113, 113, 113, 113, 113, 113, 113, 113, 113, 113, 113, 113, 113, 113, 112, 112, 112, 112, 111, 112, 112, 112, 112, 113, 113, 113, 113, 113, 112, 111, 111, 112, 112, 112, 112, 112, 112, 112, 112, 112, 113, 113, 113, 112, 112, 113, 113, 113, 112, 111, 111, 111, 111, 111, 111, 112, 112, 112, 112, 112, 112, 112, 113, 113, 113, 113, 113, 112, 113, 113, 113, 113, 112, 112, 112, 113, 113, 113, 113, 112, 112, 112, 112, 112, 112, 112, 112, 112, 112, 113, 113, 112, 113, 113, 113, 113, 113, 113, 113, 113, 113, 112, 112, 112, 111, 111, 111, 112, 112, 111, 112, 112, 113, 112, 112, 112, 113, 113, 113, 113, 112, 112, 112, 112, 112, 112, 112, 112, 112, 111, 111, 111, 112, 112, 112, 112, 112, 112, 112, 112, 112, 112, 113, 113, 113, 113, 113, 112, 112, 112, 112, 112, 112, 112, 112, 112, 113, 113, 113, 113, 112, 112, 112, 113, 113, 113, 113, 112, 112, 112, 112, 112, 112, 112, 112, 113, 112, 112, 112, 112, 112, 112, 113, 113, 113, 113, 113, 113, 113, 112, 112, 112, 112, 112, 113, 113, 113, 113, 113, 113, 112, 112, 112, 112, 112, 112, 112, 113, 113, 113, 113, 112, 112, 112, 112, 112, 112, 112, 112, 111, 111, 111, 111, 112, 112, 112, 112, 112, 112, 111, 111, 112, 113, 113, 113, 113, 113, 112, 112, 112, 111, 111, 111, 111, 111, 111, 111, 111, 111, 111, 111, 111, 111, 112, 113, 113, 113, 113, 113, 112, 112, 112, 112, 111, 112, 113, 113, 113, 113, 112, 112, 113, 113, 112, 112, 112, 112, 112, 112, 112, 112, 112, 112, 112, 112, 112, 112, 112, 112, 112, 112, 111, 111, 110, 111, 111, 112, 112, 112, 112, 112, 112, 113, 113, 113, 113, 112, 112, 112, 112, 112, 112, 112, 112, 112, 112, 111, 111, 111, 111, 111, 111, 112, 111, 111, 111, 111, 111, 111, 111, 112, 113, 113, 112, 112, 112, 112, 112, 112, 112, 112, 111, 111, 112, 112, 113, 113, 112, 111, 111, 111, 111, 111, 111, 111, 111, 111, 111, 112, 112, 112, 112, 112, 112, 113, 113, 113, 113, 112, 112, 112, 112, 113, 113, 113, 112, 112, 112, 112, 112, 111, 112, 112, 112, 112, 112, 112, 112, 111, 111, 111, 111, 111, 112, 112, 112, 113, 113, 114, 114, 114, 114, 113, 113, 114, 114, 113, 112, 112, 112, 112, 112, 112, 112, 111, 111, 112, 112, 112, 112, 112, 113, 113, 113, 112, 112, 112, 112, 112, 112, 112, 112, 112, 112, 112, 112, 112, 112, 112, 112, 112, 112, 112, 112, 112, 112, 112, 112, 112, 112, 111, 111, 111, 112, 112, 111, 111, 111, 110, 110, 110, 111, 111, 112, 112, 111, 111, 111, 112, 112, 111, 111, 111, 111, 111, 111, 111, 111, 112, 112, 112, 112, 112, 113, 113, 113, 112, 112, 112, 112]
6530A12%%%%%j%%JJ%%%j%%%%J%%%%%%jj%J%%%%%%%%%%%%%%%%%%%j%%%J%J%j%%%J%j%%%j%%
6523A11%%J%j%%%%j%%J%%%%J%%%%j%j%%%J%%%%%Jj%j%%%J%J%%%%%%%%%j%%%%%%%%%%J%j%%
6516A11%%%%j%%%%J%%%jJ%%Jj%%j%%%%%%%J%j%J%%%%%%%%J%%jj%Jj%%%%%J%%%%J%%%%%j%%
6508A11%J%%%%%%%%%%%%%%%%%%j%%%Jj%%%%%%%%%%%%%%j%J%%j%%%%%%%%%%j%%%%J%%%%Jj%
6501A10%%%j%%%J%%j%J%%%%jJ%j%J%J%%j%%%%%J%%%j%%%J%%%%%%J%%%%%%%%Jj%%%%%%J%%%
6494A13%%%%%%%%j%%%%J%%%%%%%%%%J%%j%%%%%%j%%%%J%j%%j%%%%%J%%j%%J%%%%%j%%%%%J
6486A12%%%%%%Jj%%%j%%%%j%J%J%%%%%%%%%j%%%J%%%%j%%%%%%%%%%%%%j%%jJ%%%%JJ%%%%%
6479A12%%%%%%%%%%j%%%%%J%J%%j%%j%J%%%%j%%Jj%%%%%%%jJ%jJ%Jj%%%%%%%Jj%%%%J%j%j
$$ y = [112, 112, 112, 112, 112, 112, 111, 111, 111, 112, 113, 113, 113, 113, 112, 112, 112, 112, 112, 113, 113, 113, 113, 113, 113, 113, 112, 111, 111, 112, 112, 112, 112, 112, 112, 112, 112, 112, 112, 112, 112, 112, 112, 112, 112, 112, 112, 112, 112, 111, 111, 111, 111, 112, 112, 113, 113, 112, 112, 112, 112, 113, 113, 112, 112, 112, 112, 111, 111, 111, 111, 111, 112, 112, 111, 111, 111, 111, 111, 110, 110, 110, 111, 111, 111, 111, 111, 112, 112, 112, 112, 112, 111, 111, 110, 110, 110, 110, 111, 111, 111, 111, 111, 111, 112, 111, 111, 110, 110, 110, 110, 111, 111, 112, 112, 112, 112, 112, 112, 112, 112, 112, 112, 111, 111, 111, 111, 111, 111, 111, 111, 111, 111, 111, 112, 112, 111, 111, 111, 111, 111, 111, 111, 110, 110, 110, 110, 110, 111, 111, 111, 111, 110, 111, 111, 111, 112, 111, 111, 111, 110, 110, 110, 110, 110, 110, 110, 110, 111, 111, 110, 110, 111, 111, 111, 111, 111, 111, 111, 111, 111, 112, 112, 112, 111, 110, 110, 111, 110, 110, 110, 110, 110, 110, 111, 111, 111, 111, 111, 112, 112, 112, 112, 112, 112, 111, 111, 111, 111, 112, 112, 112, 112, 112, 112, 112, 112, 112, 112, 112, 112, 112, 112, 112, 112, 112, 112, 112, 111, 111, 111, 111, 112, 111, 111, 111, 111, 111, 111, 111, 111, 111, 111, 111, 111, 111, 111, 111, 110, 110, 111, 111, 111, 110, 110, 110, 110, 110, 110, 110, 110, 110, 110, 110, 109, 109, 109, 109, 109, 110, 110, 110, 110, 110, 111, 110, 110, 110, 110, 110, 109, 109, 109, 109, 110, 110, 110, 109, 109, 110, 110, 110, 110, 110, 109, 110, 110, 109, 109, 110, 110, 111, 111, 111, 110, 110, 110, 110, 110, 110, 111, 111, 111, 111, 110, 110, 110, 110, 111, 111, 111, 111, 111, 111, 111, 112, 112, 112, 112, 112, 112, 112, 112, 112, 113, 112, 112, 112, 112, 112, 112, 112, 113, 113, 113, 113, 113, 113, 113, 113, 113, 113, 113, 113, 112, 112, 112, 112, 112, 113, 113, 113, 113, 113, 113, 113, 113, 113, 113, 113, 114, 114, 114, 113, 113, 113, 113, 113, 113, 113, 112, 112, 112, 112, 112, 113, 113, 112, 112, 112, 111, 111, 111, 111, 111, 111, 112, 112, 112, 111, 111, 111, 112, 112, 112, 112, 112, 112, 111, 111, 111, 111, 111, 111, 112, 112, 112, 112, 112, 112, 112, 113, 112, 112, 112, 112, 111, 111, 111, 111, 111, 110, 110, 111, 111, 112, 112, 112, 112, 112, 112, 112, 112, 112, 112, 111, 111, 111, 111, 112, 112, 112, 112, 112, 111, 111, 111, 111, 111, 111, 111, 111, 111, 111, 111, 111, 111, 111, 110, 110, 110, 109, 110, 110, 110, 110, 110, 111, 112, 112, 112, 112, 112, 112, 112, 112, 112, 112, 112, 112, 112, 112, 112, 112, 111, 111, 111, 111, 111, 111, 112, 112, 113, 113, 113, 112, 112, 112, 111, 111, 112, 112, 112, 112, 112, 111, 111, 111, 112, 111, 111, 111, 111, 111, 111, 111, 111, 110, 111, 111, 110, 111, 111, 112, 111, 111, 111, 111, 111, 111, 111, 111, 112, 111, 111, 111, 111, 111, 112, 112, 111, 111, 110]
6472A10%%J%%%%%%%%jJ%%%%%%%%%%%%%%j%J%%%%%%%%%%%%J%%j%%%%%%JJj%%%%J%j%%%%%%J
6465A13%%%%%j%%%%%j%%%%J%%j%%%%%%%%%%%%J%%%%%%Jj%%%%%%%%%%%j%%%J%j%J%j%%jJJ%
6457A12%%%j%%%%%%%%%%Jj%%%JjJ%%%%%%j%%%%%%J%%%%jj%%J%%%%j%%%J%%%%%%%Jj%Jj%%%
6450A11%%%%%%%%%j%j%J%J%%%%J%j%%j%%%%%J%%%%%%j%%%J%%%%%J%%j%%%%%%j%%%%%%%%%J
6443A11%%j%j%J%%%%%%%%%%%%%%%Jj%J%%j%JJ%%%%%j%%Jjj%%J%%j%%%J%%%%%%%%Jj%%%%%%
6435A11%%%%jJ%%%%%%%%%jJj%J%%%%%J%%j%Jj%j%%%%%%%%j%%j%JJ%%%%%%%%%J%j%%%%%%%j
6428A09%%%%%J%%%%%j%%%%%%%%%%%%J%%%%%%%j%J%%%%%%%J%j%%%%Jj%%%%%%%%%%%%J%%%%j
6421A10%J%%%%%%%Jj%%%%%j%%%%J%%%%Jj%%%%%%%jJ%%%J%%%%%%%%%%%%%j%%%%jJ%%JJj%j%
$$ y = [110, 110, 110, 111, 111, 111, 111, 111, 111, 111, 111, 111, 110, 111, 111, 111, 111, 111, 111, 111, 111, 111, 111, 111, 111, 111, 111, 111, 110, 110, 111, 111, 111, 111, 111, 111, 111, 111, 111, 111, 111, 111, 111, 112, 112, 112, 111, 111, 111, 111, 111, 111, 111, 112, 113, 112, 112, 112, 112, 112, 113, 113, 112, 112, 112, 112, 112, 112, 112, 113, 113, 113, 113, 113, 113, 112, 112, 112, 112, 112, 112, 111, 111, 111, 111, 111, 112, 112, 112, 111, 111, 111, 111, 111, 111, 111, 111, 111, 111, 111, 111, 111, 112, 112, 112, 112, 112, 112, 112, 113, 112, 112, 112, 112, 112, 112, 112, 112, 112, 112, 112, 112, 111, 111, 111, 111, 112, 112, 111, 111, 112, 112, 111, 111, 111, 110, 111, 112, 112, 112, 112, 112, 111, 111, 111, 111, 111, 111, 111, 111, 111, 111, 111, 112, 111, 111, 111, 111, 112, 111, 112, 112, 112, 112, 112, 112, 112, 111, 111, 111, 111, 111, 111, 111, 112, 112, 112, 112, 112, 111, 110, 110, 110, 111, 111, 111, 111, 111, 110, 110, 110, 110, 111, 111, 111, 111, 111, 111, 111, 111, 112, 111, 111, 112, 111, 111, 111, 111, 111, 111, 111, 111, 111, 111, 111, 111, 111, 110, 110, 109, 109, 110, 110, 111, 111, 111, 111, 111, 112, 112, 111, 111, 111, 110, 110, 110, 110, 110, 110, 111, 111, 111, 111, 111, 111, 111, 110, 110, 110, 110, 111, 111, 111, 111, 111, 111, 112, 112, 112, 111, 111, 111, 111, 111, 111, 111, 110, 110, 110, 110, 110, 110, 110, 110, 110, 110, 111, 111, 111, 110, 110, 109, 109, 110, 110, 110, 110, 110, 110, 110, 110, 110, 110, 110, 110, 110, 110, 110, 110, 111, 110, 110, 111, 111, 111, 110, 110, 111, 112, 112, 112, 112, 112, 112, 111, 111, 111, 112, 111, 110, 110, 110, 111, 111, 111, 110, 110, 110, 110, 111, 111, 111, 111, 111, 111, 111, 111, 111, 112, 111, 111, 111, 111, 111, 111, 111, 111, 111, 111, 111, 110, 111, 111, 111, 111, 111, 111, 111, 111, 111, 111, 110, 111, 110, 110, 111, 111, 111, 111, 111, 111, 112, 112, 112, 111, 111, 112, 111, 111, 110, 110, 110, 110, 110, 110, 110, 110, 110, 109, 109, 109, 108, 108, 109, 110, 110, 110, 110, 110, 110, 110, 110, 110, 110, 111, 111, 110, 110, 110, 110, 110, 110, 110, 110, 109, 109, 109, 109, 109, 109, 110, 110, 110, 110, 110, 110, 109, 109, 109, 109, 109, 109, 109, 109, 109, 109, 109, 109, 109, 110, 110, 110, 110, 110, 110, 110, 110, 109, 109, 110, 110, 110, 110, 110, 110, 110, 110, 111, 111, 110, 110, 110, 110, 110, 111, 110, 110, 110, 110, 110, 110, 110, 110, 110, 110, 110, 110, 110, 111, 111, 111, 111, 111, 110, 110, 111, 111, 111, 111, 111, 111, 111, 111, 112, 111, 111, 111, 111, 111, 111, 110, 110, 110, 110, 110, 111, 111, 111, 111, 111, 112, 111, 111, 111, 111, 111, 111, 111, 111, 110, 111, 111, 111, 111, 112, 112, 112, 112, 112, 112, 112, 112, 112, 112, 112, 112, 112, 112, 111, 111, 111, 111, 111, 110, 111, 111, 111, 112, 113, 112, 112, 111, 111]
6413A11j%%J%%%%%%%%%J%j%%%jJ%%j%J%Jj%%%%%%%%%%%%%j%%J%%%j%%%%%%J%%%j%%%%J%%%
6406A11%j%%%%%%J%jJjJ%%%j%%jJ%J%Jjj%%J%j%%%%%%J%%j%%%J%%j%%J%%%%j%%%%%%%J%%j
6399A10%%%J%j%%Jj%%%%%%%J%j%J%%%jj%%%%J%%%J%J%%%%%%%j%%%%%%j%%%%%%%J%Jj%%%%%
6391A11%%%j%%%J%%%j%%%%%%j%J%J%%%%%j%Jj%%%%Jj%%%%%%%%j%%%%J%%Jj%J%%%%%%J%j%%
6384A11%%%%%%%%%%%%%%%%%%j%%%%%j%J%%%%%j%%%%%j%%%%%%%%%%%%%J%%%%j%%%J%%%%%%%
6377A09%%j%%%%%J%%%%%%j%J%%%%J%%j%J%%%%JJj%jJ%%%%%%j%J%%%%J%j%%%%J%%%%%%j%J%
6369A12%%%%%%%%j%%%j%J%%%%%%J%%j%jJ%%%%%%%%J%%j%%j%%%J%j%%%%%J%%%j%%%%%J%j%%
6362A10%%jJJ%J%%%j%%j%%%%%%%J%%%%%%%J%%%j%%jjJ%%%%J%j%%%%J%Jj%%%j%%%%%%%%J%%
$$ y = [111, 110, 110, 110, 111, 111, 111, 111, 111, 111, 111, 111, 111, 111, 112, 112, 111, 111, 111, 111, 110, 111, 111, 111, 110, 110, 111, 111, 112, 111, 111, 111, 111, 111, 111, 111, 111, 111, 111, 111, 111, 111, 111, 110, 110, 110, 111, 111, 111, 111, 110, 110, 110, 110, 110, 110, 110, 111, 111, 111, 111, 110, 110, 110, 110, 110, 111, 111, 111, 111, 111, 110, 110, 110, 110, 110, 110, 110, 111, 111, 110, 111, 110, 111, 111, 111, 111, 110, 110, 110, 109, 110, 110, 111, 111, 112, 111, 110, 110, 110, 111, 111, 110, 110, 110, 110, 110, 110, 110, 111, 111, 111, 110, 110, 110, 110, 111, 111, 111, 110, 110, 110, 111, 111, 111, 111, 111, 110, 110, 110, 110, 110, 110, 110, 110, 111, 111, 111, 110, 110, 110, 110, 111, 111, 110, 110, 110, 111, 110, 110, 110, 110, 110, 110, 110, 110, 111, 111, 110, 110, 111, 111, 111, 111, 110, 109, 109, 109, 109, 109, 110, 110, 110, 110, 111, 111, 112, 112, 112, 112, 112, 112, 112, 112, 111, 111, 111, 111, 111, 111, 111, 110, 110, 110, 110, 110, 110, 110, 110, 111, 111, 112, 111, 111, 111, 111, 111, 111, 111, 111, 111, 110, 110, 110, 110, 111, 111, 111, 111, 110, 110, 110, 110, 110, 110, 110, 109, 109, 110, 110, 111, 111, 111, 111, 111, 111, 110, 110, 111, 110, 110, 110, 110, 110, 111, 110, 110, 110, 110, 110, 110, 110, 110, 110, 109, 109, 109, 109, 109, 110, 110, 110, 111, 110, 110, 111, 111, 111, 111, 111, 111, 111, 112, 112, 111, 111, 111, 111, 111, 111, 111, 111, 111, 111, 111, 111, 111, 111, 111, 111, 111, 111, 111, 111, 111, 110, 110, 110, 110, 110, 110, 109, 109, 110, 110, 110, 110, 110, 110, 109, 109, 109, 109, 109, 109, 108, 108, 108, 108, 108, 108, 108, 108, 108, 108, 108, 108, 108, 108, 109, 109, 109, 109, 109, 108, 108, 108, 108, 109, 109, 109, 109, 109, 109, 109, 109, 109, 109, 108, 108, 108, 108, 108, 108, 109, 109, 109, 109, 109, 109, 109, 108, 108, 109, 109, 109, 109, 109, 110, 110, 110, 109, 109, 110, 110, 110, 110, 110, 111, 112, 111, 111, 110, 111, 111, 111, 111, 111, 111, 111, 110, 110, 111, 111, 111, 111, 111, 112, 112, 111, 111, 111, 111, 111, 112, 112, 112, 112, 112, 112, 112, 111, 111, 112, 112, 112, 112, 112, 112, 112, 112, 112, 112, 111, 111, 111, 111, 110, 110, 111, 111, 111, 111, 111, 111, 111, 112, 112, 112, 111, 111, 110, 111, 111, 111, 111, 111, 111, 111, 111, 111, 112, 112, 112, 111, 111, 111, 110, 110, 110, 110, 111, 111, 110, 110, 110, 110, 110, 110, 111, 111, 111, 111, 110, 110, 110, 110, 110, 110, 111, 111, 110, 110, 110, 110, 110, 109, 110, 111, 111, 112, 112, 112, 112, 111, 111, 111, 110, 110, 110, 110, 110, 110, 110, 110, 111, 111, 111, 111, 111, 111, 111, 111, 112, 112, 112, 112, 111, 111, 111, 110, 109, 110, 110, 110, 110, 110, 111, 111, 110, 110, 110, 110, 110, 111, 111, 112, 111, 111, 111, 111, 110, 110, 110, 110, 110, 110, 110, 110, 110, 111, 111, 111]
6355A11%j%%%%%%%J%%%%%%j%%%%JJ%jj%%%%%%%J%%%%%J%j%%%%j%%%j%%%%%%%J%%j%J%%%%%
6348A10%%%%%J%%%%J%%%%j%%%%J%%j%%%%%%J%%%jj%%%J%j%%%J%%j%%j%%J%%jJJ%%j%%%J%j
6340A10%%%%%%%%J%j%J%%j%%%j%J%%%%%%%%%Jj%%%%%%%%jJ%J%%%%j%j%%%J%j%jJJ%%%%%%%
6333A10j%%%%%%%%%%JJ%j%%jJ%J%%%j%%%%%%%%%%%%%%%%%%%%j%%J%J%%%%j%%%%%%%%%%j%%
6326A09J%%%%j%%Jj%%%%%J%%%%%j%%%%%%%%%J%%%%%%%%%%J%%%%j%j%%%%%%%%%J%%%%%%%%%
6318A10%j%J%j%%%%%%%%J%%%%j%%%J%%%%j%J%%%%%%%%%%%%%%%%%%%%j%%%%%%%J%J%%j%%%%
6311A10j%%%%J%j%%%%Jj%%%%%%%%%%%%%%J%%j%%%%jJ%j%%J%%J%%%%%%j%%%%%%%J%j%J%%j%
6304A09J%%J%%j%%%%%Jj%j%%%%%%%%J%%%%%%%%%j%j%%%%%J%%%J%%%jJ%%J%%%%j%j%%%%%%%
$$ y = [111, 111, 110, 110, 110, 110, 110, 110, 110, 110, 111, 111, 111, 111, 111, 111, 111, 110, 110, 110, 110, 110, 111, 112, 112, 111, 110, 110, 110, 110, 110, 110, 110, 110, 111, 111, 111, 111, 111, 111, 112, 112, 111, 111, 111, 111, 111, 110, 110, 110, 110, 109, 109, 109, 109, 109, 109, 109, 109, 110, 110, 110, 109, 109, 110, 110, 110, 110, 110, 110, 110, 110, 110, 110, 110, 111, 111, 111, 111, 111, 112, 112, 112, 112, 112, 111, 111, 111, 111, 111, 112, 112, 112, 111, 111, 111, 111, 111, 111, 111, 112, 112, 112, 112, 111, 110, 110, 110, 110, 111, 111, 110, 110, 110, 110, 111, 111, 111, 110, 110, 110, 109, 109, 109, 110, 110, 110, 109, 110, 111, 111, 111, 110, 110, 110, 110, 111, 111, 110, 110, 110, 110, 110, 110, 110, 110, 110, 111, 111, 110, 110, 111, 111, 111, 110, 110, 110, 110, 109, 109, 110, 110, 110, 110, 110, 110, 110, 110, 110, 110, 111, 110, 110, 110, 110, 110, 110, 110, 110, 110, 109, 110, 110, 111, 111, 111, 111, 111, 110, 110, 109, 109, 109, 109, 110, 110, 109, 109, 108, 109, 110, 110, 110, 110, 110, 110, 110, 110, 109, 109, 109, 109, 109, 109, 109, 109, 109, 109, 109, 110, 111, 111, 110, 110, 110, 109, 110, 110, 111, 111, 111, 111, 110, 110, 110, 110, 110, 110, 110, 110, 110, 110, 110, 110, 110, 110, 110, 110, 110, 110, 110, 110, 110, 109, 109, 109, 110, 110, 111, 111, 111, 111, 111, 110, 110, 110, 110, 110, 110, 110, 110, 110, 110, 110, 109, 109, 109, 110, 110, 110, 110, 110, 109, 109, 109, 110, 109, 109, 109, 109, 109, 109, 110, 110, 110, 110, 110, 110, 109, 109, 109, 109, 109, 109, 109, 109, 109, 109, 110, 110, 110, 110, 110, 110, 110, 110, 110, 110, 110, 111, 111, 111, 111, 111, 110, 110, 109, 109, 109, 109, 109, 109, 109, 109, 109, 109, 110, 110, 110, 110, 110, 110, 110, 110, 110, 110, 110, 109, 109, 110, 110, 109, 109, 109, 109, 109, 109, 109, 109, 109, 110, 110, 110, 110, 110, 109, 109, 109, 109, 110, 110, 110, 110, 110, 109, 109, 110, 110, 110, 110, 110, 110, 110, 110, 110, 110, 110, 110, 110, 110, 110, 110, 110, 110, 110, 110, 110, 109, 109, 109, 109, 109, 109, 109, 109, 110, 110, 111, 111, 111, 110, 110, 110, 110, 110, 109, 109, 109, 109, 109, 110, 110, 109, 109, 109, 109, 109, 110, 109, 109, 109, 109, 109, 109, 109, 109, 109, 109, 109, 109, 109, 109, 109, 110, 110, 110, 109, 109, 109, 109, 109, 108, 109, 109, 108, 108, 108, 109, 109, 109, 110, 110, 110, 110, 110, 110, 110, 109, 109, 109, 109, 109, 109, 109, 109, 110, 110, 109, 109, 110, 110, 110, 109, 109, 110, 110, 110, 111, 111, 111, 110, 110, 110, 110, 110, 110, 111, 110, 110, 109, 109, 109, 109, 109, 109, 109, 109, 109, 110, 110, 110, 110, 110, 110, 110, 110, 110, 110, 109, 109, 108, 108, 108, 108, 108, 108, 109, 109, 109, 109, 110, 110, 110, 110, 109, 110, 110, 110, 111, 111, 111, 111, 111, 110, 110, 109, 109, 109, 109, 109, 109, 109, 109]
6296A09%%%%%%%%%%%%%%J%%j%%j%J%%J%j%j%J%jJ%%%%%%%J%J%%%%j%%%%%%%%%%%j%j%J%%%
6289A09j%%J%J%%%jj%%%%%%J%Jj%%Jj%J%%%j%%%%J%%j%%%%%%%%%%J%%%%%%j%%%J%j%%J%%%
6282A10j%%%%%%%%%j%%%%%%%%%%%%J%%%%%%%%%%j%J%j%%J%%j%J%%%j%%%J%j%jJ%%%%j%%jJ
6274A07%%J%j%%J%%%J%%%%j%J%%Jj%Jj%%Jjjj%J%%%%%J%%%j%j%%J%%%%%J%%%%j%%%%J%%%J
6267A10%j%j%%J%%j%J%%J%%%%%%j%%%J%%%%%%j%%%%J%%%j%%j%J%%%%%%%%%%%jJ%%%%%jJ%%
6260A09j%J%%%%j%%%J%j%%%%J%%%%J%%%%%%%j%%%j%%J%%j%%%%J%%%%j%%%%%J%%%%%%%%%%%
6253A09%%%%%J%j%%%J%j%jJj%%J%%j%%%%J%Jj%%%%%%%%J%%%jJ%%jjJ%%%%%j%%%%%J%%%%%J
6245A10%jj%%J%%%%%%%%%%%Jj%j%%%%J%j%%%%%%J%%j%%%%%%%J%%%%%j%%J%%%%%%%%%%jJ%j
$$ y = [109, 109, 109, 109, 109, 109, 109, 109, 109, 109, 109, 109, 109, 109, 109, 110, 110, 110, 109, 109, 109, 108, 108, 109, 109, 109, 110, 110, 109, 109, 108, 108, 109, 109, 108, 109, 109, 109, 109, 109, 109, 109, 109, 110, 110, 111, 111, 111, 111, 111, 110, 110, 110, 110, 110, 110, 110, 110, 110, 110, 110, 110, 109, 109, 108, 108, 109, 109, 109, 109, 108, 108, 108, 109, 109, 110, 110, 110, 110, 109, 108, 108, 108, 108, 108, 108, 108, 109, 109, 110, 109, 109, 109, 110, 109, 109, 110, 110, 110, 110, 109, 109, 109, 109, 109, 110, 110, 110, 109, 109, 109, 109, 109, 109, 109, 109, 109, 109, 109, 110, 110, 110, 110, 110, 110, 110, 109, 109, 109, 109, 110, 110, 109, 109, 109, 110, 110, 110, 110, 109, 109, 109, 109, 109, 109, 109, 109, 109, 109, 108, 108, 108, 108, 108, 108, 108, 108, 108, 108, 108, 108, 108, 109, 109, 109, 109, 109, 109, 109, 109, 109, 109, 109, 108, 108, 109, 109, 108, 108, 108, 109, 109, 109, 108, 108, 109, 109, 109, 109, 108, 108, 108, 108, 109, 109, 108, 108, 107, 108, 108, 108, 108, 108, 107, 107, 107, 106, 107, 107, 107, 108, 108, 107, 107, 107, 108, 108, 108, 108, 109, 109, 109, 109, 109, 108, 108, 109, 109, 109, 110, 109, 109, 110, 109, 109, 109, 110, 109, 108, 107, 107, 108, 108, 108, 108, 108, 108, 109, 109, 109, 109, 108, 108, 107, 107, 107, 108, 108, 108, 108, 108, 108, 109, 109, 109, 109, 109, 108, 108, 108, 108, 108, 109, 109, 109, 109, 110, 110, 109, 109, 108, 108, 108, 109, 109, 109, 108, 108, 109, 109, 109, 110, 110, 110, 110, 110, 110, 110, 109, 109, 109, 109, 110, 110, 110, 110, 110, 110, 110, 109, 109, 109, 109, 109, 110, 110, 110, 110, 109, 109, 109, 108, 108, 109, 109, 109, 109, 109, 109, 109, 109, 109, 109, 109, 109, 108, 109, 109, 109, 109, 109, 109, 108, 109, 109, 109, 108, 108, 109, 109, 109, 109, 109, 108, 108, 108, 108, 109, 109, 108, 108, 108, 108, 108, 109, 109, 109, 109, 109, 110, 110, 110, 110, 110, 110, 110, 110, 109, 109, 109, 109, 108, 108, 108, 109, 109, 109, 108, 108, 108, 108, 108, 109, 109, 109, 109, 109, 108, 108, 108, 108, 108, 108, 109, 109, 109, 109, 109, 109, 109, 109, 109, 109, 109, 109, 109, 109, 109, 109, 109, 110, 110, 109, 109, 109, 109, 110, 110, 109, 109, 108, 109, 108, 108, 108, 109, 109, 109, 108, 108, 108, 108, 108, 109, 109, 110, 109, 109, 109, 109, 109, 109, 109, 109, 109, 110, 110, 110, 110, 109, 110, 110, 110, 109, 108, 109, 109, 109, 109, 109, 109, 108, 108, 108, 108, 108, 108, 109, 109, 109, 109, 109, 109, 110, 110, 109, 108, 108, 108, 109, 109, 109, 109, 109, 109, 109, 109, 109, 109, 109, 109, 110, 109, 109, 108, 108, 108, 108, 108, 109, 109, 108, 108, 108, 108, 108, 108, 108, 109, 109, 109, 108, 108, 108, 108, 108, 108, 108, 108, 109, 109, 109, 109, 109, 109, 108, 108, 108, 109, 109, 109, 109, 109, 109, 109, 109, 109, 109, 109, 108, 109, 109, 108]
6238A08%%%%%%J%%%%%%%%%%%%jJ%%j%%%%%%Jj%JjJ%%%%Jj%%%%%%%J%jjJ%%%%%%j%%%%j%%%
6231A07%%%%J%%%%%%%%%%%%%j%%J%%j%jjJJ%%%%j%%%%j%%%JJ%%%%j%%%%%j%JJ%%j%%J%%%%
6223A07J%%%%%%%%%%%j%%J%%%J%%%%%%%%%%J%%%%%j%j%J%%%%%%%%%%%%Jj%%%%%%%%%Jj%%%
6216A09%%j%J%%j%%%%%%%%J%j%%J%j%%%%j%%%%%J%%%%%J%%jJj%J%%%%%%%J%%%%j%%jJ%%%%
6209A09%Jjj%J%%%J%j%%%%%%%%j%%%%j%%%J%%%%%%%%%J%%%%j%%J%%j%%%%%%%%J%%%J%j%j%
6201A08%%%%%j%%%%%%J%%%%%Jj%j%%%%J%%%J%%j%%J%%%%%%%%%%%%%%%%j%%%%J%%%%%%%j%%
6194A08%%%J%%%%%%j%%%Jjj%%j%J%J%%%%%%%%%%%%J%j%Jj%%%%%%%Jj%%%%%jJ%%%j%j%J%J%
6187A08%%%%%%%%j%%J%%%%jJ%%%%%%%%%j%%Jj%J%%%%%%j%%%%J%%%%%%%J%%j%%%J%%%%%%%j
$$ y = [108, 108, 108, 108, 108, 108, 108, 109, 109, 109, 109, 109, 109, 109, 109, 109, 109, 109, 109, 109, 108, 109, 109, 109, 108, 108, 108, 108, 108, 108, 108, 109, 108, 108, 109, 108, 109, 109, 109, 109, 109, 110, 109, 109, 109, 109, 109, 109, 109, 109, 110, 110, 109, 108, 109, 109, 109, 109, 109, 109, 109, 108, 108, 108, 108, 108, 107, 107, 107, 107, 107, 107, 107, 107, 108, 108, 108, 108, 108, 108, 108, 108, 108, 108, 108, 108, 108, 108, 107, 107, 107, 108, 108, 108, 107, 107, 106, 105, 106, 107, 107, 107, 107, 107, 106, 106, 106, 106, 106, 105, 105, 105, 105, 106, 107, 107, 107, 107, 107, 106, 106, 106, 106, 106, 106, 105, 105, 106, 107, 107, 107, 106, 106, 106, 107, 107, 107, 107, 107, 108, 108, 108, 108, 108, 108, 108, 108, 108, 108, 108, 108, 107, 107, 107, 108, 108, 108, 108, 109, 109, 109, 109, 109, 109, 109, 109, 109, 109, 109, 110, 110, 110, 110, 110, 110, 109, 109, 108, 108, 109, 109, 109, 109, 109, 109, 109, 109, 109, 109, 109, 109, 109, 110, 109, 109, 109, 109, 109, 109, 109, 109, 109, 109, 110, 109, 109, 109, 109, 109, 109, 108, 108, 109, 109, 109, 108, 108, 108, 108, 108, 108, 108, 108, 108, 109, 109, 108, 108, 108, 109, 109, 108, 108, 108, 108, 108, 107, 107, 107, 107, 107, 107, 108, 108, 108, 108, 108, 108, 109, 109, 109, 108, 109, 108, 108, 109, 109, 109, 109, 109, 109, 109, 109, 110, 110, 110, 110, 110, 109, 109, 109, 108, 109, 109, 109, 109, 109, 109, 110, 109, 108, 108, 109, 109, 109, 109, 110, 110, 109, 109, 109, 109, 109, 109, 109, 109, 109, 108, 108, 108, 108, 108, 107, 107, 107, 107, 108, 108, 108, 108, 108, 108, 108, 108, 108, 108, 109, 109, 109, 109, 109, 108, 108, 108, 109, 109, 109, 108, 108, 108, 108, 108, 108, 108, 108, 108, 109, 109, 109, 109, 110, 110, 109, 109, 108, 108, 108, 108, 108, 108, 108, 107, 107, 107, 107, 107, 107, 107, 108, 108, 108, 108, 108, 108, 109, 108, 108, 107, 107, 107, 107, 107, 108, 108, 108, 108, 109, 109, 109, 108, 108, 108, 109, 109, 109, 109, 109, 109, 109, 109, 109, 109, 109, 109, 109, 109, 109, 109, 109, 108, 108, 108, 108, 108, 109, 109, 109, 109, 109, 109, 109, 109, 108, 108, 108, 108, 108, 108, 109, 109, 109, 109, 109, 109, 109, 108, 108, 108, 108, 109, 108, 107, 107, 107, 106, 106, 107, 107, 108, 108, 108, 108, 108, 108, 108, 108, 108, 108, 108, 108, 108, 109, 109, 108, 108, 109, 108, 108, 108, 108, 108, 108, 108, 108, 109, 108, 108, 108, 108, 108, 108, 107, 108, 108, 108, 108, 107, 107, 106, 106, 107, 107, 108, 108, 108, 108, 108, 108, 108, 108, 108, 108, 107, 107, 107, 108, 108, 108, 108, 108, 107, 108, 108, 108, 108, 108, 108, 108, 108, 108, 108, 107, 107, 107, 108, 107, 107, 108, 108, 108, 108, 108, 108, 108, 107, 107, 107, 107, 107, 108, 108, 108, 108, 108, 108, 108, 108, 109, 109, 109, 108, 108, 108, 108, 109, 109, 109, 109, 109, 109, 109, 109, 108]
6179A08%%%%%%%%%%%%j%%%%Jj%j%JJ%j%J%j%%%%%j%%%J%J%%J%%jj%J%j%%%%J%%%%%j%J%%j
6172A07%%%%%%J%%%j%%j%%J%%%%%%j%%%J%%%J%%j%%%%%J%Jj%%%j%%%%%%%%%J%%%%%%%%%j%
6165A07%%%%%%%jJ%%%%%%%%%%%j%%J%j%%%%J%%j%%%%%%J%%%J%%j%%%j%%%J%%%j%%Jj%%%J%
6157A07%%%%%%%%J%j%%%%%J%%j%%%%j%%%%%J%%%%j%J%%%%%%j%%%%%%%%%%j%%%%J%%%%%%%%
6150A06%%%%%J%j%%%J%j%%%%%%%j%%J%%J%%%j%%%%%%%%J%%%%%%%%J%%%jJ%j%%%%%%%j%J%%
6143A07%jJ%J%%%%j%%%JjJ%j%j%%J%Jj%j%%%%%%%%J%%%%%%%j%J%%%%%%J%%%j%%%%%%J%%%j
6136A07%%%%%j%%J%%%%%%%j%%J%%Jj%%%%%%%%j%%%%%%%J%%j%%%%J%%jj%%%J%%%%Jj%%%%J%
6128A07%%%%j%%%%%%%%%%%%%J%%%%%%%%j%%JJ%%jj%%%%jJ%Jj%%%j%J%%%%%Jj%j%J%JjJ%J%
$$ y = [108, 108, 108, 108, 108, 108, 108, 108, 108, 108, 108, 108, 108, 107, 107, 107, 107, 107, 108, 107, 107, 106, 106, 107, 108, 108, 107, 107, 108, 108, 107, 107, 107, 107, 107, 107, 106, 106, 106, 106, 107, 107, 108, 108, 108, 109, 109, 109, 108, 107, 107, 108, 108, 107, 107, 107, 107, 107, 108, 108, 108, 108, 108, 108, 107, 107, 108, 108, 108, 107, 107, 107, 107, 107, 107, 107, 108, 108, 108, 108, 107, 107, 107, 106, 106, 106, 107, 107, 107, 107, 107, 107, 107, 106, 106, 106, 106, 107, 107, 107, 107, 108, 108, 108, 107, 107, 107, 107, 107, 107, 108, 108, 109, 108, 108, 108, 108, 107, 107, 107, 107, 107, 107, 107, 107, 107, 107, 108, 108, 108, 108, 108, 108, 108, 108, 108, 108, 107, 107, 107, 107, 107, 107, 107, 107, 107, 106, 107, 107, 107, 107, 107, 107, 107, 107, 107, 107, 107, 107, 106, 106, 106, 107, 107, 106, 106, 106, 106, 106, 107, 107, 107, 106, 106, 106, 106, 106, 106, 106, 107, 107, 107, 107, 108, 108, 108, 107, 107, 107, 107, 106, 106, 106, 106, 107, 107, 107, 107, 106, 106, 106, 107, 106, 106, 106, 106, 107, 107, 107, 107, 107, 107, 107, 107, 107, 107, 108, 108, 107, 107, 107, 107, 107, 107, 108, 108, 108, 107, 107, 107, 107, 107, 106, 106, 106, 106, 106, 106, 107, 107, 107, 107, 107, 106, 106, 107, 107, 107, 107, 107, 107, 107, 106, 106, 106, 106, 106, 106, 106, 106, 106, 106, 106, 105, 105, 105, 105, 105, 106, 106, 106, 106, 106, 106, 106, 106, 106, 106, 106, 106, 106, 106, 107, 107, 106, 106, 106, 106, 107, 107, 106, 106, 106, 106, 106, 106, 106, 106, 105, 105, 105, 106, 106, 106, 107, 107, 107, 107, 106, 106, 106, 106, 106, 106, 106, 106, 106, 107, 107, 107, 107, 107, 107, 107, 107, 107, 108, 108, 108, 108, 107, 108, 108, 107, 107, 107, 107, 107, 107, 107, 107, 106, 106, 107, 107, 107, 107, 106, 107, 107, 108, 108, 108, 108, 108, 107, 107, 107, 107, 108, 107, 108, 108, 107, 107, 106, 106, 106, 107, 107, 108, 107, 107, 106, 106, 106, 106, 106, 106, 106, 106, 106, 107, 107, 107, 107, 107, 107, 107, 107, 106, 106, 107, 107, 107, 107, 107, 107, 107, 108, 108, 108, 108, 107, 107, 107, 107, 107, 107, 107, 108, 108, 108, 108, 107, 107, 107, 107, 107, 107, 106, 106, 106, 107, 107, 107, 107, 107, 107, 107, 107, 106, 106, 106, 107, 107, 107, 108, 107, 107, 107, 107, 107, 107, 107, 107, 107, 106, 106, 106, 106, 106, 106, 106, 106, 107, 107, 107, 106, 106, 106, 106, 106, 107, 107, 107, 106, 105, 105, 105, 105, 106, 106, 106, 106, 106, 107, 106, 106, 106, 106, 106, 107, 107, 107, 107, 107, 107, 106, 106, 106, 106, 106, 106, 106, 106, 106, 106, 106, 106, 106, 106, 107, 107, 107, 107, 107, 107, 107, 107, 107, 106, 106, 106, 107, 108, 108, 108, 107, 106, 106, 106, 106, 106, 105, 106, 106, 107, 106, 106, 106, 106, 105, 105, 106, 106, 106, 106, 106, 106, 107, 106, 106, 105, 105, 106, 106, 107, 106, 107, 107, 108, 108]
6121A08%%%%j%J%%j%%%%%%%%%%%%%%%%%%%J%j%%%j%%%%%%J%%%%%j%%J%%%%%%%j%J%J%%%%j
6114A07j%%J%%%%jj%%%%%%J%%J%j%%%%%%J%%j%%%%J%%%%j%%j%J%%j%%%%J%%%%%%%J%%j%j%
6106A05%%%%%J%%j%%%%%j%%%%J%%%%j%%J%j%%%J%%%%jj%%%%J%%%%J%%%%%J%%J%%%%j%%%%%
6099A06%%J%%%Jj%J%%%%%%j%%%jJ%J%%Jj%%jJ%%%%%j%%j%J%%j%%%%%%%%%%%%%%%%%%%%j%J
6092A06%%%%J%%j%%%J%%%%j%%%%J%j%J%j%%%%%%%%%%J%j%%%%%j%%%%J%%%%%Jj%%%j%%%%%%
6084A05%%%J%%j%%%%%%J%%%%%%%j%%%%J%%%%j%%%%%%%%J%%%%%%J%jj%%%J%%%%jJ%%%%%%%%
6077A06jJ%%j%%%%%%%Jj%%%%%%%%%%%%jJ%%%%%J%%%%jJ%J%jJ%%j%j%%%%%J%%%%%%%j%%%%%
6070A05%%j%%j%J%JJ%%%%Jj%%j%%%%%%J%j%%J%J%j%%j%%%%%%%%j%%%J%%%j%%%%%%%%%J%%%
$$ y = [108, 108, 108, 108, 108, 107, 107, 108, 108, 108, 107, 107, 107, 107, 107, 107, 107, 107, 107, 107, 107, 107, 107, 107, 107, 107, 107, 107, 107, 107, 108, 108, 107, 107, 107, 107, 106, 106, 106, 106, 106, 106, 106, 107, 107, 107, 107, 107, 107, 106, 106, 106, 107, 107, 107, 107, 107, 107, 107, 107, 106, 106, 107, 107, 108, 108, 108, 108, 108, 107, 106, 106, 106, 107, 107, 107, 107, 107, 106, 105, 105, 105, 105, 105, 105, 105, 106, 106, 106, 107, 107, 106, 106, 106, 106, 106, 106, 106, 107, 107, 107, 106, 106, 106, 106, 106, 107, 107, 107, 107, 107, 106, 106, 106, 105, 105, 106, 106, 106, 105, 105, 105, 105, 105, 106, 106, 106, 106, 106, 106, 106, 106, 107, 107, 107, 106, 106, 105, 105, 105, 105, 105, 105, 105, 106, 106, 106, 105, 105, 105, 105, 105, 105, 104, 104, 104, 104, 104, 105, 105, 105, 105, 105, 104, 104, 104, 105, 105, 104, 104, 104, 104, 105, 105, 105, 105, 105, 104, 103, 103, 103, 103, 103, 104, 104, 104, 104, 104, 105, 105, 105, 105, 105, 105, 106, 106, 106, 107, 107, 107, 107, 107, 106, 106, 106, 106, 106, 106, 106, 106, 107, 107, 107, 107, 108, 107, 107, 108, 108, 108, 108, 108, 108, 108, 107, 107, 107, 107, 106, 107, 107, 108, 108, 108, 109, 108, 108, 108, 107, 108, 108, 108, 108, 108, 108, 107, 107, 107, 106, 106, 107, 107, 107, 106, 106, 106, 106, 106, 106, 106, 106, 106, 106, 106, 106, 106, 106, 106, 106, 106, 106, 106, 106, 106, 105, 105, 106, 106, 106, 106, 106, 107, 107, 107, 106, 106, 106, 106, 107, 107, 107, 107, 107, 106, 106, 106, 106, 106, 107, 107, 106, 106, 107, 107, 106, 106, 106, 106, 106, 106, 106, 106, 106, 106, 106, 107, 107, 106, 106, 106, 106, 106, 106, 105, 105, 105, 105, 105, 106, 106, 106, 106, 106, 106, 107, 106, 106, 106, 106, 105, 105, 105, 105, 105, 105, 105, 105, 105, 105, 106, 106, 106, 105, 105, 105, 105, 105, 105, 105, 106, 106, 106, 106, 106, 106, 106, 106, 105, 105, 105, 105, 105, 106, 106, 106, 106, 106, 105, 105, 105, 105, 105, 105, 105, 105, 105, 106, 106, 106, 106, 106, 106, 106, 107, 107, 106, 105, 105, 105, 105, 106, 106, 106, 106, 106, 105, 106, 106, 106, 106, 106, 106, 106, 106, 106, 105, 106, 106, 106, 105, 105, 105, 105, 105, 105, 105, 105, 106, 105, 105, 105, 105, 105, 105, 105, 105, 105, 105, 105, 105, 105, 104, 105, 105, 105, 105, 105, 105, 106, 106, 106, 106, 106, 105, 106, 106, 107, 107, 106, 107, 107, 107, 106, 106, 105, 105, 105, 105, 105, 105, 106, 106, 106, 106, 106, 106, 106, 106, 105, 105, 105, 105, 105, 105, 105, 105, 104, 104, 104, 103, 103, 104, 104, 105, 106, 106, 106, 106, 106, 107, 106, 106, 106, 105, 105, 105, 105, 105, 105, 105, 106, 106, 105, 105, 105, 106, 106, 107, 107, 106, 106, 106, 105, 105, 105, 105, 105, 105, 105, 105, 105, 104, 104, 104, 104, 105, 105, 105, 105, 104, 104, 104, 104, 104, 104, 104, 104, 104, 104, 105, 105, 105, 105]
6062A05%J%%%%%%jj%%%%%J%j%J%j%%J%%%%%%%%%%j%%%%%%%%%%%J%jJ%%%%%jJ%%%%%%%%%J%
6055A06%j%%%%%j%%%%%%%%J%%%%%%%J%j%j%%%%%%%J%%%%j%%%J%%%%%%j%JJ%%%%j%%%%%%%%
6048A05j%J%%%%%J%%%%%%%%%j%%%%j%%%%%%%%jJ%J%%%%%%%%%j%J%%%%%%%j%%J%%%%%j%Jj%
6040A04J%%%%%%%%%%%%%j%%%%%%%%%%j%%%J%%J%%%j%%JJj%%%%%j%%%Jj%%J%%%%%%jJ%%%j%
6033A04%%%%%%%%%%%j%%%Jj%JJj%%j%%J%%%%JJ%%%%%j%%%jjJ%%%%%%%%%%%%%%%%%%%%J%%j
6026A04%%%%%%%%%%%%Jj%%%%%%j%%%%J%%%%%%%%%j%%J%%%%%%%%J%jj%j%%%J%%%J%%%%%%J%
6019A05%%j%%%%%%J%%%j%%%%%%%%%%j%%%%J%%%%%%%%%%%j%%%%%%%%%%%%%%%%J%j%%%J%%j%
6011A03%%%%%J%%%%j%j%J%%%j%%%%%J%j%%%%%%%%%%j%J%%%%j%%%%%JJj%%%%%j%%%%%%%JJ%
$$ y = [105, 105, 106, 106, 106, 106, 106, 106, 106, 105, 104, 104, 104, 104, 104, 104, 105, 105, 104, 104, 105, 105, 104, 104, 104, 105, 105, 105, 105, 105, 105, 105, 105, 105, 105, 105, 104, 104, 104, 104, 104, 104, 104, 104, 104, 104, 104, 104, 105, 105, 104, 105, 105, 105, 105, 105, 105, 104, 105, 105, 105, 105, 105, 105, 105, 105, 105, 105, 106, 106, 106, 105, 105, 105, 105, 105, 105, 104, 104, 104, 104, 104, 104, 104, 104, 104, 105, 105, 105, 105, 105, 105, 105, 105, 106, 106, 105, 105, 104, 104, 104, 104, 104, 104, 104, 104, 105, 105, 105, 105, 105, 104, 104, 104, 104, 105, 105, 105, 105, 105, 105, 105, 104, 104, 105, 106, 106, 106, 106, 106, 105, 105, 105, 105, 105, 105, 105, 105, 105, 104, 104, 105, 105, 105, 105, 105, 105, 106, 106, 106, 106, 106, 106, 106, 106, 106, 106, 105, 105, 105, 105, 105, 104, 104, 104, 104, 104, 104, 104, 104, 104, 103, 104, 104, 105, 105, 105, 105, 105, 105, 105, 105, 105, 105, 104, 104, 105, 105, 105, 105, 105, 105, 105, 105, 104, 104, 104, 105, 105, 105, 105, 105, 105, 104, 104, 105, 104, 104, 105, 105, 105, 105, 105, 105, 105, 105, 105, 105, 105, 105, 105, 105, 104, 104, 104, 104, 104, 104, 104, 104, 104, 104, 104, 103, 103, 103, 103, 104, 104, 104, 105, 105, 105, 105, 104, 104, 104, 105, 106, 105, 105, 105, 105, 105, 105, 104, 104, 104, 104, 105, 104, 104, 104, 105, 105, 105, 105, 105, 105, 105, 104, 105, 105, 105, 105, 104, 104, 104, 104, 104, 104, 104, 104, 104, 104, 104, 104, 104, 103, 103, 103, 103, 104, 103, 103, 104, 105, 104, 104, 104, 103, 103, 103, 104, 104, 104, 104, 104, 105, 106, 106, 106, 106, 106, 106, 105, 105, 105, 105, 104, 103, 104, 104, 104, 104, 104, 104, 104, 104, 104, 104, 104, 104, 104, 104, 104, 104, 104, 104, 104, 104, 104, 105, 105, 105, 104, 104, 104, 104, 104, 104, 104, 104, 104, 104, 104, 104, 104, 105, 104, 104, 104, 104, 104, 104, 104, 103, 103, 103, 103, 103, 104, 104, 104, 104, 104, 104, 104, 104, 104, 104, 103, 103, 103, 104, 104, 104, 104, 104, 104, 104, 104, 104, 105, 105, 104, 103, 103, 102, 102, 102, 102, 103, 103, 103, 103, 104, 104, 104, 104, 104, 104, 104, 105, 105, 105, 105, 104, 104, 104, 104, 104, 104, 104, 105, 105, 105, 105, 104, 104, 104, 104, 104, 104, 104, 104, 104, 104, 104, 103, 103, 103, 103, 103, 104, 104, 104, 104, 104, 104, 104, 104, 104, 104, 104, 104, 103, 103, 103, 103, 103, 103, 103, 103, 103, 103, 103, 103, 103, 103, 103, 103, 103, 104, 104, 103, 103, 103, 103, 104, 104, 104, 103, 103, 103, 103, 103, 103, 103, 104, 104, 104, 104, 104, 103, 103, 102, 102, 103, 103, 103, 103, 102, 102, 102, 102, 102, 102, 103, 103, 102, 102, 102, 102, 102, 102, 102, 102, 102, 102, 102, 101, 101, 102, 102, 102, 102, 102, 101, 101, 101, 101, 101, 101, 102, 103, 102, 102, 102, 102, 102, 102, 101, 101, 101, 101, 101, 101, 101, 101, 102, 103, 103]
6004A03%%j%%%%%%%%%%%J%%%%%J%%%%jJ%%%%%%%%%%%%%%%%%%%%J%%%%%jJ%JjJ%J%j%j%j%%
5997A04%%%%%%j%J%%Jj%%%%%%%j%%%%%J%j%%%%%%%%%%J%j%%%%%%%%%%%%%Jj%%%J%%%%%jJ%
5989A04%%%j%%%%%%%%%J%%j%%%%%%%%%J%%%%%%%%%%%%%%%%%%j%%J%%%j%j%%%%%J%%%%%%%%
5982A03%%JJ%%j%%%%%%%%%j%%%%%%%Jj%%%%%%Jj%j%J%%%%%%%%J%%%%%j%J%%%%%%%%%%%%%%
5975A04%%j%%%%%%%jJJ%%%%%%%%%jJ%%%%%j%%%J%J%%%%j%%j%%%J%%%j%%jJ%%Jjj%%%%%%%%
5967A02Jj%%%%%J%%%%%%%J%j%j%%%JjjJ%J%%%J%%j%%%%%%%%%J%%%%%%j%%J%j%%JjJ%j%jJ%
5960A03%%jj%%J%%%%%%J%j%J%%%%%%jJ%J%%%jj%J%%%%%%%%%jj%%J%%%%%%%%%%Jj%%%J%jjJ
5953A02%%%%J%%%%j%%J%%%j%%JJ%j%%j%%%%%%%%%j%%%%J%%%%%%%%%%%%%j%J%%%%%%%%j%%%
$$ y = [103, 103, 103, 102, 102, 102, 102, 102, 102, 102, 102, 102, 102, 102, 102, 103, 103, 103, 103, 103, 103, 104, 104, 104, 104, 104, 103, 104, 104, 104, 104, 104, 104, 104, 104, 104, 104, 104, 104, 104, 104, 104, 104, 104, 104, 104, 104, 104, 105, 105, 105, 105, 105, 105, 104, 105, 105, 106, 105, 106, 106, 107, 107, 106, 106, 105, 105, 104, 104, 104, 104, 104, 104, 104, 104, 104, 103, 103, 104, 104, 104, 105, 104, 104, 104, 104, 104, 104, 104, 104, 103, 103, 103, 103, 103, 103, 104, 104, 103, 103, 103, 103, 103, 103, 103, 103, 103, 103, 103, 104, 104, 103, 103, 103, 103, 103, 103, 103, 103, 103, 103, 103, 103, 103, 103, 104, 103, 103, 103, 103, 104, 104, 104, 104, 104, 104, 103, 104, 104, 104, 104, 104, 103, 103, 103, 103, 103, 103, 103, 103, 103, 103, 104, 104, 104, 103, 103, 103, 103, 103, 103, 103, 103, 103, 103, 104, 104, 104, 104, 104, 104, 104, 104, 104, 104, 104, 104, 104, 104, 104, 104, 104, 104, 104, 103, 103, 103, 104, 104, 104, 104, 103, 103, 102, 102, 102, 102, 102, 102, 103, 103, 103, 103, 103, 103, 103, 103, 103, 103, 103, 104, 105, 105, 105, 104, 104, 104, 104, 104, 104, 104, 104, 104, 104, 103, 103, 103, 103, 103, 103, 103, 103, 104, 103, 103, 103, 103, 103, 103, 103, 104, 103, 103, 102, 102, 103, 103, 103, 103, 103, 103, 103, 103, 103, 104, 104, 104, 104, 104, 104, 103, 103, 104, 104, 104, 104, 104, 104, 104, 104, 104, 104, 104, 104, 104, 104, 104, 104, 104, 103, 103, 103, 103, 103, 103, 103, 103, 102, 103, 104, 104, 104, 104, 104, 104, 104, 104, 104, 104, 103, 104, 104, 104, 104, 104, 104, 103, 103, 103, 103, 104, 104, 105, 105, 105, 105, 105, 104, 104, 104, 103, 103, 103, 103, 104, 104, 104, 104, 103, 103, 103, 102, 103, 103, 103, 104, 103, 102, 102, 102, 102, 102, 102, 102, 102, 102, 103, 102, 102, 102, 102, 102, 102, 103, 103, 103, 103, 103, 103, 103, 103, 104, 104, 103, 103, 102, 102, 102, 102, 103, 102, 101, 102, 102, 103, 103, 103, 103, 104, 104, 104, 103, 103, 103, 103, 103, 103, 103, 103, 103, 103, 104, 104, 104, 104, 104, 104, 104, 103, 103, 103, 104, 104, 103, 103, 103, 104, 103, 104, 104, 103, 103, 102, 103, 103, 103, 103, 102, 101, 101, 101, 102, 102, 102, 102, 102, 102, 102, 103, 103, 102, 102, 103, 103, 103, 103, 103, 103, 103, 102, 103, 103, 104, 104, 104, 104, 103, 102, 102, 103, 103, 103, 103, 103, 103, 103, 103, 103, 103, 102, 101, 101, 101, 102, 102, 102, 102, 102, 102, 102, 102, 102, 102, 102, 103, 102, 102, 102, 102, 103, 103, 102, 101, 102, 102, 102, 102, 102, 103, 103, 103, 103, 103, 102, 102, 102, 103, 103, 103, 103, 102, 102, 102, 103, 104, 104, 103, 103, 103, 102, 102, 102, 102, 102, 102, 102, 102, 102, 102, 101, 101, 101, 101, 101, 102, 102, 102, 102, 102, 102, 102, 102, 102, 102, 102, 102, 102, 102, 101, 101, 102, 102, 102, 102, 102, 102, 102, 102, 102, 101, 101, 101, 101]
5945A01%%%%%%j%%J%J%%%%%%j%J%%%%%%%%%jJ%j%J%%j%%J%%%%jJ%%%j%%%%%J%J%%%%%j%%%
5938A02%j%%%%%%%%%%J%%j%%%J%%%Jj%j%%%J%j%%j%%%%J%%%%%J%j%%%J%%%%jj%%%J%JJ%j%
5931A02jj%%J%j%J%%j%%%%%%%%%%%%j%%%J%J%%%Jj%%%%j%J%%%J%%%%%%%%%%%%%j%%%j%%%%
5923A00J%%%j%%J%%j%%%%%%J%%%%%%%%%%jJ%%%%%%%%%%%%%%%%%%J%%%%%%%%%%j%%J%%%%j%
5916A01%%j%JJ%J%j%%j%%%J%%j%%%%%%%j%%%J%%J%%%%%j%j%%J%%J%j%%%%jjJ%%%%%%j%%%%
5909I9J%%%%j%JJ%%%%%%%%%%%%%%%Jj%%%%%j%j%J%j%%J%%%%%J%%%%%%%%%%j%%%%%%J%j%%%
5901A00%j%Jj%%%%J%j%%%%%J%j%%%J%%j%%%%%%J%%%%%%%j%%%J%j%%%%%J%%%j%%j%J%%J%%%
5894A00%%J%j%%%%%%j%%%J%%%%%%%%%%j%%%J%%%%%jJ%%%%%%%%%%%%%%%j%%J%%%%%%%%%%%%
$$ y = [101, 101, 101, 101, 101, 101, 101, 100, 100, 100, 101, 101, 102, 102, 102, 102, 102, 102, 102, 101, 101, 102, 102, 102, 102, 102, 102, 102, 102, 102, 102, 101, 102, 102, 101, 101, 102, 102, 102, 101, 101, 101, 102, 102, 102, 102, 102, 101, 102, 102, 102, 102, 101, 101, 101, 101, 101, 101, 102, 102, 103, 103, 103, 103, 103, 103, 102, 102, 102, 102, 102, 101, 101, 101, 101, 101, 101, 101, 101, 101, 101, 101, 102, 102, 102, 101, 101, 101, 101, 102, 102, 102, 102, 103, 102, 102, 101, 101, 101, 101, 102, 102, 101, 101, 101, 100, 100, 100, 100, 100, 101, 101, 101, 101, 101, 101, 102, 102, 101, 101, 101, 101, 102, 102, 102, 102, 102, 101, 100, 100, 100, 100, 101, 101, 102, 103, 103, 102, 102, 101, 100, 100, 100, 101, 101, 100, 100, 101, 101, 101, 100, 100, 100, 100, 100, 100, 100, 100, 100, 100, 100, 100, 100, 99, 99, 99, 99, 100, 100, 101, 101, 101, 101, 102, 101, 101, 101, 101, 101, 100, 100, 101, 101, 101, 101, 102, 102, 102, 102, 102, 102, 102, 102, 102, 102, 102, 102, 102, 102, 101, 101, 101, 101, 100, 100, 100, 100, 100, 101, 101, 101, 101, 100, 100, 100, 101, 101, 101, 100, 100, 100, 100, 100, 100, 100, 101, 101, 101, 101, 101, 101, 101, 101, 101, 101, 101, 100, 101, 101, 101, 101, 101, 101, 101, 101, 101, 101, 101, 101, 101, 101, 101, 101, 101, 101, 101, 102, 102, 102, 102, 102, 102, 102, 102, 102, 102, 102, 101, 101, 101, 102, 102, 102, 102, 102, 101, 101, 101, 101, 100, 100, 101, 102, 102, 103, 103, 102, 102, 102, 101, 101, 101, 101, 102, 102, 102, 101, 101, 101, 101, 101, 101, 101, 101, 100, 100, 100, 100, 101, 101, 101, 102, 102, 102, 102, 102, 102, 101, 101, 100, 100, 100, 101, 101, 101, 102, 102, 101, 101, 101, 101, 101, 100, 99, 100, 100, 100, 100, 100, 100, 100, 99, 99, 99, 99, 99, 100, 100, 100, 100, 100, 99, 99, 100, 101, 101, 101, 101, 101, 101, 101, 101, 101, 101, 101, 101, 101, 101, 101, 101, 102, 101, 101, 101, 101, 101, 101, 100, 100, 99, 99, 100, 100, 99, 99, 99, 100, 100, 100, 100, 100, 100, 101, 101, 101, 101, 101, 101, 101, 101, 101, 101, 101, 100, 100, 100, 100, 100, 100, 100, 101, 101, 100, 100, 100, 100, 100, 99, 99, 100, 99, 99, 99, 99, 99, 100, 100, 99, 99, 99, 99, 99, 99, 100, 100, 99, 99, 99, 99, 100, 100, 100, 99, 99, 99, 99, 99, 99, 99, 100, 100, 100, 100, 100, 100, 100, 100, 99, 99, 99, 99, 100, 100, 99, 99, 99, 99, 99, 99, 100, 100, 100, 100, 99, 99, 99, 98, 98, 99, 99, 99, 100, 100, 100, 100, 100, 100, 101, 101, 100, 100, 100, 100, 100, 100, 100, 99, 99, 99, 99, 100, 100, 100, 100, 100, 100, 100, 100, 100, 100, 100, 99, 99, 99, 99, 100, 100, 100, 100, 100, 100, 99, 100, 100, 100, 100, 100, 100, 100, 100, 100, 100, 100, 100, 100, 100, 100, 100, 99, 99, 99, 100, 100, 100, 100, 100, 100, 100, 100, 100, 100, 100, 100, 100]
5887A00%%%%j%%J%%%%%%%%%%%%j%%%%%%%%%J%%%%J%%j%%%%J%j%%%J%%j%%%%J%%j%jJ%%Jj%
5880A00%%%%%%%%%j%jJ%%%%%%j%%%Jj%%%%JJ%%%%%%j%%J%%%%%%j%%%%%%J%%%%%%%%%%Jj%j
5872I9%%%%%J%%j%%%JJ%j%%j%%%%J%%%%%%%j%%%%J%%%j%%%%%%%J%%j%%%J%%%%%j%%%%J%%j
5865I9%%%%J%%%%%j%%J%%%%%j%%J%%%%j%%%%%%%J%J%%j%jJ%%%%%%%%J%j%%%j%J%%j%%j%J%
5857I9Jj%%%%%%%%%%%%J%%%%jJ%%%%J%%%j%%%j%%%%%J%%%%j%J%%%%%%%%%%%%%%%%j%%JJ%%
5850A01%%j%%J%%j%%J%J%%jJ%j%%%%%%JjJ%%J%j%%%j%%%%%%JJ%%%%%%%%j%J%j%%%%j%%%%J
5843A02%%%J%%%%j%J%%jJ%j%%%J%j%%%%%%%%%%%%%%Jj%J%%%%%%J%%%j%%%j%%%%%%JJ%%%%%
5835A04%%%%J%%j%%%%J%%j%%%%JJ%%%%j%%%%%%%%%%J%%%%%%%%%%%%%%%J%j%%J%%j%%%J%%j
$$ y = [100, 100, 100, 100, 100, 99, 99, 99, 100, 100, 100, 100, 100, 100, 100, 100, 100, 100, 100, 100, 100, 99, 99, 99, 99, 99, 99, 99, 99, 99, 99, 100, 100, 100, 100, 100, 101, 101, 101, 100, 100, 100, 100, 100, 101, 101, 100, 100, 100, 100, 101, 101, 101, 100, 100, 100, 100, 100, 101, 101, 101, 100, 100, 99, 100, 100, 100, 101, 100, 100, 100, 100, 100, 100, 100, 100, 100, 100, 100, 99, 99, 98, 99, 99, 99, 99, 99, 99, 99, 98, 98, 98, 98, 99, 98, 98, 98, 98, 98, 99, 100, 100, 100, 100, 100, 100, 100, 99, 99, 99, 100, 100, 100, 100, 100, 100, 100, 99, 99, 99, 99, 99, 99, 99, 100, 100, 100, 100, 100, 100, 100, 100, 100, 100, 100, 101, 100, 100, 99, 99, 99, 99, 99, 99, 100, 100, 100, 99, 99, 99, 99, 100, 101, 101, 100, 100, 100, 99, 99, 99, 99, 99, 100, 100, 100, 100, 100, 100, 100, 100, 99, 99, 99, 99, 99, 100, 100, 100, 100, 99, 99, 99, 99, 99, 99, 99, 99, 100, 100, 100, 99, 99, 99, 99, 100, 100, 100, 100, 100, 100, 99, 99, 99, 99, 99, 100, 100, 100, 99, 99, 99, 99, 99, 100, 100, 100, 100, 100, 100, 99, 99, 99, 100, 100, 100, 100, 100, 100, 99, 99, 99, 100, 100, 100, 100, 100, 99, 99, 99, 99, 99, 99, 99, 99, 100, 100, 101, 101, 101, 100, 100, 99, 100, 100, 100, 100, 100, 100, 100, 100, 100, 101, 101, 100, 100, 100, 100, 99, 99, 100, 100, 100, 99, 99, 99, 98, 98, 99, 99, 100, 99, 99, 99, 99, 99, 99, 99, 99, 99, 99, 99, 99, 99, 100, 100, 100, 100, 100, 99, 100, 100, 100, 100, 100, 101, 101, 101, 101, 100, 100, 100, 100, 99, 99, 99, 99, 99, 99, 100, 100, 100, 100, 100, 99, 99, 100, 100, 100, 100, 100, 100, 100, 100, 100, 100, 100, 100, 100, 100, 100, 100, 100, 99, 99, 99, 100, 101, 101, 101, 101, 101, 100, 100, 100, 101, 101, 101, 100, 100, 100, 101, 101, 102, 102, 102, 101, 102, 102, 101, 101, 101, 101, 101, 101, 101, 102, 101, 102, 102, 102, 103, 103, 102, 102, 102, 102, 101, 101, 101, 101, 101, 101, 101, 102, 103, 103, 103, 103, 103, 103, 103, 103, 103, 102, 102, 103, 103, 102, 102, 102, 102, 102, 101, 101, 101, 101, 101, 102, 102, 102, 102, 103, 103, 103, 103, 103, 102, 102, 103, 103, 103, 102, 103, 103, 102, 102, 102, 102, 103, 103, 102, 102, 102, 102, 102, 102, 102, 102, 102, 102, 102, 102, 102, 102, 102, 103, 102, 102, 103, 103, 103, 103, 103, 103, 103, 104, 104, 104, 104, 103, 103, 103, 103, 102, 102, 102, 102, 102, 102, 102, 103, 104, 104, 104, 104, 104, 104, 104, 104, 104, 104, 105, 105, 105, 104, 104, 104, 104, 104, 105, 105, 105, 104, 104, 104, 104, 104, 105, 106, 106, 106, 106, 106, 105, 105, 105, 105, 105, 105, 105, 105, 105, 105, 105, 106, 106, 106, 106, 106, 106, 106, 106, 106, 106, 106, 106, 106, 106, 106, 106, 107, 107, 106, 106, 106, 107, 107, 107, 106, 106, 106, 106, 107, 107, 107, 106]
5828A06%%JJ%j%%JJ%%%%%%%J%%j%%%%%J%%J%%%J%J%%j%J%j%jJJ%J%%%J%%%%%JJJJJKKKMLL
5821A36LMMLLMKKJ%jlkklkklkjjjjkjkjkjj%j%jjjj%%%%%J%J%%Jj%%JJJJ%JKKKJJKKLLLMN
5813A60MMMMNMMNNNNNMMLMNMNMMMMLLLKKJJ%%%jjlkllllmmnlmlmmmnmnmnmmmmmmllkljkkj
5806A56kj%jj%%j%j%%%J%JJJ%%%%%%%J%%JJJJJ%J%%KJ%JJJ%J%%JJJ%J%J%J%K%JJJKJ%J%JJ
5799A84JJ%J%KKJKJ%JJJ%JKKJ%JJJKKKJKJKJKJJJJKLKKKLKJKLKKLKKKLLKLLLMLMLLMMLMMM
5791C18MNNNMNNNMNNNOOONONOOOOONOOOOPPOOOOPOPOPPPPPQQQQQQQQRJ0J0J0J0RJ0J1J0J2
5785G32J2J2J3J2J3J4J4J4J4J6J6J6J7J8J8J8K0K1K0K1K1K3K4K5K5K6K7K8L0L1L2L3L3L6L7
5781A482L8L9M1M3M4M7M9N0N3N4N8N9O1O4O7P0P1P5P9Q1Q4Q8R1R4R7J01J05J08J11J15J19
$$ y = [106, 106, 106, 107, 108, 108, 107, 107, 107, 108, 109, 109, 109, 109, 109, 109, 109, 109, 110, 110, 110, 109, 109, 109, 109, 109, 109, 110, 110, 110, 111, 111, 111, 111, 112, 112, 113, 113, 113, 112, 112, 113, 113, 112, 112, 111, 112, 113, 113, 114, 114, 114, 114, 115, 115, 115, 115, 115, 115, 116, 117, 118, 119, 120, 122, 124, 126, 130, 133, 136, 139, 143, 147, 150, 153, 157, 159, 161, 162, 162, 161, 158, 156, 154, 151, 149, 147, 144, 142, 141, 140, 139, 138, 136, 135, 133, 132, 130, 129, 128, 128, 127, 127, 126, 125, 124, 123, 123, 123, 123, 123, 123, 124, 124, 125, 125, 125, 126, 125, 125, 125, 126, 127, 128, 129, 129, 130, 132, 134, 136, 137, 138, 140, 142, 145, 148, 151, 155, 160, 164, 168, 172, 176, 181, 185, 189, 194, 199, 204, 209, 214, 218, 222, 225, 229, 234, 238, 243, 247, 251, 255, 259, 262, 265, 268, 270, 272, 273, 274, 274, 274, 274, 273, 272, 269, 267, 264, 261, 258, 255, 251, 247, 242, 239, 235, 232, 228, 224, 220, 215, 211, 206, 202, 197, 193, 189, 185, 181, 177, 173, 170, 167, 165, 162, 161, 159, 157, 156, 154, 153, 153, 152, 151, 151, 151, 150, 150, 149, 149, 149, 149, 150, 150, 151, 152, 153, 153, 153, 153, 153, 153, 153, 153, 154, 154, 154, 155, 156, 157, 158, 159, 159, 160, 160, 160, 162, 163, 163, 164, 165, 166, 166, 167, 167, 167, 168, 169, 170, 170, 171, 171, 172, 172, 173, 173, 175, 175, 176, 177, 178, 180, 181, 181, 182, 182, 183, 184, 185, 186, 186, 187, 187, 189, 191, 192, 194, 195, 195, 196, 197, 198, 198, 199, 201, 203, 204, 204, 205, 206, 207, 209, 211, 213, 214, 216, 217, 219, 220, 222, 223, 224, 225, 226, 228, 231, 233, 235, 237, 240, 242, 243, 245, 248, 250, 252, 255, 257, 259, 261, 264, 267, 269, 272, 275, 278, 282, 285, 289, 292, 295, 299, 303, 306, 310, 314, 318, 322, 327, 332, 337, 341, 346, 351, 356, 360, 365, 370, 375, 381, 387, 393, 398, 404, 409, 415, 421, 427, 433, 439, 444, 450, 456, 462, 468, 475, 482, 488, 494, 500, 506, 513, 519, 526, 532, 539, 546, 553, 560, 567, 575, 583, 591, 599, 607, 615, 623, 631, 640, 650, 660, 670, 680, 689, 699, 710, 720, 732, 744, 756, 769, 781, 794, 808, 822, 836, 850, 866, 882, 898, 915, 933, 951, 969, 989, 1010, 1030, 1051, 1072, 1095, 1119, 1144, 1169, 1195, 1222, 1250, 1280, 1311, 1343, 1376, 1409, 1445, 1482, 1520, 1559, 1600, 1643, 1687, 1734, 1783, 1833, 1886, 1940, 1998, 2057, 2118, 2182, 2249, 2319, 2390, 2465, 2544, 2625, 2709, 2797, 2888, 2982, 3079, 3180, 3285, 3393, 3504, 3619, 3738]
5778C738J20J24J26J28J31J33J34J36J35J35J35J34J31J28J25J20J15J10J02R5Q6P9O9N9M8
5775F576L8K8J6Noj7k7l8m8n6o5p4q1q9r4j02j06j10j15j17j20j23j24j25j24j26j25j25j23
5772D403j22j20j18j16j14j11j09j05j03j01r8r5r2q9q7q3q1p8p6p3p1o8o7o3o1n9n7n5n3
5769A878n1n0m7m6m4m2m1m0l9l7l5l5l3l3l1l1k9k9k7k6k6k5k4k4k3k1k2k0k0j9k0j9j8j7
5766H34j7j6j6j5j5j5j4j4j3j3j3j2j2j2j1j1j1j0j0j0j0rrqrqqqpqppponoononnnnnmmml
5761C95lmllllmlllklklkjkllkljkkjlkjjkkjkj%kkkjjkkjjkklkjjklklkklkkkkkkjkklkk
5753B50jkkjjkkkkjkkjkjkjkkjkkjkkjlkjkklkkllkkkllklklkkkllkkkkkjjjjj%%%%%JJKJ
5746A41JJKKLLLLNMONPOQRRJ0J1J2J2J2J3J4J3J3J2J3J2J1J0J0RQPOONMNMKKKK%%kklmmmn
$$ y = [3738, 3858, 3982, 4108, 4236, 4367, 4500, 4634, 4770, 4905, 5040, 5175, 5309, 5440, 5568, 5693, 5813, 5928, 6038, 6140, 6235, 6321, 6400, 6469, 6528, 6576, 6614, 6642, 6658, 6663, 6657, 6640, 6613, 6575, 6527, 6471, 6406, 6332, 6251, 6162, 6068, 5966, 5860, 5750, 5635, 5518, 5398, 5275, 5151, 5026, 4902, 4776, 4651, 4526, 4403, 4281, 4161, 4043, 3927, 3813, 3702, 3593, 3488, 3385, 3284, 3186, 3091, 2999, 2910, 2823, 2740, 2659, 2581, 2505, 2432, 2361, 2293, 2226, 2163, 2102, 2043, 1986, 1931, 1878, 1827, 1777, 1730, 1684, 1640, 1598, 1557, 1517, 1478, 1441, 1406, 1371, 1338, 1305, 1274, 1243, 1214, 1185, 1158, 1132, 1106, 1081, 1057, 1033, 1010, 989, 967, 947, 927, 908, 888, 869, 851, 834, 817, 801, 785, 770, 755, 740, 726, 712, 699, 686, 673, 661, 649, 637, 626, 615, 604, 594, 584, 574, 564, 555, 546, 538, 529, 521, 513, 505, 498, 490, 483, 476, 469, 463, 458, 452, 446, 441, 435, 430, 425, 420, 415, 410, 406, 402, 398, 395, 392, 388, 385, 382, 379, 376, 372, 369, 366, 363, 361, 358, 356, 353, 351, 350, 348, 345, 342, 340, 337, 336, 334, 332, 331, 328, 326, 325, 324, 322, 320, 319, 317, 316, 316, 314, 312, 310, 309, 308, 306, 304, 303, 302, 300, 298, 295, 293, 292, 291, 289, 286, 284, 281, 279, 277, 274, 272, 270, 268, 266, 264, 262, 261, 259, 257, 254, 252, 250, 249, 247, 245, 244, 243, 241, 239, 237, 235, 234, 232, 230, 229, 227, 226, 224, 223, 221, 219, 218, 216, 214, 213, 211, 209, 208, 205, 203, 202, 200, 198, 195, 193, 191, 188, 185, 183, 181, 179, 176, 173, 171, 168, 166, 163, 161, 159, 157, 154, 151, 149, 147, 145, 143, 141, 140, 139, 138, 137, 136, 136, 136, 136, 136, 136, 137, 138, 140, 141, 142, 143, 145, 147, 150, 153, 156, 159, 164, 168, 174, 179, 186, 192, 200, 209, 218, 228, 239, 251, 263, 275, 288, 302, 315, 328, 340, 353, 365, 376, 386, 396, 405, 413, 420, 426, 432, 437, 441, 446, 450, 452, 454, 456, 458, 458, 458, 456, 454, 451, 447, 443, 439, 434]
5740D34mmmmmllkkj%jJJJJKKKKKLLKLMLLLLNMMNNNNNOOPQQQJ0J1J1J3J3J5J6J8J9K2K3K5K8
5734G48L0L4L6L9M3M6N0N6O0O7P5Q3R4J06J22J40J62J88K20K56L01L51M09M76N50O31P20Q14
5731F907R11J012J111J207J293J370J433J481J511J523J510J477J422J348J260J157J044R23
5729B9900P94O63N32M04K79J57L8q2j99l15m32n48o65p81q96j007j114j213j299j370j425
5727B1421j463j479j477j452j409j349j276j190j098j000r01q04p11o25n44m72m09l53l05
5725C104k65k30k00j76j55j38j25j13j02r3q5p9p2o8o2n8n4n1m6m5m2l9l7l3l2k9k8k5k4k2
5722E76k1k1j9j7j7j6j5j5j4j3j2j2j0j1j0rrrj0qqpopononmnmmmlnlmmnnnpoppqpqpqqpp
5716A16ononmllkk%JJKLLNNOOQQQJ0J0J0J0J1J0J1J0J0J0J0QRPPPOMMLLKJLJJJ%%%jjjjjk
$$ y = [434, 430, 426, 422, 418, 414, 411, 408, 406, 404, 403, 403, 402, 403, 404, 405, 406, 408, 410, 412, 414, 416, 419, 422, 424, 427, 431, 434, 437, 440, 443, 448, 452, 456, 461, 466, 471, 476, 481, 487, 493, 500, 508, 516, 524, 534, 545, 556, 569, 582, 597, 613, 631, 650, 672, 695, 720, 748, 778, 812, 848, 887, 930, 976, 1026, 1082, 1142, 1209, 1284, 1367, 1461, 1567, 1689, 1829, 1991, 2179, 2399, 2655, 2956, 3307, 3716, 4192, 4742, 5373, 6093, 6907, 7818, 8830, 9941, 11148, 12441, 13811, 15244, 16725, 18236, 19759, 21269, 22746, 24168, 25516, 26776, 27933, 28977, 29900, 30694, 31357, 31889, 32293, 32572, 32729, 32767, 32685, 32486, 32171, 31739, 31191, 30526, 29745, 28849, 27842, 26728, 25515, 24216, 22846, 21421, 19958, 18479, 17002, 15550, 14141, 12792, 11516, 10326, 9228, 8228, 7327, 6523, 5812, 5187, 4643, 4171, 3762, 3409, 3104, 2839, 2609, 2409, 2233, 2078, 1940, 1815, 1702, 1600, 1507, 1422, 1343, 1271, 1203, 1141, 1083, 1029, 978, 932, 887, 845, 806, 769, 736, 704, 675, 647, 622, 598, 576, 555, 534, 515, 498, 481, 465, 450, 435, 421, 408, 396, 384, 374, 363, 353, 344, 335, 326, 316, 308, 300, 293, 287, 280, 274, 269, 263, 258, 254, 249, 245, 241, 237, 234, 229, 226, 222, 218, 213, 208, 203, 196, 190, 183, 176, 168, 161, 153, 146, 138, 130, 123, 116, 110, 105, 99, 94, 90, 87, 84, 82, 80, 80, 81, 82, 84, 87, 90, 95, 100, 106, 112, 120, 128, 136, 146, 156, 166, 176, 187, 197, 208, 218, 228, 238, 248, 256, 265, 272, 279, 286, 292, 296, 300, 303, 306, 308, 309, 312, 313, 314, 315, 315, 315, 315, 314, 313, 312, 311, 310, 308]
5710C08jkkkkkklmklllklklllmkklkkkkkjjjkjjkjkjjjjjj%kjj%jjjj%jjjjjj%%jj%jj%jj
5703B02%%%%j%%%%j%%%%%%%%%J%J%%%%J%jJ%%%j%j%%%j%j%%Jj%%%%j%%%j%j%j%%j%j%%j%j
5695A91%%%j%jjj%%%j%j%%%j%jJ%%jj%j%jjj%%%jjj%j%j%j%%j%%%%%%%%%%j%%%%%%j%%J%j
5688A69%J%J%j%%%%%%jjj%%j%%%%j%%%j%jj%%J%%%%j%%J%J%%%j%j%%%J%%jjJ%j%%%j%%%j%
5681A59j%%%%j%j%jjj%%%%j%J%%j%%j%J%%%%j%%%%Jj%J%%%j%%%%%J%%j%%%%%%J%%%%%%%j%
5674A51%%%%J%j%jJ%j%%%jJ%%%%%%%%%%%%%%%%J%j%%j%%J%%%j%%%j%%%%%%%%%%j%%%%%j%j
5666A45%J%j%%Jj%%j%%%%J%j%%%%%jJ%%j%%J%%%%%%j%%%%%%%%%jJ%%%jJ%j%%j%%%%%%%%%J
5659A42%jj%%J%%%%%%%%%%%%J%%%%%%%j%%j%%Jj%%%%J%%J%%%j%jJ%j%%%J%%%j%%%j%J%%J%
$$ y = [308, 307, 305, 303, 301, 299, 297, 295, 292, 288, 286, 283, 280, 277, 275, 272, 270, 267, 264, 261, 257, 255, 253, 250, 248, 246, 244, 242, 240, 239, 238, 237, 235, 234, 233, 231, 230, 228, 227, 226, 225, 224, 223, 222, 222, 220, 219, 218, 218, 217, 216, 215, 214, 214, 213, 212, 211, 210, 209, 208, 208, 208, 207, 206, 206, 205, 204, 204, 203, 202, 202, 202, 202, 202, 201, 201, 201, 201, 201, 200, 200, 200, 200, 200, 200, 200, 200, 200, 200, 201, 201, 202, 202, 202, 202, 202, 203, 203, 202, 203, 203, 203, 203, 202, 202, 201, 201, 201, 201, 200, 200, 199, 199, 199, 200, 199, 199, 199, 199, 199, 198, 198, 198, 198, 197, 197, 196, 196, 195, 195, 195, 194, 194, 193, 193, 193, 192, 192, 191, 191, 191, 191, 190, 190, 189, 188, 187, 187, 187, 187, 186, 186, 185, 185, 185, 185, 184, 184, 183, 184, 184, 184, 183, 182, 182, 181, 181, 180, 179, 178, 178, 178, 178, 177, 176, 175, 175, 174, 174, 173, 173, 172, 172, 172, 171, 171, 171, 171, 171, 171, 171, 171, 171, 171, 171, 170, 170, 170, 170, 170, 170, 170, 169, 169, 169, 170, 170, 169, 169, 170, 170, 171, 171, 170, 170, 170, 170, 170, 170, 170, 169, 168, 167, 167, 167, 166, 166, 166, 166, 166, 165, 165, 165, 165, 164, 164, 163, 162, 162, 162, 163, 163, 163, 163, 163, 162, 162, 162, 163, 163, 164, 164, 164, 164, 163, 163, 162, 162, 162, 162, 163, 163, 163, 162, 161, 162, 162, 161, 161, 161, 161, 160, 160, 160, 160, 159, 159, 158, 158, 158, 158, 158, 157, 157, 156, 156, 155, 154, 153, 153, 153, 153, 153, 152, 152, 153, 153, 153, 152, 152, 152, 151, 151, 152, 152, 152, 152, 152, 151, 151, 151, 151, 151, 152, 151, 151, 152, 152, 152, 152, 151, 151, 151, 151, 151, 151, 152, 152, 152, 151, 151, 151, 151, 151, 151, 151, 152, 152, 152, 152, 152, 152, 152, 152, 151, 151, 151, 151, 151, 151, 152, 152, 151, 151, 150, 151, 151, 150, 150, 150, 150, 149, 150, 150, 150, 150, 150, 150, 150, 150, 150, 150, 150, 150, 150, 150, 150, 150, 150, 151, 151, 150, 150, 150, 149, 149, 149, 150, 150, 150, 150, 149, 149, 149, 149, 148, 148, 148, 148, 148, 148, 148, 148, 148, 148, 148, 147, 147, 147, 147, 147, 147, 146, 146, 145, 145, 146, 146, 145, 145, 145, 146, 145, 145, 145, 144, 144, 144, 144, 144, 145, 145, 144, 144, 144, 144, 144, 144, 143, 144, 144, 144, 143, 143, 143, 144, 144, 144, 144, 144, 144, 144, 143, 143, 143, 143, 143, 143, 143, 143, 143, 143, 142, 143, 143, 143, 143, 142, 143, 143, 142, 142, 142, 141, 141, 141, 141, 141, 141, 141, 141, 141, 141, 142, 142, 141, 140, 140, 140, 141, 141, 141, 141, 141, 141, 141, 141, 141, 141, 141, 141, 141, 142, 142, 142, 142, 142, 142, 142, 142, 141, 141, 141, 140, 140, 140, 141, 140, 140, 140, 140, 140, 141, 141, 141, 142, 142, 142, 142, 141, 141, 140, 141, 141, 140, 140, 140, 140, 141, 141, 141, 141, 140, 140, 140, 140, 139, 139, 140, 140, 140, 141, 141]
5652A41%%%%%%J%%%%%J%%%%%Jj%%J%JJKJJJKJKJKLLLLMMMNNMNMNNNNMMNNLMLNMLLKKKKK%J
5644B80%%jkkllklmmmlmmnmmlnomnmnmlnmmlmmllkkklkjjk%kj%%jj%j%%%%%jj%%%%%%j%%%
5637A35%j%%%j%%%%j%%j%J%J%j%%%%%%j%%%%%%%%j%%%%J%%%%%%J%%%%%%%%%%J%%%%%%%%J%
5630A34j%j%%%%%j%%%%%%J%j%Jj%%%%%j%%%%%%%%J%%%%%j%%%%%%%jJ%J%%j%%%%%J%%j%j%%
5622A29%%JjJ%j%%%%j%%%J%%%j%%%%J%%%%%%%%%%%%%%j%%j%%%%JJ%%j%%%%%j%%%JJ%j%%%%
5615A28%%%%%%J%%%jj%%jJ%%%Jj%%j%J%%%%%%%j%J%%%%%%%J%jj%%%%jJ%%%%%%%%%%%%J%%%
5608A27j%J%%j%Jj%%JJ%%%%%j%%j%%J%j%%j%%j%JJ%J%%%j%j%%j%%%%%%%%J%%%%%%%%j%%%%
5600A24%%%%%%%J%J%%%jj%j%%%%%%%JJ%%j%%%j%%%%J%%%j%%%%J%%J%j%J%jj%%%J%j%J%j%J
$$ y = [141, 141, 141, 141, 141, 141, 141, 142, 142, 142, 142, 142, 142, 143, 143, 143, 143, 143, 143, 144, 143, 143, 143, 144, 144, 145, 146, 148, 149, 150, 151, 153, 154, 156, 157, 159, 162, 165, 168, 171, 175, 179, 183, 188, 193, 197, 202, 206, 211, 216, 221, 226, 230, 234, 239, 244, 247, 251, 254, 259, 263, 266, 269, 271, 273, 275, 277, 279, 279, 280, 280, 280, 279, 277, 275, 272, 269, 267, 264, 260, 256, 252, 249, 245, 241, 236, 232, 228, 225, 220, 214, 210, 205, 201, 196, 192, 189, 184, 180, 176, 173, 169, 165, 162, 159, 157, 155, 153, 150, 148, 147, 146, 144, 144, 142, 141, 141, 141, 140, 139, 139, 138, 138, 138, 138, 138, 138, 137, 136, 136, 136, 136, 136, 136, 136, 135, 135, 135, 135, 135, 134, 134, 134, 134, 133, 133, 133, 133, 133, 132, 132, 132, 131, 131, 132, 132, 133, 133, 132, 132, 132, 132, 132, 132, 132, 131, 131, 131, 131, 131, 131, 131, 131, 131, 130, 130, 130, 130, 130, 131, 131, 131, 131, 131, 131, 131, 132, 132, 132, 132, 132, 132, 132, 132, 132, 132, 132, 133, 133, 133, 133, 133, 133, 133, 133, 133, 134, 134, 133, 133, 132, 132, 132, 132, 132, 132, 131, 131, 131, 131, 131, 131, 131, 132, 132, 131, 131, 132, 131, 131, 131, 131, 131, 131, 130, 130, 130, 130, 130, 130, 130, 130, 130, 131, 131, 131, 131, 131, 131, 130, 130, 130, 130, 130, 130, 130, 130, 129, 130, 130, 131, 131, 131, 130, 130, 130, 130, 130, 130, 131, 131, 131, 130, 130, 129, 129, 129, 129, 129, 130, 129, 130, 130, 129, 129, 129, 129, 129, 128, 128, 128, 128, 129, 129, 129, 129, 128, 128, 128, 128, 128, 129, 129, 129, 129, 129, 129, 129, 129, 129, 129, 129, 129, 129, 129, 129, 128, 128, 128, 127, 127, 127, 127, 127, 128, 129, 129, 129, 128, 128, 128, 128, 128, 128, 127, 127, 127, 127, 128, 129, 129, 128, 128, 128, 128, 128, 128, 128, 128, 128, 128, 128, 129, 129, 129, 129, 128, 127, 127, 127, 126, 127, 127, 127, 127, 128, 127, 127, 127, 126, 126, 127, 127, 127, 127, 127, 127, 127, 127, 126, 126, 127, 127, 127, 127, 127, 127, 127, 127, 128, 128, 127, 126, 126, 126, 126, 126, 125, 126, 126, 126, 126, 126, 126, 126, 126, 126, 126, 126, 126, 126, 127, 127, 127, 127, 126, 126, 127, 127, 127, 126, 126, 127, 126, 126, 126, 127, 128, 128, 128, 128, 128, 128, 127, 127, 127, 126, 126, 126, 127, 127, 126, 126, 126, 125, 125, 125, 124, 124, 125, 126, 126, 127, 127, 127, 127, 126, 126, 125, 125, 125, 124, 124, 124, 124, 124, 124, 124, 124, 124, 125, 125, 125, 125, 125, 125, 125, 125, 125, 124, 124, 124, 124, 124, 124, 124, 124, 124, 124, 124, 124, 125, 125, 126, 126, 126, 126, 125, 124, 124, 123, 123, 123, 123, 123, 123, 123, 123, 124, 125, 125, 125, 124, 124, 124, 124, 123, 123, 123, 123, 123, 124, 124, 124, 124, 123, 123, 123, 123, 123, 124, 124, 124, 125, 125, 124, 124, 125, 125, 124, 123, 123, 123, 123, 124, 124, 123, 123, 124, 124, 123, 123, 124]
5593A24%%j%%J%%%jJ%%%j%%jJ%%%%%%%jJ%%%j%%%%%JjJ%j%%J%%%%%Jj%%J%%%j%%%%%j%%%%
5586A22jJ%%%J%%%j%%%%%J%%j%jJ%%j%%%%%%%%%%%%%%%%%%%%%%%%%%%%%%%j%J%%%%%J%j%%
5578A21jJ%%%%%%%jJ%%%%%%J%%j%%%%JjJ%j%%%J%j%j%%J%Jj%j%%J%Jj%%%j%J%J%j%jJ%%j%
5571A20j%JJJ%%%%j%%%J%%j%%%%%%%%%%%%%%%%%j%%J%j%%%J%Jj%%%j%J%%j%jJ%J%%j%%%%%
5564A20%%%%%%%%%%jJ%%%j%%%%%%%%%%%J%%%%Jj%%%%%j%%%%%%%%%%%%%%%%%%%%%%J%%%%%%
5557A20J%j%j%%%%%%%%%j%%%%%%J%j%%%%J%Jj%%%%%%%%%%J%%j%jj%J%%%%J%j%J%%%%%j%%%
5549A18J%%%%%%%%jJ%j%j%J%Jj%%%J%j%%%%Jj%%%%%%%jJJ%%j%%%%j%%%%%%%%J%%%%j%%J%%
5542A18%%J%j%%j%%%%%Jj%j%J%%%%%%%%J%j%%%%%%j%%%%JJ%%J%%jj%%%%J%%j%%j%Jj%%%J%
$$ y = [124, 124, 124, 123, 123, 123, 124, 124, 124, 124, 123, 124, 124, 124, 124, 123, 123, 123, 122, 123, 123, 123, 123, 123, 123, 123, 123, 122, 123, 123, 123, 123, 122, 122, 122, 122, 122, 122, 123, 122, 123, 123, 122, 122, 122, 123, 123, 123, 123, 123, 123, 124, 123, 123, 123, 124, 124, 124, 124, 123, 123, 123, 123, 123, 123, 122, 122, 122, 122, 122, 121, 122, 122, 122, 122, 123, 123, 123, 123, 122, 122, 122, 122, 122, 122, 123, 123, 123, 122, 122, 121, 122, 122, 122, 121, 121, 121, 121, 121, 121, 121, 121, 121, 121, 121, 121, 121, 121, 121, 121, 121, 121, 121, 121, 121, 121, 121, 121, 121, 121, 121, 121, 121, 121, 121, 121, 120, 120, 121, 121, 121, 121, 121, 121, 122, 122, 121, 121, 121, 120, 121, 121, 121, 121, 121, 121, 121, 121, 120, 121, 121, 121, 121, 121, 121, 121, 122, 122, 122, 121, 121, 121, 121, 121, 122, 121, 122, 122, 121, 121, 121, 121, 122, 122, 121, 121, 120, 120, 120, 121, 121, 122, 121, 121, 120, 120, 120, 121, 121, 122, 121, 121, 121, 121, 120, 120, 121, 121, 122, 122, 121, 121, 120, 121, 121, 121, 120, 120, 119, 119, 120, 121, 122, 122, 122, 122, 122, 121, 121, 121, 121, 122, 122, 122, 121, 121, 121, 121, 121, 121, 121, 121, 121, 121, 121, 121, 121, 121, 121, 121, 121, 121, 120, 120, 120, 121, 121, 120, 120, 120, 120, 121, 121, 122, 121, 121, 121, 121, 120, 120, 121, 121, 121, 120, 120, 119, 120, 120, 121, 121, 121, 120, 120, 120, 120, 120, 120, 120, 120, 120, 120, 120, 120, 120, 120, 120, 120, 119, 120, 120, 120, 120, 119, 119, 119, 119, 119, 119, 119, 119, 119, 119, 119, 119, 120, 120, 120, 120, 120, 121, 120, 120, 120, 120, 120, 120, 119, 119, 119, 119, 119, 119, 119, 119, 119, 119, 119, 119, 119, 119, 119, 119, 119, 119, 119, 119, 119, 119, 119, 120, 120, 120, 120, 120, 120, 120, 121, 121, 120, 120, 119, 119, 119, 119, 119, 119, 119, 119, 119, 119, 118, 118, 118, 118, 118, 118, 118, 119, 119, 118, 118, 118, 118, 118, 119, 119, 120, 119, 119, 119, 119, 119, 119, 119, 119, 119, 119, 119, 120, 120, 120, 119, 119, 118, 117, 117, 118, 118, 118, 118, 118, 119, 119, 118, 118, 119, 119, 119, 119, 119, 119, 118, 118, 118, 118, 119, 119, 119, 119, 119, 119, 119, 119, 119, 118, 119, 119, 118, 118, 117, 117, 118, 118, 119, 118, 118, 118, 118, 119, 119, 118, 118, 118, 118, 118, 119, 118, 118, 118, 118, 118, 118, 118, 118, 117, 118, 119, 119, 119, 118, 118, 118, 118, 118, 117, 117, 117, 117, 117, 117, 117, 117, 117, 118, 118, 118, 118, 118, 117, 117, 117, 118, 118, 118, 118, 118, 119, 119, 118, 118, 118, 117, 117, 117, 117, 117, 117, 118, 117, 117, 116, 116, 117, 117, 117, 117, 117, 117, 117, 117, 117, 118, 118, 117, 117, 117, 117, 117, 117, 117, 116, 116, 116, 116, 116, 117, 118, 118, 118, 119, 119, 119, 118, 117, 117, 117, 117, 117, 118, 118, 118, 117, 117, 117, 116, 116, 117, 116, 116, 116, 116, 117, 117]
5535A17%%%%j%J%%%%%%%%%%J%%%J%%%j%%%j%%J%J%%%J%%%J%KJ%%%JJ%%%%J%%%%%%j%%%j%j
5527A24%jj%%%%j%%%%j%jjJ%j%%%%%%%%%j%J%%J%%%J%J%%%%%%JJJ%J%J%J%%Jjj%%%%%j%j%
5520A24%%%j%%j%j%jjj%J%j%j%jj%%%%%%%jJ%%%%%%%%%J%%%jJ%j%%%%%%J%%%%%jJ%%%%%%%
5513A16%jj%%%%J%%%%j%j%J%%J%%%%%%%%%%%j%%J%j%%%%%J%%j%%%%%%j%%j%%J%J%%%%%%j%
5505A13%J%%%%%%J%%%%%%%%j%j%%%%%%%%J%%%%j%%%%j%%%%%J%%%%%J%j%%%%%%%%%%%J%%%%
5498A14%%%%j%%%%%%%%%j%j%%%JJJ%j%%%%%%%Jj%%%%%%%%%jJ%%%%%%%%%j%%%%%%%%%%J%Jj
5491A13%%%J%%j%j%%%%J%j%%%%%J%J%%j%%%jJ%%%%%%%%J%jj%%%%Jj%%jJ%%%J%%Jj%jJ%J%%
5483A14j%%j%%%%%%%%%%%%J%j%%jJ%Jj%%%jJ%%J%%j%%J%%%%%%jj%%J%%jJj%%%%%%J%%%%%%
$$ y = [117, 117, 117, 117, 117, 116, 116, 117, 117, 117, 117, 117, 117, 117, 117, 117, 117, 117, 118, 118, 118, 118, 119, 119, 119, 119, 118, 118, 118, 118, 117, 117, 117, 118, 118, 119, 119, 119, 119, 120, 120, 120, 120, 121, 121, 123, 124, 124, 124, 124, 125, 126, 126, 126, 126, 126, 127, 127, 127, 127, 127, 127, 127, 126, 126, 126, 126, 125, 125, 124, 124, 123, 122, 122, 122, 122, 122, 121, 121, 121, 121, 121, 120, 120, 119, 118, 119, 119, 118, 118, 118, 118, 118, 118, 118, 118, 118, 118, 117, 117, 118, 118, 118, 119, 119, 119, 119, 120, 120, 121, 121, 121, 121, 121, 121, 121, 122, 123, 124, 124, 125, 125, 126, 126, 127, 127, 127, 128, 127, 126, 126, 126, 126, 126, 126, 125, 125, 124, 124, 124, 124, 124, 123, 123, 123, 122, 122, 121, 121, 120, 119, 118, 118, 119, 119, 118, 118, 117, 117, 116, 115, 115, 115, 115, 115, 115, 115, 115, 114, 115, 115, 115, 115, 115, 115, 115, 115, 115, 115, 116, 116, 116, 116, 115, 116, 116, 115, 115, 115, 115, 115, 115, 115, 116, 116, 116, 116, 116, 116, 115, 116, 116, 116, 116, 116, 116, 116, 116, 116, 115, 114, 114, 114, 114, 114, 115, 115, 115, 115, 115, 114, 114, 113, 113, 114, 114, 114, 115, 115, 115, 115, 115, 115, 115, 115, 115, 115, 115, 115, 114, 114, 114, 115, 115, 114, 114, 114, 114, 114, 114, 115, 115, 115, 114, 114, 114, 114, 114, 114, 114, 113, 113, 113, 112, 112, 112, 113, 113, 114, 114, 114, 114, 114, 114, 114, 113, 113, 113, 114, 114, 114, 114, 114, 114, 114, 115, 115, 115, 115, 115, 115, 115, 115, 115, 114, 114, 113, 113, 113, 113, 113, 113, 113, 113, 113, 114, 114, 114, 114, 114, 113, 113, 113, 113, 113, 112, 112, 112, 112, 112, 112, 113, 113, 113, 113, 113, 113, 114, 114, 113, 113, 113, 113, 113, 113, 113, 113, 113, 113, 113, 113, 114, 114, 114, 114, 114, 114, 114, 114, 114, 113, 113, 113, 113, 113, 113, 113, 113, 113, 113, 112, 112, 111, 111, 111, 111, 112, 113, 114, 114, 113, 113, 113, 113, 113, 113, 113, 113, 114, 113, 113, 113, 113, 113, 113, 113, 113, 113, 113, 112, 113, 113, 113, 113, 113, 113, 113, 113, 113, 113, 112, 112, 112, 112, 112, 112, 112, 112, 112, 112, 112, 113, 113, 114, 113, 113, 113, 113, 114, 114, 114, 113, 113, 112, 112, 112, 112, 112, 113, 113, 112, 112, 112, 112, 112, 112, 113, 113, 114, 114, 114, 113, 113, 113, 113, 112, 113, 113, 113, 113, 113, 113, 113, 113, 113, 114, 114, 113, 112, 112, 112, 112, 112, 113, 112, 112, 112, 111, 112, 112, 112, 112, 113, 113, 113, 114, 113, 113, 112, 113, 113, 114, 114, 114, 113, 113, 113, 112, 112, 112, 112, 112, 112, 112, 112, 112, 112, 112, 112, 112, 113, 113, 112, 112, 112, 111, 112, 112, 113, 112, 112, 112, 112, 111, 112, 112, 112, 113, 113, 113, 112, 112, 112, 113, 113, 113, 113, 113, 113, 113, 112, 111, 111, 111, 112, 112, 112, 111, 112, 111, 111, 111, 111, 111, 111, 111, 112, 112, 112, 112, 112, 112, 112]
5476A12j%%%%%%J%%%%J%%%j%%j%%%%%%%%Jj%%J%j%%J%%%%%jj%%%JJj%j%%%J%%%%%%%%%%%%
5469A11%%%%%%%j%J%%%j%%%%%%%Jj%%%%%%%%J%%%%j%%%%%%%%%%j%J%%%%%%%J%%%%%%%%j%J
5461A11%j%%%%%%%%Jj%j%%%%%%j%J%%%%%%%%%%jJjj%%J%%%%%%Jj%%%j%%%J%JjJ%%%%%%%%%
5454A09%%J%j%%%%J%J%jJ%%%%J%%%%%%j%%%%JJj%%j%%%%%%%%J%%%%%%j%%%%%j%%J%%%%%J%
5447A12%%%%%%%%j%%%J%%%%j%J%%%%J%J%J%%JJ%JJJ%JJJKJJKLKKKKKLKKLKLKLKKLKLKKKJJ
5440A82JJJJ%%jjkkjkjkkklklkllkkllkklkkkjkkkjjjjjjj%jj%jj%%%j%%jj%%%%%%%%j%%%
5432A09%%%%%%%%%J%%j%%%%%%%%%j%J%Jj%%%%%Jj%%%%%j%%J%%%%%j%%%%%%%%%Jjj%%J%%%%
5425A08j%JjJ%%%%%j%jJ%j%J%J%%%%%%j%%%J%%%%%j%%J%%%j%%j%%%%JJ%%%j%%j%%%%%%j%%
$$ y = [112, 111, 111, 111, 111, 111, 111, 111, 112, 112, 112, 112, 112, 113, 113, 113, 113, 112, 112, 112, 111, 111, 111, 111, 111, 111, 111, 111, 111, 112, 111, 111, 111, 112, 112, 111, 111, 111, 112, 112, 112, 112, 112, 112, 111, 110, 110, 110, 110, 111, 112, 111, 111, 110, 110, 110, 110, 111, 111, 111, 111, 111, 111, 111, 111, 111, 111, 111, 111, 111, 111, 111, 111, 111, 111, 111, 111, 110, 110, 111, 111, 111, 111, 110, 110, 110, 110, 110, 110, 110, 110, 111, 110, 110, 110, 110, 110, 110, 110, 110, 110, 111, 111, 111, 111, 111, 110, 110, 110, 110, 110, 110, 110, 110, 110, 110, 110, 109, 109, 110, 110, 110, 110, 110, 110, 110, 110, 111, 111, 111, 111, 111, 111, 111, 111, 111, 110, 110, 111, 111, 110, 110, 110, 110, 110, 110, 110, 110, 110, 111, 110, 110, 109, 109, 109, 109, 109, 109, 109, 108, 108, 109, 109, 109, 109, 109, 109, 109, 109, 109, 109, 109, 108, 109, 108, 107, 107, 107, 108, 108, 108, 108, 108, 108, 108, 109, 108, 108, 108, 108, 107, 107, 107, 107, 108, 108, 109, 108, 109, 109, 109, 109, 109, 109, 109, 109, 109, 109, 109, 109, 110, 110, 109, 109, 109, 109, 109, 110, 110, 111, 111, 110, 111, 111, 111, 111, 111, 112, 112, 112, 112, 112, 112, 112, 111, 111, 111, 111, 111, 112, 113, 112, 112, 112, 111, 111, 111, 111, 111, 111, 111, 111, 111, 112, 112, 112, 112, 112, 112, 112, 111, 111, 111, 111, 111, 111, 110, 110, 110, 111, 111, 111, 111, 111, 111, 112, 112, 112, 112, 112, 112, 112, 112, 112, 112, 111, 111, 111, 111, 112, 112, 112, 112, 112, 111, 111, 112, 112, 112, 112, 112, 113, 113, 114, 114, 115, 115, 115, 116, 117, 117, 118, 119, 120, 120, 121, 122, 123, 125, 126, 127, 129, 132, 134, 136, 138, 140, 142, 145, 147, 149, 152, 154, 157, 159, 162, 164, 166, 169, 171, 174, 176, 178, 180, 181, 182, 183, 184, 185, 186, 186, 186, 185, 184, 182, 180, 179, 177, 176, 174, 172, 170, 167, 165, 162, 160, 157, 154, 152, 150, 147, 144, 142, 140, 137, 135, 133, 131, 130, 128, 126, 124, 123, 122, 121, 120, 119, 118, 117, 117, 116, 115, 115, 114, 113, 113, 113, 113, 112, 112, 112, 111, 110, 110, 110, 110, 110, 110, 110, 110, 110, 109, 109, 109, 109, 109, 109, 109, 109, 109, 109, 109, 109, 109, 110, 110, 110, 109, 109, 109, 109, 109, 109, 109, 109, 109, 109, 108, 108, 109, 109, 110, 109, 109, 109, 109, 109, 109, 110, 109, 109, 109, 109, 109, 109, 108, 108, 108, 109, 109, 109, 109, 109, 109, 108, 108, 108, 108, 108, 108, 108, 108, 108, 108, 109, 108, 107, 107, 107, 108, 108, 108, 108, 108, 107, 107, 108, 107, 108, 108, 108, 108, 108, 108, 107, 107, 106, 107, 107, 106, 106, 107, 107, 108, 108, 108, 108, 108, 108, 108, 107, 107, 107, 107, 108, 108, 108, 108, 108, 108, 107, 107, 107, 108, 108, 108, 108, 107, 107, 107, 106, 106, 106, 106, 106, 107, 108, 108, 108, 108, 107, 107, 107, 106, 106, 106, 106, 106, 106, 106, 105, 105, 105]
5418A05%%%%%%J%%J%%jj%%J%%%j%%%%%%%%%%J%%%j%%%J%%%j%%%%%J%%%%J%%%%j%%%%%%%%j
5410A05%%%%%%J%%%%%%%%%%%%%%j%J%%j%jJ%%j%%%JJ%j%%%%%J%%%%%%%j%%%%%%%%j%%%%%%
5403A04%%Jj%%%%%j%%%J%%J%%%%%%J%%%%%%%%jj%%J%%%%%j%J%%j%%%%%%J%%%%%%%%%J%j%%
5396A05%%J%jj%j%J%%%%%%%j%%%%%%%%%%jj%%%%j%Jj%%j%j%%%%J%%%j%%J%%%%j%j%%%%%jj
5388I5%%JJ%%%%%%%%%%%Jj%J%%%J%%%%jJ%%%%J%%%%J%%j%%j%%J%%%%j%J%%%%%%%%%j%%%%%
5381I9%j%%%jJ%%%j%%%%j%%%%j%%%%j%%j%jjjjj%j%j%jjj%%j%j%%j%j%%J%J%%JJJJ%JJKJK
5374I2KLKLLLMLMMMNMNMMNONONMNMNNMNMLMLLLLLKKJJKJJ%J%%%%j%%%j%j%jj%j%%%%%%J%J
5366B41%JJJKKKJKKKLKKKKLMLNMMNNOPPRRJ0J1J2J3J5J6J8J9K2K4K7L0L5L9M4N0N7O4P4Q4
$$ y = [105, 105, 105, 105, 105, 105, 105, 106, 106, 106, 107, 107, 107, 106, 105, 105, 105, 106, 106, 106, 106, 105, 105, 105, 105, 105, 105, 105, 105, 105, 105, 105, 106, 106, 106, 106, 105, 105, 105, 105, 106, 106, 106, 106, 105, 105, 105, 105, 105, 105, 106, 106, 106, 106, 106, 107, 107, 107, 107, 107, 106, 106, 106, 106, 106, 106, 106, 106, 106, 105, 105, 105, 105, 105, 105, 105, 106, 106, 106, 106, 106, 106, 106, 106, 106, 106, 106, 106, 106, 106, 106, 105, 105, 106, 106, 106, 105, 105, 104, 105, 105, 105, 104, 104, 104, 104, 105, 106, 106, 105, 105, 105, 105, 105, 105, 106, 106, 106, 106, 106, 106, 106, 106, 105, 105, 105, 105, 105, 105, 105, 105, 105, 104, 104, 104, 104, 104, 104, 104, 104, 104, 105, 104, 104, 104, 104, 104, 104, 103, 103, 103, 103, 104, 104, 104, 105, 105, 105, 105, 105, 105, 105, 106, 106, 106, 106, 106, 106, 106, 106, 106, 105, 104, 104, 104, 105, 105, 105, 105, 105, 105, 104, 104, 105, 105, 105, 104, 104, 104, 104, 104, 104, 104, 105, 105, 105, 105, 105, 105, 105, 105, 105, 105, 106, 106, 105, 105, 105, 105, 105, 106, 106, 105, 104, 104, 103, 103, 104, 104, 104, 104, 104, 104, 104, 104, 103, 103, 103, 103, 103, 103, 103, 103, 103, 103, 103, 102, 101, 101, 101, 101, 101, 100, 100, 101, 100, 100, 100, 99, 99, 98, 98, 98, 98, 98, 99, 99, 99, 99, 98, 98, 98, 99, 99, 99, 99, 99, 98, 98, 97, 97, 97, 97, 97, 97, 96, 95, 95, 95, 96, 97, 97, 97, 97, 97, 97, 97, 97, 97, 97, 97, 97, 98, 97, 97, 98, 98, 98, 98, 99, 99, 99, 99, 99, 98, 99, 99, 99, 99, 99, 100, 100, 100, 100, 100, 101, 101, 101, 100, 100, 100, 99, 99, 99, 100, 100, 100, 100, 100, 99, 99, 100, 100, 100, 100, 100, 100, 100, 100, 100, 100, 99, 99, 99, 99, 99, 99, 99, 98, 98, 98, 98, 97, 98, 98, 98, 98, 97, 97, 97, 97, 97, 96, 96, 96, 96, 96, 95, 95, 95, 95, 95, 94, 94, 94, 93, 93, 92, 91, 90, 89, 88, 88, 87, 87, 86, 86, 85, 84, 83, 83, 83, 82, 82, 81, 81, 81, 80, 80, 79, 79, 79, 80, 80, 81, 81, 81, 82, 83, 84, 85, 85, 86, 87, 89, 90, 92, 94, 97, 99, 102, 105, 108, 112, 115, 119, 123, 127, 132, 136, 141, 145, 149, 154, 160, 165, 171, 176, 180, 185, 189, 194, 199, 203, 208, 212, 215, 219, 222, 225, 228, 231, 234, 236, 238, 239, 240, 242, 243, 244, 244, 245, 245, 245, 245, 245, 244, 244, 244, 244, 243, 243, 242, 242, 241, 240, 240, 239, 239, 239, 239, 239, 239, 239, 240, 240, 241, 241, 242, 243, 244, 246, 248, 250, 251, 253, 255, 257, 260, 262, 264, 266, 268, 271, 275, 278, 283, 287, 291, 296, 301, 307, 314, 321, 330, 339, 349, 360, 372, 385, 400, 416, 434, 453, 475, 499, 526, 556, 591, 630, 674, 724, 781, 845, 919, 1003]
5361A003R8J13J27J42J60J79K00K23K48K73K97L19L41L64L89M13M35M51M62M72M82M92N00
5358H183N04N00M92M79M67M54M41M21L95L62L25K87K52K16J76J27P5K1k8p1j13j58k05k53
5356A3349k94l31l60l82m05m29m50m68m82m86m87m86m84m83m80m73m60m44m26m07l88l68l47
5354C529l24k99k75k50k28k06j86j66j46j30j15j01r0p9o9o2n4m8m4l9l7l3k9k7k6k3k2k0
5351D01j8j7j5j4j4j3j2j1rrrqqpppononnnmlmmmmlllkllklklkklllkkklkkkkklllllkkjk
5344H7jjkjj%%%JJJJJKLKLLMLMLMLMMMMLMLLMMLLLLLJLKKKJJ%JJJJ%jj%%%jjjj%j%jkjjjk
5337A73jjjjjjjkjjjjjj%jjjjj%j%%%%j%j%j%jjj%%%%%%j%%%%%j%%j%%%%J%j%Jj%%%%%%%J
5329A44%j%%%%jJ%%%%%%%J%%%%%%%j%%%%j%%j%%%%J%%%j%%%%%%%jJ%J%%%%%%%%%%%%%%%jj
$$ y = [1003, 1101, 1214, 1341, 1483, 1643, 1822, 2022, 2245, 2493, 2766, 3063, 3382, 3723, 4087, 4476, 4889, 5324, 5775, 6237, 6709, 7191, 7683, 8183, 8687, 9187, 9679, 10158, 10625, 11079, 11520, 11941, 12336, 12698, 13023, 13310, 13562, 13778, 13954, 14081, 14156, 14177, 14149, 14078, 13965, 13807, 13602, 13349, 13055, 12724, 12364, 11982, 11577, 11148, 10698, 10230, 9748, 9262, 8775, 8289, 7805, 7322, 6842, 6369, 5909, 5465, 5039, 4632, 4244, 3876, 3529, 3205, 2906, 2631, 2381, 2153, 1947, 1761, 1595, 1449, 1319, 1204, 1103, 1013, 934, 865, 803, 749, 701, 657, 618, 581, 548, 519, 492, 466, 443, 421, 401, 383, 366, 351, 337, 323, 310, 298, 287, 278, 269, 260, 252, 244, 237, 230, 223, 217, 212, 206, 201, 196, 191, 187, 184, 180, 176, 172, 168, 165, 162, 159, 157, 154, 151, 149, 146, 144, 141, 139, 137, 134, 131, 128, 126, 124, 122, 119, 117, 115, 113, 111, 109, 106, 103, 100, 97, 94, 92, 90, 89, 87, 86, 85, 83, 82, 81, 81, 81, 81, 82, 83, 84, 85, 86, 88, 91, 93, 96, 99, 103, 106, 110, 113, 117, 120, 124, 128, 132, 136, 139, 143, 146, 149, 153, 157, 160, 163, 166, 169, 172, 173, 176, 178, 180, 182, 183, 184, 184, 185, 186, 187, 188, 188, 187, 186, 186, 186, 186, 185, 184, 183, 182, 182, 181, 181, 180, 178, 177, 176, 175, 173, 172, 171, 170, 169, 168, 167, 166, 164, 163, 162, 161, 160, 159, 158, 158, 157, 156, 155, 154, 153, 153, 152, 152, 152, 152, 152, 151, 151, 150, 150, 149, 149, 148, 147, 146, 146, 146, 146, 146, 146, 146, 145, 145, 145, 145, 145, 145, 144, 144, 144, 143, 143, 143, 143, 143, 144, 144, 143, 143, 144, 143, 143, 143, 143, 143, 143, 143, 143, 144, 144, 143, 143, 143, 143, 143, 142, 143, 143, 143, 143, 143, 143, 143, 143, 144, 144, 144, 144, 144, 144, 144, 144, 143, 143, 143, 143, 143, 142, 142, 142, 141, 141, 141, 141, 141, 142, 142, 142, 142, 141, 141, 141, 141, 141, 141, 141, 141, 140, 141, 141, 142, 142, 142, 142, 142, 142, 142, 142, 142, 142, 142, 142, 142, 142, 142, 142, 141, 140]
5322A40j%%%%jj%%%j%%%jj%%%%jj%%%%j%%j%%%J%%%%%j%%J%%%J%J%%%jj%J%%%%J%j%jJ%%%
5315A32%j%%%j%%j%%%%J%%jj%%J%%%%%%%Jj%%j%jJ%%%%j%%J%%%jj%%%j%%%j%%%%j%%%%%jJ
5307A23%%%%J%%%%%jJ%%%%%j%%jJ%j%%%%%%Jj%%J%%%%jJ%%%j%%%%%%%%%%%%J%Jj%%%%j%%J
5300A23%%%%%%%jJ%j%%j%%%J%%%%%%%j%%%J%%j%%%%%J%%%%%j%j%J%%%%%J%%%%j%%j%%%%%J
5293A21%%%%j%%J%%%%%%%j%%%J%%j%%%%%%%%%j%Jj%%JJjj%%%%%%%%%%%%%J%j%jJ%%%%J%j%
5285A19%%%%jJ%%%%%%%%%J%j%%%%%%%%Jj%%%%J%J%jjjJ%%%%%%%%%%%%%%JJj%%j%%JJJ%%jj
5278A20%%%%%%%J%%%%J%%%J%%J%JJJJJJJJKKKKKKKKLKLLKLLLLLLLLKKLKJJJJJJj%jjj%jkj
5271A92ljklkllllklkkllkkkkklkjkjkjjjjjj%%%%%j%%%J%%J%%%J%J%J%%%%%%jj%%jjjjj%
$$ y = [140, 139, 139, 139, 139, 139, 138, 137, 137, 137, 137, 136, 136, 136, 136, 135, 134, 134, 134, 134, 134, 133, 132, 132, 132, 132, 132, 131, 131, 131, 130, 130, 130, 130, 131, 131, 131, 131, 131, 131, 130, 130, 130, 131, 131, 131, 131, 132, 132, 133, 133, 133, 133, 132, 131, 131, 132, 132, 132, 132, 132, 133, 133, 132, 132, 131, 132, 132, 132, 132, 132, 131, 131, 131, 131, 130, 130, 130, 129, 129, 129, 129, 129, 130, 130, 130, 129, 128, 128, 128, 129, 129, 129, 129, 129, 129, 129, 129, 130, 129, 129, 129, 128, 128, 127, 128, 128, 128, 128, 128, 127, 127, 127, 128, 128, 128, 128, 127, 126, 126, 126, 126, 125, 125, 125, 125, 124, 124, 124, 124, 124, 123, 123, 123, 123, 123, 123, 122, 123, 123, 123, 123, 123, 124, 124, 124, 124, 124, 124, 123, 124, 124, 124, 124, 124, 124, 123, 123, 123, 122, 123, 123, 122, 122, 122, 122, 122, 122, 122, 123, 122, 122, 122, 123, 123, 123, 123, 123, 122, 123, 123, 123, 123, 122, 122, 122, 122, 122, 122, 122, 122, 122, 122, 122, 122, 122, 123, 123, 124, 123, 123, 123, 123, 123, 122, 122, 122, 123, 123, 123, 123, 123, 123, 123, 123, 122, 123, 123, 122, 122, 122, 121, 121, 121, 121, 122, 122, 122, 122, 122, 122, 122, 122, 121, 121, 121, 121, 122, 122, 122, 121, 121, 121, 121, 121, 121, 122, 122, 122, 122, 122, 122, 121, 121, 120, 120, 121, 121, 121, 121, 121, 121, 122, 122, 122, 122, 122, 121, 121, 121, 120, 120, 120, 120, 120, 120, 121, 121, 121, 121, 121, 120, 120, 120, 121, 121, 121, 121, 121, 121, 121, 121, 120, 120, 120, 120, 121, 121, 121, 120, 120, 120, 120, 120, 120, 120, 120, 120, 120, 119, 119, 120, 119, 119, 119, 120, 121, 120, 119, 119, 119, 119, 119, 119, 119, 119, 119, 119, 119, 119, 119, 119, 120, 120, 119, 119, 118, 119, 119, 119, 119, 119, 120, 120, 119, 119, 119, 119, 119, 119, 118, 119, 119, 119, 119, 119, 119, 119, 119, 119, 119, 120, 120, 119, 119, 119, 119, 119, 119, 119, 119, 119, 120, 119, 119, 119, 119, 119, 120, 120, 121, 121, 120, 119, 118, 119, 119, 119, 119, 119, 119, 119, 119, 119, 119, 119, 119, 119, 119, 119, 120, 121, 120, 120, 120, 119, 119, 119, 120, 121, 122, 122, 122, 121, 120, 120, 120, 120, 120, 120, 120, 120, 121, 121, 121, 121, 121, 122, 122, 122, 122, 123, 123, 123, 124, 124, 125, 126, 127, 128, 129, 130, 131, 132, 134, 136, 138, 140, 142, 144, 146, 148, 151, 153, 156, 159, 161, 164, 167, 170, 173, 176, 179, 182, 185, 187, 189, 192, 194, 195, 196, 197, 198, 199, 200, 199, 199, 198, 197, 196, 196, 195, 193, 192, 189, 188, 186, 183, 181, 178, 175, 172, 169, 167, 164, 162, 160, 157, 154, 152, 150, 148, 146, 144, 141, 139, 138, 136, 135, 133, 132, 131, 130, 129, 128, 127, 127, 127, 127, 127, 127, 126, 126, 126, 126, 127, 127, 127, 128, 128, 128, 128, 129, 129, 130, 130, 131, 131, 131, 131, 131, 131, 131, 130, 129, 129, 129, 128, 127, 126, 125, 124, 124]
5264A24jj%%%jj%j%j%J%%jjj%J%%%%%%%J%j%%%%%J%%%%%j%JJ%%%%%J%%%%Jj%%%j%%%%%%%%
5256A19j%%%%%%jjj%%%%J%%%j%j%%J%%%%Jj%%%J%%%%%Jj%j%%%j%J%%%%%%j%J%%%%%%%j%j%
5249A13%%%J%%%%%%%J%J%j%%%%j%J%jJj%%%%%%%%j%%%J%Jj%%%%%%%J%J%j%%%j%j%%J%Jj%%
5242A14%%%%%%%jj%J%%J%j%%%%%%j%%J%j%jJJ%%j%%%%%%j%%%%%%%%J%%%%%%%%J%Jj%%%%j%
5234A12%%J%%jJ%J%%%%%%%%j%%%%%%%%%J%j%%%j%J%%%J%%%%%%%%j%J%%%%%j%%J%%j%%J%jJ
5227A14%%%%%%%%%j%%%%j%%JJ%%%%%%%%jjJ%j%%%%%%%%%%j%JJ%%%%%j%%%j%J%%%%%j%J%jJ
5220A12%J%%%%J%jj%Jj%%%%%%%%%%%Jj%%%%%%%jJ%J%j%%%%%%%%%%%jJ%%%%%%%%%%%%%jJ%J
5212A13%j%%j%J%%%jJ%%%%j%J%%j%%%%%%%%%%%J%j%%%%Jj%%%J%%%j%%J%%%j%%%j%J%%j%%%
$$ y = [124, 123, 122, 122, 122, 122, 121, 120, 120, 119, 119, 118, 118, 119, 119, 119, 118, 117, 116, 116, 117, 117, 117, 117, 117, 117, 117, 117, 118, 118, 117, 117, 117, 117, 117, 117, 118, 118, 118, 118, 118, 118, 117, 117, 118, 119, 119, 119, 119, 119, 119, 120, 120, 120, 120, 120, 121, 120, 120, 120, 120, 119, 119, 119, 119, 119, 119, 119, 119, 119, 118, 118, 118, 118, 118, 118, 118, 117, 116, 115, 115, 115, 115, 115, 116, 116, 116, 116, 115, 115, 114, 114, 114, 115, 115, 115, 115, 115, 116, 115, 115, 115, 115, 116, 116, 116, 116, 116, 116, 117, 116, 116, 115, 115, 115, 115, 114, 114, 115, 115, 115, 115, 115, 115, 115, 114, 114, 115, 115, 115, 115, 115, 115, 115, 115, 114, 114, 113, 113, 113, 113, 113, 114, 114, 114, 114, 114, 114, 114, 114, 115, 115, 116, 116, 115, 115, 115, 115, 115, 114, 114, 115, 115, 114, 115, 114, 114, 114, 114, 114, 114, 114, 114, 114, 113, 113, 113, 113, 114, 114, 115, 114, 114, 114, 114, 114, 114, 114, 114, 115, 115, 116, 116, 115, 115, 115, 115, 114, 114, 113, 113, 113, 114, 114, 115, 114, 114, 114, 114, 114, 114, 114, 114, 114, 114, 113, 112, 112, 113, 113, 113, 114, 114, 113, 113, 113, 113, 113, 113, 113, 112, 112, 112, 113, 113, 112, 112, 111, 112, 113, 113, 113, 112, 112, 112, 112, 112, 112, 112, 111, 111, 111, 111, 111, 111, 111, 111, 111, 112, 112, 112, 112, 112, 112, 112, 112, 112, 113, 113, 114, 113, 113, 113, 113, 113, 112, 112, 112, 112, 113, 113, 113, 112, 113, 113, 114, 114, 114, 114, 114, 114, 114, 114, 114, 113, 113, 113, 113, 113, 113, 113, 113, 113, 113, 114, 114, 113, 113, 113, 113, 112, 112, 113, 113, 113, 113, 114, 114, 114, 114, 114, 114, 114, 114, 114, 113, 113, 114, 114, 114, 114, 114, 114, 113, 113, 113, 114, 114, 114, 113, 113, 113, 114, 114, 113, 114, 114, 114, 114, 114, 114, 114, 114, 114, 114, 113, 113, 113, 113, 113, 112, 112, 112, 113, 114, 114, 114, 114, 114, 114, 114, 114, 114, 113, 112, 113, 113, 112, 112, 112, 112, 112, 112, 112, 112, 112, 112, 112, 111, 111, 112, 113, 113, 113, 113, 113, 113, 112, 112, 112, 112, 111, 111, 112, 112, 112, 112, 112, 112, 111, 111, 112, 112, 111, 112, 112, 113, 113, 113, 113, 113, 114, 114, 113, 112, 112, 113, 112, 112, 112, 112, 112, 112, 112, 112, 112, 112, 112, 112, 113, 112, 112, 112, 112, 112, 112, 112, 112, 111, 112, 112, 113, 113, 112, 112, 112, 112, 112, 112, 112, 112, 112, 112, 112, 112, 111, 112, 112, 112, 112, 112, 112, 112, 112, 112, 112, 112, 112, 112, 112, 111, 112, 112, 113, 113, 112, 112, 112, 111, 111, 112, 112, 112, 112, 111, 112, 112, 112, 112, 112, 111, 111, 112, 112, 112, 111, 111, 111, 111, 111, 111, 111, 111, 111, 111, 111, 111, 112, 112, 111, 111, 111, 111, 111, 112, 111, 111, 111, 111, 112, 112, 112, 112, 111, 111, 111, 112, 112, 112, 112, 111, 111, 111, 111, 110, 110, 111, 111, 111, 110, 110, 110, 110]
5205A10J%%%%%%j%J%%%%j%J%%%%%Jj%j%%%%%%%%%J%%jJ%%%%%jJ%j%%%%JJ%J%jJj%j%j%%%%
5198A10%%%%%J%%%%%%%%%J%j%%%%%j%J%%%%%j%j%%%%%%J%%j%JJ%Jj%%J%j%jjJ%%%%J%j%%J
5190A11j%%jJ%%%%%%%%%J%%%%J%J%j%JJ%KJKKKMMMNMLMLLMKJjknoponnmkjkjjjj%jj%%%%%
5183A12j%%%%%%j%%J%%j%%%%%%%%%%j%%%J%%J%%%%%%%jJ%%%%%%J%j%%%%%%%jj%J%%%Jj%%%
5176A10J%%%J%J%%J%J%J%JJJKKLMLMPPPOPNNNLKJ%kmnppppoomllkjjJJKJLMNPPOOONMMJJj
5168A90kknooqqppnmllkljjkjjj%%%%j%%%%j%%%%%%%J%jj%%%%%%%%%%%j%%jJ%%%%%%%j%%%
5161A07%%J%J%jj%%%J%jJj%%jJ%Jj%%%%%j%%J%%%jJ%%%%%jJ%Jj%%%%%%%%%%%%%%j%%J%%%J
5154A08%%%%%%%%%%j%%j%J%%%%%j%%j%J%J%%%j%%J%j%%%jJ%%%J%%j%j%J%%%%%%Jj%%jJ%%%
$$ y = [110, 111, 111, 111, 111, 111, 111, 111, 110, 110, 111, 111, 111, 111, 111, 110, 110, 111, 111, 111, 111, 111, 111, 112, 111, 111, 110, 110, 110, 110, 110, 110, 110, 110, 110, 110, 111, 111, 111, 110, 111, 111, 111, 111, 111, 111, 110, 111, 111, 110, 110, 110, 110, 110, 111, 112, 112, 113, 113, 112, 113, 112, 112, 111, 111, 110, 110, 110, 110, 110, 110, 110, 110, 110, 110, 111, 111, 111, 111, 111, 111, 111, 111, 111, 111, 112, 112, 111, 111, 111, 111, 111, 111, 110, 110, 111, 111, 111, 111, 111, 111, 110, 110, 109, 109, 109, 109, 109, 109, 109, 110, 110, 110, 109, 109, 110, 111, 111, 112, 111, 111, 111, 112, 112, 111, 111, 110, 109, 110, 110, 110, 110, 110, 111, 111, 110, 110, 110, 111, 110, 110, 110, 109, 110, 110, 110, 110, 110, 110, 110, 110, 110, 110, 111, 111, 111, 111, 111, 112, 112, 113, 113, 112, 112, 113, 114, 114, 116, 117, 119, 121, 123, 127, 131, 135, 140, 144, 147, 151, 154, 157, 161, 163, 164, 163, 161, 156, 150, 143, 137, 132, 127, 123, 121, 120, 118, 117, 116, 115, 114, 114, 113, 112, 112, 112, 112, 112, 112, 111, 111, 111, 111, 111, 111, 111, 110, 110, 110, 111, 111, 111, 110, 110, 110, 110, 110, 110, 110, 110, 110, 110, 110, 109, 109, 109, 109, 110, 110, 110, 111, 111, 111, 111, 111, 111, 111, 111, 110, 111, 111, 111, 111, 111, 111, 111, 112, 112, 111, 111, 111, 111, 111, 111, 111, 111, 110, 109, 109, 110, 110, 110, 110, 111, 110, 110, 110, 110, 111, 111, 111, 111, 112, 112, 113, 113, 113, 114, 114, 115, 115, 116, 116, 117, 118, 119, 121, 123, 126, 130, 133, 137, 144, 151, 158, 164, 171, 176, 181, 186, 189, 191, 192, 192, 190, 186, 181, 174, 167, 160, 153, 147, 141, 137, 134, 131, 129, 128, 127, 128, 129, 131, 132, 135, 139, 144, 151, 158, 164, 170, 176, 181, 185, 189, 190, 191, 190, 188, 186, 181, 175, 169, 161, 153, 146, 139, 134, 130, 127, 124, 122, 119, 118, 117, 115, 114, 113, 112, 112, 112, 112, 112, 111, 111, 111, 111, 111, 110, 110, 110, 110, 110, 110, 110, 110, 111, 111, 110, 109, 109, 109, 109, 109, 109, 109, 109, 109, 109, 109, 109, 108, 108, 108, 107, 108, 108, 108, 108, 108, 108, 108, 108, 107, 107, 107, 107, 107, 107, 108, 108, 109, 109, 108, 107, 107, 107, 107, 108, 108, 107, 108, 107, 107, 107, 106, 107, 107, 108, 107, 107, 107, 107, 107, 107, 106, 106, 106, 107, 107, 107, 107, 106, 107, 107, 107, 107, 107, 107, 106, 107, 107, 108, 107, 107, 107, 107, 107, 107, 107, 107, 107, 107, 107, 107, 107, 107, 107, 106, 106, 106, 107, 107, 107, 107, 108, 108, 108, 108, 108, 108, 108, 108, 108, 108, 108, 107, 107, 107, 106, 106, 107, 107, 107, 107, 107, 107, 106, 106, 106, 105, 105, 106, 106, 107, 107, 107, 107, 106, 106, 106, 107, 107, 106, 106, 106, 106, 105, 106, 106, 106, 106, 107, 107, 107, 106, 106, 105, 105, 106, 106, 106, 106, 106, 106, 106, 107, 106, 106, 106, 105, 106, 106, 106, 106]
5147A06%J%j%%j%%%%%%%J%%%jJ%%jJ%%%%J%%%%j%%%j%%%%%%%%J%j%%%j%%%%%%%%j%J%%J%%
5139A05%%%%%Jj%%j%%%%j%%%%%%J%Jj%JJ%%%%j%j%%%J%%j%%%j%%J%%j%%j%%%J%%%J%%%%%j
5132A03%J%J%j%j%j%%%J%%%j%jjJ%%%%j%J%%J%j%%%%%%%%%%J%J%%%j%%j%%J%j%%j%%%%j%%
5125I9%%%%%%%%%%J%%JJ%%%%J%j%jj%JJj%J%%j%%%%%%j%%j%J%%%%%%jj%%%%jJ%J%%%%J%J%
5117A01%j%J%%%jj%%%jj%j%%j%j%J%%%J%JJ%%%%%j%%%%%%jj%j%%J%%%%J%J%%JJJ%%%J%JJ%
5110A03%J%%%jjjj%jjjjj%%JJ%%J%%%J%J%%JJJJJJKJKKJ%JJ%%%jjjjjklkkkkkjj%jj%%%J%
5103I3J%JJJJ%%jjkkjjjjjkjkjJJJKJJJJKJKJJJJJKJJJJ%%JKMNOPRJ2J4J7J8K0K1K1J9J5Q
5096C05Knrj3j4j4j4j3j1rpnkjJJJKMMNNOQJ1J1J3J3J5J4J6J4J2QKknpj0j0j1j0rqoml%JJ
$$ y = [106, 106, 107, 107, 106, 106, 106, 105, 105, 105, 105, 105, 105, 105, 105, 106, 106, 106, 106, 105, 106, 106, 106, 105, 106, 106, 106, 106, 106, 107, 107, 107, 107, 107, 106, 106, 106, 106, 105, 105, 105, 105, 105, 105, 105, 105, 105, 106, 106, 105, 105, 105, 105, 104, 104, 104, 104, 104, 104, 104, 104, 104, 103, 103, 104, 104, 104, 105, 105, 105, 105, 105, 105, 105, 105, 106, 105, 105, 105, 104, 104, 104, 104, 104, 103, 103, 103, 103, 103, 103, 103, 104, 104, 105, 104, 104, 105, 106, 106, 106, 106, 106, 105, 105, 104, 104, 104, 104, 105, 105, 105, 104, 104, 104, 104, 103, 103, 103, 104, 104, 104, 103, 103, 103, 102, 102, 102, 102, 103, 103, 103, 103, 104, 104, 104, 104, 104, 104, 103, 103, 104, 104, 105, 105, 104, 104, 103, 103, 102, 102, 102, 102, 103, 103, 103, 103, 102, 102, 101, 100, 101, 101, 101, 101, 101, 100, 100, 101, 101, 101, 102, 102, 101, 101, 101, 101, 101, 101, 101, 101, 101, 101, 101, 102, 102, 103, 103, 103, 103, 102, 102, 102, 101, 101, 101, 102, 102, 101, 101, 101, 100, 100, 100, 100, 100, 99, 99, 99, 99, 99, 99, 99, 99, 99, 99, 99, 99, 99, 100, 100, 100, 101, 102, 102, 102, 102, 102, 103, 103, 102, 102, 101, 100, 100, 101, 102, 101, 101, 102, 102, 102, 101, 101, 101, 101, 101, 101, 101, 100, 100, 100, 99, 99, 100, 100, 100, 100, 100, 100, 100, 99, 98, 98, 98, 98, 98, 97, 98, 98, 99, 99, 99, 99, 99, 100, 100, 101, 101, 101, 100, 100, 101, 101, 101, 101, 100, 99, 99, 99, 99, 98, 97, 97, 96, 96, 96, 95, 95, 94, 94, 95, 95, 95, 95, 96, 96, 97, 98, 98, 98, 98, 98, 98, 97, 97, 97, 97, 97, 97, 97, 96, 95, 95, 94, 94, 94, 95, 95, 95, 95, 95, 96, 96, 97, 97, 97, 98, 99, 100, 100, 100, 100, 101, 101, 102, 103, 103, 103, 104, 104, 104, 104, 103, 102, 101, 100, 100, 99, 98, 97, 96, 95, 95, 95, 96, 97, 97, 97, 98, 98, 98, 98, 99, 99, 100, 100, 100, 101, 102, 103, 104, 105, 106, 108, 109, 111, 113, 114, 114, 115, 116, 116, 116, 116, 115, 114, 113, 112, 111, 109, 106, 104, 102, 100, 98, 96, 95, 94, 94, 93, 92, 92, 92, 92, 93, 93, 94, 94, 95, 96, 97, 98, 98, 98, 97, 96, 94, 92, 91, 90, 89, 88, 87, 85, 84, 82, 81, 82, 83, 84, 86, 87, 88, 89, 90, 92, 93, 95, 96, 97, 98, 99, 100, 102, 103, 104, 105, 106, 106, 106, 107, 109, 113, 118, 124, 131, 140, 152, 166, 183, 201, 221, 242, 263, 282, 297, 305, 307, 302, 293, 280, 266, 252, 238, 225, 214, 205, 198, 193, 191, 190, 191, 192, 193, 195, 199, 203, 208, 213, 219, 227, 238, 249, 262, 275, 290, 304, 320, 334, 346, 354, 356, 354, 349, 342, 332, 322, 311, 301, 292, 284, 278, 274, 271, 271, 272, 273]
5091B73KMMNNNOPPQJ1J1J3J2J2J2J1J0RQNMKJkmmmkjLQJ1J4J9K1K5K8L1L4L6L9M2M5M9N2N7
5086I44O1O8P5Q4R7J14J39J74K20K76L39M13N07O39Q27J090J416J757K029K150K084J879J677
5083A9059J607J603J423R34L27j95o30j047j516k007k348k441k311k045j731j412j122q82
5081E266o77m99l36j85m8P7J99L39N23P64J025J229J314J276J162J072J045R82P75M59J67
5079A5929m0k06m36q14j242j532j624j559j400j199r86p99o55n42m48l59k75k08j59j27j05
5077A214r0p8p0o6o0n6n1m6l9l3k7k3j9j6j5j2rqrqrrj0j1j3j5j7j6j3j2j2j2j2j1j2j1j3
5073B71j4j3j3j1rqonmljjj%J%jlmorj0j2j3j4j4j4j3j3j1j0pommkjKOJ1J3J5J6J8J6J6J2
5068A37J1RPOMKjkmnooppqqnmkjkjj%KMNPRJ2J1RQPMLKKJ%J%%k%jjj%j%%%jJ%%%%Jjjj%kj
$$ y = [273, 275, 279, 283, 288, 293, 298, 304, 311, 318, 326, 337, 348, 361, 373, 385, 397, 408, 418, 427, 435, 440, 444, 446, 447, 445, 441, 437, 433, 431, 430, 433, 441, 452, 466, 485, 506, 531, 559, 590, 624, 660, 699, 741, 786, 835, 887, 944, 1005, 1073, 1148, 1232, 1329, 1443, 1582, 1756, 1976, 2252, 2591, 3004, 3511, 4150, 4977, 6067, 7483, 9240, 11269, 13419, 15503, 17382, 19059, 20666, 22269, 23692, 24626, 24953, 24758, 24128, 23081, 21565, 19558, 17210, 14769, 12458, 10413, 8682, 7270, 6148, 5266, 4589, 4090, 3754, 3569, 3521, 3598, 3797, 4136, 4659, 5423, 6448, 7677, 8991, 10267, 11429, 12501, 13546, 14528, 15303, 15762, 15929, 15889, 15683, 15247, 14433, 13191, 11659, 10035, 8476, 7076, 5877, 4891, 4092, 3437, 2895, 2447, 2088, 1813, 1605, 1446, 1319, 1214, 1124, 1046, 976, 910, 850, 794, 743, 697, 658, 625, 598, 575, 556, 540, 525, 513, 504, 496, 487, 479, 470, 461, 451, 440, 427, 412, 395, 379, 366, 354, 342, 330, 318, 307, 295, 284, 271, 257, 244, 231, 220, 211, 203, 197, 192, 188, 185, 184, 183, 182, 182, 183, 183, 182, 179, 175, 169, 160, 150, 138, 125, 111, 97, 83, 70, 57, 46, 36, 29, 23, 19, 15, 13, 12, 14, 20, 31, 44, 59, 75, 93, 109, 125, 137, 148, 157, 164, 170, 174, 176, 175, 173, 169, 164, 158, 152, 145, 138, 130, 122, 117, 113, 111, 110, 108, 107, 106, 106, 108, 112, 117, 124, 133, 145, 156, 165, 173, 180, 184, 187, 189, 191, 192, 192, 193, 193, 193, 191, 191, 190, 189, 188, 188, 187, 187, 187, 187, 186, 187, 187, 187, 187, 187, 188, 187, 186, 185, 185, 183, 182]
5061A82jkkjkjjjj%jkjj%jjj%%jj%jjjjj%jjjkjjkj%jJ%JJJ%%%%%%J%%%%%%J%J%j%%%%jjj
5054A47j%j%Jj%%Jj%J%%%jj%%JJJ%J%j%JJ%%%%jj%%j%j%j%j%%%j%j%%%%J%%J%%j%j%%%jj%
5047A39j%j%%jj%%%%jJ%Jj%%%%J%%%%%j%%%%j%%J%Jjj%%%%%j%j%%JJ%j%%jjjj%Jj%j%%%%J
5039A29JJ%%J%%%J%%%j%%%%%%j%j%%jJ%%%%%%%jj%%%jjj%%%J%j%%%J%%j%JJJ%%jJ%%%%%%j
5032A27j%%%%%%jjJ%%%%%%%%j%%%%J%%%J%%%%%%%%%%%%%%J%J%%%%J%j%J%J%JJ%%%%%J%%%j
5025A32%%%j%j%j%j%%j%%%%%%%%j%j%%%%%%%%%%%%%%%Jj%%%%%%%J%J%%%%J%%j%%%%%J%JJ%
5017A30%%%j%%%%%%j%%j%j%jjJj%%%%j%j%%j%%%J%%%%%%%%%%%%%j%%%%%%%J%%J%jJ%%%%%%
5010A23%%%JJ%j%%j%jJJ%%j%%%j%%%%j%J%%j%%J%%%jjJ%j%%%JJ%j%%%%%%%%%%%%J%%%%%%%
$$ y = [182, 181, 179, 177, 176, 174, 173, 172, 171, 170, 170, 169, 167, 166, 165, 165, 164, 163, 162, 162, 162, 161, 160, 160, 159, 158, 157, 156, 155, 155, 154, 153, 152, 150, 149, 148, 146, 145, 145, 144, 145, 145, 146, 147, 148, 148, 148, 148, 148, 148, 148, 149, 149, 149, 149, 149, 149, 149, 150, 150, 151, 151, 150, 150, 150, 150, 150, 149, 148, 147, 146, 146, 145, 145, 146, 145, 145, 145, 146, 145, 145, 146, 146, 146, 146, 145, 144, 144, 144, 145, 146, 147, 147, 148, 148, 147, 147, 148, 149, 149, 149, 149, 149, 148, 147, 147, 147, 146, 146, 145, 145, 144, 144, 143, 143, 143, 143, 142, 142, 141, 141, 141, 141, 141, 142, 142, 142, 143, 143, 143, 142, 142, 141, 141, 141, 141, 140, 139, 139, 138, 138, 137, 137, 137, 136, 135, 135, 135, 135, 135, 134, 135, 135, 136, 135, 135, 135, 135, 135, 136, 136, 136, 136, 136, 136, 135, 135, 135, 135, 135, 134, 134, 134, 135, 135, 136, 135, 134, 134, 134, 134, 134, 134, 133, 133, 132, 132, 132, 133, 134, 134, 133, 133, 133, 132, 131, 130, 129, 129, 130, 129, 129, 128, 128, 128, 128, 128, 129, 130, 131, 131, 131, 132, 132, 132, 132, 133, 133, 133, 133, 132, 132, 132, 132, 132, 132, 132, 131, 131, 130, 130, 130, 129, 130, 130, 130, 130, 130, 130, 130, 130, 129, 128, 128, 128, 128, 127, 126, 125, 125, 125, 125, 126, 126, 125, 125, 125, 125, 126, 126, 126, 125, 125, 126, 127, 128, 128, 128, 127, 128, 128, 128, 128, 128, 128, 128, 127, 126, 126, 126, 126, 126, 126, 126, 125, 124, 125, 125, 125, 125, 125, 125, 125, 125, 125, 124, 124, 124, 124, 124, 125, 125, 125, 125, 126, 126, 126, 126, 126, 126, 126, 126, 126, 126, 126, 126, 126, 126, 126, 127, 127, 128, 128, 128, 128, 128, 129, 129, 128, 128, 129, 129, 130, 130, 131, 132, 132, 132, 132, 132, 132, 133, 133, 133, 133, 132, 132, 132, 132, 131, 131, 130, 130, 129, 129, 128, 128, 128, 127, 127, 127, 127, 127, 127, 127, 127, 127, 126, 126, 125, 125, 125, 125, 125, 125, 125, 125, 125, 125, 125, 125, 125, 125, 125, 125, 126, 125, 125, 125, 125, 125, 125, 125, 125, 126, 126, 127, 127, 127, 127, 127, 128, 128, 128, 127, 127, 127, 127, 127, 127, 128, 128, 129, 130, 130, 130, 130, 130, 129, 129, 129, 129, 129, 129, 129, 128, 128, 128, 127, 127, 126, 126, 125, 124, 125, 124, 124, 124, 124, 124, 123, 123, 122, 122, 122, 121, 121, 121, 121, 122, 122, 122, 122, 122, 122, 122, 122, 122, 122, 122, 122, 122, 122, 121, 121, 121, 121, 121, 121, 121, 121, 122, 122, 122, 123, 123, 122, 123, 123, 123, 123, 123, 123, 123, 123, 123, 123, 124, 125, 125, 124, 124, 124, 123, 123, 122, 123, 124, 124, 124, 123, 123, 123, 123, 122, 122, 122, 122, 122, 121, 121, 122, 122, 122, 121, 121, 121, 122, 122, 122, 122, 121, 120, 121, 121, 120, 120, 120, 120, 121, 122, 122, 121, 121, 121, 121, 121, 121, 121, 121, 121, 121, 121, 121, 121, 122, 122, 122, 122, 122, 122, 122, 122]
5003A22%%j%%%%%%%J%jj%JJ%j%%j%%%J%%j%%%%J%%%%Jj%j%%j%%%%J%%J%%%%%%%%j%J%%%%j
4995A20%%%%%%%j%%J%%J%J%%%%%%JJ%JJ%KKKLMMNOPOOOOOMMJJjkmnpppponmmkkj%%JJKLMO
4988A54OOPOONMMK%%jlmpqqqponnllkkjkj%%jj%j%%j%%%j%%%%%%%J%%%%%%%%%%j%%%%j%%j
4981A17%%J%%%%%%J%J%j%%J%%JJ%J%J%KLMMMMNMMLMMJjkllnoonmllkljj%j%jj%%j%J%%%j%
4973A18%%%%j%J%%%Jj%%j%%J%%%%j%%%%%J%%%%%j%%%%%%%%%j%%J%%%%%j%%j%J%%%%%%%%%%
4966A16%%%%%%%%%j%%%J%%%%j%%Jj%%%%j%%J%%%%%%%%%%%J%j%%%%%j%J%j%%%%%%%%%%%%JJ
4959A16j%%%%%%%jJ%J%%%%%%%%J%jj%%%%%j%%%J%JJ%%%%%j%%%%%%%%%%%%%%%%%%%J%%%jJ%
4951A17j%%j%%%J%%%%%%%j%%%%JJ%%%%%j%%%%%%%%%jJ%%%%%%%%%j%JJjj%%%%j%%J%%J%%%%
$$ y = [122, 122, 122, 121, 121, 121, 121, 121, 121, 121, 121, 122, 122, 121, 120, 120, 121, 122, 122, 121, 121, 121, 120, 120, 120, 120, 121, 121, 121, 120, 120, 120, 120, 120, 121, 121, 121, 121, 121, 122, 121, 121, 120, 120, 120, 119, 119, 119, 119, 119, 120, 120, 120, 121, 121, 121, 121, 121, 121, 121, 121, 121, 120, 120, 121, 121, 121, 121, 121, 120, 120, 120, 120, 120, 120, 120, 120, 119, 119, 119, 120, 120, 120, 121, 121, 122, 122, 122, 122, 122, 122, 122, 123, 124, 124, 125, 126, 126, 128, 130, 132, 135, 139, 143, 148, 154, 161, 167, 173, 179, 185, 191, 195, 199, 200, 201, 200, 198, 194, 189, 182, 175, 168, 161, 155, 150, 146, 142, 140, 138, 137, 137, 137, 138, 139, 141, 144, 148, 154, 160, 166, 173, 179, 185, 190, 194, 198, 200, 200, 200, 199, 196, 192, 185, 177, 169, 161, 154, 148, 143, 138, 135, 132, 130, 128, 127, 125, 124, 124, 124, 123, 122, 122, 121, 121, 121, 120, 120, 120, 120, 119, 119, 119, 119, 119, 119, 119, 119, 120, 120, 120, 120, 120, 120, 120, 120, 120, 120, 120, 119, 119, 119, 119, 119, 118, 118, 118, 117, 117, 117, 118, 118, 118, 118, 118, 118, 118, 119, 119, 120, 120, 119, 119, 119, 120, 120, 120, 121, 122, 122, 123, 123, 124, 124, 126, 129, 133, 137, 141, 145, 150, 154, 158, 161, 165, 169, 170, 169, 167, 164, 161, 156, 150, 144, 139, 135, 132, 129, 127, 124, 123, 122, 122, 121, 121, 120, 119, 119, 119, 118, 118, 119, 119, 119, 119, 118, 118, 118, 118, 118, 118, 117, 117, 118, 118, 118, 118, 119, 118, 118, 118, 117, 117, 117, 118, 118, 118, 118, 118, 117, 117, 117, 117, 117, 117, 118, 118, 118, 118, 118, 118, 117, 117, 117, 117, 117, 117, 117, 117, 117, 117, 116, 116, 116, 117, 117, 117, 117, 117, 117, 116, 116, 116, 115, 115, 116, 116, 116, 116, 116, 116, 116, 116, 116, 116, 116, 116, 116, 116, 116, 116, 116, 116, 116, 116, 115, 115, 115, 115, 116, 116, 116, 116, 116, 115, 115, 115, 116, 115, 115, 115, 115, 115, 114, 114, 114, 115, 115, 115, 115, 115, 115, 115, 115, 115, 115, 115, 115, 116, 116, 115, 115, 115, 115, 115, 115, 114, 114, 115, 115, 114, 114, 114, 114, 114, 114, 114, 114, 114, 114, 114, 114, 114, 115, 116, 115, 115, 115, 115, 115, 115, 115, 115, 114, 115, 115, 116, 116, 116, 116, 116, 116, 116, 116, 116, 117, 117, 116, 115, 115, 115, 115, 115, 115, 114, 114, 114, 114, 115, 115, 116, 117, 117, 117, 117, 117, 117, 116, 116, 116, 116, 116, 116, 116, 116, 116, 116, 116, 116, 116, 116, 116, 116, 116, 116, 116, 116, 117, 117, 117, 117, 116, 117, 117, 116, 116, 116, 115, 115, 115, 115, 116, 116, 116, 116, 116, 116, 116, 116, 115, 115, 115, 115, 115, 116, 117, 117, 117, 117, 117, 117, 116, 116, 116, 116, 116, 116, 116, 116, 116, 116, 115, 116, 116, 116, 116, 116, 116, 116, 116, 116, 116, 115, 115, 116, 117, 116, 115, 115, 115, 115, 115, 114, 114, 114, 115, 115, 115, 116, 116, 116, 116, 116]
4944A16j%%j%%%J%%J%%%jj%%%JJ%%%j%j%%%%%%%%%J%%%%%%%%%%%j%%%%%%%J%%%%jJJ%j%%%
4937A15%%%%%%jJ%%j%%J%%%%%J%%%j%%jJ%%j%%jJ%%J%%%j%%%J%j%%%J%j%%J%%j%%%J%%%%J
4930A16j%j%%%j%%J%J%%j%%JjJ%j%%%%JJ%%%j%j%J%%%%j%%J%%%%%j%%%jJ%%%%jj%%%J%%%%
4922A13%%%%%%J%%%%%%%%J%%j%j%%%%%%%%%%%j%%J%JJ%j%%jj%%%J%%%J%%%%%%%%%%%%%%%j
4915A13%%J%%%%%%%J%%j%%%%jJ%%j%%Jj%%%%%%%j%%%J%%jJ%%%jJ%%%%j%%J%%J%%jJj%%%%%
4908A13jJJjj%%J%%%%j%J%j%%%%J%%%%Jj%%J%jj%%J%%%%J%j%%%%j%%j%J%%%%J%%%j%J%J%%
4900A14%jj%J%%%%jJj%%%%%jJ%%%%%%%J%j%%%%%jJ%%J%%%%%%jJ%j%%J%%%j%J%j%j%Jj%J%%
4893A12%%%J%%jj%%%J%%%%%j%%%%%jJ%%%J%%%%j%%%%%%%%%Jj%%jJ%%%%%Jj%%%%%%%%%%%J%
$$ y = [116, 115, 115, 115, 114, 114, 114, 114, 115, 115, 115, 116, 116, 116, 116, 115, 114, 114, 114, 114, 115, 116, 116, 116, 116, 115, 115, 114, 114, 114, 114, 114, 114, 114, 114, 114, 114, 115, 115, 115, 115, 115, 115, 115, 115, 115, 115, 115, 115, 114, 114, 114, 114, 114, 114, 114, 114, 115, 115, 115, 115, 115, 114, 115, 116, 116, 115, 115, 115, 115, 115, 115, 115, 115, 115, 115, 114, 115, 115, 115, 114, 114, 114, 115, 115, 115, 115, 115, 115, 116, 116, 116, 116, 115, 115, 115, 114, 115, 115, 115, 114, 114, 114, 113, 114, 114, 114, 115, 115, 115, 115, 114, 114, 114, 114, 115, 115, 114, 114, 114, 114, 115, 115, 114, 114, 114, 115, 115, 115, 114, 114, 114, 114, 115, 115, 115, 115, 115, 116, 115, 115, 114, 114, 114, 114, 113, 113, 113, 114, 114, 115, 115, 115, 114, 114, 114, 115, 114, 115, 115, 114, 114, 114, 114, 114, 115, 116, 116, 116, 116, 115, 115, 114, 114, 115, 115, 115, 115, 115, 114, 114, 114, 115, 115, 115, 115, 115, 115, 114, 114, 114, 114, 113, 114, 114, 114, 114, 114, 113, 112, 112, 112, 112, 113, 113, 113, 113, 113, 113, 113, 113, 113, 113, 113, 114, 114, 114, 114, 114, 114, 114, 114, 114, 115, 115, 115, 114, 114, 113, 113, 113, 113, 113, 113, 113, 113, 113, 113, 113, 113, 112, 112, 112, 113, 113, 114, 115, 115, 114, 114, 114, 113, 112, 112, 112, 112, 113, 113, 113, 113, 114, 114, 114, 114, 114, 114, 114, 114, 114, 114, 114, 114, 114, 114, 114, 114, 113, 113, 113, 114, 114, 114, 114, 114, 114, 114, 114, 115, 115, 115, 114, 114, 114, 114, 114, 113, 114, 114, 114, 113, 113, 113, 114, 113, 113, 113, 113, 113, 113, 113, 113, 112, 112, 112, 112, 113, 113, 113, 112, 113, 113, 113, 113, 112, 113, 113, 113, 113, 113, 112, 112, 112, 113, 113, 113, 114, 114, 114, 113, 114, 113, 113, 113, 113, 113, 113, 112, 113, 114, 113, 112, 112, 112, 113, 113, 113, 113, 113, 112, 112, 113, 113, 112, 112, 112, 112, 112, 113, 113, 113, 113, 113, 114, 113, 113, 113, 114, 114, 113, 112, 112, 112, 113, 113, 113, 113, 113, 114, 114, 113, 113, 113, 113, 113, 112, 112, 112, 111, 111, 112, 112, 112, 112, 112, 113, 113, 113, 113, 112, 112, 113, 113, 114, 114, 114, 114, 113, 112, 112, 113, 113, 113, 113, 113, 112, 113, 112, 112, 112, 112, 112, 112, 111, 112, 112, 112, 112, 112, 112, 112, 112, 113, 113, 112, 112, 112, 112, 112, 112, 111, 112, 112, 112, 113, 113, 113, 113, 113, 113, 113, 112, 113, 113, 112, 112, 112, 113, 113, 113, 113, 112, 112, 113, 113, 112, 112, 111, 111, 112, 111, 111, 112, 112, 112, 112, 112, 112, 113, 113, 113, 112, 111, 111, 111, 111, 112, 112, 112, 112, 112, 112, 111, 111, 111, 111, 111, 111, 110, 111, 111, 111, 111, 112, 112, 112, 112, 112, 111, 111, 111, 111, 111, 111, 111, 111, 111, 111, 112, 111, 111, 111, 110, 111, 111, 111, 111, 111, 111, 112, 111, 111, 111, 111, 111, 111, 111, 111, 111, 111, 111, 111, 112, 112]
4886A12%%%%%%%%%%j%J%%%J%%%Jj%j%j%JJ%%%j%%%Jj%%j%JjJ%%%%J%%%%%%%%%%%j%%%%%%%
4878A12%%%j%J%%%%j%%%%%%%%JJj%%%j%%%j%J%J%%%%%%Jj%%jJ%j%J%%j%%%%%%%J%j%jJ%%%
4871A11%%%jJ%%%%%%%%%%%%J%j%%%%%%%%%%J%%j%%%%%%%%%%%%%%%%%j%%%%%%JJ%j%%%%J%j
4864A11%j%J%j%J%%%%%%j%%J%%%%j%J%%%%%%%%%%j%j%J%%%J%%%jJ%Jj%%%%J%%%jj%J%%J%%
4856A12jJ%%j%J%J%j%j%j%%%J%%%%Jj%%%j%%%%J%%%%%j%J%%%%J%%%%j%%jJ%%%%%%%J%%%j%
4849A11jJ%%%%%%%%%%%j%%J%j%%j%J%J%%j%J%j%%J%%%%%j%%%%%%%%%%%Jj%%J%jJ%%J%j%%J
4842A12%j%%j%%%%%%%jJ%%%%%%J%%j%%%%%j%J%%%%Jj%%%%%%%%%j%%%J%%%%%%J%%%%%%%j%%
4834A10%%%%%j%%%%%J%%jJ%j%j%J%JJ%%%%%%jJ%%j%%%%%j%%%%J%j%%%J%%%%%%j%JJ%%%%%%
$$ y = [112, 112, 112, 112, 112, 112, 112, 112, 112, 112, 112, 111, 111, 112, 112, 112, 112, 113, 113, 113, 113, 114, 113, 113, 112, 112, 111, 111, 112, 113, 113, 113, 113, 112, 112, 112, 112, 113, 112, 112, 112, 111, 111, 112, 111, 112, 112, 112, 112, 112, 113, 113, 113, 113, 113, 113, 113, 113, 113, 113, 113, 113, 112, 112, 112, 112, 112, 112, 112, 112, 112, 112, 112, 111, 111, 112, 112, 112, 112, 112, 111, 111, 111, 111, 111, 111, 111, 111, 111, 112, 113, 112, 112, 112, 112, 111, 111, 111, 111, 110, 110, 111, 111, 112, 112, 112, 112, 112, 112, 112, 113, 112, 112, 112, 111, 112, 112, 111, 111, 112, 112, 112, 111, 111, 111, 111, 111, 111, 111, 111, 112, 112, 111, 111, 110, 111, 111, 111, 111, 111, 111, 111, 110, 111, 111, 111, 111, 111, 111, 111, 111, 111, 111, 111, 111, 111, 112, 112, 111, 111, 111, 111, 111, 111, 111, 111, 111, 111, 111, 112, 112, 112, 111, 111, 111, 111, 111, 111, 111, 111, 111, 111, 111, 111, 111, 111, 111, 111, 111, 111, 110, 110, 110, 110, 110, 110, 110, 111, 112, 112, 111, 111, 111, 111, 111, 112, 112, 111, 111, 110, 110, 111, 111, 110, 110, 111, 111, 111, 111, 111, 111, 111, 110, 110, 110, 111, 111, 111, 111, 111, 110, 110, 111, 111, 111, 111, 111, 111, 111, 111, 111, 111, 111, 110, 110, 109, 109, 110, 110, 110, 110, 111, 111, 111, 111, 110, 111, 111, 112, 111, 111, 111, 111, 111, 112, 112, 112, 112, 111, 110, 110, 111, 111, 111, 112, 112, 112, 111, 112, 112, 112, 111, 111, 112, 112, 113, 113, 112, 112, 111, 111, 110, 110, 110, 110, 111, 111, 111, 111, 111, 112, 111, 111, 111, 111, 110, 110, 110, 110, 110, 111, 111, 111, 111, 111, 111, 110, 110, 111, 111, 111, 111, 111, 112, 112, 112, 112, 112, 111, 111, 111, 110, 111, 111, 111, 111, 111, 111, 111, 111, 112, 112, 112, 112, 111, 111, 110, 111, 111, 111, 111, 111, 111, 111, 111, 111, 111, 111, 111, 110, 110, 110, 111, 111, 110, 110, 110, 109, 109, 110, 110, 111, 111, 111, 110, 110, 111, 111, 110, 110, 110, 111, 111, 111, 111, 111, 111, 110, 110, 110, 110, 110, 110, 110, 110, 110, 110, 110, 110, 111, 110, 110, 110, 111, 111, 110, 111, 111, 111, 112, 112, 111, 111, 111, 112, 112, 111, 111, 111, 110, 110, 110, 110, 110, 110, 110, 110, 109, 110, 110, 110, 110, 110, 110, 110, 111, 111, 111, 110, 110, 110, 110, 110, 110, 109, 109, 110, 110, 110, 110, 110, 111, 110, 110, 110, 110, 110, 110, 110, 110, 110, 110, 109, 109, 109, 109, 110, 110, 110, 110, 110, 110, 110, 111, 111, 111, 111, 111, 111, 111, 111, 110, 110, 110, 110, 110, 110, 110, 110, 109, 109, 109, 109, 109, 109, 110, 110, 110, 109, 110, 110, 109, 109, 108, 108, 109, 109, 110, 111, 111, 111, 111, 111, 111, 111, 110, 111, 111, 111, 110, 110, 110, 110, 110, 110, 109, 109, 109, 109, 109, 110, 110, 109, 109, 109, 109, 110, 110, 110, 110, 110, 110, 110, 109, 109, 110, 111, 111, 111, 111, 111, 111, 111]
4827A11%j%%%j%JJ%j%JJ%%%jjj%%%%%J%%%%j%JjJJ%j%J%%%%j%%%%%J%%%j%%%J%j%J%%j%%%
4820A10%%%%%j%J%J%%%%%%%j%%%%j%jJJ%%%%%jJj%%%%%J%%%%%j%%J%%j%%J%%%%%%j%J%%jJ
4813A10%jJ%j%j%J%%%%j%%%%J%%%%J%%j%%%%%%%%%%%%%%%%%%%%%Jj%%%%%%%j%%J%%jJ%%J%
4805A10jJ%%%j%%%%%%J%%j%%j%%%Jj%%J%%j%%%J%jJ%%%%%%%%%%%%%Jj%%%%%%%%%%%%%%%%%
4798A09%%%%J%%%%jJ%%%%%%j%%%%%%%%%%%%%%%J%%%%%j%j%%%%%%%J%%jJ%%%%%%%%%%%%%Jj
4791A09%j%%%%%J%%J%j%%%%J%%%J%%j%j%%%%J%%%%%%%j%%%%%%%j%%%%%%%%J%%J%%%%%j%%%
4783A09%j%%%%j%J%J%%%%j%%%%%%%%%%%%%%%%%%J%%%%%%%%%%%j%%%J%%%%%J%%%j%%%%j%%j
4776A07%%%J%JjJ%%j%%%%%%J%J%j%%%j%J%%%%J%%j%%%%%%%%jJj%J%%j%%%%%%%J%%%j%Jj%J
$$ y = [111, 111, 110, 110, 110, 110, 109, 109, 110, 111, 111, 110, 110, 111, 112, 112, 112, 112, 111, 110, 109, 109, 109, 109, 109, 109, 110, 110, 110, 110, 110, 109, 109, 110, 109, 110, 111, 111, 110, 110, 111, 111, 111, 111, 111, 110, 110, 110, 110, 110, 110, 111, 111, 111, 111, 110, 110, 110, 110, 111, 111, 110, 110, 111, 111, 111, 110, 110, 110, 110, 110, 110, 110, 110, 110, 109, 109, 110, 110, 111, 111, 111, 111, 111, 111, 111, 111, 110, 110, 110, 110, 110, 109, 109, 108, 109, 110, 110, 110, 110, 110, 110, 109, 110, 109, 109, 109, 109, 109, 109, 110, 110, 110, 110, 110, 110, 109, 109, 109, 110, 110, 110, 109, 109, 109, 110, 110, 110, 110, 110, 110, 110, 109, 109, 110, 110, 110, 109, 110, 110, 109, 110, 110, 109, 109, 108, 108, 109, 109, 109, 109, 109, 108, 108, 108, 108, 108, 109, 109, 109, 109, 109, 110, 110, 110, 109, 109, 109, 109, 109, 109, 109, 109, 109, 109, 109, 109, 109, 109, 109, 109, 109, 109, 109, 109, 109, 109, 110, 109, 109, 109, 109, 109, 109, 109, 109, 108, 108, 108, 109, 109, 109, 108, 109, 109, 109, 110, 110, 109, 110, 110, 110, 110, 109, 109, 109, 109, 109, 109, 109, 110, 110, 110, 109, 109, 109, 108, 108, 108, 108, 109, 108, 108, 108, 109, 109, 109, 108, 108, 108, 108, 109, 109, 108, 109, 109, 109, 109, 109, 109, 109, 109, 109, 109, 109, 109, 109, 109, 110, 109, 109, 109, 109, 109, 109, 109, 109, 109, 109, 109, 109, 109, 109, 109, 109, 109, 109, 109, 109, 109, 109, 110, 110, 110, 110, 110, 109, 110, 110, 110, 110, 110, 110, 110, 109, 109, 109, 109, 109, 109, 109, 109, 109, 109, 109, 109, 109, 109, 109, 109, 110, 110, 110, 110, 110, 110, 109, 109, 108, 108, 108, 108, 108, 108, 108, 108, 109, 109, 109, 108, 109, 109, 109, 109, 109, 109, 109, 109, 109, 109, 109, 109, 109, 109, 110, 109, 109, 108, 108, 108, 108, 108, 108, 109, 109, 109, 110, 110, 109, 109, 109, 109, 109, 110, 110, 110, 110, 111, 111, 111, 110, 110, 109, 109, 109, 109, 109, 110, 110, 110, 110, 110, 110, 110, 110, 109, 109, 109, 109, 109, 109, 109, 109, 108, 108, 108, 108, 108, 108, 108, 108, 108, 109, 109, 109, 110, 110, 110, 110, 110, 110, 109, 109, 109, 109, 109, 108, 108, 108, 108, 108, 107, 107, 108, 108, 109, 109, 109, 109, 109, 108, 108, 108, 108, 108, 108, 108, 108, 108, 108, 108, 108, 108, 108, 108, 108, 108, 108, 108, 109, 109, 109, 109, 109, 109, 109, 109, 109, 109, 109, 109, 108, 108, 108, 108, 109, 109, 109, 109, 109, 109, 110, 110, 110, 110, 109, 109, 109, 109, 109, 108, 108, 108, 107, 107, 107, 107, 108, 108, 109, 108, 109, 109, 109, 108, 108, 108, 108, 108, 108, 108, 109, 109, 110, 110, 109, 109, 109, 109, 108, 108, 109, 109, 109, 109, 109, 110, 110, 110, 109, 109, 109, 109, 109, 109, 109, 109, 109, 108, 109, 108, 108, 109, 109, 109, 108, 108, 108, 108, 108, 108, 108, 108, 109, 109, 109, 109, 108, 108, 109, 108, 108, 109]
4769A09jJ%j%%J%%%%%j%%%%%J%%%%j%J%%%%%%%%%j%%j%%%%j%JJ%J%%%j%%%%%%j%J%%%j%%%
4761A07%%J%%j%%%%%Jj%%%J%J%%%%%%%%j%%%%%J%j%%%%%%%%%%%%%%%%j%%%%%J%%%%%%%j%%
4754A07j%J%%J%%%%jJ%%%%%%%j%%%J%%%j%%%J%%%%%j%jJ%J%%%%%%%%%%%%%j%%%%%%%%%%%%
4747A07%%%%%%%%%J%%J%%%%j%j%J%%%%%%J%j%%J%jj%J%j%%j%%JJ%%%%%%Jjj%%J%%%%%j%%%
4739A07J%%%%%%%%%%%%%%j%%%%%%%%J%%j%J%j%%%J%j%%%%%%j%J%Jj%%%%%%%Jj%J%j%%%%%%
4732A07%j%J%%%%%%%j%J%%%%%J%%j%%%%%%%Jj%j%jJ%%%%%%%J%%%%%Jj%%%%%%%%%%%j%jJ%%
4725A06%J%%%%%%%jJ%j%J%j%J%%%%%%j%%j%Jj%J%%%%%J%%%j%%%%%%%%%%%%%j%%%%%%jJ%JJ
4718A07%%%j%jJ%%%j%%%J%%%%%j%%jJ%J%jj%%%j%%%%%J%%%%%J%%%%j%%%%%%%J%%j%%%JjJ%
$$ y = [109, 108, 109, 109, 108, 108, 108, 109, 109, 109, 109, 109, 109, 108, 108, 108, 108, 108, 108, 109, 109, 109, 109, 109, 108, 108, 109, 109, 109, 109, 109, 109, 109, 109, 109, 109, 108, 108, 108, 107, 107, 107, 107, 107, 106, 106, 107, 108, 108, 109, 109, 109, 109, 108, 108, 108, 108, 108, 108, 108, 107, 107, 108, 108, 108, 108, 107, 107, 107, 107, 107, 107, 108, 108, 108, 107, 107, 107, 107, 107, 107, 108, 107, 107, 107, 107, 108, 108, 109, 109, 109, 109, 109, 109, 109, 109, 109, 108, 108, 108, 108, 108, 108, 109, 109, 108, 108, 108, 108, 108, 108, 108, 108, 108, 108, 108, 108, 108, 108, 108, 108, 108, 107, 107, 107, 107, 107, 107, 108, 108, 108, 108, 108, 108, 108, 108, 107, 107, 107, 106, 106, 107, 107, 107, 108, 108, 108, 108, 108, 107, 108, 108, 108, 108, 108, 108, 108, 108, 107, 107, 107, 107, 108, 108, 108, 108, 107, 107, 107, 107, 108, 108, 108, 108, 108, 108, 107, 107, 106, 107, 107, 108, 108, 108, 108, 108, 108, 108, 108, 108, 108, 108, 108, 108, 108, 107, 107, 107, 107, 107, 107, 107, 107, 107, 107, 107, 107, 107, 107, 107, 107, 107, 107, 107, 107, 107, 107, 108, 108, 108, 109, 109, 109, 109, 109, 108, 108, 107, 107, 108, 108, 108, 108, 108, 108, 108, 109, 109, 108, 108, 108, 109, 109, 108, 107, 107, 108, 108, 107, 107, 107, 106, 106, 106, 107, 108, 108, 108, 108, 108, 108, 108, 109, 108, 107, 107, 107, 108, 108, 108, 108, 108, 108, 107, 107, 107, 107, 108, 108, 108, 108, 108, 108, 108, 108, 108, 108, 108, 108, 108, 108, 108, 107, 107, 107, 107, 107, 107, 107, 107, 107, 108, 108, 108, 107, 107, 108, 108, 107, 107, 107, 107, 108, 108, 107, 107, 107, 107, 107, 107, 107, 106, 106, 107, 107, 108, 107, 107, 107, 107, 107, 107, 107, 107, 108, 107, 107, 108, 108, 107, 107, 107, 107, 107, 107, 107, 107, 106, 106, 107, 107, 107, 107, 107, 107, 107, 107, 106, 106, 107, 107, 107, 107, 107, 107, 108, 108, 108, 107, 107, 107, 107, 107, 107, 107, 107, 108, 107, 107, 106, 106, 105, 106, 106, 106, 106, 106, 106, 106, 106, 107, 107, 107, 107, 107, 107, 108, 107, 107, 107, 107, 107, 107, 107, 107, 107, 107, 107, 107, 106, 106, 105, 106, 106, 106, 106, 107, 107, 107, 107, 107, 107, 107, 107, 106, 107, 107, 106, 106, 107, 107, 106, 106, 107, 107, 107, 107, 107, 107, 107, 106, 106, 106, 105, 105, 106, 105, 105, 106, 106, 106, 106, 106, 106, 107, 107, 107, 107, 106, 106, 106, 106, 106, 106, 106, 106, 106, 106, 106, 106, 106, 106, 105, 105, 105, 105, 105, 105, 105, 104, 105, 105, 106, 107, 107, 107, 107, 106, 106, 105, 106, 106, 106, 106, 105, 105, 105, 105, 106, 106, 106, 106, 106, 106, 105, 105, 105, 104, 105, 105, 106, 106, 105, 104, 104, 104, 104, 103, 103, 103, 103, 103, 103, 104, 104, 104, 104, 104, 104, 105, 105, 105, 105, 105, 104, 104, 104, 104, 104, 104, 104, 104, 105, 105, 105, 104, 104, 104, 104, 105, 104, 105, 105]
4710A05%J%j%%%%%%J%j%JJ%%jj%%jJ%J%%%J%%%j%%%J%%j%J%%%%j%%%J%%%j%%jJ%J%j%j%%J
4703A06%%%%%j%J%%%Jj%%%%%%%%%%%%%%%%jJ%%%J%%j%%%%%%%%%%J%%%%%j%%%%%%%%%%%J%%
4696A07j%%%%%J%j%%j%%J%J%%%%%%%%%j%%%%%J%%%j%%J%%%%%%%j%%%%%J%j%J%%%j%JJ%j%%
4688A07%%%%%%%%%jJ%%%%J%%%%j%%%Jj%j%%%%%%J%J%%%%%%%%j%%%%%J%J%%%J%JJJJ%JJJJJ
4681A19KMLMNNOOPONNMLK%jklmoopponmllkj%%JJLKMNOOONOMNLKJjjknopppponlllklkjjj
4674A13j%j%%j%%%j%j%j%%JJ%j%%%j%%%%%jj%%%%%%%j%J%%%%j%J%%jJ%J%%%%j%%j%%%%%%%
4666A04%%%%%%%j%JJ%%j%%J%%%J%%j%j%%%%%J%%%%%%j%%%%Jj%%%%%%Jj%%%%%%%%%%%%%%%J
4659A05%%%%Jj%J%%%%%j%%%%%jJ%%j%%J%J%%%j%%J%%jj%%%%J%%%%%j%%%%j%J%J%%jj%J%%%
$$ y = [105, 105, 106, 106, 105, 105, 105, 105, 105, 105, 105, 106, 106, 105, 105, 106, 107, 107, 107, 106, 105, 105, 105, 104, 105, 105, 106, 106, 106, 106, 107, 107, 107, 107, 106, 106, 106, 106, 107, 107, 107, 106, 106, 107, 107, 107, 107, 107, 106, 106, 106, 106, 107, 107, 107, 107, 106, 106, 106, 105, 106, 106, 107, 107, 106, 106, 105, 105, 105, 106, 106, 106, 106, 106, 106, 105, 105, 106, 106, 106, 106, 107, 106, 106, 106, 106, 106, 106, 106, 106, 106, 106, 106, 106, 106, 106, 106, 106, 106, 105, 106, 106, 106, 106, 107, 107, 107, 106, 106, 106, 106, 106, 106, 106, 106, 106, 106, 106, 107, 107, 107, 107, 107, 107, 106, 106, 106, 106, 106, 106, 106, 106, 106, 106, 106, 106, 107, 107, 107, 106, 106, 106, 106, 106, 106, 107, 107, 106, 106, 106, 105, 105, 105, 106, 106, 107, 107, 107, 107, 107, 107, 107, 107, 107, 107, 106, 106, 106, 106, 106, 106, 107, 107, 107, 107, 106, 106, 106, 107, 107, 107, 107, 107, 107, 107, 107, 106, 106, 106, 106, 106, 106, 107, 107, 106, 106, 107, 107, 107, 107, 106, 106, 107, 108, 108, 107, 107, 107, 107, 107, 107, 107, 107, 107, 107, 107, 107, 106, 107, 107, 107, 107, 107, 108, 108, 108, 108, 108, 107, 107, 107, 107, 108, 107, 107, 106, 106, 106, 106, 106, 106, 106, 107, 107, 108, 108, 108, 108, 108, 108, 108, 108, 108, 107, 107, 107, 107, 107, 107, 108, 108, 109, 109, 109, 109, 110, 110, 111, 112, 113, 114, 114, 115, 116, 117, 118, 119, 121, 125, 128, 132, 137, 142, 148, 154, 161, 167, 172, 177, 181, 184, 186, 186, 185, 183, 180, 176, 170, 164, 157, 150, 144, 139, 135, 132, 129, 127, 126, 126, 126, 127, 128, 131, 133, 137, 142, 148, 154, 160, 165, 171, 175, 180, 183, 185, 186, 185, 184, 182, 177, 171, 164, 157, 150, 143, 137, 132, 129, 126, 123, 121, 118, 116, 115, 114, 113, 112, 112, 111, 111, 111, 110, 110, 110, 110, 109, 109, 108, 108, 107, 107, 107, 108, 109, 109, 108, 108, 108, 108, 107, 107, 107, 107, 107, 107, 106, 105, 105, 105, 105, 105, 105, 105, 105, 104, 104, 105, 105, 105, 105, 105, 104, 104, 105, 105, 105, 104, 105, 105, 106, 106, 106, 106, 106, 105, 105, 105, 104, 104, 104, 104, 104, 104, 104, 104, 104, 104, 104, 104, 104, 104, 104, 103, 103, 104, 105, 105, 105, 104, 104, 104, 105, 105, 105, 105, 106, 106, 106, 105, 105, 104, 104, 104, 104, 104, 104, 105, 105, 105, 105, 105, 105, 105, 104, 104, 104, 104, 104, 105, 104, 104, 104, 104, 104, 104, 104, 105, 104, 104, 104, 104, 104, 104, 104, 104, 104, 104, 104, 104, 104, 104, 104, 104, 105, 105, 105, 105, 105, 106, 105, 105, 106, 106, 106, 106, 106, 106, 105, 105, 105, 105, 105, 105, 104, 105, 105, 105, 104, 104, 104, 105, 105, 106, 106, 106, 106, 105, 105, 105, 106, 106, 106, 105, 104, 104, 104, 104, 104, 105, 105, 105, 105, 105, 105, 104, 104, 104, 104, 104, 103, 103, 104, 104, 105, 105, 105, 104, 103, 103, 104, 104, 104, 104]
4652A04%%%%%%%%%%%%j%%%J%%J%j%%%%%J%j%%%J%%%%j%j%%J%%%%%%%j%%%%%%%%%j%%J%%%%
4644A03%%J%%j%%%%J%%jJ%%j%%%JJjJ%j%%%%j%j%J%%J%jJ%%jjJ%%%J%%%j%%J%j%%%%%%%%%
4637A03%%%%j%%%%%j%%J%%%%j%%J%J%j%%%J%Jj%%j%%%J%%%%%%%%%%%j%j%%%%%j%J%%%j%J%
4630A01%%%%J%%%%J%%%%%%%%%j%%%%%j%J%%%%%%%%%%%%j%%%%%%%j%%%J%%%%J%%%%%%J%%%%
4622A03%%jj%%j%j%j%%%j%J%%%%J%J%%%%%%J%j%j%%%j%%%%%%%JJ%%%%J%%%%%%%%J%%J%%%%
4615A03%j%j%%j%%%%%%%%JJ%%%%%%%JJK%%%%J%%%j%j%j%j%%j%%j%jj%%%%%j%%%j%%j%j%%%
4608I5jj%jjj%j%%j%%J%%JJJJKJJJJ%%JJJ%J%J%J%%%JKKLNOQJ0J1J1J3J4J5J4J2PKkopqrq
4601B01ppnmljj%jJKLMMNPQJ1J1J1J3J3J4J5J3RM%mopj0j0rrqpnnkjJJKKLLMLMLMMMNMNNN
$$ y = [104, 104, 104, 104, 104, 104, 104, 104, 104, 104, 104, 104, 104, 103, 103, 103, 103, 104, 104, 104, 105, 105, 104, 104, 104, 104, 104, 104, 105, 105, 104, 104, 104, 104, 105, 105, 105, 105, 105, 104, 104, 103, 103, 103, 104, 104, 104, 104, 104, 104, 104, 104, 103, 103, 103, 103, 103, 103, 103, 103, 103, 103, 102, 102, 102, 103, 103, 103, 103, 103, 103, 103, 104, 104, 104, 103, 103, 103, 103, 103, 104, 104, 104, 103, 104, 104, 104, 103, 103, 103, 103, 104, 105, 104, 105, 105, 104, 104, 104, 104, 104, 103, 103, 102, 102, 103, 103, 103, 104, 104, 103, 104, 104, 104, 103, 102, 103, 103, 103, 103, 104, 104, 104, 104, 103, 103, 103, 104, 104, 103, 103, 103, 103, 103, 103, 103, 103, 103, 103, 103, 103, 103, 103, 102, 102, 102, 102, 102, 102, 101, 101, 101, 102, 102, 102, 102, 102, 101, 101, 101, 102, 102, 103, 103, 102, 102, 102, 102, 103, 103, 104, 103, 103, 103, 102, 102, 102, 102, 103, 103, 103, 103, 103, 103, 103, 103, 103, 103, 103, 103, 102, 102, 101, 101, 101, 101, 101, 101, 100, 100, 101, 101, 101, 101, 100, 100, 101, 101, 101, 101, 101, 101, 102, 102, 102, 102, 102, 103, 103, 103, 103, 103, 103, 103, 103, 103, 103, 102, 102, 102, 102, 102, 102, 101, 101, 102, 102, 102, 102, 102, 102, 102, 102, 102, 102, 102, 102, 102, 101, 101, 101, 101, 101, 101, 101, 101, 100, 100, 100, 100, 101, 101, 101, 101, 101, 102, 102, 102, 102, 102, 102, 102, 103, 103, 103, 103, 103, 103, 103, 102, 101, 101, 101, 100, 100, 99, 99, 98, 98, 98, 98, 97, 97, 98, 98, 98, 98, 98, 99, 99, 100, 100, 100, 100, 100, 100, 100, 101, 101, 100, 100, 99, 99, 99, 99, 98, 98, 98, 98, 98, 98, 98, 98, 99, 100, 100, 100, 100, 100, 101, 101, 101, 101, 101, 101, 101, 101, 101, 102, 102, 102, 103, 103, 103, 103, 103, 103, 102, 102, 101, 101, 101, 100, 100, 100, 100, 100, 100, 100, 100, 100, 101, 102, 102, 102, 102, 102, 102, 102, 102, 103, 104, 106, 106, 106, 106, 106, 107, 107, 107, 107, 106, 106, 105, 105, 104, 104, 103, 103, 103, 102, 102, 102, 101, 101, 100, 99, 99, 99, 99, 99, 99, 98, 98, 98, 98, 97, 97, 97, 96, 96, 95, 95, 95, 95, 94, 93, 93, 92, 91, 90, 90, 89, 89, 89, 88, 88, 88, 89, 89, 89, 90, 91, 92, 93, 95, 96, 97, 98, 99, 99, 99, 100, 101, 102, 102, 103, 103, 104, 104, 105, 105, 105, 105, 106, 108, 110, 113, 118, 124, 132, 142, 153, 164, 177, 191, 206, 220, 232, 239, 241, 239, 233, 226, 218, 209, 201, 194, 187, 182, 178, 175, 174, 173, 173, 172, 173, 175, 178, 182, 186, 191, 198, 206, 217, 228, 239, 252, 265, 279, 294, 307, 316, 320, 320, 316, 310, 303, 293, 283, 274, 265, 257, 250, 245, 240, 238, 237, 238, 239, 241, 243, 246, 249, 253, 256, 260, 263, 267, 271, 275, 280, 284, 289, 294, 299]
4595B99MMMLLMKLKNOPJ0J2J4J6J7J7J9J9J9K0K1K3K4K5K5K5K6K8L2L6M0M6N3O2P2Q6J05J32
4591A370J67K06K52L09L87M99O68R02J162J353J420J358J224J128J101J009P57M36J62l0j81
4589A5659m00p86j227j509j588j512j343j135r12p12n51m17k95j73m9O8J80K98M50O57R17
4586E620J160J306J320J222J101J049J019Q67N78K75M5j19k79n62r89j377j572j587j472j296
4584F309j093q91p26n98m98m11l24k45j82j41j12r2p7o6n6m9m3l7l2k8k2j7j3j0rrj0j0rj2
4581D87j4j9k0k1k2k3k4k5k4k0j8j6j4j2j1j0rqpnmmklkjkj%%%%JJjjklnoqqrrrj0rj0qon
4576C9mmmljKMOQJ0J2J4J4J0J0PPOML%jkmoooppopnmlkkkjJLMNQJ0J2J2RQNNMLKJJJ%jjjj
4569A59%%%%jJ%J%JJ%%%%jj%jjjjjkjjjjjj%jj%j%j%j%%%jjkj%j%jjjkj%jj%%%%%%J%J%%%
$$ y = [299, 303, 307, 311, 314, 317, 321, 323, 326, 328, 333, 339, 346, 356, 368, 382, 398, 415, 432, 451, 470, 489, 509, 530, 553, 577, 602, 627, 652, 678, 706, 738, 774, 814, 860, 913, 975, 1047, 1133, 1238, 1370, 1537, 1743, 1995, 2304, 2691, 3190, 3858, 4760, 5922, 7275, 8695, 10053, 11277, 12405, 13506, 14515, 15272, 15708, 15870, 15840, 15659, 15259, 14473, 13246, 11737, 10149, 8637, 7294, 6159, 5247, 4535, 3984, 3567, 3272, 3099, 3050, 3118, 3298, 3596, 4046, 4703, 5620, 6780, 8086, 9406, 10628, 11729, 12778, 13797, 14664, 15242, 15517, 15562, 15443, 15164, 14602, 13613, 12236, 10664, 9077, 7605, 6309, 5216, 4325, 3599, 3001, 2503, 2092, 1768, 1523, 1341, 1200, 1088, 996, 919, 853, 797, 748, 705, 668, 636, 608, 586, 569, 556, 546, 537, 528, 518, 508, 499, 487, 473, 454, 434, 413, 391, 368, 344, 319, 295, 275, 257, 241, 227, 215, 204, 194, 185, 177, 170, 165, 161, 157, 155, 152, 150, 149, 147, 146, 146, 146, 146, 146, 147, 148, 147, 146, 144, 141, 136, 130, 122, 114, 105, 96, 87, 77, 68, 58, 50, 44, 39, 35, 31, 27, 24, 23, 25, 29, 35, 43, 53, 65, 79, 93, 103, 113, 120, 127, 133, 137, 140, 140, 139, 137, 133, 127, 121, 115, 108, 101, 95, 88, 83, 79, 76, 74, 72, 70, 69, 70, 73, 77, 82, 90, 100, 112, 124, 133, 141, 146, 151, 155, 158, 160, 161, 162, 163, 163, 162, 161, 160, 159, 159, 159, 159, 159, 158, 159, 159, 160, 160, 161, 162, 162, 162, 162, 162, 161, 160, 160, 159, 158, 157, 156, 155, 153, 152, 151, 150, 149, 148, 147, 147, 146, 145, 145, 144, 144, 143, 143, 142, 142, 142, 142, 141, 140, 138, 137, 137, 136, 136, 135, 134, 133, 131, 130, 130, 129, 128, 128, 128, 128, 128, 128, 128, 129, 129, 130, 130, 130, 130]
4562A30%%%%%jJ%J%%%%J%%jjjj%%jJ%%%%%%j%%%%%%%J%%%%JJJ%%%J%j%%%j%jjj%%%%j%%%J
4555A27j%%%%%J%%%%J%%%%j%%%%jjjj%%j%j%%%J%%j%%%J%Jj%%%%%%%%%%j%%%%%%%%j%%%%%
4547A20%j%%%%%j%%%%%%%%%%%j%%J%%%J%Jj%J%%%%%%%j%j%%%%j%%%%J%j%J%j%j%jJ%%J%%%
4540A17j%%J%%j%%%%%%%J%%%%%%%jj%j%j%J%%%%%J%%%%j%J%%jJ%%%%%%%J%J%j%jJ%%%%%j%
4533A15%%%%%%%j%%%%J%%%j%%%%J%J%%%j%%%%%%%%%%%%%jJ%%%%%J%%j%J%%%jj%JjJ%j%%%%
4525A14%%%%j%%%J%%%%%%%J%%%%j%j%%%J%%%%j%%%J%%%%%j%%%%J%%%j%%%%%j%%%J%%%%J%%
4518A14%j%jJ%%%%jJ%%%j%%%%%%%%%j%%%%J%JJ%j%%%%%j%%%Jj%J%%jj%%%%J%%%%j%%%%%%%
4511A11%%J%%%%%%%J%%%%%%%Jjj%%%%jJ%J%%j%%J%j%j%%%%JJ%%%%%j%J%%%Jj%%%%j%jJ%%J
$$ y = [130, 130, 130, 130, 130, 130, 129, 130, 130, 131, 131, 131, 131, 131, 132, 132, 132, 131, 130, 129, 128, 128, 128, 127, 128, 128, 128, 128, 128, 128, 128, 127, 127, 127, 127, 127, 127, 127, 127, 128, 128, 128, 128, 128, 129, 130, 131, 131, 131, 131, 132, 132, 131, 131, 131, 131, 130, 130, 129, 128, 127, 127, 127, 127, 127, 126, 126, 126, 126, 127, 126, 126, 126, 126, 126, 126, 127, 127, 127, 127, 127, 128, 128, 128, 128, 128, 127, 127, 127, 127, 127, 126, 125, 124, 123, 123, 123, 122, 122, 121, 121, 121, 121, 122, 122, 122, 121, 121, 121, 121, 122, 122, 123, 122, 122, 122, 122, 122, 122, 122, 122, 122, 122, 122, 121, 121, 121, 121, 121, 121, 121, 121, 121, 120, 120, 120, 120, 120, 120, 120, 119, 119, 119, 119, 119, 119, 118, 118, 118, 118, 118, 118, 118, 118, 118, 118, 118, 118, 117, 117, 117, 118, 118, 118, 118, 119, 119, 120, 119, 119, 120, 120, 120, 120, 120, 120, 120, 120, 119, 119, 118, 118, 118, 118, 118, 117, 117, 117, 117, 117, 118, 118, 117, 117, 118, 118, 117, 117, 116, 116, 115, 116, 116, 116, 117, 117, 117, 117, 116, 116, 116, 117, 117, 117, 116, 116, 116, 116, 116, 116, 116, 116, 117, 117, 117, 117, 117, 117, 117, 117, 116, 115, 115, 114, 114, 113, 113, 114, 114, 114, 114, 114, 114, 115, 115, 115, 115, 115, 114, 114, 115, 115, 115, 114, 115, 115, 115, 115, 115, 115, 115, 115, 116, 116, 117, 117, 116, 116, 115, 116, 116, 116, 116, 116, 116, 115, 115, 115, 115, 115, 115, 115, 115, 115, 114, 114, 114, 114, 114, 115, 115, 115, 115, 114, 114, 114, 114, 114, 115, 115, 116, 116, 116, 116, 115, 115, 115, 115, 115, 115, 115, 115, 115, 115, 115, 115, 115, 115, 114, 115, 115, 115, 115, 115, 115, 116, 116, 116, 115, 115, 116, 116, 116, 116, 115, 114, 114, 115, 114, 115, 115, 114, 114, 114, 114, 114, 114, 114, 114, 114, 113, 113, 113, 113, 114, 114, 114, 114, 114, 114, 114, 114, 115, 115, 115, 115, 115, 114, 114, 113, 113, 113, 113, 114, 114, 114, 114, 114, 113, 113, 113, 113, 114, 114, 114, 114, 114, 114, 113, 113, 113, 113, 113, 114, 114, 114, 114, 113, 113, 113, 113, 113, 113, 112, 112, 112, 112, 113, 113, 113, 113, 113, 114, 114, 114, 114, 113, 113, 112, 113, 113, 113, 113, 113, 112, 113, 113, 113, 113, 112, 112, 112, 112, 112, 112, 112, 112, 112, 112, 111, 111, 111, 111, 111, 112, 112, 113, 114, 114, 113, 113, 113, 113, 113, 113, 112, 112, 112, 112, 113, 112, 112, 113, 113, 113, 112, 111, 111, 111, 111, 111, 112, 112, 112, 112, 112, 111, 111, 111, 111, 111, 111, 111, 111, 111, 111, 112, 112, 112, 112, 112, 112, 112, 112, 113, 113, 113, 113, 113, 113, 113, 113, 114, 113, 112, 112, 112, 112, 112, 111, 112, 112, 113, 113, 113, 112, 112, 112, 113, 113, 112, 112, 111, 111, 111, 111, 111, 112, 113, 113, 113, 113, 113, 113, 112, 112, 113, 113, 113, 113, 114, 113, 113, 113, 113, 113, 112, 112, 111, 112, 112, 112, 113]
4503A13%%%%%%%%%%%%%J%%jjJ%J%j%J%%%%%%%%%%%j%%JJ%J%%%%%%j%J%J%JJJJJJJKLMNNOO
4496A55OOONNMKK%%klnoppoonmlkjk%%KJKLNNOOOOOPNMLK%%kmoopqooononmlkkkjj%j%%j%
4489A17J%KJKJ%%JJJJ%jJjjjkkkjkjjjj%%J%%%jj%%%%j%%%%%%J%%J%%jjJ%%jj%%j%%J%%J%
4481A10%J%%%j%%%%%%J%jj%J%%%%%%%%%%%%%j%Jj%%%%%J%%%%Jj%%%%%%%%%J%%j%%%%J%%j%
4474A10%%%j%%J%jJ%J%%%j%%%%Jj%j%%%jJ%J%%j%%%%%%%%%%%%%%J%%%%%j%J%%%%%%%%%%%%
4467A10%j%%%%%%%%%%%%%Jj%%JjJJJ%j%j%%%%%j%%%%%j%%%%%J%%%j%%%%%jJ%J%%%%J%%j%%
4459A09%%%%%%%%%%%%%j%%%J%%j%%%%J%%j%j%J%%%%%%%%%J%%%%j%%%%%%%%%j%%JJ%j%%%%%
4452A08%%J%%%%%%%%j%%%%%%%J%%j%%%%jJJj%%%%%Jj%%J%%%%jJ%%j%jj%%%JJ%%%%%%%J%%j
$$ y = [113, 113, 113, 113, 113, 113, 113, 113, 113, 113, 113, 113, 113, 113, 114, 114, 114, 113, 112, 113, 113, 114, 114, 113, 113, 114, 114, 114, 114, 114, 114, 114, 114, 114, 114, 114, 114, 113, 113, 113, 114, 115, 115, 116, 116, 116, 116, 116, 116, 116, 115, 115, 116, 116, 117, 117, 118, 119, 120, 121, 122, 123, 124, 126, 129, 133, 138, 143, 149, 155, 161, 167, 173, 178, 183, 187, 189, 191, 191, 191, 189, 186, 181, 175, 168, 161, 155, 149, 144, 140, 137, 135, 134, 132, 132, 132, 134, 135, 137, 140, 145, 150, 156, 162, 168, 174, 180, 187, 192, 196, 199, 201, 201, 201, 199, 195, 189, 183, 176, 168, 162, 156, 150, 145, 139, 134, 130, 127, 125, 123, 121, 120, 119, 119, 118, 118, 118, 117, 117, 118, 118, 120, 121, 123, 124, 124, 124, 125, 126, 127, 128, 128, 127, 128, 127, 126, 125, 123, 121, 119, 118, 116, 115, 114, 113, 112, 112, 112, 113, 113, 113, 113, 112, 111, 111, 111, 111, 111, 110, 110, 110, 110, 110, 110, 110, 111, 111, 111, 112, 112, 112, 111, 110, 111, 111, 111, 110, 109, 109, 109, 108, 108, 108, 109, 109, 109, 110, 110, 110, 111, 111, 111, 111, 110, 110, 110, 110, 110, 110, 110, 111, 111, 110, 109, 109, 110, 110, 110, 110, 110, 110, 110, 110, 110, 110, 110, 110, 110, 110, 109, 109, 110, 109, 109, 109, 109, 109, 109, 110, 110, 110, 110, 110, 111, 110, 110, 110, 110, 110, 110, 110, 110, 110, 110, 111, 111, 111, 110, 110, 110, 110, 110, 111, 111, 111, 110, 110, 110, 110, 110, 109, 109, 109, 110, 110, 109, 110, 110, 111, 111, 111, 111, 110, 110, 110, 110, 110, 111, 110, 110, 109, 109, 109, 109, 108, 109, 109, 110, 110, 110, 109, 109, 109, 109, 109, 109, 109, 109, 109, 109, 109, 109, 109, 109, 109, 110, 110, 110, 110, 110, 110, 109, 109, 110, 110, 110, 110, 110, 110, 110, 110, 110, 110, 110, 110, 110, 110, 109, 109, 109, 109, 109, 109, 109, 109, 109, 109, 109, 109, 109, 109, 110, 109, 109, 109, 110, 109, 110, 111, 112, 112, 111, 111, 110, 110, 110, 110, 110, 110, 109, 109, 109, 109, 109, 109, 108, 108, 108, 108, 108, 108, 109, 109, 109, 109, 108, 108, 108, 108, 108, 108, 107, 108, 108, 109, 109, 109, 109, 109, 110, 110, 110, 109, 109, 109, 109, 109, 109, 109, 109, 109, 109, 109, 109, 109, 109, 109, 109, 108, 108, 108, 108, 109, 109, 109, 108, 108, 108, 108, 108, 109, 109, 109, 108, 108, 107, 107, 108, 108, 108, 108, 108, 108, 108, 108, 108, 108, 109, 109, 109, 109, 109, 108, 108, 108, 108, 108, 108, 108, 108, 108, 108, 107, 107, 107, 108, 109, 109, 108, 108, 108, 108, 108, 108, 108, 108, 109, 109, 109, 109, 109, 109, 109, 109, 109, 108, 108, 108, 108, 108, 108, 108, 108, 109, 109, 109, 108, 108, 108, 108, 108, 107, 108, 109, 108, 108, 108, 108, 108, 108, 109, 108, 108, 108, 109, 109, 109, 109, 109, 108, 109, 109, 109, 108, 108, 107, 106, 106, 106, 106, 107, 108, 108, 108, 108, 108, 108, 108, 108, 109, 109, 109, 108]
4445A08j%%%%%J%%%%J%%%j%%%%%%%j%%Jj%%%%jJ%Jj%jJ%J%j%j%J%%%%j%%J%%%%%%%%%%J%%
4438A08j%%J%j%%%J%j%%%jJ%J%%%%%j%J%%%%J%%%j%Jj%J%%%J%%%%%%%j%%%%%%%%%%j%%%%%
4430A08Jj%%%%%%%%J%j%%%J%%%%%%%%j%jJ%%j%J%%%%%%J%%j%%%%%J%%%%%j%%%J%%%j%%%J%
4423A09j%%%%%%J%%j%%%%%%%%%%%jJ%%J%j%%%J%%%%%%%%j%%j%%%%%J%j%%%J%%j%%%%%%%%%
4416A07Jj%j%J%%%%jJ%%%Jj%%J%J%j%%%%j%%%%%%%%J%%%J%%%%%%%%%j%%%j%%%%%%%%%%%%%
4408A07%%%%%%J%%j%%%%%JJj%%%j%%%%J%%%%%%%%%%J%%%%j%%%%J%j%%%%%%%j%%%%J%%j%J%
4401A08%%%%j%%%%%%Jj%%%%%j%J%jJ%%%%%%%%%%J%%%%%J%jj%%%j%%%%%%%%%%%J%%Jj%%%%%
4394A07%%j%%%%J%J%%%%j%%j%%%%%%%%%%%J%%j%%%%%%%%%J%%%%%j%J%%%%%%%%%%%%%J%%%%
$$ y = [108, 107, 107, 107, 107, 107, 107, 108, 108, 108, 108, 108, 109, 109, 109, 109, 108, 108, 108, 108, 108, 108, 108, 108, 107, 107, 107, 108, 107, 107, 107, 107, 107, 106, 107, 107, 108, 107, 107, 106, 107, 107, 108, 108, 107, 107, 106, 106, 107, 107, 107, 107, 107, 106, 106, 106, 107, 107, 107, 107, 107, 107, 107, 107, 107, 107, 107, 108, 108, 108, 107, 107, 107, 108, 108, 107, 107, 107, 107, 108, 108, 107, 107, 107, 107, 106, 107, 107, 108, 108, 108, 108, 108, 108, 107, 107, 108, 108, 108, 108, 108, 109, 109, 109, 109, 108, 108, 109, 108, 108, 109, 109, 109, 109, 110, 110, 110, 110, 110, 110, 110, 110, 109, 109, 109, 109, 109, 109, 109, 109, 109, 109, 109, 108, 108, 108, 108, 108, 108, 109, 108, 108, 108, 108, 108, 108, 108, 108, 108, 109, 109, 108, 108, 108, 108, 109, 109, 109, 109, 109, 109, 109, 109, 109, 108, 108, 107, 108, 108, 108, 107, 107, 108, 108, 108, 108, 108, 108, 108, 109, 109, 109, 108, 108, 108, 108, 108, 108, 109, 109, 109, 109, 109, 109, 108, 108, 108, 108, 109, 109, 109, 109, 108, 108, 108, 108, 109, 109, 108, 108, 108, 108, 108, 108, 108, 109, 109, 109, 108, 108, 108, 108, 108, 108, 108, 108, 108, 108, 108, 108, 107, 108, 108, 108, 109, 109, 108, 108, 108, 108, 109, 109, 109, 109, 109, 109, 109, 109, 109, 108, 108, 108, 107, 107, 107, 107, 107, 107, 108, 108, 107, 107, 107, 107, 108, 108, 108, 107, 107, 107, 107, 107, 107, 107, 107, 107, 107, 108, 107, 107, 106, 106, 107, 107, 107, 107, 107, 106, 107, 107, 107, 107, 108, 107, 107, 107, 108, 108, 109, 109, 108, 108, 108, 108, 108, 107, 107, 107, 107, 107, 107, 107, 107, 107, 108, 108, 108, 108, 109, 109, 109, 109, 109, 109, 109, 109, 109, 109, 108, 108, 108, 108, 107, 107, 107, 107, 107, 107, 107, 107, 107, 107, 107, 107, 107, 107, 107, 107, 107, 107, 107, 107, 108, 108, 108, 107, 107, 107, 107, 107, 107, 108, 109, 108, 108, 108, 108, 107, 107, 107, 107, 107, 108, 108, 108, 108, 108, 108, 108, 108, 108, 108, 108, 109, 109, 109, 109, 109, 108, 108, 108, 108, 108, 109, 109, 108, 108, 108, 108, 108, 108, 108, 108, 107, 107, 107, 107, 107, 108, 108, 108, 107, 107, 108, 108, 108, 108, 108, 108, 107, 107, 107, 107, 107, 107, 107, 108, 107, 107, 107, 107, 107, 107, 106, 106, 107, 107, 106, 107, 107, 107, 107, 107, 107, 107, 107, 107, 107, 107, 108, 108, 108, 108, 108, 108, 109, 109, 108, 107, 107, 107, 107, 106, 106, 106, 106, 106, 106, 106, 106, 106, 106, 106, 106, 107, 107, 107, 108, 107, 107, 107, 107, 107, 107, 107, 107, 106, 106, 106, 106, 106, 107, 107, 108, 108, 108, 108, 108, 107, 107, 107, 106, 106, 106, 106, 106, 106, 106, 106, 106, 106, 106, 106, 107, 107, 107, 106, 106, 106, 106, 106, 106, 106, 106, 106, 106, 107, 107, 107, 107, 107, 107, 106, 106, 107, 107, 107, 107, 107, 107, 107, 107, 107, 107, 107, 107, 107, 107, 108, 108, 108, 108, 108]
4386A08%%%jj%%%%J%%%%J%%%%%%%%jJ%Jj%j%%J%%j%%%%J%%%%%j%%Jj%%J%j%%%%%%%%%%%%%
4379A07%%%%%%%%%J%%%%%jj%%J%%%%J%J%j%%%%%%j%%j%%%%%%J%%%J%j%%%j%%J%J%%%%%j%%
4372A07J%jjJ%%%%%%j%%%%%%%%Jj%%%%%%%%%%%%%%%%%%%J%%%%%%%%%%%j%%%%%J%%%%%%%%%
4364A07%%%%j%%J%%%%%%%jJ%J%%jj%J%j%%%%%%%%%%%%%%%J%j%%%%%J%%%%%j%%%%J%%j%J%%
4357A07j%%%%%%J%%%%j%%%%%%Jj%%%%J%j%%%%%%%%%%%%%%%%J%%%%%j%%%%J%j%%%%%Jj%J%%
4350A07%j%%J%j%%%%%%J%%j%%%%%%%J%j%jJjJ%%%%j%%%J%%%%%%%%%%%%Jj%%%%%%%%%%%%%%
4343A06jjJJ%J%%%%%%j%%%%%%%%%%%%%%j%jJ%%%%%%J%%j%%%%%J%j%%%%J%j%JJ%j%%%%%%%j
4335A05%%%%%J%%%%%%%%%%%Jjj%%J%%j%%J%J%j%%%%%%%J%%%%j%jJ%%j%%%%%jJJ%%%%%%J%j
$$ y = [108, 108, 108, 108, 107, 106, 106, 106, 106, 106, 107, 107, 107, 107, 107, 108, 108, 108, 108, 108, 108, 108, 108, 108, 107, 108, 108, 109, 108, 108, 107, 107, 107, 108, 108, 108, 107, 107, 107, 107, 107, 108, 108, 108, 108, 108, 108, 107, 107, 107, 108, 107, 107, 107, 108, 108, 107, 107, 107, 107, 107, 107, 107, 107, 107, 107, 107, 107, 107, 107, 107, 107, 107, 107, 107, 107, 107, 107, 107, 108, 108, 108, 108, 108, 108, 107, 106, 106, 106, 107, 107, 107, 107, 107, 108, 108, 109, 109, 108, 108, 108, 108, 108, 108, 108, 107, 107, 107, 106, 106, 106, 106, 106, 106, 106, 107, 107, 107, 107, 108, 108, 107, 107, 107, 107, 106, 106, 106, 107, 107, 108, 108, 108, 108, 108, 108, 107, 107, 107, 108, 108, 107, 106, 107, 107, 107, 107, 107, 107, 107, 106, 106, 106, 106, 106, 106, 106, 106, 106, 107, 106, 106, 106, 106, 106, 106, 106, 106, 106, 106, 106, 106, 106, 106, 106, 106, 106, 106, 106, 106, 107, 107, 107, 107, 107, 107, 107, 107, 107, 107, 107, 107, 106, 106, 106, 106, 106, 106, 107, 107, 107, 107, 107, 107, 107, 107, 107, 107, 107, 107, 107, 107, 106, 106, 106, 107, 107, 107, 107, 107, 107, 107, 107, 106, 107, 107, 108, 108, 108, 107, 106, 106, 107, 107, 106, 106, 106, 106, 106, 106, 106, 106, 106, 106, 106, 106, 106, 106, 106, 106, 107, 107, 106, 106, 106, 106, 106, 106, 107, 107, 107, 107, 107, 107, 106, 106, 106, 106, 106, 107, 107, 107, 106, 106, 107, 107, 107, 106, 106, 106, 106, 106, 106, 106, 107, 107, 107, 107, 107, 106, 106, 106, 106, 106, 106, 106, 107, 106, 106, 106, 106, 106, 107, 107, 106, 106, 106, 106, 106, 106, 106, 106, 106, 106, 106, 106, 106, 106, 106, 106, 106, 107, 107, 107, 107, 107, 107, 106, 106, 106, 106, 106, 107, 107, 106, 106, 106, 106, 106, 106, 107, 106, 106, 107, 107, 107, 107, 106, 106, 106, 107, 107, 106, 106, 106, 106, 106, 106, 106, 107, 107, 107, 106, 106, 106, 106, 106, 106, 106, 106, 107, 107, 106, 106, 105, 106, 105, 106, 106, 106, 106, 106, 105, 105, 105, 105, 106, 106, 106, 106, 106, 106, 106, 106, 106, 106, 106, 106, 106, 107, 106, 106, 106, 106, 106, 106, 106, 106, 106, 106, 106, 106, 106, 106, 106, 105, 104, 105, 106, 106, 107, 107, 107, 107, 107, 107, 107, 106, 106, 106, 106, 106, 106, 106, 106, 106, 106, 106, 106, 106, 106, 106, 105, 105, 104, 105, 105, 105, 105, 105, 105, 105, 106, 106, 106, 105, 105, 105, 105, 105, 105, 106, 106, 105, 105, 105, 105, 105, 106, 106, 105, 105, 106, 107, 107, 106, 106, 106, 106, 106, 106, 106, 106, 105, 105, 105, 105, 105, 105, 106, 106, 106, 106, 106, 106, 106, 106, 106, 106, 106, 106, 107, 106, 105, 105, 105, 106, 106, 106, 105, 105, 105, 106, 106, 107, 107, 106, 106, 106, 106, 106, 106, 106, 106, 107, 107, 107, 107, 107, 106, 106, 105, 106, 106, 106, 105, 105, 105, 105, 105, 105, 104, 105, 106, 106, 106, 106, 106, 106, 106, 107, 107, 106]
4328A06%%J%j%%%%%%%%%%%%j%%%%%J%%J%%j%j%%%J%%j%%%J%%jjJ%%%%%%jJ%%%%%%%%Jj%j%
4321A04%J%%%%%%%%%JJ%j%Jj%%%j%%jJ%%%%J%%j%j%%%%%%%%%JJ%j%%%j%J%j%jJJ%%%%j%J%
4313A05Jj%j%%%%J%%J%%%%%%%%j%%%J%%J%%j%%%%%%%%%%%%%%%%%%%%%%%%%%%j%%%%%%%%%%
4306A05J%J%j%j%%%%%%%%J%j%J%%%%j%%%j%%J%%%%%%%%%%%J%%j%%%%%%%J%%j%jJ%%%%%%%%
4299A05JJ%%jj%%%%%%%jJ%%%%%%%%%j%%%J%%%%%%%J%%%%%j%%%%%%%%jJ%%%%J%%%%j%%J%%%
4291A06%%%%%J%%%%%j%%j%%%jJ%%%%%Jj%J%j%%%%jJJ%%j%%%%%%%%%%J%%%jJ%%j%%%%%%%%%
4284A05%%%Jj%j%J%JJ%%%%%%j%%%%J%%%%%jj%%%%%%%j%%%%%%J%%%%%%jJ%%%%j%%J%%Jj%%%
4277A05%%%%%%%%%J%j%%J%%%j%%%%%%%J%%%%j%J%j%%%%%%%%%%%%%%J%jj%J%%J%%jj%%%J%%
$$ y = [106, 106, 106, 107, 107, 106, 106, 106, 106, 106, 106, 106, 106, 106, 106, 106, 106, 106, 105, 105, 105, 105, 105, 105, 106, 106, 106, 107, 107, 107, 106, 106, 105, 105, 105, 105, 106, 106, 106, 105, 105, 105, 105, 106, 106, 106, 105, 104, 105, 105, 105, 105, 105, 105, 105, 104, 105, 105, 105, 105, 105, 105, 105, 105, 105, 106, 105, 105, 104, 104, 104, 105, 105, 105, 105, 105, 105, 105, 105, 105, 105, 106, 107, 107, 106, 106, 107, 106, 106, 106, 106, 105, 105, 105, 104, 105, 105, 105, 105, 105, 106, 106, 106, 105, 105, 104, 104, 104, 104, 104, 104, 104, 104, 104, 104, 105, 106, 106, 105, 105, 105, 105, 104, 104, 105, 105, 104, 104, 103, 104, 105, 105, 105, 105, 105, 104, 104, 105, 105, 106, 105, 105, 104, 104, 104, 104, 104, 105, 105, 105, 106, 106, 106, 106, 106, 106, 106, 106, 106, 105, 105, 105, 105, 106, 106, 106, 107, 107, 107, 106, 106, 106, 106, 106, 106, 106, 106, 106, 106, 106, 106, 106, 106, 106, 106, 106, 106, 106, 106, 106, 106, 106, 106, 106, 106, 106, 106, 105, 105, 105, 105, 105, 105, 105, 105, 105, 105, 105, 106, 106, 107, 107, 106, 106, 105, 105, 105, 105, 105, 105, 105, 105, 105, 106, 106, 105, 105, 106, 106, 106, 106, 106, 105, 105, 105, 105, 104, 104, 104, 105, 105, 105, 105, 105, 105, 105, 105, 105, 105, 105, 105, 106, 106, 106, 105, 105, 105, 105, 105, 105, 105, 105, 106, 106, 106, 105, 105, 104, 105, 105, 105, 105, 105, 105, 105, 105, 105, 106, 107, 107, 107, 106, 105, 105, 105, 105, 105, 105, 105, 105, 104, 105, 105, 105, 105, 105, 105, 105, 105, 105, 105, 104, 104, 104, 104, 105, 105, 105, 105, 105, 105, 105, 105, 106, 106, 106, 106, 106, 106, 105, 105, 105, 105, 105, 105, 105, 105, 105, 104, 105, 105, 105, 105, 105, 106, 106, 106, 106, 106, 105, 105, 105, 106, 106, 106, 106, 106, 106, 106, 106, 106, 107, 107, 107, 107, 107, 107, 106, 106, 106, 105, 105, 105, 105, 104, 105, 105, 105, 105, 105, 105, 106, 105, 105, 106, 106, 105, 105, 105, 105, 105, 104, 105, 106, 106, 106, 105, 105, 105, 105, 105, 105, 105, 105, 105, 105, 105, 106, 106, 106, 106, 105, 106, 106, 106, 105, 105, 105, 105, 105, 105, 105, 105, 105, 105, 105, 105, 105, 106, 105, 105, 104, 104, 105, 105, 106, 107, 107, 107, 107, 107, 107, 107, 106, 106, 106, 106, 106, 107, 107, 107, 107, 107, 107, 106, 105, 105, 105, 105, 105, 105, 105, 105, 104, 104, 104, 104, 104, 104, 104, 105, 105, 105, 105, 105, 105, 105, 104, 105, 105, 105, 105, 105, 104, 104, 104, 105, 105, 105, 106, 105, 105, 105, 105, 105, 105, 105, 105, 105, 105, 105, 105, 105, 106, 106, 105, 105, 105, 106, 106, 106, 106, 105, 105, 105, 105, 105, 105, 105, 105, 106, 106, 106, 106, 106, 105, 105, 106, 106, 105, 105, 105, 105, 105, 105, 105, 105, 105, 105, 105, 105, 105, 105, 105, 106, 106, 105, 104, 104, 105, 105, 105, 106, 106, 106, 105, 104, 104, 104, 104, 105, 105, 105]
4269A05J%j%j%%%%%J%Jj%%%J%%%%j%%%%%Jj%%%%%%J%%j%%%%%%J%%%%jj%JJj%%%%%%j%%%%J
4262A05%%%%%%%%j%%%J%%%%%%%j%%%J%%%jJ%%%%%j%%%%%%%J%%j%J%j%jJ%Jj%%Jj%%%Jj%%%
4255A04J%%%%%%j%%%%%%%%%%J%%%J%%%%%jj%%Jj%%%%%%%%%%j%%J%%%%%J%%%%%jJ%%%%%jJ%
4247A05%%%%j%%%%%j%%J%J%j%%%J%J%j%j%J%%j%j%%%j%%%J%%J%J%j%%jJ%%J%%%%%%%j%%%%
4240A04J%%%%%%%j%%%%%J%%%%%%%%%%jj%%%%J%%%%%%J%%%%%%j%jJ%J%j%%%%%%%%jJ%J%j%%
4233A04%J%%%%%j%%%J%%%j%%J%%j%%%j%%%%%J%%%%J%j%j%%%%%Jj%J%%%jJ%%jj%%J%%J%%j%
4226A03%%%%%%%%%%%%%%%%J%%%%j%%%%%%%%%%%%%%%%%j%%%%%%%%%%%%%J%%j%%%%%%%%%j%%
4218A01%J%%%%%%%J%%%%%j%%J%%%%jJjJ%%J%%%%j%%%%jJ%%J%%j%%%%J%J%j%%%%%%%%%%J%%
$$ y = [105, 106, 106, 105, 105, 104, 104, 104, 104, 104, 104, 105, 105, 106, 105, 105, 105, 105, 106, 106, 106, 106, 106, 105, 105, 105, 105, 105, 105, 106, 105, 105, 105, 105, 105, 105, 105, 106, 106, 106, 105, 105, 105, 105, 105, 105, 105, 106, 106, 106, 106, 106, 105, 104, 104, 105, 106, 105, 105, 105, 105, 105, 105, 105, 104, 104, 104, 104, 104, 105, 105, 105, 105, 105, 105, 105, 105, 105, 104, 104, 104, 104, 105, 105, 105, 105, 105, 105, 105, 105, 104, 104, 104, 104, 105, 105, 105, 105, 104, 105, 105, 105, 105, 105, 105, 104, 104, 104, 104, 104, 104, 104, 104, 105, 105, 105, 104, 104, 105, 105, 104, 104, 103, 104, 104, 105, 104, 104, 104, 105, 104, 104, 104, 104, 105, 104, 104, 104, 104, 105, 105, 105, 105, 105, 105, 105, 104, 104, 104, 104, 104, 104, 104, 104, 104, 104, 104, 105, 105, 105, 105, 106, 106, 106, 106, 106, 106, 105, 104, 104, 104, 105, 104, 104, 104, 104, 104, 104, 104, 104, 104, 104, 104, 103, 103, 103, 104, 104, 104, 104, 104, 104, 105, 105, 105, 105, 105, 105, 104, 105, 105, 105, 105, 105, 105, 104, 105, 105, 105, 105, 105, 105, 104, 104, 104, 104, 104, 104, 103, 103, 103, 104, 104, 105, 105, 104, 104, 104, 104, 105, 105, 106, 106, 105, 105, 104, 104, 105, 105, 105, 104, 104, 103, 103, 103, 103, 102, 102, 102, 102, 103, 103, 103, 104, 104, 105, 105, 104, 104, 104, 103, 104, 104, 104, 105, 105, 105, 105, 105, 105, 105, 105, 104, 104, 104, 104, 104, 105, 105, 105, 105, 105, 105, 105, 105, 104, 104, 104, 104, 104, 104, 105, 105, 105, 105, 105, 105, 105, 105, 105, 105, 105, 104, 103, 103, 103, 103, 103, 104, 104, 104, 104, 104, 104, 104, 105, 105, 105, 105, 105, 105, 105, 104, 104, 103, 104, 104, 105, 105, 104, 104, 104, 104, 104, 104, 104, 104, 104, 103, 104, 104, 105, 105, 104, 104, 104, 104, 105, 105, 105, 105, 105, 105, 104, 104, 104, 104, 105, 105, 105, 105, 104, 104, 104, 105, 105, 105, 104, 104, 104, 104, 103, 103, 103, 103, 103, 103, 104, 104, 104, 104, 104, 105, 105, 104, 104, 103, 103, 103, 103, 103, 103, 104, 103, 103, 104, 104, 104, 104, 103, 104, 104, 104, 103, 102, 102, 102, 103, 103, 103, 104, 104, 104, 103, 103, 103, 103, 103, 103, 103, 103, 103, 103, 103, 103, 103, 103, 103, 103, 103, 103, 104, 104, 104, 104, 104, 103, 103, 103, 103, 103, 103, 103, 103, 103, 103, 103, 103, 103, 103, 103, 103, 103, 103, 102, 102, 102, 102, 102, 102, 102, 102, 102, 102, 102, 102, 102, 102, 103, 103, 103, 102, 102, 102, 102, 102, 102, 102, 102, 102, 102, 101, 101, 101, 101, 102, 102, 102, 102, 102, 102, 102, 102, 103, 103, 103, 103, 103, 103, 102, 102, 102, 103, 103, 103, 103, 103, 102, 103, 102, 103, 103, 103, 104, 104, 104, 104, 104, 103, 103, 103, 103, 103, 102, 103, 103, 103, 104, 104, 104, 103, 103, 103, 103, 103, 104, 104, 105, 105, 104, 104, 104, 104, 104, 104, 104, 104, 104, 104, 104, 105, 105, 105]
$$ [...]
-2638G3
##END=		$$ NMR SPECTRUM
##END=		$$ LINK
